{"text_format":"1","workbook":"xlsx","n_sheets":7,"sheets":["Introduction","Water","Sanitation","Hygiene","WHS03","DHS16","data_summary"],"not_rendered":{"charts":108,"images":76,"macros":1,"external_links":0,"defined_names":0,"comments":0,"pivot_tables":0},"unopened":[],"bounds":{"document_bytes":16777216,"sheet_cells":100000,"rows_first":2000,"rows_last":500,"rows_between":2000,"halvings":0,"cell_chars":16384,"cell_head_chars":4096},"cells_cut":0,"cells_raw":0,"read":"whole","date_system":"1900"}

{"sheet":"Introduction","index":0,"n_rows":55,"n_cols":12,"rows_kept":55,"cut":false,"hidden":false,"merged":[[107,0,107,1],[1,0,1,1],[4,0,4,1],[5,0,5,1],[6,0,6,1],[7,0,7,1],[112,0,112,1],[113,0,113,1],[207,0,207,1],[212,0,212,1],[213,0,213,1]]}
[]
[]
[]
[null,null,"Joint Monitoring Programme for Water Supply, Sanitation and Hygiene"]
[]
[null,null,"Estimates on household water, sanitation and hygiene \nby wealth quintile and sub-national region in"]
[null,null,{"$f":"+Water!B5","v":"South Africa"}]
[]
[null,null,"Updated May 2021"]
[]
[null,null,"Follow the links below to find the following information: "]
[]
[null,null,"JMP Estimates"]
[null,null,"WASH status and trends by wealth quintile \n(customized quintiles made without water and sanitation assets)"]
[null,null,"Water"]
[null,null,"Sanitation"]
[null,null,"Hygiene"]
[]
[null,null,"Data inputs"]
[null,null," customized wealth quintiles and subnational data:"]
[null,null,{"$f":"IF(INDIRECT(CONCATENATE(\"Water\",\"!B105\"))=0,\"\",INDIRECT(CONCATENATE(\"Water\",\"!B105\")))","v":"WHS03"}]
[null,null,{"$f":"IF(INDIRECT(CONCATENATE(\"Water\",\"!B106\"))=0,\"\",INDIRECT(CONCATENATE(\"Water\",\"!B106\")))","v":"DHS16"}]
[null,null,{"$f":"IF(INDIRECT(CONCATENATE(\"Water\",\"!B107\"))=0,\"\",INDIRECT(CONCATENATE(\"Water\",\"!B107\")))","v":""}]
[null,null,{"$f":"IF(INDIRECT(CONCATENATE(\"Water\",\"!B108\"))=0,\"\",INDIRECT(CONCATENATE(\"Water\",\"!B108\")))","v":""}]
[null,null,{"$f":"IF(INDIRECT(CONCATENATE(\"Water\",\"!B109\"))=0,\"\",INDIRECT(CONCATENATE(\"Water\",\"!B109\")))","v":""}]
[null,null,{"$f":"IF(INDIRECT(CONCATENATE(\"Water\",\"!B110\"))=0,\"\",INDIRECT(CONCATENATE(\"Water\",\"!B110\")))","v":""}]
[null,null,{"$f":"IF(INDIRECT(CONCATENATE(\"Water\",\"!B111\"))=0,\"\",INDIRECT(CONCATENATE(\"Water\",\"!B111\")))","v":""}]
[null,null,{"$f":"IF(INDIRECT(CONCATENATE(\"Water\",\"!B112\"))=0,\"\",INDIRECT(CONCATENATE(\"Water\",\"!B112\")))","v":""}]
[null,null,{"$f":"IF(INDIRECT(CONCATENATE(\"Water\",\"!B113\"))=0,\"\",INDIRECT(CONCATENATE(\"Water\",\"!B113\")))","v":""}]
[null,null,{"$f":"IF(INDIRECT(CONCATENATE(\"Water\",\"!B114\"))=0,\"\",INDIRECT(CONCATENATE(\"Water\",\"!B114\")))","v":""}]
[null,null,{"$f":"IF(INDIRECT(CONCATENATE(\"Water\",\"!B115\"))=0,\"\",INDIRECT(CONCATENATE(\"Water\",\"!B115\")))","v":""}]
[null,null,{"$f":"IF(INDIRECT(CONCATENATE(\"Water\",\"!B116\"))=0,\"\",INDIRECT(CONCATENATE(\"Water\",\"!B116\")))","v":""}]
[]
[]
[]
[]
[]
[]
[]
[]
[]
[]
[]
[]
[]
[]
[]
[]
[]
[]
[]
[]
[]
[]
[null,null,null,null,null,null,null,null,null,null,null,{"$f":"+IF(ISNUMBER(M48), \"\", \"Insufficient data to estimate safely managed sanitation services at national level\")","v":"Insufficient data to estimate safely managed sanitation services at national level"}]

{"sheet":"Water","index":1,"n_rows":318,"n_cols":28,"rows_kept":318,"cut":false,"hidden":false,"merged":[[3,1,3,24],[317,18,317,22],[117,18,117,22],[196,18,196,22],[296,23,296,27],[298,0,299,1],[300,0,301,1],[296,0,297,2],[296,3,296,7],[296,8,296,12],[296,13,296,17],[296,18,296,22],[196,23,196,27],[198,0,199,1],[200,0,201,1],[196,13,196,17],[96,8,96,12],[96,13,96,17],[96,18,96,22],[217,18,217,22],[98,0,99,1],[100,0,101,1],[196,0,197,2],[196,3,196,7],[196,8,196,12],[217,1,217,11],[35,3,36,3],[38,1,39,2],[38,3,39,3],[96,0,97,2],[96,3,96,7],[317,1,317,11],[6,9,6,16],[6,17,6,24],[6,1,6,8],[4,1,4,24],[117,1,117,11],[30,21,30,24],[32,1,33,2],[32,3,33,3],[30,17,30,20],[30,1,31,4],[30,5,30,8],[30,9,30,12],[30,13,30,16],[96,23,96,27],[35,1,36,2]]}
["BGD"]
[]
[]
[null,"Summary of trends in use of drinking water by wealth quintile (%)"]
[null,{"$f":"IF(ISERROR(INDIRECT(CONCATENATE($B105,\"!A2\"))),\"\",INDIRECT(CONCATENATE($B105,\"!A2\")))","v":"South Africa"}]
[]
[null,{"$f":"B118","v":"National use of drinking water sources, 2000–2020"},null,null,null,null,null,null,null,{"$f":"B218","v":"Urban use of drinking water sources,  2000–2020"},null,null,null,null,null,null,null,{"$f":"B318","v":"Rural use of drinking water sources, 2000–2020"}]
[]
[]
[]
[]
[]
[]
[]
[]
[]
[]
[]
[]
[]
[]
[]
[]
[]
[]
[]
[]
[]
[]
[]
[null,{"$f":"IF(ISERROR(INDIRECT(CONCATENATE($B105,\"!A2\"))),\"\",INDIRECT(CONCATENATE($B105,\"!A2\")))","v":"South Africa"},null,null,null,"Poorest",null,null,null,"Poor",null,null,null,"Middle",null,null,null,"Rich",null,null,null,"Richest"]
[null,null,null,null,null,"Basic","Limited","Unimproved","Surface \n water","Basic","Limited","Unimproved","Surface \nwater","Basic","Limited","Unimproved","Surface \nwater","Basic","Limited","Unimproved","Surface \nwater","Basic","Limited","Unimproved","Surface \nwater"]
[null,"NATIONAL",null,"Estimate",{"$f":"C99","v":2000},{"$f":"E99","v":67.511573384889232},{"$f":"F99","v":10.760188118009069},10.746625317007613,10.981613180094087,{"$f":"J99","v":82.457469056907684},{"$f":"K99","v":4.3145175324561027},12.13833986196812,1.0896735486680882,{"$f":"O99","v":83.52386252765929},{"$f":"P99","v":3.4352309144492068},11.112481271854264,1.9284252860372391,{"$f":"T99","v":89.339002255882235},{"$f":"U99","v":4.45881790747086},6.2021798366469056,0,{"$f":"Y99","v":95.511186504538841},{"$f":"Z99","v":7.5996696495503821E-2},4.4128167989656504,0]
[null,null,null,null,{"$f":"C100","v":2020},{"$f":"E100","v":65.111235762324284},10.377615426090228,11.452909533358223,13.058239278227262,{"$f":"J100","v":90.217423568057043},4.7205506083234843,2.0280226098928154,3.0340032137266633,{"$f":"O100","v":95.003345526598153},3.9073675432693822,0,1.0892869301324899,{"$f":"T100","v":95.137593552271596},4.7482196475573764,0,0.11418680017101765,{"$f":"Y100","v":99.920494888592259},7.9505111407740969E-2,0,0]
[]
[null,"URBAN",null,"Estimate",{"$f":"C199","v":2000},{"$f":"E199","v":87.643697832120765},{"$f":"F199","v":5.1656696369185742},7.1906325309606558,0,{"$f":"J199","v":85.170659923227362},{"$f":"K199","v":2.92199822552735},11.907341851245292,0,{"$f":"O199","v":86.266434353829197},{"$f":"P199","v":7.553287327783606E-2},13.658032772892966,0,{"$f":"T199","v":94.723465386353837},{"$f":"U199","v":0},5.2765346136461631,0,{"$f":"Y199","v":96.639073514203901},{"$f":"Z199","v":9.1602116887842547E-2},3.2693243689082578,0]
[null,null,null,null,{"$f":"C200","v":2020},{"$f":"E200","v":93.535577397412183},5.5129336630566002,0,0.95148893953121649,{"$f":"J200","v":96.68304000931245},3.3169599906875504,0,0,{"$f":"O200","v":99.888866851038699},8.7460356722060817E-2,0,2.3672792239249306E-2,{"$f":"T200","v":100},0,0,0,{"$f":"Y200","v":99.90530189488473},9.4698105115270437E-2,0,0]
[]
[null,"RURAL",null,"Estimate",{"$f":"C299","v":2000},{"$f":"E299","v":52.938074242466016},{"$f":"F299","v":11.676147126208392},13.872906003740866,21.512872627584727,{"$f":"J299","v":69.768617441985612},{"$f":"K299","v":11.165962703014438},16.306635819868447,2.7587840351314981,{"$f":"O299","v":78.362811851587011},{"$f":"P299","v":6.9419621733977293},12.792268346061576,1.9029576289536863,{"$f":"T299","v":80.160476329485178},{"$f":"U299","v":5.9365982843611302},8.6802031587124873,5.22272222744121,{"$f":"Y299","v":88.543582004712064},{"$f":"Z299","v":8.0148996640765358},3.4415183312113982,0]
[null,null,null,null,{"$f":"C300","v":2020},{"$f":"E300","v":42.953550512845624},9.4739369075630062,21.841291113131263,25.731221466460113,{"$f":"J300","v":68.629316678211396},10.983625854410596,9.8416188422164907,10.545438625161523,{"$f":"O300","v":81.62502839389758},7.2309536389036175,5.0839208215271015,6.0600971456717048,{"$f":"T300","v":88.162321448523727},6.5292062899592027,1.9443704058253388,3.3641018556917288,{"$f":"Y300","v":89.754930288672966},8.1245500163028677,1.3329698901292062,0.78754980489496518]
[]
[]
[]
[]
[]
[]
[]
[]
[]
[]
[]
[]
[]
[]
[]
[]
[]
[]
[]
[]
[]
[]
[]
[]
[]
[]
[]
[]
[]
[]
[]
[]
[]
[]
[]
[]
[]
[]
[]
[]
[]
[]
[]
[]
[]
[]
[]
[]
[]
[]
[]
[]
[]
[]
[]
[]
["NATIONAL",null,null,"Poorest",null,null,null,null,"Poor",null,null,null,null,"Middle",null,null,null,null,"Rich",null,null,null,null,"Richest"]
[null,null,null,"Improved","Basic","Limited","Unimproved","Surface water","Improved","Basic","Limited","Unimproved","Surface water","Improved","Basic","Limited","Unimproved","Surface water","Improved","Basic","Limited","Unimproved","Surface water","Improved","Basic","Limited","Unimproved","Surface water"]
["Forecast period:",null,{"$f":"MinBase(C105:C116)","v":2000},{"$f":"IF((D101+H101)>100,D101*100/(D101+H101),D101)","v":78.2717615028983},{"$f":"D99*AVERAGEIF(E105:E116,\">0\")/100","v":67.511573384889232},{"$f":"D99*(100-AVERAGEIF(E105:E116,\">0\"))/100","v":10.760188118009069},{"$f":"100-(E99+F99+H99)","v":10.746625317007613},{"$f":"IF((D101+H101)>100,H101*100/(D101+H101),H101)","v":10.981613180094087},{"$f":"IF((I101+M101)>100,I101*100/(I101+M101),I101)","v":86.771986589363792},{"$f":"I99*AVERAGEIF(J105:J116,\">0\")/100","v":82.457469056907684},{"$f":"I99*(100-AVERAGEIF(J105:J116,\">0\"))/100","v":4.3145175324561027},{"$f":"100-(J99+K99+M99)","v":12.13833986196812},{"$f":"IF((I101+M101)>100,M101*100/(I101+M101),M101)","v":1.0896735486680882},{"$f":"IF((N101+R101)>100,N101*100/(N101+R101),N101)","v":86.959093442108497},{"$f":"N99*AVERAGEIF(O105:O116,\">0\")/100","v":83.52386252765929},{"$f":"N99*(100-AVERAGEIF(O105:O116,\">0\"))/100","v":3.4352309144492068},{"$f":"100-(O99+P99+R99)","v":11.112481271854264},{"$f":"IF((N101+R101)>100,R101*100/(N101+R101),R101)","v":1.9284252860372391},{"$f":"IF((S101+W101)>100,S101*100/(S101+W101),S101)","v":93.797820163353094},{"$f":"S99*AVERAGEIF(T105:T116,\">0\")/100","v":89.339002255882235},{"$f":"S99*(100-AVERAGEIF(T105:T116,\">0\"))/100","v":4.45881790747086},{"$f":"100-(T99+U99+W99)","v":6.2021798366469056},{"$f":"IF((S101+W101)>100,W101*100/(S101+W101),W101)","v":0},{"$f":"IF((X101+AB101)>100,X101*100/(X101+AB101),X101)","v":95.58718320103435},{"$f":"X99*AVERAGEIF(Y105:Y116,\">0\")/100","v":95.511186504538841},{"$f":"X99*(100-AVERAGEIF(Y105:Y116,\">0\"))/100","v":7.5996696495503821E-2},{"$f":"100-(Y99+Z99+AB99)","v":4.4128167989656504},{"$f":"IF((X101+AB101)>100,AB101*100/(X101+AB101),AB101)","v":0}]
[null,null,{"$f":"MaxTarget(C105:C116)","v":2020},{"$f":"IF((D102+H102)>100,D102*100/(D102+H102),D102)","v":75.488851188414515},{"$f":"D100*AVERAGEIF(E105:E116,\">0\")/100","v":65.111235762324284},{"$f":"D100*(100-AVERAGEIF(E105:E116,\">0\"))/100","v":10.377615426090228},{"$f":"100-(E100+F100+H100)","v":11.452909533358223},{"$f":"IF((D102+H102)>100,H102*100/(D102+H102),H102)","v":13.058239278227262},{"$f":"IF((I102+M102)>100,I102*100/(I102+M102),I102)","v":94.937974176380521},{"$f":"I100*AVERAGEIF(J105:J116,\">0\")/100","v":90.217423568057043},{"$f":"I100*(100-AVERAGEIF(J105:J116,\">0\"))/100","v":4.7205506083234843},{"$f":"100-(J100+K100+M100)","v":2.0280226098928154},{"$f":"IF((I102+M102)>100,M102*100/(I102+M102),M102)","v":3.0340032137266633},{"$f":"IF((N102+R102)>100,N102*100/(N102+R102),N102)","v":98.910713069867526},{"$f":"N100*AVERAGEIF(O105:O116,\">0\")/100","v":95.003345526598153},{"$f":"N100*(100-AVERAGEIF(O105:O116,\">0\"))/100","v":3.9073675432693822},{"$f":"100-(O100+P100+R100)","v":0},{"$f":"IF((N102+R102)>100,R102*100/(N102+R102),R102)","v":1.0892869301324899},{"$f":"IF((S102+W102)>100,S102*100/(S102+W102),S102)","v":99.885813199828974},{"$f":"S100*AVERAGEIF(T105:T116,\">0\")/100","v":95.137593552271596},{"$f":"S100*(100-AVERAGEIF(T105:T116,\">0\"))/100","v":4.7482196475573764},{"$f":"100-(T100+U100+W100)","v":0},{"$f":"IF((S102+W102)>100,W102*100/(S102+W102),W102)","v":0.11418680017101765},{"$f":"IF((X102+AB102)>100,X102*100/(X102+AB102),X102)","v":100},{"$f":"X100*AVERAGEIF(Y105:Y116,\">0\")/100","v":99.920494888592259},{"$f":"X100*(100-AVERAGEIF(Y105:Y116,\">0\"))/100","v":7.9505111407740969E-2},{"$f":"100-(Y100+Z100+AB100)","v":0},{"$f":"IF((X102+AB102)>100,AB102*100/(X102+AB102),AB102)","v":0}]
["Regression period:",null,{"$f":"MinRegYear(C99,C105:C116)","v":2001},{"$f":"IF(MAX(C105:C116)-MIN(C105:C116)<5,AVERAGEIF(C105:C116,\">0\",D105:D116),\nIF(FORECAST($C101,D$105:D$116,$C$105:$C$116)<0,0,\nIF(FORECAST($C101,D$105:D$116,$C$105:$C$116)>100,100,\nFORECAST($C101,D$105:D$116,$C$105:$C$116))))","v":78.2717615028983},null,null,null,{"$f":"IF(MAX(C105:C116)-MIN(C105:C116)<5,AVERAGEIF(C105:C116,\">0\",H105:H116),\nIF(FORECAST($C101,H$105:H$116,$C$105:$C$116)<0,0,\nIF(FORECAST($C101,H$105:H$116,$C$105:$C$116)>100,100,\nFORECAST($C101,H$105:H$116,$C$105:$C$116))))","v":10.981613180094087},{"$f":"IF(MAX(C105:C116)-MIN(C105:C116)<5,AVERAGEIF(C105:C116,\">0\",I105:I116),\nIF(FORECAST($C101,I$105:I$116,$C$105:$C$116)<0,0,\nIF(FORECAST($C101,I$105:I$116,$C$105:$C$116)>100,100,\nFORECAST($C101,I$105:I$116,$C$105:$C$116))))","v":86.771986589363792},null,null,null,{"$f":"IF(MAX(C105:C116)-MIN(C105:C116)<5,AVERAGEIF(C105:C116,\">0\",M105:M116),\nIF(FORECAST($C101,M$105:M$116,$C$105:$C$116)<0,0,\nIF(FORECAST($C101,M$105:M$116,$C$105:$C$116)>100,100,\nFORECAST($C101,M$105:M$116,$C$105:$C$116))))","v":1.0896735486680882},{"$f":"IF(MAX(C105:C116)-MIN(C105:C116)<5,AVERAGEIF(C105:C116,\">0\",N105:N116),\nIF(FORECAST($C101,N$105:N$116,$C$105:$C$116)<0,0,\nIF(FORECAST($C101,N$105:N$116,$C$105:$C$116)>100,100,\nFORECAST($C101,N$105:N$116,$C$105:$C$116))))","v":86.959093442108497},null,null,null,{"$f":"IF(MAX(C105:C116)-MIN(C105:C116)<5,AVERAGEIF(C105:C116,\">0\",R105:R116),\nIF(FORECAST($C101,R$105:R$116,$C$105:$C$116)<0,0,\nIF(FORECAST($C101,R$105:R$116,$C$105:$C$116)>100,100,\nFORECAST($C101,R$105:R$116,$C$105:$C$116))))","v":1.9284252860372391},{"$f":"IF(MAX(C105:C116)-MIN(C105:C116)<5,AVERAGEIF(C105:C116,\">0\",S105:S116),\nIF(FORECAST($C101,S$105:S$116,$C$105:$C$116)<0,0,\nIF(FORECAST($C101,S$105:S$116,$C$105:$C$116)>100,100,\nFORECAST($C101,S$105:S$116,$C$105:$C$116))))","v":93.797820163353094},null,null,null,{"$f":"IF(MAX(C105:C116)-MIN(C105:C116)<5,AVERAGEIF(C105:C116,\">0\",W105:W116),\nIF(FORECAST($C101,W$105:W$116,$C$105:$C$116)<0,0,\nIF(FORECAST($C101,W$105:W$116,$C$105:$C$116)>100,100,\nFORECAST($C101,W$105:W$116,$C$105:$C$116))))","v":0},{"$f":"IF(MAX(C105:C116)-MIN(C105:C116)<5,AVERAGEIF(C105:C116,\">0\",X105:X116),\nIF(FORECAST($C101,X$105:X$116,$C$105:$C$116)<0,0,\nIF(FORECAST($C101,X$105:X$116,$C$105:$C$116)>100,100,\nFORECAST($C101,X$105:X$116,$C$105:$C$116))))","v":95.58718320103435},null,null,null,{"$f":"IF(MAX(C105:C116)-MIN(C105:C116)<5,AVERAGEIF(C105:C116,\">0\",AB105:AB116),\nIF(FORECAST($C101,AB$105:AB$116,$C$105:$C$116)<0,0,\nIF(FORECAST($C101,AB$105:AB$116,$C$105:$C$116)>100,100,\nFORECAST($C101,AB$105:AB$116,$C$105:$C$116))))","v":0}]
[null,null,{"$f":"MaxRegYear(C100,C105:C116)","v":2018},{"$f":"IF(MAX(C105:C116)-MIN(C105:C116)<5,AVERAGEIF(C105:C116,\">0\",D105:D116),\nIF(FORECAST($C102,D$105:D$116,$C$105:$C$116)<0,0,\nIF(FORECAST($C102,D$105:D$116,$C$105:$C$116)>100,100,\nFORECAST($C102,D$105:D$116,$C$105:$C$116))))","v":75.488851188414515},null,null,null,{"$f":"IF(MAX(C105:C116)-MIN(C105:C116)<5,AVERAGEIF(C105:C116,\">0\",H105:H116),\nIF(FORECAST($C102,H$105:H$116,$C$105:$C$116)<0,0,\nIF(FORECAST($C102,H$105:H$116,$C$105:$C$116)>100,100,\nFORECAST($C102,H$105:H$116,$C$105:$C$116))))","v":13.058239278227262},{"$f":"IF(MAX(C105:C116)-MIN(C105:C116)<5,AVERAGEIF(C105:C116,\">0\",I105:I116),\nIF(FORECAST($C102,I$105:I$116,$C$105:$C$116)<0,0,\nIF(FORECAST($C102,I$105:I$116,$C$105:$C$116)>100,100,\nFORECAST($C102,I$105:I$116,$C$105:$C$116))))","v":94.937974176380521},null,null,null,{"$f":"IF(MAX(C105:C116)-MIN(C105:C116)<5,AVERAGEIF(C105:C116,\">0\",M105:M116),\nIF(FORECAST($C102,M$105:M$116,$C$105:$C$116)<0,0,\nIF(FORECAST($C102,M$105:M$116,$C$105:$C$116)>100,100,\nFORECAST($C102,M$105:M$116,$C$105:$C$116))))","v":3.0340032137266633},{"$f":"IF(MAX(C105:C116)-MIN(C105:C116)<5,AVERAGEIF(C105:C116,\">0\",N105:N116),\nIF(FORECAST($C102,N$105:N$116,$C$105:$C$116)<0,0,\nIF(FORECAST($C102,N$105:N$116,$C$105:$C$116)>100,100,\nFORECAST($C102,N$105:N$116,$C$105:$C$116))))","v":99.162796793300686},null,null,null,{"$f":"IF(MAX(C105:C116)-MIN(C105:C116)<5,AVERAGEIF(C105:C116,\">0\",R105:R116),\nIF(FORECAST($C102,R$105:R$116,$C$105:$C$116)<0,0,\nIF(FORECAST($C102,R$105:R$116,$C$105:$C$116)>100,100,\nFORECAST($C102,R$105:R$116,$C$105:$C$116))))","v":1.0920630854822235},{"$f":"IF(MAX(C105:C116)-MIN(C105:C116)<5,AVERAGEIF(C105:C116,\">0\",S105:S116),\nIF(FORECAST($C102,S$105:S$116,$C$105:$C$116)<0,0,\nIF(FORECAST($C102,S$105:S$116,$C$105:$C$116)>100,100,\nFORECAST($C102,S$105:S$116,$C$105:$C$116))))","v":100},null,null,null,{"$f":"IF(MAX(C105:C116)-MIN(C105:C116)<5,AVERAGEIF(C105:C116,\">0\",W105:W116),\nIF(FORECAST($C102,W$105:W$116,$C$105:$C$116)<0,0,\nIF(FORECAST($C102,W$105:W$116,$C$105:$C$116)>100,100,\nFORECAST($C102,W$105:W$116,$C$105:$C$116))))","v":0.11431733547844125},{"$f":"IF(MAX(C105:C116)-MIN(C105:C116)<5,AVERAGEIF(C105:C116,\">0\",X105:X116),\nIF(FORECAST($C102,X$105:X$116,$C$105:$C$116)<0,0,\nIF(FORECAST($C102,X$105:X$116,$C$105:$C$116)>100,100,\nFORECAST($C102,X$105:X$116,$C$105:$C$116))))","v":100},null,null,null,{"$f":"IF(MAX(C105:C116)-MIN(C105:C116)<5,AVERAGEIF(C105:C116,\">0\",AB105:AB116),\nIF(FORECAST($C102,AB$105:AB$116,$C$105:$C$116)<0,0,\nIF(FORECAST($C102,AB$105:AB$116,$C$105:$C$116)>100,100,\nFORECAST($C102,AB$105:AB$116,$C$105:$C$116))))","v":0}]
[]
[null,"Survey","Year","Improved","Basic",null,null,"Surface water","Improved","Basic",null,null,"Surface water","Improved","Basic",null,null,"Surface water","Improved","Basic",null,null,"Surface water","Improved","Basic",null,null,"Surface water"]
[null,"WHS03",2003,{"$f":"IF(ISERROR(INDIRECT(CONCATENATE($B105,\"!C16\"))),\"\",INDIRECT(CONCATENATE($B105,\"!C16\")))","v":77.944360289429625},{"$f":"IF(ISERROR(INDIRECT(CONCATENATE($B105,\"!C23\"))),\"\",INDIRECT(CONCATENATE($B105,\"!C23\")))","v":82.848926347772576},null,null,{"$f":"IF(ISERROR(INDIRECT(CONCATENATE($B105,\"!C21\"))),\"\",INDIRECT(CONCATENATE($B105,\"!C21\")))","v":11.225922132815622},{"$f":"IF(ISERROR(INDIRECT(CONCATENATE($B105,\"!D16\"))),\"\",INDIRECT(CONCATENATE($B105,\"!D16\")))","v":87.732691011365787},{"$f":"IF(ISERROR(INDIRECT(CONCATENATE($B105,\"!D23\"))),\"\",INDIRECT(CONCATENATE($B105,\"!D23\")))","v":94.435386693662508},null,null,{"$f":"IF(ISERROR(INDIRECT(CONCATENATE($B105,\"!D21\"))),\"\",INDIRECT(CONCATENATE($B105,\"!D21\")))","v":1.3184182151455848},{"$f":"IF(ISERROR(INDIRECT(CONCATENATE($B105,\"!E16\"))),\"\",INDIRECT(CONCATENATE($B105,\"!E16\")))","v":88.394823248131146},{"$f":"IF(ISERROR(INDIRECT(CONCATENATE($B105,\"!E23\"))),\"\",INDIRECT(CONCATENATE($B105,\"!E23\")))","v":93.713138408388204},null,null,{"$f":"IF(ISERROR(INDIRECT(CONCATENATE($B105,\"!E21\"))),\"\",INDIRECT(CONCATENATE($B105,\"!E21\")))","v":1.8300297330307647},{"$f":"IF(ISERROR(INDIRECT(CONCATENATE($B105,\"!F16\"))),\"\",INDIRECT(CONCATENATE($B105,\"!F16\")))","v":94.576822495471291},{"$f":"IF(ISERROR(INDIRECT(CONCATENATE($B105,\"!F23\"))),\"\",INDIRECT(CONCATENATE($B105,\"!F23\")))","v":90.819121646052025},null,null,{"$f":"IF(ISERROR(INDIRECT(CONCATENATE($B105,\"!F21\"))),\"\",INDIRECT(CONCATENATE($B105,\"!F21\")))","v":0},{"$f":"IF(ISERROR(INDIRECT(CONCATENATE($B105,\"!G16\"))),\"\",INDIRECT(CONCATENATE($B105,\"!G16\")))","v":96.168209281710261},{"$f":"IF(ISERROR(INDIRECT(CONCATENATE($B105,\"!G23\"))),\"\",INDIRECT(CONCATENATE($B105,\"!G23\")))","v":100},null,null,{"$f":"IF(ISERROR(INDIRECT(CONCATENATE($B105,\"!G221\"))),\"\",INDIRECT(CONCATENATE($B105,\"!G21\")))","v":0}]
[null,"DHS16",2016,75.816252401883204,89.656641659379972,null,null,12.813930325505698,93.97726975437854,95.620119231598963,null,null,2.8052585472491978,97.72706698727815,98.386064151178147,null,null,1.1904586384886864,99.64033765423946,99.673582982465717,null,null,9.9075024081315105E-2,99.944878806103858,99.840989777184532,null,null,0]
[null,null,null,"","",null,null,"","","",null,null,"","","",null,null,"","","",null,null,"","","",null,null,""]
[null,null,null,"","",null,null,"","","",null,null,"","","",null,null,"","","",null,null,"","","",null,null,""]
[null,null,null,"","",null,null,"","","",null,null,"","","",null,null,"","","",null,null,"","","",null,null,""]
[null,null,null,"","",null,null,"","","",null,null,"","","",null,null,"","","",null,null,"","","",null,null,""]
[null,null,null,{"$f":"IF(ISERROR(INDIRECT(CONCATENATE($B111,\"!C16\"))),\"\",INDIRECT(CONCATENATE($B111,\"!C16\")))","v":""},{"$f":"IF(ISERROR(INDIRECT(CONCATENATE($B111,\"!C23\"))),\"\",INDIRECT(CONCATENATE($B111,\"!C23\")))","v":""},null,null,{"$f":"IF(ISERROR(INDIRECT(CONCATENATE($B111,\"!C21\"))),\"\",INDIRECT(CONCATENATE($B111,\"!C21\")))","v":""},{"$f":"IF(ISERROR(INDIRECT(CONCATENATE($B111,\"!D16\"))),\"\",INDIRECT(CONCATENATE($B111,\"!D16\")))","v":""},{"$f":"IF(ISERROR(INDIRECT(CONCATENATE($B111,\"!D23\"))),\"\",INDIRECT(CONCATENATE($B111,\"!D23\")))","v":""},null,null,{"$f":"IF(ISERROR(INDIRECT(CONCATENATE($B111,\"!D21\"))),\"\",INDIRECT(CONCATENATE($B111,\"!D21\")))","v":""},{"$f":"IF(ISERROR(INDIRECT(CONCATENATE($B111,\"!E16\"))),\"\",INDIRECT(CONCATENATE($B111,\"!E16\")))","v":""},{"$f":"IF(ISERROR(INDIRECT(CONCATENATE($B111,\"!E23\"))),\"\",INDIRECT(CONCATENATE($B111,\"!E23\")))","v":""},null,null,{"$f":"IF(ISERROR(INDIRECT(CONCATENATE($B111,\"!E21\"))),\"\",INDIRECT(CONCATENATE($B111,\"!E21\")))","v":""},{"$f":"IF(ISERROR(INDIRECT(CONCATENATE($B111,\"!F16\"))),\"\",INDIRECT(CONCATENATE($B111,\"!F16\")))","v":""},{"$f":"IF(ISERROR(INDIRECT(CONCATENATE($B111,\"!F23\"))),\"\",INDIRECT(CONCATENATE($B111,\"!F23\")))","v":""},null,null,{"$f":"IF(ISERROR(INDIRECT(CONCATENATE($B111,\"!F21\"))),\"\",INDIRECT(CONCATENATE($B111,\"!F21\")))","v":""},{"$f":"IF(ISERROR(INDIRECT(CONCATENATE($B111,\"!G16\"))),\"\",INDIRECT(CONCATENATE($B111,\"!G16\")))","v":""},{"$f":"IF(ISERROR(INDIRECT(CONCATENATE($B111,\"!G23\"))),\"\",INDIRECT(CONCATENATE($B111,\"!G23\")))","v":""},null,null,{"$f":"IF(ISERROR(INDIRECT(CONCATENATE($B111,\"!G221\"))),\"\",INDIRECT(CONCATENATE($B111,\"!G21\")))","v":""}]
[null,null,null,{"$f":"IF(ISERROR(INDIRECT(CONCATENATE($B112,\"!C16\"))),\"\",INDIRECT(CONCATENATE($B112,\"!C16\")))","v":""},{"$f":"IF(ISERROR(INDIRECT(CONCATENATE($B112,\"!C23\"))),\"\",INDIRECT(CONCATENATE($B112,\"!C23\")))","v":""},null,null,{"$f":"IF(ISERROR(INDIRECT(CONCATENATE($B112,\"!C21\"))),\"\",INDIRECT(CONCATENATE($B112,\"!C21\")))","v":""},{"$f":"IF(ISERROR(INDIRECT(CONCATENATE($B112,\"!D16\"))),\"\",INDIRECT(CONCATENATE($B112,\"!D16\")))","v":""},{"$f":"IF(ISERROR(INDIRECT(CONCATENATE($B112,\"!D23\"))),\"\",INDIRECT(CONCATENATE($B112,\"!D23\")))","v":""},null,null,{"$f":"IF(ISERROR(INDIRECT(CONCATENATE($B112,\"!D21\"))),\"\",INDIRECT(CONCATENATE($B112,\"!D21\")))","v":""},{"$f":"IF(ISERROR(INDIRECT(CONCATENATE($B112,\"!E16\"))),\"\",INDIRECT(CONCATENATE($B112,\"!E16\")))","v":""},{"$f":"IF(ISERROR(INDIRECT(CONCATENATE($B112,\"!E23\"))),\"\",INDIRECT(CONCATENATE($B112,\"!E23\")))","v":""},null,null,{"$f":"IF(ISERROR(INDIRECT(CONCATENATE($B112,\"!E21\"))),\"\",INDIRECT(CONCATENATE($B112,\"!E21\")))","v":""},{"$f":"IF(ISERROR(INDIRECT(CONCATENATE($B112,\"!F16\"))),\"\",INDIRECT(CONCATENATE($B112,\"!F16\")))","v":""},{"$f":"IF(ISERROR(INDIRECT(CONCATENATE($B112,\"!F23\"))),\"\",INDIRECT(CONCATENATE($B112,\"!F23\")))","v":""},null,null,{"$f":"IF(ISERROR(INDIRECT(CONCATENATE($B112,\"!F21\"))),\"\",INDIRECT(CONCATENATE($B112,\"!F21\")))","v":""},{"$f":"IF(ISERROR(INDIRECT(CONCATENATE($B112,\"!G16\"))),\"\",INDIRECT(CONCATENATE($B112,\"!G16\")))","v":""},{"$f":"IF(ISERROR(INDIRECT(CONCATENATE($B112,\"!G23\"))),\"\",INDIRECT(CONCATENATE($B112,\"!G23\")))","v":""},null,null,{"$f":"IF(ISERROR(INDIRECT(CONCATENATE($B112,\"!G221\"))),\"\",INDIRECT(CONCATENATE($B112,\"!G21\")))","v":""}]
[null,null,null,"","",null,null,"","","",null,null,"","","",null,null,"","","",null,null,"","","",null,null,""]
[null,null,null,"","",null,null,"","","",null,null,"","","",null,null,"","","",null,null,"","","",null,null,""]
[null,null,null,"","",null,null,"","","",null,null,"","","",null,null,"","","",null,null,"","","",null,null,""]
[null,null,null,"","",null,null,"","","",null,null,"","","",null,null,"","","",null,null,"","","",null,null,""]
[]
[null,{"$f":"CONCATENATE(\"National use of drinking water sources, \",C99,\"–\",C100)","v":"National use of drinking water sources, 2000–2020"},null,null,null,null,null,null,null,null,null,null,null,null,null,null,null,null,"Data points used for regression"]
[]
[]
[]
[]
[]
[]
[]
[]
[]
[]
[]
[]
[]
[]
[]
[]
[]
[]
[]
[]
[]
[]
[]
[]
[]
[]
[]
[]
[]
[]
[]
[]
[]
[]
[null,null,null,null,{"$f":"IF(ISERROR(INDIRECT(CONCATENATE($B153,\"!M18\"))),\"\",INDIRECT(CONCATENATE($B153,\"!M18\")))","v":""},{"$f":"IF(ISERROR(INDIRECT(CONCATENATE($B153,\"!M19\"))),\"\",INDIRECT(CONCATENATE($B153,\"!M19\")))","v":""},{"$f":"IF(ISERROR(INDIRECT(CONCATENATE($B153,\"!M20\"))),\"\",INDIRECT(CONCATENATE($B153,\"!M20\")))","v":""},{"$f":"IF(ISERROR(INDIRECT(CONCATENATE($B153,\"!M21\"))),\"\",INDIRECT(CONCATENATE($B153,\"!M21\")))","v":""},null,{"$f":"IF(ISERROR(INDIRECT(CONCATENATE($B153,\"!N18\"))),\"\",INDIRECT(CONCATENATE($B153,\"!N18\")))","v":""},{"$f":"IF(ISERROR(INDIRECT(CONCATENATE($B153,\"!N19\"))),\"\",INDIRECT(CONCATENATE($B153,\"!N19\")))","v":""},{"$f":"IF(ISERROR(INDIRECT(CONCATENATE($B153,\"!N20\"))),\"\",INDIRECT(CONCATENATE($B153,\"!N20\")))","v":""},{"$f":"IF(ISERROR(INDIRECT(CONCATENATE($B153,\"!N21\"))),\"\",INDIRECT(CONCATENATE($B153,\"!N21\")))","v":""},null,{"$f":"IF(ISERROR(INDIRECT(CONCATENATE($B153,\"!O18\"))),\"\",INDIRECT(CONCATENATE($B153,\"!O18\")))","v":""},{"$f":"IF(ISERROR(INDIRECT(CONCATENATE($B153,\"!O19\"))),\"\",INDIRECT(CONCATENATE($B153,\"!O19\")))","v":""},{"$f":"IF(ISERROR(INDIRECT(CONCATENATE($B153,\"!O20\"))),\"\",INDIRECT(CONCATENATE($B153,\"!O20\")))","v":""},{"$f":"IF(ISERROR(INDIRECT(CONCATENATE($B153,\"!O21\"))),\"\",INDIRECT(CONCATENATE($B153,\"!O21\")))","v":""},null,{"$f":"IF(ISERROR(INDIRECT(CONCATENATE($B153,\"!P18\"))),\"\",INDIRECT(CONCATENATE($B153,\"!P18\")))","v":""},{"$f":"IF(ISERROR(INDIRECT(CONCATENATE($B153,\"!P19\"))),\"\",INDIRECT(CONCATENATE($B153,\"!P19\")))","v":""},{"$f":"IF(ISERROR(INDIRECT(CONCATENATE($B153,\"!P20\"))),\"\",INDIRECT(CONCATENATE($B153,\"!P20\")))","v":""},{"$f":"IF(ISERROR(INDIRECT(CONCATENATE($B153,\"!P21\"))),\"\",INDIRECT(CONCATENATE($B153,\"!P21\")))","v":""},null,{"$f":"IF(ISERROR(INDIRECT(CONCATENATE($B153,\"!Q18\"))),\"\",INDIRECT(CONCATENATE($B153,\"!Q18\")))","v":""},{"$f":"IF(ISERROR(INDIRECT(CONCATENATE($B153,\"!Q19\"))),\"\",INDIRECT(CONCATENATE($B153,\"!Q19\")))","v":""},{"$f":"IF(ISERROR(INDIRECT(CONCATENATE($B153,\"!Q20\"))),\"\",INDIRECT(CONCATENATE($B153,\"!Q20\")))","v":""},{"$f":"IF(ISERROR(INDIRECT(CONCATENATE($B153,\"!Q21\"))),\"\",INDIRECT(CONCATENATE($B153,\"!Q1\")))","v":""}]
[null,null,null,null,"","","","",null,"","","","",null,"","","","",null,"","","","",null,"","","",""]
[null,null,null,null,"","","","",null,"","","","",null,"","","","",null,"","","","",null,"","","",""]
[null,null,null,null,"","","","",null,"","","","",null,"","","","",null,"","","","",null,"","","",""]
[null,null,null,null,"","","","",null,"","","","",null,"","","","",null,"","","","",null,"","","",""]
[null,null,null,null,"","","","",null,"","","","",null,"","","","",null,"","","","",null,"","","",""]
[]
[]
[]
[]
[]
[]
[]
[]
[]
[]
[]
[]
[]
[]
[]
[]
[]
[]
[]
[]
[]
[]
[]
[]
[]
[]
[]
[]
[]
[]
[]
[]
[]
[]
[]
[]
[]
[]
["URBAN",null,null,"Poorest",null,null,null,null,"Poor",null,null,null,null,"Middle",null,null,null,null,"Rich",null,null,null,null,"Richest"]
[null,null,null,"Improved","Basic","Limited","Unimproved","Surface water","Improved","Basic","Limited","Unimproved","Surface water","Improved","Basic","Limited","Unimproved","Surface water","Improved","Basic","Limited","Unimproved","Surface water","Improved","Basic","Limited","Unimproved","Surface water"]
["Forecast period:",null,{"$f":"MinBase(C205:C216)","v":2000},{"$f":"IF((D201+H201)>100,D201*100/(D201+H201),D201)","v":92.80936746903933},{"$f":"D199*AVERAGEIF(E205:E216,\">0\")/100","v":87.643697832120765},{"$f":"D199*(100-AVERAGEIF(E205:E216,\">0\"))/100","v":5.1656696369185742},{"$f":"100-(E199+F199+H199)","v":7.1906325309606558},{"$f":"IF((D201+H201)>100,H201*100/(D201+H201),H201)","v":0},{"$f":"IF((I201+M201)>100,I201*100/(I201+M201),I201)","v":88.092658148754708},{"$f":"I199*AVERAGEIF(J205:J216,\">0\")/100","v":85.170659923227362},{"$f":"I199*(100-AVERAGEIF(J205:J216,\">0\"))/100","v":2.92199822552735},{"$f":"100-(J199+K199+M199)","v":11.907341851245292},{"$f":"IF((I201+M201)>100,M201*100/(I201+M201),M201)","v":0},{"$f":"IF((N201+R201)>100,N201*100/(N201+R201),N201)","v":86.341967227107034},{"$f":"N199*AVERAGEIF(O205:O216,\">0\")/100","v":86.266434353829197},{"$f":"N199*(100-AVERAGEIF(O205:O216,\">0\"))/100","v":7.553287327783606E-2},{"$f":"100-(O199+P199+R199)","v":13.658032772892966},{"$f":"IF((N201+R201)>100,R201*100/(N201+R201),R201)","v":0},{"$f":"IF((S201+W201)>100,S201*100/(S201+W201),S201)","v":94.723465386353837},{"$f":"S199*AVERAGEIF(T205:T216,\">0\")/100","v":94.723465386353837},{"$f":"S199*(100-AVERAGEIF(T205:T216,\">0\"))/100","v":0},{"$f":"100-(T199+U199+W199)","v":5.2765346136461631},{"$f":"IF((S201+W201)>100,W201*100/(S201+W201),W201)","v":0},{"$f":"IF((X201+AB201)>100,X201*100/(X201+AB201),X201)","v":96.730675631091742},{"$f":"X199*AVERAGEIF(Y205:Y216,\">0\")/100","v":96.639073514203901},{"$f":"X199*(100-AVERAGEIF(Y205:Y216,\">0\"))/100","v":9.1602116887842547E-2},{"$f":"100-(Y199+Z199+AB199)","v":3.2693243689082578},{"$f":"IF((X201+AB201)>100,AB201*100/(X201+AB201),AB201)","v":0}]
[null,null,{"$f":"MaxTarget(C205:C216)","v":2020},{"$f":"IF((D202+H202)>100,D202*100/(D202+H202),D202)","v":99.048511060468783},{"$f":"D200*AVERAGEIF(E205:E216,\">0\")/100","v":93.535577397412183},{"$f":"D200*(100-AVERAGEIF(E205:E216,\">0\"))/100","v":5.5129336630566002},{"$f":"100-(E200+F200+H200)","v":0},{"$f":"IF((D202+H202)>100,H202*100/(D202+H202),H202)","v":0.95148893953121649},{"$f":"IF((I202+M202)>100,I202*100/(I202+M202),I202)","v":100},{"$f":"I200*AVERAGEIF(J205:J216,\">0\")/100","v":96.68304000931245},{"$f":"I200*(100-AVERAGEIF(J205:J216,\">0\"))/100","v":3.3169599906875504},{"$f":"100-(J200+K200+M200)","v":0},{"$f":"IF((I202+M202)>100,M202*100/(I202+M202),M202)","v":0},{"$f":"IF((N202+R202)>100,N202*100/(N202+R202),N202)","v":99.976327207760747},{"$f":"N200*AVERAGEIF(O205:O216,\">0\")/100","v":99.888866851038699},{"$f":"N200*(100-AVERAGEIF(O205:O216,\">0\"))/100","v":8.7460356722060817E-2},{"$f":"100-(O200+P200+R200)","v":0},{"$f":"IF((N202+R202)>100,R202*100/(N202+R202),R202)","v":2.3672792239249306E-2},{"$f":"IF((S202+W202)>100,S202*100/(S202+W202),S202)","v":100},{"$f":"S200*AVERAGEIF(T205:T216,\">0\")/100","v":100},{"$f":"S200*(100-AVERAGEIF(T205:T216,\">0\"))/100","v":0},{"$f":"100-(T200+U200+W200)","v":0},{"$f":"IF((S202+W202)>100,W202*100/(S202+W202),W202)","v":0},{"$f":"IF((X202+AB202)>100,X202*100/(X202+AB202),X202)","v":100},{"$f":"X200*AVERAGEIF(Y205:Y216,\">0\")/100","v":99.90530189488473},{"$f":"X200*(100-AVERAGEIF(Y205:Y216,\">0\"))/100","v":9.4698105115270437E-2},{"$f":"100-(Y200+Z200+AB200)","v":0},{"$f":"IF((X202+AB202)>100,AB202*100/(X202+AB202),AB202)","v":0}]
["Regression period:",null,{"$f":"MinRegYear(C199,C205:C216)","v":2001},{"$f":"IF(MAX(C205:C216)-MIN(C205:C216)<5,AVERAGEIF(C205:C216,\">0\",D205:D216),\nIF(FORECAST($C201,D$205:D$216,$C$205:$C$216)<0,0,\nIF(FORECAST($C201,D$205:D$216,$C$205:$C$216)>100,100,\nFORECAST($C201,D$205:D$216,$C$205:$C$216))))","v":92.80936746903933},null,null,null,{"$f":"IF(MAX(C205:C216)-MIN(C205:C216)<5,AVERAGEIF(C205:C216,\">0\",H205:H216),\nIF(FORECAST($C201,H$205:H$216,$C$205:$C$216)<0,0,\nIF(FORECAST($C201,H$205:H$216,$C$205:$C$216)>100,100,\nFORECAST($C201,H$205:H$216,$C$205:$C$216))))","v":0},{"$f":"IF(MAX(C205:C216)-MIN(C205:C216)<5,AVERAGEIF(C205:C216,\">0\",I205:I216),\nIF(FORECAST($C201,I$205:I$216,$C$205:$C$216)<0,0,\nIF(FORECAST($C201,I$205:I$216,$C$205:$C$216)>100,100,\nFORECAST($C201,I$205:I$216,$C$205:$C$216))))","v":88.092658148754708},null,null,null,{"$f":"IF(MAX(C205:C216)-MIN(C205:C216)<5,AVERAGEIF(C205:C216,\">0\",M205:M216),\nIF(FORECAST($C201,M$205:M$216,$C$205:$C$216)<0,0,\nIF(FORECAST($C201,M$205:M$216,$C$205:$C$216)>100,100,\nFORECAST($C201,M$205:M$216,$C$205:$C$216))))","v":0},{"$f":"IF(MAX(C205:C216)-MIN(C205:C216)<5,AVERAGEIF(C205:C216,\">0\",N205:N216),\nIF(FORECAST($C201,N$205:N$216,$C$205:$C$216)<0,0,\nIF(FORECAST($C201,N$205:N$216,$C$205:$C$216)>100,100,\nFORECAST($C201,N$205:N$216,$C$205:$C$216))))","v":86.341967227107034},null,null,null,{"$f":"IF(MAX(C205:C216)-MIN(C205:C216)<5,AVERAGEIF(C205:C216,\">0\",R205:R216),\nIF(FORECAST($C201,R$205:R$216,$C$205:$C$216)<0,0,\nIF(FORECAST($C201,R$205:R$216,$C$205:$C$216)>100,100,\nFORECAST($C201,R$205:R$216,$C$205:$C$216))))","v":0},{"$f":"IF(MAX(C205:C216)-MIN(C205:C216)<5,AVERAGEIF(C205:C216,\">0\",S205:S216),\nIF(FORECAST($C201,S$205:S$216,$C$205:$C$216)<0,0,\nIF(FORECAST($C201,S$205:S$216,$C$205:$C$216)>100,100,\nFORECAST($C201,S$205:S$216,$C$205:$C$216))))","v":94.723465386353837},null,null,null,{"$f":"IF(MAX(C205:C216)-MIN(C205:C216)<5,AVERAGEIF(C205:C216,\">0\",W205:W216),\nIF(FORECAST($C201,W$205:W$216,$C$205:$C$216)<0,0,\nIF(FORECAST($C201,W$205:W$216,$C$205:$C$216)>100,100,\nFORECAST($C201,W$205:W$216,$C$205:$C$216))))","v":0},{"$f":"IF(MAX(C205:C216)-MIN(C205:C216)<5,AVERAGEIF(C205:C216,\">0\",X205:X216),\nIF(FORECAST($C201,X$205:X$216,$C$205:$C$216)<0,0,\nIF(FORECAST($C201,X$205:X$216,$C$205:$C$216)>100,100,\nFORECAST($C201,X$205:X$216,$C$205:$C$216))))","v":96.730675631091742},null,null,null,{"$f":"IF(MAX(C205:C216)-MIN(C205:C216)<5,AVERAGEIF(C205:C216,\">0\",AB205:AB216),\nIF(FORECAST($C201,AB$205:AB$216,$C$205:$C$216)<0,0,\nIF(FORECAST($C201,AB$205:AB$216,$C$205:$C$216)>100,100,\nFORECAST($C201,AB$205:AB$216,$C$205:$C$216))))","v":0}]
[null,null,{"$f":"MaxRegYear(C200,C205:C216)","v":2018},{"$f":"IF(MAX(C205:C216)-MIN(C205:C216)<5,AVERAGEIF(C205:C216,\">0\",D205:D216),\nIF(FORECAST($C202,D$205:D$216,$C$205:$C$216)<0,0,\nIF(FORECAST($C202,D$205:D$216,$C$205:$C$216)>100,100,\nFORECAST($C202,D$205:D$216,$C$205:$C$216))))","v":99.58310109580259},null,null,null,{"$f":"IF(MAX(C205:C216)-MIN(C205:C216)<5,AVERAGEIF(C205:C216,\">0\",H205:H216),\nIF(FORECAST($C202,H$205:H$216,$C$205:$C$216)<0,0,\nIF(FORECAST($C202,H$205:H$216,$C$205:$C$216)>100,100,\nFORECAST($C202,H$205:H$216,$C$205:$C$216))))","v":0.95662436761951142},{"$f":"IF(MAX(C205:C216)-MIN(C205:C216)<5,AVERAGEIF(C205:C216,\">0\",I205:I216),\nIF(FORECAST($C202,I$205:I$216,$C$205:$C$216)<0,0,\nIF(FORECAST($C202,I$205:I$216,$C$205:$C$216)>100,100,\nFORECAST($C202,I$205:I$216,$C$205:$C$216))))","v":100},null,null,null,{"$f":"IF(MAX(C205:C216)-MIN(C205:C216)<5,AVERAGEIF(C205:C216,\">0\",M205:M216),\nIF(FORECAST($C202,M$205:M$216,$C$205:$C$216)<0,0,\nIF(FORECAST($C202,M$205:M$216,$C$205:$C$216)>100,100,\nFORECAST($C202,M$205:M$216,$C$205:$C$216))))","v":0},{"$f":"IF(MAX(C205:C216)-MIN(C205:C216)<5,AVERAGEIF(C205:C216,\">0\",N205:N216),\nIF(FORECAST($C202,N$205:N$216,$C$205:$C$216)<0,0,\nIF(FORECAST($C202,N$205:N$216,$C$205:$C$216)>100,100,\nFORECAST($C202,N$205:N$216,$C$205:$C$216))))","v":100},null,null,null,{"$f":"IF(MAX(C205:C216)-MIN(C205:C216)<5,AVERAGEIF(C205:C216,\">0\",R205:R216),\nIF(FORECAST($C202,R$205:R$216,$C$205:$C$216)<0,0,\nIF(FORECAST($C202,R$205:R$216,$C$205:$C$216)>100,100,\nFORECAST($C202,R$205:R$216,$C$205:$C$216))))","v":2.3678397577113319E-2},{"$f":"IF(MAX(C205:C216)-MIN(C205:C216)<5,AVERAGEIF(C205:C216,\">0\",S205:S216),\nIF(FORECAST($C202,S$205:S$216,$C$205:$C$216)<0,0,\nIF(FORECAST($C202,S$205:S$216,$C$205:$C$216)>100,100,\nFORECAST($C202,S$205:S$216,$C$205:$C$216))))","v":100},null,null,null,{"$f":"IF(MAX(C205:C216)-MIN(C205:C216)<5,AVERAGEIF(C205:C216,\">0\",W205:W216),\nIF(FORECAST($C202,W$205:W$216,$C$205:$C$216)<0,0,\nIF(FORECAST($C202,W$205:W$216,$C$205:$C$216)>100,100,\nFORECAST($C202,W$205:W$216,$C$205:$C$216))))","v":0},{"$f":"IF(MAX(C205:C216)-MIN(C205:C216)<5,AVERAGEIF(C205:C216,\">0\",X205:X216),\nIF(FORECAST($C202,X$205:X$216,$C$205:$C$216)<0,0,\nIF(FORECAST($C202,X$205:X$216,$C$205:$C$216)>100,100,\nFORECAST($C202,X$205:X$216,$C$205:$C$216))))","v":100},null,null,null,{"$f":"IF(MAX(C205:C216)-MIN(C205:C216)<5,AVERAGEIF(C205:C216,\">0\",AB205:AB216),\nIF(FORECAST($C202,AB$205:AB$216,$C$205:$C$216)<0,0,\nIF(FORECAST($C202,AB$205:AB$216,$C$205:$C$216)>100,100,\nFORECAST($C202,AB$205:AB$216,$C$205:$C$216))))","v":0}]
[]
[null,"Survey","Year","Improved","Basic",null,null,"Surface water","Improved","Basic",null,null,"Surface water","Improved","Basic",null,null,"Surface water","Improved","Basic",null,null,"Surface water","Improved","Basic",null,null,"Surface water"]
[null,"WHS03",2003,{"$f":"IF(ISERROR(INDIRECT(CONCATENATE($B205,\"!H16\"))),\"\",INDIRECT(CONCATENATE($B205,\"!H16\")))","v":93.606277307482117},{"$f":"IF(ISERROR(INDIRECT(CONCATENATE($B205,\"!H23\"))),\"\",INDIRECT(CONCATENATE($B205,\"!H23\")))","v":92.09294442570193},null,null,{"$f":"IF(ISERROR(INDIRECT(CONCATENATE($B205,\"!H21\"))),\"\",INDIRECT(CONCATENATE($B205,\"!H21\")))","v":0},{"$f":"IF(ISERROR(INDIRECT(CONCATENATE($B205,\"!I16\"))),\"\",INDIRECT(CONCATENATE($B205,\"!I16\")))","v":89.602387920847164},{"$f":"IF(ISERROR(INDIRECT(CONCATENATE($B205,\"!I23\"))),\"\",INDIRECT(CONCATENATE($B205,\"!I23\")))","v":93.471833315391137},null,null,{"$f":"IF(ISERROR(INDIRECT(CONCATENATE($B205,\"!I21\"))),\"\",INDIRECT(CONCATENATE($B205,\"!I21\")))","v":0},{"$f":"IF(ISERROR(INDIRECT(CONCATENATE($B205,\"!J16\"))),\"\",INDIRECT(CONCATENATE($B205,\"!J16\")))","v":88.159255564250302},{"$f":"IF(ISERROR(INDIRECT(CONCATENATE($B205,\"!J23\"))),\"\",INDIRECT(CONCATENATE($B205,\"!J23\")))","v":100},null,null,{"$f":"IF(ISERROR(INDIRECT(CONCATENATE($B205,\"!J21\"))),\"\",INDIRECT(CONCATENATE($B205,\"!J21\")))","v":0},{"$f":"IF(ISERROR(INDIRECT(CONCATENATE($B205,\"!K16\"))),\"\",INDIRECT(CONCATENATE($B205,\"!K16\")))","v":95.417664976781239},{"$f":"IF(ISERROR(INDIRECT(CONCATENATE($B205,\"!K23\"))),\"\",INDIRECT(CONCATENATE($B205,\"!K23\")))","v":100},null,null,{"$f":"IF(ISERROR(INDIRECT(CONCATENATE($B205,\"!K21\"))),\"\",INDIRECT(CONCATENATE($B205,\"!K21\")))","v":0},{"$f":"IF(ISERROR(INDIRECT(CONCATENATE($B205,\"!L16\"))),\"\",INDIRECT(CONCATENATE($B205,\"!L16\")))","v":97.166585546946195},{"$f":"IF(ISERROR(INDIRECT(CONCATENATE($B205,\"!L23\"))),\"\",INDIRECT(CONCATENATE($B205,\"!L23\")))","v":100},null,null,{"$f":"IF(ISERROR(INDIRECT(CONCATENATE($B205,\"!L221\"))),\"\",INDIRECT(CONCATENATE($B205,\"!L21\")))","v":0}]
[null,"DHS16",2016,98.786191257359917,96.775270544857349,null,null,0.82907445193692053,99.415631439447935,99.894246703233762,null,null,0,99.97162975568294,99.82503786813389,null,null,2.0521277900165068E-2,99.929962314559546,100,null,null,0,100,99.810603789769445,null,null,0]
[null,null,null,"","",null,null,"","","",null,null,"","","",null,null,"","","",null,null,"","","",null,null,""]
[null,null,null,"","",null,null,"","","",null,null,"","","",null,null,"","","",null,null,"","","",null,null,""]
[null,null,null,"","",null,null,"","","",null,null,"","","",null,null,"","","",null,null,"","","",null,null,""]
[null,null,null,"","",null,null,"","","",null,null,"","","",null,null,"","","",null,null,"","","",null,null,""]
[null,null,null,"","",null,null,"","","",null,null,"","","",null,null,"","","",null,null,"","","",null,null,""]
[null,null,null,"","",null,null,"","","",null,null,"","","",null,null,"","","",null,null,"","","",null,null,""]
[null,null,null,"","",null,null,"","","",null,null,"","","",null,null,"","","",null,null,"","","",null,null,""]
[null,null,null,"","",null,null,"","","",null,null,"","","",null,null,"","","",null,null,"","","",null,null,""]
[null,null,null,"","",null,null,"","","",null,null,"","","",null,null,"","","",null,null,"","","",null,null,""]
[null,null,null,"","",null,null,"","","",null,null,"","","",null,null,"","","",null,null,"","","",null,null,""]
[]
[null,{"$f":"CONCATENATE(\"Urban use of drinking water sources,  \",C199,\"–\",C200)","v":"Urban use of drinking water sources,  2000–2020"},null,null,null,null,null,null,null,null,null,null,null,null,null,null,null,null,"Data points used for regression"]
[]
[]
[]
[]
[]
[]
[]
[]
[]
[]
[]
[]
[]
[]
[]
[]
[]
[]
[]
[]
[]
[]
[]
[]
[]
[]
[]
[]
[]
[]
[]
[]
[]
[]
[null,null,null,null,{"$f":"IF(ISERROR(INDIRECT(CONCATENATE($B253,\"!M18\"))),\"\",INDIRECT(CONCATENATE($B253,\"!M18\")))","v":""},{"$f":"IF(ISERROR(INDIRECT(CONCATENATE($B253,\"!M19\"))),\"\",INDIRECT(CONCATENATE($B253,\"!M19\")))","v":""},{"$f":"IF(ISERROR(INDIRECT(CONCATENATE($B253,\"!M20\"))),\"\",INDIRECT(CONCATENATE($B253,\"!M20\")))","v":""},{"$f":"IF(ISERROR(INDIRECT(CONCATENATE($B253,\"!M21\"))),\"\",INDIRECT(CONCATENATE($B253,\"!M21\")))","v":""},null,{"$f":"IF(ISERROR(INDIRECT(CONCATENATE($B253,\"!N18\"))),\"\",INDIRECT(CONCATENATE($B253,\"!N18\")))","v":""},{"$f":"IF(ISERROR(INDIRECT(CONCATENATE($B253,\"!N19\"))),\"\",INDIRECT(CONCATENATE($B253,\"!N19\")))","v":""},{"$f":"IF(ISERROR(INDIRECT(CONCATENATE($B253,\"!N20\"))),\"\",INDIRECT(CONCATENATE($B253,\"!N20\")))","v":""},{"$f":"IF(ISERROR(INDIRECT(CONCATENATE($B253,\"!N21\"))),\"\",INDIRECT(CONCATENATE($B253,\"!N21\")))","v":""},null,{"$f":"IF(ISERROR(INDIRECT(CONCATENATE($B253,\"!O18\"))),\"\",INDIRECT(CONCATENATE($B253,\"!O18\")))","v":""},{"$f":"IF(ISERROR(INDIRECT(CONCATENATE($B253,\"!O19\"))),\"\",INDIRECT(CONCATENATE($B253,\"!O19\")))","v":""},{"$f":"IF(ISERROR(INDIRECT(CONCATENATE($B253,\"!O20\"))),\"\",INDIRECT(CONCATENATE($B253,\"!O20\")))","v":""},{"$f":"IF(ISERROR(INDIRECT(CONCATENATE($B253,\"!O21\"))),\"\",INDIRECT(CONCATENATE($B253,\"!O21\")))","v":""},null,{"$f":"IF(ISERROR(INDIRECT(CONCATENATE($B253,\"!P18\"))),\"\",INDIRECT(CONCATENATE($B253,\"!P18\")))","v":""},{"$f":"IF(ISERROR(INDIRECT(CONCATENATE($B253,\"!P19\"))),\"\",INDIRECT(CONCATENATE($B253,\"!P19\")))","v":""},{"$f":"IF(ISERROR(INDIRECT(CONCATENATE($B253,\"!P20\"))),\"\",INDIRECT(CONCATENATE($B253,\"!P20\")))","v":""},{"$f":"IF(ISERROR(INDIRECT(CONCATENATE($B253,\"!P21\"))),\"\",INDIRECT(CONCATENATE($B253,\"!P21\")))","v":""},null,{"$f":"IF(ISERROR(INDIRECT(CONCATENATE($B253,\"!Q18\"))),\"\",INDIRECT(CONCATENATE($B253,\"!Q18\")))","v":""},{"$f":"IF(ISERROR(INDIRECT(CONCATENATE($B253,\"!Q19\"))),\"\",INDIRECT(CONCATENATE($B253,\"!Q19\")))","v":""},{"$f":"IF(ISERROR(INDIRECT(CONCATENATE($B253,\"!Q20\"))),\"\",INDIRECT(CONCATENATE($B253,\"!Q20\")))","v":""},{"$f":"IF(ISERROR(INDIRECT(CONCATENATE($B253,\"!Q21\"))),\"\",INDIRECT(CONCATENATE($B253,\"!Q1\")))","v":""}]
[null,null,null,null,{"$f":"IF(ISERROR(INDIRECT(CONCATENATE($B254,\"!M18\"))),\"\",INDIRECT(CONCATENATE($B254,\"!M18\")))","v":""},{"$f":"IF(ISERROR(INDIRECT(CONCATENATE($B254,\"!M19\"))),\"\",INDIRECT(CONCATENATE($B254,\"!M19\")))","v":""},{"$f":"IF(ISERROR(INDIRECT(CONCATENATE($B254,\"!M20\"))),\"\",INDIRECT(CONCATENATE($B254,\"!M20\")))","v":""},{"$f":"IF(ISERROR(INDIRECT(CONCATENATE($B254,\"!M21\"))),\"\",INDIRECT(CONCATENATE($B254,\"!M21\")))","v":""},null,{"$f":"IF(ISERROR(INDIRECT(CONCATENATE($B254,\"!N18\"))),\"\",INDIRECT(CONCATENATE($B254,\"!N18\")))","v":""},{"$f":"IF(ISERROR(INDIRECT(CONCATENATE($B254,\"!N19\"))),\"\",INDIRECT(CONCATENATE($B254,\"!N19\")))","v":""},{"$f":"IF(ISERROR(INDIRECT(CONCATENATE($B254,\"!N20\"))),\"\",INDIRECT(CONCATENATE($B254,\"!N20\")))","v":""},{"$f":"IF(ISERROR(INDIRECT(CONCATENATE($B254,\"!N21\"))),\"\",INDIRECT(CONCATENATE($B254,\"!N21\")))","v":""},null,{"$f":"IF(ISERROR(INDIRECT(CONCATENATE($B254,\"!O18\"))),\"\",INDIRECT(CONCATENATE($B254,\"!O18\")))","v":""},{"$f":"IF(ISERROR(INDIRECT(CONCATENATE($B254,\"!O19\"))),\"\",INDIRECT(CONCATENATE($B254,\"!O19\")))","v":""},{"$f":"IF(ISERROR(INDIRECT(CONCATENATE($B254,\"!O20\"))),\"\",INDIRECT(CONCATENATE($B254,\"!O20\")))","v":""},{"$f":"IF(ISERROR(INDIRECT(CONCATENATE($B254,\"!O21\"))),\"\",INDIRECT(CONCATENATE($B254,\"!O21\")))","v":""},null,{"$f":"IF(ISERROR(INDIRECT(CONCATENATE($B254,\"!P18\"))),\"\",INDIRECT(CONCATENATE($B254,\"!P18\")))","v":""},{"$f":"IF(ISERROR(INDIRECT(CONCATENATE($B254,\"!P19\"))),\"\",INDIRECT(CONCATENATE($B254,\"!P19\")))","v":""},{"$f":"IF(ISERROR(INDIRECT(CONCATENATE($B254,\"!P20\"))),\"\",INDIRECT(CONCATENATE($B254,\"!P20\")))","v":""},{"$f":"IF(ISERROR(INDIRECT(CONCATENATE($B254,\"!P21\"))),\"\",INDIRECT(CONCATENATE($B254,\"!P21\")))","v":""},null,{"$f":"IF(ISERROR(INDIRECT(CONCATENATE($B254,\"!Q18\"))),\"\",INDIRECT(CONCATENATE($B254,\"!Q18\")))","v":""},{"$f":"IF(ISERROR(INDIRECT(CONCATENATE($B254,\"!Q19\"))),\"\",INDIRECT(CONCATENATE($B254,\"!Q19\")))","v":""},{"$f":"IF(ISERROR(INDIRECT(CONCATENATE($B254,\"!Q20\"))),\"\",INDIRECT(CONCATENATE($B254,\"!Q20\")))","v":""},{"$f":"IF(ISERROR(INDIRECT(CONCATENATE($B254,\"!Q21\"))),\"\",INDIRECT(CONCATENATE($B254,\"!Q1\")))","v":""}]
[null,null,null,null,{"$f":"IF(ISERROR(INDIRECT(CONCATENATE($B255,\"!M18\"))),\"\",INDIRECT(CONCATENATE($B255,\"!M18\")))","v":""},{"$f":"IF(ISERROR(INDIRECT(CONCATENATE($B255,\"!M19\"))),\"\",INDIRECT(CONCATENATE($B255,\"!M19\")))","v":""},{"$f":"IF(ISERROR(INDIRECT(CONCATENATE($B255,\"!M20\"))),\"\",INDIRECT(CONCATENATE($B255,\"!M20\")))","v":""},{"$f":"IF(ISERROR(INDIRECT(CONCATENATE($B255,\"!M21\"))),\"\",INDIRECT(CONCATENATE($B255,\"!M21\")))","v":""},null,{"$f":"IF(ISERROR(INDIRECT(CONCATENATE($B255,\"!N18\"))),\"\",INDIRECT(CONCATENATE($B255,\"!N18\")))","v":""},{"$f":"IF(ISERROR(INDIRECT(CONCATENATE($B255,\"!N19\"))),\"\",INDIRECT(CONCATENATE($B255,\"!N19\")))","v":""},{"$f":"IF(ISERROR(INDIRECT(CONCATENATE($B255,\"!N20\"))),\"\",INDIRECT(CONCATENATE($B255,\"!N20\")))","v":""},{"$f":"IF(ISERROR(INDIRECT(CONCATENATE($B255,\"!N21\"))),\"\",INDIRECT(CONCATENATE($B255,\"!N21\")))","v":""},null,{"$f":"IF(ISERROR(INDIRECT(CONCATENATE($B255,\"!O18\"))),\"\",INDIRECT(CONCATENATE($B255,\"!O18\")))","v":""},{"$f":"IF(ISERROR(INDIRECT(CONCATENATE($B255,\"!O19\"))),\"\",INDIRECT(CONCATENATE($B255,\"!O19\")))","v":""},{"$f":"IF(ISERROR(INDIRECT(CONCATENATE($B255,\"!O20\"))),\"\",INDIRECT(CONCATENATE($B255,\"!O20\")))","v":""},{"$f":"IF(ISERROR(INDIRECT(CONCATENATE($B255,\"!O21\"))),\"\",INDIRECT(CONCATENATE($B255,\"!O21\")))","v":""},null,{"$f":"IF(ISERROR(INDIRECT(CONCATENATE($B255,\"!P18\"))),\"\",INDIRECT(CONCATENATE($B255,\"!P18\")))","v":""},{"$f":"IF(ISERROR(INDIRECT(CONCATENATE($B255,\"!P19\"))),\"\",INDIRECT(CONCATENATE($B255,\"!P19\")))","v":""},{"$f":"IF(ISERROR(INDIRECT(CONCATENATE($B255,\"!P20\"))),\"\",INDIRECT(CONCATENATE($B255,\"!P20\")))","v":""},{"$f":"IF(ISERROR(INDIRECT(CONCATENATE($B255,\"!P21\"))),\"\",INDIRECT(CONCATENATE($B255,\"!P21\")))","v":""},null,{"$f":"IF(ISERROR(INDIRECT(CONCATENATE($B255,\"!Q18\"))),\"\",INDIRECT(CONCATENATE($B255,\"!Q18\")))","v":""},{"$f":"IF(ISERROR(INDIRECT(CONCATENATE($B255,\"!Q19\"))),\"\",INDIRECT(CONCATENATE($B255,\"!Q19\")))","v":""},{"$f":"IF(ISERROR(INDIRECT(CONCATENATE($B255,\"!Q20\"))),\"\",INDIRECT(CONCATENATE($B255,\"!Q20\")))","v":""},{"$f":"IF(ISERROR(INDIRECT(CONCATENATE($B255,\"!Q21\"))),\"\",INDIRECT(CONCATENATE($B255,\"!Q1\")))","v":""}]
[null,null,null,null,{"$f":"IF(ISERROR(INDIRECT(CONCATENATE($B256,\"!M18\"))),\"\",INDIRECT(CONCATENATE($B256,\"!M18\")))","v":""},{"$f":"IF(ISERROR(INDIRECT(CONCATENATE($B256,\"!M19\"))),\"\",INDIRECT(CONCATENATE($B256,\"!M19\")))","v":""},{"$f":"IF(ISERROR(INDIRECT(CONCATENATE($B256,\"!M20\"))),\"\",INDIRECT(CONCATENATE($B256,\"!M20\")))","v":""},{"$f":"IF(ISERROR(INDIRECT(CONCATENATE($B256,\"!M21\"))),\"\",INDIRECT(CONCATENATE($B256,\"!M21\")))","v":""},null,{"$f":"IF(ISERROR(INDIRECT(CONCATENATE($B256,\"!N18\"))),\"\",INDIRECT(CONCATENATE($B256,\"!N18\")))","v":""},{"$f":"IF(ISERROR(INDIRECT(CONCATENATE($B256,\"!N19\"))),\"\",INDIRECT(CONCATENATE($B256,\"!N19\")))","v":""},{"$f":"IF(ISERROR(INDIRECT(CONCATENATE($B256,\"!N20\"))),\"\",INDIRECT(CONCATENATE($B256,\"!N20\")))","v":""},{"$f":"IF(ISERROR(INDIRECT(CONCATENATE($B256,\"!N21\"))),\"\",INDIRECT(CONCATENATE($B256,\"!N21\")))","v":""},null,{"$f":"IF(ISERROR(INDIRECT(CONCATENATE($B256,\"!O18\"))),\"\",INDIRECT(CONCATENATE($B256,\"!O18\")))","v":""},{"$f":"IF(ISERROR(INDIRECT(CONCATENATE($B256,\"!O19\"))),\"\",INDIRECT(CONCATENATE($B256,\"!O19\")))","v":""},{"$f":"IF(ISERROR(INDIRECT(CONCATENATE($B256,\"!O20\"))),\"\",INDIRECT(CONCATENATE($B256,\"!O20\")))","v":""},{"$f":"IF(ISERROR(INDIRECT(CONCATENATE($B256,\"!O21\"))),\"\",INDIRECT(CONCATENATE($B256,\"!O21\")))","v":""},null,{"$f":"IF(ISERROR(INDIRECT(CONCATENATE($B256,\"!P18\"))),\"\",INDIRECT(CONCATENATE($B256,\"!P18\")))","v":""},{"$f":"IF(ISERROR(INDIRECT(CONCATENATE($B256,\"!P19\"))),\"\",INDIRECT(CONCATENATE($B256,\"!P19\")))","v":""},{"$f":"IF(ISERROR(INDIRECT(CONCATENATE($B256,\"!P20\"))),\"\",INDIRECT(CONCATENATE($B256,\"!P20\")))","v":""},{"$f":"IF(ISERROR(INDIRECT(CONCATENATE($B256,\"!P21\"))),\"\",INDIRECT(CONCATENATE($B256,\"!P21\")))","v":""},null,{"$f":"IF(ISERROR(INDIRECT(CONCATENATE($B256,\"!Q18\"))),\"\",INDIRECT(CONCATENATE($B256,\"!Q18\")))","v":""},{"$f":"IF(ISERROR(INDIRECT(CONCATENATE($B256,\"!Q19\"))),\"\",INDIRECT(CONCATENATE($B256,\"!Q19\")))","v":""},{"$f":"IF(ISERROR(INDIRECT(CONCATENATE($B256,\"!Q20\"))),\"\",INDIRECT(CONCATENATE($B256,\"!Q20\")))","v":""},{"$f":"IF(ISERROR(INDIRECT(CONCATENATE($B256,\"!Q21\"))),\"\",INDIRECT(CONCATENATE($B256,\"!Q1\")))","v":""}]
[null,null,null,null,{"$f":"IF(ISERROR(INDIRECT(CONCATENATE($B257,\"!M18\"))),\"\",INDIRECT(CONCATENATE($B257,\"!M18\")))","v":""},{"$f":"IF(ISERROR(INDIRECT(CONCATENATE($B257,\"!M19\"))),\"\",INDIRECT(CONCATENATE($B257,\"!M19\")))","v":""},{"$f":"IF(ISERROR(INDIRECT(CONCATENATE($B257,\"!M20\"))),\"\",INDIRECT(CONCATENATE($B257,\"!M20\")))","v":""},{"$f":"IF(ISERROR(INDIRECT(CONCATENATE($B257,\"!M21\"))),\"\",INDIRECT(CONCATENATE($B257,\"!M21\")))","v":""},null,{"$f":"IF(ISERROR(INDIRECT(CONCATENATE($B257,\"!N18\"))),\"\",INDIRECT(CONCATENATE($B257,\"!N18\")))","v":""},{"$f":"IF(ISERROR(INDIRECT(CONCATENATE($B257,\"!N19\"))),\"\",INDIRECT(CONCATENATE($B257,\"!N19\")))","v":""},{"$f":"IF(ISERROR(INDIRECT(CONCATENATE($B257,\"!N20\"))),\"\",INDIRECT(CONCATENATE($B257,\"!N20\")))","v":""},{"$f":"IF(ISERROR(INDIRECT(CONCATENATE($B257,\"!N21\"))),\"\",INDIRECT(CONCATENATE($B257,\"!N21\")))","v":""},null,{"$f":"IF(ISERROR(INDIRECT(CONCATENATE($B257,\"!O18\"))),\"\",INDIRECT(CONCATENATE($B257,\"!O18\")))","v":""},{"$f":"IF(ISERROR(INDIRECT(CONCATENATE($B257,\"!O19\"))),\"\",INDIRECT(CONCATENATE($B257,\"!O19\")))","v":""},{"$f":"IF(ISERROR(INDIRECT(CONCATENATE($B257,\"!O20\"))),\"\",INDIRECT(CONCATENATE($B257,\"!O20\")))","v":""},{"$f":"IF(ISERROR(INDIRECT(CONCATENATE($B257,\"!O21\"))),\"\",INDIRECT(CONCATENATE($B257,\"!O21\")))","v":""},null,{"$f":"IF(ISERROR(INDIRECT(CONCATENATE($B257,\"!P18\"))),\"\",INDIRECT(CONCATENATE($B257,\"!P18\")))","v":""},{"$f":"IF(ISERROR(INDIRECT(CONCATENATE($B257,\"!P19\"))),\"\",INDIRECT(CONCATENATE($B257,\"!P19\")))","v":""},{"$f":"IF(ISERROR(INDIRECT(CONCATENATE($B257,\"!P20\"))),\"\",INDIRECT(CONCATENATE($B257,\"!P20\")))","v":""},{"$f":"IF(ISERROR(INDIRECT(CONCATENATE($B257,\"!P21\"))),\"\",INDIRECT(CONCATENATE($B257,\"!P21\")))","v":""},null,{"$f":"IF(ISERROR(INDIRECT(CONCATENATE($B257,\"!Q18\"))),\"\",INDIRECT(CONCATENATE($B257,\"!Q18\")))","v":""},{"$f":"IF(ISERROR(INDIRECT(CONCATENATE($B257,\"!Q19\"))),\"\",INDIRECT(CONCATENATE($B257,\"!Q19\")))","v":""},{"$f":"IF(ISERROR(INDIRECT(CONCATENATE($B257,\"!Q20\"))),\"\",INDIRECT(CONCATENATE($B257,\"!Q20\")))","v":""},{"$f":"IF(ISERROR(INDIRECT(CONCATENATE($B257,\"!Q21\"))),\"\",INDIRECT(CONCATENATE($B257,\"!Q1\")))","v":""}]
[]
[]
[]
[]
[]
[]
[]
[]
[]
[]
[]
[]
[]
[]
[]
[]
[]
[]
[]
[]
[]
[]
[]
[]
[]
[]
[]
[]
[]
[]
[]
[]
[]
[]
[]
[]
[]
[]
[]
["RURAL",null,null,"Poorest",null,null,null,null,"Poor",null,null,null,null,"Middle",null,null,null,null,"Rich",null,null,null,null,"Richest"]
[null,null,null,"Improved","Basic","Limited","Unimproved","Surface water","Improved","Basic","Limited","Unimproved","Surface water","Improved","Basic","Limited","Unimproved","Surface water","Improved","Basic","Limited","Unimproved","Surface water","Improved","Basic","Limited","Unimproved","Surface water"]
["Forecast period:",null,2000,{"$f":"IF((D301+H301)>100,D301*100/(D301+H301),D301)","v":64.614221368674407},{"$f":"D299*AVERAGEIF(E305:E316,\">0\")/100","v":52.938074242466016},{"$f":"D299*(100-AVERAGEIF(E305:E316,\">0\"))/100","v":11.676147126208392},{"$f":"100-(E299+F299+H299)","v":13.872906003740866},{"$f":"IF((D301+H301)>100,H301*100/(D301+H301),H301)","v":21.512872627584727},{"$f":"IF((I301+M301)>100,I301*100/(I301+M301),I301)","v":80.934580145000041},{"$f":"I299*AVERAGEIF(J305:J316,\">0\")/100","v":69.768617441985612},{"$f":"I299*(100-AVERAGEIF(J305:J316,\">0\"))/100","v":11.165962703014438},{"$f":"100-(J299+K299+M299)","v":16.306635819868447},{"$f":"IF((I301+M301)>100,M301*100/(I301+M301),M301)","v":2.7587840351314981},{"$f":"IF((N301+R301)>100,N301*100/(N301+R301),N301)","v":85.304774024984738},{"$f":"N299*AVERAGEIF(O305:O316,\">0\")/100","v":78.362811851587011},{"$f":"N299*(100-AVERAGEIF(O305:O316,\">0\"))/100","v":6.9419621733977293},{"$f":"100-(O299+P299+R299)","v":12.792268346061576},{"$f":"IF((N301+R301)>100,R301*100/(N301+R301),R301)","v":1.9029576289536863},{"$f":"IF((S301+W301)>100,S301*100/(S301+W301),S301)","v":86.097074613846303},{"$f":"S299*AVERAGEIF(T305:T316,\">0\")/100","v":80.160476329485178},{"$f":"S299*(100-AVERAGEIF(T305:T316,\">0\"))/100","v":5.9365982843611302},{"$f":"100-(T299+U299+W299)","v":8.6802031587124873},{"$f":"IF((S301+W301)>100,W301*100/(S301+W301),W301)","v":5.22272222744121},{"$f":"IF((X301+AB301)>100,X301*100/(X301+AB301),X301)","v":96.558481668788602},{"$f":"X299*AVERAGEIF(Y305:Y316,\">0\")/100","v":88.543582004712064},{"$f":"X299*(100-AVERAGEIF(Y305:Y316,\">0\"))/100","v":8.0148996640765358},{"$f":"100-(Y299+Z299+AB299)","v":3.4415183312113982},{"$f":"IF((X301+AB301)>100,AB301*100/(X301+AB301),AB301)","v":0}]
[null,null,2020,{"$f":"IF((D302+H302)>100,D302*100/(D302+H302),D302)","v":52.427487420408625},{"$f":"D300*AVERAGEIF(E305:E316,\">0\")/100","v":42.953550512845624},{"$f":"D300*(100-AVERAGEIF(E305:E316,\">0\"))/100","v":9.4739369075630062},{"$f":"100-(E300+F300+H300)","v":21.841291113131263},{"$f":"IF((D302+H302)>100,H302*100/(D302+H302),H302)","v":25.731221466460113},{"$f":"IF((I302+M302)>100,I302*100/(I302+M302),I302)","v":79.612942532621986},{"$f":"I300*AVERAGEIF(J305:J316,\">0\")/100","v":68.629316678211396},{"$f":"I300*(100-AVERAGEIF(J305:J316,\">0\"))/100","v":10.983625854410596},{"$f":"100-(J300+K300+M300)","v":9.8416188422164907},{"$f":"IF((I302+M302)>100,M302*100/(I302+M302),M302)","v":10.545438625161523},{"$f":"IF((N302+R302)>100,N302*100/(N302+R302),N302)","v":88.855982032801194},{"$f":"N300*AVERAGEIF(O305:O316,\">0\")/100","v":81.62502839389758},{"$f":"N300*(100-AVERAGEIF(O305:O316,\">0\"))/100","v":7.2309536389036175},{"$f":"100-(O300+P300+R300)","v":5.0839208215271015},{"$f":"IF((N302+R302)>100,R302*100/(N302+R302),R302)","v":6.0600971456717048},{"$f":"IF((S302+W302)>100,S302*100/(S302+W302),S302)","v":94.691527738482932},{"$f":"S300*AVERAGEIF(T305:T316,\">0\")/100","v":88.162321448523727},{"$f":"S300*(100-AVERAGEIF(T305:T316,\">0\"))/100","v":6.5292062899592027},{"$f":"100-(T300+U300+W300)","v":1.9443704058253388},{"$f":"IF((S302+W302)>100,W302*100/(S302+W302),W302)","v":3.3641018556917288},{"$f":"IF((X302+AB302)>100,X302*100/(X302+AB302),X302)","v":97.879480304975829},{"$f":"X300*AVERAGEIF(Y305:Y316,\">0\")/100","v":89.754930288672966},{"$f":"X300*(100-AVERAGEIF(Y305:Y316,\">0\"))/100","v":8.1245500163028677},{"$f":"100-(Y300+Z300+AB300)","v":1.3329698901292062},{"$f":"IF((X302+AB302)>100,AB302*100/(X302+AB302),AB302)","v":0.78754980489496518}]
["Regression period:",null,{"$f":"MinRegYear(C299,C305:C316)","v":2001},{"$f":"IF(MAX(C305:C316)-MIN(C305:C316)<5,AVERAGEIF(C305:C316,\">0\",D305:D316),\nIF(FORECAST($C301,D$305:D$316,$C$305:$C$316)<0,0,\nIF(FORECAST($C301,D$305:D$316,$C$305:$C$316)>100,100,\nFORECAST($C301,D$305:D$316,$C$305:$C$316))))","v":64.614221368674407},null,null,null,{"$f":"IF(MAX(C305:C316)-MIN(C305:C316)<5,AVERAGEIF(C305:C316,\">0\",H305:H316),\nIF(FORECAST($C301,H$305:H$316,$C$305:$C$316)<0,0,\nIF(FORECAST($C301,H$305:H$316,$C$305:$C$316)>100,100,\nFORECAST($C301,H$305:H$316,$C$305:$C$316))))","v":21.512872627584727},{"$f":"IF(MAX(C305:C316)-MIN(C305:C316)<5,AVERAGEIF(C305:C316,\">0\",I305:I316),\nIF(FORECAST($C301,I$305:I$316,$C$305:$C$316)<0,0,\nIF(FORECAST($C301,I$305:I$316,$C$305:$C$316)>100,100,\nFORECAST($C301,I$305:I$316,$C$305:$C$316))))","v":80.934580145000041},null,null,null,{"$f":"IF(MAX(C305:C316)-MIN(C305:C316)<5,AVERAGEIF(C305:C316,\">0\",M305:M316),\nIF(FORECAST($C301,M$305:M$316,$C$305:$C$316)<0,0,\nIF(FORECAST($C301,M$305:M$316,$C$305:$C$316)>100,100,\nFORECAST($C301,M$305:M$316,$C$305:$C$316))))","v":2.7587840351314981},{"$f":"IF(MAX(C305:C316)-MIN(C305:C316)<5,AVERAGEIF(C305:C316,\">0\",N305:N316),\nIF(FORECAST($C301,N$305:N$316,$C$305:$C$316)<0,0,\nIF(FORECAST($C301,N$305:N$316,$C$305:$C$316)>100,100,\nFORECAST($C301,N$305:N$316,$C$305:$C$316))))","v":85.304774024984738},null,null,null,{"$f":"IF(MAX(C305:C316)-MIN(C305:C316)<5,AVERAGEIF(C305:C316,\">0\",R305:R316),\nIF(FORECAST($C301,R$305:R$316,$C$305:$C$316)<0,0,\nIF(FORECAST($C301,R$305:R$316,$C$305:$C$316)>100,100,\nFORECAST($C301,R$305:R$316,$C$305:$C$316))))","v":1.9029576289536863},{"$f":"IF(MAX(C305:C316)-MIN(C305:C316)<5,AVERAGEIF(C305:C316,\">0\",S305:S316),\nIF(FORECAST($C301,S$305:S$316,$C$305:$C$316)<0,0,\nIF(FORECAST($C301,S$305:S$316,$C$305:$C$316)>100,100,\nFORECAST($C301,S$305:S$316,$C$305:$C$316))))","v":86.097074613846303},null,null,null,{"$f":"IF(MAX(C305:C316)-MIN(C305:C316)<5,AVERAGEIF(C305:C316,\">0\",W305:W316),\nIF(FORECAST($C301,W$305:W$316,$C$305:$C$316)<0,0,\nIF(FORECAST($C301,W$305:W$316,$C$305:$C$316)>100,100,\nFORECAST($C301,W$305:W$316,$C$305:$C$316))))","v":5.22272222744121},{"$f":"IF(MAX(C305:C316)-MIN(C305:C316)<5,AVERAGEIF(C305:C316,\">0\",X305:X316),\nIF(FORECAST($C301,X$305:X$316,$C$305:$C$316)<0,0,\nIF(FORECAST($C301,X$305:X$316,$C$305:$C$316)>100,100,\nFORECAST($C301,X$305:X$316,$C$305:$C$316))))","v":96.558481668788602},null,null,null,{"$f":"IF(MAX(C305:C316)-MIN(C305:C316)<5,AVERAGEIF(C305:C316,\">0\",AB305:AB316),\nIF(FORECAST($C301,AB$305:AB$316,$C$305:$C$316)<0,0,\nIF(FORECAST($C301,AB$305:AB$316,$C$305:$C$316)>100,100,\nFORECAST($C301,AB$305:AB$316,$C$305:$C$316))))","v":0}]
[null,null,{"$f":"MaxRegYear(C300,C305:C316)","v":2018},{"$f":"IF(MAX(C305:C316)-MIN(C305:C316)<5,AVERAGEIF(C305:C316,\">0\",D305:D316),\nIF(FORECAST($C302,D$305:D$316,$C$305:$C$316)<0,0,\nIF(FORECAST($C302,D$305:D$316,$C$305:$C$316)>100,100,\nFORECAST($C302,D$305:D$316,$C$305:$C$316))))","v":52.427487420408625},null,null,null,{"$f":"IF(MAX(C305:C316)-MIN(C305:C316)<5,AVERAGEIF(C305:C316,\">0\",H305:H316),\nIF(FORECAST($C302,H$305:H$316,$C$305:$C$316)<0,0,\nIF(FORECAST($C302,H$305:H$316,$C$305:$C$316)>100,100,\nFORECAST($C302,H$305:H$316,$C$305:$C$316))))","v":25.731221466460113},{"$f":"IF(MAX(C305:C316)-MIN(C305:C316)<5,AVERAGEIF(C305:C316,\">0\",I305:I316),\nIF(FORECAST($C302,I$305:I$316,$C$305:$C$316)<0,0,\nIF(FORECAST($C302,I$305:I$316,$C$305:$C$316)>100,100,\nFORECAST($C302,I$305:I$316,$C$305:$C$316))))","v":79.612942532621986},null,null,null,{"$f":"IF(MAX(C305:C316)-MIN(C305:C316)<5,AVERAGEIF(C305:C316,\">0\",M305:M316),\nIF(FORECAST($C302,M$305:M$316,$C$305:$C$316)<0,0,\nIF(FORECAST($C302,M$305:M$316,$C$305:$C$316)>100,100,\nFORECAST($C302,M$305:M$316,$C$305:$C$316))))","v":10.545438625161523},{"$f":"IF(MAX(C305:C316)-MIN(C305:C316)<5,AVERAGEIF(C305:C316,\">0\",N305:N316),\nIF(FORECAST($C302,N$305:N$316,$C$305:$C$316)<0,0,\nIF(FORECAST($C302,N$305:N$316,$C$305:$C$316)>100,100,\nFORECAST($C302,N$305:N$316,$C$305:$C$316))))","v":88.855982032801194},null,null,null,{"$f":"IF(MAX(C305:C316)-MIN(C305:C316)<5,AVERAGEIF(C305:C316,\">0\",R305:R316),\nIF(FORECAST($C302,R$305:R$316,$C$305:$C$316)<0,0,\nIF(FORECAST($C302,R$305:R$316,$C$305:$C$316)>100,100,\nFORECAST($C302,R$305:R$316,$C$305:$C$316))))","v":6.0600971456717048},{"$f":"IF(MAX(C305:C316)-MIN(C305:C316)<5,AVERAGEIF(C305:C316,\">0\",S305:S316),\nIF(FORECAST($C302,S$305:S$316,$C$305:$C$316)<0,0,\nIF(FORECAST($C302,S$305:S$316,$C$305:$C$316)>100,100,\nFORECAST($C302,S$305:S$316,$C$305:$C$316))))","v":94.691527738482932},null,null,null,{"$f":"IF(MAX(C305:C316)-MIN(C305:C316)<5,AVERAGEIF(C305:C316,\">0\",W305:W316),\nIF(FORECAST($C302,W$305:W$316,$C$305:$C$316)<0,0,\nIF(FORECAST($C302,W$305:W$316,$C$305:$C$316)>100,100,\nFORECAST($C302,W$305:W$316,$C$305:$C$316))))","v":3.3641018556917288},{"$f":"IF(MAX(C305:C316)-MIN(C305:C316)<5,AVERAGEIF(C305:C316,\">0\",X305:X316),\nIF(FORECAST($C302,X$305:X$316,$C$305:$C$316)<0,0,\nIF(FORECAST($C302,X$305:X$316,$C$305:$C$316)>100,100,\nFORECAST($C302,X$305:X$316,$C$305:$C$316))))","v":97.879480304975829},null,null,null,{"$f":"IF(MAX(C305:C316)-MIN(C305:C316)<5,AVERAGEIF(C305:C316,\">0\",AB305:AB316),\nIF(FORECAST($C302,AB$305:AB$316,$C$305:$C$316)<0,0,\nIF(FORECAST($C302,AB$305:AB$316,$C$305:$C$316)>100,100,\nFORECAST($C302,AB$305:AB$316,$C$305:$C$316))))","v":0.78754980489496518}]
[]
[null,"Survey","Year","Improved","Basic",null,null,"Surface water","Improved","Basic",null,null,"Surface water","Improved","Basic",null,null,"Surface water","Improved","Basic",null,null,"Surface water","Improved","Basic",null,null,"Surface water"]
[null,"WHS03",2003,{"$f":"IF(ISERROR(INDIRECT(CONCATENATE($B305,\"!M16\"))),\"\",INDIRECT(CONCATENATE($B305,\"!M16\")))","v":63.180487962996011},{"$f":"IF(ISERROR(INDIRECT(CONCATENATE($B305,\"!M23\"))),\"\",INDIRECT(CONCATENATE($B305,\"!M23\")))","v":79.547243634931931},null,null,{"$f":"IF(ISERROR(INDIRECT(CONCATENATE($B305,\"!M21\"))),\"\",INDIRECT(CONCATENATE($B305,\"!M21\")))","v":22.009148961570038},{"$f":"IF(ISERROR(INDIRECT(CONCATENATE($B305,\"!N16\"))),\"\",INDIRECT(CONCATENATE($B305,\"!N16\")))","v":80.77909336707323},{"$f":"IF(ISERROR(INDIRECT(CONCATENATE($B305,\"!N23\"))),\"\",INDIRECT(CONCATENATE($B305,\"!N23\")))","v":84.573404059180675},null,null,{"$f":"IF(ISERROR(INDIRECT(CONCATENATE($B305,\"!N21\"))),\"\",INDIRECT(CONCATENATE($B305,\"!N21\")))","v":3.6748610457232065},{"$f":"IF(ISERROR(INDIRECT(CONCATENATE($B305,\"!O16\"))),\"\",INDIRECT(CONCATENATE($B305,\"!O16\")))","v":85.722563202374928},{"$f":"IF(ISERROR(INDIRECT(CONCATENATE($B305,\"!O23\"))),\"\",INDIRECT(CONCATENATE($B305,\"!O23\")))","v":91.926124526338043},null,null,{"$f":"IF(ISERROR(INDIRECT(CONCATENATE($B305,\"!O21\"))),\"\",INDIRECT(CONCATENATE($B305,\"!O21\")))","v":2.3920328662146235},{"$f":"IF(ISERROR(INDIRECT(CONCATENATE($B305,\"!P16\"))),\"\",INDIRECT(CONCATENATE($B305,\"!P16\")))","v":87.108186746156505},{"$f":"IF(ISERROR(INDIRECT(CONCATENATE($B305,\"!P23\"))),\"\",INDIRECT(CONCATENATE($B305,\"!P23\")))","v":91.454771584491382},null,null,{"$f":"IF(ISERROR(INDIRECT(CONCATENATE($B305,\"!P21\"))),\"\",INDIRECT(CONCATENATE($B305,\"!P21\")))","v":5.00406100723536},{"$f":"IF(ISERROR(INDIRECT(CONCATENATE($B305,\"!Q16\"))),\"\",INDIRECT(CONCATENATE($B305,\"!Q16\")))","v":96.713893273045898},{"$f":"IF(ISERROR(INDIRECT(CONCATENATE($B305,\"!Q23\"))),\"\",INDIRECT(CONCATENATE($B305,\"!Q23\")))","v":85.054947454895654},null,null,{"$f":"IF(ISERROR(INDIRECT(CONCATENATE($B305,\"!Q221\"))),\"\",INDIRECT(CONCATENATE($B305,\"!Q21\")))","v":0}]
[null,"DHS16",2016,53.861220826086765,84.311650339548123,null,null,25.234945132474774,79.768429310548839,87.834032458041449,null,null,9.6293616145697669,88.438192855411032,91.798204498050396,null,null,5.5710219084107333,93.680415606172801,94.754752232694401,null,null,3.5827630758975304,97.72406870071849,98.343922275535775,null,null,0.68254316424229666]
[null,null,null,"","",null,null,"","","",null,null,"","","",null,null,"","","",null,null,"","","",null,null,""]
[null,null,null,"","",null,null,"","","",null,null,"","","",null,null,"","","",null,null,"","","",null,null,""]
[null,null,null,"","",null,null,"","","",null,null,"","","",null,null,"","","",null,null,"","","",null,null,""]
[null,null,null,"","",null,null,"","","",null,null,"","","",null,null,"","","",null,null,"","","",null,null,""]
[null,null,null,"","",null,null,"","","",null,null,"","","",null,null,"","","",null,null,"","","",null,null,""]
[null,null,null,"","",null,null,"","","",null,null,"","","",null,null,"","","",null,null,"","","",null,null,""]
[null,null,null,"","",null,null,"","","",null,null,"","","",null,null,"","","",null,null,"","","",null,null,""]
[null,null,null,"","",null,null,"","","",null,null,"","","",null,null,"","","",null,null,"","","",null,null,""]
[null,null,null,"","",null,null,"","","",null,null,"","","",null,null,"","","",null,null,"","","",null,null,""]
[null,null,null,"","",null,null,"","","",null,null,"","","",null,null,"","","",null,null,"","","",null,null,""]
[]
[null,{"$f":"CONCATENATE(\"Rural use of drinking water sources, \",C299,\"–\",C300)","v":"Rural use of drinking water sources, 2000–2020"},null,null,null,null,null,null,null,null,null,null,null,null,null,null,null,null,"Data points used for regression"]

{"sheet":"Sanitation","index":2,"n_rows":318,"n_cols":28,"rows_kept":318,"cut":false,"hidden":false,"merged":[[30,21,30,24],[4,1,4,24],[3,1,3,24],[6,1,6,8],[6,9,6,16],[6,17,6,24],[30,1,31,4],[30,5,30,8],[30,9,30,12],[30,13,30,16],[30,17,30,20],[96,23,96,27],[32,1,33,2],[32,3,33,3],[35,1,36,2],[35,3,36,3],[38,1,39,2],[38,3,39,3],[96,0,97,2],[96,3,96,7],[96,8,96,12],[96,13,96,17],[96,18,96,22],[98,0,99,1],[100,0,101,1],[117,18,117,22],[196,0,197,2],[196,3,196,7],[196,8,196,12],[196,13,196,17],[196,18,196,22],[117,1,117,11],[298,0,299,1],[300,0,301,1],[317,18,317,22],[196,23,196,27],[198,0,199,1],[200,0,201,1],[217,18,217,22],[296,0,297,2],[296,3,296,7],[296,8,296,12],[296,13,296,17],[296,18,296,22],[296,23,296,27],[217,1,217,11],[317,1,317,11]]}
[]
[]
[]
[null,"Summary of trends in use of sanitation facilities by wealth quintile (%)"]
[null,{"$f":"IF(ISERROR(INDIRECT(CONCATENATE($B105,\"!A2\"))),\"\",INDIRECT(CONCATENATE($B105,\"!A2\")))","v":"South Africa"}]
[]
[null,{"$f":"B118","v":"National use of sanitation facilities, 2000–2020"},null,null,null,null,null,null,null,{"$f":"B218","v":"Urban use of sanitation facilities, 2000–2020"},null,null,null,null,null,null,null,{"$f":"B318","v":"Rural use of sanitation facilities, 2000–2020"}]
[]
[]
[]
[]
[]
[]
[]
[]
[]
[]
[]
[]
[]
[]
[]
[]
[]
[]
[]
[]
[]
[]
[]
[null,{"$f":"IF(ISERROR(INDIRECT(CONCATENATE($B105,\"!A2\"))),\"\",INDIRECT(CONCATENATE($B105,\"!A2\")))","v":"South Africa"},null,null,null,"Poorest",null,null,null,"Poor",null,null,null,"Middle",null,null,null,"Rich",null,null,null,"Richest"]
[null,null,null,null,null,"Basic","Limited","Unimproved","Open defecation","Basic","Limited","Unimproved","Open defecation","Basic","Limited","Unimproved","Open defecation","Basic","Limited","Unimproved","Open defecation","Basic","Limited","Unimproved","Open defecation"]
[null,"NATIONAL",null,"Estimate",{"$f":"C99","v":2000},{"$f":"E99","v":32.537140299703182},{"$f":"F99","v":14.182483701694098},29.985158255691658,23.295217742911063,{"$f":"J99","v":55.155722165849141},{"$f":"K99","v":27.177585919498668},14.233390048416581,3.4333018662356096,{"$f":"O99","v":58.740384700417174},{"$f":"P99","v":34.781255037002204},5.4688545192485094,1.0095057433321131,{"$f":"T99","v":83.536186053893815},{"$f":"U99","v":12.432641644246162},4.0311723018600247,0,{"$f":"Y99","v":93.739195227210743},{"$f":"Z99","v":5.0948180857590044},1.1659866870302551,0]
[null,null,null,null,{"$f":"C100","v":2020},{"$f":"E100","v":55.239981803249393},24.078334309349554,15.086910934382104,5.5947729530189463,{"$f":"J100","v":55.656194040981461},27.424189841133533,14.634607579232011,2.2850085386529884,{"$f":"O100","v":55.340337695049293},32.768025082267911,11.083131910032918,0.80850531264987424,{"$f":"T100","v":82.973790501466326},12.348940643566793,4.3708712218398205,0.30639763312706236,{"$f":"Y100","v":94.637201760895948},5.1436256301150181,0.21917260898902668,0]
[]
[null,"URBAN",null,"Estimate",{"$f":"C199","v":2000},{"$f":"E199","v":45.156553179087183},{"$f":"F199","v":47.883606197968987},6.4323484775921429,0.52749214535168676,{"$f":"J199","v":53.014234966284633},{"$f":"K199","v":44.939888195978703},1.7166635934972732,0.3292132442393978,{"$f":"O199","v":79.141497664856956},{"$f":"P199","v":18.920772029228271},1.4709263831969253,0.46680392271784399,{"$f":"T199","v":91.631072634044145},{"$f":"U199","v":8.2126137306849358},0.15631363527091935,0,{"$f":"Y199","v":94.941843954479296},{"$f":"Z199","v":3.8089264035810766},1.2492296419396212,0]
[null,null,null,null,{"$f":"C200","v":2020},{"$f":"E200","v":36.611647491254374},38.822664426521712,20.846315478030135,3.7193726041937794,{"$f":"J200","v":51.052932986241402},43.277302821357168,5.622398373406611,4.7365818994826725E-2,{"$f":"O200","v":79.432281337533965},18.990291203654845,1.4796526326580448,9.7774826153141703E-2,{"$f":"T200","v":91.088072341703267},8.16394626965395,0.74798138864278485,0,{"$f":"Y200","v":96.142889427828976},3.8571105721710239,0,0]
[]
[null,"RURAL",null,"Estimate",{"$f":"C299","v":2000},{"$f":"E299","v":29.386501179579355},{"$f":"F299","v":7.5430624593285396},29.077363279987367,33.99307308110474,{"$f":"J299","v":29.266048265767392},{"$f":"K299","v":6.1030997190147129},39.869695104162929,24.761156911054968,{"$f":"O299","v":51.617291828212629},{"$f":"P299","v":12.955016494295354},25.649637375062639,9.778054302429382,{"$f":"T299","v":61.845529095882831},{"$f":"U299","v":14.498141926526696},22.515409553756399,1.1409194238340774,{"$f":"Y299","v":76.877122084241407},{"$f":"Z299","v":12.300943326325028},9.7580104001114734,1.0639241893220959]
[null,null,null,null,{"$f":"C300","v":2020},{"$f":"E300","v":65.173760847591879},16.72910108551288,10.029133937249753,8.0680041296454874,{"$f":"J300","v":68.911957440951824},14.370800740685475,13.843459254791014,2.8737825635716945,{"$f":"O300","v":65.650803717779951},16.477176831712846,15.761256824657949,2.1107626258492473,{"$f":"T300","v":63.09008097331926},14.789896076224801,17.981765687332569,4.1382572631233643,{"$f":"Y300","v":68.821124541158795},11.011920447634488,19.140041786682644,1.0269132245240646]
[]
[]
[]
[]
[]
[]
[]
[]
[]
[]
[]
[]
[]
[]
[]
[]
[]
[]
[]
[]
[]
[]
[]
[]
[]
[]
[]
[]
[]
[]
[]
[]
[]
[]
[]
[]
[]
[]
[]
[]
[]
[]
[]
[]
[]
[]
[]
[]
[]
[]
[]
[]
[]
[]
[]
[]
["NATIONAL",null,null,"Poorest",null,null,null,null,"Poor",null,null,null,null,"Middle",null,null,null,null,"Rich",null,null,null,null,"Richest"]
[null,null,null,"Improved","Basic","Limited","Unimproved","Open defecation","Improved","Basic","Limited","Unimproved","Open defecation","Improved","Basic","Limited","Unimproved","Open defecation","Improved","Basic","Limited","Unimproved","Open defecation","Improved","Basic","Limited","Unimproved","Open defecation"]
["Forecast period:",null,2000,{"$f":"IF((D101+H101)>100,D101*100/(D101+H101),D101)","v":46.719624001397278},{"$f":"D99*AVERAGEIF(E105:E116,\">0\")/100","v":32.537140299703182},{"$f":"D99*(100-AVERAGEIF(E105:E116,\">0\"))/100","v":14.182483701694098},{"$f":"100-(E99+F99+H99)","v":29.985158255691658},{"$f":"IF((D101+H101)>100,H101*100/(D101+H101),H101)","v":23.295217742911063},{"$f":"IF((I101+M101)>100,I101*100/(I101+M101),I101)","v":82.333308085347809},{"$f":"I99*AVERAGEIF(J105:J116,\">0\")/100","v":55.155722165849141},{"$f":"I99*(100-AVERAGEIF(J105:J116,\">0\"))/100","v":27.177585919498668},{"$f":"100-(J99+K99+M99)","v":14.233390048416581},{"$f":"IF((I101+M101)>100,M101*100/(I101+M101),M101)","v":3.4333018662356096},{"$f":"IF((N101+R101)>100,N101*100/(N101+R101),N101)","v":93.521639737419378},{"$f":"N99*AVERAGEIF(O105:O116,\">0\")/100","v":58.740384700417174},{"$f":"N99*(100-AVERAGEIF(O105:O116,\">0\"))/100","v":34.781255037002204},{"$f":"100-(O99+P99+R99)","v":5.4688545192485094},{"$f":"IF((N101+R101)>100,R101*100/(N101+R101),R101)","v":1.0095057433321131},{"$f":"IF((S101+W101)>100,S101*100/(S101+W101),S101)","v":95.968827698139975},{"$f":"S99*AVERAGEIF(T105:T116,\">0\")/100","v":83.536186053893815},{"$f":"S99*(100-AVERAGEIF(T105:T116,\">0\"))/100","v":12.432641644246162},{"$f":"100-(T99+U99+W99)","v":4.0311723018600247},{"$f":"IF((S101+W101)>100,W101*100/(S101+W101),W101)","v":0},{"$f":"IF((X101+AB101)>100,X101*100/(X101+AB101),X101)","v":98.834013312969745},{"$f":"X99*AVERAGEIF(Y105:Y116,\">0\")/100","v":93.739195227210743},{"$f":"X99*(100-AVERAGEIF(Y105:Y116,\">0\"))/100","v":5.0948180857590044},{"$f":"100-(Y99+Z99+AB99)","v":1.1659866870302551},{"$f":"IF((X101+AB101)>100,AB101*100/(X101+AB101),AB101)","v":0}]
[null,null,2020,{"$f":"IF((D102+H102)>100,D102*100/(D102+H102),D102)","v":79.31831611259895},{"$f":"D100*AVERAGEIF(E105:E116,\">0\")/100","v":55.239981803249393},{"$f":"D100*(100-AVERAGEIF(E105:E116,\">0\"))/100","v":24.078334309349554},{"$f":"100-(E100+F100+H100)","v":15.086910934382104},{"$f":"IF((D102+H102)>100,H102*100/(D102+H102),H102)","v":5.5947729530189463},{"$f":"IF((I102+M102)>100,I102*100/(I102+M102),I102)","v":83.080383882115001},{"$f":"I100*AVERAGEIF(J105:J116,\">0\")/100","v":55.656194040981461},{"$f":"I100*(100-AVERAGEIF(J105:J116,\">0\"))/100","v":27.424189841133533},{"$f":"100-(J100+K100+M100)","v":14.634607579232011},{"$f":"IF((I102+M102)>100,M102*100/(I102+M102),M102)","v":2.2850085386529884},{"$f":"IF((N102+R102)>100,N102*100/(N102+R102),N102)","v":88.108362777317211},{"$f":"N100*AVERAGEIF(O105:O116,\">0\")/100","v":55.340337695049293},{"$f":"N100*(100-AVERAGEIF(O105:O116,\">0\"))/100","v":32.768025082267911},{"$f":"100-(O100+P100+R100)","v":11.083131910032918},{"$f":"IF((N102+R102)>100,R102*100/(N102+R102),R102)","v":0.80850531264987424},{"$f":"IF((S102+W102)>100,S102*100/(S102+W102),S102)","v":95.322731145033117},{"$f":"S100*AVERAGEIF(T105:T116,\">0\")/100","v":82.973790501466326},{"$f":"S100*(100-AVERAGEIF(T105:T116,\">0\"))/100","v":12.348940643566793},{"$f":"100-(T100+U100+W100)","v":4.3708712218398205},{"$f":"IF((S102+W102)>100,W102*100/(S102+W102),W102)","v":0.30639763312706236},{"$f":"IF((X102+AB102)>100,X102*100/(X102+AB102),X102)","v":99.780827391010973},{"$f":"X100*AVERAGEIF(Y105:Y116,\">0\")/100","v":94.637201760895948},{"$f":"X100*(100-AVERAGEIF(Y105:Y116,\">0\"))/100","v":5.1436256301150181},{"$f":"100-(Y100+Z100+AB100)","v":0.21917260898902668},{"$f":"IF((X102+AB102)>100,AB102*100/(X102+AB102),AB102)","v":0}]
["Regression period:",null,{"$f":"MinRegYear(C99,C105:C116)","v":2001},{"$f":"IF(MAX(C105:C116)-MIN(C105:C116)<5,AVERAGEIF(C105:C116,\">0\",D105:D116),\nIF(FORECAST($C101,D$105:D$116,$C$105:$C$116)<0,0,\nIF(FORECAST($C101,D$105:D$116,$C$105:$C$116)>100,100,\nFORECAST($C101,D$105:D$116,$C$105:$C$116))))","v":46.719624001397278},null,null,null,{"$f":"IF(MAX(C105:C116)-MIN(C105:C116)<5,AVERAGEIF(C105:C116,\">0\",H105:H116),\nIF(FORECAST($C101,H$105:H$116,$C$105:$C$116)<0,0,\nIF(FORECAST($C101,H$105:H$116,$C$105:$C$116)>100,100,\nFORECAST($C101,H$105:H$116,$C$105:$C$116))))","v":23.295217742911063},{"$f":"IF(MAX(C105:C116)-MIN(C105:C116)<5,AVERAGEIF(C105:C116,\">0\",I105:I116),\nIF(FORECAST($C101,I$105:I$116,$C$105:$C$116)<0,0,\nIF(FORECAST($C101,I$105:I$116,$C$105:$C$116)>100,100,\nFORECAST($C101,I$105:I$116,$C$105:$C$116))))","v":82.333308085347809},null,null,null,{"$f":"IF(MAX(C105:C116)-MIN(C105:C116)<5,AVERAGEIF(C105:C116,\">0\",M105:M116),\nIF(FORECAST($C101,M$105:M$116,$C$105:$C$116)<0,0,\nIF(FORECAST($C101,M$105:M$116,$C$105:$C$116)>100,100,\nFORECAST($C101,M$105:M$116,$C$105:$C$116))))","v":3.4333018662356096},{"$f":"IF(MAX(C105:C116)-MIN(C105:C116)<5,AVERAGEIF(C105:C116,\">0\",N105:N116),\nIF(FORECAST($C101,N$105:N$116,$C$105:$C$116)<0,0,\nIF(FORECAST($C101,N$105:N$116,$C$105:$C$116)>100,100,\nFORECAST($C101,N$105:N$116,$C$105:$C$116))))","v":93.521639737419378},null,null,null,{"$f":"IF(MAX(C105:C116)-MIN(C105:C116)<5,AVERAGEIF(C105:C116,\">0\",R105:R116),\nIF(FORECAST($C101,R$105:R$116,$C$105:$C$116)<0,0,\nIF(FORECAST($C101,R$105:R$116,$C$105:$C$116)>100,100,\nFORECAST($C101,R$105:R$116,$C$105:$C$116))))","v":1.0095057433321131},{"$f":"IF(MAX(C105:C116)-MIN(C105:C116)<5,AVERAGEIF(C105:C116,\">0\",S105:S116),\nIF(FORECAST($C101,S$105:S$116,$C$105:$C$116)<0,0,\nIF(FORECAST($C101,S$105:S$116,$C$105:$C$116)>100,100,\nFORECAST($C101,S$105:S$116,$C$105:$C$116))))","v":95.968827698139975},null,null,null,{"$f":"IF(MAX(C105:C116)-MIN(C105:C116)<5,AVERAGEIF(C105:C116,\">0\",W105:W116),\nIF(FORECAST($C101,W$105:W$116,$C$105:$C$116)<0,0,\nIF(FORECAST($C101,W$105:W$116,$C$105:$C$116)>100,100,\nFORECAST($C101,W$105:W$116,$C$105:$C$116))))","v":0},{"$f":"IF(MAX(C105:C116)-MIN(C105:C116)<5,AVERAGEIF(C105:C116,\">0\",X105:X116),\nIF(FORECAST($C101,X$105:X$116,$C$105:$C$116)<0,0,\nIF(FORECAST($C101,X$105:X$116,$C$105:$C$116)>100,100,\nFORECAST($C101,X$105:X$116,$C$105:$C$116))))","v":98.834013312969745},null,null,null,{"$f":"IF(MAX(C105:C116)-MIN(C105:C116)<5,AVERAGEIF(C105:C116,\">0\",AB105:AB116),\nIF(FORECAST($C101,AB$105:AB$116,$C$105:$C$116)<0,0,\nIF(FORECAST($C101,AB$105:AB$116,$C$105:$C$116)>100,100,\nFORECAST($C101,AB$105:AB$116,$C$105:$C$116))))","v":0}]
[null,null,{"$f":"MaxRegYear(C100,C105:C116)","v":2018},{"$f":"IF(MAX(C105:C116)-MIN(C105:C116)<5,AVERAGEIF(C105:C116,\">0\",D105:D116),\nIF(FORECAST($C102,D$105:D$116,$C$105:$C$116)<0,0,\nIF(FORECAST($C102,D$105:D$116,$C$105:$C$116)>100,100,\nFORECAST($C102,D$105:D$116,$C$105:$C$116))))","v":79.31831611259895},null,null,null,{"$f":"IF(MAX(C105:C116)-MIN(C105:C116)<5,AVERAGEIF(C105:C116,\">0\",H105:H116),\nIF(FORECAST($C102,H$105:H$116,$C$105:$C$116)<0,0,\nIF(FORECAST($C102,H$105:H$116,$C$105:$C$116)>100,100,\nFORECAST($C102,H$105:H$116,$C$105:$C$116))))","v":5.5947729530189463},{"$f":"IF(MAX(C105:C116)-MIN(C105:C116)<5,AVERAGEIF(C105:C116,\">0\",I105:I116),\nIF(FORECAST($C102,I$105:I$116,$C$105:$C$116)<0,0,\nIF(FORECAST($C102,I$105:I$116,$C$105:$C$116)>100,100,\nFORECAST($C102,I$105:I$116,$C$105:$C$116))))","v":83.080383882115001},null,null,null,{"$f":"IF(MAX(C105:C116)-MIN(C105:C116)<5,AVERAGEIF(C105:C116,\">0\",M105:M116),\nIF(FORECAST($C102,M$105:M$116,$C$105:$C$116)<0,0,\nIF(FORECAST($C102,M$105:M$116,$C$105:$C$116)>100,100,\nFORECAST($C102,M$105:M$116,$C$105:$C$116))))","v":2.2850085386529884},{"$f":"IF(MAX(C105:C116)-MIN(C105:C116)<5,AVERAGEIF(C105:C116,\">0\",N105:N116),\nIF(FORECAST($C102,N$105:N$116,$C$105:$C$116)<0,0,\nIF(FORECAST($C102,N$105:N$116,$C$105:$C$116)>100,100,\nFORECAST($C102,N$105:N$116,$C$105:$C$116))))","v":88.108362777317211},null,null,null,{"$f":"IF(MAX(C105:C116)-MIN(C105:C116)<5,AVERAGEIF(C105:C116,\">0\",R105:R116),\nIF(FORECAST($C102,R$105:R$116,$C$105:$C$116)<0,0,\nIF(FORECAST($C102,R$105:R$116,$C$105:$C$116)>100,100,\nFORECAST($C102,R$105:R$116,$C$105:$C$116))))","v":0.80850531264987424},{"$f":"IF(MAX(C105:C116)-MIN(C105:C116)<5,AVERAGEIF(C105:C116,\">0\",S105:S116),\nIF(FORECAST($C102,S$105:S$116,$C$105:$C$116)<0,0,\nIF(FORECAST($C102,S$105:S$116,$C$105:$C$116)>100,100,\nFORECAST($C102,S$105:S$116,$C$105:$C$116))))","v":95.322731145033117},null,null,null,{"$f":"IF(MAX(C105:C116)-MIN(C105:C116)<5,AVERAGEIF(C105:C116,\">0\",W105:W116),\nIF(FORECAST($C102,W$105:W$116,$C$105:$C$116)<0,0,\nIF(FORECAST($C102,W$105:W$116,$C$105:$C$116)>100,100,\nFORECAST($C102,W$105:W$116,$C$105:$C$116))))","v":0.30639763312706236},{"$f":"IF(MAX(C105:C116)-MIN(C105:C116)<5,AVERAGEIF(C105:C116,\">0\",X105:X116),\nIF(FORECAST($C102,X$105:X$116,$C$105:$C$116)<0,0,\nIF(FORECAST($C102,X$105:X$116,$C$105:$C$116)>100,100,\nFORECAST($C102,X$105:X$116,$C$105:$C$116))))","v":99.780827391010973},null,null,null,{"$f":"IF(MAX(C105:C116)-MIN(C105:C116)<5,AVERAGEIF(C105:C116,\">0\",AB105:AB116),\nIF(FORECAST($C102,AB$105:AB$116,$C$105:$C$116)<0,0,\nIF(FORECAST($C102,AB$105:AB$116,$C$105:$C$116)>100,100,\nFORECAST($C102,AB$105:AB$116,$C$105:$C$116))))","v":0}]
[]
[null,"Survey","Year","Improved","Not shared",null,null,"Open defecation","Improved","Not shared",null,null,"Open defecation","Improved","Not shared",null,null,"Open defecation","Improved","Not shared",null,null,"Open defecation","Improved","Not shared",null,null,"Open defecation"]
[null,"WHS03",2003,{"$f":"IF(ISERROR(INDIRECT(CONCATENATE($B105,\"!C122\"))),\"\",INDIRECT(CONCATENATE($B105,\"!C122\")))","v":50.554764249773811},{"$f":"IF(ISERROR(INDIRECT(CONCATENATE($B105,\"!C129\"))),\"\",INDIRECT(CONCATENATE($B105,\"!C129\")))","v":61.672956923836594},null,null,{"$f":"IF(ISERROR(INDIRECT(CONCATENATE($B105,\"!C127\"))),\"\",INDIRECT(CONCATENATE($B105,\"!C127\")))","v":21.212812473512031},{"$f":"IF(ISERROR(INDIRECT(CONCATENATE($B105,\"!D122\"))),\"\",INDIRECT(CONCATENATE($B105,\"!D122\")))","v":82.4211993555557},{"$f":"IF(ISERROR(INDIRECT(CONCATENATE($B105,\"!D129\"))),\"\",INDIRECT(CONCATENATE($B105,\"!D129\")))","v":65.517116230677416},null,null,{"$f":"IF(ISERROR(INDIRECT(CONCATENATE($B105,\"!D127\"))),\"\",INDIRECT(CONCATENATE($B105,\"!D127\")))","v":3.2982085335788209},{"$f":"IF(ISERROR(INDIRECT(CONCATENATE($B105,\"!E122\"))),\"\",INDIRECT(CONCATENATE($B105,\"!E122\")))","v":92.884783624466166},{"$f":"IF(ISERROR(INDIRECT(CONCATENATE($B105,\"!E129\"))),\"\",INDIRECT(CONCATENATE($B105,\"!E129\")))","v":48.176120733900419},null,null,{"$f":"IF(ISERROR(INDIRECT(CONCATENATE($B105,\"!E127\"))),\"\",INDIRECT(CONCATENATE($B105,\"!E127\")))","v":0.98585863384008166},{"$f":"IF(ISERROR(INDIRECT(CONCATENATE($B105,\"!F122\"))),\"\",INDIRECT(CONCATENATE($B105,\"!F122\")))","v":95.892816338950908},{"$f":"IF(ISERROR(INDIRECT(CONCATENATE($B105,\"!F129\"))),\"\",INDIRECT(CONCATENATE($B105,\"!F129\")))","v":83.776491302989072},null,null,{"$f":"IF(ISERROR(INDIRECT(CONCATENATE($B105,\"!F127\"))),\"\",INDIRECT(CONCATENATE($B105,\"!F127\")))","v":0},{"$f":"IF(ISERROR(INDIRECT(CONCATENATE($B105,\"!G122\"))),\"\",INDIRECT(CONCATENATE($B105,\"!G122\")))","v":98.945403204504004},{"$f":"IF(ISERROR(INDIRECT(CONCATENATE($B105,\"!G129\"))),\"\",INDIRECT(CONCATENATE($B105,\"!G129\")))","v":92.603777641186952},null,null,{"$f":"IF(ISERROR(INDIRECT(CONCATENATE($B105,\"!G2127\"))),\"\",INDIRECT(CONCATENATE($B105,\"!G127\")))","v":0}]
[null,"DHS16",2016,75.483175864222218,77.613867382498029,null,null,7.6771782224179841,82.992492611907082,68.464436189575082,null,null,2.4201018713097522,88.745218890270351,77.442687630329502,null,null,0.83215242214189944,95.398742504222128,90.313758744970755,null,null,0.26554461537678575,99.669437499476714,97.08637473656654,null,null,0]
[null,null,null,"","",null,null,"","","",null,null,"","","",null,null,"","","",null,null,"","","",null,null,""]
[null,null,null,"","",null,null,"","","",null,null,"","","",null,null,"","","",null,null,"","","",null,null,""]
[null,null,null,"","",null,null,"","","",null,null,"","","",null,null,"","","",null,null,"","","",null,null,""]
[null,null,null,"","",null,null,"","","",null,null,"","","",null,null,"","","",null,null,"","","",null,null,""]
[null,null,null,"","",null,null,"","","",null,null,"","","",null,null,"","","",null,null,"","","",null,null,""]
[null,null,null,"","",null,null,"","","",null,null,"","","",null,null,"","","",null,null,"","","",null,null,""]
[null,null,null,"","",null,null,"","","",null,null,"","","",null,null,"","","",null,null,"","","",null,null,""]
[null,null,null,"","",null,null,"","","",null,null,"","","",null,null,"","","",null,null,"","","",null,null,""]
[null,null,null,"","",null,null,"","","",null,null,"","","",null,null,"","","",null,null,"","","",null,null,""]
[null,null,null,"","",null,null,"","","",null,null,"","","",null,null,"","","",null,null,"","","",null,null,""]
[]
[null,{"$f":"CONCATENATE(\"National use of sanitation facilities, \",C99,\"–\",C100)","v":"National use of sanitation facilities, 2000–2020"},null,null,null,null,null,null,null,null,null,null,null,null,null,null,null,null,"Data points used for regression"]
[]
[]
[]
[]
[]
[]
[]
[]
[]
[]
[]
[]
[]
[]
[]
[]
[]
[]
[]
[]
[]
[]
[]
[]
[]
[]
[]
[]
[]
[]
[]
[]
[]
[]
[]
[]
[]
[]
[]
[]
[]
[]
[]
[]
[]
[]
[]
[]
[]
[]
[]
[]
[]
[]
[]
[]
[]
[]
[]
[]
[]
[]
[]
[]
[]
[]
[]
[]
[]
[]
[]
[]
[]
[]
[]
[]
[]
[]
["URBAN",null,null,"Poorest",null,null,null,null,"Poor",null,null,null,null,"Middle",null,null,null,null,"Rich",null,null,null,null,"Richest"]
[null,null,null,"Improved","Basic","Limited","Unimproved","Open defecation","Improved","Basic","Limited","Unimproved","Open defecation","Improved","Basic","Limited","Unimproved","Open defecation","Improved","Basic","Limited","Unimproved","Open defecation","Improved","Basic","Limited","Unimproved","Open defecation"]
["Forecast period:",null,{"$f":"MinBase(C205:C216)","v":2000},{"$f":"IF((D201+H201)>100,D201*100/(D201+H201),D201)","v":93.04015937705617},{"$f":"D199*AVERAGEIF(E205:E216,\">0\")/100","v":45.156553179087183},{"$f":"D199*(100-AVERAGEIF(E205:E216,\">0\"))/100","v":47.883606197968987},{"$f":"100-(E199+F199+H199)","v":6.4323484775921429},{"$f":"IF((D201+H201)>100,H201*100/(D201+H201),H201)","v":0.52749214535168676},{"$f":"IF((I201+M201)>100,I201*100/(I201+M201),I201)","v":97.954123162263329},{"$f":"I199*AVERAGEIF(J205:J216,\">0\")/100","v":53.014234966284633},{"$f":"I199*(100-AVERAGEIF(J205:J216,\">0\"))/100","v":44.939888195978703},{"$f":"100-(J199+K199+M199)","v":1.7166635934972732},{"$f":"IF((I201+M201)>100,M201*100/(I201+M201),M201)","v":0.3292132442393978},{"$f":"IF((N201+R201)>100,N201*100/(N201+R201),N201)","v":98.062269694085231},{"$f":"N199*AVERAGEIF(O205:O216,\">0\")/100","v":79.141497664856956},{"$f":"N199*(100-AVERAGEIF(O205:O216,\">0\"))/100","v":18.920772029228271},{"$f":"100-(O199+P199+R199)","v":1.4709263831969253},{"$f":"IF((N201+R201)>100,R201*100/(N201+R201),R201)","v":0.46680392271784399},{"$f":"IF((S201+W201)>100,S201*100/(S201+W201),S201)","v":99.843686364729081},{"$f":"S199*AVERAGEIF(T205:T216,\">0\")/100","v":91.631072634044145},{"$f":"S199*(100-AVERAGEIF(T205:T216,\">0\"))/100","v":8.2126137306849358},{"$f":"100-(T199+U199+W199)","v":0.15631363527091935},{"$f":"IF((S201+W201)>100,W201*100/(S201+W201),W201)","v":0},{"$f":"IF((X201+AB201)>100,X201*100/(X201+AB201),X201)","v":98.750770358060379},{"$f":"X199*AVERAGEIF(Y205:Y216,\">0\")/100","v":94.941843954479296},{"$f":"X199*(100-AVERAGEIF(Y205:Y216,\">0\"))/100","v":3.8089264035810766},{"$f":"100-(Y199+Z199+AB199)","v":1.2492296419396212},{"$f":"IF((X201+AB201)>100,AB201*100/(X201+AB201),AB201)","v":0}]
[null,null,{"$f":"MaxTarget(C205:C216)","v":2020},{"$f":"IF((D202+H202)>100,D202*100/(D202+H202),D202)","v":75.434311917776085},{"$f":"D200*AVERAGEIF(E205:E216,\">0\")/100","v":36.611647491254374},{"$f":"D200*(100-AVERAGEIF(E205:E216,\">0\"))/100","v":38.822664426521712},{"$f":"100-(E200+F200+H200)","v":20.846315478030135},{"$f":"IF((D202+H202)>100,H202*100/(D202+H202),H202)","v":3.7193726041937794},{"$f":"IF((I202+M202)>100,I202*100/(I202+M202),I202)","v":94.330235807598569},{"$f":"I200*AVERAGEIF(J205:J216,\">0\")/100","v":51.052932986241402},{"$f":"I200*(100-AVERAGEIF(J205:J216,\">0\"))/100","v":43.277302821357168},{"$f":"100-(J200+K200+M200)","v":5.622398373406611},{"$f":"IF((I202+M202)>100,M202*100/(I202+M202),M202)","v":4.7365818994826725E-2},{"$f":"IF((N202+R202)>100,N202*100/(N202+R202),N202)","v":98.422572541188813},{"$f":"N200*AVERAGEIF(O205:O216,\">0\")/100","v":79.432281337533965},{"$f":"N200*(100-AVERAGEIF(O205:O216,\">0\"))/100","v":18.990291203654845},{"$f":"100-(O200+P200+R200)","v":1.4796526326580448},{"$f":"IF((N202+R202)>100,R202*100/(N202+R202),R202)","v":9.7774826153141703E-2},{"$f":"IF((S202+W202)>100,S202*100/(S202+W202),S202)","v":99.252018611357215},{"$f":"S200*AVERAGEIF(T205:T216,\">0\")/100","v":91.088072341703267},{"$f":"S200*(100-AVERAGEIF(T205:T216,\">0\"))/100","v":8.16394626965395},{"$f":"100-(T200+U200+W200)","v":0.74798138864278485},{"$f":"IF((S202+W202)>100,W202*100/(S202+W202),W202)","v":0},{"$f":"IF((X202+AB202)>100,X202*100/(X202+AB202),X202)","v":100},{"$f":"X200*AVERAGEIF(Y205:Y216,\">0\")/100","v":96.142889427828976},{"$f":"X200*(100-AVERAGEIF(Y205:Y216,\">0\"))/100","v":3.8571105721710239},{"$f":"100-(Y200+Z200+AB200)","v":0},{"$f":"IF((X202+AB202)>100,AB202*100/(X202+AB202),AB202)","v":0}]
["Regression period:",null,{"$f":"MinRegYear(C199,C205:C216)","v":2001},{"$f":"IF(MAX(C205:C216)-MIN(C205:C216)<5,AVERAGEIF(C205:C216,\">0\",D205:D216),\nIF(FORECAST($C201,D$205:D$216,$C$205:$C$216)<0,0,\nIF(FORECAST($C201,D$205:D$216,$C$205:$C$216)>100,100,\nFORECAST($C201,D$205:D$216,$C$205:$C$216))))","v":93.04015937705617},null,null,null,{"$f":"IF(MAX(C205:C216)-MIN(C205:C216)<5,AVERAGEIF(C205:C216,\">0\",H205:H216),\nIF(FORECAST($C201,H$205:H$216,$C$205:$C$216)<0,0,\nIF(FORECAST($C201,H$205:H$216,$C$205:$C$216)>100,100,\nFORECAST($C201,H$205:H$216,$C$205:$C$216))))","v":0.52749214535168676},{"$f":"IF(MAX(C205:C216)-MIN(C205:C216)<5,AVERAGEIF(C205:C216,\">0\",I205:I216),\nIF(FORECAST($C201,I$205:I$216,$C$205:$C$216)<0,0,\nIF(FORECAST($C201,I$205:I$216,$C$205:$C$216)>100,100,\nFORECAST($C201,I$205:I$216,$C$205:$C$216))))","v":97.954123162263329},null,null,null,{"$f":"IF(MAX(C205:C216)-MIN(C205:C216)<5,AVERAGEIF(C205:C216,\">0\",M205:M216),\nIF(FORECAST($C201,M$205:M$216,$C$205:$C$216)<0,0,\nIF(FORECAST($C201,M$205:M$216,$C$205:$C$216)>100,100,\nFORECAST($C201,M$205:M$216,$C$205:$C$216))))","v":0.3292132442393978},{"$f":"IF(MAX(C205:C216)-MIN(C205:C216)<5,AVERAGEIF(C205:C216,\">0\",N205:N216),\nIF(FORECAST($C201,N$205:N$216,$C$205:$C$216)<0,0,\nIF(FORECAST($C201,N$205:N$216,$C$205:$C$216)>100,100,\nFORECAST($C201,N$205:N$216,$C$205:$C$216))))","v":98.062269694085231},null,null,null,{"$f":"IF(MAX(C205:C216)-MIN(C205:C216)<5,AVERAGEIF(C205:C216,\">0\",R205:R216),\nIF(FORECAST($C201,R$205:R$216,$C$205:$C$216)<0,0,\nIF(FORECAST($C201,R$205:R$216,$C$205:$C$216)>100,100,\nFORECAST($C201,R$205:R$216,$C$205:$C$216))))","v":0.46680392271784399},{"$f":"IF(MAX(C205:C216)-MIN(C205:C216)<5,AVERAGEIF(C205:C216,\">0\",S205:S216),\nIF(FORECAST($C201,S$205:S$216,$C$205:$C$216)<0,0,\nIF(FORECAST($C201,S$205:S$216,$C$205:$C$216)>100,100,\nFORECAST($C201,S$205:S$216,$C$205:$C$216))))","v":99.843686364729081},null,null,null,{"$f":"IF(MAX(C205:C216)-MIN(C205:C216)<5,AVERAGEIF(C205:C216,\">0\",W205:W216),\nIF(FORECAST($C201,W$205:W$216,$C$205:$C$216)<0,0,\nIF(FORECAST($C201,W$205:W$216,$C$205:$C$216)>100,100,\nFORECAST($C201,W$205:W$216,$C$205:$C$216))))","v":0},{"$f":"IF(MAX(C205:C216)-MIN(C205:C216)<5,AVERAGEIF(C205:C216,\">0\",X205:X216),\nIF(FORECAST($C201,X$205:X$216,$C$205:$C$216)<0,0,\nIF(FORECAST($C201,X$205:X$216,$C$205:$C$216)>100,100,\nFORECAST($C201,X$205:X$216,$C$205:$C$216))))","v":98.750770358060379},null,null,null,{"$f":"IF(MAX(C205:C216)-MIN(C205:C216)<5,AVERAGEIF(C205:C216,\">0\",AB205:AB216),\nIF(FORECAST($C201,AB$205:AB$216,$C$205:$C$216)<0,0,\nIF(FORECAST($C201,AB$205:AB$216,$C$205:$C$216)>100,100,\nFORECAST($C201,AB$205:AB$216,$C$205:$C$216))))","v":0}]
[null,null,{"$f":"MaxRegYear(C200,C205:C216)","v":2018},{"$f":"IF(MAX(C205:C216)-MIN(C205:C216)<5,AVERAGEIF(C205:C216,\">0\",D205:D216),\nIF(FORECAST($C202,D$205:D$216,$C$205:$C$216)<0,0,\nIF(FORECAST($C202,D$205:D$216,$C$205:$C$216)>100,100,\nFORECAST($C202,D$205:D$216,$C$205:$C$216))))","v":75.434311917776085},null,null,null,{"$f":"IF(MAX(C205:C216)-MIN(C205:C216)<5,AVERAGEIF(C205:C216,\">0\",H205:H216),\nIF(FORECAST($C202,H$205:H$216,$C$205:$C$216)<0,0,\nIF(FORECAST($C202,H$205:H$216,$C$205:$C$216)>100,100,\nFORECAST($C202,H$205:H$216,$C$205:$C$216))))","v":3.7193726041937794},{"$f":"IF(MAX(C205:C216)-MIN(C205:C216)<5,AVERAGEIF(C205:C216,\">0\",I205:I216),\nIF(FORECAST($C202,I$205:I$216,$C$205:$C$216)<0,0,\nIF(FORECAST($C202,I$205:I$216,$C$205:$C$216)>100,100,\nFORECAST($C202,I$205:I$216,$C$205:$C$216))))","v":94.330235807598569},null,null,null,{"$f":"IF(MAX(C205:C216)-MIN(C205:C216)<5,AVERAGEIF(C205:C216,\">0\",M205:M216),\nIF(FORECAST($C202,M$205:M$216,$C$205:$C$216)<0,0,\nIF(FORECAST($C202,M$205:M$216,$C$205:$C$216)>100,100,\nFORECAST($C202,M$205:M$216,$C$205:$C$216))))","v":4.7365818994826725E-2},{"$f":"IF(MAX(C205:C216)-MIN(C205:C216)<5,AVERAGEIF(C205:C216,\">0\",N205:N216),\nIF(FORECAST($C202,N$205:N$216,$C$205:$C$216)<0,0,\nIF(FORECAST($C202,N$205:N$216,$C$205:$C$216)>100,100,\nFORECAST($C202,N$205:N$216,$C$205:$C$216))))","v":98.422572541188813},null,null,null,{"$f":"IF(MAX(C205:C216)-MIN(C205:C216)<5,AVERAGEIF(C205:C216,\">0\",R205:R216),\nIF(FORECAST($C202,R$205:R$216,$C$205:$C$216)<0,0,\nIF(FORECAST($C202,R$205:R$216,$C$205:$C$216)>100,100,\nFORECAST($C202,R$205:R$216,$C$205:$C$216))))","v":9.7774826153141703E-2},{"$f":"IF(MAX(C205:C216)-MIN(C205:C216)<5,AVERAGEIF(C205:C216,\">0\",S205:S216),\nIF(FORECAST($C202,S$205:S$216,$C$205:$C$216)<0,0,\nIF(FORECAST($C202,S$205:S$216,$C$205:$C$216)>100,100,\nFORECAST($C202,S$205:S$216,$C$205:$C$216))))","v":99.252018611357215},null,null,null,{"$f":"IF(MAX(C205:C216)-MIN(C205:C216)<5,AVERAGEIF(C205:C216,\">0\",W205:W216),\nIF(FORECAST($C202,W$205:W$216,$C$205:$C$216)<0,0,\nIF(FORECAST($C202,W$205:W$216,$C$205:$C$216)>100,100,\nFORECAST($C202,W$205:W$216,$C$205:$C$216))))","v":0},{"$f":"IF(MAX(C205:C216)-MIN(C205:C216)<5,AVERAGEIF(C205:C216,\">0\",X205:X216),\nIF(FORECAST($C202,X$205:X$216,$C$205:$C$216)<0,0,\nIF(FORECAST($C202,X$205:X$216,$C$205:$C$216)>100,100,\nFORECAST($C202,X$205:X$216,$C$205:$C$216))))","v":100},null,null,null,{"$f":"IF(MAX(C205:C216)-MIN(C205:C216)<5,AVERAGEIF(C205:C216,\">0\",AB205:AB216),\nIF(FORECAST($C202,AB$205:AB$216,$C$205:$C$216)<0,0,\nIF(FORECAST($C202,AB$205:AB$216,$C$205:$C$216)>100,100,\nFORECAST($C202,AB$205:AB$216,$C$205:$C$216))))","v":0}]
[]
[null,"Survey","Year","Improved","Not shared",null,null,"Open defecation","Improved","Not shared",null,null,"Open defecation","Improved","Not shared",null,null,"Open defecation","Improved","Not shared",null,null,"Open defecation","Improved","Not shared",null,null,"Open defecation"]
[null,"WHS03",2003,{"$f":"IF(ISERROR(INDIRECT(CONCATENATE($B205,\"!H122\"))),\"\",INDIRECT(CONCATENATE($B205,\"!H122\")))","v":90.968883205375931},{"$f":"IF(ISERROR(INDIRECT(CONCATENATE($B205,\"!H129\"))),\"\",INDIRECT(CONCATENATE($B205,\"!H129\")))","v":55.374252364889877},null,null,{"$f":"IF(ISERROR(INDIRECT(CONCATENATE($B205,\"!H127\"))),\"\",INDIRECT(CONCATENATE($B205,\"!H127\")))","v":0.9030074934507859},{"$f":"IF(ISERROR(INDIRECT(CONCATENATE($B205,\"!I122\"))),\"\",INDIRECT(CONCATENATE($B205,\"!I122\")))","v":97.527783473479175},{"$f":"IF(ISERROR(INDIRECT(CONCATENATE($B205,\"!I129\"))),\"\",INDIRECT(CONCATENATE($B205,\"!I129\")))","v":41.692902122536132},null,null,{"$f":"IF(ISERROR(INDIRECT(CONCATENATE($B205,\"!I127\"))),\"\",INDIRECT(CONCATENATE($B205,\"!I127\")))","v":0.29605472362238267},{"$f":"IF(ISERROR(INDIRECT(CONCATENATE($B205,\"!J122\"))),\"\",INDIRECT(CONCATENATE($B205,\"!J122\")))","v":98.104658264332713},{"$f":"IF(ISERROR(INDIRECT(CONCATENATE($B205,\"!J129\"))),\"\",INDIRECT(CONCATENATE($B205,\"!J129\")))","v":74.590413873723051},null,null,{"$f":"IF(ISERROR(INDIRECT(CONCATENATE($B205,\"!J127\"))),\"\",INDIRECT(CONCATENATE($B205,\"!J127\")))","v":0.42338873488670503},{"$f":"IF(ISERROR(INDIRECT(CONCATENATE($B205,\"!K122\"))),\"\",INDIRECT(CONCATENATE($B205,\"!K122\")))","v":99.774078393744162},{"$f":"IF(ISERROR(INDIRECT(CONCATENATE($B205,\"!K129\"))),\"\",INDIRECT(CONCATENATE($B205,\"!K129\")))","v":88.09727124437596},null,null,{"$f":"IF(ISERROR(INDIRECT(CONCATENATE($B205,\"!K127\"))),\"\",INDIRECT(CONCATENATE($B205,\"!K127\")))","v":0},{"$f":"IF(ISERROR(INDIRECT(CONCATENATE($B205,\"!L122\"))),\"\",INDIRECT(CONCATENATE($B205,\"!L122\")))","v":98.914158438578383},{"$f":"IF(ISERROR(INDIRECT(CONCATENATE($B205,\"!L129\"))),\"\",INDIRECT(CONCATENATE($B205,\"!L129\")))","v":94.433059356485174},null,null,{"$f":"IF(ISERROR(INDIRECT(CONCATENATE($B205,\"!L2127\"))),\"\",INDIRECT(CONCATENATE($B205,\"!L127\")))","v":0}]
[null,"DHS16",2016,77.505588089455998,41.694698250478162,null,null,3.343857256094724,94.756575496382609,66.550086033185067,null,null,8.052433961183271E-2,98.380183970941331,86.820285494640643,null,null,0.14119001398428227,99.321626582342148,95.451786227952837,null,null,0,99.976180961945374,97.852719499172764,null,null,0]
[null,null,null,"","",null,null,"","","",null,null,"","","",null,null,"","","",null,null,"","","",null,null,""]
[null,null,null,"","",null,null,"","","",null,null,"","","",null,null,"","","",null,null,"","","",null,null,""]
[null,null,null,"","",null,null,"","","",null,null,"","","",null,null,"","","",null,null,"","","",null,null,""]
[null,null,null,"","",null,null,"","","",null,null,"","","",null,null,"","","",null,null,"","","",null,null,""]
[null,null,null,"","",null,null,"","","",null,null,"","","",null,null,"","","",null,null,"","","",null,null,""]
[null,null,null,"","",null,null,"","","",null,null,"","","",null,null,"","","",null,null,"","","",null,null,""]
[null,null,null,"","",null,null,"","","",null,null,"","","",null,null,"","","",null,null,"","","",null,null,""]
[null,null,null,"","",null,null,"","","",null,null,"","","",null,null,"","","",null,null,"","","",null,null,""]
[null,null,null,"","",null,null,"","","",null,null,"","","",null,null,"","","",null,null,"","","",null,null,""]
[null,null,null,"","",null,null,"","","",null,null,"","","",null,null,"","","",null,null,"","","",null,null,""]
[]
[null,{"$f":"CONCATENATE(\"Urban use of sanitation facilities, \",C199,\"–\",C200)","v":"Urban use of sanitation facilities, 2000–2020"},null,null,null,null,null,null,null,null,null,null,null,null,null,null,null,null,"Data points used for regression"]
[]
[]
[]
[]
[]
[]
[]
[]
[]
[]
[]
[]
[]
[]
[]
[]
[]
[]
[]
[]
[]
[]
[]
[]
[]
[]
[]
[]
[]
[]
[]
[]
[]
[]
[]
[]
[]
[]
[]
[]
[]
[]
[]
[]
[]
[]
[]
[]
[]
[]
[]
[]
[]
[]
[]
[]
[]
[]
[]
[]
[]
[]
[]
[]
[]
[]
[]
[]
[]
[]
[]
[]
[]
[]
[]
[]
[]
[]
["RURAL",null,null,"Poorest",null,null,null,null,"Poor",null,null,null,null,"Middle",null,null,null,null,"Rich",null,null,null,null,"Richest"]
[null,null,null,"Improved","Basic","Limited","Unimproved","Open defecation","Improved","Basic","Limited","Unimproved","Open defecation","Improved","Basic","Limited","Unimproved","Open defecation","Improved","Basic","Limited","Unimproved","Open defecation","Improved","Basic","Limited","Unimproved","Open defecation"]
["Forecast period:",null,{"$f":"MinBase(C305:C316)","v":2000},{"$f":"IF((D301+H301)>100,D301*100/(D301+H301),D301)","v":36.929563638907894},{"$f":"D299*AVERAGEIF(E305:E316,\">0\")/100","v":29.386501179579355},{"$f":"D299*(100-AVERAGEIF(E305:E316,\">0\"))/100","v":7.5430624593285396},{"$f":"100-(E299+F299+H299)","v":29.077363279987367},{"$f":"IF((D301+H301)>100,H301*100/(D301+H301),H301)","v":33.99307308110474},{"$f":"IF((I301+M301)>100,I301*100/(I301+M301),I301)","v":35.369147984782103},{"$f":"I299*AVERAGEIF(J305:J316,\">0\")/100","v":29.266048265767392},{"$f":"I299*(100-AVERAGEIF(J305:J316,\">0\"))/100","v":6.1030997190147129},{"$f":"100-(J299+K299+M299)","v":39.869695104162929},{"$f":"IF((I301+M301)>100,M301*100/(I301+M301),M301)","v":24.761156911054968},{"$f":"IF((N301+R301)>100,N301*100/(N301+R301),N301)","v":64.572308322507979},{"$f":"N299*AVERAGEIF(O305:O316,\">0\")/100","v":51.617291828212629},{"$f":"N299*(100-AVERAGEIF(O305:O316,\">0\"))/100","v":12.955016494295354},{"$f":"100-(O299+P299+R299)","v":25.649637375062639},{"$f":"IF((N301+R301)>100,R301*100/(N301+R301),R301)","v":9.778054302429382},{"$f":"IF((S301+W301)>100,S301*100/(S301+W301),S301)","v":76.343671022409524},{"$f":"S299*AVERAGEIF(T305:T316,\">0\")/100","v":61.845529095882831},{"$f":"S299*(100-AVERAGEIF(T305:T316,\">0\"))/100","v":14.498141926526696},{"$f":"100-(T299+U299+W299)","v":22.515409553756399},{"$f":"IF((S301+W301)>100,W301*100/(S301+W301),W301)","v":1.1409194238340774},{"$f":"IF((X301+AB301)>100,X301*100/(X301+AB301),X301)","v":89.178065410566433},{"$f":"X299*AVERAGEIF(Y305:Y316,\">0\")/100","v":76.877122084241407},{"$f":"X299*(100-AVERAGEIF(Y305:Y316,\">0\"))/100","v":12.300943326325028},{"$f":"100-(Y299+Z299+AB299)","v":9.7580104001114734},{"$f":"IF((X301+AB301)>100,AB301*100/(X301+AB301),AB301)","v":1.0639241893220959}]
[null,null,{"$f":"MaxTarget(C305:C316)","v":2020},{"$f":"IF((D302+H302)>100,D302*100/(D302+H302),D302)","v":81.902861933104759},{"$f":"D300*AVERAGEIF(E305:E316,\">0\")/100","v":65.173760847591879},{"$f":"D300*(100-AVERAGEIF(E305:E316,\">0\"))/100","v":16.72910108551288},{"$f":"100-(E300+F300+H300)","v":10.029133937249753},{"$f":"IF((D302+H302)>100,H302*100/(D302+H302),H302)","v":8.0680041296454874},{"$f":"IF((I302+M302)>100,I302*100/(I302+M302),I302)","v":83.282758181637291},{"$f":"I300*AVERAGEIF(J305:J316,\">0\")/100","v":68.911957440951824},{"$f":"I300*(100-AVERAGEIF(J305:J316,\">0\"))/100","v":14.370800740685475},{"$f":"100-(J300+K300+M300)","v":13.843459254791014},{"$f":"IF((I302+M302)>100,M302*100/(I302+M302),M302)","v":2.8737825635716945},{"$f":"IF((N302+R302)>100,N302*100/(N302+R302),N302)","v":82.127980549492804},{"$f":"N300*AVERAGEIF(O305:O316,\">0\")/100","v":65.650803717779951},{"$f":"N300*(100-AVERAGEIF(O305:O316,\">0\"))/100","v":16.477176831712846},{"$f":"100-(O300+P300+R300)","v":15.761256824657949},{"$f":"IF((N302+R302)>100,R302*100/(N302+R302),R302)","v":2.1107626258492473},{"$f":"IF((S302+W302)>100,S302*100/(S302+W302),S302)","v":77.879977049544067},{"$f":"S300*AVERAGEIF(T305:T316,\">0\")/100","v":63.09008097331926},{"$f":"S300*(100-AVERAGEIF(T305:T316,\">0\"))/100","v":14.789896076224801},{"$f":"100-(T300+U300+W300)","v":17.981765687332569},{"$f":"IF((S302+W302)>100,W302*100/(S302+W302),W302)","v":4.1382572631233643},{"$f":"IF((X302+AB302)>100,X302*100/(X302+AB302),X302)","v":79.83304498879329},{"$f":"X300*AVERAGEIF(Y305:Y316,\">0\")/100","v":68.821124541158795},{"$f":"X300*(100-AVERAGEIF(Y305:Y316,\">0\"))/100","v":11.011920447634488},{"$f":"100-(Y300+Z300+AB300)","v":19.140041786682644},{"$f":"IF((X302+AB302)>100,AB302*100/(X302+AB302),AB302)","v":1.0269132245240646}]
["Regression period:",null,{"$f":"MinRegYear(C299,C305:C316)","v":2001},{"$f":"IF(MAX(C305:C316)-MIN(C305:C316)<5,AVERAGEIF(C305:C316,\">0\",D305:D316),\nIF(FORECAST($C301,D$305:D$316,$C$305:$C$316)<0,0,\nIF(FORECAST($C301,D$305:D$316,$C$305:$C$316)>100,100,\nFORECAST($C301,D$305:D$316,$C$305:$C$316))))","v":36.929563638907894},null,null,null,{"$f":"IF(MAX(C305:C316)-MIN(C305:C316)<5,AVERAGEIF(C305:C316,\">0\",H305:H316),\nIF(FORECAST($C301,H$305:H$316,$C$305:$C$316)<0,0,\nIF(FORECAST($C301,H$305:H$316,$C$305:$C$316)>100,100,\nFORECAST($C301,H$305:H$316,$C$305:$C$316))))","v":33.99307308110474},{"$f":"IF(MAX(C305:C316)-MIN(C305:C316)<5,AVERAGEIF(C305:C316,\">0\",I305:I316),\nIF(FORECAST($C301,I$305:I$316,$C$305:$C$316)<0,0,\nIF(FORECAST($C301,I$305:I$316,$C$305:$C$316)>100,100,\nFORECAST($C301,I$305:I$316,$C$305:$C$316))))","v":35.369147984782103},null,null,null,{"$f":"IF(MAX(C305:C316)-MIN(C305:C316)<5,AVERAGEIF(C305:C316,\">0\",M305:M316),\nIF(FORECAST($C301,M$305:M$316,$C$305:$C$316)<0,0,\nIF(FORECAST($C301,M$305:M$316,$C$305:$C$316)>100,100,\nFORECAST($C301,M$305:M$316,$C$305:$C$316))))","v":24.761156911054968},{"$f":"IF(MAX(C305:C316)-MIN(C305:C316)<5,AVERAGEIF(C305:C316,\">0\",N305:N316),\nIF(FORECAST($C301,N$305:N$316,$C$305:$C$316)<0,0,\nIF(FORECAST($C301,N$305:N$316,$C$305:$C$316)>100,100,\nFORECAST($C301,N$305:N$316,$C$305:$C$316))))","v":64.572308322507979},null,null,null,{"$f":"IF(MAX(C305:C316)-MIN(C305:C316)<5,AVERAGEIF(C305:C316,\">0\",R305:R316),\nIF(FORECAST($C301,R$305:R$316,$C$305:$C$316)<0,0,\nIF(FORECAST($C301,R$305:R$316,$C$305:$C$316)>100,100,\nFORECAST($C301,R$305:R$316,$C$305:$C$316))))","v":9.778054302429382},{"$f":"IF(MAX(C305:C316)-MIN(C305:C316)<5,AVERAGEIF(C305:C316,\">0\",S305:S316),\nIF(FORECAST($C301,S$305:S$316,$C$305:$C$316)<0,0,\nIF(FORECAST($C301,S$305:S$316,$C$305:$C$316)>100,100,\nFORECAST($C301,S$305:S$316,$C$305:$C$316))))","v":76.343671022409524},null,null,null,{"$f":"IF(MAX(C305:C316)-MIN(C305:C316)<5,AVERAGEIF(C305:C316,\">0\",W305:W316),\nIF(FORECAST($C301,W$305:W$316,$C$305:$C$316)<0,0,\nIF(FORECAST($C301,W$305:W$316,$C$305:$C$316)>100,100,\nFORECAST($C301,W$305:W$316,$C$305:$C$316))))","v":1.1409194238340774},{"$f":"IF(MAX(C305:C316)-MIN(C305:C316)<5,AVERAGEIF(C305:C316,\">0\",X305:X316),\nIF(FORECAST($C301,X$305:X$316,$C$305:$C$316)<0,0,\nIF(FORECAST($C301,X$305:X$316,$C$305:$C$316)>100,100,\nFORECAST($C301,X$305:X$316,$C$305:$C$316))))","v":89.178065410566433},null,null,null,{"$f":"IF(MAX(C305:C316)-MIN(C305:C316)<5,AVERAGEIF(C305:C316,\">0\",AB305:AB316),\nIF(FORECAST($C301,AB$305:AB$316,$C$305:$C$316)<0,0,\nIF(FORECAST($C301,AB$305:AB$316,$C$305:$C$316)>100,100,\nFORECAST($C301,AB$305:AB$316,$C$305:$C$316))))","v":1.0639241893220959}]
[null,null,{"$f":"MaxRegYear(C300,C305:C316)","v":2018},{"$f":"IF(MAX(C305:C316)-MIN(C305:C316)<5,AVERAGEIF(C305:C316,\">0\",D305:D316),\nIF(FORECAST($C302,D$305:D$316,$C$305:$C$316)<0,0,\nIF(FORECAST($C302,D$305:D$316,$C$305:$C$316)>100,100,\nFORECAST($C302,D$305:D$316,$C$305:$C$316))))","v":81.902861933104759},null,null,null,{"$f":"IF(MAX(C305:C316)-MIN(C305:C316)<5,AVERAGEIF(C305:C316,\">0\",H305:H316),\nIF(FORECAST($C302,H$305:H$316,$C$305:$C$316)<0,0,\nIF(FORECAST($C302,H$305:H$316,$C$305:$C$316)>100,100,\nFORECAST($C302,H$305:H$316,$C$305:$C$316))))","v":8.0680041296454874},{"$f":"IF(MAX(C305:C316)-MIN(C305:C316)<5,AVERAGEIF(C305:C316,\">0\",I305:I316),\nIF(FORECAST($C302,I$305:I$316,$C$305:$C$316)<0,0,\nIF(FORECAST($C302,I$305:I$316,$C$305:$C$316)>100,100,\nFORECAST($C302,I$305:I$316,$C$305:$C$316))))","v":83.282758181637291},null,null,null,{"$f":"IF(MAX(C305:C316)-MIN(C305:C316)<5,AVERAGEIF(C305:C316,\">0\",M305:M316),\nIF(FORECAST($C302,M$305:M$316,$C$305:$C$316)<0,0,\nIF(FORECAST($C302,M$305:M$316,$C$305:$C$316)>100,100,\nFORECAST($C302,M$305:M$316,$C$305:$C$316))))","v":2.8737825635716945},{"$f":"IF(MAX(C305:C316)-MIN(C305:C316)<5,AVERAGEIF(C305:C316,\">0\",N305:N316),\nIF(FORECAST($C302,N$305:N$316,$C$305:$C$316)<0,0,\nIF(FORECAST($C302,N$305:N$316,$C$305:$C$316)>100,100,\nFORECAST($C302,N$305:N$316,$C$305:$C$316))))","v":82.127980549492804},null,null,null,{"$f":"IF(MAX(C305:C316)-MIN(C305:C316)<5,AVERAGEIF(C305:C316,\">0\",R305:R316),\nIF(FORECAST($C302,R$305:R$316,$C$305:$C$316)<0,0,\nIF(FORECAST($C302,R$305:R$316,$C$305:$C$316)>100,100,\nFORECAST($C302,R$305:R$316,$C$305:$C$316))))","v":2.1107626258492473},{"$f":"IF(MAX(C305:C316)-MIN(C305:C316)<5,AVERAGEIF(C305:C316,\">0\",S305:S316),\nIF(FORECAST($C302,S$305:S$316,$C$305:$C$316)<0,0,\nIF(FORECAST($C302,S$305:S$316,$C$305:$C$316)>100,100,\nFORECAST($C302,S$305:S$316,$C$305:$C$316))))","v":77.879977049544067},null,null,null,{"$f":"IF(MAX(C305:C316)-MIN(C305:C316)<5,AVERAGEIF(C305:C316,\">0\",W305:W316),\nIF(FORECAST($C302,W$305:W$316,$C$305:$C$316)<0,0,\nIF(FORECAST($C302,W$305:W$316,$C$305:$C$316)>100,100,\nFORECAST($C302,W$305:W$316,$C$305:$C$316))))","v":4.1382572631233643},{"$f":"IF(MAX(C305:C316)-MIN(C305:C316)<5,AVERAGEIF(C305:C316,\">0\",X305:X316),\nIF(FORECAST($C302,X$305:X$316,$C$305:$C$316)<0,0,\nIF(FORECAST($C302,X$305:X$316,$C$305:$C$316)>100,100,\nFORECAST($C302,X$305:X$316,$C$305:$C$316))))","v":79.83304498879329},null,null,null,{"$f":"IF(MAX(C305:C316)-MIN(C305:C316)<5,AVERAGEIF(C305:C316,\">0\",AB305:AB316),\nIF(FORECAST($C302,AB$305:AB$316,$C$305:$C$316)<0,0,\nIF(FORECAST($C302,AB$305:AB$316,$C$305:$C$316)>100,100,\nFORECAST($C302,AB$305:AB$316,$C$305:$C$316))))","v":1.0269132245240646}]
[]
[null,"Survey","Year","Improved","Not shared",null,null,"Open defecation","Improved","Not shared",null,null,"Open defecation","Improved","Not shared",null,null,"Open defecation","Improved","Not shared",null,null,"Open defecation","Improved","Not shared",null,null,"Open defecation"]
[null,"WHS03",2003,{"$f":"IF(ISERROR(INDIRECT(CONCATENATE($B305,\"!M122\"))),\"\",INDIRECT(CONCATENATE($B305,\"!M122\")))","v":42.220539908813244},{"$f":"IF(ISERROR(INDIRECT(CONCATENATE($B305,\"!M129\"))),\"\",INDIRECT(CONCATENATE($B305,\"!M129\")))","v":64.290227791588379},null,null,{"$f":"IF(ISERROR(INDIRECT(CONCATENATE($B305,\"!M127\"))),\"\",INDIRECT(CONCATENATE($B305,\"!M127\")))","v":30.943064969168582},{"$f":"IF(ISERROR(INDIRECT(CONCATENATE($B305,\"!N122\"))),\"\",INDIRECT(CONCATENATE($B305,\"!N122\")))","v":41.006043302060078},{"$f":"IF(ISERROR(INDIRECT(CONCATENATE($B305,\"!N129\"))),\"\",INDIRECT(CONCATENATE($B305,\"!N129\")))","v":68.333749873748246},null,null,{"$f":"IF(ISERROR(INDIRECT(CONCATENATE($B305,\"!N127\"))),\"\",INDIRECT(CONCATENATE($B305,\"!N127\")))","v":22.186171693703823},{"$f":"IF(ISERROR(INDIRECT(CONCATENATE($B305,\"!O122\"))),\"\",INDIRECT(CONCATENATE($B305,\"!O122\")))","v":66.637681525682567},{"$f":"IF(ISERROR(INDIRECT(CONCATENATE($B305,\"!O129\"))),\"\",INDIRECT(CONCATENATE($B305,\"!O129\")))","v":68.214885465957693},null,null,{"$f":"IF(ISERROR(INDIRECT(CONCATENATE($B305,\"!O127\"))),\"\",INDIRECT(CONCATENATE($B305,\"!O127\")))","v":8.8760199875376173},{"$f":"IF(ISERROR(INDIRECT(CONCATENATE($B305,\"!P122\"))),\"\",INDIRECT(CONCATENATE($B305,\"!P122\")))","v":76.524412907954769},{"$f":"IF(ISERROR(INDIRECT(CONCATENATE($B305,\"!P129\"))),\"\",INDIRECT(CONCATENATE($B305,\"!P129\")))","v":74.157675146653943},null,null,{"$f":"IF(ISERROR(INDIRECT(CONCATENATE($B305,\"!P127\"))),\"\",INDIRECT(CONCATENATE($B305,\"!P127\")))","v":1.4935474049268986},{"$f":"IF(ISERROR(INDIRECT(CONCATENATE($B305,\"!Q122\"))),\"\",INDIRECT(CONCATENATE($B305,\"!Q122\")))","v":88.078651243298836},{"$f":"IF(ISERROR(INDIRECT(CONCATENATE($B305,\"!Q129\"))),\"\",INDIRECT(CONCATENATE($B305,\"!Q129\")))","v":77.465602859885578},null,null,{"$f":"IF(ISERROR(INDIRECT(CONCATENATE($B305,\"!Q2127\"))),\"\",INDIRECT(CONCATENATE($B305,\"!Q127\")))","v":1.0595699581693867}]
[null,"DHS16",2016,76.611885663199132,94.858694014888698,null,null,11.118012241581852,77.645862864360865,97.155383640914707,null,null,5.4487677809224939,80.062607346318146,91.659503940748351,null,null,3.0127969407410178,77.699235163998836,87.861070527048383,null,null,3.7856292820304707,80.932459156060588,94.947022891317303,null,null,1.031267455676774]
[null,null,null,"","",null,null,"","","",null,null,"","","",null,null,"","","",null,null,"","","",null,null,""]
[null,null,null,"","",null,null,"","","",null,null,"","","",null,null,"","","",null,null,"","","",null,null,""]
[null,null,null,"","",null,null,"","","",null,null,"","","",null,null,"","","",null,null,"","","",null,null,""]
[null,null,null,"","",null,null,"","","",null,null,"","","",null,null,"","","",null,null,"","","",null,null,""]
[null,null,null,"","",null,null,"","","",null,null,"","","",null,null,"","","",null,null,"","","",null,null,""]
[null,null,null,"","",null,null,"","","",null,null,"","","",null,null,"","","",null,null,"","","",null,null,""]
[null,null,null,"","",null,null,"","","",null,null,"","","",null,null,"","","",null,null,"","","",null,null,""]
[null,null,null,"","",null,null,"","","",null,null,"","","",null,null,"","","",null,null,"","","",null,null,""]
[null,null,null,"","",null,null,"","","",null,null,"","","",null,null,"","","",null,null,"","","",null,null,""]
[null,null,null,"","",null,null,"","","",null,null,"","","",null,null,"","","",null,null,"","","",null,null,""]
[]
[null,{"$f":"CONCATENATE(\"Rural use of sanitation facilities, \",C299,\"–\",C300)","v":"Rural use of sanitation facilities, 2000–2020"},null,null,null,null,null,null,null,null,null,null,null,null,null,null,null,null,"Data points used for regression"]

{"sheet":"Hygiene","index":3,"n_rows":90,"n_cols":25,"rows_kept":90,"cut":false,"hidden":false,"merged":[[39,22,40,22],[39,23,40,23],[39,24,40,24],[31,4,32,5],[39,16,40,16],[39,17,40,17],[39,18,40,18],[39,19,40,19],[39,20,40,20],[39,21,40,21],[36,24,37,24],[39,6,40,7],[39,8,40,8],[39,9,40,9],[39,10,40,10],[39,11,40,11],[39,12,40,12],[39,13,40,13],[39,14,40,14],[39,15,40,15],[36,18,37,18],[36,12,37,12],[36,13,37,13],[36,14,37,14],[36,15,37,15],[36,16,37,16],[36,17,37,17],[36,19,37,19],[36,20,37,20],[36,21,37,21],[36,22,37,22],[36,23,37,23],[33,20,34,20],[33,21,34,21],[33,22,34,22],[33,23,34,23],[33,24,34,24],[33,15,34,15],[33,16,34,16],[33,17,34,17],[33,18,34,18],[36,6,37,7],[36,8,37,8],[36,9,37,9],[36,10,37,10],[36,11,37,11],[33,10,34,10],[33,11,34,11],[33,12,34,12],[33,13,34,13],[33,14,34,14],[6,1,6,7],[3,1,3,24],[4,1,4,24],[33,1,34,3],[31,6,32,9],[31,10,31,12],[31,13,31,15],[6,10,6,15],[6,18,6,23],[33,19,34,19],[31,16,31,18],[31,19,31,21],[31,22,31,24],[33,6,34,7],[33,8,34,8],[33,9,34,9]]}
[]
[]
[]
[null,"Access to hygiene facilities by wealth quintile (%)"]
[null,{"$f":"IF(ISERROR(INDIRECT(CONCATENATE($E$32,\"!A2\"))),\"\",INDIRECT(CONCATENATE($E$32,\"!A2\")))","v":"South Africa"}]
[]
[null,{"$f":"CONCATENATE(\"National \",IF(ISERROR(INDIRECT(CONCATENATE($E$32,\"!A2\"))),\"\",INDIRECT(CONCATENATE($E$32,\"!A210\"))))","v":"National Access to hygiene facilities "},null,null,null,null,null,null,null,null,{"$f":"CONCATENATE(\"Urban \",IF(ISERROR(INDIRECT(CONCATENATE($E$32,\"!A2\"))),\"\",INDIRECT(CONCATENATE($E$32,\"!A210\"))))","v":"Urban Access to hygiene facilities "},null,null,null,null,null,null,null,{"$f":"CONCATENATE(\"Rural \",IF(ISERROR(INDIRECT(CONCATENATE($E$32,\"!A2\"))),\"\",INDIRECT(CONCATENATE($E$32,\"!A210\"))))","v":"Rural Access to hygiene facilities "}]
[]
[]
[]
[]
[]
[]
[]
[]
[]
[]
[]
[]
[]
[]
[]
[]
[]
[]
[]
[]
[]
[]
[]
[]
[null,null,null,null,{"$f":"INDEX(B88:B100,A88)","v":"DHS16"},null,{"$f":"IF(ISERROR(INDIRECT(CONCATENATE($E$32,\"!A2\"))),\"\",INDIRECT(CONCATENATE($E$32,\"!A2\")))","v":"South Africa"},null,null,null,"Poorest",null,null,"Poor",null,null,"Middle",null,null,"Rich",null,null,"Richest"]
[null,null,null,null,null,null,null,null,null,null,"Basic","Limited","No facility","Basic","Limited","No facility","Basic","Limited","No facility","Basic","Limited","No facility","Basic","Limited","No facility"]
[null,">>>  Select Survey :   ",null,null,null,null,"NATIONAL",null,null,{"$f":"IF(ISERROR(INDIRECT(CONCATENATE(#REF!,\"!A2\"))),\"\",INDIRECT(CONCATENATE(#REF!,\"!A210\")))","v":""},{"$f":"IF(ISERROR(INDIRECT(CONCATENATE($E$32,\"!C222\"))),\"\",INDIRECT(CONCATENATE($E$32,\"!C222\")))","v":4.3439503321594035},{"$f":"IF(ISERROR(INDIRECT(CONCATENATE($E$32,\"!C223\"))),\"\",INDIRECT(CONCATENATE($E$32,\"!C223\")))","v":67.223111916311794},{"$f":"IF(ISERROR(INDIRECT(CONCATENATE($E$32,\"!C224\"))),\"\",INDIRECT(CONCATENATE($E$32,\"!C224\")))","v":28.432937751529018},{"$f":"IF(ISERROR(INDIRECT(CONCATENATE($E$32,\"!D222\"))),\"\",INDIRECT(CONCATENATE($E$32,\"!D222\")))","v":9.7407705191169214},{"$f":"IF(ISERROR(INDIRECT(CONCATENATE($E$32,\"!D223\"))),\"\",INDIRECT(CONCATENATE($E$32,\"!D223\")))","v":73.378353695144455},{"$f":"IF(ISERROR(INDIRECT(CONCATENATE($E$32,\"!D224\"))),\"\",INDIRECT(CONCATENATE($E$32,\"!D224\")))","v":16.880875785738564},{"$f":"IF(ISERROR(INDIRECT(CONCATENATE($E$32,\"!E222\"))),\"\",INDIRECT(CONCATENATE($E$32,\"!E222\")))","v":21.939055790860234},{"$f":"IF(ISERROR(INDIRECT(CONCATENATE($E$32,\"!E223\"))),\"\",INDIRECT(CONCATENATE($E$32,\"!E223\")))","v":67.681492659518412},{"$f":"IF(ISERROR(INDIRECT(CONCATENATE($E$32,\"!E224\"))),\"\",INDIRECT(CONCATENATE($E$32,\"!E224\")))","v":10.379451549621365},{"$f":"IF(ISERROR(INDIRECT(CONCATENATE($E$32,\"!F222\"))),\"\",INDIRECT(CONCATENATE($E$32,\"!F222\")))","v":50.537080582987002},{"$f":"IF(ISERROR(INDIRECT(CONCATENATE($E$32,\"!F223\"))),\"\",INDIRECT(CONCATENATE($E$32,\"!F223\")))","v":44.83600711093046},{"$f":"IF(ISERROR(INDIRECT(CONCATENATE($E$32,\"!F224\"))),\"\",INDIRECT(CONCATENATE($E$32,\"!F224\")))","v":4.6269123060826454},{"$f":"IF(ISERROR(INDIRECT(CONCATENATE($E$32,\"!G222\"))),\"\",INDIRECT(CONCATENATE($E$32,\"!G222\")))","v":79.815928015328154},{"$f":"IF(ISERROR(INDIRECT(CONCATENATE($E$32,\"!G223\"))),\"\",INDIRECT(CONCATENATE($E$32,\"!G223\")))","v":17.726394068126119},{"$f":"IF(ISERROR(INDIRECT(CONCATENATE($E$32,\"!G224\"))),\"\",INDIRECT(CONCATENATE($E$32,\"!G224\")))","v":2.4576779165457854}]
[]
[]
[null,null,null,null,null,null,"URBAN",null,null,{"$f":"IF(ISERROR(INDIRECT(CONCATENATE(#REF!,\"!A2\"))),\"\",INDIRECT(CONCATENATE(#REF!,\"!A210\")))","v":""},{"$f":"IF(ISERROR(INDIRECT(CONCATENATE($E$32,\"!H222\"))),\"\",INDIRECT(CONCATENATE($E$32,\"!H222\")))","v":7.2848820303462762},{"$f":"IF(ISERROR(INDIRECT(CONCATENATE($E$32,\"!H223\"))),\"\",INDIRECT(CONCATENATE($E$32,\"!H223\")))","v":66.074326093145316},{"$f":"IF(ISERROR(INDIRECT(CONCATENATE($E$32,\"!H224\"))),\"\",INDIRECT(CONCATENATE($E$32,\"!H224\")))","v":26.640791876508523},{"$f":"IF(ISERROR(INDIRECT(CONCATENATE($E$32,\"!I222\"))),\"\",INDIRECT(CONCATENATE($E$32,\"!I222\")))","v":27.711705039486738},{"$f":"IF(ISERROR(INDIRECT(CONCATENATE($E$32,\"!I223\"))),\"\",INDIRECT(CONCATENATE($E$32,\"!I223\")))","v":61.362934304316497},{"$f":"IF(ISERROR(INDIRECT(CONCATENATE($E$32,\"!I224\"))),\"\",INDIRECT(CONCATENATE($E$32,\"!I224\")))","v":10.925360656196915},{"$f":"IF(ISERROR(INDIRECT(CONCATENATE($E$32,\"!J222\"))),\"\",INDIRECT(CONCATENATE($E$32,\"!J222\")))","v":44.687193431999731},{"$f":"IF(ISERROR(INDIRECT(CONCATENATE($E$32,\"!J223\"))),\"\",INDIRECT(CONCATENATE($E$32,\"!J223\")))","v":48.897218147983232},{"$f":"IF(ISERROR(INDIRECT(CONCATENATE($E$32,\"!J224\"))),\"\",INDIRECT(CONCATENATE($E$32,\"!J224\")))","v":6.4155884200171158},{"$f":"IF(ISERROR(INDIRECT(CONCATENATE($E$32,\"!K222\"))),\"\",INDIRECT(CONCATENATE($E$32,\"!K222\")))","v":70.555185099732796},{"$f":"IF(ISERROR(INDIRECT(CONCATENATE($E$32,\"!K223\"))),\"\",INDIRECT(CONCATENATE($E$32,\"!K223\")))","v":26.817200575185517},{"$f":"IF(ISERROR(INDIRECT(CONCATENATE($E$32,\"!K224\"))),\"\",INDIRECT(CONCATENATE($E$32,\"!K224\")))","v":2.6276143250817365},{"$f":"IF(ISERROR(INDIRECT(CONCATENATE($E$32,\"!L222\"))),\"\",INDIRECT(CONCATENATE($E$32,\"!L222\")))","v":84.262802275787493},{"$f":"IF(ISERROR(INDIRECT(CONCATENATE($E$32,\"!L223\"))),\"\",INDIRECT(CONCATENATE($E$32,\"!L223\")))","v":13.583563043697383},{"$f":"IF(ISERROR(INDIRECT(CONCATENATE($E$32,\"!L224\"))),\"\",INDIRECT(CONCATENATE($E$32,\"!L224\")))","v":2.1536346805151401}]
[]
[]
[null,null,null,null,null,null,"RURAL",null,null,{"$f":"IF(ISERROR(INDIRECT(CONCATENATE(#REF!,\"!A2\"))),\"\",INDIRECT(CONCATENATE(#REF!,\"!A210\")))","v":""},{"$f":"IF(ISERROR(INDIRECT(CONCATENATE($E$32,\"!M222\"))),\"\",INDIRECT(CONCATENATE($E$32,\"!M222\")))","v":4.6531895644275307},{"$f":"IF(ISERROR(INDIRECT(CONCATENATE($E$32,\"!M223\"))),\"\",INDIRECT(CONCATENATE($E$32,\"!M223\")))","v":61.803173238523293},{"$f":"IF(ISERROR(INDIRECT(CONCATENATE($E$32,\"!M224\"))),\"\",INDIRECT(CONCATENATE($E$32,\"!M224\")))","v":33.543637197049136},{"$f":"IF(ISERROR(INDIRECT(CONCATENATE($E$32,\"!N222\"))),\"\",INDIRECT(CONCATENATE($E$32,\"!N222\")))","v":4.0093453441798124},{"$f":"IF(ISERROR(INDIRECT(CONCATENATE($E$32,\"!N223\"))),\"\",INDIRECT(CONCATENATE($E$32,\"!N223\")))","v":76.127113970010356},{"$f":"IF(ISERROR(INDIRECT(CONCATENATE($E$32,\"!N224\"))),\"\",INDIRECT(CONCATENATE($E$32,\"!N224\")))","v":19.863540685809763},{"$f":"IF(ISERROR(INDIRECT(CONCATENATE($E$32,\"!O222\"))),\"\",INDIRECT(CONCATENATE($E$32,\"!O222\")))","v":3.8810731101498961},{"$f":"IF(ISERROR(INDIRECT(CONCATENATE($E$32,\"!O223\"))),\"\",INDIRECT(CONCATENATE($E$32,\"!O223\")))","v":82.596275805066341},{"$f":"IF(ISERROR(INDIRECT(CONCATENATE($E$32,\"!O224\"))),\"\",INDIRECT(CONCATENATE($E$32,\"!O224\")))","v":13.522651084783558},{"$f":"IF(ISERROR(INDIRECT(CONCATENATE($E$32,\"!P222\"))),\"\",INDIRECT(CONCATENATE($E$32,\"!P222\")))","v":7.8942572429017766},{"$f":"IF(ISERROR(INDIRECT(CONCATENATE($E$32,\"!P223\"))),\"\",INDIRECT(CONCATENATE($E$32,\"!P223\")))","v":80.819219832876982},{"$f":"IF(ISERROR(INDIRECT(CONCATENATE($E$32,\"!P224\"))),\"\",INDIRECT(CONCATENATE($E$32,\"!P224\")))","v":11.286522924221213},{"$f":"IF(ISERROR(INDIRECT(CONCATENATE($E$32,\"!Q222\"))),\"\",INDIRECT(CONCATENATE($E$32,\"!Q222\")))","v":28.330774769220824},{"$f":"IF(ISERROR(INDIRECT(CONCATENATE($E$32,\"!Q223\"))),\"\",INDIRECT(CONCATENATE($E$32,\"!Q223\")))","v":63.012895217227957},{"$f":"IF(ISERROR(INDIRECT(CONCATENATE($E$32,\"!Q224\"))),\"\",INDIRECT(CONCATENATE($E$32,\"!Q224\")))","v":8.6563300135510879}]
[]
[]
[]
[]
[]
[]
[]
[]
[]
[]
[]
[]
[]
[]
[]
[]
[]
[]
[]
[]
[]
[]
[]
[]
[]
[]
[]
[]
[]
[]
[]
[]
[]
[]
[]
[]
[]
[]
[]
[]
[]
[]
[]
[]
[]
[]
[]
[2,"WHS03"]
[null,"DHS16"]
[null,"Template"]

{"sheet":"WHS03","index":4,"n_rows":1072,"n_cols":69,"rows_kept":1072,"cut":false,"hidden":false,"merged":[[276,52,283,52],[338,54,338,58],[338,59,338,63],[338,64,338,68],[340,52,341,52],[342,52,343,52],[344,52,345,52],[346,52,347,52],[348,52,349,52],[350,52,351,52],[352,52,353,52],[152,52,160,52],[132,59,132,63],[132,64,132,68],[134,52,138,52],[219,54,219,58],[219,59,219,63],[219,64,219,68],[221,52,223,52],[224,52,225,52],[226,52,229,52],[258,54,258,58],[258,59,258,63],[258,64,258,68],[260,52,262,52],[263,52,266,52],[267,52,269,52],[270,52,272,52],[273,52,275,52],[49,52,51,52],[52,0,54,0],[52,52,54,52],[139,0,142,0],[139,52,142,52],[143,0,146,0],[143,52,146,52],[147,0,149,0],[147,52,149,52],[150,0,151,0],[150,52,151,52],[13,54,13,58],[13,59,13,63],[13,64,13,68],[15,52,16,52],[17,52,20,52],[21,52,22,52],[26,54,26,58],[26,59,26,63],[26,64,26,68],[28,52,29,52],[55,54,55,58],[55,59,55,63],[55,64,55,68],[119,54,119,58],[119,59,119,63],[119,64,119,68],[121,52,122,52],[123,52,126,52],[127,52,128,52],[132,54,132,58],[30,52,31,52],[32,0,33,0],[32,52,33,52],[34,52,35,52],[36,52,37,52],[38,0,39,0],[38,52,39,52],[40,52,41,52],[42,52,43,52],[44,52,45,52],[46,0,48,0],[46,52,48,52],[13,12,13,16],[15,0,16,0],[17,0,20,0],[21,0,22,0],[23,0,25,0],[26,2,26,6],[26,7,26,11],[26,12,26,16],[13,2,13,6],[13,7,13,11],[55,12,55,16],[57,0,64,0],[107,0,107,1],[44,0,45,0],[55,2,55,6],[55,7,55,11],[28,0,29,0],[34,0,35,0],[36,0,37,0],[40,0,41,0],[42,0,43,0],[132,12,132,16],[134,0,138,0],[152,0,159,0],[123,0,126,0],[127,0,128,0],[129,0,131,0],[132,2,132,6],[132,7,132,11],[119,2,119,6],[119,7,119,11],[119,12,119,16],[121,0,122,0],[30,0,31,0],[49,0,51,0],[1024,0,1024,2],[1025,0,1025,1],[1030,0,1031,0],[1032,0,1032,2],[1033,0,1033,2],[219,2,219,6],[219,7,219,11],[219,12,219,16],[221,0,223,0],[207,0,207,1],[404,2,404,3],[404,7,404,8],[404,12,404,13],[405,2,405,3],[405,7,405,8],[405,12,405,13],[400,2,401,3],[400,7,401,8],[400,12,401,13],[401,1,444,1],[402,2,402,3],[402,7,402,8],[402,12,402,13],[403,2,403,3],[403,7,403,8],[403,12,403,13],[398,2,398,5],[398,7,398,10],[398,12,398,15],[399,2,399,4],[399,7,399,9],[399,12,399,14],[410,2,410,3],[410,7,410,8],[410,12,410,13],[411,2,411,3],[411,7,411,8],[411,12,411,13],[408,2,408,3],[408,7,408,8],[408,12,408,13],[409,2,409,3],[409,7,409,8],[409,12,409,13],[406,2,406,3],[406,7,406,8],[406,12,406,13],[407,2,407,3],[407,7,407,8],[407,12,407,13],[416,2,416,3],[416,7,416,8],[416,12,416,13],[417,2,417,3],[417,7,417,8],[417,12,417,13],[414,2,414,3],[414,7,414,8],[414,12,414,13],[415,2,415,3],[415,7,415,8],[415,12,415,13],[412,2,412,3],[412,7,412,8],[412,12,412,13],[413,2,413,3],[413,7,413,8],[413,12,413,13],[422,2,422,3],[422,7,422,8],[422,12,422,13],[423,2,423,3],[423,7,423,8],[423,12,423,13],[420,2,420,3],[420,7,420,8],[420,12,420,13],[421,2,421,3],[421,7,421,8],[421,12,421,13],[418,2,418,3],[418,7,418,8],[418,12,418,13],[419,2,419,3],[419,7,419,8],[419,12,419,13],[428,2,428,3],[428,7,428,8],[428,12,428,13],[429,2,429,3],[429,7,429,8],[429,12,429,13],[426,2,426,3],[426,7,426,8],[426,12,426,13],[427,2,427,3],[427,7,427,8],[427,12,427,13],[424,2,424,3],[424,7,424,8],[424,12,424,13],[425,2,425,3],[425,7,425,8],[425,12,425,13],[434,2,434,3],[434,7,434,8],[434,12,434,13],[435,2,435,3],[435,7,435,8],[435,12,435,13],[432,2,432,3],[432,7,432,8],[432,12,432,13],[433,2,433,3],[433,7,433,8],[433,12,433,13],[430,2,430,3],[430,7,430,8],[430,12,430,13],[431,2,431,3],[431,7,431,8],[431,12,431,13],[440,2,440,3],[440,7,440,8],[440,12,440,13],[441,2,441,3],[441,7,441,8],[441,12,441,13],[438,2,438,3],[438,7,438,8],[438,12,438,13],[439,2,439,3],[439,7,439,8],[439,12,439,13],[436,2,436,3],[436,7,436,8],[436,12,436,13],[437,2,437,3],[437,7,437,8],[437,12,437,13],[446,2,446,3],[446,7,446,8],[446,12,446,13],[447,2,447,3],[447,7,447,8],[447,12,447,13],[444,2,444,3],[444,7,444,8],[444,12,444,13],[445,2,445,3],[445,7,445,8],[445,12,445,13],[442,2,442,3],[442,7,442,8],[442,12,442,13],[443,2,443,3],[443,7,443,8],[443,12,443,13],[452,2,452,3],[452,7,452,8],[452,12,452,13],[453,2,453,3],[453,7,453,9],[453,12,453,13],[450,2,450,3],[450,7,450,8],[450,12,450,13],[451,2,451,3],[451,7,451,8],[451,12,451,13],[448,2,448,3],[448,7,448,8],[448,12,448,13],[449,2,449,3],[449,7,449,8],[449,12,449,13],[458,2,458,3],[458,7,458,8],[458,12,458,13],[459,2,459,3],[459,7,459,8],[459,12,459,13],[456,2,456,3],[456,7,456,8],[456,12,456,13],[457,2,457,4],[457,7,457,8],[457,12,457,14],[454,2,454,3],[454,7,454,8],[454,12,454,13],[455,2,455,3],[455,7,455,8],[455,12,455,13],[464,2,464,3],[464,7,464,8],[464,12,464,13],[465,2,465,3],[465,7,465,8],[465,12,465,13],[462,2,462,3],[462,7,462,8],[462,12,462,13],[463,2,463,3],[463,7,463,8],[463,12,463,13],[460,2,460,3],[460,7,460,8],[460,12,460,13],[461,2,461,3],[461,7,461,8],[461,12,461,13],[470,2,470,3],[470,7,470,8],[470,12,470,13],[471,2,471,3],[471,7,471,8],[471,12,471,13],[468,2,468,3],[468,7,468,8],[468,12,468,13],[469,2,469,3],[469,7,469,8],[469,12,469,13],[466,2,466,3],[466,7,466,8],[466,12,466,13],[467,2,467,3],[467,7,467,8],[467,12,467,13],[476,2,476,3],[476,7,476,8],[476,12,476,13],[477,2,477,3],[477,7,477,8],[477,12,477,13],[474,2,474,3],[474,7,474,8],[474,12,474,13],[475,2,475,3],[475,7,475,8],[475,12,475,13],[472,2,472,3],[472,7,472,8],[472,12,472,13],[473,2,473,3],[473,7,473,8],[473,12,473,13],[482,2,482,3],[482,7,482,8],[482,12,482,13],[483,2,483,3],[483,7,483,8],[483,12,483,13],[480,2,480,3],[480,7,480,8],[480,12,480,13],[481,2,481,3],[481,7,481,8],[481,12,481,13],[478,2,478,3],[478,7,478,8],[478,12,478,13],[479,2,479,3],[479,7,479,8],[479,12,479,13],[488,2,488,3],[488,7,488,8],[488,12,488,13],[489,2,489,3],[489,7,489,8],[489,12,489,13],[486,2,486,3],[486,7,486,8],[486,12,486,13],[487,2,487,3],[487,7,487,8],[487,12,487,13],[484,2,484,3],[484,7,484,8],[484,12,484,13],[485,2,485,3],[485,7,485,8],[485,12,485,13],[494,2,494,3],[494,7,494,8],[494,12,494,13],[495,2,495,3],[495,7,495,8],[495,12,495,13],[492,2,492,3],[492,7,492,8],[492,12,492,13],[493,2,493,3],[493,7,493,8],[493,12,493,13],[490,2,490,3],[490,7,490,8],[490,12,490,13],[491,2,491,3],[491,7,491,8],[491,12,491,13],[500,2,500,3],[500,7,500,8],[500,12,500,13],[501,2,501,3],[501,7,501,8],[501,12,501,13],[498,2,498,3],[498,7,498,8],[498,12,498,13],[499,2,499,3],[499,7,499,8],[499,12,499,13],[496,2,496,3],[496,7,496,8],[496,12,496,13],[497,2,497,3],[497,7,497,8],[497,12,497,13],[506,2,506,3],[506,7,507,8],[506,9,506,11],[506,12,506,13],[507,2,507,3],[507,12,507,13],[504,2,504,3],[504,7,504,8],[504,12,504,13],[505,2,505,3],[505,7,505,11],[505,12,505,13],[502,2,502,3],[502,7,502,8],[502,12,502,13],[503,2,503,3],[503,7,503,8],[503,12,503,13],[512,2,512,3],[512,7,513,8],[512,12,512,13],[513,2,513,6],[513,12,513,16],[514,2,515,3],[514,4,514,6],[514,7,514,8],[514,12,515,13],[514,14,514,16],[510,2,510,3],[510,7,510,8],[510,12,510,13],[511,2,511,3],[511,7,511,9],[511,12,511,13],[508,2,508,3],[508,7,508,8],[508,12,508,13],[509,2,509,3],[509,7,509,8],[509,12,509,13],[520,2,521,3],[520,7,520,8],[520,12,521,13],[521,7,521,8],[522,2,522,3],[522,7,522,8],[522,12,522,13],[518,2,518,3],[518,7,518,8],[518,12,518,13],[519,2,519,4],[519,7,519,8],[519,12,519,14],[515,7,515,8],[516,2,516,3],[516,7,516,8],[516,12,516,13],[517,2,517,3],[517,7,517,8],[517,12,517,13],[527,2,527,3],[527,7,527,8],[527,12,527,13],[528,2,528,3],[528,7,528,8],[528,12,528,13],[525,2,525,3],[525,7,525,8],[525,12,525,13],[526,2,526,3],[526,7,526,8],[526,12,526,13],[523,2,523,3],[523,7,523,8],[523,12,523,13],[524,2,524,3],[524,7,524,8],[524,12,524,13],[533,2,533,3],[533,7,533,8],[533,12,533,13],[534,2,534,3],[534,7,534,8],[534,12,534,13],[531,2,531,3],[531,7,531,8],[531,12,531,13],[532,2,532,3],[532,7,532,8],[532,12,532,13],[529,2,529,3],[529,7,529,8],[529,12,529,13],[530,2,530,3],[530,7,530,8],[530,12,530,13],[539,2,539,3],[539,7,539,8],[539,12,539,13],[540,2,540,3],[540,7,540,8],[540,12,540,13],[537,2,537,3],[537,7,537,8],[537,12,537,13],[538,2,538,3],[538,7,538,8],[538,12,538,13],[535,2,535,3],[535,7,535,8],[535,12,535,13],[536,2,536,3],[536,7,536,8],[536,12,536,13],[545,2,545,3],[545,7,545,8],[545,12,545,13],[546,2,546,3],[546,7,546,8],[546,12,546,13],[543,2,543,3],[543,7,543,8],[543,12,543,13],[544,2,544,3],[544,7,544,8],[544,12,544,13],[541,2,541,3],[541,7,541,8],[541,12,541,13],[542,2,542,3],[542,7,542,8],[542,12,542,13],[551,2,551,3],[551,7,551,8],[551,12,551,13],[552,2,552,3],[552,7,552,8],[552,12,552,13],[549,2,549,3],[549,7,549,8],[549,12,549,13],[550,2,550,3],[550,7,550,8],[550,12,550,13],[547,2,547,3],[547,7,547,8],[547,12,547,13],[548,2,548,3],[548,7,548,8],[548,12,548,13],[557,2,557,3],[557,7,557,8],[557,12,557,13],[558,2,558,3],[558,7,558,8],[558,12,558,13],[555,2,555,3],[555,7,555,8],[555,12,555,13],[556,2,556,3],[556,7,556,8],[556,12,556,13],[553,2,553,3],[553,7,553,8],[553,12,553,13],[554,2,554,3],[554,7,554,8],[554,12,554,13],[563,2,563,3],[563,7,563,8],[563,12,563,13],[564,2,564,3],[564,7,564,9],[564,12,564,13],[561,2,561,3],[561,7,561,8],[561,12,561,13],[562,2,562,3],[562,7,562,8],[562,12,562,13],[559,2,559,3],[559,7,559,8],[559,12,559,13],[560,2,560,3],[560,7,560,8],[560,12,560,13],[569,2,569,3],[569,7,569,8],[569,12,569,13],[570,2,570,3],[570,7,570,8],[570,12,570,13],[567,2,567,3],[567,7,567,8],[567,12,567,13],[568,2,568,3],[568,7,568,8],[568,12,568,13],[565,2,565,3],[565,7,565,8],[565,12,565,13],[566,2,566,3],[566,7,566,8],[566,12,566,13],[575,2,575,3],[575,7,575,8],[575,12,575,13],[576,2,576,4],[576,7,576,8],[576,12,576,14],[573,2,573,3],[573,7,573,8],[573,12,573,13],[574,2,574,3],[574,7,574,8],[574,12,574,13],[571,2,571,3],[571,7,571,8],[571,12,571,13],[572,2,572,3],[572,7,572,8],[572,12,572,13],[581,2,581,3],[581,7,581,8],[581,12,581,13],[582,2,582,3],[582,7,582,8],[582,12,582,13],[579,2,579,3],[579,7,579,8],[579,12,579,13],[580,2,580,3],[580,7,580,8],[580,12,580,13],[577,2,577,3],[577,7,577,8],[577,12,577,13],[578,2,578,3],[578,7,578,8],[578,12,578,13],[587,2,587,3],[587,7,587,8],[587,12,587,13],[588,2,588,3],[588,7,588,8],[588,12,588,13],[585,2,585,3],[585,7,585,8],[585,12,585,13],[586,2,586,3],[586,7,586,8],[586,12,586,13],[583,2,583,3],[583,7,583,8],[583,12,583,13],[584,2,584,3],[584,7,584,8],[584,12,584,13],[593,2,593,3],[593,7,593,8],[593,12,593,13],[594,2,594,3],[594,7,594,8],[594,12,594,13],[591,2,591,3],[591,7,591,8],[591,12,591,13],[592,2,592,3],[592,7,592,8],[592,12,592,13],[589,2,589,3],[589,7,589,8],[589,12,589,13],[590,2,590,3],[590,7,590,8],[590,12,590,13],[599,2,599,3],[599,7,599,8],[599,12,599,13],[600,2,600,3],[600,7,600,8],[600,12,600,13],[597,2,597,3],[597,7,597,8],[597,12,597,13],[598,2,598,3],[598,7,598,8],[598,12,598,13],[595,2,595,3],[595,7,595,8],[595,12,595,13],[596,2,596,3],[596,7,596,8],[596,12,596,13],[605,2,605,3],[605,7,605,8],[605,12,605,13],[606,2,606,3],[606,7,606,8],[606,12,606,13],[603,2,603,3],[603,7,603,8],[603,12,603,13],[604,2,604,3],[604,7,604,8],[604,12,604,13],[601,2,601,3],[601,7,601,8],[601,12,601,13],[602,2,602,3],[602,7,602,8],[602,12,602,13],[611,2,611,3],[611,7,611,8],[611,12,611,13],[612,2,612,3],[612,7,612,8],[612,12,612,13],[609,2,609,3],[609,7,609,8],[609,12,609,13],[610,2,610,3],[610,7,610,8],[610,12,610,13],[607,2,607,3],[607,7,607,8],[607,12,607,13],[608,2,608,3],[608,7,608,8],[608,12,608,13],[617,2,617,3],[617,7,617,8],[617,12,617,13],[618,2,618,3],[618,7,618,8],[618,12,618,13],[615,2,615,3],[615,7,615,8],[615,12,615,13],[616,2,616,3],[616,7,616,8],[616,12,616,13],[613,2,613,3],[613,7,613,8],[613,12,613,13],[614,2,614,3],[614,7,614,8],[614,12,614,13],[623,2,623,3],[623,7,623,8],[623,12,623,13],[624,2,624,3],[624,7,624,8],[624,12,624,13],[621,2,621,3],[621,7,621,8],[621,12,621,13],[622,2,622,3],[622,7,622,8],[622,12,622,13],[619,2,619,3],[619,7,619,8],[619,12,619,13],[620,2,620,3],[620,7,620,8],[620,12,620,13],[629,2,629,3],[629,7,629,8],[629,12,629,13],[630,2,630,3],[630,7,630,8],[630,12,630,13],[627,2,627,3],[627,7,627,8],[627,12,627,13],[628,2,628,3],[628,7,628,8],[628,12,628,13],[625,2,625,3],[625,7,625,8],[625,12,625,13],[626,2,626,3],[626,7,626,8],[626,12,626,13],[635,2,635,3],[635,7,635,8],[635,12,635,13],[636,2,636,3],[636,7,636,8],[636,12,636,13],[633,2,633,3],[633,7,633,8],[633,12,633,13],[634,2,634,3],[634,7,634,8],[634,12,634,13],[631,2,631,3],[631,7,631,8],[631,12,631,13],[632,2,632,3],[632,7,632,8],[632,12,632,13],[641,2,641,3],[641,7,641,8],[641,12,641,13],[642,2,642,3],[642,7,642,8],[642,12,642,13],[639,2,639,3],[639,7,639,8],[639,12,639,13],[640,2,640,3],[640,7,640,8],[640,12,640,13],[637,2,637,3],[637,7,637,8],[637,12,637,13],[638,2,638,3],[638,7,638,8],[638,12,638,13],[647,2,647,3],[647,7,647,8],[647,12,647,13],[648,2,648,3],[648,7,648,8],[648,12,648,13],[645,2,645,3],[645,7,645,8],[645,12,645,13],[646,2,646,3],[646,7,646,8],[646,12,646,13],[643,2,643,3],[643,7,643,8],[643,12,643,13],[644,2,644,3],[644,7,644,8],[644,12,644,13],[653,2,653,3],[653,7,653,8],[653,12,653,13],[654,2,654,3],[654,7,654,8],[654,12,654,13],[651,2,651,3],[651,7,651,8],[651,12,651,13],[652,2,652,3],[652,7,652,8],[652,12,652,13],[649,2,649,3],[649,7,649,8],[649,12,649,13],[650,2,650,3],[650,7,650,8],[650,12,650,13],[659,2,659,3],[659,7,659,8],[659,12,659,13],[660,2,660,3],[660,7,660,8],[660,12,660,13],[657,2,657,3],[657,7,657,8],[657,12,657,13],[658,2,658,3],[658,7,658,8],[658,12,658,13],[655,2,655,3],[655,7,655,8],[655,12,655,13],[656,2,656,3],[656,7,656,8],[656,12,656,13],[665,2,665,3],[665,7,665,8],[665,12,665,13],[666,2,666,3],[666,7,666,8],[666,12,666,13],[663,2,663,3],[663,7,663,8],[663,12,663,13],[664,2,664,3],[664,7,664,8],[664,12,664,13],[661,2,661,3],[661,7,661,8],[661,12,661,13],[662,2,662,3],[662,7,662,8],[662,12,662,13],[671,2,671,3],[671,7,671,8],[671,12,671,13],[672,2,672,3],[672,7,672,8],[672,12,672,13],[669,2,669,3],[669,7,669,8],[669,12,669,13],[670,2,670,3],[670,7,670,8],[670,12,670,13],[667,2,667,3],[667,7,667,8],[667,12,667,13],[668,2,668,3],[668,7,668,8],[668,12,668,13],[677,2,677,3],[677,7,677,8],[677,12,677,13],[678,2,678,3],[678,7,678,8],[678,12,678,13],[675,2,675,3],[675,7,675,8],[675,12,675,13],[676,2,676,3],[676,7,676,8],[676,12,676,13],[673,2,673,3],[673,7,673,8],[673,12,673,13],[674,2,674,3],[674,7,674,8],[674,12,674,13],[683,2,683,3],[683,7,683,8],[683,12,683,13],[684,2,684,3],[684,7,684,8],[684,12,684,13],[681,2,681,3],[681,7,681,8],[681,12,681,13],[682,2,682,3],[682,7,682,8],[682,12,682,13],[679,2,679,3],[679,7,679,8],[679,12,679,13],[680,2,680,3],[680,7,680,8],[680,12,680,13],[689,2,689,3],[689,7,689,8],[689,12,689,13],[690,2,690,3],[690,7,690,8],[690,12,690,13],[687,2,687,3],[687,7,687,8],[687,12,687,13],[688,2,688,3],[688,7,688,8],[688,12,688,13],[685,2,685,3],[685,7,685,8],[685,12,685,13],[686,2,686,3],[686,7,686,8],[686,12,686,13],[695,2,695,3],[695,7,695,8],[695,12,695,13],[696,2,696,3],[696,7,696,8],[696,12,696,13],[693,2,693,3],[693,7,693,8],[693,12,693,13]],"merged_total":1315,"flags":["merged_cut"]}
[]
[{"$f":"A1026","v":"South Africa"}]
[{"$f":"A1034","v":"2003"}]
["Use of drinking water sources"]
[" by wealth quintile and sub-national region"]
["Notes:"]
["WHO/UNICEF JMP customised wealth index excludes water,"]
[" sanitation and hygiene assets."]
["Survey used for analysis:",{"$f":"A1025","v":"WHS03"}]
[{"$f":"B1028","v":""}]
[{"$f":"B1027","v":""}]
[]
[]
["Use of drinking water sources",null,"NATIONAL wealth index quintile",null,null,null,null,"URBAN wealth index quintile",null,null,null,null,"RURAL wealth index quintile",null,null,null,null,null,null,null,null,null,null,null,null,null,null,null,null,null,null,null,null,null,null,null,null,null,null,null,null,null,null,null,null,null,null,null,null,null,null,null,"Raw numbers of respondents:","Use of drinking water sources","NATIONAL wealth index quintile",null,null,null,null,"URBAN wealth index quintile",null,null,null,null,"RURAL wealth index quintile"]
["Weighted percentage (used in graphs)",null,"Poorest","Poor","Middle","Rich","Richest","Poorest","Poor","Middle","Rich","Richest","Poorest","Poor","Middle","Rich","Richest",null,null,null,null,null,null,null,null,null,null,null,null,null,null,null,null,null,null,null,null,null,null,null,null,null,null,null,null,null,null,null,null,null,null,null,"Water data, raw numbers (weighted)",null,"Poorest","Poor","Middle","Rich","Richest","Poorest","Poor","Middle","Rich","Richest","Poorest","Poor","Middle","Rich","Richest"]
["Water","Improved",77.944360289429625,87.732691011365787,88.394823248131146,94.576822495471291,96.168209281710261,93.606277307482117,89.602387920847164,88.159255564250302,95.417664976781239,97.166585546946195,63.180487962996011,80.77909336707323,85.722563202374928,87.108186746156505,96.713893273045898,null,null,null,null,null,null,null,null,null,null,null,null,null,null,null,null,null,null,null,null,null,null,null,null,null,null,null,null,null,null,null,null,null,null,null,"Water","Improved","N/A","N/A","N/A","N/A","N/A","N/A","N/A","N/A","N/A","N/A","N/A","N/A","N/A","N/A","N/A"]
[null,"Not Improved",22.055639710570375,12.267308988634216,11.60517675186885,5.423177504528705,3.8317907182897413,6.3937226925178923,10.397612079152841,11.840744435749698,4.582335023218767,2.833414453053801,36.819512037003989,19.22090663292677,14.277436797625068,12.891813253843498,3.2861067269541118,null,null,null,null,null,null,null,null,null,null,null,null,null,null,null,null,null,null,null,null,null,null,null,null,null,null,null,null,null,null,null,null,null,null,null,null,"Not Improved","N/A","N/A","N/A","N/A","N/A","N/A","N/A","N/A","N/A","N/A","N/A","N/A","N/A","N/A","N/A"]
["Water ladder","Basic",{"$f":"C16*C23/100","v":64.576065648432035},{"$f":"D16*D23/100","v":82.850706013339362},{"$f":"E16*E23/100","v":82.837563056371252},85.893839471132765,96.168209281710261,86.20477693974793,83.752994683984411,88.159255564250302,95.417664976781239,97.166585546946195,50.258336689663281,68.317629028677658,78.801430196584008,79.664593220089628,82.259951104973041,null,null,null,null,null,null,null,null,null,null,null,null,null,null,null,null,null,null,null,null,null,null,null,null,null,null,null,null,null,null,null,null,null,null,null,"Water ladder","Basic","N/A","N/A","N/A","N/A","N/A","N/A","N/A","N/A","N/A","N/A","N/A","N/A","N/A","N/A","N/A"]
[null,"Limited",{"$f":"C16*C22/100","v":13.368294640997581},{"$f":"D16*D22/100","v":4.8819849980264083},{"$f":"E16*E22/100","v":5.5572601917598865},8.6829830243385224,0,7.4015003677341733,5.8493932368627375,0,0,0,12.922151273332728,12.461464338395579,6.9211330057909164,7.4435935260668851,14.453942168072848,null,null,null,null,null,null,null,null,null,null,null,null,null,null,null,null,null,null,null,null,null,null,null,null,null,null,null,null,null,null,null,null,null,null,null,null,"Limited","N/A","N/A","N/A","N/A","N/A","N/A","N/A","N/A","N/A","N/A","N/A","N/A","N/A","N/A","N/A"]
[null,"Unimproved",{"$f":"100-C18-C19-C21","v":10.82971757775476},{"$f":"100-D18-D19-D21","v":10.948890773488646},{"$f":"100-E18-E19-E21","v":9.775147018838096},5.4231775045287129,3.8317907182897386,6.3937226925178967,10.39761207915285,11.840744435749698,4.5823350232187607,2.8334144530538055,14.810363075433951,15.546045587203556,11.885403931410451,7.8877522466081276,3.2861067269541113,null,null,null,null,null,null,null,null,null,null,null,null,null,null,null,null,null,null,null,null,null,null,null,null,null,null,null,null,null,null,null,null,null,null,null,null,"Unimproved","N/A","N/A","N/A","N/A","N/A","N/A","N/A","N/A","N/A","N/A","N/A","N/A","N/A","N/A","N/A"]
[null,"Surface water",11.225922132815622,1.3184182151455848,1.8300297330307647,0,0,0,0,0,0,0,22.009148961570038,3.6748610457232065,2.3920328662146235,5.00406100723536,0,null,null,null,null,null,null,null,null,null,null,null,null,null,null,null,null,null,null,null,null,null,null,null,null,null,null,null,null,null,null,null,null,null,null,null,null,"Surface water","N/A","N/A","N/A","N/A","N/A","N/A","N/A","N/A","N/A","N/A","N/A","N/A","N/A","N/A","N/A"]
["Improved water point at more than 30 minutes","Yes",17.151073652227424,5.5646133063374821,6.2868615916117907,9.1808783539479748,0,7.9070555742980693,6.5281666846088591,0,0,0,20.452756365068065,15.426595940819332,8.0738754736619534,8.5452284155086264,14.945052545104346,null,null,null,null,null,null,null,null,null,null,null,null,null,null,null,null,null,null,null,null,null,null,null,null,null,null,null,null,null,null,null,null,null,null,null,"Improved water point at more than 30 minutes","Yes","N/A","N/A","N/A","N/A","N/A","N/A","N/A","N/A","N/A","N/A","N/A","N/A","N/A","N/A","N/A"]
[null,"No",82.848926347772576,94.435386693662508,93.713138408388204,90.819121646052025,100,92.09294442570193,93.471833315391137,100,100,100,79.547243634931931,84.573404059180675,91.926124526338043,91.454771584491382,85.054947454895654,null,null,null,null,null,null,null,null,null,null,null,null,null,null,null,null,null,null,null,null,null,null,null,null,null,null,null,null,null,null,null,null,null,null,null,null,"No","N/A","N/A","N/A","N/A","N/A","N/A","N/A","N/A","N/A","N/A","N/A","N/A","N/A","N/A","N/A"]
["Manually calculated ratios","Improved wells"]
[null,"Improved springs"]
[null,"Other"]
[null,null,"NATIONAL wealth index quintile",null,null,null,null,"URBAN wealth index quintile",null,null,null,null,"RURAL wealth index quintile",null,null,null,null,null,null,null,null,null,null,null,null,null,null,null,null,null,null,null,null,null,null,null,null,null,null,null,null,null,null,null,null,null,null,null,null,null,null,null,"Raw numbers of respondents:","Use of drinking water sources","NATIONAL wealth index quintile",null,null,null,null,"URBAN wealth index quintile",null,null,null,null,"RURAL wealth index quintile"]
["Percentage based on weighted population",null,"Poorest","Poor","Middle","Rich","Richest","Poorest","Poor","Middle","Rich","Richest","Poorest","Poor","Middle","Rich","Richest",null,null,null,null,null,null,null,null,null,null,null,null,null,null,null,null,null,null,null,null,null,null,null,null,null,null,null,null,null,null,null,null,null,null,null,"Water data, raw numbers (weighted)",null,"Poorest","Poor","Middle","Rich","Richest","Poorest","Poor","Middle","Rich","Richest","Poorest","Poor","Middle","Rich","Richest"]
["Piped water","Yes",63.216460712011568,81.42674360093622,85.640570550108009,93.667711898514895,95.971865980856435,91.182920527012527,89.602387920847164,87.586397032224937,95.417664976781239,97.166585546946195,44.979861697312238,63.669892023535688,73.699738246117334,76.977548539987481,93.420540759150825,null,null,null,null,null,null,null,null,null,null,null,null,null,null,null,null,null,null,null,null,null,null,null,null,null,null,null,null,null,null,null,null,null,null,null,"Piped water","Yes","N/A","N/A","N/A","N/A","N/A","N/A","N/A","N/A","N/A","N/A","N/A","N/A","N/A","N/A","N/A"]
[null,"No",36.783539287988432,18.573256399063776,14.359429449891991,6.3322881014851067,4.0281340191435699,8.817079472987464,10.397612079152841,12.413602967775057,4.582335023218767,2.833414453053801,55.020138302687762,36.330107976464312,26.300261753882658,23.022451460012515,6.579459240849177,null,null,null,null,null,null,null,null,null,null,null,null,null,null,null,null,null,null,null,null,null,null,null,null,null,null,null,null,null,null,null,null,null,null,null,null,"No","N/A","N/A","N/A","N/A","N/A","N/A","N/A","N/A","N/A","N/A","N/A","N/A","N/A","N/A","N/A"]
["Piped water on premises","Yes",25.972024510287284,58.689276063038186,65.400229389207468,89.383765763758916,95.558351776001487,65.142456528639997,66.809363503144738,79.682335586707381,95.243245839760988,97.166585546946195,10.728353123228596,30.496928970005715,36.232539896018231,61.499974073102806,83.082732506442767,null,null,null,null,null,null,null,null,null,null,null,null,null,null,null,null,null,null,null,null,null,null,null,null,null,null,null,null,null,null,null,null,null,null,null,"Piped water on premises","Yes","N/A","N/A","N/A","N/A","N/A","N/A","N/A","N/A","N/A","N/A","N/A","N/A","N/A","N/A","N/A"]
[null,"No",74.027975489712716,41.310723936961814,34.599770610792532,10.616234236241082,4.4416482239985102,34.85754347136001,33.190636496855262,20.317664413292626,4.7567541602390078,2.833414453053801,89.271646876771399,69.503071029994274,63.767460103981769,38.500025926897194,16.91726749355723,null,null,null,null,null,null,null,null,null,null,null,null,null,null,null,null,null,null,null,null,null,null,null,null,null,null,null,null,null,null,null,null,null,null,null,null,"No","N/A","N/A","N/A","N/A","N/A","N/A","N/A","N/A","N/A","N/A","N/A","N/A","N/A","N/A","N/A"]
["Piped water into dwelling","Yes","N/A","N/A","N/A","N/A","N/A","N/A","N/A","N/A","N/A","N/A","N/A","N/A","N/A","N/A","N/A",null,null,null,null,null,null,null,null,null,null,null,null,null,null,null,null,null,null,null,null,null,null,null,null,null,null,null,null,null,null,null,null,null,null,null,"Piped water into dwelling","Yes","N/A","N/A","N/A","N/A","N/A","N/A","N/A","N/A","N/A","N/A","N/A","N/A","N/A","N/A","N/A"]
[null,"No","N/A","N/A","N/A","N/A","N/A","N/A","N/A","N/A","N/A","N/A","N/A","N/A","N/A","N/A","N/A",null,null,null,null,null,null,null,null,null,null,null,null,null,null,null,null,null,null,null,null,null,null,null,null,null,null,null,null,null,null,null,null,null,null,null,null,"No","N/A","N/A","N/A","N/A","N/A","N/A","N/A","N/A","N/A","N/A","N/A","N/A","N/A","N/A","N/A"]
["Water source on premises","Yes","N/A","N/A","N/A","N/A","N/A","N/A","N/A","N/A","N/A","N/A","N/A","N/A","N/A","N/A","N/A",null,null,null,null,null,null,null,null,null,null,null,null,null,null,null,null,null,null,null,null,null,null,null,null,null,null,null,null,null,null,null,null,null,null,null,"Water source on premises","Yes","N/A","N/A","N/A","N/A","N/A","N/A","N/A","N/A","N/A","N/A","N/A","N/A","N/A","N/A","N/A"]
[null,"No","N/A","N/A","N/A","N/A","N/A","N/A","N/A","N/A","N/A","N/A","N/A","N/A","N/A","N/A","N/A",null,null,null,null,null,null,null,null,null,null,null,null,null,null,null,null,null,null,null,null,null,null,null,null,null,null,null,null,null,null,null,null,null,null,null,null,"No","N/A","N/A","N/A","N/A","N/A","N/A","N/A","N/A","N/A","N/A","N/A","N/A","N/A","N/A","N/A"]
["Improved Water source on premises","Yes","N/A","N/A","N/A","N/A","N/A","N/A","N/A","N/A","N/A","N/A","N/A","N/A","N/A","N/A","N/A",null,null,null,null,null,null,null,null,null,null,null,null,null,null,null,null,null,null,null,null,null,null,null,null,null,null,null,null,null,null,null,null,null,null,null,"Improved water source on premises","Yes","N/A","N/A","N/A","N/A","N/A","N/A","N/A","N/A","N/A","N/A","N/A","N/A","N/A","N/A","N/A"]
[null,"No","N/A","N/A","N/A","N/A","N/A","N/A","N/A","N/A","N/A","N/A","N/A","N/A","N/A","N/A","N/A",null,null,null,null,null,null,null,null,null,null,null,null,null,null,null,null,null,null,null,null,null,null,null,null,null,null,null,null,null,null,null,null,null,null,null,null,"No","N/A","N/A","N/A","N/A","N/A","N/A","N/A","N/A","N/A","N/A","N/A","N/A","N/A","N/A","N/A"]
["Piped water on premises available when needed","Yes","N/A","N/A","N/A","N/A","N/A","N/A","N/A","N/A","N/A","N/A","N/A","N/A","N/A","N/A","N/A",null,null,null,null,null,null,null,null,null,null,null,null,null,null,null,null,null,null,null,null,null,null,null,null,null,null,null,null,null,null,null,null,null,null,null,"Piped water on premises available when needed","Yes","N/A","N/A","N/A","N/A","N/A","N/A","N/A","N/A","N/A","N/A","N/A","N/A","N/A","N/A","N/A"]
[null,"No","N/A","N/A","N/A","N/A","N/A","N/A","N/A","N/A","N/A","N/A","N/A","N/A","N/A","N/A","N/A",null,null,null,null,null,null,null,null,null,null,null,null,null,null,null,null,null,null,null,null,null,null,null,null,null,null,null,null,null,null,null,null,null,null,null,null,"No","N/A","N/A","N/A","N/A","N/A","N/A","N/A","N/A","N/A","N/A","N/A","N/A","N/A","N/A","N/A"]
["Water point at more than 30 minutes","Yes",26.08747647853173,12.011756680015731,7.5770560321581364,9.6152860090156942,0.53509593383603493,8.1169638329644389,6.5281666846088591,0,0,0,37.98070940384612,16.443064424107085,17.307825213668483,13.814903092620479,15.845807473417667,null,null,null,null,null,null,null,null,null,null,null,null,null,null,null,null,null,null,null,null,null,null,null,null,null,null,null,null,null,null,null,null,null,null,null,"Water point at more than 30 minutes","Yes","N/A","N/A","N/A","N/A","N/A","N/A","N/A","N/A","N/A","N/A","N/A","N/A","N/A","N/A","N/A"]
[null,"No",73.912523521468273,87.988243319984278,92.42294396784186,90.384713990984295,99.464904066163967,91.883036167035556,93.471833315391137,100,100,100,62.019290596153873,83.556935575892908,82.69217478633152,86.185096907379517,84.154192526582321,null,null,null,null,null,null,null,null,null,null,null,null,null,null,null,null,null,null,null,null,null,null,null,null,null,null,null,null,null,null,null,null,null,null,null,null,"No","N/A","N/A","N/A","N/A","N/A","N/A","N/A","N/A","N/A","N/A","N/A","N/A","N/A","N/A","N/A"]
["Water source available when needed","Yes","N/A","N/A","N/A","N/A","N/A","N/A","N/A","N/A","N/A","N/A","N/A","N/A","N/A","N/A","N/A",null,null,null,null,null,null,null,null,null,null,null,null,null,null,null,null,null,null,null,null,null,null,null,null,null,null,null,null,null,null,null,null,null,null,null,"Water source available when needed","Yes","N/A","N/A","N/A","N/A","N/A","N/A","N/A","N/A","N/A","N/A","N/A","N/A","N/A","N/A","N/A"]
[null,"No","N/A","N/A","N/A","N/A","N/A","N/A","N/A","N/A","N/A","N/A","N/A","N/A","N/A","N/A","N/A",null,null,null,null,null,null,null,null,null,null,null,null,null,null,null,null,null,null,null,null,null,null,null,null,null,null,null,null,null,null,null,null,null,null,null,null,"No","N/A","N/A","N/A","N/A","N/A","N/A","N/A","N/A","N/A","N/A","N/A","N/A","N/A","N/A","N/A"]
["Improved water source available when needed","Yes","N/A","N/A","N/A","N/A","N/A","N/A","N/A","N/A","N/A","N/A","N/A","N/A","N/A","N/A","N/A",null,null,null,null,null,null,null,null,null,null,null,null,null,null,null,null,null,null,null,null,null,null,null,null,null,null,null,null,null,null,null,null,null,null,null,"Improved water source available when needed","Yes","N/A","N/A","N/A","N/A","N/A","N/A","N/A","N/A","N/A","N/A","N/A","N/A","N/A","N/A","N/A"]
[null,"No","N/A","N/A","N/A","N/A","N/A","N/A","N/A","N/A","N/A","N/A","N/A","N/A","N/A","N/A","N/A",null,null,null,null,null,null,null,null,null,null,null,null,null,null,null,null,null,null,null,null,null,null,null,null,null,null,null,null,null,null,null,null,null,null,null,null,"No","N/A","N/A","N/A","N/A","N/A","N/A","N/A","N/A","N/A","N/A","N/A","N/A","N/A","N/A","N/A"]
["Microbiological quality at point of collection","Not contaminated (No E. coli in 100 mL)","N/A","N/A","N/A","N/A","N/A","N/A","N/A","N/A","N/A","N/A","N/A","N/A","N/A","N/A","N/A",null,null,null,null,null,null,null,null,null,null,null,null,null,null,null,null,null,null,null,null,null,null,null,null,null,null,null,null,null,null,null,null,null,null,null,"Microbiological quality at point of collection","Not contaminated (No E. coli in 100 mL)","N/A","N/A","N/A","N/A","N/A","N/A","N/A","N/A","N/A","N/A","N/A","N/A","N/A","N/A","N/A"]
[null,"Contaminated (E. coli detected in 100 mL)","N/A","N/A","N/A","N/A","N/A","N/A","N/A","N/A","N/A","N/A","N/A","N/A","N/A","N/A","N/A",null,null,null,null,null,null,null,null,null,null,null,null,null,null,null,null,null,null,null,null,null,null,null,null,null,null,null,null,null,null,null,null,null,null,null,null,"Contaminated (E. coli detected in 100 mL)","N/A","N/A","N/A","N/A","N/A","N/A","N/A","N/A","N/A","N/A","N/A","N/A","N/A","N/A","N/A"]
[null,"Highly contaminated (>100 CFU/100 mL)","N/A","N/A","N/A","N/A","N/A","N/A","N/A","N/A","N/A","N/A","N/A","N/A","N/A","N/A","N/A",null,null,null,null,null,null,null,null,null,null,null,null,null,null,null,null,null,null,null,null,null,null,null,null,null,null,null,null,null,null,null,null,null,null,null,null,"Highly contaminated (>100 CFU/100 mL)","N/A","N/A","N/A","N/A","N/A","N/A","N/A","N/A","N/A","N/A","N/A","N/A","N/A","N/A","N/A"]
["Microbiological quality of improved water sources at point of collection","Not contaminated (No E. coli in 100 mL)","N/A","N/A","N/A","N/A","N/A","N/A","N/A","N/A","N/A","N/A","N/A","N/A","N/A","N/A","N/A",null,null,null,null,null,null,null,null,null,null,null,null,null,null,null,null,null,null,null,null,null,null,null,null,null,null,null,null,null,null,null,null,null,null,null,"Microbiological quality of improved water sources at point of collection","Not contaminated (No E. coli in 100 mL)","N/A","N/A","N/A","N/A","N/A","N/A","N/A","N/A","N/A","N/A","N/A","N/A","N/A","N/A","N/A"]
[null,"Contaminated (E. coli detected in 100 mL)","N/A","N/A","N/A","N/A","N/A","N/A","N/A","N/A","N/A","N/A","N/A","N/A","N/A","N/A","N/A",null,null,null,null,null,null,null,null,null,null,null,null,null,null,null,null,null,null,null,null,null,null,null,null,null,null,null,null,null,null,null,null,null,null,null,null,"Contaminated (E. coli detected in 100 mL)","N/A","N/A","N/A","N/A","N/A","N/A","N/A","N/A","N/A","N/A","N/A","N/A","N/A","N/A","N/A"]
[null,"Highly contaminated (>100 CFU/100 mL)","N/A","N/A","N/A","N/A","N/A","N/A","N/A","N/A","N/A","N/A","N/A","N/A","N/A","N/A","N/A",null,null,null,null,null,null,null,null,null,null,null,null,null,null,null,null,null,null,null,null,null,null,null,null,null,null,null,null,null,null,null,null,null,null,null,null,"Highly contaminated (>100 CFU/100 mL)","N/A","N/A","N/A","N/A","N/A","N/A","N/A","N/A","N/A","N/A","N/A","N/A","N/A","N/A","N/A"]
["Microbiological quality of piped on premises at point of collection","Not contaminated (No E. coli in 100 mL)","N/A","N/A","N/A","N/A","N/A","N/A","N/A","N/A","N/A","N/A","N/A","N/A","N/A","N/A","N/A",null,null,null,null,null,null,null,null,null,null,null,null,null,null,null,null,null,null,null,null,null,null,null,null,null,null,null,null,null,null,null,null,null,null,null,"Microbiological quality of piped on premises at point of collection","Not contaminated (No E. coli in 100 mL)","N/A","N/A","N/A","N/A","N/A","N/A","N/A","N/A","N/A","N/A","N/A","N/A","N/A","N/A","N/A"]
[null,"Contaminated (E. coli detected in 100 mL)","N/A","N/A","N/A","N/A","N/A","N/A","N/A","N/A","N/A","N/A","N/A","N/A","N/A","N/A","N/A",null,null,null,null,null,null,null,null,null,null,null,null,null,null,null,null,null,null,null,null,null,null,null,null,null,null,null,null,null,null,null,null,null,null,null,null,"Contaminated (E. coli detected in 100 mL)","N/A","N/A","N/A","N/A","N/A","N/A","N/A","N/A","N/A","N/A","N/A","N/A","N/A","N/A","N/A"]
[null,"Highly contaminated (>100 CFU/100 mL)","N/A","N/A","N/A","N/A","N/A","N/A","N/A","N/A","N/A","N/A","N/A","N/A","N/A","N/A","N/A",null,null,null,null,null,null,null,null,null,null,null,null,null,null,null,null,null,null,null,null,null,null,null,null,null,null,null,null,null,null,null,null,null,null,null,null,"Highly contaminated (>100 CFU/100 mL)","N/A","N/A","N/A","N/A","N/A","N/A","N/A","N/A","N/A","N/A","N/A","N/A","N/A","N/A","N/A"]
[null,null,"NATIONAL wealth index quintile",null,null,null,null,"URBAN wealth index quintile",null,null,null,null,"RURAL wealth index quintile",null,null,null,null,null,null,null,null,null,null,null,null,null,null,null,null,null,null,null,null,null,null,null,null,null,null,null,null,null,null,null,null,null,null,null,null,null,null,null,"Raw numbers of respondents:","Use of drinking water sources","NATIONAL wealth index quintile",null,null,null,null,"URBAN wealth index quintile",null,null,null,null,"RURAL wealth index quintile"]
["Percentage based on weighted population",null,"Poorest","Poor","Middle","Rich","Richest","1 Poorest","2 Poor","3 Middle","4 Rich","5 Richest","1 Poorest","2 Poor","3 Middle","4 Rich","5 Richest",null,null,null,null,null,null,null,null,null,null,null,null,null,null,null,null,null,null,null,null,null,null,null,null,null,null,null,null,null,null,null,null,null,null,null,"Water data, raw numbers (weighted)",null,"Poorest","Poor","Middle","Rich","Richest","Poorest","Poor","Middle","Rich","Richest","Poorest","Poor","Middle","Rich","Richest"]
["main source of drinking water","Piped water through house connection or yard",27.624010461221733,64.381906502704766,73.142574655283269,94.359584903150918,99.316636788943697,69.466967324241381,74.562034621401736,90.384537705896378,99.817204563680434,100,10.889656350079434,35.05752771110032,39.191650612537146,66.375871928197867,85.446559328790983]
[null,"Public standpipe",39.613419233114556,24.942913038506052,22.636475104686337,4.5224250239290011,0.42977761051086877,27.769171721175745,25.437965378598271,8.9656626464558862,0.18279543631955761,0,34.766487787952613,38.13374365176994,40.527143594729949,16.704681848352052,10.631934212397077]
[null,"Protected tube well or bore hole",7.5094926490655096,3.3926296175848836,2.2339449906771267,0.58834344878431621,0.20406543158626678,0.74303959937903163,0,0.43319976509848518,0,0,6.1866374421707082,12.475804625224299,6.9126388487343302,7.5119828831866702,2.0387003627898905]
[null,"Protected dug well or protected spring",4.7161963635565769,0.77541438068753932,0.56572004808893295,0.12517611081092053,0,0,0,0.21659988254924259,0,0,8.5702069638865623,3.2022043572953787,1.759539267915099,1.4320622815342265,0.71731180277983275]
[null,"Unprotected dug well or spring",7.5171371742419186,3.0513615862274532,0.36528697096961127,0.15827106995720894,4.9520168959167839E-2,0.17962856215158265,0,0,0,0,15.262015945200014,3.7634419623176254,5.4329173117273619,3.4936477508590102,0.53445318697431254]
[null,"Rainwater (into tank or cistern )",0.83674969710004243,2.2861777544035977,0.28064730059581527,7.0342696546780506E-2,0,1.841192793052258,0,0,0,0,1.1898845391965314,0,2.6024336370524699,1.9897796743642318,0.18029745493966817]
[null,"Water taken directly from pond-water or stream",9.5807454657655242,0.70621920489542578,0.77535092969891317,0,0,0,0,0,0,0,20.607563099723734,3.3775260027200993,1.8435596816005217,2.4919736335059492,0]
[null,"Tanker-truck, vendor",2.6022489559341389,0.46337791499028463,0,0.17585674682085686,0,0,0,0,0,0,2.5275478717904036,3.9897516895723366,1.7301170457031265,0,0.45074365132823785]
[]
[]
[]
[]
[]
[]
[]
[]
[]
[]
[]
[]
[]
[]
[]
[]
[]
[]
[]
[]
[]
[]
[]
[]
[]
[]
[]
[]
[]
[]
[]
[]
[]
[]
[]
[]
[]
[]
[]
[]
[]
[]
[{"$f":"A1026","v":"South Africa"}]
[{"$f":"A1034","v":"2003"}]
["Use of sanitation facilities"]
[" by wealth quintile and sub-national region"]
["Notes:"]
["WHO/UNICEF JMP customised wealth index excludes water,"]
[" sanitation and hygiene assets."]
["Survey used for analysis:",{"$f":"A1025","v":"WHS03"}]
["Improved latrines based on:","JMP SAGE08 Ratio"]
[{"$f":"B1029","v":""}]
[]
[]
["Use of sanitation facilities",null,"NATIONAL wealth index quintile",null,null,null,null,"URBAN wealth index quintile",null,null,null,null,"RURAL wealth index quintile",null,null,null,null,null,null,null,null,null,null,null,null,null,null,null,null,null,null,null,null,null,null,null,null,null,null,null,null,null,null,null,null,null,null,null,null,null,null,null,"Raw numbers of respondents:","Use of sanitation facilities","NATIONAL wealth index quintile",null,null,null,null,"URBAN wealth index quintile",null,null,null,null,"RURAL wealth index quintile"]
["Weighted percentage (used in graphs)",null,"Poorest","Poor","Middle","Rich","Richest","Poorest","Poor","Middle","Rich","Richest","Poorest","Poor","Middle","Rich","Richest",null,null,null,null,null,null,null,null,null,null,null,null,null,null,null,null,null,null,null,null,null,null,null,null,null,null,null,null,null,null,null,null,null,null,null,"Sanitation data, raw numbers (weighted)",null,"Poorest","Poor","Middle","Rich","Richest","Poorest","Poor","Middle","Rich","Richest","Poorest","Poor","Middle","Rich","Richest"]
["Sanitation","Improved",{"$f":"C153+C154+C155+(C156+C157)*0.64","v":50.554764249773811},{"$f":"D153+D154+D155+(D156+D157)*0.64","v":82.4211993555557},92.884783624466166,95.892816338950908,98.945403204504004,{"$f":"H153+H154+H155+(H156+H157)*0.62","v":90.968883205375931},{"$f":"I153+I154+I155+(I156+I157)*0.62","v":97.527783473479175},98.104658264332713,99.774078393744162,98.914158438578383,42.220539908813244,41.006043302060078,66.637681525682567,76.524412907954769,88.078651243298836,null,null,null,null,null,null,null,null,null,null,null,null,null,null,null,null,null,null,null,null,null,null,null,null,null,null,null,null,null,null,null,null,null,null,null,"Sanitation","Improved",1350325.135925293,1955158.9542236328,2098003.1979370117,2242191.406414032,2293624.8022556305,1303654.1948852539,1312267.5467529297,1304096.3719787598,1410284.4315795898,1432484.5714569092,433217.27490234375,436912.07751464844,670487.20666503906,766266.37683105469,869633.44418907166]
[null,"Not Improved",{"$f":"100-C122","v":49.445235750226189},{"$f":"100-D122","v":17.5788006444443},7.1152163755338336,4.1071836610490919,1.0545967954959963,9.0311167946240687,2.4722165265208247,1.8953417356672873,0.22592160625583801,1.085841561421617,57.779460091186756,58.993956697939922,33.362318474317433,23.475587092045231,11.921348756701164,null,null,null,null,null,null,null,null,null,null,null,null,null,null,null,null,null,null,null,null,null,null,null,null,null,null,null,null,null,null,null,null,null,null,null,null,"Not Improved",1006635.4966430664,412543.69641113281,254785.01556396484,120624.10504150391,66661.501342773438,166121.72064208984,148234.58032226563,163132.15460205078,60465.330627441406,27341.806396484375,462160.82836914063,458195.40161132813,223845.63146972656,123304.48406982422,28447.876892089844]
["Sanitation ladder","Basic",{"$f":"C122*C129/100","v":31.178617978710143},{"$f":"D122*D129/100","v":53.999992980497773},44.748285502344991,80.33563694039249,91.627181169674756,50.373338959666789,40.662163305876646,73.176670628767411,87.898240474113095,93.407665950270513,27.143681282214516,28.020967063150628,45.456818129914012,56.748725532165217,68.230658176477547,null,null,null,null,null,null,null,null,null,null,null,null,null,null,null,null,null,null,null,null,null,null,null,null,null,null,null,null,null,null,null,null,null,null,null,"Sanitation ladder","Basic",812346.14923095703,1250235.1102294922,1002525.9089355469,1831299.957244873,2069435.3693637848,691914.42181396484,546035.12365722656,948978.53042602539,1221878.2214355469,1311397.4423980713,281069.42456054688,297312.67956542969,456429.87170410156,560680.05004882813,650146.72939491272]
[null,"Limited",{"$f":"C122*C128/100","v":19.376146271063668},{"$f":"D122*D128/100","v":28.421206375057928},48.136498122121182,15.557179398558411,7.3182220348292484,40.595544245709135,56.865620167602536,24.927987635565295,11.875837919631051,5.506492488307873,15.07685862659873,12.985076238909448,21.180863395768561,19.775687375789552,19.847993066821285,null,null,null,null,null,null,null,null,null,null,null,null,null,null,null,null,null,null,null,null,null,null,null,null,null,null,null,null,null,null,null,null,null,null,null,null,"Limited",510852.3056640625,674509.4306640625,1080294.2343139648,357203.9921875,165783.35693359375,572849.6162109375,761225.01416015625,329940.91925048828,165086.66882324219,77676.355224609375,143257.03198242188,134719.33837890625,214057.3349609375,200706.26721191406,189124.77355957031]
[null,"Unimproved",{"$f":"100-C124-C125-C127","v":28.232423276714151},{"$f":"100-D124-D125-D127","v":14.280592110865479},6.1293577416937453,4.107183661049099,1.0545967954959954,8.1281093011732892,2.1761618028984349,1.4719530007805894,0.225921606255854,1.0858415614216144,26.836395122018175,36.807785004236095,24.486298486779809,21.982039687118331,10.86177879853178,null,null,null,null,null,null,null,null,null,null,null,null,null,null,null,null,null,null,null,null,null,null,null,null,null,null,null,null,null,null,null,null,null,null,null,null,"Unimproved",521791.32464599609,340570.71252441406,233550.78955078125,120624.10504150391,66661.501342773438,153552.09222412109,144305.99340820313,157528.72540283203,60465.330627441406,27341.806396484375,191426.12036132813,269340.42956542969,149289.79724121094,110896.00317382813,19052.134704589844]
[null,"Open defecation",{"$f":"C159","v":21.212812473512031},{"$f":"D159","v":3.2982085335788209},0.98585863384008166,0,0,0.9030074934507859,0.29605472362238267,0.42338873488670503,0,0,30.943064969168582,22.186171693703823,8.8760199875376173,1.4935474049268986,1.0595699581693867,null,null,null,null,null,null,null,null,null,null,null,null,null,null,null,null,null,null,null,null,null,null,null,null,null,null,null,null,null,null,null,null,null,null,null,null,"Open defecation",484844.17199707031,71972.98388671875,21234.226013183594,0,0,12569.62841796875,3928.5869140625,5603.42919921875,0,0,270734.7080078125,188854.97204589844,74555.834228515625,12408.480895996094,9395.7421875]
["Shared among Improved Sanitation","Yes",38.327043076163406,34.482883769322584,51.823879266099581,16.223508697010921,7.3962223588130485,44.625747635110116,58.307097877463875,25.409586126276945,11.902728755624032,5.5669406435148288,35.709772208411621,31.666250126251754,31.785114534042318,25.842324853346057,22.534397140114418,null,null,null,null,null,null,null,null,null,null,null,null,null,null,null,null,null,null,null,null,null,null,null,null,null,null,null,null,null,null,null,null,null,null,null,"Shared among improved sanitation facilities","Yes","N/A","N/A","N/A","N/A","N/A","N/A","N/A","N/A","N/A","N/A","N/A","N/A","N/A","N/A","N/A"]
[null,"No",61.672956923836594,65.517116230677416,48.176120733900419,83.776491302989072,92.603777641186952,55.374252364889877,41.692902122536132,74.590413873723051,88.09727124437596,94.433059356485174,64.290227791588379,68.333749873748246,68.214885465957693,74.157675146653943,77.465602859885578,null,null,null,null,null,null,null,null,null,null,null,null,null,null,null,null,null,null,null,null,null,null,null,null,null,null,null,null,null,null,null,null,null,null,null,null,"No","N/A","N/A","N/A","N/A","N/A","N/A","N/A","N/A","N/A","N/A","N/A","N/A","N/A","N/A","N/A"]
["Manually calculated ratios","Improved latrines"]
[null,"Other"]
[null,"Other"]
[null,null,"NATIONAL wealth index quintile",null,null,null,null,"URBAN wealth index quintile",null,null,null,null,"RURAL wealth index quintile",null,null,null,null,null,null,null,null,null,null,null,null,null,null,null,null,null,null,null,null,null,null,null,null,null,null,null,null,null,null,null,null,null,null,null,null,null,null,null,"Raw numbers of respondents:","Use of sanitation facilities","NATIONAL wealth index quintile",null,null,null,null,"URBAN wealth index quintile",null,null,null,null,"RURAL wealth index quintile"]
["Percentage based on weighted population",null,"Poorest","Poor","Middle","Rich","Richest","Poorest","Poor","Middle","Rich","Richest","Poorest","Poor","Middle","Rich","Richest",null,null,null,null,null,null,null,null,null,null,null,null,null,null,null,null,null,null,null,null,null,null,null,null,null,null,null,null,null,null,null,null,null,null,null,"Sanitation data, raw numbers (weighted)",null,"Poorest","Poor","Middle","Rich","Richest","Poorest","Poor","Middle","Rich","Richest","Poorest","Poor","Middle","Rich","Richest"]
["Sanitation type","Sewer connection",16.456042586164031,54.820277193210245,76.087036674150653,84.693422287059022,94.692171523583127,72.988737703766304,85.163705117110467,87.471538042269643,95.144301689429852,95.970297329253427,2.8010066095966755,9.7104927292708449,26.351115268729071,39.981838290079189,67.755937915058141,null,null,null,null,null,null,null,null,null,null,null,null,null,null,null,null,null,null,null,null,null,null,null,null,null,null,null,null,null,null,null,null,null,null,null,"Sanitation type","Sewer connection","N/A","N/A","N/A","N/A","N/A","N/A","N/A","N/A","N/A","N/A","N/A","N/A","N/A","N/A","N/A"]
[null,"Septic tank connection",0.68832553524535378,1.3384356254681757,0.40870270959828192,0.30497632155767468,0.19566807273128173,2.1501494015445979,0.48996697058389954,0.1676583509507075,0.17441913702024098,0.20851133734779381,0,0,1.5304504883896457,0.29497799955146131,0.6920511384596828,null,null,null,null,null,null,null,null,null,null,null,null,null,null,null,null,null,null,null,null,null,null,null,null,null,null,null,null,null,null,null,null,null,null,null,null,"Septic tank connection","N/A","N/A","N/A","N/A","N/A","N/A","N/A","N/A","N/A","N/A","N/A","N/A","N/A","N/A","N/A"]
[null,"Improved latrines",40.146581810743513,26.41749047692829,12.675193465117996,9.8965009526614693,2.287863146139173,13.558592633803833,4.1967651301465621,1.2424160041197234,0.57008825710833289,1.948242138119181,45.582717910745934,39.100637520838241,47.089091483133977,45.862063760357465,28.384382779152894,null,null,null,null,null,null,null,null,null,null,null,null,null,null,null,null,null,null,null,null,null,null,null,null,null,null,null,null,null,null,null,null,null,null,null,null,"Improved latrines","N/A","N/A","N/A","N/A","N/A","N/A","N/A","N/A","N/A","N/A","N/A","N/A","N/A","N/A","N/A"]
[null,"Unimproved facilities",22.138313106969658,14.384015342176065,9.9265538738505885,5.1051004387218253,2.8242972575464176,10.447313131337292,9.8805739980119451,10.736481914643022,4.1111909164415668,1.8729491952795936,21.3793613739163,30.090289249781026,16.692867674698388,12.466236029979942,2.1214264518555845,null,null,null,null,null,null,null,null,null,null,null,null,null,null,null,null,null,null,null,null,null,null,null,null,null,null,null,null,null,null,null,null,null,null,null,null,"Unimproved facilities","N/A","N/A","N/A","N/A","N/A","N/A","N/A","N/A","N/A","N/A","N/A","N/A","N/A","N/A","N/A"]
[null,"Open defecation",20.570736960877444,3.0397813622172221,0.90251327728248076,0,0,0.85520712954796718,0.26898878414712729,0.3819056880169055,0,0,30.236914105741093,21.098580500109883,8.3364750850489209,1.3948839200319443,1.0462017154737022,null,null,null,null,null,null,null,null,null,null,null,null,null,null,null,null,null,null,null,null,null,null,null,null,null,null,null,null,null,null,null,null,null,null,null,null,"Open defecation","N/A","N/A","N/A","N/A","N/A","N/A","N/A","N/A","N/A","N/A","N/A","N/A","N/A","N/A","N/A"]
["Septic tank emptying practices","Not emptied/treated and disposed in situ","N/A","N/A","N/A","N/A","N/A","N/A","N/A","N/A","N/A","N/A","N/A","N/A","N/A","N/A","N/A",null,null,null,null,null,null,null,null,null,null,null,null,null,null,null,null,null,null,null,null,null,null,null,null,null,null,null,null,null,null,null,null,null,null,null,"Septic tank emptying practices","Not emptied/treated and disposed in situ","N/A","N/A","N/A","N/A","N/A","N/A","N/A","N/A","N/A","N/A","N/A","N/A","N/A","N/A","N/A"]
[null,"Emptied and buried on site","N/A","N/A","N/A","N/A","N/A","N/A","N/A","N/A","N/A","N/A","N/A","N/A","N/A","N/A","N/A",null,null,null,null,null,null,null,null,null,null,null,null,null,null,null,null,null,null,null,null,null,null,null,null,null,null,null,null,null,null,null,null,null,null,null,null,"Emptied and buried on site","N/A","N/A","N/A","N/A","N/A","N/A","N/A","N/A","N/A","N/A","N/A","N/A","N/A","N/A","N/A"]
[null,"Emptied and discharged locally","N/A","N/A","N/A","N/A","N/A","N/A","N/A","N/A","N/A","N/A","N/A","N/A","N/A","N/A","N/A",null,null,null,null,null,null,null,null,null,null,null,null,null,null,null,null,null,null,null,null,null,null,null,null,null,null,null,null,null,null,null,null,null,null,null,null,"Emptied and discharged locally","N/A","N/A","N/A","N/A","N/A","N/A","N/A","N/A","N/A","N/A","N/A","N/A","N/A","N/A","N/A"]
[null,"Emptied and removed offsite","N/A","N/A","N/A","N/A","N/A","N/A","N/A","N/A","N/A","N/A","N/A","N/A","N/A","N/A","N/A",null,null,null,null,null,null,null,null,null,null,null,null,null,null,null,null,null,null,null,null,null,null,null,null,null,null,null,null,null,null,null,null,null,null,null,null,"Emptied and removed offsite","N/A","N/A","N/A","N/A","N/A","N/A","N/A","N/A","N/A","N/A","N/A","N/A","N/A","N/A","N/A"]
["Latrine emptying practices","Not emptied/treated and disposed in situ","N/A","N/A","N/A","N/A","N/A","N/A","N/A","N/A","N/A","N/A","N/A","N/A","N/A","N/A","N/A",null,null,null,null,null,null,null,null,null,null,null,null,null,null,null,null,null,null,null,null,null,null,null,null,null,null,null,null,null,null,null,null,null,null,null,"Latrine emptying practices","Not emptied/treated and disposed in situ","N/A","N/A","N/A","N/A","N/A","N/A","N/A","N/A","N/A","N/A","N/A","N/A","N/A","N/A","N/A"]
[null,"Emptied and buried on site","N/A","N/A","N/A","N/A","N/A","N/A","N/A","N/A","N/A","N/A","N/A","N/A","N/A","N/A","N/A",null,null,null,null,null,null,null,null,null,null,null,null,null,null,null,null,null,null,null,null,null,null,null,null,null,null,null,null,null,null,null,null,null,null,null,null,"Emptied and buried on site","N/A","N/A","N/A","N/A","N/A","N/A","N/A","N/A","N/A","N/A","N/A","N/A","N/A","N/A","N/A"]
[null,"Emptied and discharged locally","N/A","N/A","N/A","N/A","N/A","N/A","N/A","N/A","N/A","N/A","N/A","N/A","N/A","N/A","N/A",null,null,null,null,null,null,null,null,null,null,null,null,null,null,null,null,null,null,null,null,null,null,null,null,null,null,null,null,null,null,null,null,null,null,null,null,"Emptied and discharged locally","N/A","N/A","N/A","N/A","N/A","N/A","N/A","N/A","N/A","N/A","N/A","N/A","N/A","N/A","N/A"]
[null,"Emptied and removed offsite","N/A","N/A","N/A","N/A","N/A","N/A","N/A","N/A","N/A","N/A","N/A","N/A","N/A","N/A","N/A",null,null,null,null,null,null,null,null,null,null,null,null,null,null,null,null,null,null,null,null,null,null,null,null,null,null,null,null,null,null,null,null,null,null,null,null,"Emptied and removed offsite","N/A","N/A","N/A","N/A","N/A","N/A","N/A","N/A","N/A","N/A","N/A","N/A","N/A","N/A","N/A"]
["Shared among improved sanitation facilities","Yes",25.895353543992091,29.614418707560354,46.184769891881281,15.117726731337397,7.0238664131909196,40.449207149962561,52.285068985621443,22.487357168509643,11.224660582335259,5.3209310643385432,21.553560596961834,19.230292453686062,25.875813562855747,23.00461197906796,21.058758168123475,null,null,null,null,null,null,null,null,null,null,null,null,null,null,null,null,null,null,null,null,null,null,null,null,null,null,null,null,null,null,null,null,null,null,null,"Shared among improved sanitation facilities","Yes","N/A","N/A","N/A","N/A","N/A","N/A","N/A","N/A","N/A","N/A","N/A","N/A","N/A","N/A","N/A"]
[null,"No",41.668829512167257,56.267083853738121,42.933934739890454,78.066349621534059,87.941726458980597,50.191755284330441,37.386807833735766,66.012144778335042,83.078593846037847,90.259952675406851,38.804036956922246,41.497745684760531,55.532776408221366,66.014515013638857,72.392857320785723,null,null,null,null,null,null,null,null,null,null,null,null,null,null,null,null,null,null,null,null,null,null,null,null,null,null,null,null,null,null,null,null,null,null,null,null,"No","N/A","N/A","N/A","N/A","N/A","N/A","N/A","N/A","N/A","N/A","N/A","N/A","N/A","N/A","N/A"]
[null,"DK/missing",32.435816943840649,14.118497438701525,10.881295368228267,6.8159236471285425,5.0344071278284872,9.3590375657069913,10.328123180642798,11.50049805315532,5.6967455716268978,4.4191162602546008,39.642402446115923,39.271961861553407,18.591410028922887,10.980873007293178,6.5483845110908057,null,null,null,null,null,null,null,null,null,null,null,null,null,null,null,null,null,null,null,null,null,null,null,null,null,null,null,null,null,null,null,null,null,null,null,null,"DK/missing","N/A","N/A","N/A","N/A","N/A","N/A","N/A","N/A","N/A","N/A","N/A","N/A","N/A","N/A","N/A"]
["Shared among all sanitation facilities","Yes",62.293178099974121,66.353110621357828,49.189637161126775,84.979240802443229,92.571430991057809,53.950361600567597,42.348877612730931,74.874173801001987,88.260513995406725,94.433059356485174,64.238738592926751,73.279027992530928,71.798319946223458,77.899070830610484,79.213004889176062,null,null,null,null,null,null,null,null,null,null,null,null,null,null,null,null,null,null,null,null,null,null,null,null,null,null,null,null,null,null,null,null,null,null,null,"Shared among all sanitation facilities","Yes","N/A","N/A","N/A","N/A","N/A","N/A","N/A","N/A","N/A","N/A","N/A","N/A","N/A","N/A","N/A"]
[null,"No",37.706821900025886,33.646889378642172,50.810362838873225,15.020759197556774,7.4285690089421914,46.049638399432411,57.651122387269069,25.125826198998013,11.739486004593267,5.5669406435148288,35.761261407073249,26.720972007469079,28.201680053776546,22.10092916938952,20.786995110823938,null,null,null,null,null,null,null,null,null,null,null,null,null,null,null,null,null,null,null,null,null,null,null,null,null,null,null,null,null,null,null,null,null,null,null,null,"No","N/A","N/A","N/A","N/A","N/A","N/A","N/A","N/A","N/A","N/A","N/A","N/A","N/A","N/A","N/A"]
["What type of toilet facilities","Flush to piped sewage system",16.969685923276494,59.480825923585577,83.113527431287181,88.798555271069262,97.240826235203301,77.068320418297148,93.73296831333144,96.972799809861584,99.223572175685476,97.475521438146401,2.8664211300373461,10.211049929209388,28.056585479230083,42.809849597368036,68.621715335153553,null,null,null,null,null,null,null,null,null,null,null,null,null,null,null,null,null,null,null,null,null,null,null,null,null,null,null,null,null,null,null,null,null,null,null,"What type of toilet facilities","1 Flush to piped sewage system",387862.44543457031,1297981.1561889648,1790166.830871582,2001149.3189811707,2235006.3550510406,1072770.8878173828,1243817.7247314453,1283407.358795166,1399334.5908508301,1400999.7153167725,25079.599853515625,86919.3466796875,235666.67706298828,355666.78308105469,608503.42233848572]
[null,"Flush to septic tank",0.70981027698030841,1.4522228001112367,0.44644561478865591,0.31975867800473279,0.2009345097287269,2.2703283854284022,0.53926797178640518,0.18586959903846476,0.18189728153600329,0.21178168557727403,0,0,1.6295027558165476,0.31584250088030513,0.70089408665974839,null,null,null,null,null,null,null,null,null,null,null,null,null,null,null,null,null,null,null,null,null,null,null,null,null,null,null,null,null,null,null,null,null,null,null,null,"2 Flush to septic tank",16223.561889648438,31690.17578125,9615.9091796875,7206.02783203125,4618.3267211914063,31602.378051757813,7155.97802734375,2459.93115234375,2565.26904296875,3043.9035034179688,0,0,13687.3212890625,2624.038330078125,6215.1820068359375]
[null,"Pour flush latrine",0.98334571052255981,1.1595681036060188,0.48731343479168582,0.21654667913593237,0,1.0055286083976605,0,0,0,0,0.96648027426052407,0.44151455924811817,1.9867671801408384,1.3769948737844537,0.99420489974739268,null,null,null,null,null,null,null,null,null,null,null,null,null,null,null,null,null,null,null,null,null,null,null,null,null,null,null,null,null,null,null,null,null,null,null,null,"3 Pour flush latrine",22475.541015625,25303.911376953125,10496.153564453125,4880.0595703125,0,13996.695556640625,0,0,0,0,8456.16796875,3758.296875,16688.232421875,11440.155517578125,8816.1171875]
[null,"Covered dry latrine (with privacy)",40.416333504834306,27.503806706741873,13.358409645101363,10.159642676591368,2.3494413430812249,13.310898752822991,4.6190481311444014,1.3773686978025839,0.59453054277851392,1.9787988949269384,45.680773372423268,40.674685526633354,48.149976819596297,47.729002643417687,27.752870190215855,null,null,null,null,null,null,null,null,null,null,null,null,null,null,null,null,null,null,null,null,null,null,null,null,null,null,null,null,null,null,null,null,null,null,null,null,"4 Covered dry latrine (with privacy)",923763.58758544922,600183.71087646484,287724.30432128906,228956.00003051758,54000.120483398438,185284.23345947266,61293.843994140625,18229.08203125,8384.5716857910156,28440.95263671875,399681.50708007813,346234.43395996094,404444.97589111328,396535.39990234375,246098.72265625]
[null,"Uncovered dry latrine (without privacy)",9.4147951498445117,4.2596034936532163,0.45017964177150177,8.7163121441429237E-2,0,3.8257234943588383,0.63183443072871337,0.14841977870170042,0,0,14.299911790881998,6.7526251196206628,6.4825639780522897,2.304944131460394,0,null,null,null,null,null,null,null,null,null,null,null,null,null,null,null,null,null,null,null,null,null,null,null,null,null,null,null,null,null,null,null,null,null,null,null,null,"5 Uncovered dry latrine (without privacy)",215186.39099121094,92952.392333984375,9696.335693359375,1964.29345703125,0,53253.071655273438,8384.31640625,1964.29345703125,0,0,125116.32080078125,57480.255981445313,54451.540893554688,19149.61328125,0]
[null,"Bucket latrine (where fresh excreta are manually removed)",0.88481473537276312,0.40308064330994969,0.37582294063085619,0,0.20879791198674538,1.3835992867901834,0.18082642938665627,0.13292257489131087,0,0.33389798134939402,0,1.146592417764275,0,0.47376376601345682,0,null,null,null,null,null,null,null,null,null,null,null,null,null,null,null,null,null,null,null,null,null,null,null,null,null,null,null,null,null,null,null,null,null,null,null,null,"6 Bucket latrine (where fresh excreta are manually removed)",20223.497863769531,8795.9619140625,8094.780517578125,0,4799.06103515625,19259.340637207031,2399.530517578125,1759.1923828125,0,4799.06103515625,0,9760.119140625,0,3936.0576171875,0]
[null,"No facilities (open defecation)",21.212812473512031,3.2982085335788209,0.98585863384008166,0,0,0.9030074934507859,0.29605472362238267,0.42338873488670503,0,0,30.943064969168582,22.186171693703823,8.8760199875376173,1.4935474049268986,1.0595699581693867,null,null,null,null,null,null,null,null,null,null,null,null,null,null,null,null,null,null,null,null,null,null,null,null,null,null,null,null,null,null,null,null,null,null,null,null,"7 No facilities (open defecation)",484844.17199707031,71972.98388671875,21234.226013183594,0,0,12569.62841796875,3928.5869140625,5603.42919921875,0,0,270734.7080078125,188854.97204589844,74555.834228515625,12408.480895996094,9395.7421875]
[null,"Other",9.4084022256570261,2.4426837954132989,0.78244265778867284,0.41833357375726488,0,0.23259356045398494,0,0.75923080481765159,0,0,5.243348463228287,18.587360753820381,4.8185837996263263,3.4960550821487697,0.87074553005406441,null,null,null,null,null,null,null,null,null,null,null,null,null,null,null,null,null,null,null,null,null,null,null,null,null,null,null,null,null,null,null,null,null,null,null,null,"8 Other",215040.27307128906,53303.858642578125,16852.887084960938,9427.4951171875,0,3237.6416015625,0,10048.203247070313,0,0,45876.399658203125,158220.87487792969,40474.619873046875,29045.43408203125,7721.340576171875]
[null,null,null,null,null,null,null,null,null,null,null,null,null,null,null,null,null,null,null,null,null,null,null,null,null,null,null,null,null,null,null,null,null,null,null,null,null,null,null,null,null,null,null,null,null,null,null,null,null,null,null,null,null,"Total",2285619.4698486328,2182184.1510009766,2153881.4272460938,2253583.1949882507,2298423.8632907867,1391973.8771972656,1326979.9805908203,1323471.4902648926,1410284.4315795898,1437283.6324920654,874944.70336914063,851228.29956054688,839969.20166015625,830805.96270751953,886750.52695274353]
[]
[]
[]
[]
[]
[]
[]
[]
[]
[]
[]
[]
[]
[]
[]
[]
[]
[]
[]
[]
[]
[]
[]
[]
[]
[]
[]
[]
[]
[]
[]
[]
[]
[]
[]
[]
[]
[]
[]
[]
[]
[]
[]
[]
[]
[]
[{"$f":"A1026","v":"South Africa"}]
[{"$f":"A1034","v":"2003"}]
["Access to hygiene facilities "]
[" by wealth quintile and sub-national region"]
["Notes:"]
["WHO/UNICEF JMP customised wealth index excludes water,"]
[" sanitation and hygiene assets."]
["Survey used for analysis:",{"$f":"A1025","v":"WHS03"}]
[]
[]
[]
[]
["Access to handwashing",null,"NATIONAL wealth index quintile",null,null,null,null,"URBAN wealth index quintile",null,null,null,null,"RURAL wealth index quintile",null,null,null,null,null,null,null,null,null,null,null,null,null,null,null,null,null,null,null,null,null,null,null,null,null,null,null,null,null,null,null,null,null,null,null,null,null,null,null,"Raw numbers of respondents:","Access to handwashing","NATIONAL wealth index quintile",null,null,null,null,"URBAN wealth index quintile",null,null,null,null,"RURAL wealth index quintile"]
["Weighted percentage (used in graphs)",null,"Poorest","Poor","Middle","Rich","Richest","Poorest","Poor","Middle","Rich","Richest","Poorest","Poor","Middle","Rich","Richest",null,null,null,null,null,null,null,null,null,null,null,null,null,null,null,null,null,null,null,null,null,null,null,null,null,null,null,null,null,null,null,null,null,null,null,"Hygiene data, raw numbers (weighted)",null,"Poorest","Poor","Middle","Rich","Richest","Poorest","Poor","Middle","Rich","Richest","Poorest","Poor","Middle","Rich","Richest"]
["Hygiene ladder","Basic","N/A","N/A","N/A","N/A","N/A","N/A","N/A","N/A","N/A","N/A","N/A","N/A","N/A","N/A","N/A",null,null,null,null,null,null,null,null,null,null,null,null,null,null,null,null,null,null,null,null,null,null,null,null,null,null,null,null,null,null,null,null,null,null,null,"Hygiene ladder","Basic","N/A","N/A","N/A","N/A","N/A","N/A","N/A","N/A","N/A","N/A","N/A","N/A","N/A","N/A","N/A"]
[null,"Limited","N/A","N/A","N/A","N/A","N/A","N/A","N/A","N/A","N/A","N/A","N/A","N/A","N/A","N/A","N/A",null,null,null,null,null,null,null,null,null,null,null,null,null,null,null,null,null,null,null,null,null,null,null,null,null,null,null,null,null,null,null,null,null,null,null,null,"Limited","N/A","N/A","N/A","N/A","N/A","N/A","N/A","N/A","N/A","N/A","N/A","N/A","N/A","N/A","N/A"]
[null,"No facility","N/A","N/A","N/A","N/A","N/A","N/A","N/A","N/A","N/A","N/A","N/A","N/A","N/A","N/A","N/A",null,null,null,null,null,null,null,null,null,null,null,null,null,null,null,null,null,null,null,null,null,null,null,null,null,null,null,null,null,null,null,null,null,null,null,null,"No facility","N/A","N/A","N/A","N/A","N/A","N/A","N/A","N/A","N/A","N/A","N/A","N/A","N/A","N/A","N/A"]
[null,null,null,null,null,null,null,null,null,null,null,null,null,null,null,null,null,null,null,null,null,null,null,null,null,null,null,null,null,null,null,null,null,null,null,null,null,null,null,null,null,null,null,null,null,null,null,null,null,null,null,null,"Observed handwashing place","Fixed","N/A","N/A","N/A","N/A","N/A","N/A","N/A","N/A","N/A","N/A","N/A","N/A","N/A","N/A","N/A"]
[null,null,null,null,null,null,null,null,null,null,null,null,null,null,null,null,null,null,null,null,null,null,null,null,null,null,null,null,null,null,null,null,null,null,null,null,null,null,null,null,null,null,null,null,null,null,null,null,null,null,null,null,null,"Mobile","N/A","N/A","N/A","N/A","N/A","N/A","N/A","N/A","N/A","N/A","N/A","N/A","N/A","N/A","N/A"]
[null,null,null,null,null,null,null,null,null,null,null,null,null,null,null,null,null,null,null,null,null,null,null,null,null,null,null,null,null,null,null,null,null,null,null,null,null,null,null,null,null,null,null,null,null,null,null,null,null,null,null,null,"Water / Soap","Water and soap","N/A","N/A","N/A","N/A","N/A","N/A","N/A","N/A","N/A","N/A","N/A","N/A","N/A","N/A","N/A"]
[null,null,null,null,null,null,null,null,null,null,null,null,null,null,null,null,null,null,null,null,null,null,null,null,null,null,null,null,null,null,null,null,null,null,null,null,null,null,null,null,null,null,null,null,null,null,null,null,null,null,null,null,null,"Water only","N/A","N/A","N/A","N/A","N/A","N/A","N/A","N/A","N/A","N/A","N/A","N/A","N/A","N/A","N/A"]
[null,null,null,null,null,null,null,null,null,null,null,null,null,null,null,null,null,null,null,null,null,null,null,null,null,null,null,null,null,null,null,null,null,null,null,null,null,null,null,null,null,null,null,null,null,null,null,null,null,null,null,null,null,"Soap only","N/A","N/A","N/A","N/A","N/A","N/A","N/A","N/A","N/A","N/A","N/A","N/A","N/A","N/A","N/A"]
[null,null,null,null,null,null,null,null,null,null,null,null,null,null,null,null,null,null,null,null,null,null,null,null,null,null,null,null,null,null,null,null,null,null,null,null,null,null,null,null,null,null,null,null,null,null,null,null,null,null,null,null,null,"Neither","N/A","N/A","N/A","N/A","N/A","N/A","N/A","N/A","N/A","N/A","N/A","N/A","N/A","N/A","N/A"]
[]
[]
[]
[]
[]
[]
[]
[]
[]
[]
[]
[]
[]
[]
[]
[]
[]
[]
[]
[]
[]
[]
[]
[]
[]
[]
[]
[]
[null,null,null,null,null,null,null,null,null,null,null,null,null,null,null,null,null,null,null,null,null,null,null,null,null,null,null,null,null,null,null,null,null,null,null,null,null,null,null,null,null,null,null,null,null,null,null,null,null,null,null,null,"Raw numbers of respondents:","Menstrual health and hygiene","NATIONAL wealth index quintile",null,null,null,null,"URBAN wealth index quintile",null,null,null,null,"RURAL wealth index quintile"]
[null,null,null,null,null,null,null,null,null,null,null,null,null,null,null,null,null,null,null,null,null,null,null,null,null,null,null,null,null,null,null,null,null,null,null,null,null,null,null,null,null,null,null,null,null,null,null,null,null,null,null,null,"MHH data, raw numbers (weighted)",null,"Poorest","Poor","Middle","Rich","Richest","Poorest","Poor","Middle","Rich","Richest","Poorest","Poor","Middle","Rich","Richest"]
[null,null,null,null,null,null,null,null,null,null,null,null,null,null,null,null,null,null,null,null,null,null,null,null,null,null,null,null,null,null,null,null,null,null,null,null,null,null,null,null,null,null,null,null,null,null,null,null,null,null,null,null,"Private place to wash and change","Yes","N/A","N/A","N/A","N/A","N/A","N/A","N/A","N/A","N/A","N/A","N/A","N/A","N/A","N/A","N/A"]
[null,null,null,null,null,null,null,null,null,null,null,null,null,null,null,null,null,null,null,null,null,null,null,null,null,null,null,null,null,null,null,null,null,null,null,null,null,null,null,null,null,null,null,null,null,null,null,null,null,null,null,null,null,"No","N/A","N/A","N/A","N/A","N/A","N/A","N/A","N/A","N/A","N/A","N/A","N/A","N/A","N/A","N/A"]
[null,null,null,null,null,null,null,null,null,null,null,null,null,null,null,null,null,null,null,null,null,null,null,null,null,null,null,null,null,null,null,null,null,null,null,null,null,null,null,null,null,null,null,null,null,null,null,null,null,null,null,null,null,"DK/not sure/missing","N/A","N/A","N/A","N/A","N/A","N/A","N/A","N/A","N/A","N/A","N/A","N/A","N/A","N/A","N/A"]
[null,null,null,null,null,null,null,null,null,null,null,null,null,null,null,null,null,null,null,null,null,null,null,null,null,null,null,null,null,null,null,null,null,null,null,null,null,null,null,null,null,null,null,null,null,null,null,null,null,null,null,null,"Use of menstrual materials","Materials reusable","N/A","N/A","N/A","N/A","N/A","N/A","N/A","N/A","N/A","N/A","N/A","N/A","N/A","N/A","N/A"]
[null,null,null,null,null,null,null,null,null,null,null,null,null,null,null,null,null,null,null,null,null,null,null,null,null,null,null,null,null,null,null,null,null,null,null,null,null,null,null,null,null,null,null,null,null,null,null,null,null,null,null,null,null,"Materials not reusable","N/A","N/A","N/A","N/A","N/A","N/A","N/A","N/A","N/A","N/A","N/A","N/A","N/A","N/A","N/A"]
[null,null,null,null,null,null,null,null,null,null,null,null,null,null,null,null,null,null,null,null,null,null,null,null,null,null,null,null,null,null,null,null,null,null,null,null,null,null,null,null,null,null,null,null,null,null,null,null,null,null,null,null,null,"No materials used","N/A","N/A","N/A","N/A","N/A","N/A","N/A","N/A","N/A","N/A","N/A","N/A","N/A","N/A","N/A"]
[null,null,null,null,null,null,null,null,null,null,null,null,null,null,null,null,null,null,null,null,null,null,null,null,null,null,null,null,null,null,null,null,null,null,null,null,null,null,null,null,null,null,null,null,null,null,null,null,null,null,null,null,null,"DK/not sure/missing","N/A","N/A","N/A","N/A","N/A","N/A","N/A","N/A","N/A","N/A","N/A","N/A","N/A","N/A","N/A"]
[null,null,null,null,null,null,null,null,null,null,null,null,null,null,null,null,null,null,null,null,null,null,null,null,null,null,null,null,null,null,null,null,null,null,null,null,null,null,null,null,null,null,null,null,null,null,null,null,null,null,null,null,"Use of menstrual materials with private place to wash and change","Materials reusable","N/A","N/A","N/A","N/A","N/A","N/A","N/A","N/A","N/A","N/A","N/A","N/A","N/A","N/A","N/A"]
[null,null,null,null,null,null,null,null,null,null,null,null,null,null,null,null,null,null,null,null,null,null,null,null,null,null,null,null,null,null,null,null,null,null,null,null,null,null,null,null,null,null,null,null,null,null,null,null,null,null,null,null,null,"Materials not reusable","N/A","N/A","N/A","N/A","N/A","N/A","N/A","N/A","N/A","N/A","N/A","N/A","N/A","N/A","N/A"]
[null,null,null,null,null,null,null,null,null,null,null,null,null,null,null,null,null,null,null,null,null,null,null,null,null,null,null,null,null,null,null,null,null,null,null,null,null,null,null,null,null,null,null,null,null,null,null,null,null,null,null,null,null,"No materials used","N/A","N/A","N/A","N/A","N/A","N/A","N/A","N/A","N/A","N/A","N/A","N/A","N/A","N/A","N/A"]
[null,null,null,null,null,null,null,null,null,null,null,null,null,null,null,null,null,null,null,null,null,null,null,null,null,null,null,null,null,null,null,null,null,null,null,null,null,null,null,null,null,null,null,null,null,null,null,null,null,null,null,null,"Awareness of menstruation before menarche","Yes","N/A","N/A","N/A","N/A","N/A","N/A","N/A","N/A","N/A","N/A","N/A","N/A","N/A","N/A","N/A"]
[null,null,null,null,null,null,null,null,null,null,null,null,null,null,null,null,null,null,null,null,null,null,null,null,null,null,null,null,null,null,null,null,null,null,null,null,null,null,null,null,null,null,null,null,null,null,null,null,null,null,null,null,null,"No","N/A","N/A","N/A","N/A","N/A","N/A","N/A","N/A","N/A","N/A","N/A","N/A","N/A","N/A","N/A"]
[null,null,null,null,null,null,null,null,null,null,null,null,null,null,null,null,null,null,null,null,null,null,null,null,null,null,null,null,null,null,null,null,null,null,null,null,null,null,null,null,null,null,null,null,null,null,null,null,null,null,null,null,null,"DK/not sure/missing","N/A","N/A","N/A","N/A","N/A","N/A","N/A","N/A","N/A","N/A","N/A","N/A","N/A","N/A","N/A"]
[null,null,null,null,null,null,null,null,null,null,null,null,null,null,null,null,null,null,null,null,null,null,null,null,null,null,null,null,null,null,null,null,null,null,null,null,null,null,null,null,null,null,null,null,null,null,null,null,null,null,null,null,"Participation in (all) activities during menstruation","Yes","N/A","N/A","N/A","N/A","N/A","N/A","N/A","N/A","N/A","N/A","N/A","N/A","N/A","N/A","N/A"]
[null,null,null,null,null,null,null,null,null,null,null,null,null,null,null,null,null,null,null,null,null,null,null,null,null,null,null,null,null,null,null,null,null,null,null,null,null,null,null,null,null,null,null,null,null,null,null,null,null,null,null,null,null,"No","N/A","N/A","N/A","N/A","N/A","N/A","N/A","N/A","N/A","N/A","N/A","N/A","N/A","N/A","N/A"]
[null,null,null,null,null,null,null,null,null,null,null,null,null,null,null,null,null,null,null,null,null,null,null,null,null,null,null,null,null,null,null,null,null,null,null,null,null,null,null,null,null,null,null,null,null,null,null,null,null,null,null,null,null,"DK/not sure/missing/no such activity","N/A","N/A","N/A","N/A","N/A","N/A","N/A","N/A","N/A","N/A","N/A","N/A","N/A","N/A","N/A"]
[null,null,null,null,null,null,null,null,null,null,null,null,null,null,null,null,null,null,null,null,null,null,null,null,null,null,null,null,null,null,null,null,null,null,null,null,null,null,null,null,null,null,null,null,null,null,null,null,null,null,null,null,"Participation in specific activities during menstruation","Did not go to school (amongst those usually attending school)","N/A","N/A","N/A","N/A","N/A","N/A","N/A","N/A","N/A","N/A","N/A","N/A","N/A","N/A","N/A"]
[null,null,null,null,null,null,null,null,null,null,null,null,null,null,null,null,null,null,null,null,null,null,null,null,null,null,null,null,null,null,null,null,null,null,null,null,null,null,null,null,null,null,null,null,null,null,null,null,null,null,null,null,null,"Did not go to work (amongst those who usually work)","N/A","N/A","N/A","N/A","N/A","N/A","N/A","N/A","N/A","N/A","N/A","N/A","N/A","N/A","N/A"]
[null,null,null,null,null,null,null,null,null,null,null,null,null,null,null,null,null,null,null,null,null,null,null,null,null,null,null,null,null,null,null,null,null,null,null,null,null,null,null,null,null,null,null,null,null,null,null,null,null,null,null,null,null,"Did not participate in social activities","N/A","N/A","N/A","N/A","N/A","N/A","N/A","N/A","N/A","N/A","N/A","N/A","N/A","N/A","N/A"]
[null,null,null,null,null,null,null,null,null,null,null,null,null,null,null,null,null,null,null,null,null,null,null,null,null,null,null,null,null,null,null,null,null,null,null,null,null,null,null,null,null,null,null,null,null,null,null,null,null,null,null,null,null,"Did not cook food","N/A","N/A","N/A","N/A","N/A","N/A","N/A","N/A","N/A","N/A","N/A","N/A","N/A","N/A","N/A"]
[null,null,null,null,null,null,null,null,null,null,null,null,null,null,null,null,null,null,null,null,null,null,null,null,null,null,null,null,null,null,null,null,null,null,null,null,null,null,null,null,null,null,null,null,null,null,null,null,null,null,null,null,null,"Did not eat with others","N/A","N/A","N/A","N/A","N/A","N/A","N/A","N/A","N/A","N/A","N/A","N/A","N/A","N/A","N/A"]
[null,null,null,null,null,null,null,null,null,null,null,null,null,null,null,null,null,null,null,null,null,null,null,null,null,null,null,null,null,null,null,null,null,null,null,null,null,null,null,null,null,null,null,null,null,null,null,null,null,null,null,null,null,"Did not bathe in regular place","N/A","N/A","N/A","N/A","N/A","N/A","N/A","N/A","N/A","N/A","N/A","N/A","N/A","N/A","N/A"]
[null,null,null,null,null,null,null,null,null,null,null,null,null,null,null,null,null,null,null,null,null,null,null,null,null,null,null,null,null,null,null,null,null,null,null,null,null,null,null,null,null,null,null,null,null,null,null,null,null,null,null,null,null,"Did not participate in other activities","N/A","N/A","N/A","N/A","N/A","N/A","N/A","N/A","N/A","N/A","N/A","N/A","N/A","N/A","N/A"]
[null,null,null,null,null,null,null,null,null,null,null,null,null,null,null,null,null,null,null,null,null,null,null,null,null,null,null,null,null,null,null,null,null,null,null,null,null,null,null,null,null,null,null,null,null,null,null,null,null,null,null,null,null,"DK/not sure/missing/no such activity","N/A","N/A","N/A","N/A","N/A","N/A","N/A","N/A","N/A","N/A","N/A","N/A","N/A","N/A","N/A"]
[]
[]
[]
[]
[]
[]
[]
[]
[]
[]
[]
[]
[]
[]
[]
[]
[]
[]
[]
[]
[]
[]
[]
[]
[]
[]
[]
[]
[]
[]
[]
[]
[]
[]
[]
[]
[]
[]
[]
[]
[]
[]
[]
[]
[]
[]
[]
[]
[]
[]
[]
[]
[]
[]
[null,null,null,null,null,null,null,null,null,null,null,null,null,null,null,null,null,null,null,null,null,null,null,null,null,null,null,null,null,null,null,null,null,null,null,null,null,null,null,null,null,null,null,null,null,null,null,null,null,null,null,null,"Raw numbers of respondents:","Basic water, sanitation and hygiene","NATIONAL wealth index quintile",null,null,null,null,"URBAN wealth index quintile",null,null,null,null,"RURAL wealth index quintile"]
[null,null,null,null,null,null,null,null,null,null,null,null,null,null,null,null,null,null,null,null,null,null,null,null,null,null,null,null,null,null,null,null,null,null,null,null,null,null,null,null,null,null,null,null,null,null,null,null,null,null,null,null,"WatSan data, raw numbers (weighted)",null,"Poorest","Poor","Middle","Rich","Richest","Poorest","Poor","Middle","Rich","Richest","Poorest","Poor","Middle","Rich","Richest"]
[null,null,null,null,null,null,null,null,null,null,null,null,null,null,null,null,null,null,null,null,null,null,null,null,null,null,null,null,null,null,null,null,null,null,null,null,null,null,null,null,null,null,null,null,null,null,null,null,null,null,null,null,"Use of Basic Water Sanitation and Hygiene","Yes","N/A","N/A","N/A","N/A","N/A","N/A","N/A","N/A","N/A","N/A","N/A","N/A","N/A","N/A","N/A"]
[null,null,null,null,null,null,null,null,null,null,null,null,null,null,null,null,null,null,null,null,null,null,null,null,null,null,null,null,null,null,null,null,null,null,null,null,null,null,null,null,null,null,null,null,null,null,null,null,null,null,null,null,null,"No","N/A","N/A","N/A","N/A","N/A","N/A","N/A","N/A","N/A","N/A","N/A","N/A","N/A","N/A","N/A"]
[null,null,null,null,null,null,null,null,null,null,null,null,null,null,null,null,null,null,null,null,null,null,null,null,null,null,null,null,null,null,null,null,null,null,null,null,null,null,null,null,null,null,null,null,null,null,null,null,null,null,null,null,"Use of Basic Water and Sanitation","Yes","N/A","N/A","N/A","N/A","N/A","N/A","N/A","N/A","N/A","N/A","N/A","N/A","N/A","N/A","N/A"]
[null,null,null,null,null,null,null,null,null,null,null,null,null,null,null,null,null,null,null,null,null,null,null,null,null,null,null,null,null,null,null,null,null,null,null,null,null,null,null,null,null,null,null,null,null,null,null,null,null,null,null,null,null,"No","N/A","N/A","N/A","N/A","N/A","N/A","N/A","N/A","N/A","N/A","N/A","N/A","N/A","N/A","N/A"]
[null,null,null,null,null,null,null,null,null,null,null,null,null,null,null,null,null,null,null,null,null,null,null,null,null,null,null,null,null,null,null,null,null,null,null,null,null,null,null,null,null,null,null,null,null,null,null,null,null,null,null,null,"Use of Basic Water and Hygiene","Yes","N/A","N/A","N/A","N/A","N/A","N/A","N/A","N/A","N/A","N/A","N/A","N/A","N/A","N/A","N/A"]
[null,null,null,null,null,null,null,null,null,null,null,null,null,null,null,null,null,null,null,null,null,null,null,null,null,null,null,null,null,null,null,null,null,null,null,null,null,null,null,null,null,null,null,null,null,null,null,null,null,null,null,null,null,"No","N/A","N/A","N/A","N/A","N/A","N/A","N/A","N/A","N/A","N/A","N/A","N/A","N/A","N/A","N/A"]
[null,null,null,null,null,null,null,null,null,null,null,null,null,null,null,null,null,null,null,null,null,null,null,null,null,null,null,null,null,null,null,null,null,null,null,null,null,null,null,null,null,null,null,null,null,null,null,null,null,null,null,null,"Use of Basic Sanitation and Hygiene","Yes","N/A","N/A","N/A","N/A","N/A","N/A","N/A","N/A","N/A","N/A","N/A","N/A","N/A","N/A","N/A"]
[null,null,null,null,null,null,null,null,null,null,null,null,null,null,null,null,null,null,null,null,null,null,null,null,null,null,null,null,null,null,null,null,null,null,null,null,null,null,null,null,null,null,null,null,null,null,null,null,null,null,null,null,null,"No","N/A","N/A","N/A","N/A","N/A","N/A","N/A","N/A","N/A","N/A","N/A","N/A","N/A","N/A","N/A"]
[null,null,null,null,null,null,null,null,null,null,null,null,null,null,null,null,null,null,null,null,null,null,null,null,null,null,null,null,null,null,null,null,null,null,null,null,null,null,null,null,null,null,null,null,null,null,null,null,null,null,null,null,"Use of Basic Water","Yes","N/A","N/A","N/A","N/A","N/A","N/A","N/A","N/A","N/A","N/A","N/A","N/A","N/A","N/A","N/A"]
[null,null,null,null,null,null,null,null,null,null,null,null,null,null,null,null,null,null,null,null,null,null,null,null,null,null,null,null,null,null,null,null,null,null,null,null,null,null,null,null,null,null,null,null,null,null,null,null,null,null,null,null,null,"No","N/A","N/A","N/A","N/A","N/A","N/A","N/A","N/A","N/A","N/A","N/A","N/A","N/A","N/A","N/A"]
[null,null,null,null,null,null,null,null,null,null,null,null,null,null,null,null,null,null,null,null,null,null,null,null,null,null,null,null,null,null,null,null,null,null,null,null,null,null,null,null,null,null,null,null,null,null,null,null,null,null,null,null,"Use of Basic Sanitation","Yes","N/A","N/A","N/A","N/A","N/A","N/A","N/A","N/A","N/A","N/A","N/A","N/A","N/A","N/A","N/A"]
[null,null,null,null,null,null,null,null,null,null,null,null,null,null,null,null,null,null,null,null,null,null,null,null,null,null,null,null,null,null,null,null,null,null,null,null,null,null,null,null,null,null,null,null,null,null,null,null,null,null,null,null,null,"No","N/A","N/A","N/A","N/A","N/A","N/A","N/A","N/A","N/A","N/A","N/A","N/A","N/A","N/A","N/A"]
[null,null,null,null,null,null,null,null,null,null,null,null,null,null,null,null,null,null,null,null,null,null,null,null,null,null,null,null,null,null,null,null,null,null,null,null,null,null,null,null,null,null,null,null,null,null,null,null,null,null,null,null,"Access to Basic Hygiene","Yes","N/A","N/A","N/A","N/A","N/A","N/A","N/A","N/A","N/A","N/A","N/A","N/A","N/A","N/A","N/A"]
[null,null,null,null,null,null,null,null,null,null,null,null,null,null,null,null,null,null,null,null,null,null,null,null,null,null,null,null,null,null,null,null,null,null,null,null,null,null,null,null,null,null,null,null,null,null,null,null,null,null,null,null,null,"No","N/A","N/A","N/A","N/A","N/A","N/A","N/A","N/A","N/A","N/A","N/A","N/A","N/A","N/A","N/A"]
[]
[]
[]
[]
[]
[]
[]
[]
[]
[]
[]
[]
[]
[]
[]
[]
[]
[]
[]
[]
[]
[]
[]
[]
[]
[]
[]
[]
[]
[]
[]
[]
[]
[]
[]
[]
[]
[]
[]
[]
[]
[]
[]
[]
[null,null,"INITIAL (national) Wealth Index",null,null,null,null,"URBAN Wealth Index",null,null,null,null,"RURAL Wealth Index"]
[null,null,"Matrice des composantes",null,null,null,null,"Matrice des composantes",null,null,null,null,"Matrice des composantes"]
[null,null,null,null,"Composante",null,null,null,null,"Composante",null,null,null,null,"Composante"]
[null,"Note:\n\nThe INITIAL (national) Wealth Index is based on the first component of the Principal Component Analysis (PCA) which has been obtained at national level.\n\nThe final national-level (NATIONAL) Wealth Index is based on the URBAN and RURAL specific wealth indexes. Regression procedures are used to establish the relationships between the two sets of scores (urban and rural) and the initial (national) wealth factors.\nThis allows best use of the available information for each area and a better precision of the FINAL (NATIONAL) Wealth Index.\n\nFor dependency reasons, all WASH variables (contained in the generic MICS and DHS scripts) have been excluded from the sets of asset variables used in the PCAs.\n\nThe PCA can extracts as many components as there are asset variables in the input. Only the first of the components is used to represent the Wealth Index. \n\nThe scores represent the weights of the asset variables on the Wealth Index (correlations between the variables and the component).\n\nThe communalities are the proportion of each variable's variance that can be explained by the component.\n\nProportion of explained variance is the part of the model's total variance that is explained by the component.\n\nFor more information on the procedure used:\n\nThe DHS Wealth Index, DHS Comparative Reports No. 6, Shea Oscar Rutstein, Kiersten Johnson, ORC Macro International Inc., 2004.\n\nThe DHS Wealth Index: Approaches for Rural and Urban Areas, Shea O. Rutstein, ORC Macro International Inc., 2008.\n\nMICS Methodological Paper No. 4, Review of options for reporting water, sanitation and hygiene coverage by wealth quintile, UNICEF, 2016.",null,null,"1",null,null,null,null,"1",null,null,null,null,"1"]
[null,null,"electrfu Uses electricity fuel",null,-0.72455197614102074,null,null,"q0708 Has Clothes washing machine",null,0.68546376167014667,null,null,"electrfu Uses electricity fuel",null,-0.74464870201522626]
[null,null,"q0710 Has Vacuum cleaner",null,0.68267493812758961,null,null,"q0710 Has Vacuum cleaner",null,0.66272022222127758,null,null,"q0710 Has Vacuum cleaner",null,0.68880472998821907]
[null,null,"q0704 Has Video",null,0.66291468740667026,null,null,"bike Has Bicycle",null,0.6539444994888145,null,null,"q0713 Has Cellular phone",null,0.63656454678929364]
[null,null,"q0713 Has Cellular phone",null,0.65265989945778402,null,null,"q0713 Has Cellular phone",null,0.64866027705970075,null,null,"electrhe Uses electricity heating",null,-0.63124640954505984]
[null,null,"q0708 Has Clothes washing machine",null,0.63738376037772926,null,null,"electrfu Uses electricity fuel",null,-0.58450636060094707,null,null,"q0704 Has Video",null,0.62869246279956315]
[null,null,"bike Has Bicycle",null,0.57935255554854237,null,null,"q0704 Has Video",null,0.57686916546269584,null,null,"woodfu Uses wood fuel",null,0.55341972265483097]
[null,null,"woodfu Uses wood fuel",null,0.56439777539832625,null,null,"q0711 Has Refrigerator",null,0.56687010563390161,null,null,"q0708 Has Clothes washing machine",null,0.54793039439888169]
[null,null,"electrhe Uses electricity heating",null,-0.55328396456839046,null,null,"q0712 Has Telephone",null,0.55618502244360224,null,null,"earthfl Has hearth floor",null,0.51524193229142823]
[null,null,"q0711 Has Refrigerator",null,0.54059906481892284,null,null,"q0714 Has Computer",null,0.55537105197809122,null,null,"cementwl Has cement, brick, stone or wood wall",null,-0.51026971337192484]
[null,null,"q0712 Has Telephone",null,0.51683764908721419,null,null,"electrhe Uses electricity heating",null,-0.45928267276329277,null,null,"mudwl Has mud brick wall",null,0.50913873625062755]
[null,null,"mudwl Has mud brick wall",null,0.50550268178388869,null,null,"q0705 Has Stereo",null,0.45529881183460508,null,null,"q0712 Has Telephone",null,0.49195937824533509]
[null,null,"earthfl Has hearth floor",null,0.50249071785359767,null,null,"q0706 Has DVD",null,0.42874883599443236,null,null,"bike Has Bicycle",null,0.48868385363955791]
[null,null,"q0714 Has Computer",null,0.48981424183863459,null,null,"livingki Uses living or sleeping room as kitchen",null,0.38690906541319775,null,null,"hardfl Has hard floor",null,-0.46873574502364751]
[null,null,"openst Uses open fire without chimney",null,0.48013045128188636,null,null,"q0709 Has Dish washing machine",null,0.36352613133227796,null,null,"q0711 Has Refrigerator",null,0.44731708499862277]
[null,null,"woodhe Uses wood heating",null,0.45903562284437444,null,null,"earthfl Has hearth floor",null,0.3545314751825312,null,null,"openst Uses open fire without chimney",null,0.44482232966600443]
[null,null,"hardfl Has hard floor",null,-0.41368753331069014,null,null,"kerozefu Uses kerozene fuel",null,0.33168141490027025,null,null,"woodhe Uses wood heating",null,0.43150278100693085]
[null,null,"cementwl Has cement, brick, stone or wood wall",null,-0.38409913594203754,null,null,"heatho Heats house",null,-0.31678869434805196,null,null,"q0705 Has Stereo",null,0.3686658270843392]
[null,null,"q0705 Has Stereo",null,0.38152564832266928,null,null,"TV Has TV",null,0.30912686397878192,null,null,"q0714 Has Computer",null,0.35644713102706344]
[null,null,"openhhe Uses open fire without chimney",null,0.34767587643661263,null,null,"mudwl Has mud brick wall",null,0.30891469214738565,null,null,"openhhe Uses open fire without chimney",null,0.32280059013139684]
[null,null,"q0709 Has Dish washing machine",null,0.34238497199778251,null,null,"openst Uses open fire without chimney",null,0.3009031692100092,null,null,"TV Has TV",null,0.32265642259510108]
[null,null,"livingki Uses living or sleeping room as kitchen",null,0.34222722008272266,null,null,"woodfu Uses wood fuel",null,0.28328727257157899,null,null,"q0709 Has Dish washing machine",null,0.32228902725906805]
[null,null,"kerozefu Uses kerozene fuel",null,0.34081695707789122,null,null,"hardfl Has hard floor",null,-0.28239123990700471,null,null,"car Has Car",null,0.3098670619277753]
[null,null,"q0706 Has DVD",null,0.33978126419334709,null,null,"car Has Car",null,0.26803299171145761,null,null,"kerozefu Uses kerozene fuel",null,0.28328668556047454]
[null,null,"TV Has TV",null,0.33665199134321544,null,null,"q0707 Has Camera",null,0.24432712654457991,null,null,"livingki Uses living or sleeping room as kitchen",null,0.27829217504774745]
[null,null,"car Has Car",null,0.31033001251817804,null,null,"gazfu Uses gaz fuel",null,0.22989703010105189,null,null,"q0706 Has DVD",null,0.23598043612377217]
[null,null,"separeki Uses separate room as kitchen",null,0.29766527191856312,null,null,"buildiki Uses separate building as kitchen",null,0.19480686464431765,null,null,"outdooki Kooks outdoor",null,0.22992988805740641]
[null,null,"outdooki Kooks outdoor",null,0.27078881767186819,null,null,"coalfu Uses coal fuel",null,0.18946386816823813,null,null,"separeki Uses separate room as kitchen",null,0.21721035976922992]
[null,null,"buildiki Uses separate building as kitchen",null,0.23949429143999496,null,null,"outdooki Kooks outdoor",null,0.18055108648047485,null,null,"q0707 Has Camera",null,0.19825804480773951]
[null,null,"heatho Heats house",null,-0.23885090168793219,null,null,"woodhe Uses wood heating",null,0.16873014473079276,null,null,"heatho Heats house",null,-0.19659789154793783]
[null,null,"chimnest Uses open fire with chimney",null,0.22712554635037049,null,null,"separeki Uses separate room as kitchen",null,0.16462184485595213,null,null,"buildiki Uses separate building as kitchen",null,0.1910484229011461]
[null,null,"q0707 Has Camera",null,0.21231170672113708,null,null,"openhhe Uses open fire without chimney",null,0.14876149751298939,null,null,"chimnest Uses open fire with chimney",null,0.17957387796633192]
[null,null,"metalwl Has metal sheet wall",null,0.13332302588021711,null,null,"cementwl Has cement, brick, stone or wood wall",null,-0.1463262579734686,null,null,"metalwl Has metal sheet wall",null,0.10185923709217595]
[null,null,"chimnehe Uses open fire with chimney",null,0.12618676501419951,null,null,"kerozehe Uses kerozene heating",null,0.12834826483791137,null,null,"thatchwl Has thatch wall",null,9.9711944903199165E-2]
[null,null,"coalfu Uses coal fuel",null,0.11850554655280496,null,null,"closedst Uses closed stove with chimney",null,0.11956703672861983,null,null,"closedhe Uses closed stove with chimney",null,-9.3107691231634884E-2]
[null,null,"kerozehe Uses kerozene heating",null,0.10327040552019437,null,null,"coalhe Uses coal heating",null,0.11715655087076375,null,null,"chimnehe Uses open fire with chimney",null,8.8617354204829704E-2]
[null,null,"closedst Uses closed stove with chimney",null,8.6583137456596834E-2,null,null,"q0716 Has Magazine",null,0.11442138942989455,null,null,"q0718 Has Employee",null,8.3198905476654983E-2]
[null,null,"gazfu Uses gaz fuel",null,8.5180575013036289E-2,null,null,"metalwl Has metal sheet wall",null,9.7687617556429879E-2,null,null,"closedst Uses closed stove with chimney",null,-6.3829606256923369E-2]
[null,null,"q0716 Has Magazine",null,7.1744687337962992E-2,null,null,"closedhe Uses closed stove with chimney",null,9.603794331741955E-2,null,null,"q0716 Has Magazine",null,5.9948628090855535E-2]
[null,null,"coalhe Uses coal heating",null,7.0201423865845339E-2,null,null,"chimnest Uses open fire with chimney",null,9.1008633814657985E-2,null,null,"dunghe Uses animal dung heating",null,5.3242378182826962E-2]
[null,null,"q0717 Has Security system",null,6.2644402312715564E-2,null,null,"q0717 Has Security system",null,9.0212062178376393E-2,null,null,"kerozehe Uses kerozene heating",null,4.9249836490096996E-2]
[null,null,"q0718 Has Employee",null,5.8756185473214755E-2,null,null,"q0715 Has Internet",null,8.1501559137772128E-2,null,null,"q0717 Has Security system",null,4.4841629721581656E-2]
[null,null,"closedhe Uses closed stove with chimney",null,5.4648475446409335E-2,null,null,"q0718 Has Employee",null,6.3295903807782272E-2,null,null,"dungfu Uses animal dung fuel",null,4.479522503835312E-2]
[null,null,"thatchwl Has thatch wall",null,5.2739029931911152E-2,null,null,"charcohe Uses charcoal heating",null,-5.3465636951682612E-2,null,null,"coalfu Uses coal fuel",null,4.189296513836676E-2]
[null,null,"q0715 Has Internet",null,4.9574609449572336E-2,null,null,"plastiwl Has plastic sheet wall",null,4.7905849695930175E-2,null,null,"charcohe Uses charcoal heating",null,-3.7694647249166997E-2]
[null,null,"dunghe Uses animal dung heating",null,4.8641622429734313E-2,null,null,"gazhe Uses gaz heating",null,4.5575693195745962E-2,null,null,"q0719 Has Second home",null,3.6379217697170986E-2]
[null,null,"charcohe Uses charcoal heating",null,-4.3667134443675974E-2,null,null,"chimnehe Uses open fire with chimney",null,3.4233652713576222E-2,null,null,"coalhe Uses coal heating",null,3.3777080464538478E-2]
[null,null,"dungfu Uses animal dung fuel",null,3.9222257863943281E-2,null,null,"thatchwl Has thatch wall",null,-3.283337738064443E-2,null,null,"gazfu Uses gaz fuel",null,-3.3555502708042216E-2]
[null,null,"plastiwl Has plastic sheet wall",null,3.5795096776413078E-2,null,null,"q0719 Has Second home",null,-4.8110870360789145E-3,null,null,"charcofu Uses charcoal fuel",null,2.5982629691461031E-2]
[null,null,"charcofu Uses charcoal fuel",null,3.5183343315594848E-2,null,null,null,null,null,null,null,"plastiwl Has plastic sheet wall",null,1.7775991455265084E-2]
[null,null,"agcropfu Uses agriculture crop fuel",null,2.5348676602368732E-2,null,null,null,null,null,null,null,"gazhe Uses gaz heating",null,-1.2270291853305916E-2]
[null,null,"gazhe Uses gaz heating",null,-1.2703888618982523E-2,null,null,null,null,null,null,null,"q0715 Has Internet",null,6.1397481745387936E-3]
[null,null,"q0719 Has Second home",null,1.2196684715503413E-2,null,null,"Qualités de représentation",null,null,null,null,"agcropfu Uses agriculture crop fuel",null,-1.6696584241289382E-3]
[null,null,null,null,null,null,null,null,null,"Extraction"]
[null,null,null,null,null,null,null,"hardfl Has hard floor",null,7.9744812376215488E-2]
[null,null,null,null,null,null,null,"earthfl Has hearth floor",null,0.12569256689510172]
[null,null,"Qualités de représentation",null,null,null,null,"cementwl Has cement, brick, stone or wood wall",null,2.1411373772518082E-2,null,null,"Qualités de représentation"]
[null,null,null,null,"Extraction",null,null,"mudwl Has mud brick wall",null,9.5428287024514044E-2,null,null,null,null,"Extraction"]
[null,null,"hardfl Has hard floor",null,0.17113737521668337,null,null,"thatchwl Has thatch wall",null,1.0780306702198132E-3,null,null,"hardfl Has hard floor",null,0.21971319866287389]
[null,null,"earthfl Has hearth floor",null,0.25249692152902392,null,null,"plastiwl Has plastic sheet wall",null,2.2949704350890532E-3,null,null,"earthfl Has hearth floor",null,0.26547424879140469]
[null,null,"cementwl Has cement, brick, stone or wood wall",null,0.14753214623141983,null,null,"metalwl Has metal sheet wall",null,9.5428706238513076E-3,null,null,"cementwl Has cement, brick, stone or wood wall",null,0.26037518038466634]
[null,null,"mudwl Has mud brick wall",null,0.25553296129070341,null,null,"gazfu Uses gaz fuel",null,5.2852644449283961E-2,null,null,"mudwl Has mud brick wall",null,0.25922225275088606]
[null,null,"thatchwl Has thatch wall",null,2.7814052781590204E-3,null,null,"electrfu Uses electricity fuel",null,0.34164768558296438,null,null,"thatchwl Has thatch wall",null,9.9424719563786252E-3]
[null,null,"plastiwl Has plastic sheet wall",null,1.2812889532327779E-3,null,null,"kerozefu Uses kerozene fuel",null,0.11001256099024521,null,null,"plastiwl Has plastic sheet wall",null,3.1598587221765728E-4]
[null,null,"metalwl Has metal sheet wall",null,1.7775029229857041E-2,null,null,"coalfu Uses coal fuel",null,3.5896557341271514E-2,null,null,"metalwl Has metal sheet wall",null,1.0375304181000113E-2]
[null,null,"gazfu Uses gaz fuel",null,7.2557303595515025E-3,null,null,"woodfu Uses wood fuel",null,8.0251678801044085E-2,null,null,"gazfu Uses gaz fuel",null,1.1259717619894285E-3]
[null,null,"electrfu Uses electricity fuel",null,0.5249755661298583,null,null,"openst Uses open fire without chimney",null,9.0542717240627429E-2,null,null,"electrfu Uses electricity fuel",null,0.55450168941296119]
[null,null,"kerozefu Uses kerozene fuel",null,0.11615619823183315,null,null,"chimnest Uses open fire with chimney",null,8.2825714288105087E-3,null,null,"kerozefu Uses kerozene fuel",null,8.0251346215839167E-2]
[null,null,"coalfu Uses coal fuel",null,1.4043564563779023E-2,null,null,"closedst Uses closed stove with chimney",null,1.4296276272063124E-2,null,null,"coalfu Uses coal fuel",null,1.7550205280844127E-3]
[null,null,"charcofu Uses charcoal fuel",null,1.2378676468630127E-3,null,null,"livingki Uses living or sleeping room as kitchen",null,0.14969862489891414,null,null,"charcofu Uses charcoal fuel",null,6.7509704568359237E-4]
[null,null,"woodfu Uses wood fuel",null,0.31854484887457951,null,null,"separeki Uses separate room as kitchen",null,2.7100351803777175E-2,null,null,"woodfu Uses wood fuel",null,0.30627338942335003]
[null,null,"agcropfu Uses agriculture crop fuel",null,6.4255540549147596E-4,null,null,"buildiki Uses separate building as kitchen",null,3.7949714512549498E-2,null,null,"agcropfu Uses agriculture crop fuel",null,2.7877592532647293E-6]
[null,null,"dungfu Uses animal dung fuel",null,1.5383855119456605E-3,null,null,"outdooki Kooks outdoor",null,3.2598694829279906E-2,null,null,"dungfu Uses animal dung fuel",null,2.0066121862366984E-3]
[null,null,"openst Uses open fire without chimney",null,0.23052525024814785,null,null,"heatho Heats house",null,0.10035507686674348,null,null,"openst Uses open fire without chimney",null,0.19786690496949152]
[null,null,"chimnest Uses open fire with chimney",null,5.1586013804954298E-2,null,null,"gazhe Uses gaz heating",null,2.0771438102727647E-3,null,null,"chimnest Uses open fire with chimney",null,3.224677764786707E-2]
[null,null,"closedst Uses closed stove with chimney",null,7.4966396918279415E-3,null,null,"electrhe Uses electricity heating",null,0.21094057350059386,null,null,"closedst Uses closed stove with chimney",null,4.0742186349138707E-3]
[null,null,"livingki Uses living or sleeping room as kitchen",null,0.11711947016554829,null,null,"kerozehe Uses kerozene heating",null,1.6473277086902636E-2,null,null,"livingki Uses living or sleeping room as kitchen",null,7.7446534692806102E-2]
[null,null,"separeki Uses separate room as kitchen",null,8.860461410635212E-2,null,null,"coalhe Uses coal heating",null,1.3725657411933854E-2,null,null,"separeki Uses separate room as kitchen",null,4.7180340391078296E-2]
[null,null,"buildiki Uses separate building as kitchen",null,5.7357515632345243E-2,null,null,"charcohe Uses charcoal heating",null,2.8585743346491292E-3,null,null,"buildiki Uses separate building as kitchen",null,3.6499499893015167E-2]
[null,null,"outdooki Kooks outdoor",null,7.3326583776128273E-2,null,null,"woodhe Uses wood heating",null,2.8469861740874271E-2,null,null,"outdooki Kooks outdoor",null,5.2867753422091442E-2]
[null,null,"heatho Heats house",null,5.7049753237138248E-2,null,null,"openhhe Uses open fire without chimney",null,2.2129983142307151E-2,null,null,"heatho Heats house",null,3.8650730961094726E-2]
[null,null,"gazhe Uses gaz heating",null,1.6138878604351369E-4,null,null,"chimnehe Uses open fire with chimney",null,1.1719429781137445E-3,null,null,"gazhe Uses gaz heating",null,1.5056006216530553E-4]
[null,null,"electrhe Uses electricity heating",null,0.30612314544851593,null,null,"closedhe Uses closed stove with chimney",null,9.2232865566398911E-3,null,null,"electrhe Uses electricity heating",null,0.3984720295635294]
[null,null,"kerozehe Uses kerozene heating",null,1.0664776656305391E-2,null,null,"car Has Car",null,7.184168464579431E-2,null,null,"kerozehe Uses kerozene heating",null,2.4255463943012897E-3]
[null,null,"coalhe Uses coal heating",null,4.9282399127920798E-3,null,null,"TV Has TV",null,9.5559418033356339E-2,null,null,"coalhe Uses coal heating",null,1.1408911647079068E-3]
[null,null,"charcohe Uses charcoal heating",null,1.9068186305220727E-3,null,null,"bike Has Bicycle",null,0.42764340841167608,null,null,"charcohe Uses charcoal heating",null,1.4208864312391331E-3]
[null,null,"woodhe Uses wood heating",null,0.21071370304012277,null,null,"q0704 Has Video",null,0.33277803406162715,null,null,"woodhe Uses wood heating",null,0.18619465001671531]
[null,null,"dunghe Uses animal dung heating",null,2.3660074325968323E-3,null,null,"q0705 Has Stereo",null,0.20729700805800311,null,null,"dunghe Uses animal dung heating",null,2.8347508345631686E-3]
[null,null,"openhhe Uses open fire without chimney",null,0.12087851505596674,null,null,"q0706 Has DVD",null,0.18382556436658065,null,null,"openhhe Uses open fire without chimney",null,0.10420022098917806]
[null,null,"chimnehe Uses open fire with chimney",null,1.5923099664748804E-2,null,null,"q0707 Has Camera",null,5.9695744765531168E-2,null,null,"chimnehe Uses open fire with chimney",null,7.853035466264249E-3]
[null,null,"closedhe Uses closed stove with chimney",null,2.9864558686168038E-3,null,null,"q0708 Has Clothes washing machine",null,0.46986056856298763,null,null,"closedhe Uses closed stove with chimney",null,8.6690421664854592E-3]
[null,null,"car Has Car",null,9.6304716669532539E-2,null,null,"q0709 Has Dish washing machine",null,0.1321512481614126,null,null,"car Has Car",null,9.6017596067751732E-2]
[null,null,"TV Has TV",null,0.11333456327535241,null,null,"q0710 Has Vacuum cleaner",null,0.43919809294101952,null,null,"TV Has TV",null,0.10410716704186845]
[null,null,"bike Has Bicycle",null,0.33564938362062685,null,null,"q0711 Has Refrigerator",null,0.32134171666139077,null,null,"bike Has Bicycle",null,0.23881190880800884]
[null,null,"q0704 Has Video",null,0.43945588277948333,null,null,"q0712 Has Telephone",null,0.3093417791905903,null,null,"q0704 Has Video",null,0.39525421278098011]
[null,null,"q0705 Has Stereo",null,0.14556182032803311,null,null,"q0713 Has Cellular phone",null,0.42076015503516773,null,null,"q0705 Has Stereo",null,0.1359144920597799]
[null,null,"q0706 Has DVD",null,0.11545130749682914,null,null,"q0714 Has Computer",null,0.3084370053752517,null,null,"q0706 Has DVD",null,5.5686766233165721E-2]
[null,null,"q0707 Has Camera",null,4.5076260810842123E-2,null,null,"q0715 Has Internet",null,6.6425041418877676E-3,null,null,"q0707 Has Camera",null,3.9306252330987647E-2]
[null,null,"q0708 Has Clothes washing machine",null,0.4062580579932546,null,null,"q0716 Has Magazine",null,1.3092254359067584E-2,null,null,"q0708 Has Clothes washing machine",null,0.30022771710611407]
[null,null,"q0709 Has Dish washing machine",null,0.11722746904992232,null,null,"q0717 Has Security system",null,8.1382161624752487E-3,null,null,"q0709 Has Dish washing machine",null,0.10387021709159631]
[null,null,"q0710 Has Vacuum cleaner",null,0.46604507114750832,null,null,"q0718 Has Employee",null,4.0063714388440261E-3,null,null,"q0710 Has Vacuum cleaner",null,0.47445195605414336]
[null,null,"q0711 Has Refrigerator",null,0.29224734888309395,null,null,"q0719 Has Second home",null,2.3146558468726594E-5,null,null,"q0711 Has Refrigerator",null,0.2000925745316651]
[null,null,"q0712 Has Telephone",null,0.26712115551399834,null,null,null,null,null,null,null,"q0712 Has Telephone",null,0.24202402984353669]
[null,null,"q0713 Has Cellular phone",null,0.42596494436024473,null,null,null,null,null,null,null,"q0713 Has Cellular phone",null,0.40521442222905879]
[null,null,"q0714 Has Computer",null,0.23991799150795642,null,null,"Variance totale expliquée",null,null,null,null,"q0714 Has Computer",null,0.12705455721742454]
[null,null,"q0715 Has Internet",null,2.457641902077627E-3,null,null,"Composante",null,"Sommes extraites du carré des chargements",null,null,"q0715 Has Internet",null,3.7696507646752447E-5]
[null,null,"q0716 Has Magazine",null,5.1473001612220674E-3,null,null,null,null,"Total","% de la variance","% cumulé","q0716 Has Magazine",null,3.5938380099757132E-3]
[null,null,"q0717 Has Security system",null,3.9243211411173632E-3,null,null,"1",null,5.5353822883085035,11.532046433976049,11.532046433976049,"q0717 Has Security system",null,2.0107717560874355E-3]
[null,null,"q0718 Has Employee",null,3.4522893313628125E-3,null,null,null,null,null,null,null,"q0718 Has Employee",null,6.9220578725133703E-3]
[null,null,"q0719 Has Second home",null,1.4875911804939458E-4,null,null,null,null,null,null,null,"q0719 Has Second home",null,1.3234474802581587E-3]
[null,null,null,null,null,null,null,"Matrice des coefficients des composantes"]
[null,null,null,null,null,null,null,null,null,"Composante"]
[null,null,"Variance totale expliquée",null,null,null,null,null,null,"1",null,null,"Variance totale expliquée"]
[null,null,"Composante",null,"Sommes extraites du carré des chargements",null,null,"hardfl Has hard floor",null,-5.101567067977477E-2,null,null,"Composante",null,"Sommes extraites du carré des chargements"]
[null,null,null,null,"Total","% de la variance","% cumulé","earthfl Has hearth floor",null,6.4048236728175195E-2,null,null,null,null,"Total","% de la variance","% cumulé"]
[null,null,"1",null,6.7133961207021615,12.910377155196464,12.910377155196464,"cementwl Has cement, brick, stone or wood wall",null,-2.6434715861003849E-2,null,null,"1",null,6.1041266116568949,11.738705022417104,11.738705022417104]
[null,null,null,null,null,null,null,"mudwl Has mud brick wall",null,5.5807291359055072E-2]
[null,null,null,null,null,null,null,"thatchwl Has thatch wall",null,-5.9315464895700306E-3]
[null,null,"Matrice des coefficients des composantes",null,null,null,null,"plastiwl Has plastic sheet wall",null,8.6544789864132741E-3,null,null,"Matrice des coefficients des composantes"]
[null,null,null,null,"Composante",null,null,"metalwl Has metal sheet wall",null,1.7647853837079997E-2,null,null,null,null,"Composante"]
[null,null,null,null,"1",null,null,"gazfu Uses gaz fuel",null,4.153227692812226E-2,null,null,null,null,"1"]
[null,null,"hardfl Has hard floor",null,-6.162120123300905E-2,null,null,"electrfu Uses electricity fuel",null,-0.10559457868619222,null,null,"hardfl Has hard floor",null,-7.6789977476632743E-2]
[null,null,"earthfl Has hearth floor",null,7.4848960022493319E-2,null,null,"kerozefu Uses kerozene fuel",null,5.9920236331432328E-2,null,null,"earthfl Has hearth floor",null,8.4408788524714382E-2]
[null,null,"cementwl Has cement, brick, stone or wood wall",null,-5.7213834702467145E-2,null,null,"coalfu Uses coal fuel",null,3.4227783791629371E-2,null,null,"cementwl Has cement, brick, stone or wood wall",null,-8.3594221718382405E-2]
[null,null,"mudwl Has mud brick wall",null,7.5297609837897919E-2,null,null,"woodfu Uses wood fuel",null,5.1177544353155344E-2,null,null,"mudwl Has mud brick wall",null,8.3408940974182652E-2]
[null,null,"thatchwl Has thatch wall",null,7.8557899733160876E-3,null,null,"openst Uses open fire without chimney",null,5.4359961704100991E-2,null,null,"thatchwl Has thatch wall",null,1.6335169836218959E-2]
[null,null,"plastiwl Has plastic sheet wall",null,5.331891062711377E-3,null,null,"chimnest Uses open fire with chimney",null,1.6441255377588077E-2,null,null,"plastiwl Has plastic sheet wall",null,2.9121269243201353E-3]
[null,null,"metalwl Has metal sheet wall",null,1.9859252080938243E-2,null,null,"closedst Uses closed stove with chimney",null,2.1600502097418279E-2,null,null,"metalwl Has metal sheet wall",null,1.6686946974143354E-2]
[null,null,"gazfu Uses gaz fuel",null,1.2688149705685351E-2,null,null,"livingki Uses living or sleeping room as kitchen",null,6.9897442536246038E-2,null,null,"gazfu Uses gaz fuel",null,-5.4971832733551312E-3]
[null,null,"electrfu Uses electricity fuel",null,-0.10792629588871024,null,null,"separeki Uses separate room as kitchen",null,2.9739923329894728E-2,null,null,"electrfu Uses electricity fuel",null,-0.12199103154138212]
[null,null,"kerozefu Uses kerozene fuel",null,5.0766698545749583E-2,null,null,"buildiki Uses separate building as kitchen",null,3.5193028141123475E-2,null,null,"kerozefu Uses kerozene fuel",null,4.6409044828704754E-2]
[null,null,"coalfu Uses coal fuel",null,1.7652101026389363E-2,null,null,"outdooki Kooks outdoor",null,3.2617636339557582E-2,null,null,"coalfu Uses coal fuel",null,6.8630563885036114E-3]
[null,null,"charcofu Uses charcoal fuel",null,5.2407667718428908E-3,null,null,"heatho Heats house",null,-5.7229777068361416E-2,null,null,"charcofu Uses charcoal fuel",null,4.2565679489417309E-3]
[null,null,"woodfu Uses wood fuel",null,8.4070381853066548E-2,null,null,"gazhe Uses gaz heating",null,8.2335222432618881E-3,null,null,"woodfu Uses wood fuel",null,9.0663211604749383E-2]
[null,null,"agcropfu Uses agriculture crop fuel",null,3.7758350835579014E-3,null,null,"electrhe Uses electricity heating",null,-8.297216864919367E-2,null,null,"agcropfu Uses agriculture crop fuel",null,-2.7352945480200785E-4]
[null,null,"dungfu Uses animal dung fuel",null,5.8423869467486437E-3,null,null,"kerozehe Uses kerozene heating",null,2.3186883606756616E-2,null,null,"dungfu Uses animal dung fuel",null,7.3385150551773968E-3]
[null,null,"openst Uses open fire without chimney",null,7.151826626188551E-2,null,null,"coalhe Uses coal heating",null,2.1165033374156407E-2,null,null,"openst Uses open fire without chimney",null,7.2872395670256662E-2]
[null,null,"chimnest Uses open fire with chimney",null,3.3831691481749665E-2,null,null,"charcohe Uses charcoal heating",null,-9.6588878901118468E-3,null,null,"chimnest Uses open fire with chimney",null,2.9418439260975395E-2]
[null,null,"closedst Uses closed stove with chimney",null,1.2897069664874927E-2,null,null,"woodhe Uses wood heating",null,3.0482112335253567E-2,null,null,"closedst Uses closed stove with chimney",null,-1.0456795921472138E-2]
[null,null,"livingki Uses living or sleeping room as kitchen",null,5.0976765549018255E-2,null,null,"openhhe Uses open fire without chimney",null,2.6874656485279133E-2,null,null,"livingki Uses living or sleeping room as kitchen",null,4.5590826133307907E-2]
[null,null,"separeki Uses separate room as kitchen",null,4.4339000197031429E-2,null,null,"chimnehe Uses open fire with chimney",null,6.1845146243796837E-3,null,null,"separeki Uses separate room as kitchen",null,3.5584183223596445E-2]
[null,null,"buildiki Uses separate building as kitchen",null,3.5674089109901358E-2,null,null,"closedhe Uses closed stove with chimney",null,1.7349830294515523E-2,null,null,"buildiki Uses separate building as kitchen",null,3.1298240527368119E-2]
[null,null,"outdooki Kooks outdoor",null,4.0335593610636843E-2,null,null,"car Has Car",null,4.8421767052581083E-2,null,null,"outdooki Kooks outdoor",null,3.7667942145615911E-2]
[null,null,"heatho Heats house",null,-3.5578252406615114E-2,null,null,"TV Has TV",null,5.5845621472558594E-2,null,null,"heatho Heats house",null,-3.2207374462466069E-2]
[null,null,"gazhe Uses gaz heating",null,-1.8923192361325778E-3,null,null,"bike Has Bicycle",null,0.11813899482065332,null,null,"gazhe Uses gaz heating",null,-2.0101633917411956E-3]
[null,null,"electrhe Uses electricity heating",null,-8.2414914094257552E-2,null,null,"q0704 Has Video",null,0.10421487359258341,null,null,"electrhe Uses electricity heating",null,-0.10341305967336664]
[null,null,"kerozehe Uses kerozene heating",null,1.5382736794234216E-2,null,null,"q0705 Has Stereo",null,8.2252460285581253E-2,null,null,"kerozehe Uses kerozene heating",null,8.0682855424469464E-3]
[null,null,"coalhe Uses coal heating",null,1.0456916678782678E-2,null,null,"q0706 Has DVD",null,7.7456047958965629E-2,null,null,"coalhe Uses coal heating",null,5.53348293923577E-3]
[null,null,"charcohe Uses charcoal heating",null,-6.5044775637503709E-3,null,null,"q0707 Has Camera",null,4.4139160372108847E-2,null,null,"charcohe Uses charcoal heating",null,-6.175272835458964E-3]
[null,null,"woodhe Uses wood heating",null,6.8376066984762326E-2,null,null,"q0708 Has Clothes washing machine",null,0.1238331385201599,null,null,"woodhe Uses wood heating",null,7.069033925064741E-2]
[null,null,"dunghe Uses animal dung heating",null,7.2454569274912443E-3,null,null,"q0709 Has Dish washing machine",null,6.5673175292715671E-2,null,null,"dunghe Uses animal dung heating",null,8.7223580980694843E-3]
[null,null,"openhhe Uses open fire without chimney",null,5.1788375091480363E-2,null,null,"q0710 Has Vacuum cleaner",null,0.11972438175065789,null,null,"openhhe Uses open fire without chimney",null,5.2882354949019696E-2]
[null,null,"chimnehe Uses open fire with chimney",null,1.879626387977856E-2,null,null,"q0711 Has Refrigerator",null,0.10240848348111566,null,null,"chimnehe Uses open fire with chimney",null,1.4517614040901346E-2]
[null,null,"closedhe Uses closed stove with chimney",null,8.1402131594602821E-3,null,null,"q0712 Has Telephone",null,0.10047815913606224,null,null,"closedhe Uses closed stove with chimney",null,-1.525323722051071E-2]
[null,null,"car Has Car",null,4.6225488104479726E-2,null,null,"q0713 Has Cellular phone",null,0.11718436835514709,null,null,"car Has Car",null,5.0763537790325323E-2]
[null,null,"TV Has TV",null,5.0146302302210156E-2,null,null,"q0714 Has Computer",null,0.10033111049097945,null,null,"TV Has TV",null,5.2858736904135034E-2]
[null,null,"bike Has Bicycle",null,8.6297984676040149E-2,null,null,"q0715 Has Internet",null,1.4723745333707978E-2,null,null,"bike Has Bicycle",null,8.0057948455120639E-2]
[null,null,"q0704 Has Video",null,9.8745057715637283E-2,null,null,"q0716 Has Magazine",null,2.0670910060099808E-2,null,null,"q0704 Has Video",null,0.10299466292179542]
[null,null,"q0705 Has Stereo",null,5.6830498523117862E-2,null,null,"q0717 Has Security system",null,1.6297349935327284E-2,null,null,"q0705 Has Stereo",null,6.0396163208723007E-2]
[null,null,"q0706 Has DVD",null,5.0612425974025356E-2,null,null,"q0718 Has Employee",null,1.143478453899598E-2,null,null,"q0706 Has DVD",null,3.8659164715411753E-2]
[null,null,"q0707 Has Camera",null,3.1625082581739752E-2,null,null,"q0719 Has Second home",null,-8.6915171988041339E-4,null,null,"q0707 Has Camera",null,3.2479346747023755E-2]
[null,null,"q0708 Has Clothes washing machine",null,9.4942075354711039E-2,null,null,null,null,null,null,null,"q0708 Has Clothes washing machine",null,8.9763930085020344E-2]
[null,null,"q0709 Has Dish washing machine",null,5.1000263628414075E-2,null,null,null,null,null,null,null,"q0709 Has Dish washing machine",null,5.2798548877344857E-2]
[null,null,"q0710 Has Vacuum cleaner",null,0.10168846376015543,null,null,"Matrice de covariance des coefficients des composantes",null,null,null,null,"q0710 Has Vacuum cleaner",null,0.11284247097247724]
[null,null,"q0711 Has Refrigerator",null,8.0525423362383261E-2,null,null,"Composante",null,"1",null,null,"q0711 Has Refrigerator",null,7.3281095471445942E-2]
[null,null,"q0712 Has Telephone",null,7.698602015951915E-2,null,null,"1",null,1,null,null,"q0712 Has Telephone",null,8.0594556689871533E-2]
[null,null,"q0713 Has Cellular phone",null,9.7217546488158335E-2,null,null,null,null,null,null,null,"q0713 Has Cellular phone",null,0.1042842960651672]
[null,null,"q0714 Has Computer",null,7.2960724055622164E-2,null,null,null,null,null,null,null,"q0714 Has Computer",null,5.8394452426062955E-2]
[null,null,"q0715 Has Internet",null,7.3844308541095418E-3,null,null,null,null,null,null,null,"q0715 Has Internet",null,1.0058356526900789E-3]
[null,null,"q0716 Has Magazine",null,1.0686794887124753E-2,null,null,null,null,null,null,null,"q0716 Has Magazine",null,9.8210001044822959E-3]
[null,null,"q0717 Has Security system",null,9.3312536883587809E-3,null,null,null,null,null,null,null,"q0717 Has Security system",null,7.3461172374682951E-3]
[null,null,"q0718 Has Employee",null,8.7520808271729679E-3,null,null,null,null,null,null,null,"q0718 Has Employee",null,1.36299442606207E-2]
[null,null,"q0719 Has Second home",null,1.8167682192761405E-3,null,null,null,null,null,null,null,"q0719 Has Second home",null,5.9597744299239334E-3]
[]
[]
[null,null,"Matrice de covariance des coefficients des composantes",null,null,null,null,null,null,null,null,null,"Matrice de covariance des coefficients des composantes"]
[null,null,"Composante",null,"1",null,null,null,null,null,null,null,"Composante",null,"1"]
[null,null,"1",null,1.0000000000000002,null,null,null,null,null,null,null,"1",null,0.99999999999999989]
[]
[]
[]
[]
[]
[]
[]
[]
[]
[]
[]
[]
[]
[]
[]
[]
[]
[]
[]
[]
[]
[]
[]
[]
[]
[]
[]
[]
[]
[]
[]
[]
[]
[]
[]
[]
[]
[]
[]
[]
[]
[]
[]
[]
[]
[]
[]
[]
[]
[]
[]
[]
[]
[]
[]
[]
[]
[]
[]
[]
[]
[]
[]
[]
[]
[]
[]
[]
[]
[]
[]
[]
[]
[]
[]
[]
[]
[]
[]
[]
[]
[]
[]
[]
[]
[]
[]
[]
[]
[]
[]
[]
[]
[]
[]
[]
[]
[]
[]
[]
[]
[]
[]
[]
[]
[]
[]
[]
[]
[]
[]
[]
[]
[]
[]
[]
[]
[]
[]
[]
[]
[]
[]
[]
[]
[]
[]
[]
[]
[]
[]
[]
[]
[]
[]
[]
[]
[]
[]
[]
[]
[]
[]
[]
[]
[]
[]
[]
[]
[]
[]
[]
[]
[]
[]
[]
[]
[]
[]
[]
[]
[]
[]
[]
[]
[]
[]
[]
[]
[]
[]
[]
[]
[]
[]
[]
[]
[]
[]
[]
[]
[]
[]
[]
[]
[]
[]
[]
[]
[]
[]
[]
[]
[]
[]
[]
[]
[]
[]
[]
[]
[]
[]
[]
[]
[]
[]
[]
[]
[]
[]
[]
[]
[]
[]
[]
[]
[]
[]
[]
[]
[]
[]
[]
[]
[]
[]
[]
[]
[]
[]
[]
[]
[]
[]
[]
[]
[]
[]
[]
[]
[]
[]
[]
[]
[]
[]
[]
[]
[]
[]
[]
[]
[]
[]
[]
[]
[]
[]
[]
[]
[]
[]
[]
[]
[]
[]
[]
[]
[]
[]
[]
[]
[]
[]
[]
[]
[]
[]
[]
[]
[]
[]
[]
[]
[]
[]
[]
[]
[]
[]
[]
[]
[]
[]
[]
[]
[]
[]
[]
[]
[]
[]
[]
[]
[]
[]
[]
[]
[]
[]
[]
[]
[]
[]
[]
[]
[]
[]
[]
[]
[]
[]
[]
[]
[]
[]
[]
[]
[]
[]
[]
[]
[]
[]
[]
[]
[]
[]
[]
[]
[]
[]
[]
[]
[]
[]
[]
[]
[]
[]
[]
[]
[]
[]
[]
[]
[]
[]
[]
[]
[]
[]
[]
[]
[]
[]
[]
[]
[]
[]
[]
[]
[]
[]
[]
[]
[]
[]
[]
[]
[]
[]
[]
[]
[]
[]
[]
[]
[]
[]
[]
[]
[]
[]
[]
[]
[]
[]
[]
[]
[]
[]
[]
[]
[]
[]
[]
[]
[]
[]
[]
[]
[]
[]
[]
[]
[]
[]
[]
[]
[]
[]
[]
[]
[]
[]
[]
[]
[]
[]
[]
[]
[]
[]
[]
[]
[]
[]
[]
[]
[]
[]
[]
[]
["WHS03"]
["South Africa",null,"Nombre"]
["W_text_t","",2568]
["W_text_i","",2568]
["S_text_s","",2568]
["S_text_i","",2568]
["Urban/Rural","1 Urban",1552]
[null,"2 Rural",1016]
["2003"]
["2003"]
[]
["Sub-national region names","Weighted population"]
[{"$f":"R15","v":0},{"$f":"#REF!+#REF!","v":{"$error":"#REF!"}}]
[{"$f":"S15","v":0},{"$f":"#REF!+#REF!","v":{"$error":"#REF!"}}]
[{"$f":"T15","v":0},{"$f":"#REF!+#REF!","v":{"$error":"#REF!"}}]
[{"$f":"U15","v":0},{"$f":"#REF!+#REF!","v":{"$error":"#REF!"}}]
[{"$f":"V15","v":0},{"$f":"#REF!+#REF!","v":{"$error":"#REF!"}}]
[{"$f":"W15","v":0},{"$f":"#REF!+#REF!","v":{"$error":"#REF!"}}]
[{"$f":"X15","v":0},{"$f":"#REF!+WI123","v":{"$error":"#REF!"}}]
[{"$f":"Y15","v":0},{"$f":"#REF!+#REF!","v":{"$error":"#REF!"}}]
[{"$f":"Z15","v":0},{"$f":"#REF!+#REF!","v":{"$error":"#REF!"}}]
[{"$f":"AA15","v":0},{"$f":"#REF!+#REF!","v":{"$error":"#REF!"}}]
[{"$f":"AB15","v":0},{"$f":"#REF!+#REF!","v":{"$error":"#REF!"}}]
[{"$f":"AC15","v":0},{"$f":"#REF!+#REF!","v":{"$error":"#REF!"}}]
[{"$f":"AD15","v":0},{"$f":"#REF!+#REF!","v":{"$error":"#REF!"}}]
[{"$f":"AE15","v":0},{"$f":"#REF!+#REF!","v":{"$error":"#REF!"}}]
[{"$f":"AF15","v":0},{"$f":"#REF!+#REF!","v":{"$error":"#REF!"}}]
[{"$f":"AG15","v":0},{"$f":"#REF!+#REF!","v":{"$error":"#REF!"}}]
[{"$f":"AH15","v":0},{"$f":"#REF!+#REF!","v":{"$error":"#REF!"}}]
[{"$f":"AI15","v":0},{"$f":"#REF!+#REF!","v":{"$error":"#REF!"}}]
[{"$f":"AJ15","v":0},{"$f":"#REF!+#REF!","v":{"$error":"#REF!"}}]
[{"$f":"AK15","v":0},{"$f":"#REF!+#REF!","v":{"$error":"#REF!"}}]
[{"$f":"AL15","v":0},{"$f":"#REF!+#REF!","v":{"$error":"#REF!"}}]
[{"$f":"AM15","v":0},{"$f":"#REF!+#REF!","v":{"$error":"#REF!"}}]
[{"$f":"AN15","v":0},{"$f":"#REF!+#REF!","v":{"$error":"#REF!"}}]
[{"$f":"AO15","v":0},{"$f":"#REF!+#REF!","v":{"$error":"#REF!"}}]
[{"$f":"AP15","v":0},{"$f":"#REF!+#REF!","v":{"$error":"#REF!"}}]
[{"$f":"AQ15","v":0},{"$f":"#REF!+#REF!","v":{"$error":"#REF!"}}]
[{"$f":"AR15","v":0},{"$f":"#REF!+#REF!","v":{"$error":"#REF!"}}]
[{"$f":"AS15","v":0},{"$f":"#REF!+#REF!","v":{"$error":"#REF!"}}]
[{"$f":"AT15","v":0},{"$f":"#REF!+#REF!","v":{"$error":"#REF!"}}]
[{"$f":"AU15","v":0},{"$f":"#REF!+#REF!","v":{"$error":"#REF!"}}]
[{"$f":"AV15","v":0},{"$f":"#REF!+#REF!","v":{"$error":"#REF!"}}]
[{"$f":"AW15","v":0},{"$f":"#REF!+#REF!","v":{"$error":"#REF!"}}]
[{"$f":"AX15","v":0},{"$f":"#REF!+#REF!","v":{"$error":"#REF!"}}]
[{"$f":"AY15","v":0},{"$f":"#REF!+#REF!","v":{"$error":"#REF!"}}]
[]
[{"$f":"34-COUNTIF(A1037:A1071,\"0\")","v":0},"Sub-regions"]

{"sheet":"DHS16","index":5,"n_rows":1072,"n_cols":78,"rows_kept":1072,"cut":false,"hidden":false,"merged":[[340,52,341,52],[342,52,343,52],[344,52,345,52],[346,52,347,52],[348,52,349,52],[350,52,351,52],[352,52,353,52],[152,52,165,52],[230,52,235,52],[219,54,219,58],[219,59,219,63],[219,64,219,68],[221,52,223,52],[224,52,225,52],[226,52,229,52],[258,54,258,58],[258,59,258,63],[258,64,258,68],[260,52,262,52],[263,52,266,52],[267,52,269,52],[270,52,272,52],[273,52,275,52],[276,52,283,52],[338,54,338,58],[338,59,338,63],[338,64,338,68],[150,52,151,52],[13,54,13,58],[13,59,13,63],[13,64,13,68],[15,52,16,52],[17,52,20,52],[21,52,22,52],[26,54,26,58],[26,59,26,63],[26,64,26,68],[55,54,55,58],[55,59,55,63],[55,64,55,68],[119,54,119,58],[119,59,119,63],[119,64,119,68],[121,52,122,52],[123,52,126,52],[127,52,128,52],[132,54,132,58],[132,59,132,63],[132,64,132,68],[134,52,138,52],[40,52,41,52],[42,52,43,52],[44,52,45,52],[46,52,48,52],[49,0,51,0],[49,52,51,52],[52,0,54,0],[52,52,54,52],[139,0,142,0],[139,52,142,52],[143,0,146,0],[143,52,146,52],[147,0,149,0],[147,52,149,52],[13,2,13,6],[13,7,13,11],[28,52,29,52],[30,0,31,0],[30,52,31,52],[32,0,33,0],[32,52,33,52],[34,52,35,52],[36,52,37,52],[38,0,39,0],[38,52,39,52],[28,0,29,0],[34,0,35,0],[36,0,37,0],[40,0,41,0],[42,0,43,0],[44,0,45,0],[26,2,26,6],[26,7,26,11],[26,12,26,16],[13,12,13,16],[15,0,16,0],[17,0,20,0],[21,0,22,0],[23,0,25,0],[107,0,107,1],[57,0,71,0],[55,2,55,6],[55,7,55,11],[55,12,55,16],[150,0,151,0],[134,0,138,0],[152,0,164,0],[127,0,128,0],[129,0,131,0],[132,2,132,6],[132,7,132,11],[132,12,132,16],[119,2,119,6],[119,7,119,11],[119,12,119,16],[121,0,122,0],[123,0,126,0],[46,0,48,0],[1024,0,1024,2],[1025,0,1025,1],[1030,0,1032,0],[1033,0,1033,2],[224,0,228,0],[219,2,219,6],[219,7,219,11],[219,12,219,16],[221,0,223,0],[207,0,207,1],[400,2,401,3],[400,7,401,8],[400,12,401,13],[401,1,444,1],[402,2,402,3],[402,7,402,8],[402,12,402,13],[403,2,403,3],[403,7,403,8],[403,12,403,13],[398,2,398,5],[398,7,398,10],[398,12,398,15],[399,2,399,4],[399,7,399,9],[399,12,399,14],[408,2,408,3],[408,7,408,8],[408,12,408,13],[409,2,409,3],[409,7,409,8],[409,12,409,13],[406,2,406,3],[406,7,406,8],[406,12,406,13],[407,2,407,3],[407,7,407,8],[407,12,407,13],[404,2,404,3],[404,7,404,8],[404,12,404,13],[405,2,405,3],[405,7,405,8],[405,12,405,13],[414,2,414,3],[414,7,414,8],[414,12,414,13],[415,2,415,3],[415,7,415,8],[415,12,415,13],[412,2,412,3],[412,7,412,8],[412,12,412,13],[413,2,413,3],[413,7,413,8],[413,12,413,13],[410,2,410,3],[410,7,410,8],[410,12,410,13],[411,2,411,3],[411,7,411,8],[411,12,411,13],[420,2,420,3],[420,7,420,8],[420,12,420,13],[421,2,421,3],[421,7,421,8],[421,12,421,13],[418,2,418,3],[418,7,418,8],[418,12,418,13],[419,2,419,3],[419,7,419,8],[419,12,419,13],[416,2,416,3],[416,7,416,8],[416,12,416,13],[417,2,417,3],[417,7,417,8],[417,12,417,13],[426,2,426,3],[426,7,426,8],[426,12,426,13],[427,2,427,3],[427,7,427,8],[427,12,427,13],[424,2,424,3],[424,7,424,8],[424,12,424,13],[425,2,425,3],[425,7,425,8],[425,12,425,13],[422,2,422,3],[422,7,422,8],[422,12,422,13],[423,2,423,3],[423,7,423,8],[423,12,423,13],[432,2,432,3],[432,7,432,8],[432,12,432,13],[433,2,433,3],[433,7,433,8],[433,12,433,13],[430,2,430,3],[430,7,430,8],[430,12,430,13],[431,2,431,3],[431,7,431,8],[431,12,431,13],[428,2,428,3],[428,7,428,8],[428,12,428,13],[429,2,429,3],[429,7,429,8],[429,12,429,13],[438,2,438,3],[438,7,438,8],[438,12,438,13],[439,2,439,3],[439,7,439,8],[439,12,439,13],[436,2,436,3],[436,7,436,8],[436,12,436,13],[437,2,437,3],[437,7,437,8],[437,12,437,13],[434,2,434,3],[434,7,434,8],[434,12,434,13],[435,2,435,3],[435,7,435,8],[435,12,435,13],[444,2,444,3],[444,7,444,8],[444,12,444,13],[445,2,445,3],[445,7,445,8],[445,12,445,13],[442,2,442,3],[442,7,442,8],[442,12,442,13],[443,2,443,3],[443,7,443,8],[443,12,443,13],[440,2,440,3],[440,7,440,8],[440,12,440,13],[441,2,441,3],[441,7,441,8],[441,12,441,13],[450,2,450,3],[450,7,450,8],[450,12,450,13],[451,2,451,3],[451,7,451,8],[451,12,451,13],[448,2,448,3],[448,7,448,8],[448,12,448,13],[449,2,449,3],[449,7,449,8],[449,12,449,13],[446,2,446,3],[446,7,446,8],[446,12,446,13],[447,2,447,3],[447,7,447,8],[447,12,447,13],[456,2,456,3],[456,7,456,8],[456,12,456,13],[457,2,457,3],[457,7,457,8],[457,12,457,13],[454,2,454,3],[454,7,454,8],[454,12,454,13],[455,2,455,3],[455,7,455,8],[455,12,455,13],[452,2,452,3],[452,7,452,8],[452,12,452,13],[453,2,453,3],[453,7,453,8],[453,12,453,13],[462,2,462,3],[462,7,462,8],[462,12,462,13],[463,2,463,3],[463,7,463,8],[463,12,463,13],[460,2,460,3],[460,7,460,8],[460,12,460,13],[461,2,461,3],[461,7,461,8],[461,12,461,13],[458,2,458,3],[458,7,458,8],[458,12,458,13],[459,2,459,3],[459,7,459,8],[459,12,459,13],[468,2,468,3],[468,7,468,8],[468,12,468,13],[469,2,469,3],[469,7,469,8],[469,12,469,13],[466,2,466,3],[466,7,466,8],[466,12,466,13],[467,2,467,3],[467,7,467,8],[467,12,467,13],[464,2,464,3],[464,7,464,8],[464,12,464,13],[465,2,465,3],[465,7,465,8],[465,12,465,13],[474,2,474,3],[474,7,474,8],[474,12,474,13],[475,2,475,3],[475,7,475,8],[475,12,475,13],[472,2,472,3],[472,7,472,8],[472,12,472,13],[473,2,473,3],[473,7,473,8],[473,12,473,13],[470,2,470,3],[470,7,470,8],[470,12,470,13],[471,2,471,3],[471,7,471,8],[471,12,471,13],[480,2,480,3],[480,7,480,8],[480,12,480,13],[481,2,481,3],[481,7,481,8],[481,12,481,13],[478,2,478,3],[478,7,478,8],[478,12,478,13],[479,2,479,3],[479,7,479,8],[479,12,479,13],[476,2,476,3],[476,7,476,8],[476,12,476,13],[477,2,477,3],[477,7,477,8],[477,12,477,13],[486,2,486,3],[486,7,486,8],[486,12,486,13],[487,2,487,3],[487,7,487,8],[487,12,487,13],[484,2,484,3],[484,7,484,8],[484,12,484,13],[485,2,485,3],[485,7,485,8],[485,12,485,13],[482,2,482,3],[482,7,482,8],[482,12,482,13],[483,2,483,3],[483,7,483,8],[483,12,483,13],[492,2,492,3],[492,7,492,8],[492,12,492,13],[493,2,493,3],[493,7,493,8],[493,12,493,13],[490,2,490,3],[490,7,490,8],[490,12,490,13],[491,2,491,3],[491,7,491,8],[491,12,491,13],[488,2,488,3],[488,7,488,8],[488,12,488,13],[489,2,489,3],[489,7,489,8],[489,12,489,13],[498,2,498,3],[498,7,498,8],[498,12,498,13],[499,2,499,3],[499,7,499,8],[499,12,499,13],[496,2,496,3],[496,7,496,8],[496,12,496,13],[497,2,497,3],[497,7,497,8],[497,12,497,13],[494,2,494,3],[494,7,494,8],[494,12,494,13],[495,2,495,3],[495,7,495,8],[495,12,495,13],[504,2,504,3],[504,7,504,8],[504,12,504,13],[505,2,505,3],[505,7,505,8],[505,12,505,13],[502,2,502,3],[502,7,502,8],[502,12,502,13],[503,2,503,3],[503,7,503,8],[503,12,503,13],[500,2,500,3],[500,7,500,8],[500,12,500,13],[501,2,501,4],[501,7,501,8],[501,12,501,13],[510,2,510,3],[510,7,510,8],[510,12,510,13],[511,2,511,3],[511,7,511,8],[511,12,511,13],[508,2,508,3],[508,7,508,8],[508,12,508,13],[509,2,509,3],[509,7,509,8],[509,12,509,13],[506,2,506,3],[506,7,506,8],[506,12,506,13],[507,2,507,3],[507,7,507,8],[507,12,507,13],[516,2,516,3],[516,7,516,8],[516,12,516,13],[517,2,517,3],[517,7,517,8],[517,12,517,13],[514,2,514,3],[514,7,514,8],[514,12,514,13],[515,2,515,3],[515,7,515,8],[515,12,515,13],[512,2,512,3],[512,7,512,8],[512,12,512,13],[513,2,513,3],[513,7,513,8],[513,12,513,13],[522,2,522,3],[522,7,522,8],[522,12,522,14],[523,2,523,3],[523,7,523,8],[523,12,523,13],[520,2,520,3],[520,7,520,8],[520,12,520,13],[521,2,521,3],[521,7,521,8],[521,12,521,13],[518,2,518,3],[518,7,518,8],[518,12,518,13],[519,2,519,3],[519,7,519,8],[519,12,519,13],[528,2,528,3],[528,7,528,8],[528,12,528,13],[529,2,529,3],[529,7,529,8],[529,12,529,13],[526,2,526,3],[526,7,526,8],[526,12,526,13],[527,2,527,3],[527,7,527,8],[527,12,527,13],[524,2,524,3],[524,7,524,9],[524,12,524,13],[525,2,525,3],[525,7,525,8],[525,12,525,13],[534,2,534,3],[534,7,534,8],[534,12,534,13],[535,2,535,3],[535,7,535,8],[535,12,535,13],[532,2,532,3],[532,7,532,8],[532,12,532,13],[533,2,533,3],[533,7,533,8],[533,12,533,13],[530,2,530,3],[530,7,530,8],[530,12,530,13],[531,2,531,3],[531,7,531,8],[531,12,531,13],[540,2,540,3],[540,7,540,8],[540,12,540,13],[541,2,541,3],[541,7,541,8],[541,12,541,13],[538,2,538,3],[538,7,538,8],[538,12,538,13],[539,2,539,3],[539,7,539,8],[539,12,539,13],[536,2,536,3],[536,7,536,8],[536,12,536,13],[537,2,537,3],[537,7,537,8],[537,12,537,13],[546,2,546,3],[546,7,546,8],[546,12,546,13],[547,2,547,3],[547,7,547,8],[547,12,547,13],[544,2,544,3],[544,7,544,8],[544,12,544,13],[545,2,545,3],[545,7,545,8],[545,12,545,13],[542,2,542,3],[542,7,542,8],[542,12,542,13],[543,2,543,3],[543,7,543,8],[543,12,543,13],[552,2,552,3],[552,7,552,8],[552,12,552,13],[553,2,553,3],[553,7,553,8],[553,12,553,13],[550,2,550,3],[550,7,550,8],[550,12,550,13],[551,2,551,3],[551,7,551,8],[551,12,551,13],[548,2,548,3],[548,7,548,8],[548,12,548,13],[549,2,549,3],[549,7,549,8],[549,12,549,13],[558,2,558,3],[558,7,558,8],[558,12,558,13],[559,2,559,3],[559,7,559,8],[559,12,559,13],[556,2,556,3],[556,7,556,8],[556,12,556,13],[557,2,557,3],[557,7,557,8],[557,12,557,13],[554,2,554,3],[554,7,554,8],[554,12,554,13],[555,2,555,3],[555,7,555,8],[555,12,555,13],[564,2,564,3],[564,7,564,8],[564,12,564,13],[565,2,565,3],[565,7,565,8],[565,12,565,13],[562,2,562,3],[562,7,562,8],[562,12,562,13],[563,2,563,3],[563,7,563,8],[563,12,563,13],[560,2,560,3],[560,7,560,8],[560,12,560,13],[561,2,561,3],[561,7,561,8],[561,12,561,13],[570,2,570,3],[570,7,570,8],[570,12,570,13],[571,2,571,3],[571,7,571,8],[571,12,571,13],[568,2,568,3],[568,7,568,8],[568,12,568,13],[569,2,569,3],[569,7,569,8],[569,12,569,13],[566,2,566,3],[566,7,566,8],[566,12,566,13],[567,2,567,3],[567,7,567,8],[567,12,567,13],[576,2,576,3],[576,7,576,8],[576,12,576,13],[577,2,577,3],[577,7,577,8],[577,12,577,13],[574,2,574,3],[574,7,574,8],[574,12,574,13],[575,2,575,3],[575,7,575,8],[575,12,575,13],[572,2,572,3],[572,7,572,8],[572,12,572,13],[573,2,573,3],[573,7,573,8],[573,12,573,13],[582,2,582,3],[582,7,582,8],[582,12,582,13],[583,2,583,3],[583,7,583,8],[583,12,583,13],[580,2,580,3],[580,7,580,8],[580,12,580,13],[581,2,581,3],[581,7,581,8],[581,12,581,13],[578,2,578,3],[578,7,578,8],[578,12,578,13],[579,2,579,3],[579,7,579,8],[579,12,579,13],[588,2,588,3],[588,7,588,8],[588,12,588,13],[589,2,589,3],[589,7,589,8],[589,12,589,13],[586,2,586,3],[586,7,586,8],[586,12,586,13],[587,2,587,3],[587,7,587,8],[587,12,587,13],[584,2,584,3],[584,7,584,8],[584,12,584,13],[585,2,585,3],[585,7,585,8],[585,12,585,13],[594,2,594,3],[594,7,594,8],[594,12,594,13],[595,2,595,3],[595,7,595,8],[595,12,595,13],[592,2,592,3],[592,7,592,8],[592,12,592,13],[593,2,593,3],[593,7,593,8],[593,12,593,13],[590,2,590,3],[590,7,590,8],[590,12,590,13],[591,2,591,3],[591,7,591,8],[591,12,591,13],[600,2,600,3],[600,7,600,8],[600,12,600,13],[601,2,601,6],[601,7,601,8],[601,12,601,13],[598,2,598,3],[598,7,598,8],[598,12,598,13],[599,2,599,3],[599,7,599,8],[599,12,599,13],[596,2,596,3],[596,7,596,8],[596,12,596,13],[597,2,597,3],[597,7,597,8],[597,12,597,13],[606,2,606,3],[606,7,606,8],[606,12,606,13],[607,2,607,4],[607,7,607,8],[607,12,607,13],[604,2,604,3],[604,7,604,8],[604,12,604,13],[605,2,605,3],[605,7,605,8],[605,12,605,13],[602,2,603,3],[602,4,602,6],[602,7,602,8],[602,12,602,13],[603,7,603,8],[603,12,603,13],[613,2,613,3],[613,7,613,8],[613,12,613,13],[614,2,614,3],[614,7,614,8],[614,12,614,13],[611,2,611,3],[611,7,611,8],[611,12,611,13],[612,2,612,3],[612,7,612,8],[612,12,612,13],[608,2,609,3],[608,7,608,8],[608,12,608,13],[609,7,609,8],[609,12,609,13],[610,2,610,3],[610,7,610,8],[610,12,610,13],[619,2,619,3],[619,7,619,8],[619,12,619,13],[620,2,620,3],[620,7,620,8],[620,12,620,13],[617,2,617,3],[617,7,617,8],[617,12,617,13],[618,2,618,3],[618,7,618,8],[618,12,618,13],[615,2,615,3],[615,7,615,8],[615,12,615,13],[616,2,616,3],[616,7,616,8],[616,12,616,13],[625,2,625,3],[625,7,625,8],[625,12,625,13],[626,2,626,3],[626,7,626,8],[626,12,626,13],[623,2,623,3],[623,7,623,8],[623,12,623,13],[624,2,624,3],[624,7,624,8],[624,12,624,13],[621,2,621,3],[621,7,621,8],[621,12,621,13],[622,2,622,3],[622,7,622,8],[622,12,622,13],[631,2,631,3],[631,7,631,8],[631,12,631,13],[632,2,632,3],[632,7,632,8],[632,12,632,13],[629,2,629,3],[629,7,629,8],[629,12,629,13],[630,2,630,3],[630,7,630,8],[630,12,630,13],[627,2,627,3],[627,7,627,8],[627,12,627,13],[628,2,628,3],[628,7,628,8],[628,12,628,13],[637,2,637,3],[637,7,637,8],[637,12,637,13],[638,2,638,3],[638,7,638,8],[638,12,638,13],[635,2,635,3],[635,7,635,8],[635,12,635,13],[636,2,636,3],[636,7,636,8],[636,12,636,13],[633,2,633,3],[633,7,633,8],[633,12,633,13],[634,2,634,3],[634,7,634,8],[634,12,634,13],[643,2,643,3],[643,7,643,8],[643,12,643,16],[644,2,644,3],[644,7,644,8],[644,12,645,13],[644,14,644,16],[645,2,645,3],[645,7,645,8],[641,2,641,3],[641,7,641,8],[641,12,641,13],[642,2,642,3],[642,7,642,8],[642,12,642,13],[639,2,639,3],[639,7,639,8],[639,12,639,13],[640,2,640,3],[640,7,640,8],[640,12,640,13],[650,2,650,3],[650,7,650,8],[650,12,651,13],[651,2,651,3],[651,7,651,8],[652,2,652,3],[652,7,652,8],[652,12,652,13],[648,2,648,3],[648,7,649,8],[648,9,648,11],[648,12,648,13],[649,2,649,3],[649,12,649,14],[646,2,646,3],[646,7,646,8],[646,12,646,13],[647,2,647,3],[647,7,647,11],[647,12,647,13],[658,2,658,3],[658,7,658,8],[658,12,658,13],[659,2,659,3],[659,7,659,8],[659,12,659,13],[656,2,656,3],[656,7,656,8],[656,12,656,13],[657,2,657,3],[657,7,657,8],[657,12,657,13],[653,2,653,3],[653,7,653,9],[653,12,653,13],[654,2,654,3],[654,7,655,8],[654,12,654,13],[655,2,655,3],[655,12,655,13],[664,2,664,3],[664,7,664,8],[664,12,664,13],[665,2,665,3],[665,7,665,8],[665,12,665,13],[662,2,662,3],[662,7,662,8],[662,12,662,13],[663,2,663,3],[663,7,663,8],[663,12,663,13],[660,2,660,3],[660,7,660,8],[660,12,660,13],[661,2,661,3],[661,7,661,8],[661,12,661,13],[670,2,670,3],[670,7,670,8],[670,12,670,13],[671,2,671,3],[671,7,671,8],[671,12,671,13],[668,2,668,3],[668,7,668,8],[668,12,668,13],[669,2,669,3],[669,7,669,8],[669,12,669,13],[666,2,666,3],[666,7,666,8],[666,12,666,13],[667,2,667,3],[667,7,667,8],[667,12,667,13],[676,2,676,3],[676,7,676,8],[676,12,676,13],[677,2,677,3],[677,7,677,8],[677,12,677,13],[674,2,674,3],[674,7,674,8],[674,12,674,13],[675,2,675,3],[675,7,675,8],[675,12,675,13],[672,2,672,3],[672,7,672,8],[672,12,672,13],[673,2,673,3],[673,7,673,8],[673,12,673,13],[682,2,682,3],[682,7,682,8],[682,12,682,13],[683,2,683,3],[683,7,683,8],[683,12,683,13],[680,2,680,3],[680,7,680,8],[680,12,680,13],[681,2,681,3],[681,7,681,8],[681,12,681,13],[678,2,678,3],[678,7,678,8],[678,12,678,13],[679,2,679,3],[679,7,679,8],[679,12,679,13],[688,2,688,3],[688,7,688,8],[688,12,688,13],[689,2,689,3],[689,7,689,8],[689,12,689,13],[686,2,686,3],[686,7,686,8],[686,12,686,13],[687,2,687,3],[687,7,687,8],[687,12,687,13],[684,2,684,3],[684,7,684,8],[684,12,684,13],[685,2,685,3],[685,7,685,8],[685,12,685,13],[694,2,694,3],[694,7,694,8],[694,12,694,13],[695,2,695,3],[695,7,695,8],[695,12,695,13],[692,2,692,3],[692,7,692,8],[692,12,692,13],[693,2,693,3],[693,7,693,8]],"merged_total":1316,"flags":["merged_cut"]}
[]
[{"$f":"A1026","v":"South Africa"}]
[{"$f":"A1034","v":"2016"}]
["Use of drinking water sources"]
[" by wealth quintile and sub-national region"]
["Notes:"]
["WHO/UNICEF JMP customised wealth index excludes water,"]
[" sanitation and hygiene assets."]
["Survey used for analysis:",{"$f":"A1025","v":"DHS16"}]
[{"$f":"B1028","v":""}]
[{"$f":"B1027","v":""}]
[]
[]
["Use of drinking water sources",null,"NATIONAL wealth index quintile",null,null,null,null,"URBAN wealth index quintile",null,null,null,null,"RURAL wealth index quintile",null,null,null,null,"SUB-REGIONS:",null,null,null,null,null,null,null,null,null,null,null,null,null,null,null,null,null,null,null,null,null,null,null,null,null,null,null,null,null,null,null,null,null,null,"Raw numbers of respondents:","Use of drinking water sources","NATIONAL wealth index quintile",null,null,null,null,"URBAN wealth index quintile",null,null,null,null,"RURAL wealth index quintile",null,null,null,null,"SUB-REGIONS:"]
["Weighted percentage (used in graphs)",null,"Poorest","Poor","Middle","Rich","Richest","1 Poorest","2 Poor","3 Middle","4 Rich","5 Richest","1 Poorest","2 Poor","3 Middle","4 Rich","5 Richest","2 Eastern Cape","4 Free State","7 Gauteng","5 Kwazulu-Natal","9 Limpopo","8 Mpumalanga","6 North West","3 Northern Cape","1 Western Cape",null,null,null,null,null,null,null,null,null,null,null,null,null,null,null,null,null,null,null,null,null,null,null,null,null,null,"Water data, raw numbers (weighted)",null,"Poorest","Poor","Middle","Rich","Richest","Poorest","Poor","Middle","Rich","Richest","Poorest","Poor","Middle","Rich","Richest","2 Eastern Cape","4 Free State","7 Gauteng","5 Kwazulu-Natal","9 Limpopo","8 Mpumalanga","6 North West","3 Northern Cape","1 Western Cape"]
["Water","1 Improved",75.816252401883204,93.97726975437854,97.72706698727815,99.64033765423946,99.944878806103858,98.786191257359917,99.415631439447935,99.97162975568294,99.929962314559546,100,53.861220826086765,79.768429310548839,88.438192855411032,93.680415606172801,97.72406870071849,73.778371215166899,99.917488112314061,100,89.367621848263937,92.678051924605015,95.31446634902025,99.901769446901071,99.496729030381587,99.401016052404628,null,null,null,null,null,null,null,null,null,null,null,null,null,null,null,null,null,null,null,null,null,null,null,null,null,null,"Water","Improved","N/A","N/A","N/A","N/A","N/A","N/A","N/A","N/A","N/A","N/A","N/A","N/A","N/A","N/A","N/A","N/A","N/A","N/A","N/A","N/A","N/A","N/A","N/A","N/A"]
[null,"2 Not Improved",24.183747598116867,6.0227302456214939,2.272933012721885,0.35966234576053596,5.5121193896124146E-2,1.2138087426401269,0.58436856055207576,2.8370244317055936E-2,7.0037685440461211E-2,0,46.138779173913164,20.231570689451079,11.561807144588974,6.3195843938271867,2.2759312992815075,26.221628784832973,8.2511887685943724E-2,0,10.632378151736093,7.3219480753949266,4.6855336509796865,9.8230553098930931E-2,0.50327096961842199,0.59898394759535856,null,null,null,null,null,null,null,null,null,null,null,null,null,null,null,null,null,null,null,null,null,null,null,null,null,null,null,"Not Improved","N/A","N/A","N/A","N/A","N/A","N/A","N/A","N/A","N/A","N/A","N/A","N/A","N/A","N/A","N/A","N/A","N/A","N/A","N/A","N/A","N/A","N/A","N/A","N/A"]
["Water ladder","1 Basic",67.974305735527494,89.861177389738145,96.149814819168313,99.315094635807384,99.785956231621626,95.600603850270289,99.31049613169975,99.796717261001092,99.929962314559546,99.810603789769445,45.411284171502153,70.063828091897335,81.184673131790419,88.766645698187403,96.105682167525785,71.284048941676446,98.877011976292621,99.497680327231961,86.776348113162882,81.171819700040814,90.926029586830055,96.699459280443406,98.114022124950324,99.401016052404628,null,null,null,null,null,null,null,null,null,null,null,null,null,null,null,null,null,null,null,null,null,null,null,null,null,null,"Water ladder","Basic","N/A","N/A","N/A","N/A","N/A","N/A","N/A","N/A","N/A","N/A","N/A","N/A","N/A","N/A","N/A","N/A","N/A","N/A","N/A","N/A","N/A","N/A","N/A","N/A"]
[null,"2 Limited",7.8419466663557795,4.1160923646403944,1.5772521681098235,0.32524301843207082,0.15892257448223415,3.1855874070896282,0.10513530774818093,0.17491249468182149,0,0.18939621023056377,8.4499366545845316,9.7046012186514741,7.2535197236204771,4.9137699079854356,1.6183865331927363,2.4943222734904236,1.0404761360214752,0.50231967276806078,2.5912737351010664,11.506232224564195,4.3884367621902394,3.2023101664576781,1.3827069054312644,0,null,null,null,null,null,null,null,null,null,null,null,null,null,null,null,null,null,null,null,null,null,null,null,null,null,null,null,"Limited","N/A","N/A","N/A","N/A","N/A","N/A","N/A","N/A","N/A","N/A","N/A","N/A","N/A","N/A","N/A","N/A","N/A","N/A","N/A","N/A","N/A","N/A","N/A","N/A"]
[null,"3 Other unimproved",11.369817272611149,3.2174716983722975,1.0824743742331979,0.26058732167922088,5.5121193896124146E-2,0.38473429070320642,0.58436856055207576,7.8489664168908679E-3,7.0037685440461211E-2,0,20.90383404143838,10.602209074881301,5.9907852361782483,2.7368213179296568,1.5933881350392107,13.083453981287462,8.2511887685943724E-2,0,5.0351749092705615,2.689511009385205,2.7193097547043741,9.8230553098930931E-2,0.12915041765043458,0.59898394759535856,null,null,null,null,null,null,null,null,null,null,null,null,null,null,null,null,null,null,null,null,null,null,null,null,null,null,null,"Unimproved","N/A","N/A","N/A","N/A","N/A","N/A","N/A","N/A","N/A","N/A","N/A","N/A","N/A","N/A","N/A","N/A","N/A","N/A","N/A","N/A","N/A","N/A","N/A","N/A"]
[null,"4 Surface water",12.813930325505698,2.8052585472491978,1.1904586384886864,9.9075024081315105E-2,0,0.82907445193692053,0,2.0521277900165068E-2,0,0,25.234945132474774,9.6293616145697669,5.5710219084107333,3.5827630758975304,0.68254316424229666,13.138174803545525,0,0,5.5972032424655334,4.6324370660097252,1.9662238962753129,0,0.37412055196798744,0,null,null,null,null,null,null,null,null,null,null,null,null,null,null,null,null,null,null,null,null,null,null,null,null,null,null,null,"Surface water","N/A","N/A","N/A","N/A","N/A","N/A","N/A","N/A","N/A","N/A","N/A","N/A","N/A","N/A","N/A","N/A","N/A","N/A","N/A","N/A","N/A","N/A","N/A","N/A"]
["Improved water point at more than 30 minutes","1 Yes",10.343358340620108,4.3798807684010423,1.6139358488218478,0.32641701753429631,0.15901022281546695,3.2247294551426395,0.10575329676623009,0.17496213186609424,0,0.18939621023056377,15.688349660451717,12.165967541958493,8.2017955019494444,5.2452477673056528,1.6560777244642471,3.3808313092410156,1.0413353614853778,0.50231967276806078,2.8995666232461179,12.415271993335258,4.6041665345119442,3.205458906470863,1.3897008664566766,0,null,null,null,null,null,null,null,null,null,null,null,null,null,null,null,null,null,null,null,null,null,null,null,null,null,null,"Improved water point at more than 30 minutes","Yes","N/A","N/A","N/A","N/A","N/A","N/A","N/A","N/A","N/A","N/A","N/A","N/A","N/A","N/A","N/A","N/A","N/A","N/A","N/A","N/A","N/A","N/A","N/A","N/A"]
[null,"2 No",89.656641659379972,95.620119231598963,98.386064151178147,99.673582982465717,99.840989777184532,96.775270544857349,99.894246703233762,99.82503786813389,100,99.810603789769445,84.311650339548123,87.834032458041449,91.798204498050396,94.754752232694401,98.343922275535775,96.61916869075894,98.958664638514648,99.497680327231961,97.100433376753898,87.584728006664719,95.395833465488096,96.794541093529162,98.610299133543336,100,null,null,null,null,null,null,null,null,null,null,null,null,null,null,null,null,null,null,null,null,null,null,null,null,null,null,null,"No","N/A","N/A","N/A","N/A","N/A","N/A","N/A","N/A","N/A","N/A","N/A","N/A","N/A","N/A","N/A","N/A","N/A","N/A","N/A","N/A","N/A","N/A","N/A","N/A"]
["Manually calculated ratios","Improved wells"]
[null,"Improved springs"]
[null,"Other"]
[null,null,"NATIONAL wealth index quintile",null,null,null,null,"URBAN wealth index quintile",null,null,null,null,"RURAL wealth index quintile",null,null,null,null,"SUB-REGIONS:",null,null,null,null,null,null,null,null,null,null,null,null,null,null,null,null,null,null,null,null,null,null,null,null,null,null,null,null,null,null,null,null,null,null,"Raw numbers of respondents:","Use of drinking water sources","NATIONAL wealth index quintile",null,null,null,null,"URBAN wealth index quintile",null,null,null,null,"RURAL wealth index quintile",null,null,null,null,"SUB-REGIONS:"]
["Percentage based on weighted population",null,"Poorest","Poor","Middle","Rich","Richest","1 Poorest","2 Poor","3 Middle","4 Rich","5 Richest","1 Poorest","2 Poor","3 Middle","4 Rich","5 Richest","2 Eastern Cape","4 Free State","7 Gauteng","5 Kwazulu-Natal","9 Limpopo","8 Mpumalanga","6 North West","3 Northern Cape","1 Western Cape",null,null,null,null,null,null,null,null,null,null,null,null,null,null,null,null,null,null,null,null,null,null,null,null,null,null,"Water data, raw numbers (weighted)",null,"Poorest","Poor","Middle","Rich","Richest","Poorest","Poor","Middle","Rich","Richest","Poorest","Poor","Middle","Rich","Richest","2 Eastern Cape","4 Free State","7 Gauteng","5 Kwazulu-Natal","9 Limpopo","8 Mpumalanga","6 North West","3 Northern Cape","1 Western Cape"]
["Piped water","1 Yes",62.910686538035741,84.803718799311625,90.184100172033155,95.779468495540286,98.76615867712863,94.857264274171712,98.189232845394585,99.088433847046886,99.363666239982422,99.640810526902641,38.642502924351859,63.817470727133788,70.894178890684984,78.654496937985471,78.891569419477293,65.133664796762858,96.498905172567291,98.705794167708419,83.298828370457869,68.931332171865733,83.440523397678177,90.348493837238422,97.620564893730219,99.195069057056415,null,null,null,null,null,null,null,null,null,null,null,null,null,null,null,null,null,null,null,null,null,null,null,null,null,null,"Piped water","Yes","N/A","N/A","N/A","N/A","N/A","N/A","N/A","N/A","N/A","N/A","N/A","N/A","N/A","N/A","N/A","N/A","N/A","N/A","N/A","N/A","N/A","N/A","N/A","N/A"]
[null,"2 No",37.089313461964466,15.196281200688361,9.8158998279668364,4.2205315044596787,1.2338413228713934,5.1427357258283486,1.8107671546054347,0.91156615295308274,0.63633376001760134,0.35918947309736948,61.357497075647984,36.18252927286612,29.105821109314888,21.34550306201448,21.108430580522729,34.866335203236929,3.5010948274327358,1.2942058322915895,16.701171629542259,31.068667828134171,16.559476602321851,9.6515061627614749,2.379435106269769,0.80493094294356304,null,null,null,null,null,null,null,null,null,null,null,null,null,null,null,null,null,null,null,null,null,null,null,null,null,null,null,"No","N/A","N/A","N/A","N/A","N/A","N/A","N/A","N/A","N/A","N/A","N/A","N/A","N/A","N/A","N/A","N/A","N/A","N/A","N/A","N/A","N/A","N/A","N/A","N/A"]
["Piped water on premises","Yes",25.192679041400435,57.474890867074691,76.600113972232606,91.905639836491574,98.568944501056436,62.319457650212016,89.004184424808386,97.613015513555439,99.234994854812982,99.535183379307497,7.7783476295906731,27.425949352511047,33.917523993697934,49.469358374422704,61.714581991187011,43.551160237977591,92.150423007165131,88.885437481004615,66.871547635930455,34.784785342792944,67.900595766756496,61.533863752716478,73.03285821127561,92.963029824914599,null,null,null,null,null,null,null,null,null,null,null,null,null,null,null,null,null,null,null,null,null,null,null,null,null,null,"Piped water on premises","Yes","N/A","N/A","N/A","N/A","N/A","N/A","N/A","N/A","N/A","N/A","N/A","N/A","N/A","N/A","N/A","N/A","N/A","N/A","N/A","N/A","N/A","N/A","N/A","N/A"]
[null,"No",74.807320958599789,42.525109132925216,23.39988602776716,8.0943601635084175,1.4310554989435642,37.680542349788155,10.995815575191722,2.3869844864445442,0.76500514518703311,0.46481662069251362,92.221652370409259,72.574050647488804,66.08247600630186,50.530641625577246,38.285418008812968,56.448839762022295,7.8495769928349262,11.114562518995275,33.128452364069958,65.215214657206943,32.099404233243725,38.46613624728338,26.967141788724664,7.036970175085397,null,null,null,null,null,null,null,null,null,null,null,null,null,null,null,null,null,null,null,null,null,null,null,null,null,null,null,"No","N/A","N/A","N/A","N/A","N/A","N/A","N/A","N/A","N/A","N/A","N/A","N/A","N/A","N/A","N/A","N/A","N/A","N/A","N/A","N/A","N/A","N/A","N/A","N/A"]
["Piped water into dwelling","Yes","N/A","N/A","N/A","N/A","N/A","N/A","N/A","N/A","N/A","N/A","N/A","N/A","N/A","N/A","N/A","N/A","N/A","N/A","N/A","N/A","N/A","N/A","N/A","N/A",null,null,null,null,null,null,null,null,null,null,null,null,null,null,null,null,null,null,null,null,null,null,null,null,null,null,"Piped water into dwelling","Yes","N/A","N/A","N/A","N/A","N/A","N/A","N/A","N/A","N/A","N/A","N/A","N/A","N/A","N/A","N/A","N/A","N/A","N/A","N/A","N/A","N/A","N/A","N/A","N/A"]
[null,"No","N/A","N/A","N/A","N/A","N/A","N/A","N/A","N/A","N/A","N/A","N/A","N/A","N/A","N/A","N/A","N/A","N/A","N/A","N/A","N/A","N/A","N/A","N/A","N/A",null,null,null,null,null,null,null,null,null,null,null,null,null,null,null,null,null,null,null,null,null,null,null,null,null,null,null,"No","N/A","N/A","N/A","N/A","N/A","N/A","N/A","N/A","N/A","N/A","N/A","N/A","N/A","N/A","N/A","N/A","N/A","N/A","N/A","N/A","N/A","N/A","N/A","N/A"]
["Water source on premises","1 Yes",34.63003422357508,67.656687579277303,85.763369976234316,95.52154970757131,99.522778895875391,70.643397768264165,93.127559787251627,98.218975488423638,99.556832354731966,99.803713039638524,15.140535083931011,37.289276049138103,47.19124290776314,67.03873816886572,81.093304989541394,52.105702329836966,94.377349257724148,91.417865280610656,73.602590936164631,47.187637381439188,78.05625818240307,77.414749736854844,78.523612838661052,95.087143028223522,null,null,null,null,null,null,null,null,null,null,null,null,null,null,null,null,null,null,null,null,null,null,null,null,null,null,"Water source on premises","Yes","N/A","N/A","N/A","N/A","N/A","N/A","N/A","N/A","N/A","N/A","N/A","N/A","N/A","N/A","N/A","N/A","N/A","N/A","N/A","N/A","N/A","N/A","N/A","N/A"]
[null,"2 No",65.369965776425204,32.343312420722611,14.236630023765517,4.4784502924287404,0.4772211041245798,29.356602231735884,6.8724402127484332,1.7810245115763641,0.44316764526801927,0.19628696036148177,84.859464916068887,62.710723950861791,52.80875709223659,32.961261831134273,18.906695010458634,47.894297670162928,5.6226507422759235,8.5821347193892823,26.397409063835752,52.812362618560591,21.943741817597115,22.585250263145088,21.476387161339275,4.9128569717764661,null,null,null,null,null,null,null,null,null,null,null,null,null,null,null,null,null,null,null,null,null,null,null,null,null,null,null,"No","N/A","N/A","N/A","N/A","N/A","N/A","N/A","N/A","N/A","N/A","N/A","N/A","N/A","N/A","N/A","N/A","N/A","N/A","N/A","N/A","N/A","N/A","N/A","N/A"]
["Improved Water source on premises","1 Yes",45.186251028868099,71.803901919838012,87.660911206154978,95.722466499328675,99.577667294942287,71.511409508867956,93.355264824750719,98.238997165517233,99.590828397604909,99.803713039638524,27.294182308110333,46.027271551548708,53.226944471684646,71.561102430088269,82.582869899263869,70.25092217193891,94.455286097302178,91.417865280610656,81.928811003022872,50.821237805456235,81.893401046362186,77.490869446513329,78.873308981979548,95.285630999796183,null,null,null,null,null,null,null,null,null,null,null,null,null,null,null,null,null,null,null,null,null,null,null,null,null,null,"Improved water source on premises","Yes","N/A","N/A","N/A","N/A","N/A","N/A","N/A","N/A","N/A","N/A","N/A","N/A","N/A","N/A","N/A","N/A","N/A","N/A","N/A","N/A","N/A","N/A","N/A","N/A"]
[null,"2 No",54.813748971132078,28.196098080161846,12.339088793844837,4.277533500671395,0.42233270505769721,28.488590491132026,6.6447351752493429,1.7610028344827726,0.4091716023951068,0.19628696036148177,72.705817691889479,53.97272844845125,46.773055528315041,28.438897569911738,17.417130100736202,29.749077828061061,5.5447139026978798,8.5821347193892823,18.07118899697749,49.178762194543538,18.106598953638095,22.509130553486607,21.126691018020786,4.7143690002038321,null,null,null,null,null,null,null,null,null,null,null,null,null,null,null,null,null,null,null,null,null,null,null,null,null,null,null,"No","N/A","N/A","N/A","N/A","N/A","N/A","N/A","N/A","N/A","N/A","N/A","N/A","N/A","N/A","N/A","N/A","N/A","N/A","N/A","N/A","N/A","N/A","N/A","N/A"]
["Piped water on premises available when needed","Yes","N/A","N/A","N/A","N/A","N/A","N/A","N/A","N/A","N/A","N/A","N/A","N/A","N/A","N/A","N/A","N/A","N/A","N/A","N/A","N/A","N/A","N/A","N/A","N/A",null,null,null,null,null,null,null,null,null,null,null,null,null,null,null,null,null,null,null,null,null,null,null,null,null,null,"Piped water on premises available when needed","Yes","N/A","N/A","N/A","N/A","N/A","N/A","N/A","N/A","N/A","N/A","N/A","N/A","N/A","N/A","N/A","N/A","N/A","N/A","N/A","N/A","N/A","N/A","N/A","N/A"]
[null,"No","N/A","N/A","N/A","N/A","N/A","N/A","N/A","N/A","N/A","N/A","N/A","N/A","N/A","N/A","N/A","N/A","N/A","N/A","N/A","N/A","N/A","N/A","N/A","N/A",null,null,null,null,null,null,null,null,null,null,null,null,null,null,null,null,null,null,null,null,null,null,null,null,null,null,null,"No","N/A","N/A","N/A","N/A","N/A","N/A","N/A","N/A","N/A","N/A","N/A","N/A","N/A","N/A","N/A","N/A","N/A","N/A","N/A","N/A","N/A","N/A","N/A","N/A"]
["Water point at more than 30 minutes","1 Yes",19.913311563035233,6.2199059188363535,2.3465654160193297,0.38111434438794417,0.15892257448223415,3.7190981573089128,0.12399074010794803,0.19543377258198655,0,0.18939621023056377,32.196021065670784,18.790741485065688,10.8447269779448,7.9206475497049622,2.1564955847760832,17.403465314303325,1.0404761360214752,0.50231967276806078,6.0026737809247814,15.165840759928791,5.22353127346077,3.2023101664576781,1.3827069054312644,0,null,null,null,null,null,null,null,null,null,null,null,null,null,null,null,null,null,null,null,null,null,null,null,null,null,null,"Water point at more than 30 minutes","Yes","N/A","N/A","N/A","N/A","N/A","N/A","N/A","N/A","N/A","N/A","N/A","N/A","N/A","N/A","N/A","N/A","N/A","N/A","N/A","N/A","N/A","N/A","N/A","N/A"]
[null,"2 No",80.086688436964863,93.780094081163625,97.653434583980683,99.618885655612061,99.841077425517767,96.280901842691151,99.876009259892058,99.804566227417993,100,99.810603789769445,67.803978934329152,81.209258514934263,89.155273022055241,92.07935245029509,97.843504415223947,82.596534685696511,98.959523863978546,99.497680327231961,93.997326219075305,84.834159240071173,94.776468726539136,96.79768983354235,98.617293094568751,100,null,null,null,null,null,null,null,null,null,null,null,null,null,null,null,null,null,null,null,null,null,null,null,null,null,null,null,"No","N/A","N/A","N/A","N/A","N/A","N/A","N/A","N/A","N/A","N/A","N/A","N/A","N/A","N/A","N/A","N/A","N/A","N/A","N/A","N/A","N/A","N/A","N/A","N/A"]
["Water source available when needed","1 Yes",50.710877592522053,53.579252932911814,63.952176196770594,73.330174437970058,83.028897020394083,62.460775290449874,72.910002284116288,76.75862419181189,79.554182084896098,85.643656070865532,42.566110091495787,36.228408446120973,39.887183222759063,47.829126908896576,52.945119902440808,58.754052766991791,71.621016407076155,82.000664825376475,46.612011900899859,44.732792410993753,48.00730201880048,66.20579595709971,77.087435142785168,90.133976656404528,null,null,null,null,null,null,null,null,null,null,null,null,null,null,null,null,null,null,null,null,null,null,null,null,null,null,"Water source available when needed","Yes","N/A","N/A","N/A","N/A","N/A","N/A","N/A","N/A","N/A","N/A","N/A","N/A","N/A","N/A","N/A","N/A","N/A","N/A","N/A","N/A","N/A","N/A","N/A","N/A"]
[null,"2 No",49.289122407477926,46.420747067088065,36.047823803229448,26.669825562030127,16.971102979605948,37.539224709550147,27.089997715883769,23.241375808188181,20.445817915103877,14.356343929134487,57.433889908504213,63.771591553879013,60.112816777240752,52.170873091103545,47.054880097559071,41.245947233008138,28.378983592923834,17.999335174623376,53.38798809910066,55.26720758900597,51.992697981199676,33.794204042900091,22.912564857215109,9.8660233435954883,null,null,null,null,null,null,null,null,null,null,null,null,null,null,null,null,null,null,null,null,null,null,null,null,null,null,null,"No","N/A","N/A","N/A","N/A","N/A","N/A","N/A","N/A","N/A","N/A","N/A","N/A","N/A","N/A","N/A","N/A","N/A","N/A","N/A","N/A","N/A","N/A","N/A","N/A"]
["Improved water source available when needed","1 Yes",50.710877592522053,53.579252932911814,63.952176196770594,73.330174437970058,83.028897020394083,62.460775290449874,72.910002284116288,76.75862419181189,79.554182084896098,85.643656070865532,42.566110091495787,36.228408446120973,39.887183222759063,47.829126908896576,52.945119902440808,58.754052766991791,71.621016407076155,82.000664825376475,46.612011900899859,44.732792410993753,48.00730201880048,66.20579595709971,77.087435142785168,90.133976656404528,null,null,null,null,null,null,null,null,null,null,null,null,null,null,null,null,null,null,null,null,null,null,null,null,null,null,"Improved water source available when needed","Yes","N/A","N/A","N/A","N/A","N/A","N/A","N/A","N/A","N/A","N/A","N/A","N/A","N/A","N/A","N/A","N/A","N/A","N/A","N/A","N/A","N/A","N/A","N/A","N/A"]
[null,"2 No",49.289122407477926,46.420747067088065,36.047823803229448,26.669825562030127,16.971102979605948,37.539224709550147,27.089997715883769,23.241375808188181,20.445817915103877,14.356343929134487,57.433889908504213,63.771591553879013,60.112816777240752,52.170873091103545,47.054880097559071,41.245947233008138,28.378983592923834,17.999335174623376,53.38798809910066,55.26720758900597,51.992697981199676,33.794204042900091,22.912564857215109,9.8660233435954883,null,null,null,null,null,null,null,null,null,null,null,null,null,null,null,null,null,null,null,null,null,null,null,null,null,null,null,"No","N/A","N/A","N/A","N/A","N/A","N/A","N/A","N/A","N/A","N/A","N/A","N/A","N/A","N/A","N/A","N/A","N/A","N/A","N/A","N/A","N/A","N/A","N/A","N/A"]
["Microbiological quality at point of collection","Not contaminated (No E. coli in 100 mL)","N/A","N/A","N/A","N/A","N/A","N/A","N/A","N/A","N/A","N/A","N/A","N/A","N/A","N/A","N/A","N/A","N/A","N/A","N/A","N/A","N/A","N/A","N/A","N/A",null,null,null,null,null,null,null,null,null,null,null,null,null,null,null,null,null,null,null,null,null,null,null,null,null,null,"Microbiological quality at point of collection","Not contaminated (No E. coli in 100 mL)","N/A","N/A","N/A","N/A","N/A","N/A","N/A","N/A","N/A","N/A","N/A","N/A","N/A","N/A","N/A","N/A","N/A","N/A","N/A","N/A","N/A","N/A","N/A","N/A"]
[null,"Contaminated (E. coli detected in 100 mL)","N/A","N/A","N/A","N/A","N/A","N/A","N/A","N/A","N/A","N/A","N/A","N/A","N/A","N/A","N/A","N/A","N/A","N/A","N/A","N/A","N/A","N/A","N/A","N/A",null,null,null,null,null,null,null,null,null,null,null,null,null,null,null,null,null,null,null,null,null,null,null,null,null,null,null,"Contaminated (E. coli detected in 100 mL)","N/A","N/A","N/A","N/A","N/A","N/A","N/A","N/A","N/A","N/A","N/A","N/A","N/A","N/A","N/A","N/A","N/A","N/A","N/A","N/A","N/A","N/A","N/A","N/A"]
[null,"Highly contaminated (>100 CFU/100 mL)","N/A","N/A","N/A","N/A","N/A","N/A","N/A","N/A","N/A","N/A","N/A","N/A","N/A","N/A","N/A","N/A","N/A","N/A","N/A","N/A","N/A","N/A","N/A","N/A",null,null,null,null,null,null,null,null,null,null,null,null,null,null,null,null,null,null,null,null,null,null,null,null,null,null,null,"Highly contaminated (>100 CFU/100 mL)","N/A","N/A","N/A","N/A","N/A","N/A","N/A","N/A","N/A","N/A","N/A","N/A","N/A","N/A","N/A","N/A","N/A","N/A","N/A","N/A","N/A","N/A","N/A","N/A"]
["Microbiological quality of improved water sources at point of collection","Not contaminated (No E. coli in 100 mL)","N/A","N/A","N/A","N/A","N/A","N/A","N/A","N/A","N/A","N/A","N/A","N/A","N/A","N/A","N/A","N/A","N/A","N/A","N/A","N/A","N/A","N/A","N/A","N/A",null,null,null,null,null,null,null,null,null,null,null,null,null,null,null,null,null,null,null,null,null,null,null,null,null,null,"Microbiological quality of improved water sources at point of collection","Not contaminated (No E. coli in 100 mL)","N/A","N/A","N/A","N/A","N/A","N/A","N/A","N/A","N/A","N/A","N/A","N/A","N/A","N/A","N/A","N/A","N/A","N/A","N/A","N/A","N/A","N/A","N/A","N/A"]
[null,"Contaminated (E. coli detected in 100 mL)","N/A","N/A","N/A","N/A","N/A","N/A","N/A","N/A","N/A","N/A","N/A","N/A","N/A","N/A","N/A","N/A","N/A","N/A","N/A","N/A","N/A","N/A","N/A","N/A",null,null,null,null,null,null,null,null,null,null,null,null,null,null,null,null,null,null,null,null,null,null,null,null,null,null,null,"Contaminated (E. coli detected in 100 mL)","N/A","N/A","N/A","N/A","N/A","N/A","N/A","N/A","N/A","N/A","N/A","N/A","N/A","N/A","N/A","N/A","N/A","N/A","N/A","N/A","N/A","N/A","N/A","N/A"]
[null,"Highly contaminated (>100 CFU/100 mL)","N/A","N/A","N/A","N/A","N/A","N/A","N/A","N/A","N/A","N/A","N/A","N/A","N/A","N/A","N/A","N/A","N/A","N/A","N/A","N/A","N/A","N/A","N/A","N/A",null,null,null,null,null,null,null,null,null,null,null,null,null,null,null,null,null,null,null,null,null,null,null,null,null,null,null,"Highly contaminated (>100 CFU/100 mL)","N/A","N/A","N/A","N/A","N/A","N/A","N/A","N/A","N/A","N/A","N/A","N/A","N/A","N/A","N/A","N/A","N/A","N/A","N/A","N/A","N/A","N/A","N/A","N/A"]
["Microbiological quality of piped on premises at point of collection","Not contaminated (No E. coli in 100 mL)","N/A","N/A","N/A","N/A","N/A","N/A","N/A","N/A","N/A","N/A","N/A","N/A","N/A","N/A","N/A","N/A","N/A","N/A","N/A","N/A","N/A","N/A","N/A","N/A",null,null,null,null,null,null,null,null,null,null,null,null,null,null,null,null,null,null,null,null,null,null,null,null,null,null,"Microbiological quality of piped on premises at point of collection","Not contaminated (No E. coli in 100 mL)","N/A","N/A","N/A","N/A","N/A","N/A","N/A","N/A","N/A","N/A","N/A","N/A","N/A","N/A","N/A","N/A","N/A","N/A","N/A","N/A","N/A","N/A","N/A","N/A"]
[null,"Contaminated (E. coli detected in 100 mL)","N/A","N/A","N/A","N/A","N/A","N/A","N/A","N/A","N/A","N/A","N/A","N/A","N/A","N/A","N/A","N/A","N/A","N/A","N/A","N/A","N/A","N/A","N/A","N/A",null,null,null,null,null,null,null,null,null,null,null,null,null,null,null,null,null,null,null,null,null,null,null,null,null,null,null,"Contaminated (E. coli detected in 100 mL)","N/A","N/A","N/A","N/A","N/A","N/A","N/A","N/A","N/A","N/A","N/A","N/A","N/A","N/A","N/A","N/A","N/A","N/A","N/A","N/A","N/A","N/A","N/A","N/A"]
[null,"Highly contaminated (>100 CFU/100 mL)","N/A","N/A","N/A","N/A","N/A","N/A","N/A","N/A","N/A","N/A","N/A","N/A","N/A","N/A","N/A","N/A","N/A","N/A","N/A","N/A","N/A","N/A","N/A","N/A",null,null,null,null,null,null,null,null,null,null,null,null,null,null,null,null,null,null,null,null,null,null,null,null,null,null,null,"Highly contaminated (>100 CFU/100 mL)","N/A","N/A","N/A","N/A","N/A","N/A","N/A","N/A","N/A","N/A","N/A","N/A","N/A","N/A","N/A","N/A","N/A","N/A","N/A","N/A","N/A","N/A","N/A","N/A"]
[null,null,"NATIONAL wealth index quintile",null,null,null,null,"URBAN wealth index quintile",null,null,null,null,"RURAL wealth index quintile",null,null,null,null,"SUB-REGIONS:",null,null,null,null,null,null,null,null,null,null,null,null,null,null,null,null,null,null,null,null,null,null,null,null,null,null,null,null,null,null,null,null,null,null,"Raw numbers of respondents:","Use of drinking water sources","NATIONAL wealth index quintile",null,null,null,null,"URBAN wealth index quintile",null,null,null,null,"RURAL wealth index quintile",null,null,null,null,"SUB-REGIONS:"]
["Percentage based on weighted population",null,"Poorest","Poor","Middle","Rich","Richest","1 Poorest","2 Poor","3 Middle","4 Rich","5 Richest","1 Poorest","2 Poor","3 Middle","4 Rich","5 Richest","2 Eastern Cape","4 Free State","7 Gauteng","5 Kwazulu-Natal","9 Limpopo","8 Mpumalanga","6 North West","3 Northern Cape","1 Western Cape",null,null,null,null,null,null,null,null,null,null,null,null,null,null,null,null,null,null,null,null,null,null,null,null,null,null,"Water data, raw numbers (weighted)",null,"Poorest","Poor","Middle","Rich","Richest","Poorest","Poor","Middle","Rich","Richest","Poorest","Poor","Middle","Rich","Richest","2 Eastern Cape","4 Free State","7 Gauteng","5 Kwazulu-Natal","9 Limpopo","8 Mpumalanga","6 North West","3 Northern Cape","1 Western Cape"]
["Source of drinking water","11 Piped into dwelling",5.6730596082474083,17.760524891243161,39.397476174796239,72.165046040184251,91.549111817025391,21.148100617596416,50.857238115083902,76.522691784945437,90.438590072599126,93.956986755960443,0.81699394644432544,2.6746987509669817,5.6977422875559087,11.443677873126539,21.948071572063458,28.730379534252894,65.123597304038412,63.87811372025056,34.895659594451843,12.611952007822063,27.667275262337643,26.0357608825997,50.86396386345843,87.009797316727926]
[null,"12 Piped to yard/plot",19.491001310078776,39.635803503876922,37.110733927562627,19.214713024342988,4.8597169582375255,41.135958940823571,38.130784498711371,20.706798293956293,7.8939326097930129,2.6019757852274035,6.9613536831463501,24.699633507614514,28.126078098917713,37.854482845820606,39.667238591884981,14.072205013157667,26.990108903741238,23.879868410370626,31.953576799344525,22.172833334970914,39.677377157579663,34.596084905314314,21.064706874252529,5.3563713008967797]
[null,"13 Piped to neighbor",4.1422849291648411,5.3240140638463513,3.4891351835971474,1.0331558023252758,0,4.240502546901018,2.1646689005078077,0.3341557794030019,5.7906311895169191E-2,0,3.6467785387736846,2.8317690463315959,5.8299116972001341,8.7299404336117732,5.3916481872246012,1.2490149783958966,1.3048315192762621,0.79226716657940444,4.2412598932009944,3.2849732843217438,6.8286111023431868,9.3488811146142776,1.1227347314942064,0.12035534173918663]
[null,"14 Public tap/standpipe",33.535112449646938,22.004813868390428,10.09485101620319,2.8406728567234603,0.19721417607217079,28.233197858824973,7.0203795200784791,1.14126255408846,7.0765073274262583E-2,0.10562714759514417,27.217376755987505,33.559752328291111,31.146743199786826,20.4551981299511,11.785339241065655,20.270135167682245,3.0436506461259305,9.0280895201242828,12.186020841326693,30.861573544750847,8.7113165285787009,19.465748969907608,23.464971950960692,6.1116838904026434]
[null,"21 Tube well or borehole",3.4404728545397485,4.4607757475037859,3.7947459685526654,1.8850547442426751,0.76310884085486119,0.13278308003866177,0.40735877273304599,0.22970832226999952,0.19727506144795545,0.15142736496444792,5.006919506311589,5.5977141072538679,8.0544971820030842,8.1586214521180267,10.404901213190415,0.85894244472458947,0.60315367431892719,8.0253522294381985E-2,1.5938805492800394,14.505918679548561,5.9784621687558941,5.0318788995667747,1.7364113208092564,7.7572725449431168E-2]
[null,"31 Protected well",0.46526382737067629,0.16319775546263426,0.20443838516192603,3.8727196776762375E-2,1.1631702331944046E-2,1.7422306534844102E-2,3.4788985840099526E-2,1.8366003219726919E-2,0,1.8365897902357788E-2,1.0642141975257857,0.2067463841711083,0.28615613116067617,0.34463497195452064,0.35696876778237968,0.67599864730482861,0,0,0.14717799865834311,0.30831481362392787,0,0.35708738216994257,0,5.0005003834581389E-2]
[null,"32 Unprotected well",7.0268963686676251,1.8587893137171982,0.22940302256339182,0,0,2.6281309560802539E-2,2.6239353105785911E-2,0,0,0,12.749445482111643,6.8206958377444975,4.011686584412093,0.84525499281528049,0.36290568367328835,9.1915166936080741,0,0,1.6880633301878718,1.9792569222628318,1.4957761479280609,0,0,0]
[null,"41 Protected spring",1.2841823360462408,0.29833252448079894,0.19096024273587545,0.19335538682213987,0,0,0.10495741242314365,0,0.21003671192493198,0,3.1006924378171519,0.4489328242465192,0.43698211330131181,0.67636281363619888,0.16407800298253589,1.0958511901435253,0.10050369259486508,0,0.96876669102287749,0.20091036557383793,0.48271693725889586,0.10326322786600146,0,0]
[null,"42 Unprotected spring",4.0627147271231125,0.88099737441081749,0.72588586058049887,6.1355119049364915E-2,3.3385227933654137E-2,0.15768785736481522,0.15743611863471549,7.8489664168908679E-3,0,0,8.0613219396528315,3.1901904406256469,1.3095013340174437,1.8724860725880046,0.74887563096585774,3.6049554128830508,0,0,3.1431814885049021,0.27311418283483757,0.86420984958605551,0,4.7250323565246402E-2,6.1636910643114856E-2]
[null,"43 River/dam/lake/ponds/stream/canal/irrigation channel",12.813930325505698,2.8052585472491978,1.1904586384886864,9.9075024081315105E-2,0,0.82907445193692053,0,2.0521277900165068E-2,0,0,25.234945132474774,9.6293616145697669,5.5710219084107333,3.5827630758975304,0.68254316424229666,13.138174803545525,0,0,5.5972032424655334,4.6324370660097252,1.9662238962753129,0,0.37412055196798744,0]
[null,"51 Rainwater",0.91871457390965205,0.79933459120262329,0.6990545986421689,0.14320205981594147,2.1643182670185744E-2,3.2540196143534934E-2,0,0,1.0310518198399459E-2,0,1.4945702536364882,1.2259065543356367,1.6941190974519638,1.3124499387482678,1.2480127976225559,3.7794253324109932,0,0,3.8251812294478091E-2,3.6045512642329164E-2,0.24275750194977733,0,6.2136839778120768E-2,0]
[null,"61 Tanker truck",5.1303650867149635,2.3056064376280565,1.3749040725714394,1.0478524993847655,0.12115040938160825,3.6282630826155757,0.59817786139471973,0.56878075973216946,0.14867378300585318,0,3.4478510760495942,4.9875298924905938,4.6219931205386482,1.9312622208032024,3.6970825504564764,1.7160239569878384,2.4802153346403357,1.1619307720312932,2.4721670611534745,4.149991305844595,3.6787932856770991,2.1805968746332951,5.5268198096872306E-2,7.8369266064191936E-2]
[null,"62 Cart with small tank",1.4561333581402756,1.0132227715197077,1.2173494245177761,0.51133918151912838,7.5362854289195369E-2,8.462849986588851E-2,3.1232820971907306E-2,6.6340823414130903E-2,0,0,1.1044704303942201,2.9682239897645477,2.0873758296922418,2.6025872709270947,2.5871803523852517,0.31954008615427637,0.23471023819266415,5.2021537965913876E-2,0.47556758321282311,4.5306765233341748,1.1901876432923131,1.7991963285848667,2.2347777967098144E-2,0]
[null,"71 Bottled water",0.27966206802382432,0.21164359922394546,0.15341799293708633,0.5672188621021953,2.3459388652410298,0.13279412801556204,6.6044551703797721E-2,0.38352543465380529,0.90247217242081568,3.1656170483502564,0,0.56752192508233523,0.45659409780230803,0.17119765547564472,0.47354742406019873,1.010854863952044,3.6716799385470927E-2,1.1274553503835039,0.39529302431831015,1.4862552171849584E-2,0.85696876124731203,0.98327086164399868,1.1041874735647252,0.59686120728993863]
[null,"96 Other",0.28020617682040933,0.47768501024428311,0.12718549108930746,0.19923220262985591,2.1735965962470013E-2,0.20076512377758862,0.40069308881157428,0,7.0037685440461211E-2,0,9.3066619673891751E-2,0.59132279651115771,0.66959731774871123,1.9080252526371914E-2,0.48160682040006469,0.28698187479632742,8.2511887685943724E-2,0,0.20393009057778833,0.43713990428753585,0.35932375719025844,9.8230553098930931E-2,8.1900094085188183E-2,0.53734703695224362]
[]
[]
[]
[]
[]
[]
[]
[]
[]
[]
[]
[]
[]
[]
[]
[]
[]
[]
[]
[]
[]
[]
[]
[]
[]
[]
[]
[]
[]
[]
[]
[]
[]
[]
[]
[{"$f":"A1026","v":"South Africa"}]
[{"$f":"A1034","v":"2016"}]
["Use of sanitation facilities"]
[" by wealth quintile and sub-national region"]
["Notes:"]
["WHO/UNICEF JMP customised wealth index excludes water,"]
[" sanitation and hygiene assets."]
["Survey used for analysis:",{"$f":"A1025","v":"DHS16"}]
["Improved latrines without pipe:","JMP SAGE08 Ratio"]
[{"$f":"B1029","v":""}]
[]
[]
["Use of sanitation facilities",null,"NATIONAL wealth index quintile",null,null,null,null,"URBAN wealth index quintile",null,null,null,null,"RURAL wealth index quintile",null,null,null,null,"SUB-REGIONS:",null,null,null,null,null,null,null,null,null,null,null,null,null,null,null,null,null,null,null,null,null,null,null,null,null,null,null,null,null,null,null,null,null,null,"Raw numbers of respondents:","Use of sanitation facilities","NATIONAL wealth index quintile",null,null,null,null,"URBAN wealth index quintile",null,null,null,null,"RURAL wealth index quintile",null,null,null,null,"SUB-REGIONS:"]
["Weighted percentage (used in graphs)",null,"Poorest","Poor","Middle","Rich","Richest","1 Poorest","2 Poor","3 Middle","4 Rich","5 Richest","1 Poorest","2 Poor","3 Middle","4 Rich","5 Richest","2 Eastern Cape","4 Free State","7 Gauteng","5 Kwazulu-Natal","9 Limpopo","8 Mpumalanga","6 North West","3 Northern Cape","1 Western Cape",null,null,null,null,null,null,null,null,null,null,null,null,null,null,null,null,null,null,null,null,null,null,null,null,null,null,"Sanitation data, raw numbers (weighted)",null,"Poorest","Poor","Middle","Rich","Richest","Poorest","Poor","Middle","Rich","Richest","Poorest","Poor","Middle","Rich","Richest","2 Eastern Cape","4 Free State","7 Gauteng","5 Kwazulu-Natal","9 Limpopo","8 Mpumalanga","6 North West","3 Northern Cape","1 Western Cape"]
["Sanitation","1 Improved",{"$f":"C153+C154+C155+C157+C158+C159+C160*0.64+C162+C164","v":75.483175864222218},{"$f":"D153+D154+D155+D157+D158+D159+D160*0.64+D162+D164","v":82.992492611907082},88.745218890270351,95.398742504222128,99.669437499476714,{"$f":"H153+H154+H155+H157+H158+H159+H160*0.62+H162+H164","v":77.505588089455998},{"$f":"I153+I154+I155+I157+I158+I159+I160*0.62+I162+I164","v":94.756575496382609},98.380183970941331,99.321626582342148,99.976180961945374,76.611885663199132,77.645862864360865,80.062607346318146,77.699235163998836,80.932459156060588,89.260709454462742,91.065778029659654,94.940462431555858,87.649388481373919,79.574826119063857,75.117984273323628,82.013589202853112,89.40251697922497,95.385966037581582,null,null,null,null,null,null,null,null,null,null,null,null,null,null,null,null,null,null,null,null,null,null,null,null,null,null,"Sanitation","Improved",3892.9957840000056,4743.3338689999873,5520.9366549999804,6803.3444619999864,7534.8909399999975,2824.1500919999994,4306.8299739999893,4654.2477209999988,4739.0684299999975,4813.8586440000026,1555.1458760000005,1381.7358490000006,1417.7982120000001,1305.5959699999976,1497.0709419999996,4018.9131370000068,1653.8580490000002,8258.2457659999873,5027.9848039999952,1998.7447219999997,1389.4640590000004,1553.2953540000008,667.06670399999928,3927.9291150000013]
[null,"2 Not Improved",{"$f":"100-C122","v":24.516824135777782},{"$f":"100-D122","v":17.007507388092918},11.254781109729649,4.6012574957778725,0.33056250052328551,22.494411910544002,5.2434245036173905,1.6198160290586685,0.67837341765785197,2.3819038054625707E-2,23.388114336800868,22.354137135639135,19.937392653681854,22.300764836001164,19.067540843939412,10.739290545537258,8.9342219703403458,5.0595375684441422,12.350611518626081,20.425173880936143,24.882015726676372,17.986410797146888,10.59748302077503,4.6140339624184179,null,null,null,null,null,null,null,null,null,null,null,null,null,null,null,null,null,null,null,null,null,null,null,null,null,null,null,"Not Improved",3708.425156000003,2849.129621000005,2094.4673639999974,797.234059,67.770947000000007,1991.2111710000056,516.23100199999999,160.73020000000002,81.193659999999994,1.1468879999999999,1226.1327490000001,1408.107379999999,1366.5503069999982,1476.432198999996,1289.2915909999988,853.59040000000005,348.89821599999999,1169.9260870000003,2034.5354739999993,2018.3849950000015,1696.2737409999982,1072.6442529999988,132.77120500000001,190.00277599999998]
["Sanitation ladder","1 Basic",{"$f":"C122*C129/100","v":58.585412011355196},{"$f":"D122*D129/100","v":56.820342146416941},68.726682652044232,86.158190150999047,96.765443588569937,32.315721081157221,63.060582514942588,85.413956593723967,94.804266683502817,97.829411922677778,72.673034200290445,75.437135947168329,73.384988735664351,68.267379806418191,76.842960521410873,82.192766413890936,81.98058808942065,69.403224888309637,78.064061958779206,73.216207105703688,62.806737785560792,66.825377335810103,85.475561810101865,82.456361491094,null,null,null,null,null,null,null,null,null,null,null,null,null,null,null,null,null,null,null,null,null,null,null,null,null,null,"Sanitation ladder","Basic",3021.5045850000038,3247.4967899999992,4275.5617279999969,6144.3561039999959,7315.3524539999989,1177.5208590000011,2866.1990529999953,4040.8311590000044,4523.5254669999986,4710.4915960000044,1475.191068000001,1342.4307650000005,1299.5468079999998,1147.1105959999993,1421.4242899999992,3700.682985000004,1488.8606719999998,6036.9296019999956,4478.1249939999971,1839.0301889999998,1161.7418339999979,1265.6384040000019,637.76617499999998,3395.4968060000028]
[null,"2 Limited",{"$f":"C122*C128/100","v":16.897763852867001},{"$f":"D122*D128/100","v":26.172150465490354},20.018536238226385,9.2405523532232205,2.903993910906792,45.189867008298926,31.69599298144016,12.966227377217489,4.5173598988393602,2.1467690392676362,3.938851462908703,2.2087269171925374,6.6776186106537656,9.431855357580746,4.0894986346496935,7.0679430405717403,9.0851899402389833,25.537237543246349,9.5853265225947339,6.3586190133601699,12.311246487762714,15.188211867043064,3.9269551691232003,12.929604546487624,null,null,null,null,null,null,null,null,null,null,null,null,null,null,null,null,null,null,null,null,null,null,null,null,null,null,null,"Limited",871.49119900000062,1495.8370790000001,1245.3749270000001,658.98835799999995,219.53848600000003,1646.6292330000033,1440.6309210000006,613.41656199999966,215.54296300000004,103.36704799999998,79.954807999999986,39.305084000000001,118.25140399999998,158.48537400000001,75.646651999999989,318.23015200000032,164.997377,2221.316164000003,549.85980999999992,159.71453299999999,227.72222500000018,287.65695000000017,29.300528999999997,532.4323089999998]
[null,"3 Other unimproved",{"$f":"100-(C124+C125+C127)","v":16.839645913359817},{"$f":"100-(D124+D125+D127)","v":14.587405516782951},10.422628687587476,4.3357128804009477,0.3305625005232713,19.150554654449124,5.1629001640054213,1.478626015074255,0.67837341765782355,2.3819038054583075E-2,12.270102095219002,16.90536935471664,16.924595712940871,18.515135553970595,18.036273388262671,5.3572483775092508,8.483772499395883,4.5136998302018441,10.709074553965749,17.080440340682387,21.736727491234063,13.544804612104059,6.3600085751869671,3.8789022555010746,null,null,null,null,null,null,null,null,null,null,null,null,null,null,null,null,null,null,null,null,null,null,null,null,null,null,null,"Unimproved",3124.8505230000083,2665.3842700000037,2031.0955949999973,777.05113200000005,67.770947000000007,1830.1923640000048,512.347264,153.93193200000002,81.193659999999994,1.1468879999999999,916.909851,1256.0953009999996,1282.6635399999982,1371.1149259999959,1260.5567409999992,591.35020499999962,339.87681099999998,1118.463567,1918.601592999999,1884.0227099999995,1599.2183929999981,956.01035699999909,98.878277999999995,159.73055299999999]
[null,"4 Open defecation",{"$f":"C161","v":7.6771782224179841},{"$f":"D161","v":2.4201018713097522},0.83215242214189944,0.26554461537678575,0,3.343857256094724,8.052433961183271E-2,0.14119001398428227,0,0,11.118012241581852,5.4487677809224939,3.0127969407410178,3.7856292820304707,1.031267455676774,5.3820421680280743,0.4504494709444839,0.54583773824216919,1.641536964660316,3.3447335402537539,3.145288235442433,4.4416061850427653,4.2374744455879609,0.73513170691729635,null,null,null,null,null,null,null,null,null,null,null,null,null,null,null,null,null,null,null,null,null,null,null,null,null,null,null,"Open defecation",583.57463299999984,183.74535099999991,63.371769,20.182927000000003,0,161.01880699999995,3.8837380000000001,6.7982680000000002,0,0,309.22289799999993,152.01207899999994,83.886766999999992,105.317273,28.734850000000002,262.24019500000003,9.0214049999999997,51.462519999999998,115.93388099999996,134.36228500000004,97.055347999999952,116.63389599999998,33.892926999999993,30.272223]
["Shared among Improved Sanitation","1 Yes",22.386132617501939,31.53556381042517,22.557312369670804,9.6862412550293886,2.9136252634334761,58.305301749522023,33.449913966815075,13.179714505359474,4.5482137720471822,2.147280500827268,5.1413059851113259,2.8446163590852875,8.340496059251624,12.138929472951752,5.0529771086826702,7.9183137617537351,9.9765138307828245,26.898160056526542,10.935987904389863,7.990741951287565,16.389213058442998,18.519140565201226,4.3924436378404561,13.555038632615437,null,null,null,null,null,null,null,null,null,null,null,null,null,null,null,null,null,null,null,null,null,null,null,null,null,null,"Shared among improved sanitation facilities","Yes","N/A","N/A","N/A","N/A","N/A","N/A","N/A","N/A","N/A","N/A","N/A","N/A","N/A","N/A","N/A","N/A","N/A","N/A","N/A","N/A","N/A","N/A","N/A","N/A"]
[null,"2 No",77.613867382498029,68.464436189575082,77.442687630329502,90.313758744970755,97.08637473656654,41.694698250478162,66.550086033185067,86.820285494640643,95.451786227952837,97.852719499172764,94.858694014888698,97.155383640914707,91.659503940748351,87.861070527048383,94.947022891317303,92.081686238246192,90.023486169217151,73.101839943473593,89.064012095610167,92.009258048712439,83.610786941556839,81.480859434798845,95.607556362159656,86.444961367384593,null,null,null,null,null,null,null,null,null,null,null,null,null,null,null,null,null,null,null,null,null,null,null,null,null,null,null,"No","N/A","N/A","N/A","N/A","N/A","N/A","N/A","N/A","N/A","N/A","N/A","N/A","N/A","N/A","N/A","N/A","N/A","N/A","N/A","N/A","N/A","N/A","N/A","N/A"]
["Manually calculated ratios","Improved latrines",{"$f":"(C158+C159)/(C158+C159+C160)*100","v":50.062390050753244},{"$f":"(D158+D159)/(D158+D159+D160)*100","v":44.836043429660236},38.154232330671761,35.55244878152223,22.053577775517965,20.354607848639354,34.930768785750907,48.306276327724937,22.891096507187839,50,62.351925162933817,51.774727221584882,49.497350941746951,43.519150454497016,34.954097422023082,79.188369344520382,38.046192397941113,22.853573777086385,51.632643587489447,40.042620285541872,19.133007140820158,26.903580199527216,65.21527075994797,{"$error":"#DIV/0!"}]
[null,"Other"]
[null,"Other"]
[null,null,"NATIONAL wealth index quintile",null,null,null,null,"URBAN wealth index quintile",null,null,null,null,"RURAL wealth index quintile",null,null,null,null,"SUB-REGIONS:",null,null,null,null,null,null,null,null,null,null,null,null,null,null,null,null,null,null,null,null,null,null,null,null,null,null,null,null,null,null,null,null,null,null,"Raw numbers of respondents:","Use of sanitation facilities","NATIONAL wealth index quintile",null,null,null,null,"URBAN wealth index quintile",null,null,null,null,"RURAL wealth index quintile",null,null,null,null,"SUB-REGIONS:"]
["Percentage based on weighted population",null,"Poorest","Poor","Middle","Rich","Richest","1 Poorest","2 Poor","3 Middle","4 Rich","5 Richest","1 Poorest","2 Poor","3 Middle","4 Rich","5 Richest","2 Eastern Cape","4 Free State","7 Gauteng","5 Kwazulu-Natal","9 Limpopo","8 Mpumalanga","6 North West","3 Northern Cape","1 Western Cape",null,null,null,null,null,null,null,null,null,null,null,null,null,null,null,null,null,null,null,null,null,null,null,null,null,null,"Sanitation data, raw numbers (weighted)",null,"Poorest","Poor","Middle","Rich","Richest","Poorest","Poor","Middle","Rich","Richest","Poorest","Poor","Middle","Rich","Richest","2 Eastern Cape","4 Free State","7 Gauteng","5 Kwazulu-Natal","9 Limpopo","8 Mpumalanga","6 North West","3 Northern Cape","1 Western Cape"]
["Sanitation type","1 Sewer connection",9.1146602256182963,30.780964782749283,52.380831299923628,81.198587527887526,97.32544111493776,39.885490622637924,80.088495381278477,92.888500993813921,95.341977908923241,99.495496467479455,2.0102903929662892,1.2655440862408389,2.769348430120139,5.7024251503903542,22.267410240116096,37.551276753439424,74.016341624076858,79.737654915654289,37.178681938504646,17.177677909672493,32.177209807003059,42.655643679470153,62.173371554961186,93.100493074668023,null,null,null,null,null,null,null,null,null,null,null,null,null,null,null,null,null,null,null,null,null,null,null,null,null,null,"Sanitation type","Sewer connection","N/A","N/A","N/A","N/A","N/A","N/A","N/A","N/A","N/A","N/A","N/A","N/A","N/A","N/A","N/A","N/A","N/A","N/A","N/A","N/A","N/A","N/A","N/A","N/A"]
[null,"2 Septic tank connection",0.75704057773177391,1.2004660690176054,1.9945782997334121,1.8396976047765807,1.2064992941070409,2.0889942935938777,1.7553493605261083,0.87888758150756263,1.88470125283167,0.31131602861884294,3.0785732587291528E-2,0.3768613551725844,0.69540281569901996,1.8494991018906566,4.1826483675302866,2.8525921211660621,0.32490204193669087,0.43112176606185171,2.5085730168009128,1.2179680878350854,0.55255021991823272,2.7683522806927914,1.9030179526036992,0.36257894484928471,null,null,null,null,null,null,null,null,null,null,null,null,null,null,null,null,null,null,null,null,null,null,null,null,null,null,null,"Septic tank connection","N/A","N/A","N/A","N/A","N/A","N/A","N/A","N/A","N/A","N/A","N/A","N/A","N/A","N/A","N/A","N/A","N/A","N/A","N/A","N/A","N/A","N/A","N/A","N/A"]
[null,"3 Improved latrines",41.342352657554656,30.492809231803125,18.121553676691402,6.4725914828819491,0.57664881921112865,16.674283841785371,7.4527657599326433,2.8944818914362793,1.0888966620485154,0.16936846584707091,53.873705731298259,47.884959918656399,47.455534139618138,39.377721699840954,27.278446720342835,42.077613313798146,8.2378538458847448,7.4223904582024378,31.505245824655013,31.359897457849428,12.298824676549017,13.727987195099219,19.323846527009316,1.9228940180642731,null,null,null,null,null,null,null,null,null,null,null,null,null,null,null,null,null,null,null,null,null,null,null,null,null,null,null,"Improved latrines","N/A","N/A","N/A","N/A","N/A","N/A","N/A","N/A","N/A","N/A","N/A","N/A","N/A","N/A","N/A","N/A","N/A","N/A","N/A","N/A","N/A","N/A","N/A","N/A"]
[null,"4 Unimproved facilities",41.108768316677526,35.105658045120222,26.670884301509563,10.223578769077248,0.89141077174408367,38.007373985888329,10.622865158651102,3.1969395192580796,1.6844241761966103,2.3819038054637882E-2,32.967205901566174,45.02386685900759,46.066917673821415,49.284724765847535,45.240227216334006,12.13647564356808,16.970453017157343,11.862995121839132,27.165962255379565,46.899723004388974,51.826127061087348,36.406410659694835,12.362289519838235,3.8789022555011461,null,null,null,null,null,null,null,null,null,null,null,null,null,null,null,null,null,null,null,null,null,null,null,null,null,null,null,"Unimproved facilities","N/A","N/A","N/A","N/A","N/A","N/A","N/A","N/A","N/A","N/A","N/A","N/A","N/A","N/A","N/A","N/A","N/A","N/A","N/A","N/A","N/A","N/A","N/A","N/A"]
[null,"5 Open defecation",7.6771782224179841,2.4201018713097522,0.83215242214189944,0.26554461537678575,0,3.343857256094724,8.052433961183271E-2,0.14119001398428227,0,0,11.118012241581852,5.4487677809224939,3.0127969407410178,3.7856292820304707,1.031267455676774,5.3820421680280743,0.4504494709444839,0.54583773824216919,1.641536964660316,3.3447335402537539,3.145288235442433,4.4416061850427653,4.2374744455879609,0.73513170691729635,null,null,null,null,null,null,null,null,null,null,null,null,null,null,null,null,null,null,null,null,null,null,null,null,null,null,null,"Open defecation","N/A","N/A","N/A","N/A","N/A","N/A","N/A","N/A","N/A","N/A","N/A","N/A","N/A","N/A","N/A","N/A","N/A","N/A","N/A","N/A","N/A","N/A","N/A","N/A"]
["Septic tank emptying practices","Not emptied/treated and disposed in situ","N/A","N/A","N/A","N/A","N/A","N/A","N/A","N/A","N/A","N/A","N/A","N/A","N/A","N/A","N/A","N/A","N/A","N/A","N/A","N/A","N/A","N/A","N/A","N/A",null,null,null,null,null,null,null,null,null,null,null,null,null,null,null,null,null,null,null,null,null,null,null,null,null,null,"Septic tank emptying practices","Not emptied/treated and disposed in situ","N/A","N/A","N/A","N/A","N/A","N/A","N/A","N/A","N/A","N/A","N/A","N/A","N/A","N/A","N/A","N/A","N/A","N/A","N/A","N/A","N/A","N/A","N/A","N/A"]
[null,"Emptied and buried on site","N/A","N/A","N/A","N/A","N/A","N/A","N/A","N/A","N/A","N/A","N/A","N/A","N/A","N/A","N/A","N/A","N/A","N/A","N/A","N/A","N/A","N/A","N/A","N/A",null,null,null,null,null,null,null,null,null,null,null,null,null,null,null,null,null,null,null,null,null,null,null,null,null,null,null,"Emptied and buried on site","N/A","N/A","N/A","N/A","N/A","N/A","N/A","N/A","N/A","N/A","N/A","N/A","N/A","N/A","N/A","N/A","N/A","N/A","N/A","N/A","N/A","N/A","N/A","N/A"]
[null,"Emptied and discharged locally","N/A","N/A","N/A","N/A","N/A","N/A","N/A","N/A","N/A","N/A","N/A","N/A","N/A","N/A","N/A","N/A","N/A","N/A","N/A","N/A","N/A","N/A","N/A","N/A",null,null,null,null,null,null,null,null,null,null,null,null,null,null,null,null,null,null,null,null,null,null,null,null,null,null,null,"Emptied and discharged locally","N/A","N/A","N/A","N/A","N/A","N/A","N/A","N/A","N/A","N/A","N/A","N/A","N/A","N/A","N/A","N/A","N/A","N/A","N/A","N/A","N/A","N/A","N/A","N/A"]
[null,"Emptied and removed offsite","N/A","N/A","N/A","N/A","N/A","N/A","N/A","N/A","N/A","N/A","N/A","N/A","N/A","N/A","N/A","N/A","N/A","N/A","N/A","N/A","N/A","N/A","N/A","N/A",null,null,null,null,null,null,null,null,null,null,null,null,null,null,null,null,null,null,null,null,null,null,null,null,null,null,null,"Emptied and removed offsite","N/A","N/A","N/A","N/A","N/A","N/A","N/A","N/A","N/A","N/A","N/A","N/A","N/A","N/A","N/A","N/A","N/A","N/A","N/A","N/A","N/A","N/A","N/A","N/A"]
["Latrine emptying practices","Not emptied/treated and disposed in situ","N/A","N/A","N/A","N/A","N/A","N/A","N/A","N/A","N/A","N/A","N/A","N/A","N/A","N/A","N/A","N/A","N/A","N/A","N/A","N/A","N/A","N/A","N/A","N/A",null,null,null,null,null,null,null,null,null,null,null,null,null,null,null,null,null,null,null,null,null,null,null,null,null,null,"Latrine emptying practices","Not emptied/treated and disposed in situ","N/A","N/A","N/A","N/A","N/A","N/A","N/A","N/A","N/A","N/A","N/A","N/A","N/A","N/A","N/A","N/A","N/A","N/A","N/A","N/A","N/A","N/A","N/A","N/A"]
[null,"Emptied and buried on site","N/A","N/A","N/A","N/A","N/A","N/A","N/A","N/A","N/A","N/A","N/A","N/A","N/A","N/A","N/A","N/A","N/A","N/A","N/A","N/A","N/A","N/A","N/A","N/A",null,null,null,null,null,null,null,null,null,null,null,null,null,null,null,null,null,null,null,null,null,null,null,null,null,null,null,"Emptied and buried on site","N/A","N/A","N/A","N/A","N/A","N/A","N/A","N/A","N/A","N/A","N/A","N/A","N/A","N/A","N/A","N/A","N/A","N/A","N/A","N/A","N/A","N/A","N/A","N/A"]
[null,"Emptied and discharged locally","N/A","N/A","N/A","N/A","N/A","N/A","N/A","N/A","N/A","N/A","N/A","N/A","N/A","N/A","N/A","N/A","N/A","N/A","N/A","N/A","N/A","N/A","N/A","N/A",null,null,null,null,null,null,null,null,null,null,null,null,null,null,null,null,null,null,null,null,null,null,null,null,null,null,null,"Emptied and discharged locally","N/A","N/A","N/A","N/A","N/A","N/A","N/A","N/A","N/A","N/A","N/A","N/A","N/A","N/A","N/A","N/A","N/A","N/A","N/A","N/A","N/A","N/A","N/A","N/A"]
[null,"Emptied and removed offsite","N/A","N/A","N/A","N/A","N/A","N/A","N/A","N/A","N/A","N/A","N/A","N/A","N/A","N/A","N/A","N/A","N/A","N/A","N/A","N/A","N/A","N/A","N/A","N/A",null,null,null,null,null,null,null,null,null,null,null,null,null,null,null,null,null,null,null,null,null,null,null,null,null,null,null,"Emptied and removed offsite","N/A","N/A","N/A","N/A","N/A","N/A","N/A","N/A","N/A","N/A","N/A","N/A","N/A","N/A","N/A","N/A","N/A","N/A","N/A","N/A","N/A","N/A","N/A","N/A"]
["Shared among improved sanitation facilities","Yes",11.464845926556483,19.70160384663237,16.353366464771423,8.6702394584734694,2.8876528939869726,34.195341596741258,29.869639388113043,12.739758563059045,4.4716025596857145,2.1467690392676357,2.874750026168265,1.4088635372564857,4.2470043959320796,5.6967566240340339,2.7148890750606434,6.5311425550228304,8.2385150846101656,23.560412332674982,7.7856032741291408,3.9758370839783264,7.3798306842532329,10.954438907627148,3.6633083616445696,12.929604546487624,null,null,null,null,null,null,null,null,null,null,null,null,null,null,null,null,null,null,null,null,null,null,null,null,null,null,"Shared among improved sanitation facilities","Yes","N/A","N/A","N/A","N/A","N/A","N/A","N/A","N/A","N/A","N/A","N/A","N/A","N/A","N/A","N/A","N/A","N/A","N/A","N/A","N/A","N/A","N/A","N/A","N/A"]
[null,"No",39.749207534348265,42.772636236937579,56.143596811577133,80.840637157072621,96.220936334268941,24.453427161275933,59.426971113624283,83.92211190369872,93.843973264117679,97.82941192267775,53.040031830683574,48.118501822813322,46.67328098950523,41.232889328087921,51.01361625292855,75.950339633380864,74.340582427288069,64.03075480724371,63.406897505831381,45.77970637137868,37.648754019217066,48.197544247635037,79.736927672929511,82.456361491094,null,null,null,null,null,null,null,null,null,null,null,null,null,null,null,null,null,null,null,null,null,null,null,null,null,null,null,"No","N/A","N/A","N/A","N/A","N/A","N/A","N/A","N/A","N/A","N/A","N/A","N/A","N/A","N/A","N/A","N/A","N/A","N/A","N/A","N/A","N/A","N/A","N/A","N/A"]
[null,"DK/missing",48.785946539095448,37.52575991642999,27.503036723651459,10.489123384454032,0.89141077174408367,41.351231241983079,10.703389498262935,3.3381295332423622,1.6844241761966103,2.3819038054637882E-2,44.085218143148033,50.472634639930057,49.079714614562434,53.070354047878013,46.271494672010768,17.518517811596162,17.420902488101831,12.408832860081304,28.807499220039883,50.24445654464278,54.971415296529791,40.848016844737586,16.599763965426199,4.6140339624184419,null,null,null,null,null,null,null,null,null,null,null,null,null,null,null,null,null,null,null,null,null,null,null,null,null,null,null,"DK/missing","N/A","N/A","N/A","N/A","N/A","N/A","N/A","N/A","N/A","N/A","N/A","N/A","N/A","N/A","N/A","N/A","N/A","N/A","N/A","N/A","N/A","N/A","N/A","N/A"]
["Shared among all sanitation facilities","Yes",23.247967775707064,27.10293496562997,19.696321794706346,9.0551100069672881,2.9866026843605713,53.389184089723706,32.676453681407573,12.931162329012915,4.6681708545852141,2.1467690392676357,6.9736441261058895,4.9129051721145895,10.150027297998159,11.49122370516926,5.3296707857280401,8.8265824490509033,10.175040677174101,28.541225625725609,12.63816667390978,6.9658840952181764,14.659964550827482,18.809092767413656,5.8960006346774545,15.919773387552958,null,null,null,null,null,null,null,null,null,null,null,null,null,null,null,null,null,null,null,null,null,null,null,null,null,null,"Shared among all sanitation facilities","Yes","N/A","N/A","N/A","N/A","N/A","N/A","N/A","N/A","N/A","N/A","N/A","N/A","N/A","N/A","N/A","N/A","N/A","N/A","N/A","N/A","N/A","N/A","N/A","N/A"]
[null,"No",76.752032224293359,72.897065034370073,80.303678205293721,90.94488999303276,97.013397315639423,46.610815910276443,67.323546318592719,87.068837670987264,95.331829145414773,97.85323096073239,93.026355873894161,95.08709482788538,89.849972702001764,88.508776294830753,94.670329214271959,91.173417550949054,89.824959322825876,71.458774374274313,87.361833326090419,93.034115904781871,85.340035449172802,81.190907232586284,94.10399936532265,84.080226612447092,null,null,null,null,null,null,null,null,null,null,null,null,null,null,null,null,null,null,null,null,null,null,null,null,null,null,null,"No","N/A","N/A","N/A","N/A","N/A","N/A","N/A","N/A","N/A","N/A","N/A","N/A","N/A","N/A","N/A","N/A","N/A","N/A","N/A","N/A","N/A","N/A","N/A","N/A"]
["Type of toilet facility","11 Flush to piped sewer system",9.1146602256182963,30.780964782749283,52.380831299923628,81.198587527887526,97.32544111493776,39.885490622637924,80.088495381278477,92.888500993813921,95.341977908923241,99.495496467479455,2.0102903929662892,1.2655440862408389,2.769348430120139,5.7024251503903542,22.267410240116096,37.551276753439424,74.016341624076858,79.737654915654289,37.178681938504646,17.177677909672493,32.177209807003059,42.655643679470153,62.173371554961186,93.100493074668023,null,null,null,null,null,null,null,null,null,null,null,null,null,null,null,null,null,null,null,null,null,null,null,null,null,null,"Type of toilet facility","11 Flush to piped sewer system",692.84369099999969,2337.0335129999999,3989.0119319999899,6171.5624029999926,7399.3242179999997,1920.6304650000029,3862.7169669999912,4472.560814000004,4595.733217,4790.7136590000036,55.911776999999994,35.306696000000002,77.108311999999984,158.64307400000004,620.45077600000002,1829.6872879999992,1482.3669190000007,7517.8031369999871,2625.751951000002,690.04960399999982,992.90432599999838,1120.1114420000017,497.28619500000087,3833.8148950000009]
[null,"12 Flush to septic tank",0.75704057773177391,1.2004660690176054,1.9945782997334121,1.8396976047765807,1.2064992941070409,2.0889942935938777,1.7553493605261083,0.87888758150756263,1.88470125283167,0.31131602861884294,3.0785732587291528E-2,0.3768613551725844,0.69540281569901996,1.8494991018906566,4.1826483675302866,2.8525921211660621,0.32490204193669087,0.43112176606185171,2.5085730168009128,1.2179680878350854,0.55255021991823272,2.7683522806927914,1.9030179526036992,0.36257894484928471,null,null,null,null,null,null,null,null,null,null,null,null,null,null,null,null,null,null,null,null,null,null,null,null,null,null,null,"12 Flush to septic tank",57.545840999999989,91.144948000000014,151.895196,139.82766100000001,91.726062000000013,100.59262200000001,84.661569999999998,42.318243000000002,90.847540000000009,14.989884,0.85623700000000003,10.513840999999999,19.362437999999997,51.453586000000008,116.54374700000001,138.99265200000002,6.5069959999999991,40.646901,177.16847799999999,48.927357999999998,17.050250999999999,72.695259000000007,15.221058999999995,14.930753999999999]
[null,"13 Flush to pit latrine",0.69242484287418049,2.0113954212771574,1.0985524706407583,0.5033549734970244,0.30309200044002965,2.840851278410097,1.7355035405216965,0.2431684255276568,0.43707511348205558,0.14149072009830449,7.2838405393490444E-2,0.21808763075840892,0.89203039168818765,0.6068220008738533,1.4494994287952554,0.85618402702454344,6.9065119114731663E-2,2.146501720114542,0.54405676001657188,9.7637598890610841E-2,1.1752214980806233,0.49796526032595717,1.4956471636805144,2.8714729415130095E-2,null,null,null,null,null,null,null,null,null,null,null,null,null,null,null,null,null,null,null,null,null,null,null,null,null,null,null,"13 Flush to pit latrine",52.634127000000007,152.71446300000005,83.659209000000033,38.257890000000003,23.043060000000001,136.79725200000001,83.704394000000008,11.708505999999998,21.068165999999998,6.8127860000000009,2.0258389999999999,6.0843030000000002,24.837235,16.881959000000002,40.388309,41.717597000000012,1.3832059999999999,202.37587100000005,38.424119000000005,3.9222289999999997,36.264253999999994,13.076267,11.962752999999999,1.182453]
[null,"14 Flush to somewhere else",0.38779219349481292,0.76445879623189239,0.28649762961446917,0.35025981149257895,0,1.529172910987884,0.32658177199873023,0.19844925889121234,1.4175536251805764E-2,0,7.4360978487007817E-2,0.21929203535185426,7.3792306745346634E-2,6.549915706478969E-2,0.87105470707964072,0.68337370608664827,0.27588229763944866,0,0.44903793195169278,0.3070938423470374,0.20330061744066572,0.36112136679463147,0,0.9065262123831469,null,null,null,null,null,null,null,null,null,null,null,null,null,null,null,null,null,null,null,null,null,null,null,null,null,null,null,"14 Flush to somewhere else",29.477716999999998,58.041254999999992,21.817951999999998,26.621771999999996,0,73.635199999999998,15.751237999999999,9.5552880000000009,0.68329799999999996,0,2.0681859999999999,6.1179040000000002,2.0546349999999998,1.8222050000000001,24.270741999999998,33.297407999999997,5.5252500000000007,0,31.713394999999998,12.336358000000001,6.2733240000000006,9.4828289999999988,0,37.330131999999999]
[null,"15 Flush, don't know where",7.0418176315335132E-2,2.0733046686010444E-2,0.17345949035721164,0.14009804609714155,2.5615857037257724E-2,0.10559255520596654,0.12790727777852628,5.0855601836102396E-2,0.17010643502166919,2.7877745748766447E-2,0,9.6105400193438502E-3,5.6535630839969458E-2,9.1229306312606354E-2,0.18331218351908557,0.44198057192708301,0,0,0.10872947188442798,2.1068874037556948E-2,0,0,0.10918349707778137,4.3665268090758713E-2,null,null,null,null,null,null,null,null,null,null,null,null,null,null,null,null,null,null,null,null,null,null,null,null,null,null,null,"15 Flush, don't know where",5.3527819999999995,1.5741489999999998,13.209641000000001,10.648262000000001,1.947487,5.0846629999999999,6.1690459999999998,2.4486859999999999,8.1995760000000004,1.3423149999999999,0,0.268119,1.5741489999999998,2.5380250000000002,5.107742,21.535519000000001,0,0,7.6790409999999998,0.84636400000000001,0,0,0.87329100000000004,1.798106]
[null,"21 Ventilated Improved Pit latrine (VIP)",17.322388003419821,9.2724851417099021,6.3871530753515051,2.4150516370936694,0,3.8926254077813742,1.6201044604002586,1.0275666641005978,0.23892800401647879,0,27.818694396358751,17.33017887794724,16.58619611907854,14.428443157866559,8.7470792157683661,24.722180986689718,3.5388455020012159,1.4870207203042167,8.9492975470647274,12.252627464755545,1.708062784854893,1.1186077898249214,8.5930444439587301,0,null,null,null,null,null,null,null,null,null,null,null,null,null,null,null,null,null,null,null,null,null,null,null,null,null,null,null,"21 Ventilated Improved Pit latrine (VIP)",1316.7476290000011,704.01004899999987,486.40751200000017,183.55789599999997,0,187.44397599999996,78.138625999999974,49.477108000000001,11.516956,0,773.71540099999993,483.48482199999978,461.81750599999964,401.40335300000021,243.72533799999991,1204.5891430000008,70.874449999999996,140.198869,632.04595400000005,492.20393899999988,52.706339,29.373965000000002,68.730426999999992,0]
[null,"22 Pit latrine with ventilation pipe but no gauze/mesh",20.692868470457345,16.784986265373497,9.2752899417771673,2.6600066487228435,0.24794096173384128,3.8801986142903462,3.1073857400056331,1.5622943497189927,0.24278710952831203,0,25.740828285407723,29.838668436519484,28.042271528580816,22.615815900460831,14.094714393720995,15.582501997884101,4.6044665350229259,1.914742134686034,18.500537691482794,18.864325386184642,9.4155403936134991,12.028818185992614,8.9901192717786316,0,null,null,null,null,null,null,null,null,null,null,null,null,null,null,null,null,null,null,null,null,null,null,null,null,null,null,null,"22 Pit latrine with ventilation pipe but no gauze/mesh",1572.9520370000009,1274.3939539999988,706.3508030000005,202.175894,18.850113,186.84558100000001,149.87110899999999,75.224127999999993,11.702974999999999,0,715.92415500000016,832.45207099999993,780.79457200000002,629.17836900000043,392.72984099999974,759.25796100000025,92.216241999999994,180.52517899999998,1306.6042259999992,757.80442100000005,290.53888899999993,315.86950099999979,71.906382000000022,0]
[null,"23 Pit latrine without ventilation pipe",37.92050375518361,32.059769575526779,25.387899396752921,9.1997904510563941,0.87632542378245604,30.41422472812717,8.806395152653808,2.7714733938444591,1.6226625137721509,0,32.33922469741767,43.935152350454807,45.534878063876313,48.077483143557565,42.506177856361518,10.592542603217371,13.260438309002131,11.483273893183247,25.71388703345832,46.592629162041945,47.014686827895801,35.721259449360851,9.3785639760168245,0,null,null,null,null,null,null,null,null,null,null,null,null,null,null,null,null,null,null,null,null,null,null,null,null,null,null,null,"23 Pit latrine without ventilation pipe",2882.4971130000104,2434.1263000000017,1933.3911109999972,699.23729700000001,66.624059000000003,1464.5547960000019,424.73780799999997,133.44583200000002,78.216585999999992,0,899.44394399999999,1225.7218729999991,1267.8497029999983,1337.5291239999963,1184.3762139999994,516.12201299999947,265.57425900000004,1082.662797,1816.0484859999983,1871.6863519999995,1450.7499629999986,938.01869999999894,75.013310000000004,0]
[null,"31 No facility/bush/field",7.6771782224179841,2.4201018713097522,0.83215242214189944,0.26554461537678575,0,3.343857256094724,8.052433961183271E-2,0.14119001398428227,0,0,11.118012241581852,5.4487677809224939,3.0127969407410178,3.7856292820304707,1.031267455676774,5.3820421680280743,0.4504494709444839,0.54583773824216919,1.641536964660316,3.3447335402537539,3.145288235442433,4.4416061850427653,4.2374744455879609,0.73513170691729635,null,null,null,null,null,null,null,null,null,null,null,null,null,null,null,null,null,null,null,null,null,null,null,null,null,null,null,"31 No facility/bush/field",583.57463299999984,183.74535099999991,63.371769,20.182927000000003,0,161.01880699999995,3.8837380000000001,6.7982680000000002,0,0,309.22289799999993,152.01207899999994,83.886766999999992,105.317273,28.734850000000002,262.24019500000003,9.0214049999999997,51.462519999999998,115.93388099999996,134.36228500000004,97.055347999999952,116.63389599999998,33.892926999999993,30.272223]
[null,"41 Composting toilet",1.2916445461313988,1.9448030957867641,1.0069222697664475,0.7540801774712711,0,3.3911240316425681,0.4798963793983782,0,0,0,0.20607539814534009,0.48841443341187768,1.8472281989494683,1.6159753341447944,2.7867587968316982,0.47476573027267455,0,0.8572030427540831,3.3786607840731655,6.1364934011663978E-2,0,2.6884472061660714E-2,0,0.82799387902746635,null,null,null,null,null,null,null,null,null,null,null,null,null,null,null,null,null,null,null,null,null,null,null,null,null,null,null,"41 Composting toilet",98.183339000000004,147.65846499999998,76.681199000000007,57.314456,0,163.294873,23.145695000000003,0,0,0,5.7315310000000004,13.625997,51.433270999999991,44.956888999999997,77.649203,23.132977,0,80.818575999999993,238.61860300000001,2.465109,0,0.70596999999999999,0,34.096223999999999]
[null,"42 Bucket toilet",2.7258973636052866,2.2674787995588996,0.99648727514216517,0.67352850652827434,1.5085347961627695E-2,6.0116877465523668,1.4898882339985626,0.22701686652240841,4.7586126172653835E-2,2.3819038054637882E-2,0.55362022566149682,0.7185147104909233,0.45824730319976059,1.1417424652251984,1.8629946528928587,0.77415426615009775,3.3612992842141995,0.37972122865588592,1.0030372899695386,0,4.6081396157508978,0.3240298435393521,2.8512968369445049,2.9723760431179991,null,null,null,null,null,null,null,null,null,null,null,null,null,null,null,null,null,null,null,null,null,null,null,null,null,null,null,"42 Bucket toilet",207.20693299999999,172.15749999999994,75.886531999999974,51.192063000000005,1.1468879999999999,289.48448300000013,71.858217999999994,10.930812,2.2937759999999998,1.1468879999999999,15.397721000000001,20.045434,12.759201999999998,31.763597000000004,51.909784999999999,37.720693999999995,67.31863199999998,35.80077,70.839711999999992,0,142.1951059999999,8.5088279999999994,22.805752999999999,122.40042100000001]
[null,"44 Chemical toilet",1.2726086183565581,0.45840626096971798,0.18017642879834728,0,0,2.5638919544550087,0.38196836182815164,1.0596850252929753E-2,0,0,3.5269245992928827E-2,0,3.1272270481165231E-2,1.9436000182354758E-2,1.7082701707430696E-2,0,2.5476689745868822E-2,1.0169228403435637,2.3963570133341681E-2,6.2873199969409752E-2,0,5.5711486894069927E-2,0.13585215051366153,1.0225201415309177,null,null,null,null,null,null,null,null,null,null,null,null,null,null,null,null,null,null,null,null,null,null,null,null,null,null,null,"44 Chemical toilet",96.736337999999989,34.804327999999998,13.721162999999999,0,0,123.46066,18.422566999999997,0.51023600000000002,0,0,0.98093600000000003,0,0.87072899999999998,0.54071499999999995,0.47598600000000002,0,0.51023600000000002,95.877232999999976,1.6924319999999999,2.5256979999999998,0,1.46295,1.086597,42.106682999999997]
[null,"96 Other",7.457500439384962E-2,1.3950873802621324E-2,0,0,0,5.2288600220855352E-2,0,0,0,0,0,0.15090776270998829,0,0,0,8.640506811396062E-2,7.2833126301567269E-2,0,0,0,0,0,0.13242870687690836,0,null,null,null,null,null,null,null,null,null,null,null,null,null,null,null,null,null,null,null,null,null,null,null,null,null,null,null,"96 Other",5.6687599999999998,1.059215,0,0,0,2.5178849999999997,0,0,0,0,0,4.2100900000000001,0,0,0,4.2100900000000001,1.4586699999999999,0,0,0,0,0,1.059215,0]
[null,null,null,null,null,null,null,null,null,null,null,null,null,null,null,null,null,null,null,null,null,null,null,null,null,null,null,null,null,null,null,null,null,null,null,null,null,null,null,null,null,null,null,null,null,null,null,null,null,null,null,null,null,"Total",7601.4209399999927,7592.4634900000092,7615.4040189999932,7600.5785209999858,7602.6618869999984,4815.3612629999971,4823.0609759999834,4814.9779209999979,4820.2620899999984,4815.0055320000029,2781.2786250000045,2789.8432290000032,2784.3485190000051,2782.0281689999961,2786.3625329999991,4872.5035370000114,2002.7562649999984,9428.171852999998,7062.5202779999672,4017.1297170000098,3085.7377999999935,2625.9396070000066,799.83790899999769,4117.9318910000002]
[]
[]
[]
[]
[]
[]
[]
[]
[]
[]
[]
[]
[]
[]
[]
[]
[]
[]
[]
[]
[]
[]
[]
[]
[]
[]
[]
[]
[]
[]
[]
[]
[]
[]
[]
[]
[]
[]
[]
[]
[]
[{"$f":"A1026","v":"South Africa"}]
[{"$f":"A1034","v":"2016"}]
["Access to hygiene facilities "]
[" by wealth quintile and sub-national region"]
["Notes:"]
["WHO/UNICEF JMP customised wealth index excludes water,"]
[" sanitation and hygiene assets."]
["Survey used for analysis:",{"$f":"A1025","v":"DHS16"}]
[]
[]
[]
[]
["Access to handwashing",null,"NATIONAL wealth index quintile",null,null,null,null,"URBAN wealth index quintile",null,null,null,null,"RURAL wealth index quintile",null,null,null,null,"SUB-REGIONS:",null,null,null,null,null,null,null,null,null,null,null,null,null,null,null,null,null,null,null,null,null,null,null,null,null,null,null,null,null,null,null,null,null,null,"Raw numbers of respondents:","Access to handwashing","NATIONAL wealth index quintile",null,null,null,null,"URBAN wealth index quintile",null,null,null,null,"RURAL wealth index quintile",null,null,null,null,"SUB-REGIONS:"]
["Weighted percentage (used in graphs)",null,"Poorest","Poor","Middle","Rich","Richest","1 Poorest","2 Poor","3 Middle","4 Rich","5 Richest","1 Poorest","2 Poor","3 Middle","4 Rich","5 Richest","2 Eastern Cape","4 Free State","7 Gauteng","5 Kwazulu-Natal","9 Limpopo","8 Mpumalanga","6 North West","3 Northern Cape","1 Western Cape",null,null,null,null,null,null,null,null,null,null,null,null,null,null,null,null,null,null,null,null,null,null,null,null,null,null,"Hygiene data, raw numbers (weighted)",null,"Poorest","Poor","Middle","Rich","Richest","Poorest","Poor","Middle","Rich","Richest","Poorest","Poor","Middle","Rich","Richest","2 Eastern Cape","4 Free State","7 Gauteng","5 Kwazulu-Natal","9 Limpopo","8 Mpumalanga","6 North West","3 Northern Cape","1 Western Cape"]
["Hygiene ladder","1,00 Basic",4.3439503321594035,9.7407705191169214,21.939055790860234,50.537080582987002,79.815928015328154,7.2848820303462762,27.711705039486738,44.687193431999731,70.555185099732796,84.262802275787493,4.6531895644275307,4.0093453441798124,3.8810731101498961,7.8942572429017766,28.330774769220824,22.574116790668924,27.793550866239059,38.923569222577562,32.373267938672413,11.261209273370069,22.75479397085023,21.171030061967691,41.718452708738859,73.872723607033336,null,null,null,null,null,null,null,null,null,null,null,null,null,null,null,null,null,null,null,null,null,null,null,null,null,null,"Hygiene ladder","Basic",324.78550600000011,724.34209299999941,1640.7411940000004,3797.966069999999,6020.7309540000015,347.06204600000018,1300.905637999999,2133.097846000001,3369.6239920000003,4018.4231260000051,126.91388200000002,110.05384500000002,105.66871299999995,214.46531400000001,782.35141499999861,1095.9067559999999,547.94516600000031,3592.3742419999999,2223.5406000000012,449.13750299999958,689.0866569999996,554.67654699999935,332.22807000000029,3023.6702760000035]
[null,"2,00 Limited",67.223111916311794,73.378353695144455,67.681492659518412,44.83600711093046,17.726394068126119,66.074326093145316,61.362934304316497,48.897218147983232,26.817200575185517,13.583563043697383,61.803173238523293,76.127113970010356,82.596275805066341,80.819219832876982,63.012895217227957,57.853238037047483,59.877940431453716,45.645428270057323,49.609669837810188,84.149946721991,70.198251621314739,75.320883876159911,49.858466410598403,19.282234679884866,null,null,null,null,null,null,null,null,null,null,null,null,null,null,null,null,null,null,null,null,null,null,null,null,null,null,null,"Limited",5026.0916330000036,5456.5529690000067,5061.6496049999923,3369.5186139999978,1337.1497660000007,3147.8740090000024,2880.6378779999964,2334.0591050000003,1280.7546650000008,647.78885100000014,1685.6568010000021,2089.6383030000011,2248.8218890000003,2195.6365019999957,1740.0945839999977,2808.603987000005,1180.4834929999993,4212.7549979999985,3407.4136489999987,3356.2023430000072,2125.823621999999,1973.3913590000016,397.05168800000035,789.2374479999994]
[null,"3,00 No facility",28.432937751529018,16.880875785738564,10.379451549621365,4.6269123060826454,2.4576779165457854,26.640791876508523,10.925360656196915,6.4155884200171158,2.6276143250817365,2.1536346805151401,33.543637197049136,19.863540685809763,13.522651084783558,11.286522924221213,8.6563300135510879,19.572645172283494,12.328508702307307,15.431002507365124,18.017062223517851,4.588844004638859,7.0469544078352415,3.5080860618721852,8.4230808806631288,6.8450417130818577,null,null,null,null,null,null,null,null,null,null,null,null,null,null,null,null,null,null,null,null,null,null,null,null,null,null,null,"No facility",2125.8544340000039,1255.2938060000006,776.2409600000002,347.72202399999992,185.38928100000001,1269.2048680000021,512.88303100000007,306.24160500000005,125.49144699999999,102.70505100000001,914.88927200000114,545.24089099999992,368.17681499999975,306.6238669999999,239.04365799999997,950.19416600000034,243.05446900000007,1424.1740170000007,1237.4922860000001,183.01959299999999,213.403921,91.911118999999999,67.077844999999968,280.17308900000006]
["Place where household members wash their hands","1 Observed, fixed place",17.746770776780593,30.809618407529531,51.567684080872645,76.869828051342978,93.097421537352162,30.573208625323478,59.800773229950735,75.553534692937248,91.338229349267593,94.120566775706109,14.140464334097388,15.93547118987593,19.620485807437777,27.709189525463824,52.100894151665621,41.000585855500738,64.549522205588985,64.894651989750884,53.338124914620089,20.045084966819289,44.901278229148389,46.265286557292761,66.821427064918225,83.043698014382784,null,null,null,null,null,null,null,null,null,null,null,null,null,null,null,null,null,null,null,null,null,null,null,null,null,null,"Observed handwashing place","Fixed","N/A","N/A","N/A","N/A","N/A","N/A","N/A","N/A","N/A","N/A","N/A","N/A","N/A","N/A","N/A","N/A","N/A","N/A","N/A","N/A","N/A","N/A","N/A","N/A"]
[null,"2 Observed, mobile place",52.64634626325546,50.598676411942819,36.443283981726779,17.432002581636148,3.6829013201123315,42.005687621863594,26.898182823223028,17.22273602508594,5.1374097378178094,2.7892279480770474,51.029945660334477,62.910971690302055,64.941148123562044,58.921918054813126,38.427383096024421,39.132978201468624,21.75297446891275,17.89053013987315,26.39197181219064,74.682745949276494,46.321970842759278,50.007601793257663,24.357016691490742,9.5490845989808086,null,null,null,null,null,null,null,null,null,null,null,null,null,null,null,null,null,null,null,null,null,null,null,null,null,null,null,"Mobile","N/A","N/A","N/A","N/A","N/A","N/A","N/A","N/A","N/A","N/A","N/A","N/A","N/A","N/A","N/A","N/A","N/A","N/A","N/A","N/A","N/A","N/A","N/A","N/A"]
[null,"3 Not observed: not in dwelling",15.760544120057657,9.9509350554677365,5.9121413109100143,2.1235444322304673,1.0701869451688273,16.46837287356399,5.7940495131737464,2.8053086268762577,1.2051940105190424,0.73473041235126813,15.292096022921802,12.667683270743362,8.0550332140370848,6.1576182049075499,6.1451100125024558,8.0651962387687632,3.3747808048924042,8.4110323439603984,11.701488073235435,3.7662727533973643,5.3978502645299384,1.7181516619700348,5.6185445193746277,3.8523127676469873,null,null,null,null,null,null,null,null,null,null,null,null,null,null,null,null,null,null,null,null,null,null,null,null,null,null,"Water / Soap","Water and soap","N/A","N/A","N/A","N/A","N/A","N/A","N/A","N/A","N/A","N/A","N/A","N/A","N/A","N/A","N/A","N/A","N/A","N/A","N/A","N/A","N/A","N/A","N/A","N/A"]
[null,"4 Not observed: no permission to see",1.6403428777883213,2.0582861176195104,1.7959947976333375,1.1232278275150018,0.78119857074738286,1.0636863404946162,2.6670703447478128,0.86354217365475672,0.92094548327765335,0.95718486082104826,1.9350333877462538,1.6097746831494075,2.2152795017971627,2.3472977997729285,0.89266474500071857,0.36528712323846907,1.561504889363061,2.1093017723973815,2.7479389135992629,0.71618991734938608,1.860935818979828,0.22698854094400298,0.43512641259418094,0.60348443485220327,null,null,null,null,null,null,null,null,null,null,null,null,null,null,null,null,null,null,null,null,null,null,null,null,null,null,null,"Water only","N/A","N/A","N/A","N/A","N/A","N/A","N/A","N/A","N/A","N/A","N/A","N/A","N/A","N/A","N/A","N/A","N/A","N/A","N/A","N/A","N/A","N/A","N/A","N/A"]
[null,"5 Not observed: other reason",12.205995962118122,6.5824840074403728,4.2808958288572745,2.4513971072755436,1.3682916266193283,9.8890445387544759,4.839924088905005,3.5548784814458978,1.3982214191178974,1.3982900030445897,17.60246059489991,6.8760991659291477,5.1680533531657264,4.8639764150425524,2.4339479948067488,11.435952581023209,8.7612176312428165,6.6944837540181839,5.8204762863549782,0.7897064131573801,1.517964844582715,1.7819714465352472,2.7678853116225657,2.9514201841372807,null,null,null,null,null,null,null,null,null,null,null,null,null,null,null,null,null,null,null,null,null,null,null,null,null,null,null,"Soap only","N/A","N/A","N/A","N/A","N/A","N/A","N/A","N/A","N/A","N/A","N/A","N/A","N/A","N/A","N/A","N/A","N/A","N/A","N/A","N/A","N/A","N/A","N/A","N/A"]
[null,null,null,null,null,null,null,null,null,null,null,null,null,null,null,null,null,null,null,null,null,null,null,null,null,null,null,null,null,null,null,null,null,null,null,null,null,null,null,null,null,null,null,null,null,null,null,null,null,null,null,null,null,"Neither","N/A","N/A","N/A","N/A","N/A","N/A","N/A","N/A","N/A","N/A","N/A","N/A","N/A","N/A","N/A","N/A","N/A","N/A","N/A","N/A","N/A","N/A","N/A","N/A"]
[null,null,null,null,null,null,null,null,null,null,null,null,null,null,null,null,null,null,null,null,null,null,null,null,null,null,null,null,null,null,null,null,null,null,null,null,null,null,null,null,null,null,null,null,null,null,null,null,null,null,null,null,"Place where household members wash their hands","1 Observed, fixed place",1349.0067499999993,2339.2090290000019,3927.0874859999954,5842.551639999997,7077.8821850000013,1472.2104450000006,2884.2277569999987,3637.8860140000024,4402.7420429999984,4531.9104970000062,393.28571199999988,444.57466399999987,546.30270599999994,770.87745799999993,1451.7197939999987,1997.7549959999999,1292.7695999999985,6118.3793129999958,3767.0158879999963,805.23706499999923,1385.5357149999995,1214.8984840000005,534.4631050000005,3419.6829240000025]
[null,null,null,null,null,null,null,null,null,null,null,null,null,null,null,null,null,null,null,null,null,null,null,null,null,null,null,null,null,null,null,null,null,null,null,null,null,null,null,null,null,null,null,null,null,null,null,null,null,null,null,null,null,"2 Observed, mobile place",4001.8703890000047,3841.6860330000054,2775.3033130000022,1324.9330440000001,279.998535,2022.7256100000043,1297.3157590000005,829.27093700000069,247.63661400000018,134.30148,1419.2849710000003,1755.1174840000008,1808.1878959999995,1639.2243579999956,1070.7262049999995,1906.755747000002,435.65905900000024,1686.7499270000014,1863.9383609999995,3000.1027810000073,1429.3745639999986,1313.1694219999986,194.81665299999997,393.22480000000019]
[null,null,null,null,null,null,null,null,null,null,null,null,null,null,null,null,null,null,null,null,null,null,null,null,null,null,null,null,null,null,null,null,null,null,null,null,null,null,null,null,null,null,null,null,null,null,null,null,null,null,null,null,null,"3 Not observed: not in dwelling",1198.0253010000004,755.52111100000013,450.23344700000013,161.40166200000002,81.362695000000002,793.01164799999992,279.45054099999999,135.07499100000001,58.093509999999995,35.377309999999994,425.31579799999992,353.40850399999988,224.28019800000007,171.30667299999993,171.22504299999997,392.97697199999982,67.588633999999999,793.0065840000002,826.41996800000027,151.29606200000001,166.56350599999996,45.117625000000011,44.93924899999999,158.63561600000003]
[null,null,null,null,null,null,null,null,null,null,null,null,null,null,null,null,null,null,null,null,null,null,null,null,null,null,null,null,null,null,null,null,null,null,null,null,null,null,null,null,null,null,null,null,null,null,null,null,null,null,null,null,null,"4 Not observed: no permission to see",124.68936699999995,156.27462199999997,136.77225999999999,85.371813000000003,59.391886,51.22034,128.63442899999998,41.579364999999996,44.391986000000003,46.088504,53.818670000000012,44.91019,61.681101999999996,65.302486000000002,24.872876000000005,17.798627999999997,31.273136999999998,198.868596,194.07374299999995,28.770277999999998,57.423600000000008,5.9605820000000005,3.4803059999999997,24.851077999999998]
[null,null,null,null,null,null,null,null,null,null,null,null,null,null,null,null,null,null,null,null,null,null,null,null,null,null,null,null,null,null,null,null,null,null,null,null,null,null,null,null,null,null,null,null,null,null,null,null,null,null,null,null,null,"5 Not observed: other reason",927.82913300000041,499.77269499999983,326.00751299999996,186.32036199999996,104.02658599999999,476.19321999999983,233.43249000000006,171.16661399999998,67.397936999999999,67.327741000000003,489.57347399999981,191.83238700000004,143.89661699999999,135.31719399999997,67.818615000000008,557.21719399999995,175.46583499999997,631.16743300000007,411.07231799999977,31.723530999999994,46.840414999999993,46.793494000000003,22.138596,121.53747300000002]
[null,null,null,null,null,null,null,null,null,null,null,null,null,null,null,null,null,null,null,null,null,null,null,null,null,null,null,null,null,null,null,null,null,null,null,null,null,null,null,null,null,null,null,null,null,null,null,null,null,null,null,null,null,"Total",7601.4209399999927,7592.4634900000092,7615.4040189999932,7600.5785209999858,7602.6618869999984,4815.3612629999971,4823.0609759999834,4814.9779209999979,4820.2620899999984,4815.0055320000029,2781.2786250000045,2789.8432290000032,2784.3485190000051,2782.0281689999961,2786.3625329999991,4872.5035370000114,2002.7562649999984,9428.171852999998,7062.5202779999672,4017.1297170000098,3085.7377999999935,2625.9396070000066,799.83790899999769,4117.9318910000002]
[]
[]
[]
[]
[]
[]
[]
[]
[]
[]
[]
[]
[]
[]
[]
[]
[]
[]
[]
[]
[]
[]
[null,null,null,null,null,null,null,null,null,null,null,null,null,null,null,null,null,null,null,null,null,null,null,null,null,null,null,null,null,null,null,null,null,null,null,null,null,null,null,null,null,null,null,null,null,null,null,null,null,null,null,null,"Raw numbers of respondents:","Menstrual health and hygiene","NATIONAL wealth index quintile",null,null,null,null,"URBAN wealth index quintile",null,null,null,null,"RURAL wealth index quintile",null,null,null,null,"SUB-REGIONS:"]
[null,null,null,null,null,null,null,null,null,null,null,null,null,null,null,null,null,null,null,null,null,null,null,null,null,null,null,null,null,null,null,null,null,null,null,null,null,null,null,null,null,null,null,null,null,null,null,null,null,null,null,null,"MHH data, raw numbers (weighted)",null,"Poorest","Poor","Middle","Rich","Richest","Poorest","Poor","Middle","Rich","Richest","Poorest","Poor","Middle","Rich","Richest","2 Eastern Cape","4 Free State","7 Gauteng","5 Kwazulu-Natal","9 Limpopo","8 Mpumalanga","6 North West","3 Northern Cape","1 Western Cape"]
[null,null,null,null,null,null,null,null,null,null,null,null,null,null,null,null,null,null,null,null,null,null,null,null,null,null,null,null,null,null,null,null,null,null,null,null,null,null,null,null,null,null,null,null,null,null,null,null,null,null,null,null,"Private place to wash and change","Yes","N/A","N/A","N/A","N/A","N/A","N/A","N/A","N/A","N/A","N/A","N/A","N/A","N/A","N/A","N/A","N/A","N/A","N/A","N/A","N/A","N/A","N/A","N/A","N/A"]
[null,null,null,null,null,null,null,null,null,null,null,null,null,null,null,null,null,null,null,null,null,null,null,null,null,null,null,null,null,null,null,null,null,null,null,null,null,null,null,null,null,null,null,null,null,null,null,null,null,null,null,null,null,"No","N/A","N/A","N/A","N/A","N/A","N/A","N/A","N/A","N/A","N/A","N/A","N/A","N/A","N/A","N/A","N/A","N/A","N/A","N/A","N/A","N/A","N/A","N/A","N/A"]
[null,null,null,null,null,null,null,null,null,null,null,null,null,null,null,null,null,null,null,null,null,null,null,null,null,null,null,null,null,null,null,null,null,null,null,null,null,null,null,null,null,null,null,null,null,null,null,null,null,null,null,null,null,"DK/not sure/missing","N/A","N/A","N/A","N/A","N/A","N/A","N/A","N/A","N/A","N/A","N/A","N/A","N/A","N/A","N/A","N/A","N/A","N/A","N/A","N/A","N/A","N/A","N/A","N/A"]
[null,null,null,null,null,null,null,null,null,null,null,null,null,null,null,null,null,null,null,null,null,null,null,null,null,null,null,null,null,null,null,null,null,null,null,null,null,null,null,null,null,null,null,null,null,null,null,null,null,null,null,null,"Use of menstrual materials","Materials reusable","N/A","N/A","N/A","N/A","N/A","N/A","N/A","N/A","N/A","N/A","N/A","N/A","N/A","N/A","N/A","N/A","N/A","N/A","N/A","N/A","N/A","N/A","N/A","N/A"]
[null,null,null,null,null,null,null,null,null,null,null,null,null,null,null,null,null,null,null,null,null,null,null,null,null,null,null,null,null,null,null,null,null,null,null,null,null,null,null,null,null,null,null,null,null,null,null,null,null,null,null,null,null,"Materials not reusable","N/A","N/A","N/A","N/A","N/A","N/A","N/A","N/A","N/A","N/A","N/A","N/A","N/A","N/A","N/A","N/A","N/A","N/A","N/A","N/A","N/A","N/A","N/A","N/A"]
[null,null,null,null,null,null,null,null,null,null,null,null,null,null,null,null,null,null,null,null,null,null,null,null,null,null,null,null,null,null,null,null,null,null,null,null,null,null,null,null,null,null,null,null,null,null,null,null,null,null,null,null,null,"No materials used","N/A","N/A","N/A","N/A","N/A","N/A","N/A","N/A","N/A","N/A","N/A","N/A","N/A","N/A","N/A","N/A","N/A","N/A","N/A","N/A","N/A","N/A","N/A","N/A"]
[null,null,null,null,null,null,null,null,null,null,null,null,null,null,null,null,null,null,null,null,null,null,null,null,null,null,null,null,null,null,null,null,null,null,null,null,null,null,null,null,null,null,null,null,null,null,null,null,null,null,null,null,null,"DK/not sure/missing","N/A","N/A","N/A","N/A","N/A","N/A","N/A","N/A","N/A","N/A","N/A","N/A","N/A","N/A","N/A","N/A","N/A","N/A","N/A","N/A","N/A","N/A","N/A","N/A"]
[null,null,null,null,null,null,null,null,null,null,null,null,null,null,null,null,null,null,null,null,null,null,null,null,null,null,null,null,null,null,null,null,null,null,null,null,null,null,null,null,null,null,null,null,null,null,null,null,null,null,null,null,"Use of menstrual materials with private place to wash and change","Materials reusable","N/A","N/A","N/A","N/A","N/A","N/A","N/A","N/A","N/A","N/A","N/A","N/A","N/A","N/A","N/A","N/A","N/A","N/A","N/A","N/A","N/A","N/A","N/A","N/A"]
[null,null,null,null,null,null,null,null,null,null,null,null,null,null,null,null,null,null,null,null,null,null,null,null,null,null,null,null,null,null,null,null,null,null,null,null,null,null,null,null,null,null,null,null,null,null,null,null,null,null,null,null,null,"Materials not reusable","N/A","N/A","N/A","N/A","N/A","N/A","N/A","N/A","N/A","N/A","N/A","N/A","N/A","N/A","N/A","N/A","N/A","N/A","N/A","N/A","N/A","N/A","N/A","N/A"]
[null,null,null,null,null,null,null,null,null,null,null,null,null,null,null,null,null,null,null,null,null,null,null,null,null,null,null,null,null,null,null,null,null,null,null,null,null,null,null,null,null,null,null,null,null,null,null,null,null,null,null,null,null,"No materials used","N/A","N/A","N/A","N/A","N/A","N/A","N/A","N/A","N/A","N/A","N/A","N/A","N/A","N/A","N/A","N/A","N/A","N/A","N/A","N/A","N/A","N/A","N/A","N/A"]
[null,null,null,null,null,null,null,null,null,null,null,null,null,null,null,null,null,null,null,null,null,null,null,null,null,null,null,null,null,null,null,null,null,null,null,null,null,null,null,null,null,null,null,null,null,null,null,null,null,null,null,null,"Awareness of menstruation before menarche","Yes","N/A","N/A","N/A","N/A","N/A","N/A","N/A","N/A","N/A","N/A","N/A","N/A","N/A","N/A","N/A","N/A","N/A","N/A","N/A","N/A","N/A","N/A","N/A","N/A"]
[null,null,null,null,null,null,null,null,null,null,null,null,null,null,null,null,null,null,null,null,null,null,null,null,null,null,null,null,null,null,null,null,null,null,null,null,null,null,null,null,null,null,null,null,null,null,null,null,null,null,null,null,null,"No","N/A","N/A","N/A","N/A","N/A","N/A","N/A","N/A","N/A","N/A","N/A","N/A","N/A","N/A","N/A","N/A","N/A","N/A","N/A","N/A","N/A","N/A","N/A","N/A"]
[null,null,null,null,null,null,null,null,null,null,null,null,null,null,null,null,null,null,null,null,null,null,null,null,null,null,null,null,null,null,null,null,null,null,null,null,null,null,null,null,null,null,null,null,null,null,null,null,null,null,null,null,null,"DK/not sure/missing","N/A","N/A","N/A","N/A","N/A","N/A","N/A","N/A","N/A","N/A","N/A","N/A","N/A","N/A","N/A","N/A","N/A","N/A","N/A","N/A","N/A","N/A","N/A","N/A"]
[null,null,null,null,null,null,null,null,null,null,null,null,null,null,null,null,null,null,null,null,null,null,null,null,null,null,null,null,null,null,null,null,null,null,null,null,null,null,null,null,null,null,null,null,null,null,null,null,null,null,null,null,"Participation in (all) activities during menstruation","Yes","N/A","N/A","N/A","N/A","N/A","N/A","N/A","N/A","N/A","N/A","N/A","N/A","N/A","N/A","N/A","N/A","N/A","N/A","N/A","N/A","N/A","N/A","N/A","N/A"]
[null,null,null,null,null,null,null,null,null,null,null,null,null,null,null,null,null,null,null,null,null,null,null,null,null,null,null,null,null,null,null,null,null,null,null,null,null,null,null,null,null,null,null,null,null,null,null,null,null,null,null,null,null,"No","N/A","N/A","N/A","N/A","N/A","N/A","N/A","N/A","N/A","N/A","N/A","N/A","N/A","N/A","N/A","N/A","N/A","N/A","N/A","N/A","N/A","N/A","N/A","N/A"]
[null,null,null,null,null,null,null,null,null,null,null,null,null,null,null,null,null,null,null,null,null,null,null,null,null,null,null,null,null,null,null,null,null,null,null,null,null,null,null,null,null,null,null,null,null,null,null,null,null,null,null,null,null,"DK/not sure/missing/no such activity","N/A","N/A","N/A","N/A","N/A","N/A","N/A","N/A","N/A","N/A","N/A","N/A","N/A","N/A","N/A","N/A","N/A","N/A","N/A","N/A","N/A","N/A","N/A","N/A"]
[null,null,null,null,null,null,null,null,null,null,null,null,null,null,null,null,null,null,null,null,null,null,null,null,null,null,null,null,null,null,null,null,null,null,null,null,null,null,null,null,null,null,null,null,null,null,null,null,null,null,null,null,"Participation in specific activities during menstruation","Did not go to school (amongst those usually attending school)","N/A","N/A","N/A","N/A","N/A","N/A","N/A","N/A","N/A","N/A","N/A","N/A","N/A","N/A","N/A","N/A","N/A","N/A","N/A","N/A","N/A","N/A","N/A","N/A"]
[null,null,null,null,null,null,null,null,null,null,null,null,null,null,null,null,null,null,null,null,null,null,null,null,null,null,null,null,null,null,null,null,null,null,null,null,null,null,null,null,null,null,null,null,null,null,null,null,null,null,null,null,null,"Did not go to work (amongst those who usually work)","N/A","N/A","N/A","N/A","N/A","N/A","N/A","N/A","N/A","N/A","N/A","N/A","N/A","N/A","N/A","N/A","N/A","N/A","N/A","N/A","N/A","N/A","N/A","N/A"]
[null,null,null,null,null,null,null,null,null,null,null,null,null,null,null,null,null,null,null,null,null,null,null,null,null,null,null,null,null,null,null,null,null,null,null,null,null,null,null,null,null,null,null,null,null,null,null,null,null,null,null,null,null,"Did not participate in social activities","N/A","N/A","N/A","N/A","N/A","N/A","N/A","N/A","N/A","N/A","N/A","N/A","N/A","N/A","N/A","N/A","N/A","N/A","N/A","N/A","N/A","N/A","N/A","N/A"]
[null,null,null,null,null,null,null,null,null,null,null,null,null,null,null,null,null,null,null,null,null,null,null,null,null,null,null,null,null,null,null,null,null,null,null,null,null,null,null,null,null,null,null,null,null,null,null,null,null,null,null,null,null,"Did not cook food","N/A","N/A","N/A","N/A","N/A","N/A","N/A","N/A","N/A","N/A","N/A","N/A","N/A","N/A","N/A","N/A","N/A","N/A","N/A","N/A","N/A","N/A","N/A","N/A"]
[null,null,null,null,null,null,null,null,null,null,null,null,null,null,null,null,null,null,null,null,null,null,null,null,null,null,null,null,null,null,null,null,null,null,null,null,null,null,null,null,null,null,null,null,null,null,null,null,null,null,null,null,null,"Did not eat with others","N/A","N/A","N/A","N/A","N/A","N/A","N/A","N/A","N/A","N/A","N/A","N/A","N/A","N/A","N/A","N/A","N/A","N/A","N/A","N/A","N/A","N/A","N/A","N/A"]
[null,null,null,null,null,null,null,null,null,null,null,null,null,null,null,null,null,null,null,null,null,null,null,null,null,null,null,null,null,null,null,null,null,null,null,null,null,null,null,null,null,null,null,null,null,null,null,null,null,null,null,null,null,"Did not bathe in regular place","N/A","N/A","N/A","N/A","N/A","N/A","N/A","N/A","N/A","N/A","N/A","N/A","N/A","N/A","N/A","N/A","N/A","N/A","N/A","N/A","N/A","N/A","N/A","N/A"]
[null,null,null,null,null,null,null,null,null,null,null,null,null,null,null,null,null,null,null,null,null,null,null,null,null,null,null,null,null,null,null,null,null,null,null,null,null,null,null,null,null,null,null,null,null,null,null,null,null,null,null,null,null,"Did not participate in other activities","N/A","N/A","N/A","N/A","N/A","N/A","N/A","N/A","N/A","N/A","N/A","N/A","N/A","N/A","N/A","N/A","N/A","N/A","N/A","N/A","N/A","N/A","N/A","N/A"]
[null,null,null,null,null,null,null,null,null,null,null,null,null,null,null,null,null,null,null,null,null,null,null,null,null,null,null,null,null,null,null,null,null,null,null,null,null,null,null,null,null,null,null,null,null,null,null,null,null,null,null,null,null,"DK/not sure/missing/no such activity","N/A","N/A","N/A","N/A","N/A","N/A","N/A","N/A","N/A","N/A","N/A","N/A","N/A","N/A","N/A","N/A","N/A","N/A","N/A","N/A","N/A","N/A","N/A","N/A"]
[]
[]
[]
[]
[]
[]
[]
[]
[]
[]
[]
[]
[]
[]
[]
[]
[]
[]
[]
[]
[]
[]
[]
[]
[]
[]
[]
[]
[]
[]
[]
[]
[]
[]
[]
[]
[]
[]
[]
[]
[]
[]
[]
[]
[]
[]
[]
[]
[]
[]
[]
[]
[]
[]
[null,null,null,null,null,null,null,null,null,null,null,null,null,null,null,null,null,null,null,null,null,null,null,null,null,null,null,null,null,null,null,null,null,null,null,null,null,null,null,null,null,null,null,null,null,null,null,null,null,null,null,null,"Raw numbers of respondents:","Basic water, sanitation and hygiene","NATIONAL wealth index quintile",null,null,null,null,"URBAN wealth index quintile",null,null,null,null,"RURAL wealth index quintile",null,null,null,null,"SUB-REGIONS:"]
[null,null,null,null,null,null,null,null,null,null,null,null,null,null,null,null,null,null,null,null,null,null,null,null,null,null,null,null,null,null,null,null,null,null,null,null,null,null,null,null,null,null,null,null,null,null,null,null,null,null,null,null,"WatSan data, raw numbers (weighted)",null,"Poorest","Poor","Middle","Rich","Richest","Poorest","Poor","Middle","Rich","Richest","Poorest","Poor","Middle","Rich","Richest","2 Eastern Cape","4 Free State","7 Gauteng","5 Kwazulu-Natal","9 Limpopo","8 Mpumalanga","6 North West","3 Northern Cape","1 Western Cape"]
[null,null,null,null,null,null,null,null,null,null,null,null,null,null,null,null,null,null,null,null,null,null,null,null,null,null,null,null,null,null,null,null,null,null,null,null,null,null,null,null,null,null,null,null,null,null,null,null,null,null,null,null,"Use of Basic Water Sanitation and Hygiene","Yes","N/A","N/A","N/A","N/A","N/A","N/A","N/A","N/A","N/A","N/A","N/A","N/A","N/A","N/A","N/A","N/A","N/A","N/A","N/A","N/A","N/A","N/A","N/A","N/A"]
[null,null,null,null,null,null,null,null,null,null,null,null,null,null,null,null,null,null,null,null,null,null,null,null,null,null,null,null,null,null,null,null,null,null,null,null,null,null,null,null,null,null,null,null,null,null,null,null,null,null,null,null,null,"No","N/A","N/A","N/A","N/A","N/A","N/A","N/A","N/A","N/A","N/A","N/A","N/A","N/A","N/A","N/A","N/A","N/A","N/A","N/A","N/A","N/A","N/A","N/A","N/A"]
[null,null,null,null,null,null,null,null,null,null,null,null,null,null,null,null,null,null,null,null,null,null,null,null,null,null,null,null,null,null,null,null,null,null,null,null,null,null,null,null,null,null,null,null,null,null,null,null,null,null,null,null,"Use of Basic Water and Sanitation","Yes","N/A","N/A","N/A","N/A","N/A","N/A","N/A","N/A","N/A","N/A","N/A","N/A","N/A","N/A","N/A","N/A","N/A","N/A","N/A","N/A","N/A","N/A","N/A","N/A"]
[null,null,null,null,null,null,null,null,null,null,null,null,null,null,null,null,null,null,null,null,null,null,null,null,null,null,null,null,null,null,null,null,null,null,null,null,null,null,null,null,null,null,null,null,null,null,null,null,null,null,null,null,null,"No","N/A","N/A","N/A","N/A","N/A","N/A","N/A","N/A","N/A","N/A","N/A","N/A","N/A","N/A","N/A","N/A","N/A","N/A","N/A","N/A","N/A","N/A","N/A","N/A"]
[null,null,null,null,null,null,null,null,null,null,null,null,null,null,null,null,null,null,null,null,null,null,null,null,null,null,null,null,null,null,null,null,null,null,null,null,null,null,null,null,null,null,null,null,null,null,null,null,null,null,null,null,"Use of Basic Water and Hygiene","Yes","N/A","N/A","N/A","N/A","N/A","N/A","N/A","N/A","N/A","N/A","N/A","N/A","N/A","N/A","N/A","N/A","N/A","N/A","N/A","N/A","N/A","N/A","N/A","N/A"]
[null,null,null,null,null,null,null,null,null,null,null,null,null,null,null,null,null,null,null,null,null,null,null,null,null,null,null,null,null,null,null,null,null,null,null,null,null,null,null,null,null,null,null,null,null,null,null,null,null,null,null,null,null,"No","N/A","N/A","N/A","N/A","N/A","N/A","N/A","N/A","N/A","N/A","N/A","N/A","N/A","N/A","N/A","N/A","N/A","N/A","N/A","N/A","N/A","N/A","N/A","N/A"]
[null,null,null,null,null,null,null,null,null,null,null,null,null,null,null,null,null,null,null,null,null,null,null,null,null,null,null,null,null,null,null,null,null,null,null,null,null,null,null,null,null,null,null,null,null,null,null,null,null,null,null,null,"Use of Basic Sanitation and Hygiene","Yes","N/A","N/A","N/A","N/A","N/A","N/A","N/A","N/A","N/A","N/A","N/A","N/A","N/A","N/A","N/A","N/A","N/A","N/A","N/A","N/A","N/A","N/A","N/A","N/A"]
[null,null,null,null,null,null,null,null,null,null,null,null,null,null,null,null,null,null,null,null,null,null,null,null,null,null,null,null,null,null,null,null,null,null,null,null,null,null,null,null,null,null,null,null,null,null,null,null,null,null,null,null,null,"No","N/A","N/A","N/A","N/A","N/A","N/A","N/A","N/A","N/A","N/A","N/A","N/A","N/A","N/A","N/A","N/A","N/A","N/A","N/A","N/A","N/A","N/A","N/A","N/A"]
[null,null,null,null,null,null,null,null,null,null,null,null,null,null,null,null,null,null,null,null,null,null,null,null,null,null,null,null,null,null,null,null,null,null,null,null,null,null,null,null,null,null,null,null,null,null,null,null,null,null,null,null,"Use of Basic Water","Yes","N/A","N/A","N/A","N/A","N/A","N/A","N/A","N/A","N/A","N/A","N/A","N/A","N/A","N/A","N/A","N/A","N/A","N/A","N/A","N/A","N/A","N/A","N/A","N/A"]
[null,null,null,null,null,null,null,null,null,null,null,null,null,null,null,null,null,null,null,null,null,null,null,null,null,null,null,null,null,null,null,null,null,null,null,null,null,null,null,null,null,null,null,null,null,null,null,null,null,null,null,null,null,"No","N/A","N/A","N/A","N/A","N/A","N/A","N/A","N/A","N/A","N/A","N/A","N/A","N/A","N/A","N/A","N/A","N/A","N/A","N/A","N/A","N/A","N/A","N/A","N/A"]
[null,null,null,null,null,null,null,null,null,null,null,null,null,null,null,null,null,null,null,null,null,null,null,null,null,null,null,null,null,null,null,null,null,null,null,null,null,null,null,null,null,null,null,null,null,null,null,null,null,null,null,null,"Use of Basic Sanitation","Yes","N/A","N/A","N/A","N/A","N/A","N/A","N/A","N/A","N/A","N/A","N/A","N/A","N/A","N/A","N/A","N/A","N/A","N/A","N/A","N/A","N/A","N/A","N/A","N/A"]
[null,null,null,null,null,null,null,null,null,null,null,null,null,null,null,null,null,null,null,null,null,null,null,null,null,null,null,null,null,null,null,null,null,null,null,null,null,null,null,null,null,null,null,null,null,null,null,null,null,null,null,null,null,"No","N/A","N/A","N/A","N/A","N/A","N/A","N/A","N/A","N/A","N/A","N/A","N/A","N/A","N/A","N/A","N/A","N/A","N/A","N/A","N/A","N/A","N/A","N/A","N/A"]
[null,null,null,null,null,null,null,null,null,null,null,null,null,null,null,null,null,null,null,null,null,null,null,null,null,null,null,null,null,null,null,null,null,null,null,null,null,null,null,null,null,null,null,null,null,null,null,null,null,null,null,null,"Access to Basic Hygiene","Yes","N/A","N/A","N/A","N/A","N/A","N/A","N/A","N/A","N/A","N/A","N/A","N/A","N/A","N/A","N/A","N/A","N/A","N/A","N/A","N/A","N/A","N/A","N/A","N/A"]
[null,null,null,null,null,null,null,null,null,null,null,null,null,null,null,null,null,null,null,null,null,null,null,null,null,null,null,null,null,null,null,null,null,null,null,null,null,null,null,null,null,null,null,null,null,null,null,null,null,null,null,null,null,"No","N/A","N/A","N/A","N/A","N/A","N/A","N/A","N/A","N/A","N/A","N/A","N/A","N/A","N/A","N/A","N/A","N/A","N/A","N/A","N/A","N/A","N/A","N/A","N/A"]
[]
[]
[]
[]
[]
[]
[]
[]
[]
[]
[]
[]
[]
[]
[]
[]
[]
[]
[]
[]
[]
[]
[]
[]
[]
[]
[]
[]
[]
[]
[]
[]
[]
[]
[]
[]
[]
[]
[]
[]
[]
[]
[]
[]
[null,null,"INITIAL (national) Wealth Index",null,null,null,null,"URBAN Wealth Index",null,null,null,null,"RURAL Wealth Index"]
[null,null,"Matrice des composantes",null,null,null,null,"Matrice des composantes",null,null,null,null,"Matrice des composantes"]
[null,null,null,null,"Composante",null,null,null,null,"Composante",null,null,null,null,"Composante"]
[null,"Note:\n\nThe INITIAL (national) Wealth Index is based on the first component of the Principal Component Analysis (PCA) which has been obtained at national level.\n\nThe final national-level (NATIONAL) Wealth Index is based on the URBAN and RURAL specific wealth indexes. Regression procedures are used to establish the relationships between the two sets of scores (urban and rural) and the initial (national) wealth factors.\nThis allows best use of the available information for each area and a better precision of the FINAL (NATIONAL) Wealth Index.\n\nFor dependency reasons, all WASH variables (contained in the generic MICS and DHS scripts) have been excluded from the sets of asset variables used in the PCAs.\n\nThe PCA can extracts as many components as there are asset variables in the input. Only the first of the components is used to represent the Wealth Index. \n\nThe scores represent the weights of the asset variables on the Wealth Index (correlations between the variables and the component).\n\nThe communalities are the proportion of each variable's variance that can be explained by the component.\n\nProportion of explained variance is the part of the model's total variance that is explained by the component.\n\nFor more information on the procedure used:\n\nThe DHS Wealth Index, DHS Comparative Reports No. 6, Shea Oscar Rutstein, Kiersten Johnson, ORC Macro International Inc., 2004.\n\nThe DHS Wealth Index: Approaches for Rural and Urban Areas, Shea O. Rutstein, ORC Macro International Inc., 2008.\n\nMICS Methodological Paper No. 4, Review of options for reporting water, sanitation and hygiene coverage by wealth quintile, UNICEF, 2016.",null,null,"1",null,null,null,null,"1",null,null,null,null,"1"]
[null,null,"SH121H Microwave oven",null,0.67598281140590322,null,null,"SH121A Electricity connected to the mains",null,0.72738139752757769,null,null,"HV206 Has electricity",null,0.68286918917146222]
[null,null,"SH121A Electricity connected to the mains",null,0.67473353179946205,null,null,"HV206 Has electricity",null,0.72329829063802098,null,null,"SH121A Electricity connected to the mains",null,0.68281827434410991]
[null,null,"HV206 Has electricity",null,0.67344182687376231,null,null,"HV209 Has refrigerator",null,0.69899730944827354,null,null,"cookelec Electricity for cooking",null,0.64052800322862369]
[null,null,"HV209 Has refrigerator",null,0.67239139595608921,null,null,"SH121I Electric/gas stove",null,0.67580599990719159,null,null,"SH121I Electric/gas stove",null,0.63022925145899222]
[null,null,"SH121I Electric/gas stove",null,0.67236153246076868,null,null,"SH121H Microwave oven",null,0.66124845377856223,null,null,"HV209 Has refrigerator",null,0.59705169516223311]
[null,null,"cookelec Electricity for cooking",null,0.63039212453123949,null,null,"HV208 Has television",null,0.62568282018274357,null,null,"dwell2 Traditional dwelling/hut structure made of traditional materials",null,-0.57859865758428286]
[null,null,"HV208 Has television",null,0.62683481332793534,null,null,"SH121J Washing machine",null,0.60726541881239571,null,null,"HV208 Has television",null,0.54999627186405109]
[null,null,"SH121J Washing machine",null,0.61936099529328692,null,null,"cookkero Kerosene for cooking",null,-0.60082707974465199,null,null,"fuel5 Wood",null,-0.54939857225770283]
[null,null,"floor33 Terrazo, ceramic tile floor",null,0.55931687052021595,null,null,"cookelec Electricity for cooking",null,0.57648958217163115,null,null,"cookwood Wood for cooking",null,-0.54276000289723803]
[null,null,"HV212 Has car/truck",null,0.52056128840007754,null,null,"dwell1 Dwelling/house or brick/concrete block structure on a separate stand/yard/farm",null,0.56451159702041875,null,null,"dwell1 Dwelling/house or brick/concrete block structure on a separate stand/yard/farm",null,0.52833132893231927]
[null,null,"dwell1 Dwelling/house or brick/concrete block structure on a separate stand/yard/farm",null,0.49606580067268713,null,null,"dwell9 Informal dwelling/shack not in backyard (e.g. in informal/squatter settlement or farm)",null,-0.56354436352458703,null,null,"SH121H Microwave oven",null,0.52084320018146946]
[null,null,"HV243E Has a computer",null,0.48289055873614661,null,null,"floor33 Terrazo, ceramic tile floor",null,0.53738923721840925,null,null,"wall12 Cane/palm/trunks walls",null,-0.51858273708940139]
[null,null,"cookwood Wood for cooking",null,-0.48263398515626249,null,null,"wall37 Galvanized iron/aluminum walls",null,-0.5277453650438293,null,null,"floor12 Dung floor",null,-0.48338430594749998]
[null,null,"HV243B Has watch",null,0.47858213979153663,null,null,"HV212 Has car/truck",null,0.51101521718923726,null,null,"SH121J Washing machine",null,0.43889547815932084]
[null,null,"fuel5 Wood",null,-0.45233535226269628,null,null,"roof31 Metal/ corrugated iron roof",null,-0.50849942695261863,null,null,"roof12 Thatch, palm leaf roof",null,-0.41338616383660748]
[null,null,"SH121G Vacuum cleaner or floor polisher",null,0.44465267307450607,null,null,"HV243E Has a computer",null,0.46604033411614637,null,null,"floor33 Terrazo, ceramic tile floor",null,0.40803187313701283]
[null,null,"roof34 Tile roof",null,0.44178185959078747,null,null,"HV243B Has watch",null,0.45358903420754609,null,null,"fuel1 Electricity from mains",null,0.3680397638903794]
[null,null,"fuel1 Electricity from mains",null,0.44132011014681061,null,null,"roof34 Tile roof",null,0.44405824354021195,null,null,"HV243B Has watch",null,0.34173777800479005]
[null,null,"cookkero Kerosene for cooking",null,-0.43273362152395173,null,null,"SH121G Vacuum cleaner or floor polisher",null,0.43555987956197839,null,null,"HV212 Has car/truck",null,0.33664325197622857]
[null,null,"roof31 Metal/ corrugated iron roof",null,-0.41447404505781488,null,null,"fuel1 Electricity from mains",null,0.38595630978036166,null,null,"HV243E Has a computer",null,0.32430863524039316]
[null,null,"dwell2 Traditional dwelling/hut structure made of traditional materials",null,-0.40174280704753951,null,null,"HV207 Has radio",null,0.38588985477959931,null,null,"HV207 Has radio",null,0.32298082414434531]
[null,null,"HV207 Has radio",null,0.39042911863324109,null,null,"dwell8 Informal dwelling/shack in backyard",null,-0.29762751823209072,null,null,"cookothe Household cooks in other house",null,-0.31990932041463049]
[null,null,"wall12 Cane/palm/trunks walls",null,-0.36649738472409171,null,null,"floor34 Concrete, cement floor",null,-0.29508700422468825,null,null,"HV246D@0 No goats",null,0.29944359486310745]
[null,null,"dwell9 Informal dwelling/shack not in backyard (e.g. in informal/squatter settlement or farm)",null,-0.36412746238697768,null,null,"wall33 Brick walls",null,0.27924212301701917,null,null,"HV246F@0 No chickens",null,0.29798516867215108]
[null,null,"floor12 Dung floor",null,-0.32915511006620635,null,null,"fuel5 Wood",null,-0.26614832263658028,null,null,"HV246G@0 No camels",null,0.28485898608211097]
[null,null,"wall37 Galvanized iron/aluminum walls",null,-0.32501522087153156,null,null,"cookwood Wood for cooking",null,-0.26575245073812193,null,null,"wall33 Brick walls",null,0.28086681925737822]
[null,null,"floor34 Concrete, cement floor",null,-0.30470804251421008,null,null,"persroom Number of members per sleeping room",null,-0.24494545626228803,null,null,"cookkero Kerosene for cooking",null,-0.271889408692847]
[null,null,"wall33 Brick walls",null,0.30108572351670249,null,null,"cookout Household cooks outside house",null,-0.22495031126237436,null,null,"hv246A@0 No cattle",null,0.25966462957758163]
[null,null,"cookothe Household cooks in other house",null,-0.28304002414836527,null,null,"HV243A Has mobile telephone",null,0.2247943478548135,null,null,"SH121G Vacuum cleaner or floor polisher",null,0.25905869552529848]
[null,null,"cookout Household cooks outside house",null,-0.27407365490878655,null,null,"floor11 Earth, sand floor",null,-0.22139001641988049,null,null,"roof34 Tile roof",null,0.25066146450685733]
[null,null,"roof12 Thatch, palm leaf roof",null,-0.2619546827399955,null,null,"HV210 Has bicycle",null,0.19568772369789969,null,null,"HV246G@1 1 camel",null,-0.24593417454808558]
[null,null,"persroom Number of members per sleeping room",null,-0.22948759306513761,null,null,"floor35 Rug or mat floor",null,-0.18873721153119377,null,null,"persroom Number of members per sleeping room",null,-0.24442416139162834]
[null,null,"floor11 Earth, sand floor",null,-0.20537575220025042,null,null,"wall12 Cane/palm/trunks walls",null,-0.18116757988700422,null,null,"fuel12 No heating/warming in household",null,0.21469078845795142]
[null,null,"HV243A Has mobile telephone",null,0.19959591205431493,null,null,"wall11 No walls",null,-0.17327920096491423,null,null,"HV246D@3 10+ more goats",null,-0.21408456936499484]
[null,null,"roof33 Calamine, cement fiber roof",null,0.19733960687332427,null,null,"wall31 Cement walls",null,0.172270259223714,null,null,"cookout Household cooks outside house",null,-0.21366413921183292]
[null,null,"HV211 Has motorcycle/scooter",null,0.17835953388873363,null,null,"HV211 Has motorcycle/scooter",null,0.17195377053593222,null,null,"floor11 Earth, sand floor",null,-0.20926375754324006]
[null,null,"dwell8 Informal dwelling/shack in backyard",null,-0.17471710734557439,null,null,"roof33 Calamine, cement fiber roof",null,0.16659886516031358,null,null,"HV246E@0 No sheepss",null,0.19707864545538645]
[null,null,"HV210 Has bicycle",null,0.1737595112818788,null,null,"fuel4 Coal",null,-0.15851494467237262,null,null,"HV246C@0 No horses, donkeys, mules",null,0.19690534927271486]
[null,null,"fuel2 LPG",null,0.14570320916562432,null,null,"fuel12 No heating/warming in household",null,-0.15597288767495468,null,null,"HV246G@2 2-3 camels",null,-0.18478201354992355]
[null,null,"wall11 No walls",null,-0.11898510501583993,null,null,"dwell2 Traditional dwelling/hut structure made of traditional materials",null,-0.15464759919292656,null,null,"HV246F@2 4-9 chickens",null,-0.17831947026529996]
[null,null,"wall34 Cement block walls",null,0.10843873644206256,null,null,"fuel3 Paraffin",null,-0.14261795023428248,null,null,"HV243A Has mobile telephone",null,0.17114562555177631]
[null,null,"HV243D Has boat with a motor",null,0.10061811763288231,null,null,"cookcoal Coal, lignite for cooking",null,-0.14088075504295128,null,null,"HV246A@2 5-5 cattle",null,-0.17105432380723692]
[null,null,"cookcoal Coal, lignite for cooking",null,-9.2003817540196375E-2,null,null,"floor12 Dung floor",null,-0.13019325454721006,null,null,"dwell9 Informal dwelling/shack not in backyard (e.g. in informal/squatter settlement or farm)",null,-0.16251175278568974]
[null,null,"floor35 Rug or mat floor",null,-9.1902561135753499E-2,null,null,"fuel2 LPG",null,0.12758643267454639,null,null,"HV246F@3 10+ chickens",null,-0.16086690257710734]
[null,null,"wall23 Uncovered adobe walls",null,-8.4025600724020572E-2,null,null,"wall34 Cement block walls",null,0.1215243218582861,null,null,"HV246C@2 2-3 horses, donkeys, mules",null,-0.15594244461538842]
[null,null,"fuel4 Coal",null,-8.1584539507774737E-2,null,null,"wall25 Carton walls",null,-0.12094911121940997,null,null,"HV246A@3 6+ cattle",null,-0.14309349426950937]
[null,null,"wall22 Stone with mud walls",null,-8.0868968862502125E-2,null,null,"wall26 Reused wood walls",null,-0.11507978850887522,null,null,"HV246D@1 1-4 goats",null,-0.13870326682277168]
[null,null,"wall25 Carton walls",null,-7.9182749444341324E-2,null,null,"floor32 Vinyl, asphalt strips floor",null,-0.11390194692121643,null,null,"HV246E@3 10+ more sheepss",null,-0.13686493914671399]
[null,null,"floor96 Other type of flooring",null,-7.8715856450143298E-2,null,null,"floor96 Other type of flooring",null,-9.9866086878797611E-2,null,null,"HV246D@2 5-9 goats",null,-0.13382696123290122]
[null,null,"wall31 Cement walls",null,7.7826906683448424E-2,null,null,"roof21 Rustic mat roof",null,-9.9251695981227558E-2,null,null,"HV246F@1 1-3 chickens",null,-0.1250036074615615]
[null,null,"roof21 Rustic mat roof",null,-7.533585566160246E-2,null,null,"HV243D Has boat with a motor",null,9.400241511843152E-2,null,null,"wall23 Uncovered adobe walls",null,-0.11662554669106122]
[null,null,"wall24 Plywood walls",null,-7.4710177420598545E-2,null,null,"cookothe Household cooks in other house",null,-8.5314683968697749E-2,null,null,"HV246A@1 1-2 ccattle",null,-0.11589393838485337]
[null,null,"fuel12 No heating/warming in household",null,-7.4568136740574623E-2,null,null,"cooknone Does not cook",null,-8.0946647995724069E-2,null,null,"wall31 Cement walls",null,0.10826921631707165]
[null,null,"cooknone Does not cook",null,-7.3689289762196061E-2,null,null,"cookelot Electricity from other source",null,-8.0381747066696763E-2,null,null,"wall37 Galvanized iron/aluminum walls",null,-0.10784233047550983]
[null,null,"floor31 Parquet, wood tile floor",null,7.3639683861951966E-2,null,null,"dwell7 Dwelling/house/flat/room in backyard",null,-7.2180163360754779E-2,null,null,"HV246E@2 5-9 sheepss",null,-0.10430487558922706]
[null,null,"dwell5 Town house/semi-detached house in complex",null,6.9248766612896848E-2,null,null,"wall22 Stone with mud walls",null,-7.0362972642281196E-2,null,null,"HV211 Has motorcycle/scooter",null,0.10283513130773006]
[null,null,"wall26 Reused wood walls",null,-6.7255932889467865E-2,null,null,"HV243C Has animal-drawn cart",null,6.7443312628384669E-2,null,null,"wall22 Stone with mud walls",null,-9.6546207557601224E-2]
[null,null,"dwell10 Room/flatlet on property or larger dwelling/servant's quarters/granny flat",null,-6.3765840105231203E-2,null,null,"dwell10 Room/flatlet on property or larger dwelling/servant's quarters/granny flat",null,-6.4117883554177302E-2,null,null,"HV246C@1 1 horse, donkey, mule",null,-9.6411319864398035E-2]
[null,null,"dwell4 Cluster house in complex",null,6.3281520887045237E-2,null,null,"dwell4 Cluster house in complex",null,6.3450787737094339E-2,null,null,"roof33 Calamine, cement fiber roof",null,9.5093215942694972E-2]
[null,null,"dwell6 Semi-detached house",null,6.2240262727663545E-2,null,null,"wall36 Wood planks, shingles walls",null,-5.9321058988017351E-2,null,null,"HV246E@1 1-4 sheepss",null,-9.1960501873057723E-2]
[null,null,"roof26 Cardboard roof",null,5.3437344735634378E-2,null,null,"dwell5 Town house/semi-detached house in complex",null,5.6901744792103755E-2,null,null,"floor35 Rug or mat floor",null,-9.0466052335981567E-2]
[null,null,"roof35 Concrete roof",null,4.9059857448256902E-2,null,null,"HV246F@2 4-9 chickens",null,-5.6181225451799564E-2,null,null,"fuel2 LPG",null,8.988171790893161E-2]
[null,null,"cookelot Electricity from other source",null,-4.6272985082370259E-2,null,null,"floor31 Parquet, wood tile floor",null,5.5992528915256183E-2,null,null,"HV246C@3 4+ horses, donkeys, mules",null,-8.8856034124109001E-2]
[null,null,"floor21 Rudimentary wood plank floor",null,4.593948071199009E-2,null,null,"wall24 Plywood walls",null,-4.847250395889615E-2,null,null,"HV243D Has boat with a motor",null,7.7139525601044812E-2]
[null,null,"dwell3 Flat or apartment in block of flats",null,4.4269373378045616E-2,null,null,"dwell6 Semi-detached house",null,4.6703058034718491E-2,null,null,"HV210 Has bicycle",null,6.610120761421831E-2]
[null,null,"roof25 Cardboard roof",null,4.2857643608494603E-2,null,null,"HV246F@0 No chickens",null,4.5393253383318753E-2,null,null,"wall34 Cement block walls",null,6.3961421488459416E-2]
[null,null,"cookcrop Agricultural crop for cooking",null,-4.177012438255695E-2,null,null,"roof35 Concrete roof",null,4.4981124578268257E-2,null,null,"roof21 Rustic mat roof",null,-6.0240821270583347E-2]
[null,null,"wall32 Stone walls with lime/cement",null,3.9568892491692036E-2,null,null,"roof26 Cardboard roof",null,4.4516378485343268E-2,null,null,"wall25 Carton walls",null,-5.9510958945776446E-2]
[null,null,"floor32 Vinyl, asphalt strips floor",null,-3.4149076892060391E-2,null,null,"cookcrop Agricultural crop for cooking",null,-4.180962898873683E-2,null,null,"dwell8 Informal dwelling/shack in backyard",null,-5.479490987016733E-2]
[null,null,"roof13 Sod roof",null,-3.3969243152965768E-2,null,null,"wall21 Bamboo with mud walls",null,-4.1414756454093211E-2,null,null,"roof13 Sod roof",null,-4.8660452891638062E-2]
[null,null,"dwell7 Dwelling/house/flat/room in backyard",null,-3.358706680864855E-2,null,null,"HV246E@0 No sheepss",null,-3.9508974226645947E-2,null,null,"floor96 Other type of flooring",null,-4.7545879523105065E-2]
[null,null,"HV243C Has animal-drawn cart",null,3.3271578528249642E-2,null,null,"roof13 Sod roof",null,-3.7779687939614781E-2,null,null,"cookcrop Agricultural crop for cooking",null,-4.6966734552788991E-2]
[null,null,"roof32 Finished wood roof",null,3.2515695729052579E-2,null,null,"dwell3 Flat or apartment in block of flats",null,3.5832540302789553E-2,null,null,"fuel6 Straw/shrubs/grass",null,-4.437186904681889E-2]
[null,null,"roof24 Cardboard roof",null,3.2506056879173038E-2,null,null,"HV246E@3 10+ more sheepss",null,3.5818932187352319E-2,null,null,"wall26 Reused wood walls",null,-4.1354002752353354E-2]
[null,null,"fuel6 Straw/shrubs/grass",null,-3.0224375900947103E-2,null,null,"roof25 Cardboard roof",null,3.5339529759248443E-2,null,null,"wall32 Stone walls with lime/cement",null,3.8475439018039646E-2]
[null,null,"fuel3 Paraffin",null,-2.8698129628569626E-2,null,null,"roof24 Cardboard roof",null,3.4023791739396715E-2,null,null,"HV243C Has animal-drawn cart",null,-3.8442777891620351E-2]
[null,null,"fuel7 Agricultural crop",null,-2.4780754517090824E-2,null,null,"HV246F@1 1-3 chickens",null,-3.3526565389729514E-2,null,null,"wall24 Plywood walls",null,-3.8220816484535715E-2]
[null,null,"cooklpg LPG for cooking",null,2.4742076314384655E-2,null,null,"wall23 Uncovered adobe walls",null,-2.8469394237756289E-2,null,null,"fuel7 Agricultural crop",null,-3.7654900071584688E-2]
[null,null,"wall36 Wood planks, shingles walls",null,-2.4230110145359342E-2,null,null,"wall32 Stone walls with lime/cement",null,2.8335072471905299E-2,null,null,"wall11 No walls",null,-3.6072444051549149E-2]
[null,null,"fuel8 Animal dung",null,-2.1715472175409156E-2,null,null,"HV246A@3 6+ cattle",null,2.6906173444847567E-2,null,null,"cooknone Does not cook",null,-3.4359750844439714E-2]
[null,null,"roof11 No roof",null,1.7198758750333151E-2,null,null,"HV246C@0 No horses, donkeys, mules",null,-2.6151475464705934E-2,null,null,"floor34 Concrete, cement floor",null,3.3108425195860075E-2]
[null,null,"cookoth Other fuel for cooking",null,-1.7040001796140427E-2,null,null,"HV246D@1 1-4 goats",null,-2.4532297972520319E-2,null,null,"roof31 Metal/ corrugated iron roof",null,3.2628096228706424E-2]
[null,null,"wall21 Bamboo with mud walls",null,-1.6988682453712253E-2,null,null,"wall96 Other type of walls",null,-2.3771938311201266E-2,null,null,"cookcoal Coal, lignite for cooking",null,-3.2380087961891776E-2]
[null,null,"cookelse Household cooks in other place",null,-1.4983888410132097E-2,null,null,"hv246A@0 No cattle",null,-2.3631069954850259E-2,null,null,"HV246G@3 4+ camels",null,-3.0934463463731878E-2]
[null,null,"fuel9 Electricity from generator",null,-1.3141384398340141E-2,null,null,"HV246C@2 2-3 horses, donkeys, mules",null,2.3568937778871354E-2,null,null,"dwell6 Semi-detached house",null,2.9766235815614498E-2]
[null,null,"cooksola Solar energy",null,-1.302689548556136E-2,null,null,"cookoth Other fuel for cooking",null,-2.3222496686168319E-2,null,null,"roof35 Concrete roof",null,2.5029680847225292E-2]
[null,null,"wall96 Other type of walls",null,-1.1055860293273772E-2,null,null,"HV246D@3 10+ more goats",null,2.2863549108537384E-2,null,null,"dwell4 Cluster house in complex",null,-2.3989986876498694E-2]
[null,null,"roof96 Other type of roof",null,1.0876923160583314E-2,null,null,"fuel6 Straw/shrubs/grass",null,-2.280422953987345E-2,null,null,"cookdung Dung for cooking",null,-2.246454776847014E-2]
[null,null,"fuel11 Solar energy",null,9.9662353356733697E-3,null,null,"fuel10 Electricity from other source",null,-2.2091815149542466E-2,null,null,"wall96 Other type of walls",null,2.1601647130043457E-2]
[null,null,"dwell11 Caravan or tent",null,8.7773295876394757E-3,null,null,"roof32 Finished wood roof",null,2.1412435606732446E-2,null,null,"fuel8 Animal dung",null,-2.1213794061700007E-2]
[null,null,"roof22 Palm/bamboo roof",null,-6.5756792072097763E-3,null,null,"floor21 Rudimentary wood plank floor",null,2.1340872633702081E-2,null,null,"dwell11 Caravan or tent",null,1.6157375020281983E-2]
[null,null,"roof23 Wood planks roof",null,6.3413007056525722E-3,null,null,"cooksola Solar energy",null,-2.0733283765204655E-2,null,null,"wall21 Bamboo with mud walls",null,-1.6071337700290619E-2]
[null,null,"cookdung Dung for cooking",null,-6.013770671605868E-3,null,null,"HV246C@3 4+ horses, donkeys, mules",null,2.0423317780936878E-2,null,null,"dwell7 Dwelling/house/flat/room in backyard",null,1.5993292860938858E-2]
[null,null,"fuel10 Electricity from other source",null,-5.5287216156311185E-3,null,null,"fuel9 Electricity from generator",null,-1.8105758698881411E-2,null,null,"roof23 Wood planks roof",null,-1.5971369204027103E-2]
[null,null,"cookgene Electricity from generator",null,4.9810759266879587E-3,null,null,"cooklpg LPG for cooking",null,-1.6832478170491307E-2,null,null,"cookelot Electricity from other source",null,-1.5440908870222262E-2]
[null,null,"fuel13 Other",null,-3.8562373590078584E-3,null,null,"HV246E@1 1-4 sheepss",null,1.4847839896119109E-2,null,null,"roof24 Cardboard roof",null,1.4682536887093575E-2]
[null,null,null,null,null,null,null,"roof12 Thatch, palm leaf roof",null,1.4443189496588233E-2,null,null,"floor31 Parquet, wood tile floor",null,1.3721061909802297E-2]
[null,null,null,null,null,null,null,"HV246E@2 5-9 sheepss",null,1.3407399885471719E-2,null,null,"cookoth Other fuel for cooking",null,-1.3557467419470007E-2]
[null,null,null,null,null,null,null,"roof11 No roof",null,1.2983974159879718E-2,null,null,"roof32 Finished wood roof",null,1.2282141275544762E-2]
[null,null,"Qualités de représentation",null,null,null,null,"cookelse Household cooks in other place",null,-1.2982943082041187E-2,null,null,"roof96 Other type of roof",null,1.1577109923772986E-2]
[null,null,null,null,"Extraction",null,null,"roof22 Palm/bamboo roof",null,-1.1807357383862854E-2,null,null,"dwell5 Town house/semi-detached house in complex",null,1.1429303750711012E-2]
[null,null,"persroom Number of members per sleeping room",null,5.2664555370830195E-2,null,null,"HV246G@1 1 camel",null,-1.0481739725489742E-2,null,null,"fuel11 Solar energy",null,1.0928168456584498E-2]
[null,null,"floor11 Earth, sand floor",null,4.2179199591818664E-2,null,null,"HV246A@2 5-5 cattle",null,9.8837613820572379E-3,null,null,"roof26 Cardboard roof",null,9.2126582470569776E-3]
[null,null,"floor12 Dung floor",null,0.10834308648269642,null,null,"fuel11 Solar energy",null,8.6520309818732925E-3,null,null,"fuel3 Paraffin",null,8.8757173793389179E-3]
[null,null,"floor21 Rudimentary wood plank floor",null,2.1104358880873093E-3,null,null,"fuel8 Animal dung",null,-5.2911683874887787E-3,null,null,"dwell10 Room/flatlet on property or larger dwelling/servant's quarters/granny flat",null,-8.7965650940778697E-3]
[null,null,"floor31 Parquet, wood tile floor",null,5.4228030392882284E-3,null,null,"roof23 Wood planks roof",null,5.2572634027422474E-3,null,null,"wall36 Wood planks, shingles walls",null,-7.9564323454174839E-3]
[null,null,"floor32 Vinyl, asphalt strips floor",null,1.1661594525798531E-3,null,null,"cookdung Dung for cooking",null,-5.2141203825075049E-3,null,null,"floor32 Vinyl, asphalt strips floor",null,-7.867734914632574E-3]
[null,null,"floor33 Terrazo, ceramic tile floor",null,0.31283536164852799,null,null,"fuel13 Other",null,-5.138025048456063E-3,null,null,"fuel10 Electricity from other source",null,-5.7371175562666472E-3]
[null,null,"floor34 Concrete, cement floor",null,9.2846991172841661E-2,null,null,"HV246G@0 No camels",null,4.9249830375167752E-3,null,null,"cooklpg LPG for cooking",null,-5.7009251216225904E-3]
[null,null,"floor35 Rug or mat floor",null,8.4460807433109093E-3,null,null,"HV246F@3 10+ chickens",null,4.8920742018223815E-3,null,null,"roof25 Cardboard roof",null,4.8091122894405062E-3]
[null,null,"floor96 Other type of flooring",null,6.1961860566795667E-3,null,null,"HV246C@1 1 horse, donkey, mule",null,-4.5331682535646916E-3,null,null,"dwell3 Flat or apartment in block of flats",null,-4.1737494811527271E-3]
[null,null,"wall11 No walls",null,1.4157455215630457E-2,null,null,"HV246G@2 2-3 camels",null,-4.1942607807202194E-3,null,null,"fuel4 Coal",null,2.3889221087638277E-3]
[null,null,"wall12 Cane/palm/trunks walls",null,0.13432033300959889,null,null,"dwell11 Caravan or tent",null,-4.1038982215711129E-3,null,null,"fuel9 Electricity from generator",null,1.7996194736300936E-3]
[null,null,"wall21 Bamboo with mud walls",null,2.8861533151307056E-4,null,null,"HV246A@1 1-2 ccattle",null,-2.7249152613828152E-3,null,null,"cooksola Solar energy",null,-1.298875407475643E-3]
[null,null,"wall22 Stone with mud walls",null,6.5397901248843383E-3,null,null,"HV246D@0 No goats",null,-2.4514784235126082E-3,null,null,"cookelse Household cooks in other place",null,8.8174544877541003E-4]
[null,null,"wall23 Uncovered adobe walls",null,7.0603015770325265E-3,null,null,"HV246G@3 4+ camels",null,2.0555355872058996E-3,null,null,"floor21 Rudimentary wood plank floor",null,7.9342241578412795E-4]
[null,null,"wall24 Plywood walls",null,5.5816106102173123E-3,null,null,"roof96 Other type of roof",null,1.9256486546016622E-3,null,null,"fuel13 Other",null,-5.4398195330275241E-4]
[null,null,"wall25 Carton walls",null,6.2699078095653366E-3,null,null,"cookgene Electricity from generator",null,-1.706171181394936E-3]
[null,null,"wall26 Reused wood walls",null,4.5233605088326051E-3,null,null,"HV246D@2 5-9 goats",null,5.1363048311309125E-4]
[null,null,"wall31 Cement walls",null,6.057027403914189E-3]
[null,null,"wall32 Stone walls with lime/cement",null,1.5656972530190823E-3,null,null,null,null,null,null,null,"Qualités de représentation"]
[null,null,"wall33 Brick walls",null,9.0652612905576219E-2,null,null,null,null,null,null,null,null,null,"Extraction"]
[null,null,"wall34 Cement block walls",null,1.1758959561151108E-2,null,null,"Qualités de représentation",null,null,null,null,"persroom Number of members per sleeping room",null,5.974317067200078E-2]
[null,null,"wall36 Wood planks, shingles walls",null,5.8709823765624568E-4,null,null,null,null,"Extraction",null,null,"floor11 Earth, sand floor",null,4.3791320221115961E-2]
[null,null,"wall37 Galvanized iron/aluminum walls",null,0.10563489379817044,null,null,"persroom Number of members per sleeping room",null,5.9998276543540459E-2,null,null,"floor12 Dung floor",null,0.23366038723634627]
[null,null,"wall96 Other type of walls",null,1.2223204682438763E-4,null,null,"floor11 Earth, sand floor",null,4.9013539370394953E-2,null,null,"floor21 Rudimentary wood plank floor",null,6.2951912986872165E-7]
[null,null,"roof11 No roof",null,2.9579730255216115E-4,null,null,"floor12 Dung floor",null,1.6950283529594636E-2,null,null,"floor31 Parquet, wood tile floor",null,1.8826753993262746E-4]
[null,null,"roof12 Thatch, palm leaf roof",null,6.8620255809411695E-2,null,null,"floor21 Rudimentary wood plank floor",null,4.5543284476789439E-4,null,null,"floor32 Vinyl, asphalt strips floor",null,6.1901252686928431E-5]
[null,null,"roof13 Sod roof",null,1.1539094803853117E-3,null,null,"floor31 Parquet, wood tile floor",null,3.1351632943257997E-3,null,null,"floor33 Terrazo, ceramic tile floor",null,0.16649000949569934]
[null,null,"roof21 Rustic mat roof",null,5.6754911482657993E-3,null,null,"floor32 Vinyl, asphalt strips floor",null,1.2973653512443605E-2,null,null,"floor34 Concrete, cement floor",null,1.0961678189498622E-3]
[null,null,"roof22 Palm/bamboo roof",null,4.3239557036130991E-5,null,null,"floor33 Terrazo, ceramic tile floor",null,0.28878719227818372,null,null,"floor35 Rug or mat floor",null,8.1841066252565566E-3]
[null,null,"roof23 Wood planks roof",null,4.0212094639509812E-5,null,null,"floor34 Concrete, cement floor",null,8.707634006230118E-2,null,null,"floor96 Other type of flooring",null,2.2606106596256216E-3]
[null,null,"roof24 Cardboard roof",null,1.0566437338320328E-3,null,null,"floor35 Rug or mat floor",null,3.562173501657058E-2,null,null,"wall11 No walls",null,1.3012212198521436E-3]
[null,null,"roof25 Cardboard roof",null,1.8367776156727382E-3,null,null,"floor96 Other type of flooring",null,9.9732353084835516E-3,null,null,"wall12 Cane/palm/trunks walls",null,0.2689280552071352]
[null,null,"roof26 Cardboard roof",null,2.8555498123950312E-3,null,null,"wall11 No walls",null,3.002568148703913E-2,null,null,"wall21 Bamboo with mud walls",null,2.5828789547678257E-4]
[null,null,"roof31 Metal/ corrugated iron roof",null,0.17178873402658756,null,null,"wall12 Cane/palm/trunks walls",null,3.2821692002114052E-2,null,null,"wall22 Stone with mud walls",null,9.3211701937554164E-3]
[null,null,"roof32 Finished wood roof",null,1.0572704687443282E-3,null,null,"wall21 Bamboo with mud walls",null,1.7151820521518553E-3,null,null,"wall23 Uncovered adobe walls",null,1.3601518140988901E-2]
[null,null,"roof33 Calamine, cement fiber roof",null,3.8942920440918176E-2,null,null,"wall22 Stone with mud walls",null,4.9509479190584117E-3,null,null,"wall24 Plywood walls",null,1.460830812744557E-3]
[null,null,"roof34 Tile roof",null,0.19517121146349425,null,null,"wall23 Uncovered adobe walls",null,8.1050640826479101E-4,null,null,"wall25 Carton walls",null,3.5415542346458897E-3]
[null,null,"roof35 Concrete roof",null,2.4068696128432881E-3,null,null,"wall24 Plywood walls",null,2.3495836400452027E-3,null,null,"wall26 Reused wood walls",null,1.7101535436416487E-3]
[null,null,"roof96 Other type of roof",null,1.1830745744123371E-4,null,null,"wall25 Carton walls",null,1.4628687504765203E-2,null,null,"wall31 Cement walls",null,1.1722223201912853E-2]
[null,null,"cookelec Electricity for cooking",null,0.39739423067100976,null,null,"wall26 Reused wood walls",null,1.3243357723247449E-2,null,null,"wall32 Stone walls with lime/cement",null,1.4803594076308877E-3]
[null,null,"cooklpg LPG for cooking",null,6.1217034034683415E-4,null,null,"wall31 Cement walls",null,2.9677042213005617E-2,null,null,"wall33 Brick walls",null,7.8886170159756769E-2]
[null,null,"cookkero Kerosene for cooking",null,0.1872583871972347,null,null,"wall32 Stone walls with lime/cement",null,8.0287633198812547E-4,null,null,"wall34 Cement block walls",null,4.0910634388243577E-3]
[null,null,"cookcoal Coal, lignite for cooking",null,8.4647024419697466E-3,null,null,"wall33 Brick walls",null,7.7976163267052062E-2,null,null,"wall36 Wood planks, shingles walls",null,6.3304815667205561E-5]
[null,null,"cookwood Wood for cooking",null,0.2329355636278154,null,null,"wall34 Cement block walls",null,1.4768160803116312E-2,null,null,"wall37 Galvanized iron/aluminum walls",null,1.1629968242389075E-2]
[null,null,"cookcrop Agricultural crop for cooking",null,1.7447432909342786E-3,null,null,"wall36 Wood planks, shingles walls",null,3.5189880394598341E-3,null,null,"wall96 Other type of walls",null,4.6663115873091471E-4]
[null,null,"cookdung Dung for cooking",null,3.616543769066689E-5,null,null,"wall37 Galvanized iron/aluminum walls",null,0.27851517032524464,null,null,"roof12 Thatch, palm leaf roof",null,0.17088812045154647]
[null,null,"cookgene Electricity from generator",null,2.4811117387430305E-5,null,null,"wall96 Other type of walls",null,5.6510505107155843E-4,null,null,"roof13 Sod roof",null,2.367839675619327E-3]
[null,null,"cookelot Electricity from other source",null,2.1411891484332604E-3,null,null,"roof11 No roof",null,1.6858358498442422E-4,null,null,"roof21 Rustic mat roof",null,3.6289565473543671E-3]
[null,null,"cooksola Solar energy",null,1.6970000599173896E-4,null,null,"roof12 Thatch, palm leaf roof",null,2.0860572283435666E-4,null,null,"roof23 Wood planks roof",null,2.5508463425134533E-4]
[null,null,"cooknone Does not cook",null,5.430111425656893E-3,null,null,"roof13 Sod roof",null,1.4273048208146746E-3,null,null,"roof24 Cardboard roof",null,2.155768894408635E-4]
[null,null,"cookoth Other fuel for cooking",null,2.9036166121246899E-4,null,null,"roof21 Rustic mat roof",null,9.8508991551500228E-3,null,null,"roof25 Cardboard roof",null,2.3127561012447707E-5]
[null,null,"cookothe Household cooks in other house",null,8.0111655269907198E-2,null,null,"roof22 Palm/bamboo roof",null,1.3941368839026066E-4,null,null,"roof26 Cardboard roof",null,8.4873071977066938E-5]
[null,null,"cookout Household cooks outside house",null,7.5116368315060619E-2,null,null,"roof23 Wood planks roof",null,2.7638818485812995E-5,null,null,"roof31 Metal/ corrugated iron roof",null,1.0645926635097264E-3]
[null,null,"cookelse Household cooks in other place",null,2.2451691188729098E-4,null,null,"roof24 Cardboard roof",null,1.1576184043258402E-3,null,null,"roof32 Finished wood roof",null,1.5085099431244031E-4]
[null,null,"fuel1 Electricity from mains",null,0.19476343961999304,null,null,"roof25 Cardboard roof",null,1.2488823636048064E-3,null,null,"roof33 Calamine, cement fiber roof",null,9.0427197183240177E-3]
[null,null,"fuel2 LPG",null,2.122942516116167E-2,null,null,"roof26 Cardboard roof",null,1.9817079534503331E-3,null,null,"roof34 Tile roof",null,6.2831169788722496E-2]
[null,null,"fuel3 Paraffin",null,8.2358264417818584E-4,null,null,"roof31 Metal/ corrugated iron roof",null,0.25857166721114155,null,null,"roof35 Concrete roof",null,6.2648492331395661E-4]
[null,null,"fuel4 Coal",null,6.6560370866956568E-3,null,null,"roof32 Finished wood roof",null,4.5849239861246347E-4,null,null,"roof96 Other type of roof",null,1.3402947418712294E-4]
[null,null,"fuel5 Wood",null,0.20460727090661754,null,null,"roof33 Calamine, cement fiber roof",null,2.7755181872704347E-2,null,null,"cookelec Electricity for cooking",null,0.41027612292004778]
[null,null,"fuel6 Straw/shrubs/grass",null,9.1351289860175204E-4,null,null,"roof34 Tile roof",null,0.19718772365601819,null,null,"cooklpg LPG for cooking",null,3.2500547242347544E-5]
[null,null,"fuel7 Agricultural crop",null,6.1408579443631729E-4,null,null,"roof35 Concrete roof",null,2.0233015683256885E-3,null,null,"cookkero Kerosene for cooking",null,7.3923850559345985E-2]
[null,null,"fuel8 Animal dung",null,4.7156173180096922E-4,null,null,"roof96 Other type of roof",null,3.7081227409691916E-6,null,null,"cookcoal Coal, lignite for cooking",null,1.0484700964198488E-3]
[null,null,"fuel9 Electricity from generator",null,1.7269598390493767E-4,null,null,"cookelec Electricity for cooking",null,0.33234023835242188,null,null,"cookwood Wood for cooking",null,0.29458842074500985]
[null,null,"fuel10 Electricity from other source",null,3.0566762703146765E-5,null,null,"cooklpg LPG for cooking",null,2.8333232136006634E-4,null,null,"cookcrop Agricultural crop for cooking",null,2.2058741545521432E-3]
[null,null,"fuel11 Solar energy",null,9.9325846766024488E-5,null,null,"cookkero Kerosene for cooking",null,0.36099317975448642,null,null,"cookdung Dung for cooking",null,5.0465590644187676E-4]
[null,null,"fuel12 No heating/warming in household",null,5.5604070169610349E-3,null,null,"cookcoal Coal, lignite for cooking",null,1.9847387141472043E-2,null,null,"cookelot Electricity from other source",null,2.3842166673850853E-4]
[null,null,"fuel13 Other",null,1.4870566569007903E-5,null,null,"cookwood Wood for cooking",null,7.0624365073317916E-2,null,null,"cooksola Solar energy",null,1.6870773241450176E-6]
[null,null,"dwell1 Dwelling/house or brick/concrete block structure on a separate stand/yard/farm",null,0.24608127859703416,null,null,"cookcrop Agricultural crop for cooking",null,1.7480450761758232E-3,null,null,"cooknone Does not cook",null,1.1805924780919756E-3]
[null,null,"dwell2 Traditional dwelling/hut structure made of traditional materials",null,0.16139728301443657,null,null,"cookdung Dung for cooking",null,2.7187051363280209E-5,null,null,"cookoth Other fuel for cooking",null,1.8380492282999073E-4]
[null,null,"dwell3 Flat or apartment in block of flats",null,1.9597774192848141E-3,null,null,"cookgene Electricity from generator",null,2.9110201002225916E-6,null,null,"cookothe Household cooks in other house",null,0.10234197328815071]
[null,null,"dwell4 Cluster house in complex",null,4.0045508857775424E-3,null,null,"cookelot Electricity from other source",null,6.4612252614944139E-3,null,null,"cookout Household cooks outside house",null,4.5652364385133516E-2]
[null,null,"dwell5 Town house/semi-detached house in complex",null,4.7953916774074569E-3,null,null,"cooksola Solar energy",null,4.2986905568849888E-4,null,null,"cookelse Household cooks in other place",null,7.7747503643614927E-7]
[null,null,"dwell6 Semi-detached house",null,3.8738503044085837E-3,null,null,"cooknone Does not cook",null,6.5523598217436599E-3,null,null,"fuel1 Electricity from mains",null,0.13545326780448622]
[null,null,"dwell7 Dwelling/house/flat/room in backyard",null,1.1280910568086211E-3,null,null,"cookoth Other fuel for cooking",null,5.3928435233909855E-4,null,null,"fuel2 LPG",null,8.0787232142607579E-3]
[null,null,"dwell8 Informal dwelling/shack in backyard",null,3.0526067599204964E-2,null,null,"cookothe Household cooks in other house",null,7.2785953006787724E-3,null,null,"fuel3 Paraffin",null,7.877835899789891E-5]
[null,null,"dwell9 Informal dwelling/shack not in backyard (e.g. in informal/squatter settlement or farm)",null,0.13258880886437985,null,null,"cookout Household cooks outside house",null,5.0602642537039111E-2,null,null,"fuel4 Coal",null,5.7069488417406134E-6]
[null,null,"dwell10 Room/flatlet on property or larger dwelling/servant's quarters/granny flat",null,4.0660823643259118E-3,null,null,"cookelse Household cooks in other place",null,1.6855681107152111E-4,null,null,"fuel5 Wood",null,0.3018387911988023]
[null,null,"dwell11 Caravan or tent",null,7.7041514690051371E-5,null,null,"fuel1 Electricity from mains",null,0.14896227305927451,null,null,"fuel6 Straw/shrubs/grass",null,1.9688627627080443E-3]
[null,null,"HV206 Has electricity",null,0.45352389418307043,null,null,"fuel2 LPG",null,1.6278297802616557E-2,null,null,"fuel7 Agricultural crop",null,1.4178914994010285E-3]
[null,null,"HV207 Has radio",null,0.15243489667672944,null,null,"fuel3 Paraffin",null,2.0339879729028273E-2,null,null,"fuel8 Animal dung",null,4.500250584922185E-4]
[null,null,"HV208 Has television",null,0.39292188319986754,null,null,"fuel4 Coal",null,2.5126987684485354E-2,null,null,"fuel9 Electricity from generator",null,3.2386302498686553E-6]
[null,null,"HV209 Has refrigerator",null,0.45211018935577835,null,null,"fuel5 Wood",null,7.0834929642265232E-2,null,null,"fuel10 Electricity from other source",null,3.2914517854422989E-5]
[null,null,"HV210 Has bicycle",null,3.0192367760917369E-2,null,null,"fuel6 Straw/shrubs/grass",null,5.2003288490723692E-4,null,null,"fuel11 Solar energy",null,1.1942486581548841E-4]
[null,null,"HV211 Has motorcycle/scooter",null,3.181212332900632E-2,null,null,"fuel8 Animal dung",null,2.7996462904760602E-5,null,null,"fuel12 No heating/warming in household",null,4.6092134648696846E-2]
[null,null,"HV212 Has car/truck",null,0.27098405498074868,null,null,"fuel9 Electricity from generator",null,3.2781849806211988E-4,null,null,"fuel13 Other",null,2.959163655190779E-7]
[null,null,"HV243A Has mobile telephone",null,3.9838528108793819E-2,null,null,"fuel10 Electricity from other source",null,4.8804829660155401E-4,null,null,"dwell1 Dwelling/house or brick/concrete block structure on a separate stand/yard/farm",null,0.27913399313139053]
[null,null,"HV243B Has watch",null,0.2290408645274459,null,null,"fuel11 Solar energy",null,7.4857640111295327E-5,null,null,"dwell2 Traditional dwelling/hut structure made of traditional materials",null,0.33477640655833418]
[null,null,"HV243C Has animal-drawn cart",null,1.1069979377614826E-3,null,null,"fuel12 No heating/warming in household",null,2.4327541689664028E-2,null,null,"dwell3 Flat or apartment in block of flats",null,1.742018473142266E-5]
[null,null,"HV243D Has boat with a motor",null,1.0124005595984541E-2,null,null,"fuel13 Other",null,2.639930139856193E-5,null,null,"dwell4 Cluster house in complex",null,5.7551947033457958E-4]
[null,null,"HV243E Has a computer",null,0.23318329171650787,null,null,"dwell1 Dwelling/house or brick/concrete block structure on a separate stand/yard/farm",null,0.31867334317054363,null,null,"dwell5 Town house/semi-detached house in complex",null,1.3062898422601681E-4]
[null,null,"SH121A Electricity connected to the mains",null,0.45526533893457566,null,null,"dwell2 Traditional dwelling/hut structure made of traditional materials",null,2.3915879936136059E-2,null,null,"dwell6 Semi-detached house",null,8.8602879463077131E-4]
[null,null,"SH121G Vacuum cleaner or floor polisher",null,0.19771599967230358,null,null,"dwell3 Flat or apartment in block of flats",null,1.2839709445510376E-3,null,null,"dwell7 Dwelling/house/flat/room in backyard",null,2.5578541653575784E-4]
[null,null,"SH121H Microwave oven",null,0.45695276131622892,null,null,"dwell4 Cluster house in complex",null,4.0260024644578011E-3,null,null,"dwell8 Informal dwelling/shack in backyard",null,3.0024821476797611E-3]
[null,null,"SH121I Electric/gas stove",null,0.45207003033299331,null,null,"dwell5 Town house/semi-detached house in complex",null,3.2378085603857066E-3,null,null,"dwell9 Informal dwelling/shack not in backyard (e.g. in informal/squatter settlement or farm)",null,2.6410069793477139E-2]
[null,null,"SH121J Washing machine",null,0.38360804249069097,null,null,"dwell6 Semi-detached house",null,2.1811756297942832E-3,null,null,"dwell10 Room/flatlet on property or larger dwelling/servant's quarters/granny flat",null,7.7379557454349207E-5]
[null,null,null,null,null,null,null,"dwell7 Dwelling/house/flat/room in backyard",null,5.2099759827852468E-3,null,null,"dwell11 Caravan or tent",null,2.6106076754603218E-4]
[null,null,null,null,null,null,null,"dwell8 Informal dwelling/shack in backyard",null,8.8582139608993485E-2,null,null,"HV206 Has electricity",null,0.46631032951969026]
[null,null,"Variance totale expliquée",null,null,null,null,"dwell9 Informal dwelling/shack not in backyard (e.g. in informal/squatter settlement or farm)",null,0.31758224966033188,null,null,"HV207 Has radio",null,0.10431661276496051]
[null,null,"Composante",null,"Sommes extraites du carré des chargements",null,null,"dwell10 Room/flatlet on property or larger dwelling/servant's quarters/granny flat",null,4.1111029914670397E-3,null,null,"HV208 Has television",null,0.3024958990643552]
[null,null,null,null,"Total","% de la variance","% cumulé","dwell11 Caravan or tent",null,1.6841980613014543E-5,null,null,"HV209 Has refrigerator",null,0.35647072669609614]
[null,null,"1",null,7.7796888971645579,8.1038426012130813,8.1038426012130813,"HV206 Has electricity",null,0.52316041723988305,null,null,"HV210 Has bicycle",null,4.3693696480579924E-3]
[null,null,null,null,null,null,null,"HV207 Has radio",null,0.14891098002182024,null,null,"HV211 Has motorcycle/scooter",null,1.0575064231078082E-2]
[null,null,null,null,null,null,null,"HV208 Has television",null,0.39147899147183141,null,null,"HV212 Has car/truck",null,0.11332867910113052]
[null,null,"Matrice des coefficients des composantes",null,null,null,null,"HV209 Has refrigerator",null,0.48859723861592547,null,null,"HV243A Has mobile telephone",null,2.929082514550883E-2]
[null,null,null,null,"Composante",null,null,"HV210 Has bicycle",null,3.8293685206065534E-2,null,null,"HV243B Has watch",null,0.11678470891565117]
[null,null,null,null,"1",null,null,"HV211 Has motorcycle/scooter",null,2.9568099201524031E-2,null,null,"HV243C Has animal-drawn cart",null,1.4778471720244544E-3]
[null,null,"persroom Number of members per sleeping room",null,-2.949829949482663E-2,null,null,"HV212 Has car/truck",null,0.26113655219896331,null,null,"HV243D Has boat with a motor",null,5.950506409954248E-3]
[null,null,"floor11 Earth, sand floor",null,-2.6398967222854265E-2,null,null,"HV243A Has mobile telephone",null,5.0532498827470899E-2,null,null,"HV243E Has a computer",null,0.10517609089148638]
[null,null,"floor12 Dung floor",null,-4.2309546617753907E-2,null,null,"HV243B Has watch",null,0.20574301195333441,null,null,"SH121A Electricity connected to the mains",null,0.46624079577826816]
[null,null,"floor21 Rudimentary wood plank floor",null,5.905053700634935E-3,null,null,"HV243C Has animal-drawn cart",null,4.548600418290031E-3,null,null,"SH121G Vacuum cleaner or floor polisher",null,6.7111407727269298E-2]
[null,null,"floor31 Parquet, wood tile floor",null,9.4656335022331312E-3,null,null,"HV243D Has boat with a motor",null,8.8364540480979237E-3,null,null,"SH121H Microwave oven",null,0.27127763917527425]
[null,null,"floor32 Vinyl, asphalt strips floor",null,-4.3895170286959179E-3,null,null,"HV243E Has a computer",null,0.21719359302308935,null,null,"SH121I Electric/gas stove",null,0.39718890939456164]
[null,null,"floor33 Terrazo, ceramic tile floor",null,7.1894503483817804E-2,null,null,"SH121A Electricity connected to the mains",null,0.52908369746917205,null,null,"SH121J Washing machine",null,0.19262924074869889]
[null,null,"floor34 Concrete, cement floor",null,-3.9167124359595691E-2,null,null,"SH121G Vacuum cleaner or floor polisher",null,0.18971240868404513,null,null,"hv246A@0 No cattle",null,6.7425719853662677E-2]
[null,null,"floor35 Rug or mat floor",null,-1.1813140904548122E-2,null,null,"SH121H Microwave oven",null,0.43724951762453934,null,null,"HV246A@1 1-2 ccattle",null,1.343140495435219E-2]
[null,null,"floor96 Other type of flooring",null,-1.0118123936656729E-2,null,null,"SH121I Electric/gas stove",null,0.45671374951055904,null,null,"HV246A@2 5-5 cattle",null,2.9259581693151061E-2]
[null,null,"wall11 No walls",null,-1.5294326879729871E-2,null,null,"SH121J Washing machine",null,0.36877128888539434,null,null,"HV246A@3 6+ cattle",null,2.0475748102258114E-2]
[null,null,"wall12 Cane/palm/trunks walls",null,-4.7109516790275252E-2,null,null,"hv246A@0 No cattle",null,5.5842746721102661E-4,null,null,"HV246C@0 No horses, donkeys, mules",null,3.8771716572209833E-2]
[null,null,"wall21 Bamboo with mud walls",null,-2.1837225984581558E-3,null,null,"HV246A@1 1-2 ccattle",null,7.4251631817169759E-6,null,null,"HV246C@1 1 horse, donkey, mule",null,9.2951425979952707E-3]
[null,null,"wall22 Stone with mud walls",null,-1.039488467102794E-2,null,null,"HV246A@2 5-5 cattle",null,9.7688739057445997E-5,null,null,"HV246C@2 2-3 horses, donkeys, mules",null,2.4318046032623483E-2]
[null,null,"wall23 Uncovered adobe walls",null,-1.0800637639204975E-2,null,null,"HV246A@3 6+ cattle",null,7.2394216944422036E-4,null,null,"HV246C@3 4+ horses, donkeys, mules",null,7.8953948002648232E-3]
[null,null,"wall24 Plywood walls",null,-9.6032345776484659E-3,null,null,"HV246C@0 No horses, donkeys, mules",null,6.8389966898111645E-4,null,null,"HV246D@0 No goats",null,8.9666466504540826E-2]
[null,null,"wall25 Carton walls",null,-1.0178138289463071E-2,null,null,"HV246C@1 1 horse, donkey, mule",null,2.0549614415126757E-5,null,null,"HV246D@1 1-4 goats",null,1.9238596227308995E-2]
[null,null,"wall26 Reused wood walls",null,-8.6450671458058494E-3,null,null,"HV246C@2 2-3 horses, donkeys, mules",null,5.554948280243094E-4,null,null,"HV246D@2 5-9 goats",null,1.7909655552832447E-2]
[null,null,"wall31 Cement walls",null,1.0003858472003139E-2,null,null,"HV246C@3 4+ horses, donkeys, mules",null,4.1711190918113241E-4,null,null,"HV246D@3 10+ more goats",null,4.5832202840195291E-2]
[null,null,"wall32 Stone walls with lime/cement",null,5.0861792823249791E-3,null,null,"HV246D@0 No goats",null,6.0097464609478627E-6,null,null,"HV246E@0 No sheepss",null,3.8839992494529914E-2]
[null,null,"wall33 Brick walls",null,3.87015120394388E-2,null,null,"HV246D@1 1-4 goats",null,6.0183364381252453E-4,null,null,"HV246E@1 1-4 sheepss",null,8.4567339047446535E-3]
[null,null,"wall34 Cement block walls",null,1.3938698304707909E-2,null,null,"HV246D@2 5-9 goats",null,2.6381627318298751E-7,null,null,"HV246E@2 5-9 sheepss",null,1.0879507071684136E-2]
[null,null,"wall36 Wood planks, shingles walls",null,-3.1145345868766583E-3,null,null,"HV246D@3 10+ more goats",null,5.2274187783850064E-4,null,null,"HV246E@3 10+ more sheepss",null,1.8732011567633725E-2]
[null,null,"wall37 Galvanized iron/aluminum walls",null,-4.1777405905008488E-2,null,null,"HV246E@0 No sheepss",null,1.5609590444417738E-3,null,null,"HV246F@0 No chickens",null,8.8795160748570329E-2]
[null,null,"wall96 Other type of walls",null,-1.4211185613480343E-3,null,null,"HV246E@1 1-4 sheepss",null,2.2045834958078631E-4,null,null,"HV246F@1 1-3 chickens",null,1.5625901878404153E-2]
[null,null,"roof11 No roof",null,2.2107257729292408E-3,null,null,"HV246E@2 5-9 sheepss",null,1.7975837168894706E-4,null,null,"HV246F@2 4-9 chickens",null,3.1797833475697194E-2]
[null,null,"roof12 Thatch, palm leaf roof",null,-3.3671614148410155E-2,null,null,"HV246E@3 10+ more sheepss",null,1.282995903042144E-3,null,null,"HV246F@3 10+ chickens",null,2.5878160344752543E-2]
[null,null,"roof13 Sod roof",null,-4.366401227862267E-3,null,null,"HV246F@0 No chickens",null,2.0605474527221794E-3,null,null,"HV246G@0 No camels",null,8.1144641951728283E-2]
[null,null,"roof21 Rustic mat roof",null,-9.6836591613656837E-3,null,null,"HV246F@1 1-3 chickens",null,1.1240305868318089E-3,null,null,"HV246G@1 1 camel",null,6.0483618210648224E-2]
[null,null,"roof22 Palm/bamboo roof",null,-8.4523678184694458E-4,null,null,"HV246F@2 4-9 chickens",null,3.1563300932659312E-3,null,null,"HV246G@2 2-3 camels",null,3.4144392531564129E-2]
[null,null,"roof23 Wood planks roof",null,8.1510980573577547E-4,null,null,"HV246F@3 10+ chickens",null,2.3932389996136091E-5,null,null,"HV246G@3 4+ camels",null,9.5694102978896242E-4]
[null,null,"roof24 Cardboard roof",null,4.1783234919612828E-3,null,null,"HV246G@0 No camels",null,2.4255457919827962E-5]
[null,null,"roof25 Cardboard roof",null,5.5089148390130111E-3,null,null,"HV246G@1 1 camel",null,1.0986686767290977E-4]
[null,null,"roof26 Cardboard roof",null,6.8688279752562526E-3,null,null,"HV246G@2 2-3 camels",null,1.7591823496687784E-5,null,null,"Variance totale expliquée"]
[null,null,"roof31 Metal/ corrugated iron roof",null,-5.3276429242418308E-2,null,null,"HV246G@3 4+ camels",null,4.2252265502699026E-6,null,null,"Composante",null,"Sommes extraites du carré des chargements"]
[null,null,"roof32 Finished wood roof",null,4.1795624682245958E-3,null,null,null,null,null,null,null,null,null,"Total","% de la variance","% cumulé"]
[null,null,"roof33 Calamine, cement fiber roof",null,2.5366002353287946E-2,null,null,null,null,null,null,null,"1",null,7.0587480788863539,6.0331180161421827,6.0331180161421827]
[null,null,"roof34 Tile roof",null,5.6786571472260607E-2,null,null,"Variance totale expliquée"]
[null,null,"roof35 Concrete roof",null,6.3061464406549235E-3,null,null,"Composante",null,"Sommes extraites du carré des chargements"]
[null,null,"roof96 Other type of roof",null,1.3981180101620256E-3,null,null,null,null,"Total","% de la variance","% cumulé","Matrice des coefficients des composantes"]
[null,null,"cookelec Electricity for cooking",null,8.1030505572144002E-2,null,null,"1",null,7.8701105830330409,6.6135383050697829,6.6135383050697829,null,null,"Composante"]
[null,null,"cooklpg LPG for cooking",null,3.18034263856005E-3,null,null,null,null,null,null,null,null,null,"1"]
[null,null,"cookkero Kerosene for cooking",null,-5.5623512359429819E-2,null,null,null,null,null,null,null,"persroom Number of members per sleeping room",null,-3.4627126320421218E-2]
[null,null,"cookcoal Coal, lignite for cooking",null,-1.1826156387015521E-2,null,null,"Matrice des coefficients des composantes",null,null,null,null,"floor11 Earth, sand floor",null,-2.9646015866351086E-2]
[null,null,"cookwood Wood for cooking",null,-6.2037697334165483E-2,null,null,null,null,"Composante",null,null,"floor12 Dung floor",null,-6.8480175315133604E-2]
[null,null,"cookcrop Agricultural crop for cooking",null,-5.3691252869739808E-3,null,null,null,null,"1",null,null,"floor21 Rudimentary wood plank floor",null,1.1240271035558827E-4]
[null,null,"cookdung Dung for cooking",null,-7.7300914613663931E-4,null,null,"persroom Number of members per sleeping room",null,-3.1123508834851616E-2,null,null,"floor31 Parquet, wood tile floor",null,1.9438378812304982E-3]
[null,null,"cookgene Electricity from generator",null,6.4026672435492859E-4,null,null,"floor11 Earth, sand floor",null,-2.813048356616097E-2,null,null,"floor32 Vinyl, asphalt strips floor",null,-1.1146076934188949E-3]
[null,null,"cookelot Electricity from other source",null,-5.9479223004965213E-3,null,null,"floor12 Dung floor",null,-1.6542747801776787E-2,null,null,"floor33 Terrazo, ceramic tile floor",null,5.7805133229997259E-2]
[null,null,"cooksola Solar energy",null,-1.6744751181900395E-3,null,null,"floor21 Rudimentary wood plank floor",null,2.7116356763411042E-3,null,null,"floor34 Concrete, cement floor",null,4.6904103710531534E-3]
[null,null,"cooknone Does not cook",null,-9.4720098369297772E-3,null,null,"floor31 Parquet, wood tile floor",null,7.1145796904009163E-3,null,null,"floor35 Rug or mat floor",null,-1.2816161070626315E-2]
[null,null,"cookoth Other fuel for cooking",null,-2.1903191787464599E-3,null,null,"floor32 Vinyl, asphalt strips floor",null,-1.4472725093186692E-2,null,null,"floor96 Other type of flooring",null,-6.7357382628969384E-3]
[null,null,"cookothe Household cooks in other house",null,-3.6381920651290325E-2,null,null,"floor33 Terrazo, ceramic tile floor",null,6.8282298139107758E-2,null,null,"wall11 No walls",null,-5.1103175305896795E-3]
[null,null,"cookout Household cooks outside house",null,-3.5229384944772978E-2,null,null,"floor34 Concrete, cement floor",null,-3.7494645229110043E-2,null,null,"wall12 Cane/palm/trunks walls",null,-7.346667302670154E-2]
[null,null,"cookelse Household cooks in other place",null,-1.9260266841252785E-3,null,null,"floor35 Rug or mat floor",null,-2.398151964193327E-2,null,null,"wall21 Bamboo with mud walls",null,-2.2767971771598013E-3]
[null,null,"fuel1 Electricity from mains",null,5.6727218270599143E-2,null,null,"floor96 Other type of flooring",null,-1.2689286360740118E-2,null,null,"wall22 Stone with mud walls",null,-1.3677525600663334E-2]
[null,null,"fuel2 LPG",null,1.8728667828700498E-2,null,null,"wall11 No walls",null,-2.2017378172357854E-2,null,null,"wall23 Uncovered adobe walls",null,-1.652212905003702E-2]
[null,null,"fuel3 Paraffin",null,-3.6888531158397807E-3,null,null,"wall12 Cane/palm/trunks walls",null,-2.301969940264607E-2,null,null,"wall24 Plywood walls",null,-5.4146735451374474E-3]
[null,null,"fuel4 Coal",null,-1.0486864010398878E-2,null,null,"wall21 Bamboo with mud walls",null,-5.2622839307211473E-3,null,null,"wall25 Carton walls",null,-8.4308092994254281E-3]
[null,null,"fuel5 Wood",null,-5.8143115777747584E-2,null,null,"wall22 Stone with mud walls",null,-8.9405316354734376E-3,null,null,"wall26 Reused wood walls",null,-5.858546344223366E-3]
[null,null,"fuel6 Straw/shrubs/grass",null,-3.8850365741441022E-3,null,null,"wall23 Uncovered adobe walls",null,-3.6174071428084747E-3,null,null,"wall31 Cement walls",null,1.5338302926678905E-2]
[null,null,"fuel7 Agricultural crop",null,-3.1853143287159718E-3,null,null,"wall24 Plywood walls",null,-6.159062626565466E-3,null,null,"wall32 Stone walls with lime/cement",null,5.4507454562834961E-3]
[null,null,"fuel8 Animal dung",null,-2.7913034136009904E-3,null,null,"wall25 Carton walls",null,-1.5368159054862699E-2,null,null,"wall33 Brick walls",null,3.9789891368624972E-2]
[null,null,"fuel9 Electricity from generator",null,-1.6891915052194113E-3,null,null,"wall26 Reused wood walls",null,-1.4622385199640351E-2,null,null,"wall34 Cement block walls",null,9.061298232157693E-3]
[null,null,"fuel10 Electricity from other source",null,-7.1066101597535051E-4,null,null,"wall31 Cement walls",null,2.1889178990077574E-2,null,null,"wall36 Wood planks, shingles walls",null,-1.1271732970916221E-3]
[null,null,"fuel11 Solar energy",null,1.2810583388888129E-3,null,null,"wall32 Stone walls with lime/cement",null,3.600339813901995E-3,null,null,"wall37 Galvanized iron/aluminum walls",null,-1.5277826786038798E-2]
[null,null,"fuel12 No heating/warming in household",null,-9.5849766907455999E-3,null,null,"wall33 Brick walls",null,3.5481346808395521E-2,null,null,"wall96 Other type of walls",null,3.0602660540693942E-3]
[null,null,"fuel13 Other",null,-4.9568014993675786E-4,null,null,"wall34 Cement block walls",null,1.5441247054428576E-2,null,null,"roof12 Thatch, palm leaf roof",null,-5.8563665853595209E-2]
[null,null,"dwell1 Dwelling/house or brick/concrete block structure on a separate stand/yard/farm",null,6.3764220810100372E-2,null,null,"wall36 Wood planks, shingles walls",null,-7.5375127658188212E-3,null,null,"roof13 Sod roof",null,-6.8936378445333523E-3]
[null,null,"dwell2 Traditional dwelling/hut structure made of traditional materials",null,-5.1639957890084992E-2,null,null,"wall37 Galvanized iron/aluminum walls",null,-6.7056918638675966E-2,null,null,"roof21 Rustic mat roof",null,-8.534207567312338E-3]
[null,null,"dwell3 Flat or apartment in block of flats",null,5.6903783638675267E-3,null,null,"wall96 Other type of walls",null,-3.0205342174543961E-3,null,null,"roof23 Wood planks roof",null,-2.2626348221435437E-3]
[null,null,"dwell4 Cluster house in complex",null,8.1341968455974217E-3,null,null,"roof11 No roof",null,1.6497829379769477E-3,null,null,"roof24 Cardboard roof",null,2.0800482922759323E-3]
[null,null,"dwell5 Town house/semi-detached house in complex",null,8.901225682448017E-3,null,null,"roof12 Thatch, palm leaf roof",null,1.8351952420752405E-3,null,null,"roof25 Cardboard roof",null,6.8129818994747745E-4]
[null,null,"dwell6 Semi-detached house",null,8.0003536838533593E-3,null,null,"roof13 Sod roof",null,-4.8004011558697782E-3,null,null,"roof26 Cardboard roof",null,1.3051405354177824E-3]
[null,null,"dwell7 Dwelling/house/flat/room in backyard",null,-4.3172763400461858E-3,null,null,"roof21 Rustic mat roof",null,-1.261121999927188E-2,null,null,"roof31 Metal/ corrugated iron roof",null,4.6223630400270789E-3]
[null,null,"dwell8 Informal dwelling/shack in backyard",null,-2.2458109784988068E-2,null,null,"roof22 Palm/bamboo roof",null,-1.5002784597865776E-3,null,null,"roof32 Finished wood roof",null,1.7399886124683027E-3]
[null,null,"dwell9 Informal dwelling/shack not in backyard (e.g. in informal/squatter settlement or farm)",null,-4.6804887341920606E-2,null,null,"roof23 Wood planks roof",null,6.6800375258719235E-4,null,null,"roof33 Calamine, cement fiber roof",null,1.3471682921668691E-2]
[null,null,"dwell10 Room/flatlet on property or larger dwelling/servant's quarters/granny flat",null,-8.1964511625229348E-3,null,null,"roof24 Cardboard roof",null,4.3231656506514272E-3,null,null,"roof34 Tile roof",null,3.5510753706683322E-2]
[null,null,"dwell11 Caravan or tent",null,1.12823657907947E-3,null,null,"roof25 Cardboard roof",null,4.4903472939041011E-3,null,null,"roof35 Concrete roof",null,3.5459093549594679E-3]
[null,null,"HV206 Has electricity",null,8.6564107610936705E-2,null,null,"roof26 Cardboard roof",null,5.6563853856532748E-3,null,null,"roof96 Other type of roof",null,1.6401081033620747E-3]
[null,null,"HV207 Has radio",null,5.0185698142189171E-2,null,null,"roof31 Metal/ corrugated iron roof",null,-6.46114716671045E-2,null,null,"cookelec Electricity for cooking",null,9.0742437054033342E-2]
[null,null,"HV208 Has television",null,8.0573249343736109E-2,null,null,"roof32 Finished wood roof",null,2.7207286836470812E-3,null,null,"cooklpg LPG for cooking",null,-8.0763969161540272E-4]
[null,null,"HV209 Has refrigerator",null,8.6429085384269522E-2,null,null,"roof33 Calamine, cement fiber roof",null,2.1168554546041524E-2,null,null,"cookkero Kerosene for cooking",null,-3.8518077944459314E-2]
[null,null,"HV210 Has bicycle",null,2.2335020536002212E-2,null,null,"roof34 Tile roof",null,5.6423380441126859E-2,null,null,"cookcoal Coal, lignite for cooking",null,-4.5872281600111064E-3]
[null,null,"HV211 Has motorcycle/scooter",null,2.2926306725933456E-2,null,null,"roof35 Concrete roof",null,5.7154374266661324E-3,null,null,"cookwood Wood for cooking",null,-7.689182229363091E-2]
[null,null,"HV212 Has car/truck",null,6.6912866990067571E-2,null,null,"roof96 Other type of roof",null,2.4467872900707602E-4,null,null,"cookcrop Agricultural crop for cooking",null,-6.653691848455775E-3]
[null,null,"HV243A Has mobile telephone",null,2.5656027470078027E-2,null,null,"cookelec Electricity for cooking",null,7.3250505960420625E-2,null,null,"cookdung Dung for cooking",null,-3.1825116178412099E-3]
[null,null,"HV243B Has watch",null,6.1516873761618435E-2,null,null,"cooklpg LPG for cooking",null,-2.1387854710428074E-3,null,null,"cookelot Electricity from other source",null,-2.18748547159631E-3]
[null,null,"HV243C Has animal-drawn cart",null,4.2767235255867422E-3,null,null,"cookkero Kerosene for cooking",null,-7.6342901844347513E-2,null,null,"cooksola Solar energy",null,-1.8400931623565808E-4]
[null,null,"HV243D Has boat with a motor",null,1.2933437180187799E-2,null,null,"cookcoal Coal, lignite for cooking",null,-1.7900733866011018E-2,null,null,"cooknone Does not cook",null,-4.8676833994422131E-3]
[null,null,"HV243E Has a computer",null,6.2070677262190323E-2,null,null,"cookwood Wood for cooking",null,-3.3767308341391092E-2,null,null,"cookoth Other fuel for cooking",null,-1.9206617473744646E-3]
[null,null,"SH121A Electricity connected to the mains",null,8.673014316104341E-2,null,null,"cookcrop Agricultural crop for cooking",null,-5.3124576265641153E-3,null,null,"cookothe Household cooks in other house",null,-4.532097148664669E-2]
[null,null,"SH121G Vacuum cleaner or floor polisher",null,5.7155585390640418E-2,null,null,"cookdung Dung for cooking",null,-6.6252187024518896E-4,null,null,"cookout Household cooks outside house",null,-3.0269409932751467E-2]
[null,null,"SH121H Microwave oven",null,8.689072536721576E-2,null,null,"cookgene Electricity from generator",null,-2.1679125895298403E-4,null,null,"cookelse Household cooks in other place",null,1.2491527377394684E-4]
[null,null,"SH121I Electric/gas stove",null,8.6425246735229028E-2,null,null,"cookelot Electricity from other source",null,-1.0213547347096952E-2,null,null,"fuel1 Electricity from mains",null,5.2139523861353676E-2]
[null,null,"SH121J Washing machine",null,7.9612565936797774E-2,null,null,"cooksola Solar energy",null,-2.6344336012130479E-3,null,null,"fuel2 LPG",null,1.2733379475289632E-2]
[null,null,null,null,null,null,null,"cooknone Does not cook",null,-1.0285325363818237E-2,null,null,"fuel3 Paraffin",null,1.2574067356061849E-3]
[null,null,null,null,null,null,null,"cookoth Other fuel for cooking",null,-2.9507205065495614E-3,null,null,"fuel4 Coal",null,3.3843424953915115E-4]
[null,null,"Matrice de covariance des coefficients des composantes",null,null,null,null,"cookothe Household cooks in other house",null,-1.0840341195792772E-2,null,null,"fuel5 Wood",null,-7.7832296338925383E-2]
[null,null,"Composante",null,"1",null,null,"cookout Household cooks outside house",null,-2.8582865372608447E-2,null,null,"fuel6 Straw/shrubs/grass",null,-6.2860819724592535E-3]
[null,null,"1",null,0.99999999999999989,null,null,"cookelse Household cooks in other place",null,-1.6496519261153411E-3,null,null,"fuel7 Agricultural crop",null,-5.3345011963545578E-3]
[null,null,null,null,null,null,null,"fuel1 Electricity from mains",null,4.9040773405704674E-2,null,null,"fuel8 Animal dung",null,-3.0053196154079028E-3]
[null,null,null,null,null,null,null,"fuel2 LPG",null,1.6211517148133413E-2,null,null,"fuel9 Electricity from generator",null,2.5494881720074312E-4]
[null,null,null,null,null,null,null,"fuel3 Paraffin",null,-1.8121467129286428E-2,null,null,"fuel10 Electricity from other source",null,-8.1276700799496205E-4]
[null,null,null,null,null,null,null,"fuel4 Coal",null,-2.0141387214318275E-2,null,null,"fuel11 Solar energy",null,1.5481737461735022E-3]
[null,null,null,null,null,null,null,"fuel5 Wood",null,-3.3817609019416106E-2,null,null,"fuel12 No heating/warming in household",null,3.0414853463905291E-2]
[null,null,null,null,null,null,null,"fuel6 Straw/shrubs/grass",null,-2.897574220753197E-3,null,null,"fuel13 Other",null,-7.7064933784770447E-5]
[null,null,null,null,null,null,null,"fuel8 Animal dung",null,-6.723118222628111E-4,null,null,"dwell1 Dwelling/house or brick/concrete block structure on a separate stand/yard/farm",null,7.4847738299745808E-2]
[null,null,null,null,null,null,null,"fuel9 Electricity from generator",null,-2.3005723373080841E-3,null,null,"dwell2 Traditional dwelling/hut structure made of traditional materials",null,-8.196901931022979E-2]
[null,null,null,null,null,null,null,"fuel10 Electricity from other source",null,-2.8070526984931591E-3,null,null,"dwell3 Flat or apartment in block of flats",null,-5.9128749666487776E-4]
[null,null,null,null,null,null,null,"fuel11 Solar energy",null,1.0993531654467439E-3,null,null,"dwell4 Cluster house in complex",null,-3.3986178013996433E-3]
[null,null,null,null,null,null,null,"fuel12 No heating/warming in household",null,-1.9818385781162011E-2,null,null,"dwell5 Town house/semi-detached house in complex",null,1.6191686716937198E-3]
[null,null,null,null,null,null,null,"fuel13 Other",null,-6.5285296747074847E-4,null,null,"dwell6 Semi-detached house",null,4.2169284812202373E-3]
[null,null,null,null,null,null,null,"dwell1 Dwelling/house or brick/concrete block structure on a separate stand/yard/farm",null,7.1728547021617975E-2,null,null,"dwell7 Dwelling/house/flat/room in backyard",null,2.2657407067376307E-3]
[null,null,null,null,null,null,null,"dwell2 Traditional dwelling/hut structure made of traditional materials",null,-1.9649990627365155E-2,null,null,"dwell8 Informal dwelling/shack in backyard",null,-7.7626952056932211E-3]
[null,null,null,null,null,null,null,"dwell3 Flat or apartment in block of flats",null,4.5529907013047519E-3,null,null,"dwell9 Informal dwelling/shack not in backyard (e.g. in informal/squatter settlement or farm)",null,-2.3022744397378885E-2]
[null,null,null,null,null,null,null,"dwell4 Cluster house in complex",null,8.0622485627948083E-3,null,null,"dwell10 Room/flatlet on property or larger dwelling/servant's quarters/granny flat",null,-1.2461933753365637E-3]
[null,null,null,null,null,null,null,"dwell5 Town house/semi-detached house in complex",null,7.2301074034177735E-3,null,null,"dwell11 Caravan or tent",null,2.2889859277753265E-3]
[null,null,null,null,null,null,null,"dwell6 Semi-detached house",null,5.9342314878528335E-3,null,null,"HV206 Has electricity",null,9.6740835845100362E-2]
[null,null,null,null,null,null,null,"dwell7 Dwelling/house/flat/room in backyard",null,-9.1714293718268766E-3,null,null,"HV207 Has radio",null,4.5756105832764252E-2]
[null,null,null,null,null,null,null,"dwell8 Informal dwelling/shack in backyard",null,-3.7817450605298716E-2,null,null,"HV208 Has television",null,7.7916971354901096E-2]
[null,null,null,null,null,null,null,"dwell9 Informal dwelling/shack not in backyard (e.g. in informal/squatter settlement or farm)",null,-7.1605647414855533E-2,null,null,"HV209 Has refrigerator",null,8.4583227576585929E-2]
[null,null,null,null,null,null,null,"dwell10 Room/flatlet on property or larger dwelling/servant's quarters/granny flat",null,-8.1470117703818946E-3,null,null,"HV210 Has bicycle",null,9.3644378401795837E-3]
[null,null,null,null,null,null,null,"dwell11 Caravan or tent",null,-5.21453692203334E-4,null,null,"HV211 Has motorcycle/scooter",null,1.4568465988370305E-2]
[null,null,null,null,null,null,null,"HV206 Has electricity",null,9.1904463476963114E-2,null,null,"HV212 Has car/truck",null,4.7691637130835275E-2]
[null,null,null,null,null,null,null,"HV207 Has radio",null,4.9032329432769195E-2,null,null,"HV243A Has mobile telephone",null,2.4245889446557169E-2]
[null,null,null,null,null,null,null,"HV208 Has television",null,7.9501147230591179E-2,null,null,"HV243B Has watch",null,4.8413369366017305E-2]
[null,null,null,null,null,null,null,"HV209 Has refrigerator",null,8.8816707474888984E-2,null,null,"HV243C Has animal-drawn cart",null,-5.4461184139164521E-3]
[null,null,null,null,null,null,null,"HV210 Has bicycle",null,2.4864672692119165E-2,null,null,"HV243D Has boat with a motor",null,1.0928216269933094E-2]
[null,null,null,null,null,null,null,"HV211 Has motorcycle/scooter",null,2.1848964982352691E-2,null,null,"HV243E Has a computer",null,4.5944214415363976E-2]
[null,null,null,null,null,null,null,"HV212 Has car/truck",null,6.4931135566369452E-2,null,null,"SH121A Electricity connected to the mains",null,9.6733622834126842E-2]
[null,null,null,null,null,null,null,"HV243A Has mobile telephone",null,2.8563048191399189E-2,null,null,"SH121G Vacuum cleaner or floor polisher",null,3.6700374149939874E-2]
[null,null,null,null,null,null,null,"HV243B Has watch",null,5.7634391464006424E-2,null,null,"SH121H Microwave oven",null,7.3786908721020963E-2]
[null,null,null,null,null,null,null,"HV243C Has animal-drawn cart",null,8.5695508235657941E-3,null,null,"SH121I Electric/gas stove",null,8.9283431624949339E-2]
[null,null,null,null,null,null,null,"HV243D Has boat with a motor",null,1.1944230532298846E-2,null,null,"SH121J Washing machine",null,6.2177524010541635E-2]
[null,null,null,null,null,null,null,"HV243E Has a computer",null,5.9216491204185893E-2,null,null,"hv246A@0 No cattle",null,3.6786215724892178E-2]
[null,null,null,null,null,null,null,"SH121A Electricity connected to the mains",null,9.2423275359779525E-2,null,null,"HV246A@1 1-2 ccattle",null,-1.6418483432141095E-2]
[null,null,null,null,null,null,null,"SH121G Vacuum cleaner or floor polisher",null,5.5343552668877388E-2,null,null,"HV246A@2 5-5 cattle",null,-2.4232954894492266E-2]
[null,null,null,null,null,null,null,"SH121H Microwave oven",null,8.4020223960274448E-2,null,null,"HV246A@3 6+ cattle",null,-2.0271795036505256E-2]
[null,null,null,null,null,null,null,"SH121I Electric/gas stove",null,8.5869949701106299E-2,null,null,"HV246C@0 No horses, donkeys, mules",null,2.789522264743868E-2]
[null,null,null,null,null,null,null,"SH121J Washing machine",null,7.7160976635014866E-2,null,null,"HV246C@1 1 horse, donkey, mule",null,-1.3658416306536993E-2]
[null,null,null,null,null,null,null,"hv246A@0 No cattle",null,-3.0026350590035985E-3,null,null,"HV246C@2 2-3 horses, donkeys, mules",null,-2.2092082458904129E-2]
[null,null,null,null,null,null,null,"HV246A@1 1-2 ccattle",null,-3.462359559797529E-4,null,null,"HV246C@3 4+ horses, donkeys, mules",null,-1.2588072719281359E-2]
[null,null,null,null,null,null,null,"HV246A@2 5-5 cattle",null,1.2558605470379758E-3,null,null,"HV246D@0 No goats",null,4.2421629376288801E-2]
[null,null,null,null,null,null,null,"HV246A@3 6+ cattle",null,3.4187795915922529E-3,null,null,"HV246D@1 1-4 goats",null,-1.9649839500243883E-2]
[null,null,null,null,null,null,null,"HV246C@0 No horses, donkeys, mules",null,-3.3228853888133663E-3,null,null,"HV246D@2 5-9 goats",null,-1.8959022157653611E-2]
[null,null,null,null,null,null,null,"HV246C@1 1 horse, donkey, mule",null,-5.7599803785954762E-4,null,null,"HV246D@3 10+ more goats",null,-3.0328971507759293E-2]
[null,null,null,null,null,null,null,"HV246C@2 2-3 horses, donkeys, mules",null,2.9947403572299215E-3,null,null,"HV246E@0 No sheepss",null,2.7919773202400393E-2]
[null,null,null,null,null,null,null,"HV246C@3 4+ horses, donkeys, mules",null,2.5950483878799564E-3,null,null,"HV246E@1 1-4 sheepss",null,-1.302787701804003E-2]
[null,null,null,null,null,null,null,"HV246D@0 No goats",null,-3.1149224622048955E-4,null,null,"HV246E@2 5-9 sheepss",null,-1.4776681987166635E-2]
[null,null,null,null,null,null,null,"HV246D@1 1-4 goats",null,-3.117147810528716E-3,null,null,"HV246E@3 10+ more sheepss",null,-1.9389406962418036E-2]
[null,null,null,null,null,null,null,"HV246D@2 5-9 goats",null,6.526343914663834E-5,null,null,"HV246F@0 No chickens",null,4.2215016790790996E-2]
[null,null,null,null,null,null,null,"HV246D@3 10+ more goats",null,2.9051115441539404E-3,null,null,"HV246F@1 1-3 chickens",null,-1.7709033679139761E-2]
[null,null,null,null,null,null,null,"HV246E@0 No sheepss",null,-5.0201294898984368E-3,null,null,"HV246F@2 4-9 chickens",null,-2.5262194977417742E-2]
[null,null,null,null,null,null,null,"HV246E@1 1-4 sheepss",null,1.8866113429370571E-3,null,null,"HV246F@3 10+ chickens",null,-2.2789721460421783E-2]
[null,null,null,null,null,null,null,"HV246E@2 5-9 sheepss",null,1.7035846884256457E-3,null,null,"HV246G@0 No camels",null,4.0355454380665852E-2]
[null,null,null,null,null,null,null,"HV246E@3 10+ more sheepss",null,4.5512616130926279E-3,null,null,"HV246G@1 1 camel",null,-3.484104713748138E-2]
[null,null,null,null,null,null,null,"HV246F@0 No chickens",null,5.7678037563005588E-3,null,null,"HV246G@2 2-3 camels",null,-2.6177731728751014E-2]
[null,null,null,null,null,null,null,"HV246F@1 1-3 chickens",null,-4.2599865702025244E-3,null,null,"HV246G@3 4+ camels",null,-4.3824291670446405E-3]
[null,null,null,null,null,null,null,"HV246F@2 4-9 chickens",null,-7.1385560417561549E-3]
[null,null,null,null,null,null,null,"HV246F@3 10+ chickens",null,6.2160171070138105E-4]
[null,null,null,null,null,null,null,"HV246G@0 No camels",null,6.2578320667239587E-4,null,null,"Matrice de covariance des coefficients des composantes"]
[null,null,null,null,null,null,null,"HV246G@1 1 camel",null,-1.3318414798499836E-3,null,null,"Composante",null,"1"]
[null,null,null,null,null,null,null,"HV246G@2 2-3 camels",null,-5.3293543165232175E-4,null,null,"1",null,1]
[null,null,null,null,null,null,null,"HV246G@3 4+ camels",null,2.6118255461840312E-4]
[]
[]
[null,null,null,null,null,null,null,"Matrice de covariance des coefficients des composantes"]
[null,null,null,null,null,null,null,"Composante",null,"1"]
[null,null,null,null,null,null,null,"1",null,1.0000000000000002]
[]
[]
[]
[]
[]
[]
[]
[]
[]
[]
[]
[]
[]
[]
[]
[]
[]
[]
[]
[]
[]
[]
[]
[]
[]
[]
[]
[]
[]
[]
[]
[]
[]
[]
[]
[]
[]
[]
[]
[]
[]
[]
[]
[]
[]
[]
[]
[]
[]
[]
[]
[]
[]
[]
[]
[]
[]
[]
[]
[]
[]
[]
[]
[]
[]
[]
[]
[]
[]
[]
[]
[]
[]
[]
[]
[]
[]
[]
[]
[]
[]
[]
[]
[]
[]
[]
[]
[]
[]
[]
[]
[]
[]
[]
[]
[]
[]
[]
[]
[]
[]
[]
[]
[]
[]
[]
[]
[]
[]
[]
[]
[]
[]
[]
[]
[]
[]
[]
[]
[]
[]
[]
[]
[]
[]
[]
[]
[]
[]
[]
[]
[]
[]
[]
[]
[]
[]
[]
[]
[]
[]
[]
[]
[]
[]
[]
[]
[]
[]
[]
[]
[]
[]
[]
[]
[]
[]
[]
[]
[]
[]
[]
[]
[]
[]
[]
[]
[]
[]
[]
[]
[]
[]
[]
[]
[]
[]
[]
[]
[]
[]
[]
[]
[]
[]
[]
[]
[]
[]
[]
[]
[]
[]
[]
[]
[]
[]
[]
[]
[]
[]
[]
[]
[]
[]
[]
[]
[]
[]
[]
[]
[]
[]
[]
[]
[]
[]
[]
[]
[]
[]
[]
[]
[]
[]
[]
[]
[]
[]
[]
[]
[]
[]
[]
[]
[]
[]
[]
[]
[]
[]
[]
[]
[]
["DHS16"]
["South Africa",null,"Nombre"]
["W_text_t","",11083]
["W_text_i","",11083]
["S_text_s","",11083]
["S_text_i","",11083]
["Urban/Rural","1 Urban",6556]
[null,"2 Rural",4527]
[null,"9 Missing",0]
["2016"]
[]
["Sub-national region names","Weighted population"]
[{"$f":"R15","v":"2 Eastern Cape"},{"$f":"BR122+BR123","v":4872.5035370000069}]
[{"$f":"S15","v":"4 Free State"},{"$f":"BS122+BS123","v":2002.7562650000002}]
[{"$f":"T15","v":"7 Gauteng"},{"$f":"BT122+BT123","v":9428.1718529999871}]
[{"$f":"U15","v":"5 Kwazulu-Natal"},{"$f":"BU122+BU123","v":7062.5202779999945}]
[{"$f":"V15","v":"9 Limpopo"},{"$f":"BV122+BV123","v":4017.1297170000012}]
[{"$f":"W15","v":"8 Mpumalanga"},{"$f":"BW122+BW123","v":3085.7377999999985}]
[{"$f":"X15","v":"6 North West"},{"$f":"BX122+XR123","v":1553.2953540000008}]
[{"$f":"Y15","v":"3 Northern Cape"},{"$f":"BY122+BY123","v":799.83790899999929}]
[{"$f":"Z15","v":"1 Western Cape"},{"$f":"BZ122+BZ123","v":4117.9318910000011}]
[{"$f":"AA15","v":0},{"$f":"CA122+CA123","v":0}]
[{"$f":"AB15","v":0},{"$f":"CB122+CB123","v":0}]
[{"$f":"AC15","v":0},{"$f":"CC122+CC123","v":0}]
[{"$f":"AD15","v":0},{"$f":"CD122+CD123","v":0}]
[{"$f":"AE15","v":0},{"$f":"CE122+CE123","v":0}]
[{"$f":"AF15","v":0},{"$f":"CF122+CF123","v":0}]
[{"$f":"AG15","v":0},{"$f":"CG122+CG123","v":0}]
[{"$f":"AH15","v":0},{"$f":"CH122+CH123","v":0}]
[{"$f":"AI15","v":0},{"$f":"CI122+CI123","v":0}]
[{"$f":"AJ15","v":0},{"$f":"CJ122+CJ123","v":0}]
[{"$f":"AK15","v":0},{"$f":"CK122+CK123","v":0}]
[{"$f":"AL15","v":0},{"$f":"CL122+CL123","v":0}]
[{"$f":"AM15","v":0},{"$f":"CM122+CM123","v":0}]
[{"$f":"AN15","v":0},{"$f":"CN122+CN123","v":0}]
[{"$f":"AO15","v":0},{"$f":"CO122+CO123","v":0}]
[{"$f":"AP15","v":0},{"$f":"CP122+CP123","v":0}]
[{"$f":"AQ15","v":0},{"$f":"CQ122+CQ123","v":0}]
[{"$f":"AR15","v":0},{"$f":"CR122+CR123","v":0}]
[{"$f":"AS15","v":0},{"$f":"CS122+CS123","v":0}]
[{"$f":"AT15","v":0},{"$f":"CT122+CT123","v":0}]
[{"$f":"AU15","v":0},{"$f":"CU122+CU123","v":0}]
[{"$f":"AV15","v":0},{"$f":"CV122+CV123","v":0}]
[{"$f":"AW15","v":0},{"$f":"CW122+CW123","v":0}]
[{"$f":"AX15","v":0},{"$f":"CX122+CX123","v":0}]
[{"$f":"AY15","v":0},{"$f":"CY122+CY123","v":0}]
[]
[{"$f":"34-COUNTIF(A1037:A1071,\"0\")","v":9},"Sub-regions"]

{"sheet":"data_summary","index":6,"n_rows":126,"n_cols":64,"rows_kept":126,"cut":false,"hidden":false,"merged":[]}
["iso3","year","data_source","row","var1","var2","varname","total_q1","total_q2","total_q3","total_q4","total_q5","urban_q1","urban_q2","urban_q3","urban_q4","urban_q5","rural_q1","rural_q2","rural_q3","rural_q4","rural_q5","region_1_name","region_2_name","region_3_name","region_4_name","region_5_name","region_6_name","region_7_name","region_8_name","region_9_name","region_1","region_2","region_3","region_4","region_5","region_6","region_7","region_8","region_9","n_total_q1","n_total_q2","n_total_q3","n_total_q4","n_total_q5","n_urban_q1","n_urban_q2","n_urban_q3","n_urban_q4","n_urban_q5","n_rural_q1","n_rural_q2","n_rural_q3","n_rural_q4","n_rural_q5","n_region_1","n_region_2","n_region_3","n_region_4","n_region_5","n_region_6","n_region_7","n_region_8","n_region_9"]
["ZAF",2003,"ZAF_2003_WHS",16,"Water","Improved","w_imp",77.944360289429625,87.732691011365787,88.394823248131146,94.576822495471291,96.168209281710261,93.606277307482117,89.602387920847164,88.159255564250302,95.417664976781239,97.166585546946195,63.180487962996011,80.77909336707323,85.722563202374928,87.108186746156505,96.713893273045898,"","","","","","","","",""]
["ZAF",2003,"ZAF_2003_WHS",17,"Water","Not Improved","",22.055639710570379,12.26730898863422,11.60517675186885,5.423177504528705,3.8317907182897408,6.3937226925178923,10.397612079152839,11.8407444357497,4.582335023218767,2.833414453053801,36.819512037003989,19.22090663292677,14.27743679762507,12.8918132538435,3.2861067269541122,"","","","","","","","",""]
["ZAF",2003,"ZAF_2003_WHS",18,"Water ladder","Basic","w_bas",64.576065648432035,82.850706013339362,82.837563056371252,85.893839471132765,96.168209281710261,86.20477693974793,83.752994683984411,88.159255564250302,95.417664976781239,97.166585546946195,50.258336689663281,68.317629028677658,78.801430196584008,79.664593220089628,82.259951104973041,"","","","","","","","",""]
["ZAF",2003,"ZAF_2003_WHS",19,"Water ladder","Limited","w_lim",13.368294640997579,4.8819849980264083,5.5572601917598874,8.6829830243385224,0,7.4015003677341733,5.8493932368627366,0,0,0,12.92215127333273,12.461464338395579,6.9211330057909164,7.4435935260668851,14.453942168072849,"","","","","","","","",""]
["ZAF",2003,"ZAF_2003_WHS",20,"Water ladder","Unimproved","w_unimp",10.82971757775476,10.94889077348865,9.775147018838096,5.4231775045287129,3.8317907182897391,6.3937226925178967,10.39761207915285,11.8407444357497,4.5823350232187607,2.833414453053805,14.810363075433949,15.54604558720356,11.885403931410449,7.8877522466081276,3.2861067269541109,"","","","","","","","",""]
["ZAF",2003,"ZAF_2003_WHS",21,"Water ladder","Surface water","w_sur",11.22592213281562,1.318418215145585,1.8300297330307651,0,0,0,0,0,0,0,22.009148961570041,3.674861045723206,2.392032866214624,5.00406100723536,0,"","","","","","","","",""]
["ZAF",2003,"ZAF_2003_WHS",22,"Improved water point at more than 30 minutes","Yes","",17.151073652227421,5.5646133063374821,6.2868615916117907,9.1808783539479748,0,7.9070555742980693,6.5281666846088591,0,0,0,20.452756365068069,15.426595940819331,8.0738754736619534,8.5452284155086264,14.94505254510435,"","","","","","","","",""]
["ZAF",2003,"ZAF_2003_WHS",23,"Improved water point at more than 30 minutes","No","",82.848926347772576,94.435386693662508,93.713138408388204,90.819121646052025,100,92.09294442570193,93.471833315391137,100,100,100,79.547243634931931,84.573404059180675,91.926124526338043,91.454771584491382,85.054947454895654,"","","","","","","","",""]
["ZAF",2003,"ZAF_2003_WHS",29,"Piped water","Yes","w_pip",63.216460712011568,81.42674360093622,85.640570550108009,93.667711898514895,95.971865980856435,91.182920527012527,89.602387920847164,87.586397032224937,95.417664976781239,97.166585546946195,44.979861697312238,63.669892023535688,73.699738246117334,76.977548539987481,93.420540759150825,"","","","","","","","",""]
["ZAF",2003,"ZAF_2003_WHS",30,"Piped water","No","",36.783539287988432,18.57325639906378,14.359429449891991,6.3322881014851067,4.0281340191435699,8.817079472987464,10.397612079152839,12.413602967775059,4.582335023218767,2.833414453053801,55.020138302687762,36.330107976464312,26.300261753882658,23.022451460012519,6.579459240849177,"","","","","","","","",""]
["ZAF",2003,"ZAF_2003_WHS",31,"Piped water on premises","Yes","w_pop",25.97202451028728,58.689276063038193,65.400229389207468,89.383765763758916,95.558351776001487,65.142456528639997,66.809363503144738,79.682335586707381,95.243245839760988,97.166585546946195,10.728353123228599,30.496928970005719,36.232539896018231,61.499974073102813,83.082732506442767,"","","","","","","","",""]
["ZAF",2003,"ZAF_2003_WHS",32,"Piped water on premises","No","",74.027975489712716,41.310723936961807,34.599770610792532,10.61623423624108,4.4416482239985102,34.85754347136001,33.190636496855262,20.317664413292629,4.7567541602390078,2.833414453053801,89.271646876771399,69.503071029994274,63.767460103981769,38.500025926897187,16.91726749355723,"","","","","","","","",""]
["ZAF",2003,"ZAF_2003_WHS",41,"Water point at more than 30 minutes","Yes","",26.08747647853173,12.011756680015729,7.5770560321581364,9.6152860090156942,0.53509593383603493,8.1169638329644389,6.5281666846088591,0,0,0,37.98070940384612,16.443064424107089,17.30782521366848,13.814903092620479,15.84580747341767,"","","","","","","","",""]
["ZAF",2003,"ZAF_2003_WHS",42,"Water point at more than 30 minutes","No","w_30min",73.912523521468273,87.988243319984278,92.42294396784186,90.384713990984295,99.464904066163967,91.883036167035556,93.471833315391137,100,100,100,62.019290596153873,83.556935575892908,82.69217478633152,86.185096907379517,84.154192526582321,"","","","","","","","",""]
["ZAF",2003,"ZAF_2003_WHS",58,"main source of drinking water","Piped water through house connection or yard","",27.624010461221729,64.381906502704766,73.142574655283269,94.359584903150918,99.316636788943697,69.466967324241381,74.562034621401736,90.384537705896378,99.817204563680434,100,10.889656350079431,35.05752771110032,39.191650612537153,66.375871928197867,85.446559328790983,"","","","","","","","",""]
["ZAF",2003,"ZAF_2003_WHS",59,"main source of drinking water","Public standpipe","",39.613419233114563,24.942913038506049,22.63647510468634,4.5224250239290011,0.42977761051086882,27.769171721175741,25.437965378598271,8.9656626464558862,0.18279543631955761,0,34.766487787952613,38.13374365176994,40.527143594729949,16.704681848352049,10.631934212397081,"","","","","","","","",""]
["ZAF",2003,"ZAF_2003_WHS",60,"main source of drinking water","Protected tube well or bore hole","",7.5094926490655096,3.392629617584884,2.2339449906771272,0.58834344878431621,0.2040654315862668,0.74303959937903163,0,0.43319976509848518,0,0,6.1866374421707082,12.475804625224299,6.9126388487343302,7.5119828831866702,2.038700362789891,"","","","","","","","",""]
["ZAF",2003,"ZAF_2003_WHS",61,"main source of drinking water","Protected dug well or protected spring","",4.7161963635565769,0.77541438068753932,0.56572004808893295,0.1251761108109205,0,0,0,0.21659988254924259,0,0,8.5702069638865623,3.2022043572953791,1.759539267915099,1.432062281534227,0.71731180277983275,"","","","","","","","",""]
["ZAF",2003,"ZAF_2003_WHS",62,"main source of drinking water","Unprotected dug well or spring","",7.5171371742419186,3.0513615862274528,0.36528697096961132,0.15827106995720891,0.049520168959167797,0.17962856215158271,0,0,0,0,15.262015945200011,3.763441962317625,5.4329173117273619,3.4936477508590098,0.53445318697431254,"","","","","","","","",""]
["ZAF",2003,"ZAF_2003_WHS",63,"main source of drinking water","Rainwater (into tank or cistern )","",0.83674969710004243,2.2861777544035982,0.28064730059581527,0.070342696546780506,0,1.841192793052258,0,0,0,0,1.1898845391965309,0,2.6024336370524699,1.989779674364232,0.1802974549396682,"","","","","","","","",""]
["ZAF",2003,"ZAF_2003_WHS",64,"main source of drinking water","Water taken directly from pond-water or stream","",9.5807454657655242,0.70621920489542578,0.77535092969891317,0,0,0,0,0,0,0,20.60756309972373,3.3775260027200988,1.843559681600522,2.4919736335059488,0,"","","","","","","","",""]
["ZAF",2003,"ZAF_2003_WHS",65,"main source of drinking water","Tanker-truck, vendor","",2.6022489559341389,0.46337791499028458,0,0.17585674682085689,0,0,0,0,0,0,2.5275478717904041,3.9897516895723371,1.730117045703127,0,0.45074365132823779,"","","","","","","","",""]
["ZAF",2003,"ZAF_2003_WHS",122,"Sanitation","Improved","s_imp",50.554764249773811,82.4211993555557,92.884783624466166,95.892816338950908,98.945403204504004,90.968883205375931,97.527783473479175,98.104658264332713,99.774078393744162,98.914158438578383,42.220539908813237,41.006043302060078,66.637681525682567,76.524412907954769,88.078651243298836,"","","","","","","","","",null,null,null,null,null,null,null,null,null,1350325.135925293,1955158.954223633,2098003.1979370122,2242191.406414032,2293624.80225563,1303654.1948852539,1312267.5467529299,1304096.37197876,1410284.4315795901,1432484.5714569089,433217.27490234381,436912.07751464838,670487.20666503906,766266.37683105469,869633.44418907166]
["ZAF",2003,"ZAF_2003_WHS",123,"Sanitation","Not Improved","",49.445235750226189,17.5788006444443,7.1152163755338336,4.1071836610490919,1.0545967954959961,9.0311167946240687,2.4722165265208251,1.895341735667287,0.22592160625583799,1.085841561421617,57.779460091186763,58.993956697939922,33.362318474317433,23.475587092045231,11.92134875670116,"","","","","","","","","",null,null,null,null,null,null,null,null,null,1006635.4966430661,412543.69641113281,254785.01556396479,120624.10504150391,66661.501342773438,166121.72064208979,148234.5803222656,163132.15460205081,60465.330627441414,27341.806396484379,462160.82836914063,458195.40161132813,223845.63146972659,123304.4840698242,28447.87689208984]
["ZAF",2003,"ZAF_2003_WHS",124,"Sanitation ladder","Basic","s_bas",31.17861797871014,53.999992980497773,44.748285502344991,80.33563694039249,91.627181169674756,50.373338959666789,40.662163305876653,73.176670628767411,87.898240474113095,93.407665950270513,27.143681282214519,28.020967063150628,45.456818129914012,56.748725532165217,68.230658176477547,"","","","","","","","","",null,null,null,null,null,null,null,null,null,812346.14923095703,1250235.110229492,1002525.908935547,1831299.957244873,2069435.369363785,691914.42181396484,546035.12365722656,948978.53042602539,1221878.2214355471,1311397.4423980711,281069.42456054688,297312.67956542969,456429.87170410162,560680.05004882813,650146.72939491272]
["ZAF",2003,"ZAF_2003_WHS",125,"Sanitation ladder","Limited","s_lim",19.376146271063671,28.421206375057931,48.136498122121182,15.557179398558411,7.3182220348292484,40.595544245709142,56.865620167602543,24.927987635565291,11.875837919631049,5.506492488307873,15.07685862659873,12.98507623890945,21.180863395768561,19.775687375789548,19.847993066821289,"","","","","","","","","",null,null,null,null,null,null,null,null,null,510852.3056640625,674509.4306640625,1080294.2343139651,357203.9921875,165783.35693359381,572849.6162109375,761225.01416015625,329940.91925048828,165086.66882324219,77676.355224609375,143257.0319824219,134719.33837890631,214057.3349609375,200706.26721191409,189124.77355957031]
["ZAF",2003,"ZAF_2003_WHS",126,"Sanitation ladder","Unimproved","s_unimp",28.232423276714151,14.280592110865481,6.1293577416937453,4.107183661049099,1.0545967954959949,8.1281093011732892,2.1761618028984349,1.471953000780589,0.225921606255854,1.0858415614216139,26.836395122018171,36.807785004236102,24.486298486779809,21.982039687118331,10.86177879853178,"","","","","","","","","",null,null,null,null,null,null,null,null,null,521791.32464599609,340570.71252441412,233550.78955078131,120624.10504150391,66661.501342773438,153552.09222412109,144305.9934082031,157528.725402832,60465.330627441414,27341.806396484379,191426.1203613281,269340.42956542969,149289.79724121091,110896.0031738281,19052.13470458984]
["ZAF",2003,"ZAF_2003_WHS",127,"Sanitation ladder","Open defecation","s_od",21.212812473512031,3.2982085335788209,0.98585863384008166,0,0,0.9030074934507859,0.29605472362238272,0.42338873488670498,0,0,30.943064969168582,22.18617169370382,8.8760199875376173,1.4935474049268991,1.0595699581693869,"","","","","","","","","",null,null,null,null,null,null,null,null,null,484844.17199707031,71972.98388671875,21234.22601318359,0,0,12569.62841796875,3928.5869140625,5603.42919921875,0,0,270734.7080078125,188854.97204589841,74555.834228515625,12408.48089599609,9395.7421875]
["ZAF",2003,"ZAF_2003_WHS",128,"Shared among Improved Sanitation","Yes","s_shared",38.327043076163413,34.482883769322576,51.823879266099581,16.223508697010921,7.3962223588130476,44.625747635110123,58.307097877463868,25.409586126276949,11.902728755624031,5.5669406435148288,35.709772208411621,31.66625012625175,31.785114534042322,25.84232485334606,22.534397140114422,"","","","","","","","",""]
["ZAF",2003,"ZAF_2003_WHS",129,"Shared among Improved Sanitation","No","",61.672956923836587,65.517116230677416,48.176120733900419,83.776491302989072,92.603777641186952,55.374252364889877,41.692902122536132,74.590413873723051,88.09727124437596,94.433059356485174,64.290227791588379,68.333749873748246,68.214885465957693,74.157675146653943,77.465602859885578,"","","","","","","","",""]
["ZAF",2003,"ZAF_2003_WHS",135,"Sanitation type","Sewer connection","s_sew",16.456042586164031,54.820277193210252,76.087036674150653,84.693422287059022,94.692171523583127,72.988737703766304,85.163705117110467,87.471538042269643,95.144301689429852,95.970297329253427,2.801006609596675,9.7104927292708449,26.351115268729071,39.981838290079189,67.755937915058141,"","","","","","","","",""]
["ZAF",2003,"ZAF_2003_WHS",136,"Sanitation type","Septic tank connection","s_sep",0.68832553524535378,1.338435625468176,0.40870270959828192,0.30497632155767468,0.1956680727312817,2.1501494015445979,0.48996697058389949,0.1676583509507075,0.17441913702024101,0.20851133734779381,0,0,1.5304504883896459,0.29497799955146131,0.6920511384596828,"","","","","","","","",""]
["ZAF",2003,"ZAF_2003_WHS",137,"Sanitation type","Improved latrines","s_lat",40.146581810743513,26.41749047692829,12.675193465117999,9.8965009526614693,2.287863146139173,13.55859263380383,4.1967651301465621,1.242416004119723,0.57008825710833289,1.948242138119181,45.582717910745927,39.100637520838241,47.089091483133977,45.862063760357472,28.38438277915289,"","","","","","","","",""]
["ZAF",2003,"ZAF_2003_WHS",138,"Sanitation type","Unimproved facilities","",22.138313106969662,14.38401534217607,9.9265538738505885,5.1051004387218253,2.824297257546418,10.447313131337291,9.8805739980119451,10.73648191464302,4.1111909164415668,1.872949195279594,21.3793613739163,30.09028924978103,16.692867674698391,12.466236029979941,2.121426451855585,"","","","","","","","",""]
["ZAF",2003,"ZAF_2003_WHS",139,"Sanitation type","Open defecation","",20.57073696087744,3.0397813622172221,0.90251327728248076,0,0,0.85520712954796718,0.26898878414712729,0.3819056880169055,0,0,30.236914105741089,21.098580500109879,8.3364750850489209,1.3948839200319441,1.046201715473702,"","","","","","","","",""]
["ZAF",2003,"ZAF_2003_WHS",148,"Shared among improved sanitation facilities","Yes","",25.895353543992091,29.61441870756035,46.184769891881281,15.117726731337401,7.0238664131909196,40.449207149962561,52.285068985621443,22.487357168509639,11.224660582335259,5.3209310643385432,21.55356059696183,19.230292453686062,25.87581356285575,23.00461197906796,21.058758168123479,"","","","","","","","",""]
["ZAF",2003,"ZAF_2003_WHS",149,"Shared among improved sanitation facilities","No","",41.668829512167257,56.267083853738121,42.933934739890447,78.066349621534059,87.941726458980597,50.191755284330441,37.386807833735773,66.012144778335042,83.078593846037847,90.259952675406851,38.804036956922253,41.497745684760531,55.532776408221373,66.014515013638857,72.392857320785723,"","","","","","","","",""]
["ZAF",2003,"ZAF_2003_WHS",150,"Shared among improved sanitation facilities","DK/missing","",32.435816943840649,14.118497438701519,10.881295368228271,6.8159236471285416,5.0344071278284872,9.3590375657069913,10.3281231806428,11.50049805315532,5.6967455716268978,4.4191162602546008,39.642402446115923,39.271961861553407,18.591410028922891,10.98087300729318,6.5483845110908057,"","","","","","","","",""]
["ZAF",2003,"ZAF_2003_WHS",151,"Shared among all sanitation facilities","Yes","",62.293178099974121,66.353110621357828,49.189637161126782,84.979240802443229,92.571430991057809,53.950361600567597,42.348877612730931,74.874173801001987,88.260513995406725,94.433059356485174,64.238738592926751,73.279027992530928,71.798319946223458,77.899070830610484,79.213004889176062,"","","","","","","","",""]
["ZAF",2003,"ZAF_2003_WHS",152,"Shared among all sanitation facilities","No","",37.706821900025894,33.646889378642172,50.810362838873218,15.020759197556769,7.4285690089421914,46.049638399432411,57.651122387269069,25.125826198998009,11.739486004593269,5.5669406435148288,35.761261407073249,26.720972007469079,28.201680053776549,22.10092916938952,20.786995110823941,"","","","","","","","",""]
["ZAF",2003,"ZAF_2003_WHS",153,"What type of toilet facilities","Flush to piped sewage system","",16.96968592327649,59.480825923585577,83.113527431287181,88.798555271069262,97.240826235203301,77.068320418297148,93.73296831333144,96.972799809861584,99.223572175685476,97.475521438146401,2.8664211300373461,10.211049929209389,28.05658547923008,42.809849597368043,68.621715335153553,"","","","","","","","","",null,null,null,null,null,null,null,null,null,387862.44543457031,1297981.1561889651,1790166.830871582,2001149.3189811709,2235006.3550510411,1072770.887817383,1243817.7247314451,1283407.358795166,1399334.5908508301,1400999.715316772,25079.599853515629,86919.3466796875,235666.67706298831,355666.78308105469,608503.42233848572]
["ZAF",2003,"ZAF_2003_WHS",154,"What type of toilet facilities","Flush to septic tank","",0.70981027698030841,1.4522228001112369,0.44644561478865591,0.31975867800473279,0.2009345097287269,2.2703283854284022,0.53926797178640518,0.18586959903846481,0.18189728153600329,0.211781685577274,0,0,1.629502755816548,0.31584250088030508,0.70089408665974839,"","","","","","","","","",null,null,null,null,null,null,null,null,null,16223.561889648439,31690.17578125,9615.9091796875,7206.02783203125,4618.3267211914063,31602.378051757809,7155.97802734375,2459.93115234375,2565.26904296875,3043.9035034179692,0,0,13687.3212890625,2624.038330078125,6215.1820068359384]
["ZAF",2003,"ZAF_2003_WHS",155,"What type of toilet facilities","Pour flush latrine","",0.98334571052255981,1.159568103606019,0.48731343479168582,0.2165466791359324,0,1.00552860839766,0,0,0,0,0.96648027426052407,0.44151455924811822,1.986767180140838,1.376994873784454,0.99420489974739268,"","","","","","","","","",null,null,null,null,null,null,null,null,null,22475.541015625,25303.911376953129,10496.15356445313,4880.0595703125,0,13996.69555664063,0,0,0,0,8456.16796875,3758.296875,16688.232421875,11440.15551757813,8816.1171875]
["ZAF",2003,"ZAF_2003_WHS",156,"What type of toilet facilities","Covered dry latrine (with privacy)","",40.416333504834313,27.503806706741869,13.358409645101361,10.159642676591369,2.3494413430812249,13.31089875282299,4.6190481311444014,1.3773686978025841,0.59453054277851392,1.9787988949269379,45.680773372423268,40.674685526633347,48.149976819596297,47.729002643417687,27.752870190215859,"","","","","","","","","",null,null,null,null,null,null,null,null,null,923763.58758544922,600183.71087646484,287724.30432128912,228956.00003051761,54000.120483398438,185284.23345947271,61293.843994140632,18229.08203125,8384.5716857910156,28440.95263671875,399681.50708007813,346234.43395996088,404444.97589111328,396535.39990234381,246098.72265625]
["ZAF",2003,"ZAF_2003_WHS",157,"What type of toilet facilities","Uncovered dry latrine (without privacy)","",9.4147951498445117,4.2596034936532163,0.45017964177150183,0.087163121441429195,0,3.8257234943588379,0.63183443072871337,0.14841977870170039,0,0,14.299911790882,6.7526251196206628,6.4825639780522897,2.304944131460394,0,"","","","","","","","","",null,null,null,null,null,null,null,null,null,215186.39099121091,92952.392333984375,9696.335693359375,1964.29345703125,0,53253.071655273438,8384.31640625,1964.29345703125,0,0,125116.32080078129,57480.255981445313,54451.540893554688,19149.61328125,0]
["ZAF",2003,"ZAF_2003_WHS",158,"What type of toilet facilities","Bucket latrine (where fresh excreta are manually removed)","",0.88481473537276312,0.40308064330994969,0.37582294063085619,0,0.20879791198674541,1.383599286790183,0.1808264293866563,0.1329225748913109,0,0.33389798134939402,0,1.146592417764275,0,0.47376376601345682,0,"","","","","","","","","",null,null,null,null,null,null,null,null,null,20223.497863769531,8795.9619140625,8094.780517578125,0,4799.06103515625,19259.340637207031,2399.530517578125,1759.1923828125,0,4799.06103515625,0,9760.119140625,0,3936.0576171875,0]
["ZAF",2003,"ZAF_2003_WHS",159,"What type of toilet facilities","No facilities (open defecation)","",21.212812473512031,3.2982085335788209,0.98585863384008166,0,0,0.9030074934507859,0.29605472362238272,0.42338873488670498,0,0,30.943064969168582,22.18617169370382,8.8760199875376173,1.4935474049268991,1.0595699581693869,"","","","","","","","","",null,null,null,null,null,null,null,null,null,484844.17199707031,71972.98388671875,21234.22601318359,0,0,12569.62841796875,3928.5869140625,5603.42919921875,0,0,270734.7080078125,188854.97204589841,74555.834228515625,12408.48089599609,9395.7421875]
["ZAF",2003,"ZAF_2003_WHS",160,"What type of toilet facilities","Other","",9.4084022256570261,2.4426837954132989,0.78244265778867284,0.41833357375726488,0,0.23259356045398491,0,0.75923080481765159,0,0,5.243348463228287,18.587360753820381,4.8185837996263263,3.4960550821487701,0.87074553005406441,"","","","","","","","","",null,null,null,null,null,null,null,null,null,215040.27307128909,53303.858642578132,16852.887084960941,9427.4951171875,0,3237.6416015625,0,10048.203247070311,0,0,45876.399658203132,158220.87487792969,40474.619873046882,29045.43408203125,7721.340576171875]
["ZAF",2016,"ZAF_2016_DHS",16,"Water","1 Improved","w_imp",75.816252401883204,93.97726975437854,97.72706698727815,99.64033765423946,99.944878806103858,98.786191257359917,99.415631439447935,99.97162975568294,99.929962314559546,100,53.861220826086758,79.768429310548839,88.438192855411032,93.680415606172801,97.72406870071849,"2 Eastern Cape","4 Free State","7 Gauteng","5 Kwazulu-Natal","9 Limpopo","8 Mpumalanga","6 North West","3 Northern Cape","1 Western Cape",73.778371215166899,99.917488112314061,100,89.367621848263937,92.678051924605015,95.31446634902025,99.901769446901071,99.496729030381587,99.401016052404628]
["ZAF",2016,"ZAF_2016_DHS",17,"Water","2 Not Improved","",24.18374759811687,6.0227302456214939,2.272933012721885,0.35966234576053602,0.055121193896124097,1.2138087426401269,0.58436856055207576,0.028370244317055902,0.070037685440461198,0,46.138779173913157,20.231570689451079,11.56180714458897,6.3195843938271867,2.2759312992815079,"2 Eastern Cape","4 Free State","7 Gauteng","5 Kwazulu-Natal","9 Limpopo","8 Mpumalanga","6 North West","3 Northern Cape","1 Western Cape",26.221628784832969,0.082511887685943697,0,10.63237815173609,7.3219480753949266,4.6855336509796874,0.098230553098930903,0.50327096961842199,0.59898394759535856]
["ZAF",2016,"ZAF_2016_DHS",18,"Water ladder","1 Basic","w_bas",67.974305735527494,89.861177389738145,96.149814819168313,99.315094635807384,99.785956231621626,95.600603850270289,99.31049613169975,99.796717261001092,99.929962314559546,99.810603789769445,45.411284171502153,70.063828091897335,81.184673131790419,88.766645698187403,96.105682167525785,"2 Eastern Cape","4 Free State","7 Gauteng","5 Kwazulu-Natal","9 Limpopo","8 Mpumalanga","6 North West","3 Northern Cape","1 Western Cape",71.284048941676446,98.877011976292621,99.497680327231961,86.776348113162882,81.171819700040814,90.926029586830055,96.699459280443406,98.114022124950324,99.401016052404628]
["ZAF",2016,"ZAF_2016_DHS",19,"Water ladder","2 Limited","w_lim",7.8419466663557804,4.1160923646403944,1.577252168109823,0.32524301843207082,0.15892257448223421,3.1855874070896282,0.1051353077481809,0.17491249468182149,0,0.1893962102305638,8.4499366545845316,9.7046012186514741,7.2535197236204771,4.9137699079854356,1.6183865331927361,"2 Eastern Cape","4 Free State","7 Gauteng","5 Kwazulu-Natal","9 Limpopo","8 Mpumalanga","6 North West","3 Northern Cape","1 Western Cape",2.494322273490424,1.0404761360214749,0.50231967276806078,2.591273735101066,11.506232224564201,4.3884367621902394,3.2023101664576781,1.382706905431264,0]
["ZAF",2016,"ZAF_2016_DHS",20,"Water ladder","3 Other unimproved","w_unimp",11.369817272611151,3.217471698372298,1.0824743742331979,0.26058732167922088,0.055121193896124097,0.38473429070320642,0.58436856055207576,0.0078489664168908992,0.070037685440461198,0,20.90383404143838,10.6022090748813,5.9907852361782483,2.7368213179296572,1.593388135039211,"2 Eastern Cape","4 Free State","7 Gauteng","5 Kwazulu-Natal","9 Limpopo","8 Mpumalanga","6 North West","3 Northern Cape","1 Western Cape",13.083453981287461,0.082511887685943697,0,5.0351749092705624,2.689511009385205,2.7193097547043741,0.098230553098930903,0.12915041765043461,0.59898394759535856]
["ZAF",2016,"ZAF_2016_DHS",21,"Water ladder","4 Surface water","w_sur",12.8139303255057,2.8052585472491982,1.1904586384886859,0.099075024081315105,0,0.82907445193692053,0,0.0205212779001651,0,0,25.23494513247477,9.6293616145697669,5.5710219084107333,3.58276307589753,0.68254316424229666,"2 Eastern Cape","4 Free State","7 Gauteng","5 Kwazulu-Natal","9 Limpopo","8 Mpumalanga","6 North West","3 Northern Cape","1 Western Cape",13.138174803545519,0,0,5.5972032424655334,4.6324370660097252,1.9662238962753129,0,0.37412055196798738,0]
["ZAF",2016,"ZAF_2016_DHS",22,"Improved water point at more than 30 minutes","1 Yes","",10.34335834062011,4.3798807684010423,1.613935848821848,0.32641701753429631,0.15901022281546701,3.22472945514264,0.1057532967662301,0.17496213186609419,0,0.1893962102305638,15.688349660451721,12.165967541958491,8.2017955019494444,5.2452477673056528,1.6560777244642471,"2 Eastern Cape","4 Free State","7 Gauteng","5 Kwazulu-Natal","9 Limpopo","8 Mpumalanga","6 North West","3 Northern Cape","1 Western Cape",3.380831309241016,1.041335361485378,0.50231967276806078,2.8995666232461179,12.41527199333526,4.6041665345119442,3.205458906470863,1.389700866456677,0]
["ZAF",2016,"ZAF_2016_DHS",23,"Improved water point at more than 30 minutes","2 No","",89.656641659379972,95.620119231598963,98.386064151178147,99.673582982465717,99.840989777184532,96.775270544857349,99.894246703233762,99.82503786813389,100,99.810603789769445,84.311650339548123,87.834032458041449,91.798204498050396,94.754752232694401,98.343922275535775,"2 Eastern Cape","4 Free State","7 Gauteng","5 Kwazulu-Natal","9 Limpopo","8 Mpumalanga","6 North West","3 Northern Cape","1 Western Cape",96.61916869075894,98.958664638514648,99.497680327231961,97.100433376753898,87.584728006664719,95.395833465488096,96.794541093529162,98.610299133543336,100]
["ZAF",2016,"ZAF_2016_DHS",29,"Piped water","1 Yes","w_pip",62.910686538035741,84.803718799311625,90.184100172033155,95.779468495540286,98.76615867712863,94.857264274171712,98.189232845394585,99.088433847046886,99.363666239982422,99.640810526902641,38.642502924351859,63.817470727133788,70.894178890684984,78.654496937985471,78.891569419477293,"2 Eastern Cape","4 Free State","7 Gauteng","5 Kwazulu-Natal","9 Limpopo","8 Mpumalanga","6 North West","3 Northern Cape","1 Western Cape",65.133664796762858,96.498905172567291,98.705794167708419,83.298828370457869,68.931332171865733,83.440523397678177,90.348493837238422,97.620564893730219,99.195069057056415]
["ZAF",2016,"ZAF_2016_DHS",30,"Piped water","2 No","",37.089313461964473,15.196281200688359,9.8158998279668364,4.2205315044596787,1.2338413228713929,5.1427357258283486,1.8107671546054349,0.91156615295308274,0.63633376001760134,0.35918947309736948,61.357497075647977,36.18252927286612,29.105821109314888,21.34550306201448,21.108430580522729,"2 Eastern Cape","4 Free State","7 Gauteng","5 Kwazulu-Natal","9 Limpopo","8 Mpumalanga","6 North West","3 Northern Cape","1 Western Cape",34.866335203236929,3.5010948274327358,1.294205832291589,16.701171629542259,31.068667828134171,16.559476602321851,9.6515061627614749,2.379435106269769,0.80493094294356304]
["ZAF",2016,"ZAF_2016_DHS",31,"Piped water on premises","Yes","w_pop",25.192679041400439,57.474890867074691,76.600113972232606,91.905639836491574,98.568944501056436,62.319457650212023,89.004184424808386,97.613015513555439,99.234994854812982,99.535183379307497,7.7783476295906731,27.425949352511051,33.917523993697927,49.469358374422697,61.714581991187011,"2 Eastern Cape","4 Free State","7 Gauteng","5 Kwazulu-Natal","9 Limpopo","8 Mpumalanga","6 North West","3 Northern Cape","1 Western Cape",43.551160237977591,92.150423007165131,88.885437481004615,66.871547635930455,34.784785342792937,67.900595766756496,61.533863752716478,73.03285821127561,92.963029824914599]
["ZAF",2016,"ZAF_2016_DHS",32,"Piped water on premises","No","",74.807320958599789,42.525109132925223,23.39988602776716,8.0943601635084175,1.431055498943564,37.680542349788148,10.99581557519172,2.3869844864445442,0.76500514518703311,0.46481662069251362,92.221652370409259,72.574050647488804,66.08247600630186,50.530641625577253,38.285418008812968,"2 Eastern Cape","4 Free State","7 Gauteng","5 Kwazulu-Natal","9 Limpopo","8 Mpumalanga","6 North West","3 Northern Cape","1 Western Cape",56.448839762022303,7.8495769928349262,11.114562518995269,33.128452364069958,65.215214657206943,32.099404233243717,38.46613624728338,26.967141788724661,7.036970175085397]
["ZAF",2016,"ZAF_2016_DHS",35,"Water source on premises","1 Yes","",34.63003422357508,67.656687579277303,85.763369976234316,95.52154970757131,99.522778895875391,70.643397768264165,93.127559787251627,98.218975488423638,99.556832354731966,99.803713039638524,15.14053508393101,37.289276049138103,47.19124290776314,67.03873816886572,81.093304989541394,"2 Eastern Cape","4 Free State","7 Gauteng","5 Kwazulu-Natal","9 Limpopo","8 Mpumalanga","6 North West","3 Northern Cape","1 Western Cape",52.105702329836973,94.377349257724148,91.417865280610656,73.602590936164631,47.187637381439188,78.05625818240307,77.414749736854844,78.523612838661052,95.087143028223522]
["ZAF",2016,"ZAF_2016_DHS",36,"Water source on premises","2 No","",65.369965776425204,32.343312420722611,14.236630023765519,4.4784502924287404,0.4772211041245798,29.356602231735881,6.8724402127484332,1.7810245115763641,0.44316764526801927,0.1962869603614818,84.859464916068887,62.710723950861791,52.80875709223659,32.961261831134273,18.90669501045863,"2 Eastern Cape","4 Free State","7 Gauteng","5 Kwazulu-Natal","9 Limpopo","8 Mpumalanga","6 North West","3 Northern Cape","1 Western Cape",47.894297670162928,5.6226507422759244,8.5821347193892823,26.397409063835749,52.812362618560591,21.943741817597111,22.585250263145092,21.476387161339279,4.9128569717764661]
["ZAF",2016,"ZAF_2016_DHS",37,"Improved Water source on premises","1 Yes","w_premises",45.186251028868099,71.803901919838012,87.660911206154978,95.722466499328675,99.577667294942287,71.511409508867956,93.355264824750719,98.238997165517233,99.590828397604909,99.803713039638524,27.294182308110329,46.027271551548708,53.226944471684646,71.561102430088269,82.582869899263869,"2 Eastern Cape","4 Free State","7 Gauteng","5 Kwazulu-Natal","9 Limpopo","8 Mpumalanga","6 North West","3 Northern Cape","1 Western Cape",70.25092217193891,94.455286097302178,91.417865280610656,81.928811003022872,50.821237805456242,81.893401046362186,77.490869446513329,78.873308981979548,95.285630999796183]
["ZAF",2016,"ZAF_2016_DHS",38,"Improved Water source on premises","2 No","",54.813748971132078,28.19609808016185,12.339088793844841,4.277533500671395,0.42233270505769721,28.48859049113203,6.6447351752493429,1.7610028344827731,0.4091716023951068,0.1962869603614818,72.705817691889479,53.97272844845125,46.773055528315041,28.438897569911742,17.417130100736198,"2 Eastern Cape","4 Free State","7 Gauteng","5 Kwazulu-Natal","9 Limpopo","8 Mpumalanga","6 North West","3 Northern Cape","1 Western Cape",29.749077828061061,5.5447139026978798,8.5821347193892823,18.07118899697749,49.178762194543538,18.106598953638091,22.50913055348661,21.126691018020789,4.7143690002038321]
["ZAF",2016,"ZAF_2016_DHS",41,"Water point at more than 30 minutes","1 Yes","",19.913311563035229,6.2199059188363526,2.3465654160193301,0.38111434438794423,0.15892257448223421,3.7190981573089128,0.123990740107948,0.19543377258198649,0,0.1893962102305638,32.196021065670777,18.790741485065691,10.8447269779448,7.9206475497049622,2.1564955847760832,"2 Eastern Cape","4 Free State","7 Gauteng","5 Kwazulu-Natal","9 Limpopo","8 Mpumalanga","6 North West","3 Northern Cape","1 Western Cape",17.403465314303329,1.0404761360214749,0.50231967276806078,6.0026737809247814,15.165840759928789,5.22353127346077,3.2023101664576781,1.382706905431264,0]
["ZAF",2016,"ZAF_2016_DHS",42,"Water point at more than 30 minutes","2 No","w_30min",80.086688436964863,93.780094081163625,97.653434583980683,99.618885655612061,99.841077425517767,96.280901842691151,99.876009259892058,99.804566227417993,100,99.810603789769445,67.803978934329152,81.209258514934263,89.155273022055241,92.07935245029509,97.843504415223947,"2 Eastern Cape","4 Free State","7 Gauteng","5 Kwazulu-Natal","9 Limpopo","8 Mpumalanga","6 North West","3 Northern Cape","1 Western Cape",82.596534685696511,98.959523863978546,99.497680327231961,93.997326219075305,84.834159240071173,94.776468726539136,96.79768983354235,98.617293094568751,100]
["ZAF",2016,"ZAF_2016_DHS",43,"Water source available when needed","1 Yes","w_available",50.710877592522053,53.579252932911807,63.952176196770587,73.330174437970058,83.028897020394083,62.460775290449867,72.910002284116288,76.75862419181189,79.554182084896098,85.643656070865532,42.566110091495787,36.228408446120973,39.887183222759063,47.829126908896583,52.945119902440808,"2 Eastern Cape","4 Free State","7 Gauteng","5 Kwazulu-Natal","9 Limpopo","8 Mpumalanga","6 North West","3 Northern Cape","1 Western Cape",58.754052766991791,71.621016407076155,82.000664825376475,46.612011900899859,44.732792410993753,48.00730201880048,66.20579595709971,77.087435142785168,90.133976656404528]
["ZAF",2016,"ZAF_2016_DHS",44,"Water source available when needed","2 No","",49.289122407477933,46.420747067088072,36.047823803229448,26.66982556203013,16.971102979605948,37.539224709550147,27.089997715883769,23.241375808188181,20.445817915103881,14.356343929134489,57.433889908504213,63.771591553879013,60.112816777240752,52.170873091103537,47.054880097559071,"2 Eastern Cape","4 Free State","7 Gauteng","5 Kwazulu-Natal","9 Limpopo","8 Mpumalanga","6 North West","3 Northern Cape","1 Western Cape",41.245947233008138,28.378983592923831,17.999335174623379,53.38798809910066,55.26720758900597,51.992697981199683,33.794204042900091,22.912564857215109,9.8660233435954883]
["ZAF",2016,"ZAF_2016_DHS",45,"Improved water source available when needed","1 Yes","",50.710877592522053,53.579252932911807,63.952176196770587,73.330174437970058,83.028897020394083,62.460775290449867,72.910002284116288,76.75862419181189,79.554182084896098,85.643656070865532,42.566110091495787,36.228408446120973,39.887183222759063,47.829126908896583,52.945119902440808,"2 Eastern Cape","4 Free State","7 Gauteng","5 Kwazulu-Natal","9 Limpopo","8 Mpumalanga","6 North West","3 Northern Cape","1 Western Cape",58.754052766991791,71.621016407076155,82.000664825376475,46.612011900899859,44.732792410993753,48.00730201880048,66.20579595709971,77.087435142785168,90.133976656404528]
["ZAF",2016,"ZAF_2016_DHS",46,"Improved water source available when needed","2 No","",49.289122407477933,46.420747067088072,36.047823803229448,26.66982556203013,16.971102979605948,37.539224709550147,27.089997715883769,23.241375808188181,20.445817915103881,14.356343929134489,57.433889908504213,63.771591553879013,60.112816777240752,52.170873091103537,47.054880097559071,"2 Eastern Cape","4 Free State","7 Gauteng","5 Kwazulu-Natal","9 Limpopo","8 Mpumalanga","6 North West","3 Northern Cape","1 Western Cape",41.245947233008138,28.378983592923831,17.999335174623379,53.38798809910066,55.26720758900597,51.992697981199683,33.794204042900091,22.912564857215109,9.8660233435954883]
["ZAF",2016,"ZAF_2016_DHS",58,"Source of drinking water","11 Piped into dwelling","",5.6730596082474083,17.760524891243161,39.397476174796239,72.165046040184251,91.549111817025391,21.14810061759642,50.857238115083902,76.522691784945437,90.438590072599126,93.956986755960443,0.81699394644432544,2.6746987509669822,5.6977422875559087,11.443677873126539,21.948071572063458,"2 Eastern Cape","4 Free State","7 Gauteng","5 Kwazulu-Natal","9 Limpopo","8 Mpumalanga","6 North West","3 Northern Cape","1 Western Cape",28.73037953425289,65.123597304038412,63.87811372025056,34.895659594451843,12.61195200782206,27.66727526233764,26.0357608825997,50.86396386345843,87.009797316727926]
["ZAF",2016,"ZAF_2016_DHS",59,"Source of drinking water","12 Piped to yard/plot","",19.491001310078779,39.635803503876922,37.110733927562627,19.214713024342991,4.8597169582375246,41.135958940823571,38.130784498711371,20.70679829395629,7.8939326097930129,2.601975785227403,6.9613536831463501,24.699633507614511,28.126078098917709,37.854482845820613,39.667238591884981,"2 Eastern Cape","4 Free State","7 Gauteng","5 Kwazulu-Natal","9 Limpopo","8 Mpumalanga","6 North West","3 Northern Cape","1 Western Cape",14.072205013157671,26.990108903741241,23.87986841037063,31.953576799344521,22.17283333497091,39.677377157579663,34.596084905314306,21.064706874252529,5.3563713008967797]
["ZAF",2016,"ZAF_2016_DHS",60,"Source of drinking water","13 Piped to neighbor","",4.1422849291648411,5.3240140638463513,3.4891351835971469,1.033155802325276,0,4.240502546901018,2.1646689005078081,0.3341557794030019,0.057906311895169198,0,3.6467785387736851,2.8317690463315959,5.8299116972001341,8.7299404336117732,5.3916481872246012,"2 Eastern Cape","4 Free State","7 Gauteng","5 Kwazulu-Natal","9 Limpopo","8 Mpumalanga","6 North West","3 Northern Cape","1 Western Cape",1.249014978395897,1.3048315192762621,0.79226716657940444,4.2412598932009944,3.2849732843217438,6.8286111023431868,9.3488811146142776,1.122734731494206,0.12035534173918661]
["ZAF",2016,"ZAF_2016_DHS",61,"Source of drinking water","14 Public tap/standpipe","",33.535112449646938,22.004813868390428,10.09485101620319,2.8406728567234598,0.19721417607217079,28.233197858824969,7.0203795200784791,1.14126255408846,0.070765073274262597,0.1056271475951442,27.217376755987509,33.559752328291111,31.14674319978683,20.4551981299511,11.78533924106566,"2 Eastern Cape","4 Free State","7 Gauteng","5 Kwazulu-Natal","9 Limpopo","8 Mpumalanga","6 North West","3 Northern Cape","1 Western Cape",20.270135167682241,3.0436506461259309,9.0280895201242828,12.186020841326689,30.861573544750851,8.7113165285787009,19.465748969907612,23.464971950960692,6.1116838904026434]
["ZAF",2016,"ZAF_2016_DHS",62,"Source of drinking water","21 Tube well or borehole","",3.440472854539748,4.4607757475037859,3.794745968552665,1.8850547442426751,0.76310884085486119,0.13278308003866179,0.40735877273304599,0.22970832226999949,0.19727506144795551,0.15142736496444789,5.006919506311589,5.5977141072538679,8.0544971820030842,8.1586214521180267,10.404901213190421,"2 Eastern Cape","4 Free State","7 Gauteng","5 Kwazulu-Natal","9 Limpopo","8 Mpumalanga","6 North West","3 Northern Cape","1 Western Cape",0.85894244472458947,0.60315367431892719,0.080253522294381999,1.593880549280039,14.505918679548561,5.9784621687558941,5.0318788995667747,1.736411320809256,0.077572725449431196]
["ZAF",2016,"ZAF_2016_DHS",63,"Source of drinking water","31 Protected well","",0.46526382737067629,0.16319775546263429,0.204438385161926,0.038727196776762403,0.011631702331944001,0.017422306534844102,0.034788985840099498,0.018366003219726899,0,0.018365897902357799,1.0642141975257859,0.2067463841711083,0.28615613116067617,0.34463497195452059,0.35696876778237968,"2 Eastern Cape","4 Free State","7 Gauteng","5 Kwazulu-Natal","9 Limpopo","8 Mpumalanga","6 North West","3 Northern Cape","1 Western Cape",0.67599864730482861,0,0,0.14717799865834311,0.30831481362392787,0,0.35708738216994262,0,0.050005003834581403]
["ZAF",2016,"ZAF_2016_DHS",64,"Source of drinking water","32 Unprotected well","",7.0268963686676251,1.858789313717198,0.22940302256339179,0,0,0.026281309560802501,0.026239353105785901,0,0,0,12.749445482111639,6.8206958377444984,4.011686584412093,0.84525499281528049,0.36290568367328829,"2 Eastern Cape","4 Free State","7 Gauteng","5 Kwazulu-Natal","9 Limpopo","8 Mpumalanga","6 North West","3 Northern Cape","1 Western Cape",9.1915166936080741,0,0,1.688063330187872,1.979256922262832,1.4957761479280609,0,0,0]
["ZAF",2016,"ZAF_2016_DHS",65,"Source of drinking water","41 Protected spring","",1.284182336046241,0.29833252448079889,0.19096024273587539,0.1933553868221399,0,0,0.1049574124231436,0,0.21003671192493201,0,3.1006924378171519,0.4489328242465192,0.43698211330131181,0.67636281363619888,0.16407800298253589,"2 Eastern Cape","4 Free State","7 Gauteng","5 Kwazulu-Natal","9 Limpopo","8 Mpumalanga","6 North West","3 Northern Cape","1 Western Cape",1.0958511901435251,0.10050369259486509,0,0.96876669102287749,0.2009103655738379,0.48271693725889592,0.10326322786600151,0,0]
["ZAF",2016,"ZAF_2016_DHS",66,"Source of drinking water","42 Unprotected spring","",4.0627147271231134,0.88099737441081749,0.72588586058049887,0.061355119049364901,0.033385227933654102,0.15768785736481519,0.15743611863471549,0.0078489664168908992,0,0,8.0613219396528315,3.1901904406256469,1.309501334017444,1.872486072588005,0.74887563096585774,"2 Eastern Cape","4 Free State","7 Gauteng","5 Kwazulu-Natal","9 Limpopo","8 Mpumalanga","6 North West","3 Northern Cape","1 Western Cape",3.6049554128830512,0,0,3.1431814885049021,0.27311418283483763,0.86420984958605551,0,0.047250323565246402,0.061636910643114898]
["ZAF",2016,"ZAF_2016_DHS",67,"Source of drinking water","43 River/dam/lake/ponds/stream/canal/irrigation channel","",12.8139303255057,2.8052585472491982,1.1904586384886859,0.099075024081315105,0,0.82907445193692053,0,0.0205212779001651,0,0,25.23494513247477,9.6293616145697669,5.5710219084107333,3.58276307589753,0.68254316424229666,"2 Eastern Cape","4 Free State","7 Gauteng","5 Kwazulu-Natal","9 Limpopo","8 Mpumalanga","6 North West","3 Northern Cape","1 Western Cape",13.138174803545519,0,0,5.5972032424655334,4.6324370660097252,1.9662238962753129,0,0.37412055196798738,0]
["ZAF",2016,"ZAF_2016_DHS",68,"Source of drinking water","51 Rainwater","",0.91871457390965205,0.79933459120262329,0.6990545986421689,0.1432020598159415,0.021643182670185699,0.0325401961435349,0,0,0.010310518198399499,0,1.494570253636488,1.2259065543356371,1.694119097451964,1.312449938748268,1.2480127976225559,"2 Eastern Cape","4 Free State","7 Gauteng","5 Kwazulu-Natal","9 Limpopo","8 Mpumalanga","6 North West","3 Northern Cape","1 Western Cape",3.7794253324109932,0,0,0.038251812294478098,0.036045512642329199,0.2427575019497773,0,0.062136839778120803,0]
["ZAF",2016,"ZAF_2016_DHS",69,"Source of drinking water","61 Tanker truck","",5.1303650867149626,2.3056064376280569,1.374904072571439,1.047852499384766,0.1211504093816082,3.6282630826155762,0.59817786139471973,0.56878075973216946,0.14867378300585321,0,3.4478510760495942,4.9875298924905938,4.6219931205386482,1.931262220803202,3.6970825504564759,"2 Eastern Cape","4 Free State","7 Gauteng","5 Kwazulu-Natal","9 Limpopo","8 Mpumalanga","6 North West","3 Northern Cape","1 Western Cape",1.7160239569878379,2.4802153346403362,1.161930772031293,2.472167061153475,4.149991305844595,3.6787932856770991,2.1805968746332951,0.055268198096872299,0.078369266064191895]
["ZAF",2016,"ZAF_2016_DHS",70,"Source of drinking water","62 Cart with small tank","",1.456133358140276,1.013222771519708,1.2173494245177761,0.51133918151912838,0.075362854289195397,0.084628499865888496,0.031232820971907299,0.066340823414130903,0,0,1.1044704303942201,2.9682239897645482,2.0873758296922418,2.6025872709270952,2.5871803523852521,"2 Eastern Cape","4 Free State","7 Gauteng","5 Kwazulu-Natal","9 Limpopo","8 Mpumalanga","6 North West","3 Northern Cape","1 Western Cape",0.31954008615427643,0.23471023819266421,0.052021537965913897,0.47556758321282311,4.5306765233341748,1.1901876432923131,1.7991963285848671,0.022347777967098099,0]
["ZAF",2016,"ZAF_2016_DHS",71,"Source of drinking water","71 Bottled water","",0.27966206802382432,0.21164359922394549,0.1534179929370863,0.5672188621021953,2.3459388652410298,0.13279412801556201,0.066044551703797694,0.38352543465380529,0.90247217242081568,3.1656170483502559,0,0.56752192508233523,0.45659409780230797,0.17119765547564469,0.47354742406019867,"2 Eastern Cape","4 Free State","7 Gauteng","5 Kwazulu-Natal","9 Limpopo","8 Mpumalanga","6 North West","3 Northern Cape","1 Western Cape",1.010854863952044,0.0367167993854709,1.1274553503835041,0.39529302431831009,0.0148625521718496,0.85696876124731203,0.98327086164399868,1.104187473564725,0.59686120728993863]
["ZAF",2016,"ZAF_2016_DHS",72,"Source of drinking water","96 Other","",0.28020617682040933,0.47768501024428311,0.12718549108930749,0.19923220262985589,0.021735965962469999,0.20076512377758859,0.40069308881157428,0,0.070037685440461198,0,0.093066619673891807,0.59132279651115771,0.66959731774871123,0.0190802525263719,0.48160682040006469,"2 Eastern Cape","4 Free State","7 Gauteng","5 Kwazulu-Natal","9 Limpopo","8 Mpumalanga","6 North West","3 Northern Cape","1 Western Cape",0.28698187479632742,0.082511887685943697,0,0.2039300905777883,0.43713990428753591,0.35932375719025839,0.098230553098930903,0.081900094085188196,0.53734703695224362]
["ZAF",2016,"ZAF_2016_DHS",122,"Sanitation","1 Improved","s_imp",75.483175864222218,82.992492611907082,88.745218890270351,95.398742504222128,99.669437499476714,77.505588089455998,94.756575496382609,98.380183970941331,99.321626582342148,99.976180961945374,76.611885663199132,77.645862864360865,80.062607346318146,77.699235163998836,80.932459156060588,"2 Eastern Cape","4 Free State","7 Gauteng","5 Kwazulu-Natal","9 Limpopo","8 Mpumalanga","6 North West","3 Northern Cape","1 Western Cape",89.260709454462742,91.065778029659654,94.940462431555858,87.649388481373919,79.574826119063857,75.117984273323628,82.013589202853112,89.40251697922497,95.385966037581582,3892.9957840000061,4743.3338689999873,5520.9366549999804,6803.3444619999864,7534.8909399999966,2824.1500919999989,4306.8299739999893,4654.2477209999988,4739.0684299999984,4813.8586440000026,1555.145876,1381.7358490000011,1417.7982119999999,1305.595969999998,1497.0709420000001,4018.9131370000068,1653.8580489999999,8258.2457659999873,5027.9848039999952,1998.7447219999999,1389.4640589999999,1553.295354000001,667.06670399999928,3927.9291150000008]
["ZAF",2016,"ZAF_2016_DHS",123,"Sanitation","2 Not Improved","",24.516824135777782,17.007507388092922,11.254781109729651,4.6012574957778716,0.33056250052328551,22.494411910543999,5.2434245036173914,1.6198160290586689,0.67837341765785197,0.023819038054625701,23.388114336800871,22.354137135639139,19.937392653681851,22.300764836001161,19.067540843939408,"2 Eastern Cape","4 Free State","7 Gauteng","5 Kwazulu-Natal","9 Limpopo","8 Mpumalanga","6 North West","3 Northern Cape","1 Western Cape",10.73929054553726,8.9342219703403458,5.0595375684441422,12.35061151862608,20.425173880936139,24.882015726676372,17.986410797146888,10.59748302077503,4.6140339624184179,3708.425156000003,2849.129621000005,2094.4673639999969,797.234059,67.770947000000007,1991.2111710000061,516.23100199999999,160.7302,81.193659999999994,1.1468879999999999,1226.1327490000001,1408.107379999999,1366.5503069999979,1476.432198999996,1289.291590999999,853.59040000000005,348.89821599999999,1169.9260870000001,2034.5354739999991,2018.384995000001,1696.2737409999979,1072.644252999999,132.77120500000001,190.00277600000001]
["ZAF",2016,"ZAF_2016_DHS",124,"Sanitation ladder","1 Basic","s_bas",58.585412011355203,56.820342146416941,68.726682652044232,86.158190150999047,96.765443588569937,32.315721081157221,63.060582514942588,85.413956593723967,94.804266683502817,97.829411922677778,72.673034200290445,75.437135947168329,73.384988735664351,68.267379806418191,76.842960521410873,"2 Eastern Cape","4 Free State","7 Gauteng","5 Kwazulu-Natal","9 Limpopo","8 Mpumalanga","6 North West","3 Northern Cape","1 Western Cape",82.192766413890936,81.98058808942065,69.403224888309637,78.064061958779206,73.216207105703688,62.806737785560792,66.825377335810103,85.475561810101865,82.456361491094,3021.5045850000042,3247.4967899999988,4275.5617279999969,6144.3561039999959,7315.3524539999989,1177.5208590000011,2866.1990529999948,4040.8311590000039,4523.5254669999986,4710.4915960000044,1475.191068000001,1342.430765000001,1299.5468080000001,1147.1105959999991,1421.424289999999,3700.682985000004,1488.860672,6036.9296019999956,4478.1249939999971,1839.0301890000001,1161.7418339999981,1265.6384040000021,637.76617499999998,3395.4968060000028]
["ZAF",2016,"ZAF_2016_DHS",125,"Sanitation ladder","2 Limited","s_lim",16.897763852867001,26.172150465490351,20.018536238226389,9.2405523532232205,2.903993910906792,45.189867008298933,31.69599298144016,12.966227377217489,4.5173598988393602,2.1467690392676362,3.938851462908703,2.208726917192537,6.6776186106537656,9.431855357580746,4.0894986346496944,"2 Eastern Cape","4 Free State","7 Gauteng","5 Kwazulu-Natal","9 Limpopo","8 Mpumalanga","6 North West","3 Northern Cape","1 Western Cape",7.0679430405717403,9.0851899402389833,25.537237543246349,9.5853265225947339,6.3586190133601699,12.311246487762711,15.18821186704306,3.9269551691231999,12.929604546487621,871.49119900000062,1495.8370789999999,1245.3749270000001,658.98835799999995,219.53848600000001,1646.6292330000031,1440.6309210000011,613.41656199999966,215.54296299999999,103.367048,79.954807999999986,39.305084000000001,118.25140399999999,158.48537400000001,75.646651999999989,318.23015200000032,164.997377,2221.316164000003,549.85980999999992,159.71453299999999,227.72222500000021,287.65695000000022,29.300529000000001,532.4323089999998]
["ZAF",2016,"ZAF_2016_DHS",126,"Sanitation ladder","3 Other unimproved","s_unimp",16.839645913359821,14.587405516782949,10.42262868758748,4.3357128804009477,0.3305625005232713,19.15055465444912,5.1629001640054213,1.478626015074255,0.67837341765782355,0.023819038054583099,12.270102095219,16.90536935471664,16.924595712940871,18.515135553970591,18.036273388262671,"2 Eastern Cape","4 Free State","7 Gauteng","5 Kwazulu-Natal","9 Limpopo","8 Mpumalanga","6 North West","3 Northern Cape","1 Western Cape",5.3572483775092508,8.483772499395883,4.5136998302018441,10.709074553965751,17.08044034068239,21.73672749123406,13.544804612104061,6.3600085751869671,3.878902255501075,3124.8505230000078,2665.3842700000041,2031.095594999997,777.05113200000005,67.770947000000007,1830.192364000005,512.347264,153.93193199999999,81.193659999999994,1.1468879999999999,916.909851,1256.0953010000001,1282.663539999998,1371.1149259999961,1260.556740999999,591.35020499999962,339.87681099999998,1118.463567,1918.601592999999,1884.02271,1599.2183929999981,956.01035699999909,98.878277999999995,159.73055299999999]
["ZAF",2016,"ZAF_2016_DHS",127,"Sanitation ladder","4 Open defecation","s_od",7.6771782224179841,2.4201018713097522,0.83215242214189944,0.26554461537678581,0,3.343857256094724,0.080524339611832696,0.1411900139842823,0,0,11.11801224158185,5.4487677809224939,3.0127969407410178,3.7856292820304711,1.031267455676774,"2 Eastern Cape","4 Free State","7 Gauteng","5 Kwazulu-Natal","9 Limpopo","8 Mpumalanga","6 North West","3 Northern Cape","1 Western Cape",5.3820421680280743,0.4504494709444839,0.54583773824216919,1.641536964660316,3.3447335402537539,3.145288235442433,4.4416061850427653,4.2374744455879609,0.73513170691729635,583.57463299999984,183.74535099999991,63.371769,20.182926999999999,0,161.01880700000001,3.8837380000000001,6.7982680000000002,0,0,309.22289799999987,152.01207899999989,83.886766999999992,105.317273,28.734850000000002,262.24019500000003,9.0214049999999997,51.462519999999998,115.933881,134.36228500000001,97.055347999999952,116.63389599999999,33.892926999999993,30.272223]
["ZAF",2016,"ZAF_2016_DHS",128,"Shared among Improved Sanitation","1 Yes","s_shared",22.386132617501939,31.53556381042517,22.5573123696708,9.6862412550293886,2.9136252634334761,58.305301749522023,33.449913966815068,13.17971450535947,4.5482137720471822,2.147280500827268,5.1413059851113259,2.844616359085288,8.340496059251624,12.13892947295175,5.0529771086826702,"2 Eastern Cape","4 Free State","7 Gauteng","5 Kwazulu-Natal","9 Limpopo","8 Mpumalanga","6 North West","3 Northern Cape","1 Western Cape",7.9183137617537351,9.9765138307828245,26.898160056526539,10.93598790438986,7.990741951287565,16.389213058443001,18.51914056520123,4.3924436378404561,13.555038632615441]
["ZAF",2016,"ZAF_2016_DHS",129,"Shared among Improved Sanitation","2 No","",77.613867382498029,68.464436189575082,77.442687630329502,90.313758744970755,97.08637473656654,41.694698250478162,66.550086033185067,86.820285494640643,95.451786227952837,97.852719499172764,94.858694014888698,97.155383640914707,91.659503940748351,87.861070527048383,94.947022891317303,"2 Eastern Cape","4 Free State","7 Gauteng","5 Kwazulu-Natal","9 Limpopo","8 Mpumalanga","6 North West","3 Northern Cape","1 Western Cape",92.081686238246192,90.023486169217151,73.101839943473593,89.064012095610167,92.009258048712439,83.610786941556839,81.480859434798845,95.607556362159656,86.444961367384593]
["ZAF",2016,"ZAF_2016_DHS",130,"Manually calculated ratios","Improved latrines","",50.062390050753237,44.836043429660243,38.154232330671761,35.55244878152223,22.053577775517969,20.35460784863935,34.930768785750907,48.306276327724937,22.891096507187839,50,62.351925162933817,51.774727221584882,49.497350941746951,43.519150454497023,34.954097422023082,"2 Eastern Cape","4 Free State","7 Gauteng","5 Kwazulu-Natal","9 Limpopo","8 Mpumalanga","6 North West","3 Northern Cape","1 Western Cape",79.188369344520382,38.046192397941113,22.853573777086389,51.632643587489447,40.042620285541872,19.133007140820158,26.903580199527219,65.21527075994797]
["ZAF",2016,"ZAF_2016_DHS",135,"Sanitation type","1 Sewer connection","s_sew",9.1146602256182963,30.78096478274928,52.380831299923628,81.198587527887526,97.32544111493776,39.885490622637917,80.088495381278477,92.888500993813921,95.341977908923241,99.495496467479455,2.0102903929662892,1.2655440862408389,2.769348430120139,5.7024251503903542,22.267410240116099,"2 Eastern Cape","4 Free State","7 Gauteng","5 Kwazulu-Natal","9 Limpopo","8 Mpumalanga","6 North West","3 Northern Cape","1 Western Cape",37.551276753439417,74.016341624076858,79.737654915654289,37.178681938504653,17.177677909672489,32.177209807003059,42.655643679470153,62.173371554961193,93.100493074668023]
["ZAF",2016,"ZAF_2016_DHS",136,"Sanitation type","2 Septic tank connection","s_sep",0.75704057773177391,1.200466069017605,1.9945782997334121,1.839697604776581,1.2064992941070409,2.0889942935938781,1.7553493605261079,0.87888758150756263,1.88470125283167,0.31131602861884289,0.0307857325872915,0.3768613551725844,0.69540281569901996,1.849499101890657,4.1826483675302866,"2 Eastern Cape","4 Free State","7 Gauteng","5 Kwazulu-Natal","9 Limpopo","8 Mpumalanga","6 North West","3 Northern Cape","1 Western Cape",2.8525921211660621,0.32490204193669092,0.43112176606185171,2.5085730168009128,1.2179680878350849,0.55255021991823272,2.7683522806927909,1.903017952603699,0.36257894484928471]
["ZAF",2016,"ZAF_2016_DHS",137,"Sanitation type","3 Improved latrines","s_lat",41.342352657554663,30.492809231803129,18.121553676691398,6.4725914828819491,0.57664881921112865,16.674283841785371,7.4527657599326433,2.8944818914362789,1.088896662048515,0.16936846584707091,53.873705731298259,47.884959918656399,47.455534139618138,39.377721699840947,27.278446720342831,"2 Eastern Cape","4 Free State","7 Gauteng","5 Kwazulu-Natal","9 Limpopo","8 Mpumalanga","6 North West","3 Northern Cape","1 Western Cape",42.077613313798153,8.2378538458847448,7.4223904582024378,31.50524582465501,31.359897457849431,12.298824676549019,13.727987195099219,19.323846527009319,1.9228940180642731]
["ZAF",2016,"ZAF_2016_DHS",138,"Sanitation type","4 Unimproved facilities","",41.108768316677534,35.105658045120222,26.67088430150956,10.22357876907725,0.89141077174408367,38.007373985888329,10.6228651586511,3.1969395192580801,1.6844241761966099,0.023819038054637899,32.967205901566167,45.02386685900759,46.066917673821408,49.284724765847542,45.240227216334013,"2 Eastern Cape","4 Free State","7 Gauteng","5 Kwazulu-Natal","9 Limpopo","8 Mpumalanga","6 North West","3 Northern Cape","1 Western Cape",12.13647564356808,16.97045301715734,11.862995121839131,27.165962255379561,46.899723004388967,51.826127061087348,36.406410659694828,12.362289519838241,3.8789022555011461]
["ZAF",2016,"ZAF_2016_DHS",139,"Sanitation type","5 Open defecation","",7.6771782224179841,2.4201018713097522,0.83215242214189944,0.26554461537678581,0,3.343857256094724,0.080524339611832696,0.1411900139842823,0,0,11.11801224158185,5.4487677809224939,3.0127969407410178,3.7856292820304711,1.031267455676774,"2 Eastern Cape","4 Free State","7 Gauteng","5 Kwazulu-Natal","9 Limpopo","8 Mpumalanga","6 North West","3 Northern Cape","1 Western Cape",5.3820421680280743,0.4504494709444839,0.54583773824216919,1.641536964660316,3.3447335402537539,3.145288235442433,4.4416061850427653,4.2374744455879609,0.73513170691729635]
["ZAF",2016,"ZAF_2016_DHS",148,"Shared among improved sanitation facilities","Yes","",11.46484592655648,19.70160384663237,16.353366464771419,8.6702394584734694,2.887652893986973,34.195341596741258,29.86963938811304,12.73975856305904,4.4716025596857154,2.1467690392676362,2.874750026168265,1.4088635372564859,4.2470043959320796,5.6967566240340339,2.7148890750606429,"2 Eastern Cape","4 Free State","7 Gauteng","5 Kwazulu-Natal","9 Limpopo","8 Mpumalanga","6 North West","3 Northern Cape","1 Western Cape",6.5311425550228304,8.2385150846101656,23.560412332674979,7.7856032741291408,3.9758370839783259,7.3798306842532329,10.95443890762715,3.6633083616445701,12.929604546487621]
["ZAF",2016,"ZAF_2016_DHS",149,"Shared among improved sanitation facilities","No","",39.749207534348272,42.772636236937579,56.143596811577133,80.840637157072621,96.220936334268941,24.453427161275929,59.426971113624283,83.92211190369872,93.843973264117679,97.82941192267775,53.040031830683567,48.118501822813322,46.67328098950523,41.232889328087921,51.01361625292855,"2 Eastern Cape","4 Free State","7 Gauteng","5 Kwazulu-Natal","9 Limpopo","8 Mpumalanga","6 North West","3 Northern Cape","1 Western Cape",75.950339633380864,74.340582427288069,64.03075480724371,63.406897505831381,45.77970637137868,37.648754019217073,48.197544247635037,79.736927672929511,82.456361491094]
["ZAF",2016,"ZAF_2016_DHS",150,"Shared among improved sanitation facilities","DK/missing","",48.785946539095448,37.52575991642999,27.503036723651459,10.489123384454031,0.89141077174408367,41.351231241983079,10.703389498262929,3.3381295332423622,1.6844241761966099,0.023819038054637899,44.085218143148033,50.472634639930057,49.079714614562427,53.070354047878013,46.271494672010768,"2 Eastern Cape","4 Free State","7 Gauteng","5 Kwazulu-Natal","9 Limpopo","8 Mpumalanga","6 North West","3 Northern Cape","1 Western Cape",17.518517811596158,17.420902488101831,12.408832860081301,28.80749922003988,50.24445654464278,54.971415296529791,40.848016844737593,16.599763965426199,4.6140339624184419]
["ZAF",2016,"ZAF_2016_DHS",151,"Shared among all sanitation facilities","Yes","",23.24796777570706,27.10293496562997,19.69632179470635,9.0551100069672881,2.9866026843605709,53.389184089723713,32.676453681407573,12.931162329012921,4.6681708545852141,2.1467690392676362,6.9736441261058886,4.9129051721145904,10.150027297998159,11.49122370516926,5.3296707857280401,"2 Eastern Cape","4 Free State","7 Gauteng","5 Kwazulu-Natal","9 Limpopo","8 Mpumalanga","6 North West","3 Northern Cape","1 Western Cape",8.8265824490509033,10.175040677174101,28.541225625725609,12.63816667390978,6.9658840952181764,14.65996455082748,18.809092767413659,5.8960006346774536,15.91977338755296]
["ZAF",2016,"ZAF_2016_DHS",152,"Shared among all sanitation facilities","No","",76.752032224293359,72.897065034370073,80.303678205293721,90.94488999303276,97.013397315639423,46.610815910276443,67.323546318592719,87.068837670987264,95.331829145414773,97.85323096073239,93.026355873894161,95.08709482788538,89.849972702001764,88.508776294830753,94.670329214271959,"2 Eastern Cape","4 Free State","7 Gauteng","5 Kwazulu-Natal","9 Limpopo","8 Mpumalanga","6 North West","3 Northern Cape","1 Western Cape",91.173417550949054,89.824959322825876,71.458774374274313,87.361833326090419,93.034115904781871,85.340035449172802,81.190907232586284,94.10399936532265,84.080226612447092]
["ZAF",2016,"ZAF_2016_DHS",153,"Type of toilet facility","11 Flush to piped sewer system","",9.1146602256182963,30.78096478274928,52.380831299923628,81.198587527887526,97.32544111493776,39.885490622637917,80.088495381278477,92.888500993813921,95.341977908923241,99.495496467479455,2.0102903929662892,1.2655440862408389,2.769348430120139,5.7024251503903542,22.267410240116099,"2 Eastern Cape","4 Free State","7 Gauteng","5 Kwazulu-Natal","9 Limpopo","8 Mpumalanga","6 North West","3 Northern Cape","1 Western Cape",37.551276753439417,74.016341624076858,79.737654915654289,37.178681938504653,17.177677909672489,32.177209807003059,42.655643679470153,62.173371554961193,93.100493074668023,692.84369099999969,2337.0335129999999,3989.0119319999899,6171.5624029999926,7399.3242179999997,1920.6304650000029,3862.7169669999912,4472.560814000004,4595.733217,4790.7136590000036,55.911776999999987,35.306696000000002,77.108311999999984,158.64307400000001,620.45077600000002,1829.6872879999989,1482.366919000001,7517.8031369999871,2625.751951000002,690.04960399999982,992.90432599999838,1120.1114420000019,497.28619500000087,3833.8148950000009]
["ZAF",2016,"ZAF_2016_DHS",154,"Type of toilet facility","12 Flush to septic tank","",0.75704057773177391,1.200466069017605,1.9945782997334121,1.839697604776581,1.2064992941070409,2.0889942935938781,1.7553493605261079,0.87888758150756263,1.88470125283167,0.31131602861884289,0.0307857325872915,0.3768613551725844,0.69540281569901996,1.849499101890657,4.1826483675302866,"2 Eastern Cape","4 Free State","7 Gauteng","5 Kwazulu-Natal","9 Limpopo","8 Mpumalanga","6 North West","3 Northern Cape","1 Western Cape",2.8525921211660621,0.32490204193669092,0.43112176606185171,2.5085730168009128,1.2179680878350849,0.55255021991823272,2.7683522806927909,1.903017952603699,0.36257894484928471,57.545840999999989,91.144948000000014,151.895196,139.82766100000001,91.726062000000013,100.59262200000001,84.661569999999998,42.318243000000002,90.847540000000009,14.989884,0.85623700000000003,10.513840999999999,19.362438000000001,51.453586000000008,116.543747,138.99265199999999,6.5069959999999991,40.646901,177.16847799999999,48.927357999999998,17.050250999999999,72.695259000000007,15.221059,14.930754]
["ZAF",2016,"ZAF_2016_DHS",155,"Type of toilet facility","13 Flush to pit latrine","",0.69242484287418049,2.011395421277157,1.0985524706407579,0.5033549734970244,0.30309200044002971,2.840851278410097,1.735503540521697,0.2431684255276568,0.43707511348205558,0.14149072009830449,0.072838405393490402,0.2180876307584089,0.89203039168818765,0.6068220008738533,1.449499428795255,"2 Eastern Cape","4 Free State","7 Gauteng","5 Kwazulu-Natal","9 Limpopo","8 Mpumalanga","6 North West","3 Northern Cape","1 Western Cape",0.85618402702454344,0.069065119114731705,2.146501720114542,0.54405676001657188,0.097637598890610799,1.175221498080623,0.49796526032595723,1.495647163680514,0.028714729415130098,52.634127000000007,152.71446300000011,83.659209000000033,38.257890000000003,23.043060000000001,136.79725199999999,83.704394000000008,11.708506,21.068166000000002,6.8127860000000009,2.0258389999999999,6.0843030000000002,24.837235,16.881958999999998,40.388309,41.717597000000012,1.3832059999999999,202.37587099999999,38.424118999999997,3.9222290000000002,36.264253999999987,13.076267,11.962752999999999,1.182453]
["ZAF",2016,"ZAF_2016_DHS",156,"Type of toilet facility","14 Flush to somewhere else","",0.38779219349481292,0.76445879623189239,0.28649762961446917,0.35025981149257901,0,1.529172910987884,0.32658177199873017,0.19844925889121229,0.014175536251805799,0,0.074360978487007803,0.21929203535185429,0.073792306745346606,0.065499157064789704,0.87105470707964072,"2 Eastern Cape","4 Free State","7 Gauteng","5 Kwazulu-Natal","9 Limpopo","8 Mpumalanga","6 North West","3 Northern Cape","1 Western Cape",0.68337370608664827,0.27588229763944871,0,0.44903793195169278,0.3070938423470374,0.20330061744066569,0.36112136679463153,0,0.9065262123831469,29.477716999999998,58.041254999999992,21.817951999999998,26.621772,0,73.635199999999998,15.751238000000001,9.5552880000000009,0.68329799999999996,0,2.0681859999999999,6.1179040000000002,2.0546350000000002,1.8222050000000001,24.270741999999998,33.297407999999997,5.5252500000000007,0,31.713394999999998,12.336358000000001,6.2733240000000006,9.4828289999999988,0,37.330131999999999]
["ZAF",2016,"ZAF_2016_DHS",157,"Type of toilet facility","15 Flush, don't know where","",0.070418176315335104,0.020733046686010399,0.17345949035721159,0.14009804609714149,0.025615857037257699,0.1055925552059665,0.12790727777852631,0.050855601836102403,0.17010643502166919,0.027877745748766398,0,0.0096105400193439005,0.0565356308399695,0.091229306312606395,0.1833121835190856,"2 Eastern Cape","4 Free State","7 Gauteng","5 Kwazulu-Natal","9 Limpopo","8 Mpumalanga","6 North West","3 Northern Cape","1 Western Cape",0.44198057192708301,0,0,0.108729471884428,0.0210688740375569,0,0,0.1091834970777814,0.043665268090758699,5.3527819999999986,1.574149,13.209641,10.648262000000001,1.947487,5.0846629999999999,6.1690459999999998,2.4486859999999999,8.1995760000000004,1.3423149999999999,0,0.268119,1.574149,2.5380250000000002,5.107742,21.535519000000001,0,0,7.6790409999999998,0.84636400000000001,0,0,0.87329100000000004,1.798106]
["ZAF",2016,"ZAF_2016_DHS",158,"Type of toilet facility","21 Ventilated Improved Pit latrine (VIP)","",17.322388003419821,9.2724851417099021,6.3871530753515051,2.415051637093669,0,3.8926254077813738,1.620104460400259,1.027566664100598,0.23892800401647879,0,27.818694396358751,17.33017887794724,16.58619611907854,14.42844315786656,8.7470792157683661,"2 Eastern Cape","4 Free State","7 Gauteng","5 Kwazulu-Natal","9 Limpopo","8 Mpumalanga","6 North West","3 Northern Cape","1 Western Cape",24.722180986689722,3.5388455020012159,1.4870207203042169,8.9492975470647274,12.252627464755539,1.708062784854893,1.1186077898249209,8.5930444439587301,0,1316.7476290000011,704.01004899999987,486.40751200000022,183.557896,0,187.44397599999999,78.138625999999974,49.477108000000001,11.516956,0,773.71540099999993,483.48482199999978,461.81750599999958,401.40335300000021,243.72533799999991,1204.5891430000011,70.874449999999996,140.198869,632.04595400000005,492.20393899999988,52.706339,29.373964999999998,68.730426999999992,0]
["ZAF",2016,"ZAF_2016_DHS",159,"Type of toilet facility","22 Pit latrine with ventilation pipe but no gauze/mesh","",20.692868470457341,16.784986265373501,9.2752899417771673,2.660006648722844,0.24794096173384131,3.8801986142903462,3.1073857400056331,1.5622943497189929,0.24278710952831201,0,25.740828285407719,29.83866843651948,28.04227152858082,22.615815900460831,14.094714393721,"2 Eastern Cape","4 Free State","7 Gauteng","5 Kwazulu-Natal","9 Limpopo","8 Mpumalanga","6 North West","3 Northern Cape","1 Western Cape",15.5825019978841,4.6044665350229259,1.914742134686034,18.500537691482791,18.864325386184639,9.4155403936134991,12.028818185992611,8.9901192717786316,0,1572.9520370000009,1274.393953999999,706.3508030000005,202.175894,18.850113,186.84558100000001,149.87110899999999,75.224127999999993,11.702975,0,715.92415500000016,832.45207099999993,780.79457200000002,629.17836900000043,392.72984099999968,759.25796100000025,92.216241999999994,180.52517900000001,1306.604225999999,757.80442100000005,290.53888899999993,315.86950099999979,71.906382000000022,0]
["ZAF",2016,"ZAF_2016_DHS",160,"Type of toilet facility","23 Pit latrine without ventilation pipe","",37.92050375518361,32.059769575526779,25.387899396752921,9.1997904510563941,0.87632542378245604,30.41422472812717,8.806395152653808,2.7714733938444591,1.6226625137721511,0,32.33922469741767,43.935152350454807,45.534878063876313,48.077483143557558,42.506177856361518,"2 Eastern Cape","4 Free State","7 Gauteng","5 Kwazulu-Natal","9 Limpopo","8 Mpumalanga","6 North West","3 Northern Cape","1 Western Cape",10.592542603217369,13.260438309002129,11.483273893183251,25.71388703345832,46.592629162041938,47.014686827895801,35.721259449360851,9.3785639760168245,0,2882.4971130000099,2434.1263000000022,1933.391110999997,699.23729700000001,66.624059000000003,1464.5547960000019,424.73780799999997,133.445832,78.216585999999992,0,899.44394399999999,1225.7218729999991,1267.849702999998,1337.529123999996,1184.376213999999,516.12201299999947,265.57425899999998,1082.662797,1816.0484859999981,1871.686351999999,1450.7499629999991,938.01869999999894,75.013310000000004,0]
["ZAF",2016,"ZAF_2016_DHS",161,"Type of toilet facility","31 No facility/bush/field","",7.6771782224179841,2.4201018713097522,0.83215242214189944,0.26554461537678581,0,3.343857256094724,0.080524339611832696,0.1411900139842823,0,0,11.11801224158185,5.4487677809224939,3.0127969407410178,3.7856292820304711,1.031267455676774,"2 Eastern Cape","4 Free State","7 Gauteng","5 Kwazulu-Natal","9 Limpopo","8 Mpumalanga","6 North West","3 Northern Cape","1 Western Cape",5.3820421680280743,0.4504494709444839,0.54583773824216919,1.641536964660316,3.3447335402537539,3.145288235442433,4.4416061850427653,4.2374744455879609,0.73513170691729635,583.57463299999984,183.74535099999991,63.371769,20.182926999999999,0,161.01880700000001,3.8837380000000001,6.7982680000000002,0,0,309.22289799999987,152.01207899999989,83.886766999999992,105.317273,28.734850000000002,262.24019500000003,9.0214049999999997,51.462519999999998,115.933881,134.36228500000001,97.055347999999952,116.63389599999999,33.892926999999993,30.272223]
["ZAF",2016,"ZAF_2016_DHS",162,"Type of toilet facility","41 Composting toilet","",1.291644546131399,1.9448030957867639,1.0069222697664471,0.7540801774712711,0,3.3911240316425681,0.4798963793983782,0,0,0,0.20607539814534009,0.48841443341187768,1.8472281989494681,1.615975334144794,2.7867587968316978,"2 Eastern Cape","4 Free State","7 Gauteng","5 Kwazulu-Natal","9 Limpopo","8 Mpumalanga","6 North West","3 Northern Cape","1 Western Cape",0.47476573027267449,0,0.8572030427540831,3.3786607840731659,0.061364934011663999,0,0.0268844720616607,0,0.82799387902746635,98.183339000000004,147.65846500000001,76.681199000000007,57.314456,0,163.294873,23.145695,0,0,0,5.7315310000000004,13.625997,51.433270999999991,44.956888999999997,77.649203,23.132977,0,80.818575999999993,238.61860300000001,2.465109,0,0.70596999999999999,0,34.096223999999999]
["ZAF",2016,"ZAF_2016_DHS",163,"Type of toilet facility","42 Bucket toilet","",2.725897363605287,2.2674787995589001,0.99648727514216517,0.67352850652827434,0.0150853479616277,6.0116877465523668,1.4898882339985631,0.22701686652240841,0.0475861261726538,0.023819038054637899,0.55362022566149682,0.7185147104909233,0.45824730319976059,1.141742465225198,1.8629946528928589,"2 Eastern Cape","4 Free State","7 Gauteng","5 Kwazulu-Natal","9 Limpopo","8 Mpumalanga","6 North West","3 Northern Cape","1 Western Cape",0.77415426615009775,3.3612992842142,0.37972122865588592,1.003037289969539,0,4.6081396157508978,0.3240298435393521,2.8512968369445049,2.9723760431179991,207.20693299999999,172.15749999999991,75.886531999999974,51.192062999999997,1.1468879999999999,289.48448300000013,71.858217999999994,10.930812,2.2937759999999998,1.1468879999999999,15.397721000000001,20.045434,12.759202,31.763597000000001,51.909784999999999,37.720693999999988,67.31863199999998,35.80077,70.839711999999992,0,142.1951059999999,8.5088279999999994,22.805752999999999,122.40042099999999]
["ZAF",2016,"ZAF_2016_DHS",164,"Type of toilet facility","44 Chemical toilet","",1.2726086183565579,0.45840626096971798,0.1801764287983473,0,0,2.5638919544550092,0.38196836182815158,0.0105968502529298,0,0,0.035269245992928799,0,0.031272270481165203,0.0194360001823548,0.0170827017074307,"2 Eastern Cape","4 Free State","7 Gauteng","5 Kwazulu-Natal","9 Limpopo","8 Mpumalanga","6 North West","3 Northern Cape","1 Western Cape",0,0.025476689745868801,1.0169228403435639,0.023963570133341699,0.062873199969409793,0,0.055711486894069899,0.13585215051366151,1.022520141530918,96.736337999999989,34.804327999999998,13.721163000000001,0,0,123.46066,18.422567000000001,0.51023600000000002,0,0,0.98093600000000003,0,0.87072899999999998,0.54071499999999995,0.47598600000000002,0,0.51023600000000002,95.877232999999976,1.6924319999999999,2.5256980000000002,0,1.46295,1.086597,42.106682999999997]
["ZAF",2016,"ZAF_2016_DHS",165,"Type of toilet facility","96 Other","",0.074575004393849606,0.0139508738026213,0,0,0,0.052288600220855401,0,0,0,0,0,0.15090776270998829,0,0,0,"2 Eastern Cape","4 Free State","7 Gauteng","5 Kwazulu-Natal","9 Limpopo","8 Mpumalanga","6 North West","3 Northern Cape","1 Western Cape",0.086405068113960606,0.072833126301567297,0,0,0,0,0,0.13242870687690839,0,5.6687599999999998,1.059215,0,0,0,2.5178850000000002,0,0,0,0,0,4.2100900000000001,0,0,0,4.2100900000000001,1.4586699999999999,0,0,0,0,0,1.059215,0]
["ZAF",2016,"ZAF_2016_DHS",222,"Hygiene ladder","1,00 Basic","h_bas",4.3439503321594044,9.7407705191169214,21.93905579086023,50.537080582987002,79.815928015328154,7.2848820303462762,27.711705039486741,44.687193431999731,70.555185099732796,84.262802275787493,4.6531895644275307,4.0093453441798124,3.8810731101498961,7.8942572429017774,28.33077476922082,"2 Eastern Cape","4 Free State","7 Gauteng","5 Kwazulu-Natal","9 Limpopo","8 Mpumalanga","6 North West","3 Northern Cape","1 Western Cape",22.574116790668921,27.793550866239059,38.923569222577562,32.373267938672413,11.261209273370071,22.75479397085023,21.171030061967691,41.718452708738859,73.872723607033336,324.78550600000011,724.34209299999941,1640.741194,3797.966069999999,6020.7309540000006,347.06204600000018,1300.905637999999,2133.097846000001,3369.6239919999998,4018.4231260000051,126.913882,110.053845,105.668713,214.46531400000001,782.35141499999861,1095.9067560000001,547.94516600000031,3592.3742419999999,2223.5406000000012,449.13750299999958,689.0866569999996,554.67654699999935,332.22807000000029,3023.670276000003]
["ZAF",2016,"ZAF_2016_DHS",223,"Hygiene ladder","2,00 Limited","h_lim",67.223111916311794,73.378353695144455,67.681492659518412,44.83600711093046,17.726394068126119,66.074326093145316,61.362934304316497,48.897218147983232,26.81720057518552,13.58356304369738,61.803173238523293,76.127113970010356,82.596275805066341,80.819219832876982,63.012895217227957,"2 Eastern Cape","4 Free State","7 Gauteng","5 Kwazulu-Natal","9 Limpopo","8 Mpumalanga","6 North West","3 Northern Cape","1 Western Cape",57.853238037047483,59.877940431453723,45.645428270057323,49.609669837810188,84.149946721991,70.198251621314739,75.320883876159911,49.858466410598403,19.282234679884869,5026.0916330000036,5456.5529690000067,5061.6496049999923,3369.5186139999978,1337.1497660000009,3147.8740090000019,2880.6378779999959,2334.0591049999998,1280.7546650000011,647.78885100000014,1685.6568010000019,2089.6383030000011,2248.8218889999998,2195.6365019999962,1740.0945839999979,2808.603987000005,1180.483492999999,4212.7549979999994,3407.4136489999992,3356.2023430000072,2125.823621999999,1973.391359000002,397.05168800000041,789.2374479999994]
["ZAF",2016,"ZAF_2016_DHS",224,"Hygiene ladder","3,00 No facility","h_nfac",28.432937751529021,16.88087578573856,10.37945154962136,4.6269123060826454,2.4576779165457849,26.640791876508519,10.92536065619691,6.4155884200171158,2.627614325081737,2.1536346805151401,33.543637197049136,19.86354068580976,13.522651084783559,11.28652292422121,8.6563300135510879,"2 Eastern Cape","4 Free State","7 Gauteng","5 Kwazulu-Natal","9 Limpopo","8 Mpumalanga","6 North West","3 Northern Cape","1 Western Cape",19.57264517228349,12.32850870230731,15.43100250736512,18.017062223517851,4.588844004638859,7.0469544078352424,3.5080860618721852,8.4230808806631288,6.8450417130818577,2125.8544340000039,1255.293806000001,776.2409600000002,347.72202399999992,185.38928100000001,1269.2048680000021,512.88303100000007,306.24160499999999,125.49144699999999,102.705051,914.88927200000114,545.24089099999992,368.17681499999969,306.6238669999999,239.04365799999999,950.19416600000034,243.0544690000001,1424.174017000001,1237.4922859999999,183.01959299999999,213.403921,91.911118999999999,67.077844999999968,280.17308900000012]
["ZAF",2016,"ZAF_2016_DHS",225,"Place where household members wash their hands","1 Observed, fixed place","",17.74677077678059,30.809618407529531,51.567684080872652,76.869828051342978,93.097421537352162,30.573208625323481,59.800773229950742,75.553534692937248,91.338229349267593,94.120566775706109,14.140464334097389,15.93547118987593,19.620485807437781,27.70918952546382,52.100894151665621,"2 Eastern Cape","4 Free State","7 Gauteng","5 Kwazulu-Natal","9 Limpopo","8 Mpumalanga","6 North West","3 Northern Cape","1 Western Cape",41.000585855500738,64.549522205588985,64.894651989750884,53.338124914620089,20.045084966819289,44.901278229148389,46.265286557292761,66.821427064918225,83.043698014382784]
["ZAF",2016,"ZAF_2016_DHS",226,"Place where household members wash their hands","2 Observed, mobile place","",52.64634626325546,50.598676411942819,36.443283981726779,17.432002581636151,3.682901320112332,42.005687621863594,26.898182823223031,17.22273602508594,5.1374097378178094,2.789227948077047,51.029945660334477,62.910971690302063,64.941148123562044,58.921918054813133,38.427383096024421,"2 Eastern Cape","4 Free State","7 Gauteng","5 Kwazulu-Natal","9 Limpopo","8 Mpumalanga","6 North West","3 Northern Cape","1 Western Cape",39.132978201468617,21.75297446891275,17.89053013987315,26.39197181219064,74.682745949276494,46.321970842759278,50.007601793257663,24.357016691490738,9.5490845989808086]
["ZAF",2016,"ZAF_2016_DHS",227,"Place where household members wash their hands","3 Not observed: not in dwelling","",15.760544120057659,9.9509350554677365,5.9121413109100143,2.1235444322304668,1.0701869451688271,16.46837287356399,5.7940495131737464,2.8053086268762581,1.205194010519042,0.73473041235126813,15.2920960229218,12.66768327074336,8.0550332140370848,6.1576182049075499,6.1451100125024558,"2 Eastern Cape","4 Free State","7 Gauteng","5 Kwazulu-Natal","9 Limpopo","8 Mpumalanga","6 North West","3 Northern Cape","1 Western Cape",8.0651962387687632,3.3747808048924042,8.4110323439603984,11.70148807323543,3.7662727533973639,5.3978502645299384,1.718151661970035,5.6185445193746277,3.8523127676469868]
["ZAF",2016,"ZAF_2016_DHS",228,"Place where household members wash their hands","4 Not observed: no permission to see","",1.6403428777883211,2.05828611761951,1.795994797633337,1.1232278275150021,0.78119857074738286,1.063686340494616,2.6670703447478128,0.86354217365475672,0.92094548327765335,0.95718486082104826,1.935033387746254,1.609774683149408,2.2152795017971632,2.347297799772929,0.89266474500071857,"2 Eastern Cape","4 Free State","7 Gauteng","5 Kwazulu-Natal","9 Limpopo","8 Mpumalanga","6 North West","3 Northern Cape","1 Western Cape",0.36528712323846912,1.561504889363061,2.109301772397381,2.7479389135992629,0.71618991734938608,1.860935818979828,0.226988540944003,0.43512641259418089,0.60348443485220327]
["ZAF",2016,"ZAF_2016_DHS",229,"Place where household members wash their hands","5 Not observed: other reason","",12.20599596211812,6.5824840074403728,4.2808958288572736,2.4513971072755441,1.3682916266193279,9.8890445387544759,4.839924088905005,3.5548784814458978,1.398221419117897,1.3982900030445899,17.60246059489991,6.8760991659291477,5.1680533531657256,4.8639764150425524,2.4339479948067488,"2 Eastern Cape","4 Free State","7 Gauteng","5 Kwazulu-Natal","9 Limpopo","8 Mpumalanga","6 North West","3 Northern Cape","1 Western Cape",11.43595258102321,8.7612176312428165,6.6944837540181839,5.8204762863549782,0.7897064131573801,1.517964844582715,1.781971446535247,2.7678853116225661,2.9514201841372811]