{"text_format":"1","workbook":"xlsx","n_sheets":7,"sheets":["Introduction","Water","Sanitation","Hygiene","MICS06","DHS13","data_summary"],"not_rendered":{"charts":111,"images":76,"macros":1,"external_links":0,"defined_names":0,"comments":0,"pivot_tables":0},"unopened":[],"bounds":{"document_bytes":16777216,"sheet_cells":100000,"rows_first":2000,"rows_last":500,"rows_between":2000,"halvings":0,"cell_chars":16384,"cell_head_chars":4096},"cells_cut":0,"cells_raw":0,"read":"whole","date_system":"1900"}

{"sheet":"Introduction","index":0,"n_rows":55,"n_cols":12,"rows_kept":55,"cut":false,"hidden":false,"merged":[[112,0,112,1],[113,0,113,1],[207,0,207,1],[212,0,212,1],[213,0,213,1],[107,0,107,1],[1,0,1,1],[4,0,4,1],[5,0,5,1],[6,0,6,1],[7,0,7,1]]}
[]
[]
[]
[null,null,"Joint Monitoring Programme for Water Supply, Sanitation and Hygiene"]
[]
[null,null,"Estimates on household water, sanitation and hygiene \nby wealth quintile and sub-national region in"]
[null,null,{"$f":"+Water!B5","v":"Yemen"}]
[]
[null,null,"Updated May 2021"]
[]
[null,null,"Follow the links below to find the following information: "]
[]
[null,null,"JMP Estimates"]
[null,null,"WASH status and trends by wealth quintile \n(customized quintiles made without water and sanitation assets)"]
[null,null,"Water"]
[null,null,"Sanitation"]
[null,null,"Hygiene"]
[]
[null,null,"Data inputs"]
[null,null," customized wealth quintiles and subnational data:"]
[null,null,{"$f":"IF(INDIRECT(CONCATENATE(\"Water\",\"!B105\"))=0,\"\",INDIRECT(CONCATENATE(\"Water\",\"!B105\")))","v":"MICS06"}]
[null,null,{"$f":"IF(INDIRECT(CONCATENATE(\"Water\",\"!B106\"))=0,\"\",INDIRECT(CONCATENATE(\"Water\",\"!B106\")))","v":"DHS13"}]
[null,null,{"$f":"IF(INDIRECT(CONCATENATE(\"Water\",\"!B107\"))=0,\"\",INDIRECT(CONCATENATE(\"Water\",\"!B107\")))","v":""}]
[null,null,{"$f":"IF(INDIRECT(CONCATENATE(\"Water\",\"!B108\"))=0,\"\",INDIRECT(CONCATENATE(\"Water\",\"!B108\")))","v":""}]
[null,null,{"$f":"IF(INDIRECT(CONCATENATE(\"Water\",\"!B109\"))=0,\"\",INDIRECT(CONCATENATE(\"Water\",\"!B109\")))","v":""}]
[null,null,{"$f":"IF(INDIRECT(CONCATENATE(\"Water\",\"!B110\"))=0,\"\",INDIRECT(CONCATENATE(\"Water\",\"!B110\")))","v":""}]
[null,null,{"$f":"IF(INDIRECT(CONCATENATE(\"Water\",\"!B111\"))=0,\"\",INDIRECT(CONCATENATE(\"Water\",\"!B111\")))","v":""}]
[null,null,{"$f":"IF(INDIRECT(CONCATENATE(\"Water\",\"!B112\"))=0,\"\",INDIRECT(CONCATENATE(\"Water\",\"!B112\")))","v":""}]
[null,null,{"$f":"IF(INDIRECT(CONCATENATE(\"Water\",\"!B113\"))=0,\"\",INDIRECT(CONCATENATE(\"Water\",\"!B113\")))","v":""}]
[null,null,{"$f":"IF(INDIRECT(CONCATENATE(\"Water\",\"!B114\"))=0,\"\",INDIRECT(CONCATENATE(\"Water\",\"!B114\")))","v":""}]
[null,null,{"$f":"IF(INDIRECT(CONCATENATE(\"Water\",\"!B115\"))=0,\"\",INDIRECT(CONCATENATE(\"Water\",\"!B115\")))","v":""}]
[null,null,{"$f":"IF(INDIRECT(CONCATENATE(\"Water\",\"!B116\"))=0,\"\",INDIRECT(CONCATENATE(\"Water\",\"!B116\")))","v":""}]
[]
[]
[]
[]
[]
[]
[]
[]
[]
[]
[]
[]
[]
[]
[]
[]
[]
[]
[]
[]
[]
[]
[null,null,null,null,null,null,null,null,null,null,null,{"$f":"+IF(ISNUMBER(M48), \"\", \"Insufficient data to estimate safely managed sanitation services at national level\")","v":"Insufficient data to estimate safely managed sanitation services at national level"}]

{"sheet":"Water","index":1,"n_rows":318,"n_cols":28,"rows_kept":318,"cut":false,"hidden":false,"merged":[[317,1,317,11],[6,9,6,16],[6,17,6,24],[6,1,6,8],[4,1,4,24],[117,1,117,11],[30,21,30,24],[32,1,33,2],[32,3,33,3],[30,17,30,20],[30,1,31,4],[30,5,30,8],[30,9,30,12],[30,13,30,16],[96,23,96,27],[35,1,36,2],[35,3,36,3],[38,1,39,2],[38,3,39,3],[96,0,97,2],[96,3,96,7],[96,8,96,12],[96,13,96,17],[96,18,96,22],[217,18,217,22],[98,0,99,1],[100,0,101,1],[196,0,197,2],[196,3,196,7],[196,8,196,12],[217,1,217,11],[3,1,3,24],[317,18,317,22],[117,18,117,22],[196,18,196,22],[296,23,296,27],[298,0,299,1],[300,0,301,1],[296,0,297,2],[296,3,296,7],[296,8,296,12],[296,13,296,17],[296,18,296,22],[196,23,196,27],[198,0,199,1],[200,0,201,1],[196,13,196,17]]}
["BGD"]
[]
[]
[null,"Summary of trends in use of drinking water by wealth quintile (%)"]
[null,{"$f":"IF(ISERROR(INDIRECT(CONCATENATE($B105,\"!A2\"))),\"\",INDIRECT(CONCATENATE($B105,\"!A2\")))","v":"Yemen"}]
[]
[null,{"$f":"B118","v":"National use of drinking water sources, 2000–2019"},null,null,null,null,null,null,null,{"$f":"B218","v":"Urban use of drinking water sources,  2000–2019"},null,null,null,null,null,null,null,{"$f":"B318","v":"Rural use of drinking water sources, 2000–2019"}]
[]
[]
[]
[]
[]
[]
[]
[]
[]
[]
[]
[]
[]
[]
[]
[]
[]
[]
[]
[]
[]
[]
[]
[null,{"$f":"IF(ISERROR(INDIRECT(CONCATENATE($B105,\"!A2\"))),\"\",INDIRECT(CONCATENATE($B105,\"!A2\")))","v":"Yemen"},null,null,null,"Poorest",null,null,null,"Poor",null,null,null,"Middle",null,null,null,"Rich",null,null,null,"Richest"]
[null,null,null,null,null,"Basic","Limited","Unimproved","Surface \n water","Basic","Limited","Unimproved","Surface \nwater","Basic","Limited","Unimproved","Surface \nwater","Basic","Limited","Unimproved","Surface \nwater","Basic","Limited","Unimproved","Surface \nwater"]
[null,"NATIONAL",null,"Estimate",{"$f":"C99","v":2000},{"$f":"E99","v":18.870127598973241},{"$f":"F99","v":13.60006710782646},57.389675412490988,10.14012988070931,{"$f":"J99","v":42.955852392102123},{"$f":"K99","v":10.82856204883293},38.788129119610858,7.4274564394540903,{"$f":"O99","v":64.983129961541124},{"$f":"P99","v":6.7612674325574176},22.043128164913924,6.2124744409875348,{"$f":"T99","v":90.764916889831525},{"$f":"U99","v":1.9180093722987723},6.1375988901097145,1.179474847759991,{"$f":"Y99","v":95.510273964970779},{"$f":"Z99","v":2.8835235993209385},1.1994205634660489,0.40678187224222739]
[null,null,null,null,{"$f":"C100","v":2019},{"$f":"E100","v":34.854239069715447},25.120126393111892,37.01909789104684,3.0065366461258236,{"$f":"J100","v":60.076857738960236},15.144525029722127,22.369866707801179,2.4087505235164599,{"$f":"O100","v":79.867049433374362},8.3098872059243121,10.979000608160391,0.84406275254093543,{"$f":"T100","v":94.733679230371251},2.0018757341753664,2.9650037170816574,0.29944131837171994,{"$f":"Y100","v":96.098420722940276},2.9012801713216754,0.90116225893369517,9.9136846804356082E-2]
[]
[null,"URBAN",null,"Estimate",{"$f":"C199","v":2000},{"$f":"E199","v":90.666072686628709},{"$f":"F199","v":3.635469356232063},5.698457957139226,0,{"$f":"J199","v":94.602621692709761},{"$f":"K199","v":1.5864966462525507},3.8108816610376834,0,{"$f":"O199","v":94.607708427102793},{"$f":"P199","v":2.3944543975609593},2.9978371753362438,0,{"$f":"T199","v":96.003491250933152},{"$f":"U199","v":1.8870102664109936},2.1094984826558516,0,{"$f":"Y199","v":98.63089406772832},{"$f":"Z199","v":1.3691059322716939},0,0]
[null,null,null,null,{"$f":"C200","v":2019},{"$f":"E200","v":94.860082530903469},3.8036380417920492,1.3362794273044756,0,{"$f":"J200","v":98.350648520696637},1.6493514793033768,0,0,{"$f":"O200","v":97.531545351324723},2.4684546486752623,0,0,{"$f":"T200","v":98.072325468598549},1.9276745314014505,0,0,{"$f":"Y200","v":98.111339424225378},1.361893938998362,0.52676663677625868,0]
[]
[null,"RURAL",null,"Estimate",{"$f":"C299","v":2000},{"$f":"E299","v":15.498437300844181},{"$f":"F299","v":15.797363470108884},57.494411776437573,11.209787452609362,{"$f":"J299","v":27.344584487714609},{"$f":"K299","v":10.160166877567965},54.024485150853479,8.4707634838639478,{"$f":"O299","v":51.164849345685909},{"$f":"P299","v":10.763717663810514},30.303309289388835,7.7681237011147459,{"$f":"T299","v":59.379324243352691},{"$f":"U299","v":6.4121009495146462},27.308014417030336,6.9005603901023278,{"$f":"Y299","v":87.878820932404949},{"$f":"Z299","v":3.6141380060744872},6.2353641027430058,2.2716769587775616]
[null,null,null,null,{"$f":"C300","v":2019},{"$f":"E300","v":29.066215184826216},29.626829922400464,38.73673800031338,2.5702168924599391,{"$f":"J300","v":49.968527141004444},18.566329819602263,27.929067816560064,3.5360752228332331,{"$f":"O300","v":65.5469299315901},13.789323266573733,18.910642674578867,1.753104127257302,{"$f":"T300","v":77.573269218794636},8.3767816416413901,12.924905823663948,1.1250433159000295,{"$f":"Y300","v":89.776813910613001},3.6921955913381823,5.8720650911872667,0.65892540686155598]
[]
[]
[]
[]
[]
[]
[]
[]
[]
[]
[]
[]
[]
[]
[]
[]
[]
[]
[]
[]
[]
[]
[]
[]
[]
[]
[]
[]
[]
[]
[]
[]
[]
[]
[]
[]
[]
[]
[]
[]
[]
[]
[]
[]
[]
[]
[]
[]
[]
[]
[]
[]
[]
[]
[]
[]
["NATIONAL",null,null,"Poorest",null,null,null,null,"Poor",null,null,null,null,"Middle",null,null,null,null,"Rich",null,null,null,null,"Richest"]
[null,null,null,"Improved","Basic","Limited","Unimproved","Surface water","Improved","Basic","Limited","Unimproved","Surface water","Improved","Basic","Limited","Unimproved","Surface water","Improved","Basic","Limited","Unimproved","Surface water","Improved","Basic","Limited","Unimproved","Surface water"]
["Forecast period:",null,{"$f":"MinBase(C105:C116)","v":2000},{"$f":"IF((D101+H101)>100,D101*100/(D101+H101),D101)","v":32.470194706799703},{"$f":"D99*AVERAGEIF(E105:E116,\">0\")/100","v":18.870127598973241},{"$f":"D99*(100-AVERAGEIF(E105:E116,\">0\"))/100","v":13.60006710782646},{"$f":"100-(E99+F99+H99)","v":57.389675412490988},{"$f":"IF((D101+H101)>100,H101*100/(D101+H101),H101)","v":10.14012988070931},{"$f":"IF((I101+M101)>100,I101*100/(I101+M101),I101)","v":53.784414440935052},{"$f":"I99*AVERAGEIF(J105:J116,\">0\")/100","v":42.955852392102123},{"$f":"I99*(100-AVERAGEIF(J105:J116,\">0\"))/100","v":10.82856204883293},{"$f":"100-(J99+K99+M99)","v":38.788129119610858},{"$f":"IF((I101+M101)>100,M101*100/(I101+M101),M101)","v":7.4274564394540903},{"$f":"IF((N101+R101)>100,N101*100/(N101+R101),N101)","v":71.744397394098542},{"$f":"N99*AVERAGEIF(O105:O116,\">0\")/100","v":64.983129961541124},{"$f":"N99*(100-AVERAGEIF(O105:O116,\">0\"))/100","v":6.7612674325574176},{"$f":"100-(O99+P99+R99)","v":22.043128164913924},{"$f":"IF((N101+R101)>100,R101*100/(N101+R101),R101)","v":6.2124744409875348},{"$f":"IF((S101+W101)>100,S101*100/(S101+W101),S101)","v":92.682926262130309},{"$f":"S99*AVERAGEIF(T105:T116,\">0\")/100","v":90.764916889831525},{"$f":"S99*(100-AVERAGEIF(T105:T116,\">0\"))/100","v":1.9180093722987723},{"$f":"100-(T99+U99+W99)","v":6.1375988901097145},{"$f":"IF((S101+W101)>100,W101*100/(S101+W101),W101)","v":1.179474847759991},{"$f":"IF((X101+AB101)>100,X101*100/(X101+AB101),X101)","v":98.393797564291731},{"$f":"X99*AVERAGEIF(Y105:Y116,\">0\")/100","v":95.510273964970779},{"$f":"X99*(100-AVERAGEIF(Y105:Y116,\">0\"))/100","v":2.8835235993209385},{"$f":"100-(Y99+Z99+AB99)","v":1.1994205634660489},{"$f":"IF((X101+AB101)>100,AB101*100/(X101+AB101),AB101)","v":0.40678187224222739}]
[null,null,{"$f":"MaxTarget(C105:C116)","v":2019},{"$f":"IF((D102+H102)>100,D102*100/(D102+H102),D102)","v":59.974365462827336},{"$f":"D100*AVERAGEIF(E105:E116,\">0\")/100","v":34.854239069715447},{"$f":"D100*(100-AVERAGEIF(E105:E116,\">0\"))/100","v":25.120126393111892},{"$f":"100-(E100+F100+H100)","v":37.01909789104684},{"$f":"IF((D102+H102)>100,H102*100/(D102+H102),H102)","v":3.0065366461258236},{"$f":"IF((I102+M102)>100,I102*100/(I102+M102),I102)","v":75.221382768682361},{"$f":"I100*AVERAGEIF(J105:J116,\">0\")/100","v":60.076857738960236},{"$f":"I100*(100-AVERAGEIF(J105:J116,\">0\"))/100","v":15.144525029722127},{"$f":"100-(J100+K100+M100)","v":22.369866707801179},{"$f":"IF((I102+M102)>100,M102*100/(I102+M102),M102)","v":2.4087505235164599},{"$f":"IF((N102+R102)>100,N102*100/(N102+R102),N102)","v":88.176936639298674},{"$f":"N100*AVERAGEIF(O105:O116,\">0\")/100","v":79.867049433374362},{"$f":"N100*(100-AVERAGEIF(O105:O116,\">0\"))/100","v":8.3098872059243121},{"$f":"100-(O100+P100+R100)","v":10.979000608160391},{"$f":"IF((N102+R102)>100,R102*100/(N102+R102),R102)","v":0.84406275254093543},{"$f":"IF((S102+W102)>100,S102*100/(S102+W102),S102)","v":96.735554964546623},{"$f":"S100*AVERAGEIF(T105:T116,\">0\")/100","v":94.733679230371251},{"$f":"S100*(100-AVERAGEIF(T105:T116,\">0\"))/100","v":2.0018757341753664},{"$f":"100-(T100+U100+W100)","v":2.9650037170816574},{"$f":"IF((S102+W102)>100,W102*100/(S102+W102),W102)","v":0.29944131837171994},{"$f":"IF((X102+AB102)>100,X102*100/(X102+AB102),X102)","v":98.999700894261949},{"$f":"X100*AVERAGEIF(Y105:Y116,\">0\")/100","v":96.098420722940276},{"$f":"X100*(100-AVERAGEIF(Y105:Y116,\">0\"))/100","v":2.9012801713216754},{"$f":"100-(Y100+Z100+AB100)","v":0.90116225893369517},{"$f":"IF((X102+AB102)>100,AB102*100/(X102+AB102),AB102)","v":9.9136846804356082E-2}]
["Regression period:",null,{"$f":"MinRegYear(C99,C105:C116)","v":2004},{"$f":"IF(MAX(C105:C116)-MIN(C105:C116)<5,AVERAGEIF(C105:C116,\">0\",D105:D116),\nIF(FORECAST($C101,D$105:D$116,$C$105:$C$116)<0,0,\nIF(FORECAST($C101,D$105:D$116,$C$105:$C$116)>100,100,\nFORECAST($C101,D$105:D$116,$C$105:$C$116))))","v":32.470194706799703},null,null,null,{"$f":"IF(MAX(C105:C116)-MIN(C105:C116)<5,AVERAGEIF(C105:C116,\">0\",H105:H116),\nIF(FORECAST($C101,H$105:H$116,$C$105:$C$116)<0,0,\nIF(FORECAST($C101,H$105:H$116,$C$105:$C$116)>100,100,\nFORECAST($C101,H$105:H$116,$C$105:$C$116))))","v":10.14012988070931},{"$f":"IF(MAX(C105:C116)-MIN(C105:C116)<5,AVERAGEIF(C105:C116,\">0\",I105:I116),\nIF(FORECAST($C101,I$105:I$116,$C$105:$C$116)<0,0,\nIF(FORECAST($C101,I$105:I$116,$C$105:$C$116)>100,100,\nFORECAST($C101,I$105:I$116,$C$105:$C$116))))","v":53.784414440935052},null,null,null,{"$f":"IF(MAX(C105:C116)-MIN(C105:C116)<5,AVERAGEIF(C105:C116,\">0\",M105:M116),\nIF(FORECAST($C101,M$105:M$116,$C$105:$C$116)<0,0,\nIF(FORECAST($C101,M$105:M$116,$C$105:$C$116)>100,100,\nFORECAST($C101,M$105:M$116,$C$105:$C$116))))","v":7.4274564394540903},{"$f":"IF(MAX(C105:C116)-MIN(C105:C116)<5,AVERAGEIF(C105:C116,\">0\",N105:N116),\nIF(FORECAST($C101,N$105:N$116,$C$105:$C$116)<0,0,\nIF(FORECAST($C101,N$105:N$116,$C$105:$C$116)>100,100,\nFORECAST($C101,N$105:N$116,$C$105:$C$116))))","v":71.744397394098542},null,null,null,{"$f":"IF(MAX(C105:C116)-MIN(C105:C116)<5,AVERAGEIF(C105:C116,\">0\",R105:R116),\nIF(FORECAST($C101,R$105:R$116,$C$105:$C$116)<0,0,\nIF(FORECAST($C101,R$105:R$116,$C$105:$C$116)>100,100,\nFORECAST($C101,R$105:R$116,$C$105:$C$116))))","v":6.2124744409875348},{"$f":"IF(MAX(C105:C116)-MIN(C105:C116)<5,AVERAGEIF(C105:C116,\">0\",S105:S116),\nIF(FORECAST($C101,S$105:S$116,$C$105:$C$116)<0,0,\nIF(FORECAST($C101,S$105:S$116,$C$105:$C$116)>100,100,\nFORECAST($C101,S$105:S$116,$C$105:$C$116))))","v":92.682926262130309},null,null,null,{"$f":"IF(MAX(C105:C116)-MIN(C105:C116)<5,AVERAGEIF(C105:C116,\">0\",W105:W116),\nIF(FORECAST($C101,W$105:W$116,$C$105:$C$116)<0,0,\nIF(FORECAST($C101,W$105:W$116,$C$105:$C$116)>100,100,\nFORECAST($C101,W$105:W$116,$C$105:$C$116))))","v":1.179474847759991},{"$f":"IF(MAX(C105:C116)-MIN(C105:C116)<5,AVERAGEIF(C105:C116,\">0\",X105:X116),\nIF(FORECAST($C101,X$105:X$116,$C$105:$C$116)<0,0,\nIF(FORECAST($C101,X$105:X$116,$C$105:$C$116)>100,100,\nFORECAST($C101,X$105:X$116,$C$105:$C$116))))","v":98.393797564291731},null,null,null,{"$f":"IF(MAX(C105:C116)-MIN(C105:C116)<5,AVERAGEIF(C105:C116,\">0\",AB105:AB116),\nIF(FORECAST($C101,AB$105:AB$116,$C$105:$C$116)<0,0,\nIF(FORECAST($C101,AB$105:AB$116,$C$105:$C$116)>100,100,\nFORECAST($C101,AB$105:AB$116,$C$105:$C$116))))","v":0.40678187224222739}]
[null,null,{"$f":"MaxRegYear(C100,C105:C116)","v":2015},{"$f":"IF(MAX(C105:C116)-MIN(C105:C116)<5,AVERAGEIF(C105:C116,\">0\",D105:D116),\nIF(FORECAST($C102,D$105:D$116,$C$105:$C$116)<0,0,\nIF(FORECAST($C102,D$105:D$116,$C$105:$C$116)>100,100,\nFORECAST($C102,D$105:D$116,$C$105:$C$116))))","v":59.974365462827336},null,null,null,{"$f":"IF(MAX(C105:C116)-MIN(C105:C116)<5,AVERAGEIF(C105:C116,\">0\",H105:H116),\nIF(FORECAST($C102,H$105:H$116,$C$105:$C$116)<0,0,\nIF(FORECAST($C102,H$105:H$116,$C$105:$C$116)>100,100,\nFORECAST($C102,H$105:H$116,$C$105:$C$116))))","v":3.0065366461258236},{"$f":"IF(MAX(C105:C116)-MIN(C105:C116)<5,AVERAGEIF(C105:C116,\">0\",I105:I116),\nIF(FORECAST($C102,I$105:I$116,$C$105:$C$116)<0,0,\nIF(FORECAST($C102,I$105:I$116,$C$105:$C$116)>100,100,\nFORECAST($C102,I$105:I$116,$C$105:$C$116))))","v":75.221382768682361},null,null,null,{"$f":"IF(MAX(C105:C116)-MIN(C105:C116)<5,AVERAGEIF(C105:C116,\">0\",M105:M116),\nIF(FORECAST($C102,M$105:M$116,$C$105:$C$116)<0,0,\nIF(FORECAST($C102,M$105:M$116,$C$105:$C$116)>100,100,\nFORECAST($C102,M$105:M$116,$C$105:$C$116))))","v":2.4087505235164599},{"$f":"IF(MAX(C105:C116)-MIN(C105:C116)<5,AVERAGEIF(C105:C116,\">0\",N105:N116),\nIF(FORECAST($C102,N$105:N$116,$C$105:$C$116)<0,0,\nIF(FORECAST($C102,N$105:N$116,$C$105:$C$116)>100,100,\nFORECAST($C102,N$105:N$116,$C$105:$C$116))))","v":88.176936639298674},null,null,null,{"$f":"IF(MAX(C105:C116)-MIN(C105:C116)<5,AVERAGEIF(C105:C116,\">0\",R105:R116),\nIF(FORECAST($C102,R$105:R$116,$C$105:$C$116)<0,0,\nIF(FORECAST($C102,R$105:R$116,$C$105:$C$116)>100,100,\nFORECAST($C102,R$105:R$116,$C$105:$C$116))))","v":0.84406275254093543},{"$f":"IF(MAX(C105:C116)-MIN(C105:C116)<5,AVERAGEIF(C105:C116,\">0\",S105:S116),\nIF(FORECAST($C102,S$105:S$116,$C$105:$C$116)<0,0,\nIF(FORECAST($C102,S$105:S$116,$C$105:$C$116)>100,100,\nFORECAST($C102,S$105:S$116,$C$105:$C$116))))","v":96.735554964546623},null,null,null,{"$f":"IF(MAX(C105:C116)-MIN(C105:C116)<5,AVERAGEIF(C105:C116,\">0\",W105:W116),\nIF(FORECAST($C102,W$105:W$116,$C$105:$C$116)<0,0,\nIF(FORECAST($C102,W$105:W$116,$C$105:$C$116)>100,100,\nFORECAST($C102,W$105:W$116,$C$105:$C$116))))","v":0.29944131837171994},{"$f":"IF(MAX(C105:C116)-MIN(C105:C116)<5,AVERAGEIF(C105:C116,\">0\",X105:X116),\nIF(FORECAST($C102,X$105:X$116,$C$105:$C$116)<0,0,\nIF(FORECAST($C102,X$105:X$116,$C$105:$C$116)>100,100,\nFORECAST($C102,X$105:X$116,$C$105:$C$116))))","v":98.999700894261949},null,null,null,{"$f":"IF(MAX(C105:C116)-MIN(C105:C116)<5,AVERAGEIF(C105:C116,\">0\",AB105:AB116),\nIF(FORECAST($C102,AB$105:AB$116,$C$105:$C$116)<0,0,\nIF(FORECAST($C102,AB$105:AB$116,$C$105:$C$116)>100,100,\nFORECAST($C102,AB$105:AB$116,$C$105:$C$116))))","v":9.9136846804356082E-2}]
[]
[null,"Survey","Year","Improved","% Improved\n< = 30min",null,null,"Surface water","Improved","% Improved\n< = 30min",null,null,"Surface water","Improved","% Improved\n< = 30min",null,null,"Surface water","Improved","% Improved\n< = 30min",null,null,"Surface water","Improved","% Improved\n< = 30min",null,null,"Surface water"]
[null,"MICS06",2006,{"$f":"IF(ISERROR(INDIRECT(CONCATENATE($B105,\"!C16\"))),\"\",INDIRECT(CONCATENATE($B105,\"!C16\")))","v":37.470953026076685},{"$f":"IF(ISERROR(INDIRECT(CONCATENATE($B105,\"!C23\"))),\"\",INDIRECT(CONCATENATE($B105,\"!C23\")))","v":58.11522773228576},null,null,{"$f":"IF(ISERROR(INDIRECT(CONCATENATE($B105,\"!C21\"))),\"\",INDIRECT(CONCATENATE($B105,\"!C21\")))","v":8.8431129289669492},{"$f":"IF(ISERROR(INDIRECT(CONCATENATE($B105,\"!D16\"))),\"\",INDIRECT(CONCATENATE($B105,\"!D16\")))","v":57.682045045979905},{"$f":"IF(ISERROR(INDIRECT(CONCATENATE($B105,\"!D23\"))),\"\",INDIRECT(CONCATENATE($B105,\"!D23\")))","v":79.866728751458965},null,null,{"$f":"IF(ISERROR(INDIRECT(CONCATENATE($B105,\"!D21\"))),\"\",INDIRECT(CONCATENATE($B105,\"!D21\")))","v":6.5149644547381342},{"$f":"IF(ISERROR(INDIRECT(CONCATENATE($B105,\"!E16\"))),\"\",INDIRECT(CONCATENATE($B105,\"!E16\")))","v":74.732131802316559},{"$f":"IF(ISERROR(INDIRECT(CONCATENATE($B105,\"!E23\"))),\"\",INDIRECT(CONCATENATE($B105,\"!E23\")))","v":90.575894873829441},null,null,{"$f":"IF(ISERROR(INDIRECT(CONCATENATE($B105,\"!E21\"))),\"\",INDIRECT(CONCATENATE($B105,\"!E21\")))","v":5.236399588542624},{"$f":"IF(ISERROR(INDIRECT(CONCATENATE($B105,\"!F16\"))),\"\",INDIRECT(CONCATENATE($B105,\"!F16\")))","v":93.419767844387863},{"$f":"IF(ISERROR(INDIRECT(CONCATENATE($B105,\"!F23\"))),\"\",INDIRECT(CONCATENATE($B105,\"!F23\")))","v":97.930568822488226},null,null,{"$f":"IF(ISERROR(INDIRECT(CONCATENATE($B105,\"!F21\"))),\"\",INDIRECT(CONCATENATE($B105,\"!F21\")))","v":1.0194687515075649},{"$f":"IF(ISERROR(INDIRECT(CONCATENATE($B105,\"!G16\"))),\"\",INDIRECT(CONCATENATE($B105,\"!G16\")))","v":98.503961806104485},{"$f":"IF(ISERROR(INDIRECT(CONCATENATE($B105,\"!G23\"))),\"\",INDIRECT(CONCATENATE($B105,\"!G23\")))","v":97.069405114243295},null,null,{"$f":"IF(ISERROR(INDIRECT(CONCATENATE($B105,\"!G221\"))),\"\",INDIRECT(CONCATENATE($B105,\"!G21\")))","v":0.35084641307170344}]
[null,"DHS13",2013,54.973607143548818,"N/A",null,null,4.3035535978684045,71.32375216363711,"N/A",null,null,3.3212425082323569,85.189202231080188,"N/A",null,null,1.820137604985679,95.998713382289139,"N/A",null,null,0.45944741462412503,98.889536652449166,"N/A",null,null,0.15507230597487529]
[null,null,null,"","",null,null,"","","",null,null,"","","",null,null,"","","",null,null,"","","",null,null,""]
[null,null,null,"","",null,null,"","","",null,null,"","","",null,null,"","","",null,null,"","","",null,null,""]
[null,null,null,"","",null,null,"","","",null,null,"","","",null,null,"","","",null,null,"","","",null,null,""]
[null,null,null,"","",null,null,"","","",null,null,"","","",null,null,"","","",null,null,"","","",null,null,""]
[null,null,null,{"$f":"IF(ISERROR(INDIRECT(CONCATENATE($B111,\"!C16\"))),\"\",INDIRECT(CONCATENATE($B111,\"!C16\")))","v":""},{"$f":"IF(ISERROR(INDIRECT(CONCATENATE($B111,\"!C23\"))),\"\",INDIRECT(CONCATENATE($B111,\"!C23\")))","v":""},null,null,{"$f":"IF(ISERROR(INDIRECT(CONCATENATE($B111,\"!C21\"))),\"\",INDIRECT(CONCATENATE($B111,\"!C21\")))","v":""},{"$f":"IF(ISERROR(INDIRECT(CONCATENATE($B111,\"!D16\"))),\"\",INDIRECT(CONCATENATE($B111,\"!D16\")))","v":""},{"$f":"IF(ISERROR(INDIRECT(CONCATENATE($B111,\"!D23\"))),\"\",INDIRECT(CONCATENATE($B111,\"!D23\")))","v":""},null,null,{"$f":"IF(ISERROR(INDIRECT(CONCATENATE($B111,\"!D21\"))),\"\",INDIRECT(CONCATENATE($B111,\"!D21\")))","v":""},{"$f":"IF(ISERROR(INDIRECT(CONCATENATE($B111,\"!E16\"))),\"\",INDIRECT(CONCATENATE($B111,\"!E16\")))","v":""},{"$f":"IF(ISERROR(INDIRECT(CONCATENATE($B111,\"!E23\"))),\"\",INDIRECT(CONCATENATE($B111,\"!E23\")))","v":""},null,null,{"$f":"IF(ISERROR(INDIRECT(CONCATENATE($B111,\"!E21\"))),\"\",INDIRECT(CONCATENATE($B111,\"!E21\")))","v":""},{"$f":"IF(ISERROR(INDIRECT(CONCATENATE($B111,\"!F16\"))),\"\",INDIRECT(CONCATENATE($B111,\"!F16\")))","v":""},{"$f":"IF(ISERROR(INDIRECT(CONCATENATE($B111,\"!F23\"))),\"\",INDIRECT(CONCATENATE($B111,\"!F23\")))","v":""},null,null,{"$f":"IF(ISERROR(INDIRECT(CONCATENATE($B111,\"!F21\"))),\"\",INDIRECT(CONCATENATE($B111,\"!F21\")))","v":""},{"$f":"IF(ISERROR(INDIRECT(CONCATENATE($B111,\"!G16\"))),\"\",INDIRECT(CONCATENATE($B111,\"!G16\")))","v":""},{"$f":"IF(ISERROR(INDIRECT(CONCATENATE($B111,\"!G23\"))),\"\",INDIRECT(CONCATENATE($B111,\"!G23\")))","v":""},null,null,{"$f":"IF(ISERROR(INDIRECT(CONCATENATE($B111,\"!G221\"))),\"\",INDIRECT(CONCATENATE($B111,\"!G21\")))","v":""}]
[null,null,null,{"$f":"IF(ISERROR(INDIRECT(CONCATENATE($B112,\"!C16\"))),\"\",INDIRECT(CONCATENATE($B112,\"!C16\")))","v":""},{"$f":"IF(ISERROR(INDIRECT(CONCATENATE($B112,\"!C23\"))),\"\",INDIRECT(CONCATENATE($B112,\"!C23\")))","v":""},null,null,{"$f":"IF(ISERROR(INDIRECT(CONCATENATE($B112,\"!C21\"))),\"\",INDIRECT(CONCATENATE($B112,\"!C21\")))","v":""},{"$f":"IF(ISERROR(INDIRECT(CONCATENATE($B112,\"!D16\"))),\"\",INDIRECT(CONCATENATE($B112,\"!D16\")))","v":""},{"$f":"IF(ISERROR(INDIRECT(CONCATENATE($B112,\"!D23\"))),\"\",INDIRECT(CONCATENATE($B112,\"!D23\")))","v":""},null,null,{"$f":"IF(ISERROR(INDIRECT(CONCATENATE($B112,\"!D21\"))),\"\",INDIRECT(CONCATENATE($B112,\"!D21\")))","v":""},{"$f":"IF(ISERROR(INDIRECT(CONCATENATE($B112,\"!E16\"))),\"\",INDIRECT(CONCATENATE($B112,\"!E16\")))","v":""},{"$f":"IF(ISERROR(INDIRECT(CONCATENATE($B112,\"!E23\"))),\"\",INDIRECT(CONCATENATE($B112,\"!E23\")))","v":""},null,null,{"$f":"IF(ISERROR(INDIRECT(CONCATENATE($B112,\"!E21\"))),\"\",INDIRECT(CONCATENATE($B112,\"!E21\")))","v":""},{"$f":"IF(ISERROR(INDIRECT(CONCATENATE($B112,\"!F16\"))),\"\",INDIRECT(CONCATENATE($B112,\"!F16\")))","v":""},{"$f":"IF(ISERROR(INDIRECT(CONCATENATE($B112,\"!F23\"))),\"\",INDIRECT(CONCATENATE($B112,\"!F23\")))","v":""},null,null,{"$f":"IF(ISERROR(INDIRECT(CONCATENATE($B112,\"!F21\"))),\"\",INDIRECT(CONCATENATE($B112,\"!F21\")))","v":""},{"$f":"IF(ISERROR(INDIRECT(CONCATENATE($B112,\"!G16\"))),\"\",INDIRECT(CONCATENATE($B112,\"!G16\")))","v":""},{"$f":"IF(ISERROR(INDIRECT(CONCATENATE($B112,\"!G23\"))),\"\",INDIRECT(CONCATENATE($B112,\"!G23\")))","v":""},null,null,{"$f":"IF(ISERROR(INDIRECT(CONCATENATE($B112,\"!G221\"))),\"\",INDIRECT(CONCATENATE($B112,\"!G21\")))","v":""}]
[null,null,null,"","",null,null,"","","",null,null,"","","",null,null,"","","",null,null,"","","",null,null,""]
[null,null,null,"","",null,null,"","","",null,null,"","","",null,null,"","","",null,null,"","","",null,null,""]
[null,null,null,"","",null,null,"","","",null,null,"","","",null,null,"","","",null,null,"","","",null,null,""]
[null,null,null,"","",null,null,"","","",null,null,"","","",null,null,"","","",null,null,"","","",null,null,""]
[]
[null,{"$f":"CONCATENATE(\"National use of drinking water sources, \",C99,\"–\",C100)","v":"National use of drinking water sources, 2000–2019"},null,null,null,null,null,null,null,null,null,null,null,null,null,null,null,null,"Data points used for regression"]
[]
[]
[]
[]
[]
[]
[]
[]
[]
[]
[]
[]
[]
[]
[]
[]
[]
[]
[]
[]
[]
[]
[]
[]
[]
[]
[]
[]
[]
[]
[]
[]
[]
[]
[null,null,null,null,{"$f":"IF(ISERROR(INDIRECT(CONCATENATE($B153,\"!M18\"))),\"\",INDIRECT(CONCATENATE($B153,\"!M18\")))","v":""},{"$f":"IF(ISERROR(INDIRECT(CONCATENATE($B153,\"!M19\"))),\"\",INDIRECT(CONCATENATE($B153,\"!M19\")))","v":""},{"$f":"IF(ISERROR(INDIRECT(CONCATENATE($B153,\"!M20\"))),\"\",INDIRECT(CONCATENATE($B153,\"!M20\")))","v":""},{"$f":"IF(ISERROR(INDIRECT(CONCATENATE($B153,\"!M21\"))),\"\",INDIRECT(CONCATENATE($B153,\"!M21\")))","v":""},null,{"$f":"IF(ISERROR(INDIRECT(CONCATENATE($B153,\"!N18\"))),\"\",INDIRECT(CONCATENATE($B153,\"!N18\")))","v":""},{"$f":"IF(ISERROR(INDIRECT(CONCATENATE($B153,\"!N19\"))),\"\",INDIRECT(CONCATENATE($B153,\"!N19\")))","v":""},{"$f":"IF(ISERROR(INDIRECT(CONCATENATE($B153,\"!N20\"))),\"\",INDIRECT(CONCATENATE($B153,\"!N20\")))","v":""},{"$f":"IF(ISERROR(INDIRECT(CONCATENATE($B153,\"!N21\"))),\"\",INDIRECT(CONCATENATE($B153,\"!N21\")))","v":""},null,{"$f":"IF(ISERROR(INDIRECT(CONCATENATE($B153,\"!O18\"))),\"\",INDIRECT(CONCATENATE($B153,\"!O18\")))","v":""},{"$f":"IF(ISERROR(INDIRECT(CONCATENATE($B153,\"!O19\"))),\"\",INDIRECT(CONCATENATE($B153,\"!O19\")))","v":""},{"$f":"IF(ISERROR(INDIRECT(CONCATENATE($B153,\"!O20\"))),\"\",INDIRECT(CONCATENATE($B153,\"!O20\")))","v":""},{"$f":"IF(ISERROR(INDIRECT(CONCATENATE($B153,\"!O21\"))),\"\",INDIRECT(CONCATENATE($B153,\"!O21\")))","v":""},null,{"$f":"IF(ISERROR(INDIRECT(CONCATENATE($B153,\"!P18\"))),\"\",INDIRECT(CONCATENATE($B153,\"!P18\")))","v":""},{"$f":"IF(ISERROR(INDIRECT(CONCATENATE($B153,\"!P19\"))),\"\",INDIRECT(CONCATENATE($B153,\"!P19\")))","v":""},{"$f":"IF(ISERROR(INDIRECT(CONCATENATE($B153,\"!P20\"))),\"\",INDIRECT(CONCATENATE($B153,\"!P20\")))","v":""},{"$f":"IF(ISERROR(INDIRECT(CONCATENATE($B153,\"!P21\"))),\"\",INDIRECT(CONCATENATE($B153,\"!P21\")))","v":""},null,{"$f":"IF(ISERROR(INDIRECT(CONCATENATE($B153,\"!Q18\"))),\"\",INDIRECT(CONCATENATE($B153,\"!Q18\")))","v":""},{"$f":"IF(ISERROR(INDIRECT(CONCATENATE($B153,\"!Q19\"))),\"\",INDIRECT(CONCATENATE($B153,\"!Q19\")))","v":""},{"$f":"IF(ISERROR(INDIRECT(CONCATENATE($B153,\"!Q20\"))),\"\",INDIRECT(CONCATENATE($B153,\"!Q20\")))","v":""},{"$f":"IF(ISERROR(INDIRECT(CONCATENATE($B153,\"!Q21\"))),\"\",INDIRECT(CONCATENATE($B153,\"!Q1\")))","v":""}]
[null,null,null,null,"","","","",null,"","","","",null,"","","","",null,"","","","",null,"","","",""]
[null,null,null,null,"","","","",null,"","","","",null,"","","","",null,"","","","",null,"","","",""]
[null,null,null,null,"","","","",null,"","","","",null,"","","","",null,"","","","",null,"","","",""]
[null,null,null,null,"","","","",null,"","","","",null,"","","","",null,"","","","",null,"","","",""]
[null,null,null,null,"","","","",null,"","","","",null,"","","","",null,"","","","",null,"","","",""]
[]
[]
[]
[]
[]
[]
[]
[]
[]
[]
[]
[]
[]
[]
[]
[]
[]
[]
[]
[]
[]
[]
[]
[]
[]
[]
[]
[]
[]
[]
[]
[]
[]
[]
[]
[]
[]
[]
["URBAN",null,null,"Poorest",null,null,null,null,"Poor",null,null,null,null,"Middle",null,null,null,null,"Rich",null,null,null,null,"Richest"]
[null,null,null,"Improved","Basic","Limited","Unimproved","Surface water","Improved","Basic","Limited","Unimproved","Surface water","Improved","Basic","Limited","Unimproved","Surface water","Improved","Basic","Limited","Unimproved","Surface water","Improved","Basic","Limited","Unimproved","Surface water"]
["Forecast period:",null,{"$f":"MinBase(C205:C216)","v":2000},{"$f":"IF((D201+H201)>100,D201*100/(D201+H201),D201)","v":94.301542042860774},{"$f":"D199*AVERAGEIF(E205:E216,\">0\")/100","v":90.666072686628709},{"$f":"D199*(100-AVERAGEIF(E205:E216,\">0\"))/100","v":3.635469356232063},{"$f":"100-(E199+F199+H199)","v":5.698457957139226},{"$f":"IF((D201+H201)>100,H201*100/(D201+H201),H201)","v":0},{"$f":"IF((I201+M201)>100,I201*100/(I201+M201),I201)","v":96.189118338962317},{"$f":"I199*AVERAGEIF(J205:J216,\">0\")/100","v":94.602621692709761},{"$f":"I199*(100-AVERAGEIF(J205:J216,\">0\"))/100","v":1.5864966462525507},{"$f":"100-(J199+K199+M199)","v":3.8108816610376834},{"$f":"IF((I201+M201)>100,M201*100/(I201+M201),M201)","v":0},{"$f":"IF((N201+R201)>100,N201*100/(N201+R201),N201)","v":97.002162824663742},{"$f":"N199*AVERAGEIF(O205:O216,\">0\")/100","v":94.607708427102793},{"$f":"N199*(100-AVERAGEIF(O205:O216,\">0\"))/100","v":2.3944543975609593},{"$f":"100-(O199+P199+R199)","v":2.9978371753362438},{"$f":"IF((N201+R201)>100,R201*100/(N201+R201),R201)","v":0},{"$f":"IF((S201+W201)>100,S201*100/(S201+W201),S201)","v":97.890501517344148},{"$f":"S199*AVERAGEIF(T205:T216,\">0\")/100","v":96.003491250933152},{"$f":"S199*(100-AVERAGEIF(T205:T216,\">0\"))/100","v":1.8870102664109936},{"$f":"100-(T199+U199+W199)","v":2.1094984826558516},{"$f":"IF((S201+W201)>100,W201*100/(S201+W201),W201)","v":0},{"$f":"IF((X201+AB201)>100,X201*100/(X201+AB201),X201)","v":100},{"$f":"X199*AVERAGEIF(Y205:Y216,\">0\")/100","v":98.63089406772832},{"$f":"X199*(100-AVERAGEIF(Y205:Y216,\">0\"))/100","v":1.3691059322716939},{"$f":"100-(Y199+Z199+AB199)","v":0},{"$f":"IF((X201+AB201)>100,AB201*100/(X201+AB201),AB201)","v":0}]
[null,null,{"$f":"MaxTarget(C205:C216)","v":2019},{"$f":"IF((D202+H202)>100,D202*100/(D202+H202),D202)","v":98.663720572695524},{"$f":"D200*AVERAGEIF(E205:E216,\">0\")/100","v":94.860082530903469},{"$f":"D200*(100-AVERAGEIF(E205:E216,\">0\"))/100","v":3.8036380417920492},{"$f":"100-(E200+F200+H200)","v":1.3362794273044756},{"$f":"IF((D202+H202)>100,H202*100/(D202+H202),H202)","v":0},{"$f":"IF((I202+M202)>100,I202*100/(I202+M202),I202)","v":100},{"$f":"I200*AVERAGEIF(J205:J216,\">0\")/100","v":98.350648520696637},{"$f":"I200*(100-AVERAGEIF(J205:J216,\">0\"))/100","v":1.6493514793033768},{"$f":"100-(J200+K200+M200)","v":0},{"$f":"IF((I202+M202)>100,M202*100/(I202+M202),M202)","v":0},{"$f":"IF((N202+R202)>100,N202*100/(N202+R202),N202)","v":100},{"$f":"N200*AVERAGEIF(O205:O216,\">0\")/100","v":97.531545351324723},{"$f":"N200*(100-AVERAGEIF(O205:O216,\">0\"))/100","v":2.4684546486752623},{"$f":"100-(O200+P200+R200)","v":0},{"$f":"IF((N202+R202)>100,R202*100/(N202+R202),R202)","v":0},{"$f":"IF((S202+W202)>100,S202*100/(S202+W202),S202)","v":100},{"$f":"S200*AVERAGEIF(T205:T216,\">0\")/100","v":98.072325468598549},{"$f":"S200*(100-AVERAGEIF(T205:T216,\">0\"))/100","v":1.9276745314014505},{"$f":"100-(T200+U200+W200)","v":0},{"$f":"IF((S202+W202)>100,W202*100/(S202+W202),W202)","v":0},{"$f":"IF((X202+AB202)>100,X202*100/(X202+AB202),X202)","v":99.473233363223741},{"$f":"X200*AVERAGEIF(Y205:Y216,\">0\")/100","v":98.111339424225378},{"$f":"X200*(100-AVERAGEIF(Y205:Y216,\">0\"))/100","v":1.361893938998362},{"$f":"100-(Y200+Z200+AB200)","v":0.52676663677625868},{"$f":"IF((X202+AB202)>100,AB202*100/(X202+AB202),AB202)","v":0}]
["Regression period:",null,{"$f":"MinRegYear(C199,C205:C216)","v":2004},{"$f":"IF(MAX(C205:C216)-MIN(C205:C216)<5,AVERAGEIF(C205:C216,\">0\",D205:D216),\nIF(FORECAST($C201,D$205:D$216,$C$205:$C$216)<0,0,\nIF(FORECAST($C201,D$205:D$216,$C$205:$C$216)>100,100,\nFORECAST($C201,D$205:D$216,$C$205:$C$216))))","v":94.301542042860774},null,null,null,{"$f":"IF(MAX(C205:C216)-MIN(C205:C216)<5,AVERAGEIF(C205:C216,\">0\",H205:H216),\nIF(FORECAST($C201,H$205:H$216,$C$205:$C$216)<0,0,\nIF(FORECAST($C201,H$205:H$216,$C$205:$C$216)>100,100,\nFORECAST($C201,H$205:H$216,$C$205:$C$216))))","v":0},{"$f":"IF(MAX(C205:C216)-MIN(C205:C216)<5,AVERAGEIF(C205:C216,\">0\",I205:I216),\nIF(FORECAST($C201,I$205:I$216,$C$205:$C$216)<0,0,\nIF(FORECAST($C201,I$205:I$216,$C$205:$C$216)>100,100,\nFORECAST($C201,I$205:I$216,$C$205:$C$216))))","v":96.189118338962317},null,null,null,{"$f":"IF(MAX(C205:C216)-MIN(C205:C216)<5,AVERAGEIF(C205:C216,\">0\",M205:M216),\nIF(FORECAST($C201,M$205:M$216,$C$205:$C$216)<0,0,\nIF(FORECAST($C201,M$205:M$216,$C$205:$C$216)>100,100,\nFORECAST($C201,M$205:M$216,$C$205:$C$216))))","v":0},{"$f":"IF(MAX(C205:C216)-MIN(C205:C216)<5,AVERAGEIF(C205:C216,\">0\",N205:N216),\nIF(FORECAST($C201,N$205:N$216,$C$205:$C$216)<0,0,\nIF(FORECAST($C201,N$205:N$216,$C$205:$C$216)>100,100,\nFORECAST($C201,N$205:N$216,$C$205:$C$216))))","v":97.002162824663742},null,null,null,{"$f":"IF(MAX(C205:C216)-MIN(C205:C216)<5,AVERAGEIF(C205:C216,\">0\",R205:R216),\nIF(FORECAST($C201,R$205:R$216,$C$205:$C$216)<0,0,\nIF(FORECAST($C201,R$205:R$216,$C$205:$C$216)>100,100,\nFORECAST($C201,R$205:R$216,$C$205:$C$216))))","v":0},{"$f":"IF(MAX(C205:C216)-MIN(C205:C216)<5,AVERAGEIF(C205:C216,\">0\",S205:S216),\nIF(FORECAST($C201,S$205:S$216,$C$205:$C$216)<0,0,\nIF(FORECAST($C201,S$205:S$216,$C$205:$C$216)>100,100,\nFORECAST($C201,S$205:S$216,$C$205:$C$216))))","v":97.890501517344148},null,null,null,{"$f":"IF(MAX(C205:C216)-MIN(C205:C216)<5,AVERAGEIF(C205:C216,\">0\",W205:W216),\nIF(FORECAST($C201,W$205:W$216,$C$205:$C$216)<0,0,\nIF(FORECAST($C201,W$205:W$216,$C$205:$C$216)>100,100,\nFORECAST($C201,W$205:W$216,$C$205:$C$216))))","v":0},{"$f":"IF(MAX(C205:C216)-MIN(C205:C216)<5,AVERAGEIF(C205:C216,\">0\",X205:X216),\nIF(FORECAST($C201,X$205:X$216,$C$205:$C$216)<0,0,\nIF(FORECAST($C201,X$205:X$216,$C$205:$C$216)>100,100,\nFORECAST($C201,X$205:X$216,$C$205:$C$216))))","v":100},null,null,null,{"$f":"IF(MAX(C205:C216)-MIN(C205:C216)<5,AVERAGEIF(C205:C216,\">0\",AB205:AB216),\nIF(FORECAST($C201,AB$205:AB$216,$C$205:$C$216)<0,0,\nIF(FORECAST($C201,AB$205:AB$216,$C$205:$C$216)>100,100,\nFORECAST($C201,AB$205:AB$216,$C$205:$C$216))))","v":0}]
[null,null,{"$f":"MaxRegYear(C200,C205:C216)","v":2015},{"$f":"IF(MAX(C205:C216)-MIN(C205:C216)<5,AVERAGEIF(C205:C216,\">0\",D205:D216),\nIF(FORECAST($C202,D$205:D$216,$C$205:$C$216)<0,0,\nIF(FORECAST($C202,D$205:D$216,$C$205:$C$216)>100,100,\nFORECAST($C202,D$205:D$216,$C$205:$C$216))))","v":98.663720572695524},null,null,null,{"$f":"IF(MAX(C205:C216)-MIN(C205:C216)<5,AVERAGEIF(C205:C216,\">0\",H205:H216),\nIF(FORECAST($C202,H$205:H$216,$C$205:$C$216)<0,0,\nIF(FORECAST($C202,H$205:H$216,$C$205:$C$216)>100,100,\nFORECAST($C202,H$205:H$216,$C$205:$C$216))))","v":0},{"$f":"IF(MAX(C205:C216)-MIN(C205:C216)<5,AVERAGEIF(C205:C216,\">0\",I205:I216),\nIF(FORECAST($C202,I$205:I$216,$C$205:$C$216)<0,0,\nIF(FORECAST($C202,I$205:I$216,$C$205:$C$216)>100,100,\nFORECAST($C202,I$205:I$216,$C$205:$C$216))))","v":100},null,null,null,{"$f":"IF(MAX(C205:C216)-MIN(C205:C216)<5,AVERAGEIF(C205:C216,\">0\",M205:M216),\nIF(FORECAST($C202,M$205:M$216,$C$205:$C$216)<0,0,\nIF(FORECAST($C202,M$205:M$216,$C$205:$C$216)>100,100,\nFORECAST($C202,M$205:M$216,$C$205:$C$216))))","v":0},{"$f":"IF(MAX(C205:C216)-MIN(C205:C216)<5,AVERAGEIF(C205:C216,\">0\",N205:N216),\nIF(FORECAST($C202,N$205:N$216,$C$205:$C$216)<0,0,\nIF(FORECAST($C202,N$205:N$216,$C$205:$C$216)>100,100,\nFORECAST($C202,N$205:N$216,$C$205:$C$216))))","v":100},null,null,null,{"$f":"IF(MAX(C205:C216)-MIN(C205:C216)<5,AVERAGEIF(C205:C216,\">0\",R205:R216),\nIF(FORECAST($C202,R$205:R$216,$C$205:$C$216)<0,0,\nIF(FORECAST($C202,R$205:R$216,$C$205:$C$216)>100,100,\nFORECAST($C202,R$205:R$216,$C$205:$C$216))))","v":0},{"$f":"IF(MAX(C205:C216)-MIN(C205:C216)<5,AVERAGEIF(C205:C216,\">0\",S205:S216),\nIF(FORECAST($C202,S$205:S$216,$C$205:$C$216)<0,0,\nIF(FORECAST($C202,S$205:S$216,$C$205:$C$216)>100,100,\nFORECAST($C202,S$205:S$216,$C$205:$C$216))))","v":100},null,null,null,{"$f":"IF(MAX(C205:C216)-MIN(C205:C216)<5,AVERAGEIF(C205:C216,\">0\",W205:W216),\nIF(FORECAST($C202,W$205:W$216,$C$205:$C$216)<0,0,\nIF(FORECAST($C202,W$205:W$216,$C$205:$C$216)>100,100,\nFORECAST($C202,W$205:W$216,$C$205:$C$216))))","v":0},{"$f":"IF(MAX(C205:C216)-MIN(C205:C216)<5,AVERAGEIF(C205:C216,\">0\",X205:X216),\nIF(FORECAST($C202,X$205:X$216,$C$205:$C$216)<0,0,\nIF(FORECAST($C202,X$205:X$216,$C$205:$C$216)>100,100,\nFORECAST($C202,X$205:X$216,$C$205:$C$216))))","v":99.473233363223741},null,null,null,{"$f":"IF(MAX(C205:C216)-MIN(C205:C216)<5,AVERAGEIF(C205:C216,\">0\",AB205:AB216),\nIF(FORECAST($C202,AB$205:AB$216,$C$205:$C$216)<0,0,\nIF(FORECAST($C202,AB$205:AB$216,$C$205:$C$216)>100,100,\nFORECAST($C202,AB$205:AB$216,$C$205:$C$216))))","v":0}]
[]
[null,"Survey","Year","Improved","% Improved\n< = 30min",null,null,"Surface water","Improved","% Improved\n< = 30min",null,null,"Surface water","Improved","% Improved\n< = 30min",null,null,"Surface water","Improved","% Improved\n< = 30min",null,null,"Surface water","Improved","% Improved\n< = 30min",null,null,"Surface water"]
[null,"MICS06",2006,{"$f":"IF(ISERROR(INDIRECT(CONCATENATE($B205,\"!H16\"))),\"\",INDIRECT(CONCATENATE($B205,\"!H16\")))","v":95.094665411921568},{"$f":"IF(ISERROR(INDIRECT(CONCATENATE($B205,\"!H23\"))),\"\",INDIRECT(CONCATENATE($B205,\"!H23\")))","v":96.144846332863025},null,null,{"$f":"IF(ISERROR(INDIRECT(CONCATENATE($B205,\"!H21\"))),\"\",INDIRECT(CONCATENATE($B205,\"!H21\")))","v":0},{"$f":"IF(ISERROR(INDIRECT(CONCATENATE($B205,\"!I16\"))),\"\",INDIRECT(CONCATENATE($B205,\"!I16\")))","v":96.890455270907538},{"$f":"IF(ISERROR(INDIRECT(CONCATENATE($B205,\"!I23\"))),\"\",INDIRECT(CONCATENATE($B205,\"!I23\")))","v":98.350648520696623},null,null,{"$f":"IF(ISERROR(INDIRECT(CONCATENATE($B205,\"!I21\"))),\"\",INDIRECT(CONCATENATE($B205,\"!I21\")))","v":0},{"$f":"IF(ISERROR(INDIRECT(CONCATENATE($B205,\"!J16\"))),\"\",INDIRECT(CONCATENATE($B205,\"!J16\")))","v":97.614137988894981},{"$f":"IF(ISERROR(INDIRECT(CONCATENATE($B205,\"!J23\"))),\"\",INDIRECT(CONCATENATE($B205,\"!J23\")))","v":97.531545351324738},null,null,{"$f":"IF(ISERROR(INDIRECT(CONCATENATE($B205,\"!J21\"))),\"\",INDIRECT(CONCATENATE($B205,\"!J21\")))","v":0},{"$f":"IF(ISERROR(INDIRECT(CONCATENATE($B205,\"!K16\"))),\"\",INDIRECT(CONCATENATE($B205,\"!K16\")))","v":98.307922264614191},{"$f":"IF(ISERROR(INDIRECT(CONCATENATE($B205,\"!K23\"))),\"\",INDIRECT(CONCATENATE($B205,\"!K23\")))","v":98.072325468598549},null,null,{"$f":"IF(ISERROR(INDIRECT(CONCATENATE($B205,\"!K21\"))),\"\",INDIRECT(CONCATENATE($B205,\"!K21\")))","v":0},{"$f":"IF(ISERROR(INDIRECT(CONCATENATE($B205,\"!L16\"))),\"\",INDIRECT(CONCATENATE($B205,\"!L16\")))","v":100},{"$f":"IF(ISERROR(INDIRECT(CONCATENATE($B205,\"!L23\"))),\"\",INDIRECT(CONCATENATE($B205,\"!L23\")))","v":98.630894067728306},null,null,{"$f":"IF(ISERROR(INDIRECT(CONCATENATE($B205,\"!L221\"))),\"\",INDIRECT(CONCATENATE($B205,\"!L21\")))","v":0}]
[null,"DHS13",2013,97.870597203634574,"N/A",null,null,0,99.34513453271552,"N/A",null,null,0,99.756051063704632,"N/A",null,null,0,99.768894880059477,"N/A",null,null,0,99.590292615840696,"N/A",null,null,0]
[null,null,null,"","",null,null,"","","",null,null,"","","",null,null,"","","",null,null,"","","",null,null,""]
[null,null,null,"","",null,null,"","","",null,null,"","","",null,null,"","","",null,null,"","","",null,null,""]
[null,null,null,"","",null,null,"","","",null,null,"","","",null,null,"","","",null,null,"","","",null,null,""]
[null,null,null,"","",null,null,"","","",null,null,"","","",null,null,"","","",null,null,"","","",null,null,""]
[null,null,null,"","",null,null,"","","",null,null,"","","",null,null,"","","",null,null,"","","",null,null,""]
[null,null,null,"","",null,null,"","","",null,null,"","","",null,null,"","","",null,null,"","","",null,null,""]
[null,null,null,"","",null,null,"","","",null,null,"","","",null,null,"","","",null,null,"","","",null,null,""]
[null,null,null,"","",null,null,"","","",null,null,"","","",null,null,"","","",null,null,"","","",null,null,""]
[null,null,null,"","",null,null,"","","",null,null,"","","",null,null,"","","",null,null,"","","",null,null,""]
[null,null,null,"","",null,null,"","","",null,null,"","","",null,null,"","","",null,null,"","","",null,null,""]
[]
[null,{"$f":"CONCATENATE(\"Urban use of drinking water sources,  \",C199,\"–\",C200)","v":"Urban use of drinking water sources,  2000–2019"},null,null,null,null,null,null,null,null,null,null,null,null,null,null,null,null,"Data points used for regression"]
[]
[]
[]
[]
[]
[]
[]
[]
[]
[]
[]
[]
[]
[]
[]
[]
[]
[]
[]
[]
[]
[]
[]
[]
[]
[]
[]
[]
[]
[]
[]
[]
[]
[]
[null,null,null,null,{"$f":"IF(ISERROR(INDIRECT(CONCATENATE($B253,\"!M18\"))),\"\",INDIRECT(CONCATENATE($B253,\"!M18\")))","v":""},{"$f":"IF(ISERROR(INDIRECT(CONCATENATE($B253,\"!M19\"))),\"\",INDIRECT(CONCATENATE($B253,\"!M19\")))","v":""},{"$f":"IF(ISERROR(INDIRECT(CONCATENATE($B253,\"!M20\"))),\"\",INDIRECT(CONCATENATE($B253,\"!M20\")))","v":""},{"$f":"IF(ISERROR(INDIRECT(CONCATENATE($B253,\"!M21\"))),\"\",INDIRECT(CONCATENATE($B253,\"!M21\")))","v":""},null,{"$f":"IF(ISERROR(INDIRECT(CONCATENATE($B253,\"!N18\"))),\"\",INDIRECT(CONCATENATE($B253,\"!N18\")))","v":""},{"$f":"IF(ISERROR(INDIRECT(CONCATENATE($B253,\"!N19\"))),\"\",INDIRECT(CONCATENATE($B253,\"!N19\")))","v":""},{"$f":"IF(ISERROR(INDIRECT(CONCATENATE($B253,\"!N20\"))),\"\",INDIRECT(CONCATENATE($B253,\"!N20\")))","v":""},{"$f":"IF(ISERROR(INDIRECT(CONCATENATE($B253,\"!N21\"))),\"\",INDIRECT(CONCATENATE($B253,\"!N21\")))","v":""},null,{"$f":"IF(ISERROR(INDIRECT(CONCATENATE($B253,\"!O18\"))),\"\",INDIRECT(CONCATENATE($B253,\"!O18\")))","v":""},{"$f":"IF(ISERROR(INDIRECT(CONCATENATE($B253,\"!O19\"))),\"\",INDIRECT(CONCATENATE($B253,\"!O19\")))","v":""},{"$f":"IF(ISERROR(INDIRECT(CONCATENATE($B253,\"!O20\"))),\"\",INDIRECT(CONCATENATE($B253,\"!O20\")))","v":""},{"$f":"IF(ISERROR(INDIRECT(CONCATENATE($B253,\"!O21\"))),\"\",INDIRECT(CONCATENATE($B253,\"!O21\")))","v":""},null,{"$f":"IF(ISERROR(INDIRECT(CONCATENATE($B253,\"!P18\"))),\"\",INDIRECT(CONCATENATE($B253,\"!P18\")))","v":""},{"$f":"IF(ISERROR(INDIRECT(CONCATENATE($B253,\"!P19\"))),\"\",INDIRECT(CONCATENATE($B253,\"!P19\")))","v":""},{"$f":"IF(ISERROR(INDIRECT(CONCATENATE($B253,\"!P20\"))),\"\",INDIRECT(CONCATENATE($B253,\"!P20\")))","v":""},{"$f":"IF(ISERROR(INDIRECT(CONCATENATE($B253,\"!P21\"))),\"\",INDIRECT(CONCATENATE($B253,\"!P21\")))","v":""},null,{"$f":"IF(ISERROR(INDIRECT(CONCATENATE($B253,\"!Q18\"))),\"\",INDIRECT(CONCATENATE($B253,\"!Q18\")))","v":""},{"$f":"IF(ISERROR(INDIRECT(CONCATENATE($B253,\"!Q19\"))),\"\",INDIRECT(CONCATENATE($B253,\"!Q19\")))","v":""},{"$f":"IF(ISERROR(INDIRECT(CONCATENATE($B253,\"!Q20\"))),\"\",INDIRECT(CONCATENATE($B253,\"!Q20\")))","v":""},{"$f":"IF(ISERROR(INDIRECT(CONCATENATE($B253,\"!Q21\"))),\"\",INDIRECT(CONCATENATE($B253,\"!Q1\")))","v":""}]
[null,null,null,null,{"$f":"IF(ISERROR(INDIRECT(CONCATENATE($B254,\"!M18\"))),\"\",INDIRECT(CONCATENATE($B254,\"!M18\")))","v":""},{"$f":"IF(ISERROR(INDIRECT(CONCATENATE($B254,\"!M19\"))),\"\",INDIRECT(CONCATENATE($B254,\"!M19\")))","v":""},{"$f":"IF(ISERROR(INDIRECT(CONCATENATE($B254,\"!M20\"))),\"\",INDIRECT(CONCATENATE($B254,\"!M20\")))","v":""},{"$f":"IF(ISERROR(INDIRECT(CONCATENATE($B254,\"!M21\"))),\"\",INDIRECT(CONCATENATE($B254,\"!M21\")))","v":""},null,{"$f":"IF(ISERROR(INDIRECT(CONCATENATE($B254,\"!N18\"))),\"\",INDIRECT(CONCATENATE($B254,\"!N18\")))","v":""},{"$f":"IF(ISERROR(INDIRECT(CONCATENATE($B254,\"!N19\"))),\"\",INDIRECT(CONCATENATE($B254,\"!N19\")))","v":""},{"$f":"IF(ISERROR(INDIRECT(CONCATENATE($B254,\"!N20\"))),\"\",INDIRECT(CONCATENATE($B254,\"!N20\")))","v":""},{"$f":"IF(ISERROR(INDIRECT(CONCATENATE($B254,\"!N21\"))),\"\",INDIRECT(CONCATENATE($B254,\"!N21\")))","v":""},null,{"$f":"IF(ISERROR(INDIRECT(CONCATENATE($B254,\"!O18\"))),\"\",INDIRECT(CONCATENATE($B254,\"!O18\")))","v":""},{"$f":"IF(ISERROR(INDIRECT(CONCATENATE($B254,\"!O19\"))),\"\",INDIRECT(CONCATENATE($B254,\"!O19\")))","v":""},{"$f":"IF(ISERROR(INDIRECT(CONCATENATE($B254,\"!O20\"))),\"\",INDIRECT(CONCATENATE($B254,\"!O20\")))","v":""},{"$f":"IF(ISERROR(INDIRECT(CONCATENATE($B254,\"!O21\"))),\"\",INDIRECT(CONCATENATE($B254,\"!O21\")))","v":""},null,{"$f":"IF(ISERROR(INDIRECT(CONCATENATE($B254,\"!P18\"))),\"\",INDIRECT(CONCATENATE($B254,\"!P18\")))","v":""},{"$f":"IF(ISERROR(INDIRECT(CONCATENATE($B254,\"!P19\"))),\"\",INDIRECT(CONCATENATE($B254,\"!P19\")))","v":""},{"$f":"IF(ISERROR(INDIRECT(CONCATENATE($B254,\"!P20\"))),\"\",INDIRECT(CONCATENATE($B254,\"!P20\")))","v":""},{"$f":"IF(ISERROR(INDIRECT(CONCATENATE($B254,\"!P21\"))),\"\",INDIRECT(CONCATENATE($B254,\"!P21\")))","v":""},null,{"$f":"IF(ISERROR(INDIRECT(CONCATENATE($B254,\"!Q18\"))),\"\",INDIRECT(CONCATENATE($B254,\"!Q18\")))","v":""},{"$f":"IF(ISERROR(INDIRECT(CONCATENATE($B254,\"!Q19\"))),\"\",INDIRECT(CONCATENATE($B254,\"!Q19\")))","v":""},{"$f":"IF(ISERROR(INDIRECT(CONCATENATE($B254,\"!Q20\"))),\"\",INDIRECT(CONCATENATE($B254,\"!Q20\")))","v":""},{"$f":"IF(ISERROR(INDIRECT(CONCATENATE($B254,\"!Q21\"))),\"\",INDIRECT(CONCATENATE($B254,\"!Q1\")))","v":""}]
[null,null,null,null,{"$f":"IF(ISERROR(INDIRECT(CONCATENATE($B255,\"!M18\"))),\"\",INDIRECT(CONCATENATE($B255,\"!M18\")))","v":""},{"$f":"IF(ISERROR(INDIRECT(CONCATENATE($B255,\"!M19\"))),\"\",INDIRECT(CONCATENATE($B255,\"!M19\")))","v":""},{"$f":"IF(ISERROR(INDIRECT(CONCATENATE($B255,\"!M20\"))),\"\",INDIRECT(CONCATENATE($B255,\"!M20\")))","v":""},{"$f":"IF(ISERROR(INDIRECT(CONCATENATE($B255,\"!M21\"))),\"\",INDIRECT(CONCATENATE($B255,\"!M21\")))","v":""},null,{"$f":"IF(ISERROR(INDIRECT(CONCATENATE($B255,\"!N18\"))),\"\",INDIRECT(CONCATENATE($B255,\"!N18\")))","v":""},{"$f":"IF(ISERROR(INDIRECT(CONCATENATE($B255,\"!N19\"))),\"\",INDIRECT(CONCATENATE($B255,\"!N19\")))","v":""},{"$f":"IF(ISERROR(INDIRECT(CONCATENATE($B255,\"!N20\"))),\"\",INDIRECT(CONCATENATE($B255,\"!N20\")))","v":""},{"$f":"IF(ISERROR(INDIRECT(CONCATENATE($B255,\"!N21\"))),\"\",INDIRECT(CONCATENATE($B255,\"!N21\")))","v":""},null,{"$f":"IF(ISERROR(INDIRECT(CONCATENATE($B255,\"!O18\"))),\"\",INDIRECT(CONCATENATE($B255,\"!O18\")))","v":""},{"$f":"IF(ISERROR(INDIRECT(CONCATENATE($B255,\"!O19\"))),\"\",INDIRECT(CONCATENATE($B255,\"!O19\")))","v":""},{"$f":"IF(ISERROR(INDIRECT(CONCATENATE($B255,\"!O20\"))),\"\",INDIRECT(CONCATENATE($B255,\"!O20\")))","v":""},{"$f":"IF(ISERROR(INDIRECT(CONCATENATE($B255,\"!O21\"))),\"\",INDIRECT(CONCATENATE($B255,\"!O21\")))","v":""},null,{"$f":"IF(ISERROR(INDIRECT(CONCATENATE($B255,\"!P18\"))),\"\",INDIRECT(CONCATENATE($B255,\"!P18\")))","v":""},{"$f":"IF(ISERROR(INDIRECT(CONCATENATE($B255,\"!P19\"))),\"\",INDIRECT(CONCATENATE($B255,\"!P19\")))","v":""},{"$f":"IF(ISERROR(INDIRECT(CONCATENATE($B255,\"!P20\"))),\"\",INDIRECT(CONCATENATE($B255,\"!P20\")))","v":""},{"$f":"IF(ISERROR(INDIRECT(CONCATENATE($B255,\"!P21\"))),\"\",INDIRECT(CONCATENATE($B255,\"!P21\")))","v":""},null,{"$f":"IF(ISERROR(INDIRECT(CONCATENATE($B255,\"!Q18\"))),\"\",INDIRECT(CONCATENATE($B255,\"!Q18\")))","v":""},{"$f":"IF(ISERROR(INDIRECT(CONCATENATE($B255,\"!Q19\"))),\"\",INDIRECT(CONCATENATE($B255,\"!Q19\")))","v":""},{"$f":"IF(ISERROR(INDIRECT(CONCATENATE($B255,\"!Q20\"))),\"\",INDIRECT(CONCATENATE($B255,\"!Q20\")))","v":""},{"$f":"IF(ISERROR(INDIRECT(CONCATENATE($B255,\"!Q21\"))),\"\",INDIRECT(CONCATENATE($B255,\"!Q1\")))","v":""}]
[null,null,null,null,{"$f":"IF(ISERROR(INDIRECT(CONCATENATE($B256,\"!M18\"))),\"\",INDIRECT(CONCATENATE($B256,\"!M18\")))","v":""},{"$f":"IF(ISERROR(INDIRECT(CONCATENATE($B256,\"!M19\"))),\"\",INDIRECT(CONCATENATE($B256,\"!M19\")))","v":""},{"$f":"IF(ISERROR(INDIRECT(CONCATENATE($B256,\"!M20\"))),\"\",INDIRECT(CONCATENATE($B256,\"!M20\")))","v":""},{"$f":"IF(ISERROR(INDIRECT(CONCATENATE($B256,\"!M21\"))),\"\",INDIRECT(CONCATENATE($B256,\"!M21\")))","v":""},null,{"$f":"IF(ISERROR(INDIRECT(CONCATENATE($B256,\"!N18\"))),\"\",INDIRECT(CONCATENATE($B256,\"!N18\")))","v":""},{"$f":"IF(ISERROR(INDIRECT(CONCATENATE($B256,\"!N19\"))),\"\",INDIRECT(CONCATENATE($B256,\"!N19\")))","v":""},{"$f":"IF(ISERROR(INDIRECT(CONCATENATE($B256,\"!N20\"))),\"\",INDIRECT(CONCATENATE($B256,\"!N20\")))","v":""},{"$f":"IF(ISERROR(INDIRECT(CONCATENATE($B256,\"!N21\"))),\"\",INDIRECT(CONCATENATE($B256,\"!N21\")))","v":""},null,{"$f":"IF(ISERROR(INDIRECT(CONCATENATE($B256,\"!O18\"))),\"\",INDIRECT(CONCATENATE($B256,\"!O18\")))","v":""},{"$f":"IF(ISERROR(INDIRECT(CONCATENATE($B256,\"!O19\"))),\"\",INDIRECT(CONCATENATE($B256,\"!O19\")))","v":""},{"$f":"IF(ISERROR(INDIRECT(CONCATENATE($B256,\"!O20\"))),\"\",INDIRECT(CONCATENATE($B256,\"!O20\")))","v":""},{"$f":"IF(ISERROR(INDIRECT(CONCATENATE($B256,\"!O21\"))),\"\",INDIRECT(CONCATENATE($B256,\"!O21\")))","v":""},null,{"$f":"IF(ISERROR(INDIRECT(CONCATENATE($B256,\"!P18\"))),\"\",INDIRECT(CONCATENATE($B256,\"!P18\")))","v":""},{"$f":"IF(ISERROR(INDIRECT(CONCATENATE($B256,\"!P19\"))),\"\",INDIRECT(CONCATENATE($B256,\"!P19\")))","v":""},{"$f":"IF(ISERROR(INDIRECT(CONCATENATE($B256,\"!P20\"))),\"\",INDIRECT(CONCATENATE($B256,\"!P20\")))","v":""},{"$f":"IF(ISERROR(INDIRECT(CONCATENATE($B256,\"!P21\"))),\"\",INDIRECT(CONCATENATE($B256,\"!P21\")))","v":""},null,{"$f":"IF(ISERROR(INDIRECT(CONCATENATE($B256,\"!Q18\"))),\"\",INDIRECT(CONCATENATE($B256,\"!Q18\")))","v":""},{"$f":"IF(ISERROR(INDIRECT(CONCATENATE($B256,\"!Q19\"))),\"\",INDIRECT(CONCATENATE($B256,\"!Q19\")))","v":""},{"$f":"IF(ISERROR(INDIRECT(CONCATENATE($B256,\"!Q20\"))),\"\",INDIRECT(CONCATENATE($B256,\"!Q20\")))","v":""},{"$f":"IF(ISERROR(INDIRECT(CONCATENATE($B256,\"!Q21\"))),\"\",INDIRECT(CONCATENATE($B256,\"!Q1\")))","v":""}]
[null,null,null,null,{"$f":"IF(ISERROR(INDIRECT(CONCATENATE($B257,\"!M18\"))),\"\",INDIRECT(CONCATENATE($B257,\"!M18\")))","v":""},{"$f":"IF(ISERROR(INDIRECT(CONCATENATE($B257,\"!M19\"))),\"\",INDIRECT(CONCATENATE($B257,\"!M19\")))","v":""},{"$f":"IF(ISERROR(INDIRECT(CONCATENATE($B257,\"!M20\"))),\"\",INDIRECT(CONCATENATE($B257,\"!M20\")))","v":""},{"$f":"IF(ISERROR(INDIRECT(CONCATENATE($B257,\"!M21\"))),\"\",INDIRECT(CONCATENATE($B257,\"!M21\")))","v":""},null,{"$f":"IF(ISERROR(INDIRECT(CONCATENATE($B257,\"!N18\"))),\"\",INDIRECT(CONCATENATE($B257,\"!N18\")))","v":""},{"$f":"IF(ISERROR(INDIRECT(CONCATENATE($B257,\"!N19\"))),\"\",INDIRECT(CONCATENATE($B257,\"!N19\")))","v":""},{"$f":"IF(ISERROR(INDIRECT(CONCATENATE($B257,\"!N20\"))),\"\",INDIRECT(CONCATENATE($B257,\"!N20\")))","v":""},{"$f":"IF(ISERROR(INDIRECT(CONCATENATE($B257,\"!N21\"))),\"\",INDIRECT(CONCATENATE($B257,\"!N21\")))","v":""},null,{"$f":"IF(ISERROR(INDIRECT(CONCATENATE($B257,\"!O18\"))),\"\",INDIRECT(CONCATENATE($B257,\"!O18\")))","v":""},{"$f":"IF(ISERROR(INDIRECT(CONCATENATE($B257,\"!O19\"))),\"\",INDIRECT(CONCATENATE($B257,\"!O19\")))","v":""},{"$f":"IF(ISERROR(INDIRECT(CONCATENATE($B257,\"!O20\"))),\"\",INDIRECT(CONCATENATE($B257,\"!O20\")))","v":""},{"$f":"IF(ISERROR(INDIRECT(CONCATENATE($B257,\"!O21\"))),\"\",INDIRECT(CONCATENATE($B257,\"!O21\")))","v":""},null,{"$f":"IF(ISERROR(INDIRECT(CONCATENATE($B257,\"!P18\"))),\"\",INDIRECT(CONCATENATE($B257,\"!P18\")))","v":""},{"$f":"IF(ISERROR(INDIRECT(CONCATENATE($B257,\"!P19\"))),\"\",INDIRECT(CONCATENATE($B257,\"!P19\")))","v":""},{"$f":"IF(ISERROR(INDIRECT(CONCATENATE($B257,\"!P20\"))),\"\",INDIRECT(CONCATENATE($B257,\"!P20\")))","v":""},{"$f":"IF(ISERROR(INDIRECT(CONCATENATE($B257,\"!P21\"))),\"\",INDIRECT(CONCATENATE($B257,\"!P21\")))","v":""},null,{"$f":"IF(ISERROR(INDIRECT(CONCATENATE($B257,\"!Q18\"))),\"\",INDIRECT(CONCATENATE($B257,\"!Q18\")))","v":""},{"$f":"IF(ISERROR(INDIRECT(CONCATENATE($B257,\"!Q19\"))),\"\",INDIRECT(CONCATENATE($B257,\"!Q19\")))","v":""},{"$f":"IF(ISERROR(INDIRECT(CONCATENATE($B257,\"!Q20\"))),\"\",INDIRECT(CONCATENATE($B257,\"!Q20\")))","v":""},{"$f":"IF(ISERROR(INDIRECT(CONCATENATE($B257,\"!Q21\"))),\"\",INDIRECT(CONCATENATE($B257,\"!Q1\")))","v":""}]
[]
[]
[]
[]
[]
[]
[]
[]
[]
[]
[]
[]
[]
[]
[]
[]
[]
[]
[]
[]
[]
[]
[]
[]
[]
[]
[]
[]
[]
[]
[]
[]
[]
[]
[]
[]
[]
[]
[]
["RURAL",null,null,"Poorest",null,null,null,null,"Poor",null,null,null,null,"Middle",null,null,null,null,"Rich",null,null,null,null,"Richest"]
[null,null,null,"Improved","Basic","Limited","Unimproved","Surface water","Improved","Basic","Limited","Unimproved","Surface water","Improved","Basic","Limited","Unimproved","Surface water","Improved","Basic","Limited","Unimproved","Surface water","Improved","Basic","Limited","Unimproved","Surface water"]
["Forecast period:",null,2000,{"$f":"IF((D301+H301)>100,D301*100/(D301+H301),D301)","v":31.295800770953065},{"$f":"D299*AVERAGEIF(E305:E316,\">0\")/100","v":15.498437300844181},{"$f":"D299*(100-AVERAGEIF(E305:E316,\">0\"))/100","v":15.797363470108884},{"$f":"100-(E299+F299+H299)","v":57.494411776437573},{"$f":"IF((D301+H301)>100,H301*100/(D301+H301),H301)","v":11.209787452609362},{"$f":"IF((I301+M301)>100,I301*100/(I301+M301),I301)","v":37.504751365282573},{"$f":"I299*AVERAGEIF(J305:J316,\">0\")/100","v":27.344584487714609},{"$f":"I299*(100-AVERAGEIF(J305:J316,\">0\"))/100","v":10.160166877567965},{"$f":"100-(J299+K299+M299)","v":54.024485150853479},{"$f":"IF((I301+M301)>100,M301*100/(I301+M301),M301)","v":8.4707634838639478},{"$f":"IF((N301+R301)>100,N301*100/(N301+R301),N301)","v":61.928567009496419},{"$f":"N299*AVERAGEIF(O305:O316,\">0\")/100","v":51.164849345685909},{"$f":"N299*(100-AVERAGEIF(O305:O316,\">0\"))/100","v":10.763717663810514},{"$f":"100-(O299+P299+R299)","v":30.303309289388835},{"$f":"IF((N301+R301)>100,R301*100/(N301+R301),R301)","v":7.7681237011147459},{"$f":"IF((S301+W301)>100,S301*100/(S301+W301),S301)","v":65.791425192867337},{"$f":"S299*AVERAGEIF(T305:T316,\">0\")/100","v":59.379324243352691},{"$f":"S299*(100-AVERAGEIF(T305:T316,\">0\"))/100","v":6.4121009495146462},{"$f":"100-(T299+U299+W299)","v":27.308014417030336},{"$f":"IF((S301+W301)>100,W301*100/(S301+W301),W301)","v":6.9005603901023278},{"$f":"IF((X301+AB301)>100,X301*100/(X301+AB301),X301)","v":91.492958938479433},{"$f":"X299*AVERAGEIF(Y305:Y316,\">0\")/100","v":87.878820932404949},{"$f":"X299*(100-AVERAGEIF(Y305:Y316,\">0\"))/100","v":3.6141380060744872},{"$f":"100-(Y299+Z299+AB299)","v":6.2353641027430058},{"$f":"IF((X301+AB301)>100,AB301*100/(X301+AB301),AB301)","v":2.2716769587775616}]
[null,null,2019,{"$f":"IF((D302+H302)>100,D302*100/(D302+H302),D302)","v":58.693045107226681},{"$f":"D300*AVERAGEIF(E305:E316,\">0\")/100","v":29.066215184826216},{"$f":"D300*(100-AVERAGEIF(E305:E316,\">0\"))/100","v":29.626829922400464},{"$f":"100-(E300+F300+H300)","v":38.73673800031338},{"$f":"IF((D302+H302)>100,H302*100/(D302+H302),H302)","v":2.5702168924599391},{"$f":"IF((I302+M302)>100,I302*100/(I302+M302),I302)","v":68.534856960606703},{"$f":"I300*AVERAGEIF(J305:J316,\">0\")/100","v":49.968527141004444},{"$f":"I300*(100-AVERAGEIF(J305:J316,\">0\"))/100","v":18.566329819602263},{"$f":"100-(J300+K300+M300)","v":27.929067816560064},{"$f":"IF((I302+M302)>100,M302*100/(I302+M302),M302)","v":3.5360752228332331},{"$f":"IF((N302+R302)>100,N302*100/(N302+R302),N302)","v":79.336253198163831},{"$f":"N300*AVERAGEIF(O305:O316,\">0\")/100","v":65.5469299315901},{"$f":"N300*(100-AVERAGEIF(O305:O316,\">0\"))/100","v":13.789323266573733},{"$f":"100-(O300+P300+R300)","v":18.910642674578867},{"$f":"IF((N302+R302)>100,R302*100/(N302+R302),R302)","v":1.753104127257302},{"$f":"IF((S302+W302)>100,S302*100/(S302+W302),S302)","v":85.950050860436022},{"$f":"S300*AVERAGEIF(T305:T316,\">0\")/100","v":77.573269218794636},{"$f":"S300*(100-AVERAGEIF(T305:T316,\">0\"))/100","v":8.3767816416413901},{"$f":"100-(T300+U300+W300)","v":12.924905823663948},{"$f":"IF((S302+W302)>100,W302*100/(S302+W302),W302)","v":1.1250433159000295},{"$f":"IF((X302+AB302)>100,X302*100/(X302+AB302),X302)","v":93.469009501951177},{"$f":"X300*AVERAGEIF(Y305:Y316,\">0\")/100","v":89.776813910613001},{"$f":"X300*(100-AVERAGEIF(Y305:Y316,\">0\"))/100","v":3.6921955913381823},{"$f":"100-(Y300+Z300+AB300)","v":5.8720650911872667},{"$f":"IF((X302+AB302)>100,AB302*100/(X302+AB302),AB302)","v":0.65892540686155598}]
["Regression period:",null,{"$f":"MinRegYear(C299,C305:C316)","v":2004},{"$f":"IF(MAX(C305:C316)-MIN(C305:C316)<5,AVERAGEIF(C305:C316,\">0\",D305:D316),\nIF(FORECAST($C301,D$305:D$316,$C$305:$C$316)<0,0,\nIF(FORECAST($C301,D$305:D$316,$C$305:$C$316)>100,100,\nFORECAST($C301,D$305:D$316,$C$305:$C$316))))","v":31.295800770953065},null,null,null,{"$f":"IF(MAX(C305:C316)-MIN(C305:C316)<5,AVERAGEIF(C305:C316,\">0\",H305:H316),\nIF(FORECAST($C301,H$305:H$316,$C$305:$C$316)<0,0,\nIF(FORECAST($C301,H$305:H$316,$C$305:$C$316)>100,100,\nFORECAST($C301,H$305:H$316,$C$305:$C$316))))","v":11.209787452609362},{"$f":"IF(MAX(C305:C316)-MIN(C305:C316)<5,AVERAGEIF(C305:C316,\">0\",I305:I316),\nIF(FORECAST($C301,I$305:I$316,$C$305:$C$316)<0,0,\nIF(FORECAST($C301,I$305:I$316,$C$305:$C$316)>100,100,\nFORECAST($C301,I$305:I$316,$C$305:$C$316))))","v":37.504751365282573},null,null,null,{"$f":"IF(MAX(C305:C316)-MIN(C305:C316)<5,AVERAGEIF(C305:C316,\">0\",M305:M316),\nIF(FORECAST($C301,M$305:M$316,$C$305:$C$316)<0,0,\nIF(FORECAST($C301,M$305:M$316,$C$305:$C$316)>100,100,\nFORECAST($C301,M$305:M$316,$C$305:$C$316))))","v":8.4707634838639478},{"$f":"IF(MAX(C305:C316)-MIN(C305:C316)<5,AVERAGEIF(C305:C316,\">0\",N305:N316),\nIF(FORECAST($C301,N$305:N$316,$C$305:$C$316)<0,0,\nIF(FORECAST($C301,N$305:N$316,$C$305:$C$316)>100,100,\nFORECAST($C301,N$305:N$316,$C$305:$C$316))))","v":61.928567009496419},null,null,null,{"$f":"IF(MAX(C305:C316)-MIN(C305:C316)<5,AVERAGEIF(C305:C316,\">0\",R305:R316),\nIF(FORECAST($C301,R$305:R$316,$C$305:$C$316)<0,0,\nIF(FORECAST($C301,R$305:R$316,$C$305:$C$316)>100,100,\nFORECAST($C301,R$305:R$316,$C$305:$C$316))))","v":7.7681237011147459},{"$f":"IF(MAX(C305:C316)-MIN(C305:C316)<5,AVERAGEIF(C305:C316,\">0\",S305:S316),\nIF(FORECAST($C301,S$305:S$316,$C$305:$C$316)<0,0,\nIF(FORECAST($C301,S$305:S$316,$C$305:$C$316)>100,100,\nFORECAST($C301,S$305:S$316,$C$305:$C$316))))","v":65.791425192867337},null,null,null,{"$f":"IF(MAX(C305:C316)-MIN(C305:C316)<5,AVERAGEIF(C305:C316,\">0\",W305:W316),\nIF(FORECAST($C301,W$305:W$316,$C$305:$C$316)<0,0,\nIF(FORECAST($C301,W$305:W$316,$C$305:$C$316)>100,100,\nFORECAST($C301,W$305:W$316,$C$305:$C$316))))","v":6.9005603901023278},{"$f":"IF(MAX(C305:C316)-MIN(C305:C316)<5,AVERAGEIF(C305:C316,\">0\",X305:X316),\nIF(FORECAST($C301,X$305:X$316,$C$305:$C$316)<0,0,\nIF(FORECAST($C301,X$305:X$316,$C$305:$C$316)>100,100,\nFORECAST($C301,X$305:X$316,$C$305:$C$316))))","v":91.492958938479433},null,null,null,{"$f":"IF(MAX(C305:C316)-MIN(C305:C316)<5,AVERAGEIF(C305:C316,\">0\",AB305:AB316),\nIF(FORECAST($C301,AB$305:AB$316,$C$305:$C$316)<0,0,\nIF(FORECAST($C301,AB$305:AB$316,$C$305:$C$316)>100,100,\nFORECAST($C301,AB$305:AB$316,$C$305:$C$316))))","v":2.2716769587775616}]
[null,null,{"$f":"MaxRegYear(C300,C305:C316)","v":2015},{"$f":"IF(MAX(C305:C316)-MIN(C305:C316)<5,AVERAGEIF(C305:C316,\">0\",D305:D316),\nIF(FORECAST($C302,D$305:D$316,$C$305:$C$316)<0,0,\nIF(FORECAST($C302,D$305:D$316,$C$305:$C$316)>100,100,\nFORECAST($C302,D$305:D$316,$C$305:$C$316))))","v":58.693045107226681},null,null,null,{"$f":"IF(MAX(C305:C316)-MIN(C305:C316)<5,AVERAGEIF(C305:C316,\">0\",H305:H316),\nIF(FORECAST($C302,H$305:H$316,$C$305:$C$316)<0,0,\nIF(FORECAST($C302,H$305:H$316,$C$305:$C$316)>100,100,\nFORECAST($C302,H$305:H$316,$C$305:$C$316))))","v":2.5702168924599391},{"$f":"IF(MAX(C305:C316)-MIN(C305:C316)<5,AVERAGEIF(C305:C316,\">0\",I305:I316),\nIF(FORECAST($C302,I$305:I$316,$C$305:$C$316)<0,0,\nIF(FORECAST($C302,I$305:I$316,$C$305:$C$316)>100,100,\nFORECAST($C302,I$305:I$316,$C$305:$C$316))))","v":68.534856960606703},null,null,null,{"$f":"IF(MAX(C305:C316)-MIN(C305:C316)<5,AVERAGEIF(C305:C316,\">0\",M305:M316),\nIF(FORECAST($C302,M$305:M$316,$C$305:$C$316)<0,0,\nIF(FORECAST($C302,M$305:M$316,$C$305:$C$316)>100,100,\nFORECAST($C302,M$305:M$316,$C$305:$C$316))))","v":3.5360752228332331},{"$f":"IF(MAX(C305:C316)-MIN(C305:C316)<5,AVERAGEIF(C305:C316,\">0\",N305:N316),\nIF(FORECAST($C302,N$305:N$316,$C$305:$C$316)<0,0,\nIF(FORECAST($C302,N$305:N$316,$C$305:$C$316)>100,100,\nFORECAST($C302,N$305:N$316,$C$305:$C$316))))","v":79.336253198163831},null,null,null,{"$f":"IF(MAX(C305:C316)-MIN(C305:C316)<5,AVERAGEIF(C305:C316,\">0\",R305:R316),\nIF(FORECAST($C302,R$305:R$316,$C$305:$C$316)<0,0,\nIF(FORECAST($C302,R$305:R$316,$C$305:$C$316)>100,100,\nFORECAST($C302,R$305:R$316,$C$305:$C$316))))","v":1.753104127257302},{"$f":"IF(MAX(C305:C316)-MIN(C305:C316)<5,AVERAGEIF(C305:C316,\">0\",S305:S316),\nIF(FORECAST($C302,S$305:S$316,$C$305:$C$316)<0,0,\nIF(FORECAST($C302,S$305:S$316,$C$305:$C$316)>100,100,\nFORECAST($C302,S$305:S$316,$C$305:$C$316))))","v":85.950050860436022},null,null,null,{"$f":"IF(MAX(C305:C316)-MIN(C305:C316)<5,AVERAGEIF(C305:C316,\">0\",W305:W316),\nIF(FORECAST($C302,W$305:W$316,$C$305:$C$316)<0,0,\nIF(FORECAST($C302,W$305:W$316,$C$305:$C$316)>100,100,\nFORECAST($C302,W$305:W$316,$C$305:$C$316))))","v":1.1250433159000295},{"$f":"IF(MAX(C305:C316)-MIN(C305:C316)<5,AVERAGEIF(C305:C316,\">0\",X305:X316),\nIF(FORECAST($C302,X$305:X$316,$C$305:$C$316)<0,0,\nIF(FORECAST($C302,X$305:X$316,$C$305:$C$316)>100,100,\nFORECAST($C302,X$305:X$316,$C$305:$C$316))))","v":93.469009501951177},null,null,null,{"$f":"IF(MAX(C305:C316)-MIN(C305:C316)<5,AVERAGEIF(C305:C316,\">0\",AB305:AB316),\nIF(FORECAST($C302,AB$305:AB$316,$C$305:$C$316)<0,0,\nIF(FORECAST($C302,AB$305:AB$316,$C$305:$C$316)>100,100,\nFORECAST($C302,AB$305:AB$316,$C$305:$C$316))))","v":0.65892540686155598}]
[]
[null,"Survey","Year","Improved","% Improved\n< = 30min",null,null,"Surface water","Improved","% Improved\n< = 30min",null,null,"Surface water","Improved","% Improved\n< = 30min",null,null,"Surface water","Improved","% Improved\n< = 30min",null,null,"Surface water","Improved","% Improved\n< = 30min",null,null,"Surface water"]
[null,"MICS06",2006,{"$f":"IF(ISERROR(INDIRECT(CONCATENATE($B305,\"!M16\"))),\"\",INDIRECT(CONCATENATE($B305,\"!M16\")))","v":36.277117923002962},{"$f":"IF(ISERROR(INDIRECT(CONCATENATE($B305,\"!M23\"))),\"\",INDIRECT(CONCATENATE($B305,\"!M23\")))","v":49.522418085013257},null,null,{"$f":"IF(ISERROR(INDIRECT(CONCATENATE($B305,\"!M21\"))),\"\",INDIRECT(CONCATENATE($B305,\"!M21\")))","v":9.6389564416732458},{"$f":"IF(ISERROR(INDIRECT(CONCATENATE($B305,\"!N16\"))),\"\",INDIRECT(CONCATENATE($B305,\"!N16\")))","v":43.146588746250686},{"$f":"IF(ISERROR(INDIRECT(CONCATENATE($B305,\"!N23\"))),\"\",INDIRECT(CONCATENATE($B305,\"!N23\")))","v":72.909654089926761},null,null,{"$f":"IF(ISERROR(INDIRECT(CONCATENATE($B305,\"!N21\"))),\"\",INDIRECT(CONCATENATE($B305,\"!N21\")))","v":7.573547436403774},{"$f":"IF(ISERROR(INDIRECT(CONCATENATE($B305,\"!O16\"))),\"\",INDIRECT(CONCATENATE($B305,\"!O16\")))","v":65.09360086198113},{"$f":"IF(ISERROR(INDIRECT(CONCATENATE($B305,\"!O23\"))),\"\",INDIRECT(CONCATENATE($B305,\"!O23\")))","v":82.619139787038904},null,null,{"$f":"IF(ISERROR(INDIRECT(CONCATENATE($B305,\"!O21\"))),\"\",INDIRECT(CONCATENATE($B305,\"!O21\")))","v":6.6744837785953246},{"$f":"IF(ISERROR(INDIRECT(CONCATENATE($B305,\"!P16\"))),\"\",INDIRECT(CONCATENATE($B305,\"!P16\")))","v":69.456629859697799},{"$f":"IF(ISERROR(INDIRECT(CONCATENATE($B305,\"!P23\"))),\"\",INDIRECT(CONCATENATE($B305,\"!P23\")))","v":90.253895654764136},null,null,{"$f":"IF(ISERROR(INDIRECT(CONCATENATE($B305,\"!P21\"))),\"\",INDIRECT(CONCATENATE($B305,\"!P21\")))","v":5.850466376610906},{"$f":"IF(ISERROR(INDIRECT(CONCATENATE($B305,\"!Q16\"))),\"\",INDIRECT(CONCATENATE($B305,\"!Q16\")))","v":91.852240859110637},{"$f":"IF(ISERROR(INDIRECT(CONCATENATE($B305,\"!Q23\"))),\"\",INDIRECT(CONCATENATE($B305,\"!Q23\")))","v":96.049818425366851},null,null,{"$f":"IF(ISERROR(INDIRECT(CONCATENATE($B305,\"!Q221\"))),\"\",INDIRECT(CONCATENATE($B305,\"!Q21\")))","v":1.978449403883777}]
[null,"DHS13",2013,53.711727955177018,"N/A",null,null,4.1410479033962568,62.893019579638931,"N/A",null,null,4.4332912702933625,76.171219345678523,"N/A",null,null,2.8467440497768663,82.284846193604992,"N/A",null,null,2.1751373293913514,93.109727581319916,"N/A",null,null,0.95215296175543007]
[null,null,null,"","",null,null,"","","",null,null,"","","",null,null,"","","",null,null,"","","",null,null,""]
[null,null,null,"","",null,null,"","","",null,null,"","","",null,null,"","","",null,null,"","","",null,null,""]
[null,null,null,"","",null,null,"","","",null,null,"","","",null,null,"","","",null,null,"","","",null,null,""]
[null,null,null,"","",null,null,"","","",null,null,"","","",null,null,"","","",null,null,"","","",null,null,""]
[null,null,null,"","",null,null,"","","",null,null,"","","",null,null,"","","",null,null,"","","",null,null,""]
[null,null,null,"","",null,null,"","","",null,null,"","","",null,null,"","","",null,null,"","","",null,null,""]
[null,null,null,"","",null,null,"","","",null,null,"","","",null,null,"","","",null,null,"","","",null,null,""]
[null,null,null,"","",null,null,"","","",null,null,"","","",null,null,"","","",null,null,"","","",null,null,""]
[null,null,null,"","",null,null,"","","",null,null,"","","",null,null,"","","",null,null,"","","",null,null,""]
[null,null,null,"","",null,null,"","","",null,null,"","","",null,null,"","","",null,null,"","","",null,null,""]
[]
[null,{"$f":"CONCATENATE(\"Rural use of drinking water sources, \",C299,\"–\",C300)","v":"Rural use of drinking water sources, 2000–2019"},null,null,null,null,null,null,null,null,null,null,null,null,null,null,null,null,"Data points used for regression"]

{"sheet":"Sanitation","index":2,"n_rows":318,"n_cols":28,"rows_kept":318,"cut":false,"hidden":false,"merged":[[298,0,299,1],[300,0,301,1],[317,18,317,22],[196,23,196,27],[198,0,199,1],[200,0,201,1],[217,18,217,22],[296,0,297,2],[296,3,296,7],[296,8,296,12],[296,13,296,17],[296,18,296,22],[296,23,296,27],[217,1,217,11],[317,1,317,11],[98,0,99,1],[100,0,101,1],[117,18,117,22],[196,0,197,2],[196,3,196,7],[196,8,196,12],[196,13,196,17],[196,18,196,22],[117,1,117,11],[96,23,96,27],[32,1,33,2],[32,3,33,3],[35,1,36,2],[35,3,36,3],[38,1,39,2],[38,3,39,3],[96,0,97,2],[96,3,96,7],[96,8,96,12],[96,13,96,17],[96,18,96,22],[30,21,30,24],[4,1,4,24],[3,1,3,24],[6,1,6,8],[6,9,6,16],[6,17,6,24],[30,1,31,4],[30,5,30,8],[30,9,30,12],[30,13,30,16],[30,17,30,20]]}
[]
[]
[]
[null,"Summary of trends in use of sanitation facilities by wealth quintile (%)"]
[null,{"$f":"IF(ISERROR(INDIRECT(CONCATENATE($B105,\"!A2\"))),\"\",INDIRECT(CONCATENATE($B105,\"!A2\")))","v":"Yemen"}]
[]
[null,{"$f":"B118","v":"National use of sanitation facilities, 2000–2019"},null,null,null,null,null,null,null,{"$f":"B218","v":"Urban use of sanitation facilities, 2000–2019"},null,null,null,null,null,null,null,{"$f":"B318","v":"Rural use of sanitation facilities, 2000–2019"}]
[]
[]
[]
[]
[]
[]
[]
[]
[]
[]
[]
[]
[]
[]
[]
[]
[]
[]
[]
[]
[]
[]
[]
[null,{"$f":"IF(ISERROR(INDIRECT(CONCATENATE($B105,\"!A2\"))),\"\",INDIRECT(CONCATENATE($B105,\"!A2\")))","v":"Yemen"},null,null,null,"Poorest",null,null,null,"Poor",null,null,null,"Middle",null,null,null,"Rich",null,null,null,"Richest"]
[null,null,null,null,null,"Basic","Limited","Unimproved","Open defecation","Basic","Limited","Unimproved","Open defecation","Basic","Limited","Unimproved","Open defecation","Basic","Limited","Unimproved","Open defecation","Basic","Limited","Unimproved","Open defecation"]
[null,"NATIONAL",null,"Estimate",{"$f":"C99","v":2000},{"$f":"E99","v":6.6655512009241251},{"$f":"F99","v":0.97253478123333836},26.21526472750088,66.146649290341657,{"$f":"J99","v":23.506350884874777},{"$f":"K99","v":2.5734686967152958},42.850651788710238,31.06952862969969,{"$f":"O99","v":44.701407905186073},{"$f":"P99","v":1.9833009029629571},46.129841559596109,7.1854496322548584,{"$f":"T99","v":79.57515608587795},{"$f":"U99","v":2.9956544093830235},17.429189504739028,0,{"$f":"Y99","v":87.664329150243489},{"$f":"Z99","v":1.3174535369227944},10.328440635964625,0.68977667686908717]
[null,null,null,null,{"$f":"C100","v":2019},{"$f":"E100","v":13.367388069956558},1.9503638094436899,25.924807669706979,58.757440450892773,{"$f":"J100","v":37.445839719599604},4.0995600215690908,26.773746754335789,31.680853504495516,{"$f":"O100","v":60.540046876022799},2.686025681546953,15.822588627743244,20.951338814687006,{"$f":"T100","v":79.849599456158899},3.0059859944247269,8.1024215200178134,9.0419930293985544,{"$f":"Y100","v":96.156661990498108},1.4450796083884652,0,2.3982584011134107]
[]
[null,"URBAN",null,"Estimate",{"$f":"C199","v":2000},{"$f":"E199","v":78.672937356018693},{"$f":"F199","v":2.2209709683637406},16.924027393447204,2.1820642821703586,{"$f":"J199","v":90.52560449767347},{"$f":"K199","v":3.9840113119826435},5.4903841903438888,0,{"$f":"O199","v":88.606755442396064},{"$f":"P199","v":2.7776843991443125},8.6155601584596297,0,{"$f":"T199","v":96.812151043578709},{"$f":"U199","v":0},3.1878489564212913,0,{"$f":"Y199","v":99.728042813566148},{"$f":"Z199","v":0.27195718643385192},0,0]
[null,null,null,null,{"$f":"C200","v":2019},{"$f":"E200","v":71.243045125017019},2.0112219047378148,18.550127949493117,8.1956050207520548,{"$f":"J200","v":86.640290102401906},3.8130195070975543,5.8420551600571571,3.7046352304433867,{"$f":"O200","v":95.492168566868472},2.9935314248256013,0,1.5143000083059197,{"$f":"T200","v":97.543568898067335},0,1.9191831232317185,0.53724797870094676,{"$f":"Y200","v":98.815880400392373},0.26946973038378985,0.31987808567620846,0.59477178354762827]
[]
[null,"RURAL",null,"Estimate",{"$f":"C299","v":2000},{"$f":"E299","v":4.034689129605737},{"$f":"F299","v":0.51463170672474312},20.165724960681473,75.284954202988047,{"$f":"J299","v":14.489731527392012},{"$f":"K299","v":1.8528348999807198},36.573087090278023,47.084346482349247,{"$f":"O299","v":27.755929053435509},{"$f":"P299","v":2.232906723936555},49.569186394701546,20.441977827926394,{"$f":"T299","v":35.755741683581725},{"$f":"U299","v":2.3014729030700263},54.489446845807379,7.4533385675408681,{"$f":"Y299","v":65.584623194028211},{"$f":"Z299","v":3.048984089273679},31.366392716698115,0]
[null,null,null,null,{"$f":"C300","v":2019},{"$f":"E300","v":11.493778098308253},1.4660516459729971,23.774214961004873,63.265955294713876,{"$f":"J300","v":26.577929276320148},3.3985802179489206,30.905031988381779,39.118458517349154,{"$f":"O300","v":44.430441433440798},3.5743365402470517,21.699516004519637,30.295706021792512,{"$f":"T300","v":58.05828094413004},3.7370098926824213,15.859739731130048,22.344969432057496,{"$f":"Y300","v":75.732966450141603},3.520773597445999,4.5329170182258167,16.213342934186585]
[]
[]
[]
[]
[]
[]
[]
[]
[]
[]
[]
[]
[]
[]
[]
[]
[]
[]
[]
[]
[]
[]
[]
[]
[]
[]
[]
[]
[]
[]
[]
[]
[]
[]
[]
[]
[]
[]
[]
[]
[]
[]
[]
[]
[]
[]
[]
[]
[]
[]
[]
[]
[]
[]
[]
[]
["NATIONAL",null,null,"Poorest",null,null,null,null,"Poor",null,null,null,null,"Middle",null,null,null,null,"Rich",null,null,null,null,"Richest"]
[null,null,null,"Improved","Basic","Limited","Unimproved","Open defecation","Improved","Basic","Limited","Unimproved","Open defecation","Improved","Basic","Limited","Unimproved","Open defecation","Improved","Basic","Limited","Unimproved","Open defecation","Improved","Basic","Limited","Unimproved","Open defecation"]
["Forecast period:",null,2000,{"$f":"IF((D101+H101)>100,D101*100/(D101+H101),D101)","v":7.6380859821574631},{"$f":"D99*AVERAGEIF(E105:E116,\">0\")/100","v":6.6655512009241251},{"$f":"D99*(100-AVERAGEIF(E105:E116,\">0\"))/100","v":0.97253478123333836},{"$f":"100-(E99+F99+H99)","v":26.21526472750088},{"$f":"IF((D101+H101)>100,H101*100/(D101+H101),H101)","v":66.146649290341657},{"$f":"IF((I101+M101)>100,I101*100/(I101+M101),I101)","v":26.079819581590073},{"$f":"I99*AVERAGEIF(J105:J116,\">0\")/100","v":23.506350884874777},{"$f":"I99*(100-AVERAGEIF(J105:J116,\">0\"))/100","v":2.5734686967152958},{"$f":"100-(J99+K99+M99)","v":42.850651788710238},{"$f":"IF((I101+M101)>100,M101*100/(I101+M101),M101)","v":31.06952862969969},{"$f":"IF((N101+R101)>100,N101*100/(N101+R101),N101)","v":46.684708808149026},{"$f":"N99*AVERAGEIF(O105:O116,\">0\")/100","v":44.701407905186073},{"$f":"N99*(100-AVERAGEIF(O105:O116,\">0\"))/100","v":1.9833009029629571},{"$f":"100-(O99+P99+R99)","v":46.129841559596109},{"$f":"IF((N101+R101)>100,R101*100/(N101+R101),R101)","v":7.1854496322548584},{"$f":"IF((S101+W101)>100,S101*100/(S101+W101),S101)","v":82.570810495260972},{"$f":"S99*AVERAGEIF(T105:T116,\">0\")/100","v":79.57515608587795},{"$f":"S99*(100-AVERAGEIF(T105:T116,\">0\"))/100","v":2.9956544093830235},{"$f":"100-(T99+U99+W99)","v":17.429189504739028},{"$f":"IF((S101+W101)>100,W101*100/(S101+W101),W101)","v":0},{"$f":"IF((X101+AB101)>100,X101*100/(X101+AB101),X101)","v":88.981782687166287},{"$f":"X99*AVERAGEIF(Y105:Y116,\">0\")/100","v":87.664329150243489},{"$f":"X99*(100-AVERAGEIF(Y105:Y116,\">0\"))/100","v":1.3174535369227944},{"$f":"100-(Y99+Z99+AB99)","v":10.328440635964625},{"$f":"IF((X101+AB101)>100,AB101*100/(X101+AB101),AB101)","v":0.68977667686908717}]
[null,null,2019,{"$f":"IF((D102+H102)>100,D102*100/(D102+H102),D102)","v":15.317751879400248},{"$f":"D100*AVERAGEIF(E105:E116,\">0\")/100","v":13.367388069956558},{"$f":"D100*(100-AVERAGEIF(E105:E116,\">0\"))/100","v":1.9503638094436899},{"$f":"100-(E100+F100+H100)","v":25.924807669706979},{"$f":"IF((D102+H102)>100,H102*100/(D102+H102),H102)","v":58.757440450892773},{"$f":"IF((I102+M102)>100,I102*100/(I102+M102),I102)","v":41.545399741168694},{"$f":"I100*AVERAGEIF(J105:J116,\">0\")/100","v":37.445839719599604},{"$f":"I100*(100-AVERAGEIF(J105:J116,\">0\"))/100","v":4.0995600215690908},{"$f":"100-(J100+K100+M100)","v":26.773746754335789},{"$f":"IF((I102+M102)>100,M102*100/(I102+M102),M102)","v":31.680853504495516},{"$f":"IF((N102+R102)>100,N102*100/(N102+R102),N102)","v":63.226072557569751},{"$f":"N100*AVERAGEIF(O105:O116,\">0\")/100","v":60.540046876022799},{"$f":"N100*(100-AVERAGEIF(O105:O116,\">0\"))/100","v":2.686025681546953},{"$f":"100-(O100+P100+R100)","v":15.822588627743244},{"$f":"IF((N102+R102)>100,R102*100/(N102+R102),R102)","v":20.951338814687006},{"$f":"IF((S102+W102)>100,S102*100/(S102+W102),S102)","v":82.855585450583632},{"$f":"S100*AVERAGEIF(T105:T116,\">0\")/100","v":79.849599456158899},{"$f":"S100*(100-AVERAGEIF(T105:T116,\">0\"))/100","v":3.0059859944247269},{"$f":"100-(T100+U100+W100)","v":8.1024215200178134},{"$f":"IF((S102+W102)>100,W102*100/(S102+W102),W102)","v":9.0419930293985544},{"$f":"IF((X102+AB102)>100,X102*100/(X102+AB102),X102)","v":97.601741598886576},{"$f":"X100*AVERAGEIF(Y105:Y116,\">0\")/100","v":96.156661990498108},{"$f":"X100*(100-AVERAGEIF(Y105:Y116,\">0\"))/100","v":1.4450796083884652},{"$f":"100-(Y100+Z100+AB100)","v":0},{"$f":"IF((X102+AB102)>100,AB102*100/(X102+AB102),AB102)","v":2.3982584011134107}]
["Regression period:",null,{"$f":"MinRegYear(C99,C105:C116)","v":2004},{"$f":"IF(MAX(C105:C116)-MIN(C105:C116)<5,AVERAGEIF(C105:C116,\">0\",D105:D116),\nIF(FORECAST($C101,D$105:D$116,$C$105:$C$116)<0,0,\nIF(FORECAST($C101,D$105:D$116,$C$105:$C$116)>100,100,\nFORECAST($C101,D$105:D$116,$C$105:$C$116))))","v":7.6380859821574631},null,null,null,{"$f":"IF(MAX(C105:C116)-MIN(C105:C116)<5,AVERAGEIF(C105:C116,\">0\",H105:H116),\nIF(FORECAST($C101,H$105:H$116,$C$105:$C$116)<0,0,\nIF(FORECAST($C101,H$105:H$116,$C$105:$C$116)>100,100,\nFORECAST($C101,H$105:H$116,$C$105:$C$116))))","v":66.146649290341657},{"$f":"IF(MAX(C105:C116)-MIN(C105:C116)<5,AVERAGEIF(C105:C116,\">0\",I105:I116),\nIF(FORECAST($C101,I$105:I$116,$C$105:$C$116)<0,0,\nIF(FORECAST($C101,I$105:I$116,$C$105:$C$116)>100,100,\nFORECAST($C101,I$105:I$116,$C$105:$C$116))))","v":26.079819581590073},null,null,null,{"$f":"IF(MAX(C105:C116)-MIN(C105:C116)<5,AVERAGEIF(C105:C116,\">0\",M105:M116),\nIF(FORECAST($C101,M$105:M$116,$C$105:$C$116)<0,0,\nIF(FORECAST($C101,M$105:M$116,$C$105:$C$116)>100,100,\nFORECAST($C101,M$105:M$116,$C$105:$C$116))))","v":31.06952862969969},{"$f":"IF(MAX(C105:C116)-MIN(C105:C116)<5,AVERAGEIF(C105:C116,\">0\",N105:N116),\nIF(FORECAST($C101,N$105:N$116,$C$105:$C$116)<0,0,\nIF(FORECAST($C101,N$105:N$116,$C$105:$C$116)>100,100,\nFORECAST($C101,N$105:N$116,$C$105:$C$116))))","v":46.684708808149026},null,null,null,{"$f":"IF(MAX(C105:C116)-MIN(C105:C116)<5,AVERAGEIF(C105:C116,\">0\",R105:R116),\nIF(FORECAST($C101,R$105:R$116,$C$105:$C$116)<0,0,\nIF(FORECAST($C101,R$105:R$116,$C$105:$C$116)>100,100,\nFORECAST($C101,R$105:R$116,$C$105:$C$116))))","v":7.1854496322548584},{"$f":"IF(MAX(C105:C116)-MIN(C105:C116)<5,AVERAGEIF(C105:C116,\">0\",S105:S116),\nIF(FORECAST($C101,S$105:S$116,$C$105:$C$116)<0,0,\nIF(FORECAST($C101,S$105:S$116,$C$105:$C$116)>100,100,\nFORECAST($C101,S$105:S$116,$C$105:$C$116))))","v":82.570810495260972},null,null,null,{"$f":"IF(MAX(C105:C116)-MIN(C105:C116)<5,AVERAGEIF(C105:C116,\">0\",W105:W116),\nIF(FORECAST($C101,W$105:W$116,$C$105:$C$116)<0,0,\nIF(FORECAST($C101,W$105:W$116,$C$105:$C$116)>100,100,\nFORECAST($C101,W$105:W$116,$C$105:$C$116))))","v":0},{"$f":"IF(MAX(C105:C116)-MIN(C105:C116)<5,AVERAGEIF(C105:C116,\">0\",X105:X116),\nIF(FORECAST($C101,X$105:X$116,$C$105:$C$116)<0,0,\nIF(FORECAST($C101,X$105:X$116,$C$105:$C$116)>100,100,\nFORECAST($C101,X$105:X$116,$C$105:$C$116))))","v":88.981782687166287},null,null,null,{"$f":"IF(MAX(C105:C116)-MIN(C105:C116)<5,AVERAGEIF(C105:C116,\">0\",AB105:AB116),\nIF(FORECAST($C101,AB$105:AB$116,$C$105:$C$116)<0,0,\nIF(FORECAST($C101,AB$105:AB$116,$C$105:$C$116)>100,100,\nFORECAST($C101,AB$105:AB$116,$C$105:$C$116))))","v":0.68977667686908717}]
[null,null,{"$f":"MaxRegYear(C100,C105:C116)","v":2015},{"$f":"IF(MAX(C105:C116)-MIN(C105:C116)<5,AVERAGEIF(C105:C116,\">0\",D105:D116),\nIF(FORECAST($C102,D$105:D$116,$C$105:$C$116)<0,0,\nIF(FORECAST($C102,D$105:D$116,$C$105:$C$116)>100,100,\nFORECAST($C102,D$105:D$116,$C$105:$C$116))))","v":15.317751879400248},null,null,null,{"$f":"IF(MAX(C105:C116)-MIN(C105:C116)<5,AVERAGEIF(C105:C116,\">0\",H105:H116),\nIF(FORECAST($C102,H$105:H$116,$C$105:$C$116)<0,0,\nIF(FORECAST($C102,H$105:H$116,$C$105:$C$116)>100,100,\nFORECAST($C102,H$105:H$116,$C$105:$C$116))))","v":58.757440450892773},{"$f":"IF(MAX(C105:C116)-MIN(C105:C116)<5,AVERAGEIF(C105:C116,\">0\",I105:I116),\nIF(FORECAST($C102,I$105:I$116,$C$105:$C$116)<0,0,\nIF(FORECAST($C102,I$105:I$116,$C$105:$C$116)>100,100,\nFORECAST($C102,I$105:I$116,$C$105:$C$116))))","v":41.545399741168694},null,null,null,{"$f":"IF(MAX(C105:C116)-MIN(C105:C116)<5,AVERAGEIF(C105:C116,\">0\",M105:M116),\nIF(FORECAST($C102,M$105:M$116,$C$105:$C$116)<0,0,\nIF(FORECAST($C102,M$105:M$116,$C$105:$C$116)>100,100,\nFORECAST($C102,M$105:M$116,$C$105:$C$116))))","v":31.680853504495516},{"$f":"IF(MAX(C105:C116)-MIN(C105:C116)<5,AVERAGEIF(C105:C116,\">0\",N105:N116),\nIF(FORECAST($C102,N$105:N$116,$C$105:$C$116)<0,0,\nIF(FORECAST($C102,N$105:N$116,$C$105:$C$116)>100,100,\nFORECAST($C102,N$105:N$116,$C$105:$C$116))))","v":63.226072557569751},null,null,null,{"$f":"IF(MAX(C105:C116)-MIN(C105:C116)<5,AVERAGEIF(C105:C116,\">0\",R105:R116),\nIF(FORECAST($C102,R$105:R$116,$C$105:$C$116)<0,0,\nIF(FORECAST($C102,R$105:R$116,$C$105:$C$116)>100,100,\nFORECAST($C102,R$105:R$116,$C$105:$C$116))))","v":20.951338814687006},{"$f":"IF(MAX(C105:C116)-MIN(C105:C116)<5,AVERAGEIF(C105:C116,\">0\",S105:S116),\nIF(FORECAST($C102,S$105:S$116,$C$105:$C$116)<0,0,\nIF(FORECAST($C102,S$105:S$116,$C$105:$C$116)>100,100,\nFORECAST($C102,S$105:S$116,$C$105:$C$116))))","v":82.855585450583632},null,null,null,{"$f":"IF(MAX(C105:C116)-MIN(C105:C116)<5,AVERAGEIF(C105:C116,\">0\",W105:W116),\nIF(FORECAST($C102,W$105:W$116,$C$105:$C$116)<0,0,\nIF(FORECAST($C102,W$105:W$116,$C$105:$C$116)>100,100,\nFORECAST($C102,W$105:W$116,$C$105:$C$116))))","v":9.0419930293985544},{"$f":"IF(MAX(C105:C116)-MIN(C105:C116)<5,AVERAGEIF(C105:C116,\">0\",X105:X116),\nIF(FORECAST($C102,X$105:X$116,$C$105:$C$116)<0,0,\nIF(FORECAST($C102,X$105:X$116,$C$105:$C$116)>100,100,\nFORECAST($C102,X$105:X$116,$C$105:$C$116))))","v":97.862315425666793},null,null,null,{"$f":"IF(MAX(C105:C116)-MIN(C105:C116)<5,AVERAGEIF(C105:C116,\">0\",AB105:AB116),\nIF(FORECAST($C102,AB$105:AB$116,$C$105:$C$116)<0,0,\nIF(FORECAST($C102,AB$105:AB$116,$C$105:$C$116)>100,100,\nFORECAST($C102,AB$105:AB$116,$C$105:$C$116))))","v":2.4046611902332415}]
[]
[null,"Survey","Year","Improved","Not shared",null,null,"Open defecation","Improved","Not shared",null,null,"Open defecation","Improved","Not shared",null,null,"Open defecation","Improved","Not shared",null,null,"Open defecation","Improved","Not shared",null,null,"Open defecation"]
[null,"MICS06",2006,{"$f":"IF(ISERROR(INDIRECT(CONCATENATE($B105,\"!C122\"))),\"\",INDIRECT(CONCATENATE($B105,\"!C122\")))","v":9.0343888725650494},{"$f":"IF(ISERROR(INDIRECT(CONCATENATE($B105,\"!C129\"))),\"\",INDIRECT(CONCATENATE($B105,\"!C129\")))","v":87.267297284880328},null,null,{"$f":"IF(ISERROR(INDIRECT(CONCATENATE($B105,\"!C127\"))),\"\",INDIRECT(CONCATENATE($B105,\"!C127\")))","v":64.803156774078374},{"$f":"IF(ISERROR(INDIRECT(CONCATENATE($B105,\"!D122\"))),\"\",INDIRECT(CONCATENATE($B105,\"!D122\")))","v":28.891743246967984},{"$f":"IF(ISERROR(INDIRECT(CONCATENATE($B105,\"!D129\"))),\"\",INDIRECT(CONCATENATE($B105,\"!D129\")))","v":90.132337040659877},null,null,{"$f":"IF(ISERROR(INDIRECT(CONCATENATE($B105,\"!D127\"))),\"\",INDIRECT(CONCATENATE($B105,\"!D127\")))","v":31.180678606935292},{"$f":"IF(ISERROR(INDIRECT(CONCATENATE($B105,\"!E122\"))),\"\",INDIRECT(CONCATENATE($B105,\"!E122\")))","v":49.692229489861475},{"$f":"IF(ISERROR(INDIRECT(CONCATENATE($B105,\"!E129\"))),\"\",INDIRECT(CONCATENATE($B105,\"!E129\")))","v":95.751711955378497},null,null,{"$f":"IF(ISERROR(INDIRECT(CONCATENATE($B105,\"!E127\"))),\"\",INDIRECT(CONCATENATE($B105,\"!E127\")))","v":9.6883385745153934},{"$f":"IF(ISERROR(INDIRECT(CONCATENATE($B105,\"!F122\"))),\"\",INDIRECT(CONCATENATE($B105,\"!F122\")))","v":82.622587759865098},{"$f":"IF(ISERROR(INDIRECT(CONCATENATE($B105,\"!F129\"))),\"\",INDIRECT(CONCATENATE($B105,\"!F129\")))","v":96.372017676204166},null,null,{"$f":"IF(ISERROR(INDIRECT(CONCATENATE($B105,\"!F127\"))),\"\",INDIRECT(CONCATENATE($B105,\"!F127\")))","v":0.48354721317900967},{"$f":"IF(ISERROR(INDIRECT(CONCATENATE($B105,\"!G122\"))),\"\",INDIRECT(CONCATENATE($B105,\"!G122\")))","v":90.596425003257337},{"$f":"IF(ISERROR(INDIRECT(CONCATENATE($B105,\"!G129\"))),\"\",INDIRECT(CONCATENATE($B105,\"!G129\")))","v":98.519412067125501},null,null,{"$f":"IF(ISERROR(INDIRECT(CONCATENATE($B105,\"!G2127\"))),\"\",INDIRECT(CONCATENATE($B105,\"!G127\")))","v":1.0015738611171108}]
[null,"DHS13",2013,13.921448988992243,"N/A",null,null,60.100932967156432,38.733476075790776,"N/A",null,null,31.569703527259911,60.218551875856576,"N/A",null,null,18.448449872426789,82.80380818597952,"N/A",null,null,7.140116181349712,96.247673109575828,"N/A",null,null,2.0928640059852115]
[null,null,null,"","",null,null,"","","",null,null,"","","",null,null,"","","",null,null,"","","",null,null,""]
[null,null,null,"","",null,null,"","","",null,null,"","","",null,null,"","","",null,null,"","","",null,null,""]
[null,null,null,"","",null,null,"","","",null,null,"","","",null,null,"","","",null,null,"","","",null,null,""]
[null,null,null,"","",null,null,"","","",null,null,"","","",null,null,"","","",null,null,"","","",null,null,""]
[null,null,null,"","",null,null,"","","",null,null,"","","",null,null,"","","",null,null,"","","",null,null,""]
[null,null,null,"","",null,null,"","","",null,null,"","","",null,null,"","","",null,null,"","","",null,null,""]
[null,null,null,"","",null,null,"","","",null,null,"","","",null,null,"","","",null,null,"","","",null,null,""]
[null,null,null,"","",null,null,"","","",null,null,"","","",null,null,"","","",null,null,"","","",null,null,""]
[null,null,null,"","",null,null,"","","",null,null,"","","",null,null,"","","",null,null,"","","",null,null,""]
[null,null,null,"","",null,null,"","","",null,null,"","","",null,null,"","","",null,null,"","","",null,null,""]
[]
[null,{"$f":"CONCATENATE(\"National use of sanitation facilities, \",C99,\"–\",C100)","v":"National use of sanitation facilities, 2000–2019"},null,null,null,null,null,null,null,null,null,null,null,null,null,null,null,null,"Data points used for regression"]
[]
[]
[]
[]
[]
[]
[]
[]
[]
[]
[]
[]
[]
[]
[]
[]
[]
[]
[]
[]
[]
[]
[]
[]
[]
[]
[]
[]
[]
[]
[]
[]
[]
[]
[]
[]
[]
[]
[]
[]
[]
[]
[]
[]
[]
[]
[]
[]
[]
[]
[]
[]
[]
[]
[]
[]
[]
[]
[]
[]
[]
[]
[]
[]
[]
[]
[]
[]
[]
[]
[]
[]
[]
[]
[]
[]
[]
[]
["URBAN",null,null,"Poorest",null,null,null,null,"Poor",null,null,null,null,"Middle",null,null,null,null,"Rich",null,null,null,null,"Richest"]
[null,null,null,"Improved","Basic","Limited","Unimproved","Open defecation","Improved","Basic","Limited","Unimproved","Open defecation","Improved","Basic","Limited","Unimproved","Open defecation","Improved","Basic","Limited","Unimproved","Open defecation","Improved","Basic","Limited","Unimproved","Open defecation"]
["Forecast period:",null,{"$f":"MinBase(C205:C216)","v":2000},{"$f":"IF((D201+H201)>100,D201*100/(D201+H201),D201)","v":80.893908324382437},{"$f":"D199*AVERAGEIF(E205:E216,\">0\")/100","v":78.672937356018693},{"$f":"D199*(100-AVERAGEIF(E205:E216,\">0\"))/100","v":2.2209709683637406},{"$f":"100-(E199+F199+H199)","v":16.924027393447204},{"$f":"IF((D201+H201)>100,H201*100/(D201+H201),H201)","v":2.1820642821703586},{"$f":"IF((I201+M201)>100,I201*100/(I201+M201),I201)","v":94.509615809656111},{"$f":"I199*AVERAGEIF(J205:J216,\">0\")/100","v":90.52560449767347},{"$f":"I199*(100-AVERAGEIF(J205:J216,\">0\"))/100","v":3.9840113119826435},{"$f":"100-(J199+K199+M199)","v":5.4903841903438888},{"$f":"IF((I201+M201)>100,M201*100/(I201+M201),M201)","v":0},{"$f":"IF((N201+R201)>100,N201*100/(N201+R201),N201)","v":91.38443984154037},{"$f":"N199*AVERAGEIF(O205:O216,\">0\")/100","v":88.606755442396064},{"$f":"N199*(100-AVERAGEIF(O205:O216,\">0\"))/100","v":2.7776843991443125},{"$f":"100-(O199+P199+R199)","v":8.6155601584596297},{"$f":"IF((N201+R201)>100,R201*100/(N201+R201),R201)","v":0},{"$f":"IF((S201+W201)>100,S201*100/(S201+W201),S201)","v":96.812151043578709},{"$f":"S199*AVERAGEIF(T205:T216,\">0\")/100","v":96.812151043578709},{"$f":"S199*(100-AVERAGEIF(T205:T216,\">0\"))/100","v":0},{"$f":"100-(T199+U199+W199)","v":3.1878489564212913},{"$f":"IF((S201+W201)>100,W201*100/(S201+W201),W201)","v":0},{"$f":"IF((X201+AB201)>100,X201*100/(X201+AB201),X201)","v":100},{"$f":"X199*AVERAGEIF(Y205:Y216,\">0\")/100","v":99.728042813566148},{"$f":"X199*(100-AVERAGEIF(Y205:Y216,\">0\"))/100","v":0.27195718643385192},{"$f":"100-(Y199+Z199+AB199)","v":0},{"$f":"IF((X201+AB201)>100,AB201*100/(X201+AB201),AB201)","v":0}]
[null,null,{"$f":"MaxTarget(C205:C216)","v":2019},{"$f":"IF((D202+H202)>100,D202*100/(D202+H202),D202)","v":73.254267029754828},{"$f":"D200*AVERAGEIF(E205:E216,\">0\")/100","v":71.243045125017019},{"$f":"D200*(100-AVERAGEIF(E205:E216,\">0\"))/100","v":2.0112219047378148},{"$f":"100-(E200+F200+H200)","v":18.550127949493117},{"$f":"IF((D202+H202)>100,H202*100/(D202+H202),H202)","v":8.1956050207520548},{"$f":"IF((I202+M202)>100,I202*100/(I202+M202),I202)","v":90.453309609499456},{"$f":"I200*AVERAGEIF(J205:J216,\">0\")/100","v":86.640290102401906},{"$f":"I200*(100-AVERAGEIF(J205:J216,\">0\"))/100","v":3.8130195070975543},{"$f":"100-(J200+K200+M200)","v":5.8420551600571571},{"$f":"IF((I202+M202)>100,M202*100/(I202+M202),M202)","v":3.7046352304433867},{"$f":"IF((N202+R202)>100,N202*100/(N202+R202),N202)","v":98.485699991694077},{"$f":"N200*AVERAGEIF(O205:O216,\">0\")/100","v":95.492168566868472},{"$f":"N200*(100-AVERAGEIF(O205:O216,\">0\"))/100","v":2.9935314248256013},{"$f":"100-(O200+P200+R200)","v":0},{"$f":"IF((N202+R202)>100,R202*100/(N202+R202),R202)","v":1.5143000083059197},{"$f":"IF((S202+W202)>100,S202*100/(S202+W202),S202)","v":97.543568898067335},{"$f":"S200*AVERAGEIF(T205:T216,\">0\")/100","v":97.543568898067335},{"$f":"S200*(100-AVERAGEIF(T205:T216,\">0\"))/100","v":0},{"$f":"100-(T200+U200+W200)","v":1.9191831232317185},{"$f":"IF((S202+W202)>100,W202*100/(S202+W202),W202)","v":0.53724797870094676},{"$f":"IF((X202+AB202)>100,X202*100/(X202+AB202),X202)","v":99.085350130776163},{"$f":"X200*AVERAGEIF(Y205:Y216,\">0\")/100","v":98.815880400392373},{"$f":"X200*(100-AVERAGEIF(Y205:Y216,\">0\"))/100","v":0.26946973038378985},{"$f":"100-(Y200+Z200+AB200)","v":0.31987808567620846},{"$f":"IF((X202+AB202)>100,AB202*100/(X202+AB202),AB202)","v":0.59477178354762827}]
["Regression period:",null,{"$f":"MinRegYear(C199,C205:C216)","v":2004},{"$f":"IF(MAX(C205:C216)-MIN(C205:C216)<5,AVERAGEIF(C205:C216,\">0\",D205:D216),\nIF(FORECAST($C201,D$205:D$216,$C$205:$C$216)<0,0,\nIF(FORECAST($C201,D$205:D$216,$C$205:$C$216)>100,100,\nFORECAST($C201,D$205:D$216,$C$205:$C$216))))","v":80.893908324382437},null,null,null,{"$f":"IF(MAX(C205:C216)-MIN(C205:C216)<5,AVERAGEIF(C205:C216,\">0\",H205:H216),\nIF(FORECAST($C201,H$205:H$216,$C$205:$C$216)<0,0,\nIF(FORECAST($C201,H$205:H$216,$C$205:$C$216)>100,100,\nFORECAST($C201,H$205:H$216,$C$205:$C$216))))","v":2.1820642821703586},{"$f":"IF(MAX(C205:C216)-MIN(C205:C216)<5,AVERAGEIF(C205:C216,\">0\",I205:I216),\nIF(FORECAST($C201,I$205:I$216,$C$205:$C$216)<0,0,\nIF(FORECAST($C201,I$205:I$216,$C$205:$C$216)>100,100,\nFORECAST($C201,I$205:I$216,$C$205:$C$216))))","v":94.509615809656111},null,null,null,{"$f":"IF(MAX(C205:C216)-MIN(C205:C216)<5,AVERAGEIF(C205:C216,\">0\",M205:M216),\nIF(FORECAST($C201,M$205:M$216,$C$205:$C$216)<0,0,\nIF(FORECAST($C201,M$205:M$216,$C$205:$C$216)>100,100,\nFORECAST($C201,M$205:M$216,$C$205:$C$216))))","v":0},{"$f":"IF(MAX(C205:C216)-MIN(C205:C216)<5,AVERAGEIF(C205:C216,\">0\",N205:N216),\nIF(FORECAST($C201,N$205:N$216,$C$205:$C$216)<0,0,\nIF(FORECAST($C201,N$205:N$216,$C$205:$C$216)>100,100,\nFORECAST($C201,N$205:N$216,$C$205:$C$216))))","v":91.38443984154037},null,null,null,{"$f":"IF(MAX(C205:C216)-MIN(C205:C216)<5,AVERAGEIF(C205:C216,\">0\",R205:R216),\nIF(FORECAST($C201,R$205:R$216,$C$205:$C$216)<0,0,\nIF(FORECAST($C201,R$205:R$216,$C$205:$C$216)>100,100,\nFORECAST($C201,R$205:R$216,$C$205:$C$216))))","v":0},{"$f":"IF(MAX(C205:C216)-MIN(C205:C216)<5,AVERAGEIF(C205:C216,\">0\",S205:S216),\nIF(FORECAST($C201,S$205:S$216,$C$205:$C$216)<0,0,\nIF(FORECAST($C201,S$205:S$216,$C$205:$C$216)>100,100,\nFORECAST($C201,S$205:S$216,$C$205:$C$216))))","v":96.812151043578709},null,null,null,{"$f":"IF(MAX(C205:C216)-MIN(C205:C216)<5,AVERAGEIF(C205:C216,\">0\",W205:W216),\nIF(FORECAST($C201,W$205:W$216,$C$205:$C$216)<0,0,\nIF(FORECAST($C201,W$205:W$216,$C$205:$C$216)>100,100,\nFORECAST($C201,W$205:W$216,$C$205:$C$216))))","v":0},{"$f":"IF(MAX(C205:C216)-MIN(C205:C216)<5,AVERAGEIF(C205:C216,\">0\",X205:X216),\nIF(FORECAST($C201,X$205:X$216,$C$205:$C$216)<0,0,\nIF(FORECAST($C201,X$205:X$216,$C$205:$C$216)>100,100,\nFORECAST($C201,X$205:X$216,$C$205:$C$216))))","v":100},null,null,null,{"$f":"IF(MAX(C205:C216)-MIN(C205:C216)<5,AVERAGEIF(C205:C216,\">0\",AB205:AB216),\nIF(FORECAST($C201,AB$205:AB$216,$C$205:$C$216)<0,0,\nIF(FORECAST($C201,AB$205:AB$216,$C$205:$C$216)>100,100,\nFORECAST($C201,AB$205:AB$216,$C$205:$C$216))))","v":0}]
[null,null,{"$f":"MaxRegYear(C200,C205:C216)","v":2015},{"$f":"IF(MAX(C205:C216)-MIN(C205:C216)<5,AVERAGEIF(C205:C216,\">0\",D205:D216),\nIF(FORECAST($C202,D$205:D$216,$C$205:$C$216)<0,0,\nIF(FORECAST($C202,D$205:D$216,$C$205:$C$216)>100,100,\nFORECAST($C202,D$205:D$216,$C$205:$C$216))))","v":73.254267029754828},null,null,null,{"$f":"IF(MAX(C205:C216)-MIN(C205:C216)<5,AVERAGEIF(C205:C216,\">0\",H205:H216),\nIF(FORECAST($C202,H$205:H$216,$C$205:$C$216)<0,0,\nIF(FORECAST($C202,H$205:H$216,$C$205:$C$216)>100,100,\nFORECAST($C202,H$205:H$216,$C$205:$C$216))))","v":8.1956050207520548},{"$f":"IF(MAX(C205:C216)-MIN(C205:C216)<5,AVERAGEIF(C205:C216,\">0\",I205:I216),\nIF(FORECAST($C202,I$205:I$216,$C$205:$C$216)<0,0,\nIF(FORECAST($C202,I$205:I$216,$C$205:$C$216)>100,100,\nFORECAST($C202,I$205:I$216,$C$205:$C$216))))","v":90.453309609499456},null,null,null,{"$f":"IF(MAX(C205:C216)-MIN(C205:C216)<5,AVERAGEIF(C205:C216,\">0\",M205:M216),\nIF(FORECAST($C202,M$205:M$216,$C$205:$C$216)<0,0,\nIF(FORECAST($C202,M$205:M$216,$C$205:$C$216)>100,100,\nFORECAST($C202,M$205:M$216,$C$205:$C$216))))","v":3.7046352304433867},{"$f":"IF(MAX(C205:C216)-MIN(C205:C216)<5,AVERAGEIF(C205:C216,\">0\",N205:N216),\nIF(FORECAST($C202,N$205:N$216,$C$205:$C$216)<0,0,\nIF(FORECAST($C202,N$205:N$216,$C$205:$C$216)>100,100,\nFORECAST($C202,N$205:N$216,$C$205:$C$216))))","v":98.833411002671255},null,null,null,{"$f":"IF(MAX(C205:C216)-MIN(C205:C216)<5,AVERAGEIF(C205:C216,\">0\",R205:R216),\nIF(FORECAST($C202,R$205:R$216,$C$205:$C$216)<0,0,\nIF(FORECAST($C202,R$205:R$216,$C$205:$C$216)>100,100,\nFORECAST($C202,R$205:R$216,$C$205:$C$216))))","v":1.5196463559163362},{"$f":"IF(MAX(C205:C216)-MIN(C205:C216)<5,AVERAGEIF(C205:C216,\">0\",S205:S216),\nIF(FORECAST($C202,S$205:S$216,$C$205:$C$216)<0,0,\nIF(FORECAST($C202,S$205:S$216,$C$205:$C$216)>100,100,\nFORECAST($C202,S$205:S$216,$C$205:$C$216))))","v":97.543568898067335},null,null,null,{"$f":"IF(MAX(C205:C216)-MIN(C205:C216)<5,AVERAGEIF(C205:C216,\">0\",W205:W216),\nIF(FORECAST($C202,W$205:W$216,$C$205:$C$216)<0,0,\nIF(FORECAST($C202,W$205:W$216,$C$205:$C$216)>100,100,\nFORECAST($C202,W$205:W$216,$C$205:$C$216))))","v":0.53724797870094676},{"$f":"IF(MAX(C205:C216)-MIN(C205:C216)<5,AVERAGEIF(C205:C216,\">0\",X205:X216),\nIF(FORECAST($C202,X$205:X$216,$C$205:$C$216)<0,0,\nIF(FORECAST($C202,X$205:X$216,$C$205:$C$216)>100,100,\nFORECAST($C202,X$205:X$216,$C$205:$C$216))))","v":99.085350130776163},null,null,null,{"$f":"IF(MAX(C205:C216)-MIN(C205:C216)<5,AVERAGEIF(C205:C216,\">0\",AB205:AB216),\nIF(FORECAST($C202,AB$205:AB$216,$C$205:$C$216)<0,0,\nIF(FORECAST($C202,AB$205:AB$216,$C$205:$C$216)>100,100,\nFORECAST($C202,AB$205:AB$216,$C$205:$C$216))))","v":0.59477178354762827}]
[]
[null,"Survey","Year","Improved","Not shared",null,null,"Open defecation","Improved","Not shared",null,null,"Open defecation","Improved","Not shared",null,null,"Open defecation","Improved","Not shared",null,null,"Open defecation","Improved","Not shared",null,null,"Open defecation"]
[null,"MICS06",2006,{"$f":"IF(ISERROR(INDIRECT(CONCATENATE($B205,\"!H122\"))),\"\",INDIRECT(CONCATENATE($B205,\"!H122\")))","v":79.504882634450297},{"$f":"IF(ISERROR(INDIRECT(CONCATENATE($B205,\"!H129\"))),\"\",INDIRECT(CONCATENATE($B205,\"!H129\")))","v":97.254464502496646},null,null,{"$f":"IF(ISERROR(INDIRECT(CONCATENATE($B205,\"!H127\"))),\"\",INDIRECT(CONCATENATE($B205,\"!H127\")))","v":3.2754353255489268},{"$f":"IF(ISERROR(INDIRECT(CONCATENATE($B205,\"!I122\"))),\"\",INDIRECT(CONCATENATE($B205,\"!I122\")))","v":93.772105591445907},{"$f":"IF(ISERROR(INDIRECT(CONCATENATE($B205,\"!I129\"))),\"\",INDIRECT(CONCATENATE($B205,\"!I129\")))","v":95.784543955816616},null,null,{"$f":"IF(ISERROR(INDIRECT(CONCATENATE($B205,\"!I127\"))),\"\",INDIRECT(CONCATENATE($B205,\"!I127\")))","v":4.4406678483915725E-2},{"$f":"IF(ISERROR(INDIRECT(CONCATENATE($B205,\"!J122\"))),\"\",INDIRECT(CONCATENATE($B205,\"!J122\")))","v":92.738798234473308},{"$f":"IF(ISERROR(INDIRECT(CONCATENATE($B205,\"!J129\"))),\"\",INDIRECT(CONCATENATE($B205,\"!J129\")))","v":96.960440525804188},null,null,{"$f":"IF(ISERROR(INDIRECT(CONCATENATE($B205,\"!J127\"))),\"\",INDIRECT(CONCATENATE($B205,\"!J127\")))","v":0},{"$f":"IF(ISERROR(INDIRECT(CONCATENATE($B205,\"!K122\"))),\"\",INDIRECT(CONCATENATE($B205,\"!K122\")))","v":96.945136108031164},{"$f":"IF(ISERROR(INDIRECT(CONCATENATE($B205,\"!K129\"))),\"\",INDIRECT(CONCATENATE($B205,\"!K129\")))","v":100},null,null,{"$f":"IF(ISERROR(INDIRECT(CONCATENATE($B205,\"!K127\"))),\"\",INDIRECT(CONCATENATE($B205,\"!K127\")))","v":0},{"$f":"IF(ISERROR(INDIRECT(CONCATENATE($B205,\"!L122\"))),\"\",INDIRECT(CONCATENATE($B205,\"!L122\")))","v":100},{"$f":"IF(ISERROR(INDIRECT(CONCATENATE($B205,\"!L129\"))),\"\",INDIRECT(CONCATENATE($B205,\"!L129\")))","v":99.728042813566148},null,null,{"$f":"IF(ISERROR(INDIRECT(CONCATENATE($B205,\"!L2127\"))),\"\",INDIRECT(CONCATENATE($B205,\"!L127\")))","v":0}]
[null,"DHS13",2013,74.643292719687352,"N/A",null,null,7.1022339773736789,91.190819827709831,"N/A",null,null,2.8912511077857377,97.479052609738332,"N/A",null,null,1.181947165712723,97.410583833614851,"N/A",null,null,0.41785953898962169,99.288605657270352,"N/A",null,null,0.46260027609260851]
[null,null,null,"","",null,null,"","","",null,null,"","","",null,null,"","","",null,null,"","","",null,null,""]
[null,null,null,"","",null,null,"","","",null,null,"","","",null,null,"","","",null,null,"","","",null,null,""]
[null,null,null,"","",null,null,"","","",null,null,"","","",null,null,"","","",null,null,"","","",null,null,""]
[null,null,null,"","",null,null,"","","",null,null,"","","",null,null,"","","",null,null,"","","",null,null,""]
[null,null,null,"","",null,null,"","","",null,null,"","","",null,null,"","","",null,null,"","","",null,null,""]
[null,null,null,"","",null,null,"","","",null,null,"","","",null,null,"","","",null,null,"","","",null,null,""]
[null,null,null,"","",null,null,"","","",null,null,"","","",null,null,"","","",null,null,"","","",null,null,""]
[null,null,null,"","",null,null,"","","",null,null,"","","",null,null,"","","",null,null,"","","",null,null,""]
[null,null,null,"","",null,null,"","","",null,null,"","","",null,null,"","","",null,null,"","","",null,null,""]
[null,null,null,"","",null,null,"","","",null,null,"","","",null,null,"","","",null,null,"","","",null,null,""]
[]
[null,{"$f":"CONCATENATE(\"Urban use of sanitation facilities, \",C199,\"–\",C200)","v":"Urban use of sanitation facilities, 2000–2019"},null,null,null,null,null,null,null,null,null,null,null,null,null,null,null,null,"Data points used for regression"]
[]
[]
[]
[]
[]
[]
[]
[]
[]
[]
[]
[]
[]
[]
[]
[]
[]
[]
[]
[]
[]
[]
[]
[]
[]
[]
[]
[]
[]
[]
[]
[]
[]
[]
[]
[]
[]
[]
[]
[]
[]
[]
[]
[]
[]
[]
[]
[]
[]
[]
[]
[]
[]
[]
[]
[]
[]
[]
[]
[]
[]
[]
[]
[]
[]
[]
[]
[]
[]
[]
[]
[]
[]
[]
[]
[]
[]
[]
["RURAL",null,null,"Poorest",null,null,null,null,"Poor",null,null,null,null,"Middle",null,null,null,null,"Rich",null,null,null,null,"Richest"]
[null,null,null,"Improved","Basic","Limited","Unimproved","Open defecation","Improved","Basic","Limited","Unimproved","Open defecation","Improved","Basic","Limited","Unimproved","Open defecation","Improved","Basic","Limited","Unimproved","Open defecation","Improved","Basic","Limited","Unimproved","Open defecation"]
["Forecast period:",null,{"$f":"MinBase(C305:C316)","v":2000},{"$f":"IF((D301+H301)>100,D301*100/(D301+H301),D301)","v":4.5493208363304802},{"$f":"D299*AVERAGEIF(E305:E316,\">0\")/100","v":4.034689129605737},{"$f":"D299*(100-AVERAGEIF(E305:E316,\">0\"))/100","v":0.51463170672474312},{"$f":"100-(E299+F299+H299)","v":20.165724960681473},{"$f":"IF((D301+H301)>100,H301*100/(D301+H301),H301)","v":75.284954202988047},{"$f":"IF((I301+M301)>100,I301*100/(I301+M301),I301)","v":16.342566427372731},{"$f":"I299*AVERAGEIF(J305:J316,\">0\")/100","v":14.489731527392012},{"$f":"I299*(100-AVERAGEIF(J305:J316,\">0\"))/100","v":1.8528348999807198},{"$f":"100-(J299+K299+M299)","v":36.573087090278023},{"$f":"IF((I301+M301)>100,M301*100/(I301+M301),M301)","v":47.084346482349247},{"$f":"IF((N301+R301)>100,N301*100/(N301+R301),N301)","v":29.98883577737206},{"$f":"N299*AVERAGEIF(O305:O316,\">0\")/100","v":27.755929053435509},{"$f":"N299*(100-AVERAGEIF(O305:O316,\">0\"))/100","v":2.232906723936555},{"$f":"100-(O299+P299+R299)","v":49.569186394701546},{"$f":"IF((N301+R301)>100,R301*100/(N301+R301),R301)","v":20.441977827926394},{"$f":"IF((S301+W301)>100,S301*100/(S301+W301),S301)","v":38.057214586651753},{"$f":"S299*AVERAGEIF(T305:T316,\">0\")/100","v":35.755741683581725},{"$f":"S299*(100-AVERAGEIF(T305:T316,\">0\"))/100","v":2.3014729030700263},{"$f":"100-(T299+U299+W299)","v":54.489446845807379},{"$f":"IF((S301+W301)>100,W301*100/(S301+W301),W301)","v":7.4533385675408681},{"$f":"IF((X301+AB301)>100,X301*100/(X301+AB301),X301)","v":68.633607283301899},{"$f":"X299*AVERAGEIF(Y305:Y316,\">0\")/100","v":65.584623194028211},{"$f":"X299*(100-AVERAGEIF(Y305:Y316,\">0\"))/100","v":3.048984089273679},{"$f":"100-(Y299+Z299+AB299)","v":31.366392716698115},{"$f":"IF((X301+AB301)>100,AB301*100/(X301+AB301),AB301)","v":0}]
[null,null,{"$f":"MaxTarget(C305:C316)","v":2019},{"$f":"IF((D302+H302)>100,D302*100/(D302+H302),D302)","v":12.959829744281251},{"$f":"D300*AVERAGEIF(E305:E316,\">0\")/100","v":11.493778098308253},{"$f":"D300*(100-AVERAGEIF(E305:E316,\">0\"))/100","v":1.4660516459729971},{"$f":"100-(E300+F300+H300)","v":23.774214961004873},{"$f":"IF((D302+H302)>100,H302*100/(D302+H302),H302)","v":63.265955294713876},{"$f":"IF((I302+M302)>100,I302*100/(I302+M302),I302)","v":29.976509494269067},{"$f":"I300*AVERAGEIF(J305:J316,\">0\")/100","v":26.577929276320148},{"$f":"I300*(100-AVERAGEIF(J305:J316,\">0\"))/100","v":3.3985802179489206},{"$f":"100-(J300+K300+M300)","v":30.905031988381779},{"$f":"IF((I302+M302)>100,M302*100/(I302+M302),M302)","v":39.118458517349154},{"$f":"IF((N302+R302)>100,N302*100/(N302+R302),N302)","v":48.004777973687851},{"$f":"N300*AVERAGEIF(O305:O316,\">0\")/100","v":44.430441433440798},{"$f":"N300*(100-AVERAGEIF(O305:O316,\">0\"))/100","v":3.5743365402470517},{"$f":"100-(O300+P300+R300)","v":21.699516004519637},{"$f":"IF((N302+R302)>100,R302*100/(N302+R302),R302)","v":30.295706021792512},{"$f":"IF((S302+W302)>100,S302*100/(S302+W302),S302)","v":61.795290836812455},{"$f":"S300*AVERAGEIF(T305:T316,\">0\")/100","v":58.05828094413004},{"$f":"S300*(100-AVERAGEIF(T305:T316,\">0\"))/100","v":3.7370098926824213},{"$f":"100-(T300+U300+W300)","v":15.859739731130048},{"$f":"IF((S302+W302)>100,W302*100/(S302+W302),W302)","v":22.344969432057496},{"$f":"IF((X302+AB302)>100,X302*100/(X302+AB302),X302)","v":79.253740047587598},{"$f":"X300*AVERAGEIF(Y305:Y316,\">0\")/100","v":75.732966450141603},{"$f":"X300*(100-AVERAGEIF(Y305:Y316,\">0\"))/100","v":3.520773597445999},{"$f":"100-(Y300+Z300+AB300)","v":4.5329170182258167},{"$f":"IF((X302+AB302)>100,AB302*100/(X302+AB302),AB302)","v":16.213342934186585}]
["Regression period:",null,{"$f":"MinRegYear(C299,C305:C316)","v":2004},{"$f":"IF(MAX(C305:C316)-MIN(C305:C316)<5,AVERAGEIF(C305:C316,\">0\",D305:D316),\nIF(FORECAST($C301,D$305:D$316,$C$305:$C$316)<0,0,\nIF(FORECAST($C301,D$305:D$316,$C$305:$C$316)>100,100,\nFORECAST($C301,D$305:D$316,$C$305:$C$316))))","v":4.5493208363304802},null,null,null,{"$f":"IF(MAX(C305:C316)-MIN(C305:C316)<5,AVERAGEIF(C305:C316,\">0\",H305:H316),\nIF(FORECAST($C301,H$305:H$316,$C$305:$C$316)<0,0,\nIF(FORECAST($C301,H$305:H$316,$C$305:$C$316)>100,100,\nFORECAST($C301,H$305:H$316,$C$305:$C$316))))","v":75.284954202988047},{"$f":"IF(MAX(C305:C316)-MIN(C305:C316)<5,AVERAGEIF(C305:C316,\">0\",I305:I316),\nIF(FORECAST($C301,I$305:I$316,$C$305:$C$316)<0,0,\nIF(FORECAST($C301,I$305:I$316,$C$305:$C$316)>100,100,\nFORECAST($C301,I$305:I$316,$C$305:$C$316))))","v":16.342566427372731},null,null,null,{"$f":"IF(MAX(C305:C316)-MIN(C305:C316)<5,AVERAGEIF(C305:C316,\">0\",M305:M316),\nIF(FORECAST($C301,M$305:M$316,$C$305:$C$316)<0,0,\nIF(FORECAST($C301,M$305:M$316,$C$305:$C$316)>100,100,\nFORECAST($C301,M$305:M$316,$C$305:$C$316))))","v":47.084346482349247},{"$f":"IF(MAX(C305:C316)-MIN(C305:C316)<5,AVERAGEIF(C305:C316,\">0\",N305:N316),\nIF(FORECAST($C301,N$305:N$316,$C$305:$C$316)<0,0,\nIF(FORECAST($C301,N$305:N$316,$C$305:$C$316)>100,100,\nFORECAST($C301,N$305:N$316,$C$305:$C$316))))","v":29.98883577737206},null,null,null,{"$f":"IF(MAX(C305:C316)-MIN(C305:C316)<5,AVERAGEIF(C305:C316,\">0\",R305:R316),\nIF(FORECAST($C301,R$305:R$316,$C$305:$C$316)<0,0,\nIF(FORECAST($C301,R$305:R$316,$C$305:$C$316)>100,100,\nFORECAST($C301,R$305:R$316,$C$305:$C$316))))","v":20.441977827926394},{"$f":"IF(MAX(C305:C316)-MIN(C305:C316)<5,AVERAGEIF(C305:C316,\">0\",S305:S316),\nIF(FORECAST($C301,S$305:S$316,$C$305:$C$316)<0,0,\nIF(FORECAST($C301,S$305:S$316,$C$305:$C$316)>100,100,\nFORECAST($C301,S$305:S$316,$C$305:$C$316))))","v":38.057214586651753},null,null,null,{"$f":"IF(MAX(C305:C316)-MIN(C305:C316)<5,AVERAGEIF(C305:C316,\">0\",W305:W316),\nIF(FORECAST($C301,W$305:W$316,$C$305:$C$316)<0,0,\nIF(FORECAST($C301,W$305:W$316,$C$305:$C$316)>100,100,\nFORECAST($C301,W$305:W$316,$C$305:$C$316))))","v":7.4533385675408681},{"$f":"IF(MAX(C305:C316)-MIN(C305:C316)<5,AVERAGEIF(C305:C316,\">0\",X305:X316),\nIF(FORECAST($C301,X$305:X$316,$C$305:$C$316)<0,0,\nIF(FORECAST($C301,X$305:X$316,$C$305:$C$316)>100,100,\nFORECAST($C301,X$305:X$316,$C$305:$C$316))))","v":68.633607283301899},null,null,null,{"$f":"IF(MAX(C305:C316)-MIN(C305:C316)<5,AVERAGEIF(C305:C316,\">0\",AB305:AB316),\nIF(FORECAST($C301,AB$305:AB$316,$C$305:$C$316)<0,0,\nIF(FORECAST($C301,AB$305:AB$316,$C$305:$C$316)>100,100,\nFORECAST($C301,AB$305:AB$316,$C$305:$C$316))))","v":0}]
[null,null,{"$f":"MaxRegYear(C300,C305:C316)","v":2015},{"$f":"IF(MAX(C305:C316)-MIN(C305:C316)<5,AVERAGEIF(C305:C316,\">0\",D305:D316),\nIF(FORECAST($C302,D$305:D$316,$C$305:$C$316)<0,0,\nIF(FORECAST($C302,D$305:D$316,$C$305:$C$316)>100,100,\nFORECAST($C302,D$305:D$316,$C$305:$C$316))))","v":12.959829744281251},null,null,null,{"$f":"IF(MAX(C305:C316)-MIN(C305:C316)<5,AVERAGEIF(C305:C316,\">0\",H305:H316),\nIF(FORECAST($C302,H$305:H$316,$C$305:$C$316)<0,0,\nIF(FORECAST($C302,H$305:H$316,$C$305:$C$316)>100,100,\nFORECAST($C302,H$305:H$316,$C$305:$C$316))))","v":63.265955294713876},{"$f":"IF(MAX(C305:C316)-MIN(C305:C316)<5,AVERAGEIF(C305:C316,\">0\",I305:I316),\nIF(FORECAST($C302,I$305:I$316,$C$305:$C$316)<0,0,\nIF(FORECAST($C302,I$305:I$316,$C$305:$C$316)>100,100,\nFORECAST($C302,I$305:I$316,$C$305:$C$316))))","v":29.976509494269067},null,null,null,{"$f":"IF(MAX(C305:C316)-MIN(C305:C316)<5,AVERAGEIF(C305:C316,\">0\",M305:M316),\nIF(FORECAST($C302,M$305:M$316,$C$305:$C$316)<0,0,\nIF(FORECAST($C302,M$305:M$316,$C$305:$C$316)>100,100,\nFORECAST($C302,M$305:M$316,$C$305:$C$316))))","v":39.118458517349154},{"$f":"IF(MAX(C305:C316)-MIN(C305:C316)<5,AVERAGEIF(C305:C316,\">0\",N305:N316),\nIF(FORECAST($C302,N$305:N$316,$C$305:$C$316)<0,0,\nIF(FORECAST($C302,N$305:N$316,$C$305:$C$316)>100,100,\nFORECAST($C302,N$305:N$316,$C$305:$C$316))))","v":48.004777973687851},null,null,null,{"$f":"IF(MAX(C305:C316)-MIN(C305:C316)<5,AVERAGEIF(C305:C316,\">0\",R305:R316),\nIF(FORECAST($C302,R$305:R$316,$C$305:$C$316)<0,0,\nIF(FORECAST($C302,R$305:R$316,$C$305:$C$316)>100,100,\nFORECAST($C302,R$305:R$316,$C$305:$C$316))))","v":30.295706021792512},{"$f":"IF(MAX(C305:C316)-MIN(C305:C316)<5,AVERAGEIF(C305:C316,\">0\",S305:S316),\nIF(FORECAST($C302,S$305:S$316,$C$305:$C$316)<0,0,\nIF(FORECAST($C302,S$305:S$316,$C$305:$C$316)>100,100,\nFORECAST($C302,S$305:S$316,$C$305:$C$316))))","v":61.795290836812455},null,null,null,{"$f":"IF(MAX(C305:C316)-MIN(C305:C316)<5,AVERAGEIF(C305:C316,\">0\",W305:W316),\nIF(FORECAST($C302,W$305:W$316,$C$305:$C$316)<0,0,\nIF(FORECAST($C302,W$305:W$316,$C$305:$C$316)>100,100,\nFORECAST($C302,W$305:W$316,$C$305:$C$316))))","v":22.344969432057496},{"$f":"IF(MAX(C305:C316)-MIN(C305:C316)<5,AVERAGEIF(C305:C316,\">0\",X305:X316),\nIF(FORECAST($C302,X$305:X$316,$C$305:$C$316)<0,0,\nIF(FORECAST($C302,X$305:X$316,$C$305:$C$316)>100,100,\nFORECAST($C302,X$305:X$316,$C$305:$C$316))))","v":79.253740047587598},null,null,null,{"$f":"IF(MAX(C305:C316)-MIN(C305:C316)<5,AVERAGEIF(C305:C316,\">0\",AB305:AB316),\nIF(FORECAST($C302,AB$305:AB$316,$C$305:$C$316)<0,0,\nIF(FORECAST($C302,AB$305:AB$316,$C$305:$C$316)>100,100,\nFORECAST($C302,AB$305:AB$316,$C$305:$C$316))))","v":16.213342934186585}]
[]
[null,"Survey","Year","Improved","Not shared",null,null,"Open defecation","Improved","Not shared",null,null,"Open defecation","Improved","Not shared",null,null,"Open defecation","Improved","Not shared",null,null,"Open defecation","Improved","Not shared",null,null,"Open defecation"]
[null,"MICS06",2006,{"$f":"IF(ISERROR(INDIRECT(CONCATENATE($B305,\"!M122\"))),\"\",INDIRECT(CONCATENATE($B305,\"!M122\")))","v":6.0785042741396209},{"$f":"IF(ISERROR(INDIRECT(CONCATENATE($B305,\"!M129\"))),\"\",INDIRECT(CONCATENATE($B305,\"!M129\")))","v":88.687724492523387},null,null,{"$f":"IF(ISERROR(INDIRECT(CONCATENATE($B305,\"!M127\"))),\"\",INDIRECT(CONCATENATE($B305,\"!M127\")))","v":73.099681674211411},{"$f":"IF(ISERROR(INDIRECT(CONCATENATE($B305,\"!N122\"))),\"\",INDIRECT(CONCATENATE($B305,\"!N122\")))","v":18.821465166808832},{"$f":"IF(ISERROR(INDIRECT(CONCATENATE($B305,\"!N129\"))),\"\",INDIRECT(CONCATENATE($B305,\"!N129\")))","v":88.662521836978172},null,null,{"$f":"IF(ISERROR(INDIRECT(CONCATENATE($B305,\"!N127\"))),\"\",INDIRECT(CONCATENATE($B305,\"!N127\")))","v":45.636003215985632},{"$f":"IF(ISERROR(INDIRECT(CONCATENATE($B305,\"!O122\"))),\"\",INDIRECT(CONCATENATE($B305,\"!O122\")))","v":33.264461631247769},{"$f":"IF(ISERROR(INDIRECT(CONCATENATE($B305,\"!O129\"))),\"\",INDIRECT(CONCATENATE($B305,\"!O129\")))","v":92.554206703744782},null,null,{"$f":"IF(ISERROR(INDIRECT(CONCATENATE($B305,\"!O127\"))),\"\",INDIRECT(CONCATENATE($B305,\"!O127\")))","v":22.233564772265822},{"$f":"IF(ISERROR(INDIRECT(CONCATENATE($B305,\"!P122\"))),\"\",INDIRECT(CONCATENATE($B305,\"!P122\")))","v":42.373228450318088},{"$f":"IF(ISERROR(INDIRECT(CONCATENATE($B305,\"!P129\"))),\"\",INDIRECT(CONCATENATE($B305,\"!P129\")))","v":93.952597613706473},null,null,{"$f":"IF(ISERROR(INDIRECT(CONCATENATE($B305,\"!P127\"))),\"\",INDIRECT(CONCATENATE($B305,\"!P127\")))","v":10.160907815634532},{"$f":"IF(ISERROR(INDIRECT(CONCATENATE($B305,\"!Q122\"))),\"\",INDIRECT(CONCATENATE($B305,\"!Q122\")))","v":70.564540513171963},{"$f":"IF(ISERROR(INDIRECT(CONCATENATE($B305,\"!Q129\"))),\"\",INDIRECT(CONCATENATE($B305,\"!Q129\")))","v":95.557593123893},null,null,{"$f":"IF(ISERROR(INDIRECT(CONCATENATE($B305,\"!Q2127\"))),\"\",INDIRECT(CONCATENATE($B305,\"!Q127\")))","v":2.1248039278546829}]
[null,"DHS13",2013,11.430646306471946,"N/A",null,null,65.451227823491308,27.49761075483352,"N/A",null,null,40.566801783712855,44.729152119812525,"N/A",null,null,28.504119077453279,57.479276973147122,"N/A",null,null,19.637400183963543,77.322806817717407,"N/A",null,null,13.08255648833482]
[null,null,null,"","",null,null,"","","",null,null,"","","",null,null,"","","",null,null,"","","",null,null,""]
[null,null,null,"","",null,null,"","","",null,null,"","","",null,null,"","","",null,null,"","","",null,null,""]
[null,null,null,"","",null,null,"","","",null,null,"","","",null,null,"","","",null,null,"","","",null,null,""]
[null,null,null,"","",null,null,"","","",null,null,"","","",null,null,"","","",null,null,"","","",null,null,""]
[null,null,null,"","",null,null,"","","",null,null,"","","",null,null,"","","",null,null,"","","",null,null,""]
[null,null,null,"","",null,null,"","","",null,null,"","","",null,null,"","","",null,null,"","","",null,null,""]
[null,null,null,"","",null,null,"","","",null,null,"","","",null,null,"","","",null,null,"","","",null,null,""]
[null,null,null,"","",null,null,"","","",null,null,"","","",null,null,"","","",null,null,"","","",null,null,""]
[null,null,null,"","",null,null,"","","",null,null,"","","",null,null,"","","",null,null,"","","",null,null,""]
[null,null,null,"","",null,null,"","","",null,null,"","","",null,null,"","","",null,null,"","","",null,null,""]
[]
[null,{"$f":"CONCATENATE(\"Rural use of sanitation facilities, \",C299,\"–\",C300)","v":"Rural use of sanitation facilities, 2000–2019"},null,null,null,null,null,null,null,null,null,null,null,null,null,null,null,null,"Data points used for regression"]

{"sheet":"Hygiene","index":3,"n_rows":90,"n_cols":25,"rows_kept":90,"cut":false,"hidden":false,"merged":[[6,1,6,7],[3,1,3,24],[4,1,4,24],[33,1,34,3],[31,6,32,9],[31,10,31,12],[31,13,31,15],[6,10,6,15],[6,18,6,23],[33,19,34,19],[31,16,31,18],[31,19,31,21],[31,22,31,24],[33,6,34,7],[33,8,34,8],[33,9,34,9],[33,15,34,15],[33,16,34,16],[33,17,34,17],[33,18,34,18],[36,6,37,7],[36,8,37,8],[36,9,37,9],[36,10,37,10],[36,11,37,11],[33,10,34,10],[33,11,34,11],[33,12,34,12],[33,13,34,13],[33,14,34,14],[33,20,34,20],[33,21,34,21],[33,22,34,22],[33,23,34,23],[33,24,34,24],[36,19,37,19],[36,20,37,20],[36,21,37,21],[36,22,37,22],[36,23,37,23],[39,12,40,12],[39,13,40,13],[39,14,40,14],[39,15,40,15],[36,18,37,18],[36,12,37,12],[36,13,37,13],[36,14,37,14],[36,15,37,15],[36,16,37,16],[36,17,37,17],[39,22,40,22],[39,23,40,23],[39,24,40,24],[31,4,32,5],[39,16,40,16],[39,17,40,17],[39,18,40,18],[39,19,40,19],[39,20,40,20],[39,21,40,21],[36,24,37,24],[39,6,40,7],[39,8,40,8],[39,9,40,9],[39,10,40,10],[39,11,40,11]]}
[]
[]
[]
[null,"Access to hygiene facilities by wealth quintile (%)"]
[null,{"$f":"IF(ISERROR(INDIRECT(CONCATENATE($E$32,\"!A2\"))),\"\",INDIRECT(CONCATENATE($E$32,\"!A2\")))","v":"Yemen"}]
[]
[null,{"$f":"CONCATENATE(\"National \",IF(ISERROR(INDIRECT(CONCATENATE($E$32,\"!A2\"))),\"\",INDIRECT(CONCATENATE($E$32,\"!A210\"))))","v":"National Access to hygiene facilities "},null,null,null,null,null,null,null,null,{"$f":"CONCATENATE(\"Urban \",IF(ISERROR(INDIRECT(CONCATENATE($E$32,\"!A2\"))),\"\",INDIRECT(CONCATENATE($E$32,\"!A210\"))))","v":"Urban Access to hygiene facilities "},null,null,null,null,null,null,null,{"$f":"CONCATENATE(\"Rural \",IF(ISERROR(INDIRECT(CONCATENATE($E$32,\"!A2\"))),\"\",INDIRECT(CONCATENATE($E$32,\"!A210\"))))","v":"Rural Access to hygiene facilities "}]
[]
[]
[]
[]
[]
[]
[]
[]
[]
[]
[]
[]
[]
[]
[]
[]
[]
[]
[]
[]
[]
[]
[]
[]
[null,null,null,null,{"$f":"INDEX(B88:B100,A88)","v":"DHS13"},null,{"$f":"IF(ISERROR(INDIRECT(CONCATENATE($E$32,\"!A2\"))),\"\",INDIRECT(CONCATENATE($E$32,\"!A2\")))","v":"Yemen"},null,null,null,"Poorest",null,null,"Poor",null,null,"Middle",null,null,"Rich",null,null,"Richest"]
[null,null,null,null,null,null,null,null,null,null,"Basic","Limited","No facility","Basic","Limited","No facility","Basic","Limited","No facility","Basic","Limited","No facility","Basic","Limited","No facility"]
[null,">>>  Select Survey :   ",null,null,null,null,"NATIONAL",null,null,{"$f":"IF(ISERROR(INDIRECT(CONCATENATE(#REF!,\"!A2\"))),\"\",INDIRECT(CONCATENATE(#REF!,\"!A210\")))","v":""},{"$f":"IF(ISERROR(INDIRECT(CONCATENATE($E$32,\"!C222\"))),\"\",INDIRECT(CONCATENATE($E$32,\"!C222\")))","v":19.547737979602374},{"$f":"IF(ISERROR(INDIRECT(CONCATENATE($E$32,\"!C223\"))),\"\",INDIRECT(CONCATENATE($E$32,\"!C223\")))","v":43.081054142822126},{"$f":"IF(ISERROR(INDIRECT(CONCATENATE($E$32,\"!C224\"))),\"\",INDIRECT(CONCATENATE($E$32,\"!C224\")))","v":37.37120787757533},{"$f":"IF(ISERROR(INDIRECT(CONCATENATE($E$32,\"!D222\"))),\"\",INDIRECT(CONCATENATE($E$32,\"!D222\")))","v":31.994326751458935},{"$f":"IF(ISERROR(INDIRECT(CONCATENATE($E$32,\"!D223\"))),\"\",INDIRECT(CONCATENATE($E$32,\"!D223\")))","v":31.424365061277783},{"$f":"IF(ISERROR(INDIRECT(CONCATENATE($E$32,\"!D224\"))),\"\",INDIRECT(CONCATENATE($E$32,\"!D224\")))","v":36.581308187263502},{"$f":"IF(ISERROR(INDIRECT(CONCATENATE($E$32,\"!E222\"))),\"\",INDIRECT(CONCATENATE($E$32,\"!E222\")))","v":45.55945627119371},{"$f":"IF(ISERROR(INDIRECT(CONCATENATE($E$32,\"!E223\"))),\"\",INDIRECT(CONCATENATE($E$32,\"!E223\")))","v":25.541000259454201},{"$f":"IF(ISERROR(INDIRECT(CONCATENATE($E$32,\"!E224\"))),\"\",INDIRECT(CONCATENATE($E$32,\"!E224\")))","v":28.899543469352135},{"$f":"IF(ISERROR(INDIRECT(CONCATENATE($E$32,\"!F222\"))),\"\",INDIRECT(CONCATENATE($E$32,\"!F222\")))","v":58.460576277453058},{"$f":"IF(ISERROR(INDIRECT(CONCATENATE($E$32,\"!F223\"))),\"\",INDIRECT(CONCATENATE($E$32,\"!F223\")))","v":23.221925593316762},{"$f":"IF(ISERROR(INDIRECT(CONCATENATE($E$32,\"!F224\"))),\"\",INDIRECT(CONCATENATE($E$32,\"!F224\")))","v":18.317498129229577},{"$f":"IF(ISERROR(INDIRECT(CONCATENATE($E$32,\"!G222\"))),\"\",INDIRECT(CONCATENATE($E$32,\"!G222\")))","v":76.016692155433304},{"$f":"IF(ISERROR(INDIRECT(CONCATENATE($E$32,\"!G223\"))),\"\",INDIRECT(CONCATENATE($E$32,\"!G223\")))","v":14.796876847267146},{"$f":"IF(ISERROR(INDIRECT(CONCATENATE($E$32,\"!G224\"))),\"\",INDIRECT(CONCATENATE($E$32,\"!G224\")))","v":9.1864309972992313}]
[]
[]
[null,null,null,null,null,null,"URBAN",null,null,{"$f":"IF(ISERROR(INDIRECT(CONCATENATE(#REF!,\"!A2\"))),\"\",INDIRECT(CONCATENATE(#REF!,\"!A210\")))","v":""},{"$f":"IF(ISERROR(INDIRECT(CONCATENATE($E$32,\"!H222\"))),\"\",INDIRECT(CONCATENATE($E$32,\"!H222\")))","v":56.668826768087754},{"$f":"IF(ISERROR(INDIRECT(CONCATENATE($E$32,\"!H223\"))),\"\",INDIRECT(CONCATENATE($E$32,\"!H223\")))","v":25.587431358416612},{"$f":"IF(ISERROR(INDIRECT(CONCATENATE($E$32,\"!H224\"))),\"\",INDIRECT(CONCATENATE($E$32,\"!H224\")))","v":17.743741873495537},{"$f":"IF(ISERROR(INDIRECT(CONCATENATE($E$32,\"!I222\"))),\"\",INDIRECT(CONCATENATE($E$32,\"!I222\")))","v":61.568099718395843},{"$f":"IF(ISERROR(INDIRECT(CONCATENATE($E$32,\"!I223\"))),\"\",INDIRECT(CONCATENATE($E$32,\"!I223\")))","v":27.614440074882602},{"$f":"IF(ISERROR(INDIRECT(CONCATENATE($E$32,\"!I224\"))),\"\",INDIRECT(CONCATENATE($E$32,\"!I224\")))","v":10.817460206721353},{"$f":"IF(ISERROR(INDIRECT(CONCATENATE($E$32,\"!J222\"))),\"\",INDIRECT(CONCATENATE($E$32,\"!J222\")))","v":68.185291752541531},{"$f":"IF(ISERROR(INDIRECT(CONCATENATE($E$32,\"!J223\"))),\"\",INDIRECT(CONCATENATE($E$32,\"!J223\")))","v":20.745773841035778},{"$f":"IF(ISERROR(INDIRECT(CONCATENATE($E$32,\"!J224\"))),\"\",INDIRECT(CONCATENATE($E$32,\"!J224\")))","v":11.068934406422631},{"$f":"IF(ISERROR(INDIRECT(CONCATENATE($E$32,\"!K222\"))),\"\",INDIRECT(CONCATENATE($E$32,\"!K222\")))","v":79.593387871582692},{"$f":"IF(ISERROR(INDIRECT(CONCATENATE($E$32,\"!K223\"))),\"\",INDIRECT(CONCATENATE($E$32,\"!K223\")))","v":17.263258564382213},{"$f":"IF(ISERROR(INDIRECT(CONCATENATE($E$32,\"!K224\"))),\"\",INDIRECT(CONCATENATE($E$32,\"!K224\")))","v":3.1433535640351167},{"$f":"IF(ISERROR(INDIRECT(CONCATENATE($E$32,\"!L222\"))),\"\",INDIRECT(CONCATENATE($E$32,\"!L222\")))","v":82.05328388010085},{"$f":"IF(ISERROR(INDIRECT(CONCATENATE($E$32,\"!L223\"))),\"\",INDIRECT(CONCATENATE($E$32,\"!L223\")))","v":14.597960600974744},{"$f":"IF(ISERROR(INDIRECT(CONCATENATE($E$32,\"!L224\"))),\"\",INDIRECT(CONCATENATE($E$32,\"!L224\")))","v":3.3487555189243743}]
[]
[]
[null,null,null,null,null,null,"RURAL",null,null,{"$f":"IF(ISERROR(INDIRECT(CONCATENATE(#REF!,\"!A2\"))),\"\",INDIRECT(CONCATENATE(#REF!,\"!A210\")))","v":""},{"$f":"IF(ISERROR(INDIRECT(CONCATENATE($E$32,\"!M222\"))),\"\",INDIRECT(CONCATENATE($E$32,\"!M222\")))","v":18.159781719983027},{"$f":"IF(ISERROR(INDIRECT(CONCATENATE($E$32,\"!M223\"))),\"\",INDIRECT(CONCATENATE($E$32,\"!M223\")))","v":43.34128324988481},{"$f":"IF(ISERROR(INDIRECT(CONCATENATE($E$32,\"!M224\"))),\"\",INDIRECT(CONCATENATE($E$32,\"!M224\")))","v":38.498935030132174},{"$f":"IF(ISERROR(INDIRECT(CONCATENATE($E$32,\"!N222\"))),\"\",INDIRECT(CONCATENATE($E$32,\"!N222\")))","v":24.164642133879177},{"$f":"IF(ISERROR(INDIRECT(CONCATENATE($E$32,\"!N223\"))),\"\",INDIRECT(CONCATENATE($E$32,\"!N223\")))","v":36.576488883313516},{"$f":"IF(ISERROR(INDIRECT(CONCATENATE($E$32,\"!N224\"))),\"\",INDIRECT(CONCATENATE($E$32,\"!N224\")))","v":39.258868982807449},{"$f":"IF(ISERROR(INDIRECT(CONCATENATE($E$32,\"!O222\"))),\"\",INDIRECT(CONCATENATE($E$32,\"!O222\")))","v":36.063507544791499},{"$f":"IF(ISERROR(INDIRECT(CONCATENATE($E$32,\"!O223\"))),\"\",INDIRECT(CONCATENATE($E$32,\"!O223\")))","v":32.058481434638061},{"$f":"IF(ISERROR(INDIRECT(CONCATENATE($E$32,\"!O224\"))),\"\",INDIRECT(CONCATENATE($E$32,\"!O224\")))","v":31.878011020570774},{"$f":"IF(ISERROR(INDIRECT(CONCATENATE($E$32,\"!P222\"))),\"\",INDIRECT(CONCATENATE($E$32,\"!P222\")))","v":44.569004712905283},{"$f":"IF(ISERROR(INDIRECT(CONCATENATE($E$32,\"!P223\"))),\"\",INDIRECT(CONCATENATE($E$32,\"!P223\")))","v":25.506784767359669},{"$f":"IF(ISERROR(INDIRECT(CONCATENATE($E$32,\"!P224\"))),\"\",INDIRECT(CONCATENATE($E$32,\"!P224\")))","v":29.924210519735361},{"$f":"IF(ISERROR(INDIRECT(CONCATENATE($E$32,\"!Q222\"))),\"\",INDIRECT(CONCATENATE($E$32,\"!Q222\")))","v":57.018629452400319},{"$f":"IF(ISERROR(INDIRECT(CONCATENATE($E$32,\"!Q223\"))),\"\",INDIRECT(CONCATENATE($E$32,\"!Q223\")))","v":14.971298266650503},{"$f":"IF(ISERROR(INDIRECT(CONCATENATE($E$32,\"!Q224\"))),\"\",INDIRECT(CONCATENATE($E$32,\"!Q224\")))","v":28.010072280949384}]
[]
[]
[]
[]
[]
[]
[]
[]
[]
[]
[]
[]
[]
[]
[]
[]
[]
[]
[]
[]
[]
[]
[]
[]
[]
[]
[]
[]
[]
[]
[]
[]
[]
[]
[]
[]
[]
[]
[]
[]
[]
[]
[]
[]
[]
[]
[]
[2,"MICS06"]
[null,"DHS13"]
[null,"Template"]

{"sheet":"MICS06","index":4,"n_rows":1072,"n_cols":90,"rows_kept":1072,"cut":false,"hidden":false,"merged":[[346,52,347,52],[348,52,349,52],[350,52,351,52],[352,52,353,52],[152,52,164,52],[270,52,272,52],[273,52,275,52],[276,52,283,52],[338,54,338,58],[338,59,338,63],[338,64,338,68],[340,52,341,52],[342,52,343,52],[344,52,345,52],[221,52,223,52],[224,52,225,52],[226,52,229,52],[258,54,258,58],[258,59,258,63],[258,64,258,68],[260,52,262,52],[263,52,266,52],[267,52,269,52],[119,64,119,68],[121,52,122,52],[123,52,126,52],[127,52,128,52],[132,54,132,58],[132,59,132,63],[132,64,132,68],[134,52,138,52],[219,54,219,58],[219,59,219,63],[219,64,219,68],[13,64,13,68],[15,52,16,52],[17,52,20,52],[21,52,22,52],[26,54,26,58],[26,59,26,63],[26,64,26,68],[40,52,41,52],[55,54,55,58],[55,59,55,63],[55,64,55,68],[139,52,142,52],[143,0,146,0],[143,52,146,52],[147,0,149,0],[147,52,149,52],[150,0,151,0],[150,52,151,52],[13,54,13,58],[13,59,13,63],[119,54,119,58],[119,59,119,63],[42,52,43,52],[44,52,45,52],[46,0,48,0],[46,52,48,52],[49,0,51,0],[49,52,51,52],[52,0,54,0],[52,52,54,52],[32,52,33,52],[34,52,35,52],[36,52,37,52],[38,0,39,0],[38,52,39,52],[13,2,13,6],[13,7,13,11],[28,52,29,52],[30,0,31,0],[30,52,31,52],[26,2,26,6],[26,7,26,11],[26,12,26,16],[13,12,13,16],[15,0,16,0],[17,0,20,0],[21,0,22,0],[23,0,25,0],[32,0,33,0],[55,2,55,6],[55,7,55,11],[55,12,55,16],[28,0,29,0],[34,0,35,0],[36,0,37,0],[40,0,41,0],[42,0,43,0],[44,0,45,0],[139,0,142,0],[107,0,107,1],[119,2,119,6],[119,7,119,11],[57,0,71,0],[132,12,132,16],[134,0,138,0],[119,12,119,16],[121,0,122,0],[123,0,126,0],[127,0,128,0],[129,0,131,0],[152,0,163,0],[132,2,132,6],[132,7,132,11],[219,2,219,6],[219,7,219,11],[219,12,219,16],[207,0,207,1],[1024,0,1024,2],[1025,0,1025,1],[1030,0,1032,0],[1033,0,1033,2],[398,2,398,5],[221,0,223,0],[398,7,398,10],[398,12,398,15],[399,2,399,4],[399,7,399,9],[399,12,399,14],[400,2,401,3],[400,7,401,8],[400,12,401,13],[405,2,405,3],[405,7,405,8],[405,12,405,13],[406,2,406,3],[406,7,406,8],[406,12,406,13],[401,1,444,1],[402,2,402,3],[402,7,402,8],[402,12,402,13],[403,2,403,3],[403,7,403,8],[403,12,403,13],[404,2,404,3],[404,7,404,8],[404,12,404,13],[409,2,409,3],[409,7,409,8],[409,12,409,13],[410,2,410,3],[410,7,410,8],[410,12,410,13],[407,2,407,3],[407,7,407,8],[407,12,407,13],[408,2,408,3],[408,7,408,8],[408,12,408,13],[413,2,413,3],[413,7,413,8],[413,12,413,13],[414,2,414,3],[414,7,414,8],[414,12,414,13],[411,2,411,3],[411,7,411,8],[411,12,411,13],[412,2,412,3],[412,7,412,8],[412,12,412,13],[417,2,417,3],[417,7,417,8],[417,12,417,13],[418,2,418,3],[418,7,418,8],[418,12,418,13],[415,2,415,3],[415,7,415,8],[415,12,415,13],[416,2,416,3],[416,7,416,8],[416,12,416,13],[421,2,421,3],[421,7,421,8],[421,12,421,13],[422,2,422,3],[422,7,422,8],[422,12,422,13],[419,2,419,3],[419,7,419,8],[419,12,419,13],[420,2,420,3],[420,7,420,8],[420,12,420,13],[425,2,425,3],[425,7,425,8],[425,12,425,13],[426,2,426,3],[426,7,426,8],[426,12,426,13],[423,2,423,3],[423,7,423,8],[423,12,423,13],[424,2,424,3],[424,7,424,8],[424,12,424,13],[429,2,429,3],[429,7,429,8],[429,12,429,13],[430,2,430,3],[430,7,430,8],[430,12,430,13],[427,2,427,3],[427,7,427,8],[427,12,427,13],[428,2,428,3],[428,7,428,8],[428,12,428,13],[433,2,433,3],[433,7,433,8],[433,12,433,13],[434,2,434,3],[434,7,434,8],[434,12,434,13],[431,2,431,3],[431,7,431,8],[431,12,431,13],[432,2,432,3],[432,7,432,8],[432,12,432,13],[437,2,437,3],[437,7,437,8],[437,12,437,13],[438,2,438,3],[438,7,438,9],[438,12,438,13],[435,2,435,3],[435,7,435,8],[435,12,435,13],[436,2,436,3],[436,7,436,8],[436,12,436,13],[441,2,441,4],[441,7,441,8],[441,12,441,14],[442,2,442,3],[442,7,442,8],[442,12,442,13],[439,2,439,3],[439,7,439,8],[439,12,439,13],[440,2,440,3],[440,7,440,8],[440,12,440,13],[445,2,445,3],[445,7,445,8],[445,12,445,13],[446,2,446,3],[446,7,446,8],[446,12,446,13],[443,2,443,3],[443,7,443,8],[443,12,443,13],[444,2,444,3],[444,7,444,8],[444,12,444,13],[449,2,449,3],[449,7,449,8],[449,12,449,13],[450,2,450,3],[450,7,450,8],[450,12,450,13],[447,2,447,3],[447,7,447,8],[447,12,447,13],[448,2,448,3],[448,7,448,8],[448,12,448,13],[453,2,453,3],[453,7,453,8],[453,12,453,13],[454,2,454,3],[454,7,454,8],[454,12,454,13],[451,2,451,3],[451,7,451,8],[451,12,451,13],[452,2,452,3],[452,7,452,8],[452,12,452,13],[457,2,457,3],[457,7,457,8],[457,12,457,13],[458,2,458,3],[458,7,458,8],[458,12,458,13],[455,2,455,3],[455,7,455,8],[455,12,455,13],[456,2,456,3],[456,7,456,8],[456,12,456,13],[461,2,461,3],[461,7,461,8],[461,12,461,13],[462,2,462,3],[462,7,462,8],[462,12,462,13],[459,2,459,3],[459,7,459,8],[459,12,459,13],[460,2,460,3],[460,7,460,8],[460,12,460,13],[465,2,465,3],[465,7,465,8],[465,12,465,13],[466,2,466,3],[466,7,466,8],[466,12,466,13],[463,2,463,3],[463,7,463,8],[463,12,463,13],[464,2,464,3],[464,7,464,8],[464,12,464,13],[469,2,469,3],[469,7,469,8],[469,12,469,13],[470,2,470,3],[470,7,470,8],[470,12,470,13],[467,2,467,3],[467,7,467,8],[467,12,467,13],[468,2,468,3],[468,7,468,8],[468,12,468,13],[473,2,473,3],[473,7,473,8],[473,12,473,13],[474,2,474,3],[474,7,474,8],[474,12,474,13],[471,2,471,3],[471,7,471,8],[471,12,471,13],[472,2,472,3],[472,7,472,8],[472,12,472,13],[478,2,478,3],[478,7,478,8],[478,12,478,13],[479,2,479,3],[479,7,479,8],[479,12,479,13],[475,2,475,3],[475,7,475,11],[475,12,475,13],[476,2,476,3],[476,7,477,8],[476,9,476,11],[476,12,476,13],[477,2,477,3],[477,12,477,13],[482,14,482,16],[484,2,484,3],[484,7,484,8],[484,12,484,13],[480,2,480,3],[480,7,480,8],[480,12,480,13],[481,2,481,6],[481,7,481,9],[481,12,481,16],[485,2,485,3],[485,7,485,8],[485,12,485,13],[486,2,486,3],[486,7,486,8],[486,12,486,13],[482,2,483,3],[482,4,482,6],[482,7,483,8],[482,12,483,13],[490,2,490,3],[490,7,490,8],[490,12,490,13],[491,2,491,3],[491,7,491,8],[491,12,491,13],[487,2,487,4],[487,7,487,8],[487,12,487,14],[488,2,489,3],[488,7,488,8],[488,12,489,13],[489,7,489,8],[494,2,494,3],[494,7,494,8],[494,12,494,13],[495,2,495,3],[495,7,495,8],[495,12,495,13],[492,2,492,3],[492,7,492,8],[492,12,492,13],[493,2,493,3],[493,7,493,8],[493,12,493,13],[498,2,498,3],[498,7,498,8],[498,12,498,13],[499,2,499,3],[499,7,499,8],[499,12,499,13],[496,2,496,3],[496,7,496,8],[496,12,496,13],[497,2,497,3],[497,7,497,8],[497,12,497,13],[502,2,502,3],[502,7,502,8],[502,12,502,13],[503,2,503,3],[503,7,503,8],[503,12,503,13],[500,2,500,3],[500,7,500,8],[500,12,500,13],[501,2,501,3],[501,7,501,8],[501,12,501,13],[506,2,506,3],[506,7,506,8],[506,12,506,13],[507,2,507,3],[507,7,507,8],[507,12,507,13],[504,2,504,3],[504,7,504,8],[504,12,504,13],[505,2,505,3],[505,7,505,8],[505,12,505,13],[510,2,510,3],[510,7,510,8],[510,12,510,13],[511,2,511,3],[511,7,511,8],[511,12,511,13],[508,2,508,3],[508,7,508,8],[508,12,508,13],[509,2,509,3],[509,7,509,8],[509,12,509,13],[514,2,514,3],[514,7,514,8],[514,12,514,13],[515,2,515,3],[515,7,515,8],[515,12,515,13],[512,2,512,3],[512,7,512,8],[512,12,512,13],[513,2,513,3],[513,7,513,8],[513,12,513,13],[518,2,518,3],[518,7,518,8],[518,12,518,13],[519,2,519,3],[519,7,519,9],[519,12,519,13],[516,2,516,3],[516,7,516,8],[516,12,516,13],[517,2,517,3],[517,7,517,8],[517,12,517,13],[522,2,522,3],[522,7,522,8],[522,12,522,13],[523,2,523,3],[523,7,523,8],[523,12,523,13],[520,2,520,3],[520,7,520,8],[520,12,520,13],[521,2,521,3],[521,7,521,8],[521,12,521,13],[526,2,526,3],[526,7,526,8],[526,12,526,13],[527,2,527,3],[527,7,527,8],[527,12,527,13],[524,2,524,3],[524,7,524,8],[524,12,524,13],[525,2,525,3],[525,7,525,8],[525,12,525,13],[530,2,530,3],[530,7,530,8],[530,12,530,13],[531,2,531,3],[531,7,531,8],[531,12,531,13],[528,2,528,4],[528,7,528,8],[528,12,528,14],[529,2,529,3],[529,7,529,8],[529,12,529,13],[534,2,534,3],[534,7,534,8],[534,12,534,13],[535,2,535,3],[535,7,535,8],[535,12,535,13],[532,2,532,3],[532,7,532,8],[532,12,532,13],[533,2,533,3],[533,7,533,8],[533,12,533,13],[538,2,538,3],[538,7,538,8],[538,12,538,13],[539,2,539,3],[539,7,539,8],[539,12,539,13],[536,2,536,3],[536,7,536,8],[536,12,536,13],[537,2,537,3],[537,7,537,8],[537,12,537,13],[542,2,542,3],[542,7,542,8],[542,12,542,13],[543,2,543,3],[543,7,543,8],[543,12,543,13],[540,2,540,3],[540,7,540,8],[540,12,540,13],[541,2,541,3],[541,7,541,8],[541,12,541,13],[546,2,546,3],[546,7,546,8],[546,12,546,13],[547,2,547,3],[547,7,547,8],[547,12,547,13],[544,2,544,3],[544,7,544,8],[544,12,544,13],[545,2,545,3],[545,7,545,8],[545,12,545,13],[550,2,550,3],[550,7,550,8],[550,12,550,13],[551,2,551,3],[551,7,551,8],[551,12,551,13],[548,2,548,3],[548,7,548,8],[548,12,548,13],[549,2,549,3],[549,7,549,8],[549,12,549,13],[554,2,554,3],[554,7,554,8],[554,12,554,13],[555,2,555,3],[555,7,555,8],[555,12,555,13],[552,2,552,3],[552,7,552,8],[552,12,552,13],[553,2,553,3],[553,7,553,8],[553,12,553,13],[558,2,558,3],[558,7,558,8],[558,12,558,13],[559,2,559,3],[559,7,559,8],[559,12,559,13],[556,2,556,3],[556,7,556,8],[556,12,556,13],[557,2,557,3],[557,7,557,8],[557,12,557,13],[562,2,562,3],[562,7,562,8],[562,12,562,13],[563,2,563,3],[563,7,563,8],[563,12,563,13],[560,2,560,3],[560,7,560,8],[560,12,560,13],[561,2,561,3],[561,7,561,8],[561,12,561,13],[566,2,566,3],[566,7,566,8],[566,12,566,13],[567,2,567,3],[567,7,567,8],[567,12,567,13],[564,2,564,3],[564,7,564,8],[564,12,564,13],[565,2,565,3],[565,7,565,8],[565,12,565,13],[570,2,570,3],[570,7,570,8],[570,12,570,13],[571,2,571,3],[571,7,571,8],[571,12,571,13],[568,2,568,3],[568,7,568,8],[568,12,568,13],[569,2,569,3],[569,7,569,8],[569,12,569,13],[574,2,574,3],[574,7,574,8],[574,12,574,13],[575,2,575,3],[575,7,575,8],[575,12,575,13],[572,2,572,3],[572,7,572,8],[572,12,572,13],[573,2,573,3],[573,7,573,8],[573,12,573,13],[578,2,578,3],[578,7,578,8],[578,12,578,13],[579,2,579,3],[579,7,579,8],[579,12,579,13],[576,2,576,3],[576,7,576,8],[576,12,576,13],[577,2,577,3],[577,7,577,8],[577,12,577,13],[582,2,582,3],[582,7,582,8],[582,12,582,13],[583,2,583,3],[583,7,583,8],[583,12,583,13],[580,2,580,3],[580,7,580,8],[580,12,580,13],[581,2,581,3],[581,7,581,8],[581,12,581,13],[586,2,586,3],[586,7,586,8],[586,12,586,13],[587,2,587,3],[587,7,587,8],[587,12,587,13],[584,2,584,3],[584,7,584,8],[584,12,584,13],[585,2,585,3],[585,7,585,8],[585,12,585,13],[590,2,590,3],[590,7,590,8],[590,12,590,13],[591,2,591,3],[591,7,591,8],[591,12,591,13],[588,2,588,3],[588,7,588,8],[588,12,588,13],[589,2,589,3],[589,7,589,8],[589,12,589,13],[594,2,594,3],[594,7,594,8],[594,12,594,13],[595,2,595,3],[595,7,595,8],[595,12,595,13],[592,2,592,3],[592,7,592,8],[592,12,592,13],[593,2,593,3],[593,7,593,8],[593,12,593,13],[598,2,598,3],[598,7,598,8],[598,12,598,13],[599,2,599,3],[599,7,599,8],[599,12,599,13],[596,2,596,3],[596,7,596,8],[596,12,596,13],[597,2,597,3],[597,7,597,8],[597,12,597,13],[602,2,602,3],[602,7,602,8],[602,12,602,13],[603,2,603,3],[603,7,603,8],[603,12,603,13],[600,2,600,3],[600,7,600,8],[600,12,600,13],[601,2,601,3],[601,7,601,8],[601,12,601,13],[606,2,606,3],[606,7,606,8],[606,12,606,13],[607,2,607,3],[607,7,607,8],[607,12,607,13],[604,2,604,3],[604,7,604,8],[604,12,604,13],[605,2,605,3],[605,7,605,8],[605,12,605,13],[610,2,610,3],[610,7,610,8],[610,12,610,13],[611,2,611,3],[611,7,611,8],[611,12,611,13],[608,2,608,3],[608,7,608,8],[608,12,608,13],[609,2,609,3],[609,7,609,8],[609,12,609,13],[614,2,614,3],[614,7,614,8],[614,12,614,13],[615,2,615,3],[615,7,615,8],[615,12,615,13],[612,2,612,3],[612,7,612,8],[612,12,612,13],[613,2,613,3],[613,7,613,8],[613,12,613,13],[618,2,618,3],[618,7,618,8],[618,12,618,13],[619,2,619,3],[619,7,619,8],[619,12,619,13],[616,2,616,3],[616,7,616,8],[616,12,616,13],[617,2,617,3],[617,7,617,8],[617,12,617,13],[622,2,622,3],[622,7,622,8],[622,12,622,13],[623,2,623,3],[623,7,623,8],[623,12,623,13],[620,2,620,3],[620,7,620,8],[620,12,620,13],[621,2,621,3],[621,7,621,8],[621,12,621,13],[626,2,626,3],[626,7,626,8],[626,12,626,13],[627,2,627,3],[627,7,627,8],[627,12,627,13],[624,2,624,3],[624,7,624,8],[624,12,624,13],[625,2,625,3],[625,7,625,8],[625,12,625,13],[630,2,630,3],[630,7,630,8],[630,12,630,13],[631,2,631,3],[631,7,631,8],[631,12,631,13],[628,2,628,3],[628,7,628,8],[628,12,628,13],[629,2,629,3],[629,7,629,8],[629,12,629,13],[634,2,634,3],[634,7,634,8],[634,12,634,13],[635,2,635,3],[635,7,635,8],[635,12,635,13],[632,2,632,3],[632,7,632,8],[632,12,632,13],[633,2,633,3],[633,7,633,8],[633,12,633,13],[638,2,638,3],[638,7,638,8],[638,12,638,13],[639,2,639,3],[639,7,639,8],[639,12,639,13],[636,2,636,3],[636,7,636,8],[636,12,636,13],[637,2,637,3],[637,7,637,8],[637,12,637,13],[642,2,642,3],[642,7,642,8],[642,12,642,13],[643,2,643,3],[643,7,643,8],[643,12,643,13],[640,2,640,3],[640,7,640,8],[640,12,640,13],[641,2,641,3],[641,7,641,8],[641,12,641,13],[646,2,646,3],[646,7,646,8],[646,12,646,13],[647,2,647,3],[647,7,647,8],[647,12,647,13],[644,2,644,3],[644,7,644,8],[644,12,644,13],[645,2,645,3],[645,7,645,8],[645,12,645,13],[650,2,650,3],[650,7,650,8],[650,12,650,13],[651,2,651,3],[651,7,651,8],[651,12,651,13],[648,2,648,3],[648,7,648,8],[648,12,648,13],[649,2,649,3],[649,7,649,8],[649,12,649,13],[654,2,654,3],[654,7,654,8],[654,12,654,13],[655,2,655,3],[655,7,655,8],[655,12,655,13],[652,2,652,3],[652,7,652,8],[652,12,652,13],[653,2,653,3],[653,7,653,8],[653,12,653,13],[658,2,658,3],[658,7,658,8],[658,12,658,13],[659,2,659,3],[659,7,659,8],[659,12,659,13],[656,2,656,3],[656,7,656,8],[656,12,656,13],[657,2,657,3],[657,7,657,8],[657,12,657,13],[662,2,662,3],[662,7,662,8],[662,12,662,13],[663,2,663,3],[663,7,663,8],[663,12,663,13],[660,2,660,3],[660,7,660,8],[660,12,660,13],[661,2,661,3],[661,7,661,8],[661,12,661,13],[666,2,666,3],[666,7,666,8],[666,12,666,13],[667,2,667,3],[667,7,667,8],[667,12,667,13],[664,2,664,3],[664,7,664,8],[664,12,664,13],[665,2,665,3],[665,7,665,8],[665,12,665,13],[670,2,670,3],[670,7,670,8],[670,12,670,13],[671,2,671,3],[671,7,671,8],[671,12,671,13],[668,2,668,3],[668,7,668,8],[668,12,668,13],[669,2,669,3],[669,7,669,8],[669,12,669,13],[674,2,674,3],[674,7,674,8],[674,12,674,13],[675,2,675,3],[675,7,675,8],[675,12,675,13],[672,2,672,3],[672,7,672,8],[672,12,672,13],[673,2,673,3],[673,7,673,8],[673,12,673,13],[678,2,678,3],[678,7,678,8],[678,12,678,13],[679,2,679,3],[679,7,679,8],[679,12,679,13],[676,2,676,3],[676,7,676,8],[676,12,676,13],[677,2,677,3],[677,7,677,8],[677,12,677,13],[682,2,682,3],[682,7,682,8],[682,12,682,13],[683,2,683,3],[683,7,683,8],[683,12,683,13],[680,2,680,3],[680,7,680,8],[680,12,680,13],[681,2,681,3],[681,7,681,8],[681,12,681,13],[686,2,686,3],[686,7,686,8],[686,12,686,13],[687,2,687,3],[687,7,687,8],[687,12,687,13],[684,2,684,3],[684,7,684,8],[684,12,684,13],[685,2,685,3],[685,7,685,8],[685,12,685,13],[690,2,690,3],[690,7,690,8],[690,12,690,13],[691,2,691,3],[691,7,691,8],[691,12,691,13],[688,2,688,3],[688,7,688,8],[688,12,688,13],[689,2,689,3],[689,7,689,8],[689,12,689,13],[694,2,694,3],[694,7,694,8],[694,12,694,13],[695,2,695,3],[695,7,695,8],[695,12,695,13],[692,2,692,3]],"merged_total":1014,"flags":["merged_cut"]}
[]
[{"$f":"A1026","v":"Yemen"}]
[{"$f":"A1034","v":"2006"}]
["Use of drinking water sources"]
[" by wealth quintile and sub-national region"]
["Notes:"]
["WHO/UNICEF JMP customised wealth index excludes water,"]
[" sanitation and hygiene assets."]
["Survey used for analysis:",{"$f":"A1025","v":"MICS06"}]
[{"$f":"B1028","v":""}]
[{"$f":"B1027","v":""}]
[]
[]
["Use of drinking water sources",null,"NATIONAL wealth index quintile",null,null,null,null,"URBAN wealth index quintile",null,null,null,null,"RURAL wealth index quintile",null,null,null,null,"SUB-REGIONS:",null,null,null,null,null,null,null,null,null,null,null,null,null,null,null,null,null,null,null,null,null,null,null,null,null,null,null,null,null,null,null,null,null,null,"Raw numbers of respondents:","Use of drinking water sources","NATIONAL wealth index quintile",null,null,null,null,"URBAN wealth index quintile",null,null,null,null,"RURAL wealth index quintile",null,null,null,null,"SUB-REGIONS:"]
["Weighted percentage (used in graphs)",null,"Poorest","Poor","Middle","Rich","Richest","Poorest","Poor","Middle","Rich","Richest","Poorest","Poor","Middle","Rich","Richest","Abyan","Aden","Al Baidhah","Al Dala'a","Al Hodeidah","Al Jawf","Al Maharah","Al Mahweet","Amran","Dhamar","Hadramout","Hajjah","Ibb","Lahej","Mareb","Raimah","Sa'adah","Sana'a","Sana'a City","Shabwah","Taiz",null,null,null,null,null,null,null,null,null,null,null,null,null,null,"Water data, raw numbers (weighted)",null,"Poorest","Poor","Middle","Rich","Richest","Poorest","Poor","Middle","Rich","Richest","Poorest","Poor","Middle","Rich","Richest","Abyan","Aden","Al Baidhah","Al Dala'a","Al Hodeidah","Al Jawf","Al Maharah","Al Mahweet","Amran","Dhamar","Hadramout","Hajjah","Ibb","Lahej","Mareb","Raimah","Sa'adah","Sana'a","Sana'a City","Shabwah","Taiz"]
["Water","Improved",37.470953026076685,57.682045045979905,74.732131802316559,93.419767844387863,98.503961806104485,95.094665411921568,96.890455270907538,97.614137988894981,98.307922264614191,100,36.277117923002962,43.146588746250686,65.09360086198113,69.456629859697799,91.852240859110637,75.201447894161944,97.465352667600328,80.491682898967184,98.224811761297175,75.689175457007309,61.968098654874623,100,42.287000620571071,65.799117920622535,42.858618583977453,95.432505952934505,50.114749723358209,65.571228178996293,88.333226853866137,69.714576211615764,79.267385813925102,82.582350556923174,60.849794514052981,100,100,70.488436323272197,null,null,null,null,null,null,null,null,null,null,null,null,null,null,"Water","Improved","N/A","N/A","N/A","N/A","N/A","N/A","N/A","N/A","N/A","N/A","N/A","N/A","N/A","N/A","N/A","N/A","N/A","N/A","N/A","N/A","N/A","N/A","N/A","N/A","N/A","N/A","N/A","N/A","N/A","N/A","N/A","N/A","N/A","N/A","N/A","N/A"]
[null,"Not Improved",62.529046973923087,42.317954954020067,25.267868197683342,6.5802321556122045,1.4960381938955354,4.9053345880784249,3.1095447290924585,2.3858620111050031,1.6920777353858039,0,63.722882076997053,56.853411253749478,34.906399138018934,30.543370140302216,8.1477591408893915,24.798552105838077,2.5346473323996741,19.508317101032898,1.7751882387028073,24.310824542992801,38.031901345125384,0,57.712999379428979,34.20088207937745,57.14138141602254,4.567494047065451,49.885250276641649,34.428771821003643,11.666773146133893,30.285423788384218,20.732614186074887,17.417649443076876,39.150205485946962,0,0,29.511563676727871,null,null,null,null,null,null,null,null,null,null,null,null,null,null,null,"Not Improved","N/A","N/A","N/A","N/A","N/A","N/A","N/A","N/A","N/A","N/A","N/A","N/A","N/A","N/A","N/A","N/A","N/A","N/A","N/A","N/A","N/A","N/A","N/A","N/A","N/A","N/A","N/A","N/A","N/A","N/A","N/A","N/A","N/A","N/A","N/A","N/A"]
["Water ladder","Basic",21.735441162824213,46.034283466918083,67.689297138237905,91.486510042657002,95.614283421517541,91.428619931042249,95.292391113593055,95.198505768621374,96.406305166778253,98.630894067728306,17.914047379206746,31.458028606494647,53.737240806658036,62.687314238887403,88.223910564806388,69.968477982385608,97.465352667600328,72.356101140840138,98.224811761297175,63.641965533236167,27.373260898519607,100,21.118043000456062,64.223663980447157,32.808863446765514,94.45444166802136,41.995978464068706,60.137145238984459,82.993771151272909,59.116391553469192,48.199593381195363,81.43793846997832,50.578313404985963,99.194979063177612,92.426775225353751,61.096866179858402,null,null,null,null,null,null,null,null,null,null,null,null,null,null,"Water ladder","Basic","N/A","N/A","N/A","N/A","N/A","N/A","N/A","N/A","N/A","N/A","N/A","N/A","N/A","N/A","N/A","N/A","N/A","N/A","N/A","N/A","N/A","N/A","N/A","N/A","N/A","N/A","N/A","N/A","N/A","N/A","N/A","N/A","N/A","N/A","N/A","N/A"]
[null,"Limited",15.66515419051575,11.604590926165336,7.0428346640786499,1.933257801730907,2.8866637193316587,3.666045480879323,1.5980641573144945,2.4094070617358638,1.8949278325822518,1.3691059322717052,18.259564637182216,11.688560139756037,11.304880117346356,6.7693156208103868,3.6283302943042322,5.2329699117763289,0,8.1355817581270333,0,12.047209923771108,34.594837756355034,0,21.168957620115002,1.575453940175386,10.04975513721196,0.94357097253175637,7.9515328885249525,5.4340829400118089,5.3394557025932485,10.598184658146593,31.067792432729707,1.1444120869448582,10.27148110906702,0.80502093682240838,7.573224774646234,9.3426362981627395,null,null,null,null,null,null,null,null,null,null,null,null,null,null,null,"Limited","N/A","N/A","N/A","N/A","N/A","N/A","N/A","N/A","N/A","N/A","N/A","N/A","N/A","N/A","N/A","N/A","N/A","N/A","N/A","N/A","N/A","N/A","N/A","N/A","N/A","N/A","N/A","N/A","N/A","N/A","N/A","N/A","N/A","N/A","N/A","N/A"]
[null,"Unimproved",53.756291717692875,35.846161152178418,20.031468609140713,5.5607634041046392,1.1482064460790964,4.9053345880784249,3.1095447290924585,2.3920871696427422,1.6987670006394955,0,54.187431541937912,49.279863817345685,28.283395297400372,24.692903763691319,6.1693097370056114,24.798552105838077,2.5346473323996741,19.508317101032898,1.7751882387028073,22.70637922844541,38.031901345125384,0,54.480303193632253,34.20088207937745,48.603442539921701,3.7999520327948426,36.667751957531834,30.409129414480546,5.8949160737431585,30.285423788384218,6.3382933699041395,17.417649443076876,16.588555806226726,0,0,26.493015814732285,null,null,null,null,null,null,null,null,null,null,null,null,null,null,null,"Unimproved","N/A","N/A","N/A","N/A","N/A","N/A","N/A","N/A","N/A","N/A","N/A","N/A","N/A","N/A","N/A","N/A","N/A","N/A","N/A","N/A","N/A","N/A","N/A","N/A","N/A","N/A","N/A","N/A","N/A","N/A","N/A","N/A","N/A","N/A","N/A","N/A"]
[null,"Surface water",8.8431129289669492,6.5149644547381342,5.236399588542624,1.0194687515075649,0.35084641307170344,0,0,0,0,0,9.6389564416732458,7.573547436403774,6.6744837785953246,5.850466376610906,1.978449403883777,0,0,0,0,1.6044453145473963,0,0,3.2326961857967138,0,8.5379388761008528,0.80203532665199273,13.384736689874366,4.0196424065231007,5.7718570723907359,0,14.394320816170749,0,22.561649679720226,0,0,3.0674817072466474,null,null,null,null,null,null,null,null,null,null,null,null,null,null,null,"Surface water","N/A","N/A","N/A","N/A","N/A","N/A","N/A","N/A","N/A","N/A","N/A","N/A","N/A","N/A","N/A","N/A","N/A","N/A","N/A","N/A","N/A","N/A","N/A","N/A","N/A","N/A","N/A","N/A","N/A","N/A","N/A","N/A","N/A","N/A","N/A","N/A"]
["Improved water point at more than 30 minutes","Yes",41.884772267714212,20.133271248541018,9.424105126170554,2.0694311775118011,2.9305948857567219,3.8551536671369671,1.6493514793033812,2.4684546486752756,1.9276745314014312,1.3691059322717052,50.477581914986693,27.090345910073221,17.380860212961156,9.7461043452358478,3.9501815746331306,6.9586026044886502,0,10.107357015182277,0,15.916688021808509,55.826850439655509,0,50.060201266242274,2.3943389971822291,23.448621232437542,0.98908870993676223,15.919777929260229,8.2872977842932176,6.0446741195434468,15.202250711495733,39.193663464138048,1.3857828933508338,16.880058825334025,0.80502093682240838,7.573224774646234,13.263347936163905,null,null,null,null,null,null,null,null,null,null,null,null,null,null,"Improved water point at more than 30 minutes","Yes","N/A","N/A","N/A","N/A","N/A","N/A","N/A","N/A","N/A","N/A","N/A","N/A","N/A","N/A","N/A","N/A","N/A","N/A","N/A","N/A","N/A","N/A","N/A","N/A","N/A","N/A","N/A","N/A","N/A","N/A","N/A","N/A","N/A","N/A","N/A","N/A"]
[null,"No",58.11522773228576,79.866728751458965,90.575894873829441,97.930568822488226,97.069405114243295,96.144846332863025,98.350648520696623,97.531545351324738,98.072325468598549,98.630894067728306,49.522418085013257,72.909654089926761,82.619139787038904,90.253895654764136,96.049818425366851,93.041397395511353,100,89.892642984817712,100,84.083311978191446,44.173149560344513,100,49.939798733757698,97.605661002817769,76.551378767562497,99.010911290063234,84.080222070739765,91.712702215706727,93.95532588045657,84.797749288504292,60.806336535861902,98.614217106649178,83.119941174665982,99.194979063177612,92.426775225353751,86.736652063836118,null,null,null,null,null,null,null,null,null,null,null,null,null,null,null,"No","N/A","N/A","N/A","N/A","N/A","N/A","N/A","N/A","N/A","N/A","N/A","N/A","N/A","N/A","N/A","N/A","N/A","N/A","N/A","N/A","N/A","N/A","N/A","N/A","N/A","N/A","N/A","N/A","N/A","N/A","N/A","N/A","N/A","N/A","N/A","N/A"]
["Manually calculated ratios","Improved wells",{"$f":"C62/(C62+C63)*100","v":30.103553973949182},{"$f":"D62/(D62+D63)*100","v":33.72087888435987},{"$f":"E62/(E62+E63)*100","v":32.188805136642991},{"$f":"F62/(F62+F63)*100","v":37.55224799335118},{"$f":"G62/(G62+G63)*100","v":83.156909727553739},100,{"$f":"I62/(I62+I63)*100","v":100},100,{"$f":"K62/(K62+K63)*100","v":100},100,35.971211041714021,22.33385948718848,39.513743986318069,26.717504683522808,43.682212691038671,3.1345335235784448,50,{"$f":"T62/(T62+T63)*100","v":13.40250881553847},{"$f":"U62/(U62+U63)*100","v":0},{"$f":"V62/(V62+V63)*100","v":40.534054122003646},{"$f":"W62/(W62+W63)*100","v":55.744908384144573},50,{"$f":"Y62/(Y62+Y63)*100","v":45.626874444260245},15.72557447591468,46.842128373326041,100,17.692761669812178,14.754726010645413,47.661974983844985,43.400887880298043,95.46753453733038,23.302631243419697,27.793200605267131,100,50,{"$f":"AL62/(AL62+AL63)*100","v":30.643755832674778}]
[null,"Improved springs",{"$f":"C64/(C64+C65)*100","v":20.10531081951342},{"$f":"D64/(D64+D65)*100","v":24.303315822835835},{"$f":"E64/(E64+E65)*100","v":25.765675999828446},{"$f":"F64/(F64+F65)*100","v":31.920222845260639},{"$f":"G64/(G64+G65)*100","v":0},50,50,50,50,50,{"$f":"M64/(M64+M65)*100","v":17.873038091779563},25.595653247022405,31.398251757450304,20.34508686894798,28.915037269142136,0,50,{"$f":"T64/(T64+T65)*100","v":0},50,{"$f":"V64/(V64+V65)*100","v":17.288167082362392},{"$f":"W64/(W64+W65)*100","v":0},50,{"$f":"Y64/(Y64+Y65)*100","v":35.105008171962325},{"$f":"Z64/(Z64+Z65)*100","v":49.211524337334417},{"$f":"AA64/(AA64+AA65)*100","v":4.4321599818229229},50,{"$f":"AC64/(AC64+AC65)*100","v":0},{"$f":"AD64/(AD64+AD65)*100","v":12.851275087007549},{"$f":"AE64/(AE64+AE65)*100","v":0},50,{"$f":"AG64/(AG64+AG65)*100","v":87.648694326108654},50,{"$f":"AI64/(AI64+AI65)*100","v":18.818241653217445},50,50,{"$f":"AL64/(AL64+AL65)*100","v":39.674900301163603}]
[null,"Other"]
[null,null,"NATIONAL wealth index quintile",null,null,null,null,"URBAN wealth index quintile",null,null,null,null,"RURAL wealth index quintile",null,null,null,null,"SUB-REGIONS:",null,null,null,null,null,null,null,null,null,null,null,null,null,null,null,null,null,null,null,null,null,null,null,null,null,null,null,null,null,null,null,null,null,null,"Raw numbers of respondents:","Use of drinking water sources","NATIONAL wealth index quintile",null,null,null,null,"URBAN wealth index quintile",null,null,null,null,"RURAL wealth index quintile",null,null,null,null,"SUB-REGIONS:"]
["Percentage based on weighted population",null,"Poorest","Poor","Middle","Rich","Richest","Poorest","Poor","Middle","Rich","Richest","Poorest","Poor","Middle","Rich","Richest","Abyan","Aden","Al Baidhah","Al Dala'a","Al Hodeidah","Al Jawf","Al Maharah","Al Mahweet","Amran","Dhamar","Hadramout","Hajjah","Ibb","Lahej","Mareb","Raimah","Sa'adah","Sana'a","Sana'a City","Shabwah","Taiz",null,null,null,null,null,null,null,null,null,null,null,null,null,null,"Water data, raw numbers (weighted)",null,"Poorest","Poor","Middle","Rich","Richest","Poorest","Poor","Middle","Rich","Richest","Poorest","Poor","Middle","Rich","Richest","Abyan","Aden","Al Baidhah","Al Dala'a","Al Hodeidah","Al Jawf","Al Maharah","Al Mahweet","Amran","Dhamar","Hadramout","Hajjah","Ibb","Lahej","Mareb","Raimah","Sa'adah","Sana'a","Sana'a City","Shabwah","Taiz"]
["Piped water","Yes",8.6612974103887233,25.179588801285828,42.181671905907834,62.488320277801691,70.254718528566784,71.345694406095134,70.136650076126088,71.357669418863878,71.987354074467873,76.925619441368923,4.4786587029094651,15.056833599486319,27.88209068268533,38.04196335975147,55.383471982080358,29.866398414256913,97.465352667600328,64.952761490658261,80.942307397627545,54.72265453785424,0,0,2.7275874067659771,13.517011925719121,24.010324408761946,77.699317395556264,15.953635829284451,47.477270669380758,49.90736904483483,44.469378764109443,17.07767163423506,0,11.969061535741655,62.272328856358008,24.257955843269404,44.760893565302808,null,null,null,null,null,null,null,null,null,null,null,null,null,null,"Piped water","Yes","N/A","N/A","N/A","N/A","N/A","N/A","N/A","N/A","N/A","N/A","N/A","N/A","N/A","N/A","N/A","N/A","N/A","N/A","N/A","N/A","N/A","N/A","N/A","N/A","N/A","N/A","N/A","N/A","N/A","N/A","N/A","N/A","N/A","N/A","N/A","N/A"]
[null,"No",91.338702589611273,74.820411198714083,57.818328094092109,37.51167972219838,29.745281471433284,28.654305593904901,29.863349923873905,28.642330581136065,28.012645925532148,23.07438055863107,95.521341297090487,84.943166400513647,72.117909317314783,61.958036640248579,44.616528017919499,70.133601585743094,2.5346473323996741,35.047238509341803,19.057692602372434,45.277345462145753,100,100,97.272412593234023,86.482988074280897,75.989675591238068,22.300682604443654,84.046364170715535,52.522729330619121,50.092630955165227,55.530621235890564,82.922328365764912,100,88.030938464258313,37.727671143642013,75.7420441567306,55.23910643469727,null,null,null,null,null,null,null,null,null,null,null,null,null,null,null,"No","N/A","N/A","N/A","N/A","N/A","N/A","N/A","N/A","N/A","N/A","N/A","N/A","N/A","N/A","N/A","N/A","N/A","N/A","N/A","N/A","N/A","N/A","N/A","N/A","N/A","N/A","N/A","N/A","N/A","N/A","N/A","N/A","N/A","N/A","N/A","N/A"]
["Piped water on premises","Yes",7.2966574358242999,21.454826515506813,39.198729660463826,61.538925337314666,68.43120348174368,67.56398846585239,69.43493930251276,71.357669418863878,71.642704044419673,76.925619441368923,3.9723883373900724,12.521812083950778,23.758219140104323,35.226429952219966,51.844379405822991,29.866398414256913,97.465352667600328,64.952761490658261,80.942307397627545,52.587352032827738,0,0,1.9194133603167991,13.517011925719121,23.764264367781802,77.699317395556264,15.953635829284451,41.801666754412203,46.341644500007696,40.930938318767616,0,0,9.0963727012547491,61.600832379910067,18.865695093168842,41.403421958675963,null,null,null,null,null,null,null,null,null,null,null,null,null,null,"Piped water on premises","Yes","N/A","N/A","N/A","N/A","N/A","N/A","N/A","N/A","N/A","N/A","N/A","N/A","N/A","N/A","N/A","N/A","N/A","N/A","N/A","N/A","N/A","N/A","N/A","N/A","N/A","N/A","N/A","N/A","N/A","N/A","N/A","N/A","N/A","N/A","N/A","N/A"]
[null,"No",92.703342564175685,78.54517348449312,60.801270339536082,38.461074662685412,31.56879651825642,32.436011534147646,30.565060697487244,28.642330581136065,28.357295955580351,23.07438055863107,96.027611662609885,87.478187916049194,76.241780859895741,64.773570047780083,48.155620594176874,70.133601585743094,2.5346473323996741,35.047238509341803,19.057692602372434,47.412647967172269,100,100,98.080586639683204,86.482988074280897,76.235735632218223,22.300682604443654,84.046364170715535,58.198333245587662,53.658355499992375,59.069061681232384,100,100,90.903627298745207,38.399167620089955,81.134304906831161,58.596578041324122,null,null,null,null,null,null,null,null,null,null,null,null,null,null,null,"No","N/A","N/A","N/A","N/A","N/A","N/A","N/A","N/A","N/A","N/A","N/A","N/A","N/A","N/A","N/A","N/A","N/A","N/A","N/A","N/A","N/A","N/A","N/A","N/A","N/A","N/A","N/A","N/A","N/A","N/A","N/A","N/A","N/A","N/A","N/A","N/A"]
["Piped water into dwelling","Yes","N/A","N/A","N/A","N/A","N/A","N/A","N/A","N/A","N/A","N/A","N/A","N/A","N/A","N/A","N/A","N/A","N/A","N/A","N/A","N/A","N/A","N/A","N/A","N/A","N/A","N/A","N/A","N/A","N/A","N/A","N/A","N/A","N/A","N/A","N/A","N/A",null,null,null,null,null,null,null,null,null,null,null,null,null,null,"Piped water into dwelling","Yes","N/A","N/A","N/A","N/A","N/A","N/A","N/A","N/A","N/A","N/A","N/A","N/A","N/A","N/A","N/A","N/A","N/A","N/A","N/A","N/A","N/A","N/A","N/A","N/A","N/A","N/A","N/A","N/A","N/A","N/A","N/A","N/A","N/A","N/A","N/A","N/A"]
[null,"No","N/A","N/A","N/A","N/A","N/A","N/A","N/A","N/A","N/A","N/A","N/A","N/A","N/A","N/A","N/A","N/A","N/A","N/A","N/A","N/A","N/A","N/A","N/A","N/A","N/A","N/A","N/A","N/A","N/A","N/A","N/A","N/A","N/A","N/A","N/A","N/A",null,null,null,null,null,null,null,null,null,null,null,null,null,null,null,"No","N/A","N/A","N/A","N/A","N/A","N/A","N/A","N/A","N/A","N/A","N/A","N/A","N/A","N/A","N/A","N/A","N/A","N/A","N/A","N/A","N/A","N/A","N/A","N/A","N/A","N/A","N/A","N/A","N/A","N/A","N/A","N/A","N/A","N/A","N/A","N/A"]
["Water source on premises","Yes",14.078252187495636,31.007622132555973,55.087637148287172,83.715753804429966,87.733002516552759,87.508163452708644,89.394756900259281,92.11038002866178,93.065904355235091,97.25770598640932,10.311357620813924,20.47530948300809,36.08418367915516,49.221716838897187,72.19059098212459,69.192567334840021,98.36324587491319,67.245691486165697,98.224811761297175,55.992117463975319,12.270518362650778,17.874396135265698,1.9194133603167991,58.371880107407478,24.568022025494923,91.548203337488843,37.456166433680679,54.407035478802534,61.404048529208332,40.930938318767616,3.1352818051378599,70.135367860940406,26.857645484134355,96.67151720270067,88.482387321892176,41.525293029778268,null,null,null,null,null,null,null,null,null,null,null,null,null,null,"Water source on premises","Yes","N/A","N/A","N/A","N/A","N/A","N/A","N/A","N/A","N/A","N/A","N/A","N/A","N/A","N/A","N/A","N/A","N/A","N/A","N/A","N/A","N/A","N/A","N/A","N/A","N/A","N/A","N/A","N/A","N/A","N/A","N/A","N/A","N/A","N/A","N/A","N/A"]
[null,"No",85.921747812504321,68.992377867443906,44.912362851712714,16.284246195570095,12.266997483447325,12.491836547291365,10.60524309974072,7.8896199713381909,6.9340956447648869,2.7422940135907048,89.688642379186007,79.524690516991953,63.915816320844911,50.778283161102841,27.809409017875375,30.807432665160007,1.6367541250868245,32.754308513834367,1.7751882387028073,44.007882536024717,87.729481637349267,82.125603864734288,98.080586639683204,41.628119892592522,75.431977974505088,8.4517966625111054,62.543833566319208,45.592964521197338,38.595951470791746,59.069061681232384,96.864718194862135,29.864632139059623,73.142354515865591,3.3284827972993627,11.517612678107815,58.474706970221824,null,null,null,null,null,null,null,null,null,null,null,null,null,null,null,"No","N/A","N/A","N/A","N/A","N/A","N/A","N/A","N/A","N/A","N/A","N/A","N/A","N/A","N/A","N/A","N/A","N/A","N/A","N/A","N/A","N/A","N/A","N/A","N/A","N/A","N/A","N/A","N/A","N/A","N/A","N/A","N/A","N/A","N/A","N/A","N/A"]
["Improved Water source on premises","Yes",33.097264740127201,52.257984799894999,73.12663317534286,88.695446380405812,88.637290713081612,92.008628069324701,90.194362357359154,93.565412939410038,94.181069007955841,97.25770598640932,24.013050758366045,45.55378096484889,53.524758504793347,69.956454147092842,78.162421028891856,92.009621187375558,100,83.543652044860579,100,71.451480698498543,19.801347191544881,17.874396135265698,4.5390151397568621,70.55608955882046,57.32341087325571,95.929790822676992,74.439271451644601,82.973946027489745,66.549718534165009,58.712166870990387,3.9553238358304452,77.973704832780172,44.137610814662175,96.67151720270067,88.482387321892176,58.910787635203121,null,null,null,null,null,null,null,null,null,null,null,null,null,null,"Improved water source on premises","Yes","N/A","N/A","N/A","N/A","N/A","N/A","N/A","N/A","N/A","N/A","N/A","N/A","N/A","N/A","N/A","N/A","N/A","N/A","N/A","N/A","N/A","N/A","N/A","N/A","N/A","N/A","N/A","N/A","N/A","N/A","N/A","N/A","N/A","N/A","N/A","N/A"]
[null,"No",66.902735259872827,47.742015200105058,26.87336682465719,11.304553619594152,11.362709286918465,7.9913719306753128,9.8056376426408374,6.4345870605899584,5.8189309920441517,2.7422940135907048,75.98694924163388,54.446219035151103,46.475241495206767,30.043545852907211,21.837578971108073,7.9903788126244519,0,16.456347955139421,0,28.548519301501372,80.198652808455151,82.125603864734288,95.46098486024313,29.443910441179543,42.676589126744325,4.0702091773229956,25.560728548355417,17.026053972510187,33.450281465835033,41.287833129009641,96.044676164169545,22.026295167219793,55.862389185337861,3.3284827972993627,11.517612678107815,41.089212364796943,null,null,null,null,null,null,null,null,null,null,null,null,null,null,null,"No","N/A","N/A","N/A","N/A","N/A","N/A","N/A","N/A","N/A","N/A","N/A","N/A","N/A","N/A","N/A","N/A","N/A","N/A","N/A","N/A","N/A","N/A","N/A","N/A","N/A","N/A","N/A","N/A","N/A","N/A","N/A","N/A","N/A","N/A","N/A","N/A"]
["Piped water on premises available when needed","Yes","N/A","N/A","N/A","N/A","N/A","N/A","N/A","N/A","N/A","N/A","N/A","N/A","N/A","N/A","N/A","N/A","N/A","N/A","N/A","N/A","N/A","N/A","N/A","N/A","N/A","N/A","N/A","N/A","N/A","N/A","N/A","N/A","N/A","N/A","N/A","N/A",null,null,null,null,null,null,null,null,null,null,null,null,null,null,"Piped water on premises available when needed","Yes","N/A","N/A","N/A","N/A","N/A","N/A","N/A","N/A","N/A","N/A","N/A","N/A","N/A","N/A","N/A","N/A","N/A","N/A","N/A","N/A","N/A","N/A","N/A","N/A","N/A","N/A","N/A","N/A","N/A","N/A","N/A","N/A","N/A","N/A","N/A","N/A"]
[null,"No","N/A","N/A","N/A","N/A","N/A","N/A","N/A","N/A","N/A","N/A","N/A","N/A","N/A","N/A","N/A","N/A","N/A","N/A","N/A","N/A","N/A","N/A","N/A","N/A","N/A","N/A","N/A","N/A","N/A","N/A","N/A","N/A","N/A","N/A","N/A","N/A",null,null,null,null,null,null,null,null,null,null,null,null,null,null,null,"No","N/A","N/A","N/A","N/A","N/A","N/A","N/A","N/A","N/A","N/A","N/A","N/A","N/A","N/A","N/A","N/A","N/A","N/A","N/A","N/A","N/A","N/A","N/A","N/A","N/A","N/A","N/A","N/A","N/A","N/A","N/A","N/A","N/A","N/A","N/A","N/A"]
["Water point at more than 30 minutes","Yes",59.568074513322522,37.0752146720817,20.562309791678416,4.8360118729526409,3.6976402227468048,4.1283744543092711,2.0349617727877773,3.8739845809461833,2.6297241514421565,1.3691059322717052,62.090753124113661,52.868522011235186,28.469350899402418,24.148092905263514,7.8224347013100379,17.818877657412397,0,24.221346264061655,1.7751882387028073,24.193021836169461,58.548166857497776,0,52.839867470422227,19.66446981854984,55.6826163573675,3.4768723277283184,40.568871272781159,26.853120005311759,11.234371776336408,37.850659493380689,46.340491826463968,5.942333668203716,35.77666621794986,0.80502093682240838,7.573224774646234,24.606165936207702,null,null,null,null,null,null,null,null,null,null,null,null,null,null,"Water point at more than 30 minutes","Yes","N/A","N/A","N/A","N/A","N/A","N/A","N/A","N/A","N/A","N/A","N/A","N/A","N/A","N/A","N/A","N/A","N/A","N/A","N/A","N/A","N/A","N/A","N/A","N/A","N/A","N/A","N/A","N/A","N/A","N/A","N/A","N/A","N/A","N/A","N/A","N/A"]
[null,"No",40.431925486677258,62.924785327918286,79.437690208321484,95.163988127047475,96.302359777253216,95.871625545690748,97.965038227212219,96.1260154190538,97.370275848557839,98.630894067728306,37.909246875886367,47.131477988764964,71.530649100597614,75.851907094736518,92.177565298689956,82.181122342587614,100,75.778653735938434,98.224811761297175,75.806978163830635,41.451833142502274,100,47.160132529577801,80.33553018145011,44.3173836426325,96.523127672271642,59.43112872721872,73.146879994688149,88.765628223663612,62.149340506619311,53.659508173535983,94.057666331796284,64.223333782050076,99.194979063177612,92.426775225353751,75.393834063792369,null,null,null,null,null,null,null,null,null,null,null,null,null,null,null,"No","N/A","N/A","N/A","N/A","N/A","N/A","N/A","N/A","N/A","N/A","N/A","N/A","N/A","N/A","N/A","N/A","N/A","N/A","N/A","N/A","N/A","N/A","N/A","N/A","N/A","N/A","N/A","N/A","N/A","N/A","N/A","N/A","N/A","N/A","N/A","N/A"]
["Water source available when needed","Yes","N/A","N/A","N/A","N/A","N/A","N/A","N/A","N/A","N/A","N/A","N/A","N/A","N/A","N/A","N/A","N/A","N/A","N/A","N/A","N/A","N/A","N/A","N/A","N/A","N/A","N/A","N/A","N/A","N/A","N/A","N/A","N/A","N/A","N/A","N/A","N/A",null,null,null,null,null,null,null,null,null,null,null,null,null,null,"Water source available when needed","Yes","N/A","N/A","N/A","N/A","N/A","N/A","N/A","N/A","N/A","N/A","N/A","N/A","N/A","N/A","N/A","N/A","N/A","N/A","N/A","N/A","N/A","N/A","N/A","N/A","N/A","N/A","N/A","N/A","N/A","N/A","N/A","N/A","N/A","N/A","N/A","N/A"]
[null,"No","N/A","N/A","N/A","N/A","N/A","N/A","N/A","N/A","N/A","N/A","N/A","N/A","N/A","N/A","N/A","N/A","N/A","N/A","N/A","N/A","N/A","N/A","N/A","N/A","N/A","N/A","N/A","N/A","N/A","N/A","N/A","N/A","N/A","N/A","N/A","N/A",null,null,null,null,null,null,null,null,null,null,null,null,null,null,null,"No","N/A","N/A","N/A","N/A","N/A","N/A","N/A","N/A","N/A","N/A","N/A","N/A","N/A","N/A","N/A","N/A","N/A","N/A","N/A","N/A","N/A","N/A","N/A","N/A","N/A","N/A","N/A","N/A","N/A","N/A","N/A","N/A","N/A","N/A","N/A","N/A"]
["Improved water source available when needed","Yes","N/A","N/A","N/A","N/A","N/A","N/A","N/A","N/A","N/A","N/A","N/A","N/A","N/A","N/A","N/A","N/A","N/A","N/A","N/A","N/A","N/A","N/A","N/A","N/A","N/A","N/A","N/A","N/A","N/A","N/A","N/A","N/A","N/A","N/A","N/A","N/A",null,null,null,null,null,null,null,null,null,null,null,null,null,null,"Improved water source available when needed","Yes","N/A","N/A","N/A","N/A","N/A","N/A","N/A","N/A","N/A","N/A","N/A","N/A","N/A","N/A","N/A","N/A","N/A","N/A","N/A","N/A","N/A","N/A","N/A","N/A","N/A","N/A","N/A","N/A","N/A","N/A","N/A","N/A","N/A","N/A","N/A","N/A"]
[null,"No","N/A","N/A","N/A","N/A","N/A","N/A","N/A","N/A","N/A","N/A","N/A","N/A","N/A","N/A","N/A","N/A","N/A","N/A","N/A","N/A","N/A","N/A","N/A","N/A","N/A","N/A","N/A","N/A","N/A","N/A","N/A","N/A","N/A","N/A","N/A","N/A",null,null,null,null,null,null,null,null,null,null,null,null,null,null,null,"No","N/A","N/A","N/A","N/A","N/A","N/A","N/A","N/A","N/A","N/A","N/A","N/A","N/A","N/A","N/A","N/A","N/A","N/A","N/A","N/A","N/A","N/A","N/A","N/A","N/A","N/A","N/A","N/A","N/A","N/A","N/A","N/A","N/A","N/A","N/A","N/A"]
["Microbiological quality at point of collection","Not contaminated (No E. coli in 100 mL)","N/A","N/A","N/A","N/A","N/A","N/A","N/A","N/A","N/A","N/A","N/A","N/A","N/A","N/A","N/A","N/A","N/A","N/A","N/A","N/A","N/A","N/A","N/A","N/A","N/A","N/A","N/A","N/A","N/A","N/A","N/A","N/A","N/A","N/A","N/A","N/A",null,null,null,null,null,null,null,null,null,null,null,null,null,null,"Microbiological quality at point of collection","Not contaminated (No E. coli in 100 mL)","N/A","N/A","N/A","N/A","N/A","N/A","N/A","N/A","N/A","N/A","N/A","N/A","N/A","N/A","N/A","N/A","N/A","N/A","N/A","N/A","N/A","N/A","N/A","N/A","N/A","N/A","N/A","N/A","N/A","N/A","N/A","N/A","N/A","N/A","N/A","N/A"]
[null,"Contaminated (E. coli detected in 100 mL)","N/A","N/A","N/A","N/A","N/A","N/A","N/A","N/A","N/A","N/A","N/A","N/A","N/A","N/A","N/A","N/A","N/A","N/A","N/A","N/A","N/A","N/A","N/A","N/A","N/A","N/A","N/A","N/A","N/A","N/A","N/A","N/A","N/A","N/A","N/A","N/A",null,null,null,null,null,null,null,null,null,null,null,null,null,null,null,"Contaminated (E. coli detected in 100 mL)","N/A","N/A","N/A","N/A","N/A","N/A","N/A","N/A","N/A","N/A","N/A","N/A","N/A","N/A","N/A","N/A","N/A","N/A","N/A","N/A","N/A","N/A","N/A","N/A","N/A","N/A","N/A","N/A","N/A","N/A","N/A","N/A","N/A","N/A","N/A","N/A"]
[null,"Highly contaminated (>100 CFU/100 mL)","N/A","N/A","N/A","N/A","N/A","N/A","N/A","N/A","N/A","N/A","N/A","N/A","N/A","N/A","N/A","N/A","N/A","N/A","N/A","N/A","N/A","N/A","N/A","N/A","N/A","N/A","N/A","N/A","N/A","N/A","N/A","N/A","N/A","N/A","N/A","N/A",null,null,null,null,null,null,null,null,null,null,null,null,null,null,null,"Highly contaminated (>100 CFU/100 mL)","N/A","N/A","N/A","N/A","N/A","N/A","N/A","N/A","N/A","N/A","N/A","N/A","N/A","N/A","N/A","N/A","N/A","N/A","N/A","N/A","N/A","N/A","N/A","N/A","N/A","N/A","N/A","N/A","N/A","N/A","N/A","N/A","N/A","N/A","N/A","N/A"]
["Microbiological quality of improved water sources at point of collection","Not contaminated (No E. coli in 100 mL)","N/A","N/A","N/A","N/A","N/A","N/A","N/A","N/A","N/A","N/A","N/A","N/A","N/A","N/A","N/A","N/A","N/A","N/A","N/A","N/A","N/A","N/A","N/A","N/A","N/A","N/A","N/A","N/A","N/A","N/A","N/A","N/A","N/A","N/A","N/A","N/A",null,null,null,null,null,null,null,null,null,null,null,null,null,null,"Microbiological quality of improved water sources at point of collection","Not contaminated (No E. coli in 100 mL)","N/A","N/A","N/A","N/A","N/A","N/A","N/A","N/A","N/A","N/A","N/A","N/A","N/A","N/A","N/A","N/A","N/A","N/A","N/A","N/A","N/A","N/A","N/A","N/A","N/A","N/A","N/A","N/A","N/A","N/A","N/A","N/A","N/A","N/A","N/A","N/A"]
[null,"Contaminated (E. coli detected in 100 mL)","N/A","N/A","N/A","N/A","N/A","N/A","N/A","N/A","N/A","N/A","N/A","N/A","N/A","N/A","N/A","N/A","N/A","N/A","N/A","N/A","N/A","N/A","N/A","N/A","N/A","N/A","N/A","N/A","N/A","N/A","N/A","N/A","N/A","N/A","N/A","N/A",null,null,null,null,null,null,null,null,null,null,null,null,null,null,null,"Contaminated (E. coli detected in 100 mL)","N/A","N/A","N/A","N/A","N/A","N/A","N/A","N/A","N/A","N/A","N/A","N/A","N/A","N/A","N/A","N/A","N/A","N/A","N/A","N/A","N/A","N/A","N/A","N/A","N/A","N/A","N/A","N/A","N/A","N/A","N/A","N/A","N/A","N/A","N/A","N/A"]
[null,"Highly contaminated (>100 CFU/100 mL)","N/A","N/A","N/A","N/A","N/A","N/A","N/A","N/A","N/A","N/A","N/A","N/A","N/A","N/A","N/A","N/A","N/A","N/A","N/A","N/A","N/A","N/A","N/A","N/A","N/A","N/A","N/A","N/A","N/A","N/A","N/A","N/A","N/A","N/A","N/A","N/A",null,null,null,null,null,null,null,null,null,null,null,null,null,null,null,"Highly contaminated (>100 CFU/100 mL)","N/A","N/A","N/A","N/A","N/A","N/A","N/A","N/A","N/A","N/A","N/A","N/A","N/A","N/A","N/A","N/A","N/A","N/A","N/A","N/A","N/A","N/A","N/A","N/A","N/A","N/A","N/A","N/A","N/A","N/A","N/A","N/A","N/A","N/A","N/A","N/A"]
["Microbiological quality of piped on premises at point of collection","Not contaminated (No E. coli in 100 mL)","N/A","N/A","N/A","N/A","N/A","N/A","N/A","N/A","N/A","N/A","N/A","N/A","N/A","N/A","N/A","N/A","N/A","N/A","N/A","N/A","N/A","N/A","N/A","N/A","N/A","N/A","N/A","N/A","N/A","N/A","N/A","N/A","N/A","N/A","N/A","N/A",null,null,null,null,null,null,null,null,null,null,null,null,null,null,"Microbiological quality of piped on premises at point of collection","Not contaminated (No E. coli in 100 mL)","N/A","N/A","N/A","N/A","N/A","N/A","N/A","N/A","N/A","N/A","N/A","N/A","N/A","N/A","N/A","N/A","N/A","N/A","N/A","N/A","N/A","N/A","N/A","N/A","N/A","N/A","N/A","N/A","N/A","N/A","N/A","N/A","N/A","N/A","N/A","N/A"]
[null,"Contaminated (E. coli detected in 100 mL)","N/A","N/A","N/A","N/A","N/A","N/A","N/A","N/A","N/A","N/A","N/A","N/A","N/A","N/A","N/A","N/A","N/A","N/A","N/A","N/A","N/A","N/A","N/A","N/A","N/A","N/A","N/A","N/A","N/A","N/A","N/A","N/A","N/A","N/A","N/A","N/A",null,null,null,null,null,null,null,null,null,null,null,null,null,null,null,"Contaminated (E. coli detected in 100 mL)","N/A","N/A","N/A","N/A","N/A","N/A","N/A","N/A","N/A","N/A","N/A","N/A","N/A","N/A","N/A","N/A","N/A","N/A","N/A","N/A","N/A","N/A","N/A","N/A","N/A","N/A","N/A","N/A","N/A","N/A","N/A","N/A","N/A","N/A","N/A","N/A"]
[null,"Highly contaminated (>100 CFU/100 mL)","N/A","N/A","N/A","N/A","N/A","N/A","N/A","N/A","N/A","N/A","N/A","N/A","N/A","N/A","N/A","N/A","N/A","N/A","N/A","N/A","N/A","N/A","N/A","N/A","N/A","N/A","N/A","N/A","N/A","N/A","N/A","N/A","N/A","N/A","N/A","N/A",null,null,null,null,null,null,null,null,null,null,null,null,null,null,null,"Highly contaminated (>100 CFU/100 mL)","N/A","N/A","N/A","N/A","N/A","N/A","N/A","N/A","N/A","N/A","N/A","N/A","N/A","N/A","N/A","N/A","N/A","N/A","N/A","N/A","N/A","N/A","N/A","N/A","N/A","N/A","N/A","N/A","N/A","N/A","N/A","N/A","N/A","N/A","N/A","N/A"]
[null,null,"NATIONAL wealth index quintile",null,null,null,null,"URBAN wealth index quintile",null,null,null,null,"RURAL wealth index quintile",null,null,null,null,"SUB-REGIONS:",null,null,null,null,null,null,null,null,null,null,null,null,null,null,null,null,null,null,null,null,null,null,null,null,null,null,null,null,null,null,null,null,null,null,"Raw numbers of respondents:","Use of drinking water sources","NATIONAL wealth index quintile",null,null,null,null,"URBAN wealth index quintile",null,null,null,null,"RURAL wealth index quintile",null,null,null,null,"SUB-REGIONS:"]
["Percentage based on weighted population",null,"Poorest","Poor","Middle","Rich","Richest","Poorest","Poor","Middle","Rich","Richest","Poorest","Poor","Middle","Rich","Richest","Abyan","Aden","Al Baidhah","Al Dala'a","Al Hodeidah","Al Jawf","Al Maharah","Al Mahweet","Amran","Dhamar","Hadramout","Hajjah","Ibb","Lahej","Mareb","Raimah","Sa'adah","Sana'a","Sana'a City","Shabwah","Taiz",null,null,null,null,null,null,null,null,null,null,null,null,null,null,"Water data, raw numbers (weighted)",null,"Poorest","Poor","Middle","Rich","Richest","Poorest","Poor","Middle","Rich","Richest","Poorest","Poor","Middle","Rich","Richest","Abyan","Aden","Al Baidhah","Al Dala'a","Al Hodeidah","Al Jawf","Al Maharah","Al Mahweet","Amran","Dhamar","Hadramout","Hajjah","Ibb","Lahej","Mareb","Raimah","Sa'adah","Sana'a","Sana'a City","Shabwah","Taiz"]
["Main source of drinking water","Piped into dwelling",2.5343515285069671,14.869269449349979,28.617103308353521,47.524305575165222,47.930427808416724,45.622310769159796,54.910802825283966,52.053388024453085,46.020472003856533,46.601514837206267,0.44927509352245326,7.9735891965033456,16.06075893109314,26.597601868237824,44.325446934044443,26.747211753312111,96.192032723216073,55.102371198969536,42.855665888882328,27.231186915219691,0,0,0,11.199210098579893,20.03571719500572,68.510651470680472,13.159104593298441,34.693039663001016,40.275751102577459,17.678329677949996,0,0,9.0963727012547491,27.062045018115278,16.269421398675977,27.077821222297743]
[null,"Piped into yard or plot",4.7623059073173337,6.5218699353862197,9.7305159039320639,5.20305389562236,2.3188374690240914,18.597110864650602,3.4761694247762662,1.1128817564895677,2.4769737845277096,0,3.5231132438676189,4.5482228874474329,7.6974602090111848,8.0349193765941838,6.0162515745381233,3.1191866609448047,0,4.2010887566688808,37.702138818059915,21.614539079190582,0,0,1.9194133603167991,2.3178018271392267,3.7285471727760813,0.82771342458652764,2.7945312359860099,6.3331416482972598,4.5320792639104841,23.25260864081762,0,0,0,3.2193946892216641,2.5962736944928659,2.5568066570819568]
[null,"Public tap/standpipe",1.3646399745644233,3.7247622857790277,2.982942245444002,0.94939494048703488,1.823515046823132,3.7817059402427464,0.70171077361333989,0,0.34465003004820244,0,0.50627036551939264,2.5350215155355382,4.1238715425810053,2.815533407531511,3.5390925762573548,0,0,0,0,2.1353025050265155,0,0,0.80817404644917845,0,0.24606004098014647,0,0,5.6756039149685522,3.565724544827134,3.5384404453418119,17.07767163423506,0,2.872688834486905,0.67149647644794375,5.3922607501005677,3.3574716066268606]
[null,"Tubewell/borehole",1.3696688223455555,5.697811909597748,9.3064960297911767,4.0700498764686346,4.1827614878213861,0.54798929846438771,0.26090024722663818,0.26122164377013357,0.87838703944588625,0,1.5109359504828552,3.4494182997769651,7.2791241996173097,11.153797000095404,11.297183232387169,0,0,5.9212496207130263,0,4.9953172020534193,1.8120123767103309,0,0,22.717967125559941,2.7873893936155016,1.5263103955443722,0,0.24942235597387066,0.63001929626419617,0,0,59.676232935073713,11.627582662925766,0.60229958918913162,42.293634735376386,0.23686813251131683]
[null,"Protected well",14.285022207529336,11.733789823235833,4.9365106742117071,1.4534761106455896,1.9941685338047881,0,1.1933242833408686,0,0.72531769389861156,2.1756574914708899,17.890333069229364,9.0927262426479452,13.065052827404763,4.650279616063373,3.1610209697963407,0.77591064754560457,0,2.7402877291670005,0,8.5532199400801581,45.710955897288905,0,11.434402280922166,4.5188953241168726,11.403451059366008,0.58145157925499891,7.5176006314080555,2.7200019685528485,4.9145905163228161,23.223231478739606,23.523227112141928,5.2919294192129946,4.8533247282400103,2.5753140239226164,0,9.5132320605663416]
[null,"Unprotected well",33.167920457948682,23.063019190772689,10.399599669915661,2.4170674341854284,0.40391064005853244,0,0,0,0,0,31.844809427037536,31.620014194641303,19.999525492302521,12.755086907297954,4.0753820763451802,23.977713510852602,0,17.705792679226334,1.7751882387028073,12.548098754407642,36.289279141738241,0,13.626271763036124,24.217068064934644,12.940983011780153,0,34.972095277596182,15.71478270037553,5.3967541520183842,30.285423788384218,1.1168007529787649,17.417649443076876,12.608948858632345,0,0,21.53137001925635]
[null,"Protected spring",4.6842001088304173,3.7770680959941281,2.6683548068507137,0.55410596713202198,0,0,0,0,0,0,4.84323224137946,4.9732326472523631,3.6111856198186647,2.6443064311509459,0.80059514753396022,0,0,0,0,1.1684612967436714,0,0,22.100027549568928,5.0954360150769977,1.4983709847219278,0,0,2.1154340018147799,0,0,37.053330424356524,0,0.92248809030165746,0,0,2.4751592831943925]
[null,"Unprotected spring",18.61412216472587,11.764301334942234,7.6878834958760631,1.181802863511662,0.18056530496488915,0,0,0,0,0,22.254747500559503,14.456756496825879,7.8900458745806619,10.352966316732285,1.9681896203430229,0.82083859498547507,0,0.54811664196730481,0,5.5902731091480344,1.312146893479895,0,40.85403143059613,5.2587159517445938,32.308418275300582,0,1.5731401924903627,14.345454022856426,0.49816192172477386,0,5.2214926169253735,0,3.9796069475943789,0,0,3.7634431188431487]
[null,"Rainwater collection",2.4276288061118669,4.0887398594437458,3.3111530324703145,1.7715612637393903,2.8545021887241226,0,0,0,0,1.3511811012536821,2.1396826072077779,3.111643358914765,5.5358263065694846,3.4053783554550443,6.0811202700145115,0,0,2.41584995402948,0,0,0,0,6.0249833833139892,9.7247051755194427,1.5765091012377193,9.8408542099278939,2.6962588544055386,7.407839754220745E-2,18.238359688486732,0,1.6131566431915496,0,2.8721739043252703,0.92661475259866399,5.36436754870775,4.0492980818979332]
[null,"Tanker-truck",2.5459340895607472,3.1977242092794698,8.1185611049282738,14.599159778437476,10.82033649527739,14.409047535683886,15.791421996056531,16.525533250832659,15.545538652852567,11.224632593136437,2.6144641148425403,2.5202884420049316,3.9212850714921781,6.7521789347584011,8.2809519255401991,8.9549975458352389,0,1.487745171054113,15.151784647600772,1.9796629891045834,14.109197116203887,0,0,5.7885478646250714,0.8585539343010693,3.8175933761558554,10.056698676659817,9.9529870764746047,11.94407225189282,0,0,16.306470509246235,20.981133464977567,15.028488216370986,19.248612968892512,7.405686110966661]
[null,"Cart with small tank/drum",3.2357963582444103,3.7525143402712553,3.3881956282276611,4.5061748064198897,2.8630785388969437,4.8896646766240597,5.1790400887431352,4.0056597329747028,1.6313061317278124,1.2730537396795574,2.5121830967010093,4.7330730355797472,3.7715184413557208,2.1646495225970468,4.9079516088622146,35.604141286524182,0,2.8688218204100076,0,4.2698594911711627,0,0,0,4.4365544900050615,0.3290734346158089,1.2174482027918412,13.890555731600337,2.9820337092571902,1.888791246582245,2.0219659687667497,0,1.1805607948407921,6.4466903756026097,2.9085831695932445,8.8354289037539413,0.40420473838121573]
[null,"Surface water",8.83317384330085,6.5083249883623333,5.236399588542624,1.0194687515075649,0.35014084456225103,0,0,0,0,0,9.6233251494001486,7.573547436403774,6.6646547494885482,5.850466376610906,1.978449403883777,0,0,0,0,1.6044453145473963,0,0,3.2326961857967138,0,8.5379388761008528,0.79602382490235779,13.340014806555125,4.0196424065231007,5.7718570723907359,0,14.394320816170749,0,22.561649679720226,0,0,3.0624038605337742]
[null,"Bottled water",0.26140522306562708,0.31849513764254128,1.6722990681071728,12.788485630270324,23.71633423731592,7.2468363270961085,15.377085631866736,23.655453580374783,30.685276928256833,37.3739602372532,0.28762814025046363,0.20937312058763283,2.7517713037749525E-2,1.2379853472140843,3.442626620136191,0,1.2733199443842582,5.7542686479551373,2.5152224067541864,3.7416260384174711,0.33593326467152107,100,0,0,0.39494626735748695,9.1104832939925391,0,0.7754854431139161,2.3438389430023014,0,0,0.12715689854942872,1.177339751938463,47.005764064540422,0,13.411888429747806]
[null,"Other",1.9138305079477842,0.9630426566736483,1.9439854433489754,1.9618931064075498,0.56142140430986298,4.9053345880784249,3.1095447290924585,2.3858620111050031,1.6920777353858039,0,0,3.2030931258784867,0.32433226552529276,1.584850539661067,0.12573804031740862,0,2.5346473323996741,1.2544077798392586,0,4.5303775508141273,0.43047530990725275,0,0,4.7250980626982129,3.3540412528409518,3.7714702221630931,0,0.34889269124856187,0,0,0,0,0,0,0,1.1543466780946083]
[null,"Missing",0,1.9266783269178762E-2,0,0,0,0,0,0,0,0,0,0,2.7840756121883671E-2,0,0,0,0,0,0,3.7629814075597595E-2,0,0,0,0,0,0,0,0,0,0,0,0,0,0,0,0]
[]
[]
[]
[]
[]
[]
[]
[]
[]
[]
[]
[]
[]
[]
[]
[]
[]
[]
[]
[]
[]
[]
[]
[]
[]
[]
[]
[]
[]
[]
[]
[]
[]
[]
[]
[{"$f":"A1026","v":"Yemen"}]
[{"$f":"A1034","v":"2006"}]
["Use of sanitation facilities"]
[" by wealth quintile and sub-national region"]
["Notes:"]
["WHO/UNICEF JMP customised wealth index excludes water,"]
[" sanitation and hygiene assets."]
["Survey used for analysis:",{"$f":"A1025","v":"MICS06"}]
[{"$f":"B1030","v":""}]
[{"$f":"B1029","v":""}]
[]
[]
["Use of sanitation facilities",null,"NATIONAL wealth index quintile",null,null,null,null,"URBAN wealth index quintile",null,null,null,null,"RURAL wealth index quintile",null,null,null,null,"SUB-REGIONS:",null,null,null,null,null,null,null,null,null,null,null,null,null,null,null,null,null,null,null,null,null,null,null,null,null,null,null,null,null,null,null,null,null,null,"Raw numbers of respondents:","Use of sanitation facilities","NATIONAL wealth index quintile",null,null,null,null,"URBAN wealth index quintile",null,null,null,null,"RURAL wealth index quintile",null,null,null,null,"SUB-REGIONS:"]
["Weighted percentage (used in graphs)",null,"Poorest","Poor","Middle","Rich","Richest","Poorest","Poor","Middle","Rich","Richest","Poorest","Poor","Middle","Rich","Richest","Abyan","Aden","Al Baidhah","Al Dala'a","Al Hodeidah","Al Jawf","Al Maharah","Al Mahweet","Amran","Dhamar","Hadramout","Hajjah","Ibb","Lahej","Mareb","Raimah","Sa'adah","Sana'a","Sana'a City","Shabwah","Taiz",null,null,null,null,null,null,null,null,null,null,null,null,null,null,"Sanitation data, raw numbers (weighted)",null,"Poorest","Poor","Middle","Rich","Richest","Poorest","Poor","Middle","Rich","Richest","Poorest","Poor","Middle","Rich","Richest","Abyan","Aden","Al Baidhah","Al Dala'a","Al Hodeidah","Al Jawf","Al Maharah","Al Mahweet","Amran","Dhamar","Hadramout","Hajjah","Ibb","Lahej","Mareb","Raimah","Sa'adah","Sana'a","Sana'a City","Shabwah","Taiz"]
["Sanitation","Improved",9.0343888725650494,28.891743246967984,49.692229489861475,82.622587759865098,90.596425003257337,79.504882634450297,93.772105591445907,92.738798234473308,96.945136108031164,100,6.0785042741396209,18.821465166808832,33.264461631247769,42.373228450318088,70.564540513171963,75.093138924728748,85.89251695118304,37.239951838536442,72.956587231233001,55.847721410572746,14.098227562848592,97.584541062801947,14.851947209473874,39.94528161935208,26.732848530963789,67.125438098670557,21.552225579309621,46.490592539182657,45.846604516434041,45.999725789443552,9.0037837545801036,43.401637259560118,52.071539735394559,98.835124954659065,65.980339319779475,60.800527859154464,null,null,null,null,null,null,null,null,null,null,null,null,null,null,"Sanitation","Improved",471.34238064945237,1506.495375259085,2593.6222609007805,4313.4756294732042,4725.8481415458073,1274.0748096808463,1507.8466873361258,1489.3964511350928,1553.7176424689571,1602.8949948259997,219.79147020711102,679.12942470539338,1200.3357501181226,1533.8621349841733,2549.7344223665077,387.54386348925874,733.52566558647106,253.33060878428037,399.2962905008435,1490.9966035573229,64.544314591555889,81.962576707595815,108.56878755822299,310.64345266899772,703.96765449772067,939.48208564409833,342.76546072192332,1518.2511306519223,407.77857356891582,99.163957964149418,41.251239865683814,338.92278447889407,630.92539587717579,2310.0997884789676,294.0461449875495,2153.7174076467804]
[null,"Not Improved",90.965611127434983,71.108256753031924,50.307770510138447,17.377412240134895,9.4035749967427282,20.495117365549699,6.2278944085540768,7.2612017655266579,3.0548638919688371,0,93.921495725860368,81.178534833191122,66.735538368752316,57.626771549681962,29.435459486827909,24.906861075271284,14.107483048816974,62.760048161463644,27.043412768766984,44.152278589427297,85.901772437151408,2.4154589371980673,85.148052790526137,60.054718380647913,73.267151469036236,32.874561901329422,78.447774420690322,53.509407460817251,54.153395483566037,54.000274210556434,90.996216245419888,56.598362740439903,47.928460264605377,1.1648750453409309,34.01966068022049,39.199472140845607,null,null,null,null,null,null,null,null,null,null,null,null,null,null,null,"Not Improved",4745.8603244586866,3707.7811132916063,2625.7496359265615,907.22218019831269,490.52561865046488,328.43659271794968,100.14395958998372,116.61578914585441,48.959608649207539,0,3396.0893500497982,2929.1413378865664,2408.1271296495133,2086.0228515530275,1063.6022532837178,128.54038740045561,120.47849172954989,426.93506363834183,148.01041017484698,1178.757087190492,393.27433178667371,2.0287766511781138,622.43830549802169,467.02900344031633,1929.3755662306578,460.10965223493525,1247.6292735044196,1747.4657546992939,481.66259196548049,116.41114876160954,416.90325373485234,441.97583105487666,580.7257269497469,27.22693573849385,151.61107353997139,1388.550206601418]
["Sanitation ladder","Basic",7.884066995293491,26.040803400279273,47.520540464470749,79.625054880474494,89.255065267043392,77.322047859473074,89.81918369853328,89.919947306482044,96.945136108031164,99.728042813566148,5.3908871239152054,16.687585663561119,30.787658577072929,39.71245362681077,67.429776513321499,69.606412648595779,85.094123641736871,37.239951838536442,68.283680785119799,52.076000121930143,13.036013410983916,95.652173913043484,13.943879441712658,33.232618481182676,26.437576481787605,63.828693545710848,18.644714486935861,44.906572918518265,41.858127389059533,41.955793851910059,9.0037837545801036,41.054911601705214,50.515940156148318,98.041028843256413,64.875910706810231,58.960330828944542,null,null,null,null,null,null,null,null,null,null,null,null,null,null,"Sanitation ladder","Basic",411.32775655098987,1357.8394891304722,2477.1563696294525,4156.9834960946755,4655.8778042361064,1239.0946335163103,1444.2840730177961,1444.1253601962799,1553.7176424689571,1598.5358066965819,194.92805355534924,602.13327448076359,1110.9612313032726,1434.9399953415457,2436.464845064831,359.22773328870881,726.70735353206783,253.33060878428037,373.72116040495962,1390.300935249066,59.681300139851032,80.339555386653316,101.93074776613102,258.44092037205115,696.19212800803405,893.34112126189711,296.52455741176419,1463.5756470527963,372.30341612012319,90.446247373894536,41.251239865683814,320.59723630632936,612.07695610854785,2291.5391678511819,289.12417915036872,2088.5327042072972]
[null,"Limited",1.1503218772715609,2.8509398466886999,2.1083794723508036,2.9975328793907057,1.3413597362139646,2.1828347749772039,3.9529218929126335,2.8188509279912393,0,0.27195718643386124,0.68761715022441428,2.133879503247714,2.4768030541748307,2.5561527081536548,3.1347639998504713,5.4867262761329538,0.79839330944616349,0,4.6729064461132115,3.7717212886425906,1.0622141518646766,1.932367149758454,0.90806776776121212,6.7126631381693835,0.29527204917617578,3.2967445529597161,2.9075110923737544,1.4763158006004942,3.9884771273745172,4.0439319375334994,0,2.346725657854897,1.5555995792462509,0.79409611140265446,1.1044286129692427,1.8401970302099189,null,null,null,null,null,null,null,null,null,null,null,null,null,null,null,"Limited",60.01462409846259,148.65588612861214,109.9058552045436,156.49213337853413,69.97033730970314,34.980176164535798,63.562614318329686,45.271090938812385,0,4.3591881294179746,24.863416651761735,76.996150224629844,89.374518814849779,92.362103575841161,113.2695773016772,28.316130200549868,6.818312054403199,0,25.575130095883885,100.69566830825657,4.8630144517048546,1.6230213209424911,6.6380397920919672,52.202532296946401,7.7755264896865874,46.140964382201282,46.240903310159041,48.115447532339317,35.475157448792686,8.7177105902548941,0,18.325548172564663,18.848439768628097,18.560620627785909,4.9219658371808066,65.184703439483044]
[null,"Unimproved",26.162454353356342,39.927578146096749,40.682741488663019,16.893865026955886,8.4020011356256195,17.219682040000773,6.1834877300701621,7.2612017655266579,3.0548638919688371,0,20.821814051648918,35.542531617205654,44.501973596486529,47.570485849401088,27.310655558973224,24.777542634013681,14.107483048816974,33.953903666655201,25.761737133149225,17.88145644661299,24.834591263479492,2.4154589371980673,22.174431601661734,60.054718380647913,26.787504754471435,29.830641544194279,13.097686268550335,34.176050654010083,41.639920590195281,19.177667476646214,57.392460553923485,56.598362740439903,15.864635834190368,1.117610556638319,33.388558615666639,31.517844753043068,null,null,null,null,null,null,null,null,null,null,null,null,null,null,null,"Unimproved",1364.9482762459886,2081.9343197196285,2120.7147736035831,881.97764143114853,438.27978257016736,275.94736814782999,99.429904353351816,116.61578914585441,48.959608649207539,0,752.89198072313127,1282.4707766286353,1605.8371979932094,1718.8762342564066,986.8259336728878,127.87299529162907,120.47849172954989,230.97675109170117,140.99571354018326,477.39084344291314,113.69738955602787,2.0287766511781138,162.09666785305271,467.02900344031633,705.40694045416558,417.50719440885382,208.30491272051145,1113.8510957050869,370.36259502502969,41.342277130291244,262.94613701571564,441.97583105487666,192.22403821737007,26.12221021298296,148.79852163301092,1116.4464073960689]
[null,"Open defecation",64.803156774078374,31.180678606935292,9.6883385745153934,0.48354721317900967,1.0015738611171108,3.2754353255489268,4.4406678483915725E-2,0,0,0,73.099681674211411,45.636003215985632,22.233564772265822,10.160907815634532,2.1248039278546829,0.12931844125760075,0,28.806144494808432,1.2816756356177597,26.27082214281431,61.067181173671933,0,62.973621188864435,0,46.479646714564772,3.0439203571351396,65.350088152139946,19.441060626871028,12.513474893370761,34.822606733910234,33.603755691496353,0,32.063824430415011,4.7264488702611948E-2,0.63110206455385287,7.6816273878025729,null,null,null,null,null,null,null,null,null,null,null,null,null,null,null,"Open defecation",3380.9120482126846,1625.8467935719837,505.034862322979,25.244538767164222,52.245836080297593,52.489224570119674,0.71405523663191406,0,0,0,2643.1973693266655,1646.6705612579367,802.28993165630527,367.14661729662078,76.776319610829901,0.66739210882654398,0,195.95831254664057,7.0146966346637463,701.36624374757901,279.5769422306459,0,460.34163764496918,0,1223.9686257764918,42.602457826081398,1039.3243607839074,633.61465899420625,111.29999694045087,75.068871631318316,153.95711671913648,0,388.50168873237686,1.1047255255108921,2.812551906960461,272.10379920535019]
["Shared among Improved Sanitation","Yes",12.732702715119688,9.867662959340084,4.2482880446215789,3.6279823237959543,1.4805879328745444,2.7455354975033432,4.2154560441833873,3.0395594741957765,0,0.27195718643386124,11.312275507476594,11.337478163021842,7.4457932962552027,6.0474023862935251,4.4424068761070146,7.3065613645911034,0.92952603764065944,0,6.4050507616298171,6.753581333988949,7.5343808087181481,1.98019801980198,6.1141327460547865,16.804645920727054,1.1045289424887579,4.9113192350621091,13.490537585895529,3.1828888656345486,8.6996129145067194,8.791208791208792,0,5.4069979983024306,2.9874276565493303,0.80345536241993798,1.6738753155186619,3.0266135755807402,null,null,null,null,null,null,null,null,null,null,null,null,null,null,"Shared among improved sanitation facilities","Yes","N/A","N/A","N/A","N/A","N/A","N/A","N/A","N/A","N/A","N/A","N/A","N/A","N/A","N/A","N/A","N/A","N/A","N/A","N/A","N/A","N/A","N/A","N/A","N/A","N/A","N/A","N/A","N/A","N/A","N/A","N/A","N/A","N/A","N/A","N/A","N/A"]
[null,"No",87.267297284880328,90.132337040659877,95.751711955378497,96.372017676204166,98.519412067125501,97.254464502496646,95.784543955816616,96.960440525804188,100,99.728042813566148,88.687724492523387,88.662521836978172,92.554206703744782,93.952597613706473,95.557593123893,92.693438635408882,99.070473962359344,100,93.594949238370191,93.246418666011024,92.465619191281846,98.019801980198011,93.885867253945207,83.195354079272889,98.895471057511244,95.088680764937891,86.509462414104448,96.817111134365447,91.300387085493298,91.208791208791212,100,94.593002001697556,97.012572343450699,99.196544637580061,98.326124684481357,96.973386424419246,null,null,null,null,null,null,null,null,null,null,null,null,null,null,null,"No","N/A","N/A","N/A","N/A","N/A","N/A","N/A","N/A","N/A","N/A","N/A","N/A","N/A","N/A","N/A","N/A","N/A","N/A","N/A","N/A","N/A","N/A","N/A","N/A","N/A","N/A","N/A","N/A","N/A","N/A","N/A","N/A","N/A","N/A","N/A","N/A"]
["Manually calculated ratios","Improved latrines",{"$f":"(C158+C159)/(C158+C159+C160)*100","v":15.753684255514976},{"$f":"(D158+D159)/(D158+D159+D160)*100","v":36.695200307977252},51.14122022365509,60.743174948857984,91.784434300784255,26.120989536329198,67.396309817249829,100,68.589299330128057,100,19.012702265827965,27.296855258288833,42.952846618028723,49.3775276515141,77.615640728376775,12.752971461654115,50,77.064440225175943,100,25.466623529301419,0,0,67.981051610102412,27.258949687800332,70.512056374296122,100,57.245452833316989,21.931129986420505,95.557193941250077,0,70.270270270270274,58.057218479211691,0,16.666666666666664,50,34.883381649572684]
[null,"Other"]
[null,"Other"]
[null,null,"NATIONAL wealth index quintile",null,null,null,null,"URBAN wealth index quintile",null,null,null,null,"RURAL wealth index quintile",null,null,null,null,"SUB-REGIONS:",null,null,null,null,null,null,null,null,null,null,null,null,null,null,null,null,null,null,null,null,null,null,null,null,null,null,null,null,null,null,null,null,null,null,"Raw numbers of respondents:","Use of sanitation facilities","NATIONAL wealth index quintile",null,null,null,null,"URBAN wealth index quintile",null,null,null,null,"RURAL wealth index quintile",null,null,null,null,"SUB-REGIONS:"]
["Percentage based on weighted population",null,"Poorest","Poor","Middle","Rich","Richest","Poorest","Poor","Middle","Rich","Richest","Poorest","Poor","Middle","Rich","Richest","Abyan","Aden","Al Baidhah","Al Dala'a","Al Hodeidah","Al Jawf","Al Maharah","Al Mahweet","Amran","Dhamar","Hadramout","Hajjah","Ibb","Lahej","Mareb","Raimah","Sa'adah","Sana'a","Sana'a City","Shabwah","Taiz",null,null,null,null,null,null,null,null,null,null,null,null,null,null,"Sanitation data, raw numbers (weighted)",null,"Poorest","Poor","Middle","Rich","Richest","Poorest","Poor","Middle","Rich","Richest","Poorest","Poor","Middle","Rich","Richest","Abyan","Aden","Al Baidhah","Al Dala'a","Al Hodeidah","Al Jawf","Al Maharah","Al Mahweet","Amran","Dhamar","Hadramout","Hajjah","Ibb","Lahej","Mareb","Raimah","Sa'adah","Sana'a","Sana'a City","Shabwah","Taiz"]
["Sanitation type","Sewer connection",0,0.33155094627356746,4.1686452947901511,24.177453587535471,36.833379267188974,20.652900237574887,37.809007972728779,41.662442720105439,53.174531418971348,55.815814697721102,0,0,9.0897929192621227E-2,0.27069030930950222,1.3966472616019694,23.347096529463617,80.512388387454862,12.596053552235695,7.1393206456677847,8.971754791496112,0,0,0,0,3.4061379964959273,11.993331950103062,3.8811818257786594,3.0679612315852784,1.1078415978447851,0,0,0,0.48385678981220864,54.378252635108126,0,15.242374527976946,null,null,null,null,null,null,null,null,null,null,null,null,null,null,"Sanitation type","Sewer connection","N/A","N/A","N/A","N/A","N/A","N/A","N/A","N/A","N/A","N/A","N/A","N/A","N/A","N/A","N/A","N/A","N/A","N/A","N/A","N/A","N/A","N/A","N/A","N/A","N/A","N/A","N/A","N/A","N/A","N/A","N/A","N/A","N/A","N/A","N/A","N/A"]
[null,"Septic tank connection",0,0.63361047505812762,0.77525335566119979,3.2186227070772353,2.0170146356837266,1.4174747380528638,3.3167165269042309,2.8140162930268837,2.5937835262188886,1.2605568563692213,0,0.31360951237327228,0.43989932024843559,0.98824219350420117,2.7888881156857299,0,0,1.0496711293529748,4.0031885844686501,0.63592998161490999,1.0622141518646766,94.20289855072464,0,0,0,10.559901967079774,0.66265580244122213,0.89339122164953155,0,0,0,1.2292917557975462,1.1914383055061004,0,0,0.14657901856758565,null,null,null,null,null,null,null,null,null,null,null,null,null,null,null,"Septic tank connection","N/A","N/A","N/A","N/A","N/A","N/A","N/A","N/A","N/A","N/A","N/A","N/A","N/A","N/A","N/A","N/A","N/A","N/A","N/A","N/A","N/A","N/A","N/A","N/A","N/A","N/A","N/A","N/A","N/A","N/A","N/A","N/A","N/A","N/A","N/A","N/A"]
[null,"Improved latrines",9.0343888725650494,27.926581825636287,44.748330839410158,55.226511465252436,51.746031100384627,57.434507658822589,52.646381091812856,48.262339221340952,41.176821162840902,42.923628445909721,6.0785042741396209,18.507855654435559,32.733664381806719,41.114295947504367,66.379005135884213,51.746042395265121,5.3801285637281833,23.594227156947774,61.814078001096597,46.240036637461706,13.036013410983916,3.3816425120772946,14.851947209473874,39.94528161935208,23.32671053446785,44.57220418148772,17.008387951089738,42.529240085947833,44.738762918589259,45.999725789443552,9.0037837545801036,42.172345503762564,50.396244640076262,44.456872319550918,65.980339319779475,45.411574312609915,null,null,null,null,null,null,null,null,null,null,null,null,null,null,null,"Improved latrines","N/A","N/A","N/A","N/A","N/A","N/A","N/A","N/A","N/A","N/A","N/A","N/A","N/A","N/A","N/A","N/A","N/A","N/A","N/A","N/A","N/A","N/A","N/A","N/A","N/A","N/A","N/A","N/A","N/A","N/A","N/A","N/A","N/A","N/A","N/A","N/A"]
[null,"Unimproved facilities",26.162454353356342,39.927578146096749,40.631608851108759,16.893865026955886,8.4020011356256195,17.219682040000773,6.1834877300701621,7.2612017655266579,3.0548638919688371,0,20.821814051648918,35.542531617205654,44.501973596486529,47.48427755713567,27.310655558973224,24.777542634013681,14.107483048816974,33.953903666655201,25.761737133149225,17.88145644661299,24.834591263479492,2.4154589371980673,22.174431601661734,60.054718380647913,26.787504754471435,29.830641544194279,13.097686268550335,34.10739922684067,41.639920590195281,19.177667476646214,57.392460553923485,56.598362740439903,15.864635834190368,1.117610556638319,33.388558615666639,31.517844753043068,null,null,null,null,null,null,null,null,null,null,null,null,null,null,null,"Unimproved facilities","N/A","N/A","N/A","N/A","N/A","N/A","N/A","N/A","N/A","N/A","N/A","N/A","N/A","N/A","N/A","N/A","N/A","N/A","N/A","N/A","N/A","N/A","N/A","N/A","N/A","N/A","N/A","N/A","N/A","N/A","N/A","N/A","N/A","N/A","N/A","N/A"]
[null,"Open defecation",64.803156774078374,31.180678606935292,9.6761616590297024,0.48354721317900967,1.0015738611171108,3.2754353255489268,4.4406678483915725E-2,0,0,0,73.099681674211411,45.636003215985632,22.233564772265822,10.142493992546298,2.1248039278546829,0.12931844125760075,0,28.806144494808432,1.2816756356177597,26.27082214281431,61.067181173671933,0,62.973621188864435,0,46.479646714564772,3.0439203571351396,65.350088152139946,19.402008233976552,12.513474893370761,34.822606733910234,33.603755691496353,0,32.063824430415011,4.7264488702611948E-2,0.63110206455385287,7.6816273878025729,null,null,null,null,null,null,null,null,null,null,null,null,null,null,null,"Open defecation","N/A","N/A","N/A","N/A","N/A","N/A","N/A","N/A","N/A","N/A","N/A","N/A","N/A","N/A","N/A","N/A","N/A","N/A","N/A","N/A","N/A","N/A","N/A","N/A","N/A","N/A","N/A","N/A","N/A","N/A","N/A","N/A","N/A","N/A","N/A","N/A"]
["Septic tank emptying practices","Not emptied/treated and disposed in situ","N/A","N/A","N/A","N/A","N/A","N/A","N/A","N/A","N/A","N/A","N/A","N/A","N/A","N/A","N/A","N/A","N/A","N/A","N/A","N/A","N/A","N/A","N/A","N/A","N/A","N/A","N/A","N/A","N/A","N/A","N/A","N/A","N/A","N/A","N/A","N/A",null,null,null,null,null,null,null,null,null,null,null,null,null,null,"Septic tank emptying practices","Not emptied/treated and disposed in situ","N/A","N/A","N/A","N/A","N/A","N/A","N/A","N/A","N/A","N/A","N/A","N/A","N/A","N/A","N/A","N/A","N/A","N/A","N/A","N/A","N/A","N/A","N/A","N/A","N/A","N/A","N/A","N/A","N/A","N/A","N/A","N/A","N/A","N/A","N/A","N/A"]
[null,"Emptied and buried on site","N/A","N/A","N/A","N/A","N/A","N/A","N/A","N/A","N/A","N/A","N/A","N/A","N/A","N/A","N/A","N/A","N/A","N/A","N/A","N/A","N/A","N/A","N/A","N/A","N/A","N/A","N/A","N/A","N/A","N/A","N/A","N/A","N/A","N/A","N/A","N/A",null,null,null,null,null,null,null,null,null,null,null,null,null,null,null,"Emptied and buried on site","N/A","N/A","N/A","N/A","N/A","N/A","N/A","N/A","N/A","N/A","N/A","N/A","N/A","N/A","N/A","N/A","N/A","N/A","N/A","N/A","N/A","N/A","N/A","N/A","N/A","N/A","N/A","N/A","N/A","N/A","N/A","N/A","N/A","N/A","N/A","N/A"]
[null,"Emptied and discharged locally","N/A","N/A","N/A","N/A","N/A","N/A","N/A","N/A","N/A","N/A","N/A","N/A","N/A","N/A","N/A","N/A","N/A","N/A","N/A","N/A","N/A","N/A","N/A","N/A","N/A","N/A","N/A","N/A","N/A","N/A","N/A","N/A","N/A","N/A","N/A","N/A",null,null,null,null,null,null,null,null,null,null,null,null,null,null,null,"Emptied and discharged locally","N/A","N/A","N/A","N/A","N/A","N/A","N/A","N/A","N/A","N/A","N/A","N/A","N/A","N/A","N/A","N/A","N/A","N/A","N/A","N/A","N/A","N/A","N/A","N/A","N/A","N/A","N/A","N/A","N/A","N/A","N/A","N/A","N/A","N/A","N/A","N/A"]
[null,"Emptied and removed offsite","N/A","N/A","N/A","N/A","N/A","N/A","N/A","N/A","N/A","N/A","N/A","N/A","N/A","N/A","N/A","N/A","N/A","N/A","N/A","N/A","N/A","N/A","N/A","N/A","N/A","N/A","N/A","N/A","N/A","N/A","N/A","N/A","N/A","N/A","N/A","N/A",null,null,null,null,null,null,null,null,null,null,null,null,null,null,null,"Emptied and removed offsite","N/A","N/A","N/A","N/A","N/A","N/A","N/A","N/A","N/A","N/A","N/A","N/A","N/A","N/A","N/A","N/A","N/A","N/A","N/A","N/A","N/A","N/A","N/A","N/A","N/A","N/A","N/A","N/A","N/A","N/A","N/A","N/A","N/A","N/A","N/A","N/A"]
["Latrine emptying practices","Not emptied/treated and disposed in situ","N/A","N/A","N/A","N/A","N/A","N/A","N/A","N/A","N/A","N/A","N/A","N/A","N/A","N/A","N/A","N/A","N/A","N/A","N/A","N/A","N/A","N/A","N/A","N/A","N/A","N/A","N/A","N/A","N/A","N/A","N/A","N/A","N/A","N/A","N/A","N/A",null,null,null,null,null,null,null,null,null,null,null,null,null,null,"Latrine emptying practices","Not emptied/treated and disposed in situ","N/A","N/A","N/A","N/A","N/A","N/A","N/A","N/A","N/A","N/A","N/A","N/A","N/A","N/A","N/A","N/A","N/A","N/A","N/A","N/A","N/A","N/A","N/A","N/A","N/A","N/A","N/A","N/A","N/A","N/A","N/A","N/A","N/A","N/A","N/A","N/A"]
[null,"Emptied and buried on site","N/A","N/A","N/A","N/A","N/A","N/A","N/A","N/A","N/A","N/A","N/A","N/A","N/A","N/A","N/A","N/A","N/A","N/A","N/A","N/A","N/A","N/A","N/A","N/A","N/A","N/A","N/A","N/A","N/A","N/A","N/A","N/A","N/A","N/A","N/A","N/A",null,null,null,null,null,null,null,null,null,null,null,null,null,null,null,"Emptied and buried on site","N/A","N/A","N/A","N/A","N/A","N/A","N/A","N/A","N/A","N/A","N/A","N/A","N/A","N/A","N/A","N/A","N/A","N/A","N/A","N/A","N/A","N/A","N/A","N/A","N/A","N/A","N/A","N/A","N/A","N/A","N/A","N/A","N/A","N/A","N/A","N/A"]
[null,"Emptied and discharged locally","N/A","N/A","N/A","N/A","N/A","N/A","N/A","N/A","N/A","N/A","N/A","N/A","N/A","N/A","N/A","N/A","N/A","N/A","N/A","N/A","N/A","N/A","N/A","N/A","N/A","N/A","N/A","N/A","N/A","N/A","N/A","N/A","N/A","N/A","N/A","N/A",null,null,null,null,null,null,null,null,null,null,null,null,null,null,null,"Emptied and discharged locally","N/A","N/A","N/A","N/A","N/A","N/A","N/A","N/A","N/A","N/A","N/A","N/A","N/A","N/A","N/A","N/A","N/A","N/A","N/A","N/A","N/A","N/A","N/A","N/A","N/A","N/A","N/A","N/A","N/A","N/A","N/A","N/A","N/A","N/A","N/A","N/A"]
[null,"Emptied and removed offsite","N/A","N/A","N/A","N/A","N/A","N/A","N/A","N/A","N/A","N/A","N/A","N/A","N/A","N/A","N/A","N/A","N/A","N/A","N/A","N/A","N/A","N/A","N/A","N/A","N/A","N/A","N/A","N/A","N/A","N/A","N/A","N/A","N/A","N/A","N/A","N/A",null,null,null,null,null,null,null,null,null,null,null,null,null,null,null,"Emptied and removed offsite","N/A","N/A","N/A","N/A","N/A","N/A","N/A","N/A","N/A","N/A","N/A","N/A","N/A","N/A","N/A","N/A","N/A","N/A","N/A","N/A","N/A","N/A","N/A","N/A","N/A","N/A","N/A","N/A","N/A","N/A","N/A","N/A","N/A","N/A","N/A","N/A"]
["Shared among improved sanitation facilities","Yes",1.1503218772715609,2.8509398466886999,2.1057295279409214,2.9975328793907057,1.3413597362139646,2.1828347749772039,3.9529218929126335,2.8188509279912393,0,0.27195718643386124,0.68761715022441428,2.133879503247714,2.4768030541748307,2.5515203913756177,3.1347639998504713,5.4867262761329538,0.79839330944616349,0,4.6729064461132115,3.7717212886425906,1.0622141518646766,1.932367149758454,0.90806776776121212,6.7126631381693835,0.29527204917617578,3.2967445529597161,2.9075110923737544,1.473350238906721,3.9884771273745172,4.0439319375334994,0,2.346725657854897,1.5555995792462509,0.79409611140265446,1.1044286129692427,1.8401970302099189,null,null,null,null,null,null,null,null,null,null,null,null,null,null,"Shared among improved sanitation facilities","Yes","N/A","N/A","N/A","N/A","N/A","N/A","N/A","N/A","N/A","N/A","N/A","N/A","N/A","N/A","N/A","N/A","N/A","N/A","N/A","N/A","N/A","N/A","N/A","N/A","N/A","N/A","N/A","N/A","N/A","N/A","N/A","N/A","N/A","N/A","N/A","N/A"]
[null,"No",7.884066995293491,26.040803400279273,47.460813649535488,79.625054880474494,89.255065267043392,77.322047859473074,89.81918369853328,89.919947306482044,96.945136108031164,99.728042813566148,5.3908871239152054,16.687585663561119,30.787658577072929,39.640485835275577,67.429776513321499,69.606412648595779,85.094123641736871,37.239951838536442,68.283680785119799,52.076000121930143,13.036013410983916,95.652173913043484,13.943879441712658,33.232618481182676,26.437576481787605,63.828693545710848,18.644714486935861,44.81636646513504,41.858127389059533,41.955793851910059,9.0037837545801036,41.054911601705214,50.515940156148318,98.041028843256413,64.875910706810231,58.960330828944542,null,null,null,null,null,null,null,null,null,null,null,null,null,null,null,"No","N/A","N/A","N/A","N/A","N/A","N/A","N/A","N/A","N/A","N/A","N/A","N/A","N/A","N/A","N/A","N/A","N/A","N/A","N/A","N/A","N/A","N/A","N/A","N/A","N/A","N/A","N/A","N/A","N/A","N/A","N/A","N/A","N/A","N/A","N/A","N/A"]
[null,"DK/missing",90.965611127434983,71.108256753031924,50.43345682252356,17.377412240134895,9.4035749967427282,20.495117365549699,6.2278944085540768,7.2612017655266579,3.0548638919688371,0,93.921495725860368,81.178534833191122,66.735538368752316,57.807993773348855,29.435459486827909,24.906861075271284,14.107483048816974,62.760048161463644,27.043412768766984,44.152278589427297,85.901772437151408,2.4154589371980673,85.148052790526137,60.054718380647913,73.267151469036236,32.874561901329422,78.447774420690322,53.710283295958142,54.153395483566037,54.000274210556434,90.996216245419888,56.598362740439903,47.928460264605377,1.1648750453409309,34.01966068022049,39.199472140845607,null,null,null,null,null,null,null,null,null,null,null,null,null,null,null,"DK/missing","N/A","N/A","N/A","N/A","N/A","N/A","N/A","N/A","N/A","N/A","N/A","N/A","N/A","N/A","N/A","N/A","N/A","N/A","N/A","N/A","N/A","N/A","N/A","N/A","N/A","N/A","N/A","N/A","N/A","N/A","N/A","N/A","N/A","N/A","N/A","N/A"]
["Shared among all sanitation facilities","Yes",8.1964785089890864,9.0918562912349419,6.5481971265947472,4.0482683800137611,1.6508649833603128,3.0423130813485102,4.0738954282946658,2.8188509279912393,0,0.27195718643386124,6.8516423861025393,9.1190879261247098,8.3030817090649425,7.9868066161760911,5.1029703082620044,5.4938308125050144,0.79839330944616349,0,10.575436560041695,7.021564123370533,2.7283258286614496,1.932367149758454,2.4524887307859347,18.268967776080615,3.702889856935009,6.3532939289630566,13.144195463580429,4.6631415094805462,6.307082325438544,16.270538579368942,17.18117095150896,5.4691913487013082,2.2897956298009414,0.79447161434906388,6.8321597739459072,3.8902223603379222,null,null,null,null,null,null,null,null,null,null,null,null,null,null,"Shared among all sanitation facilities","Yes","N/A","N/A","N/A","N/A","N/A","N/A","N/A","N/A","N/A","N/A","N/A","N/A","N/A","N/A","N/A","N/A","N/A","N/A","N/A","N/A","N/A","N/A","N/A","N/A","N/A","N/A","N/A","N/A","N/A","N/A","N/A","N/A","N/A","N/A","N/A","N/A"]
[null,"No",79.347912220441458,89.165822083096842,92.648546034630215,95.951731619986333,98.310573229289517,96.572264040758753,95.926104571705338,97.181149072008736,99.875746659085706,99.728042813566148,72.601203570089979,88.482062122455801,90.330130711629593,90.848997855814019,94.897029691737984,94.506169187494976,98.268880538565952,100,89.424563439958305,89.659609600440703,97.271674171338546,98.067632850241552,97.547511269214056,54.250317317033947,94.766485700252474,93.646706071036917,86.855804536419569,94.941589308352064,93.692917674561471,83.729461420631068,82.818829048491011,94.530808651298699,97.710204370199051,99.205528385650936,93.167840226054096,95.739036607749938,null,null,null,null,null,null,null,null,null,null,null,null,null,null,null,"No","N/A","N/A","N/A","N/A","N/A","N/A","N/A","N/A","N/A","N/A","N/A","N/A","N/A","N/A","N/A","N/A","N/A","N/A","N/A","N/A","N/A","N/A","N/A","N/A","N/A","N/A","N/A","N/A","N/A","N/A","N/A","N/A","N/A","N/A","N/A","N/A"]
["Kind of toilet facility","Flush to piped sewer system",0,0.33155094627356746,4.1686452947901511,24.177453587535471,36.833379267188974,20.652900237574887,37.809007972728779,41.662442720105439,53.174531418971348,55.815814697721102,0,0,9.0897929192621227E-2,0.27069030930950222,1.3966472616019694,23.347096529463617,80.512388387454862,12.596053552235695,7.1393206456677847,8.971754791496112,0,0,0,0,3.4061379964959273,11.993331950103062,3.8811818257786594,3.0679612315852784,1.1078415978447851,0,0,0,0.48385678981220864,54.378252635108126,0,15.242374527976946,null,null,null,null,null,null,null,null,null,null,null,null,null,null,"Kind of toilet facility","Flush to piped sewer system",0,17.287983039109978,217.57710099469261,1262.2317898788122,1921.3667310872186,330.96508123318557,607.96531189702591,669.10392968493193,852.21611844053496,894.66890011112616,0,0,3.2800180333932039,9.798677866705777,50.465567732928577,120.49068822858078,687.57914398328569,85.686628395829672,39.073980276462763,239.52375467081129,0,0,0,0,89.695304019378909,167.85768307004886,61.726111382933674,100.19092797590966,9.8535992201455294,0,0,0,5.8626562266339333,1270.9974310028683,0,539.92569654694364]
[null,"Flush to septic tank",0,0.63361047505812762,0.77525335566119979,3.2186227070772353,2.0170146356837266,1.4174747380528638,3.3167165269042309,2.8140162930268837,2.5937835262188886,1.2605568563692213,0,0.31360951237327228,0.43989932024843559,0.98824219350420117,2.7888881156857299,0,0,1.0496711293529748,4.0031885844686501,0.63592998161490999,1.0622141518646766,94.20289855072464,0,0,0,10.559901967079774,0.66265580244122213,0.89339122164953155,0,0,0,1.2292917557975462,1.1914383055061004,0,0,0.14657901856758565,null,null,null,null,null,null,null,null,null,null,null,null,null,null,null,"Flush to septic tank",0,33.03820202995032,40.463355774591619,168.0345651699713,105.21502219512428,22.715194303419608,53.332491537672539,45.193446109511932,41.569978517960692,20.205402757678215,0,11.315880343672003,15.873603679514943,35.773230793284469,100.7719171269231,0,0,7.1405523663191408,21.909719363481244,16.977764154735954,4.8630144517048546,79.122289395946453,0,0,0,147.79551545937409,10.53884298807052,29.175627977654287,0,0,0,9.5995223018938187,14.436075606454736,0,0,5.192221104002436]
[null,"Flush to pit (latrine)",7.6212788807701752,21.432555257789275,37.548536763255164,51.750720381626714,48.197228449557343,54.353958004328447,51.082953916070217,46.466312561104452,39.493371364662529,42.615085880160073,4.9104716634794086,14.062393770274015,25.310356064482903,33.381606606743723,58.934148468295092,50.217630295075864,5.3801285637281833,16.446715969035104,51.863136830597497,42.25915580389529,13.036013410983916,3.3816425120772946,5.180244921512319,38.138538243458079,20.982997283381568,37.914981138421226,11.666163429078523,38.963649129344837,25.087580153664113,41.955793851910052,5.7774704681970048,28.851259409840115,50.396244640076262,44.420812649280755,65.980339319779475,39.955943693395938,null,null,null,null,null,null,null,null,null,null,null,null,null,null,null,"Flush to pit (latrine)",397.61756793137681,1117.552689702542,1959.7977754912245,2701.7487254528173,2514.1475779845605,871.02837467441645,821.40912114398395,746.25466733854103,632.95127856106183,683.07507861388717,177.55680306390235,507.40924293335058,913.31480332388162,1208.3757658224258,2129.4892010870649,259.16528112290848,45.946521603185403,111.88136297819536,283.85042305446206,1128.2153717533633,59.681300139851032,2.8402873116493592,37.86795781394094,296.59290708209051,552.5543364675483,530.65494343173748,185.53804886230429,1272.4424687660178,223.13926532312581,90.446247373894522,26.469740566488511,225.29908529549814,610.62666404408719,1038.2595251662096,294.0461449875495,1415.3464534184086]
[null,"Flush to somewhere else",12.724802099098618,26.164269577536349,30.541716335504432,14.176834919289904,7.5898839199062555,10.192244263918125,4.990265392970076,7.2612017655266579,2.2839223862271281,0,9.4101209859680335,21.187810483075843,31.116061244278153,35.569526387432823,23.422503021632611,14.321201966701476,13.40793843482605,31.82669467619737,24.480061497531466,3.1660261187968857,24.110770270468041,0,18.009815245882614,25.510159986392701,25.807370465719636,29.830641544194279,6.638612522233041,21.972251720455542,38.179215335045349,8.5794828184996224,56.027481855838325,38.254606393466069,13.755844700641271,0.93731220528748016,33.388558615666639,14.77376217295801,null,null,null,null,null,null,null,null,null,null,null,null,null,null,null,"Flush to somewhere else",663.87871933383019,1364.2773569825001,1594.0857592240452,740.12971011211482,395.91671322734595,163.33187648962519,80.243000775749294,116.61578914585441,36.603904517257334,0,340.25875989458848,764.51357089422027,1122.8115196455399,1287.5759454810682,846.33389203593447,73.909467888254341,114.50435164378709,216.50607854892874,133.98101690551951,84.525099156619618,110.38360208362138,0,131.65302689372683,198.38548772359559,679.59664060728574,417.50719440885382,105.58014397928495,717.55153452679053,339.58165786791403,18.495229242498716,256.69242577374837,298.72969170446981,166.6728467696478,21.908048663536306,148.79852163301092,523.32619285874216]
[null,"Flush to unknown place/not sure/DK where",0.19085054292387457,0.97915269951161299,0.61194910124785329,0.69878366315183871,0,0.72770600953021158,0,0.67983858072913206,0,0,0.27537023986953474,0.71213001061013492,0.83590383059402518,0.7496583485375039,0.38472807947473592,0,0,0,2.1307197160688585,0.2281341712152315,0,0,3.178237187164243,0,0,0,0.41896641624199144,0.33242600185878352,1.3556805581969193,4.0439319375334994,0,0,0,0,0,1.4158652593897687,null,null,null,null,null,null,null,null,null,null,null,null,null,null,null,"Flush to unknown place/not sure/DK where",9.9570596881379512,51.055728997643477,31.939899413417979,36.481383396510438,0,11.661571778662911,0,10.918290820662133,0,0,9.9570596881379512,25.695578964488526,30.163279437541117,27.13677000903181,13.901520797185398,0,0,0,11.661571778662911,6.0906204558755794,0,0,23.233139272321885,0,0,0,6.6632198220894576,10.856092074000252,12.05798095774988,8.7177105902548941,0,0,0,0,0,50.153736544754992]
[null,"Ventilated Improved Pit latrine (VIP)",0.3070962273355704,3.0150712758878537,4.4975900176877959,1.8325871139318926,3.0463386078276486,1.6197093917176664,0.18453888470419999,0.73343173804906792,0.88113013689713626,0.30854256574964772,0.26585775598706918,1.3529856045044066,4.2243231153727194,4.7283350869101399,6.1098260645701519,1.5284121001892632,0,4.1052422144919829,6.0450332157274271,2.2765643588654538,0,0,6.4934651007973114,0,0.12348637129573156,6.2329158541209591,2.4517585765115011,3.1908640363530889,17.485477397245692,0,1.861334588297942,0.15366146947469328,0,3.6059670270167765E-2,0,2.4176742506698337,null,null,null,null,null,null,null,null,null,null,null,null,null,null,null,"Ventilated Improved Pit latrine (VIP)",16.021832679836415,157.21415265166584,234.74594941770891,95.673835317364791,158.90840778544978,25.956027687999782,2.9673680059852932,11.779003487173329,14.121672256796746,4.9456133433088221,9.613099607901848,48.819383989410603,152.43313153966821,171.16029192423076,220.7685860095504,7.887894137769508,0,27.926553554991209,33.08487184774738,60.778660993059759,0,0,47.467690471960168,0,3.2518199870396209,87.235375323229349,38.992639296781682,104.20458562378229,155.52303396131538,0,8.5277880572280598,1.1999402877367273,0,0.84283230988933011,0,85.640491999495268]
[null,"Pit latrine with slab",0.91516322153543128,2.4998025924475362,2.090254957219333,0.94442030654203257,0.50246404299963154,0.73313425324624526,1.3788882910384441,0.38275634145830317,0.80231966128125176,0,0.62680461480360783,2.3803462690470063,2.3630813713570538,2.2546959053129969,0.95030252354426881,0,0,3.0422689734206854,1.7751882387028073,1.4761823034857564,0,0,0,1.8067433758939957,2.2202268797905527,0.42430718894554781,2.4714995292577209,4.2300918391105537E-2,0.81002480948253808,0,1.3649786980851573,13.167424624447769,0,0,0,1.6220911091544041,null,null,null,null,null,null,null,null,null,null,null,null,null,null,null,"Pit latrine with slab",47.745920350101294,130.34661883817265,109.09817980914633,49.305330257732926,26.21040249345408,11.748560003162346,22.172394751457457,6.1471136942718889,12.858594692602937,0,22.664507847168856,85.889338474471714,85.270914104123221,81.617398568494153,34.337629612854727,0,0,20.695511488945012,9.7157241800272356,39.41043152947708,0,0,0,14.050545586907175,58.466194023753715,5.9385683597086691,39.306598369743668,1.3814282345569731,7.2046941065792538,0,6.2537112419672436,102.82423659376542,0,0,0,57.458808033175814]
[null,"Pit latrine without slab/open pit",6.5363031136807939,9.5139959076840608,6.2938284503584585,1.7947118266875783,0.31765104348606737,6.6546391752851655,0.7563247216268032,0,0.77094150574170883,0,3.8024217803722151,9.9434519106090988,8.7489585378452333,7.1590926100488197,2.0361418566816258,10.456340667312201,0,2.1272089904578344,0,10.983194511920953,0.72382099301145031,2.4154589371980673,3.0584099393827708,4.8213306936751588,0.98013428875179942,0,3.6770024600863662,11.509189665132354,0.85062531348397208,6.5607809788526525,1.3649786980851573,9.6236681379604967,1.1895307065132894,0.18029835135083883,0,7.5410079734679059,null,null,null,null,null,null,null,null,null,null,null,null,null,null,null,"Pit latrine without slab/open pit",341.01218286102181,496.08605173604531,328.49831337253346,93.696481025794085,16.569865681396859,106.64135157244198,12.161630784148931,0,12.355704131950208,0,137.49103986175024,358.78666808289984,315.70292120440632,259.15091856345134,73.572660475742722,53.963527403374719,0,14.470672542772448,0,293.22424084402098,3.3137874724064811,2.0287766511781138,22.357193591625247,37.494160822655836,25.810299846879815,0,58.478853502586695,375.85755026132472,7.5658117025824483,14.1434105972049,6.2537112419672436,75.151091252898112,14.412962161839308,4.2141615494466507,0,267.12268323202784]
[null,"Bucket",0.54319378577409849,0.29973535815007496,0.63977264328993144,0.21334751966009249,0.21484852234104571,0,0,0,0,0,0.31448879936466029,0.47025242349367996,0.89617237941236483,0.46087365393037888,0.61841818892864564,0,0,0,0,0,0,0,1.1062064163963503,0,0,0,2.7820712862309258,0.29675006154127059,2.6100799416659557,0,0,0,0.91926042703580968,0,0,9.3992383381788447E-2,null,null,null,null,null,null,null,null,null,null,null,null,null,null,null,"Bucket",28.339520885385568,15.629030307892581,33.392113547464149,11.138229285882959,11.207301943567728,0,0,0,0,0,11.371540178082984,16.967980707302583,32.33804764982554,16.683096205531193,22.345531229450685,0,0,0,0,0,0,0,8.0864473677006181,0,0,0,44.245915238639761,9.6910168670434089,23.215125454533151,0,0,0,11.138229285882959,0,0,3.3294617563930955]
[null,"No facilities or bush or field",64.803156774078374,31.180678606935292,9.6761616590297024,0.48354721317900967,1.0015738611171108,3.2754353255489268,4.4406678483915725E-2,0,0,0,73.099681674211411,45.636003215985632,22.233564772265822,10.142493992546298,2.1248039278546829,0.12931844125760075,0,28.806144494808432,1.2816756356177597,26.27082214281431,61.067181173671933,0,62.973621188864435,0,46.479646714564772,3.0439203571351396,65.350088152139946,19.402008233976552,12.513474893370761,34.822606733910234,33.603755691496353,0,32.063824430415011,4.7264488702611948E-2,0.63110206455385287,7.6816273878025729,null,null,null,null,null,null,null,null,null,null,null,null,null,null,null,"No facilities or bush or field",3380.9120482126846,1625.8467935719837,505.034862322979,25.244538767164222,52.245836080297593,52.489224570119674,0.71405523663191406,0,0,0,2643.1973693266655,1646.6705612579367,802.28993165630527,367.14661729662078,76.776319610829901,0.66739210882654398,0,195.95831254664057,7.0146966346637463,701.36624374757901,279.5769422306459,0,460.34163764496918,0,1223.9686257764918,42.602457826081398,1039.3243607839074,633.61465899420625,111.29999694045087,75.068871631318316,153.95711671913648,0,388.50168873237686,1.1047255255108921,2.812551906960461,272.10379920535019]
[null,"Other",6.3581553548028342,3.859392623013286,3.1562914219559159,0.7089707613183166,0.27961764989225119,0.37279860079748123,0.43689761547328282,0,0,0,7.2947824859440136,3.9410168000270369,3.6104633824383359,4.2947849057236613,1.233592491730346,0,0.69954461399092449,0,1.2816756356177597,3.5560967747976493,0,0,0,29.723227700580029,0,0,0,0.32920777971152065,0,4.0374036792939396,0,8.7200882090133458,0,0,0,9.1090822232353439,null,null,null,null,null,null,null,null,null,null,null,null,null,null,null,"Other",331.71785316575136,201.23940214264175,164.7385874595393,37.01322100735684,14.585901717856864,5.9741400857628051,7.0252727934535875,0,0,0,263.77064078870978,142.20255694421286,130.28223094289027,155.46627400635663,44.573849931760122,0,5.9741400857628051,0,7.0146966346637463,94.939024891724216,0,0,0,231.14935489406474,0,0,0,10.750994049928977,0,8.7036372905876309,0,68.09504809750878,0,0,0,322.66806954890512]
[null,"Missing",0,9.0184679712974558E-2,0,0,0,0,0,0,0,0,0,0,0.13031805251246473,0,0,0,0,0,0,0.1761390410975025,0,0,0,0,0,0,0,0,0,0,0,0,0,0,0,0,null,null,null,null,null,null,null,null,null,null,null,null,null,null,null,"Missing",0,4.7024785505483813,0,0,0,0,0,0,0,0,0,0,4.7024785505483813,0,0,0,0,0,0,4.7024785505483813,0,0,0,0,0,0,0,0,0,0,0,0,0,0,0,0]
[null,null,null,null,null,null,null,null,null,null,null,null,null,null,null,null,null,null,null,null,null,null,null,null,null,null,null,null,null,null,null,null,null,null,null,null,null,null,null,null,null,null,null,null,null,null,null,null,null,null,null,null,null,"Total",5217.2027051081377,5214.2764885506958,5219.3718968273461,5220.6978096715175,5216.3737601962694,1602.511402398796,1607.9906469261098,1606.0122402809477,1602.6772511181648,1602.8949948259997,3615.8808202569094,3608.2707625919611,3608.4628797676332,3619.884986537199,3613.3366756502301,516.08425088971421,854.00415731602084,680.26567242262161,547.30670067569054,2669.7536907478138,457.81864637822957,83.991353358773921,731.00709305624457,777.67245610931411,2633.3432207283781,1399.5917378790339,1590.3947342263439,3265.7168853512194,889.44116553439562,215.57510672575899,458.15449360053617,780.89861553377057,1211.6511228269235,2337.3267242174616,445.65721852752102,3542.267614248196]
[]
[]
[]
[]
[]
[]
[]
[]
[]
[]
[]
[]
[]
[]
[]
[]
[]
[]
[]
[]
[]
[]
[]
[]
[]
[]
[]
[]
[]
[]
[]
[]
[]
[]
[]
[]
[]
[]
[]
[]
[]
[]
[{"$f":"A1026","v":"Yemen"}]
[{"$f":"A1034","v":"2006"}]
["Access to hygiene facilities "]
[" by wealth quintile and sub-national region"]
["Notes:"]
["WHO/UNICEF JMP customised wealth index excludes water,"]
[" sanitation and hygiene assets."]
["Survey used for analysis:",{"$f":"A1025","v":"MICS06"}]
[]
[]
[]
[]
["Access to handwashing",null,"NATIONAL wealth index quintile",null,null,null,null,"URBAN wealth index quintile",null,null,null,null,"RURAL wealth index quintile",null,null,null,null,"SUB-REGIONS:",null,null,null,null,null,null,null,null,null,null,null,null,null,null,null,null,null,null,null,null,null,null,null,null,null,null,null,null,null,null,null,null,null,null,"Raw numbers of respondents:","Access to handwashing","NATIONAL wealth index quintile",null,null,null,null,"URBAN wealth index quintile",null,null,null,null,"RURAL wealth index quintile",null,null,null,null,"SUB-REGIONS:"]
["Weighted percentage (used in graphs)",null,"Poorest","Poor","Middle","Rich","Richest","Poorest","Poor","Middle","Rich","Richest","Poorest","Poor","Middle","Rich","Richest","Abyan","Aden","Al Baidhah","Al Dala'a","Al Hodeidah","Al Jawf","Al Maharah","Al Mahweet","Amran","Dhamar","Hadramout","Hajjah","Ibb","Lahej","Mareb","Raimah","Sa'adah","Sana'a","Sana'a City","Shabwah","Taiz",null,null,null,null,null,null,null,null,null,null,null,null,null,null,"Hygiene data, raw numbers (weighted)",null,"Poorest","Poor","Middle","Rich","Richest","Poorest","Poor","Middle","Rich","Richest","Poorest","Poor","Middle","Rich","Richest","Abyan","Aden","Al Baidhah","Al Dala'a","Al Hodeidah","Al Jawf","Al Maharah","Al Mahweet","Amran","Dhamar","Hadramout","Hajjah","Ibb","Lahej","Mareb","Raimah","Sa'adah","Sana'a","Sana'a City","Shabwah","Taiz"]
["Hygiene ladder","Basic","N/A","N/A","N/A","N/A","N/A","N/A","N/A","N/A","N/A","N/A","N/A","N/A","N/A","N/A","N/A","N/A","N/A","N/A","N/A","N/A","N/A","N/A","N/A","N/A","N/A","N/A","N/A","N/A","N/A","N/A","N/A","N/A","N/A","N/A","N/A","N/A",null,null,null,null,null,null,null,null,null,null,null,null,null,null,"Hygiene ladder","Basic","N/A","N/A","N/A","N/A","N/A","N/A","N/A","N/A","N/A","N/A","N/A","N/A","N/A","N/A","N/A","N/A","N/A","N/A","N/A","N/A","N/A","N/A","N/A","N/A","N/A","N/A","N/A","N/A","N/A","N/A","N/A","N/A","N/A","N/A","N/A","N/A"]
[null,"Limited","N/A","N/A","N/A","N/A","N/A","N/A","N/A","N/A","N/A","N/A","N/A","N/A","N/A","N/A","N/A","N/A","N/A","N/A","N/A","N/A","N/A","N/A","N/A","N/A","N/A","N/A","N/A","N/A","N/A","N/A","N/A","N/A","N/A","N/A","N/A","N/A",null,null,null,null,null,null,null,null,null,null,null,null,null,null,null,"Limited","N/A","N/A","N/A","N/A","N/A","N/A","N/A","N/A","N/A","N/A","N/A","N/A","N/A","N/A","N/A","N/A","N/A","N/A","N/A","N/A","N/A","N/A","N/A","N/A","N/A","N/A","N/A","N/A","N/A","N/A","N/A","N/A","N/A","N/A","N/A","N/A"]
[null,"No facility","N/A","N/A","N/A","N/A","N/A","N/A","N/A","N/A","N/A","N/A","N/A","N/A","N/A","N/A","N/A","N/A","N/A","N/A","N/A","N/A","N/A","N/A","N/A","N/A","N/A","N/A","N/A","N/A","N/A","N/A","N/A","N/A","N/A","N/A","N/A","N/A",null,null,null,null,null,null,null,null,null,null,null,null,null,null,null,"No facility","N/A","N/A","N/A","N/A","N/A","N/A","N/A","N/A","N/A","N/A","N/A","N/A","N/A","N/A","N/A","N/A","N/A","N/A","N/A","N/A","N/A","N/A","N/A","N/A","N/A","N/A","N/A","N/A","N/A","N/A","N/A","N/A","N/A","N/A","N/A","N/A"]
[null,null,null,null,null,null,null,null,null,null,null,null,null,null,null,null,null,null,null,null,null,null,null,null,null,null,null,null,null,null,null,null,null,null,null,null,null,null,null,null,null,null,null,null,null,null,null,null,null,null,null,null,"Observed handwashing place","Fixed","N/A","N/A","N/A","N/A","N/A","N/A","N/A","N/A","N/A","N/A","N/A","N/A","N/A","N/A","N/A","N/A","N/A","N/A","N/A","N/A","N/A","N/A","N/A","N/A","N/A","N/A","N/A","N/A","N/A","N/A","N/A","N/A","N/A","N/A","N/A","N/A"]
[null,null,null,null,null,null,null,null,null,null,null,null,null,null,null,null,null,null,null,null,null,null,null,null,null,null,null,null,null,null,null,null,null,null,null,null,null,null,null,null,null,null,null,null,null,null,null,null,null,null,null,null,null,"Mobile","N/A","N/A","N/A","N/A","N/A","N/A","N/A","N/A","N/A","N/A","N/A","N/A","N/A","N/A","N/A","N/A","N/A","N/A","N/A","N/A","N/A","N/A","N/A","N/A","N/A","N/A","N/A","N/A","N/A","N/A","N/A","N/A","N/A","N/A","N/A","N/A"]
[null,null,null,null,null,null,null,null,null,null,null,null,null,null,null,null,null,null,null,null,null,null,null,null,null,null,null,null,null,null,null,null,null,null,null,null,null,null,null,null,null,null,null,null,null,null,null,null,null,null,null,null,"Water / Soap","Water and soap","N/A","N/A","N/A","N/A","N/A","N/A","N/A","N/A","N/A","N/A","N/A","N/A","N/A","N/A","N/A","N/A","N/A","N/A","N/A","N/A","N/A","N/A","N/A","N/A","N/A","N/A","N/A","N/A","N/A","N/A","N/A","N/A","N/A","N/A","N/A","N/A"]
[null,null,null,null,null,null,null,null,null,null,null,null,null,null,null,null,null,null,null,null,null,null,null,null,null,null,null,null,null,null,null,null,null,null,null,null,null,null,null,null,null,null,null,null,null,null,null,null,null,null,null,null,null,"Water only","N/A","N/A","N/A","N/A","N/A","N/A","N/A","N/A","N/A","N/A","N/A","N/A","N/A","N/A","N/A","N/A","N/A","N/A","N/A","N/A","N/A","N/A","N/A","N/A","N/A","N/A","N/A","N/A","N/A","N/A","N/A","N/A","N/A","N/A","N/A","N/A"]
[null,null,null,null,null,null,null,null,null,null,null,null,null,null,null,null,null,null,null,null,null,null,null,null,null,null,null,null,null,null,null,null,null,null,null,null,null,null,null,null,null,null,null,null,null,null,null,null,null,null,null,null,null,"Soap only","N/A","N/A","N/A","N/A","N/A","N/A","N/A","N/A","N/A","N/A","N/A","N/A","N/A","N/A","N/A","N/A","N/A","N/A","N/A","N/A","N/A","N/A","N/A","N/A","N/A","N/A","N/A","N/A","N/A","N/A","N/A","N/A","N/A","N/A","N/A","N/A"]
[null,null,null,null,null,null,null,null,null,null,null,null,null,null,null,null,null,null,null,null,null,null,null,null,null,null,null,null,null,null,null,null,null,null,null,null,null,null,null,null,null,null,null,null,null,null,null,null,null,null,null,null,null,"Neither","N/A","N/A","N/A","N/A","N/A","N/A","N/A","N/A","N/A","N/A","N/A","N/A","N/A","N/A","N/A","N/A","N/A","N/A","N/A","N/A","N/A","N/A","N/A","N/A","N/A","N/A","N/A","N/A","N/A","N/A","N/A","N/A","N/A","N/A","N/A","N/A"]
[]
[]
[]
[]
[]
[]
[]
[]
[]
[]
[]
[]
[]
[]
[]
[]
[]
[]
[]
[]
[]
[]
[]
[]
[]
[]
[]
[]
[null,null,null,null,null,null,null,null,null,null,null,null,null,null,null,null,null,null,null,null,null,null,null,null,null,null,null,null,null,null,null,null,null,null,null,null,null,null,null,null,null,null,null,null,null,null,null,null,null,null,null,null,"Raw numbers of respondents:","Menstrual health and hygiene","NATIONAL wealth index quintile",null,null,null,null,"URBAN wealth index quintile",null,null,null,null,"RURAL wealth index quintile",null,null,null,null,"SUB-REGIONS:"]
[null,null,null,null,null,null,null,null,null,null,null,null,null,null,null,null,null,null,null,null,null,null,null,null,null,null,null,null,null,null,null,null,null,null,null,null,null,null,null,null,null,null,null,null,null,null,null,null,null,null,null,null,"MHH data, raw numbers (weighted)",null,"Poorest","Poor","Middle","Rich","Richest","Poorest","Poor","Middle","Rich","Richest","Poorest","Poor","Middle","Rich","Richest","Abyan","Aden","Al Baidhah","Al Dala'a","Al Hodeidah","Al Jawf","Al Maharah","Al Mahweet","Amran","Dhamar","Hadramout","Hajjah","Ibb","Lahej","Mareb","Raimah","Sa'adah","Sana'a","Sana'a City","Shabwah","Taiz"]
[null,null,null,null,null,null,null,null,null,null,null,null,null,null,null,null,null,null,null,null,null,null,null,null,null,null,null,null,null,null,null,null,null,null,null,null,null,null,null,null,null,null,null,null,null,null,null,null,null,null,null,null,"Private place to wash and change","Yes","N/A","N/A","N/A","N/A","N/A","N/A","N/A","N/A","N/A","N/A","N/A","N/A","N/A","N/A","N/A","N/A","N/A","N/A","N/A","N/A","N/A","N/A","N/A","N/A","N/A","N/A","N/A","N/A","N/A","N/A","N/A","N/A","N/A","N/A","N/A","N/A"]
[null,null,null,null,null,null,null,null,null,null,null,null,null,null,null,null,null,null,null,null,null,null,null,null,null,null,null,null,null,null,null,null,null,null,null,null,null,null,null,null,null,null,null,null,null,null,null,null,null,null,null,null,null,"No","N/A","N/A","N/A","N/A","N/A","N/A","N/A","N/A","N/A","N/A","N/A","N/A","N/A","N/A","N/A","N/A","N/A","N/A","N/A","N/A","N/A","N/A","N/A","N/A","N/A","N/A","N/A","N/A","N/A","N/A","N/A","N/A","N/A","N/A","N/A","N/A"]
[null,null,null,null,null,null,null,null,null,null,null,null,null,null,null,null,null,null,null,null,null,null,null,null,null,null,null,null,null,null,null,null,null,null,null,null,null,null,null,null,null,null,null,null,null,null,null,null,null,null,null,null,null,"DK/not sure/missing","N/A","N/A","N/A","N/A","N/A","N/A","N/A","N/A","N/A","N/A","N/A","N/A","N/A","N/A","N/A","N/A","N/A","N/A","N/A","N/A","N/A","N/A","N/A","N/A","N/A","N/A","N/A","N/A","N/A","N/A","N/A","N/A","N/A","N/A","N/A","N/A"]
[null,null,null,null,null,null,null,null,null,null,null,null,null,null,null,null,null,null,null,null,null,null,null,null,null,null,null,null,null,null,null,null,null,null,null,null,null,null,null,null,null,null,null,null,null,null,null,null,null,null,null,null,"Use of menstrual materials","Materials reusable","N/A","N/A","N/A","N/A","N/A","N/A","N/A","N/A","N/A","N/A","N/A","N/A","N/A","N/A","N/A","N/A","N/A","N/A","N/A","N/A","N/A","N/A","N/A","N/A","N/A","N/A","N/A","N/A","N/A","N/A","N/A","N/A","N/A","N/A","N/A","N/A"]
[null,null,null,null,null,null,null,null,null,null,null,null,null,null,null,null,null,null,null,null,null,null,null,null,null,null,null,null,null,null,null,null,null,null,null,null,null,null,null,null,null,null,null,null,null,null,null,null,null,null,null,null,null,"Materials not reusable","N/A","N/A","N/A","N/A","N/A","N/A","N/A","N/A","N/A","N/A","N/A","N/A","N/A","N/A","N/A","N/A","N/A","N/A","N/A","N/A","N/A","N/A","N/A","N/A","N/A","N/A","N/A","N/A","N/A","N/A","N/A","N/A","N/A","N/A","N/A","N/A"]
[null,null,null,null,null,null,null,null,null,null,null,null,null,null,null,null,null,null,null,null,null,null,null,null,null,null,null,null,null,null,null,null,null,null,null,null,null,null,null,null,null,null,null,null,null,null,null,null,null,null,null,null,null,"No materials used","N/A","N/A","N/A","N/A","N/A","N/A","N/A","N/A","N/A","N/A","N/A","N/A","N/A","N/A","N/A","N/A","N/A","N/A","N/A","N/A","N/A","N/A","N/A","N/A","N/A","N/A","N/A","N/A","N/A","N/A","N/A","N/A","N/A","N/A","N/A","N/A"]
[null,null,null,null,null,null,null,null,null,null,null,null,null,null,null,null,null,null,null,null,null,null,null,null,null,null,null,null,null,null,null,null,null,null,null,null,null,null,null,null,null,null,null,null,null,null,null,null,null,null,null,null,null,"DK/not sure/missing","N/A","N/A","N/A","N/A","N/A","N/A","N/A","N/A","N/A","N/A","N/A","N/A","N/A","N/A","N/A","N/A","N/A","N/A","N/A","N/A","N/A","N/A","N/A","N/A","N/A","N/A","N/A","N/A","N/A","N/A","N/A","N/A","N/A","N/A","N/A","N/A"]
[null,null,null,null,null,null,null,null,null,null,null,null,null,null,null,null,null,null,null,null,null,null,null,null,null,null,null,null,null,null,null,null,null,null,null,null,null,null,null,null,null,null,null,null,null,null,null,null,null,null,null,null,"Use of menstrual materials with private place to wash and change","Materials reusable","N/A","N/A","N/A","N/A","N/A","N/A","N/A","N/A","N/A","N/A","N/A","N/A","N/A","N/A","N/A","N/A","N/A","N/A","N/A","N/A","N/A","N/A","N/A","N/A","N/A","N/A","N/A","N/A","N/A","N/A","N/A","N/A","N/A","N/A","N/A","N/A"]
[null,null,null,null,null,null,null,null,null,null,null,null,null,null,null,null,null,null,null,null,null,null,null,null,null,null,null,null,null,null,null,null,null,null,null,null,null,null,null,null,null,null,null,null,null,null,null,null,null,null,null,null,null,"Materials not reusable","N/A","N/A","N/A","N/A","N/A","N/A","N/A","N/A","N/A","N/A","N/A","N/A","N/A","N/A","N/A","N/A","N/A","N/A","N/A","N/A","N/A","N/A","N/A","N/A","N/A","N/A","N/A","N/A","N/A","N/A","N/A","N/A","N/A","N/A","N/A","N/A"]
[null,null,null,null,null,null,null,null,null,null,null,null,null,null,null,null,null,null,null,null,null,null,null,null,null,null,null,null,null,null,null,null,null,null,null,null,null,null,null,null,null,null,null,null,null,null,null,null,null,null,null,null,null,"No materials used","N/A","N/A","N/A","N/A","N/A","N/A","N/A","N/A","N/A","N/A","N/A","N/A","N/A","N/A","N/A","N/A","N/A","N/A","N/A","N/A","N/A","N/A","N/A","N/A","N/A","N/A","N/A","N/A","N/A","N/A","N/A","N/A","N/A","N/A","N/A","N/A"]
[null,null,null,null,null,null,null,null,null,null,null,null,null,null,null,null,null,null,null,null,null,null,null,null,null,null,null,null,null,null,null,null,null,null,null,null,null,null,null,null,null,null,null,null,null,null,null,null,null,null,null,null,"Awareness of menstruation before menarche","Yes","N/A","N/A","N/A","N/A","N/A","N/A","N/A","N/A","N/A","N/A","N/A","N/A","N/A","N/A","N/A","N/A","N/A","N/A","N/A","N/A","N/A","N/A","N/A","N/A","N/A","N/A","N/A","N/A","N/A","N/A","N/A","N/A","N/A","N/A","N/A","N/A"]
[null,null,null,null,null,null,null,null,null,null,null,null,null,null,null,null,null,null,null,null,null,null,null,null,null,null,null,null,null,null,null,null,null,null,null,null,null,null,null,null,null,null,null,null,null,null,null,null,null,null,null,null,null,"No","N/A","N/A","N/A","N/A","N/A","N/A","N/A","N/A","N/A","N/A","N/A","N/A","N/A","N/A","N/A","N/A","N/A","N/A","N/A","N/A","N/A","N/A","N/A","N/A","N/A","N/A","N/A","N/A","N/A","N/A","N/A","N/A","N/A","N/A","N/A","N/A"]
[null,null,null,null,null,null,null,null,null,null,null,null,null,null,null,null,null,null,null,null,null,null,null,null,null,null,null,null,null,null,null,null,null,null,null,null,null,null,null,null,null,null,null,null,null,null,null,null,null,null,null,null,null,"DK/not sure/missing","N/A","N/A","N/A","N/A","N/A","N/A","N/A","N/A","N/A","N/A","N/A","N/A","N/A","N/A","N/A","N/A","N/A","N/A","N/A","N/A","N/A","N/A","N/A","N/A","N/A","N/A","N/A","N/A","N/A","N/A","N/A","N/A","N/A","N/A","N/A","N/A"]
[null,null,null,null,null,null,null,null,null,null,null,null,null,null,null,null,null,null,null,null,null,null,null,null,null,null,null,null,null,null,null,null,null,null,null,null,null,null,null,null,null,null,null,null,null,null,null,null,null,null,null,null,"Participation in (all) activities during menstruation","Yes","N/A","N/A","N/A","N/A","N/A","N/A","N/A","N/A","N/A","N/A","N/A","N/A","N/A","N/A","N/A","N/A","N/A","N/A","N/A","N/A","N/A","N/A","N/A","N/A","N/A","N/A","N/A","N/A","N/A","N/A","N/A","N/A","N/A","N/A","N/A","N/A"]
[null,null,null,null,null,null,null,null,null,null,null,null,null,null,null,null,null,null,null,null,null,null,null,null,null,null,null,null,null,null,null,null,null,null,null,null,null,null,null,null,null,null,null,null,null,null,null,null,null,null,null,null,null,"No","N/A","N/A","N/A","N/A","N/A","N/A","N/A","N/A","N/A","N/A","N/A","N/A","N/A","N/A","N/A","N/A","N/A","N/A","N/A","N/A","N/A","N/A","N/A","N/A","N/A","N/A","N/A","N/A","N/A","N/A","N/A","N/A","N/A","N/A","N/A","N/A"]
[null,null,null,null,null,null,null,null,null,null,null,null,null,null,null,null,null,null,null,null,null,null,null,null,null,null,null,null,null,null,null,null,null,null,null,null,null,null,null,null,null,null,null,null,null,null,null,null,null,null,null,null,null,"DK/not sure/missing/no such activity","N/A","N/A","N/A","N/A","N/A","N/A","N/A","N/A","N/A","N/A","N/A","N/A","N/A","N/A","N/A","N/A","N/A","N/A","N/A","N/A","N/A","N/A","N/A","N/A","N/A","N/A","N/A","N/A","N/A","N/A","N/A","N/A","N/A","N/A","N/A","N/A"]
[null,null,null,null,null,null,null,null,null,null,null,null,null,null,null,null,null,null,null,null,null,null,null,null,null,null,null,null,null,null,null,null,null,null,null,null,null,null,null,null,null,null,null,null,null,null,null,null,null,null,null,null,"Participation in specific activities during menstruation","Did not go to school (amongst those usually attending school)","N/A","N/A","N/A","N/A","N/A","N/A","N/A","N/A","N/A","N/A","N/A","N/A","N/A","N/A","N/A","N/A","N/A","N/A","N/A","N/A","N/A","N/A","N/A","N/A","N/A","N/A","N/A","N/A","N/A","N/A","N/A","N/A","N/A","N/A","N/A","N/A"]
[null,null,null,null,null,null,null,null,null,null,null,null,null,null,null,null,null,null,null,null,null,null,null,null,null,null,null,null,null,null,null,null,null,null,null,null,null,null,null,null,null,null,null,null,null,null,null,null,null,null,null,null,null,"Did not go to work (amongst those who usually work)","N/A","N/A","N/A","N/A","N/A","N/A","N/A","N/A","N/A","N/A","N/A","N/A","N/A","N/A","N/A","N/A","N/A","N/A","N/A","N/A","N/A","N/A","N/A","N/A","N/A","N/A","N/A","N/A","N/A","N/A","N/A","N/A","N/A","N/A","N/A","N/A"]
[null,null,null,null,null,null,null,null,null,null,null,null,null,null,null,null,null,null,null,null,null,null,null,null,null,null,null,null,null,null,null,null,null,null,null,null,null,null,null,null,null,null,null,null,null,null,null,null,null,null,null,null,null,"Did not participate in social activities","N/A","N/A","N/A","N/A","N/A","N/A","N/A","N/A","N/A","N/A","N/A","N/A","N/A","N/A","N/A","N/A","N/A","N/A","N/A","N/A","N/A","N/A","N/A","N/A","N/A","N/A","N/A","N/A","N/A","N/A","N/A","N/A","N/A","N/A","N/A","N/A"]
[null,null,null,null,null,null,null,null,null,null,null,null,null,null,null,null,null,null,null,null,null,null,null,null,null,null,null,null,null,null,null,null,null,null,null,null,null,null,null,null,null,null,null,null,null,null,null,null,null,null,null,null,null,"Did not cook food","N/A","N/A","N/A","N/A","N/A","N/A","N/A","N/A","N/A","N/A","N/A","N/A","N/A","N/A","N/A","N/A","N/A","N/A","N/A","N/A","N/A","N/A","N/A","N/A","N/A","N/A","N/A","N/A","N/A","N/A","N/A","N/A","N/A","N/A","N/A","N/A"]
[null,null,null,null,null,null,null,null,null,null,null,null,null,null,null,null,null,null,null,null,null,null,null,null,null,null,null,null,null,null,null,null,null,null,null,null,null,null,null,null,null,null,null,null,null,null,null,null,null,null,null,null,null,"Did not eat with others","N/A","N/A","N/A","N/A","N/A","N/A","N/A","N/A","N/A","N/A","N/A","N/A","N/A","N/A","N/A","N/A","N/A","N/A","N/A","N/A","N/A","N/A","N/A","N/A","N/A","N/A","N/A","N/A","N/A","N/A","N/A","N/A","N/A","N/A","N/A","N/A"]
[null,null,null,null,null,null,null,null,null,null,null,null,null,null,null,null,null,null,null,null,null,null,null,null,null,null,null,null,null,null,null,null,null,null,null,null,null,null,null,null,null,null,null,null,null,null,null,null,null,null,null,null,null,"Did not bathe in regular place","N/A","N/A","N/A","N/A","N/A","N/A","N/A","N/A","N/A","N/A","N/A","N/A","N/A","N/A","N/A","N/A","N/A","N/A","N/A","N/A","N/A","N/A","N/A","N/A","N/A","N/A","N/A","N/A","N/A","N/A","N/A","N/A","N/A","N/A","N/A","N/A"]
[null,null,null,null,null,null,null,null,null,null,null,null,null,null,null,null,null,null,null,null,null,null,null,null,null,null,null,null,null,null,null,null,null,null,null,null,null,null,null,null,null,null,null,null,null,null,null,null,null,null,null,null,null,"Did not participate in other activities","N/A","N/A","N/A","N/A","N/A","N/A","N/A","N/A","N/A","N/A","N/A","N/A","N/A","N/A","N/A","N/A","N/A","N/A","N/A","N/A","N/A","N/A","N/A","N/A","N/A","N/A","N/A","N/A","N/A","N/A","N/A","N/A","N/A","N/A","N/A","N/A"]
[null,null,null,null,null,null,null,null,null,null,null,null,null,null,null,null,null,null,null,null,null,null,null,null,null,null,null,null,null,null,null,null,null,null,null,null,null,null,null,null,null,null,null,null,null,null,null,null,null,null,null,null,null,"DK/not sure/missing/no such activity","N/A","N/A","N/A","N/A","N/A","N/A","N/A","N/A","N/A","N/A","N/A","N/A","N/A","N/A","N/A","N/A","N/A","N/A","N/A","N/A","N/A","N/A","N/A","N/A","N/A","N/A","N/A","N/A","N/A","N/A","N/A","N/A","N/A","N/A","N/A","N/A"]
[]
[]
[]
[]
[]
[]
[]
[]
[]
[]
[]
[]
[]
[]
[]
[]
[]
[]
[]
[]
[]
[]
[]
[]
[]
[]
[]
[]
[]
[]
[]
[]
[]
[]
[]
[]
[]
[]
[]
[]
[]
[]
[]
[]
[]
[]
[]
[]
[]
[]
[]
[]
[]
[]
[null,null,null,null,null,null,null,null,null,null,null,null,null,null,null,null,null,null,null,null,null,null,null,null,null,null,null,null,null,null,null,null,null,null,null,null,null,null,null,null,null,null,null,null,null,null,null,null,null,null,null,null,"Raw numbers of respondents:","Basic water, sanitation and hygiene","NATIONAL wealth index quintile",null,null,null,null,"URBAN wealth index quintile",null,null,null,null,"RURAL wealth index quintile",null,null,null,null,"SUB-REGIONS:"]
[null,null,null,null,null,null,null,null,null,null,null,null,null,null,null,null,null,null,null,null,null,null,null,null,null,null,null,null,null,null,null,null,null,null,null,null,null,null,null,null,null,null,null,null,null,null,null,null,null,null,null,null,"WatSan data, raw numbers (weighted)",null,"Poorest","Poor","Middle","Rich","Richest","Poorest","Poor","Middle","Rich","Richest","Poorest","Poor","Middle","Rich","Richest","Abyan","Aden","Al Baidhah","Al Dala'a","Al Hodeidah","Al Jawf","Al Maharah","Al Mahweet","Amran","Dhamar","Hadramout","Hajjah","Ibb","Lahej","Mareb","Raimah","Sa'adah","Sana'a","Sana'a City","Shabwah","Taiz"]
[null,null,null,null,null,null,null,null,null,null,null,null,null,null,null,null,null,null,null,null,null,null,null,null,null,null,null,null,null,null,null,null,null,null,null,null,null,null,null,null,null,null,null,null,null,null,null,null,null,null,null,null,"Use of Basic Water Sanitation and Hygiene","Yes","N/A","N/A","N/A","N/A","N/A","N/A","N/A","N/A","N/A","N/A","N/A","N/A","N/A","N/A","N/A","N/A","N/A","N/A","N/A","N/A","N/A","N/A","N/A","N/A","N/A","N/A","N/A","N/A","N/A","N/A","N/A","N/A","N/A","N/A","N/A","N/A"]
[null,null,null,null,null,null,null,null,null,null,null,null,null,null,null,null,null,null,null,null,null,null,null,null,null,null,null,null,null,null,null,null,null,null,null,null,null,null,null,null,null,null,null,null,null,null,null,null,null,null,null,null,null,"No","N/A","N/A","N/A","N/A","N/A","N/A","N/A","N/A","N/A","N/A","N/A","N/A","N/A","N/A","N/A","N/A","N/A","N/A","N/A","N/A","N/A","N/A","N/A","N/A","N/A","N/A","N/A","N/A","N/A","N/A","N/A","N/A","N/A","N/A","N/A","N/A"]
[null,null,null,null,null,null,null,null,null,null,null,null,null,null,null,null,null,null,null,null,null,null,null,null,null,null,null,null,null,null,null,null,null,null,null,null,null,null,null,null,null,null,null,null,null,null,null,null,null,null,null,null,"Use of Basic Water and Sanitation","Yes","N/A","N/A","N/A","N/A","N/A","N/A","N/A","N/A","N/A","N/A","N/A","N/A","N/A","N/A","N/A","N/A","N/A","N/A","N/A","N/A","N/A","N/A","N/A","N/A","N/A","N/A","N/A","N/A","N/A","N/A","N/A","N/A","N/A","N/A","N/A","N/A"]
[null,null,null,null,null,null,null,null,null,null,null,null,null,null,null,null,null,null,null,null,null,null,null,null,null,null,null,null,null,null,null,null,null,null,null,null,null,null,null,null,null,null,null,null,null,null,null,null,null,null,null,null,null,"No","N/A","N/A","N/A","N/A","N/A","N/A","N/A","N/A","N/A","N/A","N/A","N/A","N/A","N/A","N/A","N/A","N/A","N/A","N/A","N/A","N/A","N/A","N/A","N/A","N/A","N/A","N/A","N/A","N/A","N/A","N/A","N/A","N/A","N/A","N/A","N/A"]
[null,null,null,null,null,null,null,null,null,null,null,null,null,null,null,null,null,null,null,null,null,null,null,null,null,null,null,null,null,null,null,null,null,null,null,null,null,null,null,null,null,null,null,null,null,null,null,null,null,null,null,null,"Use of Basic Water and Hygiene","Yes","N/A","N/A","N/A","N/A","N/A","N/A","N/A","N/A","N/A","N/A","N/A","N/A","N/A","N/A","N/A","N/A","N/A","N/A","N/A","N/A","N/A","N/A","N/A","N/A","N/A","N/A","N/A","N/A","N/A","N/A","N/A","N/A","N/A","N/A","N/A","N/A"]
[null,null,null,null,null,null,null,null,null,null,null,null,null,null,null,null,null,null,null,null,null,null,null,null,null,null,null,null,null,null,null,null,null,null,null,null,null,null,null,null,null,null,null,null,null,null,null,null,null,null,null,null,null,"No","N/A","N/A","N/A","N/A","N/A","N/A","N/A","N/A","N/A","N/A","N/A","N/A","N/A","N/A","N/A","N/A","N/A","N/A","N/A","N/A","N/A","N/A","N/A","N/A","N/A","N/A","N/A","N/A","N/A","N/A","N/A","N/A","N/A","N/A","N/A","N/A"]
[null,null,null,null,null,null,null,null,null,null,null,null,null,null,null,null,null,null,null,null,null,null,null,null,null,null,null,null,null,null,null,null,null,null,null,null,null,null,null,null,null,null,null,null,null,null,null,null,null,null,null,null,"Use of Basic Sanitation and Hygiene","Yes","N/A","N/A","N/A","N/A","N/A","N/A","N/A","N/A","N/A","N/A","N/A","N/A","N/A","N/A","N/A","N/A","N/A","N/A","N/A","N/A","N/A","N/A","N/A","N/A","N/A","N/A","N/A","N/A","N/A","N/A","N/A","N/A","N/A","N/A","N/A","N/A"]
[null,null,null,null,null,null,null,null,null,null,null,null,null,null,null,null,null,null,null,null,null,null,null,null,null,null,null,null,null,null,null,null,null,null,null,null,null,null,null,null,null,null,null,null,null,null,null,null,null,null,null,null,null,"No","N/A","N/A","N/A","N/A","N/A","N/A","N/A","N/A","N/A","N/A","N/A","N/A","N/A","N/A","N/A","N/A","N/A","N/A","N/A","N/A","N/A","N/A","N/A","N/A","N/A","N/A","N/A","N/A","N/A","N/A","N/A","N/A","N/A","N/A","N/A","N/A"]
[null,null,null,null,null,null,null,null,null,null,null,null,null,null,null,null,null,null,null,null,null,null,null,null,null,null,null,null,null,null,null,null,null,null,null,null,null,null,null,null,null,null,null,null,null,null,null,null,null,null,null,null,"Use of Basic Water","Yes","N/A","N/A","N/A","N/A","N/A","N/A","N/A","N/A","N/A","N/A","N/A","N/A","N/A","N/A","N/A","N/A","N/A","N/A","N/A","N/A","N/A","N/A","N/A","N/A","N/A","N/A","N/A","N/A","N/A","N/A","N/A","N/A","N/A","N/A","N/A","N/A"]
[null,null,null,null,null,null,null,null,null,null,null,null,null,null,null,null,null,null,null,null,null,null,null,null,null,null,null,null,null,null,null,null,null,null,null,null,null,null,null,null,null,null,null,null,null,null,null,null,null,null,null,null,null,"No","N/A","N/A","N/A","N/A","N/A","N/A","N/A","N/A","N/A","N/A","N/A","N/A","N/A","N/A","N/A","N/A","N/A","N/A","N/A","N/A","N/A","N/A","N/A","N/A","N/A","N/A","N/A","N/A","N/A","N/A","N/A","N/A","N/A","N/A","N/A","N/A"]
[null,null,null,null,null,null,null,null,null,null,null,null,null,null,null,null,null,null,null,null,null,null,null,null,null,null,null,null,null,null,null,null,null,null,null,null,null,null,null,null,null,null,null,null,null,null,null,null,null,null,null,null,"Use of Basic Sanitation","Yes","N/A","N/A","N/A","N/A","N/A","N/A","N/A","N/A","N/A","N/A","N/A","N/A","N/A","N/A","N/A","N/A","N/A","N/A","N/A","N/A","N/A","N/A","N/A","N/A","N/A","N/A","N/A","N/A","N/A","N/A","N/A","N/A","N/A","N/A","N/A","N/A"]
[null,null,null,null,null,null,null,null,null,null,null,null,null,null,null,null,null,null,null,null,null,null,null,null,null,null,null,null,null,null,null,null,null,null,null,null,null,null,null,null,null,null,null,null,null,null,null,null,null,null,null,null,null,"No","N/A","N/A","N/A","N/A","N/A","N/A","N/A","N/A","N/A","N/A","N/A","N/A","N/A","N/A","N/A","N/A","N/A","N/A","N/A","N/A","N/A","N/A","N/A","N/A","N/A","N/A","N/A","N/A","N/A","N/A","N/A","N/A","N/A","N/A","N/A","N/A"]
[null,null,null,null,null,null,null,null,null,null,null,null,null,null,null,null,null,null,null,null,null,null,null,null,null,null,null,null,null,null,null,null,null,null,null,null,null,null,null,null,null,null,null,null,null,null,null,null,null,null,null,null,"Access to Basic Hygiene","Yes","N/A","N/A","N/A","N/A","N/A","N/A","N/A","N/A","N/A","N/A","N/A","N/A","N/A","N/A","N/A","N/A","N/A","N/A","N/A","N/A","N/A","N/A","N/A","N/A","N/A","N/A","N/A","N/A","N/A","N/A","N/A","N/A","N/A","N/A","N/A","N/A"]
[null,null,null,null,null,null,null,null,null,null,null,null,null,null,null,null,null,null,null,null,null,null,null,null,null,null,null,null,null,null,null,null,null,null,null,null,null,null,null,null,null,null,null,null,null,null,null,null,null,null,null,null,null,"No","N/A","N/A","N/A","N/A","N/A","N/A","N/A","N/A","N/A","N/A","N/A","N/A","N/A","N/A","N/A","N/A","N/A","N/A","N/A","N/A","N/A","N/A","N/A","N/A","N/A","N/A","N/A","N/A","N/A","N/A","N/A","N/A","N/A","N/A","N/A","N/A"]
[]
[]
[]
[]
[]
[]
[]
[]
[]
[]
[]
[]
[]
[]
[]
[]
[]
[]
[]
[]
[]
[]
[]
[]
[]
[]
[]
[]
[]
[]
[]
[]
[]
[]
[]
[]
[]
[]
[]
[]
[]
[]
[]
[]
[null,null,"INITIAL (national) Wealth Index",null,null,null,null,"URBAN Wealth Index",null,null,null,null,"RURAL Wealth Index"]
[null,null,"Component Matrix",null,null,null,null,"Component Matrix",null,null,null,null,"Component Matrix"]
[null,null,null,null,"Component",null,null,null,null,"Component",null,null,null,null,"Component"]
[null,"Note:\n\nThe INITIAL (national) Wealth Index is based on the first component of the Principal Component Analysis (PCA) which has been obtained at national level.\n\nThe final national-level (NATIONAL) Wealth Index is based on the URBAN and RURAL specific wealth indexes. Regression procedures are used to establish the relationships between the two sets of scores (urban and rural) and the initial (national) wealth factors.\nThis allows best use of the available information for each area and a better precision of the FINAL (NATIONAL) Wealth Index.\n\nFor dependency reasons, all WASH variables (contained in the generic MICS and DHS scripts) have been excluded from the sets of asset variables used in the PCAs.\n\nThe PCA can extracts as many components as there are asset variables in the input. Only the first of the components is used to represent the Wealth Index. \n\nThe scores represent the weights of the asset variables on the Wealth Index (correlations between the variables and the component).\n\nThe communalities are the proportion of each variable's variance that can be explained by the component.\n\nProportion of explained variance is the part of the model's total variance that is explained by the component.\n\nFor more information on the procedure used:\n\nThe DHS Wealth Index, DHS Comparative Reports No. 6, Shea Oscar Rutstein, Kiersten Johnson, ORC Macro International Inc., 2004.\n\nThe DHS Wealth Index: Approaches for Rural and Urban Areas, Shea O. Rutstein, ORC Macro International Inc., 2008.\n\nMICS Methodological Paper No. 4, Review of options for reporting water, sanitation and hygiene coverage by wealth quintile, UNICEF, 2016.",null,null,"1",null,null,null,null,"1",null,null,null,null,"1"]
[null,null,"Household has: television",null,0.76523643744702408,null,null,"Household has: refrigerator",null,0.63972798337412395,null,null,"Household has: television",null,0.72864645991122468]
[null,null,"Household fuel type: LPG",null,0.75846692485070633,null,null,"Household fuel type: LPG",null,0.62144927911170245,null,null,"Household has: refrigerator",null,0.68839095859679145]
[null,null,"Household has: refrigerator",null,0.75823602445404692,null,null,"Household fuel type: kerosene",null,-0.59478876049708673,null,null,"Household fuel type: LPG",null,0.68775257027796943]
[null,null,"Household has: electricity",null,0.73554414904179877,null,null,"Household has: non-mobile phone",null,0.53942484533175938,null,null,"Household has: electricity",null,0.66229409996161404]
[null,null,"Household fuel type: wood",null,-0.72456793336665537,null,null,"Household has: fan",null,0.5320664732650332,null,null,"Household has: fan",null,0.65802954005429815]
[null,null,"Household has: fan",null,0.71194824899347409,null,null,"Household has: television",null,0.5180816689237876,null,null,"Household fuel type: wood",null,-0.65276345581874295]
[null,null,"Household has: non-mobile phone",null,0.64512286619557435,null,null,"Has carpet floor",null,0.50342660427452068,null,null,"Household has: non-mobile phone",null,0.60022709002183583]
[null,null,"Household has: mobile telephone",null,0.5625246789036632,null,null,"Household has: electricity",null,0.4733560252380471,null,null,"Household has: mobile telephone",null,0.56341884788214314]
[null,null,"Has carpet floor",null,0.48052607099580857,null,null,"Household has: mobile telephone",null,0.45317417085006434,null,null,"Household has: radio",null,0.47285835770830303]
[null,null,"Has dung floor",null,-0.46996285868574034,null,null,"Household member owns: car/truck",null,0.4327289787844929,null,null,"Has dung floor",null,-0.44912296791636952]
[null,null,"Household has: radio",null,0.46685581135982029,null,null,"Household has: radio",null,0.42593678426038889,null,null,"Household member owns: car/truck",null,0.42866431069761513]
[null,null,"Household member owns: car/truck",null,0.39016124706528271,null,null,"Has earth/sand floor",null,-0.38307398532878173,null,null,"Household has: computer",null,0.38693691661298601]
[null,null,"Has earth/sand floor",null,-0.33496784213391168,null,null,"Persons per sleeping rooms",null,-0.38258779312135655,null,null,"Household member owns: bicycle",null,0.37324312740229271]
[null,null,"Household member owns: bicycle",null,0.3347115310536849,null,null,"Has dung floor",null,-0.33059214002166659,null,null,"Has ceramic tile floor",null,0.32198802326600151]
[null,null,"Household cooks in owm house",null,0.32751642867783426,null,null,"Household member owns: bicycle",null,0.2828946251778075,null,null,"Has earth/sand floor",null,-0.29578323161203224]
[null,null,"Household cooks outside house",null,-0.30499305807613197,null,null,"Has cement floor",null,-0.26865076936435239,null,null,"Has carpet floor",null,0.28532444011986824]
[null,null,"Persons per sleeping rooms",null,-0.28452620784996818,null,null,"Household member owns: land2",null,0.24859244258395891,null,null,"Has cement floor",null,0.27057085086891747]
[null,null,"Has ceramic tile floor",null,0.28279165774349208,null,null,"Household fuel type: wood",null,-0.2461593465177784,null,null,"Persons per sleeping rooms",null,-0.23284400641045502]
[null,null,"Household has: computer",null,0.24545046010648844,null,null,"Household member owns: land",null,0.17752400612968028,null,null,"Household member owns: shop",null,0.19024968752042562]
[null,null,"Household member owns: land",null,-0.18242344915070999,null,null,"Household has: computer",null,0.17417707800449586,null,null,"Household cooks in owm house",null,0.17097486459362887]
[null,null,"Household member owns: shop",null,0.16277576439570465,null,null,"Has vinyl/asphalt strip floor",null,-0.14437327664086394,null,null,"Household cooks outside house",null,-0.16761774625082101]
[null,null,"Household fuel type: kerosene",null,-0.14309232306310596,null,null,"Household member owns: shop",null,0.13927770646682572,null,null,"Has vinyl/asphalt strip floor",null,0.1105483966271395]
[null,null,"Has cement floor",null,0.12439254683636768,null,null,"Household member owns: motorcycle/scooter",null,-0.12049959089794753,null,null,"Household member owns: land",null,0.10739010967288809]
[null,null,"Household cooks in other house",null,-8.9996879423814E-2,null,null,"Has ceramic tile floor",null,0.10117900079992803,null,null,"Household fuel type: kerosene",null,-0.10408143472990534]
[null,null,"Has palm/bamboo floor",null,-8.6353188436597977E-2,null,null,"Has wood floor",null,-9.8542147320597032E-2,null,null,"Has palm/bamboo floor",null,-7.4274408565284236E-2]
[null,null,"Household member owns: motorcycle/scooter",null,6.3412745277925522E-2,null,null,"Household fuel type: electricity",null,-7.3876927075523249E-2,null,null,"Household member owns: motorcycle/scooter",null,6.6710654856134088E-2]
[null,null,"Has vinyl/asphalt strip floor",null,-5.6880184385855868E-2,null,null,"Household member owns: factory",null,7.3829366636613478E-2,null,null,"Household member owns: boat with motor",null,4.922989141264747E-2]
[null,null,"Household member owns: animal drawn cart",null,-4.8239335360532466E-2,null,null,"Household member owns: animal drawn cart",null,7.0449604501323926E-2,null,null,"Household fuel type: animal dung",null,4.094129490138488E-2]
[null,null,"Household member owns: factory",null,2.1496657041406679E-2,null,null,"Household member owns: boat with motor",null,6.7843571648379716E-2,null,null,"Household cooks in other house",null,-2.6043942584308387E-2]
[null,null,"Household fuel type: charcoal",null,-2.082546761813275E-2,null,null,"Household cooks in other house",null,-6.147468854361432E-2,null,null,"Household member owns: land2",null,1.7090997207701901E-2]
[null,null,"Household fuel type: electricity",null,2.0190246792236775E-2,null,null,"Household cooks in owm house",null,4.5607176858207858E-2,null,null,"Household fuel type: charcoal",null,-1.6644533153667807E-2]
[null,null,"Household member owns: boat with motor",null,1.8327277365373658E-2,null,null,"Has parquet/polished wood floor",null,-3.3733932470680357E-2,null,null,"Household member owns: factory",null,1.244738022833659E-2]
[null,null,"Has wood floor",null,-8.5345410467215395E-3,null,null,"Household cooks outside house",null,7.6185972415674843E-3,null,null,"Household member owns: animal drawn cart",null,-1.0611305746945165E-2]
[null,null,"Household fuel type: animal dung",null,6.140730898374594E-3,null,null,null,null,null,null,null,"Has parquet/polished wood floor",null,-9.7106865213969426E-3]
[null,null,"Has parquet/polished wood floor",null,4.5378003681223085E-3,null,null,null,null,null,null,null,"Has wood floor",null,-7.3228040501177247E-3]
[null,null,"Household member owns: land2",null,1.2501281696937973E-3,null,null,null,null,null,null,null,"Household fuel type: electricity",null,2.5512269063464725E-3]
[null,null,null,null,null,null,null,"Communalities"]
[null,null,null,null,null,null,null,null,null,"Extraction"]
[null,null,null,null,null,null,null,"Persons per sleeping rooms",null,0.14637341944546992]
[null,null,"Communalities",null,null,null,null,"Has earth/sand floor",null,0.14674567823567569,null,null,"Communalities"]
[null,null,null,null,"Extraction",null,null,"Has dung floor",null,0.10929116304410522,null,null,null,null,"Extraction"]
[null,null,"Persons per sleeping rooms",null,8.095516295348329E-2,null,null,"Has wood floor",null,9.7105547985542485E-3,null,null,"Persons per sleeping rooms",null,5.4216331321272022E-2]
[null,null,"Has earth/sand floor",null,0.11220345526384917,null,null,"Has parquet/polished wood floor",null,1.1379781999364224E-3,null,null,"Has earth/sand floor",null,8.7487720102857103E-2]
[null,null,"Has dung floor",null,0.22086508854407313,null,null,"Has vinyl/asphalt strip floor",null,2.0843643008019431E-2,null,null,"Has dung floor",null,0.20171144031000829]
[null,null,"Has wood floor",null,7.2838390878174794E-5,null,null,"Has ceramic tile floor",null,1.0237190202871838E-2,null,null,"Has wood floor",null,5.3623459156420551E-5]
[null,null,"Has palm/bamboo floor",null,7.4568731531665985E-3,null,null,"Has cement floor",null,7.2173235880058459E-2,null,null,"Has palm/bamboo floor",null,5.5166877677227683E-3]
[null,null,"Has parquet/polished wood floor",null,2.0591632180930959E-5,null,null,"Has carpet floor",null,0.25343834589137487,null,null,"Has parquet/polished wood floor",null,9.429743271684026E-5]
[null,null,"Has vinyl/asphalt strip floor",null,3.2353553757689616E-3,null,null,"Household fuel type: electricity",null,5.45780035412218E-3,null,null,"Has vinyl/asphalt strip floor",null,1.2220947996831348E-2]
[null,null,"Has ceramic tile floor",null,7.9971121689312363E-2,null,null,"Household fuel type: LPG",null,0.38619920650845463,null,null,"Has ceramic tile floor",null,0.10367628712674713]
[null,null,"Has cement floor",null,1.5473505708437927E-2,null,null,"Household fuel type: kerosene",null,0.3537736696136608,null,null,"Has cement floor",null,7.320858533992998E-2]
[null,null,"Has carpet floor",null,0.23090530490666886,null,null,"Household fuel type: wood",null,6.0594423878059703E-2,null,null,"Has carpet floor",null,8.1410036129716271E-2]
[null,null,"Household fuel type: electricity",null,4.0764606553142735E-4,null,null,"Household cooks in owm house",null,2.0800145809758506E-3,null,null,"Household fuel type: electricity",null,6.5087587276661924E-6]
[null,null,"Household fuel type: LPG",null,0.57527207609248698,null,null,"Household cooks in other house",null,3.7791373315343856E-3,null,null,"Household fuel type: LPG",null,0.4730035979239533]
[null,null,"Household fuel type: kerosene",null,2.0475412919596286E-2,null,null,"Household cooks outside house",null,5.8043023929219683E-5,null,null,"Household fuel type: kerosene",null,1.0832945055435547E-2]
[null,null,"Household fuel type: charcoal",null,4.3370010151389578E-4,null,null,"Household has: electricity",null,0.22406592662916269,null,null,"Household fuel type: charcoal",null,2.7704048390354678E-4]
[null,null,"Household fuel type: wood",null,0.52499869006322597,null,null,"Household has: radio",null,0.18142214418608107,null,null,"Household fuel type: wood",null,0.42610012925242796]
[null,null,"Household fuel type: animal dung",null,3.7708575966252447E-5,null,null,"Household has: television",null,0.26840861567485708,null,null,"Household fuel type: animal dung",null,1.6761896282021635E-3]
[null,null,"Household cooks in owm house",null,0.10726701105388289,null,null,"Household has: mobile telephone",null,0.2053668291256433,null,null,"Household cooks in owm house",null,2.9232404322809727E-2]
[null,null,"Household cooks in other house",null,8.0994383060245152E-3,null,null,"Household has: non-mobile phone",null,0.29097916376119254,null,null,"Household cooks in other house",null,6.7828694533475183E-4]
[null,null,"Household cooks outside house",null,9.3020765474630812E-2,null,null,"Household has: refrigerator",null,0.40925189271192342,null,null,"Household cooks outside house",null,2.8095708858204622E-2]
[null,null,"Household has: electricity",null,0.54102519518962389,null,null,"Household has: fan",null,0.28309473197269031,null,null,"Household has: electricity",null,0.43863347484396442]
[null,null,"Household has: radio",null,0.21795434860043611,null,null,"Household has: computer",null,3.0337654502184237E-2,null,null,"Household has: radio",null,0.22359502645459348]
[null,null,"Household has: television",null,0.58558680519661321,null,null,"Household member owns: bicycle",null,8.0029368954492197E-2,null,null,"Household has: television",null,0.53092566354116]
[null,null,"Household has: mobile telephone",null,0.31643401437566937,null,null,"Household member owns: motorcycle/scooter",null,1.4520151406572718E-2,null,null,"Household has: mobile telephone",null,0.31744079814884157]
[null,null,"Household has: non-mobile phone",null,0.41618351248839291,null,null,"Household member owns: animal drawn cart",null,4.9631467743929602E-3,null,null,"Household has: non-mobile phone",null,0.36027255959608101]
[null,null,"Household has: refrigerator",null,0.57492186877987805,null,null,"Household member owns: car/truck",null,0.18725436907987011,null,null,"Household has: refrigerator",null,0.47388211187780943]
[null,null,"Household has: fan",null,0.50687030924487375,null,null,"Household member owns: boat with motor",null,4.6027502140088324E-3,null,null,"Household has: fan",null,0.43300287558407119]
[null,null,"Household has: computer",null,6.0245928366486873E-2,null,null,"Household member owns: land",null,3.1514772752330764E-2,null,null,"Household has: computer",null,0.1497201774379649]
[null,null,"Household member owns: bicycle",null,0.11203180902030187,null,null,"Household member owns: factory",null,5.4507753779634953E-3,null,null,"Household member owns: bicycle",null,0.13931043215304412]
[null,null,"Household member owns: motorcycle/scooter",null,4.0211762636830654E-3,null,null,"Household member owns: land2",null,6.1798202509858909E-2,null,null,"Household member owns: motorcycle/scooter",null,4.450311471334247E-3]
[null,null,"Household member owns: animal drawn cart",null,2.327033476025918E-3,null,null,"Household member owns: shop",null,1.9398279518659266E-2,null,null,"Household member owns: animal drawn cart",null,1.1259980965515149E-4]
[null,null,"Household member owns: car/truck",null,0.15222579871153658,null,null,null,null,null,null,null,"Household member owns: car/truck",null,0.18375309126586151]
[null,null,"Household member owns: boat with motor",null,3.3588909562733761E-4,null,null,null,null,null,null,null,"Household member owns: boat with motor",null,2.4235822085010611E-3]
[null,null,"Household member owns: land",null,3.3278314800041675E-2,null,null,"Total Variance Explained",null,null,null,null,"Household member owns: land",null,1.1532635655554933E-2]
[null,null,"Household member owns: factory",null,4.6210626395585934E-4,null,null,"Component",null,"Extraction Sums of Squared Loadings",null,null,"Household member owns: factory",null,1.5493727454878465E-4]
[null,null,"Household member owns: land2",null,1.5628204406619636E-6,null,null,null,null,"Total","% of Variance","Cumulative %","Household member owns: land2",null,2.9210218555367418E-4]
[null,null,"Household member owns: shop",null,2.649594947460595E-2,null,null,"1",null,3.8843522791486862,11.770764482268746,11.770764482268746,"Household member owns: shop",null,3.6194943601619595E-2]
[]
[]
[null,null,"Total Variance Explained",null,null,null,null,"Component Score Coefficient Matrix",null,null,null,null,"Total Variance Explained"]
[null,null,"Component",null,"Extraction Sums of Squared Loadings",null,null,null,null,"Component",null,null,"Component",null,"Extraction Sums of Squared Loadings"]
[null,null,null,null,"Total","% of Variance","Cumulative %",null,null,"1",null,null,null,null,"Total","% of Variance","Cumulative %"]
[null,null,"1",null,5.6315733684388718,15.643259356774644,15.643259356774644,"Persons per sleeping rooms",null,-9.8494617796408099E-2,null,null,"1",null,4.8951960913261159,13.59776692035032,13.59776692035032]
[null,null,null,null,null,null,null,"Has earth/sand floor",null,-9.8619784664005325E-2]
[null,null,null,null,null,null,null,"Has dung floor",null,-8.510869155619448E-2]
[null,null,"Component Score Coefficient Matrix",null,null,null,null,"Has wood floor",null,-2.5369003694534629E-2,null,null,"Component Score Coefficient Matrix"]
[null,null,null,null,"Component",null,null,"Has parquet/polished wood floor",null,-8.6845708232399701E-3,null,null,null,null,"Component"]
[null,null,null,null,"1",null,null,"Has vinyl/asphalt strip floor",null,-3.7167915334524057E-2,null,null,null,null,"1"]
[null,null,"Persons per sleeping rooms",null,-5.0523395370207481E-2,null,null,"Has ceramic tile floor",null,2.6047843637421814E-2,null,null,"Persons per sleeping rooms",null,-4.7565818011465442E-2]
[null,null,"Has earth/sand floor",null,-5.948032995737533E-2,null,null,"Has cement floor",null,-6.9162308168205386E-2,null,null,"Has earth/sand floor",null,-6.0423163054925566E-2]
[null,null,"Has dung floor",null,-8.3451431409836851E-2,null,null,"Has carpet floor",null,0.12960374551425963,null,null,"Has dung floor",null,-9.174769703550352E-2]
[null,null,"Has wood floor",null,-1.5154807525995884E-3,null,null,"Household fuel type: electricity",null,-1.9019110978192349E-2,null,null,"Has wood floor",null,-1.4959163869028922E-3]
[null,null,"Has palm/bamboo floor",null,-1.5333758931482403E-2,null,null,"Household fuel type: LPG",null,0.15998787814577475,null,null,"Has palm/bamboo floor",null,-1.5172917934154337E-2]
[null,null,"Has parquet/polished wood floor",null,8.0577843370621531E-4,null,null,"Household fuel type: kerosene",null,-0.15312430947366173,null,null,"Has parquet/polished wood floor",null,-1.9837175754008054E-3]
[null,null,"Has vinyl/asphalt strip floor",null,-1.0100229663104546E-2,null,null,"Household fuel type: wood",null,-6.3372044765138524E-2,null,null,"Has vinyl/asphalt strip floor",null,2.2583037444204153E-2]
[null,null,"Has ceramic tile floor",null,5.0215390840568024E-2,null,null,"Household cooks in owm house",null,1.1741256606160178E-2,null,null,"Has ceramic tile floor",null,6.5776327905747792E-2]
[null,null,"Has cement floor",null,2.2088418049119825E-2,null,null,"Household cooks in other house",null,-1.5826239260947624E-2,null,null,"Has cement floor",null,5.5272729798985315E-2]
[null,null,"Has carpet floor",null,8.5327143865128269E-2,null,null,"Household cooks outside house",null,1.9613558951551155E-3,null,null,"Has carpet floor",null,5.8286621168340859E-2]
[null,null,"Household fuel type: electricity",null,3.5851875615062288E-3,null,null,"Household has: electricity",null,0.12186228004577127,null,null,"Household fuel type: electricity",null,5.2116950143571081E-4]
[null,null,"Household fuel type: LPG",null,0.13468117615254668,null,null,"Household has: radio",null,0.10965451989172807,null,null,"Household fuel type: LPG",null,0.14049540762965762]
[null,null,"Household fuel type: kerosene",null,-2.5408942350825237E-2,null,null,"Household has: television",null,0.13337659194941323,null,null,"Household fuel type: kerosene",null,-2.1261954125663948E-2]
[null,null,"Household fuel type: charcoal",null,-3.6979838946688145E-3,null,null,"Household has: mobile telephone",null,0.11666659928933742,null,null,"Household fuel type: charcoal",null,-3.4001769986621265E-3]
[null,null,"Household fuel type: wood",null,-0.12866172310341628,null,null,"Household has: non-mobile phone",null,0.13887124713878485,null,null,"Household fuel type: wood",null,-0.13334776455132941]
[null,null,"Household fuel type: animal dung",null,1.0904112397414911E-3,null,null,"Household has: refrigerator",null,0.16469360588332888,null,null,"Household fuel type: animal dung",null,8.3635658587670227E-3]
[null,null,"Household cooks in owm house",null,5.8157180462806456E-2,null,null,"Household has: fan",null,0.13697688443995701,null,null,"Household cooks in owm house",null,3.4927071644092506E-2]
[null,null,"Household cooks in other house",null,-1.5980770121576528E-2,null,null,"Household has: computer",null,4.4840700710768018E-2,null,null,"Household cooks in other house",null,-5.3203062958920291E-3]
[null,null,"Household cooks outside house",null,-5.4157699477984274E-2,null,null,"Household member owns: bicycle",null,7.2829291693339432E-2,null,null,"Household cooks outside house",null,-3.4241273101975597E-2]
[null,null,"Household has: electricity",null,0.13061077267749405,null,null,"Household member owns: motorcycle/scooter",null,-3.1021797776888765E-2,null,null,"Household has: electricity",null,0.13529470272603472]
[null,null,"Household has: radio",null,8.2899712179233753E-2,null,null,"Household member owns: animal drawn cart",null,1.8136770158437846E-2,null,null,"Household has: radio",null,9.6596407761104619E-2]
[null,null,"Household has: television",null,0.13588324032776569,null,null,"Household member owns: car/truck",null,0.11140312404397366,null,null,"Household has: television",null,0.14884928944977835]
[null,null,"Household has: mobile telephone",null,9.9887658759136563E-2,null,null,"Household member owns: boat with motor",null,1.746586477559359E-2,null,null,"Household has: mobile telephone",null,0.11509627752818215]
[null,null,"Household has: non-mobile phone",null,0.11455464112587935,null,null,"Household member owns: land",null,4.5702344527975537E-2,null,null,"Household has: non-mobile phone",null,0.12261553548087455]
[null,null,"Household has: refrigerator",null,0.13464017510691467,null,null,"Household member owns: factory",null,1.9006866867593761E-2,null,null,"Household has: refrigerator",null,0.14062581881378836]
[null,null,"Household has: fan",null,0.12642084234992987,null,null,"Household member owns: land2",null,6.3998428751792222E-2,null,null,"Household has: fan",null,0.1344235302892712]
[null,null,"Household has: computer",null,4.3584704317637217E-2,null,null,"Household member owns: shop",null,3.585609554892135E-2,null,null,"Household has: computer",null,7.9044211793396046E-2]
[null,null,"Household member owns: bicycle",null,5.943481672981743E-2,null,null,null,null,null,null,null,"Household member owns: bicycle",null,7.6246818398888805E-2]
[null,null,"Household member owns: motorcycle/scooter",null,1.1260218260372976E-2,null,null,null,null,null,null,null,"Household member owns: motorcycle/scooter",null,1.3627779891052754E-2]
[null,null,"Household member owns: animal drawn cart",null,-8.5658717741086444E-3,null,null,"Component Score Covariance Matrix",null,null,null,null,"Household member owns: animal drawn cart",null,-2.1676977896243062E-3]
[null,null,"Household member owns: car/truck",null,6.9281037738382401E-2,null,null,"Component",null,"1",null,null,"Household member owns: car/truck",null,8.7568363493583629E-2]
[null,null,"Household member owns: boat with motor",null,3.25437957855358E-3,null,null,"1",null,1,null,null,"Household member owns: boat with motor",null,1.005677617284398E-2]
[null,null,"Household member owns: land",null,-3.2392981004752429E-2,null,null,null,null,null,null,null,"Household member owns: land",null,2.1937856557610533E-2]
[null,null,"Household member owns: factory",null,3.8171671813565966E-3,null,null,null,null,null,null,null,"Household member owns: factory",null,2.5427745888244031E-3]
[null,null,"Household member owns: land2",null,2.2198559583719771E-4,null,null,null,null,null,null,null,"Household member owns: land2",null,3.4913815276952313E-3]
[null,null,"Household member owns: shop",null,2.8904136330346299E-2,null,null,null,null,null,null,null,"Household member owns: shop",null,3.8864569257507857E-2]
[]
[]
[null,null,"Component Score Covariance Matrix",null,null,null,null,null,null,null,null,null,"Component Score Covariance Matrix"]
[null,null,"Component",null,"1",null,null,null,null,null,null,null,"Component",null,"1"]
[null,null,"1",null,1,null,null,null,null,null,null,null,"1",null,1]
[]
[]
[]
[]
[]
[]
[]
[]
[]
[]
[]
[]
[]
[]
[]
[]
[]
[]
[]
[]
[]
[]
[]
[]
[]
[]
[]
[]
[]
[]
[]
[]
[]
[]
[]
[]
[]
[]
[]
[]
[]
[]
[]
[]
[]
[]
[]
[]
[]
[]
[]
[]
[]
[]
[]
[]
[]
[]
[]
[]
[]
[]
[]
[]
[]
[]
[]
[]
[]
[]
[]
[]
[]
[]
[]
[]
[]
[]
[]
[]
[]
[]
[]
[]
[]
[]
[]
[]
[]
[]
[]
[]
[]
[]
[]
[]
[]
[]
[]
[]
[]
[]
[]
[]
[]
[]
[]
[]
[]
[]
[]
[]
[]
[]
[]
[]
[]
[]
[]
[]
[]
[]
[]
[]
[]
[]
[]
[]
[]
[]
[]
[]
[]
[]
[]
[]
[]
[]
[]
[]
[]
[]
[]
[]
[]
[]
[]
[]
[]
[]
[]
[]
[]
[]
[]
[]
[]
[]
[]
[]
[]
[]
[]
[]
[]
[]
[]
[]
[]
[]
[]
[]
[]
[]
[]
[]
[]
[]
[]
[]
[]
[]
[]
[]
[]
[]
[]
[]
[]
[]
[]
[]
[]
[]
[]
[]
[]
[]
[]
[]
[]
[]
[]
[]
[]
[]
[]
[]
[]
[]
[]
[]
[]
[]
[]
[]
[]
[]
[]
[]
[]
[]
[]
[]
[]
[]
[]
[]
[]
[]
[]
[]
[]
[]
[]
[]
[]
[]
[]
[]
[]
[]
[]
[]
[]
[]
[]
[]
[]
[]
[]
[]
[]
[]
[]
[]
[]
[]
[]
[]
[]
[]
[]
[]
[]
[]
[]
[]
[]
[]
[]
[]
[]
[]
[]
[]
[]
[]
[]
[]
[]
[]
[]
[]
[]
[]
[]
[]
[]
[]
[]
[]
[]
[]
[]
[]
[]
[]
[]
[]
[]
[]
[]
[]
[]
[]
[]
[]
[]
[]
[]
[]
[]
[]
[]
[]
[]
[]
[]
[]
[]
[]
[]
[]
[]
[]
[]
[]
[]
[]
[]
[]
[]
[]
[]
[]
[]
[]
[]
[]
[]
[]
[]
[]
[]
[]
[]
[]
[]
[]
[]
[]
[]
[]
[]
[]
[]
[]
[]
[]
[]
[]
[]
[]
[]
[]
[]
[]
[]
[]
[]
[]
[]
[]
[]
[]
[]
[]
[]
[]
[]
[]
[]
[]
[]
[]
[]
[]
[]
[]
[]
[]
[]
[]
[]
[]
[]
[]
[]
[]
[]
[]
[]
[]
[]
[]
[]
[]
[]
[]
[]
[]
[]
[]
[]
[]
[]
[]
[]
[]
[]
[]
[]
[]
[]
[]
[]
[]
[]
[]
[]
[]
[]
[]
[]
[]
[]
[]
[]
[]
[]
[]
[]
[]
[]
[]
[]
[]
[]
[]
[]
[]
[]
[]
[]
[]
[]
[]
[]
[]
[]
[]
[]
[]
[]
[]
[]
[]
[]
[]
[]
[]
[]
[]
[]
[]
[]
[]
[]
[]
[]
[]
[]
[]
[]
[]
[]
[]
[]
[]
[]
[]
[]
["MICS06"]
["Yemen",null,"Count"]
["W_text_t","",3586]
["W_text_i","",3586]
["S_text_s","",3586]
["S_text_i","",3586]
["Urban/Rural","Urban",1055]
[null,"Rural",2531]
[null,"Missing",0]
["2006"]
[]
["Sub-national region names","Weighted population"]
[{"$f":"R15","v":"Abyan"},{"$f":"BR122+BR123","v":516.08425088971433}]
[{"$f":"S15","v":"Aden"},{"$f":"BS122+BS123","v":854.00415731602095}]
[{"$f":"T15","v":"Al Baidhah"},{"$f":"BT122+BT123","v":680.26567242262217}]
[{"$f":"U15","v":"Al Dala'a"},{"$f":"BU122+BU123","v":547.30670067569054}]
[{"$f":"V15","v":"Al Hodeidah"},{"$f":"BV122+BV123","v":2669.7536907478152}]
[{"$f":"W15","v":"Al Jawf"},{"$f":"BW122+BW123","v":457.81864637822957}]
[{"$f":"X15","v":"Al Maharah"},{"$f":"BX122+XR123","v":81.962576707595815}]
[{"$f":"Y15","v":"Al Mahweet"},{"$f":"BY122+BY123","v":731.00709305624468}]
[{"$f":"Z15","v":"Amran"},{"$f":"BZ122+BZ123","v":777.672456109314}]
[{"$f":"AA15","v":"Dhamar"},{"$f":"CA122+CA123","v":2633.3432207283786}]
[{"$f":"AB15","v":"Hadramout"},{"$f":"CB122+CB123","v":1399.5917378790336}]
[{"$f":"AC15","v":"Hajjah"},{"$f":"CC122+CC123","v":1590.394734226343}]
[{"$f":"AD15","v":"Ibb"},{"$f":"CD122+CD123","v":3265.7168853512162}]
[{"$f":"AE15","v":"Lahej"},{"$f":"CE122+CE123","v":889.4411655343963}]
[{"$f":"AF15","v":"Mareb"},{"$f":"CF122+CF123","v":215.57510672575896}]
[{"$f":"AG15","v":"Raimah"},{"$f":"CG122+CG123","v":458.15449360053617}]
[{"$f":"AH15","v":"Sa'adah"},{"$f":"CH122+CH123","v":780.89861553377068}]
[{"$f":"AI15","v":"Sana'a"},{"$f":"CI122+CI123","v":1211.6511228269228}]
[{"$f":"AJ15","v":"Sana'a City"},{"$f":"CJ122+CJ123","v":2337.3267242174616}]
[{"$f":"AK15","v":"Shabwah"},{"$f":"CK122+CK123","v":445.65721852752085}]
[{"$f":"AL15","v":"Taiz"},{"$f":"CL122+CL123","v":3542.2676142481987}]
[{"$f":"AM15","v":0},{"$f":"CM122+CM123","v":0}]
[{"$f":"AN15","v":0},{"$f":"CN122+CN123","v":0}]
[{"$f":"AO15","v":0},{"$f":"CO122+CO123","v":0}]
[{"$f":"AP15","v":0},{"$f":"CP122+CP123","v":0}]
[{"$f":"AQ15","v":0},{"$f":"CQ122+CQ123","v":0}]
[{"$f":"AR15","v":0},{"$f":"CR122+CR123","v":0}]
[{"$f":"AS15","v":0},{"$f":"CS122+CS123","v":0}]
[{"$f":"AT15","v":0},{"$f":"CT122+CT123","v":0}]
[{"$f":"AU15","v":0},{"$f":"CU122+CU123","v":0}]
[{"$f":"AV15","v":0},{"$f":"CV122+CV123","v":0}]
[{"$f":"AW15","v":0},{"$f":"CW122+CW123","v":0}]
[{"$f":"AX15","v":0},{"$f":"CX122+CX123","v":0}]
[{"$f":"AY15","v":0},{"$f":"CY122+CY123","v":0}]
[]
[{"$f":"34-COUNTIF(A1037:A1071,\"0\")","v":21},"Sub-regions"]

{"sheet":"DHS13","index":5,"n_rows":1072,"n_cols":90,"rows_kept":1072,"cut":false,"hidden":false,"merged":[[346,52,347,52],[348,52,349,52],[350,52,351,52],[352,52,353,52],[152,52,159,52],[230,52,236,52],[270,52,272,52],[273,52,275,52],[276,52,283,52],[338,54,338,58],[338,59,338,63],[338,64,338,68],[340,52,341,52],[342,52,343,52],[344,52,345,52],[221,52,223,52],[224,52,225,52],[226,52,229,52],[258,54,258,58],[258,59,258,63],[258,64,258,68],[260,52,262,52],[263,52,266,52],[267,52,269,52],[119,64,119,68],[121,52,122,52],[123,52,126,52],[127,52,128,52],[132,54,132,58],[132,59,132,63],[132,64,132,68],[134,52,138,52],[219,54,219,58],[219,59,219,63],[219,64,219,68],[13,64,13,68],[15,52,16,52],[17,52,20,52],[21,52,22,52],[26,54,26,58],[26,59,26,63],[26,64,26,68],[40,52,41,52],[55,54,55,58],[55,59,55,63],[55,64,55,68],[139,52,142,52],[143,0,146,0],[143,52,146,52],[147,0,149,0],[147,52,149,52],[150,0,151,0],[150,52,151,52],[13,54,13,58],[13,59,13,63],[119,54,119,58],[119,59,119,63],[42,52,43,52],[44,52,45,52],[46,0,48,0],[46,52,48,52],[49,0,51,0],[49,52,51,52],[52,0,54,0],[52,52,54,52],[32,52,33,52],[34,52,35,52],[36,52,37,52],[38,0,39,0],[38,52,39,52],[13,2,13,6],[13,7,13,11],[28,52,29,52],[30,0,31,0],[30,52,31,52],[26,2,26,6],[26,7,26,11],[26,12,26,16],[13,12,13,16],[15,0,16,0],[17,0,20,0],[21,0,22,0],[23,0,25,0],[32,0,33,0],[55,2,55,6],[55,7,55,11],[55,12,55,16],[28,0,29,0],[34,0,35,0],[36,0,37,0],[40,0,41,0],[42,0,43,0],[44,0,45,0],[139,0,142,0],[119,7,119,11],[119,12,119,16],[57,0,68,0],[107,0,107,1],[121,0,122,0],[123,0,126,0],[127,0,128,0],[129,0,131,0],[132,2,132,6],[119,2,119,6],[132,7,132,11],[132,12,132,16],[134,0,138,0],[152,0,158,0],[201,0,203,0],[207,0,207,1],[219,2,219,6],[219,7,219,11],[1025,0,1025,1],[1030,0,1032,0],[1033,0,1033,2],[219,12,219,16],[221,0,223,0],[224,0,229,0],[398,2,398,5],[398,7,398,10],[398,12,398,15],[399,2,399,4],[399,7,399,9],[399,12,399,14],[1024,0,1024,2],[400,2,401,3],[400,7,401,8],[400,12,401,13],[401,1,444,1],[402,2,402,3],[402,7,402,8],[402,12,402,13],[403,2,403,3],[403,7,403,8],[403,12,403,13],[406,2,406,3],[406,7,406,8],[406,12,406,13],[407,2,407,3],[407,7,407,8],[407,12,407,13],[404,2,404,3],[404,7,404,8],[404,12,404,13],[405,2,405,3],[405,7,405,8],[405,12,405,13],[410,2,410,3],[410,7,410,8],[410,12,410,13],[411,2,411,3],[411,7,411,8],[411,12,411,13],[408,2,408,3],[408,7,408,8],[408,12,408,13],[409,2,409,3],[409,7,409,8],[409,12,409,13],[414,2,414,3],[414,7,414,8],[414,12,414,13],[415,2,415,3],[415,7,415,8],[415,12,415,13],[412,2,412,3],[412,7,412,8],[412,12,412,13],[413,2,413,3],[413,7,413,8],[413,12,413,13],[418,2,418,3],[418,7,418,8],[418,12,418,13],[419,2,419,3],[419,7,419,8],[419,12,419,13],[416,2,416,3],[416,7,416,8],[416,12,416,13],[417,2,417,3],[417,7,417,8],[417,12,417,13],[422,2,422,3],[422,7,422,8],[422,12,422,13],[423,2,423,3],[423,7,423,8],[423,12,423,13],[420,2,420,3],[420,7,420,8],[420,12,420,13],[421,2,421,3],[421,7,421,8],[421,12,421,13],[426,2,426,3],[426,7,426,8],[426,12,426,13],[427,2,427,3],[427,7,427,8],[427,12,427,13],[424,2,424,3],[424,7,424,8],[424,12,424,13],[425,2,425,3],[425,7,425,8],[425,12,425,13],[430,2,430,3],[430,7,430,8],[430,12,430,13],[431,2,431,3],[431,7,431,8],[431,12,431,13],[428,2,428,3],[428,7,428,8],[428,12,428,13],[429,2,429,3],[429,7,429,8],[429,12,429,13],[434,2,434,3],[434,7,434,8],[434,12,434,13],[435,2,435,3],[435,7,435,8],[435,12,435,13],[432,2,432,3],[432,7,432,8],[432,12,432,13],[433,2,433,3],[433,7,433,8],[433,12,433,13],[438,2,438,3],[438,7,438,8],[438,12,438,13],[439,2,439,3],[439,7,439,8],[439,12,439,13],[436,2,436,3],[436,7,436,8],[436,12,436,13],[437,2,437,3],[437,7,437,8],[437,12,437,13],[442,2,442,3],[442,7,442,8],[442,12,442,13],[443,2,443,3],[443,7,443,8],[443,12,443,13],[440,2,440,3],[440,7,440,8],[440,12,440,13],[441,2,441,3],[441,7,441,8],[441,12,441,13],[446,2,446,3],[446,7,446,8],[446,12,446,13],[447,2,447,3],[447,7,447,8],[447,12,447,13],[444,2,444,3],[444,7,444,8],[444,12,444,13],[445,2,445,3],[445,7,445,8],[445,12,445,13],[450,2,450,3],[450,7,450,8],[450,12,450,13],[451,2,451,3],[451,7,451,8],[451,12,451,13],[448,2,448,3],[448,7,448,8],[448,12,448,13],[449,2,449,3],[449,7,449,8],[449,12,449,13],[454,2,454,4],[454,7,454,8],[454,12,454,13],[455,2,455,3],[455,7,455,8],[455,12,455,13],[452,2,452,3],[452,7,452,8],[452,12,452,13],[453,2,453,3],[453,7,453,8],[453,12,453,13],[458,2,458,3],[458,7,458,8],[458,12,458,13],[459,2,459,3],[459,7,459,8],[459,12,459,13],[456,2,456,3],[456,7,456,8],[456,12,456,13],[457,2,457,3],[457,7,457,8],[457,12,457,13],[462,2,462,3],[462,7,462,8],[462,12,462,13],[463,2,463,3],[463,7,463,8],[463,12,463,13],[460,2,460,3],[460,7,460,8],[460,12,460,13],[461,2,461,3],[461,7,461,8],[461,12,461,13],[466,2,466,3],[466,7,466,8],[466,12,466,13],[467,2,467,3],[467,7,467,8],[467,12,467,13],[464,2,464,3],[464,7,464,8],[464,12,464,13],[465,2,465,3],[465,7,465,8],[465,12,465,13],[470,2,470,3],[470,7,470,8],[470,12,470,13],[471,2,471,3],[471,7,471,8],[471,12,471,13],[468,2,468,3],[468,7,468,8],[468,12,468,13],[469,2,469,3],[469,7,469,8],[469,12,469,13],[474,2,474,3],[474,7,474,8],[474,12,474,13],[475,2,475,3],[475,7,475,8],[475,12,475,13],[472,2,472,3],[472,7,472,8],[472,12,472,13],[473,2,473,3],[473,7,473,8],[473,12,473,13],[478,2,478,3],[478,7,478,8],[478,12,478,13],[479,2,479,3],[479,7,479,8],[479,12,479,14],[476,2,476,3],[476,7,476,8],[476,12,476,13],[477,2,477,3],[477,7,477,9],[477,12,477,13],[482,2,482,3],[482,7,482,8],[482,12,482,13],[483,2,483,3],[483,7,483,8],[483,12,483,13],[480,2,480,3],[480,7,480,8],[480,12,480,13],[481,2,481,3],[481,7,481,8],[481,12,481,13],[486,2,486,3],[486,7,486,8],[486,12,486,13],[487,2,487,3],[487,7,487,8],[487,12,487,13],[484,2,484,3],[484,7,484,8],[484,12,484,13],[485,2,485,3],[485,7,485,8],[485,12,485,13],[490,2,490,3],[490,7,490,8],[490,12,490,13],[491,2,491,3],[491,7,491,8],[491,12,491,13],[488,2,488,3],[488,7,488,8],[488,12,488,13],[489,2,489,3],[489,7,489,8],[489,12,489,13],[494,2,494,3],[494,7,494,8],[494,12,494,13],[495,2,495,3],[495,7,495,8],[495,12,495,13],[492,2,492,3],[492,7,492,8],[492,12,492,13],[493,2,493,3],[493,7,493,8],[493,12,493,13],[498,2,498,3],[498,7,498,8],[498,12,498,13],[499,2,499,3],[499,7,499,8],[499,12,499,13],[496,2,496,3],[496,7,496,8],[496,12,496,13],[497,2,497,3],[497,7,497,8],[497,12,497,13],[502,2,502,3],[502,7,502,8],[502,12,502,13],[503,2,503,3],[503,7,503,8],[503,12,503,13],[500,2,500,3],[500,7,500,8],[500,12,500,13],[501,2,501,3],[501,7,501,8],[501,12,501,13],[506,2,506,3],[506,7,506,8],[506,12,506,13],[507,2,507,6],[507,7,507,8],[507,12,507,13],[504,2,504,3],[504,7,504,8],[504,12,504,13],[505,2,505,3],[505,7,505,8],[505,12,505,13],[510,2,510,3],[510,7,510,8],[510,12,510,13],[511,2,511,3],[511,7,511,8],[511,12,511,13],[508,2,509,3],[508,4,508,6],[508,7,508,8],[508,12,508,13],[509,7,509,8],[509,12,509,13],[514,2,515,3],[514,7,514,8],[514,12,514,13],[515,7,515,8],[515,12,515,13],[516,2,516,3],[516,7,516,8],[516,12,516,13],[512,2,512,3],[512,7,512,8],[512,12,512,13],[513,2,513,4],[513,7,513,8],[513,12,513,13],[519,2,519,3],[519,7,519,8],[519,12,519,13],[520,2,520,3],[520,7,520,8],[520,12,520,13],[517,2,517,3],[517,7,517,8],[517,12,517,13],[518,2,518,3],[518,7,518,8],[518,12,518,13],[523,2,523,3],[523,7,523,8],[523,12,523,13],[524,2,524,3],[524,7,524,8],[524,12,524,13],[521,2,521,3],[521,7,521,8],[521,12,521,13],[522,2,522,3],[522,7,522,8],[522,12,522,13],[527,2,527,3],[527,7,527,8],[527,12,527,13],[528,2,528,3],[528,7,528,8],[528,12,528,13],[525,2,525,3],[525,7,525,8],[525,12,525,13],[526,2,526,3],[526,7,526,8],[526,12,526,13],[531,2,531,3],[531,7,531,8],[531,12,531,13],[532,2,532,3],[532,7,532,8],[532,12,532,13],[529,2,529,3],[529,7,529,8],[529,12,529,13],[530,2,530,3],[530,7,530,8],[530,12,530,13],[535,2,535,3],[535,7,535,8],[535,12,535,13],[536,2,536,3],[536,7,536,8],[536,12,536,13],[533,2,533,3],[533,7,533,8],[533,12,533,13],[534,2,534,3],[534,7,534,8],[534,12,534,13],[539,2,539,3],[539,7,539,8],[539,12,539,13],[540,2,540,3],[540,7,540,8],[540,12,540,13],[537,2,537,3],[537,7,537,8],[537,12,537,13],[538,2,538,3],[538,7,538,8],[538,12,538,13],[543,2,543,3],[543,7,543,8],[543,12,543,13],[544,2,544,3],[544,7,544,8],[544,12,544,13],[541,2,541,3],[541,7,541,8],[541,12,541,13],[542,2,542,3],[542,7,542,8],[542,12,542,13],[547,2,547,3],[547,7,547,8],[547,12,547,13],[548,2,548,3],[548,7,548,8],[548,12,548,13],[545,2,545,3],[545,7,545,8],[545,12,545,13],[546,2,546,3],[546,7,546,8],[546,12,546,13],[551,2,551,3],[551,7,551,8],[551,12,551,13],[552,2,552,3],[552,7,552,8],[552,12,552,13],[549,2,549,3],[549,7,549,8],[549,12,549,13],[550,2,550,3],[550,7,550,8],[550,12,550,13],[553,2,553,3],[553,7,553,11],[553,12,553,13],[554,2,554,3],[554,7,555,8],[554,9,554,11],[554,12,554,13],[555,2,555,3],[555,12,555,13],[558,14,558,16],[559,2,559,3],[559,7,559,9],[556,2,556,3],[556,7,556,8],[556,12,556,13],[557,2,557,3],[557,7,557,8],[557,12,557,16],[560,2,560,3],[560,7,561,8],[560,12,560,13],[561,2,561,3],[561,12,561,13],[562,2,562,3],[562,7,562,8],[562,12,562,13],[558,2,558,3],[558,7,558,8],[558,12,559,13],[566,2,566,3],[566,7,566,8],[566,12,566,13],[567,2,567,4],[567,7,567,8],[567,12,567,13],[563,2,563,3],[563,7,563,8],[563,12,563,14],[564,2,564,3],[564,7,564,8],[564,12,565,13],[565,2,565,3],[565,7,565,8],[570,2,570,3],[570,7,570,8],[570,12,570,13],[571,2,571,3],[571,7,571,8],[571,12,571,13],[568,2,568,3],[568,7,568,8],[568,12,568,13],[569,2,569,3],[569,7,569,8],[569,12,569,13],[574,2,574,3],[574,7,574,8],[574,12,574,13],[575,2,575,3],[575,7,575,8],[575,12,575,13],[572,2,572,3],[572,7,572,8],[572,12,572,13],[573,2,573,3],[573,7,573,8],[573,12,573,13],[578,2,578,3],[578,7,578,8],[578,12,578,13],[579,2,579,3],[579,7,579,8],[579,12,579,13],[576,2,576,3],[576,7,576,8],[576,12,576,13],[577,2,577,3],[577,7,577,8],[577,12,577,13],[582,2,582,3],[582,7,582,8],[582,12,582,13],[583,2,583,3],[583,7,583,8],[583,12,583,13],[580,2,580,3],[580,7,580,8],[580,12,580,13],[581,2,581,3],[581,7,581,8],[581,12,581,13],[586,2,586,3],[586,7,586,8],[586,12,586,13],[587,2,587,3],[587,7,587,8],[587,12,587,13],[584,2,584,3],[584,7,584,8],[584,12,584,13],[585,2,585,3],[585,7,585,8],[585,12,585,13],[590,2,590,3],[590,7,590,8],[590,12,590,13],[591,2,591,3],[591,7,591,8],[591,12,591,13],[588,2,588,3],[588,7,588,8],[588,12,588,13],[589,2,589,3],[589,7,589,8],[589,12,589,13],[594,2,594,3],[594,7,594,8],[594,12,594,13],[595,2,595,3],[595,7,595,8],[595,12,595,13],[592,2,592,3],[592,7,592,8],[592,12,592,13],[593,2,593,3],[593,7,593,8],[593,12,593,13],[598,2,598,3],[598,7,598,8],[598,12,598,13],[599,2,599,3],[599,7,599,8],[599,12,599,13],[596,2,596,3],[596,7,596,8],[596,12,596,13],[597,2,597,3],[597,7,597,8],[597,12,597,13],[602,2,602,3],[602,7,602,8],[602,12,602,13],[603,2,603,3],[603,7,603,8],[603,12,603,13],[600,2,600,3],[600,7,600,8],[600,12,600,13],[601,2,601,3],[601,7,601,8],[601,12,601,13],[606,2,606,3],[606,7,606,8],[606,12,606,13],[607,2,607,3],[607,7,607,8],[607,12,607,13],[604,2,604,3],[604,7,604,8],[604,12,604,13],[605,2,605,3],[605,7,605,8],[605,12,605,13],[610,2,610,3],[610,7,610,8],[610,12,610,13],[611,2,611,3],[611,7,611,8],[611,12,611,13],[608,2,608,3],[608,7,608,8],[608,12,608,13],[609,2,609,3],[609,7,609,8],[609,12,609,13],[614,2,614,3],[614,7,614,8],[614,12,614,13],[615,2,615,3],[615,7,615,8],[615,12,615,13],[612,2,612,3],[612,7,612,8],[612,12,612,13],[613,2,613,3],[613,7,613,8],[613,12,613,13],[618,2,618,3],[618,7,618,8],[618,12,618,13],[619,2,619,3],[619,7,619,8],[619,12,619,13],[616,2,616,3],[616,7,616,8],[616,12,616,13],[617,2,617,3],[617,7,617,8],[617,12,617,13],[622,2,622,3],[622,7,622,8],[622,12,622,13],[623,2,623,3],[623,7,623,8],[623,12,623,13],[620,2,620,3],[620,7,620,8],[620,12,620,13],[621,2,621,3],[621,7,621,8],[621,12,621,13],[626,2,626,3],[626,7,626,8],[626,12,626,13],[627,2,627,3],[627,7,627,8],[627,12,627,13],[624,2,624,3],[624,7,624,8],[624,12,624,13],[625,2,625,3],[625,7,625,8],[625,12,625,13],[630,2,630,3],[630,7,630,8],[630,12,630,13],[631,2,631,3],[631,7,631,8],[631,12,631,13],[628,2,628,3],[628,7,628,8],[628,12,628,13],[629,2,629,3],[629,7,629,8],[629,12,629,13],[634,2,634,3],[634,7,634,8],[634,12,634,13],[635,2,635,3],[635,7,635,8],[635,12,635,13],[632,2,632,3],[632,7,632,8],[632,12,632,13],[633,2,633,3],[633,7,633,8],[633,12,633,13],[638,2,638,3],[638,7,638,8],[638,12,638,13],[639,2,639,3],[639,7,639,8],[639,12,639,13],[636,2,636,3],[636,7,636,9],[636,12,636,13],[637,2,637,3],[637,7,637,8],[637,12,637,13],[642,2,642,3],[642,7,642,8],[642,12,642,14],[643,2,643,3],[643,7,643,8],[643,12,643,13],[640,2,640,3],[640,7,640,8],[640,12,640,13],[641,2,641,3],[641,7,641,8],[641,12,641,13],[646,2,646,3],[646,7,646,8],[646,12,646,13],[647,2,647,3],[647,7,647,8],[647,12,647,13],[644,2,644,3],[644,7,644,8],[644,12,644,13],[645,2,645,3],[645,7,645,8],[645,12,645,13],[650,2,650,3],[650,7,650,8],[650,12,650,13],[651,2,651,3],[651,7,651,8],[651,12,651,13],[648,2,648,3],[648,7,648,8],[648,12,648,13],[649,2,649,3],[649,7,649,8],[649,12,649,13],[654,2,654,3],[654,7,654,8],[654,12,654,13],[655,2,655,3],[655,7,655,8],[655,12,655,13],[652,2,652,3],[652,7,652,8],[652,12,652,13],[653,2,653,3],[653,7,653,8],[653,12,653,13],[658,2,658,3],[658,7,658,8],[658,12,658,13],[659,2,659,3],[659,7,659,8],[659,12,659,13],[656,2,656,3],[656,7,656,8],[656,12,656,13],[657,2,657,3],[657,7,657,8],[657,12,657,13],[662,2,662,3],[662,7,662,8],[662,12,662,13],[663,2,663,3],[663,7,663,8],[663,12,663,13],[660,2,660,3],[660,7,660,8],[660,12,660,13],[661,2,661,3],[661,7,661,8],[661,12,661,13],[666,2,666,3],[666,7,666,8],[666,12,666,13],[667,2,667,3],[667,7,667,8],[667,12,667,13],[664,2,664,3],[664,7,664,8],[664,12,664,13],[665,2,665,3],[665,7,665,8],[665,12,665,13],[670,2,670,3],[670,7,670,8],[670,12,670,13],[671,2,671,3],[671,7,671,8],[671,12,671,13],[668,2,668,3],[668,7,668,8],[668,12,668,13],[669,2,669,3],[669,7,669,8],[669,12,669,13],[674,2,674,3],[674,7,674,8],[674,12,674,13],[675,2,675,3],[675,7,675,8],[675,12,675,13],[672,2,672,3],[672,7,672,8],[672,12,672,13],[673,2,673,3],[673,7,673,8],[673,12,673,13],[678,2,678,3],[678,7,678,8],[678,12,678,13],[679,2,679,3],[679,7,679,8],[679,12,679,13],[676,2,676,3],[676,7,676,8],[676,12,676,13],[677,2,677,3],[677,7,677,8],[677,12,677,13],[693,12,693,13],[682,2,682,3],[682,7,682,8],[682,12,682,13],[683,2,683,3],[683,7,683,8],[683,12,683,13],[680,2,680,3],[680,7,680,8],[680,12,680,13],[681,2,681,3],[681,7,681,8],[681,12,681,13],[686,2,686,3],[686,7,686,8],[686,12,686,13],[687,2,687,3],[687,7,687,8],[687,12,687,13],[684,2,684,3],[684,7,684,8],[684,12,684,13],[685,2,685,3],[685,7,685,8],[685,12,685,13],[698,2,698,3],[698,7,698,8],[698,12,698,13],[696,2,696,3],[696,7,696,8],[696,12,696,13],[697,2,697,3],[697,7,697,8],[697,12,697,13],[690,2,690,3],[690,7,690,8],[690,12,690,13],[691,2,691,3],[691,7,691,8],[691,12,691,13]],"merged_total":1017,"flags":["merged_cut"]}
[]
[{"$f":"A1026","v":"Yemen"}]
[{"$f":"A1034","v":"2013"}]
["Use of drinking water sources"]
[" by wealth quintile and sub-national region"]
["Notes:"]
["WHO/UNICEF JMP customised wealth index excludes water,"]
[" sanitation and hygiene assets."]
["Survey used for analysis:",{"$f":"A1025","v":"DHS13"}]
["Improved wells+springs based on:","MICS06"]
["Time to improved source based on:","MICS06"]
[]
[]
["Use of drinking water sources",null,"NATIONAL wealth index quintile",null,null,null,null,"URBAN wealth index quintile",null,null,null,null,"RURAL wealth index quintile",null,null,null,null,"SUB-REGIONS:",null,null,null,null,null,null,null,null,null,null,null,null,null,null,null,null,null,null,null,null,null,null,null,null,null,null,null,null,null,null,null,null,null,null,"Raw numbers of respondents:","Use of drinking water sources","NATIONAL wealth index quintile",null,null,null,null,"URBAN wealth index quintile",null,null,null,null,"RURAL wealth index quintile",null,null,null,null,"SUB-REGIONS:"]
["Weighted percentage (used in graphs)",null,"Poorest","Poor","Middle","Rich","Richest","Poorest","Poor","Middle","Rich","Richest","Poorest","Poor","Middle","Rich","Richest","Abyan","Aden","Al-Baidha","Al-Hodiedah","Al-Jawf","Al-Mhrah","Al-Mhweit","Aldhalae","Amran","Dhamar","Hadramout","Hajjah","Ibb","lahj","Mareb","Reimah","Sadah","Sanaa","Sanaa City","Shabwah","Taiz",null,null,null,null,null,null,null,null,null,null,null,null,null,null,"Water data, raw numbers (weighted)",null,"Poorest","Poor","Middle","Rich","Richest","Poorest","Poor","Middle","Rich","Richest","Poorest","Poor","Middle","Rich","Richest","Abyan","Aden","Al-Baidha","Al-Hodiedah","Al-Jawf","Al-Mhrah","Al-Mhweit","Aldhalae","Amran","Dhamar","Hadramout","Hajjah","Ibb","lahj","Mareb","Reimah","Sadah","Sanaa","Sanaa City","Shabwah","Taiz"]
["Water","Improved",{"$f":"C58+C59+C60+C63+C65+C66+C67+C68+C61*MICS06!C24/100+C62*MICS06!C25/100","v":54.973607143548818},{"$f":"D58+D59+D60+D63+D65+D66+D67+D68+D61*MICS06!D24/100+D62*MICS06!D25/100","v":71.32375216363711},{"$f":"E58+E59+E60+E63+E65+E66+E67+E68+E61*MICS06!E24/100+E62*MICS06!E25/100","v":85.189202231080188},{"$f":"F58+F59+F60+F63+F65+F66+F67+F68+F61*MICS06!F24/100+F62*MICS06!F25/100","v":95.998713382289139},{"$f":"G58+G59+G60+G63+G65+G66+G67+G68+G61*MICS06!G24/100+G62*MICS06!G25/100","v":98.889536652449166},{"$f":"H58+H59+H60+H63+H65+H66+H67+H68+H61*MICS06!H24/100+H62*MICS06!H25/100","v":97.870597203634574},{"$f":"I58+I59+I60+I63+I65+I66+I67+I68+I61*MICS06!I24/100+I62*MICS06!I25/100","v":99.34513453271552},{"$f":"J58+J59+J60+J63+J65+J66+J67+J68+J61*MICS06!J24/100+J62*MICS06!J25/100","v":99.756051063704632},{"$f":"K58+K59+K60+K63+K65+K66+K67+K68+K61*MICS06!K24/100+K62*MICS06!K25/100","v":99.768894880059477},{"$f":"L58+L59+L60+L63+L65+L66+L67+L68+L61*MICS06!L24/100+L62*MICS06!L25/100","v":99.590292615840696},{"$f":"M58+M59+M60+M63+M65+M66+M67+M68+M61*MICS06!M24/100+M62*MICS06!M25/100","v":53.711727955177018},{"$f":"N58+N59+N60+N63+N65+N66+N67+N68+N61*MICS06!N24/100+N62*MICS06!N25/100","v":62.893019579638931},{"$f":"O58+O59+O60+O63+O65+O66+O67+O68+O61*MICS06!O24/100+O62*MICS06!O25/100","v":76.171219345678523},{"$f":"P58+P59+P60+P63+P65+P66+P67+P68+P61*MICS06!P24/100+P62*MICS06!P25/100","v":82.284846193604992},{"$f":"Q58+Q59+Q60+Q63+Q65+Q66+Q67+Q68+Q61*MICS06!Q24/100+Q62*MICS06!Q25/100","v":93.109727581319916},{"$f":"R58+R59+R60+R63+R65+R66+R67+R68+R61*MICS06!R24/100+R62*MICS06!R25/100","v":86.279830993183978},{"$f":"S58+S59+S60+S63+S65+S66+S67+S68+S61*MICS06!S24/100+S62*MICS06!S25/100","v":99.577722839354323},{"$f":"T58+T59+T60+T63+T65+T66+T67+T68+T61*MICS06!T24/100+T62*MICS06!T25/100","v":81.147375676441015},{"$f":"U58+U59+U60+U63+U65+U66+U67+U68+U61*MICS06!U24/100+U62*MICS06!U25/100","v":95.166213569266006},{"$f":"V58+V59+V60+V63+V65+V66+V67+V68+V61*MICS06!V24/100+V62*MICS06!V25/100","v":85.506612984397108},{"$f":"W58+W59+W60+W63+W65+W66+W67+W68+W61*MICS06!W24/100+W62*MICS06!W25/100","v":87.020667161028811},{"$f":"X58+X59+X60+X63+X65+X66+X67+X68+X61*MICS06!X24/100+X62*MICS06!X25/100","v":73.69950630114063},{"$f":"Y58+Y59+Y60+Y63+Y65+Y66+Y67+Y68+Y61*MICS06!Y24/100+Y62*MICS06!Y25/100","v":84.561663130305092},{"$f":"Z58+Z59+Z60+Z63+Z65+Z66+Z67+Z68+Z61*MICS06!Z24/100+Z62*MICS06!Z25/100","v":72.473602249466396},{"$f":"AA58+AA59+AA60+AA63+AA65+AA66+AA67+AA68+AA61*MICS06!AA24/100+AA62*MICS06!AA25/100","v":72.217365243124021},{"$f":"AB58+AB59+AB60+AB63+AB65+AB66+AB67+AB68+AB61*MICS06!AB24/100+AB62*MICS06!AB25/100","v":90.958152577032848},{"$f":"AC58+AC59+AC60+AC63+AC65+AC66+AC67+AC68+AC61*MICS06!AC24/100+AC62*MICS06!AC25/100","v":55.660961915833056},{"$f":"AD58+AD59+AD60+AD63+AD65+AD66+AD67+AD68+AD61*MICS06!AD24/100+AD62*MICS06!AD25/100","v":71.850195238751468},{"$f":"AE58+AE59+AE60+AE63+AE65+AE66+AE67+AE68+AE61*MICS06!AE24/100+AE62*MICS06!AE25/100","v":81.481907879359511},{"$f":"AF58+AF59+AF60+AF63+AF65+AF66+AF67+AF68+AF61*MICS06!AF24/100+AF62*MICS06!AF25/100","v":77.44262909565704},{"$f":"AG58+AG59+AG60+AG63+AG65+AG66+AG67+AG68+AG61*MICS06!AG24/100+AG62*MICS06!AG25/100","v":83.649440033773544},{"$f":"AH58+AH59+AH60+AH63+AH65+AH66+AH67+AH68+AH61*MICS06!AH24/100+AH62*MICS06!AH25/100","v":78.224518667071607},{"$f":"AI58+AI59+AI60+AI63+AI65+AI66+AI67+AI68+AI61*MICS06!AI24/100+AI62*MICS06!AI25/100","v":71.448232782702789},{"$f":"AJ58+AJ59+AJ60+AJ63+AJ65+AJ66+AJ67+AJ68+AJ61*MICS06!AJ24/100+AJ62*MICS06!AJ25/100","v":99.872755472470487},{"$f":"AK58+AK59+AK60+AK63+AK65+AK66+AK67+AK68+AK61*MICS06!AK24/100+AK62*MICS06!AK25/100","v":90.532868058053538},{"$f":"AL58+AL59+AL60+AL63+AL65+AL66+AL67+AL68+AL61*MICS06!AL24/100+AL62*MICS06!AL25/100","v":80.406744477156209},null,null,null,null,null,null,null,null,null,null,null,null,null,null,"Water","Improved","N/A","N/A","N/A","N/A","N/A","N/A","N/A","N/A","N/A","N/A","N/A","N/A","N/A","N/A","N/A","N/A","N/A","N/A","N/A","N/A","N/A","N/A","N/A","N/A","N/A","N/A","N/A","N/A","N/A","N/A","N/A","N/A","N/A","N/A","N/A","N/A"]
[null,"Not Improved",{"$f":"100-C16","v":45.026392856451182},{"$f":"100-D16","v":28.67624783636289},14.810797768919812,4.0012866177108606,1.1104633475508336,2.1294027963654258,0.65486546728448047,0.24394893629536796,0.23110511994052274,0.40970738415930441,46.288272044822982,37.106980420361069,23.828780654321477,17.715153806395008,6.8902724186800839,13.720169006816022,0.42227716064567744,18.852624323558985,4.8337864307339942,14.493387015602892,12.979332838971189,26.30049369885937,15.438336869694908,27.526397750533604,27.782634756875979,9.0418474229671517,44.339038084166944,28.149804761248532,18.518092120640489,22.55737090434296,16.350559966226456,21.775481332928393,28.551767217297211,0.12724452752951265,9.4671319419464623,19.593255522843791,null,null,null,null,null,null,null,null,null,null,null,null,null,null,null,"Not Improved","N/A","N/A","N/A","N/A","N/A","N/A","N/A","N/A","N/A","N/A","N/A","N/A","N/A","N/A","N/A","N/A","N/A","N/A","N/A","N/A","N/A","N/A","N/A","N/A","N/A","N/A","N/A","N/A","N/A","N/A","N/A","N/A","N/A","N/A","N/A","N/A"]
["Water ladder","Basic",{"$f":"C16*MICS06!C23/100","v":31.948036984125512},{"$f":"D16*MICS06!D23/100","v":56.9639476758949},{"$f":"E16*MICS06!E23/100","v":77.160882256677155},{"$f":"F16*MICS06!F23/100","v":94.012086077545888},{"$f":"G16*MICS06!G23/100","v":95.991484948763997},{"$f":"H16*MICS06!H23/100","v":94.097535286489801},{"$f":"I16*MICS06!I23/100","v":97.706584086684245},{"$f":"J16*MICS06!J23/100","v":97.293618183887745},{"$f":"K16*MICS06!K23/100","v":97.845675303195875},{"$f":"L16*MICS06!L23/100","v":98.226796011670487},{"$f":"M16*MICS06!M23/100","v":26.599346478647703},{"$f":"N16*MICS06!N23/100","v":45.855083022224655},{"$f":"O16*MICS06!O23/100","v":62.932006188698161},{"$f":"P16*MICS06!P23/100","v":74.265279223259398},{"$f":"Q16*MICS06!Q23/100","v":89.43172427821149},{"$f":"R16*MICS06!R23/100","v":80.275960426543875},{"$f":"S16*MICS06!S23/100","v":99.577722839354323},{"$f":"T16*MICS06!T23/100","v":72.94552070837193},{"$f":"U16*MICS06!U23/100","v":95.166213569266006},{"$f":"V16*MICS06!V23/100","v":71.896792157655369},{"$f":"W16*MICS06!W23/100","v":38.439769453450857},{"$f":"X16*MICS06!X23/100","v":73.69950630114063},{"$f":"Y16*MICS06!Y23/100","v":42.229924373192553},{"$f":"Z16*MICS06!Z23/100","v":70.738338528144681},{"$f":"AA16*MICS06!AA23/100","v":55.283388803217903},{"$f":"AB16*MICS06!AB23/100","v":90.058495759126359},{"$f":"AC16*MICS06!AC23/100","v":46.799860385542324},{"$f":"AD16*MICS06!AD23/100","v":65.895755600720037},{"$f":"AE16*MICS06!AE23/100","v":76.556592081665656},{"$f":"AF16*MICS06!AF23/100","v":65.669606462961539},{"$f":"AG16*MICS06!AG23/100","v":50.864160017300335},{"$f":"AH16*MICS06!AH23/100","v":77.140496668977306},{"$f":"AI16*MICS06!AI23/100","v":59.387729059320975},{"$f":"AJ16*MICS06!AJ23/100","v":99.068758880735672},{"$f":"AK16*MICS06!AK23/100","v":83.676610465083229},{"$f":"AL16*MICS06!AL23/100","v":69.74211819300875},null,null,null,null,null,null,null,null,null,null,null,null,null,null,"Water ladder","Basic","N/A","N/A","N/A","N/A","N/A","N/A","N/A","N/A","N/A","N/A","N/A","N/A","N/A","N/A","N/A","N/A","N/A","N/A","N/A","N/A","N/A","N/A","N/A","N/A","N/A","N/A","N/A","N/A","N/A","N/A","N/A","N/A","N/A","N/A","N/A","N/A"]
[null,"Limited",{"$f":"C16*MICS06!C22/100","v":23.025570159423296},{"$f":"D16*MICS06!D22/100","v":14.359804487742201},{"$f":"E16*MICS06!E22/100","v":8.0283199744030274},{"$f":"F16*MICS06!F22/100","v":1.986627304743285},{"$f":"G16*MICS06!G22/100","v":2.8980517036851943},{"$f":"H16*MICS06!H22/100","v":3.7730619171447684},{"$f":"I16*MICS06!I22/100","v":1.6385504460312776},{"$f":"J16*MICS06!J22/100","v":2.4624328798168986},{"$f":"K16*MICS06!K22/100","v":1.9232195768635731},{"$f":"L16*MICS06!L22/100","v":1.363496604170225},{"$f":"M16*MICS06!M22/100","v":27.112381476529286},{"$f":"N16*MICS06!N22/100","v":17.037936557414266},{"$f":"O16*MICS06!O22/100","v":13.239213156980409},{"$f":"P16*MICS06!P22/100","v":8.0195669703455703},{"$f":"Q16*MICS06!Q22/100","v":3.6780033031084014},{"$f":"R16*MICS06!R22/100","v":6.0038705666401064},{"$f":"S16*MICS06!S22/100","v":0},{"$f":"T16*MICS06!T22/100","v":8.2018549680690782},{"$f":"U16*MICS06!U22/100","v":0},{"$f":"V16*MICS06!V22/100","v":13.609820826741693},{"$f":"W16*MICS06!W22/100","v":48.580897707577968},{"$f":"X16*MICS06!X22/100","v":0},{"$f":"Y16*MICS06!Y22/100","v":42.331738757112518},{"$f":"Z16*MICS06!Z22/100","v":1.735263721321711},{"$f":"AA16*MICS06!AA22/100","v":16.933976439906147},{"$f":"AB16*MICS06!AB22/100","v":0.89965681790648599},{"$f":"AC16*MICS06!AC22/100","v":8.8611015302907319},{"$f":"AD16*MICS06!AD22/100","v":5.9544396380314017},{"$f":"AE16*MICS06!AE22/100","v":4.9253157976938766},{"$f":"AF16*MICS06!AF22/100","v":11.773022632695524},{"$f":"AG16*MICS06!AG22/100","v":32.785280016473166},{"$f":"AH16*MICS06!AH22/100","v":1.084021998094308},{"$f":"AI16*MICS06!AI22/100","v":12.060503723381821},{"$f":"AJ16*MICS06!AJ22/100","v":0.80399659173483495},{"$f":"AK16*MICS06!AK22/100","v":6.8562575929702971},{"$f":"AL16*MICS06!AL22/100","v":10.664626284147483},null,null,null,null,null,null,null,null,null,null,null,null,null,null,null,"Limited","N/A","N/A","N/A","N/A","N/A","N/A","N/A","N/A","N/A","N/A","N/A","N/A","N/A","N/A","N/A","N/A","N/A","N/A","N/A","N/A","N/A","N/A","N/A","N/A","N/A","N/A","N/A","N/A","N/A","N/A","N/A","N/A","N/A","N/A","N/A","N/A"]
[null,"Unimproved",{"$f":"100-C18-C19-C21","v":40.722839258582795},{"$f":"100-D18-D19-D21","v":25.355005328130542},12.990660163934139,3.5418392030867016,0.95539104157593346,2.1294027963654303,0.65486546728447736,0.24394893629535686,0.23110511994055138,0.40970738415928798,42.147224141426754,32.673689150067723,20.982036604544565,15.540016477003679,5.9381194569246789,13.103156924535085,0.42227716064567744,17.464497988554445,4.623531907764562,10.450470785309939,6.5118382197020219,23.372809100322982,15.123307683113996,20.820913613880798,22.492126733622545,1.1843173869090275,43.661443224509711,26.414148484788733,17.96053471504219,21.771648487437638,7.7961922019765986,20.903012085330314,26.470405577768627,0.12724452752949322,5.1117472830369746,19.442926564213483,null,null,null,null,null,null,null,null,null,null,null,null,null,null,null,"Unimproved","N/A","N/A","N/A","N/A","N/A","N/A","N/A","N/A","N/A","N/A","N/A","N/A","N/A","N/A","N/A","N/A","N/A","N/A","N/A","N/A","N/A","N/A","N/A","N/A","N/A","N/A","N/A","N/A","N/A","N/A","N/A","N/A","N/A","N/A","N/A","N/A"]
[null,"Surface water",{"$f":"C64","v":4.3035535978684045},3.3212425082323569,1.820137604985679,0.45944741462412503,0.15507230597487529,0,0,0,0,0,4.1410479033962568,4.4332912702933625,2.8467440497768663,2.1751373293913514,0.95215296175543007,0.61701208228093296,0,1.3881263350045461,0.21025452296943195,4.0429162302929988,6.4674946192691527,2.9276845985363877,0.31502918658093276,6.705484136652812,5.2905080232534054,7.8575300360581277,0.67759485965723432,1.7356562764598269,0.5575574055982776,0.78572241690530209,8.5543677642498999,0.87246924759807365,2.0813616395285774,0,4.3553846589094984,0.15032895863028772,null,null,null,null,null,null,null,null,null,null,null,null,null,null,null,"Surface water","N/A","N/A","N/A","N/A","N/A","N/A","N/A","N/A","N/A","N/A","N/A","N/A","N/A","N/A","N/A","N/A","N/A","N/A","N/A","N/A","N/A","N/A","N/A","N/A","N/A","N/A","N/A","N/A","N/A","N/A","N/A","N/A","N/A","N/A","N/A","N/A"]
["Improved water point at more than 30 minutes","Yes","N/A","N/A","N/A","N/A","N/A","N/A","N/A","N/A","N/A","N/A","N/A","N/A","N/A","N/A","N/A","N/A","N/A","N/A","N/A","N/A","N/A","N/A","N/A","N/A","N/A","N/A","N/A","N/A","N/A","N/A","N/A","N/A","N/A","N/A","N/A","N/A",null,null,null,null,null,null,null,null,null,null,null,null,null,null,"Improved water point at more than 30 minutes","Yes","N/A","N/A","N/A","N/A","N/A","N/A","N/A","N/A","N/A","N/A","N/A","N/A","N/A","N/A","N/A","N/A","N/A","N/A","N/A","N/A","N/A","N/A","N/A","N/A","N/A","N/A","N/A","N/A","N/A","N/A","N/A","N/A","N/A","N/A","N/A","N/A"]
[null,"No","N/A","N/A","N/A","N/A","N/A","N/A","N/A","N/A","N/A","N/A","N/A","N/A","N/A","N/A","N/A","N/A","N/A","N/A","N/A","N/A","N/A","N/A","N/A","N/A","N/A","N/A","N/A","N/A","N/A","N/A","N/A","N/A","N/A","N/A","N/A","N/A",null,null,null,null,null,null,null,null,null,null,null,null,null,null,null,"No","N/A","N/A","N/A","N/A","N/A","N/A","N/A","N/A","N/A","N/A","N/A","N/A","N/A","N/A","N/A","N/A","N/A","N/A","N/A","N/A","N/A","N/A","N/A","N/A","N/A","N/A","N/A","N/A","N/A","N/A","N/A","N/A","N/A","N/A","N/A","N/A"]
["Manually calculated ratios","Improved wells"]
[null,"Improved springs"]
[null,"Other"]
[null,null,"NATIONAL wealth index quintile",null,null,null,null,"URBAN wealth index quintile",null,null,null,null,"RURAL wealth index quintile",null,null,null,null,"SUB-REGIONS:",null,null,null,null,null,null,null,null,null,null,null,null,null,null,null,null,null,null,null,null,null,null,null,null,null,null,null,null,null,null,null,null,null,null,"Raw numbers of respondents:","Use of drinking water sources","NATIONAL wealth index quintile",null,null,null,null,"URBAN wealth index quintile",null,null,null,null,"RURAL wealth index quintile",null,null,null,null,"SUB-REGIONS:"]
["Percentage based on weighted population",null,"Poorest","Poor","Middle","Rich","Richest","Poorest","Poor","Middle","Rich","Richest","Poorest","Poor","Middle","Rich","Richest","Abyan","Aden","Al-Baidha","Al-Hodiedah","Al-Jawf","Al-Mhrah","Al-Mhweit","Aldhalae","Amran","Dhamar","Hadramout","Hajjah","Ibb","lahj","Mareb","Reimah","Sadah","Sanaa","Sanaa City","Shabwah","Taiz",null,null,null,null,null,null,null,null,null,null,null,null,null,null,"Water data, raw numbers (weighted)",null,"Poorest","Poor","Middle","Rich","Richest","Poorest","Poor","Middle","Rich","Richest","Poorest","Poor","Middle","Rich","Richest","Abyan","Aden","Al-Baidha","Al-Hodiedah","Al-Jawf","Al-Mhrah","Al-Mhweit","Aldhalae","Amran","Dhamar","Hadramout","Hajjah","Ibb","lahj","Mareb","Reimah","Sadah","Sanaa","Sanaa City","Shabwah","Taiz"]
["Piped water","Yes","N/A","N/A","N/A","N/A","N/A","N/A","N/A","N/A","N/A","N/A","N/A","N/A","N/A","N/A","N/A","N/A","N/A","N/A","N/A","N/A","N/A","N/A","N/A","N/A","N/A","N/A","N/A","N/A","N/A","N/A","N/A","N/A","N/A","N/A","N/A","N/A",null,null,null,null,null,null,null,null,null,null,null,null,null,null,"Piped water","Yes","N/A","N/A","N/A","N/A","N/A","N/A","N/A","N/A","N/A","N/A","N/A","N/A","N/A","N/A","N/A","N/A","N/A","N/A","N/A","N/A","N/A","N/A","N/A","N/A","N/A","N/A","N/A","N/A","N/A","N/A","N/A","N/A","N/A","N/A","N/A","N/A"]
[null,"No","N/A","N/A","N/A","N/A","N/A","N/A","N/A","N/A","N/A","N/A","N/A","N/A","N/A","N/A","N/A","N/A","N/A","N/A","N/A","N/A","N/A","N/A","N/A","N/A","N/A","N/A","N/A","N/A","N/A","N/A","N/A","N/A","N/A","N/A","N/A","N/A",null,null,null,null,null,null,null,null,null,null,null,null,null,null,null,"No","N/A","N/A","N/A","N/A","N/A","N/A","N/A","N/A","N/A","N/A","N/A","N/A","N/A","N/A","N/A","N/A","N/A","N/A","N/A","N/A","N/A","N/A","N/A","N/A","N/A","N/A","N/A","N/A","N/A","N/A","N/A","N/A","N/A","N/A","N/A","N/A"]
["Piped water on premises","Yes","N/A","N/A","N/A","N/A","N/A","N/A","N/A","N/A","N/A","N/A","N/A","N/A","N/A","N/A","N/A","N/A","N/A","N/A","N/A","N/A","N/A","N/A","N/A","N/A","N/A","N/A","N/A","N/A","N/A","N/A","N/A","N/A","N/A","N/A","N/A","N/A",null,null,null,null,null,null,null,null,null,null,null,null,null,null,"Piped water on premises","Yes","N/A","N/A","N/A","N/A","N/A","N/A","N/A","N/A","N/A","N/A","N/A","N/A","N/A","N/A","N/A","N/A","N/A","N/A","N/A","N/A","N/A","N/A","N/A","N/A","N/A","N/A","N/A","N/A","N/A","N/A","N/A","N/A","N/A","N/A","N/A","N/A"]
[null,"No","N/A","N/A","N/A","N/A","N/A","N/A","N/A","N/A","N/A","N/A","N/A","N/A","N/A","N/A","N/A","N/A","N/A","N/A","N/A","N/A","N/A","N/A","N/A","N/A","N/A","N/A","N/A","N/A","N/A","N/A","N/A","N/A","N/A","N/A","N/A","N/A",null,null,null,null,null,null,null,null,null,null,null,null,null,null,null,"No","N/A","N/A","N/A","N/A","N/A","N/A","N/A","N/A","N/A","N/A","N/A","N/A","N/A","N/A","N/A","N/A","N/A","N/A","N/A","N/A","N/A","N/A","N/A","N/A","N/A","N/A","N/A","N/A","N/A","N/A","N/A","N/A","N/A","N/A","N/A","N/A"]
["Piped water into dwelling","Yes","N/A","N/A","N/A","N/A","N/A","N/A","N/A","N/A","N/A","N/A","N/A","N/A","N/A","N/A","N/A","N/A","N/A","N/A","N/A","N/A","N/A","N/A","N/A","N/A","N/A","N/A","N/A","N/A","N/A","N/A","N/A","N/A","N/A","N/A","N/A","N/A",null,null,null,null,null,null,null,null,null,null,null,null,null,null,"Piped water into dwelling","Yes","N/A","N/A","N/A","N/A","N/A","N/A","N/A","N/A","N/A","N/A","N/A","N/A","N/A","N/A","N/A","N/A","N/A","N/A","N/A","N/A","N/A","N/A","N/A","N/A","N/A","N/A","N/A","N/A","N/A","N/A","N/A","N/A","N/A","N/A","N/A","N/A"]
[null,"No","N/A","N/A","N/A","N/A","N/A","N/A","N/A","N/A","N/A","N/A","N/A","N/A","N/A","N/A","N/A","N/A","N/A","N/A","N/A","N/A","N/A","N/A","N/A","N/A","N/A","N/A","N/A","N/A","N/A","N/A","N/A","N/A","N/A","N/A","N/A","N/A",null,null,null,null,null,null,null,null,null,null,null,null,null,null,null,"No","N/A","N/A","N/A","N/A","N/A","N/A","N/A","N/A","N/A","N/A","N/A","N/A","N/A","N/A","N/A","N/A","N/A","N/A","N/A","N/A","N/A","N/A","N/A","N/A","N/A","N/A","N/A","N/A","N/A","N/A","N/A","N/A","N/A","N/A","N/A","N/A"]
["Water source on premises","Yes",79.940697876162417,82.622729944713953,87.182141692180025,90.556273631078355,96.272228570250036,85.111254022933295,95.070824409310433,97.768028954477302,97.859031376941346,97.794671994767327,80.252166666057676,81.96294422177867,84.110015493967737,86.998724309387725,86.735055843323678,68.011225972334771,99.932650728623557,83.77223184529808,88.025792227839318,50.38415860960167,99.501700027939265,62.979409556735845,86.54918470448473,81.941791610308755,95.253927705210344,98.50602421065112,80.505414123117049,83.597703273155005,97.37552493091431,80.155013849643353,92.326404617111621,96.030549367835548,86.098987671318994,99.168848496466794,78.475646837249002,82.672422532213872,null,null,null,null,null,null,null,null,null,null,null,null,null,null,"Water source on premises","Yes","N/A","N/A","N/A","N/A","N/A","N/A","N/A","N/A","N/A","N/A","N/A","N/A","N/A","N/A","N/A","N/A","N/A","N/A","N/A","N/A","N/A","N/A","N/A","N/A","N/A","N/A","N/A","N/A","N/A","N/A","N/A","N/A","N/A","N/A","N/A","N/A"]
[null,"No",20.059302123837732,17.377270055286242,12.817858307820016,9.4437263689215669,3.7277714297499389,14.888745977066645,4.9291755906895185,2.2319710455226751,2.1409686230586358,2.2053280052326421,19.747833333942062,18.037055778221379,15.88998450603224,13.001275690612285,13.264944156676336,31.988774027665222,6.7349271376444655E-2,16.227768154702055,11.974207772160717,49.615841390398423,0.49829997206074356,37.020590443264425,13.450815295515389,18.058208389691199,4.7460722947897054,1.4939757893488461,19.494585876882944,16.402296726844963,2.6244750690856673,19.844986150356561,7.673595382888494,3.9694506321644072,13.901012328680956,0.83115150353321476,21.524353162751055,17.327577467785986,null,null,null,null,null,null,null,null,null,null,null,null,null,null,null,"No","N/A","N/A","N/A","N/A","N/A","N/A","N/A","N/A","N/A","N/A","N/A","N/A","N/A","N/A","N/A","N/A","N/A","N/A","N/A","N/A","N/A","N/A","N/A","N/A","N/A","N/A","N/A","N/A","N/A","N/A","N/A","N/A","N/A","N/A","N/A","N/A"]
["Improved Water source on premises","Yes","N/A","N/A","N/A","N/A","N/A","N/A","N/A","N/A","N/A","N/A","N/A","N/A","N/A","N/A","N/A","N/A","N/A","N/A","N/A","N/A","N/A","N/A","N/A","N/A","N/A","N/A","N/A","N/A","N/A","N/A","N/A","N/A","N/A","N/A","N/A","N/A",null,null,null,null,null,null,null,null,null,null,null,null,null,null,"Improved water source on premises","Yes","N/A","N/A","N/A","N/A","N/A","N/A","N/A","N/A","N/A","N/A","N/A","N/A","N/A","N/A","N/A","N/A","N/A","N/A","N/A","N/A","N/A","N/A","N/A","N/A","N/A","N/A","N/A","N/A","N/A","N/A","N/A","N/A","N/A","N/A","N/A","N/A"]
[null,"No","N/A","N/A","N/A","N/A","N/A","N/A","N/A","N/A","N/A","N/A","N/A","N/A","N/A","N/A","N/A","N/A","N/A","N/A","N/A","N/A","N/A","N/A","N/A","N/A","N/A","N/A","N/A","N/A","N/A","N/A","N/A","N/A","N/A","N/A","N/A","N/A",null,null,null,null,null,null,null,null,null,null,null,null,null,null,null,"No","N/A","N/A","N/A","N/A","N/A","N/A","N/A","N/A","N/A","N/A","N/A","N/A","N/A","N/A","N/A","N/A","N/A","N/A","N/A","N/A","N/A","N/A","N/A","N/A","N/A","N/A","N/A","N/A","N/A","N/A","N/A","N/A","N/A","N/A","N/A","N/A"]
["Piped water on premises available when needed","Yes","N/A","N/A","N/A","N/A","N/A","N/A","N/A","N/A","N/A","N/A","N/A","N/A","N/A","N/A","N/A","N/A","N/A","N/A","N/A","N/A","N/A","N/A","N/A","N/A","N/A","N/A","N/A","N/A","N/A","N/A","N/A","N/A","N/A","N/A","N/A","N/A",null,null,null,null,null,null,null,null,null,null,null,null,null,null,"Piped water on premises available when needed","Yes","N/A","N/A","N/A","N/A","N/A","N/A","N/A","N/A","N/A","N/A","N/A","N/A","N/A","N/A","N/A","N/A","N/A","N/A","N/A","N/A","N/A","N/A","N/A","N/A","N/A","N/A","N/A","N/A","N/A","N/A","N/A","N/A","N/A","N/A","N/A","N/A"]
[null,"No","N/A","N/A","N/A","N/A","N/A","N/A","N/A","N/A","N/A","N/A","N/A","N/A","N/A","N/A","N/A","N/A","N/A","N/A","N/A","N/A","N/A","N/A","N/A","N/A","N/A","N/A","N/A","N/A","N/A","N/A","N/A","N/A","N/A","N/A","N/A","N/A",null,null,null,null,null,null,null,null,null,null,null,null,null,null,null,"No","N/A","N/A","N/A","N/A","N/A","N/A","N/A","N/A","N/A","N/A","N/A","N/A","N/A","N/A","N/A","N/A","N/A","N/A","N/A","N/A","N/A","N/A","N/A","N/A","N/A","N/A","N/A","N/A","N/A","N/A","N/A","N/A","N/A","N/A","N/A","N/A"]
["Water point at more than 30 minutes","Yes",15.502950977546909,11.758048348810817,8.7456667018941427,5.2139890738110042,2.1522623521737527,10.121323565331792,2.5685062545450545,0.65649840641865076,0.92171984718214306,1.3519295925152865,15.682761043747204,12.469042331887843,11.004677992058266,8.4660637920428776,8.1241179628365909,16.19022066988423,0,14.264258245693725,7.8268742088358669,33.366051349979855,0,19.770438989932622,9.9542109575803295,11.629667267687054,3.444373765421497,0.90161062331379194,18.164856280234577,10.162631021823671,0.35748780792279911,13.777996564740997,6.7290505223859016,2.7016266115629777,8.0320594193241561,0.28660966541060856,15.384184250198135,12.640002203152919,null,null,null,null,null,null,null,null,null,null,null,null,null,null,"Water point at more than 30 minutes","Yes","N/A","N/A","N/A","N/A","N/A","N/A","N/A","N/A","N/A","N/A","N/A","N/A","N/A","N/A","N/A","N/A","N/A","N/A","N/A","N/A","N/A","N/A","N/A","N/A","N/A","N/A","N/A","N/A","N/A","N/A","N/A","N/A","N/A","N/A","N/A","N/A"]
[null,"No",84.497049022453126,88.241951651189268,91.254333298105834,94.786010926188851,97.847737647826264,89.878676434668137,97.431493745454901,99.343501593581351,99.078280152817854,98.648070407484681,84.317238956252567,87.53095766811218,88.995322007941695,91.533936207957041,91.875882037163464,83.809779330115802,100,85.735741754306432,92.173125791164111,66.633948650020272,100,80.229561010067528,90.045789042419784,88.370332732312917,96.555626234578511,99.098389376686185,81.835143719765398,89.837368978176244,99.642512192077206,86.222003435258941,93.270949477614224,97.298373388437014,91.967940580675872,99.713390334589391,84.615815749801897,87.35999779684694,null,null,null,null,null,null,null,null,null,null,null,null,null,null,null,"No","N/A","N/A","N/A","N/A","N/A","N/A","N/A","N/A","N/A","N/A","N/A","N/A","N/A","N/A","N/A","N/A","N/A","N/A","N/A","N/A","N/A","N/A","N/A","N/A","N/A","N/A","N/A","N/A","N/A","N/A","N/A","N/A","N/A","N/A","N/A","N/A"]
["Water source available when needed","Yes","N/A","N/A","N/A","N/A","N/A","N/A","N/A","N/A","N/A","N/A","N/A","N/A","N/A","N/A","N/A","N/A","N/A","N/A","N/A","N/A","N/A","N/A","N/A","N/A","N/A","N/A","N/A","N/A","N/A","N/A","N/A","N/A","N/A","N/A","N/A","N/A",null,null,null,null,null,null,null,null,null,null,null,null,null,null,"Water source available when needed","Yes","N/A","N/A","N/A","N/A","N/A","N/A","N/A","N/A","N/A","N/A","N/A","N/A","N/A","N/A","N/A","N/A","N/A","N/A","N/A","N/A","N/A","N/A","N/A","N/A","N/A","N/A","N/A","N/A","N/A","N/A","N/A","N/A","N/A","N/A","N/A","N/A"]
[null,"No","N/A","N/A","N/A","N/A","N/A","N/A","N/A","N/A","N/A","N/A","N/A","N/A","N/A","N/A","N/A","N/A","N/A","N/A","N/A","N/A","N/A","N/A","N/A","N/A","N/A","N/A","N/A","N/A","N/A","N/A","N/A","N/A","N/A","N/A","N/A","N/A",null,null,null,null,null,null,null,null,null,null,null,null,null,null,null,"No","N/A","N/A","N/A","N/A","N/A","N/A","N/A","N/A","N/A","N/A","N/A","N/A","N/A","N/A","N/A","N/A","N/A","N/A","N/A","N/A","N/A","N/A","N/A","N/A","N/A","N/A","N/A","N/A","N/A","N/A","N/A","N/A","N/A","N/A","N/A","N/A"]
["Improved water source available when needed","Yes","N/A","N/A","N/A","N/A","N/A","N/A","N/A","N/A","N/A","N/A","N/A","N/A","N/A","N/A","N/A","N/A","N/A","N/A","N/A","N/A","N/A","N/A","N/A","N/A","N/A","N/A","N/A","N/A","N/A","N/A","N/A","N/A","N/A","N/A","N/A","N/A",null,null,null,null,null,null,null,null,null,null,null,null,null,null,"Improved water source available when needed","Yes","N/A","N/A","N/A","N/A","N/A","N/A","N/A","N/A","N/A","N/A","N/A","N/A","N/A","N/A","N/A","N/A","N/A","N/A","N/A","N/A","N/A","N/A","N/A","N/A","N/A","N/A","N/A","N/A","N/A","N/A","N/A","N/A","N/A","N/A","N/A","N/A"]
[null,"No","N/A","N/A","N/A","N/A","N/A","N/A","N/A","N/A","N/A","N/A","N/A","N/A","N/A","N/A","N/A","N/A","N/A","N/A","N/A","N/A","N/A","N/A","N/A","N/A","N/A","N/A","N/A","N/A","N/A","N/A","N/A","N/A","N/A","N/A","N/A","N/A",null,null,null,null,null,null,null,null,null,null,null,null,null,null,null,"No","N/A","N/A","N/A","N/A","N/A","N/A","N/A","N/A","N/A","N/A","N/A","N/A","N/A","N/A","N/A","N/A","N/A","N/A","N/A","N/A","N/A","N/A","N/A","N/A","N/A","N/A","N/A","N/A","N/A","N/A","N/A","N/A","N/A","N/A","N/A","N/A"]
["Microbiological quality at point of collection","Not contaminated (No E. coli in 100 mL)","N/A","N/A","N/A","N/A","N/A","N/A","N/A","N/A","N/A","N/A","N/A","N/A","N/A","N/A","N/A","N/A","N/A","N/A","N/A","N/A","N/A","N/A","N/A","N/A","N/A","N/A","N/A","N/A","N/A","N/A","N/A","N/A","N/A","N/A","N/A","N/A",null,null,null,null,null,null,null,null,null,null,null,null,null,null,"Microbiological quality at point of collection","Not contaminated (No E. coli in 100 mL)","N/A","N/A","N/A","N/A","N/A","N/A","N/A","N/A","N/A","N/A","N/A","N/A","N/A","N/A","N/A","N/A","N/A","N/A","N/A","N/A","N/A","N/A","N/A","N/A","N/A","N/A","N/A","N/A","N/A","N/A","N/A","N/A","N/A","N/A","N/A","N/A"]
[null,"Contaminated (E. coli detected in 100 mL)","N/A","N/A","N/A","N/A","N/A","N/A","N/A","N/A","N/A","N/A","N/A","N/A","N/A","N/A","N/A","N/A","N/A","N/A","N/A","N/A","N/A","N/A","N/A","N/A","N/A","N/A","N/A","N/A","N/A","N/A","N/A","N/A","N/A","N/A","N/A","N/A",null,null,null,null,null,null,null,null,null,null,null,null,null,null,null,"Contaminated (E. coli detected in 100 mL)","N/A","N/A","N/A","N/A","N/A","N/A","N/A","N/A","N/A","N/A","N/A","N/A","N/A","N/A","N/A","N/A","N/A","N/A","N/A","N/A","N/A","N/A","N/A","N/A","N/A","N/A","N/A","N/A","N/A","N/A","N/A","N/A","N/A","N/A","N/A","N/A"]
[null,"Highly contaminated (>100 CFU/100 mL)","N/A","N/A","N/A","N/A","N/A","N/A","N/A","N/A","N/A","N/A","N/A","N/A","N/A","N/A","N/A","N/A","N/A","N/A","N/A","N/A","N/A","N/A","N/A","N/A","N/A","N/A","N/A","N/A","N/A","N/A","N/A","N/A","N/A","N/A","N/A","N/A",null,null,null,null,null,null,null,null,null,null,null,null,null,null,null,"Highly contaminated (>100 CFU/100 mL)","N/A","N/A","N/A","N/A","N/A","N/A","N/A","N/A","N/A","N/A","N/A","N/A","N/A","N/A","N/A","N/A","N/A","N/A","N/A","N/A","N/A","N/A","N/A","N/A","N/A","N/A","N/A","N/A","N/A","N/A","N/A","N/A","N/A","N/A","N/A","N/A"]
["Microbiological quality of improved water sources at point of collection","Not contaminated (No E. coli in 100 mL)","N/A","N/A","N/A","N/A","N/A","N/A","N/A","N/A","N/A","N/A","N/A","N/A","N/A","N/A","N/A","N/A","N/A","N/A","N/A","N/A","N/A","N/A","N/A","N/A","N/A","N/A","N/A","N/A","N/A","N/A","N/A","N/A","N/A","N/A","N/A","N/A",null,null,null,null,null,null,null,null,null,null,null,null,null,null,"Microbiological quality of improved water sources at point of collection","Not contaminated (No E. coli in 100 mL)","N/A","N/A","N/A","N/A","N/A","N/A","N/A","N/A","N/A","N/A","N/A","N/A","N/A","N/A","N/A","N/A","N/A","N/A","N/A","N/A","N/A","N/A","N/A","N/A","N/A","N/A","N/A","N/A","N/A","N/A","N/A","N/A","N/A","N/A","N/A","N/A"]
[null,"Contaminated (E. coli detected in 100 mL)","N/A","N/A","N/A","N/A","N/A","N/A","N/A","N/A","N/A","N/A","N/A","N/A","N/A","N/A","N/A","N/A","N/A","N/A","N/A","N/A","N/A","N/A","N/A","N/A","N/A","N/A","N/A","N/A","N/A","N/A","N/A","N/A","N/A","N/A","N/A","N/A",null,null,null,null,null,null,null,null,null,null,null,null,null,null,null,"Contaminated (E. coli detected in 100 mL)","N/A","N/A","N/A","N/A","N/A","N/A","N/A","N/A","N/A","N/A","N/A","N/A","N/A","N/A","N/A","N/A","N/A","N/A","N/A","N/A","N/A","N/A","N/A","N/A","N/A","N/A","N/A","N/A","N/A","N/A","N/A","N/A","N/A","N/A","N/A","N/A"]
[null,"Highly contaminated (>100 CFU/100 mL)","N/A","N/A","N/A","N/A","N/A","N/A","N/A","N/A","N/A","N/A","N/A","N/A","N/A","N/A","N/A","N/A","N/A","N/A","N/A","N/A","N/A","N/A","N/A","N/A","N/A","N/A","N/A","N/A","N/A","N/A","N/A","N/A","N/A","N/A","N/A","N/A",null,null,null,null,null,null,null,null,null,null,null,null,null,null,null,"Highly contaminated (>100 CFU/100 mL)","N/A","N/A","N/A","N/A","N/A","N/A","N/A","N/A","N/A","N/A","N/A","N/A","N/A","N/A","N/A","N/A","N/A","N/A","N/A","N/A","N/A","N/A","N/A","N/A","N/A","N/A","N/A","N/A","N/A","N/A","N/A","N/A","N/A","N/A","N/A","N/A"]
["Microbiological quality of piped on premises at point of collection","Not contaminated (No E. coli in 100 mL)","N/A","N/A","N/A","N/A","N/A","N/A","N/A","N/A","N/A","N/A","N/A","N/A","N/A","N/A","N/A","N/A","N/A","N/A","N/A","N/A","N/A","N/A","N/A","N/A","N/A","N/A","N/A","N/A","N/A","N/A","N/A","N/A","N/A","N/A","N/A","N/A",null,null,null,null,null,null,null,null,null,null,null,null,null,null,"Microbiological quality of piped on premises at point of collection","Not contaminated (No E. coli in 100 mL)","N/A","N/A","N/A","N/A","N/A","N/A","N/A","N/A","N/A","N/A","N/A","N/A","N/A","N/A","N/A","N/A","N/A","N/A","N/A","N/A","N/A","N/A","N/A","N/A","N/A","N/A","N/A","N/A","N/A","N/A","N/A","N/A","N/A","N/A","N/A","N/A"]
[null,"Contaminated (E. coli detected in 100 mL)","N/A","N/A","N/A","N/A","N/A","N/A","N/A","N/A","N/A","N/A","N/A","N/A","N/A","N/A","N/A","N/A","N/A","N/A","N/A","N/A","N/A","N/A","N/A","N/A","N/A","N/A","N/A","N/A","N/A","N/A","N/A","N/A","N/A","N/A","N/A","N/A",null,null,null,null,null,null,null,null,null,null,null,null,null,null,null,"Contaminated (E. coli detected in 100 mL)","N/A","N/A","N/A","N/A","N/A","N/A","N/A","N/A","N/A","N/A","N/A","N/A","N/A","N/A","N/A","N/A","N/A","N/A","N/A","N/A","N/A","N/A","N/A","N/A","N/A","N/A","N/A","N/A","N/A","N/A","N/A","N/A","N/A","N/A","N/A","N/A"]
[null,"Highly contaminated (>100 CFU/100 mL)","N/A","N/A","N/A","N/A","N/A","N/A","N/A","N/A","N/A","N/A","N/A","N/A","N/A","N/A","N/A","N/A","N/A","N/A","N/A","N/A","N/A","N/A","N/A","N/A","N/A","N/A","N/A","N/A","N/A","N/A","N/A","N/A","N/A","N/A","N/A","N/A",null,null,null,null,null,null,null,null,null,null,null,null,null,null,null,"Highly contaminated (>100 CFU/100 mL)","N/A","N/A","N/A","N/A","N/A","N/A","N/A","N/A","N/A","N/A","N/A","N/A","N/A","N/A","N/A","N/A","N/A","N/A","N/A","N/A","N/A","N/A","N/A","N/A","N/A","N/A","N/A","N/A","N/A","N/A","N/A","N/A","N/A","N/A","N/A","N/A"]
[null,null,"NATIONAL wealth index quintile",null,null,null,null,"URBAN wealth index quintile",null,null,null,null,"RURAL wealth index quintile",null,null,null,null,"SUB-REGIONS:",null,null,null,null,null,null,null,null,null,null,null,null,null,null,null,null,null,null,null,null,null,null,null,null,null,null,null,null,null,null,null,null,null,null,"Raw numbers of respondents:","Use of drinking water sources","NATIONAL wealth index quintile",null,null,null,null,"URBAN wealth index quintile",null,null,null,null,"RURAL wealth index quintile",null,null,null,null,"SUB-REGIONS:"]
["Percentage based on weighted population",null,"Poorest","Poor","Middle","Rich","Richest","Poorest","Poor","Middle","Rich","Richest","Poorest","Poor","Middle","Rich","Richest","Abyan","Aden","Al-Baidha","Al-Hodiedah","Al-Jawf","Al-Mhrah","Al-Mhweit","Aldhalae","Amran","Dhamar","Hadramout","Hajjah","Ibb","lahj","Mareb","Reimah","Sadah","Sanaa","Sanaa City","Shabwah","Taiz",null,null,null,null,null,null,null,null,null,null,null,null,null,null,"Water data, raw numbers (weighted)",null,"Poorest","Poor","Middle","Rich","Richest","Poorest","Poor","Middle","Rich","Richest","Poorest","Poor","Middle","Rich","Richest","Abyan","Aden","Al-Baidha","Al-Hodiedah","Al-Jawf","Al-Mhrah","Al-Mhweit","Aldhalae","Amran","Dhamar","Hadramout","Hajjah","Ibb","lahj","Mareb","Reimah","Sadah","Sanaa","Sanaa City","Shabwah","Taiz"]
["Source of drinking water","Government network",4.4636621532084062,11.321460443733393,15.483112587502468,34.407128207535969,33.788012541830071,41.742571302135929,42.514201926782476,47.55345771218412,39.244575752873104,29.865058186861127,2.3139523189219355,9.9775291806595838,11.299250494645655,11.324108818811988,19.289018568409404,32.68333991975004,86.123898441087803,9.4794505660787802,29.095421728372745,1.2723054407167933,12.900477135719646,19.520370714193515,6.9933175743955136,8.6016507802720987,22.198302937286901,49.129572981581802,15.871663289290835,22.13180890296962,17.549086903592332,6.2622742432289753,2.3154852481592365,10.483238459831609,7.0493194357104896,17.571805599432459,12.43960174111961,3.8218255316968071]
[null,"Local network",6.666915921770812,13.920597475730581,17.491970933016717,7.5501530579085347,5.382454248177746,5.4403364362731033,1.9315706934689079,0.50017896998527278,0.1506976189929653,1.1215867990327606,5.6303741366737396,11.111514863472809,15.213238103780718,18.93562876814655,18.797481108363097,1.2146725974363517,0.67428969693405305,7.0580573993164242,27.049443161507757,1.508645053878648,3.8558027009542029E-2,0.67224278902536705,8.9030343913538985,2.4352429125738073,6.3715769037466341,15.637774710269397,1.1802974960930139,11.336026476510167,9.7813608380307837,12.805566138101909,3.3388788554697744,8.6763303588239644,5.1033034678100773,0.80209972304958432,20.798157476750731,15.661902703529011]
[null,"Tube well or borehole",20.801302717410621,19.075627584075221,19.007047785241681,8.1392630321094721,5.7577028131751602,5.054768236036395,2.0604750893142572,2.0160492195735498,1.6384623813518178,0.83701393193685203,20.717023312656689,19.257252540671129,20.064913926096299,20.992376565806232,19.040895026899861,17.007761992732913,0,8.8151265863161541,22.419783270321641,28.02147038948689,1.3308522100524809,5.482604342524164,23.259187762102087,18.407819193933893,27.943868250920232,0.60360734181770015,5.3858465064554775,12.433237463047918,7.2380793919736632,14.802376759976518,6.140224348255761,27.574686670406081,42.46741990188481,2.9992297397792775,14.96250954827082,11.967782355630577]
[null,"Well",32.939897852986434,16.964354957513173,9.0243454961517173,2.7834497611757243,1.0672705311081676,1.5146879017145976,0.72597006653447893,0.12630520093922215,4.4781251117979079E-2,5.089511045168188E-2,37.476854027321437,21.411845593700857,14.858847590509628,10.283903230647105,5.6542577411929296,9.3580395258609705,0,14.512436199931637,3.0513689840481004,17.123299812203456,4.7210580211503217,10.284991336091071,25.654148043639243,11.38134985147509,11.81807495293581,2.400193027525364,39.514743724972689,7.9703910495470849,23.99874699051384,35.07264262299023,8.1041667235941421,21.118240368336487,15.988463534678049,4.9456347860879164E-2,9.4021758336802446,21.498997833927806]
[null,"Spring",20.859961531873594,17.066300534274049,8.4037708574883645,1.5656250267740517,0.52429566178248621,0.50771139216702965,0.34322553352056628,2.0954841490169032E-2,0.36492111473966288,0,20.653138487158309,20.300349342204509,15.875048381593096,9.3435093750199307,3.3006260470087776,2.5859840844356463,0,4.6794400157032836,0,0,4.1554359051413607,33.295132287568158,1.6797580754750279,21.572058447503718,16.16016092512422,2.103123920445459,11.125205919899891,20.585885730358029,4.4632890092023887,3.1770443865513616,58.658614458628719,7.3257902942464757,17.860101185909166,0,0.18206068860714483,6.0939003605191928]
[null,"Surface water protected",2.7519955968601026,2.8079170142176211,3.5062302884431928,1.2693485537759084,0.51633125308677441,0.57588992379128778,0,0.15027394124241111,0,0,2.7342257237000918,2.7922900584549626,3.2882570692790658,3.6197486235582055,2.9341767553929579,0.2990645665449419,0,1.5667590194433973,1.2368632100366754,0,0,11.435313791615998,1.3462433462683636,1.1370720741085356,3.7838891993404253,0.17511283045313794,0.85313456882583416,3.1972150428109636,6.7241442069861446,0.21919576134163313,11.933300994673905,7.2764796785760062,0.25664718273275006,0,0.6284643955590945,1.2890531659410605]
[null,"Surface water unprotected",4.3035535978684045,3.3212425082323569,1.820137604985679,0.45944741462412503,0.15507230597487529,0,0,0,0,0,4.1410479033962568,4.4332912702933625,2.8467440497768663,2.1751373293913514,0.95215296175543007,0.61701208228093296,0,1.3881263350045461,0.21025452296943195,4.0429162302929988,6.4674946192691527,2.9276845985363877,0.31502918658093276,6.705484136652812,5.2905080232534054,7.8575300360581277,0.67759485965723432,1.7356562764598269,0.5575574055982776,0.78572241690530209,8.5543677642498999,0.87246924759807365,2.0813616395285774,0,4.3553846589094984,0.15032895863028772]
[null,"Rainwater",2.046347129103427,3.9868979389164636,7.4221533277137777,2.1301905297231611,0.42849920105777611,0.1143967987466263,0.3879369949882136,0.70571081732765895,0.30139260037314108,2.4926473783330884E-2,2.1573469096409155,2.7459949354001987,4.9074692367560058,8.4395024318451703,4.2250702432592409,1.4284776358974147,8.2915945177457873E-2,0,0.18009315595189168,0.18478749002635322,2.4953354297844403,3.8035615432464911,0.26194455850955806,0.14754975741237625,0.23439941592008143,0.36424042719108557,1.8540720142134173,8.304240000349596,11.360274577805891,1.0765375348337645,0.61254758978297996,7.0736104631165597,0.82365785397484526,0.24990048048459504,0.77267767866886039,10.12092038956864]
[null,"Tanker truck",3.6828299219912695,9.0174528268260161,15.125826535911969,25.662037456785527,17.179116713419425,32.574270774915163,29.607130455175351,19.081944591234532,17.522177774718585,12.683689436360096,2.6417702663556271,6.0629540967783901,9.0004196434013277,12.852396731989055,21.889854946529443,31.265896849861079,0.15510813164687831,47.08554878908933,7.9532049111675498,47.578636996936922,13.793310310293073,10.158315791284233,30.230681758778015,29.008599893910475,5.2042798364622014,16.01515669675749,23.112942903528626,6.4363451815267894,14.650379414303044,21.204597103354427,0.11973218780962801,8.5561722110617016,7.8285721622758775,22.118884252540376,32.226922971219793,5.4454984092276275]
[null,"Bottled water",0.21393792778303272,0.24439924429146809,1.1492347138376104,15.074462795121709,34.949910689599825,10.599820133937957,21.878521005410036,29.611653190472758,40.684346943262042,55.007122677414841,0.15288458191661819,0.33068713252665594,0.15704743851412045,0.64313180791859126,3.0071187512120541,2.0872865448734079,12.541510624508126,4.2943836731342042,7.2314041319077536,0,53.830384579517073,0.78294547939024384,1.2723886116170326,0.10508512189020416,0.22896667321590172,5.5809326012141351,0.41175570572937298,0.73668265463168814,2.7403057596126912,4.2617210600825306,3.8912961038129107E-2,0,0.11465003374735035,56.081379329323319,3.912415985320925,22.569956477435117]
[null,"Container",0.23657574346952728,1.0811931289914831,0.93350870189061774,0.22113079477438605,0,0,6.7715534281519496E-2,0,0,0,0.19192914239072237,0.63669823759943456,1.3848487795045263,0.82940501927601196,0.50183003703885709,0,0,0.90301910201749958,0,0,0,5.4090038031009473E-2,0,0.22486107514958853,0,0,0,3.4530813512616985,0,0,0,0,0,0,0,0.52395614893827325]
[null,"Other",1.0330199056742619,1.1925563431984416,0.63266116781614556,0.73776336969090206,0.25133404078764982,1.8755471002817818,0.48325270052386926,0.23347151555024639,4.8644562570722957E-2,0.40970738415940972,1.1894531898674783,0.93959274823825267,1.1039152861429267,0.56115129759011473,0.40751781293821104,1.4524642003262316,0.42227716064564963,0.21765231396491747,1.572162923716429,0.26793858645800062,0.26709376206294649,1.5827472884936578,8.4266691280261985E-2,0.27322675511728306,0.76597288179418388,0.13275542668640108,1.2743011333368807E-2,1.6794298705264541,0.9367755023808535,0.3323219726333253,0.18376886833813566,1.0429822480028363,0.42650360174769852,0.12724452752952631,0.31962902189332626,0.85587766495556838]
[]
[]
[]
[]
[]
[]
[]
[]
[]
[]
[]
[]
[]
[]
[]
[]
[]
[]
[]
[]
[]
[]
[]
[]
[]
[]
[]
[]
[]
[]
[]
[]
[]
[]
[]
[]
[]
[]
[{"$f":"A1026","v":"Yemen"}]
[{"$f":"A1034","v":"2013"}]
["Use of sanitation facilities"]
[" by wealth quintile and sub-national region"]
["Notes:"]
["WHO/UNICEF JMP customised wealth index excludes water,"]
[" sanitation and hygiene assets."]
["Survey used for analysis:",{"$f":"A1025","v":"DHS13"}]
[{"$f":"B1030","v":"Ratio of Improved latrines based on:"},"MICS06"]
[{"$f":"B1029","v":"Ratio of Shared improved based on:"},"MICS06"]
[]
[]
["Use of sanitation facilities",null,"NATIONAL wealth index quintile",null,null,null,null,"URBAN wealth index quintile",null,null,null,null,"RURAL wealth index quintile",null,null,null,null,"SUB-REGIONS:",null,null,null,null,null,null,null,null,null,null,null,null,null,null,null,null,null,null,null,null,null,null,null,null,null,null,null,null,null,null,null,null,null,null,"Raw numbers of respondents:","Use of sanitation facilities","NATIONAL wealth index quintile",null,null,null,null,"URBAN wealth index quintile",null,null,null,null,"RURAL wealth index quintile",null,null,null,null,"SUB-REGIONS:"]
["Weighted percentage (used in graphs)",null,"Poorest","Poor","Middle","Rich","Richest","Poorest","Poor","Middle","Rich","Richest","Poorest","Poor","Middle","Rich","Richest","Abyan","Aden","Al-Baidha","Al-Hodiedah","Al-Jawf","Al-Mhrah","Al-Mhweit","Aldhalae","Amran","Dhamar","Hadramout","Hajjah","Ibb","lahj","Mareb","Reimah","Sadah","Sanaa","Sanaa City","Shabwah","Taiz",null,null,null,null,null,null,null,null,null,null,null,null,null,null,"Sanitation data, raw numbers (weighted)",null,"Poorest","Poor","Middle","Rich","Richest","Poorest","Poor","Middle","Rich","Richest","Poorest","Poor","Middle","Rich","Richest","Abyan","Aden","Al-Baidha","Al-Hodiedah","Al-Jawf","Al-Mhrah","Al-Mhweit","Aldhalae","Amran","Dhamar","Hadramout","Hajjah","Ibb","lahj","Mareb","Reimah","Sadah","Sanaa","Sanaa City","Shabwah","Taiz"]
["Sanitation","Improved",{"$f":"C153+C154+(C155+C156)*MICS06!C130/100","v":13.921448988992243},{"$f":"D153+D154+(D155+D156)*MICS06!D130/100","v":38.733476075790776},{"$f":"E153+E154+(E155+E156)*MICS06!E130/100","v":60.218551875856576},{"$f":"F153+F154+(F155+F156)*MICS06!F130/100","v":82.80380818597952},{"$f":"G153+G154+(G155+G156)*MICS06!G130/100","v":96.247673109575828},{"$f":"H153+H154+(H155+H156)*MICS06!H130/100","v":74.643292719687352},{"$f":"I153+I154+(I155+I156)*MICS06!I130/100","v":91.190819827709831},{"$f":"J153+J154+(J155+J156)*MICS06!J130/100","v":97.479052609738332},{"$f":"K153+K154+(K155+K156)*MICS06!K130/100","v":97.410583833614851},{"$f":"L153+L154+(L155+L156)*MICS06!L130/100","v":99.288605657270352},{"$f":"M153+M154+(M155+M156)*MICS06!M130/100","v":11.430646306471946},{"$f":"N153+N154+(N155+N156)*MICS06!N130/100","v":27.49761075483352},{"$f":"O153+O154+(O155+O156)*MICS06!O130/100","v":44.729152119812525},{"$f":"P153+P154+(P155+P156)*MICS06!P130/100","v":57.479276973147122},{"$f":"Q153+Q154+(Q155+Q156)*MICS06!Q130/100","v":77.322806817717407},{"$f":"R153+R154+(R155+R156)*MICS06!R130/100","v":67.385473045662749},{"$f":"S153+S154+(S155+S156)*MICS06!S130/100","v":97.992870776394909},{"$f":"T153+T154+(T155+T156)*MICS06!T130/100","v":75.252197977564265},{"$f":"U153+U154+(U155+U156)*MICS06!U130/100","v":73.326961808209518},{"$f":"V153+V154+(V155+V156)*MICS06!V130/100","v":54.63198538560178},{"$f":"W153+W154+(W155+W156)*MICS06!W130/100","v":90.172047571340485},{"$f":"X153+X154+(X155+X156)*MICS06!X130/100","v":15.090113722591088},{"$f":"Y153+Y154+(Y155+Y156)*MICS06!Y130/100","v":65.339926069227744},{"$f":"Z153+Z154+(Z155+Z156)*MICS06!Z130/100","v":43.920241345740813},{"$f":"AA153+AA154+(AA155+AA156)*MICS06!AA130/100","v":49.80966894881422},{"$f":"AB153+AB154+(AB155+AB156)*MICS06!AB130/100","v":87.63078021541331},{"$f":"AC153+AC154+(AC155+AC156)*MICS06!AC130/100","v":32.903987582836628},{"$f":"AD153+AD154+(AD155+AD156)*MICS06!AD130/100","v":63.534260798234811},{"$f":"AE153+AE154+(AE155+AE156)*MICS06!AE130/100","v":71.741785412072915},{"$f":"AF153+AF154+(AF155+AF156)*MICS06!AF130/100","v":55.931637543973451},{"$f":"AG153+AG154+(AG155+AG156)*MICS06!AG130/100","v":23.873522481388726},{"$f":"AH153+AH154+(AH155+AH156)*MICS06!AH130/100","v":53.71838207809342},{"$f":"AI153+AI154+(AI155+AI156)*MICS06!AI130/100","v":18.246998599245252},{"$f":"AJ153+AJ154+(AJ155+AJ156)*MICS06!AJ130/100","v":99.071658219807446},{"$f":"AK153+AK154+(AK155+AK156)*MICS06!AK130/100","v":64.649296814693628},{"$f":"AL153+AL154+(AL155+AL156)*MICS06!AL130/100","v":49.002919222304229},null,null,null,null,null,null,null,null,null,null,null,null,null,null,"Sanitation","Improved","N/A","N/A","N/A","N/A","N/A","N/A","N/A","N/A","N/A","N/A","N/A","N/A","N/A","N/A","N/A","N/A","N/A","N/A","N/A","N/A","N/A","N/A","N/A","N/A","N/A","N/A","N/A","N/A","N/A","N/A","N/A","N/A","N/A","N/A","N/A","N/A"]
[null,"Not Improved",{"$f":"100-C122","v":86.078551011007761},{"$f":"100-D122","v":61.266523924209224},39.781448124143424,17.19619181402048,3.7523268904241718,25.356707280312648,8.8091801722901693,2.5209473902616679,2.5894161663851492,0.71139434272964763,88.569353693528058,72.502389245166484,55.270847880187475,42.520723026852878,22.677193182282593,32.614526954337251,2.0071292236050908,24.747802022435735,26.673038191790482,45.36801461439822,9.8279524286595148,84.909886277408916,34.660073930772256,56.079758654259187,50.19033105118578,12.36921978458669,67.096012417163365,36.465739201765189,28.258214587927085,44.068362456026549,76.126477518611267,46.28161792190658,81.753001400754755,0.92834178019255376,35.350703185306372,50.997080777695771,null,null,null,null,null,null,null,null,null,null,null,null,null,null,null,"Not Improved","N/A","N/A","N/A","N/A","N/A","N/A","N/A","N/A","N/A","N/A","N/A","N/A","N/A","N/A","N/A","N/A","N/A","N/A","N/A","N/A","N/A","N/A","N/A","N/A","N/A","N/A","N/A","N/A","N/A","N/A","N/A","N/A","N/A","N/A","N/A","N/A"]
["Sanitation ladder","Basic",{"$f":"C122*MICS06!C129/100","v":12.148872275586827},{"$f":"D122*MICS06!D129/100","v":34.911387204195101},{"$f":"E122*MICS06!E129/100","v":57.660294335870368},{"$f":"F122*MICS06!F129/100","v":79.799700661562369},{"$f":"G122*MICS06!G129/100","v":94.822641675842945},{"$f":"H122*MICS06!H129/100","v":72.593934621563008},{"$f":"I122*MICS06!I129/100","v":87.346710901542266},{"$f":"J122*MICS06!J129/100","v":94.516118830782702},{"$f":"K122*MICS06!K129/100","v":97.410583833614851},{"$f":"L122*MICS06!L129/100","v":99.018583158875444},{"$f":"M122*MICS06!M129/100","v":10.137580103998641},{"$f":"N122*MICS06!N129/100","v":24.380075140151529},{"$f":"O122*MICS06!O129/100","v":41.398711909803723},{"$f":"P122*MICS06!P129/100","v":54.003273805848757},{"$f":"Q122*MICS06!Q129/100","v":73.887813130848201},{"$f":"R122*MICS06!R129/100","v":62.461912106761389},{"$f":"S122*MICS06!S129/100","v":97.082001527496757},{"$f":"T122*MICS06!T129/100","v":75.252197977564265},{"$f":"U122*MICS06!U129/100","v":68.630332682432794},{"$f":"V122*MICS06!V129/100","v":50.942369818212192},{"$f":"W122*MICS06!W129/100","v":83.378142124297213},{"$f":"X122*MICS06!X129/100","v":14.791299589470471},{"$f":"Y122*MICS06!Y129/100","v":61.344956253181095},{"$f":"Z122*MICS06!Z129/100","v":36.539600300060279},{"$f":"AA122*MICS06!AA129/100","v":49.259506739116731},{"$f":"AB122*MICS06!AB129/100","v":83.326952850858703},{"$f":"AC122*MICS06!AC129/100","v":28.465062770715647},{"$f":"AD122*MICS06!AD129/100","v":61.512035885424574},{"$f":"AE122*MICS06!AE129/100","v":65.500527783266534},{"$f":"AF122*MICS06!AF129/100","v":51.014570507140625},{"$f":"AG122*MICS06!AG129/100","v":23.873522481388726},{"$f":"AH122*MICS06!AH129/100","v":50.813830234410453},{"$f":"AI122*MICS06!AI129/100","v":17.701882716601236},{"$f":"AJ122*MICS06!AJ129/100","v":98.275661669202051},{"$f":"AK122*MICS06!AK129/100","v":63.567148193656095},{"$f":"AL122*MICS06!AL129/100","v":47.519790216691099},null,null,null,null,null,null,null,null,null,null,null,null,null,null,"Sanitation ladder","Basic","N/A","N/A","N/A","N/A","N/A","N/A","N/A","N/A","N/A","N/A","N/A","N/A","N/A","N/A","N/A","N/A","N/A","N/A","N/A","N/A","N/A","N/A","N/A","N/A","N/A","N/A","N/A","N/A","N/A","N/A","N/A","N/A","N/A","N/A","N/A","N/A"]
[null,"Limited",{"$f":"C122*MICS06!C128/100","v":1.7725767134054176},{"$f":"D122*MICS06!D128/100","v":3.8220888715956596},{"$f":"E122*MICS06!E128/100","v":2.5582575399862586},{"$f":"F122*MICS06!F128/100","v":3.0041075244172446},{"$f":"G122*MICS06!G128/100","v":1.4250314337329175},{"$f":"H122*MICS06!H128/100","v":2.0493580981243449},{"$f":"I122*MICS06!I128/100","v":3.8441089261675767},{"$f":"J122*MICS06!J128/100","v":2.9629337789555872},{"$f":"K122*MICS06!K128/100","v":0},{"$f":"L122*MICS06!L128/100","v":0.27002249839492404},{"$f":"M122*MICS06!M128/100","v":1.2930662024733039},{"$f":"N122*MICS06!N128/100","v":3.1175356146819957},{"$f":"O122*MICS06!O128/100","v":3.3304402100087929},{"$f":"P122*MICS06!P128/100","v":3.476003167298364},{"$f":"Q122*MICS06!Q128/100","v":3.4349936868692215},{"$f":"R122*MICS06!R128/100","v":4.9235609389013462},{"$f":"S122*MICS06!S128/100","v":0.91086924889815535},{"$f":"T122*MICS06!T128/100","v":0},{"$f":"U122*MICS06!U128/100","v":4.6966291257767292},{"$f":"V122*MICS06!V128/100","v":3.6896155673895725},{"$f":"W122*MICS06!W128/100","v":6.7939054470432767},{"$f":"X122*MICS06!X128/100","v":0.29881413312061555},{"$f":"Y122*MICS06!Y128/100","v":3.9949698160466416},{"$f":"Z122*MICS06!Z128/100","v":7.3806410456805107},{"$f":"AA122*MICS06!AA128/100","v":0.55016220969748897},{"$f":"AB122*MICS06!AB128/100","v":4.3038273645545955},{"$f":"AC122*MICS06!AC128/100","v":4.4389248121209732},{"$f":"AD122*MICS06!AD128/100","v":2.0222249128102319},{"$f":"AE122*MICS06!AE128/100","v":6.2412576288063928},{"$f":"AF122*MICS06!AF128/100","v":4.9170670368328313},{"$f":"AG122*MICS06!AG128/100","v":0},{"$f":"AH122*MICS06!AH128/100","v":2.9045518436829627},{"$f":"AI122*MICS06!AI128/100","v":0.54511588264402155},{"$f":"AJ122*MICS06!AJ128/100","v":0.7959965506053962},{"$f":"AK122*MICS06!AK128/100","v":1.0821486210375493},{"$f":"AL122*MICS06!AL128/100","v":1.4831290056131237},null,null,null,null,null,null,null,null,null,null,null,null,null,null,null,"Limited","N/A","N/A","N/A","N/A","N/A","N/A","N/A","N/A","N/A","N/A","N/A","N/A","N/A","N/A","N/A","N/A","N/A","N/A","N/A","N/A","N/A","N/A","N/A","N/A","N/A","N/A","N/A","N/A","N/A","N/A","N/A","N/A","N/A","N/A","N/A","N/A"]
[null,"Unimproved",{"$f":"100-C124-C125-C127","v":25.977618043851329},{"$f":"100-D124-D125-D127","v":29.69682039694932},21.332998251716585,10.056075632670677,1.6594628844389256,18.254473302938969,5.9179290645044187,1.339000224548988,2.1715566273955274,0.24879406663702358,23.118125870036749,31.935587461453615,26.766728802734203,22.883322842889335,9.5946366939477592,12.405657774920833,1.8383061302373291,3.9867875169772802,4.4695601367397408,27.24896422220943,5.5805830105089695,40.797692214680687,22.374724124371753,19.965402537279068,16.578928593650794,9.6650569700944509,20.034458864482659,17.325667195537438,16.755425305393747,19.012941700918798,35.995182458453257,37.327296945729913,36.165078131059985,0.82899248073530318,16.098230224924695,14.205728964201249,null,null,null,null,null,null,null,null,null,null,null,null,null,null,null,"Unimproved","N/A","N/A","N/A","N/A","N/A","N/A","N/A","N/A","N/A","N/A","N/A","N/A","N/A","N/A","N/A","N/A","N/A","N/A","N/A","N/A","N/A","N/A","N/A","N/A","N/A","N/A","N/A","N/A","N/A","N/A","N/A","N/A","N/A","N/A","N/A","N/A"]
[null,"Open defecation",{"$f":"C157","v":60.100932967156432},{"$f":"D157","v":31.569703527259911},18.448449872426789,7.140116181349712,2.0928640059852115,7.1022339773736789,2.8912511077857377,1.181947165712723,0.41785953898962169,0.46260027609260851,65.451227823491308,40.566801783712855,28.504119077453279,19.637400183963543,13.08255648833482,20.208869179416432,0.16882309336775808,20.761014505458455,22.203478055050734,18.119050392188804,4.2473694181505417,44.112194062728229,12.285349806400509,36.11435611698014,33.611402457534986,2.7041628144922503,47.061553552680721,19.140072006227758,11.502789282533325,25.055420755107743,40.13129506015801,8.9543209761766782,45.587923269694755,9.9349299457249129E-2,19.252472960381663,36.791351813494529,null,null,null,null,null,null,null,null,null,null,null,null,null,null,null,"Open defecation","N/A","N/A","N/A","N/A","N/A","N/A","N/A","N/A","N/A","N/A","N/A","N/A","N/A","N/A","N/A","N/A","N/A","N/A","N/A","N/A","N/A","N/A","N/A","N/A","N/A","N/A","N/A","N/A","N/A","N/A","N/A","N/A","N/A","N/A","N/A","N/A"]
["Shared among Improved Sanitation","Yes","N/A","N/A","N/A","N/A","N/A","N/A","N/A","N/A","N/A","N/A","N/A","N/A","N/A","N/A","N/A","N/A","N/A","N/A","N/A","N/A","N/A","N/A","N/A","N/A","N/A","N/A","N/A","N/A","N/A","N/A","N/A","N/A","N/A","N/A","N/A","N/A",null,null,null,null,null,null,null,null,null,null,null,null,null,null,"Shared among improved sanitation facilities","Yes","N/A","N/A","N/A","N/A","N/A","N/A","N/A","N/A","N/A","N/A","N/A","N/A","N/A","N/A","N/A","N/A","N/A","N/A","N/A","N/A","N/A","N/A","N/A","N/A","N/A","N/A","N/A","N/A","N/A","N/A","N/A","N/A","N/A","N/A","N/A","N/A"]
[null,"No","N/A","N/A","N/A","N/A","N/A","N/A","N/A","N/A","N/A","N/A","N/A","N/A","N/A","N/A","N/A","N/A","N/A","N/A","N/A","N/A","N/A","N/A","N/A","N/A","N/A","N/A","N/A","N/A","N/A","N/A","N/A","N/A","N/A","N/A","N/A","N/A",null,null,null,null,null,null,null,null,null,null,null,null,null,null,null,"No","N/A","N/A","N/A","N/A","N/A","N/A","N/A","N/A","N/A","N/A","N/A","N/A","N/A","N/A","N/A","N/A","N/A","N/A","N/A","N/A","N/A","N/A","N/A","N/A","N/A","N/A","N/A","N/A","N/A","N/A","N/A","N/A","N/A","N/A","N/A","N/A"]
["Manually calculated ratios","Improved latrines"]
[null,"Other"]
[null,"Other"]
[null,null,"NATIONAL wealth index quintile",null,null,null,null,"URBAN wealth index quintile",null,null,null,null,"RURAL wealth index quintile",null,null,null,null,"SUB-REGIONS:",null,null,null,null,null,null,null,null,null,null,null,null,null,null,null,null,null,null,null,null,null,null,null,null,null,null,null,null,null,null,null,null,null,null,"Raw numbers of respondents:","Use of sanitation facilities","NATIONAL wealth index quintile",null,null,null,null,"URBAN wealth index quintile",null,null,null,null,"RURAL wealth index quintile",null,null,null,null,"SUB-REGIONS:"]
["Percentage based on weighted population",null,"Poorest","Poor","Middle","Rich","Richest","Poorest","Poor","Middle","Rich","Richest","Poorest","Poor","Middle","Rich","Richest","Abyan","Aden","Al-Baidha","Al-Hodiedah","Al-Jawf","Al-Mhrah","Al-Mhweit","Aldhalae","Amran","Dhamar","Hadramout","Hajjah","Ibb","lahj","Mareb","Reimah","Sadah","Sanaa","Sanaa City","Shabwah","Taiz",null,null,null,null,null,null,null,null,null,null,null,null,null,null,"Sanitation data, raw numbers (weighted)",null,"Poorest","Poor","Middle","Rich","Richest","Poorest","Poor","Middle","Rich","Richest","Poorest","Poor","Middle","Rich","Richest","Abyan","Aden","Al-Baidha","Al-Hodiedah","Al-Jawf","Al-Mhrah","Al-Mhweit","Aldhalae","Amran","Dhamar","Hadramout","Hajjah","Ibb","lahj","Mareb","Reimah","Sadah","Sanaa","Sanaa City","Shabwah","Taiz"]
["Sanitation type","Sewer connection",0.87464150880310598,2.7072132910443694,8.4752366809751418,41.322733558608483,67.346226396888682,37.215825524228627,60.029956441436283,69.684049997812025,78.097686735342492,77.421905471887982,0.36807640034774902,1.9355177901685703,3.0073435829444439,5.5853841148876242,19.845397013566345,21.315063737366856,81.683582903090596,28.191200161451,18.999714865876648,4.6516289346922486,84.440002478121784,8.347515321600838,10.706694237164237,7.4448036836294609,12.436083622767361,46.948617983957874,4.6621137992997683,20.277118931747808,11.928710856303693,13.997189080447662,0.73985403022720575,8.0653673405314468,2.0584899038292854,70.934087086338266,23.925645180194575,21.311453289907043,null,null,null,null,null,null,null,null,null,null,null,null,null,null,"Sanitation type","Sewer connection","N/A","N/A","N/A","N/A","N/A","N/A","N/A","N/A","N/A","N/A","N/A","N/A","N/A","N/A","N/A","N/A","N/A","N/A","N/A","N/A","N/A","N/A","N/A","N/A","N/A","N/A","N/A","N/A","N/A","N/A","N/A","N/A","N/A","N/A","N/A","N/A"]
[null,"Septic tank connection",10.121054421090545,26.614929187775328,38.573681882137436,33.642926184171415,23.437323071937129,33.60786938798325,24.838788518750839,20.104022346510551,15.489195166468306,18.51868691201609,7.853239823899667,18.793655696638542,30.855004952760449,38.12204005228255,45.614704754007811,44.999288593805744,16.011331411721688,35.489843894975174,17.8331585977716,46.581148202239596,5.1405504112205662,6.7388342071109957,41.414632713996433,29.998934088041796,23.805853818073221,37.868764970840708,20.968308616161025,40.556669781062098,19.633203074875993,41.891120589001638,15.008007920716834,28.254505539237972,16.102617124725846,27.989274492328114,33.99018498385383,22.269171668923068,null,null,null,null,null,null,null,null,null,null,null,null,null,null,null,"Septic tank connection","N/A","N/A","N/A","N/A","N/A","N/A","N/A","N/A","N/A","N/A","N/A","N/A","N/A","N/A","N/A","N/A","N/A","N/A","N/A","N/A","N/A","N/A","N/A","N/A","N/A","N/A","N/A","N/A","N/A","N/A","N/A","N/A","N/A","N/A","N/A","N/A"]
[null,"Improved latrines","N/A","N/A","N/A","N/A","N/A","N/A","N/A","N/A","N/A","N/A","N/A","N/A","N/A","N/A","N/A","N/A","N/A","N/A","N/A","N/A","N/A","N/A","N/A","N/A","N/A","N/A","N/A","N/A","N/A","N/A","N/A","N/A","N/A","N/A","N/A","N/A",null,null,null,null,null,null,null,null,null,null,null,null,null,null,null,"Improved latrines","N/A","N/A","N/A","N/A","N/A","N/A","N/A","N/A","N/A","N/A","N/A","N/A","N/A","N/A","N/A","N/A","N/A","N/A","N/A","N/A","N/A","N/A","N/A","N/A","N/A","N/A","N/A","N/A","N/A","N/A","N/A","N/A","N/A","N/A","N/A","N/A"]
[null,"Unimproved facilities","N/A","N/A","N/A","N/A","N/A","N/A","N/A","N/A","N/A","N/A","N/A","N/A","N/A","N/A","N/A","N/A","N/A","N/A","N/A","N/A","N/A","N/A","N/A","N/A","N/A","N/A","N/A","N/A","N/A","N/A","N/A","N/A","N/A","N/A","N/A","N/A",null,null,null,null,null,null,null,null,null,null,null,null,null,null,null,"Unimproved facilities","N/A","N/A","N/A","N/A","N/A","N/A","N/A","N/A","N/A","N/A","N/A","N/A","N/A","N/A","N/A","N/A","N/A","N/A","N/A","N/A","N/A","N/A","N/A","N/A","N/A","N/A","N/A","N/A","N/A","N/A","N/A","N/A","N/A","N/A","N/A","N/A"]
[null,"Open defecation",59.892484654333941,31.499035679423603,18.397009288413397,7.1273444528741976,2.0919185858341054,7.0998733572314396,2.8860247518298232,1.181947165712723,0.41785953898962169,0.46260027609260851,65.149519888709094,40.527400681286608,28.412776633179419,19.571610793831312,13.050720787606638,20.208869179416432,0.16882309336775808,20.725653981268504,22.154654714350944,18.053233775479374,4.2195082739159053,44.101190378200471,12.253676979559589,36.089764962323493,33.601223871058025,2.7028124553294024,46.354781486205653,19.129523619759752,11.488121526088459,25.036011380122545,40.13129506015801,8.9038818902520269,45.37333354893395,9.922408678986766E-2,19.234419566175077,36.781298551115874,null,null,null,null,null,null,null,null,null,null,null,null,null,null,null,"Open defecation","N/A","N/A","N/A","N/A","N/A","N/A","N/A","N/A","N/A","N/A","N/A","N/A","N/A","N/A","N/A","N/A","N/A","N/A","N/A","N/A","N/A","N/A","N/A","N/A","N/A","N/A","N/A","N/A","N/A","N/A","N/A","N/A","N/A","N/A","N/A","N/A"]
["Septic tank emptying practices","Not emptied/treated and disposed in situ","N/A","N/A","N/A","N/A","N/A","N/A","N/A","N/A","N/A","N/A","N/A","N/A","N/A","N/A","N/A","N/A","N/A","N/A","N/A","N/A","N/A","N/A","N/A","N/A","N/A","N/A","N/A","N/A","N/A","N/A","N/A","N/A","N/A","N/A","N/A","N/A",null,null,null,null,null,null,null,null,null,null,null,null,null,null,"Septic tank emptying practices","Not emptied/treated and disposed in situ","N/A","N/A","N/A","N/A","N/A","N/A","N/A","N/A","N/A","N/A","N/A","N/A","N/A","N/A","N/A","N/A","N/A","N/A","N/A","N/A","N/A","N/A","N/A","N/A","N/A","N/A","N/A","N/A","N/A","N/A","N/A","N/A","N/A","N/A","N/A","N/A"]
[null,"Emptied and buried on site","N/A","N/A","N/A","N/A","N/A","N/A","N/A","N/A","N/A","N/A","N/A","N/A","N/A","N/A","N/A","N/A","N/A","N/A","N/A","N/A","N/A","N/A","N/A","N/A","N/A","N/A","N/A","N/A","N/A","N/A","N/A","N/A","N/A","N/A","N/A","N/A",null,null,null,null,null,null,null,null,null,null,null,null,null,null,null,"Emptied and buried on site","N/A","N/A","N/A","N/A","N/A","N/A","N/A","N/A","N/A","N/A","N/A","N/A","N/A","N/A","N/A","N/A","N/A","N/A","N/A","N/A","N/A","N/A","N/A","N/A","N/A","N/A","N/A","N/A","N/A","N/A","N/A","N/A","N/A","N/A","N/A","N/A"]
[null,"Emptied and discharged locally","N/A","N/A","N/A","N/A","N/A","N/A","N/A","N/A","N/A","N/A","N/A","N/A","N/A","N/A","N/A","N/A","N/A","N/A","N/A","N/A","N/A","N/A","N/A","N/A","N/A","N/A","N/A","N/A","N/A","N/A","N/A","N/A","N/A","N/A","N/A","N/A",null,null,null,null,null,null,null,null,null,null,null,null,null,null,null,"Emptied and discharged locally","N/A","N/A","N/A","N/A","N/A","N/A","N/A","N/A","N/A","N/A","N/A","N/A","N/A","N/A","N/A","N/A","N/A","N/A","N/A","N/A","N/A","N/A","N/A","N/A","N/A","N/A","N/A","N/A","N/A","N/A","N/A","N/A","N/A","N/A","N/A","N/A"]
[null,"Emptied and removed offsite","N/A","N/A","N/A","N/A","N/A","N/A","N/A","N/A","N/A","N/A","N/A","N/A","N/A","N/A","N/A","N/A","N/A","N/A","N/A","N/A","N/A","N/A","N/A","N/A","N/A","N/A","N/A","N/A","N/A","N/A","N/A","N/A","N/A","N/A","N/A","N/A",null,null,null,null,null,null,null,null,null,null,null,null,null,null,null,"Emptied and removed offsite","N/A","N/A","N/A","N/A","N/A","N/A","N/A","N/A","N/A","N/A","N/A","N/A","N/A","N/A","N/A","N/A","N/A","N/A","N/A","N/A","N/A","N/A","N/A","N/A","N/A","N/A","N/A","N/A","N/A","N/A","N/A","N/A","N/A","N/A","N/A","N/A"]
["Latrine emptying practices","Not emptied/treated and disposed in situ","N/A","N/A","N/A","N/A","N/A","N/A","N/A","N/A","N/A","N/A","N/A","N/A","N/A","N/A","N/A","N/A","N/A","N/A","N/A","N/A","N/A","N/A","N/A","N/A","N/A","N/A","N/A","N/A","N/A","N/A","N/A","N/A","N/A","N/A","N/A","N/A",null,null,null,null,null,null,null,null,null,null,null,null,null,null,"Latrine emptying practices","Not emptied/treated and disposed in situ","N/A","N/A","N/A","N/A","N/A","N/A","N/A","N/A","N/A","N/A","N/A","N/A","N/A","N/A","N/A","N/A","N/A","N/A","N/A","N/A","N/A","N/A","N/A","N/A","N/A","N/A","N/A","N/A","N/A","N/A","N/A","N/A","N/A","N/A","N/A","N/A"]
[null,"Emptied and buried on site","N/A","N/A","N/A","N/A","N/A","N/A","N/A","N/A","N/A","N/A","N/A","N/A","N/A","N/A","N/A","N/A","N/A","N/A","N/A","N/A","N/A","N/A","N/A","N/A","N/A","N/A","N/A","N/A","N/A","N/A","N/A","N/A","N/A","N/A","N/A","N/A",null,null,null,null,null,null,null,null,null,null,null,null,null,null,null,"Emptied and buried on site","N/A","N/A","N/A","N/A","N/A","N/A","N/A","N/A","N/A","N/A","N/A","N/A","N/A","N/A","N/A","N/A","N/A","N/A","N/A","N/A","N/A","N/A","N/A","N/A","N/A","N/A","N/A","N/A","N/A","N/A","N/A","N/A","N/A","N/A","N/A","N/A"]
[null,"Emptied and discharged locally","N/A","N/A","N/A","N/A","N/A","N/A","N/A","N/A","N/A","N/A","N/A","N/A","N/A","N/A","N/A","N/A","N/A","N/A","N/A","N/A","N/A","N/A","N/A","N/A","N/A","N/A","N/A","N/A","N/A","N/A","N/A","N/A","N/A","N/A","N/A","N/A",null,null,null,null,null,null,null,null,null,null,null,null,null,null,null,"Emptied and discharged locally","N/A","N/A","N/A","N/A","N/A","N/A","N/A","N/A","N/A","N/A","N/A","N/A","N/A","N/A","N/A","N/A","N/A","N/A","N/A","N/A","N/A","N/A","N/A","N/A","N/A","N/A","N/A","N/A","N/A","N/A","N/A","N/A","N/A","N/A","N/A","N/A"]
[null,"Emptied and removed offsite","N/A","N/A","N/A","N/A","N/A","N/A","N/A","N/A","N/A","N/A","N/A","N/A","N/A","N/A","N/A","N/A","N/A","N/A","N/A","N/A","N/A","N/A","N/A","N/A","N/A","N/A","N/A","N/A","N/A","N/A","N/A","N/A","N/A","N/A","N/A","N/A",null,null,null,null,null,null,null,null,null,null,null,null,null,null,null,"Emptied and removed offsite","N/A","N/A","N/A","N/A","N/A","N/A","N/A","N/A","N/A","N/A","N/A","N/A","N/A","N/A","N/A","N/A","N/A","N/A","N/A","N/A","N/A","N/A","N/A","N/A","N/A","N/A","N/A","N/A","N/A","N/A","N/A","N/A","N/A","N/A","N/A","N/A"]
["Shared among improved sanitation facilities","Yes","N/A","N/A","N/A","N/A","N/A","N/A","N/A","N/A","N/A","N/A","N/A","N/A","N/A","N/A","N/A","N/A","N/A","N/A","N/A","N/A","N/A","N/A","N/A","N/A","N/A","N/A","N/A","N/A","N/A","N/A","N/A","N/A","N/A","N/A","N/A","N/A",null,null,null,null,null,null,null,null,null,null,null,null,null,null,"Shared among improved sanitation facilities","Yes","N/A","N/A","N/A","N/A","N/A","N/A","N/A","N/A","N/A","N/A","N/A","N/A","N/A","N/A","N/A","N/A","N/A","N/A","N/A","N/A","N/A","N/A","N/A","N/A","N/A","N/A","N/A","N/A","N/A","N/A","N/A","N/A","N/A","N/A","N/A","N/A"]
[null,"No","N/A","N/A","N/A","N/A","N/A","N/A","N/A","N/A","N/A","N/A","N/A","N/A","N/A","N/A","N/A","N/A","N/A","N/A","N/A","N/A","N/A","N/A","N/A","N/A","N/A","N/A","N/A","N/A","N/A","N/A","N/A","N/A","N/A","N/A","N/A","N/A",null,null,null,null,null,null,null,null,null,null,null,null,null,null,null,"No","N/A","N/A","N/A","N/A","N/A","N/A","N/A","N/A","N/A","N/A","N/A","N/A","N/A","N/A","N/A","N/A","N/A","N/A","N/A","N/A","N/A","N/A","N/A","N/A","N/A","N/A","N/A","N/A","N/A","N/A","N/A","N/A","N/A","N/A","N/A","N/A"]
[null,"DK/missing","N/A","N/A","N/A","N/A","N/A","N/A","N/A","N/A","N/A","N/A","N/A","N/A","N/A","N/A","N/A","N/A","N/A","N/A","N/A","N/A","N/A","N/A","N/A","N/A","N/A","N/A","N/A","N/A","N/A","N/A","N/A","N/A","N/A","N/A","N/A","N/A",null,null,null,null,null,null,null,null,null,null,null,null,null,null,null,"DK/missing","N/A","N/A","N/A","N/A","N/A","N/A","N/A","N/A","N/A","N/A","N/A","N/A","N/A","N/A","N/A","N/A","N/A","N/A","N/A","N/A","N/A","N/A","N/A","N/A","N/A","N/A","N/A","N/A","N/A","N/A","N/A","N/A","N/A","N/A","N/A","N/A"]
["Shared among all sanitation facilities","Yes",17.672345826021751,14.407274008410312,10.758395891536884,6.7906322451007695,4.252169672322978,9.6887257469432182,4.4224730350859067,6.7546521742787036,4.0834236544996783,2.3775280146298434,15.936195938586959,16.839281727142087,14.255601275866262,10.49824804802393,7.3169412386549242,9.8474900951253979,3.7651546124266786,4.5919142282948737,11.694523929001051,20.837363007399912,7.5326982758898184,18.85385791861907,11.623528586644733,17.871643170304797,19.789365979154148,11.177459231850467,13.44200314949539,11.441498122425386,4.5349014467006805,7.7759279747995267,13.755061180736632,12.78271228735143,9.7275537337007592,1.7847235055742618,12.958625767156947,2.0408518378268776,null,null,null,null,null,null,null,null,null,null,null,null,null,null,"Shared among all sanitation facilities","Yes","N/A","N/A","N/A","N/A","N/A","N/A","N/A","N/A","N/A","N/A","N/A","N/A","N/A","N/A","N/A","N/A","N/A","N/A","N/A","N/A","N/A","N/A","N/A","N/A","N/A","N/A","N/A","N/A","N/A","N/A","N/A","N/A","N/A","N/A","N/A","N/A"]
[null,"No",82.223121694518724,85.413489902379183,88.855447271102832,93.085113467445908,95.57068915930293,90.275496354631485,95.391390508707744,93.245347825721325,95.663961158405456,97.622471985370154,83.889907923505319,83.050528978469245,85.564810559746888,89.010656248135277,92.390544685519586,90.152509904874591,96.219053174011577,95.221144132643843,88.150565493022128,78.634908308805535,91.553481223582025,81.146142081380987,87.904772490821316,82.021812919816838,80.085555340168384,88.470913581963757,86.411333769263194,88.558501877574571,95.123663583479313,91.939894414738887,85.974930769327898,86.306952991748361,89.41074961113749,98.089118552103585,87.04137423284304,97.874524271629426,null,null,null,null,null,null,null,null,null,null,null,null,null,null,null,"No","N/A","N/A","N/A","N/A","N/A","N/A","N/A","N/A","N/A","N/A","N/A","N/A","N/A","N/A","N/A","N/A","N/A","N/A","N/A","N/A","N/A","N/A","N/A","N/A","N/A","N/A","N/A","N/A","N/A","N/A","N/A","N/A","N/A","N/A","N/A","N/A"]
["Type of toilet facility","Flush to piped sewer system",0.87768558933986707,2.7132869035466376,8.49893461566041,41.396781156050437,67.376662801043082,37.228199326256103,60.138665807210799,69.684049997812025,78.097686735342492,77.421905471887982,0.36978096502881946,1.9373995179235275,3.0170117022269736,5.6041592181963669,19.893807529003606,21.315063737366856,81.683582903090596,28.239297829015729,19.041585504984138,4.6685873634411719,84.997554433348228,8.349598109489369,10.73436848328465,7.4498764880371269,12.439850799614097,46.972074105137381,4.7331971201229628,20.288300124296107,11.943941146577361,14.008040517103293,0.73985403022720575,8.1110563738449173,2.0682253748449924,71.023600092098221,23.948101750958198,21.317278250961532,null,null,null,null,null,null,null,null,null,null,null,null,null,null,"Type of toilet facility","Flush to piped sewer system",204.561992,633.23398299999974,1982.6392949999997,9663.6799549999923,15751.661848999967,2687.3152899999991,4330.2927640000034,5029.5534520000037,5630.8010190000041,5585.8380259999885,59.554028000000002,312.94749700000006,486.41020600000002,903.39040499999953,3209.6743870000028,528.89900900000021,3116.5455980000015,1326.5489789999997,2741.7585400000025,43.699690999999987,381.04489499999983,258.90856700000006,323.1508079999997,338.13864499999994,1034.2719670000001,3077.6838479999979,331.38808099999994,2602.779833999999,386.86349900000005,120.60753500000004,19.884550000000004,294.71346999999997,125.962086,7338.9500140000036,591.98506099999997,3251.9923969999973]
[null,"Flush to septic tank",10.156279486977143,26.674639579711052,38.681539235061294,33.703212076229391,23.447915318533262,33.619043589187022,24.883769543335042,20.104022346510551,15.489195166468306,18.51868691201609,7.8896082387807844,18.81192705726416,30.954198762885156,38.250186161054884,45.72597646941621,44.999288593805744,16.011331411721688,35.550393949737256,17.87245843743051,46.750968945450495,5.1744931379922621,6.7405156131017181,41.521679643078926,30.019375019936579,23.81306516081106,37.88768468303283,21.288012740222985,40.579033507164716,19.658270274964444,41.923597026870162,15.008007920716834,28.414562854712059,16.17877322440026,28.024594663373659,34.022088114933879,22.27525839871679,null,null,null,null,null,null,null,null,null,null,null,null,null,null,null,"Flush to septic tank",2367.1218810000028,6225.3970430000008,9023.6651000000002,7867.6903340000063,5481.7739230000034,2426.7886039999985,1791.7591910000003,1451.0387239999998,1116.7626030000004,1336.0867950000002,1270.6385519999992,3038.684294000001,4990.5136880000073,6165.9295930000044,7377.4462370000037,1116.5849389999994,610.89441300000021,1669.9897809999986,2573.4183499999999,437.60622599999999,23.197305,209.01332200000002,1249.9817149999999,1362.5341049999988,1979.8618280000001,2482.4604279999999,1490.4500090000004,5205.8718299999991,636.73013200000025,360.95710099999962,403.35994899999974,1032.4369640000002,985.34330399999965,2895.8134920000011,841.00894999999957,3398.1341380000013]
[null,"Pit",17.460746257360896,23.704226236269889,23.493141760445447,11.197612622849196,5.4652912649243257,12.94798996213874,7.160517542993003,7.4556994861752326,4.7592808785613459,3.2282262203339922,15.77543400764416,23.567644766078804,23.326143318629864,25.370856029993323,13.706810444416814,5.6005390173412062,0.59591292316525868,5.6961422179434802,34.946376368607872,11.153530008286067,4.9919160342734896,30.354161813972802,17.566350787695058,21.023581518758345,16.401522618725043,2.7710214272430966,11.820990207591006,11.343290734046583,40.61055946839307,14.790370435725103,11.357729865336507,27.657604424472293,29.651445515201786,0.14078078601337046,11.987868368681365,14.840630515261713,null,null,null,null,null,null,null,null,null,null,null,null,null,null,null,"Pit",4069.5723840000019,5532.154220000004,5480.5017480000033,2613.9748460000005,1277.7038269999998,934.64986299999964,515.59403399999997,538.12657400000001,343.14157999999998,232.91016499999998,2540.6679290000006,3806.8737870000004,3760.6994260000047,4089.7817159999986,2211.4619509999984,138.96836400000007,22.73639,267.57788700000003,5031.8565029999972,104.40113399999997,22.378809999999998,941.23722299999974,528.8229540000001,954.22862099999952,1363.6526139999992,181.56166300000001,827.62985799999956,1455.2273080000002,1315.3734549999999,127.34330100000007,305.25392599999981,1004.9330440000008,1805.8756920000005,14.547040000000001,296.334092,2263.9671459999995]
[null,"Latrine",0.86819740966985848,1.7638173064749547,2.0011228818834916,1.4849891018479786,0.44322147071841239,1.5845751191521402,1.9918893081981588,0.23528077924052718,0.81549823297344393,0.11978705303229034,0.90424181288412864,1.1541926609511104,1.7197907736287135,2.2225295482699909,1.3713654354337623,2.7984503296577241,0,9.1777816895277109,1.4665414971869926,1.4607416599386369,0,0.3178356883952182,1.6800092390742605,2.6420032218533742,2.8246263343367359,0,0.20228392482163571,0.81717326587188865,1.3952512246349131,0,0.20571012029631341,1.9558756903089292,0.22554760430735463,0,1.3703455289217219,0.6692837097319686,null,null,null,null,null,null,null,null,null,null,null,null,null,null,null,"Latrine",202.35058400000005,411.64428899999984,466.82378900000026,346.65640700000006,103.61858900000001,114.382458,143.42625899999999,16.981752,58.796982,8.6424000000000003,145.63010899999998,186.43635500000005,277.26898899999998,358.27173900000008,221.25661500000001,69.439042000000001,0,431.12888299999997,211.16427900000002,13.673078,0,9.8556099999999986,50.575527000000008,119.91653700000001,234.84460399999998,0,14.162621999999999,104.83490900000001,45.192098999999999,0,5.5287300000000004,71.06631800000001,13.736630000000002,0,33.874254000000001,102.10053600000001]
[null,"No facility/bush/field",60.100932967156432,31.569703527259911,18.448449872426789,7.140116181349712,2.0928640059852115,7.1022339773736789,2.8912511077857377,1.181947165712723,0.41785953898962169,0.46260027609260851,65.451227823491308,40.566801783712855,28.504119077453279,19.637400183963543,13.08255648833482,20.208869179416432,0.16882309336775808,20.761014505458455,22.203478055050734,18.119050392188804,4.2473694181505417,44.112194062728229,12.285349806400509,36.11435611698014,33.611402457534986,2.7041628144922503,47.061553552680721,19.140072006227758,11.502789282533325,25.055420755107743,40.13129506015801,8.9543209761766782,45.587923269694755,9.9349299457249129E-2,19.252472960381663,36.791351813494529,null,null,null,null,null,null,null,null,null,null,null,null,null,null,null,"No facility/bush/field",14007.711552000006,7367.8198499999935,4303.6713779999936,1666.7913710000007,489.280483,512.67432499999984,208.18492699999996,85.308853999999997,30.127447,33.375698999999997,10541.062475000012,6552.7419419999978,4595.505685999995,3165.5486959999998,2110.7445829999997,501.4505709999998,6.4412560000000001,975.25451099999987,3197.0329129999991,169.60096100000004,19.041,1367.8532549999998,369.84203800000006,1639.1760939999983,2794.5135269999987,177.18098200000003,3294.947901999999,2455.4739989999975,372.57461799999999,215.724143,1078.5813289999992,325.35330599999998,2776.4623630000015,10.265877,475.91147299999977,5612.5925159999997]
[null,"Bucket toilet",9.9999048375148298,13.25155509050289,8.5468028423041371,4.8043341936241299,1.0384989342696409,7.2755667973219902,2.6595532719757031,1.1402630935514761,0.33330043100633649,0.1954809276141235,9.223356643570165,13.364636563213688,12.22074716484785,8.5164908105423329,5.9316106399844175,4.6038855136047605,1.5403496686547848,0.32928453734455548,4.4695601367397115,17.507089876939858,0.58866697623545416,10.069101789925741,13.952672558420097,2.2222093055848577,9.9811846300468989,9.514189009794169,14.680005394530482,7.6960159066930434,14.449450079059892,3.6694317895112643,30.985273381436109,24.469036757082392,5.9074756807959385,0.66870873356350979,9.074697030501877,3.9775105280059329,null,null,null,null,null,null,null,null,null,null,null,null,null,null,null,"Bucket toilet",2330.6756750000027,3092.6825320000044,1993.8060389999998,1121.5255569999997,242.78560799999997,525.18634400000019,191.50149300000004,82.300242000000011,24.030780999999998,14.103564,1485.4416310000004,2158.7852800000001,1970.259559000001,1372.8582260000003,957.0082910000001,114.23801099999996,58.770315999999994,15.468234000000001,643.56272600000023,163.87278600000002,2.6390000000000002,312.22780799999992,420.03564700000015,100.86272500000001,829.85396099999991,623.38456199999996,1027.7997500000006,987.31953299999975,468.01677499999983,31.593363999999998,832.76996900000029,889.07713099999955,359.78572200000013,69.098440000000011,224.32195800000002,606.77699300000006]
[null,"Other",0.53625345198085517,0.32277135623493108,0.33000879221837265,0.27295466804854285,0.13554620452586394,0.24239122857024559,0.27435341850131462,0.1987371309973931,8.7179016658517627E-2,5.3313139022889103E-2,0.38635050860055359,0.59739765085596142,0.25798920032844025,0.39837804797985943,0.28787299341065981,0.47390362880721482,0,0.24608527097293464,0,0.34003175375502231,0,5.6592922387209879E-2,2.2595694820464733,0.52859832884940861,0.92834799893117059,0.15086796030034086,0.21395706002995921,0.13611445569970132,0.43973852383690365,0.55313947568239241,1.5721296218292924,0.43754292340254625,0.38060933075462566,4.2966425494023644E-2,0.34442624562131502,0.1286867838275243,null,null,null,null,null,null,null,null,null,null,null,null,null,null,null,"Other",124.98447700000001,75.329221999999987,76.984754999999993,63.718638999999996,31.688686999999998,17.496995999999999,19.754854999999999,14.344158,6.2855600000000003,3.846438,62.222589000000006,96.497443000000004,41.593667000000003,64.218536999999998,46.445536999999987,11.759155999999999,0,11.559925,0,3.1828220000000003,0,1.7548619999999999,68.022790999999998,23.992280000000001,77.184551999999996,9.8851049999999994,14.979900000000001,17.462082000000002,14.243103000000001,4.7624639999999996,42.253050999999992,15.898027000000001,23.180425999999997,4.4397700000000002,8.5140440000000002,19.631419999999999]
[null,null,null,null,null,null,null,null,null,null,null,null,null,null,null,null,null,null,null,null,null,null,null,null,null,null,null,null,null,null,null,null,null,null,null,null,null,null,null,null,null,null,null,null,null,null,null,null,null,null,null,null,null,"Total",23306.978545000042,23338.26113899994,23328.09210400001,23344.037109000143,23378.512966000017,7218.4938800000036,7200.5135230000205,7217.6537560000088,7209.9459720000004,7214.8030869999911,16105.217313000025,16152.966597999983,16122.251220999964,16119.998911999955,16134.037600999958,2481.3390920000011,3815.3879729999985,4697.5281999999925,14398.793311000005,936.03669799999955,448.30100999999991,3100.8506469999907,3010.4314800000006,4538.8490070000043,8314.1830529999988,6552.1565879999935,7001.3581220000169,12828.969495000021,3238.9936810000031,860.98790800000006,2687.6315039999918,3633.4782600000071,6090.3462230000196,10333.114633000001,2471.9498319999989,15255.195146]
[]
[]
[]
[]
[]
[]
[]
[]
[]
[]
[]
[]
[]
[]
[]
[]
[]
[]
[]
[]
[]
[]
[]
[]
[]
[]
[]
[]
[]
[]
[]
[]
[]
[]
[]
[]
[]
[]
[]
[]
[]
[]
[]
[]
[]
[]
[]
[{"$f":"A1026","v":"Yemen"}]
[{"$f":"A1034","v":"2013"}]
["Access to hygiene facilities "]
[" by wealth quintile and sub-national region"]
["Notes:"]
["WHO/UNICEF JMP customised wealth index excludes water,"]
[" sanitation and hygiene assets."]
["Survey used for analysis:",{"$f":"A1025","v":"DHS13"}]
[]
[]
[]
[]
["Access to handwashing",null,"NATIONAL wealth index quintile",null,null,null,null,"URBAN wealth index quintile",null,null,null,null,"RURAL wealth index quintile",null,null,null,null,"SUB-REGIONS:",null,null,null,null,null,null,null,null,null,null,null,null,null,null,null,null,null,null,null,null,null,null,null,null,null,null,null,null,null,null,null,null,null,null,"Raw numbers of respondents:","Access to handwashing","NATIONAL wealth index quintile",null,null,null,null,"URBAN wealth index quintile",null,null,null,null,"RURAL wealth index quintile",null,null,null,null,"SUB-REGIONS:"]
["Weighted percentage (used in graphs)",null,"Poorest","Poor","Middle","Rich","Richest","Poorest","Poor","Middle","Rich","Richest","Poorest","Poor","Middle","Rich","Richest","Abyan","Aden","Al-Baidha","Al-Hodiedah","Al-Jawf","Al-Mhrah","Al-Mhweit","Aldhalae","Amran","Dhamar","Hadramout","Hajjah","Ibb","lahj","Mareb","Reimah","Sadah","Sanaa","Sanaa City","Shabwah","Taiz",null,null,null,null,null,null,null,null,null,null,null,null,null,null,"Hygiene data, raw numbers (weighted)",null,"Poorest","Poor","Middle","Rich","Richest","Poorest","Poor","Middle","Rich","Richest","Poorest","Poor","Middle","Rich","Richest","Abyan","Aden","Al-Baidha","Al-Hodiedah","Al-Jawf","Al-Mhrah","Al-Mhweit","Aldhalae","Amran","Dhamar","Hadramout","Hajjah","Ibb","lahj","Mareb","Reimah","Sadah","Sanaa","Sanaa City","Shabwah","Taiz"]
["Hygiene ladder","Basic",19.547737979602374,31.994326751458935,45.55945627119371,58.460576277453058,76.016692155433304,56.668826768087754,61.568099718395843,68.185291752541531,79.593387871582692,82.05328388010085,18.159781719983027,24.164642133879177,36.063507544791499,44.569004712905283,57.018629452400319,45.843710530994677,76.79580158071488,56.322886723216868,55.027223797089121,52.605296347254139,71.698776364321049,19.598174037134605,79.981760669566668,45.587904889935963,31.199773389440633,39.35772523117663,27.131483245618522,32.572130627802501,45.534598409446311,13.009908354073627,39.565059888548035,38.811547575287996,32.283017273150442,70.481901717754525,27.373658331548317,55.186559033509127,null,null,null,null,null,null,null,null,null,null,null,null,null,null,"Hygiene ladder","Basic",4460.3271350000005,7319.3665570000012,10535.301093999999,13413.583874999984,17343.223697999958,3920.993497999998,4357.7866010000062,4711.7283860000061,5610.2872890000017,5743.2982499999889,2865.5879750000008,3828.7228880000052,5756.6288300000042,7124.1915570000056,9152.5770849999917,1135.1740369999995,2915.1634320000007,2641.7616830000002,7512.6312499999995,492.91149000000047,315.61096700000007,599.80484800000033,2389.5077360000023,2055.3722229999985,2571.5929469999987,2423.331415000001,1894.0815380000006,4166.727431999997,1463.5273590000011,111.20952300000002,1055.6297489999993,1377.3538000000003,1957.4565429999998,6915.3191009999973,677.29821600000014,8400.3370699999923]
[null,"Limited",43.081054142822126,31.424365061277783,25.541000259454201,23.221925593316762,14.796876847267146,25.587431358416612,27.614440074882602,20.745773841035778,17.263258564382213,14.597960600974744,43.34128324988481,36.576488883313516,32.058481434638061,25.506784767359669,14.971298266650503,13.858312742597171,12.59039844221177,25.315889188269601,37.33900840689077,17.106090338936493,10.950587283897837,25.848760503178003,17.124578320167604,40.72479834316205,51.430142413190353,6.5847871226813677,53.708202452761476,31.37101294753316,15.269800146176543,24.676146650814768,15.080287235934076,24.18302608121979,35.983074743425014,28.873454904277114,15.933412602504987,9.1811541776247765,null,null,null,null,null,null,null,null,null,null,null,null,null,null,null,"Limited",9830.0680620000003,7188.9759860000067,5906.1751390000036,5328.1932289999959,3375.9104470000029,1770.4293120000002,1954.5485000000001,1433.5709209999998,1216.8327379999998,1021.7804529999999,6839.1934450000072,5795.2954310000041,5117.3274880000126,4077.1657759999989,2403.1787990000016,343.15714499999996,477.93067299999996,1187.4133219999997,5097.7349399999939,160.28402199999999,48.203409000000001,791.10491799999954,511.60804700000006,1836.1146340000012,4239.0497470000046,405.43810400000018,3749.4343299999987,4013.0767529999998,490.78659000000016,210.93326899999991,402.35500399999989,858.21321100000046,2181.8067530000017,2832.9138310000017,394.23564799999991,1397.5285129999995]
[null,"No facility",37.37120787757533,36.581308187263502,28.899543469352135,18.317498129229577,9.1864309972992313,17.743741873495537,10.817460206721353,11.068934406422631,3.1433535640351167,3.3487555189243743,38.498935030132174,39.258868982807449,31.878011020570774,29.924210519735361,28.010072280949384,40.297976726408088,10.613799977073407,18.361224088513669,7.6337677960200008,30.288613313809481,17.350636351781155,54.553065459687602,2.8936610102657432,13.687296766901902,17.370084197369081,54.057487646142121,19.160314301619717,36.056856424664154,39.195601444377083,62.313944995111569,45.35465287551817,37.005426343492068,31.733907983424263,0.6446433779683185,56.69292906594675,35.632286788866082,null,null,null,null,null,null,null,null,null,null,null,null,null,null,null,"No facility",8527.217458000001,8368.7338019999861,6682.8144330000086,4202.888735999999,2095.8860909999994,1227.7137269999987,765.65921899999989,764.88361499999985,221.56509500000004,234.39527099999992,6075.0777170000129,6220.3002799999967,5088.5199410000023,4783.2750430000042,4496.1506119999976,997.85153499999979,402.8991289999999,861.21257399999979,1042.205631,283.80422800000008,76.375795999999966,1669.6041719999982,86.450026999999992,617.10424400000034,1431.7022579999998,3328.4242740000022,1337.6046290000002,4612.5043059999989,1259.7856809999996,532.66355999999985,1210.101058,1313.2577230000009,1924.1617130000004,63.249068999999992,1402.7361359999998,5423.8427770000026]
["Place where household members wash their hands","Observed",61.101149310751438,62.026326473122829,70.282780539413437,80.141464254796205,88.584652987917096,78.818811871373413,87.506601010217537,85.142617182092479,94.690307715387661,93.766643682759209,59.980846488424213,59.52263190439475,67.230749582905261,69.25453598648545,71.449167628552473,59.577958803221897,88.931823683766709,81.375841169887281,87.386747763824346,69.529625361202662,80.621698949716517,44.844559286635103,96.120321739045053,85.678925246149433,81.891151234667035,43.151547095553234,79.395472297538845,63.725275619164634,60.260133303664411,37.386499695291164,54.247941015354527,61.180336134920879,67.644415670498944,94.220835734990288,43.3070709340533,64.208869278267329,null,null,null,null,null,null,null,null,null,null,null,null,null,null,"Observed handwashing place","Fixed","N/A","N/A","N/A","N/A","N/A","N/A","N/A","N/A","N/A","N/A","N/A","N/A","N/A","N/A","N/A","N/A","N/A","N/A","N/A","N/A","N/A","N/A","N/A","N/A","N/A","N/A","N/A","N/A","N/A","N/A","N/A","N/A","N/A","N/A","N/A","N/A"]
[null,"Not observed: not in dwelling",26.010776756115629,27.403813070421513,21.83111194129377,14.408581777651111,8.0502951504164777,12.547773773284352,6.939554049862771,9.1693947835865011,2.6881199769412092,2.6405798426193443,26.59130165923488,28.539627084322067,24.347188279895029,22.882979553028797,23.767884098810228,39.860303260800734,9.1421858921920993,1.4886810199837539,3.6420055278703884,30.20964058425028,16.47659522570029,2.7132736197188936,2.8642787917262256,7.0577403513217636,16.076414407264465,49.437086151793757,12.519317656501105,23.975860822165195,36.599485160805237,42.834163485004076,24.455133824030472,35.93967370675287,23.280720674061378,0.61132927190091291,44.33092576800432,35.476374080818914,null,null,null,null,null,null,null,null,null,null,null,null,null,null,null,"Mobile","N/A","N/A","N/A","N/A","N/A","N/A","N/A","N/A","N/A","N/A","N/A","N/A","N/A","N/A","N/A","N/A","N/A","N/A","N/A","N/A","N/A","N/A","N/A","N/A","N/A","N/A","N/A","N/A","N/A","N/A","N/A","N/A","N/A","N/A","N/A","N/A"]
[null,"Not observed: no permission to see",2.3546499383889747,2.1550836764295145,0.85229663092467733,1.80132516205515,2.3139664903826147,4.162911704530587,1.8792229812537624,4.1223937315177528,2.1670639364951958,2.7365070622058436,2.3626875391610924,1.9474563968787273,1.2953523160869598,0.74848819232475139,0.62783038403499181,0.20780614050794141,0.28501368869833682,0,5.3222050745166047,0.11042300058194529,2.4533337088143914,1.2573634239664278,0.99272015328451668,0.41834726515856019,0.80553718449380118,6.0749077821610227,1.7666856090680056,0.34072137212705822,0.80474229649472873,0.71740466417272919,0.50220828189845634,2.5207522918811294,0.34351878651128581,5.1678349931088601,0,2.8831134611467243E-2,null,null,null,null,null,null,null,null,null,null,null,null,null,null,"Water / Soap","Water and soap","N/A","N/A","N/A","N/A","N/A","N/A","N/A","N/A","N/A","N/A","N/A","N/A","N/A","N/A","N/A","N/A","N/A","N/A","N/A","N/A","N/A","N/A","N/A","N/A","N/A","N/A","N/A","N/A","N/A","N/A","N/A","N/A","N/A","N/A","N/A","N/A"]
[null,"Not observed: other reason",1.8813405034480941,0.80226387835830859,0.77242841017408137,1.2085420865866161,0.25084770938651574,0.82545412652882644,1.7805202069916322,0.43790880067813498,0.29478329078386045,0.13191784841847357,2.1831310629184673,1.2119673543796414,0.5473373760881669,0.63521816925168673,0.98176334674104704,0.35393179546941161,1.0103628588441853,2.1904075510789314,0.6323745263492121,0,0,1.7313225946634196,0,0.5146162897919534,0.11349547502720911,0.60083322117593363,6.2986946873651419,0.41123665126898673,5.7062050704949512E-2,1.2882328656594402,0.87600569367340153,0,1.405297014835365,0,6.0898168348644299,5.5271461969109766E-2,null,null,null,null,null,null,null,null,null,null,null,null,null,null,null,"Water only","N/A","N/A","N/A","N/A","N/A","N/A","N/A","N/A","N/A","N/A","N/A","N/A","N/A","N/A","N/A","N/A","N/A","N/A","N/A","N/A","N/A","N/A","N/A","N/A","N/A","N/A","N/A","N/A","N/A","N/A","N/A","N/A","N/A","N/A","N/A","N/A"]
[null,"No place for washing",8.5675313312522423,7.5720840252288619,5.9636499375311081,2.3547928613720988,0.65981761152259266,3.6290122272589409,1.8941017516742642,0.99009608130057691,9.014465607981674E-2,0.47631268082590761,8.7728636237156881,8.7197209338271691,6.5664256202965747,6.0553158931432449,3.0500241626731799,0,0.40729815971456929,14.622999357492001,2.9478495957374808,0,0.44837211576881442,49.385397007814404,0,6.014436873465411,1.0248745955639893,0.73562574931620184,0,11.546905535273968,2.1882111293655977,17.696233518393704,19.69367345234101,0,6.7589002647910164,0,6.272186463078004,1.2709388812803438E-2,null,null,null,null,null,null,null,null,null,null,null,null,null,null,null,"Soap only","N/A","N/A","N/A","N/A","N/A","N/A","N/A","N/A","N/A","N/A","N/A","N/A","N/A","N/A","N/A","N/A","N/A","N/A","N/A","N/A","N/A","N/A","N/A","N/A","N/A","N/A","N/A","N/A","N/A","N/A","N/A","N/A","N/A","N/A","N/A","N/A"]
[null,"missing",8.4552160043458377E-2,4.0428876438908683E-2,0.29773254066277616,8.5293857538362411E-2,0.14042005037452465,1.6036297023911135E-2,0,0.13758942082452519,6.958042431222812E-2,0.24803888317125486,0.10916962654552334,5.8596326197653543E-2,1.2946824728001603E-2,0.42346220576629801,0.12333037918811063,0,0.22331571678411857,0.32207090155818491,6.881751170202513E-2,0.15031105396519137,0,6.8084067202026352E-2,2.2679315944279795E-2,0.31593397411282959,8.8527102983495518E-2,0,1.9829749526776165E-2,0,9.0366058964996734E-2,7.7465771478787318E-2,0.22503773270251184,0.3592378664450005,0.56714758930169407,0,0,0.2179446555203125,null,null,null,null,null,null,null,null,null,null,null,null,null,null,null,"Neither","N/A","N/A","N/A","N/A","N/A","N/A","N/A","N/A","N/A","N/A","N/A","N/A","N/A","N/A","N/A","N/A","N/A","N/A","N/A","N/A","N/A","N/A","N/A","N/A","N/A","N/A","N/A","N/A","N/A","N/A","N/A","N/A","N/A","N/A","N/A","N/A"]
[null,null,null,null,null,null,null,null,null,null,null,null,null,null,null,null,null,null,null,null,null,null,null,null,null,null,null,null,null,null,null,null,null,null,null,null,null,null,null,null,null,null,null,null,null,null,null,null,null,null,null,null,"Place where household members wash their hands","Observed",14290.395197000002,14508.342542999939,16441.476232999972,18741.777104000037,20719.134144999975,5691.4228100000055,6312.3351010000188,6145.2993070000066,6827.1200269999981,6765.0787029999938,9704.781420000003,9624.0183189999825,10873.956317999957,11201.357332999989,11555.755883999966,1478.3311820000008,3393.0941049999992,3829.1750049999987,12610.366190000012,653.19551200000024,363.81437599999998,1390.9097660000007,2901.1157830000029,3891.4868570000026,6810.6426939999983,2828.7695190000027,5643.5158680000095,8179.8041850000027,1954.3139490000003,322.14279199999987,1457.9847530000013,2235.5670110000015,4139.2632960000019,9748.2329320000063,1071.533864,9797.865582999988]
[null,null,null,null,null,null,null,null,null,null,null,null,null,null,null,null,null,null,null,null,null,null,null,null,null,null,null,null,null,null,null,null,null,null,null,null,null,null,null,null,null,null,null,null,null,null,null,null,null,null,null,null,null,"Not observed: not in dwelling",6083.4253270000027,6409.9218769999989,5107.0220240000053,3369.5719259999996,1882.8898629999997,906.0614359999995,500.58841400000011,661.81516699999997,193.81199800000005,190.51263599999996,4302.4196120000033,4614.4783100000013,3937.9341070000064,3701.135632000005,3844.0737049999966,989.06928699999969,348.80986099999996,70.050522000000001,525.56050600000003,283.80422800000008,74.352466999999976,84.155554999999993,86.450026999999992,320.55845399999993,1337.0274159999997,3240.8136400000008,889.88661199999979,3077.5519569999997,1186.968572,369.0828809999993,657.26388100000088,1313.2577230000009,1424.5822309999992,63.249068999999992,1096.8667969999999,5413.469331000003]
[null,null,null,null,null,null,null,null,null,null,null,null,null,null,null,null,null,null,null,null,null,null,null,null,null,null,null,null,null,null,null,null,null,null,null,null,null,null,null,null,null,null,null,null,null,null,null,null,null,null,null,null,null,"Not observed: no permission to see",550.70777800000008,504.08744099999996,199.380484,421.25552599999992,541.21544200000017,300.59943900000002,135.55874700000001,297.54010599999998,156.24413900000002,197.43359599999999,382.27813499999991,314.87781099999984,209.51134100000002,121.061871,101.54148599999999,5.1563749999999997,10.874378,0,768.02211600000055,1.0373679999999998,11.070940999999999,38.998689999999996,29.962405999999998,19.001089,66.994123999999999,398.23633499999988,125.57792000000002,43.735143999999998,26.098831999999998,6.1815559999999996,13.497508,92.109835000000004,21.020429999999998,534.67217600000004,0,4.3994479999999996]
[null,null,null,null,null,null,null,null,null,null,null,null,null,null,null,null,null,null,null,null,null,null,null,null,null,null,null,null,null,null,null,null,null,null,null,null,null,null,null,null,null,null,null,null,null,null,null,null,null,null,null,null,null,"Not observed: other reason",440.00971500000037,187.65449800000002,180.69665500000011,282.62805800000007,58.670968000000002,59.605166999999987,128.43877000000001,31.606741,21.253715999999997,9.5176130000000008,353.22625500000021,195.95901000000003,88.52679400000001,102.74136700000001,158.78446099999999,8.7822479999999992,38.549262999999996,103.070564,91.254962000000006,0,0,53.699123000000007,0,23.373571999999999,9.4390800000000006,39.387201999999995,447.71801700000009,52.786516000000006,1.8505959999999999,11.100127999999998,23.543805000000003,0,85.992232999999999,0,150.67851100000004,8.4340740000000007]
[null,null,null,null,null,null,null,null,null,null,null,null,null,null,null,null,null,null,null,null,null,null,null,null,null,null,null,null,null,null,null,null,null,null,null,null,null,null,null,null,null,null,null,null,null,null,null,null,null,null,null,null,null,"No place for washing",2003.7824159999973,1771.1574269999983,1395.0957539999993,550.68875200000002,154.32525999999996,262.04712400000005,136.632035,71.46170699999999,6.4993810000000005,34.365021999999996,1419.4318499999986,1409.8629599999981,1062.0590399999994,979.39804399999991,493.29244599999993,0,15.540005000000001,688.09148800000014,425.39016300000009,0,2.0233289999999999,1531.7494939999988,0,273.17221799999999,85.235762000000008,48.223432000000003,0,1482.1658329999993,70.966512999999978,152.48055099999999,529.29337199999975,0,413.58724899999999,0,155.19082800000004,1.9393720000000001]
[null,null,null,null,null,null,null,null,null,null,null,null,null,null,null,null,null,null,null,null,null,null,null,null,null,null,null,null,null,null,null,null,null,null,null,null,null,null,null,null,null,null,null,null,null,null,null,null,null,null,null,null,null,"missing",19.77514,9.4565649999999994,69.649528000000004,19.946708999999998,32.842956000000001,1.157964,0,9.9307280000000002,5.0167109999999999,17.895516999999998,17.663428,9.4742470000000001,2.0940300000000001,68.491564000000011,19.946708999999998,0,8.5203609999999994,15.155184,9.9307280000000002,1.412096,0,2.1117119999999998,0.68450999999999995,14.349537,7.3625350000000003,0,1.4095200000000001,0,2.930688,0.66748799999999997,6.0481850000000001,13.126771999999999,34.704611999999997,0,0,33.256969999999995]
[null,null,null,null,null,null,null,null,null,null,null,null,null,null,null,null,null,null,null,null,null,null,null,null,null,null,null,null,null,null,null,null,null,null,null,null,null,null,null,null,null,null,null,null,null,null,null,null,null,null,null,null,null,"Total",23388.095573000042,23390.62035099995,23393.320678000011,23385.868075000144,23389.078634000016,7220.8939400000036,7213.5530670000207,7217.6537560000088,7209.9459720000004,7214.8030869999911,16179.800700000027,16168.670656999981,16174.081629999964,16174.185810999956,16173.394690999956,2481.3390920000011,3815.3879729999985,4705.5427629999922,14430.524665000004,939.44920399999955,451.26111299999991,3101.6243399999908,3018.2127260000007,4541.9417270000049,8316.7016109999986,6555.4301279999936,7108.107937000018,12836.043635000022,3243.1291500000029,861.655396,2687.6315039999918,3654.0613410000069,6119.1500510000205,10346.154177,2474.2699999999986,15259.364777999999]
[]
[]
[]
[]
[]
[]
[]
[]
[]
[]
[]
[]
[]
[]
[]
[]
[]
[]
[]
[]
[]
[null,null,null,null,null,null,null,null,null,null,null,null,null,null,null,null,null,null,null,null,null,null,null,null,null,null,null,null,null,null,null,null,null,null,null,null,null,null,null,null,null,null,null,null,null,null,null,null,null,null,null,null,"Raw numbers of respondents:","Menstrual health and hygiene","NATIONAL wealth index quintile",null,null,null,null,"URBAN wealth index quintile",null,null,null,null,"RURAL wealth index quintile",null,null,null,null,"SUB-REGIONS:"]
[null,null,null,null,null,null,null,null,null,null,null,null,null,null,null,null,null,null,null,null,null,null,null,null,null,null,null,null,null,null,null,null,null,null,null,null,null,null,null,null,null,null,null,null,null,null,null,null,null,null,null,null,"MHH data, raw numbers (weighted)",null,"Poorest","Poor","Middle","Rich","Richest","Poorest","Poor","Middle","Rich","Richest","Poorest","Poor","Middle","Rich","Richest","Abyan","Aden","Al-Baidha","Al-Hodiedah","Al-Jawf","Al-Mhrah","Al-Mhweit","Aldhalae","Amran","Dhamar","Hadramout","Hajjah","Ibb","lahj","Mareb","Reimah","Sadah","Sanaa","Sanaa City","Shabwah","Taiz"]
[null,null,null,null,null,null,null,null,null,null,null,null,null,null,null,null,null,null,null,null,null,null,null,null,null,null,null,null,null,null,null,null,null,null,null,null,null,null,null,null,null,null,null,null,null,null,null,null,null,null,null,null,"Private place to wash and change","Yes","N/A","N/A","N/A","N/A","N/A","N/A","N/A","N/A","N/A","N/A","N/A","N/A","N/A","N/A","N/A","N/A","N/A","N/A","N/A","N/A","N/A","N/A","N/A","N/A","N/A","N/A","N/A","N/A","N/A","N/A","N/A","N/A","N/A","N/A","N/A","N/A"]
[null,null,null,null,null,null,null,null,null,null,null,null,null,null,null,null,null,null,null,null,null,null,null,null,null,null,null,null,null,null,null,null,null,null,null,null,null,null,null,null,null,null,null,null,null,null,null,null,null,null,null,null,null,"No","N/A","N/A","N/A","N/A","N/A","N/A","N/A","N/A","N/A","N/A","N/A","N/A","N/A","N/A","N/A","N/A","N/A","N/A","N/A","N/A","N/A","N/A","N/A","N/A","N/A","N/A","N/A","N/A","N/A","N/A","N/A","N/A","N/A","N/A","N/A","N/A"]
[null,null,null,null,null,null,null,null,null,null,null,null,null,null,null,null,null,null,null,null,null,null,null,null,null,null,null,null,null,null,null,null,null,null,null,null,null,null,null,null,null,null,null,null,null,null,null,null,null,null,null,null,null,"DK/not sure/missing","N/A","N/A","N/A","N/A","N/A","N/A","N/A","N/A","N/A","N/A","N/A","N/A","N/A","N/A","N/A","N/A","N/A","N/A","N/A","N/A","N/A","N/A","N/A","N/A","N/A","N/A","N/A","N/A","N/A","N/A","N/A","N/A","N/A","N/A","N/A","N/A"]
[null,null,null,null,null,null,null,null,null,null,null,null,null,null,null,null,null,null,null,null,null,null,null,null,null,null,null,null,null,null,null,null,null,null,null,null,null,null,null,null,null,null,null,null,null,null,null,null,null,null,null,null,"Use of menstrual materials","Materials reusable","N/A","N/A","N/A","N/A","N/A","N/A","N/A","N/A","N/A","N/A","N/A","N/A","N/A","N/A","N/A","N/A","N/A","N/A","N/A","N/A","N/A","N/A","N/A","N/A","N/A","N/A","N/A","N/A","N/A","N/A","N/A","N/A","N/A","N/A","N/A","N/A"]
[null,null,null,null,null,null,null,null,null,null,null,null,null,null,null,null,null,null,null,null,null,null,null,null,null,null,null,null,null,null,null,null,null,null,null,null,null,null,null,null,null,null,null,null,null,null,null,null,null,null,null,null,null,"Materials not reusable","N/A","N/A","N/A","N/A","N/A","N/A","N/A","N/A","N/A","N/A","N/A","N/A","N/A","N/A","N/A","N/A","N/A","N/A","N/A","N/A","N/A","N/A","N/A","N/A","N/A","N/A","N/A","N/A","N/A","N/A","N/A","N/A","N/A","N/A","N/A","N/A"]
[null,null,null,null,null,null,null,null,null,null,null,null,null,null,null,null,null,null,null,null,null,null,null,null,null,null,null,null,null,null,null,null,null,null,null,null,null,null,null,null,null,null,null,null,null,null,null,null,null,null,null,null,null,"No materials used","N/A","N/A","N/A","N/A","N/A","N/A","N/A","N/A","N/A","N/A","N/A","N/A","N/A","N/A","N/A","N/A","N/A","N/A","N/A","N/A","N/A","N/A","N/A","N/A","N/A","N/A","N/A","N/A","N/A","N/A","N/A","N/A","N/A","N/A","N/A","N/A"]
[null,null,null,null,null,null,null,null,null,null,null,null,null,null,null,null,null,null,null,null,null,null,null,null,null,null,null,null,null,null,null,null,null,null,null,null,null,null,null,null,null,null,null,null,null,null,null,null,null,null,null,null,null,"DK/not sure/missing","N/A","N/A","N/A","N/A","N/A","N/A","N/A","N/A","N/A","N/A","N/A","N/A","N/A","N/A","N/A","N/A","N/A","N/A","N/A","N/A","N/A","N/A","N/A","N/A","N/A","N/A","N/A","N/A","N/A","N/A","N/A","N/A","N/A","N/A","N/A","N/A"]
[null,null,null,null,null,null,null,null,null,null,null,null,null,null,null,null,null,null,null,null,null,null,null,null,null,null,null,null,null,null,null,null,null,null,null,null,null,null,null,null,null,null,null,null,null,null,null,null,null,null,null,null,"Use of menstrual materials with private place to wash and change","Materials reusable","N/A","N/A","N/A","N/A","N/A","N/A","N/A","N/A","N/A","N/A","N/A","N/A","N/A","N/A","N/A","N/A","N/A","N/A","N/A","N/A","N/A","N/A","N/A","N/A","N/A","N/A","N/A","N/A","N/A","N/A","N/A","N/A","N/A","N/A","N/A","N/A"]
[null,null,null,null,null,null,null,null,null,null,null,null,null,null,null,null,null,null,null,null,null,null,null,null,null,null,null,null,null,null,null,null,null,null,null,null,null,null,null,null,null,null,null,null,null,null,null,null,null,null,null,null,null,"Materials not reusable","N/A","N/A","N/A","N/A","N/A","N/A","N/A","N/A","N/A","N/A","N/A","N/A","N/A","N/A","N/A","N/A","N/A","N/A","N/A","N/A","N/A","N/A","N/A","N/A","N/A","N/A","N/A","N/A","N/A","N/A","N/A","N/A","N/A","N/A","N/A","N/A"]
[null,null,null,null,null,null,null,null,null,null,null,null,null,null,null,null,null,null,null,null,null,null,null,null,null,null,null,null,null,null,null,null,null,null,null,null,null,null,null,null,null,null,null,null,null,null,null,null,null,null,null,null,null,"No materials used","N/A","N/A","N/A","N/A","N/A","N/A","N/A","N/A","N/A","N/A","N/A","N/A","N/A","N/A","N/A","N/A","N/A","N/A","N/A","N/A","N/A","N/A","N/A","N/A","N/A","N/A","N/A","N/A","N/A","N/A","N/A","N/A","N/A","N/A","N/A","N/A"]
[null,null,null,null,null,null,null,null,null,null,null,null,null,null,null,null,null,null,null,null,null,null,null,null,null,null,null,null,null,null,null,null,null,null,null,null,null,null,null,null,null,null,null,null,null,null,null,null,null,null,null,null,"Awareness of menstruation before menarche","Yes","N/A","N/A","N/A","N/A","N/A","N/A","N/A","N/A","N/A","N/A","N/A","N/A","N/A","N/A","N/A","N/A","N/A","N/A","N/A","N/A","N/A","N/A","N/A","N/A","N/A","N/A","N/A","N/A","N/A","N/A","N/A","N/A","N/A","N/A","N/A","N/A"]
[null,null,null,null,null,null,null,null,null,null,null,null,null,null,null,null,null,null,null,null,null,null,null,null,null,null,null,null,null,null,null,null,null,null,null,null,null,null,null,null,null,null,null,null,null,null,null,null,null,null,null,null,null,"No","N/A","N/A","N/A","N/A","N/A","N/A","N/A","N/A","N/A","N/A","N/A","N/A","N/A","N/A","N/A","N/A","N/A","N/A","N/A","N/A","N/A","N/A","N/A","N/A","N/A","N/A","N/A","N/A","N/A","N/A","N/A","N/A","N/A","N/A","N/A","N/A"]
[null,null,null,null,null,null,null,null,null,null,null,null,null,null,null,null,null,null,null,null,null,null,null,null,null,null,null,null,null,null,null,null,null,null,null,null,null,null,null,null,null,null,null,null,null,null,null,null,null,null,null,null,null,"DK/not sure/missing","N/A","N/A","N/A","N/A","N/A","N/A","N/A","N/A","N/A","N/A","N/A","N/A","N/A","N/A","N/A","N/A","N/A","N/A","N/A","N/A","N/A","N/A","N/A","N/A","N/A","N/A","N/A","N/A","N/A","N/A","N/A","N/A","N/A","N/A","N/A","N/A"]
[null,null,null,null,null,null,null,null,null,null,null,null,null,null,null,null,null,null,null,null,null,null,null,null,null,null,null,null,null,null,null,null,null,null,null,null,null,null,null,null,null,null,null,null,null,null,null,null,null,null,null,null,"Participation in (all) activities during menstruation","Yes","N/A","N/A","N/A","N/A","N/A","N/A","N/A","N/A","N/A","N/A","N/A","N/A","N/A","N/A","N/A","N/A","N/A","N/A","N/A","N/A","N/A","N/A","N/A","N/A","N/A","N/A","N/A","N/A","N/A","N/A","N/A","N/A","N/A","N/A","N/A","N/A"]
[null,null,null,null,null,null,null,null,null,null,null,null,null,null,null,null,null,null,null,null,null,null,null,null,null,null,null,null,null,null,null,null,null,null,null,null,null,null,null,null,null,null,null,null,null,null,null,null,null,null,null,null,null,"No","N/A","N/A","N/A","N/A","N/A","N/A","N/A","N/A","N/A","N/A","N/A","N/A","N/A","N/A","N/A","N/A","N/A","N/A","N/A","N/A","N/A","N/A","N/A","N/A","N/A","N/A","N/A","N/A","N/A","N/A","N/A","N/A","N/A","N/A","N/A","N/A"]
[null,null,null,null,null,null,null,null,null,null,null,null,null,null,null,null,null,null,null,null,null,null,null,null,null,null,null,null,null,null,null,null,null,null,null,null,null,null,null,null,null,null,null,null,null,null,null,null,null,null,null,null,null,"DK/not sure/missing/no such activity","N/A","N/A","N/A","N/A","N/A","N/A","N/A","N/A","N/A","N/A","N/A","N/A","N/A","N/A","N/A","N/A","N/A","N/A","N/A","N/A","N/A","N/A","N/A","N/A","N/A","N/A","N/A","N/A","N/A","N/A","N/A","N/A","N/A","N/A","N/A","N/A"]
[null,null,null,null,null,null,null,null,null,null,null,null,null,null,null,null,null,null,null,null,null,null,null,null,null,null,null,null,null,null,null,null,null,null,null,null,null,null,null,null,null,null,null,null,null,null,null,null,null,null,null,null,"Participation in specific activities during menstruation","Did not go to school (amongst those usually attending school)","N/A","N/A","N/A","N/A","N/A","N/A","N/A","N/A","N/A","N/A","N/A","N/A","N/A","N/A","N/A","N/A","N/A","N/A","N/A","N/A","N/A","N/A","N/A","N/A","N/A","N/A","N/A","N/A","N/A","N/A","N/A","N/A","N/A","N/A","N/A","N/A"]
[null,null,null,null,null,null,null,null,null,null,null,null,null,null,null,null,null,null,null,null,null,null,null,null,null,null,null,null,null,null,null,null,null,null,null,null,null,null,null,null,null,null,null,null,null,null,null,null,null,null,null,null,null,"Did not go to work (amongst those who usually work)","N/A","N/A","N/A","N/A","N/A","N/A","N/A","N/A","N/A","N/A","N/A","N/A","N/A","N/A","N/A","N/A","N/A","N/A","N/A","N/A","N/A","N/A","N/A","N/A","N/A","N/A","N/A","N/A","N/A","N/A","N/A","N/A","N/A","N/A","N/A","N/A"]
[null,null,null,null,null,null,null,null,null,null,null,null,null,null,null,null,null,null,null,null,null,null,null,null,null,null,null,null,null,null,null,null,null,null,null,null,null,null,null,null,null,null,null,null,null,null,null,null,null,null,null,null,null,"Did not participate in social activities","N/A","N/A","N/A","N/A","N/A","N/A","N/A","N/A","N/A","N/A","N/A","N/A","N/A","N/A","N/A","N/A","N/A","N/A","N/A","N/A","N/A","N/A","N/A","N/A","N/A","N/A","N/A","N/A","N/A","N/A","N/A","N/A","N/A","N/A","N/A","N/A"]
[null,null,null,null,null,null,null,null,null,null,null,null,null,null,null,null,null,null,null,null,null,null,null,null,null,null,null,null,null,null,null,null,null,null,null,null,null,null,null,null,null,null,null,null,null,null,null,null,null,null,null,null,null,"Did not cook food","N/A","N/A","N/A","N/A","N/A","N/A","N/A","N/A","N/A","N/A","N/A","N/A","N/A","N/A","N/A","N/A","N/A","N/A","N/A","N/A","N/A","N/A","N/A","N/A","N/A","N/A","N/A","N/A","N/A","N/A","N/A","N/A","N/A","N/A","N/A","N/A"]
[null,null,null,null,null,null,null,null,null,null,null,null,null,null,null,null,null,null,null,null,null,null,null,null,null,null,null,null,null,null,null,null,null,null,null,null,null,null,null,null,null,null,null,null,null,null,null,null,null,null,null,null,null,"Did not eat with others","N/A","N/A","N/A","N/A","N/A","N/A","N/A","N/A","N/A","N/A","N/A","N/A","N/A","N/A","N/A","N/A","N/A","N/A","N/A","N/A","N/A","N/A","N/A","N/A","N/A","N/A","N/A","N/A","N/A","N/A","N/A","N/A","N/A","N/A","N/A","N/A"]
[null,null,null,null,null,null,null,null,null,null,null,null,null,null,null,null,null,null,null,null,null,null,null,null,null,null,null,null,null,null,null,null,null,null,null,null,null,null,null,null,null,null,null,null,null,null,null,null,null,null,null,null,null,"Did not bathe in regular place","N/A","N/A","N/A","N/A","N/A","N/A","N/A","N/A","N/A","N/A","N/A","N/A","N/A","N/A","N/A","N/A","N/A","N/A","N/A","N/A","N/A","N/A","N/A","N/A","N/A","N/A","N/A","N/A","N/A","N/A","N/A","N/A","N/A","N/A","N/A","N/A"]
[null,null,null,null,null,null,null,null,null,null,null,null,null,null,null,null,null,null,null,null,null,null,null,null,null,null,null,null,null,null,null,null,null,null,null,null,null,null,null,null,null,null,null,null,null,null,null,null,null,null,null,null,null,"Did not participate in other activities","N/A","N/A","N/A","N/A","N/A","N/A","N/A","N/A","N/A","N/A","N/A","N/A","N/A","N/A","N/A","N/A","N/A","N/A","N/A","N/A","N/A","N/A","N/A","N/A","N/A","N/A","N/A","N/A","N/A","N/A","N/A","N/A","N/A","N/A","N/A","N/A"]
[null,null,null,null,null,null,null,null,null,null,null,null,null,null,null,null,null,null,null,null,null,null,null,null,null,null,null,null,null,null,null,null,null,null,null,null,null,null,null,null,null,null,null,null,null,null,null,null,null,null,null,null,null,"DK/not sure/missing/no such activity","N/A","N/A","N/A","N/A","N/A","N/A","N/A","N/A","N/A","N/A","N/A","N/A","N/A","N/A","N/A","N/A","N/A","N/A","N/A","N/A","N/A","N/A","N/A","N/A","N/A","N/A","N/A","N/A","N/A","N/A","N/A","N/A","N/A","N/A","N/A","N/A"]
[]
[]
[]
[]
[]
[]
[]
[]
[]
[]
[]
[]
[]
[]
[]
[]
[]
[]
[]
[]
[]
[]
[]
[]
[]
[]
[]
[]
[]
[]
[]
[]
[]
[]
[]
[]
[]
[]
[]
[]
[]
[]
[]
[]
[]
[]
[]
[]
[]
[]
[]
[]
[]
[]
[null,null,null,null,null,null,null,null,null,null,null,null,null,null,null,null,null,null,null,null,null,null,null,null,null,null,null,null,null,null,null,null,null,null,null,null,null,null,null,null,null,null,null,null,null,null,null,null,null,null,null,null,"Raw numbers of respondents:","Basic water, sanitation and hygiene","NATIONAL wealth index quintile",null,null,null,null,"URBAN wealth index quintile",null,null,null,null,"RURAL wealth index quintile",null,null,null,null,"SUB-REGIONS:"]
[null,null,null,null,null,null,null,null,null,null,null,null,null,null,null,null,null,null,null,null,null,null,null,null,null,null,null,null,null,null,null,null,null,null,null,null,null,null,null,null,null,null,null,null,null,null,null,null,null,null,null,null,"WatSan data, raw numbers (weighted)",null,"Poorest","Poor","Middle","Rich","Richest","Poorest","Poor","Middle","Rich","Richest","Poorest","Poor","Middle","Rich","Richest","Abyan","Aden","Al-Baidha","Al-Hodiedah","Al-Jawf","Al-Mhrah","Al-Mhweit","Aldhalae","Amran","Dhamar","Hadramout","Hajjah","Ibb","lahj","Mareb","Reimah","Sadah","Sanaa","Sanaa City","Shabwah","Taiz"]
[null,null,null,null,null,null,null,null,null,null,null,null,null,null,null,null,null,null,null,null,null,null,null,null,null,null,null,null,null,null,null,null,null,null,null,null,null,null,null,null,null,null,null,null,null,null,null,null,null,null,null,null,"Use of Basic Water Sanitation and Hygiene","Yes","N/A","N/A","N/A","N/A","N/A","N/A","N/A","N/A","N/A","N/A","N/A","N/A","N/A","N/A","N/A","N/A","N/A","N/A","N/A","N/A","N/A","N/A","N/A","N/A","N/A","N/A","N/A","N/A","N/A","N/A","N/A","N/A","N/A","N/A","N/A","N/A"]
[null,null,null,null,null,null,null,null,null,null,null,null,null,null,null,null,null,null,null,null,null,null,null,null,null,null,null,null,null,null,null,null,null,null,null,null,null,null,null,null,null,null,null,null,null,null,null,null,null,null,null,null,null,"No","N/A","N/A","N/A","N/A","N/A","N/A","N/A","N/A","N/A","N/A","N/A","N/A","N/A","N/A","N/A","N/A","N/A","N/A","N/A","N/A","N/A","N/A","N/A","N/A","N/A","N/A","N/A","N/A","N/A","N/A","N/A","N/A","N/A","N/A","N/A","N/A"]
[null,null,null,null,null,null,null,null,null,null,null,null,null,null,null,null,null,null,null,null,null,null,null,null,null,null,null,null,null,null,null,null,null,null,null,null,null,null,null,null,null,null,null,null,null,null,null,null,null,null,null,null,"Use of Basic Water and Sanitation","Yes","N/A","N/A","N/A","N/A","N/A","N/A","N/A","N/A","N/A","N/A","N/A","N/A","N/A","N/A","N/A","N/A","N/A","N/A","N/A","N/A","N/A","N/A","N/A","N/A","N/A","N/A","N/A","N/A","N/A","N/A","N/A","N/A","N/A","N/A","N/A","N/A"]
[null,null,null,null,null,null,null,null,null,null,null,null,null,null,null,null,null,null,null,null,null,null,null,null,null,null,null,null,null,null,null,null,null,null,null,null,null,null,null,null,null,null,null,null,null,null,null,null,null,null,null,null,null,"No","N/A","N/A","N/A","N/A","N/A","N/A","N/A","N/A","N/A","N/A","N/A","N/A","N/A","N/A","N/A","N/A","N/A","N/A","N/A","N/A","N/A","N/A","N/A","N/A","N/A","N/A","N/A","N/A","N/A","N/A","N/A","N/A","N/A","N/A","N/A","N/A"]
[null,null,null,null,null,null,null,null,null,null,null,null,null,null,null,null,null,null,null,null,null,null,null,null,null,null,null,null,null,null,null,null,null,null,null,null,null,null,null,null,null,null,null,null,null,null,null,null,null,null,null,null,"Use of Basic Water and Hygiene","Yes","N/A","N/A","N/A","N/A","N/A","N/A","N/A","N/A","N/A","N/A","N/A","N/A","N/A","N/A","N/A","N/A","N/A","N/A","N/A","N/A","N/A","N/A","N/A","N/A","N/A","N/A","N/A","N/A","N/A","N/A","N/A","N/A","N/A","N/A","N/A","N/A"]
[null,null,null,null,null,null,null,null,null,null,null,null,null,null,null,null,null,null,null,null,null,null,null,null,null,null,null,null,null,null,null,null,null,null,null,null,null,null,null,null,null,null,null,null,null,null,null,null,null,null,null,null,null,"No","N/A","N/A","N/A","N/A","N/A","N/A","N/A","N/A","N/A","N/A","N/A","N/A","N/A","N/A","N/A","N/A","N/A","N/A","N/A","N/A","N/A","N/A","N/A","N/A","N/A","N/A","N/A","N/A","N/A","N/A","N/A","N/A","N/A","N/A","N/A","N/A"]
[null,null,null,null,null,null,null,null,null,null,null,null,null,null,null,null,null,null,null,null,null,null,null,null,null,null,null,null,null,null,null,null,null,null,null,null,null,null,null,null,null,null,null,null,null,null,null,null,null,null,null,null,"Use of Basic Sanitation and Hygiene","Yes","N/A","N/A","N/A","N/A","N/A","N/A","N/A","N/A","N/A","N/A","N/A","N/A","N/A","N/A","N/A","N/A","N/A","N/A","N/A","N/A","N/A","N/A","N/A","N/A","N/A","N/A","N/A","N/A","N/A","N/A","N/A","N/A","N/A","N/A","N/A","N/A"]
[null,null,null,null,null,null,null,null,null,null,null,null,null,null,null,null,null,null,null,null,null,null,null,null,null,null,null,null,null,null,null,null,null,null,null,null,null,null,null,null,null,null,null,null,null,null,null,null,null,null,null,null,null,"No","N/A","N/A","N/A","N/A","N/A","N/A","N/A","N/A","N/A","N/A","N/A","N/A","N/A","N/A","N/A","N/A","N/A","N/A","N/A","N/A","N/A","N/A","N/A","N/A","N/A","N/A","N/A","N/A","N/A","N/A","N/A","N/A","N/A","N/A","N/A","N/A"]
[null,null,null,null,null,null,null,null,null,null,null,null,null,null,null,null,null,null,null,null,null,null,null,null,null,null,null,null,null,null,null,null,null,null,null,null,null,null,null,null,null,null,null,null,null,null,null,null,null,null,null,null,"Use of Basic Water","Yes","N/A","N/A","N/A","N/A","N/A","N/A","N/A","N/A","N/A","N/A","N/A","N/A","N/A","N/A","N/A","N/A","N/A","N/A","N/A","N/A","N/A","N/A","N/A","N/A","N/A","N/A","N/A","N/A","N/A","N/A","N/A","N/A","N/A","N/A","N/A","N/A"]
[null,null,null,null,null,null,null,null,null,null,null,null,null,null,null,null,null,null,null,null,null,null,null,null,null,null,null,null,null,null,null,null,null,null,null,null,null,null,null,null,null,null,null,null,null,null,null,null,null,null,null,null,null,"No","N/A","N/A","N/A","N/A","N/A","N/A","N/A","N/A","N/A","N/A","N/A","N/A","N/A","N/A","N/A","N/A","N/A","N/A","N/A","N/A","N/A","N/A","N/A","N/A","N/A","N/A","N/A","N/A","N/A","N/A","N/A","N/A","N/A","N/A","N/A","N/A"]
[null,null,null,null,null,null,null,null,null,null,null,null,null,null,null,null,null,null,null,null,null,null,null,null,null,null,null,null,null,null,null,null,null,null,null,null,null,null,null,null,null,null,null,null,null,null,null,null,null,null,null,null,"Use of Basic Sanitation","Yes","N/A","N/A","N/A","N/A","N/A","N/A","N/A","N/A","N/A","N/A","N/A","N/A","N/A","N/A","N/A","N/A","N/A","N/A","N/A","N/A","N/A","N/A","N/A","N/A","N/A","N/A","N/A","N/A","N/A","N/A","N/A","N/A","N/A","N/A","N/A","N/A"]
[null,null,null,null,null,null,null,null,null,null,null,null,null,null,null,null,null,null,null,null,null,null,null,null,null,null,null,null,null,null,null,null,null,null,null,null,null,null,null,null,null,null,null,null,null,null,null,null,null,null,null,null,null,"No","N/A","N/A","N/A","N/A","N/A","N/A","N/A","N/A","N/A","N/A","N/A","N/A","N/A","N/A","N/A","N/A","N/A","N/A","N/A","N/A","N/A","N/A","N/A","N/A","N/A","N/A","N/A","N/A","N/A","N/A","N/A","N/A","N/A","N/A","N/A","N/A"]
[null,null,null,null,null,null,null,null,null,null,null,null,null,null,null,null,null,null,null,null,null,null,null,null,null,null,null,null,null,null,null,null,null,null,null,null,null,null,null,null,null,null,null,null,null,null,null,null,null,null,null,null,"Access to Basic Hygiene","Yes","N/A","N/A","N/A","N/A","N/A","N/A","N/A","N/A","N/A","N/A","N/A","N/A","N/A","N/A","N/A","N/A","N/A","N/A","N/A","N/A","N/A","N/A","N/A","N/A","N/A","N/A","N/A","N/A","N/A","N/A","N/A","N/A","N/A","N/A","N/A","N/A"]
[null,null,null,null,null,null,null,null,null,null,null,null,null,null,null,null,null,null,null,null,null,null,null,null,null,null,null,null,null,null,null,null,null,null,null,null,null,null,null,null,null,null,null,null,null,null,null,null,null,null,null,null,null,"No","N/A","N/A","N/A","N/A","N/A","N/A","N/A","N/A","N/A","N/A","N/A","N/A","N/A","N/A","N/A","N/A","N/A","N/A","N/A","N/A","N/A","N/A","N/A","N/A","N/A","N/A","N/A","N/A","N/A","N/A","N/A","N/A","N/A","N/A","N/A","N/A"]
[]
[]
[]
[]
[]
[]
[]
[]
[]
[]
[]
[]
[]
[]
[]
[]
[]
[]
[]
[]
[]
[]
[]
[]
[]
[]
[]
[]
[]
[]
[]
[]
[]
[]
[]
[]
[]
[]
[]
[]
[]
[]
[]
[]
[null,null,"INITIAL (national) Wealth Index",null,null,null,null,"URBAN Wealth Index",null,null,null,null,"RURAL Wealth Index"]
[null,null,"Component Matrix",null,null,null,null,"Component Matrix",null,null,null,null,"Component Matrix"]
[null,null,null,null,"Component",null,null,null,null,"Component",null,null,null,null,"Component"]
[null,"Note:\n\nThe INITIAL (national) Wealth Index is based on the first component of the Principal Component Analysis (PCA) which has been obtained at national level.\n\nThe final national-level (NATIONAL) Wealth Index is based on the URBAN and RURAL specific wealth indexes. Regression procedures are used to establish the relationships between the two sets of scores (urban and rural) and the initial (national) wealth factors.\nThis allows best use of the available information for each area and a better precision of the FINAL (NATIONAL) Wealth Index.\n\nFor dependency reasons, all WASH variables (contained in the generic MICS and DHS scripts) have been excluded from the sets of asset variables used in the PCAs.\n\nThe PCA can extracts as many components as there are asset variables in the input. Only the first of the components is used to represent the Wealth Index. \n\nThe scores represent the weights of the asset variables on the Wealth Index (correlations between the variables and the component).\n\nThe communalities are the proportion of each variable's variance that can be explained by the component.\n\nProportion of explained variance is the part of the model's total variance that is explained by the component.\n\nFor more information on the procedure used:\n\nThe DHS Wealth Index, DHS Comparative Reports No. 6, Shea Oscar Rutstein, Kiersten Johnson, ORC Macro International Inc., 2004.\n\nThe DHS Wealth Index: Approaches for Rural and Urban Areas, Shea O. Rutstein, ORC Macro International Inc., 2008.\n\nMICS Methodological Paper No. 4, Review of options for reporting water, sanitation and hygiene coverage by wealth quintile, UNICEF, 2016.",null,null,"1",null,null,null,null,"1",null,null,null,null,"1"]
[null,null,"Biogas for cooking",null,0.75350885244775923,null,null,"No sheepss",null,-0.61237689277988394,null,null,"Biogas for cooking",null,0.71505067875809125]
[null,null,"Has refrigerator",null,0.73922614706047218,null,null,"No horses, donkeys, mules",null,-0.58285871574002401,null,null,"Wood for cooking",null,-0.69210178502471476]
[null,null,"Wood for cooking",null,-0.72719362822728151,null,null,"No goats",null,-0.55510712566258924,null,null,"Has electricity",null,0.66437578646473472]
[null,null,"Has television",null,0.71025702459270734,null,null,"Bamboo with mud walls",null,0.49128062454931209,null,null,"Has refrigerator",null,0.66016720692464259]
[null,null,"Has electricity",null,0.69936237057237072,null,null,"No milk cows or bulls",null,-0.45135784538710955,null,null,"Has television",null,0.65263177889307245]
[null,null,"Rudimentary wood plank floor",null,-0.68615842613981093,null,null,"1-4 goats",null,0.44612541769322916,null,null,"Rudimentary wood plank floor",null,-0.64521858369019081]
[null,null,"Fan",null,0.60722876914272428,null,null,"1 horse, donkey, mule",null,0.4266505180235135,null,null,"Fan",null,0.58355944240744084]
[null,null,"Air conditioner",null,0.49542163436780196,null,null,"No chickens",null,-0.40378255383931771,null,null,"Air conditioner",null,0.43725281804797544]
[null,null,"Has mobile telephone",null,0.46586143065408825,null,null,"1-2 cmilk cows or bulls",null,0.39671240652372636,null,null,"Has mobile telephone",null,0.41685102273011487]
[null,null,"Concrete roof, cement",null,0.42355313322952098,null,null,"Wood and dirt",null,0.39445605370287723,null,null,"Generator",null,0.39971049433454237]
[null,null,"Vinyl, asphalt strips floor",null,0.42274464143630242,null,null,"5-9 sheepss",null,0.39101676812421016,null,null,"Has car/truck",null,0.38088889036154483]
[null,null,"Wood and dirt",null,-0.42134342660904234,null,null,"Has refrigerator",null,-0.38961107409048279,null,null,"Parquet, wood tile floor",null,0.37797709898547655]
[null,null,"Brick walls",null,0.39290929975882266,null,null,"Biogas for cooking",null,-0.37772839420701299,null,null,"No horses, donkeys, mules",null,0.36457839030942774]
[null,null,"Stone walls with lime/cement",null,-0.38757399585281654,null,null,"Rudimentary wood plank floor",null,0.37678990836762172,null,null,"Stone walls with lime/cement",null,-0.36160053861517794]
[null,null,"Generator",null,0.37303281871449678,null,null,"1-4 sheepss",null,0.37637772947307391,null,null,"Concrete roof, cement",null,0.34927968883435079]
[null,null,"Has car/truck",null,0.35033271647317293,null,null,"2-3 horses, donkeys, mules",null,0.37488470932655665,null,null,"Vinyl, asphalt strips floor",null,0.33445838104535097]
[null,null,"Household cooks in other house",null,-0.32387001998551096,null,null,"Concrete roof, cement",null,-0.35808531258883863,null,null,"1 horse, donkey, mule",null,-0.32774648269046786]
[null,null,"Household cooks in other place",null,-0.30195917529010452,null,null,"Wood for cooking",null,0.35190478560431404,null,null,"Wood and dirt",null,-0.29594964487567038]
[null,null,"Rug or mat floor",null,0.29056666132277065,null,null,"Vinyl, asphalt strips floor",null,-0.33948992268764649,null,null,"Brick walls",null,0.29457907155157997]
[null,null,"Wood and cement",null,0.28309953202573535,null,null,"Has electricity",null,-0.3272647108619573,null,null,"No milk cows or bulls",null,0.27769148269244809]
[null,null,"Has bicycle",null,0.26153281288500563,null,null,"Has television",null,-0.31105278905844941,null,null,"1-2 cmilk cows or bulls",null,-0.27497617942410252]
[null,null,"Number of members per sleeping room",null,-0.25162637625706047,null,null,"4-9 chickens",null,0.2896191071756562,null,null,"Wood and cement",null,0.26013530547022745]
[null,null,"Parquet, wood tile floor",null,0.20265427693436372,null,null,"10+ more sheepss",null,0.26720740884922956,null,null,"Household cooks in other place",null,-0.2548994819112107]
[null,null,"Cement walls",null,0.19831437215748246,null,null,"Parquet, wood tile floor",null,0.26338467502690505,null,null,"Has bicycle",null,0.24275287414163205]
[null,null,"No walls",null,-0.18880890428770861,null,null,"1-3 chickens",null,0.24906272609705996,null,null,"Household cooks in other house",null,-0.24188335809388029]
[null,null,"roof15",null,-0.16296157808610565,null,null,"5-9 goats",null,0.24795578776581614,null,null,"1-3 chickens",null,-0.23495552085536056]
[null,null,"Own commercial or industrial property",null,0.16147928649513688,null,null,"Household cooks in other house",null,0.22514892463093189,null,null,"Number of members per sleeping room",null,-0.21974087139847362]
[null,null,"Has radio",null,0.12057318868826492,null,null,"No camels",null,-0.2201648959954525,null,null,"No chickens",null,0.21961613312287973]
[null,null,"Bamboo with mud walls",null,-0.10869783755655275,null,null,"Brick walls",null,-0.21548633085341787,null,null,"Rug or mat floor",null,0.20831832400508521]
[null,null,"Does not cook",null,-0.10609250274430308,null,null,"5-5 milk cows or bulls",null,0.21389204885959923,null,null,"Cement walls",null,0.20314842454214121]
[null,null,"Own Real estate",null,-0.10294341241134178,null,null,"Kerosene for cooking",null,0.21302316489252124,null,null,"No walls",null,-0.16923794361798886]
[null,null,"Cane/palm/trunks walls",null,-9.2026382949275481E-2,null,null,"Owns land usable for agriculture",null,0.20687253585697921,null,null,"roof15",null,-0.15395555212815507]
[null,null,"Kerosene for cooking",null,-8.9251136511846282E-2,null,null,"Household cooks in other place",null,0.20083742720590367,null,null,"Own commercial or industrial property",null,0.12689219369667185]
[null,null,"Has motorcycle/scooter",null,8.8011284242845628E-2,null,null,"Rug or mat floor",null,-0.18479371402178738,null,null,"2-3 horses, donkeys, mules",null,-0.11130984342083228]
[null,null,"Other type of roof",null,-8.5799449360177998E-2,null,null,"10+ more goats",null,0.18162984128266813,null,null,"Has motorcycle/scooter",null,0.10975817367409753]
[null,null,"Covered adobe walls",null,7.6788088041142705E-2,null,null,"No walls",null,0.17639842372761869,null,null,"Has radio",null,0.10813424038676195]
[null,null,"Other type of walls",null,-5.7993669823776385E-2,null,null,"Has mobile telephone",null,-0.17410578004798921,null,null,"Covered adobe walls",null,0.10528464643061342]
[null,null,"Has boat with a motor",null,5.6922020722753652E-2,null,null,"Own Real estate",null,0.15868455373109808,null,null,"Terrazo, ceramic tile floor",null,9.9705084450355724E-2]
[null,null,"Terrazo, ceramic tile floor",null,4.3133583509516467E-2,null,null,"roof15",null,0.15659645743055284,null,null,"No goats",null,9.5004646648302354E-2]
[null,null,"Cement block walls",null,4.2893228240628758E-2,null,null,"2-3 camels",null,0.15467102273495284,null,null,"Own Real estate",null,-8.6018720925461478E-2]
[null,null,"Charcoal for cooking",null,-4.097878353603087E-2,null,null,"Cement walls",null,-0.14196116558497196,null,null,"Does not cook",null,-8.1785555994738843E-2]
[null,null,"Other type of flooring",null,-3.6527870974667316E-2,null,null,"Has motorcycle/scooter",null,0.13500129145115658,null,null,"10+ more goats",null,-7.3427159035632641E-2]
[null,null,"Electricity for cooking",null,3.4246492538355898E-2,null,null,"Air conditioner",null,-0.13348494437469607,null,null,"Cane/palm/trunks walls",null,-6.9072326977269574E-2]
[null,null,"Other fuel for cooking",null,-2.2230700357563735E-2,null,null,"4+ horses, donkeys, mules",null,0.12374584646104504,null,null,"Has boat with a motor",null,6.8052456909686324E-2]
[null,null,"Has animal-drawn cart",null,2.011925959518731E-2,null,null,"Fan",null,-0.12086623418381391,null,null,"Other type of roof",null,-6.7171900062787782E-2]
[null,null,"Dung for cooking",null,-1.8294092133013289E-2,null,null,"1 camel",null,0.11950431766019717,null,null,"1-4 goats",null,-6.0062552825435996E-2]
[null,null,"Metal plates",null,1.3217214009505466E-2,null,null,"10+ chickens",null,0.11924869717970503,null,null,"1-4 sheepss",null,-5.7337333995808988E-2]
[null,null,"Concrete, cement floor",null,-1.0642231494970464E-2,null,null,"Number of members per sleeping room",null,0.11749408376580657,null,null,"5-9 sheepss",null,5.1992077353920522E-2]
[null,null,"Metal plates and mud",null,8.2193449839449775E-3,null,null,"4+ camels",null,0.10469857663846911,null,null,"Kerosene for cooking",null,-4.367193612435355E-2]
[null,null,null,null,null,null,null,"Generator",null,-0.10080976581093057,null,null,"Electricity for cooking",null,4.1198139533824445E-2]
[null,null,null,null,null,null,null,"Has animal-drawn cart",null,0.10057685299089972,null,null,"Other type of walls",null,-3.9511439146773068E-2]
[null,null,null,null,null,null,null,"Has car/truck",null,-8.1866016271475647E-2,null,null,"Has animal-drawn cart",null,3.6140841408795303E-2]
[null,null,"Communalities",null,null,null,null,"Has radio",null,-7.9283570722634936E-2,null,null,"4+ camels",null,3.4334493797164974E-2]
[null,null,null,null,"Extraction",null,null,"Has bicycle",null,-7.7504734983258439E-2,null,null,"Charcoal for cooking",null,-3.378767755042545E-2]
[null,null,"Number of members per sleeping room",null,6.331583322825976E-2,null,null,"Charcoal for cooking",null,7.6496816805862858E-2,null,null,"10+ more sheepss",null,3.3329803524297118E-2]
[null,null,"Rudimentary wood plank floor",null,0.47081338576266235,null,null,"Other type of walls",null,6.9366007719093264E-2,null,null,"Metal plates",null,3.3000718263229867E-2]
[null,null,"Parquet, wood tile floor",null,4.1068755959789781E-2,null,null,"Does not cook",null,6.6475598138917527E-2,null,null,"Owns land usable for agriculture",null,-3.2962664410784576E-2]
[null,null,"Vinyl, asphalt strips floor",null,0.17871303186310789,null,null,"Wood and cement",null,-6.4822117197060991E-2,null,null,"Other type of flooring",null,-3.2601934689164315E-2]
[null,null,"Terrazo, ceramic tile floor",null,1.860506026372431E-3,null,null,"Terrazo, ceramic tile floor",null,5.3275732406424525E-2,null,null,"4-9 chickens",null,-3.1646494090949606E-2]
[null,null,"Concrete, cement floor",null,1.1325709119254129E-4,null,null,"Own commercial or industrial property",null,-4.6042141686277176E-2,null,null,"Metal plates and mud",null,3.1579457956005703E-2]
[null,null,"Rug or mat floor",null,8.4428984672261703E-2,null,null,"Other type of roof",null,4.2340532255220074E-2,null,null,"Bamboo with mud walls",null,2.9337899992369E-2]
[null,null,"Other type of flooring",null,1.334285357941943E-3,null,null,"6+ milk cows or bulls",null,3.3205129556106099E-2,null,null,"4+ horses, donkeys, mules",null,-2.6937288746678383E-2]
[null,null,"No walls",null,3.5648802338325111E-2,null,null,"Other type of flooring",null,2.7943564393342307E-2,null,null,"5-5 milk cows or bulls",null,-2.6502191565755191E-2]
[null,null,"Cane/palm/trunks walls",null,8.468855158726701E-3,null,null,"Has boat with a motor",null,2.6427153622362056E-2,null,null,"2-3 camels",null,2.1104329390628531E-2]
[null,null,"Bamboo with mud walls",null,1.181521988947073E-2,null,null,"Concrete, cement floor",null,-2.4104357006267368E-2,null,null,"No camels",null,-1.6480590380094851E-2]
[null,null,"Cement walls",null,3.9328590204216453E-2,null,null,"Cane/palm/trunks walls",null,2.407724969075754E-2,null,null,"Other fuel for cooking",null,-1.5100051686577656E-2]
[null,null,"Stone walls with lime/cement",null,0.15021360226131905,null,null,"Cement block walls",null,-1.7233400074121982E-2,null,null,"Cement block walls",null,1.4251740454219472E-2]
[null,null,"Brick walls",null,0.15437771783696835,null,null,"Covered adobe walls",null,1.4766347590564407E-2,null,null,"1 camel",null,-1.4228091657366986E-2]
[null,null,"Cement block walls",null,1.8398290289026724E-3,null,null,"Electricity for cooking",null,1.3405014729145789E-2,null,null,"Concrete, cement floor",null,-1.3736681015471841E-2]
[null,null,"Covered adobe walls",null,5.8964104650142835E-3,null,null,"Metal plates",null,1.1309171618610964E-2,null,null,"Dung for cooking",null,-1.3462323189668857E-2]
[null,null,"Other type of walls",null,3.3632657396291915E-3,null,null,"Metal plates and mud",null,8.2025837487082354E-3,null,null,"6+ milk cows or bulls",null,-1.3297780022408856E-2]
[null,null,"Wood and cement",null,8.0145345033190346E-2,null,null,"Stone walls with lime/cement",null,-8.0641806975763116E-3,null,null,"10+ chickens",null,1.3285727920526898E-2]
[null,null,"Wood and dirt",null,0.17753028314664945,null,null,null,null,null,null,null,"5-9 goats",null,-7.6274382663998148E-3]
[null,null,"roof15",null,2.655647593231391E-2,null,null,null,null,null,null,null,"No sheepss",null,-1.2646499757594958E-3]
[null,null,"Metal plates",null,1.7469474617306754E-4]
[null,null,"Metal plates and mud",null,6.7557631965101469E-5,null,null,"Communalities"]
[null,null,"Concrete roof, cement",null,0.17939725666854436,null,null,null,null,"Extraction"]
[null,null,"Other type of roof",null,7.3615455105097488E-3,null,null,"Number of members per sleeping room",null,1.380485971996637E-2,null,null,"Communalities"]
[null,null,"Electricity for cooking",null,1.1728222511796663E-3,null,null,"Rudimentary wood plank floor",null,0.14197063504768076,null,null,null,null,"Extraction"]
[null,null,"Biogas for cooking",null,0.56777559071713901,null,null,"Parquet, wood tile floor",null,6.9371487039028373E-2,null,null,"Number of members per sleeping room",null,4.8286050562960522E-2]
[null,null,"Kerosene for cooking",null,7.9657653686562198E-3,null,null,"Vinyl, asphalt strips floor",null,0.1152534076064642,null,null,"Rudimentary wood plank floor",null,0.41630702073917575]
[null,null,"Charcoal for cooking",null,1.6792607000928746E-3,null,null,"Terrazo, ceramic tile floor",null,2.8383036634409523E-3,null,null,"Parquet, wood tile floor",null,0.14286668735747673]
[null,null,"Wood for cooking",null,0.52881057293435774,null,null,"Concrete, cement floor",null,5.8102002668559082E-4,null,null,"Vinyl, asphalt strips floor",null,0.11186240865147719]
[null,null,"Dung for cooking",null,3.3467380697117869E-4,null,null,"Rug or mat floor",null,3.4148716741966137E-2,null,null,"Terrazo, ceramic tile floor",null,9.9411038652525673E-3]
[null,null,"Does not cook",null,1.1255619138549958E-2,null,null,"Other type of flooring",null,7.8084279100486807E-4,null,null,"Concrete, cement floor",null,1.8869640532082451E-4]
[null,null,"Other fuel for cooking",null,4.9420403838778431E-4,null,null,"No walls",null,3.1116403893588506E-2,null,null,"Rug or mat floor",null,4.3396524116287659E-2]
[null,null,"Household cooks in other house",null,0.10489178984541526,null,null,"Cane/palm/trunks walls",null,5.7971395267108409E-4,null,null,"Other type of flooring",null,1.0628861454765354E-3]
[null,null,"Household cooks in other place",null,9.1179343541880065E-2,null,null,"Bamboo with mud walls",null,0.24135665205756215,null,null,"No walls",null,2.8641481560045576E-2]
[null,null,"Has electricity",null,0.48910772537260599,null,null,"Cement walls",null,2.0152972534243828E-2,null,null,"Cane/palm/trunks walls",null,4.7709863540548424E-3]
[null,null,"Has radio",null,1.4537893830455935E-2,null,null,"Stone walls with lime/cement",null,6.5031010323162363E-5,null,null,"Bamboo with mud walls",null,8.6071237596224497E-4]
[null,null,"Has television",null,0.50446504098328571,null,null,"Brick walls",null,4.6434358784668672E-2,null,null,"Cement walls",null,4.126928239395404E-2]
[null,null,"Has refrigerator",null,0.54645529649787083,null,null,"Cement block walls",null,2.9699007811474754E-4,null,null,"Stone walls with lime/cement",null,0.13075494952678679]
[null,null,"Has bicycle",null,6.8399412215543368E-2,null,null,"Covered adobe walls",null,2.1804502116536727E-4,null,null,"Brick walls",null,8.6776829396190872E-2]
[null,null,"Has motorcycle/scooter",null,7.745986154074967E-3,null,null,"Other type of walls",null,4.8116430268853065E-3,null,null,"Cement block walls",null,2.0311210597443583E-4]
[null,null,"Has car/truck",null,0.12273301223147258,null,null,"Wood and cement",null,4.2019068779095099E-3,null,null,"Covered adobe walls",null,1.1084856774019278E-2]
[null,null,"Has mobile telephone",null,0.21702687257107386,null,null,"Wood and dirt",null,0.15559557830284718,null,null,"Other type of walls",null,1.5611538234491513E-3]
[null,null,"Has animal-drawn cart",null,4.047846066585366E-4,null,null,"roof15",null,2.4522450479798948E-2,null,null,"Wood and cement",null,6.7670377152088554E-2]
[null,null,"Has boat with a motor",null,3.2401164431615963E-3,null,null,"Metal plates",null,1.2789736269919574E-4,null,null,"Wood and dirt",null,8.7586192302035418E-2]
[null,null,"Air conditioner",null,0.24544259579966404,null,null,"Metal plates and mud",null,6.7282380154572451E-5,null,null,"roof15",null,2.3702312031085072E-2]
[null,null,"Fan",null,0.36872677807458792,null,null,"Concrete roof, cement",null,0.12822509109184627,null,null,"Metal plates",null,1.0890474058890733E-3]
[null,null,"Generator",null,0.13915348383808263,null,null,"Other type of roof",null,1.7927206716553314E-3,null,null,"Metal plates and mud",null,9.9726216479513181E-4]
[null,null,"Own Real estate",null,1.0597346158891597E-2,null,null,"Electricity for cooking",null,1.7969441988861554E-4,null,null,"Concrete roof, cement",null,0.12199630103222091]
[null,null,"Own commercial or industrial property",null,2.6075559966978495E-2,null,null,"Biogas for cooking",null,0.14267873979020859,null,null,"Other type of roof",null,4.5120641580451495E-3]
[null,null,null,null,null,null,null,"Kerosene for cooking",null,4.5378868780826295E-2,null,null,"Electricity for cooking",null,1.6972867010484687E-3]
[null,null,null,null,null,null,null,"Charcoal for cooking",null,5.8517629814297421E-3,null,null,"Biogas for cooking",null,0.51129747319240704]
[null,null,"Total Variance Explained",null,null,null,null,"Wood for cooking",null,0.12383697813121823,null,null,"Kerosene for cooking",null,1.9072380048496165E-3]
[null,null,"Component",null,"Extraction Sums of Squared Loadings",null,null,"Does not cook",null,4.4190051479268558E-3,null,null,"Charcoal for cooking",null,1.1416071542515239E-3]
[null,null,null,null,"Total","% of Variance","Cumulative %","Household cooks in other house",null,5.0692038262465051E-2,null,null,"Wood for cooking",null,0.47900488083439646]
[null,null,"1",null,5.8035050386405445,11.843887833960295,11.843887833960295,"Household cooks in other place",null,4.0335672166686654E-2,null,null,"Dung for cooking",null,1.8123414566309588E-4]
[null,null,null,null,null,null,null,"Has electricity",null,0.10710219097556051,null,null,"Does not cook",null,6.6888771693685628E-3]
[null,null,null,null,null,null,null,"Has radio",null,6.2858845865310558E-3,null,null,"Other fuel for cooking",null,2.2801156093731669E-4]
[null,null,"Component Score Coefficient Matrix",null,null,null,null,"Has television",null,9.6753837581040225E-2,null,null,"Household cooks in other house",null,5.8507558922772318E-2]
[null,null,null,null,"Component",null,null,"Has refrigerator",null,0.15179678905393967,null,null,"Household cooks in other place",null,6.4973745878603634E-2]
[null,null,null,null,"1",null,null,"Has bicycle",null,6.0069839448251248E-3,null,null,"Has electricity",null,0.44139518564063479]
[null,null,"Number of members per sleeping room",null,-4.335765620632652E-2,null,null,"Has motorcycle/scooter",null,1.8225348693480123E-2,null,null,"Has radio",null,1.1693013944022019E-2]
[null,null,"Rudimentary wood plank floor",null,-0.11823172747697684,null,null,"Has car/truck",null,6.7020446201615158E-3,null,null,"Has television",null,0.42592823882113617]
[null,null,"Parquet, wood tile floor",null,3.4919290253917816E-2,null,null,"Has mobile telephone",null,3.0312822646118797E-2,null,null,"Has refrigerator",null,0.43582074109868385]
[null,null,"Vinyl, asphalt strips floor",null,7.2842986888373429E-2,null,null,"Has animal-drawn cart",null,1.0115703357553053E-2,null,null,"Has bicycle",null,5.8928957904023048E-2]
[null,null,"Terrazo, ceramic tile floor",null,7.4323332576308725E-3,null,null,"Has boat with a motor",null,6.9839444857992393E-4,null,null,"Has motorcycle/scooter",null,1.2046856688273355E-2]
[null,null,"Concrete, cement floor",null,-1.8337593271846933E-3,null,null,"Air conditioner",null,1.7818230374715704E-2,null,null,"Has car/truck",null,0.14507634680084891]
[null,null,"Rug or mat floor",null,5.0067443620387564E-2,null,null,"Fan",null,1.4608646565776547E-2,null,null,"Has mobile telephone",null,0.17376477515114275]
[null,null,"Other type of flooring",null,-6.2941051539474263E-3,null,null,"Generator",null,1.0162608882854666E-2,null,null,"Has animal-drawn cart",null,1.3061604177356933E-3]
[null,null,"No walls",null,-3.2533598752924761E-2,null,null,"Own Real estate",null,2.5180787592837754E-2,null,null,"Has boat with a motor",null,4.6311368914447142E-3]
[null,null,"Cane/palm/trunks walls",null,-1.5857035073899479E-2,null,null,"Own commercial or industrial property",null,2.1198788110592223E-3,null,null,"Air conditioner",null,0.19119002689089593]
[null,null,"Bamboo with mud walls",null,-1.8729687806390689E-2,null,null,"Owns land usable for agriculture",null,4.2796246091897146E-2,null,null,"Fan",null,0.34054162282288325]
[null,null,"Cement walls",null,3.4171482722437169E-2,null,null,"No milk cows or bulls",null,0.2037239045924939,null,null,"Generator",null,0.15976847928116422]
[null,null,"Stone walls with lime/cement",null,-6.678274478479726E-2,null,null,"1-2 cmilk cows or bulls",null,0.15738073348984633,null,null,"Own Real estate",null,7.399220349652424E-3]
[null,null,"Brick walls",null,6.7702069205209228E-2,null,null,"5-5 milk cows or bulls",null,4.5749808565357181E-2,null,null,"Own commercial or industrial property",null,1.6101628821153686E-2]
[null,null,"Cement block walls",null,7.3909177221419932E-3,null,null,"6+ milk cows or bulls",null,1.1025806288377908E-3,null,null,"Owns land usable for agriculture",null,1.0865372450580041E-3]
[null,null,"Covered adobe walls",null,1.3231329606828445E-2,null,null,"No horses, donkeys, mules",null,0.33972428251411013,null,null,"No milk cows or bulls",null,7.7112559559930197E-2]
[null,null,"Other type of walls",null,-9.9928697291802888E-3,null,null,"1 horse, donkey, mule",null,0.18203066452973243,null,null,"1-2 cmilk cows or bulls",null,7.5611899250676226E-2]
[null,null,"Wood and cement",null,4.8780785084327351E-2,null,null,"2-3 horses, donkeys, mules",null,0.14053854528685689,null,null,"5-5 milk cows or bulls",null,7.0236615778798553E-4]
[null,null,"Wood and dirt",null,-7.2601544033076407E-2,null,null,"4+ horses, donkeys, mules",null,1.5313034516360534E-2,null,null,"6+ milk cows or bulls",null,1.7683095352437607E-4]
[null,null,"roof15",null,-2.8079854674215796E-2,null,null,"No goats",null,0.30814392096138166,null,null,"No horses, donkeys, mules",null,0.13291740268061344]
[null,null,"Metal plates",null,2.2774536976367579E-3,null,null,"1-4 goats",null,0.1990278883119582,null,null,"1 horse, donkey, mule",null,0.10741775691597315]
[null,null,"Metal plates and mud",null,1.4162725679084335E-3,null,null,"5-9 goats",null,6.1482072686566462E-2,null,null,"2-3 horses, donkeys, mules",null,1.2389881242370199E-2]
[null,null,"Concrete roof, cement",null,7.2982297837159649E-2,null,null,"10+ more goats",null,3.2989399244367217E-2,null,null,"4+ horses, donkeys, mules",null,7.256175250219258E-4]
[null,null,"Other type of roof",null,-1.4784074242877934E-2,null,null,"No sheepss",null,0.37500545881074548,null,null,"No goats",null,9.0258828847687884E-3]
[null,null,"Electricity for cooking",null,5.9010016033996656E-3,null,null,"1-4 sheepss",null,0.14166019524330642,null,null,"1-4 goats",null,3.6075102519082893E-3]
[null,null,"Biogas for cooking",null,0.12983685676686627,null,null,"5-9 sheepss",null,0.15289411295430233,null,null,"5-9 goats",null,5.8177814507740214E-5]
[null,null,"Kerosene for cooking",null,-1.5378833294293669E-2,null,null,"10+ more sheepss",null,7.1399799343919323E-2,null,null,"10+ more goats",null,5.3915476840440879E-3]
[null,null,"Charcoal for cooking",null,-7.0610403994118068E-3,null,null,"No chickens",null,0.16304035078500151,null,null,"No sheepss",null,1.5993395611884933E-6]
[null,null,"Wood for cooking",null,-0.1253024893379992,null,null,"1-3 chickens",null,6.2032241530899111E-2,null,null,"1-4 sheepss",null,3.287569869746953E-3]
[null,null,"Dung for cooking",null,-3.1522488584413513E-3,null,null,"4-9 chickens",null,8.3879227241224236E-2,null,null,"5-9 sheepss",null,2.7031761075760551E-3]
[null,null,"Does not cook",null,-1.8280763441734679E-2,null,null,"10+ chickens",null,1.4220251779056991E-2,null,null,"10+ more sheepss",null,1.1108758029682486E-3]
[null,null,"Other fuel for cooking",null,-3.8305644967220041E-3,null,null,"No camels",null,4.8472581428688412E-2,null,null,"No chickens",null,4.8231245927846431E-2]
[null,null,"Household cooks in other house",null,-5.5805934143097875E-2,null,null,"1 camel",null,1.4281281939429314E-2,null,null,"1-3 chickens",null,5.5204096780413769E-2]
[null,null,"Household cooks in other place",null,-5.2030483867872644E-2,null,null,"2-3 camels",null,2.3923125273876297E-2,null,null,"4-9 chickens",null,1.0015005882485083E-3]
[null,null,"Has electricity",null,0.12050689469827605,null,null,"4+ camels",null,1.096179195012139E-2,null,null,"10+ chickens",null,1.7651056637826799E-4]
[null,null,"Has radio",null,2.0775925563167746E-2,null,null,null,null,null,null,null,"No camels",null,2.7160985927647497E-4]
[null,null,"Has television",null,0.12238414886585211,null,null,null,null,null,null,null,"1 camel",null,2.0243859221043601E-4]
[null,null,"Has refrigerator",null,0.12737580860852218,null,null,"Total Variance Explained",null,null,null,null,"2-3 camels",null,4.4539271902814721E-4]
[null,null,"Has bicycle",null,4.5064630967610729E-2,null,null,"Component",null,"Extraction Sums of Squared Loadings",null,null,"4+ camels",null,1.17885746430756E-3]
[null,null,"Has motorcycle/scooter",null,1.5165194767102678E-2,null,null,null,null,"Total","% of Variance","Cumulative %"]
[null,null,"Has car/truck",null,6.0365712468690713E-2,null,null,"1",null,4.8473504216783914,6.7324311412199886,6.7324311412199886]
[null,null,"Has mobile telephone",null,8.0272426327248431E-2,null,null,null,null,null,null,null,"Total Variance Explained"]
[null,null,"Has animal-drawn cart",null,3.4667428495763295E-3,null,null,null,null,null,null,null,"Component",null,"Extraction Sums of Squared Loadings"]
[null,null,"Has boat with a motor",null,9.8082142332536811E-3,null,null,"Component Score Coefficient Matrix",null,null,null,null,null,null,"Total","% of Variance","Cumulative %"]
[null,null,"Air conditioner",null,8.5365935080475616E-2,null,null,null,null,"Component",null,null,"1",null,5.4786474472717641,7.4035776314483295,7.4035776314483295]
[null,null,"Fan",null,0.10463138484410894,null,null,null,null,"1"]
[null,null,"Generator",null,6.4277159446023094E-2,null,null,"Number of members per sleeping room",null,2.4238826068845323E-2]
[null,null,"Own Real estate",null,-1.7738144746309376E-2,null,null,"Rudimentary wood plank floor",null,7.7731105777402928E-2,null,null,"Component Score Coefficient Matrix"]
[null,null,"Own commercial or industrial property",null,2.7824441509051043E-2,null,null,"Parquet, wood tile floor",null,5.433580247241715E-2,null,null,null,null,"Component"]
[null,null,null,null,null,null,null,"Vinyl, asphalt strips floor",null,-7.0036183307353783E-2,null,null,null,null,"1"]
[null,null,null,null,null,null,null,"Terrazo, ceramic tile floor",null,1.0990691361648626E-2,null,null,"Number of members per sleeping room",null,-4.0108598611852522E-2]
[null,null,"Component Score Covariance Matrix",null,null,null,null,"Concrete, cement floor",null,-4.972687119641178E-3,null,null,"Rudimentary wood plank floor",null,-0.11776968492679601]
[null,null,"Component",null,"1",null,null,"Rug or mat floor",null,-3.8122623277935558E-2,null,null,"Parquet, wood tile floor",null,6.8990951256354377E-2]
[null,null,"1",null,1,null,null,"Other type of flooring",null,5.7647089569536148E-3,null,null,"Vinyl, asphalt strips floor",null,6.1047618826413685E-2]
[null,null,null,null,null,null,null,"No walls",null,3.6390689424624034E-2,null,null,"Terrazo, ceramic tile floor",null,1.8198850247246059E-2]
[null,null,null,null,null,null,null,"Cane/palm/trunks walls",null,4.9670949273811337E-3,null,null,"Concrete, cement floor",null,-2.5073124612740656E-3]
[null,null,null,null,null,null,null,"Bamboo with mud walls",null,0.10135034231323564,null,null,"Rug or mat floor",null,3.8023677560932091E-2]
[null,null,null,null,null,null,null,"Cement walls",null,-2.9286342689418772E-2,null,null,"Other type of flooring",null,-5.9507268907035274E-3]
[null,null,null,null,null,null,null,"Stone walls with lime/cement",null,-1.6636265167691538E-3,null,null,"No walls",null,-3.0890460692495434E-2]
[null,null,null,null,null,null,null,"Brick walls",null,-4.4454456993601441E-2,null,null,"Cane/palm/trunks walls",null,-1.2607550977142353E-2]
[null,null,null,null,null,null,null,"Cement block walls",null,-3.5552205999076357E-3,null,null,"Bamboo with mud walls",null,5.3549530745911718E-3]
[null,null,null,null,null,null,null,"Covered adobe walls",null,3.0462719436428879E-3,null,null,"Cement walls",null,3.7080032343257338E-2]
[null,null,null,null,null,null,null,"Other type of walls",null,1.4310087302307171E-2,null,null,"Stone walls with lime/cement",null,-6.6001790057735224E-2]
[null,null,null,null,null,null,null,"Wood and cement",null,-1.337269055423816E-2,null,null,"Brick walls",null,5.376857598279542E-2]
[null,null,null,null,null,null,null,"Wood and dirt",null,8.1375600975490667E-2,null,null,"Cement block walls",null,2.6013246136720298E-3]
[null,null,null,null,null,null,null,"roof15",null,3.2305578059762273E-2,null,null,"Covered adobe walls",null,1.9217269854267166E-2]
[null,null,null,null,null,null,null,"Metal plates",null,2.3330625258768008E-3,null,null,"Other type of walls",null,-7.2118966454847956E-3]
[null,null,null,null,null,null,null,"Metal plates and mud",null,1.6921788266069067E-3,null,null,"Wood and cement",null,4.7481665497525069E-2]
[null,null,null,null,null,null,null,"Concrete roof, cement",null,-7.3872380050636371E-2,null,null,"Wood and dirt",null,-5.4018742349089523E-2]
[null,null,null,null,null,null,null,"Other type of roof",null,8.7347785020583883E-3,null,null,"roof15",null,-2.8101014640907637E-2]
[null,null,null,null,null,null,null,"Electricity for cooking",null,2.7654313311444713E-3,null,null,"Metal plates",null,6.0235155813253586E-3]
[null,null,null,null,null,null,null,"Biogas for cooking",null,-7.792471378131248E-2,null,null,"Metal plates and mud",null,5.7640974820768083E-3]
[null,null,null,null,null,null,null,"Kerosene for cooking",null,4.394631012023309E-2,null,null,"Concrete roof, cement",null,6.3752904744451805E-2]
[null,null,null,null,null,null,null,"Charcoal for cooking",null,1.5781160871669742E-2,null,null,"Other type of roof",null,-1.2260672129256611E-2]
[null,null,null,null,null,null,null,"Wood for cooking",null,7.2597348033787756E-2,null,null,"Electricity for cooking",null,7.5197646737316789E-3]
[null,null,null,null,null,null,null,"Does not cook",null,1.371380080994854E-2,null,null,"Biogas for cooking",null,0.13051591394408296]
[null,null,null,null,null,null,null,"Household cooks in other house",null,4.644783336150355E-2,null,null,"Kerosene for cooking",null,-7.9712988551765892E-3]
[null,null,null,null,null,null,null,"Household cooks in other place",null,4.1432413532084579E-2,null,null,"Charcoal for cooking",null,-6.1671567436322105E-3]
[null,null,null,null,null,null,null,"Has electricity",null,-6.7514143272654537E-2,null,null,"Wood for cooking",null,-0.12632712575242727]
[null,null,null,null,null,null,null,"Has radio",null,-1.6356063380122424E-2,null,null,"Dung for cooking",null,-2.4572348046182049E-3]
[null,null,null,null,null,null,null,"Has television",null,-6.4169651871536781E-2,null,null,"Does not cook",null,-1.4928056017816244E-2]
[null,null,null,null,null,null,null,"Has refrigerator",null,-8.0376090069341474E-2,null,null,"Other fuel for cooking",null,-2.756164150350124E-3]
[null,null,null,null,null,null,null,"Has bicycle",null,-1.5989092646704606E-2,null,null,"Household cooks in other house",null,-4.4150195905438755E-2]
[null,null,null,null,null,null,null,"Has motorcycle/scooter",null,2.7850532704918923E-2,null,null,"Household cooks in other place",null,-4.6525987365393373E-2]
[null,null,null,null,null,null,null,"Has car/truck",null,-1.6888817425980439E-2,null,null,"Has electricity",null,0.12126638789206598]
[null,null,null,null,null,null,null,"Has mobile telephone",null,-3.5917721002663806E-2,null,null,"Has radio",null,1.9737397127207051E-2]
[null,null,null,null,null,null,null,"Has animal-drawn cart",null,2.0748830647996572E-2,null,null,"Has television",null,0.11912279174270789]
[null,null,null,null,null,null,null,"Has boat with a motor",null,5.4518760401918035E-3,null,null,"Has refrigerator",null,0.12049820932598798]
[null,null,null,null,null,null,null,"Air conditioner",null,-2.7537712928226262E-2,null,null,"Has bicycle",null,4.4308905889266018E-2]
[null,null,null,null,null,null,null,"Fan",null,-2.4934494862033117E-2,null,null,"Has motorcycle/scooter",null,2.0033808477447203E-2]
[null,null,null,null,null,null,null,"Generator",null,-2.0796880159537807E-2,null,null,"Has car/truck",null,6.952243122546943E-2]
[null,null,null,null,null,null,null,"Own Real estate",null,3.2736348711540783E-2,null,null,"Has mobile telephone",null,7.6086484254009962E-2]
[null,null,null,null,null,null,null,"Own commercial or industrial property",null,-9.498414119261285E-3,null,null,"Has animal-drawn cart",null,6.5966722182119212E-3]
[null,null,null,null,null,null,null,"Owns land usable for agriculture",null,4.2677445998498646E-2,null,null,"Has boat with a motor",null,1.2421397354848018E-2]
[null,null,null,null,null,null,null,"No milk cows or bulls",null,-9.311434208852333E-2,null,null,"Air conditioner",null,7.9810358716496166E-2]
[null,null,null,null,null,null,null,"1-2 cmilk cows or bulls",null,8.1841082656113187E-2,null,null,"Fan",null,0.10651523903003463]
[null,null,null,null,null,null,null,"5-5 milk cows or bulls",null,4.4125559378382896E-2,null,null,"Generator",null,7.2957878414605548E-2]
[null,null,null,null,null,null,null,"6+ milk cows or bulls",null,6.8501607409288245E-3,null,null,"Own Real estate",null,-1.5700722076631663E-2]
[null,null,null,null,null,null,null,"No horses, donkeys, mules",null,-0.12024274398099108,null,null,"Own commercial or industrial property",null,2.3161226364339461E-2]
[null,null,null,null,null,null,null,"1 horse, donkey, mule",null,8.8017263228059764E-2,null,null,"Owns land usable for agriculture",null,-6.016569733319709E-3]
[null,null,null,null,null,null,null,"2-3 horses, donkeys, mules",null,7.7338066513613662E-2,null,null,"No milk cows or bulls",null,5.0686138388176788E-2]
[null,null,null,null,null,null,null,"4+ horses, donkeys, mules",null,2.5528553889487143E-2,null,null,"1-2 cmilk cows or bulls",null,-5.0190522765072999E-2]
[null,null,null,null,null,null,null,"No goats",null,-0.11451763899305299,null,null,"5-5 milk cows or bulls",null,-4.8373602829568192E-3]
[null,null,null,null,null,null,null,"1-4 goats",null,9.2034901313934422E-2,null,null,"6+ milk cows or bulls",null,-2.4272012664422926E-3]
[null,null,null,null,null,null,null,"5-9 goats",null,5.115284974176916E-2,null,null,"No horses, donkeys, mules",null,6.6545327805493146E-2]
[null,null,null,null,null,null,null,"10+ more goats",null,3.7469921809320919E-2,null,null,"1 horse, donkey, mule",null,-5.9822517481696667E-2]
[null,null,null,null,null,null,null,"No sheepss",null,-0.12633229280086766,null,null,"2-3 horses, donkeys, mules",null,-2.0317029794691743E-2]
[null,null,null,null,null,null,null,"1-4 sheepss",null,7.7646073985043848E-2,null,null,"4+ horses, donkeys, mules",null,-4.9167771801218044E-3]
[null,null,null,null,null,null,null,"5-9 sheepss",null,8.0666082314886756E-2,null,null,"No goats",null,1.7340894365380714E-2]
[null,null,null,null,null,null,null,"10+ more sheepss",null,5.512442584184149E-2,null,null,"1-4 goats",null,-1.0963025710907119E-2]
[null,null,null,null,null,null,null,"No chickens",null,-8.3299641807102587E-2,null,null,"5-9 goats",null,-1.3922119172311586E-3]
[null,null,null,null,null,null,null,"1-3 chickens",null,5.1381209203113926E-2,null,null,"10+ more goats",null,-1.3402424547722565E-2]
[null,null,null,null,null,null,null,"4-9 chickens",null,5.9747920406252743E-2,null,null,"No sheepss",null,-2.3083251622428482E-4]
[null,null,null,null,null,null,null,"10+ chickens",null,2.4600799778452011E-2,null,null,"1-4 sheepss",null,-1.046560023210868E-2]
[null,null,null,null,null,null,null,"No camels",null,-4.5419636882621031E-2,null,null,"5-9 sheepss",null,9.4899476292841858E-3]
[null,null,null,null,null,null,null,"1 camel",null,2.4653533841033696E-2,null,null,"10+ more sheepss",null,6.0835824617432848E-3]
[null,null,null,null,null,null,null,"2-3 camels",null,3.1908364215475493E-2,null,null,"No chickens",null,4.008583053327211E-2]
[null,null,null,null,null,null,null,"4+ camels",null,2.1599135100741757E-2,null,null,"1-3 chickens",null,-4.2885679926778802E-2]
[null,null,null,null,null,null,null,null,null,null,null,null,"4-9 chickens",null,-5.7763333734330378E-3]
[null,null,null,null,null,null,null,null,null,null,null,null,"10+ chickens",null,2.4250014348236402E-3]
[null,null,null,null,null,null,null,"Component Score Covariance Matrix",null,null,null,null,"No camels",null,-3.0081494636603778E-3]
[null,null,null,null,null,null,null,"Component",null,"1",null,null,"1 camel",null,-2.5970080744020566E-3]
[null,null,null,null,null,null,null,"1",null,1,null,null,"2-3 camels",null,3.8521057603620739E-3]
[null,null,null,null,null,null,null,null,null,null,null,null,"4+ camels",null,6.2669653646472067E-3]
[]
[]
[null,null,null,null,null,null,null,null,null,null,null,null,"Component Score Covariance Matrix"]
[null,null,null,null,null,null,null,null,null,null,null,null,"Component",null,"1"]
[null,null,null,null,null,null,null,null,null,null,null,null,"1",null,1]
[]
[]
[]
[]
[]
[]
[]
[]
[]
[]
[]
[]
[]
[]
[]
[]
[]
[]
[]
[]
[]
[]
[]
[]
[]
[]
[]
[]
[]
[]
[]
[]
[]
[]
[]
[]
[]
[]
[]
[]
[]
[]
[]
[]
[]
[]
[]
[]
[]
[]
[]
[]
[]
[]
[]
[]
[]
[]
[]
[]
[]
[]
[]
[]
[]
[]
[]
[]
[]
[]
[]
[]
[]
[]
[]
[]
[]
[]
[]
[]
[]
[]
[]
[]
[]
[]
[]
[]
[]
[]
[]
[]
[]
[]
[]
[]
[]
[]
[]
[]
[]
[]
[]
[]
[]
[]
[]
[]
[]
[]
[]
[]
[]
[]
[]
[]
[]
[]
[]
[]
[]
[]
[]
[]
[]
[]
[]
[]
[]
[]
[]
[]
[]
[]
[]
[]
[]
[]
[]
[]
[]
[]
[]
[]
[]
[]
[]
[]
[]
[]
[]
[]
[]
[]
[]
[]
[]
[]
[]
[]
[]
[]
[]
[]
[]
[]
[]
[]
[]
[]
[]
[]
[]
[]
[]
[]
[]
[]
[]
[]
[]
[]
[]
[]
[]
[]
[]
[]
[]
[]
[]
[]
[]
[]
[]
[]
[]
[]
[]
[]
[]
[]
[]
[]
[]
[]
[]
[]
[]
[]
[]
[]
[]
[]
[]
[]
[]
[]
[]
[]
[]
[]
[]
[]
[]
[]
[]
[]
[]
[]
[]
[]
[]
[]
[]
[]
[]
[]
[]
[]
[]
[]
[]
[]
[]
[]
[]
[]
[]
[]
[]
[]
[]
[]
[]
[]
[]
[]
[]
[]
[]
[]
[]
[]
[]
[]
[]
[]
[]
[]
[]
[]
[]
[]
[]
[]
[]
[]
[]
[]
[]
[]
[]
[]
[]
[]
[]
[]
[]
[]
[]
[]
[]
[]
[]
[]
[]
[]
[]
[]
[]
[]
[]
[]
[]
[]
[]
[]
[]
[]
[]
[]
[]
[]
[]
[]
[]
[]
[]
[]
[]
[]
[]
[]
[]
[]
[]
[]
[]
[]
[]
[]
[]
[]
[]
[]
[]
[]
[]
[]
[]
[]
[]
[]
[]
[]
[]
[]
[]
[]
[]
[]
[]
[]
[]
[]
[]
[]
[]
[]
[]
[]
[]
[]
[]
[]
[]
[]
[]
[]
[]
[]
[]
[]
[]
[]
[]
[]
[]
["DHS13"]
["Yemen",null,"Count"]
["W_text_t","",17351]
["W_text_i","",17351]
["S_text_s","Ratio of Shared improved based on:",17351]
["S_text_i","Ratio of Improved latrines based on:",17351]
["Urban/Rural","Urban",4693]
[null,"Rural",12658]
[null,"Missing",0]
["2013"]
[]
["Sub-national region names","Weighted population"]
[{"$f":"R15","v":"Abyan"},{"$f":"BR122+BR123","v":{"$error":"#VALUE!"}}]
[{"$f":"S15","v":"Aden"},{"$f":"BS122+BS123","v":{"$error":"#VALUE!"}}]
[{"$f":"T15","v":"Al-Baidha"},{"$f":"BT122+BT123","v":{"$error":"#VALUE!"}}]
[{"$f":"U15","v":"Al-Hodiedah"},{"$f":"BU122+BU123","v":{"$error":"#VALUE!"}}]
[{"$f":"V15","v":"Al-Jawf"},{"$f":"BV122+BV123","v":{"$error":"#VALUE!"}}]
[{"$f":"W15","v":"Al-Mhrah"},{"$f":"BW122+BW123","v":{"$error":"#VALUE!"}}]
[{"$f":"X15","v":"Al-Mhweit"},{"$f":"BX122+XR123","v":{"$error":"#VALUE!"}}]
[{"$f":"Y15","v":"Aldhalae"},{"$f":"BY122+BY123","v":{"$error":"#VALUE!"}}]
[{"$f":"Z15","v":"Amran"},{"$f":"BZ122+BZ123","v":{"$error":"#VALUE!"}}]
[{"$f":"AA15","v":"Dhamar"},{"$f":"CA122+CA123","v":{"$error":"#VALUE!"}}]
[{"$f":"AB15","v":"Hadramout"},{"$f":"CB122+CB123","v":{"$error":"#VALUE!"}}]
[{"$f":"AC15","v":"Hajjah"},{"$f":"CC122+CC123","v":{"$error":"#VALUE!"}}]
[{"$f":"AD15","v":"Ibb"},{"$f":"CD122+CD123","v":{"$error":"#VALUE!"}}]
[{"$f":"AE15","v":"lahj"},{"$f":"CE122+CE123","v":{"$error":"#VALUE!"}}]
[{"$f":"AF15","v":"Mareb"},{"$f":"CF122+CF123","v":{"$error":"#VALUE!"}}]
[{"$f":"AG15","v":"Reimah"},{"$f":"CG122+CG123","v":{"$error":"#VALUE!"}}]
[{"$f":"AH15","v":"Sadah"},{"$f":"CH122+CH123","v":{"$error":"#VALUE!"}}]
[{"$f":"AI15","v":"Sanaa"},{"$f":"CI122+CI123","v":{"$error":"#VALUE!"}}]
[{"$f":"AJ15","v":"Sanaa City"},{"$f":"CJ122+CJ123","v":{"$error":"#VALUE!"}}]
[{"$f":"AK15","v":"Shabwah"},{"$f":"CK122+CK123","v":{"$error":"#VALUE!"}}]
[{"$f":"AL15","v":"Taiz"},{"$f":"CL122+CL123","v":{"$error":"#VALUE!"}}]
[{"$f":"AM15","v":0},{"$f":"CM122+CM123","v":0}]
[{"$f":"AN15","v":0},{"$f":"CN122+CN123","v":0}]
[{"$f":"AO15","v":0},{"$f":"CO122+CO123","v":0}]
[{"$f":"AP15","v":0},{"$f":"CP122+CP123","v":0}]
[{"$f":"AQ15","v":0},{"$f":"CQ122+CQ123","v":0}]
[{"$f":"AR15","v":0},{"$f":"CR122+CR123","v":0}]
[{"$f":"AS15","v":0},{"$f":"CS122+CS123","v":0}]
[{"$f":"AT15","v":0},{"$f":"CT122+CT123","v":0}]
[{"$f":"AU15","v":0},{"$f":"CU122+CU123","v":0}]
[{"$f":"AV15","v":0},{"$f":"CV122+CV123","v":0}]
[{"$f":"AW15","v":0},{"$f":"CW122+CW123","v":0}]
[{"$f":"AX15","v":0},{"$f":"CX122+CX123","v":0}]
[{"$f":"AY15","v":0},{"$f":"CY122+CY123","v":0}]
[]
[{"$f":"34-COUNTIF(A1037:A1071,\"0\")","v":21},"Sub-regions"]

{"sheet":"data_summary","index":6,"n_rows":116,"n_cols":100,"rows_kept":116,"cut":false,"hidden":false,"merged":[]}
["iso3","year","data_source","row","var1","var2","varname","total_q1","total_q2","total_q3","total_q4","total_q5","urban_q1","urban_q2","urban_q3","urban_q4","urban_q5","rural_q1","rural_q2","rural_q3","rural_q4","rural_q5","region_1_name","region_2_name","region_3_name","region_4_name","region_5_name","region_6_name","region_7_name","region_8_name","region_9_name","region_10_name","region_11_name","region_12_name","region_13_name","region_14_name","region_15_name","region_16_name","region_17_name","region_18_name","region_19_name","region_20_name","region_21_name","region_1","region_2","region_3","region_4","region_5","region_6","region_7","region_8","region_9","region_10","region_11","region_12","region_13","region_14","region_15","region_16","region_17","region_18","region_19","region_20","region_21","n_total_q1","n_total_q2","n_total_q3","n_total_q4","n_total_q5","n_urban_q1","n_urban_q2","n_urban_q3","n_urban_q4","n_urban_q5","n_rural_q1","n_rural_q2","n_rural_q3","n_rural_q4","n_rural_q5","n_region_1","n_region_2","n_region_3","n_region_4","n_region_5","n_region_6","n_region_7","n_region_8","n_region_9","n_region_10","n_region_11","n_region_12","n_region_13","n_region_14","n_region_15","n_region_16","n_region_17","n_region_18","n_region_19","n_region_20","n_region_21"]
["YEM",2006,"YEM_2006_MICS",16,"Water","Improved","w_imp",37.470953026076693,57.682045045979898,74.732131802316559,93.419767844387863,98.503961806104485,95.094665411921568,96.890455270907538,97.614137988894981,98.307922264614191,100,36.277117923002962,43.146588746250693,65.09360086198113,69.456629859697799,91.852240859110637,"Abyan","Aden","Al Baidhah","Al Dala'a","Al Hodeidah","Al Jawf","Al Maharah","Al Mahweet","Amran","Dhamar","Hadramout","Hajjah","Ibb","Lahej","Mareb","Raimah","Sa'adah","Sana'a","Sana'a City","Shabwah","Taiz",75.201447894161944,97.465352667600328,80.491682898967184,98.224811761297175,75.689175457007309,61.968098654874623,100,42.287000620571071,65.799117920622535,42.858618583977453,95.432505952934505,50.114749723358209,65.571228178996293,88.333226853866137,69.714576211615764,79.267385813925102,82.582350556923174,60.849794514052981,100,100,70.488436323272197]
["YEM",2006,"YEM_2006_MICS",17,"Water","Not Improved","",62.529046973923087,42.317954954020067,25.267868197683342,6.5802321556122054,1.4960381938955349,4.9053345880784249,3.109544729092458,2.3858620111050031,1.6920777353858041,0,63.722882076997053,56.853411253749478,34.906399138018926,30.543370140302219,8.1477591408893915,"Abyan","Aden","Al Baidhah","Al Dala'a","Al Hodeidah","Al Jawf","Al Maharah","Al Mahweet","Amran","Dhamar","Hadramout","Hajjah","Ibb","Lahej","Mareb","Raimah","Sa'adah","Sana'a","Sana'a City","Shabwah","Taiz",24.79855210583808,2.5346473323996741,19.508317101032901,1.7751882387028071,24.310824542992801,38.031901345125377,0,57.712999379428979,34.20088207937745,57.14138141602254,4.567494047065451,49.885250276641649,34.428771821003643,11.66677314613389,30.285423788384222,20.73261418607489,17.417649443076879,39.150205485946962,0,0,29.511563676727871]
["YEM",2006,"YEM_2006_MICS",18,"Water ladder","Basic","w_bas",21.735441162824209,46.034283466918083,67.689297138237905,91.486510042657002,95.614283421517541,91.428619931042249,95.292391113593055,95.198505768621374,96.406305166778253,98.630894067728306,17.91404737920675,31.458028606494651,53.737240806658043,62.687314238887403,88.223910564806388,"Abyan","Aden","Al Baidhah","Al Dala'a","Al Hodeidah","Al Jawf","Al Maharah","Al Mahweet","Amran","Dhamar","Hadramout","Hajjah","Ibb","Lahej","Mareb","Raimah","Sa'adah","Sana'a","Sana'a City","Shabwah","Taiz",69.968477982385608,97.465352667600328,72.356101140840138,98.224811761297175,63.641965533236167,27.373260898519611,100,21.118043000456058,64.223663980447157,32.808863446765507,94.45444166802136,41.995978464068713,60.137145238984459,82.993771151272909,59.116391553469192,48.199593381195363,81.43793846997832,50.578313404985963,99.194979063177612,92.426775225353751,61.096866179858402]
["YEM",2006,"YEM_2006_MICS",19,"Water ladder","Limited","w_lim",15.66515419051575,11.60459092616534,7.0428346640786499,1.933257801730907,2.8866637193316591,3.666045480879323,1.598064157314494,2.4094070617358638,1.8949278325822521,1.369105932271705,18.259564637182219,11.68856013975604,11.304880117346359,6.7693156208103868,3.6283302943042322,"Abyan","Aden","Al Baidhah","Al Dala'a","Al Hodeidah","Al Jawf","Al Maharah","Al Mahweet","Amran","Dhamar","Hadramout","Hajjah","Ibb","Lahej","Mareb","Raimah","Sa'adah","Sana'a","Sana'a City","Shabwah","Taiz",5.2329699117763289,0,8.1355817581270333,0,12.04720992377111,34.594837756355027,0,21.168957620114998,1.575453940175386,10.04975513721196,0.94357097253175637,7.9515328885249534,5.4340829400118089,5.3394557025932494,10.598184658146589,31.067792432729711,1.144412086944858,10.27148110906702,0.80502093682240838,7.573224774646234,9.3426362981627395]
["YEM",2006,"YEM_2006_MICS",20,"Water ladder","Unimproved","w_unimp",53.756291717692868,35.846161152178418,20.03146860914071,5.5607634041046392,1.1482064460790959,4.9053345880784249,3.109544729092458,2.3920871696427422,1.698767000639495,0,54.187431541937912,49.279863817345692,28.283395297400372,24.692903763691319,6.1693097370056114,"Abyan","Aden","Al Baidhah","Al Dala'a","Al Hodeidah","Al Jawf","Al Maharah","Al Mahweet","Amran","Dhamar","Hadramout","Hajjah","Ibb","Lahej","Mareb","Raimah","Sa'adah","Sana'a","Sana'a City","Shabwah","Taiz",24.79855210583808,2.5346473323996741,19.508317101032901,1.7751882387028071,22.70637922844541,38.031901345125377,0,54.480303193632253,34.20088207937745,48.603442539921701,3.7999520327948431,36.667751957531827,30.40912941448055,5.8949160737431594,30.285423788384222,6.3382933699041386,17.417649443076879,16.588555806226729,0,0,26.493015814732281]
["YEM",2006,"YEM_2006_MICS",21,"Water ladder","Surface water","w_sur",8.8431129289669492,6.5149644547381342,5.236399588542624,1.0194687515075651,0.35084641307170339,0,0,0,0,0,9.6389564416732458,7.573547436403774,6.6744837785953246,5.850466376610906,1.978449403883777,"Abyan","Aden","Al Baidhah","Al Dala'a","Al Hodeidah","Al Jawf","Al Maharah","Al Mahweet","Amran","Dhamar","Hadramout","Hajjah","Ibb","Lahej","Mareb","Raimah","Sa'adah","Sana'a","Sana'a City","Shabwah","Taiz",0,0,0,0,1.604445314547396,0,0,3.2326961857967138,0,8.5379388761008528,0.80203532665199273,13.384736689874369,4.0196424065231007,5.7718570723907359,0,14.394320816170749,0,22.561649679720229,0,0,3.0674817072466469]
["YEM",2006,"YEM_2006_MICS",22,"Improved water point at more than 30 minutes","Yes","",41.884772267714212,20.133271248541021,9.424105126170554,2.0694311775118011,2.9305948857567219,3.8551536671369671,1.649351479303381,2.4684546486752761,1.927674531401431,1.369105932271705,50.477581914986693,27.090345910073221,17.38086021296116,9.7461043452358478,3.950181574633131,"Abyan","Aden","Al Baidhah","Al Dala'a","Al Hodeidah","Al Jawf","Al Maharah","Al Mahweet","Amran","Dhamar","Hadramout","Hajjah","Ibb","Lahej","Mareb","Raimah","Sa'adah","Sana'a","Sana'a City","Shabwah","Taiz",6.9586026044886502,0,10.107357015182281,0,15.916688021808509,55.826850439655509,0,50.060201266242267,2.3943389971822291,23.448621232437539,0.98908870993676223,15.919777929260229,8.2872977842932176,6.0446741195434468,15.202250711495729,39.193663464138048,1.385782893350834,16.880058825334029,0.80502093682240838,7.573224774646234,13.26334793616391]
["YEM",2006,"YEM_2006_MICS",23,"Improved water point at more than 30 minutes","No","",58.11522773228576,79.866728751458965,90.575894873829441,97.930568822488226,97.069405114243295,96.144846332863025,98.350648520696623,97.531545351324738,98.072325468598549,98.630894067728306,49.522418085013257,72.909654089926761,82.619139787038904,90.253895654764136,96.049818425366851,"Abyan","Aden","Al Baidhah","Al Dala'a","Al Hodeidah","Al Jawf","Al Maharah","Al Mahweet","Amran","Dhamar","Hadramout","Hajjah","Ibb","Lahej","Mareb","Raimah","Sa'adah","Sana'a","Sana'a City","Shabwah","Taiz",93.041397395511353,100,89.892642984817712,100,84.083311978191446,44.173149560344513,100,49.939798733757698,97.605661002817769,76.551378767562497,99.010911290063234,84.080222070739765,91.712702215706727,93.95532588045657,84.797749288504292,60.806336535861902,98.614217106649178,83.119941174665982,99.194979063177612,92.426775225353751,86.736652063836118]
["YEM",2006,"YEM_2006_MICS",24,"Manually calculated ratios","Improved wells","",30.103553973949179,33.72087888435987,32.188805136642991,37.55224799335118,83.156909727553739,100,100,100,100,100,35.971211041714021,22.33385948718848,39.513743986318069,26.717504683522812,43.682212691038671,"Abyan","Aden","Al Baidhah","Al Dala'a","Al Hodeidah","Al Jawf","Al Maharah","Al Mahweet","Amran","Dhamar","Hadramout","Hajjah","Ibb","Lahej","Mareb","Raimah","Sa'adah","Sana'a","Sana'a City","Shabwah","Taiz",3.1345335235784448,50,13.40250881553847,0,40.534054122003653,55.744908384144573,50,45.626874444260253,15.72557447591468,46.842128373326041,100,17.692761669812182,14.75472601064541,47.661974983844978,43.400887880298043,95.46753453733038,23.3026312434197,27.793200605267131,100,50,30.643755832674781]
["YEM",2006,"YEM_2006_MICS",25,"Manually calculated ratios","Improved springs","",20.10531081951342,24.303315822835831,25.765675999828449,31.920222845260639,0,50,50,50,50,50,17.873038091779559,25.595653247022401,31.3982517574503,20.34508686894798,28.91503726914214,"Abyan","Aden","Al Baidhah","Al Dala'a","Al Hodeidah","Al Jawf","Al Maharah","Al Mahweet","Amran","Dhamar","Hadramout","Hajjah","Ibb","Lahej","Mareb","Raimah","Sa'adah","Sana'a","Sana'a City","Shabwah","Taiz",0,50,0,50,17.288167082362389,0,50,35.105008171962332,49.211524337334417,4.4321599818229229,50,0,12.851275087007551,0,50,87.648694326108654,50,18.818241653217449,50,50,39.674900301163603]
["YEM",2006,"YEM_2006_MICS",29,"Piped water","Yes","w_pip",8.6612974103887233,25.179588801285831,42.181671905907827,62.488320277801691,70.254718528566784,71.345694406095134,70.136650076126088,71.357669418863878,71.987354074467873,76.925619441368923,4.4786587029094651,15.056833599486319,27.88209068268533,38.04196335975147,55.383471982080358,"Abyan","Aden","Al Baidhah","Al Dala'a","Al Hodeidah","Al Jawf","Al Maharah","Al Mahweet","Amran","Dhamar","Hadramout","Hajjah","Ibb","Lahej","Mareb","Raimah","Sa'adah","Sana'a","Sana'a City","Shabwah","Taiz",29.86639841425691,97.465352667600328,64.952761490658261,80.942307397627545,54.72265453785424,0,0,2.7275874067659771,13.517011925719119,24.010324408761949,77.699317395556264,15.953635829284449,47.477270669380758,49.90736904483483,44.469378764109443,17.07767163423506,0,11.969061535741661,62.272328856358008,24.2579558432694,44.760893565302808]
["YEM",2006,"YEM_2006_MICS",30,"Piped water","No","",91.338702589611273,74.820411198714083,57.818328094092109,37.51167972219838,29.74528147143328,28.654305593904901,29.863349923873901,28.642330581136061,28.012645925532151,23.07438055863107,95.521341297090487,84.943166400513647,72.117909317314783,61.958036640248579,44.616528017919499,"Abyan","Aden","Al Baidhah","Al Dala'a","Al Hodeidah","Al Jawf","Al Maharah","Al Mahweet","Amran","Dhamar","Hadramout","Hajjah","Ibb","Lahej","Mareb","Raimah","Sa'adah","Sana'a","Sana'a City","Shabwah","Taiz",70.133601585743094,2.5346473323996741,35.047238509341803,19.05769260237243,45.277345462145753,100,100,97.272412593234023,86.482988074280897,75.989675591238068,22.300682604443651,84.046364170715535,52.522729330619121,50.092630955165227,55.530621235890557,82.922328365764912,100,88.030938464258313,37.727671143642013,75.7420441567306,55.23910643469727]
["YEM",2006,"YEM_2006_MICS",31,"Piped water on premises","Yes","w_pop",7.2966574358242999,21.454826515506809,39.198729660463833,61.538925337314673,68.43120348174368,67.56398846585239,69.43493930251276,71.357669418863878,71.642704044419673,76.925619441368923,3.9723883373900719,12.521812083950779,23.75821914010432,35.226429952219974,51.844379405822991,"Abyan","Aden","Al Baidhah","Al Dala'a","Al Hodeidah","Al Jawf","Al Maharah","Al Mahweet","Amran","Dhamar","Hadramout","Hajjah","Ibb","Lahej","Mareb","Raimah","Sa'adah","Sana'a","Sana'a City","Shabwah","Taiz",29.86639841425691,97.465352667600328,64.952761490658261,80.942307397627545,52.587352032827738,0,0,1.9194133603167991,13.517011925719119,23.764264367781799,77.699317395556264,15.953635829284449,41.801666754412203,46.341644500007703,40.930938318767623,0,0,9.0963727012547491,61.600832379910067,18.865695093168839,41.403421958675963]
["YEM",2006,"YEM_2006_MICS",32,"Piped water on premises","No","",92.703342564175685,78.54517348449312,60.801270339536082,38.461074662685412,31.56879651825642,32.436011534147653,30.56506069748724,28.642330581136061,28.357295955580351,23.07438055863107,96.027611662609885,87.478187916049194,76.241780859895741,64.773570047780083,48.155620594176867,"Abyan","Aden","Al Baidhah","Al Dala'a","Al Hodeidah","Al Jawf","Al Maharah","Al Mahweet","Amran","Dhamar","Hadramout","Hajjah","Ibb","Lahej","Mareb","Raimah","Sa'adah","Sana'a","Sana'a City","Shabwah","Taiz",70.133601585743094,2.5346473323996741,35.047238509341803,19.05769260237243,47.412647967172269,100,100,98.080586639683204,86.482988074280897,76.235735632218223,22.300682604443651,84.046364170715535,58.198333245587662,53.658355499992368,59.069061681232377,100,100,90.903627298745207,38.399167620089948,81.134304906831161,58.596578041324122]
["YEM",2006,"YEM_2006_MICS",35,"Water source on premises","Yes","",14.078252187495639,31.007622132555969,55.087637148287172,83.715753804429966,87.733002516552759,87.508163452708644,89.394756900259281,92.11038002866178,93.065904355235091,97.25770598640932,10.31135762081392,20.47530948300809,36.08418367915516,49.221716838897187,72.19059098212459,"Abyan","Aden","Al Baidhah","Al Dala'a","Al Hodeidah","Al Jawf","Al Maharah","Al Mahweet","Amran","Dhamar","Hadramout","Hajjah","Ibb","Lahej","Mareb","Raimah","Sa'adah","Sana'a","Sana'a City","Shabwah","Taiz",69.192567334840021,98.36324587491319,67.245691486165697,98.224811761297175,55.992117463975319,12.27051836265078,17.874396135265702,1.9194133603167991,58.371880107407478,24.568022025494919,91.548203337488843,37.456166433680679,54.407035478802527,61.404048529208332,40.930938318767623,3.1352818051378599,70.135367860940406,26.857645484134359,96.67151720270067,88.482387321892176,41.525293029778268]
["YEM",2006,"YEM_2006_MICS",36,"Water source on premises","No","",85.921747812504321,68.992377867443906,44.912362851712707,16.284246195570091,12.266997483447319,12.491836547291371,10.60524309974072,7.8896199713381909,6.9340956447648869,2.7422940135907048,89.688642379186007,79.524690516991953,63.915816320844911,50.778283161102841,27.809409017875371,"Abyan","Aden","Al Baidhah","Al Dala'a","Al Hodeidah","Al Jawf","Al Maharah","Al Mahweet","Amran","Dhamar","Hadramout","Hajjah","Ibb","Lahej","Mareb","Raimah","Sa'adah","Sana'a","Sana'a City","Shabwah","Taiz",30.807432665160011,1.6367541250868241,32.754308513834367,1.7751882387028071,44.007882536024717,87.729481637349267,82.125603864734288,98.080586639683204,41.628119892592522,75.431977974505088,8.4517966625111054,62.543833566319208,45.592964521197338,38.595951470791753,59.069061681232377,96.864718194862135,29.864632139059619,73.142354515865591,3.3284827972993631,11.51761267810781,58.474706970221817]
["YEM",2006,"YEM_2006_MICS",37,"Improved Water source on premises","Yes","w_premises",33.097264740127201,52.257984799894999,73.12663317534286,88.695446380405812,88.637290713081612,92.008628069324701,90.194362357359154,93.565412939410038,94.181069007955841,97.25770598640932,24.013050758366049,45.55378096484889,53.524758504793347,69.956454147092842,78.162421028891856,"Abyan","Aden","Al Baidhah","Al Dala'a","Al Hodeidah","Al Jawf","Al Maharah","Al Mahweet","Amran","Dhamar","Hadramout","Hajjah","Ibb","Lahej","Mareb","Raimah","Sa'adah","Sana'a","Sana'a City","Shabwah","Taiz",92.009621187375558,100,83.543652044860579,100,71.451480698498543,19.801347191544881,17.874396135265702,4.5390151397568621,70.55608955882046,57.32341087325571,95.929790822676992,74.439271451644601,82.973946027489745,66.549718534165009,58.712166870990387,3.9553238358304448,77.973704832780172,44.137610814662168,96.67151720270067,88.482387321892176,58.910787635203121]
["YEM",2006,"YEM_2006_MICS",38,"Improved Water source on premises","No","",66.902735259872827,47.742015200105058,26.87336682465719,11.304553619594151,11.362709286918459,7.9913719306753128,9.8056376426408374,6.4345870605899584,5.8189309920441517,2.7422940135907048,75.98694924163388,54.446219035151103,46.475241495206767,30.043545852907211,21.837578971108069,"Abyan","Aden","Al Baidhah","Al Dala'a","Al Hodeidah","Al Jawf","Al Maharah","Al Mahweet","Amran","Dhamar","Hadramout","Hajjah","Ibb","Lahej","Mareb","Raimah","Sa'adah","Sana'a","Sana'a City","Shabwah","Taiz",7.9903788126244519,0,16.456347955139421,0,28.548519301501369,80.198652808455151,82.125603864734288,95.46098486024313,29.44391044117954,42.676589126744332,4.0702091773229956,25.560728548355421,17.026053972510191,33.450281465835033,41.287833129009641,96.044676164169545,22.026295167219789,55.862389185337861,3.3284827972993631,11.51761267810781,41.089212364796943]
["YEM",2006,"YEM_2006_MICS",41,"Water point at more than 30 minutes","Yes","",59.568074513322522,37.0752146720817,20.56230979167842,4.8360118729526409,3.6976402227468048,4.1283744543092711,2.0349617727877769,3.8739845809461828,2.629724151442157,1.369105932271705,62.090753124113661,52.868522011235193,28.469350899402421,24.14809290526351,7.8224347013100379,"Abyan","Aden","Al Baidhah","Al Dala'a","Al Hodeidah","Al Jawf","Al Maharah","Al Mahweet","Amran","Dhamar","Hadramout","Hajjah","Ibb","Lahej","Mareb","Raimah","Sa'adah","Sana'a","Sana'a City","Shabwah","Taiz",17.818877657412401,0,24.221346264061651,1.7751882387028071,24.193021836169461,58.548166857497783,0,52.839867470422227,19.66446981854984,55.6826163573675,3.476872327728318,40.568871272781159,26.853120005311759,11.23437177633641,37.850659493380689,46.340491826463968,5.942333668203716,35.77666621794986,0.80502093682240838,7.573224774646234,24.606165936207699]
["YEM",2006,"YEM_2006_MICS",42,"Water point at more than 30 minutes","No","w_30min",40.431925486677258,62.924785327918293,79.437690208321484,95.163988127047475,96.302359777253216,95.871625545690748,97.965038227212219,96.1260154190538,97.370275848557839,98.630894067728306,37.909246875886367,47.131477988764964,71.530649100597614,75.851907094736518,92.177565298689956,"Abyan","Aden","Al Baidhah","Al Dala'a","Al Hodeidah","Al Jawf","Al Maharah","Al Mahweet","Amran","Dhamar","Hadramout","Hajjah","Ibb","Lahej","Mareb","Raimah","Sa'adah","Sana'a","Sana'a City","Shabwah","Taiz",82.181122342587614,100,75.778653735938434,98.224811761297175,75.806978163830635,41.451833142502267,100,47.160132529577801,80.33553018145011,44.3173836426325,96.523127672271642,59.43112872721872,73.146879994688149,88.765628223663612,62.149340506619311,53.659508173535983,94.057666331796284,64.223333782050076,99.194979063177612,92.426775225353751,75.393834063792369]
["YEM",2006,"YEM_2006_MICS",58,"Main source of drinking water","Piped into dwelling","",2.5343515285069671,14.86926944934998,28.617103308353521,47.524305575165222,47.930427808416717,45.622310769159803,54.910802825283973,52.053388024453078,46.020472003856533,46.601514837206267,0.44927509352245332,7.9735891965033456,16.06075893109314,26.59760186823782,44.325446934044443,"Abyan","Aden","Al Baidhah","Al Dala'a","Al Hodeidah","Al Jawf","Al Maharah","Al Mahweet","Amran","Dhamar","Hadramout","Hajjah","Ibb","Lahej","Mareb","Raimah","Sa'adah","Sana'a","Sana'a City","Shabwah","Taiz",26.747211753312111,96.192032723216073,55.102371198969543,42.855665888882328,27.231186915219691,0,0,0,11.19921009857989,20.03571719500572,68.510651470680472,13.159104593298441,34.693039663001016,40.275751102577459,17.67832967795,0,0,9.0963727012547491,27.062045018115281,16.269421398675981,27.077821222297739]
["YEM",2006,"YEM_2006_MICS",59,"Main source of drinking water","Piped into yard or plot","",4.7623059073173337,6.5218699353862197,9.7305159039320639,5.20305389562236,2.3188374690240909,18.597110864650599,3.4761694247762658,1.1128817564895681,2.47697378452771,0,3.5231132438676189,4.5482228874474329,7.6974602090111848,8.0349193765941838,6.0162515745381233,"Abyan","Aden","Al Baidhah","Al Dala'a","Al Hodeidah","Al Jawf","Al Maharah","Al Mahweet","Amran","Dhamar","Hadramout","Hajjah","Ibb","Lahej","Mareb","Raimah","Sa'adah","Sana'a","Sana'a City","Shabwah","Taiz",3.1191866609448051,0,4.2010887566688808,37.702138818059908,21.614539079190578,0,0,1.9194133603167991,2.3178018271392271,3.7285471727760808,0.82771342458652764,2.7945312359860099,6.3331416482972598,4.5320792639104841,23.25260864081762,0,0,0,3.2193946892216641,2.5962736944928659,2.5568066570819572]
["YEM",2006,"YEM_2006_MICS",60,"Main source of drinking water","Public tap/standpipe","",1.3646399745644231,3.7247622857790281,2.982942245444002,0.94939494048703488,1.823515046823132,3.781705940242746,0.70171077361333989,0,0.34465003004820238,0,0.50627036551939264,2.5350215155355378,4.1238715425810053,2.815533407531511,3.5390925762573548,"Abyan","Aden","Al Baidhah","Al Dala'a","Al Hodeidah","Al Jawf","Al Maharah","Al Mahweet","Amran","Dhamar","Hadramout","Hajjah","Ibb","Lahej","Mareb","Raimah","Sa'adah","Sana'a","Sana'a City","Shabwah","Taiz",0,0,0,0,2.135302505026516,0,0,0.80817404644917845,0,0.2460600409801465,0,0,5.6756039149685522,3.565724544827134,3.5384404453418119,17.07767163423506,0,2.872688834486905,0.67149647644794375,5.3922607501005677,3.3574716066268611]
["YEM",2006,"YEM_2006_MICS",61,"Main source of drinking water","Tubewell/borehole","",1.369668822345556,5.697811909597748,9.3064960297911767,4.0700498764686346,4.1827614878213861,0.54798929846438771,0.26090024722663818,0.26122164377013363,0.87838703944588625,0,1.510935950482855,3.4494182997769651,7.2791241996173097,11.1537970000954,11.297183232387169,"Abyan","Aden","Al Baidhah","Al Dala'a","Al Hodeidah","Al Jawf","Al Maharah","Al Mahweet","Amran","Dhamar","Hadramout","Hajjah","Ibb","Lahej","Mareb","Raimah","Sa'adah","Sana'a","Sana'a City","Shabwah","Taiz",0,0,5.9212496207130263,0,4.9953172020534193,1.8120123767103311,0,0,22.717967125559941,2.7873893936155021,1.526310395544372,0,0.24942235597387069,0.63001929626419617,0,0,59.676232935073713,11.62758266292577,0.60229958918913162,42.293634735376394,0.2368681325113168]
["YEM",2006,"YEM_2006_MICS",62,"Main source of drinking water","Protected well","",14.285022207529339,11.73378982323583,4.9365106742117071,1.45347611064559,1.9941685338047881,0,1.193324283340869,0,0.72531769389861156,2.1756574914708899,17.89033306922936,9.0927262426479452,13.065052827404759,4.650279616063373,3.1610209697963412,"Abyan","Aden","Al Baidhah","Al Dala'a","Al Hodeidah","Al Jawf","Al Maharah","Al Mahweet","Amran","Dhamar","Hadramout","Hajjah","Ibb","Lahej","Mareb","Raimah","Sa'adah","Sana'a","Sana'a City","Shabwah","Taiz",0.77591064754560457,0,2.740287729167,0,8.5532199400801581,45.710955897288898,0,11.434402280922169,4.5188953241168726,11.403451059366009,0.58145157925499891,7.5176006314080546,2.720001968552848,4.9145905163228161,23.22323147873961,23.523227112141932,5.2919294192129946,4.8533247282400103,2.575314023922616,0,9.5132320605663416]
["YEM",2006,"YEM_2006_MICS",63,"Main source of drinking water","Unprotected well","",33.167920457948682,23.063019190772689,10.399599669915659,2.4170674341854279,0.40391064005853239,0,0,0,0,0,31.844809427037539,31.6200141946413,19.999525492302521,12.755086907297949,4.0753820763451802,"Abyan","Aden","Al Baidhah","Al Dala'a","Al Hodeidah","Al Jawf","Al Maharah","Al Mahweet","Amran","Dhamar","Hadramout","Hajjah","Ibb","Lahej","Mareb","Raimah","Sa'adah","Sana'a","Sana'a City","Shabwah","Taiz",23.977713510852599,0,17.705792679226331,1.7751882387028071,12.54809875440764,36.289279141738241,0,13.626271763036121,24.21706806493464,12.940983011780149,0,34.972095277596182,15.71478270037553,5.3967541520183842,30.285423788384222,1.1168007529787649,17.417649443076879,12.608948858632351,0,0,21.53137001925635]
["YEM",2006,"YEM_2006_MICS",64,"Main source of drinking water","Protected spring","",4.6842001088304173,3.7770680959941281,2.6683548068507141,0.55410596713202198,0,0,0,0,0,0,4.84323224137946,4.9732326472523631,3.6111856198186651,2.6443064311509459,0.80059514753396022,"Abyan","Aden","Al Baidhah","Al Dala'a","Al Hodeidah","Al Jawf","Al Maharah","Al Mahweet","Amran","Dhamar","Hadramout","Hajjah","Ibb","Lahej","Mareb","Raimah","Sa'adah","Sana'a","Sana'a City","Shabwah","Taiz",0,0,0,0,1.1684612967436709,0,0,22.100027549568932,5.0954360150769977,1.498370984721928,0,0,2.1154340018147799,0,0,37.053330424356517,0,0.92248809030165746,0,0,2.475159283194392]
["YEM",2006,"YEM_2006_MICS",65,"Main source of drinking water","Unprotected spring","",18.61412216472587,11.76430133494223,7.6878834958760631,1.181802863511662,0.18056530496488921,0,0,0,0,0,22.2547475005595,14.45675649682588,7.8900458745806619,10.352966316732291,1.9681896203430229,"Abyan","Aden","Al Baidhah","Al Dala'a","Al Hodeidah","Al Jawf","Al Maharah","Al Mahweet","Amran","Dhamar","Hadramout","Hajjah","Ibb","Lahej","Mareb","Raimah","Sa'adah","Sana'a","Sana'a City","Shabwah","Taiz",0.82083859498547507,0,0.54811664196730481,0,5.5902731091480344,1.312146893479895,0,40.85403143059613,5.2587159517445938,32.308418275300582,0,1.573140192490363,14.34545402285643,0.49816192172477392,0,5.2214926169253726,0,3.9796069475943789,0,0,3.7634431188431492]
["YEM",2006,"YEM_2006_MICS",66,"Main source of drinking water","Rainwater collection","",2.4276288061118669,4.0887398594437458,3.311153032470314,1.77156126373939,2.8545021887241231,0,0,0,0,1.3511811012536821,2.1396826072077779,3.111643358914765,5.5358263065694846,3.4053783554550439,6.0811202700145106,"Abyan","Aden","Al Baidhah","Al Dala'a","Al Hodeidah","Al Jawf","Al Maharah","Al Mahweet","Amran","Dhamar","Hadramout","Hajjah","Ibb","Lahej","Mareb","Raimah","Sa'adah","Sana'a","Sana'a City","Shabwah","Taiz",0,0,2.41584995402948,0,0,0,0,6.0249833833139892,9.7247051755194427,1.576509101237719,9.8408542099278939,2.696258854405539,0.074078397542207394,18.238359688486732,0,1.6131566431915501,0,2.8721739043252699,0.92661475259866399,5.36436754870775,4.0492980818979332]
["YEM",2006,"YEM_2006_MICS",67,"Main source of drinking water","Tanker-truck","",2.5459340895607472,3.1977242092794702,8.1185611049282738,14.59915977843748,10.82033649527739,14.409047535683889,15.791421996056529,16.525533250832659,15.545538652852571,11.224632593136439,2.6144641148425398,2.5202884420049321,3.9212850714921781,6.7521789347584011,8.2809519255401991,"Abyan","Aden","Al Baidhah","Al Dala'a","Al Hodeidah","Al Jawf","Al Maharah","Al Mahweet","Amran","Dhamar","Hadramout","Hajjah","Ibb","Lahej","Mareb","Raimah","Sa'adah","Sana'a","Sana'a City","Shabwah","Taiz",8.9549975458352389,0,1.487745171054113,15.15178464760077,1.9796629891045829,14.109197116203889,0,0,5.7885478646250714,0.8585539343010693,3.8175933761558549,10.056698676659821,9.9529870764746047,11.94407225189282,0,0,16.306470509246239,20.981133464977571,15.02848821637099,19.248612968892509,7.405686110966661]
["YEM",2006,"YEM_2006_MICS",68,"Main source of drinking water","Cart with small tank/drum","",3.2357963582444098,3.7525143402712549,3.3881956282276611,4.5061748064198897,2.8630785388969442,4.8896646766240597,5.1790400887431352,4.0056597329747028,1.6313061317278119,1.2730537396795569,2.5121830967010088,4.7330730355797472,3.7715184413557208,2.1646495225970468,4.9079516088622146,"Abyan","Aden","Al Baidhah","Al Dala'a","Al Hodeidah","Al Jawf","Al Maharah","Al Mahweet","Amran","Dhamar","Hadramout","Hajjah","Ibb","Lahej","Mareb","Raimah","Sa'adah","Sana'a","Sana'a City","Shabwah","Taiz",35.604141286524182,0,2.868821820410008,0,4.2698594911711627,0,0,0,4.4365544900050624,0.3290734346158089,1.217448202791841,13.89055573160034,2.9820337092571898,1.888791246582245,2.0219659687667502,0,1.1805607948407919,6.4466903756026097,2.908583169593244,8.8354289037539413,0.40420473838121568]
["YEM",2006,"YEM_2006_MICS",69,"Main source of drinking water","Surface water","",8.83317384330085,6.5083249883623333,5.236399588542624,1.0194687515075651,0.35014084456225097,0,0,0,0,0,9.6233251494001486,7.573547436403774,6.6646547494885482,5.850466376610906,1.978449403883777,"Abyan","Aden","Al Baidhah","Al Dala'a","Al Hodeidah","Al Jawf","Al Maharah","Al Mahweet","Amran","Dhamar","Hadramout","Hajjah","Ibb","Lahej","Mareb","Raimah","Sa'adah","Sana'a","Sana'a City","Shabwah","Taiz",0,0,0,0,1.604445314547396,0,0,3.2326961857967138,0,8.5379388761008528,0.79602382490235779,13.34001480655512,4.0196424065231007,5.7718570723907359,0,14.394320816170749,0,22.561649679720229,0,0,3.0624038605337738]
["YEM",2006,"YEM_2006_MICS",70,"Main source of drinking water","Bottled water","",0.26140522306562708,0.31849513764254128,1.672299068107173,12.788485630270319,23.71633423731592,7.2468363270961076,15.377085631866739,23.655453580374779,30.68527692825683,37.3739602372532,0.28762814025046363,0.2093731205876328,0.027517713037749501,1.237985347214084,3.442626620136191,"Abyan","Aden","Al Baidhah","Al Dala'a","Al Hodeidah","Al Jawf","Al Maharah","Al Mahweet","Amran","Dhamar","Hadramout","Hajjah","Ibb","Lahej","Mareb","Raimah","Sa'adah","Sana'a","Sana'a City","Shabwah","Taiz",0,1.273319944384258,5.7542686479551373,2.515222406754186,3.7416260384174711,0.33593326467152113,100,0,0,0.39494626735748689,9.1104832939925391,0,0.7754854431139161,2.343838943002301,0,0,0.12715689854942869,1.177339751938463,47.005764064540422,0,13.41188842974781]
["YEM",2006,"YEM_2006_MICS",71,"Main source of drinking water","Other","",1.913830507947784,0.9630426566736483,1.9439854433489749,1.96189310640755,0.56142140430986298,4.9053345880784249,3.109544729092458,2.3858620111050031,1.6920777353858041,0,0,3.2030931258784872,0.32433226552529282,1.584850539661067,0.12573804031740859,"Abyan","Aden","Al Baidhah","Al Dala'a","Al Hodeidah","Al Jawf","Al Maharah","Al Mahweet","Amran","Dhamar","Hadramout","Hajjah","Ibb","Lahej","Mareb","Raimah","Sa'adah","Sana'a","Sana'a City","Shabwah","Taiz",0,2.5346473323996741,1.254407779839259,0,4.5303775508141273,0.43047530990725269,0,0,4.7250980626982129,3.3540412528409518,3.7714702221630931,0,0.34889269124856193,0,0,0,0,0,0,0,1.1543466780946079]
["YEM",2006,"YEM_2006_MICS",72,"Main source of drinking water","Missing","",0,0.0192667832691788,0,0,0,0,0,0,0,0,0,0,0.027840756121883699,0,0,"Abyan","Aden","Al Baidhah","Al Dala'a","Al Hodeidah","Al Jawf","Al Maharah","Al Mahweet","Amran","Dhamar","Hadramout","Hajjah","Ibb","Lahej","Mareb","Raimah","Sa'adah","Sana'a","Sana'a City","Shabwah","Taiz",0,0,0,0,0.037629814075597602,0,0,0,0,0,0,0,0,0,0,0,0,0,0,0,0]
["YEM",2006,"YEM_2006_MICS",122,"Sanitation","Improved","s_imp",9.0343888725650494,28.89174324696798,49.692229489861482,82.622587759865098,90.596425003257337,79.504882634450297,93.772105591445907,92.738798234473308,96.945136108031164,100,6.0785042741396209,18.821465166808832,33.264461631247769,42.373228450318088,70.564540513171963,"Abyan","Aden","Al Baidhah","Al Dala'a","Al Hodeidah","Al Jawf","Al Maharah","Al Mahweet","Amran","Dhamar","Hadramout","Hajjah","Ibb","Lahej","Mareb","Raimah","Sa'adah","Sana'a","Sana'a City","Shabwah","Taiz",75.093138924728748,85.89251695118304,37.239951838536442,72.956587231233001,55.847721410572753,14.09822756284859,97.584541062801947,14.85194720947387,39.94528161935208,26.732848530963789,67.125438098670557,21.552225579309621,46.490592539182657,45.846604516434041,45.999725789443552,9.0037837545801036,43.401637259560118,52.071539735394559,98.835124954659065,65.980339319779475,60.800527859154457,471.34238064945242,1506.495375259085,2593.62226090078,4313.4756294732042,4725.8481415458073,1274.0748096808461,1507.846687336126,1489.396451135093,1553.7176424689569,1602.8949948259999,219.79147020711099,679.12942470539338,1200.3357501181231,1533.8621349841731,2549.7344223665082,387.54386348925868,733.52566558647106,253.3306087842804,399.2962905008435,1490.9966035573229,64.544314591555889,81.962576707595815,108.56878755822299,310.64345266899772,703.96765449772067,939.48208564409833,342.76546072192332,1518.251130651922,407.77857356891582,99.163957964149418,41.251239865683807,338.92278447889407,630.92539587717579,2310.0997884789681,294.0461449875495,2153.71740764678]
["YEM",2006,"YEM_2006_MICS",123,"Sanitation","Not Improved","",90.965611127434983,71.108256753031924,50.307770510138447,17.377412240134891,9.4035749967427282,20.495117365549699,6.2278944085540768,7.2612017655266579,3.0548638919688371,0,93.921495725860368,81.178534833191122,66.735538368752316,57.626771549681962,29.435459486827909,"Abyan","Aden","Al Baidhah","Al Dala'a","Al Hodeidah","Al Jawf","Al Maharah","Al Mahweet","Amran","Dhamar","Hadramout","Hajjah","Ibb","Lahej","Mareb","Raimah","Sa'adah","Sana'a","Sana'a City","Shabwah","Taiz",24.90686107527128,14.10748304881697,62.760048161463637,27.043412768766981,44.152278589427297,85.901772437151408,2.4154589371980668,85.148052790526137,60.054718380647913,73.267151469036236,32.874561901329422,78.447774420690322,53.509407460817251,54.153395483566037,54.000274210556427,90.996216245419888,56.598362740439903,47.928460264605377,1.1648750453409309,34.01966068022049,39.199472140845607,4745.8603244586866,3707.7811132916058,2625.749635926561,907.22218019831269,490.52561865046488,328.43659271794968,100.14395958998369,116.61578914585439,48.959608649207539,0,3396.0893500497982,2929.1413378865659,2408.1271296495129,2086.022851553028,1063.602253283718,128.54038740045559,120.4784917295499,426.93506363834177,148.01041017484701,1178.757087190492,393.27433178667371,2.0287766511781138,622.43830549802169,467.02900344031627,1929.375566230658,460.10965223493531,1247.6292735044201,1747.4657546992939,481.66259196548049,116.4111487616095,416.90325373485229,441.97583105487672,580.7257269497469,27.22693573849385,151.61107353997139,1388.550206601418]
["YEM",2006,"YEM_2006_MICS",124,"Sanitation ladder","Basic","s_bas",7.884066995293491,26.04080340027927,47.520540464470749,79.625054880474494,89.255065267043392,77.322047859473074,89.81918369853328,89.919947306482044,96.945136108031164,99.728042813566148,5.3908871239152054,16.687585663561119,30.787658577072929,39.71245362681077,67.429776513321499,"Abyan","Aden","Al Baidhah","Al Dala'a","Al Hodeidah","Al Jawf","Al Maharah","Al Mahweet","Amran","Dhamar","Hadramout","Hajjah","Ibb","Lahej","Mareb","Raimah","Sa'adah","Sana'a","Sana'a City","Shabwah","Taiz",69.606412648595779,85.094123641736871,37.239951838536442,68.283680785119799,52.076000121930143,13.036013410983919,95.652173913043484,13.94387944171266,33.232618481182683,26.437576481787609,63.828693545710848,18.644714486935861,44.906572918518258,41.858127389059533,41.955793851910059,9.0037837545801036,41.054911601705207,50.515940156148318,98.041028843256413,64.875910706810231,58.960330828944542,411.32775655098987,1357.839489130472,2477.156369629452,4156.9834960946764,4655.8778042361064,1239.0946335163101,1444.2840730177959,1444.1253601962801,1553.7176424689569,1598.5358066965821,194.92805355534921,602.13327448076359,1110.9612313032731,1434.9399953415459,2436.464845064831,359.22773328870881,726.70735353206783,253.3306087842804,373.72116040495962,1390.300935249066,59.681300139851032,80.339555386653316,101.93074776613101,258.44092037205121,696.19212800803405,893.34112126189711,296.52455741176419,1463.5756470527961,372.30341612012319,90.446247373894536,41.251239865683807,320.59723630632942,612.07695610854785,2291.5391678511819,289.12417915036872,2088.5327042072968]
["YEM",2006,"YEM_2006_MICS",125,"Sanitation ladder","Limited","s_lim",1.1503218772715611,2.8509398466886999,2.108379472350804,2.9975328793907061,1.3413597362139651,2.1828347749772039,3.952921892912634,2.8188509279912388,0,0.27195718643386119,0.68761715022441428,2.133879503247714,2.4768030541748312,2.5561527081536548,3.1347639998504708,"Abyan","Aden","Al Baidhah","Al Dala'a","Al Hodeidah","Al Jawf","Al Maharah","Al Mahweet","Amran","Dhamar","Hadramout","Hajjah","Ibb","Lahej","Mareb","Raimah","Sa'adah","Sana'a","Sana'a City","Shabwah","Taiz",5.4867262761329538,0.79839330944616349,0,4.6729064461132106,3.771721288642591,1.062214151864677,1.932367149758454,0.90806776776121212,6.7126631381693844,0.29527204917617578,3.2967445529597161,2.9075110923737539,1.4763158006004939,3.9884771273745172,4.0439319375334994,0,2.346725657854897,1.5555995792462509,0.79409611140265446,1.1044286129692431,1.8401970302099191,60.01462409846259,148.65588612861211,109.9058552045436,156.49213337853411,69.97033730970314,34.980176164535798,63.562614318329693,45.271090938812392,0,4.3591881294179746,24.863416651761739,76.996150224629844,89.374518814849779,92.362103575841161,113.2695773016772,28.316130200549871,6.818312054403199,0,25.575130095883889,100.6956683082566,4.8630144517048546,1.6230213209424911,6.6380397920919672,52.202532296946401,7.7755264896865874,46.140964382201282,46.240903310159041,48.115447532339317,35.475157448792693,8.7177105902548941,0,18.325548172564659,18.848439768628101,18.560620627785909,4.9219658371808066,65.184703439483044]
["YEM",2006,"YEM_2006_MICS",126,"Sanitation ladder","Unimproved","s_unimp",26.162454353356338,39.927578146096749,40.682741488663019,16.89386502695589,8.4020011356256195,17.21968204000077,6.1834877300701621,7.2612017655266579,3.0548638919688371,0,20.821814051648921,35.542531617205647,44.501973596486529,47.570485849401088,27.31065555897322,"Abyan","Aden","Al Baidhah","Al Dala'a","Al Hodeidah","Al Jawf","Al Maharah","Al Mahweet","Amran","Dhamar","Hadramout","Hajjah","Ibb","Lahej","Mareb","Raimah","Sa'adah","Sana'a","Sana'a City","Shabwah","Taiz",24.777542634013681,14.10748304881697,33.953903666655201,25.761737133149229,17.88145644661299,24.834591263479489,2.4154589371980668,22.17443160166173,60.054718380647913,26.787504754471431,29.830641544194279,13.097686268550341,34.176050654010083,41.639920590195281,19.17766747664621,57.392460553923478,56.598362740439903,15.86463583419037,1.117610556638319,33.388558615666639,31.517844753043072,1364.9482762459891,2081.934319719629,2120.7147736035831,881.97764143114853,438.27978257016741,275.94736814782999,99.429904353351816,116.61578914585439,48.959608649207539,0,752.89198072313127,1282.4707766286349,1605.837197993209,1718.8762342564071,986.8259336728878,127.8729952916291,120.4784917295499,230.9767510917012,140.99571354018329,477.39084344291308,113.6973895560279,2.0287766511781138,162.09666785305271,467.02900344031627,705.40694045416558,417.50719440885382,208.30491272051151,1113.8510957050869,370.36259502502969,41.342277130291237,262.94613701571558,441.97583105487672,192.22403821737009,26.12221021298296,148.79852163301089,1116.4464073960689]
["YEM",2006,"YEM_2006_MICS",127,"Sanitation ladder","Open defecation","s_od",64.803156774078374,31.180678606935292,9.6883385745153934,0.48354721317900973,1.001573861117111,3.2754353255489268,0.044406678483915697,0,0,0,73.099681674211411,45.636003215985632,22.233564772265819,10.16090781563453,2.1248039278546829,"Abyan","Aden","Al Baidhah","Al Dala'a","Al Hodeidah","Al Jawf","Al Maharah","Al Mahweet","Amran","Dhamar","Hadramout","Hajjah","Ibb","Lahej","Mareb","Raimah","Sa'adah","Sana'a","Sana'a City","Shabwah","Taiz",0.12931844125760081,0,28.806144494808429,1.2816756356177601,26.27082214281431,61.067181173671933,0,62.973621188864428,0,46.479646714564772,3.0439203571351401,65.350088152139946,19.441060626871032,12.513474893370759,34.822606733910227,33.603755691496353,0,32.063824430415011,0.0472644887026119,0.63110206455385287,7.6816273878025729,3380.912048212685,1625.8467935719841,505.034862322979,25.244538767164219,52.245836080297593,52.489224570119667,0.71405523663191406,0,0,0,2643.197369326665,1646.6705612579369,802.28993165630527,367.14661729662078,76.776319610829901,0.66739210882654398,0,195.9583125466406,7.0146966346637463,701.36624374757901,279.5769422306459,0,460.34163764496918,0,1223.968625776492,42.602457826081398,1039.324360783907,633.61465899420625,111.2999969404509,75.068871631318316,153.95711671913651,0,388.50168873237692,1.1047255255108921,2.812551906960461,272.10379920535019]
["YEM",2006,"YEM_2006_MICS",128,"Shared among Improved Sanitation","Yes","s_shared",12.732702715119689,9.867662959340084,4.2482880446215789,3.6279823237959539,1.4805879328745439,2.7455354975033428,4.2154560441833873,3.039559474195777,0,0.27195718643386119,11.31227550747659,11.33747816302184,7.4457932962552027,6.0474023862935251,4.4424068761070146,"Abyan","Aden","Al Baidhah","Al Dala'a","Al Hodeidah","Al Jawf","Al Maharah","Al Mahweet","Amran","Dhamar","Hadramout","Hajjah","Ibb","Lahej","Mareb","Raimah","Sa'adah","Sana'a","Sana'a City","Shabwah","Taiz",7.3065613645911034,0.92952603764065944,0,6.4050507616298171,6.753581333988949,7.5343808087181481,1.98019801980198,6.1141327460547874,16.804645920727051,1.1045289424887581,4.9113192350621091,13.490537585895529,3.1828888656345491,8.6996129145067194,8.791208791208792,0,5.4069979983024314,2.9874276565493298,0.80345536241993798,1.6738753155186621,3.0266135755807402]
["YEM",2006,"YEM_2006_MICS",129,"Shared among Improved Sanitation","No","",87.267297284880328,90.132337040659877,95.751711955378497,96.372017676204166,98.519412067125501,97.254464502496646,95.784543955816616,96.960440525804188,100,99.728042813566148,88.687724492523387,88.662521836978172,92.554206703744782,93.952597613706473,95.557593123893,"Abyan","Aden","Al Baidhah","Al Dala'a","Al Hodeidah","Al Jawf","Al Maharah","Al Mahweet","Amran","Dhamar","Hadramout","Hajjah","Ibb","Lahej","Mareb","Raimah","Sa'adah","Sana'a","Sana'a City","Shabwah","Taiz",92.693438635408882,99.070473962359344,100,93.594949238370191,93.246418666011024,92.465619191281846,98.019801980198011,93.885867253945207,83.195354079272889,98.895471057511244,95.088680764937891,86.509462414104448,96.817111134365447,91.300387085493298,91.208791208791212,100,94.593002001697556,97.012572343450699,99.196544637580061,98.326124684481357,96.973386424419246]
["YEM",2006,"YEM_2006_MICS",130,"Manually calculated ratios","Improved latrines","",15.75368425551498,36.695200307977252,51.14122022365509,60.743174948857977,91.784434300784255,26.120989536329201,67.396309817249829,100,68.589299330128057,100,19.012702265827961,27.296855258288829,42.952846618028723,49.3775276515141,77.615640728376775,"Abyan","Aden","Al Baidhah","Al Dala'a","Al Hodeidah","Al Jawf","Al Maharah","Al Mahweet","Amran","Dhamar","Hadramout","Hajjah","Ibb","Lahej","Mareb","Raimah","Sa'adah","Sana'a","Sana'a City","Shabwah","Taiz",12.752971461654109,50,77.064440225175943,100,25.466623529301419,0,0,67.981051610102412,27.258949687800332,70.512056374296122,100,57.245452833316989,21.931129986420501,95.557193941250077,0,70.270270270270274,58.057218479211691,0,16.666666666666661,50,34.883381649572677]
["YEM",2006,"YEM_2006_MICS",135,"Sanitation type","Sewer connection","s_sew",0,0.33155094627356752,4.1686452947901511,24.177453587535471,36.833379267188967,20.65290023757489,37.809007972728779,41.662442720105439,53.174531418971348,55.815814697721102,0,0,0.090897929192621199,0.27069030930950222,1.3966472616019689,"Abyan","Aden","Al Baidhah","Al Dala'a","Al Hodeidah","Al Jawf","Al Maharah","Al Mahweet","Amran","Dhamar","Hadramout","Hajjah","Ibb","Lahej","Mareb","Raimah","Sa'adah","Sana'a","Sana'a City","Shabwah","Taiz",23.34709652946362,80.512388387454862,12.59605355223569,7.1393206456677847,8.971754791496112,0,0,0,0,3.4061379964959269,11.993331950103061,3.881181825778659,3.067961231585278,1.1078415978447851,0,0,0,0.48385678981220859,54.378252635108133,0,15.242374527976949]
["YEM",2006,"YEM_2006_MICS",136,"Sanitation type","Septic tank connection","s_sep",0,0.63361047505812762,0.77525335566119979,3.2186227070772349,2.0170146356837271,1.4174747380528641,3.3167165269042309,2.8140162930268842,2.5937835262188891,1.2605568563692211,0,0.31360951237327228,0.43989932024843559,0.98824219350420117,2.7888881156857299,"Abyan","Aden","Al Baidhah","Al Dala'a","Al Hodeidah","Al Jawf","Al Maharah","Al Mahweet","Amran","Dhamar","Hadramout","Hajjah","Ibb","Lahej","Mareb","Raimah","Sa'adah","Sana'a","Sana'a City","Shabwah","Taiz",0,0,1.049671129352975,4.0031885844686501,0.63592998161490999,1.062214151864677,94.20289855072464,0,0,0,10.559901967079769,0.66265580244122213,0.89339122164953155,0,0,0,1.229291755797546,1.1914383055061,0,0,0.14657901856758571]
["YEM",2006,"YEM_2006_MICS",137,"Sanitation type","Improved latrines","s_lat",9.0343888725650494,27.926581825636291,44.748330839410158,55.226511465252443,51.746031100384627,57.434507658822589,52.646381091812863,48.262339221340952,41.176821162840902,42.923628445909721,6.0785042741396209,18.507855654435559,32.733664381806719,41.114295947504367,66.379005135884213,"Abyan","Aden","Al Baidhah","Al Dala'a","Al Hodeidah","Al Jawf","Al Maharah","Al Mahweet","Amran","Dhamar","Hadramout","Hajjah","Ibb","Lahej","Mareb","Raimah","Sa'adah","Sana'a","Sana'a City","Shabwah","Taiz",51.746042395265121,5.3801285637281833,23.59422715694777,61.814078001096597,46.240036637461706,13.036013410983919,3.381642512077295,14.85194720947387,39.94528161935208,23.32671053446785,44.57220418148772,17.008387951089741,42.529240085947833,44.738762918589259,45.999725789443552,9.0037837545801036,42.172345503762557,50.396244640076262,44.456872319550918,65.980339319779475,45.411574312609908]
["YEM",2006,"YEM_2006_MICS",138,"Sanitation type","Unimproved facilities","",26.162454353356338,39.927578146096749,40.631608851108759,16.89386502695589,8.4020011356256195,17.21968204000077,6.1834877300701621,7.2612017655266579,3.0548638919688371,0,20.821814051648921,35.542531617205647,44.501973596486529,47.48427755713567,27.31065555897322,"Abyan","Aden","Al Baidhah","Al Dala'a","Al Hodeidah","Al Jawf","Al Maharah","Al Mahweet","Amran","Dhamar","Hadramout","Hajjah","Ibb","Lahej","Mareb","Raimah","Sa'adah","Sana'a","Sana'a City","Shabwah","Taiz",24.777542634013681,14.10748304881697,33.953903666655201,25.761737133149229,17.88145644661299,24.834591263479489,2.4154589371980668,22.17443160166173,60.054718380647913,26.787504754471431,29.830641544194279,13.097686268550341,34.10739922684067,41.639920590195281,19.17766747664621,57.392460553923478,56.598362740439903,15.86463583419037,1.117610556638319,33.388558615666639,31.517844753043072]
["YEM",2006,"YEM_2006_MICS",139,"Sanitation type","Open defecation","",64.803156774078374,31.180678606935292,9.6761616590297024,0.48354721317900973,1.001573861117111,3.2754353255489268,0.044406678483915697,0,0,0,73.099681674211411,45.636003215985632,22.233564772265819,10.142493992546299,2.1248039278546829,"Abyan","Aden","Al Baidhah","Al Dala'a","Al Hodeidah","Al Jawf","Al Maharah","Al Mahweet","Amran","Dhamar","Hadramout","Hajjah","Ibb","Lahej","Mareb","Raimah","Sa'adah","Sana'a","Sana'a City","Shabwah","Taiz",0.12931844125760081,0,28.806144494808429,1.2816756356177601,26.27082214281431,61.067181173671933,0,62.973621188864428,0,46.479646714564772,3.0439203571351401,65.350088152139946,19.402008233976549,12.513474893370759,34.822606733910227,33.603755691496353,0,32.063824430415011,0.0472644887026119,0.63110206455385287,7.6816273878025729]
["YEM",2006,"YEM_2006_MICS",148,"Shared among improved sanitation facilities","Yes","",1.1503218772715611,2.8509398466886999,2.1057295279409209,2.9975328793907061,1.3413597362139651,2.1828347749772039,3.952921892912634,2.8188509279912388,0,0.27195718643386119,0.68761715022441428,2.133879503247714,2.4768030541748312,2.5515203913756181,3.1347639998504708,"Abyan","Aden","Al Baidhah","Al Dala'a","Al Hodeidah","Al Jawf","Al Maharah","Al Mahweet","Amran","Dhamar","Hadramout","Hajjah","Ibb","Lahej","Mareb","Raimah","Sa'adah","Sana'a","Sana'a City","Shabwah","Taiz",5.4867262761329538,0.79839330944616349,0,4.6729064461132106,3.771721288642591,1.062214151864677,1.932367149758454,0.90806776776121212,6.7126631381693844,0.29527204917617578,3.2967445529597161,2.9075110923737539,1.473350238906721,3.9884771273745172,4.0439319375334994,0,2.346725657854897,1.5555995792462509,0.79409611140265446,1.1044286129692431,1.8401970302099191]
["YEM",2006,"YEM_2006_MICS",149,"Shared among improved sanitation facilities","No","",7.884066995293491,26.04080340027927,47.460813649535488,79.625054880474494,89.255065267043392,77.322047859473074,89.81918369853328,89.919947306482044,96.945136108031164,99.728042813566148,5.3908871239152054,16.687585663561119,30.787658577072929,39.640485835275577,67.429776513321499,"Abyan","Aden","Al Baidhah","Al Dala'a","Al Hodeidah","Al Jawf","Al Maharah","Al Mahweet","Amran","Dhamar","Hadramout","Hajjah","Ibb","Lahej","Mareb","Raimah","Sa'adah","Sana'a","Sana'a City","Shabwah","Taiz",69.606412648595779,85.094123641736871,37.239951838536442,68.283680785119799,52.076000121930143,13.036013410983919,95.652173913043484,13.94387944171266,33.232618481182683,26.437576481787609,63.828693545710848,18.644714486935861,44.81636646513504,41.858127389059533,41.955793851910059,9.0037837545801036,41.054911601705207,50.515940156148318,98.041028843256413,64.875910706810231,58.960330828944542]
["YEM",2006,"YEM_2006_MICS",150,"Shared among improved sanitation facilities","DK/missing","",90.965611127434983,71.108256753031924,50.43345682252356,17.377412240134891,9.4035749967427282,20.495117365549699,6.2278944085540768,7.2612017655266579,3.0548638919688371,0,93.921495725860368,81.178534833191122,66.735538368752316,57.807993773348848,29.435459486827909,"Abyan","Aden","Al Baidhah","Al Dala'a","Al Hodeidah","Al Jawf","Al Maharah","Al Mahweet","Amran","Dhamar","Hadramout","Hajjah","Ibb","Lahej","Mareb","Raimah","Sa'adah","Sana'a","Sana'a City","Shabwah","Taiz",24.90686107527128,14.10748304881697,62.760048161463637,27.043412768766981,44.152278589427297,85.901772437151408,2.4154589371980668,85.148052790526137,60.054718380647913,73.267151469036236,32.874561901329422,78.447774420690322,53.710283295958142,54.153395483566037,54.000274210556427,90.996216245419888,56.598362740439903,47.928460264605377,1.1648750453409309,34.01966068022049,39.199472140845607]
["YEM",2006,"YEM_2006_MICS",151,"Shared among all sanitation facilities","Yes","",8.1964785089890864,9.0918562912349419,6.5481971265947472,4.0482683800137611,1.6508649833603131,3.0423130813485102,4.0738954282946658,2.8188509279912388,0,0.27195718643386119,6.8516423861025393,9.1190879261247098,8.3030817090649425,7.9868066161760911,5.1029703082620044,"Abyan","Aden","Al Baidhah","Al Dala'a","Al Hodeidah","Al Jawf","Al Maharah","Al Mahweet","Amran","Dhamar","Hadramout","Hajjah","Ibb","Lahej","Mareb","Raimah","Sa'adah","Sana'a","Sana'a City","Shabwah","Taiz",5.4938308125050144,0.79839330944616349,0,10.575436560041689,7.021564123370533,2.72832582866145,1.932367149758454,2.4524887307859351,18.268967776080611,3.702889856935009,6.3532939289630566,13.144195463580431,4.6631415094805462,6.307082325438544,16.270538579368939,17.18117095150896,5.4691913487013082,2.289795629800941,0.79447161434906388,6.8321597739459072,3.8902223603379218]
["YEM",2006,"YEM_2006_MICS",152,"Shared among all sanitation facilities","No","",79.347912220441458,89.165822083096842,92.648546034630215,95.951731619986333,98.310573229289517,96.572264040758753,95.926104571705338,97.181149072008736,99.875746659085706,99.728042813566148,72.601203570089979,88.482062122455801,90.330130711629593,90.848997855814019,94.897029691737984,"Abyan","Aden","Al Baidhah","Al Dala'a","Al Hodeidah","Al Jawf","Al Maharah","Al Mahweet","Amran","Dhamar","Hadramout","Hajjah","Ibb","Lahej","Mareb","Raimah","Sa'adah","Sana'a","Sana'a City","Shabwah","Taiz",94.506169187494976,98.268880538565952,100,89.424563439958305,89.659609600440703,97.271674171338546,98.067632850241552,97.547511269214056,54.250317317033947,94.766485700252474,93.646706071036917,86.855804536419569,94.941589308352064,93.692917674561471,83.729461420631068,82.818829048491011,94.530808651298699,97.710204370199051,99.205528385650936,93.167840226054096,95.739036607749938]
["YEM",2006,"YEM_2006_MICS",153,"Kind of toilet facility","Flush to piped sewer system","",0,0.33155094627356752,4.1686452947901511,24.177453587535471,36.833379267188967,20.65290023757489,37.809007972728779,41.662442720105439,53.174531418971348,55.815814697721102,0,0,0.090897929192621199,0.27069030930950222,1.3966472616019689,"Abyan","Aden","Al Baidhah","Al Dala'a","Al Hodeidah","Al Jawf","Al Maharah","Al Mahweet","Amran","Dhamar","Hadramout","Hajjah","Ibb","Lahej","Mareb","Raimah","Sa'adah","Sana'a","Sana'a City","Shabwah","Taiz",23.34709652946362,80.512388387454862,12.59605355223569,7.1393206456677847,8.971754791496112,0,0,0,0,3.4061379964959269,11.993331950103061,3.881181825778659,3.067961231585278,1.1078415978447851,0,0,0,0.48385678981220859,54.378252635108133,0,15.242374527976949,0,17.287983039109982,217.57710099469259,1262.2317898788119,1921.366731087219,330.96508123318557,607.96531189702591,669.10392968493193,852.21611844053496,894.66890011112616,0,0,3.2800180333932039,9.798677866705777,50.465567732928577,120.49068822858079,687.57914398328569,85.686628395829672,39.073980276462763,239.52375467081129,0,0,0,0,89.695304019378909,167.85768307004889,61.726111382933667,100.1909279759097,9.8535992201455294,0,0,0,5.8626562266339333,1270.9974310028681,0,539.92569654694364]
["YEM",2006,"YEM_2006_MICS",154,"Kind of toilet facility","Flush to septic tank","",0,0.63361047505812762,0.77525335566119979,3.2186227070772349,2.0170146356837271,1.4174747380528641,3.3167165269042309,2.8140162930268842,2.5937835262188891,1.2605568563692211,0,0.31360951237327228,0.43989932024843559,0.98824219350420117,2.7888881156857299,"Abyan","Aden","Al Baidhah","Al Dala'a","Al Hodeidah","Al Jawf","Al Maharah","Al Mahweet","Amran","Dhamar","Hadramout","Hajjah","Ibb","Lahej","Mareb","Raimah","Sa'adah","Sana'a","Sana'a City","Shabwah","Taiz",0,0,1.049671129352975,4.0031885844686501,0.63592998161490999,1.062214151864677,94.20289855072464,0,0,0,10.559901967079769,0.66265580244122213,0.89339122164953155,0,0,0,1.229291755797546,1.1914383055061,0,0,0.14657901856758571,0,33.03820202995032,40.463355774591619,168.0345651699713,105.21502219512431,22.715194303419612,53.332491537672539,45.193446109511932,41.569978517960692,20.205402757678211,0,11.315880343671999,15.87360367951494,35.773230793284469,100.7719171269231,0,0,7.1405523663191408,21.909719363481241,16.977764154735951,4.8630144517048546,79.122289395946453,0,0,0,147.79551545937409,10.53884298807052,29.17562797765429,0,0,0,9.5995223018938187,14.43607560645474,0,0,5.192221104002436]
["YEM",2006,"YEM_2006_MICS",155,"Kind of toilet facility","Flush to pit (latrine)","",7.6212788807701752,21.432555257789279,37.548536763255157,51.750720381626707,48.197228449557343,54.353958004328447,51.082953916070217,46.466312561104452,39.493371364662529,42.615085880160073,4.9104716634794094,14.062393770274021,25.3103560644829,33.381606606743723,58.934148468295092,"Abyan","Aden","Al Baidhah","Al Dala'a","Al Hodeidah","Al Jawf","Al Maharah","Al Mahweet","Amran","Dhamar","Hadramout","Hajjah","Ibb","Lahej","Mareb","Raimah","Sa'adah","Sana'a","Sana'a City","Shabwah","Taiz",50.217630295075857,5.3801285637281833,16.4467159690351,51.863136830597497,42.25915580389529,13.036013410983919,3.381642512077295,5.180244921512319,38.138538243458079,20.982997283381572,37.914981138421233,11.666163429078519,38.963649129344837,25.08758015366411,41.955793851910052,5.7774704681970048,28.851259409840111,50.396244640076262,44.420812649280762,65.980339319779475,39.955943693395938,397.61756793137681,1117.552689702542,1959.797775491224,2701.7487254528169,2514.14757798456,871.02837467441645,821.40912114398395,746.25466733854103,632.95127856106183,683.07507861388717,177.55680306390241,507.40924293335058,913.31480332388162,1208.375765822426,2129.4892010870649,259.16528112290848,45.946521603185403,111.8813629781954,283.85042305446211,1128.2153717533629,59.681300139851032,2.8402873116493592,37.86795781394094,296.59290708209051,552.5543364675483,530.65494343173748,185.53804886230429,1272.442468766018,223.13926532312581,90.446247373894522,26.469740566488511,225.29908529549809,610.62666404408719,1038.2595251662101,294.0461449875495,1415.3464534184091]
["YEM",2006,"YEM_2006_MICS",156,"Kind of toilet facility","Flush to somewhere else","",12.724802099098619,26.164269577536349,30.541716335504429,14.176834919289901,7.5898839199062564,10.192244263918131,4.990265392970076,7.2612017655266579,2.2839223862271281,0,9.4101209859680335,21.18781048307584,31.11606124427815,35.569526387432823,23.422503021632611,"Abyan","Aden","Al Baidhah","Al Dala'a","Al Hodeidah","Al Jawf","Al Maharah","Al Mahweet","Amran","Dhamar","Hadramout","Hajjah","Ibb","Lahej","Mareb","Raimah","Sa'adah","Sana'a","Sana'a City","Shabwah","Taiz",14.32120196670148,13.40793843482605,31.82669467619737,24.480061497531469,3.1660261187968861,24.110770270468041,0,18.00981524588261,25.510159986392701,25.807370465719639,29.830641544194279,6.638612522233041,21.972251720455539,38.179215335045349,8.5794828184996224,56.027481855838317,38.254606393466069,13.755844700641269,0.93731220528748016,33.388558615666639,14.77376217295801,663.87871933383019,1364.2773569824999,1594.085759224045,740.12971011211482,395.91671322734601,163.33187648962519,80.243000775749294,116.61578914585439,36.603904517257327,0,340.25875989458848,764.51357089422027,1122.8115196455401,1287.5759454810679,846.33389203593447,73.909467888254341,114.5043516437871,216.50607854892871,133.98101690551951,84.525099156619618,110.3836020836214,0,131.6530268937268,198.38548772359559,679.59664060728574,417.50719440885382,105.580143979285,717.55153452679053,339.58165786791398,18.49522924249872,256.69242577374843,298.72969170446981,166.6728467696478,21.908048663536309,148.79852163301089,523.32619285874216]
["YEM",2006,"YEM_2006_MICS",157,"Kind of toilet facility","Flush to unknown place/not sure/DK where","",0.1908505429238746,0.97915269951161299,0.61194910124785329,0.69878366315183871,0,0.72770600953021158,0,0.67983858072913206,0,0,0.27537023986953468,0.71213001061013492,0.83590383059402518,0.7496583485375039,0.38472807947473592,"Abyan","Aden","Al Baidhah","Al Dala'a","Al Hodeidah","Al Jawf","Al Maharah","Al Mahweet","Amran","Dhamar","Hadramout","Hajjah","Ibb","Lahej","Mareb","Raimah","Sa'adah","Sana'a","Sana'a City","Shabwah","Taiz",0,0,0,2.130719716068858,0.2281341712152315,0,0,3.178237187164243,0,0,0,0.41896641624199138,0.33242600185878352,1.3556805581969189,4.0439319375334994,0,0,0,0,0,1.4158652593897689,9.9570596881379512,51.055728997643477,31.939899413417979,36.481383396510438,0,11.661571778662911,0,10.918290820662129,0,0,9.9570596881379512,25.695578964488529,30.163279437541121,27.13677000903181,13.9015207971854,0,0,0,11.661571778662911,6.0906204558755794,0,0,23.233139272321889,0,0,0,6.6632198220894576,10.85609207400025,12.05798095774988,8.7177105902548941,0,0,0,0,0,50.153736544754992]
["YEM",2006,"YEM_2006_MICS",158,"Kind of toilet facility","Ventilated Improved Pit latrine (VIP)","",0.3070962273355704,3.0150712758878542,4.4975900176877959,1.832587113931893,3.0463386078276491,1.6197093917176659,0.18453888470419999,0.73343173804906792,0.88113013689713626,0.30854256574964772,0.26585775598706918,1.3529856045044071,4.2243231153727194,4.7283350869101399,6.1098260645701519,"Abyan","Aden","Al Baidhah","Al Dala'a","Al Hodeidah","Al Jawf","Al Maharah","Al Mahweet","Amran","Dhamar","Hadramout","Hajjah","Ibb","Lahej","Mareb","Raimah","Sa'adah","Sana'a","Sana'a City","Shabwah","Taiz",1.528412100189263,0,4.1052422144919829,6.0450332157274271,2.2765643588654538,0,0,6.4934651007973114,0,0.1234863712957316,6.2329158541209591,2.4517585765115011,3.1908640363530889,17.485477397245688,0,1.861334588297942,0.15366146947469331,0,0.0360596702701678,0,2.4176742506698341,16.021832679836411,157.21415265166581,234.74594941770891,95.673835317364791,158.90840778544981,25.956027687999779,2.9673680059852932,11.77900348717333,14.121672256796749,4.9456133433088221,9.613099607901848,48.819383989410603,152.43313153966821,171.16029192423079,220.7685860095504,7.887894137769508,0,27.926553554991209,33.08487184774738,60.778660993059759,0,0,47.467690471960168,0,3.2518199870396209,87.235375323229349,38.992639296781682,104.20458562378229,155.52303396131541,0,8.5277880572280598,1.1999402877367269,0,0.84283230988933011,0,85.640491999495268]
["YEM",2006,"YEM_2006_MICS",159,"Kind of toilet facility","Pit latrine with slab","",0.91516322153543128,2.4998025924475362,2.090254957219333,0.94442030654203257,0.50246404299963154,0.73313425324624526,1.3788882910384439,0.38275634145830317,0.80231966128125176,0,0.62680461480360783,2.3803462690470059,2.3630813713570542,2.2546959053129969,0.95030252354426881,"Abyan","Aden","Al Baidhah","Al Dala'a","Al Hodeidah","Al Jawf","Al Maharah","Al Mahweet","Amran","Dhamar","Hadramout","Hajjah","Ibb","Lahej","Mareb","Raimah","Sa'adah","Sana'a","Sana'a City","Shabwah","Taiz",0,0,3.0422689734206849,1.7751882387028071,1.476182303485756,0,0,0,1.8067433758939959,2.2202268797905531,0.42430718894554781,2.4714995292577209,0.042300918391105502,0.81002480948253808,0,1.364978698085157,13.16742462444777,0,0,0,1.6220911091544039,47.745920350101287,130.34661883817259,109.0981798091463,49.305330257732933,26.21040249345408,11.74856000316235,22.17239475145746,6.1471136942718889,12.85859469260294,0,22.66450784716886,85.889338474471714,85.270914104123221,81.617398568494153,34.337629612854727,0,0,20.695511488945009,9.7157241800272356,39.41043152947708,0,0,0,14.05054558690717,58.466194023753722,5.9385683597086691,39.306598369743668,1.3814282345569731,7.2046941065792538,0,6.2537112419672436,102.82423659376541,0,0,0,57.458808033175814]
["YEM",2006,"YEM_2006_MICS",160,"Kind of toilet facility","Pit latrine without slab/open pit","",6.5363031136807939,9.5139959076840608,6.2938284503584594,1.7947118266875779,0.31765104348606737,6.6546391752851646,0.7563247216268032,0,0.77094150574170883,0,3.8024217803722151,9.9434519106090988,8.7489585378452333,7.1590926100488197,2.0361418566816258,"Abyan","Aden","Al Baidhah","Al Dala'a","Al Hodeidah","Al Jawf","Al Maharah","Al Mahweet","Amran","Dhamar","Hadramout","Hajjah","Ibb","Lahej","Mareb","Raimah","Sa'adah","Sana'a","Sana'a City","Shabwah","Taiz",10.456340667312199,0,2.127208990457834,0,10.983194511920949,0.72382099301145031,2.4154589371980668,3.0584099393827708,4.8213306936751588,0.98013428875179942,0,3.6770024600863662,11.50918966513235,0.85062531348397208,6.5607809788526534,1.364978698085157,9.6236681379604967,1.189530706513289,0.1802983513508388,0,7.5410079734679059,341.01218286102181,496.08605173604531,328.49831337253352,93.696481025794085,16.569865681396859,106.64135157244201,12.16163078414893,0,12.35570413195021,0,137.49103986175021,358.78666808289978,315.70292120440632,259.15091856345128,73.572660475742722,53.963527403374719,0,14.47067254277245,0,293.22424084402098,3.3137874724064811,2.0287766511781138,22.357193591625251,37.494160822655843,25.810299846879811,0,58.478853502586688,375.85755026132472,7.5658117025824483,14.1434105972049,6.2537112419672436,75.151091252898112,14.41296216183931,4.2141615494466507,0,267.12268323202778]
["YEM",2006,"YEM_2006_MICS",161,"Kind of toilet facility","Bucket","",0.54319378577409849,0.29973535815007502,0.63977264328993144,0.21334751966009249,0.21484852234104571,0,0,0,0,0,0.31448879936466029,0.47025242349368002,0.89617237941236483,0.46087365393037888,0.61841818892864564,"Abyan","Aden","Al Baidhah","Al Dala'a","Al Hodeidah","Al Jawf","Al Maharah","Al Mahweet","Amran","Dhamar","Hadramout","Hajjah","Ibb","Lahej","Mareb","Raimah","Sa'adah","Sana'a","Sana'a City","Shabwah","Taiz",0,0,0,0,0,0,0,1.1062064163963501,0,0,0,2.7820712862309258,0.29675006154127059,2.6100799416659561,0,0,0,0.91926042703580968,0,0,0.093992383381788405,28.339520885385571,15.629030307892579,33.392113547464149,11.138229285882961,11.20730194356773,0,0,0,0,0,11.371540178082981,16.96798070730258,32.33804764982554,16.683096205531189,22.345531229450689,0,0,0,0,0,0,0,8.0864473677006181,0,0,0,44.245915238639761,9.6910168670434089,23.215125454533151,0,0,0,11.138229285882961,0,0,3.3294617563930951]
["YEM",2006,"YEM_2006_MICS",162,"Kind of toilet facility","No facilities or bush or field","",64.803156774078374,31.180678606935292,9.6761616590297024,0.48354721317900973,1.001573861117111,3.2754353255489268,0.044406678483915697,0,0,0,73.099681674211411,45.636003215985632,22.233564772265819,10.142493992546299,2.1248039278546829,"Abyan","Aden","Al Baidhah","Al Dala'a","Al Hodeidah","Al Jawf","Al Maharah","Al Mahweet","Amran","Dhamar","Hadramout","Hajjah","Ibb","Lahej","Mareb","Raimah","Sa'adah","Sana'a","Sana'a City","Shabwah","Taiz",0.12931844125760081,0,28.806144494808429,1.2816756356177601,26.27082214281431,61.067181173671933,0,62.973621188864428,0,46.479646714564772,3.0439203571351401,65.350088152139946,19.402008233976549,12.513474893370759,34.822606733910227,33.603755691496353,0,32.063824430415011,0.0472644887026119,0.63110206455385287,7.6816273878025729,3380.912048212685,1625.8467935719841,505.034862322979,25.244538767164219,52.245836080297593,52.489224570119667,0.71405523663191406,0,0,0,2643.197369326665,1646.6705612579369,802.28993165630527,367.14661729662078,76.776319610829901,0.66739210882654398,0,195.9583125466406,7.0146966346637463,701.36624374757901,279.5769422306459,0,460.34163764496918,0,1223.968625776492,42.602457826081398,1039.324360783907,633.61465899420625,111.2999969404509,75.068871631318316,153.95711671913651,0,388.50168873237692,1.1047255255108921,2.812551906960461,272.10379920535019]
["YEM",2006,"YEM_2006_MICS",163,"Kind of toilet facility","Other","",6.3581553548028342,3.859392623013286,3.1562914219559159,0.7089707613183166,0.27961764989225119,0.37279860079748123,0.43689761547328282,0,0,0,7.2947824859440136,3.9410168000270369,3.6104633824383359,4.2947849057236613,1.233592491730346,"Abyan","Aden","Al Baidhah","Al Dala'a","Al Hodeidah","Al Jawf","Al Maharah","Al Mahweet","Amran","Dhamar","Hadramout","Hajjah","Ibb","Lahej","Mareb","Raimah","Sa'adah","Sana'a","Sana'a City","Shabwah","Taiz",0,0.69954461399092449,0,1.2816756356177601,3.5560967747976489,0,0,0,29.723227700580029,0,0,0,0.32920777971152071,0,4.0374036792939396,0,8.7200882090133458,0,0,0,9.1090822232353439,331.71785316575142,201.23940214264181,164.7385874595393,37.01322100735684,14.58590171785686,5.9741400857628051,7.0252727934535866,0,0,0,263.77064078870978,142.20255694421289,130.28223094289029,155.4662740063566,44.573849931760122,0,5.9741400857628051,0,7.0146966346637463,94.939024891724216,0,0,0,231.14935489406469,0,0,0,10.75099404992898,0,8.7036372905876309,0,68.09504809750878,0,0,0,322.66806954890512]
["YEM",2006,"YEM_2006_MICS",164,"Kind of toilet facility","Missing","",0,0.0901846797129746,0,0,0,0,0,0,0,0,0,0,0.1303180525124647,0,0,"Abyan","Aden","Al Baidhah","Al Dala'a","Al Hodeidah","Al Jawf","Al Maharah","Al Mahweet","Amran","Dhamar","Hadramout","Hajjah","Ibb","Lahej","Mareb","Raimah","Sa'adah","Sana'a","Sana'a City","Shabwah","Taiz",0,0,0,0,0.1761390410975025,0,0,0,0,0,0,0,0,0,0,0,0,0,0,0,0,0,4.7024785505483813,0,0,0,0,0,0,0,0,0,0,4.7024785505483813,0,0,0,0,0,0,4.7024785505483813,0,0,0,0,0,0,0,0,0,0,0,0,0,0,0,0]
["YEM",2013,"YEM_2013_DHS",16,"Water","Improved","w_imp",54.973607143548818,71.32375216363711,85.189202231080188,95.998713382289139,98.889536652449166,97.870597203634574,99.34513453271552,99.756051063704632,99.768894880059477,99.590292615840696,53.711727955177018,62.893019579638931,76.171219345678523,82.284846193604992,93.109727581319916,"Abyan","Aden","Al-Baidha","Al-Hodiedah","Al-Jawf","Al-Mhrah","Al-Mhweit","Aldhalae","Amran","Dhamar","Hadramout","Hajjah","Ibb","lahj","Mareb","Reimah","Sadah","Sanaa","Sanaa City","Shabwah","Taiz",86.279830993183978,99.577722839354323,81.147375676441015,95.166213569266006,85.506612984397108,87.020667161028811,73.69950630114063,84.561663130305092,72.473602249466396,72.217365243124021,90.958152577032848,55.660961915833063,71.850195238751468,81.481907879359511,77.44262909565704,83.649440033773544,78.224518667071607,71.448232782702789,99.872755472470487,90.532868058053538,80.406744477156209]
["YEM",2013,"YEM_2013_DHS",17,"Water","Not Improved","",45.026392856451182,28.67624783636289,14.81079776891981,4.0012866177108606,1.1104633475508341,2.1294027963654258,0.65486546728448047,0.24394893629536801,0.23110511994052271,0.40970738415930441,46.288272044822982,37.106980420361069,23.828780654321481,17.715153806395008,6.8902724186800839,"Abyan","Aden","Al-Baidha","Al-Hodiedah","Al-Jawf","Al-Mhrah","Al-Mhweit","Aldhalae","Amran","Dhamar","Hadramout","Hajjah","Ibb","lahj","Mareb","Reimah","Sadah","Sanaa","Sanaa City","Shabwah","Taiz",13.72016900681602,0.42227716064567739,18.852624323558981,4.8337864307339942,14.49338701560289,12.979332838971191,26.30049369885937,15.438336869694909,27.526397750533601,27.782634756875979,9.0418474229671517,44.339038084166937,28.149804761248529,18.518092120640489,22.55737090434296,16.350559966226459,21.77548133292839,28.551767217297211,0.12724452752951271,9.4671319419464623,19.593255522843791]
["YEM",2013,"YEM_2013_DHS",18,"Water ladder","Basic","w_bas",31.948036984125508,56.9639476758949,77.160882256677155,94.012086077545888,95.991484948763997,94.097535286489801,97.706584086684245,97.293618183887745,97.845675303195875,98.226796011670487,26.5993464786477,45.855083022224647,62.932006188698161,74.265279223259398,89.43172427821149,"Abyan","Aden","Al-Baidha","Al-Hodiedah","Al-Jawf","Al-Mhrah","Al-Mhweit","Aldhalae","Amran","Dhamar","Hadramout","Hajjah","Ibb","lahj","Mareb","Reimah","Sadah","Sanaa","Sanaa City","Shabwah","Taiz",80.275960426543875,99.577722839354323,72.94552070837193,95.166213569266006,71.896792157655369,38.439769453450857,73.69950630114063,42.229924373192553,70.738338528144681,55.283388803217903,90.058495759126359,46.799860385542317,65.895755600720037,76.556592081665656,65.669606462961539,50.864160017300343,77.140496668977306,59.387729059320982,99.068758880735672,83.676610465083229,69.74211819300875]
["YEM",2013,"YEM_2013_DHS",19,"Water ladder","Limited","w_lim",23.0255701594233,14.359804487742201,8.0283199744030274,1.986627304743285,2.8980517036851938,3.7730619171447679,1.6385504460312781,2.4624328798168991,1.9232195768635729,1.363496604170225,27.11238147652929,17.03793655741427,13.23921315698041,8.0195669703455703,3.678003303108401,"Abyan","Aden","Al-Baidha","Al-Hodiedah","Al-Jawf","Al-Mhrah","Al-Mhweit","Aldhalae","Amran","Dhamar","Hadramout","Hajjah","Ibb","lahj","Mareb","Reimah","Sadah","Sanaa","Sanaa City","Shabwah","Taiz",6.0038705666401064,0,8.2018549680690782,0,13.609820826741689,48.580897707577968,0,42.331738757112518,1.735263721321711,16.93397643990615,0.89965681790648599,8.8611015302907319,5.9544396380314017,4.9253157976938766,11.77302263269552,32.785280016473173,1.084021998094308,12.060503723381821,0.80399659173483495,6.8562575929702971,10.664626284147481]
["YEM",2013,"YEM_2013_DHS",20,"Water ladder","Unimproved","w_unimp",40.722839258582788,25.355005328130542,12.990660163934139,3.5418392030867021,0.95539104157593346,2.1294027963654298,0.65486546728447736,0.24394893629535691,0.23110511994055141,0.40970738415928798,42.147224141426747,32.673689150067723,20.982036604544561,15.540016477003681,5.9381194569246789,"Abyan","Aden","Al-Baidha","Al-Hodiedah","Al-Jawf","Al-Mhrah","Al-Mhweit","Aldhalae","Amran","Dhamar","Hadramout","Hajjah","Ibb","lahj","Mareb","Reimah","Sadah","Sanaa","Sanaa City","Shabwah","Taiz",13.103156924535091,0.42227716064567739,17.464497988554449,4.623531907764562,10.450470785309941,6.5118382197020219,23.372809100322979,15.123307683114,20.820913613880801,22.492126733622541,1.184317386909028,43.661443224509711,26.414148484788729,17.96053471504219,21.771648487437641,7.7961922019765986,20.90301208533031,26.470405577768631,0.1272445275294932,5.1117472830369746,19.442926564213479]
["YEM",2013,"YEM_2013_DHS",21,"Water ladder","Surface water","w_sur",4.3035535978684054,3.3212425082323569,1.820137604985679,0.45944741462412497,0.15507230597487531,0,0,0,0,0,4.1410479033962568,4.4332912702933616,2.8467440497768659,2.175137329391351,0.95215296175543007,"Abyan","Aden","Al-Baidha","Al-Hodiedah","Al-Jawf","Al-Mhrah","Al-Mhweit","Aldhalae","Amran","Dhamar","Hadramout","Hajjah","Ibb","lahj","Mareb","Reimah","Sadah","Sanaa","Sanaa City","Shabwah","Taiz",0.61701208228093296,0,1.3881263350045461,0.21025452296943201,4.0429162302929988,6.4674946192691527,2.9276845985363882,0.31502918658093282,6.705484136652812,5.2905080232534054,7.8575300360581277,0.67759485965723432,1.7356562764598269,0.5575574055982776,0.78572241690530209,8.5543677642498999,0.87246924759807365,2.081361639528577,0,4.3553846589094984,0.1503289586302877]
["YEM",2013,"YEM_2013_DHS",35,"Water source on premises","Yes","",79.940697876162417,82.622729944713953,87.182141692180025,90.556273631078355,96.272228570250036,85.111254022933295,95.070824409310433,97.768028954477302,97.859031376941346,97.794671994767327,80.252166666057676,81.96294422177867,84.110015493967737,86.998724309387725,86.735055843323678,"Abyan","Aden","Al-Baidha","Al-Hodiedah","Al-Jawf","Al-Mhrah","Al-Mhweit","Aldhalae","Amran","Dhamar","Hadramout","Hajjah","Ibb","lahj","Mareb","Reimah","Sadah","Sanaa","Sanaa City","Shabwah","Taiz",68.011225972334771,99.932650728623557,83.77223184529808,88.025792227839318,50.38415860960167,99.501700027939265,62.979409556735853,86.54918470448473,81.941791610308755,95.253927705210344,98.50602421065112,80.505414123117049,83.597703273155005,97.37552493091431,80.155013849643353,92.326404617111621,96.030549367835548,86.098987671318994,99.168848496466794,78.475646837249002,82.672422532213872]
["YEM",2013,"YEM_2013_DHS",36,"Water source on premises","No","",20.059302123837728,17.377270055286239,12.817858307820019,9.4437263689215669,3.7277714297499389,14.888745977066639,4.9291755906895176,2.2319710455226751,2.1409686230586358,2.2053280052326421,19.747833333942062,18.037055778221379,15.88998450603224,13.001275690612291,13.264944156676339,"Abyan","Aden","Al-Baidha","Al-Hodiedah","Al-Jawf","Al-Mhrah","Al-Mhweit","Aldhalae","Amran","Dhamar","Hadramout","Hajjah","Ibb","lahj","Mareb","Reimah","Sadah","Sanaa","Sanaa City","Shabwah","Taiz",31.988774027665219,0.067349271376444697,16.227768154702051,11.974207772160719,49.615841390398423,0.49829997206074361,37.020590443264418,13.45081529551539,18.058208389691199,4.7460722947897054,1.4939757893488459,19.49458587688294,16.402296726844959,2.6244750690856669,19.844986150356561,7.673595382888494,3.9694506321644072,13.901012328680959,0.83115150353321476,21.524353162751051,17.327577467785989]
["YEM",2013,"YEM_2013_DHS",41,"Water point at more than 30 minutes","Yes","",15.502950977546909,11.758048348810821,8.7456667018941427,5.2139890738110042,2.1522623521737532,10.121323565331791,2.568506254545055,0.65649840641865076,0.92171984718214306,1.351929592515287,15.682761043747201,12.46904233188784,11.004677992058269,8.4660637920428776,8.1241179628365909,"Abyan","Aden","Al-Baidha","Al-Hodiedah","Al-Jawf","Al-Mhrah","Al-Mhweit","Aldhalae","Amran","Dhamar","Hadramout","Hajjah","Ibb","lahj","Mareb","Reimah","Sadah","Sanaa","Sanaa City","Shabwah","Taiz",16.19022066988423,0,14.264258245693719,7.8268742088358669,33.366051349979863,0,19.770438989932622,9.9542109575803295,11.629667267687051,3.444373765421497,0.90161062331379194,18.164856280234581,10.162631021823669,0.35748780792279911,13.777996564741001,6.7290505223859016,2.7016266115629781,8.0320594193241561,0.28660966541060862,15.384184250198141,12.640002203152919]
["YEM",2013,"YEM_2013_DHS",42,"Water point at more than 30 minutes","No","w_30min",84.497049022453126,88.241951651189268,91.254333298105834,94.786010926188851,97.847737647826264,89.878676434668137,97.431493745454901,99.343501593581351,99.078280152817854,98.648070407484681,84.317238956252567,87.53095766811218,88.995322007941695,91.533936207957041,91.875882037163464,"Abyan","Aden","Al-Baidha","Al-Hodiedah","Al-Jawf","Al-Mhrah","Al-Mhweit","Aldhalae","Amran","Dhamar","Hadramout","Hajjah","Ibb","lahj","Mareb","Reimah","Sadah","Sanaa","Sanaa City","Shabwah","Taiz",83.809779330115802,100,85.735741754306432,92.173125791164111,66.633948650020272,100,80.229561010067528,90.045789042419784,88.370332732312917,96.555626234578511,99.098389376686185,81.835143719765398,89.837368978176244,99.642512192077206,86.222003435258941,93.270949477614224,97.298373388437014,91.967940580675872,99.713390334589391,84.615815749801897,87.35999779684694]
["YEM",2013,"YEM_2013_DHS",58,"Source of drinking water","Government network","",4.4636621532084062,11.32146044373339,15.48311258750247,34.407128207535969,33.788012541830071,41.742571302135929,42.514201926782476,47.55345771218412,39.244575752873097,29.86505818686113,2.313952318921936,9.9775291806595838,11.29925049464565,11.32410881881199,19.2890185684094,"Abyan","Aden","Al-Baidha","Al-Hodiedah","Al-Jawf","Al-Mhrah","Al-Mhweit","Aldhalae","Amran","Dhamar","Hadramout","Hajjah","Ibb","lahj","Mareb","Reimah","Sadah","Sanaa","Sanaa City","Shabwah","Taiz",32.68333991975004,86.123898441087803,9.4794505660787802,29.095421728372749,1.2723054407167931,12.900477135719649,19.520370714193511,6.9933175743955136,8.6016507802720987,22.198302937286901,49.129572981581802,15.871663289290829,22.13180890296962,17.549086903592329,6.2622742432289753,2.315485248159237,10.483238459831609,7.0493194357104896,17.571805599432459,12.43960174111961,3.8218255316968071]
["YEM",2013,"YEM_2013_DHS",59,"Source of drinking water","Local network","",6.666915921770812,13.920597475730579,17.49197093301672,7.5501530579085347,5.382454248177746,5.4403364362731033,1.9315706934689081,0.50017896998527278,0.1506976189929653,1.121586799032761,5.6303741366737396,11.111514863472809,15.21323810378072,18.93562876814655,18.797481108363101,"Abyan","Aden","Al-Baidha","Al-Hodiedah","Al-Jawf","Al-Mhrah","Al-Mhweit","Aldhalae","Amran","Dhamar","Hadramout","Hajjah","Ibb","lahj","Mareb","Reimah","Sadah","Sanaa","Sanaa City","Shabwah","Taiz",1.2146725974363519,0.67428969693405305,7.0580573993164242,27.04944316150776,1.508645053878648,0.038558027009542001,0.67224278902536705,8.9030343913538985,2.4352429125738069,6.3715769037466341,15.637774710269399,1.1802974960930139,11.33602647651017,9.7813608380307837,12.805566138101909,3.3388788554697739,8.6763303588239644,5.1033034678100773,0.80209972304958432,20.798157476750731,15.661902703529011]
["YEM",2013,"YEM_2013_DHS",60,"Source of drinking water","Tube well or borehole","",20.801302717410621,19.075627584075221,19.007047785241681,8.1392630321094721,5.7577028131751602,5.054768236036395,2.0604750893142572,2.0160492195735502,1.638462381351818,0.83701393193685203,20.717023312656689,19.257252540671129,20.064913926096299,20.992376565806229,19.040895026899861,"Abyan","Aden","Al-Baidha","Al-Hodiedah","Al-Jawf","Al-Mhrah","Al-Mhweit","Aldhalae","Amran","Dhamar","Hadramout","Hajjah","Ibb","lahj","Mareb","Reimah","Sadah","Sanaa","Sanaa City","Shabwah","Taiz",17.00776199273291,0,8.8151265863161541,22.419783270321641,28.02147038948689,1.3308522100524811,5.482604342524164,23.259187762102091,18.407819193933889,27.943868250920229,0.60360734181770015,5.3858465064554766,12.43323746304792,7.2380793919736632,14.80237675997652,6.140224348255761,27.574686670406081,42.46741990188481,2.999229739779278,14.96250954827082,11.967782355630581]
["YEM",2013,"YEM_2013_DHS",61,"Source of drinking water","Well","",32.939897852986427,16.964354957513169,9.0243454961517173,2.7834497611757238,1.0672705311081681,1.514687901714598,0.72597006653447893,0.12630520093922221,0.0447812511179791,0.050895110451681901,37.476854027321437,21.41184559370086,14.85884759050963,10.283903230647111,5.6542577411929296,"Abyan","Aden","Al-Baidha","Al-Hodiedah","Al-Jawf","Al-Mhrah","Al-Mhweit","Aldhalae","Amran","Dhamar","Hadramout","Hajjah","Ibb","lahj","Mareb","Reimah","Sadah","Sanaa","Sanaa City","Shabwah","Taiz",9.3580395258609705,0,14.51243619993164,3.0513689840481,17.123299812203459,4.7210580211503217,10.284991336091069,25.654148043639239,11.38134985147509,11.81807495293581,2.400193027525364,39.514743724972689,7.9703910495470849,23.99874699051384,35.07264262299023,8.1041667235941421,21.11824036833649,15.988463534678051,0.049456347860879199,9.4021758336802446,21.49899783392781]
["YEM",2013,"YEM_2013_DHS",62,"Source of drinking water","Spring","",20.859961531873591,17.066300534274049,8.4037708574883645,1.5656250267740519,0.52429566178248621,0.50771139216702965,0.34322553352056628,0.020954841490169001,0.36492111473966288,0,20.653138487158309,20.300349342204509,15.8750483815931,9.3435093750199307,3.300626047008778,"Abyan","Aden","Al-Baidha","Al-Hodiedah","Al-Jawf","Al-Mhrah","Al-Mhweit","Aldhalae","Amran","Dhamar","Hadramout","Hajjah","Ibb","lahj","Mareb","Reimah","Sadah","Sanaa","Sanaa City","Shabwah","Taiz",2.5859840844356459,0,4.6794400157032836,0,0,4.1554359051413607,33.295132287568158,1.6797580754750281,21.572058447503721,16.16016092512422,2.103123920445459,11.125205919899891,20.585885730358029,4.4632890092023887,3.177044386551362,58.658614458628719,7.3257902942464757,17.860101185909169,0,0.1820606886071448,6.0939003605191928]
["YEM",2013,"YEM_2013_DHS",63,"Source of drinking water","Surface water protected","",2.7519955968601031,2.8079170142176211,3.5062302884431928,1.2693485537759079,0.51633125308677441,0.57588992379128778,0,0.15027394124241111,0,0,2.7342257237000922,2.792290058454963,3.2882570692790658,3.619748623558205,2.9341767553929579,"Abyan","Aden","Al-Baidha","Al-Hodiedah","Al-Jawf","Al-Mhrah","Al-Mhweit","Aldhalae","Amran","Dhamar","Hadramout","Hajjah","Ibb","lahj","Mareb","Reimah","Sadah","Sanaa","Sanaa City","Shabwah","Taiz",0.2990645665449419,0,1.5667590194433969,1.236863210036675,0,0,11.435313791616,1.3462433462683641,1.1370720741085361,3.7838891993404249,0.17511283045313791,0.85313456882583416,3.197215042810964,6.7241442069861446,0.2191957613416331,11.93330099467391,7.2764796785760062,0.25664718273275011,0,0.6284643955590945,1.28905316594106]
["YEM",2013,"YEM_2013_DHS",64,"Source of drinking water","Surface water unprotected","",4.3035535978684054,3.3212425082323569,1.820137604985679,0.45944741462412497,0.15507230597487531,0,0,0,0,0,4.1410479033962568,4.4332912702933616,2.8467440497768659,2.175137329391351,0.95215296175543007,"Abyan","Aden","Al-Baidha","Al-Hodiedah","Al-Jawf","Al-Mhrah","Al-Mhweit","Aldhalae","Amran","Dhamar","Hadramout","Hajjah","Ibb","lahj","Mareb","Reimah","Sadah","Sanaa","Sanaa City","Shabwah","Taiz",0.61701208228093296,0,1.3881263350045461,0.21025452296943201,4.0429162302929988,6.4674946192691527,2.9276845985363882,0.31502918658093282,6.705484136652812,5.2905080232534054,7.8575300360581277,0.67759485965723432,1.7356562764598269,0.5575574055982776,0.78572241690530209,8.5543677642498999,0.87246924759807365,2.081361639528577,0,4.3553846589094984,0.1503289586302877]
["YEM",2013,"YEM_2013_DHS",65,"Source of drinking water","Rainwater","",2.046347129103427,3.986897938916464,7.4221533277137777,2.1301905297231611,0.42849920105777611,0.1143967987466263,0.3879369949882136,0.70571081732765895,0.30139260037314108,0.024926473783330901,2.157346909640915,2.7459949354001991,4.9074692367560058,8.4395024318451703,4.2250702432592409,"Abyan","Aden","Al-Baidha","Al-Hodiedah","Al-Jawf","Al-Mhrah","Al-Mhweit","Aldhalae","Amran","Dhamar","Hadramout","Hajjah","Ibb","lahj","Mareb","Reimah","Sadah","Sanaa","Sanaa City","Shabwah","Taiz",1.4284776358974149,0.0829159451774579,0,0.18009315595189171,0.1847874900263532,2.4953354297844399,3.8035615432464911,0.26194455850955811,0.14754975741237619,0.2343994159200814,0.36424042719108563,1.8540720142134171,8.304240000349596,11.360274577805891,1.076537534833764,0.61254758978297996,7.0736104631165597,0.82365785397484526,0.24990048048459501,0.77267767866886039,10.12092038956864]
["YEM",2013,"YEM_2013_DHS",66,"Source of drinking water","Tanker truck","",3.682829921991269,9.0174528268260161,15.125826535911971,25.66203745678553,17.179116713419429,32.574270774915163,29.607130455175351,19.081944591234532,17.522177774718589,12.683689436360099,2.6417702663556271,6.0629540967783901,9.0004196434013277,12.85239673198905,21.889854946529439,"Abyan","Aden","Al-Baidha","Al-Hodiedah","Al-Jawf","Al-Mhrah","Al-Mhweit","Aldhalae","Amran","Dhamar","Hadramout","Hajjah","Ibb","lahj","Mareb","Reimah","Sadah","Sanaa","Sanaa City","Shabwah","Taiz",31.265896849861079,0.15510813164687831,47.08554878908933,7.9532049111675498,47.578636996936922,13.793310310293069,10.158315791284229,30.230681758778019,29.008599893910471,5.2042798364622014,16.01515669675749,23.11294290352863,6.4363451815267894,14.650379414303041,21.20459710335443,0.11973218780962799,8.5561722110617016,7.8285721622758766,22.118884252540379,32.226922971219793,5.4454984092276284]
["YEM",2013,"YEM_2013_DHS",67,"Source of drinking water","Bottled water","",0.21393792778303269,0.24439924429146809,1.14923471383761,15.074462795121709,34.949910689599832,10.599820133937961,21.87852100541004,29.611653190472762,40.684346943262042,55.007122677414841,0.15288458191661819,0.33068713252665588,0.15704743851412051,0.64313180791859126,3.0071187512120541,"Abyan","Aden","Al-Baidha","Al-Hodiedah","Al-Jawf","Al-Mhrah","Al-Mhweit","Aldhalae","Amran","Dhamar","Hadramout","Hajjah","Ibb","lahj","Mareb","Reimah","Sadah","Sanaa","Sanaa City","Shabwah","Taiz",2.0872865448734079,12.541510624508129,4.2943836731342042,7.2314041319077544,0,53.830384579517073,0.78294547939024384,1.2723886116170331,0.10508512189020421,0.22896667321590169,5.5809326012141351,0.41175570572937298,0.73668265463168814,2.7403057596126912,4.2617210600825306,0.0389129610381291,0,0.11465003374735031,56.081379329323319,3.912415985320925,22.56995647743512]
["YEM",2013,"YEM_2013_DHS",68,"Source of drinking water","Container","",0.23657574346952731,1.0811931289914829,0.93350870189061774,0.22113079477438599,0,0,0.067715534281519496,0,0,0,0.1919291423907224,0.63669823759943456,1.3848487795045259,0.82940501927601196,0.50183003703885709,"Abyan","Aden","Al-Baidha","Al-Hodiedah","Al-Jawf","Al-Mhrah","Al-Mhweit","Aldhalae","Amran","Dhamar","Hadramout","Hajjah","Ibb","lahj","Mareb","Reimah","Sadah","Sanaa","Sanaa City","Shabwah","Taiz",0,0,0.90301910201749958,0,0,0,0.054090038031009501,0,0.2248610751495885,0,0,0,3.453081351261698,0,0,0,0,0,0,0,0.52395614893827325]
["YEM",2013,"YEM_2013_DHS",69,"Source of drinking water","Other","",1.0330199056742619,1.1925563431984421,0.63266116781614556,0.73776336969090206,0.25133404078764982,1.8755471002817821,0.48325270052386932,0.23347151555024639,0.048644562570722999,0.40970738415940972,1.1894531898674781,0.93959274823825267,1.1039152861429271,0.56115129759011473,0.40751781293821099,"Abyan","Aden","Al-Baidha","Al-Hodiedah","Al-Jawf","Al-Mhrah","Al-Mhweit","Aldhalae","Amran","Dhamar","Hadramout","Hajjah","Ibb","lahj","Mareb","Reimah","Sadah","Sanaa","Sanaa City","Shabwah","Taiz",1.452464200326232,0.42227716064564957,0.21765231396491749,1.572162923716429,0.26793858645800062,0.26709376206294649,1.582747288493658,0.084266691280261999,0.27322675511728312,0.76597288179418388,0.13275542668640111,0.0127430113333688,1.6794298705264541,0.9367755023808535,0.3323219726333253,0.18376886833813569,1.0429822480028359,0.42650360174769852,0.12724452752952631,0.31962902189332631,0.85587766495556838]
["YEM",2013,"YEM_2013_DHS",122,"Sanitation","Improved","s_imp",13.921448988992241,38.733476075790783,60.218551875856583,82.80380818597952,96.247673109575828,74.643292719687352,91.190819827709831,97.479052609738332,97.410583833614851,99.288605657270352,11.430646306471949,27.49761075483352,44.729152119812532,57.479276973147122,77.322806817717407,"Abyan","Aden","Al-Baidha","Al-Hodiedah","Al-Jawf","Al-Mhrah","Al-Mhweit","Aldhalae","Amran","Dhamar","Hadramout","Hajjah","Ibb","lahj","Mareb","Reimah","Sadah","Sanaa","Sanaa City","Shabwah","Taiz",67.385473045662749,97.992870776394909,75.252197977564265,73.326961808209518,54.63198538560178,90.172047571340485,15.09011372259109,65.339926069227744,43.920241345740813,49.80966894881422,87.63078021541331,32.903987582836628,63.534260798234811,71.741785412072915,55.931637543973451,23.873522481388729,53.71838207809342,18.246998599245249,99.071658219807446,64.649296814693628,49.002919222304229]
["YEM",2013,"YEM_2013_DHS",123,"Sanitation","Not Improved","",86.078551011007761,61.266523924209217,39.781448124143417,17.19619181402048,3.7523268904241718,25.356707280312651,8.8091801722901693,2.5209473902616679,2.5894161663851492,0.71139434272964763,88.569353693528058,72.502389245166484,55.270847880187468,42.520723026852878,22.67719318228259,"Abyan","Aden","Al-Baidha","Al-Hodiedah","Al-Jawf","Al-Mhrah","Al-Mhweit","Aldhalae","Amran","Dhamar","Hadramout","Hajjah","Ibb","lahj","Mareb","Reimah","Sadah","Sanaa","Sanaa City","Shabwah","Taiz",32.614526954337251,2.0071292236050908,24.747802022435739,26.673038191790479,45.36801461439822,9.8279524286595148,84.909886277408916,34.660073930772263,56.079758654259187,50.19033105118578,12.36921978458669,67.096012417163365,36.465739201765189,28.258214587927089,44.068362456026549,76.126477518611267,46.28161792190658,81.753001400754755,0.92834178019255376,35.350703185306372,50.997080777695771]
["YEM",2013,"YEM_2013_DHS",124,"Sanitation ladder","Basic","s_bas",12.148872275586831,34.911387204195101,57.660294335870368,79.799700661562369,94.822641675842945,72.593934621563008,87.346710901542266,94.516118830782702,97.410583833614851,99.018583158875444,10.137580103998641,24.380075140151529,41.398711909803723,54.003273805848757,73.887813130848201,"Abyan","Aden","Al-Baidha","Al-Hodiedah","Al-Jawf","Al-Mhrah","Al-Mhweit","Aldhalae","Amran","Dhamar","Hadramout","Hajjah","Ibb","lahj","Mareb","Reimah","Sadah","Sanaa","Sanaa City","Shabwah","Taiz",62.461912106761389,97.082001527496757,75.252197977564265,68.630332682432794,50.942369818212192,83.378142124297213,14.791299589470469,61.344956253181103,36.539600300060279,49.259506739116731,83.326952850858703,28.465062770715651,61.512035885424567,65.500527783266534,51.014570507140633,23.873522481388729,50.813830234410453,17.70188271660124,98.275661669202051,63.567148193656102,47.519790216691099]
["YEM",2013,"YEM_2013_DHS",125,"Sanitation ladder","Limited","s_lim",1.772576713405418,3.82208887159566,2.558257539986259,3.004107524417245,1.425031433732918,2.0493580981243449,3.8441089261675772,2.9629337789555872,0,0.27002249839492398,1.2930662024733039,3.1175356146819961,3.3304402100087929,3.476003167298364,3.434993686869221,"Abyan","Aden","Al-Baidha","Al-Hodiedah","Al-Jawf","Al-Mhrah","Al-Mhweit","Aldhalae","Amran","Dhamar","Hadramout","Hajjah","Ibb","lahj","Mareb","Reimah","Sadah","Sanaa","Sanaa City","Shabwah","Taiz",4.9235609389013462,0.91086924889815535,0,4.6966291257767292,3.689615567389573,6.7939054470432767,0.29881413312061561,3.994969816046642,7.3806410456805107,0.55016220969748897,4.3038273645545946,4.4389248121209732,2.0222249128102319,6.2412576288063928,4.9170670368328313,0,2.9045518436829632,0.54511588264402155,0.7959965506053962,1.0821486210375491,1.4831290056131241]
["YEM",2013,"YEM_2013_DHS",126,"Sanitation ladder","Unimproved","s_unimp",25.977618043851329,29.69682039694932,21.332998251716589,10.05607563267068,1.6594628844389261,18.254473302938969,5.9179290645044187,1.339000224548988,2.1715566273955269,0.24879406663702361,23.118125870036749,31.935587461453611,26.7667288027342,22.883322842889331,9.5946366939477592,"Abyan","Aden","Al-Baidha","Al-Hodiedah","Al-Jawf","Al-Mhrah","Al-Mhweit","Aldhalae","Amran","Dhamar","Hadramout","Hajjah","Ibb","lahj","Mareb","Reimah","Sadah","Sanaa","Sanaa City","Shabwah","Taiz",12.405657774920829,1.8383061302373289,3.9867875169772802,4.4695601367397408,27.24896422220943,5.5805830105089704,40.797692214680687,22.374724124371749,19.965402537279068,16.57892859365079,9.6650569700944509,20.034458864482659,17.325667195537442,16.75542530539375,19.012941700918802,35.995182458453257,37.327296945729913,36.165078131059992,0.82899248073530318,16.098230224924691,14.205728964201249]
["YEM",2013,"YEM_2013_DHS",127,"Sanitation ladder","Open defecation","s_od",60.100932967156432,31.569703527259911,18.448449872426789,7.140116181349712,2.0928640059852111,7.1022339773736789,2.8912511077857381,1.181947165712723,0.41785953898962169,0.46260027609260851,65.451227823491308,40.566801783712847,28.504119077453279,19.637400183963539,13.08255648833482,"Abyan","Aden","Al-Baidha","Al-Hodiedah","Al-Jawf","Al-Mhrah","Al-Mhweit","Aldhalae","Amran","Dhamar","Hadramout","Hajjah","Ibb","lahj","Mareb","Reimah","Sadah","Sanaa","Sanaa City","Shabwah","Taiz",20.208869179416428,0.16882309336775811,20.761014505458451,22.203478055050731,18.1190503921888,4.2473694181505417,44.112194062728229,12.285349806400511,36.11435611698014,33.611402457534993,2.7041628144922498,47.061553552680721,19.140072006227761,11.502789282533319,25.05542075510774,40.13129506015801,8.9543209761766782,45.587923269694762,0.099349299457249102,19.25247296038166,36.791351813494529]
["YEM",2013,"YEM_2013_DHS",135,"Sanitation type","Sewer connection","s_sew",0.87464150880310598,2.7072132910443689,8.4752366809751418,41.322733558608483,67.346226396888682,37.215825524228627,60.029956441436283,69.684049997812025,78.097686735342492,77.421905471887982,0.36807640034774902,1.9355177901685701,3.0073435829444439,5.5853841148876242,19.845397013566341,"Abyan","Aden","Al-Baidha","Al-Hodiedah","Al-Jawf","Al-Mhrah","Al-Mhweit","Aldhalae","Amran","Dhamar","Hadramout","Hajjah","Ibb","lahj","Mareb","Reimah","Sadah","Sanaa","Sanaa City","Shabwah","Taiz",21.315063737366859,81.683582903090596,28.191200161451,18.999714865876651,4.6516289346922486,84.440002478121784,8.347515321600838,10.706694237164241,7.4448036836294609,12.436083622767359,46.948617983957867,4.6621137992997683,20.277118931747811,11.92871085630369,13.99718908044766,0.73985403022720575,8.0653673405314468,2.058489903829285,70.934087086338266,23.925645180194579,21.311453289907039]
["YEM",2013,"YEM_2013_DHS",136,"Sanitation type","Septic tank connection","s_sep",10.121054421090539,26.614929187775331,38.573681882137443,33.642926184171422,23.437323071937129,33.60786938798325,24.838788518750839,20.104022346510551,15.48919516646831,18.51868691201609,7.853239823899667,18.793655696638542,30.855004952760449,38.12204005228255,45.614704754007811,"Abyan","Aden","Al-Baidha","Al-Hodiedah","Al-Jawf","Al-Mhrah","Al-Mhweit","Aldhalae","Amran","Dhamar","Hadramout","Hajjah","Ibb","lahj","Mareb","Reimah","Sadah","Sanaa","Sanaa City","Shabwah","Taiz",44.999288593805737,16.011331411721692,35.489843894975166,17.8331585977716,46.581148202239604,5.1405504112205662,6.7388342071109957,41.414632713996433,29.9989340880418,23.805853818073221,37.868764970840708,20.968308616161021,40.556669781062098,19.63320307487599,41.891120589001638,15.00800792071683,28.254505539237972,16.10261712472585,27.989274492328111,33.99018498385383,22.269171668923072]
["YEM",2013,"YEM_2013_DHS",139,"Sanitation type","Open defecation","",59.892484654333941,31.499035679423599,18.3970092884134,7.1273444528741976,2.0919185858341049,7.0998733572314396,2.8860247518298232,1.181947165712723,0.41785953898962169,0.46260027609260851,65.149519888709094,40.527400681286608,28.412776633179419,19.571610793831312,13.05072078760664,"Abyan","Aden","Al-Baidha","Al-Hodiedah","Al-Jawf","Al-Mhrah","Al-Mhweit","Aldhalae","Amran","Dhamar","Hadramout","Hajjah","Ibb","lahj","Mareb","Reimah","Sadah","Sanaa","Sanaa City","Shabwah","Taiz",20.208869179416428,0.16882309336775811,20.725653981268501,22.15465471435094,18.05323377547937,4.2195082739159053,44.101190378200471,12.253676979559589,36.089764962323493,33.601223871058018,2.702812455329402,46.354781486205653,19.129523619759748,11.488121526088459,25.036011380122549,40.13129506015801,8.9038818902520269,45.37333354893395,0.099224086789867702,19.234419566175081,36.781298551115867]
["YEM",2013,"YEM_2013_DHS",151,"Shared among all sanitation facilities","Yes","",17.672345826021751,14.40727400841031,10.75839589153688,6.7906322451007686,4.252169672322978,9.6887257469432182,4.4224730350859067,6.7546521742787036,4.0834236544996783,2.377528014629843,15.936195938586961,16.83928172714209,14.25560127586626,10.49824804802393,7.3169412386549242,"Abyan","Aden","Al-Baidha","Al-Hodiedah","Al-Jawf","Al-Mhrah","Al-Mhweit","Aldhalae","Amran","Dhamar","Hadramout","Hajjah","Ibb","lahj","Mareb","Reimah","Sadah","Sanaa","Sanaa City","Shabwah","Taiz",9.8474900951253979,3.765154612426679,4.5919142282948737,11.694523929001051,20.837363007399912,7.5326982758898184,18.85385791861907,11.62352858664473,17.8716431703048,19.789365979154152,11.17745923185047,13.44200314949539,11.44149812242539,4.5349014467006814,7.7759279747995267,13.755061180736631,12.78271228735143,9.7275537337007592,1.7847235055742621,12.958625767156949,2.0408518378268781]
["YEM",2013,"YEM_2013_DHS",152,"Shared among all sanitation facilities","No","",82.223121694518724,85.413489902379183,88.855447271102832,93.085113467445908,95.57068915930293,90.275496354631485,95.391390508707744,93.245347825721325,95.663961158405456,97.622471985370154,83.889907923505319,83.050528978469245,85.564810559746888,89.010656248135277,92.390544685519586,"Abyan","Aden","Al-Baidha","Al-Hodiedah","Al-Jawf","Al-Mhrah","Al-Mhweit","Aldhalae","Amran","Dhamar","Hadramout","Hajjah","Ibb","lahj","Mareb","Reimah","Sadah","Sanaa","Sanaa City","Shabwah","Taiz",90.152509904874591,96.219053174011577,95.221144132643843,88.150565493022128,78.634908308805535,91.553481223582025,81.146142081380987,87.904772490821316,82.021812919816838,80.085555340168384,88.470913581963757,86.411333769263194,88.558501877574571,95.123663583479313,91.939894414738887,85.974930769327898,86.306952991748361,89.41074961113749,98.089118552103585,87.04137423284304,97.874524271629426]
["YEM",2013,"YEM_2013_DHS",153,"Type of toilet facility","Flush to piped sewer system","",0.87768558933986707,2.713286903546638,8.49893461566041,41.396781156050437,67.376662801043082,37.228199326256103,60.138665807210799,69.684049997812025,78.097686735342492,77.421905471887982,0.36978096502881952,1.937399517923527,3.017011702226974,5.6041592181963669,19.89380752900361,"Abyan","Aden","Al-Baidha","Al-Hodiedah","Al-Jawf","Al-Mhrah","Al-Mhweit","Aldhalae","Amran","Dhamar","Hadramout","Hajjah","Ibb","lahj","Mareb","Reimah","Sadah","Sanaa","Sanaa City","Shabwah","Taiz",21.315063737366859,81.683582903090596,28.239297829015729,19.041585504984141,4.6685873634411719,84.997554433348228,8.349598109489369,10.73436848328465,7.4498764880371269,12.439850799614099,46.972074105137381,4.7331971201229628,20.288300124296111,11.943941146577361,14.008040517103289,0.73985403022720575,8.1110563738449173,2.0682253748449919,71.023600092098221,23.948101750958202,21.317278250961529,204.561992,633.23398299999974,1982.6392949999999,9663.6799549999923,15751.661848999969,2687.3152899999991,4330.2927640000034,5029.5534520000037,5630.8010190000041,5585.8380259999894,59.554028000000002,312.94749700000011,486.41020600000002,903.39040499999953,3209.6743870000032,528.89900900000021,3116.545598000002,1326.5489789999999,2741.758540000003,43.699690999999987,381.04489499999983,258.90856700000012,323.1508079999997,338.13864499999988,1034.2719669999999,3077.6838479999979,331.38808099999989,2602.779833999999,386.86349899999999,120.607535,19.884550000000001,294.71346999999997,125.962086,7338.9500140000036,591.98506099999997,3251.9923969999968]
["YEM",2013,"YEM_2013_DHS",154,"Type of toilet facility","Flush to septic tank","",10.156279486977139,26.674639579711052,38.681539235061287,33.703212076229391,23.447915318533258,33.619043589187022,24.883769543335038,20.104022346510551,15.48919516646831,18.51868691201609,7.8896082387807844,18.81192705726416,30.954198762885159,38.250186161054877,45.72597646941621,"Abyan","Aden","Al-Baidha","Al-Hodiedah","Al-Jawf","Al-Mhrah","Al-Mhweit","Aldhalae","Amran","Dhamar","Hadramout","Hajjah","Ibb","lahj","Mareb","Reimah","Sadah","Sanaa","Sanaa City","Shabwah","Taiz",44.999288593805737,16.011331411721692,35.550393949737263,17.87245843743051,46.750968945450502,5.1744931379922621,6.7405156131017181,41.521679643078933,30.019375019936579,23.81306516081106,37.88768468303283,21.288012740222989,40.579033507164723,19.65827027496444,41.923597026870162,15.00800792071683,28.414562854712059,16.17877322440026,28.024594663373659,34.022088114933879,22.27525839871679,2367.1218810000032,6225.3970430000008,9023.6651000000002,7867.6903340000063,5481.7739230000034,2426.788603999998,1791.7591910000001,1451.038724,1116.7626029999999,1336.0867949999999,1270.638551999999,3038.684294000001,4990.5136880000073,6165.9295930000044,7377.4462370000037,1116.5849389999989,610.89441300000021,1669.9897809999991,2573.4183499999999,437.60622599999999,23.197305,209.01332199999999,1249.9817149999999,1362.534104999999,1979.8618280000001,2482.4604279999999,1490.4500089999999,5205.8718299999991,636.73013200000025,360.95710099999962,403.35994899999969,1032.436964,985.34330399999965,2895.8134920000011,841.00894999999957,3398.1341380000008]
["YEM",2013,"YEM_2013_DHS",155,"Type of toilet facility","Pit","",17.460746257360899,23.704226236269889,23.49314176044545,11.197612622849199,5.4652912649243257,12.94798996213874,7.160517542993003,7.4556994861752326,4.7592808785613459,3.2282262203339922,15.77543400764416,23.5676447660788,23.32614331862986,25.37085602999332,13.70681044441681,"Abyan","Aden","Al-Baidha","Al-Hodiedah","Al-Jawf","Al-Mhrah","Al-Mhweit","Aldhalae","Amran","Dhamar","Hadramout","Hajjah","Ibb","lahj","Mareb","Reimah","Sadah","Sanaa","Sanaa City","Shabwah","Taiz",5.6005390173412062,0.59591292316525868,5.6961422179434802,34.946376368607872,11.15353000828607,4.9919160342734896,30.354161813972802,17.566350787695061,21.023581518758341,16.401522618725039,2.7710214272430971,11.820990207591009,11.34329073404658,40.61055946839307,14.7903704357251,11.357729865336511,27.657604424472289,29.65144551520179,0.14078078601337049,11.987868368681371,14.84063051526171,4069.5723840000019,5532.154220000004,5480.5017480000033,2613.974846000001,1277.703827,934.64986299999964,515.59403399999997,538.12657400000001,343.14157999999998,232.91016500000001,2540.6679290000011,3806.873787,3760.6994260000051,4089.7817159999991,2211.461950999998,138.96836400000009,22.73639,267.57788699999998,5031.8565029999972,104.401134,22.378810000000001,941.23722299999974,528.8229540000001,954.22862099999952,1363.6526139999989,181.56166300000001,827.62985799999956,1455.227308,1315.3734549999999,127.3433010000001,305.25392599999981,1004.933044000001,1805.875692000001,14.547040000000001,296.334092,2263.967146]
["YEM",2013,"YEM_2013_DHS",156,"Type of toilet facility","Latrine","",0.86819740966985848,1.7638173064749549,2.0011228818834921,1.4849891018479791,0.44322147071841239,1.58457511915214,1.991889308198159,0.2352807792405272,0.81549823297344393,0.1197870530322903,0.90424181288412864,1.1541926609511099,1.719790773628713,2.2225295482699909,1.3713654354337621,"Abyan","Aden","Al-Baidha","Al-Hodiedah","Al-Jawf","Al-Mhrah","Al-Mhweit","Aldhalae","Amran","Dhamar","Hadramout","Hajjah","Ibb","lahj","Mareb","Reimah","Sadah","Sanaa","Sanaa City","Shabwah","Taiz",2.7984503296577241,0,9.1777816895277109,1.466541497186993,1.4607416599386369,0,0.3178356883952182,1.68000923907426,2.6420032218533742,2.8246263343367359,0,0.20228392482163571,0.81717326587188865,1.3952512246349129,0,0.20571012029631339,1.9558756903089289,0.2255476043073546,0,1.3703455289217219,0.6692837097319686,202.35058400000011,411.64428899999979,466.82378900000032,346.65640700000012,103.618589,114.382458,143.42625899999999,16.981752,58.796982,8.6424000000000003,145.630109,186.43635499999999,277.26898899999998,358.27173900000008,221.25661500000001,69.439042000000001,0,431.12888299999997,211.16427899999999,13.673078,0,9.8556099999999986,50.575527000000008,119.91653700000001,234.844604,0,14.162622000000001,104.834909,45.192098999999999,0,5.5287300000000004,71.06631800000001,13.73663,0,33.874254000000001,102.10053600000001]
["YEM",2013,"YEM_2013_DHS",157,"Type of toilet facility","No facility/bush/field","",60.100932967156432,31.569703527259911,18.448449872426789,7.140116181349712,2.0928640059852111,7.1022339773736789,2.8912511077857381,1.181947165712723,0.41785953898962169,0.46260027609260851,65.451227823491308,40.566801783712847,28.504119077453279,19.637400183963539,13.08255648833482,"Abyan","Aden","Al-Baidha","Al-Hodiedah","Al-Jawf","Al-Mhrah","Al-Mhweit","Aldhalae","Amran","Dhamar","Hadramout","Hajjah","Ibb","lahj","Mareb","Reimah","Sadah","Sanaa","Sanaa City","Shabwah","Taiz",20.208869179416428,0.16882309336775811,20.761014505458451,22.203478055050731,18.1190503921888,4.2473694181505417,44.112194062728229,12.285349806400511,36.11435611698014,33.611402457534993,2.7041628144922498,47.061553552680721,19.140072006227761,11.502789282533319,25.05542075510774,40.13129506015801,8.9543209761766782,45.587923269694762,0.099349299457249102,19.25247296038166,36.791351813494529,14007.71155200001,7367.8198499999926,4303.6713779999936,1666.7913710000009,489.280483,512.67432499999984,208.18492699999999,85.308853999999997,30.127447,33.375698999999997,10541.06247500001,6552.7419419999978,4595.505685999995,3165.5486959999998,2110.7445830000001,501.4505709999998,6.4412560000000001,975.25451099999987,3197.0329129999991,169.60096100000001,19.041,1367.853255,369.84203800000012,1639.1760939999981,2794.5135269999992,177.180982,3294.947901999999,2455.473998999998,372.57461799999999,215.724143,1078.581328999999,325.35330599999998,2776.462363000001,10.265877,475.91147299999977,5612.5925159999997]
["YEM",2013,"YEM_2013_DHS",158,"Type of toilet facility","Bucket toilet","",9.9999048375148298,13.25155509050289,8.5468028423041371,4.8043341936241299,1.0384989342696409,7.2755667973219902,2.6595532719757031,1.1402630935514759,0.33330043100633649,0.1954809276141235,9.223356643570165,13.36463656321369,12.22074716484785,8.5164908105423329,5.9316106399844184,"Abyan","Aden","Al-Baidha","Al-Hodiedah","Al-Jawf","Al-Mhrah","Al-Mhweit","Aldhalae","Amran","Dhamar","Hadramout","Hajjah","Ibb","lahj","Mareb","Reimah","Sadah","Sanaa","Sanaa City","Shabwah","Taiz",4.6038855136047614,1.5403496686547851,0.32928453734455548,4.4695601367397124,17.507089876939862,0.58866697623545416,10.069101789925741,13.952672558420099,2.2222093055848582,9.9811846300468989,9.514189009794169,14.680005394530481,7.6960159066930434,14.44945007905989,3.6694317895112638,30.985273381436109,24.469036757082389,5.9074756807959394,0.66870873356350979,9.074697030501877,3.9775105280059329,2330.6756750000031,3092.6825320000039,1993.8060390000001,1121.5255569999999,242.785608,525.18634400000019,191.50149300000001,82.300242000000011,24.030781000000001,14.103564,1485.4416309999999,2158.7852800000001,1970.259559000001,1372.8582260000001,957.0082910000001,114.238011,58.770315999999987,15.468234000000001,643.56272600000023,163.87278599999999,2.6389999999999998,312.22780799999992,420.03564700000021,100.862725,829.85396099999991,623.38456199999996,1027.799750000001,987.31953299999975,468.01677499999983,31.593364000000001,832.76996900000029,889.07713099999955,359.78572200000008,69.098440000000011,224.321958,606.77699300000006]
["YEM",2013,"YEM_2013_DHS",159,"Type of toilet facility","Other","",0.53625345198085517,0.32277135623493108,0.33000879221837259,0.27295466804854279,0.13554620452586391,0.24239122857024559,0.27435341850131462,0.1987371309973931,0.0871790166585176,0.053313139022889103,0.38635050860055359,0.59739765085596142,0.25798920032844019,0.39837804797985937,0.28787299341065981,"Abyan","Aden","Al-Baidha","Al-Hodiedah","Al-Jawf","Al-Mhrah","Al-Mhweit","Aldhalae","Amran","Dhamar","Hadramout","Hajjah","Ibb","lahj","Mareb","Reimah","Sadah","Sanaa","Sanaa City","Shabwah","Taiz",0.47390362880721482,0,0.24608527097293459,0,0.34003175375502231,0,0.0565929223872099,2.2595694820464729,0.52859832884940861,0.92834799893117059,0.15086796030034089,0.21395706002995921,0.13611445569970129,0.43973852383690359,0.55313947568239241,1.5721296218292919,0.43754292340254619,0.38060933075462572,0.042966425494023602,0.34442624562131502,0.1286867838275243,124.984477,75.329221999999987,76.984754999999993,63.718639000000003,31.688687000000002,17.496995999999999,19.754854999999999,14.344158,6.2855600000000003,3.846438,62.222589000000013,96.497443000000004,41.593667000000003,64.218536999999998,46.445536999999987,11.759156000000001,0,11.559925,0,3.1828219999999998,0,1.7548619999999999,68.022790999999998,23.992280000000001,77.184551999999996,9.8851049999999994,14.979900000000001,17.462081999999999,14.243103,4.7624639999999996,42.253050999999992,15.898027000000001,23.180426000000001,4.4397700000000002,8.5140440000000002,19.631419999999999]
["YEM",2013,"YEM_2013_DHS",222,"Hygiene ladder","Basic","h_bas",19.54773797960237,31.994326751458939,45.55945627119371,58.460576277453058,76.016692155433304,56.668826768087747,61.568099718395843,68.185291752541531,79.593387871582692,82.05328388010085,18.15978171998303,24.16464213387918,36.063507544791499,44.569004712905283,57.018629452400319,"Abyan","Aden","Al-Baidha","Al-Hodiedah","Al-Jawf","Al-Mhrah","Al-Mhweit","Aldhalae","Amran","Dhamar","Hadramout","Hajjah","Ibb","lahj","Mareb","Reimah","Sadah","Sanaa","Sanaa City","Shabwah","Taiz",45.843710530994677,76.79580158071488,56.322886723216868,55.027223797089121,52.605296347254139,71.698776364321049,19.598174037134601,79.981760669566668,45.587904889935963,31.19977338944063,39.35772523117663,27.131483245618519,32.572130627802501,45.534598409446311,13.00990835407363,39.565059888548028,38.811547575288003,32.283017273150442,70.481901717754525,27.37365833154832,55.186559033509127,4460.3271350000005,7319.3665570000012,10535.301094,13413.58387499998,17343.223697999962,3920.993497999998,4357.7866010000062,4711.7283860000061,5610.2872890000017,5743.2982499999889,2865.5879750000008,3828.7228880000048,5756.6288300000042,7124.1915570000056,9152.5770849999917,1135.174037,2915.1634320000012,2641.7616830000002,7512.6312499999995,492.91149000000053,315.61096700000007,599.80484800000033,2389.5077360000018,2055.372222999998,2571.5929469999992,2423.331415000001,1894.081538000001,4166.727431999997,1463.5273590000011,111.209523,1055.629748999999,1377.3538000000001,1957.456543,6915.3191009999973,677.29821600000014,8400.3370699999923]
["YEM",2013,"YEM_2013_DHS",223,"Hygiene ladder","Limited","h_lim",43.081054142822133,31.424365061277779,25.541000259454201,23.221925593316762,14.79687684726715,25.587431358416609,27.614440074882602,20.745773841035781,17.263258564382209,14.597960600974741,43.34128324988481,36.576488883313523,32.058481434638061,25.506784767359669,14.9712982666505,"Abyan","Aden","Al-Baidha","Al-Hodiedah","Al-Jawf","Al-Mhrah","Al-Mhweit","Aldhalae","Amran","Dhamar","Hadramout","Hajjah","Ibb","lahj","Mareb","Reimah","Sadah","Sanaa","Sanaa City","Shabwah","Taiz",13.858312742597169,12.59039844221177,25.315889188269601,37.33900840689077,17.10609033893649,10.950587283897841,25.848760503177999,17.124578320167601,40.72479834316205,51.430142413190353,6.5847871226813677,53.708202452761483,31.37101294753316,15.269800146176539,24.676146650814768,15.08028723593408,24.18302608121979,35.983074743425007,28.873454904277111,15.93341260250499,9.1811541776247765,9830.0680620000003,7188.9759860000067,5906.1751390000036,5328.1932289999959,3375.9104470000029,1770.429312,1954.5485000000001,1433.570921,1216.8327380000001,1021.780453,6839.1934450000072,5795.2954310000041,5117.3274880000126,4077.1657759999989,2403.1787990000021,343.15714500000001,477.93067300000001,1187.4133220000001,5097.7349399999939,160.28402199999999,48.203409000000001,791.10491799999954,511.60804700000011,1836.1146340000009,4239.0497470000046,405.43810400000018,3749.4343299999991,4013.0767529999998,490.78659000000022,210.93326899999991,402.35500399999989,858.21321100000046,2181.8067530000021,2832.9138310000021,394.23564799999991,1397.528513]
["YEM",2013,"YEM_2013_DHS",224,"Hygiene ladder","No facility","h_nfac",37.37120787757533,36.581308187263502,28.899543469352139,18.31749812922958,9.1864309972992313,17.743741873495541,10.81746020672135,11.068934406422629,3.1433535640351171,3.3487555189243738,38.498935030132174,39.258868982807449,31.878011020570771,29.924210519735361,28.01007228094938,"Abyan","Aden","Al-Baidha","Al-Hodiedah","Al-Jawf","Al-Mhrah","Al-Mhweit","Aldhalae","Amran","Dhamar","Hadramout","Hajjah","Ibb","lahj","Mareb","Reimah","Sadah","Sanaa","Sanaa City","Shabwah","Taiz",40.297976726408088,10.613799977073411,18.361224088513669,7.6337677960200008,30.288613313809481,17.350636351781159,54.553065459687602,2.8936610102657432,13.6872967669019,17.370084197369081,54.057487646142121,19.160314301619721,36.056856424664147,39.195601444377083,62.313944995111569,45.35465287551817,37.005426343492068,31.73390798342426,0.6446433779683185,56.69292906594675,35.632286788866082,8527.217458000001,8368.7338019999861,6682.8144330000086,4202.888735999999,2095.8860909999989,1227.7137269999989,765.65921899999989,764.88361499999985,221.56509500000001,234.39527099999989,6075.0777170000129,6220.3002799999967,5088.5199410000023,4783.2750430000042,4496.1506119999976,997.85153499999979,402.8991289999999,861.21257399999979,1042.205631,283.80422800000008,76.375795999999966,1669.604171999998,86.450026999999992,617.10424400000034,1431.702258,3328.4242740000018,1337.6046289999999,4612.5043059999989,1259.7856810000001,532.66355999999985,1210.101058,1313.2577230000011,1924.161713,63.249068999999992,1402.736136,5423.8427770000026]
["YEM",2013,"YEM_2013_DHS",225,"Place where household members wash their hands","Observed","",61.101149310751438,62.026326473122829,70.282780539413437,80.141464254796205,88.584652987917096,78.818811871373413,87.506601010217537,85.142617182092479,94.690307715387661,93.766643682759209,59.980846488424213,59.52263190439475,67.230749582905261,69.25453598648545,71.449167628552473,"Abyan","Aden","Al-Baidha","Al-Hodiedah","Al-Jawf","Al-Mhrah","Al-Mhweit","Aldhalae","Amran","Dhamar","Hadramout","Hajjah","Ibb","lahj","Mareb","Reimah","Sadah","Sanaa","Sanaa City","Shabwah","Taiz",59.577958803221897,88.931823683766709,81.375841169887281,87.386747763824346,69.529625361202662,80.621698949716517,44.844559286635103,96.120321739045053,85.678925246149433,81.891151234667035,43.151547095553227,79.395472297538845,63.725275619164627,60.260133303664411,37.386499695291157,54.247941015354527,61.180336134920879,67.644415670498944,94.220835734990288,43.3070709340533,64.208869278267329]
["YEM",2013,"YEM_2013_DHS",226,"Place where household members wash their hands","Not observed: not in dwelling","",26.010776756115629,27.40381307042151,21.83111194129377,14.40858177765111,8.0502951504164777,12.54777377328435,6.939554049862771,9.1693947835865011,2.6881199769412092,2.6405798426193439,26.59130165923488,28.539627084322071,24.347188279895029,22.8829795530288,23.767884098810232,"Abyan","Aden","Al-Baidha","Al-Hodiedah","Al-Jawf","Al-Mhrah","Al-Mhweit","Aldhalae","Amran","Dhamar","Hadramout","Hajjah","Ibb","lahj","Mareb","Reimah","Sadah","Sanaa","Sanaa City","Shabwah","Taiz",39.860303260800727,9.1421858921920993,1.4886810199837539,3.642005527870388,30.20964058425028,16.47659522570029,2.713273619718894,2.864278791726226,7.0577403513217636,16.076414407264469,49.437086151793757,12.51931765650111,23.975860822165199,36.599485160805237,42.834163485004083,24.455133824030469,35.93967370675287,23.280720674061381,0.61132927190091291,44.33092576800432,35.476374080818907]
["YEM",2013,"YEM_2013_DHS",227,"Place where household members wash their hands","Not observed: no permission to see","",2.3546499383889752,2.155083676429514,0.85229663092467733,1.80132516205515,2.3139664903826151,4.162911704530587,1.879222981253762,4.1223937315177528,2.1670639364951958,2.7365070622058441,2.362687539161092,1.9474563968787271,1.29535231608696,0.74848819232475139,0.62783038403499181,"Abyan","Aden","Al-Baidha","Al-Hodiedah","Al-Jawf","Al-Mhrah","Al-Mhweit","Aldhalae","Amran","Dhamar","Hadramout","Hajjah","Ibb","lahj","Mareb","Reimah","Sadah","Sanaa","Sanaa City","Shabwah","Taiz",0.20780614050794141,0.28501368869833682,0,5.3222050745166047,0.1104230005819453,2.4533337088143909,1.257363423966428,0.99272015328451668,0.41834726515856019,0.80553718449380118,6.0749077821610227,1.7666856090680061,0.34072137212705822,0.80474229649472873,0.71740466417272919,0.50220828189845634,2.5207522918811289,0.34351878651128581,5.1678349931088601,0,0.028831134611467201]
["YEM",2013,"YEM_2013_DHS",228,"Place where household members wash their hands","Not observed: other reason","",1.8813405034480939,0.80226387835830859,0.77242841017408137,1.2085420865866161,0.25084770938651568,0.82545412652882644,1.7805202069916319,0.43790880067813498,0.29478329078386051,0.13191784841847359,2.1831310629184668,1.211967354379641,0.5473373760881669,0.63521816925168673,0.98176334674104704,"Abyan","Aden","Al-Baidha","Al-Hodiedah","Al-Jawf","Al-Mhrah","Al-Mhweit","Aldhalae","Amran","Dhamar","Hadramout","Hajjah","Ibb","lahj","Mareb","Reimah","Sadah","Sanaa","Sanaa City","Shabwah","Taiz",0.35393179546941161,1.0103628588441851,2.1904075510789309,0.6323745263492121,0,0,1.7313225946634201,0,0.5146162897919534,0.11349547502720909,0.60083322117593363,6.2986946873651419,0.41123665126898667,0.057062050704949498,1.28823286565944,0.87600569367340153,0,1.405297014835365,0,6.0898168348644299,0.0552714619691098]
["YEM",2013,"YEM_2013_DHS",229,"Place where household members wash their hands","No place for washing","",8.5675313312522423,7.5720840252288619,5.9636499375311081,2.3547928613720992,0.65981761152259266,3.6290122272589409,1.894101751674264,0.99009608130057691,0.090144656079816698,0.47631268082590761,8.7728636237156881,8.7197209338271691,6.5664256202965747,6.0553158931432449,3.0500241626731799,"Abyan","Aden","Al-Baidha","Al-Hodiedah","Al-Jawf","Al-Mhrah","Al-Mhweit","Aldhalae","Amran","Dhamar","Hadramout","Hajjah","Ibb","lahj","Mareb","Reimah","Sadah","Sanaa","Sanaa City","Shabwah","Taiz",0,0.40729815971456929,14.622999357492001,2.9478495957374808,0,0.44837211576881442,49.385397007814397,0,6.014436873465411,1.0248745955639891,0.73562574931620184,0,11.54690553527397,2.1882111293655981,17.696233518393701,19.69367345234101,0,6.7589002647910164,0,6.272186463078004,0.0127093888128034]
["YEM",2013,"YEM_2013_DHS",230,"Place where household members wash their hands","missing","",0.084552160043458405,0.040428876438908697,0.29773254066277621,0.085293857538362397,0.14042005037452471,0.0160362970239111,0,0.13758942082452519,0.069580424312228106,0.24803888317125489,0.1091696265455233,0.058596326197653502,0.012946824728001601,0.42346220576629801,0.1233303791881106,"Abyan","Aden","Al-Baidha","Al-Hodiedah","Al-Jawf","Al-Mhrah","Al-Mhweit","Aldhalae","Amran","Dhamar","Hadramout","Hajjah","Ibb","lahj","Mareb","Reimah","Sadah","Sanaa","Sanaa City","Shabwah","Taiz",0,0.2233157167841186,0.32207090155818491,0.068817511702025103,0.1503110539651914,0,0.068084067202026394,0.022679315944279799,0.31593397411282959,0.088527102983495504,0,0.0198297495267762,0,0.090366058964996707,0.077465771478787304,0.22503773270251179,0.3592378664450005,0.56714758930169407,0,0,0.2179446555203125]