{"text_format":"1","workbook":"xlsx","n_sheets":7,"sheets":["Introduction","Water","Sanitation","Hygiene","WHS03","MICS13","data_summary"],"not_rendered":{"charts":108,"images":76,"macros":1,"external_links":0,"defined_names":0,"comments":0,"pivot_tables":0},"unopened":[],"bounds":{"document_bytes":16777216,"sheet_cells":100000,"rows_first":2000,"rows_last":500,"rows_between":2000,"halvings":0,"cell_chars":16384,"cell_head_chars":4096},"cells_cut":0,"cells_raw":0,"read":"whole","date_system":"1900"}

{"sheet":"Introduction","index":0,"n_rows":55,"n_cols":12,"rows_kept":55,"cut":false,"hidden":false,"merged":[[112,0,112,1],[113,0,113,1],[207,0,207,1],[212,0,212,1],[213,0,213,1],[107,0,107,1],[1,0,1,1],[4,0,4,1],[5,0,5,1],[6,0,6,1],[7,0,7,1]]}
[]
[]
[]
[null,null,"Joint Monitoring Programme for Water Supply, Sanitation and Hygiene"]
[]
[null,null,"Estimates on household water, sanitation and hygiene \nby wealth quintile and sub-national region in"]
[null,null,{"$f":"+Water!B5","v":"Uruguay"}]
[]
[null,null,"Updated May 2021"]
[]
[null,null,"Follow the links below to find the following information: "]
[]
[null,null,"JMP Estimates"]
[null,null,"WASH status and trends by wealth quintile \n(customized quintiles made without water and sanitation assets)"]
[null,null,"Water"]
[null,null,"Sanitation"]
[null,null,"Hygiene"]
[]
[null,null,"Data inputs"]
[null,null," customized wealth quintiles and subnational data:"]
[null,null,{"$f":"IF(INDIRECT(CONCATENATE(\"Water\",\"!B105\"))=0,\"\",INDIRECT(CONCATENATE(\"Water\",\"!B105\")))","v":"WHS03"}]
[null,null,{"$f":"IF(INDIRECT(CONCATENATE(\"Water\",\"!B106\"))=0,\"\",INDIRECT(CONCATENATE(\"Water\",\"!B106\")))","v":"MICS13"}]
[null,null,{"$f":"IF(INDIRECT(CONCATENATE(\"Water\",\"!B107\"))=0,\"\",INDIRECT(CONCATENATE(\"Water\",\"!B107\")))","v":""}]
[null,null,{"$f":"IF(INDIRECT(CONCATENATE(\"Water\",\"!B108\"))=0,\"\",INDIRECT(CONCATENATE(\"Water\",\"!B108\")))","v":""}]
[null,null,{"$f":"IF(INDIRECT(CONCATENATE(\"Water\",\"!B109\"))=0,\"\",INDIRECT(CONCATENATE(\"Water\",\"!B109\")))","v":""}]
[null,null,{"$f":"IF(INDIRECT(CONCATENATE(\"Water\",\"!B110\"))=0,\"\",INDIRECT(CONCATENATE(\"Water\",\"!B110\")))","v":""}]
[null,null,{"$f":"IF(INDIRECT(CONCATENATE(\"Water\",\"!B111\"))=0,\"\",INDIRECT(CONCATENATE(\"Water\",\"!B111\")))","v":""}]
[null,null,{"$f":"IF(INDIRECT(CONCATENATE(\"Water\",\"!B112\"))=0,\"\",INDIRECT(CONCATENATE(\"Water\",\"!B112\")))","v":""}]
[null,null,{"$f":"IF(INDIRECT(CONCATENATE(\"Water\",\"!B113\"))=0,\"\",INDIRECT(CONCATENATE(\"Water\",\"!B113\")))","v":""}]
[null,null,{"$f":"IF(INDIRECT(CONCATENATE(\"Water\",\"!B114\"))=0,\"\",INDIRECT(CONCATENATE(\"Water\",\"!B114\")))","v":""}]
[null,null,{"$f":"IF(INDIRECT(CONCATENATE(\"Water\",\"!B115\"))=0,\"\",INDIRECT(CONCATENATE(\"Water\",\"!B115\")))","v":""}]
[null,null,{"$f":"IF(INDIRECT(CONCATENATE(\"Water\",\"!B116\"))=0,\"\",INDIRECT(CONCATENATE(\"Water\",\"!B116\")))","v":""}]
[]
[]
[]
[]
[]
[]
[]
[]
[]
[]
[]
[]
[]
[]
[]
[]
[]
[]
[]
[]
[]
[]
[null,null,null,null,null,null,null,null,null,null,null,{"$f":"+IF(ISNUMBER(M48), \"\", \"Insufficient data to estimate safely managed sanitation services at national level\")","v":"Insufficient data to estimate safely managed sanitation services at national level"}]

{"sheet":"Water","index":1,"n_rows":318,"n_cols":28,"rows_kept":318,"cut":false,"hidden":false,"merged":[[317,1,317,11],[6,9,6,16],[6,17,6,24],[6,1,6,8],[4,1,4,24],[117,1,117,11],[30,21,30,24],[32,1,33,2],[32,3,33,3],[30,17,30,20],[30,1,31,4],[30,5,30,8],[30,9,30,12],[30,13,30,16],[96,23,96,27],[35,1,36,2],[35,3,36,3],[38,1,39,2],[38,3,39,3],[96,0,97,2],[96,3,96,7],[96,8,96,12],[96,13,96,17],[96,18,96,22],[217,18,217,22],[98,0,99,1],[100,0,101,1],[196,0,197,2],[196,3,196,7],[196,8,196,12],[217,1,217,11],[3,1,3,24],[317,18,317,22],[117,18,117,22],[196,18,196,22],[296,23,296,27],[298,0,299,1],[300,0,301,1],[296,0,297,2],[296,3,296,7],[296,8,296,12],[296,13,296,17],[296,18,296,22],[196,23,196,27],[198,0,199,1],[200,0,201,1],[196,13,196,17]]}
["BGD"]
[]
[]
[null,"Summary of trends in use of drinking water by wealth quintile (%)"]
[null,{"$f":"IF(ISERROR(INDIRECT(CONCATENATE($B105,\"!A2\"))),\"\",INDIRECT(CONCATENATE($B105,\"!A2\")))","v":"Uruguay"}]
[]
[null,{"$f":"B118","v":"National use of drinking water sources, 2000–2019"},null,null,null,null,null,null,null,{"$f":"B218","v":"Urban use of drinking water sources,  2000–2019"},null,null,null,null,null,null,null,{"$f":"B318","v":"Rural use of drinking water sources, 2000–2019"}]
[]
[]
[]
[]
[]
[]
[]
[]
[]
[]
[]
[]
[]
[]
[]
[]
[]
[]
[]
[]
[]
[]
[]
[null,{"$f":"IF(ISERROR(INDIRECT(CONCATENATE($B105,\"!A2\"))),\"\",INDIRECT(CONCATENATE($B105,\"!A2\")))","v":"Uruguay"},null,null,null,"Poorest",null,null,null,"Poor",null,null,null,"Middle",null,null,null,"Rich",null,null,null,"Richest"]
[null,null,null,null,null,"Basic","Limited","Unimproved","Surface \n water","Basic","Limited","Unimproved","Surface \nwater","Basic","Limited","Unimproved","Surface \nwater","Basic","Limited","Unimproved","Surface \nwater","Basic","Limited","Unimproved","Surface \nwater"]
[null,"NATIONAL",null,"Estimate",{"$f":"C99","v":2000},{"$f":"E99","v":98.062505771867251},{"$f":"F99","v":1.2260601650800174},0.71143406305273515,0,{"$f":"J99","v":99.577180583261821},{"$f":"K99","v":0},0.42281941673817869,0,{"$f":"O99","v":99.413117849337155},{"$f":"P99","v":0.10829142416976484},0.47859072649308132,0,{"$f":"T99","v":99.817161033135733},{"$f":"U99","v":0},0.18283896686426715,0,{"$f":"Y99","v":99.303281302275323},{"$f":"Z99","v":0},0.69671869772467687,0]
[null,null,null,null,{"$f":"C100","v":2019},{"$f":"E100","v":97.643986899332646},1.2208274891055462,1.1351856115618091,0,{"$f":"J100","v":99.496977038093434},0,0.50302296190656648,0,{"$f":"O100","v":99.891187810783364},0.10881218921664981,0,0,{"$f":"T100","v":99.976278734672889},0,2.3721265327111496E-2,0,{"$f":"Y100","v":99.568858980167448},0,0,0.43114101983256653]
[]
[null,"URBAN",null,"Estimate",{"$f":"C199","v":2000},{"$f":"E199","v":98.783612277823011},{"$f":"F199","v":0},1.2163877221769894,0,{"$f":"J199","v":99.24970139787834},{"$f":"K199","v":0},0.75029860212166,0,{"$f":"O199","v":99.632434066275096},{"$f":"P199","v":0.11891642932894406},0.24864950439595646,0,{"$f":"T199","v":99.502636722407757},{"$f":"U199","v":0},0.49736327759224253,0,{"$f":"Y199","v":99.332070715032216},{"$f":"Z199","v":0},0.66792928496778359,0]
[null,null,null,null,{"$f":"C200","v":2019},{"$f":"E200","v":100},0,0,0,{"$f":"J200","v":100},0,0,0,{"$f":"O200","v":99.880787148506641},0.11921285149335858,0,0,{"$f":"T200","v":100},0,0,0,{"$f":"Y200","v":99.525704590231811},0,0,0.47429540976819723]
[]
[null,"RURAL",null,"Estimate",{"$f":"C299","v":2000},{"$f":"E299","v":97.612681531310827},{"$f":"F299","v":2.3873184686891733},0,0,{"$f":"J299","v":100},{"$f":"K299","v":0},0,0,{"$f":"O299","v":100},{"$f":"P299","v":0},0,0,{"$f":"T299","v":100},{"$f":"U299","v":0},0,0,{"$f":"Y299","v":100},{"$f":"Z299","v":0},0,0]
[null,null,null,null,{"$f":"C300","v":2019},{"$f":"E300","v":88.574251212038675},2.1662651046112975,9.2594836833500267,0,{"$f":"J300","v":90.262536555468159},0,9.7374634445318407,0,{"$f":"O300","v":99.785952715399887},0,0.21404728460011313,0,{"$f":"T300","v":99.727324872360811},0,0.27267512763918944,0,{"$f":"Y300","v":99.39230397427103},0,0.60769602572896986,0]
[]
[]
[]
[]
[]
[]
[]
[]
[]
[]
[]
[]
[]
[]
[]
[]
[]
[]
[]
[]
[]
[]
[]
[]
[]
[]
[]
[]
[]
[]
[]
[]
[]
[]
[]
[]
[]
[]
[]
[]
[]
[]
[]
[]
[]
[]
[]
[]
[]
[]
[]
[]
[]
[]
[]
[]
["NATIONAL",null,null,"Poorest",null,null,null,null,"Poor",null,null,null,null,"Middle",null,null,null,null,"Rich",null,null,null,null,"Richest"]
[null,null,null,"Improved","Basic","Limited","Unimproved","Surface water","Improved","Basic","Limited","Unimproved","Surface water","Improved","Basic","Limited","Unimproved","Surface water","Improved","Basic","Limited","Unimproved","Surface water","Improved","Basic","Limited","Unimproved","Surface water"]
["Forecast period:",null,{"$f":"MinBase(C105:C116)","v":2000},{"$f":"IF((D101+H101)>100,D101*100/(D101+H101),D101)","v":99.288565936947279},{"$f":"D99*AVERAGEIF(E105:E116,\">0\")/100","v":98.062505771867251},{"$f":"D99*(100-AVERAGEIF(E105:E116,\">0\"))/100","v":1.2260601650800174},{"$f":"100-(E99+F99+H99)","v":0.71143406305273515},{"$f":"IF((D101+H101)>100,H101*100/(D101+H101),H101)","v":0},{"$f":"IF((I101+M101)>100,I101*100/(I101+M101),I101)","v":99.577180583261821},{"$f":"I99*AVERAGEIF(J105:J116,\">0\")/100","v":99.577180583261821},{"$f":"I99*(100-AVERAGEIF(J105:J116,\">0\"))/100","v":0},{"$f":"100-(J99+K99+M99)","v":0.42281941673817869},{"$f":"IF((I101+M101)>100,M101*100/(I101+M101),M101)","v":0},{"$f":"IF((N101+R101)>100,N101*100/(N101+R101),N101)","v":99.521409273506933},{"$f":"N99*AVERAGEIF(O105:O116,\">0\")/100","v":99.413117849337155},{"$f":"N99*(100-AVERAGEIF(O105:O116,\">0\"))/100","v":0.10829142416976484},{"$f":"100-(O99+P99+R99)","v":0.47859072649308132},{"$f":"IF((N101+R101)>100,R101*100/(N101+R101),R101)","v":0},{"$f":"IF((S101+W101)>100,S101*100/(S101+W101),S101)","v":99.817161033135719},{"$f":"S99*AVERAGEIF(T105:T116,\">0\")/100","v":99.817161033135733},{"$f":"S99*(100-AVERAGEIF(T105:T116,\">0\"))/100","v":0},{"$f":"100-(T99+U99+W99)","v":0.18283896686426715},{"$f":"IF((S101+W101)>100,W101*100/(S101+W101),W101)","v":0},{"$f":"IF((X101+AB101)>100,X101*100/(X101+AB101),X101)","v":99.303281302275309},{"$f":"X99*AVERAGEIF(Y105:Y116,\">0\")/100","v":99.303281302275323},{"$f":"X99*(100-AVERAGEIF(Y105:Y116,\">0\"))/100","v":0},{"$f":"100-(Y99+Z99+AB99)","v":0.69671869772467687},{"$f":"IF((X101+AB101)>100,AB101*100/(X101+AB101),AB101)","v":0}]
[null,null,{"$f":"MaxTarget(C105:C116)","v":2019},{"$f":"IF((D102+H102)>100,D102*100/(D102+H102),D102)","v":98.864814388438191},{"$f":"D100*AVERAGEIF(E105:E116,\">0\")/100","v":97.643986899332646},{"$f":"D100*(100-AVERAGEIF(E105:E116,\">0\"))/100","v":1.2208274891055462},{"$f":"100-(E100+F100+H100)","v":1.1351856115618091},{"$f":"IF((D102+H102)>100,H102*100/(D102+H102),H102)","v":0},{"$f":"IF((I102+M102)>100,I102*100/(I102+M102),I102)","v":99.496977038093434},{"$f":"I100*AVERAGEIF(J105:J116,\">0\")/100","v":99.496977038093434},{"$f":"I100*(100-AVERAGEIF(J105:J116,\">0\"))/100","v":0},{"$f":"100-(J100+K100+M100)","v":0.50302296190656648},{"$f":"IF((I102+M102)>100,M102*100/(I102+M102),M102)","v":0},{"$f":"IF((N102+R102)>100,N102*100/(N102+R102),N102)","v":100},{"$f":"N100*AVERAGEIF(O105:O116,\">0\")/100","v":99.891187810783364},{"$f":"N100*(100-AVERAGEIF(O105:O116,\">0\"))/100","v":0.10881218921664981},{"$f":"100-(O100+P100+R100)","v":0},{"$f":"IF((N102+R102)>100,R102*100/(N102+R102),R102)","v":0},{"$f":"IF((S102+W102)>100,S102*100/(S102+W102),S102)","v":99.976278734672889},{"$f":"S100*AVERAGEIF(T105:T116,\">0\")/100","v":99.976278734672889},{"$f":"S100*(100-AVERAGEIF(T105:T116,\">0\"))/100","v":0},{"$f":"100-(T100+U100+W100)","v":2.3721265327111496E-2},{"$f":"IF((S102+W102)>100,W102*100/(S102+W102),W102)","v":0},{"$f":"IF((X102+AB102)>100,X102*100/(X102+AB102),X102)","v":99.568858980167434},{"$f":"X100*AVERAGEIF(Y105:Y116,\">0\")/100","v":99.568858980167448},{"$f":"X100*(100-AVERAGEIF(Y105:Y116,\">0\"))/100","v":0},{"$f":"100-(Y100+Z100+AB100)","v":0},{"$f":"IF((X102+AB102)>100,AB102*100/(X102+AB102),AB102)","v":0.43114101983256653}]
["Regression period:",null,{"$f":"MinRegYear(C99,C105:C116)","v":2001},{"$f":"IF(MAX(C105:C116)-MIN(C105:C116)<5,AVERAGEIF(C105:C116,\">0\",D105:D116),\nIF(FORECAST($C101,D$105:D$116,$C$105:$C$116)<0,0,\nIF(FORECAST($C101,D$105:D$116,$C$105:$C$116)>100,100,\nFORECAST($C101,D$105:D$116,$C$105:$C$116))))","v":99.288565936947279},null,null,null,{"$f":"IF(MAX(C105:C116)-MIN(C105:C116)<5,AVERAGEIF(C105:C116,\">0\",H105:H116),\nIF(FORECAST($C101,H$105:H$116,$C$105:$C$116)<0,0,\nIF(FORECAST($C101,H$105:H$116,$C$105:$C$116)>100,100,\nFORECAST($C101,H$105:H$116,$C$105:$C$116))))","v":0},{"$f":"IF(MAX(C105:C116)-MIN(C105:C116)<5,AVERAGEIF(C105:C116,\">0\",I105:I116),\nIF(FORECAST($C101,I$105:I$116,$C$105:$C$116)<0,0,\nIF(FORECAST($C101,I$105:I$116,$C$105:$C$116)>100,100,\nFORECAST($C101,I$105:I$116,$C$105:$C$116))))","v":99.577180583261821},null,null,null,{"$f":"IF(MAX(C105:C116)-MIN(C105:C116)<5,AVERAGEIF(C105:C116,\">0\",M105:M116),\nIF(FORECAST($C101,M$105:M$116,$C$105:$C$116)<0,0,\nIF(FORECAST($C101,M$105:M$116,$C$105:$C$116)>100,100,\nFORECAST($C101,M$105:M$116,$C$105:$C$116))))","v":0},{"$f":"IF(MAX(C105:C116)-MIN(C105:C116)<5,AVERAGEIF(C105:C116,\">0\",N105:N116),\nIF(FORECAST($C101,N$105:N$116,$C$105:$C$116)<0,0,\nIF(FORECAST($C101,N$105:N$116,$C$105:$C$116)>100,100,\nFORECAST($C101,N$105:N$116,$C$105:$C$116))))","v":99.521409273506933},null,null,null,{"$f":"IF(MAX(C105:C116)-MIN(C105:C116)<5,AVERAGEIF(C105:C116,\">0\",R105:R116),\nIF(FORECAST($C101,R$105:R$116,$C$105:$C$116)<0,0,\nIF(FORECAST($C101,R$105:R$116,$C$105:$C$116)>100,100,\nFORECAST($C101,R$105:R$116,$C$105:$C$116))))","v":0},{"$f":"IF(MAX(C105:C116)-MIN(C105:C116)<5,AVERAGEIF(C105:C116,\">0\",S105:S116),\nIF(FORECAST($C101,S$105:S$116,$C$105:$C$116)<0,0,\nIF(FORECAST($C101,S$105:S$116,$C$105:$C$116)>100,100,\nFORECAST($C101,S$105:S$116,$C$105:$C$116))))","v":99.817161033135719},null,null,null,{"$f":"IF(MAX(C105:C116)-MIN(C105:C116)<5,AVERAGEIF(C105:C116,\">0\",W105:W116),\nIF(FORECAST($C101,W$105:W$116,$C$105:$C$116)<0,0,\nIF(FORECAST($C101,W$105:W$116,$C$105:$C$116)>100,100,\nFORECAST($C101,W$105:W$116,$C$105:$C$116))))","v":0},{"$f":"IF(MAX(C105:C116)-MIN(C105:C116)<5,AVERAGEIF(C105:C116,\">0\",X105:X116),\nIF(FORECAST($C101,X$105:X$116,$C$105:$C$116)<0,0,\nIF(FORECAST($C101,X$105:X$116,$C$105:$C$116)>100,100,\nFORECAST($C101,X$105:X$116,$C$105:$C$116))))","v":99.303281302275309},null,null,null,{"$f":"IF(MAX(C105:C116)-MIN(C105:C116)<5,AVERAGEIF(C105:C116,\">0\",AB105:AB116),\nIF(FORECAST($C101,AB$105:AB$116,$C$105:$C$116)<0,0,\nIF(FORECAST($C101,AB$105:AB$116,$C$105:$C$116)>100,100,\nFORECAST($C101,AB$105:AB$116,$C$105:$C$116))))","v":0}]
[null,null,{"$f":"MaxRegYear(C100,C105:C116)","v":2015},{"$f":"IF(MAX(C105:C116)-MIN(C105:C116)<5,AVERAGEIF(C105:C116,\">0\",D105:D116),\nIF(FORECAST($C102,D$105:D$116,$C$105:$C$116)<0,0,\nIF(FORECAST($C102,D$105:D$116,$C$105:$C$116)>100,100,\nFORECAST($C102,D$105:D$116,$C$105:$C$116))))","v":98.864814388438191},null,null,null,{"$f":"IF(MAX(C105:C116)-MIN(C105:C116)<5,AVERAGEIF(C105:C116,\">0\",H105:H116),\nIF(FORECAST($C102,H$105:H$116,$C$105:$C$116)<0,0,\nIF(FORECAST($C102,H$105:H$116,$C$105:$C$116)>100,100,\nFORECAST($C102,H$105:H$116,$C$105:$C$116))))","v":0},{"$f":"IF(MAX(C105:C116)-MIN(C105:C116)<5,AVERAGEIF(C105:C116,\">0\",I105:I116),\nIF(FORECAST($C102,I$105:I$116,$C$105:$C$116)<0,0,\nIF(FORECAST($C102,I$105:I$116,$C$105:$C$116)>100,100,\nFORECAST($C102,I$105:I$116,$C$105:$C$116))))","v":99.496977038093434},null,null,null,{"$f":"IF(MAX(C105:C116)-MIN(C105:C116)<5,AVERAGEIF(C105:C116,\">0\",M105:M116),\nIF(FORECAST($C102,M$105:M$116,$C$105:$C$116)<0,0,\nIF(FORECAST($C102,M$105:M$116,$C$105:$C$116)>100,100,\nFORECAST($C102,M$105:M$116,$C$105:$C$116))))","v":0},{"$f":"IF(MAX(C105:C116)-MIN(C105:C116)<5,AVERAGEIF(C105:C116,\">0\",N105:N116),\nIF(FORECAST($C102,N$105:N$116,$C$105:$C$116)<0,0,\nIF(FORECAST($C102,N$105:N$116,$C$105:$C$116)>100,100,\nFORECAST($C102,N$105:N$116,$C$105:$C$116))))","v":100},null,null,null,{"$f":"IF(MAX(C105:C116)-MIN(C105:C116)<5,AVERAGEIF(C105:C116,\">0\",R105:R116),\nIF(FORECAST($C102,R$105:R$116,$C$105:$C$116)<0,0,\nIF(FORECAST($C102,R$105:R$116,$C$105:$C$116)>100,100,\nFORECAST($C102,R$105:R$116,$C$105:$C$116))))","v":0},{"$f":"IF(MAX(C105:C116)-MIN(C105:C116)<5,AVERAGEIF(C105:C116,\">0\",S105:S116),\nIF(FORECAST($C102,S$105:S$116,$C$105:$C$116)<0,0,\nIF(FORECAST($C102,S$105:S$116,$C$105:$C$116)>100,100,\nFORECAST($C102,S$105:S$116,$C$105:$C$116))))","v":99.976278734672889},null,null,null,{"$f":"IF(MAX(C105:C116)-MIN(C105:C116)<5,AVERAGEIF(C105:C116,\">0\",W105:W116),\nIF(FORECAST($C102,W$105:W$116,$C$105:$C$116)<0,0,\nIF(FORECAST($C102,W$105:W$116,$C$105:$C$116)>100,100,\nFORECAST($C102,W$105:W$116,$C$105:$C$116))))","v":0},{"$f":"IF(MAX(C105:C116)-MIN(C105:C116)<5,AVERAGEIF(C105:C116,\">0\",X105:X116),\nIF(FORECAST($C102,X$105:X$116,$C$105:$C$116)<0,0,\nIF(FORECAST($C102,X$105:X$116,$C$105:$C$116)>100,100,\nFORECAST($C102,X$105:X$116,$C$105:$C$116))))","v":99.696417905129891},null,null,null,{"$f":"IF(MAX(C105:C116)-MIN(C105:C116)<5,AVERAGEIF(C105:C116,\">0\",AB105:AB116),\nIF(FORECAST($C102,AB$105:AB$116,$C$105:$C$116)<0,0,\nIF(FORECAST($C102,AB$105:AB$116,$C$105:$C$116)>100,100,\nFORECAST($C102,AB$105:AB$116,$C$105:$C$116))))","v":0.43169336004777392}]
[]
[null,"Survey","Year","Improved","% Improved\n< = 30min",null,null,"Surface water","Improved","% Improved\n< = 30min",null,null,"Surface water","Improved","% Improved\n< = 30min",null,null,"Surface water","Improved","% Improved\n< = 30min",null,null,"Surface water","Improved","% Improved\n< = 30min",null,null,"Surface water"]
[null,"WHS03",2003,{"$f":"IF(ISERROR(INDIRECT(CONCATENATE($B105,\"!C16\"))),\"\",INDIRECT(CONCATENATE($B105,\"!C16\")))","v":99.228030001445973},{"$f":"IF(ISERROR(INDIRECT(CONCATENATE($B105,\"!C23\"))),\"\",INDIRECT(CONCATENATE($B105,\"!C23\")))","v":97.53030945001538},null,null,{"$f":"IF(ISERROR(INDIRECT(CONCATENATE($B105,\"!C21\"))),\"\",INDIRECT(CONCATENATE($B105,\"!C21\")))","v":0},{"$f":"IF(ISERROR(INDIRECT(CONCATENATE($B105,\"!D16\"))),\"\",INDIRECT(CONCATENATE($B105,\"!D16\")))","v":99.565722933952046},{"$f":"IF(ISERROR(INDIRECT(CONCATENATE($B105,\"!D23\"))),\"\",INDIRECT(CONCATENATE($B105,\"!D23\")))","v":100},null,null,{"$f":"IF(ISERROR(INDIRECT(CONCATENATE($B105,\"!D21\"))),\"\",INDIRECT(CONCATENATE($B105,\"!D21\")))","v":0},{"$f":"IF(ISERROR(INDIRECT(CONCATENATE($B105,\"!E16\"))),\"\",INDIRECT(CONCATENATE($B105,\"!E16\")))","v":99.597713270725322},{"$f":"IF(ISERROR(INDIRECT(CONCATENATE($B105,\"!E23\"))),\"\",INDIRECT(CONCATENATE($B105,\"!E23\")))","v":100},null,null,{"$f":"IF(ISERROR(INDIRECT(CONCATENATE($B105,\"!E21\"))),\"\",INDIRECT(CONCATENATE($B105,\"!E21\")))","v":0},{"$f":"IF(ISERROR(INDIRECT(CONCATENATE($B105,\"!F16\"))),\"\",INDIRECT(CONCATENATE($B105,\"!F16\")))","v":99.83989213335532},{"$f":"IF(ISERROR(INDIRECT(CONCATENATE($B105,\"!F23\"))),\"\",INDIRECT(CONCATENATE($B105,\"!F23\")))","v":100},null,null,{"$f":"IF(ISERROR(INDIRECT(CONCATENATE($B105,\"!F21\"))),\"\",INDIRECT(CONCATENATE($B105,\"!F21\")))","v":0},{"$f":"IF(ISERROR(INDIRECT(CONCATENATE($B105,\"!G16\"))),\"\",INDIRECT(CONCATENATE($B105,\"!G16\")))","v":99.359443674111674},{"$f":"IF(ISERROR(INDIRECT(CONCATENATE($B105,\"!G23\"))),\"\",INDIRECT(CONCATENATE($B105,\"!G23\")))","v":100},null,null,{"$f":"IF(ISERROR(INDIRECT(CONCATENATE($B105,\"!G221\"))),\"\",INDIRECT(CONCATENATE($B105,\"!G21\")))","v":0}]
[null,"MICS13",2013,98.925350323939483,100,null,null,0,99.508434687403195,100,null,null,0,99.979233256817224,99.782375621566715,null,null,0,99.953547634453301,100,null,null,0,99.640255533293526,100,null,null,0.35974446670648352]
[null,null,null,"","",null,null,"","","",null,null,"","","",null,null,"","","",null,null,"","","",null,null,""]
[null,null,null,"","",null,null,"","","",null,null,"","","",null,null,"","","",null,null,"","","",null,null,""]
[null,null,null,"","",null,null,"","","",null,null,"","","",null,null,"","","",null,null,"","","",null,null,""]
[null,null,null,"","",null,null,"","","",null,null,"","","",null,null,"","","",null,null,"","","",null,null,""]
[null,null,null,{"$f":"IF(ISERROR(INDIRECT(CONCATENATE($B111,\"!C16\"))),\"\",INDIRECT(CONCATENATE($B111,\"!C16\")))","v":""},{"$f":"IF(ISERROR(INDIRECT(CONCATENATE($B111,\"!C23\"))),\"\",INDIRECT(CONCATENATE($B111,\"!C23\")))","v":""},null,null,{"$f":"IF(ISERROR(INDIRECT(CONCATENATE($B111,\"!C21\"))),\"\",INDIRECT(CONCATENATE($B111,\"!C21\")))","v":""},{"$f":"IF(ISERROR(INDIRECT(CONCATENATE($B111,\"!D16\"))),\"\",INDIRECT(CONCATENATE($B111,\"!D16\")))","v":""},{"$f":"IF(ISERROR(INDIRECT(CONCATENATE($B111,\"!D23\"))),\"\",INDIRECT(CONCATENATE($B111,\"!D23\")))","v":""},null,null,{"$f":"IF(ISERROR(INDIRECT(CONCATENATE($B111,\"!D21\"))),\"\",INDIRECT(CONCATENATE($B111,\"!D21\")))","v":""},{"$f":"IF(ISERROR(INDIRECT(CONCATENATE($B111,\"!E16\"))),\"\",INDIRECT(CONCATENATE($B111,\"!E16\")))","v":""},{"$f":"IF(ISERROR(INDIRECT(CONCATENATE($B111,\"!E23\"))),\"\",INDIRECT(CONCATENATE($B111,\"!E23\")))","v":""},null,null,{"$f":"IF(ISERROR(INDIRECT(CONCATENATE($B111,\"!E21\"))),\"\",INDIRECT(CONCATENATE($B111,\"!E21\")))","v":""},{"$f":"IF(ISERROR(INDIRECT(CONCATENATE($B111,\"!F16\"))),\"\",INDIRECT(CONCATENATE($B111,\"!F16\")))","v":""},{"$f":"IF(ISERROR(INDIRECT(CONCATENATE($B111,\"!F23\"))),\"\",INDIRECT(CONCATENATE($B111,\"!F23\")))","v":""},null,null,{"$f":"IF(ISERROR(INDIRECT(CONCATENATE($B111,\"!F21\"))),\"\",INDIRECT(CONCATENATE($B111,\"!F21\")))","v":""},{"$f":"IF(ISERROR(INDIRECT(CONCATENATE($B111,\"!G16\"))),\"\",INDIRECT(CONCATENATE($B111,\"!G16\")))","v":""},{"$f":"IF(ISERROR(INDIRECT(CONCATENATE($B111,\"!G23\"))),\"\",INDIRECT(CONCATENATE($B111,\"!G23\")))","v":""},null,null,{"$f":"IF(ISERROR(INDIRECT(CONCATENATE($B111,\"!G221\"))),\"\",INDIRECT(CONCATENATE($B111,\"!G21\")))","v":""}]
[null,null,null,{"$f":"IF(ISERROR(INDIRECT(CONCATENATE($B112,\"!C16\"))),\"\",INDIRECT(CONCATENATE($B112,\"!C16\")))","v":""},{"$f":"IF(ISERROR(INDIRECT(CONCATENATE($B112,\"!C23\"))),\"\",INDIRECT(CONCATENATE($B112,\"!C23\")))","v":""},null,null,{"$f":"IF(ISERROR(INDIRECT(CONCATENATE($B112,\"!C21\"))),\"\",INDIRECT(CONCATENATE($B112,\"!C21\")))","v":""},{"$f":"IF(ISERROR(INDIRECT(CONCATENATE($B112,\"!D16\"))),\"\",INDIRECT(CONCATENATE($B112,\"!D16\")))","v":""},{"$f":"IF(ISERROR(INDIRECT(CONCATENATE($B112,\"!D23\"))),\"\",INDIRECT(CONCATENATE($B112,\"!D23\")))","v":""},null,null,{"$f":"IF(ISERROR(INDIRECT(CONCATENATE($B112,\"!D21\"))),\"\",INDIRECT(CONCATENATE($B112,\"!D21\")))","v":""},{"$f":"IF(ISERROR(INDIRECT(CONCATENATE($B112,\"!E16\"))),\"\",INDIRECT(CONCATENATE($B112,\"!E16\")))","v":""},{"$f":"IF(ISERROR(INDIRECT(CONCATENATE($B112,\"!E23\"))),\"\",INDIRECT(CONCATENATE($B112,\"!E23\")))","v":""},null,null,{"$f":"IF(ISERROR(INDIRECT(CONCATENATE($B112,\"!E21\"))),\"\",INDIRECT(CONCATENATE($B112,\"!E21\")))","v":""},{"$f":"IF(ISERROR(INDIRECT(CONCATENATE($B112,\"!F16\"))),\"\",INDIRECT(CONCATENATE($B112,\"!F16\")))","v":""},{"$f":"IF(ISERROR(INDIRECT(CONCATENATE($B112,\"!F23\"))),\"\",INDIRECT(CONCATENATE($B112,\"!F23\")))","v":""},null,null,{"$f":"IF(ISERROR(INDIRECT(CONCATENATE($B112,\"!F21\"))),\"\",INDIRECT(CONCATENATE($B112,\"!F21\")))","v":""},{"$f":"IF(ISERROR(INDIRECT(CONCATENATE($B112,\"!G16\"))),\"\",INDIRECT(CONCATENATE($B112,\"!G16\")))","v":""},{"$f":"IF(ISERROR(INDIRECT(CONCATENATE($B112,\"!G23\"))),\"\",INDIRECT(CONCATENATE($B112,\"!G23\")))","v":""},null,null,{"$f":"IF(ISERROR(INDIRECT(CONCATENATE($B112,\"!G221\"))),\"\",INDIRECT(CONCATENATE($B112,\"!G21\")))","v":""}]
[null,null,null,"","",null,null,"","","",null,null,"","","",null,null,"","","",null,null,"","","",null,null,""]
[null,null,null,"","",null,null,"","","",null,null,"","","",null,null,"","","",null,null,"","","",null,null,""]
[null,null,null,"","",null,null,"","","",null,null,"","","",null,null,"","","",null,null,"","","",null,null,""]
[null,null,null,"","",null,null,"","","",null,null,"","","",null,null,"","","",null,null,"","","",null,null,""]
[]
[null,{"$f":"CONCATENATE(\"National use of drinking water sources, \",C99,\"–\",C100)","v":"National use of drinking water sources, 2000–2019"},null,null,null,null,null,null,null,null,null,null,null,null,null,null,null,null,"Data points used for regression"]
[]
[]
[]
[]
[]
[]
[]
[]
[]
[]
[]
[]
[]
[]
[]
[]
[]
[]
[]
[]
[]
[]
[]
[]
[]
[]
[]
[]
[]
[]
[]
[]
[]
[]
[null,null,null,null,{"$f":"IF(ISERROR(INDIRECT(CONCATENATE($B153,\"!M18\"))),\"\",INDIRECT(CONCATENATE($B153,\"!M18\")))","v":""},{"$f":"IF(ISERROR(INDIRECT(CONCATENATE($B153,\"!M19\"))),\"\",INDIRECT(CONCATENATE($B153,\"!M19\")))","v":""},{"$f":"IF(ISERROR(INDIRECT(CONCATENATE($B153,\"!M20\"))),\"\",INDIRECT(CONCATENATE($B153,\"!M20\")))","v":""},{"$f":"IF(ISERROR(INDIRECT(CONCATENATE($B153,\"!M21\"))),\"\",INDIRECT(CONCATENATE($B153,\"!M21\")))","v":""},null,{"$f":"IF(ISERROR(INDIRECT(CONCATENATE($B153,\"!N18\"))),\"\",INDIRECT(CONCATENATE($B153,\"!N18\")))","v":""},{"$f":"IF(ISERROR(INDIRECT(CONCATENATE($B153,\"!N19\"))),\"\",INDIRECT(CONCATENATE($B153,\"!N19\")))","v":""},{"$f":"IF(ISERROR(INDIRECT(CONCATENATE($B153,\"!N20\"))),\"\",INDIRECT(CONCATENATE($B153,\"!N20\")))","v":""},{"$f":"IF(ISERROR(INDIRECT(CONCATENATE($B153,\"!N21\"))),\"\",INDIRECT(CONCATENATE($B153,\"!N21\")))","v":""},null,{"$f":"IF(ISERROR(INDIRECT(CONCATENATE($B153,\"!O18\"))),\"\",INDIRECT(CONCATENATE($B153,\"!O18\")))","v":""},{"$f":"IF(ISERROR(INDIRECT(CONCATENATE($B153,\"!O19\"))),\"\",INDIRECT(CONCATENATE($B153,\"!O19\")))","v":""},{"$f":"IF(ISERROR(INDIRECT(CONCATENATE($B153,\"!O20\"))),\"\",INDIRECT(CONCATENATE($B153,\"!O20\")))","v":""},{"$f":"IF(ISERROR(INDIRECT(CONCATENATE($B153,\"!O21\"))),\"\",INDIRECT(CONCATENATE($B153,\"!O21\")))","v":""},null,{"$f":"IF(ISERROR(INDIRECT(CONCATENATE($B153,\"!P18\"))),\"\",INDIRECT(CONCATENATE($B153,\"!P18\")))","v":""},{"$f":"IF(ISERROR(INDIRECT(CONCATENATE($B153,\"!P19\"))),\"\",INDIRECT(CONCATENATE($B153,\"!P19\")))","v":""},{"$f":"IF(ISERROR(INDIRECT(CONCATENATE($B153,\"!P20\"))),\"\",INDIRECT(CONCATENATE($B153,\"!P20\")))","v":""},{"$f":"IF(ISERROR(INDIRECT(CONCATENATE($B153,\"!P21\"))),\"\",INDIRECT(CONCATENATE($B153,\"!P21\")))","v":""},null,{"$f":"IF(ISERROR(INDIRECT(CONCATENATE($B153,\"!Q18\"))),\"\",INDIRECT(CONCATENATE($B153,\"!Q18\")))","v":""},{"$f":"IF(ISERROR(INDIRECT(CONCATENATE($B153,\"!Q19\"))),\"\",INDIRECT(CONCATENATE($B153,\"!Q19\")))","v":""},{"$f":"IF(ISERROR(INDIRECT(CONCATENATE($B153,\"!Q20\"))),\"\",INDIRECT(CONCATENATE($B153,\"!Q20\")))","v":""},{"$f":"IF(ISERROR(INDIRECT(CONCATENATE($B153,\"!Q21\"))),\"\",INDIRECT(CONCATENATE($B153,\"!Q1\")))","v":""}]
[null,null,null,null,"","","","",null,"","","","",null,"","","","",null,"","","","",null,"","","",""]
[null,null,null,null,"","","","",null,"","","","",null,"","","","",null,"","","","",null,"","","",""]
[null,null,null,null,"","","","",null,"","","","",null,"","","","",null,"","","","",null,"","","",""]
[null,null,null,null,"","","","",null,"","","","",null,"","","","",null,"","","","",null,"","","",""]
[null,null,null,null,"","","","",null,"","","","",null,"","","","",null,"","","","",null,"","","",""]
[]
[]
[]
[]
[]
[]
[]
[]
[]
[]
[]
[]
[]
[]
[]
[]
[]
[]
[]
[]
[]
[]
[]
[]
[]
[]
[]
[]
[]
[]
[]
[]
[]
[]
[]
[]
[]
[]
["URBAN",null,null,"Poorest",null,null,null,null,"Poor",null,null,null,null,"Middle",null,null,null,null,"Rich",null,null,null,null,"Richest"]
[null,null,null,"Improved","Basic","Limited","Unimproved","Surface water","Improved","Basic","Limited","Unimproved","Surface water","Improved","Basic","Limited","Unimproved","Surface water","Improved","Basic","Limited","Unimproved","Surface water","Improved","Basic","Limited","Unimproved","Surface water"]
["Forecast period:",null,{"$f":"MinBase(C205:C216)","v":2000},{"$f":"IF((D201+H201)>100,D201*100/(D201+H201),D201)","v":98.783612277823011},{"$f":"D199*AVERAGEIF(E205:E216,\">0\")/100","v":98.783612277823011},{"$f":"D199*(100-AVERAGEIF(E205:E216,\">0\"))/100","v":0},{"$f":"100-(E199+F199+H199)","v":1.2163877221769894},{"$f":"IF((D201+H201)>100,H201*100/(D201+H201),H201)","v":0},{"$f":"IF((I201+M201)>100,I201*100/(I201+M201),I201)","v":99.24970139787834},{"$f":"I199*AVERAGEIF(J205:J216,\">0\")/100","v":99.24970139787834},{"$f":"I199*(100-AVERAGEIF(J205:J216,\">0\"))/100","v":0},{"$f":"100-(J199+K199+M199)","v":0.75029860212166},{"$f":"IF((I201+M201)>100,M201*100/(I201+M201),M201)","v":0},{"$f":"IF((N201+R201)>100,N201*100/(N201+R201),N201)","v":99.751350495604044},{"$f":"N199*AVERAGEIF(O205:O216,\">0\")/100","v":99.632434066275096},{"$f":"N199*(100-AVERAGEIF(O205:O216,\">0\"))/100","v":0.11891642932894406},{"$f":"100-(O199+P199+R199)","v":0.24864950439595646},{"$f":"IF((N201+R201)>100,R201*100/(N201+R201),R201)","v":0},{"$f":"IF((S201+W201)>100,S201*100/(S201+W201),S201)","v":99.502636722407743},{"$f":"S199*AVERAGEIF(T205:T216,\">0\")/100","v":99.502636722407757},{"$f":"S199*(100-AVERAGEIF(T205:T216,\">0\"))/100","v":0},{"$f":"100-(T199+U199+W199)","v":0.49736327759224253},{"$f":"IF((S201+W201)>100,W201*100/(S201+W201),W201)","v":0},{"$f":"IF((X201+AB201)>100,X201*100/(X201+AB201),X201)","v":99.332070715032231},{"$f":"X199*AVERAGEIF(Y205:Y216,\">0\")/100","v":99.332070715032216},{"$f":"X199*(100-AVERAGEIF(Y205:Y216,\">0\"))/100","v":0},{"$f":"100-(Y199+Z199+AB199)","v":0.66792928496778359},{"$f":"IF((X201+AB201)>100,AB201*100/(X201+AB201),AB201)","v":0}]
[null,null,{"$f":"MaxTarget(C205:C216)","v":2019},{"$f":"IF((D202+H202)>100,D202*100/(D202+H202),D202)","v":100},{"$f":"D200*AVERAGEIF(E205:E216,\">0\")/100","v":100},{"$f":"D200*(100-AVERAGEIF(E205:E216,\">0\"))/100","v":0},{"$f":"100-(E200+F200+H200)","v":0},{"$f":"IF((D202+H202)>100,H202*100/(D202+H202),H202)","v":0},{"$f":"IF((I202+M202)>100,I202*100/(I202+M202),I202)","v":100},{"$f":"I200*AVERAGEIF(J205:J216,\">0\")/100","v":100},{"$f":"I200*(100-AVERAGEIF(J205:J216,\">0\"))/100","v":0},{"$f":"100-(J200+K200+M200)","v":0},{"$f":"IF((I202+M202)>100,M202*100/(I202+M202),M202)","v":0},{"$f":"IF((N202+R202)>100,N202*100/(N202+R202),N202)","v":100},{"$f":"N200*AVERAGEIF(O205:O216,\">0\")/100","v":99.880787148506641},{"$f":"N200*(100-AVERAGEIF(O205:O216,\">0\"))/100","v":0.11921285149335858},{"$f":"100-(O200+P200+R200)","v":0},{"$f":"IF((N202+R202)>100,R202*100/(N202+R202),R202)","v":0},{"$f":"IF((S202+W202)>100,S202*100/(S202+W202),S202)","v":100},{"$f":"S200*AVERAGEIF(T205:T216,\">0\")/100","v":100},{"$f":"S200*(100-AVERAGEIF(T205:T216,\">0\"))/100","v":0},{"$f":"100-(T200+U200+W200)","v":0},{"$f":"IF((S202+W202)>100,W202*100/(S202+W202),W202)","v":0},{"$f":"IF((X202+AB202)>100,X202*100/(X202+AB202),X202)","v":99.525704590231811},{"$f":"X200*AVERAGEIF(Y205:Y216,\">0\")/100","v":99.525704590231811},{"$f":"X200*(100-AVERAGEIF(Y205:Y216,\">0\"))/100","v":0},{"$f":"100-(Y200+Z200+AB200)","v":0},{"$f":"IF((X202+AB202)>100,AB202*100/(X202+AB202),AB202)","v":0.47429540976819723}]
["Regression period:",null,{"$f":"MinRegYear(C199,C205:C216)","v":2001},{"$f":"IF(MAX(C205:C216)-MIN(C205:C216)<5,AVERAGEIF(C205:C216,\">0\",D205:D216),\nIF(FORECAST($C201,D$205:D$216,$C$205:$C$216)<0,0,\nIF(FORECAST($C201,D$205:D$216,$C$205:$C$216)>100,100,\nFORECAST($C201,D$205:D$216,$C$205:$C$216))))","v":98.783612277823011},null,null,null,{"$f":"IF(MAX(C205:C216)-MIN(C205:C216)<5,AVERAGEIF(C205:C216,\">0\",H205:H216),\nIF(FORECAST($C201,H$205:H$216,$C$205:$C$216)<0,0,\nIF(FORECAST($C201,H$205:H$216,$C$205:$C$216)>100,100,\nFORECAST($C201,H$205:H$216,$C$205:$C$216))))","v":0},{"$f":"IF(MAX(C205:C216)-MIN(C205:C216)<5,AVERAGEIF(C205:C216,\">0\",I205:I216),\nIF(FORECAST($C201,I$205:I$216,$C$205:$C$216)<0,0,\nIF(FORECAST($C201,I$205:I$216,$C$205:$C$216)>100,100,\nFORECAST($C201,I$205:I$216,$C$205:$C$216))))","v":99.24970139787834},null,null,null,{"$f":"IF(MAX(C205:C216)-MIN(C205:C216)<5,AVERAGEIF(C205:C216,\">0\",M205:M216),\nIF(FORECAST($C201,M$205:M$216,$C$205:$C$216)<0,0,\nIF(FORECAST($C201,M$205:M$216,$C$205:$C$216)>100,100,\nFORECAST($C201,M$205:M$216,$C$205:$C$216))))","v":0},{"$f":"IF(MAX(C205:C216)-MIN(C205:C216)<5,AVERAGEIF(C205:C216,\">0\",N205:N216),\nIF(FORECAST($C201,N$205:N$216,$C$205:$C$216)<0,0,\nIF(FORECAST($C201,N$205:N$216,$C$205:$C$216)>100,100,\nFORECAST($C201,N$205:N$216,$C$205:$C$216))))","v":99.751350495604044},null,null,null,{"$f":"IF(MAX(C205:C216)-MIN(C205:C216)<5,AVERAGEIF(C205:C216,\">0\",R205:R216),\nIF(FORECAST($C201,R$205:R$216,$C$205:$C$216)<0,0,\nIF(FORECAST($C201,R$205:R$216,$C$205:$C$216)>100,100,\nFORECAST($C201,R$205:R$216,$C$205:$C$216))))","v":0},{"$f":"IF(MAX(C205:C216)-MIN(C205:C216)<5,AVERAGEIF(C205:C216,\">0\",S205:S216),\nIF(FORECAST($C201,S$205:S$216,$C$205:$C$216)<0,0,\nIF(FORECAST($C201,S$205:S$216,$C$205:$C$216)>100,100,\nFORECAST($C201,S$205:S$216,$C$205:$C$216))))","v":99.502636722407743},null,null,null,{"$f":"IF(MAX(C205:C216)-MIN(C205:C216)<5,AVERAGEIF(C205:C216,\">0\",W205:W216),\nIF(FORECAST($C201,W$205:W$216,$C$205:$C$216)<0,0,\nIF(FORECAST($C201,W$205:W$216,$C$205:$C$216)>100,100,\nFORECAST($C201,W$205:W$216,$C$205:$C$216))))","v":0},{"$f":"IF(MAX(C205:C216)-MIN(C205:C216)<5,AVERAGEIF(C205:C216,\">0\",X205:X216),\nIF(FORECAST($C201,X$205:X$216,$C$205:$C$216)<0,0,\nIF(FORECAST($C201,X$205:X$216,$C$205:$C$216)>100,100,\nFORECAST($C201,X$205:X$216,$C$205:$C$216))))","v":99.332070715032231},null,null,null,{"$f":"IF(MAX(C205:C216)-MIN(C205:C216)<5,AVERAGEIF(C205:C216,\">0\",AB205:AB216),\nIF(FORECAST($C201,AB$205:AB$216,$C$205:$C$216)<0,0,\nIF(FORECAST($C201,AB$205:AB$216,$C$205:$C$216)>100,100,\nFORECAST($C201,AB$205:AB$216,$C$205:$C$216))))","v":0}]
[null,null,{"$f":"MaxRegYear(C200,C205:C216)","v":2015},{"$f":"IF(MAX(C205:C216)-MIN(C205:C216)<5,AVERAGEIF(C205:C216,\">0\",D205:D216),\nIF(FORECAST($C202,D$205:D$216,$C$205:$C$216)<0,0,\nIF(FORECAST($C202,D$205:D$216,$C$205:$C$216)>100,100,\nFORECAST($C202,D$205:D$216,$C$205:$C$216))))","v":100},null,null,null,{"$f":"IF(MAX(C205:C216)-MIN(C205:C216)<5,AVERAGEIF(C205:C216,\">0\",H205:H216),\nIF(FORECAST($C202,H$205:H$216,$C$205:$C$216)<0,0,\nIF(FORECAST($C202,H$205:H$216,$C$205:$C$216)>100,100,\nFORECAST($C202,H$205:H$216,$C$205:$C$216))))","v":0},{"$f":"IF(MAX(C205:C216)-MIN(C205:C216)<5,AVERAGEIF(C205:C216,\">0\",I205:I216),\nIF(FORECAST($C202,I$205:I$216,$C$205:$C$216)<0,0,\nIF(FORECAST($C202,I$205:I$216,$C$205:$C$216)>100,100,\nFORECAST($C202,I$205:I$216,$C$205:$C$216))))","v":100},null,null,null,{"$f":"IF(MAX(C205:C216)-MIN(C205:C216)<5,AVERAGEIF(C205:C216,\">0\",M205:M216),\nIF(FORECAST($C202,M$205:M$216,$C$205:$C$216)<0,0,\nIF(FORECAST($C202,M$205:M$216,$C$205:$C$216)>100,100,\nFORECAST($C202,M$205:M$216,$C$205:$C$216))))","v":0},{"$f":"IF(MAX(C205:C216)-MIN(C205:C216)<5,AVERAGEIF(C205:C216,\">0\",N205:N216),\nIF(FORECAST($C202,N$205:N$216,$C$205:$C$216)<0,0,\nIF(FORECAST($C202,N$205:N$216,$C$205:$C$216)>100,100,\nFORECAST($C202,N$205:N$216,$C$205:$C$216))))","v":100},null,null,null,{"$f":"IF(MAX(C205:C216)-MIN(C205:C216)<5,AVERAGEIF(C205:C216,\">0\",R205:R216),\nIF(FORECAST($C202,R$205:R$216,$C$205:$C$216)<0,0,\nIF(FORECAST($C202,R$205:R$216,$C$205:$C$216)>100,100,\nFORECAST($C202,R$205:R$216,$C$205:$C$216))))","v":0},{"$f":"IF(MAX(C205:C216)-MIN(C205:C216)<5,AVERAGEIF(C205:C216,\">0\",S205:S216),\nIF(FORECAST($C202,S$205:S$216,$C$205:$C$216)<0,0,\nIF(FORECAST($C202,S$205:S$216,$C$205:$C$216)>100,100,\nFORECAST($C202,S$205:S$216,$C$205:$C$216))))","v":100},null,null,null,{"$f":"IF(MAX(C205:C216)-MIN(C205:C216)<5,AVERAGEIF(C205:C216,\">0\",W205:W216),\nIF(FORECAST($C202,W$205:W$216,$C$205:$C$216)<0,0,\nIF(FORECAST($C202,W$205:W$216,$C$205:$C$216)>100,100,\nFORECAST($C202,W$205:W$216,$C$205:$C$216))))","v":0},{"$f":"IF(MAX(C205:C216)-MIN(C205:C216)<5,AVERAGEIF(C205:C216,\">0\",X205:X216),\nIF(FORECAST($C202,X$205:X$216,$C$205:$C$216)<0,0,\nIF(FORECAST($C202,X$205:X$216,$C$205:$C$216)>100,100,\nFORECAST($C202,X$205:X$216,$C$205:$C$216))))","v":99.649626856015161},null,null,null,{"$f":"IF(MAX(C205:C216)-MIN(C205:C216)<5,AVERAGEIF(C205:C216,\">0\",AB205:AB216),\nIF(FORECAST($C202,AB$205:AB$216,$C$205:$C$216)<0,0,\nIF(FORECAST($C202,AB$205:AB$216,$C$205:$C$216)>100,100,\nFORECAST($C202,AB$205:AB$216,$C$205:$C$216))))","v":0.47488596837887087}]
[]
[null,"Survey","Year","Improved","% Improved\n< = 30min",null,null,"Surface water","Improved","% Improved\n< = 30min",null,null,"Surface water","Improved","% Improved\n< = 30min",null,null,"Surface water","Improved","% Improved\n< = 30min",null,null,"Surface water","Improved","% Improved\n< = 30min",null,null,"Surface water"]
[null,"WHS03",2003,{"$f":"IF(ISERROR(INDIRECT(CONCATENATE($B205,\"!H16\"))),\"\",INDIRECT(CONCATENATE($B205,\"!H16\")))","v":98.971244373347105},{"$f":"IF(ISERROR(INDIRECT(CONCATENATE($B205,\"!H23\"))),\"\",INDIRECT(CONCATENATE($B205,\"!H23\")))","v":100},null,null,{"$f":"IF(ISERROR(INDIRECT(CONCATENATE($B205,\"!H21\"))),\"\",INDIRECT(CONCATENATE($B205,\"!H21\")))","v":0},{"$f":"IF(ISERROR(INDIRECT(CONCATENATE($B205,\"!I16\"))),\"\",INDIRECT(CONCATENATE($B205,\"!I16\")))","v":99.374751164898626},{"$f":"IF(ISERROR(INDIRECT(CONCATENATE($B205,\"!I23\"))),\"\",INDIRECT(CONCATENATE($B205,\"!I23\")))","v":100},null,null,{"$f":"IF(ISERROR(INDIRECT(CONCATENATE($B205,\"!I21\"))),\"\",INDIRECT(CONCATENATE($B205,\"!I21\")))","v":0},{"$f":"IF(ISERROR(INDIRECT(CONCATENATE($B205,\"!J16\"))),\"\",INDIRECT(CONCATENATE($B205,\"!J16\")))","v":99.792792079670036},{"$f":"IF(ISERROR(INDIRECT(CONCATENATE($B205,\"!J23\"))),\"\",INDIRECT(CONCATENATE($B205,\"!J23\")))","v":100},null,null,{"$f":"IF(ISERROR(INDIRECT(CONCATENATE($B205,\"!J21\"))),\"\",INDIRECT(CONCATENATE($B205,\"!J21\")))","v":0},{"$f":"IF(ISERROR(INDIRECT(CONCATENATE($B205,\"!K16\"))),\"\",INDIRECT(CONCATENATE($B205,\"!K16\")))","v":99.585530602006457},{"$f":"IF(ISERROR(INDIRECT(CONCATENATE($B205,\"!K23\"))),\"\",INDIRECT(CONCATENATE($B205,\"!K23\")))","v":100},null,null,{"$f":"IF(ISERROR(INDIRECT(CONCATENATE($B205,\"!K21\"))),\"\",INDIRECT(CONCATENATE($B205,\"!K21\")))","v":0},{"$f":"IF(ISERROR(INDIRECT(CONCATENATE($B205,\"!L16\"))),\"\",INDIRECT(CONCATENATE($B205,\"!L16\")))","v":99.3774358780298},{"$f":"IF(ISERROR(INDIRECT(CONCATENATE($B205,\"!L23\"))),\"\",INDIRECT(CONCATENATE($B205,\"!L23\")))","v":100},null,null,{"$f":"IF(ISERROR(INDIRECT(CONCATENATE($B205,\"!L221\"))),\"\",INDIRECT(CONCATENATE($B205,\"!L21\")))","v":0}]
[null,"MICS13",2013,99.909404850967505,100,null,null,0,100,100,null,null,0,100,99.761574297013297,null,null,0,100,100,null,null,0,99.604261693017605,100,null,null,0.39573830698239837]
[null,null,null,"","",null,null,"","","",null,null,"","","",null,null,"","","",null,null,"","","",null,null,""]
[null,null,null,"","",null,null,"","","",null,null,"","","",null,null,"","","",null,null,"","","",null,null,""]
[null,null,null,"","",null,null,"","","",null,null,"","","",null,null,"","","",null,null,"","","",null,null,""]
[null,null,null,"","",null,null,"","","",null,null,"","","",null,null,"","","",null,null,"","","",null,null,""]
[null,null,null,"","",null,null,"","","",null,null,"","","",null,null,"","","",null,null,"","","",null,null,""]
[null,null,null,"","",null,null,"","","",null,null,"","","",null,null,"","","",null,null,"","","",null,null,""]
[null,null,null,"","",null,null,"","","",null,null,"","","",null,null,"","","",null,null,"","","",null,null,""]
[null,null,null,"","",null,null,"","","",null,null,"","","",null,null,"","","",null,null,"","","",null,null,""]
[null,null,null,"","",null,null,"","","",null,null,"","","",null,null,"","","",null,null,"","","",null,null,""]
[null,null,null,"","",null,null,"","","",null,null,"","","",null,null,"","","",null,null,"","","",null,null,""]
[]
[null,{"$f":"CONCATENATE(\"Urban use of drinking water sources,  \",C199,\"–\",C200)","v":"Urban use of drinking water sources,  2000–2019"},null,null,null,null,null,null,null,null,null,null,null,null,null,null,null,null,"Data points used for regression"]
[]
[]
[]
[]
[]
[]
[]
[]
[]
[]
[]
[]
[]
[]
[]
[]
[]
[]
[]
[]
[]
[]
[]
[]
[]
[]
[]
[]
[]
[]
[]
[]
[]
[]
[null,null,null,null,{"$f":"IF(ISERROR(INDIRECT(CONCATENATE($B253,\"!M18\"))),\"\",INDIRECT(CONCATENATE($B253,\"!M18\")))","v":""},{"$f":"IF(ISERROR(INDIRECT(CONCATENATE($B253,\"!M19\"))),\"\",INDIRECT(CONCATENATE($B253,\"!M19\")))","v":""},{"$f":"IF(ISERROR(INDIRECT(CONCATENATE($B253,\"!M20\"))),\"\",INDIRECT(CONCATENATE($B253,\"!M20\")))","v":""},{"$f":"IF(ISERROR(INDIRECT(CONCATENATE($B253,\"!M21\"))),\"\",INDIRECT(CONCATENATE($B253,\"!M21\")))","v":""},null,{"$f":"IF(ISERROR(INDIRECT(CONCATENATE($B253,\"!N18\"))),\"\",INDIRECT(CONCATENATE($B253,\"!N18\")))","v":""},{"$f":"IF(ISERROR(INDIRECT(CONCATENATE($B253,\"!N19\"))),\"\",INDIRECT(CONCATENATE($B253,\"!N19\")))","v":""},{"$f":"IF(ISERROR(INDIRECT(CONCATENATE($B253,\"!N20\"))),\"\",INDIRECT(CONCATENATE($B253,\"!N20\")))","v":""},{"$f":"IF(ISERROR(INDIRECT(CONCATENATE($B253,\"!N21\"))),\"\",INDIRECT(CONCATENATE($B253,\"!N21\")))","v":""},null,{"$f":"IF(ISERROR(INDIRECT(CONCATENATE($B253,\"!O18\"))),\"\",INDIRECT(CONCATENATE($B253,\"!O18\")))","v":""},{"$f":"IF(ISERROR(INDIRECT(CONCATENATE($B253,\"!O19\"))),\"\",INDIRECT(CONCATENATE($B253,\"!O19\")))","v":""},{"$f":"IF(ISERROR(INDIRECT(CONCATENATE($B253,\"!O20\"))),\"\",INDIRECT(CONCATENATE($B253,\"!O20\")))","v":""},{"$f":"IF(ISERROR(INDIRECT(CONCATENATE($B253,\"!O21\"))),\"\",INDIRECT(CONCATENATE($B253,\"!O21\")))","v":""},null,{"$f":"IF(ISERROR(INDIRECT(CONCATENATE($B253,\"!P18\"))),\"\",INDIRECT(CONCATENATE($B253,\"!P18\")))","v":""},{"$f":"IF(ISERROR(INDIRECT(CONCATENATE($B253,\"!P19\"))),\"\",INDIRECT(CONCATENATE($B253,\"!P19\")))","v":""},{"$f":"IF(ISERROR(INDIRECT(CONCATENATE($B253,\"!P20\"))),\"\",INDIRECT(CONCATENATE($B253,\"!P20\")))","v":""},{"$f":"IF(ISERROR(INDIRECT(CONCATENATE($B253,\"!P21\"))),\"\",INDIRECT(CONCATENATE($B253,\"!P21\")))","v":""},null,{"$f":"IF(ISERROR(INDIRECT(CONCATENATE($B253,\"!Q18\"))),\"\",INDIRECT(CONCATENATE($B253,\"!Q18\")))","v":""},{"$f":"IF(ISERROR(INDIRECT(CONCATENATE($B253,\"!Q19\"))),\"\",INDIRECT(CONCATENATE($B253,\"!Q19\")))","v":""},{"$f":"IF(ISERROR(INDIRECT(CONCATENATE($B253,\"!Q20\"))),\"\",INDIRECT(CONCATENATE($B253,\"!Q20\")))","v":""},{"$f":"IF(ISERROR(INDIRECT(CONCATENATE($B253,\"!Q21\"))),\"\",INDIRECT(CONCATENATE($B253,\"!Q1\")))","v":""}]
[null,null,null,null,{"$f":"IF(ISERROR(INDIRECT(CONCATENATE($B254,\"!M18\"))),\"\",INDIRECT(CONCATENATE($B254,\"!M18\")))","v":""},{"$f":"IF(ISERROR(INDIRECT(CONCATENATE($B254,\"!M19\"))),\"\",INDIRECT(CONCATENATE($B254,\"!M19\")))","v":""},{"$f":"IF(ISERROR(INDIRECT(CONCATENATE($B254,\"!M20\"))),\"\",INDIRECT(CONCATENATE($B254,\"!M20\")))","v":""},{"$f":"IF(ISERROR(INDIRECT(CONCATENATE($B254,\"!M21\"))),\"\",INDIRECT(CONCATENATE($B254,\"!M21\")))","v":""},null,{"$f":"IF(ISERROR(INDIRECT(CONCATENATE($B254,\"!N18\"))),\"\",INDIRECT(CONCATENATE($B254,\"!N18\")))","v":""},{"$f":"IF(ISERROR(INDIRECT(CONCATENATE($B254,\"!N19\"))),\"\",INDIRECT(CONCATENATE($B254,\"!N19\")))","v":""},{"$f":"IF(ISERROR(INDIRECT(CONCATENATE($B254,\"!N20\"))),\"\",INDIRECT(CONCATENATE($B254,\"!N20\")))","v":""},{"$f":"IF(ISERROR(INDIRECT(CONCATENATE($B254,\"!N21\"))),\"\",INDIRECT(CONCATENATE($B254,\"!N21\")))","v":""},null,{"$f":"IF(ISERROR(INDIRECT(CONCATENATE($B254,\"!O18\"))),\"\",INDIRECT(CONCATENATE($B254,\"!O18\")))","v":""},{"$f":"IF(ISERROR(INDIRECT(CONCATENATE($B254,\"!O19\"))),\"\",INDIRECT(CONCATENATE($B254,\"!O19\")))","v":""},{"$f":"IF(ISERROR(INDIRECT(CONCATENATE($B254,\"!O20\"))),\"\",INDIRECT(CONCATENATE($B254,\"!O20\")))","v":""},{"$f":"IF(ISERROR(INDIRECT(CONCATENATE($B254,\"!O21\"))),\"\",INDIRECT(CONCATENATE($B254,\"!O21\")))","v":""},null,{"$f":"IF(ISERROR(INDIRECT(CONCATENATE($B254,\"!P18\"))),\"\",INDIRECT(CONCATENATE($B254,\"!P18\")))","v":""},{"$f":"IF(ISERROR(INDIRECT(CONCATENATE($B254,\"!P19\"))),\"\",INDIRECT(CONCATENATE($B254,\"!P19\")))","v":""},{"$f":"IF(ISERROR(INDIRECT(CONCATENATE($B254,\"!P20\"))),\"\",INDIRECT(CONCATENATE($B254,\"!P20\")))","v":""},{"$f":"IF(ISERROR(INDIRECT(CONCATENATE($B254,\"!P21\"))),\"\",INDIRECT(CONCATENATE($B254,\"!P21\")))","v":""},null,{"$f":"IF(ISERROR(INDIRECT(CONCATENATE($B254,\"!Q18\"))),\"\",INDIRECT(CONCATENATE($B254,\"!Q18\")))","v":""},{"$f":"IF(ISERROR(INDIRECT(CONCATENATE($B254,\"!Q19\"))),\"\",INDIRECT(CONCATENATE($B254,\"!Q19\")))","v":""},{"$f":"IF(ISERROR(INDIRECT(CONCATENATE($B254,\"!Q20\"))),\"\",INDIRECT(CONCATENATE($B254,\"!Q20\")))","v":""},{"$f":"IF(ISERROR(INDIRECT(CONCATENATE($B254,\"!Q21\"))),\"\",INDIRECT(CONCATENATE($B254,\"!Q1\")))","v":""}]
[null,null,null,null,{"$f":"IF(ISERROR(INDIRECT(CONCATENATE($B255,\"!M18\"))),\"\",INDIRECT(CONCATENATE($B255,\"!M18\")))","v":""},{"$f":"IF(ISERROR(INDIRECT(CONCATENATE($B255,\"!M19\"))),\"\",INDIRECT(CONCATENATE($B255,\"!M19\")))","v":""},{"$f":"IF(ISERROR(INDIRECT(CONCATENATE($B255,\"!M20\"))),\"\",INDIRECT(CONCATENATE($B255,\"!M20\")))","v":""},{"$f":"IF(ISERROR(INDIRECT(CONCATENATE($B255,\"!M21\"))),\"\",INDIRECT(CONCATENATE($B255,\"!M21\")))","v":""},null,{"$f":"IF(ISERROR(INDIRECT(CONCATENATE($B255,\"!N18\"))),\"\",INDIRECT(CONCATENATE($B255,\"!N18\")))","v":""},{"$f":"IF(ISERROR(INDIRECT(CONCATENATE($B255,\"!N19\"))),\"\",INDIRECT(CONCATENATE($B255,\"!N19\")))","v":""},{"$f":"IF(ISERROR(INDIRECT(CONCATENATE($B255,\"!N20\"))),\"\",INDIRECT(CONCATENATE($B255,\"!N20\")))","v":""},{"$f":"IF(ISERROR(INDIRECT(CONCATENATE($B255,\"!N21\"))),\"\",INDIRECT(CONCATENATE($B255,\"!N21\")))","v":""},null,{"$f":"IF(ISERROR(INDIRECT(CONCATENATE($B255,\"!O18\"))),\"\",INDIRECT(CONCATENATE($B255,\"!O18\")))","v":""},{"$f":"IF(ISERROR(INDIRECT(CONCATENATE($B255,\"!O19\"))),\"\",INDIRECT(CONCATENATE($B255,\"!O19\")))","v":""},{"$f":"IF(ISERROR(INDIRECT(CONCATENATE($B255,\"!O20\"))),\"\",INDIRECT(CONCATENATE($B255,\"!O20\")))","v":""},{"$f":"IF(ISERROR(INDIRECT(CONCATENATE($B255,\"!O21\"))),\"\",INDIRECT(CONCATENATE($B255,\"!O21\")))","v":""},null,{"$f":"IF(ISERROR(INDIRECT(CONCATENATE($B255,\"!P18\"))),\"\",INDIRECT(CONCATENATE($B255,\"!P18\")))","v":""},{"$f":"IF(ISERROR(INDIRECT(CONCATENATE($B255,\"!P19\"))),\"\",INDIRECT(CONCATENATE($B255,\"!P19\")))","v":""},{"$f":"IF(ISERROR(INDIRECT(CONCATENATE($B255,\"!P20\"))),\"\",INDIRECT(CONCATENATE($B255,\"!P20\")))","v":""},{"$f":"IF(ISERROR(INDIRECT(CONCATENATE($B255,\"!P21\"))),\"\",INDIRECT(CONCATENATE($B255,\"!P21\")))","v":""},null,{"$f":"IF(ISERROR(INDIRECT(CONCATENATE($B255,\"!Q18\"))),\"\",INDIRECT(CONCATENATE($B255,\"!Q18\")))","v":""},{"$f":"IF(ISERROR(INDIRECT(CONCATENATE($B255,\"!Q19\"))),\"\",INDIRECT(CONCATENATE($B255,\"!Q19\")))","v":""},{"$f":"IF(ISERROR(INDIRECT(CONCATENATE($B255,\"!Q20\"))),\"\",INDIRECT(CONCATENATE($B255,\"!Q20\")))","v":""},{"$f":"IF(ISERROR(INDIRECT(CONCATENATE($B255,\"!Q21\"))),\"\",INDIRECT(CONCATENATE($B255,\"!Q1\")))","v":""}]
[null,null,null,null,{"$f":"IF(ISERROR(INDIRECT(CONCATENATE($B256,\"!M18\"))),\"\",INDIRECT(CONCATENATE($B256,\"!M18\")))","v":""},{"$f":"IF(ISERROR(INDIRECT(CONCATENATE($B256,\"!M19\"))),\"\",INDIRECT(CONCATENATE($B256,\"!M19\")))","v":""},{"$f":"IF(ISERROR(INDIRECT(CONCATENATE($B256,\"!M20\"))),\"\",INDIRECT(CONCATENATE($B256,\"!M20\")))","v":""},{"$f":"IF(ISERROR(INDIRECT(CONCATENATE($B256,\"!M21\"))),\"\",INDIRECT(CONCATENATE($B256,\"!M21\")))","v":""},null,{"$f":"IF(ISERROR(INDIRECT(CONCATENATE($B256,\"!N18\"))),\"\",INDIRECT(CONCATENATE($B256,\"!N18\")))","v":""},{"$f":"IF(ISERROR(INDIRECT(CONCATENATE($B256,\"!N19\"))),\"\",INDIRECT(CONCATENATE($B256,\"!N19\")))","v":""},{"$f":"IF(ISERROR(INDIRECT(CONCATENATE($B256,\"!N20\"))),\"\",INDIRECT(CONCATENATE($B256,\"!N20\")))","v":""},{"$f":"IF(ISERROR(INDIRECT(CONCATENATE($B256,\"!N21\"))),\"\",INDIRECT(CONCATENATE($B256,\"!N21\")))","v":""},null,{"$f":"IF(ISERROR(INDIRECT(CONCATENATE($B256,\"!O18\"))),\"\",INDIRECT(CONCATENATE($B256,\"!O18\")))","v":""},{"$f":"IF(ISERROR(INDIRECT(CONCATENATE($B256,\"!O19\"))),\"\",INDIRECT(CONCATENATE($B256,\"!O19\")))","v":""},{"$f":"IF(ISERROR(INDIRECT(CONCATENATE($B256,\"!O20\"))),\"\",INDIRECT(CONCATENATE($B256,\"!O20\")))","v":""},{"$f":"IF(ISERROR(INDIRECT(CONCATENATE($B256,\"!O21\"))),\"\",INDIRECT(CONCATENATE($B256,\"!O21\")))","v":""},null,{"$f":"IF(ISERROR(INDIRECT(CONCATENATE($B256,\"!P18\"))),\"\",INDIRECT(CONCATENATE($B256,\"!P18\")))","v":""},{"$f":"IF(ISERROR(INDIRECT(CONCATENATE($B256,\"!P19\"))),\"\",INDIRECT(CONCATENATE($B256,\"!P19\")))","v":""},{"$f":"IF(ISERROR(INDIRECT(CONCATENATE($B256,\"!P20\"))),\"\",INDIRECT(CONCATENATE($B256,\"!P20\")))","v":""},{"$f":"IF(ISERROR(INDIRECT(CONCATENATE($B256,\"!P21\"))),\"\",INDIRECT(CONCATENATE($B256,\"!P21\")))","v":""},null,{"$f":"IF(ISERROR(INDIRECT(CONCATENATE($B256,\"!Q18\"))),\"\",INDIRECT(CONCATENATE($B256,\"!Q18\")))","v":""},{"$f":"IF(ISERROR(INDIRECT(CONCATENATE($B256,\"!Q19\"))),\"\",INDIRECT(CONCATENATE($B256,\"!Q19\")))","v":""},{"$f":"IF(ISERROR(INDIRECT(CONCATENATE($B256,\"!Q20\"))),\"\",INDIRECT(CONCATENATE($B256,\"!Q20\")))","v":""},{"$f":"IF(ISERROR(INDIRECT(CONCATENATE($B256,\"!Q21\"))),\"\",INDIRECT(CONCATENATE($B256,\"!Q1\")))","v":""}]
[null,null,null,null,{"$f":"IF(ISERROR(INDIRECT(CONCATENATE($B257,\"!M18\"))),\"\",INDIRECT(CONCATENATE($B257,\"!M18\")))","v":""},{"$f":"IF(ISERROR(INDIRECT(CONCATENATE($B257,\"!M19\"))),\"\",INDIRECT(CONCATENATE($B257,\"!M19\")))","v":""},{"$f":"IF(ISERROR(INDIRECT(CONCATENATE($B257,\"!M20\"))),\"\",INDIRECT(CONCATENATE($B257,\"!M20\")))","v":""},{"$f":"IF(ISERROR(INDIRECT(CONCATENATE($B257,\"!M21\"))),\"\",INDIRECT(CONCATENATE($B257,\"!M21\")))","v":""},null,{"$f":"IF(ISERROR(INDIRECT(CONCATENATE($B257,\"!N18\"))),\"\",INDIRECT(CONCATENATE($B257,\"!N18\")))","v":""},{"$f":"IF(ISERROR(INDIRECT(CONCATENATE($B257,\"!N19\"))),\"\",INDIRECT(CONCATENATE($B257,\"!N19\")))","v":""},{"$f":"IF(ISERROR(INDIRECT(CONCATENATE($B257,\"!N20\"))),\"\",INDIRECT(CONCATENATE($B257,\"!N20\")))","v":""},{"$f":"IF(ISERROR(INDIRECT(CONCATENATE($B257,\"!N21\"))),\"\",INDIRECT(CONCATENATE($B257,\"!N21\")))","v":""},null,{"$f":"IF(ISERROR(INDIRECT(CONCATENATE($B257,\"!O18\"))),\"\",INDIRECT(CONCATENATE($B257,\"!O18\")))","v":""},{"$f":"IF(ISERROR(INDIRECT(CONCATENATE($B257,\"!O19\"))),\"\",INDIRECT(CONCATENATE($B257,\"!O19\")))","v":""},{"$f":"IF(ISERROR(INDIRECT(CONCATENATE($B257,\"!O20\"))),\"\",INDIRECT(CONCATENATE($B257,\"!O20\")))","v":""},{"$f":"IF(ISERROR(INDIRECT(CONCATENATE($B257,\"!O21\"))),\"\",INDIRECT(CONCATENATE($B257,\"!O21\")))","v":""},null,{"$f":"IF(ISERROR(INDIRECT(CONCATENATE($B257,\"!P18\"))),\"\",INDIRECT(CONCATENATE($B257,\"!P18\")))","v":""},{"$f":"IF(ISERROR(INDIRECT(CONCATENATE($B257,\"!P19\"))),\"\",INDIRECT(CONCATENATE($B257,\"!P19\")))","v":""},{"$f":"IF(ISERROR(INDIRECT(CONCATENATE($B257,\"!P20\"))),\"\",INDIRECT(CONCATENATE($B257,\"!P20\")))","v":""},{"$f":"IF(ISERROR(INDIRECT(CONCATENATE($B257,\"!P21\"))),\"\",INDIRECT(CONCATENATE($B257,\"!P21\")))","v":""},null,{"$f":"IF(ISERROR(INDIRECT(CONCATENATE($B257,\"!Q18\"))),\"\",INDIRECT(CONCATENATE($B257,\"!Q18\")))","v":""},{"$f":"IF(ISERROR(INDIRECT(CONCATENATE($B257,\"!Q19\"))),\"\",INDIRECT(CONCATENATE($B257,\"!Q19\")))","v":""},{"$f":"IF(ISERROR(INDIRECT(CONCATENATE($B257,\"!Q20\"))),\"\",INDIRECT(CONCATENATE($B257,\"!Q20\")))","v":""},{"$f":"IF(ISERROR(INDIRECT(CONCATENATE($B257,\"!Q21\"))),\"\",INDIRECT(CONCATENATE($B257,\"!Q1\")))","v":""}]
[]
[]
[]
[]
[]
[]
[]
[]
[]
[]
[]
[]
[]
[]
[]
[]
[]
[]
[]
[]
[]
[]
[]
[]
[]
[]
[]
[]
[]
[]
[]
[]
[]
[]
[]
[]
[]
[]
[]
["RURAL",null,null,"Poorest",null,null,null,null,"Poor",null,null,null,null,"Middle",null,null,null,null,"Rich",null,null,null,null,"Richest"]
[null,null,null,"Improved","Basic","Limited","Unimproved","Surface water","Improved","Basic","Limited","Unimproved","Surface water","Improved","Basic","Limited","Unimproved","Surface water","Improved","Basic","Limited","Unimproved","Surface water","Improved","Basic","Limited","Unimproved","Surface water"]
["Forecast period:",null,2000,{"$f":"IF((D301+H301)>100,D301*100/(D301+H301),D301)","v":100},{"$f":"D299*AVERAGEIF(E305:E316,\">0\")/100","v":97.612681531310827},{"$f":"D299*(100-AVERAGEIF(E305:E316,\">0\"))/100","v":2.3873184686891733},{"$f":"100-(E299+F299+H299)","v":0},{"$f":"IF((D301+H301)>100,H301*100/(D301+H301),H301)","v":0},{"$f":"IF((I301+M301)>100,I301*100/(I301+M301),I301)","v":100},{"$f":"I299*AVERAGEIF(J305:J316,\">0\")/100","v":100},{"$f":"I299*(100-AVERAGEIF(J305:J316,\">0\"))/100","v":0},{"$f":"100-(J299+K299+M299)","v":0},{"$f":"IF((I301+M301)>100,M301*100/(I301+M301),M301)","v":0},{"$f":"IF((N301+R301)>100,N301*100/(N301+R301),N301)","v":100},{"$f":"N299*AVERAGEIF(O305:O316,\">0\")/100","v":100},{"$f":"N299*(100-AVERAGEIF(O305:O316,\">0\"))/100","v":0},{"$f":"100-(O299+P299+R299)","v":0},{"$f":"IF((N301+R301)>100,R301*100/(N301+R301),R301)","v":0},{"$f":"IF((S301+W301)>100,S301*100/(S301+W301),S301)","v":100},{"$f":"S299*AVERAGEIF(T305:T316,\">0\")/100","v":100},{"$f":"S299*(100-AVERAGEIF(T305:T316,\">0\"))/100","v":0},{"$f":"100-(T299+U299+W299)","v":0},{"$f":"IF((S301+W301)>100,W301*100/(S301+W301),W301)","v":0},{"$f":"IF((X301+AB301)>100,X301*100/(X301+AB301),X301)","v":100},{"$f":"X299*AVERAGEIF(Y305:Y316,\">0\")/100","v":100},{"$f":"X299*(100-AVERAGEIF(Y305:Y316,\">0\"))/100","v":0},{"$f":"100-(Y299+Z299+AB299)","v":0},{"$f":"IF((X301+AB301)>100,AB301*100/(X301+AB301),AB301)","v":0}]
[null,null,2019,{"$f":"IF((D302+H302)>100,D302*100/(D302+H302),D302)","v":90.740516316649973},{"$f":"D300*AVERAGEIF(E305:E316,\">0\")/100","v":88.574251212038675},{"$f":"D300*(100-AVERAGEIF(E305:E316,\">0\"))/100","v":2.1662651046112975},{"$f":"100-(E300+F300+H300)","v":9.2594836833500267},{"$f":"IF((D302+H302)>100,H302*100/(D302+H302),H302)","v":0},{"$f":"IF((I302+M302)>100,I302*100/(I302+M302),I302)","v":90.262536555468159},{"$f":"I300*AVERAGEIF(J305:J316,\">0\")/100","v":90.262536555468159},{"$f":"I300*(100-AVERAGEIF(J305:J316,\">0\"))/100","v":0},{"$f":"100-(J300+K300+M300)","v":9.7374634445318407},{"$f":"IF((I302+M302)>100,M302*100/(I302+M302),M302)","v":0},{"$f":"IF((N302+R302)>100,N302*100/(N302+R302),N302)","v":99.785952715399887},{"$f":"N300*AVERAGEIF(O305:O316,\">0\")/100","v":99.785952715399887},{"$f":"N300*(100-AVERAGEIF(O305:O316,\">0\"))/100","v":0},{"$f":"100-(O300+P300+R300)","v":0.21404728460011313},{"$f":"IF((N302+R302)>100,R302*100/(N302+R302),R302)","v":0},{"$f":"IF((S302+W302)>100,S302*100/(S302+W302),S302)","v":99.727324872360811},{"$f":"S300*AVERAGEIF(T305:T316,\">0\")/100","v":99.727324872360811},{"$f":"S300*(100-AVERAGEIF(T305:T316,\">0\"))/100","v":0},{"$f":"100-(T300+U300+W300)","v":0.27267512763918944},{"$f":"IF((S302+W302)>100,W302*100/(S302+W302),W302)","v":0},{"$f":"IF((X302+AB302)>100,X302*100/(X302+AB302),X302)","v":99.39230397427103},{"$f":"X300*AVERAGEIF(Y305:Y316,\">0\")/100","v":99.39230397427103},{"$f":"X300*(100-AVERAGEIF(Y305:Y316,\">0\"))/100","v":0},{"$f":"100-(Y300+Z300+AB300)","v":0.60769602572896986},{"$f":"IF((X302+AB302)>100,AB302*100/(X302+AB302),AB302)","v":0}]
["Regression period:",null,{"$f":"MinRegYear(C299,C305:C316)","v":2001},{"$f":"IF(MAX(C305:C316)-MIN(C305:C316)<5,AVERAGEIF(C305:C316,\">0\",D305:D316),\nIF(FORECAST($C301,D$305:D$316,$C$305:$C$316)<0,0,\nIF(FORECAST($C301,D$305:D$316,$C$305:$C$316)>100,100,\nFORECAST($C301,D$305:D$316,$C$305:$C$316))))","v":100},null,null,null,{"$f":"IF(MAX(C305:C316)-MIN(C305:C316)<5,AVERAGEIF(C305:C316,\">0\",H305:H316),\nIF(FORECAST($C301,H$305:H$316,$C$305:$C$316)<0,0,\nIF(FORECAST($C301,H$305:H$316,$C$305:$C$316)>100,100,\nFORECAST($C301,H$305:H$316,$C$305:$C$316))))","v":0},{"$f":"IF(MAX(C305:C316)-MIN(C305:C316)<5,AVERAGEIF(C305:C316,\">0\",I305:I316),\nIF(FORECAST($C301,I$305:I$316,$C$305:$C$316)<0,0,\nIF(FORECAST($C301,I$305:I$316,$C$305:$C$316)>100,100,\nFORECAST($C301,I$305:I$316,$C$305:$C$316))))","v":100},null,null,null,{"$f":"IF(MAX(C305:C316)-MIN(C305:C316)<5,AVERAGEIF(C305:C316,\">0\",M305:M316),\nIF(FORECAST($C301,M$305:M$316,$C$305:$C$316)<0,0,\nIF(FORECAST($C301,M$305:M$316,$C$305:$C$316)>100,100,\nFORECAST($C301,M$305:M$316,$C$305:$C$316))))","v":0},{"$f":"IF(MAX(C305:C316)-MIN(C305:C316)<5,AVERAGEIF(C305:C316,\">0\",N305:N316),\nIF(FORECAST($C301,N$305:N$316,$C$305:$C$316)<0,0,\nIF(FORECAST($C301,N$305:N$316,$C$305:$C$316)>100,100,\nFORECAST($C301,N$305:N$316,$C$305:$C$316))))","v":100},null,null,null,{"$f":"IF(MAX(C305:C316)-MIN(C305:C316)<5,AVERAGEIF(C305:C316,\">0\",R305:R316),\nIF(FORECAST($C301,R$305:R$316,$C$305:$C$316)<0,0,\nIF(FORECAST($C301,R$305:R$316,$C$305:$C$316)>100,100,\nFORECAST($C301,R$305:R$316,$C$305:$C$316))))","v":0},{"$f":"IF(MAX(C305:C316)-MIN(C305:C316)<5,AVERAGEIF(C305:C316,\">0\",S305:S316),\nIF(FORECAST($C301,S$305:S$316,$C$305:$C$316)<0,0,\nIF(FORECAST($C301,S$305:S$316,$C$305:$C$316)>100,100,\nFORECAST($C301,S$305:S$316,$C$305:$C$316))))","v":100},null,null,null,{"$f":"IF(MAX(C305:C316)-MIN(C305:C316)<5,AVERAGEIF(C305:C316,\">0\",W305:W316),\nIF(FORECAST($C301,W$305:W$316,$C$305:$C$316)<0,0,\nIF(FORECAST($C301,W$305:W$316,$C$305:$C$316)>100,100,\nFORECAST($C301,W$305:W$316,$C$305:$C$316))))","v":0},{"$f":"IF(MAX(C305:C316)-MIN(C305:C316)<5,AVERAGEIF(C305:C316,\">0\",X305:X316),\nIF(FORECAST($C301,X$305:X$316,$C$305:$C$316)<0,0,\nIF(FORECAST($C301,X$305:X$316,$C$305:$C$316)>100,100,\nFORECAST($C301,X$305:X$316,$C$305:$C$316))))","v":100},null,null,null,{"$f":"IF(MAX(C305:C316)-MIN(C305:C316)<5,AVERAGEIF(C305:C316,\">0\",AB305:AB316),\nIF(FORECAST($C301,AB$305:AB$316,$C$305:$C$316)<0,0,\nIF(FORECAST($C301,AB$305:AB$316,$C$305:$C$316)>100,100,\nFORECAST($C301,AB$305:AB$316,$C$305:$C$316))))","v":0}]
[null,null,{"$f":"MaxRegYear(C300,C305:C316)","v":2015},{"$f":"IF(MAX(C305:C316)-MIN(C305:C316)<5,AVERAGEIF(C305:C316,\">0\",D305:D316),\nIF(FORECAST($C302,D$305:D$316,$C$305:$C$316)<0,0,\nIF(FORECAST($C302,D$305:D$316,$C$305:$C$316)>100,100,\nFORECAST($C302,D$305:D$316,$C$305:$C$316))))","v":90.740516316649973},null,null,null,{"$f":"IF(MAX(C305:C316)-MIN(C305:C316)<5,AVERAGEIF(C305:C316,\">0\",H305:H316),\nIF(FORECAST($C302,H$305:H$316,$C$305:$C$316)<0,0,\nIF(FORECAST($C302,H$305:H$316,$C$305:$C$316)>100,100,\nFORECAST($C302,H$305:H$316,$C$305:$C$316))))","v":0},{"$f":"IF(MAX(C305:C316)-MIN(C305:C316)<5,AVERAGEIF(C305:C316,\">0\",I305:I316),\nIF(FORECAST($C302,I$305:I$316,$C$305:$C$316)<0,0,\nIF(FORECAST($C302,I$305:I$316,$C$305:$C$316)>100,100,\nFORECAST($C302,I$305:I$316,$C$305:$C$316))))","v":90.262536555468159},null,null,null,{"$f":"IF(MAX(C305:C316)-MIN(C305:C316)<5,AVERAGEIF(C305:C316,\">0\",M305:M316),\nIF(FORECAST($C302,M$305:M$316,$C$305:$C$316)<0,0,\nIF(FORECAST($C302,M$305:M$316,$C$305:$C$316)>100,100,\nFORECAST($C302,M$305:M$316,$C$305:$C$316))))","v":0},{"$f":"IF(MAX(C305:C316)-MIN(C305:C316)<5,AVERAGEIF(C305:C316,\">0\",N305:N316),\nIF(FORECAST($C302,N$305:N$316,$C$305:$C$316)<0,0,\nIF(FORECAST($C302,N$305:N$316,$C$305:$C$316)>100,100,\nFORECAST($C302,N$305:N$316,$C$305:$C$316))))","v":99.785952715399887},null,null,null,{"$f":"IF(MAX(C305:C316)-MIN(C305:C316)<5,AVERAGEIF(C305:C316,\">0\",R305:R316),\nIF(FORECAST($C302,R$305:R$316,$C$305:$C$316)<0,0,\nIF(FORECAST($C302,R$305:R$316,$C$305:$C$316)>100,100,\nFORECAST($C302,R$305:R$316,$C$305:$C$316))))","v":0},{"$f":"IF(MAX(C305:C316)-MIN(C305:C316)<5,AVERAGEIF(C305:C316,\">0\",S305:S316),\nIF(FORECAST($C302,S$305:S$316,$C$305:$C$316)<0,0,\nIF(FORECAST($C302,S$305:S$316,$C$305:$C$316)>100,100,\nFORECAST($C302,S$305:S$316,$C$305:$C$316))))","v":99.727324872360811},null,null,null,{"$f":"IF(MAX(C305:C316)-MIN(C305:C316)<5,AVERAGEIF(C305:C316,\">0\",W305:W316),\nIF(FORECAST($C302,W$305:W$316,$C$305:$C$316)<0,0,\nIF(FORECAST($C302,W$305:W$316,$C$305:$C$316)>100,100,\nFORECAST($C302,W$305:W$316,$C$305:$C$316))))","v":0},{"$f":"IF(MAX(C305:C316)-MIN(C305:C316)<5,AVERAGEIF(C305:C316,\">0\",X305:X316),\nIF(FORECAST($C302,X$305:X$316,$C$305:$C$316)<0,0,\nIF(FORECAST($C302,X$305:X$316,$C$305:$C$316)>100,100,\nFORECAST($C302,X$305:X$316,$C$305:$C$316))))","v":99.39230397427103},null,null,null,{"$f":"IF(MAX(C305:C316)-MIN(C305:C316)<5,AVERAGEIF(C305:C316,\">0\",AB305:AB316),\nIF(FORECAST($C302,AB$305:AB$316,$C$305:$C$316)<0,0,\nIF(FORECAST($C302,AB$305:AB$316,$C$305:$C$316)>100,100,\nFORECAST($C302,AB$305:AB$316,$C$305:$C$316))))","v":0}]
[]
[null,"Survey","Year","Improved","% Improved\n< = 30min",null,null,"Surface water","Improved","% Improved\n< = 30min",null,null,"Surface water","Improved","% Improved\n< = 30min",null,null,"Surface water","Improved","% Improved\n< = 30min",null,null,"Surface water","Improved","% Improved\n< = 30min",null,null,"Surface water"]
[null,"WHS03",2003,{"$f":"IF(ISERROR(INDIRECT(CONCATENATE($B305,\"!M16\"))),\"\",INDIRECT(CONCATENATE($B305,\"!M16\")))","v":99.246170488451497},{"$f":"IF(ISERROR(INDIRECT(CONCATENATE($B305,\"!M23\"))),\"\",INDIRECT(CONCATENATE($B305,\"!M23\")))","v":95.225363062621653},null,null,{"$f":"IF(ISERROR(INDIRECT(CONCATENATE($B305,\"!M21\"))),\"\",INDIRECT(CONCATENATE($B305,\"!M21\")))","v":0},{"$f":"IF(ISERROR(INDIRECT(CONCATENATE($B305,\"!N16\"))),\"\",INDIRECT(CONCATENATE($B305,\"!N16\")))","v":100},{"$f":"IF(ISERROR(INDIRECT(CONCATENATE($B305,\"!N23\"))),\"\",INDIRECT(CONCATENATE($B305,\"!N23\")))","v":100},null,null,{"$f":"IF(ISERROR(INDIRECT(CONCATENATE($B305,\"!N21\"))),\"\",INDIRECT(CONCATENATE($B305,\"!N21\")))","v":0},{"$f":"IF(ISERROR(INDIRECT(CONCATENATE($B305,\"!O16\"))),\"\",INDIRECT(CONCATENATE($B305,\"!O16\")))","v":100},{"$f":"IF(ISERROR(INDIRECT(CONCATENATE($B305,\"!O23\"))),\"\",INDIRECT(CONCATENATE($B305,\"!O23\")))","v":100},null,null,{"$f":"IF(ISERROR(INDIRECT(CONCATENATE($B305,\"!O21\"))),\"\",INDIRECT(CONCATENATE($B305,\"!O21\")))","v":0},{"$f":"IF(ISERROR(INDIRECT(CONCATENATE($B305,\"!P16\"))),\"\",INDIRECT(CONCATENATE($B305,\"!P16\")))","v":100},{"$f":"IF(ISERROR(INDIRECT(CONCATENATE($B305,\"!P23\"))),\"\",INDIRECT(CONCATENATE($B305,\"!P23\")))","v":100},null,null,{"$f":"IF(ISERROR(INDIRECT(CONCATENATE($B305,\"!P21\"))),\"\",INDIRECT(CONCATENATE($B305,\"!P21\")))","v":0},{"$f":"IF(ISERROR(INDIRECT(CONCATENATE($B305,\"!Q16\"))),\"\",INDIRECT(CONCATENATE($B305,\"!Q16\")))","v":100},{"$f":"IF(ISERROR(INDIRECT(CONCATENATE($B305,\"!Q23\"))),\"\",INDIRECT(CONCATENATE($B305,\"!Q23\")))","v":100},null,null,{"$f":"IF(ISERROR(INDIRECT(CONCATENATE($B305,\"!Q221\"))),\"\",INDIRECT(CONCATENATE($B305,\"!Q21\")))","v":0}]
[null,"MICS13",2013,92.158125345283466,100,null,null,0,91.885447129556866,100,null,null,0,99.821627262833232,100,null,null,0,99.772770726967352,100,null,null,0,99.493586645225861,100,null,null,0]
[null,null,null,"","",null,null,"","","",null,null,"","","",null,null,"","","",null,null,"","","",null,null,""]
[null,null,null,"","",null,null,"","","",null,null,"","","",null,null,"","","",null,null,"","","",null,null,""]
[null,null,null,"","",null,null,"","","",null,null,"","","",null,null,"","","",null,null,"","","",null,null,""]
[null,null,null,"","",null,null,"","","",null,null,"","","",null,null,"","","",null,null,"","","",null,null,""]
[null,null,null,"","",null,null,"","","",null,null,"","","",null,null,"","","",null,null,"","","",null,null,""]
[null,null,null,"","",null,null,"","","",null,null,"","","",null,null,"","","",null,null,"","","",null,null,""]
[null,null,null,"","",null,null,"","","",null,null,"","","",null,null,"","","",null,null,"","","",null,null,""]
[null,null,null,"","",null,null,"","","",null,null,"","","",null,null,"","","",null,null,"","","",null,null,""]
[null,null,null,"","",null,null,"","","",null,null,"","","",null,null,"","","",null,null,"","","",null,null,""]
[null,null,null,"","",null,null,"","","",null,null,"","","",null,null,"","","",null,null,"","","",null,null,""]
[]
[null,{"$f":"CONCATENATE(\"Rural use of drinking water sources, \",C299,\"–\",C300)","v":"Rural use of drinking water sources, 2000–2019"},null,null,null,null,null,null,null,null,null,null,null,null,null,null,null,null,"Data points used for regression"]

{"sheet":"Sanitation","index":2,"n_rows":318,"n_cols":28,"rows_kept":318,"cut":false,"hidden":false,"merged":[[298,0,299,1],[300,0,301,1],[317,18,317,22],[196,23,196,27],[198,0,199,1],[200,0,201,1],[217,18,217,22],[296,0,297,2],[296,3,296,7],[296,8,296,12],[296,13,296,17],[296,18,296,22],[296,23,296,27],[217,1,217,11],[317,1,317,11],[98,0,99,1],[100,0,101,1],[117,18,117,22],[196,0,197,2],[196,3,196,7],[196,8,196,12],[196,13,196,17],[196,18,196,22],[117,1,117,11],[96,23,96,27],[32,1,33,2],[32,3,33,3],[35,1,36,2],[35,3,36,3],[38,1,39,2],[38,3,39,3],[96,0,97,2],[96,3,96,7],[96,8,96,12],[96,13,96,17],[96,18,96,22],[30,21,30,24],[4,1,4,24],[3,1,3,24],[6,1,6,8],[6,9,6,16],[6,17,6,24],[30,1,31,4],[30,5,30,8],[30,9,30,12],[30,13,30,16],[30,17,30,20]]}
[]
[]
[]
[null,"Summary of trends in use of sanitation facilities by wealth quintile (%)"]
[null,{"$f":"IF(ISERROR(INDIRECT(CONCATENATE($B105,\"!A2\"))),\"\",INDIRECT(CONCATENATE($B105,\"!A2\")))","v":"Uruguay"}]
[]
[null,{"$f":"B118","v":"National use of sanitation facilities, 2000–2019"},null,null,null,null,null,null,null,{"$f":"B218","v":"Urban use of sanitation facilities, 2000–2019"},null,null,null,null,null,null,null,{"$f":"B318","v":"Rural use of sanitation facilities, 2000–2019"}]
[]
[]
[]
[]
[]
[]
[]
[]
[]
[]
[]
[]
[]
[]
[]
[]
[]
[]
[]
[]
[]
[]
[]
[null,{"$f":"IF(ISERROR(INDIRECT(CONCATENATE($B105,\"!A2\"))),\"\",INDIRECT(CONCATENATE($B105,\"!A2\")))","v":"Uruguay"},null,null,null,"Poorest",null,null,null,"Poor",null,null,null,"Middle",null,null,null,"Rich",null,null,null,"Richest"]
[null,null,null,null,null,"Basic","Limited","Unimproved","Open defecation","Basic","Limited","Unimproved","Open defecation","Basic","Limited","Unimproved","Open defecation","Basic","Limited","Unimproved","Open defecation","Basic","Limited","Unimproved","Open defecation"]
[null,"NATIONAL",null,"Estimate",{"$f":"C99","v":2000},{"$f":"E99","v":95.51728977114837},{"$f":"F99","v":4.4827102288516301},0,0,{"$f":"J99","v":97.031492991385477},{"$f":"K99","v":2.8452813882285084},0.12322562038600893,0,{"$f":"O99","v":97.690040921398293},{"$f":"P99","v":2.3099590786017075},0,0,{"$f":"T99","v":98.068709029290474},{"$f":"U99","v":1.9312909707095258},0,0,{"$f":"Y99","v":98.410547971718813},{"$f":"Z99","v":1.5056316938418903},8.3820334439295152E-2,0]
[null,null,null,null,{"$f":"C100","v":2019},{"$f":"E100","v":88.473774231291458},4.1521518636253889,4.5753010715177425,2.7987728335654083,{"$f":"J100","v":97.088858948845825},2.8469635461140341,1.7674188996579687E-2,4.6503316043555287E-2,{"$f":"O100","v":97.649785010152627},2.3090071954130811,0,4.1207794434302336E-2,{"$f":"T100","v":96.69497331009353},1.90423765862979,1.4007890312766733,0,{"$f":"Y100","v":97.884367044985652},1.497581391345737,0.61805156366861524,0]
[]
[null,"URBAN",null,"Estimate",{"$f":"C199","v":2000},{"$f":"E199","v":95.290130378988465},{"$f":"F199","v":4.7098696210115349},0,0,{"$f":"J199","v":98.059822610189428},{"$f":"K199","v":1.9401773898105859},0,0,{"$f":"O199","v":97.277709765749819},{"$f":"P199","v":2.7222902342501811},0,0,{"$f":"T199","v":98.197169389922863},{"$f":"U199","v":1.8028306100771374},0,0,{"$f":"Y199","v":98.312524407921259},{"$f":"Z199","v":1.5576370038478169},0.12983858823092476,0]
[null,null,null,null,{"$f":"C200","v":2019},{"$f":"E200","v":88.314822200560286},4.3651036735192834,4.2898102840270553,3.0302638418933725,{"$f":"J200","v":97.965816166987011},1.9383174111695589,4.4631802627165484E-2,5.1234619216254274E-2,{"$f":"O200","v":97.233349077775031},2.7210488124697014,0,4.5602109755261466E-2,{"$f":"T200","v":96.697736695104908},1.7753020858155646,1.5269612190795243,0,{"$f":"Y200","v":97.777226030093061},1.5491558813618831,0.67361808854505512,0]
[]
[null,"RURAL",null,"Estimate",{"$f":"C299","v":2000},{"$f":"E299","v":93.204948575975578},{"$f":"F299","v":6.7950514240244217},0,0,{"$f":"J299","v":96.668033007953824},{"$f":"K299","v":3.3319669920461905},0,0,{"$f":"O299","v":98.583602244802847},{"$f":"P299","v":0.81036663666951791},0.60603111852763902,0,{"$f":"T299","v":98.82755421212714},{"$f":"U299","v":1.17244578787286},0,0,{"$f":"Y299","v":99.161369593592283},{"$f":"Z299","v":0.83863040640771658},0,0]
[null,null,null,null,{"$f":"C300","v":2019},{"$f":"E300","v":86.019273273995253},6.271184033512454,7.2535636270629595,0.45597906542933231,{"$f":"J300","v":96.323719021067078},3.3200991304221521,0.35618184851077217,0,{"$f":"O300","v":99.184692345230857},0.8153076547691569,0,0,{"$f":"T300","v":98.82755421212714},1.17244578787286,0,0,{"$f":"Y300","v":99.161369593592283},0.83863040640771658,0,0]
[]
[]
[]
[]
[]
[]
[]
[]
[]
[]
[]
[]
[]
[]
[]
[]
[]
[]
[]
[]
[]
[]
[]
[]
[]
[]
[]
[]
[]
[]
[]
[]
[]
[]
[]
[]
[]
[]
[]
[]
[]
[]
[]
[]
[]
[]
[]
[]
[]
[]
[]
[]
[]
[]
[]
[]
["NATIONAL",null,null,"Poorest",null,null,null,null,"Poor",null,null,null,null,"Middle",null,null,null,null,"Rich",null,null,null,null,"Richest"]
[null,null,null,"Improved","Basic","Limited","Unimproved","Open defecation","Improved","Basic","Limited","Unimproved","Open defecation","Improved","Basic","Limited","Unimproved","Open defecation","Improved","Basic","Limited","Unimproved","Open defecation","Improved","Basic","Limited","Unimproved","Open defecation"]
["Forecast period:",null,2000,{"$f":"IF((D101+H101)>100,D101*100/(D101+H101),D101)","v":100},{"$f":"D99*AVERAGEIF(E105:E116,\">0\")/100","v":95.51728977114837},{"$f":"D99*(100-AVERAGEIF(E105:E116,\">0\"))/100","v":4.4827102288516301},{"$f":"100-(E99+F99+H99)","v":0},{"$f":"IF((D101+H101)>100,H101*100/(D101+H101),H101)","v":0},{"$f":"IF((I101+M101)>100,I101*100/(I101+M101),I101)","v":99.876774379613991},{"$f":"I99*AVERAGEIF(J105:J116,\">0\")/100","v":97.031492991385477},{"$f":"I99*(100-AVERAGEIF(J105:J116,\">0\"))/100","v":2.8452813882285084},{"$f":"100-(J99+K99+M99)","v":0.12322562038600893},{"$f":"IF((I101+M101)>100,M101*100/(I101+M101),M101)","v":0},{"$f":"IF((N101+R101)>100,N101*100/(N101+R101),N101)","v":100},{"$f":"N99*AVERAGEIF(O105:O116,\">0\")/100","v":97.690040921398293},{"$f":"N99*(100-AVERAGEIF(O105:O116,\">0\"))/100","v":2.3099590786017075},{"$f":"100-(O99+P99+R99)","v":0},{"$f":"IF((N101+R101)>100,R101*100/(N101+R101),R101)","v":0},{"$f":"IF((S101+W101)>100,S101*100/(S101+W101),S101)","v":100},{"$f":"S99*AVERAGEIF(T105:T116,\">0\")/100","v":98.068709029290474},{"$f":"S99*(100-AVERAGEIF(T105:T116,\">0\"))/100","v":1.9312909707095258},{"$f":"100-(T99+U99+W99)","v":0},{"$f":"IF((S101+W101)>100,W101*100/(S101+W101),W101)","v":0},{"$f":"IF((X101+AB101)>100,X101*100/(X101+AB101),X101)","v":99.916179665560691},{"$f":"X99*AVERAGEIF(Y105:Y116,\">0\")/100","v":98.410547971718813},{"$f":"X99*(100-AVERAGEIF(Y105:Y116,\">0\"))/100","v":1.5056316938418903},{"$f":"100-(Y99+Z99+AB99)","v":8.3820334439295152E-2},{"$f":"IF((X101+AB101)>100,AB101*100/(X101+AB101),AB101)","v":0}]
[null,null,2019,{"$f":"IF((D102+H102)>100,D102*100/(D102+H102),D102)","v":92.625926094916849},{"$f":"D100*AVERAGEIF(E105:E116,\">0\")/100","v":88.473774231291458},{"$f":"D100*(100-AVERAGEIF(E105:E116,\">0\"))/100","v":4.1521518636253889},{"$f":"100-(E100+F100+H100)","v":4.5753010715177425},{"$f":"IF((D102+H102)>100,H102*100/(D102+H102),H102)","v":2.7987728335654083},{"$f":"IF((I102+M102)>100,I102*100/(I102+M102),I102)","v":99.935822494959865},{"$f":"I100*AVERAGEIF(J105:J116,\">0\")/100","v":97.088858948845825},{"$f":"I100*(100-AVERAGEIF(J105:J116,\">0\"))/100","v":2.8469635461140341},{"$f":"100-(J100+K100+M100)","v":1.7674188996579687E-2},{"$f":"IF((I102+M102)>100,M102*100/(I102+M102),M102)","v":4.6503316043555287E-2},{"$f":"IF((N102+R102)>100,N102*100/(N102+R102),N102)","v":99.958792205565715},{"$f":"N100*AVERAGEIF(O105:O116,\">0\")/100","v":97.649785010152627},{"$f":"N100*(100-AVERAGEIF(O105:O116,\">0\"))/100","v":2.3090071954130811},{"$f":"100-(O100+P100+R100)","v":0},{"$f":"IF((N102+R102)>100,R102*100/(N102+R102),R102)","v":4.1207794434302336E-2},{"$f":"IF((S102+W102)>100,S102*100/(S102+W102),S102)","v":98.599210968723327},{"$f":"S100*AVERAGEIF(T105:T116,\">0\")/100","v":96.69497331009353},{"$f":"S100*(100-AVERAGEIF(T105:T116,\">0\"))/100","v":1.90423765862979},{"$f":"100-(T100+U100+W100)","v":1.4007890312766733},{"$f":"IF((S102+W102)>100,W102*100/(S102+W102),W102)","v":0},{"$f":"IF((X102+AB102)>100,X102*100/(X102+AB102),X102)","v":99.381948436331385},{"$f":"X100*AVERAGEIF(Y105:Y116,\">0\")/100","v":97.884367044985652},{"$f":"X100*(100-AVERAGEIF(Y105:Y116,\">0\"))/100","v":1.497581391345737},{"$f":"100-(Y100+Z100+AB100)","v":0.61805156366861524},{"$f":"IF((X102+AB102)>100,AB102*100/(X102+AB102),AB102)","v":0}]
["Regression period:",null,{"$f":"MinRegYear(C99,C105:C116)","v":2001},{"$f":"IF(MAX(C105:C116)-MIN(C105:C116)<5,AVERAGEIF(C105:C116,\">0\",D105:D116),\nIF(FORECAST($C101,D$105:D$116,$C$105:$C$116)<0,0,\nIF(FORECAST($C101,D$105:D$116,$C$105:$C$116)>100,100,\nFORECAST($C101,D$105:D$116,$C$105:$C$116))))","v":100},null,null,null,{"$f":"IF(MAX(C105:C116)-MIN(C105:C116)<5,AVERAGEIF(C105:C116,\">0\",H105:H116),\nIF(FORECAST($C101,H$105:H$116,$C$105:$C$116)<0,0,\nIF(FORECAST($C101,H$105:H$116,$C$105:$C$116)>100,100,\nFORECAST($C101,H$105:H$116,$C$105:$C$116))))","v":0},{"$f":"IF(MAX(C105:C116)-MIN(C105:C116)<5,AVERAGEIF(C105:C116,\">0\",I105:I116),\nIF(FORECAST($C101,I$105:I$116,$C$105:$C$116)<0,0,\nIF(FORECAST($C101,I$105:I$116,$C$105:$C$116)>100,100,\nFORECAST($C101,I$105:I$116,$C$105:$C$116))))","v":99.876774379613991},null,null,null,{"$f":"IF(MAX(C105:C116)-MIN(C105:C116)<5,AVERAGEIF(C105:C116,\">0\",M105:M116),\nIF(FORECAST($C101,M$105:M$116,$C$105:$C$116)<0,0,\nIF(FORECAST($C101,M$105:M$116,$C$105:$C$116)>100,100,\nFORECAST($C101,M$105:M$116,$C$105:$C$116))))","v":0},{"$f":"IF(MAX(C105:C116)-MIN(C105:C116)<5,AVERAGEIF(C105:C116,\">0\",N105:N116),\nIF(FORECAST($C101,N$105:N$116,$C$105:$C$116)<0,0,\nIF(FORECAST($C101,N$105:N$116,$C$105:$C$116)>100,100,\nFORECAST($C101,N$105:N$116,$C$105:$C$116))))","v":100},null,null,null,{"$f":"IF(MAX(C105:C116)-MIN(C105:C116)<5,AVERAGEIF(C105:C116,\">0\",R105:R116),\nIF(FORECAST($C101,R$105:R$116,$C$105:$C$116)<0,0,\nIF(FORECAST($C101,R$105:R$116,$C$105:$C$116)>100,100,\nFORECAST($C101,R$105:R$116,$C$105:$C$116))))","v":0},{"$f":"IF(MAX(C105:C116)-MIN(C105:C116)<5,AVERAGEIF(C105:C116,\">0\",S105:S116),\nIF(FORECAST($C101,S$105:S$116,$C$105:$C$116)<0,0,\nIF(FORECAST($C101,S$105:S$116,$C$105:$C$116)>100,100,\nFORECAST($C101,S$105:S$116,$C$105:$C$116))))","v":100},null,null,null,{"$f":"IF(MAX(C105:C116)-MIN(C105:C116)<5,AVERAGEIF(C105:C116,\">0\",W105:W116),\nIF(FORECAST($C101,W$105:W$116,$C$105:$C$116)<0,0,\nIF(FORECAST($C101,W$105:W$116,$C$105:$C$116)>100,100,\nFORECAST($C101,W$105:W$116,$C$105:$C$116))))","v":0},{"$f":"IF(MAX(C105:C116)-MIN(C105:C116)<5,AVERAGEIF(C105:C116,\">0\",X105:X116),\nIF(FORECAST($C101,X$105:X$116,$C$105:$C$116)<0,0,\nIF(FORECAST($C101,X$105:X$116,$C$105:$C$116)>100,100,\nFORECAST($C101,X$105:X$116,$C$105:$C$116))))","v":99.916179665560691},null,null,null,{"$f":"IF(MAX(C105:C116)-MIN(C105:C116)<5,AVERAGEIF(C105:C116,\">0\",AB105:AB116),\nIF(FORECAST($C101,AB$105:AB$116,$C$105:$C$116)<0,0,\nIF(FORECAST($C101,AB$105:AB$116,$C$105:$C$116)>100,100,\nFORECAST($C101,AB$105:AB$116,$C$105:$C$116))))","v":0}]
[null,null,{"$f":"MaxRegYear(C100,C105:C116)","v":2015},{"$f":"IF(MAX(C105:C116)-MIN(C105:C116)<5,AVERAGEIF(C105:C116,\">0\",D105:D116),\nIF(FORECAST($C102,D$105:D$116,$C$105:$C$116)<0,0,\nIF(FORECAST($C102,D$105:D$116,$C$105:$C$116)>100,100,\nFORECAST($C102,D$105:D$116,$C$105:$C$116))))","v":92.625926094916849},null,null,null,{"$f":"IF(MAX(C105:C116)-MIN(C105:C116)<5,AVERAGEIF(C105:C116,\">0\",H105:H116),\nIF(FORECAST($C102,H$105:H$116,$C$105:$C$116)<0,0,\nIF(FORECAST($C102,H$105:H$116,$C$105:$C$116)>100,100,\nFORECAST($C102,H$105:H$116,$C$105:$C$116))))","v":2.7987728335654083},{"$f":"IF(MAX(C105:C116)-MIN(C105:C116)<5,AVERAGEIF(C105:C116,\">0\",I105:I116),\nIF(FORECAST($C102,I$105:I$116,$C$105:$C$116)<0,0,\nIF(FORECAST($C102,I$105:I$116,$C$105:$C$116)>100,100,\nFORECAST($C102,I$105:I$116,$C$105:$C$116))))","v":99.935822494959865},null,null,null,{"$f":"IF(MAX(C105:C116)-MIN(C105:C116)<5,AVERAGEIF(C105:C116,\">0\",M105:M116),\nIF(FORECAST($C102,M$105:M$116,$C$105:$C$116)<0,0,\nIF(FORECAST($C102,M$105:M$116,$C$105:$C$116)>100,100,\nFORECAST($C102,M$105:M$116,$C$105:$C$116))))","v":4.6503316043555287E-2},{"$f":"IF(MAX(C105:C116)-MIN(C105:C116)<5,AVERAGEIF(C105:C116,\">0\",N105:N116),\nIF(FORECAST($C102,N$105:N$116,$C$105:$C$116)<0,0,\nIF(FORECAST($C102,N$105:N$116,$C$105:$C$116)>100,100,\nFORECAST($C102,N$105:N$116,$C$105:$C$116))))","v":99.958792205565715},null,null,null,{"$f":"IF(MAX(C105:C116)-MIN(C105:C116)<5,AVERAGEIF(C105:C116,\">0\",R105:R116),\nIF(FORECAST($C102,R$105:R$116,$C$105:$C$116)<0,0,\nIF(FORECAST($C102,R$105:R$116,$C$105:$C$116)>100,100,\nFORECAST($C102,R$105:R$116,$C$105:$C$116))))","v":4.1207794434302336E-2},{"$f":"IF(MAX(C105:C116)-MIN(C105:C116)<5,AVERAGEIF(C105:C116,\">0\",S105:S116),\nIF(FORECAST($C102,S$105:S$116,$C$105:$C$116)<0,0,\nIF(FORECAST($C102,S$105:S$116,$C$105:$C$116)>100,100,\nFORECAST($C102,S$105:S$116,$C$105:$C$116))))","v":98.599210968723327},null,null,null,{"$f":"IF(MAX(C105:C116)-MIN(C105:C116)<5,AVERAGEIF(C105:C116,\">0\",W105:W116),\nIF(FORECAST($C102,W$105:W$116,$C$105:$C$116)<0,0,\nIF(FORECAST($C102,W$105:W$116,$C$105:$C$116)>100,100,\nFORECAST($C102,W$105:W$116,$C$105:$C$116))))","v":0},{"$f":"IF(MAX(C105:C116)-MIN(C105:C116)<5,AVERAGEIF(C105:C116,\">0\",X105:X116),\nIF(FORECAST($C102,X$105:X$116,$C$105:$C$116)<0,0,\nIF(FORECAST($C102,X$105:X$116,$C$105:$C$116)>100,100,\nFORECAST($C102,X$105:X$116,$C$105:$C$116))))","v":99.381948436331385},null,null,null,{"$f":"IF(MAX(C105:C116)-MIN(C105:C116)<5,AVERAGEIF(C105:C116,\">0\",AB105:AB116),\nIF(FORECAST($C102,AB$105:AB$116,$C$105:$C$116)<0,0,\nIF(FORECAST($C102,AB$105:AB$116,$C$105:$C$116)>100,100,\nFORECAST($C102,AB$105:AB$116,$C$105:$C$116))))","v":0}]
[]
[null,"Survey","Year","Improved","Not shared",null,null,"Open defecation","Improved","Not shared",null,null,"Open defecation","Improved","Not shared",null,null,"Open defecation","Improved","Not shared",null,null,"Open defecation","Improved","Not shared",null,null,"Open defecation"]
[null,"WHS03",2003,{"$f":"IF(ISERROR(INDIRECT(CONCATENATE($B105,\"!C122\"))),\"\",INDIRECT(CONCATENATE($B105,\"!C122\")))","v":99.844996313537763},{"$f":"IF(ISERROR(INDIRECT(CONCATENATE($B105,\"!C129\"))),\"\",INDIRECT(CONCATENATE($B105,\"!C129\")))","v":97.951749859458261},null,null,{"$f":"IF(ISERROR(INDIRECT(CONCATENATE($B105,\"!C127\"))),\"\",INDIRECT(CONCATENATE($B105,\"!C127\")))","v":0},{"$f":"IF(ISERROR(INDIRECT(CONCATENATE($B105,\"!D122\"))),\"\",INDIRECT(CONCATENATE($B105,\"!D122\")))","v":99.885209824663391},{"$f":"IF(ISERROR(INDIRECT(CONCATENATE($B105,\"!D129\"))),\"\",INDIRECT(CONCATENATE($B105,\"!D129\")))","v":99.190595984008084},null,null,{"$f":"IF(ISERROR(INDIRECT(CONCATENATE($B105,\"!D127\"))),\"\",INDIRECT(CONCATENATE($B105,\"!D127\")))","v":0},{"$f":"IF(ISERROR(INDIRECT(CONCATENATE($B105,\"!E122\"))),\"\",INDIRECT(CONCATENATE($B105,\"!E122\")))","v":100},{"$f":"IF(ISERROR(INDIRECT(CONCATENATE($B105,\"!E129\"))),\"\",INDIRECT(CONCATENATE($B105,\"!E129\")))","v":99.854001669351192},null,null,{"$f":"IF(ISERROR(INDIRECT(CONCATENATE($B105,\"!E127\"))),\"\",INDIRECT(CONCATENATE($B105,\"!E127\")))","v":0},{"$f":"IF(ISERROR(INDIRECT(CONCATENATE($B105,\"!F122\"))),\"\",INDIRECT(CONCATENATE($B105,\"!F122\")))","v":99.83989213335532},{"$f":"IF(ISERROR(INDIRECT(CONCATENATE($B105,\"!F129\"))),\"\",INDIRECT(CONCATENATE($B105,\"!F129\")))","v":99.678755591572553},null,null,{"$f":"IF(ISERROR(INDIRECT(CONCATENATE($B105,\"!F127\"))),\"\",INDIRECT(CONCATENATE($B105,\"!F127\")))","v":0},{"$f":"IF(ISERROR(INDIRECT(CONCATENATE($B105,\"!G122\"))),\"\",INDIRECT(CONCATENATE($B105,\"!G122\")))","v":99.839860918527918},{"$f":"IF(ISERROR(INDIRECT(CONCATENATE($B105,\"!G129\"))),\"\",INDIRECT(CONCATENATE($B105,\"!G129\")))","v":99.757524090294638},null,null,{"$f":"IF(ISERROR(INDIRECT(CONCATENATE($B105,\"!G2127\"))),\"\",INDIRECT(CONCATENATE($B105,\"!G127\")))","v":0}]
[null,"MICS13",2013,93.82910446468702,93.082829682838479,null,null,2.33231069463785,99.927387049910436,95.11182035672374,null,null,3.8752763369629649E-2,99.965660171304748,95.526080173445408,null,null,3.4339828695251422E-2,98.805991162828676,96.458662467008395,null,null,0,99.458267183364129,97.228686353536304,null,null,0]
[null,null,null,"","",null,null,"","","",null,null,"","","",null,null,"","","",null,null,"","","",null,null,""]
[null,null,null,"","",null,null,"","","",null,null,"","","",null,null,"","","",null,null,"","","",null,null,""]
[null,null,null,"","",null,null,"","","",null,null,"","","",null,null,"","","",null,null,"","","",null,null,""]
[null,null,null,"","",null,null,"","","",null,null,"","","",null,null,"","","",null,null,"","","",null,null,""]
[null,null,null,"","",null,null,"","","",null,null,"","","",null,null,"","","",null,null,"","","",null,null,""]
[null,null,null,"","",null,null,"","","",null,null,"","","",null,null,"","","",null,null,"","","",null,null,""]
[null,null,null,"","",null,null,"","","",null,null,"","","",null,null,"","","",null,null,"","","",null,null,""]
[null,null,null,"","",null,null,"","","",null,null,"","","",null,null,"","","",null,null,"","","",null,null,""]
[null,null,null,"","",null,null,"","","",null,null,"","","",null,null,"","","",null,null,"","","",null,null,""]
[null,null,null,"","",null,null,"","","",null,null,"","","",null,null,"","","",null,null,"","","",null,null,""]
[]
[null,{"$f":"CONCATENATE(\"National use of sanitation facilities, \",C99,\"–\",C100)","v":"National use of sanitation facilities, 2000–2019"},null,null,null,null,null,null,null,null,null,null,null,null,null,null,null,null,"Data points used for regression"]
[]
[]
[]
[]
[]
[]
[]
[]
[]
[]
[]
[]
[]
[]
[]
[]
[]
[]
[]
[]
[]
[]
[]
[]
[]
[]
[]
[]
[]
[]
[]
[]
[]
[]
[]
[]
[]
[]
[]
[]
[]
[]
[]
[]
[]
[]
[]
[]
[]
[]
[]
[]
[]
[]
[]
[]
[]
[]
[]
[]
[]
[]
[]
[]
[]
[]
[]
[]
[]
[]
[]
[]
[]
[]
[]
[]
[]
[]
["URBAN",null,null,"Poorest",null,null,null,null,"Poor",null,null,null,null,"Middle",null,null,null,null,"Rich",null,null,null,null,"Richest"]
[null,null,null,"Improved","Basic","Limited","Unimproved","Open defecation","Improved","Basic","Limited","Unimproved","Open defecation","Improved","Basic","Limited","Unimproved","Open defecation","Improved","Basic","Limited","Unimproved","Open defecation","Improved","Basic","Limited","Unimproved","Open defecation"]
["Forecast period:",null,{"$f":"MinBase(C205:C216)","v":2000},{"$f":"IF((D201+H201)>100,D201*100/(D201+H201),D201)","v":100},{"$f":"D199*AVERAGEIF(E205:E216,\">0\")/100","v":95.290130378988465},{"$f":"D199*(100-AVERAGEIF(E205:E216,\">0\"))/100","v":4.7098696210115349},{"$f":"100-(E199+F199+H199)","v":0},{"$f":"IF((D201+H201)>100,H201*100/(D201+H201),H201)","v":0},{"$f":"IF((I201+M201)>100,I201*100/(I201+M201),I201)","v":100},{"$f":"I199*AVERAGEIF(J205:J216,\">0\")/100","v":98.059822610189428},{"$f":"I199*(100-AVERAGEIF(J205:J216,\">0\"))/100","v":1.9401773898105859},{"$f":"100-(J199+K199+M199)","v":0},{"$f":"IF((I201+M201)>100,M201*100/(I201+M201),M201)","v":0},{"$f":"IF((N201+R201)>100,N201*100/(N201+R201),N201)","v":100},{"$f":"N199*AVERAGEIF(O205:O216,\">0\")/100","v":97.277709765749819},{"$f":"N199*(100-AVERAGEIF(O205:O216,\">0\"))/100","v":2.7222902342501811},{"$f":"100-(O199+P199+R199)","v":0},{"$f":"IF((N201+R201)>100,R201*100/(N201+R201),R201)","v":0},{"$f":"IF((S201+W201)>100,S201*100/(S201+W201),S201)","v":100},{"$f":"S199*AVERAGEIF(T205:T216,\">0\")/100","v":98.197169389922863},{"$f":"S199*(100-AVERAGEIF(T205:T216,\">0\"))/100","v":1.8028306100771374},{"$f":"100-(T199+U199+W199)","v":0},{"$f":"IF((S201+W201)>100,W201*100/(S201+W201),W201)","v":0},{"$f":"IF((X201+AB201)>100,X201*100/(X201+AB201),X201)","v":99.870161411769089},{"$f":"X199*AVERAGEIF(Y205:Y216,\">0\")/100","v":98.312524407921259},{"$f":"X199*(100-AVERAGEIF(Y205:Y216,\">0\"))/100","v":1.5576370038478169},{"$f":"100-(Y199+Z199+AB199)","v":0.12983858823092476},{"$f":"IF((X201+AB201)>100,AB201*100/(X201+AB201),AB201)","v":0}]
[null,null,{"$f":"MaxTarget(C205:C216)","v":2019},{"$f":"IF((D202+H202)>100,D202*100/(D202+H202),D202)","v":92.679925874079572},{"$f":"D200*AVERAGEIF(E205:E216,\">0\")/100","v":88.314822200560286},{"$f":"D200*(100-AVERAGEIF(E205:E216,\">0\"))/100","v":4.3651036735192834},{"$f":"100-(E200+F200+H200)","v":4.2898102840270553},{"$f":"IF((D202+H202)>100,H202*100/(D202+H202),H202)","v":3.0302638418933725},{"$f":"IF((I202+M202)>100,I202*100/(I202+M202),I202)","v":99.904133578156561},{"$f":"I200*AVERAGEIF(J205:J216,\">0\")/100","v":97.965816166987011},{"$f":"I200*(100-AVERAGEIF(J205:J216,\">0\"))/100","v":1.9383174111695589},{"$f":"100-(J200+K200+M200)","v":4.4631802627165484E-2},{"$f":"IF((I202+M202)>100,M202*100/(I202+M202),M202)","v":5.1234619216254274E-2},{"$f":"IF((N202+R202)>100,N202*100/(N202+R202),N202)","v":99.954397890244735},{"$f":"N200*AVERAGEIF(O205:O216,\">0\")/100","v":97.233349077775031},{"$f":"N200*(100-AVERAGEIF(O205:O216,\">0\"))/100","v":2.7210488124697014},{"$f":"100-(O200+P200+R200)","v":0},{"$f":"IF((N202+R202)>100,R202*100/(N202+R202),R202)","v":4.5602109755261466E-2},{"$f":"IF((S202+W202)>100,S202*100/(S202+W202),S202)","v":98.473038780920461},{"$f":"S200*AVERAGEIF(T205:T216,\">0\")/100","v":96.697736695104908},{"$f":"S200*(100-AVERAGEIF(T205:T216,\">0\"))/100","v":1.7753020858155646},{"$f":"100-(T200+U200+W200)","v":1.5269612190795243},{"$f":"IF((S202+W202)>100,W202*100/(S202+W202),W202)","v":0},{"$f":"IF((X202+AB202)>100,X202*100/(X202+AB202),X202)","v":99.326381911454945},{"$f":"X200*AVERAGEIF(Y205:Y216,\">0\")/100","v":97.777226030093061},{"$f":"X200*(100-AVERAGEIF(Y205:Y216,\">0\"))/100","v":1.5491558813618831},{"$f":"100-(Y200+Z200+AB200)","v":0.67361808854505512},{"$f":"IF((X202+AB202)>100,AB202*100/(X202+AB202),AB202)","v":0}]
["Regression period:",null,{"$f":"MinRegYear(C199,C205:C216)","v":2001},{"$f":"IF(MAX(C205:C216)-MIN(C205:C216)<5,AVERAGEIF(C205:C216,\">0\",D205:D216),\nIF(FORECAST($C201,D$205:D$216,$C$205:$C$216)<0,0,\nIF(FORECAST($C201,D$205:D$216,$C$205:$C$216)>100,100,\nFORECAST($C201,D$205:D$216,$C$205:$C$216))))","v":100},null,null,null,{"$f":"IF(MAX(C205:C216)-MIN(C205:C216)<5,AVERAGEIF(C205:C216,\">0\",H205:H216),\nIF(FORECAST($C201,H$205:H$216,$C$205:$C$216)<0,0,\nIF(FORECAST($C201,H$205:H$216,$C$205:$C$216)>100,100,\nFORECAST($C201,H$205:H$216,$C$205:$C$216))))","v":0},{"$f":"IF(MAX(C205:C216)-MIN(C205:C216)<5,AVERAGEIF(C205:C216,\">0\",I205:I216),\nIF(FORECAST($C201,I$205:I$216,$C$205:$C$216)<0,0,\nIF(FORECAST($C201,I$205:I$216,$C$205:$C$216)>100,100,\nFORECAST($C201,I$205:I$216,$C$205:$C$216))))","v":100},null,null,null,{"$f":"IF(MAX(C205:C216)-MIN(C205:C216)<5,AVERAGEIF(C205:C216,\">0\",M205:M216),\nIF(FORECAST($C201,M$205:M$216,$C$205:$C$216)<0,0,\nIF(FORECAST($C201,M$205:M$216,$C$205:$C$216)>100,100,\nFORECAST($C201,M$205:M$216,$C$205:$C$216))))","v":0},{"$f":"IF(MAX(C205:C216)-MIN(C205:C216)<5,AVERAGEIF(C205:C216,\">0\",N205:N216),\nIF(FORECAST($C201,N$205:N$216,$C$205:$C$216)<0,0,\nIF(FORECAST($C201,N$205:N$216,$C$205:$C$216)>100,100,\nFORECAST($C201,N$205:N$216,$C$205:$C$216))))","v":100},null,null,null,{"$f":"IF(MAX(C205:C216)-MIN(C205:C216)<5,AVERAGEIF(C205:C216,\">0\",R205:R216),\nIF(FORECAST($C201,R$205:R$216,$C$205:$C$216)<0,0,\nIF(FORECAST($C201,R$205:R$216,$C$205:$C$216)>100,100,\nFORECAST($C201,R$205:R$216,$C$205:$C$216))))","v":0},{"$f":"IF(MAX(C205:C216)-MIN(C205:C216)<5,AVERAGEIF(C205:C216,\">0\",S205:S216),\nIF(FORECAST($C201,S$205:S$216,$C$205:$C$216)<0,0,\nIF(FORECAST($C201,S$205:S$216,$C$205:$C$216)>100,100,\nFORECAST($C201,S$205:S$216,$C$205:$C$216))))","v":100},null,null,null,{"$f":"IF(MAX(C205:C216)-MIN(C205:C216)<5,AVERAGEIF(C205:C216,\">0\",W205:W216),\nIF(FORECAST($C201,W$205:W$216,$C$205:$C$216)<0,0,\nIF(FORECAST($C201,W$205:W$216,$C$205:$C$216)>100,100,\nFORECAST($C201,W$205:W$216,$C$205:$C$216))))","v":0},{"$f":"IF(MAX(C205:C216)-MIN(C205:C216)<5,AVERAGEIF(C205:C216,\">0\",X205:X216),\nIF(FORECAST($C201,X$205:X$216,$C$205:$C$216)<0,0,\nIF(FORECAST($C201,X$205:X$216,$C$205:$C$216)>100,100,\nFORECAST($C201,X$205:X$216,$C$205:$C$216))))","v":99.870161411769089},null,null,null,{"$f":"IF(MAX(C205:C216)-MIN(C205:C216)<5,AVERAGEIF(C205:C216,\">0\",AB205:AB216),\nIF(FORECAST($C201,AB$205:AB$216,$C$205:$C$216)<0,0,\nIF(FORECAST($C201,AB$205:AB$216,$C$205:$C$216)>100,100,\nFORECAST($C201,AB$205:AB$216,$C$205:$C$216))))","v":0}]
[null,null,{"$f":"MaxRegYear(C200,C205:C216)","v":2015},{"$f":"IF(MAX(C205:C216)-MIN(C205:C216)<5,AVERAGEIF(C205:C216,\">0\",D205:D216),\nIF(FORECAST($C202,D$205:D$216,$C$205:$C$216)<0,0,\nIF(FORECAST($C202,D$205:D$216,$C$205:$C$216)>100,100,\nFORECAST($C202,D$205:D$216,$C$205:$C$216))))","v":92.679925874079572},null,null,null,{"$f":"IF(MAX(C205:C216)-MIN(C205:C216)<5,AVERAGEIF(C205:C216,\">0\",H205:H216),\nIF(FORECAST($C202,H$205:H$216,$C$205:$C$216)<0,0,\nIF(FORECAST($C202,H$205:H$216,$C$205:$C$216)>100,100,\nFORECAST($C202,H$205:H$216,$C$205:$C$216))))","v":3.0302638418933725},{"$f":"IF(MAX(C205:C216)-MIN(C205:C216)<5,AVERAGEIF(C205:C216,\">0\",I205:I216),\nIF(FORECAST($C202,I$205:I$216,$C$205:$C$216)<0,0,\nIF(FORECAST($C202,I$205:I$216,$C$205:$C$216)>100,100,\nFORECAST($C202,I$205:I$216,$C$205:$C$216))))","v":99.904133578156561},null,null,null,{"$f":"IF(MAX(C205:C216)-MIN(C205:C216)<5,AVERAGEIF(C205:C216,\">0\",M205:M216),\nIF(FORECAST($C202,M$205:M$216,$C$205:$C$216)<0,0,\nIF(FORECAST($C202,M$205:M$216,$C$205:$C$216)>100,100,\nFORECAST($C202,M$205:M$216,$C$205:$C$216))))","v":5.1234619216254274E-2},{"$f":"IF(MAX(C205:C216)-MIN(C205:C216)<5,AVERAGEIF(C205:C216,\">0\",N205:N216),\nIF(FORECAST($C202,N$205:N$216,$C$205:$C$216)<0,0,\nIF(FORECAST($C202,N$205:N$216,$C$205:$C$216)>100,100,\nFORECAST($C202,N$205:N$216,$C$205:$C$216))))","v":99.954397890244735},null,null,null,{"$f":"IF(MAX(C205:C216)-MIN(C205:C216)<5,AVERAGEIF(C205:C216,\">0\",R205:R216),\nIF(FORECAST($C202,R$205:R$216,$C$205:$C$216)<0,0,\nIF(FORECAST($C202,R$205:R$216,$C$205:$C$216)>100,100,\nFORECAST($C202,R$205:R$216,$C$205:$C$216))))","v":4.5602109755261466E-2},{"$f":"IF(MAX(C205:C216)-MIN(C205:C216)<5,AVERAGEIF(C205:C216,\">0\",S205:S216),\nIF(FORECAST($C202,S$205:S$216,$C$205:$C$216)<0,0,\nIF(FORECAST($C202,S$205:S$216,$C$205:$C$216)>100,100,\nFORECAST($C202,S$205:S$216,$C$205:$C$216))))","v":98.473038780920461},null,null,null,{"$f":"IF(MAX(C205:C216)-MIN(C205:C216)<5,AVERAGEIF(C205:C216,\">0\",W205:W216),\nIF(FORECAST($C202,W$205:W$216,$C$205:$C$216)<0,0,\nIF(FORECAST($C202,W$205:W$216,$C$205:$C$216)>100,100,\nFORECAST($C202,W$205:W$216,$C$205:$C$216))))","v":0},{"$f":"IF(MAX(C205:C216)-MIN(C205:C216)<5,AVERAGEIF(C205:C216,\">0\",X205:X216),\nIF(FORECAST($C202,X$205:X$216,$C$205:$C$216)<0,0,\nIF(FORECAST($C202,X$205:X$216,$C$205:$C$216)>100,100,\nFORECAST($C202,X$205:X$216,$C$205:$C$216))))","v":99.326381911454945},null,null,null,{"$f":"IF(MAX(C205:C216)-MIN(C205:C216)<5,AVERAGEIF(C205:C216,\">0\",AB205:AB216),\nIF(FORECAST($C202,AB$205:AB$216,$C$205:$C$216)<0,0,\nIF(FORECAST($C202,AB$205:AB$216,$C$205:$C$216)>100,100,\nFORECAST($C202,AB$205:AB$216,$C$205:$C$216))))","v":0}]
[]
[null,"Survey","Year","Improved","Not shared",null,null,"Open defecation","Improved","Not shared",null,null,"Open defecation","Improved","Not shared",null,null,"Open defecation","Improved","Not shared",null,null,"Open defecation","Improved","Not shared",null,null,"Open defecation"]
[null,"WHS03",2003,{"$f":"IF(ISERROR(INDIRECT(CONCATENATE($B205,\"!H122\"))),\"\",INDIRECT(CONCATENATE($B205,\"!H122\")))","v":100},{"$f":"IF(ISERROR(INDIRECT(CONCATENATE($B205,\"!H129\"))),\"\",INDIRECT(CONCATENATE($B205,\"!H129\")))","v":99.092426789364268},null,null,{"$f":"IF(ISERROR(INDIRECT(CONCATENATE($B205,\"!H127\"))),\"\",INDIRECT(CONCATENATE($B205,\"!H127\")))","v":0},{"$f":"IF(ISERROR(INDIRECT(CONCATENATE($B205,\"!I122\"))),\"\",INDIRECT(CONCATENATE($B205,\"!I122\")))","v":100},{"$f":"IF(ISERROR(INDIRECT(CONCATENATE($B205,\"!I129\"))),\"\",INDIRECT(CONCATENATE($B205,\"!I129\")))","v":99.453216649444116},null,null,{"$f":"IF(ISERROR(INDIRECT(CONCATENATE($B205,\"!I127\"))),\"\",INDIRECT(CONCATENATE($B205,\"!I127\")))","v":0},{"$f":"IF(ISERROR(INDIRECT(CONCATENATE($B205,\"!J122\"))),\"\",INDIRECT(CONCATENATE($B205,\"!J122\")))","v":100},{"$f":"IF(ISERROR(INDIRECT(CONCATENATE($B205,\"!J129\"))),\"\",INDIRECT(CONCATENATE($B205,\"!J129\")))","v":99.604514180650511},null,null,{"$f":"IF(ISERROR(INDIRECT(CONCATENATE($B205,\"!J127\"))),\"\",INDIRECT(CONCATENATE($B205,\"!J127\")))","v":0},{"$f":"IF(ISERROR(INDIRECT(CONCATENATE($B205,\"!K122\"))),\"\",INDIRECT(CONCATENATE($B205,\"!K122\")))","v":99.792765301003229},{"$f":"IF(ISERROR(INDIRECT(CONCATENATE($B205,\"!K129\"))),\"\",INDIRECT(CONCATENATE($B205,\"!K129\")))","v":99.606337130437808},null,null,{"$f":"IF(ISERROR(INDIRECT(CONCATENATE($B205,\"!K127\"))),\"\",INDIRECT(CONCATENATE($B205,\"!K127\")))","v":0},{"$f":"IF(ISERROR(INDIRECT(CONCATENATE($B205,\"!L122\"))),\"\",INDIRECT(CONCATENATE($B205,\"!L122\")))","v":99.792478626009924},{"$f":"IF(ISERROR(INDIRECT(CONCATENATE($B205,\"!L129\"))),\"\",INDIRECT(CONCATENATE($B205,\"!L129\")))","v":99.87157185846867},null,null,{"$f":"IF(ISERROR(INDIRECT(CONCATENATE($B205,\"!L2127\"))),\"\",INDIRECT(CONCATENATE($B205,\"!L127\")))","v":0}]
[null,"MICS13",2013,93.899938228399776,91.487833968612648,null,null,2.5252198682445046,99.92011131513047,96.666428570934713,null,null,4.2695516013546368E-2,99.961998241870603,94.950905350849141,null,null,3.8001758129385284E-2,98.692993200934239,96.788001649407903,null,null,0,99.404064697214096,97.009104047469634,null,null,0]
[null,null,null,"","",null,null,"","","",null,null,"","","",null,null,"","","",null,null,"","","",null,null,""]
[null,null,null,"","",null,null,"","","",null,null,"","","",null,null,"","","",null,null,"","","",null,null,""]
[null,null,null,"","",null,null,"","","",null,null,"","","",null,null,"","","",null,null,"","","",null,null,""]
[null,null,null,"","",null,null,"","","",null,null,"","","",null,null,"","","",null,null,"","","",null,null,""]
[null,null,null,"","",null,null,"","","",null,null,"","","",null,null,"","","",null,null,"","","",null,null,""]
[null,null,null,"","",null,null,"","","",null,null,"","","",null,null,"","","",null,null,"","","",null,null,""]
[null,null,null,"","",null,null,"","","",null,null,"","","",null,null,"","","",null,null,"","","",null,null,""]
[null,null,null,"","",null,null,"","","",null,null,"","","",null,null,"","","",null,null,"","","",null,null,""]
[null,null,null,"","",null,null,"","","",null,null,"","","",null,null,"","","",null,null,"","","",null,null,""]
[null,null,null,"","",null,null,"","","",null,null,"","","",null,null,"","","",null,null,"","","",null,null,""]
[]
[null,{"$f":"CONCATENATE(\"Urban use of sanitation facilities, \",C199,\"–\",C200)","v":"Urban use of sanitation facilities, 2000–2019"},null,null,null,null,null,null,null,null,null,null,null,null,null,null,null,null,"Data points used for regression"]
[]
[]
[]
[]
[]
[]
[]
[]
[]
[]
[]
[]
[]
[]
[]
[]
[]
[]
[]
[]
[]
[]
[]
[]
[]
[]
[]
[]
[]
[]
[]
[]
[]
[]
[]
[]
[]
[]
[]
[]
[]
[]
[]
[]
[]
[]
[]
[]
[]
[]
[]
[]
[]
[]
[]
[]
[]
[]
[]
[]
[]
[]
[]
[]
[]
[]
[]
[]
[]
[]
[]
[]
[]
[]
[]
[]
[]
[]
["RURAL",null,null,"Poorest",null,null,null,null,"Poor",null,null,null,null,"Middle",null,null,null,null,"Rich",null,null,null,null,"Richest"]
[null,null,null,"Improved","Basic","Limited","Unimproved","Open defecation","Improved","Basic","Limited","Unimproved","Open defecation","Improved","Basic","Limited","Unimproved","Open defecation","Improved","Basic","Limited","Unimproved","Open defecation","Improved","Basic","Limited","Unimproved","Open defecation"]
["Forecast period:",null,{"$f":"MinBase(C305:C316)","v":2000},{"$f":"IF((D301+H301)>100,D301*100/(D301+H301),D301)","v":100},{"$f":"D299*AVERAGEIF(E305:E316,\">0\")/100","v":93.204948575975578},{"$f":"D299*(100-AVERAGEIF(E305:E316,\">0\"))/100","v":6.7950514240244217},{"$f":"100-(E299+F299+H299)","v":0},{"$f":"IF((D301+H301)>100,H301*100/(D301+H301),H301)","v":0},{"$f":"IF((I301+M301)>100,I301*100/(I301+M301),I301)","v":100},{"$f":"I299*AVERAGEIF(J305:J316,\">0\")/100","v":96.668033007953824},{"$f":"I299*(100-AVERAGEIF(J305:J316,\">0\"))/100","v":3.3319669920461905},{"$f":"100-(J299+K299+M299)","v":0},{"$f":"IF((I301+M301)>100,M301*100/(I301+M301),M301)","v":0},{"$f":"IF((N301+R301)>100,N301*100/(N301+R301),N301)","v":99.393968881472361},{"$f":"N299*AVERAGEIF(O305:O316,\">0\")/100","v":98.583602244802847},{"$f":"N299*(100-AVERAGEIF(O305:O316,\">0\"))/100","v":0.81036663666951791},{"$f":"100-(O299+P299+R299)","v":0.60603111852763902},{"$f":"IF((N301+R301)>100,R301*100/(N301+R301),R301)","v":0},{"$f":"IF((S301+W301)>100,S301*100/(S301+W301),S301)","v":100},{"$f":"S299*AVERAGEIF(T305:T316,\">0\")/100","v":98.82755421212714},{"$f":"S299*(100-AVERAGEIF(T305:T316,\">0\"))/100","v":1.17244578787286},{"$f":"100-(T299+U299+W299)","v":0},{"$f":"IF((S301+W301)>100,W301*100/(S301+W301),W301)","v":0},{"$f":"IF((X301+AB301)>100,X301*100/(X301+AB301),X301)","v":100},{"$f":"X299*AVERAGEIF(Y305:Y316,\">0\")/100","v":99.161369593592283},{"$f":"X299*(100-AVERAGEIF(Y305:Y316,\">0\"))/100","v":0.83863040640771658},{"$f":"100-(Y299+Z299+AB299)","v":0},{"$f":"IF((X301+AB301)>100,AB301*100/(X301+AB301),AB301)","v":0}]
[null,null,{"$f":"MaxTarget(C305:C316)","v":2019},{"$f":"IF((D302+H302)>100,D302*100/(D302+H302),D302)","v":92.290457307507722},{"$f":"D300*AVERAGEIF(E305:E316,\">0\")/100","v":86.019273273995253},{"$f":"D300*(100-AVERAGEIF(E305:E316,\">0\"))/100","v":6.271184033512454},{"$f":"100-(E300+F300+H300)","v":7.2535636270629595},{"$f":"IF((D302+H302)>100,H302*100/(D302+H302),H302)","v":0.45597906542933231},{"$f":"IF((I302+M302)>100,I302*100/(I302+M302),I302)","v":99.643818151489242},{"$f":"I300*AVERAGEIF(J305:J316,\">0\")/100","v":96.323719021067078},{"$f":"I300*(100-AVERAGEIF(J305:J316,\">0\"))/100","v":3.3200991304221521},{"$f":"100-(J300+K300+M300)","v":0.35618184851077217},{"$f":"IF((I302+M302)>100,M302*100/(I302+M302),M302)","v":0},{"$f":"IF((N302+R302)>100,N302*100/(N302+R302),N302)","v":100},{"$f":"N300*AVERAGEIF(O305:O316,\">0\")/100","v":99.184692345230857},{"$f":"N300*(100-AVERAGEIF(O305:O316,\">0\"))/100","v":0.8153076547691569},{"$f":"100-(O300+P300+R300)","v":0},{"$f":"IF((N302+R302)>100,R302*100/(N302+R302),R302)","v":0},{"$f":"IF((S302+W302)>100,S302*100/(S302+W302),S302)","v":100},{"$f":"S300*AVERAGEIF(T305:T316,\">0\")/100","v":98.82755421212714},{"$f":"S300*(100-AVERAGEIF(T305:T316,\">0\"))/100","v":1.17244578787286},{"$f":"100-(T300+U300+W300)","v":0},{"$f":"IF((S302+W302)>100,W302*100/(S302+W302),W302)","v":0},{"$f":"IF((X302+AB302)>100,X302*100/(X302+AB302),X302)","v":100},{"$f":"X300*AVERAGEIF(Y305:Y316,\">0\")/100","v":99.161369593592283},{"$f":"X300*(100-AVERAGEIF(Y305:Y316,\">0\"))/100","v":0.83863040640771658},{"$f":"100-(Y300+Z300+AB300)","v":0},{"$f":"IF((X302+AB302)>100,AB302*100/(X302+AB302),AB302)","v":0}]
["Regression period:",null,{"$f":"MinRegYear(C299,C305:C316)","v":2001},{"$f":"IF(MAX(C305:C316)-MIN(C305:C316)<5,AVERAGEIF(C305:C316,\">0\",D305:D316),\nIF(FORECAST($C301,D$305:D$316,$C$305:$C$316)<0,0,\nIF(FORECAST($C301,D$305:D$316,$C$305:$C$316)>100,100,\nFORECAST($C301,D$305:D$316,$C$305:$C$316))))","v":100},null,null,null,{"$f":"IF(MAX(C305:C316)-MIN(C305:C316)<5,AVERAGEIF(C305:C316,\">0\",H305:H316),\nIF(FORECAST($C301,H$305:H$316,$C$305:$C$316)<0,0,\nIF(FORECAST($C301,H$305:H$316,$C$305:$C$316)>100,100,\nFORECAST($C301,H$305:H$316,$C$305:$C$316))))","v":0},{"$f":"IF(MAX(C305:C316)-MIN(C305:C316)<5,AVERAGEIF(C305:C316,\">0\",I305:I316),\nIF(FORECAST($C301,I$305:I$316,$C$305:$C$316)<0,0,\nIF(FORECAST($C301,I$305:I$316,$C$305:$C$316)>100,100,\nFORECAST($C301,I$305:I$316,$C$305:$C$316))))","v":100},null,null,null,{"$f":"IF(MAX(C305:C316)-MIN(C305:C316)<5,AVERAGEIF(C305:C316,\">0\",M305:M316),\nIF(FORECAST($C301,M$305:M$316,$C$305:$C$316)<0,0,\nIF(FORECAST($C301,M$305:M$316,$C$305:$C$316)>100,100,\nFORECAST($C301,M$305:M$316,$C$305:$C$316))))","v":0},{"$f":"IF(MAX(C305:C316)-MIN(C305:C316)<5,AVERAGEIF(C305:C316,\">0\",N305:N316),\nIF(FORECAST($C301,N$305:N$316,$C$305:$C$316)<0,0,\nIF(FORECAST($C301,N$305:N$316,$C$305:$C$316)>100,100,\nFORECAST($C301,N$305:N$316,$C$305:$C$316))))","v":99.393968881472361},null,null,null,{"$f":"IF(MAX(C305:C316)-MIN(C305:C316)<5,AVERAGEIF(C305:C316,\">0\",R305:R316),\nIF(FORECAST($C301,R$305:R$316,$C$305:$C$316)<0,0,\nIF(FORECAST($C301,R$305:R$316,$C$305:$C$316)>100,100,\nFORECAST($C301,R$305:R$316,$C$305:$C$316))))","v":0},{"$f":"IF(MAX(C305:C316)-MIN(C305:C316)<5,AVERAGEIF(C305:C316,\">0\",S305:S316),\nIF(FORECAST($C301,S$305:S$316,$C$305:$C$316)<0,0,\nIF(FORECAST($C301,S$305:S$316,$C$305:$C$316)>100,100,\nFORECAST($C301,S$305:S$316,$C$305:$C$316))))","v":100},null,null,null,{"$f":"IF(MAX(C305:C316)-MIN(C305:C316)<5,AVERAGEIF(C305:C316,\">0\",W305:W316),\nIF(FORECAST($C301,W$305:W$316,$C$305:$C$316)<0,0,\nIF(FORECAST($C301,W$305:W$316,$C$305:$C$316)>100,100,\nFORECAST($C301,W$305:W$316,$C$305:$C$316))))","v":0},{"$f":"IF(MAX(C305:C316)-MIN(C305:C316)<5,AVERAGEIF(C305:C316,\">0\",X305:X316),\nIF(FORECAST($C301,X$305:X$316,$C$305:$C$316)<0,0,\nIF(FORECAST($C301,X$305:X$316,$C$305:$C$316)>100,100,\nFORECAST($C301,X$305:X$316,$C$305:$C$316))))","v":100},null,null,null,{"$f":"IF(MAX(C305:C316)-MIN(C305:C316)<5,AVERAGEIF(C305:C316,\">0\",AB305:AB316),\nIF(FORECAST($C301,AB$305:AB$316,$C$305:$C$316)<0,0,\nIF(FORECAST($C301,AB$305:AB$316,$C$305:$C$316)>100,100,\nFORECAST($C301,AB$305:AB$316,$C$305:$C$316))))","v":0}]
[null,null,{"$f":"MaxRegYear(C300,C305:C316)","v":2015},{"$f":"IF(MAX(C305:C316)-MIN(C305:C316)<5,AVERAGEIF(C305:C316,\">0\",D305:D316),\nIF(FORECAST($C302,D$305:D$316,$C$305:$C$316)<0,0,\nIF(FORECAST($C302,D$305:D$316,$C$305:$C$316)>100,100,\nFORECAST($C302,D$305:D$316,$C$305:$C$316))))","v":92.290457307507722},null,null,null,{"$f":"IF(MAX(C305:C316)-MIN(C305:C316)<5,AVERAGEIF(C305:C316,\">0\",H305:H316),\nIF(FORECAST($C302,H$305:H$316,$C$305:$C$316)<0,0,\nIF(FORECAST($C302,H$305:H$316,$C$305:$C$316)>100,100,\nFORECAST($C302,H$305:H$316,$C$305:$C$316))))","v":0.45597906542933231},{"$f":"IF(MAX(C305:C316)-MIN(C305:C316)<5,AVERAGEIF(C305:C316,\">0\",I305:I316),\nIF(FORECAST($C302,I$305:I$316,$C$305:$C$316)<0,0,\nIF(FORECAST($C302,I$305:I$316,$C$305:$C$316)>100,100,\nFORECAST($C302,I$305:I$316,$C$305:$C$316))))","v":99.643818151489242},null,null,null,{"$f":"IF(MAX(C305:C316)-MIN(C305:C316)<5,AVERAGEIF(C305:C316,\">0\",M305:M316),\nIF(FORECAST($C302,M$305:M$316,$C$305:$C$316)<0,0,\nIF(FORECAST($C302,M$305:M$316,$C$305:$C$316)>100,100,\nFORECAST($C302,M$305:M$316,$C$305:$C$316))))","v":0},{"$f":"IF(MAX(C305:C316)-MIN(C305:C316)<5,AVERAGEIF(C305:C316,\">0\",N305:N316),\nIF(FORECAST($C302,N$305:N$316,$C$305:$C$316)<0,0,\nIF(FORECAST($C302,N$305:N$316,$C$305:$C$316)>100,100,\nFORECAST($C302,N$305:N$316,$C$305:$C$316))))","v":100},null,null,null,{"$f":"IF(MAX(C305:C316)-MIN(C305:C316)<5,AVERAGEIF(C305:C316,\">0\",R305:R316),\nIF(FORECAST($C302,R$305:R$316,$C$305:$C$316)<0,0,\nIF(FORECAST($C302,R$305:R$316,$C$305:$C$316)>100,100,\nFORECAST($C302,R$305:R$316,$C$305:$C$316))))","v":0},{"$f":"IF(MAX(C305:C316)-MIN(C305:C316)<5,AVERAGEIF(C305:C316,\">0\",S305:S316),\nIF(FORECAST($C302,S$305:S$316,$C$305:$C$316)<0,0,\nIF(FORECAST($C302,S$305:S$316,$C$305:$C$316)>100,100,\nFORECAST($C302,S$305:S$316,$C$305:$C$316))))","v":100},null,null,null,{"$f":"IF(MAX(C305:C316)-MIN(C305:C316)<5,AVERAGEIF(C305:C316,\">0\",W305:W316),\nIF(FORECAST($C302,W$305:W$316,$C$305:$C$316)<0,0,\nIF(FORECAST($C302,W$305:W$316,$C$305:$C$316)>100,100,\nFORECAST($C302,W$305:W$316,$C$305:$C$316))))","v":0},{"$f":"IF(MAX(C305:C316)-MIN(C305:C316)<5,AVERAGEIF(C305:C316,\">0\",X305:X316),\nIF(FORECAST($C302,X$305:X$316,$C$305:$C$316)<0,0,\nIF(FORECAST($C302,X$305:X$316,$C$305:$C$316)>100,100,\nFORECAST($C302,X$305:X$316,$C$305:$C$316))))","v":100},null,null,null,{"$f":"IF(MAX(C305:C316)-MIN(C305:C316)<5,AVERAGEIF(C305:C316,\">0\",AB305:AB316),\nIF(FORECAST($C302,AB$305:AB$316,$C$305:$C$316)<0,0,\nIF(FORECAST($C302,AB$305:AB$316,$C$305:$C$316)>100,100,\nFORECAST($C302,AB$305:AB$316,$C$305:$C$316))))","v":0}]
[]
[null,"Survey","Year","Improved","Not shared",null,null,"Open defecation","Improved","Not shared",null,null,"Open defecation","Improved","Not shared",null,null,"Open defecation","Improved","Not shared",null,null,"Open defecation","Improved","Not shared",null,null,"Open defecation"]
[null,"WHS03",2003,{"$f":"IF(ISERROR(INDIRECT(CONCATENATE($B305,\"!M122\"))),\"\",INDIRECT(CONCATENATE($B305,\"!M122\")))","v":99.316537578806262},{"$f":"IF(ISERROR(INDIRECT(CONCATENATE($B305,\"!M129\"))),\"\",INDIRECT(CONCATENATE($B305,\"!M129\")))","v":94.329865942774902},null,null,{"$f":"IF(ISERROR(INDIRECT(CONCATENATE($B305,\"!M127\"))),\"\",INDIRECT(CONCATENATE($B305,\"!M127\")))","v":0},{"$f":"IF(ISERROR(INDIRECT(CONCATENATE($B305,\"!N122\"))),\"\",INDIRECT(CONCATENATE($B305,\"!N122\")))","v":100},{"$f":"IF(ISERROR(INDIRECT(CONCATENATE($B305,\"!N129\"))),\"\",INDIRECT(CONCATENATE($B305,\"!N129\")))","v":98.645381758198837},null,null,{"$f":"IF(ISERROR(INDIRECT(CONCATENATE($B305,\"!N127\"))),\"\",INDIRECT(CONCATENATE($B305,\"!N127\")))","v":0},{"$f":"IF(ISERROR(INDIRECT(CONCATENATE($B305,\"!O122\"))),\"\",INDIRECT(CONCATENATE($B305,\"!O122\")))","v":99.494974067893637},{"$f":"IF(ISERROR(INDIRECT(CONCATENATE($B305,\"!O129\"))),\"\",INDIRECT(CONCATENATE($B305,\"!O129\")))","v":99.354598834563419},null,null,{"$f":"IF(ISERROR(INDIRECT(CONCATENATE($B305,\"!O127\"))),\"\",INDIRECT(CONCATENATE($B305,\"!O127\")))","v":0},{"$f":"IF(ISERROR(INDIRECT(CONCATENATE($B305,\"!P122\"))),\"\",INDIRECT(CONCATENATE($B305,\"!P122\")))","v":100},{"$f":"IF(ISERROR(INDIRECT(CONCATENATE($B305,\"!P129\"))),\"\",INDIRECT(CONCATENATE($B305,\"!P129\")))","v":100},null,null,{"$f":"IF(ISERROR(INDIRECT(CONCATENATE($B305,\"!P127\"))),\"\",INDIRECT(CONCATENATE($B305,\"!P127\")))","v":0},{"$f":"IF(ISERROR(INDIRECT(CONCATENATE($B305,\"!Q122\"))),\"\",INDIRECT(CONCATENATE($B305,\"!Q122\")))","v":100},{"$f":"IF(ISERROR(INDIRECT(CONCATENATE($B305,\"!Q129\"))),\"\",INDIRECT(CONCATENATE($B305,\"!Q129\")))","v":100},null,null,{"$f":"IF(ISERROR(INDIRECT(CONCATENATE($B305,\"!Q2127\"))),\"\",INDIRECT(CONCATENATE($B305,\"!Q127\")))","v":0}]
[null,"MICS13",2013,93.461470686057368,92.080031209176241,null,null,0.37998255452445079,99.703181792907714,94.690684257708782,null,null,0,100,99.014785855898282,null,null,0,100,97.65510842425428,null,null,0,100,98.322739187184567,null,null,0]
[null,null,null,"","",null,null,"","","",null,null,"","","",null,null,"","","",null,null,"","","",null,null,""]
[null,null,null,"","",null,null,"","","",null,null,"","","",null,null,"","","",null,null,"","","",null,null,""]
[null,null,null,"","",null,null,"","","",null,null,"","","",null,null,"","","",null,null,"","","",null,null,""]
[null,null,null,"","",null,null,"","","",null,null,"","","",null,null,"","","",null,null,"","","",null,null,""]
[null,null,null,"","",null,null,"","","",null,null,"","","",null,null,"","","",null,null,"","","",null,null,""]
[null,null,null,"","",null,null,"","","",null,null,"","","",null,null,"","","",null,null,"","","",null,null,""]
[null,null,null,"","",null,null,"","","",null,null,"","","",null,null,"","","",null,null,"","","",null,null,""]
[null,null,null,"","",null,null,"","","",null,null,"","","",null,null,"","","",null,null,"","","",null,null,""]
[null,null,null,"","",null,null,"","","",null,null,"","","",null,null,"","","",null,null,"","","",null,null,""]
[null,null,null,"","",null,null,"","","",null,null,"","","",null,null,"","","",null,null,"","","",null,null,""]
[]
[null,{"$f":"CONCATENATE(\"Rural use of sanitation facilities, \",C299,\"–\",C300)","v":"Rural use of sanitation facilities, 2000–2019"},null,null,null,null,null,null,null,null,null,null,null,null,null,null,null,null,"Data points used for regression"]

{"sheet":"Hygiene","index":3,"n_rows":90,"n_cols":25,"rows_kept":90,"cut":false,"hidden":false,"merged":[[6,1,6,7],[3,1,3,24],[4,1,4,24],[33,1,34,3],[31,6,32,9],[31,10,31,12],[31,13,31,15],[6,10,6,15],[6,18,6,23],[33,19,34,19],[31,16,31,18],[31,19,31,21],[31,22,31,24],[33,6,34,7],[33,8,34,8],[33,9,34,9],[33,15,34,15],[33,16,34,16],[33,17,34,17],[33,18,34,18],[36,6,37,7],[36,8,37,8],[36,9,37,9],[36,10,37,10],[36,11,37,11],[33,10,34,10],[33,11,34,11],[33,12,34,12],[33,13,34,13],[33,14,34,14],[33,20,34,20],[33,21,34,21],[33,22,34,22],[33,23,34,23],[33,24,34,24],[36,19,37,19],[36,20,37,20],[36,21,37,21],[36,22,37,22],[36,23,37,23],[39,12,40,12],[39,13,40,13],[39,14,40,14],[39,15,40,15],[36,18,37,18],[36,12,37,12],[36,13,37,13],[36,14,37,14],[36,15,37,15],[36,16,37,16],[36,17,37,17],[39,22,40,22],[39,23,40,23],[39,24,40,24],[31,4,32,5],[39,16,40,16],[39,17,40,17],[39,18,40,18],[39,19,40,19],[39,20,40,20],[39,21,40,21],[36,24,37,24],[39,6,40,7],[39,8,40,8],[39,9,40,9],[39,10,40,10],[39,11,40,11]]}
[]
[]
[]
[null,"Access to hygiene facilities by wealth quintile (%)"]
[null,{"$f":"IF(ISERROR(INDIRECT(CONCATENATE($E$32,\"!A2\"))),\"\",INDIRECT(CONCATENATE($E$32,\"!A2\")))","v":"Uruguay"}]
[]
[null,{"$f":"CONCATENATE(\"National \",IF(ISERROR(INDIRECT(CONCATENATE($E$32,\"!A2\"))),\"\",INDIRECT(CONCATENATE($E$32,\"!A210\"))))","v":"National Access to hygiene facilities "},null,null,null,null,null,null,null,null,{"$f":"CONCATENATE(\"Urban \",IF(ISERROR(INDIRECT(CONCATENATE($E$32,\"!A2\"))),\"\",INDIRECT(CONCATENATE($E$32,\"!A210\"))))","v":"Urban Access to hygiene facilities "},null,null,null,null,null,null,null,{"$f":"CONCATENATE(\"Rural \",IF(ISERROR(INDIRECT(CONCATENATE($E$32,\"!A2\"))),\"\",INDIRECT(CONCATENATE($E$32,\"!A210\"))))","v":"Rural Access to hygiene facilities "}]
[]
[]
[]
[]
[]
[]
[]
[]
[]
[]
[]
[]
[]
[]
[]
[]
[]
[]
[]
[]
[]
[]
[]
[]
[null,null,null,null,{"$f":"INDEX(B88:B100,A88)","v":"MICS13"},null,{"$f":"IF(ISERROR(INDIRECT(CONCATENATE($E$32,\"!A2\"))),\"\",INDIRECT(CONCATENATE($E$32,\"!A2\")))","v":"Uruguay"},null,null,null,"Poorest",null,null,"Poor",null,null,"Middle",null,null,"Rich",null,null,"Richest"]
[null,null,null,null,null,null,null,null,null,null,"Basic","Limited","No facility","Basic","Limited","No facility","Basic","Limited","No facility","Basic","Limited","No facility","Basic","Limited","No facility"]
[null,">>>  Select Survey :   ",null,null,null,null,"NATIONAL",null,null,{"$f":"IF(ISERROR(INDIRECT(CONCATENATE(#REF!,\"!A2\"))),\"\",INDIRECT(CONCATENATE(#REF!,\"!A210\")))","v":""},{"$f":"IF(ISERROR(INDIRECT(CONCATENATE($E$32,\"!C222\"))),\"\",INDIRECT(CONCATENATE($E$32,\"!C222\")))","v":"N/A"},{"$f":"IF(ISERROR(INDIRECT(CONCATENATE($E$32,\"!C223\"))),\"\",INDIRECT(CONCATENATE($E$32,\"!C223\")))","v":"N/A"},{"$f":"IF(ISERROR(INDIRECT(CONCATENATE($E$32,\"!C224\"))),\"\",INDIRECT(CONCATENATE($E$32,\"!C224\")))","v":"N/A"},{"$f":"IF(ISERROR(INDIRECT(CONCATENATE($E$32,\"!D222\"))),\"\",INDIRECT(CONCATENATE($E$32,\"!D222\")))","v":"N/A"},{"$f":"IF(ISERROR(INDIRECT(CONCATENATE($E$32,\"!D223\"))),\"\",INDIRECT(CONCATENATE($E$32,\"!D223\")))","v":"N/A"},{"$f":"IF(ISERROR(INDIRECT(CONCATENATE($E$32,\"!D224\"))),\"\",INDIRECT(CONCATENATE($E$32,\"!D224\")))","v":"N/A"},{"$f":"IF(ISERROR(INDIRECT(CONCATENATE($E$32,\"!E222\"))),\"\",INDIRECT(CONCATENATE($E$32,\"!E222\")))","v":"N/A"},{"$f":"IF(ISERROR(INDIRECT(CONCATENATE($E$32,\"!E223\"))),\"\",INDIRECT(CONCATENATE($E$32,\"!E223\")))","v":"N/A"},{"$f":"IF(ISERROR(INDIRECT(CONCATENATE($E$32,\"!E224\"))),\"\",INDIRECT(CONCATENATE($E$32,\"!E224\")))","v":"N/A"},{"$f":"IF(ISERROR(INDIRECT(CONCATENATE($E$32,\"!F222\"))),\"\",INDIRECT(CONCATENATE($E$32,\"!F222\")))","v":"N/A"},{"$f":"IF(ISERROR(INDIRECT(CONCATENATE($E$32,\"!F223\"))),\"\",INDIRECT(CONCATENATE($E$32,\"!F223\")))","v":"N/A"},{"$f":"IF(ISERROR(INDIRECT(CONCATENATE($E$32,\"!F224\"))),\"\",INDIRECT(CONCATENATE($E$32,\"!F224\")))","v":"N/A"},{"$f":"IF(ISERROR(INDIRECT(CONCATENATE($E$32,\"!G222\"))),\"\",INDIRECT(CONCATENATE($E$32,\"!G222\")))","v":"N/A"},{"$f":"IF(ISERROR(INDIRECT(CONCATENATE($E$32,\"!G223\"))),\"\",INDIRECT(CONCATENATE($E$32,\"!G223\")))","v":"N/A"},{"$f":"IF(ISERROR(INDIRECT(CONCATENATE($E$32,\"!G224\"))),\"\",INDIRECT(CONCATENATE($E$32,\"!G224\")))","v":"N/A"}]
[]
[]
[null,null,null,null,null,null,"URBAN",null,null,{"$f":"IF(ISERROR(INDIRECT(CONCATENATE(#REF!,\"!A2\"))),\"\",INDIRECT(CONCATENATE(#REF!,\"!A210\")))","v":""},{"$f":"IF(ISERROR(INDIRECT(CONCATENATE($E$32,\"!H222\"))),\"\",INDIRECT(CONCATENATE($E$32,\"!H222\")))","v":"N/A"},{"$f":"IF(ISERROR(INDIRECT(CONCATENATE($E$32,\"!H223\"))),\"\",INDIRECT(CONCATENATE($E$32,\"!H223\")))","v":"N/A"},{"$f":"IF(ISERROR(INDIRECT(CONCATENATE($E$32,\"!H224\"))),\"\",INDIRECT(CONCATENATE($E$32,\"!H224\")))","v":"N/A"},{"$f":"IF(ISERROR(INDIRECT(CONCATENATE($E$32,\"!I222\"))),\"\",INDIRECT(CONCATENATE($E$32,\"!I222\")))","v":"N/A"},{"$f":"IF(ISERROR(INDIRECT(CONCATENATE($E$32,\"!I223\"))),\"\",INDIRECT(CONCATENATE($E$32,\"!I223\")))","v":"N/A"},{"$f":"IF(ISERROR(INDIRECT(CONCATENATE($E$32,\"!I224\"))),\"\",INDIRECT(CONCATENATE($E$32,\"!I224\")))","v":"N/A"},{"$f":"IF(ISERROR(INDIRECT(CONCATENATE($E$32,\"!J222\"))),\"\",INDIRECT(CONCATENATE($E$32,\"!J222\")))","v":"N/A"},{"$f":"IF(ISERROR(INDIRECT(CONCATENATE($E$32,\"!J223\"))),\"\",INDIRECT(CONCATENATE($E$32,\"!J223\")))","v":"N/A"},{"$f":"IF(ISERROR(INDIRECT(CONCATENATE($E$32,\"!J224\"))),\"\",INDIRECT(CONCATENATE($E$32,\"!J224\")))","v":"N/A"},{"$f":"IF(ISERROR(INDIRECT(CONCATENATE($E$32,\"!K222\"))),\"\",INDIRECT(CONCATENATE($E$32,\"!K222\")))","v":"N/A"},{"$f":"IF(ISERROR(INDIRECT(CONCATENATE($E$32,\"!K223\"))),\"\",INDIRECT(CONCATENATE($E$32,\"!K223\")))","v":"N/A"},{"$f":"IF(ISERROR(INDIRECT(CONCATENATE($E$32,\"!K224\"))),\"\",INDIRECT(CONCATENATE($E$32,\"!K224\")))","v":"N/A"},{"$f":"IF(ISERROR(INDIRECT(CONCATENATE($E$32,\"!L222\"))),\"\",INDIRECT(CONCATENATE($E$32,\"!L222\")))","v":"N/A"},{"$f":"IF(ISERROR(INDIRECT(CONCATENATE($E$32,\"!L223\"))),\"\",INDIRECT(CONCATENATE($E$32,\"!L223\")))","v":"N/A"},{"$f":"IF(ISERROR(INDIRECT(CONCATENATE($E$32,\"!L224\"))),\"\",INDIRECT(CONCATENATE($E$32,\"!L224\")))","v":"N/A"}]
[]
[]
[null,null,null,null,null,null,"RURAL",null,null,{"$f":"IF(ISERROR(INDIRECT(CONCATENATE(#REF!,\"!A2\"))),\"\",INDIRECT(CONCATENATE(#REF!,\"!A210\")))","v":""},{"$f":"IF(ISERROR(INDIRECT(CONCATENATE($E$32,\"!M222\"))),\"\",INDIRECT(CONCATENATE($E$32,\"!M222\")))","v":"N/A"},{"$f":"IF(ISERROR(INDIRECT(CONCATENATE($E$32,\"!M223\"))),\"\",INDIRECT(CONCATENATE($E$32,\"!M223\")))","v":"N/A"},{"$f":"IF(ISERROR(INDIRECT(CONCATENATE($E$32,\"!M224\"))),\"\",INDIRECT(CONCATENATE($E$32,\"!M224\")))","v":"N/A"},{"$f":"IF(ISERROR(INDIRECT(CONCATENATE($E$32,\"!N222\"))),\"\",INDIRECT(CONCATENATE($E$32,\"!N222\")))","v":"N/A"},{"$f":"IF(ISERROR(INDIRECT(CONCATENATE($E$32,\"!N223\"))),\"\",INDIRECT(CONCATENATE($E$32,\"!N223\")))","v":"N/A"},{"$f":"IF(ISERROR(INDIRECT(CONCATENATE($E$32,\"!N224\"))),\"\",INDIRECT(CONCATENATE($E$32,\"!N224\")))","v":"N/A"},{"$f":"IF(ISERROR(INDIRECT(CONCATENATE($E$32,\"!O222\"))),\"\",INDIRECT(CONCATENATE($E$32,\"!O222\")))","v":"N/A"},{"$f":"IF(ISERROR(INDIRECT(CONCATENATE($E$32,\"!O223\"))),\"\",INDIRECT(CONCATENATE($E$32,\"!O223\")))","v":"N/A"},{"$f":"IF(ISERROR(INDIRECT(CONCATENATE($E$32,\"!O224\"))),\"\",INDIRECT(CONCATENATE($E$32,\"!O224\")))","v":"N/A"},{"$f":"IF(ISERROR(INDIRECT(CONCATENATE($E$32,\"!P222\"))),\"\",INDIRECT(CONCATENATE($E$32,\"!P222\")))","v":"N/A"},{"$f":"IF(ISERROR(INDIRECT(CONCATENATE($E$32,\"!P223\"))),\"\",INDIRECT(CONCATENATE($E$32,\"!P223\")))","v":"N/A"},{"$f":"IF(ISERROR(INDIRECT(CONCATENATE($E$32,\"!P224\"))),\"\",INDIRECT(CONCATENATE($E$32,\"!P224\")))","v":"N/A"},{"$f":"IF(ISERROR(INDIRECT(CONCATENATE($E$32,\"!Q222\"))),\"\",INDIRECT(CONCATENATE($E$32,\"!Q222\")))","v":"N/A"},{"$f":"IF(ISERROR(INDIRECT(CONCATENATE($E$32,\"!Q223\"))),\"\",INDIRECT(CONCATENATE($E$32,\"!Q223\")))","v":"N/A"},{"$f":"IF(ISERROR(INDIRECT(CONCATENATE($E$32,\"!Q224\"))),\"\",INDIRECT(CONCATENATE($E$32,\"!Q224\")))","v":"N/A"}]
[]
[]
[]
[]
[]
[]
[]
[]
[]
[]
[]
[]
[]
[]
[]
[]
[]
[]
[]
[]
[]
[]
[]
[]
[]
[]
[]
[]
[]
[]
[]
[]
[]
[]
[]
[]
[]
[]
[]
[]
[]
[]
[]
[]
[]
[]
[]
[2,"WHS03"]
[null,"MICS13"]
[null,"Template"]

{"sheet":"WHS03","index":4,"n_rows":1072,"n_cols":69,"rows_kept":1072,"cut":false,"hidden":false,"merged":[[346,52,347,52],[348,52,349,52],[350,52,351,52],[352,52,353,52],[152,52,157,52],[270,52,272,52],[273,52,275,52],[276,52,283,52],[338,54,338,58],[338,59,338,63],[338,64,338,68],[340,52,341,52],[342,52,343,52],[344,52,345,52],[221,52,223,52],[224,52,225,52],[226,52,229,52],[258,54,258,58],[258,59,258,63],[258,64,258,68],[260,52,262,52],[263,52,266,52],[267,52,269,52],[119,64,119,68],[121,52,122,52],[123,52,126,52],[127,52,128,52],[132,54,132,58],[132,59,132,63],[132,64,132,68],[134,52,138,52],[219,54,219,58],[219,59,219,63],[219,64,219,68],[13,64,13,68],[15,52,16,52],[17,52,20,52],[21,52,22,52],[26,54,26,58],[26,59,26,63],[26,64,26,68],[40,52,41,52],[55,54,55,58],[55,59,55,63],[55,64,55,68],[139,52,142,52],[143,0,146,0],[143,52,146,52],[147,0,149,0],[147,52,149,52],[150,0,151,0],[150,52,151,52],[13,54,13,58],[13,59,13,63],[119,54,119,58],[119,59,119,63],[42,52,43,52],[44,52,45,52],[46,0,48,0],[46,52,48,52],[49,0,51,0],[49,52,51,52],[52,0,54,0],[52,52,54,52],[32,52,33,52],[34,52,35,52],[36,52,37,52],[38,0,39,0],[38,52,39,52],[13,2,13,6],[13,7,13,11],[28,52,29,52],[30,0,31,0],[30,52,31,52],[28,0,29,0],[34,0,35,0],[36,0,37,0],[40,0,41,0],[42,0,43,0],[13,12,13,16],[15,0,16,0],[17,0,20,0],[21,0,22,0],[23,0,25,0],[26,2,26,6],[26,7,26,11],[26,12,26,16],[32,0,33,0],[139,0,142,0],[119,12,119,16],[121,0,122,0],[55,12,55,16],[57,0,63,0],[107,0,107,1],[44,0,45,0],[55,2,55,6],[55,7,55,11],[123,0,126,0],[127,0,128,0],[129,0,131,0],[132,2,132,6],[132,7,132,11],[119,2,119,6],[119,7,119,11],[132,12,132,16],[134,0,138,0],[152,0,156,0],[219,12,219,16],[221,0,223,0],[207,0,207,1],[1024,0,1024,2],[1025,0,1025,1],[1030,0,1031,0],[1032,0,1032,2],[1033,0,1033,2],[219,2,219,6],[219,7,219,11],[401,1,444,1],[402,2,402,3],[402,7,402,8],[402,12,402,13],[403,2,403,3],[403,7,403,8],[403,12,403,13],[398,2,398,5],[398,7,398,10],[398,12,398,15],[399,2,399,4],[399,7,399,9],[399,12,399,14],[404,2,404,3],[404,7,404,8],[404,12,404,13],[405,2,405,3],[405,7,405,8],[405,12,405,13],[400,2,401,3],[400,7,401,8],[400,12,401,13],[408,2,408,3],[408,7,408,8],[408,12,408,13],[409,2,409,3],[409,7,409,8],[409,12,409,13],[406,2,406,3],[406,7,406,8],[406,12,406,13],[407,2,407,3],[407,7,407,8],[407,12,407,13],[412,2,412,3],[412,7,412,8],[412,12,412,13],[413,2,413,3],[413,7,413,8],[413,12,413,13],[410,2,410,3],[410,7,410,8],[410,12,410,13],[411,2,411,3],[411,7,411,8],[411,12,411,13],[416,2,416,3],[416,7,416,8],[416,12,416,13],[417,2,417,3],[417,7,417,8],[417,12,417,13],[414,2,414,3],[414,7,414,8],[414,12,414,13],[415,2,415,3],[415,7,415,8],[415,12,415,13],[420,2,420,3],[420,7,420,8],[420,12,420,13],[421,2,421,3],[421,7,421,8],[421,12,421,13],[418,2,418,3],[418,7,418,8],[418,12,418,13],[419,2,419,3],[419,7,419,8],[419,12,419,13],[424,2,424,3],[424,7,424,8],[424,12,424,13],[425,2,425,3],[425,7,425,8],[425,12,425,13],[422,2,422,3],[422,7,422,8],[422,12,422,13],[423,2,423,3],[423,7,423,8],[423,12,423,13],[428,2,428,3],[428,7,428,8],[428,12,428,13],[429,2,429,3],[429,7,429,8],[429,12,429,13],[426,2,426,3],[426,7,426,8],[426,12,426,13],[427,2,427,3],[427,7,427,8],[427,12,427,13],[432,2,432,3],[432,7,432,8],[432,12,432,13],[433,2,433,3],[433,7,433,8],[433,12,433,13],[430,2,430,3],[430,7,430,8],[430,12,430,13],[431,2,431,3],[431,7,431,8],[431,12,431,13],[436,2,436,3],[436,7,436,8],[436,12,436,13],[437,2,437,3],[437,7,437,8],[437,12,437,13],[434,2,434,3],[434,7,434,8],[434,12,434,13],[435,2,435,3],[435,7,435,8],[435,12,435,13],[440,2,440,3],[440,7,440,8],[440,12,440,13],[441,2,441,3],[441,7,441,8],[441,12,441,13],[438,2,438,3],[438,7,438,8],[438,12,438,13],[439,2,439,3],[439,7,439,8],[439,12,439,13],[444,2,444,3],[444,7,444,8],[444,12,444,13],[445,2,445,3],[445,7,445,8],[445,12,445,13],[442,2,442,3],[442,7,442,8],[442,12,442,13],[443,2,443,3],[443,7,443,8],[443,12,443,13],[448,2,448,3],[448,7,448,8],[448,12,448,13],[449,2,449,3],[449,7,449,8],[449,12,449,13],[446,2,446,3],[446,7,446,8],[446,12,446,13],[447,2,447,3],[447,7,447,8],[447,12,447,13],[452,2,452,3],[452,7,452,8],[452,12,452,13],[453,2,453,3],[453,7,453,8],[453,12,453,13],[450,2,450,3],[450,7,450,8],[450,12,450,14],[451,2,451,4],[451,7,451,9],[451,12,451,13],[456,2,456,3],[456,7,456,8],[456,12,456,13],[457,2,457,3],[457,7,457,8],[457,12,457,13],[454,2,454,3],[454,7,454,8],[454,12,454,13],[455,2,455,3],[455,7,455,8],[455,12,455,13],[460,2,460,3],[460,7,460,8],[460,12,460,13],[461,2,461,3],[461,7,461,8],[461,12,461,13],[458,2,458,3],[458,7,458,8],[458,12,458,13],[459,2,459,3],[459,7,459,8],[459,12,459,13],[464,2,464,3],[464,7,464,8],[464,12,464,13],[465,2,465,3],[465,7,465,8],[465,12,465,13],[462,2,462,3],[462,7,462,8],[462,12,462,13],[463,2,463,3],[463,7,463,8],[463,12,463,13],[468,2,468,3],[468,7,468,8],[468,12,468,13],[469,2,469,3],[469,7,469,8],[469,12,469,13],[466,2,466,3],[466,7,466,8],[466,12,466,13],[467,2,467,3],[467,7,467,8],[467,12,467,13],[472,2,472,3],[472,7,472,8],[472,12,472,13],[473,2,473,3],[473,7,473,8],[473,12,473,13],[470,2,470,3],[470,7,470,8],[470,12,470,13],[471,2,471,3],[471,7,471,8],[471,12,471,13],[476,2,476,3],[476,7,476,8],[476,12,476,13],[477,2,477,3],[477,7,477,8],[477,12,477,13],[474,2,474,3],[474,7,474,8],[474,12,474,13],[475,2,475,3],[475,7,475,8],[475,12,475,13],[480,2,480,3],[480,7,480,8],[480,12,480,13],[481,2,481,3],[481,7,481,8],[481,12,481,13],[478,2,478,3],[478,7,478,8],[478,12,478,13],[479,2,479,3],[479,7,479,8],[479,12,479,13],[484,2,484,3],[484,7,484,8],[484,12,484,13],[485,2,485,3],[485,7,485,8],[485,12,485,13],[482,2,482,3],[482,7,482,8],[482,12,482,13],[483,2,483,3],[483,7,483,8],[483,12,483,13],[488,2,488,3],[488,7,488,8],[488,12,488,13],[489,2,489,3],[489,7,489,8],[489,12,489,13],[486,2,486,3],[486,7,486,8],[486,12,486,13],[487,2,487,3],[487,7,487,8],[487,12,487,13],[492,2,492,3],[492,7,492,8],[492,12,492,13],[493,2,493,3],[493,7,493,8],[493,12,493,13],[490,2,490,3],[490,7,490,8],[490,12,490,13],[491,2,491,3],[491,7,491,8],[491,12,491,13],[496,2,496,3],[496,7,496,8],[496,12,496,13],[497,2,497,3],[497,7,497,8],[497,12,497,13],[494,2,494,3],[494,7,494,8],[494,12,494,13],[495,2,495,3],[495,7,495,8],[495,12,495,13],[500,2,500,3],[500,7,500,8],[500,12,501,13],[500,14,500,16],[501,2,501,6],[501,7,501,11],[498,2,498,3],[498,7,498,8],[498,12,498,13],[499,2,499,3],[499,7,499,8],[499,12,499,16],[504,2,504,3],[504,7,504,8],[504,12,504,13],[505,2,505,3],[505,7,505,8],[505,12,505,14],[502,2,503,3],[502,4,502,6],[502,7,503,8],[502,9,502,11],[502,12,502,13],[503,12,503,13],[510,2,510,3],[510,7,510,8],[510,12,510,13],[511,2,511,3],[511,7,511,8],[511,12,511,13],[506,2,506,3],[506,7,506,8],[506,12,507,13],[507,2,507,4],[507,7,507,9],[508,2,509,3],[508,7,509,8],[508,12,508,13],[509,12,509,13],[514,2,514,3],[514,7,514,8],[514,12,514,13],[515,2,515,3],[515,7,515,8],[515,12,515,13],[512,2,512,3],[512,7,512,8],[512,12,512,13],[513,2,513,3],[513,7,513,8],[513,12,513,13],[518,2,518,3],[518,7,518,8],[518,12,518,13],[519,2,519,3],[519,7,519,8],[519,12,519,13],[516,2,516,3],[516,7,516,8],[516,12,516,13],[517,2,517,3],[517,7,517,8],[517,12,517,13],[522,2,522,3],[522,7,522,8],[522,12,522,13],[523,2,523,3],[523,7,523,8],[523,12,523,13],[520,2,520,3],[520,7,520,8],[520,12,520,13],[521,2,521,3],[521,7,521,8],[521,12,521,13],[526,2,526,3],[526,7,526,8],[526,12,526,13],[527,2,527,3],[527,7,527,8],[527,12,527,13],[524,2,524,3],[524,7,524,8],[524,12,524,13],[525,2,525,3],[525,7,525,8],[525,12,525,13],[530,2,530,3],[530,7,530,8],[530,12,530,13],[531,2,531,3],[531,7,531,8],[531,12,531,13],[528,2,528,3],[528,7,528,8],[528,12,528,13],[529,2,529,3],[529,7,529,8],[529,12,529,13],[534,2,534,3],[534,7,534,8],[534,12,534,13],[535,2,535,3],[535,7,535,8],[535,12,535,13],[532,2,532,3],[532,7,532,8],[532,12,532,13],[533,2,533,3],[533,7,533,8],[533,12,533,13],[538,2,538,3],[538,7,538,8],[538,12,538,13],[539,2,539,3],[539,7,539,8],[539,12,539,13],[536,2,536,3],[536,7,536,8],[536,12,536,13],[537,2,537,3],[537,7,537,8],[537,12,537,13],[542,2,542,3],[542,7,542,8],[542,12,542,13],[543,2,543,3],[543,7,543,8],[543,12,543,13],[540,2,540,3],[540,7,540,8],[540,12,540,13],[541,2,541,3],[541,7,541,8],[541,12,541,13],[546,2,546,3],[546,7,546,8],[546,12,546,13],[547,2,547,3],[547,7,547,8],[547,12,547,13],[544,2,544,3],[544,7,544,8],[544,12,544,13],[545,2,545,3],[545,7,545,8],[545,12,545,13],[550,2,550,3],[550,7,550,8],[550,12,550,13],[551,2,551,3],[551,7,551,8],[551,12,551,13],[548,2,548,3],[548,7,548,8],[548,12,548,13],[549,2,549,3],[549,7,549,8],[549,12,549,13],[554,2,554,3],[554,7,554,8],[554,12,554,13],[555,2,555,3],[555,7,555,8],[555,12,555,14],[552,2,552,3],[552,7,552,8],[552,12,552,13],[553,2,553,3],[553,7,553,8],[553,12,553,13],[558,2,558,4],[558,7,558,9],[558,12,558,13],[559,2,559,3],[559,7,559,8],[559,12,559,13],[556,2,556,3],[556,7,556,8],[556,12,556,13],[557,2,557,3],[557,7,557,8],[557,12,557,13],[562,2,562,3],[562,7,562,8],[562,12,562,13],[563,2,563,3],[563,7,563,8],[563,12,563,13],[560,2,560,3],[560,7,560,8],[560,12,560,13],[561,2,561,3],[561,7,561,8],[561,12,561,13],[566,2,566,3],[566,7,566,8],[566,12,566,13],[567,2,567,3],[567,7,567,8],[567,12,567,13],[564,2,564,3],[564,7,564,8],[564,12,564,13],[565,2,565,3],[565,7,565,8],[565,12,565,13],[570,2,570,3],[570,7,570,8],[570,12,570,13],[571,2,571,3],[571,7,571,8],[571,12,571,13],[568,2,568,3],[568,7,568,8],[568,12,568,13],[569,2,569,3],[569,7,569,8],[569,12,569,13],[574,2,574,3],[574,7,574,8],[574,12,574,13],[575,2,575,3],[575,7,575,8],[575,12,575,13],[572,2,572,3],[572,7,572,8],[572,12,572,13],[573,2,573,3],[573,7,573,8],[573,12,573,13],[578,2,578,3],[578,7,578,8],[578,12,578,13],[579,2,579,3],[579,7,579,8],[579,12,579,13],[576,2,576,3],[576,7,576,8],[576,12,576,13],[577,2,577,3],[577,7,577,8],[577,12,577,13],[582,2,582,3],[582,7,582,8],[582,12,582,13],[583,2,583,3],[583,7,583,8],[583,12,583,13],[580,2,580,3],[580,7,580,8],[580,12,580,13],[581,2,581,3],[581,7,581,8],[581,12,581,13],[586,2,586,3],[586,7,586,8],[586,12,586,13],[587,2,587,3],[587,7,587,8],[587,12,587,13],[584,2,584,3],[584,7,584,8],[584,12,584,13],[585,2,585,3],[585,7,585,8],[585,12,585,13],[590,2,590,3],[590,7,590,8],[590,12,590,13],[591,2,591,3],[591,7,591,8],[591,12,591,13],[588,2,588,3],[588,7,588,8],[588,12,588,13],[589,2,589,3],[589,7,589,8],[589,12,589,13],[594,2,594,3],[594,7,594,8],[594,12,594,13],[595,2,595,3],[595,7,595,8],[595,12,595,13],[592,2,592,3],[592,7,592,8],[592,12,592,13],[593,2,593,3],[593,7,593,8],[593,12,593,13],[598,2,598,3],[598,7,598,8],[598,12,598,13],[599,2,599,3],[599,7,599,8],[599,12,599,13],[596,2,596,3],[596,7,596,8],[596,12,596,13],[597,2,597,3],[597,7,597,8],[597,12,597,13],[602,2,602,3],[602,7,602,8],[602,12,602,13],[603,2,603,3],[603,7,603,8],[603,12,603,13],[600,2,600,3],[600,7,600,8],[600,12,600,13],[601,2,601,3],[601,7,601,8],[601,12,601,13],[606,2,606,3],[606,7,606,8],[606,12,606,13],[607,2,607,3],[607,7,607,8],[607,12,607,13],[604,2,604,3],[604,7,604,8],[604,12,604,13],[605,2,605,3],[605,7,605,8],[605,12,605,13],[610,2,610,3],[610,7,610,8],[610,12,610,13],[611,2,611,3],[611,7,611,8],[611,12,611,13],[608,2,608,3],[608,7,608,8],[608,12,608,13],[609,2,609,3],[609,7,609,8],[609,12,609,13],[614,2,614,3],[614,7,614,8],[614,12,614,13],[615,2,615,3],[615,7,615,8],[615,12,615,13],[612,2,612,3],[612,7,612,8],[612,12,612,13],[613,2,613,3],[613,7,613,8],[613,12,613,13],[618,2,618,3],[618,7,618,8],[618,12,618,13],[619,2,619,3],[619,7,619,8],[619,12,619,13],[616,2,616,3],[616,7,616,8],[616,12,616,13],[617,2,617,3],[617,7,617,8],[617,12,617,13],[622,2,622,3],[622,7,622,8],[622,12,622,13],[623,2,623,3],[623,7,623,8],[623,12,623,13],[620,2,620,3],[620,7,620,8],[620,12,620,13],[621,2,621,3],[621,7,621,8],[621,12,621,13],[626,2,626,3],[626,7,626,8],[626,12,626,13],[627,2,627,3],[627,7,627,8],[627,12,627,13],[624,2,624,3],[624,7,624,8],[624,12,624,13],[625,2,625,3],[625,7,625,8],[625,12,625,13],[630,2,630,3],[630,7,630,8],[630,12,630,13],[631,2,631,3],[631,7,631,8],[631,12,631,13],[628,2,628,3],[628,7,628,8],[628,12,628,13],[629,2,629,3],[629,7,629,8],[629,12,629,13],[634,2,634,3],[634,7,634,8],[634,12,634,13],[635,2,635,3],[635,7,635,8],[635,12,635,13],[632,2,632,3],[632,7,632,8],[632,12,632,13],[633,2,633,3],[633,7,633,8],[633,12,633,13],[638,2,638,3],[638,7,638,8],[638,12,638,13],[639,2,639,3],[639,7,639,8],[639,12,639,13],[636,2,636,3],[636,7,636,8],[636,12,636,13],[637,2,637,3],[637,7,637,8],[637,12,637,13],[642,2,642,3],[642,7,642,8],[642,12,642,13],[643,2,643,3],[643,7,643,8],[643,12,643,13],[640,2,640,3],[640,7,640,8],[640,12,640,13],[641,2,641,3],[641,7,641,8],[641,12,641,13],[646,2,646,3],[646,7,646,8],[646,12,646,13],[647,2,647,3],[647,7,647,8],[647,12,647,13],[644,2,644,3],[644,7,644,8],[644,12,644,13],[645,2,645,3],[645,7,645,8],[645,12,645,13],[650,2,650,3],[650,7,650,8],[650,12,650,13],[651,2,651,3],[651,7,651,8],[651,12,651,13],[648,2,648,3],[648,7,648,8],[648,12,648,13],[649,2,649,3],[649,7,649,8],[649,12,649,13],[654,2,654,3],[654,7,654,8],[654,12,654,13],[655,2,655,3],[655,7,655,8],[655,12,655,13],[652,2,652,3],[652,7,652,8],[652,12,652,13],[653,2,653,3],[653,7,653,8],[653,12,653,13],[658,2,658,3],[658,7,658,8],[658,12,658,13],[659,2,659,3],[659,7,659,8],[659,12,659,13],[656,2,656,3],[656,7,656,8],[656,12,656,13],[657,2,657,3],[657,7,657,8],[657,12,657,13],[662,2,662,3],[662,7,662,8],[662,12,662,13],[663,2,663,3],[663,7,663,8],[663,12,663,13],[660,2,660,3],[660,7,660,8],[660,12,660,13],[661,2,661,3],[661,7,661,8],[661,12,661,13],[666,2,666,3],[666,7,666,8],[666,12,666,13],[667,2,667,3],[667,7,667,8],[667,12,667,13],[664,2,664,3],[664,7,664,8],[664,12,664,13],[665,2,665,3],[665,7,665,8],[665,12,665,13],[670,2,670,3],[670,7,670,8],[670,12,670,13],[671,2,671,3],[671,7,671,8],[671,12,671,13],[668,2,668,3],[668,7,668,8],[668,12,668,13],[669,2,669,3],[669,7,669,8],[669,12,669,13],[674,2,674,3],[674,7,674,8],[674,12,674,13],[675,2,675,3],[675,7,675,8],[675,12,675,13],[672,2,672,3],[672,7,672,8],[672,12,672,13],[673,2,673,3],[673,7,673,8],[673,12,673,13],[678,2,678,3],[678,7,678,8],[678,12,678,13],[679,2,679,3],[679,7,679,8],[679,12,679,13],[676,2,676,3],[676,7,676,8],[676,12,676,13],[677,2,677,3],[677,7,677,8],[677,12,677,13],[693,12,693,13],[682,2,682,3],[682,7,682,8],[682,12,682,13],[683,2,683,3],[683,7,683,8],[683,12,683,13],[680,2,680,3],[680,7,680,8],[680,12,680,13],[681,2,681,3],[681,7,681,8],[681,12,681,13],[686,2,686,3],[686,7,686,8],[686,12,686,13],[687,2,687,3],[687,7,687,8],[687,12,687,13],[684,2,684,3],[684,7,684,8],[684,12,684,13],[685,2,685,3],[685,7,685,8],[685,12,685,13],[698,2,698,3],[698,7,698,8],[698,12,698,13],[696,2,696,3],[696,7,696,8],[696,12,696,13],[697,2,697,3],[697,7,697,8],[697,12,697,13],[690,2,690,3],[690,7,690,8],[690,12,690,13],[691,2,691,3],[691,7,691,8],[691,12,691,13],[688,2,688,3],[688,7,688,8]],"merged_total":1015,"flags":["merged_cut"]}
[]
[{"$f":"A1026","v":"Uruguay"}]
[{"$f":"A1034","v":"2003"}]
["Use of drinking water sources"]
[" by wealth quintile and sub-national region"]
["Notes:"]
["WHO/UNICEF JMP customised wealth index excludes water,"]
[" sanitation and hygiene assets."]
["Survey used for analysis:",{"$f":"A1025","v":"WHS03"}]
[{"$f":"B1028","v":""}]
[{"$f":"B1027","v":""}]
[]
[]
["Use of drinking water sources",null,"NATIONAL wealth index quintile",null,null,null,null,"URBAN wealth index quintile",null,null,null,null,"RURAL wealth index quintile",null,null,null,null,null,null,null,null,null,null,null,null,null,null,null,null,null,null,null,null,null,null,null,null,null,null,null,null,null,null,null,null,null,null,null,null,null,null,null,"Raw numbers of respondents:","Use of drinking water sources","NATIONAL wealth index quintile",null,null,null,null,"URBAN wealth index quintile",null,null,null,null,"RURAL wealth index quintile"]
["Weighted percentage (used in graphs)",null,"Poorest","Poor","Middle","Rich","Richest","Poorest","Poor","Middle","Rich","Richest","Poorest","Poor","Middle","Rich","Richest",null,null,null,null,null,null,null,null,null,null,null,null,null,null,null,null,null,null,null,null,null,null,null,null,null,null,null,null,null,null,null,null,null,null,null,"Water data, raw numbers (weighted)",null,"Poorest","Poor","Middle","Rich","Richest","Poorest","Poor","Middle","Rich","Richest","Poorest","Poor","Middle","Rich","Richest"]
["Water","Improved",99.228030001445973,99.565722933952046,99.597713270725322,99.83989213335532,99.359443674111674,98.971244373347105,99.374751164898626,99.792792079670036,99.585530602006457,99.3774358780298,99.246170488451497,100,100,100,100,null,null,null,null,null,null,null,null,null,null,null,null,null,null,null,null,null,null,null,null,null,null,null,null,null,null,null,null,null,null,null,null,null,null,null,"Water","Improved","N/A","N/A","N/A","N/A","N/A","N/A","N/A","N/A","N/A","N/A","N/A","N/A","N/A","N/A","N/A"]
[null,"Not Improved",0.77196999855402981,0.4342770660479533,0.40228672927468367,0.1601078666446743,0.64055632588833356,1.0287556266529012,0.62524883510137208,0.20720792032996099,0.41446939799354166,0.62256412197020328,0.7538295115485083,0,0,0,0,null,null,null,null,null,null,null,null,null,null,null,null,null,null,null,null,null,null,null,null,null,null,null,null,null,null,null,null,null,null,null,null,null,null,null,null,"Not Improved","N/A","N/A","N/A","N/A","N/A","N/A","N/A","N/A","N/A","N/A","N/A","N/A","N/A","N/A","N/A"]
["Water ladder","Basic",{"$f":"C16*C23/100","v":96.777404721564366},{"$f":"D16*D23/100","v":99.565722933952031},{"$f":"E16*E23/100","v":99.597713270725322},99.83989213335532,99.359443674111674,98.971244373347105,99.374751164898626,99.792792079670036,99.585530602006457,99.377435878029786,94.507526173376405,100,100,100,100,null,null,null,null,null,null,null,null,null,null,null,null,null,null,null,null,null,null,null,null,null,null,null,null,null,null,null,null,null,null,null,null,null,null,null,"Water ladder","Basic","N/A","N/A","N/A","N/A","N/A","N/A","N/A","N/A","N/A","N/A","N/A","N/A","N/A","N/A","N/A"]
[null,"Limited",{"$f":"C16*C22/100","v":2.4506252798816259},{"$f":"D16*D22/100","v":0},{"$f":"E16*E22/100","v":0},0,0,0,0,0,0,0,4.7386443150750885,0,0,0,0,null,null,null,null,null,null,null,null,null,null,null,null,null,null,null,null,null,null,null,null,null,null,null,null,null,null,null,null,null,null,null,null,null,null,null,null,"Limited","N/A","N/A","N/A","N/A","N/A","N/A","N/A","N/A","N/A","N/A","N/A","N/A","N/A","N/A","N/A"]
[null,"Unimproved",{"$f":"100-C18-C19-C21","v":0.77196999855400783},{"$f":"100-D18-D19-D21","v":0.43427706604796867},{"$f":"100-E18-E19-E21","v":0.40228672927467812},0.16010786664467958,0.64055632588832623,1.0287556266528952,0.62524883510137386,0.20720792032996371,0.41446939799354254,0.62256412197021405,0.7538295115485063,0,0,0,0,null,null,null,null,null,null,null,null,null,null,null,null,null,null,null,null,null,null,null,null,null,null,null,null,null,null,null,null,null,null,null,null,null,null,null,null,"Unimproved","N/A","N/A","N/A","N/A","N/A","N/A","N/A","N/A","N/A","N/A","N/A","N/A","N/A","N/A","N/A"]
[null,"Surface water",0,0,0,0,0,0,0,0,0,0,0,0,0,0,0,null,null,null,null,null,null,null,null,null,null,null,null,null,null,null,null,null,null,null,null,null,null,null,null,null,null,null,null,null,null,null,null,null,null,null,null,"Surface water","N/A","N/A","N/A","N/A","N/A","N/A","N/A","N/A","N/A","N/A","N/A","N/A","N/A","N/A","N/A"]
["Improved water point at more than 30 minutes","Yes",2.4696905499846311,0,0,0,0,0,0,0,0,0,4.7746369373783422,0,0,0,0,null,null,null,null,null,null,null,null,null,null,null,null,null,null,null,null,null,null,null,null,null,null,null,null,null,null,null,null,null,null,null,null,null,null,null,"Improved water point at more than 30 minutes","Yes","N/A","N/A","N/A","N/A","N/A","N/A","N/A","N/A","N/A","N/A","N/A","N/A","N/A","N/A","N/A"]
[null,"No",97.53030945001538,100,100,100,100,100,100,100,100,100,95.225363062621653,100,100,100,100,null,null,null,null,null,null,null,null,null,null,null,null,null,null,null,null,null,null,null,null,null,null,null,null,null,null,null,null,null,null,null,null,null,null,null,null,"No","N/A","N/A","N/A","N/A","N/A","N/A","N/A","N/A","N/A","N/A","N/A","N/A","N/A","N/A","N/A"]
["Manually calculated ratios","Improved wells"]
[null,"Improved springs"]
[null,"Other"]
[null,null,"NATIONAL wealth index quintile",null,null,null,null,"URBAN wealth index quintile",null,null,null,null,"RURAL wealth index quintile",null,null,null,null,null,null,null,null,null,null,null,null,null,null,null,null,null,null,null,null,null,null,null,null,null,null,null,null,null,null,null,null,null,null,null,null,null,null,null,"Raw numbers of respondents:","Use of drinking water sources","NATIONAL wealth index quintile",null,null,null,null,"URBAN wealth index quintile",null,null,null,null,"RURAL wealth index quintile"]
["Percentage based on weighted population",null,"Poorest","Poor","Middle","Rich","Richest","Poorest","Poor","Middle","Rich","Richest","Poorest","Poor","Middle","Rich","Richest",null,null,null,null,null,null,null,null,null,null,null,null,null,null,null,null,null,null,null,null,null,null,null,null,null,null,null,null,null,null,null,null,null,null,null,"Water data, raw numbers (weighted)",null,"Poorest","Poor","Middle","Rich","Richest","Poorest","Poor","Middle","Rich","Richest","Poorest","Poor","Middle","Rich","Richest"]
["Piped water","Yes",89.519777424514658,94.250539562110873,97.33288284696178,98.438950164413242,98.816512057981981,96.792703144385754,98.535877599415116,99.127491188058428,99.402696630599593,99.231101010105959,74.411369277223372,86.709671822451384,81.504107415418773,92.173030945449227,93.542945082900658,null,null,null,null,null,null,null,null,null,null,null,null,null,null,null,null,null,null,null,null,null,null,null,null,null,null,null,null,null,null,null,null,null,null,null,"Piped water","Yes","N/A","N/A","N/A","N/A","N/A","N/A","N/A","N/A","N/A","N/A","N/A","N/A","N/A","N/A","N/A"]
[null,"No",10.480222575485339,5.7494604378891339,2.6671171530382249,1.5610498355867592,1.1834879420180275,3.2072968556142425,1.464122400584875,0.87250881194157037,0.5973033694004064,0.76889898989404126,25.588630722776625,13.290328177548613,18.495892584581235,7.8269690545507711,6.4570549170993443,null,null,null,null,null,null,null,null,null,null,null,null,null,null,null,null,null,null,null,null,null,null,null,null,null,null,null,null,null,null,null,null,null,null,null,null,"No","N/A","N/A","N/A","N/A","N/A","N/A","N/A","N/A","N/A","N/A","N/A","N/A","N/A","N/A","N/A"]
["Piped water on premises","Yes",84.839388092375643,92.200807052177666,96.392538128354033,97.883775822513428,98.671636228342635,91.956817415509718,96.631035716850249,98.201789397212323,98.810030227461453,99.043359011411226,68.892001523358616,86.067580151628391,80.29950648199852,91.402114244382375,93.542945082900658,null,null,null,null,null,null,null,null,null,null,null,null,null,null,null,null,null,null,null,null,null,null,null,null,null,null,null,null,null,null,null,null,null,null,null,"Piped water on premises","Yes","N/A","N/A","N/A","N/A","N/A","N/A","N/A","N/A","N/A","N/A","N/A","N/A","N/A","N/A","N/A"]
[null,"No",15.160611907624356,7.7991929478223296,3.6074618716459681,2.1162241774865707,1.3283637716573709,8.0431825844902871,3.3689642831497473,1.798210602787675,1.1899697725385456,0.95664098858877344,31.107998476641384,13.9324198483716,19.700493518001483,8.5978857556176269,6.4570549170993443,null,null,null,null,null,null,null,null,null,null,null,null,null,null,null,null,null,null,null,null,null,null,null,null,null,null,null,null,null,null,null,null,null,null,null,null,"No","N/A","N/A","N/A","N/A","N/A","N/A","N/A","N/A","N/A","N/A","N/A","N/A","N/A","N/A","N/A"]
["Piped water into dwelling","Yes","N/A","N/A","N/A","N/A","N/A","N/A","N/A","N/A","N/A","N/A","N/A","N/A","N/A","N/A","N/A",null,null,null,null,null,null,null,null,null,null,null,null,null,null,null,null,null,null,null,null,null,null,null,null,null,null,null,null,null,null,null,null,null,null,null,"Piped water into dwelling","Yes","N/A","N/A","N/A","N/A","N/A","N/A","N/A","N/A","N/A","N/A","N/A","N/A","N/A","N/A","N/A"]
[null,"No","N/A","N/A","N/A","N/A","N/A","N/A","N/A","N/A","N/A","N/A","N/A","N/A","N/A","N/A","N/A",null,null,null,null,null,null,null,null,null,null,null,null,null,null,null,null,null,null,null,null,null,null,null,null,null,null,null,null,null,null,null,null,null,null,null,null,"No","N/A","N/A","N/A","N/A","N/A","N/A","N/A","N/A","N/A","N/A","N/A","N/A","N/A","N/A","N/A"]
["Water source on premises","Yes","N/A","N/A","N/A","N/A","N/A","N/A","N/A","N/A","N/A","N/A","N/A","N/A","N/A","N/A","N/A",null,null,null,null,null,null,null,null,null,null,null,null,null,null,null,null,null,null,null,null,null,null,null,null,null,null,null,null,null,null,null,null,null,null,null,"Water source on premises","Yes","N/A","N/A","N/A","N/A","N/A","N/A","N/A","N/A","N/A","N/A","N/A","N/A","N/A","N/A","N/A"]
[null,"No","N/A","N/A","N/A","N/A","N/A","N/A","N/A","N/A","N/A","N/A","N/A","N/A","N/A","N/A","N/A",null,null,null,null,null,null,null,null,null,null,null,null,null,null,null,null,null,null,null,null,null,null,null,null,null,null,null,null,null,null,null,null,null,null,null,null,"No","N/A","N/A","N/A","N/A","N/A","N/A","N/A","N/A","N/A","N/A","N/A","N/A","N/A","N/A","N/A"]
["Improved Water source on premises","Yes","N/A","N/A","N/A","N/A","N/A","N/A","N/A","N/A","N/A","N/A","N/A","N/A","N/A","N/A","N/A",null,null,null,null,null,null,null,null,null,null,null,null,null,null,null,null,null,null,null,null,null,null,null,null,null,null,null,null,null,null,null,null,null,null,null,"Improved water source on premises","Yes","N/A","N/A","N/A","N/A","N/A","N/A","N/A","N/A","N/A","N/A","N/A","N/A","N/A","N/A","N/A"]
[null,"No","N/A","N/A","N/A","N/A","N/A","N/A","N/A","N/A","N/A","N/A","N/A","N/A","N/A","N/A","N/A",null,null,null,null,null,null,null,null,null,null,null,null,null,null,null,null,null,null,null,null,null,null,null,null,null,null,null,null,null,null,null,null,null,null,null,null,"No","N/A","N/A","N/A","N/A","N/A","N/A","N/A","N/A","N/A","N/A","N/A","N/A","N/A","N/A","N/A"]
["Piped water on premises available when needed","Yes","N/A","N/A","N/A","N/A","N/A","N/A","N/A","N/A","N/A","N/A","N/A","N/A","N/A","N/A","N/A",null,null,null,null,null,null,null,null,null,null,null,null,null,null,null,null,null,null,null,null,null,null,null,null,null,null,null,null,null,null,null,null,null,null,null,"Piped water on premises available when needed","Yes","N/A","N/A","N/A","N/A","N/A","N/A","N/A","N/A","N/A","N/A","N/A","N/A","N/A","N/A","N/A"]
[null,"No","N/A","N/A","N/A","N/A","N/A","N/A","N/A","N/A","N/A","N/A","N/A","N/A","N/A","N/A","N/A",null,null,null,null,null,null,null,null,null,null,null,null,null,null,null,null,null,null,null,null,null,null,null,null,null,null,null,null,null,null,null,null,null,null,null,null,"No","N/A","N/A","N/A","N/A","N/A","N/A","N/A","N/A","N/A","N/A","N/A","N/A","N/A","N/A","N/A"]
["Water point at more than 30 minutes","Yes",2.3757402399852379,0,0,0,0,0,0,0,0,0,4.6563300969945525,0,0,0,0,null,null,null,null,null,null,null,null,null,null,null,null,null,null,null,null,null,null,null,null,null,null,null,null,null,null,null,null,null,null,null,null,null,null,null,"Water point at more than 30 minutes","Yes","N/A","N/A","N/A","N/A","N/A","N/A","N/A","N/A","N/A","N/A","N/A","N/A","N/A","N/A","N/A"]
[null,"No",97.624259760014766,100,100,100,100,100,100,100,100,100,95.343669903005448,100,100,100,100,null,null,null,null,null,null,null,null,null,null,null,null,null,null,null,null,null,null,null,null,null,null,null,null,null,null,null,null,null,null,null,null,null,null,null,null,"No","N/A","N/A","N/A","N/A","N/A","N/A","N/A","N/A","N/A","N/A","N/A","N/A","N/A","N/A","N/A"]
["Water source available when needed","Yes","N/A","N/A","N/A","N/A","N/A","N/A","N/A","N/A","N/A","N/A","N/A","N/A","N/A","N/A","N/A",null,null,null,null,null,null,null,null,null,null,null,null,null,null,null,null,null,null,null,null,null,null,null,null,null,null,null,null,null,null,null,null,null,null,null,"Water source available when needed","Yes","N/A","N/A","N/A","N/A","N/A","N/A","N/A","N/A","N/A","N/A","N/A","N/A","N/A","N/A","N/A"]
[null,"No","N/A","N/A","N/A","N/A","N/A","N/A","N/A","N/A","N/A","N/A","N/A","N/A","N/A","N/A","N/A",null,null,null,null,null,null,null,null,null,null,null,null,null,null,null,null,null,null,null,null,null,null,null,null,null,null,null,null,null,null,null,null,null,null,null,null,"No","N/A","N/A","N/A","N/A","N/A","N/A","N/A","N/A","N/A","N/A","N/A","N/A","N/A","N/A","N/A"]
["Improved water source available when needed","Yes","N/A","N/A","N/A","N/A","N/A","N/A","N/A","N/A","N/A","N/A","N/A","N/A","N/A","N/A","N/A",null,null,null,null,null,null,null,null,null,null,null,null,null,null,null,null,null,null,null,null,null,null,null,null,null,null,null,null,null,null,null,null,null,null,null,"Improved water source available when needed","Yes","N/A","N/A","N/A","N/A","N/A","N/A","N/A","N/A","N/A","N/A","N/A","N/A","N/A","N/A","N/A"]
[null,"No","N/A","N/A","N/A","N/A","N/A","N/A","N/A","N/A","N/A","N/A","N/A","N/A","N/A","N/A","N/A",null,null,null,null,null,null,null,null,null,null,null,null,null,null,null,null,null,null,null,null,null,null,null,null,null,null,null,null,null,null,null,null,null,null,null,null,"No","N/A","N/A","N/A","N/A","N/A","N/A","N/A","N/A","N/A","N/A","N/A","N/A","N/A","N/A","N/A"]
["Microbiological quality at point of collection","Not contaminated (No E. coli in 100 mL)","N/A","N/A","N/A","N/A","N/A","N/A","N/A","N/A","N/A","N/A","N/A","N/A","N/A","N/A","N/A",null,null,null,null,null,null,null,null,null,null,null,null,null,null,null,null,null,null,null,null,null,null,null,null,null,null,null,null,null,null,null,null,null,null,null,"Microbiological quality at point of collection","Not contaminated (No E. coli in 100 mL)","N/A","N/A","N/A","N/A","N/A","N/A","N/A","N/A","N/A","N/A","N/A","N/A","N/A","N/A","N/A"]
[null,"Contaminated (E. coli detected in 100 mL)","N/A","N/A","N/A","N/A","N/A","N/A","N/A","N/A","N/A","N/A","N/A","N/A","N/A","N/A","N/A",null,null,null,null,null,null,null,null,null,null,null,null,null,null,null,null,null,null,null,null,null,null,null,null,null,null,null,null,null,null,null,null,null,null,null,null,"Contaminated (E. coli detected in 100 mL)","N/A","N/A","N/A","N/A","N/A","N/A","N/A","N/A","N/A","N/A","N/A","N/A","N/A","N/A","N/A"]
[null,"Highly contaminated (>100 CFU/100 mL)","N/A","N/A","N/A","N/A","N/A","N/A","N/A","N/A","N/A","N/A","N/A","N/A","N/A","N/A","N/A",null,null,null,null,null,null,null,null,null,null,null,null,null,null,null,null,null,null,null,null,null,null,null,null,null,null,null,null,null,null,null,null,null,null,null,null,"Highly contaminated (>100 CFU/100 mL)","N/A","N/A","N/A","N/A","N/A","N/A","N/A","N/A","N/A","N/A","N/A","N/A","N/A","N/A","N/A"]
["Microbiological quality of improved water sources at point of collection","Not contaminated (No E. coli in 100 mL)","N/A","N/A","N/A","N/A","N/A","N/A","N/A","N/A","N/A","N/A","N/A","N/A","N/A","N/A","N/A",null,null,null,null,null,null,null,null,null,null,null,null,null,null,null,null,null,null,null,null,null,null,null,null,null,null,null,null,null,null,null,null,null,null,null,"Microbiological quality of improved water sources at point of collection","Not contaminated (No E. coli in 100 mL)","N/A","N/A","N/A","N/A","N/A","N/A","N/A","N/A","N/A","N/A","N/A","N/A","N/A","N/A","N/A"]
[null,"Contaminated (E. coli detected in 100 mL)","N/A","N/A","N/A","N/A","N/A","N/A","N/A","N/A","N/A","N/A","N/A","N/A","N/A","N/A","N/A",null,null,null,null,null,null,null,null,null,null,null,null,null,null,null,null,null,null,null,null,null,null,null,null,null,null,null,null,null,null,null,null,null,null,null,null,"Contaminated (E. coli detected in 100 mL)","N/A","N/A","N/A","N/A","N/A","N/A","N/A","N/A","N/A","N/A","N/A","N/A","N/A","N/A","N/A"]
[null,"Highly contaminated (>100 CFU/100 mL)","N/A","N/A","N/A","N/A","N/A","N/A","N/A","N/A","N/A","N/A","N/A","N/A","N/A","N/A","N/A",null,null,null,null,null,null,null,null,null,null,null,null,null,null,null,null,null,null,null,null,null,null,null,null,null,null,null,null,null,null,null,null,null,null,null,null,"Highly contaminated (>100 CFU/100 mL)","N/A","N/A","N/A","N/A","N/A","N/A","N/A","N/A","N/A","N/A","N/A","N/A","N/A","N/A","N/A"]
["Microbiological quality of piped on premises at point of collection","Not contaminated (No E. coli in 100 mL)","N/A","N/A","N/A","N/A","N/A","N/A","N/A","N/A","N/A","N/A","N/A","N/A","N/A","N/A","N/A",null,null,null,null,null,null,null,null,null,null,null,null,null,null,null,null,null,null,null,null,null,null,null,null,null,null,null,null,null,null,null,null,null,null,null,"Microbiological quality of piped on premises at point of collection","Not contaminated (No E. coli in 100 mL)","N/A","N/A","N/A","N/A","N/A","N/A","N/A","N/A","N/A","N/A","N/A","N/A","N/A","N/A","N/A"]
[null,"Contaminated (E. coli detected in 100 mL)","N/A","N/A","N/A","N/A","N/A","N/A","N/A","N/A","N/A","N/A","N/A","N/A","N/A","N/A","N/A",null,null,null,null,null,null,null,null,null,null,null,null,null,null,null,null,null,null,null,null,null,null,null,null,null,null,null,null,null,null,null,null,null,null,null,null,"Contaminated (E. coli detected in 100 mL)","N/A","N/A","N/A","N/A","N/A","N/A","N/A","N/A","N/A","N/A","N/A","N/A","N/A","N/A","N/A"]
[null,"Highly contaminated (>100 CFU/100 mL)","N/A","N/A","N/A","N/A","N/A","N/A","N/A","N/A","N/A","N/A","N/A","N/A","N/A","N/A","N/A",null,null,null,null,null,null,null,null,null,null,null,null,null,null,null,null,null,null,null,null,null,null,null,null,null,null,null,null,null,null,null,null,null,null,null,null,"Highly contaminated (>100 CFU/100 mL)","N/A","N/A","N/A","N/A","N/A","N/A","N/A","N/A","N/A","N/A","N/A","N/A","N/A","N/A","N/A"]
[null,null,"NATIONAL wealth index quintile",null,null,null,null,"URBAN wealth index quintile",null,null,null,null,"RURAL wealth index quintile",null,null,null,null,null,null,null,null,null,null,null,null,null,null,null,null,null,null,null,null,null,null,null,null,null,null,null,null,null,null,null,null,null,null,null,null,null,null,null,"Raw numbers of respondents:","Use of drinking water sources","NATIONAL wealth index quintile",null,null,null,null,"URBAN wealth index quintile",null,null,null,null,"RURAL wealth index quintile"]
["Percentage based on weighted population",null,"Poorest","Poor","Middle","Rich","Richest","Poorest","Poor","Middle","Rich","Richest","Poorest","Poor","Middle","Rich","Richest",null,null,null,null,null,null,null,null,null,null,null,null,null,null,null,null,null,null,null,null,null,null,null,null,null,null,null,null,null,null,null,null,null,null,null,"Water data, raw numbers (weighted)",null,"Poorest","Poor","Middle","Rich","Richest","Poorest","Poor","Middle","Rich","Richest","Poorest","Poor","Middle","Rich","Richest"]
["main source of drinking water","Piped water through house connection or yard",85.352362303567674,92.602960471988965,96.781878783040924,98.040746770610369,99.307758356593695,92.912661650108177,97.239021566458504,98.405693788798359,99.221272036352062,99.663830261198726,68.892001523358616,86.067580151628391,80.29950648199852,91.402114244382375,93.542945082900658]
[null,"Public standpipe",4.7086889118473394,2.0586728540030856,0.94414288011985659,0.55606464514031062,0.14580982368874815,4.8861522955432752,1.9168268199273788,0.92762390103993331,0.59513304749736218,0.18891813522453529,5.5193677538647581,0.64209167082298524,1.2046009334202512,0.77091670106685484,0]
[null,"Protected tube well or bore hole",4.6501712527731387,3.888522720044707,1.3234932323523827,0.41660619533563065,0.39015883248339522,1.1619155218064887,0.17951459714290083,0.1878476563000584,0.18359491615058088,0.14725160357673259,9.8840780429779418,8.4637491912862028,14.458942201512826,5.1873761591026621,2.3960170245178887]
[null,"Protected dug well or protected spring",3.848165297144897,1.3345530968750465,0.95048510448684387,0.88754396027373728,0.15627298723416638,0.64996987600225076,0.66463701647121398,0.35060090126302507,0,0,12.119794491541267,3.4267753061779529,3.5319244509620491,2.6395928954481098,4.0610378925814556]
[null,"Unprotected dug well or spring",0.17199607650372414,0,0,0,0,0,0,0,0,0,0.7538295115485083,0,0,0,0]
[null,"Rainwater (into tank or cistern )",1.1300343179843524,0.11529085708819085,0,0,0,0.2093149149652791,0,0,0,0,2.8309286767089086,1.3998036800844584,0.50502593210635793,0,0]
[null,"Tanker-truck, vendor",0.13858184017887518,0,0,9.9038428639960263E-2,0,0.17998574157453268,0,0.12823375259861969,0,0,0,0,0,0,0]
[]
[]
[]
[]
[]
[]
[]
[]
[]
[]
[]
[]
[]
[]
[]
[]
[]
[]
[]
[]
[]
[]
[]
[]
[]
[]
[]
[]
[]
[]
[]
[]
[]
[]
[]
[]
[]
[]
[]
[]
[]
[]
[]
[{"$f":"A1026","v":"Uruguay"}]
[{"$f":"A1034","v":"2003"}]
["Use of sanitation facilities"]
[" by wealth quintile and sub-national region"]
["Notes:"]
["WHO/UNICEF JMP customised wealth index excludes water,"]
[" sanitation and hygiene assets."]
["Survey used for analysis:",{"$f":"A1025","v":"WHS03"}]
[{"$f":"B1030","v":""}]
[{"$f":"B1029","v":""}]
[]
[]
["Use of sanitation facilities",null,"NATIONAL wealth index quintile",null,null,null,null,"URBAN wealth index quintile",null,null,null,null,"RURAL wealth index quintile",null,null,null,null,null,null,null,null,null,null,null,null,null,null,null,null,null,null,null,null,null,null,null,null,null,null,null,null,null,null,null,null,null,null,null,null,null,null,null,"Raw numbers of respondents:","Use of sanitation facilities","NATIONAL wealth index quintile",null,null,null,null,"URBAN wealth index quintile",null,null,null,null,"RURAL wealth index quintile"]
["Weighted percentage (used in graphs)",null,"Poorest","Poor","Middle","Rich","Richest","Poorest","Poor","Middle","Rich","Richest","Poorest","Poor","Middle","Rich","Richest",null,null,null,null,null,null,null,null,null,null,null,null,null,null,null,null,null,null,null,null,null,null,null,null,null,null,null,null,null,null,null,null,null,null,null,"Sanitation data, raw numbers (weighted)",null,"Poorest","Poor","Middle","Rich","Richest","Poorest","Poor","Middle","Rich","Richest","Poorest","Poor","Middle","Rich","Richest"]
["Sanitation","Improved",99.844996313537763,99.885209824663391,100,99.83989213335532,99.839860918527918,100,100,100,99.792765301003229,99.792478626009924,99.316537578806262,100,99.494974067893637,100,100,null,null,null,null,null,null,null,null,null,null,null,null,null,null,null,null,null,null,null,null,null,null,null,null,null,null,null,null,null,null,null,null,null,null,null,"Sanitation","Improved",222169.96282958984,223097.9920501709,222131.96629333496,222280.23587036133,222236.83880615234,172068.03944396973,171819.13165283203,172029.55453491211,171650.86618041992,171413.25114440918,50119.645904541016,51029.137115478516,50511.080505371094,50229.455902099609,51046.833465576172]
[null,"Not Improved",0.15500368646224394,0.11479017533660672,0,0.1601078666446743,0.16013908147208339,0,0,0,0.20723469899677083,0.20752137399006773,0.68346242119373257,0,0.50502593210635793,0,0,null,null,null,null,null,null,null,null,null,null,null,null,null,null,null,null,null,null,null,null,null,null,null,null,null,null,null,null,null,null,null,null,null,null,null,null,"Not Improved",344.90625,256.38888549804688,0,356.4588623046875,356.4588623046875,0,0,0,356.4588623046875,356.4588623046875,344.90625,0,256.38888549804688,0,0]
["Sanitation ladder","Basic",{"$f":"C122*C129/100","v":97.799921036221846},{"$f":"D122*D129/100","v":99.076734924960618},{"$f":"E122*E129/100","v":99.854001669351206},99.519162062496932,99.597773307517144,99.092426789364268,99.453216649444116,99.604514180650511,99.39991823750384,99.664317000322484,93.685156757093608,98.645381758198837,98.852832345708634,100,100,null,null,null,null,null,null,null,null,null,null,null,null,null,null,null,null,null,null,null,null,null,null,null,null,null,null,null,null,null,null,null,null,null,null,null,"Sanitation ladder","Basic",215413.98263549805,220097.85528564453,220559.41612243652,221210.85928344727,221342.37347412109,168134.26605224609,169066.50442504883,170994.15292358398,170620.08483886719,171193.10829162598,46818.767120361328,50337.887115478516,50183.426666259766,50229.455902099609,51046.833465576172]
[null,"Limited",{"$f":"C122*C128/100","v":2.0450752773159278},{"$f":"D122*D128/100","v":0.80847489970278519},{"$f":"E122*E128/100","v":0.14599833064881435},0.32073007085839705,0.2420876110107707,0.90757321063573926,0.54678335055587612,0.39548581934948535,0.39284706349939569,0.12816162568743844,5.6313808217126526,1.3546182418011634,0.64214172218500787,0,0,null,null,null,null,null,null,null,null,null,null,null,null,null,null,null,null,null,null,null,null,null,null,null,null,null,null,null,null,null,null,null,null,null,null,null,null,"Limited",4504.480224609375,1798.1100769042969,322.48388671875,712.917724609375,538.0064697265625,1539.9174346923828,929.50990295410156,678.9427490234375,674.32247924804688,220.14285278320313,2814.2591247558594,691.25,327.65383911132813,0,0]
[null,"Unimproved",{"$f":"100-C124-C125-C127","v":0.15500368646222595},{"$f":"100-D124-D125-D127","v":0.11479017533659641},{"$f":"100-E124-E125-E127","v":-2.0150547896946591E-14},0.16010786664467119,0.160139081472085,-7.1054273576010019E-15,8.2156503822261584E-15,3.219646771412954E-15,0.20723469899676417,0.2075213739900777,0.68346242119373901,-8.8817841970012523E-16,0.50502593210635771,0,0,null,null,null,null,null,null,null,null,null,null,null,null,null,null,null,null,null,null,null,null,null,null,null,null,null,null,null,null,null,null,null,null,null,null,null,null,"Unimproved",344.90625,256.38888549804688,0,356.4588623046875,356.4588623046875,0,0,0,356.4588623046875,356.4588623046875,344.90625,0,256.38888549804688,0,0]
[null,"Open defecation",0,0,0,0,0,0,0,0,0,0,0,0,0,0,0,null,null,null,null,null,null,null,null,null,null,null,null,null,null,null,null,null,null,null,null,null,null,null,null,null,null,null,null,null,null,null,null,null,null,null,null,"Open defecation",100636.88548278809,135625.95893859863,174455.90521240234,189870.65858459473,200381.50825500488,103120.54670715332,132995.59417724609,144411.638671875,152654.13070678711,161005.86836242676,12064.143402099609,18193.691070556641,16523.347961425781,30585.306610107422,29416.648803710938]
["Shared among Improved Sanitation","Yes",2.0482501405417355,0.80940401599192391,0.14599833064881435,0.32124440842744556,0.24247590970536392,0.90757321063573926,0.54678335055587612,0.3954858193494854,0.39366286956219493,0.12842814153133419,5.6701340572250949,1.3546182418011634,0.64540116543657933,0,0,null,null,null,null,null,null,null,null,null,null,null,null,null,null,null,null,null,null,null,null,null,null,null,null,null,null,null,null,null,null,null,null,null,null,null,"Shared among improved sanitation facilities","Yes","N/A","N/A","N/A","N/A","N/A","N/A","N/A","N/A","N/A","N/A","N/A","N/A","N/A","N/A","N/A"]
[null,"No",97.951749859458261,99.190595984008084,99.854001669351192,99.678755591572553,99.757524090294638,99.092426789364268,99.453216649444116,99.604514180650511,99.606337130437808,99.87157185846867,94.329865942774902,98.645381758198837,99.354598834563419,100,100,null,null,null,null,null,null,null,null,null,null,null,null,null,null,null,null,null,null,null,null,null,null,null,null,null,null,null,null,null,null,null,null,null,null,null,null,"No","N/A","N/A","N/A","N/A","N/A","N/A","N/A","N/A","N/A","N/A","N/A","N/A","N/A","N/A","N/A"]
["Manually calculated ratios","Improved latrines"]
[null,"Other"]
[null,"Other"]
[null,null,"NATIONAL wealth index quintile",null,null,null,null,"URBAN wealth index quintile",null,null,null,null,"RURAL wealth index quintile",null,null,null,null,null,null,null,null,null,null,null,null,null,null,null,null,null,null,null,null,null,null,null,null,null,null,null,null,null,null,null,null,null,null,null,null,null,null,null,"Raw numbers of respondents:","Use of sanitation facilities","NATIONAL wealth index quintile",null,null,null,null,"URBAN wealth index quintile",null,null,null,null,"RURAL wealth index quintile"]
["Percentage based on weighted population",null,"Poorest","Poor","Middle","Rich","Richest","Poorest","Poor","Middle","Rich","Richest","Poorest","Poor","Middle","Rich","Richest",null,null,null,null,null,null,null,null,null,null,null,null,null,null,null,null,null,null,null,null,null,null,null,null,null,null,null,null,null,null,null,null,null,null,null,"Sanitation data, raw numbers (weighted)",null,"Poorest","Poor","Middle","Rich","Richest","Poorest","Poor","Middle","Rich","Richest","Poorest","Poor","Middle","Rich","Richest"]
["Sanitation type","Sewer connection",45.227038489186064,60.722318662583987,78.537055302533858,85.282733294520227,90.021357495437428,59.930099186567595,77.404415269639131,83.94583073954756,88.748621995528168,93.733562428517587,23.90617351592612,35.653534625491453,32.54711759258501,60.891176423889839,57.626784673232045,null,null,null,null,null,null,null,null,null,null,null,null,null,null,null,null,null,null,null,null,null,null,null,null,null,null,null,null,null,null,null,null,null,null,null,"Sanitation type","Sewer connection","N/A","N/A","N/A","N/A","N/A","N/A","N/A","N/A","N/A","N/A","N/A","N/A","N/A","N/A","N/A"]
[null,"Septic tank connection",49.978100547542986,38.316390784164049,20.676168642227751,14.557158838835097,9.8185034230904904,38.02394119896146,21.601790654925644,16.054169260452429,11.044143305475069,6.0589161974923487,71.029823074274972,54.586283441933759,65.175057779216317,37.827471551997469,42.373215326767948,null,null,null,null,null,null,null,null,null,null,null,null,null,null,null,null,null,null,null,null,null,null,null,null,null,null,null,null,null,null,null,null,null,null,null,null,"Septic tank connection","N/A","N/A","N/A","N/A","N/A","N/A","N/A","N/A","N/A","N/A","N/A","N/A","N/A","N/A","N/A"]
[null,"Improved latrines",4.6398572768087014,0.84650037791535426,0.78677605523839045,0,0,2.0459596144709393,0.9937940754352157,0,0,0,4.3805409886051709,9.7601819325747901,1.7727986960923099,1.2813520241126888,0,null,null,null,null,null,null,null,null,null,null,null,null,null,null,null,null,null,null,null,null,null,null,null,null,null,null,null,null,null,null,null,null,null,null,null,null,"Improved latrines","N/A","N/A","N/A","N/A","N/A","N/A","N/A","N/A","N/A","N/A","N/A","N/A","N/A","N/A","N/A"]
[null,"Unimproved facilities",0.15500368646224394,0.11479017533660672,0,0.1601078666446743,0.16013908147208339,0,0,0,0.20723469899677083,0.20752137399006773,0.68346242119373257,0,0.50502593210635793,0,0,null,null,null,null,null,null,null,null,null,null,null,null,null,null,null,null,null,null,null,null,null,null,null,null,null,null,null,null,null,null,null,null,null,null,null,null,"Unimproved facilities","N/A","N/A","N/A","N/A","N/A","N/A","N/A","N/A","N/A","N/A","N/A","N/A","N/A","N/A","N/A"]
[null,"Open defecation",0,0,0,0,0,0,0,0,0,0,0,0,0,0,0,null,null,null,null,null,null,null,null,null,null,null,null,null,null,null,null,null,null,null,null,null,null,null,null,null,null,null,null,null,null,null,null,null,null,null,null,"Open defecation","N/A","N/A","N/A","N/A","N/A","N/A","N/A","N/A","N/A","N/A","N/A","N/A","N/A","N/A","N/A"]
["Septic tank emptying practices","Not emptied/treated and disposed in situ","N/A","N/A","N/A","N/A","N/A","N/A","N/A","N/A","N/A","N/A","N/A","N/A","N/A","N/A","N/A",null,null,null,null,null,null,null,null,null,null,null,null,null,null,null,null,null,null,null,null,null,null,null,null,null,null,null,null,null,null,null,null,null,null,null,"Septic tank emptying practices","Not emptied/treated and disposed in situ","N/A","N/A","N/A","N/A","N/A","N/A","N/A","N/A","N/A","N/A","N/A","N/A","N/A","N/A","N/A"]
[null,"Emptied and buried on site","N/A","N/A","N/A","N/A","N/A","N/A","N/A","N/A","N/A","N/A","N/A","N/A","N/A","N/A","N/A",null,null,null,null,null,null,null,null,null,null,null,null,null,null,null,null,null,null,null,null,null,null,null,null,null,null,null,null,null,null,null,null,null,null,null,null,"Emptied and buried on site","N/A","N/A","N/A","N/A","N/A","N/A","N/A","N/A","N/A","N/A","N/A","N/A","N/A","N/A","N/A"]
[null,"Emptied and discharged locally","N/A","N/A","N/A","N/A","N/A","N/A","N/A","N/A","N/A","N/A","N/A","N/A","N/A","N/A","N/A",null,null,null,null,null,null,null,null,null,null,null,null,null,null,null,null,null,null,null,null,null,null,null,null,null,null,null,null,null,null,null,null,null,null,null,null,"Emptied and discharged locally","N/A","N/A","N/A","N/A","N/A","N/A","N/A","N/A","N/A","N/A","N/A","N/A","N/A","N/A","N/A"]
[null,"Emptied and removed offsite","N/A","N/A","N/A","N/A","N/A","N/A","N/A","N/A","N/A","N/A","N/A","N/A","N/A","N/A","N/A",null,null,null,null,null,null,null,null,null,null,null,null,null,null,null,null,null,null,null,null,null,null,null,null,null,null,null,null,null,null,null,null,null,null,null,null,"Emptied and removed offsite","N/A","N/A","N/A","N/A","N/A","N/A","N/A","N/A","N/A","N/A","N/A","N/A","N/A","N/A","N/A"]
["Latrine emptying practices","Not emptied/treated and disposed in situ","N/A","N/A","N/A","N/A","N/A","N/A","N/A","N/A","N/A","N/A","N/A","N/A","N/A","N/A","N/A",null,null,null,null,null,null,null,null,null,null,null,null,null,null,null,null,null,null,null,null,null,null,null,null,null,null,null,null,null,null,null,null,null,null,null,"Latrine emptying practices","Not emptied/treated and disposed in situ","N/A","N/A","N/A","N/A","N/A","N/A","N/A","N/A","N/A","N/A","N/A","N/A","N/A","N/A","N/A"]
[null,"Emptied and buried on site","N/A","N/A","N/A","N/A","N/A","N/A","N/A","N/A","N/A","N/A","N/A","N/A","N/A","N/A","N/A",null,null,null,null,null,null,null,null,null,null,null,null,null,null,null,null,null,null,null,null,null,null,null,null,null,null,null,null,null,null,null,null,null,null,null,null,"Emptied and buried on site","N/A","N/A","N/A","N/A","N/A","N/A","N/A","N/A","N/A","N/A","N/A","N/A","N/A","N/A","N/A"]
[null,"Emptied and discharged locally","N/A","N/A","N/A","N/A","N/A","N/A","N/A","N/A","N/A","N/A","N/A","N/A","N/A","N/A","N/A",null,null,null,null,null,null,null,null,null,null,null,null,null,null,null,null,null,null,null,null,null,null,null,null,null,null,null,null,null,null,null,null,null,null,null,null,"Emptied and discharged locally","N/A","N/A","N/A","N/A","N/A","N/A","N/A","N/A","N/A","N/A","N/A","N/A","N/A","N/A","N/A"]
[null,"Emptied and removed offsite","N/A","N/A","N/A","N/A","N/A","N/A","N/A","N/A","N/A","N/A","N/A","N/A","N/A","N/A","N/A",null,null,null,null,null,null,null,null,null,null,null,null,null,null,null,null,null,null,null,null,null,null,null,null,null,null,null,null,null,null,null,null,null,null,null,null,"Emptied and removed offsite","N/A","N/A","N/A","N/A","N/A","N/A","N/A","N/A","N/A","N/A","N/A","N/A","N/A","N/A","N/A"]
["Shared among improved sanitation facilities","Yes",2.0243502122989354,0.80504804489247639,0.14517671278923266,0.3202157332893486,0.24169931231617747,0.89494681270766963,0.54098160898183123,0.39466634140801143,0.39203125743659639,0.12816162568743844,5.5767048444967129,1.3546182418011634,0.64540116543657933,0,0,null,null,null,null,null,null,null,null,null,null,null,null,null,null,null,null,null,null,null,null,null,null,null,null,null,null,null,null,null,null,null,null,null,null,null,"Shared among improved sanitation facilities","Yes","N/A","N/A","N/A","N/A","N/A","N/A","N/A","N/A","N/A","N/A","N/A","N/A","N/A","N/A","N/A"]
[null,"No",96.80880362132028,98.656781768972564,99.292064894063103,99.35956853342131,99.438022524739651,97.713826806863466,98.397950681449714,99.398125738262024,99.193499344569858,99.664317000322484,92.77555258389107,98.645381758198837,99.354598834563419,100,100,null,null,null,null,null,null,null,null,null,null,null,null,null,null,null,null,null,null,null,null,null,null,null,null,null,null,null,null,null,null,null,null,null,null,null,null,"No","N/A","N/A","N/A","N/A","N/A","N/A","N/A","N/A","N/A","N/A","N/A","N/A","N/A","N/A","N/A"]
[null,"DK/missing",1.1668461663807872,0.53817018613495693,0.56275839314766629,0.3202157332893486,0.32027816294416678,1.391226380428864,1.0610677095684484,0.20720792032996099,0.41446939799354166,0.20752137399006773,1.647742571612228,0,0,0,0,null,null,null,null,null,null,null,null,null,null,null,null,null,null,null,null,null,null,null,null,null,null,null,null,null,null,null,null,null,null,null,null,null,null,null,null,"DK/missing","N/A","N/A","N/A","N/A","N/A","N/A","N/A","N/A","N/A","N/A","N/A","N/A","N/A","N/A","N/A"]
["Shared among all sanitation facilities","Yes",98.350407370029174,99.186096768937915,99.85351350683905,99.676610334860442,99.757121217767718,99.280021507880718,99.450876357139578,99.601954126694508,99.604638188618821,99.871295516874,95.316505856964028,98.607107535293778,99.351658602491426,100,100,null,null,null,null,null,null,null,null,null,null,null,null,null,null,null,null,null,null,null,null,null,null,null,null,null,null,null,null,null,null,null,null,null,null,null,"Shared among all sanitation facilities","Yes","N/A","N/A","N/A","N/A","N/A","N/A","N/A","N/A","N/A","N/A","N/A","N/A","N/A","N/A","N/A"]
[null,"No",1.6495926299708186,0.81390323106208595,0.14648649316095083,0.32338966513955941,0.24287878223227538,0.71997849211928688,0.54912364286043247,0.39804587330548896,0.39536181138117704,0.12870448312599891,4.6834941430359747,1.3928924647062155,0.64834139750856379,0,0,null,null,null,null,null,null,null,null,null,null,null,null,null,null,null,null,null,null,null,null,null,null,null,null,null,null,null,null,null,null,null,null,null,null,null,null,"No","N/A","N/A","N/A","N/A","N/A","N/A","N/A","N/A","N/A","N/A","N/A","N/A","N/A","N/A","N/A"]
["What type of toilet facilities","Flush to piped sewage system",45.227038489186064,60.792102023087089,78.537055302533858,85.41949662827038,90.165748096241188,59.930099186567595,77.404415269639131,83.94583073954756,88.932921868471311,93.928484109309267,23.90617351592612,35.653534625491453,32.712323308286329,60.891176423889839,57.626784673232045,null,null,null,null,null,null,null,null,null,null,null,null,null,null,null,null,null,null,null,null,null,null,null,null,null,null,null,null,null,null,null,null,null,null,null,"What type of toilet facilities","Flush to piped sewage system",100636.88548278809,135625.95893859863,174455.90521240234,189870.65858459473,200381.50825500488,103120.54670715332,132995.59417724609,144411.638671875,152654.13070678711,161005.86836242676,12064.143402099609,18193.691070556641,16523.347961425781,30585.306610107422,29416.648803710938]
[null,"Flush to septic tank",49.978100547542986,38.360424783032364,20.676168642227751,14.580503371729629,9.8342519037588207,38.02394119896146,21.601790654925644,16.054169260452429,11.06707813152868,6.0715158906907352,71.029823074274972,54.586283441933759,65.505879457531179,37.827471551997469,42.373215326767948,null,null,null,null,null,null,null,null,null,null,null,null,null,null,null,null,null,null,null,null,null,null,null,null,null,null,null,null,null,null,null,null,null,null,null,null,"Flush to septic tank",111208.70500183105,85581.337432861328,45928.379959106445,32409.577285766602,21855.330551147461,65427.050140380859,37116.009124755859,27617.915863037109,18996.735473632813,10407.382781982422,35844.882110595703,27854.909423828125,33087.727508544922,19000.533142089844,21630.184661865234]
[null,"Pour flush latrine",1.2044077088680665,0.11492209461051062,0.78677605523839045,0,0,1.0067804321315119,0.86794306430400625,0,0,0,0.50805738791239008,1.3546182418011634,0.50758939015526261,0.51043532304583394,0,null,null,null,null,null,null,null,null,null,null,null,null,null,null,null,null,null,null,null,null,null,null,null,null,null,null,null,null,null,null,null,null,null,null,null,null,"Pour flush latrine",2679.9862365722656,256.38888549804688,1747.6811218261719,0,0,1732.3473510742188,1491.292236328125,0,0,0,256.38888549804688,691.25,256.38888549804688,256.38888549804688,0]
[null,"Covered dry latrine (with privacy)",3.4354495679406343,0.73255109927002982,0,0,0,1.0391791823394274,0.1258510111312095,0,0,0,3.8724836006927812,8.4055636907736258,1.2742078440272224,0.77091670106685484,0,null,null,null,null,null,null,null,null,null,null,null,null,null,null,null,null,null,null,null,null,null,null,null,null,null,null,null,null,null,null,null,null,null,null,null,null,"Covered dry latrine (with privacy)",7644.3861083984375,1634.3067932128906,0,0,0,1788.0952453613281,216.23611450195313,0,0,0,1954.2315063476563,4289.28662109375,643.61614990234375,387.22726440429688,0]
[null,"Bucket latrine (where fresh excreta are manually removed)",0.15500368646224394,0,0,0,0,0,0,0,0,0,0.68346242119373257,0,0,0,0,null,null,null,null,null,null,null,null,null,null,null,null,null,null,null,null,null,null,null,null,null,null,null,null,null,null,null,null,null,null,null,null,null,null,null,null,"Bucket latrine (where fresh excreta are manually removed)",344.90625,0,0,0,0,0,0,0,0,0,344.90625,0,0,0,0]
[null,null,null,null,null,null,null,null,null,null,null,null,null,null,null,null,null,null,null,null,null,null,null,null,null,null,null,null,null,null,null,null,null,null,null,null,null,null,null,null,null,null,null,null,null,null,null,null,null,null,null,null,null,"Total",222514.86907958984,223097.9920501709,222131.96629333496,222280.23587036133,222236.83880615234,172068.03944396973,171819.13165283203,172029.55453491211,171650.86618041992,171413.25114440918,50464.552154541016,51029.137115478516,50511.080505371094,50229.455902099609,51046.833465576172]
[]
[]
[]
[]
[]
[]
[]
[]
[]
[]
[]
[]
[]
[]
[]
[]
[]
[]
[]
[]
[]
[]
[]
[]
[]
[]
[]
[]
[]
[]
[]
[]
[]
[]
[]
[]
[]
[]
[]
[]
[]
[]
[]
[]
[]
[]
[]
[]
[]
[{"$f":"A1026","v":"Uruguay"}]
[{"$f":"A1034","v":"2003"}]
["Access to hygiene facilities "]
[" by wealth quintile and sub-national region"]
["Notes:"]
["WHO/UNICEF JMP customised wealth index excludes water,"]
[" sanitation and hygiene assets."]
["Survey used for analysis:",{"$f":"A1025","v":"WHS03"}]
[]
[]
[]
[]
["Access to handwashing",null,"NATIONAL wealth index quintile",null,null,null,null,"URBAN wealth index quintile",null,null,null,null,"RURAL wealth index quintile",null,null,null,null,null,null,null,null,null,null,null,null,null,null,null,null,null,null,null,null,null,null,null,null,null,null,null,null,null,null,null,null,null,null,null,null,null,null,null,"Raw numbers of respondents:","Access to handwashing","NATIONAL wealth index quintile",null,null,null,null,"URBAN wealth index quintile",null,null,null,null,"RURAL wealth index quintile"]
["Weighted percentage (used in graphs)",null,"Poorest","Poor","Middle","Rich","Richest","Poorest","Poor","Middle","Rich","Richest","Poorest","Poor","Middle","Rich","Richest",null,null,null,null,null,null,null,null,null,null,null,null,null,null,null,null,null,null,null,null,null,null,null,null,null,null,null,null,null,null,null,null,null,null,null,"Hygiene data, raw numbers (weighted)",null,"Poorest","Poor","Middle","Rich","Richest","Poorest","Poor","Middle","Rich","Richest","Poorest","Poor","Middle","Rich","Richest"]
["Hygiene ladder","Basic","N/A","N/A","N/A","N/A","N/A","N/A","N/A","N/A","N/A","N/A","N/A","N/A","N/A","N/A","N/A",null,null,null,null,null,null,null,null,null,null,null,null,null,null,null,null,null,null,null,null,null,null,null,null,null,null,null,null,null,null,null,null,null,null,null,"Hygiene ladder","Basic","N/A","N/A","N/A","N/A","N/A","N/A","N/A","N/A","N/A","N/A","N/A","N/A","N/A","N/A","N/A"]
[null,"Limited","N/A","N/A","N/A","N/A","N/A","N/A","N/A","N/A","N/A","N/A","N/A","N/A","N/A","N/A","N/A",null,null,null,null,null,null,null,null,null,null,null,null,null,null,null,null,null,null,null,null,null,null,null,null,null,null,null,null,null,null,null,null,null,null,null,null,"Limited","N/A","N/A","N/A","N/A","N/A","N/A","N/A","N/A","N/A","N/A","N/A","N/A","N/A","N/A","N/A"]
[null,"No facility","N/A","N/A","N/A","N/A","N/A","N/A","N/A","N/A","N/A","N/A","N/A","N/A","N/A","N/A","N/A",null,null,null,null,null,null,null,null,null,null,null,null,null,null,null,null,null,null,null,null,null,null,null,null,null,null,null,null,null,null,null,null,null,null,null,null,"No facility","N/A","N/A","N/A","N/A","N/A","N/A","N/A","N/A","N/A","N/A","N/A","N/A","N/A","N/A","N/A"]
[null,null,null,null,null,null,null,null,null,null,null,null,null,null,null,null,null,null,null,null,null,null,null,null,null,null,null,null,null,null,null,null,null,null,null,null,null,null,null,null,null,null,null,null,null,null,null,null,null,null,null,null,"Observed handwashing place","Fixed","N/A","N/A","N/A","N/A","N/A","N/A","N/A","N/A","N/A","N/A","N/A","N/A","N/A","N/A","N/A"]
[null,null,null,null,null,null,null,null,null,null,null,null,null,null,null,null,null,null,null,null,null,null,null,null,null,null,null,null,null,null,null,null,null,null,null,null,null,null,null,null,null,null,null,null,null,null,null,null,null,null,null,null,null,"Mobile","N/A","N/A","N/A","N/A","N/A","N/A","N/A","N/A","N/A","N/A","N/A","N/A","N/A","N/A","N/A"]
[null,null,null,null,null,null,null,null,null,null,null,null,null,null,null,null,null,null,null,null,null,null,null,null,null,null,null,null,null,null,null,null,null,null,null,null,null,null,null,null,null,null,null,null,null,null,null,null,null,null,null,null,"Water / Soap","Water and soap","N/A","N/A","N/A","N/A","N/A","N/A","N/A","N/A","N/A","N/A","N/A","N/A","N/A","N/A","N/A"]
[null,null,null,null,null,null,null,null,null,null,null,null,null,null,null,null,null,null,null,null,null,null,null,null,null,null,null,null,null,null,null,null,null,null,null,null,null,null,null,null,null,null,null,null,null,null,null,null,null,null,null,null,null,"Water only","N/A","N/A","N/A","N/A","N/A","N/A","N/A","N/A","N/A","N/A","N/A","N/A","N/A","N/A","N/A"]
[null,null,null,null,null,null,null,null,null,null,null,null,null,null,null,null,null,null,null,null,null,null,null,null,null,null,null,null,null,null,null,null,null,null,null,null,null,null,null,null,null,null,null,null,null,null,null,null,null,null,null,null,null,"Soap only","N/A","N/A","N/A","N/A","N/A","N/A","N/A","N/A","N/A","N/A","N/A","N/A","N/A","N/A","N/A"]
[null,null,null,null,null,null,null,null,null,null,null,null,null,null,null,null,null,null,null,null,null,null,null,null,null,null,null,null,null,null,null,null,null,null,null,null,null,null,null,null,null,null,null,null,null,null,null,null,null,null,null,null,null,"Neither","N/A","N/A","N/A","N/A","N/A","N/A","N/A","N/A","N/A","N/A","N/A","N/A","N/A","N/A","N/A"]
[]
[]
[]
[]
[]
[]
[]
[]
[]
[]
[]
[]
[]
[]
[]
[]
[]
[]
[]
[]
[]
[]
[]
[]
[]
[]
[]
[]
[null,null,null,null,null,null,null,null,null,null,null,null,null,null,null,null,null,null,null,null,null,null,null,null,null,null,null,null,null,null,null,null,null,null,null,null,null,null,null,null,null,null,null,null,null,null,null,null,null,null,null,null,"Raw numbers of respondents:","Menstrual health and hygiene","NATIONAL wealth index quintile",null,null,null,null,"URBAN wealth index quintile",null,null,null,null,"RURAL wealth index quintile"]
[null,null,null,null,null,null,null,null,null,null,null,null,null,null,null,null,null,null,null,null,null,null,null,null,null,null,null,null,null,null,null,null,null,null,null,null,null,null,null,null,null,null,null,null,null,null,null,null,null,null,null,null,"MHH data, raw numbers (weighted)",null,"Poorest","Poor","Middle","Rich","Richest","Poorest","Poor","Middle","Rich","Richest","Poorest","Poor","Middle","Rich","Richest"]
[null,null,null,null,null,null,null,null,null,null,null,null,null,null,null,null,null,null,null,null,null,null,null,null,null,null,null,null,null,null,null,null,null,null,null,null,null,null,null,null,null,null,null,null,null,null,null,null,null,null,null,null,"Private place to wash and change","Yes","N/A","N/A","N/A","N/A","N/A","N/A","N/A","N/A","N/A","N/A","N/A","N/A","N/A","N/A","N/A"]
[null,null,null,null,null,null,null,null,null,null,null,null,null,null,null,null,null,null,null,null,null,null,null,null,null,null,null,null,null,null,null,null,null,null,null,null,null,null,null,null,null,null,null,null,null,null,null,null,null,null,null,null,null,"No","N/A","N/A","N/A","N/A","N/A","N/A","N/A","N/A","N/A","N/A","N/A","N/A","N/A","N/A","N/A"]
[null,null,null,null,null,null,null,null,null,null,null,null,null,null,null,null,null,null,null,null,null,null,null,null,null,null,null,null,null,null,null,null,null,null,null,null,null,null,null,null,null,null,null,null,null,null,null,null,null,null,null,null,null,"DK/not sure/missing","N/A","N/A","N/A","N/A","N/A","N/A","N/A","N/A","N/A","N/A","N/A","N/A","N/A","N/A","N/A"]
[null,null,null,null,null,null,null,null,null,null,null,null,null,null,null,null,null,null,null,null,null,null,null,null,null,null,null,null,null,null,null,null,null,null,null,null,null,null,null,null,null,null,null,null,null,null,null,null,null,null,null,null,"Use of menstrual materials","Materials reusable","N/A","N/A","N/A","N/A","N/A","N/A","N/A","N/A","N/A","N/A","N/A","N/A","N/A","N/A","N/A"]
[null,null,null,null,null,null,null,null,null,null,null,null,null,null,null,null,null,null,null,null,null,null,null,null,null,null,null,null,null,null,null,null,null,null,null,null,null,null,null,null,null,null,null,null,null,null,null,null,null,null,null,null,null,"Materials not reusable","N/A","N/A","N/A","N/A","N/A","N/A","N/A","N/A","N/A","N/A","N/A","N/A","N/A","N/A","N/A"]
[null,null,null,null,null,null,null,null,null,null,null,null,null,null,null,null,null,null,null,null,null,null,null,null,null,null,null,null,null,null,null,null,null,null,null,null,null,null,null,null,null,null,null,null,null,null,null,null,null,null,null,null,null,"No materials used","N/A","N/A","N/A","N/A","N/A","N/A","N/A","N/A","N/A","N/A","N/A","N/A","N/A","N/A","N/A"]
[null,null,null,null,null,null,null,null,null,null,null,null,null,null,null,null,null,null,null,null,null,null,null,null,null,null,null,null,null,null,null,null,null,null,null,null,null,null,null,null,null,null,null,null,null,null,null,null,null,null,null,null,null,"DK/not sure/missing","N/A","N/A","N/A","N/A","N/A","N/A","N/A","N/A","N/A","N/A","N/A","N/A","N/A","N/A","N/A"]
[null,null,null,null,null,null,null,null,null,null,null,null,null,null,null,null,null,null,null,null,null,null,null,null,null,null,null,null,null,null,null,null,null,null,null,null,null,null,null,null,null,null,null,null,null,null,null,null,null,null,null,null,"Use of menstrual materials with private place to wash and change","Materials reusable","N/A","N/A","N/A","N/A","N/A","N/A","N/A","N/A","N/A","N/A","N/A","N/A","N/A","N/A","N/A"]
[null,null,null,null,null,null,null,null,null,null,null,null,null,null,null,null,null,null,null,null,null,null,null,null,null,null,null,null,null,null,null,null,null,null,null,null,null,null,null,null,null,null,null,null,null,null,null,null,null,null,null,null,null,"Materials not reusable","N/A","N/A","N/A","N/A","N/A","N/A","N/A","N/A","N/A","N/A","N/A","N/A","N/A","N/A","N/A"]
[null,null,null,null,null,null,null,null,null,null,null,null,null,null,null,null,null,null,null,null,null,null,null,null,null,null,null,null,null,null,null,null,null,null,null,null,null,null,null,null,null,null,null,null,null,null,null,null,null,null,null,null,null,"No materials used","N/A","N/A","N/A","N/A","N/A","N/A","N/A","N/A","N/A","N/A","N/A","N/A","N/A","N/A","N/A"]
[null,null,null,null,null,null,null,null,null,null,null,null,null,null,null,null,null,null,null,null,null,null,null,null,null,null,null,null,null,null,null,null,null,null,null,null,null,null,null,null,null,null,null,null,null,null,null,null,null,null,null,null,"Awareness of menstruation before menarche","Yes","N/A","N/A","N/A","N/A","N/A","N/A","N/A","N/A","N/A","N/A","N/A","N/A","N/A","N/A","N/A"]
[null,null,null,null,null,null,null,null,null,null,null,null,null,null,null,null,null,null,null,null,null,null,null,null,null,null,null,null,null,null,null,null,null,null,null,null,null,null,null,null,null,null,null,null,null,null,null,null,null,null,null,null,null,"No","N/A","N/A","N/A","N/A","N/A","N/A","N/A","N/A","N/A","N/A","N/A","N/A","N/A","N/A","N/A"]
[null,null,null,null,null,null,null,null,null,null,null,null,null,null,null,null,null,null,null,null,null,null,null,null,null,null,null,null,null,null,null,null,null,null,null,null,null,null,null,null,null,null,null,null,null,null,null,null,null,null,null,null,null,"DK/not sure/missing","N/A","N/A","N/A","N/A","N/A","N/A","N/A","N/A","N/A","N/A","N/A","N/A","N/A","N/A","N/A"]
[null,null,null,null,null,null,null,null,null,null,null,null,null,null,null,null,null,null,null,null,null,null,null,null,null,null,null,null,null,null,null,null,null,null,null,null,null,null,null,null,null,null,null,null,null,null,null,null,null,null,null,null,"Participation in (all) activities during menstruation","Yes","N/A","N/A","N/A","N/A","N/A","N/A","N/A","N/A","N/A","N/A","N/A","N/A","N/A","N/A","N/A"]
[null,null,null,null,null,null,null,null,null,null,null,null,null,null,null,null,null,null,null,null,null,null,null,null,null,null,null,null,null,null,null,null,null,null,null,null,null,null,null,null,null,null,null,null,null,null,null,null,null,null,null,null,null,"No","N/A","N/A","N/A","N/A","N/A","N/A","N/A","N/A","N/A","N/A","N/A","N/A","N/A","N/A","N/A"]
[null,null,null,null,null,null,null,null,null,null,null,null,null,null,null,null,null,null,null,null,null,null,null,null,null,null,null,null,null,null,null,null,null,null,null,null,null,null,null,null,null,null,null,null,null,null,null,null,null,null,null,null,null,"DK/not sure/missing/no such activity","N/A","N/A","N/A","N/A","N/A","N/A","N/A","N/A","N/A","N/A","N/A","N/A","N/A","N/A","N/A"]
[null,null,null,null,null,null,null,null,null,null,null,null,null,null,null,null,null,null,null,null,null,null,null,null,null,null,null,null,null,null,null,null,null,null,null,null,null,null,null,null,null,null,null,null,null,null,null,null,null,null,null,null,"Participation in specific activities during menstruation","Did not go to school (amongst those usually attending school)","N/A","N/A","N/A","N/A","N/A","N/A","N/A","N/A","N/A","N/A","N/A","N/A","N/A","N/A","N/A"]
[null,null,null,null,null,null,null,null,null,null,null,null,null,null,null,null,null,null,null,null,null,null,null,null,null,null,null,null,null,null,null,null,null,null,null,null,null,null,null,null,null,null,null,null,null,null,null,null,null,null,null,null,null,"Did not go to work (amongst those who usually work)","N/A","N/A","N/A","N/A","N/A","N/A","N/A","N/A","N/A","N/A","N/A","N/A","N/A","N/A","N/A"]
[null,null,null,null,null,null,null,null,null,null,null,null,null,null,null,null,null,null,null,null,null,null,null,null,null,null,null,null,null,null,null,null,null,null,null,null,null,null,null,null,null,null,null,null,null,null,null,null,null,null,null,null,null,"Did not participate in social activities","N/A","N/A","N/A","N/A","N/A","N/A","N/A","N/A","N/A","N/A","N/A","N/A","N/A","N/A","N/A"]
[null,null,null,null,null,null,null,null,null,null,null,null,null,null,null,null,null,null,null,null,null,null,null,null,null,null,null,null,null,null,null,null,null,null,null,null,null,null,null,null,null,null,null,null,null,null,null,null,null,null,null,null,null,"Did not cook food","N/A","N/A","N/A","N/A","N/A","N/A","N/A","N/A","N/A","N/A","N/A","N/A","N/A","N/A","N/A"]
[null,null,null,null,null,null,null,null,null,null,null,null,null,null,null,null,null,null,null,null,null,null,null,null,null,null,null,null,null,null,null,null,null,null,null,null,null,null,null,null,null,null,null,null,null,null,null,null,null,null,null,null,null,"Did not eat with others","N/A","N/A","N/A","N/A","N/A","N/A","N/A","N/A","N/A","N/A","N/A","N/A","N/A","N/A","N/A"]
[null,null,null,null,null,null,null,null,null,null,null,null,null,null,null,null,null,null,null,null,null,null,null,null,null,null,null,null,null,null,null,null,null,null,null,null,null,null,null,null,null,null,null,null,null,null,null,null,null,null,null,null,null,"Did not bathe in regular place","N/A","N/A","N/A","N/A","N/A","N/A","N/A","N/A","N/A","N/A","N/A","N/A","N/A","N/A","N/A"]
[null,null,null,null,null,null,null,null,null,null,null,null,null,null,null,null,null,null,null,null,null,null,null,null,null,null,null,null,null,null,null,null,null,null,null,null,null,null,null,null,null,null,null,null,null,null,null,null,null,null,null,null,null,"Did not participate in other activities","N/A","N/A","N/A","N/A","N/A","N/A","N/A","N/A","N/A","N/A","N/A","N/A","N/A","N/A","N/A"]
[null,null,null,null,null,null,null,null,null,null,null,null,null,null,null,null,null,null,null,null,null,null,null,null,null,null,null,null,null,null,null,null,null,null,null,null,null,null,null,null,null,null,null,null,null,null,null,null,null,null,null,null,null,"DK/not sure/missing/no such activity","N/A","N/A","N/A","N/A","N/A","N/A","N/A","N/A","N/A","N/A","N/A","N/A","N/A","N/A","N/A"]
[]
[]
[]
[]
[]
[]
[]
[]
[]
[]
[]
[]
[]
[]
[]
[]
[]
[]
[]
[]
[]
[]
[]
[]
[]
[]
[]
[]
[]
[]
[]
[]
[]
[]
[]
[]
[]
[]
[]
[]
[]
[]
[]
[]
[]
[]
[]
[]
[]
[]
[]
[]
[]
[]
[null,null,null,null,null,null,null,null,null,null,null,null,null,null,null,null,null,null,null,null,null,null,null,null,null,null,null,null,null,null,null,null,null,null,null,null,null,null,null,null,null,null,null,null,null,null,null,null,null,null,null,null,"Raw numbers of respondents:","Basic water, sanitation and hygiene","NATIONAL wealth index quintile",null,null,null,null,"URBAN wealth index quintile",null,null,null,null,"RURAL wealth index quintile"]
[null,null,null,null,null,null,null,null,null,null,null,null,null,null,null,null,null,null,null,null,null,null,null,null,null,null,null,null,null,null,null,null,null,null,null,null,null,null,null,null,null,null,null,null,null,null,null,null,null,null,null,null,"WatSan data, raw numbers (weighted)",null,"Poorest","Poor","Middle","Rich","Richest","Poorest","Poor","Middle","Rich","Richest","Poorest","Poor","Middle","Rich","Richest"]
[null,null,null,null,null,null,null,null,null,null,null,null,null,null,null,null,null,null,null,null,null,null,null,null,null,null,null,null,null,null,null,null,null,null,null,null,null,null,null,null,null,null,null,null,null,null,null,null,null,null,null,null,"Use of Basic Water Sanitation and Hygiene","Yes","N/A","N/A","N/A","N/A","N/A","N/A","N/A","N/A","N/A","N/A","N/A","N/A","N/A","N/A","N/A"]
[null,null,null,null,null,null,null,null,null,null,null,null,null,null,null,null,null,null,null,null,null,null,null,null,null,null,null,null,null,null,null,null,null,null,null,null,null,null,null,null,null,null,null,null,null,null,null,null,null,null,null,null,null,"No","N/A","N/A","N/A","N/A","N/A","N/A","N/A","N/A","N/A","N/A","N/A","N/A","N/A","N/A","N/A"]
[null,null,null,null,null,null,null,null,null,null,null,null,null,null,null,null,null,null,null,null,null,null,null,null,null,null,null,null,null,null,null,null,null,null,null,null,null,null,null,null,null,null,null,null,null,null,null,null,null,null,null,null,"Use of Basic Water and Sanitation","Yes","N/A","N/A","N/A","N/A","N/A","N/A","N/A","N/A","N/A","N/A","N/A","N/A","N/A","N/A","N/A"]
[null,null,null,null,null,null,null,null,null,null,null,null,null,null,null,null,null,null,null,null,null,null,null,null,null,null,null,null,null,null,null,null,null,null,null,null,null,null,null,null,null,null,null,null,null,null,null,null,null,null,null,null,null,"No","N/A","N/A","N/A","N/A","N/A","N/A","N/A","N/A","N/A","N/A","N/A","N/A","N/A","N/A","N/A"]
[null,null,null,null,null,null,null,null,null,null,null,null,null,null,null,null,null,null,null,null,null,null,null,null,null,null,null,null,null,null,null,null,null,null,null,null,null,null,null,null,null,null,null,null,null,null,null,null,null,null,null,null,"Use of Basic Water and Hygiene","Yes","N/A","N/A","N/A","N/A","N/A","N/A","N/A","N/A","N/A","N/A","N/A","N/A","N/A","N/A","N/A"]
[null,null,null,null,null,null,null,null,null,null,null,null,null,null,null,null,null,null,null,null,null,null,null,null,null,null,null,null,null,null,null,null,null,null,null,null,null,null,null,null,null,null,null,null,null,null,null,null,null,null,null,null,null,"No","N/A","N/A","N/A","N/A","N/A","N/A","N/A","N/A","N/A","N/A","N/A","N/A","N/A","N/A","N/A"]
[null,null,null,null,null,null,null,null,null,null,null,null,null,null,null,null,null,null,null,null,null,null,null,null,null,null,null,null,null,null,null,null,null,null,null,null,null,null,null,null,null,null,null,null,null,null,null,null,null,null,null,null,"Use of Basic Sanitation and Hygiene","Yes","N/A","N/A","N/A","N/A","N/A","N/A","N/A","N/A","N/A","N/A","N/A","N/A","N/A","N/A","N/A"]
[null,null,null,null,null,null,null,null,null,null,null,null,null,null,null,null,null,null,null,null,null,null,null,null,null,null,null,null,null,null,null,null,null,null,null,null,null,null,null,null,null,null,null,null,null,null,null,null,null,null,null,null,null,"No","N/A","N/A","N/A","N/A","N/A","N/A","N/A","N/A","N/A","N/A","N/A","N/A","N/A","N/A","N/A"]
[null,null,null,null,null,null,null,null,null,null,null,null,null,null,null,null,null,null,null,null,null,null,null,null,null,null,null,null,null,null,null,null,null,null,null,null,null,null,null,null,null,null,null,null,null,null,null,null,null,null,null,null,"Use of Basic Water","Yes","N/A","N/A","N/A","N/A","N/A","N/A","N/A","N/A","N/A","N/A","N/A","N/A","N/A","N/A","N/A"]
[null,null,null,null,null,null,null,null,null,null,null,null,null,null,null,null,null,null,null,null,null,null,null,null,null,null,null,null,null,null,null,null,null,null,null,null,null,null,null,null,null,null,null,null,null,null,null,null,null,null,null,null,null,"No","N/A","N/A","N/A","N/A","N/A","N/A","N/A","N/A","N/A","N/A","N/A","N/A","N/A","N/A","N/A"]
[null,null,null,null,null,null,null,null,null,null,null,null,null,null,null,null,null,null,null,null,null,null,null,null,null,null,null,null,null,null,null,null,null,null,null,null,null,null,null,null,null,null,null,null,null,null,null,null,null,null,null,null,"Use of Basic Sanitation","Yes","N/A","N/A","N/A","N/A","N/A","N/A","N/A","N/A","N/A","N/A","N/A","N/A","N/A","N/A","N/A"]
[null,null,null,null,null,null,null,null,null,null,null,null,null,null,null,null,null,null,null,null,null,null,null,null,null,null,null,null,null,null,null,null,null,null,null,null,null,null,null,null,null,null,null,null,null,null,null,null,null,null,null,null,null,"No","N/A","N/A","N/A","N/A","N/A","N/A","N/A","N/A","N/A","N/A","N/A","N/A","N/A","N/A","N/A"]
[null,null,null,null,null,null,null,null,null,null,null,null,null,null,null,null,null,null,null,null,null,null,null,null,null,null,null,null,null,null,null,null,null,null,null,null,null,null,null,null,null,null,null,null,null,null,null,null,null,null,null,null,"Access to Basic Hygiene","Yes","N/A","N/A","N/A","N/A","N/A","N/A","N/A","N/A","N/A","N/A","N/A","N/A","N/A","N/A","N/A"]
[null,null,null,null,null,null,null,null,null,null,null,null,null,null,null,null,null,null,null,null,null,null,null,null,null,null,null,null,null,null,null,null,null,null,null,null,null,null,null,null,null,null,null,null,null,null,null,null,null,null,null,null,null,"No","N/A","N/A","N/A","N/A","N/A","N/A","N/A","N/A","N/A","N/A","N/A","N/A","N/A","N/A","N/A"]
[]
[]
[]
[]
[]
[]
[]
[]
[]
[]
[]
[]
[]
[]
[]
[]
[]
[]
[]
[]
[]
[]
[]
[]
[]
[]
[]
[]
[]
[]
[]
[]
[]
[]
[]
[]
[]
[]
[]
[]
[]
[]
[]
[]
[null,null,"INITIAL (national) Wealth Index",null,null,null,null,"URBAN Wealth Index",null,null,null,null,"RURAL Wealth Index"]
[null,null,"Component Matrix",null,null,null,null,"Component Matrix",null,null,null,null,"Component Matrix"]
[null,null,null,null,"Component",null,null,null,null,"Component",null,null,null,null,"Component"]
[null,"Note:\n\nThe INITIAL (national) Wealth Index is based on the first component of the Principal Component Analysis (PCA) which has been obtained at national level.\n\nThe final national-level (NATIONAL) Wealth Index is based on the URBAN and RURAL specific wealth indexes. Regression procedures are used to establish the relationships between the two sets of scores (urban and rural) and the initial (national) wealth factors.\nThis allows best use of the available information for each area and a better precision of the FINAL (NATIONAL) Wealth Index.\n\nFor dependency reasons, all WASH variables (contained in the generic MICS and DHS scripts) have been excluded from the sets of asset variables used in the PCAs.\n\nThe PCA can extracts as many components as there are asset variables in the input. Only the first of the components is used to represent the Wealth Index. \n\nThe scores represent the weights of the asset variables on the Wealth Index (correlations between the variables and the component).\n\nThe communalities are the proportion of each variable's variance that can be explained by the component.\n\nProportion of explained variance is the part of the model's total variance that is explained by the component.\n\nFor more information on the procedure used:\n\nThe DHS Wealth Index, DHS Comparative Reports No. 6, Shea Oscar Rutstein, Kiersten Johnson, ORC Macro International Inc., 2004.\n\nThe DHS Wealth Index: Approaches for Rural and Urban Areas, Shea O. Rutstein, ORC Macro International Inc., 2008.\n\nMICS Methodological Paper No. 4, Review of options for reporting water, sanitation and hygiene coverage by wealth quintile, UNICEF, 2016.",null,null,"1",null,null,null,null,"1",null,null,null,null,"1"]
[null,null,"Has Computer",null,0.6478582718935707,null,null,"Has Computer",null,0.67641504004644237,null,null,"Uses gaz fuel",null,-0.58436488035242251]
[null,null,"Has Internet",null,0.63597121404697732,null,null,"Has Internet",null,0.67000490371142374,null,null,"Uses wood fuel",null,0.52347557867087835]
[null,null,"Has Vacuum cleaner",null,0.62551472954237652,null,null,"Has Video",null,0.62592933989181643,null,null,"Has Clothes washing machine",null,0.51328198109095746]
[null,null,"Has Video",null,0.61332639446784309,null,null,"Has Vacuum cleaner",null,0.62279434363284125,null,null,"Has mud brick wall",null,0.50443774332138924]
[null,null,"Has Clothes washing machine",null,0.54329658607011677,null,null,"Has Cellular phone",null,0.55631981848750967,null,null,"Uses separate room as kitchen",null,0.49562469907915679]
[null,null,"Has Cellular phone",null,0.5431204381607686,null,null,"Has Car",null,0.53678496044839186,null,null,"Has Vacuum cleaner",null,0.47739073835095075]
[null,null,"Has Stereo",null,0.49659221610443977,null,null,"Has Clothes washing machine",null,0.53073078468935453,null,null,"Has Computer",null,0.46892497813411244]
[null,null,"Has Car",null,0.49051837328904574,null,null,"Has Employee",null,0.47449819394019888,null,null,"Has Stereo",null,0.45759660616778031]
[null,null,"Has Telephone",null,0.48575017659866726,null,null,"Has Stereo",null,0.46992959639477117,null,null,"Has Cellular phone",null,0.45092275421708256]
[null,null,"Has Employee",null,0.45982984757600043,null,null,"Has Telephone",null,0.46808381576103658,null,null,"Has TV",null,0.44658188248787684]
[null,null,"Uses gaz heating",null,-0.4456987793264568,null,null,"Has Camera",null,0.44951894180982682,null,null,"Has hard floor",null,-0.44475731123038853]
[null,null,"Has Camera",null,0.4276165858925422,null,null,"Has Security system",null,0.43850455659093118,null,null,"Has hearth floor",null,0.44475731123038853]
[null,null,"Has Security system",null,0.41606773734439623,null,null,"Uses gaz heating",null,-0.39957852253174814,null,null,"Has Video",null,0.4431274267480515]
[null,null,"Uses separate room as kitchen",null,0.35265134759559003,null,null,"Has Dish washing machine",null,0.37251947359340198,null,null,"Has Car",null,0.42761055792224451]
[null,null,"Has Dish washing machine",null,0.35182604954863428,null,null,"Has Second home",null,0.362114301239429,null,null,"Has Telephone",null,0.42731165704759044]
[null,null,"Uses wood fuel",null,0.34227254349024216,null,null,"Has Magazine",null,0.34591360284660028,null,null,"Has Internet",null,0.41648761491224862]
[null,null,"Has Second home",null,0.33770036570412598,null,null,"Heats house",null,-0.30898810836945378,null,null,"Uses gaz heating",null,-0.40039839126357163]
[null,null,"Has Magazine",null,0.32633721424348799,null,null,"Has Refrigerator",null,0.28193080674307125,null,null,"Uses kerozene fuel",null,0.38909076223656569]
[null,null,"Uses wood heating",null,0.31018685490832754,null,null,"Uses kerozene fuel",null,0.28084144443007331,null,null,"Uses open fire without chimney",null,0.38231862293582275]
[null,null,"Uses gaz fuel",null,-0.29901104058769479,null,null,"Has DVD",null,0.28066158982384837,null,null,"Uses open fire with chimney",null,0.37153925430809925]
[null,null,"Uses open fire with chimney",null,0.28538222035232341,null,null,"Uses open fire without chimney",null,0.26777459191357139,null,null,"Has Employee",null,0.35523511069347252]
[null,null,"Has TV",null,0.27419775342976915,null,null,"Has TV",null,0.24512863494652334,null,null,"Uses closed stove with chimney",null,0.3333422736395299]
[null,null,"Heats house",null,-0.27356399781381457,null,null,"Uses separate room as kitchen",null,0.22902118782796071,null,null,"Has cement, brick, stone or wood wall",null,-0.32668968729113296]
[null,null,"Uses open fire without chimney",null,0.27186053198882837,null,null,"Uses wood heating",null,0.20672598358331068,null,null,"Uses living or sleeping room as kitchen",null,0.31934597144983717]
[null,null,"Uses kerozene fuel",null,0.27142457180835383,null,null,"Uses open fire with chimney",null,0.19603874773464117,null,null,"Has Refrigerator",null,0.3140585238943745]
[null,null,"Has DVD",null,0.26963733253192068,null,null,"Uses living or sleeping room as kitchen",null,0.17500849723685052,null,null,"Has Camera",null,0.30383260435890713]
[null,null,"Has Refrigerator",null,0.2695660168299947,null,null,"Uses gaz fuel",null,-0.16413547923332,null,null,"Heats house",null,-0.28179104445574665]
[null,null,"Uses open fire with chimney",null,0.26950785621557521,null,null,"Uses kerozene heating",null,0.14319403186430218,null,null,"Has Second home",null,0.26408171576428546]
[null,null,"Uses living or sleeping room as kitchen",null,0.22012407747649856,null,null,"Uses open fire with chimney",null,0.14038847539839155,null,null,"Has Security system",null,0.26402811515635732]
[null,null,"Uses closed stove with chimney",null,0.2079317289266186,null,null,"Has Bicycle",null,0.14035705492742215,null,null,"Has Magazine",null,0.24497145906126744]
[null,null,"Has hearth floor",null,0.18241001049998831,null,null,"Has hearth floor",null,0.13910048164484246,null,null,"Has Dish washing machine",null,0.23867296396196133]
[null,null,"Has hard floor",null,-0.15299331162376464,null,null,"Uses wood fuel",null,0.12515067876232153,null,null,"Uses wood heating",null,0.19271951593286898]
[null,null,"Has mud brick wall",null,0.14966303706803114,null,null,"Has cement, brick, stone or wood wall",null,-0.1096584051523825,null,null,"Has DVD",null,0.1795928639041075]
[null,null,"Uses kerozene heating",null,0.10898582428888218,null,null,"Has mud brick wall",null,9.7758949396812164E-2,null,null,"Uses coal heating",null,0.1658608458330687]
[null,null,"Has cement, brick, stone or wood wall",null,-0.10762773280185507,null,null,"Uses open fire without chimney",null,9.480776089813335E-2,null,null,"Uses open fire with chimney",null,0.1631340115835557]
[null,null,"Has Bicycle",null,0.10702290794569998,null,null,"Has hard floor",null,-7.8906334855323279E-2,null,null,"Has Bicycle",null,0.16205467503755336]
[null,null,"Uses separate building as kitchen",null,8.237201459186258E-2,null,null,"Kooks outdoor",null,6.8296958220535733E-2,null,null,"Uses separate building as kitchen",null,0.12157562711941181]
[null,null,"Uses closed stove with chimney",null,7.4380319730556158E-2,null,null,"Uses closed stove with chimney",null,6.3796940210473885E-2,null,null,"Uses coal fuel",null,9.5393560384185033E-2]
[null,null,"Kooks outdoor",null,7.3768684351776373E-2,null,null,"Has plastic sheet wall",null,5.207497309928652E-2,null,null,"Kooks outdoor",null,8.9286814974822132E-2]
[null,null,"Uses open fire without chimney",null,7.2396602410172969E-2,null,null,"Uses electricity fuel",null,3.8253480097798498E-2,null,null,"Uses electricity fuel",null,8.6608619778335588E-2]
[null,null,"Uses coal fuel",null,5.6123713780940124E-2,null,null,"Uses separate building as kitchen",null,3.7069640673590275E-2,null,null,"Uses electricity heating",null,-8.4966171861764792E-2]
[null,null,"Uses electricity fuel",null,4.9721693361132087E-2,null,null,"Uses closed stove with chimney",null,2.3945567971423779E-2,null,null,"Uses closed stove with chimney",null,5.857120771426523E-2]
[null,null,"Has plastic sheet wall",null,4.2705635651136831E-2,null,null,"Uses coal fuel",null,2.3945567971423644E-2,null,null,"Uses kerozene heating",null,5.6991651628318769E-2]
[null,null,"Uses coal heating",null,4.232426267191744E-2,null,null,"Uses coal heating",null,2.3927801181732263E-2,null,null,"Uses charcoal heating",null,-1.6486422387843831E-2]
[null,null,"Uses electricity heating",null,-4.0211430591797777E-2,null,null,"Uses charcoal heating",null,2.2181848808115294E-2,null,null,"Uses open fire without chimney",null,-5.969693181822975E-3]
[null,null,"Uses charcoal heating",null,1.5770645583228101E-2,null,null,"Uses electricity heating",null,3.4232174084639459E-3]
[]
[]
[null,null,null,null,null,null,null,null,null,null,null,null,"Communalities"]
[null,null,"Communalities",null,null,null,null,"Communalities",null,null,null,null,null,null,"Extraction"]
[null,null,null,null,"Extraction",null,null,null,null,"Extraction",null,null,"Has hard floor",null,0.19780906589288469]
[null,null,"Has hard floor",null,2.3406953401606357E-2,null,null,"Has hard floor",null,6.2262096803004053E-3,null,null,"Has hearth floor",null,0.19780906589288469]
[null,null,"Has hearth floor",null,3.3273411930605845E-2,null,null,"Has hearth floor",null,1.9348943993827153E-2,null,null,"Has cement, brick, stone or wood wall",null,0.10672615178237824]
[null,null,"Has cement, brick, stone or wood wall",null,1.158372886806751E-2,null,null,"Has cement, brick, stone or wood wall",null,1.2024965820564068E-2,null,null,"Has mud brick wall",null,0.25445743688717576]
[null,null,"Has mud brick wall",null,2.2399024664426861E-2,null,null,"Has mud brick wall",null,9.5568121871684817E-3,null,null,"Uses gaz fuel",null,0.34148231338930107]
[null,null,"Has plastic sheet wall",null,1.8237713163676492E-3,null,null,"Has plastic sheet wall",null,2.7118028232914148E-3,null,null,"Uses electricity fuel",null,7.5010530199083022E-3]
[null,null,"Uses gaz fuel",null,8.9407602393336061E-2,null,null,"Uses gaz fuel",null,2.6940455543151623E-2,null,null,"Uses kerozene fuel",null,0.1513916212578317]
[null,null,"Uses electricity fuel",null,2.4722467906984468E-3,null,null,"Uses electricity fuel",null,1.4633287395926658E-3,null,null,"Uses coal fuel",null,9.0999313627711555E-3]
[null,null,"Uses kerozene fuel",null,7.3671298181348224E-2,null,null,"Uses kerozene fuel",null,7.8871916909569947E-2,null,null,"Uses wood fuel",null,0.27402668146481096]
[null,null,"Uses coal fuel",null,3.1498712485648886E-3,null,null,"Uses coal fuel",null,5.7339022547406987E-4,null,null,"Uses open fire without chimney",null,0.1461675294435438]
[null,null,"Uses wood fuel",null,0.11715049402727971,null,null,"Uses wood fuel",null,1.5662692394669796E-2,null,null,"Uses open fire with chimney",null,0.13804141749181845]
[null,null,"Uses open fire without chimney",null,7.390814885324877E-2,null,null,"Uses open fire without chimney",null,7.1703232074479692E-2,null,null,"Uses closed stove with chimney",null,0.11111707139517123]
[null,null,"Uses open fire with chimney",null,7.2634484561915166E-2,null,null,"Uses open fire with chimney",null,1.9708924024684792E-2,null,null,"Uses living or sleeping room as kitchen",null,0.10198184948124021]
[null,null,"Uses closed stove with chimney",null,4.3235603894412798E-2,null,null,"Uses closed stove with chimney",null,5.7339022547407627E-4,null,null,"Uses separate room as kitchen",null,0.24564384233730471]
[null,null,"Uses living or sleeping room as kitchen",null,4.8454609484879542E-2,null,null,"Uses living or sleeping room as kitchen",null,3.0627974105100719E-2,null,null,"Uses separate building as kitchen",null,1.4780633109478259E-2]
[null,null,"Uses separate room as kitchen",null,0.12436297296098565,null,null,"Uses separate room as kitchen",null,5.2450704474130062E-2,null,null,"Kooks outdoor",null,7.9721353283481212E-3]
[null,null,"Uses separate building as kitchen",null,6.7851487879220214E-3,null,null,"Uses separate building as kitchen",null,1.3741582596690984E-3,null,null,"Heats house",null,7.9406192735460582E-2]
[null,null,"Kooks outdoor",null,5.441818790992016E-3,null,null,"Kooks outdoor",null,4.6644745021776034E-3,null,null,"Uses gaz heating",null,0.1603188717264562]
[null,null,"Heats house",null,7.4837260899876745E-2,null,null,"Heats house",null,9.5473651113733321E-2,null,null,"Uses electricity heating",null,7.219250360842951E-3]
[null,null,"Uses gaz heating",null,0.19864740189309363,null,null,"Uses gaz heating",null,0.15966299566865474,null,null,"Uses kerozene heating",null,3.2480483553236493E-3]
[null,null,"Uses electricity heating",null,1.6169591502389702E-3,null,null,"Uses electricity heating",null,1.1718417425610615E-5,null,null,"Uses coal heating",null,2.7509820180460984E-2]
[null,null,"Uses kerozene heating",null,1.1877909895927101E-2,null,null,"Uses kerozene heating",null,2.0504530761554788E-2,null,null,"Uses charcoal heating",null,2.7180212315039827E-4]
[null,null,"Uses coal heating",null,1.7913432107214641E-3,null,null,"Uses coal heating",null,5.7253966939250784E-4,null,null,"Uses wood heating",null,3.714081182139934E-2]
[null,null,"Uses charcoal heating",null,2.4871326211179203E-4,null,null,"Uses charcoal heating",null,4.9203441654608584E-4,null,null,"Uses open fire without chimney",null,3.5637236685103717E-5]
[null,null,"Uses wood heating",null,9.6215884957919842E-2,null,null,"Uses wood heating",null,4.2735632288487237E-2,null,null,"Uses open fire with chimney",null,2.6612705735343686E-2]
[null,null,"Uses open fire without chimney",null,5.2412680405366629E-3,null,null,"Uses open fire without chimney",null,8.9885115265176223E-3,null,null,"Uses closed stove with chimney",null,3.4305863731076028E-3]
[null,null,"Uses open fire with chimney",null,8.1443011693222073E-2,null,null,"Uses open fire with chimney",null,3.8431190613366278E-2,null,null,"Has Car",null,0.18285078924657322]
[null,null,"Uses closed stove with chimney",null,5.5324319632197617E-3,null,null,"Uses closed stove with chimney",null,4.0700495802187793E-3,null,null,"Has TV",null,0.19943537776641584]
[null,null,"Has Car",null,0.24060827453413161,null,null,"Has Car",null,0.28813809376358163,null,null,"Has Bicycle",null,2.6261717701527021E-2]
[null,null,"Has TV",null,7.5184407985932483E-2,null,null,"Has TV",null,6.0088047670745909E-2,null,null,"Has Video",null,0.19636191633634975]
[null,null,"Has Bicycle",null,1.1453902825153772E-2,null,null,"Has Bicycle",null,1.9700102867899399E-2,null,null,"Has Stereo",null,0.20939465397627063]
[null,null,"Has Video",null,0.37616926615092428,null,null,"Has Video",null,0.39178753853740506,null,null,"Has DVD",null,3.225359676527928E-2]
[null,null,"Has Stereo",null,0.24660382909551862,null,null,"Has Stereo",null,0.22083382556775252,null,null,"Has Camera",null,9.2314251471516187E-2]
[null,null,"Has DVD",null,7.2704291094929568E-2,null,null,"Has DVD",null,7.87709280024501E-2,null,null,"Has Clothes washing machine",null,0.26345839211265804]
[null,null,"Has Camera",null,0.18285594453039392,null,null,"Has Camera",null,0.20206727904582647,null,null,"Has Dish washing machine",null,5.6964783726387691E-2]
[null,null,"Has Clothes washing machine",null,0.29517118043544383,null,null,"Has Clothes washing machine",null,0.28167516581697799,null,null,"Has Vacuum cleaner",null,0.22790191706326593]
[null,null,"Has Dish washing machine",null,0.12378156914099807,null,null,"Has Dish washing machine",null,0.13877075820630533,null,null,"Has Refrigerator",null,9.8632756430713397E-2]
[null,null,"Has Vacuum cleaner",null,0.39126867687447248,null,null,"Has Vacuum cleaner",null,0.38787279446106154,null,null,"Has Telephone",null,0.18259525224875756]
[null,null,"Has Refrigerator",null,7.2665837429588986E-2,null,null,"Has Refrigerator",null,7.9484979790798993E-2,null,null,"Has Cellular phone",null,0.20333133027071945]
[null,null,"Has Telephone",null,0.23595323406563642,null,null,"Has Telephone",null,0.21910245857741203,null,null,"Has Computer",null,0.21989063511807783]
[null,null,"Has Cellular phone",null,0.29497981034794529,null,null,"Has Cellular phone",null,0.30949174044197569,null,null,"Has Internet",null,0.1734619333752935]
[null,null,"Has Computer",null,0.41972034046092377,null,null,"Has Computer",null,0.45753730640103024,null,null,"Has Magazine",null,6.0011015754606226E-2]
[null,null,"Has Internet",null,0.40445938509638624,null,null,"Has Internet",null,0.4489065709973542,null,null,"Has Security system",null,6.9710845593018683E-2]
[null,null,"Has Magazine",null,0.10649597740020018,null,null,"Has Magazine",null,0.11965622063431551,null,null,"Has Employee",null,0.12619198386940367]
[null,null,"Has Security system",null,0.1731123620588855,null,null,"Has Security system",null,0.19228624615100917,null,null,"Has Second home",null,6.9739152601008852E-2]
[null,null,"Has Employee",null,0.2114434887217678,null,null,"Has Employee",null,0.22514853605251059]
[null,null,"Has Second home",null,0.11404153699670043,null,null,"Has Second home",null,0.13112676716211993]
[null,null,null,null,null,null,null,null,null,null,null,null,"Total Variance Explained"]
[null,null,null,null,null,null,null,null,null,null,null,null,"Component",null,"Extraction Sums of Squared Loadings"]
[null,null,"Total Variance Explained",null,null,null,null,"Total Variance Explained",null,null,null,null,null,null,"Total","% of Variance","Cumulative %"]
[null,null,"Component",null,"Extraction Sums of Squared Loadings",null,null,"Component",null,"Extraction Sums of Squared Loadings",null,null,"1",null,5.3419638276129229,11.871030728028718,11.871030728028718]
[null,null,null,null,"Total","% of Variance","Cumulative %",null,null,"Total","% of Variance","Cumulative %"]
[null,null,"1",null,5.2792866903694593,11.476710196455347,11.476710196455347,"1",null,4.9778715901877542,10.821459978669031,10.821459978669031]
[null,null,null,null,null,null,null,null,null,null,null,null,"Component Score Coefficient Matrix"]
[null,null,null,null,null,null,null,null,null,null,null,null,null,null,"Component"]
[null,null,"Component Score Coefficient Matrix",null,null,null,null,"Component Score Coefficient Matrix",null,null,null,null,null,null,"1"]
[null,null,null,null,"Component",null,null,null,null,"Component",null,null,"Has hard floor",null,-8.3257267473697966E-2]
[null,null,null,null,"1",null,null,null,null,"1",null,null,"Has hearth floor",null,8.3257267473697966E-2]
[null,null,"Has hard floor",null,-2.8979921075863706E-2,null,null,"Has hard floor",null,-1.5851420316036539E-2,null,null,"Has cement, brick, stone or wood wall",null,-6.115535369267288E-2]
[null,null,"Has hearth floor",null,3.4552018330950451E-2,null,null,"Has hearth floor",null,2.794376655256306E-2,null,null,"Has mud brick wall",null,9.4429269759170043E-2]
[null,null,"Has cement, brick, stone or wood wall",null,-2.0386794488390054E-2,null,null,"Has cement, brick, stone or wood wall",null,-2.2029175153601425E-2,null,null,"Uses gaz fuel",null,-0.10939139597535391]
[null,null,"Has mud brick wall",null,2.8349102037032448E-2,null,null,"Has mud brick wall",null,1.9638704539810137E-2,null,null,"Uses electricity fuel",null,1.6212880239033174E-2]
[null,null,"Has plastic sheet wall",null,8.089281404065625E-3,null,null,"Has plastic sheet wall",null,1.0461292975482794E-2,null,null,"Uses kerozene fuel",null,7.2836652360941265E-2]
[null,null,"Uses gaz fuel",null,-5.6638530567615211E-2,null,null,"Uses gaz fuel",null,-3.2973023964069183E-2,null,null,"Uses coal fuel",null,1.7857395419094781E-2]
[null,null,"Uses electricity fuel",null,9.4182597531282056E-3,null,null,"Uses electricity fuel",null,7.6847060846653263E-3,null,null,"Uses wood fuel",null,9.7993096839219029E-2]
[null,null,"Uses kerozene fuel",null,5.1413114636015111E-2,null,null,"Uses kerozene fuel",null,5.6417976908777707E-2,null,null,"Uses open fire without chimney",null,7.1568927696514045E-2]
[null,null,"Uses coal fuel",null,1.0630927447702679E-2,null,null,"Uses coal fuel",null,4.8104029076652963E-3,null,null,"Uses open fire with chimney",null,6.9551061425686025E-2]
[null,null,"Uses wood fuel",null,6.4833104084803736E-2,null,null,"Uses wood fuel",null,2.5141403608926988E-2,null,null,"Uses closed stove with chimney",null,6.2400698394186833E-2]
[null,null,"Uses open fire without chimney",null,5.1495694008199963E-2,null,null,"Uses open fire without chimney",null,5.379298904403268E-2,null,null,"Uses living or sleeping room as kitchen",null,5.9780631572067033E-2]
[null,null,"Uses open fire with chimney",null,5.1050051270603435E-2,null,null,"Uses open fire with chimney",null,2.8202510421345844E-2,null,null,"Uses separate room as kitchen",null,9.2779493660597956E-2]
[null,null,"Uses closed stove with chimney",null,3.9386330222590533E-2,null,null,"Uses closed stove with chimney",null,4.8104029076653232E-3,null,null,"Uses separate building as kitchen",null,2.2758601713283845E-2]
[null,null,"Uses living or sleeping room as kitchen",null,4.1695799146133063E-2,null,null,"Uses living or sleeping room as kitchen",null,3.5157294451271609E-2,null,null,"Kooks outdoor",null,1.6714230544447598E-2]
[null,null,"Uses separate room as kitchen",null,6.6799052273274151E-2,null,null,"Uses separate room as kitchen",null,4.600785369381586E-2,null,null,"Heats house",null,-5.2750459110028465E-2]
[null,null,"Uses separate building as kitchen",null,1.5602868232582752E-2,null,null,"Uses separate building as kitchen",null,7.4468856823588911E-3,null,null,"Uses gaz heating",null,-7.495340743302846E-2]
[null,null,"Kooks outdoor",null,1.397322946797834E-2,null,null,"Kooks outdoor",null,1.3720112498514596E-2,null,null,"Uses electricity heating",null,-1.5905418794221273E-2]
[null,null,"Heats house",null,-5.1818363702970216E-2,null,null,"Heats house",null,-6.2072334083209939E-2,null,null,"Uses kerozene heating",null,1.0668670449194281E-2]
[null,null,"Uses gaz heating",null,-8.4424052995550711E-2,null,null,"Uses gaz heating",null,-8.0270958238333523E-2,null,null,"Uses coal heating",null,3.1048665094983288E-2]
[null,null,"Uses electricity heating",null,-7.6168302557146532E-3,null,null,"Uses electricity heating",null,6.8768696549177753E-4,null,null,"Uses charcoal heating",null,-3.0862100380808551E-3]
[null,null,"Uses kerozene heating",null,2.0644043538627192E-2,null,null,"Uses kerozene heating",null,2.87661160538095E-2,null,null,"Uses wood heating",null,3.6076529559539612E-2]
[null,null,"Uses coal heating",null,8.0170419138490597E-3,null,null,"Uses coal heating",null,4.8068337537870796E-3,null,null,"Uses open fire without chimney",null,-1.1175090986137498E-3]
[null,null,"Uses charcoal heating",null,2.9872682633426801E-3,null,null,"Uses charcoal heating",null,4.4560910031989486E-3,null,null,"Uses open fire with chimney",null,3.0538209701141451E-2]
[null,null,"Uses wood heating",null,5.8755448055922831E-2,null,null,"Uses wood heating",null,4.152899082226294E-2,null,null,"Uses closed stove with chimney",null,1.0964358727310589E-2]
[null,null,"Uses open fire without chimney",null,1.3713330352420481E-2,null,null,"Uses open fire without chimney",null,1.9045843023555657E-2,null,null,"Has Car",null,8.0047445419210911E-2]
[null,null,"Uses open fire with chimney",null,5.405696585353495E-2,null,null,"Uses open fire with chimney",null,3.9382041939584667E-2,null,null,"Has TV",null,8.3598821875106866E-2]
[null,null,"Uses closed stove with chimney",null,1.4089085153538197E-2,null,null,"Uses closed stove with chimney",null,1.281610806036634E-2,null,null,"Has Bicycle",null,3.0336161057452928E-2]
[null,null,"Has Car",null,9.2913759387959635E-2,null,null,"Has Car",null,0.10783423210564287,null,null,"Has Video",null,8.2952157867018858E-2]
[null,null,"Has TV",null,5.1938409393444025E-2,null,null,"Has TV",null,4.9243663783877886E-2,null,null,"Has Stereo",null,8.5660745923144724E-2]
[null,null,"Has Bicycle",null,2.0272228848820146E-2,null,null,"Has Bicycle",null,2.8196198392118062E-2,null,null,"Has DVD",null,3.3619258703284638E-2]
[null,null,"Has Video",null,0.11617599695555098,null,null,"Has Video",null,0.12574236368925856,null,null,"Has Camera",null,5.6876574638783331E-2]
[null,null,"Has Stereo",null,9.4064263835174827E-2,null,null,"Has Stereo",null,9.4403720120278645E-2,null,null,"Has Clothes washing machine",null,9.608488519479913E-2]
[null,null,"Has DVD",null,5.1074576613502815E-2,null,null,"Has DVD",null,5.6381846083993187E-2,null,null,"Has Dish washing machine",null,4.4678880588491975E-2]
[null,null,"Has Camera",null,8.0998932426345718E-2,null,null,"Has Camera",null,9.0303442679378551E-2,null,null,"Has Vacuum cleaner",null,8.9366149557825555E-2]
[null,null,"Has Clothes washing machine",null,0.10291098361094979,null,null,"Has Clothes washing machine",null,0.10661801436090008,null,null,"Has Refrigerator",null,5.8790836858719941E-2]
[null,null,"Has Dish washing machine",null,6.6642724705676573E-2,null,null,"Has Dish washing machine",null,7.4835091031215481E-2,null,null,"Has Telephone",null,7.9991492049944532E-2]
[null,null,"Has Vacuum cleaner",null,0.11848470564848246,null,null,"Has Vacuum cleaner",null,0.12511257720277008,null,null,"Has Cellular phone",null,8.4411420363095027E-2]
[null,null,"Has Refrigerator",null,5.1061068026811346E-2,null,null,"Has Refrigerator",null,5.6636817891969254E-2,null,null,"Has Computer",null,8.7781384012787914E-2]
[null,null,"Has Telephone",null,9.201056981519469E-2,null,null,"Has Telephone",null,9.4032922963242102E-2,null,null,"Has Internet",null,7.796526302918784E-2]
[null,null,"Has Cellular phone",null,0.10287761775687153,null,null,"Has Cellular phone",null,0.11175857159194548,null,null,"Has Magazine",null,4.5857940444110769E-2]
[null,null,"Has Computer",null,0.12271700892383848,null,null,"Has Computer",null,0.1358843890991028,null,null,"Has Security system",null,4.9425290712673972E-2]
[null,null,"Has Internet",null,0.12046536802161624,null,null,"Has Internet",null,0.13459666276488916,null,null,"Has Employee",null,6.6498973440673903E-2]
[null,null,"Has Magazine",null,6.1814641519430343E-2,null,null,"Has Magazine",null,6.9490262370057079E-2,null,null,"Has Second home",null,4.9435324589663383E-2]
[null,null,"Has Security system",null,7.8811354970244787E-2,null,null,"Has Security system",null,8.8090773063591976E-2]
[null,null,"Has Employee",null,8.7100753292074048E-2,null,null,"Has Employee",null,9.5321501437585665E-2]
[null,null,"Has Second home",null,6.3967044320620656E-2,null,null,"Has Second home",null,7.2744805621988901E-2,null,null,"Component Score Covariance Matrix"]
[null,null,null,null,null,null,null,null,null,null,null,null,"Component",null,"1"]
[null,null,null,null,null,null,null,null,null,null,null,null,"1",null,1.0000000000000004]
[null,null,"Component Score Covariance Matrix",null,null,null,null,"Component Score Covariance Matrix"]
[null,null,"Component",null,"1",null,null,"Component",null,"1"]
[null,null,"1",null,0.99999999999999989,null,null,"1",null,1]
[]
[]
[]
[]
[]
[]
[]
[]
[]
[]
[]
[]
[]
[]
[]
[]
[]
[]
[]
[]
[]
[]
[]
[]
[]
[]
[]
[]
[]
[]
[]
[]
[]
[]
[]
[]
[]
[]
[]
[]
[]
[]
[]
[]
[]
[]
[]
[]
[]
[]
[]
[]
[]
[]
[]
[]
[]
[]
[]
[]
[]
[]
[]
[]
[]
[]
[]
[]
[]
[]
[]
[]
[]
[]
[]
[]
[]
[]
[]
[]
[]
[]
[]
[]
[]
[]
[]
[]
[]
[]
[]
[]
[]
[]
[]
[]
[]
[]
[]
[]
[]
[]
[]
[]
[]
[]
[]
[]
[]
[]
[]
[]
[]
[]
[]
[]
[]
[]
[]
[]
[]
[]
[]
[]
[]
[]
[]
[]
[]
[]
[]
[]
[]
[]
[]
[]
[]
[]
[]
[]
[]
[]
[]
[]
[]
[]
[]
[]
[]
[]
[]
[]
[]
[]
[]
[]
[]
[]
[]
[]
[]
[]
[]
[]
[]
[]
[]
[]
[]
[]
[]
[]
[]
[]
[]
[]
[]
[]
[]
[]
[]
[]
[]
[]
[]
[]
[]
[]
[]
[]
[]
[]
[]
[]
[]
[]
[]
[]
[]
[]
[]
[]
[]
[]
[]
[]
[]
[]
[]
[]
[]
[]
[]
[]
[]
[]
[]
[]
[]
[]
[]
[]
[]
[]
[]
[]
[]
[]
[]
[]
[]
[]
[]
[]
[]
[]
[]
[]
[]
[]
[]
[]
[]
[]
[]
[]
[]
[]
[]
[]
[]
[]
[]
[]
[]
[]
[]
[]
[]
[]
[]
[]
[]
[]
[]
[]
[]
[]
[]
[]
[]
[]
[]
[]
[]
[]
[]
[]
[]
[]
[]
[]
[]
[]
[]
[]
[]
[]
[]
[]
[]
[]
[]
[]
[]
[]
[]
[]
[]
[]
[]
[]
[]
[]
[]
[]
[]
[]
[]
[]
[]
[]
[]
[]
[]
[]
[]
[]
[]
[]
[]
[]
[]
[]
[]
[]
[]
[]
[]
[]
[]
[]
[]
[]
[]
[]
[]
[]
[]
[]
[]
[]
[]
[]
[]
[]
[]
[]
[]
[]
[]
[]
[]
[]
[]
[]
[]
[]
[]
[]
[]
[]
[]
[]
[]
[]
[]
[]
[]
[]
[]
[]
[]
[]
[]
[]
[]
[]
[]
[]
[]
[]
[]
[]
[]
[]
[]
[]
[]
[]
[]
[]
[]
[]
[]
[]
[]
[]
[]
[]
[]
[]
[]
[]
[]
[]
[]
[]
[]
[]
[]
[]
[]
[]
[]
[]
[]
[]
[]
[]
[]
[]
[]
[]
[]
[]
[]
[]
[]
[]
[]
[]
[]
[]
[]
[]
[]
[]
[]
[]
[]
[]
[]
[]
[]
[]
[]
[]
[]
[]
[]
[]
[]
[]
[]
[]
[]
[]
[]
[]
[]
[]
[]
["WHS03"]
["Uruguay",null,"Count"]
["W_text_t","",2982]
["W_text_i","",2982]
["S_text_s","",2982]
["S_text_i","",2982]
["Urban/Rural","Urban",2489]
[null,"Rural",493]
["2003"]
["2003"]
[]
["Sub-national region names","Weighted population"]
[{"$f":"R15","v":0},{"$f":"#REF!+#REF!","v":{"$error":"#REF!"}}]
[{"$f":"S15","v":0},{"$f":"#REF!+#REF!","v":{"$error":"#REF!"}}]
[{"$f":"T15","v":0},{"$f":"#REF!+#REF!","v":{"$error":"#REF!"}}]
[{"$f":"U15","v":0},{"$f":"#REF!+#REF!","v":{"$error":"#REF!"}}]
[{"$f":"V15","v":0},{"$f":"#REF!+#REF!","v":{"$error":"#REF!"}}]
[{"$f":"W15","v":0},{"$f":"#REF!+#REF!","v":{"$error":"#REF!"}}]
[{"$f":"X15","v":0},{"$f":"#REF!+WD123","v":{"$error":"#REF!"}}]
[{"$f":"Y15","v":0},{"$f":"#REF!+#REF!","v":{"$error":"#REF!"}}]
[{"$f":"Z15","v":0},{"$f":"#REF!+#REF!","v":{"$error":"#REF!"}}]
[{"$f":"AA15","v":0},{"$f":"#REF!+#REF!","v":{"$error":"#REF!"}}]
[{"$f":"AB15","v":0},{"$f":"#REF!+#REF!","v":{"$error":"#REF!"}}]
[{"$f":"AC15","v":0},{"$f":"#REF!+#REF!","v":{"$error":"#REF!"}}]
[{"$f":"AD15","v":0},{"$f":"#REF!+#REF!","v":{"$error":"#REF!"}}]
[{"$f":"AE15","v":0},{"$f":"#REF!+#REF!","v":{"$error":"#REF!"}}]
[{"$f":"AF15","v":0},{"$f":"#REF!+#REF!","v":{"$error":"#REF!"}}]
[{"$f":"AG15","v":0},{"$f":"#REF!+#REF!","v":{"$error":"#REF!"}}]
[{"$f":"AH15","v":0},{"$f":"#REF!+#REF!","v":{"$error":"#REF!"}}]
[{"$f":"AI15","v":0},{"$f":"#REF!+#REF!","v":{"$error":"#REF!"}}]
[{"$f":"AJ15","v":0},{"$f":"#REF!+#REF!","v":{"$error":"#REF!"}}]
[{"$f":"AK15","v":0},{"$f":"#REF!+#REF!","v":{"$error":"#REF!"}}]
[{"$f":"AL15","v":0},{"$f":"#REF!+#REF!","v":{"$error":"#REF!"}}]
[{"$f":"AM15","v":0},{"$f":"#REF!+#REF!","v":{"$error":"#REF!"}}]
[{"$f":"AN15","v":0},{"$f":"#REF!+#REF!","v":{"$error":"#REF!"}}]
[{"$f":"AO15","v":0},{"$f":"#REF!+#REF!","v":{"$error":"#REF!"}}]
[{"$f":"AP15","v":0},{"$f":"#REF!+#REF!","v":{"$error":"#REF!"}}]
[{"$f":"AQ15","v":0},{"$f":"#REF!+#REF!","v":{"$error":"#REF!"}}]
[{"$f":"AR15","v":0},{"$f":"#REF!+#REF!","v":{"$error":"#REF!"}}]
[{"$f":"AS15","v":0},{"$f":"#REF!+#REF!","v":{"$error":"#REF!"}}]
[{"$f":"AT15","v":0},{"$f":"#REF!+#REF!","v":{"$error":"#REF!"}}]
[{"$f":"AU15","v":0},{"$f":"#REF!+#REF!","v":{"$error":"#REF!"}}]
[{"$f":"AV15","v":0},{"$f":"#REF!+#REF!","v":{"$error":"#REF!"}}]
[{"$f":"AW15","v":0},{"$f":"#REF!+#REF!","v":{"$error":"#REF!"}}]
[{"$f":"AX15","v":0},{"$f":"#REF!+#REF!","v":{"$error":"#REF!"}}]
[{"$f":"AY15","v":0},{"$f":"#REF!+#REF!","v":{"$error":"#REF!"}}]
[]
[{"$f":"34-COUNTIF(A1037:A1071,\"0\")","v":0},"Sub-regions"]

{"sheet":"MICS13","index":5,"n_rows":1072,"n_cols":72,"rows_kept":1072,"cut":false,"hidden":false,"merged":[[346,52,347,52],[348,52,349,52],[350,52,351,52],[352,52,353,52],[152,52,160,52],[270,52,272,52],[273,52,275,52],[276,52,283,52],[338,54,338,58],[338,59,338,63],[338,64,338,68],[340,52,341,52],[342,52,343,52],[344,52,345,52],[221,52,223,52],[224,52,225,52],[226,52,229,52],[258,54,258,58],[258,59,258,63],[258,64,258,68],[260,52,262,52],[263,52,266,52],[267,52,269,52],[119,64,119,68],[121,52,122,52],[123,52,126,52],[127,52,128,52],[132,54,132,58],[132,59,132,63],[132,64,132,68],[134,52,138,52],[219,54,219,58],[219,59,219,63],[219,64,219,68],[13,64,13,68],[15,52,16,52],[17,52,20,52],[21,52,22,52],[26,54,26,58],[26,59,26,63],[26,64,26,68],[40,52,41,52],[55,54,55,58],[55,59,55,63],[55,64,55,68],[139,52,142,52],[143,0,146,0],[143,52,146,52],[147,0,149,0],[147,52,149,52],[150,0,151,0],[150,52,151,52],[13,54,13,58],[13,59,13,63],[119,54,119,58],[119,59,119,63],[42,52,43,52],[44,52,45,52],[46,0,48,0],[46,52,48,52],[49,0,51,0],[49,52,51,52],[52,0,54,0],[52,52,54,52],[32,52,33,52],[34,52,35,52],[36,52,37,52],[38,0,39,0],[38,52,39,52],[13,2,13,6],[13,7,13,11],[28,52,29,52],[30,0,31,0],[30,52,31,52],[26,2,26,6],[26,7,26,11],[26,12,26,16],[13,12,13,16],[15,0,16,0],[17,0,20,0],[21,0,22,0],[23,0,25,0],[32,0,33,0],[55,2,55,6],[55,7,55,11],[55,12,55,16],[28,0,29,0],[34,0,35,0],[36,0,37,0],[40,0,41,0],[42,0,43,0],[44,0,45,0],[139,0,142,0],[107,0,107,1],[119,2,119,6],[119,7,119,11],[57,0,70,0],[132,12,132,16],[134,0,138,0],[119,12,119,16],[121,0,122,0],[123,0,126,0],[127,0,128,0],[129,0,131,0],[152,0,159,0],[132,2,132,6],[132,7,132,11],[219,2,219,6],[219,7,219,11],[219,12,219,16],[207,0,207,1],[1024,0,1024,2],[1025,0,1025,1],[1030,0,1032,0],[1033,0,1033,2],[398,2,398,5],[221,0,223,0],[398,7,398,10],[398,12,398,15],[399,2,399,4],[399,7,399,9],[399,12,399,14],[400,2,401,3],[400,7,401,8],[400,12,401,13],[401,1,444,1],[402,2,402,3],[402,7,402,8],[402,12,402,13],[403,2,403,3],[403,7,403,8],[403,12,403,13],[404,2,404,3],[404,7,404,8],[404,12,404,13],[407,2,407,3],[407,7,407,8],[407,12,407,13],[408,2,408,3],[408,7,408,8],[408,12,408,13],[405,2,405,3],[405,7,405,8],[405,12,405,13],[406,2,406,3],[406,7,406,8],[406,12,406,13],[411,2,411,3],[411,7,411,8],[411,12,411,13],[412,2,412,3],[412,7,412,8],[412,12,412,13],[409,2,409,3],[409,7,409,8],[409,12,409,13],[410,2,410,3],[410,7,410,8],[410,12,410,13],[415,2,415,3],[415,7,415,8],[415,12,415,13],[416,2,416,3],[416,7,416,8],[416,12,416,13],[413,2,413,3],[413,7,413,8],[413,12,413,13],[414,2,414,3],[414,7,414,8],[414,12,414,13],[419,2,419,3],[419,7,419,8],[419,12,419,13],[420,2,420,3],[420,7,420,8],[420,12,420,13],[417,2,417,3],[417,7,417,8],[417,12,417,13],[418,2,418,3],[418,7,418,8],[418,12,418,13],[423,2,423,3],[423,7,423,8],[423,12,423,13],[424,2,424,3],[424,7,424,8],[424,12,424,13],[421,2,421,3],[421,7,421,8],[421,12,421,13],[422,2,422,3],[422,7,422,8],[422,12,422,13],[427,2,427,3],[427,7,427,8],[427,12,427,13],[428,2,428,3],[428,7,428,8],[428,12,428,13],[425,2,425,3],[425,7,425,8],[425,12,425,13],[426,2,426,3],[426,7,426,8],[426,12,426,13],[431,2,431,3],[431,7,431,8],[431,12,431,13],[432,2,432,3],[432,7,432,8],[432,12,432,13],[429,2,429,3],[429,7,429,8],[429,12,429,13],[430,2,430,3],[430,7,430,8],[430,12,430,13],[435,2,435,3],[435,7,435,8],[435,12,435,13],[436,2,436,3],[436,7,436,8],[436,12,436,13],[433,2,433,3],[433,7,433,8],[433,12,433,13],[434,2,434,3],[434,7,434,8],[434,12,434,13],[439,2,439,3],[439,7,439,8],[439,12,439,13],[440,2,440,3],[440,7,440,8],[440,12,440,13],[437,2,437,3],[437,7,437,8],[437,12,437,13],[438,2,438,3],[438,7,438,8],[438,12,438,13],[443,2,443,3],[443,7,443,8],[443,12,443,13],[444,2,444,3],[444,7,444,8],[444,12,444,13],[441,2,441,3],[441,7,441,8],[441,12,441,13],[442,2,442,3],[442,7,442,8],[442,12,442,13],[447,2,447,3],[447,7,447,8],[447,12,447,13],[448,2,448,3],[448,7,448,8],[448,12,448,13],[445,2,445,3],[445,7,445,8],[445,12,445,13],[446,2,446,3],[446,7,446,8],[446,12,446,13],[451,2,451,3],[451,7,451,8],[451,12,451,14],[452,2,452,4],[452,7,452,9],[452,12,452,13],[449,2,449,3],[449,7,449,8],[449,12,449,13],[450,2,450,3],[450,7,450,8],[450,12,450,13],[455,2,455,3],[455,7,455,8],[455,12,455,13],[456,2,456,3],[456,7,456,8],[456,12,456,13],[453,2,453,3],[453,7,453,8],[453,12,453,13],[454,2,454,3],[454,7,454,8],[454,12,454,13],[459,2,459,3],[459,7,459,8],[459,12,459,13],[460,2,460,3],[460,7,460,8],[460,12,460,13],[457,2,457,3],[457,7,457,8],[457,12,457,13],[458,2,458,3],[458,7,458,8],[458,12,458,13],[463,2,463,3],[463,7,463,8],[463,12,463,13],[464,2,464,3],[464,7,464,8],[464,12,464,13],[461,2,461,3],[461,7,461,8],[461,12,461,13],[462,2,462,3],[462,7,462,8],[462,12,462,13],[467,2,467,3],[467,7,467,8],[467,12,467,13],[468,2,468,3],[468,7,468,8],[468,12,468,13],[465,2,465,3],[465,7,465,8],[465,12,465,13],[466,2,466,3],[466,7,466,8],[466,12,466,13],[471,2,471,3],[471,7,471,8],[471,12,471,13],[472,2,472,3],[472,7,472,8],[472,12,472,13],[469,2,469,3],[469,7,469,8],[469,12,469,13],[470,2,470,3],[470,7,470,8],[470,12,470,13],[475,2,475,3],[475,7,475,8],[475,12,475,13],[476,2,476,3],[476,7,476,8],[476,12,476,13],[473,2,473,3],[473,7,473,8],[473,12,473,13],[474,2,474,3],[474,7,474,8],[474,12,474,13],[479,2,479,3],[479,7,479,8],[479,12,479,13],[480,2,480,3],[480,7,480,8],[480,12,480,13],[477,2,477,3],[477,7,477,8],[477,12,477,13],[478,2,478,3],[478,7,478,8],[478,12,478,13],[483,2,483,3],[483,7,483,8],[483,12,483,13],[484,2,484,3],[484,7,484,8],[484,12,484,13],[481,2,481,3],[481,7,481,8],[481,12,481,13],[482,2,482,3],[482,7,482,8],[482,12,482,13],[487,2,487,3],[487,7,487,8],[487,12,487,13],[488,2,488,3],[488,7,488,8],[488,12,488,13],[485,2,485,3],[485,7,485,8],[485,12,485,13],[486,2,486,3],[486,7,486,8],[486,12,486,13],[491,2,491,3],[491,7,491,8],[491,12,491,13],[492,2,492,3],[492,7,492,8],[492,12,492,13],[489,2,489,3],[489,7,489,8],[489,12,489,13],[490,2,490,3],[490,7,490,8],[490,12,490,13],[495,2,495,3],[495,7,495,8],[495,12,495,13],[496,2,496,3],[496,7,496,8],[496,12,496,13],[493,2,493,3],[493,7,493,8],[493,12,493,13],[494,2,494,3],[494,7,494,8],[494,12,494,13],[499,2,499,3],[499,7,499,8],[499,12,499,13],[500,2,500,3],[500,7,500,8],[500,12,500,13],[497,2,497,3],[497,7,497,8],[497,12,497,13],[498,2,498,3],[498,7,498,8],[498,12,498,13],[501,2,501,3],[501,7,501,8],[501,12,501,16],[502,2,502,3],[502,7,502,8],[502,12,503,13],[502,14,502,16],[503,2,503,6],[503,7,503,11],[506,2,506,3],[506,7,506,8],[506,12,506,13],[507,2,507,3],[507,7,507,8],[507,12,507,14],[504,2,505,3],[504,4,504,6],[504,7,505,8],[504,9,504,11],[504,12,504,13],[505,12,505,13],[508,2,508,3],[508,7,508,8],[508,12,509,13],[509,2,509,4],[509,7,509,9],[510,2,511,3],[510,7,511,8],[510,12,510,13],[511,12,511,13],[514,2,514,3],[514,7,514,8],[514,12,514,13],[515,2,515,3],[515,7,515,8],[515,12,515,13],[512,2,512,3],[512,7,512,8],[512,12,512,13],[513,2,513,3],[513,7,513,8],[513,12,513,13],[518,2,518,3],[518,7,518,8],[518,12,518,13],[519,2,519,3],[519,7,519,8],[519,12,519,13],[516,2,516,3],[516,7,516,8],[516,12,516,13],[517,2,517,3],[517,7,517,8],[517,12,517,13],[522,2,522,3],[522,7,522,8],[522,12,522,13],[523,2,523,3],[523,7,523,8],[523,12,523,13],[520,2,520,3],[520,7,520,8],[520,12,520,13],[521,2,521,3],[521,7,521,8],[521,12,521,13],[526,2,526,3],[526,7,526,8],[526,12,526,13],[527,2,527,3],[527,7,527,8],[527,12,527,13],[524,2,524,3],[524,7,524,8],[524,12,524,13],[525,2,525,3],[525,7,525,8],[525,12,525,13],[530,2,530,3],[530,7,530,8],[530,12,530,13],[531,2,531,3],[531,7,531,8],[531,12,531,13],[528,2,528,3],[528,7,528,8],[528,12,528,13],[529,2,529,3],[529,7,529,8],[529,12,529,13],[534,2,534,3],[534,7,534,8],[534,12,534,13],[535,2,535,3],[535,7,535,8],[535,12,535,13],[532,2,532,3],[532,7,532,8],[532,12,532,13],[533,2,533,3],[533,7,533,8],[533,12,533,13],[538,2,538,3],[538,7,538,8],[538,12,538,13],[539,2,539,3],[539,7,539,8],[539,12,539,13],[536,2,536,3],[536,7,536,8],[536,12,536,13],[537,2,537,3],[537,7,537,8],[537,12,537,13],[542,2,542,3],[542,7,542,8],[542,12,542,13],[543,2,543,3],[543,7,543,8],[543,12,543,13],[540,2,540,3],[540,7,540,8],[540,12,540,13],[541,2,541,3],[541,7,541,8],[541,12,541,13],[546,2,546,3],[546,7,546,8],[546,12,546,13],[547,2,547,3],[547,7,547,8],[547,12,547,13],[544,2,544,3],[544,7,544,8],[544,12,544,13],[545,2,545,3],[545,7,545,8],[545,12,545,13],[550,2,550,3],[550,7,550,8],[550,12,550,13],[551,2,551,3],[551,7,551,8],[551,12,551,13],[548,2,548,3],[548,7,548,8],[548,12,548,13],[549,2,549,3],[549,7,549,8],[549,12,549,13],[554,2,554,3],[554,7,554,8],[554,12,554,13],[555,2,555,3],[555,7,555,8],[555,12,555,13],[552,2,552,3],[552,7,552,8],[552,12,552,13],[553,2,553,3],[553,7,553,8],[553,12,553,13],[558,2,558,3],[558,7,558,8],[558,12,558,14],[559,2,559,3],[559,7,559,8],[559,12,559,13],[556,2,556,3],[556,7,556,8],[556,12,556,13],[557,2,557,3],[557,7,557,8],[557,12,557,13],[562,2,562,3],[562,7,562,8],[562,12,562,13],[563,2,563,3],[563,7,563,8],[563,12,563,13],[560,2,560,3],[560,7,560,8],[560,12,560,13],[561,2,561,4],[561,7,561,9],[561,12,561,13],[566,2,566,3],[566,7,566,8],[566,12,566,13],[567,2,567,3],[567,7,567,8],[567,12,567,13],[564,2,564,3],[564,7,564,8],[564,12,564,13],[565,2,565,3],[565,7,565,8],[565,12,565,13],[570,2,570,3],[570,7,570,8],[570,12,570,13],[571,2,571,3],[571,7,571,8],[571,12,571,13],[568,2,568,3],[568,7,568,8],[568,12,568,13],[569,2,569,3],[569,7,569,8],[569,12,569,13],[574,2,574,3],[574,7,574,8],[574,12,574,13],[575,2,575,3],[575,7,575,8],[575,12,575,13],[572,2,572,3],[572,7,572,8],[572,12,572,13],[573,2,573,3],[573,7,573,8],[573,12,573,13],[578,2,578,3],[578,7,578,8],[578,12,578,13],[579,2,579,3],[579,7,579,8],[579,12,579,13],[576,2,576,3],[576,7,576,8],[576,12,576,13],[577,2,577,3],[577,7,577,8],[577,12,577,13],[582,2,582,3],[582,7,582,8],[582,12,582,13],[583,2,583,3],[583,7,583,8],[583,12,583,13],[580,2,580,3],[580,7,580,8],[580,12,580,13],[581,2,581,3],[581,7,581,8],[581,12,581,13],[586,2,586,3],[586,7,586,8],[586,12,586,13],[587,2,587,3],[587,7,587,8],[587,12,587,13],[584,2,584,3],[584,7,584,8],[584,12,584,13],[585,2,585,3],[585,7,585,8],[585,12,585,13],[590,2,590,3],[590,7,590,8],[590,12,590,13],[591,2,591,3],[591,7,591,8],[591,12,591,13],[588,2,588,3],[588,7,588,8],[588,12,588,13],[589,2,589,3],[589,7,589,8],[589,12,589,13],[594,2,594,3],[594,7,594,8],[594,12,594,13],[595,2,595,3],[595,7,595,8],[595,12,595,13],[592,2,592,3],[592,7,592,8],[592,12,592,13],[593,2,593,3],[593,7,593,8],[593,12,593,13],[598,2,598,3],[598,7,598,8],[598,12,598,13],[599,2,599,3],[599,7,599,8],[599,12,599,13],[596,2,596,3],[596,7,596,8],[596,12,596,13],[597,2,597,3],[597,7,597,8],[597,12,597,13],[602,2,602,3],[602,7,602,8],[602,12,602,13],[603,2,603,3],[603,7,603,8],[603,12,603,13],[600,2,600,3],[600,7,600,8],[600,12,600,13],[601,2,601,3],[601,7,601,8],[601,12,601,13],[606,2,606,3],[606,7,606,8],[606,12,606,13],[607,2,607,3],[607,7,607,8],[607,12,607,13],[604,2,604,3],[604,7,604,8],[604,12,604,13],[605,2,605,3],[605,7,605,8],[605,12,605,13],[610,2,610,3],[610,7,610,8],[610,12,610,13],[611,2,611,3],[611,7,611,8],[611,12,611,13],[608,2,608,3],[608,7,608,8],[608,12,608,13],[609,2,609,3],[609,7,609,8],[609,12,609,13],[614,2,614,3],[614,7,614,8],[614,12,614,13],[615,2,615,3],[615,7,615,8],[615,12,615,13],[612,2,612,3],[612,7,612,8],[612,12,612,13],[613,2,613,3],[613,7,613,8],[613,12,613,13],[618,2,618,3],[618,7,618,8],[618,12,618,13],[619,2,619,3],[619,7,619,8],[619,12,619,13],[616,2,616,3],[616,7,616,8],[616,12,616,13],[617,2,617,3],[617,7,617,8],[617,12,617,13],[622,2,622,3],[622,7,622,8],[622,12,622,13],[623,2,623,3],[623,7,623,8],[623,12,623,13],[620,2,620,3],[620,7,620,8],[620,12,620,13],[621,2,621,3],[621,7,621,8],[621,12,621,13],[626,2,626,3],[626,7,626,8],[626,12,626,13],[627,2,627,3],[627,7,627,8],[627,12,627,13],[624,2,624,3],[624,7,624,8],[624,12,624,13],[625,2,625,3],[625,7,625,8],[625,12,625,13],[630,2,630,3],[630,7,630,8],[630,12,630,13],[631,2,631,3],[631,7,631,8],[631,12,631,13],[628,2,628,3],[628,7,628,8],[628,12,628,13],[629,2,629,3],[629,7,629,8],[629,12,629,13],[634,2,634,3],[634,7,634,8],[634,12,634,13],[635,2,635,3],[635,7,635,8],[635,12,635,13],[632,2,632,3],[632,7,632,8],[632,12,632,13],[633,2,633,3],[633,7,633,8],[633,12,633,13],[638,2,638,3],[638,7,638,8],[638,12,638,13],[639,2,639,3],[639,7,639,8],[639,12,639,13],[636,2,636,3],[636,7,636,8],[636,12,636,13],[637,2,637,3],[637,7,637,8],[637,12,637,13],[642,2,642,3],[642,7,642,8],[642,12,642,13],[643,2,643,3],[643,7,643,8],[643,12,643,13],[640,2,640,3],[640,7,640,8],[640,12,640,13],[641,2,641,3],[641,7,641,8],[641,12,641,13],[646,2,646,3],[646,7,646,8],[646,12,646,13],[647,2,647,3],[647,7,647,8],[647,12,647,13],[644,2,644,3],[644,7,644,8],[644,12,644,13],[645,2,645,3],[645,7,645,8],[645,12,645,13],[650,2,650,3],[650,7,650,8],[650,12,650,13],[651,2,651,3],[651,7,651,8],[651,12,651,13],[648,2,648,3],[648,7,648,8],[648,12,648,13],[649,2,649,3],[649,7,649,8],[649,12,649,13],[654,2,654,3],[654,7,654,8],[654,12,654,13],[655,2,655,3],[655,7,655,8],[655,12,655,13],[652,2,652,3],[652,7,652,8],[652,12,652,13],[653,2,653,3],[653,7,653,8],[653,12,653,13],[658,2,658,3],[658,7,658,8],[658,12,658,13],[659,2,659,3],[659,7,659,8],[659,12,659,13],[656,2,656,3],[656,7,656,8],[656,12,656,13],[657,2,657,3],[657,7,657,8],[657,12,657,13],[662,2,662,3],[662,7,662,8],[662,12,662,13],[663,2,663,3],[663,7,663,8],[663,12,663,13],[660,2,660,3],[660,7,660,8],[660,12,660,13],[661,2,661,3],[661,7,661,8],[661,12,661,13],[666,2,666,3],[666,7,666,8],[666,12,666,13],[667,2,667,3],[667,7,667,8],[667,12,667,13],[664,2,664,3],[664,7,664,8],[664,12,664,13],[665,2,665,3],[665,7,665,8],[665,12,665,13],[670,2,670,3],[670,7,670,8],[670,12,670,13],[671,2,671,3],[671,7,671,8],[671,12,671,13],[668,2,668,3],[668,7,668,8],[668,12,668,13],[669,2,669,3],[669,7,669,8],[669,12,669,13],[674,2,674,3],[674,7,674,8],[674,12,674,13],[675,2,675,3],[675,7,675,8],[675,12,675,13],[672,2,672,3],[672,7,672,8],[672,12,672,13],[673,2,673,3],[673,7,673,8],[673,12,673,13],[678,2,678,3],[678,7,678,8],[678,12,678,13],[679,2,679,3],[679,7,679,8],[679,12,679,13],[676,2,676,3],[676,7,676,8],[676,12,676,13],[677,2,677,3],[677,7,677,8],[677,12,677,13],[682,2,682,3],[682,7,682,8],[682,12,682,13],[683,2,683,3],[683,7,683,8],[683,12,683,13],[680,2,680,3],[680,7,680,8],[680,12,680,13],[681,2,681,3],[681,7,681,8],[681,12,681,13],[686,2,686,3],[686,7,686,8],[686,12,686,13],[687,2,687,3],[687,7,687,8],[687,12,687,13],[684,2,684,3],[684,7,684,8],[684,12,684,13],[685,2,685,3],[685,7,685,8],[685,12,685,13],[690,2,690,3],[690,7,690,8],[690,12,690,13],[691,2,691,3],[691,7,691,8],[691,12,691,13],[688,2,688,3],[688,7,688,8],[688,12,688,13],[689,2,689,3],[689,7,689,8],[689,12,689,13],[694,2,694,3],[694,7,694,8],[694,12,694,13],[695,2,695,3],[695,7,695,8],[695,12,695,13],[692,2,692,3]],"merged_total":1014,"flags":["merged_cut"]}
[]
[{"$f":"A1026","v":"Uruguay"}]
[{"$f":"A1034","v":"2013"}]
["Use of drinking water sources"]
[" by wealth quintile and sub-national region"]
["Notes:"]
["WHO/UNICEF JMP customised wealth index excludes water,"]
[" sanitation and hygiene assets."]
["Survey used for analysis:",{"$f":"A1025","v":"MICS13"}]
[{"$f":"B1028","v":""}]
[{"$f":"B1027","v":""}]
[]
[]
["Use of drinking water sources",null,"NATIONAL wealth index quintile",null,null,null,null,"URBAN wealth index quintile",null,null,null,null,"RURAL wealth index quintile",null,null,null,null,"SUB-REGIONS:",null,null,null,null,null,null,null,null,null,null,null,null,null,null,null,null,null,null,null,null,null,null,null,null,null,null,null,null,null,null,null,null,null,null,"Raw numbers of respondents:","Use of drinking water sources","NATIONAL wealth index quintile",null,null,null,null,"URBAN wealth index quintile",null,null,null,null,"RURAL wealth index quintile",null,null,null,null,"SUB-REGIONS:"]
["Weighted percentage (used in graphs)",null,"Poorest","Poor","Middle","Rich","Richest","Poorest","Poor","Middle","Rich","Richest","Poorest","Poor","Middle","Rich","Richest","Más de 5 mil habitantes","Montevideo y Área Metropolitana","Rurales y menores de 5 mil habitantes",null,null,null,null,null,null,null,null,null,null,null,null,null,null,null,null,null,null,null,null,null,null,null,null,null,null,null,null,null,null,null,null,"Water data, raw numbers (weighted)",null,"Poorest","Poor","Middle","Rich","Richest","Poorest","Poor","Middle","Rich","Richest","Poorest","Poor","Middle","Rich","Richest","Más de 5 mil habitantes","Montevideo y Área Metropolitana","Rurales y menores de 5 mil habitantes"]
["Water","Improved",98.925350323939483,99.508434687403195,99.979233256817224,99.953547634453301,99.640255533293526,99.909404850967505,100,100,100,99.604261693017605,92.158125345283466,91.885447129556866,99.821627262833232,99.772770726967352,99.493586645225861,100,99.824674772885686,96.591692779871067,null,null,null,null,null,null,null,null,null,null,null,null,null,null,null,null,null,null,null,null,null,null,null,null,null,null,null,null,null,null,null,null,"Water","Improved","N/A","N/A","N/A","N/A","N/A","N/A","N/A","N/A","N/A","N/A","N/A","N/A","N/A","N/A","N/A","N/A","N/A","N/A"]
[null,"Not Improved",1.0746496760605257,0.49156531259682201,2.0766743182762323E-2,4.6452365546689522E-2,0.35974446670648352,9.0595149032495353E-2,0,0,0,0.39573830698239837,7.8418746547165181,8.1145528704431982,0.17837273716675625,0.22722927303266727,0.50641335477414229,0,0.17532522711432982,3.4083072201289784,null,null,null,null,null,null,null,null,null,null,null,null,null,null,null,null,null,null,null,null,null,null,null,null,null,null,null,null,null,null,null,null,null,"Not Improved","N/A","N/A","N/A","N/A","N/A","N/A","N/A","N/A","N/A","N/A","N/A","N/A","N/A","N/A","N/A","N/A","N/A","N/A"]
["Water ladder","Basic",98.920336651363399,99.508224090715075,99.761449382653723,99.953547634453301,99.640255533293526,99.908986186114646,100,99.761574297013297,100,99.604261693017605,92.118287953174928,91.885447129556866,99.821627262833232,99.745535788242151,99.493586645225861,100,99.738401057099466,96.512785536784875,null,null,null,null,null,null,null,null,null,null,null,null,null,null,null,null,null,null,null,null,null,null,null,null,null,null,null,null,null,null,null,null,"Water ladder","Basic","N/A","N/A","N/A","N/A","N/A","N/A","N/A","N/A","N/A","N/A","N/A","N/A","N/A","N/A","N/A","N/A","N/A","N/A"]
[null,"Limited",0,0,0.21757873851233339,0,0,0,0,0.23842570298670793,0,0,0,0,0,0,0,0,8.6035243130199363E-2,0,null,null,null,null,null,null,null,null,null,null,null,null,null,null,null,null,null,null,null,null,null,null,null,null,null,null,null,null,null,null,null,null,null,"Limited","N/A","N/A","N/A","N/A","N/A","N/A","N/A","N/A","N/A","N/A","N/A","N/A","N/A","N/A","N/A","N/A","N/A","N/A"]
[null,"Unimproved",1.0796633486365601,0.49177590928493481,2.0971878833941741E-2,4.6452365546689522E-2,0,9.1013813885367445E-2,0,0,0,0,7.881712046825065,8.1145528704431982,0.17837273716675625,0.25446421175786615,0.50641335477414229,0,3.2731745957576136E-2,3.4872144632151589,null,null,null,null,null,null,null,null,null,null,null,null,null,null,null,null,null,null,null,null,null,null,null,null,null,null,null,null,null,null,null,null,null,"Unimproved","N/A","N/A","N/A","N/A","N/A","N/A","N/A","N/A","N/A","N/A","N/A","N/A","N/A","N/A","N/A","N/A","N/A","N/A"]
[null,"Surface water",0,0,0,0,0.35974446670648352,0,0,0,0,0.39573830698239837,0,0,0,0,0,0,0.14283195381275979,0,null,null,null,null,null,null,null,null,null,null,null,null,null,null,null,null,null,null,null,null,null,null,null,null,null,null,null,null,null,null,null,null,null,"Surface water","N/A","N/A","N/A","N/A","N/A","N/A","N/A","N/A","N/A","N/A","N/A","N/A","N/A","N/A","N/A","N/A","N/A","N/A"]
["Improved water point at more than 30 minutes","Yes",0,0,0.21762437843329158,0,0,0,0,0.23842570298670793,0,0,0,0,0,0,0,0,8.6186555435626741E-2,0,null,null,null,null,null,null,null,null,null,null,null,null,null,null,null,null,null,null,null,null,null,null,null,null,null,null,null,null,null,null,null,null,"Improved water point at more than 30 minutes","Yes","N/A","N/A","N/A","N/A","N/A","N/A","N/A","N/A","N/A","N/A","N/A","N/A","N/A","N/A","N/A","N/A","N/A","N/A"]
[null,"No",100,100,99.782375621566715,100,100,100,100,99.761574297013297,100,100,100,100,100,100,100,100,99.913813444564354,100,null,null,null,null,null,null,null,null,null,null,null,null,null,null,null,null,null,null,null,null,null,null,null,null,null,null,null,null,null,null,null,null,null,"No","N/A","N/A","N/A","N/A","N/A","N/A","N/A","N/A","N/A","N/A","N/A","N/A","N/A","N/A","N/A","N/A","N/A","N/A"]
["Manually calculated ratios","Improved wells"]
[null,"Improved springs"]
[null,"Other"]
[null,null,"NATIONAL wealth index quintile",null,null,null,null,"URBAN wealth index quintile",null,null,null,null,"RURAL wealth index quintile",null,null,null,null,"SUB-REGIONS:",null,null,null,null,null,null,null,null,null,null,null,null,null,null,null,null,null,null,null,null,null,null,null,null,null,null,null,null,null,null,null,null,null,null,"Raw numbers of respondents:","Use of drinking water sources","NATIONAL wealth index quintile",null,null,null,null,"URBAN wealth index quintile",null,null,null,null,"RURAL wealth index quintile",null,null,null,null,"SUB-REGIONS:"]
["Percentage based on weighted population",null,"Poorest","Poor","Middle","Rich","Richest","Poorest","Poor","Middle","Rich","Richest","Poorest","Poor","Middle","Rich","Richest","Más de 5 mil habitantes","Montevideo y Área Metropolitana","Rurales y menores de 5 mil habitantes",null,null,null,null,null,null,null,null,null,null,null,null,null,null,null,null,null,null,null,null,null,null,null,null,null,null,null,null,null,null,null,null,"Water data, raw numbers (weighted)",null,"Poorest","Poor","Middle","Rich","Richest","Poorest","Poor","Middle","Rich","Richest","Poorest","Poor","Middle","Rich","Richest","Más de 5 mil habitantes","Montevideo y Área Metropolitana","Rurales y menores de 5 mil habitantes"]
["Piped water","Yes",94.870010906422863,97.259937629705433,99.475495247666473,98.915632179976797,98.595953444083477,98.927243957536376,99.667144914329313,99.954722876610475,100,99.547677533049921,66.592482497617169,81.133428864568558,78.896056286021221,95.084026891012499,77.476739733149316,99.631945129225898,99.609021725254635,79.891454264157474,null,null,null,null,null,null,null,null,null,null,null,null,null,null,null,null,null,null,null,null,null,null,null,null,null,null,null,null,null,null,null,null,"Piped water","Yes","N/A","N/A","N/A","N/A","N/A","N/A","N/A","N/A","N/A","N/A","N/A","N/A","N/A","N/A","N/A","N/A","N/A","N/A"]
[null,"No",5.1299890935771968,2.740062370294591,0.52450475233355576,1.0843678200231781,1.4040465559165347,1.0727560424636153,0.3328550856707016,4.5277123389526296E-2,0,0.45232246695007738,33.407517502382852,18.866571135431514,21.103943713978826,4.9159731089875063,22.523260266850713,0.36805487077410459,0.39097827474536168,20.108545735842398,null,null,null,null,null,null,null,null,null,null,null,null,null,null,null,null,null,null,null,null,null,null,null,null,null,null,null,null,null,null,null,null,null,"No","N/A","N/A","N/A","N/A","N/A","N/A","N/A","N/A","N/A","N/A","N/A","N/A","N/A","N/A","N/A","N/A","N/A","N/A"]
["Piped water on premises","Yes",89.849445390803822,97.118673538305316,98.027992624312802,98.87028500033621,98.595953444083477,93.499945657981016,99.620030317682691,99.435315320351251,99.950361278523602,99.547677533049921,65.689222930166196,81.133428864568558,77.775371729898055,84.381170667319239,77.476739733149316,97.347446625346123,99.262052153838738,77.333200972238259,null,null,null,null,null,null,null,null,null,null,null,null,null,null,null,null,null,null,null,null,null,null,null,null,null,null,null,null,null,null,null,null,"Piped water on premises","Yes","N/A","N/A","N/A","N/A","N/A","N/A","N/A","N/A","N/A","N/A","N/A","N/A","N/A","N/A","N/A","N/A","N/A","N/A"]
[null,"No",10.150554609196218,2.8813264616946963,1.9720073756872167,1.1297149996637683,1.4040465559165347,6.50005434201897,0.37996968231732264,0.56468467964876423,4.9638721476400569E-2,0.45232246695007738,34.310777069833819,18.866571135431514,22.224628270102009,15.618829332680775,22.523260266850713,2.6525533746538854,0.7379478461612976,22.666799027761598,null,null,null,null,null,null,null,null,null,null,null,null,null,null,null,null,null,null,null,null,null,null,null,null,null,null,null,null,null,null,null,null,null,"No","N/A","N/A","N/A","N/A","N/A","N/A","N/A","N/A","N/A","N/A","N/A","N/A","N/A","N/A","N/A","N/A","N/A","N/A"]
["Piped water into dwelling","Yes","N/A","N/A","N/A","N/A","N/A","N/A","N/A","N/A","N/A","N/A","N/A","N/A","N/A","N/A","N/A","N/A","N/A","N/A",null,null,null,null,null,null,null,null,null,null,null,null,null,null,null,null,null,null,null,null,null,null,null,null,null,null,null,null,null,null,null,null,"Piped water into dwelling","Yes","N/A","N/A","N/A","N/A","N/A","N/A","N/A","N/A","N/A","N/A","N/A","N/A","N/A","N/A","N/A","N/A","N/A","N/A"]
[null,"No","N/A","N/A","N/A","N/A","N/A","N/A","N/A","N/A","N/A","N/A","N/A","N/A","N/A","N/A","N/A","N/A","N/A","N/A",null,null,null,null,null,null,null,null,null,null,null,null,null,null,null,null,null,null,null,null,null,null,null,null,null,null,null,null,null,null,null,null,null,"No","N/A","N/A","N/A","N/A","N/A","N/A","N/A","N/A","N/A","N/A","N/A","N/A","N/A","N/A","N/A","N/A","N/A","N/A"]
["Water source on premises","Yes",94.336485275429254,99.957176290229626,98.806403226870458,100,100,95.060879424178296,99.952885403353392,99.761574297013297,100,100,87.949306465384154,99.169900704198739,100,89.297143776306712,100,97.952997666631106,99.75773277873563,95.268670598291692,null,null,null,null,null,null,null,null,null,null,null,null,null,null,null,null,null,null,null,null,null,null,null,null,null,null,null,null,null,null,null,null,"Water source on premises","Yes","N/A","N/A","N/A","N/A","N/A","N/A","N/A","N/A","N/A","N/A","N/A","N/A","N/A","N/A","N/A","N/A","N/A","N/A"]
[null,"No",5.6635147245707946,4.2823709770375334E-2,1.1935967731295405,0,0,4.9391205758216943,4.7114596646621064E-2,0.23842570298670793,0,0,12.050693534615856,0.83009929580126829,0,10.702856223693269,0,2.0470023333689111,0.24226722126436542,4.7313294017083161,null,null,null,null,null,null,null,null,null,null,null,null,null,null,null,null,null,null,null,null,null,null,null,null,null,null,null,null,null,null,null,null,null,"No","N/A","N/A","N/A","N/A","N/A","N/A","N/A","N/A","N/A","N/A","N/A","N/A","N/A","N/A","N/A","N/A","N/A","N/A"]
["Improved Water source on premises","Yes",94.415725412127145,99.956964743838157,98.806155304208488,100,100,95.113314685402187,99.952885403353392,99.761574297013297,100,100,87.972250698050431,99.096593288999472,100,89.272768365847895,100,97.952997666631106,99.777859599309309,95.300830443101916,null,null,null,null,null,null,null,null,null,null,null,null,null,null,null,null,null,null,null,null,null,null,null,null,null,null,null,null,null,null,null,null,"Improved water source on premises","Yes","N/A","N/A","N/A","N/A","N/A","N/A","N/A","N/A","N/A","N/A","N/A","N/A","N/A","N/A","N/A","N/A","N/A","N/A"]
[null,"No",5.5842745878728861,4.3035256161854191E-2,1.1938446957915165,0,0,4.8866853145978286,4.7114596646621064E-2,0.23842570298670793,0,0,12.027749301949578,0.90340671100053849,0,10.727231634152082,0,2.0470023333689111,0.22214040069067587,4.6991695568980658,null,null,null,null,null,null,null,null,null,null,null,null,null,null,null,null,null,null,null,null,null,null,null,null,null,null,null,null,null,null,null,null,null,"No","N/A","N/A","N/A","N/A","N/A","N/A","N/A","N/A","N/A","N/A","N/A","N/A","N/A","N/A","N/A","N/A","N/A","N/A"]
["Piped water on premises available when needed","Yes","N/A","N/A","N/A","N/A","N/A","N/A","N/A","N/A","N/A","N/A","N/A","N/A","N/A","N/A","N/A","N/A","N/A","N/A",null,null,null,null,null,null,null,null,null,null,null,null,null,null,null,null,null,null,null,null,null,null,null,null,null,null,null,null,null,null,null,null,"Piped water on premises available when needed","Yes","N/A","N/A","N/A","N/A","N/A","N/A","N/A","N/A","N/A","N/A","N/A","N/A","N/A","N/A","N/A","N/A","N/A","N/A"]
[null,"No","N/A","N/A","N/A","N/A","N/A","N/A","N/A","N/A","N/A","N/A","N/A","N/A","N/A","N/A","N/A","N/A","N/A","N/A",null,null,null,null,null,null,null,null,null,null,null,null,null,null,null,null,null,null,null,null,null,null,null,null,null,null,null,null,null,null,null,null,null,"No","N/A","N/A","N/A","N/A","N/A","N/A","N/A","N/A","N/A","N/A","N/A","N/A","N/A","N/A","N/A","N/A","N/A","N/A"]
["Water point at more than 30 minutes","Yes",0,0,0.21757873851233339,0,0,0,0,0.23842570298670793,0,0,0,0,0,0,0,0,8.6035243130199363E-2,0,null,null,null,null,null,null,null,null,null,null,null,null,null,null,null,null,null,null,null,null,null,null,null,null,null,null,null,null,null,null,null,null,"Water point at more than 30 minutes","Yes","N/A","N/A","N/A","N/A","N/A","N/A","N/A","N/A","N/A","N/A","N/A","N/A","N/A","N/A","N/A","N/A","N/A","N/A"]
[null,"No",100,100,99.78242126148767,100,100,100,100,99.761574297013297,100,100,100,100,100,100,100,100,99.913964756869788,100,null,null,null,null,null,null,null,null,null,null,null,null,null,null,null,null,null,null,null,null,null,null,null,null,null,null,null,null,null,null,null,null,null,"No","N/A","N/A","N/A","N/A","N/A","N/A","N/A","N/A","N/A","N/A","N/A","N/A","N/A","N/A","N/A","N/A","N/A","N/A"]
["Water source available when needed","Yes","N/A","N/A","N/A","N/A","N/A","N/A","N/A","N/A","N/A","N/A","N/A","N/A","N/A","N/A","N/A","N/A","N/A","N/A",null,null,null,null,null,null,null,null,null,null,null,null,null,null,null,null,null,null,null,null,null,null,null,null,null,null,null,null,null,null,null,null,"Water source available when needed","Yes","N/A","N/A","N/A","N/A","N/A","N/A","N/A","N/A","N/A","N/A","N/A","N/A","N/A","N/A","N/A","N/A","N/A","N/A"]
[null,"No","N/A","N/A","N/A","N/A","N/A","N/A","N/A","N/A","N/A","N/A","N/A","N/A","N/A","N/A","N/A","N/A","N/A","N/A",null,null,null,null,null,null,null,null,null,null,null,null,null,null,null,null,null,null,null,null,null,null,null,null,null,null,null,null,null,null,null,null,null,"No","N/A","N/A","N/A","N/A","N/A","N/A","N/A","N/A","N/A","N/A","N/A","N/A","N/A","N/A","N/A","N/A","N/A","N/A"]
["Improved water source available when needed","Yes","N/A","N/A","N/A","N/A","N/A","N/A","N/A","N/A","N/A","N/A","N/A","N/A","N/A","N/A","N/A","N/A","N/A","N/A",null,null,null,null,null,null,null,null,null,null,null,null,null,null,null,null,null,null,null,null,null,null,null,null,null,null,null,null,null,null,null,null,"Improved water source available when needed","Yes","N/A","N/A","N/A","N/A","N/A","N/A","N/A","N/A","N/A","N/A","N/A","N/A","N/A","N/A","N/A","N/A","N/A","N/A"]
[null,"No","N/A","N/A","N/A","N/A","N/A","N/A","N/A","N/A","N/A","N/A","N/A","N/A","N/A","N/A","N/A","N/A","N/A","N/A",null,null,null,null,null,null,null,null,null,null,null,null,null,null,null,null,null,null,null,null,null,null,null,null,null,null,null,null,null,null,null,null,null,"No","N/A","N/A","N/A","N/A","N/A","N/A","N/A","N/A","N/A","N/A","N/A","N/A","N/A","N/A","N/A","N/A","N/A","N/A"]
["Microbiological quality at point of collection","Not contaminated (No E. coli in 100 mL)","N/A","N/A","N/A","N/A","N/A","N/A","N/A","N/A","N/A","N/A","N/A","N/A","N/A","N/A","N/A","N/A","N/A","N/A",null,null,null,null,null,null,null,null,null,null,null,null,null,null,null,null,null,null,null,null,null,null,null,null,null,null,null,null,null,null,null,null,"Microbiological quality at point of collection","Not contaminated (No E. coli in 100 mL)","N/A","N/A","N/A","N/A","N/A","N/A","N/A","N/A","N/A","N/A","N/A","N/A","N/A","N/A","N/A","N/A","N/A","N/A"]
[null,"Contaminated (E. coli detected in 100 mL)","N/A","N/A","N/A","N/A","N/A","N/A","N/A","N/A","N/A","N/A","N/A","N/A","N/A","N/A","N/A","N/A","N/A","N/A",null,null,null,null,null,null,null,null,null,null,null,null,null,null,null,null,null,null,null,null,null,null,null,null,null,null,null,null,null,null,null,null,null,"Contaminated (E. coli detected in 100 mL)","N/A","N/A","N/A","N/A","N/A","N/A","N/A","N/A","N/A","N/A","N/A","N/A","N/A","N/A","N/A","N/A","N/A","N/A"]
[null,"Highly contaminated (>100 CFU/100 mL)","N/A","N/A","N/A","N/A","N/A","N/A","N/A","N/A","N/A","N/A","N/A","N/A","N/A","N/A","N/A","N/A","N/A","N/A",null,null,null,null,null,null,null,null,null,null,null,null,null,null,null,null,null,null,null,null,null,null,null,null,null,null,null,null,null,null,null,null,null,"Highly contaminated (>100 CFU/100 mL)","N/A","N/A","N/A","N/A","N/A","N/A","N/A","N/A","N/A","N/A","N/A","N/A","N/A","N/A","N/A","N/A","N/A","N/A"]
["Microbiological quality of improved water sources at point of collection","Not contaminated (No E. coli in 100 mL)","N/A","N/A","N/A","N/A","N/A","N/A","N/A","N/A","N/A","N/A","N/A","N/A","N/A","N/A","N/A","N/A","N/A","N/A",null,null,null,null,null,null,null,null,null,null,null,null,null,null,null,null,null,null,null,null,null,null,null,null,null,null,null,null,null,null,null,null,"Microbiological quality of improved water sources at point of collection","Not contaminated (No E. coli in 100 mL)","N/A","N/A","N/A","N/A","N/A","N/A","N/A","N/A","N/A","N/A","N/A","N/A","N/A","N/A","N/A","N/A","N/A","N/A"]
[null,"Contaminated (E. coli detected in 100 mL)","N/A","N/A","N/A","N/A","N/A","N/A","N/A","N/A","N/A","N/A","N/A","N/A","N/A","N/A","N/A","N/A","N/A","N/A",null,null,null,null,null,null,null,null,null,null,null,null,null,null,null,null,null,null,null,null,null,null,null,null,null,null,null,null,null,null,null,null,null,"Contaminated (E. coli detected in 100 mL)","N/A","N/A","N/A","N/A","N/A","N/A","N/A","N/A","N/A","N/A","N/A","N/A","N/A","N/A","N/A","N/A","N/A","N/A"]
[null,"Highly contaminated (>100 CFU/100 mL)","N/A","N/A","N/A","N/A","N/A","N/A","N/A","N/A","N/A","N/A","N/A","N/A","N/A","N/A","N/A","N/A","N/A","N/A",null,null,null,null,null,null,null,null,null,null,null,null,null,null,null,null,null,null,null,null,null,null,null,null,null,null,null,null,null,null,null,null,null,"Highly contaminated (>100 CFU/100 mL)","N/A","N/A","N/A","N/A","N/A","N/A","N/A","N/A","N/A","N/A","N/A","N/A","N/A","N/A","N/A","N/A","N/A","N/A"]
["Microbiological quality of piped on premises at point of collection","Not contaminated (No E. coli in 100 mL)","N/A","N/A","N/A","N/A","N/A","N/A","N/A","N/A","N/A","N/A","N/A","N/A","N/A","N/A","N/A","N/A","N/A","N/A",null,null,null,null,null,null,null,null,null,null,null,null,null,null,null,null,null,null,null,null,null,null,null,null,null,null,null,null,null,null,null,null,"Microbiological quality of piped on premises at point of collection","Not contaminated (No E. coli in 100 mL)","N/A","N/A","N/A","N/A","N/A","N/A","N/A","N/A","N/A","N/A","N/A","N/A","N/A","N/A","N/A","N/A","N/A","N/A"]
[null,"Contaminated (E. coli detected in 100 mL)","N/A","N/A","N/A","N/A","N/A","N/A","N/A","N/A","N/A","N/A","N/A","N/A","N/A","N/A","N/A","N/A","N/A","N/A",null,null,null,null,null,null,null,null,null,null,null,null,null,null,null,null,null,null,null,null,null,null,null,null,null,null,null,null,null,null,null,null,null,"Contaminated (E. coli detected in 100 mL)","N/A","N/A","N/A","N/A","N/A","N/A","N/A","N/A","N/A","N/A","N/A","N/A","N/A","N/A","N/A","N/A","N/A","N/A"]
[null,"Highly contaminated (>100 CFU/100 mL)","N/A","N/A","N/A","N/A","N/A","N/A","N/A","N/A","N/A","N/A","N/A","N/A","N/A","N/A","N/A","N/A","N/A","N/A",null,null,null,null,null,null,null,null,null,null,null,null,null,null,null,null,null,null,null,null,null,null,null,null,null,null,null,null,null,null,null,null,null,"Highly contaminated (>100 CFU/100 mL)","N/A","N/A","N/A","N/A","N/A","N/A","N/A","N/A","N/A","N/A","N/A","N/A","N/A","N/A","N/A","N/A","N/A","N/A"]
[null,null,"NATIONAL wealth index quintile",null,null,null,null,"URBAN wealth index quintile",null,null,null,null,"RURAL wealth index quintile",null,null,null,null,"SUB-REGIONS:",null,null,null,null,null,null,null,null,null,null,null,null,null,null,null,null,null,null,null,null,null,null,null,null,null,null,null,null,null,null,null,null,null,null,"Raw numbers of respondents:","Use of drinking water sources","NATIONAL wealth index quintile",null,null,null,null,"URBAN wealth index quintile",null,null,null,null,"RURAL wealth index quintile",null,null,null,null,"SUB-REGIONS:"]
["Percentage based on weighted population",null,"Poorest","Poor","Middle","Rich","Richest","Poorest","Poor","Middle","Rich","Richest","Poorest","Poor","Middle","Rich","Richest","Más de 5 mil habitantes","Montevideo y Área Metropolitana","Rurales y menores de 5 mil habitantes",null,null,null,null,null,null,null,null,null,null,null,null,null,null,null,null,null,null,null,null,null,null,null,null,null,null,null,null,null,null,null,null,"Water data, raw numbers (weighted)",null,"Poorest","Poor","Middle","Rich","Richest","Poorest","Poor","Middle","Rich","Richest","Poorest","Poor","Middle","Rich","Richest","Más de 5 mil habitantes","Montevideo y Área Metropolitana","Rurales y menores de 5 mil habitantes"]
["Fuente principal de agua potable","Tubería dentro de la vivienda",82.644011391464304,95.256696924526167,93.761985381257773,90.07214788182435,79.478536697930977,87.050991603325599,97.640329337615427,94.904484675430254,89.953567834033251,79.271500152828054,54.359035368027889,77.601779081198501,76.869883771477774,81.01974201356181,75.501286153236506,93.655692923923482,86.638932910992608,73.102734717258116]
[null,"Tubería dentro del terreno, patio o lote",5.8877292570064474,0.9763247115195739,1.0823888601660059,1.579839763015416,6.8286858306655898,5.0329371241113643,1.0569132271983819,1.1022902652502395,1.7293517831805869,7.5119225440294715,11.330187562138331,3.015814269165666,0.21904334527016109,0.90562769638846929,0,1.7574031363257223,4.5147820971344625,3.0995585475223235]
[null,"Tubería al vecino",0.46437369411177981,4.2823709770375334E-2,0.97814627293867262,0,0,0.46000143824253209,4.7114596646621064E-2,0,0,0,0.50544084675858025,0,0,10.702856223693269,0,5.8710930112596538E-2,0.13583255326590524,2.2627585403345041]
[null,"Canilla o grifo público",4.556191821507241,9.8440381629729373E-2,0.46935635041498847,4.534717964059011E-2,0,4.9672968613128221,0,0.51940755625923796,4.9638721476400569E-2,0,0.39781872069239754,0,1.1206845561231789,0,0,2.2257875737671839,0.21113701815003053,0.29549475158469285]
[null,"Pozo con tubería",1.6297686563560909,0.93107216490418232,3.1252263270964933E-2,0.85034640893149827,0.73033091619499013,0.80042754810640393,0.3328550856707016,0,0,0,3.044668620266894,6.7676497745484498,7.3191759471635267,0.11657327198556322,17.268448379807381,0.33499431334850804,0.13990235648518534,6.8967207404541666]
[null,"Pozo protegido",0.53454161961135538,0.23834433183620479,3.3573021653501234E-2,0.14860664247280264,5.1437624542403547E-2,0.13651257904506267,0,0,0,5.6584159967679022E-2,4.0057074910527533,2.1330506754983909,0.98626012912896888,0.53777726112641,1.4485237824054571,3.3060557425596548E-2,4.3118831320529169E-2,1.8248367294449352]
[null,"Pozo no protegido",0.69348863415044226,1.5668173727473863E-2,0,0,0,1.1305191569913354E-2,0,0,0,0,4.6608102526169519,2.7955932009842357,0.17837273716675625,0,0,0,4.0789824781646859E-3,1.5359482490745811]
[null,"Manantial o pozo surgente protegido",0.73253504548488357,1.0790805609573824,0.37096303570926398,3.8962403072187464E-2,0.26253354847265759,0,0,0,0,0,6.5103566811850273,1.5299375054347852,12.620134900519576,3.7385707216417874,3.2998747498637395,0,0,5.4632528610658708]
[null,"Manantial o pozo surgente no protegido",0.30900846365052803,0.4758971388693482,2.0766743182762323E-2,4.6452365546689522E-2,0,0,0,0,0,0,3.1810644020995662,5.3189596694589616,0,0.22722927303266727,0.50641335477414229,0,0,1.8723589710543962]
[null,"Recogen agua de lluvia",0.16980784221192019,0,0,0,0,0,0,0,0,0,1.8747955540167232,0,0,0,0,0,0,0.37319894781368673]
[null,"Carrotanque / camión cisterna",0.9475360882783076,0,0,0,0,0,0,0,0,0,10.130114501144927,0.32138030950668528,0,0,0,0,0,2.0824684334640087]
[null,"Agua de superficie(río, arroyo, represa, lago, estanque, canal, canal de irrigación)",0,0,0,0,0.35974446670648352,0,0,0,0,0.39573830698239837,0,0,0,0,0,0,0.14263794152301637,0]
[null,"Agua embotellada/envasada",1.3588549079071854,0.88565190225961565,3.2515680714060782,7.2182973554964978,12.288730915486887,1.4612376968237129,0.92278775286889125,3.4738175030603009,8.2674416613097819,12.764254836192373,0,0.51583551420438822,0.68644461315011318,2.7516235385699979,1.9754535799128157,1.934350565096965,8.14096900553713,1.1906685109286186]
[null,"Otra",7.2152578259555497E-2,0,0,0,0,7.9289957462582009E-2,0,0,0,0,0,0,0,0,0,0,2.8608303113148759E-2,0]
[]
[]
[]
[]
[]
[]
[]
[]
[]
[]
[]
[]
[]
[]
[]
[]
[]
[]
[]
[]
[]
[]
[]
[]
[]
[]
[]
[]
[]
[]
[]
[]
[]
[]
[]
[]
[{"$f":"A1026","v":"Uruguay"}]
[{"$f":"A1034","v":"2013"}]
["Use of sanitation facilities"]
[" by wealth quintile and sub-national region"]
["Notes:"]
["WHO/UNICEF JMP customised wealth index excludes water,"]
[" sanitation and hygiene assets."]
["Survey used for analysis:",{"$f":"A1025","v":"MICS13"}]
[{"$f":"B1030","v":""}]
[{"$f":"B1029","v":""}]
[]
[]
["Use of sanitation facilities",null,"NATIONAL wealth index quintile",null,null,null,null,"URBAN wealth index quintile",null,null,null,null,"RURAL wealth index quintile",null,null,null,null,"SUB-REGIONS:",null,null,null,null,null,null,null,null,null,null,null,null,null,null,null,null,null,null,null,null,null,null,null,null,null,null,null,null,null,null,null,null,null,null,"Raw numbers of respondents:","Use of sanitation facilities","NATIONAL wealth index quintile",null,null,null,null,"URBAN wealth index quintile",null,null,null,null,"RURAL wealth index quintile",null,null,null,null,"SUB-REGIONS:"]
["Weighted percentage (used in graphs)",null,"Poorest","Poor","Middle","Rich","Richest","Poorest","Poor","Middle","Rich","Richest","Poorest","Poor","Middle","Rich","Richest","Más de 5 mil habitantes","Montevideo y Área Metropolitana","Rurales y menores de 5 mil habitantes",null,null,null,null,null,null,null,null,null,null,null,null,null,null,null,null,null,null,null,null,null,null,null,null,null,null,null,null,null,null,null,null,"Sanitation data, raw numbers (weighted)",null,"Poorest","Poor","Middle","Rich","Richest","Poorest","Poor","Middle","Rich","Richest","Poorest","Poor","Middle","Rich","Richest","Más de 5 mil habitantes","Montevideo y Área Metropolitana","Rurales y menores de 5 mil habitantes"]
["Sanitation","Improved",93.82910446468702,99.927387049910436,99.965660171304748,98.805991162828676,99.458267183364129,93.899938228399776,99.92011131513047,99.961998241870603,98.692993200934239,99.404064697214096,93.461470686057368,99.703181792907714,100,100,100,99.915139238189596,97.138608906009864,98.637517454984902,null,null,null,null,null,null,null,null,null,null,null,null,null,null,null,null,null,null,null,null,null,null,null,null,null,null,null,null,null,null,null,null,"Sanitation","Improved",2018.3642239999992,2149.0974169999959,2162.7739599999991,2115.791174999998,2139.4569530000003,1838.0653349999993,1953.2295659999986,1954.2929149999993,1930.658836999999,1943.8056440000018,182.09516199999987,200.27420699999988,188.91283799999999,197.72628500000008,196.4229399999999,4350.0160289999949,5270.0362679999862,965.431432000001]
[null,"Not Improved",6.1708955353130319,7.2612950089550224E-2,3.4339828695251422E-2,1.1940088371712991,0.54173281663586781,6.1000617716002559,7.9888684869545354E-2,3.8001758129385284E-2,1.3070067990657459,0.59593530278591111,6.5385293139426066,0.29681820709227663,0,0,0,8.4860761810379479E-2,2.861391093990187,1.3624825450151243,null,null,null,null,null,null,null,null,null,null,null,null,null,null,null,null,null,null,null,null,null,null,null,null,null,null,null,null,null,null,null,null,null,"Not Improved",132.74255199999999,1.5616570000000001,0.74294800000000005,25.568017999999999,11.653269999999999,119.40702300000002,1.5616570000000001,0.74294800000000005,25.568017999999999,11.653269999999999,12.739309,0.59621999999999997,0,0,0,3.6945919999999997,155.23832399999998,13.335528999999999]
["Sanitation ladder","Basic",87.338336275869793,95.041791948869957,95.493276681154555,95.306937512935065,96.69562494954414,85.906539944224818,96.588014315608802,94.914822337456044,95.522975887170276,96.423326433507967,86.059351376276723,94.409625066411635,99.014785855898282,97.65510842425428,98.322739187184567,93.656412707576337,94.012511581531626,95.077195193555397,null,null,null,null,null,null,null,null,null,null,null,null,null,null,null,null,null,null,null,null,null,null,null,null,null,null,null,null,null,null,null,null,"Sanitation ladder","Basic",1878.5939499999997,2015.8606599999978,2066.0131869999991,2040.863867999999,2055.2838650000017,1681.4522619999993,1859.4715629999992,1855.6188159999999,1868.6461069999987,1860.8426080000022,167.67328199999992,189.64101699999998,187.05164200000002,193.08981800000009,193.12841499999993,4040.2799939999973,5085.7513619999954,930.58417400000087]
[null,"Limited",6.4902855800171579,4.8845806012598949,4.4723834901501966,3.499053649893666,2.7561197731461888,7.9928740190540291,3.3308672894270552,5.0471759044145994,3.1700173137639509,2.9728357930032661,7.4021193097806623,5.2935567264961341,0.98521414410173647,2.3448915757457325,1.6772608128154491,6.2579441603506769,3.1178348129080731,3.5603222614294978,null,null,null,null,null,null,null,null,null,null,null,null,null,null,null,null,null,null,null,null,null,null,null,null,null,null,null,null,null,null,null,null,null,"Limited",139.60205500000001,103.60320100000001,96.760772999999986,74.927306999999999,58.581848999999998,156.44485400000005,64.124446999999989,98.674098999999984,62.012729999999991,57.371796999999994,14.42188,10.633190000000001,1.8611959999999999,4.6364669999999997,3.2945250000000001,269.96385900000007,168.66406799999993,34.847257999999997]
[null,"Unimproved",3.8390674494752712,3.487468650058935E-2,0,1.1940088371712991,0.54825527730972246,3.5753661684766951,3.8422878950620541E-2,0,1.3070067990657459,0.60383777348879575,6.1585467594181553,0.29681820709227663,0,0,0,5.0495365841966761E-2,1.9550870501055053,1.2868427829982698,null,null,null,null,null,null,null,null,null,null,null,null,null,null,null,null,null,null,null,null,null,null,null,null,null,null,null,null,null,null,null,null,null,"Unimproved",82.575982000000025,0.73970100000000005,0,25.568017999999999,11.653269999999999,69.980790000000013,0.73970100000000005,0,25.568017999999999,11.653269999999999,11.998972,0.59621999999999997,0,0,0,2.1783389999999998,105.76344,12.595192000000001]
[null,"Open defecation",2.33231069463785,3.8752763369629649E-2,3.4339828695251422E-2,0,0,2.5252198682445046,4.2695516013546368E-2,3.8001758129385284E-2,0,0,0.37998255452445079,0,0,0,0,3.5147766231050176E-2,0.91456655545500454,7.5639762016854545E-2,null,null,null,null,null,null,null,null,null,null,null,null,null,null,null,null,null,null,null,null,null,null,null,null,null,null,null,null,null,null,null,null,null,"Open defecation",50.16657,0.82195600000000002,0.74294800000000005,0,0,49.426232999999996,0.82195600000000002,0.74294800000000005,0,0,0.74033700000000002,0,0,0,0,1.5162529999999999,49.474883999999996,0.74033700000000002]
["Shared among Improved Sanitation","Yes",6.917170317161542,4.8881796432763132,4.4739198265545985,3.5413375329916517,2.7713136464637302,8.5121660313873697,3.3335714290652971,5.0490946491508932,3.2119983505920691,2.990895952530392,7.9199687908237841,5.3093157422912718,0.98521414410173647,2.3448915757457325,1.6772608128154491,6.2633082537105427,3.2099492369220677,3.6095010836564474,null,null,null,null,null,null,null,null,null,null,null,null,null,null,null,null,null,null,null,null,null,null,null,null,null,null,null,null,null,null,null,null,"Shared among improved sanitation facilities","Yes","N/A","N/A","N/A","N/A","N/A","N/A","N/A","N/A","N/A","N/A","N/A","N/A","N/A","N/A","N/A","N/A","N/A","N/A"]
[null,"No",93.082829682838479,95.11182035672374,95.526080173445408,96.458662467008395,97.228686353536304,91.487833968612648,96.666428570934713,94.950905350849141,96.788001649407903,97.009104047469634,92.080031209176241,94.690684257708782,99.014785855898282,97.65510842425428,98.322739187184567,93.73669174628948,96.790050763078099,96.390498916343532,null,null,null,null,null,null,null,null,null,null,null,null,null,null,null,null,null,null,null,null,null,null,null,null,null,null,null,null,null,null,null,null,null,"No","N/A","N/A","N/A","N/A","N/A","N/A","N/A","N/A","N/A","N/A","N/A","N/A","N/A","N/A","N/A","N/A","N/A","N/A"]
["Manually calculated ratios","Improved latrines"]
[null,"Other"]
[null,"Other"]
[null,null,"NATIONAL wealth index quintile",null,null,null,null,"URBAN wealth index quintile",null,null,null,null,"RURAL wealth index quintile",null,null,null,null,"SUB-REGIONS:",null,null,null,null,null,null,null,null,null,null,null,null,null,null,null,null,null,null,null,null,null,null,null,null,null,null,null,null,null,null,null,null,null,null,"Raw numbers of respondents:","Use of sanitation facilities","NATIONAL wealth index quintile",null,null,null,null,"URBAN wealth index quintile",null,null,null,null,"RURAL wealth index quintile",null,null,null,null,"SUB-REGIONS:"]
["Percentage based on weighted population",null,"Poorest","Poor","Middle","Rich","Richest","Poorest","Poor","Middle","Rich","Richest","Poorest","Poor","Middle","Rich","Richest","Más de 5 mil habitantes","Montevideo y Área Metropolitana","Rurales y menores de 5 mil habitantes",null,null,null,null,null,null,null,null,null,null,null,null,null,null,null,null,null,null,null,null,null,null,null,null,null,null,null,null,null,null,null,null,"Sanitation data, raw numbers (weighted)",null,"Poorest","Poor","Middle","Rich","Richest","Poorest","Poor","Middle","Rich","Richest","Poorest","Poor","Middle","Rich","Richest","Más de 5 mil habitantes","Montevideo y Área Metropolitana","Rurales y menores de 5 mil habitantes"]
["Sanitation type","Sewer connection",33.126670742261652,51.426656896526843,54.367181400368402,65.34766472501849,78.052147586302524,38.063501839753691,52.920803348624467,58.056999182526056,68.915785741015242,79.710436043454564,8.7760984553908887,36.157380200122752,34.395837619039966,32.497367256963308,16.666108856735377,61.599660644969688,57.869732024800925,25.715865985386454,null,null,null,null,null,null,null,null,null,null,null,null,null,null,null,null,null,null,null,null,null,null,null,null,null,null,null,null,null,null,null,null,"Sanitation type","Sewer connection","N/A","N/A","N/A","N/A","N/A","N/A","N/A","N/A","N/A","N/A","N/A","N/A","N/A","N/A","N/A","N/A","N/A","N/A"]
[null,"Septic tank connection",60.174328696364142,48.354100171992329,45.383028270745569,33.4583264378103,21.396116111526652,55.577266292104632,46.891865443985608,41.666573356357929,29.777207459919069,19.693628653759564,80.917992689291623,63.545801592785033,65.604162380960062,67.502632743036656,83.224338766133954,38.269832288883329,39.087366068567178,72.149727170858171,null,null,null,null,null,null,null,null,null,null,null,null,null,null,null,null,null,null,null,null,null,null,null,null,null,null,null,null,null,null,null,null,null,"Septic tank connection","N/A","N/A","N/A","N/A","N/A","N/A","N/A","N/A","N/A","N/A","N/A","N/A","N/A","N/A","N/A","N/A","N/A","N/A"]
[null,"Improved latrines",0.5281050260612451,0.1466299813914628,0.21545050019086803,0,1.000348553501342E-2,0.25917009654140943,0.10744252252047287,0.23842570298670793,0,0,3.7673795413748947,0,0,0,0.10955237713069568,4.5646304336679572E-2,0.18151081264201624,0.77192429874019775,null,null,null,null,null,null,null,null,null,null,null,null,null,null,null,null,null,null,null,null,null,null,null,null,null,null,null,null,null,null,null,null,null,"Improved latrines","N/A","N/A","N/A","N/A","N/A","N/A","N/A","N/A","N/A","N/A","N/A","N/A","N/A","N/A","N/A","N/A","N/A","N/A"]
[null,"Unimproved facilities",3.8387672300280133,3.4394154282400287E-2,0,1.1940088371712991,0.54173281663586781,3.5750589127859382,3.7840409313112652E-2,0,1.3070067990657459,0.59593530278591111,6.1585467594181553,0.29681820709227663,0,0,0,5.0034078734880666E-2,1.9494578238667764,1.2868427829982698,null,null,null,null,null,null,null,null,null,null,null,null,null,null,null,null,null,null,null,null,null,null,null,null,null,null,null,null,null,null,null,null,null,"Unimproved facilities","N/A","N/A","N/A","N/A","N/A","N/A","N/A","N/A","N/A","N/A","N/A","N/A","N/A","N/A","N/A","N/A","N/A","N/A"]
[null,"Open defecation",2.3321283052850204,3.821879580714993E-2,3.4339828695251422E-2,0,0,2.5250028588143172,4.2048275556432695E-2,3.8001758129385284E-2,0,0,0.37998255452445079,0,0,0,0,3.4826683075498813E-2,0.91193327012341097,7.5639762016854545E-2,null,null,null,null,null,null,null,null,null,null,null,null,null,null,null,null,null,null,null,null,null,null,null,null,null,null,null,null,null,null,null,null,null,"Open defecation","N/A","N/A","N/A","N/A","N/A","N/A","N/A","N/A","N/A","N/A","N/A","N/A","N/A","N/A","N/A","N/A","N/A","N/A"]
["Septic tank emptying practices","Not emptied/treated and disposed in situ","N/A","N/A","N/A","N/A","N/A","N/A","N/A","N/A","N/A","N/A","N/A","N/A","N/A","N/A","N/A","N/A","N/A","N/A",null,null,null,null,null,null,null,null,null,null,null,null,null,null,null,null,null,null,null,null,null,null,null,null,null,null,null,null,null,null,null,null,"Septic tank emptying practices","Not emptied/treated and disposed in situ","N/A","N/A","N/A","N/A","N/A","N/A","N/A","N/A","N/A","N/A","N/A","N/A","N/A","N/A","N/A","N/A","N/A","N/A"]
[null,"Emptied and buried on site","N/A","N/A","N/A","N/A","N/A","N/A","N/A","N/A","N/A","N/A","N/A","N/A","N/A","N/A","N/A","N/A","N/A","N/A",null,null,null,null,null,null,null,null,null,null,null,null,null,null,null,null,null,null,null,null,null,null,null,null,null,null,null,null,null,null,null,null,null,"Emptied and buried on site","N/A","N/A","N/A","N/A","N/A","N/A","N/A","N/A","N/A","N/A","N/A","N/A","N/A","N/A","N/A","N/A","N/A","N/A"]
[null,"Emptied and discharged locally","N/A","N/A","N/A","N/A","N/A","N/A","N/A","N/A","N/A","N/A","N/A","N/A","N/A","N/A","N/A","N/A","N/A","N/A",null,null,null,null,null,null,null,null,null,null,null,null,null,null,null,null,null,null,null,null,null,null,null,null,null,null,null,null,null,null,null,null,null,"Emptied and discharged locally","N/A","N/A","N/A","N/A","N/A","N/A","N/A","N/A","N/A","N/A","N/A","N/A","N/A","N/A","N/A","N/A","N/A","N/A"]
[null,"Emptied and removed offsite","N/A","N/A","N/A","N/A","N/A","N/A","N/A","N/A","N/A","N/A","N/A","N/A","N/A","N/A","N/A","N/A","N/A","N/A",null,null,null,null,null,null,null,null,null,null,null,null,null,null,null,null,null,null,null,null,null,null,null,null,null,null,null,null,null,null,null,null,null,"Emptied and removed offsite","N/A","N/A","N/A","N/A","N/A","N/A","N/A","N/A","N/A","N/A","N/A","N/A","N/A","N/A","N/A","N/A","N/A","N/A"]
["Latrine emptying practices","Not emptied/treated and disposed in situ","N/A","N/A","N/A","N/A","N/A","N/A","N/A","N/A","N/A","N/A","N/A","N/A","N/A","N/A","N/A","N/A","N/A","N/A",null,null,null,null,null,null,null,null,null,null,null,null,null,null,null,null,null,null,null,null,null,null,null,null,null,null,null,null,null,null,null,null,"Latrine emptying practices","Not emptied/treated and disposed in situ","N/A","N/A","N/A","N/A","N/A","N/A","N/A","N/A","N/A","N/A","N/A","N/A","N/A","N/A","N/A","N/A","N/A","N/A"]
[null,"Emptied and buried on site","N/A","N/A","N/A","N/A","N/A","N/A","N/A","N/A","N/A","N/A","N/A","N/A","N/A","N/A","N/A","N/A","N/A","N/A",null,null,null,null,null,null,null,null,null,null,null,null,null,null,null,null,null,null,null,null,null,null,null,null,null,null,null,null,null,null,null,null,null,"Emptied and buried on site","N/A","N/A","N/A","N/A","N/A","N/A","N/A","N/A","N/A","N/A","N/A","N/A","N/A","N/A","N/A","N/A","N/A","N/A"]
[null,"Emptied and discharged locally","N/A","N/A","N/A","N/A","N/A","N/A","N/A","N/A","N/A","N/A","N/A","N/A","N/A","N/A","N/A","N/A","N/A","N/A",null,null,null,null,null,null,null,null,null,null,null,null,null,null,null,null,null,null,null,null,null,null,null,null,null,null,null,null,null,null,null,null,null,"Emptied and discharged locally","N/A","N/A","N/A","N/A","N/A","N/A","N/A","N/A","N/A","N/A","N/A","N/A","N/A","N/A","N/A","N/A","N/A","N/A"]
[null,"Emptied and removed offsite","N/A","N/A","N/A","N/A","N/A","N/A","N/A","N/A","N/A","N/A","N/A","N/A","N/A","N/A","N/A","N/A","N/A","N/A",null,null,null,null,null,null,null,null,null,null,null,null,null,null,null,null,null,null,null,null,null,null,null,null,null,null,null,null,null,null,null,null,null,"Emptied and removed offsite","N/A","N/A","N/A","N/A","N/A","N/A","N/A","N/A","N/A","N/A","N/A","N/A","N/A","N/A","N/A","N/A","N/A","N/A"]
["Shared among improved sanitation facilities","Yes",6.4897780322923451,4.8172768177203062,4.4723834901501966,3.499053649893666,2.7233308815900683,7.9921871366727197,3.2803731797807463,5.0471759044145994,3.1700173137639509,2.9339300656868699,7.4021193097806623,5.2935567264961341,0.98521414410173647,2.3448915757457325,1.6772608128154491,6.200776360694193,3.1088577202840399,3.5603222614294978,null,null,null,null,null,null,null,null,null,null,null,null,null,null,null,null,null,null,null,null,null,null,null,null,null,null,null,null,null,null,null,null,"Shared among improved sanitation facilities","Yes","N/A","N/A","N/A","N/A","N/A","N/A","N/A","N/A","N/A","N/A","N/A","N/A","N/A","N/A","N/A","N/A","N/A","N/A"]
[null,"No",87.331506318494405,93.732227686404627,95.493276681154555,95.306937512935065,95.545260443867136,85.899157407156622,95.123793330025634,94.914822337456044,95.522975887170276,95.161427053128094,86.059351376276723,94.409625066411635,99.014785855898282,97.65510842425428,98.322739187184567,92.800839231524151,93.741824045171043,95.077195193555397,null,null,null,null,null,null,null,null,null,null,null,null,null,null,null,null,null,null,null,null,null,null,null,null,null,null,null,null,null,null,null,null,null,"No","N/A","N/A","N/A","N/A","N/A","N/A","N/A","N/A","N/A","N/A","N/A","N/A","N/A","N/A","N/A","N/A","N/A","N/A"]
[null,"DK/missing",6.1787156492133182,1.450495495875143,3.4339828695251422E-2,1.1940088371712991,1.7314086745428474,6.1086554561706921,1.5958334901936495,3.8001758129385284E-2,1.3070067990657459,1.9046428811850746,6.5385293139426066,0.29681820709227663,0,0,0,0.99838440778170501,3.1493182345451407,1.3624825450151243,null,null,null,null,null,null,null,null,null,null,null,null,null,null,null,null,null,null,null,null,null,null,null,null,null,null,null,null,null,null,null,null,null,"DK/missing","N/A","N/A","N/A","N/A","N/A","N/A","N/A","N/A","N/A","N/A","N/A","N/A","N/A","N/A","N/A","N/A","N/A","N/A"]
["Shared among all sanitation facilities","Yes",6.8003781636420433,4.8191186268279989,4.4739198265545985,3.499053649893666,2.7233308815900683,8.3705878965583285,3.2817531003674705,5.0490946491508932,3.1700173137639509,2.9339300656868699,7.4303533562740265,5.2935567264961341,0.98521414410173647,2.3448915757457325,1.6772608128154491,6.2092585980755626,3.1931760356425913,3.563017319250398,null,null,null,null,null,null,null,null,null,null,null,null,null,null,null,null,null,null,null,null,null,null,null,null,null,null,null,null,null,null,null,null,"Shared among all sanitation facilities","Yes","N/A","N/A","N/A","N/A","N/A","N/A","N/A","N/A","N/A","N/A","N/A","N/A","N/A","N/A","N/A","N/A","N/A","N/A"]
[null,"No",93.191614992587759,93.802472015928871,95.526080173445408,96.500946350106346,96.08699326050295,91.620595807137519,95.201664397518925,94.950905350849141,96.829982686236022,95.757362355913983,92.56964664372596,94.706443273503893,99.014785855898282,97.65510842425428,98.322739187184567,92.87689949512847,96.516246955382371,96.436982680749622,null,null,null,null,null,null,null,null,null,null,null,null,null,null,null,null,null,null,null,null,null,null,null,null,null,null,null,null,null,null,null,null,null,"No","N/A","N/A","N/A","N/A","N/A","N/A","N/A","N/A","N/A","N/A","N/A","N/A","N/A","N/A","N/A","N/A","N/A","N/A"]
["Tipo de servicio sanitario","Inodoro conectado a red de saneamiento",33.126670742261652,51.426656896526843,54.367181400368402,65.34766472501849,78.052147586302524,38.063501839753691,52.920803348624467,58.056999182526056,68.915785741015242,79.710436043454564,8.7760984553908887,36.157380200122752,34.395837619039966,32.497367256963308,16.666108856735377,61.599660644969688,57.869732024800925,25.715865985386454,null,null,null,null,null,null,null,null,null,null,null,null,null,null,null,null,null,null,null,null,null,null,null,null,null,null,null,null,null,null,null,null,"Tipo de servicio sanitario","Inodoro conectado a red de saneamiento",712.59005899999943,1106.0120629999994,1176.2431620000011,1399.3282260000005,1678.9877260000017,745.08252699999946,1034.4912190000002,1135.0351550000009,1348.1491080000005,1558.7048270000025,17.098865000000004,72.629483999999991,64.97815300000002,64.255836999999985,32.736060999999999,2681.8709679999997,3139.5918680000023,251.69839999999988]
[null,"Inodoro conectado a fosa séptica o pozo impermeable",60.174328696364142,48.354100171992329,45.383028270745569,33.4583264378103,21.396116111526652,55.577266292104632,46.891865443985608,41.666573356357929,29.777207459919069,19.693628653759564,80.917992689291623,63.545801592785033,65.604162380960062,67.502632743036656,83.224338766133954,38.269832288883329,39.087366068567178,72.149727170858171,null,null,null,null,null,null,null,null,null,null,null,null,null,null,null,null,null,null,null,null,null,null,null,null,null,null,null,null,null,null,null,null,null,"Inodoro conectado a fosa séptica o pozo impermeable",1294.4140620000005,1039.9318430000008,981.86949000000004,716.46294899999975,460.25404100000003,1087.9096249999989,916.63806999999986,814.596452,582.50972899999999,385.10081699999995,157.65614299999993,127.64472300000003,123.93468500000003,133.470448,163.47169299999996,1666.157752999999,2120.5969399999976,706.17769200000032]
[null,"Inodoro o taza turca (letrina) conectado/a a pozo permeable (perdedor)",0.5281050260612451,0.1466299813914628,0.21545050019086803,0,1.000348553501342E-2,0.25917009654140943,0.10744252252047287,0.23842570298670793,0,0,3.7673795413748947,0,0,0,0.10955237713069568,4.5646304336679572E-2,0.18151081264201624,0.77192429874019775,null,null,null,null,null,null,null,null,null,null,null,null,null,null,null,null,null,null,null,null,null,null,null,null,null,null,null,null,null,null,null,null,null,"Inodoro o taza turca (letrina) conectado/a a pozo permeable (perdedor)",11.360102999999999,3.153511,4.661308,0,0.21518599999999999,5.0731830000000002,2.1002770000000002,4.661308,0,0,7.3401540000000001,0,0,0,0.21518599999999999,1.9873080000000001,9.8474599999999999,7.5553400000000002]
[null,"Baldeo a otra parte",2.3994481620283845,0,0,0.56222907578308412,0,2.6368031093290174,0,0,0.61543700666556922,0,0,0,0,0,0,0,1.173286898581376,0,null,null,null,null,null,null,null,null,null,null,null,null,null,null,null,null,null,null,null,null,null,null,null,null,null,null,null,null,null,null,null,null,null,"Baldeo a otra parte",51.614691999999998,0,0,12.039344,0,51.614691999999998,0,0,12.039344,0,0,0,0,0,0,0,63.654035999999998,0]
[null,"Balde",0.60569764111049462,0,0,0,0,0.38695468516036158,0,0,0,0,2.7996442169619988,0,0,0,0,3.3060557425596548E-2,0.1130849673313645,0.55730038071851062,null,null,null,null,null,null,null,null,null,null,null,null,null,null,null,null,null,null,null,null,null,null,null,null,null,null,null,null,null,null,null,null,null,"Balde",13.029203000000001,0,0,0,0,7.5745310000000003,0,0,0,0,5.4546720000000004,0,0,0,0,1.4393609999999999,6.1351700000000005,5.4546720000000004]
[null,"No hay instalación sanitaria, va al monte, campo",2.3321283052850204,3.821879580714993E-2,3.4339828695251422E-2,0,0,2.5250028588143172,4.2048275556432695E-2,3.8001758129385284E-2,0,0,0.37998255452445079,0,0,0,0,3.4826683075498813E-2,0.91193327012341097,7.5639762016854545E-2,null,null,null,null,null,null,null,null,null,null,null,null,null,null,null,null,null,null,null,null,null,null,null,null,null,null,null,null,null,null,null,null,null,"No hay instalación sanitaria, va al monte, campo",50.16657,0.82195600000000002,0.74294800000000005,0,0,49.426232999999996,0.82195600000000002,0.74294800000000005,0,0,0.74033700000000002,0,0,0,0,1.5162529999999999,49.474883999999996,0.74033700000000002]
[null,"Otro",0.73576463877030773,3.4394154282400287E-2,0,0,0,0.47422294174741064,3.7840409313112652E-2,0,0,0,3.358902542456156,0,0,0,0,1.6973521309284114E-2,0.17111587335485834,0.66862698280229282,null,null,null,null,null,null,null,null,null,null,null,null,null,null,null,null,null,null,null,null,null,null,null,null,null,null,null,null,null,null,null,null,null,"Otro",15.827082999999998,0.73970100000000005,0,0,0,9.2827829999999985,0.73970100000000005,0,0,0,6.5442999999999998,0,0,0,0,0.73897800000000002,9.2835059999999991,6.5442999999999998]
[null,"Missing",9.7856788118824742E-2,0,0,0.63177976138821512,0.54173281663586781,7.7078176549147531E-2,0,0,0.69156979240017658,0.59593530278591111,0,0.29681820709227663,0,0,0,0,0.4919700845991774,6.091541947746635E-2,null,null,null,null,null,null,null,null,null,null,null,null,null,null,null,null,null,null,null,null,null,null,null,null,null,null,null,null,null,null,null,null,null,"Missing",2.1050040000000001,0,0,13.528673999999999,11.653269999999999,1.5087840000000001,0,0,13.528673999999999,11.653269999999999,0,0.59621999999999997,0,0,0,0,26.690727999999993,0.59621999999999997]
[null,null,null,null,null,null,null,null,null,null,null,null,null,null,null,null,null,null,null,null,null,null,null,null,null,null,null,null,null,null,null,null,null,null,null,null,null,null,null,null,null,null,null,null,null,null,null,null,null,null,null,null,null,"Total",2151.1067759999983,2150.6590739999961,2163.5169079999991,2141.3591929999984,2151.1102230000006,1957.4723579999986,1954.7912229999984,1955.0358629999994,1956.2268549999992,1955.4589140000016,194.83447099999992,200.87042699999989,188.91283799999999,197.72628500000008,196.4229399999999,4353.7106209999956,5425.2745919999834,978.76696100000072]
[]
[]
[]
[]
[]
[]
[]
[]
[]
[]
[]
[]
[]
[]
[]
[]
[]
[]
[]
[]
[]
[]
[]
[]
[]
[]
[]
[]
[]
[]
[]
[]
[]
[]
[]
[]
[]
[]
[]
[]
[]
[]
[]
[]
[]
[]
[{"$f":"A1026","v":"Uruguay"}]
[{"$f":"A1034","v":"2013"}]
["Access to hygiene facilities "]
[" by wealth quintile and sub-national region"]
["Notes:"]
["WHO/UNICEF JMP customised wealth index excludes water,"]
[" sanitation and hygiene assets."]
["Survey used for analysis:",{"$f":"A1025","v":"MICS13"}]
[]
[]
[]
[]
["Access to handwashing",null,"NATIONAL wealth index quintile",null,null,null,null,"URBAN wealth index quintile",null,null,null,null,"RURAL wealth index quintile",null,null,null,null,"SUB-REGIONS:",null,null,null,null,null,null,null,null,null,null,null,null,null,null,null,null,null,null,null,null,null,null,null,null,null,null,null,null,null,null,null,null,null,null,"Raw numbers of respondents:","Access to handwashing","NATIONAL wealth index quintile",null,null,null,null,"URBAN wealth index quintile",null,null,null,null,"RURAL wealth index quintile",null,null,null,null,"SUB-REGIONS:"]
["Weighted percentage (used in graphs)",null,"Poorest","Poor","Middle","Rich","Richest","Poorest","Poor","Middle","Rich","Richest","Poorest","Poor","Middle","Rich","Richest","Más de 5 mil habitantes","Montevideo y Área Metropolitana","Rurales y menores de 5 mil habitantes",null,null,null,null,null,null,null,null,null,null,null,null,null,null,null,null,null,null,null,null,null,null,null,null,null,null,null,null,null,null,null,null,"Hygiene data, raw numbers (weighted)",null,"Poorest","Poor","Middle","Rich","Richest","Poorest","Poor","Middle","Rich","Richest","Poorest","Poor","Middle","Rich","Richest","Más de 5 mil habitantes","Montevideo y Área Metropolitana","Rurales y menores de 5 mil habitantes"]
["Hygiene ladder","Basic","N/A","N/A","N/A","N/A","N/A","N/A","N/A","N/A","N/A","N/A","N/A","N/A","N/A","N/A","N/A","N/A","N/A","N/A",null,null,null,null,null,null,null,null,null,null,null,null,null,null,null,null,null,null,null,null,null,null,null,null,null,null,null,null,null,null,null,null,"Hygiene ladder","Basic","N/A","N/A","N/A","N/A","N/A","N/A","N/A","N/A","N/A","N/A","N/A","N/A","N/A","N/A","N/A","N/A","N/A","N/A"]
[null,"Limited","N/A","N/A","N/A","N/A","N/A","N/A","N/A","N/A","N/A","N/A","N/A","N/A","N/A","N/A","N/A","N/A","N/A","N/A",null,null,null,null,null,null,null,null,null,null,null,null,null,null,null,null,null,null,null,null,null,null,null,null,null,null,null,null,null,null,null,null,null,"Limited","N/A","N/A","N/A","N/A","N/A","N/A","N/A","N/A","N/A","N/A","N/A","N/A","N/A","N/A","N/A","N/A","N/A","N/A"]
[null,"No facility","N/A","N/A","N/A","N/A","N/A","N/A","N/A","N/A","N/A","N/A","N/A","N/A","N/A","N/A","N/A","N/A","N/A","N/A",null,null,null,null,null,null,null,null,null,null,null,null,null,null,null,null,null,null,null,null,null,null,null,null,null,null,null,null,null,null,null,null,null,"No facility","N/A","N/A","N/A","N/A","N/A","N/A","N/A","N/A","N/A","N/A","N/A","N/A","N/A","N/A","N/A","N/A","N/A","N/A"]
[null,null,null,null,null,null,null,null,null,null,null,null,null,null,null,null,null,null,null,null,null,null,null,null,null,null,null,null,null,null,null,null,null,null,null,null,null,null,null,null,null,null,null,null,null,null,null,null,null,null,null,null,"Observed handwashing place","Fixed","N/A","N/A","N/A","N/A","N/A","N/A","N/A","N/A","N/A","N/A","N/A","N/A","N/A","N/A","N/A","N/A","N/A","N/A"]
[null,null,null,null,null,null,null,null,null,null,null,null,null,null,null,null,null,null,null,null,null,null,null,null,null,null,null,null,null,null,null,null,null,null,null,null,null,null,null,null,null,null,null,null,null,null,null,null,null,null,null,null,null,"Mobile","N/A","N/A","N/A","N/A","N/A","N/A","N/A","N/A","N/A","N/A","N/A","N/A","N/A","N/A","N/A","N/A","N/A","N/A"]
[null,null,null,null,null,null,null,null,null,null,null,null,null,null,null,null,null,null,null,null,null,null,null,null,null,null,null,null,null,null,null,null,null,null,null,null,null,null,null,null,null,null,null,null,null,null,null,null,null,null,null,null,"Water / Soap","Water and soap","N/A","N/A","N/A","N/A","N/A","N/A","N/A","N/A","N/A","N/A","N/A","N/A","N/A","N/A","N/A","N/A","N/A","N/A"]
[null,null,null,null,null,null,null,null,null,null,null,null,null,null,null,null,null,null,null,null,null,null,null,null,null,null,null,null,null,null,null,null,null,null,null,null,null,null,null,null,null,null,null,null,null,null,null,null,null,null,null,null,null,"Water only","N/A","N/A","N/A","N/A","N/A","N/A","N/A","N/A","N/A","N/A","N/A","N/A","N/A","N/A","N/A","N/A","N/A","N/A"]
[null,null,null,null,null,null,null,null,null,null,null,null,null,null,null,null,null,null,null,null,null,null,null,null,null,null,null,null,null,null,null,null,null,null,null,null,null,null,null,null,null,null,null,null,null,null,null,null,null,null,null,null,null,"Soap only","N/A","N/A","N/A","N/A","N/A","N/A","N/A","N/A","N/A","N/A","N/A","N/A","N/A","N/A","N/A","N/A","N/A","N/A"]
[null,null,null,null,null,null,null,null,null,null,null,null,null,null,null,null,null,null,null,null,null,null,null,null,null,null,null,null,null,null,null,null,null,null,null,null,null,null,null,null,null,null,null,null,null,null,null,null,null,null,null,null,null,"Neither","N/A","N/A","N/A","N/A","N/A","N/A","N/A","N/A","N/A","N/A","N/A","N/A","N/A","N/A","N/A","N/A","N/A","N/A"]
[]
[]
[]
[]
[]
[]
[]
[]
[]
[]
[]
[]
[]
[]
[]
[]
[]
[]
[]
[]
[]
[]
[]
[]
[]
[]
[]
[]
[null,null,null,null,null,null,null,null,null,null,null,null,null,null,null,null,null,null,null,null,null,null,null,null,null,null,null,null,null,null,null,null,null,null,null,null,null,null,null,null,null,null,null,null,null,null,null,null,null,null,null,null,"Raw numbers of respondents:","Menstrual health and hygiene","NATIONAL wealth index quintile",null,null,null,null,"URBAN wealth index quintile",null,null,null,null,"RURAL wealth index quintile",null,null,null,null,"SUB-REGIONS:"]
[null,null,null,null,null,null,null,null,null,null,null,null,null,null,null,null,null,null,null,null,null,null,null,null,null,null,null,null,null,null,null,null,null,null,null,null,null,null,null,null,null,null,null,null,null,null,null,null,null,null,null,null,"MHH data, raw numbers (weighted)",null,"Poorest","Poor","Middle","Rich","Richest","Poorest","Poor","Middle","Rich","Richest","Poorest","Poor","Middle","Rich","Richest","Más de 5 mil habitantes","Montevideo y Área Metropolitana","Rurales y menores de 5 mil habitantes"]
[null,null,null,null,null,null,null,null,null,null,null,null,null,null,null,null,null,null,null,null,null,null,null,null,null,null,null,null,null,null,null,null,null,null,null,null,null,null,null,null,null,null,null,null,null,null,null,null,null,null,null,null,"Private place to wash and change","Yes","N/A","N/A","N/A","N/A","N/A","N/A","N/A","N/A","N/A","N/A","N/A","N/A","N/A","N/A","N/A","N/A","N/A","N/A"]
[null,null,null,null,null,null,null,null,null,null,null,null,null,null,null,null,null,null,null,null,null,null,null,null,null,null,null,null,null,null,null,null,null,null,null,null,null,null,null,null,null,null,null,null,null,null,null,null,null,null,null,null,null,"No","N/A","N/A","N/A","N/A","N/A","N/A","N/A","N/A","N/A","N/A","N/A","N/A","N/A","N/A","N/A","N/A","N/A","N/A"]
[null,null,null,null,null,null,null,null,null,null,null,null,null,null,null,null,null,null,null,null,null,null,null,null,null,null,null,null,null,null,null,null,null,null,null,null,null,null,null,null,null,null,null,null,null,null,null,null,null,null,null,null,null,"DK/not sure/missing","N/A","N/A","N/A","N/A","N/A","N/A","N/A","N/A","N/A","N/A","N/A","N/A","N/A","N/A","N/A","N/A","N/A","N/A"]
[null,null,null,null,null,null,null,null,null,null,null,null,null,null,null,null,null,null,null,null,null,null,null,null,null,null,null,null,null,null,null,null,null,null,null,null,null,null,null,null,null,null,null,null,null,null,null,null,null,null,null,null,"Use of menstrual materials","Materials reusable","N/A","N/A","N/A","N/A","N/A","N/A","N/A","N/A","N/A","N/A","N/A","N/A","N/A","N/A","N/A","N/A","N/A","N/A"]
[null,null,null,null,null,null,null,null,null,null,null,null,null,null,null,null,null,null,null,null,null,null,null,null,null,null,null,null,null,null,null,null,null,null,null,null,null,null,null,null,null,null,null,null,null,null,null,null,null,null,null,null,null,"Materials not reusable","N/A","N/A","N/A","N/A","N/A","N/A","N/A","N/A","N/A","N/A","N/A","N/A","N/A","N/A","N/A","N/A","N/A","N/A"]
[null,null,null,null,null,null,null,null,null,null,null,null,null,null,null,null,null,null,null,null,null,null,null,null,null,null,null,null,null,null,null,null,null,null,null,null,null,null,null,null,null,null,null,null,null,null,null,null,null,null,null,null,null,"No materials used","N/A","N/A","N/A","N/A","N/A","N/A","N/A","N/A","N/A","N/A","N/A","N/A","N/A","N/A","N/A","N/A","N/A","N/A"]
[null,null,null,null,null,null,null,null,null,null,null,null,null,null,null,null,null,null,null,null,null,null,null,null,null,null,null,null,null,null,null,null,null,null,null,null,null,null,null,null,null,null,null,null,null,null,null,null,null,null,null,null,null,"DK/not sure/missing","N/A","N/A","N/A","N/A","N/A","N/A","N/A","N/A","N/A","N/A","N/A","N/A","N/A","N/A","N/A","N/A","N/A","N/A"]
[null,null,null,null,null,null,null,null,null,null,null,null,null,null,null,null,null,null,null,null,null,null,null,null,null,null,null,null,null,null,null,null,null,null,null,null,null,null,null,null,null,null,null,null,null,null,null,null,null,null,null,null,"Use of menstrual materials with private place to wash and change","Materials reusable","N/A","N/A","N/A","N/A","N/A","N/A","N/A","N/A","N/A","N/A","N/A","N/A","N/A","N/A","N/A","N/A","N/A","N/A"]
[null,null,null,null,null,null,null,null,null,null,null,null,null,null,null,null,null,null,null,null,null,null,null,null,null,null,null,null,null,null,null,null,null,null,null,null,null,null,null,null,null,null,null,null,null,null,null,null,null,null,null,null,null,"Materials not reusable","N/A","N/A","N/A","N/A","N/A","N/A","N/A","N/A","N/A","N/A","N/A","N/A","N/A","N/A","N/A","N/A","N/A","N/A"]
[null,null,null,null,null,null,null,null,null,null,null,null,null,null,null,null,null,null,null,null,null,null,null,null,null,null,null,null,null,null,null,null,null,null,null,null,null,null,null,null,null,null,null,null,null,null,null,null,null,null,null,null,null,"No materials used","N/A","N/A","N/A","N/A","N/A","N/A","N/A","N/A","N/A","N/A","N/A","N/A","N/A","N/A","N/A","N/A","N/A","N/A"]
[null,null,null,null,null,null,null,null,null,null,null,null,null,null,null,null,null,null,null,null,null,null,null,null,null,null,null,null,null,null,null,null,null,null,null,null,null,null,null,null,null,null,null,null,null,null,null,null,null,null,null,null,"Awareness of menstruation before menarche","Yes","N/A","N/A","N/A","N/A","N/A","N/A","N/A","N/A","N/A","N/A","N/A","N/A","N/A","N/A","N/A","N/A","N/A","N/A"]
[null,null,null,null,null,null,null,null,null,null,null,null,null,null,null,null,null,null,null,null,null,null,null,null,null,null,null,null,null,null,null,null,null,null,null,null,null,null,null,null,null,null,null,null,null,null,null,null,null,null,null,null,null,"No","N/A","N/A","N/A","N/A","N/A","N/A","N/A","N/A","N/A","N/A","N/A","N/A","N/A","N/A","N/A","N/A","N/A","N/A"]
[null,null,null,null,null,null,null,null,null,null,null,null,null,null,null,null,null,null,null,null,null,null,null,null,null,null,null,null,null,null,null,null,null,null,null,null,null,null,null,null,null,null,null,null,null,null,null,null,null,null,null,null,null,"DK/not sure/missing","N/A","N/A","N/A","N/A","N/A","N/A","N/A","N/A","N/A","N/A","N/A","N/A","N/A","N/A","N/A","N/A","N/A","N/A"]
[null,null,null,null,null,null,null,null,null,null,null,null,null,null,null,null,null,null,null,null,null,null,null,null,null,null,null,null,null,null,null,null,null,null,null,null,null,null,null,null,null,null,null,null,null,null,null,null,null,null,null,null,"Participation in (all) activities during menstruation","Yes","N/A","N/A","N/A","N/A","N/A","N/A","N/A","N/A","N/A","N/A","N/A","N/A","N/A","N/A","N/A","N/A","N/A","N/A"]
[null,null,null,null,null,null,null,null,null,null,null,null,null,null,null,null,null,null,null,null,null,null,null,null,null,null,null,null,null,null,null,null,null,null,null,null,null,null,null,null,null,null,null,null,null,null,null,null,null,null,null,null,null,"No","N/A","N/A","N/A","N/A","N/A","N/A","N/A","N/A","N/A","N/A","N/A","N/A","N/A","N/A","N/A","N/A","N/A","N/A"]
[null,null,null,null,null,null,null,null,null,null,null,null,null,null,null,null,null,null,null,null,null,null,null,null,null,null,null,null,null,null,null,null,null,null,null,null,null,null,null,null,null,null,null,null,null,null,null,null,null,null,null,null,null,"DK/not sure/missing/no such activity","N/A","N/A","N/A","N/A","N/A","N/A","N/A","N/A","N/A","N/A","N/A","N/A","N/A","N/A","N/A","N/A","N/A","N/A"]
[null,null,null,null,null,null,null,null,null,null,null,null,null,null,null,null,null,null,null,null,null,null,null,null,null,null,null,null,null,null,null,null,null,null,null,null,null,null,null,null,null,null,null,null,null,null,null,null,null,null,null,null,"Participation in specific activities during menstruation","Did not go to school (amongst those usually attending school)","N/A","N/A","N/A","N/A","N/A","N/A","N/A","N/A","N/A","N/A","N/A","N/A","N/A","N/A","N/A","N/A","N/A","N/A"]
[null,null,null,null,null,null,null,null,null,null,null,null,null,null,null,null,null,null,null,null,null,null,null,null,null,null,null,null,null,null,null,null,null,null,null,null,null,null,null,null,null,null,null,null,null,null,null,null,null,null,null,null,null,"Did not go to work (amongst those who usually work)","N/A","N/A","N/A","N/A","N/A","N/A","N/A","N/A","N/A","N/A","N/A","N/A","N/A","N/A","N/A","N/A","N/A","N/A"]
[null,null,null,null,null,null,null,null,null,null,null,null,null,null,null,null,null,null,null,null,null,null,null,null,null,null,null,null,null,null,null,null,null,null,null,null,null,null,null,null,null,null,null,null,null,null,null,null,null,null,null,null,null,"Did not participate in social activities","N/A","N/A","N/A","N/A","N/A","N/A","N/A","N/A","N/A","N/A","N/A","N/A","N/A","N/A","N/A","N/A","N/A","N/A"]
[null,null,null,null,null,null,null,null,null,null,null,null,null,null,null,null,null,null,null,null,null,null,null,null,null,null,null,null,null,null,null,null,null,null,null,null,null,null,null,null,null,null,null,null,null,null,null,null,null,null,null,null,null,"Did not cook food","N/A","N/A","N/A","N/A","N/A","N/A","N/A","N/A","N/A","N/A","N/A","N/A","N/A","N/A","N/A","N/A","N/A","N/A"]
[null,null,null,null,null,null,null,null,null,null,null,null,null,null,null,null,null,null,null,null,null,null,null,null,null,null,null,null,null,null,null,null,null,null,null,null,null,null,null,null,null,null,null,null,null,null,null,null,null,null,null,null,null,"Did not eat with others","N/A","N/A","N/A","N/A","N/A","N/A","N/A","N/A","N/A","N/A","N/A","N/A","N/A","N/A","N/A","N/A","N/A","N/A"]
[null,null,null,null,null,null,null,null,null,null,null,null,null,null,null,null,null,null,null,null,null,null,null,null,null,null,null,null,null,null,null,null,null,null,null,null,null,null,null,null,null,null,null,null,null,null,null,null,null,null,null,null,null,"Did not bathe in regular place","N/A","N/A","N/A","N/A","N/A","N/A","N/A","N/A","N/A","N/A","N/A","N/A","N/A","N/A","N/A","N/A","N/A","N/A"]
[null,null,null,null,null,null,null,null,null,null,null,null,null,null,null,null,null,null,null,null,null,null,null,null,null,null,null,null,null,null,null,null,null,null,null,null,null,null,null,null,null,null,null,null,null,null,null,null,null,null,null,null,null,"Did not participate in other activities","N/A","N/A","N/A","N/A","N/A","N/A","N/A","N/A","N/A","N/A","N/A","N/A","N/A","N/A","N/A","N/A","N/A","N/A"]
[null,null,null,null,null,null,null,null,null,null,null,null,null,null,null,null,null,null,null,null,null,null,null,null,null,null,null,null,null,null,null,null,null,null,null,null,null,null,null,null,null,null,null,null,null,null,null,null,null,null,null,null,null,"DK/not sure/missing/no such activity","N/A","N/A","N/A","N/A","N/A","N/A","N/A","N/A","N/A","N/A","N/A","N/A","N/A","N/A","N/A","N/A","N/A","N/A"]
[]
[]
[]
[]
[]
[]
[]
[]
[]
[]
[]
[]
[]
[]
[]
[]
[]
[]
[]
[]
[]
[]
[]
[]
[]
[]
[]
[]
[]
[]
[]
[]
[]
[]
[]
[]
[]
[]
[]
[]
[]
[]
[]
[]
[]
[]
[]
[]
[]
[]
[]
[]
[]
[]
[null,null,null,null,null,null,null,null,null,null,null,null,null,null,null,null,null,null,null,null,null,null,null,null,null,null,null,null,null,null,null,null,null,null,null,null,null,null,null,null,null,null,null,null,null,null,null,null,null,null,null,null,"Raw numbers of respondents:","Basic water, sanitation and hygiene","NATIONAL wealth index quintile",null,null,null,null,"URBAN wealth index quintile",null,null,null,null,"RURAL wealth index quintile",null,null,null,null,"SUB-REGIONS:"]
[null,null,null,null,null,null,null,null,null,null,null,null,null,null,null,null,null,null,null,null,null,null,null,null,null,null,null,null,null,null,null,null,null,null,null,null,null,null,null,null,null,null,null,null,null,null,null,null,null,null,null,null,"WatSan data, raw numbers (weighted)",null,"Poorest","Poor","Middle","Rich","Richest","Poorest","Poor","Middle","Rich","Richest","Poorest","Poor","Middle","Rich","Richest","Más de 5 mil habitantes","Montevideo y Área Metropolitana","Rurales y menores de 5 mil habitantes"]
[null,null,null,null,null,null,null,null,null,null,null,null,null,null,null,null,null,null,null,null,null,null,null,null,null,null,null,null,null,null,null,null,null,null,null,null,null,null,null,null,null,null,null,null,null,null,null,null,null,null,null,null,"Use of Basic Water Sanitation and Hygiene","Yes","N/A","N/A","N/A","N/A","N/A","N/A","N/A","N/A","N/A","N/A","N/A","N/A","N/A","N/A","N/A","N/A","N/A","N/A"]
[null,null,null,null,null,null,null,null,null,null,null,null,null,null,null,null,null,null,null,null,null,null,null,null,null,null,null,null,null,null,null,null,null,null,null,null,null,null,null,null,null,null,null,null,null,null,null,null,null,null,null,null,null,"No","N/A","N/A","N/A","N/A","N/A","N/A","N/A","N/A","N/A","N/A","N/A","N/A","N/A","N/A","N/A","N/A","N/A","N/A"]
[null,null,null,null,null,null,null,null,null,null,null,null,null,null,null,null,null,null,null,null,null,null,null,null,null,null,null,null,null,null,null,null,null,null,null,null,null,null,null,null,null,null,null,null,null,null,null,null,null,null,null,null,"Use of Basic Water and Sanitation","Yes","N/A","N/A","N/A","N/A","N/A","N/A","N/A","N/A","N/A","N/A","N/A","N/A","N/A","N/A","N/A","N/A","N/A","N/A"]
[null,null,null,null,null,null,null,null,null,null,null,null,null,null,null,null,null,null,null,null,null,null,null,null,null,null,null,null,null,null,null,null,null,null,null,null,null,null,null,null,null,null,null,null,null,null,null,null,null,null,null,null,null,"No","N/A","N/A","N/A","N/A","N/A","N/A","N/A","N/A","N/A","N/A","N/A","N/A","N/A","N/A","N/A","N/A","N/A","N/A"]
[null,null,null,null,null,null,null,null,null,null,null,null,null,null,null,null,null,null,null,null,null,null,null,null,null,null,null,null,null,null,null,null,null,null,null,null,null,null,null,null,null,null,null,null,null,null,null,null,null,null,null,null,"Use of Basic Water and Hygiene","Yes","N/A","N/A","N/A","N/A","N/A","N/A","N/A","N/A","N/A","N/A","N/A","N/A","N/A","N/A","N/A","N/A","N/A","N/A"]
[null,null,null,null,null,null,null,null,null,null,null,null,null,null,null,null,null,null,null,null,null,null,null,null,null,null,null,null,null,null,null,null,null,null,null,null,null,null,null,null,null,null,null,null,null,null,null,null,null,null,null,null,null,"No","N/A","N/A","N/A","N/A","N/A","N/A","N/A","N/A","N/A","N/A","N/A","N/A","N/A","N/A","N/A","N/A","N/A","N/A"]
[null,null,null,null,null,null,null,null,null,null,null,null,null,null,null,null,null,null,null,null,null,null,null,null,null,null,null,null,null,null,null,null,null,null,null,null,null,null,null,null,null,null,null,null,null,null,null,null,null,null,null,null,"Use of Basic Sanitation and Hygiene","Yes","N/A","N/A","N/A","N/A","N/A","N/A","N/A","N/A","N/A","N/A","N/A","N/A","N/A","N/A","N/A","N/A","N/A","N/A"]
[null,null,null,null,null,null,null,null,null,null,null,null,null,null,null,null,null,null,null,null,null,null,null,null,null,null,null,null,null,null,null,null,null,null,null,null,null,null,null,null,null,null,null,null,null,null,null,null,null,null,null,null,null,"No","N/A","N/A","N/A","N/A","N/A","N/A","N/A","N/A","N/A","N/A","N/A","N/A","N/A","N/A","N/A","N/A","N/A","N/A"]
[null,null,null,null,null,null,null,null,null,null,null,null,null,null,null,null,null,null,null,null,null,null,null,null,null,null,null,null,null,null,null,null,null,null,null,null,null,null,null,null,null,null,null,null,null,null,null,null,null,null,null,null,"Use of Basic Water","Yes","N/A","N/A","N/A","N/A","N/A","N/A","N/A","N/A","N/A","N/A","N/A","N/A","N/A","N/A","N/A","N/A","N/A","N/A"]
[null,null,null,null,null,null,null,null,null,null,null,null,null,null,null,null,null,null,null,null,null,null,null,null,null,null,null,null,null,null,null,null,null,null,null,null,null,null,null,null,null,null,null,null,null,null,null,null,null,null,null,null,null,"No","N/A","N/A","N/A","N/A","N/A","N/A","N/A","N/A","N/A","N/A","N/A","N/A","N/A","N/A","N/A","N/A","N/A","N/A"]
[null,null,null,null,null,null,null,null,null,null,null,null,null,null,null,null,null,null,null,null,null,null,null,null,null,null,null,null,null,null,null,null,null,null,null,null,null,null,null,null,null,null,null,null,null,null,null,null,null,null,null,null,"Use of Basic Sanitation","Yes","N/A","N/A","N/A","N/A","N/A","N/A","N/A","N/A","N/A","N/A","N/A","N/A","N/A","N/A","N/A","N/A","N/A","N/A"]
[null,null,null,null,null,null,null,null,null,null,null,null,null,null,null,null,null,null,null,null,null,null,null,null,null,null,null,null,null,null,null,null,null,null,null,null,null,null,null,null,null,null,null,null,null,null,null,null,null,null,null,null,null,"No","N/A","N/A","N/A","N/A","N/A","N/A","N/A","N/A","N/A","N/A","N/A","N/A","N/A","N/A","N/A","N/A","N/A","N/A"]
[null,null,null,null,null,null,null,null,null,null,null,null,null,null,null,null,null,null,null,null,null,null,null,null,null,null,null,null,null,null,null,null,null,null,null,null,null,null,null,null,null,null,null,null,null,null,null,null,null,null,null,null,"Access to Basic Hygiene","Yes","N/A","N/A","N/A","N/A","N/A","N/A","N/A","N/A","N/A","N/A","N/A","N/A","N/A","N/A","N/A","N/A","N/A","N/A"]
[null,null,null,null,null,null,null,null,null,null,null,null,null,null,null,null,null,null,null,null,null,null,null,null,null,null,null,null,null,null,null,null,null,null,null,null,null,null,null,null,null,null,null,null,null,null,null,null,null,null,null,null,null,"No","N/A","N/A","N/A","N/A","N/A","N/A","N/A","N/A","N/A","N/A","N/A","N/A","N/A","N/A","N/A","N/A","N/A","N/A"]
[]
[]
[]
[]
[]
[]
[]
[]
[]
[]
[]
[]
[]
[]
[]
[]
[]
[]
[]
[]
[]
[]
[]
[]
[]
[]
[]
[]
[]
[]
[]
[]
[]
[]
[]
[]
[]
[]
[]
[]
[]
[]
[]
[]
[null,null,"INITIAL (national) Wealth Index",null,null,null,null,"URBAN Wealth Index",null,null,null,null,"RURAL Wealth Index"]
[null,null,"Component Matrix",null,null,null,null,"Component Matrix",null,null,null,null,"Component Matrix"]
[null,null,null,null,"Component",null,null,null,null,"Component",null,null,null,null,"Component"]
[null,"Note:\n\nThe INITIAL (national) Wealth Index is based on the first component of the Principal Component Analysis (PCA) which has been obtained at national level.\n\nThe final national-level (NATIONAL) Wealth Index is based on the URBAN and RURAL specific wealth indexes. Regression procedures are used to establish the relationships between the two sets of scores (urban and rural) and the initial (national) wealth factors.\nThis allows best use of the available information for each area and a better precision of the FINAL (NATIONAL) Wealth Index.\n\nFor dependency reasons, all WASH variables (contained in the generic MICS and DHS scripts) have been excluded from the sets of asset variables used in the PCAs.\n\nThe PCA can extracts as many components as there are asset variables in the input. Only the first of the components is used to represent the Wealth Index. \n\nThe scores represent the weights of the asset variables on the Wealth Index (correlations between the variables and the component).\n\nThe communalities are the proportion of each variable's variance that can be explained by the component.\n\nProportion of explained variance is the part of the model's total variance that is explained by the component.\n\nFor more information on the procedure used:\n\nThe DHS Wealth Index, DHS Comparative Reports No. 6, Shea Oscar Rutstein, Kiersten Johnson, ORC Macro International Inc., 2004.\n\nThe DHS Wealth Index: Approaches for Rural and Urban Areas, Shea O. Rutstein, ORC Macro International Inc., 2008.\n\nMICS Methodological Paper No. 4, Review of options for reporting water, sanitation and hygiene coverage by wealth quintile, UNICEF, 2016.",null,null,"1",null,null,null,null,"1",null,null,null,null,"1"]
[null,null,"Conexion a internet",null,0.68226569308594531,null,null,"Conexion a internet",null,0.68357846018264956,null,null,"Otro tipo de computadora",null,0.63626204359441019]
[null,null,"Otro tipo de computadora",null,0.6651295970364024,null,null,"Otro tipo de computadora",null,0.6607804276396898,null,null,"Horno Microondas",null,0.62580396239461922]
[null,null,"Horno Microondas",null,0.64544112221617067,null,null,"Horno Microondas",null,0.63783441805626107,null,null,"Calefon o termofon",null,0.61964372206228735]
[null,null,"Telephono fijo",null,0.63156482671953351,null,null,"Telephono fijo",null,0.63776896970444641,null,null,"Conexion a internet",null,0.6060706110459837]
[null,null,"Calefon o termofon",null,0.58889809532731729,null,null,"Calefon o termofon",null,0.58192390329252319,null,null,"Lavarropa",null,0.59988224287517511]
[null,null,"Cement floor",null,-0.57016272483626684,null,null,"Automovil, Camioneta",null,0.56437720226497434,null,null,"Cement floor",null,-0.5982322357340274]
[null,null,"Equipo de aire acondicionado",null,0.54748879628282732,null,null,"Cement floor",null,-0.55815078917834127,null,null,"Ceramic tiles floor",null,0.57008941325065499]
[null,null,"Metal/tin roof",null,-0.53740669696814791,null,null,"Metal/tin roof",null,-0.55437752485233294,null,null,"Automovil, Camioneta",null,0.4980924610237818]
[null,null,"Automovil, Camioneta",null,0.53377321138276779,null,null,"Equipo de aire acondicionado",null,0.54554520716532495,null,null,"Reproductor de DVD",null,0.48651323368853083]
[null,null,"Lavarropa",null,0.53229827305325428,null,null,"Cement roof",null,0.51157890438660258,null,null,"Equipo de aire acondicionado",null,0.48273000569833313]
[null,null,"Cement roof",null,0.52211314422318811,null,null,"Lavarropa",null,0.50902971475581482,null,null,"Telephono fijo",null,0.47580126711178278]
[null,null,"Reproductor de DVD",null,0.46753232552216906,null,null,"Household owns bank account",null,0.476035750964802,null,null,"Refrigetaror",null,0.4253124455032215]
[null,null,"Household owns bank account",null,0.45767298451148947,null,null,"Reproductor de DVD",null,0.45500669880663558,null,null,"Conexion a TV por abonados",null,0.38666572524100146]
[null,null,"Conexion a TV por abonados",null,0.4253234970910002,null,null,"Conexion a TV por abonados",null,0.43669022529305673,null,null,"Household owns bank account",null,0.3436378274007259]
[null,null,"Reloj",null,0.38627186355475762,null,null,"Reloj",null,0.40757036909004329,null,null,"Wood fuel",null,-0.34227619629100348]
[null,null,"Persons per sleeping rooms",null,-0.34135816320986445,null,null,"Brick walls",null,0.38263169604917896,null,null,"Cement roof",null,0.32569204481958769]
[null,null,"Parquet/polished wood floor",null,0.33435498448282691,null,null,"Persons per sleeping rooms",null,-0.36859985989173349,null,null,"Electricity",null,0.32562050369042744]
[null,null,"Secadora de ropa",null,0.32969515661311738,null,null,"Cement blocks walls",null,-0.35866500340195101,null,null,"LPG fuel",null,0.31386214079009928]
[null,null,"Refrigetaror",null,0.31019424895335829,null,null,"Parquet/polished wood floor",null,0.34364508015100059,null,null,"Other dwelling arrangement",null,-0.29020410733525775]
[null,null,"Brick walls",null,0.30750676815675065,null,null,"Secadora de ropa",null,0.32605452246242894,null,null,"Television convencional",null,0.26058832085834016]
[null,null,"Cement blocks walls",null,-0.29810410514482566,null,null,"Lavavajilla",null,0.27005676041901017,null,null,"Owns dwelling",null,0.25452244152062348]
[null,null,"Other dwelling arrangement",null,-0.26575972758843797,null,null,"Refrigetaror",null,0.2672134057708328,null,null,"Bicicleta",null,0.23088773811943675]
[null,null,"Lavavajilla",null,0.2655121387818013,null,null,"Radio",null,0.25254262232884478,null,null,"Persons per sleeping rooms",null,-0.22708427538786513]
[null,null,"Ceramic tiles floor",null,0.25314520628799425,null,null,"Other dwelling arrangement",null,-0.23596399005250546,null,null,"Secadora de ropa",null,0.22235986664513485]
[null,null,"Radio",null,0.23355926517732198,null,null,"Ceramic tiles floor",null,0.20750348551121939,null,null,"Reloj",null,0.22030708713040284]
[null,null,"Celular",null,0.18866244640386701,null,null,"Celular",null,0.19799004133982429,null,null,"Thatch/palm leaf roof",null,-0.22010572308954876]
[null,null,"Owns dwelling",null,0.18460979296646773,null,null,"Computedora del plan ceibal",null,-0.18627899690175137,null,null,"Metal/tin roof",null,-0.21999743093261165]
[null,null,"Wood fuel",null,-0.17565593663715379,null,null,"Owns dwelling",null,0.16530969716620267,null,null,"Radio",null,0.19294578408964178]
[null,null,"Electricity",null,0.16422824102606218,null,null,"Television convencional",null,0.11974557711424805,null,null,"Motociclate",null,0.19259883358026167]
[null,null,"Television convencional",null,0.15426521127604326,null,null,"Bote con motor",null,0.1037572320647064,null,null,"Celular",null,0.18534070930485069]
[null,null,"Computedora del plan ceibal",null,-0.1432863249963568,null,null,"Bicicleta",null,9.8176666422434458E-2,null,null,"Computedora del plan ceibal",null,0.15042353813028939]
[null,null,"Thatch/palm leaf roof",null,-0.11483490787782455,null,null,"Wood fuel",null,-9.2357578199961488E-2,null,null,"Brick walls",null,0.14325439135503668]
[null,null,"Bicicleta",null,0.109800145689951,null,null,"Calentador instantanoe de agua",null,-8.9331543558231252E-2,null,null,"Lavavajilla",null,0.12553764450208593]
[null,null,"Bote con motor",null,9.6904010015774145E-2,null,null,"Electricity",null,8.1502960819730894E-2,null,null,"Cement blocks walls",null,-0.11990238586817772]
[null,null,"Calentador instantanoe de agua",null,-8.3361900299929945E-2,null,null,"Natural gas fuel",null,7.4017667654060579E-2,null,null,"Natural gas fuel",null,-9.2293299681982369E-2]
[null,null,"Motociclate",null,-8.3022393592355526E-2,null,null,"Motociclate",null,-7.1422431086121715E-2,null,null,"Wood roof",null,8.1263280314842243E-2]
[null,null,"Ceramic tiles roof",null,5.6076171907690743E-2,null,null,"Ceramic tiles roof",null,4.6859766764911166E-2,null,null,"Carpet floor",null,8.0700520149502075E-2]
[null,null,"Natural gas fuel",null,4.3886975264480488E-2,null,null,"Electricity fuel",null,-2.9391189932136127E-2,null,null,"Ceramic tiles roof",null,7.7121097859671542E-2]
[null,null,"LPG fuel",null,3.9185690300382645E-2,null,null,"Wood planks floor",null,2.9383311329405498E-2,null,null,"Bote con motor",null,7.2247710736645071E-2]
[null,null,"Wood planks floor",null,3.7434069840032419E-2,null,null,"Calamine/cement fibre roof",null,2.3030284233712849E-2,null,null,"Vinyl/asphalt strip floor",null,-6.5484960694620759E-2]
[null,null,"Carpet floor",null,3.1214131632171547E-2,null,null,"Cement walls",null,-2.1621830578409437E-2,null,null,"Parquet/polished wood floor",null,6.2224920972484284E-2]
[null,null,"Calamine/cement fibre roof",null,2.7276536523420474E-2,null,null,"Carpet floor",null,2.0098685558274102E-2,null,null,"Cement walls",null,-5.0362198463834128E-2]
[null,null,"Rents dwelling",null,2.652739528008248E-2,null,null,"LPG fuel",null,-1.8295991718014666E-2,null,null,"Calamine/cement fibre roof",null,3.9419491603630522E-2]
[null,null,"Wood roof",null,2.3661460836583072E-2,null,null,"Wood roof",null,1.7948390755027348E-2,null,null,"Calentador instantanoe de agua",null,-2.6441980210657353E-2]
[null,null,"Electricity fuel",null,-1.5321709942576638E-2,null,null,"Rents dwelling",null,1.29615868105091E-2,null,null,"Rents dwelling",null,1.1368197194910954E-2]
[null,null,"Cement walls",null,-4.1783323698538089E-3,null,null,"Thatch/palm leaf roof",null,-1.148906910096347E-2,null,null,"Electricity fuel",null,-7.4651617396485096E-3]
[null,null,"Vinyl/asphalt strip floor",null,1.8740446926576917E-3,null,null,"Vinyl/asphalt strip floor",null,1.3303367539765443E-3]
[]
[]
[null,null,null,null,null,null,null,null,null,null,null,null,"Communalities"]
[null,null,"Communalities",null,null,null,null,"Communalities",null,null,null,null,null,null,"Extraction"]
[null,null,null,null,"Extraction",null,null,null,null,"Extraction",null,null,"Persons per sleeping rooms",null,5.1567268128431772E-2]
[null,null,"Persons per sleeping rooms",null,0.11652539559001246,null,null,"Persons per sleeping rooms",null,0.13586585671220555,null,null,"Parquet/polished wood floor",null,3.8719407900319144E-3]
[null,null,"Wood planks floor",null,1.4013095847884248E-3,null,null,"Wood planks floor",null,8.6337898468076947E-4,null,null,"Vinyl/asphalt strip floor",null,4.2882800771760253E-3]
[null,null,"Parquet/polished wood floor",null,0.11179325564851142,null,null,"Parquet/polished wood floor",null,0.11809194111198762,null,null,"Ceramic tiles floor",null,0.32500193910047609]
[null,null,"Vinyl/asphalt strip floor",null,3.512043510078462E-6,null,null,"Vinyl/asphalt strip floor",null,1.7697958789808485E-6,null,null,"Cement floor",null,0.35788180787133295]
[null,null,"Ceramic tiles floor",null,6.4082495466591158E-2,null,null,"Ceramic tiles floor",null,4.3057696499304833E-2,null,null,"Carpet floor",null,6.5125739524001906E-3]
[null,null,"Cement floor",null,0.32508553279271651,null,null,"Cement floor",null,0.31153230346040517,null,null,"Thatch/palm leaf roof",null,4.8446529336773118E-2]
[null,null,"Carpet floor",null,9.7432201355053235E-4,null,null,"Carpet floor",null,4.0395716117037596E-4,null,null,"Metal/tin roof",null,4.8398869616949232E-2]
[null,null,"Thatch/palm leaf roof",null,1.3187056067308451E-2,null,null,"Thatch/palm leaf roof",null,1.3199870880671355E-4,null,null,"Wood roof",null,6.6037207275286272E-3]
[null,null,"Metal/tin roof",null,0.28880595794621478,null,null,"Metal/tin roof",null,0.30733444006139904,null,null,"Calamine/cement fibre roof",null,1.5538963182886972E-3]
[null,null,"Wood roof",null,5.5986472892115453E-4,null,null,"Wood roof",null,3.2214473069515115E-4,null,null,"Ceramic tiles roof",null,5.9476637350810348E-3]
[null,null,"Calamine/cement fibre roof",null,7.4400944471349109E-4,null,null,"Calamine/cement fibre roof",null,5.3039399188560261E-4,null,null,"Cement roof",null,0.10607530805876432]
[null,null,"Ceramic tiles roof",null,3.1445370558208846E-3,null,null,"Ceramic tiles roof",null,2.195837741261873E-3,null,null,"Cement walls",null,2.5363510341106167E-3]
[null,null,"Cement roof",null,0.27260213537062361,null,null,"Cement roof",null,0.26171297541339666,null,null,"Brick walls",null,2.0521820642502006E-2]
[null,null,"Cement walls",null,1.7458461392968148E-5,null,null,"Cement walls",null,4.6750355756144132E-4,null,null,"Cement blocks walls",null,1.4376582136881385E-2]
[null,null,"Brick walls",null,9.45604124622096E-2,null,null,"Brick walls",null,0.14640701482147128,null,null,"Electricity fuel",null,5.5728639799111964E-5]
[null,null,"Cement blocks walls",null,8.8866057504197266E-2,null,null,"Cement blocks walls",null,0.12864058466532152,null,null,"LPG fuel",null,9.8509443421344101E-2]
[null,null,"Electricity fuel",null,2.347547955644518E-4,null,null,"Electricity fuel",null,8.6384204562690002E-4,null,null,"Natural gas fuel",null,8.5180531661882067E-3]
[null,null,"LPG fuel",null,1.5355183243175026E-3,null,null,"LPG fuel",null,3.3474331294566128E-4,null,null,"Wood fuel",null,0.11715299454743754]
[null,null,"Natural gas fuel",null,1.9260665978651221E-3,null,null,"Natural gas fuel",null,5.478615124946966E-3,null,null,"Electricity",null,0.10602871242360767]
[null,null,"Wood fuel",null,3.0855008075875785E-2,null,null,"Wood fuel",null,8.5299222509620017E-3,null,null,"Radio",null,3.7228075597966662E-2]
[null,null,"Electricity",null,2.6970915150514373E-2,null,null,"Electricity",null,6.6427326223825892E-3,null,null,"Television convencional",null,6.7906272967769243E-2]
[null,null,"Radio",null,5.4549930350170604E-2,null,null,"Radio",null,6.3777776092729527E-2,null,null,"Telephono fijo",null,0.22638684578517806]
[null,null,"Television convencional",null,2.3797755410042264E-2,null,null,"Television convencional",null,1.4339003238424325E-2,null,null,"Refrigetaror",null,0.18089067629993077]
[null,null,"Telephono fijo",null,0.39887413034927438,null,null,"Telephono fijo",null,0.4067492587178711,null,null,"Calefon o termofon",null,0.38395834229120523]
[null,null,"Refrigetaror",null,9.6220472083738018E-2,null,null,"Refrigetaror",null,7.1403004223647745E-2,null,null,"Calentador instantanoe de agua",null,6.9917831746079513E-4]
[null,null,"Calefon o termofon",null,0.3468009666801421,null,null,"Calefon o termofon",null,0.33863542922320589,null,null,"Reproductor de DVD",null,0.23669512655407102]
[null,null,"Calentador instantanoe de agua",null,6.9492064216154599E-3,null,null,"Calentador instantanoe de agua",null,7.9801246744961672E-3,null,null,"Lavarropa",null,0.35985870531695058]
[null,null,"Reproductor de DVD",null,0.21858647540816745,null,null,"Reproductor de DVD",null,0.20703109595891239,null,null,"Secadora de ropa",null,4.9443910294442152E-2]
[null,null,"Lavarropa",null,0.28334145149547685,null,null,"Lavarropa",null,0.25911125050438621,null,null,"Lavavajilla",null,1.5759700187132106E-2]
[null,null,"Secadora de ropa",null,0.108698896294148,null,null,"Secadora de ropa",null,0.10631155161820258,null,null,"Horno Microondas",null,0.39163059934880601]
[null,null,"Lavavajilla",null,7.0496695840486512E-2,null,null,"Lavavajilla",null,7.293065384801066E-2,null,null,"Equipo de aire acondicionado",null,0.23302825840151273]
[null,null,"Horno Microondas",null,0.41659424224766978,null,null,"Horno Microondas",null,0.40683274485716919,null,null,"Computedora del plan ceibal",null,2.2627240823634626E-2]
[null,null,"Equipo de aire acondicionado",null,0.29974398205521918,null,null,"Equipo de aire acondicionado",null,0.2976195730610573,null,null,"Otro tipo de computadora",null,0.40482938811893515]
[null,null,"Computedora del plan ceibal",null,2.0530970930961581E-2,null,null,"Computedora del plan ceibal",null,3.4699864686722696E-2,null,null,"Conexion a internet",null,0.36732158557365208]
[null,null,"Otro tipo de computadora",null,0.44239738085380703,null,null,"Otro tipo de computadora",null,0.43663077355169133,null,null,"Conexion a TV por abonados",null,0.14951038307614964]
[null,null,"Conexion a internet",null,0.46548647596204534,null,null,"Conexion a internet",null,0.46727951122568223,null,null,"Reloj",null,4.8535212639882912E-2]
[null,null,"Conexion a TV por abonados",null,0.18090007717771805,null,null,"Conexion a TV por abonados",null,0.19069835286650064,null,null,"Celular",null,3.4351178525625171E-2]
[null,null,"Reloj",null,0.1492059525740653,null,null,"Reloj",null,0.16611360576019413,null,null,"Bicicleta",null,5.3309147613909605E-2]
[null,null,"Celular",null,3.559351868309199E-2,null,null,"Celular",null,3.920005646974533E-2,null,null,"Motociclate",null,3.7094310696477333E-2]
[null,null,"Bicicleta",null,1.2056071993534465E-2,null,null,"Bicicleta",null,9.6386578298219699E-3,null,null,"Automovil, Camioneta",null,0.24809609972872759]
[null,null,"Motociclate",null,6.8927178378039959E-3,null,null,"Motociclate",null,5.1011636622518052E-3,null,null,"Bote con motor",null,5.2197317066859398E-3]
[null,null,"Automovil, Camioneta",null,0.2849138411898729,null,null,"Automovil, Camioneta",null,0.31852162643643978,null,null,"Owns dwelling",null,6.47816732376192E-2]
[null,null,"Bote con motor",null,9.3903871571372564E-3,null,null,"Bote con motor",null,1.0765563205729337E-2,null,null,"Rents dwelling",null,1.2923590746238129E-4]
[null,null,"Owns dwelling",null,3.4080775659122077E-2,null,null,"Owns dwelling",null,2.7327295977181636E-2,null,null,"Other dwelling arrangement",null,8.4218423914253798E-2]
[null,null,"Rents dwelling",null,7.0370270034574229E-4,null,null,"Rents dwelling",null,1.6800273264636347E-4,null,null,"Household owns bank account",null,0.11808695642069109]
[null,null,"Other dwelling arrangement",null,7.0628232807880761E-2,null,null,"Other dwelling arrangement",null,5.5679004601498897E-2]
[null,null,"Household owns bank account",null,0.20946456075165407,null,null,"Household owns bank account",null,0.22661003619662298]
[null,null,null,null,null,null,null,null,null,null,null,null,"Total Variance Explained"]
[null,null,null,null,null,null,null,null,null,null,null,null,"Component",null,"Extraction Sums of Squared Loadings"]
[null,null,"Total Variance Explained",null,null,null,null,"Total Variance Explained",null,null,null,null,null,null,"Total","% of Variance","Cumulative %"]
[null,null,"Component",null,"Extraction Sums of Squared Loadings",null,null,"Component",null,"Extraction Sums of Squared Loadings",null,null,"1",null,5.1554457430712368,11.207490745807036,11.207490745807036]
[null,null,null,null,"Total","% of Variance","Cumulative %",null,null,"Total","% of Variance","Cumulative %"]
[null,null,"1",null,5.6907744460404102,12.108030736256193,12.108030736256193,"1",null,5.7205646339951395,12.171414114883275,12.171414114883275]
[null,null,null,null,null,null,null,null,null,null,null,null,"Component Score Coefficient Matrix"]
[null,null,null,null,null,null,null,null,null,null,null,null,null,null,"Component"]
[null,null,"Component Score Coefficient Matrix",null,null,null,null,"Component Score Coefficient Matrix",null,null,null,null,null,null,"1"]
[null,null,null,null,"Component",null,null,null,null,"Component",null,null,"Persons per sleeping rooms",null,-4.4047457136574375E-2]
[null,null,null,null,"1",null,null,null,null,"1",null,null,"Parquet/polished wood floor",null,1.2069746065335417E-2]
[null,null,"Persons per sleeping rooms",null,-5.9984483034181454E-2,null,null,"Persons per sleeping rooms",null,-6.4434174504608283E-2,null,null,"Vinyl/asphalt strip floor",null,-1.2702094825191511E-2]
[null,null,"Wood planks floor",null,6.5780273308984685E-3,null,null,"Wood planks floor",null,5.1364355110668008E-3,null,null,"Ceramic tiles floor",null,0.11058004325170873]
[null,null,"Parquet/polished wood floor",null,5.8753863407021524E-2,null,null,"Parquet/polished wood floor",null,6.0071881385422785E-2,null,null,"Cement floor",null,-0.11603889664400667]
[null,null,"Vinyl/asphalt strip floor",null,3.2931276936509665E-4,null,null,"Vinyl/asphalt strip floor",null,2.3255339972401654E-4,null,null,"Carpet floor",null,1.5653451548386703E-2]
[null,null,"Ceramic tiles floor",null,4.4483436953669873E-2,null,null,"Ceramic tiles floor",null,3.6273252517435961E-2,null,null,"Thatch/palm leaf roof",null,-4.2693829798396039E-2]
[null,null,"Cement floor",null,-0.10019070870626068,null,null,"Cement floor",null,-9.7569178025096209E-2,null,null,"Metal/tin roof",null,-4.2672824406751166E-2]
[null,null,"Carpet floor",null,5.485041083272954E-3,null,null,"Carpet floor",null,3.5134093999804241E-3,null,null,"Wood roof",null,1.5762609939995516E-2]
[null,null,"Thatch/palm leaf roof",null,-2.0179135364910766E-2,null,null,"Thatch/palm leaf roof",null,-2.0083802624461752E-3,null,null,"Calamine/cement fibre roof",null,7.6461849407704714E-3]
[null,null,"Metal/tin roof",null,-9.4434720979333586E-2,null,null,"Metal/tin roof",null,-9.6909581539884729E-2,null,null,"Ceramic tiles roof",null,1.495915226405398E-2]
[null,null,"Wood roof",null,4.1578630572938098E-3,null,null,"Wood roof",null,3.1375208398777429E-3,null,null,"Cement roof",null,6.3174371538544064E-2]
[null,null,"Calamine/cement fibre roof",null,4.7931150289042355E-3,null,null,"Calamine/cement fibre roof",null,4.0258760642004855E-3,null,null,"Cement walls",null,-9.7687379469601453E-3]
[null,null,"Ceramic tiles roof",null,9.8538735701795433E-3,null,null,"Ceramic tiles roof",null,8.1914583197681898E-3,null,null,"Brick walls",null,2.778700397488738E-2]
[null,null,"Cement roof",null,9.1747291897409433E-2,null,null,"Cement roof",null,8.94280437540175E-2,null,null,"Cement blocks walls",null,-2.325742367269075E-2]
[null,null,"Cement walls",null,-7.3422912987898407E-4,null,null,"Cement walls",null,-3.7796672115055071E-3,null,null,"Electricity fuel",null,-1.4480148005982726E-3]
[null,null,"Brick walls",null,5.4036014091317752E-2,null,null,"Brick walls",null,6.6887050585067123E-2,null,null,"LPG fuel",null,6.0879729209044733E-2]
[null,null,"Cement blocks walls",null,-5.2383749869447688E-2,null,null,"Cement blocks walls",null,-6.2697482914630703E-2,null,null,"Natural gas fuel",null,-1.7902098922488278E-2]
[null,null,"Electricity fuel",null,-2.6923769493688758E-3,null,null,"Electricity fuel",null,-5.1378127532159075E-3,null,null,"Wood fuel",null,-6.6391193574486237E-2]
[null,null,"LPG fuel",null,6.8858273459858673E-3,null,null,"LPG fuel",null,-3.1982842409101616E-3,null,null,"Electricity",null,6.3160494730848754E-2]
[null,null,"Natural gas fuel",null,7.7119512784444722E-3,null,null,"Natural gas fuel",null,1.2938874462531499E-2,null,null,"Radio",null,3.7425625970160796E-2]
[null,null,"Wood fuel",null,-3.0866789450664938E-2,null,null,"Wood fuel",null,-1.6144836062355717E-2,null,null,"Television convencional",null,5.0546225068620498E-2]
[null,null,"Electricity",null,2.8858680410419477E-2,null,null,"Electricity",null,1.424736298500847E-2,null,null,"Telephono fijo",null,9.2291004662641507E-2]
[null,null,"Radio",null,4.1041736479264325E-2,null,null,"Radio",null,4.4146450304587068E-2,null,null,"Refrigetaror",null,8.2497705668773375E-2]
[null,null,"Television convencional",null,2.7107946860093809E-2,null,null,"Television convencional",null,2.0932475162092498E-2,null,null,"Calefon o termofon",null,0.12019207512659208]
[null,null,"Telephono fijo",null,0.11098047070886292,null,null,"Telephono fijo",null,0.1114870664889315,null,null,"Calentador instantanoe de agua",null,-5.1289416140582172E-3]
[null,null,"Refrigetaror",null,5.4508266299183337E-2,null,null,"Refrigetaror",null,4.6711019430299788E-2,null,null,"Reproductor de DVD",null,9.4368801057093832E-2]
[null,null,"Calefon o termofon",null,0.10348294435339414,null,null,"Calefon o termofon",null,0.10172490663497982,null,null,"Lavarropa",null,0.11635894794963146]
[null,null,"Calentador instantanoe de agua",null,-1.4648603821916082E-2,null,null,"Calentador instantanoe de agua",null,-1.5615861243375845E-2,null,null,"Secadora de ropa",null,4.313106523213435E-2]
[null,null,"Reproductor de DVD",null,8.2156186289806962E-2,null,null,"Reproductor de DVD",null,7.9538774215171651E-2,null,null,"Lavavajilla",null,2.4350492810598333E-2]
[null,null,"Lavarropa",null,9.3537053366018141E-2,null,null,"Lavarropa",null,8.8982425219154893E-2,null,null,"Horno Microondas",null,0.12138697478014987]
[null,null,"Secadora de ropa",null,5.7935024439866215E-2,null,null,"Secadora de ropa",null,5.6996912599293237E-2,null,null,"Equipo de aire acondicionado",null,9.3634969652645006E-2]
[null,null,"Lavavajilla",null,4.6656591523591695E-2,null,null,"Lavavajilla",null,4.7208060339737359E-2,null,null,"Computedora del plan ceibal",null,2.9177600856813223E-2]
[null,null,"Horno Microondas",null,0.11341885508487561,null,null,"Horno Microondas",null,0.11149850737912366,null,null,"Otro tipo de computadora",null,0.1234155251172078]
[null,null,"Equipo de aire acondicionado",null,9.6206377791649242E-2,null,null,"Equipo de aire acondicionado",null,9.5365622463796179E-2,null,null,"Conexion a internet",null,0.11755930355013906]
[null,null,"Computedora del plan ceibal",null,-2.5178703945304685E-2,null,null,"Computedora del plan ceibal",null,-3.2563043828709864E-2,null,null,"Conexion a TV por abonados",null,7.5001414913670364E-2]
[null,null,"Otro tipo de computadora",null,0.11687857309108314,null,null,"Otro tipo de computadora",null,0.11550965156707135,null,null,"Reloj",null,4.273288831067399E-2]
[null,null,"Conexion a internet",null,0.11988977942372316,null,null,"Conexion a internet",null,0.11949492819649352,null,null,"Celular",null,3.5950472285338861E-2]
[null,null,"Conexion a TV por abonados",null,7.473912401974328E-2,null,null,"Conexion a TV por abonados",null,7.6336909594198574E-2,null,null,"Bicicleta",null,4.4785213466700315E-2]
[null,null,"Reloj",null,6.7876853531512224E-2,null,null,"Reloj",null,7.1246528125564312E-2,null,null,"Motociclate",null,3.7358328101718206E-2]
[null,null,"Celular",null,3.315233246243604E-2,null,null,"Celular",null,3.461022713793753E-2,null,null,"Automovil, Camioneta",null,9.6614819716258876E-2]
[null,null,"Bicicleta",null,1.929441181179636E-2,null,null,"Bicicleta",null,1.716205876584417E-2,null,null,"Bote con motor",null,1.4013863075514627E-2]
[null,null,"Motociclate",null,-1.4588944682234197E-2,null,null,"Motociclate",null,-1.2485206558402533E-2,null,null,"Owns dwelling",null,4.9369628584045123E-2]
[null,null,"Automovil, Camioneta",null,9.3796233964985598E-2,null,null,"Automovil, Camioneta",null,9.8657604340504287E-2,null,null,"Rents dwelling",null,2.2050852169648895E-3]
[null,null,"Bote con motor",null,1.7028264067502984E-2,null,null,"Bote con motor",null,1.8137585833418717E-2,null,null,"Other dwelling arrangement",null,-5.6290788769386882E-2]
[null,null,"Owns dwelling",null,3.2440188012532727E-2,null,null,"Owns dwelling",null,2.8897444176022413E-2,null,null,"Household owns bank account",null,6.6655308682583805E-2]
[null,null,"Rents dwelling",null,4.661473676669789E-3,null,null,"Rents dwelling",null,2.2657880191551925E-3]
[null,null,"Other dwelling arrangement",null,-4.6700098573288412E-2,null,null,"Other dwelling arrangement",null,-4.124837409409924E-2]
[null,null,"Household owns bank account",null,8.0423673236589804E-2,null,null,"Household owns bank account",null,8.3214819064520745E-2,null,null,"Component Score Covariance Matrix"]
[null,null,null,null,null,null,null,null,null,null,null,null,"Component",null,"1"]
[null,null,null,null,null,null,null,null,null,null,null,null,"1",null,1]
[null,null,"Component Score Covariance Matrix",null,null,null,null,"Component Score Covariance Matrix"]
[null,null,"Component",null,"1",null,null,"Component",null,"1"]
[null,null,"1",null,0.99999999999999978,null,null,"1",null,0.99999999999999956]
[]
[]
[]
[]
[]
[]
[]
[]
[]
[]
[]
[]
[]
[]
[]
[]
[]
[]
[]
[]
[]
[]
[]
[]
[]
[]
[]
[]
[]
[]
[]
[]
[]
[]
[]
[]
[]
[]
[]
[]
[]
[]
[]
[]
[]
[]
[]
[]
[]
[]
[]
[]
[]
[]
[]
[]
[]
[]
[]
[]
[]
[]
[]
[]
[]
[]
[]
[]
[]
[]
[]
[]
[]
[]
[]
[]
[]
[]
[]
[]
[]
[]
[]
[]
[]
[]
[]
[]
[]
[]
[]
[]
[]
[]
[]
[]
[]
[]
[]
[]
[]
[]
[]
[]
[]
[]
[]
[]
[]
[]
[]
[]
[]
[]
[]
[]
[]
[]
[]
[]
[]
[]
[]
[]
[]
[]
[]
[]
[]
[]
[]
[]
[]
[]
[]
[]
[]
[]
[]
[]
[]
[]
[]
[]
[]
[]
[]
[]
[]
[]
[]
[]
[]
[]
[]
[]
[]
[]
[]
[]
[]
[]
[]
[]
[]
[]
[]
[]
[]
[]
[]
[]
[]
[]
[]
[]
[]
[]
[]
[]
[]
[]
[]
[]
[]
[]
[]
[]
[]
[]
[]
[]
[]
[]
[]
[]
[]
[]
[]
[]
[]
[]
[]
[]
[]
[]
[]
[]
[]
[]
[]
[]
[]
[]
[]
[]
[]
[]
[]
[]
[]
[]
[]
[]
[]
[]
[]
[]
[]
[]
[]
[]
[]
[]
[]
[]
[]
[]
[]
[]
[]
[]
[]
[]
[]
[]
[]
[]
[]
[]
[]
[]
[]
[]
[]
[]
[]
[]
[]
[]
[]
[]
[]
[]
[]
[]
[]
[]
[]
[]
[]
[]
[]
[]
[]
[]
[]
[]
[]
[]
[]
[]
[]
[]
[]
[]
[]
[]
[]
[]
[]
[]
[]
[]
[]
[]
[]
[]
[]
[]
[]
[]
[]
[]
[]
[]
[]
[]
[]
[]
[]
[]
[]
[]
[]
[]
[]
[]
[]
[]
[]
[]
[]
[]
[]
[]
[]
[]
[]
[]
[]
[]
[]
[]
[]
[]
[]
[]
[]
[]
[]
[]
[]
[]
[]
[]
[]
[]
[]
[]
[]
[]
[]
[]
[]
[]
[]
[]
[]
[]
[]
[]
[]
[]
[]
[]
[]
[]
[]
[]
[]
[]
[]
[]
[]
[]
[]
[]
[]
[]
[]
[]
[]
[]
[]
[]
[]
[]
[]
[]
[]
[]
[]
[]
[]
[]
[]
[]
[]
[]
[]
[]
[]
[]
[]
[]
[]
[]
[]
[]
[]
[]
[]
[]
[]
[]
[]
[]
[]
[]
[]
[]
[]
[]
[]
[]
[]
[]
[]
[]
[]
[]
[]
[]
[]
[]
[]
[]
[]
[]
[]
[]
[]
[]
[]
[]
[]
[]
[]
[]
[]
[]
[]
[]
[]
[]
[]
[]
[]
[]
["MICS13"]
["Uruguay",null,"Count"]
["W_text_t","",3568]
["W_text_i","",3568]
["S_text_s","",3568]
["S_text_i","",3568]
["Urban/Rural","Urban",3027]
[null,"Rural",541]
[null,"Missing",0]
["2013"]
[]
["Sub-national region names","Weighted population"]
[{"$f":"R15","v":"Más de 5 mil habitantes"},{"$f":"BR122+BR123","v":4353.7106209999947}]
[{"$f":"S15","v":"Montevideo y Área Metropolitana"},{"$f":"BS122+BS123","v":5425.2745919999861}]
[{"$f":"T15","v":"Rurales y menores de 5 mil habitantes"},{"$f":"BT122+BT123","v":978.76696100000095}]
[{"$f":"U15","v":0},{"$f":"BU122+BU123","v":0}]
[{"$f":"V15","v":0},{"$f":"BV122+BV123","v":0}]
[{"$f":"W15","v":0},{"$f":"BW122+BW123","v":0}]
[{"$f":"X15","v":0},{"$f":"BX122+XR123","v":0}]
[{"$f":"Y15","v":0},{"$f":"BY122+BY123","v":0}]
[{"$f":"Z15","v":0},{"$f":"BZ122+BZ123","v":0}]
[{"$f":"AA15","v":0},{"$f":"CA122+CA123","v":0}]
[{"$f":"AB15","v":0},{"$f":"CB122+CB123","v":0}]
[{"$f":"AC15","v":0},{"$f":"CC122+CC123","v":0}]
[{"$f":"AD15","v":0},{"$f":"CD122+CD123","v":0}]
[{"$f":"AE15","v":0},{"$f":"CE122+CE123","v":0}]
[{"$f":"AF15","v":0},{"$f":"CF122+CF123","v":0}]
[{"$f":"AG15","v":0},{"$f":"CG122+CG123","v":0}]
[{"$f":"AH15","v":0},{"$f":"CH122+CH123","v":0}]
[{"$f":"AI15","v":0},{"$f":"CI122+CI123","v":0}]
[{"$f":"AJ15","v":0},{"$f":"CJ122+CJ123","v":0}]
[{"$f":"AK15","v":0},{"$f":"CK122+CK123","v":0}]
[{"$f":"AL15","v":0},{"$f":"CL122+CL123","v":0}]
[{"$f":"AM15","v":0},{"$f":"CM122+CM123","v":0}]
[{"$f":"AN15","v":0},{"$f":"CN122+CN123","v":0}]
[{"$f":"AO15","v":0},{"$f":"CO122+CO123","v":0}]
[{"$f":"AP15","v":0},{"$f":"CP122+CP123","v":0}]
[{"$f":"AQ15","v":0},{"$f":"CQ122+CQ123","v":0}]
[{"$f":"AR15","v":0},{"$f":"CR122+CR123","v":0}]
[{"$f":"AS15","v":0},{"$f":"CS122+CS123","v":0}]
[{"$f":"AT15","v":0},{"$f":"CT122+CT123","v":0}]
[{"$f":"AU15","v":0},{"$f":"CU122+CU123","v":0}]
[{"$f":"AV15","v":0},{"$f":"CV122+CV123","v":0}]
[{"$f":"AW15","v":0},{"$f":"CW122+CW123","v":0}]
[{"$f":"AX15","v":0},{"$f":"CX122+CX123","v":0}]
[{"$f":"AY15","v":0},{"$f":"CY122+CY123","v":0}]
[]
[{"$f":"34-COUNTIF(A1037:A1071,\"0\")","v":3},"Sub-regions"]

{"sheet":"data_summary","index":6,"n_rows":103,"n_cols":46,"rows_kept":103,"cut":false,"hidden":false,"merged":[]}
["iso3","year","data_source","row","var1","var2","varname","total_q1","total_q2","total_q3","total_q4","total_q5","urban_q1","urban_q2","urban_q3","urban_q4","urban_q5","rural_q1","rural_q2","rural_q3","rural_q4","rural_q5","region_1_name","region_2_name","region_3_name","region_1","region_2","region_3","n_total_q1","n_total_q2","n_total_q3","n_total_q4","n_total_q5","n_urban_q1","n_urban_q2","n_urban_q3","n_urban_q4","n_urban_q5","n_rural_q1","n_rural_q2","n_rural_q3","n_rural_q4","n_rural_q5","n_region_1","n_region_2","n_region_3"]
["URY",2003,"URY_2003_WHS",16,"Water","Improved","w_imp",99.228030001445973,99.565722933952046,99.597713270725322,99.83989213335532,99.359443674111674,98.971244373347105,99.374751164898626,99.792792079670036,99.585530602006457,99.3774358780298,99.246170488451497,100,100,100,100,"","",""]
["URY",2003,"URY_2003_WHS",17,"Water","Not Improved","",0.77196999855402981,0.4342770660479533,0.40228672927468367,0.1601078666446743,0.64055632588833356,1.028755626652901,0.62524883510137208,0.20720792032996099,0.41446939799354171,0.62256412197020328,0.7538295115485083,0,0,0,0,"","",""]
["URY",2003,"URY_2003_WHS",18,"Water ladder","Basic","w_bas",96.777404721564366,99.565722933952031,99.597713270725322,99.83989213335532,99.359443674111674,98.971244373347105,99.374751164898626,99.792792079670036,99.585530602006457,99.377435878029786,94.507526173376405,100,100,100,100,"","",""]
["URY",2003,"URY_2003_WHS",19,"Water ladder","Limited","w_lim",2.4506252798816259,0,0,0,0,0,0,0,0,0,4.7386443150750894,0,0,0,0,"","",""]
["URY",2003,"URY_2003_WHS",20,"Water ladder","Unimproved","w_unimp",0.77196999855400783,0.43427706604796867,0.40228672927467812,0.1601078666446796,0.64055632588832623,1.028755626652895,0.62524883510137386,0.20720792032996371,0.41446939799354249,0.62256412197021405,0.7538295115485063,0,0,0,0,"","",""]
["URY",2003,"URY_2003_WHS",21,"Water ladder","Surface water","w_sur",0,0,0,0,0,0,0,0,0,0,0,0,0,0,0,"","",""]
["URY",2003,"URY_2003_WHS",22,"Improved water point at more than 30 minutes","Yes","",2.4696905499846311,0,0,0,0,0,0,0,0,0,4.7746369373783422,0,0,0,0,"","",""]
["URY",2003,"URY_2003_WHS",23,"Improved water point at more than 30 minutes","No","",97.53030945001538,100,100,100,100,100,100,100,100,100,95.225363062621653,100,100,100,100,"","",""]
["URY",2003,"URY_2003_WHS",29,"Piped water","Yes","w_pip",89.519777424514658,94.250539562110873,97.33288284696178,98.438950164413242,98.816512057981981,96.792703144385754,98.535877599415116,99.127491188058428,99.402696630599593,99.231101010105959,74.411369277223372,86.709671822451384,81.504107415418773,92.173030945449227,93.542945082900658,"","",""]
["URY",2003,"URY_2003_WHS",30,"Piped water","No","",10.480222575485341,5.7494604378891339,2.6671171530382249,1.561049835586759,1.183487942018028,3.207296855614242,1.464122400584875,0.87250881194157037,0.5973033694004064,0.76889898989404126,25.588630722776621,13.290328177548609,18.495892584581231,7.8269690545507711,6.4570549170993443,"","",""]
["URY",2003,"URY_2003_WHS",31,"Piped water on premises","Yes","w_pop",84.839388092375643,92.200807052177666,96.392538128354033,97.883775822513428,98.671636228342635,91.956817415509718,96.631035716850249,98.201789397212323,98.810030227461453,99.043359011411226,68.892001523358616,86.067580151628391,80.29950648199852,91.402114244382375,93.542945082900658,"","",""]
["URY",2003,"URY_2003_WHS",32,"Piped water on premises","No","",15.160611907624361,7.7991929478223296,3.6074618716459681,2.1162241774865711,1.3283637716573711,8.0431825844902871,3.3689642831497468,1.798210602787675,1.1899697725385461,0.95664098858877344,31.107998476641381,13.9324198483716,19.70049351800148,8.5978857556176269,6.4570549170993443,"","",""]
["URY",2003,"URY_2003_WHS",41,"Water point at more than 30 minutes","Yes","",2.3757402399852379,0,0,0,0,0,0,0,0,0,4.6563300969945516,0,0,0,0,"","",""]
["URY",2003,"URY_2003_WHS",42,"Water point at more than 30 minutes","No","w_30min",97.624259760014766,100,100,100,100,100,100,100,100,100,95.343669903005448,100,100,100,100,"","",""]
["URY",2003,"URY_2003_WHS",58,"main source of drinking water","Piped water through house connection or yard","",85.352362303567674,92.602960471988965,96.781878783040924,98.040746770610369,99.307758356593695,92.912661650108177,97.239021566458504,98.405693788798359,99.221272036352062,99.663830261198726,68.892001523358616,86.067580151628391,80.29950648199852,91.402114244382375,93.542945082900658,"","",""]
["URY",2003,"URY_2003_WHS",59,"main source of drinking water","Public standpipe","",4.7086889118473394,2.0586728540030861,0.94414288011985659,0.55606464514031062,0.14580982368874809,4.8861522955432752,1.916826819927379,0.92762390103993331,0.59513304749736218,0.18891813522453529,5.5193677538647581,0.64209167082298524,1.204600933420251,0.77091670106685484,0,"","",""]
["URY",2003,"URY_2003_WHS",60,"main source of drinking water","Protected tube well or bore hole","",4.6501712527731387,3.888522720044707,1.3234932323523829,0.41660619533563059,0.39015883248339522,1.1619155218064889,0.1795145971429008,0.1878476563000584,0.18359491615058091,0.14725160357673259,9.8840780429779418,8.4637491912862028,14.45894220151283,5.1873761591026621,2.3960170245178891,"","",""]
["URY",2003,"URY_2003_WHS",61,"main source of drinking water","Protected dug well or protected spring","",3.848165297144897,1.334553096875047,0.95048510448684387,0.88754396027373728,0.15627298723416641,0.64996987600225076,0.66463701647121398,0.35060090126302512,0,0,12.119794491541271,3.4267753061779529,3.5319244509620491,2.6395928954481098,4.0610378925814556,"","",""]
["URY",2003,"URY_2003_WHS",62,"main source of drinking water","Unprotected dug well or spring","",0.17199607650372409,0,0,0,0,0,0,0,0,0,0.7538295115485083,0,0,0,0,"","",""]
["URY",2003,"URY_2003_WHS",63,"main source of drinking water","Rainwater (into tank or cistern )","",1.1300343179843519,0.1152908570881909,0,0,0,0.2093149149652791,0,0,0,0,2.830928676708909,1.399803680084458,0.50502593210635793,0,0,"","",""]
["URY",2003,"URY_2003_WHS",64,"main source of drinking water","Tanker-truck, vendor","",0.1385818401788752,0,0,0.099038428639960305,0,0.1799857415745327,0,0.12823375259861969,0,0,0,0,0,0,0,"","",""]
["URY",2003,"URY_2003_WHS",122,"Sanitation","Improved","s_imp",99.844996313537763,99.885209824663391,100,99.83989213335532,99.839860918527918,100,100,100,99.792765301003229,99.792478626009924,99.316537578806262,100,99.494974067893637,100,100,"","","",null,null,null,222169.96282958979,223097.9920501709,222131.96629333499,222280.2358703613,222236.83880615229,172068.0394439697,171819.131652832,172029.55453491211,171650.86618041989,171413.25114440921,50119.645904541023,51029.137115478523,50511.080505371086,50229.455902099609,51046.833465576172]
["URY",2003,"URY_2003_WHS",123,"Sanitation","Not Improved","",0.15500368646224391,0.1147901753366067,0,0.1601078666446743,0.16013908147208339,0,0,0,0.2072346989967708,0.2075213739900677,0.68346242119373257,0,0.50502593210635793,0,0,"","","",null,null,null,344.90625,256.38888549804688,0,356.4588623046875,356.4588623046875,0,0,0,356.4588623046875,356.4588623046875,344.90625,0,256.38888549804688,0,0]
["URY",2003,"URY_2003_WHS",124,"Sanitation ladder","Basic","s_bas",97.799921036221846,99.076734924960618,99.854001669351206,99.519162062496932,99.597773307517144,99.092426789364268,99.453216649444116,99.604514180650511,99.39991823750384,99.664317000322484,93.685156757093608,98.645381758198837,98.852832345708634,100,100,"","","",null,null,null,215413.98263549799,220097.8552856445,220559.41612243649,221210.85928344729,221342.37347412109,168134.26605224609,169066.5044250488,170994.15292358401,170620.08483886719,171193.10829162601,46818.767120361328,50337.887115478523,50183.426666259773,50229.455902099609,51046.833465576172]
["URY",2003,"URY_2003_WHS",125,"Sanitation ladder","Limited","s_lim",2.0450752773159282,0.80847489970278519,0.14599833064881429,0.32073007085839711,0.2420876110107707,0.90757321063573926,0.54678335055587612,0.39548581934948529,0.39284706349939569,0.12816162568743841,5.6313808217126526,1.354618241801163,0.64214172218500787,0,0,"","","",null,null,null,4504.480224609375,1798.1100769042971,322.48388671875,712.917724609375,538.0064697265625,1539.917434692383,929.50990295410156,678.9427490234375,674.32247924804688,220.1428527832031,2814.2591247558589,691.25,327.65383911132813,0,0]
["URY",2003,"URY_2003_WHS",126,"Sanitation ladder","Unimproved","s_unimp",0.15500368646222601,0.1147901753365964,-2.0150547896900001e-14,0.16010786664467119,0.160139081472085,-7.1054273576e-15,8.2156503822300002e-15,3.2196467714100001e-15,0.20723469899676419,0.2075213739900777,0.68346242119373901,-8.881784197e-16,0.50502593210635771,0,0,"","","",null,null,null,344.90625,256.38888549804688,0,356.4588623046875,356.4588623046875,0,0,0,356.4588623046875,356.4588623046875,344.90625,0,256.38888549804688,0,0]
["URY",2003,"URY_2003_WHS",127,"Sanitation ladder","Open defecation","s_od",0,0,0,0,0,0,0,0,0,0,0,0,0,0,0,"","","",null,null,null,100636.8854827881,135625.9589385986,174455.90521240229,189870.6585845947,200381.50825500491,103120.54670715331,132995.59417724609,144411.638671875,152654.13070678711,161005.86836242679,12064.143402099609,18193.691070556641,16523.347961425781,30585.306610107418,29416.648803710941]
["URY",2003,"URY_2003_WHS",128,"Shared among Improved Sanitation","Yes","s_shared",2.048250140541735,0.80940401599192391,0.14599833064881429,0.32124440842744562,0.2424759097053639,0.90757321063573926,0.54678335055587612,0.3954858193494854,0.39366286956219487,0.12842814153133419,5.6701340572250949,1.354618241801163,0.64540116543657933,0,0,"","",""]
["URY",2003,"URY_2003_WHS",129,"Shared among Improved Sanitation","No","",97.951749859458261,99.190595984008084,99.854001669351192,99.678755591572553,99.757524090294638,99.092426789364268,99.453216649444116,99.604514180650511,99.606337130437808,99.87157185846867,94.329865942774902,98.645381758198837,99.354598834563419,100,100,"","",""]
["URY",2003,"URY_2003_WHS",135,"Sanitation type","Sewer connection","s_sew",45.227038489186057,60.722318662583987,78.537055302533858,85.282733294520227,90.021357495437428,59.930099186567602,77.404415269639131,83.94583073954756,88.748621995528168,93.733562428517587,23.90617351592612,35.653534625491453,32.54711759258501,60.891176423889839,57.626784673232052,"","",""]
["URY",2003,"URY_2003_WHS",136,"Sanitation type","Septic tank connection","s_sep",49.978100547542986,38.316390784164049,20.676168642227751,14.5571588388351,9.8185034230904904,38.02394119896146,21.60179065492564,16.054169260452429,11.044143305475069,6.0589161974923487,71.029823074274972,54.586283441933759,65.175057779216317,37.827471551997469,42.373215326767948,"","",""]
["URY",2003,"URY_2003_WHS",137,"Sanitation type","Improved latrines","s_lat",4.6398572768087014,0.84650037791535426,0.78677605523839045,0,0,2.0459596144709389,0.9937940754352157,0,0,0,4.3805409886051709,9.7601819325747901,1.7727986960923099,1.281352024112689,0,"","",""]
["URY",2003,"URY_2003_WHS",138,"Sanitation type","Unimproved facilities","",0.15500368646224391,0.1147901753366067,0,0.1601078666446743,0.16013908147208339,0,0,0,0.2072346989967708,0.2075213739900677,0.68346242119373257,0,0.50502593210635793,0,0,"","",""]
["URY",2003,"URY_2003_WHS",139,"Sanitation type","Open defecation","",0,0,0,0,0,0,0,0,0,0,0,0,0,0,0,"","",""]
["URY",2003,"URY_2003_WHS",148,"Shared among improved sanitation facilities","Yes","",2.024350212298935,0.80504804489247639,0.14517671278923269,0.3202157332893486,0.2416993123161775,0.89494681270766963,0.54098160898183123,0.39466634140801138,0.39203125743659639,0.12816162568743841,5.5767048444967129,1.354618241801163,0.64540116543657933,0,0,"","",""]
["URY",2003,"URY_2003_WHS",149,"Shared among improved sanitation facilities","No","",96.80880362132028,98.656781768972564,99.292064894063103,99.35956853342131,99.438022524739651,97.713826806863466,98.397950681449714,99.398125738262024,99.193499344569858,99.664317000322484,92.77555258389107,98.645381758198837,99.354598834563419,100,100,"","",""]
["URY",2003,"URY_2003_WHS",150,"Shared among improved sanitation facilities","DK/missing","",1.166846166380787,0.53817018613495693,0.56275839314766629,0.3202157332893486,0.32027816294416678,1.391226380428864,1.061067709568448,0.20720792032996099,0.41446939799354171,0.2075213739900677,1.647742571612228,0,0,0,0,"","",""]
["URY",2003,"URY_2003_WHS",151,"Shared among all sanitation facilities","Yes","",98.350407370029174,99.186096768937915,99.85351350683905,99.676610334860442,99.757121217767718,99.280021507880718,99.450876357139578,99.601954126694508,99.604638188618821,99.871295516874,95.316505856964028,98.607107535293778,99.351658602491426,100,100,"","",""]
["URY",2003,"URY_2003_WHS",152,"Shared among all sanitation facilities","No","",1.649592629970819,0.81390323106208595,0.1464864931609508,0.32338966513955941,0.24287878223227541,0.71997849211928688,0.54912364286043247,0.39804587330548902,0.39536181138117699,0.12870448312599889,4.6834941430359747,1.392892464706216,0.64834139750856379,0,0,"","",""]
["URY",2003,"URY_2003_WHS",153,"What type of toilet facilities","Flush to piped sewage system","",45.227038489186057,60.792102023087089,78.537055302533858,85.41949662827038,90.165748096241188,59.930099186567602,77.404415269639131,83.94583073954756,88.932921868471311,93.928484109309267,23.90617351592612,35.653534625491453,32.712323308286329,60.891176423889839,57.626784673232052,"","","",null,null,null,100636.8854827881,135625.9589385986,174455.90521240229,189870.6585845947,200381.50825500491,103120.54670715331,132995.59417724609,144411.638671875,152654.13070678711,161005.86836242679,12064.143402099609,18193.691070556641,16523.347961425781,30585.306610107418,29416.648803710941]
["URY",2003,"URY_2003_WHS",154,"What type of toilet facilities","Flush to septic tank","",49.978100547542986,38.360424783032357,20.676168642227751,14.58050337172963,9.8342519037588207,38.02394119896146,21.60179065492564,16.054169260452429,11.06707813152868,6.0715158906907352,71.029823074274972,54.586283441933759,65.505879457531179,37.827471551997469,42.373215326767948,"","","",null,null,null,111208.7050018311,85581.337432861328,45928.379959106453,32409.577285766602,21855.330551147461,65427.050140380859,37116.009124755859,27617.915863037109,18996.735473632809,10407.38278198242,35844.882110595703,27854.909423828129,33087.727508544922,19000.53314208984,21630.184661865231]
["URY",2003,"URY_2003_WHS",155,"What type of toilet facilities","Pour flush latrine","",1.204407708868066,0.1149220946105106,0.78677605523839045,0,0,1.0067804321315119,0.86794306430400625,0,0,0,0.50805738791239008,1.354618241801163,0.50758939015526261,0.51043532304583394,0,"","","",null,null,null,2679.9862365722661,256.38888549804688,1747.6811218261721,0,0,1732.347351074219,1491.292236328125,0,0,0,256.38888549804688,691.25,256.38888549804688,256.38888549804688,0]
["URY",2003,"URY_2003_WHS",156,"What type of toilet facilities","Covered dry latrine (with privacy)","",3.4354495679406338,0.73255109927002982,0,0,0,1.039179182339427,0.1258510111312095,0,0,0,3.8724836006927812,8.4055636907736258,1.274207844027222,0.77091670106685484,0,"","","",null,null,null,7644.3861083984384,1634.3067932128911,0,0,0,1788.0952453613279,216.2361145019531,0,0,0,1954.231506347656,4289.28662109375,643.61614990234375,387.22726440429688,0]
["URY",2003,"URY_2003_WHS",157,"What type of toilet facilities","Bucket latrine (where fresh excreta are manually removed)","",0.15500368646224391,0,0,0,0,0,0,0,0,0,0.68346242119373257,0,0,0,0,"","","",null,null,null,344.90625,0,0,0,0,0,0,0,0,0,344.90625,0,0,0,0]
["URY",2013,"URY_2013_MICS",16,"Water","Improved","w_imp",98.925350323939483,99.508434687403195,99.979233256817224,99.953547634453301,99.640255533293526,99.909404850967505,100,100,100,99.604261693017605,92.158125345283466,91.885447129556866,99.821627262833232,99.772770726967352,99.493586645225861,"Más de 5 mil habitantes","Montevideo y Área Metropolitana","Rurales y menores de 5 mil habitantes",100,99.824674772885686,96.591692779871067]
["URY",2013,"URY_2013_MICS",17,"Water","Not Improved","",1.074649676060526,0.49156531259682201,0.020766743182762299,0.046452365546689502,0.35974446670648352,0.090595149032495395,0,0,0,0.39573830698239842,7.8418746547165181,8.1145528704431982,0.17837273716675631,0.22722927303266729,0.50641335477414229,"Más de 5 mil habitantes","Montevideo y Área Metropolitana","Rurales y menores de 5 mil habitantes",0,0.1753252271143298,3.4083072201289779]
["URY",2013,"URY_2013_MICS",18,"Water ladder","Basic","w_bas",98.920336651363399,99.508224090715075,99.761449382653723,99.953547634453301,99.640255533293526,99.908986186114646,100,99.761574297013297,100,99.604261693017605,92.118287953174928,91.885447129556866,99.821627262833232,99.745535788242151,99.493586645225861,"Más de 5 mil habitantes","Montevideo y Área Metropolitana","Rurales y menores de 5 mil habitantes",100,99.738401057099466,96.512785536784875]
["URY",2013,"URY_2013_MICS",19,"Water ladder","Limited","w_lim",0,0,0.21757873851233339,0,0,0,0,0.2384257029867079,0,0,0,0,0,0,0,"Más de 5 mil habitantes","Montevideo y Área Metropolitana","Rurales y menores de 5 mil habitantes",0,0.086035243130199404,0]
["URY",2013,"URY_2013_MICS",20,"Water ladder","Unimproved","w_unimp",1.0796633486365601,0.49177590928493481,0.0209718788339417,0.046452365546689502,0,0.091013813885367403,0,0,0,0,7.881712046825065,8.1145528704431982,0.17837273716675631,0.25446421175786621,0.50641335477414229,"Más de 5 mil habitantes","Montevideo y Área Metropolitana","Rurales y menores de 5 mil habitantes",0,0.032731745957576101,3.4872144632151589]
["URY",2013,"URY_2013_MICS",21,"Water ladder","Surface water","w_sur",0,0,0,0,0.35974446670648352,0,0,0,0,0.39573830698239842,0,0,0,0,0,"Más de 5 mil habitantes","Montevideo y Área Metropolitana","Rurales y menores de 5 mil habitantes",0,0.14283195381275979,0]
["URY",2013,"URY_2013_MICS",22,"Improved water point at more than 30 minutes","Yes","",0,0,0.2176243784332916,0,0,0,0,0.2384257029867079,0,0,0,0,0,0,0,"Más de 5 mil habitantes","Montevideo y Área Metropolitana","Rurales y menores de 5 mil habitantes",0,0.086186555435626699,0]
["URY",2013,"URY_2013_MICS",23,"Improved water point at more than 30 minutes","No","",100,100,99.782375621566715,100,100,100,100,99.761574297013297,100,100,100,100,100,100,100,"Más de 5 mil habitantes","Montevideo y Área Metropolitana","Rurales y menores de 5 mil habitantes",100,99.913813444564354,100]
["URY",2013,"URY_2013_MICS",29,"Piped water","Yes","w_pip",94.870010906422863,97.259937629705433,99.475495247666473,98.915632179976797,98.595953444083477,98.927243957536376,99.667144914329313,99.954722876610475,100,99.547677533049921,66.592482497617169,81.133428864568558,78.896056286021221,95.084026891012499,77.476739733149316,"Más de 5 mil habitantes","Montevideo y Área Metropolitana","Rurales y menores de 5 mil habitantes",99.631945129225898,99.609021725254635,79.891454264157474]
["URY",2013,"URY_2013_MICS",30,"Piped water","No","",5.1299890935771968,2.740062370294591,0.52450475233355576,1.0843678200231781,1.4040465559165349,1.0727560424636149,0.3328550856707016,0.045277123389526303,0,0.45232246695007738,33.407517502382852,18.86657113543151,21.103943713978829,4.9159731089875063,22.523260266850709,"Más de 5 mil habitantes","Montevideo y Área Metropolitana","Rurales y menores de 5 mil habitantes",0.36805487077410459,0.39097827474536168,20.108545735842402]
["URY",2013,"URY_2013_MICS",31,"Piped water on premises","Yes","w_pop",89.849445390803822,97.118673538305316,98.027992624312802,98.87028500033621,98.595953444083477,93.499945657981016,99.620030317682691,99.435315320351251,99.950361278523602,99.547677533049921,65.689222930166196,81.133428864568558,77.775371729898055,84.381170667319239,77.476739733149316,"Más de 5 mil habitantes","Montevideo y Área Metropolitana","Rurales y menores de 5 mil habitantes",97.347446625346123,99.262052153838738,77.333200972238259]
["URY",2013,"URY_2013_MICS",32,"Piped water on premises","No","",10.15055460919622,2.8813264616946959,1.972007375687217,1.1297149996637681,1.4040465559165349,6.50005434201897,0.37996968231732259,0.56468467964876423,0.049638721476400603,0.45232246695007738,34.310777069833819,18.86657113543151,22.224628270102009,15.618829332680781,22.523260266850709,"Más de 5 mil habitantes","Montevideo y Área Metropolitana","Rurales y menores de 5 mil habitantes",2.652553374653885,0.7379478461612976,22.666799027761598]
["URY",2013,"URY_2013_MICS",35,"Water source on premises","Yes","",94.336485275429254,99.957176290229626,98.806403226870458,100,100,95.060879424178296,99.952885403353392,99.761574297013297,100,100,87.949306465384154,99.169900704198739,100,89.297143776306712,100,"Más de 5 mil habitantes","Montevideo y Área Metropolitana","Rurales y menores de 5 mil habitantes",97.952997666631106,99.75773277873563,95.268670598291692]
["URY",2013,"URY_2013_MICS",36,"Water source on premises","No","",5.6635147245707946,0.0428237097703753,1.19359677312954,0,0,4.9391205758216943,0.047114596646621099,0.2384257029867079,0,0,12.05069353461586,0.83009929580126829,0,10.702856223693271,0,"Más de 5 mil habitantes","Montevideo y Área Metropolitana","Rurales y menores de 5 mil habitantes",2.0470023333689111,0.2422672212643654,4.7313294017083161]
["URY",2013,"URY_2013_MICS",37,"Improved Water source on premises","Yes","w_premises",94.415725412127145,99.956964743838157,98.806155304208488,100,100,95.113314685402187,99.952885403353392,99.761574297013297,100,100,87.972250698050431,99.096593288999472,100,89.272768365847895,100,"Más de 5 mil habitantes","Montevideo y Área Metropolitana","Rurales y menores de 5 mil habitantes",97.952997666631106,99.777859599309309,95.300830443101916]
["URY",2013,"URY_2013_MICS",38,"Improved Water source on premises","No","",5.5842745878728861,0.043035256161854198,1.193844695791517,0,0,4.8866853145978286,0.047114596646621099,0.2384257029867079,0,0,12.02774930194958,0.90340671100053849,0,10.72723163415208,0,"Más de 5 mil habitantes","Montevideo y Área Metropolitana","Rurales y menores de 5 mil habitantes",2.0470023333689111,0.22214040069067589,4.6991695568980658]
["URY",2013,"URY_2013_MICS",41,"Water point at more than 30 minutes","Yes","",0,0,0.21757873851233339,0,0,0,0,0.2384257029867079,0,0,0,0,0,0,0,"Más de 5 mil habitantes","Montevideo y Área Metropolitana","Rurales y menores de 5 mil habitantes",0,0.086035243130199404,0]
["URY",2013,"URY_2013_MICS",42,"Water point at more than 30 minutes","No","w_30min",100,100,99.78242126148767,100,100,100,100,99.761574297013297,100,100,100,100,100,100,100,"Más de 5 mil habitantes","Montevideo y Área Metropolitana","Rurales y menores de 5 mil habitantes",100,99.913964756869788,100]
["URY",2013,"URY_2013_MICS",58,"Fuente principal de agua potable","Tubería dentro de la vivienda","",82.644011391464304,95.256696924526167,93.761985381257773,90.07214788182435,79.478536697930977,87.050991603325599,97.640329337615427,94.904484675430254,89.953567834033251,79.271500152828054,54.359035368027889,77.601779081198501,76.869883771477774,81.01974201356181,75.501286153236506,"Más de 5 mil habitantes","Montevideo y Área Metropolitana","Rurales y menores de 5 mil habitantes",93.655692923923482,86.638932910992608,73.102734717258116]
["URY",2013,"URY_2013_MICS",59,"Fuente principal de agua potable","Tubería dentro del terreno, patio o lote","",5.8877292570064466,0.9763247115195739,1.0823888601660061,1.579839763015416,6.8286858306655898,5.0329371241113643,1.0569132271983821,1.10229026525024,1.7293517831805869,7.5119225440294706,11.330187562138329,3.015814269165666,0.21904334527016109,0.90562769638846929,0,"Más de 5 mil habitantes","Montevideo y Área Metropolitana","Rurales y menores de 5 mil habitantes",1.7574031363257221,4.5147820971344634,3.099558547522324]
["URY",2013,"URY_2013_MICS",60,"Fuente principal de agua potable","Tubería al vecino","",0.46437369411177981,0.0428237097703753,0.97814627293867262,0,0,0.46000143824253209,0.047114596646621099,0,0,0,0.50544084675858025,0,0,10.702856223693271,0,"Más de 5 mil habitantes","Montevideo y Área Metropolitana","Rurales y menores de 5 mil habitantes",0.058710930112596503,0.13583255326590521,2.2627585403345041]
["URY",2013,"URY_2013_MICS",61,"Fuente principal de agua potable","Canilla o grifo público","",4.556191821507241,0.098440381629729401,0.46935635041498852,0.045347179640590103,0,4.9672968613128221,0,0.51940755625923796,0.049638721476400603,0,0.39781872069239749,0,1.1206845561231791,0,0,"Más de 5 mil habitantes","Montevideo y Área Metropolitana","Rurales y menores de 5 mil habitantes",2.2257875737671839,0.2111370181500305,0.29549475158469279]
["URY",2013,"URY_2013_MICS",62,"Fuente principal de agua potable","Pozo con tubería","",1.6297686563560909,0.93107216490418232,0.031252263270964899,0.85034640893149827,0.73033091619499013,0.80042754810640393,0.3328550856707016,0,0,0,3.044668620266894,6.7676497745484498,7.3191759471635267,0.11657327198556321,17.268448379807381,"Más de 5 mil habitantes","Montevideo y Área Metropolitana","Rurales y menores de 5 mil habitantes",0.33499431334850799,0.13990235648518529,6.8967207404541666]
["URY",2013,"URY_2013_MICS",63,"Fuente principal de agua potable","Pozo protegido","",0.53454161961135538,0.23834433183620479,0.033573021653501199,0.14860664247280261,0.051437624542403498,0.1365125790450627,0,0,0,0.056584159967679001,4.0057074910527533,2.1330506754983909,0.98626012912896888,0.53777726112641,1.4485237824054571,"Más de 5 mil habitantes","Montevideo y Área Metropolitana","Rurales y menores de 5 mil habitantes",0.0330605574255965,0.043118831320529197,1.824836729444935]
["URY",2013,"URY_2013_MICS",64,"Fuente principal de agua potable","Pozo no protegido","",0.69348863415044226,0.015668173727473901,0,0,0,0.0113051915699134,0,0,0,0,4.6608102526169519,2.7955932009842361,0.17837273716675631,0,0,"Más de 5 mil habitantes","Montevideo y Área Metropolitana","Rurales y menores de 5 mil habitantes",0,0.0040789824781646998,1.5359482490745811]
["URY",2013,"URY_2013_MICS",65,"Fuente principal de agua potable","Manantial o pozo surgente protegido","",0.73253504548488357,1.0790805609573819,0.37096303570926398,0.038962403072187499,0.26253354847265759,0,0,0,0,0,6.5103566811850273,1.529937505434785,12.620134900519581,3.7385707216417869,3.29987474986374,"Más de 5 mil habitantes","Montevideo y Área Metropolitana","Rurales y menores de 5 mil habitantes",0,0,5.4632528610658708]
["URY",2013,"URY_2013_MICS",66,"Fuente principal de agua potable","Manantial o pozo surgente no protegido","",0.30900846365052798,0.4758971388693482,0.020766743182762299,0.046452365546689502,0,0,0,0,0,0,3.1810644020995662,5.3189596694589616,0,0.22722927303266729,0.50641335477414229,"Más de 5 mil habitantes","Montevideo y Área Metropolitana","Rurales y menores de 5 mil habitantes",0,0,1.872358971054396]
["URY",2013,"URY_2013_MICS",67,"Fuente principal de agua potable","Recogen agua de lluvia","",0.16980784221192019,0,0,0,0,0,0,0,0,0,1.8747955540167229,0,0,0,0,"Más de 5 mil habitantes","Montevideo y Área Metropolitana","Rurales y menores de 5 mil habitantes",0,0,0.37319894781368668]
["URY",2013,"URY_2013_MICS",68,"Fuente principal de agua potable","Carrotanque / camión cisterna","",0.9475360882783076,0,0,0,0,0,0,0,0,0,10.130114501144931,0.32138030950668528,0,0,0,"Más de 5 mil habitantes","Montevideo y Área Metropolitana","Rurales y menores de 5 mil habitantes",0,0,2.0824684334640091]
["URY",2013,"URY_2013_MICS",69,"Fuente principal de agua potable","Agua de superficie(río, arroyo, represa, lago, estanque, canal, canal de irrigación)","",0,0,0,0,0.35974446670648352,0,0,0,0,0.39573830698239842,0,0,0,0,0,"Más de 5 mil habitantes","Montevideo y Área Metropolitana","Rurales y menores de 5 mil habitantes",0,0.1426379415230164,0]
["URY",2013,"URY_2013_MICS",70,"Fuente principal de agua potable","Agua embotellada/envasada","",1.358854907907185,0.88565190225961565,3.2515680714060782,7.2182973554964978,12.288730915486889,1.4612376968237131,0.92278775286889125,3.4738175030603009,8.2674416613097819,12.76425483619237,0,0.51583551420438822,0.68644461315011318,2.7516235385699979,1.9754535799128159,"Más de 5 mil habitantes","Montevideo y Área Metropolitana","Rurales y menores de 5 mil habitantes",1.934350565096965,8.14096900553713,1.190668510928619]
["URY",2013,"URY_2013_MICS",71,"Fuente principal de agua potable","Otra","",0.072152578259555497,0,0,0,0,0.079289957462581995,0,0,0,0,0,0,0,0,0,"Más de 5 mil habitantes","Montevideo y Área Metropolitana","Rurales y menores de 5 mil habitantes",0,0.028608303113148801,0]
["URY",2013,"URY_2013_MICS",122,"Sanitation","Improved","s_imp",93.82910446468702,99.927387049910436,99.965660171304748,98.805991162828676,99.458267183364129,93.899938228399776,99.92011131513047,99.961998241870603,98.692993200934239,99.404064697214096,93.461470686057368,99.703181792907714,100,100,100,"Más de 5 mil habitantes","Montevideo y Área Metropolitana","Rurales y menores de 5 mil habitantes",99.915139238189596,97.138608906009864,98.637517454984902,2018.364223999999,2149.0974169999959,2162.7739599999991,2115.791174999998,2139.4569529999999,1838.0653349999991,1953.2295659999991,1954.2929149999991,1930.658836999999,1943.8056440000021,182.0951619999999,200.2742069999999,188.91283799999999,197.7262850000001,196.4229399999999,4350.0160289999949,5270.0362679999862,965.431432000001]
["URY",2013,"URY_2013_MICS",123,"Sanitation","Not Improved","",6.1708955353130319,0.072612950089550196,0.034339828695251401,1.1940088371712989,0.54173281663586781,6.1000617716002559,0.079888684869545395,0.038001758129385298,1.3070067990657459,0.59593530278591111,6.5385293139426066,0.29681820709227658,0,0,0,"Más de 5 mil habitantes","Montevideo y Área Metropolitana","Rurales y menores de 5 mil habitantes",0.084860761810379506,2.861391093990187,1.3624825450151239,132.74255199999999,1.5616570000000001,0.74294800000000005,25.568017999999999,11.653269999999999,119.407023,1.5616570000000001,0.74294800000000005,25.568017999999999,11.653269999999999,12.739309,0.59621999999999997,0,0,0,3.6945920000000001,155.23832400000001,13.335528999999999]
["URY",2013,"URY_2013_MICS",124,"Sanitation ladder","Basic","s_bas",87.338336275869793,95.041791948869957,95.493276681154555,95.306937512935065,96.69562494954414,85.906539944224818,96.588014315608802,94.914822337456044,95.522975887170276,96.423326433507967,86.059351376276723,94.409625066411635,99.014785855898282,97.65510842425428,98.322739187184567,"Más de 5 mil habitantes","Montevideo y Área Metropolitana","Rurales y menores de 5 mil habitantes",93.656412707576337,94.012511581531626,95.077195193555397,1878.5939499999999,2015.860659999998,2066.0131869999991,2040.863867999999,2055.2838650000022,1681.4522619999991,1859.4715629999989,1855.6188159999999,1868.6461069999989,1860.842608000002,167.67328199999989,189.64101700000001,187.05164199999999,193.08981800000009,193.1284149999999,4040.2799939999968,5085.7513619999954,930.58417400000087]
["URY",2013,"URY_2013_MICS",125,"Sanitation ladder","Limited","s_lim",6.4902855800171579,4.8845806012598949,4.4723834901501966,3.499053649893666,2.7561197731461888,7.9928740190540291,3.3308672894270548,5.0471759044145994,3.1700173137639509,2.9728357930032661,7.4021193097806623,5.2935567264961341,0.98521414410173647,2.344891575745732,1.6772608128154489,"Más de 5 mil habitantes","Montevideo y Área Metropolitana","Rurales y menores de 5 mil habitantes",6.2579441603506769,3.1178348129080731,3.5603222614294978,139.60205500000001,103.603201,96.760772999999986,74.927306999999999,58.581848999999998,156.44485399999999,64.124446999999989,98.674098999999984,62.012729999999991,57.371796999999987,14.42188,10.633190000000001,1.8611960000000001,4.6364669999999997,3.2945250000000001,269.96385900000013,168.6640679999999,34.847257999999997]
["URY",2013,"URY_2013_MICS",126,"Sanitation ladder","Unimproved","s_unimp",3.8390674494752708,0.034874686500589301,0,1.1940088371712989,0.54825527730972246,3.5753661684766951,0.0384228789506205,0,1.3070067990657459,0.60383777348879575,6.1585467594181553,0.29681820709227658,0,0,0,"Más de 5 mil habitantes","Montevideo y Área Metropolitana","Rurales y menores de 5 mil habitantes",0.050495365841966802,1.9550870501055051,1.28684278299827,82.575982000000025,0.73970100000000005,0,25.568017999999999,11.653269999999999,69.980790000000013,0.73970100000000005,0,25.568017999999999,11.653269999999999,11.998972,0.59621999999999997,0,0,0,2.1783389999999998,105.76344,12.595192000000001]
["URY",2013,"URY_2013_MICS",127,"Sanitation ladder","Open defecation","s_od",2.33231069463785,0.0387527633696296,0.034339828695251401,0,0,2.5252198682445051,0.042695516013546403,0.038001758129385298,0,0,0.37998255452445079,0,0,0,0,"Más de 5 mil habitantes","Montevideo y Área Metropolitana","Rurales y menores de 5 mil habitantes",0.035147766231050197,0.91456655545500454,0.075639762016854503,50.16657,0.82195600000000002,0.74294800000000005,0,0,49.426233000000003,0.82195600000000002,0.74294800000000005,0,0,0.74033700000000002,0,0,0,0,1.5162530000000001,49.474884000000003,0.74033700000000002]
["URY",2013,"URY_2013_MICS",128,"Shared among Improved Sanitation","Yes","s_shared",6.917170317161542,4.8881796432763132,4.4739198265545994,3.5413375329916521,2.7713136464637298,8.5121660313873697,3.3335714290652971,5.0490946491508932,3.2119983505920691,2.990895952530392,7.9199687908237841,5.3093157422912718,0.98521414410173647,2.344891575745732,1.6772608128154489,"Más de 5 mil habitantes","Montevideo y Área Metropolitana","Rurales y menores de 5 mil habitantes",6.2633082537105427,3.2099492369220681,3.609501083656447]
["URY",2013,"URY_2013_MICS",129,"Shared among Improved Sanitation","No","",93.082829682838479,95.11182035672374,95.526080173445408,96.458662467008395,97.228686353536304,91.487833968612648,96.666428570934713,94.950905350849141,96.788001649407903,97.009104047469634,92.080031209176241,94.690684257708782,99.014785855898282,97.65510842425428,98.322739187184567,"Más de 5 mil habitantes","Montevideo y Área Metropolitana","Rurales y menores de 5 mil habitantes",93.73669174628948,96.790050763078099,96.390498916343532]
["URY",2013,"URY_2013_MICS",135,"Sanitation type","Sewer connection","s_sew",33.126670742261652,51.426656896526843,54.367181400368402,65.34766472501849,78.052147586302524,38.063501839753691,52.920803348624467,58.056999182526063,68.915785741015242,79.710436043454564,8.7760984553908887,36.157380200122752,34.395837619039973,32.497367256963308,16.666108856735381,"Más de 5 mil habitantes","Montevideo y Área Metropolitana","Rurales y menores de 5 mil habitantes",61.599660644969688,57.869732024800918,25.715865985386451]
["URY",2013,"URY_2013_MICS",136,"Sanitation type","Septic tank connection","s_sep",60.174328696364142,48.354100171992329,45.383028270745569,33.4583264378103,21.396116111526648,55.577266292104632,46.891865443985608,41.666573356357929,29.777207459919069,19.693628653759561,80.917992689291623,63.545801592785033,65.604162380960062,67.502632743036656,83.224338766133954,"Más de 5 mil habitantes","Montevideo y Área Metropolitana","Rurales y menores de 5 mil habitantes",38.269832288883329,39.087366068567178,72.149727170858171]
["URY",2013,"URY_2013_MICS",137,"Sanitation type","Improved latrines","s_lat",0.5281050260612451,0.1466299813914628,0.21545050019086801,0,0.010003485535013399,0.25917009654140938,0.1074425225204729,0.2384257029867079,0,0,3.7673795413748952,0,0,0,0.1095523771306957,"Más de 5 mil habitantes","Montevideo y Área Metropolitana","Rurales y menores de 5 mil habitantes",0.0456463043366796,0.18151081264201621,0.77192429874019775]
["URY",2013,"URY_2013_MICS",138,"Sanitation type","Unimproved facilities","",3.8387672300280129,0.034394154282400301,0,1.1940088371712989,0.54173281663586781,3.5750589127859378,0.037840409313112701,0,1.3070067990657459,0.59593530278591111,6.1585467594181553,0.29681820709227658,0,0,0,"Más de 5 mil habitantes","Montevideo y Área Metropolitana","Rurales y menores de 5 mil habitantes",0.050034078734880701,1.9494578238667759,1.28684278299827]
["URY",2013,"URY_2013_MICS",139,"Sanitation type","Open defecation","",2.3321283052850199,0.038218795807149902,0.034339828695251401,0,0,2.5250028588143172,0.042048275556432702,0.038001758129385298,0,0,0.37998255452445079,0,0,0,0,"Más de 5 mil habitantes","Montevideo y Área Metropolitana","Rurales y menores de 5 mil habitantes",0.034826683075498799,0.91193327012341097,0.075639762016854503]
["URY",2013,"URY_2013_MICS",148,"Shared among improved sanitation facilities","Yes","",6.4897780322923451,4.8172768177203062,4.4723834901501966,3.499053649893666,2.7233308815900679,7.9921871366727197,3.2803731797807458,5.0471759044145994,3.1700173137639509,2.9339300656868699,7.4021193097806623,5.2935567264961341,0.98521414410173647,2.344891575745732,1.6772608128154489,"Más de 5 mil habitantes","Montevideo y Área Metropolitana","Rurales y menores de 5 mil habitantes",6.200776360694193,3.1088577202840399,3.5603222614294978]
["URY",2013,"URY_2013_MICS",149,"Shared among improved sanitation facilities","No","",87.331506318494405,93.732227686404627,95.493276681154555,95.306937512935065,95.545260443867136,85.899157407156622,95.123793330025634,94.914822337456044,95.522975887170276,95.161427053128094,86.059351376276723,94.409625066411635,99.014785855898282,97.65510842425428,98.322739187184567,"Más de 5 mil habitantes","Montevideo y Área Metropolitana","Rurales y menores de 5 mil habitantes",92.800839231524151,93.741824045171043,95.077195193555397]
["URY",2013,"URY_2013_MICS",150,"Shared among improved sanitation facilities","DK/missing","",6.1787156492133182,1.450495495875143,0.034339828695251401,1.1940088371712989,1.731408674542847,6.1086554561706921,1.59583349019365,0.038001758129385298,1.3070067990657459,1.9046428811850751,6.5385293139426066,0.29681820709227658,0,0,0,"Más de 5 mil habitantes","Montevideo y Área Metropolitana","Rurales y menores de 5 mil habitantes",0.99838440778170501,3.1493182345451411,1.3624825450151239]
["URY",2013,"URY_2013_MICS",151,"Shared among all sanitation facilities","Yes","",6.8003781636420433,4.8191186268279989,4.4739198265545994,3.499053649893666,2.7233308815900679,8.3705878965583285,3.28175310036747,5.0490946491508932,3.1700173137639509,2.9339300656868699,7.4303533562740256,5.2935567264961341,0.98521414410173647,2.344891575745732,1.6772608128154489,"Más de 5 mil habitantes","Montevideo y Área Metropolitana","Rurales y menores de 5 mil habitantes",6.2092585980755626,3.1931760356425909,3.563017319250398]
["URY",2013,"URY_2013_MICS",152,"Shared among all sanitation facilities","No","",93.191614992587759,93.802472015928871,95.526080173445408,96.500946350106346,96.08699326050295,91.620595807137519,95.201664397518925,94.950905350849141,96.829982686236022,95.757362355913983,92.56964664372596,94.706443273503893,99.014785855898282,97.65510842425428,98.322739187184567,"Más de 5 mil habitantes","Montevideo y Área Metropolitana","Rurales y menores de 5 mil habitantes",92.87689949512847,96.516246955382371,96.436982680749622]
["URY",2013,"URY_2013_MICS",153,"Tipo de servicio sanitario","Inodoro conectado a red de saneamiento","",33.126670742261652,51.426656896526843,54.367181400368402,65.34766472501849,78.052147586302524,38.063501839753691,52.920803348624467,58.056999182526063,68.915785741015242,79.710436043454564,8.7760984553908887,36.157380200122752,34.395837619039973,32.497367256963308,16.666108856735381,"Más de 5 mil habitantes","Montevideo y Área Metropolitana","Rurales y menores de 5 mil habitantes",61.599660644969688,57.869732024800918,25.715865985386451,712.59005899999943,1106.012062999999,1176.2431620000009,1399.328226000001,1678.9877260000021,745.08252699999946,1034.491219,1135.0351550000009,1348.149108000001,1558.704827000003,17.098865,72.629483999999991,64.97815300000002,64.255836999999985,32.736060999999999,2681.8709680000002,3139.5918680000018,251.69839999999991]
["URY",2013,"URY_2013_MICS",154,"Tipo de servicio sanitario","Inodoro conectado a fosa séptica o pozo impermeable","",60.174328696364142,48.354100171992329,45.383028270745569,33.4583264378103,21.396116111526648,55.577266292104632,46.891865443985608,41.666573356357929,29.777207459919069,19.693628653759561,80.917992689291623,63.545801592785033,65.604162380960062,67.502632743036656,83.224338766133954,"Más de 5 mil habitantes","Montevideo y Área Metropolitana","Rurales y menores de 5 mil habitantes",38.269832288883329,39.087366068567178,72.149727170858171,1294.414062000001,1039.931843000001,981.86949000000004,716.46294899999975,460.25404099999997,1087.9096249999991,916.63806999999986,814.596452,582.50972899999999,385.10081699999989,157.6561429999999,127.644723,123.934685,133.470448,163.47169299999999,1666.157752999999,2120.5969399999981,706.17769200000032]
["URY",2013,"URY_2013_MICS",155,"Tipo de servicio sanitario","Inodoro o taza turca (letrina) conectado/a a pozo permeable (perdedor)","",0.5281050260612451,0.1466299813914628,0.21545050019086801,0,0.010003485535013399,0.25917009654140938,0.1074425225204729,0.2384257029867079,0,0,3.7673795413748952,0,0,0,0.1095523771306957,"Más de 5 mil habitantes","Montevideo y Área Metropolitana","Rurales y menores de 5 mil habitantes",0.0456463043366796,0.18151081264201621,0.77192429874019775,11.360103000000001,3.153511,4.661308,0,0.21518599999999999,5.0731830000000002,2.1002770000000002,4.661308,0,0,7.3401540000000001,0,0,0,0.21518599999999999,1.9873080000000001,9.8474599999999999,7.5553400000000002]
["URY",2013,"URY_2013_MICS",156,"Tipo de servicio sanitario","Baldeo a otra parte","",2.399448162028385,0,0,0.56222907578308412,0,2.636803109329017,0,0,0.61543700666556922,0,0,0,0,0,0,"Más de 5 mil habitantes","Montevideo y Área Metropolitana","Rurales y menores de 5 mil habitantes",0,1.173286898581376,0,51.614691999999998,0,0,12.039344,0,51.614691999999998,0,0,12.039344,0,0,0,0,0,0,0,63.654035999999998,0]
["URY",2013,"URY_2013_MICS",157,"Tipo de servicio sanitario","Balde","",0.60569764111049462,0,0,0,0,0.38695468516036158,0,0,0,0,2.7996442169619988,0,0,0,0,"Más de 5 mil habitantes","Montevideo y Área Metropolitana","Rurales y menores de 5 mil habitantes",0.0330605574255965,0.1130849673313645,0.55730038071851062,13.029203000000001,0,0,0,0,7.5745310000000003,0,0,0,0,5.4546720000000004,0,0,0,0,1.4393609999999999,6.1351699999999996,5.4546720000000004]
["URY",2013,"URY_2013_MICS",158,"Tipo de servicio sanitario","No hay instalación sanitaria, va al monte, campo","",2.3321283052850199,0.038218795807149902,0.034339828695251401,0,0,2.5250028588143172,0.042048275556432702,0.038001758129385298,0,0,0.37998255452445079,0,0,0,0,"Más de 5 mil habitantes","Montevideo y Área Metropolitana","Rurales y menores de 5 mil habitantes",0.034826683075498799,0.91193327012341097,0.075639762016854503,50.16657,0.82195600000000002,0.74294800000000005,0,0,49.426233000000003,0.82195600000000002,0.74294800000000005,0,0,0.74033700000000002,0,0,0,0,1.5162530000000001,49.474884000000003,0.74033700000000002]
["URY",2013,"URY_2013_MICS",159,"Tipo de servicio sanitario","Otro","",0.73576463877030773,0.034394154282400301,0,0,0,0.47422294174741059,0.037840409313112701,0,0,0,3.358902542456156,0,0,0,0,"Más de 5 mil habitantes","Montevideo y Área Metropolitana","Rurales y menores de 5 mil habitantes",0.0169735213092841,0.17111587335485831,0.66862698280229282,15.827083,0.73970100000000005,0,0,0,9.2827829999999985,0.73970100000000005,0,0,0,6.5442999999999998,0,0,0,0,0.73897800000000002,9.2835059999999991,6.5442999999999998]
["URY",2013,"URY_2013_MICS",160,"Tipo de servicio sanitario","Missing","",0.0978567881188247,0,0,0.63177976138821512,0.54173281663586781,0.077078176549147503,0,0,0.69156979240017658,0.59593530278591111,0,0.29681820709227658,0,0,0,"Más de 5 mil habitantes","Montevideo y Área Metropolitana","Rurales y menores de 5 mil habitantes",0,0.4919700845991774,0.060915419477466301,2.1050040000000001,0,0,13.528674000000001,11.653269999999999,1.5087839999999999,0,0,13.528674000000001,11.653269999999999,0,0.59621999999999997,0,0,0,0,26.690727999999989,0.59621999999999997]