{"text_format":"1","workbook":"xlsx","n_sheets":8,"sheets":["Introduction","Water","Sanitation","Hygiene","DHS03","DHS08","DHS13","data_summary"],"not_rendered":{"charts":123,"images":76,"macros":1,"external_links":0,"defined_names":0,"comments":0,"pivot_tables":0},"unopened":[],"bounds":{"document_bytes":16777216,"sheet_cells":100000,"rows_first":2000,"rows_last":500,"rows_between":2000,"halvings":0,"cell_chars":16384,"cell_head_chars":4096},"cells_cut":0,"cells_raw":0,"read":"whole","date_system":"1900"}

{"sheet":"Introduction","index":0,"n_rows":55,"n_cols":12,"rows_kept":55,"cut":false,"hidden":false,"merged":[[112,0,112,1],[113,0,113,1],[207,0,207,1],[212,0,212,1],[213,0,213,1],[107,0,107,1],[1,0,1,1],[4,0,4,1],[5,0,5,1],[6,0,6,1],[7,0,7,1]]}
[]
[]
[]
[null,null,"Joint Monitoring Programme for Water Supply, Sanitation and Hygiene"]
[]
[null,null,"Estimates on household water, sanitation and hygiene \nby wealth quintile and sub-national region in"]
[null,null,{"$f":"+Water!B5","v":"Turkey"}]
[]
[null,null,"Updated May 2021"]
[]
[null,null,"Follow the links below to find the following information: "]
[]
[null,null,"JMP Estimates"]
[null,null,"WASH status and trends by wealth quintile \n(customized quintiles made without water and sanitation assets)"]
[null,null,"Water"]
[null,null,"Sanitation"]
[null,null,"Hygiene"]
[]
[null,null,"Data inputs"]
[null,null," customized wealth quintiles and subnational data:"]
[null,null,{"$f":"IF(INDIRECT(CONCATENATE(\"Water\",\"!B105\"))=0,\"\",INDIRECT(CONCATENATE(\"Water\",\"!B105\")))","v":"DHS03"}]
[null,null,{"$f":"IF(INDIRECT(CONCATENATE(\"Water\",\"!B106\"))=0,\"\",INDIRECT(CONCATENATE(\"Water\",\"!B106\")))","v":"DHS08"}]
[null,null,{"$f":"IF(INDIRECT(CONCATENATE(\"Water\",\"!B107\"))=0,\"\",INDIRECT(CONCATENATE(\"Water\",\"!B107\")))","v":"DHS13"}]
[null,null,{"$f":"IF(INDIRECT(CONCATENATE(\"Water\",\"!B108\"))=0,\"\",INDIRECT(CONCATENATE(\"Water\",\"!B108\")))","v":""}]
[null,null,{"$f":"IF(INDIRECT(CONCATENATE(\"Water\",\"!B109\"))=0,\"\",INDIRECT(CONCATENATE(\"Water\",\"!B109\")))","v":""}]
[null,null,{"$f":"IF(INDIRECT(CONCATENATE(\"Water\",\"!B110\"))=0,\"\",INDIRECT(CONCATENATE(\"Water\",\"!B110\")))","v":""}]
[null,null,{"$f":"IF(INDIRECT(CONCATENATE(\"Water\",\"!B111\"))=0,\"\",INDIRECT(CONCATENATE(\"Water\",\"!B111\")))","v":""}]
[null,null,{"$f":"IF(INDIRECT(CONCATENATE(\"Water\",\"!B112\"))=0,\"\",INDIRECT(CONCATENATE(\"Water\",\"!B112\")))","v":""}]
[null,null,{"$f":"IF(INDIRECT(CONCATENATE(\"Water\",\"!B113\"))=0,\"\",INDIRECT(CONCATENATE(\"Water\",\"!B113\")))","v":""}]
[null,null,{"$f":"IF(INDIRECT(CONCATENATE(\"Water\",\"!B114\"))=0,\"\",INDIRECT(CONCATENATE(\"Water\",\"!B114\")))","v":""}]
[null,null,{"$f":"IF(INDIRECT(CONCATENATE(\"Water\",\"!B115\"))=0,\"\",INDIRECT(CONCATENATE(\"Water\",\"!B115\")))","v":""}]
[null,null,{"$f":"IF(INDIRECT(CONCATENATE(\"Water\",\"!B116\"))=0,\"\",INDIRECT(CONCATENATE(\"Water\",\"!B116\")))","v":""}]
[]
[]
[]
[]
[]
[]
[]
[]
[]
[]
[]
[]
[]
[]
[]
[]
[]
[]
[]
[]
[]
[]
[null,null,null,null,null,null,null,null,null,null,null,{"$f":"+IF(ISNUMBER(M48), \"\", \"Insufficient data to estimate safely managed sanitation services at national level\")","v":"Insufficient data to estimate safely managed sanitation services at national level"}]

{"sheet":"Water","index":1,"n_rows":318,"n_cols":28,"rows_kept":318,"cut":false,"hidden":false,"merged":[[317,1,317,11],[6,9,6,16],[6,17,6,24],[6,1,6,8],[4,1,4,24],[117,1,117,11],[30,21,30,24],[32,1,33,2],[32,3,33,3],[30,17,30,20],[30,1,31,4],[30,5,30,8],[30,9,30,12],[30,13,30,16],[96,23,96,27],[35,1,36,2],[35,3,36,3],[38,1,39,2],[38,3,39,3],[96,0,97,2],[96,3,96,7],[96,8,96,12],[96,13,96,17],[96,18,96,22],[217,18,217,22],[98,0,99,1],[100,0,101,1],[196,0,197,2],[196,3,196,7],[196,8,196,12],[217,1,217,11],[3,1,3,24],[317,18,317,22],[117,18,117,22],[196,18,196,22],[296,23,296,27],[298,0,299,1],[300,0,301,1],[296,0,297,2],[296,3,296,7],[296,8,296,12],[296,13,296,17],[296,18,296,22],[196,23,196,27],[198,0,199,1],[200,0,201,1],[196,13,196,17]]}
["BGD"]
[]
[]
[null,"Summary of trends in use of drinking water by wealth quintile (%)"]
[null,{"$f":"IF(ISERROR(INDIRECT(CONCATENATE($B105,\"!A2\"))),\"\",INDIRECT(CONCATENATE($B105,\"!A2\")))","v":"Turkey"}]
[]
[null,{"$f":"B118","v":"National use of drinking water sources, 2000–2019"},null,null,null,null,null,null,null,{"$f":"B218","v":"Urban use of drinking water sources,  2000–2019"},null,null,null,null,null,null,null,{"$f":"B318","v":"Rural use of drinking water sources, 2000–2019"}]
[]
[]
[]
[]
[]
[]
[]
[]
[]
[]
[]
[]
[]
[]
[]
[]
[]
[]
[]
[]
[]
[]
[]
[null,{"$f":"IF(ISERROR(INDIRECT(CONCATENATE($B105,\"!A2\"))),\"\",INDIRECT(CONCATENATE($B105,\"!A2\")))","v":"Turkey"},null,null,null,"Poorest",null,null,null,"Poor",null,null,null,"Middle",null,null,null,"Rich",null,null,null,"Richest"]
[null,null,null,null,null,"Basic","Limited","Unimproved","Surface \n water","Basic","Limited","Unimproved","Surface \nwater","Basic","Limited","Unimproved","Surface \nwater","Basic","Limited","Unimproved","Surface \nwater","Basic","Limited","Unimproved","Surface \nwater"]
[null,"NATIONAL",null,"Estimate",{"$f":"C99","v":2000},{"$f":"E99","v":95.513575077098309},{"$f":"F99","v":1.4365019281282594},2.9489501129035602,0.10097288186986475,{"$f":"J99","v":97.115436620451604},{"$f":"K99","v":1.0263265153354595},1.538087288683883,0.32014957552905798,{"$f":"O99","v":97.389028082491592},{"$f":"P99","v":1.3894017649220545},1.1267399121148003,9.4830240471558636E-2,{"$f":"T99","v":97.253537720358466},{"$f":"U99","v":1.7326165497227748},0.95910976894906241,5.473596096969402E-2,{"$f":"Y99","v":98.28457116444352},{"$f":"Z99","v":0.53227677273736218},0.94954191966306212,0.23361014315604933]
[null,null,null,null,{"$f":"C100","v":2019},{"$f":"E100","v":96.083551909188202},1.4450742469596367,2.0044036377551748,0.46697020609698825,{"$f":"J100","v":96.873259594751104},1.0237671621416631,1.8479854007100016,0.25498784239723093,{"$f":"O100","v":97.323005813420409},1.3884598574097016,1.2009858181217652,8.7548511048125777E-2,{"$f":"T100","v":97.023747540159334},1.7285227318678233,0.99967578557104275,0.24805394240179979,{"$f":"Y100","v":98.875947793784732},0.53547947322237899,0.54116723491330276,4.740549807958061E-2]
[]
[null,"URBAN",null,"Estimate",{"$f":"C199","v":2000},{"$f":"E199","v":98.101900270707716},{"$f":"F199","v":0.83274494436936874},0.91853287977316711,0.14682190514975429,{"$f":"J199","v":98.43363601501413},{"$f":"K199","v":1.1136990855544771},0.44988434192111981,2.7805575102703983E-3,{"$f":"O199","v":98.252778357957141},{"$f":"P199","v":0.96147399673190992},0.64042711561658905,0.1453205296943644,{"$f":"T199","v":97.290364878486287},{"$f":"U199","v":1.6838077898719954},0.83443268374142576,0.19139464790029947,{"$f":"Y199","v":98.682161034680234},{"$f":"Z199","v":0.33608282660987399},0.82968244113850176,0.15207369757139233]
[null,null,null,null,{"$f":"C200","v":2019},{"$f":"E200","v":98.495661115798782},0.83608741125467234,0.52401067862986395,0.14424079431669218,{"$f":"J200","v":97.855821947297713},1.1071615743450149,0.80084551841031271,0.23617095994696058,{"$f":"O200","v":98.238269901234631},0.96133202106359261,0.65507754800741225,0.1453205296943644,{"$f":"T200","v":97.176259374916668},1.6818329618813945,0.84383320011825447,0.29807446308367425,{"$f":"Y200","v":99.327209039908226},0.33827967307759471,0.33451128701418043,0]
[]
[null,"RURAL",null,"Estimate",{"$f":"C299","v":2000},{"$f":"E299","v":91.369982776581395},{"$f":"F299","v":2.654575082941538},5.975442140477071,0,{"$f":"J299","v":93.873526950542114},{"$f":"K299","v":1.8648798318914592},3.7548984485610504,0.50669476900537092,{"$f":"O299","v":96.672274426758378},{"$f":"P299","v":1.0563546501648466},1.9057581788689362,0.36561274420783718,{"$f":"T299","v":94.635446254711312},{"$f":"U299","v":2.8387822463304979},2.3403075417093362,0.18546395724885301,{"$f":"Y299","v":95.418169752306966},{"$f":"Z299","v":1.9140332646465512},2.6356689663720658,3.2128016674416671E-2]
[null,null,null,null,{"$f":"C300","v":2019},{"$f":"E300","v":90.883826371363824},2.6404507650804017,5.4347716905893719,1.0409511729664018,{"$f":"J300","v":93.976395922158432},1.866923414110286,3.2127375500510311,0.94394311368025541,{"$f":"O300","v":96.367956203067138},1.0530293123404044,2.579014484592463,0,{"$f":"T300","v":92.3654559161034},2.7706892798194316,4.8275893354095984,3.6265468667561862E-2,{"$f":"Y300","v":95.395525800279572},1.9135790400734327,2.4900584480734977,0.20083671157350125]
[]
[]
[]
[]
[]
[]
[]
[]
[]
[]
[]
[]
[]
[]
[]
[]
[]
[]
[]
[]
[]
[]
[]
[]
[]
[]
[]
[]
[]
[]
[]
[]
[]
[]
[]
[]
[]
[]
[]
[]
[]
[]
[]
[]
[]
[]
[]
[]
[]
[]
[]
[]
[]
[]
[]
[]
["NATIONAL",null,null,"Poorest",null,null,null,null,"Poor",null,null,null,null,"Middle",null,null,null,null,"Rich",null,null,null,null,"Richest"]
[null,null,null,"Improved","Basic","Limited","Unimproved","Surface water","Improved","Basic","Limited","Unimproved","Surface water","Improved","Basic","Limited","Unimproved","Surface water","Improved","Basic","Limited","Unimproved","Surface water","Improved","Basic","Limited","Unimproved","Surface water"]
["Forecast period:",null,2000,{"$f":"IF((D101+H101)>100,D101*100/(D101+H101),D101)","v":96.950077005226561},{"$f":"D99*AVERAGEIF(E105:E116,\">0\")/100","v":95.513575077098309},{"$f":"D99*(100-AVERAGEIF(E105:E116,\">0\"))/100","v":1.4365019281282594},{"$f":"100-(E99+F99+H99)","v":2.9489501129035602},{"$f":"IF((D101+H101)>100,H101*100/(D101+H101),H101)","v":0.10097288186986475},{"$f":"IF((I101+M101)>100,I101*100/(I101+M101),I101)","v":98.141763135787059},{"$f":"I99*AVERAGEIF(J105:J116,\">0\")/100","v":97.115436620451604},{"$f":"I99*(100-AVERAGEIF(J105:J116,\">0\"))/100","v":1.0263265153354595},{"$f":"100-(J99+K99+M99)","v":1.538087288683883},{"$f":"IF((I101+M101)>100,M101*100/(I101+M101),M101)","v":0.32014957552905798},{"$f":"IF((N101+R101)>100,N101*100/(N101+R101),N101)","v":98.778429847413634},{"$f":"N99*AVERAGEIF(O105:O116,\">0\")/100","v":97.389028082491592},{"$f":"N99*(100-AVERAGEIF(O105:O116,\">0\"))/100","v":1.3894017649220545},{"$f":"100-(O99+P99+R99)","v":1.1267399121148003},{"$f":"IF((N101+R101)>100,R101*100/(N101+R101),R101)","v":9.4830240471558636E-2},{"$f":"IF((S101+W101)>100,S101*100/(S101+W101),S101)","v":98.986154270081244},{"$f":"S99*AVERAGEIF(T105:T116,\">0\")/100","v":97.253537720358466},{"$f":"S99*(100-AVERAGEIF(T105:T116,\">0\"))/100","v":1.7326165497227748},{"$f":"100-(T99+U99+W99)","v":0.95910976894906241},{"$f":"IF((S101+W101)>100,W101*100/(S101+W101),W101)","v":5.473596096969402E-2},{"$f":"IF((X101+AB101)>100,X101*100/(X101+AB101),X101)","v":98.816847937180881},{"$f":"X99*AVERAGEIF(Y105:Y116,\">0\")/100","v":98.28457116444352},{"$f":"X99*(100-AVERAGEIF(Y105:Y116,\">0\"))/100","v":0.53227677273736218},{"$f":"100-(Y99+Z99+AB99)","v":0.94954191966306212},{"$f":"IF((X101+AB101)>100,AB101*100/(X101+AB101),AB101)","v":0.23361014315604933}]
[null,null,2019,{"$f":"IF((D102+H102)>100,D102*100/(D102+H102),D102)","v":97.528626156147837},{"$f":"D100*AVERAGEIF(E105:E116,\">0\")/100","v":96.083551909188202},{"$f":"D100*(100-AVERAGEIF(E105:E116,\">0\"))/100","v":1.4450742469596367},{"$f":"100-(E100+F100+H100)","v":2.0044036377551748},{"$f":"IF((D102+H102)>100,H102*100/(D102+H102),H102)","v":0.46697020609698825},{"$f":"IF((I102+M102)>100,I102*100/(I102+M102),I102)","v":97.897026756892771},{"$f":"I100*AVERAGEIF(J105:J116,\">0\")/100","v":96.873259594751104},{"$f":"I100*(100-AVERAGEIF(J105:J116,\">0\"))/100","v":1.0237671621416631},{"$f":"100-(J100+K100+M100)","v":1.8479854007100016},{"$f":"IF((I102+M102)>100,M102*100/(I102+M102),M102)","v":0.25498784239723093},{"$f":"IF((N102+R102)>100,N102*100/(N102+R102),N102)","v":98.711465670830108},{"$f":"N100*AVERAGEIF(O105:O116,\">0\")/100","v":97.323005813420409},{"$f":"N100*(100-AVERAGEIF(O105:O116,\">0\"))/100","v":1.3884598574097016},{"$f":"100-(O100+P100+R100)","v":1.2009858181217652},{"$f":"IF((N102+R102)>100,R102*100/(N102+R102),R102)","v":8.7548511048125777E-2},{"$f":"IF((S102+W102)>100,S102*100/(S102+W102),S102)","v":98.752270272027147},{"$f":"S100*AVERAGEIF(T105:T116,\">0\")/100","v":97.023747540159334},{"$f":"S100*(100-AVERAGEIF(T105:T116,\">0\"))/100","v":1.7285227318678233},{"$f":"100-(T100+U100+W100)","v":0.99967578557104275},{"$f":"IF((S102+W102)>100,W102*100/(S102+W102),W102)","v":0.24805394240179979},{"$f":"IF((X102+AB102)>100,X102*100/(X102+AB102),X102)","v":99.411427267007099},{"$f":"X100*AVERAGEIF(Y105:Y116,\">0\")/100","v":98.875947793784732},{"$f":"X100*(100-AVERAGEIF(Y105:Y116,\">0\"))/100","v":0.53547947322237899},{"$f":"100-(Y100+Z100+AB100)","v":0.54116723491330276},{"$f":"IF((X102+AB102)>100,AB102*100/(X102+AB102),AB102)","v":4.740549807958061E-2}]
["Regression period:",null,{"$f":"MinRegYear(C99,C105:C116)","v":2001},{"$f":"IF(MAX(C105:C116)-MIN(C105:C116)<5,AVERAGEIF(C105:C116,\">0\",D105:D116),\nIF(FORECAST($C101,D$105:D$116,$C$105:$C$116)<0,0,\nIF(FORECAST($C101,D$105:D$116,$C$105:$C$116)>100,100,\nFORECAST($C101,D$105:D$116,$C$105:$C$116))))","v":96.950077005226561},null,null,null,{"$f":"IF(MAX(C105:C116)-MIN(C105:C116)<5,AVERAGEIF(C105:C116,\">0\",H105:H116),\nIF(FORECAST($C101,H$105:H$116,$C$105:$C$116)<0,0,\nIF(FORECAST($C101,H$105:H$116,$C$105:$C$116)>100,100,\nFORECAST($C101,H$105:H$116,$C$105:$C$116))))","v":0.10097288186986475},{"$f":"IF(MAX(C105:C116)-MIN(C105:C116)<5,AVERAGEIF(C105:C116,\">0\",I105:I116),\nIF(FORECAST($C101,I$105:I$116,$C$105:$C$116)<0,0,\nIF(FORECAST($C101,I$105:I$116,$C$105:$C$116)>100,100,\nFORECAST($C101,I$105:I$116,$C$105:$C$116))))","v":98.141763135787059},null,null,null,{"$f":"IF(MAX(C105:C116)-MIN(C105:C116)<5,AVERAGEIF(C105:C116,\">0\",M105:M116),\nIF(FORECAST($C101,M$105:M$116,$C$105:$C$116)<0,0,\nIF(FORECAST($C101,M$105:M$116,$C$105:$C$116)>100,100,\nFORECAST($C101,M$105:M$116,$C$105:$C$116))))","v":0.32014957552905798},{"$f":"IF(MAX(C105:C116)-MIN(C105:C116)<5,AVERAGEIF(C105:C116,\">0\",N105:N116),\nIF(FORECAST($C101,N$105:N$116,$C$105:$C$116)<0,0,\nIF(FORECAST($C101,N$105:N$116,$C$105:$C$116)>100,100,\nFORECAST($C101,N$105:N$116,$C$105:$C$116))))","v":98.778429847413634},null,null,null,{"$f":"IF(MAX(C105:C116)-MIN(C105:C116)<5,AVERAGEIF(C105:C116,\">0\",R105:R116),\nIF(FORECAST($C101,R$105:R$116,$C$105:$C$116)<0,0,\nIF(FORECAST($C101,R$105:R$116,$C$105:$C$116)>100,100,\nFORECAST($C101,R$105:R$116,$C$105:$C$116))))","v":9.4830240471558636E-2},{"$f":"IF(MAX(C105:C116)-MIN(C105:C116)<5,AVERAGEIF(C105:C116,\">0\",S105:S116),\nIF(FORECAST($C101,S$105:S$116,$C$105:$C$116)<0,0,\nIF(FORECAST($C101,S$105:S$116,$C$105:$C$116)>100,100,\nFORECAST($C101,S$105:S$116,$C$105:$C$116))))","v":98.986154270081244},null,null,null,{"$f":"IF(MAX(C105:C116)-MIN(C105:C116)<5,AVERAGEIF(C105:C116,\">0\",W105:W116),\nIF(FORECAST($C101,W$105:W$116,$C$105:$C$116)<0,0,\nIF(FORECAST($C101,W$105:W$116,$C$105:$C$116)>100,100,\nFORECAST($C101,W$105:W$116,$C$105:$C$116))))","v":5.473596096969402E-2},{"$f":"IF(MAX(C105:C116)-MIN(C105:C116)<5,AVERAGEIF(C105:C116,\">0\",X105:X116),\nIF(FORECAST($C101,X$105:X$116,$C$105:$C$116)<0,0,\nIF(FORECAST($C101,X$105:X$116,$C$105:$C$116)>100,100,\nFORECAST($C101,X$105:X$116,$C$105:$C$116))))","v":98.816847937180881},null,null,null,{"$f":"IF(MAX(C105:C116)-MIN(C105:C116)<5,AVERAGEIF(C105:C116,\">0\",AB105:AB116),\nIF(FORECAST($C101,AB$105:AB$116,$C$105:$C$116)<0,0,\nIF(FORECAST($C101,AB$105:AB$116,$C$105:$C$116)>100,100,\nFORECAST($C101,AB$105:AB$116,$C$105:$C$116))))","v":0.23361014315604933}]
[null,null,{"$f":"MaxRegYear(C100,C105:C116)","v":2015},{"$f":"IF(MAX(C105:C116)-MIN(C105:C116)<5,AVERAGEIF(C105:C116,\">0\",D105:D116),\nIF(FORECAST($C102,D$105:D$116,$C$105:$C$116)<0,0,\nIF(FORECAST($C102,D$105:D$116,$C$105:$C$116)>100,100,\nFORECAST($C102,D$105:D$116,$C$105:$C$116))))","v":97.528626156147837},null,null,null,{"$f":"IF(MAX(C105:C116)-MIN(C105:C116)<5,AVERAGEIF(C105:C116,\">0\",H105:H116),\nIF(FORECAST($C102,H$105:H$116,$C$105:$C$116)<0,0,\nIF(FORECAST($C102,H$105:H$116,$C$105:$C$116)>100,100,\nFORECAST($C102,H$105:H$116,$C$105:$C$116))))","v":0.46697020609698825},{"$f":"IF(MAX(C105:C116)-MIN(C105:C116)<5,AVERAGEIF(C105:C116,\">0\",I105:I116),\nIF(FORECAST($C102,I$105:I$116,$C$105:$C$116)<0,0,\nIF(FORECAST($C102,I$105:I$116,$C$105:$C$116)>100,100,\nFORECAST($C102,I$105:I$116,$C$105:$C$116))))","v":97.897026756892771},null,null,null,{"$f":"IF(MAX(C105:C116)-MIN(C105:C116)<5,AVERAGEIF(C105:C116,\">0\",M105:M116),\nIF(FORECAST($C102,M$105:M$116,$C$105:$C$116)<0,0,\nIF(FORECAST($C102,M$105:M$116,$C$105:$C$116)>100,100,\nFORECAST($C102,M$105:M$116,$C$105:$C$116))))","v":0.25498784239723093},{"$f":"IF(MAX(C105:C116)-MIN(C105:C116)<5,AVERAGEIF(C105:C116,\">0\",N105:N116),\nIF(FORECAST($C102,N$105:N$116,$C$105:$C$116)<0,0,\nIF(FORECAST($C102,N$105:N$116,$C$105:$C$116)>100,100,\nFORECAST($C102,N$105:N$116,$C$105:$C$116))))","v":98.711465670830108},null,null,null,{"$f":"IF(MAX(C105:C116)-MIN(C105:C116)<5,AVERAGEIF(C105:C116,\">0\",R105:R116),\nIF(FORECAST($C102,R$105:R$116,$C$105:$C$116)<0,0,\nIF(FORECAST($C102,R$105:R$116,$C$105:$C$116)>100,100,\nFORECAST($C102,R$105:R$116,$C$105:$C$116))))","v":8.7548511048125777E-2},{"$f":"IF(MAX(C105:C116)-MIN(C105:C116)<5,AVERAGEIF(C105:C116,\">0\",S105:S116),\nIF(FORECAST($C102,S$105:S$116,$C$105:$C$116)<0,0,\nIF(FORECAST($C102,S$105:S$116,$C$105:$C$116)>100,100,\nFORECAST($C102,S$105:S$116,$C$105:$C$116))))","v":98.752270272027147},null,null,null,{"$f":"IF(MAX(C105:C116)-MIN(C105:C116)<5,AVERAGEIF(C105:C116,\">0\",W105:W116),\nIF(FORECAST($C102,W$105:W$116,$C$105:$C$116)<0,0,\nIF(FORECAST($C102,W$105:W$116,$C$105:$C$116)>100,100,\nFORECAST($C102,W$105:W$116,$C$105:$C$116))))","v":0.24805394240179979},{"$f":"IF(MAX(C105:C116)-MIN(C105:C116)<5,AVERAGEIF(C105:C116,\">0\",X105:X116),\nIF(FORECAST($C102,X$105:X$116,$C$105:$C$116)<0,0,\nIF(FORECAST($C102,X$105:X$116,$C$105:$C$116)>100,100,\nFORECAST($C102,X$105:X$116,$C$105:$C$116))))","v":99.411427267007099},null,null,null,{"$f":"IF(MAX(C105:C116)-MIN(C105:C116)<5,AVERAGEIF(C105:C116,\">0\",AB105:AB116),\nIF(FORECAST($C102,AB$105:AB$116,$C$105:$C$116)<0,0,\nIF(FORECAST($C102,AB$105:AB$116,$C$105:$C$116)>100,100,\nFORECAST($C102,AB$105:AB$116,$C$105:$C$116))))","v":4.740549807958061E-2}]
[]
[null,"Survey","Year","Improved","% Improved\n< = 30min",null,null,"Surface water","Improved","% Improved\n< = 30min",null,null,"Surface water","Improved","% Improved\n< = 30min",null,null,"Surface water","Improved","% Improved\n< = 30min",null,null,"Surface water","Improved","% Improved\n< = 30min",null,null,"Surface water"]
[null,"DHS03",2003,{"$f":"IF(ISERROR(INDIRECT(CONCATENATE($B105,\"!C16\"))),\"\",INDIRECT(CONCATENATE($B105,\"!C16\")))","v":97.555629554731894},{"$f":"IF(ISERROR(INDIRECT(CONCATENATE($B105,\"!C23\"))),\"\",INDIRECT(CONCATENATE($B105,\"!C23\")))","v":"N/A"},null,null,{"$f":"IF(ISERROR(INDIRECT(CONCATENATE($B105,\"!C21\"))),\"\",INDIRECT(CONCATENATE($B105,\"!C21\")))","v":8.207174397730814E-2},{"$f":"IF(ISERROR(INDIRECT(CONCATENATE($B105,\"!D16\"))),\"\",INDIRECT(CONCATENATE($B105,\"!D16\")))","v":98.808118674616821},{"$f":"IF(ISERROR(INDIRECT(CONCATENATE($B105,\"!D23\"))),\"\",INDIRECT(CONCATENATE($B105,\"!D23\")))","v":"N/A"},null,null,{"$f":"IF(ISERROR(INDIRECT(CONCATENATE($B105,\"!D21\"))),\"\",INDIRECT(CONCATENATE($B105,\"!D21\")))","v":0.14661406266738236},{"$f":"IF(ISERROR(INDIRECT(CONCATENATE($B105,\"!E16\"))),\"\",INDIRECT(CONCATENATE($B105,\"!E16\")))","v":99.463235841763733},{"$f":"IF(ISERROR(INDIRECT(CONCATENATE($B105,\"!E23\"))),\"\",INDIRECT(CONCATENATE($B105,\"!E23\")))","v":"N/A"},null,null,{"$f":"IF(ISERROR(INDIRECT(CONCATENATE($B105,\"!E21\"))),\"\",INDIRECT(CONCATENATE($B105,\"!E21\")))","v":3.4642055643691293E-2},{"$f":"IF(ISERROR(INDIRECT(CONCATENATE($B105,\"!F16\"))),\"\",INDIRECT(CONCATENATE($B105,\"!F16\")))","v":99.665710822409096},{"$f":"IF(ISERROR(INDIRECT(CONCATENATE($B105,\"!F23\"))),\"\",INDIRECT(CONCATENATE($B105,\"!F23\")))","v":"N/A"},null,null,{"$f":"IF(ISERROR(INDIRECT(CONCATENATE($B105,\"!F21\"))),\"\",INDIRECT(CONCATENATE($B105,\"!F21\")))","v":0},{"$f":"IF(ISERROR(INDIRECT(CONCATENATE($B105,\"!G16\"))),\"\",INDIRECT(CONCATENATE($B105,\"!G16\")))","v":99.383093636468743},{"$f":"IF(ISERROR(INDIRECT(CONCATENATE($B105,\"!G23\"))),\"\",INDIRECT(CONCATENATE($B105,\"!G23\")))","v":"N/A"},null,null,{"$f":"IF(ISERROR(INDIRECT(CONCATENATE($B105,\"!G221\"))),\"\",INDIRECT(CONCATENATE($B105,\"!G21\")))","v":0.13300331791176365}]
[null,"DHS08",2008,96.193546239082622,"N/A",null,null,0.42634448383342433,96.61675918899634,"N/A",null,null,0.61602209664882912,97.356203148540658,"N/A",null,null,0.20948525129459594,97.443275166954521,"N/A",null,null,0.31610058260572793,98.151526012040065,"N/A",null,null,0.28852014394168896]
[null,"DHS13",2013,97.968878948247095,98.518307594484099,null,null,0.3434984041395408,98.633306975406612,98.954240801731416,null,null,0.10006996757321958,99.415404287061222,98.593415822595773,null,null,2.9440820341239349E-2,99.498650823799025,98.249637474554902,null,null,0.13808427245150456,99.80779315777319,99.461350180815586,null,null,0]
[null,null,null,"","",null,null,"","","",null,null,"","","",null,null,"","","",null,null,"","","",null,null,""]
[null,null,null,"","",null,null,"","","",null,null,"","","",null,null,"","","",null,null,"","","",null,null,""]
[null,null,null,"","",null,null,"","","",null,null,"","","",null,null,"","","",null,null,"","","",null,null,""]
[null,null,null,{"$f":"IF(ISERROR(INDIRECT(CONCATENATE($B111,\"!C16\"))),\"\",INDIRECT(CONCATENATE($B111,\"!C16\")))","v":""},{"$f":"IF(ISERROR(INDIRECT(CONCATENATE($B111,\"!C23\"))),\"\",INDIRECT(CONCATENATE($B111,\"!C23\")))","v":""},null,null,{"$f":"IF(ISERROR(INDIRECT(CONCATENATE($B111,\"!C21\"))),\"\",INDIRECT(CONCATENATE($B111,\"!C21\")))","v":""},{"$f":"IF(ISERROR(INDIRECT(CONCATENATE($B111,\"!D16\"))),\"\",INDIRECT(CONCATENATE($B111,\"!D16\")))","v":""},{"$f":"IF(ISERROR(INDIRECT(CONCATENATE($B111,\"!D23\"))),\"\",INDIRECT(CONCATENATE($B111,\"!D23\")))","v":""},null,null,{"$f":"IF(ISERROR(INDIRECT(CONCATENATE($B111,\"!D21\"))),\"\",INDIRECT(CONCATENATE($B111,\"!D21\")))","v":""},{"$f":"IF(ISERROR(INDIRECT(CONCATENATE($B111,\"!E16\"))),\"\",INDIRECT(CONCATENATE($B111,\"!E16\")))","v":""},{"$f":"IF(ISERROR(INDIRECT(CONCATENATE($B111,\"!E23\"))),\"\",INDIRECT(CONCATENATE($B111,\"!E23\")))","v":""},null,null,{"$f":"IF(ISERROR(INDIRECT(CONCATENATE($B111,\"!E21\"))),\"\",INDIRECT(CONCATENATE($B111,\"!E21\")))","v":""},{"$f":"IF(ISERROR(INDIRECT(CONCATENATE($B111,\"!F16\"))),\"\",INDIRECT(CONCATENATE($B111,\"!F16\")))","v":""},{"$f":"IF(ISERROR(INDIRECT(CONCATENATE($B111,\"!F23\"))),\"\",INDIRECT(CONCATENATE($B111,\"!F23\")))","v":""},null,null,{"$f":"IF(ISERROR(INDIRECT(CONCATENATE($B111,\"!F21\"))),\"\",INDIRECT(CONCATENATE($B111,\"!F21\")))","v":""},{"$f":"IF(ISERROR(INDIRECT(CONCATENATE($B111,\"!G16\"))),\"\",INDIRECT(CONCATENATE($B111,\"!G16\")))","v":""},{"$f":"IF(ISERROR(INDIRECT(CONCATENATE($B111,\"!G23\"))),\"\",INDIRECT(CONCATENATE($B111,\"!G23\")))","v":""},null,null,{"$f":"IF(ISERROR(INDIRECT(CONCATENATE($B111,\"!G221\"))),\"\",INDIRECT(CONCATENATE($B111,\"!G21\")))","v":""}]
[null,null,null,{"$f":"IF(ISERROR(INDIRECT(CONCATENATE($B112,\"!C16\"))),\"\",INDIRECT(CONCATENATE($B112,\"!C16\")))","v":""},{"$f":"IF(ISERROR(INDIRECT(CONCATENATE($B112,\"!C23\"))),\"\",INDIRECT(CONCATENATE($B112,\"!C23\")))","v":""},null,null,{"$f":"IF(ISERROR(INDIRECT(CONCATENATE($B112,\"!C21\"))),\"\",INDIRECT(CONCATENATE($B112,\"!C21\")))","v":""},{"$f":"IF(ISERROR(INDIRECT(CONCATENATE($B112,\"!D16\"))),\"\",INDIRECT(CONCATENATE($B112,\"!D16\")))","v":""},{"$f":"IF(ISERROR(INDIRECT(CONCATENATE($B112,\"!D23\"))),\"\",INDIRECT(CONCATENATE($B112,\"!D23\")))","v":""},null,null,{"$f":"IF(ISERROR(INDIRECT(CONCATENATE($B112,\"!D21\"))),\"\",INDIRECT(CONCATENATE($B112,\"!D21\")))","v":""},{"$f":"IF(ISERROR(INDIRECT(CONCATENATE($B112,\"!E16\"))),\"\",INDIRECT(CONCATENATE($B112,\"!E16\")))","v":""},{"$f":"IF(ISERROR(INDIRECT(CONCATENATE($B112,\"!E23\"))),\"\",INDIRECT(CONCATENATE($B112,\"!E23\")))","v":""},null,null,{"$f":"IF(ISERROR(INDIRECT(CONCATENATE($B112,\"!E21\"))),\"\",INDIRECT(CONCATENATE($B112,\"!E21\")))","v":""},{"$f":"IF(ISERROR(INDIRECT(CONCATENATE($B112,\"!F16\"))),\"\",INDIRECT(CONCATENATE($B112,\"!F16\")))","v":""},{"$f":"IF(ISERROR(INDIRECT(CONCATENATE($B112,\"!F23\"))),\"\",INDIRECT(CONCATENATE($B112,\"!F23\")))","v":""},null,null,{"$f":"IF(ISERROR(INDIRECT(CONCATENATE($B112,\"!F21\"))),\"\",INDIRECT(CONCATENATE($B112,\"!F21\")))","v":""},{"$f":"IF(ISERROR(INDIRECT(CONCATENATE($B112,\"!G16\"))),\"\",INDIRECT(CONCATENATE($B112,\"!G16\")))","v":""},{"$f":"IF(ISERROR(INDIRECT(CONCATENATE($B112,\"!G23\"))),\"\",INDIRECT(CONCATENATE($B112,\"!G23\")))","v":""},null,null,{"$f":"IF(ISERROR(INDIRECT(CONCATENATE($B112,\"!G221\"))),\"\",INDIRECT(CONCATENATE($B112,\"!G21\")))","v":""}]
[null,null,null,"","",null,null,"","","",null,null,"","","",null,null,"","","",null,null,"","","",null,null,""]
[null,null,null,"","",null,null,"","","",null,null,"","","",null,null,"","","",null,null,"","","",null,null,""]
[null,null,null,"","",null,null,"","","",null,null,"","","",null,null,"","","",null,null,"","","",null,null,""]
[null,null,null,"","",null,null,"","","",null,null,"","","",null,null,"","","",null,null,"","","",null,null,""]
[]
[null,{"$f":"CONCATENATE(\"National use of drinking water sources, \",C99,\"–\",C100)","v":"National use of drinking water sources, 2000–2019"},null,null,null,null,null,null,null,null,null,null,null,null,null,null,null,null,"Data points used for regression"]
[]
[]
[]
[]
[]
[]
[]
[]
[]
[]
[]
[]
[]
[]
[]
[]
[]
[]
[]
[]
[]
[]
[]
[]
[]
[]
[]
[]
[]
[]
[]
[]
[]
[]
[null,null,null,null,{"$f":"IF(ISERROR(INDIRECT(CONCATENATE($B153,\"!M18\"))),\"\",INDIRECT(CONCATENATE($B153,\"!M18\")))","v":""},{"$f":"IF(ISERROR(INDIRECT(CONCATENATE($B153,\"!M19\"))),\"\",INDIRECT(CONCATENATE($B153,\"!M19\")))","v":""},{"$f":"IF(ISERROR(INDIRECT(CONCATENATE($B153,\"!M20\"))),\"\",INDIRECT(CONCATENATE($B153,\"!M20\")))","v":""},{"$f":"IF(ISERROR(INDIRECT(CONCATENATE($B153,\"!M21\"))),\"\",INDIRECT(CONCATENATE($B153,\"!M21\")))","v":""},null,{"$f":"IF(ISERROR(INDIRECT(CONCATENATE($B153,\"!N18\"))),\"\",INDIRECT(CONCATENATE($B153,\"!N18\")))","v":""},{"$f":"IF(ISERROR(INDIRECT(CONCATENATE($B153,\"!N19\"))),\"\",INDIRECT(CONCATENATE($B153,\"!N19\")))","v":""},{"$f":"IF(ISERROR(INDIRECT(CONCATENATE($B153,\"!N20\"))),\"\",INDIRECT(CONCATENATE($B153,\"!N20\")))","v":""},{"$f":"IF(ISERROR(INDIRECT(CONCATENATE($B153,\"!N21\"))),\"\",INDIRECT(CONCATENATE($B153,\"!N21\")))","v":""},null,{"$f":"IF(ISERROR(INDIRECT(CONCATENATE($B153,\"!O18\"))),\"\",INDIRECT(CONCATENATE($B153,\"!O18\")))","v":""},{"$f":"IF(ISERROR(INDIRECT(CONCATENATE($B153,\"!O19\"))),\"\",INDIRECT(CONCATENATE($B153,\"!O19\")))","v":""},{"$f":"IF(ISERROR(INDIRECT(CONCATENATE($B153,\"!O20\"))),\"\",INDIRECT(CONCATENATE($B153,\"!O20\")))","v":""},{"$f":"IF(ISERROR(INDIRECT(CONCATENATE($B153,\"!O21\"))),\"\",INDIRECT(CONCATENATE($B153,\"!O21\")))","v":""},null,{"$f":"IF(ISERROR(INDIRECT(CONCATENATE($B153,\"!P18\"))),\"\",INDIRECT(CONCATENATE($B153,\"!P18\")))","v":""},{"$f":"IF(ISERROR(INDIRECT(CONCATENATE($B153,\"!P19\"))),\"\",INDIRECT(CONCATENATE($B153,\"!P19\")))","v":""},{"$f":"IF(ISERROR(INDIRECT(CONCATENATE($B153,\"!P20\"))),\"\",INDIRECT(CONCATENATE($B153,\"!P20\")))","v":""},{"$f":"IF(ISERROR(INDIRECT(CONCATENATE($B153,\"!P21\"))),\"\",INDIRECT(CONCATENATE($B153,\"!P21\")))","v":""},null,{"$f":"IF(ISERROR(INDIRECT(CONCATENATE($B153,\"!Q18\"))),\"\",INDIRECT(CONCATENATE($B153,\"!Q18\")))","v":""},{"$f":"IF(ISERROR(INDIRECT(CONCATENATE($B153,\"!Q19\"))),\"\",INDIRECT(CONCATENATE($B153,\"!Q19\")))","v":""},{"$f":"IF(ISERROR(INDIRECT(CONCATENATE($B153,\"!Q20\"))),\"\",INDIRECT(CONCATENATE($B153,\"!Q20\")))","v":""},{"$f":"IF(ISERROR(INDIRECT(CONCATENATE($B153,\"!Q21\"))),\"\",INDIRECT(CONCATENATE($B153,\"!Q1\")))","v":""}]
[null,null,null,null,"","","","",null,"","","","",null,"","","","",null,"","","","",null,"","","",""]
[null,null,null,null,"","","","",null,"","","","",null,"","","","",null,"","","","",null,"","","",""]
[null,null,null,null,"","","","",null,"","","","",null,"","","","",null,"","","","",null,"","","",""]
[null,null,null,null,"","","","",null,"","","","",null,"","","","",null,"","","","",null,"","","",""]
[null,null,null,null,"","","","",null,"","","","",null,"","","","",null,"","","","",null,"","","",""]
[]
[]
[]
[]
[]
[]
[]
[]
[]
[]
[]
[]
[]
[]
[]
[]
[]
[]
[]
[]
[]
[]
[]
[]
[]
[]
[]
[]
[]
[]
[]
[]
[]
[]
[]
[]
[]
[]
["URBAN",null,null,"Poorest",null,null,null,null,"Poor",null,null,null,null,"Middle",null,null,null,null,"Rich",null,null,null,null,"Richest"]
[null,null,null,"Improved","Basic","Limited","Unimproved","Surface water","Improved","Basic","Limited","Unimproved","Surface water","Improved","Basic","Limited","Unimproved","Surface water","Improved","Basic","Limited","Unimproved","Surface water","Improved","Basic","Limited","Unimproved","Surface water"]
["Forecast period:",null,2000,{"$f":"IF((D201+H201)>100,D201*100/(D201+H201),D201)","v":98.934645215077083},{"$f":"D199*AVERAGEIF(E205:E216,\">0\")/100","v":98.101900270707716},{"$f":"D199*(100-AVERAGEIF(E205:E216,\">0\"))/100","v":0.83274494436936874},{"$f":"100-(E199+F199+H199)","v":0.91853287977316711},{"$f":"IF((D201+H201)>100,H201*100/(D201+H201),H201)","v":0.14682190514975429},{"$f":"IF((I201+M201)>100,I201*100/(I201+M201),I201)","v":99.547335100568603},{"$f":"I199*AVERAGEIF(J205:J216,\">0\")/100","v":98.43363601501413},{"$f":"I199*(100-AVERAGEIF(J205:J216,\">0\"))/100","v":1.1136990855544771},{"$f":"100-(J199+K199+M199)","v":0.44988434192111981},{"$f":"IF((I201+M201)>100,M201*100/(I201+M201),M201)","v":2.7805575102703983E-3},{"$f":"IF((N201+R201)>100,N201*100/(N201+R201),N201)","v":99.214252354689052},{"$f":"N199*AVERAGEIF(O205:O216,\">0\")/100","v":98.252778357957141},{"$f":"N199*(100-AVERAGEIF(O205:O216,\">0\"))/100","v":0.96147399673190992},{"$f":"100-(O199+P199+R199)","v":0.64042711561658905},{"$f":"IF((N201+R201)>100,R201*100/(N201+R201),R201)","v":0.1453205296943644},{"$f":"IF((S201+W201)>100,S201*100/(S201+W201),S201)","v":98.974172668358278},{"$f":"S199*AVERAGEIF(T205:T216,\">0\")/100","v":97.290364878486287},{"$f":"S199*(100-AVERAGEIF(T205:T216,\">0\"))/100","v":1.6838077898719954},{"$f":"100-(T199+U199+W199)","v":0.83443268374142576},{"$f":"IF((S201+W201)>100,W201*100/(S201+W201),W201)","v":0.19139464790029947},{"$f":"IF((X201+AB201)>100,X201*100/(X201+AB201),X201)","v":99.018243861290102},{"$f":"X199*AVERAGEIF(Y205:Y216,\">0\")/100","v":98.682161034680234},{"$f":"X199*(100-AVERAGEIF(Y205:Y216,\">0\"))/100","v":0.33608282660987399},{"$f":"100-(Y199+Z199+AB199)","v":0.82968244113850176},{"$f":"IF((X201+AB201)>100,AB201*100/(X201+AB201),AB201)","v":0.15207369757139233}]
[null,null,2019,{"$f":"IF((D202+H202)>100,D202*100/(D202+H202),D202)","v":99.331748527053449},{"$f":"D200*AVERAGEIF(E205:E216,\">0\")/100","v":98.495661115798782},{"$f":"D200*(100-AVERAGEIF(E205:E216,\">0\"))/100","v":0.83608741125467234},{"$f":"100-(E200+F200+H200)","v":0.52401067862986395},{"$f":"IF((D202+H202)>100,H202*100/(D202+H202),H202)","v":0.14424079431669218},{"$f":"IF((I202+M202)>100,I202*100/(I202+M202),I202)","v":98.962983521642741},{"$f":"I200*AVERAGEIF(J205:J216,\">0\")/100","v":97.855821947297713},{"$f":"I200*(100-AVERAGEIF(J205:J216,\">0\"))/100","v":1.1071615743450149},{"$f":"100-(J200+K200+M200)","v":0.80084551841031271},{"$f":"IF((I202+M202)>100,M202*100/(I202+M202),M202)","v":0.23617095994696058},{"$f":"IF((N202+R202)>100,N202*100/(N202+R202),N202)","v":99.199601922298228},{"$f":"N200*AVERAGEIF(O205:O216,\">0\")/100","v":98.238269901234631},{"$f":"N200*(100-AVERAGEIF(O205:O216,\">0\"))/100","v":0.96133202106359261},{"$f":"100-(O200+P200+R200)","v":0.65507754800741225},{"$f":"IF((N202+R202)>100,R202*100/(N202+R202),R202)","v":0.1453205296943644},{"$f":"IF((S202+W202)>100,S202*100/(S202+W202),S202)","v":98.858092336798052},{"$f":"S200*AVERAGEIF(T205:T216,\">0\")/100","v":97.176259374916668},{"$f":"S200*(100-AVERAGEIF(T205:T216,\">0\"))/100","v":1.6818329618813945},{"$f":"100-(T200+U200+W200)","v":0.84383320011825447},{"$f":"IF((S202+W202)>100,W202*100/(S202+W202),W202)","v":0.29807446308367425},{"$f":"IF((X202+AB202)>100,X202*100/(X202+AB202),X202)","v":99.66548871298582},{"$f":"X200*AVERAGEIF(Y205:Y216,\">0\")/100","v":99.327209039908226},{"$f":"X200*(100-AVERAGEIF(Y205:Y216,\">0\"))/100","v":0.33827967307759471},{"$f":"100-(Y200+Z200+AB200)","v":0.33451128701418043},{"$f":"IF((X202+AB202)>100,AB202*100/(X202+AB202),AB202)","v":0}]
["Regression period:",null,{"$f":"MinRegYear(C199,C205:C216)","v":2001},{"$f":"IF(MAX(C205:C216)-MIN(C205:C216)<5,AVERAGEIF(C205:C216,\">0\",D205:D216),\nIF(FORECAST($C201,D$205:D$216,$C$205:$C$216)<0,0,\nIF(FORECAST($C201,D$205:D$216,$C$205:$C$216)>100,100,\nFORECAST($C201,D$205:D$216,$C$205:$C$216))))","v":98.934645215077083},null,null,null,{"$f":"IF(MAX(C205:C216)-MIN(C205:C216)<5,AVERAGEIF(C205:C216,\">0\",H205:H216),\nIF(FORECAST($C201,H$205:H$216,$C$205:$C$216)<0,0,\nIF(FORECAST($C201,H$205:H$216,$C$205:$C$216)>100,100,\nFORECAST($C201,H$205:H$216,$C$205:$C$216))))","v":0.14682190514975429},{"$f":"IF(MAX(C205:C216)-MIN(C205:C216)<5,AVERAGEIF(C205:C216,\">0\",I205:I216),\nIF(FORECAST($C201,I$205:I$216,$C$205:$C$216)<0,0,\nIF(FORECAST($C201,I$205:I$216,$C$205:$C$216)>100,100,\nFORECAST($C201,I$205:I$216,$C$205:$C$216))))","v":99.547335100568603},null,null,null,{"$f":"IF(MAX(C205:C216)-MIN(C205:C216)<5,AVERAGEIF(C205:C216,\">0\",M205:M216),\nIF(FORECAST($C201,M$205:M$216,$C$205:$C$216)<0,0,\nIF(FORECAST($C201,M$205:M$216,$C$205:$C$216)>100,100,\nFORECAST($C201,M$205:M$216,$C$205:$C$216))))","v":2.7805575102703983E-3},{"$f":"IF(MAX(C205:C216)-MIN(C205:C216)<5,AVERAGEIF(C205:C216,\">0\",N205:N216),\nIF(FORECAST($C201,N$205:N$216,$C$205:$C$216)<0,0,\nIF(FORECAST($C201,N$205:N$216,$C$205:$C$216)>100,100,\nFORECAST($C201,N$205:N$216,$C$205:$C$216))))","v":99.214252354689052},null,null,null,{"$f":"IF(MAX(C205:C216)-MIN(C205:C216)<5,AVERAGEIF(C205:C216,\">0\",R205:R216),\nIF(FORECAST($C201,R$205:R$216,$C$205:$C$216)<0,0,\nIF(FORECAST($C201,R$205:R$216,$C$205:$C$216)>100,100,\nFORECAST($C201,R$205:R$216,$C$205:$C$216))))","v":0.1453205296943644},{"$f":"IF(MAX(C205:C216)-MIN(C205:C216)<5,AVERAGEIF(C205:C216,\">0\",S205:S216),\nIF(FORECAST($C201,S$205:S$216,$C$205:$C$216)<0,0,\nIF(FORECAST($C201,S$205:S$216,$C$205:$C$216)>100,100,\nFORECAST($C201,S$205:S$216,$C$205:$C$216))))","v":98.974172668358278},null,null,null,{"$f":"IF(MAX(C205:C216)-MIN(C205:C216)<5,AVERAGEIF(C205:C216,\">0\",W205:W216),\nIF(FORECAST($C201,W$205:W$216,$C$205:$C$216)<0,0,\nIF(FORECAST($C201,W$205:W$216,$C$205:$C$216)>100,100,\nFORECAST($C201,W$205:W$216,$C$205:$C$216))))","v":0.19139464790029947},{"$f":"IF(MAX(C205:C216)-MIN(C205:C216)<5,AVERAGEIF(C205:C216,\">0\",X205:X216),\nIF(FORECAST($C201,X$205:X$216,$C$205:$C$216)<0,0,\nIF(FORECAST($C201,X$205:X$216,$C$205:$C$216)>100,100,\nFORECAST($C201,X$205:X$216,$C$205:$C$216))))","v":99.018243861290102},null,null,null,{"$f":"IF(MAX(C205:C216)-MIN(C205:C216)<5,AVERAGEIF(C205:C216,\">0\",AB205:AB216),\nIF(FORECAST($C201,AB$205:AB$216,$C$205:$C$216)<0,0,\nIF(FORECAST($C201,AB$205:AB$216,$C$205:$C$216)>100,100,\nFORECAST($C201,AB$205:AB$216,$C$205:$C$216))))","v":0.15207369757139233}]
[null,null,{"$f":"MaxRegYear(C200,C205:C216)","v":2015},{"$f":"IF(MAX(C205:C216)-MIN(C205:C216)<5,AVERAGEIF(C205:C216,\">0\",D205:D216),\nIF(FORECAST($C202,D$205:D$216,$C$205:$C$216)<0,0,\nIF(FORECAST($C202,D$205:D$216,$C$205:$C$216)>100,100,\nFORECAST($C202,D$205:D$216,$C$205:$C$216))))","v":99.331748527053449},null,null,null,{"$f":"IF(MAX(C205:C216)-MIN(C205:C216)<5,AVERAGEIF(C205:C216,\">0\",H205:H216),\nIF(FORECAST($C202,H$205:H$216,$C$205:$C$216)<0,0,\nIF(FORECAST($C202,H$205:H$216,$C$205:$C$216)>100,100,\nFORECAST($C202,H$205:H$216,$C$205:$C$216))))","v":0.14424079431669218},{"$f":"IF(MAX(C205:C216)-MIN(C205:C216)<5,AVERAGEIF(C205:C216,\">0\",I205:I216),\nIF(FORECAST($C202,I$205:I$216,$C$205:$C$216)<0,0,\nIF(FORECAST($C202,I$205:I$216,$C$205:$C$216)>100,100,\nFORECAST($C202,I$205:I$216,$C$205:$C$216))))","v":98.962983521642741},null,null,null,{"$f":"IF(MAX(C205:C216)-MIN(C205:C216)<5,AVERAGEIF(C205:C216,\">0\",M205:M216),\nIF(FORECAST($C202,M$205:M$216,$C$205:$C$216)<0,0,\nIF(FORECAST($C202,M$205:M$216,$C$205:$C$216)>100,100,\nFORECAST($C202,M$205:M$216,$C$205:$C$216))))","v":0.23617095994696058},{"$f":"IF(MAX(C205:C216)-MIN(C205:C216)<5,AVERAGEIF(C205:C216,\">0\",N205:N216),\nIF(FORECAST($C202,N$205:N$216,$C$205:$C$216)<0,0,\nIF(FORECAST($C202,N$205:N$216,$C$205:$C$216)>100,100,\nFORECAST($C202,N$205:N$216,$C$205:$C$216))))","v":99.199601922298228},null,null,null,{"$f":"IF(MAX(C205:C216)-MIN(C205:C216)<5,AVERAGEIF(C205:C216,\">0\",R205:R216),\nIF(FORECAST($C202,R$205:R$216,$C$205:$C$216)<0,0,\nIF(FORECAST($C202,R$205:R$216,$C$205:$C$216)>100,100,\nFORECAST($C202,R$205:R$216,$C$205:$C$216))))","v":0.1453205296943644},{"$f":"IF(MAX(C205:C216)-MIN(C205:C216)<5,AVERAGEIF(C205:C216,\">0\",S205:S216),\nIF(FORECAST($C202,S$205:S$216,$C$205:$C$216)<0,0,\nIF(FORECAST($C202,S$205:S$216,$C$205:$C$216)>100,100,\nFORECAST($C202,S$205:S$216,$C$205:$C$216))))","v":98.858092336798052},null,null,null,{"$f":"IF(MAX(C205:C216)-MIN(C205:C216)<5,AVERAGEIF(C205:C216,\">0\",W205:W216),\nIF(FORECAST($C202,W$205:W$216,$C$205:$C$216)<0,0,\nIF(FORECAST($C202,W$205:W$216,$C$205:$C$216)>100,100,\nFORECAST($C202,W$205:W$216,$C$205:$C$216))))","v":0.29807446308367425},{"$f":"IF(MAX(C205:C216)-MIN(C205:C216)<5,AVERAGEIF(C205:C216,\">0\",X205:X216),\nIF(FORECAST($C202,X$205:X$216,$C$205:$C$216)<0,0,\nIF(FORECAST($C202,X$205:X$216,$C$205:$C$216)>100,100,\nFORECAST($C202,X$205:X$216,$C$205:$C$216))))","v":99.66548871298582},null,null,null,{"$f":"IF(MAX(C205:C216)-MIN(C205:C216)<5,AVERAGEIF(C205:C216,\">0\",AB205:AB216),\nIF(FORECAST($C202,AB$205:AB$216,$C$205:$C$216)<0,0,\nIF(FORECAST($C202,AB$205:AB$216,$C$205:$C$216)>100,100,\nFORECAST($C202,AB$205:AB$216,$C$205:$C$216))))","v":0}]
[]
[null,"Survey","Year","Improved","% Improved\n< = 30min",null,null,"Surface water","Improved","% Improved\n< = 30min",null,null,"Surface water","Improved","% Improved\n< = 30min",null,null,"Surface water","Improved","% Improved\n< = 30min",null,null,"Surface water","Improved","% Improved\n< = 30min",null,null,"Surface water"]
[null,"DHS03",2003,{"$f":"IF(ISERROR(INDIRECT(CONCATENATE($B205,\"!H16\"))),\"\",INDIRECT(CONCATENATE($B205,\"!H16\")))","v":99.344619101521431},{"$f":"IF(ISERROR(INDIRECT(CONCATENATE($B205,\"!H23\"))),\"\",INDIRECT(CONCATENATE($B205,\"!H23\")))","v":"N/A"},null,null,{"$f":"IF(ISERROR(INDIRECT(CONCATENATE($B205,\"!H21\"))),\"\",INDIRECT(CONCATENATE($B205,\"!H21\")))","v":2.6511019528466545E-2},{"$f":"IF(ISERROR(INDIRECT(CONCATENATE($B205,\"!I16\"))),\"\",INDIRECT(CONCATENATE($B205,\"!I16\")))","v":99.824170236884484},{"$f":"IF(ISERROR(INDIRECT(CONCATENATE($B205,\"!I23\"))),\"\",INDIRECT(CONCATENATE($B205,\"!I23\")))","v":"N/A"},null,null,{"$f":"IF(ISERROR(INDIRECT(CONCATENATE($B205,\"!I21\"))),\"\",INDIRECT(CONCATENATE($B205,\"!I21\")))","v":0},{"$f":"IF(ISERROR(INDIRECT(CONCATENATE($B205,\"!J16\"))),\"\",INDIRECT(CONCATENATE($B205,\"!J16\")))","v":99.760507782404474},{"$f":"IF(ISERROR(INDIRECT(CONCATENATE($B205,\"!J23\"))),\"\",INDIRECT(CONCATENATE($B205,\"!J23\")))","v":"N/A"},null,null,{"$f":"IF(ISERROR(INDIRECT(CONCATENATE($B205,\"!J21\"))),\"\",INDIRECT(CONCATENATE($B205,\"!J21\")))","v":0},{"$f":"IF(ISERROR(INDIRECT(CONCATENATE($B205,\"!K16\"))),\"\",INDIRECT(CONCATENATE($B205,\"!K16\")))","v":99.489188429101716},{"$f":"IF(ISERROR(INDIRECT(CONCATENATE($B205,\"!K23\"))),\"\",INDIRECT(CONCATENATE($B205,\"!K23\")))","v":"N/A"},null,null,{"$f":"IF(ISERROR(INDIRECT(CONCATENATE($B205,\"!K21\"))),\"\",INDIRECT(CONCATENATE($B205,\"!K21\")))","v":6.7183953013361969E-2},{"$f":"IF(ISERROR(INDIRECT(CONCATENATE($B205,\"!L16\"))),\"\",INDIRECT(CONCATENATE($B205,\"!L16\")))","v":99.45259871625737},{"$f":"IF(ISERROR(INDIRECT(CONCATENATE($B205,\"!L23\"))),\"\",INDIRECT(CONCATENATE($B205,\"!L23\")))","v":"N/A"},null,null,{"$f":"IF(ISERROR(INDIRECT(CONCATENATE($B205,\"!L221\"))),\"\",INDIRECT(CONCATENATE($B205,\"!L21\")))","v":0.12978335787922227}]
[null,"DHS08",2008,98.426707187312701,"N/A",null,null,0.38541566073778094,98.534531444495144,"N/A",null,null,0.19171984587391624,98.110230445236851,"N/A",null,null,0.43596158908309324,97.852935172074055,"N/A",null,null,0.52363589246111242,98.658083677687912,"N/A",null,null,5.3892683288578533E-2]
[null,"DHS13",2013,99.628264324361695,99.158287834803431,null,null,2.4667368933422168E-2,99.40677625193743,98.881236665522636,null,null,0.16670743031192323,99.750043187839594,99.030911412510918,null,null,0,99.406273906558695,98.298740222346609,null,null,0.14338382100148742,99.914916467468601,99.660584945254456,null,null,0]
[null,null,null,"","",null,null,"","","",null,null,"","","",null,null,"","","",null,null,"","","",null,null,""]
[null,null,null,"","",null,null,"","","",null,null,"","","",null,null,"","","",null,null,"","","",null,null,""]
[null,null,null,"","",null,null,"","","",null,null,"","","",null,null,"","","",null,null,"","","",null,null,""]
[null,null,null,"","",null,null,"","","",null,null,"","","",null,null,"","","",null,null,"","","",null,null,""]
[null,null,null,"","",null,null,"","","",null,null,"","","",null,null,"","","",null,null,"","","",null,null,""]
[null,null,null,"","",null,null,"","","",null,null,"","","",null,null,"","","",null,null,"","","",null,null,""]
[null,null,null,"","",null,null,"","","",null,null,"","","",null,null,"","","",null,null,"","","",null,null,""]
[null,null,null,"","",null,null,"","","",null,null,"","","",null,null,"","","",null,null,"","","",null,null,""]
[null,null,null,"","",null,null,"","","",null,null,"","","",null,null,"","","",null,null,"","","",null,null,""]
[]
[null,{"$f":"CONCATENATE(\"Urban use of drinking water sources,  \",C199,\"–\",C200)","v":"Urban use of drinking water sources,  2000–2019"},null,null,null,null,null,null,null,null,null,null,null,null,null,null,null,null,"Data points used for regression"]
[]
[]
[]
[]
[]
[]
[]
[]
[]
[]
[]
[]
[]
[]
[]
[]
[]
[]
[]
[]
[]
[]
[]
[]
[]
[]
[]
[]
[]
[]
[]
[]
[]
[]
[null,null,null,null,{"$f":"IF(ISERROR(INDIRECT(CONCATENATE($B253,\"!M18\"))),\"\",INDIRECT(CONCATENATE($B253,\"!M18\")))","v":""},{"$f":"IF(ISERROR(INDIRECT(CONCATENATE($B253,\"!M19\"))),\"\",INDIRECT(CONCATENATE($B253,\"!M19\")))","v":""},{"$f":"IF(ISERROR(INDIRECT(CONCATENATE($B253,\"!M20\"))),\"\",INDIRECT(CONCATENATE($B253,\"!M20\")))","v":""},{"$f":"IF(ISERROR(INDIRECT(CONCATENATE($B253,\"!M21\"))),\"\",INDIRECT(CONCATENATE($B253,\"!M21\")))","v":""},null,{"$f":"IF(ISERROR(INDIRECT(CONCATENATE($B253,\"!N18\"))),\"\",INDIRECT(CONCATENATE($B253,\"!N18\")))","v":""},{"$f":"IF(ISERROR(INDIRECT(CONCATENATE($B253,\"!N19\"))),\"\",INDIRECT(CONCATENATE($B253,\"!N19\")))","v":""},{"$f":"IF(ISERROR(INDIRECT(CONCATENATE($B253,\"!N20\"))),\"\",INDIRECT(CONCATENATE($B253,\"!N20\")))","v":""},{"$f":"IF(ISERROR(INDIRECT(CONCATENATE($B253,\"!N21\"))),\"\",INDIRECT(CONCATENATE($B253,\"!N21\")))","v":""},null,{"$f":"IF(ISERROR(INDIRECT(CONCATENATE($B253,\"!O18\"))),\"\",INDIRECT(CONCATENATE($B253,\"!O18\")))","v":""},{"$f":"IF(ISERROR(INDIRECT(CONCATENATE($B253,\"!O19\"))),\"\",INDIRECT(CONCATENATE($B253,\"!O19\")))","v":""},{"$f":"IF(ISERROR(INDIRECT(CONCATENATE($B253,\"!O20\"))),\"\",INDIRECT(CONCATENATE($B253,\"!O20\")))","v":""},{"$f":"IF(ISERROR(INDIRECT(CONCATENATE($B253,\"!O21\"))),\"\",INDIRECT(CONCATENATE($B253,\"!O21\")))","v":""},null,{"$f":"IF(ISERROR(INDIRECT(CONCATENATE($B253,\"!P18\"))),\"\",INDIRECT(CONCATENATE($B253,\"!P18\")))","v":""},{"$f":"IF(ISERROR(INDIRECT(CONCATENATE($B253,\"!P19\"))),\"\",INDIRECT(CONCATENATE($B253,\"!P19\")))","v":""},{"$f":"IF(ISERROR(INDIRECT(CONCATENATE($B253,\"!P20\"))),\"\",INDIRECT(CONCATENATE($B253,\"!P20\")))","v":""},{"$f":"IF(ISERROR(INDIRECT(CONCATENATE($B253,\"!P21\"))),\"\",INDIRECT(CONCATENATE($B253,\"!P21\")))","v":""},null,{"$f":"IF(ISERROR(INDIRECT(CONCATENATE($B253,\"!Q18\"))),\"\",INDIRECT(CONCATENATE($B253,\"!Q18\")))","v":""},{"$f":"IF(ISERROR(INDIRECT(CONCATENATE($B253,\"!Q19\"))),\"\",INDIRECT(CONCATENATE($B253,\"!Q19\")))","v":""},{"$f":"IF(ISERROR(INDIRECT(CONCATENATE($B253,\"!Q20\"))),\"\",INDIRECT(CONCATENATE($B253,\"!Q20\")))","v":""},{"$f":"IF(ISERROR(INDIRECT(CONCATENATE($B253,\"!Q21\"))),\"\",INDIRECT(CONCATENATE($B253,\"!Q1\")))","v":""}]
[null,null,null,null,{"$f":"IF(ISERROR(INDIRECT(CONCATENATE($B254,\"!M18\"))),\"\",INDIRECT(CONCATENATE($B254,\"!M18\")))","v":""},{"$f":"IF(ISERROR(INDIRECT(CONCATENATE($B254,\"!M19\"))),\"\",INDIRECT(CONCATENATE($B254,\"!M19\")))","v":""},{"$f":"IF(ISERROR(INDIRECT(CONCATENATE($B254,\"!M20\"))),\"\",INDIRECT(CONCATENATE($B254,\"!M20\")))","v":""},{"$f":"IF(ISERROR(INDIRECT(CONCATENATE($B254,\"!M21\"))),\"\",INDIRECT(CONCATENATE($B254,\"!M21\")))","v":""},null,{"$f":"IF(ISERROR(INDIRECT(CONCATENATE($B254,\"!N18\"))),\"\",INDIRECT(CONCATENATE($B254,\"!N18\")))","v":""},{"$f":"IF(ISERROR(INDIRECT(CONCATENATE($B254,\"!N19\"))),\"\",INDIRECT(CONCATENATE($B254,\"!N19\")))","v":""},{"$f":"IF(ISERROR(INDIRECT(CONCATENATE($B254,\"!N20\"))),\"\",INDIRECT(CONCATENATE($B254,\"!N20\")))","v":""},{"$f":"IF(ISERROR(INDIRECT(CONCATENATE($B254,\"!N21\"))),\"\",INDIRECT(CONCATENATE($B254,\"!N21\")))","v":""},null,{"$f":"IF(ISERROR(INDIRECT(CONCATENATE($B254,\"!O18\"))),\"\",INDIRECT(CONCATENATE($B254,\"!O18\")))","v":""},{"$f":"IF(ISERROR(INDIRECT(CONCATENATE($B254,\"!O19\"))),\"\",INDIRECT(CONCATENATE($B254,\"!O19\")))","v":""},{"$f":"IF(ISERROR(INDIRECT(CONCATENATE($B254,\"!O20\"))),\"\",INDIRECT(CONCATENATE($B254,\"!O20\")))","v":""},{"$f":"IF(ISERROR(INDIRECT(CONCATENATE($B254,\"!O21\"))),\"\",INDIRECT(CONCATENATE($B254,\"!O21\")))","v":""},null,{"$f":"IF(ISERROR(INDIRECT(CONCATENATE($B254,\"!P18\"))),\"\",INDIRECT(CONCATENATE($B254,\"!P18\")))","v":""},{"$f":"IF(ISERROR(INDIRECT(CONCATENATE($B254,\"!P19\"))),\"\",INDIRECT(CONCATENATE($B254,\"!P19\")))","v":""},{"$f":"IF(ISERROR(INDIRECT(CONCATENATE($B254,\"!P20\"))),\"\",INDIRECT(CONCATENATE($B254,\"!P20\")))","v":""},{"$f":"IF(ISERROR(INDIRECT(CONCATENATE($B254,\"!P21\"))),\"\",INDIRECT(CONCATENATE($B254,\"!P21\")))","v":""},null,{"$f":"IF(ISERROR(INDIRECT(CONCATENATE($B254,\"!Q18\"))),\"\",INDIRECT(CONCATENATE($B254,\"!Q18\")))","v":""},{"$f":"IF(ISERROR(INDIRECT(CONCATENATE($B254,\"!Q19\"))),\"\",INDIRECT(CONCATENATE($B254,\"!Q19\")))","v":""},{"$f":"IF(ISERROR(INDIRECT(CONCATENATE($B254,\"!Q20\"))),\"\",INDIRECT(CONCATENATE($B254,\"!Q20\")))","v":""},{"$f":"IF(ISERROR(INDIRECT(CONCATENATE($B254,\"!Q21\"))),\"\",INDIRECT(CONCATENATE($B254,\"!Q1\")))","v":""}]
[null,null,null,null,{"$f":"IF(ISERROR(INDIRECT(CONCATENATE($B255,\"!M18\"))),\"\",INDIRECT(CONCATENATE($B255,\"!M18\")))","v":""},{"$f":"IF(ISERROR(INDIRECT(CONCATENATE($B255,\"!M19\"))),\"\",INDIRECT(CONCATENATE($B255,\"!M19\")))","v":""},{"$f":"IF(ISERROR(INDIRECT(CONCATENATE($B255,\"!M20\"))),\"\",INDIRECT(CONCATENATE($B255,\"!M20\")))","v":""},{"$f":"IF(ISERROR(INDIRECT(CONCATENATE($B255,\"!M21\"))),\"\",INDIRECT(CONCATENATE($B255,\"!M21\")))","v":""},null,{"$f":"IF(ISERROR(INDIRECT(CONCATENATE($B255,\"!N18\"))),\"\",INDIRECT(CONCATENATE($B255,\"!N18\")))","v":""},{"$f":"IF(ISERROR(INDIRECT(CONCATENATE($B255,\"!N19\"))),\"\",INDIRECT(CONCATENATE($B255,\"!N19\")))","v":""},{"$f":"IF(ISERROR(INDIRECT(CONCATENATE($B255,\"!N20\"))),\"\",INDIRECT(CONCATENATE($B255,\"!N20\")))","v":""},{"$f":"IF(ISERROR(INDIRECT(CONCATENATE($B255,\"!N21\"))),\"\",INDIRECT(CONCATENATE($B255,\"!N21\")))","v":""},null,{"$f":"IF(ISERROR(INDIRECT(CONCATENATE($B255,\"!O18\"))),\"\",INDIRECT(CONCATENATE($B255,\"!O18\")))","v":""},{"$f":"IF(ISERROR(INDIRECT(CONCATENATE($B255,\"!O19\"))),\"\",INDIRECT(CONCATENATE($B255,\"!O19\")))","v":""},{"$f":"IF(ISERROR(INDIRECT(CONCATENATE($B255,\"!O20\"))),\"\",INDIRECT(CONCATENATE($B255,\"!O20\")))","v":""},{"$f":"IF(ISERROR(INDIRECT(CONCATENATE($B255,\"!O21\"))),\"\",INDIRECT(CONCATENATE($B255,\"!O21\")))","v":""},null,{"$f":"IF(ISERROR(INDIRECT(CONCATENATE($B255,\"!P18\"))),\"\",INDIRECT(CONCATENATE($B255,\"!P18\")))","v":""},{"$f":"IF(ISERROR(INDIRECT(CONCATENATE($B255,\"!P19\"))),\"\",INDIRECT(CONCATENATE($B255,\"!P19\")))","v":""},{"$f":"IF(ISERROR(INDIRECT(CONCATENATE($B255,\"!P20\"))),\"\",INDIRECT(CONCATENATE($B255,\"!P20\")))","v":""},{"$f":"IF(ISERROR(INDIRECT(CONCATENATE($B255,\"!P21\"))),\"\",INDIRECT(CONCATENATE($B255,\"!P21\")))","v":""},null,{"$f":"IF(ISERROR(INDIRECT(CONCATENATE($B255,\"!Q18\"))),\"\",INDIRECT(CONCATENATE($B255,\"!Q18\")))","v":""},{"$f":"IF(ISERROR(INDIRECT(CONCATENATE($B255,\"!Q19\"))),\"\",INDIRECT(CONCATENATE($B255,\"!Q19\")))","v":""},{"$f":"IF(ISERROR(INDIRECT(CONCATENATE($B255,\"!Q20\"))),\"\",INDIRECT(CONCATENATE($B255,\"!Q20\")))","v":""},{"$f":"IF(ISERROR(INDIRECT(CONCATENATE($B255,\"!Q21\"))),\"\",INDIRECT(CONCATENATE($B255,\"!Q1\")))","v":""}]
[null,null,null,null,{"$f":"IF(ISERROR(INDIRECT(CONCATENATE($B256,\"!M18\"))),\"\",INDIRECT(CONCATENATE($B256,\"!M18\")))","v":""},{"$f":"IF(ISERROR(INDIRECT(CONCATENATE($B256,\"!M19\"))),\"\",INDIRECT(CONCATENATE($B256,\"!M19\")))","v":""},{"$f":"IF(ISERROR(INDIRECT(CONCATENATE($B256,\"!M20\"))),\"\",INDIRECT(CONCATENATE($B256,\"!M20\")))","v":""},{"$f":"IF(ISERROR(INDIRECT(CONCATENATE($B256,\"!M21\"))),\"\",INDIRECT(CONCATENATE($B256,\"!M21\")))","v":""},null,{"$f":"IF(ISERROR(INDIRECT(CONCATENATE($B256,\"!N18\"))),\"\",INDIRECT(CONCATENATE($B256,\"!N18\")))","v":""},{"$f":"IF(ISERROR(INDIRECT(CONCATENATE($B256,\"!N19\"))),\"\",INDIRECT(CONCATENATE($B256,\"!N19\")))","v":""},{"$f":"IF(ISERROR(INDIRECT(CONCATENATE($B256,\"!N20\"))),\"\",INDIRECT(CONCATENATE($B256,\"!N20\")))","v":""},{"$f":"IF(ISERROR(INDIRECT(CONCATENATE($B256,\"!N21\"))),\"\",INDIRECT(CONCATENATE($B256,\"!N21\")))","v":""},null,{"$f":"IF(ISERROR(INDIRECT(CONCATENATE($B256,\"!O18\"))),\"\",INDIRECT(CONCATENATE($B256,\"!O18\")))","v":""},{"$f":"IF(ISERROR(INDIRECT(CONCATENATE($B256,\"!O19\"))),\"\",INDIRECT(CONCATENATE($B256,\"!O19\")))","v":""},{"$f":"IF(ISERROR(INDIRECT(CONCATENATE($B256,\"!O20\"))),\"\",INDIRECT(CONCATENATE($B256,\"!O20\")))","v":""},{"$f":"IF(ISERROR(INDIRECT(CONCATENATE($B256,\"!O21\"))),\"\",INDIRECT(CONCATENATE($B256,\"!O21\")))","v":""},null,{"$f":"IF(ISERROR(INDIRECT(CONCATENATE($B256,\"!P18\"))),\"\",INDIRECT(CONCATENATE($B256,\"!P18\")))","v":""},{"$f":"IF(ISERROR(INDIRECT(CONCATENATE($B256,\"!P19\"))),\"\",INDIRECT(CONCATENATE($B256,\"!P19\")))","v":""},{"$f":"IF(ISERROR(INDIRECT(CONCATENATE($B256,\"!P20\"))),\"\",INDIRECT(CONCATENATE($B256,\"!P20\")))","v":""},{"$f":"IF(ISERROR(INDIRECT(CONCATENATE($B256,\"!P21\"))),\"\",INDIRECT(CONCATENATE($B256,\"!P21\")))","v":""},null,{"$f":"IF(ISERROR(INDIRECT(CONCATENATE($B256,\"!Q18\"))),\"\",INDIRECT(CONCATENATE($B256,\"!Q18\")))","v":""},{"$f":"IF(ISERROR(INDIRECT(CONCATENATE($B256,\"!Q19\"))),\"\",INDIRECT(CONCATENATE($B256,\"!Q19\")))","v":""},{"$f":"IF(ISERROR(INDIRECT(CONCATENATE($B256,\"!Q20\"))),\"\",INDIRECT(CONCATENATE($B256,\"!Q20\")))","v":""},{"$f":"IF(ISERROR(INDIRECT(CONCATENATE($B256,\"!Q21\"))),\"\",INDIRECT(CONCATENATE($B256,\"!Q1\")))","v":""}]
[null,null,null,null,{"$f":"IF(ISERROR(INDIRECT(CONCATENATE($B257,\"!M18\"))),\"\",INDIRECT(CONCATENATE($B257,\"!M18\")))","v":""},{"$f":"IF(ISERROR(INDIRECT(CONCATENATE($B257,\"!M19\"))),\"\",INDIRECT(CONCATENATE($B257,\"!M19\")))","v":""},{"$f":"IF(ISERROR(INDIRECT(CONCATENATE($B257,\"!M20\"))),\"\",INDIRECT(CONCATENATE($B257,\"!M20\")))","v":""},{"$f":"IF(ISERROR(INDIRECT(CONCATENATE($B257,\"!M21\"))),\"\",INDIRECT(CONCATENATE($B257,\"!M21\")))","v":""},null,{"$f":"IF(ISERROR(INDIRECT(CONCATENATE($B257,\"!N18\"))),\"\",INDIRECT(CONCATENATE($B257,\"!N18\")))","v":""},{"$f":"IF(ISERROR(INDIRECT(CONCATENATE($B257,\"!N19\"))),\"\",INDIRECT(CONCATENATE($B257,\"!N19\")))","v":""},{"$f":"IF(ISERROR(INDIRECT(CONCATENATE($B257,\"!N20\"))),\"\",INDIRECT(CONCATENATE($B257,\"!N20\")))","v":""},{"$f":"IF(ISERROR(INDIRECT(CONCATENATE($B257,\"!N21\"))),\"\",INDIRECT(CONCATENATE($B257,\"!N21\")))","v":""},null,{"$f":"IF(ISERROR(INDIRECT(CONCATENATE($B257,\"!O18\"))),\"\",INDIRECT(CONCATENATE($B257,\"!O18\")))","v":""},{"$f":"IF(ISERROR(INDIRECT(CONCATENATE($B257,\"!O19\"))),\"\",INDIRECT(CONCATENATE($B257,\"!O19\")))","v":""},{"$f":"IF(ISERROR(INDIRECT(CONCATENATE($B257,\"!O20\"))),\"\",INDIRECT(CONCATENATE($B257,\"!O20\")))","v":""},{"$f":"IF(ISERROR(INDIRECT(CONCATENATE($B257,\"!O21\"))),\"\",INDIRECT(CONCATENATE($B257,\"!O21\")))","v":""},null,{"$f":"IF(ISERROR(INDIRECT(CONCATENATE($B257,\"!P18\"))),\"\",INDIRECT(CONCATENATE($B257,\"!P18\")))","v":""},{"$f":"IF(ISERROR(INDIRECT(CONCATENATE($B257,\"!P19\"))),\"\",INDIRECT(CONCATENATE($B257,\"!P19\")))","v":""},{"$f":"IF(ISERROR(INDIRECT(CONCATENATE($B257,\"!P20\"))),\"\",INDIRECT(CONCATENATE($B257,\"!P20\")))","v":""},{"$f":"IF(ISERROR(INDIRECT(CONCATENATE($B257,\"!P21\"))),\"\",INDIRECT(CONCATENATE($B257,\"!P21\")))","v":""},null,{"$f":"IF(ISERROR(INDIRECT(CONCATENATE($B257,\"!Q18\"))),\"\",INDIRECT(CONCATENATE($B257,\"!Q18\")))","v":""},{"$f":"IF(ISERROR(INDIRECT(CONCATENATE($B257,\"!Q19\"))),\"\",INDIRECT(CONCATENATE($B257,\"!Q19\")))","v":""},{"$f":"IF(ISERROR(INDIRECT(CONCATENATE($B257,\"!Q20\"))),\"\",INDIRECT(CONCATENATE($B257,\"!Q20\")))","v":""},{"$f":"IF(ISERROR(INDIRECT(CONCATENATE($B257,\"!Q21\"))),\"\",INDIRECT(CONCATENATE($B257,\"!Q1\")))","v":""}]
[]
[]
[]
[]
[]
[]
[]
[]
[]
[]
[]
[]
[]
[]
[]
[]
[]
[]
[]
[]
[]
[]
[]
[]
[]
[]
[]
[]
[]
[]
[]
[]
[]
[]
[]
[]
[]
[]
[]
["RURAL",null,null,"Poorest",null,null,null,null,"Poor",null,null,null,null,"Middle",null,null,null,null,"Rich",null,null,null,null,"Richest"]
[null,null,null,"Improved","Basic","Limited","Unimproved","Surface water","Improved","Basic","Limited","Unimproved","Surface water","Improved","Basic","Limited","Unimproved","Surface water","Improved","Basic","Limited","Unimproved","Surface water","Improved","Basic","Limited","Unimproved","Surface water"]
["Forecast period:",null,2000,{"$f":"IF((D301+H301)>100,D301*100/(D301+H301),D301)","v":94.024557859522943},{"$f":"D299*AVERAGEIF(E305:E316,\">0\")/100","v":91.369982776581395},{"$f":"D299*(100-AVERAGEIF(E305:E316,\">0\"))/100","v":2.654575082941538},{"$f":"100-(E299+F299+H299)","v":5.975442140477071},{"$f":"IF((D301+H301)>100,H301*100/(D301+H301),H301)","v":0},{"$f":"IF((I301+M301)>100,I301*100/(I301+M301),I301)","v":95.738406782433572},{"$f":"I299*AVERAGEIF(J305:J316,\">0\")/100","v":93.873526950542114},{"$f":"I299*(100-AVERAGEIF(J305:J316,\">0\"))/100","v":1.8648798318914592},{"$f":"100-(J299+K299+M299)","v":3.7548984485610504},{"$f":"IF((I301+M301)>100,M301*100/(I301+M301),M301)","v":0.50669476900537092},{"$f":"IF((N301+R301)>100,N301*100/(N301+R301),N301)","v":97.728629076923227},{"$f":"N299*AVERAGEIF(O305:O316,\">0\")/100","v":96.672274426758378},{"$f":"N299*(100-AVERAGEIF(O305:O316,\">0\"))/100","v":1.0563546501648466},{"$f":"100-(O299+P299+R299)","v":1.9057581788689362},{"$f":"IF((N301+R301)>100,R301*100/(N301+R301),R301)","v":0.36561274420783718},{"$f":"IF((S301+W301)>100,S301*100/(S301+W301),S301)","v":97.474228501041807},{"$f":"S299*AVERAGEIF(T305:T316,\">0\")/100","v":94.635446254711312},{"$f":"S299*(100-AVERAGEIF(T305:T316,\">0\"))/100","v":2.8387822463304979},{"$f":"100-(T299+U299+W299)","v":2.3403075417093362},{"$f":"IF((S301+W301)>100,W301*100/(S301+W301),W301)","v":0.18546395724885301},{"$f":"IF((X301+AB301)>100,X301*100/(X301+AB301),X301)","v":97.332203016953514},{"$f":"X299*AVERAGEIF(Y305:Y316,\">0\")/100","v":95.418169752306966},{"$f":"X299*(100-AVERAGEIF(Y305:Y316,\">0\"))/100","v":1.9140332646465512},{"$f":"100-(Y299+Z299+AB299)","v":2.6356689663720658},{"$f":"IF((X301+AB301)>100,AB301*100/(X301+AB301),AB301)","v":3.2128016674416671E-2}]
[null,null,2019,{"$f":"IF((D302+H302)>100,D302*100/(D302+H302),D302)","v":93.52427713644424},{"$f":"D300*AVERAGEIF(E305:E316,\">0\")/100","v":90.883826371363824},{"$f":"D300*(100-AVERAGEIF(E305:E316,\">0\"))/100","v":2.6404507650804017},{"$f":"100-(E300+F300+H300)","v":5.4347716905893719},{"$f":"IF((D302+H302)>100,H302*100/(D302+H302),H302)","v":1.0409511729664018},{"$f":"IF((I302+M302)>100,I302*100/(I302+M302),I302)","v":95.843319336268706},{"$f":"I300*AVERAGEIF(J305:J316,\">0\")/100","v":93.976395922158432},{"$f":"I300*(100-AVERAGEIF(J305:J316,\">0\"))/100","v":1.866923414110286},{"$f":"100-(J300+K300+M300)","v":3.2127375500510311},{"$f":"IF((I302+M302)>100,M302*100/(I302+M302),M302)","v":0.94394311368025541},{"$f":"IF((N302+R302)>100,N302*100/(N302+R302),N302)","v":97.420985515407537},{"$f":"N300*AVERAGEIF(O305:O316,\">0\")/100","v":96.367956203067138},{"$f":"N300*(100-AVERAGEIF(O305:O316,\">0\"))/100","v":1.0530293123404044},{"$f":"100-(O300+P300+R300)","v":2.579014484592463},{"$f":"IF((N302+R302)>100,R302*100/(N302+R302),R302)","v":0},{"$f":"IF((S302+W302)>100,S302*100/(S302+W302),S302)","v":95.136145195922836},{"$f":"S300*AVERAGEIF(T305:T316,\">0\")/100","v":92.3654559161034},{"$f":"S300*(100-AVERAGEIF(T305:T316,\">0\"))/100","v":2.7706892798194316},{"$f":"100-(T300+U300+W300)","v":4.8275893354095984},{"$f":"IF((S302+W302)>100,W302*100/(S302+W302),W302)","v":3.6265468667561862E-2},{"$f":"IF((X302+AB302)>100,X302*100/(X302+AB302),X302)","v":97.309104840353001},{"$f":"X300*AVERAGEIF(Y305:Y316,\">0\")/100","v":95.395525800279572},{"$f":"X300*(100-AVERAGEIF(Y305:Y316,\">0\"))/100","v":1.9135790400734327},{"$f":"100-(Y300+Z300+AB300)","v":2.4900584480734977},{"$f":"IF((X302+AB302)>100,AB302*100/(X302+AB302),AB302)","v":0.20083671157350125}]
["Regression period:",null,{"$f":"MinRegYear(C299,C305:C316)","v":2001},{"$f":"IF(MAX(C305:C316)-MIN(C305:C316)<5,AVERAGEIF(C305:C316,\">0\",D305:D316),\nIF(FORECAST($C301,D$305:D$316,$C$305:$C$316)<0,0,\nIF(FORECAST($C301,D$305:D$316,$C$305:$C$316)>100,100,\nFORECAST($C301,D$305:D$316,$C$305:$C$316))))","v":94.024557859522943},null,null,null,{"$f":"IF(MAX(C305:C316)-MIN(C305:C316)<5,AVERAGEIF(C305:C316,\">0\",H305:H316),\nIF(FORECAST($C301,H$305:H$316,$C$305:$C$316)<0,0,\nIF(FORECAST($C301,H$305:H$316,$C$305:$C$316)>100,100,\nFORECAST($C301,H$305:H$316,$C$305:$C$316))))","v":0},{"$f":"IF(MAX(C305:C316)-MIN(C305:C316)<5,AVERAGEIF(C305:C316,\">0\",I305:I316),\nIF(FORECAST($C301,I$305:I$316,$C$305:$C$316)<0,0,\nIF(FORECAST($C301,I$305:I$316,$C$305:$C$316)>100,100,\nFORECAST($C301,I$305:I$316,$C$305:$C$316))))","v":95.738406782433572},null,null,null,{"$f":"IF(MAX(C305:C316)-MIN(C305:C316)<5,AVERAGEIF(C305:C316,\">0\",M305:M316),\nIF(FORECAST($C301,M$305:M$316,$C$305:$C$316)<0,0,\nIF(FORECAST($C301,M$305:M$316,$C$305:$C$316)>100,100,\nFORECAST($C301,M$305:M$316,$C$305:$C$316))))","v":0.50669476900537092},{"$f":"IF(MAX(C305:C316)-MIN(C305:C316)<5,AVERAGEIF(C305:C316,\">0\",N305:N316),\nIF(FORECAST($C301,N$305:N$316,$C$305:$C$316)<0,0,\nIF(FORECAST($C301,N$305:N$316,$C$305:$C$316)>100,100,\nFORECAST($C301,N$305:N$316,$C$305:$C$316))))","v":97.728629076923227},null,null,null,{"$f":"IF(MAX(C305:C316)-MIN(C305:C316)<5,AVERAGEIF(C305:C316,\">0\",R305:R316),\nIF(FORECAST($C301,R$305:R$316,$C$305:$C$316)<0,0,\nIF(FORECAST($C301,R$305:R$316,$C$305:$C$316)>100,100,\nFORECAST($C301,R$305:R$316,$C$305:$C$316))))","v":0.36561274420783718},{"$f":"IF(MAX(C305:C316)-MIN(C305:C316)<5,AVERAGEIF(C305:C316,\">0\",S305:S316),\nIF(FORECAST($C301,S$305:S$316,$C$305:$C$316)<0,0,\nIF(FORECAST($C301,S$305:S$316,$C$305:$C$316)>100,100,\nFORECAST($C301,S$305:S$316,$C$305:$C$316))))","v":97.474228501041807},null,null,null,{"$f":"IF(MAX(C305:C316)-MIN(C305:C316)<5,AVERAGEIF(C305:C316,\">0\",W305:W316),\nIF(FORECAST($C301,W$305:W$316,$C$305:$C$316)<0,0,\nIF(FORECAST($C301,W$305:W$316,$C$305:$C$316)>100,100,\nFORECAST($C301,W$305:W$316,$C$305:$C$316))))","v":0.18546395724885301},{"$f":"IF(MAX(C305:C316)-MIN(C305:C316)<5,AVERAGEIF(C305:C316,\">0\",X305:X316),\nIF(FORECAST($C301,X$305:X$316,$C$305:$C$316)<0,0,\nIF(FORECAST($C301,X$305:X$316,$C$305:$C$316)>100,100,\nFORECAST($C301,X$305:X$316,$C$305:$C$316))))","v":97.332203016953514},null,null,null,{"$f":"IF(MAX(C305:C316)-MIN(C305:C316)<5,AVERAGEIF(C305:C316,\">0\",AB305:AB316),\nIF(FORECAST($C301,AB$305:AB$316,$C$305:$C$316)<0,0,\nIF(FORECAST($C301,AB$305:AB$316,$C$305:$C$316)>100,100,\nFORECAST($C301,AB$305:AB$316,$C$305:$C$316))))","v":3.2128016674416671E-2}]
[null,null,{"$f":"MaxRegYear(C300,C305:C316)","v":2015},{"$f":"IF(MAX(C305:C316)-MIN(C305:C316)<5,AVERAGEIF(C305:C316,\">0\",D305:D316),\nIF(FORECAST($C302,D$305:D$316,$C$305:$C$316)<0,0,\nIF(FORECAST($C302,D$305:D$316,$C$305:$C$316)>100,100,\nFORECAST($C302,D$305:D$316,$C$305:$C$316))))","v":93.52427713644424},null,null,null,{"$f":"IF(MAX(C305:C316)-MIN(C305:C316)<5,AVERAGEIF(C305:C316,\">0\",H305:H316),\nIF(FORECAST($C302,H$305:H$316,$C$305:$C$316)<0,0,\nIF(FORECAST($C302,H$305:H$316,$C$305:$C$316)>100,100,\nFORECAST($C302,H$305:H$316,$C$305:$C$316))))","v":1.0409511729664018},{"$f":"IF(MAX(C305:C316)-MIN(C305:C316)<5,AVERAGEIF(C305:C316,\">0\",I305:I316),\nIF(FORECAST($C302,I$305:I$316,$C$305:$C$316)<0,0,\nIF(FORECAST($C302,I$305:I$316,$C$305:$C$316)>100,100,\nFORECAST($C302,I$305:I$316,$C$305:$C$316))))","v":95.843319336268706},null,null,null,{"$f":"IF(MAX(C305:C316)-MIN(C305:C316)<5,AVERAGEIF(C305:C316,\">0\",M305:M316),\nIF(FORECAST($C302,M$305:M$316,$C$305:$C$316)<0,0,\nIF(FORECAST($C302,M$305:M$316,$C$305:$C$316)>100,100,\nFORECAST($C302,M$305:M$316,$C$305:$C$316))))","v":0.94394311368025541},{"$f":"IF(MAX(C305:C316)-MIN(C305:C316)<5,AVERAGEIF(C305:C316,\">0\",N305:N316),\nIF(FORECAST($C302,N$305:N$316,$C$305:$C$316)<0,0,\nIF(FORECAST($C302,N$305:N$316,$C$305:$C$316)>100,100,\nFORECAST($C302,N$305:N$316,$C$305:$C$316))))","v":97.420985515407537},null,null,null,{"$f":"IF(MAX(C305:C316)-MIN(C305:C316)<5,AVERAGEIF(C305:C316,\">0\",R305:R316),\nIF(FORECAST($C302,R$305:R$316,$C$305:$C$316)<0,0,\nIF(FORECAST($C302,R$305:R$316,$C$305:$C$316)>100,100,\nFORECAST($C302,R$305:R$316,$C$305:$C$316))))","v":0},{"$f":"IF(MAX(C305:C316)-MIN(C305:C316)<5,AVERAGEIF(C305:C316,\">0\",S305:S316),\nIF(FORECAST($C302,S$305:S$316,$C$305:$C$316)<0,0,\nIF(FORECAST($C302,S$305:S$316,$C$305:$C$316)>100,100,\nFORECAST($C302,S$305:S$316,$C$305:$C$316))))","v":95.136145195922836},null,null,null,{"$f":"IF(MAX(C305:C316)-MIN(C305:C316)<5,AVERAGEIF(C305:C316,\">0\",W305:W316),\nIF(FORECAST($C302,W$305:W$316,$C$305:$C$316)<0,0,\nIF(FORECAST($C302,W$305:W$316,$C$305:$C$316)>100,100,\nFORECAST($C302,W$305:W$316,$C$305:$C$316))))","v":3.6265468667561862E-2},{"$f":"IF(MAX(C305:C316)-MIN(C305:C316)<5,AVERAGEIF(C305:C316,\">0\",X305:X316),\nIF(FORECAST($C302,X$305:X$316,$C$305:$C$316)<0,0,\nIF(FORECAST($C302,X$305:X$316,$C$305:$C$316)>100,100,\nFORECAST($C302,X$305:X$316,$C$305:$C$316))))","v":97.309104840353001},null,null,null,{"$f":"IF(MAX(C305:C316)-MIN(C305:C316)<5,AVERAGEIF(C305:C316,\">0\",AB305:AB316),\nIF(FORECAST($C302,AB$305:AB$316,$C$305:$C$316)<0,0,\nIF(FORECAST($C302,AB$305:AB$316,$C$305:$C$316)>100,100,\nFORECAST($C302,AB$305:AB$316,$C$305:$C$316))))","v":0.20083671157350125}]
[]
[null,"Survey","Year","Improved","% Improved\n< = 30min",null,null,"Surface water","Improved","% Improved\n< = 30min",null,null,"Surface water","Improved","% Improved\n< = 30min",null,null,"Surface water","Improved","% Improved\n< = 30min",null,null,"Surface water","Improved","% Improved\n< = 30min",null,null,"Surface water"]
[null,"DHS03",2003,{"$f":"IF(ISERROR(INDIRECT(CONCATENATE($B305,\"!M16\"))),\"\",INDIRECT(CONCATENATE($B305,\"!M16\")))","v":94.621165276542939},{"$f":"IF(ISERROR(INDIRECT(CONCATENATE($B305,\"!M23\"))),\"\",INDIRECT(CONCATENATE($B305,\"!M23\")))","v":"N/A"},null,null,{"$f":"IF(ISERROR(INDIRECT(CONCATENATE($B305,\"!M21\"))),\"\",INDIRECT(CONCATENATE($B305,\"!M21\")))","v":7.488018954563605E-2},{"$f":"IF(ISERROR(INDIRECT(CONCATENATE($B305,\"!N16\"))),\"\",INDIRECT(CONCATENATE($B305,\"!N16\")))","v":97.146740615520798},{"$f":"IF(ISERROR(INDIRECT(CONCATENATE($B305,\"!N23\"))),\"\",INDIRECT(CONCATENATE($B305,\"!N23\")))","v":"N/A"},null,null,{"$f":"IF(ISERROR(INDIRECT(CONCATENATE($B305,\"!N21\"))),\"\",INDIRECT(CONCATENATE($B305,\"!N21\")))","v":0.17763803780407211},{"$f":"IF(ISERROR(INDIRECT(CONCATENATE($B305,\"!O16\"))),\"\",INDIRECT(CONCATENATE($B305,\"!O16\")))","v":98.470900030403087},{"$f":"IF(ISERROR(INDIRECT(CONCATENATE($B305,\"!O23\"))),\"\",INDIRECT(CONCATENATE($B305,\"!O23\")))","v":"N/A"},null,null,{"$f":"IF(ISERROR(INDIRECT(CONCATENATE($B305,\"!O21\"))),\"\",INDIRECT(CONCATENATE($B305,\"!O21\")))","v":0.39663432632293433},{"$f":"IF(ISERROR(INDIRECT(CONCATENATE($B305,\"!P16\"))),\"\",INDIRECT(CONCATENATE($B305,\"!P16\")))","v":98.419356965076389},{"$f":"IF(ISERROR(INDIRECT(CONCATENATE($B305,\"!P23\"))),\"\",INDIRECT(CONCATENATE($B305,\"!P23\")))","v":"N/A"},null,null,{"$f":"IF(ISERROR(INDIRECT(CONCATENATE($B305,\"!P21\"))),\"\",INDIRECT(CONCATENATE($B305,\"!P21\")))","v":0.1065703489866365},{"$f":"IF(ISERROR(INDIRECT(CONCATENATE($B305,\"!Q16\"))),\"\",INDIRECT(CONCATENATE($B305,\"!Q16\")))","v":99.273184231468989},{"$f":"IF(ISERROR(INDIRECT(CONCATENATE($B305,\"!Q23\"))),\"\",INDIRECT(CONCATENATE($B305,\"!Q23\")))","v":"N/A"},null,null,{"$f":"IF(ISERROR(INDIRECT(CONCATENATE($B305,\"!Q221\"))),\"\",INDIRECT(CONCATENATE($B305,\"!Q21\")))","v":0}]
[null,"DHS08",2008,92.438265314492554,"N/A",null,null,0.59976258679919769,93.004170408558139,"N/A",null,null,1.5083605022239461,96.002367228772641,"N/A",null,null,0,93.746906118950648,"N/A",null,null,0.22602378988798524,93.432092020593572,"N/A",null,null,0.22894088172967023]
[null,"DHS13",2013,94.263821902915296,97.176721546611688,null,null,0.84047069051621426,97.221678153974466,98.052108976359492,null,null,0.48995828400042091,98.251154629320453,98.919093964437607,null,null,0.12066198088872553,96.749297461419985,97.087658666310801,null,null,0,99.256685533897198,98.033504631233754,null,null,0.1205062106422037]
[null,null,null,"","",null,null,"","","",null,null,"","","",null,null,"","","",null,null,"","","",null,null,""]
[null,null,null,"","",null,null,"","","",null,null,"","","",null,null,"","","",null,null,"","","",null,null,""]
[null,null,null,"","",null,null,"","","",null,null,"","","",null,null,"","","",null,null,"","","",null,null,""]
[null,null,null,"","",null,null,"","","",null,null,"","","",null,null,"","","",null,null,"","","",null,null,""]
[null,null,null,"","",null,null,"","","",null,null,"","","",null,null,"","","",null,null,"","","",null,null,""]
[null,null,null,"","",null,null,"","","",null,null,"","","",null,null,"","","",null,null,"","","",null,null,""]
[null,null,null,"","",null,null,"","","",null,null,"","","",null,null,"","","",null,null,"","","",null,null,""]
[null,null,null,"","",null,null,"","","",null,null,"","","",null,null,"","","",null,null,"","","",null,null,""]
[null,null,null,"","",null,null,"","","",null,null,"","","",null,null,"","","",null,null,"","","",null,null,""]
[]
[null,{"$f":"CONCATENATE(\"Rural use of drinking water sources, \",C299,\"–\",C300)","v":"Rural use of drinking water sources, 2000–2019"},null,null,null,null,null,null,null,null,null,null,null,null,null,null,null,null,"Data points used for regression"]

{"sheet":"Sanitation","index":2,"n_rows":318,"n_cols":28,"rows_kept":318,"cut":false,"hidden":false,"merged":[[298,0,299,1],[300,0,301,1],[317,18,317,22],[196,23,196,27],[198,0,199,1],[200,0,201,1],[217,18,217,22],[296,0,297,2],[296,3,296,7],[296,8,296,12],[296,13,296,17],[296,18,296,22],[296,23,296,27],[217,1,217,11],[317,1,317,11],[98,0,99,1],[100,0,101,1],[117,18,117,22],[196,0,197,2],[196,3,196,7],[196,8,196,12],[196,13,196,17],[196,18,196,22],[117,1,117,11],[96,23,96,27],[32,1,33,2],[32,3,33,3],[35,1,36,2],[35,3,36,3],[38,1,39,2],[38,3,39,3],[96,0,97,2],[96,3,96,7],[96,8,96,12],[96,13,96,17],[96,18,96,22],[30,21,30,24],[4,1,4,24],[3,1,3,24],[6,1,6,8],[6,9,6,16],[6,17,6,24],[30,1,31,4],[30,5,30,8],[30,9,30,12],[30,13,30,16],[30,17,30,20]]}
[]
[]
[]
[null,"Summary of trends in use of sanitation facilities by wealth quintile (%)"]
[null,{"$f":"IF(ISERROR(INDIRECT(CONCATENATE($B105,\"!A2\"))),\"\",INDIRECT(CONCATENATE($B105,\"!A2\")))","v":"Turkey"}]
[]
[null,{"$f":"B118","v":"National use of sanitation facilities, 2000–2019"},null,null,null,null,null,null,null,{"$f":"B218","v":"Urban use of sanitation facilities, 2000–2019"},null,null,null,null,null,null,null,{"$f":"B318","v":"Rural use of sanitation facilities, 2000–2019"}]
[]
[]
[]
[]
[]
[]
[]
[]
[]
[]
[]
[]
[]
[]
[]
[]
[]
[]
[]
[]
[]
[]
[]
[null,{"$f":"IF(ISERROR(INDIRECT(CONCATENATE($B105,\"!A2\"))),\"\",INDIRECT(CONCATENATE($B105,\"!A2\")))","v":"Turkey"},null,null,null,"Poorest",null,null,null,"Poor",null,null,null,"Middle",null,null,null,"Rich",null,null,null,"Richest"]
[null,null,null,null,null,"Basic","Limited","Unimproved","Open defecation","Basic","Limited","Unimproved","Open defecation","Basic","Limited","Unimproved","Open defecation","Basic","Limited","Unimproved","Open defecation","Basic","Limited","Unimproved","Open defecation"]
[null,"NATIONAL",null,"Estimate",{"$f":"C99","v":2000},{"$f":"E99","v":55.149591915119032},{"$f":"F99","v":2.761791473595935},39.341706001072453,2.7469106102125807,{"$f":"J99","v":82.82363650529777},{"$f":"K99","v":1.4469237427059118},15.401688268009735,0.32775148398659582,{"$f":"O99","v":93.434532739702433},{"$f":"P99","v":0.76964803174593499},5.5971792826055093,0.19863994594613388,{"$f":"T99","v":95.933510024950834},{"$f":"U99","v":0.27116819977753248},3.4599726855443151,0.33534908972731614,{"$f":"Y99","v":98.879119495435376},{"$f":"Z99","v":8.9688047372660298E-2},1.0245127159050753,6.6797412868838425E-3]
[null,null,null,null,{"$f":"C100","v":2019},{"$f":"E100","v":92.32040875394047},4.62323852056692,3.0563527254926157,0,{"$f":"J100","v":96.088126819406767},1.6786535577708332,2.2035431936532177,2.9676429169185781E-2,{"$f":"O100","v":98.375023436888554},0.81034432282218571,0.81463224028925652,0,{"$f":"T100","v":99.718134081646113},0.28186591835388697,0,0,{"$f":"Y100","v":99.709467128433985},9.0441212026878284E-2,0.19341191825225224,6.6797412868838425E-3]
[]
[null,"URBAN",null,"Estimate",{"$f":"C199","v":2000},{"$f":"E199","v":88.219867893961705},{"$f":"F199","v":2.5005463669121886},9.0695452954902436,0.21004044363586161,{"$f":"J199","v":95.943071425925751},{"$f":"K199","v":0.90364101143293329},2.9194147251450033,0.23387283749630683,{"$f":"O199","v":97.596067571890103},{"$f":"P199","v":0.17998451039847393},1.901791671737783,0.32215624597365178,{"$f":"T199","v":98.524287197170722},{"$f":"U199","v":0.13074740533930881},1.1033248083931113,0.24164058909686048,{"$f":"Y199","v":99.635968550124474},{"$f":"Z199","v":4.7403678644551722E-2},0.3074354803869852,9.1922908439909679E-3]
[null,null,null,null,{"$f":"C200","v":2019},{"$f":"E200","v":97.241338095829391},2.756255257392525,0,2.4066467780924313E-3,{"$f":"J200","v":98.291153403801019},0.92575645074376278,0.78309014545521904,0,{"$f":"O200","v":99.815921683719637},0.18407831628034899,0,0,{"$f":"T200","v":99.867470113546545},0.13252988645344033,0,0,{"$f":"Y200","v":99.91525262534735},4.7536553275521413E-2,2.8018530533145736E-2,9.1922908439909679E-3]
[]
[null,"RURAL",null,"Estimate",{"$f":"C299","v":2000},{"$f":"E299","v":33.050028475439134},{"$f":"F299","v":2.7689907335641379},57.249624565557156,6.931356225439572,{"$f":"J299","v":49.651147176271827},{"$f":"K299","v":1.6618012725581348},47.119930192592555,1.5671213585774808,{"$f":"O299","v":64.713436452628969},{"$f":"P299","v":2.3359519634097397},32.114119838740677,0.83649174522061287,{"$f":"T299","v":80.150093667512024},{"$f":"U299","v":1.371526025221548},18.478380307266434,0,{"$f":"Y299","v":88.366200371321412},{"$f":"Z299","v":0.86266546822545653},10.77113416045313,0]
[null,null,null,null,{"$f":"C300","v":2019},{"$f":"E300","v":77.843737305039838},6.5218880953110068,15.634374599649149,0,{"$f":"J300","v":86.383798063596672},2.8912263606085107,10.724975575794815,0,{"$f":"O300","v":88.243851755632292},3.1853261094904064,8.4832603252834389,8.7561809593864837E-2,{"$f":"T300","v":90.842437995775086},1.5544931041831418,7.6030689000417766,0,{"$f":"Y300","v":97.504555393044683},0.95187767018162261,1.5435669367737006,0]
[]
[]
[]
[]
[]
[]
[]
[]
[]
[]
[]
[]
[]
[]
[]
[]
[]
[]
[]
[]
[]
[]
[]
[]
[]
[]
[]
[]
[]
[]
[]
[]
[]
[]
[]
[]
[]
[]
[]
[]
[]
[]
[]
[]
[]
[]
[]
[]
[]
[]
[]
[]
[]
[]
[]
[]
["NATIONAL",null,null,"Poorest",null,null,null,null,"Poor",null,null,null,null,"Middle",null,null,null,null,"Rich",null,null,null,null,"Richest"]
[null,null,null,"Improved","Basic","Limited","Unimproved","Open defecation","Improved","Basic","Limited","Unimproved","Open defecation","Improved","Basic","Limited","Unimproved","Open defecation","Improved","Basic","Limited","Unimproved","Open defecation","Improved","Basic","Limited","Unimproved","Open defecation"]
["Forecast period:",null,2000,{"$f":"IF((D101+H101)>100,D101*100/(D101+H101),D101)","v":57.911383388714967},{"$f":"D99*AVERAGEIF(E105:E116,\">0\")/100","v":55.149591915119032},{"$f":"D99*(100-AVERAGEIF(E105:E116,\">0\"))/100","v":2.761791473595935},{"$f":"100-(E99+F99+H99)","v":39.341706001072453},{"$f":"IF((D101+H101)>100,H101*100/(D101+H101),H101)","v":2.7469106102125807},{"$f":"IF((I101+M101)>100,I101*100/(I101+M101),I101)","v":84.270560248003676},{"$f":"I99*AVERAGEIF(J105:J116,\">0\")/100","v":82.82363650529777},{"$f":"I99*(100-AVERAGEIF(J105:J116,\">0\"))/100","v":1.4469237427059118},{"$f":"100-(J99+K99+M99)","v":15.401688268009735},{"$f":"IF((I101+M101)>100,M101*100/(I101+M101),M101)","v":0.32775148398659582},{"$f":"IF((N101+R101)>100,N101*100/(N101+R101),N101)","v":94.204180771448364},{"$f":"N99*AVERAGEIF(O105:O116,\">0\")/100","v":93.434532739702433},{"$f":"N99*(100-AVERAGEIF(O105:O116,\">0\"))/100","v":0.76964803174593499},{"$f":"100-(O99+P99+R99)","v":5.5971792826055093},{"$f":"IF((N101+R101)>100,R101*100/(N101+R101),R101)","v":0.19863994594613388},{"$f":"IF((S101+W101)>100,S101*100/(S101+W101),S101)","v":96.204678224728355},{"$f":"S99*AVERAGEIF(T105:T116,\">0\")/100","v":95.933510024950834},{"$f":"S99*(100-AVERAGEIF(T105:T116,\">0\"))/100","v":0.27116819977753248},{"$f":"100-(T99+U99+W99)","v":3.4599726855443151},{"$f":"IF((S101+W101)>100,W101*100/(S101+W101),W101)","v":0.33534908972731614},{"$f":"IF((X101+AB101)>100,X101*100/(X101+AB101),X101)","v":98.968807542808023},{"$f":"X99*AVERAGEIF(Y105:Y116,\">0\")/100","v":98.879119495435376},{"$f":"X99*(100-AVERAGEIF(Y105:Y116,\">0\"))/100","v":8.9688047372660298E-2},{"$f":"100-(Y99+Z99+AB99)","v":1.0245127159050753},{"$f":"IF((X101+AB101)>100,AB101*100/(X101+AB101),AB101)","v":6.6797412868838425E-3}]
[null,null,2019,{"$f":"IF((D102+H102)>100,D102*100/(D102+H102),D102)","v":96.943647274507384},{"$f":"D100*AVERAGEIF(E105:E116,\">0\")/100","v":92.32040875394047},{"$f":"D100*(100-AVERAGEIF(E105:E116,\">0\"))/100","v":4.62323852056692},{"$f":"100-(E100+F100+H100)","v":3.0563527254926157},{"$f":"IF((D102+H102)>100,H102*100/(D102+H102),H102)","v":0},{"$f":"IF((I102+M102)>100,I102*100/(I102+M102),I102)","v":97.766780377177611},{"$f":"I100*AVERAGEIF(J105:J116,\">0\")/100","v":96.088126819406767},{"$f":"I100*(100-AVERAGEIF(J105:J116,\">0\"))/100","v":1.6786535577708332},{"$f":"100-(J100+K100+M100)","v":2.2035431936532177},{"$f":"IF((I102+M102)>100,M102*100/(I102+M102),M102)","v":2.9676429169185781E-2},{"$f":"IF((N102+R102)>100,N102*100/(N102+R102),N102)","v":99.185367759710743},{"$f":"N100*AVERAGEIF(O105:O116,\">0\")/100","v":98.375023436888554},{"$f":"N100*(100-AVERAGEIF(O105:O116,\">0\"))/100","v":0.81034432282218571},{"$f":"100-(O100+P100+R100)","v":0.81463224028925652},{"$f":"IF((N102+R102)>100,R102*100/(N102+R102),R102)","v":0},{"$f":"IF((S102+W102)>100,S102*100/(S102+W102),S102)","v":100},{"$f":"S100*AVERAGEIF(T105:T116,\">0\")/100","v":99.718134081646113},{"$f":"S100*(100-AVERAGEIF(T105:T116,\">0\"))/100","v":0.28186591835388697},{"$f":"100-(T100+U100+W100)","v":0},{"$f":"IF((S102+W102)>100,W102*100/(S102+W102),W102)","v":0},{"$f":"IF((X102+AB102)>100,X102*100/(X102+AB102),X102)","v":99.799908340460874},{"$f":"X100*AVERAGEIF(Y105:Y116,\">0\")/100","v":99.709467128433985},{"$f":"X100*(100-AVERAGEIF(Y105:Y116,\">0\"))/100","v":9.0441212026878284E-2},{"$f":"100-(Y100+Z100+AB100)","v":0.19341191825225224},{"$f":"IF((X102+AB102)>100,AB102*100/(X102+AB102),AB102)","v":6.6797412868838425E-3}]
["Regression period:",null,{"$f":"MinRegYear(C99,C105:C116)","v":2001},{"$f":"IF(MAX(C105:C116)-MIN(C105:C116)<5,AVERAGEIF(C105:C116,\">0\",D105:D116),\nIF(FORECAST($C101,D$105:D$116,$C$105:$C$116)<0,0,\nIF(FORECAST($C101,D$105:D$116,$C$105:$C$116)>100,100,\nFORECAST($C101,D$105:D$116,$C$105:$C$116))))","v":57.911383388714967},null,null,null,{"$f":"IF(MAX(C105:C116)-MIN(C105:C116)<5,AVERAGEIF(C105:C116,\">0\",H105:H116),\nIF(FORECAST($C101,H$105:H$116,$C$105:$C$116)<0,0,\nIF(FORECAST($C101,H$105:H$116,$C$105:$C$116)>100,100,\nFORECAST($C101,H$105:H$116,$C$105:$C$116))))","v":2.7469106102125807},{"$f":"IF(MAX(C105:C116)-MIN(C105:C116)<5,AVERAGEIF(C105:C116,\">0\",I105:I116),\nIF(FORECAST($C101,I$105:I$116,$C$105:$C$116)<0,0,\nIF(FORECAST($C101,I$105:I$116,$C$105:$C$116)>100,100,\nFORECAST($C101,I$105:I$116,$C$105:$C$116))))","v":84.270560248003676},null,null,null,{"$f":"IF(MAX(C105:C116)-MIN(C105:C116)<5,AVERAGEIF(C105:C116,\">0\",M105:M116),\nIF(FORECAST($C101,M$105:M$116,$C$105:$C$116)<0,0,\nIF(FORECAST($C101,M$105:M$116,$C$105:$C$116)>100,100,\nFORECAST($C101,M$105:M$116,$C$105:$C$116))))","v":0.32775148398659582},{"$f":"IF(MAX(C105:C116)-MIN(C105:C116)<5,AVERAGEIF(C105:C116,\">0\",N105:N116),\nIF(FORECAST($C101,N$105:N$116,$C$105:$C$116)<0,0,\nIF(FORECAST($C101,N$105:N$116,$C$105:$C$116)>100,100,\nFORECAST($C101,N$105:N$116,$C$105:$C$116))))","v":94.204180771448364},null,null,null,{"$f":"IF(MAX(C105:C116)-MIN(C105:C116)<5,AVERAGEIF(C105:C116,\">0\",R105:R116),\nIF(FORECAST($C101,R$105:R$116,$C$105:$C$116)<0,0,\nIF(FORECAST($C101,R$105:R$116,$C$105:$C$116)>100,100,\nFORECAST($C101,R$105:R$116,$C$105:$C$116))))","v":0.19863994594613388},{"$f":"IF(MAX(C105:C116)-MIN(C105:C116)<5,AVERAGEIF(C105:C116,\">0\",S105:S116),\nIF(FORECAST($C101,S$105:S$116,$C$105:$C$116)<0,0,\nIF(FORECAST($C101,S$105:S$116,$C$105:$C$116)>100,100,\nFORECAST($C101,S$105:S$116,$C$105:$C$116))))","v":96.204678224728355},null,null,null,{"$f":"IF(MAX(C105:C116)-MIN(C105:C116)<5,AVERAGEIF(C105:C116,\">0\",W105:W116),\nIF(FORECAST($C101,W$105:W$116,$C$105:$C$116)<0,0,\nIF(FORECAST($C101,W$105:W$116,$C$105:$C$116)>100,100,\nFORECAST($C101,W$105:W$116,$C$105:$C$116))))","v":0.33534908972731614},{"$f":"IF(MAX(C105:C116)-MIN(C105:C116)<5,AVERAGEIF(C105:C116,\">0\",X105:X116),\nIF(FORECAST($C101,X$105:X$116,$C$105:$C$116)<0,0,\nIF(FORECAST($C101,X$105:X$116,$C$105:$C$116)>100,100,\nFORECAST($C101,X$105:X$116,$C$105:$C$116))))","v":98.968807542808023},null,null,null,{"$f":"IF(MAX(C105:C116)-MIN(C105:C116)<5,AVERAGEIF(C105:C116,\">0\",AB105:AB116),\nIF(FORECAST($C101,AB$105:AB$116,$C$105:$C$116)<0,0,\nIF(FORECAST($C101,AB$105:AB$116,$C$105:$C$116)>100,100,\nFORECAST($C101,AB$105:AB$116,$C$105:$C$116))))","v":6.6797412868838425E-3}]
[null,null,{"$f":"MaxRegYear(C100,C105:C116)","v":2015},{"$f":"IF(MAX(C105:C116)-MIN(C105:C116)<5,AVERAGEIF(C105:C116,\">0\",D105:D116),\nIF(FORECAST($C102,D$105:D$116,$C$105:$C$116)<0,0,\nIF(FORECAST($C102,D$105:D$116,$C$105:$C$116)>100,100,\nFORECAST($C102,D$105:D$116,$C$105:$C$116))))","v":96.943647274507384},null,null,null,{"$f":"IF(MAX(C105:C116)-MIN(C105:C116)<5,AVERAGEIF(C105:C116,\">0\",H105:H116),\nIF(FORECAST($C102,H$105:H$116,$C$105:$C$116)<0,0,\nIF(FORECAST($C102,H$105:H$116,$C$105:$C$116)>100,100,\nFORECAST($C102,H$105:H$116,$C$105:$C$116))))","v":0},{"$f":"IF(MAX(C105:C116)-MIN(C105:C116)<5,AVERAGEIF(C105:C116,\">0\",I105:I116),\nIF(FORECAST($C102,I$105:I$116,$C$105:$C$116)<0,0,\nIF(FORECAST($C102,I$105:I$116,$C$105:$C$116)>100,100,\nFORECAST($C102,I$105:I$116,$C$105:$C$116))))","v":97.766780377177611},null,null,null,{"$f":"IF(MAX(C105:C116)-MIN(C105:C116)<5,AVERAGEIF(C105:C116,\">0\",M105:M116),\nIF(FORECAST($C102,M$105:M$116,$C$105:$C$116)<0,0,\nIF(FORECAST($C102,M$105:M$116,$C$105:$C$116)>100,100,\nFORECAST($C102,M$105:M$116,$C$105:$C$116))))","v":2.9676429169185781E-2},{"$f":"IF(MAX(C105:C116)-MIN(C105:C116)<5,AVERAGEIF(C105:C116,\">0\",N105:N116),\nIF(FORECAST($C102,N$105:N$116,$C$105:$C$116)<0,0,\nIF(FORECAST($C102,N$105:N$116,$C$105:$C$116)>100,100,\nFORECAST($C102,N$105:N$116,$C$105:$C$116))))","v":99.185367759710743},null,null,null,{"$f":"IF(MAX(C105:C116)-MIN(C105:C116)<5,AVERAGEIF(C105:C116,\">0\",R105:R116),\nIF(FORECAST($C102,R$105:R$116,$C$105:$C$116)<0,0,\nIF(FORECAST($C102,R$105:R$116,$C$105:$C$116)>100,100,\nFORECAST($C102,R$105:R$116,$C$105:$C$116))))","v":0},{"$f":"IF(MAX(C105:C116)-MIN(C105:C116)<5,AVERAGEIF(C105:C116,\">0\",S105:S116),\nIF(FORECAST($C102,S$105:S$116,$C$105:$C$116)<0,0,\nIF(FORECAST($C102,S$105:S$116,$C$105:$C$116)>100,100,\nFORECAST($C102,S$105:S$116,$C$105:$C$116))))","v":100},null,null,null,{"$f":"IF(MAX(C105:C116)-MIN(C105:C116)<5,AVERAGEIF(C105:C116,\">0\",W105:W116),\nIF(FORECAST($C102,W$105:W$116,$C$105:$C$116)<0,0,\nIF(FORECAST($C102,W$105:W$116,$C$105:$C$116)>100,100,\nFORECAST($C102,W$105:W$116,$C$105:$C$116))))","v":0},{"$f":"IF(MAX(C105:C116)-MIN(C105:C116)<5,AVERAGEIF(C105:C116,\">0\",X105:X116),\nIF(FORECAST($C102,X$105:X$116,$C$105:$C$116)<0,0,\nIF(FORECAST($C102,X$105:X$116,$C$105:$C$116)>100,100,\nFORECAST($C102,X$105:X$116,$C$105:$C$116))))","v":99.799908340460874},null,null,null,{"$f":"IF(MAX(C105:C116)-MIN(C105:C116)<5,AVERAGEIF(C105:C116,\">0\",AB105:AB116),\nIF(FORECAST($C102,AB$105:AB$116,$C$105:$C$116)<0,0,\nIF(FORECAST($C102,AB$105:AB$116,$C$105:$C$116)>100,100,\nFORECAST($C102,AB$105:AB$116,$C$105:$C$116))))","v":6.6797412868838425E-3}]
[]
[null,"Survey","Year","Improved","Not shared",null,null,"Open defecation","Improved","Not shared",null,null,"Open defecation","Improved","Not shared",null,null,"Open defecation","Improved","Not shared",null,null,"Open defecation","Improved","Not shared",null,null,"Open defecation"]
[null,"DHS03",2003,{"$f":"IF(ISERROR(INDIRECT(CONCATENATE($B105,\"!C122\"))),\"\",INDIRECT(CONCATENATE($B105,\"!C122\")))","v":60.767876991964698},{"$f":"IF(ISERROR(INDIRECT(CONCATENATE($B105,\"!C129\"))),\"\",INDIRECT(CONCATENATE($B105,\"!C129\")))","v":92.075273997205926},null,null,{"$f":"IF(ISERROR(INDIRECT(CONCATENATE($B105,\"!C127\"))),\"\",INDIRECT(CONCATENATE($B105,\"!C127\")))","v":2.1644217985472993},{"$f":"IF(ISERROR(INDIRECT(CONCATENATE($B105,\"!D122\"))),\"\",INDIRECT(CONCATENATE($B105,\"!D122\")))","v":87.288316313967371},{"$f":"IF(ISERROR(INDIRECT(CONCATENATE($B105,\"!D129\"))),\"\",INDIRECT(CONCATENATE($B105,\"!D129\")))","v":97.954696700194503},null,null,{"$f":"IF(ISERROR(INDIRECT(CONCATENATE($B105,\"!D127\"))),\"\",INDIRECT(CONCATENATE($B105,\"!D127\")))","v":0.21291075344100915},{"$f":"IF(ISERROR(INDIRECT(CONCATENATE($B105,\"!E122\"))),\"\",INDIRECT(CONCATENATE($B105,\"!E122\")))","v":94.766418299948654},{"$f":"IF(ISERROR(INDIRECT(CONCATENATE($B105,\"!E129\"))),\"\",INDIRECT(CONCATENATE($B105,\"!E129\")))","v":98.340140109917684},null,null,{"$f":"IF(ISERROR(INDIRECT(CONCATENATE($B105,\"!E127\"))),\"\",INDIRECT(CONCATENATE($B105,\"!E127\")))","v":0.1903335702258333},{"$f":"IF(ISERROR(INDIRECT(CONCATENATE($B105,\"!F122\"))),\"\",INDIRECT(CONCATENATE($B105,\"!F122\")))","v":96.322184095029016},{"$f":"IF(ISERROR(INDIRECT(CONCATENATE($B105,\"!F129\"))),\"\",INDIRECT(CONCATENATE($B105,\"!F129\")))","v":99.724891048255145},null,null,{"$f":"IF(ISERROR(INDIRECT(CONCATENATE($B105,\"!F127\"))),\"\",INDIRECT(CONCATENATE($B105,\"!F127\")))","v":0.31850963879860189},{"$f":"IF(ISERROR(INDIRECT(CONCATENATE($B105,\"!G122\"))),\"\",INDIRECT(CONCATENATE($B105,\"!G122\")))","v":98.898080942263789},{"$f":"IF(ISERROR(INDIRECT(CONCATENATE($B105,\"!G129\"))),\"\",INDIRECT(CONCATENATE($B105,\"!G129\")))","v":99.815893459899158},null,null,{"$f":"IF(ISERROR(INDIRECT(CONCATENATE($B105,\"!G2127\"))),\"\",INDIRECT(CONCATENATE($B105,\"!G127\")))","v":0}]
[null,"DHS08",2008,82.866603521051672,96.754781344512494,null,null,1.5310242551411117,88.839221074713265,97.504052440390311,null,null,0.32323111629266782,96.993495490939665,99.35418681394674,null,null,5.8857701383279058E-3,99.694150185250692,99.536315766534827,null,null,1.8667388906306932E-2,99.763268513480853,99.96401015632928,null,null,2.0039223860651528E-2]
[null,"DHS13",2013,88.648065481816516,96.862957092167989,null,null,0,96.928473549091606,99.39025718458609,null,null,0,98.324409005850313,99.854673474706445,null,null,0,99.708078368777535,99.893195430148367,null,null,0,99.491724369158675,99.948228763257291,null,null,0]
[null,null,null,"","",null,null,"","","",null,null,"","","",null,null,"","","",null,null,"","","",null,null,""]
[null,null,null,"","",null,null,"","","",null,null,"","","",null,null,"","","",null,null,"","","",null,null,""]
[null,null,null,"","",null,null,"","","",null,null,"","","",null,null,"","","",null,null,"","","",null,null,""]
[null,null,null,"","",null,null,"","","",null,null,"","","",null,null,"","","",null,null,"","","",null,null,""]
[null,null,null,"","",null,null,"","","",null,null,"","","",null,null,"","","",null,null,"","","",null,null,""]
[null,null,null,"","",null,null,"","","",null,null,"","","",null,null,"","","",null,null,"","","",null,null,""]
[null,null,null,"","",null,null,"","","",null,null,"","","",null,null,"","","",null,null,"","","",null,null,""]
[null,null,null,"","",null,null,"","","",null,null,"","","",null,null,"","","",null,null,"","","",null,null,""]
[null,null,null,"","",null,null,"","","",null,null,"","","",null,null,"","","",null,null,"","","",null,null,""]
[]
[null,{"$f":"CONCATENATE(\"National use of sanitation facilities, \",C99,\"–\",C100)","v":"National use of sanitation facilities, 2000–2019"},null,null,null,null,null,null,null,null,null,null,null,null,null,null,null,null,"Data points used for regression"]
[]
[]
[]
[]
[]
[]
[]
[]
[]
[]
[]
[]
[]
[]
[]
[]
[]
[]
[]
[]
[]
[]
[]
[]
[]
[]
[]
[]
[]
[]
[]
[]
[]
[]
[]
[]
[]
[]
[]
[]
[]
[]
[]
[]
[]
[]
[]
[]
[]
[]
[]
[]
[]
[]
[]
[]
[]
[]
[]
[]
[]
[]
[]
[]
[]
[]
[]
[]
[]
[]
[]
[]
[]
[]
[]
[]
[]
[]
["URBAN",null,null,"Poorest",null,null,null,null,"Poor",null,null,null,null,"Middle",null,null,null,null,"Rich",null,null,null,null,"Richest"]
[null,null,null,"Improved","Basic","Limited","Unimproved","Open defecation","Improved","Basic","Limited","Unimproved","Open defecation","Improved","Basic","Limited","Unimproved","Open defecation","Improved","Basic","Limited","Unimproved","Open defecation","Improved","Basic","Limited","Unimproved","Open defecation"]
["Forecast period:",null,2000,{"$f":"IF((D201+H201)>100,D201*100/(D201+H201),D201)","v":90.720414260873895},{"$f":"D199*AVERAGEIF(E205:E216,\">0\")/100","v":88.219867893961705},{"$f":"D199*(100-AVERAGEIF(E205:E216,\">0\"))/100","v":2.5005463669121886},{"$f":"100-(E199+F199+H199)","v":9.0695452954902436},{"$f":"IF((D201+H201)>100,H201*100/(D201+H201),H201)","v":0.21004044363586161},{"$f":"IF((I201+M201)>100,I201*100/(I201+M201),I201)","v":96.84671243735869},{"$f":"I199*AVERAGEIF(J205:J216,\">0\")/100","v":95.943071425925751},{"$f":"I199*(100-AVERAGEIF(J205:J216,\">0\"))/100","v":0.90364101143293329},{"$f":"100-(J199+K199+M199)","v":2.9194147251450033},{"$f":"IF((I201+M201)>100,M201*100/(I201+M201),M201)","v":0.23387283749630683},{"$f":"IF((N201+R201)>100,N201*100/(N201+R201),N201)","v":97.776052082288572},{"$f":"N199*AVERAGEIF(O205:O216,\">0\")/100","v":97.596067571890103},{"$f":"N199*(100-AVERAGEIF(O205:O216,\">0\"))/100","v":0.17998451039847393},{"$f":"100-(O199+P199+R199)","v":1.901791671737783},{"$f":"IF((N201+R201)>100,R201*100/(N201+R201),R201)","v":0.32215624597365178},{"$f":"IF((S201+W201)>100,S201*100/(S201+W201),S201)","v":98.655034602510028},{"$f":"S199*AVERAGEIF(T205:T216,\">0\")/100","v":98.524287197170722},{"$f":"S199*(100-AVERAGEIF(T205:T216,\">0\"))/100","v":0.13074740533930881},{"$f":"100-(T199+U199+W199)","v":1.1033248083931113},{"$f":"IF((S201+W201)>100,W201*100/(S201+W201),W201)","v":0.24164058909686048},{"$f":"IF((X201+AB201)>100,X201*100/(X201+AB201),X201)","v":99.683372228769031},{"$f":"X199*AVERAGEIF(Y205:Y216,\">0\")/100","v":99.635968550124474},{"$f":"X199*(100-AVERAGEIF(Y205:Y216,\">0\"))/100","v":4.7403678644551722E-2},{"$f":"100-(Y199+Z199+AB199)","v":0.3074354803869852},{"$f":"IF((X201+AB201)>100,AB201*100/(X201+AB201),AB201)","v":9.1922908439909679E-3}]
[null,null,2019,{"$f":"IF((D202+H202)>100,D202*100/(D202+H202),D202)","v":99.997593353221916},{"$f":"D200*AVERAGEIF(E205:E216,\">0\")/100","v":97.241338095829391},{"$f":"D200*(100-AVERAGEIF(E205:E216,\">0\"))/100","v":2.756255257392525},{"$f":"100-(E200+F200+H200)","v":0},{"$f":"IF((D202+H202)>100,H202*100/(D202+H202),H202)","v":2.4066467780924313E-3},{"$f":"IF((I202+M202)>100,I202*100/(I202+M202),I202)","v":99.216909854544781},{"$f":"I200*AVERAGEIF(J205:J216,\">0\")/100","v":98.291153403801019},{"$f":"I200*(100-AVERAGEIF(J205:J216,\">0\"))/100","v":0.92575645074376278},{"$f":"100-(J200+K200+M200)","v":0.78309014545521904},{"$f":"IF((I202+M202)>100,M202*100/(I202+M202),M202)","v":0},{"$f":"IF((N202+R202)>100,N202*100/(N202+R202),N202)","v":100},{"$f":"N200*AVERAGEIF(O205:O216,\">0\")/100","v":99.815921683719637},{"$f":"N200*(100-AVERAGEIF(O205:O216,\">0\"))/100","v":0.18407831628034899},{"$f":"100-(O200+P200+R200)","v":0},{"$f":"IF((N202+R202)>100,R202*100/(N202+R202),R202)","v":0},{"$f":"IF((S202+W202)>100,S202*100/(S202+W202),S202)","v":100},{"$f":"S200*AVERAGEIF(T205:T216,\">0\")/100","v":99.867470113546545},{"$f":"S200*(100-AVERAGEIF(T205:T216,\">0\"))/100","v":0.13252988645344033},{"$f":"100-(T200+U200+W200)","v":0},{"$f":"IF((S202+W202)>100,W202*100/(S202+W202),W202)","v":0},{"$f":"IF((X202+AB202)>100,X202*100/(X202+AB202),X202)","v":99.96278917862287},{"$f":"X200*AVERAGEIF(Y205:Y216,\">0\")/100","v":99.91525262534735},{"$f":"X200*(100-AVERAGEIF(Y205:Y216,\">0\"))/100","v":4.7536553275521413E-2},{"$f":"100-(Y200+Z200+AB200)","v":2.8018530533145736E-2},{"$f":"IF((X202+AB202)>100,AB202*100/(X202+AB202),AB202)","v":9.1922908439909679E-3}]
["Regression period:",null,{"$f":"MinRegYear(C199,C205:C216)","v":2001},{"$f":"IF(MAX(C205:C216)-MIN(C205:C216)<5,AVERAGEIF(C205:C216,\">0\",D205:D216),\nIF(FORECAST($C201,D$205:D$216,$C$205:$C$216)<0,0,\nIF(FORECAST($C201,D$205:D$216,$C$205:$C$216)>100,100,\nFORECAST($C201,D$205:D$216,$C$205:$C$216))))","v":90.720414260873895},null,null,null,{"$f":"IF(MAX(C205:C216)-MIN(C205:C216)<5,AVERAGEIF(C205:C216,\">0\",H205:H216),\nIF(FORECAST($C201,H$205:H$216,$C$205:$C$216)<0,0,\nIF(FORECAST($C201,H$205:H$216,$C$205:$C$216)>100,100,\nFORECAST($C201,H$205:H$216,$C$205:$C$216))))","v":0.21004044363586161},{"$f":"IF(MAX(C205:C216)-MIN(C205:C216)<5,AVERAGEIF(C205:C216,\">0\",I205:I216),\nIF(FORECAST($C201,I$205:I$216,$C$205:$C$216)<0,0,\nIF(FORECAST($C201,I$205:I$216,$C$205:$C$216)>100,100,\nFORECAST($C201,I$205:I$216,$C$205:$C$216))))","v":96.84671243735869},null,null,null,{"$f":"IF(MAX(C205:C216)-MIN(C205:C216)<5,AVERAGEIF(C205:C216,\">0\",M205:M216),\nIF(FORECAST($C201,M$205:M$216,$C$205:$C$216)<0,0,\nIF(FORECAST($C201,M$205:M$216,$C$205:$C$216)>100,100,\nFORECAST($C201,M$205:M$216,$C$205:$C$216))))","v":0.23387283749630683},{"$f":"IF(MAX(C205:C216)-MIN(C205:C216)<5,AVERAGEIF(C205:C216,\">0\",N205:N216),\nIF(FORECAST($C201,N$205:N$216,$C$205:$C$216)<0,0,\nIF(FORECAST($C201,N$205:N$216,$C$205:$C$216)>100,100,\nFORECAST($C201,N$205:N$216,$C$205:$C$216))))","v":97.776052082288572},null,null,null,{"$f":"IF(MAX(C205:C216)-MIN(C205:C216)<5,AVERAGEIF(C205:C216,\">0\",R205:R216),\nIF(FORECAST($C201,R$205:R$216,$C$205:$C$216)<0,0,\nIF(FORECAST($C201,R$205:R$216,$C$205:$C$216)>100,100,\nFORECAST($C201,R$205:R$216,$C$205:$C$216))))","v":0.32215624597365178},{"$f":"IF(MAX(C205:C216)-MIN(C205:C216)<5,AVERAGEIF(C205:C216,\">0\",S205:S216),\nIF(FORECAST($C201,S$205:S$216,$C$205:$C$216)<0,0,\nIF(FORECAST($C201,S$205:S$216,$C$205:$C$216)>100,100,\nFORECAST($C201,S$205:S$216,$C$205:$C$216))))","v":98.655034602510028},null,null,null,{"$f":"IF(MAX(C205:C216)-MIN(C205:C216)<5,AVERAGEIF(C205:C216,\">0\",W205:W216),\nIF(FORECAST($C201,W$205:W$216,$C$205:$C$216)<0,0,\nIF(FORECAST($C201,W$205:W$216,$C$205:$C$216)>100,100,\nFORECAST($C201,W$205:W$216,$C$205:$C$216))))","v":0.24164058909686048},{"$f":"IF(MAX(C205:C216)-MIN(C205:C216)<5,AVERAGEIF(C205:C216,\">0\",X205:X216),\nIF(FORECAST($C201,X$205:X$216,$C$205:$C$216)<0,0,\nIF(FORECAST($C201,X$205:X$216,$C$205:$C$216)>100,100,\nFORECAST($C201,X$205:X$216,$C$205:$C$216))))","v":99.683372228769031},null,null,null,{"$f":"IF(MAX(C205:C216)-MIN(C205:C216)<5,AVERAGEIF(C205:C216,\">0\",AB205:AB216),\nIF(FORECAST($C201,AB$205:AB$216,$C$205:$C$216)<0,0,\nIF(FORECAST($C201,AB$205:AB$216,$C$205:$C$216)>100,100,\nFORECAST($C201,AB$205:AB$216,$C$205:$C$216))))","v":9.1922908439909679E-3}]
[null,null,{"$f":"MaxRegYear(C200,C205:C216)","v":2015},{"$f":"IF(MAX(C205:C216)-MIN(C205:C216)<5,AVERAGEIF(C205:C216,\">0\",D205:D216),\nIF(FORECAST($C202,D$205:D$216,$C$205:$C$216)<0,0,\nIF(FORECAST($C202,D$205:D$216,$C$205:$C$216)>100,100,\nFORECAST($C202,D$205:D$216,$C$205:$C$216))))","v":100},null,null,null,{"$f":"IF(MAX(C205:C216)-MIN(C205:C216)<5,AVERAGEIF(C205:C216,\">0\",H205:H216),\nIF(FORECAST($C202,H$205:H$216,$C$205:$C$216)<0,0,\nIF(FORECAST($C202,H$205:H$216,$C$205:$C$216)>100,100,\nFORECAST($C202,H$205:H$216,$C$205:$C$216))))","v":2.4067046989735275E-3},{"$f":"IF(MAX(C205:C216)-MIN(C205:C216)<5,AVERAGEIF(C205:C216,\">0\",I205:I216),\nIF(FORECAST($C202,I$205:I$216,$C$205:$C$216)<0,0,\nIF(FORECAST($C202,I$205:I$216,$C$205:$C$216)>100,100,\nFORECAST($C202,I$205:I$216,$C$205:$C$216))))","v":99.216909854544781},null,null,null,{"$f":"IF(MAX(C205:C216)-MIN(C205:C216)<5,AVERAGEIF(C205:C216,\">0\",M205:M216),\nIF(FORECAST($C202,M$205:M$216,$C$205:$C$216)<0,0,\nIF(FORECAST($C202,M$205:M$216,$C$205:$C$216)>100,100,\nFORECAST($C202,M$205:M$216,$C$205:$C$216))))","v":0},{"$f":"IF(MAX(C205:C216)-MIN(C205:C216)<5,AVERAGEIF(C205:C216,\">0\",N205:N216),\nIF(FORECAST($C202,N$205:N$216,$C$205:$C$216)<0,0,\nIF(FORECAST($C202,N$205:N$216,$C$205:$C$216)>100,100,\nFORECAST($C202,N$205:N$216,$C$205:$C$216))))","v":100},null,null,null,{"$f":"IF(MAX(C205:C216)-MIN(C205:C216)<5,AVERAGEIF(C205:C216,\">0\",R205:R216),\nIF(FORECAST($C202,R$205:R$216,$C$205:$C$216)<0,0,\nIF(FORECAST($C202,R$205:R$216,$C$205:$C$216)>100,100,\nFORECAST($C202,R$205:R$216,$C$205:$C$216))))","v":0},{"$f":"IF(MAX(C205:C216)-MIN(C205:C216)<5,AVERAGEIF(C205:C216,\">0\",S205:S216),\nIF(FORECAST($C202,S$205:S$216,$C$205:$C$216)<0,0,\nIF(FORECAST($C202,S$205:S$216,$C$205:$C$216)>100,100,\nFORECAST($C202,S$205:S$216,$C$205:$C$216))))","v":100},null,null,null,{"$f":"IF(MAX(C205:C216)-MIN(C205:C216)<5,AVERAGEIF(C205:C216,\">0\",W205:W216),\nIF(FORECAST($C202,W$205:W$216,$C$205:$C$216)<0,0,\nIF(FORECAST($C202,W$205:W$216,$C$205:$C$216)>100,100,\nFORECAST($C202,W$205:W$216,$C$205:$C$216))))","v":0},{"$f":"IF(MAX(C205:C216)-MIN(C205:C216)<5,AVERAGEIF(C205:C216,\">0\",X205:X216),\nIF(FORECAST($C202,X$205:X$216,$C$205:$C$216)<0,0,\nIF(FORECAST($C202,X$205:X$216,$C$205:$C$216)>100,100,\nFORECAST($C202,X$205:X$216,$C$205:$C$216))))","v":99.96278917862287},null,null,null,{"$f":"IF(MAX(C205:C216)-MIN(C205:C216)<5,AVERAGEIF(C205:C216,\">0\",AB205:AB216),\nIF(FORECAST($C202,AB$205:AB$216,$C$205:$C$216)<0,0,\nIF(FORECAST($C202,AB$205:AB$216,$C$205:$C$216)>100,100,\nFORECAST($C202,AB$205:AB$216,$C$205:$C$216))))","v":9.1922908439909679E-3}]
[]
[null,"Survey","Year","Improved","Not shared",null,null,"Open defecation","Improved","Not shared",null,null,"Open defecation","Improved","Not shared",null,null,"Open defecation","Improved","Not shared",null,null,"Open defecation","Improved","Not shared",null,null,"Open defecation"]
[null,"DHS03",2003,{"$f":"IF(ISERROR(INDIRECT(CONCATENATE($B205,\"!H122\"))),\"\",INDIRECT(CONCATENATE($B205,\"!H122\")))","v":91.526704035020842},{"$f":"IF(ISERROR(INDIRECT(CONCATENATE($B205,\"!H129\"))),\"\",INDIRECT(CONCATENATE($B205,\"!H129\")))","v":94.914259515589464},null,null,{"$f":"IF(ISERROR(INDIRECT(CONCATENATE($B205,\"!H127\"))),\"\",INDIRECT(CONCATENATE($B205,\"!H127\")))","v":0.14830981352634842},{"$f":"IF(ISERROR(INDIRECT(CONCATENATE($B205,\"!I122\"))),\"\",INDIRECT(CONCATENATE($B205,\"!I122\")))","v":96.791094278349519},{"$f":"IF(ISERROR(INDIRECT(CONCATENATE($B205,\"!I129\"))),\"\",INDIRECT(CONCATENATE($B205,\"!I129\")))","v":97.964602379209794},null,null,{"$f":"IF(ISERROR(INDIRECT(CONCATENATE($B205,\"!I127\"))),\"\",INDIRECT(CONCATENATE($B205,\"!I127\")))","v":0.21678576885436562},{"$f":"IF(ISERROR(INDIRECT(CONCATENATE($B205,\"!J122\"))),\"\",INDIRECT(CONCATENATE($B205,\"!J122\")))","v":97.984019160576011},{"$f":"IF(ISERROR(INDIRECT(CONCATENATE($B205,\"!J129\"))),\"\",INDIRECT(CONCATENATE($B205,\"!J129\")))","v":99.702097682650631},null,null,{"$f":"IF(ISERROR(INDIRECT(CONCATENATE($B205,\"!J127\"))),\"\",INDIRECT(CONCATENATE($B205,\"!J127\")))","v":0.30349430492653656},{"$f":"IF(ISERROR(INDIRECT(CONCATENATE($B205,\"!K122\"))),\"\",INDIRECT(CONCATENATE($B205,\"!K122\")))","v":98.63432632909624},{"$f":"IF(ISERROR(INDIRECT(CONCATENATE($B205,\"!K129\"))),\"\",INDIRECT(CONCATENATE($B205,\"!K129\")))","v":99.725398997631899},null,null,{"$f":"IF(ISERROR(INDIRECT(CONCATENATE($B205,\"!K127\"))),\"\",INDIRECT(CONCATENATE($B205,\"!K127\")))","v":0.23384573138405912},{"$f":"IF(ISERROR(INDIRECT(CONCATENATE($B205,\"!L122\"))),\"\",INDIRECT(CONCATENATE($B205,\"!L122\")))","v":99.675828586359458},{"$f":"IF(ISERROR(INDIRECT(CONCATENATE($B205,\"!L129\"))),\"\",INDIRECT(CONCATENATE($B205,\"!L129\")))","v":99.973569763525077},null,null,{"$f":"IF(ISERROR(INDIRECT(CONCATENATE($B205,\"!L2127\"))),\"\",INDIRECT(CONCATENATE($B205,\"!L127\")))","v":0}]
[null,"DHS08",2008,97.357736310784531,98.367745031112705,null,null,0.17036090897591055,98.820246726023214,99.593503917947757,null,null,2.9582629040371632E-2,99.487952002145789,99.745667368508322,null,null,2.5636392648680319E-2,99.978005756094404,99.925935808477078,null,null,0,99.91800140275906,99.950448544706077,null,null,2.7576872531972906E-2]
[null,"DHS13",2013,99.026614578843279,98.449030676345856,null,null,0,98.484092433482402,99.642704173252312,null,null,0,99.918413775514139,100,null,null,0,99.799375971602345,99.951075534530659,null,null,0,99.875412121969347,99.933318945962725,null,null,0]
[null,null,null,"","",null,null,"","","",null,null,"","","",null,null,"","","",null,null,"","","",null,null,""]
[null,null,null,"","",null,null,"","","",null,null,"","","",null,null,"","","",null,null,"","","",null,null,""]
[null,null,null,"","",null,null,"","","",null,null,"","","",null,null,"","","",null,null,"","","",null,null,""]
[null,null,null,"","",null,null,"","","",null,null,"","","",null,null,"","","",null,null,"","","",null,null,""]
[null,null,null,"","",null,null,"","","",null,null,"","","",null,null,"","","",null,null,"","","",null,null,""]
[null,null,null,"","",null,null,"","","",null,null,"","","",null,null,"","","",null,null,"","","",null,null,""]
[null,null,null,"","",null,null,"","","",null,null,"","","",null,null,"","","",null,null,"","","",null,null,""]
[null,null,null,"","",null,null,"","","",null,null,"","","",null,null,"","","",null,null,"","","",null,null,""]
[null,null,null,"","",null,null,"","","",null,null,"","","",null,null,"","","",null,null,"","","",null,null,""]
[]
[null,{"$f":"CONCATENATE(\"Urban use of sanitation facilities, \",C199,\"–\",C200)","v":"Urban use of sanitation facilities, 2000–2019"},null,null,null,null,null,null,null,null,null,null,null,null,null,null,null,null,"Data points used for regression"]
[]
[]
[]
[]
[]
[]
[]
[]
[]
[]
[]
[]
[]
[]
[]
[]
[]
[]
[]
[]
[]
[]
[]
[]
[]
[]
[]
[]
[]
[]
[]
[]
[]
[]
[]
[]
[]
[]
[]
[]
[]
[]
[]
[]
[]
[]
[]
[]
[]
[]
[]
[]
[]
[]
[]
[]
[]
[]
[]
[]
[]
[]
[]
[]
[]
[]
[]
[]
[]
[]
[]
[]
[]
[]
[]
[]
[]
[]
["RURAL",null,null,"Poorest",null,null,null,null,"Poor",null,null,null,null,"Middle",null,null,null,null,"Rich",null,null,null,null,"Richest"]
[null,null,null,"Improved","Basic","Limited","Unimproved","Open defecation","Improved","Basic","Limited","Unimproved","Open defecation","Improved","Basic","Limited","Unimproved","Open defecation","Improved","Basic","Limited","Unimproved","Open defecation","Improved","Basic","Limited","Unimproved","Open defecation"]
["Forecast period:",null,2000,{"$f":"IF((D301+H301)>100,D301*100/(D301+H301),D301)","v":35.819019209003272},{"$f":"D299*AVERAGEIF(E305:E316,\">0\")/100","v":33.050028475439134},{"$f":"D299*(100-AVERAGEIF(E305:E316,\">0\"))/100","v":2.7689907335641379},{"$f":"100-(E299+F299+H299)","v":57.249624565557156},{"$f":"IF((D301+H301)>100,H301*100/(D301+H301),H301)","v":6.931356225439572},{"$f":"IF((I301+M301)>100,I301*100/(I301+M301),I301)","v":51.312948448829957},{"$f":"I299*AVERAGEIF(J305:J316,\">0\")/100","v":49.651147176271827},{"$f":"I299*(100-AVERAGEIF(J305:J316,\">0\"))/100","v":1.6618012725581348},{"$f":"100-(J299+K299+M299)","v":47.119930192592555},{"$f":"IF((I301+M301)>100,M301*100/(I301+M301),M301)","v":1.5671213585774808},{"$f":"IF((N301+R301)>100,N301*100/(N301+R301),N301)","v":67.04938841603871},{"$f":"N299*AVERAGEIF(O305:O316,\">0\")/100","v":64.713436452628969},{"$f":"N299*(100-AVERAGEIF(O305:O316,\">0\"))/100","v":2.3359519634097397},{"$f":"100-(O299+P299+R299)","v":32.114119838740677},{"$f":"IF((N301+R301)>100,R301*100/(N301+R301),R301)","v":0.83649174522061287},{"$f":"IF((S301+W301)>100,S301*100/(S301+W301),S301)","v":81.521619692733566},{"$f":"S299*AVERAGEIF(T305:T316,\">0\")/100","v":80.150093667512024},{"$f":"S299*(100-AVERAGEIF(T305:T316,\">0\"))/100","v":1.371526025221548},{"$f":"100-(T299+U299+W299)","v":18.478380307266434},{"$f":"IF((S301+W301)>100,W301*100/(S301+W301),W301)","v":0},{"$f":"IF((X301+AB301)>100,X301*100/(X301+AB301),X301)","v":89.22886583954687},{"$f":"X299*AVERAGEIF(Y305:Y316,\">0\")/100","v":88.366200371321412},{"$f":"X299*(100-AVERAGEIF(Y305:Y316,\">0\"))/100","v":0.86266546822545653},{"$f":"100-(Y299+Z299+AB299)","v":10.77113416045313},{"$f":"IF((X301+AB301)>100,AB301*100/(X301+AB301),AB301)","v":0}]
[null,null,2019,{"$f":"IF((D302+H302)>100,D302*100/(D302+H302),D302)","v":84.365625400350837},{"$f":"D300*AVERAGEIF(E305:E316,\">0\")/100","v":77.843737305039838},{"$f":"D300*(100-AVERAGEIF(E305:E316,\">0\"))/100","v":6.5218880953110068},{"$f":"100-(E300+F300+H300)","v":15.634374599649149},{"$f":"IF((D302+H302)>100,H302*100/(D302+H302),H302)","v":0},{"$f":"IF((I302+M302)>100,I302*100/(I302+M302),I302)","v":89.275024424205185},{"$f":"I300*AVERAGEIF(J305:J316,\">0\")/100","v":86.383798063596672},{"$f":"I300*(100-AVERAGEIF(J305:J316,\">0\"))/100","v":2.8912263606085107},{"$f":"100-(J300+K300+M300)","v":10.724975575794815},{"$f":"IF((I302+M302)>100,M302*100/(I302+M302),M302)","v":0},{"$f":"IF((N302+R302)>100,N302*100/(N302+R302),N302)","v":91.429177865122711},{"$f":"N300*AVERAGEIF(O305:O316,\">0\")/100","v":88.243851755632292},{"$f":"N300*(100-AVERAGEIF(O305:O316,\">0\"))/100","v":3.1853261094904064},{"$f":"100-(O300+P300+R300)","v":8.4832603252834389},{"$f":"IF((N302+R302)>100,R302*100/(N302+R302),R302)","v":8.7561809593864837E-2},{"$f":"IF((S302+W302)>100,S302*100/(S302+W302),S302)","v":92.396931099958238},{"$f":"S300*AVERAGEIF(T305:T316,\">0\")/100","v":90.842437995775086},{"$f":"S300*(100-AVERAGEIF(T305:T316,\">0\"))/100","v":1.5544931041831418},{"$f":"100-(T300+U300+W300)","v":7.6030689000417766},{"$f":"IF((S302+W302)>100,W302*100/(S302+W302),W302)","v":0},{"$f":"IF((X302+AB302)>100,X302*100/(X302+AB302),X302)","v":98.456433063226314},{"$f":"X300*AVERAGEIF(Y305:Y316,\">0\")/100","v":97.504555393044683},{"$f":"X300*(100-AVERAGEIF(Y305:Y316,\">0\"))/100","v":0.95187767018162261},{"$f":"100-(Y300+Z300+AB300)","v":1.5435669367737006},{"$f":"IF((X302+AB302)>100,AB302*100/(X302+AB302),AB302)","v":0}]
["Regression period:",null,{"$f":"MinRegYear(C299,C305:C316)","v":2001},{"$f":"IF(MAX(C305:C316)-MIN(C305:C316)<5,AVERAGEIF(C305:C316,\">0\",D305:D316),\nIF(FORECAST($C301,D$305:D$316,$C$305:$C$316)<0,0,\nIF(FORECAST($C301,D$305:D$316,$C$305:$C$316)>100,100,\nFORECAST($C301,D$305:D$316,$C$305:$C$316))))","v":35.819019209003272},null,null,null,{"$f":"IF(MAX(C305:C316)-MIN(C305:C316)<5,AVERAGEIF(C305:C316,\">0\",H305:H316),\nIF(FORECAST($C301,H$305:H$316,$C$305:$C$316)<0,0,\nIF(FORECAST($C301,H$305:H$316,$C$305:$C$316)>100,100,\nFORECAST($C301,H$305:H$316,$C$305:$C$316))))","v":6.931356225439572},{"$f":"IF(MAX(C305:C316)-MIN(C305:C316)<5,AVERAGEIF(C305:C316,\">0\",I305:I316),\nIF(FORECAST($C301,I$305:I$316,$C$305:$C$316)<0,0,\nIF(FORECAST($C301,I$305:I$316,$C$305:$C$316)>100,100,\nFORECAST($C301,I$305:I$316,$C$305:$C$316))))","v":51.312948448829957},null,null,null,{"$f":"IF(MAX(C305:C316)-MIN(C305:C316)<5,AVERAGEIF(C305:C316,\">0\",M305:M316),\nIF(FORECAST($C301,M$305:M$316,$C$305:$C$316)<0,0,\nIF(FORECAST($C301,M$305:M$316,$C$305:$C$316)>100,100,\nFORECAST($C301,M$305:M$316,$C$305:$C$316))))","v":1.5671213585774808},{"$f":"IF(MAX(C305:C316)-MIN(C305:C316)<5,AVERAGEIF(C305:C316,\">0\",N305:N316),\nIF(FORECAST($C301,N$305:N$316,$C$305:$C$316)<0,0,\nIF(FORECAST($C301,N$305:N$316,$C$305:$C$316)>100,100,\nFORECAST($C301,N$305:N$316,$C$305:$C$316))))","v":67.04938841603871},null,null,null,{"$f":"IF(MAX(C305:C316)-MIN(C305:C316)<5,AVERAGEIF(C305:C316,\">0\",R305:R316),\nIF(FORECAST($C301,R$305:R$316,$C$305:$C$316)<0,0,\nIF(FORECAST($C301,R$305:R$316,$C$305:$C$316)>100,100,\nFORECAST($C301,R$305:R$316,$C$305:$C$316))))","v":0.83649174522061287},{"$f":"IF(MAX(C305:C316)-MIN(C305:C316)<5,AVERAGEIF(C305:C316,\">0\",S305:S316),\nIF(FORECAST($C301,S$305:S$316,$C$305:$C$316)<0,0,\nIF(FORECAST($C301,S$305:S$316,$C$305:$C$316)>100,100,\nFORECAST($C301,S$305:S$316,$C$305:$C$316))))","v":81.521619692733566},null,null,null,{"$f":"IF(MAX(C305:C316)-MIN(C305:C316)<5,AVERAGEIF(C305:C316,\">0\",W305:W316),\nIF(FORECAST($C301,W$305:W$316,$C$305:$C$316)<0,0,\nIF(FORECAST($C301,W$305:W$316,$C$305:$C$316)>100,100,\nFORECAST($C301,W$305:W$316,$C$305:$C$316))))","v":0},{"$f":"IF(MAX(C305:C316)-MIN(C305:C316)<5,AVERAGEIF(C305:C316,\">0\",X305:X316),\nIF(FORECAST($C301,X$305:X$316,$C$305:$C$316)<0,0,\nIF(FORECAST($C301,X$305:X$316,$C$305:$C$316)>100,100,\nFORECAST($C301,X$305:X$316,$C$305:$C$316))))","v":89.22886583954687},null,null,null,{"$f":"IF(MAX(C305:C316)-MIN(C305:C316)<5,AVERAGEIF(C305:C316,\">0\",AB305:AB316),\nIF(FORECAST($C301,AB$305:AB$316,$C$305:$C$316)<0,0,\nIF(FORECAST($C301,AB$305:AB$316,$C$305:$C$316)>100,100,\nFORECAST($C301,AB$305:AB$316,$C$305:$C$316))))","v":0}]
[null,null,{"$f":"MaxRegYear(C300,C305:C316)","v":2015},{"$f":"IF(MAX(C305:C316)-MIN(C305:C316)<5,AVERAGEIF(C305:C316,\">0\",D305:D316),\nIF(FORECAST($C302,D$305:D$316,$C$305:$C$316)<0,0,\nIF(FORECAST($C302,D$305:D$316,$C$305:$C$316)>100,100,\nFORECAST($C302,D$305:D$316,$C$305:$C$316))))","v":84.365625400350837},null,null,null,{"$f":"IF(MAX(C305:C316)-MIN(C305:C316)<5,AVERAGEIF(C305:C316,\">0\",H305:H316),\nIF(FORECAST($C302,H$305:H$316,$C$305:$C$316)<0,0,\nIF(FORECAST($C302,H$305:H$316,$C$305:$C$316)>100,100,\nFORECAST($C302,H$305:H$316,$C$305:$C$316))))","v":0},{"$f":"IF(MAX(C305:C316)-MIN(C305:C316)<5,AVERAGEIF(C305:C316,\">0\",I305:I316),\nIF(FORECAST($C302,I$305:I$316,$C$305:$C$316)<0,0,\nIF(FORECAST($C302,I$305:I$316,$C$305:$C$316)>100,100,\nFORECAST($C302,I$305:I$316,$C$305:$C$316))))","v":89.275024424205185},null,null,null,{"$f":"IF(MAX(C305:C316)-MIN(C305:C316)<5,AVERAGEIF(C305:C316,\">0\",M305:M316),\nIF(FORECAST($C302,M$305:M$316,$C$305:$C$316)<0,0,\nIF(FORECAST($C302,M$305:M$316,$C$305:$C$316)>100,100,\nFORECAST($C302,M$305:M$316,$C$305:$C$316))))","v":0},{"$f":"IF(MAX(C305:C316)-MIN(C305:C316)<5,AVERAGEIF(C305:C316,\">0\",N305:N316),\nIF(FORECAST($C302,N$305:N$316,$C$305:$C$316)<0,0,\nIF(FORECAST($C302,N$305:N$316,$C$305:$C$316)>100,100,\nFORECAST($C302,N$305:N$316,$C$305:$C$316))))","v":91.429177865122711},null,null,null,{"$f":"IF(MAX(C305:C316)-MIN(C305:C316)<5,AVERAGEIF(C305:C316,\">0\",R305:R316),\nIF(FORECAST($C302,R$305:R$316,$C$305:$C$316)<0,0,\nIF(FORECAST($C302,R$305:R$316,$C$305:$C$316)>100,100,\nFORECAST($C302,R$305:R$316,$C$305:$C$316))))","v":8.7561809593864837E-2},{"$f":"IF(MAX(C305:C316)-MIN(C305:C316)<5,AVERAGEIF(C305:C316,\">0\",S305:S316),\nIF(FORECAST($C302,S$305:S$316,$C$305:$C$316)<0,0,\nIF(FORECAST($C302,S$305:S$316,$C$305:$C$316)>100,100,\nFORECAST($C302,S$305:S$316,$C$305:$C$316))))","v":92.396931099958238},null,null,null,{"$f":"IF(MAX(C305:C316)-MIN(C305:C316)<5,AVERAGEIF(C305:C316,\">0\",W305:W316),\nIF(FORECAST($C302,W$305:W$316,$C$305:$C$316)<0,0,\nIF(FORECAST($C302,W$305:W$316,$C$305:$C$316)>100,100,\nFORECAST($C302,W$305:W$316,$C$305:$C$316))))","v":0},{"$f":"IF(MAX(C305:C316)-MIN(C305:C316)<5,AVERAGEIF(C305:C316,\">0\",X305:X316),\nIF(FORECAST($C302,X$305:X$316,$C$305:$C$316)<0,0,\nIF(FORECAST($C302,X$305:X$316,$C$305:$C$316)>100,100,\nFORECAST($C302,X$305:X$316,$C$305:$C$316))))","v":98.456433063226314},null,null,null,{"$f":"IF(MAX(C305:C316)-MIN(C305:C316)<5,AVERAGEIF(C305:C316,\">0\",AB305:AB316),\nIF(FORECAST($C302,AB$305:AB$316,$C$305:$C$316)<0,0,\nIF(FORECAST($C302,AB$305:AB$316,$C$305:$C$316)>100,100,\nFORECAST($C302,AB$305:AB$316,$C$305:$C$316))))","v":0}]
[]
[null,"Survey","Year","Improved","Not shared",null,null,"Open defecation","Improved","Not shared",null,null,"Open defecation","Improved","Not shared",null,null,"Open defecation","Improved","Not shared",null,null,"Open defecation","Improved","Not shared",null,null,"Open defecation"]
[null,"DHS03",2003,{"$f":"IF(ISERROR(INDIRECT(CONCATENATE($B305,\"!M122\"))),\"\",INDIRECT(CONCATENATE($B305,\"!M122\")))","v":41.648586509779811},{"$f":"IF(ISERROR(INDIRECT(CONCATENATE($B305,\"!M129\"))),\"\",INDIRECT(CONCATENATE($B305,\"!M129\")))","v":89.855693308040586},null,null,{"$f":"IF(ISERROR(INDIRECT(CONCATENATE($B305,\"!M127\"))),\"\",INDIRECT(CONCATENATE($B305,\"!M127\")))","v":5.0112592733342254},{"$f":"IF(ISERROR(INDIRECT(CONCATENATE($B305,\"!N122\"))),\"\",INDIRECT(CONCATENATE($B305,\"!N122\")))","v":53.277988569764034},{"$f":"IF(ISERROR(INDIRECT(CONCATENATE($B305,\"!N129\"))),\"\",INDIRECT(CONCATENATE($B305,\"!N129\")))","v":96.518464748450853},null,null,{"$f":"IF(ISERROR(INDIRECT(CONCATENATE($B305,\"!N127\"))),\"\",INDIRECT(CONCATENATE($B305,\"!N127\")))","v":1.4621054405613334},{"$f":"IF(ISERROR(INDIRECT(CONCATENATE($B305,\"!O122\"))),\"\",INDIRECT(CONCATENATE($B305,\"!O122\")))","v":72.825493754278398},{"$f":"IF(ISERROR(INDIRECT(CONCATENATE($B305,\"!O129\"))),\"\",INDIRECT(CONCATENATE($B305,\"!O129\")))","v":96.992102187272565},null,null,{"$f":"IF(ISERROR(INDIRECT(CONCATENATE($B305,\"!O127\"))),\"\",INDIRECT(CONCATENATE($B305,\"!O127\")))","v":0.53494995401911094},{"$f":"IF(ISERROR(INDIRECT(CONCATENATE($B305,\"!P122\"))),\"\",INDIRECT(CONCATENATE($B305,\"!P122\")))","v":83.526412088973785},{"$f":"IF(ISERROR(INDIRECT(CONCATENATE($B305,\"!P129\"))),\"\",INDIRECT(CONCATENATE($B305,\"!P129\")))","v":97.300880791630675},null,null,{"$f":"IF(ISERROR(INDIRECT(CONCATENATE($B305,\"!P127\"))),\"\",INDIRECT(CONCATENATE($B305,\"!P127\")))","v":0},{"$f":"IF(ISERROR(INDIRECT(CONCATENATE($B305,\"!Q122\"))),\"\",INDIRECT(CONCATENATE($B305,\"!Q122\")))","v":90.013596596463742},{"$f":"IF(ISERROR(INDIRECT(CONCATENATE($B305,\"!Q129\"))),\"\",INDIRECT(CONCATENATE($B305,\"!Q129\")))","v":98.867156455600636},null,null,{"$f":"IF(ISERROR(INDIRECT(CONCATENATE($B305,\"!Q2127\"))),\"\",INDIRECT(CONCATENATE($B305,\"!Q127\")))","v":0}]
[null,"DHS08",2008,62.303646614936326,93.139609853991033,null,null,5.2591649289828268,77.210213616184419,97.177242005508418,null,null,0.1688372099921446,74.652726592411767,93.159633816865338,null,null,0.85113037820261261,86.056922434500848,98.73041017363758,null,null,0,94.909635715746418,98.657430940246911,null,null,0]
[null,"DHS13",2013,76.324733789313782,93.813184663328954,null,null,0,80.393757123603649,96.588609450076618,null,null,0,90.239629075052548,99.396482024719049,null,null,0,91.294491665562902,98.921485867217314,null,null,0,96.604716041949118,99.575009937004154,null,null,0]
[null,null,null,"","",null,null,"","","",null,null,"","","",null,null,"","","",null,null,"","","",null,null,""]
[null,null,null,"","",null,null,"","","",null,null,"","","",null,null,"","","",null,null,"","","",null,null,""]
[null,null,null,"","",null,null,"","","",null,null,"","","",null,null,"","","",null,null,"","","",null,null,""]
[null,null,null,"","",null,null,"","","",null,null,"","","",null,null,"","","",null,null,"","","",null,null,""]
[null,null,null,"","",null,null,"","","",null,null,"","","",null,null,"","","",null,null,"","","",null,null,""]
[null,null,null,"","",null,null,"","","",null,null,"","","",null,null,"","","",null,null,"","","",null,null,""]
[null,null,null,"","",null,null,"","","",null,null,"","","",null,null,"","","",null,null,"","","",null,null,""]
[null,null,null,"","",null,null,"","","",null,null,"","","",null,null,"","","",null,null,"","","",null,null,""]
[null,null,null,"","",null,null,"","","",null,null,"","","",null,null,"","","",null,null,"","","",null,null,""]
[]
[null,{"$f":"CONCATENATE(\"Rural use of sanitation facilities, \",C299,\"–\",C300)","v":"Rural use of sanitation facilities, 2000–2019"},null,null,null,null,null,null,null,null,null,null,null,null,null,null,null,null,"Data points used for regression"]

{"sheet":"Hygiene","index":3,"n_rows":91,"n_cols":25,"rows_kept":91,"cut":false,"hidden":false,"merged":[[6,1,6,7],[3,1,3,24],[4,1,4,24],[33,1,34,3],[31,6,32,9],[31,10,31,12],[31,13,31,15],[6,10,6,15],[6,18,6,23],[33,19,34,19],[31,16,31,18],[31,19,31,21],[31,22,31,24],[33,6,34,7],[33,8,34,8],[33,9,34,9],[33,15,34,15],[33,16,34,16],[33,17,34,17],[33,18,34,18],[36,6,37,7],[36,8,37,8],[36,9,37,9],[36,10,37,10],[36,11,37,11],[33,10,34,10],[33,11,34,11],[33,12,34,12],[33,13,34,13],[33,14,34,14],[33,20,34,20],[33,21,34,21],[33,22,34,22],[33,23,34,23],[33,24,34,24],[36,19,37,19],[36,20,37,20],[36,21,37,21],[36,22,37,22],[36,23,37,23],[39,12,40,12],[39,13,40,13],[39,14,40,14],[39,15,40,15],[36,18,37,18],[36,12,37,12],[36,13,37,13],[36,14,37,14],[36,15,37,15],[36,16,37,16],[36,17,37,17],[39,22,40,22],[39,23,40,23],[39,24,40,24],[31,4,32,5],[39,16,40,16],[39,17,40,17],[39,18,40,18],[39,19,40,19],[39,20,40,20],[39,21,40,21],[36,24,37,24],[39,6,40,7],[39,8,40,8],[39,9,40,9],[39,10,40,10],[39,11,40,11]]}
[]
[]
[]
[null,"Access to hygiene facilities by wealth quintile (%)"]
[null,{"$f":"IF(ISERROR(INDIRECT(CONCATENATE($E$32,\"!A2\"))),\"\",INDIRECT(CONCATENATE($E$32,\"!A2\")))","v":"Turkey"}]
[]
[null,{"$f":"CONCATENATE(\"National \",IF(ISERROR(INDIRECT(CONCATENATE($E$32,\"!A2\"))),\"\",INDIRECT(CONCATENATE($E$32,\"!A210\"))))","v":"National Access to hygiene facilities "},null,null,null,null,null,null,null,null,{"$f":"CONCATENATE(\"Urban \",IF(ISERROR(INDIRECT(CONCATENATE($E$32,\"!A2\"))),\"\",INDIRECT(CONCATENATE($E$32,\"!A210\"))))","v":"Urban Access to hygiene facilities "},null,null,null,null,null,null,null,{"$f":"CONCATENATE(\"Rural \",IF(ISERROR(INDIRECT(CONCATENATE($E$32,\"!A2\"))),\"\",INDIRECT(CONCATENATE($E$32,\"!A210\"))))","v":"Rural Access to hygiene facilities "}]
[]
[]
[]
[]
[]
[]
[]
[]
[]
[]
[]
[]
[]
[]
[]
[]
[]
[]
[]
[]
[]
[]
[]
[]
[null,null,null,null,{"$f":"INDEX(B88:B100,A88)","v":"DHS13"},null,{"$f":"IF(ISERROR(INDIRECT(CONCATENATE($E$32,\"!A2\"))),\"\",INDIRECT(CONCATENATE($E$32,\"!A2\")))","v":"Turkey"},null,null,null,"Poorest",null,null,"Poor",null,null,"Middle",null,null,"Rich",null,null,"Richest"]
[null,null,null,null,null,null,null,null,null,null,"Basic","Limited","No facility","Basic","Limited","No facility","Basic","Limited","No facility","Basic","Limited","No facility","Basic","Limited","No facility"]
[null,">>>  Select Survey :   ",null,null,null,null,"NATIONAL",null,null,{"$f":"IF(ISERROR(INDIRECT(CONCATENATE(#REF!,\"!A2\"))),\"\",INDIRECT(CONCATENATE(#REF!,\"!A210\")))","v":""},{"$f":"IF(ISERROR(INDIRECT(CONCATENATE($E$32,\"!C222\"))),\"\",INDIRECT(CONCATENATE($E$32,\"!C222\")))","v":"N/A"},{"$f":"IF(ISERROR(INDIRECT(CONCATENATE($E$32,\"!C223\"))),\"\",INDIRECT(CONCATENATE($E$32,\"!C223\")))","v":"N/A"},{"$f":"IF(ISERROR(INDIRECT(CONCATENATE($E$32,\"!C224\"))),\"\",INDIRECT(CONCATENATE($E$32,\"!C224\")))","v":"N/A"},{"$f":"IF(ISERROR(INDIRECT(CONCATENATE($E$32,\"!D222\"))),\"\",INDIRECT(CONCATENATE($E$32,\"!D222\")))","v":"N/A"},{"$f":"IF(ISERROR(INDIRECT(CONCATENATE($E$32,\"!D223\"))),\"\",INDIRECT(CONCATENATE($E$32,\"!D223\")))","v":"N/A"},{"$f":"IF(ISERROR(INDIRECT(CONCATENATE($E$32,\"!D224\"))),\"\",INDIRECT(CONCATENATE($E$32,\"!D224\")))","v":"N/A"},{"$f":"IF(ISERROR(INDIRECT(CONCATENATE($E$32,\"!E222\"))),\"\",INDIRECT(CONCATENATE($E$32,\"!E222\")))","v":"N/A"},{"$f":"IF(ISERROR(INDIRECT(CONCATENATE($E$32,\"!E223\"))),\"\",INDIRECT(CONCATENATE($E$32,\"!E223\")))","v":"N/A"},{"$f":"IF(ISERROR(INDIRECT(CONCATENATE($E$32,\"!E224\"))),\"\",INDIRECT(CONCATENATE($E$32,\"!E224\")))","v":"N/A"},{"$f":"IF(ISERROR(INDIRECT(CONCATENATE($E$32,\"!F222\"))),\"\",INDIRECT(CONCATENATE($E$32,\"!F222\")))","v":"N/A"},{"$f":"IF(ISERROR(INDIRECT(CONCATENATE($E$32,\"!F223\"))),\"\",INDIRECT(CONCATENATE($E$32,\"!F223\")))","v":"N/A"},{"$f":"IF(ISERROR(INDIRECT(CONCATENATE($E$32,\"!F224\"))),\"\",INDIRECT(CONCATENATE($E$32,\"!F224\")))","v":"N/A"},{"$f":"IF(ISERROR(INDIRECT(CONCATENATE($E$32,\"!G222\"))),\"\",INDIRECT(CONCATENATE($E$32,\"!G222\")))","v":"N/A"},{"$f":"IF(ISERROR(INDIRECT(CONCATENATE($E$32,\"!G223\"))),\"\",INDIRECT(CONCATENATE($E$32,\"!G223\")))","v":"N/A"},{"$f":"IF(ISERROR(INDIRECT(CONCATENATE($E$32,\"!G224\"))),\"\",INDIRECT(CONCATENATE($E$32,\"!G224\")))","v":"N/A"}]
[]
[]
[null,null,null,null,null,null,"URBAN",null,null,{"$f":"IF(ISERROR(INDIRECT(CONCATENATE(#REF!,\"!A2\"))),\"\",INDIRECT(CONCATENATE(#REF!,\"!A210\")))","v":""},{"$f":"IF(ISERROR(INDIRECT(CONCATENATE($E$32,\"!H222\"))),\"\",INDIRECT(CONCATENATE($E$32,\"!H222\")))","v":"N/A"},{"$f":"IF(ISERROR(INDIRECT(CONCATENATE($E$32,\"!H223\"))),\"\",INDIRECT(CONCATENATE($E$32,\"!H223\")))","v":"N/A"},{"$f":"IF(ISERROR(INDIRECT(CONCATENATE($E$32,\"!H224\"))),\"\",INDIRECT(CONCATENATE($E$32,\"!H224\")))","v":"N/A"},{"$f":"IF(ISERROR(INDIRECT(CONCATENATE($E$32,\"!I222\"))),\"\",INDIRECT(CONCATENATE($E$32,\"!I222\")))","v":"N/A"},{"$f":"IF(ISERROR(INDIRECT(CONCATENATE($E$32,\"!I223\"))),\"\",INDIRECT(CONCATENATE($E$32,\"!I223\")))","v":"N/A"},{"$f":"IF(ISERROR(INDIRECT(CONCATENATE($E$32,\"!I224\"))),\"\",INDIRECT(CONCATENATE($E$32,\"!I224\")))","v":"N/A"},{"$f":"IF(ISERROR(INDIRECT(CONCATENATE($E$32,\"!J222\"))),\"\",INDIRECT(CONCATENATE($E$32,\"!J222\")))","v":"N/A"},{"$f":"IF(ISERROR(INDIRECT(CONCATENATE($E$32,\"!J223\"))),\"\",INDIRECT(CONCATENATE($E$32,\"!J223\")))","v":"N/A"},{"$f":"IF(ISERROR(INDIRECT(CONCATENATE($E$32,\"!J224\"))),\"\",INDIRECT(CONCATENATE($E$32,\"!J224\")))","v":"N/A"},{"$f":"IF(ISERROR(INDIRECT(CONCATENATE($E$32,\"!K222\"))),\"\",INDIRECT(CONCATENATE($E$32,\"!K222\")))","v":"N/A"},{"$f":"IF(ISERROR(INDIRECT(CONCATENATE($E$32,\"!K223\"))),\"\",INDIRECT(CONCATENATE($E$32,\"!K223\")))","v":"N/A"},{"$f":"IF(ISERROR(INDIRECT(CONCATENATE($E$32,\"!K224\"))),\"\",INDIRECT(CONCATENATE($E$32,\"!K224\")))","v":"N/A"},{"$f":"IF(ISERROR(INDIRECT(CONCATENATE($E$32,\"!L222\"))),\"\",INDIRECT(CONCATENATE($E$32,\"!L222\")))","v":"N/A"},{"$f":"IF(ISERROR(INDIRECT(CONCATENATE($E$32,\"!L223\"))),\"\",INDIRECT(CONCATENATE($E$32,\"!L223\")))","v":"N/A"},{"$f":"IF(ISERROR(INDIRECT(CONCATENATE($E$32,\"!L224\"))),\"\",INDIRECT(CONCATENATE($E$32,\"!L224\")))","v":"N/A"}]
[]
[]
[null,null,null,null,null,null,"RURAL",null,null,{"$f":"IF(ISERROR(INDIRECT(CONCATENATE(#REF!,\"!A2\"))),\"\",INDIRECT(CONCATENATE(#REF!,\"!A210\")))","v":""},{"$f":"IF(ISERROR(INDIRECT(CONCATENATE($E$32,\"!M222\"))),\"\",INDIRECT(CONCATENATE($E$32,\"!M222\")))","v":"N/A"},{"$f":"IF(ISERROR(INDIRECT(CONCATENATE($E$32,\"!M223\"))),\"\",INDIRECT(CONCATENATE($E$32,\"!M223\")))","v":"N/A"},{"$f":"IF(ISERROR(INDIRECT(CONCATENATE($E$32,\"!M224\"))),\"\",INDIRECT(CONCATENATE($E$32,\"!M224\")))","v":"N/A"},{"$f":"IF(ISERROR(INDIRECT(CONCATENATE($E$32,\"!N222\"))),\"\",INDIRECT(CONCATENATE($E$32,\"!N222\")))","v":"N/A"},{"$f":"IF(ISERROR(INDIRECT(CONCATENATE($E$32,\"!N223\"))),\"\",INDIRECT(CONCATENATE($E$32,\"!N223\")))","v":"N/A"},{"$f":"IF(ISERROR(INDIRECT(CONCATENATE($E$32,\"!N224\"))),\"\",INDIRECT(CONCATENATE($E$32,\"!N224\")))","v":"N/A"},{"$f":"IF(ISERROR(INDIRECT(CONCATENATE($E$32,\"!O222\"))),\"\",INDIRECT(CONCATENATE($E$32,\"!O222\")))","v":"N/A"},{"$f":"IF(ISERROR(INDIRECT(CONCATENATE($E$32,\"!O223\"))),\"\",INDIRECT(CONCATENATE($E$32,\"!O223\")))","v":"N/A"},{"$f":"IF(ISERROR(INDIRECT(CONCATENATE($E$32,\"!O224\"))),\"\",INDIRECT(CONCATENATE($E$32,\"!O224\")))","v":"N/A"},{"$f":"IF(ISERROR(INDIRECT(CONCATENATE($E$32,\"!P222\"))),\"\",INDIRECT(CONCATENATE($E$32,\"!P222\")))","v":"N/A"},{"$f":"IF(ISERROR(INDIRECT(CONCATENATE($E$32,\"!P223\"))),\"\",INDIRECT(CONCATENATE($E$32,\"!P223\")))","v":"N/A"},{"$f":"IF(ISERROR(INDIRECT(CONCATENATE($E$32,\"!P224\"))),\"\",INDIRECT(CONCATENATE($E$32,\"!P224\")))","v":"N/A"},{"$f":"IF(ISERROR(INDIRECT(CONCATENATE($E$32,\"!Q222\"))),\"\",INDIRECT(CONCATENATE($E$32,\"!Q222\")))","v":"N/A"},{"$f":"IF(ISERROR(INDIRECT(CONCATENATE($E$32,\"!Q223\"))),\"\",INDIRECT(CONCATENATE($E$32,\"!Q223\")))","v":"N/A"},{"$f":"IF(ISERROR(INDIRECT(CONCATENATE($E$32,\"!Q224\"))),\"\",INDIRECT(CONCATENATE($E$32,\"!Q224\")))","v":"N/A"}]
[]
[]
[]
[]
[]
[]
[]
[]
[]
[]
[]
[]
[]
[]
[]
[]
[]
[]
[]
[]
[]
[]
[]
[]
[]
[]
[]
[]
[]
[]
[]
[]
[]
[]
[]
[]
[]
[]
[]
[]
[]
[]
[]
[]
[]
[]
[]
[3,"DHS03"]
[null,"DHS08"]
[null,"DHS13"]
[null,"Template"]

{"sheet":"DHS03","index":4,"n_rows":1072,"n_cols":74,"rows_kept":1072,"cut":false,"hidden":false,"merged":[[346,52,347,52],[348,52,349,52],[350,52,351,52],[352,52,353,52],[152,52,157,52],[270,52,272,52],[273,52,275,52],[276,52,283,52],[338,54,338,58],[338,59,338,63],[338,64,338,68],[340,52,341,52],[342,52,343,52],[344,52,345,52],[221,52,223,52],[224,52,225,52],[226,52,229,52],[258,54,258,58],[258,59,258,63],[258,64,258,68],[260,52,262,52],[263,52,266,52],[267,52,269,52],[119,64,119,68],[121,52,122,52],[123,52,126,52],[127,52,128,52],[132,54,132,58],[132,59,132,63],[132,64,132,68],[134,52,138,52],[219,54,219,58],[219,59,219,63],[219,64,219,68],[13,64,13,68],[15,52,16,52],[17,52,20,52],[21,52,22,52],[26,54,26,58],[26,59,26,63],[26,64,26,68],[40,52,41,52],[55,54,55,58],[55,59,55,63],[55,64,55,68],[139,52,142,52],[143,0,146,0],[143,52,146,52],[147,0,149,0],[147,52,149,52],[150,0,151,0],[150,52,151,52],[13,54,13,58],[13,59,13,63],[119,54,119,58],[119,59,119,63],[42,52,43,52],[44,52,45,52],[46,0,48,0],[46,52,48,52],[49,0,51,0],[49,52,51,52],[52,0,54,0],[52,52,54,52],[32,52,33,52],[34,52,35,52],[36,52,37,52],[38,0,39,0],[38,52,39,52],[13,2,13,6],[13,7,13,11],[28,52,29,52],[30,0,31,0],[30,52,31,52],[26,2,26,6],[26,7,26,11],[26,12,26,16],[13,12,13,16],[15,0,16,0],[17,0,20,0],[21,0,22,0],[23,0,25,0],[32,0,33,0],[55,2,55,6],[55,7,55,11],[55,12,55,16],[28,0,29,0],[34,0,35,0],[36,0,37,0],[40,0,41,0],[42,0,43,0],[44,0,45,0],[139,0,142,0],[119,2,119,6],[119,7,119,11],[119,12,119,16],[57,0,68,0],[107,0,107,1],[134,0,138,0],[152,0,156,0],[121,0,122,0],[123,0,126,0],[127,0,128,0],[129,0,131,0],[132,2,132,6],[132,7,132,11],[132,12,132,16],[207,0,207,1],[219,2,219,6],[219,7,219,11],[1024,0,1024,2],[1025,0,1025,1],[1030,0,1032,0],[1033,0,1033,2],[398,2,398,5],[219,12,219,16],[221,0,223,0],[398,7,398,10],[398,12,398,15],[399,2,399,4],[399,7,399,9],[399,12,399,14],[400,2,401,3],[400,7,401,8],[400,12,401,13],[405,2,405,3],[405,7,405,8],[405,12,405,13],[406,2,406,3],[406,7,406,8],[406,12,406,13],[401,1,444,1],[402,2,402,3],[402,7,402,8],[402,12,402,13],[403,2,403,3],[403,7,403,8],[403,12,403,13],[404,2,404,3],[404,7,404,8],[404,12,404,13],[409,2,409,3],[409,7,409,8],[409,12,409,13],[410,2,410,3],[410,7,410,8],[410,12,410,13],[407,2,407,3],[407,7,407,8],[407,12,407,13],[408,2,408,3],[408,7,408,8],[408,12,408,13],[413,2,413,3],[413,7,413,8],[413,12,413,13],[414,2,414,3],[414,7,414,8],[414,12,414,13],[411,2,411,3],[411,7,411,8],[411,12,411,13],[412,2,412,3],[412,7,412,8],[412,12,412,13],[417,2,417,3],[417,7,417,8],[417,12,417,13],[418,2,418,3],[418,7,418,8],[418,12,418,13],[415,2,415,3],[415,7,415,8],[415,12,415,13],[416,2,416,3],[416,7,416,8],[416,12,416,13],[421,2,421,3],[421,7,421,8],[421,12,421,13],[422,2,422,3],[422,7,422,8],[422,12,422,13],[419,2,419,3],[419,7,419,8],[419,12,419,13],[420,2,420,3],[420,7,420,8],[420,12,420,13],[425,2,425,3],[425,7,425,8],[425,12,425,13],[426,2,426,3],[426,7,426,8],[426,12,426,13],[423,2,423,3],[423,7,423,8],[423,12,423,13],[424,2,424,3],[424,7,424,8],[424,12,424,13],[429,2,429,3],[429,7,429,8],[429,12,429,13],[430,2,430,3],[430,7,430,8],[430,12,430,13],[427,2,427,3],[427,7,427,8],[427,12,427,13],[428,2,428,3],[428,7,428,8],[428,12,428,13],[433,2,433,3],[433,7,433,8],[433,12,433,13],[434,2,434,3],[434,7,434,8],[434,12,434,13],[431,2,431,3],[431,7,431,8],[431,12,431,13],[432,2,432,3],[432,7,432,8],[432,12,432,13],[437,2,437,3],[437,7,437,8],[437,12,437,13],[438,2,438,3],[438,7,438,8],[438,12,438,13],[435,2,435,3],[435,7,435,8],[435,12,435,13],[436,2,436,3],[436,7,436,8],[436,12,436,13],[441,2,441,3],[441,7,441,8],[441,12,441,13],[442,2,442,3],[442,7,442,8],[442,12,442,13],[439,2,439,3],[439,7,439,8],[439,12,439,13],[440,2,440,3],[440,7,440,8],[440,12,440,13],[445,2,445,3],[445,7,445,8],[445,12,445,13],[446,2,446,4],[446,7,446,9],[446,12,446,14],[443,2,443,3],[443,7,443,8],[443,12,443,13],[444,2,444,3],[444,7,444,8],[444,12,444,13],[449,2,449,3],[449,7,449,8],[449,12,449,13],[450,2,450,3],[450,7,450,8],[450,12,450,13],[447,2,447,3],[447,7,447,8],[447,12,447,13],[448,2,448,3],[448,7,448,8],[448,12,448,13],[453,2,453,3],[453,7,453,8],[453,12,453,13],[454,2,454,3],[454,7,454,8],[454,12,454,13],[451,2,451,3],[451,7,451,8],[451,12,451,13],[452,2,452,3],[452,7,452,8],[452,12,452,13],[457,2,457,3],[457,7,457,8],[457,12,457,13],[458,2,458,3],[458,7,458,8],[458,12,458,13],[455,2,455,3],[455,7,455,8],[455,12,455,13],[456,2,456,3],[456,7,456,8],[456,12,456,13],[461,2,461,3],[461,7,461,8],[461,12,461,13],[462,2,462,3],[462,7,462,8],[462,12,462,13],[459,2,459,3],[459,7,459,8],[459,12,459,13],[460,2,460,3],[460,7,460,8],[460,12,460,13],[465,2,465,3],[465,7,465,8],[465,12,465,13],[466,2,466,3],[466,7,466,8],[466,12,466,13],[463,2,463,3],[463,7,463,8],[463,12,463,13],[464,2,464,3],[464,7,464,8],[464,12,464,13],[469,2,469,3],[469,7,469,8],[469,12,469,13],[470,2,470,3],[470,7,470,8],[470,12,470,13],[467,2,467,3],[467,7,467,8],[467,12,467,13],[468,2,468,3],[468,7,468,8],[468,12,468,13],[473,2,473,3],[473,7,473,8],[473,12,473,13],[474,2,474,3],[474,7,474,8],[474,12,474,13],[471,2,471,3],[471,7,471,8],[471,12,471,13],[472,2,472,3],[472,7,472,8],[472,12,472,13],[477,2,477,3],[477,7,477,8],[477,12,477,13],[478,2,478,3],[478,7,478,8],[478,12,478,13],[475,2,475,3],[475,7,475,8],[475,12,475,13],[476,2,476,3],[476,7,476,8],[476,12,476,13],[481,2,481,3],[481,7,481,8],[481,12,481,13],[482,2,482,3],[482,7,482,8],[482,12,482,13],[479,2,479,3],[479,7,479,8],[479,12,479,13],[480,2,480,3],[480,7,480,8],[480,12,480,13],[485,2,485,3],[485,7,485,8],[485,12,485,13],[486,2,486,3],[486,7,486,8],[486,12,486,13],[483,2,483,3],[483,7,483,8],[483,12,483,13],[484,2,484,3],[484,7,484,8],[484,12,484,13],[489,2,489,3],[489,7,489,8],[489,12,489,13],[490,2,490,3],[490,7,490,8],[490,12,490,13],[487,2,487,3],[487,7,487,8],[487,12,487,13],[488,2,488,3],[488,7,488,8],[488,12,488,13],[491,2,491,6],[491,7,491,11],[491,12,491,16],[492,2,493,3],[492,4,492,6],[492,7,493,8],[492,9,492,11],[492,12,493,13],[492,14,492,16],[496,2,496,3],[496,7,496,8],[496,12,496,13],[497,2,497,4],[497,7,497,9],[497,12,497,14],[494,2,494,3],[494,7,494,8],[494,12,494,13],[495,2,495,3],[495,7,495,8],[495,12,495,13],[501,2,501,3],[501,7,501,8],[501,12,501,13],[502,2,502,3],[502,7,502,8],[502,12,502,13],[498,2,499,3],[498,7,499,8],[498,12,499,13],[500,2,500,3],[500,7,500,8],[500,12,500,13],[505,2,505,3],[505,7,505,8],[505,12,505,13],[506,2,506,3],[506,7,506,8],[506,12,506,13],[503,2,503,3],[503,7,503,8],[503,12,503,13],[504,2,504,3],[504,7,504,8],[504,12,504,13],[509,2,509,3],[509,7,509,8],[509,12,509,13],[510,2,510,3],[510,7,510,8],[510,12,510,13],[507,2,507,3],[507,7,507,8],[507,12,507,13],[508,2,508,3],[508,7,508,8],[508,12,508,13],[513,2,513,3],[513,7,513,8],[513,12,513,13],[514,2,514,3],[514,7,514,8],[514,12,514,13],[511,2,511,3],[511,7,511,8],[511,12,511,13],[512,2,512,3],[512,7,512,8],[512,12,512,13],[517,2,517,3],[517,7,517,8],[517,12,517,13],[518,2,518,3],[518,7,518,8],[518,12,518,13],[515,2,515,3],[515,7,515,8],[515,12,515,13],[516,2,516,3],[516,7,516,8],[516,12,516,13],[521,2,521,3],[521,7,521,8],[521,12,521,13],[522,2,522,3],[522,7,522,8],[522,12,522,13],[519,2,519,3],[519,7,519,8],[519,12,519,13],[520,2,520,3],[520,7,520,8],[520,12,520,13],[525,2,525,3],[525,7,525,8],[525,12,525,13],[526,2,526,3],[526,7,526,8],[526,12,526,13],[523,2,523,3],[523,7,523,8],[523,12,523,13],[524,2,524,3],[524,7,524,8],[524,12,524,13],[529,2,529,3],[529,7,529,8],[529,12,529,13],[530,2,530,3],[530,7,530,8],[530,12,530,13],[527,2,527,3],[527,7,527,8],[527,12,527,13],[528,2,528,3],[528,7,528,8],[528,12,528,13],[533,2,533,3],[533,7,533,8],[533,12,533,13],[534,2,534,3],[534,7,534,8],[534,12,534,13],[531,2,531,3],[531,7,531,8],[531,12,531,13],[532,2,532,3],[532,7,532,8],[532,12,532,13],[537,2,537,3],[537,7,537,8],[537,12,537,13],[538,2,538,3],[538,7,538,8],[538,12,538,13],[535,2,535,3],[535,7,535,8],[535,12,535,13],[536,2,536,3],[536,7,536,8],[536,12,536,13],[541,2,541,3],[541,7,541,8],[541,12,541,13],[542,2,542,3],[542,7,542,8],[542,12,542,13],[539,2,539,3],[539,7,539,8],[539,12,539,13],[540,2,540,3],[540,7,540,8],[540,12,540,13],[545,2,545,3],[545,7,545,8],[545,12,545,13],[546,2,546,3],[546,7,546,8],[546,12,546,13],[543,2,543,4],[543,7,543,9],[543,12,543,14],[544,2,544,3],[544,7,544,8],[544,12,544,13],[549,2,549,3],[549,7,549,8],[549,12,549,13],[550,2,550,3],[550,7,550,8],[550,12,550,13],[547,2,547,3],[547,7,547,8],[547,12,547,13],[548,2,548,3],[548,7,548,8],[548,12,548,13],[553,2,553,3],[553,7,553,8],[553,12,553,13],[554,2,554,3],[554,7,554,8],[554,12,554,13],[551,2,551,3],[551,7,551,8],[551,12,551,13],[552,2,552,3],[552,7,552,8],[552,12,552,13],[557,2,557,3],[557,7,557,8],[557,12,557,13],[558,2,558,3],[558,7,558,8],[558,12,558,13],[555,2,555,3],[555,7,555,8],[555,12,555,13],[556,2,556,3],[556,7,556,8],[556,12,556,13],[561,2,561,3],[561,7,561,8],[561,12,561,13],[562,2,562,3],[562,7,562,8],[562,12,562,13],[559,2,559,3],[559,7,559,8],[559,12,559,13],[560,2,560,3],[560,7,560,8],[560,12,560,13],[565,2,565,3],[565,7,565,8],[565,12,565,13],[566,2,566,3],[566,7,566,8],[566,12,566,13],[563,2,563,3],[563,7,563,8],[563,12,563,13],[564,2,564,3],[564,7,564,8],[564,12,564,13],[569,2,569,3],[569,7,569,8],[569,12,569,13],[570,2,570,3],[570,7,570,8],[570,12,570,13],[567,2,567,3],[567,7,567,8],[567,12,567,13],[568,2,568,3],[568,7,568,8],[568,12,568,13],[573,2,573,3],[573,7,573,8],[573,12,573,13],[574,2,574,3],[574,7,574,8],[574,12,574,13],[571,2,571,3],[571,7,571,8],[571,12,571,13],[572,2,572,3],[572,7,572,8],[572,12,572,13],[577,2,577,3],[577,7,577,8],[577,12,577,13],[578,2,578,3],[578,7,578,8],[578,12,578,13],[575,2,575,3],[575,7,575,8],[575,12,575,13],[576,2,576,3],[576,7,576,8],[576,12,576,13],[581,2,581,3],[581,7,581,8],[581,12,581,13],[582,2,582,3],[582,7,582,8],[582,12,582,13],[579,2,579,3],[579,7,579,8],[579,12,579,13],[580,2,580,3],[580,7,580,8],[580,12,580,13],[585,2,585,3],[585,7,585,8],[585,12,585,13],[586,2,586,3],[586,7,586,8],[586,12,586,13],[583,2,583,3],[583,7,583,8],[583,12,583,13],[584,2,584,3],[584,7,584,8],[584,12,584,13],[589,2,589,3],[589,7,589,8],[589,12,589,13],[590,2,590,3],[590,7,590,8],[590,12,590,13],[587,2,587,3],[587,7,587,8],[587,12,587,13],[588,2,588,3],[588,7,588,8],[588,12,588,13],[593,2,593,3],[593,7,593,8],[593,12,593,13],[594,2,594,3],[594,7,594,8],[594,12,594,13],[591,2,591,3],[591,7,591,8],[591,12,591,13],[592,2,592,3],[592,7,592,8],[592,12,592,13],[597,2,597,3],[597,7,597,8],[597,12,597,13],[598,2,598,3],[598,7,598,8],[598,12,598,13],[595,2,595,3],[595,7,595,8],[595,12,595,13],[596,2,596,3],[596,7,596,8],[596,12,596,13],[601,2,601,3],[601,7,601,8],[601,12,601,13],[602,2,602,3],[602,7,602,8],[602,12,602,13],[599,2,599,3],[599,7,599,8],[599,12,599,13],[600,2,600,3],[600,7,600,8],[600,12,600,13],[605,2,605,3],[605,7,605,8],[605,12,605,13],[606,2,606,3],[606,7,606,8],[606,12,606,13],[603,2,603,3],[603,7,603,8],[603,12,603,13],[604,2,604,3],[604,7,604,8],[604,12,604,13],[609,2,609,3],[609,7,609,8],[609,12,609,13],[610,2,610,3],[610,7,610,8],[610,12,610,13],[607,2,607,3],[607,7,607,8],[607,12,607,13],[608,2,608,3],[608,7,608,8],[608,12,608,13],[613,2,613,3],[613,7,613,8],[613,12,613,13],[614,2,614,3],[614,7,614,8],[614,12,614,13],[611,2,611,3],[611,7,611,8],[611,12,611,13],[612,2,612,3],[612,7,612,8],[612,12,612,13],[617,2,617,3],[617,7,617,8],[617,12,617,13],[618,2,618,3],[618,7,618,8],[618,12,618,13],[615,2,615,3],[615,7,615,8],[615,12,615,13],[616,2,616,3],[616,7,616,8],[616,12,616,13],[621,2,621,3],[621,7,621,8],[621,12,621,13],[622,2,622,3],[622,7,622,8],[622,12,622,13],[619,2,619,3],[619,7,619,8],[619,12,619,13],[620,2,620,3],[620,7,620,8],[620,12,620,13],[625,2,625,3],[625,7,625,8],[625,12,625,13],[626,2,626,3],[626,7,626,8],[626,12,626,13],[623,2,623,3],[623,7,623,8],[623,12,623,13],[624,2,624,3],[624,7,624,8],[624,12,624,13],[629,2,629,3],[629,7,629,8],[629,12,629,13],[630,2,630,3],[630,7,630,8],[630,12,630,13],[627,2,627,3],[627,7,627,8],[627,12,627,13],[628,2,628,3],[628,7,628,8],[628,12,628,13],[633,2,633,3],[633,7,633,8],[633,12,633,13],[634,2,634,3],[634,7,634,8],[634,12,634,13],[631,2,631,3],[631,7,631,8],[631,12,631,13],[632,2,632,3],[632,7,632,8],[632,12,632,13],[637,2,637,3],[637,7,637,8],[637,12,637,13],[638,2,638,3],[638,7,638,8],[638,12,638,13],[635,2,635,3],[635,7,635,8],[635,12,635,13],[636,2,636,3],[636,7,636,8],[636,12,636,13],[641,2,641,3],[641,7,641,8],[641,12,641,13],[642,2,642,3],[642,7,642,8],[642,12,642,13],[639,2,639,3],[639,7,639,8],[639,12,639,13],[640,2,640,3],[640,7,640,8],[640,12,640,13],[645,2,645,3],[645,7,645,8],[645,12,645,13],[646,2,646,3],[646,7,646,8],[646,12,646,13],[643,2,643,3],[643,7,643,8],[643,12,643,13],[644,2,644,3],[644,7,644,8],[644,12,644,13],[649,2,649,3],[649,7,649,8],[649,12,649,13],[650,2,650,3],[650,7,650,8],[650,12,650,13],[647,2,647,3],[647,7,647,8],[647,12,647,13],[648,2,648,3],[648,7,648,8],[648,12,648,13],[653,2,653,3],[653,7,653,8],[653,12,653,13],[654,2,654,3],[654,7,654,8],[654,12,654,13],[651,2,651,3],[651,7,651,8],[651,12,651,13],[652,2,652,3],[652,7,652,8],[652,12,652,13],[657,2,657,3],[657,7,657,8],[657,12,657,13],[658,2,658,3],[658,7,658,8],[658,12,658,13],[655,2,655,3],[655,7,655,8],[655,12,655,13],[656,2,656,3],[656,7,656,8],[656,12,656,13],[661,2,661,3],[661,7,661,8],[661,12,661,13],[662,2,662,3],[662,7,662,8],[662,12,662,13],[659,2,659,3],[659,7,659,8],[659,12,659,13],[660,2,660,3],[660,7,660,8],[660,12,660,13],[665,2,665,3],[665,7,665,8],[665,12,665,13],[666,2,666,3],[666,7,666,8],[666,12,666,13],[663,2,663,3],[663,7,663,8],[663,12,663,13],[664,2,664,3],[664,7,664,8],[664,12,664,13],[669,2,669,3],[669,7,669,8],[669,12,669,13],[670,2,670,3],[670,7,670,8],[670,12,670,13],[667,2,667,3],[667,7,667,8],[667,12,667,13],[668,2,668,3],[668,7,668,8],[668,12,668,13],[673,2,673,3],[673,7,673,8],[673,12,673,13],[674,2,674,3],[674,7,674,8],[674,12,674,13],[671,2,671,3],[671,7,671,8],[671,12,671,13],[672,2,672,3],[672,7,672,8],[672,12,672,13],[677,2,677,3],[677,7,677,8],[677,12,677,13],[678,2,678,3],[678,7,678,8],[678,12,678,13],[675,2,675,3],[675,7,675,8],[675,12,675,13],[676,2,676,3],[676,7,676,8],[676,12,676,13],[681,2,681,3],[681,7,681,8],[681,12,681,13],[682,2,682,3],[682,7,682,8],[682,12,682,13],[679,2,679,3],[679,7,679,8],[679,12,679,13],[680,2,680,3],[680,7,680,8],[680,12,680,13],[685,2,685,3],[685,7,685,8],[685,12,685,13],[686,2,686,3],[686,7,686,8],[686,12,686,13],[683,2,683,3],[683,7,683,8],[683,12,683,13],[684,2,684,3],[684,7,684,8],[684,12,684,13],[689,2,689,3],[689,7,689,8],[689,12,689,13],[690,2,690,3],[690,7,690,8],[690,12,690,13],[687,2,687,3],[687,7,687,8],[687,12,687,13],[688,2,688,3],[688,7,688,8],[688,12,688,13],[693,2,693,3],[693,7,693,8],[693,12,693,13],[694,2,694,3],[694,7,694,8],[694,12,694,13],[691,2,691,3],[691,7,691,8],[691,12,691,13],[692,2,692,3]],"merged_total":1014,"flags":["merged_cut"]}
[]
[{"$f":"A1026","v":"Turkey"}]
[{"$f":"A1034","v":"2003"}]
["Use of drinking water sources"]
[" by wealth quintile and sub-national region"]
["Notes:"]
["WHO/UNICEF JMP customised wealth index excludes water,"]
[" sanitation and hygiene assets."]
["Survey used for analysis:",{"$f":"A1025","v":"DHS03"}]
["Improved wells + springs based on :","DHS13"]
[{"$f":"B1027","v":""}]
[]
[]
["Use of drinking water sources",null,"NATIONAL wealth index quintile",null,null,null,null,"URBAN wealth index quintile",null,null,null,null,"RURAL wealth index quintile",null,null,null,null,"SUB-REGIONS:",null,null,null,null,null,null,null,null,null,null,null,null,null,null,null,null,null,null,null,null,null,null,null,null,null,null,null,null,null,null,null,null,null,null,"Raw numbers of respondents:","Use of drinking water sources","NATIONAL wealth index quintile",null,null,null,null,"URBAN wealth index quintile",null,null,null,null,"RURAL wealth index quintile",null,null,null,null,"SUB-REGIONS:"]
["Weighted percentage (used in graphs)",null,"Poorest","Poor","Middle","Rich","Richest","Poorest","Poor","Middle","Rich","Richest","Poorest","Poor","Middle","Rich","Richest","Central","East","North","South","West",null,null,null,null,null,null,null,null,null,null,null,null,null,null,null,null,null,null,null,null,null,null,null,null,null,null,null,null,null,null,"Water data, raw numbers (weighted)",null,"Poorest","Poor","Middle","Rich","Richest","Poorest","Poor","Middle","Rich","Richest","Poorest","Poor","Middle","Rich","Richest","Central","East","North","South","West"]
["Water","Improved",{"$f":"C58+C59+C62+C65+C66+C67+C68+C63*'DHS13'!C25/100+('DHS03'!C60+'DHS03'!C61)*'DHS13'!C24/100","v":97.555629554731894},{"$f":"D58+D59+D62+D65+D66+D67+D68+D63*'DHS13'!D25/100+('DHS03'!D60+'DHS03'!D61)*'DHS13'!D24/100","v":98.808118674616821},{"$f":"E58+E59+E62+E65+E66+E67+E68+E63*'DHS13'!E25/100+('DHS03'!E60+'DHS03'!E61)*'DHS13'!E24/100","v":99.463235841763733},{"$f":"F58+F59+F62+F65+F66+F67+F68+F63*'DHS13'!F25/100+('DHS03'!F60+'DHS03'!F61)*'DHS13'!F24/100","v":99.665710822409096},{"$f":"G58+G59+G62+G65+G66+G67+G68+G63*'DHS13'!G25/100+('DHS03'!G60+'DHS03'!G61)*'DHS13'!G24/100","v":99.383093636468743},{"$f":"H58+H59+H62+H65+H66+H67+H68+H63*'DHS13'!H25/100+('DHS03'!H60+'DHS03'!H61)*'DHS13'!H24/100","v":99.344619101521431},{"$f":"I58+I59+I62+I65+I66+I67+I68+I63*'DHS13'!I25/100+('DHS03'!I60+'DHS03'!I61)*'DHS13'!I24/100","v":99.824170236884484},{"$f":"J58+J59+J62+J65+J66+J67+J68+J63*'DHS13'!J25/100+('DHS03'!J60+'DHS03'!J61)*'DHS13'!J24/100","v":99.760507782404474},{"$f":"K58+K59+K62+K65+K66+K67+K68+K63*'DHS13'!K25/100+('DHS03'!K60+'DHS03'!K61)*'DHS13'!K24/100","v":99.489188429101716},{"$f":"L58+L59+L62+L65+L66+L67+L68+L63*'DHS13'!L25/100+('DHS03'!L60+'DHS03'!L61)*'DHS13'!L24/100","v":99.45259871625737},{"$f":"M58+M59+M62+M65+M66+M67+M68+M63*'DHS13'!M25/100+('DHS03'!M60+'DHS03'!M61)*'DHS13'!M24/100","v":94.621165276542939},{"$f":"N58+N59+N62+N65+N66+N67+N68+N63*'DHS13'!N25/100+('DHS03'!N60+'DHS03'!N61)*'DHS13'!N24/100","v":97.146740615520798},{"$f":"O58+O59+O62+O65+O66+O67+O68+O63*'DHS13'!O25/100+('DHS03'!O60+'DHS03'!O61)*'DHS13'!O24/100","v":98.470900030403087},{"$f":"P58+P59+P62+P65+P66+P67+P68+P63*'DHS13'!P25/100+('DHS03'!P60+'DHS03'!P61)*'DHS13'!P24/100","v":98.419356965076389},{"$f":"Q58+Q59+Q62+Q65+Q66+Q67+Q68+Q63*'DHS13'!Q25/100+('DHS03'!Q60+'DHS03'!Q61)*'DHS13'!Q24/100","v":99.273184231468989},{"$f":"R58+R59+R62+R65+R66+R67+R68+R63*'DHS13'!R25/100+('DHS03'!R60+'DHS03'!R61)*'DHS13'!R24/100","v":99.363415614415445},{"$f":"S58+S59+S62+S65+S66+S67+S68+S63*'DHS13'!S25/100+('DHS03'!S60+'DHS03'!S61)*'DHS13'!S24/100","v":97.975571245123149},{"$f":"T58+T59+T62+T65+T66+T67+T68+T63*'DHS13'!T25/100+('DHS03'!T60+'DHS03'!T61)*'DHS13'!T24/100","v":99.265164836911353},{"$f":"U58+U59+U62+U65+U66+U67+U68+U63*'DHS13'!U25/100+('DHS03'!U60+'DHS03'!U61)*'DHS13'!U24/100","v":97.850879818954212},{"$f":"V58+V59+V62+V65+V66+V67+V68+V63*'DHS13'!V25/100+('DHS03'!V60+'DHS03'!V61)*'DHS13'!V24/100","v":99.405543758006374},null,null,null,null,null,null,null,null,null,null,null,null,null,null,null,null,null,null,null,null,null,null,null,null,null,null,null,null,null,null,"Water","Improved","N/A","N/A","N/A","N/A","N/A","N/A","N/A","N/A","N/A","N/A","N/A","N/A","N/A","N/A","N/A","N/A","N/A","N/A","N/A","N/A"]
[null,"Not Improved",{"$f":"100-C16","v":2.4443704452681061},{"$f":"100-D16","v":1.1918813253831786},0.53676415823626655,0.33428917759090382,0.61690636353125683,0.65538089847856895,0.1758297631155159,0.23949221759552586,0.51081157089828366,0.54740128374263008,5.3788347234570608,2.8532593844792018,1.5290999695969134,1.5806430349236109,0.72681576853101149,0.63658438558455543,2.0244287548768511,0.73483516308864694,2.1491201810457881,0.59445624199362612,null,null,null,null,null,null,null,null,null,null,null,null,null,null,null,null,null,null,null,null,null,null,null,null,null,null,null,null,null,null,null,"Not Improved","N/A","N/A","N/A","N/A","N/A","N/A","N/A","N/A","N/A","N/A","N/A","N/A","N/A","N/A","N/A","N/A","N/A","N/A","N/A","N/A"]
["Water ladder","Basic",{"$f":"C16*'DHS13'!C23/100","v":96.110155200466195},{"$f":"D16*'DHS13'!D23/100","v":97.77482368494087},{"$f":"E16*'DHS13'!E23/100","v":98.064201704079238},{"$f":"F16*'DHS13'!F23/100","v":97.921199569455169},{"$f":"G16*'DHS13'!G23/100","v":98.84776678229602},{"$f":"H16*'DHS13'!H23/100","v":98.508423357075742},{"$f":"I16*'DHS13'!I23/100","v":98.707374021327965},{"$f":"J16*'DHS13'!J23/100","v":98.793740086664044},{"$f":"K16*'DHS13'!K23/100","v":97.79661888324361},{"$f":"L16*'DHS13'!L23/100","v":99.11504162387871},{"$f":"M16*'DHS13'!M23/100","v":91.949746304945364},{"$f":"N16*'DHS13'!N23/100","v":95.254427975311742},{"$f":"O16*'DHS13'!O23/100","v":97.406522128701852},{"$f":"P16*'DHS13'!P23/100","v":95.553049351831348},{"$f":"Q16*'DHS13'!Q23/100","v":97.320981661130375},{"$f":"R16*'DHS13'!R23/100","v":97.404180728997702},{"$f":"S16*'DHS13'!S23/100","v":96.92958697274949},{"$f":"T16*'DHS13'!T23/100","v":97.268996941531384},{"$f":"U16*'DHS13'!U23/100","v":97.374751960038012},{"$f":"V16*'DHS13'!V23/100","v":98.349436401108392},null,null,null,null,null,null,null,null,null,null,null,null,null,null,null,null,null,null,null,null,null,null,null,null,null,null,null,null,null,null,"Water ladder","Basic","N/A","N/A","N/A","N/A","N/A","N/A","N/A","N/A","N/A","N/A","N/A","N/A","N/A","N/A","N/A","N/A","N/A","N/A","N/A","N/A"]
[null,"Limited",{"$f":"C16*'DHS13'!C22/100","v":1.4454743542656643},{"$f":"D16*'DHS13'!D22/100","v":1.0332949896759687},{"$f":"E16*'DHS13'!E22/100","v":1.3990341376843958},{"$f":"F16*'DHS13'!F22/100","v":1.7445112529538944},{"$f":"G16*'DHS13'!G22/100","v":0.53532685417269354},{"$f":"H16*'DHS13'!H22/100","v":0.83619574444563338},{"$f":"I16*'DHS13'!I22/100","v":1.1167962155565461},{"$f":"J16*'DHS13'!J22/100","v":0.96676769574043564},{"$f":"K16*'DHS13'!K22/100","v":1.692569545858114},{"$f":"L16*'DHS13'!L22/100","v":0.3375570923786792},{"$f":"M16*'DHS13'!M22/100","v":2.6714189715975625},{"$f":"N16*'DHS13'!N22/100","v":1.89231264020905},{"$f":"O16*'DHS13'!O22/100","v":1.0643779017012474},{"$f":"P16*'DHS13'!P22/100","v":2.8663076132450356},{"$f":"Q16*'DHS13'!Q22/100","v":1.9522025703386747},{"$f":"R16*'DHS13'!R22/100","v":1.9592348854176687},{"$f":"S16*'DHS13'!S22/100","v":1.0459842723736583},{"$f":"T16*'DHS13'!T22/100","v":1.99616789537992},{"$f":"U16*'DHS13'!U22/100","v":0.47612785891620146},{"$f":"V16*'DHS13'!V22/100","v":1.0561073568978749},null,null,null,null,null,null,null,null,null,null,null,null,null,null,null,null,null,null,null,null,null,null,null,null,null,null,null,null,null,null,null,"Limited","N/A","N/A","N/A","N/A","N/A","N/A","N/A","N/A","N/A","N/A","N/A","N/A","N/A","N/A","N/A","N/A","N/A","N/A","N/A","N/A"]
[null,"Unimproved",{"$f":"100-C18-C19-C21","v":2.3622987012908321},{"$f":"100-D18-D19-D21","v":1.0452672627157791},0.50212210259267476,0.33428917759093668,0.4839030456195228,0.62886987895015811,0.17582976311548904,0.23949221759551986,0.44362761788491367,0.41761792586338831,5.3039545339114369,2.6756213466751357,1.1324656432739666,1.4740726859369802,0.7268157685309502,0.62017243317364823,1.9677870581168615,0.48191806177799185,2.0093792079291055,0.52383443582268929,null,null,null,null,null,null,null,null,null,null,null,null,null,null,null,null,null,null,null,null,null,null,null,null,null,null,null,null,null,null,null,"Unimproved","N/A","N/A","N/A","N/A","N/A","N/A","N/A","N/A","N/A","N/A","N/A","N/A","N/A","N/A","N/A","N/A","N/A","N/A","N/A","N/A"]
[null,"Surface water",{"$f":"C64","v":8.207174397730814E-2},0.14661406266738236,3.4642055643691293E-2,0,0.13300331791176365,2.6511019528466545E-2,0,0,6.7183953013361969E-2,0.12978335787922227,7.488018954563605E-2,0.17763803780407211,0.39663432632293433,0.1065703489866365,0,1.6411952410981645E-2,5.664169675998966E-2,0.25291710131070416,0.13974097311668163,7.0621806171044049E-2,null,null,null,null,null,null,null,null,null,null,null,null,null,null,null,null,null,null,null,null,null,null,null,null,null,null,null,null,null,null,null,"Surface water","N/A","N/A","N/A","N/A","N/A","N/A","N/A","N/A","N/A","N/A","N/A","N/A","N/A","N/A","N/A","N/A","N/A","N/A","N/A","N/A"]
["Improved water point at more than 30 minutes","Yes","N/A","N/A","N/A","N/A","N/A","N/A","N/A","N/A","N/A","N/A","N/A","N/A","N/A","N/A","N/A","N/A","N/A","N/A","N/A","N/A",null,null,null,null,null,null,null,null,null,null,null,null,null,null,null,null,null,null,null,null,null,null,null,null,null,null,null,null,null,null,"Improved water point at more than 30 minutes","Yes","N/A","N/A","N/A","N/A","N/A","N/A","N/A","N/A","N/A","N/A","N/A","N/A","N/A","N/A","N/A","N/A","N/A","N/A","N/A","N/A"]
[null,"No","N/A","N/A","N/A","N/A","N/A","N/A","N/A","N/A","N/A","N/A","N/A","N/A","N/A","N/A","N/A","N/A","N/A","N/A","N/A","N/A",null,null,null,null,null,null,null,null,null,null,null,null,null,null,null,null,null,null,null,null,null,null,null,null,null,null,null,null,null,null,null,"No","N/A","N/A","N/A","N/A","N/A","N/A","N/A","N/A","N/A","N/A","N/A","N/A","N/A","N/A","N/A","N/A","N/A","N/A","N/A","N/A"]
["Manually calculated ratios","Improved wells"]
[null,"Improved springs"]
[null,"Other"]
[null,null,"NATIONAL wealth index quintile",null,null,null,null,"URBAN wealth index quintile",null,null,null,null,"RURAL wealth index quintile",null,null,null,null,"SUB-REGIONS:",null,null,null,null,null,null,null,null,null,null,null,null,null,null,null,null,null,null,null,null,null,null,null,null,null,null,null,null,null,null,null,null,null,null,"Raw numbers of respondents:","Use of drinking water sources","NATIONAL wealth index quintile",null,null,null,null,"URBAN wealth index quintile",null,null,null,null,"RURAL wealth index quintile",null,null,null,null,"SUB-REGIONS:"]
["Percentage based on weighted population",null,"Poorest","Poor","Middle","Rich","Richest","Poorest","Poor","Middle","Rich","Richest","Poorest","Poor","Middle","Rich","Richest","Central","East","North","South","West",null,null,null,null,null,null,null,null,null,null,null,null,null,null,null,null,null,null,null,null,null,null,null,null,null,null,null,null,null,null,"Water data, raw numbers (weighted)",null,"Poorest","Poor","Middle","Rich","Richest","Poorest","Poor","Middle","Rich","Richest","Poorest","Poor","Middle","Rich","Richest","Central","East","North","South","West"]
["Piped water","Yes",33.636214601087531,56.70645712687363,73.801171693448481,81.415561756971528,84.713811357270032,89.31260980309024,90.352646911664564,90.38091292183077,90.419635388315143,89.770857972487264,6.533038119890219,8.4874329069339733,12.985911103893072,18.395473740274131,34.598249124263333,58.939840026824442,55.019015075352954,50.036125596657101,72.059800485641659,77.097301482626889,null,null,null,null,null,null,null,null,null,null,null,null,null,null,null,null,null,null,null,null,null,null,null,null,null,null,null,null,null,null,"Piped water","Yes","N/A","N/A","N/A","N/A","N/A","N/A","N/A","N/A","N/A","N/A","N/A","N/A","N/A","N/A","N/A","N/A","N/A","N/A","N/A","N/A"]
[null,"No",66.363785398912484,43.29354287312686,26.19882830655196,18.584438243029147,15.286188642730842,10.687390196909899,9.6473530883355885,9.6190870781694535,9.5803646116853329,10.2291420275128,93.466961880109821,91.512567093066124,87.014088896106784,81.604526259725873,65.401750875736838,41.060159973176383,44.980984924646208,49.963874403342992,27.940199514358532,22.902698517373537,null,null,null,null,null,null,null,null,null,null,null,null,null,null,null,null,null,null,null,null,null,null,null,null,null,null,null,null,null,null,null,"No","N/A","N/A","N/A","N/A","N/A","N/A","N/A","N/A","N/A","N/A","N/A","N/A","N/A","N/A","N/A","N/A","N/A","N/A","N/A","N/A"]
["Piped water on premises","Yes",33.034701255655655,56.551626683348843,73.391996620764601,81.193601911014184,84.154309847083155,88.401671645784958,89.929994117203449,89.984182232654248,90.268418665877746,89.070598604318917,6.2606425864211346,8.4874329069339733,12.985911103893072,18.395473740274131,34.242660638129124,58.81634945294708,54.641129246117323,50.005152171752556,71.912201102614787,76.389249344317989,null,null,null,null,null,null,null,null,null,null,null,null,null,null,null,null,null,null,null,null,null,null,null,null,null,null,null,null,null,null,"Piped water on premises","Yes","N/A","N/A","N/A","N/A","N/A","N/A","N/A","N/A","N/A","N/A","N/A","N/A","N/A","N/A","N/A","N/A","N/A","N/A","N/A","N/A"]
[null,"No",66.965298744344366,43.448373316651669,26.608003379235839,18.806398088986505,15.845690152917713,11.598328354215177,10.070005882796714,10.015817767346004,9.731581334122744,10.929401395681186,93.739357413578901,91.512567093066124,87.014088896106784,81.604526259725873,65.757339361871033,41.183650547053745,45.358870753881831,49.994847828247529,28.087798897385412,23.610750655682498,null,null,null,null,null,null,null,null,null,null,null,null,null,null,null,null,null,null,null,null,null,null,null,null,null,null,null,null,null,null,null,"No","N/A","N/A","N/A","N/A","N/A","N/A","N/A","N/A","N/A","N/A","N/A","N/A","N/A","N/A","N/A","N/A","N/A","N/A","N/A","N/A"]
["Piped water into dwelling","Yes","N/A","N/A","N/A","N/A","N/A","N/A","N/A","N/A","N/A","N/A","N/A","N/A","N/A","N/A","N/A","N/A","N/A","N/A","N/A","N/A",null,null,null,null,null,null,null,null,null,null,null,null,null,null,null,null,null,null,null,null,null,null,null,null,null,null,null,null,null,null,"Piped water into dwelling","Yes","N/A","N/A","N/A","N/A","N/A","N/A","N/A","N/A","N/A","N/A","N/A","N/A","N/A","N/A","N/A","N/A","N/A","N/A","N/A","N/A"]
[null,"No","N/A","N/A","N/A","N/A","N/A","N/A","N/A","N/A","N/A","N/A","N/A","N/A","N/A","N/A","N/A","N/A","N/A","N/A","N/A","N/A",null,null,null,null,null,null,null,null,null,null,null,null,null,null,null,null,null,null,null,null,null,null,null,null,null,null,null,null,null,null,null,"No","N/A","N/A","N/A","N/A","N/A","N/A","N/A","N/A","N/A","N/A","N/A","N/A","N/A","N/A","N/A","N/A","N/A","N/A","N/A","N/A"]
["Water source on premises","Yes",33.406961430283431,56.864602537914365,73.506528284975573,81.193601911014184,84.204604783595613,88.709211048611905,89.987579859071914,89.984182232654248,90.268418665877746,89.145061967340141,7.0254269872732644,8.5234707099579481,13.535058551124065,18.748275845097222,34.242660638129124,58.873121180389113,55.071737012650956,50.601868238658874,72.0619812716658,76.409146866742304,null,null,null,null,null,null,null,null,null,null,null,null,null,null,null,null,null,null,null,null,null,null,null,null,null,null,null,null,null,null,"Water source on premises","Yes","N/A","N/A","N/A","N/A","N/A","N/A","N/A","N/A","N/A","N/A","N/A","N/A","N/A","N/A","N/A","N/A","N/A","N/A","N/A","N/A"]
[null,"No",66.593038569716555,43.135397462086111,26.493471715024864,18.806398088986505,15.795395216405247,11.290788951388217,10.012420140928251,10.015817767346004,9.731581334122744,10.854938032659959,92.974573012726751,91.476529290042137,86.464941448875805,81.251724154902789,65.757339361871033,41.126878819611719,44.928262987348219,49.398131761341233,27.938018728334402,23.590853133258168,null,null,null,null,null,null,null,null,null,null,null,null,null,null,null,null,null,null,null,null,null,null,null,null,null,null,null,null,null,null,null,"No","N/A","N/A","N/A","N/A","N/A","N/A","N/A","N/A","N/A","N/A","N/A","N/A","N/A","N/A","N/A","N/A","N/A","N/A","N/A","N/A"]
["Improved Water source on premises","Yes","N/A","N/A","N/A","N/A","N/A","N/A","N/A","N/A","N/A","N/A","N/A","N/A","N/A","N/A","N/A","N/A","N/A","N/A","N/A","N/A",null,null,null,null,null,null,null,null,null,null,null,null,null,null,null,null,null,null,null,null,null,null,null,null,null,null,null,null,null,null,"Improved water source on premises","Yes","N/A","N/A","N/A","N/A","N/A","N/A","N/A","N/A","N/A","N/A","N/A","N/A","N/A","N/A","N/A","N/A","N/A","N/A","N/A","N/A"]
[null,"No","N/A","N/A","N/A","N/A","N/A","N/A","N/A","N/A","N/A","N/A","N/A","N/A","N/A","N/A","N/A","N/A","N/A","N/A","N/A","N/A",null,null,null,null,null,null,null,null,null,null,null,null,null,null,null,null,null,null,null,null,null,null,null,null,null,null,null,null,null,null,null,"No","N/A","N/A","N/A","N/A","N/A","N/A","N/A","N/A","N/A","N/A","N/A","N/A","N/A","N/A","N/A","N/A","N/A","N/A","N/A","N/A"]
["Piped water on premises available when needed","Yes","N/A","N/A","N/A","N/A","N/A","N/A","N/A","N/A","N/A","N/A","N/A","N/A","N/A","N/A","N/A","N/A","N/A","N/A","N/A","N/A",null,null,null,null,null,null,null,null,null,null,null,null,null,null,null,null,null,null,null,null,null,null,null,null,null,null,null,null,null,null,"Piped water on premises available when needed","Yes","N/A","N/A","N/A","N/A","N/A","N/A","N/A","N/A","N/A","N/A","N/A","N/A","N/A","N/A","N/A","N/A","N/A","N/A","N/A","N/A"]
[null,"No","N/A","N/A","N/A","N/A","N/A","N/A","N/A","N/A","N/A","N/A","N/A","N/A","N/A","N/A","N/A","N/A","N/A","N/A","N/A","N/A",null,null,null,null,null,null,null,null,null,null,null,null,null,null,null,null,null,null,null,null,null,null,null,null,null,null,null,null,null,null,null,"No","N/A","N/A","N/A","N/A","N/A","N/A","N/A","N/A","N/A","N/A","N/A","N/A","N/A","N/A","N/A","N/A","N/A","N/A","N/A","N/A"]
["Water point at more than 30 minutes","Yes",4.7458469387026767,2.0448373148096071,2.0838588954388402,1.9700053409881502,1.8514398910013263,1.161484481432959,1.5074199505842363,2.0163853931421722,2.0826011337128518,1.751066829959345,11.952973418364001,9.979661052119134,3.7870894905532566,7.6489838549397922,1.7864768458694811,1.314702309050334,2.7410776958809628,2.304860716915758,2.6733862737219849,2.5581570316354956,null,null,null,null,null,null,null,null,null,null,null,null,null,null,null,null,null,null,null,null,null,null,null,null,null,null,null,null,null,null,"Water point at more than 30 minutes","Yes","N/A","N/A","N/A","N/A","N/A","N/A","N/A","N/A","N/A","N/A","N/A","N/A","N/A","N/A","N/A","N/A","N/A","N/A","N/A","N/A"]
[null,"No",95.254153061297359,97.955162685190473,97.916141104561149,98.029994659011876,98.148560108998936,98.838515518567078,98.492580049415764,97.983614606857941,97.917398866287314,98.248933170040658,88.047026581636018,90.020338947880845,96.212910509446758,92.351016145060242,98.213523154130513,98.685297690949682,97.258922304118926,97.695139283084231,97.326613726278026,97.441842968364838,null,null,null,null,null,null,null,null,null,null,null,null,null,null,null,null,null,null,null,null,null,null,null,null,null,null,null,null,null,null,null,"No","N/A","N/A","N/A","N/A","N/A","N/A","N/A","N/A","N/A","N/A","N/A","N/A","N/A","N/A","N/A","N/A","N/A","N/A","N/A","N/A"]
["Water source available when needed","Yes",88.455670473274438,94.288442533656124,96.623592376971203,98.158500035616044,98.976001570470103,91.967238811793024,96.431809381813878,98.096347853565319,98.133422405476495,99.267558703145696,87.722471977024981,87.859728376382805,93.930939767477597,94.660828802435148,97.282864717507053,96.432074651199301,87.411614682983625,96.02923707904985,94.320388940761163,98.92295920963015,null,null,null,null,null,null,null,null,null,null,null,null,null,null,null,null,null,null,null,null,null,null,null,null,null,null,null,null,null,null,"Water source available when needed","Yes","N/A","N/A","N/A","N/A","N/A","N/A","N/A","N/A","N/A","N/A","N/A","N/A","N/A","N/A","N/A","N/A","N/A","N/A","N/A","N/A"]
[null,"No",11.544329526725756,5.7115574663439759,3.3764076230288347,1.8414999643840044,1.0239984295299285,8.0327611882070933,3.5681906181862137,1.9036521464346239,1.8665775945235548,0.73244129685431325,12.277528022975012,12.140271623617318,6.0690602325223439,5.3391711975648759,2.7171352824929733,3.56792534880086,12.588385317016252,3.9707629209501478,5.6796110592387183,1.0770407903698427,null,null,null,null,null,null,null,null,null,null,null,null,null,null,null,null,null,null,null,null,null,null,null,null,null,null,null,null,null,null,null,"No","N/A","N/A","N/A","N/A","N/A","N/A","N/A","N/A","N/A","N/A","N/A","N/A","N/A","N/A","N/A","N/A","N/A","N/A","N/A","N/A"]
["Improved water source available when needed","Yes","N/A","N/A","N/A","N/A","N/A","N/A","N/A","N/A","N/A","N/A","N/A","N/A","N/A","N/A","N/A","N/A","N/A","N/A","N/A","N/A",null,null,null,null,null,null,null,null,null,null,null,null,null,null,null,null,null,null,null,null,null,null,null,null,null,null,null,null,null,null,"Improved water source available when needed","Yes","N/A","N/A","N/A","N/A","N/A","N/A","N/A","N/A","N/A","N/A","N/A","N/A","N/A","N/A","N/A","N/A","N/A","N/A","N/A","N/A"]
[null,"No","N/A","N/A","N/A","N/A","N/A","N/A","N/A","N/A","N/A","N/A","N/A","N/A","N/A","N/A","N/A","N/A","N/A","N/A","N/A","N/A",null,null,null,null,null,null,null,null,null,null,null,null,null,null,null,null,null,null,null,null,null,null,null,null,null,null,null,null,null,null,null,"No","N/A","N/A","N/A","N/A","N/A","N/A","N/A","N/A","N/A","N/A","N/A","N/A","N/A","N/A","N/A","N/A","N/A","N/A","N/A","N/A"]
["Microbiological quality at point of collection","Not contaminated (No E. coli in 100 mL)","N/A","N/A","N/A","N/A","N/A","N/A","N/A","N/A","N/A","N/A","N/A","N/A","N/A","N/A","N/A","N/A","N/A","N/A","N/A","N/A",null,null,null,null,null,null,null,null,null,null,null,null,null,null,null,null,null,null,null,null,null,null,null,null,null,null,null,null,null,null,"Microbiological quality at point of collection","Not contaminated (No E. coli in 100 mL)","N/A","N/A","N/A","N/A","N/A","N/A","N/A","N/A","N/A","N/A","N/A","N/A","N/A","N/A","N/A","N/A","N/A","N/A","N/A","N/A"]
[null,"Contaminated (E. coli detected in 100 mL)","N/A","N/A","N/A","N/A","N/A","N/A","N/A","N/A","N/A","N/A","N/A","N/A","N/A","N/A","N/A","N/A","N/A","N/A","N/A","N/A",null,null,null,null,null,null,null,null,null,null,null,null,null,null,null,null,null,null,null,null,null,null,null,null,null,null,null,null,null,null,null,"Contaminated (E. coli detected in 100 mL)","N/A","N/A","N/A","N/A","N/A","N/A","N/A","N/A","N/A","N/A","N/A","N/A","N/A","N/A","N/A","N/A","N/A","N/A","N/A","N/A"]
[null,"Highly contaminated (>100 CFU/100 mL)","N/A","N/A","N/A","N/A","N/A","N/A","N/A","N/A","N/A","N/A","N/A","N/A","N/A","N/A","N/A","N/A","N/A","N/A","N/A","N/A",null,null,null,null,null,null,null,null,null,null,null,null,null,null,null,null,null,null,null,null,null,null,null,null,null,null,null,null,null,null,null,"Highly contaminated (>100 CFU/100 mL)","N/A","N/A","N/A","N/A","N/A","N/A","N/A","N/A","N/A","N/A","N/A","N/A","N/A","N/A","N/A","N/A","N/A","N/A","N/A","N/A"]
["Microbiological quality of improved water sources at point of collection","Not contaminated (No E. coli in 100 mL)","N/A","N/A","N/A","N/A","N/A","N/A","N/A","N/A","N/A","N/A","N/A","N/A","N/A","N/A","N/A","N/A","N/A","N/A","N/A","N/A",null,null,null,null,null,null,null,null,null,null,null,null,null,null,null,null,null,null,null,null,null,null,null,null,null,null,null,null,null,null,"Microbiological quality of improved water sources at point of collection","Not contaminated (No E. coli in 100 mL)","N/A","N/A","N/A","N/A","N/A","N/A","N/A","N/A","N/A","N/A","N/A","N/A","N/A","N/A","N/A","N/A","N/A","N/A","N/A","N/A"]
[null,"Contaminated (E. coli detected in 100 mL)","N/A","N/A","N/A","N/A","N/A","N/A","N/A","N/A","N/A","N/A","N/A","N/A","N/A","N/A","N/A","N/A","N/A","N/A","N/A","N/A",null,null,null,null,null,null,null,null,null,null,null,null,null,null,null,null,null,null,null,null,null,null,null,null,null,null,null,null,null,null,null,"Contaminated (E. coli detected in 100 mL)","N/A","N/A","N/A","N/A","N/A","N/A","N/A","N/A","N/A","N/A","N/A","N/A","N/A","N/A","N/A","N/A","N/A","N/A","N/A","N/A"]
[null,"Highly contaminated (>100 CFU/100 mL)","N/A","N/A","N/A","N/A","N/A","N/A","N/A","N/A","N/A","N/A","N/A","N/A","N/A","N/A","N/A","N/A","N/A","N/A","N/A","N/A",null,null,null,null,null,null,null,null,null,null,null,null,null,null,null,null,null,null,null,null,null,null,null,null,null,null,null,null,null,null,null,"Highly contaminated (>100 CFU/100 mL)","N/A","N/A","N/A","N/A","N/A","N/A","N/A","N/A","N/A","N/A","N/A","N/A","N/A","N/A","N/A","N/A","N/A","N/A","N/A","N/A"]
["Microbiological quality of piped on premises at point of collection","Not contaminated (No E. coli in 100 mL)","N/A","N/A","N/A","N/A","N/A","N/A","N/A","N/A","N/A","N/A","N/A","N/A","N/A","N/A","N/A","N/A","N/A","N/A","N/A","N/A",null,null,null,null,null,null,null,null,null,null,null,null,null,null,null,null,null,null,null,null,null,null,null,null,null,null,null,null,null,null,"Microbiological quality of piped on premises at point of collection","Not contaminated (No E. coli in 100 mL)","N/A","N/A","N/A","N/A","N/A","N/A","N/A","N/A","N/A","N/A","N/A","N/A","N/A","N/A","N/A","N/A","N/A","N/A","N/A","N/A"]
[null,"Contaminated (E. coli detected in 100 mL)","N/A","N/A","N/A","N/A","N/A","N/A","N/A","N/A","N/A","N/A","N/A","N/A","N/A","N/A","N/A","N/A","N/A","N/A","N/A","N/A",null,null,null,null,null,null,null,null,null,null,null,null,null,null,null,null,null,null,null,null,null,null,null,null,null,null,null,null,null,null,null,"Contaminated (E. coli detected in 100 mL)","N/A","N/A","N/A","N/A","N/A","N/A","N/A","N/A","N/A","N/A","N/A","N/A","N/A","N/A","N/A","N/A","N/A","N/A","N/A","N/A"]
[null,"Highly contaminated (>100 CFU/100 mL)","N/A","N/A","N/A","N/A","N/A","N/A","N/A","N/A","N/A","N/A","N/A","N/A","N/A","N/A","N/A","N/A","N/A","N/A","N/A","N/A",null,null,null,null,null,null,null,null,null,null,null,null,null,null,null,null,null,null,null,null,null,null,null,null,null,null,null,null,null,null,null,"Highly contaminated (>100 CFU/100 mL)","N/A","N/A","N/A","N/A","N/A","N/A","N/A","N/A","N/A","N/A","N/A","N/A","N/A","N/A","N/A","N/A","N/A","N/A","N/A","N/A"]
[null,null,"NATIONAL wealth index quintile",null,null,null,null,"URBAN wealth index quintile",null,null,null,null,"RURAL wealth index quintile",null,null,null,null,"SUB-REGIONS:",null,null,null,null,null,null,null,null,null,null,null,null,null,null,null,null,null,null,null,null,null,null,null,null,null,null,null,null,null,null,null,null,null,null,"Raw numbers of respondents:","Use of drinking water sources","NATIONAL wealth index quintile",null,null,null,null,"URBAN wealth index quintile",null,null,null,null,"RURAL wealth index quintile",null,null,null,null,"SUB-REGIONS:"]
["Percentage based on weighted population",null,"Poorest","Poor","Middle","Rich","Richest","Poorest","Poor","Middle","Rich","Richest","Poorest","Poor","Middle","Rich","Richest","Central","East","North","South","West",null,null,null,null,null,null,null,null,null,null,null,null,null,null,null,null,null,null,null,null,null,null,null,null,null,null,null,null,null,null,"Water data, raw numbers (weighted)",null,"Poorest","Poor","Middle","Rich","Richest","Poorest","Poor","Middle","Rich","Richest","Poorest","Poor","Middle","Rich","Richest","Central","East","North","South","West"]
["Source of drinking water","Piped water in house/garden",31.91421271794362,53.118864261650934,63.602211555539675,62.178512926040007,43.788789543654893,84.537698349374068,80.169791875545286,72.05319747042455,64.378198927342623,40.0866454743079,6.0284925149341637,8.4874329069339733,12.491298821952466,17.350845174665494,30.226822263565218,49.259132902636118,53.390900025935593,42.48649515166246,65.90046130951815,47.061176020175374]
[null,"Public piped water outside house/garden",0.60151334543188917,0.1549020962660215,0.40971515778809853,0.22195984595735643,0.50735080319803183,0.91093815730527405,0.42265279446112808,0.39750780219739079,0.15121672243741102,0.70098642426587776,0.27239553346908496,0,0,0,0.19395735607319842,0.12364004257595862,0.37788582923562569,3.0973424904541649E-2,0.14770251143396174,0.68041656798565442]
[null,"Public well",2.6762562928079503,0.88026311344031027,0.72727464618719007,0.28127080235435459,0.65746047046073908,0.71786453972668951,0.65753721674423216,0.28346976750071379,0.51777810329108098,0.4822104320058142,5.0387412684908535,2.2957892975740171,1.1916872183750447,0.79809354965832469,1.2232197495907129,0.87778430297030907,2.0904185792108989,0.62539467611987409,1.4466439016448038,0.54156263491220225]
[null,"Well in house/garden",5.8579049807555608,4.2004939626785491,1.9874828819353521,1.4359869822613125,0.72516373638632692,1.9673065324458658,1.0497698419568502,0.66480185329164088,0.17345776691602527,0.40189328905396554,7.826453186714982,7.4072352996310746,6.9808199071172847,7.0205561071519433,5.6404817266046372,0.66456335776514353,5.904936909126743,1.5143931807930178,3.7460325691885137,2.4620085741441384]
[null,"Piped surface water in house/garden",45.200162488043119,30.957577567931651,17.484247743438566,10.435537497443825,5.3664666293913799,3.8194020514778231,3.8582184162481519,2.3701970125355394,2.1436970818720007,1.3800042504451711,63.427143597124925,66.739648829344162,65.705791105258001,63.962000742327888,48.806433877447645,29.756541592013601,28.20778311254049,36.024557386218937,15.44129503749731,13.413671129323737]
[null,"Spring/public fountain",11.476545884071182,6.3230894703418388,4.8528540882811733,5.5699009996233269,6.1951805233511568,3.0826616969163192,3.4458713732579511,5.3128984339611582,5.6493076047802324,5.8195764425223224,16.324909724836626,14.220587689226258,11.799018268764815,8.0817902057520854,7.080635285700752,8.1657613913305251,7.8930517417042738,10.348212900062121,5.9632119472501532,5.2305525201949692]
[null,"River/stream/pond/lake/dam",8.207174397730814E-2,0.14661406266738236,3.4642055643691293E-2,0,0.13300331791176365,2.6511019528466545E-2,0,0,6.7183953013361969E-2,0.12978335787922227,7.488018954563605E-2,0.17763803780407211,0.39663432632293433,0.1065703489866365,0,1.6411952410981645E-2,5.664169675998966E-2,0.25291710131070416,0.13974097311668163,7.0621806171044049E-2]
[null,"Rainwater",0.13380613354922632,2.4372370720092521E-2,4.8651217242093613E-2,0,0,0,0,0,0,0,7.488018954563605E-2,0.33679046810470287,7.5122556786353836E-2,0,0.14980836399938957,0,0,0.53744884028524642,0,0]
[null,"Tanker truck",0.62610369970824398,0.26980044834901606,0.40180412247651215,0.22374352292140473,0.12406640691073056,0.81961775067815301,0.46256440798756243,0.29216277368830035,0.31634300602320381,7.9600266506361303E-2,0.40135374746456259,0,0.28528506264931036,0.28418759729769733,0,0.69750797746672,0.61953089989145926,0,0.27948194623336325,4.9317031343113632E-2]
[null,"Bottled water",1.2735871215657437,3.7263183911652327,10.106417260608151,19.405506409962008,42.033225942566162,3.9478314440578908,9.8298672797510598,18.266283068533973,26.244045858749043,50.47928652459256,0.38691678581161748,0.15468845626209765,0.83583180462762952,1.963225960435111,6.2875147020643185,10.343249807695438,1.3689839275774744,7.8631376609747399,6.3779406098660436,30.100602499622966]
[null,"Water station",0,5.7847749108567784E-2,0.19669189139107621,0.16876688311518862,0.30253216261003507,0,0.10372679404789577,0.21033274596103713,0.35877097557576831,0.19303580341671933,0,0,0,0.2928259545537652,0.14222788180154169,0,3.3092182400157155E-2,0,0.20644276523425409,0.29580209745201874]
[null,"Other",0.15783559214622156,0.1398565056809781,0.14800737946924028,7.8814130322482356E-2,0.1667604635598261,0.17016845848963741,0,0.14914907190619781,0,0.24697773500451109,0.14383326206197927,0.18018901511986646,0.23851092814604313,0.13990435917116548,0.24889879315269792,9.5406673136351719E-2,5.6775095616489898E-2,0.31646967766852663,0.35104642901687694,9.4269118676391303E-2]
[]
[]
[]
[]
[]
[]
[]
[]
[]
[]
[]
[]
[]
[]
[]
[]
[]
[]
[]
[]
[]
[]
[]
[]
[]
[]
[]
[]
[]
[]
[]
[]
[]
[]
[]
[]
[]
[]
[{"$f":"A1026","v":"Turkey"}]
[{"$f":"A1034","v":"2003"}]
["Use of sanitation facilities"]
[" by wealth quintile and sub-national region"]
["Notes:"]
["WHO/UNICEF JMP customised wealth index excludes water,"]
[" sanitation and hygiene assets."]
["Survey used for analysis:",{"$f":"A1025","v":"DHS03"}]
[{"$f":"B1030","v":""}]
[{"$f":"B1029","v":""}]
[]
[]
["Use of sanitation facilities",null,"NATIONAL wealth index quintile",null,null,null,null,"URBAN wealth index quintile",null,null,null,null,"RURAL wealth index quintile",null,null,null,null,"SUB-REGIONS:",null,null,null,null,null,null,null,null,null,null,null,null,null,null,null,null,null,null,null,null,null,null,null,null,null,null,null,null,null,null,null,null,null,null,"Raw numbers of respondents:","Use of sanitation facilities","NATIONAL wealth index quintile",null,null,null,null,"URBAN wealth index quintile",null,null,null,null,"RURAL wealth index quintile",null,null,null,null,"SUB-REGIONS:"]
["Weighted percentage (used in graphs)",null,"Poorest","Poor","Middle","Rich","Richest","Poorest","Poor","Middle","Rich","Richest","Poorest","Poor","Middle","Rich","Richest","Central","East","North","South","West",null,null,null,null,null,null,null,null,null,null,null,null,null,null,null,null,null,null,null,null,null,null,null,null,null,null,null,null,null,null,"Sanitation data, raw numbers (weighted)",null,"Poorest","Poor","Middle","Rich","Richest","Poorest","Poor","Middle","Rich","Richest","Poorest","Poor","Middle","Rich","Richest","Central","East","North","South","West"]
["Sanitation","Improved",60.767876991964698,87.288316313967371,94.766418299948654,96.322184095029016,98.898080942263789,91.526704035020842,96.791094278349519,97.984019160576011,98.63432632909624,99.675828586359458,41.648586509779811,53.277988569764034,72.825493754278398,83.526412088973785,90.013596596463742,90.113641436243881,67.130842437721057,77.235059278344536,88.947639437174402,98.462453759574146,null,null,null,null,null,null,null,null,null,null,null,null,null,null,null,null,null,null,null,null,null,null,null,null,null,null,null,null,null,null,"Sanitation","Improved",5538.7058410000018,7945.2368270000006,8649.9019279999429,8779.4346829999267,9012.4807219998802,5632.5114480000111,5957.1818900000126,6030.5039449999931,6066.1386339999553,6135.1891479999604,1233.3345569999981,1578.5128119999993,2152.6810759999989,2474.998539999995,2664.7079509999953,8968.8408399998971,5991.5042080000176,2708.5936029999862,5363.7711770000014,16893.050172999727]
[null,"Not Improved",39.232123008035316,12.711683686033028,5.2335817000514213,3.6778159049712782,1.1019190577361573,8.4732959649791741,3.2089057216505901,2.0159808394240373,1.3656736709038266,0.32417141364054702,58.351413490220203,46.722011430236172,27.174506245721609,16.473587911026215,9.9864034035362614,9.8863585637564277,32.869157562278318,22.764940721655556,11.052360562825594,1.5375462404258644,null,null,null,null,null,null,null,null,null,null,null,null,null,null,null,null,null,null,null,null,null,null,null,null,null,null,null,null,null,null,null,"Not Improved",3575.8232739999885,1157.0544790000004,477.70053200000001,335.22022799999996,100.416754,521.44275300000027,197.49787100000006,124.07513500000002,83.990696999999997,19.953211999999997,1727.9533529999965,1384.2732359999989,803.26328500000056,488.13429199999996,295.63143299999996,983.97062900000037,2933.6097789999912,798.35470299999963,666.48573699999986,263.794419]
["Sanitation ladder","Basic",{"$f":"C122*C129/100","v":55.95218924263655},{"$f":"D122*D129/100","v":85.503005500053135},{"$f":"E122*E129/100","v":93.193428533320187},96.057193144067426,98.71600310721486,86.871893393865179,94.821010648271184,97.692122496864613,98.363475480317518,99.649484029155744,37.42362616136171,51.423096616391376,70.634977320535498,81.271934656218576,88.993883378339021,88.507829284594067,65.533686303972999,76.383551627771993,85.950668216877787,96.871723328133015,null,null,null,null,null,null,null,null,null,null,null,null,null,null,null,null,null,null,null,null,null,null,null,null,null,null,null,null,null,null,"Sanitation ladder","Basic",5099.7785790000007,7782.7326360000088,8504.3805899999606,8750.2938769999328,8994.6729309998809,5346.0565330000163,5833.9918940000134,6012.5389339999929,6043.2790129999557,6133.5676029999604,1108.2213169999993,1523.5563319999994,2087.9306289999977,2408.1953789999948,2634.5209789999954,8809.0173839999006,5846.0544770000115,2675.5208869999865,5181.1348400000006,16620.131024999726]
[null,"Limited",{"$f":"C122*C128/100","v":4.8156877493281325},{"$f":"D122*D128/100","v":1.7853108139143168},{"$f":"E122*E128/100","v":1.5729897666286456},0.26499095096165087,0.1820778350489336,4.6548106411557546,1.97008363007833,0.2918966637114041,0.27085084877873794,2.6344557203710407E-2,4.2249603484181391,1.8548919533726704,2.1905164337428475,2.2544774327552024,1.0197132181247246,1.605812151649852,1.5971561337479863,0.8515076505725544,2.9969712202965995,1.5907304314411215,null,null,null,null,null,null,null,null,null,null,null,null,null,null,null,null,null,null,null,null,null,null,null,null,null,null,null,null,null,null,null,"Limited",438.92726200000027,162.50419100000005,143.54342200000002,24.139251000000002,16.590325,286.45491500000009,121.21208000000001,17.965011000000001,16.640599999999999,1.621545,125.11323999999999,54.956479999999999,64.750446999999994,66.803161000000003,30.186972000000001,159.82345600000002,142.47728599999999,29.826140000000002,180.65842100000003,272.91914799999995]
[null,"Unimproved",{"$f":"100-C124-C125-C127","v":37.067701209488014},{"$f":"100-D124-D125-D127","v":12.498772932591539},{"$f":"100-E124-E125-E127","v":5.0432481298253338},3.3593062661723212,1.1019190577362066,8.3249861514527179,2.9921199527961209,1.7124865344974465,1.1318279395196844,0.3241714136405458,53.340154216885928,45.259905989674621,26.639556291702544,16.473587911026222,9.9864034035362543,9.8221572069846559,30.500748677424781,22.672279409415268,10.947593646727414,1.3290229784229981,null,null,null,null,null,null,null,null,null,null,null,null,null,null,null,null,null,null,null,null,null,null,null,null,null,null,null,null,null,null,null,"Unimproved",3378.5464189999893,1137.6747220000007,460.33140499999996,306.20510400000001,100.416754,512.31583500000033,184.15968900000004,105.39633800000001,69.623424999999983,19.953211999999997,1579.5555379999978,1340.9541799999988,787.45046200000058,488.13429199999996,295.63143299999996,977.58078900000032,2722.2969859999926,795.10812699999963,660.17009499999983,228.018407]
[null,"Open defecation",2.1644217985472993,0.21291075344100915,0.1903335702258333,0.31850963879860189,0,0.14830981352634842,0.21678576885436562,0.30349430492653656,0.23384573138405912,0,5.0112592733342254,1.4621054405613334,0.53494995401911094,0,0,6.420135677142591E-2,2.3684088848542326,9.266131224018366E-2,0.10476691609819881,0.2085232620028652,null,null,null,null,null,null,null,null,null,null,null,null,null,null,null,null,null,null,null,null,null,null,null,null,null,null,null,null,null,null,null,"Open defecation",197.27685499999998,19.379756999999998,17.369126999999999,29.015124,0,9.1269179999999999,13.338182000000002,18.678796999999999,14.367272,0,148.39781499999998,43.319056000000003,15.812823,0,0,6.3898400000000004,211.31279299999997,3.2465760000000001,6.3156420000000004,35.776011999999994]
["Shared among Improved Sanitation","Yes",7.9247260027940554,2.0453032998055911,1.6598598900824955,0.27510895174492467,0.18410654010084354,5.085740484410632,2.0353976207902047,0.2979023173493674,0.27460100236811713,2.643023647491969E-2,10.14430669195951,3.4815352515491664,3.0078978127273706,2.6991192083693165,1.1328435443993634,1.781985641747678,2.3791689121579362,1.1024885052574867,3.3693656619335286,1.6155705760953012,null,null,null,null,null,null,null,null,null,null,null,null,null,null,null,null,null,null,null,null,null,null,null,null,null,null,null,null,null,null,"Shared among improved sanitation facilities","Yes","N/A","N/A","N/A","N/A","N/A","N/A","N/A","N/A","N/A","N/A","N/A","N/A","N/A","N/A","N/A","N/A","N/A","N/A","N/A","N/A"]
[null,"No",92.075273997205926,97.954696700194503,98.340140109917684,99.724891048255145,99.815893459899158,94.914259515589464,97.964602379209794,99.702097682650631,99.725398997631899,99.973569763525077,89.855693308040586,96.518464748450853,96.992102187272565,97.300880791630675,98.867156455600636,98.218014358252361,97.620831087841964,98.897511494742531,96.630634338066457,98.384429423904692,null,null,null,null,null,null,null,null,null,null,null,null,null,null,null,null,null,null,null,null,null,null,null,null,null,null,null,null,null,null,null,"No","N/A","N/A","N/A","N/A","N/A","N/A","N/A","N/A","N/A","N/A","N/A","N/A","N/A","N/A","N/A","N/A","N/A","N/A","N/A","N/A"]
["Manually calculated ratios","Improved latrines"]
[null,"Other"]
[null,"Other"]
[null,null,"NATIONAL wealth index quintile",null,null,null,null,"URBAN wealth index quintile",null,null,null,null,"RURAL wealth index quintile",null,null,null,null,"SUB-REGIONS:",null,null,null,null,null,null,null,null,null,null,null,null,null,null,null,null,null,null,null,null,null,null,null,null,null,null,null,null,null,null,null,null,null,null,"Raw numbers of respondents:","Use of sanitation facilities","NATIONAL wealth index quintile",null,null,null,null,"URBAN wealth index quintile",null,null,null,null,"RURAL wealth index quintile",null,null,null,null,"SUB-REGIONS:"]
["Percentage based on weighted population",null,"Poorest","Poor","Middle","Rich","Richest","Poorest","Poor","Middle","Rich","Richest","Poorest","Poor","Middle","Rich","Richest","Central","East","North","South","West",null,null,null,null,null,null,null,null,null,null,null,null,null,null,null,null,null,null,null,null,null,null,null,null,null,null,null,null,null,null,"Sanitation data, raw numbers (weighted)",null,"Poorest","Poor","Middle","Rich","Richest","Poorest","Poor","Middle","Rich","Richest","Poorest","Poor","Middle","Rich","Richest","Central","East","North","South","West"]
["Sanitation type","Sewer connection","N/A","N/A","N/A","N/A","N/A","N/A","N/A","N/A","N/A","N/A","N/A","N/A","N/A","N/A","N/A","N/A","N/A","N/A","N/A","N/A",null,null,null,null,null,null,null,null,null,null,null,null,null,null,null,null,null,null,null,null,null,null,null,null,null,null,null,null,null,null,"Sanitation type","Sewer connection","N/A","N/A","N/A","N/A","N/A","N/A","N/A","N/A","N/A","N/A","N/A","N/A","N/A","N/A","N/A","N/A","N/A","N/A","N/A","N/A"]
[null,"Septic tank connection","N/A","N/A","N/A","N/A","N/A","N/A","N/A","N/A","N/A","N/A","N/A","N/A","N/A","N/A","N/A","N/A","N/A","N/A","N/A","N/A",null,null,null,null,null,null,null,null,null,null,null,null,null,null,null,null,null,null,null,null,null,null,null,null,null,null,null,null,null,null,null,"Septic tank connection","N/A","N/A","N/A","N/A","N/A","N/A","N/A","N/A","N/A","N/A","N/A","N/A","N/A","N/A","N/A","N/A","N/A","N/A","N/A","N/A"]
[null,"Improved latrines","N/A","N/A","N/A","N/A","N/A","N/A","N/A","N/A","N/A","N/A","N/A","N/A","N/A","N/A","N/A","N/A","N/A","N/A","N/A","N/A",null,null,null,null,null,null,null,null,null,null,null,null,null,null,null,null,null,null,null,null,null,null,null,null,null,null,null,null,null,null,null,"Improved latrines","N/A","N/A","N/A","N/A","N/A","N/A","N/A","N/A","N/A","N/A","N/A","N/A","N/A","N/A","N/A","N/A","N/A","N/A","N/A","N/A"]
[null,"Unimproved facilities","N/A","N/A","N/A","N/A","N/A","N/A","N/A","N/A","N/A","N/A","N/A","N/A","N/A","N/A","N/A","N/A","N/A","N/A","N/A","N/A",null,null,null,null,null,null,null,null,null,null,null,null,null,null,null,null,null,null,null,null,null,null,null,null,null,null,null,null,null,null,null,"Unimproved facilities","N/A","N/A","N/A","N/A","N/A","N/A","N/A","N/A","N/A","N/A","N/A","N/A","N/A","N/A","N/A","N/A","N/A","N/A","N/A","N/A"]
[null,"Open defecation",2.1644217985472993,0.21291075344100915,0.19029232568045168,0.31833486054401777,0,0.14830981352634842,0.21671610088504148,0.30349430492653656,0.23360926619187078,0,5.0112592733342254,1.4621054405613334,0.53494995401911094,0,0,6.420135677142591E-2,2.3676201033150845,9.2575530538773113E-2,0.10473255269335942,0.2085232620028652,null,null,null,null,null,null,null,null,null,null,null,null,null,null,null,null,null,null,null,null,null,null,null,null,null,null,null,null,null,null,null,"Open defecation","N/A","N/A","N/A","N/A","N/A","N/A","N/A","N/A","N/A","N/A","N/A","N/A","N/A","N/A","N/A","N/A","N/A","N/A","N/A","N/A"]
["Septic tank emptying practices","Not emptied/treated and disposed in situ","N/A","N/A","N/A","N/A","N/A","N/A","N/A","N/A","N/A","N/A","N/A","N/A","N/A","N/A","N/A","N/A","N/A","N/A","N/A","N/A",null,null,null,null,null,null,null,null,null,null,null,null,null,null,null,null,null,null,null,null,null,null,null,null,null,null,null,null,null,null,"Septic tank emptying practices","Not emptied/treated and disposed in situ","N/A","N/A","N/A","N/A","N/A","N/A","N/A","N/A","N/A","N/A","N/A","N/A","N/A","N/A","N/A","N/A","N/A","N/A","N/A","N/A"]
[null,"Emptied and buried on site","N/A","N/A","N/A","N/A","N/A","N/A","N/A","N/A","N/A","N/A","N/A","N/A","N/A","N/A","N/A","N/A","N/A","N/A","N/A","N/A",null,null,null,null,null,null,null,null,null,null,null,null,null,null,null,null,null,null,null,null,null,null,null,null,null,null,null,null,null,null,null,"Emptied and buried on site","N/A","N/A","N/A","N/A","N/A","N/A","N/A","N/A","N/A","N/A","N/A","N/A","N/A","N/A","N/A","N/A","N/A","N/A","N/A","N/A"]
[null,"Emptied and discharged locally","N/A","N/A","N/A","N/A","N/A","N/A","N/A","N/A","N/A","N/A","N/A","N/A","N/A","N/A","N/A","N/A","N/A","N/A","N/A","N/A",null,null,null,null,null,null,null,null,null,null,null,null,null,null,null,null,null,null,null,null,null,null,null,null,null,null,null,null,null,null,null,"Emptied and discharged locally","N/A","N/A","N/A","N/A","N/A","N/A","N/A","N/A","N/A","N/A","N/A","N/A","N/A","N/A","N/A","N/A","N/A","N/A","N/A","N/A"]
[null,"Emptied and removed offsite","N/A","N/A","N/A","N/A","N/A","N/A","N/A","N/A","N/A","N/A","N/A","N/A","N/A","N/A","N/A","N/A","N/A","N/A","N/A","N/A",null,null,null,null,null,null,null,null,null,null,null,null,null,null,null,null,null,null,null,null,null,null,null,null,null,null,null,null,null,null,null,"Emptied and removed offsite","N/A","N/A","N/A","N/A","N/A","N/A","N/A","N/A","N/A","N/A","N/A","N/A","N/A","N/A","N/A","N/A","N/A","N/A","N/A","N/A"]
["Latrine emptying practices","Not emptied/treated and disposed in situ","N/A","N/A","N/A","N/A","N/A","N/A","N/A","N/A","N/A","N/A","N/A","N/A","N/A","N/A","N/A","N/A","N/A","N/A","N/A","N/A",null,null,null,null,null,null,null,null,null,null,null,null,null,null,null,null,null,null,null,null,null,null,null,null,null,null,null,null,null,null,"Latrine emptying practices","Not emptied/treated and disposed in situ","N/A","N/A","N/A","N/A","N/A","N/A","N/A","N/A","N/A","N/A","N/A","N/A","N/A","N/A","N/A","N/A","N/A","N/A","N/A","N/A"]
[null,"Emptied and buried on site","N/A","N/A","N/A","N/A","N/A","N/A","N/A","N/A","N/A","N/A","N/A","N/A","N/A","N/A","N/A","N/A","N/A","N/A","N/A","N/A",null,null,null,null,null,null,null,null,null,null,null,null,null,null,null,null,null,null,null,null,null,null,null,null,null,null,null,null,null,null,null,"Emptied and buried on site","N/A","N/A","N/A","N/A","N/A","N/A","N/A","N/A","N/A","N/A","N/A","N/A","N/A","N/A","N/A","N/A","N/A","N/A","N/A","N/A"]
[null,"Emptied and discharged locally","N/A","N/A","N/A","N/A","N/A","N/A","N/A","N/A","N/A","N/A","N/A","N/A","N/A","N/A","N/A","N/A","N/A","N/A","N/A","N/A",null,null,null,null,null,null,null,null,null,null,null,null,null,null,null,null,null,null,null,null,null,null,null,null,null,null,null,null,null,null,null,"Emptied and discharged locally","N/A","N/A","N/A","N/A","N/A","N/A","N/A","N/A","N/A","N/A","N/A","N/A","N/A","N/A","N/A","N/A","N/A","N/A","N/A","N/A"]
[null,"Emptied and removed offsite","N/A","N/A","N/A","N/A","N/A","N/A","N/A","N/A","N/A","N/A","N/A","N/A","N/A","N/A","N/A","N/A","N/A","N/A","N/A","N/A",null,null,null,null,null,null,null,null,null,null,null,null,null,null,null,null,null,null,null,null,null,null,null,null,null,null,null,null,null,null,null,"Emptied and removed offsite","N/A","N/A","N/A","N/A","N/A","N/A","N/A","N/A","N/A","N/A","N/A","N/A","N/A","N/A","N/A","N/A","N/A","N/A","N/A","N/A"]
["Shared among improved sanitation facilities","Yes",4.8156877493281316,1.7853108139143166,1.5726300814376291,0.26483998830134386,0.18205323876070137,4.6548106411557546,1.9694295187879216,0.2918966637114041,0.27057317178880202,2.6344557203710407E-2,4.2249603484181391,1.8548919533726702,2.1905164337428475,2.254477432755202,1.0197132181247246,1.605812151649852,1.5963637686591596,0.85048701598968346,2.9958660729790592,1.5907304314411217,null,null,null,null,null,null,null,null,null,null,null,null,null,null,null,null,null,null,null,null,null,null,null,null,null,null,null,null,null,null,"Shared among improved sanitation facilities","Yes","N/A","N/A","N/A","N/A","N/A","N/A","N/A","N/A","N/A","N/A","N/A","N/A","N/A","N/A","N/A","N/A","N/A","N/A","N/A","N/A"]
[null,"No",55.952189242636564,85.503005500053149,93.17211860692737,96.002470334227979,98.702667891179885,86.871893393865179,94.789527977847428,97.692122496864599,98.26263299112405,99.649484029155758,37.42362616136171,51.423096616391362,70.634977320535512,81.271934656218576,88.993883378339007,88.507829284594052,65.501174388530188,76.291996731816099,85.918973501300471,96.871723328133015,null,null,null,null,null,null,null,null,null,null,null,null,null,null,null,null,null,null,null,null,null,null,null,null,null,null,null,null,null,null,null,"No","N/A","N/A","N/A","N/A","N/A","N/A","N/A","N/A","N/A","N/A","N/A","N/A","N/A","N/A","N/A","N/A","N/A","N/A","N/A","N/A"]
[null,"DK/missing",39.232123008035316,12.711683686033028,5.2552513116352717,3.7326896774710341,1.1152788700593659,8.4732959649791741,3.2410425033647798,2.0159808394240373,1.4667938370872076,0.32417141364054702,58.351413490220203,46.722011430236172,27.174506245721609,16.473587911026215,9.9864034035362614,9.8863585637564277,32.902461842809963,22.857516252194326,11.085160425720456,1.5375462404258644,null,null,null,null,null,null,null,null,null,null,null,null,null,null,null,null,null,null,null,null,null,null,null,null,null,null,null,null,null,null,null,"DK/missing","N/A","N/A","N/A","N/A","N/A","N/A","N/A","N/A","N/A","N/A","N/A","N/A","N/A","N/A","N/A","N/A","N/A","N/A","N/A","N/A"]
["Shared among all sanitation facilities","Yes",7.6374220571842493,2.2060466505595473,1.7256722440964185,0.2656857586907575,0.18205323876070137,5.0047634512170811,1.9737068593363758,0.29278525027164337,0.27120673585429417,2.6344557203710407E-2,9.8442671291073101,4.2543066710582718,2.8755427064161507,3.3257804015989572,1.0197132181247246,1.926528194233285,3.7536837680577162,2.3385399019111257,3.2261654492437759,1.6609761632063063,null,null,null,null,null,null,null,null,null,null,null,null,null,null,null,null,null,null,null,null,null,null,null,null,null,null,null,null,null,null,"Shared among all sanitation facilities","Yes","N/A","N/A","N/A","N/A","N/A","N/A","N/A","N/A","N/A","N/A","N/A","N/A","N/A","N/A","N/A","N/A","N/A","N/A","N/A","N/A"]
[null,"No",92.362577942815889,97.793953349440628,98.054307551509979,99.679265228611698,99.804586948916068,94.995236548782884,97.994086562108251,99.511123329642288,99.627436318745936,99.9736554427963,90.155732870892706,95.745693328941755,97.124457293583816,96.470568113903568,98.980286781875265,97.95250393964578,96.212204310705786,97.396567686713425,96.741000299712084,98.339023836793672,null,null,null,null,null,null,null,null,null,null,null,null,null,null,null,null,null,null,null,null,null,null,null,null,null,null,null,null,null,null,null,"No","N/A","N/A","N/A","N/A","N/A","N/A","N/A","N/A","N/A","N/A","N/A","N/A","N/A","N/A","N/A","N/A","N/A","N/A","N/A","N/A"]
["Type of toilet facility","Flush toilet",37.308670333870637,64.517643212857664,80.090209769770254,86.630713619147443,93.011222414963839,80.430040236498812,89.890553589316497,93.502428827771865,94.970905289025708,97.800552817469978,16.157414967462625,20.796733142979946,34.902576435876291,41.701021184594708,50.531508994286881,74.749105537825173,58.4836089078171,57.721317549412433,57.119684460681896,86.395789893158295,null,null,null,null,null,null,null,null,null,null,null,null,null,null,null,null,null,null,null,null,null,null,null,null,null,null,null,null,null,null,"Type of toilet facility","Flush toilet",3400.5096200000025,5872.5838290000202,7298.7750139999853,7887.6810709999718,8474.1776559999362,4949.6278400000174,5530.3381510000163,5743.430736000003,5838.0158349999701,6017.8288419999635,478.46757600000018,616.16270800000007,1031.7007399999998,1235.6566499999992,1492.4981119999995,7430.6437559999358,5214.3959870000044,2024.25676799999,3441.6392730000111,14822.791405999773]
[null,"Open pit",35.300987548603551,11.165869085403282,4.4460021190839756,3.0089055463754963,0.83539840845659896,7.6202415338709706,2.5561766471240253,1.2380593048397881,0.97451838013137559,0.29213092163541921,51.524241153572994,42.324701030858996,24.376837247242111,15.276616529353101,8.6664027360009985,9.6555847303804736,28.625844923772387,19.007003549484409,10.017959677071158,1.2054350489159185,null,null,null,null,null,null,null,null,null,null,null,null,null,null,null,null,null,null,null,null,null,null,null,null,null,null,null,null,null,null,null,"Open pit",3217.5187879999917,1016.3499310000005,405.17273299999994,273.959273,76.112476999999998,468.94617400000027,157.26370200000002,76.048376000000019,59.905228000000001,17.975296,1525.7811239999985,1253.9903369999993,720.56574600000067,452.66643999999997,255.97077899999999,959.84038700000031,2552.2790689999938,666.56578900000011,603.61333899999977,206.814618]
[null,"Closed pit",23.459206658094057,22.770673101109917,14.826054750321468,9.7941652412954845,5.9083285990509475,11.096663798522133,6.9379518841728789,4.6735206754798693,3.7110260318601136,1.9073162608946643,25.491171542317264,32.481255426784116,37.922917318402085,41.825390904379148,39.687508845987765,15.473606318032711,8.7158883577925526,19.513741728932192,31.900951592926969,12.06666386641613,null,null,null,null,null,null,null,null,null,null,null,null,null,null,null,null,null,null,null,null,null,null,null,null,null,null,null,null,null,null,null,"Closed pit",2138.1962209999988,2072.6529980000005,1351.1269139999974,891.75361199999941,538.30306599999994,682.88360800000009,426.84373899999991,287.07320899999996,228.12279900000001,117.36030599999999,754.86698100000012,962.3501040000001,1120.9803359999987,1239.3418899999981,1172.2098389999987,1538.1970839999999,777.10822100000087,684.33683499999916,1922.1319040000001,2070.2587670000007]
[null,"No facility, bush/field/public toilet",2.1644217985472993,0.21291075344100915,0.1905932190373697,0.31867425612701483,0,0.14830981352634842,0.21679986487593955,0.30408878723542382,0.23372201565357315,0,5.0112592733342254,1.4621054405613334,0.53494995401911094,0,0,6.4279063862286046E-2,2.3700414724622063,9.2575530538773113E-2,0.10481850350695623,0.2085232620028652,null,null,null,null,null,null,null,null,null,null,null,null,null,null,null,null,null,null,null,null,null,null,null,null,null,null,null,null,null,null,null,"No facility, bush/field/public toilet",197.27685499999998,19.379756999999998,17.369126999999999,29.015124,0,9.1269179999999999,13.338182000000002,18.678796999999999,14.367272,0,148.39781499999998,43.319056000000003,15.812823,0,0,6.3898400000000004,211.31279299999997,3.2465760000000001,6.3156420000000004,35.776011999999994]
[null,"OTHER",1.7667136608845009,1.3329038471887427,0.44714014178739481,0.24754133705535875,0.24505057752919382,0.70474461758185458,0.39851801451083041,0.28190240467323208,0.10982828332952339,0,1.8159130633130536,2.9352049588158526,2.2627190444603911,1.1969713816731136,1.114579423724442,5.7424349900038453E-2,1.8046163381550306,3.6653616416323835,0.85658576581318346,0.12358792950708065,null,null,null,null,null,null,null,null,null,null,null,null,null,null,null,null,null,null,null,null,null,null,null,null,null,null,null,null,null,null,null,"OTHER",161.02763099999999,121.32479099999998,40.748742,22.538509000000001,22.326360999999999,43.369661000000001,24.518031000000004,17.315988000000001,6.7513229999999993,0,53.774414,86.963842999999997,66.884715999999997,35.467852000000001,32.920206,5.7084279999999996,160.89951300000001,128.54233800000003,51.611966000000002,21.203789]
[null,null,null,null,null,null,null,null,null,null,null,null,null,null,null,null,null,null,null,null,null,null,null,null,null,null,null,null,null,null,null,null,null,null,null,null,null,null,null,null,null,null,null,null,null,null,null,null,null,null,null,null,null,"Total",9114.5291149999885,9102.2913059999646,9113.1925299999402,9104.9475889998994,9110.9195599998839,6153.9542010000105,6152.3018050000055,6142.5471059999918,6147.1624569999522,6153.16444399996,2961.2879099999941,2962.7860479999922,2955.9443609999994,2963.1328319999952,2953.5989359999958,9940.7794949998679,8915.9955830000636,3506.9483059999825,6025.3121240000009,17156.844591999725]
[]
[]
[]
[]
[]
[]
[]
[]
[]
[]
[]
[]
[]
[]
[]
[]
[]
[]
[]
[]
[]
[]
[]
[]
[]
[]
[]
[]
[]
[]
[]
[]
[]
[]
[]
[]
[]
[]
[]
[]
[]
[]
[]
[]
[]
[]
[]
[]
[]
[{"$f":"A1026","v":"Turkey"}]
[{"$f":"A1034","v":"2003"}]
["Access to hygiene facilities "]
[" by wealth quintile and sub-national region"]
["Notes:"]
["WHO/UNICEF JMP customised wealth index excludes water,"]
[" sanitation and hygiene assets."]
["Survey used for analysis:",{"$f":"A1025","v":"DHS03"}]
[]
[]
[]
[]
["Access to handwashing",null,"NATIONAL wealth index quintile",null,null,null,null,"URBAN wealth index quintile",null,null,null,null,"RURAL wealth index quintile",null,null,null,null,"SUB-REGIONS:",null,null,null,null,null,null,null,null,null,null,null,null,null,null,null,null,null,null,null,null,null,null,null,null,null,null,null,null,null,null,null,null,null,null,"Raw numbers of respondents:","Access to handwashing","NATIONAL wealth index quintile",null,null,null,null,"URBAN wealth index quintile",null,null,null,null,"RURAL wealth index quintile",null,null,null,null,"SUB-REGIONS:"]
["Weighted percentage (used in graphs)",null,"Poorest","Poor","Middle","Rich","Richest","Poorest","Poor","Middle","Rich","Richest","Poorest","Poor","Middle","Rich","Richest","Central","East","North","South","West",null,null,null,null,null,null,null,null,null,null,null,null,null,null,null,null,null,null,null,null,null,null,null,null,null,null,null,null,null,null,"Hygiene data, raw numbers (weighted)",null,"Poorest","Poor","Middle","Rich","Richest","Poorest","Poor","Middle","Rich","Richest","Poorest","Poor","Middle","Rich","Richest","Central","East","North","South","West"]
["Hygiene ladder","Basic","N/A","N/A","N/A","N/A","N/A","N/A","N/A","N/A","N/A","N/A","N/A","N/A","N/A","N/A","N/A","N/A","N/A","N/A","N/A","N/A",null,null,null,null,null,null,null,null,null,null,null,null,null,null,null,null,null,null,null,null,null,null,null,null,null,null,null,null,null,null,"Hygiene ladder","Basic","N/A","N/A","N/A","N/A","N/A","N/A","N/A","N/A","N/A","N/A","N/A","N/A","N/A","N/A","N/A","N/A","N/A","N/A","N/A","N/A"]
[null,"Limited","N/A","N/A","N/A","N/A","N/A","N/A","N/A","N/A","N/A","N/A","N/A","N/A","N/A","N/A","N/A","N/A","N/A","N/A","N/A","N/A",null,null,null,null,null,null,null,null,null,null,null,null,null,null,null,null,null,null,null,null,null,null,null,null,null,null,null,null,null,null,null,"Limited","N/A","N/A","N/A","N/A","N/A","N/A","N/A","N/A","N/A","N/A","N/A","N/A","N/A","N/A","N/A","N/A","N/A","N/A","N/A","N/A"]
[null,"No facility","N/A","N/A","N/A","N/A","N/A","N/A","N/A","N/A","N/A","N/A","N/A","N/A","N/A","N/A","N/A","N/A","N/A","N/A","N/A","N/A",null,null,null,null,null,null,null,null,null,null,null,null,null,null,null,null,null,null,null,null,null,null,null,null,null,null,null,null,null,null,null,"No facility","N/A","N/A","N/A","N/A","N/A","N/A","N/A","N/A","N/A","N/A","N/A","N/A","N/A","N/A","N/A","N/A","N/A","N/A","N/A","N/A"]
[null,null,null,null,null,null,null,null,null,null,null,null,null,null,null,null,null,null,null,null,null,null,null,null,null,null,null,null,null,null,null,null,null,null,null,null,null,null,null,null,null,null,null,null,null,null,null,null,null,null,null,null,"Observed handwashing place","Fixed","N/A","N/A","N/A","N/A","N/A","N/A","N/A","N/A","N/A","N/A","N/A","N/A","N/A","N/A","N/A","N/A","N/A","N/A","N/A","N/A"]
[null,null,null,null,null,null,null,null,null,null,null,null,null,null,null,null,null,null,null,null,null,null,null,null,null,null,null,null,null,null,null,null,null,null,null,null,null,null,null,null,null,null,null,null,null,null,null,null,null,null,null,null,null,"Mobile","N/A","N/A","N/A","N/A","N/A","N/A","N/A","N/A","N/A","N/A","N/A","N/A","N/A","N/A","N/A","N/A","N/A","N/A","N/A","N/A"]
[null,null,null,null,null,null,null,null,null,null,null,null,null,null,null,null,null,null,null,null,null,null,null,null,null,null,null,null,null,null,null,null,null,null,null,null,null,null,null,null,null,null,null,null,null,null,null,null,null,null,null,null,"Water / Soap","Water and soap","N/A","N/A","N/A","N/A","N/A","N/A","N/A","N/A","N/A","N/A","N/A","N/A","N/A","N/A","N/A","N/A","N/A","N/A","N/A","N/A"]
[null,null,null,null,null,null,null,null,null,null,null,null,null,null,null,null,null,null,null,null,null,null,null,null,null,null,null,null,null,null,null,null,null,null,null,null,null,null,null,null,null,null,null,null,null,null,null,null,null,null,null,null,null,"Water only","N/A","N/A","N/A","N/A","N/A","N/A","N/A","N/A","N/A","N/A","N/A","N/A","N/A","N/A","N/A","N/A","N/A","N/A","N/A","N/A"]
[null,null,null,null,null,null,null,null,null,null,null,null,null,null,null,null,null,null,null,null,null,null,null,null,null,null,null,null,null,null,null,null,null,null,null,null,null,null,null,null,null,null,null,null,null,null,null,null,null,null,null,null,null,"Soap only","N/A","N/A","N/A","N/A","N/A","N/A","N/A","N/A","N/A","N/A","N/A","N/A","N/A","N/A","N/A","N/A","N/A","N/A","N/A","N/A"]
[null,null,null,null,null,null,null,null,null,null,null,null,null,null,null,null,null,null,null,null,null,null,null,null,null,null,null,null,null,null,null,null,null,null,null,null,null,null,null,null,null,null,null,null,null,null,null,null,null,null,null,null,null,"Neither","N/A","N/A","N/A","N/A","N/A","N/A","N/A","N/A","N/A","N/A","N/A","N/A","N/A","N/A","N/A","N/A","N/A","N/A","N/A","N/A"]
[]
[]
[]
[]
[]
[]
[]
[]
[]
[]
[]
[]
[]
[]
[]
[]
[]
[]
[]
[]
[]
[]
[]
[]
[]
[]
[]
[]
[null,null,null,null,null,null,null,null,null,null,null,null,null,null,null,null,null,null,null,null,null,null,null,null,null,null,null,null,null,null,null,null,null,null,null,null,null,null,null,null,null,null,null,null,null,null,null,null,null,null,null,null,"Raw numbers of respondents:","Menstrual health and hygiene","NATIONAL wealth index quintile",null,null,null,null,"URBAN wealth index quintile",null,null,null,null,"RURAL wealth index quintile",null,null,null,null,"SUB-REGIONS:"]
[null,null,null,null,null,null,null,null,null,null,null,null,null,null,null,null,null,null,null,null,null,null,null,null,null,null,null,null,null,null,null,null,null,null,null,null,null,null,null,null,null,null,null,null,null,null,null,null,null,null,null,null,"MHH data, raw numbers (weighted)",null,"Poorest","Poor","Middle","Rich","Richest","Poorest","Poor","Middle","Rich","Richest","Poorest","Poor","Middle","Rich","Richest","Central","East","North","South","West"]
[null,null,null,null,null,null,null,null,null,null,null,null,null,null,null,null,null,null,null,null,null,null,null,null,null,null,null,null,null,null,null,null,null,null,null,null,null,null,null,null,null,null,null,null,null,null,null,null,null,null,null,null,"Private place to wash and change","Yes","N/A","N/A","N/A","N/A","N/A","N/A","N/A","N/A","N/A","N/A","N/A","N/A","N/A","N/A","N/A","N/A","N/A","N/A","N/A","N/A"]
[null,null,null,null,null,null,null,null,null,null,null,null,null,null,null,null,null,null,null,null,null,null,null,null,null,null,null,null,null,null,null,null,null,null,null,null,null,null,null,null,null,null,null,null,null,null,null,null,null,null,null,null,null,"No","N/A","N/A","N/A","N/A","N/A","N/A","N/A","N/A","N/A","N/A","N/A","N/A","N/A","N/A","N/A","N/A","N/A","N/A","N/A","N/A"]
[null,null,null,null,null,null,null,null,null,null,null,null,null,null,null,null,null,null,null,null,null,null,null,null,null,null,null,null,null,null,null,null,null,null,null,null,null,null,null,null,null,null,null,null,null,null,null,null,null,null,null,null,null,"DK/not sure/missing","N/A","N/A","N/A","N/A","N/A","N/A","N/A","N/A","N/A","N/A","N/A","N/A","N/A","N/A","N/A","N/A","N/A","N/A","N/A","N/A"]
[null,null,null,null,null,null,null,null,null,null,null,null,null,null,null,null,null,null,null,null,null,null,null,null,null,null,null,null,null,null,null,null,null,null,null,null,null,null,null,null,null,null,null,null,null,null,null,null,null,null,null,null,"Use of menstrual materials","Materials reusable","N/A","N/A","N/A","N/A","N/A","N/A","N/A","N/A","N/A","N/A","N/A","N/A","N/A","N/A","N/A","N/A","N/A","N/A","N/A","N/A"]
[null,null,null,null,null,null,null,null,null,null,null,null,null,null,null,null,null,null,null,null,null,null,null,null,null,null,null,null,null,null,null,null,null,null,null,null,null,null,null,null,null,null,null,null,null,null,null,null,null,null,null,null,null,"Materials not reusable","N/A","N/A","N/A","N/A","N/A","N/A","N/A","N/A","N/A","N/A","N/A","N/A","N/A","N/A","N/A","N/A","N/A","N/A","N/A","N/A"]
[null,null,null,null,null,null,null,null,null,null,null,null,null,null,null,null,null,null,null,null,null,null,null,null,null,null,null,null,null,null,null,null,null,null,null,null,null,null,null,null,null,null,null,null,null,null,null,null,null,null,null,null,null,"No materials used","N/A","N/A","N/A","N/A","N/A","N/A","N/A","N/A","N/A","N/A","N/A","N/A","N/A","N/A","N/A","N/A","N/A","N/A","N/A","N/A"]
[null,null,null,null,null,null,null,null,null,null,null,null,null,null,null,null,null,null,null,null,null,null,null,null,null,null,null,null,null,null,null,null,null,null,null,null,null,null,null,null,null,null,null,null,null,null,null,null,null,null,null,null,null,"DK/not sure/missing","N/A","N/A","N/A","N/A","N/A","N/A","N/A","N/A","N/A","N/A","N/A","N/A","N/A","N/A","N/A","N/A","N/A","N/A","N/A","N/A"]
[null,null,null,null,null,null,null,null,null,null,null,null,null,null,null,null,null,null,null,null,null,null,null,null,null,null,null,null,null,null,null,null,null,null,null,null,null,null,null,null,null,null,null,null,null,null,null,null,null,null,null,null,"Use of menstrual materials with private place to wash and change","Materials reusable","N/A","N/A","N/A","N/A","N/A","N/A","N/A","N/A","N/A","N/A","N/A","N/A","N/A","N/A","N/A","N/A","N/A","N/A","N/A","N/A"]
[null,null,null,null,null,null,null,null,null,null,null,null,null,null,null,null,null,null,null,null,null,null,null,null,null,null,null,null,null,null,null,null,null,null,null,null,null,null,null,null,null,null,null,null,null,null,null,null,null,null,null,null,null,"Materials not reusable","N/A","N/A","N/A","N/A","N/A","N/A","N/A","N/A","N/A","N/A","N/A","N/A","N/A","N/A","N/A","N/A","N/A","N/A","N/A","N/A"]
[null,null,null,null,null,null,null,null,null,null,null,null,null,null,null,null,null,null,null,null,null,null,null,null,null,null,null,null,null,null,null,null,null,null,null,null,null,null,null,null,null,null,null,null,null,null,null,null,null,null,null,null,null,"No materials used","N/A","N/A","N/A","N/A","N/A","N/A","N/A","N/A","N/A","N/A","N/A","N/A","N/A","N/A","N/A","N/A","N/A","N/A","N/A","N/A"]
[null,null,null,null,null,null,null,null,null,null,null,null,null,null,null,null,null,null,null,null,null,null,null,null,null,null,null,null,null,null,null,null,null,null,null,null,null,null,null,null,null,null,null,null,null,null,null,null,null,null,null,null,"Awareness of menstruation before menarche","Yes","N/A","N/A","N/A","N/A","N/A","N/A","N/A","N/A","N/A","N/A","N/A","N/A","N/A","N/A","N/A","N/A","N/A","N/A","N/A","N/A"]
[null,null,null,null,null,null,null,null,null,null,null,null,null,null,null,null,null,null,null,null,null,null,null,null,null,null,null,null,null,null,null,null,null,null,null,null,null,null,null,null,null,null,null,null,null,null,null,null,null,null,null,null,null,"No","N/A","N/A","N/A","N/A","N/A","N/A","N/A","N/A","N/A","N/A","N/A","N/A","N/A","N/A","N/A","N/A","N/A","N/A","N/A","N/A"]
[null,null,null,null,null,null,null,null,null,null,null,null,null,null,null,null,null,null,null,null,null,null,null,null,null,null,null,null,null,null,null,null,null,null,null,null,null,null,null,null,null,null,null,null,null,null,null,null,null,null,null,null,null,"DK/not sure/missing","N/A","N/A","N/A","N/A","N/A","N/A","N/A","N/A","N/A","N/A","N/A","N/A","N/A","N/A","N/A","N/A","N/A","N/A","N/A","N/A"]
[null,null,null,null,null,null,null,null,null,null,null,null,null,null,null,null,null,null,null,null,null,null,null,null,null,null,null,null,null,null,null,null,null,null,null,null,null,null,null,null,null,null,null,null,null,null,null,null,null,null,null,null,"Participation in (all) activities during menstruation","Yes","N/A","N/A","N/A","N/A","N/A","N/A","N/A","N/A","N/A","N/A","N/A","N/A","N/A","N/A","N/A","N/A","N/A","N/A","N/A","N/A"]
[null,null,null,null,null,null,null,null,null,null,null,null,null,null,null,null,null,null,null,null,null,null,null,null,null,null,null,null,null,null,null,null,null,null,null,null,null,null,null,null,null,null,null,null,null,null,null,null,null,null,null,null,null,"No","N/A","N/A","N/A","N/A","N/A","N/A","N/A","N/A","N/A","N/A","N/A","N/A","N/A","N/A","N/A","N/A","N/A","N/A","N/A","N/A"]
[null,null,null,null,null,null,null,null,null,null,null,null,null,null,null,null,null,null,null,null,null,null,null,null,null,null,null,null,null,null,null,null,null,null,null,null,null,null,null,null,null,null,null,null,null,null,null,null,null,null,null,null,null,"DK/not sure/missing/no such activity","N/A","N/A","N/A","N/A","N/A","N/A","N/A","N/A","N/A","N/A","N/A","N/A","N/A","N/A","N/A","N/A","N/A","N/A","N/A","N/A"]
[null,null,null,null,null,null,null,null,null,null,null,null,null,null,null,null,null,null,null,null,null,null,null,null,null,null,null,null,null,null,null,null,null,null,null,null,null,null,null,null,null,null,null,null,null,null,null,null,null,null,null,null,"Participation in specific activities during menstruation","Did not go to school (amongst those usually attending school)","N/A","N/A","N/A","N/A","N/A","N/A","N/A","N/A","N/A","N/A","N/A","N/A","N/A","N/A","N/A","N/A","N/A","N/A","N/A","N/A"]
[null,null,null,null,null,null,null,null,null,null,null,null,null,null,null,null,null,null,null,null,null,null,null,null,null,null,null,null,null,null,null,null,null,null,null,null,null,null,null,null,null,null,null,null,null,null,null,null,null,null,null,null,null,"Did not go to work (amongst those who usually work)","N/A","N/A","N/A","N/A","N/A","N/A","N/A","N/A","N/A","N/A","N/A","N/A","N/A","N/A","N/A","N/A","N/A","N/A","N/A","N/A"]
[null,null,null,null,null,null,null,null,null,null,null,null,null,null,null,null,null,null,null,null,null,null,null,null,null,null,null,null,null,null,null,null,null,null,null,null,null,null,null,null,null,null,null,null,null,null,null,null,null,null,null,null,null,"Did not participate in social activities","N/A","N/A","N/A","N/A","N/A","N/A","N/A","N/A","N/A","N/A","N/A","N/A","N/A","N/A","N/A","N/A","N/A","N/A","N/A","N/A"]
[null,null,null,null,null,null,null,null,null,null,null,null,null,null,null,null,null,null,null,null,null,null,null,null,null,null,null,null,null,null,null,null,null,null,null,null,null,null,null,null,null,null,null,null,null,null,null,null,null,null,null,null,null,"Did not cook food","N/A","N/A","N/A","N/A","N/A","N/A","N/A","N/A","N/A","N/A","N/A","N/A","N/A","N/A","N/A","N/A","N/A","N/A","N/A","N/A"]
[null,null,null,null,null,null,null,null,null,null,null,null,null,null,null,null,null,null,null,null,null,null,null,null,null,null,null,null,null,null,null,null,null,null,null,null,null,null,null,null,null,null,null,null,null,null,null,null,null,null,null,null,null,"Did not eat with others","N/A","N/A","N/A","N/A","N/A","N/A","N/A","N/A","N/A","N/A","N/A","N/A","N/A","N/A","N/A","N/A","N/A","N/A","N/A","N/A"]
[null,null,null,null,null,null,null,null,null,null,null,null,null,null,null,null,null,null,null,null,null,null,null,null,null,null,null,null,null,null,null,null,null,null,null,null,null,null,null,null,null,null,null,null,null,null,null,null,null,null,null,null,null,"Did not bathe in regular place","N/A","N/A","N/A","N/A","N/A","N/A","N/A","N/A","N/A","N/A","N/A","N/A","N/A","N/A","N/A","N/A","N/A","N/A","N/A","N/A"]
[null,null,null,null,null,null,null,null,null,null,null,null,null,null,null,null,null,null,null,null,null,null,null,null,null,null,null,null,null,null,null,null,null,null,null,null,null,null,null,null,null,null,null,null,null,null,null,null,null,null,null,null,null,"Did not participate in other activities","N/A","N/A","N/A","N/A","N/A","N/A","N/A","N/A","N/A","N/A","N/A","N/A","N/A","N/A","N/A","N/A","N/A","N/A","N/A","N/A"]
[null,null,null,null,null,null,null,null,null,null,null,null,null,null,null,null,null,null,null,null,null,null,null,null,null,null,null,null,null,null,null,null,null,null,null,null,null,null,null,null,null,null,null,null,null,null,null,null,null,null,null,null,null,"DK/not sure/missing/no such activity","N/A","N/A","N/A","N/A","N/A","N/A","N/A","N/A","N/A","N/A","N/A","N/A","N/A","N/A","N/A","N/A","N/A","N/A","N/A","N/A"]
[]
[]
[]
[]
[]
[]
[]
[]
[]
[]
[]
[]
[]
[]
[]
[]
[]
[]
[]
[]
[]
[]
[]
[]
[]
[]
[]
[]
[]
[]
[]
[]
[]
[]
[]
[]
[]
[]
[]
[]
[]
[]
[]
[]
[]
[]
[]
[]
[]
[]
[]
[]
[]
[]
[null,null,null,null,null,null,null,null,null,null,null,null,null,null,null,null,null,null,null,null,null,null,null,null,null,null,null,null,null,null,null,null,null,null,null,null,null,null,null,null,null,null,null,null,null,null,null,null,null,null,null,null,"Raw numbers of respondents:","Basic water, sanitation and hygiene","NATIONAL wealth index quintile",null,null,null,null,"URBAN wealth index quintile",null,null,null,null,"RURAL wealth index quintile",null,null,null,null,"SUB-REGIONS:"]
[null,null,null,null,null,null,null,null,null,null,null,null,null,null,null,null,null,null,null,null,null,null,null,null,null,null,null,null,null,null,null,null,null,null,null,null,null,null,null,null,null,null,null,null,null,null,null,null,null,null,null,null,"WatSan data, raw numbers (weighted)",null,"Poorest","Poor","Middle","Rich","Richest","Poorest","Poor","Middle","Rich","Richest","Poorest","Poor","Middle","Rich","Richest","Central","East","North","South","West"]
[null,null,null,null,null,null,null,null,null,null,null,null,null,null,null,null,null,null,null,null,null,null,null,null,null,null,null,null,null,null,null,null,null,null,null,null,null,null,null,null,null,null,null,null,null,null,null,null,null,null,null,null,"Use of Basic Water Sanitation and Hygiene","Yes","N/A","N/A","N/A","N/A","N/A","N/A","N/A","N/A","N/A","N/A","N/A","N/A","N/A","N/A","N/A","N/A","N/A","N/A","N/A","N/A"]
[null,null,null,null,null,null,null,null,null,null,null,null,null,null,null,null,null,null,null,null,null,null,null,null,null,null,null,null,null,null,null,null,null,null,null,null,null,null,null,null,null,null,null,null,null,null,null,null,null,null,null,null,null,"No","N/A","N/A","N/A","N/A","N/A","N/A","N/A","N/A","N/A","N/A","N/A","N/A","N/A","N/A","N/A","N/A","N/A","N/A","N/A","N/A"]
[null,null,null,null,null,null,null,null,null,null,null,null,null,null,null,null,null,null,null,null,null,null,null,null,null,null,null,null,null,null,null,null,null,null,null,null,null,null,null,null,null,null,null,null,null,null,null,null,null,null,null,null,"Use of Basic Water and Sanitation","Yes","N/A","N/A","N/A","N/A","N/A","N/A","N/A","N/A","N/A","N/A","N/A","N/A","N/A","N/A","N/A","N/A","N/A","N/A","N/A","N/A"]
[null,null,null,null,null,null,null,null,null,null,null,null,null,null,null,null,null,null,null,null,null,null,null,null,null,null,null,null,null,null,null,null,null,null,null,null,null,null,null,null,null,null,null,null,null,null,null,null,null,null,null,null,null,"No","N/A","N/A","N/A","N/A","N/A","N/A","N/A","N/A","N/A","N/A","N/A","N/A","N/A","N/A","N/A","N/A","N/A","N/A","N/A","N/A"]
[null,null,null,null,null,null,null,null,null,null,null,null,null,null,null,null,null,null,null,null,null,null,null,null,null,null,null,null,null,null,null,null,null,null,null,null,null,null,null,null,null,null,null,null,null,null,null,null,null,null,null,null,"Use of Basic Water and Hygiene","Yes","N/A","N/A","N/A","N/A","N/A","N/A","N/A","N/A","N/A","N/A","N/A","N/A","N/A","N/A","N/A","N/A","N/A","N/A","N/A","N/A"]
[null,null,null,null,null,null,null,null,null,null,null,null,null,null,null,null,null,null,null,null,null,null,null,null,null,null,null,null,null,null,null,null,null,null,null,null,null,null,null,null,null,null,null,null,null,null,null,null,null,null,null,null,null,"No","N/A","N/A","N/A","N/A","N/A","N/A","N/A","N/A","N/A","N/A","N/A","N/A","N/A","N/A","N/A","N/A","N/A","N/A","N/A","N/A"]
[null,null,null,null,null,null,null,null,null,null,null,null,null,null,null,null,null,null,null,null,null,null,null,null,null,null,null,null,null,null,null,null,null,null,null,null,null,null,null,null,null,null,null,null,null,null,null,null,null,null,null,null,"Use of Basic Sanitation and Hygiene","Yes","N/A","N/A","N/A","N/A","N/A","N/A","N/A","N/A","N/A","N/A","N/A","N/A","N/A","N/A","N/A","N/A","N/A","N/A","N/A","N/A"]
[null,null,null,null,null,null,null,null,null,null,null,null,null,null,null,null,null,null,null,null,null,null,null,null,null,null,null,null,null,null,null,null,null,null,null,null,null,null,null,null,null,null,null,null,null,null,null,null,null,null,null,null,null,"No","N/A","N/A","N/A","N/A","N/A","N/A","N/A","N/A","N/A","N/A","N/A","N/A","N/A","N/A","N/A","N/A","N/A","N/A","N/A","N/A"]
[null,null,null,null,null,null,null,null,null,null,null,null,null,null,null,null,null,null,null,null,null,null,null,null,null,null,null,null,null,null,null,null,null,null,null,null,null,null,null,null,null,null,null,null,null,null,null,null,null,null,null,null,"Use of Basic Water","Yes","N/A","N/A","N/A","N/A","N/A","N/A","N/A","N/A","N/A","N/A","N/A","N/A","N/A","N/A","N/A","N/A","N/A","N/A","N/A","N/A"]
[null,null,null,null,null,null,null,null,null,null,null,null,null,null,null,null,null,null,null,null,null,null,null,null,null,null,null,null,null,null,null,null,null,null,null,null,null,null,null,null,null,null,null,null,null,null,null,null,null,null,null,null,null,"No","N/A","N/A","N/A","N/A","N/A","N/A","N/A","N/A","N/A","N/A","N/A","N/A","N/A","N/A","N/A","N/A","N/A","N/A","N/A","N/A"]
[null,null,null,null,null,null,null,null,null,null,null,null,null,null,null,null,null,null,null,null,null,null,null,null,null,null,null,null,null,null,null,null,null,null,null,null,null,null,null,null,null,null,null,null,null,null,null,null,null,null,null,null,"Use of Basic Sanitation","Yes","N/A","N/A","N/A","N/A","N/A","N/A","N/A","N/A","N/A","N/A","N/A","N/A","N/A","N/A","N/A","N/A","N/A","N/A","N/A","N/A"]
[null,null,null,null,null,null,null,null,null,null,null,null,null,null,null,null,null,null,null,null,null,null,null,null,null,null,null,null,null,null,null,null,null,null,null,null,null,null,null,null,null,null,null,null,null,null,null,null,null,null,null,null,null,"No","N/A","N/A","N/A","N/A","N/A","N/A","N/A","N/A","N/A","N/A","N/A","N/A","N/A","N/A","N/A","N/A","N/A","N/A","N/A","N/A"]
[null,null,null,null,null,null,null,null,null,null,null,null,null,null,null,null,null,null,null,null,null,null,null,null,null,null,null,null,null,null,null,null,null,null,null,null,null,null,null,null,null,null,null,null,null,null,null,null,null,null,null,null,"Access to Basic Hygiene","Yes","N/A","N/A","N/A","N/A","N/A","N/A","N/A","N/A","N/A","N/A","N/A","N/A","N/A","N/A","N/A","N/A","N/A","N/A","N/A","N/A"]
[null,null,null,null,null,null,null,null,null,null,null,null,null,null,null,null,null,null,null,null,null,null,null,null,null,null,null,null,null,null,null,null,null,null,null,null,null,null,null,null,null,null,null,null,null,null,null,null,null,null,null,null,null,"No","N/A","N/A","N/A","N/A","N/A","N/A","N/A","N/A","N/A","N/A","N/A","N/A","N/A","N/A","N/A","N/A","N/A","N/A","N/A","N/A"]
[]
[]
[]
[]
[]
[]
[]
[]
[]
[]
[]
[]
[]
[]
[]
[]
[]
[]
[]
[]
[]
[]
[]
[]
[]
[]
[]
[]
[]
[]
[]
[]
[]
[]
[]
[]
[]
[]
[]
[]
[]
[]
[]
[]
[null,null,"INITIAL (national) Wealth Index",null,null,null,null,"URBAN Wealth Index",null,null,null,null,"RURAL Wealth Index"]
[null,null,"Component Matrix",null,null,null,null,"Component Matrix",null,null,null,null,"Component Matrix"]
[null,null,null,null,"Component",null,null,null,null,"Component",null,null,null,null,"Component"]
[null,"Note:\n\nThe INITIAL (national) Wealth Index is based on the first component of the Principal Component Analysis (PCA) which has been obtained at national level.\n\nThe final national-level (NATIONAL) Wealth Index is based on the URBAN and RURAL specific wealth indexes. Regression procedures are used to establish the relationships between the two sets of scores (urban and rural) and the initial (national) wealth factors.\nThis allows best use of the available information for each area and a better precision of the FINAL (NATIONAL) Wealth Index.\n\nFor dependency reasons, all WASH variables (contained in the generic MICS and DHS scripts) have been excluded from the sets of asset variables used in the PCAs.\n\nThe PCA can extracts as many components as there are asset variables in the input. Only the first of the components is used to represent the Wealth Index. \n\nThe scores represent the weights of the asset variables on the Wealth Index (correlations between the variables and the component).\n\nThe communalities are the proportion of each variable's variance that can be explained by the component.\n\nProportion of explained variance is the part of the model's total variance that is explained by the component.\n\nFor more information on the procedure used:\n\nThe DHS Wealth Index, DHS Comparative Reports No. 6, Shea Oscar Rutstein, Kiersten Johnson, ORC Macro International Inc., 2004.\n\nThe DHS Wealth Index: Approaches for Rural and Urban Areas, Shea O. Rutstein, ORC Macro International Inc., 2008.\n\nMICS Methodological Paper No. 4, Review of options for reporting water, sanitation and hygiene coverage by wealth quintile, UNICEF, 2016.",null,null,"1",null,null,null,null,"1",null,null,null,null,"1"]
[null,null,"Blender/mixer",null,0.65467803166581784,null,null,"Television",null,0.64129346408805743,null,null,"Vacuum cleaner",null,0.67161500950088093]
[null,null,"Television",null,0.64876067741442589,null,null,"Dishwasher",null,0.62838234919099134,null,null,"Washing machine",null,0.63888769740581108]
[null,null,"Vacuum cleaner",null,0.642028040704122,null,null,"Blender/mixer",null,0.62291945504937518,null,null,"Blender/mixer",null,0.63274734297201152]
[null,null,"Has credit card",null,0.62232836232509647,null,null,"Has credit card",null,0.60242127114140864,null,null,"Television",null,0.60870458028375485]
[null,null,"Dishwasher",null,0.61872918995659865,null,null,"Camera",null,0.59043568384463663,null,null,"Gas or electric oven",null,0.59145179409879378]
[null,null,"Washing machine",null,0.61547164766874707,null,null,"Has car",null,0.58543951191094246,null,null,"Has car/truck",null,0.5825966792034416]
[null,null,"Camera",null,0.60265025404259809,null,null,"Has car/truck",null,0.58511587966642276,null,null,"Has car",null,0.58189510522234389]
[null,null,"Gas or electric oven",null,0.58082745189770146,null,null,"Vacuum cleaner",null,0.5522378647035906,null,null,"Iron",null,0.56555432857357735]
[null,null,"Has car",null,0.55302057718857955,null,null,"Washing machine",null,0.52745022908910844,null,null,"Camera",null,0.54512187958819491]
[null,null,"Has car/truck",null,0.55294598878092482,null,null,"Computer",null,0.52725487427355855,null,null,"Has credit card",null,0.54143133687577194]
[null,null,"Iron",null,0.53361306203767123,null,null,"Gas or electric oven",null,0.51343775183965934,null,null,"Separate bathroom",null,0.50503546641046526]
[null,null,"Computer",null,0.50987243946758831,null,null,"Internet",null,0.47494504739712584,null,null,"DVD/VCD player",null,0.49941572611212254]
[null,null,"DVD/VCD player",null,0.5082418505127555,null,null,"CD player",null,0.46487345118874601,null,null,"Dishwasher",null,0.49291853645739669]
[null,null,"Separate bathroom",null,0.49386577678177185,null,null,"DVD/VCD player",null,0.45640813241178135,null,null,"Separate kitchen",null,0.4520133046192128]
[null,null,"CD player",null,0.47041976920399164,null,null,"Concrete, cement floor",null,-0.45583369269186413,null,null,"Has television",null,0.39538541245911574]
[null,null,"Internet",null,0.44563152806704731,null,null,"Iron",null,0.44320377650641346,null,null,"Has refrigerator",null,0.38407259226550822]
[null,null,"Separate kitchen",null,0.43588867442359563,null,null,"Parquet, wood tile floor",null,0.41947062833691073,null,null,"Computer",null,0.38283546150696873]
[null,null,"Parquet, wood tile floor",null,0.42671582270459285,null,null,"Separate bathroom",null,0.3789376527565988,null,null,"CD player",null,0.36934745897354782]
[null,null,"Concrete, cement floor",null,-0.42025174105664354,null,null,"Cable TV",null,0.37510872697370878,null,null,"Has bicycle",null,0.36556823437480568]
[null,null,"Number of members per sleeping room",null,-0.38302248635554731,null,null,"Number of members per sleeping room",null,-0.37298139699892952,null,null,"Digiturk, CINE 5, satellite antenna etc.",null,0.35266582927190548]
[null,null,"Has refrigerator",null,0.37123607472538822,null,null,"Video",null,0.37169964364368546,null,null,"Internet",null,0.31244568064453226]
[null,null,"Video",null,0.35592185618004923,null,null,"Digiturk, CINE 5, satellite antenna etc.",null,0.35791810954958259,null,null,"Parquet, wood tile floor",null,0.31110516177023878]
[null,null,"Cable TV",null,0.35217425945304726,null,null,"Video camera",null,0.35659008069150278,null,null,"Video",null,0.30342896384955925]
[null,null,"Has television",null,0.34602635441514812,null,null,"Has refrigerator",null,0.3274000849709276,null,null,"Microwave oven",null,0.30117686634202528]
[null,null,"Video camera",null,0.32392564187514622,null,null,"Microwave oven",null,0.31366927680491907,null,null,"Earth, sand floor",null,-0.28411894986582631]
[null,null,"Microwave oven",null,0.32246771329689239,null,null,"Separate kitchen",null,0.30691447835595481,null,null,"Number of members per sleeping room",null,-0.27312678476566288]
[null,null,"Has bicycle",null,0.31584669425428114,null,null,"Has bicycle",null,0.29680989278904008,null,null,"Dwelling ownership 2",null,0.2635309317306726]
[null,null,"Earth, sand floor",null,-0.27957219134638789,null,null,"Has television",null,0.28360707507052801,null,null,"Carpet floor",null,0.22126379629420792]
[null,null,"Digiturk, CINE 5, satellite antenna etc.",null,0.2761227906637555,null,null,"Dwelling ownership 1",null,0.1537247592574976,null,null,"Vinyl, asphalt strips floor",null,0.22111578382427535]
[null,null,"Carpet floor",null,0.17098893366453807,null,null,"Earth, sand floor",null,-0.15126033013181817,null,null,"Video camera",null,0.20698702657822649]
[null,null,"Marley floor",null,0.15750460092623489,null,null,"Carpet floor",null,0.14144080821972305,null,null,"Marley floor",null,0.18426872314443812]
[null,null,"Rudimentary wood plank floor",null,-0.13667732155692952,null,null,"Taxi/minibus/commercial vehicles",null,0.11837990936781545,null,null,"Concrete, cement floor",null,-0.1774790046354156]
[null,null,"Vinyl, asphalt strips floor",null,0.11573582231978906,null,null,"No rent paid",null,-0.11688145599140018,null,null,"Dwelling ownership 1",null,-0.14887680714643337]
[null,null,"Dwelling ownership 2",null,9.9837551663065807E-2,null,null,"Rudimentary wood plank floor",null,-0.11339437083498684,null,null,"Dwelling ownership",null,0.14816781613552352]
[null,null,"Taxi/minibus/commercial vehicles",null,9.639769950636369E-2,null,null,"Dwelling ownership",null,-0.10222447651882668,null,null,"Taxi/minibus/commercial vehicles",null,0.14457958064010515]
[null,null,"Dwelling ownership",null,9.1636165034584716E-2,null,null,"Dwelling ownership 2",null,7.6422869152816431E-2,null,null,"Has motorcycle/scooter",null,0.14171021764978109]
[null,null,"No rent paid",null,-9.1024103756019326E-2,null,null,"Marley floor",null,5.8461881904234958E-2,null,null,"Mozaic floor",null,0.10308056620885878]
[null,null,"Dwelling ownership 1",null,-4.7295967069284919E-2,null,null,"Vinyl, asphalt strips floor",null,4.7108750808422008E-2,null,null,"Cable TV",null,7.9299172562142667E-2]
[null,null,"Mozaic floor",null,3.3935258075675802E-2,null,null,"Other type of flooring",null,1.8981748175921763E-2,null,null,"No rent paid",null,-4.2679110806572787E-2]
[null,null,"Other type of flooring",null,1.4479055473812034E-2,null,null,"Mozaic floor",null,-7.12651481217862E-3,null,null,"Rudimentary wood plank floor",null,-1.0851087807007725E-2]
[null,null,"Has motorcycle/scooter",null,-7.7934862623486184E-4,null,null,"Has motorcycle/scooter",null,-5.4342453796121662E-3,null,null,"Other type of flooring",null,3.4184738876633326E-3]
[]
[]
[]
[null,null,"Communalities",null,null,null,null,"Communalities",null,null,null,null,"Communalities"]
[null,null,null,null,"Extraction",null,null,null,null,"Extraction",null,null,null,null,"Extraction"]
[null,null,"Number of members per sleeping room",null,0.14670622505398542,null,null,"Number of members per sleeping room",null,0.13911512250727306,null,null,"Number of members per sleeping room",null,7.4598240556428733E-2]
[null,null,"Earth, sand floor",null,7.8160610174221323E-2,null,null,"Earth, sand floor",null,2.287968747158662E-2,null,null,"Earth, sand floor",null,8.0723577672859925E-2]
[null,null,"Rudimentary wood plank floor",null,1.8680690227976311E-2,null,null,"Rudimentary wood plank floor",null,1.2858283337062513E-2,null,null,"Rudimentary wood plank floor",null,1.1774610659539173E-4]
[null,null,"Parquet, wood tile floor",null,0.18208639334645751,null,null,"Parquet, wood tile floor",null,0.17595560803736271,null,null,"Parquet, wood tile floor",null,9.6786421680086443E-2]
[null,null,"Vinyl, asphalt strips floor",null,1.3394780568037784E-2,null,null,"Vinyl, asphalt strips floor",null,2.2192344027300013E-3,null,null,"Vinyl, asphalt strips floor",null,4.8892189856223671E-2]
[null,null,"Concrete, cement floor",null,0.17661152586114018,null,null,"Concrete, cement floor",null,0.20778435539310083,null,null,"Concrete, cement floor",null,3.1498797086377872E-2]
[null,null,"Carpet floor",null,2.9237215435735802E-2,null,null,"Carpet floor",null,2.0005502229848475E-2,null,null,"Carpet floor",null,4.895766755052474E-2]
[null,null,"Marley floor",null,2.4807699312932512E-2,null,null,"Marley floor",null,3.4177916357847147E-3,null,null,"Marley floor",null,3.3954962329281586E-2]
[null,null,"Mozaic floor",null,1.1516017406627197E-3,null,null,"Mozaic floor",null,5.0787213368201268E-5,null,null,"Mozaic floor",null,1.0625603129938918E-2]
[null,null,"Other type of flooring",null,2.0964304741372624E-4,null,null,"Other type of flooring",null,3.603067638141092E-4,null,null,"Other type of flooring",null,1.1685963720636058E-5]
[null,null,"Dwelling ownership 1",null,2.2369085010188836E-3,null,null,"Dwelling ownership 1",null,2.3631301608775593E-2,null,null,"Dwelling ownership 1",null,2.2164303706116311E-2]
[null,null,"Dwelling ownership 2",null,9.9675367220753344E-3,null,null,"Dwelling ownership 2",null,5.8404549295485008E-3,null,null,"Dwelling ownership 2",null,6.9448551978836426E-2]
[null,null,"Dwelling ownership",null,8.3971867422456461E-3,null,null,"Dwelling ownership",null,1.0449843599548148E-2,null,null,"Dwelling ownership",null,2.1953701738370301E-2]
[null,null,"No rent paid",null,8.2853874645865723E-3,null,null,"No rent paid",null,1.3661274754669618E-2,null,null,"No rent paid",null,1.821506499239718E-3]
[null,null,"Has television",null,0.1197342379498377,null,null,"Has television",null,8.0432973030060112E-2,null,null,"Has television",null,0.15632962438546508]
[null,null,"Has refrigerator",null,0.13781622317751402,null,null,"Has refrigerator",null,0.10719081563897061,null,null,"Has refrigerator",null,0.14751175612954731]
[null,null,"Has bicycle",null,9.9759134271357353E-2,null,null,"Has bicycle",null,8.8096112457441464E-2,null,null,"Has bicycle",null,0.13364013398391286]
[null,null,"Has motorcycle/scooter",null,6.073842812141664E-7,null,null,"Has motorcycle/scooter",null,2.9531022845836177E-5,null,null,"Has motorcycle/scooter",null,2.0081785786348328E-2]
[null,null,"Has car/truck",null,0.30574926650891465,null,null,"Has car/truck",null,0.34236059263781171,null,null,"Has car/truck",null,0.33941889061887787]
[null,null,"Separate kitchen",null,0.18999893649075936,null,null,"Separate kitchen",null,9.4196497024507858E-2,null,null,"Separate kitchen",null,0.20431602755278125]
[null,null,"Separate bathroom",null,0.24390340547626291,null,null,"Separate bathroom",null,0.14359374467668065,null,null,"Separate bathroom",null,0.25506082233243621]
[null,null,"Gas or electric oven",null,0.33736052887797668,null,null,"Gas or electric oven",null,0.2636183250141636,null,null,"Gas or electric oven",null,0.34981522474268195]
[null,null,"Microwave oven",null,0.10398542611892679,null,null,"Microwave oven",null,9.838841521132094E-2,null,null,"Microwave oven",null,9.0707504819602158E-2]
[null,null,"Dishwasher",null,0.38282581050434872,null,null,"Dishwasher",null,0.39486437677478897,null,null,"Dishwasher",null,0.24296868358330193]
[null,null,"Blender/mixer",null,0.42860332514582961,null,null,"Blender/mixer",null,0.38802864747901056,null,null,"Blender/mixer",null,0.40036920003814036]
[null,null,"DVD/VCD player",null,0.2583097786126301,null,null,"DVD/VCD player",null,0.20830838333161014,null,null,"DVD/VCD player",null,0.24941606748809858]
[null,null,"Washing machine",null,0.37880534908408231,null,null,"Washing machine",null,0.27820374416615296,null,null,"Washing machine",null,0.40817748989649921]
[null,null,"Video camera",null,0.10492782146422548,null,null,"Video camera",null,0.12715648564757245,null,null,"Video camera",null,4.2843629171695437E-2]
[null,null,"Iron",null,0.28474289997721958,null,null,"Iron",null,0.19642958750954689,null,null,"Iron",null,0.31985169856830986]
[null,null,"Digiturk, CINE 5, satellite antenna etc.",null,7.6243795523940144E-2,null,null,"Digiturk, CINE 5, satellite antenna etc.",null,0.128105373143547,null,null,"Digiturk, CINE 5, satellite antenna etc.",null,0.12437318713604079]
[null,null,"Vacuum cleaner",null,0.41220000505037374,null,null,"Vacuum cleaner",null,0.30496665921238125,null,null,"Vacuum cleaner",null,0.4510667209868684]
[null,null,"Television",null,0.42089041655922477,null,null,"Television",null,0.4112573070820606,null,null,"Television",null,0.37052126605842217]
[null,null,"Video",null,0.12668036770665164,null,null,"Video",null,0.13816062508484275,null,null,"Video",null,9.206913610281714E-2]
[null,null,"Cable TV",null,0.12402670902130225,null,null,"Cable TV",null,0.14070655705183641,null,null,"Cable TV",null,6.2883587690404806E-3]
[null,null,"Camera",null,0.363187328697608,null,null,"Camera",null,0.34861429675708372,null,null,"Camera",null,0.29715786360576646]
[null,null,"CD player",null,0.22129475925793676,null,null,"CD player",null,0.21610732562013543,null,null,"CD player",null,0.13641754545021659]
[null,null,"Computer",null,0.2599699045286295,null,null,"Computer",null,0.27799770244522604,null,null,"Computer",null,0.14656299058725375]
[null,null,"Internet",null,0.19858745880737158,null,null,"Internet",null,0.2255727980470581,null,null,"Internet",null,9.7622303353425047E-2]
[null,null,"Has car",null,0.30583175879398966,null,null,"Has car",null,0.34273942210652253,null,null,"Has car",null,0.33860191348172269]
[null,null,"Taxi/minibus/commercial vehicles",null,9.2925164701191908E-3,null,null,"Taxi/minibus/commercial vehicles",null,1.4013802941932199E-2,null,null,"Taxi/minibus/commercial vehicles",null,2.0903255138068667E-2]
[null,null,"Has credit card",null,0.38729259055423654,null,null,"Has credit card",null,0.36291138792363059,null,null,"Has credit card",null,0.29314789255108564]
[]
[]
[null,null,"Total Variance Explained",null,null,null,null,"Total Variance Explained",null,null,null,null,"Total Variance Explained"]
[null,null,"Component",null,"Extraction Sums of Squared Loadings",null,null,"Component",null,"Extraction Sums of Squared Loadings",null,null,"Component",null,"Extraction Sums of Squared Loadings"]
[null,null,null,null,"Total","% of Variance","Cumulative %",null,null,"Total","% of Variance","Cumulative %",null,null,"Total","% of Variance","Cumulative %"]
[null,null,"1",null,6.9819537662140396,17.029155527351318,17.029155527351318,"1",null,6.3602810429232139,15.512880592495643,15.512880592495643,"1",null,6.2767959281730272,15.309258361397626,15.309258361397626]
[]
[]
[null,null,"Component Score Coefficient Matrix",null,null,null,null,"Component Score Coefficient Matrix",null,null,null,null,"Component Score Coefficient Matrix"]
[null,null,null,null,"Component",null,null,null,null,"Component",null,null,null,null,"Component"]
[null,null,null,null,"1",null,null,null,null,"1",null,null,null,null,"1"]
[null,null,"Number of members per sleeping room",null,-5.4858926194700522E-2,null,null,"Number of members per sleeping room",null,-5.8642282390009855E-2,null,null,"Number of members per sleeping room",null,-4.3513727049775422E-2]
[null,null,"Earth, sand floor",null,-4.0042114386269527E-2,null,null,"Earth, sand floor",null,-2.3782019868464527E-2,null,null,"Earth, sand floor",null,-4.5264965297115239E-2]
[null,null,"Rudimentary wood plank floor",null,-1.9575798713866697E-2,null,null,"Rudimentary wood plank floor",null,-1.7828515763647808E-2,null,null,"Rudimentary wood plank floor",null,-1.7287622428990021E-3]
[null,null,"Parquet, wood tile floor",null,6.1116964820003283E-2,null,null,"Parquet, wood tile floor",null,6.5951586966999834E-2,null,null,"Parquet, wood tile floor",null,4.9564326342658629E-2]
[null,null,"Vinyl, asphalt strips floor",null,1.6576423476167869E-2,null,null,"Vinyl, asphalt strips floor",null,7.4067089945400611E-3,null,null,"Vinyl, asphalt strips floor",null,3.5227492872886033E-2]
[null,null,"Concrete, cement floor",null,-6.019113777153022E-2,null,null,"Concrete, cement floor",null,-7.1668797277291529E-2,null,null,"Concrete, cement floor",null,-2.8275414186848358E-2]
[null,null,"Carpet floor",null,2.4490126888545231E-2,null,null,"Carpet floor",null,2.223813810509169E-2,null,null,"Carpet floor",null,3.5251073768557378E-2]
[null,null,"Marley floor",null,2.2558814652770421E-2,null,null,"Marley floor",null,9.191713622353645E-3,null,null,"Marley floor",null,2.9357131449400622E-2]
[null,null,"Mozaic floor",null,4.8604243471060933E-3,null,null,"Mozaic floor",null,-1.1204716842045774E-3,null,null,"Mozaic floor",null,1.6422481691046823E-2]
[null,null,"Other type of flooring",null,2.0737827775194929E-3,null,null,"Other type of flooring",null,2.9844197210501982E-3,null,null,"Other type of flooring",null,5.4462084266906224E-4]
[null,null,"Dwelling ownership 1",null,-6.7740304007958413E-3,null,null,"Dwelling ownership 1",null,2.4169491602661162E-2,null,null,"Dwelling ownership 1",null,-2.371859924236323E-2]
[null,null,"Dwelling ownership 2",null,1.4299371638091307E-2,null,null,"Dwelling ownership 2",null,1.2015643434160598E-2,null,null,"Dwelling ownership 2",null,4.1984944985678063E-2]
[null,null,"Dwelling ownership",null,1.312471667715932E-2,null,null,"Dwelling ownership",null,-1.6072320677176215E-2,null,null,"Dwelling ownership",null,2.3605644955012963E-2]
[null,null,"No rent paid",null,-1.3037053352671669E-2,null,null,"No rent paid",null,-1.8376775366152835E-2,null,null,"No rent paid",null,-6.7995058776740098E-3]
[null,null,"Has television",null,4.9560103948207715E-2,null,null,"Has television",null,4.459033699243279E-2,null,null,"Has television",null,6.299159905525234E-2]
[null,null,"Has refrigerator",null,5.3170801061704936E-2,null,null,"Has refrigerator",null,5.1475726113582712E-2,null,null,"Has refrigerator",null,6.1189275015557085E-2]
[null,null,"Has bicycle",null,4.5237580314936528E-2,null,null,"Has bicycle",null,4.6666159999216777E-2,null,null,"Has bicycle",null,5.824121710472923E-2]
[null,null,"Has motorcycle/scooter",null,-1.1162328659438593E-4,null,null,"Has motorcycle/scooter",null,-8.544033420753625E-4,null,null,"Has motorcycle/scooter",null,2.2576840042500532E-2]
[null,null,"Has car/truck",null,7.919645521811576E-2,null,null,"Has car/truck",null,9.1995286956297898E-2,null,null,"Has car/truck",null,9.2817527584175705E-2]
[null,null,"Separate kitchen",null,6.2430759214258745E-2,null,null,"Separate kitchen",null,4.8254861111435343E-2,null,null,"Separate kitchen",null,7.2013382272056656E-2]
[null,null,"Separate bathroom",null,7.0734610012974972E-2,null,null,"Separate bathroom",null,5.9578759208797058E-2,null,null,"Separate bathroom",null,8.0460711514236671E-2]
[null,null,"Gas or electric oven",null,8.3189816396142494E-2,null,null,"Gas or electric oven",null,8.0725639067622243E-2,null,null,"Gas or electric oven",null,9.4228297505116812E-2]
[null,null,"Microwave oven",null,4.618588493915942E-2,null,null,"Microwave oven",null,4.9316889409143978E-2,null,null,"Microwave oven",null,4.7982580569524452E-2]
[null,null,"Dishwasher",null,8.8618345333458748E-2,null,null,"Dishwasher",null,9.8797890368407984E-2,null,null,"Dishwasher",null,7.853027915802728E-2]
[null,null,"Blender/mixer",null,9.3767167985819633E-2,null,null,"Blender/mixer",null,9.7938982703047128E-2,null,null,"Blender/mixer",null,0.10080737851169616]
[null,null,"DVD/VCD player",null,7.2793643087721197E-2,null,null,"DVD/VCD player",null,7.175911399695227E-2,null,null,"DVD/VCD player",null,7.956539161493599E-2]
[null,null,"Washing machine",null,8.8151779326732252E-2,null,null,"Washing machine",null,8.2928761406852847E-2,null,null,"Washing machine",null,0.10178564106859067]
[null,null,"Video camera",null,4.6394698779392625E-2,null,null,"Video camera",null,5.6065145279745744E-2,null,null,"Video camera",null,3.2976542322999139E-2]
[null,null,"Iron",null,7.6427470004147943E-2,null,null,"Iron",null,6.9683049147575879E-2,null,null,"Iron",null,9.0102392214970739E-2]
[null,null,"Digiturk, CINE 5, satellite antenna etc.",null,3.9548069195176429E-2,null,null,"Digiturk, CINE 5, satellite antenna etc.",null,5.6273945621918904E-2,null,null,"Digiturk, CINE 5, satellite antenna etc.",null,5.6185645241226628E-2]
[null,null,"Vacuum cleaner",null,9.1955355506781217E-2,null,null,"Vacuum cleaner",null,8.6826016173929876E-2,null,null,"Vacuum cleaner",null,0.10699965670165837]
[null,null,"Television",null,9.2919646726079094E-2,null,null,"Television",null,0.10082785017834936,null,null,"Television",null,9.697695882569965E-2]
[null,null,"Video",null,5.0977400896346482E-2,null,null,"Video",null,5.8440757748788194E-2,null,null,"Video",null,4.834137788160936E-2]
[null,null,"Cable TV",null,5.0440646163718954E-2,null,null,"Cable TV",null,5.8976753455112593E-2,null,null,"Cable TV",null,1.2633702524278832E-2]
[null,null,"Camera",null,8.6315417463639965E-2,null,null,"Camera",null,9.2831697193882123E-2,null,null,"Camera",null,8.6847156706409342E-2]
[null,null,"CD player",null,6.7376523098788221E-2,null,null,"CD player",null,7.3090080147635753E-2,null,null,"CD player",null,5.8843311651371938E-2]
[null,null,"Computer",null,7.302718644956975E-2,null,null,"Computer",null,8.2898046598146841E-2,null,null,"Computer",null,6.0992179113014404E-2]
[null,null,"Internet",null,6.3826192923745292E-2,null,null,"Internet",null,7.4673594482994571E-2,null,null,"Internet",null,4.9777893724748695E-2]
[null,null,"Has car",null,7.9207138246126588E-2,null,null,"Has car",null,9.2046170280845288E-2,null,null,"Has car",null,9.2705754955413194E-2]
[null,null,"Taxi/minibus/commercial vehicles",null,1.3806694047851779E-2,null,null,"Taxi/minibus/commercial vehicles",null,1.8612370832186923E-2,null,null,"Taxi/minibus/commercial vehicles",null,2.3033978210310817E-2]
[null,null,"Has credit card",null,8.9133841781732934E-2,null,null,"Has credit card",null,9.4716140226491163E-2,null,null,"Has credit card",null,8.6259190687654738E-2]
[]
[]
[null,null,"Component Score Covariance Matrix",null,null,null,null,"Component Score Covariance Matrix",null,null,null,null,"Component Score Covariance Matrix"]
[null,null,"Component",null,"1",null,null,"Component",null,"1",null,null,"Component",null,"1"]
[null,null,"1",null,1.0000000000000002,null,null,"1",null,1,null,null,"1",null,1]
[]
[]
[]
[]
[]
[]
[]
[]
[]
[]
[]
[]
[]
[]
[]
[]
[]
[]
[]
[]
[]
[]
[]
[]
[]
[]
[]
[]
[]
[]
[]
[]
[]
[]
[]
[]
[]
[]
[]
[]
[]
[]
[]
[]
[]
[]
[]
[]
[]
[]
[]
[]
[]
[]
[]
[]
[]
[]
[]
[]
[]
[]
[]
[]
[]
[]
[]
[]
[]
[]
[]
[]
[]
[]
[]
[]
[]
[]
[]
[]
[]
[]
[]
[]
[]
[]
[]
[]
[]
[]
[]
[]
[]
[]
[]
[]
[]
[]
[]
[]
[]
[]
[]
[]
[]
[]
[]
[]
[]
[]
[]
[]
[]
[]
[]
[]
[]
[]
[]
[]
[]
[]
[]
[]
[]
[]
[]
[]
[]
[]
[]
[]
[]
[]
[]
[]
[]
[]
[]
[]
[]
[]
[]
[]
[]
[]
[]
[]
[]
[]
[]
[]
[]
[]
[]
[]
[]
[]
[]
[]
[]
[]
[]
[]
[]
[]
[]
[]
[]
[]
[]
[]
[]
[]
[]
[]
[]
[]
[]
[]
[]
[]
[]
[]
[]
[]
[]
[]
[]
[]
[]
[]
[]
[]
[]
[]
[]
[]
[]
[]
[]
[]
[]
[]
[]
[]
[]
[]
[]
[]
[]
[]
[]
[]
[]
[]
[]
[]
[]
[]
[]
[]
[]
[]
[]
[]
[]
[]
[]
[]
[]
[]
[]
[]
[]
[]
[]
[]
[]
[]
[]
[]
[]
[]
[]
[]
[]
[]
[]
[]
[]
[]
[]
[]
[]
[]
[]
[]
[]
[]
[]
[]
[]
[]
[]
[]
[]
[]
[]
[]
[]
[]
[]
[]
[]
[]
[]
[]
[]
[]
[]
[]
[]
[]
[]
[]
[]
[]
[]
[]
[]
[]
[]
[]
[]
[]
[]
[]
[]
[]
[]
[]
[]
[]
[]
[]
[]
[]
[]
[]
[]
[]
[]
[]
[]
[]
[]
[]
[]
[]
[]
[]
[]
[]
[]
[]
[]
[]
[]
[]
[]
[]
[]
[]
[]
[]
[]
[]
[]
[]
[]
[]
[]
[]
[]
[]
[]
[]
[]
[]
[]
[]
[]
[]
[]
[]
[]
[]
[]
[]
[]
[]
[]
[]
[]
[]
[]
[]
[]
[]
[]
[]
[]
[]
[]
[]
[]
[]
[]
[]
[]
[]
[]
[]
[]
[]
[]
[]
[]
[]
[]
[]
[]
[]
[]
[]
[]
[]
[]
[]
[]
[]
[]
[]
[]
[]
[]
[]
[]
[]
[]
[]
[]
[]
[]
[]
[]
[]
[]
[]
[]
[]
[]
[]
[]
[]
[]
[]
[]
[]
[]
[]
[]
[]
[]
[]
[]
[]
[]
[]
[]
[]
[]
[]
[]
[]
[]
[]
[]
[]
[]
[]
[]
[]
[]
[]
[]
[]
[]
[]
[]
[]
[]
[]
[]
[]
[]
[]
[]
[]
[]
[]
[]
[]
[]
[]
[]
[]
["DHS03"]
["Turkey",null,"Count"]
["W_text_t","",10836]
["W_text_i","",10836]
["S_text_s","",10836]
["S_text_i","",10836]
["Urban/Rural","Urban",7956]
[null,"Rural",2880]
[null,"Missing",0]
["2003"]
[]
["Sub-national region names","Weighted population"]
[{"$f":"R15","v":"Central"},{"$f":"BR122+BR123","v":9952.8114689998984}]
[{"$f":"S15","v":"East"},{"$f":"BS122+BS123","v":8925.1139870000079}]
[{"$f":"T15","v":"North"},{"$f":"BT122+BT123","v":3506.9483059999857}]
[{"$f":"U15","v":"South"},{"$f":"BU122+BU123","v":6030.2569140000014}]
[{"$f":"V15","v":"West"},{"$f":"BV122+BV123","v":17156.844591999728}]
[{"$f":"W15","v":0},{"$f":"BW122+BW123","v":0}]
[{"$f":"X15","v":0},{"$f":"BX122+XR123","v":0}]
[{"$f":"Y15","v":0},{"$f":"BY122+BY123","v":0}]
[{"$f":"Z15","v":0},{"$f":"BZ122+BZ123","v":0}]
[{"$f":"AA15","v":0},{"$f":"CA122+CA123","v":0}]
[{"$f":"AB15","v":0},{"$f":"CB122+CB123","v":0}]
[{"$f":"AC15","v":0},{"$f":"CC122+CC123","v":0}]
[{"$f":"AD15","v":0},{"$f":"CD122+CD123","v":0}]
[{"$f":"AE15","v":0},{"$f":"CE122+CE123","v":0}]
[{"$f":"AF15","v":0},{"$f":"CF122+CF123","v":0}]
[{"$f":"AG15","v":0},{"$f":"CG122+CG123","v":0}]
[{"$f":"AH15","v":0},{"$f":"CH122+CH123","v":0}]
[{"$f":"AI15","v":0},{"$f":"CI122+CI123","v":0}]
[{"$f":"AJ15","v":0},{"$f":"CJ122+CJ123","v":0}]
[{"$f":"AK15","v":0},{"$f":"CK122+CK123","v":0}]
[{"$f":"AL15","v":0},{"$f":"CL122+CL123","v":0}]
[{"$f":"AM15","v":0},{"$f":"CM122+CM123","v":0}]
[{"$f":"AN15","v":0},{"$f":"CN122+CN123","v":0}]
[{"$f":"AO15","v":0},{"$f":"CO122+CO123","v":0}]
[{"$f":"AP15","v":0},{"$f":"CP122+CP123","v":0}]
[{"$f":"AQ15","v":0},{"$f":"CQ122+CQ123","v":0}]
[{"$f":"AR15","v":0},{"$f":"CR122+CR123","v":0}]
[{"$f":"AS15","v":0},{"$f":"CS122+CS123","v":0}]
[{"$f":"AT15","v":0},{"$f":"CT122+CT123","v":0}]
[{"$f":"AU15","v":0},{"$f":"CU122+CU123","v":0}]
[{"$f":"AV15","v":0},{"$f":"CV122+CV123","v":0}]
[{"$f":"AW15","v":0},{"$f":"CW122+CW123","v":0}]
[{"$f":"AX15","v":0},{"$f":"CX122+CX123","v":0}]
[{"$f":"AY15","v":0},{"$f":"CY122+CY123","v":0}]
[]
[{"$f":"34-COUNTIF(A1037:A1071,\"0\")","v":5},"Sub-regions"]

{"sheet":"DHS08","index":5,"n_rows":1072,"n_cols":74,"rows_kept":1072,"cut":false,"hidden":false,"merged":[[346,52,347,52],[348,52,349,52],[350,52,351,52],[352,52,353,52],[152,52,157,52],[270,52,272,52],[273,52,275,52],[276,52,283,52],[338,54,338,58],[338,59,338,63],[338,64,338,68],[340,52,341,52],[342,52,343,52],[344,52,345,52],[221,52,223,52],[224,52,225,52],[226,52,229,52],[258,54,258,58],[258,59,258,63],[258,64,258,68],[260,52,262,52],[263,52,266,52],[267,52,269,52],[119,64,119,68],[121,52,122,52],[123,52,126,52],[127,52,128,52],[132,54,132,58],[132,59,132,63],[132,64,132,68],[134,52,138,52],[219,54,219,58],[219,59,219,63],[219,64,219,68],[13,64,13,68],[15,52,16,52],[17,52,20,52],[21,52,22,52],[26,54,26,58],[26,59,26,63],[26,64,26,68],[40,52,41,52],[55,54,55,58],[55,59,55,63],[55,64,55,68],[139,52,142,52],[143,0,146,0],[143,52,146,52],[147,0,149,0],[147,52,149,52],[150,0,151,0],[150,52,151,52],[13,54,13,58],[13,59,13,63],[119,54,119,58],[119,59,119,63],[42,52,43,52],[44,52,45,52],[46,0,48,0],[46,52,48,52],[49,0,51,0],[49,52,51,52],[52,0,54,0],[52,52,54,52],[32,52,33,52],[34,52,35,52],[36,52,37,52],[38,0,39,0],[38,52,39,52],[13,2,13,6],[13,7,13,11],[28,52,29,52],[30,0,31,0],[30,52,31,52],[26,2,26,6],[26,7,26,11],[26,12,26,16],[13,12,13,16],[15,0,16,0],[17,0,20,0],[21,0,22,0],[23,0,25,0],[32,0,33,0],[55,2,55,6],[55,7,55,11],[55,12,55,16],[28,0,29,0],[34,0,35,0],[36,0,37,0],[40,0,41,0],[42,0,43,0],[44,0,45,0],[139,0,142,0],[119,7,119,11],[119,12,119,16],[57,0,66,0],[107,0,107,1],[121,0,122,0],[123,0,126,0],[127,0,128,0],[129,0,131,0],[132,2,132,6],[119,2,119,6],[132,7,132,11],[132,12,132,16],[134,0,138,0],[152,0,156,0],[219,2,219,6],[219,7,219,11],[219,12,219,16],[221,0,223,0],[207,0,207,1],[1030,0,1032,0],[1033,0,1033,2],[398,2,398,5],[398,7,398,10],[398,12,398,15],[399,2,399,4],[399,7,399,9],[399,12,399,14],[400,2,401,3],[400,7,401,8],[400,12,401,13],[1024,0,1024,2],[1025,0,1025,1],[405,2,405,3],[405,7,405,8],[405,12,405,13],[406,2,406,3],[406,7,406,8],[406,12,406,13],[401,1,444,1],[402,2,402,3],[402,7,402,8],[402,12,402,13],[403,2,403,3],[403,7,403,8],[403,12,403,13],[404,2,404,3],[404,7,404,8],[404,12,404,13],[409,2,409,3],[409,7,409,8],[409,12,409,13],[410,2,410,3],[410,7,410,8],[410,12,410,13],[407,2,407,3],[407,7,407,8],[407,12,407,13],[408,2,408,3],[408,7,408,8],[408,12,408,13],[413,2,413,3],[413,7,413,8],[413,12,413,13],[414,2,414,3],[414,7,414,8],[414,12,414,13],[411,2,411,3],[411,7,411,8],[411,12,411,13],[412,2,412,3],[412,7,412,8],[412,12,412,13],[417,2,417,3],[417,7,417,8],[417,12,417,13],[418,2,418,3],[418,7,418,8],[418,12,418,13],[415,2,415,3],[415,7,415,8],[415,12,415,13],[416,2,416,3],[416,7,416,8],[416,12,416,13],[421,2,421,3],[421,7,421,8],[421,12,421,13],[422,2,422,3],[422,7,422,8],[422,12,422,13],[419,2,419,3],[419,7,419,8],[419,12,419,13],[420,2,420,3],[420,7,420,8],[420,12,420,13],[425,2,425,3],[425,7,425,8],[425,12,425,13],[426,2,426,3],[426,7,426,8],[426,12,426,13],[423,2,423,3],[423,7,423,8],[423,12,423,13],[424,2,424,3],[424,7,424,8],[424,12,424,13],[429,2,429,3],[429,7,429,8],[429,12,429,13],[430,2,430,3],[430,7,430,8],[430,12,430,13],[427,2,427,3],[427,7,427,8],[427,12,427,13],[428,2,428,3],[428,7,428,8],[428,12,428,13],[433,2,433,3],[433,7,433,8],[433,12,433,13],[434,2,434,3],[434,7,434,8],[434,12,434,13],[431,2,431,3],[431,7,431,8],[431,12,431,13],[432,2,432,3],[432,7,432,8],[432,12,432,13],[437,2,437,3],[437,7,437,8],[437,12,437,13],[438,2,438,3],[438,7,438,8],[438,12,438,13],[435,2,435,3],[435,7,435,8],[435,12,435,13],[436,2,436,3],[436,7,436,8],[436,12,436,13],[441,2,441,3],[441,7,441,8],[441,12,441,13],[442,2,442,3],[442,7,442,8],[442,12,442,13],[439,2,439,3],[439,7,439,8],[439,12,439,13],[440,2,440,3],[440,7,440,8],[440,12,440,13],[445,2,445,3],[445,7,445,8],[445,12,445,13],[446,2,446,3],[446,7,446,8],[446,12,446,13],[443,2,443,3],[443,7,443,8],[443,12,443,13],[444,2,444,3],[444,7,444,8],[444,12,444,13],[449,2,449,3],[449,7,449,8],[449,12,449,13],[450,2,450,4],[450,7,450,9],[450,12,450,14],[447,2,447,3],[447,7,447,8],[447,12,447,13],[448,2,448,3],[448,7,448,8],[448,12,448,13],[453,2,453,3],[453,7,453,8],[453,12,453,13],[454,2,454,3],[454,7,454,8],[454,12,454,13],[451,2,451,3],[451,7,451,8],[451,12,451,13],[452,2,452,3],[452,7,452,8],[452,12,452,13],[457,2,457,3],[457,7,457,8],[457,12,457,13],[458,2,458,3],[458,7,458,8],[458,12,458,13],[455,2,455,3],[455,7,455,8],[455,12,455,13],[456,2,456,3],[456,7,456,8],[456,12,456,13],[461,2,461,3],[461,7,461,8],[461,12,461,13],[462,2,462,3],[462,7,462,8],[462,12,462,13],[459,2,459,3],[459,7,459,8],[459,12,459,13],[460,2,460,3],[460,7,460,8],[460,12,460,13],[465,2,465,3],[465,7,465,8],[465,12,465,13],[466,2,466,3],[466,7,466,8],[466,12,466,13],[463,2,463,3],[463,7,463,8],[463,12,463,13],[464,2,464,3],[464,7,464,8],[464,12,464,13],[469,2,469,3],[469,7,469,8],[469,12,469,13],[470,2,470,3],[470,7,470,8],[470,12,470,13],[467,2,467,3],[467,7,467,8],[467,12,467,13],[468,2,468,3],[468,7,468,8],[468,12,468,13],[473,2,473,3],[473,7,473,8],[473,12,473,13],[474,2,474,3],[474,7,474,8],[474,12,474,13],[471,2,471,3],[471,7,471,8],[471,12,471,13],[472,2,472,3],[472,7,472,8],[472,12,472,13],[477,2,477,3],[477,7,477,8],[477,12,477,13],[478,2,478,3],[478,7,478,8],[478,12,478,13],[475,2,475,3],[475,7,475,8],[475,12,475,13],[476,2,476,3],[476,7,476,8],[476,12,476,13],[481,2,481,3],[481,7,481,8],[481,12,481,13],[482,2,482,3],[482,7,482,8],[482,12,482,13],[479,2,479,3],[479,7,479,8],[479,12,479,13],[480,2,480,3],[480,7,480,8],[480,12,480,13],[485,2,485,3],[485,7,485,8],[485,12,485,13],[486,2,486,3],[486,7,486,8],[486,12,486,13],[483,2,483,3],[483,7,483,8],[483,12,483,13],[484,2,484,3],[484,7,484,8],[484,12,484,13],[489,2,489,3],[489,7,489,8],[489,12,489,13],[490,2,490,3],[490,7,490,8],[490,12,490,13],[487,2,487,3],[487,7,487,8],[487,12,487,13],[488,2,488,3],[488,7,488,8],[488,12,488,13],[493,2,493,3],[493,7,493,8],[493,12,493,13],[494,2,494,3],[494,7,494,8],[494,12,494,13],[491,2,491,3],[491,7,491,8],[491,12,491,13],[492,2,492,3],[492,7,492,8],[492,12,492,13],[497,2,497,3],[497,7,497,8],[497,12,497,13],[498,2,498,3],[498,7,498,8],[498,12,498,13],[495,2,495,3],[495,7,495,8],[495,12,495,13],[496,2,496,3],[496,7,496,8],[496,12,496,13],[499,2,499,6],[499,7,499,11],[499,12,499,16],[500,2,501,3],[500,4,500,6],[500,7,501,8],[500,9,500,11],[500,12,501,13],[500,14,500,16],[504,2,504,3],[504,7,504,8],[504,12,504,13],[505,2,505,4],[505,7,505,9],[505,12,505,14],[502,2,502,3],[502,7,502,8],[502,12,502,13],[503,2,503,3],[503,7,503,8],[503,12,503,13],[509,2,509,3],[509,7,509,8],[509,12,509,13],[510,2,510,3],[510,7,510,8],[510,12,510,13],[506,2,507,3],[506,7,507,8],[506,12,507,13],[508,2,508,3],[508,7,508,8],[508,12,508,13],[513,2,513,3],[513,7,513,8],[513,12,513,13],[514,2,514,3],[514,7,514,8],[514,12,514,13],[511,2,511,3],[511,7,511,8],[511,12,511,13],[512,2,512,3],[512,7,512,8],[512,12,512,13],[517,2,517,3],[517,7,517,8],[517,12,517,13],[518,2,518,3],[518,7,518,8],[518,12,518,13],[515,2,515,3],[515,7,515,8],[515,12,515,13],[516,2,516,3],[516,7,516,8],[516,12,516,13],[521,2,521,3],[521,7,521,8],[521,12,521,13],[522,2,522,3],[522,7,522,8],[522,12,522,13],[519,2,519,3],[519,7,519,8],[519,12,519,13],[520,2,520,3],[520,7,520,8],[520,12,520,13],[525,2,525,3],[525,7,525,8],[525,12,525,13],[526,2,526,3],[526,7,526,8],[526,12,526,13],[523,2,523,3],[523,7,523,8],[523,12,523,13],[524,2,524,3],[524,7,524,8],[524,12,524,13],[529,2,529,3],[529,7,529,8],[529,12,529,13],[530,2,530,3],[530,7,530,8],[530,12,530,13],[527,2,527,3],[527,7,527,8],[527,12,527,13],[528,2,528,3],[528,7,528,8],[528,12,528,13],[533,2,533,3],[533,7,533,8],[533,12,533,13],[534,2,534,3],[534,7,534,8],[534,12,534,13],[531,2,531,3],[531,7,531,8],[531,12,531,13],[532,2,532,3],[532,7,532,8],[532,12,532,13],[537,2,537,3],[537,7,537,8],[537,12,537,13],[538,2,538,3],[538,7,538,8],[538,12,538,13],[535,2,535,3],[535,7,535,8],[535,12,535,13],[536,2,536,3],[536,7,536,8],[536,12,536,13],[541,2,541,3],[541,7,541,8],[541,12,541,13],[542,2,542,3],[542,7,542,8],[542,12,542,13],[539,2,539,3],[539,7,539,8],[539,12,539,13],[540,2,540,3],[540,7,540,8],[540,12,540,13],[545,2,545,3],[545,7,545,8],[545,12,545,13],[546,2,546,3],[546,7,546,8],[546,12,546,13],[543,2,543,3],[543,7,543,8],[543,12,543,13],[544,2,544,3],[544,7,544,8],[544,12,544,13],[549,2,549,3],[549,7,549,8],[549,12,549,13],[550,2,550,3],[550,7,550,8],[550,12,550,13],[547,2,547,3],[547,7,547,8],[547,12,547,13],[548,2,548,3],[548,7,548,8],[548,12,548,13],[553,2,553,3],[553,7,553,8],[553,12,553,13],[554,2,554,3],[554,7,554,8],[554,12,554,13],[551,2,551,3],[551,7,551,8],[551,12,551,13],[552,2,552,3],[552,7,552,8],[552,12,552,13],[557,2,557,3],[557,7,557,8],[557,12,557,13],[558,2,558,3],[558,7,558,8],[558,12,558,13],[555,2,555,4],[555,7,555,9],[555,12,555,14],[556,2,556,3],[556,7,556,8],[556,12,556,13],[561,2,561,3],[561,7,561,8],[561,12,561,13],[562,2,562,3],[562,7,562,8],[562,12,562,13],[559,2,559,3],[559,7,559,8],[559,12,559,13],[560,2,560,3],[560,7,560,8],[560,12,560,13],[565,2,565,3],[565,7,565,8],[565,12,565,13],[566,2,566,3],[566,7,566,8],[566,12,566,13],[563,2,563,3],[563,7,563,8],[563,12,563,13],[564,2,564,3],[564,7,564,8],[564,12,564,13],[569,2,569,3],[569,7,569,8],[569,12,569,13],[570,2,570,3],[570,7,570,8],[570,12,570,13],[567,2,567,3],[567,7,567,8],[567,12,567,13],[568,2,568,3],[568,7,568,8],[568,12,568,13],[573,2,573,3],[573,7,573,8],[573,12,573,13],[574,2,574,3],[574,7,574,8],[574,12,574,13],[571,2,571,3],[571,7,571,8],[571,12,571,13],[572,2,572,3],[572,7,572,8],[572,12,572,13],[577,2,577,3],[577,7,577,8],[577,12,577,13],[578,2,578,3],[578,7,578,8],[578,12,578,13],[575,2,575,3],[575,7,575,8],[575,12,575,13],[576,2,576,3],[576,7,576,8],[576,12,576,13],[581,2,581,3],[581,7,581,8],[581,12,581,13],[582,2,582,3],[582,7,582,8],[582,12,582,13],[579,2,579,3],[579,7,579,8],[579,12,579,13],[580,2,580,3],[580,7,580,8],[580,12,580,13],[585,2,585,3],[585,7,585,8],[585,12,585,13],[586,2,586,3],[586,7,586,8],[586,12,586,13],[583,2,583,3],[583,7,583,8],[583,12,583,13],[584,2,584,3],[584,7,584,8],[584,12,584,13],[589,2,589,3],[589,7,589,8],[589,12,589,13],[590,2,590,3],[590,7,590,8],[590,12,590,13],[587,2,587,3],[587,7,587,8],[587,12,587,13],[588,2,588,3],[588,7,588,8],[588,12,588,13],[593,2,593,3],[593,7,593,8],[593,12,593,13],[594,2,594,3],[594,7,594,8],[594,12,594,13],[591,2,591,3],[591,7,591,8],[591,12,591,13],[592,2,592,3],[592,7,592,8],[592,12,592,13],[597,2,597,3],[597,7,597,8],[597,12,597,13],[598,2,598,3],[598,7,598,8],[598,12,598,13],[595,2,595,3],[595,7,595,8],[595,12,595,13],[596,2,596,3],[596,7,596,8],[596,12,596,13],[601,2,601,3],[601,7,601,8],[601,12,601,13],[602,2,602,3],[602,7,602,8],[602,12,602,13],[599,2,599,3],[599,7,599,8],[599,12,599,13],[600,2,600,3],[600,7,600,8],[600,12,600,13],[605,2,605,3],[605,7,605,8],[605,12,605,13],[606,2,606,3],[606,7,606,8],[606,12,606,13],[603,2,603,3],[603,7,603,8],[603,12,603,13],[604,2,604,3],[604,7,604,8],[604,12,604,13],[609,2,609,3],[609,7,609,8],[609,12,609,13],[610,2,610,3],[610,7,610,8],[610,12,610,13],[607,2,607,3],[607,7,607,8],[607,12,607,13],[608,2,608,3],[608,7,608,8],[608,12,608,13],[613,2,613,3],[613,7,613,8],[613,12,613,13],[614,2,614,3],[614,7,614,8],[614,12,614,13],[611,2,611,3],[611,7,611,8],[611,12,611,13],[612,2,612,3],[612,7,612,8],[612,12,612,13],[617,2,617,3],[617,7,617,8],[617,12,617,13],[618,2,618,3],[618,7,618,8],[618,12,618,13],[615,2,615,3],[615,7,615,8],[615,12,615,13],[616,2,616,3],[616,7,616,8],[616,12,616,13],[621,2,621,3],[621,7,621,8],[621,12,621,13],[622,2,622,3],[622,7,622,8],[622,12,622,13],[619,2,619,3],[619,7,619,8],[619,12,619,13],[620,2,620,3],[620,7,620,8],[620,12,620,13],[625,2,625,3],[625,7,625,8],[625,12,625,13],[626,2,626,3],[626,7,626,8],[626,12,626,13],[623,2,623,3],[623,7,623,8],[623,12,623,13],[624,2,624,3],[624,7,624,8],[624,12,624,13],[629,2,629,3],[629,7,629,8],[629,12,629,13],[630,2,630,3],[630,7,630,8],[630,12,630,13],[627,2,627,3],[627,7,627,8],[627,12,627,13],[628,2,628,3],[628,7,628,8],[628,12,628,13],[633,2,633,3],[633,7,633,8],[633,12,633,13],[634,2,634,3],[634,7,634,8],[634,12,634,13],[631,2,631,3],[631,7,631,8],[631,12,631,13],[632,2,632,3],[632,7,632,8],[632,12,632,13],[637,2,637,3],[637,7,637,8],[637,12,637,13],[638,2,638,3],[638,7,638,8],[638,12,638,13],[635,2,635,3],[635,7,635,8],[635,12,635,13],[636,2,636,3],[636,7,636,8],[636,12,636,13],[641,2,641,3],[641,7,641,8],[641,12,641,13],[642,2,642,3],[642,7,642,8],[642,12,642,13],[639,2,639,3],[639,7,639,8],[639,12,639,13],[640,2,640,3],[640,7,640,8],[640,12,640,13],[645,2,645,3],[645,7,645,8],[645,12,645,13],[646,2,646,3],[646,7,646,8],[646,12,646,13],[643,2,643,3],[643,7,643,8],[643,12,643,13],[644,2,644,3],[644,7,644,8],[644,12,644,13],[649,2,649,3],[649,7,649,8],[649,12,649,13],[650,2,650,3],[650,7,650,8],[650,12,650,13],[647,2,647,3],[647,7,647,8],[647,12,647,13],[648,2,648,3],[648,7,648,8],[648,12,648,13],[653,2,653,3],[653,7,653,8],[653,12,653,13],[654,2,654,3],[654,7,654,8],[654,12,654,13],[651,2,651,3],[651,7,651,8],[651,12,651,13],[652,2,652,3],[652,7,652,8],[652,12,652,13],[657,2,657,3],[657,7,657,8],[657,12,657,13],[658,2,658,3],[658,7,658,8],[658,12,658,13],[655,2,655,3],[655,7,655,8],[655,12,655,13],[656,2,656,3],[656,7,656,8],[656,12,656,13],[661,2,661,3],[661,7,661,8],[661,12,661,13],[662,2,662,3],[662,7,662,8],[662,12,662,13],[659,2,659,3],[659,7,659,8],[659,12,659,13],[660,2,660,3],[660,7,660,8],[660,12,660,13],[665,2,665,3],[665,7,665,8],[665,12,665,13],[666,2,666,3],[666,7,666,8],[666,12,666,13],[663,2,663,3],[663,7,663,8],[663,12,663,13],[664,2,664,3],[664,7,664,8],[664,12,664,13],[669,2,669,3],[669,7,669,8],[669,12,669,13],[670,2,670,3],[670,7,670,8],[670,12,670,13],[667,2,667,3],[667,7,667,8],[667,12,667,13],[668,2,668,3],[668,7,668,8],[668,12,668,13],[673,2,673,3],[673,7,673,8],[673,12,673,13],[674,2,674,3],[674,7,674,8],[674,12,674,13],[671,2,671,3],[671,7,671,8],[671,12,671,13],[672,2,672,3],[672,7,672,8],[672,12,672,13],[677,2,677,3],[677,7,677,8],[677,12,677,13],[678,2,678,3],[678,7,678,8],[678,12,678,13],[675,2,675,3],[675,7,675,8],[675,12,675,13],[676,2,676,3],[676,7,676,8],[676,12,676,13],[681,2,681,3],[681,7,681,8],[681,12,681,13],[682,2,682,3],[682,7,682,8],[682,12,682,13],[679,2,679,3],[679,7,679,8],[679,12,679,13],[680,2,680,3],[680,7,680,8],[680,12,680,13],[685,2,685,3],[685,7,685,8],[685,12,685,13],[686,2,686,3],[686,7,686,8],[686,12,686,13],[683,2,683,3],[683,7,683,8],[683,12,683,13],[684,2,684,3],[684,7,684,8],[684,12,684,13],[689,2,689,3],[689,7,689,8],[689,12,689,13],[690,2,690,3],[690,7,690,8],[690,12,690,13],[687,2,687,3],[687,7,687,8],[687,12,687,13],[688,2,688,3],[688,7,688,8],[688,12,688,13],[693,2,693,3],[693,7,693,8],[693,12,693,13],[694,2,694,3],[694,7,694,8],[694,12,694,13],[691,2,691,3],[691,7,691,8],[691,12,691,13],[692,2,692,3]],"merged_total":1014,"flags":["merged_cut"]}
[]
[{"$f":"A1026","v":"Turkey"}]
[{"$f":"A1034","v":"2008"}]
["Use of drinking water sources"]
[" by wealth quintile and sub-national region"]
["Notes:"]
["WHO/UNICEF JMP customised wealth index excludes water,"]
[" sanitation and hygiene assets."]
["Survey used for analysis:",{"$f":"A1025","v":"DHS08"}]
["Improved wells + springs based on :","DHS13"]
[{"$f":"B1027","v":""}]
[]
[]
["Use of drinking water sources",null,"NATIONAL wealth index quintile",null,null,null,null,"URBAN wealth index quintile",null,null,null,null,"RURAL wealth index quintile",null,null,null,null,"SUB-REGIONS:",null,null,null,null,null,null,null,null,null,null,null,null,null,null,null,null,null,null,null,null,null,null,null,null,null,null,null,null,null,null,null,null,null,null,"Raw numbers of respondents:","Use of drinking water sources","NATIONAL wealth index quintile",null,null,null,null,"URBAN wealth index quintile",null,null,null,null,"RURAL wealth index quintile",null,null,null,null,"SUB-REGIONS:"]
["Weighted percentage (used in graphs)",null,"Poorest","Poor","Middle","Rich","Richest","Poorest","Poor","Middle","Rich","Richest","Poorest","Poor","Middle","Rich","Richest","Central","East","North","South","West",null,null,null,null,null,null,null,null,null,null,null,null,null,null,null,null,null,null,null,null,null,null,null,null,null,null,null,null,null,null,"Water data, raw numbers (weighted)",null,"Poorest","Poor","Middle","Rich","Richest","Poorest","Poor","Middle","Rich","Richest","Poorest","Poor","Middle","Rich","Richest","Central","East","North","South","West"]
["Water","Improved",{"$f":"C58+C59+C62+C65+C66+C63*'DHS13'!C25/100+('DHS08'!C60+'DHS08'!C61)*'DHS13'!C24/100","v":96.193546239082622},{"$f":"D58+D59+D62+D65+D66+D63*'DHS13'!D25/100+('DHS08'!D60+'DHS08'!D61)*'DHS13'!D24/100","v":96.61675918899634},{"$f":"E58+E59+E62+E65+E66+E63*'DHS13'!E25/100+('DHS08'!E60+'DHS08'!E61)*'DHS13'!E24/100","v":97.356203148540658},{"$f":"F58+F59+F62+F65+F66+F63*'DHS13'!F25/100+('DHS08'!F60+'DHS08'!F61)*'DHS13'!F24/100","v":97.443275166954521},{"$f":"G58+G59+G62+G65+G66+G63*'DHS13'!G25/100+('DHS08'!G60+'DHS08'!G61)*'DHS13'!G24/100","v":98.151526012040065},{"$f":"H58+H59+H62+H65+H66+H63*'DHS13'!H25/100+('DHS08'!H60+'DHS08'!H61)*'DHS13'!H24/100","v":98.426707187312701},{"$f":"I58+I59+I62+I65+I66+I63*'DHS13'!I25/100+('DHS08'!I60+'DHS08'!I61)*'DHS13'!I24/100","v":98.534531444495144},{"$f":"J58+J59+J62+J65+J66+J63*'DHS13'!J25/100+('DHS08'!J60+'DHS08'!J61)*'DHS13'!J24/100","v":98.110230445236851},{"$f":"K58+K59+K62+K65+K66+K63*'DHS13'!K25/100+('DHS08'!K60+'DHS08'!K61)*'DHS13'!K24/100","v":97.852935172074055},{"$f":"L58+L59+L62+L65+L66+L63*'DHS13'!L25/100+('DHS08'!L60+'DHS08'!L61)*'DHS13'!L24/100","v":98.658083677687912},{"$f":"M58+M59+M62+M65+M66+M63*'DHS13'!M25/100+('DHS08'!M60+'DHS08'!M61)*'DHS13'!M24/100","v":92.438265314492554},{"$f":"N58+N59+N62+N65+N66+N63*'DHS13'!N25/100+('DHS08'!N60+'DHS08'!N61)*'DHS13'!N24/100","v":93.004170408558139},{"$f":"O58+O59+O62+O65+O66+O63*'DHS13'!O25/100+('DHS08'!O60+'DHS08'!O61)*'DHS13'!O24/100","v":96.002367228772641},{"$f":"P58+P59+P62+P65+P66+P63*'DHS13'!P25/100+('DHS08'!P60+'DHS08'!P61)*'DHS13'!P24/100","v":93.746906118950648},{"$f":"Q58+Q59+Q62+Q65+Q66+Q63*'DHS13'!Q25/100+('DHS08'!Q60+'DHS08'!Q61)*'DHS13'!Q24/100","v":93.432092020593572},{"$f":"R58+R59+R62+R65+R66+R63*'DHS13'!R25/100+('DHS08'!R60+'DHS08'!R61)*'DHS13'!R24/100","v":95.331008443930571},{"$f":"S58+S59+S62+S65+S66+S63*'DHS13'!S25/100+('DHS08'!S60+'DHS08'!S61)*'DHS13'!S24/100","v":96.862873276790125},{"$f":"T58+T59+T62+T65+T66+T63*'DHS13'!T25/100+('DHS08'!T60+'DHS08'!T61)*'DHS13'!T24/100","v":99.157393956874913},{"$f":"U58+U59+U62+U65+U66+U63*'DHS13'!U25/100+('DHS08'!U60+'DHS08'!U61)*'DHS13'!U24/100","v":97.563413573590424},{"$f":"V58+V59+V62+V65+V66+V63*'DHS13'!V25/100+('DHS08'!V60+'DHS08'!V61)*'DHS13'!V24/100","v":97.657982512676938},null,null,null,null,null,null,null,null,null,null,null,null,null,null,null,null,null,null,null,null,null,null,null,null,null,null,null,null,null,null,"Water","Improved","N/A","N/A","N/A","N/A","N/A","N/A","N/A","N/A","N/A","N/A","N/A","N/A","N/A","N/A","N/A","N/A","N/A","N/A","N/A","N/A"]
[null,"Not Improved",{"$f":"100-C16","v":3.8064537609173783},{"$f":"100-D16","v":3.3832408110036596},2.6437968514593422,2.5567248330454788,1.8484739879599346,1.5732928126872991,1.4654685555048559,1.8897695547631486,2.147064827925945,1.3419163223120876,7.5617346855074459,6.9958295914418613,3.9976327712273587,6.2530938810493524,6.5679079794064279,4.6689915560694288,3.1371267232098745,0.84260604312508747,2.4365864264095762,2.3420174873230621,null,null,null,null,null,null,null,null,null,null,null,null,null,null,null,null,null,null,null,null,null,null,null,null,null,null,null,null,null,null,null,"Not Improved","N/A","N/A","N/A","N/A","N/A","N/A","N/A","N/A","N/A","N/A","N/A","N/A","N/A","N/A","N/A","N/A","N/A","N/A","N/A","N/A"]
["Water ladder","Basic",{"$f":"C16*'DHS13'!C23/100","v":94.768253769861715},{"$f":"D16*'DHS13'!D23/100","v":95.606380542708408},{"$f":"E16*'DHS13'!E23/100","v":95.986806199331767},{"$f":"F16*'DHS13'!F23/100","v":95.737664594865805},{"$f":"G16*'DHS13'!G23/100","v":97.622832994649471},{"$f":"H16*'DHS13'!H23/100","v":97.598237619114684},{"$f":"I16*'DHS13'!I23/100","v":97.432163234895071},{"$f":"J16*'DHS13'!J23/100","v":97.159455398832819},{"$f":"K16*'DHS13'!K23/100","v":96.188202544738303},{"$f":"L16*'DHS13'!L23/100","v":98.323223288962382},{"$f":"M16*'DHS13'!M23/100","v":89.828475687182561},{"$f":"N16*'DHS13'!N23/100","v":91.192550521558516},{"$f":"O16*'DHS13'!O23/100","v":94.964671847114062},{"$f":"P16*'DHS13'!P23/100","v":91.016676222993652},{"$f":"Q16*'DHS13'!Q23/100","v":91.594754258067184},{"$f":"R16*'DHS13'!R23/100","v":93.451284037815199},{"$f":"S16*'DHS13'!S23/100","v":95.828768134693419},{"$f":"T16*'DHS13'!T23/100","v":97.16339327464712},{"$f":"U16*'DHS13'!U23/100","v":97.088684482760598},{"$f":"V16*'DHS13'!V23/100","v":96.620441648331067},null,null,null,null,null,null,null,null,null,null,null,null,null,null,null,null,null,null,null,null,null,null,null,null,null,null,null,null,null,null,"Water ladder","Basic","N/A","N/A","N/A","N/A","N/A","N/A","N/A","N/A","N/A","N/A","N/A","N/A","N/A","N/A","N/A","N/A","N/A","N/A","N/A","N/A"]
[null,"Limited",{"$f":"C16*'DHS13'!C22/100","v":1.4252924692208901},{"$f":"D16*'DHS13'!D22/100","v":1.0103786462879609},{"$f":"E16*'DHS13'!E22/100","v":1.3693969492087883},{"$f":"F16*'DHS13'!F22/100","v":1.7056105720886878},{"$f":"G16*'DHS13'!G22/100","v":0.52869301739057495},{"$f":"H16*'DHS13'!H22/100","v":0.82846956819795037},{"$f":"I16*'DHS13'!I22/100","v":1.1023682096000973},{"$f":"J16*'DHS13'!J22/100","v":0.95077504640402555},{"$f":"K16*'DHS13'!K22/100","v":1.6647326273357586},{"$f":"L16*'DHS13'!L22/100","v":0.3348603887255569},{"$f":"M16*'DHS13'!M22/100","v":2.6097896273099725},{"$f":"N16*'DHS13'!N22/100","v":1.8116198869996185},{"$f":"O16*'DHS13'!O22/100","v":1.0376953816585861},{"$f":"P16*'DHS13'!P22/100","v":2.7302298959570055},{"$f":"Q16*'DHS13'!Q22/100","v":1.8373377625264409},{"$f":"R16*'DHS13'!R22/100","v":1.8797244061153029},{"$f":"S16*'DHS13'!S22/100","v":1.034105142096718},{"$f":"T16*'DHS13'!T22/100","v":1.9940006822277629},{"$f":"U16*'DHS13'!U22/100","v":0.47472909082981352},{"$f":"V16*'DHS13'!V22/100","v":1.0375408643457593},null,null,null,null,null,null,null,null,null,null,null,null,null,null,null,null,null,null,null,null,null,null,null,null,null,null,null,null,null,null,null,"Limited","N/A","N/A","N/A","N/A","N/A","N/A","N/A","N/A","N/A","N/A","N/A","N/A","N/A","N/A","N/A","N/A","N/A","N/A","N/A","N/A"]
[null,"Unimproved",{"$f":"100-C18-C19-C21","v":3.38010927708397},{"$f":"100-D18-D19-D21","v":2.7672187143548022},2.4343116001648495,2.2406242504397795,1.5599538440182652,1.1878771519495845,1.273748709630915,1.4538079656800624,1.6234289354648264,1.2880236390234829,6.9619720987082694,5.4874690892179192,3.9976327712273525,6.0270700911613568,6.3389670976767052,4.3009518740520267,2.8613935815668707,0.66110613627223047,2.1223496021546797,1.8767556296783723,null,null,null,null,null,null,null,null,null,null,null,null,null,null,null,null,null,null,null,null,null,null,null,null,null,null,null,null,null,null,null,"Unimproved","N/A","N/A","N/A","N/A","N/A","N/A","N/A","N/A","N/A","N/A","N/A","N/A","N/A","N/A","N/A","N/A","N/A","N/A","N/A","N/A"]
[null,"Surface water",{"$f":"C64","v":0.42634448383342433},0.61602209664882912,0.20948525129459594,0.31610058260572793,0.28852014394168896,0.38541566073778094,0.19171984587391624,0.43596158908309324,0.52363589246111242,5.3892683288578533E-2,0.59976258679919769,1.5083605022239461,0,0.22602378988798524,0.22894088172967023,0.36803968201747161,0.27573314164299212,0.18149990685288631,0.31423682425490851,0.46526185764480188,null,null,null,null,null,null,null,null,null,null,null,null,null,null,null,null,null,null,null,null,null,null,null,null,null,null,null,null,null,null,null,"Surface water","N/A","N/A","N/A","N/A","N/A","N/A","N/A","N/A","N/A","N/A","N/A","N/A","N/A","N/A","N/A","N/A","N/A","N/A","N/A","N/A"]
["Improved water point at more than 30 minutes","Yes","N/A","N/A","N/A","N/A","N/A","N/A","N/A","N/A","N/A","N/A","N/A","N/A","N/A","N/A","N/A","N/A","N/A","N/A","N/A","N/A",null,null,null,null,null,null,null,null,null,null,null,null,null,null,null,null,null,null,null,null,null,null,null,null,null,null,null,null,null,null,"Improved water point at more than 30 minutes","Yes","N/A","N/A","N/A","N/A","N/A","N/A","N/A","N/A","N/A","N/A","N/A","N/A","N/A","N/A","N/A","N/A","N/A","N/A","N/A","N/A"]
[null,"No","N/A","N/A","N/A","N/A","N/A","N/A","N/A","N/A","N/A","N/A","N/A","N/A","N/A","N/A","N/A","N/A","N/A","N/A","N/A","N/A",null,null,null,null,null,null,null,null,null,null,null,null,null,null,null,null,null,null,null,null,null,null,null,null,null,null,null,null,null,null,null,"No","N/A","N/A","N/A","N/A","N/A","N/A","N/A","N/A","N/A","N/A","N/A","N/A","N/A","N/A","N/A","N/A","N/A","N/A","N/A","N/A"]
["Manually calculated ratios","Improved wells"]
[null,"Improved springs"]
[null,"Other"]
[null,null,"NATIONAL wealth index quintile",null,null,null,null,"URBAN wealth index quintile",null,null,null,null,"RURAL wealth index quintile",null,null,null,null,"SUB-REGIONS:",null,null,null,null,null,null,null,null,null,null,null,null,null,null,null,null,null,null,null,null,null,null,null,null,null,null,null,null,null,null,null,null,null,null,"Raw numbers of respondents:","Use of drinking water sources","NATIONAL wealth index quintile",null,null,null,null,"URBAN wealth index quintile",null,null,null,null,"RURAL wealth index quintile",null,null,null,null,"SUB-REGIONS:"]
["Percentage based on weighted population",null,"Poorest","Poor","Middle","Rich","Richest","Poorest","Poor","Middle","Rich","Richest","Poorest","Poor","Middle","Rich","Richest","Central","East","North","South","West",null,null,null,null,null,null,null,null,null,null,null,null,null,null,null,null,null,null,null,null,null,null,null,null,null,null,null,null,null,null,"Water data, raw numbers (weighted)",null,"Poorest","Poor","Middle","Rich","Richest","Poorest","Poor","Middle","Rich","Richest","Poorest","Poor","Middle","Rich","Richest","Central","East","North","South","West"]
["Piped water","Yes",40.115850105511228,42.366547781077635,49.638019026677647,37.990818057533957,24.640311499184932,62.345094031643278,64.187296766855127,48.096297205918013,36.159619136337028,22.454796373534176,10.911626720041133,17.34046763035651,17.188596812393683,20.670600379643027,26.209642765275682,33.464333374833892,57.768093873009008,30.637106845542078,50.141065935473335,31.158798972920977,null,null,null,null,null,null,null,null,null,null,null,null,null,null,null,null,null,null,null,null,null,null,null,null,null,null,null,null,null,null,"Piped water","Yes","N/A","N/A","N/A","N/A","N/A","N/A","N/A","N/A","N/A","N/A","N/A","N/A","N/A","N/A","N/A","N/A","N/A","N/A","N/A","N/A"]
[null,"No",59.884149894488317,57.633452218922287,50.361980973322197,62.009181942465915,75.35968850081484,37.654905968356388,35.812703233144958,51.903702794082164,63.840380863662915,77.54520362646528,89.088373279959015,82.659532369643742,82.811403187606601,79.329399620357222,73.790357234724468,66.535666625166357,42.231906126990829,69.362893154458433,49.858934064526444,68.841201027078185,null,null,null,null,null,null,null,null,null,null,null,null,null,null,null,null,null,null,null,null,null,null,null,null,null,null,null,null,null,null,null,"No","N/A","N/A","N/A","N/A","N/A","N/A","N/A","N/A","N/A","N/A","N/A","N/A","N/A","N/A","N/A","N/A","N/A","N/A","N/A","N/A"]
["Piped water on premises","Yes",39.886894241735519,42.196983185831307,49.396926429946532,37.964983014119639,24.619624104255948,62.034935100157398,63.999173259280987,48.067860293953544,36.124044093555611,22.426337986426969,10.813968506662119,17.082795060208788,17.188596812393683,20.388613294398215,25.907202830042102,33.347122181030763,57.590489375298567,30.121385126303728,50.015711718150001,31.089191412907869,null,null,null,null,null,null,null,null,null,null,null,null,null,null,null,null,null,null,null,null,null,null,null,null,null,null,null,null,null,null,"Piped water on premises","Yes","N/A","N/A","N/A","N/A","N/A","N/A","N/A","N/A","N/A","N/A","N/A","N/A","N/A","N/A","N/A","N/A","N/A","N/A","N/A","N/A"]
[null,"No",60.113105758264027,57.803016814168608,50.603073570053311,62.03501698588024,75.380375895743839,37.965064899842268,36.00082674071912,51.932139706046634,63.875955906444339,77.573662013572502,89.186031493338035,82.917204939791461,82.811403187606601,79.611386705602044,74.092797169958047,66.652877818969458,42.409510624701277,69.87861487369679,49.984288281849778,68.910808587091282,null,null,null,null,null,null,null,null,null,null,null,null,null,null,null,null,null,null,null,null,null,null,null,null,null,null,null,null,null,null,null,"No","N/A","N/A","N/A","N/A","N/A","N/A","N/A","N/A","N/A","N/A","N/A","N/A","N/A","N/A","N/A","N/A","N/A","N/A","N/A","N/A"]
["Piped water into dwelling","Yes","N/A","N/A","N/A","N/A","N/A","N/A","N/A","N/A","N/A","N/A","N/A","N/A","N/A","N/A","N/A","N/A","N/A","N/A","N/A","N/A",null,null,null,null,null,null,null,null,null,null,null,null,null,null,null,null,null,null,null,null,null,null,null,null,null,null,null,null,null,null,"Piped water into dwelling","Yes","N/A","N/A","N/A","N/A","N/A","N/A","N/A","N/A","N/A","N/A","N/A","N/A","N/A","N/A","N/A","N/A","N/A","N/A","N/A","N/A"]
[null,"No","N/A","N/A","N/A","N/A","N/A","N/A","N/A","N/A","N/A","N/A","N/A","N/A","N/A","N/A","N/A","N/A","N/A","N/A","N/A","N/A",null,null,null,null,null,null,null,null,null,null,null,null,null,null,null,null,null,null,null,null,null,null,null,null,null,null,null,null,null,null,null,"No","N/A","N/A","N/A","N/A","N/A","N/A","N/A","N/A","N/A","N/A","N/A","N/A","N/A","N/A","N/A","N/A","N/A","N/A","N/A","N/A"]
["Water source on premises","Yes",90.344306936420423,91.589777850175196,90.349914305881995,91.290880837538694,93.986562724134728,93.984284126251865,92.203696629504933,92.7395179679976,92.418073465767591,95.092718696676044,84.000501276234843,88.222638020361003,90.162286345984356,85.703122298835083,85.853036605768892,83.742677136830295,93.527217110812856,93.757741419340945,94.964952679020399,93.167696180129468,null,null,null,null,null,null,null,null,null,null,null,null,null,null,null,null,null,null,null,null,null,null,null,null,null,null,null,null,null,null,"Water source on premises","Yes","N/A","N/A","N/A","N/A","N/A","N/A","N/A","N/A","N/A","N/A","N/A","N/A","N/A","N/A","N/A","N/A","N/A","N/A","N/A","N/A"]
[null,"No",9.6556930635795641,8.4102221498247811,9.6500856941179709,8.709119162461386,6.0134372758651766,6.0157158737481753,7.7963033704951377,7.260482032002284,7.581926534232422,4.9072813033238081,15.999498723765251,11.777361979639208,9.837713654015916,14.296877701165126,14.146963394231177,16.257322863169932,6.4727828891870747,6.2422585806592421,5.035047320979535,6.832303819870007,null,null,null,null,null,null,null,null,null,null,null,null,null,null,null,null,null,null,null,null,null,null,null,null,null,null,null,null,null,null,null,"No","N/A","N/A","N/A","N/A","N/A","N/A","N/A","N/A","N/A","N/A","N/A","N/A","N/A","N/A","N/A","N/A","N/A","N/A","N/A","N/A"]
["Improved Water source on premises","Yes","N/A","N/A","N/A","N/A","N/A","N/A","N/A","N/A","N/A","N/A","N/A","N/A","N/A","N/A","N/A","N/A","N/A","N/A","N/A","N/A",null,null,null,null,null,null,null,null,null,null,null,null,null,null,null,null,null,null,null,null,null,null,null,null,null,null,null,null,null,null,"Improved water source on premises","Yes","N/A","N/A","N/A","N/A","N/A","N/A","N/A","N/A","N/A","N/A","N/A","N/A","N/A","N/A","N/A","N/A","N/A","N/A","N/A","N/A"]
[null,"No","N/A","N/A","N/A","N/A","N/A","N/A","N/A","N/A","N/A","N/A","N/A","N/A","N/A","N/A","N/A","N/A","N/A","N/A","N/A","N/A",null,null,null,null,null,null,null,null,null,null,null,null,null,null,null,null,null,null,null,null,null,null,null,null,null,null,null,null,null,null,null,"No","N/A","N/A","N/A","N/A","N/A","N/A","N/A","N/A","N/A","N/A","N/A","N/A","N/A","N/A","N/A","N/A","N/A","N/A","N/A","N/A"]
["Piped water on premises available when needed","Yes","N/A","N/A","N/A","N/A","N/A","N/A","N/A","N/A","N/A","N/A","N/A","N/A","N/A","N/A","N/A","N/A","N/A","N/A","N/A","N/A",null,null,null,null,null,null,null,null,null,null,null,null,null,null,null,null,null,null,null,null,null,null,null,null,null,null,null,null,null,null,"Piped water on premises available when needed","Yes","N/A","N/A","N/A","N/A","N/A","N/A","N/A","N/A","N/A","N/A","N/A","N/A","N/A","N/A","N/A","N/A","N/A","N/A","N/A","N/A"]
[null,"No","N/A","N/A","N/A","N/A","N/A","N/A","N/A","N/A","N/A","N/A","N/A","N/A","N/A","N/A","N/A","N/A","N/A","N/A","N/A","N/A",null,null,null,null,null,null,null,null,null,null,null,null,null,null,null,null,null,null,null,null,null,null,null,null,null,null,null,null,null,null,null,"No","N/A","N/A","N/A","N/A","N/A","N/A","N/A","N/A","N/A","N/A","N/A","N/A","N/A","N/A","N/A","N/A","N/A","N/A","N/A","N/A"]
["Water point at more than 30 minutes","Yes",1.9441747253257233,1.8532117899576033,2.9680020384002255,2.3137064761566104,1.8666087401123659,1.798352540866234,2.8130135424676497,2.1833986928894924,2.5239580042341441,2.1330168497368454,4.1642190802300085,0.45559375952336612,1.9641233457191247,1.1949645329859993,1.7402247468083554,3.6182493159915485,1.5656282506887367,2.3607602052261858,1.6783390694939913,1.8860232055615977,null,null,null,null,null,null,null,null,null,null,null,null,null,null,null,null,null,null,null,null,null,null,null,null,null,null,null,null,null,null,"Water point at more than 30 minutes","Yes","N/A","N/A","N/A","N/A","N/A","N/A","N/A","N/A","N/A","N/A","N/A","N/A","N/A","N/A","N/A","N/A","N/A","N/A","N/A","N/A"]
[null,"No",98.055825274674262,98.146788210042416,97.031997961599757,97.686293523843489,98.133391259887517,98.201647459133824,97.18698645753237,97.81660130711046,97.476041995765897,97.866983150263096,95.835780919770073,99.544406240476647,98.035876654280941,98.805035467014022,98.25977525319162,96.381750684008523,98.434371749311225,97.639239794773829,98.321660930505956,98.113976794438173,null,null,null,null,null,null,null,null,null,null,null,null,null,null,null,null,null,null,null,null,null,null,null,null,null,null,null,null,null,null,null,"No","N/A","N/A","N/A","N/A","N/A","N/A","N/A","N/A","N/A","N/A","N/A","N/A","N/A","N/A","N/A","N/A","N/A","N/A","N/A","N/A"]
["Water source available when needed","Yes","N/A","N/A","N/A","N/A","N/A","N/A","N/A","N/A","N/A","N/A","N/A","N/A","N/A","N/A","N/A","N/A","N/A","N/A","N/A","N/A",null,null,null,null,null,null,null,null,null,null,null,null,null,null,null,null,null,null,null,null,null,null,null,null,null,null,null,null,null,null,"Water source available when needed","Yes","N/A","N/A","N/A","N/A","N/A","N/A","N/A","N/A","N/A","N/A","N/A","N/A","N/A","N/A","N/A","N/A","N/A","N/A","N/A","N/A"]
[null,"No","N/A","N/A","N/A","N/A","N/A","N/A","N/A","N/A","N/A","N/A","N/A","N/A","N/A","N/A","N/A","N/A","N/A","N/A","N/A","N/A",null,null,null,null,null,null,null,null,null,null,null,null,null,null,null,null,null,null,null,null,null,null,null,null,null,null,null,null,null,null,null,"No","N/A","N/A","N/A","N/A","N/A","N/A","N/A","N/A","N/A","N/A","N/A","N/A","N/A","N/A","N/A","N/A","N/A","N/A","N/A","N/A"]
["Improved water source available when needed","Yes","N/A","N/A","N/A","N/A","N/A","N/A","N/A","N/A","N/A","N/A","N/A","N/A","N/A","N/A","N/A","N/A","N/A","N/A","N/A","N/A",null,null,null,null,null,null,null,null,null,null,null,null,null,null,null,null,null,null,null,null,null,null,null,null,null,null,null,null,null,null,"Improved water source available when needed","Yes","N/A","N/A","N/A","N/A","N/A","N/A","N/A","N/A","N/A","N/A","N/A","N/A","N/A","N/A","N/A","N/A","N/A","N/A","N/A","N/A"]
[null,"No","N/A","N/A","N/A","N/A","N/A","N/A","N/A","N/A","N/A","N/A","N/A","N/A","N/A","N/A","N/A","N/A","N/A","N/A","N/A","N/A",null,null,null,null,null,null,null,null,null,null,null,null,null,null,null,null,null,null,null,null,null,null,null,null,null,null,null,null,null,null,null,"No","N/A","N/A","N/A","N/A","N/A","N/A","N/A","N/A","N/A","N/A","N/A","N/A","N/A","N/A","N/A","N/A","N/A","N/A","N/A","N/A"]
["Microbiological quality at point of collection","Not contaminated (No E. coli in 100 mL)","N/A","N/A","N/A","N/A","N/A","N/A","N/A","N/A","N/A","N/A","N/A","N/A","N/A","N/A","N/A","N/A","N/A","N/A","N/A","N/A",null,null,null,null,null,null,null,null,null,null,null,null,null,null,null,null,null,null,null,null,null,null,null,null,null,null,null,null,null,null,"Microbiological quality at point of collection","Not contaminated (No E. coli in 100 mL)","N/A","N/A","N/A","N/A","N/A","N/A","N/A","N/A","N/A","N/A","N/A","N/A","N/A","N/A","N/A","N/A","N/A","N/A","N/A","N/A"]
[null,"Contaminated (E. coli detected in 100 mL)","N/A","N/A","N/A","N/A","N/A","N/A","N/A","N/A","N/A","N/A","N/A","N/A","N/A","N/A","N/A","N/A","N/A","N/A","N/A","N/A",null,null,null,null,null,null,null,null,null,null,null,null,null,null,null,null,null,null,null,null,null,null,null,null,null,null,null,null,null,null,null,"Contaminated (E. coli detected in 100 mL)","N/A","N/A","N/A","N/A","N/A","N/A","N/A","N/A","N/A","N/A","N/A","N/A","N/A","N/A","N/A","N/A","N/A","N/A","N/A","N/A"]
[null,"Highly contaminated (>100 CFU/100 mL)","N/A","N/A","N/A","N/A","N/A","N/A","N/A","N/A","N/A","N/A","N/A","N/A","N/A","N/A","N/A","N/A","N/A","N/A","N/A","N/A",null,null,null,null,null,null,null,null,null,null,null,null,null,null,null,null,null,null,null,null,null,null,null,null,null,null,null,null,null,null,null,"Highly contaminated (>100 CFU/100 mL)","N/A","N/A","N/A","N/A","N/A","N/A","N/A","N/A","N/A","N/A","N/A","N/A","N/A","N/A","N/A","N/A","N/A","N/A","N/A","N/A"]
["Microbiological quality of improved water sources at point of collection","Not contaminated (No E. coli in 100 mL)","N/A","N/A","N/A","N/A","N/A","N/A","N/A","N/A","N/A","N/A","N/A","N/A","N/A","N/A","N/A","N/A","N/A","N/A","N/A","N/A",null,null,null,null,null,null,null,null,null,null,null,null,null,null,null,null,null,null,null,null,null,null,null,null,null,null,null,null,null,null,"Microbiological quality of improved water sources at point of collection","Not contaminated (No E. coli in 100 mL)","N/A","N/A","N/A","N/A","N/A","N/A","N/A","N/A","N/A","N/A","N/A","N/A","N/A","N/A","N/A","N/A","N/A","N/A","N/A","N/A"]
[null,"Contaminated (E. coli detected in 100 mL)","N/A","N/A","N/A","N/A","N/A","N/A","N/A","N/A","N/A","N/A","N/A","N/A","N/A","N/A","N/A","N/A","N/A","N/A","N/A","N/A",null,null,null,null,null,null,null,null,null,null,null,null,null,null,null,null,null,null,null,null,null,null,null,null,null,null,null,null,null,null,null,"Contaminated (E. coli detected in 100 mL)","N/A","N/A","N/A","N/A","N/A","N/A","N/A","N/A","N/A","N/A","N/A","N/A","N/A","N/A","N/A","N/A","N/A","N/A","N/A","N/A"]
[null,"Highly contaminated (>100 CFU/100 mL)","N/A","N/A","N/A","N/A","N/A","N/A","N/A","N/A","N/A","N/A","N/A","N/A","N/A","N/A","N/A","N/A","N/A","N/A","N/A","N/A",null,null,null,null,null,null,null,null,null,null,null,null,null,null,null,null,null,null,null,null,null,null,null,null,null,null,null,null,null,null,null,"Highly contaminated (>100 CFU/100 mL)","N/A","N/A","N/A","N/A","N/A","N/A","N/A","N/A","N/A","N/A","N/A","N/A","N/A","N/A","N/A","N/A","N/A","N/A","N/A","N/A"]
["Microbiological quality of piped on premises at point of collection","Not contaminated (No E. coli in 100 mL)","N/A","N/A","N/A","N/A","N/A","N/A","N/A","N/A","N/A","N/A","N/A","N/A","N/A","N/A","N/A","N/A","N/A","N/A","N/A","N/A",null,null,null,null,null,null,null,null,null,null,null,null,null,null,null,null,null,null,null,null,null,null,null,null,null,null,null,null,null,null,"Microbiological quality of piped on premises at point of collection","Not contaminated (No E. coli in 100 mL)","N/A","N/A","N/A","N/A","N/A","N/A","N/A","N/A","N/A","N/A","N/A","N/A","N/A","N/A","N/A","N/A","N/A","N/A","N/A","N/A"]
[null,"Contaminated (E. coli detected in 100 mL)","N/A","N/A","N/A","N/A","N/A","N/A","N/A","N/A","N/A","N/A","N/A","N/A","N/A","N/A","N/A","N/A","N/A","N/A","N/A","N/A",null,null,null,null,null,null,null,null,null,null,null,null,null,null,null,null,null,null,null,null,null,null,null,null,null,null,null,null,null,null,null,"Contaminated (E. coli detected in 100 mL)","N/A","N/A","N/A","N/A","N/A","N/A","N/A","N/A","N/A","N/A","N/A","N/A","N/A","N/A","N/A","N/A","N/A","N/A","N/A","N/A"]
[null,"Highly contaminated (>100 CFU/100 mL)","N/A","N/A","N/A","N/A","N/A","N/A","N/A","N/A","N/A","N/A","N/A","N/A","N/A","N/A","N/A","N/A","N/A","N/A","N/A","N/A",null,null,null,null,null,null,null,null,null,null,null,null,null,null,null,null,null,null,null,null,null,null,null,null,null,null,null,null,null,null,null,"Highly contaminated (>100 CFU/100 mL)","N/A","N/A","N/A","N/A","N/A","N/A","N/A","N/A","N/A","N/A","N/A","N/A","N/A","N/A","N/A","N/A","N/A","N/A","N/A","N/A"]
[null,null,"NATIONAL wealth index quintile",null,null,null,null,"URBAN wealth index quintile",null,null,null,null,"RURAL wealth index quintile",null,null,null,null,"SUB-REGIONS:",null,null,null,null,null,null,null,null,null,null,null,null,null,null,null,null,null,null,null,null,null,null,null,null,null,null,null,null,null,null,null,null,null,null,"Raw numbers of respondents:","Use of drinking water sources","NATIONAL wealth index quintile",null,null,null,null,"URBAN wealth index quintile",null,null,null,null,"RURAL wealth index quintile",null,null,null,null,"SUB-REGIONS:"]
["Percentage based on weighted population",null,"Poorest","Poor","Middle","Rich","Richest","Poorest","Poor","Middle","Rich","Richest","Poorest","Poor","Middle","Rich","Richest","Central","East","North","South","West",null,null,null,null,null,null,null,null,null,null,null,null,null,null,null,null,null,null,null,null,null,null,null,null,null,null,null,null,null,null,"Water data, raw numbers (weighted)",null,"Poorest","Poor","Middle","Rich","Richest","Poorest","Poor","Middle","Rich","Richest","Poorest","Poor","Middle","Rich","Richest","Central","East","North","South","West"]
["Source of drinking water","Piped into residence",39.906112561725159,42.258373587769405,49.407127912966097,37.964983014119639,24.637286408397479,62.045535730975864,64.022855985728029,48.081496921989462,36.124044093555611,22.448476366221001,10.817783140396001,17.106938579169157,17.206805328220383,20.446269132767014,25.907202830042102,33.353659628623625,57.606946410628289,30.121385126303728,50.151574470354085,31.100059426902043]
[null,"Public tap",0.22906617938531942,0.1698112867837489,0.24114238731951679,2.5835043414318068E-2,2.0702236222239642E-2,0.3102119319496015,0.18819312218540454,2.8444979383914295E-2,3.5575042781419125E-2,2.8486480083533893E-2,9.7692662371065123E-2,0.2580367448955323,0,0.2827845010167554,0.30243993523358198,0.11723417215887329,0.17765524990103818,0.51572171923835108,0.12569472970196341,6.9631893098073827E-2]
[null,"Well in residence",5.4237142610894153,4.8695571751595512,1.0146760478437127,0.98052973930807119,0.29720506743086061,0.83506572374004695,0.48188418247024506,0.34581233999880712,0.23102644571901734,0.24559391883052475,10.341185954796542,9.161281398861604,10.028446635798014,7.3526459641229174,3.5150304314675611,1.762605891930795,6.2227301699481359,3.6677224766175187,2.249933299579109,1.0924229922890316]
[null,"Public well",2.0127561992777041,0.98250954313716299,0.53014927956584357,8.7860258933799174E-2,0.11314698539247665,1.1322326705502097,0.44510831590138633,0.22215151117627313,0,2.9617292436777361E-2,4.1880032528541751,1.2187310732643377,2.0586999710650344,0.65167617781414855,0.65726983827231567,0.30281180344864328,1.7968550854882743,0.2187260660370601,0.77232375870516723,0.56919111651266419]
[null,"Piped surface water in house/garden",34.14522636943655,28.356937373630704,12.975705088388196,5.3874696136928986,3.8478479037607585,7.1813579834235073,4.7099096040598374,2.8187826012725448,1.2653191247186044,0.81497312494795038,59.903477923348738,56.509342390399262,59.223009818550295,52.109653684162019,37.800012288225624,15.651531645872286,25.239024609055928,41.664499515822797,28.101790726484676,6.3477168059536861]
[null,"Spring/public fountain",6.4742402989468015,5.033214422683467,6.3412669022381687,6.2450773934513144,4.173956368622008,3.6458217128729915,5.8627045327055791,4.872470434664443,5.8362493793879855,3.5438637306655183,11.174712415531509,7.8988202439828186,5.6778312161425877,8.3407363147301581,7.1805034271033907,11.754080254220661,4.0579363160336408,4.3885912573611288,3.0770655279872852,4.2357485687267085]
[null,"River/stream/pond/lake/dam",0.42634448383342433,0.61602209664882912,0.20948525129459594,0.31610058260572793,0.28852014394168896,0.38541566073778094,0.19171984587391624,0.43596158908309324,0.52363589246111242,5.3892683288578533E-2,0.59976258679919769,1.5083605022239461,0,0.22602378988798524,0.22894088172967023,0.36803968201747161,0.27573314164299212,0.18149990685288631,0.31423682425490851,0.46526185764480188]
[null,"Tanker truck",0.23659344445175032,0.16003132083093932,0.39864970668495314,0.1528501686763325,3.8958063981854321E-2,0.14970346511882382,0.16035228488434017,0.33141101471516171,8.5613319530410154E-2,5.3606678128807109E-2,0.52458066330369157,0,0.30132022025594896,0.3042253755239176,0.40536269208439957,0.36730221176965999,0.33237664216975837,0.84353102742685682,0,0]
[null,"Bottled water",9.4461259877325148,15.618669950057765,26.721329719029001,46.865684605553582,65.196705672123414,23.561774332480052,22.962675020767726,41.477068404871396,54.733415507912717,71.574422848424192,0.17637529328536561,3.3362211895316345,2.421287216123488,5.6307119656187874,17.99648748221961,32.772733458159273,2.9735258690516861,17.909217105894832,13.981160581462779,54.532083308451227]
[null,"Other",1.699820214121029,1.9348732432983475,2.16046770466976,1.9736095802441882,1.3856711501268377,0.75288078815076731,0.97459710542351796,1.3864002028451359,1.1651211939330604,1.2070668769724551,2.1764261073137097,3.0022678776719278,3.0825995938444986,4.6552730943565317,6.0067501936218921,3.5500012517987956,1.3172165060803398,0.48910579844580226,1.2262200814700155,1.5878840304211779]
[]
[]
[]
[]
[]
[]
[]
[]
[]
[]
[]
[]
[]
[]
[]
[]
[]
[]
[]
[]
[]
[]
[]
[]
[]
[]
[]
[]
[]
[]
[]
[]
[]
[]
[]
[]
[]
[]
[]
[]
[{"$f":"A1026","v":"Turkey"}]
[{"$f":"A1034","v":"2008"}]
["Use of sanitation facilities"]
[" by wealth quintile and sub-national region"]
["Notes:"]
["WHO/UNICEF JMP customised wealth index excludes water,"]
[" sanitation and hygiene assets."]
["Survey used for analysis:",{"$f":"A1025","v":"DHS08"}]
[{"$f":"B1030","v":""}]
[{"$f":"B1029","v":""}]
[]
[]
["Use of sanitation facilities",null,"NATIONAL wealth index quintile",null,null,null,null,"URBAN wealth index quintile",null,null,null,null,"RURAL wealth index quintile",null,null,null,null,"SUB-REGIONS:",null,null,null,null,null,null,null,null,null,null,null,null,null,null,null,null,null,null,null,null,null,null,null,null,null,null,null,null,null,null,null,null,null,null,"Raw numbers of respondents:","Use of sanitation facilities","NATIONAL wealth index quintile",null,null,null,null,"URBAN wealth index quintile",null,null,null,null,"RURAL wealth index quintile",null,null,null,null,"SUB-REGIONS:"]
["Weighted percentage (used in graphs)",null,"Poorest","Poor","Middle","Rich","Richest","Poorest","Poor","Middle","Rich","Richest","Poorest","Poor","Middle","Rich","Richest","Central","East","North","South","West",null,null,null,null,null,null,null,null,null,null,null,null,null,null,null,null,null,null,null,null,null,null,null,null,null,null,null,null,null,null,"Sanitation data, raw numbers (weighted)",null,"Poorest","Poor","Middle","Rich","Richest","Poorest","Poor","Middle","Rich","Richest","Poorest","Poor","Middle","Rich","Richest","Central","East","North","South","West"]
["Sanitation","Improved",{"$f":"C153+C155","v":82.866603521051672},{"$f":"D153+D155","v":88.839221074713265},96.993495490939665,99.694150185250692,99.763268513480853,97.357736310784531,98.820246726023214,99.487952002145789,99.978005756094404,99.91800140275906,62.303646614936326,77.210213616184419,74.652726592411767,86.056922434500848,94.909635715746418,97.077029461163491,80.581709055669492,85.599321002933223,97.368609195603653,98.067529763171777,null,null,null,null,null,null,null,null,null,null,null,null,null,null,null,null,null,null,null,null,null,null,null,null,null,null,null,null,null,null,"Sanitation","Improved",8189.9049820000291,8347.9229020000093,8359.6299590000144,8414.66986000002,8412.7003930000337,6091.8484010000293,6103.941690000006,6120.3443079999961,6123.0565859999961,6112.508466000023,2131.6974140000002,2255.6338889999961,2256.4433899999926,2265.083297999995,2264.2706539999963,8815.4193539999669,7692.5226809999958,2825.2637049999726,5160.7424470000014,17230.879909000087]
[null,"Not Improved",{"$f":"100-C122","v":17.133396478948328},{"$f":"100-D122","v":11.160778925286735},3.0065045090603348,0.30584981474930828,0.23673148651914744,2.6422636892154685,1.179753273976786,0.51204799785421073,2.1994243905595567E-2,8.199859724093983E-2,37.696353385063674,22.789786383815581,25.347273407588233,13.943077565499152,5.0903642842535817,2.922970538836509,19.418290944330508,14.400678997066777,2.6313908043963465,1.9324702368282232,null,null,null,null,null,null,null,null,null,null,null,null,null,null,null,null,null,null,null,null,null,null,null,null,null,null,null,null,null,null,null,"Not Improved",235.3917900000001,74.935642999999999,57.742982000000012,16.823616000000001,10.902511000000001,30.001745,15.727855,7.6909799999999997,0,10.902511000000001,169.62054200000003,44.340064999999996,44.140912,37.163981999999997,36.207949999999997,51.761043000000008,231.53959300000008,44.379640999999999,18.213744999999999,49.902519999999996]
["Sanitation ladder","Basic",{"$f":"C122*C129/100","v":80.177401044417635},{"$f":"D122*D129/100","v":86.621840704322693},{"$f":"E122*E129/100","v":96.367098707445209},99.231884129154594,99.727363869102049,95.76860982225557,98.41854629480757,99.234921675801559,99.903957854430416,99.868490578963389,58.029373381960987,75.030756138769547,69.546206727796459,84.964352502391833,93.635408311902452,95.938404834770722,77.815500376994947,85.21714348429488,95.286508275372398,97.611571763954714,null,null,null,null,null,null,null,null,null,null,null,null,null,null,null,null,null,null,null,null,null,null,null,null,null,null,null,null,null,null,"Sanitation ladder","Basic",7832.8444360000276,8089.3751810000103,8271.4557810000151,8355.6320590000196,8386.6030260000352,5939.7845790000256,6061.5248730000067,6101.5793189999958,6110.5960279999963,6090.4686240000237,1961.5063970000006,2166.9890049999972,2086.7043039999971,2207.0772149999962,2209.6801389999955,8685.772228999971,7331.7803639999929,2783.5047979999722,5000.4498619999977,17134.403230000076]
[null,"Limited",{"$f":"C122*C128/100","v":2.6892024766340459},{"$f":"D122*D128/100","v":2.2173803703905768},{"$f":"E122*E128/100","v":0.62639678349444072},0.46226605609610294,3.5904644378804043E-2,1.5891264885289444,0.40170043121564264,0.25303032634423966,7.4047901663995011E-2,4.9510823795684299E-2,4.2742732329753581,2.1794574774149118,5.1065198646154428,1.0925699321090436,1.2742274038439609,1.1386246263928328,2.7662086786745688,0.38217751863832861,2.0821009202311989,0.45595799921701058,null,null,null,null,null,null,null,null,null,null,null,null,null,null,null,null,null,null,null,null,null,null,null,null,null,null,null,null,null,null,null,"Limited",262.71872600000012,207.07504700000004,53.76537600000001,38.924233999999998,3.019412,98.561199000000002,24.740430000000003,15.557875999999997,4.5291180000000004,3.019412,144.478801,62.945658999999992,153.218953,28.381152,30.070194999999998,103.08524700000001,260.63232099999999,12.483321,109.26458999999994,80.037315999999976]
[null,"Unimproved",{"$f":"100-C124-C125-C127","v":15.602372223807208},{"$f":"100-D124-D125-D127","v":10.837547808994062},{"$f":"100-E124-E125-E127","v":3.0006187389220229},0.28718242584299647,0.21669226265849503,2.4719027802395748,1.1501706449364162,0.48641160520552129,2.199424390558867E-2,5.4421724708954018E-2,32.437188456080825,22.620949173823398,24.496143029385486,13.943077565499124,5.090364284253587,2.9081330249545729,17.641223459001427,14.329558629188794,2.4731387835364469,1.886878684517773,null,null,null,null,null,null,null,null,null,null,null,null,null,null,null,null,null,null,null,null,null,null,null,null,null,null,null,null,null,null,null,"Unimproved",107.842849,47.876719000000001,57.249580000000009,15.253431000000001,9.2191109999999998,19.663652999999996,13.922725000000002,6.1207949999999993,0,9.2191109999999998,49.942682999999995,40.500242999999998,24.700547999999998,37.163981999999997,36.207949999999997,50.449315000000006,92.502680999999981,42.359561000000006,10.098695000000001,42.031437999999994]
[null,"Open defecation",1.5310242551411117,0.32323111629266782,5.8857701383279058E-3,1.8667388906306932E-2,2.0039223860651528E-2,0.17036090897591055,2.9582629040371632E-2,2.5636392648680319E-2,0,2.7576872531972906E-2,5.2591649289828268,0.1688372099921446,0.85113037820261261,0,0,1.483751388187237E-2,1.7770674853290573,7.1120367877996901E-2,0.15825202085995588,4.559155231050227E-2,null,null,null,null,null,null,null,null,null,null,null,null,null,null,null,null,null,null,null,null,null,null,null,null,null,null,null,null,null,null,null,"Open defecation",127.54894099999997,27.058923999999998,0.49340200000000001,1.5701849999999999,1.6834,10.338092,1.8051300000000001,1.5701849999999999,0,1.6834,119.67785899999997,3.8398219999999998,19.440363999999999,0,0,1.311728,139.03691199999997,2.0200800000000001,8.1150500000000001,7.8710820000000004]
["Shared among Improved Sanitation","Yes",3.2452186554875189,2.4959475596097054,0.64581318605323756,0.46368423346517795,3.5989843670721659E-2,1.6322549688872681,0.4064960820522413,0.25433263149168273,7.4064191522925274E-2,4.9551455293937792E-2,6.8603901460089949,2.8227579944916315,6.8403661831348384,1.2695898263624452,1.3425690597530704,1.1729083931728148,3.4327997148379494,0.4464726053437183,2.1383697861478841,0.46494288203050138,null,null,null,null,null,null,null,null,null,null,null,null,null,null,null,null,null,null,null,null,null,null,null,null,null,null,null,null,null,null,"Shared among improved sanitation facilities","Yes","N/A","N/A","N/A","N/A","N/A","N/A","N/A","N/A","N/A","N/A","N/A","N/A","N/A","N/A","N/A","N/A","N/A","N/A","N/A","N/A"]
[null,"No",96.754781344512494,97.504052440390311,99.35418681394674,99.536315766534827,99.96401015632928,98.367745031112705,99.593503917947757,99.745667368508322,99.925935808477078,99.950448544706077,93.139609853991033,97.177242005508418,93.159633816865338,98.73041017363758,98.657430940246911,98.827091606827238,96.567200285162073,99.553527394656271,97.861630213852052,99.535057117969444,null,null,null,null,null,null,null,null,null,null,null,null,null,null,null,null,null,null,null,null,null,null,null,null,null,null,null,null,null,null,null,"No","N/A","N/A","N/A","N/A","N/A","N/A","N/A","N/A","N/A","N/A","N/A","N/A","N/A","N/A","N/A","N/A","N/A","N/A","N/A","N/A"]
["Manually calculated ratios","Improved latrines"]
[null,"Other"]
[null,"Other"]
[null,null,"NATIONAL wealth index quintile",null,null,null,null,"URBAN wealth index quintile",null,null,null,null,"RURAL wealth index quintile",null,null,null,null,"SUB-REGIONS:",null,null,null,null,null,null,null,null,null,null,null,null,null,null,null,null,null,null,null,null,null,null,null,null,null,null,null,null,null,null,null,null,null,null,"Raw numbers of respondents:","Use of sanitation facilities","NATIONAL wealth index quintile",null,null,null,null,"URBAN wealth index quintile",null,null,null,null,"RURAL wealth index quintile",null,null,null,null,"SUB-REGIONS:"]
["Percentage based on weighted population",null,"Poorest","Poor","Middle","Rich","Richest","Poorest","Poor","Middle","Rich","Richest","Poorest","Poor","Middle","Rich","Richest","Central","East","North","South","West",null,null,null,null,null,null,null,null,null,null,null,null,null,null,null,null,null,null,null,null,null,null,null,null,null,null,null,null,null,null,"Sanitation data, raw numbers (weighted)",null,"Poorest","Poor","Middle","Rich","Richest","Poorest","Poor","Middle","Rich","Richest","Poorest","Poor","Middle","Rich","Richest","Central","East","North","South","West"]
["Sanitation type","Sewer connection","N/A","N/A","N/A","N/A","N/A","N/A","N/A","N/A","N/A","N/A","N/A","N/A","N/A","N/A","N/A","N/A","N/A","N/A","N/A","N/A",null,null,null,null,null,null,null,null,null,null,null,null,null,null,null,null,null,null,null,null,null,null,null,null,null,null,null,null,null,null,"Sanitation type","Sewer connection","N/A","N/A","N/A","N/A","N/A","N/A","N/A","N/A","N/A","N/A","N/A","N/A","N/A","N/A","N/A","N/A","N/A","N/A","N/A","N/A"]
[null,"Septic tank connection","N/A","N/A","N/A","N/A","N/A","N/A","N/A","N/A","N/A","N/A","N/A","N/A","N/A","N/A","N/A","N/A","N/A","N/A","N/A","N/A",null,null,null,null,null,null,null,null,null,null,null,null,null,null,null,null,null,null,null,null,null,null,null,null,null,null,null,null,null,null,null,"Septic tank connection","N/A","N/A","N/A","N/A","N/A","N/A","N/A","N/A","N/A","N/A","N/A","N/A","N/A","N/A","N/A","N/A","N/A","N/A","N/A","N/A"]
[null,"Improved latrines","N/A","N/A","N/A","N/A","N/A","N/A","N/A","N/A","N/A","N/A","N/A","N/A","N/A","N/A","N/A","N/A","N/A","N/A","N/A","N/A",null,null,null,null,null,null,null,null,null,null,null,null,null,null,null,null,null,null,null,null,null,null,null,null,null,null,null,null,null,null,null,"Improved latrines","N/A","N/A","N/A","N/A","N/A","N/A","N/A","N/A","N/A","N/A","N/A","N/A","N/A","N/A","N/A","N/A","N/A","N/A","N/A","N/A"]
[null,"Unimproved facilities","N/A","N/A","N/A","N/A","N/A","N/A","N/A","N/A","N/A","N/A","N/A","N/A","N/A","N/A","N/A","N/A","N/A","N/A","N/A","N/A",null,null,null,null,null,null,null,null,null,null,null,null,null,null,null,null,null,null,null,null,null,null,null,null,null,null,null,null,null,null,null,"Unimproved facilities","N/A","N/A","N/A","N/A","N/A","N/A","N/A","N/A","N/A","N/A","N/A","N/A","N/A","N/A","N/A","N/A","N/A","N/A","N/A","N/A"]
[null,"Open defecation",1.5138806911097324,0.32125582847479695,5.8617101019333229E-3,1.8622857320230186E-2,1.9984322850743835E-2,0.16887201995224968,2.9497180962571059E-2,2.5622975818607931E-2,0,2.7491213742193245E-2,5.2004052151062314,0.16695067321618923,0.84501854520608932,0,0,1.4793067708916773E-2,1.7546165993192702,7.0394810658816268E-2,0.15669277165416884,4.5548180658712481E-2,null,null,null,null,null,null,null,null,null,null,null,null,null,null,null,null,null,null,null,null,null,null,null,null,null,null,null,null,null,null,null,"Open defecation","N/A","N/A","N/A","N/A","N/A","N/A","N/A","N/A","N/A","N/A","N/A","N/A","N/A","N/A","N/A","N/A","N/A","N/A","N/A","N/A"]
["Septic tank emptying practices","Not emptied/treated and disposed in situ","N/A","N/A","N/A","N/A","N/A","N/A","N/A","N/A","N/A","N/A","N/A","N/A","N/A","N/A","N/A","N/A","N/A","N/A","N/A","N/A",null,null,null,null,null,null,null,null,null,null,null,null,null,null,null,null,null,null,null,null,null,null,null,null,null,null,null,null,null,null,"Septic tank emptying practices","Not emptied/treated and disposed in situ","N/A","N/A","N/A","N/A","N/A","N/A","N/A","N/A","N/A","N/A","N/A","N/A","N/A","N/A","N/A","N/A","N/A","N/A","N/A","N/A"]
[null,"Emptied and buried on site","N/A","N/A","N/A","N/A","N/A","N/A","N/A","N/A","N/A","N/A","N/A","N/A","N/A","N/A","N/A","N/A","N/A","N/A","N/A","N/A",null,null,null,null,null,null,null,null,null,null,null,null,null,null,null,null,null,null,null,null,null,null,null,null,null,null,null,null,null,null,null,"Emptied and buried on site","N/A","N/A","N/A","N/A","N/A","N/A","N/A","N/A","N/A","N/A","N/A","N/A","N/A","N/A","N/A","N/A","N/A","N/A","N/A","N/A"]
[null,"Emptied and discharged locally","N/A","N/A","N/A","N/A","N/A","N/A","N/A","N/A","N/A","N/A","N/A","N/A","N/A","N/A","N/A","N/A","N/A","N/A","N/A","N/A",null,null,null,null,null,null,null,null,null,null,null,null,null,null,null,null,null,null,null,null,null,null,null,null,null,null,null,null,null,null,null,"Emptied and discharged locally","N/A","N/A","N/A","N/A","N/A","N/A","N/A","N/A","N/A","N/A","N/A","N/A","N/A","N/A","N/A","N/A","N/A","N/A","N/A","N/A"]
[null,"Emptied and removed offsite","N/A","N/A","N/A","N/A","N/A","N/A","N/A","N/A","N/A","N/A","N/A","N/A","N/A","N/A","N/A","N/A","N/A","N/A","N/A","N/A",null,null,null,null,null,null,null,null,null,null,null,null,null,null,null,null,null,null,null,null,null,null,null,null,null,null,null,null,null,null,null,"Emptied and removed offsite","N/A","N/A","N/A","N/A","N/A","N/A","N/A","N/A","N/A","N/A","N/A","N/A","N/A","N/A","N/A","N/A","N/A","N/A","N/A","N/A"]
["Latrine emptying practices","Not emptied/treated and disposed in situ","N/A","N/A","N/A","N/A","N/A","N/A","N/A","N/A","N/A","N/A","N/A","N/A","N/A","N/A","N/A","N/A","N/A","N/A","N/A","N/A",null,null,null,null,null,null,null,null,null,null,null,null,null,null,null,null,null,null,null,null,null,null,null,null,null,null,null,null,null,null,"Latrine emptying practices","Not emptied/treated and disposed in situ","N/A","N/A","N/A","N/A","N/A","N/A","N/A","N/A","N/A","N/A","N/A","N/A","N/A","N/A","N/A","N/A","N/A","N/A","N/A","N/A"]
[null,"Emptied and buried on site","N/A","N/A","N/A","N/A","N/A","N/A","N/A","N/A","N/A","N/A","N/A","N/A","N/A","N/A","N/A","N/A","N/A","N/A","N/A","N/A",null,null,null,null,null,null,null,null,null,null,null,null,null,null,null,null,null,null,null,null,null,null,null,null,null,null,null,null,null,null,null,"Emptied and buried on site","N/A","N/A","N/A","N/A","N/A","N/A","N/A","N/A","N/A","N/A","N/A","N/A","N/A","N/A","N/A","N/A","N/A","N/A","N/A","N/A"]
[null,"Emptied and discharged locally","N/A","N/A","N/A","N/A","N/A","N/A","N/A","N/A","N/A","N/A","N/A","N/A","N/A","N/A","N/A","N/A","N/A","N/A","N/A","N/A",null,null,null,null,null,null,null,null,null,null,null,null,null,null,null,null,null,null,null,null,null,null,null,null,null,null,null,null,null,null,null,"Emptied and discharged locally","N/A","N/A","N/A","N/A","N/A","N/A","N/A","N/A","N/A","N/A","N/A","N/A","N/A","N/A","N/A","N/A","N/A","N/A","N/A","N/A"]
[null,"Emptied and removed offsite","N/A","N/A","N/A","N/A","N/A","N/A","N/A","N/A","N/A","N/A","N/A","N/A","N/A","N/A","N/A","N/A","N/A","N/A","N/A","N/A",null,null,null,null,null,null,null,null,null,null,null,null,null,null,null,null,null,null,null,null,null,null,null,null,null,null,null,null,null,null,null,"Emptied and removed offsite","N/A","N/A","N/A","N/A","N/A","N/A","N/A","N/A","N/A","N/A","N/A","N/A","N/A","N/A","N/A","N/A","N/A","N/A","N/A","N/A"]
["Shared among improved sanitation facilities","Yes",3.1182133176969988,2.458488954713888,0.63874294719811331,0.46165289827711559,3.5844662128674196E-2,1.6099903893335106,0.40427722147536299,0.25388032654553483,7.3968253214506605E-2,4.9309314879258166E-2,6.2780895018576128,2.7367987750699587,6.6600016729141576,1.2327586287777073,1.3071277840930551,1.1625482101940416,3.2891250975547308,0.43501297878709005,2.1097801554834992,0.4631579404974383,null,null,null,null,null,null,null,null,null,null,null,null,null,null,null,null,null,null,null,null,null,null,null,null,null,null,null,null,null,null,"Shared among improved sanitation facilities","Yes","N/A","N/A","N/A","N/A","N/A","N/A","N/A","N/A","N/A","N/A","N/A","N/A","N/A","N/A","N/A","N/A","N/A","N/A","N/A","N/A"]
[null,"No",92.968172492523863,96.040734125851372,98.266476238812515,99.10026121450565,99.560759470482296,97.025971517467383,99.049872357119284,99.568279754331584,99.796497748714415,99.462026097484994,85.234045642670125,94.217980218049064,90.703231443678874,95.86621012318021,96.053061965361323,97.954161752913365,92.52552681289032,96.998283841785792,96.553237305313672,99.152936508509256,null,null,null,null,null,null,null,null,null,null,null,null,null,null,null,null,null,null,null,null,null,null,null,null,null,null,null,null,null,null,null,"No","N/A","N/A","N/A","N/A","N/A","N/A","N/A","N/A","N/A","N/A","N/A","N/A","N/A","N/A","N/A","N/A","N/A","N/A","N/A","N/A"]
[null,"DK/missing",3.9136141897791772,1.5007769194347773,1.0947808139893587,0.43808588721725916,0.40339586738904831,1.3640380931990155,0.54585042140539275,0.17783991912286792,0.12953399807107394,0.48866458763575954,8.4878648554724219,3.0452210068810248,2.6367668834071787,2.9010312480421363,2.6398102505455898,0.88329003689266317,4.1853480895549087,2.5667031794271171,1.3369825392027563,0.38390555099326451,null,null,null,null,null,null,null,null,null,null,null,null,null,null,null,null,null,null,null,null,null,null,null,null,null,null,null,null,null,null,null,"DK/missing","N/A","N/A","N/A","N/A","N/A","N/A","N/A","N/A","N/A","N/A","N/A","N/A","N/A","N/A","N/A","N/A","N/A","N/A","N/A","N/A"]
["Shared among all sanitation facilities","Yes",3.2291700887674182,2.477202367714773,0.63878039065280146,0.46173888725128043,3.5851826873504487E-2,1.6982845338915449,0.41920396171447316,0.25394539491266582,7.3968253214506605E-2,4.9322874336065685E-2,6.6224855877316608,2.7413755199559091,6.7167595366356263,1.2327586287777073,1.3071277840930551,1.1627202121822946,3.3595037760135185,0.43531942106931282,2.2142288238179244,0.46336899664514664,null,null,null,null,null,null,null,null,null,null,null,null,null,null,null,null,null,null,null,null,null,null,null,null,null,null,null,null,null,null,"Shared among all sanitation facilities","Yes","N/A","N/A","N/A","N/A","N/A","N/A","N/A","N/A","N/A","N/A","N/A","N/A","N/A","N/A","N/A","N/A","N/A","N/A","N/A","N/A"]
[null,"No",95.574132807121742,96.882758488597389,98.952412499294539,99.299663840796399,99.690125665679858,97.426275435437375,99.254863398276257,99.693706098304347,99.796497748714415,99.639973492404238,91.971723235154727,96.139385641082413,92.559036579304319,97.4804581808432,97.626993143727546,98.537682771533468,95.261813316620476,98.543779878789664,96.798929894489433,99.441456758146558,null,null,null,null,null,null,null,null,null,null,null,null,null,null,null,null,null,null,null,null,null,null,null,null,null,null,null,null,null,null,null,"No","N/A","N/A","N/A","N/A","N/A","N/A","N/A","N/A","N/A","N/A","N/A","N/A","N/A","N/A","N/A","N/A","N/A","N/A","N/A","N/A"]
["Type of toilet facility","11",55.813905865707135,63.19498036941409,85.052211002576215,92.893180533089591,95.59667552089671,88.622351169056273,91.885119432720543,95.472278112638648,97.778147235956268,98.483689940459712,19.147174383375564,31.622391929052323,23.319031062396682,44.369377167860222,61.684378015958821,84.607365482364841,64.62090376742151,60.554050716999853,59.152481010212057,90.548268396995852,null,null,null,null,null,null,null,null,null,null,null,null,null,null,null,null,null,null,null,null,null,null,null,null,null,null,null,null,null,null,"Type of toilet facility","11",4695.1802670000161,5320.8207569999895,7151.8305960000152,7819.8875260000232,8045.8023010000243,5422.8921550000186,5620.1532520000046,5850.5748929999936,5987.0112839999938,6023.4712090000194,438.65686000000011,727.30677800000035,536.47396800000013,1021.4927790000008,1405.4882690000009,7473.4836319999549,5118.5524130000076,1737.0736669999726,3063.4810780000021,15640.930657000028]
[null,"21",14.490805506931142,10.308419488678926,2.4223116415710773,0.26450572027256125,0.19272837003505261,2.1968763997600935,0.97443609626862804,0.3865431722690173,2.199424390555519E-2,2.1446738791612095E-2,30.743985464609214,20.861935639119878,23.428590751116136,12.328829507836394,4.4651723366559315,2.7224006159439771,16.535156766606445,12.888823127956936,2.2797032379299949,1.6852517644584608,null,null,null,null,null,null,null,null,null,null,null,null,null,null,null,null,null,null,null,null,null,null,null,null,null,null,null,null,null,null,null,"21",1218.9962879999971,867.93685300000004,203.68621000000005,22.266488999999996,16.220798000000002,134.42911000000001,59.601382999999998,23.687501999999999,1.3467199999999999,1.311728,704.33683099999985,479.8190859999998,538.99448099999995,283.84014200000018,101.739655,240.47334800000002,1309.7320159999979,369.73307300000005,118.064832,291.1033690000001]
[null,"22",27.052697655344538,25.644240705299175,11.941284488363449,6.8009696521610996,4.1665929925841425,8.7353851417282602,6.9351272933026706,4.0156738895071484,2.1998585201381333,1.4343114622993427,43.156472231560763,45.587821687132092,51.333695530015092,41.687545266640633,33.225257699787591,12.469663978798648,15.960805288247986,25.04527028593337,38.216128185391604,7.519261366175928,null,null,null,null,null,null,null,null,null,null,null,null,null,null,null,null,null,null,null,null,null,null,null,null,null,null,null,null,null,null,null,"22",2275.7284269999914,2159.1652919999947,1004.1131530000001,572.51584499999967,350.67729399999973,534.52713599999993,424.18705499999993,246.08191300000007,134.69858200000002,87.725529000000009,988.70372299999951,1048.5080249999996,1180.974940999999,959.75037700000075,757.04272999999944,1101.4623739999988,1264.2382519999974,718.45696499999906,1979.1965369999964,1298.845882999999]
[null,"31",1.5162366898413715,0.32137676668544674,5.8677188238440512E-3,1.8652375522075871E-2,2.000141658363587E-2,0.16894785908609097,2.9512466689865041E-2,2.5622975818607931E-2,0,2.7523572022400834E-2,5.2238846466507596,0.16695067321618923,0.84501854520608932,0,0,1.4850082742437473E-2,1.755318727938058,7.041959652963814E-2,0.15669277165416884,4.5567163562085837E-2,null,null,null,null,null,null,null,null,null,null,null,null,null,null,null,null,null,null,null,null,null,null,null,null,null,null,null,null,null,null,null,"31",127.54894099999997,27.058923999999998,0.49340200000000001,1.5701849999999999,1.6834,10.338092,1.8051300000000001,1.5701849999999999,0,1.6834,119.67785899999997,3.8398219999999998,19.440363999999999,0,0,1.311728,139.03691199999997,2.0200800000000001,8.1150500000000001,7.8710820000000004]
[null,"OTHER",1.1263542821755652,0.53098266992207455,0.57832514866541418,2.2691718954713197E-2,2.4001699900363042E-2,0.27643943036907875,0.17580471101829467,9.9881849766528363E-2,0,3.3028286426881007E-2,1.7284832738038034,1.7609000714796819,1.0736641112662899,1.6142480576630358,0.62519194759782115,0.18571984014998086,1.127815449786066,1.4414362725801946,0.19499479481212029,0.2016513088073715,null,null,null,null,null,null,null,null,null,null,null,null,null,null,null,null,null,null,null,null,null,null,null,null,null,null,null,null,null,null,null,"OTHER",94.751232999999985,44.707088999999996,48.629935000000003,1.910223,2.0200800000000001,16.915610999999998,10.753094999999998,6.1207949999999993,0,2.0200800000000001,39.599108999999999,40.500242999999998,24.700547999999998,37.163981999999997,14.245097000000001,16.404885999999998,89.333050999999983,41.349521000000003,10.098695000000001,34.832406999999996]
[null,null,null,null,null,null,null,null,null,null,null,null,null,null,null,null,null,null,null,null,null,null,null,null,null,null,null,null,null,null,null,null,null,null,null,null,null,null,null,null,null,null,null,null,null,null,null,null,null,null,null,null,null,"Total",8412.2051560000255,8419.6889150000079,8408.7532960000153,8418.1502680000194,8416.403873000032,6119.1021040000305,6116.4999150000049,6128.0352879999964,6123.0565859999961,6116.2119460000231,2290.9743819999971,2299.973953999996,2300.5843019999925,2302.247279999995,2278.5157509999967,8833.1359679999641,7920.8926439999977,2868.633305999972,5178.9561920000015,17273.583398000079]
[]
[]
[]
[]
[]
[]
[]
[]
[]
[]
[]
[]
[]
[]
[]
[]
[]
[]
[]
[]
[]
[]
[]
[]
[]
[]
[]
[]
[]
[]
[]
[]
[]
[]
[]
[]
[]
[]
[]
[]
[]
[]
[]
[]
[]
[]
[]
[]
[]
[{"$f":"A1026","v":"Turkey"}]
[{"$f":"A1034","v":"2008"}]
["Access to hygiene facilities "]
[" by wealth quintile and sub-national region"]
["Notes:"]
["WHO/UNICEF JMP customised wealth index excludes water,"]
[" sanitation and hygiene assets."]
["Survey used for analysis:",{"$f":"A1025","v":"DHS08"}]
[]
[]
[]
[]
["Access to handwashing",null,"NATIONAL wealth index quintile",null,null,null,null,"URBAN wealth index quintile",null,null,null,null,"RURAL wealth index quintile",null,null,null,null,"SUB-REGIONS:",null,null,null,null,null,null,null,null,null,null,null,null,null,null,null,null,null,null,null,null,null,null,null,null,null,null,null,null,null,null,null,null,null,null,"Raw numbers of respondents:","Access to handwashing","NATIONAL wealth index quintile",null,null,null,null,"URBAN wealth index quintile",null,null,null,null,"RURAL wealth index quintile",null,null,null,null,"SUB-REGIONS:"]
["Weighted percentage (used in graphs)",null,"Poorest","Poor","Middle","Rich","Richest","Poorest","Poor","Middle","Rich","Richest","Poorest","Poor","Middle","Rich","Richest","Central","East","North","South","West",null,null,null,null,null,null,null,null,null,null,null,null,null,null,null,null,null,null,null,null,null,null,null,null,null,null,null,null,null,null,"Hygiene data, raw numbers (weighted)",null,"Poorest","Poor","Middle","Rich","Richest","Poorest","Poor","Middle","Rich","Richest","Poorest","Poor","Middle","Rich","Richest","Central","East","North","South","West"]
["Hygiene ladder","Basic","N/A","N/A","N/A","N/A","N/A","N/A","N/A","N/A","N/A","N/A","N/A","N/A","N/A","N/A","N/A","N/A","N/A","N/A","N/A","N/A",null,null,null,null,null,null,null,null,null,null,null,null,null,null,null,null,null,null,null,null,null,null,null,null,null,null,null,null,null,null,"Hygiene ladder","Basic","N/A","N/A","N/A","N/A","N/A","N/A","N/A","N/A","N/A","N/A","N/A","N/A","N/A","N/A","N/A","N/A","N/A","N/A","N/A","N/A"]
[null,"Limited","N/A","N/A","N/A","N/A","N/A","N/A","N/A","N/A","N/A","N/A","N/A","N/A","N/A","N/A","N/A","N/A","N/A","N/A","N/A","N/A",null,null,null,null,null,null,null,null,null,null,null,null,null,null,null,null,null,null,null,null,null,null,null,null,null,null,null,null,null,null,null,"Limited","N/A","N/A","N/A","N/A","N/A","N/A","N/A","N/A","N/A","N/A","N/A","N/A","N/A","N/A","N/A","N/A","N/A","N/A","N/A","N/A"]
[null,"No facility","N/A","N/A","N/A","N/A","N/A","N/A","N/A","N/A","N/A","N/A","N/A","N/A","N/A","N/A","N/A","N/A","N/A","N/A","N/A","N/A",null,null,null,null,null,null,null,null,null,null,null,null,null,null,null,null,null,null,null,null,null,null,null,null,null,null,null,null,null,null,null,"No facility","N/A","N/A","N/A","N/A","N/A","N/A","N/A","N/A","N/A","N/A","N/A","N/A","N/A","N/A","N/A","N/A","N/A","N/A","N/A","N/A"]
[null,null,null,null,null,null,null,null,null,null,null,null,null,null,null,null,null,null,null,null,null,null,null,null,null,null,null,null,null,null,null,null,null,null,null,null,null,null,null,null,null,null,null,null,null,null,null,null,null,null,null,null,"Observed handwashing place","Fixed","N/A","N/A","N/A","N/A","N/A","N/A","N/A","N/A","N/A","N/A","N/A","N/A","N/A","N/A","N/A","N/A","N/A","N/A","N/A","N/A"]
[null,null,null,null,null,null,null,null,null,null,null,null,null,null,null,null,null,null,null,null,null,null,null,null,null,null,null,null,null,null,null,null,null,null,null,null,null,null,null,null,null,null,null,null,null,null,null,null,null,null,null,null,null,"Mobile","N/A","N/A","N/A","N/A","N/A","N/A","N/A","N/A","N/A","N/A","N/A","N/A","N/A","N/A","N/A","N/A","N/A","N/A","N/A","N/A"]
[null,null,null,null,null,null,null,null,null,null,null,null,null,null,null,null,null,null,null,null,null,null,null,null,null,null,null,null,null,null,null,null,null,null,null,null,null,null,null,null,null,null,null,null,null,null,null,null,null,null,null,null,"Water / Soap","Water and soap","N/A","N/A","N/A","N/A","N/A","N/A","N/A","N/A","N/A","N/A","N/A","N/A","N/A","N/A","N/A","N/A","N/A","N/A","N/A","N/A"]
[null,null,null,null,null,null,null,null,null,null,null,null,null,null,null,null,null,null,null,null,null,null,null,null,null,null,null,null,null,null,null,null,null,null,null,null,null,null,null,null,null,null,null,null,null,null,null,null,null,null,null,null,null,"Water only","N/A","N/A","N/A","N/A","N/A","N/A","N/A","N/A","N/A","N/A","N/A","N/A","N/A","N/A","N/A","N/A","N/A","N/A","N/A","N/A"]
[null,null,null,null,null,null,null,null,null,null,null,null,null,null,null,null,null,null,null,null,null,null,null,null,null,null,null,null,null,null,null,null,null,null,null,null,null,null,null,null,null,null,null,null,null,null,null,null,null,null,null,null,null,"Soap only","N/A","N/A","N/A","N/A","N/A","N/A","N/A","N/A","N/A","N/A","N/A","N/A","N/A","N/A","N/A","N/A","N/A","N/A","N/A","N/A"]
[null,null,null,null,null,null,null,null,null,null,null,null,null,null,null,null,null,null,null,null,null,null,null,null,null,null,null,null,null,null,null,null,null,null,null,null,null,null,null,null,null,null,null,null,null,null,null,null,null,null,null,null,null,"Neither","N/A","N/A","N/A","N/A","N/A","N/A","N/A","N/A","N/A","N/A","N/A","N/A","N/A","N/A","N/A","N/A","N/A","N/A","N/A","N/A"]
[]
[]
[]
[]
[]
[]
[]
[]
[]
[]
[]
[]
[]
[]
[]
[]
[]
[]
[]
[]
[]
[]
[]
[]
[]
[]
[]
[]
[null,null,null,null,null,null,null,null,null,null,null,null,null,null,null,null,null,null,null,null,null,null,null,null,null,null,null,null,null,null,null,null,null,null,null,null,null,null,null,null,null,null,null,null,null,null,null,null,null,null,null,null,"Raw numbers of respondents:","Menstrual health and hygiene","NATIONAL wealth index quintile",null,null,null,null,"URBAN wealth index quintile",null,null,null,null,"RURAL wealth index quintile",null,null,null,null,"SUB-REGIONS:"]
[null,null,null,null,null,null,null,null,null,null,null,null,null,null,null,null,null,null,null,null,null,null,null,null,null,null,null,null,null,null,null,null,null,null,null,null,null,null,null,null,null,null,null,null,null,null,null,null,null,null,null,null,"MHH data, raw numbers (weighted)",null,"Poorest","Poor","Middle","Rich","Richest","Poorest","Poor","Middle","Rich","Richest","Poorest","Poor","Middle","Rich","Richest","Central","East","North","South","West"]
[null,null,null,null,null,null,null,null,null,null,null,null,null,null,null,null,null,null,null,null,null,null,null,null,null,null,null,null,null,null,null,null,null,null,null,null,null,null,null,null,null,null,null,null,null,null,null,null,null,null,null,null,"Private place to wash and change","Yes","N/A","N/A","N/A","N/A","N/A","N/A","N/A","N/A","N/A","N/A","N/A","N/A","N/A","N/A","N/A","N/A","N/A","N/A","N/A","N/A"]
[null,null,null,null,null,null,null,null,null,null,null,null,null,null,null,null,null,null,null,null,null,null,null,null,null,null,null,null,null,null,null,null,null,null,null,null,null,null,null,null,null,null,null,null,null,null,null,null,null,null,null,null,null,"No","N/A","N/A","N/A","N/A","N/A","N/A","N/A","N/A","N/A","N/A","N/A","N/A","N/A","N/A","N/A","N/A","N/A","N/A","N/A","N/A"]
[null,null,null,null,null,null,null,null,null,null,null,null,null,null,null,null,null,null,null,null,null,null,null,null,null,null,null,null,null,null,null,null,null,null,null,null,null,null,null,null,null,null,null,null,null,null,null,null,null,null,null,null,null,"DK/not sure/missing","N/A","N/A","N/A","N/A","N/A","N/A","N/A","N/A","N/A","N/A","N/A","N/A","N/A","N/A","N/A","N/A","N/A","N/A","N/A","N/A"]
[null,null,null,null,null,null,null,null,null,null,null,null,null,null,null,null,null,null,null,null,null,null,null,null,null,null,null,null,null,null,null,null,null,null,null,null,null,null,null,null,null,null,null,null,null,null,null,null,null,null,null,null,"Use of menstrual materials","Materials reusable","N/A","N/A","N/A","N/A","N/A","N/A","N/A","N/A","N/A","N/A","N/A","N/A","N/A","N/A","N/A","N/A","N/A","N/A","N/A","N/A"]
[null,null,null,null,null,null,null,null,null,null,null,null,null,null,null,null,null,null,null,null,null,null,null,null,null,null,null,null,null,null,null,null,null,null,null,null,null,null,null,null,null,null,null,null,null,null,null,null,null,null,null,null,null,"Materials not reusable","N/A","N/A","N/A","N/A","N/A","N/A","N/A","N/A","N/A","N/A","N/A","N/A","N/A","N/A","N/A","N/A","N/A","N/A","N/A","N/A"]
[null,null,null,null,null,null,null,null,null,null,null,null,null,null,null,null,null,null,null,null,null,null,null,null,null,null,null,null,null,null,null,null,null,null,null,null,null,null,null,null,null,null,null,null,null,null,null,null,null,null,null,null,null,"No materials used","N/A","N/A","N/A","N/A","N/A","N/A","N/A","N/A","N/A","N/A","N/A","N/A","N/A","N/A","N/A","N/A","N/A","N/A","N/A","N/A"]
[null,null,null,null,null,null,null,null,null,null,null,null,null,null,null,null,null,null,null,null,null,null,null,null,null,null,null,null,null,null,null,null,null,null,null,null,null,null,null,null,null,null,null,null,null,null,null,null,null,null,null,null,null,"DK/not sure/missing","N/A","N/A","N/A","N/A","N/A","N/A","N/A","N/A","N/A","N/A","N/A","N/A","N/A","N/A","N/A","N/A","N/A","N/A","N/A","N/A"]
[null,null,null,null,null,null,null,null,null,null,null,null,null,null,null,null,null,null,null,null,null,null,null,null,null,null,null,null,null,null,null,null,null,null,null,null,null,null,null,null,null,null,null,null,null,null,null,null,null,null,null,null,"Use of menstrual materials with private place to wash and change","Materials reusable","N/A","N/A","N/A","N/A","N/A","N/A","N/A","N/A","N/A","N/A","N/A","N/A","N/A","N/A","N/A","N/A","N/A","N/A","N/A","N/A"]
[null,null,null,null,null,null,null,null,null,null,null,null,null,null,null,null,null,null,null,null,null,null,null,null,null,null,null,null,null,null,null,null,null,null,null,null,null,null,null,null,null,null,null,null,null,null,null,null,null,null,null,null,null,"Materials not reusable","N/A","N/A","N/A","N/A","N/A","N/A","N/A","N/A","N/A","N/A","N/A","N/A","N/A","N/A","N/A","N/A","N/A","N/A","N/A","N/A"]
[null,null,null,null,null,null,null,null,null,null,null,null,null,null,null,null,null,null,null,null,null,null,null,null,null,null,null,null,null,null,null,null,null,null,null,null,null,null,null,null,null,null,null,null,null,null,null,null,null,null,null,null,null,"No materials used","N/A","N/A","N/A","N/A","N/A","N/A","N/A","N/A","N/A","N/A","N/A","N/A","N/A","N/A","N/A","N/A","N/A","N/A","N/A","N/A"]
[null,null,null,null,null,null,null,null,null,null,null,null,null,null,null,null,null,null,null,null,null,null,null,null,null,null,null,null,null,null,null,null,null,null,null,null,null,null,null,null,null,null,null,null,null,null,null,null,null,null,null,null,"Awareness of menstruation before menarche","Yes","N/A","N/A","N/A","N/A","N/A","N/A","N/A","N/A","N/A","N/A","N/A","N/A","N/A","N/A","N/A","N/A","N/A","N/A","N/A","N/A"]
[null,null,null,null,null,null,null,null,null,null,null,null,null,null,null,null,null,null,null,null,null,null,null,null,null,null,null,null,null,null,null,null,null,null,null,null,null,null,null,null,null,null,null,null,null,null,null,null,null,null,null,null,null,"No","N/A","N/A","N/A","N/A","N/A","N/A","N/A","N/A","N/A","N/A","N/A","N/A","N/A","N/A","N/A","N/A","N/A","N/A","N/A","N/A"]
[null,null,null,null,null,null,null,null,null,null,null,null,null,null,null,null,null,null,null,null,null,null,null,null,null,null,null,null,null,null,null,null,null,null,null,null,null,null,null,null,null,null,null,null,null,null,null,null,null,null,null,null,null,"DK/not sure/missing","N/A","N/A","N/A","N/A","N/A","N/A","N/A","N/A","N/A","N/A","N/A","N/A","N/A","N/A","N/A","N/A","N/A","N/A","N/A","N/A"]
[null,null,null,null,null,null,null,null,null,null,null,null,null,null,null,null,null,null,null,null,null,null,null,null,null,null,null,null,null,null,null,null,null,null,null,null,null,null,null,null,null,null,null,null,null,null,null,null,null,null,null,null,"Participation in (all) activities during menstruation","Yes","N/A","N/A","N/A","N/A","N/A","N/A","N/A","N/A","N/A","N/A","N/A","N/A","N/A","N/A","N/A","N/A","N/A","N/A","N/A","N/A"]
[null,null,null,null,null,null,null,null,null,null,null,null,null,null,null,null,null,null,null,null,null,null,null,null,null,null,null,null,null,null,null,null,null,null,null,null,null,null,null,null,null,null,null,null,null,null,null,null,null,null,null,null,null,"No","N/A","N/A","N/A","N/A","N/A","N/A","N/A","N/A","N/A","N/A","N/A","N/A","N/A","N/A","N/A","N/A","N/A","N/A","N/A","N/A"]
[null,null,null,null,null,null,null,null,null,null,null,null,null,null,null,null,null,null,null,null,null,null,null,null,null,null,null,null,null,null,null,null,null,null,null,null,null,null,null,null,null,null,null,null,null,null,null,null,null,null,null,null,null,"DK/not sure/missing/no such activity","N/A","N/A","N/A","N/A","N/A","N/A","N/A","N/A","N/A","N/A","N/A","N/A","N/A","N/A","N/A","N/A","N/A","N/A","N/A","N/A"]
[null,null,null,null,null,null,null,null,null,null,null,null,null,null,null,null,null,null,null,null,null,null,null,null,null,null,null,null,null,null,null,null,null,null,null,null,null,null,null,null,null,null,null,null,null,null,null,null,null,null,null,null,"Participation in specific activities during menstruation","Did not go to school (amongst those usually attending school)","N/A","N/A","N/A","N/A","N/A","N/A","N/A","N/A","N/A","N/A","N/A","N/A","N/A","N/A","N/A","N/A","N/A","N/A","N/A","N/A"]
[null,null,null,null,null,null,null,null,null,null,null,null,null,null,null,null,null,null,null,null,null,null,null,null,null,null,null,null,null,null,null,null,null,null,null,null,null,null,null,null,null,null,null,null,null,null,null,null,null,null,null,null,null,"Did not go to work (amongst those who usually work)","N/A","N/A","N/A","N/A","N/A","N/A","N/A","N/A","N/A","N/A","N/A","N/A","N/A","N/A","N/A","N/A","N/A","N/A","N/A","N/A"]
[null,null,null,null,null,null,null,null,null,null,null,null,null,null,null,null,null,null,null,null,null,null,null,null,null,null,null,null,null,null,null,null,null,null,null,null,null,null,null,null,null,null,null,null,null,null,null,null,null,null,null,null,null,"Did not participate in social activities","N/A","N/A","N/A","N/A","N/A","N/A","N/A","N/A","N/A","N/A","N/A","N/A","N/A","N/A","N/A","N/A","N/A","N/A","N/A","N/A"]
[null,null,null,null,null,null,null,null,null,null,null,null,null,null,null,null,null,null,null,null,null,null,null,null,null,null,null,null,null,null,null,null,null,null,null,null,null,null,null,null,null,null,null,null,null,null,null,null,null,null,null,null,null,"Did not cook food","N/A","N/A","N/A","N/A","N/A","N/A","N/A","N/A","N/A","N/A","N/A","N/A","N/A","N/A","N/A","N/A","N/A","N/A","N/A","N/A"]
[null,null,null,null,null,null,null,null,null,null,null,null,null,null,null,null,null,null,null,null,null,null,null,null,null,null,null,null,null,null,null,null,null,null,null,null,null,null,null,null,null,null,null,null,null,null,null,null,null,null,null,null,null,"Did not eat with others","N/A","N/A","N/A","N/A","N/A","N/A","N/A","N/A","N/A","N/A","N/A","N/A","N/A","N/A","N/A","N/A","N/A","N/A","N/A","N/A"]
[null,null,null,null,null,null,null,null,null,null,null,null,null,null,null,null,null,null,null,null,null,null,null,null,null,null,null,null,null,null,null,null,null,null,null,null,null,null,null,null,null,null,null,null,null,null,null,null,null,null,null,null,null,"Did not bathe in regular place","N/A","N/A","N/A","N/A","N/A","N/A","N/A","N/A","N/A","N/A","N/A","N/A","N/A","N/A","N/A","N/A","N/A","N/A","N/A","N/A"]
[null,null,null,null,null,null,null,null,null,null,null,null,null,null,null,null,null,null,null,null,null,null,null,null,null,null,null,null,null,null,null,null,null,null,null,null,null,null,null,null,null,null,null,null,null,null,null,null,null,null,null,null,null,"Did not participate in other activities","N/A","N/A","N/A","N/A","N/A","N/A","N/A","N/A","N/A","N/A","N/A","N/A","N/A","N/A","N/A","N/A","N/A","N/A","N/A","N/A"]
[null,null,null,null,null,null,null,null,null,null,null,null,null,null,null,null,null,null,null,null,null,null,null,null,null,null,null,null,null,null,null,null,null,null,null,null,null,null,null,null,null,null,null,null,null,null,null,null,null,null,null,null,null,"DK/not sure/missing/no such activity","N/A","N/A","N/A","N/A","N/A","N/A","N/A","N/A","N/A","N/A","N/A","N/A","N/A","N/A","N/A","N/A","N/A","N/A","N/A","N/A"]
[]
[]
[]
[]
[]
[]
[]
[]
[]
[]
[]
[]
[]
[]
[]
[]
[]
[]
[]
[]
[]
[]
[]
[]
[]
[]
[]
[]
[]
[]
[]
[]
[]
[]
[]
[]
[]
[]
[]
[]
[]
[]
[]
[]
[]
[]
[]
[]
[]
[]
[]
[]
[]
[]
[null,null,null,null,null,null,null,null,null,null,null,null,null,null,null,null,null,null,null,null,null,null,null,null,null,null,null,null,null,null,null,null,null,null,null,null,null,null,null,null,null,null,null,null,null,null,null,null,null,null,null,null,"Raw numbers of respondents:","Basic water, sanitation and hygiene","NATIONAL wealth index quintile",null,null,null,null,"URBAN wealth index quintile",null,null,null,null,"RURAL wealth index quintile",null,null,null,null,"SUB-REGIONS:"]
[null,null,null,null,null,null,null,null,null,null,null,null,null,null,null,null,null,null,null,null,null,null,null,null,null,null,null,null,null,null,null,null,null,null,null,null,null,null,null,null,null,null,null,null,null,null,null,null,null,null,null,null,"WatSan data, raw numbers (weighted)",null,"Poorest","Poor","Middle","Rich","Richest","Poorest","Poor","Middle","Rich","Richest","Poorest","Poor","Middle","Rich","Richest","Central","East","North","South","West"]
[null,null,null,null,null,null,null,null,null,null,null,null,null,null,null,null,null,null,null,null,null,null,null,null,null,null,null,null,null,null,null,null,null,null,null,null,null,null,null,null,null,null,null,null,null,null,null,null,null,null,null,null,"Use of Basic Water Sanitation and Hygiene","Yes","N/A","N/A","N/A","N/A","N/A","N/A","N/A","N/A","N/A","N/A","N/A","N/A","N/A","N/A","N/A","N/A","N/A","N/A","N/A","N/A"]
[null,null,null,null,null,null,null,null,null,null,null,null,null,null,null,null,null,null,null,null,null,null,null,null,null,null,null,null,null,null,null,null,null,null,null,null,null,null,null,null,null,null,null,null,null,null,null,null,null,null,null,null,null,"No","N/A","N/A","N/A","N/A","N/A","N/A","N/A","N/A","N/A","N/A","N/A","N/A","N/A","N/A","N/A","N/A","N/A","N/A","N/A","N/A"]
[null,null,null,null,null,null,null,null,null,null,null,null,null,null,null,null,null,null,null,null,null,null,null,null,null,null,null,null,null,null,null,null,null,null,null,null,null,null,null,null,null,null,null,null,null,null,null,null,null,null,null,null,"Use of Basic Water and Sanitation","Yes","N/A","N/A","N/A","N/A","N/A","N/A","N/A","N/A","N/A","N/A","N/A","N/A","N/A","N/A","N/A","N/A","N/A","N/A","N/A","N/A"]
[null,null,null,null,null,null,null,null,null,null,null,null,null,null,null,null,null,null,null,null,null,null,null,null,null,null,null,null,null,null,null,null,null,null,null,null,null,null,null,null,null,null,null,null,null,null,null,null,null,null,null,null,null,"No","N/A","N/A","N/A","N/A","N/A","N/A","N/A","N/A","N/A","N/A","N/A","N/A","N/A","N/A","N/A","N/A","N/A","N/A","N/A","N/A"]
[null,null,null,null,null,null,null,null,null,null,null,null,null,null,null,null,null,null,null,null,null,null,null,null,null,null,null,null,null,null,null,null,null,null,null,null,null,null,null,null,null,null,null,null,null,null,null,null,null,null,null,null,"Use of Basic Water and Hygiene","Yes","N/A","N/A","N/A","N/A","N/A","N/A","N/A","N/A","N/A","N/A","N/A","N/A","N/A","N/A","N/A","N/A","N/A","N/A","N/A","N/A"]
[null,null,null,null,null,null,null,null,null,null,null,null,null,null,null,null,null,null,null,null,null,null,null,null,null,null,null,null,null,null,null,null,null,null,null,null,null,null,null,null,null,null,null,null,null,null,null,null,null,null,null,null,null,"No","N/A","N/A","N/A","N/A","N/A","N/A","N/A","N/A","N/A","N/A","N/A","N/A","N/A","N/A","N/A","N/A","N/A","N/A","N/A","N/A"]
[null,null,null,null,null,null,null,null,null,null,null,null,null,null,null,null,null,null,null,null,null,null,null,null,null,null,null,null,null,null,null,null,null,null,null,null,null,null,null,null,null,null,null,null,null,null,null,null,null,null,null,null,"Use of Basic Sanitation and Hygiene","Yes","N/A","N/A","N/A","N/A","N/A","N/A","N/A","N/A","N/A","N/A","N/A","N/A","N/A","N/A","N/A","N/A","N/A","N/A","N/A","N/A"]
[null,null,null,null,null,null,null,null,null,null,null,null,null,null,null,null,null,null,null,null,null,null,null,null,null,null,null,null,null,null,null,null,null,null,null,null,null,null,null,null,null,null,null,null,null,null,null,null,null,null,null,null,null,"No","N/A","N/A","N/A","N/A","N/A","N/A","N/A","N/A","N/A","N/A","N/A","N/A","N/A","N/A","N/A","N/A","N/A","N/A","N/A","N/A"]
[null,null,null,null,null,null,null,null,null,null,null,null,null,null,null,null,null,null,null,null,null,null,null,null,null,null,null,null,null,null,null,null,null,null,null,null,null,null,null,null,null,null,null,null,null,null,null,null,null,null,null,null,"Use of Basic Water","Yes","N/A","N/A","N/A","N/A","N/A","N/A","N/A","N/A","N/A","N/A","N/A","N/A","N/A","N/A","N/A","N/A","N/A","N/A","N/A","N/A"]
[null,null,null,null,null,null,null,null,null,null,null,null,null,null,null,null,null,null,null,null,null,null,null,null,null,null,null,null,null,null,null,null,null,null,null,null,null,null,null,null,null,null,null,null,null,null,null,null,null,null,null,null,null,"No","N/A","N/A","N/A","N/A","N/A","N/A","N/A","N/A","N/A","N/A","N/A","N/A","N/A","N/A","N/A","N/A","N/A","N/A","N/A","N/A"]
[null,null,null,null,null,null,null,null,null,null,null,null,null,null,null,null,null,null,null,null,null,null,null,null,null,null,null,null,null,null,null,null,null,null,null,null,null,null,null,null,null,null,null,null,null,null,null,null,null,null,null,null,"Use of Basic Sanitation","Yes","N/A","N/A","N/A","N/A","N/A","N/A","N/A","N/A","N/A","N/A","N/A","N/A","N/A","N/A","N/A","N/A","N/A","N/A","N/A","N/A"]
[null,null,null,null,null,null,null,null,null,null,null,null,null,null,null,null,null,null,null,null,null,null,null,null,null,null,null,null,null,null,null,null,null,null,null,null,null,null,null,null,null,null,null,null,null,null,null,null,null,null,null,null,null,"No","N/A","N/A","N/A","N/A","N/A","N/A","N/A","N/A","N/A","N/A","N/A","N/A","N/A","N/A","N/A","N/A","N/A","N/A","N/A","N/A"]
[null,null,null,null,null,null,null,null,null,null,null,null,null,null,null,null,null,null,null,null,null,null,null,null,null,null,null,null,null,null,null,null,null,null,null,null,null,null,null,null,null,null,null,null,null,null,null,null,null,null,null,null,"Access to Basic Hygiene","Yes","N/A","N/A","N/A","N/A","N/A","N/A","N/A","N/A","N/A","N/A","N/A","N/A","N/A","N/A","N/A","N/A","N/A","N/A","N/A","N/A"]
[null,null,null,null,null,null,null,null,null,null,null,null,null,null,null,null,null,null,null,null,null,null,null,null,null,null,null,null,null,null,null,null,null,null,null,null,null,null,null,null,null,null,null,null,null,null,null,null,null,null,null,null,null,"No","N/A","N/A","N/A","N/A","N/A","N/A","N/A","N/A","N/A","N/A","N/A","N/A","N/A","N/A","N/A","N/A","N/A","N/A","N/A","N/A"]
[]
[]
[]
[]
[]
[]
[]
[]
[]
[]
[]
[]
[]
[]
[]
[]
[]
[]
[]
[]
[]
[]
[]
[]
[]
[]
[]
[]
[]
[]
[]
[]
[]
[]
[]
[]
[]
[]
[]
[]
[]
[]
[]
[]
[null,null,"INITIAL (national) Wealth Index",null,null,null,null,"URBAN Wealth Index",null,null,null,null,"RURAL Wealth Index"]
[null,null,"Component Matrix",null,null,null,null,"Component Matrix",null,null,null,null,"Component Matrix"]
[null,null,null,null,"Component",null,null,null,null,"Component",null,null,null,null,"Component"]
[null,"Note:\n\nThe INITIAL (national) Wealth Index is based on the first component of the Principal Component Analysis (PCA) which has been obtained at national level.\n\nThe final national-level (NATIONAL) Wealth Index is based on the URBAN and RURAL specific wealth indexes. Regression procedures are used to establish the relationships between the two sets of scores (urban and rural) and the initial (national) wealth factors.\nThis allows best use of the available information for each area and a better precision of the FINAL (NATIONAL) Wealth Index.\n\nFor dependency reasons, all WASH variables (contained in the generic MICS and DHS scripts) have been excluded from the sets of asset variables used in the PCAs.\n\nThe PCA can extracts as many components as there are asset variables in the input. Only the first of the components is used to represent the Wealth Index. \n\nThe scores represent the weights of the asset variables on the Wealth Index (correlations between the variables and the component).\n\nThe communalities are the proportion of each variable's variance that can be explained by the component.\n\nProportion of explained variance is the part of the model's total variance that is explained by the component.\n\nFor more information on the procedure used:\n\nThe DHS Wealth Index, DHS Comparative Reports No. 6, Shea Oscar Rutstein, Kiersten Johnson, ORC Macro International Inc., 2004.\n\nThe DHS Wealth Index: Approaches for Rural and Urban Areas, Shea O. Rutstein, ORC Macro International Inc., 2008.\n\nMICS Methodological Paper No. 4, Review of options for reporting water, sanitation and hygiene coverage by wealth quintile, UNICEF, 2016.",null,null,"1",null,null,null,null,"1",null,null,null,null,"1"]
[null,null,"Gas or electric oven",null,0.92548787288366274,null,null,"Gas or electric oven",null,0.93693294687013551,null,null,"Gas or electric oven",null,0.93802513197432902]
[null,null,"Blender/mixer",null,0.57594172417322065,null,null,"Blender/mixer",null,0.53052841911617676,null,null,"Vacuum cleaner",null,0.53800386104133369]
[null,null,"Vacuum cleaner",null,0.55390697611722395,null,null,"Vacuum cleaner",null,0.47753610178003836,null,null,"Iron",null,0.53776458990144582]
[null,null,"Iron",null,0.53732829223247558,null,null,"Iron",null,0.46511448047070958,null,null,"Blender/mixer",null,0.5105667513674168]
[null,null,"Dishwasher",null,0.48071476587003703,null,null,"Dishwasher",null,0.45097751923198554,null,null,"Cellular phone",null,0.44392944899101328]
[null,null,"Washing machine",null,0.46839873230275547,null,null,"Camera",null,0.41524834408812117,null,null,"Washing machine",null,0.44276982022159567]
[null,null,"Camera",null,0.45622028328336078,null,null,"Washing machine",null,0.40920824045000265,null,null,"Separate bathroom",null,0.40561250130525001]
[null,null,"Cellular phone",null,0.42449980255664971,null,null,"Internet",null,0.38057189021938326,null,null,"Camera",null,0.40410409184507007]
[null,null,"Internet",null,0.41873091170050553,null,null,"Car",null,0.36028438995905437,null,null,"DVD/VCD player",null,0.37355337923933207]
[null,null,"Separate bathroom",null,0.41021920850533045,null,null,"Computer",null,0.35598192207593354,null,null,"Car",null,0.36741754583754016]
[null,null,"DVD/VCD player",null,0.40684500991450379,null,null,"Concrete, cement floor",null,-0.35394501635997438,null,null,"Has a mobile telephone",null,0.35254526877760561]
[null,null,"Computer",null,0.40166593209217588,null,null,"Cellular phone",null,0.34920688366884772,null,null,"Dishwasher",null,0.33219327893848305]
[null,null,"Car",null,0.37584081832576621,null,null,"DVD/VCD player",null,0.34847069338339559,null,null,"Internet",null,0.31289313461700347]
[null,null,"Concrete, cement floor",null,-0.34441906729440269,null,null,"Has refrigerator",null,0.30889680393613628,null,null,"Computer",null,0.30772632004603273]
[null,null,"Has a mobile telephone",null,0.34327197974674706,null,null,"Separate bathroom",null,0.30389058857907558,null,null,"Earth, sand floor",null,-0.30136068582006054]
[null,null,"Has refrigerator",null,0.31183305509568082,null,null,"Video camera",null,0.27965469576216256,null,null,"Has refrigerator",null,0.2862053910003346]
[null,null,"Video camera",null,0.29956148359365831,null,null,"Has a mobile telephone",null,0.27304251243539907,null,null,"Satellite antenna",null,0.25951153504795521]
[null,null,"Earth, sand floor",null,-0.28744602183172591,null,null,"Number of members per sleeping room",null,-0.25094441154132208,null,null,"Microwave oven",null,0.24729040058574878]
[null,null,"Parquet, wood tile floor",null,0.28143740594472588,null,null,"Parquet, wood tile floor",null,0.2480223063064082,null,null,"Video camera",null,0.23467609896060446]
[null,null,"Number of members per sleeping room",null,-0.27527942966930719,null,null,"Microwave oven",null,0.24122048928946591,null,null,"Has television",null,0.22818093499863187]
[null,null,"Microwave oven",null,0.27027845164968806,null,null,"Laptop",null,0.23348160405216956,null,null,"Laptop",null,0.21175773809745868]
[null,null,"Laptop",null,0.2645165477467743,null,null,"Cable TV/Digiturk etc.",null,0.21385224483065071,null,null,"Parquet, wood tile floor",null,0.1770169524779058]
[null,null,"Cable TV/Digiturk etc.",null,0.24081402335010502,null,null,"LCD/Plasma television",null,0.19548974302854238,null,null,"Air conditioner",null,0.17634235640350626]
[null,null,"Air conditioner",null,0.22080135317843119,null,null,"Air conditioner",null,0.1948706575812422,null,null,"Has motorcycle/scooter",null,0.17522391266345946]
[null,null,"LCD/Plasma television",null,0.20641812182803032,null,null,"Fitness equipment",null,0.18725480613410384,null,null,"Number of members per sleeping room",null,-0.1747970993676084]
[null,null,"Fitness equipment",null,0.20249523957712823,null,null,"Satellite antenna",null,0.17800645919679997,null,null,"Has car/truck",null,0.15221486143047067]
[null,null,"Laminated floor",null,0.17449504422217596,null,null,"Earth, sand floor",null,-0.14661835228265468,null,null,"Taxi/minibus",null,0.15221486143047036]
[null,null,"Satellite antenna",null,0.16479315125833729,null,null,"Laminated floor",null,0.1427399156926322,null,null,"Tractor",null,0.1459858922541005]
[null,null,"Has television",null,0.14911783356589878,null,null,"Dwelling ownership 1",null,0.12769895241680518,null,null,"Concrete, cement floor",null,-0.14291859633254889]
[null,null,"Has car/truck",null,9.5436350966210351E-2,null,null,"No rent paid",null,-9.5497259643658239E-2,null,null,"Vinyl, asphalt strips floor",null,0.14039328067568985]
[null,null,"Taxi/minibus",null,9.5436350966209893E-2,null,null,"Has television",null,9.466679005703621E-2,null,null,"Cable TV/Digiturk etc.",null,0.140356866928983]
[null,null,"Vinyl, asphalt strips floor",null,8.1565559029933232E-2,null,null,"Taxi/minibus",null,8.619106792828693E-2,null,null,"Dwelling ownership 2",null,0.13912966587116171]
[null,null,"No rent paid",null,-7.6189046284015779E-2,null,null,"Has car/truck",null,8.6191067928286319E-2,null,null,"Fitness equipment",null,0.13539227323098738]
[null,null,"Dwelling ownership",null,7.1119760576411353E-2,null,null,"Dwelling ownership",null,-7.2987813494650458E-2,null,null,"LCD/Plasma television",null,0.13389680483116631]
[null,null,"Marley floor",null,6.3154580324724707E-2,null,null,"Washer dryer",null,6.3528118926498567E-2,null,null,"Marley floor",null,0.12826211717548758]
[null,null,"Tractor",null,-5.7231905165005321E-2,null,null,"Garbage grinder",null,4.9898642699731537E-2,null,null,"Laminated floor",null,0.12392113946500324]
[null,null,"Other type of flooring",null,5.6528527990850348E-2,null,null,"Dwelling ownership 2",null,3.5526773651406308E-2,null,null,"Dwelling ownership",null,0.11089068065831668]
[null,null,"Dwelling ownership 2",null,5.5402109224098849E-2,null,null,"Other type of flooring",null,3.3511276100379767E-2,null,null,"Carpet floor",null,9.5359528508792604E-2]
[null,null,"Washer dryer",null,5.3606407052251857E-2,null,null,"Vinyl, asphalt strips floor",null,3.0918109822248518E-2,null,null,"Dwelling ownership 1",null,-8.227922071320401E-2]
[null,null,"Garbage grinder",null,4.5363437843800231E-2,null,null,"Rudimentary wood plank floor",null,-2.1994449752466311E-2,null,null,"Mozaic floor",null,7.3213608940920785E-2]
[null,null,"Carpet floor",null,4.0066585181612741E-2,null,null,"Carpet floor",null,1.5295098916013102E-2,null,null,"Other type of flooring",null,6.7334183141325887E-2]
[null,null,"Mozaic floor",null,3.3651218971961543E-2,null,null,"Tractor",null,-8.4900528005618908E-3,null,null,"Rudimentary wood plank floor",null,6.5026742120684877E-2]
[null,null,"Has motorcycle/scooter",null,2.9198760497901492E-2,null,null,"Mozaic floor",null,3.4007620622148547E-3,null,null,"No rent paid",null,-3.6358736875302021E-2]
[null,null,"Dwelling ownership 1",null,-2.0827653834997534E-2,null,null,"Has motorcycle/scooter",null,1.9976256442473836E-3,null,null,"Garbage grinder",null,5.1083909850118212E-3]
[null,null,"Rudimentary wood plank floor",null,-2.0382008381471431E-2,null,null,"Marley floor",null,-3.3340749052069993E-4,null,null,"Washer dryer",null,-2.1761097176533528E-3]
[]
[]
[]
[null,null,"Communalities",null,null,null,null,"Communalities",null,null,null,null,"Communalities"]
[null,null,null,null,"Extraction",null,null,null,null,"Extraction",null,null,null,null,"Extraction"]
[null,null,"Number of members per sleeping room",null,7.5778764399059034E-2,null,null,"Number of members per sleeping room",null,6.2973097683820423E-2,null,null,"Number of members per sleeping room",null,3.0554025947329564E-2]
[null,null,"Earth, sand floor",null,8.2625215466885046E-2,null,null,"Earth, sand floor",null,2.1496941226080632E-2,null,null,"Earth, sand floor",null,9.081826295793724E-2]
[null,null,"Rudimentary wood plank floor",null,4.1542626566237165E-4,null,null,"Rudimentary wood plank floor",null,4.8375581991376535E-4,null,null,"Rudimentary wood plank floor",null,4.2284771908300527E-3]
[null,null,"Parquet, wood tile floor",null,7.9207013464896434E-2,null,null,"Parquet, wood tile floor",null,6.1515064425549777E-2,null,null,"Parquet, wood tile floor",null,3.1335001464565158E-2]
[null,null,"Vinyl, asphalt strips floor",null,6.652940419865523E-3,null,null,"Vinyl, asphalt strips floor",null,9.5592951498062032E-4,null,null,"Vinyl, asphalt strips floor",null,1.9710273258883027E-2]
[null,null,"Concrete, cement floor",null,0.11862449391594629,null,null,"Concrete, cement floor",null,0.12527707460606252,null,null,"Concrete, cement floor",null,2.0425725177666054E-2]
[null,null,"Carpet floor",null,1.6053312481154297E-3,null,null,"Carpet floor",null,2.3394005085062517E-4,null,null,"Carpet floor",null,9.0934396774192301E-3]
[null,null,"Marley floor",null,3.9885010159921054E-3,null,null,"Marley floor",null,1.1116055473531062E-7,null,null,"Marley floor",null,1.6451170702338504E-2]
[null,null,"Mozaic floor",null,1.1324045382989044E-3,null,null,"Mozaic floor",null,1.1565182603799832E-5,null,null,"Mozaic floor",null,5.3602325341540764E-3]
[null,null,"Laminated floor",null,3.0448520458099145E-2,null,null,"Laminated floor",null,2.0374683531939747E-2,null,null,"Laminated floor",null,1.5356448806304785E-2]
[null,null,"Other type of flooring",null,3.1954744768123511E-3,null,null,"Other type of flooring",null,1.1230056258758842E-3,null,null,"Other type of flooring",null,4.533892219309615E-3]
[null,null,"Dwelling ownership 1",null,4.3379116427048751E-4,null,null,"Dwelling ownership 1",null,1.6307022448349473E-2,null,null,"Dwelling ownership 1",null,6.7698701611721398E-3]
[null,null,"Dwelling ownership 2",null,3.0693937064789787E-3,null,null,"Dwelling ownership 2",null,1.2621516460782575E-3,null,null,"Dwelling ownership 2",null,1.9357063925421102E-2]
[null,null,"Dwelling ownership",null,5.0580203444460748E-3,null,null,"Dwelling ownership",null,5.3272209187298792E-3,null,null,"Dwelling ownership",null,1.229674305686477E-2]
[null,null,"No rent paid",null,5.8047707736678987E-3,null,null,"No rent paid",null,9.1197265994482773E-3,null,null,"No rent paid",null,1.321957747167447E-3]
[null,null,"Has television",null,2.2236128287387087E-2,null,null,"Has television",null,8.9618011397029698E-3,null,null,"Has television",null,5.2066539096849863E-2]
[null,null,"Has refrigerator",null,9.7239854250305915E-2,null,null,"Has refrigerator",null,9.5417235481959822E-2,null,null,"Has refrigerator",null,8.1913525837654405E-2]
[null,null,"Has motorcycle/scooter",null,8.5256761461381257E-4,null,null,"Has motorcycle/scooter",null,3.9905082145547741E-6,null,null,"Has motorcycle/scooter",null,3.0703419569091669E-2]
[null,null,"Has car/truck",null,9.1080970857456787E-3,null,null,"Has car/truck",null,7.4289001906184668E-3,null,null,"Has car/truck",null,2.3169364040297385E-2]
[null,null,"Has a mobile telephone",null,0.11783565207925112,null,null,"Has a mobile telephone",null,7.4552213597035052E-2,null,null,"Has a mobile telephone",null,0.12428816653747418]
[null,null,"Separate bathroom",null,0.16827979902673978,null,null,"Separate bathroom",null,9.2349489826936984E-2,null,null,"Separate bathroom",null,0.16452150121510145]
[null,null,"Gas or electric oven",null,0.85652780285473162,null,null,"Gas or electric oven",null,0.87784334693075661,null,null,"Gas or electric oven",null,0.879891148215459]
[null,null,"Microwave oven",null,7.305044142615276E-2,null,null,"Microwave oven",null,5.8187324453049333E-2,null,null,"Microwave oven",null,6.1152542221860097E-2]
[null,null,"Blender/mixer",null,0.33170886964362217,null,null,"Blender/mixer",null,0.28146040348990969,null,null,"Blender/mixer",null,0.2606784076018776]
[null,null,"Dishwasher",null,0.23108668612548453,null,null,"Dishwasher",null,0.20338072285263589,null,null,"Dishwasher",null,0.11035237457190081]
[null,null,"Garbage grinder",null,2.0578414930083268E-3,null,null,"Garbage grinder",null,2.4898745432754715E-3,null,null,"Garbage grinder",null,2.6095658455750045E-5]
[null,null,"Washing machine",null,0.21939737242282839,null,null,"Washing machine",null,0.16745138405218718,null,null,"Washing machine",null,0.19604511369906416]
[null,null,"Washer dryer",null,2.8736468770517178E-3,null,null,"Washer dryer",null,4.0358218943393458E-3,null,null,"Washer dryer",null,4.7354535032653553E-6]
[null,null,"Iron",null,0.28872169363346867,null,null,"Iron",null,0.21633147994353807,null,null,"Iron",null,0.28919075415187023]
[null,null,"Vacuum cleaner",null,0.30681293819132688,null,null,"Vacuum cleaner",null,0.22804072850327514,null,null,"Vacuum cleaner",null,0.28944815449538269]
[null,null,"LCD/Plasma television",null,4.2608441019011567E-2,null,null,"LCD/Plasma television",null,3.8216239629365538E-2,null,null,"LCD/Plasma television",null,1.792835434399544E-2]
[null,null,"Cable TV/Digiturk etc.",null,5.7991393842064927E-2,null,null,"Cable TV/Digiturk etc.",null,4.5732782619108577E-2,null,null,"Cable TV/Digiturk etc.",null,1.9700050094120243E-2]
[null,null,"Satellite antenna",null,2.7156782701653236E-2,null,null,"Satellite antenna",null,3.1686299515782015E-2,null,null,"Satellite antenna",null,6.734623682294609E-2]
[null,null,"Video camera",null,8.9737082452833614E-2,null,null,"Video camera",null,7.8206748861827699E-2,null,null,"Video camera",null,5.5072871423367413E-2]
[null,null,"DVD/VCD player",null,0.16552286209233269,null,null,"DVD/VCD player",null,0.1214318241471045,null,null,"DVD/VCD player",null,0.13954212714112424]
[null,null,"Camera",null,0.20813694687914996,null,null,"Camera",null,0.17243118726792667,null,null,"Camera",null,0.16330011704592884]
[null,null,"Cellular phone",null,0.18020008237063459,null,null,"Cellular phone",null,0.12194544760170814,null,null,"Cellular phone",null,0.19707335568146467]
[null,null,"Laptop",null,6.9969004031871534E-2,null,null,"Laptop",null,5.4513659430774082E-2,null,null,"Laptop",null,4.4841339644151906E-2]
[null,null,"Computer",null,0.16133552100347645,null,null,"Computer",null,0.12672312884487602,null,null,"Computer",null,9.4695488049073365E-2]
[null,null,"Internet",null,0.17533557641353656,null,null,"Internet",null,0.1448349636251543,null,null,"Internet",null,9.7902113690454248E-2]
[null,null,"Fitness equipment",null,4.1004322051398555E-2,null,null,"Fitness equipment",null,3.5064362420320815E-2,null,null,"Fitness equipment",null,1.8331067650654342E-2]
[null,null,"Air conditioner",null,4.8753237565426308E-2,null,null,"Air conditioner",null,3.7974573186145749E-2,null,null,"Air conditioner",null,3.1096626661941226E-2]
[null,null,"Car",null,0.14125632071978161,null,null,"Car",null,0.12980484164816797,null,null,"Car",null,0.13499565298928093]
[null,null,"Taxi/minibus",null,9.1080970857455919E-3,null,null,"Taxi/minibus",null,7.4289001906185717E-3,null,null,"Taxi/minibus",null,2.3169364040297295E-2]
[null,null,"Tractor",null,3.275490968816163E-3,null,null,"Tractor",null,7.2080996556328806E-5,null,null,"Tractor",null,2.1311880737225838E-2]
[]
[]
[null,null,"Total Variance Explained",null,null,null,null,"Total Variance Explained",null,null,null,null,"Total Variance Explained"]
[null,null,"Component",null,"Extraction Sums of Squared Loadings",null,null,"Component",null,"Extraction Sums of Squared Loadings",null,null,"Component",null,"Extraction Sums of Squared Loadings"]
[null,null,null,null,"Total","% of Variance","Cumulative %",null,null,"Total","% of Variance","Cumulative %",null,null,"Total","% of Variance","Cumulative %"]
[null,null,"1",null,10.562915233851049,20.313298526636633,20.313298526636633,"1",null,9.9353664763490084,19.106473992978863,19.106473992978863,"1",null,10.136609110717442,19.493479059072005,19.493479059072005]
[]
[]
[null,null,"Component Score Coefficient Matrix",null,null,null,null,"Component Score Coefficient Matrix",null,null,null,null,"Component Score Coefficient Matrix"]
[null,null,null,null,"Component",null,null,null,null,"Component",null,null,null,null,"Component"]
[null,null,null,null,"1",null,null,null,null,"1",null,null,null,null,"1"]
[null,null,"Number of members per sleeping room",null,-2.6060933329003461E-2,null,null,"Number of members per sleeping room",null,-2.5257690507812822E-2,null,null,"Number of members per sleeping room",null,-1.7244139283500173E-2]
[null,null,"Earth, sand floor",null,-2.7212754762108247E-2,null,null,"Earth, sand floor",null,-1.4757216317251859E-2,null,null,"Earth, sand floor",null,-2.9729930643318556E-2]
[null,null,"Rudimentary wood plank floor",null,-1.9295817423728881E-3,null,null,"Rudimentary wood plank floor",null,-2.2137532425023044E-3,null,null,"Rudimentary wood plank floor",null,6.4150389356468392E-3]
[null,null,"Parquet, wood tile floor",null,2.6643914081862688E-2,null,null,"Parquet, wood tile floor",null,2.4963579038259093E-2,null,null,"Parquet, wood tile floor",null,1.7463132941640779E-2]
[null,null,"Vinyl, asphalt strips floor",null,7.7218795402749715E-3,null,null,"Vinyl, asphalt strips floor",null,3.1119244464558626E-3,null,null,"Vinyl, asphalt strips floor",null,1.3850122772047307E-2]
[null,null,"Concrete, cement floor",null,-3.2606440520382148E-2,null,null,"Concrete, cement floor",null,-3.5624756993366598E-2,null,null,"Concrete, cement floor",null,-1.4099251018907395E-2]
[null,null,"Carpet floor",null,3.7931370549307325E-3,null,null,"Carpet floor",null,1.5394599637993081E-3,null,null,"Carpet floor",null,9.4074386678252124E-3]
[null,null,"Marley floor",null,5.9788968221890842E-3,null,null,"Marley floor",null,-3.3557643929327771E-5,null,null,"Marley floor",null,1.2653355355281084E-2]
[null,null,"Mozaic floor",null,3.1857889822043866E-3,null,null,"Mozaic floor",null,3.4228853765085748E-4,null,null,"Mozaic floor",null,7.2226923363861387E-3]
[null,null,"Laminated floor",null,1.6519591453595165E-2,null,null,"Laminated floor",null,1.4366849580478229E-2,null,null,"Laminated floor",null,1.2225107835516846E-2]
[null,null,"Other type of flooring",null,5.3516029182637927E-3,null,null,"Other type of flooring",null,3.3729280324135864E-3,null,null,"Other type of flooring",null,6.642673344297495E-3]
[null,null,"Dwelling ownership 1",null,-1.9717713693518059E-3,null,null,"Dwelling ownership 1",null,1.2852968506072789E-2,null,null,"Dwelling ownership 1",null,-8.1170359648385908E-3]
[null,null,"Dwelling ownership 2",null,5.2449639136127229E-3,null,null,"Dwelling ownership 2",null,3.5757889491019042E-3,null,null,"Dwelling ownership 2",null,1.3725464240705488E-2]
[null,null,"Dwelling ownership",null,6.7329670836033364E-3,null,null,"Dwelling ownership",null,-7.3462628347325549E-3,null,null,"Dwelling ownership",null,1.0939622850907008E-2]
[null,null,"No rent paid",null,-7.2128805918892733E-3,null,null,"No rent paid",null,-9.6118507425959621E-3,null,null,"No rent paid",null,-3.5868737245535009E-3]
[null,null,"Has television",null,1.4117109743342425E-2,null,null,"Has television",null,9.5282635303276537E-3,null,null,"Has television",null,2.2510578488952094E-2]
[null,null,"Has refrigerator",null,2.9521495552321315E-2,null,null,"Has refrigerator",null,3.1090630091145658E-2,null,null,"Has refrigerator",null,2.82348256575988E-2]
[null,null,"Has motorcycle/scooter",null,2.7642710228638415E-3,null,null,"Has motorcycle/scooter",null,2.0106209962186114E-4,null,null,"Has motorcycle/scooter",null,1.7286245405102495E-2]
[null,null,"Has car/truck",null,9.0350389881350933E-3,null,null,"Has car/truck",null,8.675177521982996E-3,null,null,"Has car/truck",null,1.5016349132919984E-2]
[null,null,"Has a mobile telephone",null,3.2497844784994671E-2,null,null,"Has a mobile telephone",null,2.7481876293680027E-2,null,null,"Has a mobile telephone",null,3.4779408471503487E-2]
[null,null,"Separate bathroom",null,3.88357947994033E-2,null,null,"Separate bathroom",null,3.0586751812576075E-2,null,null,"Separate bathroom",null,4.0014614046466064E-2]
[null,null,"Gas or electric oven",null,8.7616709250657232E-2,null,null,"Gas or electric oven",null,9.4302806957397164E-2,null,null,"Gas or electric oven",null,9.253835495960433E-2]
[null,null,"Microwave oven",null,2.5587486566542236E-2,null,null,"Microwave oven",null,2.4278972483167852E-2,null,null,"Microwave oven",null,2.4395771592325536E-2]
[null,null,"Blender/mixer",null,5.4524883654040519E-2,null,null,"Blender/mixer",null,5.3397971819065936E-2,null,null,"Blender/mixer",null,5.0368594249885233E-2]
[null,null,"Dishwasher",null,4.55096680440535E-2,null,null,"Dishwasher",null,4.5391130795781998E-2,null,null,"Dishwasher",null,3.2771637468712776E-2]
[null,null,"Garbage grinder",null,4.2945945167129334E-3,null,null,"Garbage grinder",null,5.0223253282618728E-3,null,null,"Garbage grinder",null,5.0395461926323242E-4]
[null,null,"Washing machine",null,4.4343698868440667E-2,null,null,"Washing machine",null,4.1187030334926926E-2,null,null,"Washing machine",null,4.368026974162937E-2]
[null,null,"Washer dryer",null,5.0749632904805511E-3,null,null,"Washer dryer",null,6.3941394691103054E-3,null,null,"Washer dryer",null,-2.1467827099622011E-4]
[null,null,"Iron",null,5.0869317829087164E-2,null,null,"Iron",null,4.6814023577077674E-2,null,null,"Iron",null,5.3051724104944228E-2]
[null,null,"Vacuum cleaner",null,5.2438835667459903E-2,null,null,"Vacuum cleaner",null,4.806426646835886E-2,null,null,"Vacuum cleaner",null,5.3075328757868537E-2]
[null,null,"LCD/Plasma television",null,1.9541775850526633E-2,null,null,"LCD/Plasma television",null,1.9676148181740735E-2,null,null,"LCD/Plasma television",null,1.3209230361817656E-2]
[null,null,"Cable TV/Digiturk etc.",null,2.279806455119195E-2,null,null,"Cable TV/Digiturk etc.",null,2.1524343902132127E-2,null,null,"Cable TV/Digiturk etc.",null,1.384653047147528E-2]
[null,null,"Satellite antenna",null,1.5601105150425095E-2,null,null,"Satellite antenna",null,1.791644622476098E-2,null,null,"Satellite antenna",null,2.560141485317546E-2]
[null,null,"Video camera",null,2.8359735637530394E-2,null,null,"Video camera",null,2.8147396115470569E-2,null,null,"Video camera",null,2.3151341478925263E-2]
[null,null,"DVD/VCD player",null,3.8516356603022307E-2,null,null,"DVD/VCD player",null,3.5073763430158805E-2,null,null,"DVD/VCD player",null,3.6851907295544613E-2]
[null,null,"Camera",null,4.3190754936791351E-2,null,null,"Camera",null,4.1794970027186587E-2,null,null,"Camera",null,3.9865805954558374E-2]
[null,null,"Cellular phone",null,4.0187750555476597E-2,null,null,"Cellular phone",null,3.5147861379862484E-2,null,null,"Cellular phone",null,4.3794669809418464E-2]
[null,null,"Laptop",null,2.5042002315712641E-2,null,null,"Laptop",null,2.3500049505770022E-2,null,null,"Laptop",null,2.0890392022078381E-2]
[null,null,"Computer",null,3.8026048983613371E-2,null,null,"Computer",null,3.5829772653413763E-2,null,null,"Computer",null,3.0357915224399207E-2]
[null,null,"Internet",null,3.9641604843954029E-2,null,null,"Internet",null,3.8304766223302276E-2,null,null,"Internet",null,3.0867633465927122E-2]
[null,null,"Fitness equipment",null,1.9170393314166746E-2,null,null,"Fitness equipment",null,1.8847297337230701E-2,null,null,"Fitness equipment",null,1.3356761788104965E-2]
[null,null,"Air conditioner",null,2.0903448365355383E-2,null,null,"Air conditioner",null,1.9613836897222552E-2,null,null,"Air conditioner",null,1.7396582474218068E-2]
[null,null,"Car",null,3.558116391214676E-2,null,null,"Car",null,3.6262818368774416E-2,null,null,"Car",null,3.624659309877791E-2]
[null,null,"Taxi/minibus",null,9.0350389881350499E-3,null,null,"Taxi/minibus",null,8.6751775219830584E-3,null,null,"Taxi/minibus",null,1.5016349132919953E-2]
[null,null,"Tractor",null,-5.4181922223131953E-3,null,null,"Tractor",null,-8.5452839819973785E-4,null,null,"Tractor",null,1.4401846875968566E-2]
[]
[]
[null,null,"Component Score Covariance Matrix",null,null,null,null,"Component Score Covariance Matrix",null,null,null,null,"Component Score Covariance Matrix"]
[null,null,"Component",null,"1",null,null,"Component",null,"1",null,null,"Component",null,"1"]
[null,null,"1",null,1.0000000000000002,null,null,"1",null,1,null,null,"1",null,0.99999999999999978]
[]
[]
[]
[]
[]
[]
[]
[]
[]
[]
[]
[]
[]
[]
[]
[]
[]
[]
[]
[]
[]
[]
[]
[]
[]
[]
[]
[]
[]
[]
[]
[]
[]
[]
[]
[]
[]
[]
[]
[]
[]
[]
[]
[]
[]
[]
[]
[]
[]
[]
[]
[]
[]
[]
[]
[]
[]
[]
[]
[]
[]
[]
[]
[]
[]
[]
[]
[]
[]
[]
[]
[]
[]
[]
[]
[]
[]
[]
[]
[]
[]
[]
[]
[]
[]
[]
[]
[]
[]
[]
[]
[]
[]
[]
[]
[]
[]
[]
[]
[]
[]
[]
[]
[]
[]
[]
[]
[]
[]
[]
[]
[]
[]
[]
[]
[]
[]
[]
[]
[]
[]
[]
[]
[]
[]
[]
[]
[]
[]
[]
[]
[]
[]
[]
[]
[]
[]
[]
[]
[]
[]
[]
[]
[]
[]
[]
[]
[]
[]
[]
[]
[]
[]
[]
[]
[]
[]
[]
[]
[]
[]
[]
[]
[]
[]
[]
[]
[]
[]
[]
[]
[]
[]
[]
[]
[]
[]
[]
[]
[]
[]
[]
[]
[]
[]
[]
[]
[]
[]
[]
[]
[]
[]
[]
[]
[]
[]
[]
[]
[]
[]
[]
[]
[]
[]
[]
[]
[]
[]
[]
[]
[]
[]
[]
[]
[]
[]
[]
[]
[]
[]
[]
[]
[]
[]
[]
[]
[]
[]
[]
[]
[]
[]
[]
[]
[]
[]
[]
[]
[]
[]
[]
[]
[]
[]
[]
[]
[]
[]
[]
[]
[]
[]
[]
[]
[]
[]
[]
[]
[]
[]
[]
[]
[]
[]
[]
[]
[]
[]
[]
[]
[]
[]
[]
[]
[]
[]
[]
[]
[]
[]
[]
[]
[]
[]
[]
[]
[]
[]
[]
[]
[]
[]
[]
[]
[]
[]
[]
[]
[]
[]
[]
[]
[]
[]
[]
[]
[]
[]
[]
[]
[]
[]
[]
[]
[]
[]
[]
[]
[]
[]
[]
[]
[]
[]
[]
[]
[]
[]
[]
[]
[]
[]
[]
[]
[]
[]
[]
[]
[]
[]
[]
[]
[]
[]
[]
[]
[]
[]
[]
[]
[]
[]
[]
[]
[]
[]
[]
[]
[]
[]
[]
[]
[]
[]
[]
[]
[]
[]
[]
[]
[]
[]
[]
[]
[]
[]
[]
[]
[]
[]
[]
[]
[]
[]
[]
[]
[]
[]
[]
[]
[]
[]
[]
[]
[]
[]
[]
[]
[]
[]
[]
[]
[]
[]
[]
[]
[]
[]
[]
[]
[]
[]
[]
[]
[]
[]
[]
[]
[]
[]
[]
[]
[]
[]
[]
[]
[]
[]
[]
[]
[]
[]
[]
[]
[]
[]
[]
[]
[]
[]
[]
[]
[]
[]
[]
[]
[]
[]
[]
[]
[]
[]
[]
[]
[]
[]
[]
[]
[]
[]
[]
[]
[]
[]
[]
["DHS08"]
["Turkey",null,"Count"]
["W_text_t","",10525]
["W_text_i","",10525]
["S_text_s","",10525]
["S_text_i","",10525]
["Urban/Rural","Urban",7672]
[null,"Rural",2853]
[null,"Missing",0]
["2008"]
[]
["Sub-national region names","Weighted population"]
[{"$f":"R15","v":"Central"},{"$f":"BR122+BR123","v":8867.1803969999673}]
[{"$f":"S15","v":"East"},{"$f":"BS122+BS123","v":7924.0622739999963}]
[{"$f":"T15","v":"North"},{"$f":"BT122+BT123","v":2869.6433459999726}]
[{"$f":"U15","v":"South"},{"$f":"BU122+BU123","v":5178.9561920000015}]
[{"$f":"V15","v":"West"},{"$f":"BV122+BV123","v":17280.782429000086}]
[{"$f":"W15","v":0},{"$f":"BW122+BW123","v":0}]
[{"$f":"X15","v":0},{"$f":"BX122+XR123","v":0}]
[{"$f":"Y15","v":0},{"$f":"BY122+BY123","v":0}]
[{"$f":"Z15","v":0},{"$f":"BZ122+BZ123","v":0}]
[{"$f":"AA15","v":0},{"$f":"CA122+CA123","v":0}]
[{"$f":"AB15","v":0},{"$f":"CB122+CB123","v":0}]
[{"$f":"AC15","v":0},{"$f":"CC122+CC123","v":0}]
[{"$f":"AD15","v":0},{"$f":"CD122+CD123","v":0}]
[{"$f":"AE15","v":0},{"$f":"CE122+CE123","v":0}]
[{"$f":"AF15","v":0},{"$f":"CF122+CF123","v":0}]
[{"$f":"AG15","v":0},{"$f":"CG122+CG123","v":0}]
[{"$f":"AH15","v":0},{"$f":"CH122+CH123","v":0}]
[{"$f":"AI15","v":0},{"$f":"CI122+CI123","v":0}]
[{"$f":"AJ15","v":0},{"$f":"CJ122+CJ123","v":0}]
[{"$f":"AK15","v":0},{"$f":"CK122+CK123","v":0}]
[{"$f":"AL15","v":0},{"$f":"CL122+CL123","v":0}]
[{"$f":"AM15","v":0},{"$f":"CM122+CM123","v":0}]
[{"$f":"AN15","v":0},{"$f":"CN122+CN123","v":0}]
[{"$f":"AO15","v":0},{"$f":"CO122+CO123","v":0}]
[{"$f":"AP15","v":0},{"$f":"CP122+CP123","v":0}]
[{"$f":"AQ15","v":0},{"$f":"CQ122+CQ123","v":0}]
[{"$f":"AR15","v":0},{"$f":"CR122+CR123","v":0}]
[{"$f":"AS15","v":0},{"$f":"CS122+CS123","v":0}]
[{"$f":"AT15","v":0},{"$f":"CT122+CT123","v":0}]
[{"$f":"AU15","v":0},{"$f":"CU122+CU123","v":0}]
[{"$f":"AV15","v":0},{"$f":"CV122+CV123","v":0}]
[{"$f":"AW15","v":0},{"$f":"CW122+CW123","v":0}]
[{"$f":"AX15","v":0},{"$f":"CX122+CX123","v":0}]
[{"$f":"AY15","v":0},{"$f":"CY122+CY123","v":0}]
[]
[{"$f":"34-COUNTIF(A1037:A1071,\"0\")","v":5},"Sub-regions"]

{"sheet":"DHS13","index":6,"n_rows":1072,"n_cols":74,"rows_kept":1072,"cut":false,"hidden":false,"merged":[[346,52,347,52],[348,52,349,52],[350,52,351,52],[352,52,353,52],[152,52,156,52],[270,52,272,52],[273,52,275,52],[276,52,283,52],[338,54,338,58],[338,59,338,63],[338,64,338,68],[340,52,341,52],[342,52,343,52],[344,52,345,52],[221,52,223,52],[224,52,225,52],[226,52,229,52],[258,54,258,58],[258,59,258,63],[258,64,258,68],[260,52,262,52],[263,52,266,52],[267,52,269,52],[119,64,119,68],[121,52,122,52],[123,52,126,52],[127,52,128,52],[132,54,132,58],[132,59,132,63],[132,64,132,68],[134,52,138,52],[219,54,219,58],[219,59,219,63],[219,64,219,68],[13,64,13,68],[15,52,16,52],[17,52,20,52],[21,52,22,52],[26,54,26,58],[26,59,26,63],[26,64,26,68],[40,52,41,52],[55,54,55,58],[55,59,55,63],[55,64,55,68],[139,52,142,52],[143,0,146,0],[143,52,146,52],[147,0,149,0],[147,52,149,52],[150,0,151,0],[150,52,151,52],[13,54,13,58],[13,59,13,63],[119,54,119,58],[119,59,119,63],[42,52,43,52],[44,52,45,52],[46,0,48,0],[46,52,48,52],[49,0,51,0],[49,52,51,52],[52,0,54,0],[52,52,54,52],[32,52,33,52],[34,52,35,52],[36,52,37,52],[38,0,39,0],[38,52,39,52],[13,2,13,6],[13,7,13,11],[28,52,29,52],[30,0,31,0],[30,52,31,52],[26,2,26,6],[26,7,26,11],[26,12,26,16],[13,12,13,16],[15,0,16,0],[17,0,20,0],[21,0,22,0],[23,0,25,0],[32,0,33,0],[55,2,55,6],[55,7,55,11],[55,12,55,16],[28,0,29,0],[34,0,35,0],[36,0,37,0],[40,0,41,0],[42,0,43,0],[44,0,45,0],[139,0,142,0],[107,0,107,1],[119,2,119,6],[119,7,119,11],[57,0,69,0],[132,12,132,16],[134,0,138,0],[119,12,119,16],[121,0,122,0],[123,0,126,0],[127,0,128,0],[129,0,131,0],[152,0,155,0],[132,2,132,6],[132,7,132,11],[219,2,219,6],[219,7,219,11],[219,12,219,16],[207,0,207,1],[1024,0,1024,2],[1025,0,1025,1],[1030,0,1032,0],[1033,0,1033,2],[398,2,398,5],[221,0,223,0],[398,7,398,10],[398,12,398,15],[399,2,399,4],[399,7,399,9],[399,12,399,14],[400,2,401,3],[400,7,401,8],[400,12,401,13],[405,2,405,3],[405,7,405,8],[405,12,405,13],[406,2,406,3],[406,7,406,8],[406,12,406,13],[401,1,444,1],[402,2,402,3],[402,7,402,8],[402,12,402,13],[403,2,403,3],[403,7,403,8],[403,12,403,13],[404,2,404,3],[404,7,404,8],[404,12,404,13],[409,2,409,3],[409,7,409,8],[409,12,409,13],[410,2,410,3],[410,7,410,8],[410,12,410,13],[407,2,407,3],[407,7,407,8],[407,12,407,13],[408,2,408,3],[408,7,408,8],[408,12,408,13],[413,2,413,3],[413,7,413,8],[413,12,413,13],[414,2,414,3],[414,7,414,8],[414,12,414,13],[411,2,411,3],[411,7,411,8],[411,12,411,13],[412,2,412,3],[412,7,412,8],[412,12,412,13],[417,2,417,3],[417,7,417,8],[417,12,417,13],[418,2,418,3],[418,7,418,8],[418,12,418,13],[415,2,415,3],[415,7,415,8],[415,12,415,13],[416,2,416,3],[416,7,416,8],[416,12,416,13],[421,2,421,3],[421,7,421,8],[421,12,421,13],[422,2,422,3],[422,7,422,8],[422,12,422,13],[419,2,419,3],[419,7,419,8],[419,12,419,13],[420,2,420,3],[420,7,420,8],[420,12,420,13],[425,2,425,3],[425,7,425,8],[425,12,425,13],[426,2,426,3],[426,7,426,8],[426,12,426,13],[423,2,423,3],[423,7,423,8],[423,12,423,13],[424,2,424,3],[424,7,424,8],[424,12,424,13],[429,2,429,3],[429,7,429,8],[429,12,429,13],[430,2,430,3],[430,7,430,8],[430,12,430,13],[427,2,427,3],[427,7,427,8],[427,12,427,13],[428,2,428,3],[428,7,428,8],[428,12,428,13],[433,2,433,3],[433,7,433,8],[433,12,433,13],[434,2,434,3],[434,7,434,8],[434,12,434,13],[431,2,431,3],[431,7,431,8],[431,12,431,13],[432,2,432,3],[432,7,432,8],[432,12,432,13],[437,2,437,3],[437,7,437,8],[437,12,437,13],[438,2,438,3],[438,7,438,8],[438,12,438,13],[435,2,435,3],[435,7,435,8],[435,12,435,13],[436,2,436,3],[436,7,436,8],[436,12,436,13],[441,2,441,3],[441,7,441,8],[441,12,441,13],[442,2,442,3],[442,7,442,8],[442,12,442,13],[439,2,439,3],[439,7,439,8],[439,12,439,13],[440,2,440,3],[440,7,440,8],[440,12,440,13],[445,2,445,3],[445,7,445,8],[445,12,445,13],[446,2,446,3],[446,7,446,8],[446,12,446,13],[443,2,443,3],[443,7,443,8],[443,12,443,13],[444,2,444,4],[444,7,444,9],[444,12,444,14],[449,2,449,3],[449,7,449,8],[449,12,449,13],[450,2,450,3],[450,7,450,8],[450,12,450,13],[447,2,447,3],[447,7,447,8],[447,12,447,13],[448,2,448,3],[448,7,448,8],[448,12,448,13],[453,2,453,3],[453,7,453,8],[453,12,453,13],[454,2,454,3],[454,7,454,8],[454,12,454,13],[451,2,451,3],[451,7,451,8],[451,12,451,13],[452,2,452,3],[452,7,452,8],[452,12,452,13],[457,2,457,3],[457,7,457,8],[457,12,457,13],[458,2,458,3],[458,7,458,8],[458,12,458,13],[455,2,455,3],[455,7,455,8],[455,12,455,13],[456,2,456,3],[456,7,456,8],[456,12,456,13],[461,2,461,3],[461,7,461,8],[461,12,461,13],[462,2,462,3],[462,7,462,8],[462,12,462,13],[459,2,459,3],[459,7,459,8],[459,12,459,13],[460,2,460,3],[460,7,460,8],[460,12,460,13],[465,2,465,3],[465,7,465,8],[465,12,465,13],[466,2,466,3],[466,7,466,8],[466,12,466,13],[463,2,463,3],[463,7,463,8],[463,12,463,13],[464,2,464,3],[464,7,464,8],[464,12,464,13],[469,2,469,3],[469,7,469,8],[469,12,469,13],[470,2,470,3],[470,7,470,8],[470,12,470,13],[467,2,467,3],[467,7,467,8],[467,12,467,13],[468,2,468,3],[468,7,468,8],[468,12,468,13],[473,2,473,3],[473,7,473,8],[473,12,473,13],[474,2,474,3],[474,7,474,8],[474,12,474,13],[471,2,471,3],[471,7,471,8],[471,12,471,13],[472,2,472,3],[472,7,472,8],[472,12,472,13],[477,2,477,3],[477,7,477,8],[477,12,477,13],[478,2,478,3],[478,7,478,8],[478,12,478,13],[475,2,475,3],[475,7,475,8],[475,12,475,13],[476,2,476,3],[476,7,476,8],[476,12,476,13],[481,2,481,3],[481,7,481,8],[481,12,481,13],[482,2,482,3],[482,7,482,8],[482,12,482,13],[479,2,479,3],[479,7,479,8],[479,12,479,13],[480,2,480,3],[480,7,480,8],[480,12,480,13],[485,2,485,3],[485,7,485,8],[485,12,485,13],[486,2,486,3],[486,7,486,8],[486,12,486,13],[483,2,483,3],[483,7,483,8],[483,12,483,13],[484,2,484,3],[484,7,484,8],[484,12,484,13],[487,2,487,6],[487,7,487,11],[487,12,487,16],[488,2,489,3],[488,4,488,6],[488,7,489,8],[488,9,488,11],[488,12,489,13],[488,14,488,16],[492,2,492,3],[492,7,492,8],[492,12,492,13],[493,2,493,4],[493,7,493,9],[493,12,493,14],[490,2,490,3],[490,7,490,8],[490,12,490,13],[491,2,491,3],[491,7,491,8],[491,12,491,13],[497,2,497,3],[497,7,497,8],[497,12,497,13],[498,2,498,3],[498,7,498,8],[498,12,498,13],[494,2,495,3],[494,7,495,8],[494,12,495,13],[496,2,496,3],[496,7,496,8],[496,12,496,13],[501,2,501,3],[501,7,501,8],[501,12,501,13],[502,2,502,3],[502,7,502,8],[502,12,502,13],[499,2,499,3],[499,7,499,8],[499,12,499,13],[500,2,500,3],[500,7,500,8],[500,12,500,13],[505,2,505,3],[505,7,505,8],[505,12,505,13],[506,2,506,3],[506,7,506,8],[506,12,506,13],[503,2,503,3],[503,7,503,8],[503,12,503,13],[504,2,504,3],[504,7,504,8],[504,12,504,13],[509,2,509,3],[509,7,509,8],[509,12,509,13],[510,2,510,3],[510,7,510,8],[510,12,510,13],[507,2,507,3],[507,7,507,8],[507,12,507,13],[508,2,508,3],[508,7,508,8],[508,12,508,13],[513,2,513,3],[513,7,513,8],[513,12,513,13],[514,2,514,3],[514,7,514,8],[514,12,514,13],[511,2,511,3],[511,7,511,8],[511,12,511,13],[512,2,512,3],[512,7,512,8],[512,12,512,13],[517,2,517,3],[517,7,517,8],[517,12,517,13],[518,2,518,3],[518,7,518,8],[518,12,518,13],[515,2,515,3],[515,7,515,8],[515,12,515,13],[516,2,516,3],[516,7,516,8],[516,12,516,13],[521,2,521,3],[521,7,521,8],[521,12,521,13],[522,2,522,3],[522,7,522,8],[522,12,522,13],[519,2,519,3],[519,7,519,8],[519,12,519,13],[520,2,520,3],[520,7,520,8],[520,12,520,13],[525,2,525,3],[525,7,525,8],[525,12,525,13],[526,2,526,3],[526,7,526,8],[526,12,526,13],[523,2,523,3],[523,7,523,8],[523,12,523,13],[524,2,524,3],[524,7,524,8],[524,12,524,13],[529,2,529,3],[529,7,529,8],[529,12,529,13],[530,2,530,3],[530,7,530,8],[530,12,530,13],[527,2,527,3],[527,7,527,8],[527,12,527,13],[528,2,528,3],[528,7,528,8],[528,12,528,13],[533,2,533,3],[533,7,533,8],[533,12,533,13],[534,2,534,3],[534,7,534,8],[534,12,534,13],[531,2,531,3],[531,7,531,8],[531,12,531,13],[532,2,532,3],[532,7,532,8],[532,12,532,13],[537,2,537,4],[537,7,537,9],[537,12,537,14],[538,2,538,3],[538,7,538,8],[538,12,538,13],[535,2,535,3],[535,7,535,8],[535,12,535,13],[536,2,536,3],[536,7,536,8],[536,12,536,13],[541,2,541,3],[541,7,541,8],[541,12,541,13],[542,2,542,3],[542,7,542,8],[542,12,542,13],[539,2,539,3],[539,7,539,8],[539,12,539,13],[540,2,540,3],[540,7,540,8],[540,12,540,13],[545,2,545,3],[545,7,545,8],[545,12,545,13],[546,2,546,3],[546,7,546,8],[546,12,546,13],[543,2,543,3],[543,7,543,8],[543,12,543,13],[544,2,544,3],[544,7,544,8],[544,12,544,13],[549,2,549,3],[549,7,549,8],[549,12,549,13],[550,2,550,3],[550,7,550,8],[550,12,550,13],[547,2,547,3],[547,7,547,8],[547,12,547,13],[548,2,548,3],[548,7,548,8],[548,12,548,13],[553,2,553,3],[553,7,553,8],[553,12,553,13],[554,2,554,3],[554,7,554,8],[554,12,554,13],[551,2,551,3],[551,7,551,8],[551,12,551,13],[552,2,552,3],[552,7,552,8],[552,12,552,13],[557,2,557,3],[557,7,557,8],[557,12,557,13],[558,2,558,3],[558,7,558,8],[558,12,558,13],[555,2,555,3],[555,7,555,8],[555,12,555,13],[556,2,556,3],[556,7,556,8],[556,12,556,13],[561,2,561,3],[561,7,561,8],[561,12,561,13],[562,2,562,3],[562,7,562,8],[562,12,562,13],[559,2,559,3],[559,7,559,8],[559,12,559,13],[560,2,560,3],[560,7,560,8],[560,12,560,13],[565,2,565,3],[565,7,565,8],[565,12,565,13],[566,2,566,3],[566,7,566,8],[566,12,566,13],[563,2,563,3],[563,7,563,8],[563,12,563,13],[564,2,564,3],[564,7,564,8],[564,12,564,13],[569,2,569,3],[569,7,569,8],[569,12,569,13],[570,2,570,3],[570,7,570,8],[570,12,570,13],[567,2,567,3],[567,7,567,8],[567,12,567,13],[568,2,568,3],[568,7,568,8],[568,12,568,13],[573,2,573,3],[573,7,573,8],[573,12,573,13],[574,2,574,3],[574,7,574,8],[574,12,574,13],[571,2,571,3],[571,7,571,8],[571,12,571,13],[572,2,572,3],[572,7,572,8],[572,12,572,13],[577,2,577,3],[577,7,577,8],[577,12,577,13],[578,2,578,3],[578,7,578,8],[578,12,578,13],[575,2,575,3],[575,7,575,8],[575,12,575,13],[576,2,576,3],[576,7,576,8],[576,12,576,13],[581,2,581,3],[581,7,581,8],[581,12,581,13],[582,2,582,3],[582,7,582,8],[582,12,582,13],[579,2,579,3],[579,7,579,8],[579,12,579,13],[580,2,580,3],[580,7,580,8],[580,12,580,13],[585,2,585,3],[585,7,585,8],[585,12,585,13],[586,2,586,3],[586,7,586,8],[586,12,586,13],[583,2,583,3],[583,7,583,8],[583,12,583,13],[584,2,584,3],[584,7,584,8],[584,12,584,13],[589,2,589,3],[589,7,589,8],[589,12,589,13],[590,2,590,3],[590,7,590,8],[590,12,590,13],[587,2,587,3],[587,7,587,8],[587,12,587,13],[588,2,588,3],[588,7,588,8],[588,12,588,13],[593,2,593,3],[593,7,593,8],[593,12,593,13],[594,2,594,3],[594,7,594,8],[594,12,594,13],[591,2,591,3],[591,7,591,8],[591,12,591,13],[592,2,592,3],[592,7,592,8],[592,12,592,13],[597,2,597,3],[597,7,597,8],[597,12,597,13],[598,2,598,3],[598,7,598,8],[598,12,598,13],[595,2,595,3],[595,7,595,8],[595,12,595,13],[596,2,596,3],[596,7,596,8],[596,12,596,13],[601,2,601,3],[601,7,601,8],[601,12,601,13],[602,2,602,3],[602,7,602,8],[602,12,602,13],[599,2,599,3],[599,7,599,8],[599,12,599,13],[600,2,600,3],[600,7,600,8],[600,12,600,13],[605,2,605,3],[605,7,605,8],[605,12,605,13],[606,2,606,3],[606,7,606,8],[606,12,606,13],[603,2,603,3],[603,7,603,8],[603,12,603,13],[604,2,604,3],[604,7,604,8],[604,12,604,13],[609,2,609,3],[609,7,609,8],[609,12,609,13],[610,2,610,3],[610,7,610,8],[610,12,610,13],[607,2,607,3],[607,7,607,8],[607,12,607,13],[608,2,608,3],[608,7,608,8],[608,12,608,13],[613,2,613,3],[613,7,613,8],[613,12,613,13],[614,2,614,3],[614,7,614,8],[614,12,614,13],[611,2,611,3],[611,7,611,8],[611,12,611,13],[612,2,612,3],[612,7,612,8],[612,12,612,13],[617,2,617,3],[617,7,617,8],[617,12,617,13],[618,2,618,3],[618,7,618,8],[618,12,618,13],[615,2,615,3],[615,7,615,8],[615,12,615,13],[616,2,616,3],[616,7,616,8],[616,12,616,13],[621,2,621,3],[621,7,621,8],[621,12,621,13],[622,2,622,3],[622,7,622,8],[622,12,622,13],[619,2,619,3],[619,7,619,8],[619,12,619,13],[620,2,620,3],[620,7,620,8],[620,12,620,13],[625,2,625,3],[625,7,625,8],[625,12,625,13],[626,2,626,3],[626,7,626,8],[626,12,626,13],[623,2,623,3],[623,7,623,8],[623,12,623,13],[624,2,624,3],[624,7,624,8],[624,12,624,13],[629,2,629,3],[629,7,629,8],[629,12,629,13],[630,2,630,3],[630,7,630,8],[630,12,630,13],[627,2,627,3],[627,7,627,8],[627,12,627,13],[628,2,628,3],[628,7,628,8],[628,12,628,13],[633,2,633,3],[633,7,633,8],[633,12,633,13],[634,2,634,3],[634,7,634,8],[634,12,634,13],[631,2,631,3],[631,7,631,8],[631,12,631,13],[632,2,632,3],[632,7,632,8],[632,12,632,13],[637,2,637,3],[637,7,637,8],[637,12,637,13],[638,2,638,3],[638,7,638,8],[638,12,638,13],[635,2,635,3],[635,7,635,8],[635,12,635,13],[636,2,636,3],[636,7,636,8],[636,12,636,13],[641,2,641,3],[641,7,641,8],[641,12,641,13],[642,2,642,3],[642,7,642,8],[642,12,642,13],[639,2,639,3],[639,7,639,8],[639,12,639,13],[640,2,640,3],[640,7,640,8],[640,12,640,13],[645,2,645,3],[645,7,645,8],[645,12,645,13],[646,2,646,3],[646,7,646,8],[646,12,646,13],[643,2,643,3],[643,7,643,8],[643,12,643,13],[644,2,644,3],[644,7,644,8],[644,12,644,13],[649,2,649,3],[649,7,649,8],[649,12,649,13],[650,2,650,3],[650,7,650,8],[650,12,650,13],[647,2,647,3],[647,7,647,8],[647,12,647,13],[648,2,648,3],[648,7,648,8],[648,12,648,13],[653,2,653,3],[653,7,653,8],[653,12,653,13],[654,2,654,3],[654,7,654,8],[654,12,654,13],[651,2,651,3],[651,7,651,8],[651,12,651,13],[652,2,652,3],[652,7,652,8],[652,12,652,13],[657,2,657,3],[657,7,657,8],[657,12,657,13],[658,2,658,3],[658,7,658,8],[658,12,658,13],[655,2,655,3],[655,7,655,8],[655,12,655,13],[656,2,656,3],[656,7,656,8],[656,12,656,13],[661,2,661,3],[661,7,661,8],[661,12,661,13],[662,2,662,3],[662,7,662,8],[662,12,662,13],[659,2,659,3],[659,7,659,8],[659,12,659,13],[660,2,660,3],[660,7,660,8],[660,12,660,13],[665,2,665,3],[665,7,665,8],[665,12,665,13],[666,2,666,3],[666,7,666,8],[666,12,666,13],[663,2,663,3],[663,7,663,8],[663,12,663,13],[664,2,664,3],[664,7,664,8],[664,12,664,13],[669,2,669,3],[669,7,669,8],[669,12,669,13],[670,2,670,3],[670,7,670,8],[670,12,670,13],[667,2,667,3],[667,7,667,8],[667,12,667,13],[668,2,668,3],[668,7,668,8],[668,12,668,13],[673,2,673,3],[673,7,673,8],[673,12,673,13],[674,2,674,3],[674,7,674,8],[674,12,674,13],[671,2,671,3],[671,7,671,8],[671,12,671,13],[672,2,672,3],[672,7,672,8],[672,12,672,13],[677,2,677,3],[677,7,677,8],[677,12,677,13],[678,2,678,3],[678,7,678,8],[678,12,678,13],[675,2,675,3],[675,7,675,8],[675,12,675,13],[676,2,676,3],[676,7,676,8],[676,12,676,13],[681,2,681,3],[681,7,681,8],[681,12,681,13],[682,2,682,3],[682,7,682,8],[682,12,682,13],[679,2,679,3],[679,7,679,8],[679,12,679,13],[680,2,680,3],[680,7,680,8],[680,12,680,13],[685,2,685,3],[685,7,685,8],[685,12,685,13],[686,2,686,3],[686,7,686,8],[686,12,686,13],[683,2,683,3],[683,7,683,8],[683,12,683,13],[684,2,684,3],[684,7,684,8],[684,12,684,13],[689,2,689,3],[689,7,689,8],[689,12,689,13],[690,2,690,3],[690,7,690,8],[690,12,690,13],[687,2,687,3],[687,7,687,8],[687,12,687,13],[688,2,688,3],[688,7,688,8],[688,12,688,13],[693,2,693,3],[693,7,693,8],[693,12,693,13],[694,2,694,3],[694,7,694,8],[694,12,694,13],[691,2,691,3],[691,7,691,8],[691,12,691,13],[692,2,692,3]],"merged_total":1014,"flags":["merged_cut"]}
[]
[{"$f":"A1026","v":"Turkey"}]
[{"$f":"A1034","v":"2013"}]
["Use of drinking water sources"]
[" by wealth quintile and sub-national region"]
["Notes:"]
["WHO/UNICEF JMP customised wealth index excludes water,"]
[" sanitation and hygiene assets."]
["Survey used for analysis:",{"$f":"A1025","v":"DHS13"}]
[{"$f":"B1028","v":""}]
[{"$f":"B1027","v":""}]
[]
[]
["Use of drinking water sources",null,"NATIONAL wealth index quintile",null,null,null,null,"URBAN wealth index quintile",null,null,null,null,"RURAL wealth index quintile",null,null,null,null,"SUB-REGIONS:",null,null,null,null,null,null,null,null,null,null,null,null,null,null,null,null,null,null,null,null,null,null,null,null,null,null,null,null,null,null,null,null,null,null,"Raw numbers of respondents:","Use of drinking water sources","NATIONAL wealth index quintile",null,null,null,null,"URBAN wealth index quintile",null,null,null,null,"RURAL wealth index quintile",null,null,null,null,"SUB-REGIONS:"]
["Weighted percentage (used in graphs)",null,"Poorest","Poor","Middle","Rich","Richest","Poorest","Poor","Middle","Rich","Richest","Poorest","Poor","Middle","Rich","Richest","Central","East","North","South","West",null,null,null,null,null,null,null,null,null,null,null,null,null,null,null,null,null,null,null,null,null,null,null,null,null,null,null,null,null,null,"Water data, raw numbers (weighted)",null,"Poorest","Poor","Middle","Rich","Richest","Poorest","Poor","Middle","Rich","Richest","Poorest","Poor","Middle","Rich","Richest","Central","East","North","South","West"]
["Water","Improved",97.968878948247095,98.633306975406612,99.415404287061222,99.498650823799025,99.80779315777319,99.628264324361695,99.40677625193743,99.750043187839594,99.406273906558695,99.914916467468601,94.263821902915296,97.221678153974466,98.251154629320453,96.749297461419985,99.256685533897198,99.015587547247776,98.060983576900242,99.387520252589951,98.521775987586125,99.66340988162662,null,null,null,null,null,null,null,null,null,null,null,null,null,null,null,null,null,null,null,null,null,null,null,null,null,null,null,null,null,null,"Water","Improved","N/A","N/A","N/A","N/A","N/A","N/A","N/A","N/A","N/A","N/A","N/A","N/A","N/A","N/A","N/A","N/A","N/A","N/A","N/A","N/A"]
[null,"Not Improved",2.0311210517530021,1.3666930245934743,0.58459571293874246,0.50134917620094188,0.19220684222683279,0.37173567563829862,0.59322374806255784,0.2499568121604023,0.59372609344128779,8.5083532531379777E-2,5.7361780970846432,2.7783218460255452,1.7488453706795353,3.2507025385800228,0.74331446610278407,0.98441245275227829,1.9390164230997005,0.61247974741000955,1.478224012413861,0.33659011837341107,null,null,null,null,null,null,null,null,null,null,null,null,null,null,null,null,null,null,null,null,null,null,null,null,null,null,null,null,null,null,null,"Not Improved","N/A","N/A","N/A","N/A","N/A","N/A","N/A","N/A","N/A","N/A","N/A","N/A","N/A","N/A","N/A","N/A","N/A","N/A","N/A","N/A"]
["Water ladder","Basic",96.499831801358255,97.597202138117964,98.016094637430371,97.756910339549691,99.269812021655696,98.789216363821737,98.294327744682448,98.783376903290787,97.715001219245863,99.575723347501395,91.508983974415713,95.285399055525204,97.170087988351838,93.900532341755891,97.298420199760443,97.061687737714664,96.996553961920213,97.383764551630009,98.041523849522576,98.604208384331187,null,null,null,null,null,null,null,null,null,null,null,null,null,null,null,null,null,null,null,null,null,null,null,null,null,null,null,null,null,null,"Water ladder","Basic","N/A","N/A","N/A","N/A","N/A","N/A","N/A","N/A","N/A","N/A","N/A","N/A","N/A","N/A","N/A","N/A","N/A","N/A","N/A","N/A"]
[null,"Limited",1.4513349996040472,1.0314178658165383,1.3983478176273714,1.7415843646848637,0.53761251178196023,0.83857927581594061,1.1121229221660467,0.96666628454878023,1.6911569860573339,0.33912604075008967,2.6586134892655342,1.8929279078434749,1.0617943449876242,2.8167370122110942,1.951750000480406,1.9523458154464344,1.0467069249674479,1.9985231722503709,0.47938813599763724,1.0588431790404207,null,null,null,null,null,null,null,null,null,null,null,null,null,null,null,null,null,null,null,null,null,null,null,null,null,null,null,null,null,null,null,"Limited","N/A","N/A","N/A","N/A","N/A","N/A","N/A","N/A","N/A","N/A","N/A","N/A","N/A","N/A","N/A","N/A","N/A","N/A","N/A","N/A"]
[null,"Unimproved",1.7053347948982036,1.2713100284923278,0.55611672460092354,0.36342102331388354,0.19257546656228958,0.34753699142883443,0.42684190283957046,0.2499568121604023,0.45045797369530166,8.515061174853901E-2,4.9919318458024744,2.3317147526308895,1.6474556857718234,3.2827306460329964,0.62932358911697217,0.9244425563970744,1.7273197927120263,0.44310594931855751,1.2158559675547815,0.2878429786197283,null,null,null,null,null,null,null,null,null,null,null,null,null,null,null,null,null,null,null,null,null,null,null,null,null,null,null,null,null,null,null,"Unimproved","N/A","N/A","N/A","N/A","N/A","N/A","N/A","N/A","N/A","N/A","N/A","N/A","N/A","N/A","N/A","N/A","N/A","N/A","N/A","N/A"]
[null,"Surface water",0.3434984041395408,0.10006996757321958,2.9440820341239349E-2,0.13808427245150456,0,2.4667368933422168E-2,0.16670743031192323,0,0.14338382100148742,0,0.84047069051621426,0.48995828400042091,0.12066198088872553,0,0.1205062106422037,6.1523890441762062E-2,0.22941932040026397,0.17460632680099486,0.26323204692496771,4.9105458008610652E-2,null,null,null,null,null,null,null,null,null,null,null,null,null,null,null,null,null,null,null,null,null,null,null,null,null,null,null,null,null,null,null,"Surface water","N/A","N/A","N/A","N/A","N/A","N/A","N/A","N/A","N/A","N/A","N/A","N/A","N/A","N/A","N/A","N/A","N/A","N/A","N/A","N/A"]
["Improved water point at more than 30 minutes","Yes",1.4816924055158764,1.0457591982686092,1.4065841774041237,1.7503625254450639,0.5386498191843917,0.8417121651965016,1.1187633344773809,0.96908858748907833,1.701259777653406,0.33941505474557221,2.8232784533882933,1.9478910236405005,1.0809060355624032,2.9123413336891955,1.9664953687663005,1.9717869734073701,1.0675970132970503,2.0109450265453575,0.48658515876111019,1.0624229967182424,null,null,null,null,null,null,null,null,null,null,null,null,null,null,null,null,null,null,null,null,null,null,null,null,null,null,null,null,null,null,"Improved water point at more than 30 minutes","Yes","N/A","N/A","N/A","N/A","N/A","N/A","N/A","N/A","N/A","N/A","N/A","N/A","N/A","N/A","N/A","N/A","N/A","N/A","N/A","N/A"]
[null,"No",98.518307594484099,98.954240801731416,98.593415822595773,98.249637474554902,99.461350180815586,99.158287834803431,98.881236665522636,99.030911412510918,98.298740222346609,99.660584945254456,97.176721546611688,98.052108976359492,98.919093964437607,97.087658666310801,98.033504631233754,98.028213026592553,98.932402986702954,97.9890549734546,99.513414841238884,98.937577003281646,null,null,null,null,null,null,null,null,null,null,null,null,null,null,null,null,null,null,null,null,null,null,null,null,null,null,null,null,null,null,null,"No","N/A","N/A","N/A","N/A","N/A","N/A","N/A","N/A","N/A","N/A","N/A","N/A","N/A","N/A","N/A","N/A","N/A","N/A","N/A","N/A"]
["Manually calculated ratios","Improved wells",{"$f":"C62/(C62+C63)*100","v":83.345872238700565},93.824748474161794,90.568084273605649,97.733019337341105,92.442209501231147,91.103770440096682,100,94.88026949532852,100,91.277253424144249,78.098790414737124,77.975741498426473,94.05414126462756,92.10547740554739,94.53266339567331,97.145652840190493,85.630863827640454,96.581548947983734,88.209710247532428,92.345414704901501]
[null,"Improved springs",{"$f":"C64/(C64+C65)*100","v":93.175882402238869},90.64284585971177,97.97931116180682,96.112226314631499,96.567545686192204,92.869070322444173,94.89737880293012,99.213344753857314,92.147221413287809,98.392974734033885,85.650835991457697,97.479618144984855,96.54183952415795,91.129152764721852,98.550196302780904,94.112713066779492,90.344058675187043,99.108050979474029,82.457420827121737,96.182919561925772]
[null,"Other"]
[null,null,"NATIONAL wealth index quintile",null,null,null,null,"URBAN wealth index quintile",null,null,null,null,"RURAL wealth index quintile",null,null,null,null,"SUB-REGIONS:",null,null,null,null,null,null,null,null,null,null,null,null,null,null,null,null,null,null,null,null,null,null,null,null,null,null,null,null,null,null,null,null,null,null,"Raw numbers of respondents:","Use of drinking water sources","NATIONAL wealth index quintile",null,null,null,null,"URBAN wealth index quintile",null,null,null,null,"RURAL wealth index quintile",null,null,null,null,"SUB-REGIONS:"]
["Percentage based on weighted population",null,"Poorest","Poor","Middle","Rich","Richest","Poorest","Poor","Middle","Rich","Richest","Poorest","Poor","Middle","Rich","Richest","Central","East","North","South","West",null,null,null,null,null,null,null,null,null,null,null,null,null,null,null,null,null,null,null,null,null,null,null,null,null,null,null,null,null,null,"Water data, raw numbers (weighted)",null,"Poorest","Poor","Middle","Rich","Richest","Poorest","Poor","Middle","Rich","Richest","Poorest","Poor","Middle","Rich","Richest","Central","East","North","South","West"]
["Piped water","Yes",73.40395268500032,83.913747802541693,89.405500134405528,91.318794136481728,94.05782879350258,95.19076152488411,94.036098220824599,93.858672771640869,94.269854349840969,95.777431235923245,55.398344781138512,51.040310210018824,59.366652639403213,56.672713683204591,68.219993338309877,81.848980399794385,78.944627208185253,69.637573172366416,90.413992518531472,93.952416585119252,null,null,null,null,null,null,null,null,null,null,null,null,null,null,null,null,null,null,null,null,null,null,null,null,null,null,null,null,null,null,"Piped water","Yes","N/A","N/A","N/A","N/A","N/A","N/A","N/A","N/A","N/A","N/A","N/A","N/A","N/A","N/A","N/A","N/A","N/A","N/A","N/A","N/A"]
[null,"No",26.596047314999925,16.086252197458407,10.594499865594369,8.6812058635183877,5.9421712064976058,4.8092384751158779,5.9639017791754805,6.1413272283591276,5.7301456501590522,4.2225687640767884,44.60165521886141,48.959689789981141,40.633347360596723,43.327286316795444,31.780006661690148,18.151019600205327,21.055372791814712,30.362426827633342,9.5860074814686982,6.0475834148808572,null,null,null,null,null,null,null,null,null,null,null,null,null,null,null,null,null,null,null,null,null,null,null,null,null,null,null,null,null,null,null,"No","N/A","N/A","N/A","N/A","N/A","N/A","N/A","N/A","N/A","N/A","N/A","N/A","N/A","N/A","N/A","N/A","N/A","N/A","N/A","N/A"]
["Piped water on premises","Yes",68.014475256263353,82.106939407873,88.032260807297973,90.532360773058002,92.899647504968428,93.916885268957557,93.470224219896423,93.119494796888034,93.772904614372038,94.946046907441072,44.491525738253735,44.381004721176396,52.489531725244596,52.349938748226577,63.716458562335845,80.943725566603547,73.716940096919956,66.361688734658102,89.812861231922938,92.481688383962563,null,null,null,null,null,null,null,null,null,null,null,null,null,null,null,null,null,null,null,null,null,null,null,null,null,null,null,null,null,null,"Piped water on premises","Yes","N/A","N/A","N/A","N/A","N/A","N/A","N/A","N/A","N/A","N/A","N/A","N/A","N/A","N/A","N/A","N/A","N/A","N/A","N/A","N/A"]
[null,"No",31.985524743736871,17.893060592127078,11.967739192701927,9.4676392269420848,7.1003524950316779,6.0831147310424347,6.5297757801036767,6.8805052031119445,6.2270953856279743,5.0539530925589462,55.508474261746223,55.618995278823569,47.510468274755326,47.650061251773479,36.283541437664141,19.056274433396158,26.283059903080012,33.638311265341642,10.187138768077247,7.5183116160374404,null,null,null,null,null,null,null,null,null,null,null,null,null,null,null,null,null,null,null,null,null,null,null,null,null,null,null,null,null,null,null,"No","N/A","N/A","N/A","N/A","N/A","N/A","N/A","N/A","N/A","N/A","N/A","N/A","N/A","N/A","N/A","N/A","N/A","N/A","N/A","N/A"]
["Piped water into dwelling","Yes","N/A","N/A","N/A","N/A","N/A","N/A","N/A","N/A","N/A","N/A","N/A","N/A","N/A","N/A","N/A","N/A","N/A","N/A","N/A","N/A",null,null,null,null,null,null,null,null,null,null,null,null,null,null,null,null,null,null,null,null,null,null,null,null,null,null,null,null,null,null,"Piped water into dwelling","Yes","N/A","N/A","N/A","N/A","N/A","N/A","N/A","N/A","N/A","N/A","N/A","N/A","N/A","N/A","N/A","N/A","N/A","N/A","N/A","N/A"]
[null,"No","N/A","N/A","N/A","N/A","N/A","N/A","N/A","N/A","N/A","N/A","N/A","N/A","N/A","N/A","N/A","N/A","N/A","N/A","N/A","N/A",null,null,null,null,null,null,null,null,null,null,null,null,null,null,null,null,null,null,null,null,null,null,null,null,null,null,null,null,null,null,null,"No","N/A","N/A","N/A","N/A","N/A","N/A","N/A","N/A","N/A","N/A","N/A","N/A","N/A","N/A","N/A","N/A","N/A","N/A","N/A","N/A"]
["Water source on premises","Yes",90.331176125421237,93.047662021206506,92.620989614799626,93.688913823131145,95.324751842487345,95.60618375650354,94.153303648169654,93.96492941661289,94.340508901209589,95.997747958600272,82.217031837633101,86.613823248150695,88.817784626450987,87.621461680852136,88.57426395639439,88.962776693798389,91.900337213919954,92.864642390666859,96.25953472145288,94.515697915465438,null,null,null,null,null,null,null,null,null,null,null,null,null,null,null,null,null,null,null,null,null,null,null,null,null,null,null,null,null,null,"Water source on premises","Yes","N/A","N/A","N/A","N/A","N/A","N/A","N/A","N/A","N/A","N/A","N/A","N/A","N/A","N/A","N/A","N/A","N/A","N/A","N/A","N/A"]
[null,"No",9.6688238745788695,6.9523379787935591,7.3790103852003019,6.3110861768689173,4.675248157512744,4.393816243496425,5.846696351830432,6.0350705833871077,5.6594910987904239,4.0022520413997675,17.782968162366792,13.386176751849291,11.182215373549001,12.378538319147866,11.425736043605632,11.03722330620128,8.0996627860799304,7.1353576093330302,3.7404652785471328,5.4843020845346668,null,null,null,null,null,null,null,null,null,null,null,null,null,null,null,null,null,null,null,null,null,null,null,null,null,null,null,null,null,null,null,"No","N/A","N/A","N/A","N/A","N/A","N/A","N/A","N/A","N/A","N/A","N/A","N/A","N/A","N/A","N/A","N/A","N/A","N/A","N/A","N/A"]
["Improved Water source on premises","Yes",91.135395095863998,93.831217018569973,93.059431840301627,94.105670327766845,95.469973822504187,95.840661518732546,94.636495424792216,94.200389707769119,94.903978585787357,96.07949578765475,84.542066025994103,87.109175031614072,89.58454309374217,89.115871500259516,88.81952227877818,89.753480783642459,92.816456122518602,93.144596072296764,96.667745706091225,94.804398744418208,null,null,null,null,null,null,null,null,null,null,null,null,null,null,null,null,null,null,null,null,null,null,null,null,null,null,null,null,null,null,"Improved water source on premises","Yes","N/A","N/A","N/A","N/A","N/A","N/A","N/A","N/A","N/A","N/A","N/A","N/A","N/A","N/A","N/A","N/A","N/A","N/A","N/A","N/A"]
[null,"No",8.864604904135998,6.1687829814299979,6.9405681596983317,5.894329672233237,4.5300261774958868,4.1593384812674037,5.3635045752078838,5.799610292230895,5.0960214142126734,3.9205042123452931,15.457933974005886,12.890824968385903,10.415456906257893,10.884128499740479,11.180477721221877,10.246519216357154,7.1835438774812914,6.8554039277031533,3.3322542939088082,5.1956012555818747,null,null,null,null,null,null,null,null,null,null,null,null,null,null,null,null,null,null,null,null,null,null,null,null,null,null,null,null,null,null,null,"No","N/A","N/A","N/A","N/A","N/A","N/A","N/A","N/A","N/A","N/A","N/A","N/A","N/A","N/A","N/A","N/A","N/A","N/A","N/A","N/A"]
["Piped water on premises available when needed","Yes","N/A","N/A","N/A","N/A","N/A","N/A","N/A","N/A","N/A","N/A","N/A","N/A","N/A","N/A","N/A","N/A","N/A","N/A","N/A","N/A",null,null,null,null,null,null,null,null,null,null,null,null,null,null,null,null,null,null,null,null,null,null,null,null,null,null,null,null,null,null,"Piped water on premises available when needed","Yes","N/A","N/A","N/A","N/A","N/A","N/A","N/A","N/A","N/A","N/A","N/A","N/A","N/A","N/A","N/A","N/A","N/A","N/A","N/A","N/A"]
[null,"No","N/A","N/A","N/A","N/A","N/A","N/A","N/A","N/A","N/A","N/A","N/A","N/A","N/A","N/A","N/A","N/A","N/A","N/A","N/A","N/A",null,null,null,null,null,null,null,null,null,null,null,null,null,null,null,null,null,null,null,null,null,null,null,null,null,null,null,null,null,null,null,"No","N/A","N/A","N/A","N/A","N/A","N/A","N/A","N/A","N/A","N/A","N/A","N/A","N/A","N/A","N/A","N/A","N/A","N/A","N/A","N/A"]
["Water point at more than 30 minutes","Yes",1.5887094803264241,1.31768375610875,1.4344710218988499,1.9294691022906831,0.58748187620330972,0.90969975702944561,1.3545331428186453,0.97881831730756308,1.9803066998202046,0.33912604075008967,2.9377239499165757,2.2293027019863065,1.0617943449876242,3.1259423802082775,2.0119344092975888,2.2263115170659007,1.1882158813928216,2.1558060038445821,0.58158086669698539,1.1404718601518391,null,null,null,null,null,null,null,null,null,null,null,null,null,null,null,null,null,null,null,null,null,null,null,null,null,null,null,null,null,null,"Water point at more than 30 minutes","Yes","N/A","N/A","N/A","N/A","N/A","N/A","N/A","N/A","N/A","N/A","N/A","N/A","N/A","N/A","N/A","N/A","N/A","N/A","N/A","N/A"]
[null,"No",98.411290519673628,98.682316243891293,98.565528978101071,98.070530897709261,99.412518123796659,99.0903002429705,98.645466857181361,99.021181682692429,98.01969330017981,99.660873959249926,97.062276050083412,97.770697298013687,98.93820565501241,96.874057619791671,97.988065590702433,97.773688482934062,98.811784118607164,97.844193996155354,99.418419133303004,98.85952813984818,null,null,null,null,null,null,null,null,null,null,null,null,null,null,null,null,null,null,null,null,null,null,null,null,null,null,null,null,null,null,null,"No","N/A","N/A","N/A","N/A","N/A","N/A","N/A","N/A","N/A","N/A","N/A","N/A","N/A","N/A","N/A","N/A","N/A","N/A","N/A","N/A"]
["Water source available when needed","Yes","N/A","N/A","N/A","N/A","N/A","N/A","N/A","N/A","N/A","N/A","N/A","N/A","N/A","N/A","N/A","N/A","N/A","N/A","N/A","N/A",null,null,null,null,null,null,null,null,null,null,null,null,null,null,null,null,null,null,null,null,null,null,null,null,null,null,null,null,null,null,"Water source available when needed","Yes","N/A","N/A","N/A","N/A","N/A","N/A","N/A","N/A","N/A","N/A","N/A","N/A","N/A","N/A","N/A","N/A","N/A","N/A","N/A","N/A"]
[null,"No","N/A","N/A","N/A","N/A","N/A","N/A","N/A","N/A","N/A","N/A","N/A","N/A","N/A","N/A","N/A","N/A","N/A","N/A","N/A","N/A",null,null,null,null,null,null,null,null,null,null,null,null,null,null,null,null,null,null,null,null,null,null,null,null,null,null,null,null,null,null,null,"No","N/A","N/A","N/A","N/A","N/A","N/A","N/A","N/A","N/A","N/A","N/A","N/A","N/A","N/A","N/A","N/A","N/A","N/A","N/A","N/A"]
["Improved water source available when needed","Yes","N/A","N/A","N/A","N/A","N/A","N/A","N/A","N/A","N/A","N/A","N/A","N/A","N/A","N/A","N/A","N/A","N/A","N/A","N/A","N/A",null,null,null,null,null,null,null,null,null,null,null,null,null,null,null,null,null,null,null,null,null,null,null,null,null,null,null,null,null,null,"Improved water source available when needed","Yes","N/A","N/A","N/A","N/A","N/A","N/A","N/A","N/A","N/A","N/A","N/A","N/A","N/A","N/A","N/A","N/A","N/A","N/A","N/A","N/A"]
[null,"No","N/A","N/A","N/A","N/A","N/A","N/A","N/A","N/A","N/A","N/A","N/A","N/A","N/A","N/A","N/A","N/A","N/A","N/A","N/A","N/A",null,null,null,null,null,null,null,null,null,null,null,null,null,null,null,null,null,null,null,null,null,null,null,null,null,null,null,null,null,null,null,"No","N/A","N/A","N/A","N/A","N/A","N/A","N/A","N/A","N/A","N/A","N/A","N/A","N/A","N/A","N/A","N/A","N/A","N/A","N/A","N/A"]
["Microbiological quality at point of collection","Not contaminated (No E. coli in 100 mL)","N/A","N/A","N/A","N/A","N/A","N/A","N/A","N/A","N/A","N/A","N/A","N/A","N/A","N/A","N/A","N/A","N/A","N/A","N/A","N/A",null,null,null,null,null,null,null,null,null,null,null,null,null,null,null,null,null,null,null,null,null,null,null,null,null,null,null,null,null,null,"Microbiological quality at point of collection","Not contaminated (No E. coli in 100 mL)","N/A","N/A","N/A","N/A","N/A","N/A","N/A","N/A","N/A","N/A","N/A","N/A","N/A","N/A","N/A","N/A","N/A","N/A","N/A","N/A"]
[null,"Contaminated (E. coli detected in 100 mL)","N/A","N/A","N/A","N/A","N/A","N/A","N/A","N/A","N/A","N/A","N/A","N/A","N/A","N/A","N/A","N/A","N/A","N/A","N/A","N/A",null,null,null,null,null,null,null,null,null,null,null,null,null,null,null,null,null,null,null,null,null,null,null,null,null,null,null,null,null,null,null,"Contaminated (E. coli detected in 100 mL)","N/A","N/A","N/A","N/A","N/A","N/A","N/A","N/A","N/A","N/A","N/A","N/A","N/A","N/A","N/A","N/A","N/A","N/A","N/A","N/A"]
[null,"Highly contaminated (>100 CFU/100 mL)","N/A","N/A","N/A","N/A","N/A","N/A","N/A","N/A","N/A","N/A","N/A","N/A","N/A","N/A","N/A","N/A","N/A","N/A","N/A","N/A",null,null,null,null,null,null,null,null,null,null,null,null,null,null,null,null,null,null,null,null,null,null,null,null,null,null,null,null,null,null,null,"Highly contaminated (>100 CFU/100 mL)","N/A","N/A","N/A","N/A","N/A","N/A","N/A","N/A","N/A","N/A","N/A","N/A","N/A","N/A","N/A","N/A","N/A","N/A","N/A","N/A"]
["Microbiological quality of improved water sources at point of collection","Not contaminated (No E. coli in 100 mL)","N/A","N/A","N/A","N/A","N/A","N/A","N/A","N/A","N/A","N/A","N/A","N/A","N/A","N/A","N/A","N/A","N/A","N/A","N/A","N/A",null,null,null,null,null,null,null,null,null,null,null,null,null,null,null,null,null,null,null,null,null,null,null,null,null,null,null,null,null,null,"Microbiological quality of improved water sources at point of collection","Not contaminated (No E. coli in 100 mL)","N/A","N/A","N/A","N/A","N/A","N/A","N/A","N/A","N/A","N/A","N/A","N/A","N/A","N/A","N/A","N/A","N/A","N/A","N/A","N/A"]
[null,"Contaminated (E. coli detected in 100 mL)","N/A","N/A","N/A","N/A","N/A","N/A","N/A","N/A","N/A","N/A","N/A","N/A","N/A","N/A","N/A","N/A","N/A","N/A","N/A","N/A",null,null,null,null,null,null,null,null,null,null,null,null,null,null,null,null,null,null,null,null,null,null,null,null,null,null,null,null,null,null,null,"Contaminated (E. coli detected in 100 mL)","N/A","N/A","N/A","N/A","N/A","N/A","N/A","N/A","N/A","N/A","N/A","N/A","N/A","N/A","N/A","N/A","N/A","N/A","N/A","N/A"]
[null,"Highly contaminated (>100 CFU/100 mL)","N/A","N/A","N/A","N/A","N/A","N/A","N/A","N/A","N/A","N/A","N/A","N/A","N/A","N/A","N/A","N/A","N/A","N/A","N/A","N/A",null,null,null,null,null,null,null,null,null,null,null,null,null,null,null,null,null,null,null,null,null,null,null,null,null,null,null,null,null,null,null,"Highly contaminated (>100 CFU/100 mL)","N/A","N/A","N/A","N/A","N/A","N/A","N/A","N/A","N/A","N/A","N/A","N/A","N/A","N/A","N/A","N/A","N/A","N/A","N/A","N/A"]
["Microbiological quality of piped on premises at point of collection","Not contaminated (No E. coli in 100 mL)","N/A","N/A","N/A","N/A","N/A","N/A","N/A","N/A","N/A","N/A","N/A","N/A","N/A","N/A","N/A","N/A","N/A","N/A","N/A","N/A",null,null,null,null,null,null,null,null,null,null,null,null,null,null,null,null,null,null,null,null,null,null,null,null,null,null,null,null,null,null,"Microbiological quality of piped on premises at point of collection","Not contaminated (No E. coli in 100 mL)","N/A","N/A","N/A","N/A","N/A","N/A","N/A","N/A","N/A","N/A","N/A","N/A","N/A","N/A","N/A","N/A","N/A","N/A","N/A","N/A"]
[null,"Contaminated (E. coli detected in 100 mL)","N/A","N/A","N/A","N/A","N/A","N/A","N/A","N/A","N/A","N/A","N/A","N/A","N/A","N/A","N/A","N/A","N/A","N/A","N/A","N/A",null,null,null,null,null,null,null,null,null,null,null,null,null,null,null,null,null,null,null,null,null,null,null,null,null,null,null,null,null,null,null,"Contaminated (E. coli detected in 100 mL)","N/A","N/A","N/A","N/A","N/A","N/A","N/A","N/A","N/A","N/A","N/A","N/A","N/A","N/A","N/A","N/A","N/A","N/A","N/A","N/A"]
[null,"Highly contaminated (>100 CFU/100 mL)","N/A","N/A","N/A","N/A","N/A","N/A","N/A","N/A","N/A","N/A","N/A","N/A","N/A","N/A","N/A","N/A","N/A","N/A","N/A","N/A",null,null,null,null,null,null,null,null,null,null,null,null,null,null,null,null,null,null,null,null,null,null,null,null,null,null,null,null,null,null,null,"Highly contaminated (>100 CFU/100 mL)","N/A","N/A","N/A","N/A","N/A","N/A","N/A","N/A","N/A","N/A","N/A","N/A","N/A","N/A","N/A","N/A","N/A","N/A","N/A","N/A"]
[null,null,"NATIONAL wealth index quintile",null,null,null,null,"URBAN wealth index quintile",null,null,null,null,"RURAL wealth index quintile",null,null,null,null,"SUB-REGIONS:",null,null,null,null,null,null,null,null,null,null,null,null,null,null,null,null,null,null,null,null,null,null,null,null,null,null,null,null,null,null,null,null,null,null,"Raw numbers of respondents:","Use of drinking water sources","NATIONAL wealth index quintile",null,null,null,null,"URBAN wealth index quintile",null,null,null,null,"RURAL wealth index quintile",null,null,null,null,"SUB-REGIONS:"]
["Percentage based on weighted population",null,"Poorest","Poor","Middle","Rich","Richest","Poorest","Poor","Middle","Rich","Richest","Poorest","Poor","Middle","Rich","Richest","Central","East","North","South","West",null,null,null,null,null,null,null,null,null,null,null,null,null,null,null,null,null,null,null,null,null,null,null,null,null,null,null,null,null,null,"Water data, raw numbers (weighted)",null,"Poorest","Poor","Middle","Rich","Richest","Poorest","Poor","Middle","Rich","Richest","Poorest","Poor","Middle","Rich","Richest","Central","East","North","South","West"]
["Source of drinking water","Piped into dwelling",58.680123839517805,63.055627850923926,57.496564200271486,50.851648757273026,37.974418158523179,77.265593128724618,62.393805987589289,55.062444331483086,48.931269099746402,36.680196051147107,40.006719631818868,41.203375845407642,48.874354383264368,48.02892644181258,47.61947297288512,53.771165945918753,66.274903676295622,50.565810648297351,74.790926471589898,41.741351628958903]
[null,"Piped to yard/plot",1.5836780980743228,0.31710439064182255,6.77009491542922E-2,4.334312283985222E-2,2.5997080695314829E-2,0.42777426057318119,9.2867083764001365E-2,0,5.5872264718139615E-2,3.3552814991043511E-2,3.9245020459285582,1.6027746196382826,0.72488178641457135,0.47773640693388852,0.2230540798220399,0.31401904712408041,1.243060961975867,0,0.12814667725424492,0.22213110300452008]
[null,"Public tap/standpipe",5.3763908491149444,1.8070466547750206,1.3739531831048084,0.78683651682880718,1.1581812885340765,1.2569977139891479,0.5659703309728622,0.73967392302767243,0.49706507276121642,0.83138432848215649,10.9068190428848,6.6593054888424295,6.8771209141585867,4.3227749349780229,4.5102018909068446,0.90572652951604138,5.2149954230832716,3.2770486684720734,0.60113128660854342,1.4709666082405961]
[null,"Tube well or borehole",8.9041278706701039,3.3957197466632381,1.0568348767975249,0.75170964002020135,0.67966585278477543,0.58004801423034758,4.6432821027373346E-2,0.29982468003210277,0.10758926678231949,4.135018407597605E-2,14.80914198068225,20.072554183709752,11.409795380170934,8.2272469808722448,7.5433786270004672,2.1692245107925348,9.8135514293519002,0.24879071363557104,1.4239417267814711,1.10004396479359]
[null,"Protected well",2.2983389798108127,2.1073937659283217,1.0298247121947093,1.215415482049311,0.49960434931671283,0.99498665233278949,1.0686881693214123,1.0382327000578802,0.57335532156794311,0.32877436182067021,3.2453985670954046,4.0097842624057831,2.6996428211161834,4.6050737669709587,3.4402761573822058,1.4807670680049285,2.9092440411945262,1.2556789963638864,1.458903373135505,0.73875598686996713]
[null,"Unprotected well",0.45925286976324353,0.13870206720750872,0.10724771288123125,2.8192349050340765E-2,4.0846113748061824E-2,9.7159860952323554E-2,0,5.6022939792508566E-2,0,3.1418730638994391E-2,0.91010569854172785,1.1325640953673828,0.17066441343775254,0.39470897851601167,0.19896982787336756,4.3508105111531213E-2,0.4881805685236611,4.4444070662261442E-2,0.19499999990761907,6.1236074707461174E-2]
[null,"Protected spring",12.886083583980771,8.8105812396757024,7.5760954127833822,6.1576909574786471,3.9865590957943358,2.7517450307759845,4.2060672357369961,4.5253395836609638,4.3387316063932646,3.2857227627532293,20.407007885541287,20.983553308828203,23.503934336006939,25.624480873614132,18.881189329952445,13.233835634549578,6.1823669748516714,27.119225604117641,4.1389079475462047,3.7344823925078803]
[null,"Unprotected spring",0.94376514055477434,0.90952535683591851,0.15624657140542858,0.24908078592153657,0.14170062900920974,0.21129209366366322,0.22615975387415047,3.5881081651827434E-2,0.36974634861060796,5.3664801892385393E-2,3.4188049618389305,0.54253974338157018,0.8419186660228003,2.4943813084711874,0.27776726100429133,0.82785189236217416,0.66076921529788168,0.24406661694946591,0.88054076432139072,0.14820531287363073]
[null,"River/dam/lake/ponds/stream/canal/irrigation channel",0.34052886307145824,9.9741108923557364E-2,2.9407740282105171E-2,0.13811205137067548,0,2.4636307451530663E-2,0.16664434817376333,0,0.14338915632625757,0,0.82660439435713273,0.48243073751192578,0.11934677803023307,0,0.1196359715900874,6.1458929265913655E-2,0.22738417023215685,0.17318879671000562,0.26307828120573756,4.9061189800565924E-2]
[null,"Tanker truck",0.34788886947849973,0.23308070766469771,0.10544266240625377,2.4762189223426028E-2,2.4753816724767105E-2,3.6954461177295991E-2,3.2505497710357018E-2,0,0,0,0.4039286884578327,0.77355637812606859,1.0954354379941393,0.53938522288168833,0.22044188593462336,8.5730944962968583E-2,0.15177178192292212,0.35555256529809154,0.59874876198425642,0]
[null,"Cart with small tank",0,9.624895918236448E-2,1.3893338872225953E-2,0,0,3.5791921601996464E-2,1.7898570304273203E-2,0,0,0,0,0,0,0.30475080497311885,0,4.1778721331838832E-2,0,0.11111017665565361,4.3810885023238273E-2,0]
[null,"Bottled water",7.8922468575999325,18.823510231249937,30.746774422905119,39.718250666392194,55.458613515400359,16.278373140956241,30.999462801772417,38.151454830937091,44.925462522346365,58.71393596419847,0.560304060506292,1.9167740670162519,3.0659895701946773,4.618922028383424,16.965611995648494,27.064932671059509,6.2895331675123609,16.489624641189042,15.337258857663183,50.671833774408903]
[null,"Other",0.28757417836352578,0.20571792032814312,0.24001421694158889,3.4957481552224091E-2,9.6600994695611887E-3,3.8647413570781143E-2,0.18349739975334317,9.1125929357153107E-2,5.7519340747704865E-2,0,0.58066304234685218,0.62078726976466703,0.61691551318874926,0.3616122515928229,0,0,0.54423858975813544,0.11545850164878667,0.13960496697911362,6.1931963834059314E-2]
[]
[]
[]
[]
[]
[]
[]
[]
[]
[]
[]
[]
[]
[]
[]
[]
[]
[]
[]
[]
[]
[]
[]
[]
[]
[]
[]
[]
[]
[]
[]
[]
[]
[]
[]
[]
[]
[{"$f":"A1026","v":"Turkey"}]
[{"$f":"A1034","v":"2013"}]
["Use of sanitation facilities"]
[" by wealth quintile and sub-national region"]
["Notes:"]
["WHO/UNICEF JMP customised wealth index excludes water,"]
[" sanitation and hygiene assets."]
["Survey used for analysis:",{"$f":"A1025","v":"DHS13"}]
[{"$f":"B1030","v":""}]
[{"$f":"B1029","v":""}]
[]
[]
["Use of sanitation facilities",null,"NATIONAL wealth index quintile",null,null,null,null,"URBAN wealth index quintile",null,null,null,null,"RURAL wealth index quintile",null,null,null,null,"SUB-REGIONS:",null,null,null,null,null,null,null,null,null,null,null,null,null,null,null,null,null,null,null,null,null,null,null,null,null,null,null,null,null,null,null,null,null,null,"Raw numbers of respondents:","Use of sanitation facilities","NATIONAL wealth index quintile",null,null,null,null,"URBAN wealth index quintile",null,null,null,null,"RURAL wealth index quintile",null,null,null,null,"SUB-REGIONS:"]
["Weighted percentage (used in graphs)",null,"Poorest","Poor","Middle","Rich","Richest","Poorest","Poor","Middle","Rich","Richest","Poorest","Poor","Middle","Rich","Richest","Central","East","North","South","West",null,null,null,null,null,null,null,null,null,null,null,null,null,null,null,null,null,null,null,null,null,null,null,null,null,null,null,null,null,null,"Sanitation data, raw numbers (weighted)",null,"Poorest","Poor","Middle","Rich","Richest","Poorest","Poor","Middle","Rich","Richest","Poorest","Poor","Middle","Rich","Richest","Central","East","North","South","West"]
["Sanitation","Improved",88.648065481816516,96.928473549091606,98.324409005850313,99.708078368777535,99.491724369158675,99.026614578843279,98.484092433482402,99.918413775514139,99.799375971602345,99.875412121969347,76.324733789313782,80.393757123603649,90.239629075052548,91.294491665562902,96.604716041949118,97.471285607496355,92.224883729631401,94.653204303471199,97.739999174117898,98.27299482688943,null,null,null,null,null,null,null,null,null,null,null,null,null,null,null,null,null,null,null,null,null,null,null,null,null,null,null,null,null,null,"Sanitation","Improved",7773.0193609999969,8506.6745519999949,8614.8386839999785,8744.7799729999824,8724.2838589999792,6732.3028390000172,6695.5830479999868,6783.8140929999872,6788.1041289999839,6785.7371670000066,1508.4411109999992,1581.6833870000007,1781.4320520000017,1801.2060549999983,1905.2925479999997,8519.9250240000183,7740.1778719999947,3082.9717939999978,5342.9279859999888,17677.59375299999]
[null,"Not Improved",11.351934518183523,3.0715264509084768,1.675590994149577,0.29192163122248938,0.50827563084132577,0.97338542115667748,1.5159075665175923,8.1586224485856076E-2,0.2006240283976661,0.12458787803065281,23.67526621068609,19.606242876396347,9.7603709249474804,8.705508334437063,3.3952839580508707,2.5287143925036424,7.7751162703684802,5.3467956965285852,2.2600008258821167,1.7270051731106004,null,null,null,null,null,null,null,null,null,null,null,null,null,null,null,null,null,null,null,null,null,null,null,null,null,null,null,null,null,null,null,"Not Improved",995.38333199999988,269.564504,146.80938600000002,25.602644000000002,44.569946999999999,66.175396000000006,103.06116199999998,5.5391770000000005,13.645945000000001,8.4647520000000007,467.90526600000021,385.73727300000019,192.68072999999995,171.75641200000001,66.963700000000003,221.033886,652.54387399999996,174.15174099999996,123.54227300000001,310.65803900000003]
["Sanitation ladder","Basic",85.823263877041185,96.325233706197253,98.179631677068841,99.600941600859571,99.437036947869132,97.485125622670353,98.128266584036012,99.918272528021944,99.750218431880995,99.807806652232173,71.602663453563167,77.596721921563301,89.663701510283261,90.280231418725279,96.194155598385478,96.726880269453517,90.542674528629192,94.647533706231513,97.064482616193175,97.798137883981468,null,null,null,null,null,null,null,null,null,null,null,null,null,null,null,null,null,null,null,null,null,null,null,null,null,null,null,null,null,null,"Sanitation ladder","Basic",7495.422349999998,8420.0134319999943,8592.4688849999748,8716.1351789999808,8665.2580929999749,6588.8874900000146,6654.0075089999882,6772.080227999988,6773.5719749999844,6726.7114010000078,1415.1166450000001,1522.2737720000002,1764.3674230000013,1775.0862519999982,1897.1952439999993,8429.3172360000208,7546.1143339999935,3079.5210789999978,5299.0413809999882,17535.303908999977]
[null,"Limited",2.77950693799579,0.59093940250441579,0.14288870244859422,0.10649209566964965,5.1506449333996805E-2,1.5357839311835593,0.35186540176085906,0,4.8826149104754198E-2,6.6597305272307936E-2,4.7220703357506588,2.7406205076911534,0.54442224200874778,0.98430087904951835,0.41056044356361954,0.73674369580610732,1.627724038878946,0,0.67254830170643687,0.46925583268532095,null,null,null,null,null,null,null,null,null,null,null,null,null,null,null,null,null,null,null,null,null,null,null,null,null,null,null,null,null,null,null,"Limited",242.74978000000007,51.655391999999999,12.50531,9.3191839999999999,4.488435,103.80155399999998,23.859740999999996,0,3.3155559999999999,4.488435,93.324465999999973,53.764831999999998,10.712929000000001,19.353283999999999,8.0973039999999994,64.203935000000001,135.65969599999997,0,36.716430000000003,84.13803999999999]
[null,"Unimproved",11.397229184963074,3.0838268912983802,1.6774796204824047,0.29256630347077406,0.51145660279683747,0.97909044614600693,1.5198680142031291,8.172747197804639E-2,0.20095541901426944,0.12559604249551998,23.67526621068609,19.66265757074553,9.7918762477079948,8.7354677022251757,3.3952839580508707,2.5363760347403281,7.8296014324917422,5.3524662937682743,2.2629690821003834,1.7326062833331268,null,null,null,null,null,null,null,null,null,null,null,null,null,null,null,null,null,null,null,null,null,null,null,null,null,null,null,null,null,null,null,"Unimproved",995.38333199999988,269.564504,146.80938600000002,25.602644000000002,44.569946999999999,66.175396000000006,103.06116199999998,5.5391770000000005,13.645945000000001,8.4647520000000007,467.90526600000021,385.73727300000019,192.68072999999995,171.75641200000001,66.963700000000003,221.033886,652.54387399999996,174.15174099999996,123.54227300000001,310.65803900000003]
[null,"Open defecation",0,0,0,0,0,0,0,0,0,0,0,0,0,0,0,0,0,0,0,0,null,null,null,null,null,null,null,null,null,null,null,null,null,null,null,null,null,null,null,null,null,null,null,null,null,null,null,null,null,null,null,"Open defecation",5197.9558660000057,7154.4577179999924,7964.8754909999834,8308.8557729999866,8454.5157669999808,6237.1085950000179,6503.9647099999893,6649.8142059999864,6665.3098429999827,6731.3051180000075,506.96660599999996,697.28687699999978,877.66109099999994,938.64805100000058,1272.595517999998,7810.6380399999825,6044.8462259999951,2215.1841199999953,4182.7903200000101,16827.201909000014]
["Shared among Improved Sanitation","Yes",3.1370429078320363,0.6097428154139094,0.14532652529354897,0.10680456985160233,5.177123674266676E-2,1.5509693236541131,0.35729582674767962,0,4.8924465469338596E-2,6.6681054037273049E-2,6.1868153366711063,3.4113905499233552,0.6035179752809291,1.0785141327826839,0.4249900629958272,0.75591658285630292,1.7659943584672206,0,0.68812025021650802,0.47752953949131949,null,null,null,null,null,null,null,null,null,null,null,null,null,null,null,null,null,null,null,null,null,null,null,null,null,null,null,null,null,null,"Shared among improved sanitation facilities","Yes","N/A","N/A","N/A","N/A","N/A","N/A","N/A","N/A","N/A","N/A","N/A","N/A","N/A","N/A","N/A","N/A","N/A","N/A","N/A","N/A"]
[null,"No",96.862957092167989,99.39025718458609,99.854673474706445,99.893195430148367,99.948228763257291,98.449030676345856,99.642704173252312,100,99.951075534530659,99.933318945962725,93.813184663328954,96.588609450076618,99.396482024719049,98.921485867217314,99.575009937004154,99.244083417143699,98.234005641532761,100,99.311879749783472,99.522470460508629,null,null,null,null,null,null,null,null,null,null,null,null,null,null,null,null,null,null,null,null,null,null,null,null,null,null,null,null,null,null,null,"No","N/A","N/A","N/A","N/A","N/A","N/A","N/A","N/A","N/A","N/A","N/A","N/A","N/A","N/A","N/A","N/A","N/A","N/A","N/A","N/A"]
["Manually calculated ratios","Improved latrines"]
[null,"Other"]
[null,"Other"]
[null,null,"NATIONAL wealth index quintile",null,null,null,null,"URBAN wealth index quintile",null,null,null,null,"RURAL wealth index quintile",null,null,null,null,"SUB-REGIONS:",null,null,null,null,null,null,null,null,null,null,null,null,null,null,null,null,null,null,null,null,null,null,null,null,null,null,null,null,null,null,null,null,null,null,"Raw numbers of respondents:","Use of sanitation facilities","NATIONAL wealth index quintile",null,null,null,null,"URBAN wealth index quintile",null,null,null,null,"RURAL wealth index quintile",null,null,null,null,"SUB-REGIONS:"]
["Percentage based on weighted population",null,"Poorest","Poor","Middle","Rich","Richest","Poorest","Poor","Middle","Rich","Richest","Poorest","Poor","Middle","Rich","Richest","Central","East","North","South","West",null,null,null,null,null,null,null,null,null,null,null,null,null,null,null,null,null,null,null,null,null,null,null,null,null,null,null,null,null,null,"Sanitation data, raw numbers (weighted)",null,"Poorest","Poor","Middle","Rich","Richest","Poorest","Poor","Middle","Rich","Richest","Poorest","Poor","Middle","Rich","Richest","Central","East","North","South","West"]
["Sanitation type","Sewer connection","N/A","N/A","N/A","N/A","N/A","N/A","N/A","N/A","N/A","N/A","N/A","N/A","N/A","N/A","N/A","N/A","N/A","N/A","N/A","N/A",null,null,null,null,null,null,null,null,null,null,null,null,null,null,null,null,null,null,null,null,null,null,null,null,null,null,null,null,null,null,"Sanitation type","Sewer connection","N/A","N/A","N/A","N/A","N/A","N/A","N/A","N/A","N/A","N/A","N/A","N/A","N/A","N/A","N/A","N/A","N/A","N/A","N/A","N/A"]
[null,"Septic tank connection","N/A","N/A","N/A","N/A","N/A","N/A","N/A","N/A","N/A","N/A","N/A","N/A","N/A","N/A","N/A","N/A","N/A","N/A","N/A","N/A",null,null,null,null,null,null,null,null,null,null,null,null,null,null,null,null,null,null,null,null,null,null,null,null,null,null,null,null,null,null,null,"Septic tank connection","N/A","N/A","N/A","N/A","N/A","N/A","N/A","N/A","N/A","N/A","N/A","N/A","N/A","N/A","N/A","N/A","N/A","N/A","N/A","N/A"]
[null,"Improved latrines","N/A","N/A","N/A","N/A","N/A","N/A","N/A","N/A","N/A","N/A","N/A","N/A","N/A","N/A","N/A","N/A","N/A","N/A","N/A","N/A",null,null,null,null,null,null,null,null,null,null,null,null,null,null,null,null,null,null,null,null,null,null,null,null,null,null,null,null,null,null,null,"Improved latrines","N/A","N/A","N/A","N/A","N/A","N/A","N/A","N/A","N/A","N/A","N/A","N/A","N/A","N/A","N/A","N/A","N/A","N/A","N/A","N/A"]
[null,"Unimproved facilities","N/A","N/A","N/A","N/A","N/A","N/A","N/A","N/A","N/A","N/A","N/A","N/A","N/A","N/A","N/A","N/A","N/A","N/A","N/A","N/A",null,null,null,null,null,null,null,null,null,null,null,null,null,null,null,null,null,null,null,null,null,null,null,null,null,null,null,null,null,null,null,"Unimproved facilities","N/A","N/A","N/A","N/A","N/A","N/A","N/A","N/A","N/A","N/A","N/A","N/A","N/A","N/A","N/A","N/A","N/A","N/A","N/A","N/A"]
[null,"Open defecation",0,0,0,0,0,0,0,0,0,0,0,0,0,0,0,0,0,0,0,0,null,null,null,null,null,null,null,null,null,null,null,null,null,null,null,null,null,null,null,null,null,null,null,null,null,null,null,null,null,null,null,"Open defecation","N/A","N/A","N/A","N/A","N/A","N/A","N/A","N/A","N/A","N/A","N/A","N/A","N/A","N/A","N/A","N/A","N/A","N/A","N/A","N/A"]
["Septic tank emptying practices","Not emptied/treated and disposed in situ","N/A","N/A","N/A","N/A","N/A","N/A","N/A","N/A","N/A","N/A","N/A","N/A","N/A","N/A","N/A","N/A","N/A","N/A","N/A","N/A",null,null,null,null,null,null,null,null,null,null,null,null,null,null,null,null,null,null,null,null,null,null,null,null,null,null,null,null,null,null,"Septic tank emptying practices","Not emptied/treated and disposed in situ","N/A","N/A","N/A","N/A","N/A","N/A","N/A","N/A","N/A","N/A","N/A","N/A","N/A","N/A","N/A","N/A","N/A","N/A","N/A","N/A"]
[null,"Emptied and buried on site","N/A","N/A","N/A","N/A","N/A","N/A","N/A","N/A","N/A","N/A","N/A","N/A","N/A","N/A","N/A","N/A","N/A","N/A","N/A","N/A",null,null,null,null,null,null,null,null,null,null,null,null,null,null,null,null,null,null,null,null,null,null,null,null,null,null,null,null,null,null,null,"Emptied and buried on site","N/A","N/A","N/A","N/A","N/A","N/A","N/A","N/A","N/A","N/A","N/A","N/A","N/A","N/A","N/A","N/A","N/A","N/A","N/A","N/A"]
[null,"Emptied and discharged locally","N/A","N/A","N/A","N/A","N/A","N/A","N/A","N/A","N/A","N/A","N/A","N/A","N/A","N/A","N/A","N/A","N/A","N/A","N/A","N/A",null,null,null,null,null,null,null,null,null,null,null,null,null,null,null,null,null,null,null,null,null,null,null,null,null,null,null,null,null,null,null,"Emptied and discharged locally","N/A","N/A","N/A","N/A","N/A","N/A","N/A","N/A","N/A","N/A","N/A","N/A","N/A","N/A","N/A","N/A","N/A","N/A","N/A","N/A"]
[null,"Emptied and removed offsite","N/A","N/A","N/A","N/A","N/A","N/A","N/A","N/A","N/A","N/A","N/A","N/A","N/A","N/A","N/A","N/A","N/A","N/A","N/A","N/A",null,null,null,null,null,null,null,null,null,null,null,null,null,null,null,null,null,null,null,null,null,null,null,null,null,null,null,null,null,null,null,"Emptied and removed offsite","N/A","N/A","N/A","N/A","N/A","N/A","N/A","N/A","N/A","N/A","N/A","N/A","N/A","N/A","N/A","N/A","N/A","N/A","N/A","N/A"]
["Latrine emptying practices","Not emptied/treated and disposed in situ","N/A","N/A","N/A","N/A","N/A","N/A","N/A","N/A","N/A","N/A","N/A","N/A","N/A","N/A","N/A","N/A","N/A","N/A","N/A","N/A",null,null,null,null,null,null,null,null,null,null,null,null,null,null,null,null,null,null,null,null,null,null,null,null,null,null,null,null,null,null,"Latrine emptying practices","Not emptied/treated and disposed in situ","N/A","N/A","N/A","N/A","N/A","N/A","N/A","N/A","N/A","N/A","N/A","N/A","N/A","N/A","N/A","N/A","N/A","N/A","N/A","N/A"]
[null,"Emptied and buried on site","N/A","N/A","N/A","N/A","N/A","N/A","N/A","N/A","N/A","N/A","N/A","N/A","N/A","N/A","N/A","N/A","N/A","N/A","N/A","N/A",null,null,null,null,null,null,null,null,null,null,null,null,null,null,null,null,null,null,null,null,null,null,null,null,null,null,null,null,null,null,null,"Emptied and buried on site","N/A","N/A","N/A","N/A","N/A","N/A","N/A","N/A","N/A","N/A","N/A","N/A","N/A","N/A","N/A","N/A","N/A","N/A","N/A","N/A"]
[null,"Emptied and discharged locally","N/A","N/A","N/A","N/A","N/A","N/A","N/A","N/A","N/A","N/A","N/A","N/A","N/A","N/A","N/A","N/A","N/A","N/A","N/A","N/A",null,null,null,null,null,null,null,null,null,null,null,null,null,null,null,null,null,null,null,null,null,null,null,null,null,null,null,null,null,null,null,"Emptied and discharged locally","N/A","N/A","N/A","N/A","N/A","N/A","N/A","N/A","N/A","N/A","N/A","N/A","N/A","N/A","N/A","N/A","N/A","N/A","N/A","N/A"]
[null,"Emptied and removed offsite","N/A","N/A","N/A","N/A","N/A","N/A","N/A","N/A","N/A","N/A","N/A","N/A","N/A","N/A","N/A","N/A","N/A","N/A","N/A","N/A",null,null,null,null,null,null,null,null,null,null,null,null,null,null,null,null,null,null,null,null,null,null,null,null,null,null,null,null,null,null,null,"Emptied and removed offsite","N/A","N/A","N/A","N/A","N/A","N/A","N/A","N/A","N/A","N/A","N/A","N/A","N/A","N/A","N/A","N/A","N/A","N/A","N/A","N/A"]
["Shared among improved sanitation facilities","Yes",2.7684606706509101,0.58858232632901142,0.1427278281447798,0.10625743946377272,5.118610823376761E-2,1.526835130038475,0.35094851654253639,0,4.8745631108585895E-2,6.6062726034798541E-2,4.7220703357506588,2.7327573148489748,0.5426705656171571,0.98092509734499722,0.41056044356361954,0.73451821088585645,1.6163969223053984,0,0.67166614397197399,0.46773883850913833,null,null,null,null,null,null,null,null,null,null,null,null,null,null,null,null,null,null,null,null,null,null,null,null,null,null,null,null,null,null,"Shared among improved sanitation facilities","Yes","N/A","N/A","N/A","N/A","N/A","N/A","N/A","N/A","N/A","N/A","N/A","N/A","N/A","N/A","N/A","N/A","N/A","N/A","N/A","N/A"]
[null,"No",85.482186578677073,95.941021869083485,98.069094037464424,99.381470109469902,98.81859459295444,96.917093241234667,97.872565521413009,99.745586342128874,99.585722811137813,99.006645389633448,71.602663453563167,77.374086942850312,89.375208908403721,89.970604189907235,96.194155598385478,96.434696957064205,89.912600016752535,94.547260670602512,96.937166579762419,97.481979415023261,null,null,null,null,null,null,null,null,null,null,null,null,null,null,null,null,null,null,null,null,null,null,null,null,null,null,null,null,null,null,null,"No","N/A","N/A","N/A","N/A","N/A","N/A","N/A","N/A","N/A","N/A","N/A","N/A","N/A","N/A","N/A","N/A","N/A","N/A","N/A","N/A"]
[null,"DK/missing",11.749352750672088,3.4703958045875782,1.788178134390648,0.51227245106631691,1.1302192988117454,1.5560716287267733,1.7764859620444855,0.25441365787112785,0.36553155775361795,0.92729188433176357,23.67526621068609,19.893155742300682,10.082120525979141,9.0484707127477311,3.3952839580508707,2.8307848320499596,8.4710030609419391,5.4527393293972715,2.3911672762656169,2.0502817464675642,null,null,null,null,null,null,null,null,null,null,null,null,null,null,null,null,null,null,null,null,null,null,null,null,null,null,null,null,null,null,null,"DK/missing","N/A","N/A","N/A","N/A","N/A","N/A","N/A","N/A","N/A","N/A","N/A","N/A","N/A","N/A","N/A","N/A","N/A","N/A","N/A","N/A"]
["Shared among all sanitation facilities","Yes",3.4829060847757116,0.80565444712998191,0.16498562695636804,0.10625743946377272,5.1198676904003856E-2,1.5508332535257807,0.35094851654253639,0,4.8745631108585895E-2,6.6083663740278381E-2,7.5472239535420051,3.2910221298472577,0.73784113580536659,1.7699607865880411,0.41056044356361954,0.91706208466777739,2.1569382925893406,0,0.8607737111320769,0.52423536279115479,null,null,null,null,null,null,null,null,null,null,null,null,null,null,null,null,null,null,null,null,null,null,null,null,null,null,null,null,null,null,"Shared among all sanitation facilities","Yes","N/A","N/A","N/A","N/A","N/A","N/A","N/A","N/A","N/A","N/A","N/A","N/A","N/A","N/A","N/A","N/A","N/A","N/A","N/A","N/A"]
[null,"No",96.066715730324731,98.79531541452198,99.670470877518355,99.673391740692423,99.254335127469687,97.866186086636816,99.388473087930564,99.760122984438553,99.693070183807535,99.130957923562164,92.236158680453642,96.418859908033497,98.939831869384079,97.887076835101297,99.589439556436389,98.728788143908659,97.087593730607082,99.894056367131313,99.007913059281776,99.117106742499331,null,null,null,null,null,null,null,null,null,null,null,null,null,null,null,null,null,null,null,null,null,null,null,null,null,null,null,null,null,null,null,"No","N/A","N/A","N/A","N/A","N/A","N/A","N/A","N/A","N/A","N/A","N/A","N/A","N/A","N/A","N/A","N/A","N/A","N/A","N/A","N/A"]
["Type of toilet facility","Flush toilet",60.189369250859315,81.553631823320089,90.981906732843868,94.737665799147706,96.50880718571689,91.789077117965647,95.70425226151508,98.010452623977201,98.085533180759583,99.105657974578534,27.123337299120937,35.837595133015562,44.538290839332099,47.57556551125213,64.524856711215662,89.403324831051293,73.12611730499421,68.010442225980611,76.641357210745426,93.607596274534316,null,null,null,null,null,null,null,null,null,null,null,null,null,null,null,null,null,null,null,null,null,null,null,null,null,null,null,null,null,null,"Type of toilet facility","Flush toilet",5197.9558660000057,7154.4577179999924,7964.8754909999834,8308.8557729999866,8454.5157669999808,6237.1085950000179,6503.9647099999893,6649.8142059999864,6665.3098429999827,6731.3051180000075,506.96660599999996,697.28687699999978,877.66109099999994,938.64805100000058,1272.595517999998,7810.6380399999825,6044.8462259999951,2215.1841199999953,4182.7903200000101,16827.201909000014]
[null,"Open pit",9.7014429331930518,2.8083038427164264,1.5122145949607404,0.27556202568807558,0.41177378033824774,0.9043945541045002,1.4020842911520432,1.4546395607149503E-2,0.10744759619411408,9.2933689818909856E-2,18.720623146381296,18.034126356717625,9.1041949583874402,8.3848011691547359,3.0338819339869065,2.3823153922988958,6.0568991145824507,4.7884627133124598,2.0760166473497264,1.6617814366981918,null,null,null,null,null,null,null,null,null,null,null,null,null,null,null,null,null,null,null,null,null,null,null,null,null,null,null,null,null,null,null,"Open pit",837.81692399999986,246.36414900000003,132.38457400000001,24.167844000000002,36.072852000000005,61.454012000000006,95.284237999999988,0.98694400000000004,7.3014999999999999,6.3121020000000003,349.91014099999995,350.88737400000019,179.40512599999997,165.42898000000002,59.835926000000001,208.128761,500.68327300000004,155.96614599999995,113.300999,298.72716399999996]
[null,"Closed pit",29.817769050092796,15.413913698571621,7.4244588847782564,4.97041256962987,3.0794190339448684,7.287579165661227,2.8196170452290623,1.9750009804156365,1.8070192230462991,0.80140833560257785,53.580118441933791,45.454238575082158,45.863277210224076,43.718926154310886,32.079859330733377,8.1187496212522881,20.508879164375475,26.642762077490527,21.257227465694804,4.7306222887676368,null,null,null,null,null,null,null,null,null,null,null,null,null,null,null,null,null,null,null,null,null,null,null,null,null,null,null,null,null,null,null,"Closed pit",2575.063494999999,1352.2168340000001,649.96319300000005,435.92420000000021,269.76809200000002,495.19424400000003,191.61833800000005,133.99988700000003,122.79428599999999,54.432049000000006,1001.474505,884.39651000000026,903.77096100000074,862.55800399999976,632.69703000000004,709.28698399999882,1695.3316460000017,867.78767400000015,1160.1376660000014,850.39184400000022]
[null,"Other",0.29141876585490889,0.22415063539192523,8.1419787417087552E-2,1.635960553441386E-2,0,1.8949162268578505E-2,7.4046402103858253E-2,0,0,0,0.57592111256386802,0.67403993518463123,0.49423699205635885,0.32070716528232884,0.36140202406396438,9.5610155397073224E-2,0.30810441604779593,0.55833298321612401,2.5398676210468284E-2,0,null,null,null,null,null,null,null,null,null,null,null,null,null,null,null,null,null,null,null,null,null,null,null,null,null,null,null,null,null,null,null,"Other",25.166934000000001,19.664068999999998,7.1277740000000005,1.4348000000000001,0,1.287604,5.0321189999999998,0,0,0,10.764633,13.114697,9.739317999999999,6.3274319999999999,7.1277740000000005,8.3528920000000006,25.468928000000002,18.185594999999999,1.3861619999999999,0]
[null,null,null,null,null,null,null,null,null,null,null,null,null,null,null,null,null,null,null,null,null,null,null,null,null,null,null,null,null,null,null,null,null,null,null,null,null,null,null,null,null,null,null,null,null,null,null,null,null,null,null,null,null,"Total",8636.0032189999984,8772.7027699999871,8754.3510319999878,8770.3826169999811,8760.3567109999804,6795.0444550000211,6795.8994049999865,6784.8010369999874,6795.4056289999835,6792.0492690000065,1869.115885000002,1945.6854580000008,1970.576496000001,1972.9624669999989,1972.2562479999999,8736.4066770000209,8266.3300730000028,3257.1235350000047,5457.6151469999886,17976.320916999986]
[]
[]
[]
[]
[]
[]
[]
[]
[]
[]
[]
[]
[]
[]
[]
[]
[]
[]
[]
[]
[]
[]
[]
[]
[]
[]
[]
[]
[]
[]
[]
[]
[]
[]
[]
[]
[]
[]
[]
[]
[]
[]
[]
[]
[]
[]
[]
[]
[]
[]
[{"$f":"A1026","v":"Turkey"}]
[{"$f":"A1034","v":"2013"}]
["Access to hygiene facilities "]
[" by wealth quintile and sub-national region"]
["Notes:"]
["WHO/UNICEF JMP customised wealth index excludes water,"]
[" sanitation and hygiene assets."]
["Survey used for analysis:",{"$f":"A1025","v":"DHS13"}]
[]
[]
[]
[]
["Access to handwashing",null,"NATIONAL wealth index quintile",null,null,null,null,"URBAN wealth index quintile",null,null,null,null,"RURAL wealth index quintile",null,null,null,null,"SUB-REGIONS:",null,null,null,null,null,null,null,null,null,null,null,null,null,null,null,null,null,null,null,null,null,null,null,null,null,null,null,null,null,null,null,null,null,null,"Raw numbers of respondents:","Access to handwashing","NATIONAL wealth index quintile",null,null,null,null,"URBAN wealth index quintile",null,null,null,null,"RURAL wealth index quintile",null,null,null,null,"SUB-REGIONS:"]
["Weighted percentage (used in graphs)",null,"Poorest","Poor","Middle","Rich","Richest","Poorest","Poor","Middle","Rich","Richest","Poorest","Poor","Middle","Rich","Richest","Central","East","North","South","West",null,null,null,null,null,null,null,null,null,null,null,null,null,null,null,null,null,null,null,null,null,null,null,null,null,null,null,null,null,null,"Hygiene data, raw numbers (weighted)",null,"Poorest","Poor","Middle","Rich","Richest","Poorest","Poor","Middle","Rich","Richest","Poorest","Poor","Middle","Rich","Richest","Central","East","North","South","West"]
["Hygiene ladder","Basic","N/A","N/A","N/A","N/A","N/A","N/A","N/A","N/A","N/A","N/A","N/A","N/A","N/A","N/A","N/A","N/A","N/A","N/A","N/A","N/A",null,null,null,null,null,null,null,null,null,null,null,null,null,null,null,null,null,null,null,null,null,null,null,null,null,null,null,null,null,null,"Hygiene ladder","Basic","N/A","N/A","N/A","N/A","N/A","N/A","N/A","N/A","N/A","N/A","N/A","N/A","N/A","N/A","N/A","N/A","N/A","N/A","N/A","N/A"]
[null,"Limited","N/A","N/A","N/A","N/A","N/A","N/A","N/A","N/A","N/A","N/A","N/A","N/A","N/A","N/A","N/A","N/A","N/A","N/A","N/A","N/A",null,null,null,null,null,null,null,null,null,null,null,null,null,null,null,null,null,null,null,null,null,null,null,null,null,null,null,null,null,null,null,"Limited","N/A","N/A","N/A","N/A","N/A","N/A","N/A","N/A","N/A","N/A","N/A","N/A","N/A","N/A","N/A","N/A","N/A","N/A","N/A","N/A"]
[null,"No facility","N/A","N/A","N/A","N/A","N/A","N/A","N/A","N/A","N/A","N/A","N/A","N/A","N/A","N/A","N/A","N/A","N/A","N/A","N/A","N/A",null,null,null,null,null,null,null,null,null,null,null,null,null,null,null,null,null,null,null,null,null,null,null,null,null,null,null,null,null,null,null,"No facility","N/A","N/A","N/A","N/A","N/A","N/A","N/A","N/A","N/A","N/A","N/A","N/A","N/A","N/A","N/A","N/A","N/A","N/A","N/A","N/A"]
[null,null,null,null,null,null,null,null,null,null,null,null,null,null,null,null,null,null,null,null,null,null,null,null,null,null,null,null,null,null,null,null,null,null,null,null,null,null,null,null,null,null,null,null,null,null,null,null,null,null,null,null,"Observed handwashing place","Fixed","N/A","N/A","N/A","N/A","N/A","N/A","N/A","N/A","N/A","N/A","N/A","N/A","N/A","N/A","N/A","N/A","N/A","N/A","N/A","N/A"]
[null,null,null,null,null,null,null,null,null,null,null,null,null,null,null,null,null,null,null,null,null,null,null,null,null,null,null,null,null,null,null,null,null,null,null,null,null,null,null,null,null,null,null,null,null,null,null,null,null,null,null,null,null,"Mobile","N/A","N/A","N/A","N/A","N/A","N/A","N/A","N/A","N/A","N/A","N/A","N/A","N/A","N/A","N/A","N/A","N/A","N/A","N/A","N/A"]
[null,null,null,null,null,null,null,null,null,null,null,null,null,null,null,null,null,null,null,null,null,null,null,null,null,null,null,null,null,null,null,null,null,null,null,null,null,null,null,null,null,null,null,null,null,null,null,null,null,null,null,null,"Water / Soap","Water and soap","N/A","N/A","N/A","N/A","N/A","N/A","N/A","N/A","N/A","N/A","N/A","N/A","N/A","N/A","N/A","N/A","N/A","N/A","N/A","N/A"]
[null,null,null,null,null,null,null,null,null,null,null,null,null,null,null,null,null,null,null,null,null,null,null,null,null,null,null,null,null,null,null,null,null,null,null,null,null,null,null,null,null,null,null,null,null,null,null,null,null,null,null,null,null,"Water only","N/A","N/A","N/A","N/A","N/A","N/A","N/A","N/A","N/A","N/A","N/A","N/A","N/A","N/A","N/A","N/A","N/A","N/A","N/A","N/A"]
[null,null,null,null,null,null,null,null,null,null,null,null,null,null,null,null,null,null,null,null,null,null,null,null,null,null,null,null,null,null,null,null,null,null,null,null,null,null,null,null,null,null,null,null,null,null,null,null,null,null,null,null,null,"Soap only","N/A","N/A","N/A","N/A","N/A","N/A","N/A","N/A","N/A","N/A","N/A","N/A","N/A","N/A","N/A","N/A","N/A","N/A","N/A","N/A"]
[null,null,null,null,null,null,null,null,null,null,null,null,null,null,null,null,null,null,null,null,null,null,null,null,null,null,null,null,null,null,null,null,null,null,null,null,null,null,null,null,null,null,null,null,null,null,null,null,null,null,null,null,null,"Neither","N/A","N/A","N/A","N/A","N/A","N/A","N/A","N/A","N/A","N/A","N/A","N/A","N/A","N/A","N/A","N/A","N/A","N/A","N/A","N/A"]
[]
[]
[]
[]
[]
[]
[]
[]
[]
[]
[]
[]
[]
[]
[]
[]
[]
[]
[]
[]
[]
[]
[]
[]
[]
[]
[]
[]
[null,null,null,null,null,null,null,null,null,null,null,null,null,null,null,null,null,null,null,null,null,null,null,null,null,null,null,null,null,null,null,null,null,null,null,null,null,null,null,null,null,null,null,null,null,null,null,null,null,null,null,null,"Raw numbers of respondents:","Menstrual health and hygiene","NATIONAL wealth index quintile",null,null,null,null,"URBAN wealth index quintile",null,null,null,null,"RURAL wealth index quintile",null,null,null,null,"SUB-REGIONS:"]
[null,null,null,null,null,null,null,null,null,null,null,null,null,null,null,null,null,null,null,null,null,null,null,null,null,null,null,null,null,null,null,null,null,null,null,null,null,null,null,null,null,null,null,null,null,null,null,null,null,null,null,null,"MHH data, raw numbers (weighted)",null,"Poorest","Poor","Middle","Rich","Richest","Poorest","Poor","Middle","Rich","Richest","Poorest","Poor","Middle","Rich","Richest","Central","East","North","South","West"]
[null,null,null,null,null,null,null,null,null,null,null,null,null,null,null,null,null,null,null,null,null,null,null,null,null,null,null,null,null,null,null,null,null,null,null,null,null,null,null,null,null,null,null,null,null,null,null,null,null,null,null,null,"Private place to wash and change","Yes","N/A","N/A","N/A","N/A","N/A","N/A","N/A","N/A","N/A","N/A","N/A","N/A","N/A","N/A","N/A","N/A","N/A","N/A","N/A","N/A"]
[null,null,null,null,null,null,null,null,null,null,null,null,null,null,null,null,null,null,null,null,null,null,null,null,null,null,null,null,null,null,null,null,null,null,null,null,null,null,null,null,null,null,null,null,null,null,null,null,null,null,null,null,null,"No","N/A","N/A","N/A","N/A","N/A","N/A","N/A","N/A","N/A","N/A","N/A","N/A","N/A","N/A","N/A","N/A","N/A","N/A","N/A","N/A"]
[null,null,null,null,null,null,null,null,null,null,null,null,null,null,null,null,null,null,null,null,null,null,null,null,null,null,null,null,null,null,null,null,null,null,null,null,null,null,null,null,null,null,null,null,null,null,null,null,null,null,null,null,null,"DK/not sure/missing","N/A","N/A","N/A","N/A","N/A","N/A","N/A","N/A","N/A","N/A","N/A","N/A","N/A","N/A","N/A","N/A","N/A","N/A","N/A","N/A"]
[null,null,null,null,null,null,null,null,null,null,null,null,null,null,null,null,null,null,null,null,null,null,null,null,null,null,null,null,null,null,null,null,null,null,null,null,null,null,null,null,null,null,null,null,null,null,null,null,null,null,null,null,"Use of menstrual materials","Materials reusable","N/A","N/A","N/A","N/A","N/A","N/A","N/A","N/A","N/A","N/A","N/A","N/A","N/A","N/A","N/A","N/A","N/A","N/A","N/A","N/A"]
[null,null,null,null,null,null,null,null,null,null,null,null,null,null,null,null,null,null,null,null,null,null,null,null,null,null,null,null,null,null,null,null,null,null,null,null,null,null,null,null,null,null,null,null,null,null,null,null,null,null,null,null,null,"Materials not reusable","N/A","N/A","N/A","N/A","N/A","N/A","N/A","N/A","N/A","N/A","N/A","N/A","N/A","N/A","N/A","N/A","N/A","N/A","N/A","N/A"]
[null,null,null,null,null,null,null,null,null,null,null,null,null,null,null,null,null,null,null,null,null,null,null,null,null,null,null,null,null,null,null,null,null,null,null,null,null,null,null,null,null,null,null,null,null,null,null,null,null,null,null,null,null,"No materials used","N/A","N/A","N/A","N/A","N/A","N/A","N/A","N/A","N/A","N/A","N/A","N/A","N/A","N/A","N/A","N/A","N/A","N/A","N/A","N/A"]
[null,null,null,null,null,null,null,null,null,null,null,null,null,null,null,null,null,null,null,null,null,null,null,null,null,null,null,null,null,null,null,null,null,null,null,null,null,null,null,null,null,null,null,null,null,null,null,null,null,null,null,null,null,"DK/not sure/missing","N/A","N/A","N/A","N/A","N/A","N/A","N/A","N/A","N/A","N/A","N/A","N/A","N/A","N/A","N/A","N/A","N/A","N/A","N/A","N/A"]
[null,null,null,null,null,null,null,null,null,null,null,null,null,null,null,null,null,null,null,null,null,null,null,null,null,null,null,null,null,null,null,null,null,null,null,null,null,null,null,null,null,null,null,null,null,null,null,null,null,null,null,null,"Use of menstrual materials with private place to wash and change","Materials reusable","N/A","N/A","N/A","N/A","N/A","N/A","N/A","N/A","N/A","N/A","N/A","N/A","N/A","N/A","N/A","N/A","N/A","N/A","N/A","N/A"]
[null,null,null,null,null,null,null,null,null,null,null,null,null,null,null,null,null,null,null,null,null,null,null,null,null,null,null,null,null,null,null,null,null,null,null,null,null,null,null,null,null,null,null,null,null,null,null,null,null,null,null,null,null,"Materials not reusable","N/A","N/A","N/A","N/A","N/A","N/A","N/A","N/A","N/A","N/A","N/A","N/A","N/A","N/A","N/A","N/A","N/A","N/A","N/A","N/A"]
[null,null,null,null,null,null,null,null,null,null,null,null,null,null,null,null,null,null,null,null,null,null,null,null,null,null,null,null,null,null,null,null,null,null,null,null,null,null,null,null,null,null,null,null,null,null,null,null,null,null,null,null,null,"No materials used","N/A","N/A","N/A","N/A","N/A","N/A","N/A","N/A","N/A","N/A","N/A","N/A","N/A","N/A","N/A","N/A","N/A","N/A","N/A","N/A"]
[null,null,null,null,null,null,null,null,null,null,null,null,null,null,null,null,null,null,null,null,null,null,null,null,null,null,null,null,null,null,null,null,null,null,null,null,null,null,null,null,null,null,null,null,null,null,null,null,null,null,null,null,"Awareness of menstruation before menarche","Yes","N/A","N/A","N/A","N/A","N/A","N/A","N/A","N/A","N/A","N/A","N/A","N/A","N/A","N/A","N/A","N/A","N/A","N/A","N/A","N/A"]
[null,null,null,null,null,null,null,null,null,null,null,null,null,null,null,null,null,null,null,null,null,null,null,null,null,null,null,null,null,null,null,null,null,null,null,null,null,null,null,null,null,null,null,null,null,null,null,null,null,null,null,null,null,"No","N/A","N/A","N/A","N/A","N/A","N/A","N/A","N/A","N/A","N/A","N/A","N/A","N/A","N/A","N/A","N/A","N/A","N/A","N/A","N/A"]
[null,null,null,null,null,null,null,null,null,null,null,null,null,null,null,null,null,null,null,null,null,null,null,null,null,null,null,null,null,null,null,null,null,null,null,null,null,null,null,null,null,null,null,null,null,null,null,null,null,null,null,null,null,"DK/not sure/missing","N/A","N/A","N/A","N/A","N/A","N/A","N/A","N/A","N/A","N/A","N/A","N/A","N/A","N/A","N/A","N/A","N/A","N/A","N/A","N/A"]
[null,null,null,null,null,null,null,null,null,null,null,null,null,null,null,null,null,null,null,null,null,null,null,null,null,null,null,null,null,null,null,null,null,null,null,null,null,null,null,null,null,null,null,null,null,null,null,null,null,null,null,null,"Participation in (all) activities during menstruation","Yes","N/A","N/A","N/A","N/A","N/A","N/A","N/A","N/A","N/A","N/A","N/A","N/A","N/A","N/A","N/A","N/A","N/A","N/A","N/A","N/A"]
[null,null,null,null,null,null,null,null,null,null,null,null,null,null,null,null,null,null,null,null,null,null,null,null,null,null,null,null,null,null,null,null,null,null,null,null,null,null,null,null,null,null,null,null,null,null,null,null,null,null,null,null,null,"No","N/A","N/A","N/A","N/A","N/A","N/A","N/A","N/A","N/A","N/A","N/A","N/A","N/A","N/A","N/A","N/A","N/A","N/A","N/A","N/A"]
[null,null,null,null,null,null,null,null,null,null,null,null,null,null,null,null,null,null,null,null,null,null,null,null,null,null,null,null,null,null,null,null,null,null,null,null,null,null,null,null,null,null,null,null,null,null,null,null,null,null,null,null,null,"DK/not sure/missing/no such activity","N/A","N/A","N/A","N/A","N/A","N/A","N/A","N/A","N/A","N/A","N/A","N/A","N/A","N/A","N/A","N/A","N/A","N/A","N/A","N/A"]
[null,null,null,null,null,null,null,null,null,null,null,null,null,null,null,null,null,null,null,null,null,null,null,null,null,null,null,null,null,null,null,null,null,null,null,null,null,null,null,null,null,null,null,null,null,null,null,null,null,null,null,null,"Participation in specific activities during menstruation","Did not go to school (amongst those usually attending school)","N/A","N/A","N/A","N/A","N/A","N/A","N/A","N/A","N/A","N/A","N/A","N/A","N/A","N/A","N/A","N/A","N/A","N/A","N/A","N/A"]
[null,null,null,null,null,null,null,null,null,null,null,null,null,null,null,null,null,null,null,null,null,null,null,null,null,null,null,null,null,null,null,null,null,null,null,null,null,null,null,null,null,null,null,null,null,null,null,null,null,null,null,null,null,"Did not go to work (amongst those who usually work)","N/A","N/A","N/A","N/A","N/A","N/A","N/A","N/A","N/A","N/A","N/A","N/A","N/A","N/A","N/A","N/A","N/A","N/A","N/A","N/A"]
[null,null,null,null,null,null,null,null,null,null,null,null,null,null,null,null,null,null,null,null,null,null,null,null,null,null,null,null,null,null,null,null,null,null,null,null,null,null,null,null,null,null,null,null,null,null,null,null,null,null,null,null,null,"Did not participate in social activities","N/A","N/A","N/A","N/A","N/A","N/A","N/A","N/A","N/A","N/A","N/A","N/A","N/A","N/A","N/A","N/A","N/A","N/A","N/A","N/A"]
[null,null,null,null,null,null,null,null,null,null,null,null,null,null,null,null,null,null,null,null,null,null,null,null,null,null,null,null,null,null,null,null,null,null,null,null,null,null,null,null,null,null,null,null,null,null,null,null,null,null,null,null,null,"Did not cook food","N/A","N/A","N/A","N/A","N/A","N/A","N/A","N/A","N/A","N/A","N/A","N/A","N/A","N/A","N/A","N/A","N/A","N/A","N/A","N/A"]
[null,null,null,null,null,null,null,null,null,null,null,null,null,null,null,null,null,null,null,null,null,null,null,null,null,null,null,null,null,null,null,null,null,null,null,null,null,null,null,null,null,null,null,null,null,null,null,null,null,null,null,null,null,"Did not eat with others","N/A","N/A","N/A","N/A","N/A","N/A","N/A","N/A","N/A","N/A","N/A","N/A","N/A","N/A","N/A","N/A","N/A","N/A","N/A","N/A"]
[null,null,null,null,null,null,null,null,null,null,null,null,null,null,null,null,null,null,null,null,null,null,null,null,null,null,null,null,null,null,null,null,null,null,null,null,null,null,null,null,null,null,null,null,null,null,null,null,null,null,null,null,null,"Did not bathe in regular place","N/A","N/A","N/A","N/A","N/A","N/A","N/A","N/A","N/A","N/A","N/A","N/A","N/A","N/A","N/A","N/A","N/A","N/A","N/A","N/A"]
[null,null,null,null,null,null,null,null,null,null,null,null,null,null,null,null,null,null,null,null,null,null,null,null,null,null,null,null,null,null,null,null,null,null,null,null,null,null,null,null,null,null,null,null,null,null,null,null,null,null,null,null,null,"Did not participate in other activities","N/A","N/A","N/A","N/A","N/A","N/A","N/A","N/A","N/A","N/A","N/A","N/A","N/A","N/A","N/A","N/A","N/A","N/A","N/A","N/A"]
[null,null,null,null,null,null,null,null,null,null,null,null,null,null,null,null,null,null,null,null,null,null,null,null,null,null,null,null,null,null,null,null,null,null,null,null,null,null,null,null,null,null,null,null,null,null,null,null,null,null,null,null,null,"DK/not sure/missing/no such activity","N/A","N/A","N/A","N/A","N/A","N/A","N/A","N/A","N/A","N/A","N/A","N/A","N/A","N/A","N/A","N/A","N/A","N/A","N/A","N/A"]
[]
[]
[]
[]
[]
[]
[]
[]
[]
[]
[]
[]
[]
[]
[]
[]
[]
[]
[]
[]
[]
[]
[]
[]
[]
[]
[]
[]
[]
[]
[]
[]
[]
[]
[]
[]
[]
[]
[]
[]
[]
[]
[]
[]
[]
[]
[]
[]
[]
[]
[]
[]
[]
[]
[null,null,null,null,null,null,null,null,null,null,null,null,null,null,null,null,null,null,null,null,null,null,null,null,null,null,null,null,null,null,null,null,null,null,null,null,null,null,null,null,null,null,null,null,null,null,null,null,null,null,null,null,"Raw numbers of respondents:","Basic water, sanitation and hygiene","NATIONAL wealth index quintile",null,null,null,null,"URBAN wealth index quintile",null,null,null,null,"RURAL wealth index quintile",null,null,null,null,"SUB-REGIONS:"]
[null,null,null,null,null,null,null,null,null,null,null,null,null,null,null,null,null,null,null,null,null,null,null,null,null,null,null,null,null,null,null,null,null,null,null,null,null,null,null,null,null,null,null,null,null,null,null,null,null,null,null,null,"WatSan data, raw numbers (weighted)",null,"Poorest","Poor","Middle","Rich","Richest","Poorest","Poor","Middle","Rich","Richest","Poorest","Poor","Middle","Rich","Richest","Central","East","North","South","West"]
[null,null,null,null,null,null,null,null,null,null,null,null,null,null,null,null,null,null,null,null,null,null,null,null,null,null,null,null,null,null,null,null,null,null,null,null,null,null,null,null,null,null,null,null,null,null,null,null,null,null,null,null,"Use of Basic Water Sanitation and Hygiene","Yes","N/A","N/A","N/A","N/A","N/A","N/A","N/A","N/A","N/A","N/A","N/A","N/A","N/A","N/A","N/A","N/A","N/A","N/A","N/A","N/A"]
[null,null,null,null,null,null,null,null,null,null,null,null,null,null,null,null,null,null,null,null,null,null,null,null,null,null,null,null,null,null,null,null,null,null,null,null,null,null,null,null,null,null,null,null,null,null,null,null,null,null,null,null,null,"No","N/A","N/A","N/A","N/A","N/A","N/A","N/A","N/A","N/A","N/A","N/A","N/A","N/A","N/A","N/A","N/A","N/A","N/A","N/A","N/A"]
[null,null,null,null,null,null,null,null,null,null,null,null,null,null,null,null,null,null,null,null,null,null,null,null,null,null,null,null,null,null,null,null,null,null,null,null,null,null,null,null,null,null,null,null,null,null,null,null,null,null,null,null,"Use of Basic Water and Sanitation","Yes","N/A","N/A","N/A","N/A","N/A","N/A","N/A","N/A","N/A","N/A","N/A","N/A","N/A","N/A","N/A","N/A","N/A","N/A","N/A","N/A"]
[null,null,null,null,null,null,null,null,null,null,null,null,null,null,null,null,null,null,null,null,null,null,null,null,null,null,null,null,null,null,null,null,null,null,null,null,null,null,null,null,null,null,null,null,null,null,null,null,null,null,null,null,null,"No","N/A","N/A","N/A","N/A","N/A","N/A","N/A","N/A","N/A","N/A","N/A","N/A","N/A","N/A","N/A","N/A","N/A","N/A","N/A","N/A"]
[null,null,null,null,null,null,null,null,null,null,null,null,null,null,null,null,null,null,null,null,null,null,null,null,null,null,null,null,null,null,null,null,null,null,null,null,null,null,null,null,null,null,null,null,null,null,null,null,null,null,null,null,"Use of Basic Water and Hygiene","Yes","N/A","N/A","N/A","N/A","N/A","N/A","N/A","N/A","N/A","N/A","N/A","N/A","N/A","N/A","N/A","N/A","N/A","N/A","N/A","N/A"]
[null,null,null,null,null,null,null,null,null,null,null,null,null,null,null,null,null,null,null,null,null,null,null,null,null,null,null,null,null,null,null,null,null,null,null,null,null,null,null,null,null,null,null,null,null,null,null,null,null,null,null,null,null,"No","N/A","N/A","N/A","N/A","N/A","N/A","N/A","N/A","N/A","N/A","N/A","N/A","N/A","N/A","N/A","N/A","N/A","N/A","N/A","N/A"]
[null,null,null,null,null,null,null,null,null,null,null,null,null,null,null,null,null,null,null,null,null,null,null,null,null,null,null,null,null,null,null,null,null,null,null,null,null,null,null,null,null,null,null,null,null,null,null,null,null,null,null,null,"Use of Basic Sanitation and Hygiene","Yes","N/A","N/A","N/A","N/A","N/A","N/A","N/A","N/A","N/A","N/A","N/A","N/A","N/A","N/A","N/A","N/A","N/A","N/A","N/A","N/A"]
[null,null,null,null,null,null,null,null,null,null,null,null,null,null,null,null,null,null,null,null,null,null,null,null,null,null,null,null,null,null,null,null,null,null,null,null,null,null,null,null,null,null,null,null,null,null,null,null,null,null,null,null,null,"No","N/A","N/A","N/A","N/A","N/A","N/A","N/A","N/A","N/A","N/A","N/A","N/A","N/A","N/A","N/A","N/A","N/A","N/A","N/A","N/A"]
[null,null,null,null,null,null,null,null,null,null,null,null,null,null,null,null,null,null,null,null,null,null,null,null,null,null,null,null,null,null,null,null,null,null,null,null,null,null,null,null,null,null,null,null,null,null,null,null,null,null,null,null,"Use of Basic Water","Yes","N/A","N/A","N/A","N/A","N/A","N/A","N/A","N/A","N/A","N/A","N/A","N/A","N/A","N/A","N/A","N/A","N/A","N/A","N/A","N/A"]
[null,null,null,null,null,null,null,null,null,null,null,null,null,null,null,null,null,null,null,null,null,null,null,null,null,null,null,null,null,null,null,null,null,null,null,null,null,null,null,null,null,null,null,null,null,null,null,null,null,null,null,null,null,"No","N/A","N/A","N/A","N/A","N/A","N/A","N/A","N/A","N/A","N/A","N/A","N/A","N/A","N/A","N/A","N/A","N/A","N/A","N/A","N/A"]
[null,null,null,null,null,null,null,null,null,null,null,null,null,null,null,null,null,null,null,null,null,null,null,null,null,null,null,null,null,null,null,null,null,null,null,null,null,null,null,null,null,null,null,null,null,null,null,null,null,null,null,null,"Use of Basic Sanitation","Yes","N/A","N/A","N/A","N/A","N/A","N/A","N/A","N/A","N/A","N/A","N/A","N/A","N/A","N/A","N/A","N/A","N/A","N/A","N/A","N/A"]
[null,null,null,null,null,null,null,null,null,null,null,null,null,null,null,null,null,null,null,null,null,null,null,null,null,null,null,null,null,null,null,null,null,null,null,null,null,null,null,null,null,null,null,null,null,null,null,null,null,null,null,null,null,"No","N/A","N/A","N/A","N/A","N/A","N/A","N/A","N/A","N/A","N/A","N/A","N/A","N/A","N/A","N/A","N/A","N/A","N/A","N/A","N/A"]
[null,null,null,null,null,null,null,null,null,null,null,null,null,null,null,null,null,null,null,null,null,null,null,null,null,null,null,null,null,null,null,null,null,null,null,null,null,null,null,null,null,null,null,null,null,null,null,null,null,null,null,null,"Access to Basic Hygiene","Yes","N/A","N/A","N/A","N/A","N/A","N/A","N/A","N/A","N/A","N/A","N/A","N/A","N/A","N/A","N/A","N/A","N/A","N/A","N/A","N/A"]
[null,null,null,null,null,null,null,null,null,null,null,null,null,null,null,null,null,null,null,null,null,null,null,null,null,null,null,null,null,null,null,null,null,null,null,null,null,null,null,null,null,null,null,null,null,null,null,null,null,null,null,null,null,"No","N/A","N/A","N/A","N/A","N/A","N/A","N/A","N/A","N/A","N/A","N/A","N/A","N/A","N/A","N/A","N/A","N/A","N/A","N/A","N/A"]
[]
[]
[]
[]
[]
[]
[]
[]
[]
[]
[]
[]
[]
[]
[]
[]
[]
[]
[]
[]
[]
[]
[]
[]
[]
[]
[]
[]
[]
[]
[]
[]
[]
[]
[]
[]
[]
[]
[]
[]
[]
[]
[]
[]
[null,null,"INITIAL (national) Wealth Index",null,null,null,null,"URBAN Wealth Index",null,null,null,null,"RURAL Wealth Index"]
[null,null,"Component Matrix",null,null,null,null,"Component Matrix",null,null,null,null,"Component Matrix"]
[null,null,null,null,"Component",null,null,null,null,"Component",null,null,null,null,"Component"]
[null,"Note:\n\nThe INITIAL (national) Wealth Index is based on the first component of the Principal Component Analysis (PCA) which has been obtained at national level.\n\nThe final national-level (NATIONAL) Wealth Index is based on the URBAN and RURAL specific wealth indexes. Regression procedures are used to establish the relationships between the two sets of scores (urban and rural) and the initial (national) wealth factors.\nThis allows best use of the available information for each area and a better precision of the FINAL (NATIONAL) Wealth Index.\n\nFor dependency reasons, all WASH variables (contained in the generic MICS and DHS scripts) have been excluded from the sets of asset variables used in the PCAs.\n\nThe PCA can extracts as many components as there are asset variables in the input. Only the first of the components is used to represent the Wealth Index. \n\nThe scores represent the weights of the asset variables on the Wealth Index (correlations between the variables and the component).\n\nThe communalities are the proportion of each variable's variance that can be explained by the component.\n\nProportion of explained variance is the part of the model's total variance that is explained by the component.\n\nFor more information on the procedure used:\n\nThe DHS Wealth Index, DHS Comparative Reports No. 6, Shea Oscar Rutstein, Kiersten Johnson, ORC Macro International Inc., 2004.\n\nThe DHS Wealth Index: Approaches for Rural and Urban Areas, Shea O. Rutstein, ORC Macro International Inc., 2008.\n\nMICS Methodological Paper No. 4, Review of options for reporting water, sanitation and hygiene coverage by wealth quintile, UNICEF, 2016.",null,null,"1",null,null,null,null,"1",null,null,null,null,"1"]
[null,null,"Dishwasher",null,0.64213727867734505,null,null,"Dishwasher",null,0.60388841816462369,null,null,"Iron",null,0.61256581281766753]
[null,null,"Internet",null,0.60609555386010749,null,null,"Internet",null,0.58116361477685508,null,null,"Vacuum cleaner",null,0.60430106862460997]
[null,null,"Iron",null,0.59141301736099217,null,null,"Car",null,0.57109930178032975,null,null,"Car",null,0.5987562410547782]
[null,null,"Vacuum cleaner",null,0.579802277207633,null,null,"Has car/truck",null,0.57109930178032853,null,null,"Has car/truck",null,0.59875624105477787]
[null,null,"Gas/electric oven",null,0.5605048209572947,null,null,"Iron",null,0.52749678314365378,null,null,"Gas/electric oven",null,0.56937614696363303]
[null,null,"Car",null,0.54873213888047578,null,null,"Laptop",null,0.52022356091932875,null,null,"Dishwasher",null,0.56070499046061872]
[null,null,"Has car/truck",null,0.54873213888047567,null,null,"Gas/electric oven",null,0.50329812796633255,null,null,"Internet",null,0.53806314251225995]
[null,null,"Laptop",null,0.54323990174307879,null,null,"Vacuum cleaner",null,0.50309391819943994,null,null,"Washing machine",null,0.49200729070707272]
[null,null,"LCD/Plasma television",null,0.5182636429131926,null,null,"LCD/Plasma television",null,0.49934245080977563,null,null,"Laptop",null,0.4765313870868006]
[null,null,"Washing machine",null,0.45645532817377643,null,null,"Washing machine",null,0.41858193238999031,null,null,"Has mobile telephone",null,0.44112497466340084]
[null,null,"Concrete, cement floor",null,-0.44741837206979768,null,null,"Concrete, cement floor",null,-0.41760292581573605,null,null,"Mobile phone",null,0.44112497466339839]
[null,null,"Microwave oven",null,0.42889745880901325,null,null,"Microwave oven",null,0.41256387256892074,null,null,"Refrigerator",null,0.41215627465476451]
[null,null,"DVD/VCD player",null,0.42672849195683593,null,null,"Cable TV/Digiturk etc.",null,0.41113195028138666,null,null,"Has refrigerator",null,0.41215627465476334]
[null,null,"Mobile phone",null,0.42366974423597581,null,null,"DVD/VCD player",null,0.40682162108950043,null,null,"Computer",null,0.39960112905030598]
[null,null,"Has mobile telephone",null,0.4236697442359737,null,null,"Has mobile telephone",null,0.40426701037234775,null,null,"LCD/Plasma television",null,0.39055684849813721]
[null,null,"Cable TV/Digiturk etc.",null,0.41304819589059039,null,null,"Mobile phone",null,0.40426701037234769,null,null,"Microwave oven",null,0.37816282339817686]
[null,null,"Computer",null,0.40046923898491438,null,null,"Refrigerator",null,0.36171399257038167,null,null,"DVD/VCD player",null,0.35720919774984161]
[null,null,"Refrigerator",null,0.37124237361102563,null,null,"Has refrigerator",null,0.361713992570381,null,null,"Has television",null,0.34785143929267115]
[null,null,"Has refrigerator",null,0.37124237361102519,null,null,"Computer",null,0.35855506152671046,null,null,"Deep freezer",null,0.3260150840261925]
[null,null,"Parquet, wood tile floor",null,0.33315252144356688,null,null,"Non-mobile phone",null,0.32244984310476499,null,null,"Satellite antenna",null,0.32501359518899192]
[null,null,"Non-mobile phone",null,0.2994925547408675,null,null,"Air conditioner",null,0.28453488359150064,null,null,"Parquet, wood tile floor",null,0.32155834496691232]
[null,null,"Air conditioner",null,0.28634560192776215,null,null,"Home theather",null,0.26673415702679354,null,null,"Concrete, cement floor",null,-0.30430851339407988]
[null,null,"Number of members per sleeping room",null,-0.27170564635689759,null,null,"Parquet, wood tile floor",null,0.26626435690093964,null,null,"Cable TV/Digiturk etc.",null,0.29902882653816271]
[null,null,"Home theather",null,0.25364833935046782,null,null,"Number of members per sleeping room",null,-0.24872085293111509,null,null,"Non-mobile phone",null,0.28133696253997087]
[null,null,"Has television",null,0.23312926247898805,null,null,"Deep freezer",null,0.2355542931560278,null,null,"Has motorcycle/scooter",null,0.26444305100904819]
[null,null,"Earth, sand floor",null,-0.23032431814972715,null,null,"Washer dryer",null,0.21801705231623281,null,null,"Motorcycle",null,0.26444305100904564]
[null,null,"Deep freezer",null,0.22069907512761258,null,null,"Television",null,-0.18719529764316162,null,null,"Earth, sand floor",null,-0.23495983508039109]
[null,null,"Washer dryer",null,0.20039837357643595,null,null,"Has television",null,0.18402184522599585,null,null,"Air conditioner",null,0.20053351315007792]
[null,null,"Satellite antenna",null,0.1975753154624961,null,null,"Satellite antenna",null,0.17519406754807809,null,null,"Tractor",null,0.18714021981917961]
[null,null,"Television",null,-0.18981286240482184,null,null,"Garbage grinder",null,0.1435189856242145,null,null,"Number of members per sleeping room",null,-0.18028028989713249]
[null,null,"Rudimentary wood plank floor",null,-0.12708950217714032,null,null,"Earth, sand floor",null,-0.13909785579712852,null,null,"Home theather",null,0.14569711919926645]
[null,null,"Garbage grinder",null,0.12465553403743454,null,null,"Rudimentary wood plank floor",null,-9.2980460560338943E-2,null,null,"Terrazo, ceramic tile floor",null,0.14242759988341411]
[null,null,"Taxi/minibus",null,8.8869483860315845E-2,null,null,"Taxi/minibus",null,8.675499193088318E-2,null,null,"Taxi/minibus",null,0.13782344675747082]
[null,null,"Tractor",null,-8.2284484358974438E-2,null,null,"Motorcycle",null,8.068625568843911E-2,null,null,"Washer dryer",null,8.7912375368509696E-2]
[null,null,"Motorcycle",null,5.5197739758466195E-2,null,null,"Has motorcycle/scooter",null,8.0686255688437999E-2,null,null,"Vinyl, asphalt strips floor",null,7.7939200686831134E-2]
[null,null,"Has motorcycle/scooter",null,5.519773975846471E-2,null,null,"Vinyl, asphalt strips floor",null,-7.5860479232737241E-2,null,null,"Rug or mat floor",null,3.2600266790096068E-2]
[null,null,"Terrazo, ceramic tile floor",null,3.7511715178974336E-2,null,null,"Terrazo, ceramic tile floor",null,-4.5569264028963684E-2,null,null,"Garbage grinder",null,2.3654848485566118E-2]
[null,null,"Vinyl, asphalt strips floor",null,-1.073062858600762E-2,null,null,"Rug or mat floor",null,-1.9172764052265662E-2,null,null,"Television",null,-2.1584223104612443E-2]
[null,null,"Rug or mat floor",null,-5.5931628496754754E-3,null,null,"Tractor",null,1.1815102436505848E-2,null,null,"Rudimentary wood plank floor",null,-1.8263365486179121E-2]
[]
[]
[]
[null,null,"Communalities",null,null,null,null,"Communalities",null,null,null,null,"Communalities"]
[null,null,null,null,"Extraction",null,null,null,null,"Extraction",null,null,null,null,"Extraction"]
[null,null,"Number of members per sleeping room",null,7.3823958262219491E-2,null,null,"Number of members per sleeping room",null,6.1862062682781382E-2,null,null,"Number of members per sleeping room",null,3.2500982925394134E-2]
[null,null,"Earth, sand floor",null,5.304929153113673E-2,null,null,"Earth, sand floor",null,1.9348213487358761E-2,null,null,"Earth, sand floor",null,5.5206124101004582E-2]
[null,null,"Rudimentary wood plank floor",null,1.6151741563633356E-2,null,null,"Rudimentary wood plank floor",null,8.6453660460127455E-3,null,null,"Rudimentary wood plank floor",null,3.3355051888175874E-4]
[null,null,"Parquet, wood tile floor",null,0.1109906025442063,null,null,"Parquet, wood tile floor",null,7.0896707755870966E-2,null,null,"Parquet, wood tile floor",null,0.10339976921785979]
[null,null,"Vinyl, asphalt strips floor",null,1.1514638985084389E-4,null,null,"Vinyl, asphalt strips floor",null,5.7548123094205584E-3,null,null,"Vinyl, asphalt strips floor",null,6.0745190037021389E-3]
[null,null,"Terrazo, ceramic tile floor",null,1.4071287756684935E-3,null,null,"Terrazo, ceramic tile floor",null,2.0765578241414037E-3,null,null,"Terrazo, ceramic tile floor",null,2.0285621208549903E-2]
[null,null,"Concrete, cement floor",null,0.2001831996655879,null,null,"Concrete, cement floor",null,0.17439220364986313,null,null,"Concrete, cement floor",null,9.26036713241149E-2]
[null,null,"Rug or mat floor",null,3.1283470662989883E-5,null,null,"Rug or mat floor",null,3.6759488140385041E-4,null,null,"Rug or mat floor",null,1.0627773947854407E-3]
[null,null,"Has television",null,5.4349253023996902E-2,null,null,"Has television",null,3.3864039520380369E-2,null,null,"Has television",null,0.12100062381798288]
[null,null,"Has refrigerator",null,0.13782089996434801,null,null,"Has refrigerator",null,0.13083701242120566,null,null,"Has refrigerator",null,0.16987279473729272]
[null,null,"Has motorcycle/scooter",null,3.0467904744431958E-3,null,null,"Has motorcycle/scooter",null,6.5102718570199938E-3,null,null,"Has motorcycle/scooter",null,6.9930127226974059E-2]
[null,null,"Has car/truck",null,0.30110696024034161,null,null,"Has car/truck",null,0.32615441249397875,null,null,"Has car/truck",null,0.35850903620204727]
[null,null,"Has mobile telephone",null,0.17949605218097536,null,null,"Has mobile telephone",null,0.16343181567539591,null,null,"Has mobile telephone",null,0.19459124327178604]
[null,null,"Refrigerator",null,0.13782089996434835,null,null,"Refrigerator",null,0.13083701242120613,null,null,"Refrigerator",null,0.16987279473729366]
[null,null,"Deep freezer",null,4.870808176218358E-2,null,null,"Deep freezer",null,5.5485825024235887E-2,null,null,"Deep freezer",null,0.10628583501260536]
[null,null,"Gas/electric oven",null,0.314165654316369,null,null,"Gas/electric oven",null,0.25330900561441488,null,null,"Gas/electric oven",null,0.32418919673115265]
[null,null,"Microwave oven",null,0.18395303017282921,null,null,"Microwave oven",null,0.17020894894906466,null,null,"Microwave oven",null,0.14300712100048071]
[null,null,"Dishwasher",null,0.41234028466714628,null,null,"Dishwasher",null,0.36468122159337141,null,null,"Dishwasher",null,0.31439008632744253]
[null,null,"Garbage grinder",null,1.5539002166158002E-2,null,null,"Garbage grinder",null,2.059769923460349E-2,null,null,"Garbage grinder",null,5.5955185687508969E-4]
[null,null,"Washing machine",null,0.20835146661822995,null,null,"Washing machine",null,0.1752108341233384,null,null,"Washing machine",null,0.24207117410891396]
[null,null,"Washer dryer",null,4.015950813208078E-2,null,null,"Washer dryer",null,4.7531435100658992E-2,null,null,"Washer dryer",null,7.7285857429337506E-3]
[null,null,"Iron",null,0.34976935710403323,null,null,"Iron",null,0.27825285622690288,null,null,"Iron",null,0.37523687503296971]
[null,null,"Vacuum cleaner",null,0.33617068065515687,null,null,"Vacuum cleaner",null,0.25310349052926479,null,null,"Vacuum cleaner",null,0.36517978154084557]
[null,null,"LCD/Plasma television",null,0.2685972035656532,null,null,"LCD/Plasma television",null,0.24934288318071318,null,null,"LCD/Plasma television",null,0.15253465190879689]
[null,null,"Home theather",null,6.4337480055250085E-2,null,null,"Home theather",null,7.1147110524794152E-2,null,null,"Home theather",null,2.1227650542965257E-2]
[null,null,"Television",null,3.6028922734311832E-2,null,null,"Television",null,3.504207945971187E-2,null,null,"Television",null,4.6587868702968561E-4]
[null,null,"Satellite antenna",null,3.9036005280104848E-2,null,null,"Satellite antenna",null,3.0692961304040547E-2,null,null,"Satellite antenna",null,0.10563383705767392]
[null,null,"Cable TV/Digiturk etc.",null,0.17060881212847154,null,null,"Cable TV/Digiturk etc.",null,0.16902948054217659,null,null,"Cable TV/Digiturk etc.",null,8.9418239100790595E-2]
[null,null,"DVD/VCD player",null,0.18209720584775538,null,null,"DVD/VCD player",null,0.16550383138588906,null,null,"DVD/VCD player",null,0.12759841095708546]
[null,null,"Mobile phone",null,0.17949605218097717,null,null,"Mobile phone",null,0.16343181567539589,null,null,"Mobile phone",null,0.19459124327178387]
[null,null,"Non-mobile phone",null,8.969579034521151E-2,null,null,"Non-mobile phone",null,0.10397390131828756,null,null,"Non-mobile phone",null,7.9150486491216976E-2]
[null,null,"Laptop",null,0.29510959084582988,null,null,"Laptop",null,0.27063255333558656,null,null,"Laptop",null,0.22708216287887018]
[null,null,"Computer",null,0.16037561137315648,null,null,"Computer",null,0.12856173214642314,null,null,"Computer",null,0.15968106233827931]
[null,null,"Internet",null,0.36735182040899045,null,null,"Internet",null,0.33775114714050081,null,null,"Internet",null,0.28951194533016855]
[null,null,"Air conditioner",null,8.1993803743372423E-2,null,null,"Air conditioner",null,8.0960099980428815E-2,null,null,"Air conditioner",null,4.0213689896312473E-2]
[null,null,"Car",null,0.30110696024034178,null,null,"Car",null,0.32615441249398014,null,null,"Car",null,0.35850903620204766]
[null,null,"Taxi/minibus",null,7.8977851615989383E-3,null,null,"Taxi/minibus",null,7.5264286249276053E-3,null,null,"Taxi/minibus",null,1.8995302476109394E-2]
[null,null,"Tractor",null,6.7707363662223088E-3,null,null,"Tractor",null,1.3959664558512642E-4,null,null,"Tractor",null,3.5021461873970865E-2]
[null,null,"Motorcycle",null,3.0467904744433598E-3,null,null,"Motorcycle",null,6.5102718570201725E-3,null,null,"Motorcycle",null,6.9930127226972713E-2]
[]
[]
[null,null,"Total Variance Explained",null,null,null,null,"Total Variance Explained",null,null,null,null,"Total Variance Explained"]
[null,null,"Component",null,"Extraction Sums of Squared Loadings",null,null,"Component",null,"Extraction Sums of Squared Loadings",null,null,"Component",null,"Extraction Sums of Squared Loadings"]
[null,null,null,null,"Total","% of Variance","Cumulative %",null,null,"Total","% of Variance","Cumulative %",null,null,"Total","% of Variance","Cumulative %"]
[null,null,"1",null,5.4321008443972971,13.928463703582814,13.928463703582814,"1",null,4.899759705037356,12.563486423172707,12.563486423172707,"1",null,5.2434570292819611,13.444761613543491,13.444761613543491]
[]
[]
[null,null,"Component Score Coefficient Matrix",null,null,null,null,"Component Score Coefficient Matrix",null,null,null,null,"Component Score Coefficient Matrix"]
[null,null,null,null,"Component",null,null,null,null,"Component",null,null,null,null,"Component"]
[null,null,null,null,"1",null,null,null,null,"1",null,null,null,null,"1"]
[null,null,"Number of members per sleeping room",null,-5.0018520299956584E-2,null,null,"Number of members per sleeping room",null,-5.0761847091278699E-2,null,null,"Number of members per sleeping room",null,-3.4381952381865907E-2]
[null,null,"Earth, sand floor",null,-4.2400596886430234E-2,null,null,"Earth, sand floor",null,-2.8388709685931022E-2,null,null,"Earth, sand floor",null,-4.4810100238881233E-2]
[null,null,"Rudimentary wood plank floor",null,-2.3396013037611626E-2,null,null,"Rudimentary wood plank floor",null,-1.8976534801236757E-2,null,null,"Rudimentary wood plank floor",null,-3.4830771729772534E-3]
[null,null,"Parquet, wood tile floor",null,6.1330327066218292E-2,null,null,"Parquet, wood tile floor",null,5.4342329610000663E-2,null,null,"Parquet, wood tile floor",null,6.1325637489003409E-2]
[null,null,"Vinyl, asphalt strips floor",null,-1.9754104154887432E-3,null,null,"Vinyl, asphalt strips floor",null,-1.5482489713678495E-2,null,null,"Vinyl, asphalt strips floor",null,1.486408685178147E-2]
[null,null,"Terrazo, ceramic tile floor",null,6.9055631059692394E-3,null,null,"Terrazo, ceramic tile floor",null,-9.3003058868610915E-3,null,null,"Terrazo, ceramic tile floor",null,2.7162919251179241E-2]
[null,null,"Concrete, cement floor",null,-8.236562333544814E-2,null,null,"Concrete, cement floor",null,-8.522926652635758E-2,null,null,"Concrete, cement floor",null,-5.8035855294451009E-2]
[null,null,"Rug or mat floor",null,-1.029650039624043E-3,null,null,"Rug or mat floor",null,-3.9130008829931975E-3,null,null,"Rug or mat floor",null,6.2173231530344673E-3]
[null,null,"Has television",null,4.2916961440330949E-2,null,null,"Has television",null,3.7557320420592517E-2,null,null,"Has television",null,6.6340095351235459E-2]
[null,null,"Has refrigerator",null,6.8342319895243989E-2,null,null,"Has refrigerator",null,7.3822802411822208E-2,null,null,"Has refrigerator",null,7.8603919580743462E-2]
[null,null,"Has motorcycle/scooter",null,1.0161398202943156E-2,null,null,"Has motorcycle/scooter",null,1.6467390350895349E-2,null,null,"Has motorcycle/scooter",null,5.043295854858202E-2]
[null,null,"Has car/truck",null,0.10101655963299012,null,null,"Has car/truck",null,0.11655659382503829,null,null,"Has car/truck",null,0.11419112194703568]
[null,null,"Has mobile telephone",null,7.7993718521067082E-2,null,null,"Has mobile telephone",null,8.2507517655759324E-2,null,null,"Has mobile telephone",null,8.4128652566417328E-2]
[null,null,"Refrigerator",null,6.8342319895244072E-2,null,null,"Refrigerator",null,7.3822802411822347E-2,null,null,"Refrigerator",null,7.8603919580743684E-2]
[null,null,"Deep freezer",null,4.0628677826414605E-2,null,null,"Deep freezer",null,4.8074662296981339E-2,null,null,"Deep freezer",null,6.2175599457680114E-2]
[null,null,"Gas/electric oven",null,0.10318380254950582,null,null,"Gas/electric oven",null,0.10271894098171808,null,null,"Gas/electric oven",null,0.10858793040239778]
[null,null,"Microwave oven",null,7.8956092880967166E-2,null,null,"Microwave oven",null,8.4200837878798659E-2,null,null,"Microwave oven",null,7.2120896821760053E-2]
[null,null,"Dishwasher",null,0.11821159015110136,null,null,"Dishwasher",null,0.12324857840350349,null,null,"Dishwasher",null,0.1069342205589509]
[null,null,"Garbage grinder",null,2.2947941801560075E-2,null,null,"Garbage grinder",null,2.9291025328581966E-2,null,null,"Garbage grinder",null,4.5113077790980604E-3]
[null,null,"Washing machine",null,8.4029244163345604E-2,null,null,"Washing machine",null,8.5429073584905327E-2,null,null,"Washing machine",null,9.3832616146078754E-2]
[null,null,"Washer dryer",null,3.6891504652960934E-2,null,null,"Washer dryer",null,4.449545803074656E-2,null,null,"Washer dryer",null,1.6766109625303519E-2]
[null,null,"Iron",null,0.10887371834618628,null,null,"Iron",null,0.10765768423323774,null,null,"Iron",null,0.11682479886777145]
[null,null,"Vacuum cleaner",null,0.10673628745417062,null,null,"Vacuum cleaner",null,0.10267726347523083,null,null,"Vacuum cleaner",null,0.11524859749014915]
[null,null,"LCD/Plasma television",null,9.5407588658397768E-2,null,null,"LCD/Plasma television",null,0.10191162033852609,null,null,"LCD/Plasma television",null,7.4484609355446554E-2]
[null,null,"Home theather",null,4.6694335509636614E-2,null,null,"Home theather",null,5.4438211888752197E-2,null,null,"Home theather",null,2.7786461944023635E-2]
[null,null,"Television",null,-3.4942809023988566E-2,null,null,"Television",null,-3.8204995532884901E-2,null,null,"Television",null,-4.1164107923600517E-3]
[null,null,"Satellite antenna",null,3.63718055172478E-2,null,null,"Satellite antenna",null,3.5755644785593094E-2,null,null,"Satellite antenna",null,6.1984601642382342E-2]
[null,null,"Cable TV/Digiturk etc.",null,7.603838877855347E-2,null,null,"Cable TV/Digiturk etc.",null,8.3908594508973408E-2,null,null,"Cable TV/Digiturk etc.",null,5.7028945763881213E-2]
[null,null,"DVD/VCD player",null,7.8556805954176329E-2,null,null,"DVD/VCD player",null,8.3028892349813463E-2,null,null,"DVD/VCD player",null,6.8124749712835497E-2]
[null,null,"Mobile phone",null,7.799371852106747E-2,null,null,"Mobile phone",null,8.250751765575931E-2,null,null,"Mobile phone",null,8.4128652566416856E-2]
[null,null,"Non-mobile phone",null,5.5133835567461147E-2,null,null,"Non-mobile phone",null,6.5809317704551923E-2,null,null,"Non-mobile phone",null,5.3654861853325256E-2]
[null,null,"Laptop",null,0.10000548909237937,null,null,"Laptop",null,0.10617328037219788,null,null,"Laptop",null,9.0881146622471085E-2]
[null,null,"Computer",null,7.3722718052622455E-2,null,null,"Computer",null,7.317809099047988E-2,null,null,"Computer",null,7.620947913156205E-2]
[null,null,"Internet",null,0.11157663880361096,null,null,"Internet",null,0.11861063598269342,null,null,"Internet",null,0.10261610603604818]
[null,null,"Air conditioner",null,5.2713601998589689E-2,null,null,"Air conditioner",null,5.807119138903391E-2,null,null,"Air conditioner",null,3.8244523037035162E-2]
[null,null,"Car",null,0.10101655963299014,null,null,"Car",null,0.11655659382503854,null,null,"Car",null,0.11419112194703573]
[null,null,"Taxi/minibus",null,1.6360057812987099E-2,null,null,"Taxi/minibus",null,1.770596869101395E-2,null,null,"Taxi/minibus",null,2.6284843374857283E-2]
[null,null,"Tractor",null,-1.5147819732368031E-2,null,null,"Tractor",null,2.411363647968073E-3,null,null,"Tractor",null,3.5690236188472509E-2]
[null,null,"Motorcycle",null,1.016139820294343E-2,null,null,"Motorcycle",null,1.6467390350895575E-2,null,null,"Motorcycle",null,5.0432958548581534E-2]
[]
[]
[null,null,"Component Score Covariance Matrix",null,null,null,null,"Component Score Covariance Matrix",null,null,null,null,"Component Score Covariance Matrix"]
[null,null,"Component",null,"1",null,null,"Component",null,"1",null,null,"Component",null,"1"]
[null,null,"1",null,0.99999999999999967,null,null,"1",null,0.99999999999999989,null,null,"1",null,1]
[]
[]
[]
[]
[]
[]
[]
[]
[]
[]
[]
[]
[]
[]
[]
[]
[]
[]
[]
[]
[]
[]
[]
[]
[]
[]
[]
[]
[]
[]
[]
[]
[]
[]
[]
[]
[]
[]
[]
[]
[]
[]
[]
[]
[]
[]
[]
[]
[]
[]
[]
[]
[]
[]
[]
[]
[]
[]
[]
[]
[]
[]
[]
[]
[]
[]
[]
[]
[]
[]
[]
[]
[]
[]
[]
[]
[]
[]
[]
[]
[]
[]
[]
[]
[]
[]
[]
[]
[]
[]
[]
[]
[]
[]
[]
[]
[]
[]
[]
[]
[]
[]
[]
[]
[]
[]
[]
[]
[]
[]
[]
[]
[]
[]
[]
[]
[]
[]
[]
[]
[]
[]
[]
[]
[]
[]
[]
[]
[]
[]
[]
[]
[]
[]
[]
[]
[]
[]
[]
[]
[]
[]
[]
[]
[]
[]
[]
[]
[]
[]
[]
[]
[]
[]
[]
[]
[]
[]
[]
[]
[]
[]
[]
[]
[]
[]
[]
[]
[]
[]
[]
[]
[]
[]
[]
[]
[]
[]
[]
[]
[]
[]
[]
[]
[]
[]
[]
[]
[]
[]
[]
[]
[]
[]
[]
[]
[]
[]
[]
[]
[]
[]
[]
[]
[]
[]
[]
[]
[]
[]
[]
[]
[]
[]
[]
[]
[]
[]
[]
[]
[]
[]
[]
[]
[]
[]
[]
[]
[]
[]
[]
[]
[]
[]
[]
[]
[]
[]
[]
[]
[]
[]
[]
[]
[]
[]
[]
[]
[]
[]
[]
[]
[]
[]
[]
[]
[]
[]
[]
[]
[]
[]
[]
[]
[]
[]
[]
[]
[]
[]
[]
[]
[]
[]
[]
[]
[]
[]
[]
[]
[]
[]
[]
[]
[]
[]
[]
[]
[]
[]
[]
[]
[]
[]
[]
[]
[]
[]
[]
[]
[]
[]
[]
[]
[]
[]
[]
[]
[]
[]
[]
[]
[]
[]
[]
[]
[]
[]
[]
[]
[]
[]
[]
[]
[]
[]
[]
[]
[]
[]
[]
[]
[]
[]
[]
[]
[]
[]
[]
[]
[]
[]
[]
[]
[]
[]
[]
[]
[]
[]
[]
[]
[]
[]
[]
[]
[]
[]
[]
[]
[]
[]
[]
[]
[]
[]
[]
[]
[]
[]
[]
[]
[]
[]
[]
[]
[]
[]
[]
[]
[]
[]
[]
[]
[]
[]
[]
[]
[]
[]
[]
[]
[]
[]
[]
[]
[]
[]
[]
[]
[]
[]
[]
[]
[]
[]
[]
[]
[]
[]
[]
[]
[]
[]
[]
[]
[]
[]
[]
[]
[]
[]
[]
[]
[]
[]
[]
[]
[]
[]
[]
[]
[]
[]
[]
[]
[]
[]
[]
[]
[]
[]
[]
[]
[]
[]
[]
[]
[]
[]
[]
[]
[]
[]
[]
[]
[]
[]
[]
[]
[]
[]
[]
[]
[]
[]
[]
[]
[]
[]
[]
[]
[]
[]
[]
[]
[]
[]
[]
[]
[]
[]
[]
[]
["DHS13"]
["Turkey",null,"Count"]
["W_text_t","",11794]
["W_text_i","",11794]
["S_text_s","",11794]
["S_text_i","",11794]
["Urban/Rural","Urban",8482]
[null,"Rural",3312]
[null,"Missing",0]
["2013"]
[]
["Sub-national region names","Weighted population"]
[{"$f":"R15","v":"Central"},{"$f":"BR122+BR123","v":8740.9589100000176}]
[{"$f":"S15","v":"East"},{"$f":"BS122+BS123","v":8392.7217459999956}]
[{"$f":"T15","v":"North"},{"$f":"BT122+BT123","v":3257.1235349999979}]
[{"$f":"U15","v":"South"},{"$f":"BU122+BU123","v":5466.4702589999888}]
[{"$f":"V15","v":"West"},{"$f":"BV122+BV123","v":17988.251791999992}]
[{"$f":"W15","v":0},{"$f":"BW122+BW123","v":0}]
[{"$f":"X15","v":0},{"$f":"BX122+XR123","v":0}]
[{"$f":"Y15","v":0},{"$f":"BY122+BY123","v":0}]
[{"$f":"Z15","v":0},{"$f":"BZ122+BZ123","v":0}]
[{"$f":"AA15","v":0},{"$f":"CA122+CA123","v":0}]
[{"$f":"AB15","v":0},{"$f":"CB122+CB123","v":0}]
[{"$f":"AC15","v":0},{"$f":"CC122+CC123","v":0}]
[{"$f":"AD15","v":0},{"$f":"CD122+CD123","v":0}]
[{"$f":"AE15","v":0},{"$f":"CE122+CE123","v":0}]
[{"$f":"AF15","v":0},{"$f":"CF122+CF123","v":0}]
[{"$f":"AG15","v":0},{"$f":"CG122+CG123","v":0}]
[{"$f":"AH15","v":0},{"$f":"CH122+CH123","v":0}]
[{"$f":"AI15","v":0},{"$f":"CI122+CI123","v":0}]
[{"$f":"AJ15","v":0},{"$f":"CJ122+CJ123","v":0}]
[{"$f":"AK15","v":0},{"$f":"CK122+CK123","v":0}]
[{"$f":"AL15","v":0},{"$f":"CL122+CL123","v":0}]
[{"$f":"AM15","v":0},{"$f":"CM122+CM123","v":0}]
[{"$f":"AN15","v":0},{"$f":"CN122+CN123","v":0}]
[{"$f":"AO15","v":0},{"$f":"CO122+CO123","v":0}]
[{"$f":"AP15","v":0},{"$f":"CP122+CP123","v":0}]
[{"$f":"AQ15","v":0},{"$f":"CQ122+CQ123","v":0}]
[{"$f":"AR15","v":0},{"$f":"CR122+CR123","v":0}]
[{"$f":"AS15","v":0},{"$f":"CS122+CS123","v":0}]
[{"$f":"AT15","v":0},{"$f":"CT122+CT123","v":0}]
[{"$f":"AU15","v":0},{"$f":"CU122+CU123","v":0}]
[{"$f":"AV15","v":0},{"$f":"CV122+CV123","v":0}]
[{"$f":"AW15","v":0},{"$f":"CW122+CW123","v":0}]
[{"$f":"AX15","v":0},{"$f":"CX122+CX123","v":0}]
[{"$f":"AY15","v":0},{"$f":"CY122+CY123","v":0}]
[]
[{"$f":"34-COUNTIF(A1037:A1071,\"0\")","v":5},"Sub-regions"]

{"sheet":"data_summary","index":7,"n_rows":142,"n_cols":52,"rows_kept":142,"cut":false,"hidden":false,"merged":[]}
["iso3","year","data_source","row","var1","var2","varname","total_q1","total_q2","total_q3","total_q4","total_q5","urban_q1","urban_q2","urban_q3","urban_q4","urban_q5","rural_q1","rural_q2","rural_q3","rural_q4","rural_q5","region_1_name","region_2_name","region_3_name","region_4_name","region_5_name","region_1","region_2","region_3","region_4","region_5","n_total_q1","n_total_q2","n_total_q3","n_total_q4","n_total_q5","n_urban_q1","n_urban_q2","n_urban_q3","n_urban_q4","n_urban_q5","n_rural_q1","n_rural_q2","n_rural_q3","n_rural_q4","n_rural_q5","n_region_1","n_region_2","n_region_3","n_region_4","n_region_5"]
["TUR",2003,"TUR_2003_DHS",16,"Water","Improved","w_imp",97.555629554731894,98.808118674616821,99.463235841763733,99.665710822409096,99.383093636468743,99.344619101521431,99.824170236884484,99.760507782404474,99.489188429101716,99.45259871625737,94.621165276542939,97.146740615520798,98.470900030403087,98.419356965076389,99.273184231468989,"Central","East","North","South","West",99.363415614415445,97.975571245123149,99.265164836911353,97.850879818954212,99.405543758006374]
["TUR",2003,"TUR_2003_DHS",17,"Water","Not Improved","",2.4443704452681061,1.191881325383179,0.53676415823626655,0.33428917759090382,0.61690636353125683,0.65538089847856895,0.1758297631155159,0.23949221759552591,0.51081157089828366,0.54740128374263008,5.3788347234570608,2.8532593844792018,1.529099969596913,1.5806430349236109,0.72681576853101149,"Central","East","North","South","West",0.63658438558455543,2.0244287548768511,0.73483516308864694,2.1491201810457881,0.59445624199362612]
["TUR",2003,"TUR_2003_DHS",18,"Water ladder","Basic","w_bas",96.110155200466195,97.77482368494087,98.064201704079238,97.921199569455169,98.84776678229602,98.508423357075742,98.707374021327965,98.793740086664044,97.79661888324361,99.11504162387871,91.949746304945364,95.254427975311742,97.406522128701852,95.553049351831348,97.320981661130375,"Central","East","North","South","West",97.404180728997702,96.92958697274949,97.268996941531384,97.374751960038012,98.349436401108392]
["TUR",2003,"TUR_2003_DHS",19,"Water ladder","Limited","w_lim",1.4454743542656641,1.0332949896759689,1.399034137684396,1.744511252953894,0.53532685417269354,0.83619574444563338,1.1167962155565461,0.96676769574043564,1.692569545858114,0.3375570923786792,2.671418971597562,1.89231264020905,1.0643779017012469,2.866307613245036,1.9522025703386749,"Central","East","North","South","West",1.9592348854176691,1.0459842723736581,1.99616789537992,0.47612785891620152,1.0561073568978749]
["TUR",2003,"TUR_2003_DHS",20,"Water ladder","Unimproved","w_unimp",2.3622987012908321,1.0452672627157791,0.50212210259267476,0.33428917759093668,0.4839030456195228,0.62886987895015811,0.17582976311548901,0.23949221759551989,0.44362761788491373,0.41761792586338831,5.3039545339114369,2.6756213466751362,1.132465643273967,1.4740726859369799,0.7268157685309502,"Central","East","North","South","West",0.62017243317364823,1.9677870581168611,0.48191806177799179,2.009379207929106,0.52383443582268929]
["TUR",2003,"TUR_2003_DHS",21,"Water ladder","Surface water","w_sur",0.082071743977308098,0.14661406266738239,0.0346420556436913,0,0.13300331791176359,0.0265110195284665,0,0,0.067183953013361997,0.12978335787922229,0.074880189545636106,0.17763803780407211,0.39663432632293433,0.1065703489866365,0,"Central","East","North","South","West",0.0164119524109816,0.056641696759989701,0.25291710131070422,0.1397409731166816,0.070621806171043994]
["TUR",2003,"TUR_2003_DHS",29,"Piped water","Yes","w_pip",33.636214601087531,56.70645712687363,73.801171693448481,81.415561756971528,84.713811357270032,89.31260980309024,90.352646911664564,90.38091292183077,90.419635388315143,89.770857972487264,6.533038119890219,8.4874329069339733,12.98591110389307,18.395473740274131,34.598249124263333,"Central","East","North","South","West",58.939840026824442,55.019015075352947,50.036125596657101,72.059800485641659,77.097301482626889]
["TUR",2003,"TUR_2003_DHS",30,"Piped water","No","",66.363785398912484,43.29354287312686,26.19882830655196,18.584438243029151,15.28618864273084,10.687390196909901,9.6473530883355885,9.6190870781694535,9.5803646116853329,10.2291420275128,93.466961880109821,91.512567093066124,87.014088896106784,81.604526259725873,65.401750875736838,"Central","East","North","South","West",41.060159973176383,44.980984924646208,49.963874403342992,27.940199514358529,22.90269851737354]
["TUR",2003,"TUR_2003_DHS",31,"Piped water on premises","Yes","w_pop",33.034701255655648,56.551626683348843,73.391996620764601,81.193601911014184,84.154309847083155,88.401671645784958,89.929994117203449,89.984182232654248,90.268418665877746,89.070598604318917,6.2606425864211346,8.4874329069339733,12.98591110389307,18.395473740274131,34.242660638129117,"Central","East","North","South","West",58.81634945294708,54.641129246117323,50.005152171752563,71.912201102614787,76.389249344317989]
["TUR",2003,"TUR_2003_DHS",32,"Piped water on premises","No","",66.965298744344366,43.448373316651669,26.608003379235839,18.806398088986509,15.84569015291771,11.59832835421518,10.07000588279671,10.015817767346,9.731581334122744,10.92940139568119,93.739357413578901,91.512567093066124,87.014088896106784,81.604526259725873,65.757339361871033,"Central","East","North","South","West",41.183650547053738,45.358870753881831,49.994847828247529,28.087798897385412,23.610750655682502]
["TUR",2003,"TUR_2003_DHS",35,"Water source on premises","Yes","",33.406961430283431,56.864602537914372,73.506528284975573,81.193601911014184,84.204604783595613,88.709211048611905,89.987579859071914,89.984182232654248,90.268418665877746,89.145061967340141,7.0254269872732644,8.5234707099579481,13.53505855112406,18.748275845097218,34.242660638129117,"Central","East","North","South","West",58.873121180389113,55.071737012650964,50.601868238658867,72.0619812716658,76.409146866742304]
["TUR",2003,"TUR_2003_DHS",36,"Water source on premises","No","",66.593038569716555,43.135397462086111,26.49347171502486,18.806398088986509,15.79539521640525,11.290788951388221,10.012420140928249,10.015817767346,9.731581334122744,10.854938032659961,92.974573012726751,91.476529290042137,86.464941448875805,81.251724154902789,65.757339361871033,"Central","East","North","South","West",41.126878819611719,44.928262987348219,49.398131761341233,27.938018728334399,23.590853133258172]
["TUR",2003,"TUR_2003_DHS",41,"Water point at more than 30 minutes","Yes","",4.7458469387026767,2.0448373148096071,2.0838588954388402,1.9700053409881499,1.8514398910013261,1.161484481432959,1.5074199505842361,2.0163853931421718,2.0826011337128518,1.751066829959345,11.952973418364,9.979661052119134,3.7870894905532571,7.6489838549397922,1.7864768458694811,"Central","East","North","South","West",1.314702309050334,2.7410776958809628,2.304860716915758,2.6733862737219849,2.558157031635496]
["TUR",2003,"TUR_2003_DHS",42,"Water point at more than 30 minutes","No","w_30min",95.254153061297359,97.955162685190473,97.916141104561149,98.029994659011876,98.148560108998936,98.838515518567078,98.492580049415764,97.983614606857941,97.917398866287314,98.248933170040658,88.047026581636018,90.020338947880845,96.212910509446758,92.351016145060242,98.213523154130513,"Central","East","North","South","West",98.685297690949682,97.258922304118926,97.695139283084231,97.326613726278026,97.441842968364838]
["TUR",2003,"TUR_2003_DHS",43,"Water source available when needed","Yes","w_available",88.455670473274438,94.288442533656124,96.623592376971203,98.158500035616044,98.976001570470103,91.967238811793024,96.431809381813878,98.096347853565319,98.133422405476495,99.267558703145696,87.722471977024981,87.859728376382805,93.930939767477597,94.660828802435148,97.282864717507053,"Central","East","North","South","West",96.432074651199301,87.411614682983625,96.02923707904985,94.320388940761163,98.92295920963015]
["TUR",2003,"TUR_2003_DHS",44,"Water source available when needed","No","",11.544329526725759,5.7115574663439759,3.3764076230288351,1.841499964384004,1.023998429529928,8.0327611882070933,3.5681906181862142,1.9036521464346241,1.866577594523555,0.73244129685431325,12.277528022975011,12.14027162361732,6.0690602325223439,5.3391711975648759,2.7171352824929729,"Central","East","North","South","West",3.56792534880086,12.58838531701625,3.9707629209501478,5.6796110592387183,1.0770407903698429]
["TUR",2003,"TUR_2003_DHS",58,"Source of drinking water","Piped water in house/garden","",31.91421271794362,53.118864261650927,63.602211555539682,62.178512926040007,43.788789543654893,84.537698349374068,80.169791875545286,72.05319747042455,64.378198927342623,40.0866454743079,6.0284925149341637,8.4874329069339733,12.491298821952469,17.350845174665491,30.226822263565222,"Central","East","North","South","West",49.259132902636118,53.390900025935593,42.48649515166246,65.90046130951815,47.061176020175367]
["TUR",2003,"TUR_2003_DHS",59,"Source of drinking water","Public piped water outside house/garden","",0.60151334543188917,0.1549020962660215,0.40971515778809853,0.22195984595735641,0.50735080319803183,0.91093815730527405,0.42265279446112808,0.39750780219739079,0.15121672243741099,0.70098642426587776,0.27239553346908502,0,0,0,0.19395735607319839,"Central","East","North","South","West",0.12364004257595861,0.37788582923562569,0.030973424904541601,0.14770251143396171,0.68041656798565442]
["TUR",2003,"TUR_2003_DHS",60,"Source of drinking water","Public well","",2.6762562928079499,0.88026311344031027,0.72727464618719007,0.28127080235435459,0.65746047046073908,0.71786453972668951,0.65753721674423216,0.28346976750071379,0.51777810329108098,0.4822104320058142,5.0387412684908526,2.2957892975740171,1.1916872183750451,0.79809354965832469,1.2232197495907129,"Central","East","North","South","West",0.87778430297030907,2.0904185792108989,0.62539467611987409,1.4466439016448041,0.54156263491220225]
["TUR",2003,"TUR_2003_DHS",61,"Source of drinking water","Well in house/garden","",5.8579049807555608,4.2004939626785491,1.9874828819353521,1.4359869822613121,0.72516373638632692,1.9673065324458661,1.04976984195685,0.66480185329164088,0.1734577669160253,0.40189328905396549,7.826453186714982,7.4072352996310746,6.9808199071172847,7.0205561071519433,5.6404817266046372,"Central","East","North","South","West",0.66456335776514353,5.904936909126743,1.514393180793018,3.7460325691885141,2.462008574144138]
["TUR",2003,"TUR_2003_DHS",62,"Source of drinking water","Piped surface water in house/garden","",45.200162488043119,30.957577567931651,17.484247743438569,10.43553749744382,5.3664666293913799,3.8194020514778231,3.8582184162481519,2.3701970125355389,2.1436970818720011,1.3800042504451711,63.427143597124918,66.739648829344162,65.705791105258001,63.962000742327888,48.806433877447652,"Central","East","North","South","West",29.756541592013601,28.20778311254049,36.024557386218937,15.44129503749731,13.41367112932374]
["TUR",2003,"TUR_2003_DHS",63,"Source of drinking water","Spring/public fountain","",11.47654588407118,6.3230894703418388,4.8528540882811733,5.5699009996233269,6.1951805233511568,3.0826616969163192,3.4458713732579511,5.3128984339611582,5.6493076047802324,5.8195764425223224,16.32490972483663,14.22058768922626,11.79901826876482,8.0817902057520854,7.080635285700752,"Central","East","North","South","West",8.1657613913305251,7.8930517417042738,10.348212900062119,5.9632119472501532,5.2305525201949692]
["TUR",2003,"TUR_2003_DHS",64,"Source of drinking water","River/stream/pond/lake/dam","",0.082071743977308098,0.14661406266738239,0.0346420556436913,0,0.13300331791176359,0.0265110195284665,0,0,0.067183953013361997,0.12978335787922229,0.074880189545636106,0.17763803780407211,0.39663432632293433,0.1065703489866365,0,"Central","East","North","South","West",0.0164119524109816,0.056641696759989701,0.25291710131070422,0.1397409731166816,0.070621806171043994]
["TUR",2003,"TUR_2003_DHS",65,"Source of drinking water","Rainwater","",0.1338061335492263,0.0243723707200925,0.048651217242093599,0,0,0,0,0,0,0,0.074880189545636106,0.33679046810470292,0.075122556786353795,0,0.1498083639993896,"Central","East","North","South","West",0,0,0.53744884028524642,0,0]
["TUR",2003,"TUR_2003_DHS",66,"Source of drinking water","Tanker truck","",0.62610369970824398,0.26980044834901612,0.40180412247651209,0.2237435229214047,0.12406640691073061,0.81961775067815301,0.46256440798756238,0.29216277368830029,0.31634300602320381,0.079600266506361303,0.40135374746456259,0,0.28528506264931042,0.28418759729769733,0,"Central","East","North","South","West",0.69750797746672,0.61953089989145926,0,0.27948194623336331,0.049317031343113597]
["TUR",2003,"TUR_2003_DHS",67,"Source of drinking water","Bottled water","",1.2735871215657439,3.7263183911652331,10.106417260608151,19.405506409962008,42.033225942566162,3.9478314440578912,9.8298672797510598,18.266283068533969,26.24404585874904,50.47928652459256,0.38691678581161748,0.15468845626209771,0.83583180462762952,1.963225960435111,6.2875147020643194,"Central","East","North","South","West",10.34324980769544,1.368983927577474,7.8631376609747399,6.3779406098660436,30.100602499622969]
["TUR",2003,"TUR_2003_DHS",68,"Source of drinking water","Water station","",0,0.057847749108567798,0.19669189139107621,0.16876688311518859,0.30253216261003513,0,0.1037267940478958,0.2103327459610371,0.35877097557576831,0.1930358034167193,0,0,0,0.2928259545537652,0.14222788180154169,"Central","East","North","South","West",0,0.033092182400157197,0,0.20644276523425409,0.29580209745201869]
["TUR",2003,"TUR_2003_DHS",69,"Source of drinking water","Other","",0.15783559214622159,0.1398565056809781,0.14800737946924031,0.078814130322482398,0.1667604635598261,0.17016845848963741,0,0.14914907190619781,0,0.24697773500451109,0.1438332620619793,0.18018901511986651,0.23851092814604311,0.1399043591711655,0.24889879315269789,"Central","East","North","South","West",0.095406673136351705,0.056775095616489898,0.31646967766852663,0.35104642901687688,0.094269118676391303]
["TUR",2003,"TUR_2003_DHS",122,"Sanitation","Improved","s_imp",60.767876991964698,87.288316313967371,94.766418299948654,96.322184095029016,98.898080942263789,91.526704035020842,96.791094278349519,97.984019160576011,98.63432632909624,99.675828586359458,41.648586509779811,53.277988569764027,72.825493754278398,83.526412088973785,90.013596596463742,"Central","East","North","South","West",90.113641436243881,67.130842437721057,77.235059278344536,88.947639437174402,98.462453759574146,5538.7058410000018,7945.2368270000006,8649.9019279999429,8779.4346829999267,9012.4807219998802,5632.5114480000111,5957.1818900000126,6030.5039449999931,6066.1386339999553,6135.1891479999604,1233.3345569999981,1578.512811999999,2152.6810759999989,2474.998539999995,2664.7079509999949,8968.8408399998971,5991.5042080000176,2708.5936029999862,5363.7711770000014,16893.05017299973]
["TUR",2003,"TUR_2003_DHS",123,"Sanitation","Not Improved","",39.232123008035323,12.71168368603303,5.2335817000514213,3.6778159049712782,1.1019190577361571,8.4732959649791741,3.2089057216505901,2.0159808394240368,1.3656736709038271,0.32417141364054702,58.351413490220203,46.722011430236172,27.174506245721609,16.473587911026211,9.9864034035362614,"Central","East","North","South","West",9.8863585637564277,32.869157562278318,22.764940721655559,11.052360562825591,1.537546240425864,3575.823273999988,1157.0544789999999,477.70053200000001,335.22022800000002,100.416754,521.44275300000027,197.49787100000009,124.075135,83.990696999999997,19.953212000000001,1727.953352999996,1384.2732359999991,803.26328500000056,488.13429200000002,295.63143300000002,983.97062900000037,2933.6097789999908,798.35470299999963,666.48573699999986,263.794419]
["TUR",2003,"TUR_2003_DHS",124,"Sanitation ladder","Basic","s_bas",55.95218924263655,85.503005500053135,93.193428533320187,96.057193144067426,98.71600310721486,86.871893393865179,94.821010648271184,97.692122496864613,98.363475480317518,99.649484029155744,37.42362616136171,51.423096616391383,70.634977320535498,81.271934656218576,88.993883378339021,"Central","East","North","South","West",88.507829284594067,65.533686303972999,76.383551627771993,85.950668216877787,96.871723328133015,5099.7785790000007,7782.7326360000088,8504.3805899999606,8750.2938769999328,8994.6729309998809,5346.0565330000163,5833.9918940000134,6012.5389339999929,6043.2790129999557,6133.5676029999604,1108.2213169999991,1523.556331999999,2087.9306289999981,2408.1953789999948,2634.5209789999949,8809.0173839999006,5846.0544770000124,2675.520886999986,5181.1348400000006,16620.13102499973]
["TUR",2003,"TUR_2003_DHS",125,"Sanitation ladder","Limited","s_lim",4.8156877493281316,1.785310813914317,1.5729897666286461,0.26499095096165087,0.1820778350489336,4.6548106411557546,1.97008363007833,0.2918966637114041,0.27085084877873788,0.0263445572037104,4.2249603484181391,1.85489195337267,2.190516433742848,2.254477432755202,1.019713218124725,"Central","East","North","South","West",1.605812151649852,1.597156133747986,0.8515076505725544,2.996971220296599,1.590730431441121,438.92726200000033,162.50419099999999,143.54342199999999,24.139251000000002,16.590325,286.45491500000009,121.21208,17.965011000000001,16.640599999999999,1.621545,125.11324,54.956479999999999,64.750446999999994,66.803161000000003,30.186972000000001,159.82345599999999,142.47728599999999,29.826139999999999,180.658421,272.91914800000001]
["TUR",2003,"TUR_2003_DHS",126,"Sanitation ladder","Unimproved","s_unimp",37.067701209488007,12.498772932591541,5.0432481298253338,3.3593062661723212,1.101919057736207,8.3249861514527179,2.9921199527961209,1.712486534497446,1.131827939519684,0.3241714136405458,53.340154216885928,45.259905989674621,26.63955629170254,16.473587911026222,9.9864034035362543,"Central","East","North","South","West",9.8221572069846559,30.500748677424781,22.672279409415271,10.947593646727411,1.3290229784229981,3378.5464189999889,1137.6747220000011,460.33140500000002,306.20510400000001,100.416754,512.31583500000033,184.15968899999999,105.396338,69.623424999999983,19.953212000000001,1579.555537999998,1340.954179999999,787.45046200000058,488.13429200000002,295.63143300000002,977.58078900000032,2722.296985999993,795.10812699999963,660.17009499999983,228.018407]
["TUR",2003,"TUR_2003_DHS",127,"Sanitation ladder","Open defecation","s_od",2.1644217985472989,0.21291075344100921,0.1903335702258333,0.31850963879860189,0,0.14830981352634839,0.2167857688543656,0.30349430492653662,0.23384573138405909,0,5.0112592733342254,1.462105440561333,0.53494995401911094,0,0,"Central","East","North","South","West",0.064201356771425896,2.3684088848542331,0.092661312240183702,0.1047669160981988,0.2085232620028652,197.27685500000001,19.379757000000001,17.369126999999999,29.015124,0,9.1269179999999999,13.338182,18.678796999999999,14.367272,0,148.39781500000001,43.319056000000003,15.812823,0,0,6.3898400000000004,211.312793,3.2465760000000001,6.3156420000000004,35.776011999999987]
["TUR",2003,"TUR_2003_DHS",128,"Shared among Improved Sanitation","Yes","s_shared",7.9247260027940554,2.0453032998055911,1.659859890082495,0.27510895174492472,0.18410654010084351,5.085740484410632,2.0353976207902051,0.2979023173493674,0.27460100236811708,0.0264302364749197,10.14430669195951,3.481535251549166,3.007897812727371,2.699119208369317,1.132843544399363,"Central","East","North","South","West",1.781985641747678,2.3791689121579358,1.1024885052574871,3.369365661933529,1.615570576095301]
["TUR",2003,"TUR_2003_DHS",129,"Shared among Improved Sanitation","No","",92.075273997205926,97.954696700194503,98.340140109917684,99.724891048255145,99.815893459899158,94.914259515589464,97.964602379209794,99.702097682650631,99.725398997631899,99.973569763525077,89.855693308040586,96.518464748450853,96.992102187272565,97.300880791630675,98.867156455600636,"Central","East","North","South","West",98.218014358252361,97.620831087841964,98.897511494742531,96.630634338066457,98.384429423904692]
["TUR",2003,"TUR_2003_DHS",139,"Shared among Improved Sanitation","Open defecation","",2.1644217985472989,0.21291075344100921,0.19029232568045171,0.31833486054401777,0,0.14830981352634839,0.21671610088504151,0.30349430492653662,0.23360926619187081,0,5.0112592733342254,1.462105440561333,0.53494995401911094,0,0,"Central","East","North","South","West",0.064201356771425896,2.367620103315085,0.092575530538773099,0.1047325526933594,0.2085232620028652]
["TUR",2003,"TUR_2003_DHS",148,"Shared among improved sanitation facilities","Yes","",4.8156877493281316,1.785310813914317,1.5726300814376291,0.26483998830134392,0.1820532387607014,4.6548106411557546,1.9694295187879221,0.2918966637114041,0.27057317178880202,0.0263445572037104,4.2249603484181391,1.85489195337267,2.190516433742848,2.254477432755202,1.019713218124725,"Central","East","North","South","West",1.605812151649852,1.5963637686591601,0.85048701598968346,2.9958660729790592,1.5907304314411219]
["TUR",2003,"TUR_2003_DHS",149,"Shared among improved sanitation facilities","No","",55.952189242636557,85.503005500053149,93.17211860692737,96.002470334227979,98.702667891179885,86.871893393865179,94.789527977847428,97.692122496864599,98.26263299112405,99.649484029155758,37.42362616136171,51.423096616391362,70.634977320535512,81.271934656218576,88.993883378339007,"Central","East","North","South","West",88.507829284594052,65.501174388530188,76.291996731816099,85.918973501300471,96.871723328133015]
["TUR",2003,"TUR_2003_DHS",150,"Shared among improved sanitation facilities","DK/missing","",39.232123008035323,12.71168368603303,5.2552513116352717,3.7326896774710341,1.1152788700593661,8.4732959649791741,3.2410425033647798,2.0159808394240368,1.466793837087208,0.32417141364054702,58.351413490220203,46.722011430236172,27.174506245721609,16.473587911026211,9.9864034035362614,"Central","East","North","South","West",9.8863585637564277,32.902461842809963,22.85751625219433,11.08516042572046,1.537546240425864]
["TUR",2003,"TUR_2003_DHS",151,"Shared among all sanitation facilities","Yes","",7.6374220571842493,2.2060466505595469,1.725672244096419,0.2656857586907575,0.1820532387607014,5.0047634512170811,1.973706859336376,0.29278525027164343,0.27120673585429422,0.0263445572037104,9.8442671291073101,4.2543066710582718,2.8755427064161512,3.3257804015989572,1.019713218124725,"Central","East","North","South","West",1.926528194233285,3.7536837680577162,2.3385399019111262,3.2261654492437759,1.660976163206306]
["TUR",2003,"TUR_2003_DHS",152,"Shared among all sanitation facilities","No","",92.362577942815889,97.793953349440628,98.054307551509979,99.679265228611698,99.804586948916068,94.995236548782884,97.994086562108251,99.511123329642288,99.627436318745936,99.9736554427963,90.155732870892706,95.745693328941755,97.124457293583816,96.470568113903568,98.980286781875265,"Central","East","North","South","West",97.95250393964578,96.212204310705786,97.396567686713425,96.741000299712084,98.339023836793672]
["TUR",2003,"TUR_2003_DHS",153,"Type of toilet facility","Flush toilet","",37.308670333870637,64.517643212857664,80.090209769770254,86.630713619147443,93.011222414963839,80.430040236498812,89.890553589316497,93.502428827771865,94.970905289025708,97.800552817469978,16.157414967462621,20.796733142979949,34.902576435876291,41.701021184594708,50.531508994286881,"Central","East","North","South","West",74.749105537825173,58.4836089078171,57.721317549412433,57.119684460681903,86.395789893158295,3400.509620000003,5872.5838290000202,7298.7750139999853,7887.6810709999718,8474.1776559999362,4949.6278400000174,5530.3381510000163,5743.430736000003,5838.0158349999701,6017.8288419999644,478.46757600000018,616.16270800000007,1031.70074,1235.656649999999,1492.498112,7430.6437559999358,5214.3959870000044,2024.25676799999,3441.6392730000111,14822.791405999769]
["TUR",2003,"TUR_2003_DHS",154,"Type of toilet facility","Open pit","",35.300987548603551,11.16586908540328,4.4460021190839756,3.0089055463754959,0.83539840845659896,7.6202415338709706,2.5561766471240248,1.2380593048397881,0.97451838013137559,0.29213092163541921,51.524241153572987,42.324701030859003,24.376837247242111,15.276616529353101,8.6664027360009985,"Central","East","North","South","West",9.6555847303804736,28.625844923772391,19.007003549484409,10.017959677071159,1.205435048915918,3217.5187879999921,1016.349931000001,405.17273299999988,273.959273,76.112476999999998,468.94617400000033,157.26370199999999,76.048376000000019,59.905228000000001,17.975296,1525.781123999998,1253.990336999999,720.56574600000067,452.66644000000002,255.97077899999999,959.84038700000031,2552.2790689999938,666.56578900000011,603.61333899999977,206.814618]
["TUR",2003,"TUR_2003_DHS",155,"Type of toilet facility","Closed pit","",23.459206658094061,22.770673101109921,14.82605475032147,9.7941652412954845,5.9083285990509484,11.09666379852213,6.9379518841728789,4.6735206754798693,3.711026031860114,1.9073162608946641,25.491171542317261,32.481255426784116,37.922917318402092,41.825390904379148,39.687508845987757,"Central","East","North","South","West",15.47360631803271,8.7158883577925526,19.513741728932189,31.900951592926969,12.06666386641613,2138.1962209999988,2072.652998,1351.126913999997,891.75361199999941,538.30306599999994,682.88360800000009,426.84373899999991,287.07320900000002,228.12279899999999,117.36030599999999,754.86698100000012,962.3501040000001,1120.9803359999989,1239.3418899999981,1172.209838999999,1538.1970839999999,777.10822100000087,684.33683499999916,1922.1319040000001,2070.2587670000012]
["TUR",2003,"TUR_2003_DHS",156,"Type of toilet facility","No facility, bush/field/public toilet","",2.1644217985472989,0.21291075344100921,0.1905932190373697,0.31867425612701478,0,0.14830981352634839,0.21679986487593961,0.30408878723542382,0.23372201565357309,0,5.0112592733342254,1.462105440561333,0.53494995401911094,0,0,"Central","East","North","South","West",0.064279063862286004,2.3700414724622059,0.092575530538773099,0.10481850350695621,0.2085232620028652,197.27685500000001,19.379757000000001,17.369126999999999,29.015124,0,9.1269179999999999,13.338182,18.678796999999999,14.367272,0,148.39781500000001,43.319056000000003,15.812823,0,0,6.3898400000000004,211.312793,3.2465760000000001,6.3156420000000004,35.776011999999987]
["TUR",2003,"TUR_2003_DHS",157,"Type of toilet facility","OTHER","",1.7667136608845011,1.3329038471887431,0.44714014178739481,0.24754133705535869,0.24505057752919379,0.70474461758185458,0.39851801451083041,0.28190240467323208,0.10982828332952339,0,1.815913063313054,2.9352049588158531,2.2627190444603911,1.196971381673114,1.114579423724442,"Central","East","North","South","West",0.057424349900038502,1.8046163381550311,3.665361641632384,0.85658576581318346,0.1235879295070807,161.02763100000001,121.324791,40.748742,22.538509000000001,22.326360999999999,43.369661000000001,24.518031000000001,17.315988000000001,6.7513229999999993,0,53.774414,86.963842999999997,66.884715999999997,35.467852000000001,32.920206,5.7084279999999996,160.89951300000001,128.542338,51.611966000000002,21.203789]
["TUR",2008,"TUR_2008_DHS",16,"Water","Improved","w_imp",96.193546239082622,96.61675918899634,97.356203148540658,97.443275166954521,98.151526012040065,98.426707187312701,98.534531444495144,98.110230445236851,97.852935172074055,98.658083677687912,92.438265314492554,93.004170408558139,96.002367228772641,93.746906118950648,93.432092020593572,"Central","East","North","South","West",95.331008443930571,96.862873276790125,99.157393956874913,97.563413573590424,97.657982512676938]
["TUR",2008,"TUR_2008_DHS",17,"Water","Not Improved","",3.8064537609173779,3.38324081100366,2.6437968514593422,2.5567248330454788,1.848473987959935,1.5732928126872989,1.4654685555048561,1.889769554763149,2.147064827925945,1.341916322312088,7.5617346855074459,6.9958295914418613,3.9976327712273592,6.2530938810493524,6.5679079794064279,"Central","East","North","South","West",4.6689915560694288,3.137126723209875,0.84260604312508747,2.4365864264095758,2.3420174873230621]
["TUR",2008,"TUR_2008_DHS",18,"Water ladder","Basic","w_bas",94.768253769861715,95.606380542708408,95.986806199331767,95.737664594865805,97.622832994649471,97.598237619114684,97.432163234895071,97.159455398832819,96.188202544738303,98.323223288962382,89.828475687182561,91.192550521558516,94.964671847114062,91.016676222993652,91.594754258067184,"Central","East","North","South","West",93.451284037815199,95.828768134693419,97.16339327464712,97.088684482760598,96.620441648331067]
["TUR",2008,"TUR_2008_DHS",19,"Water ladder","Limited","w_lim",1.4252924692208899,1.0103786462879609,1.3693969492087881,1.705610572088688,0.52869301739057495,0.82846956819795037,1.1023682096000971,0.95077504640402555,1.664732627335759,0.3348603887255569,2.609789627309973,1.811619886999619,1.0376953816585861,2.730229895957005,1.8373377625264411,"Central","East","North","South","West",1.8797244061153029,1.034105142096718,1.9940006822277629,0.47472909082981352,1.0375408643457591]
["TUR",2008,"TUR_2008_DHS",20,"Water ladder","Unimproved","w_unimp",3.38010927708397,2.7672187143548022,2.434311600164849,2.24062425043978,1.559953844018265,1.187877151949585,1.273748709630915,1.453807965680062,1.6234289354648259,1.2880236390234829,6.9619720987082694,5.4874690892179192,3.9976327712273521,6.0270700911613568,6.3389670976767052,"Central","East","North","South","West",4.3009518740520267,2.8613935815668712,0.66110613627223047,2.1223496021546802,1.8767556296783721]
["TUR",2008,"TUR_2008_DHS",21,"Water ladder","Surface water","w_sur",0.42634448383342433,0.61602209664882912,0.20948525129459589,0.31610058260572788,0.28852014394168901,0.38541566073778089,0.19171984587391619,0.43596158908309318,0.52363589246111242,0.053892683288578498,0.59976258679919769,1.5083605022239459,0,0.22602378988798519,0.2289408817296702,"Central","East","North","South","West",0.36803968201747161,0.27573314164299212,0.18149990685288631,0.31423682425490851,0.46526185764480188]
["TUR",2008,"TUR_2008_DHS",29,"Piped water","Yes","w_pip",40.115850105511228,42.366547781077642,49.638019026677647,37.990818057533957,24.640311499184929,62.345094031643278,64.187296766855127,48.096297205918013,36.159619136337028,22.45479637353418,10.911626720041131,17.34046763035651,17.18859681239368,20.67060037964303,26.209642765275682,"Central","East","North","South","West",33.464333374833892,57.768093873009008,30.637106845542078,50.141065935473343,31.15879897292098]
["TUR",2008,"TUR_2008_DHS",30,"Piped water","No","",59.884149894488317,57.633452218922287,50.361980973322197,62.009181942465908,75.35968850081484,37.654905968356388,35.812703233144958,51.903702794082157,63.840380863662922,77.54520362646528,89.088373279959015,82.659532369643742,82.811403187606601,79.329399620357222,73.790357234724468,"Central","East","North","South","West",66.535666625166357,42.231906126990829,69.362893154458433,49.858934064526437,68.841201027078185]
["TUR",2008,"TUR_2008_DHS",31,"Piped water on premises","Yes","w_pop",39.886894241735519,42.196983185831307,49.396926429946532,37.964983014119639,24.619624104255951,62.034935100157398,63.999173259280987,48.067860293953537,36.124044093555611,22.426337986426969,10.813968506662119,17.082795060208792,17.18859681239368,20.388613294398219,25.907202830042099,"Central","East","North","South","West",33.347122181030763,57.590489375298567,30.121385126303728,50.015711718150001,31.089191412907869]
["TUR",2008,"TUR_2008_DHS",32,"Piped water on premises","No","",60.113105758264027,57.803016814168608,50.603073570053311,62.03501698588024,75.380375895743839,37.965064899842268,36.00082674071912,51.932139706046627,63.875955906444339,77.573662013572502,89.186031493338035,82.917204939791461,82.811403187606601,79.611386705602044,74.092797169958047,"Central","East","North","South","West",66.652877818969458,42.409510624701277,69.87861487369679,49.984288281849778,68.910808587091282]
["TUR",2008,"TUR_2008_DHS",35,"Water source on premises","Yes","",90.344306936420423,91.589777850175196,90.349914305881995,91.290880837538694,93.986562724134728,93.984284126251865,92.203696629504933,92.7395179679976,92.418073465767591,95.092718696676044,84.000501276234843,88.222638020361003,90.162286345984356,85.703122298835083,85.853036605768892,"Central","East","North","South","West",83.742677136830295,93.527217110812856,93.757741419340945,94.964952679020399,93.167696180129468]
["TUR",2008,"TUR_2008_DHS",36,"Water source on premises","No","",9.6556930635795641,8.4102221498247811,9.6500856941179709,8.709119162461386,6.0134372758651766,6.0157158737481753,7.7963033704951377,7.260482032002284,7.581926534232422,4.9072813033238081,15.99949872376525,11.77736197963921,9.837713654015916,14.29687770116513,14.146963394231181,"Central","East","North","South","West",16.257322863169929,6.4727828891870747,6.2422585806592421,5.035047320979535,6.832303819870007]
["TUR",2008,"TUR_2008_DHS",41,"Water point at more than 30 minutes","Yes","",1.9441747253257231,1.8532117899576031,2.968002038400225,2.31370647615661,1.8666087401123661,1.798352540866234,2.8130135424676501,2.183398692889492,2.5239580042341441,2.1330168497368449,4.1642190802300094,0.45559375952336612,1.9641233457191249,1.194964532985999,1.7402247468083549,"Central","East","North","South","West",3.618249315991549,1.5656282506887369,2.3607602052261858,1.678339069493991,1.886023205561598]
["TUR",2008,"TUR_2008_DHS",42,"Water point at more than 30 minutes","No","w_30min",98.055825274674262,98.146788210042416,97.031997961599757,97.686293523843489,98.133391259887517,98.201647459133824,97.18698645753237,97.81660130711046,97.476041995765897,97.866983150263096,95.835780919770073,99.544406240476647,98.035876654280941,98.805035467014022,98.25977525319162,"Central","East","North","South","West",96.381750684008523,98.434371749311225,97.639239794773829,98.321660930505956,98.113976794438173]
["TUR",2008,"TUR_2008_DHS",58,"Source of drinking water","Piped into residence","",39.906112561725159,42.258373587769412,49.407127912966097,37.964983014119639,24.637286408397479,62.045535730975857,64.022855985728029,48.081496921989462,36.124044093555611,22.448476366221001,10.817783140395999,17.10693857916916,17.20680532822038,20.446269132767011,25.907202830042099,"Central","East","North","South","West",33.353659628623618,57.606946410628289,30.121385126303728,50.151574470354078,31.100059426902039]
["TUR",2008,"TUR_2008_DHS",59,"Source of drinking water","Public tap","",0.2290661793853194,0.1698112867837489,0.24114238731951679,0.025835043414318099,0.020702236222239601,0.3102119319496015,0.18819312218540449,0.028444979383914298,0.035575042781419097,0.0284864800835339,0.097692662371065095,0.2580367448955323,0,0.2827845010167554,0.30243993523358198,"Central","East","North","South","West",0.1172341721588733,0.1776552499010382,0.51572171923835108,0.12569472970196341,0.069631893098073799]
["TUR",2008,"TUR_2008_DHS",60,"Source of drinking water","Well in residence","",5.4237142610894153,4.8695571751595512,1.0146760478437129,0.98052973930807119,0.29720506743086061,0.83506572374004695,0.48188418247024511,0.34581233999880712,0.23102644571901729,0.24559391883052481,10.34118595479654,9.161281398861604,10.02844663579801,7.3526459641229174,3.5150304314675611,"Central","East","North","South","West",1.762605891930795,6.2227301699481359,3.6677224766175192,2.249933299579109,1.0924229922890321]
["TUR",2008,"TUR_2008_DHS",61,"Source of drinking water","Public well","",2.0127561992777041,0.98250954313716299,0.53014927956584357,0.087860258933799201,0.1131469853924767,1.1322326705502099,0.44510831590138628,0.2221515111762731,0,0.029617292436777399,4.1880032528541751,1.2187310732643379,2.058699971065034,0.65167617781414855,0.65726983827231567,"Central","East","North","South","West",0.30281180344864328,1.7968550854882741,0.2187260660370601,0.77232375870516723,0.56919111651266419]
["TUR",2008,"TUR_2008_DHS",62,"Source of drinking water","Piped surface water in house/garden","",34.14522636943655,28.3569373736307,12.975705088388199,5.3874696136928986,3.847847903760758,7.1813579834235073,4.7099096040598374,2.8187826012725452,1.265319124718604,0.81497312494795038,59.903477923348738,56.509342390399262,59.223009818550302,52.109653684162019,37.800012288225624,"Central","East","North","South","West",15.651531645872289,25.239024609055932,41.664499515822797,28.10179072648468,6.3477168059536861]
["TUR",2008,"TUR_2008_DHS",63,"Source of drinking water","Spring/public fountain","",6.4742402989468024,5.033214422683467,6.3412669022381687,6.2450773934513144,4.173956368622008,3.6458217128729919,5.8627045327055791,4.872470434664443,5.8362493793879846,3.5438637306655179,11.174712415531509,7.8988202439828186,5.6778312161425877,8.3407363147301581,7.1805034271033907,"Central","East","North","South","West",11.754080254220661,4.0579363160336408,4.3885912573611288,3.0770655279872852,4.2357485687267076]
["TUR",2008,"TUR_2008_DHS",64,"Source of drinking water","River/stream/pond/lake/dam","",0.42634448383342433,0.61602209664882912,0.20948525129459589,0.31610058260572788,0.28852014394168901,0.38541566073778089,0.19171984587391619,0.43596158908309318,0.52363589246111242,0.053892683288578498,0.59976258679919769,1.5083605022239459,0,0.22602378988798519,0.2289408817296702,"Central","East","North","South","West",0.36803968201747161,0.27573314164299212,0.18149990685288631,0.31423682425490851,0.46526185764480188]
["TUR",2008,"TUR_2008_DHS",65,"Source of drinking water","Tanker truck","",0.23659344445175029,0.16003132083093929,0.39864970668495309,0.1528501686763325,0.0389580639818543,0.14970346511882379,0.1603522848843402,0.33141101471516171,0.085613319530410195,0.053606678128807102,0.52458066330369157,0,0.30132022025594901,0.3042253755239176,0.40536269208439962,"Central","East","North","South","West",0.36730221176965999,0.33237664216975837,0.84353102742685682,0,0]
["TUR",2008,"TUR_2008_DHS",66,"Source of drinking water","Bottled water","",9.4461259877325148,15.618669950057759,26.721329719029001,46.865684605553582,65.196705672123414,23.561774332480049,22.96267502076773,41.477068404871403,54.733415507912717,71.574422848424192,0.17637529328536561,3.336221189531634,2.421287216123488,5.6307119656187874,17.99648748221961,"Central","East","North","South","West",32.772733458159273,2.9735258690516861,17.909217105894829,13.981160581462779,54.532083308451227]
["TUR",2008,"TUR_2008_DHS",67,"Source of drinking water","Other","",1.699820214121029,1.934873243298348,2.16046770466976,1.973609580244188,1.3856711501268379,0.75288078815076731,0.97459710542351796,1.3864002028451361,1.1651211939330599,1.2070668769724551,2.1764261073137101,3.0022678776719278,3.082599593844499,4.6552730943565317,6.0067501936218921,"Central","East","North","South","West",3.550001251798796,1.31721650608034,0.48910579844580232,1.226220081470015,1.5878840304211781]
["TUR",2008,"TUR_2008_DHS",122,"Sanitation","Improved","s_imp",82.866603521051672,88.839221074713265,96.993495490939665,99.694150185250692,99.763268513480853,97.357736310784531,98.820246726023214,99.487952002145789,99.978005756094404,99.91800140275906,62.303646614936333,77.210213616184419,74.652726592411767,86.056922434500848,94.909635715746418,"Central","East","North","South","West",97.077029461163491,80.581709055669492,85.599321002933223,97.368609195603653,98.067529763171777,8189.9049820000291,8347.9229020000093,8359.6299590000144,8414.66986000002,8412.7003930000337,6091.8484010000293,6103.941690000006,6120.3443079999961,6123.0565859999961,6112.508466000023,2131.6974140000002,2255.6338889999961,2256.4433899999931,2265.083297999995,2264.2706539999958,8815.4193539999669,7692.5226809999958,2825.263704999973,5160.7424470000014,17230.87990900009]
["TUR",2008,"TUR_2008_DHS",123,"Sanitation","Not Improved","",17.133396478948331,11.16077892528673,3.0065045090603348,0.30584981474930828,0.23673148651914741,2.6422636892154689,1.179753273976786,0.51204799785421073,0.021994243905595599,0.081998597240939802,37.696353385063667,22.789786383815581,25.347273407588229,13.94307756549915,5.0903642842535817,"Central","East","North","South","West",2.922970538836509,19.418290944330511,14.40067899706678,2.631390804396347,1.9324702368282229,235.3917900000001,74.935642999999999,57.742982000000012,16.823616000000001,10.902511000000001,30.001745,15.727855,7.6909799999999997,0,10.902511000000001,169.620542,44.340065000000003,44.140912,37.163981999999997,36.207949999999997,51.761043000000008,231.53959300000011,44.379640999999999,18.213744999999999,49.902520000000003]
["TUR",2008,"TUR_2008_DHS",124,"Sanitation ladder","Basic","s_bas",80.177401044417635,86.621840704322693,96.367098707445209,99.231884129154594,99.727363869102049,95.76860982225557,98.41854629480757,99.234921675801559,99.903957854430416,99.868490578963389,58.029373381960987,75.030756138769547,69.546206727796459,84.964352502391833,93.635408311902452,"Central","East","North","South","West",95.938404834770722,77.815500376994947,85.21714348429488,95.286508275372398,97.611571763954714,7832.8444360000276,8089.3751810000103,8271.4557810000151,8355.6320590000196,8386.6030260000352,5939.7845790000256,6061.5248730000067,6101.5793189999958,6110.5960279999963,6090.4686240000237,1961.506397000001,2166.9890049999972,2086.7043039999971,2207.0772149999962,2209.680138999996,8685.772228999971,7331.7803639999929,2783.5047979999722,5000.4498619999977,17134.40323000008]
["TUR",2008,"TUR_2008_DHS",125,"Sanitation ladder","Limited","s_lim",2.6892024766340459,2.2173803703905768,0.62639678349444072,0.46226605609610288,0.035904644378804002,1.589126488528944,0.40170043121564258,0.25303032634423972,0.074047901663994997,0.049510823795684299,4.2742732329753581,2.1794574774149118,5.1065198646154428,1.0925699321090441,1.2742274038439609,"Central","East","North","South","West",1.138624626392833,2.7662086786745692,0.38217751863832861,2.0821009202311989,0.45595799921701058,262.71872600000012,207.07504700000001,53.76537600000001,38.924233999999998,3.019412,98.561199000000002,24.74043,15.557876,4.5291180000000004,3.019412,144.478801,62.945658999999992,153.218953,28.381152,30.070194999999998,103.085247,260.63232099999999,12.483321,109.2645899999999,80.037315999999976]
["TUR",2008,"TUR_2008_DHS",126,"Sanitation ladder","Unimproved","s_unimp",15.60237222380721,10.83754780899406,3.0006187389220229,0.28718242584299652,0.21669226265849501,2.4719027802395752,1.150170644936416,0.48641160520552129,0.021994243905588701,0.054421724708953997,32.437188456080833,22.620949173823401,24.49614302938549,13.94307756549912,5.090364284253587,"Central","East","North","South","West",2.9081330249545729,17.641223459001431,14.32955862918879,2.4731387835364469,1.886878684517773,107.842849,47.876719000000001,57.249580000000009,15.253431000000001,9.2191109999999998,19.663653,13.922725,6.1207949999999993,0,9.2191109999999998,49.942683000000002,40.500242999999998,24.700548000000001,37.163981999999997,36.207949999999997,50.449315000000013,92.502680999999981,42.359561000000006,10.098694999999999,42.031437999999987]
["TUR",2008,"TUR_2008_DHS",127,"Sanitation ladder","Open defecation","s_od",1.531024255141112,0.32323111629266782,0.0058857701383278997,0.018667388906306901,0.0200392238606515,0.17036090897591061,0.029582629040371601,0.025636392648680301,0,0.027576872531972899,5.2591649289828268,0.1688372099921446,0.85113037820261261,0,0,"Central","East","North","South","West",0.0148375138818724,1.7770674853290569,0.071120367877996901,0.15825202085995591,0.045591552310502298,127.548941,27.058924000000001,0.49340200000000001,1.5701849999999999,1.6834,10.338092,1.8051299999999999,1.5701849999999999,0,1.6834,119.677859,3.8398219999999998,19.440363999999999,0,0,1.311728,139.036912,2.0200800000000001,8.1150500000000001,7.8710820000000004]
["TUR",2008,"TUR_2008_DHS",128,"Shared among Improved Sanitation","Yes","s_shared",3.2452186554875189,2.4959475596097049,0.64581318605323756,0.46368423346517801,0.035989843670721701,1.6322549688872681,0.4064960820522413,0.25433263149168273,0.074064191522925302,0.049551455293937799,6.8603901460089949,2.822757994491631,6.8403661831348384,1.269589826362445,1.3425690597530699,"Central","East","North","South","West",1.172908393172815,3.432799714837949,0.4464726053437183,2.1383697861478841,0.46494288203050138]
["TUR",2008,"TUR_2008_DHS",129,"Shared among Improved Sanitation","No","",96.754781344512494,97.504052440390311,99.35418681394674,99.536315766534827,99.96401015632928,98.367745031112705,99.593503917947757,99.745667368508322,99.925935808477078,99.950448544706077,93.139609853991033,97.177242005508418,93.159633816865338,98.73041017363758,98.657430940246911,"Central","East","North","South","West",98.827091606827238,96.567200285162073,99.553527394656271,97.861630213852052,99.535057117969444]
["TUR",2008,"TUR_2008_DHS",139,"Shared among Improved Sanitation","Open defecation","",1.513880691109732,0.32125582847479689,0.0058617101019333004,0.0186228573202302,0.019984322850743801,0.16887201995224971,0.029497180962571101,0.025622975818607899,0,0.0274912137421932,5.2004052151062314,0.1669506732161892,0.84501854520608932,0,0,"Central","East","North","South","West",0.0147930677089168,1.7546165993192699,0.070394810658816295,0.15669277165416881,0.045548180658712502]
["TUR",2008,"TUR_2008_DHS",148,"Shared among improved sanitation facilities","Yes","",3.1182133176969988,2.458488954713888,0.63874294719811331,0.46165289827711559,0.035844662128674203,1.609990389333511,0.40427722147536299,0.25388032654553477,0.073968253214506605,0.049309314879258201,6.2780895018576128,2.7367987750699592,6.6600016729141576,1.232758628777707,1.3071277840930551,"Central","East","North","South","West",1.1625482101940421,3.2891250975547308,0.43501297878709011,2.1097801554834992,0.4631579404974383]
["TUR",2008,"TUR_2008_DHS",149,"Shared among improved sanitation facilities","No","",92.968172492523863,96.040734125851372,98.266476238812515,99.10026121450565,99.560759470482296,97.025971517467383,99.049872357119284,99.568279754331584,99.796497748714415,99.462026097484994,85.234045642670125,94.217980218049064,90.703231443678874,95.86621012318021,96.053061965361323,"Central","East","North","South","West",97.954161752913365,92.52552681289032,96.998283841785792,96.553237305313672,99.152936508509256]
["TUR",2008,"TUR_2008_DHS",150,"Shared among improved sanitation facilities","DK/missing","",3.9136141897791772,1.5007769194347771,1.0947808139893589,0.43808588721725922,0.40339586738904831,1.364038093199015,0.54585042140539275,0.1778399191228679,0.12953399807107391,0.48866458763575948,8.4878648554724219,3.0452210068810248,2.6367668834071791,2.9010312480421359,2.6398102505455898,"Central","East","North","South","West",0.88329003689266317,4.1853480895549087,2.5667031794271171,1.3369825392027559,0.38390555099326451]
["TUR",2008,"TUR_2008_DHS",151,"Shared among all sanitation facilities","Yes","",3.2291700887674182,2.477202367714773,0.63878039065280146,0.46173888725128043,0.035851826873504501,1.6982845338915451,0.41920396171447322,0.25394539491266582,0.073968253214506605,0.049322874336065699,6.6224855877316608,2.7413755199559091,6.7167595366356263,1.232758628777707,1.3071277840930551,"Central","East","North","South","West",1.162720212182295,3.359503776013518,0.43531942106931282,2.214228823817924,0.46336899664514658]
["TUR",2008,"TUR_2008_DHS",152,"Shared among all sanitation facilities","No","",95.574132807121742,96.882758488597389,98.952412499294539,99.299663840796399,99.690125665679858,97.426275435437375,99.254863398276257,99.693706098304347,99.796497748714415,99.639973492404238,91.971723235154727,96.139385641082413,92.559036579304319,97.4804581808432,97.626993143727546,"Central","East","North","South","West",98.537682771533468,95.261813316620476,98.543779878789664,96.798929894489433,99.441456758146558]
["TUR",2008,"TUR_2008_DHS",153,"Type of toilet facility","11","",55.813905865707127,63.19498036941409,85.052211002576215,92.893180533089591,95.59667552089671,88.622351169056273,91.885119432720543,95.472278112638648,97.778147235956268,98.483689940459712,19.14717438337556,31.62239192905232,23.319031062396679,44.369377167860222,61.684378015958821,"Central","East","North","South","West",84.607365482364841,64.62090376742151,60.554050716999853,59.152481010212057,90.548268396995852,4695.1802670000161,5320.8207569999886,7151.8305960000152,7819.8875260000232,8045.8023010000243,5422.8921550000186,5620.1532520000046,5850.5748929999936,5987.0112839999938,6023.4712090000194,438.65686000000011,727.30677800000035,536.47396800000013,1021.492779000001,1405.4882690000011,7473.4836319999549,5118.5524130000076,1737.0736669999731,3063.4810780000021,15640.93065700003]
["TUR",2008,"TUR_2008_DHS",154,"Type of toilet facility","21","",14.490805506931141,10.308419488678931,2.4223116415710768,0.26450572027256131,0.19272837003505261,2.196876399760094,0.97443609626862804,0.3865431722690173,0.0219942439055552,0.021446738791612099,30.74398546460921,20.861935639119881,23.42859075111614,12.328829507836391,4.4651723366559306,"Central","East","North","South","West",2.7224006159439771,16.535156766606441,12.88882312795694,2.2797032379299949,1.685251764458461,1218.9962879999971,867.93685300000004,203.68620999999999,22.266489,16.220797999999998,134.42911000000001,59.601382999999998,23.687501999999999,1.3467199999999999,1.311728,704.33683099999985,479.8190859999998,538.99448099999995,283.84014200000018,101.739655,240.47334799999999,1309.7320159999981,369.73307299999999,118.064832,291.1033690000001]
["TUR",2008,"TUR_2008_DHS",155,"Type of toilet facility","22","",27.052697655344542,25.644240705299179,11.941284488363451,6.8009696521610996,4.1665929925841434,8.7353851417282602,6.9351272933026706,4.0156738895071484,2.1998585201381329,1.4343114622993429,43.156472231560763,45.587821687132092,51.333695530015092,41.687545266640633,33.225257699787591,"Central","East","North","South","West",12.46966397879865,15.96080528824799,25.04527028593337,38.216128185391597,7.519261366175928,2275.7284269999909,2159.1652919999951,1004.113153,572.51584499999967,350.67729399999968,534.52713599999993,424.18705499999987,246.0819130000001,134.69858199999999,87.725529000000009,988.70372299999951,1048.5080250000001,1180.974940999999,959.75037700000075,757.04272999999944,1101.462373999999,1264.2382519999969,718.45696499999906,1979.1965369999959,1298.845882999999]
["TUR",2008,"TUR_2008_DHS",156,"Type of toilet facility","31","",1.5162366898413711,0.32137676668544668,0.0058677188238440998,0.018652375522075899,0.020001416583635901,0.168947859086091,0.029512466689865,0.025622975818607899,0,0.0275235720224008,5.2238846466507596,0.1669506732161892,0.84501854520608932,0,0,"Central","East","North","South","West",0.014850082742437499,1.755318727938058,0.070419596529638098,0.15669277165416881,0.045567163562085802,127.548941,27.058924000000001,0.49340200000000001,1.5701849999999999,1.6834,10.338092,1.8051299999999999,1.5701849999999999,0,1.6834,119.677859,3.8398219999999998,19.440363999999999,0,0,1.311728,139.036912,2.0200800000000001,8.1150500000000001,7.8710820000000004]
["TUR",2008,"TUR_2008_DHS",157,"Type of toilet facility","OTHER","",1.126354282175565,0.53098266992207455,0.57832514866541418,0.0226917189547132,0.024001699900363001,0.27643943036907881,0.1758047110182947,0.099881849766528405,0,0.033028286426881,1.728483273803803,1.7609000714796821,1.0736641112662899,1.614248057663036,0.62519194759782115,"Central","East","North","South","West",0.18571984014998091,1.127815449786066,1.441436272580195,0.19499479481212029,0.2016513088073715,94.751232999999985,44.707089000000003,48.629935000000003,1.910223,2.0200800000000001,16.915610999999998,10.753095,6.1207949999999993,0,2.0200800000000001,39.599108999999999,40.500242999999998,24.700548000000001,37.163981999999997,14.245096999999999,16.404886000000001,89.333050999999983,41.349521000000003,10.098694999999999,34.832407000000003]
["TUR",2013,"TUR_2013_DHS",16,"Water","Improved","w_imp",97.968878948247095,98.633306975406612,99.415404287061222,99.498650823799025,99.80779315777319,99.628264324361695,99.40677625193743,99.750043187839594,99.406273906558695,99.914916467468601,94.263821902915296,97.221678153974466,98.251154629320453,96.749297461419985,99.256685533897198,"Central","East","North","South","West",99.015587547247776,98.060983576900242,99.387520252589951,98.521775987586125,99.66340988162662]
["TUR",2013,"TUR_2013_DHS",17,"Water","Not Improved","",2.0311210517530021,1.3666930245934741,0.58459571293874246,0.50134917620094188,0.19220684222683279,0.37173567563829862,0.59322374806255784,0.2499568121604023,0.59372609344128779,0.085083532531379805,5.7361780970846432,2.7783218460255452,1.748845370679535,3.2507025385800228,0.74331446610278407,"Central","East","North","South","West",0.98441245275227829,1.9390164230997,0.61247974741000955,1.478224012413861,0.33659011837341107]
["TUR",2013,"TUR_2013_DHS",18,"Water ladder","Basic","w_bas",96.499831801358255,97.597202138117964,98.016094637430371,97.756910339549691,99.269812021655696,98.789216363821737,98.294327744682448,98.783376903290787,97.715001219245863,99.575723347501395,91.508983974415713,95.285399055525204,97.170087988351838,93.900532341755891,97.298420199760443,"Central","East","North","South","West",97.061687737714664,96.996553961920213,97.383764551630009,98.041523849522576,98.604208384331187]
["TUR",2013,"TUR_2013_DHS",19,"Water ladder","Limited","w_lim",1.451334999604047,1.031417865816538,1.3983478176273709,1.7415843646848641,0.53761251178196023,0.83857927581594061,1.1121229221660469,0.96666628454878023,1.6911569860573341,0.33912604075008967,2.6586134892655342,1.8929279078434751,1.0617943449876239,2.8167370122110942,1.951750000480406,"Central","East","North","South","West",1.9523458154464339,1.0467069249674481,1.9985231722503709,0.47938813599763719,1.0588431790404209]
["TUR",2013,"TUR_2013_DHS",20,"Water ladder","Unimproved","w_unimp",1.7053347948982041,1.271310028492328,0.55611672460092354,0.36342102331388348,0.1925754665622896,0.34753699142883437,0.42684190283957052,0.2499568121604023,0.45045797369530172,0.085150611748538996,4.9919318458024744,2.331714752630889,1.647455685771823,3.2827306460329959,0.62932358911697217,"Central","East","North","South","West",0.9244425563970744,1.7273197927120261,0.44310594931855751,1.215855967554782,0.2878429786197283]
["TUR",2013,"TUR_2013_DHS",21,"Water ladder","Surface water","w_sur",0.3434984041395408,0.10006996757321961,0.0294408203412393,0.13808427245150459,0,0.024667368933422199,0.1667074303119232,0,0.14338382100148739,0,0.84047069051621426,0.48995828400042091,0.1206619808887255,0,0.1205062106422037,"Central","East","North","South","West",0.061523890441762097,0.229419320400264,0.17460632680099489,0.26323204692496771,0.0491054580086107]
["TUR",2013,"TUR_2013_DHS",22,"Improved water point at more than 30 minutes","Yes","",1.481692405515876,1.045759198268609,1.4065841774041239,1.7503625254450641,0.5386498191843917,0.8417121651965016,1.1187633344773811,0.96908858748907833,1.701259777653406,0.33941505474557221,2.8232784533882929,1.9478910236405,1.0809060355624029,2.912341333689195,1.9664953687663,"Central","East","North","South","West",1.9717869734073701,1.06759701329705,2.010945026545357,0.48658515876111019,1.0624229967182419]
["TUR",2013,"TUR_2013_DHS",23,"Improved water point at more than 30 minutes","No","",98.518307594484099,98.954240801731416,98.593415822595773,98.249637474554902,99.461350180815586,99.158287834803431,98.881236665522636,99.030911412510918,98.298740222346609,99.660584945254456,97.176721546611688,98.052108976359492,98.919093964437607,97.087658666310801,98.033504631233754,"Central","East","North","South","West",98.028213026592553,98.932402986702954,97.9890549734546,99.513414841238884,98.937577003281646]
["TUR",2013,"TUR_2013_DHS",24,"Manually calculated ratios","Improved wells","",83.345872238700565,93.824748474161794,90.568084273605649,97.733019337341105,92.442209501231147,91.103770440096682,100,94.88026949532852,100,91.277253424144249,78.098790414737124,77.975741498426473,94.05414126462756,92.10547740554739,94.53266339567331,"Central","East","North","South","West",97.145652840190493,85.630863827640454,96.581548947983734,88.209710247532428,92.345414704901501]
["TUR",2013,"TUR_2013_DHS",25,"Manually calculated ratios","Improved springs","",93.175882402238869,90.64284585971177,97.97931116180682,96.112226314631499,96.567545686192204,92.869070322444173,94.89737880293012,99.213344753857314,92.147221413287809,98.392974734033885,85.650835991457697,97.479618144984855,96.54183952415795,91.129152764721852,98.550196302780904,"Central","East","North","South","West",94.112713066779492,90.344058675187043,99.108050979474029,82.457420827121737,96.182919561925772]
["TUR",2013,"TUR_2013_DHS",29,"Piped water","Yes","w_pip",73.40395268500032,83.913747802541693,89.405500134405528,91.318794136481728,94.05782879350258,95.19076152488411,94.036098220824599,93.858672771640869,94.269854349840969,95.777431235923245,55.398344781138512,51.040310210018824,59.366652639403213,56.672713683204591,68.219993338309877,"Central","East","North","South","West",81.848980399794385,78.944627208185253,69.637573172366416,90.413992518531472,93.952416585119252]
["TUR",2013,"TUR_2013_DHS",30,"Piped water","No","",26.596047314999929,16.086252197458411,10.59449986559437,8.6812058635183877,5.9421712064976058,4.8092384751158779,5.9639017791754796,6.1413272283591276,5.7301456501590522,4.2225687640767884,44.60165521886141,48.959689789981141,40.633347360596723,43.327286316795437,31.780006661690152,"Central","East","North","South","West",18.151019600205331,21.055372791814712,30.362426827633339,9.5860074814686982,6.0475834148808572]
["TUR",2013,"TUR_2013_DHS",31,"Piped water on premises","Yes","w_pop",68.014475256263353,82.106939407873,88.032260807297973,90.532360773058002,92.899647504968428,93.916885268957557,93.470224219896423,93.119494796888034,93.772904614372038,94.946046907441072,44.491525738253728,44.381004721176403,52.489531725244603,52.349938748226577,63.716458562335838,"Central","East","North","South","West",80.943725566603547,73.716940096919956,66.361688734658102,89.812861231922938,92.481688383962563]
["TUR",2013,"TUR_2013_DHS",32,"Piped water on premises","No","",31.985524743736871,17.893060592127082,11.967739192701931,9.4676392269420848,7.1003524950316779,6.0831147310424347,6.5297757801036767,6.8805052031119436,6.2270953856279743,5.0539530925589462,55.508474261746223,55.618995278823569,47.510468274755333,47.650061251773479,36.283541437664141,"Central","East","North","South","West",19.056274433396158,26.283059903080009,33.638311265341642,10.187138768077251,7.5183116160374404]
["TUR",2013,"TUR_2013_DHS",35,"Water source on premises","Yes","",90.331176125421237,93.047662021206506,92.620989614799626,93.688913823131145,95.324751842487345,95.60618375650354,94.153303648169654,93.96492941661289,94.340508901209589,95.997747958600272,82.217031837633101,86.613823248150695,88.817784626450987,87.621461680852136,88.57426395639439,"Central","East","North","South","West",88.962776693798389,91.900337213919954,92.864642390666859,96.25953472145288,94.515697915465438]
["TUR",2013,"TUR_2013_DHS",36,"Water source on premises","No","",9.6688238745788695,6.9523379787935591,7.3790103852003019,6.3110861768689173,4.675248157512744,4.393816243496425,5.846696351830432,6.0350705833871077,5.6594910987904239,4.0022520413997684,17.782968162366789,13.386176751849289,11.182215373549001,12.37853831914787,11.42573604360563,"Central","East","North","South","West",11.03722330620128,8.0996627860799304,7.1353576093330302,3.7404652785471328,5.4843020845346668]
["TUR",2013,"TUR_2013_DHS",37,"Improved Water source on premises","Yes","w_premises",91.135395095863998,93.831217018569973,93.059431840301627,94.105670327766845,95.469973822504187,95.840661518732546,94.636495424792216,94.200389707769119,94.903978585787357,96.07949578765475,84.542066025994103,87.109175031614072,89.58454309374217,89.115871500259516,88.81952227877818,"Central","East","North","South","West",89.753480783642459,92.816456122518602,93.144596072296764,96.667745706091225,94.804398744418208]
["TUR",2013,"TUR_2013_DHS",38,"Improved Water source on premises","No","",8.864604904135998,6.1687829814299979,6.9405681596983317,5.894329672233237,4.5300261774958868,4.1593384812674037,5.3635045752078838,5.799610292230895,5.0960214142126734,3.9205042123452931,15.45793397400589,12.8908249683859,10.415456906257891,10.884128499740481,11.18047772122188,"Central","East","North","South","West",10.24651921635715,7.1835438774812914,6.8554039277031533,3.3322542939088078,5.1956012555818747]
["TUR",2013,"TUR_2013_DHS",41,"Water point at more than 30 minutes","Yes","",1.5887094803264239,1.31768375610875,1.4344710218988499,1.9294691022906829,0.58748187620330972,0.90969975702944561,1.3545331428186449,0.97881831730756308,1.980306699820205,0.33912604075008967,2.9377239499165761,2.229302701986307,1.0617943449876239,3.125942380208278,2.0119344092975888,"Central","East","North","South","West",2.2263115170659011,1.1882158813928221,2.1558060038445821,0.58158086669698539,1.1404718601518391]
["TUR",2013,"TUR_2013_DHS",42,"Water point at more than 30 minutes","No","w_30min",98.411290519673628,98.682316243891293,98.565528978101071,98.070530897709261,99.412518123796659,99.0903002429705,98.645466857181361,99.021181682692429,98.01969330017981,99.660873959249926,97.062276050083412,97.770697298013687,98.93820565501241,96.874057619791671,97.988065590702433,"Central","East","North","South","West",97.773688482934062,98.811784118607164,97.844193996155354,99.418419133303004,98.85952813984818]
["TUR",2013,"TUR_2013_DHS",58,"Source of drinking water","Piped into dwelling","",58.680123839517798,63.055627850923933,57.496564200271493,50.851648757273033,37.974418158523179,77.265593128724618,62.393805987589289,55.062444331483093,48.931269099746402,36.680196051147107,40.006719631818868,41.203375845407642,48.874354383264368,48.02892644181258,47.61947297288512,"Central","East","North","South","West",53.771165945918753,66.274903676295622,50.565810648297351,74.790926471589898,41.741351628958903]
["TUR",2013,"TUR_2013_DHS",59,"Source of drinking water","Piped to yard/plot","",1.583678098074323,0.31710439064182261,0.0677009491542922,0.043343122839852199,0.025997080695314801,0.42777426057318119,0.092867083764001407,0,0.055872264718139601,0.033552814991043498,3.9245020459285578,1.602774619638283,0.72488178641457135,0.47773640693388852,0.2230540798220399,"Central","East","North","South","West",0.31401904712408041,1.243060961975867,0,0.12814667725424489,0.2221311030045201]
["TUR",2013,"TUR_2013_DHS",60,"Source of drinking water","Public tap/standpipe","",5.3763908491149444,1.807046654775021,1.373953183104808,0.78683651682880718,1.158181288534077,1.2569977139891479,0.5659703309728622,0.73967392302767243,0.49706507276121642,0.83138432848215649,10.9068190428848,6.6593054888424286,6.8771209141585867,4.3227749349780229,4.5102018909068446,"Central","East","North","South","West",0.90572652951604138,5.2149954230832716,3.277048668472073,0.60113128660854342,1.4709666082405961]
["TUR",2013,"TUR_2013_DHS",61,"Source of drinking water","Tube well or borehole","",8.9041278706701039,3.3957197466632381,1.0568348767975251,0.75170964002020135,0.67966585278477543,0.58004801423034758,0.046432821027373297,0.29982468003210277,0.1075892667823195,0.041350184075976099,14.80914198068225,20.072554183709752,11.40979538017093,8.2272469808722448,7.5433786270004672,"Central","East","North","South","West",2.1692245107925352,9.8135514293519002,0.24879071363557101,1.4239417267814709,1.10004396479359]
["TUR",2013,"TUR_2013_DHS",62,"Source of drinking water","Protected well","",2.2983389798108131,2.1073937659283222,1.0298247121947091,1.215415482049311,0.49960434931671283,0.99498665233278949,1.0686881693214121,1.0382327000578799,0.57335532156794311,0.32877436182067021,3.2453985670954051,4.0097842624057831,2.6996428211161829,4.6050737669709587,3.4402761573822058,"Central","East","North","South","West",1.480767068004929,2.9092440411945262,1.2556789963638859,1.458903373135505,0.73875598686996713]
["TUR",2013,"TUR_2013_DHS",63,"Source of drinking water","Unprotected well","",0.45925286976324348,0.13870206720750869,0.10724771288123119,0.028192349050340799,0.040846113748061803,0.097159860952323596,0,0.056022939792508601,0,0.031418730638994398,0.91010569854172785,1.132564095367383,0.17066441343775249,0.39470897851601172,0.19896982787336759,"Central","East","North","South","West",0.043508105111531199,0.4881805685236611,0.044444070662261401,0.1949999999076191,0.061236074707461202]
["TUR",2013,"TUR_2013_DHS",64,"Source of drinking water","Protected spring","",12.886083583980771,8.8105812396757024,7.5760954127833822,6.1576909574786471,3.9865590957943362,2.751745030775985,4.2060672357369961,4.5253395836609638,4.3387316063932646,3.2857227627532288,20.40700788554129,20.983553308828199,23.503934336006939,25.624480873614129,18.881189329952441,"Central","East","North","South","West",13.23383563454958,6.1823669748516714,27.119225604117641,4.1389079475462047,3.7344823925078798]
["TUR",2013,"TUR_2013_DHS",65,"Source of drinking water","Unprotected spring","",0.94376514055477434,0.90952535683591851,0.15624657140542861,0.2490807859215366,0.14170062900920971,0.21129209366366319,0.22615975387415049,0.0358810816518274,0.36974634861060801,0.0536648018923854,3.41880496183893,0.54253974338157018,0.8419186660228003,2.494381308471187,0.27776726100429128,"Central","East","North","South","West",0.82785189236217416,0.66076921529788168,0.24406661694946591,0.88054076432139072,0.1482053128736307]
["TUR",2013,"TUR_2013_DHS",66,"Source of drinking water","River/dam/lake/ponds/stream/canal/irrigation channel","",0.34052886307145819,0.099741108923557406,0.029407740282105198,0.1381120513706755,0,0.024636307451530701,0.16664434817376331,0,0.14338915632625759,0,0.82660439435713273,0.48243073751192578,0.11934677803023309,0,0.1196359715900874,"Central","East","North","South","West",0.061458929265913703,0.22738417023215679,0.17318879671000559,0.26307828120573762,0.049061189800565903]
["TUR",2013,"TUR_2013_DHS",67,"Source of drinking water","Tanker truck","",0.34788886947849967,0.23308070766469771,0.1054426624062538,0.024762189223426,0.024753816724767098,0.036954461177295998,0.032505497710356997,0,0,0,0.4039286884578327,0.77355637812606859,1.0954354379941389,0.53938522288168833,0.22044188593462341,"Central","East","North","South","West",0.085730944962968597,0.15177178192292209,0.35555256529809148,0.59874876198425642,0]
["TUR",2013,"TUR_2013_DHS",68,"Source of drinking water","Cart with small tank","",0,0.096248959182364494,0.013893338872226,0,0,0.035791921601996499,0.017898570304273199,0,0,0,0,0,0,0.30475080497311879,0,"Central","East","North","South","West",0.041778721331838797,0,0.11111017665565361,0.043810885023238301,0]
["TUR",2013,"TUR_2013_DHS",69,"Source of drinking water","Bottled water","",7.8922468575999316,18.823510231249941,30.746774422905119,39.718250666392187,55.458613515400359,16.278373140956241,30.99946280177242,38.151454830937091,44.925462522346358,58.71393596419847,0.560304060506292,1.9167740670162521,3.0659895701946769,4.618922028383424,16.965611995648491,"Central","East","North","South","West",27.064932671059509,6.2895331675123609,16.489624641189039,15.33725885766318,50.671833774408903]
["TUR",2013,"TUR_2013_DHS",70,"Source of drinking water","Other","",0.28757417836352578,0.20571792032814309,0.24001421694158889,0.034957481552224098,0.0096600994695612008,0.038647413570781101,0.1834973997533432,0.091125929357153093,0.0575193407477049,0,0.58066304234685218,0.62078726976466703,0.61691551318874926,0.3616122515928229,0,"Central","East","North","South","West",0,0.54423858975813544,0.1154585016487867,0.13960496697911359,0.0619319638340593]
["TUR",2013,"TUR_2013_DHS",122,"Sanitation","Improved","s_imp",88.648065481816516,96.928473549091606,98.324409005850313,99.708078368777535,99.491724369158675,99.026614578843279,98.484092433482402,99.918413775514139,99.799375971602345,99.875412121969347,76.324733789313782,80.393757123603649,90.239629075052548,91.294491665562902,96.604716041949118,"Central","East","North","South","West",97.471285607496355,92.224883729631401,94.653204303471199,97.739999174117898,98.27299482688943,7773.0193609999969,8506.6745519999949,8614.8386839999785,8744.7799729999824,8724.2838589999792,6732.3028390000172,6695.5830479999868,6783.8140929999872,6788.1041289999839,6785.7371670000066,1508.441110999999,1581.6833870000009,1781.4320520000019,1801.2060549999981,1905.2925479999999,8519.9250240000183,7740.1778719999947,3082.9717939999982,5342.9279859999888,17677.59375299999]
["TUR",2013,"TUR_2013_DHS",123,"Sanitation","Not Improved","",11.351934518183519,3.0715264509084772,1.675590994149577,0.29192163122248938,0.50827563084132577,0.97338542115667748,1.5159075665175921,0.081586224485856104,0.2006240283976661,0.1245878780306528,23.67526621068609,19.606242876396351,9.7603709249474804,8.705508334437063,3.3952839580508711,"Central","East","North","South","West",2.5287143925036419,7.7751162703684802,5.3467956965285852,2.2600008258821171,1.7270051731106,995.38333199999988,269.564504,146.80938599999999,25.602644000000002,44.569946999999999,66.175396000000006,103.061162,5.5391769999999996,13.645944999999999,8.4647520000000007,467.90526600000021,385.73727300000019,192.68073000000001,171.75641200000001,66.963700000000003,221.033886,652.54387399999996,174.15174099999999,123.54227299999999,310.65803899999997]
["TUR",2013,"TUR_2013_DHS",124,"Sanitation ladder","Basic","s_bas",85.823263877041185,96.325233706197253,98.179631677068841,99.600941600859571,99.437036947869132,97.485125622670353,98.128266584036012,99.918272528021944,99.750218431880995,99.807806652232173,71.602663453563167,77.596721921563301,89.663701510283261,90.280231418725279,96.194155598385478,"Central","East","North","South","West",96.726880269453517,90.542674528629192,94.647533706231513,97.064482616193175,97.798137883981468,7495.422349999998,8420.0134319999943,8592.4688849999748,8716.1351789999808,8665.2580929999749,6588.8874900000146,6654.0075089999882,6772.080227999988,6773.5719749999844,6726.7114010000078,1415.1166450000001,1522.273772,1764.3674230000011,1775.086251999998,1897.1952439999991,8429.3172360000208,7546.1143339999944,3079.5210789999978,5299.0413809999882,17535.30390899998]
["TUR",2013,"TUR_2013_DHS",125,"Sanitation ladder","Limited","s_lim",2.77950693799579,0.59093940250441579,0.1428887024485942,0.10649209566964971,0.051506449333996798,1.535783931183559,0.35186540176085912,0,0.048826149104754198,0.066597305272307894,4.7220703357506588,2.740620507691153,0.54442224200874778,0.98430087904951835,0.41056044356361948,"Central","East","North","South","West",0.73674369580610732,1.627724038878946,0,0.67254830170643687,0.46925583268532101,242.7497800000001,51.655391999999999,12.50531,9.3191839999999999,4.488435,103.801554,23.859741,0,3.3155559999999999,4.488435,93.324465999999973,53.764831999999998,10.712929000000001,19.353283999999999,8.0973039999999994,64.203935000000001,135.659696,0,36.716430000000003,84.13803999999999]
["TUR",2013,"TUR_2013_DHS",126,"Sanitation ladder","Unimproved","s_unimp",11.39722918496307,3.0838268912983802,1.677479620482405,0.29256630347077411,0.51145660279683747,0.97909044614600693,1.5198680142031289,0.081727471978046404,0.20095541901426939,0.12559604249552,23.67526621068609,19.66265757074553,9.7918762477079948,8.7354677022251757,3.3952839580508711,"Central","East","North","South","West",2.5363760347403281,7.8296014324917422,5.3524662937682743,2.2629690821003829,1.7326062833331271,995.38333199999988,269.564504,146.80938599999999,25.602644000000002,44.569946999999999,66.175396000000006,103.061162,5.5391769999999996,13.645944999999999,8.4647520000000007,467.90526600000021,385.73727300000019,192.68073000000001,171.75641200000001,66.963700000000003,221.033886,652.54387399999996,174.15174099999999,123.54227299999999,310.65803899999997]
["TUR",2013,"TUR_2013_DHS",127,"Sanitation ladder","Open defecation","s_od",0,0,0,0,0,0,0,0,0,0,0,0,0,0,0,"Central","East","North","South","West",0,0,0,0,0,5197.9558660000057,7154.4577179999924,7964.8754909999834,8308.8557729999866,8454.5157669999808,6237.1085950000179,6503.9647099999893,6649.8142059999864,6665.3098429999827,6731.3051180000066,506.96660600000001,697.28687699999978,877.66109099999994,938.64805100000058,1272.595517999998,7810.6380399999834,6044.8462259999951,2215.1841199999949,4182.7903200000101,16827.20190900001]
["TUR",2013,"TUR_2013_DHS",128,"Shared among Improved Sanitation","Yes","s_shared",3.1370429078320359,0.6097428154139094,0.145326525293549,0.1068045698516023,0.051771236742666801,1.5509693236541131,0.35729582674767962,0,0.048924465469338603,0.066681054037272994,6.1868153366711063,3.4113905499233552,0.6035179752809291,1.0785141327826839,0.4249900629958272,"Central","East","North","South","West",0.75591658285630292,1.7659943584672211,0,0.68812025021650802,0.47752953949131949]
["TUR",2013,"TUR_2013_DHS",129,"Shared among Improved Sanitation","No","",96.862957092167989,99.39025718458609,99.854673474706445,99.893195430148367,99.948228763257291,98.449030676345856,99.642704173252312,100,99.951075534530659,99.933318945962725,93.813184663328954,96.588609450076618,99.396482024719049,98.921485867217314,99.575009937004154,"Central","East","North","South","West",99.244083417143699,98.234005641532761,100,99.311879749783472,99.522470460508629]
["TUR",2013,"TUR_2013_DHS",139,"Shared among Improved Sanitation","Open defecation","",0,0,0,0,0,0,0,0,0,0,0,0,0,0,0,"Central","East","North","South","West",0,0,0,0,0]
["TUR",2013,"TUR_2013_DHS",148,"Shared among improved sanitation facilities","Yes","",2.7684606706509101,0.58858232632901142,0.1427278281447798,0.1062574394637727,0.051186108233767597,1.526835130038475,0.35094851654253639,0,0.048745631108585902,0.0660627260347985,4.7220703357506588,2.7327573148489752,0.5426705656171571,0.98092509734499722,0.41056044356361948,"Central","East","North","South","West",0.73451821088585645,1.616396922305398,0,0.67166614397197399,0.46773883850913828]
["TUR",2013,"TUR_2013_DHS",149,"Shared among improved sanitation facilities","No","",85.482186578677073,95.941021869083485,98.069094037464424,99.381470109469902,98.81859459295444,96.917093241234667,97.872565521413009,99.745586342128874,99.585722811137813,99.006645389633448,71.602663453563167,77.374086942850312,89.375208908403721,89.970604189907235,96.194155598385478,"Central","East","North","South","West",96.434696957064205,89.912600016752535,94.547260670602512,96.937166579762419,97.481979415023261]
["TUR",2013,"TUR_2013_DHS",150,"Shared among improved sanitation facilities","DK/missing","",11.74935275067209,3.4703958045875778,1.788178134390648,0.51227245106631691,1.130219298811745,1.5560716287267731,1.7764859620444859,0.25441365787112791,0.36553155775361801,0.92729188433176357,23.67526621068609,19.893155742300682,10.082120525979141,9.0484707127477311,3.3952839580508711,"Central","East","North","South","West",2.83078483204996,8.4710030609419391,5.4527393293972706,2.3911672762656169,2.0502817464675638]
["TUR",2013,"TUR_2013_DHS",151,"Shared among all sanitation facilities","Yes","",3.4829060847757121,0.80565444712998191,0.16498562695636801,0.1062574394637727,0.051198676904003898,1.5508332535257809,0.35094851654253639,0,0.048745631108585902,0.066083663740278395,7.5472239535420051,3.2910221298472582,0.73784113580536659,1.7699607865880409,0.41056044356361948,"Central","East","North","South","West",0.91706208466777739,2.156938292589341,0,0.8607737111320769,0.52423536279115479]
["TUR",2013,"TUR_2013_DHS",152,"Shared among all sanitation facilities","No","",96.066715730324731,98.79531541452198,99.670470877518355,99.673391740692423,99.254335127469687,97.866186086636816,99.388473087930564,99.760122984438553,99.693070183807535,99.130957923562164,92.236158680453642,96.418859908033497,98.939831869384079,97.887076835101297,99.589439556436389,"Central","East","North","South","West",98.728788143908659,97.087593730607082,99.894056367131313,99.007913059281776,99.117106742499331]
["TUR",2013,"TUR_2013_DHS",153,"Type of toilet facility","Flush toilet","",60.189369250859308,81.553631823320089,90.981906732843868,94.737665799147706,96.50880718571689,91.789077117965647,95.70425226151508,98.010452623977201,98.085533180759583,99.105657974578534,27.123337299120941,35.837595133015562,44.538290839332099,47.57556551125213,64.524856711215662,"Central","East","North","South","West",89.403324831051293,73.12611730499421,68.010442225980611,76.641357210745426,93.607596274534316,5197.9558660000057,7154.4577179999924,7964.8754909999834,8308.8557729999866,8454.5157669999808,6237.1085950000179,6503.9647099999893,6649.8142059999864,6665.3098429999827,6731.3051180000066,506.96660600000001,697.28687699999978,877.66109099999994,938.64805100000058,1272.595517999998,7810.6380399999834,6044.8462259999951,2215.1841199999949,4182.7903200000101,16827.20190900001]
["TUR",2013,"TUR_2013_DHS",154,"Type of toilet facility","Open pit","",9.7014429331930518,2.808303842716426,1.51221459496074,0.27556202568807558,0.41177378033824769,0.9043945541045002,1.402084291152043,0.014546395607149499,0.10744759619411411,0.092933689818909898,18.7206231463813,18.034126356717621,9.1041949583874402,8.3848011691547359,3.033881933986907,"Central","East","North","South","West",2.3823153922988962,6.0568991145824507,4.7884627133124598,2.0760166473497259,1.661781436698192,837.81692399999986,246.364149,132.38457399999999,24.167843999999999,36.072851999999997,61.454012000000013,95.284237999999988,0.98694400000000004,7.3014999999999999,6.3121020000000003,349.91014100000001,350.88737400000019,179.405126,165.42898,59.835926000000001,208.128761,500.68327299999999,155.96614600000001,113.300999,298.72716400000002]
["TUR",2013,"TUR_2013_DHS",155,"Type of toilet facility","Closed pit","",29.817769050092799,15.413913698571619,7.4244588847782564,4.97041256962987,3.0794190339448679,7.287579165661227,2.8196170452290619,1.975000980415637,1.8070192230462989,0.80140833560257785,53.580118441933791,45.454238575082158,45.863277210224084,43.718926154310893,32.079859330733377,"Central","East","North","South","West",8.1187496212522881,20.508879164375479,26.642762077490531,21.2572274656948,4.7306222887676368,2575.063494999999,1352.2168340000001,649.96319300000005,435.92420000000021,269.76809200000002,495.19424400000003,191.61833800000011,133.999887,122.794286,54.432049000000013,1001.474505,884.39651000000026,903.77096100000074,862.55800399999976,632.69703000000004,709.28698399999882,1695.3316460000019,867.78767400000015,1160.137666000001,850.39184400000022]
["TUR",2013,"TUR_2013_DHS",156,"Type of toilet facility","Other","",0.29141876585490889,0.2241506353919252,0.081419787417087594,0.016359605534413901,0,0.018949162268578498,0.074046402103858294,0,0,0,0.57592111256386802,0.67403993518463123,0.49423699205635879,0.32070716528232879,0.36140202406396438,"Central","East","North","South","West",0.095610155397073196,0.30810441604779593,0.55833298321612401,0.025398676210468301,0,25.166934000000001,19.664069000000001,7.1277739999999996,1.4348000000000001,0,1.287604,5.0321189999999998,0,0,0,10.764633,13.114697,9.739317999999999,6.3274319999999999,7.1277739999999996,8.3528920000000006,25.468927999999998,18.185594999999999,1.3861619999999999,0]