{"text_format":"1","workbook":"xlsx","n_sheets":8,"sheets":["Introduction","Water","Sanitation","Hygiene","MICS00","MICS06","MICS11","data_summary"],"not_rendered":{"charts":123,"images":76,"macros":1,"external_links":0,"defined_names":0,"comments":0,"pivot_tables":0},"unopened":[],"bounds":{"document_bytes":16777216,"sheet_cells":100000,"rows_first":2000,"rows_last":500,"rows_between":2000,"halvings":0,"cell_chars":16384,"cell_head_chars":4096},"cells_cut":0,"cells_raw":0,"read":"whole","date_system":"1900"}

{"sheet":"Introduction","index":0,"n_rows":55,"n_cols":12,"rows_kept":55,"cut":false,"hidden":false,"merged":[[112,0,112,1],[113,0,113,1],[207,0,207,1],[212,0,212,1],[213,0,213,1],[107,0,107,1],[1,0,1,1],[4,0,4,1],[5,0,5,1],[6,0,6,1],[7,0,7,1]]}
[]
[]
[]
[null,null,"Joint Monitoring Programme for Water Supply, Sanitation and Hygiene"]
[]
[null,null,"Estimates on household water, sanitation and hygiene \nby wealth quintile and sub-national region in"]
[null,null,{"$f":"+Water!B5","v":"Trinidad and Tobago"}]
[]
[null,null,"Updated May 2021"]
[]
[null,null,"Follow the links below to find the following information: "]
[]
[null,null,"JMP Estimates"]
[null,null,"WASH status and trends by wealth quintile \n(customized quintiles made without water and sanitation assets)"]
[null,null,"Water"]
[null,null,"Sanitation"]
[null,null,"Hygiene"]
[]
[null,null,"Data inputs"]
[null,null," customized wealth quintiles and subnational data:"]
[null,null,{"$f":"IF(INDIRECT(CONCATENATE(\"Water\",\"!B105\"))=0,\"\",INDIRECT(CONCATENATE(\"Water\",\"!B105\")))","v":"MICS00"}]
[null,null,{"$f":"IF(INDIRECT(CONCATENATE(\"Water\",\"!B106\"))=0,\"\",INDIRECT(CONCATENATE(\"Water\",\"!B106\")))","v":"MICS06"}]
[null,null,{"$f":"IF(INDIRECT(CONCATENATE(\"Water\",\"!B107\"))=0,\"\",INDIRECT(CONCATENATE(\"Water\",\"!B107\")))","v":"MICS11"}]
[null,null,{"$f":"IF(INDIRECT(CONCATENATE(\"Water\",\"!B108\"))=0,\"\",INDIRECT(CONCATENATE(\"Water\",\"!B108\")))","v":""}]
[null,null,{"$f":"IF(INDIRECT(CONCATENATE(\"Water\",\"!B109\"))=0,\"\",INDIRECT(CONCATENATE(\"Water\",\"!B109\")))","v":""}]
[null,null,{"$f":"IF(INDIRECT(CONCATENATE(\"Water\",\"!B110\"))=0,\"\",INDIRECT(CONCATENATE(\"Water\",\"!B110\")))","v":""}]
[null,null,{"$f":"IF(INDIRECT(CONCATENATE(\"Water\",\"!B111\"))=0,\"\",INDIRECT(CONCATENATE(\"Water\",\"!B111\")))","v":""}]
[null,null,{"$f":"IF(INDIRECT(CONCATENATE(\"Water\",\"!B112\"))=0,\"\",INDIRECT(CONCATENATE(\"Water\",\"!B112\")))","v":""}]
[null,null,{"$f":"IF(INDIRECT(CONCATENATE(\"Water\",\"!B113\"))=0,\"\",INDIRECT(CONCATENATE(\"Water\",\"!B113\")))","v":""}]
[null,null,{"$f":"IF(INDIRECT(CONCATENATE(\"Water\",\"!B114\"))=0,\"\",INDIRECT(CONCATENATE(\"Water\",\"!B114\")))","v":""}]
[null,null,{"$f":"IF(INDIRECT(CONCATENATE(\"Water\",\"!B115\"))=0,\"\",INDIRECT(CONCATENATE(\"Water\",\"!B115\")))","v":""}]
[null,null,{"$f":"IF(INDIRECT(CONCATENATE(\"Water\",\"!B116\"))=0,\"\",INDIRECT(CONCATENATE(\"Water\",\"!B116\")))","v":""}]
[]
[]
[]
[]
[]
[]
[]
[]
[]
[]
[]
[]
[]
[]
[]
[]
[]
[]
[]
[]
[]
[]
[null,null,null,null,null,null,null,null,null,null,null,{"$f":"+IF(ISNUMBER(M48), \"\", \"Insufficient data to estimate safely managed sanitation services at national level\")","v":"Insufficient data to estimate safely managed sanitation services at national level"}]

{"sheet":"Water","index":1,"n_rows":318,"n_cols":28,"rows_kept":318,"cut":false,"hidden":false,"merged":[[317,1,317,11],[6,9,6,16],[6,17,6,24],[6,1,6,8],[4,1,4,24],[117,1,117,11],[30,21,30,24],[32,1,33,2],[32,3,33,3],[30,17,30,20],[30,1,31,4],[30,5,30,8],[30,9,30,12],[30,13,30,16],[96,23,96,27],[35,1,36,2],[35,3,36,3],[38,1,39,2],[38,3,39,3],[96,0,97,2],[96,3,96,7],[96,8,96,12],[96,13,96,17],[96,18,96,22],[217,18,217,22],[98,0,99,1],[100,0,101,1],[196,0,197,2],[196,3,196,7],[196,8,196,12],[217,1,217,11],[3,1,3,24],[317,18,317,22],[117,18,117,22],[196,18,196,22],[296,23,296,27],[298,0,299,1],[300,0,301,1],[296,0,297,2],[296,3,296,7],[296,8,296,12],[296,13,296,17],[296,18,296,22],[196,23,196,27],[198,0,199,1],[200,0,201,1],[196,13,196,17]]}
["BGD"]
[]
[]
[null,"Summary of trends in use of drinking water by wealth quintile (%)"]
[null,{"$f":"IF(ISERROR(INDIRECT(CONCATENATE($B105,\"!A2\"))),\"\",INDIRECT(CONCATENATE($B105,\"!A2\")))","v":"Trinidad and Tobago"}]
[]
[null,{"$f":"B118","v":"National use of drinking water sources, 2000–2017"},null,null,null,null,null,null,null,{"$f":"B218","v":"Urban use of drinking water sources,  2007–2015"},null,null,null,null,null,null,null,{"$f":"B318","v":"Rural use of drinking water sources, 2007–2015"}]
[]
[]
[]
[]
[]
[]
[]
[]
[]
[]
[]
[]
[]
[]
[]
[]
[]
[]
[]
[]
[]
[]
[]
[null,{"$f":"IF(ISERROR(INDIRECT(CONCATENATE($B105,\"!A2\"))),\"\",INDIRECT(CONCATENATE($B105,\"!A2\")))","v":"Trinidad and Tobago"},null,null,null,"Poorest",null,null,null,"Poor",null,null,null,"Middle",null,null,null,"Rich",null,null,null,"Richest"]
[null,null,null,null,null,"Basic","Limited","Unimproved","Surface \n water","Basic","Limited","Unimproved","Surface \nwater","Basic","Limited","Unimproved","Surface \nwater","Basic","Limited","Unimproved","Surface \nwater","Basic","Limited","Unimproved","Surface \nwater"]
[null,"NATIONAL",null,"Estimate",{"$f":"C99","v":2000},{"$f":"E99","v":89.340319957009029},{"$f":"F99","v":1.6992747345103374},7.1882152282916536,1.7721900801889774,{"$f":"J99","v":94.42241506141491},{"$f":"K99","v":0.51486994012905318},3.6509462206088159,1.4117687778472146,{"$f":"O99","v":95.049694838134158},{"$f":"P99","v":0.61252883605985087},3.7245532227527889,0.61322310305320116,{"$f":"T99","v":97.872995648085748},{"$f":"U99","v":0.22717754291897663},1.6958936263386875,0.20393318265659133,{"$f":"Y99","v":98.925373432069577},{"$f":"Z99","v":2.1704126382966954E-2},0.95099919575716285,0.10192324579028877]
[null,null,null,null,{"$f":"C100","v":2017},{"$f":"E100","v":97.984602668184976},1.8636911057090773,0.15170622610594364,0,{"$f":"J100","v":99.45767362093757},0.54232637906243042,0,0,{"$f":"O100","v":99.359696218074546},0.64030378192545356,0,0,{"$f":"T100","v":99.768422893121041},0.23157710687895872,0,0,{"$f":"Y100","v":99.936508224092591},2.1925968328616544E-2,0,4.1565807578793863E-2]
[]
[null,"URBAN",null,"Estimate",{"$f":"C199","v":2007},{"$f":"E199","v":98.126027257321439},{"$f":"F199","v":0.98033756002950279},0.89363518264906361,0,{"$f":"J199","v":98.787991839922086},{"$f":"K199","v":5.1710504514250244E-2},1.0310384789803209,0.12925917658334207,{"$f":"O199","v":99.758815167412735},{"$f":"P199","v":0},0.18583211932873667,5.5352713258525033E-2,{"$f":"T199","v":99.897052806390533},{"$f":"U199","v":0.10294719360946658},0,0,{"$f":"Y199","v":99.681577732755613},{"$f":"Z199","v":0},0.15910734653891723,0.15931492070546685]
[null,null,null,null,{"$f":"C200","v":2015},{"$f":"E200","v":98.126027257321439},0.98033756002950279,0.89363518264906361,0,{"$f":"J200","v":98.787991839922086},5.1710504514250244E-2,1.0310384789803209,0.12925917658334207,{"$f":"O200","v":99.758815167412735},0,0.18583211932873667,5.5352713258525033E-2,{"$f":"T200","v":99.897052806390533},0.10294719360946658,0,0,{"$f":"Y200","v":99.681577732755613},0,0.15910734653891723,0.15931492070546685]
[]
[null,"RURAL",null,"Estimate",{"$f":"C299","v":2007},{"$f":"E299","v":97.466816439379159},{"$f":"F299","v":2.3842166019561874E-2},1.8582647195033104,0.65107667509796807,{"$f":"J299","v":100},{"$f":"K299","v":0},0,0,{"$f":"O299","v":99.155681311186356},{"$f":"P299","v":0},0.8443186888136438,0,{"$f":"T299","v":99.465531128894511},{"$f":"U299","v":0.26529724153120871},0.26917162957427365,0,{"$f":"Y299","v":99.458522558506957},{"$f":"Z299","v":0.2773738030892331},0.26410363840381024,0]
[null,null,null,null,{"$f":"C300","v":2015},{"$f":"E300","v":97.466816439379159},2.3842166019561874E-2,1.8582647195033104,0.65107667509796807,{"$f":"J300","v":100},0,0,0,{"$f":"O300","v":99.155681311186356},0,0.8443186888136438,0,{"$f":"T300","v":99.465531128894511},0.26529724153120871,0.26917162957427365,0,{"$f":"Y300","v":99.458522558506957},0.2773738030892331,0.26410363840381024,0]
[]
[]
[]
[]
[]
[]
[]
[]
[]
[]
[]
[]
[]
[]
[]
[]
[]
[]
[]
[]
[]
[]
[]
[]
[]
[]
[]
[]
[]
[]
[]
[]
[]
[]
[]
[]
[]
[]
[]
[]
[]
[]
[]
[]
[]
[]
[]
[]
[]
[]
[]
[]
[]
[]
[]
[]
["NATIONAL",null,null,"Poorest",null,null,null,null,"Poor",null,null,null,null,"Middle",null,null,null,null,"Rich",null,null,null,null,"Richest"]
[null,null,null,"Improved","Basic","Limited","Unimproved","Surface water","Improved","Basic","Limited","Unimproved","Surface water","Improved","Basic","Limited","Unimproved","Surface water","Improved","Basic","Limited","Unimproved","Surface water","Improved","Basic","Limited","Unimproved","Surface water"]
["Forecast period:",null,2000,{"$f":"IF((D101+H101)>100,D101*100/(D101+H101),D101)","v":91.039594691519369},{"$f":"D99*AVERAGEIF(E105:E116,\">0\")/100","v":89.340319957009029},{"$f":"D99*(100-AVERAGEIF(E105:E116,\">0\"))/100","v":1.6992747345103374},{"$f":"100-(E99+F99+H99)","v":7.1882152282916536},{"$f":"IF((D101+H101)>100,H101*100/(D101+H101),H101)","v":1.7721900801889774},{"$f":"IF((I101+M101)>100,I101*100/(I101+M101),I101)","v":94.937285001543955},{"$f":"I99*AVERAGEIF(J105:J116,\">0\")/100","v":94.42241506141491},{"$f":"I99*(100-AVERAGEIF(J105:J116,\">0\"))/100","v":0.51486994012905318},{"$f":"100-(J99+K99+M99)","v":3.6509462206088159},{"$f":"IF((I101+M101)>100,M101*100/(I101+M101),M101)","v":1.4117687778472146},{"$f":"IF((N101+R101)>100,N101*100/(N101+R101),N101)","v":95.662223674194024},{"$f":"N99*AVERAGEIF(O105:O116,\">0\")/100","v":95.049694838134158},{"$f":"N99*(100-AVERAGEIF(O105:O116,\">0\"))/100","v":0.61252883605985087},{"$f":"100-(O99+P99+R99)","v":3.7245532227527889},{"$f":"IF((N101+R101)>100,R101*100/(N101+R101),R101)","v":0.61322310305320116},{"$f":"IF((S101+W101)>100,S101*100/(S101+W101),S101)","v":98.100173191004728},{"$f":"S99*AVERAGEIF(T105:T116,\">0\")/100","v":97.872995648085748},{"$f":"S99*(100-AVERAGEIF(T105:T116,\">0\"))/100","v":0.22717754291897663},{"$f":"100-(T99+U99+W99)","v":1.6958936263386875},{"$f":"IF((S101+W101)>100,W101*100/(S101+W101),W101)","v":0.20393318265659133},{"$f":"IF((X101+AB101)>100,X101*100/(X101+AB101),X101)","v":98.947077558452534},{"$f":"X99*AVERAGEIF(Y105:Y116,\">0\")/100","v":98.925373432069577},{"$f":"X99*(100-AVERAGEIF(Y105:Y116,\">0\"))/100","v":2.1704126382966954E-2},{"$f":"100-(Y99+Z99+AB99)","v":0.95099919575716285},{"$f":"IF((X101+AB101)>100,AB101*100/(X101+AB101),AB101)","v":0.10192324579028877}]
[null,null,2017,{"$f":"IF((D102+H102)>100,D102*100/(D102+H102),D102)","v":99.848293773894056},{"$f":"D100*AVERAGEIF(E105:E116,\">0\")/100","v":97.984602668184976},{"$f":"D100*(100-AVERAGEIF(E105:E116,\">0\"))/100","v":1.8636911057090773},{"$f":"100-(E100+F100+H100)","v":0.15170622610594364},{"$f":"IF((D102+H102)>100,H102*100/(D102+H102),H102)","v":0},{"$f":"IF((I102+M102)>100,I102*100/(I102+M102),I102)","v":100},{"$f":"I100*AVERAGEIF(J105:J116,\">0\")/100","v":99.45767362093757},{"$f":"I100*(100-AVERAGEIF(J105:J116,\">0\"))/100","v":0.54232637906243042},{"$f":"100-(J100+K100+M100)","v":0},{"$f":"IF((I102+M102)>100,M102*100/(I102+M102),M102)","v":0},{"$f":"IF((N102+R102)>100,N102*100/(N102+R102),N102)","v":100},{"$f":"N100*AVERAGEIF(O105:O116,\">0\")/100","v":99.359696218074546},{"$f":"N100*(100-AVERAGEIF(O105:O116,\">0\"))/100","v":0.64030378192545356},{"$f":"100-(O100+P100+R100)","v":0},{"$f":"IF((N102+R102)>100,R102*100/(N102+R102),R102)","v":0},{"$f":"IF((S102+W102)>100,S102*100/(S102+W102),S102)","v":100},{"$f":"S100*AVERAGEIF(T105:T116,\">0\")/100","v":99.768422893121041},{"$f":"S100*(100-AVERAGEIF(T105:T116,\">0\"))/100","v":0.23157710687895872},{"$f":"100-(T100+U100+W100)","v":0},{"$f":"IF((S102+W102)>100,W102*100/(S102+W102),W102)","v":0},{"$f":"IF((X102+AB102)>100,X102*100/(X102+AB102),X102)","v":99.958434192421208},{"$f":"X100*AVERAGEIF(Y105:Y116,\">0\")/100","v":99.936508224092591},{"$f":"X100*(100-AVERAGEIF(Y105:Y116,\">0\"))/100","v":2.1925968328616544E-2},{"$f":"100-(Y100+Z100+AB100)","v":0},{"$f":"IF((X102+AB102)>100,AB102*100/(X102+AB102),AB102)","v":4.1565807578793863E-2}]
["Regression period:",null,{"$f":"MinRegYear(C99,C105:C116)","v":2000},{"$f":"IF(MAX(C105:C116)-MIN(C105:C116)<5,AVERAGEIF(C105:C116,\">0\",D105:D116),\nIF(FORECAST($C101,D$105:D$116,$C$105:$C$116)<0,0,\nIF(FORECAST($C101,D$105:D$116,$C$105:$C$116)>100,100,\nFORECAST($C101,D$105:D$116,$C$105:$C$116))))","v":91.039594691519369},null,null,null,{"$f":"IF(MAX(C105:C116)-MIN(C105:C116)<5,AVERAGEIF(C105:C116,\">0\",H105:H116),\nIF(FORECAST($C101,H$105:H$116,$C$105:$C$116)<0,0,\nIF(FORECAST($C101,H$105:H$116,$C$105:$C$116)>100,100,\nFORECAST($C101,H$105:H$116,$C$105:$C$116))))","v":1.7721900801889774},{"$f":"IF(MAX(C105:C116)-MIN(C105:C116)<5,AVERAGEIF(C105:C116,\">0\",I105:I116),\nIF(FORECAST($C101,I$105:I$116,$C$105:$C$116)<0,0,\nIF(FORECAST($C101,I$105:I$116,$C$105:$C$116)>100,100,\nFORECAST($C101,I$105:I$116,$C$105:$C$116))))","v":94.937285001543955},null,null,null,{"$f":"IF(MAX(C105:C116)-MIN(C105:C116)<5,AVERAGEIF(C105:C116,\">0\",M105:M116),\nIF(FORECAST($C101,M$105:M$116,$C$105:$C$116)<0,0,\nIF(FORECAST($C101,M$105:M$116,$C$105:$C$116)>100,100,\nFORECAST($C101,M$105:M$116,$C$105:$C$116))))","v":1.4117687778472146},{"$f":"IF(MAX(C105:C116)-MIN(C105:C116)<5,AVERAGEIF(C105:C116,\">0\",N105:N116),\nIF(FORECAST($C101,N$105:N$116,$C$105:$C$116)<0,0,\nIF(FORECAST($C101,N$105:N$116,$C$105:$C$116)>100,100,\nFORECAST($C101,N$105:N$116,$C$105:$C$116))))","v":95.662223674194024},null,null,null,{"$f":"IF(MAX(C105:C116)-MIN(C105:C116)<5,AVERAGEIF(C105:C116,\">0\",R105:R116),\nIF(FORECAST($C101,R$105:R$116,$C$105:$C$116)<0,0,\nIF(FORECAST($C101,R$105:R$116,$C$105:$C$116)>100,100,\nFORECAST($C101,R$105:R$116,$C$105:$C$116))))","v":0.61322310305320116},{"$f":"IF(MAX(C105:C116)-MIN(C105:C116)<5,AVERAGEIF(C105:C116,\">0\",S105:S116),\nIF(FORECAST($C101,S$105:S$116,$C$105:$C$116)<0,0,\nIF(FORECAST($C101,S$105:S$116,$C$105:$C$116)>100,100,\nFORECAST($C101,S$105:S$116,$C$105:$C$116))))","v":98.100173191004728},null,null,null,{"$f":"IF(MAX(C105:C116)-MIN(C105:C116)<5,AVERAGEIF(C105:C116,\">0\",W105:W116),\nIF(FORECAST($C101,W$105:W$116,$C$105:$C$116)<0,0,\nIF(FORECAST($C101,W$105:W$116,$C$105:$C$116)>100,100,\nFORECAST($C101,W$105:W$116,$C$105:$C$116))))","v":0.20393318265659133},{"$f":"IF(MAX(C105:C116)-MIN(C105:C116)<5,AVERAGEIF(C105:C116,\">0\",X105:X116),\nIF(FORECAST($C101,X$105:X$116,$C$105:$C$116)<0,0,\nIF(FORECAST($C101,X$105:X$116,$C$105:$C$116)>100,100,\nFORECAST($C101,X$105:X$116,$C$105:$C$116))))","v":98.947077558452534},null,null,null,{"$f":"IF(MAX(C105:C116)-MIN(C105:C116)<5,AVERAGEIF(C105:C116,\">0\",AB105:AB116),\nIF(FORECAST($C101,AB$105:AB$116,$C$105:$C$116)<0,0,\nIF(FORECAST($C101,AB$105:AB$116,$C$105:$C$116)>100,100,\nFORECAST($C101,AB$105:AB$116,$C$105:$C$116))))","v":0.10192324579028877}]
[null,null,{"$f":"MaxRegYear(C100,C105:C116)","v":2013},{"$f":"IF(MAX(C105:C116)-MIN(C105:C116)<5,AVERAGEIF(C105:C116,\">0\",D105:D116),\nIF(FORECAST($C102,D$105:D$116,$C$105:$C$116)<0,0,\nIF(FORECAST($C102,D$105:D$116,$C$105:$C$116)>100,100,\nFORECAST($C102,D$105:D$116,$C$105:$C$116))))","v":99.848293773894056},null,null,null,{"$f":"IF(MAX(C105:C116)-MIN(C105:C116)<5,AVERAGEIF(C105:C116,\">0\",H105:H116),\nIF(FORECAST($C102,H$105:H$116,$C$105:$C$116)<0,0,\nIF(FORECAST($C102,H$105:H$116,$C$105:$C$116)>100,100,\nFORECAST($C102,H$105:H$116,$C$105:$C$116))))","v":0},{"$f":"IF(MAX(C105:C116)-MIN(C105:C116)<5,AVERAGEIF(C105:C116,\">0\",I105:I116),\nIF(FORECAST($C102,I$105:I$116,$C$105:$C$116)<0,0,\nIF(FORECAST($C102,I$105:I$116,$C$105:$C$116)>100,100,\nFORECAST($C102,I$105:I$116,$C$105:$C$116))))","v":100},null,null,null,{"$f":"IF(MAX(C105:C116)-MIN(C105:C116)<5,AVERAGEIF(C105:C116,\">0\",M105:M116),\nIF(FORECAST($C102,M$105:M$116,$C$105:$C$116)<0,0,\nIF(FORECAST($C102,M$105:M$116,$C$105:$C$116)>100,100,\nFORECAST($C102,M$105:M$116,$C$105:$C$116))))","v":0},{"$f":"IF(MAX(C105:C116)-MIN(C105:C116)<5,AVERAGEIF(C105:C116,\">0\",N105:N116),\nIF(FORECAST($C102,N$105:N$116,$C$105:$C$116)<0,0,\nIF(FORECAST($C102,N$105:N$116,$C$105:$C$116)>100,100,\nFORECAST($C102,N$105:N$116,$C$105:$C$116))))","v":100},null,null,null,{"$f":"IF(MAX(C105:C116)-MIN(C105:C116)<5,AVERAGEIF(C105:C116,\">0\",R105:R116),\nIF(FORECAST($C102,R$105:R$116,$C$105:$C$116)<0,0,\nIF(FORECAST($C102,R$105:R$116,$C$105:$C$116)>100,100,\nFORECAST($C102,R$105:R$116,$C$105:$C$116))))","v":0},{"$f":"IF(MAX(C105:C116)-MIN(C105:C116)<5,AVERAGEIF(C105:C116,\">0\",S105:S116),\nIF(FORECAST($C102,S$105:S$116,$C$105:$C$116)<0,0,\nIF(FORECAST($C102,S$105:S$116,$C$105:$C$116)>100,100,\nFORECAST($C102,S$105:S$116,$C$105:$C$116))))","v":100},null,null,null,{"$f":"IF(MAX(C105:C116)-MIN(C105:C116)<5,AVERAGEIF(C105:C116,\">0\",W105:W116),\nIF(FORECAST($C102,W$105:W$116,$C$105:$C$116)<0,0,\nIF(FORECAST($C102,W$105:W$116,$C$105:$C$116)>100,100,\nFORECAST($C102,W$105:W$116,$C$105:$C$116))))","v":0},{"$f":"IF(MAX(C105:C116)-MIN(C105:C116)<5,AVERAGEIF(C105:C116,\">0\",X105:X116),\nIF(FORECAST($C102,X$105:X$116,$C$105:$C$116)<0,0,\nIF(FORECAST($C102,X$105:X$116,$C$105:$C$116)>100,100,\nFORECAST($C102,X$105:X$116,$C$105:$C$116))))","v":100},null,null,null,{"$f":"IF(MAX(C105:C116)-MIN(C105:C116)<5,AVERAGEIF(C105:C116,\">0\",AB105:AB116),\nIF(FORECAST($C102,AB$105:AB$116,$C$105:$C$116)<0,0,\nIF(FORECAST($C102,AB$105:AB$116,$C$105:$C$116)>100,100,\nFORECAST($C102,AB$105:AB$116,$C$105:$C$116))))","v":4.1583091926769455E-2}]
[]
[null,"Survey","Year","Improved","% Improved\n< = 30min",null,null,"Surface water","Improved","% Improved\n< = 30min",null,null,"Surface water","Improved","% Improved\n< = 30min",null,null,"Surface water","Improved","% Improved\n< = 30min",null,null,"Surface water","Improved","% Improved\n< = 30min",null,null,"Surface water"]
[null,"MICS00",2000,{"$f":"IF(ISERROR(INDIRECT(CONCATENATE($B105,\"!C16\"))),\"\",INDIRECT(CONCATENATE($B105,\"!C16\")))","v":90.976933514246952},{"$f":"IF(ISERROR(INDIRECT(CONCATENATE($B105,\"!C23\"))),\"\",INDIRECT(CONCATENATE($B105,\"!C23\")))","v":96.38329604772558},null,null,{"$f":"IF(ISERROR(INDIRECT(CONCATENATE($B105,\"!C21\"))),\"\",INDIRECT(CONCATENATE($B105,\"!C21\")))","v":1.9335142469470827},{"$f":"IF(ISERROR(INDIRECT(CONCATENATE($B105,\"!D16\"))),\"\",INDIRECT(CONCATENATE($B105,\"!D16\")))","v":94.78375701551667},{"$f":"IF(ISERROR(INDIRECT(CONCATENATE($B105,\"!D23\"))),\"\",INDIRECT(CONCATENATE($B105,\"!D23\")))","v":99.024730059212814},null,null,{"$f":"IF(ISERROR(INDIRECT(CONCATENATE($B105,\"!D21\"))),\"\",INDIRECT(CONCATENATE($B105,\"!D21\")))","v":1.6507098052162428},{"$f":"IF(ISERROR(INDIRECT(CONCATENATE($B105,\"!E16\"))),\"\",INDIRECT(CONCATENATE($B105,\"!E16\")))","v":95.389408099688481},{"$f":"IF(ISERROR(INDIRECT(CONCATENATE($B105,\"!E23\"))),\"\",INDIRECT(CONCATENATE($B105,\"!E23\")))","v":98.431372549019599},null,null,{"$f":"IF(ISERROR(INDIRECT(CONCATENATE($B105,\"!E21\"))),\"\",INDIRECT(CONCATENATE($B105,\"!E21\")))","v":0.71695760598503744},{"$f":"IF(ISERROR(INDIRECT(CONCATENATE($B105,\"!F16\"))),\"\",INDIRECT(CONCATENATE($B105,\"!F16\")))","v":98.078219824679707},{"$f":"IF(ISERROR(INDIRECT(CONCATENATE($B105,\"!F23\"))),\"\",INDIRECT(CONCATENATE($B105,\"!F23\")))","v":99.655647382920108},null,null,{"$f":"IF(ISERROR(INDIRECT(CONCATENATE($B105,\"!F21\"))),\"\",INDIRECT(CONCATENATE($B105,\"!F21\")))","v":0.2364066193853428},{"$f":"IF(ISERROR(INDIRECT(CONCATENATE($B105,\"!G16\"))),\"\",INDIRECT(CONCATENATE($B105,\"!G16\")))","v":98.813559322033896},{"$f":"IF(ISERROR(INDIRECT(CONCATENATE($B105,\"!G23\"))),\"\",INDIRECT(CONCATENATE($B105,\"!G23\")))","v":100},null,null,{"$f":"IF(ISERROR(INDIRECT(CONCATENATE($B105,\"!G221\"))),\"\",INDIRECT(CONCATENATE($B105,\"!G21\")))","v":0.13559322033898305}]
[null,"MICS06",2006,95.243002704153099,98.596414876874434,null,null,0.49776873252474513,97.920444968028292,99.378003507708641,null,null,0,98.38359588617611,99.68684509562334,null,null,0,99.080293380524438,99.836170461825532,null,null,0,99.80303017971751,100,null,null,0]
[null,"MICS11",2011,98.417915886955811,99.42072086466203,null,null,0.28001408217187912,99.602948479888738,99.970287295891296,null,null,7.3984061691761499E-2,99.223671222914973,99.960871009580714,null,null,3.185797946553881E-2,99.782170921356538,99.813450834617484,null,null,0,99.817578593513971,99.934194742527424,null,null,9.1270161979590564E-2]
[null,null,null,"","",null,null,"","","",null,null,"","","",null,null,"","","",null,null,"","","",null,null,""]
[null,null,null,"","",null,null,"","","",null,null,"","","",null,null,"","","",null,null,"","","",null,null,""]
[null,null,null,"","",null,null,"","","",null,null,"","","",null,null,"","","",null,null,"","","",null,null,""]
[null,null,null,{"$f":"IF(ISERROR(INDIRECT(CONCATENATE($B111,\"!C16\"))),\"\",INDIRECT(CONCATENATE($B111,\"!C16\")))","v":""},{"$f":"IF(ISERROR(INDIRECT(CONCATENATE($B111,\"!C23\"))),\"\",INDIRECT(CONCATENATE($B111,\"!C23\")))","v":""},null,null,{"$f":"IF(ISERROR(INDIRECT(CONCATENATE($B111,\"!C21\"))),\"\",INDIRECT(CONCATENATE($B111,\"!C21\")))","v":""},{"$f":"IF(ISERROR(INDIRECT(CONCATENATE($B111,\"!D16\"))),\"\",INDIRECT(CONCATENATE($B111,\"!D16\")))","v":""},{"$f":"IF(ISERROR(INDIRECT(CONCATENATE($B111,\"!D23\"))),\"\",INDIRECT(CONCATENATE($B111,\"!D23\")))","v":""},null,null,{"$f":"IF(ISERROR(INDIRECT(CONCATENATE($B111,\"!D21\"))),\"\",INDIRECT(CONCATENATE($B111,\"!D21\")))","v":""},{"$f":"IF(ISERROR(INDIRECT(CONCATENATE($B111,\"!E16\"))),\"\",INDIRECT(CONCATENATE($B111,\"!E16\")))","v":""},{"$f":"IF(ISERROR(INDIRECT(CONCATENATE($B111,\"!E23\"))),\"\",INDIRECT(CONCATENATE($B111,\"!E23\")))","v":""},null,null,{"$f":"IF(ISERROR(INDIRECT(CONCATENATE($B111,\"!E21\"))),\"\",INDIRECT(CONCATENATE($B111,\"!E21\")))","v":""},{"$f":"IF(ISERROR(INDIRECT(CONCATENATE($B111,\"!F16\"))),\"\",INDIRECT(CONCATENATE($B111,\"!F16\")))","v":""},{"$f":"IF(ISERROR(INDIRECT(CONCATENATE($B111,\"!F23\"))),\"\",INDIRECT(CONCATENATE($B111,\"!F23\")))","v":""},null,null,{"$f":"IF(ISERROR(INDIRECT(CONCATENATE($B111,\"!F21\"))),\"\",INDIRECT(CONCATENATE($B111,\"!F21\")))","v":""},{"$f":"IF(ISERROR(INDIRECT(CONCATENATE($B111,\"!G16\"))),\"\",INDIRECT(CONCATENATE($B111,\"!G16\")))","v":""},{"$f":"IF(ISERROR(INDIRECT(CONCATENATE($B111,\"!G23\"))),\"\",INDIRECT(CONCATENATE($B111,\"!G23\")))","v":""},null,null,{"$f":"IF(ISERROR(INDIRECT(CONCATENATE($B111,\"!G221\"))),\"\",INDIRECT(CONCATENATE($B111,\"!G21\")))","v":""}]
[null,null,null,{"$f":"IF(ISERROR(INDIRECT(CONCATENATE($B112,\"!C16\"))),\"\",INDIRECT(CONCATENATE($B112,\"!C16\")))","v":""},{"$f":"IF(ISERROR(INDIRECT(CONCATENATE($B112,\"!C23\"))),\"\",INDIRECT(CONCATENATE($B112,\"!C23\")))","v":""},null,null,{"$f":"IF(ISERROR(INDIRECT(CONCATENATE($B112,\"!C21\"))),\"\",INDIRECT(CONCATENATE($B112,\"!C21\")))","v":""},{"$f":"IF(ISERROR(INDIRECT(CONCATENATE($B112,\"!D16\"))),\"\",INDIRECT(CONCATENATE($B112,\"!D16\")))","v":""},{"$f":"IF(ISERROR(INDIRECT(CONCATENATE($B112,\"!D23\"))),\"\",INDIRECT(CONCATENATE($B112,\"!D23\")))","v":""},null,null,{"$f":"IF(ISERROR(INDIRECT(CONCATENATE($B112,\"!D21\"))),\"\",INDIRECT(CONCATENATE($B112,\"!D21\")))","v":""},{"$f":"IF(ISERROR(INDIRECT(CONCATENATE($B112,\"!E16\"))),\"\",INDIRECT(CONCATENATE($B112,\"!E16\")))","v":""},{"$f":"IF(ISERROR(INDIRECT(CONCATENATE($B112,\"!E23\"))),\"\",INDIRECT(CONCATENATE($B112,\"!E23\")))","v":""},null,null,{"$f":"IF(ISERROR(INDIRECT(CONCATENATE($B112,\"!E21\"))),\"\",INDIRECT(CONCATENATE($B112,\"!E21\")))","v":""},{"$f":"IF(ISERROR(INDIRECT(CONCATENATE($B112,\"!F16\"))),\"\",INDIRECT(CONCATENATE($B112,\"!F16\")))","v":""},{"$f":"IF(ISERROR(INDIRECT(CONCATENATE($B112,\"!F23\"))),\"\",INDIRECT(CONCATENATE($B112,\"!F23\")))","v":""},null,null,{"$f":"IF(ISERROR(INDIRECT(CONCATENATE($B112,\"!F21\"))),\"\",INDIRECT(CONCATENATE($B112,\"!F21\")))","v":""},{"$f":"IF(ISERROR(INDIRECT(CONCATENATE($B112,\"!G16\"))),\"\",INDIRECT(CONCATENATE($B112,\"!G16\")))","v":""},{"$f":"IF(ISERROR(INDIRECT(CONCATENATE($B112,\"!G23\"))),\"\",INDIRECT(CONCATENATE($B112,\"!G23\")))","v":""},null,null,{"$f":"IF(ISERROR(INDIRECT(CONCATENATE($B112,\"!G221\"))),\"\",INDIRECT(CONCATENATE($B112,\"!G21\")))","v":""}]
[null,null,null,"","",null,null,"","","",null,null,"","","",null,null,"","","",null,null,"","","",null,null,""]
[null,null,null,"","",null,null,"","","",null,null,"","","",null,null,"","","",null,null,"","","",null,null,""]
[null,null,null,"","",null,null,"","","",null,null,"","","",null,null,"","","",null,null,"","","",null,null,""]
[null,null,null,"","",null,null,"","","",null,null,"","","",null,null,"","","",null,null,"","","",null,null,""]
[]
[null,{"$f":"CONCATENATE(\"National use of drinking water sources, \",C99,\"–\",C100)","v":"National use of drinking water sources, 2000–2017"},null,null,null,null,null,null,null,null,null,null,null,null,null,null,null,null,"Data points used for regression"]
[]
[]
[]
[]
[]
[]
[]
[]
[]
[]
[]
[]
[]
[]
[]
[]
[]
[]
[]
[]
[]
[]
[]
[]
[]
[]
[]
[]
[]
[]
[]
[]
[]
[]
[null,null,null,null,{"$f":"IF(ISERROR(INDIRECT(CONCATENATE($B153,\"!M18\"))),\"\",INDIRECT(CONCATENATE($B153,\"!M18\")))","v":""},{"$f":"IF(ISERROR(INDIRECT(CONCATENATE($B153,\"!M19\"))),\"\",INDIRECT(CONCATENATE($B153,\"!M19\")))","v":""},{"$f":"IF(ISERROR(INDIRECT(CONCATENATE($B153,\"!M20\"))),\"\",INDIRECT(CONCATENATE($B153,\"!M20\")))","v":""},{"$f":"IF(ISERROR(INDIRECT(CONCATENATE($B153,\"!M21\"))),\"\",INDIRECT(CONCATENATE($B153,\"!M21\")))","v":""},null,{"$f":"IF(ISERROR(INDIRECT(CONCATENATE($B153,\"!N18\"))),\"\",INDIRECT(CONCATENATE($B153,\"!N18\")))","v":""},{"$f":"IF(ISERROR(INDIRECT(CONCATENATE($B153,\"!N19\"))),\"\",INDIRECT(CONCATENATE($B153,\"!N19\")))","v":""},{"$f":"IF(ISERROR(INDIRECT(CONCATENATE($B153,\"!N20\"))),\"\",INDIRECT(CONCATENATE($B153,\"!N20\")))","v":""},{"$f":"IF(ISERROR(INDIRECT(CONCATENATE($B153,\"!N21\"))),\"\",INDIRECT(CONCATENATE($B153,\"!N21\")))","v":""},null,{"$f":"IF(ISERROR(INDIRECT(CONCATENATE($B153,\"!O18\"))),\"\",INDIRECT(CONCATENATE($B153,\"!O18\")))","v":""},{"$f":"IF(ISERROR(INDIRECT(CONCATENATE($B153,\"!O19\"))),\"\",INDIRECT(CONCATENATE($B153,\"!O19\")))","v":""},{"$f":"IF(ISERROR(INDIRECT(CONCATENATE($B153,\"!O20\"))),\"\",INDIRECT(CONCATENATE($B153,\"!O20\")))","v":""},{"$f":"IF(ISERROR(INDIRECT(CONCATENATE($B153,\"!O21\"))),\"\",INDIRECT(CONCATENATE($B153,\"!O21\")))","v":""},null,{"$f":"IF(ISERROR(INDIRECT(CONCATENATE($B153,\"!P18\"))),\"\",INDIRECT(CONCATENATE($B153,\"!P18\")))","v":""},{"$f":"IF(ISERROR(INDIRECT(CONCATENATE($B153,\"!P19\"))),\"\",INDIRECT(CONCATENATE($B153,\"!P19\")))","v":""},{"$f":"IF(ISERROR(INDIRECT(CONCATENATE($B153,\"!P20\"))),\"\",INDIRECT(CONCATENATE($B153,\"!P20\")))","v":""},{"$f":"IF(ISERROR(INDIRECT(CONCATENATE($B153,\"!P21\"))),\"\",INDIRECT(CONCATENATE($B153,\"!P21\")))","v":""},null,{"$f":"IF(ISERROR(INDIRECT(CONCATENATE($B153,\"!Q18\"))),\"\",INDIRECT(CONCATENATE($B153,\"!Q18\")))","v":""},{"$f":"IF(ISERROR(INDIRECT(CONCATENATE($B153,\"!Q19\"))),\"\",INDIRECT(CONCATENATE($B153,\"!Q19\")))","v":""},{"$f":"IF(ISERROR(INDIRECT(CONCATENATE($B153,\"!Q20\"))),\"\",INDIRECT(CONCATENATE($B153,\"!Q20\")))","v":""},{"$f":"IF(ISERROR(INDIRECT(CONCATENATE($B153,\"!Q21\"))),\"\",INDIRECT(CONCATENATE($B153,\"!Q1\")))","v":""}]
[null,null,null,null,"","","","",null,"","","","",null,"","","","",null,"","","","",null,"","","",""]
[null,null,null,null,"","","","",null,"","","","",null,"","","","",null,"","","","",null,"","","",""]
[null,null,null,null,"","","","",null,"","","","",null,"","","","",null,"","","","",null,"","","",""]
[null,null,null,null,"","","","",null,"","","","",null,"","","","",null,"","","","",null,"","","",""]
[null,null,null,null,"","","","",null,"","","","",null,"","","","",null,"","","","",null,"","","",""]
[]
[]
[]
[]
[]
[]
[]
[]
[]
[]
[]
[]
[]
[]
[]
[]
[]
[]
[]
[]
[]
[]
[]
[]
[]
[]
[]
[]
[]
[]
[]
[]
[]
[]
[]
[]
[]
[]
["URBAN",null,null,"Poorest",null,null,null,null,"Poor",null,null,null,null,"Middle",null,null,null,null,"Rich",null,null,null,null,"Richest"]
[null,null,null,"Improved","Basic","Limited","Unimproved","Surface water","Improved","Basic","Limited","Unimproved","Surface water","Improved","Basic","Limited","Unimproved","Surface water","Improved","Basic","Limited","Unimproved","Surface water","Improved","Basic","Limited","Unimproved","Surface water"]
["Forecast period:",null,{"$f":"MinBase(C205:C216)","v":2007},{"$f":"IF((D201+H201)>100,D201*100/(D201+H201),D201)","v":99.106364817350951},{"$f":"D199*AVERAGEIF(E205:E216,\">0\")/100","v":98.126027257321439},{"$f":"D199*(100-AVERAGEIF(E205:E216,\">0\"))/100","v":0.98033756002950279},{"$f":"100-(E199+F199+H199)","v":0.89363518264906361},{"$f":"IF((D201+H201)>100,H201*100/(D201+H201),H201)","v":0},{"$f":"IF((I201+M201)>100,I201*100/(I201+M201),I201)","v":98.839702344436347},{"$f":"I199*AVERAGEIF(J205:J216,\">0\")/100","v":98.787991839922086},{"$f":"I199*(100-AVERAGEIF(J205:J216,\">0\"))/100","v":5.1710504514250244E-2},{"$f":"100-(J199+K199+M199)","v":1.0310384789803209},{"$f":"IF((I201+M201)>100,M201*100/(I201+M201),M201)","v":0.12925917658334207},{"$f":"IF((N201+R201)>100,N201*100/(N201+R201),N201)","v":99.758815167412749},{"$f":"N199*AVERAGEIF(O205:O216,\">0\")/100","v":99.758815167412735},{"$f":"N199*(100-AVERAGEIF(O205:O216,\">0\"))/100","v":0},{"$f":"100-(O199+P199+R199)","v":0.18583211932873667},{"$f":"IF((N201+R201)>100,R201*100/(N201+R201),R201)","v":5.5352713258525033E-2},{"$f":"IF((S201+W201)>100,S201*100/(S201+W201),S201)","v":100},{"$f":"S199*AVERAGEIF(T205:T216,\">0\")/100","v":99.897052806390533},{"$f":"S199*(100-AVERAGEIF(T205:T216,\">0\"))/100","v":0.10294719360946658},{"$f":"100-(T199+U199+W199)","v":0},{"$f":"IF((S201+W201)>100,W201*100/(S201+W201),W201)","v":0},{"$f":"IF((X201+AB201)>100,X201*100/(X201+AB201),X201)","v":99.681577732755613},{"$f":"X199*AVERAGEIF(Y205:Y216,\">0\")/100","v":99.681577732755613},{"$f":"X199*(100-AVERAGEIF(Y205:Y216,\">0\"))/100","v":0},{"$f":"100-(Y199+Z199+AB199)","v":0.15910734653891723},{"$f":"IF((X201+AB201)>100,AB201*100/(X201+AB201),AB201)","v":0.15931492070546685}]
[null,null,{"$f":"MaxTarget(C205:C216)","v":2015},{"$f":"IF((D202+H202)>100,D202*100/(D202+H202),D202)","v":99.106364817350951},{"$f":"D200*AVERAGEIF(E205:E216,\">0\")/100","v":98.126027257321439},{"$f":"D200*(100-AVERAGEIF(E205:E216,\">0\"))/100","v":0.98033756002950279},{"$f":"100-(E200+F200+H200)","v":0.89363518264906361},{"$f":"IF((D202+H202)>100,H202*100/(D202+H202),H202)","v":0},{"$f":"IF((I202+M202)>100,I202*100/(I202+M202),I202)","v":98.839702344436347},{"$f":"I200*AVERAGEIF(J205:J216,\">0\")/100","v":98.787991839922086},{"$f":"I200*(100-AVERAGEIF(J205:J216,\">0\"))/100","v":5.1710504514250244E-2},{"$f":"100-(J200+K200+M200)","v":1.0310384789803209},{"$f":"IF((I202+M202)>100,M202*100/(I202+M202),M202)","v":0.12925917658334207},{"$f":"IF((N202+R202)>100,N202*100/(N202+R202),N202)","v":99.758815167412749},{"$f":"N200*AVERAGEIF(O205:O216,\">0\")/100","v":99.758815167412735},{"$f":"N200*(100-AVERAGEIF(O205:O216,\">0\"))/100","v":0},{"$f":"100-(O200+P200+R200)","v":0.18583211932873667},{"$f":"IF((N202+R202)>100,R202*100/(N202+R202),R202)","v":5.5352713258525033E-2},{"$f":"IF((S202+W202)>100,S202*100/(S202+W202),S202)","v":100},{"$f":"S200*AVERAGEIF(T205:T216,\">0\")/100","v":99.897052806390533},{"$f":"S200*(100-AVERAGEIF(T205:T216,\">0\"))/100","v":0.10294719360946658},{"$f":"100-(T200+U200+W200)","v":0},{"$f":"IF((S202+W202)>100,W202*100/(S202+W202),W202)","v":0},{"$f":"IF((X202+AB202)>100,X202*100/(X202+AB202),X202)","v":99.681577732755613},{"$f":"X200*AVERAGEIF(Y205:Y216,\">0\")/100","v":99.681577732755613},{"$f":"X200*(100-AVERAGEIF(Y205:Y216,\">0\"))/100","v":0},{"$f":"100-(Y200+Z200+AB200)","v":0.15910734653891723},{"$f":"IF((X202+AB202)>100,AB202*100/(X202+AB202),AB202)","v":0.15931492070546685}]
["Regression period:",null,{"$f":"MinRegYear(C199,C205:C216)","v":2009},{"$f":"IF(MAX(C205:C216)-MIN(C205:C216)<5,AVERAGEIF(C205:C216,\">0\",D205:D216),\nIF(FORECAST($C201,D$205:D$216,$C$205:$C$216)<0,0,\nIF(FORECAST($C201,D$205:D$216,$C$205:$C$216)>100,100,\nFORECAST($C201,D$205:D$216,$C$205:$C$216))))","v":99.106364817350951},null,null,null,{"$f":"IF(MAX(C205:C216)-MIN(C205:C216)<5,AVERAGEIF(C205:C216,\">0\",H205:H216),\nIF(FORECAST($C201,H$205:H$216,$C$205:$C$216)<0,0,\nIF(FORECAST($C201,H$205:H$216,$C$205:$C$216)>100,100,\nFORECAST($C201,H$205:H$216,$C$205:$C$216))))","v":0},{"$f":"IF(MAX(C205:C216)-MIN(C205:C216)<5,AVERAGEIF(C205:C216,\">0\",I205:I216),\nIF(FORECAST($C201,I$205:I$216,$C$205:$C$216)<0,0,\nIF(FORECAST($C201,I$205:I$216,$C$205:$C$216)>100,100,\nFORECAST($C201,I$205:I$216,$C$205:$C$216))))","v":98.839702344436347},null,null,null,{"$f":"IF(MAX(C205:C216)-MIN(C205:C216)<5,AVERAGEIF(C205:C216,\">0\",M205:M216),\nIF(FORECAST($C201,M$205:M$216,$C$205:$C$216)<0,0,\nIF(FORECAST($C201,M$205:M$216,$C$205:$C$216)>100,100,\nFORECAST($C201,M$205:M$216,$C$205:$C$216))))","v":0.12925917658334207},{"$f":"IF(MAX(C205:C216)-MIN(C205:C216)<5,AVERAGEIF(C205:C216,\">0\",N205:N216),\nIF(FORECAST($C201,N$205:N$216,$C$205:$C$216)<0,0,\nIF(FORECAST($C201,N$205:N$216,$C$205:$C$216)>100,100,\nFORECAST($C201,N$205:N$216,$C$205:$C$216))))","v":99.758815167412749},null,null,null,{"$f":"IF(MAX(C205:C216)-MIN(C205:C216)<5,AVERAGEIF(C205:C216,\">0\",R205:R216),\nIF(FORECAST($C201,R$205:R$216,$C$205:$C$216)<0,0,\nIF(FORECAST($C201,R$205:R$216,$C$205:$C$216)>100,100,\nFORECAST($C201,R$205:R$216,$C$205:$C$216))))","v":5.5352713258525033E-2},{"$f":"IF(MAX(C205:C216)-MIN(C205:C216)<5,AVERAGEIF(C205:C216,\">0\",S205:S216),\nIF(FORECAST($C201,S$205:S$216,$C$205:$C$216)<0,0,\nIF(FORECAST($C201,S$205:S$216,$C$205:$C$216)>100,100,\nFORECAST($C201,S$205:S$216,$C$205:$C$216))))","v":100},null,null,null,{"$f":"IF(MAX(C205:C216)-MIN(C205:C216)<5,AVERAGEIF(C205:C216,\">0\",W205:W216),\nIF(FORECAST($C201,W$205:W$216,$C$205:$C$216)<0,0,\nIF(FORECAST($C201,W$205:W$216,$C$205:$C$216)>100,100,\nFORECAST($C201,W$205:W$216,$C$205:$C$216))))","v":0},{"$f":"IF(MAX(C205:C216)-MIN(C205:C216)<5,AVERAGEIF(C205:C216,\">0\",X205:X216),\nIF(FORECAST($C201,X$205:X$216,$C$205:$C$216)<0,0,\nIF(FORECAST($C201,X$205:X$216,$C$205:$C$216)>100,100,\nFORECAST($C201,X$205:X$216,$C$205:$C$216))))","v":99.681577732755613},null,null,null,{"$f":"IF(MAX(C205:C216)-MIN(C205:C216)<5,AVERAGEIF(C205:C216,\">0\",AB205:AB216),\nIF(FORECAST($C201,AB$205:AB$216,$C$205:$C$216)<0,0,\nIF(FORECAST($C201,AB$205:AB$216,$C$205:$C$216)>100,100,\nFORECAST($C201,AB$205:AB$216,$C$205:$C$216))))","v":0.15931492070546685}]
[null,null,{"$f":"MaxRegYear(C200,C205:C216)","v":2013},{"$f":"IF(MAX(C205:C216)-MIN(C205:C216)<5,AVERAGEIF(C205:C216,\">0\",D205:D216),\nIF(FORECAST($C202,D$205:D$216,$C$205:$C$216)<0,0,\nIF(FORECAST($C202,D$205:D$216,$C$205:$C$216)>100,100,\nFORECAST($C202,D$205:D$216,$C$205:$C$216))))","v":99.106364817350951},null,null,null,{"$f":"IF(MAX(C205:C216)-MIN(C205:C216)<5,AVERAGEIF(C205:C216,\">0\",H205:H216),\nIF(FORECAST($C202,H$205:H$216,$C$205:$C$216)<0,0,\nIF(FORECAST($C202,H$205:H$216,$C$205:$C$216)>100,100,\nFORECAST($C202,H$205:H$216,$C$205:$C$216))))","v":0},{"$f":"IF(MAX(C205:C216)-MIN(C205:C216)<5,AVERAGEIF(C205:C216,\">0\",I205:I216),\nIF(FORECAST($C202,I$205:I$216,$C$205:$C$216)<0,0,\nIF(FORECAST($C202,I$205:I$216,$C$205:$C$216)>100,100,\nFORECAST($C202,I$205:I$216,$C$205:$C$216))))","v":98.839702344436347},null,null,null,{"$f":"IF(MAX(C205:C216)-MIN(C205:C216)<5,AVERAGEIF(C205:C216,\">0\",M205:M216),\nIF(FORECAST($C202,M$205:M$216,$C$205:$C$216)<0,0,\nIF(FORECAST($C202,M$205:M$216,$C$205:$C$216)>100,100,\nFORECAST($C202,M$205:M$216,$C$205:$C$216))))","v":0.12925917658334207},{"$f":"IF(MAX(C205:C216)-MIN(C205:C216)<5,AVERAGEIF(C205:C216,\">0\",N205:N216),\nIF(FORECAST($C202,N$205:N$216,$C$205:$C$216)<0,0,\nIF(FORECAST($C202,N$205:N$216,$C$205:$C$216)>100,100,\nFORECAST($C202,N$205:N$216,$C$205:$C$216))))","v":99.758815167412749},null,null,null,{"$f":"IF(MAX(C205:C216)-MIN(C205:C216)<5,AVERAGEIF(C205:C216,\">0\",R205:R216),\nIF(FORECAST($C202,R$205:R$216,$C$205:$C$216)<0,0,\nIF(FORECAST($C202,R$205:R$216,$C$205:$C$216)>100,100,\nFORECAST($C202,R$205:R$216,$C$205:$C$216))))","v":5.5352713258525033E-2},{"$f":"IF(MAX(C205:C216)-MIN(C205:C216)<5,AVERAGEIF(C205:C216,\">0\",S205:S216),\nIF(FORECAST($C202,S$205:S$216,$C$205:$C$216)<0,0,\nIF(FORECAST($C202,S$205:S$216,$C$205:$C$216)>100,100,\nFORECAST($C202,S$205:S$216,$C$205:$C$216))))","v":100},null,null,null,{"$f":"IF(MAX(C205:C216)-MIN(C205:C216)<5,AVERAGEIF(C205:C216,\">0\",W205:W216),\nIF(FORECAST($C202,W$205:W$216,$C$205:$C$216)<0,0,\nIF(FORECAST($C202,W$205:W$216,$C$205:$C$216)>100,100,\nFORECAST($C202,W$205:W$216,$C$205:$C$216))))","v":0},{"$f":"IF(MAX(C205:C216)-MIN(C205:C216)<5,AVERAGEIF(C205:C216,\">0\",X205:X216),\nIF(FORECAST($C202,X$205:X$216,$C$205:$C$216)<0,0,\nIF(FORECAST($C202,X$205:X$216,$C$205:$C$216)>100,100,\nFORECAST($C202,X$205:X$216,$C$205:$C$216))))","v":99.681577732755613},null,null,null,{"$f":"IF(MAX(C205:C216)-MIN(C205:C216)<5,AVERAGEIF(C205:C216,\">0\",AB205:AB216),\nIF(FORECAST($C202,AB$205:AB$216,$C$205:$C$216)<0,0,\nIF(FORECAST($C202,AB$205:AB$216,$C$205:$C$216)>100,100,\nFORECAST($C202,AB$205:AB$216,$C$205:$C$216))))","v":0.15931492070546685}]
[]
[null,"Survey","Year","Improved","% Improved\n< = 30min",null,null,"Surface water","Improved","% Improved\n< = 30min",null,null,"Surface water","Improved","% Improved\n< = 30min",null,null,"Surface water","Improved","% Improved\n< = 30min",null,null,"Surface water","Improved","% Improved\n< = 30min",null,null,"Surface water"]
[null,"MICS00",null,{"$f":"IF(ISERROR(INDIRECT(CONCATENATE($B205,\"!H16\"))),\"\",INDIRECT(CONCATENATE($B205,\"!H16\")))","v":"N/A"},{"$f":"IF(ISERROR(INDIRECT(CONCATENATE($B205,\"!H23\"))),\"\",INDIRECT(CONCATENATE($B205,\"!H23\")))","v":"N/A"},null,null,{"$f":"IF(ISERROR(INDIRECT(CONCATENATE($B205,\"!H21\"))),\"\",INDIRECT(CONCATENATE($B205,\"!H21\")))","v":"N/A"},{"$f":"IF(ISERROR(INDIRECT(CONCATENATE($B205,\"!I16\"))),\"\",INDIRECT(CONCATENATE($B205,\"!I16\")))","v":"N/A"},{"$f":"IF(ISERROR(INDIRECT(CONCATENATE($B205,\"!I23\"))),\"\",INDIRECT(CONCATENATE($B205,\"!I23\")))","v":"N/A"},null,null,{"$f":"IF(ISERROR(INDIRECT(CONCATENATE($B205,\"!I21\"))),\"\",INDIRECT(CONCATENATE($B205,\"!I21\")))","v":"N/A"},{"$f":"IF(ISERROR(INDIRECT(CONCATENATE($B205,\"!J16\"))),\"\",INDIRECT(CONCATENATE($B205,\"!J16\")))","v":"N/A"},{"$f":"IF(ISERROR(INDIRECT(CONCATENATE($B205,\"!J23\"))),\"\",INDIRECT(CONCATENATE($B205,\"!J23\")))","v":"N/A"},null,null,{"$f":"IF(ISERROR(INDIRECT(CONCATENATE($B205,\"!J21\"))),\"\",INDIRECT(CONCATENATE($B205,\"!J21\")))","v":"N/A"},{"$f":"IF(ISERROR(INDIRECT(CONCATENATE($B205,\"!K16\"))),\"\",INDIRECT(CONCATENATE($B205,\"!K16\")))","v":"N/A"},{"$f":"IF(ISERROR(INDIRECT(CONCATENATE($B205,\"!K23\"))),\"\",INDIRECT(CONCATENATE($B205,\"!K23\")))","v":"N/A"},null,null,{"$f":"IF(ISERROR(INDIRECT(CONCATENATE($B205,\"!K21\"))),\"\",INDIRECT(CONCATENATE($B205,\"!K21\")))","v":"N/A"},{"$f":"IF(ISERROR(INDIRECT(CONCATENATE($B205,\"!L16\"))),\"\",INDIRECT(CONCATENATE($B205,\"!L16\")))","v":"N/A"},{"$f":"IF(ISERROR(INDIRECT(CONCATENATE($B205,\"!L23\"))),\"\",INDIRECT(CONCATENATE($B205,\"!L23\")))","v":"N/A"},null,null,{"$f":"IF(ISERROR(INDIRECT(CONCATENATE($B205,\"!L221\"))),\"\",INDIRECT(CONCATENATE($B205,\"!L21\")))","v":"N/A"}]
[null,"MICS06",null,"N/A","N/A",null,null,"N/A","N/A","N/A",null,null,"N/A","N/A","N/A",null,null,"N/A","N/A","N/A",null,null,"N/A","N/A","N/A",null,null,"N/A"]
[null,"MICS11",2011,99.106364817350951,99.010822804533063,null,null,0,98.839702344436347,99.947682456252195,null,null,0.12925917658334207,99.758815167412749,100,null,null,5.5352713258525033E-2,100,99.897052806390533,null,null,0,99.681577732755613,100,null,null,0.15931492070546685]
[null,null,null,"","",null,null,"","","",null,null,"","","",null,null,"","","",null,null,"","","",null,null,""]
[null,null,null,"","",null,null,"","","",null,null,"","","",null,null,"","","",null,null,"","","",null,null,""]
[null,null,null,"","",null,null,"","","",null,null,"","","",null,null,"","","",null,null,"","","",null,null,""]
[null,null,null,"","",null,null,"","","",null,null,"","","",null,null,"","","",null,null,"","","",null,null,""]
[null,null,null,"","",null,null,"","","",null,null,"","","",null,null,"","","",null,null,"","","",null,null,""]
[null,null,null,"","",null,null,"","","",null,null,"","","",null,null,"","","",null,null,"","","",null,null,""]
[null,null,null,"","",null,null,"","","",null,null,"","","",null,null,"","","",null,null,"","","",null,null,""]
[null,null,null,"","",null,null,"","","",null,null,"","","",null,null,"","","",null,null,"","","",null,null,""]
[null,null,null,"","",null,null,"","","",null,null,"","","",null,null,"","","",null,null,"","","",null,null,""]
[]
[null,{"$f":"CONCATENATE(\"Urban use of drinking water sources,  \",C199,\"–\",C200)","v":"Urban use of drinking water sources,  2007–2015"},null,null,null,null,null,null,null,null,null,null,null,null,null,null,null,null,"Data points used for regression"]
[]
[]
[]
[]
[]
[]
[]
[]
[]
[]
[]
[]
[]
[]
[]
[]
[]
[]
[]
[]
[]
[]
[]
[]
[]
[]
[]
[]
[]
[]
[]
[]
[]
[]
[null,null,null,null,{"$f":"IF(ISERROR(INDIRECT(CONCATENATE($B253,\"!M18\"))),\"\",INDIRECT(CONCATENATE($B253,\"!M18\")))","v":""},{"$f":"IF(ISERROR(INDIRECT(CONCATENATE($B253,\"!M19\"))),\"\",INDIRECT(CONCATENATE($B253,\"!M19\")))","v":""},{"$f":"IF(ISERROR(INDIRECT(CONCATENATE($B253,\"!M20\"))),\"\",INDIRECT(CONCATENATE($B253,\"!M20\")))","v":""},{"$f":"IF(ISERROR(INDIRECT(CONCATENATE($B253,\"!M21\"))),\"\",INDIRECT(CONCATENATE($B253,\"!M21\")))","v":""},null,{"$f":"IF(ISERROR(INDIRECT(CONCATENATE($B253,\"!N18\"))),\"\",INDIRECT(CONCATENATE($B253,\"!N18\")))","v":""},{"$f":"IF(ISERROR(INDIRECT(CONCATENATE($B253,\"!N19\"))),\"\",INDIRECT(CONCATENATE($B253,\"!N19\")))","v":""},{"$f":"IF(ISERROR(INDIRECT(CONCATENATE($B253,\"!N20\"))),\"\",INDIRECT(CONCATENATE($B253,\"!N20\")))","v":""},{"$f":"IF(ISERROR(INDIRECT(CONCATENATE($B253,\"!N21\"))),\"\",INDIRECT(CONCATENATE($B253,\"!N21\")))","v":""},null,{"$f":"IF(ISERROR(INDIRECT(CONCATENATE($B253,\"!O18\"))),\"\",INDIRECT(CONCATENATE($B253,\"!O18\")))","v":""},{"$f":"IF(ISERROR(INDIRECT(CONCATENATE($B253,\"!O19\"))),\"\",INDIRECT(CONCATENATE($B253,\"!O19\")))","v":""},{"$f":"IF(ISERROR(INDIRECT(CONCATENATE($B253,\"!O20\"))),\"\",INDIRECT(CONCATENATE($B253,\"!O20\")))","v":""},{"$f":"IF(ISERROR(INDIRECT(CONCATENATE($B253,\"!O21\"))),\"\",INDIRECT(CONCATENATE($B253,\"!O21\")))","v":""},null,{"$f":"IF(ISERROR(INDIRECT(CONCATENATE($B253,\"!P18\"))),\"\",INDIRECT(CONCATENATE($B253,\"!P18\")))","v":""},{"$f":"IF(ISERROR(INDIRECT(CONCATENATE($B253,\"!P19\"))),\"\",INDIRECT(CONCATENATE($B253,\"!P19\")))","v":""},{"$f":"IF(ISERROR(INDIRECT(CONCATENATE($B253,\"!P20\"))),\"\",INDIRECT(CONCATENATE($B253,\"!P20\")))","v":""},{"$f":"IF(ISERROR(INDIRECT(CONCATENATE($B253,\"!P21\"))),\"\",INDIRECT(CONCATENATE($B253,\"!P21\")))","v":""},null,{"$f":"IF(ISERROR(INDIRECT(CONCATENATE($B253,\"!Q18\"))),\"\",INDIRECT(CONCATENATE($B253,\"!Q18\")))","v":""},{"$f":"IF(ISERROR(INDIRECT(CONCATENATE($B253,\"!Q19\"))),\"\",INDIRECT(CONCATENATE($B253,\"!Q19\")))","v":""},{"$f":"IF(ISERROR(INDIRECT(CONCATENATE($B253,\"!Q20\"))),\"\",INDIRECT(CONCATENATE($B253,\"!Q20\")))","v":""},{"$f":"IF(ISERROR(INDIRECT(CONCATENATE($B253,\"!Q21\"))),\"\",INDIRECT(CONCATENATE($B253,\"!Q1\")))","v":""}]
[null,null,null,null,{"$f":"IF(ISERROR(INDIRECT(CONCATENATE($B254,\"!M18\"))),\"\",INDIRECT(CONCATENATE($B254,\"!M18\")))","v":""},{"$f":"IF(ISERROR(INDIRECT(CONCATENATE($B254,\"!M19\"))),\"\",INDIRECT(CONCATENATE($B254,\"!M19\")))","v":""},{"$f":"IF(ISERROR(INDIRECT(CONCATENATE($B254,\"!M20\"))),\"\",INDIRECT(CONCATENATE($B254,\"!M20\")))","v":""},{"$f":"IF(ISERROR(INDIRECT(CONCATENATE($B254,\"!M21\"))),\"\",INDIRECT(CONCATENATE($B254,\"!M21\")))","v":""},null,{"$f":"IF(ISERROR(INDIRECT(CONCATENATE($B254,\"!N18\"))),\"\",INDIRECT(CONCATENATE($B254,\"!N18\")))","v":""},{"$f":"IF(ISERROR(INDIRECT(CONCATENATE($B254,\"!N19\"))),\"\",INDIRECT(CONCATENATE($B254,\"!N19\")))","v":""},{"$f":"IF(ISERROR(INDIRECT(CONCATENATE($B254,\"!N20\"))),\"\",INDIRECT(CONCATENATE($B254,\"!N20\")))","v":""},{"$f":"IF(ISERROR(INDIRECT(CONCATENATE($B254,\"!N21\"))),\"\",INDIRECT(CONCATENATE($B254,\"!N21\")))","v":""},null,{"$f":"IF(ISERROR(INDIRECT(CONCATENATE($B254,\"!O18\"))),\"\",INDIRECT(CONCATENATE($B254,\"!O18\")))","v":""},{"$f":"IF(ISERROR(INDIRECT(CONCATENATE($B254,\"!O19\"))),\"\",INDIRECT(CONCATENATE($B254,\"!O19\")))","v":""},{"$f":"IF(ISERROR(INDIRECT(CONCATENATE($B254,\"!O20\"))),\"\",INDIRECT(CONCATENATE($B254,\"!O20\")))","v":""},{"$f":"IF(ISERROR(INDIRECT(CONCATENATE($B254,\"!O21\"))),\"\",INDIRECT(CONCATENATE($B254,\"!O21\")))","v":""},null,{"$f":"IF(ISERROR(INDIRECT(CONCATENATE($B254,\"!P18\"))),\"\",INDIRECT(CONCATENATE($B254,\"!P18\")))","v":""},{"$f":"IF(ISERROR(INDIRECT(CONCATENATE($B254,\"!P19\"))),\"\",INDIRECT(CONCATENATE($B254,\"!P19\")))","v":""},{"$f":"IF(ISERROR(INDIRECT(CONCATENATE($B254,\"!P20\"))),\"\",INDIRECT(CONCATENATE($B254,\"!P20\")))","v":""},{"$f":"IF(ISERROR(INDIRECT(CONCATENATE($B254,\"!P21\"))),\"\",INDIRECT(CONCATENATE($B254,\"!P21\")))","v":""},null,{"$f":"IF(ISERROR(INDIRECT(CONCATENATE($B254,\"!Q18\"))),\"\",INDIRECT(CONCATENATE($B254,\"!Q18\")))","v":""},{"$f":"IF(ISERROR(INDIRECT(CONCATENATE($B254,\"!Q19\"))),\"\",INDIRECT(CONCATENATE($B254,\"!Q19\")))","v":""},{"$f":"IF(ISERROR(INDIRECT(CONCATENATE($B254,\"!Q20\"))),\"\",INDIRECT(CONCATENATE($B254,\"!Q20\")))","v":""},{"$f":"IF(ISERROR(INDIRECT(CONCATENATE($B254,\"!Q21\"))),\"\",INDIRECT(CONCATENATE($B254,\"!Q1\")))","v":""}]
[null,null,null,null,{"$f":"IF(ISERROR(INDIRECT(CONCATENATE($B255,\"!M18\"))),\"\",INDIRECT(CONCATENATE($B255,\"!M18\")))","v":""},{"$f":"IF(ISERROR(INDIRECT(CONCATENATE($B255,\"!M19\"))),\"\",INDIRECT(CONCATENATE($B255,\"!M19\")))","v":""},{"$f":"IF(ISERROR(INDIRECT(CONCATENATE($B255,\"!M20\"))),\"\",INDIRECT(CONCATENATE($B255,\"!M20\")))","v":""},{"$f":"IF(ISERROR(INDIRECT(CONCATENATE($B255,\"!M21\"))),\"\",INDIRECT(CONCATENATE($B255,\"!M21\")))","v":""},null,{"$f":"IF(ISERROR(INDIRECT(CONCATENATE($B255,\"!N18\"))),\"\",INDIRECT(CONCATENATE($B255,\"!N18\")))","v":""},{"$f":"IF(ISERROR(INDIRECT(CONCATENATE($B255,\"!N19\"))),\"\",INDIRECT(CONCATENATE($B255,\"!N19\")))","v":""},{"$f":"IF(ISERROR(INDIRECT(CONCATENATE($B255,\"!N20\"))),\"\",INDIRECT(CONCATENATE($B255,\"!N20\")))","v":""},{"$f":"IF(ISERROR(INDIRECT(CONCATENATE($B255,\"!N21\"))),\"\",INDIRECT(CONCATENATE($B255,\"!N21\")))","v":""},null,{"$f":"IF(ISERROR(INDIRECT(CONCATENATE($B255,\"!O18\"))),\"\",INDIRECT(CONCATENATE($B255,\"!O18\")))","v":""},{"$f":"IF(ISERROR(INDIRECT(CONCATENATE($B255,\"!O19\"))),\"\",INDIRECT(CONCATENATE($B255,\"!O19\")))","v":""},{"$f":"IF(ISERROR(INDIRECT(CONCATENATE($B255,\"!O20\"))),\"\",INDIRECT(CONCATENATE($B255,\"!O20\")))","v":""},{"$f":"IF(ISERROR(INDIRECT(CONCATENATE($B255,\"!O21\"))),\"\",INDIRECT(CONCATENATE($B255,\"!O21\")))","v":""},null,{"$f":"IF(ISERROR(INDIRECT(CONCATENATE($B255,\"!P18\"))),\"\",INDIRECT(CONCATENATE($B255,\"!P18\")))","v":""},{"$f":"IF(ISERROR(INDIRECT(CONCATENATE($B255,\"!P19\"))),\"\",INDIRECT(CONCATENATE($B255,\"!P19\")))","v":""},{"$f":"IF(ISERROR(INDIRECT(CONCATENATE($B255,\"!P20\"))),\"\",INDIRECT(CONCATENATE($B255,\"!P20\")))","v":""},{"$f":"IF(ISERROR(INDIRECT(CONCATENATE($B255,\"!P21\"))),\"\",INDIRECT(CONCATENATE($B255,\"!P21\")))","v":""},null,{"$f":"IF(ISERROR(INDIRECT(CONCATENATE($B255,\"!Q18\"))),\"\",INDIRECT(CONCATENATE($B255,\"!Q18\")))","v":""},{"$f":"IF(ISERROR(INDIRECT(CONCATENATE($B255,\"!Q19\"))),\"\",INDIRECT(CONCATENATE($B255,\"!Q19\")))","v":""},{"$f":"IF(ISERROR(INDIRECT(CONCATENATE($B255,\"!Q20\"))),\"\",INDIRECT(CONCATENATE($B255,\"!Q20\")))","v":""},{"$f":"IF(ISERROR(INDIRECT(CONCATENATE($B255,\"!Q21\"))),\"\",INDIRECT(CONCATENATE($B255,\"!Q1\")))","v":""}]
[null,null,null,null,{"$f":"IF(ISERROR(INDIRECT(CONCATENATE($B256,\"!M18\"))),\"\",INDIRECT(CONCATENATE($B256,\"!M18\")))","v":""},{"$f":"IF(ISERROR(INDIRECT(CONCATENATE($B256,\"!M19\"))),\"\",INDIRECT(CONCATENATE($B256,\"!M19\")))","v":""},{"$f":"IF(ISERROR(INDIRECT(CONCATENATE($B256,\"!M20\"))),\"\",INDIRECT(CONCATENATE($B256,\"!M20\")))","v":""},{"$f":"IF(ISERROR(INDIRECT(CONCATENATE($B256,\"!M21\"))),\"\",INDIRECT(CONCATENATE($B256,\"!M21\")))","v":""},null,{"$f":"IF(ISERROR(INDIRECT(CONCATENATE($B256,\"!N18\"))),\"\",INDIRECT(CONCATENATE($B256,\"!N18\")))","v":""},{"$f":"IF(ISERROR(INDIRECT(CONCATENATE($B256,\"!N19\"))),\"\",INDIRECT(CONCATENATE($B256,\"!N19\")))","v":""},{"$f":"IF(ISERROR(INDIRECT(CONCATENATE($B256,\"!N20\"))),\"\",INDIRECT(CONCATENATE($B256,\"!N20\")))","v":""},{"$f":"IF(ISERROR(INDIRECT(CONCATENATE($B256,\"!N21\"))),\"\",INDIRECT(CONCATENATE($B256,\"!N21\")))","v":""},null,{"$f":"IF(ISERROR(INDIRECT(CONCATENATE($B256,\"!O18\"))),\"\",INDIRECT(CONCATENATE($B256,\"!O18\")))","v":""},{"$f":"IF(ISERROR(INDIRECT(CONCATENATE($B256,\"!O19\"))),\"\",INDIRECT(CONCATENATE($B256,\"!O19\")))","v":""},{"$f":"IF(ISERROR(INDIRECT(CONCATENATE($B256,\"!O20\"))),\"\",INDIRECT(CONCATENATE($B256,\"!O20\")))","v":""},{"$f":"IF(ISERROR(INDIRECT(CONCATENATE($B256,\"!O21\"))),\"\",INDIRECT(CONCATENATE($B256,\"!O21\")))","v":""},null,{"$f":"IF(ISERROR(INDIRECT(CONCATENATE($B256,\"!P18\"))),\"\",INDIRECT(CONCATENATE($B256,\"!P18\")))","v":""},{"$f":"IF(ISERROR(INDIRECT(CONCATENATE($B256,\"!P19\"))),\"\",INDIRECT(CONCATENATE($B256,\"!P19\")))","v":""},{"$f":"IF(ISERROR(INDIRECT(CONCATENATE($B256,\"!P20\"))),\"\",INDIRECT(CONCATENATE($B256,\"!P20\")))","v":""},{"$f":"IF(ISERROR(INDIRECT(CONCATENATE($B256,\"!P21\"))),\"\",INDIRECT(CONCATENATE($B256,\"!P21\")))","v":""},null,{"$f":"IF(ISERROR(INDIRECT(CONCATENATE($B256,\"!Q18\"))),\"\",INDIRECT(CONCATENATE($B256,\"!Q18\")))","v":""},{"$f":"IF(ISERROR(INDIRECT(CONCATENATE($B256,\"!Q19\"))),\"\",INDIRECT(CONCATENATE($B256,\"!Q19\")))","v":""},{"$f":"IF(ISERROR(INDIRECT(CONCATENATE($B256,\"!Q20\"))),\"\",INDIRECT(CONCATENATE($B256,\"!Q20\")))","v":""},{"$f":"IF(ISERROR(INDIRECT(CONCATENATE($B256,\"!Q21\"))),\"\",INDIRECT(CONCATENATE($B256,\"!Q1\")))","v":""}]
[null,null,null,null,{"$f":"IF(ISERROR(INDIRECT(CONCATENATE($B257,\"!M18\"))),\"\",INDIRECT(CONCATENATE($B257,\"!M18\")))","v":""},{"$f":"IF(ISERROR(INDIRECT(CONCATENATE($B257,\"!M19\"))),\"\",INDIRECT(CONCATENATE($B257,\"!M19\")))","v":""},{"$f":"IF(ISERROR(INDIRECT(CONCATENATE($B257,\"!M20\"))),\"\",INDIRECT(CONCATENATE($B257,\"!M20\")))","v":""},{"$f":"IF(ISERROR(INDIRECT(CONCATENATE($B257,\"!M21\"))),\"\",INDIRECT(CONCATENATE($B257,\"!M21\")))","v":""},null,{"$f":"IF(ISERROR(INDIRECT(CONCATENATE($B257,\"!N18\"))),\"\",INDIRECT(CONCATENATE($B257,\"!N18\")))","v":""},{"$f":"IF(ISERROR(INDIRECT(CONCATENATE($B257,\"!N19\"))),\"\",INDIRECT(CONCATENATE($B257,\"!N19\")))","v":""},{"$f":"IF(ISERROR(INDIRECT(CONCATENATE($B257,\"!N20\"))),\"\",INDIRECT(CONCATENATE($B257,\"!N20\")))","v":""},{"$f":"IF(ISERROR(INDIRECT(CONCATENATE($B257,\"!N21\"))),\"\",INDIRECT(CONCATENATE($B257,\"!N21\")))","v":""},null,{"$f":"IF(ISERROR(INDIRECT(CONCATENATE($B257,\"!O18\"))),\"\",INDIRECT(CONCATENATE($B257,\"!O18\")))","v":""},{"$f":"IF(ISERROR(INDIRECT(CONCATENATE($B257,\"!O19\"))),\"\",INDIRECT(CONCATENATE($B257,\"!O19\")))","v":""},{"$f":"IF(ISERROR(INDIRECT(CONCATENATE($B257,\"!O20\"))),\"\",INDIRECT(CONCATENATE($B257,\"!O20\")))","v":""},{"$f":"IF(ISERROR(INDIRECT(CONCATENATE($B257,\"!O21\"))),\"\",INDIRECT(CONCATENATE($B257,\"!O21\")))","v":""},null,{"$f":"IF(ISERROR(INDIRECT(CONCATENATE($B257,\"!P18\"))),\"\",INDIRECT(CONCATENATE($B257,\"!P18\")))","v":""},{"$f":"IF(ISERROR(INDIRECT(CONCATENATE($B257,\"!P19\"))),\"\",INDIRECT(CONCATENATE($B257,\"!P19\")))","v":""},{"$f":"IF(ISERROR(INDIRECT(CONCATENATE($B257,\"!P20\"))),\"\",INDIRECT(CONCATENATE($B257,\"!P20\")))","v":""},{"$f":"IF(ISERROR(INDIRECT(CONCATENATE($B257,\"!P21\"))),\"\",INDIRECT(CONCATENATE($B257,\"!P21\")))","v":""},null,{"$f":"IF(ISERROR(INDIRECT(CONCATENATE($B257,\"!Q18\"))),\"\",INDIRECT(CONCATENATE($B257,\"!Q18\")))","v":""},{"$f":"IF(ISERROR(INDIRECT(CONCATENATE($B257,\"!Q19\"))),\"\",INDIRECT(CONCATENATE($B257,\"!Q19\")))","v":""},{"$f":"IF(ISERROR(INDIRECT(CONCATENATE($B257,\"!Q20\"))),\"\",INDIRECT(CONCATENATE($B257,\"!Q20\")))","v":""},{"$f":"IF(ISERROR(INDIRECT(CONCATENATE($B257,\"!Q21\"))),\"\",INDIRECT(CONCATENATE($B257,\"!Q1\")))","v":""}]
[]
[]
[]
[]
[]
[]
[]
[]
[]
[]
[]
[]
[]
[]
[]
[]
[]
[]
[]
[]
[]
[]
[]
[]
[]
[]
[]
[]
[]
[]
[]
[]
[]
[]
[]
[]
[]
[]
[]
["RURAL",null,null,"Poorest",null,null,null,null,"Poor",null,null,null,null,"Middle",null,null,null,null,"Rich",null,null,null,null,"Richest"]
[null,null,null,"Improved","Basic","Limited","Unimproved","Surface water","Improved","Basic","Limited","Unimproved","Surface water","Improved","Basic","Limited","Unimproved","Surface water","Improved","Basic","Limited","Unimproved","Surface water","Improved","Basic","Limited","Unimproved","Surface water"]
["Forecast period:",null,2007,{"$f":"IF((D301+H301)>100,D301*100/(D301+H301),D301)","v":97.490658605398721},{"$f":"D299*AVERAGEIF(E305:E316,\">0\")/100","v":97.466816439379159},{"$f":"D299*(100-AVERAGEIF(E305:E316,\">0\"))/100","v":2.3842166019561874E-2},{"$f":"100-(E299+F299+H299)","v":1.8582647195033104},{"$f":"IF((D301+H301)>100,H301*100/(D301+H301),H301)","v":0.65107667509796807},{"$f":"IF((I301+M301)>100,I301*100/(I301+M301),I301)","v":100},{"$f":"I299*AVERAGEIF(J305:J316,\">0\")/100","v":100},{"$f":"I299*(100-AVERAGEIF(J305:J316,\">0\"))/100","v":0},{"$f":"100-(J299+K299+M299)","v":0},{"$f":"IF((I301+M301)>100,M301*100/(I301+M301),M301)","v":0},{"$f":"IF((N301+R301)>100,N301*100/(N301+R301),N301)","v":99.155681311186356},{"$f":"N299*AVERAGEIF(O305:O316,\">0\")/100","v":99.155681311186356},{"$f":"N299*(100-AVERAGEIF(O305:O316,\">0\"))/100","v":0},{"$f":"100-(O299+P299+R299)","v":0.8443186888136438},{"$f":"IF((N301+R301)>100,R301*100/(N301+R301),R301)","v":0},{"$f":"IF((S301+W301)>100,S301*100/(S301+W301),S301)","v":99.730828370425726},{"$f":"S299*AVERAGEIF(T305:T316,\">0\")/100","v":99.465531128894511},{"$f":"S299*(100-AVERAGEIF(T305:T316,\">0\"))/100","v":0.26529724153120871},{"$f":"100-(T299+U299+W299)","v":0.26917162957427365},{"$f":"IF((S301+W301)>100,W301*100/(S301+W301),W301)","v":0},{"$f":"IF((X301+AB301)>100,X301*100/(X301+AB301),X301)","v":99.73589636159619},{"$f":"X299*AVERAGEIF(Y305:Y316,\">0\")/100","v":99.458522558506957},{"$f":"X299*(100-AVERAGEIF(Y305:Y316,\">0\"))/100","v":0.2773738030892331},{"$f":"100-(Y299+Z299+AB299)","v":0.26410363840381024},{"$f":"IF((X301+AB301)>100,AB301*100/(X301+AB301),AB301)","v":0}]
[null,null,2015,{"$f":"IF((D302+H302)>100,D302*100/(D302+H302),D302)","v":97.490658605398721},{"$f":"D300*AVERAGEIF(E305:E316,\">0\")/100","v":97.466816439379159},{"$f":"D300*(100-AVERAGEIF(E305:E316,\">0\"))/100","v":2.3842166019561874E-2},{"$f":"100-(E300+F300+H300)","v":1.8582647195033104},{"$f":"IF((D302+H302)>100,H302*100/(D302+H302),H302)","v":0.65107667509796807},{"$f":"IF((I302+M302)>100,I302*100/(I302+M302),I302)","v":100},{"$f":"I300*AVERAGEIF(J305:J316,\">0\")/100","v":100},{"$f":"I300*(100-AVERAGEIF(J305:J316,\">0\"))/100","v":0},{"$f":"100-(J300+K300+M300)","v":0},{"$f":"IF((I302+M302)>100,M302*100/(I302+M302),M302)","v":0},{"$f":"IF((N302+R302)>100,N302*100/(N302+R302),N302)","v":99.155681311186356},{"$f":"N300*AVERAGEIF(O305:O316,\">0\")/100","v":99.155681311186356},{"$f":"N300*(100-AVERAGEIF(O305:O316,\">0\"))/100","v":0},{"$f":"100-(O300+P300+R300)","v":0.8443186888136438},{"$f":"IF((N302+R302)>100,R302*100/(N302+R302),R302)","v":0},{"$f":"IF((S302+W302)>100,S302*100/(S302+W302),S302)","v":99.730828370425726},{"$f":"S300*AVERAGEIF(T305:T316,\">0\")/100","v":99.465531128894511},{"$f":"S300*(100-AVERAGEIF(T305:T316,\">0\"))/100","v":0.26529724153120871},{"$f":"100-(T300+U300+W300)","v":0.26917162957427365},{"$f":"IF((S302+W302)>100,W302*100/(S302+W302),W302)","v":0},{"$f":"IF((X302+AB302)>100,X302*100/(X302+AB302),X302)","v":99.73589636159619},{"$f":"X300*AVERAGEIF(Y305:Y316,\">0\")/100","v":99.458522558506957},{"$f":"X300*(100-AVERAGEIF(Y305:Y316,\">0\"))/100","v":0.2773738030892331},{"$f":"100-(Y300+Z300+AB300)","v":0.26410363840381024},{"$f":"IF((X302+AB302)>100,AB302*100/(X302+AB302),AB302)","v":0}]
["Regression period:",null,{"$f":"MinRegYear(C299,C305:C316)","v":2009},{"$f":"IF(MAX(C305:C316)-MIN(C305:C316)<5,AVERAGEIF(C305:C316,\">0\",D305:D316),\nIF(FORECAST($C301,D$305:D$316,$C$305:$C$316)<0,0,\nIF(FORECAST($C301,D$305:D$316,$C$305:$C$316)>100,100,\nFORECAST($C301,D$305:D$316,$C$305:$C$316))))","v":97.490658605398721},null,null,null,{"$f":"IF(MAX(C305:C316)-MIN(C305:C316)<5,AVERAGEIF(C305:C316,\">0\",H305:H316),\nIF(FORECAST($C301,H$305:H$316,$C$305:$C$316)<0,0,\nIF(FORECAST($C301,H$305:H$316,$C$305:$C$316)>100,100,\nFORECAST($C301,H$305:H$316,$C$305:$C$316))))","v":0.65107667509796807},{"$f":"IF(MAX(C305:C316)-MIN(C305:C316)<5,AVERAGEIF(C305:C316,\">0\",I305:I316),\nIF(FORECAST($C301,I$305:I$316,$C$305:$C$316)<0,0,\nIF(FORECAST($C301,I$305:I$316,$C$305:$C$316)>100,100,\nFORECAST($C301,I$305:I$316,$C$305:$C$316))))","v":100},null,null,null,{"$f":"IF(MAX(C305:C316)-MIN(C305:C316)<5,AVERAGEIF(C305:C316,\">0\",M305:M316),\nIF(FORECAST($C301,M$305:M$316,$C$305:$C$316)<0,0,\nIF(FORECAST($C301,M$305:M$316,$C$305:$C$316)>100,100,\nFORECAST($C301,M$305:M$316,$C$305:$C$316))))","v":0},{"$f":"IF(MAX(C305:C316)-MIN(C305:C316)<5,AVERAGEIF(C305:C316,\">0\",N305:N316),\nIF(FORECAST($C301,N$305:N$316,$C$305:$C$316)<0,0,\nIF(FORECAST($C301,N$305:N$316,$C$305:$C$316)>100,100,\nFORECAST($C301,N$305:N$316,$C$305:$C$316))))","v":99.155681311186356},null,null,null,{"$f":"IF(MAX(C305:C316)-MIN(C305:C316)<5,AVERAGEIF(C305:C316,\">0\",R305:R316),\nIF(FORECAST($C301,R$305:R$316,$C$305:$C$316)<0,0,\nIF(FORECAST($C301,R$305:R$316,$C$305:$C$316)>100,100,\nFORECAST($C301,R$305:R$316,$C$305:$C$316))))","v":0},{"$f":"IF(MAX(C305:C316)-MIN(C305:C316)<5,AVERAGEIF(C305:C316,\">0\",S305:S316),\nIF(FORECAST($C301,S$305:S$316,$C$305:$C$316)<0,0,\nIF(FORECAST($C301,S$305:S$316,$C$305:$C$316)>100,100,\nFORECAST($C301,S$305:S$316,$C$305:$C$316))))","v":99.730828370425726},null,null,null,{"$f":"IF(MAX(C305:C316)-MIN(C305:C316)<5,AVERAGEIF(C305:C316,\">0\",W305:W316),\nIF(FORECAST($C301,W$305:W$316,$C$305:$C$316)<0,0,\nIF(FORECAST($C301,W$305:W$316,$C$305:$C$316)>100,100,\nFORECAST($C301,W$305:W$316,$C$305:$C$316))))","v":0},{"$f":"IF(MAX(C305:C316)-MIN(C305:C316)<5,AVERAGEIF(C305:C316,\">0\",X305:X316),\nIF(FORECAST($C301,X$305:X$316,$C$305:$C$316)<0,0,\nIF(FORECAST($C301,X$305:X$316,$C$305:$C$316)>100,100,\nFORECAST($C301,X$305:X$316,$C$305:$C$316))))","v":99.73589636159619},null,null,null,{"$f":"IF(MAX(C305:C316)-MIN(C305:C316)<5,AVERAGEIF(C305:C316,\">0\",AB305:AB316),\nIF(FORECAST($C301,AB$305:AB$316,$C$305:$C$316)<0,0,\nIF(FORECAST($C301,AB$305:AB$316,$C$305:$C$316)>100,100,\nFORECAST($C301,AB$305:AB$316,$C$305:$C$316))))","v":0}]
[null,null,{"$f":"MaxRegYear(C300,C305:C316)","v":2013},{"$f":"IF(MAX(C305:C316)-MIN(C305:C316)<5,AVERAGEIF(C305:C316,\">0\",D305:D316),\nIF(FORECAST($C302,D$305:D$316,$C$305:$C$316)<0,0,\nIF(FORECAST($C302,D$305:D$316,$C$305:$C$316)>100,100,\nFORECAST($C302,D$305:D$316,$C$305:$C$316))))","v":97.490658605398721},null,null,null,{"$f":"IF(MAX(C305:C316)-MIN(C305:C316)<5,AVERAGEIF(C305:C316,\">0\",H305:H316),\nIF(FORECAST($C302,H$305:H$316,$C$305:$C$316)<0,0,\nIF(FORECAST($C302,H$305:H$316,$C$305:$C$316)>100,100,\nFORECAST($C302,H$305:H$316,$C$305:$C$316))))","v":0.65107667509796807},{"$f":"IF(MAX(C305:C316)-MIN(C305:C316)<5,AVERAGEIF(C305:C316,\">0\",I305:I316),\nIF(FORECAST($C302,I$305:I$316,$C$305:$C$316)<0,0,\nIF(FORECAST($C302,I$305:I$316,$C$305:$C$316)>100,100,\nFORECAST($C302,I$305:I$316,$C$305:$C$316))))","v":100},null,null,null,{"$f":"IF(MAX(C305:C316)-MIN(C305:C316)<5,AVERAGEIF(C305:C316,\">0\",M305:M316),\nIF(FORECAST($C302,M$305:M$316,$C$305:$C$316)<0,0,\nIF(FORECAST($C302,M$305:M$316,$C$305:$C$316)>100,100,\nFORECAST($C302,M$305:M$316,$C$305:$C$316))))","v":0},{"$f":"IF(MAX(C305:C316)-MIN(C305:C316)<5,AVERAGEIF(C305:C316,\">0\",N305:N316),\nIF(FORECAST($C302,N$305:N$316,$C$305:$C$316)<0,0,\nIF(FORECAST($C302,N$305:N$316,$C$305:$C$316)>100,100,\nFORECAST($C302,N$305:N$316,$C$305:$C$316))))","v":99.155681311186356},null,null,null,{"$f":"IF(MAX(C305:C316)-MIN(C305:C316)<5,AVERAGEIF(C305:C316,\">0\",R305:R316),\nIF(FORECAST($C302,R$305:R$316,$C$305:$C$316)<0,0,\nIF(FORECAST($C302,R$305:R$316,$C$305:$C$316)>100,100,\nFORECAST($C302,R$305:R$316,$C$305:$C$316))))","v":0},{"$f":"IF(MAX(C305:C316)-MIN(C305:C316)<5,AVERAGEIF(C305:C316,\">0\",S305:S316),\nIF(FORECAST($C302,S$305:S$316,$C$305:$C$316)<0,0,\nIF(FORECAST($C302,S$305:S$316,$C$305:$C$316)>100,100,\nFORECAST($C302,S$305:S$316,$C$305:$C$316))))","v":99.730828370425726},null,null,null,{"$f":"IF(MAX(C305:C316)-MIN(C305:C316)<5,AVERAGEIF(C305:C316,\">0\",W305:W316),\nIF(FORECAST($C302,W$305:W$316,$C$305:$C$316)<0,0,\nIF(FORECAST($C302,W$305:W$316,$C$305:$C$316)>100,100,\nFORECAST($C302,W$305:W$316,$C$305:$C$316))))","v":0},{"$f":"IF(MAX(C305:C316)-MIN(C305:C316)<5,AVERAGEIF(C305:C316,\">0\",X305:X316),\nIF(FORECAST($C302,X$305:X$316,$C$305:$C$316)<0,0,\nIF(FORECAST($C302,X$305:X$316,$C$305:$C$316)>100,100,\nFORECAST($C302,X$305:X$316,$C$305:$C$316))))","v":99.73589636159619},null,null,null,{"$f":"IF(MAX(C305:C316)-MIN(C305:C316)<5,AVERAGEIF(C305:C316,\">0\",AB305:AB316),\nIF(FORECAST($C302,AB$305:AB$316,$C$305:$C$316)<0,0,\nIF(FORECAST($C302,AB$305:AB$316,$C$305:$C$316)>100,100,\nFORECAST($C302,AB$305:AB$316,$C$305:$C$316))))","v":0}]
[]
[null,"Survey","Year","Improved","% Improved\n< = 30min",null,null,"Surface water","Improved","% Improved\n< = 30min",null,null,"Surface water","Improved","% Improved\n< = 30min",null,null,"Surface water","Improved","% Improved\n< = 30min",null,null,"Surface water","Improved","% Improved\n< = 30min",null,null,"Surface water"]
[null,"MICS00",null,{"$f":"IF(ISERROR(INDIRECT(CONCATENATE($B305,\"!M16\"))),\"\",INDIRECT(CONCATENATE($B305,\"!M16\")))","v":"N/A"},{"$f":"IF(ISERROR(INDIRECT(CONCATENATE($B305,\"!M23\"))),\"\",INDIRECT(CONCATENATE($B305,\"!M23\")))","v":"N/A"},null,null,{"$f":"IF(ISERROR(INDIRECT(CONCATENATE($B305,\"!M21\"))),\"\",INDIRECT(CONCATENATE($B305,\"!M21\")))","v":"N/A"},{"$f":"IF(ISERROR(INDIRECT(CONCATENATE($B305,\"!N16\"))),\"\",INDIRECT(CONCATENATE($B305,\"!N16\")))","v":"N/A"},{"$f":"IF(ISERROR(INDIRECT(CONCATENATE($B305,\"!N23\"))),\"\",INDIRECT(CONCATENATE($B305,\"!N23\")))","v":"N/A"},null,null,{"$f":"IF(ISERROR(INDIRECT(CONCATENATE($B305,\"!N21\"))),\"\",INDIRECT(CONCATENATE($B305,\"!N21\")))","v":"N/A"},{"$f":"IF(ISERROR(INDIRECT(CONCATENATE($B305,\"!O16\"))),\"\",INDIRECT(CONCATENATE($B305,\"!O16\")))","v":"N/A"},{"$f":"IF(ISERROR(INDIRECT(CONCATENATE($B305,\"!O23\"))),\"\",INDIRECT(CONCATENATE($B305,\"!O23\")))","v":"N/A"},null,null,{"$f":"IF(ISERROR(INDIRECT(CONCATENATE($B305,\"!O21\"))),\"\",INDIRECT(CONCATENATE($B305,\"!O21\")))","v":"N/A"},{"$f":"IF(ISERROR(INDIRECT(CONCATENATE($B305,\"!P16\"))),\"\",INDIRECT(CONCATENATE($B305,\"!P16\")))","v":"N/A"},{"$f":"IF(ISERROR(INDIRECT(CONCATENATE($B305,\"!P23\"))),\"\",INDIRECT(CONCATENATE($B305,\"!P23\")))","v":"N/A"},null,null,{"$f":"IF(ISERROR(INDIRECT(CONCATENATE($B305,\"!P21\"))),\"\",INDIRECT(CONCATENATE($B305,\"!P21\")))","v":"N/A"},{"$f":"IF(ISERROR(INDIRECT(CONCATENATE($B305,\"!Q16\"))),\"\",INDIRECT(CONCATENATE($B305,\"!Q16\")))","v":"N/A"},{"$f":"IF(ISERROR(INDIRECT(CONCATENATE($B305,\"!Q23\"))),\"\",INDIRECT(CONCATENATE($B305,\"!Q23\")))","v":"N/A"},null,null,{"$f":"IF(ISERROR(INDIRECT(CONCATENATE($B305,\"!Q221\"))),\"\",INDIRECT(CONCATENATE($B305,\"!Q21\")))","v":"N/A"}]
[null,"MICS06",null,"N/A","N/A",null,null,"N/A","N/A","N/A",null,null,"N/A","N/A","N/A",null,null,"N/A","N/A","N/A",null,null,"N/A","N/A","N/A",null,null,"N/A"]
[null,"MICS11",2011,97.490658605398721,99.975544153295687,null,null,0.65107667509796807,100,100,null,null,0,99.155681311186356,100,null,null,0,99.730828370425726,99.733986726204833,null,null,0,99.73589636159619,99.721891702779104,null,null,0]
[null,null,null,"","",null,null,"","","",null,null,"","","",null,null,"","","",null,null,"","","",null,null,""]
[null,null,null,"","",null,null,"","","",null,null,"","","",null,null,"","","",null,null,"","","",null,null,""]
[null,null,null,"","",null,null,"","","",null,null,"","","",null,null,"","","",null,null,"","","",null,null,""]
[null,null,null,"","",null,null,"","","",null,null,"","","",null,null,"","","",null,null,"","","",null,null,""]
[null,null,null,"","",null,null,"","","",null,null,"","","",null,null,"","","",null,null,"","","",null,null,""]
[null,null,null,"","",null,null,"","","",null,null,"","","",null,null,"","","",null,null,"","","",null,null,""]
[null,null,null,"","",null,null,"","","",null,null,"","","",null,null,"","","",null,null,"","","",null,null,""]
[null,null,null,"","",null,null,"","","",null,null,"","","",null,null,"","","",null,null,"","","",null,null,""]
[null,null,null,"","",null,null,"","","",null,null,"","","",null,null,"","","",null,null,"","","",null,null,""]
[]
[null,{"$f":"CONCATENATE(\"Rural use of drinking water sources, \",C299,\"–\",C300)","v":"Rural use of drinking water sources, 2007–2015"},null,null,null,null,null,null,null,null,null,null,null,null,null,null,null,null,"Data points used for regression"]

{"sheet":"Sanitation","index":2,"n_rows":318,"n_cols":28,"rows_kept":318,"cut":false,"hidden":false,"merged":[[298,0,299,1],[300,0,301,1],[317,18,317,22],[196,23,196,27],[198,0,199,1],[200,0,201,1],[217,18,217,22],[296,0,297,2],[296,3,296,7],[296,8,296,12],[296,13,296,17],[296,18,296,22],[296,23,296,27],[217,1,217,11],[317,1,317,11],[98,0,99,1],[100,0,101,1],[117,18,117,22],[196,0,197,2],[196,3,196,7],[196,8,196,12],[196,13,196,17],[196,18,196,22],[117,1,117,11],[96,23,96,27],[32,1,33,2],[32,3,33,3],[35,1,36,2],[35,3,36,3],[38,1,39,2],[38,3,39,3],[96,0,97,2],[96,3,96,7],[96,8,96,12],[96,13,96,17],[96,18,96,22],[30,21,30,24],[4,1,4,24],[3,1,3,24],[6,1,6,8],[6,9,6,16],[6,17,6,24],[30,1,31,4],[30,5,30,8],[30,9,30,12],[30,13,30,16],[30,17,30,20]]}
[]
[]
[]
[null,"Summary of trends in use of sanitation facilities by wealth quintile (%)"]
[null,{"$f":"IF(ISERROR(INDIRECT(CONCATENATE($B105,\"!A2\"))),\"\",INDIRECT(CONCATENATE($B105,\"!A2\")))","v":"Trinidad and Tobago"}]
[]
[null,{"$f":"B118","v":"National use of sanitation facilities, 2000–2017"},null,null,null,null,null,null,null,{"$f":"B218","v":"Urban use of sanitation facilities, 2007–2015"},null,null,null,null,null,null,null,{"$f":"B318","v":"Rural use of sanitation facilities, 2007–2015"}]
[]
[]
[]
[]
[]
[]
[]
[]
[]
[]
[]
[]
[]
[]
[]
[]
[]
[]
[]
[]
[]
[]
[]
[null,{"$f":"IF(ISERROR(INDIRECT(CONCATENATE($B105,\"!A2\"))),\"\",INDIRECT(CONCATENATE($B105,\"!A2\")))","v":"Trinidad and Tobago"},null,null,null,"Poorest",null,null,null,"Poor",null,null,null,"Middle",null,null,null,"Rich",null,null,null,"Richest"]
[null,null,null,null,null,"Basic","Limited","Unimproved","Open defecation","Basic","Limited","Unimproved","Open defecation","Basic","Limited","Unimproved","Open defecation","Basic","Limited","Unimproved","Open defecation","Basic","Limited","Unimproved","Open defecation"]
[null,"NATIONAL",null,"Estimate",{"$f":"C99","v":2000},{"$f":"E99","v":81.384130362536624},{"$f":"F99","v":12.374287926230558},5.9402521027381141,0.3013296084946937,{"$f":"J99","v":90.243466465311684},{"$f":"K99","v":7.9734272104521722},1.6231985326550955,0.15990779158104118,{"$f":"O99","v":92.809651629628547},{"$f":"P99","v":5.2309725690317279},1.9190238059053399,4.0351995434374732E-2,{"$f":"T99","v":96.601188957860955},{"$f":"U99","v":3.1465997500699325},0.25221129206910575,0,{"$f":"Y99","v":98.792055148907892},{"$f":"Z99","v":1.0129820782349195},0.19496277285719543,0]
[null,null,null,null,{"$f":"C100","v":2017},{"$f":"E100","v":83.840752667785566},12.747812243511266,3.0489102804178714,0.36252480828529876,{"$f":"J100","v":91.495602340559756},8.0840592002231322,0.42033845921710622,0,{"$f":"O100","v":94.617280319044056},5.3328548185962621,0,4.986486235968466E-2,{"$f":"T100","v":96.357848145120457},3.138673386545721,0.50347846833382448,0,{"$f":"Y100","v":98.855250273391562},1.013630060792194,0.13111966581624301,0]
[]
[null,"URBAN",null,"Estimate",{"$f":"C199","v":2007},{"$f":"E199","v":81.478300597888577},{"$f":"F199","v":12.788263021148785},5.4138101513360226,0.31962622962661524,{"$f":"J199","v":93.412638029802025},{"$f":"K199","v":5.6391683993541326},0.94819357084384137,0,{"$f":"O199","v":93.512109936092372},{"$f":"P199","v":5.914650625168564},0.57323943873906558,0,{"$f":"T199","v":98.260182352604389},{"$f":"U199","v":1.3965739265975226},0.34324372079808541,0,{"$f":"Y199","v":99.249657650253013},{"$f":"Z199","v":0.59123500320807043},0.15910734653891723,0]
[null,null,null,null,{"$f":"C200","v":2015},{"$f":"E200","v":81.478300597888577},12.788263021148785,5.4138101513360226,0.31962622962661524,{"$f":"J200","v":93.412638029802025},5.6391683993541326,0.94819357084384137,0,{"$f":"O200","v":93.512109936092372},5.914650625168564,0.57323943873906558,0,{"$f":"T200","v":98.260182352604389},1.3965739265975226,0.34324372079808541,0,{"$f":"Y200","v":99.249657650253013},0.59123500320807043,0.15910734653891723,0]
[]
[null,"RURAL",null,"Estimate",{"$f":"C299","v":2007},{"$f":"E299","v":91.81591398401288},{"$f":"F299","v":6.2503411774021309},1.7157222697734511,0.21802256881154092,{"$f":"J299","v":95.013262951914768},{"$f":"K299","v":4.690074400256095},0.29666264782913743,0,{"$f":"O299","v":94.46598936758042},{"$f":"P299","v":5.120619998066636},0.41339063435295031,0,{"$f":"T299","v":97.513915690100333},{"$f":"U299","v":2.4860843098996668},0,0,{"$f":"Y299","v":98.782316372237844},{"$f":"Z299","v":1.1725377066674918},4.5145921094658092E-2,0]
[null,null,null,null,{"$f":"C300","v":2015},{"$f":"E300","v":91.81591398401288},6.2503411774021309,1.7157222697734511,0.21802256881154092,{"$f":"J300","v":95.013262951914768},4.690074400256095,0.29666264782913743,0,{"$f":"O300","v":94.46598936758042},5.120619998066636,0.41339063435295031,0,{"$f":"T300","v":97.513915690100333},2.4860843098996668,0,0,{"$f":"Y300","v":98.782316372237844},1.1725377066674918,4.5145921094658092E-2,0]
[]
[]
[]
[]
[]
[]
[]
[]
[]
[]
[]
[]
[]
[]
[]
[]
[]
[]
[]
[]
[]
[]
[]
[]
[]
[]
[]
[]
[]
[]
[]
[]
[]
[]
[]
[]
[]
[]
[]
[]
[]
[]
[]
[]
[]
[]
[]
[]
[]
[]
[]
[]
[]
[]
[]
[]
["NATIONAL",null,null,"Poorest",null,null,null,null,"Poor",null,null,null,null,"Middle",null,null,null,null,"Rich",null,null,null,null,"Richest"]
[null,null,null,"Improved","Basic","Limited","Unimproved","Open defecation","Improved","Basic","Limited","Unimproved","Open defecation","Improved","Basic","Limited","Unimproved","Open defecation","Improved","Basic","Limited","Unimproved","Open defecation","Improved","Basic","Limited","Unimproved","Open defecation"]
["Forecast period:",null,2000,{"$f":"IF((D101+H101)>100,D101*100/(D101+H101),D101)","v":93.758418288767189},{"$f":"D99*AVERAGEIF(E105:E116,\">0\")/100","v":81.384130362536624},{"$f":"D99*(100-AVERAGEIF(E105:E116,\">0\"))/100","v":12.374287926230558},{"$f":"100-(E99+F99+H99)","v":5.9402521027381141},{"$f":"IF((D101+H101)>100,H101*100/(D101+H101),H101)","v":0.3013296084946937},{"$f":"IF((I101+M101)>100,I101*100/(I101+M101),I101)","v":98.216893675763856},{"$f":"I99*AVERAGEIF(J105:J116,\">0\")/100","v":90.243466465311684},{"$f":"I99*(100-AVERAGEIF(J105:J116,\">0\"))/100","v":7.9734272104521722},{"$f":"100-(J99+K99+M99)","v":1.6231985326550955},{"$f":"IF((I101+M101)>100,M101*100/(I101+M101),M101)","v":0.15990779158104118},{"$f":"IF((N101+R101)>100,N101*100/(N101+R101),N101)","v":98.040624198660282},{"$f":"N99*AVERAGEIF(O105:O116,\">0\")/100","v":92.809651629628547},{"$f":"N99*(100-AVERAGEIF(O105:O116,\">0\"))/100","v":5.2309725690317279},{"$f":"100-(O99+P99+R99)","v":1.9190238059053399},{"$f":"IF((N101+R101)>100,R101*100/(N101+R101),R101)","v":4.0351995434374732E-2},{"$f":"IF((S101+W101)>100,S101*100/(S101+W101),S101)","v":99.747788707930894},{"$f":"S99*AVERAGEIF(T105:T116,\">0\")/100","v":96.601188957860955},{"$f":"S99*(100-AVERAGEIF(T105:T116,\">0\"))/100","v":3.1465997500699325},{"$f":"100-(T99+U99+W99)","v":0.25221129206910575},{"$f":"IF((S101+W101)>100,W101*100/(S101+W101),W101)","v":0},{"$f":"IF((X101+AB101)>100,X101*100/(X101+AB101),X101)","v":99.805037227142805},{"$f":"X99*AVERAGEIF(Y105:Y116,\">0\")/100","v":98.792055148907892},{"$f":"X99*(100-AVERAGEIF(Y105:Y116,\">0\"))/100","v":1.0129820782349195},{"$f":"100-(Y99+Z99+AB99)","v":0.19496277285719543},{"$f":"IF((X101+AB101)>100,AB101*100/(X101+AB101),AB101)","v":0}]
[null,null,2017,{"$f":"IF((D102+H102)>100,D102*100/(D102+H102),D102)","v":96.588564911296828},{"$f":"D100*AVERAGEIF(E105:E116,\">0\")/100","v":83.840752667785566},{"$f":"D100*(100-AVERAGEIF(E105:E116,\">0\"))/100","v":12.747812243511266},{"$f":"100-(E100+F100+H100)","v":3.0489102804178714},{"$f":"IF((D102+H102)>100,H102*100/(D102+H102),H102)","v":0.36252480828529876},{"$f":"IF((I102+M102)>100,I102*100/(I102+M102),I102)","v":99.579661540782894},{"$f":"I100*AVERAGEIF(J105:J116,\">0\")/100","v":91.495602340559756},{"$f":"I100*(100-AVERAGEIF(J105:J116,\">0\"))/100","v":8.0840592002231322},{"$f":"100-(J100+K100+M100)","v":0.42033845921710622},{"$f":"IF((I102+M102)>100,M102*100/(I102+M102),M102)","v":0},{"$f":"IF((N102+R102)>100,N102*100/(N102+R102),N102)","v":99.950135137640316},{"$f":"N100*AVERAGEIF(O105:O116,\">0\")/100","v":94.617280319044056},{"$f":"N100*(100-AVERAGEIF(O105:O116,\">0\"))/100","v":5.3328548185962621},{"$f":"100-(O100+P100+R100)","v":0},{"$f":"IF((N102+R102)>100,R102*100/(N102+R102),R102)","v":4.986486235968466E-2},{"$f":"IF((S102+W102)>100,S102*100/(S102+W102),S102)","v":99.49652153166619},{"$f":"S100*AVERAGEIF(T105:T116,\">0\")/100","v":96.357848145120457},{"$f":"S100*(100-AVERAGEIF(T105:T116,\">0\"))/100","v":3.138673386545721},{"$f":"100-(T100+U100+W100)","v":0.50347846833382448},{"$f":"IF((S102+W102)>100,W102*100/(S102+W102),W102)","v":0},{"$f":"IF((X102+AB102)>100,X102*100/(X102+AB102),X102)","v":99.868880334183757},{"$f":"X100*AVERAGEIF(Y105:Y116,\">0\")/100","v":98.855250273391562},{"$f":"X100*(100-AVERAGEIF(Y105:Y116,\">0\"))/100","v":1.013630060792194},{"$f":"100-(Y100+Z100+AB100)","v":0.13111966581624301},{"$f":"IF((X102+AB102)>100,AB102*100/(X102+AB102),AB102)","v":0}]
["Regression period:",null,{"$f":"MinRegYear(C99,C105:C116)","v":2000},{"$f":"IF(MAX(C105:C116)-MIN(C105:C116)<5,AVERAGEIF(C105:C116,\">0\",D105:D116),\nIF(FORECAST($C101,D$105:D$116,$C$105:$C$116)<0,0,\nIF(FORECAST($C101,D$105:D$116,$C$105:$C$116)>100,100,\nFORECAST($C101,D$105:D$116,$C$105:$C$116))))","v":93.758418288767189},null,null,null,{"$f":"IF(MAX(C105:C116)-MIN(C105:C116)<5,AVERAGEIF(C105:C116,\">0\",H105:H116),\nIF(FORECAST($C101,H$105:H$116,$C$105:$C$116)<0,0,\nIF(FORECAST($C101,H$105:H$116,$C$105:$C$116)>100,100,\nFORECAST($C101,H$105:H$116,$C$105:$C$116))))","v":0.3013296084946937},{"$f":"IF(MAX(C105:C116)-MIN(C105:C116)<5,AVERAGEIF(C105:C116,\">0\",I105:I116),\nIF(FORECAST($C101,I$105:I$116,$C$105:$C$116)<0,0,\nIF(FORECAST($C101,I$105:I$116,$C$105:$C$116)>100,100,\nFORECAST($C101,I$105:I$116,$C$105:$C$116))))","v":98.216893675763856},null,null,null,{"$f":"IF(MAX(C105:C116)-MIN(C105:C116)<5,AVERAGEIF(C105:C116,\">0\",M105:M116),\nIF(FORECAST($C101,M$105:M$116,$C$105:$C$116)<0,0,\nIF(FORECAST($C101,M$105:M$116,$C$105:$C$116)>100,100,\nFORECAST($C101,M$105:M$116,$C$105:$C$116))))","v":0.15990779158104118},{"$f":"IF(MAX(C105:C116)-MIN(C105:C116)<5,AVERAGEIF(C105:C116,\">0\",N105:N116),\nIF(FORECAST($C101,N$105:N$116,$C$105:$C$116)<0,0,\nIF(FORECAST($C101,N$105:N$116,$C$105:$C$116)>100,100,\nFORECAST($C101,N$105:N$116,$C$105:$C$116))))","v":98.040624198660282},null,null,null,{"$f":"IF(MAX(C105:C116)-MIN(C105:C116)<5,AVERAGEIF(C105:C116,\">0\",R105:R116),\nIF(FORECAST($C101,R$105:R$116,$C$105:$C$116)<0,0,\nIF(FORECAST($C101,R$105:R$116,$C$105:$C$116)>100,100,\nFORECAST($C101,R$105:R$116,$C$105:$C$116))))","v":4.0351995434374732E-2},{"$f":"IF(MAX(C105:C116)-MIN(C105:C116)<5,AVERAGEIF(C105:C116,\">0\",S105:S116),\nIF(FORECAST($C101,S$105:S$116,$C$105:$C$116)<0,0,\nIF(FORECAST($C101,S$105:S$116,$C$105:$C$116)>100,100,\nFORECAST($C101,S$105:S$116,$C$105:$C$116))))","v":99.747788707930894},null,null,null,{"$f":"IF(MAX(C105:C116)-MIN(C105:C116)<5,AVERAGEIF(C105:C116,\">0\",W105:W116),\nIF(FORECAST($C101,W$105:W$116,$C$105:$C$116)<0,0,\nIF(FORECAST($C101,W$105:W$116,$C$105:$C$116)>100,100,\nFORECAST($C101,W$105:W$116,$C$105:$C$116))))","v":0},{"$f":"IF(MAX(C105:C116)-MIN(C105:C116)<5,AVERAGEIF(C105:C116,\">0\",X105:X116),\nIF(FORECAST($C101,X$105:X$116,$C$105:$C$116)<0,0,\nIF(FORECAST($C101,X$105:X$116,$C$105:$C$116)>100,100,\nFORECAST($C101,X$105:X$116,$C$105:$C$116))))","v":99.805037227142805},null,null,null,{"$f":"IF(MAX(C105:C116)-MIN(C105:C116)<5,AVERAGEIF(C105:C116,\">0\",AB105:AB116),\nIF(FORECAST($C101,AB$105:AB$116,$C$105:$C$116)<0,0,\nIF(FORECAST($C101,AB$105:AB$116,$C$105:$C$116)>100,100,\nFORECAST($C101,AB$105:AB$116,$C$105:$C$116))))","v":0}]
[null,null,{"$f":"MaxRegYear(C100,C105:C116)","v":2013},{"$f":"IF(MAX(C105:C116)-MIN(C105:C116)<5,AVERAGEIF(C105:C116,\">0\",D105:D116),\nIF(FORECAST($C102,D$105:D$116,$C$105:$C$116)<0,0,\nIF(FORECAST($C102,D$105:D$116,$C$105:$C$116)>100,100,\nFORECAST($C102,D$105:D$116,$C$105:$C$116))))","v":96.588564911296828},null,null,null,{"$f":"IF(MAX(C105:C116)-MIN(C105:C116)<5,AVERAGEIF(C105:C116,\">0\",H105:H116),\nIF(FORECAST($C102,H$105:H$116,$C$105:$C$116)<0,0,\nIF(FORECAST($C102,H$105:H$116,$C$105:$C$116)>100,100,\nFORECAST($C102,H$105:H$116,$C$105:$C$116))))","v":0.36252480828529876},{"$f":"IF(MAX(C105:C116)-MIN(C105:C116)<5,AVERAGEIF(C105:C116,\">0\",I105:I116),\nIF(FORECAST($C102,I$105:I$116,$C$105:$C$116)<0,0,\nIF(FORECAST($C102,I$105:I$116,$C$105:$C$116)>100,100,\nFORECAST($C102,I$105:I$116,$C$105:$C$116))))","v":99.579661540782894},null,null,null,{"$f":"IF(MAX(C105:C116)-MIN(C105:C116)<5,AVERAGEIF(C105:C116,\">0\",M105:M116),\nIF(FORECAST($C102,M$105:M$116,$C$105:$C$116)<0,0,\nIF(FORECAST($C102,M$105:M$116,$C$105:$C$116)>100,100,\nFORECAST($C102,M$105:M$116,$C$105:$C$116))))","v":0},{"$f":"IF(MAX(C105:C116)-MIN(C105:C116)<5,AVERAGEIF(C105:C116,\">0\",N105:N116),\nIF(FORECAST($C102,N$105:N$116,$C$105:$C$116)<0,0,\nIF(FORECAST($C102,N$105:N$116,$C$105:$C$116)>100,100,\nFORECAST($C102,N$105:N$116,$C$105:$C$116))))","v":100},null,null,null,{"$f":"IF(MAX(C105:C116)-MIN(C105:C116)<5,AVERAGEIF(C105:C116,\">0\",R105:R116),\nIF(FORECAST($C102,R$105:R$116,$C$105:$C$116)<0,0,\nIF(FORECAST($C102,R$105:R$116,$C$105:$C$116)>100,100,\nFORECAST($C102,R$105:R$116,$C$105:$C$116))))","v":4.9889739809772404E-2},{"$f":"IF(MAX(C105:C116)-MIN(C105:C116)<5,AVERAGEIF(C105:C116,\">0\",S105:S116),\nIF(FORECAST($C102,S$105:S$116,$C$105:$C$116)<0,0,\nIF(FORECAST($C102,S$105:S$116,$C$105:$C$116)>100,100,\nFORECAST($C102,S$105:S$116,$C$105:$C$116))))","v":99.49652153166619},null,null,null,{"$f":"IF(MAX(C105:C116)-MIN(C105:C116)<5,AVERAGEIF(C105:C116,\">0\",W105:W116),\nIF(FORECAST($C102,W$105:W$116,$C$105:$C$116)<0,0,\nIF(FORECAST($C102,W$105:W$116,$C$105:$C$116)>100,100,\nFORECAST($C102,W$105:W$116,$C$105:$C$116))))","v":0},{"$f":"IF(MAX(C105:C116)-MIN(C105:C116)<5,AVERAGEIF(C105:C116,\">0\",X105:X116),\nIF(FORECAST($C102,X$105:X$116,$C$105:$C$116)<0,0,\nIF(FORECAST($C102,X$105:X$116,$C$105:$C$116)>100,100,\nFORECAST($C102,X$105:X$116,$C$105:$C$116))))","v":99.868880334183757},null,null,null,{"$f":"IF(MAX(C105:C116)-MIN(C105:C116)<5,AVERAGEIF(C105:C116,\">0\",AB105:AB116),\nIF(FORECAST($C102,AB$105:AB$116,$C$105:$C$116)<0,0,\nIF(FORECAST($C102,AB$105:AB$116,$C$105:$C$116)>100,100,\nFORECAST($C102,AB$105:AB$116,$C$105:$C$116))))","v":0}]
[]
[null,"Survey","Year","Improved","Not shared",null,null,"Open defecation","Improved","Not shared",null,null,"Open defecation","Improved","Not shared",null,null,"Open defecation","Improved","Not shared",null,null,"Open defecation","Improved","Not shared",null,null,"Open defecation"]
[null,"MICS00",2000,{"$f":"IF(ISERROR(INDIRECT(CONCATENATE($B105,\"!C122\"))),\"\",INDIRECT(CONCATENATE($B105,\"!C122\")))","v":93.639613018909898},{"$f":"IF(ISERROR(INDIRECT(CONCATENATE($B105,\"!C129\"))),\"\",INDIRECT(CONCATENATE($B105,\"!C129\")))","v":"N/A"},null,null,{"$f":"IF(ISERROR(INDIRECT(CONCATENATE($B105,\"!C127\"))),\"\",INDIRECT(CONCATENATE($B105,\"!C127\")))","v":0.23744911804613297},{"$f":"IF(ISERROR(INDIRECT(CONCATENATE($B105,\"!D122\"))),\"\",INDIRECT(CONCATENATE($B105,\"!D122\")))","v":98.078445153140592},{"$f":"IF(ISERROR(INDIRECT(CONCATENATE($B105,\"!D129\"))),\"\",INDIRECT(CONCATENATE($B105,\"!D129\")))","v":"N/A"},null,null,{"$f":"IF(ISERROR(INDIRECT(CONCATENATE($B105,\"!D127\"))),\"\",INDIRECT(CONCATENATE($B105,\"!D127\")))","v":0.16507098052162431},{"$f":"IF(ISERROR(INDIRECT(CONCATENATE($B105,\"!E122\"))),\"\",INDIRECT(CONCATENATE($B105,\"!E122\")))","v":97.903577517923296},{"$f":"IF(ISERROR(INDIRECT(CONCATENATE($B105,\"!E129\"))),\"\",INDIRECT(CONCATENATE($B105,\"!E129\")))","v":"N/A"},null,null,{"$f":"IF(ISERROR(INDIRECT(CONCATENATE($B105,\"!E127\"))),\"\",INDIRECT(CONCATENATE($B105,\"!E127\")))","v":0},{"$f":"IF(ISERROR(INDIRECT(CONCATENATE($B105,\"!F122\"))),\"\",INDIRECT(CONCATENATE($B105,\"!F122\")))","v":99.696561024949432},{"$f":"IF(ISERROR(INDIRECT(CONCATENATE($B105,\"!F129\"))),\"\",INDIRECT(CONCATENATE($B105,\"!F129\")))","v":"N/A"},null,null,{"$f":"IF(ISERROR(INDIRECT(CONCATENATE($B105,\"!F127\"))),\"\",INDIRECT(CONCATENATE($B105,\"!F127\")))","v":0},{"$f":"IF(ISERROR(INDIRECT(CONCATENATE($B105,\"!G122\"))),\"\",INDIRECT(CONCATENATE($B105,\"!G122\")))","v":99.830508474576277},{"$f":"IF(ISERROR(INDIRECT(CONCATENATE($B105,\"!G129\"))),\"\",INDIRECT(CONCATENATE($B105,\"!G129\")))","v":"N/A"},null,null,{"$f":"IF(ISERROR(INDIRECT(CONCATENATE($B105,\"!G2127\"))),\"\",INDIRECT(CONCATENATE($B105,\"!G127\")))","v":0}]
[null,"MICS06",2006,95.326011400543848,83.976113867386943,null,null,0.47011062584642205,99.150450209389987,89.619337773112449,null,null,5.7946802288259422E-2,99.404360407261066,93.355231158927694,null,null,0.13352842125556769,99.744520144521758,96.532107701681127,null,null,0,99.778466532192695,98.882010084177381,null,null,0]
[null,"MICS11",2011,96.010591414771227,89.627775464195182,null,null,0.2764535736253948,99.203866719016659,94.144296135379406,null,null,0,99.823596285238096,95.973738109092906,null,null,0,99.473704800744542,97.158780505809034,null,null,0,99.889623814636082,99.088068167625678,null,null,0]
[null,null,null,"","",null,null,"","","",null,null,"","","",null,null,"","","",null,null,"","","",null,null,""]
[null,null,null,"","",null,null,"","","",null,null,"","","",null,null,"","","",null,null,"","","",null,null,""]
[null,null,null,"","",null,null,"","","",null,null,"","","",null,null,"","","",null,null,"","","",null,null,""]
[null,null,null,"","",null,null,"","","",null,null,"","","",null,null,"","","",null,null,"","","",null,null,""]
[null,null,null,"","",null,null,"","","",null,null,"","","",null,null,"","","",null,null,"","","",null,null,""]
[null,null,null,"","",null,null,"","","",null,null,"","","",null,null,"","","",null,null,"","","",null,null,""]
[null,null,null,"","",null,null,"","","",null,null,"","","",null,null,"","","",null,null,"","","",null,null,""]
[null,null,null,"","",null,null,"","","",null,null,"","","",null,null,"","","",null,null,"","","",null,null,""]
[null,null,null,"","",null,null,"","","",null,null,"","","",null,null,"","","",null,null,"","","",null,null,""]
[]
[null,{"$f":"CONCATENATE(\"National use of sanitation facilities, \",C99,\"–\",C100)","v":"National use of sanitation facilities, 2000–2017"},null,null,null,null,null,null,null,null,null,null,null,null,null,null,null,null,"Data points used for regression"]
[]
[]
[]
[]
[]
[]
[]
[]
[]
[]
[]
[]
[]
[]
[]
[]
[]
[]
[]
[]
[]
[]
[]
[]
[]
[]
[]
[]
[]
[]
[]
[]
[]
[]
[]
[]
[]
[]
[]
[]
[]
[]
[]
[]
[]
[]
[]
[]
[]
[]
[]
[]
[]
[]
[]
[]
[]
[]
[]
[]
[]
[]
[]
[]
[]
[]
[]
[]
[]
[]
[]
[]
[]
[]
[]
[]
[]
[]
["URBAN",null,null,"Poorest",null,null,null,null,"Poor",null,null,null,null,"Middle",null,null,null,null,"Rich",null,null,null,null,"Richest"]
[null,null,null,"Improved","Basic","Limited","Unimproved","Open defecation","Improved","Basic","Limited","Unimproved","Open defecation","Improved","Basic","Limited","Unimproved","Open defecation","Improved","Basic","Limited","Unimproved","Open defecation","Improved","Basic","Limited","Unimproved","Open defecation"]
["Forecast period:",null,{"$f":"MinBase(C205:C216)","v":2007},{"$f":"IF((D201+H201)>100,D201*100/(D201+H201),D201)","v":94.26656361903737},{"$f":"D199*AVERAGEIF(E205:E216,\">0\")/100","v":81.478300597888577},{"$f":"D199*(100-AVERAGEIF(E205:E216,\">0\"))/100","v":12.788263021148785},{"$f":"100-(E199+F199+H199)","v":5.4138101513360226},{"$f":"IF((D201+H201)>100,H201*100/(D201+H201),H201)","v":0.31962622962661524},{"$f":"IF((I201+M201)>100,I201*100/(I201+M201),I201)","v":99.051806429156159},{"$f":"I199*AVERAGEIF(J205:J216,\">0\")/100","v":93.412638029802025},{"$f":"I199*(100-AVERAGEIF(J205:J216,\">0\"))/100","v":5.6391683993541326},{"$f":"100-(J199+K199+M199)","v":0.94819357084384137},{"$f":"IF((I201+M201)>100,M201*100/(I201+M201),M201)","v":0},{"$f":"IF((N201+R201)>100,N201*100/(N201+R201),N201)","v":99.426760561260934},{"$f":"N199*AVERAGEIF(O205:O216,\">0\")/100","v":93.512109936092372},{"$f":"N199*(100-AVERAGEIF(O205:O216,\">0\"))/100","v":5.914650625168564},{"$f":"100-(O199+P199+R199)","v":0.57323943873906558},{"$f":"IF((N201+R201)>100,R201*100/(N201+R201),R201)","v":0},{"$f":"IF((S201+W201)>100,S201*100/(S201+W201),S201)","v":99.656756279201915},{"$f":"S199*AVERAGEIF(T205:T216,\">0\")/100","v":98.260182352604389},{"$f":"S199*(100-AVERAGEIF(T205:T216,\">0\"))/100","v":1.3965739265975226},{"$f":"100-(T199+U199+W199)","v":0.34324372079808541},{"$f":"IF((S201+W201)>100,W201*100/(S201+W201),W201)","v":0},{"$f":"IF((X201+AB201)>100,X201*100/(X201+AB201),X201)","v":99.840892653461083},{"$f":"X199*AVERAGEIF(Y205:Y216,\">0\")/100","v":99.249657650253013},{"$f":"X199*(100-AVERAGEIF(Y205:Y216,\">0\"))/100","v":0.59123500320807043},{"$f":"100-(Y199+Z199+AB199)","v":0.15910734653891723},{"$f":"IF((X201+AB201)>100,AB201*100/(X201+AB201),AB201)","v":0}]
[null,null,{"$f":"MaxTarget(C205:C216)","v":2015},{"$f":"IF((D202+H202)>100,D202*100/(D202+H202),D202)","v":94.26656361903737},{"$f":"D200*AVERAGEIF(E205:E216,\">0\")/100","v":81.478300597888577},{"$f":"D200*(100-AVERAGEIF(E205:E216,\">0\"))/100","v":12.788263021148785},{"$f":"100-(E200+F200+H200)","v":5.4138101513360226},{"$f":"IF((D202+H202)>100,H202*100/(D202+H202),H202)","v":0.31962622962661524},{"$f":"IF((I202+M202)>100,I202*100/(I202+M202),I202)","v":99.051806429156159},{"$f":"I200*AVERAGEIF(J205:J216,\">0\")/100","v":93.412638029802025},{"$f":"I200*(100-AVERAGEIF(J205:J216,\">0\"))/100","v":5.6391683993541326},{"$f":"100-(J200+K200+M200)","v":0.94819357084384137},{"$f":"IF((I202+M202)>100,M202*100/(I202+M202),M202)","v":0},{"$f":"IF((N202+R202)>100,N202*100/(N202+R202),N202)","v":99.426760561260934},{"$f":"N200*AVERAGEIF(O205:O216,\">0\")/100","v":93.512109936092372},{"$f":"N200*(100-AVERAGEIF(O205:O216,\">0\"))/100","v":5.914650625168564},{"$f":"100-(O200+P200+R200)","v":0.57323943873906558},{"$f":"IF((N202+R202)>100,R202*100/(N202+R202),R202)","v":0},{"$f":"IF((S202+W202)>100,S202*100/(S202+W202),S202)","v":99.656756279201915},{"$f":"S200*AVERAGEIF(T205:T216,\">0\")/100","v":98.260182352604389},{"$f":"S200*(100-AVERAGEIF(T205:T216,\">0\"))/100","v":1.3965739265975226},{"$f":"100-(T200+U200+W200)","v":0.34324372079808541},{"$f":"IF((S202+W202)>100,W202*100/(S202+W202),W202)","v":0},{"$f":"IF((X202+AB202)>100,X202*100/(X202+AB202),X202)","v":99.840892653461083},{"$f":"X200*AVERAGEIF(Y205:Y216,\">0\")/100","v":99.249657650253013},{"$f":"X200*(100-AVERAGEIF(Y205:Y216,\">0\"))/100","v":0.59123500320807043},{"$f":"100-(Y200+Z200+AB200)","v":0.15910734653891723},{"$f":"IF((X202+AB202)>100,AB202*100/(X202+AB202),AB202)","v":0}]
["Regression period:",null,{"$f":"MinRegYear(C199,C205:C216)","v":2009},{"$f":"IF(MAX(C205:C216)-MIN(C205:C216)<5,AVERAGEIF(C205:C216,\">0\",D205:D216),\nIF(FORECAST($C201,D$205:D$216,$C$205:$C$216)<0,0,\nIF(FORECAST($C201,D$205:D$216,$C$205:$C$216)>100,100,\nFORECAST($C201,D$205:D$216,$C$205:$C$216))))","v":94.26656361903737},null,null,null,{"$f":"IF(MAX(C205:C216)-MIN(C205:C216)<5,AVERAGEIF(C205:C216,\">0\",H205:H216),\nIF(FORECAST($C201,H$205:H$216,$C$205:$C$216)<0,0,\nIF(FORECAST($C201,H$205:H$216,$C$205:$C$216)>100,100,\nFORECAST($C201,H$205:H$216,$C$205:$C$216))))","v":0.31962622962661524},{"$f":"IF(MAX(C205:C216)-MIN(C205:C216)<5,AVERAGEIF(C205:C216,\">0\",I205:I216),\nIF(FORECAST($C201,I$205:I$216,$C$205:$C$216)<0,0,\nIF(FORECAST($C201,I$205:I$216,$C$205:$C$216)>100,100,\nFORECAST($C201,I$205:I$216,$C$205:$C$216))))","v":99.051806429156159},null,null,null,{"$f":"IF(MAX(C205:C216)-MIN(C205:C216)<5,AVERAGEIF(C205:C216,\">0\",M205:M216),\nIF(FORECAST($C201,M$205:M$216,$C$205:$C$216)<0,0,\nIF(FORECAST($C201,M$205:M$216,$C$205:$C$216)>100,100,\nFORECAST($C201,M$205:M$216,$C$205:$C$216))))","v":0},{"$f":"IF(MAX(C205:C216)-MIN(C205:C216)<5,AVERAGEIF(C205:C216,\">0\",N205:N216),\nIF(FORECAST($C201,N$205:N$216,$C$205:$C$216)<0,0,\nIF(FORECAST($C201,N$205:N$216,$C$205:$C$216)>100,100,\nFORECAST($C201,N$205:N$216,$C$205:$C$216))))","v":99.426760561260934},null,null,null,{"$f":"IF(MAX(C205:C216)-MIN(C205:C216)<5,AVERAGEIF(C205:C216,\">0\",R205:R216),\nIF(FORECAST($C201,R$205:R$216,$C$205:$C$216)<0,0,\nIF(FORECAST($C201,R$205:R$216,$C$205:$C$216)>100,100,\nFORECAST($C201,R$205:R$216,$C$205:$C$216))))","v":0},{"$f":"IF(MAX(C205:C216)-MIN(C205:C216)<5,AVERAGEIF(C205:C216,\">0\",S205:S216),\nIF(FORECAST($C201,S$205:S$216,$C$205:$C$216)<0,0,\nIF(FORECAST($C201,S$205:S$216,$C$205:$C$216)>100,100,\nFORECAST($C201,S$205:S$216,$C$205:$C$216))))","v":99.656756279201915},null,null,null,{"$f":"IF(MAX(C205:C216)-MIN(C205:C216)<5,AVERAGEIF(C205:C216,\">0\",W205:W216),\nIF(FORECAST($C201,W$205:W$216,$C$205:$C$216)<0,0,\nIF(FORECAST($C201,W$205:W$216,$C$205:$C$216)>100,100,\nFORECAST($C201,W$205:W$216,$C$205:$C$216))))","v":0},{"$f":"IF(MAX(C205:C216)-MIN(C205:C216)<5,AVERAGEIF(C205:C216,\">0\",X205:X216),\nIF(FORECAST($C201,X$205:X$216,$C$205:$C$216)<0,0,\nIF(FORECAST($C201,X$205:X$216,$C$205:$C$216)>100,100,\nFORECAST($C201,X$205:X$216,$C$205:$C$216))))","v":99.840892653461083},null,null,null,{"$f":"IF(MAX(C205:C216)-MIN(C205:C216)<5,AVERAGEIF(C205:C216,\">0\",AB205:AB216),\nIF(FORECAST($C201,AB$205:AB$216,$C$205:$C$216)<0,0,\nIF(FORECAST($C201,AB$205:AB$216,$C$205:$C$216)>100,100,\nFORECAST($C201,AB$205:AB$216,$C$205:$C$216))))","v":0}]
[null,null,{"$f":"MaxRegYear(C200,C205:C216)","v":2013},{"$f":"IF(MAX(C205:C216)-MIN(C205:C216)<5,AVERAGEIF(C205:C216,\">0\",D205:D216),\nIF(FORECAST($C202,D$205:D$216,$C$205:$C$216)<0,0,\nIF(FORECAST($C202,D$205:D$216,$C$205:$C$216)>100,100,\nFORECAST($C202,D$205:D$216,$C$205:$C$216))))","v":94.26656361903737},null,null,null,{"$f":"IF(MAX(C205:C216)-MIN(C205:C216)<5,AVERAGEIF(C205:C216,\">0\",H205:H216),\nIF(FORECAST($C202,H$205:H$216,$C$205:$C$216)<0,0,\nIF(FORECAST($C202,H$205:H$216,$C$205:$C$216)>100,100,\nFORECAST($C202,H$205:H$216,$C$205:$C$216))))","v":0.31962622962661524},{"$f":"IF(MAX(C205:C216)-MIN(C205:C216)<5,AVERAGEIF(C205:C216,\">0\",I205:I216),\nIF(FORECAST($C202,I$205:I$216,$C$205:$C$216)<0,0,\nIF(FORECAST($C202,I$205:I$216,$C$205:$C$216)>100,100,\nFORECAST($C202,I$205:I$216,$C$205:$C$216))))","v":99.051806429156159},null,null,null,{"$f":"IF(MAX(C205:C216)-MIN(C205:C216)<5,AVERAGEIF(C205:C216,\">0\",M205:M216),\nIF(FORECAST($C202,M$205:M$216,$C$205:$C$216)<0,0,\nIF(FORECAST($C202,M$205:M$216,$C$205:$C$216)>100,100,\nFORECAST($C202,M$205:M$216,$C$205:$C$216))))","v":0},{"$f":"IF(MAX(C205:C216)-MIN(C205:C216)<5,AVERAGEIF(C205:C216,\">0\",N205:N216),\nIF(FORECAST($C202,N$205:N$216,$C$205:$C$216)<0,0,\nIF(FORECAST($C202,N$205:N$216,$C$205:$C$216)>100,100,\nFORECAST($C202,N$205:N$216,$C$205:$C$216))))","v":99.426760561260934},null,null,null,{"$f":"IF(MAX(C205:C216)-MIN(C205:C216)<5,AVERAGEIF(C205:C216,\">0\",R205:R216),\nIF(FORECAST($C202,R$205:R$216,$C$205:$C$216)<0,0,\nIF(FORECAST($C202,R$205:R$216,$C$205:$C$216)>100,100,\nFORECAST($C202,R$205:R$216,$C$205:$C$216))))","v":0},{"$f":"IF(MAX(C205:C216)-MIN(C205:C216)<5,AVERAGEIF(C205:C216,\">0\",S205:S216),\nIF(FORECAST($C202,S$205:S$216,$C$205:$C$216)<0,0,\nIF(FORECAST($C202,S$205:S$216,$C$205:$C$216)>100,100,\nFORECAST($C202,S$205:S$216,$C$205:$C$216))))","v":99.656756279201915},null,null,null,{"$f":"IF(MAX(C205:C216)-MIN(C205:C216)<5,AVERAGEIF(C205:C216,\">0\",W205:W216),\nIF(FORECAST($C202,W$205:W$216,$C$205:$C$216)<0,0,\nIF(FORECAST($C202,W$205:W$216,$C$205:$C$216)>100,100,\nFORECAST($C202,W$205:W$216,$C$205:$C$216))))","v":0},{"$f":"IF(MAX(C205:C216)-MIN(C205:C216)<5,AVERAGEIF(C205:C216,\">0\",X205:X216),\nIF(FORECAST($C202,X$205:X$216,$C$205:$C$216)<0,0,\nIF(FORECAST($C202,X$205:X$216,$C$205:$C$216)>100,100,\nFORECAST($C202,X$205:X$216,$C$205:$C$216))))","v":99.840892653461083},null,null,null,{"$f":"IF(MAX(C205:C216)-MIN(C205:C216)<5,AVERAGEIF(C205:C216,\">0\",AB205:AB216),\nIF(FORECAST($C202,AB$205:AB$216,$C$205:$C$216)<0,0,\nIF(FORECAST($C202,AB$205:AB$216,$C$205:$C$216)>100,100,\nFORECAST($C202,AB$205:AB$216,$C$205:$C$216))))","v":0}]
[]
[null,"Survey","Year","Improved","Not shared",null,null,"Open defecation","Improved","Not shared",null,null,"Open defecation","Improved","Not shared",null,null,"Open defecation","Improved","Not shared",null,null,"Open defecation","Improved","Not shared",null,null,"Open defecation"]
[null,"MICS00",null,{"$f":"IF(ISERROR(INDIRECT(CONCATENATE($B205,\"!H122\"))),\"\",INDIRECT(CONCATENATE($B205,\"!H122\")))","v":"N/A"},{"$f":"IF(ISERROR(INDIRECT(CONCATENATE($B205,\"!H129\"))),\"\",INDIRECT(CONCATENATE($B205,\"!H129\")))","v":"N/A"},null,null,{"$f":"IF(ISERROR(INDIRECT(CONCATENATE($B205,\"!H127\"))),\"\",INDIRECT(CONCATENATE($B205,\"!H127\")))","v":"N/A"},{"$f":"IF(ISERROR(INDIRECT(CONCATENATE($B205,\"!I122\"))),\"\",INDIRECT(CONCATENATE($B205,\"!I122\")))","v":"N/A"},{"$f":"IF(ISERROR(INDIRECT(CONCATENATE($B205,\"!I129\"))),\"\",INDIRECT(CONCATENATE($B205,\"!I129\")))","v":"N/A"},null,null,{"$f":"IF(ISERROR(INDIRECT(CONCATENATE($B205,\"!I127\"))),\"\",INDIRECT(CONCATENATE($B205,\"!I127\")))","v":"N/A"},{"$f":"IF(ISERROR(INDIRECT(CONCATENATE($B205,\"!J122\"))),\"\",INDIRECT(CONCATENATE($B205,\"!J122\")))","v":"N/A"},{"$f":"IF(ISERROR(INDIRECT(CONCATENATE($B205,\"!J129\"))),\"\",INDIRECT(CONCATENATE($B205,\"!J129\")))","v":"N/A"},null,null,{"$f":"IF(ISERROR(INDIRECT(CONCATENATE($B205,\"!J127\"))),\"\",INDIRECT(CONCATENATE($B205,\"!J127\")))","v":"N/A"},{"$f":"IF(ISERROR(INDIRECT(CONCATENATE($B205,\"!K122\"))),\"\",INDIRECT(CONCATENATE($B205,\"!K122\")))","v":"N/A"},{"$f":"IF(ISERROR(INDIRECT(CONCATENATE($B205,\"!K129\"))),\"\",INDIRECT(CONCATENATE($B205,\"!K129\")))","v":"N/A"},null,null,{"$f":"IF(ISERROR(INDIRECT(CONCATENATE($B205,\"!K127\"))),\"\",INDIRECT(CONCATENATE($B205,\"!K127\")))","v":"N/A"},{"$f":"IF(ISERROR(INDIRECT(CONCATENATE($B205,\"!L122\"))),\"\",INDIRECT(CONCATENATE($B205,\"!L122\")))","v":"N/A"},{"$f":"IF(ISERROR(INDIRECT(CONCATENATE($B205,\"!L129\"))),\"\",INDIRECT(CONCATENATE($B205,\"!L129\")))","v":"N/A"},null,null,{"$f":"IF(ISERROR(INDIRECT(CONCATENATE($B205,\"!L2127\"))),\"\",INDIRECT(CONCATENATE($B205,\"!L127\")))","v":"N/A"}]
[null,"MICS06",null,"N/A","N/A",null,null,"N/A","N/A","N/A",null,null,"N/A","N/A","N/A",null,null,"N/A","N/A","N/A",null,null,"N/A","N/A","N/A",null,null,"N/A"]
[null,"MICS11",2011,94.26656361903737,86.433935289260759,null,null,0.31962622962661524,99.051806429156159,94.306849513756845,null,null,0,99.426760561260934,94.051248786764702,null,null,0,99.656756279201915,98.598615910511043,null,null,0,99.840892653461083,99.407822799361185,null,null,0]
[null,null,null,"","",null,null,"","","",null,null,"","","",null,null,"","","",null,null,"","","",null,null,""]
[null,null,null,"","",null,null,"","","",null,null,"","","",null,null,"","","",null,null,"","","",null,null,""]
[null,null,null,"","",null,null,"","","",null,null,"","","",null,null,"","","",null,null,"","","",null,null,""]
[null,null,null,"","",null,null,"","","",null,null,"","","",null,null,"","","",null,null,"","","",null,null,""]
[null,null,null,"","",null,null,"","","",null,null,"","","",null,null,"","","",null,null,"","","",null,null,""]
[null,null,null,"","",null,null,"","","",null,null,"","","",null,null,"","","",null,null,"","","",null,null,""]
[null,null,null,"","",null,null,"","","",null,null,"","","",null,null,"","","",null,null,"","","",null,null,""]
[null,null,null,"","",null,null,"","","",null,null,"","","",null,null,"","","",null,null,"","","",null,null,""]
[null,null,null,"","",null,null,"","","",null,null,"","","",null,null,"","","",null,null,"","","",null,null,""]
[]
[null,{"$f":"CONCATENATE(\"Urban use of sanitation facilities, \",C199,\"–\",C200)","v":"Urban use of sanitation facilities, 2007–2015"},null,null,null,null,null,null,null,null,null,null,null,null,null,null,null,null,"Data points used for regression"]
[]
[]
[]
[]
[]
[]
[]
[]
[]
[]
[]
[]
[]
[]
[]
[]
[]
[]
[]
[]
[]
[]
[]
[]
[]
[]
[]
[]
[]
[]
[]
[]
[]
[]
[]
[]
[]
[]
[]
[]
[]
[]
[]
[]
[]
[]
[]
[]
[]
[]
[]
[]
[]
[]
[]
[]
[]
[]
[]
[]
[]
[]
[]
[]
[]
[]
[]
[]
[]
[]
[]
[]
[]
[]
[]
[]
[]
[]
["RURAL",null,null,"Poorest",null,null,null,null,"Poor",null,null,null,null,"Middle",null,null,null,null,"Rich",null,null,null,null,"Richest"]
[null,null,null,"Improved","Basic","Limited","Unimproved","Open defecation","Improved","Basic","Limited","Unimproved","Open defecation","Improved","Basic","Limited","Unimproved","Open defecation","Improved","Basic","Limited","Unimproved","Open defecation","Improved","Basic","Limited","Unimproved","Open defecation"]
["Forecast period:",null,{"$f":"MinBase(C305:C316)","v":2007},{"$f":"IF((D301+H301)>100,D301*100/(D301+H301),D301)","v":98.066255161415},{"$f":"D299*AVERAGEIF(E305:E316,\">0\")/100","v":91.81591398401288},{"$f":"D299*(100-AVERAGEIF(E305:E316,\">0\"))/100","v":6.2503411774021309},{"$f":"100-(E299+F299+H299)","v":1.7157222697734511},{"$f":"IF((D301+H301)>100,H301*100/(D301+H301),H301)","v":0.21802256881154092},{"$f":"IF((I301+M301)>100,I301*100/(I301+M301),I301)","v":99.703337352170863},{"$f":"I299*AVERAGEIF(J305:J316,\">0\")/100","v":95.013262951914768},{"$f":"I299*(100-AVERAGEIF(J305:J316,\">0\"))/100","v":4.690074400256095},{"$f":"100-(J299+K299+M299)","v":0.29666264782913743},{"$f":"IF((I301+M301)>100,M301*100/(I301+M301),M301)","v":0},{"$f":"IF((N301+R301)>100,N301*100/(N301+R301),N301)","v":99.586609365647064},{"$f":"N299*AVERAGEIF(O305:O316,\">0\")/100","v":94.46598936758042},{"$f":"N299*(100-AVERAGEIF(O305:O316,\">0\"))/100","v":5.120619998066636},{"$f":"100-(O299+P299+R299)","v":0.41339063435295031},{"$f":"IF((N301+R301)>100,R301*100/(N301+R301),R301)","v":0},{"$f":"IF((S301+W301)>100,S301*100/(S301+W301),S301)","v":100},{"$f":"S299*AVERAGEIF(T305:T316,\">0\")/100","v":97.513915690100333},{"$f":"S299*(100-AVERAGEIF(T305:T316,\">0\"))/100","v":2.4860843098996668},{"$f":"100-(T299+U299+W299)","v":0},{"$f":"IF((S301+W301)>100,W301*100/(S301+W301),W301)","v":0},{"$f":"IF((X301+AB301)>100,X301*100/(X301+AB301),X301)","v":99.954854078905328},{"$f":"X299*AVERAGEIF(Y305:Y316,\">0\")/100","v":98.782316372237844},{"$f":"X299*(100-AVERAGEIF(Y305:Y316,\">0\"))/100","v":1.1725377066674918},{"$f":"100-(Y299+Z299+AB299)","v":4.5145921094658092E-2},{"$f":"IF((X301+AB301)>100,AB301*100/(X301+AB301),AB301)","v":0}]
[null,null,{"$f":"MaxTarget(C305:C316)","v":2015},{"$f":"IF((D302+H302)>100,D302*100/(D302+H302),D302)","v":98.066255161415},{"$f":"D300*AVERAGEIF(E305:E316,\">0\")/100","v":91.81591398401288},{"$f":"D300*(100-AVERAGEIF(E305:E316,\">0\"))/100","v":6.2503411774021309},{"$f":"100-(E300+F300+H300)","v":1.7157222697734511},{"$f":"IF((D302+H302)>100,H302*100/(D302+H302),H302)","v":0.21802256881154092},{"$f":"IF((I302+M302)>100,I302*100/(I302+M302),I302)","v":99.703337352170863},{"$f":"I300*AVERAGEIF(J305:J316,\">0\")/100","v":95.013262951914768},{"$f":"I300*(100-AVERAGEIF(J305:J316,\">0\"))/100","v":4.690074400256095},{"$f":"100-(J300+K300+M300)","v":0.29666264782913743},{"$f":"IF((I302+M302)>100,M302*100/(I302+M302),M302)","v":0},{"$f":"IF((N302+R302)>100,N302*100/(N302+R302),N302)","v":99.586609365647064},{"$f":"N300*AVERAGEIF(O305:O316,\">0\")/100","v":94.46598936758042},{"$f":"N300*(100-AVERAGEIF(O305:O316,\">0\"))/100","v":5.120619998066636},{"$f":"100-(O300+P300+R300)","v":0.41339063435295031},{"$f":"IF((N302+R302)>100,R302*100/(N302+R302),R302)","v":0},{"$f":"IF((S302+W302)>100,S302*100/(S302+W302),S302)","v":100},{"$f":"S300*AVERAGEIF(T305:T316,\">0\")/100","v":97.513915690100333},{"$f":"S300*(100-AVERAGEIF(T305:T316,\">0\"))/100","v":2.4860843098996668},{"$f":"100-(T300+U300+W300)","v":0},{"$f":"IF((S302+W302)>100,W302*100/(S302+W302),W302)","v":0},{"$f":"IF((X302+AB302)>100,X302*100/(X302+AB302),X302)","v":99.954854078905328},{"$f":"X300*AVERAGEIF(Y305:Y316,\">0\")/100","v":98.782316372237844},{"$f":"X300*(100-AVERAGEIF(Y305:Y316,\">0\"))/100","v":1.1725377066674918},{"$f":"100-(Y300+Z300+AB300)","v":4.5145921094658092E-2},{"$f":"IF((X302+AB302)>100,AB302*100/(X302+AB302),AB302)","v":0}]
["Regression period:",null,{"$f":"MinRegYear(C299,C305:C316)","v":2009},{"$f":"IF(MAX(C305:C316)-MIN(C305:C316)<5,AVERAGEIF(C305:C316,\">0\",D305:D316),\nIF(FORECAST($C301,D$305:D$316,$C$305:$C$316)<0,0,\nIF(FORECAST($C301,D$305:D$316,$C$305:$C$316)>100,100,\nFORECAST($C301,D$305:D$316,$C$305:$C$316))))","v":98.066255161415},null,null,null,{"$f":"IF(MAX(C305:C316)-MIN(C305:C316)<5,AVERAGEIF(C305:C316,\">0\",H305:H316),\nIF(FORECAST($C301,H$305:H$316,$C$305:$C$316)<0,0,\nIF(FORECAST($C301,H$305:H$316,$C$305:$C$316)>100,100,\nFORECAST($C301,H$305:H$316,$C$305:$C$316))))","v":0.21802256881154092},{"$f":"IF(MAX(C305:C316)-MIN(C305:C316)<5,AVERAGEIF(C305:C316,\">0\",I305:I316),\nIF(FORECAST($C301,I$305:I$316,$C$305:$C$316)<0,0,\nIF(FORECAST($C301,I$305:I$316,$C$305:$C$316)>100,100,\nFORECAST($C301,I$305:I$316,$C$305:$C$316))))","v":99.703337352170863},null,null,null,{"$f":"IF(MAX(C305:C316)-MIN(C305:C316)<5,AVERAGEIF(C305:C316,\">0\",M305:M316),\nIF(FORECAST($C301,M$305:M$316,$C$305:$C$316)<0,0,\nIF(FORECAST($C301,M$305:M$316,$C$305:$C$316)>100,100,\nFORECAST($C301,M$305:M$316,$C$305:$C$316))))","v":0},{"$f":"IF(MAX(C305:C316)-MIN(C305:C316)<5,AVERAGEIF(C305:C316,\">0\",N305:N316),\nIF(FORECAST($C301,N$305:N$316,$C$305:$C$316)<0,0,\nIF(FORECAST($C301,N$305:N$316,$C$305:$C$316)>100,100,\nFORECAST($C301,N$305:N$316,$C$305:$C$316))))","v":99.586609365647064},null,null,null,{"$f":"IF(MAX(C305:C316)-MIN(C305:C316)<5,AVERAGEIF(C305:C316,\">0\",R305:R316),\nIF(FORECAST($C301,R$305:R$316,$C$305:$C$316)<0,0,\nIF(FORECAST($C301,R$305:R$316,$C$305:$C$316)>100,100,\nFORECAST($C301,R$305:R$316,$C$305:$C$316))))","v":0},{"$f":"IF(MAX(C305:C316)-MIN(C305:C316)<5,AVERAGEIF(C305:C316,\">0\",S305:S316),\nIF(FORECAST($C301,S$305:S$316,$C$305:$C$316)<0,0,\nIF(FORECAST($C301,S$305:S$316,$C$305:$C$316)>100,100,\nFORECAST($C301,S$305:S$316,$C$305:$C$316))))","v":100},null,null,null,{"$f":"IF(MAX(C305:C316)-MIN(C305:C316)<5,AVERAGEIF(C305:C316,\">0\",W305:W316),\nIF(FORECAST($C301,W$305:W$316,$C$305:$C$316)<0,0,\nIF(FORECAST($C301,W$305:W$316,$C$305:$C$316)>100,100,\nFORECAST($C301,W$305:W$316,$C$305:$C$316))))","v":0},{"$f":"IF(MAX(C305:C316)-MIN(C305:C316)<5,AVERAGEIF(C305:C316,\">0\",X305:X316),\nIF(FORECAST($C301,X$305:X$316,$C$305:$C$316)<0,0,\nIF(FORECAST($C301,X$305:X$316,$C$305:$C$316)>100,100,\nFORECAST($C301,X$305:X$316,$C$305:$C$316))))","v":99.954854078905328},null,null,null,{"$f":"IF(MAX(C305:C316)-MIN(C305:C316)<5,AVERAGEIF(C305:C316,\">0\",AB305:AB316),\nIF(FORECAST($C301,AB$305:AB$316,$C$305:$C$316)<0,0,\nIF(FORECAST($C301,AB$305:AB$316,$C$305:$C$316)>100,100,\nFORECAST($C301,AB$305:AB$316,$C$305:$C$316))))","v":0}]
[null,null,{"$f":"MaxRegYear(C300,C305:C316)","v":2013},{"$f":"IF(MAX(C305:C316)-MIN(C305:C316)<5,AVERAGEIF(C305:C316,\">0\",D305:D316),\nIF(FORECAST($C302,D$305:D$316,$C$305:$C$316)<0,0,\nIF(FORECAST($C302,D$305:D$316,$C$305:$C$316)>100,100,\nFORECAST($C302,D$305:D$316,$C$305:$C$316))))","v":98.066255161415},null,null,null,{"$f":"IF(MAX(C305:C316)-MIN(C305:C316)<5,AVERAGEIF(C305:C316,\">0\",H305:H316),\nIF(FORECAST($C302,H$305:H$316,$C$305:$C$316)<0,0,\nIF(FORECAST($C302,H$305:H$316,$C$305:$C$316)>100,100,\nFORECAST($C302,H$305:H$316,$C$305:$C$316))))","v":0.21802256881154092},{"$f":"IF(MAX(C305:C316)-MIN(C305:C316)<5,AVERAGEIF(C305:C316,\">0\",I305:I316),\nIF(FORECAST($C302,I$305:I$316,$C$305:$C$316)<0,0,\nIF(FORECAST($C302,I$305:I$316,$C$305:$C$316)>100,100,\nFORECAST($C302,I$305:I$316,$C$305:$C$316))))","v":99.703337352170863},null,null,null,{"$f":"IF(MAX(C305:C316)-MIN(C305:C316)<5,AVERAGEIF(C305:C316,\">0\",M305:M316),\nIF(FORECAST($C302,M$305:M$316,$C$305:$C$316)<0,0,\nIF(FORECAST($C302,M$305:M$316,$C$305:$C$316)>100,100,\nFORECAST($C302,M$305:M$316,$C$305:$C$316))))","v":0},{"$f":"IF(MAX(C305:C316)-MIN(C305:C316)<5,AVERAGEIF(C305:C316,\">0\",N305:N316),\nIF(FORECAST($C302,N$305:N$316,$C$305:$C$316)<0,0,\nIF(FORECAST($C302,N$305:N$316,$C$305:$C$316)>100,100,\nFORECAST($C302,N$305:N$316,$C$305:$C$316))))","v":99.586609365647064},null,null,null,{"$f":"IF(MAX(C305:C316)-MIN(C305:C316)<5,AVERAGEIF(C305:C316,\">0\",R305:R316),\nIF(FORECAST($C302,R$305:R$316,$C$305:$C$316)<0,0,\nIF(FORECAST($C302,R$305:R$316,$C$305:$C$316)>100,100,\nFORECAST($C302,R$305:R$316,$C$305:$C$316))))","v":0},{"$f":"IF(MAX(C305:C316)-MIN(C305:C316)<5,AVERAGEIF(C305:C316,\">0\",S305:S316),\nIF(FORECAST($C302,S$305:S$316,$C$305:$C$316)<0,0,\nIF(FORECAST($C302,S$305:S$316,$C$305:$C$316)>100,100,\nFORECAST($C302,S$305:S$316,$C$305:$C$316))))","v":100},null,null,null,{"$f":"IF(MAX(C305:C316)-MIN(C305:C316)<5,AVERAGEIF(C305:C316,\">0\",W305:W316),\nIF(FORECAST($C302,W$305:W$316,$C$305:$C$316)<0,0,\nIF(FORECAST($C302,W$305:W$316,$C$305:$C$316)>100,100,\nFORECAST($C302,W$305:W$316,$C$305:$C$316))))","v":0},{"$f":"IF(MAX(C305:C316)-MIN(C305:C316)<5,AVERAGEIF(C305:C316,\">0\",X305:X316),\nIF(FORECAST($C302,X$305:X$316,$C$305:$C$316)<0,0,\nIF(FORECAST($C302,X$305:X$316,$C$305:$C$316)>100,100,\nFORECAST($C302,X$305:X$316,$C$305:$C$316))))","v":99.954854078905328},null,null,null,{"$f":"IF(MAX(C305:C316)-MIN(C305:C316)<5,AVERAGEIF(C305:C316,\">0\",AB305:AB316),\nIF(FORECAST($C302,AB$305:AB$316,$C$305:$C$316)<0,0,\nIF(FORECAST($C302,AB$305:AB$316,$C$305:$C$316)>100,100,\nFORECAST($C302,AB$305:AB$316,$C$305:$C$316))))","v":0}]
[]
[null,"Survey","Year","Improved","Not shared",null,null,"Open defecation","Improved","Not shared",null,null,"Open defecation","Improved","Not shared",null,null,"Open defecation","Improved","Not shared",null,null,"Open defecation","Improved","Not shared",null,null,"Open defecation"]
[null,"MICS00",null,{"$f":"IF(ISERROR(INDIRECT(CONCATENATE($B305,\"!M122\"))),\"\",INDIRECT(CONCATENATE($B305,\"!M122\")))","v":"N/A"},{"$f":"IF(ISERROR(INDIRECT(CONCATENATE($B305,\"!M129\"))),\"\",INDIRECT(CONCATENATE($B305,\"!M129\")))","v":"N/A"},null,null,{"$f":"IF(ISERROR(INDIRECT(CONCATENATE($B305,\"!M127\"))),\"\",INDIRECT(CONCATENATE($B305,\"!M127\")))","v":"N/A"},{"$f":"IF(ISERROR(INDIRECT(CONCATENATE($B305,\"!N122\"))),\"\",INDIRECT(CONCATENATE($B305,\"!N122\")))","v":"N/A"},{"$f":"IF(ISERROR(INDIRECT(CONCATENATE($B305,\"!N129\"))),\"\",INDIRECT(CONCATENATE($B305,\"!N129\")))","v":"N/A"},null,null,{"$f":"IF(ISERROR(INDIRECT(CONCATENATE($B305,\"!N127\"))),\"\",INDIRECT(CONCATENATE($B305,\"!N127\")))","v":"N/A"},{"$f":"IF(ISERROR(INDIRECT(CONCATENATE($B305,\"!O122\"))),\"\",INDIRECT(CONCATENATE($B305,\"!O122\")))","v":"N/A"},{"$f":"IF(ISERROR(INDIRECT(CONCATENATE($B305,\"!O129\"))),\"\",INDIRECT(CONCATENATE($B305,\"!O129\")))","v":"N/A"},null,null,{"$f":"IF(ISERROR(INDIRECT(CONCATENATE($B305,\"!O127\"))),\"\",INDIRECT(CONCATENATE($B305,\"!O127\")))","v":"N/A"},{"$f":"IF(ISERROR(INDIRECT(CONCATENATE($B305,\"!P122\"))),\"\",INDIRECT(CONCATENATE($B305,\"!P122\")))","v":"N/A"},{"$f":"IF(ISERROR(INDIRECT(CONCATENATE($B305,\"!P129\"))),\"\",INDIRECT(CONCATENATE($B305,\"!P129\")))","v":"N/A"},null,null,{"$f":"IF(ISERROR(INDIRECT(CONCATENATE($B305,\"!P127\"))),\"\",INDIRECT(CONCATENATE($B305,\"!P127\")))","v":"N/A"},{"$f":"IF(ISERROR(INDIRECT(CONCATENATE($B305,\"!Q122\"))),\"\",INDIRECT(CONCATENATE($B305,\"!Q122\")))","v":"N/A"},{"$f":"IF(ISERROR(INDIRECT(CONCATENATE($B305,\"!Q129\"))),\"\",INDIRECT(CONCATENATE($B305,\"!Q129\")))","v":"N/A"},null,null,{"$f":"IF(ISERROR(INDIRECT(CONCATENATE($B305,\"!Q2127\"))),\"\",INDIRECT(CONCATENATE($B305,\"!Q127\")))","v":"N/A"}]
[null,"MICS06",null,"N/A","N/A",null,null,"N/A","N/A","N/A",null,null,"N/A","N/A","N/A",null,null,"N/A","N/A","N/A",null,null,"N/A","N/A","N/A",null,null,"N/A"]
[null,"MICS11",2011,98.066255161415,93.626409852079902,null,null,0.21802256881154092,99.703337352170863,95.295970501278333,null,null,0,99.586609365647064,94.858123967986984,null,null,0,100,97.513915690100333,null,null,0,99.954854078905328,98.826932701295448,null,null,0]
[null,null,null,"","",null,null,"","","",null,null,"","","",null,null,"","","",null,null,"","","",null,null,""]
[null,null,null,"","",null,null,"","","",null,null,"","","",null,null,"","","",null,null,"","","",null,null,""]
[null,null,null,"","",null,null,"","","",null,null,"","","",null,null,"","","",null,null,"","","",null,null,""]
[null,null,null,"","",null,null,"","","",null,null,"","","",null,null,"","","",null,null,"","","",null,null,""]
[null,null,null,"","",null,null,"","","",null,null,"","","",null,null,"","","",null,null,"","","",null,null,""]
[null,null,null,"","",null,null,"","","",null,null,"","","",null,null,"","","",null,null,"","","",null,null,""]
[null,null,null,"","",null,null,"","","",null,null,"","","",null,null,"","","",null,null,"","","",null,null,""]
[null,null,null,"","",null,null,"","","",null,null,"","","",null,null,"","","",null,null,"","","",null,null,""]
[null,null,null,"","",null,null,"","","",null,null,"","","",null,null,"","","",null,null,"","","",null,null,""]
[]
[null,{"$f":"CONCATENATE(\"Rural use of sanitation facilities, \",C299,\"–\",C300)","v":"Rural use of sanitation facilities, 2007–2015"},null,null,null,null,null,null,null,null,null,null,null,null,null,null,null,null,"Data points used for regression"]

{"sheet":"Hygiene","index":3,"n_rows":91,"n_cols":25,"rows_kept":91,"cut":false,"hidden":false,"merged":[[6,1,6,7],[3,1,3,24],[4,1,4,24],[33,1,34,3],[31,6,32,9],[31,10,31,12],[31,13,31,15],[6,10,6,15],[6,18,6,23],[33,19,34,19],[31,16,31,18],[31,19,31,21],[31,22,31,24],[33,6,34,7],[33,8,34,8],[33,9,34,9],[33,15,34,15],[33,16,34,16],[33,17,34,17],[33,18,34,18],[36,6,37,7],[36,8,37,8],[36,9,37,9],[36,10,37,10],[36,11,37,11],[33,10,34,10],[33,11,34,11],[33,12,34,12],[33,13,34,13],[33,14,34,14],[33,20,34,20],[33,21,34,21],[33,22,34,22],[33,23,34,23],[33,24,34,24],[36,19,37,19],[36,20,37,20],[36,21,37,21],[36,22,37,22],[36,23,37,23],[39,12,40,12],[39,13,40,13],[39,14,40,14],[39,15,40,15],[36,18,37,18],[36,12,37,12],[36,13,37,13],[36,14,37,14],[36,15,37,15],[36,16,37,16],[36,17,37,17],[39,22,40,22],[39,23,40,23],[39,24,40,24],[31,4,32,5],[39,16,40,16],[39,17,40,17],[39,18,40,18],[39,19,40,19],[39,20,40,20],[39,21,40,21],[36,24,37,24],[39,6,40,7],[39,8,40,8],[39,9,40,9],[39,10,40,10],[39,11,40,11]]}
[]
[]
[]
[null,"Access to hygiene facilities by wealth quintile (%)"]
[null,{"$f":"IF(ISERROR(INDIRECT(CONCATENATE($E$32,\"!A2\"))),\"\",INDIRECT(CONCATENATE($E$32,\"!A2\")))","v":"Trinidad and Tobago"}]
[]
[null,{"$f":"CONCATENATE(\"National \",IF(ISERROR(INDIRECT(CONCATENATE($E$32,\"!A2\"))),\"\",INDIRECT(CONCATENATE($E$32,\"!A210\"))))","v":"National Access to hygiene facilities "},null,null,null,null,null,null,null,null,{"$f":"CONCATENATE(\"Urban \",IF(ISERROR(INDIRECT(CONCATENATE($E$32,\"!A2\"))),\"\",INDIRECT(CONCATENATE($E$32,\"!A210\"))))","v":"Urban Access to hygiene facilities "},null,null,null,null,null,null,null,{"$f":"CONCATENATE(\"Rural \",IF(ISERROR(INDIRECT(CONCATENATE($E$32,\"!A2\"))),\"\",INDIRECT(CONCATENATE($E$32,\"!A210\"))))","v":"Rural Access to hygiene facilities "}]
[]
[]
[]
[]
[]
[]
[]
[]
[]
[]
[]
[]
[]
[]
[]
[]
[]
[]
[]
[]
[]
[]
[]
[]
[null,null,null,null,{"$f":"INDEX(B88:B100,A88)","v":"MICS11"},null,{"$f":"IF(ISERROR(INDIRECT(CONCATENATE($E$32,\"!A2\"))),\"\",INDIRECT(CONCATENATE($E$32,\"!A2\")))","v":"Trinidad and Tobago"},null,null,null,"Poorest",null,null,"Poor",null,null,"Middle",null,null,"Rich",null,null,"Richest"]
[null,null,null,null,null,null,null,null,null,null,"Basic","Limited","No facility","Basic","Limited","No facility","Basic","Limited","No facility","Basic","Limited","No facility","Basic","Limited","No facility"]
[null,">>>  Select Survey :   ",null,null,null,null,"NATIONAL",null,null,{"$f":"IF(ISERROR(INDIRECT(CONCATENATE(#REF!,\"!A2\"))),\"\",INDIRECT(CONCATENATE(#REF!,\"!A210\")))","v":""},{"$f":"IF(ISERROR(INDIRECT(CONCATENATE($E$32,\"!C222\"))),\"\",INDIRECT(CONCATENATE($E$32,\"!C222\")))","v":77.017666870655518},{"$f":"IF(ISERROR(INDIRECT(CONCATENATE($E$32,\"!C223\"))),\"\",INDIRECT(CONCATENATE($E$32,\"!C223\")))","v":11.247985455494334},{"$f":"IF(ISERROR(INDIRECT(CONCATENATE($E$32,\"!C224\"))),\"\",INDIRECT(CONCATENATE($E$32,\"!C224\")))","v":11.734347673849697},{"$f":"IF(ISERROR(INDIRECT(CONCATENATE($E$32,\"!D222\"))),\"\",INDIRECT(CONCATENATE($E$32,\"!D222\")))","v":89.983926532022977},{"$f":"IF(ISERROR(INDIRECT(CONCATENATE($E$32,\"!D223\"))),\"\",INDIRECT(CONCATENATE($E$32,\"!D223\")))","v":5.7380503382846211},{"$f":"IF(ISERROR(INDIRECT(CONCATENATE($E$32,\"!D224\"))),\"\",INDIRECT(CONCATENATE($E$32,\"!D224\")))","v":4.2780231296923903},{"$f":"IF(ISERROR(INDIRECT(CONCATENATE($E$32,\"!E222\"))),\"\",INDIRECT(CONCATENATE($E$32,\"!E222\")))","v":93.275319222739995},{"$f":"IF(ISERROR(INDIRECT(CONCATENATE($E$32,\"!E223\"))),\"\",INDIRECT(CONCATENATE($E$32,\"!E223\")))","v":2.9522461455519613},{"$f":"IF(ISERROR(INDIRECT(CONCATENATE($E$32,\"!E224\"))),\"\",INDIRECT(CONCATENATE($E$32,\"!E224\")))","v":3.7724346317080117},{"$f":"IF(ISERROR(INDIRECT(CONCATENATE($E$32,\"!F222\"))),\"\",INDIRECT(CONCATENATE($E$32,\"!F222\")))","v":92.850506714727572},{"$f":"IF(ISERROR(INDIRECT(CONCATENATE($E$32,\"!F223\"))),\"\",INDIRECT(CONCATENATE($E$32,\"!F223\")))","v":2.3538545423914869},{"$f":"IF(ISERROR(INDIRECT(CONCATENATE($E$32,\"!F224\"))),\"\",INDIRECT(CONCATENATE($E$32,\"!F224\")))","v":4.7956387428809952},{"$f":"IF(ISERROR(INDIRECT(CONCATENATE($E$32,\"!G222\"))),\"\",INDIRECT(CONCATENATE($E$32,\"!G222\")))","v":94.160781086983732},{"$f":"IF(ISERROR(INDIRECT(CONCATENATE($E$32,\"!G223\"))),\"\",INDIRECT(CONCATENATE($E$32,\"!G223\")))","v":1.1485049381599695},{"$f":"IF(ISERROR(INDIRECT(CONCATENATE($E$32,\"!G224\"))),\"\",INDIRECT(CONCATENATE($E$32,\"!G224\")))","v":4.6907139748562949}]
[]
[]
[null,null,null,null,null,null,"URBAN",null,null,{"$f":"IF(ISERROR(INDIRECT(CONCATENATE(#REF!,\"!A2\"))),\"\",INDIRECT(CONCATENATE(#REF!,\"!A210\")))","v":""},{"$f":"IF(ISERROR(INDIRECT(CONCATENATE($E$32,\"!H222\"))),\"\",INDIRECT(CONCATENATE($E$32,\"!H222\")))","v":78.119211348526647},{"$f":"IF(ISERROR(INDIRECT(CONCATENATE($E$32,\"!H223\"))),\"\",INDIRECT(CONCATENATE($E$32,\"!H223\")))","v":12.501669396220219},{"$f":"IF(ISERROR(INDIRECT(CONCATENATE($E$32,\"!H224\"))),\"\",INDIRECT(CONCATENATE($E$32,\"!H224\")))","v":9.3791192552531637},{"$f":"IF(ISERROR(INDIRECT(CONCATENATE($E$32,\"!I222\"))),\"\",INDIRECT(CONCATENATE($E$32,\"!I222\")))","v":89.416186096928058},{"$f":"IF(ISERROR(INDIRECT(CONCATENATE($E$32,\"!I223\"))),\"\",INDIRECT(CONCATENATE($E$32,\"!I223\")))","v":5.4928140348513228},{"$f":"IF(ISERROR(INDIRECT(CONCATENATE($E$32,\"!I224\"))),\"\",INDIRECT(CONCATENATE($E$32,\"!I224\")))","v":5.0909998682206457},{"$f":"IF(ISERROR(INDIRECT(CONCATENATE($E$32,\"!J222\"))),\"\",INDIRECT(CONCATENATE($E$32,\"!J222\")))","v":91.590480086532651},{"$f":"IF(ISERROR(INDIRECT(CONCATENATE($E$32,\"!J223\"))),\"\",INDIRECT(CONCATENATE($E$32,\"!J223\")))","v":3.2503687223796187},{"$f":"IF(ISERROR(INDIRECT(CONCATENATE($E$32,\"!J224\"))),\"\",INDIRECT(CONCATENATE($E$32,\"!J224\")))","v":5.1591511910877994},{"$f":"IF(ISERROR(INDIRECT(CONCATENATE($E$32,\"!K222\"))),\"\",INDIRECT(CONCATENATE($E$32,\"!K222\")))","v":93.447721588221},{"$f":"IF(ISERROR(INDIRECT(CONCATENATE($E$32,\"!K223\"))),\"\",INDIRECT(CONCATENATE($E$32,\"!K223\")))","v":2.3118913472934279},{"$f":"IF(ISERROR(INDIRECT(CONCATENATE($E$32,\"!K224\"))),\"\",INDIRECT(CONCATENATE($E$32,\"!K224\")))","v":4.2403870644855912},{"$f":"IF(ISERROR(INDIRECT(CONCATENATE($E$32,\"!L222\"))),\"\",INDIRECT(CONCATENATE($E$32,\"!L222\")))","v":94.394888396911696},{"$f":"IF(ISERROR(INDIRECT(CONCATENATE($E$32,\"!L223\"))),\"\",INDIRECT(CONCATENATE($E$32,\"!L223\")))","v":0.73580308665254168},{"$f":"IF(ISERROR(INDIRECT(CONCATENATE($E$32,\"!L224\"))),\"\",INDIRECT(CONCATENATE($E$32,\"!L224\")))","v":4.869308516435793}]
[]
[]
[null,null,null,null,null,null,"RURAL",null,null,{"$f":"IF(ISERROR(INDIRECT(CONCATENATE(#REF!,\"!A2\"))),\"\",INDIRECT(CONCATENATE(#REF!,\"!A210\")))","v":""},{"$f":"IF(ISERROR(INDIRECT(CONCATENATE($E$32,\"!M222\"))),\"\",INDIRECT(CONCATENATE($E$32,\"!M222\")))","v":75.938867809032345},{"$f":"IF(ISERROR(INDIRECT(CONCATENATE($E$32,\"!M223\"))),\"\",INDIRECT(CONCATENATE($E$32,\"!M223\")))","v":10.009887481117476},{"$f":"IF(ISERROR(INDIRECT(CONCATENATE($E$32,\"!M224\"))),\"\",INDIRECT(CONCATENATE($E$32,\"!M224\")))","v":14.051244709850309},{"$f":"IF(ISERROR(INDIRECT(CONCATENATE($E$32,\"!N222\"))),\"\",INDIRECT(CONCATENATE($E$32,\"!N222\")))","v":89.613810220297978},{"$f":"IF(ISERROR(INDIRECT(CONCATENATE($E$32,\"!N223\"))),\"\",INDIRECT(CONCATENATE($E$32,\"!N223\")))","v":5.1591614055769819},{"$f":"IF(ISERROR(INDIRECT(CONCATENATE($E$32,\"!N224\"))),\"\",INDIRECT(CONCATENATE($E$32,\"!N224\")))","v":5.2270283741250809},{"$f":"IF(ISERROR(INDIRECT(CONCATENATE($E$32,\"!O222\"))),\"\",INDIRECT(CONCATENATE($E$32,\"!O222\")))","v":95.415535866308133},{"$f":"IF(ISERROR(INDIRECT(CONCATENATE($E$32,\"!O223\"))),\"\",INDIRECT(CONCATENATE($E$32,\"!O223\")))","v":2.5715075155465672},{"$f":"IF(ISERROR(INDIRECT(CONCATENATE($E$32,\"!O224\"))),\"\",INDIRECT(CONCATENATE($E$32,\"!O224\")))","v":2.0129566181452918},{"$f":"IF(ISERROR(INDIRECT(CONCATENATE($E$32,\"!P222\"))),\"\",INDIRECT(CONCATENATE($E$32,\"!P222\")))","v":94.618154772590572},{"$f":"IF(ISERROR(INDIRECT(CONCATENATE($E$32,\"!P223\"))),\"\",INDIRECT(CONCATENATE($E$32,\"!P223\")))","v":1.7958695335113275},{"$f":"IF(ISERROR(INDIRECT(CONCATENATE($E$32,\"!P224\"))),\"\",INDIRECT(CONCATENATE($E$32,\"!P224\")))","v":3.5859756938981238},{"$f":"IF(ISERROR(INDIRECT(CONCATENATE($E$32,\"!Q222\"))),\"\",INDIRECT(CONCATENATE($E$32,\"!Q222\")))","v":92.508555959241647},{"$f":"IF(ISERROR(INDIRECT(CONCATENATE($E$32,\"!Q223\"))),\"\",INDIRECT(CONCATENATE($E$32,\"!Q223\")))","v":2.4743939160449471},{"$f":"IF(ISERROR(INDIRECT(CONCATENATE($E$32,\"!Q224\"))),\"\",INDIRECT(CONCATENATE($E$32,\"!Q224\")))","v":5.0170501247133616}]
[]
[]
[]
[]
[]
[]
[]
[]
[]
[]
[]
[]
[]
[]
[]
[]
[]
[]
[]
[]
[]
[]
[]
[]
[]
[]
[]
[]
[]
[]
[]
[]
[]
[]
[]
[]
[]
[]
[]
[]
[]
[]
[]
[]
[]
[]
[]
[3,"MICS00"]
[null,"MICS06"]
[null,"MICS11"]
[null,"Template"]

{"sheet":"MICS00","index":4,"n_rows":1072,"n_cols":84,"rows_kept":1072,"cut":false,"hidden":false,"merged":[[346,52,347,52],[348,52,349,52],[350,52,351,52],[352,52,353,52],[152,52,158,52],[270,52,272,52],[273,52,275,52],[276,52,283,52],[338,54,338,58],[338,59,338,63],[338,64,338,68],[340,52,341,52],[342,52,343,52],[344,52,345,52],[221,52,223,52],[224,52,225,52],[226,52,229,52],[258,54,258,58],[258,59,258,63],[258,64,258,68],[260,52,262,52],[263,52,266,52],[267,52,269,52],[119,64,119,68],[121,52,122,52],[123,52,126,52],[127,52,128,52],[132,54,132,58],[132,59,132,63],[132,64,132,68],[134,52,138,52],[219,54,219,58],[219,59,219,63],[219,64,219,68],[13,64,13,68],[15,52,16,52],[17,52,20,52],[21,52,22,52],[26,54,26,58],[26,59,26,63],[26,64,26,68],[40,52,41,52],[55,54,55,58],[55,59,55,63],[55,64,55,68],[139,52,142,52],[143,52,146,52],[147,0,149,0],[147,52,149,52],[150,0,151,0],[150,52,151,52],[13,54,13,58],[13,59,13,63],[119,54,119,58],[119,59,119,63],[42,52,43,52],[44,52,45,52],[46,0,48,0],[46,52,48,52],[49,0,51,0],[49,52,51,52],[52,0,54,0],[52,52,54,52],[32,52,33,52],[34,52,35,52],[36,52,37,52],[38,0,39,0],[38,52,39,52],[13,2,13,6],[28,52,29,52],[30,0,31,0],[30,52,31,52],[28,0,29,0],[34,0,35,0],[36,0,37,0],[40,0,41,0],[15,0,16,0],[17,0,20,0],[21,0,22,0],[23,0,25,0],[26,2,26,6],[32,0,33,0],[57,0,71,0],[42,0,43,0],[44,0,45,0],[55,2,55,6],[121,0,122,0],[123,0,126,0],[127,0,128,0],[129,0,131,0],[132,2,132,6],[107,0,107,1],[119,2,119,6],[207,0,207,1],[143,0,146,0],[219,2,219,6],[134,0,138,0],[152,0,157,0],[139,0,142,0],[398,2,398,5],[398,7,398,10],[398,12,398,15],[221,0,223,0],[399,2,399,4],[399,7,399,8],[399,12,399,13],[400,2,401,3],[400,7,400,8],[400,12,400,13],[1024,0,1024,2],[1025,0,1025,1],[1034,0,1034,2],[401,1,444,1],[401,7,401,8],[401,12,401,13],[402,2,402,3],[402,7,402,8],[402,12,402,13],[403,2,403,3],[403,7,403,8],[403,12,403,13],[404,2,404,3],[407,2,407,3],[407,7,407,8],[407,12,407,13],[408,2,408,3],[408,7,408,8],[408,12,408,13],[404,7,404,8],[404,12,404,13],[405,2,405,3],[405,7,405,8],[405,12,405,13],[406,2,406,3],[406,7,406,8],[406,12,406,13],[411,2,411,3],[411,7,411,8],[411,12,411,13],[412,2,412,3],[412,7,412,8],[412,12,412,13],[409,2,409,3],[409,7,409,8],[409,12,409,13],[410,2,410,3],[410,7,410,8],[410,12,410,13],[415,2,415,3],[415,7,415,8],[415,12,415,13],[416,2,416,3],[416,7,416,8],[416,12,416,13],[413,2,413,3],[413,7,413,8],[413,12,413,13],[414,2,414,3],[414,7,414,8],[414,12,414,13],[419,2,419,3],[419,7,419,8],[419,12,419,13],[420,2,420,3],[420,7,420,8],[420,12,420,13],[417,2,417,3],[417,7,417,8],[417,12,417,13],[418,2,418,3],[418,7,418,8],[418,12,418,13],[423,2,423,3],[423,7,423,8],[423,12,423,13],[424,2,424,3],[424,7,424,8],[424,12,424,13],[421,2,421,3],[421,7,421,8],[421,12,421,13],[422,2,422,3],[422,7,422,8],[422,12,422,13],[427,2,427,4],[427,7,427,8],[427,12,427,13],[428,2,428,3],[428,7,428,8],[428,12,428,13],[425,2,425,3],[425,7,425,8],[425,12,425,13],[426,2,426,3],[426,7,426,8],[426,12,426,13],[431,2,431,3],[431,7,431,8],[431,12,431,13],[432,2,432,3],[432,7,432,8],[432,12,432,13],[429,2,429,3],[429,7,429,8],[429,12,429,13],[430,2,430,3],[430,7,430,8],[430,12,430,13],[435,2,435,3],[435,7,435,8],[435,12,435,13],[436,2,436,3],[436,7,436,8],[436,12,436,13],[433,2,433,3],[433,7,433,8],[433,12,433,13],[434,2,434,3],[434,7,434,8],[434,12,434,13],[439,2,439,3],[439,7,439,8],[439,12,439,13],[440,2,440,3],[440,7,440,8],[440,12,440,13],[437,2,437,3],[437,7,437,8],[437,12,437,13],[438,2,438,3],[438,7,438,8],[438,12,438,13],[443,2,443,3],[443,7,443,8],[443,12,443,13],[444,2,444,3],[444,7,444,8],[444,12,444,13],[441,2,441,3],[441,7,441,8],[441,12,441,13],[442,2,442,3],[442,7,442,8],[442,12,442,13],[447,2,447,3],[447,7,447,8],[447,12,447,13],[448,2,448,3],[448,7,448,8],[448,12,448,13],[445,2,445,3],[445,7,445,8],[445,12,445,13],[446,2,446,3],[446,7,446,8],[446,12,446,13],[451,2,451,3],[451,7,451,8],[451,12,451,13],[452,2,452,3],[452,7,452,8],[452,12,452,13],[449,2,449,3],[449,7,449,8],[449,12,449,13],[450,2,450,3],[450,7,450,8],[450,12,450,13],[456,2,456,3],[456,7,456,8],[456,12,456,13],[457,2,457,3],[457,7,457,8],[457,12,457,13],[453,2,453,6],[453,7,453,8],[453,12,453,13],[454,2,455,3],[454,4,454,6],[454,7,454,8],[454,12,454,13],[455,7,455,8],[455,12,455,13],[460,2,461,3],[460,7,460,8],[460,12,460,13],[461,7,461,8],[461,12,461,13],[462,2,462,3],[462,7,462,8],[462,12,462,13],[458,2,458,3],[458,7,458,8],[458,12,458,13],[459,2,459,4],[459,7,459,8],[459,12,459,13],[465,2,465,3],[465,7,465,8],[465,12,465,13],[466,2,466,3],[466,7,466,8],[466,12,466,13],[463,2,463,3],[463,7,463,8],[463,12,463,13],[464,2,464,3],[464,7,464,8],[464,12,464,13],[469,2,469,3],[469,7,469,8],[469,12,469,13],[470,2,470,3],[470,7,470,8],[470,12,470,13],[467,2,467,3],[467,7,467,8],[467,12,467,13],[468,2,468,3],[468,7,468,8],[468,12,468,13],[473,2,473,3],[473,7,473,8],[473,12,473,13],[474,2,474,3],[474,7,474,8],[474,12,474,13],[471,2,471,3],[471,7,471,8],[471,12,471,13],[472,2,472,3],[472,7,472,8],[472,12,472,13],[477,2,477,3],[477,7,477,8],[477,12,477,13],[478,2,478,3],[478,7,478,8],[478,12,478,13],[475,2,475,3],[475,7,475,8],[475,12,475,13],[476,2,476,3],[476,7,476,8],[476,12,476,13],[481,2,481,3],[481,7,481,8],[481,12,481,13],[482,2,482,3],[482,7,482,8],[482,12,482,13],[479,2,479,3],[479,7,479,8],[479,12,479,13],[480,2,480,3],[480,7,480,8],[480,12,480,13],[485,2,485,3],[485,7,485,8],[485,12,485,13],[486,2,486,4],[486,7,486,8],[486,12,486,13],[483,2,483,3],[483,7,483,8],[483,12,483,13],[484,2,484,3],[484,7,484,8],[484,12,484,13],[489,2,489,3],[489,7,489,8],[489,12,489,13],[490,2,490,3],[490,7,490,8],[490,12,490,13],[487,2,487,3],[487,7,487,8],[487,12,487,13],[488,2,488,3],[488,7,488,8],[488,12,488,13],[493,2,493,3],[493,7,493,8],[493,12,493,13],[494,2,494,3],[494,7,494,8],[494,12,494,13],[491,2,491,3],[491,7,491,8],[491,12,491,13],[492,2,492,3],[492,7,492,8],[492,12,492,13],[497,2,497,3],[497,7,497,8],[497,12,497,13],[498,2,498,3],[498,7,498,8],[498,12,498,13],[495,2,495,3],[495,7,495,8],[495,12,495,13],[496,2,496,3],[496,7,496,8],[496,12,496,13],[501,2,501,3],[501,7,501,8],[501,12,501,13],[502,2,502,3],[502,7,502,8],[502,12,502,13],[499,2,499,3],[499,7,499,8],[499,12,499,13],[500,2,500,3],[500,7,500,8],[500,12,500,13],[505,2,505,3],[505,7,505,8],[505,12,505,13],[506,2,506,3],[506,7,506,8],[506,12,506,13],[503,2,503,3],[503,7,503,8],[503,12,503,13],[504,2,504,3],[504,7,504,8],[504,12,504,13],[509,2,509,3],[509,7,509,8],[509,12,509,13],[510,2,510,3],[510,7,510,8],[510,12,510,13],[507,2,507,3],[507,7,507,8],[507,12,507,13],[508,2,508,3],[508,7,508,8],[508,12,508,13],[513,2,513,3],[513,7,513,8],[513,12,513,13],[514,2,514,3],[514,7,514,8],[514,12,514,13],[511,2,511,3],[511,7,511,8],[511,12,511,13],[512,2,512,3],[512,7,512,8],[512,12,512,13],[517,2,517,3],[517,7,517,8],[517,12,517,13],[518,2,518,3],[518,7,518,8],[518,12,518,13],[515,2,515,3],[515,7,515,8],[515,12,515,13],[516,2,516,3],[516,7,516,8],[516,12,516,13],[521,2,521,3],[521,7,521,8],[521,12,521,13],[522,2,522,3],[522,7,522,8],[522,12,522,13],[519,2,519,3],[519,7,519,8],[519,12,519,13],[520,2,520,3],[520,7,520,8],[520,12,520,13],[525,2,525,3],[525,7,525,8],[525,12,525,13],[526,2,526,3],[526,7,526,8],[526,12,526,13],[523,2,523,3],[523,7,523,8],[523,12,523,13],[524,2,524,3],[524,7,524,8],[524,12,524,13],[529,2,529,3],[529,7,529,8],[529,12,529,13],[530,2,530,3],[530,7,530,8],[530,12,530,13],[527,2,527,3],[527,7,527,8],[527,12,527,13],[528,2,528,3],[528,7,528,8],[528,12,528,13],[533,2,533,3],[533,7,533,8],[533,12,533,13],[534,2,534,3],[534,7,534,8],[534,12,534,13],[531,2,531,3],[531,7,531,8],[531,12,531,13],[532,2,532,3],[532,7,532,8],[532,12,532,13],[537,2,537,3],[537,7,537,8],[537,12,537,13],[538,2,538,3],[538,7,538,8],[538,12,538,13],[535,2,535,3],[535,7,535,8],[535,12,535,13],[536,2,536,3],[536,7,536,8],[536,12,536,13],[541,2,541,3],[541,7,541,8],[541,12,541,13],[542,2,542,3],[542,7,542,8],[542,12,542,13],[539,2,539,3],[539,7,539,8],[539,12,539,13],[540,2,540,3],[540,7,540,8],[540,12,540,13],[545,2,545,3],[545,7,545,8],[545,12,545,13],[546,2,546,3],[546,7,546,8],[546,12,546,13],[543,2,543,3],[543,7,543,8],[543,12,543,13],[544,2,544,3],[544,7,544,8],[544,12,544,13],[549,2,549,3],[549,7,549,8],[549,12,549,13],[550,2,550,3],[550,7,550,8],[550,12,550,13],[547,2,547,3],[547,7,547,8],[547,12,547,13],[548,2,548,3],[548,7,548,8],[548,12,548,13],[553,2,553,3],[553,7,553,8],[553,12,553,13],[554,2,554,3],[554,7,554,8],[554,12,554,13],[551,2,551,3],[551,7,551,8],[551,12,551,13],[552,2,552,3],[552,7,552,8],[552,12,552,13],[557,2,557,3],[557,7,557,8],[557,12,557,13],[558,2,558,3],[558,7,558,8],[558,12,558,13],[555,2,555,3],[555,7,555,8],[555,12,555,13],[556,2,556,3],[556,7,556,8],[556,12,556,13],[561,2,561,3],[561,7,561,8],[561,12,561,13],[562,2,562,3],[562,7,562,8],[562,12,562,13],[559,2,559,3],[559,7,559,8],[559,12,559,13],[560,2,560,3],[560,7,560,8],[560,12,560,13],[565,2,565,3],[565,7,565,8],[565,12,565,13],[566,2,566,3],[566,7,566,8],[566,12,566,13],[563,2,563,3],[563,7,563,8],[563,12,563,13],[564,2,564,3],[564,7,564,8],[564,12,564,13],[569,2,569,3],[569,7,569,8],[569,12,569,13],[570,2,570,3],[570,7,570,8],[570,12,570,13],[567,2,567,3],[567,7,567,8],[567,12,567,13],[568,2,568,3],[568,7,568,8],[568,12,568,13],[573,2,573,3],[573,7,573,8],[573,12,573,13],[574,2,574,3],[574,7,574,8],[574,12,574,13],[571,2,571,3],[571,7,571,8],[571,12,571,13],[572,2,572,3],[572,7,572,8],[572,12,572,13],[577,2,577,3],[577,7,577,8],[577,12,577,13],[578,2,578,3],[578,7,578,8],[578,12,578,13],[575,2,575,3],[575,7,575,8],[575,12,575,13],[576,2,576,3],[576,7,576,8],[576,12,576,13],[581,2,581,3],[581,7,581,8],[581,12,581,13],[582,2,582,3],[582,7,582,8],[582,12,582,13],[579,2,579,3],[579,7,579,8],[579,12,579,13],[580,2,580,3],[580,7,580,8],[580,12,580,13],[585,2,585,3],[585,7,585,8],[585,12,585,13],[586,2,586,3],[586,7,586,8],[586,12,586,13],[583,2,583,3],[583,7,583,8],[583,12,583,13],[584,2,584,3],[584,7,584,8],[584,12,584,13],[589,2,589,3],[589,7,589,8],[589,12,589,13],[590,2,590,3],[590,7,590,8],[590,12,590,13],[587,2,587,3],[587,7,587,8],[587,12,587,13],[588,2,588,3],[588,7,588,8],[588,12,588,13],[593,2,593,3],[593,7,593,8],[593,12,593,13],[594,2,594,3],[594,7,594,8],[594,12,594,13],[591,2,591,3],[591,7,591,8],[591,12,591,13],[592,2,592,3],[592,7,592,8],[592,12,592,13],[597,2,597,3],[597,7,597,8],[597,12,597,13],[598,2,598,3],[598,7,598,8],[598,12,598,13],[595,2,595,3],[595,7,595,8],[595,12,595,13],[596,2,596,3],[596,7,596,8],[596,12,596,13],[601,2,601,3],[601,7,601,8],[601,12,601,13],[602,2,602,3],[602,7,602,8],[602,12,602,13],[599,2,599,3],[599,7,599,8],[599,12,599,13],[600,2,600,3],[600,7,600,8],[600,12,600,13],[605,2,605,3],[605,7,605,8],[605,12,605,13],[606,2,606,3],[606,7,606,8],[606,12,606,13],[603,2,603,3],[603,7,603,8],[603,12,603,13],[604,2,604,3],[604,7,604,8],[604,12,604,13],[609,2,609,3],[609,7,609,8],[609,12,609,13],[610,2,610,3],[610,7,610,8],[610,12,610,13],[607,2,607,3],[607,7,607,8],[607,12,607,13],[608,2,608,3],[608,7,608,8],[608,12,608,13],[613,2,613,3],[613,7,613,8],[613,12,613,13],[614,2,614,3],[614,7,614,8],[614,12,614,13],[611,2,611,3],[611,7,611,8],[611,12,611,13],[612,2,612,3],[612,7,612,8],[612,12,612,13],[617,2,617,3],[617,7,617,8],[617,12,617,13],[618,2,618,3],[618,7,618,8],[618,12,618,13],[615,2,615,3],[615,7,615,8],[615,12,615,13],[616,2,616,3],[616,7,616,8],[616,12,616,13],[621,2,621,3],[621,7,621,8],[621,12,621,13],[622,2,622,3],[622,7,622,8],[622,12,622,13],[619,2,619,3],[619,7,619,8],[619,12,619,13],[620,2,620,3],[620,7,620,8],[620,12,620,13],[625,2,625,3],[625,7,625,8],[625,12,625,13],[626,2,626,3],[626,7,626,8],[626,12,626,13],[623,2,623,3],[623,7,623,8],[623,12,623,13],[624,2,624,3],[624,7,624,8],[624,12,624,13],[629,2,629,3],[629,7,629,8],[629,12,629,13],[630,2,630,3],[630,7,630,8],[630,12,630,13],[627,2,627,3],[627,7,627,8],[627,12,627,13],[628,2,628,3],[628,7,628,8],[628,12,628,13],[633,2,633,3],[633,7,633,8],[633,12,633,13],[634,2,634,3],[634,7,634,8],[634,12,634,13],[631,2,631,3],[631,7,631,8],[631,12,631,13],[632,2,632,3],[632,7,632,8],[632,12,632,13],[637,2,637,3],[637,7,637,8],[637,12,637,13],[638,2,638,3],[638,7,638,8],[638,12,638,13],[635,2,635,3],[635,7,635,8],[635,12,635,13],[636,2,636,3],[636,7,636,8],[636,12,636,13],[641,2,641,3],[641,7,641,8],[641,12,641,13],[642,2,642,3],[642,7,642,8],[642,12,642,13],[639,2,639,3],[639,7,639,8],[639,12,639,13],[640,2,640,3],[640,7,640,8],[640,12,640,13],[645,2,645,3],[645,7,645,8],[645,12,645,13],[646,2,646,3],[646,7,646,8],[646,12,646,13],[643,2,643,3],[643,7,643,8],[643,12,643,13],[644,2,644,3],[644,7,644,8],[644,12,644,13],[649,2,649,3],[649,7,649,8],[649,12,649,13],[650,2,650,3],[650,7,650,8],[650,12,650,13],[647,2,647,3],[647,7,647,8],[647,12,647,13],[648,2,648,3],[648,7,648,8],[648,12,648,13],[653,2,653,3],[653,7,653,8],[653,12,653,13],[654,2,654,3],[654,7,654,8],[654,12,654,13],[651,2,651,3],[651,7,651,8],[651,12,651,13],[652,2,652,3],[652,7,652,8],[652,12,652,13],[657,2,657,3],[657,7,657,8],[657,12,657,13],[658,2,658,3],[658,7,658,8],[658,12,658,13],[655,2,655,3],[655,7,655,8],[655,12,655,13],[656,2,656,3],[656,7,656,8],[656,12,656,13],[661,2,661,3],[661,7,661,8],[661,12,661,13],[662,2,662,3],[662,7,662,8],[662,12,662,13],[659,2,659,3],[659,7,659,8],[659,12,659,13],[660,2,660,3],[660,7,660,8],[660,12,660,13],[665,2,665,3],[665,7,665,8],[665,12,665,13],[666,2,666,3],[666,7,666,8],[666,12,666,13],[663,2,663,3],[663,7,663,8],[663,12,663,13],[664,2,664,3],[664,7,664,8],[664,12,664,13],[669,2,669,3],[669,7,669,8],[669,12,669,13],[670,2,670,3],[670,7,670,8],[670,12,670,13],[667,2,667,3],[667,7,667,8],[667,12,667,13],[668,2,668,3],[668,7,668,8],[668,12,668,13],[673,2,673,3],[673,7,673,8],[673,12,673,13],[674,2,674,3],[674,7,674,8],[674,12,674,13],[671,2,671,3],[671,7,671,8],[671,12,671,13],[672,2,672,3],[672,7,672,8],[672,12,672,13],[677,2,677,3],[677,7,677,8],[677,12,677,13],[678,2,678,3],[678,7,678,8],[678,12,678,13],[675,2,675,3],[675,7,675,8],[675,12,675,13],[676,2,676,3],[676,7,676,8],[676,12,676,13],[681,2,681,3],[681,7,681,8],[681,12,681,13],[682,2,682,3],[682,7,682,8],[682,12,682,13],[679,2,679,3],[679,7,679,8],[679,12,679,13],[680,2,680,3],[680,7,680,8],[680,12,680,13],[685,2,685,3],[685,7,685,8],[685,12,685,13],[686,2,686,3],[686,7,686,8],[686,12,686,13],[683,2,683,3],[683,7,683,8],[683,12,683,13],[684,2,684,3],[684,7,684,8],[684,12,684,13],[689,2,689,3],[689,7,689,8],[689,12,689,13],[690,2,690,3],[690,7,690,8],[690,12,690,13],[687,2,687,3],[687,7,687,8],[687,12,687,13],[688,2,688,3],[688,7,688,8],[688,12,688,13],[693,2,693,3],[693,7,693,8],[693,12,693,13],[694,2,694,3],[694,7,694,8],[694,12,694,13],[691,2,691,3],[691,7,691,8],[691,12,691,13],[692,2,692,3],[692,7,692,8],[692,12,692,13],[697,2,697,3],[697,7,697,8],[697,12,697,13],[698,2,698,3],[698,7,698,8],[698,12,698,13],[695,2,695,3]],"merged_total":1005,"flags":["merged_cut"]}
[]
[{"$f":"A1026","v":"Trinidad and Tobago"}]
[{"$f":"A1034","v":"2000"}]
["Use of drinking water sources"]
[" by wealth quintile and sub-national region"]
["Notes:"]
["WHO/UNICEF JMP customised wealth index excludes water,"]
[" sanitation and hygiene assets."]
["Survey used for analysis:",{"$f":"A1025","v":"MICS00"}]
[{"$f":"B1028","v":""}]
[{"$f":"B1027","v":""}]
[]
[]
["Use of drinking water sources",null,"NATIONAL wealth index quintile",null,null,null,null,null,null,null,null,null,null,null,null,null,null,"SUB-REGIONS:",null,null,null,null,null,null,null,null,null,null,null,null,null,null,null,null,null,null,null,null,null,null,null,null,null,null,null,null,null,null,null,null,null,null,"Raw numbers of respondents:","Use of drinking water sources","NATIONAL wealth index quintile",null,null,null,null,"URBAN wealth index quintile",null,null,null,null,"RURAL wealth index quintile",null,null,null,null,"SUB-REGIONS:"]
["Weighted percentage (used in graphs)",null,"Poorest","Poor","Middle","Rich","Richest",null,null,null,null,null,null,null,null,null,null,"arima borough","caroni","chaguanas borough","diego martin","nariva/mayaro","port of spain","pt. fortin borough","rest of st. george","san fernando","st anns","st. andrew/st. david","st. patrick","tacarigua","tobago","victoria",null,null,null,null,null,null,null,null,null,null,null,null,null,null,null,null,null,null,null,null,"Water data, raw numbers (weighted)",null,"Poorest","Poor","Middle","Rich","Richest","Poorest","Poor","Middle","Rich","Richest","Poorest","Poor","Middle","Rich","Richest","arima borough","caroni","chaguanas borough","diego martin","nariva/mayaro","port of spain","pt. fortin borough","rest of st. george","san fernando","st anns","st. andrew/st. david","st. patrick","tacarigua","tobago","victoria"]
["Water","Improved",90.976933514246952,94.78375701551667,95.389408099688481,98.078219824679707,98.813559322033896,"N/A","N/A","N/A","N/A","N/A","N/A","N/A","N/A","N/A","N/A",95.356037151702793,91.885441527446304,93.902439024390233,95.679012345679013,99.043062200956939,99.387442572741193,98.755186721991706,90.353697749196144,97.87556904400607,95.531587057010782,96.397694524495677,96.928982725527831,97.449313276651409,94.830659536541901,95.464956481905645,null,null,null,null,null,null,null,null,null,null,null,null,null,null,null,null,null,null,null,null,"Water","Improved","N/A","N/A","N/A","N/A","N/A","N/A","N/A","N/A","N/A","N/A","N/A","N/A","N/A","N/A","N/A","N/A","N/A","N/A","N/A","N/A","N/A","N/A","N/A","N/A","N/A","N/A","N/A","N/A","N/A","N/A"]
[null,"Not Improved",9.0230664857530538,5.216242984483328,4.610591900311527,1.9217801753202968,1.1864406779661016,"N/A","N/A","N/A","N/A","N/A","N/A","N/A","N/A","N/A","N/A",4.643962848297214,8.1145584725536999,6.0975609756097562,4.3209876543209873,0.9569377990430622,0.61255742725880558,1.2448132780082988,9.6463022508038581,2.1244309559939301,4.4684129429892137,3.6023054755043229,3.0710172744721689,2.5506867233485937,5.169340463458111,4.5350435180943656,null,null,null,null,null,null,null,null,null,null,null,null,null,null,null,null,null,null,null,null,null,"Not Improved","N/A","N/A","N/A","N/A","N/A","N/A","N/A","N/A","N/A","N/A","N/A","N/A","N/A","N/A","N/A","N/A","N/A","N/A","N/A","N/A","N/A","N/A","N/A","N/A","N/A","N/A","N/A","N/A","N/A","N/A"]
["Water ladder","Basic",87.68656716417911,93.859359524595575,93.890274314214466,97.737250928740295,98.813559322033896,"N/A","N/A","N/A","N/A","N/A","N/A","N/A","N/A","N/A","N/A",95.356037151702793,91.885441527446304,93.360433604336052,93.75,99.043062200956939,97.856049004594183,93.7759336099585,90.353697749196144,97.87556904400607,94.69072164948453,94.236311239193085,96.865003198976325,96.664486592544137,94.29590017825312,91.57123224919836,null,null,null,null,null,null,null,null,null,null,null,null,null,null,null,null,null,null,null,null,"Water ladder","Basic","N/A","N/A","N/A","N/A","N/A","N/A","N/A","N/A","N/A","N/A","N/A","N/A","N/A","N/A","N/A","N/A","N/A","N/A","N/A","N/A","N/A","N/A","N/A","N/A","N/A","N/A","N/A","N/A","N/A","N/A"]
[null,"Limited",3.2903663500678428,0.92439749092109602,1.4962593516209477,0.33772374197906113,0,"N/A","N/A","N/A","N/A","N/A","N/A","N/A","N/A","N/A","N/A",0,0,0.54200542005420049,1.9290123456790123,0,1.5313935681470139,4.9792531120331951,0,0,0.82474226804123718,2.1613832853025938,6.3979526551503518E-2,0.78482668410725964,0.53475935828876997,3.8937242327072838,null,null,null,null,null,null,null,null,null,null,null,null,null,null,null,null,null,null,null,null,null,"Limited","N/A","N/A","N/A","N/A","N/A","N/A","N/A","N/A","N/A","N/A","N/A","N/A","N/A","N/A","N/A","N/A","N/A","N/A","N/A","N/A","N/A","N/A","N/A","N/A","N/A","N/A","N/A","N/A","N/A","N/A"]
[null,"Unimproved",7.08955223880597,3.565533179267085,3.8965087281795512,1.6886187098953058,1.0508474576271187,"N/A","N/A","N/A","N/A","N/A","N/A","N/A","N/A","N/A","N/A",4.643962848297214,8.1145584725536999,6.0975609756097562,0.69444444444444442,0,0.61255742725880558,1.2448132780082988,9.6463022508038581,2.1244309559939301,1.7525773195876289,1.5850144092219021,2.5591810620601407,1.5696533682145193,5.169340463458111,4.5350435180943656,null,null,null,null,null,null,null,null,null,null,null,null,null,null,null,null,null,null,null,null,null,"Unimproved","N/A","N/A","N/A","N/A","N/A","N/A","N/A","N/A","N/A","N/A","N/A","N/A","N/A","N/A","N/A","N/A","N/A","N/A","N/A","N/A","N/A","N/A","N/A","N/A","N/A","N/A","N/A","N/A","N/A","N/A"]
[null,"Surface water",1.9335142469470827,1.6507098052162428,0.71695760598503744,0.2364066193853428,0.13559322033898305,"N/A","N/A","N/A","N/A","N/A","N/A","N/A","N/A","N/A","N/A",0,0,0,3.6265432098765435,0.9569377990430622,0,0,0,0,2.731958762886598,2.0172910662824206,0.51183621241202815,0.98103335513407453,0,0,null,null,null,null,null,null,null,null,null,null,null,null,null,null,null,null,null,null,null,null,null,"Surface water","N/A","N/A","N/A","N/A","N/A","N/A","N/A","N/A","N/A","N/A","N/A","N/A","N/A","N/A","N/A","N/A","N/A","N/A","N/A","N/A","N/A","N/A","N/A","N/A","N/A","N/A","N/A","N/A","N/A","N/A"]
["Improved water point at more than 30 minutes","Yes",3.6167039522744222,0.9752699407871821,1.5686274509803921,0.34435261707988984,0,"N/A","N/A","N/A","N/A","N/A","N/A","N/A","N/A","N/A","N/A",0,0,0.57720057720057716,2.0161290322580645,0,1.5408320493066257,5.0420168067226889,0,0,0.86346465191581223,2.2421524663677128,6.6006600660066E-2,0.80536912751677858,0.56390977443609014,4.0786948176583495,null,null,null,null,null,null,null,null,null,null,null,null,null,null,null,null,null,null,null,null,"Improved water point at more than 30 minutes","Yes","N/A","N/A","N/A","N/A","N/A","N/A","N/A","N/A","N/A","N/A","N/A","N/A","N/A","N/A","N/A","N/A","N/A","N/A","N/A","N/A","N/A","N/A","N/A","N/A","N/A","N/A","N/A","N/A","N/A","N/A"]
[null,"No",96.38329604772558,99.024730059212814,98.431372549019599,99.655647382920108,100,"N/A","N/A","N/A","N/A","N/A","N/A","N/A","N/A","N/A","N/A",100,100,99.422799422799429,97.983870967741936,100,98.45916795069337,94.9579831932773,100,100,99.13653534808418,97.757847533632287,99.93399339933994,99.194630872483231,99.436090225563916,95.921305182341655,null,null,null,null,null,null,null,null,null,null,null,null,null,null,null,null,null,null,null,null,null,"No","N/A","N/A","N/A","N/A","N/A","N/A","N/A","N/A","N/A","N/A","N/A","N/A","N/A","N/A","N/A","N/A","N/A","N/A","N/A","N/A","N/A","N/A","N/A","N/A","N/A","N/A","N/A","N/A","N/A","N/A"]
["Manually calculated ratios","Improved wells"]
[null,"Improved springs"]
[null,"Other"]
[null,null,"NATIONAL wealth index quintile",null,null,null,null,null,null,null,null,null,null,null,null,null,null,"SUB-REGIONS:",null,null,null,null,null,null,null,null,null,null,null,null,null,null,null,null,null,null,null,null,null,null,null,null,null,null,null,null,null,null,null,null,null,null,"Raw numbers of respondents:","Use of drinking water sources","NATIONAL wealth index quintile",null,null,null,null,"URBAN wealth index quintile",null,null,null,null,"RURAL wealth index quintile",null,null,null,null,"SUB-REGIONS:"]
["Percentage based on weighted population",null,"Poorest","Poor","Middle","Rich","Richest",null,null,null,null,null,null,null,null,null,null,"arima borough","caroni","chaguanas borough","diego martin","nariva/mayaro","port of spain","pt. fortin borough","rest of st. george","san fernando","st anns","st. andrew/st. david","st. patrick","tacarigua","tobago","victoria",null,null,null,null,null,null,null,null,null,null,null,null,null,null,null,null,null,null,null,null,"Water data, raw numbers (weighted)",null,"Poorest","Poor","Middle","Rich","Richest","Poorest","Poor","Middle","Rich","Richest","Poorest","Poor","Middle","Rich","Richest","arima borough","caroni","chaguanas borough","diego martin","nariva/mayaro","port of spain","pt. fortin borough","rest of st. george","san fernando","st anns","st. andrew/st. david","st. patrick","tacarigua","tobago","victoria"]
["Piped water","Yes",68.147896879240164,83.591944536150535,88.442367601246104,92.447741065407968,95.627118644067792,"N/A","N/A","N/A","N/A","N/A","N/A","N/A","N/A","N/A","N/A",94.427244582043343,83.890214797136039,88.888888888888886,85.18518518518519,52.87081339712919,99.387442572741193,92.116182572614107,88.745980707395503,96.509863429438553,91.884951206985107,89.625360230547543,74.28023032629558,95.487246566383249,92.335115864527623,75.217590471827762,null,null,null,null,null,null,null,null,null,null,null,null,null,null,null,null,null,null,null,null,"Piped water","Yes","N/A","N/A","N/A","N/A","N/A","N/A","N/A","N/A","N/A","N/A","N/A","N/A","N/A","N/A","N/A","N/A","N/A","N/A","N/A","N/A","N/A","N/A","N/A","N/A","N/A","N/A","N/A","N/A","N/A","N/A"]
[null,"No",31.852103120759839,16.408055463849454,11.557632398753894,7.552258934592043,4.3728813559322033,"N/A","N/A","N/A","N/A","N/A","N/A","N/A","N/A","N/A","N/A",5.5727554179566559,16.109785202863961,11.111111111111111,14.814814814814813,47.129186602870817,0.61255742725880558,7.8838174273858916,11.254019292604502,3.4901365705614569,8.1150487930148945,10.37463976945245,25.719769673704413,4.5127534336167434,7.66488413547237,24.782409528172238,null,null,null,null,null,null,null,null,null,null,null,null,null,null,null,null,null,null,null,null,null,"No","N/A","N/A","N/A","N/A","N/A","N/A","N/A","N/A","N/A","N/A","N/A","N/A","N/A","N/A","N/A","N/A","N/A","N/A","N/A","N/A","N/A","N/A","N/A","N/A","N/A","N/A","N/A","N/A","N/A","N/A"]
["Piped water on premises","Yes",41.926729986431475,71.739848134697922,80.373831775700936,89.345920431557659,95.186440677966104,"N/A","N/A","N/A","N/A","N/A","N/A","N/A","N/A","N/A","N/A",94.427244582043343,77.028639618138428,86.58536585365853,66.743827160493822,52.87081339712919,82.542113323124042,75.103734439834028,84.726688102893888,92.41274658573596,73.70313302516692,72.334293948126799,66.538707613563659,89.601046435578809,87.878787878787875,65.50618415025194,null,null,null,null,null,null,null,null,null,null,null,null,null,null,null,null,null,null,null,null,"Piped water on premises","Yes","N/A","N/A","N/A","N/A","N/A","N/A","N/A","N/A","N/A","N/A","N/A","N/A","N/A","N/A","N/A","N/A","N/A","N/A","N/A","N/A","N/A","N/A","N/A","N/A","N/A","N/A","N/A","N/A","N/A","N/A"]
[null,"No",58.073270013568525,28.260151865302081,19.626168224299064,10.654079568442347,4.8135593220338979,"N/A","N/A","N/A","N/A","N/A","N/A","N/A","N/A","N/A","N/A",5.5727554179566559,22.971360381861576,13.414634146341465,33.256172839506171,47.129186602870817,17.457886676875958,24.896265560165975,15.27331189710611,7.587253414264036,26.296866974833076,27.665706051873201,33.461292386436341,10.398953564421189,12.121212121212121,34.493815849748053,null,null,null,null,null,null,null,null,null,null,null,null,null,null,null,null,null,null,null,null,null,"No","N/A","N/A","N/A","N/A","N/A","N/A","N/A","N/A","N/A","N/A","N/A","N/A","N/A","N/A","N/A","N/A","N/A","N/A","N/A","N/A","N/A","N/A","N/A","N/A","N/A","N/A","N/A","N/A","N/A","N/A"]
["Piped water into dwelling","Yes","N/A","N/A","N/A","N/A","N/A","N/A","N/A","N/A","N/A","N/A","N/A","N/A","N/A","N/A","N/A","N/A","N/A","N/A","N/A","N/A","N/A","N/A","N/A","N/A","N/A","N/A","N/A","N/A","N/A","N/A",null,null,null,null,null,null,null,null,null,null,null,null,null,null,null,null,null,null,null,null,"Piped water into dwelling","Yes","N/A","N/A","N/A","N/A","N/A","N/A","N/A","N/A","N/A","N/A","N/A","N/A","N/A","N/A","N/A","N/A","N/A","N/A","N/A","N/A","N/A","N/A","N/A","N/A","N/A","N/A","N/A","N/A","N/A","N/A"]
[null,"No","N/A","N/A","N/A","N/A","N/A","N/A","N/A","N/A","N/A","N/A","N/A","N/A","N/A","N/A","N/A","N/A","N/A","N/A","N/A","N/A","N/A","N/A","N/A","N/A","N/A","N/A","N/A","N/A","N/A","N/A",null,null,null,null,null,null,null,null,null,null,null,null,null,null,null,null,null,null,null,null,null,"No","N/A","N/A","N/A","N/A","N/A","N/A","N/A","N/A","N/A","N/A","N/A","N/A","N/A","N/A","N/A","N/A","N/A","N/A","N/A","N/A","N/A","N/A","N/A","N/A","N/A","N/A","N/A","N/A","N/A","N/A"]
["Water source on premises","Yes",55.868385345997282,79.498184219214266,86.884735202492209,94.30209035738369,97.457627118644069,"N/A","N/A","N/A","N/A","N/A","N/A","N/A","N/A","N/A","N/A",97.213622291021679,88.484486873508345,87.53387533875339,75.771604938271608,58.133971291866025,82.542113323124042,79.668049792531122,91.479099678456592,95.447647951441581,76.887519260400623,80.835734870316998,92.386436340371077,91.824722040549375,88.591800356506241,69.445716903344021,null,null,null,null,null,null,null,null,null,null,null,null,null,null,null,null,null,null,null,null,"Water source on premises","Yes","N/A","N/A","N/A","N/A","N/A","N/A","N/A","N/A","N/A","N/A","N/A","N/A","N/A","N/A","N/A","N/A","N/A","N/A","N/A","N/A","N/A","N/A","N/A","N/A","N/A","N/A","N/A","N/A","N/A","N/A"]
[null,"No",44.131614654002718,20.501815780785737,13.115264797507789,5.6979096426163185,2.5423728813559325,"N/A","N/A","N/A","N/A","N/A","N/A","N/A","N/A","N/A","N/A",2.7863777089783279,11.515513126491648,12.466124661246612,24.228395061728396,41.866028708133975,17.457886676875958,20.331950207468878,8.520900321543408,4.5523520485584212,23.112480739599384,19.164265129682999,7.6135636596289196,8.1752779594506215,11.408199643493761,30.554283096655976,null,null,null,null,null,null,null,null,null,null,null,null,null,null,null,null,null,null,null,null,null,"No","N/A","N/A","N/A","N/A","N/A","N/A","N/A","N/A","N/A","N/A","N/A","N/A","N/A","N/A","N/A","N/A","N/A","N/A","N/A","N/A","N/A","N/A","N/A","N/A","N/A","N/A","N/A","N/A","N/A","N/A"]
["Improved Water source on premises","Yes",59.246830723340793,82.201323580633925,89.875898105813192,95.118597456170505,98.044596912521442,"N/A","N/A","N/A","N/A","N/A","N/A","N/A","N/A","N/A","N/A",100,91.558441558441558,92.20779220779221,78.790322580645167,58.695652173913047,83.050847457627114,80.672268907563023,95.55160142348754,97.054263565891475,79.784946236559136,82.959641255605376,93.531353135313537,93.489932885906029,92.669172932330824,72.600767754318625,null,null,null,null,null,null,null,null,null,null,null,null,null,null,null,null,null,null,null,null,"Improved water source on premises","Yes","N/A","N/A","N/A","N/A","N/A","N/A","N/A","N/A","N/A","N/A","N/A","N/A","N/A","N/A","N/A","N/A","N/A","N/A","N/A","N/A","N/A","N/A","N/A","N/A","N/A","N/A","N/A","N/A","N/A","N/A"]
[null,"No",40.753169276659207,17.798676419366075,10.124101894186806,4.8814025438294948,1.9554030874785591,"N/A","N/A","N/A","N/A","N/A","N/A","N/A","N/A","N/A","N/A",0,8.4415584415584419,7.7922077922077921,21.20967741935484,41.304347826086953,16.949152542372879,19.327731092436977,4.4483985765124556,2.945736434108527,20.21505376344086,17.040358744394617,6.4686468646864688,6.5100671140939594,7.3308270676691727,27.399232245681382,null,null,null,null,null,null,null,null,null,null,null,null,null,null,null,null,null,null,null,null,null,"No","N/A","N/A","N/A","N/A","N/A","N/A","N/A","N/A","N/A","N/A","N/A","N/A","N/A","N/A","N/A","N/A","N/A","N/A","N/A","N/A","N/A","N/A","N/A","N/A","N/A","N/A","N/A","N/A","N/A","N/A"]
["Piped water on premises available when needed","Yes","N/A","N/A","N/A","N/A","N/A","N/A","N/A","N/A","N/A","N/A","N/A","N/A","N/A","N/A","N/A","N/A","N/A","N/A","N/A","N/A","N/A","N/A","N/A","N/A","N/A","N/A","N/A","N/A","N/A","N/A",null,null,null,null,null,null,null,null,null,null,null,null,null,null,null,null,null,null,null,null,"Piped water on premises available when needed","Yes","N/A","N/A","N/A","N/A","N/A","N/A","N/A","N/A","N/A","N/A","N/A","N/A","N/A","N/A","N/A","N/A","N/A","N/A","N/A","N/A","N/A","N/A","N/A","N/A","N/A","N/A","N/A","N/A","N/A","N/A"]
[null,"No","N/A","N/A","N/A","N/A","N/A","N/A","N/A","N/A","N/A","N/A","N/A","N/A","N/A","N/A","N/A","N/A","N/A","N/A","N/A","N/A","N/A","N/A","N/A","N/A","N/A","N/A","N/A","N/A","N/A","N/A",null,null,null,null,null,null,null,null,null,null,null,null,null,null,null,null,null,null,null,null,null,"No","N/A","N/A","N/A","N/A","N/A","N/A","N/A","N/A","N/A","N/A","N/A","N/A","N/A","N/A","N/A","N/A","N/A","N/A","N/A","N/A","N/A","N/A","N/A","N/A","N/A","N/A","N/A","N/A","N/A","N/A"]
["Water point at more than 30 minutes","Yes",4.1482488949336958,1.1900826446280992,2.0625,0.33772374197906113,0,"N/A","N/A","N/A","N/A","N/A","N/A","N/A","N/A","N/A","N/A",0,0.29832935560859186,0.54200542005420049,2.4691358024691357,0,1.6845329249617151,4.9792531120331951,0,0,0.82644628099173556,2.7377521613832854,6.4267352185089971E-2,0.85022890778286464,0.53475935828876997,5.4054054054054053,null,null,null,null,null,null,null,null,null,null,null,null,null,null,null,null,null,null,null,null,"Water point at more than 30 minutes","Yes","N/A","N/A","N/A","N/A","N/A","N/A","N/A","N/A","N/A","N/A","N/A","N/A","N/A","N/A","N/A","N/A","N/A","N/A","N/A","N/A","N/A","N/A","N/A","N/A","N/A","N/A","N/A","N/A","N/A","N/A"]
[null,"No",95.851751105066313,98.809917355371908,97.9375,99.662276258020938,100,"N/A","N/A","N/A","N/A","N/A","N/A","N/A","N/A","N/A","N/A",100,99.701670644391399,99.45799457994579,97.53086419753086,100,98.315467075038285,95.020746887966794,100,100,99.173553719008268,97.262247838616716,99.935732647814916,99.149771092217136,99.465240641711233,94.594594594594597,null,null,null,null,null,null,null,null,null,null,null,null,null,null,null,null,null,null,null,null,null,"No","N/A","N/A","N/A","N/A","N/A","N/A","N/A","N/A","N/A","N/A","N/A","N/A","N/A","N/A","N/A","N/A","N/A","N/A","N/A","N/A","N/A","N/A","N/A","N/A","N/A","N/A","N/A","N/A","N/A","N/A"]
["Water source available when needed","Yes","N/A","N/A","N/A","N/A","N/A","N/A","N/A","N/A","N/A","N/A","N/A","N/A","N/A","N/A","N/A",0,0,0,0,0,0,0,0,0,0,0,0,0,0,0,null,null,null,null,null,null,null,null,null,null,null,null,null,null,null,null,null,null,null,null,"Water source available when needed","Yes","N/A","N/A","N/A","N/A","N/A","N/A","N/A","N/A","N/A","N/A","N/A","N/A","N/A","N/A","N/A","N/A","N/A","N/A","N/A","N/A","N/A","N/A","N/A","N/A","N/A","N/A","N/A","N/A","N/A","N/A"]
[null,"No","N/A","N/A","N/A","N/A","N/A","N/A","N/A","N/A","N/A","N/A","N/A","N/A","N/A","N/A","N/A",0,0,0,0,0,0,0,0,0,0,0,0,0,0,0,null,null,null,null,null,null,null,null,null,null,null,null,null,null,null,null,null,null,null,null,null,"No","N/A","N/A","N/A","N/A","N/A","N/A","N/A","N/A","N/A","N/A","N/A","N/A","N/A","N/A","N/A","N/A","N/A","N/A","N/A","N/A","N/A","N/A","N/A","N/A","N/A","N/A","N/A","N/A","N/A","N/A"]
["Improved water source available when needed","Yes","N/A","N/A","N/A","N/A","N/A","N/A","N/A","N/A","N/A","N/A","N/A","N/A","N/A","N/A","N/A",0,0,0,0,0,0,0,0,0,0,0,0,0,0,0,null,null,null,null,null,null,null,null,null,null,null,null,null,null,null,null,null,null,null,null,"Improved water source available when needed","Yes","N/A","N/A","N/A","N/A","N/A","N/A","N/A","N/A","N/A","N/A","N/A","N/A","N/A","N/A","N/A","N/A","N/A","N/A","N/A","N/A","N/A","N/A","N/A","N/A","N/A","N/A","N/A","N/A","N/A","N/A"]
[null,"No","N/A","N/A","N/A","N/A","N/A","N/A","N/A","N/A","N/A","N/A","N/A","N/A","N/A","N/A","N/A",0,0,0,0,0,0,0,0,0,0,0,0,0,0,0,null,null,null,null,null,null,null,null,null,null,null,null,null,null,null,null,null,null,null,null,null,"No","N/A","N/A","N/A","N/A","N/A","N/A","N/A","N/A","N/A","N/A","N/A","N/A","N/A","N/A","N/A","N/A","N/A","N/A","N/A","N/A","N/A","N/A","N/A","N/A","N/A","N/A","N/A","N/A","N/A","N/A"]
["Microbiological quality at point of collection","Not contaminated (No E. coli in 100 mL)","N/A","N/A","N/A","N/A","N/A","N/A","N/A","N/A","N/A","N/A","N/A","N/A","N/A","N/A","N/A","N/A","N/A","N/A","N/A","N/A","N/A","N/A","N/A","N/A","N/A","N/A","N/A","N/A","N/A","N/A",null,null,null,null,null,null,null,null,null,null,null,null,null,null,null,null,null,null,null,null,"Microbiological quality at point of collection","Not contaminated (No E. coli in 100 mL)","N/A","N/A","N/A","N/A","N/A","N/A","N/A","N/A","N/A","N/A","N/A","N/A","N/A","N/A","N/A","N/A","N/A","N/A","N/A","N/A","N/A","N/A","N/A","N/A","N/A","N/A","N/A","N/A","N/A","N/A"]
[null,"Contaminated (E. coli detected in 100 mL)","N/A","N/A","N/A","N/A","N/A","N/A","N/A","N/A","N/A","N/A","N/A","N/A","N/A","N/A","N/A","N/A","N/A","N/A","N/A","N/A","N/A","N/A","N/A","N/A","N/A","N/A","N/A","N/A","N/A","N/A",null,null,null,null,null,null,null,null,null,null,null,null,null,null,null,null,null,null,null,null,null,"Contaminated (E. coli detected in 100 mL)","N/A","N/A","N/A","N/A","N/A","N/A","N/A","N/A","N/A","N/A","N/A","N/A","N/A","N/A","N/A","N/A","N/A","N/A","N/A","N/A","N/A","N/A","N/A","N/A","N/A","N/A","N/A","N/A","N/A","N/A"]
[null,"Highly contaminated (>100 CFU/100 mL)","N/A","N/A","N/A","N/A","N/A","N/A","N/A","N/A","N/A","N/A","N/A","N/A","N/A","N/A","N/A","N/A","N/A","N/A","N/A","N/A","N/A","N/A","N/A","N/A","N/A","N/A","N/A","N/A","N/A","N/A",null,null,null,null,null,null,null,null,null,null,null,null,null,null,null,null,null,null,null,null,null,"Highly contaminated (>100 CFU/100 mL)","N/A","N/A","N/A","N/A","N/A","N/A","N/A","N/A","N/A","N/A","N/A","N/A","N/A","N/A","N/A","N/A","N/A","N/A","N/A","N/A","N/A","N/A","N/A","N/A","N/A","N/A","N/A","N/A","N/A","N/A"]
["Microbiological quality of improved water sources at point of collection","Not contaminated (No E. coli in 100 mL)","N/A","N/A","N/A","N/A","N/A","N/A","N/A","N/A","N/A","N/A","N/A","N/A","N/A","N/A","N/A","N/A","N/A","N/A","N/A","N/A","N/A","N/A","N/A","N/A","N/A","N/A","N/A","N/A","N/A","N/A",null,null,null,null,null,null,null,null,null,null,null,null,null,null,null,null,null,null,null,null,"Microbiological quality of improved water sources at point of collection","Not contaminated (No E. coli in 100 mL)","N/A","N/A","N/A","N/A","N/A","N/A","N/A","N/A","N/A","N/A","N/A","N/A","N/A","N/A","N/A","N/A","N/A","N/A","N/A","N/A","N/A","N/A","N/A","N/A","N/A","N/A","N/A","N/A","N/A","N/A"]
[null,"Contaminated (E. coli detected in 100 mL)","N/A","N/A","N/A","N/A","N/A","N/A","N/A","N/A","N/A","N/A","N/A","N/A","N/A","N/A","N/A","N/A","N/A","N/A","N/A","N/A","N/A","N/A","N/A","N/A","N/A","N/A","N/A","N/A","N/A","N/A",null,null,null,null,null,null,null,null,null,null,null,null,null,null,null,null,null,null,null,null,null,"Contaminated (E. coli detected in 100 mL)","N/A","N/A","N/A","N/A","N/A","N/A","N/A","N/A","N/A","N/A","N/A","N/A","N/A","N/A","N/A","N/A","N/A","N/A","N/A","N/A","N/A","N/A","N/A","N/A","N/A","N/A","N/A","N/A","N/A","N/A"]
[null,"Highly contaminated (>100 CFU/100 mL)","N/A","N/A","N/A","N/A","N/A","N/A","N/A","N/A","N/A","N/A","N/A","N/A","N/A","N/A","N/A","N/A","N/A","N/A","N/A","N/A","N/A","N/A","N/A","N/A","N/A","N/A","N/A","N/A","N/A","N/A",null,null,null,null,null,null,null,null,null,null,null,null,null,null,null,null,null,null,null,null,null,"Highly contaminated (>100 CFU/100 mL)","N/A","N/A","N/A","N/A","N/A","N/A","N/A","N/A","N/A","N/A","N/A","N/A","N/A","N/A","N/A","N/A","N/A","N/A","N/A","N/A","N/A","N/A","N/A","N/A","N/A","N/A","N/A","N/A","N/A","N/A"]
["Microbiological quality of piped on premises at point of collection","Not contaminated (No E. coli in 100 mL)","N/A","N/A","N/A","N/A","N/A","N/A","N/A","N/A","N/A","N/A","N/A","N/A","N/A","N/A","N/A","N/A","N/A","N/A","N/A","N/A","N/A","N/A","N/A","N/A","N/A","N/A","N/A","N/A","N/A","N/A",null,null,null,null,null,null,null,null,null,null,null,null,null,null,null,null,null,null,null,null,"Microbiological quality of piped on premises at point of collection","Not contaminated (No E. coli in 100 mL)","N/A","N/A","N/A","N/A","N/A","N/A","N/A","N/A","N/A","N/A","N/A","N/A","N/A","N/A","N/A","N/A","N/A","N/A","N/A","N/A","N/A","N/A","N/A","N/A","N/A","N/A","N/A","N/A","N/A","N/A"]
[null,"Contaminated (E. coli detected in 100 mL)","N/A","N/A","N/A","N/A","N/A","N/A","N/A","N/A","N/A","N/A","N/A","N/A","N/A","N/A","N/A","N/A","N/A","N/A","N/A","N/A","N/A","N/A","N/A","N/A","N/A","N/A","N/A","N/A","N/A","N/A",null,null,null,null,null,null,null,null,null,null,null,null,null,null,null,null,null,null,null,null,null,"Contaminated (E. coli detected in 100 mL)","N/A","N/A","N/A","N/A","N/A","N/A","N/A","N/A","N/A","N/A","N/A","N/A","N/A","N/A","N/A","N/A","N/A","N/A","N/A","N/A","N/A","N/A","N/A","N/A","N/A","N/A","N/A","N/A","N/A","N/A"]
[null,"Highly contaminated (>100 CFU/100 mL)","N/A","N/A","N/A","N/A","N/A","N/A","N/A","N/A","N/A","N/A","N/A","N/A","N/A","N/A","N/A","N/A","N/A","N/A","N/A","N/A","N/A","N/A","N/A","N/A","N/A","N/A","N/A","N/A","N/A","N/A",null,null,null,null,null,null,null,null,null,null,null,null,null,null,null,null,null,null,null,null,null,"Highly contaminated (>100 CFU/100 mL)","N/A","N/A","N/A","N/A","N/A","N/A","N/A","N/A","N/A","N/A","N/A","N/A","N/A","N/A","N/A","N/A","N/A","N/A","N/A","N/A","N/A","N/A","N/A","N/A","N/A","N/A","N/A","N/A","N/A","N/A"]
[null,null,"NATIONAL wealth index quintile",null,null,null,null,null,null,null,null,null,null,null,null,null,null,"SUB-REGIONS:",null,null,null,null,null,null,null,null,null,null,null,null,null,null,null,null,null,null,null,null,null,null,null,null,null,null,null,null,null,null,null,null,null,null,"Raw numbers of respondents:","Use of drinking water sources","NATIONAL wealth index quintile",null,null,null,null,"URBAN wealth index quintile",null,null,null,null,"RURAL wealth index quintile",null,null,null,null,"SUB-REGIONS:"]
["Percentage based on weighted population",null,"Poorest","Poor","Middle","Rich","Richest",null,null,null,null,null,null,null,null,null,null,"arima borough","caroni","chaguanas borough","diego martin","nariva/mayaro","port of spain","pt. fortin borough","rest of st. george","san fernando","st anns","st. andrew/st. david","st. patrick","tacarigua","tobago","victoria",null,null,null,null,null,null,null,null,null,null,null,null,null,null,null,null,null,null,null,null,"Water data, raw numbers (weighted)",null,"Poorest","Poor","Middle","Rich","Richest","Poorest","Poor","Middle","Rich","Richest","Poorest","Poor","Middle","Rich","Richest","arima borough","caroni","chaguanas borough","diego martin","nariva/mayaro","port of spain","pt. fortin borough","rest of st. george","san fernando","st anns","st. andrew/st. david","st. patrick","tacarigua","tobago","victoria"]
["main source of water","public piped into dwelling",26.255088195386705,52.294486629250578,65.732087227414326,79.737019554956163,89.694915254237287,"N/A","N/A","N/A","N/A","N/A","N/A","N/A","N/A","N/A","N/A",93.188854489164086,69.272076372315041,78.997289972899736,46.296296296296298,52.87081339712919,69.984686064318538,41.908713692946058,74.758842443729904,85.584218512898332,56.856702619414477,54.755043227665702,46.449136276391556,82.799215173315886,55.614973262032088,56.573522675217589]
[null,"public piped into yard or plot",9.9050203527815466,9.3100033014196093,6.8535825545171329,2.461227242076871,1.152542372881356,"N/A","N/A","N/A","N/A","N/A","N/A","N/A","N/A","N/A","N/A",1.2383900928792571,6.6229116945107398,3.3875338753387529,3.0092592592592591,0,8.5758039816232774,17.427385892116181,7.8778135048231519,0,7.8582434514637907,5.4755043227665707,7.037747920665387,5.755395683453238,2.8520499108734403,7.7874484654145677]
[null,"private piped into dwelling",1.6282225237449117,5.6124133377352257,5.3894080996884739,5.2258934592043156,3.9322033898305082,"N/A","N/A","N/A","N/A","N/A","N/A","N/A","N/A","N/A","N/A",0,0.23866348448687352,1.6260162601626018,10.87962962962963,0,0.91883614088820831,7.0539419087136928,0.16077170418006431,6.8285280728376323,4.4684129429892137,3.4582132564841501,9.6609085092770322,0.45781556572923476,27.807486631016044,0.50389372423270729]
[null,"private catchment not piped",4.1383989145183175,4.522944866292506,2.3987538940809969,1.9217801753202968,0.40677966101694918,"N/A","N/A","N/A","N/A","N/A","N/A","N/A","N/A","N/A","N/A",0,0.8949880668257757,2.5745257452574526,6.5586419753086416,0,3.0627871362940278,8.7136929460580905,1.929260450160772,0,4.5197740112994351,8.6455331412103753,3.3909149072296865,0.58862001308044476,1.6042780748663104,0.64131928538708205]
[null,"public stand pipe",26.221166892808682,11.852096401452625,8.0685358255451707,3.1018206338503034,0.44067796610169491,"N/A","N/A","N/A","N/A","N/A","N/A","N/A","N/A","N/A","N/A",0,6.8615751789976125,2.3035230352303522,18.441358024691358,0,16.845329249617151,17.012448132780083,4.019292604501608,4.0971168437025796,18.181818181818183,17.291066282420751,7.7415227127319257,5.8862001308044478,4.4563279857397502,9.7114063215758133]
[null,"truck borne",4.1723202170963365,2.1459227467811157,0.96573208722741444,1.3149022252191505,0.57627118644067798,"N/A","N/A","N/A","N/A","N/A","N/A","N/A","N/A","N/A","N/A",0,0.8353221957040573,0.54200542005420049,3.7037037037037033,4.0669856459330145,0,0,0.8038585209003215,0,0.97586029789419626,1.7291066282420751,2.3672424824056302,0,2.4955436720142603,4.8098946404031153]
[null,"spring/river",1.9335142469470827,1.6507098052162428,0.71651090342679125,0.23600809170600134,0.13559322033898305,"N/A","N/A","N/A","N/A","N/A","N/A","N/A","N/A","N/A","N/A",0,0,0,3.6265432098765435,0.9569377990430622,0,0,0,0,2.7221366204417055,2.0172910662824206,0.51183621241202815,0.98103335513407453,0,0]
[null,"protected well",0.50881953867028495,0.36315615714757343,0,0,0,"N/A","N/A","N/A","N/A","N/A","N/A","N/A","N/A","N/A","N/A",0,0,3.5230352303523031,0,0,0,0,0,0,0,0,0,0,0,0]
[null,"not stated",0.37313432835820892,0.46219874546054801,0.46728971962616817,0.64059339177343222,0.64406779661016944,"N/A","N/A","N/A","N/A","N/A","N/A","N/A","N/A","N/A","N/A",0,0,0.27100271002710025,0,0,0,0,2.2508038585209005,0.60698027314112291,0.51361068310220848,0.28818443804034583,0.51183621241202815,0.98103335513407453,0,1.0535959688502061]
[null,"protected spring",0.30529172320217096,0.16507098052162431,3.1152647975077882E-2,0.64059339177343222,0.16949152542372881,"N/A","N/A","N/A","N/A","N/A","N/A","N/A","N/A","N/A","N/A",0,0.17899761336515513,0.94850948509485089,1.1574074074074074,1.6746411483253589,0,0,0,0,5.1361068310220852E-2,0.72046109510086453,0,6.540222367560497E-2,0,0]
[null,"rainwater collection",17.130257801899592,8.517662594915814,5.8878504672897192,3.3378287255563048,1.4576271186440677,"N/A","N/A","N/A","N/A","N/A","N/A","N/A","N/A","N/A","N/A",0,6.9809069212410506,0,4.5524691358024691,39.473684210526315,0,4.9792531120331951,0.8038585209003215,0.75872534142640369,2.1058038007190549,4.3227665706051877,20.153550863723606,0.52321778940483976,0,15.437471369674761]
[null,"bottled water",0,0,6.2305295950155763E-2,0.33715441672285906,0.98305084745762705,"N/A","N/A","N/A","N/A","N/A","N/A","N/A","N/A","N/A","N/A",0.92879256965944268,0,0,1.0802469135802468,0.9569377990430622,0,1.6597510373443984,0,0.60698027314112291,0.51361068310220848,0,0.12795905310300704,0,0,0]
[null,"tube well/bore hole with pump",0.71234735413839889,0,0,0,0,"N/A","N/A","N/A","N/A","N/A","N/A","N/A","N/A","N/A","N/A",0,0,0,0,0,0,0,0,0,0,0,0,1.3734466971877044,0,0]
[null,"other",6.7164179104477615,2.4760647078243645,2.5233644859813085,0.87660148347943356,0.13559322033898305,"N/A","N/A","N/A","N/A","N/A","N/A","N/A","N/A","N/A","N/A",0.92879256965944268,8.1145584725536999,5.8265582655826558,0.30864197530864196,0,0.61255742725880558,1.2448132780082988,5.787781350482315,1.5174506828528074,0.51361068310220848,1.2968299711815563,0.89571337172104937,0.45781556572923476,5.169340463458111,3.4814475492441592]
[null,"missing",0,0.62726972598217234,0.90342679127725856,0.16857720836142953,0.2711864406779661,"N/A","N/A","N/A","N/A","N/A","N/A","N/A","N/A","N/A","N/A",3.7151702786377707,0,0,0.38580246913580246,0,0,0,1.607717041800643,0,0.71905495634309191,0,1.1516314779270633,0.13080444735120994,0,0]
[]
[]
[]
[]
[]
[]
[]
[]
[]
[]
[]
[]
[]
[]
[]
[]
[]
[]
[]
[]
[]
[]
[]
[]
[]
[]
[]
[]
[]
[]
[]
[]
[]
[]
[]
[{"$f":"A1026","v":"Trinidad and Tobago"}]
[{"$f":"A1034","v":"2000"}]
["Use of sanitation facilities"]
[" by wealth quintile and sub-national region"]
["Notes:"]
["WHO/UNICEF JMP customised wealth index excludes water,"]
[" sanitation and hygiene assets."]
["Survey used for analysis:",{"$f":"A1025","v":"MICS00"}]
[{"$f":"B1030","v":"Ratio of Improved latrines based on:"},"MICS06"]
[{"$f":"B1029","v":"Ratio of Shared improved based on:"},"MICS06"]
[]
[]
["Use of sanitation facilities",null,"NATIONAL wealth index quintile",null,null,null,null,null,null,null,null,null,null,null,null,null,null,"SUB-REGIONS:",null,null,null,null,null,null,null,null,null,null,null,null,null,null,null,null,null,null,null,null,null,null,null,null,null,null,null,null,null,null,null,null,null,null,"Raw numbers of respondents:","Use of sanitation facilities","NATIONAL wealth index quintile",null,null,null,null,"URBAN wealth index quintile",null,null,null,null,"RURAL wealth index quintile",null,null,null,null,"SUB-REGIONS:"]
["Weighted percentage (used in graphs)",null,"Poorest","Poor","Middle","Rich","Richest",null,null,null,null,null,null,null,null,null,null,"arima borough","caroni","chaguanas borough","diego martin","nariva/mayaro","port of spain","pt. fortin borough","rest of st. george","san fernando","st anns","st. andrew/st. david","st. patrick","tacarigua","tobago","victoria",null,null,null,null,null,null,null,null,null,null,null,null,null,null,null,null,null,null,null,null,"Sanitation data, raw numbers (weighted)",null,"Poorest","Poor","Middle","Rich","Richest","Poorest","Poor","Middle","Rich","Richest","Poorest","Poor","Middle","Rich","Richest","arima borough","caroni","chaguanas borough","diego martin","nariva/mayaro","port of spain","pt. fortin borough","rest of st. george","san fernando","st anns","st. andrew/st. david","st. patrick","tacarigua","tobago","victoria"]
["Sanitation","Improved",{"$f":"C154+C155+C153*MICS06!C130/100","v":93.639613018909898},{"$f":"D154+D155+D153*MICS06!D130/100","v":98.078445153140592},{"$f":"E154+E155+E153*MICS06!E130/100","v":97.903577517923296},{"$f":"F154+F155+F153*MICS06!F130/100","v":99.696561024949432},{"$f":"G154+G155+G153*MICS06!G130/100","v":99.830508474576277},"N/A","N/A","N/A","N/A","N/A","N/A","N/A","N/A","N/A","N/A","N/A","N/A","N/A","N/A","N/A","N/A","N/A","N/A","N/A","N/A","N/A","N/A","N/A","N/A","N/A",null,null,null,null,null,null,null,null,null,null,null,null,null,null,null,null,null,null,null,null,"Sanitation","Improved","N/A","N/A","N/A","N/A","N/A","N/A","N/A","N/A","N/A","N/A","N/A","N/A","N/A","N/A","N/A","N/A","N/A","N/A","N/A","N/A","N/A","N/A","N/A","N/A","N/A","N/A","N/A","N/A","N/A","N/A"]
[null,"Not Improved",{"$f":"100-C122","v":6.3603869810901017},{"$f":"100-D122","v":1.9215548468594079},2.0964224820767043,0.30343897505056816,0.16949152542372303,"N/A","N/A","N/A","N/A","N/A","N/A","N/A","N/A","N/A","N/A","N/A","N/A","N/A","N/A","N/A","N/A","N/A","N/A","N/A","N/A","N/A","N/A","N/A","N/A","N/A",null,null,null,null,null,null,null,null,null,null,null,null,null,null,null,null,null,null,null,null,null,"Not Improved","N/A","N/A","N/A","N/A","N/A","N/A","N/A","N/A","N/A","N/A","N/A","N/A","N/A","N/A","N/A","N/A","N/A","N/A","N/A","N/A","N/A","N/A","N/A","N/A","N/A","N/A","N/A","N/A","N/A","N/A"]
["Sanitation ladder","Basic",{"$f":"C122*MICS06!C129/100","v":78.634908053740261},{"$f":"D122*MICS06!D129/100","v":87.897253044409894},{"$f":"E122*MICS06!E129/100","v":91.398111104717259},{"$f":"F122*MICS06!F129/100","v":96.239191663476433},{"$f":"G122*MICS06!G129/100","v":98.714413456916063},"N/A","N/A","N/A","N/A","N/A","N/A","N/A","N/A","N/A","N/A","N/A","N/A","N/A","N/A","N/A","N/A","N/A","N/A","N/A","N/A","N/A","N/A","N/A","N/A","N/A",null,null,null,null,null,null,null,null,null,null,null,null,null,null,null,null,null,null,null,null,"Sanitation ladder","Basic","N/A","N/A","N/A","N/A","N/A","N/A","N/A","N/A","N/A","N/A","N/A","N/A","N/A","N/A","N/A","N/A","N/A","N/A","N/A","N/A","N/A","N/A","N/A","N/A","N/A","N/A","N/A","N/A","N/A","N/A"]
[null,"Limited",{"$f":"C122*MICS06!C128/100","v":15.004704965169903},{"$f":"D122*MICS06!D128/100","v":10.181192108730695},{"$f":"E122*MICS06!E128/100","v":6.5054664132060402},{"$f":"F122*MICS06!F128/100","v":3.4573693614730687},{"$f":"G122*MICS06!G128/100","v":1.1160950176601552},"N/A","N/A","N/A","N/A","N/A","N/A","N/A","N/A","N/A","N/A","N/A","N/A","N/A","N/A","N/A","N/A","N/A","N/A","N/A","N/A","N/A","N/A","N/A","N/A","N/A",null,null,null,null,null,null,null,null,null,null,null,null,null,null,null,null,null,null,null,null,null,"Limited","N/A","N/A","N/A","N/A","N/A","N/A","N/A","N/A","N/A","N/A","N/A","N/A","N/A","N/A","N/A","N/A","N/A","N/A","N/A","N/A","N/A","N/A","N/A","N/A","N/A","N/A","N/A","N/A","N/A","N/A"]
[null,"Unimproved",{"$f":"100-(C124+C125+C127)","v":6.1229378630437026},{"$f":"100-(D124+D125+D127)","v":1.7564838663377884},2.0964224820767043,0.30343897505049711,0.16949152542377988,"N/A","N/A","N/A","N/A","N/A","N/A","N/A","N/A","N/A","N/A","N/A","N/A","N/A","N/A","N/A","N/A","N/A","N/A","N/A","N/A","N/A","N/A","N/A","N/A","N/A",null,null,null,null,null,null,null,null,null,null,null,null,null,null,null,null,null,null,null,null,null,"Unimproved","N/A","N/A","N/A","N/A","N/A","N/A","N/A","N/A","N/A","N/A","N/A","N/A","N/A","N/A","N/A","N/A","N/A","N/A","N/A","N/A","N/A","N/A","N/A","N/A","N/A","N/A","N/A","N/A","N/A","N/A"]
[null,"Open defecation",{"$f":"C156","v":0.23744911804613297},{"$f":"D156","v":0.16507098052162431},0,0,0,"N/A","N/A","N/A","N/A","N/A","N/A","N/A","N/A","N/A","N/A","N/A","N/A","N/A","N/A","N/A","N/A","N/A","N/A","N/A","N/A","N/A","N/A","N/A","N/A","N/A",null,null,null,null,null,null,null,null,null,null,null,null,null,null,null,null,null,null,null,null,null,"Open defecation","N/A","N/A","N/A","N/A","N/A","N/A","N/A","N/A","N/A","N/A","N/A","N/A","N/A","N/A","N/A","N/A","N/A","N/A","N/A","N/A","N/A","N/A","N/A","N/A","N/A","N/A","N/A","N/A","N/A","N/A"]
["Shared among Improved Sanitation","Yes","N/A","N/A","N/A","N/A","N/A","N/A","N/A","N/A","N/A","N/A","N/A","N/A","N/A","N/A","N/A","N/A","N/A","N/A","N/A","N/A","N/A","N/A","N/A","N/A","N/A","N/A","N/A","N/A","N/A","N/A",null,null,null,null,null,null,null,null,null,null,null,null,null,null,null,null,null,null,null,null,"Shared among improved sanitation facilities","Yes","N/A","N/A","N/A","N/A","N/A","N/A","N/A","N/A","N/A","N/A","N/A","N/A","N/A","N/A","N/A","N/A","N/A","N/A","N/A","N/A","N/A","N/A","N/A","N/A","N/A","N/A","N/A","N/A","N/A","N/A"]
[null,"No","N/A","N/A","N/A","N/A","N/A","N/A","N/A","N/A","N/A","N/A","N/A","N/A","N/A","N/A","N/A","N/A","N/A","N/A","N/A","N/A","N/A","N/A","N/A","N/A","N/A","N/A","N/A","N/A","N/A","N/A",null,null,null,null,null,null,null,null,null,null,null,null,null,null,null,null,null,null,null,null,null,"No","N/A","N/A","N/A","N/A","N/A","N/A","N/A","N/A","N/A","N/A","N/A","N/A","N/A","N/A","N/A","N/A","N/A","N/A","N/A","N/A","N/A","N/A","N/A","N/A","N/A","N/A","N/A","N/A","N/A","N/A"]
["Manually calculated ratios","Improved latrines"]
[null,"Other"]
[null,"Other"]
[null,null,"NATIONAL wealth index quintile",null,null,null,null,null,null,null,null,null,null,null,null,null,null,"SUB-REGIONS:",null,null,null,null,null,null,null,null,null,null,null,null,null,null,null,null,null,null,null,null,null,null,null,null,null,null,null,null,null,null,null,null,null,null,"Raw numbers of respondents:","Use of sanitation facilities","NATIONAL wealth index quintile",null,null,null,null,"URBAN wealth index quintile",null,null,null,null,"RURAL wealth index quintile",null,null,null,null,"SUB-REGIONS:"]
["Percentage based on weighted population",null,"Poorest","Poor","Middle","Rich","Richest",null,null,null,null,null,null,null,null,null,null,"arima borough","caroni","chaguanas borough","diego martin","nariva/mayaro","port of spain","pt. fortin borough","rest of st. george","san fernando","st anns","st. andrew/st. david","st. patrick","tacarigua","tobago","victoria",null,null,null,null,null,null,null,null,null,null,null,null,null,null,null,null,null,null,null,null,"Sanitation data, raw numbers (weighted)",null,"Poorest","Poor","Middle","Rich","Richest","Poorest","Poor","Middle","Rich","Richest","Poorest","Poor","Middle","Rich","Richest","arima borough","caroni","chaguanas borough","diego martin","nariva/mayaro","port of spain","pt. fortin borough","rest of st. george","san fernando","st anns","st. andrew/st. david","st. patrick","tacarigua","tobago","victoria"]
["Sanitation type","Sewer connection","N/A","N/A","N/A","N/A","N/A","N/A","N/A","N/A","N/A","N/A","N/A","N/A","N/A","N/A","N/A",0,0,0,0,0,0,0,0,0,0,0,0,0,0,0,null,null,null,null,null,null,null,null,null,null,null,null,null,null,null,null,null,null,null,null,"Sanitation type","Sewer connection","N/A","N/A","N/A","N/A","N/A","N/A","N/A","N/A","N/A","N/A","N/A","N/A","N/A","N/A","N/A","N/A","N/A","N/A","N/A","N/A","N/A","N/A","N/A","N/A","N/A","N/A","N/A","N/A","N/A","N/A"]
[null,"Septic tank connection","N/A","N/A","N/A","N/A","N/A","N/A","N/A","N/A","N/A","N/A","N/A","N/A","N/A","N/A","N/A",0,0,0,0,0,0,0,0,0,0,0,0,0,0,0,null,null,null,null,null,null,null,null,null,null,null,null,null,null,null,null,null,null,null,null,null,"Septic tank connection","N/A","N/A","N/A","N/A","N/A","N/A","N/A","N/A","N/A","N/A","N/A","N/A","N/A","N/A","N/A","N/A","N/A","N/A","N/A","N/A","N/A","N/A","N/A","N/A","N/A","N/A","N/A","N/A","N/A","N/A"]
[null,"Improved latrines","N/A","N/A","N/A","N/A","N/A","N/A","N/A","N/A","N/A","N/A","N/A","N/A","N/A","N/A","N/A",0,0,0,0,0,0,0,0,0,0,0,0,0,0,0,null,null,null,null,null,null,null,null,null,null,null,null,null,null,null,null,null,null,null,null,null,"Improved latrines","N/A","N/A","N/A","N/A","N/A","N/A","N/A","N/A","N/A","N/A","N/A","N/A","N/A","N/A","N/A","N/A","N/A","N/A","N/A","N/A","N/A","N/A","N/A","N/A","N/A","N/A","N/A","N/A","N/A","N/A"]
[null,"Unimproved facilities","N/A","N/A","N/A","N/A","N/A","N/A","N/A","N/A","N/A","N/A","N/A","N/A","N/A","N/A","N/A",100,100,100,100,100,100,100,100,100,100,100,100,100,100,100,null,null,null,null,null,null,null,null,null,null,null,null,null,null,null,null,null,null,null,null,null,"Unimproved facilities","N/A","N/A","N/A","N/A","N/A","N/A","N/A","N/A","N/A","N/A","N/A","N/A","N/A","N/A","N/A","N/A","N/A","N/A","N/A","N/A","N/A","N/A","N/A","N/A","N/A","N/A","N/A","N/A","N/A","N/A"]
[null,"Open defecation","N/A","N/A","N/A","N/A","N/A","N/A","N/A","N/A","N/A","N/A","N/A","N/A","N/A","N/A","N/A",0,0,0,0,0,0,0,0,0,0,0,0,0,0,0,null,null,null,null,null,null,null,null,null,null,null,null,null,null,null,null,null,null,null,null,null,"Open defecation","N/A","N/A","N/A","N/A","N/A","N/A","N/A","N/A","N/A","N/A","N/A","N/A","N/A","N/A","N/A","N/A","N/A","N/A","N/A","N/A","N/A","N/A","N/A","N/A","N/A","N/A","N/A","N/A","N/A","N/A"]
["Septic tank emptying practices","Not emptied/treated and disposed in situ","N/A","N/A","N/A","N/A","N/A","N/A","N/A","N/A","N/A","N/A","N/A","N/A","N/A","N/A","N/A","N/A","N/A","N/A","N/A","N/A","N/A","N/A","N/A","N/A","N/A","N/A","N/A","N/A","N/A","N/A",null,null,null,null,null,null,null,null,null,null,null,null,null,null,null,null,null,null,null,null,"Septic tank emptying practices","Not emptied/treated and disposed in situ","N/A","N/A","N/A","N/A","N/A","N/A","N/A","N/A","N/A","N/A","N/A","N/A","N/A","N/A","N/A","N/A","N/A","N/A","N/A","N/A","N/A","N/A","N/A","N/A","N/A","N/A","N/A","N/A","N/A","N/A"]
[null,"Emptied and buried on site","N/A","N/A","N/A","N/A","N/A","N/A","N/A","N/A","N/A","N/A","N/A","N/A","N/A","N/A","N/A","N/A","N/A","N/A","N/A","N/A","N/A","N/A","N/A","N/A","N/A","N/A","N/A","N/A","N/A","N/A",null,null,null,null,null,null,null,null,null,null,null,null,null,null,null,null,null,null,null,null,null,"Emptied and buried on site","N/A","N/A","N/A","N/A","N/A","N/A","N/A","N/A","N/A","N/A","N/A","N/A","N/A","N/A","N/A","N/A","N/A","N/A","N/A","N/A","N/A","N/A","N/A","N/A","N/A","N/A","N/A","N/A","N/A","N/A"]
[null,"Emptied and discharged locally","N/A","N/A","N/A","N/A","N/A","N/A","N/A","N/A","N/A","N/A","N/A","N/A","N/A","N/A","N/A","N/A","N/A","N/A","N/A","N/A","N/A","N/A","N/A","N/A","N/A","N/A","N/A","N/A","N/A","N/A",null,null,null,null,null,null,null,null,null,null,null,null,null,null,null,null,null,null,null,null,null,"Emptied and discharged locally","N/A","N/A","N/A","N/A","N/A","N/A","N/A","N/A","N/A","N/A","N/A","N/A","N/A","N/A","N/A","N/A","N/A","N/A","N/A","N/A","N/A","N/A","N/A","N/A","N/A","N/A","N/A","N/A","N/A","N/A"]
[null,"Emptied and removed offsite","N/A","N/A","N/A","N/A","N/A","N/A","N/A","N/A","N/A","N/A","N/A","N/A","N/A","N/A","N/A","N/A","N/A","N/A","N/A","N/A","N/A","N/A","N/A","N/A","N/A","N/A","N/A","N/A","N/A","N/A",null,null,null,null,null,null,null,null,null,null,null,null,null,null,null,null,null,null,null,null,null,"Emptied and removed offsite","N/A","N/A","N/A","N/A","N/A","N/A","N/A","N/A","N/A","N/A","N/A","N/A","N/A","N/A","N/A","N/A","N/A","N/A","N/A","N/A","N/A","N/A","N/A","N/A","N/A","N/A","N/A","N/A","N/A","N/A"]
["Latrine emptying practices","Not emptied/treated and disposed in situ","N/A","N/A","N/A","N/A","N/A","N/A","N/A","N/A","N/A","N/A","N/A","N/A","N/A","N/A","N/A","N/A","N/A","N/A","N/A","N/A","N/A","N/A","N/A","N/A","N/A","N/A","N/A","N/A","N/A","N/A",null,null,null,null,null,null,null,null,null,null,null,null,null,null,null,null,null,null,null,null,"Latrine emptying practices","Not emptied/treated and disposed in situ","N/A","N/A","N/A","N/A","N/A","N/A","N/A","N/A","N/A","N/A","N/A","N/A","N/A","N/A","N/A","N/A","N/A","N/A","N/A","N/A","N/A","N/A","N/A","N/A","N/A","N/A","N/A","N/A","N/A","N/A"]
[null,"Emptied and buried on site","N/A","N/A","N/A","N/A","N/A","N/A","N/A","N/A","N/A","N/A","N/A","N/A","N/A","N/A","N/A","N/A","N/A","N/A","N/A","N/A","N/A","N/A","N/A","N/A","N/A","N/A","N/A","N/A","N/A","N/A",null,null,null,null,null,null,null,null,null,null,null,null,null,null,null,null,null,null,null,null,null,"Emptied and buried on site","N/A","N/A","N/A","N/A","N/A","N/A","N/A","N/A","N/A","N/A","N/A","N/A","N/A","N/A","N/A","N/A","N/A","N/A","N/A","N/A","N/A","N/A","N/A","N/A","N/A","N/A","N/A","N/A","N/A","N/A"]
[null,"Emptied and discharged locally","N/A","N/A","N/A","N/A","N/A","N/A","N/A","N/A","N/A","N/A","N/A","N/A","N/A","N/A","N/A","N/A","N/A","N/A","N/A","N/A","N/A","N/A","N/A","N/A","N/A","N/A","N/A","N/A","N/A","N/A",null,null,null,null,null,null,null,null,null,null,null,null,null,null,null,null,null,null,null,null,null,"Emptied and discharged locally","N/A","N/A","N/A","N/A","N/A","N/A","N/A","N/A","N/A","N/A","N/A","N/A","N/A","N/A","N/A","N/A","N/A","N/A","N/A","N/A","N/A","N/A","N/A","N/A","N/A","N/A","N/A","N/A","N/A","N/A"]
[null,"Emptied and removed offsite","N/A","N/A","N/A","N/A","N/A","N/A","N/A","N/A","N/A","N/A","N/A","N/A","N/A","N/A","N/A","N/A","N/A","N/A","N/A","N/A","N/A","N/A","N/A","N/A","N/A","N/A","N/A","N/A","N/A","N/A",null,null,null,null,null,null,null,null,null,null,null,null,null,null,null,null,null,null,null,null,null,"Emptied and removed offsite","N/A","N/A","N/A","N/A","N/A","N/A","N/A","N/A","N/A","N/A","N/A","N/A","N/A","N/A","N/A","N/A","N/A","N/A","N/A","N/A","N/A","N/A","N/A","N/A","N/A","N/A","N/A","N/A","N/A","N/A"]
["Shared among improved sanitation facilities","Yes","N/A","N/A","N/A","N/A","N/A","N/A","N/A","N/A","N/A","N/A","N/A","N/A","N/A","N/A","N/A","N/A","N/A","N/A","N/A","N/A","N/A","N/A","N/A","N/A","N/A","N/A","N/A","N/A","N/A","N/A",null,null,null,null,null,null,null,null,null,null,null,null,null,null,null,null,null,null,null,null,"Shared among improved sanitation facilities","Yes","N/A","N/A","N/A","N/A","N/A","N/A","N/A","N/A","N/A","N/A","N/A","N/A","N/A","N/A","N/A","N/A","N/A","N/A","N/A","N/A","N/A","N/A","N/A","N/A","N/A","N/A","N/A","N/A","N/A","N/A"]
[null,"No","N/A","N/A","N/A","N/A","N/A","N/A","N/A","N/A","N/A","N/A","N/A","N/A","N/A","N/A","N/A","N/A","N/A","N/A","N/A","N/A","N/A","N/A","N/A","N/A","N/A","N/A","N/A","N/A","N/A","N/A",null,null,null,null,null,null,null,null,null,null,null,null,null,null,null,null,null,null,null,null,null,"No","N/A","N/A","N/A","N/A","N/A","N/A","N/A","N/A","N/A","N/A","N/A","N/A","N/A","N/A","N/A","N/A","N/A","N/A","N/A","N/A","N/A","N/A","N/A","N/A","N/A","N/A","N/A","N/A","N/A","N/A"]
[null,"DK/missing","N/A","N/A","N/A","N/A","N/A","N/A","N/A","N/A","N/A","N/A","N/A","N/A","N/A","N/A","N/A","N/A","N/A","N/A","N/A","N/A","N/A","N/A","N/A","N/A","N/A","N/A","N/A","N/A","N/A","N/A",null,null,null,null,null,null,null,null,null,null,null,null,null,null,null,null,null,null,null,null,null,"DK/missing","N/A","N/A","N/A","N/A","N/A","N/A","N/A","N/A","N/A","N/A","N/A","N/A","N/A","N/A","N/A","N/A","N/A","N/A","N/A","N/A","N/A","N/A","N/A","N/A","N/A","N/A","N/A","N/A","N/A","N/A"]
["Shared among all sanitation facilities","Yes","N/A","N/A","N/A","N/A","N/A","N/A","N/A","N/A","N/A","N/A","N/A","N/A","N/A","N/A","N/A","N/A","N/A","N/A","N/A","N/A","N/A","N/A","N/A","N/A","N/A","N/A","N/A","N/A","N/A","N/A",null,null,null,null,null,null,null,null,null,null,null,null,null,null,null,null,null,null,null,null,"Shared among all sanitation facilities","Yes","N/A","N/A","N/A","N/A","N/A","N/A","N/A","N/A","N/A","N/A","N/A","N/A","N/A","N/A","N/A","N/A","N/A","N/A","N/A","N/A","N/A","N/A","N/A","N/A","N/A","N/A","N/A","N/A","N/A","N/A"]
[null,"No","N/A","N/A","N/A","N/A","N/A","N/A","N/A","N/A","N/A","N/A","N/A","N/A","N/A","N/A","N/A","N/A","N/A","N/A","N/A","N/A","N/A","N/A","N/A","N/A","N/A","N/A","N/A","N/A","N/A","N/A",null,null,null,null,null,null,null,null,null,null,null,null,null,null,null,null,null,null,null,null,null,"No","N/A","N/A","N/A","N/A","N/A","N/A","N/A","N/A","N/A","N/A","N/A","N/A","N/A","N/A","N/A","N/A","N/A","N/A","N/A","N/A","N/A","N/A","N/A","N/A","N/A","N/A","N/A","N/A","N/A","N/A"]
["type of toilet facility","pit",77.37449118046132,37.999339716077912,19.719626168224298,5.8664868509777479,1.4576271186440677,"N/A","N/A","N/A","N/A","N/A","N/A","N/A","N/A","N/A","N/A",5.2631578947368416,30.310262529832936,20.189701897018971,28.703703703703702,42.822966507177036,23.736600306278714,48.962655601659748,24.59807073954984,7.2837632776934749,25.83461736004109,46.397694524495677,32.949456174024313,19.816873773708306,25.668449197860966,36.463582226294086,null,null,null,null,null,null,null,null,null,null,null,null,null,null,null,null,null,null,null,null,"type of toilet facility","pit",2281,1151,633,174,43,"N/A","N/A","N/A","N/A","N/A","N/A","N/A","N/A","N/A","N/A",17,508,149,372,179,155,118,153,48,503,322,515,303,144,796]
[null,"wc linked to sewer",7.3609226594301216,22.746781115879827,33.208722741433021,41.200269723533381,51.762711864406782,"N/A","N/A","N/A","N/A","N/A","N/A","N/A","N/A","N/A","N/A",68.730650154798766,7.0405727923627692,26.287262872628723,39.737654320987652,55.741626794258373,72.588055130168456,0,33.279742765273312,65.553869499241273,21.571648690292758,0.57636887608069165,36.78822776711452,47.351209941138002,49.376114081996434,14.933577645442053,null,null,null,null,null,null,null,null,null,null,null,null,null,null,null,null,null,null,null,null,null,"wc linked to sewer",217,689,1066,1222,1527,"N/A","N/A","N/A","N/A","N/A","N/A","N/A","N/A","N/A","N/A",222,118,194,515,233,474,0,207,432,420,4,575,724,277,326]
[null,"wc not linked to sewer",14.620081411126188,38.857708814790357,45.607476635514018,52.6298044504383,46.610169491525419,"N/A","N/A","N/A","N/A","N/A","N/A","N/A","N/A","N/A","N/A",25.077399380804955,62.649164677804293,53.116531165311656,31.095679012345677,1.4354066985645932,3.522205206738132,51.037344398340245,40.192926045016073,27.16236722306525,51.30970724191063,53.02593659942363,29.366602687140116,32.308698495748857,24.9554367201426,47.686669720568027,null,null,null,null,null,null,null,null,null,null,null,null,null,null,null,null,null,null,null,null,null,"wc not linked to sewer",431,1177,1464,1561,1375,"N/A","N/A","N/A","N/A","N/A","N/A","N/A","N/A","N/A","N/A",81,1050,392,403,6,23,123,250,179,999,368,459,494,140,1041]
[null,"none",0.23744911804613297,0.16507098052162431,0,0,0,"N/A","N/A","N/A","N/A","N/A","N/A","N/A","N/A","N/A","N/A",0,0,0,0,0,0.15313935681470139,0,0,0,0.41088854648176681,0,0.12795905310300704,6.540222367560497E-2,0,0,null,null,null,null,null,null,null,null,null,null,null,null,null,null,null,null,null,null,null,null,null,"none",7,5,0,0,0,"N/A","N/A","N/A","N/A","N/A","N/A","N/A","N/A","N/A","N/A",0,0,0,0,0,1,0,0,0,8,0,2,1,0,0]
[null,"other",0.20352781546811397,0,0,0,0,"N/A","N/A","N/A","N/A","N/A","N/A","N/A","N/A","N/A","N/A",0,0,0.40650406504065045,7.716049382716049E-2,0,0,0,0,0,0,0,0,6.540222367560497E-2,0,4.5808520384791572E-2,null,null,null,null,null,null,null,null,null,null,null,null,null,null,null,null,null,null,null,null,null,"other",6,0,0,0,0,"N/A","N/A","N/A","N/A","N/A","N/A","N/A","N/A","N/A","N/A",0,0,3,1,0,0,0,0,0,0,0,0,1,0,1]
[null,"missing",0.20352781546811397,0.23109937273027401,1.4641744548286604,0.30343897505057316,0.16949152542372881,"N/A","N/A","N/A","N/A","N/A","N/A","N/A","N/A","N/A","N/A",0.92879256965944268,0,0,0.38580246913580246,0,0,0,1.929260450160772,0,0.87313816127375443,0,0.76775431861804222,0.39241334205362982,0,0.87036188731103981,null,null,null,null,null,null,null,null,null,null,null,null,null,null,null,null,null,null,null,null,null,"missing",6,7,47,9,5,"N/A","N/A","N/A","N/A","N/A","N/A","N/A","N/A","N/A","N/A",3,0,0,5,0,0,0,12,0,17,0,12,6,0,19]
[null,null,null,null,null,null,null,null,null,null,null,null,null,null,null,null,null,null,null,null,null,null,null,null,null,null,null,null,null,null,null,null,null,null,null,null,null,null,null,null,null,null,null,null,null,null,null,null,null,null,null,null,null,"Total",2948,3029,3210,2966,2950,"N/A","N/A","N/A","N/A","N/A","N/A","N/A","N/A","N/A","N/A",323,1676,738,1296,418,653,241,622,659,1947,694,1563,1529,561,2183]
[]
[]
[]
[]
[]
[]
[]
[]
[]
[]
[]
[]
[]
[]
[]
[]
[]
[]
[]
[]
[]
[]
[]
[]
[]
[]
[]
[]
[]
[]
[]
[]
[]
[]
[]
[]
[]
[]
[]
[]
[]
[]
[]
[]
[]
[]
[]
[]
[{"$f":"A1026","v":"Trinidad and Tobago"}]
[{"$f":"A1034","v":"2000"}]
["Access to hygiene facilities "]
[" by wealth quintile and sub-national region"]
["Notes:"]
["WHO/UNICEF JMP customised wealth index excludes water,"]
[" sanitation and hygiene assets."]
["Survey used for analysis:",{"$f":"A1025","v":"MICS00"}]
[]
[]
[]
[]
["Access to handwashing",null,"NATIONAL wealth index quintile",null,null,null,null,null,null,null,null,null,null,null,null,null,null,"SUB-REGIONS:",null,null,null,null,null,null,null,null,null,null,null,null,null,null,null,null,null,null,null,null,null,null,null,null,null,null,null,null,null,null,null,null,null,null,"Raw numbers of respondents:","Access to handwashing","NATIONAL wealth index quintile",null,null,null,null,"URBAN wealth index quintile",null,null,null,null,"RURAL wealth index quintile",null,null,null,null,"SUB-REGIONS:"]
["Weighted percentage (used in graphs)",null,"Poorest","Poor","Middle","Rich","Richest",null,null,null,null,null,null,null,null,null,null,"arima borough","caroni","chaguanas borough","diego martin","nariva/mayaro","port of spain","pt. fortin borough","rest of st. george","san fernando","st anns","st. andrew/st. david","st. patrick","tacarigua","tobago","victoria",null,null,null,null,null,null,null,null,null,null,null,null,null,null,null,null,null,null,null,null,"Hygiene data, raw numbers (weighted)",null,"Poorest","Poor","Middle","Rich","Richest","Poorest","Poor","Middle","Rich","Richest","Poorest","Poor","Middle","Rich","Richest","arima borough","caroni","chaguanas borough","diego martin","nariva/mayaro","port of spain","pt. fortin borough","rest of st. george","san fernando","st anns","st. andrew/st. david","st. patrick","tacarigua","tobago","victoria"]
["Hygiene ladder","Basic","N/A","N/A","N/A","N/A","N/A","N/A","N/A","N/A","N/A","N/A","N/A","N/A","N/A","N/A","N/A","N/A","N/A","N/A","N/A","N/A","N/A","N/A","N/A","N/A","N/A","N/A","N/A","N/A","N/A","N/A",null,null,null,null,null,null,null,null,null,null,null,null,null,null,null,null,null,null,null,null,"Hygiene ladder","Basic","N/A","N/A","N/A","N/A","N/A","N/A","N/A","N/A","N/A","N/A","N/A","N/A","N/A","N/A","N/A","N/A","N/A","N/A","N/A","N/A","N/A","N/A","N/A","N/A","N/A","N/A","N/A","N/A","N/A","N/A"]
[null,"Limited","N/A","N/A","N/A","N/A","N/A","N/A","N/A","N/A","N/A","N/A","N/A","N/A","N/A","N/A","N/A","N/A","N/A","N/A","N/A","N/A","N/A","N/A","N/A","N/A","N/A","N/A","N/A","N/A","N/A","N/A",null,null,null,null,null,null,null,null,null,null,null,null,null,null,null,null,null,null,null,null,null,"Limited","N/A","N/A","N/A","N/A","N/A","N/A","N/A","N/A","N/A","N/A","N/A","N/A","N/A","N/A","N/A","N/A","N/A","N/A","N/A","N/A","N/A","N/A","N/A","N/A","N/A","N/A","N/A","N/A","N/A","N/A"]
[null,"No facility","N/A","N/A","N/A","N/A","N/A","N/A","N/A","N/A","N/A","N/A","N/A","N/A","N/A","N/A","N/A","N/A","N/A","N/A","N/A","N/A","N/A","N/A","N/A","N/A","N/A","N/A","N/A","N/A","N/A","N/A",null,null,null,null,null,null,null,null,null,null,null,null,null,null,null,null,null,null,null,null,null,"No facility","N/A","N/A","N/A","N/A","N/A","N/A","N/A","N/A","N/A","N/A","N/A","N/A","N/A","N/A","N/A","N/A","N/A","N/A","N/A","N/A","N/A","N/A","N/A","N/A","N/A","N/A","N/A","N/A","N/A","N/A"]
[null,null,null,null,null,null,null,null,null,null,null,null,null,null,null,null,null,null,null,null,null,null,null,null,null,null,null,null,null,null,null,null,null,null,null,null,null,null,null,null,null,null,null,null,null,null,null,null,null,null,null,null,"Observed handwashing place","Fixed","N/A","N/A","N/A","N/A","N/A","N/A","N/A","N/A","N/A","N/A","N/A","N/A","N/A","N/A","N/A","N/A","N/A","N/A","N/A","N/A","N/A","N/A","N/A","N/A","N/A","N/A","N/A","N/A","N/A","N/A"]
[null,null,null,null,null,null,null,null,null,null,null,null,null,null,null,null,null,null,null,null,null,null,null,null,null,null,null,null,null,null,null,null,null,null,null,null,null,null,null,null,null,null,null,null,null,null,null,null,null,null,null,null,null,"Mobile","N/A","N/A","N/A","N/A","N/A","N/A","N/A","N/A","N/A","N/A","N/A","N/A","N/A","N/A","N/A","N/A","N/A","N/A","N/A","N/A","N/A","N/A","N/A","N/A","N/A","N/A","N/A","N/A","N/A","N/A"]
[null,null,null,null,null,null,null,null,null,null,null,null,null,null,null,null,null,null,null,null,null,null,null,null,null,null,null,null,null,null,null,null,null,null,null,null,null,null,null,null,null,null,null,null,null,null,null,null,null,null,null,null,"Water / Soap","Water and soap","N/A","N/A","N/A","N/A","N/A","N/A","N/A","N/A","N/A","N/A","N/A","N/A","N/A","N/A","N/A","N/A","N/A","N/A","N/A","N/A","N/A","N/A","N/A","N/A","N/A","N/A","N/A","N/A","N/A","N/A"]
[null,null,null,null,null,null,null,null,null,null,null,null,null,null,null,null,null,null,null,null,null,null,null,null,null,null,null,null,null,null,null,null,null,null,null,null,null,null,null,null,null,null,null,null,null,null,null,null,null,null,null,null,null,"Water only","N/A","N/A","N/A","N/A","N/A","N/A","N/A","N/A","N/A","N/A","N/A","N/A","N/A","N/A","N/A","N/A","N/A","N/A","N/A","N/A","N/A","N/A","N/A","N/A","N/A","N/A","N/A","N/A","N/A","N/A"]
[null,null,null,null,null,null,null,null,null,null,null,null,null,null,null,null,null,null,null,null,null,null,null,null,null,null,null,null,null,null,null,null,null,null,null,null,null,null,null,null,null,null,null,null,null,null,null,null,null,null,null,null,null,"Soap only","N/A","N/A","N/A","N/A","N/A","N/A","N/A","N/A","N/A","N/A","N/A","N/A","N/A","N/A","N/A","N/A","N/A","N/A","N/A","N/A","N/A","N/A","N/A","N/A","N/A","N/A","N/A","N/A","N/A","N/A"]
[null,null,null,null,null,null,null,null,null,null,null,null,null,null,null,null,null,null,null,null,null,null,null,null,null,null,null,null,null,null,null,null,null,null,null,null,null,null,null,null,null,null,null,null,null,null,null,null,null,null,null,null,null,"Neither","N/A","N/A","N/A","N/A","N/A","N/A","N/A","N/A","N/A","N/A","N/A","N/A","N/A","N/A","N/A","N/A","N/A","N/A","N/A","N/A","N/A","N/A","N/A","N/A","N/A","N/A","N/A","N/A","N/A","N/A"]
[]
[]
[]
[]
[]
[]
[]
[]
[]
[]
[]
[]
[]
[]
[]
[]
[]
[]
[]
[]
[]
[]
[]
[]
[]
[]
[]
[]
[null,null,null,null,null,null,null,null,null,null,null,null,null,null,null,null,null,null,null,null,null,null,null,null,null,null,null,null,null,null,null,null,null,null,null,null,null,null,null,null,null,null,null,null,null,null,null,null,null,null,null,null,"Raw numbers of respondents:","Menstrual health and hygiene","NATIONAL wealth index quintile",null,null,null,null,"URBAN wealth index quintile",null,null,null,null,"RURAL wealth index quintile",null,null,null,null,"SUB-REGIONS:"]
[null,null,null,null,null,null,null,null,null,null,null,null,null,null,null,null,null,null,null,null,null,null,null,null,null,null,null,null,null,null,null,null,null,null,null,null,null,null,null,null,null,null,null,null,null,null,null,null,null,null,null,null,"MHH data, raw numbers (weighted)",null,"Poorest","Poor","Middle","Rich","Richest","Poorest","Poor","Middle","Rich","Richest","Poorest","Poor","Middle","Rich","Richest","arima borough","caroni","chaguanas borough","diego martin","nariva/mayaro","port of spain","pt. fortin borough","rest of st. george","san fernando","st anns","st. andrew/st. david","st. patrick","tacarigua","tobago","victoria"]
[null,null,null,null,null,null,null,null,null,null,null,null,null,null,null,null,null,null,null,null,null,null,null,null,null,null,null,null,null,null,null,null,null,null,null,null,null,null,null,null,null,null,null,null,null,null,null,null,null,null,null,null,"Private place to wash and change","Yes","N/A","N/A","N/A","N/A","N/A","N/A","N/A","N/A","N/A","N/A","N/A","N/A","N/A","N/A","N/A","N/A","N/A","N/A","N/A","N/A","N/A","N/A","N/A","N/A","N/A","N/A","N/A","N/A","N/A","N/A"]
[null,null,null,null,null,null,null,null,null,null,null,null,null,null,null,null,null,null,null,null,null,null,null,null,null,null,null,null,null,null,null,null,null,null,null,null,null,null,null,null,null,null,null,null,null,null,null,null,null,null,null,null,null,"No","N/A","N/A","N/A","N/A","N/A","N/A","N/A","N/A","N/A","N/A","N/A","N/A","N/A","N/A","N/A","N/A","N/A","N/A","N/A","N/A","N/A","N/A","N/A","N/A","N/A","N/A","N/A","N/A","N/A","N/A"]
[null,null,null,null,null,null,null,null,null,null,null,null,null,null,null,null,null,null,null,null,null,null,null,null,null,null,null,null,null,null,null,null,null,null,null,null,null,null,null,null,null,null,null,null,null,null,null,null,null,null,null,null,null,"DK/not sure/missing","N/A","N/A","N/A","N/A","N/A","N/A","N/A","N/A","N/A","N/A","N/A","N/A","N/A","N/A","N/A","N/A","N/A","N/A","N/A","N/A","N/A","N/A","N/A","N/A","N/A","N/A","N/A","N/A","N/A","N/A"]
[null,null,null,null,null,null,null,null,null,null,null,null,null,null,null,null,null,null,null,null,null,null,null,null,null,null,null,null,null,null,null,null,null,null,null,null,null,null,null,null,null,null,null,null,null,null,null,null,null,null,null,null,"Use of menstrual materials","Materials reusable","N/A","N/A","N/A","N/A","N/A","N/A","N/A","N/A","N/A","N/A","N/A","N/A","N/A","N/A","N/A","N/A","N/A","N/A","N/A","N/A","N/A","N/A","N/A","N/A","N/A","N/A","N/A","N/A","N/A","N/A"]
[null,null,null,null,null,null,null,null,null,null,null,null,null,null,null,null,null,null,null,null,null,null,null,null,null,null,null,null,null,null,null,null,null,null,null,null,null,null,null,null,null,null,null,null,null,null,null,null,null,null,null,null,null,"Materials not reusable","N/A","N/A","N/A","N/A","N/A","N/A","N/A","N/A","N/A","N/A","N/A","N/A","N/A","N/A","N/A","N/A","N/A","N/A","N/A","N/A","N/A","N/A","N/A","N/A","N/A","N/A","N/A","N/A","N/A","N/A"]
[null,null,null,null,null,null,null,null,null,null,null,null,null,null,null,null,null,null,null,null,null,null,null,null,null,null,null,null,null,null,null,null,null,null,null,null,null,null,null,null,null,null,null,null,null,null,null,null,null,null,null,null,null,"No materials used","N/A","N/A","N/A","N/A","N/A","N/A","N/A","N/A","N/A","N/A","N/A","N/A","N/A","N/A","N/A","N/A","N/A","N/A","N/A","N/A","N/A","N/A","N/A","N/A","N/A","N/A","N/A","N/A","N/A","N/A"]
[null,null,null,null,null,null,null,null,null,null,null,null,null,null,null,null,null,null,null,null,null,null,null,null,null,null,null,null,null,null,null,null,null,null,null,null,null,null,null,null,null,null,null,null,null,null,null,null,null,null,null,null,null,"DK/not sure/missing","N/A","N/A","N/A","N/A","N/A","N/A","N/A","N/A","N/A","N/A","N/A","N/A","N/A","N/A","N/A","N/A","N/A","N/A","N/A","N/A","N/A","N/A","N/A","N/A","N/A","N/A","N/A","N/A","N/A","N/A"]
[null,null,null,null,null,null,null,null,null,null,null,null,null,null,null,null,null,null,null,null,null,null,null,null,null,null,null,null,null,null,null,null,null,null,null,null,null,null,null,null,null,null,null,null,null,null,null,null,null,null,null,null,"Use of menstrual materials with private place to wash and change","Materials reusable","N/A","N/A","N/A","N/A","N/A","N/A","N/A","N/A","N/A","N/A","N/A","N/A","N/A","N/A","N/A","N/A","N/A","N/A","N/A","N/A","N/A","N/A","N/A","N/A","N/A","N/A","N/A","N/A","N/A","N/A"]
[null,null,null,null,null,null,null,null,null,null,null,null,null,null,null,null,null,null,null,null,null,null,null,null,null,null,null,null,null,null,null,null,null,null,null,null,null,null,null,null,null,null,null,null,null,null,null,null,null,null,null,null,null,"Materials not reusable","N/A","N/A","N/A","N/A","N/A","N/A","N/A","N/A","N/A","N/A","N/A","N/A","N/A","N/A","N/A","N/A","N/A","N/A","N/A","N/A","N/A","N/A","N/A","N/A","N/A","N/A","N/A","N/A","N/A","N/A"]
[null,null,null,null,null,null,null,null,null,null,null,null,null,null,null,null,null,null,null,null,null,null,null,null,null,null,null,null,null,null,null,null,null,null,null,null,null,null,null,null,null,null,null,null,null,null,null,null,null,null,null,null,null,"No materials used","N/A","N/A","N/A","N/A","N/A","N/A","N/A","N/A","N/A","N/A","N/A","N/A","N/A","N/A","N/A","N/A","N/A","N/A","N/A","N/A","N/A","N/A","N/A","N/A","N/A","N/A","N/A","N/A","N/A","N/A"]
[null,null,null,null,null,null,null,null,null,null,null,null,null,null,null,null,null,null,null,null,null,null,null,null,null,null,null,null,null,null,null,null,null,null,null,null,null,null,null,null,null,null,null,null,null,null,null,null,null,null,null,null,"Awareness of menstruation before menarche","Yes","N/A","N/A","N/A","N/A","N/A","N/A","N/A","N/A","N/A","N/A","N/A","N/A","N/A","N/A","N/A","N/A","N/A","N/A","N/A","N/A","N/A","N/A","N/A","N/A","N/A","N/A","N/A","N/A","N/A","N/A"]
[null,null,null,null,null,null,null,null,null,null,null,null,null,null,null,null,null,null,null,null,null,null,null,null,null,null,null,null,null,null,null,null,null,null,null,null,null,null,null,null,null,null,null,null,null,null,null,null,null,null,null,null,null,"No","N/A","N/A","N/A","N/A","N/A","N/A","N/A","N/A","N/A","N/A","N/A","N/A","N/A","N/A","N/A","N/A","N/A","N/A","N/A","N/A","N/A","N/A","N/A","N/A","N/A","N/A","N/A","N/A","N/A","N/A"]
[null,null,null,null,null,null,null,null,null,null,null,null,null,null,null,null,null,null,null,null,null,null,null,null,null,null,null,null,null,null,null,null,null,null,null,null,null,null,null,null,null,null,null,null,null,null,null,null,null,null,null,null,null,"DK/not sure/missing","N/A","N/A","N/A","N/A","N/A","N/A","N/A","N/A","N/A","N/A","N/A","N/A","N/A","N/A","N/A","N/A","N/A","N/A","N/A","N/A","N/A","N/A","N/A","N/A","N/A","N/A","N/A","N/A","N/A","N/A"]
[null,null,null,null,null,null,null,null,null,null,null,null,null,null,null,null,null,null,null,null,null,null,null,null,null,null,null,null,null,null,null,null,null,null,null,null,null,null,null,null,null,null,null,null,null,null,null,null,null,null,null,null,"Participation in (all) activities during menstruation","Yes","N/A","N/A","N/A","N/A","N/A","N/A","N/A","N/A","N/A","N/A","N/A","N/A","N/A","N/A","N/A","N/A","N/A","N/A","N/A","N/A","N/A","N/A","N/A","N/A","N/A","N/A","N/A","N/A","N/A","N/A"]
[null,null,null,null,null,null,null,null,null,null,null,null,null,null,null,null,null,null,null,null,null,null,null,null,null,null,null,null,null,null,null,null,null,null,null,null,null,null,null,null,null,null,null,null,null,null,null,null,null,null,null,null,null,"No","N/A","N/A","N/A","N/A","N/A","N/A","N/A","N/A","N/A","N/A","N/A","N/A","N/A","N/A","N/A","N/A","N/A","N/A","N/A","N/A","N/A","N/A","N/A","N/A","N/A","N/A","N/A","N/A","N/A","N/A"]
[null,null,null,null,null,null,null,null,null,null,null,null,null,null,null,null,null,null,null,null,null,null,null,null,null,null,null,null,null,null,null,null,null,null,null,null,null,null,null,null,null,null,null,null,null,null,null,null,null,null,null,null,null,"DK/not sure/missing/no such activity","N/A","N/A","N/A","N/A","N/A","N/A","N/A","N/A","N/A","N/A","N/A","N/A","N/A","N/A","N/A","N/A","N/A","N/A","N/A","N/A","N/A","N/A","N/A","N/A","N/A","N/A","N/A","N/A","N/A","N/A"]
[null,null,null,null,null,null,null,null,null,null,null,null,null,null,null,null,null,null,null,null,null,null,null,null,null,null,null,null,null,null,null,null,null,null,null,null,null,null,null,null,null,null,null,null,null,null,null,null,null,null,null,null,"Participation in specific activities during menstruation","Did not go to school (amongst those usually attending school)","N/A","N/A","N/A","N/A","N/A","N/A","N/A","N/A","N/A","N/A","N/A","N/A","N/A","N/A","N/A","N/A","N/A","N/A","N/A","N/A","N/A","N/A","N/A","N/A","N/A","N/A","N/A","N/A","N/A","N/A"]
[null,null,null,null,null,null,null,null,null,null,null,null,null,null,null,null,null,null,null,null,null,null,null,null,null,null,null,null,null,null,null,null,null,null,null,null,null,null,null,null,null,null,null,null,null,null,null,null,null,null,null,null,null,"Did not go to work (amongst those who usually work)","N/A","N/A","N/A","N/A","N/A","N/A","N/A","N/A","N/A","N/A","N/A","N/A","N/A","N/A","N/A","N/A","N/A","N/A","N/A","N/A","N/A","N/A","N/A","N/A","N/A","N/A","N/A","N/A","N/A","N/A"]
[null,null,null,null,null,null,null,null,null,null,null,null,null,null,null,null,null,null,null,null,null,null,null,null,null,null,null,null,null,null,null,null,null,null,null,null,null,null,null,null,null,null,null,null,null,null,null,null,null,null,null,null,null,"Did not participate in social activities","N/A","N/A","N/A","N/A","N/A","N/A","N/A","N/A","N/A","N/A","N/A","N/A","N/A","N/A","N/A","N/A","N/A","N/A","N/A","N/A","N/A","N/A","N/A","N/A","N/A","N/A","N/A","N/A","N/A","N/A"]
[null,null,null,null,null,null,null,null,null,null,null,null,null,null,null,null,null,null,null,null,null,null,null,null,null,null,null,null,null,null,null,null,null,null,null,null,null,null,null,null,null,null,null,null,null,null,null,null,null,null,null,null,null,"Did not cook food","N/A","N/A","N/A","N/A","N/A","N/A","N/A","N/A","N/A","N/A","N/A","N/A","N/A","N/A","N/A","N/A","N/A","N/A","N/A","N/A","N/A","N/A","N/A","N/A","N/A","N/A","N/A","N/A","N/A","N/A"]
[null,null,null,null,null,null,null,null,null,null,null,null,null,null,null,null,null,null,null,null,null,null,null,null,null,null,null,null,null,null,null,null,null,null,null,null,null,null,null,null,null,null,null,null,null,null,null,null,null,null,null,null,null,"Did not eat with others","N/A","N/A","N/A","N/A","N/A","N/A","N/A","N/A","N/A","N/A","N/A","N/A","N/A","N/A","N/A","N/A","N/A","N/A","N/A","N/A","N/A","N/A","N/A","N/A","N/A","N/A","N/A","N/A","N/A","N/A"]
[null,null,null,null,null,null,null,null,null,null,null,null,null,null,null,null,null,null,null,null,null,null,null,null,null,null,null,null,null,null,null,null,null,null,null,null,null,null,null,null,null,null,null,null,null,null,null,null,null,null,null,null,null,"Did not bathe in regular place","N/A","N/A","N/A","N/A","N/A","N/A","N/A","N/A","N/A","N/A","N/A","N/A","N/A","N/A","N/A","N/A","N/A","N/A","N/A","N/A","N/A","N/A","N/A","N/A","N/A","N/A","N/A","N/A","N/A","N/A"]
[null,null,null,null,null,null,null,null,null,null,null,null,null,null,null,null,null,null,null,null,null,null,null,null,null,null,null,null,null,null,null,null,null,null,null,null,null,null,null,null,null,null,null,null,null,null,null,null,null,null,null,null,null,"Did not participate in other activities","N/A","N/A","N/A","N/A","N/A","N/A","N/A","N/A","N/A","N/A","N/A","N/A","N/A","N/A","N/A","N/A","N/A","N/A","N/A","N/A","N/A","N/A","N/A","N/A","N/A","N/A","N/A","N/A","N/A","N/A"]
[null,null,null,null,null,null,null,null,null,null,null,null,null,null,null,null,null,null,null,null,null,null,null,null,null,null,null,null,null,null,null,null,null,null,null,null,null,null,null,null,null,null,null,null,null,null,null,null,null,null,null,null,null,"DK/not sure/missing/no such activity","N/A","N/A","N/A","N/A","N/A","N/A","N/A","N/A","N/A","N/A","N/A","N/A","N/A","N/A","N/A","N/A","N/A","N/A","N/A","N/A","N/A","N/A","N/A","N/A","N/A","N/A","N/A","N/A","N/A","N/A"]
[]
[]
[]
[]
[]
[]
[]
[]
[]
[]
[]
[]
[]
[]
[]
[]
[]
[]
[]
[]
[]
[]
[]
[]
[]
[]
[]
[]
[]
[]
[]
[]
[]
[]
[]
[]
[]
[]
[]
[]
[]
[]
[]
[]
[]
[]
[]
[]
[]
[]
[]
[]
[]
[]
[null,null,null,null,null,null,null,null,null,null,null,null,null,null,null,null,null,null,null,null,null,null,null,null,null,null,null,null,null,null,null,null,null,null,null,null,null,null,null,null,null,null,null,null,null,null,null,null,null,null,null,null,"Raw numbers of respondents:","Basic water, sanitation and hygiene","NATIONAL wealth index quintile",null,null,null,null,"URBAN wealth index quintile",null,null,null,null,"RURAL wealth index quintile",null,null,null,null,"SUB-REGIONS:"]
[null,null,null,null,null,null,null,null,null,null,null,null,null,null,null,null,null,null,null,null,null,null,null,null,null,null,null,null,null,null,null,null,null,null,null,null,null,null,null,null,null,null,null,null,null,null,null,null,null,null,null,null,"WatSan data, raw numbers (weighted)",null,"Poorest","Poor","Middle","Rich","Richest","Poorest","Poor","Middle","Rich","Richest","Poorest","Poor","Middle","Rich","Richest","arima borough","caroni","chaguanas borough","diego martin","nariva/mayaro","port of spain","pt. fortin borough","rest of st. george","san fernando","st anns","st. andrew/st. david","st. patrick","tacarigua","tobago","victoria"]
[null,null,null,null,null,null,null,null,null,null,null,null,null,null,null,null,null,null,null,null,null,null,null,null,null,null,null,null,null,null,null,null,null,null,null,null,null,null,null,null,null,null,null,null,null,null,null,null,null,null,null,null,"Use of Basic Water Sanitation and Hygiene","Yes","N/A","N/A","N/A","N/A","N/A","N/A","N/A","N/A","N/A","N/A","N/A","N/A","N/A","N/A","N/A","N/A","N/A","N/A","N/A","N/A","N/A","N/A","N/A","N/A","N/A","N/A","N/A","N/A","N/A","N/A"]
[null,null,null,null,null,null,null,null,null,null,null,null,null,null,null,null,null,null,null,null,null,null,null,null,null,null,null,null,null,null,null,null,null,null,null,null,null,null,null,null,null,null,null,null,null,null,null,null,null,null,null,null,null,"No","N/A","N/A","N/A","N/A","N/A","N/A","N/A","N/A","N/A","N/A","N/A","N/A","N/A","N/A","N/A","N/A","N/A","N/A","N/A","N/A","N/A","N/A","N/A","N/A","N/A","N/A","N/A","N/A","N/A","N/A"]
[null,null,null,null,null,null,null,null,null,null,null,null,null,null,null,null,null,null,null,null,null,null,null,null,null,null,null,null,null,null,null,null,null,null,null,null,null,null,null,null,null,null,null,null,null,null,null,null,null,null,null,null,"Use of Basic Water and Sanitation","Yes","N/A","N/A","N/A","N/A","N/A","N/A","N/A","N/A","N/A","N/A","N/A","N/A","N/A","N/A","N/A","N/A","N/A","N/A","N/A","N/A","N/A","N/A","N/A","N/A","N/A","N/A","N/A","N/A","N/A","N/A"]
[null,null,null,null,null,null,null,null,null,null,null,null,null,null,null,null,null,null,null,null,null,null,null,null,null,null,null,null,null,null,null,null,null,null,null,null,null,null,null,null,null,null,null,null,null,null,null,null,null,null,null,null,null,"No","N/A","N/A","N/A","N/A","N/A","N/A","N/A","N/A","N/A","N/A","N/A","N/A","N/A","N/A","N/A","N/A","N/A","N/A","N/A","N/A","N/A","N/A","N/A","N/A","N/A","N/A","N/A","N/A","N/A","N/A"]
[null,null,null,null,null,null,null,null,null,null,null,null,null,null,null,null,null,null,null,null,null,null,null,null,null,null,null,null,null,null,null,null,null,null,null,null,null,null,null,null,null,null,null,null,null,null,null,null,null,null,null,null,"Use of Basic Water and Hygiene","Yes","N/A","N/A","N/A","N/A","N/A","N/A","N/A","N/A","N/A","N/A","N/A","N/A","N/A","N/A","N/A","N/A","N/A","N/A","N/A","N/A","N/A","N/A","N/A","N/A","N/A","N/A","N/A","N/A","N/A","N/A"]
[null,null,null,null,null,null,null,null,null,null,null,null,null,null,null,null,null,null,null,null,null,null,null,null,null,null,null,null,null,null,null,null,null,null,null,null,null,null,null,null,null,null,null,null,null,null,null,null,null,null,null,null,null,"No","N/A","N/A","N/A","N/A","N/A","N/A","N/A","N/A","N/A","N/A","N/A","N/A","N/A","N/A","N/A","N/A","N/A","N/A","N/A","N/A","N/A","N/A","N/A","N/A","N/A","N/A","N/A","N/A","N/A","N/A"]
[null,null,null,null,null,null,null,null,null,null,null,null,null,null,null,null,null,null,null,null,null,null,null,null,null,null,null,null,null,null,null,null,null,null,null,null,null,null,null,null,null,null,null,null,null,null,null,null,null,null,null,null,"Use of Basic Sanitation and Hygiene","Yes","N/A","N/A","N/A","N/A","N/A","N/A","N/A","N/A","N/A","N/A","N/A","N/A","N/A","N/A","N/A","N/A","N/A","N/A","N/A","N/A","N/A","N/A","N/A","N/A","N/A","N/A","N/A","N/A","N/A","N/A"]
[null,null,null,null,null,null,null,null,null,null,null,null,null,null,null,null,null,null,null,null,null,null,null,null,null,null,null,null,null,null,null,null,null,null,null,null,null,null,null,null,null,null,null,null,null,null,null,null,null,null,null,null,null,"No","N/A","N/A","N/A","N/A","N/A","N/A","N/A","N/A","N/A","N/A","N/A","N/A","N/A","N/A","N/A","N/A","N/A","N/A","N/A","N/A","N/A","N/A","N/A","N/A","N/A","N/A","N/A","N/A","N/A","N/A"]
[null,null,null,null,null,null,null,null,null,null,null,null,null,null,null,null,null,null,null,null,null,null,null,null,null,null,null,null,null,null,null,null,null,null,null,null,null,null,null,null,null,null,null,null,null,null,null,null,null,null,null,null,"Use of Basic Water","Yes","N/A","N/A","N/A","N/A","N/A","N/A","N/A","N/A","N/A","N/A","N/A","N/A","N/A","N/A","N/A","N/A","N/A","N/A","N/A","N/A","N/A","N/A","N/A","N/A","N/A","N/A","N/A","N/A","N/A","N/A"]
[null,null,null,null,null,null,null,null,null,null,null,null,null,null,null,null,null,null,null,null,null,null,null,null,null,null,null,null,null,null,null,null,null,null,null,null,null,null,null,null,null,null,null,null,null,null,null,null,null,null,null,null,null,"No","N/A","N/A","N/A","N/A","N/A","N/A","N/A","N/A","N/A","N/A","N/A","N/A","N/A","N/A","N/A","N/A","N/A","N/A","N/A","N/A","N/A","N/A","N/A","N/A","N/A","N/A","N/A","N/A","N/A","N/A"]
[null,null,null,null,null,null,null,null,null,null,null,null,null,null,null,null,null,null,null,null,null,null,null,null,null,null,null,null,null,null,null,null,null,null,null,null,null,null,null,null,null,null,null,null,null,null,null,null,null,null,null,null,"Use of Basic Sanitation","Yes","N/A","N/A","N/A","N/A","N/A","N/A","N/A","N/A","N/A","N/A","N/A","N/A","N/A","N/A","N/A","N/A","N/A","N/A","N/A","N/A","N/A","N/A","N/A","N/A","N/A","N/A","N/A","N/A","N/A","N/A"]
[null,null,null,null,null,null,null,null,null,null,null,null,null,null,null,null,null,null,null,null,null,null,null,null,null,null,null,null,null,null,null,null,null,null,null,null,null,null,null,null,null,null,null,null,null,null,null,null,null,null,null,null,null,"No","N/A","N/A","N/A","N/A","N/A","N/A","N/A","N/A","N/A","N/A","N/A","N/A","N/A","N/A","N/A","N/A","N/A","N/A","N/A","N/A","N/A","N/A","N/A","N/A","N/A","N/A","N/A","N/A","N/A","N/A"]
[null,null,null,null,null,null,null,null,null,null,null,null,null,null,null,null,null,null,null,null,null,null,null,null,null,null,null,null,null,null,null,null,null,null,null,null,null,null,null,null,null,null,null,null,null,null,null,null,null,null,null,null,"Access to Basic Hygiene","Yes","N/A","N/A","N/A","N/A","N/A","N/A","N/A","N/A","N/A","N/A","N/A","N/A","N/A","N/A","N/A","N/A","N/A","N/A","N/A","N/A","N/A","N/A","N/A","N/A","N/A","N/A","N/A","N/A","N/A","N/A"]
[null,null,null,null,null,null,null,null,null,null,null,null,null,null,null,null,null,null,null,null,null,null,null,null,null,null,null,null,null,null,null,null,null,null,null,null,null,null,null,null,null,null,null,null,null,null,null,null,null,null,null,null,null,"No","N/A","N/A","N/A","N/A","N/A","N/A","N/A","N/A","N/A","N/A","N/A","N/A","N/A","N/A","N/A","N/A","N/A","N/A","N/A","N/A","N/A","N/A","N/A","N/A","N/A","N/A","N/A","N/A","N/A","N/A"]
[]
[]
[]
[]
[]
[]
[]
[]
[]
[]
[]
[]
[]
[]
[]
[]
[]
[]
[]
[]
[]
[]
[]
[]
[]
[]
[]
[]
[]
[]
[]
[]
[]
[]
[]
[]
[]
[]
[]
[]
[]
[]
[]
[]
[null,null,"INITIAL (national) Wealth Index",null,null,null,null,"URBAN Wealth Index",null,null,null,null,"RURAL Wealth Index"]
[null,null,"Component Matrix"]
[null,null,null,null,"Component"]
[null,"Note:\n\nThe INITIAL (national) Wealth Index is based on the first component of the Principal Component Analysis (PCA) which has been obtained at national level.\n\nThe final national-level (NATIONAL) Wealth Index is based on the URBAN and RURAL specific wealth indexes. Regression procedures are used to establish the relationships between the two sets of scores (urban and rural) and the initial (national) wealth factors.\nThis allows best use of the available information for each area and a better precision of the FINAL (NATIONAL) Wealth Index.\n\nFor dependency reasons, all WASH variables (contained in the generic MICS and DHS scripts) have been excluded from the sets of asset variables used in the PCAs.\n\nThe PCA can extracts as many components as there are asset variables in the input. Only the first of the components is used to represent the Wealth Index. \n\nThe scores represent the weights of the asset variables on the Wealth Index (correlations between the variables and the component).\n\nThe communalities are the proportion of each variable's variance that can be explained by the component.\n\nProportion of explained variance is the part of the model's total variance that is explained by the component.\n\nFor more information on the procedure used:\n\nThe DHS Wealth Index, DHS Comparative Reports No. 6, Shea Oscar Rutstein, Kiersten Johnson, ORC Macro International Inc., 2004.\n\nThe DHS Wealth Index: Approaches for Rural and Urban Areas, Shea O. Rutstein, ORC Macro International Inc., 2008.\n\nMICS Methodological Paper No. 4, Review of options for reporting water, sanitation and hygiene coverage by wealth quintile, UNICEF, 2016.",null,null,"1"]
[null,null,"wall1",null,0.73458815707489644]
[null,null,"Household member owns: asset2j",null,0.72813583210771626]
[null,null,"Household member owns: asset2c",null,0.6780959874667738]
[null,null,"Household member owns: asset2g",null,0.66041182649803643]
[null,null,"wall4",null,-0.65226770146581492]
[null,null,"Household member owns: asset2d",null,0.63721667762274403]
[null,null,"Household member owns: asset2f",null,0.61026236794965094]
[null,null,"Household member owns: asset2i",null,0.58222467887341589]
[null,null,"Household member owns: asset2b",null,0.53407719262897102]
[null,null,"Household member owns: asset2a",null,0.51185958613967675]
[null,null,"Household member owns: asset2e",null,0.44044883478868152]
[null,null,"Household member owns: asset2h",null,0.4273550757009128]
[null,null,"Persons per sleeping rooms",null,-0.29084253509975549]
[null,null,"wall2",null,-0.19289156995314022]
[null,null,"wall6",null,-0.11788783736429341]
[null,null,"owner5",null,-9.9789426149367269E-2]
[null,null,"owner1",null,9.1927581445496717E-2]
[null,null,"wall5",null,-6.213030997564109E-2]
[null,null,"wall3",null,-5.3500540907278286E-2]
[null,null,"owner4",null,-4.2940013817005497E-2]
[null,null,"owner3",null,-2.8417099319557257E-2]
[null,null,"owner2",null,1.5296618328001737E-2]
[]
[]
[]
[null,null,"Communalities"]
[null,null,null,null,"Extraction"]
[null,null,"Persons per sleeping rooms",null,8.4589380223252505E-2]
[null,null,"wall1",null,0.53961976051469274]
[null,null,"wall2",null,3.7207157758987183E-2]
[null,null,"wall3",null,2.8623078773713571E-3]
[null,null,"wall4",null,0.42545315437549747]
[null,null,"wall5",null,3.8601754176692468E-3]
[null,null,"wall6",null,1.3897542198430094E-2]
[null,null,"owner1",null,8.4506802304184329E-3]
[null,null,"owner2",null,2.3398653227255865E-4]
[null,null,"owner3",null,8.0753153373758148E-4]
[null,null,"owner4",null,1.8438447866046231E-3]
[null,null,"owner5",null,9.9579295712200235E-3]
[null,null,"Household member owns: asset2a",null,0.26200023592308114]
[null,null,"Household member owns: asset2b",null,0.28523844768644302]
[null,null,"Household member owns: asset2c",null,0.45981416821853904]
[null,null,"Household member owns: asset2d",null,0.40604509424056812]
[null,null,"Household member owns: asset2e",null,0.19399517606670727]
[null,null,"Household member owns: asset2f",null,0.37242015773551518]
[null,null,"Household member owns: asset2g",null,0.43614378057847258]
[null,null,"Household member owns: asset2h",null,0.18263236072733291]
[null,null,"Household member owns: asset2i",null,0.33898557668925228]
[null,null,"Household member owns: asset2j",null,0.53018178999919641]
[]
[]
[null,null,"Total Variance Explained"]
[null,null,"Component",null,"Extraction Sums of Squared Loadings"]
[null,null,null,null,"Total","% of Variance","Cumulative %"]
[null,null,"1",null,4.5962402388852617,20.8920010858421,20.8920010858421]
[]
[]
[null,null,"Component Score Coefficient Matrix"]
[null,null,null,null,"Component"]
[null,null,null,null,"1"]
[null,null,"Persons per sleeping rooms",null,-6.3278357958567955E-2]
[null,null,"wall1",null,0.15982370783409225]
[null,null,"wall2",null,-4.1967251476811997E-2]
[null,null,"wall3",null,-1.1640066255599798E-2]
[null,null,"wall4",null,-0.14191331774772745]
[null,null,"wall5",null,-1.3517637622595139E-2]
[null,null,"wall6",null,-2.5648754468257529E-2]
[null,null,"owner1",null,2.0000604117201705E-2]
[null,null,"owner2",null,3.3280719746954885E-3]
[null,null,"owner3",null,-6.1826836376266811E-3]
[null,null,"owner4",null,-9.3424215413552558E-3]
[null,null,"owner5",null,-2.171109884664546E-2]
[null,null,"Household member owns: asset2a",null,0.11136484594717777]
[null,null,"Household member owns: asset2b",null,0.11619871130985576]
[null,null,"Household member owns: asset2c",null,0.14753275551828732]
[null,null,"Household member owns: asset2d",null,0.13863867955198309]
[null,null,"Household member owns: asset2e",null,9.5828070748430833E-2]
[null,null,"Household member owns: asset2f",null,0.13277425378827881]
[null,null,"Household member owns: asset2g",null,0.14368522796323802]
[null,null,"Household member owns: asset2h",null,9.2979272946916353E-2]
[null,null,"Household member owns: asset2i",null,0.12667411810802656]
[null,null,"Household member owns: asset2j",null,0.15841988109053085]
[]
[]
[null,null,"Component Score Covariance Matrix"]
[null,null,"Component",null,"1"]
[null,null,"1",null,0.99999999999999989]
[]
[]
[]
[]
[]
[]
[]
[]
[]
[]
[]
[]
[]
[]
[]
[]
[]
[]
[]
[]
[]
[]
[]
[]
[]
[]
[]
[]
[]
[]
[]
[]
[]
[]
[]
[]
[]
[]
[]
[]
[]
[]
[]
[]
[]
[]
[]
[]
[]
[]
[]
[]
[]
[]
[]
[]
[]
[]
[]
[]
[]
[]
[]
[]
[]
[]
[]
[]
[]
[]
[]
[]
[]
[]
[]
[]
[]
[]
[]
[]
[]
[]
[]
[]
[]
[]
[]
[]
[]
[]
[]
[]
[]
[]
[]
[]
[]
[]
[]
[]
[]
[]
[]
[]
[]
[]
[]
[]
[]
[]
[]
[]
[]
[]
[]
[]
[]
[]
[]
[]
[]
[]
[]
[]
[]
[]
[]
[]
[]
[]
[]
[]
[]
[]
[]
[]
[]
[]
[]
[]
[]
[]
[]
[]
[]
[]
[]
[]
[]
[]
[]
[]
[]
[]
[]
[]
[]
[]
[]
[]
[]
[]
[]
[]
[]
[]
[]
[]
[]
[]
[]
[]
[]
[]
[]
[]
[]
[]
[]
[]
[]
[]
[]
[]
[]
[]
[]
[]
[]
[]
[]
[]
[]
[]
[]
[]
[]
[]
[]
[]
[]
[]
[]
[]
[]
[]
[]
[]
[]
[]
[]
[]
[]
[]
[]
[]
[]
[]
[]
[]
[]
[]
[]
[]
[]
[]
[]
[]
[]
[]
[]
[]
[]
[]
[]
[]
[]
[]
[]
[]
[]
[]
[]
[]
[]
[]
[]
[]
[]
[]
[]
[]
[]
[]
[]
[]
[]
[]
[]
[]
[]
[]
[]
[]
[]
[]
[]
[]
[]
[]
[]
[]
[]
[]
[]
[]
[]
[]
[]
[]
[]
[]
[]
[]
[]
[]
[]
[]
[]
[]
[]
[]
[]
[]
[]
[]
[]
[]
[]
[]
[]
[]
[]
[]
[]
[]
[]
[]
[]
[]
[]
[]
[]
[]
[]
[]
[]
[]
[]
[]
[]
[]
[]
[]
[]
[]
[]
[]
[]
[]
[]
[]
[]
[]
[]
[]
[]
[]
[]
[]
[]
[]
[]
[]
[]
[]
[]
[]
[]
[]
[]
[]
[]
[]
[]
[]
[]
[]
[]
[]
[]
[]
[]
[]
[]
[]
[]
[]
[]
[]
[]
[]
[]
[]
[]
[]
[]
[]
[]
[]
[]
[]
[]
[]
[]
[]
[]
[]
[]
[]
[]
[]
[]
[]
[]
[]
[]
[]
[]
[]
[]
[]
[]
[]
[]
[]
[]
[]
[]
[]
[]
[]
[]
[]
[]
[]
[]
[]
[]
[]
[]
[]
[]
[]
[]
[]
[]
[]
[]
[]
[]
[]
[]
[]
[]
[]
[]
[]
[]
[]
[]
[]
[]
[]
[]
[]
[]
[]
[]
[]
[]
[]
[]
[]
[]
[]
[]
[]
[]
[]
[]
[]
[]
[]
[]
[]
[]
[]
[]
[]
[]
[]
[]
[]
[]
[]
[]
[]
[]
[]
[]
[]
[]
[]
[]
[]
[]
[]
[]
[]
[]
[]
[]
[]
[]
[]
[]
[]
[]
[]
[]
[]
[]
[]
[]
[]
[]
[]
[]
[]
[]
[]
[]
[]
[]
[]
[]
[]
[]
[]
[]
[]
[]
[]
[]
[]
[]
[]
[]
[]
[]
[]
[]
[]
[]
["MICS00"]
["Trinidad and Tobago",null,"Count"]
["W_text_t","",4007]
["W_text_i","",4007]
["S_text_s","Ratio of Shared improved based on:",4007]
["S_text_i","Ratio of Improved latrines based on:",4007]
["Urban/Rural",".00",4007]
[null,"Urban",0]
[null,"Rural",0]
["2000"]
["2000"]
["Sub-national region names","Weighted population"]
[{"$f":"R15","v":"arima borough"},{"$f":"BR122+BR123","v":{"$error":"#VALUE!"}}]
[{"$f":"S15","v":"caroni"},{"$f":"BS122+BS123","v":{"$error":"#VALUE!"}}]
[{"$f":"T15","v":"chaguanas borough"},{"$f":"BT122+BT123","v":{"$error":"#VALUE!"}}]
[{"$f":"U15","v":"diego martin"},{"$f":"BU122+BU123","v":{"$error":"#VALUE!"}}]
[{"$f":"V15","v":"nariva/mayaro"},{"$f":"BV122+BV123","v":{"$error":"#VALUE!"}}]
[{"$f":"W15","v":"port of spain"},{"$f":"BW122+BW123","v":{"$error":"#VALUE!"}}]
[{"$f":"X15","v":"pt. fortin borough"},{"$f":"BX122+XR123","v":{"$error":"#VALUE!"}}]
[{"$f":"Y15","v":"rest of st. george"},{"$f":"BY122+BY123","v":{"$error":"#VALUE!"}}]
[{"$f":"Z15","v":"san fernando"},{"$f":"BZ122+BZ123","v":{"$error":"#VALUE!"}}]
[{"$f":"AA15","v":"st anns"},{"$f":"CA122+CA123","v":{"$error":"#VALUE!"}}]
[{"$f":"AB15","v":"st. andrew/st. david"},{"$f":"CB122+CB123","v":{"$error":"#VALUE!"}}]
[{"$f":"AC15","v":"st. patrick"},{"$f":"CC122+CC123","v":{"$error":"#VALUE!"}}]
[{"$f":"AD15","v":"tacarigua"},{"$f":"CD122+CD123","v":{"$error":"#VALUE!"}}]
[{"$f":"AE15","v":"tobago"},{"$f":"CE122+CE123","v":{"$error":"#VALUE!"}}]
[{"$f":"AF15","v":"victoria"},{"$f":"CF122+CF123","v":{"$error":"#VALUE!"}}]
[{"$f":"AG15","v":0},{"$f":"CG122+CG123","v":0}]
[{"$f":"AH15","v":0},{"$f":"CH122+CH123","v":0}]
[{"$f":"AI15","v":0},{"$f":"CI122+CI123","v":0}]
[{"$f":"AJ15","v":0},{"$f":"CJ122+CJ123","v":0}]
[{"$f":"AK15","v":0},{"$f":"CK122+CK123","v":0}]
[{"$f":"AL15","v":0},{"$f":"CL122+CL123","v":0}]
[{"$f":"AM15","v":0},{"$f":"CM122+CM123","v":0}]
[{"$f":"AN15","v":0},{"$f":"CN122+CN123","v":0}]
[{"$f":"AO15","v":0},{"$f":"CO122+CO123","v":0}]
[{"$f":"AP15","v":0},{"$f":"CP122+CP123","v":0}]
[{"$f":"AQ15","v":0},{"$f":"CQ122+CQ123","v":0}]
[{"$f":"AR15","v":0},{"$f":"CR122+CR123","v":0}]
[{"$f":"AS15","v":0},{"$f":"CS122+CS123","v":0}]
[{"$f":"AT15","v":0},{"$f":"CT122+CT123","v":0}]
[{"$f":"AU15","v":0},{"$f":"CU122+CU123","v":0}]
[{"$f":"AV15","v":0},{"$f":"CV122+CV123","v":0}]
[{"$f":"AW15","v":0},{"$f":"CW122+CW123","v":0}]
[{"$f":"AX15","v":0},{"$f":"CX122+CX123","v":0}]
[{"$f":"AY15","v":0},{"$f":"CY122+CY123","v":0}]
[]
[{"$f":"34-COUNTIF(A1037:A1071,\"0\")","v":15},"Sub-regions"]

{"sheet":"MICS06","index":5,"n_rows":1072,"n_cols":84,"rows_kept":1072,"cut":false,"hidden":false,"merged":[[346,52,347,52],[348,52,349,52],[350,52,351,52],[352,52,353,52],[152,52,163,52],[270,52,272,52],[273,52,275,52],[276,52,283,52],[338,54,338,58],[338,59,338,63],[338,64,338,68],[340,52,341,52],[342,52,343,52],[344,52,345,52],[221,52,223,52],[224,52,225,52],[226,52,229,52],[258,54,258,58],[258,59,258,63],[258,64,258,68],[260,52,262,52],[263,52,266,52],[267,52,269,52],[119,64,119,68],[121,52,122,52],[123,52,126,52],[127,52,128,52],[132,54,132,58],[132,59,132,63],[132,64,132,68],[134,52,138,52],[219,54,219,58],[219,59,219,63],[219,64,219,68],[13,64,13,68],[15,52,16,52],[17,52,20,52],[21,52,22,52],[26,54,26,58],[26,59,26,63],[26,64,26,68],[40,52,41,52],[55,54,55,58],[55,59,55,63],[55,64,55,68],[139,52,142,52],[143,52,146,52],[147,0,149,0],[147,52,149,52],[150,0,151,0],[150,52,151,52],[13,54,13,58],[13,59,13,63],[119,54,119,58],[119,59,119,63],[42,52,43,52],[44,52,45,52],[46,0,48,0],[46,52,48,52],[49,0,51,0],[49,52,51,52],[52,0,54,0],[52,52,54,52],[32,52,33,52],[34,52,35,52],[36,52,37,52],[38,0,39,0],[38,52,39,52],[13,2,13,6],[28,52,29,52],[30,0,31,0],[30,52,31,52],[28,0,29,0],[34,0,35,0],[36,0,37,0],[40,0,41,0],[15,0,16,0],[17,0,20,0],[21,0,22,0],[23,0,25,0],[26,2,26,6],[32,0,33,0],[57,0,69,0],[42,0,43,0],[44,0,45,0],[55,2,55,6],[121,0,122,0],[123,0,126,0],[127,0,128,0],[129,0,131,0],[132,2,132,6],[107,0,107,1],[119,2,119,6],[207,0,207,1],[134,0,138,0],[152,0,162,0],[139,0,142,0],[143,0,146,0],[1025,0,1025,1],[1034,0,1034,2],[398,2,398,5],[398,7,398,10],[219,2,219,6],[221,0,223,0],[398,12,398,15],[399,2,399,4],[399,7,399,8],[399,12,399,13],[400,2,401,3],[400,7,400,8],[400,12,400,13],[1024,0,1024,2],[404,7,404,8],[404,12,404,13],[405,2,405,3],[405,7,405,8],[405,12,405,13],[406,2,406,3],[406,7,406,8],[406,12,406,13],[401,1,444,1],[401,7,401,8],[401,12,401,13],[402,2,402,3],[402,7,402,8],[402,12,402,13],[403,2,403,3],[403,7,403,8],[403,12,403,13],[404,2,404,3],[409,2,409,3],[409,7,409,8],[409,12,409,13],[410,2,410,3],[410,7,410,8],[410,12,410,13],[407,2,407,3],[407,7,407,8],[407,12,407,13],[408,2,408,3],[408,7,408,8],[408,12,408,13],[413,2,413,3],[413,7,413,8],[413,12,413,13],[414,2,414,3],[414,7,414,8],[414,12,414,13],[411,2,411,3],[411,7,411,8],[411,12,411,13],[412,2,412,3],[412,7,412,8],[412,12,412,13],[417,2,417,3],[417,7,417,8],[417,12,417,13],[418,2,418,3],[418,7,418,8],[418,12,418,13],[415,2,415,3],[415,7,415,8],[415,12,415,13],[416,2,416,3],[416,7,416,8],[416,12,416,13],[421,2,421,3],[421,7,421,8],[421,12,421,13],[422,2,422,3],[422,7,422,8],[422,12,422,13],[419,2,419,3],[419,7,419,8],[419,12,419,13],[420,2,420,3],[420,7,420,8],[420,12,420,13],[425,2,425,3],[425,7,425,8],[425,12,425,13],[426,2,426,3],[426,7,426,8],[426,12,426,13],[423,2,423,3],[423,7,423,8],[423,12,423,13],[424,2,424,3],[424,7,424,8],[424,12,424,13],[429,2,429,3],[429,7,429,8],[429,12,429,13],[430,2,430,3],[430,7,430,8],[430,12,430,13],[427,2,427,3],[427,7,427,8],[427,12,427,13],[428,2,428,3],[428,7,428,8],[428,12,428,13],[433,2,433,3],[433,7,433,8],[433,12,433,13],[434,2,434,3],[434,7,434,8],[434,12,434,13],[431,2,431,3],[431,7,431,8],[431,12,431,13],[432,2,432,3],[432,7,432,8],[432,12,432,13],[437,2,437,3],[437,7,437,8],[437,12,437,13],[438,2,438,3],[438,7,438,8],[438,12,438,13],[435,2,435,3],[435,7,435,8],[435,12,435,13],[436,2,436,3],[436,7,436,8],[436,12,436,13],[441,2,441,3],[441,7,441,8],[441,12,441,13],[442,2,442,3],[442,7,442,8],[442,12,442,13],[439,2,439,3],[439,7,439,8],[439,12,439,13],[440,2,440,3],[440,7,440,8],[440,12,440,13],[445,2,445,3],[445,7,445,8],[445,12,445,13],[446,2,446,3],[446,7,446,8],[446,12,446,13],[443,2,443,3],[443,7,443,8],[443,12,443,13],[444,2,444,3],[444,7,444,8],[444,12,444,13],[449,2,449,3],[449,7,449,8],[449,12,449,13],[450,2,450,3],[450,7,450,8],[450,12,450,13],[447,2,447,3],[447,7,447,8],[447,12,447,13],[448,2,448,3],[448,7,448,8],[448,12,448,13],[453,2,453,3],[453,7,453,8],[453,12,453,13],[454,2,454,3],[454,7,454,8],[454,12,454,13],[451,2,451,3],[451,7,451,8],[451,12,451,13],[452,2,452,3],[452,7,452,8],[452,12,452,13],[457,2,457,3],[457,7,457,8],[457,12,457,13],[458,2,458,3],[458,7,458,8],[458,12,458,13],[455,2,455,3],[455,7,455,8],[455,12,455,13],[456,2,456,3],[456,7,456,8],[456,12,456,13],[461,2,461,3],[461,7,461,8],[461,12,461,13],[462,2,462,4],[462,7,462,8],[462,12,462,13],[459,2,459,3],[459,7,459,8],[459,12,459,13],[460,2,460,3],[460,7,460,8],[460,12,460,13],[465,2,465,3],[465,7,465,8],[465,12,465,13],[466,2,466,3],[466,7,466,8],[466,12,466,13],[463,2,463,3],[463,7,463,8],[463,12,463,13],[464,2,464,3],[464,7,464,8],[464,12,464,13],[469,2,469,3],[469,7,469,8],[469,12,469,13],[470,2,470,3],[470,7,470,8],[470,12,470,13],[467,2,467,3],[467,7,467,8],[467,12,467,13],[468,2,468,3],[468,7,468,8],[468,12,468,13],[473,2,473,3],[473,7,473,8],[473,12,473,13],[474,2,474,3],[474,7,474,8],[474,12,474,13],[471,2,471,3],[471,7,471,8],[471,12,471,13],[472,2,472,3],[472,7,472,8],[472,12,472,13],[477,2,477,3],[477,7,477,8],[477,12,477,13],[478,2,478,3],[478,7,478,8],[478,12,478,13],[475,2,475,3],[475,7,475,8],[475,12,475,13],[476,2,476,3],[476,7,476,8],[476,12,476,13],[481,2,481,3],[481,7,481,8],[481,12,481,13],[482,2,482,3],[482,7,482,8],[482,12,482,13],[479,2,479,3],[479,7,479,8],[479,12,479,13],[480,2,480,3],[480,7,480,8],[480,12,480,13],[485,2,485,3],[485,7,485,8],[485,12,485,13],[486,2,486,3],[486,7,486,8],[486,12,486,13],[483,2,483,3],[483,7,483,8],[483,12,483,13],[484,2,484,3],[484,7,484,8],[484,12,484,13],[489,2,489,3],[489,7,489,8],[489,12,489,13],[490,2,490,3],[490,7,490,8],[490,12,490,13],[487,2,487,3],[487,7,487,8],[487,12,487,13],[488,2,488,3],[488,7,488,8],[488,12,488,13],[493,2,493,3],[493,7,493,8],[493,12,493,13],[494,2,494,3],[494,7,494,8],[494,12,494,13],[491,2,491,3],[491,7,491,8],[491,12,491,13],[492,2,492,3],[492,7,492,8],[492,12,492,13],[497,2,497,3],[497,7,497,8],[497,12,497,13],[498,2,498,3],[498,7,498,8],[498,12,498,13],[495,2,495,3],[495,7,495,8],[495,12,495,13],[496,2,496,3],[496,7,496,8],[496,12,496,13],[501,2,501,3],[501,7,501,8],[501,12,501,13],[502,2,502,3],[502,7,502,8],[502,12,502,13],[499,2,499,3],[499,7,499,8],[499,12,499,13],[500,2,500,3],[500,7,500,8],[500,12,500,13],[505,2,505,3],[505,7,505,8],[505,12,505,13],[506,2,506,3],[506,7,506,8],[506,12,506,13],[503,2,503,3],[503,7,503,8],[503,12,503,13],[504,2,504,3],[504,7,504,8],[504,12,504,13],[509,2,509,3],[509,7,509,8],[509,12,509,13],[510,2,510,3],[510,7,510,8],[510,12,510,13],[507,2,507,3],[507,7,507,8],[507,12,507,13],[508,2,508,3],[508,7,508,8],[508,12,508,13],[513,2,513,3],[513,7,513,8],[513,12,513,13],[514,2,514,3],[514,7,514,8],[514,12,514,13],[511,2,511,3],[511,7,511,8],[511,12,511,13],[512,2,512,3],[512,7,512,8],[512,12,512,13],[517,2,517,3],[517,7,517,8],[517,12,517,13],[518,2,518,3],[518,7,518,8],[518,12,518,13],[515,2,515,3],[515,7,515,8],[515,12,515,13],[516,2,516,3],[516,7,516,8],[516,12,516,13],[521,2,521,3],[521,7,521,8],[521,12,521,13],[522,2,522,3],[522,7,522,8],[522,12,522,13],[519,2,519,3],[519,7,519,8],[519,12,519,13],[520,2,520,3],[520,7,520,8],[520,12,520,13],[523,2,523,6],[523,7,523,8],[523,12,523,13],[524,2,525,3],[524,4,524,6],[524,7,524,8],[524,12,524,13],[525,7,525,8],[525,12,525,13],[528,2,528,3],[528,7,528,8],[528,12,528,13],[529,2,529,4],[529,7,529,8],[529,12,529,13],[526,2,526,3],[526,7,526,8],[526,12,526,13],[527,2,527,3],[527,7,527,8],[527,12,527,13],[533,2,533,3],[533,7,533,8],[533,12,533,13],[534,2,534,3],[534,7,534,8],[534,12,534,13],[530,2,531,3],[530,7,530,8],[530,12,530,13],[531,7,531,8],[531,12,531,13],[532,2,532,3],[532,7,532,8],[532,12,532,13],[537,2,537,3],[537,7,537,8],[537,12,537,13],[538,2,538,3],[538,7,538,8],[538,12,538,13],[535,2,535,3],[535,7,535,8],[535,12,535,13],[536,2,536,3],[536,7,536,8],[536,12,536,13],[541,2,541,3],[541,7,541,8],[541,12,541,13],[542,2,542,3],[542,7,542,8],[542,12,542,13],[539,2,539,3],[539,7,539,8],[539,12,539,13],[540,2,540,3],[540,7,540,8],[540,12,540,13],[545,2,545,3],[545,7,545,8],[545,12,545,13],[546,2,546,3],[546,7,546,8],[546,12,546,13],[543,2,543,3],[543,7,543,8],[543,12,543,13],[544,2,544,3],[544,7,544,8],[544,12,544,13],[549,2,549,3],[549,7,549,8],[549,12,549,13],[550,2,550,3],[550,7,550,8],[550,12,550,13],[547,2,547,3],[547,7,547,8],[547,12,547,13],[548,2,548,3],[548,7,548,8],[548,12,548,13],[553,2,553,3],[553,7,553,8],[553,12,553,13],[554,2,554,3],[554,7,554,8],[554,12,554,13],[551,2,551,3],[551,7,551,8],[551,12,551,13],[552,2,552,3],[552,7,552,8],[552,12,552,13],[557,2,557,3],[557,7,557,8],[557,12,557,13],[558,2,558,3],[558,7,558,8],[558,12,558,13],[555,2,555,3],[555,7,555,8],[555,12,555,13],[556,2,556,3],[556,7,556,8],[556,12,556,13],[561,2,561,3],[561,7,561,8],[561,12,561,13],[562,2,562,3],[562,7,562,8],[562,12,562,13],[559,2,559,3],[559,7,559,8],[559,12,559,13],[560,2,560,3],[560,7,560,8],[560,12,560,13],[565,2,565,3],[565,7,565,8],[565,12,565,13],[566,2,566,3],[566,7,566,8],[566,12,566,13],[563,2,563,3],[563,7,563,8],[563,12,563,13],[564,2,564,3],[564,7,564,8],[564,12,564,13],[569,2,569,3],[569,7,569,8],[569,12,569,13],[570,2,570,3],[570,7,570,8],[570,12,570,13],[567,2,567,3],[567,7,567,8],[567,12,567,13],[568,2,568,3],[568,7,568,8],[568,12,568,13],[573,2,573,3],[573,7,573,8],[573,12,573,13],[574,2,574,3],[574,7,574,8],[574,12,574,13],[571,2,571,3],[571,7,571,8],[571,12,571,13],[572,2,572,3],[572,7,572,8],[572,12,572,13],[577,2,577,3],[577,7,577,8],[577,12,577,13],[578,2,578,3],[578,7,578,8],[578,12,578,13],[575,2,575,3],[575,7,575,8],[575,12,575,13],[576,2,576,3],[576,7,576,8],[576,12,576,13],[581,2,581,3],[581,7,581,8],[581,12,581,13],[582,2,582,3],[582,7,582,8],[582,12,582,13],[579,2,579,3],[579,7,579,8],[579,12,579,13],[580,2,580,3],[580,7,580,8],[580,12,580,13],[585,2,585,3],[585,7,585,8],[585,12,585,13],[586,2,586,3],[586,7,586,8],[586,12,586,13],[583,2,583,3],[583,7,583,8],[583,12,583,13],[584,2,584,3],[584,7,584,8],[584,12,584,13],[589,2,589,3],[589,7,589,8],[589,12,589,13],[590,2,590,3],[590,7,590,8],[590,12,590,13],[587,2,587,3],[587,7,587,8],[587,12,587,13],[588,2,588,3],[588,7,588,8],[588,12,588,13],[593,2,593,3],[593,7,593,8],[593,12,593,13],[594,2,594,3],[594,7,594,8],[594,12,594,13],[591,2,591,4],[591,7,591,8],[591,12,591,13],[592,2,592,3],[592,7,592,8],[592,12,592,13],[597,2,597,3],[597,7,597,8],[597,12,597,13],[598,2,598,3],[598,7,598,8],[598,12,598,13],[595,2,595,3],[595,7,595,8],[595,12,595,13],[596,2,596,3],[596,7,596,8],[596,12,596,13],[601,2,601,3],[601,7,601,8],[601,12,601,13],[602,2,602,3],[602,7,602,8],[602,12,602,13],[599,2,599,3],[599,7,599,8],[599,12,599,13],[600,2,600,3],[600,7,600,8],[600,12,600,13],[605,2,605,3],[605,7,605,8],[605,12,605,13],[606,2,606,3],[606,7,606,8],[606,12,606,13],[603,2,603,3],[603,7,603,8],[603,12,603,13],[604,2,604,3],[604,7,604,8],[604,12,604,13],[609,2,609,3],[609,7,609,8],[609,12,609,13],[610,2,610,3],[610,7,610,8],[610,12,610,13],[607,2,607,3],[607,7,607,8],[607,12,607,13],[608,2,608,3],[608,7,608,8],[608,12,608,13],[613,2,613,3],[613,7,613,8],[613,12,613,13],[614,2,614,3],[614,7,614,8],[614,12,614,13],[611,2,611,3],[611,7,611,8],[611,12,611,13],[612,2,612,3],[612,7,612,8],[612,12,612,13],[617,2,617,3],[617,7,617,8],[617,12,617,13],[618,2,618,3],[618,7,618,8],[618,12,618,13],[615,2,615,3],[615,7,615,8],[615,12,615,13],[616,2,616,3],[616,7,616,8],[616,12,616,13],[621,2,621,3],[621,7,621,8],[621,12,621,13],[622,2,622,3],[622,7,622,8],[622,12,622,13],[619,2,619,3],[619,7,619,8],[619,12,619,13],[620,2,620,3],[620,7,620,8],[620,12,620,13],[625,2,625,3],[625,7,625,8],[625,12,625,13],[626,2,626,3],[626,7,626,8],[626,12,626,13],[623,2,623,3],[623,7,623,8],[623,12,623,13],[624,2,624,3],[624,7,624,8],[624,12,624,13],[629,2,629,3],[629,7,629,8],[629,12,629,13],[630,2,630,3],[630,7,630,8],[630,12,630,13],[627,2,627,3],[627,7,627,8],[627,12,627,13],[628,2,628,3],[628,7,628,8],[628,12,628,13],[633,2,633,3],[633,7,633,8],[633,12,633,13],[634,2,634,3],[634,7,634,8],[634,12,634,13],[631,2,631,3],[631,7,631,8],[631,12,631,13],[632,2,632,3],[632,7,632,8],[632,12,632,13],[637,2,637,3],[637,7,637,8],[637,12,637,13],[638,2,638,3],[638,7,638,8],[638,12,638,13],[635,2,635,3],[635,7,635,8],[635,12,635,13],[636,2,636,3],[636,7,636,8],[636,12,636,13],[641,2,641,3],[641,7,641,8],[641,12,641,13],[642,2,642,3],[642,7,642,8],[642,12,642,13],[639,2,639,3],[639,7,639,8],[639,12,639,13],[640,2,640,3],[640,7,640,8],[640,12,640,13],[645,2,645,3],[645,7,645,8],[645,12,645,13],[646,2,646,3],[646,7,646,8],[646,12,646,13],[643,2,643,3],[643,7,643,8],[643,12,643,13],[644,2,644,3],[644,7,644,8],[644,12,644,13],[649,2,649,3],[649,7,649,8],[649,12,649,13],[650,2,650,3],[650,7,650,8],[650,12,650,13],[647,2,647,3],[647,7,647,8],[647,12,647,13],[648,2,648,3],[648,7,648,8],[648,12,648,13],[653,2,653,3],[653,7,653,8],[653,12,653,13],[654,2,654,3],[654,7,654,8],[654,12,654,13],[651,2,651,3],[651,7,651,8],[651,12,651,13],[652,2,652,3],[652,7,652,8],[652,12,652,13],[657,2,657,3],[657,7,657,8],[657,12,657,13],[658,2,658,3],[658,7,658,8],[658,12,658,13],[655,2,655,3],[655,7,655,8],[655,12,655,13],[656,2,656,3],[656,7,656,8],[656,12,656,13],[661,2,661,3],[661,7,661,8],[661,12,661,13],[662,2,662,3],[662,7,662,8],[662,12,662,13],[659,2,659,3],[659,7,659,8],[659,12,659,13],[660,2,660,3],[660,7,660,8],[660,12,660,13],[665,2,665,3],[665,7,665,8],[665,12,665,13],[666,2,666,3],[666,7,666,8],[666,12,666,13],[663,2,663,3],[663,7,663,8],[663,12,663,13],[664,2,664,3],[664,7,664,8],[664,12,664,13],[669,2,669,3],[669,7,669,8],[669,12,669,13],[670,2,670,3],[670,7,670,8],[670,12,670,13],[667,2,667,3],[667,7,667,8],[667,12,667,13],[668,2,668,3],[668,7,668,8],[668,12,668,13],[673,2,673,3],[673,7,673,8],[673,12,673,13],[674,2,674,3],[674,7,674,8],[674,12,674,13],[671,2,671,3],[671,7,671,8],[671,12,671,13],[672,2,672,3],[672,7,672,8],[672,12,672,13],[677,2,677,3],[677,7,677,8],[677,12,677,13],[678,2,678,3],[678,7,678,8],[678,12,678,13],[675,2,675,3],[675,7,675,8],[675,12,675,13],[676,2,676,3],[676,7,676,8],[676,12,676,13],[681,2,681,3],[681,7,681,8],[681,12,681,13],[682,2,682,3],[682,7,682,8],[682,12,682,13],[679,2,679,3],[679,7,679,8],[679,12,679,13],[680,2,680,3],[680,7,680,8],[680,12,680,13],[685,2,685,3],[685,7,685,8],[685,12,685,13],[686,2,686,3],[686,7,686,8],[686,12,686,13],[683,2,683,3],[683,7,683,8],[683,12,683,13],[684,2,684,3],[684,7,684,8],[684,12,684,13],[687,2,687,3],[687,7,687,8],[687,12,687,13],[688,2,688,3],[688,7,688,8],[688,12,688,13],[693,2,693,3],[693,7,693,8],[693,12,693,13],[694,2,694,3],[694,7,694,8],[694,12,694,13],[691,2,691,3],[691,7,691,8],[691,12,691,13],[692,2,692,3],[692,7,692,8],[692,12,692,13],[697,2,697,3],[697,7,697,8],[697,12,697,13],[698,2,698,3],[698,7,698,8],[698,12,698,13],[695,2,695,3],[695,7,695,8],[695,12,695,13],[696,2,696,3],[696,7,696,8],[696,12,696,13],[689,2,689,3]],"merged_total":1005,"flags":["merged_cut"]}
[]
[{"$f":"A1026","v":"Trinidad and Tobago"}]
[{"$f":"A1034","v":"2006"}]
["Use of drinking water sources"]
[" by wealth quintile and sub-national region"]
["Notes:"]
["WHO/UNICEF JMP customised wealth index excludes water,"]
[" sanitation and hygiene assets."]
["Survey used for analysis:",{"$f":"A1025","v":"MICS06"}]
[{"$f":"B1028","v":""}]
[{"$f":"B1027","v":""}]
[]
[]
["Use of drinking water sources",null,"NATIONAL wealth index quintile",null,null,null,null,null,null,null,null,null,null,null,null,null,null,"SUB-REGIONS:",null,null,null,null,null,null,null,null,null,null,null,null,null,null,null,null,null,null,null,null,null,null,null,null,null,null,null,null,null,null,null,null,null,null,"Raw numbers of respondents:","Use of drinking water sources","NATIONAL wealth index quintile",null,null,null,null,"URBAN wealth index quintile",null,null,null,null,"RURAL wealth index quintile",null,null,null,null,"SUB-REGIONS:"]
["Weighted percentage (used in graphs)",null,"Poorest","Poor","Middle","Rich","Richest",null,null,null,null,null,null,null,null,null,null,"Arima","Chaguanas","Couva/Tabaquite/Talparo","Diego Martin","Mayaro/Rio Claro","Penal/Debe","Point Fortin","Port of Spain","Princes Town","San Fernando","San Juan/Laventille","Sangre Grande","Siparia","Tobago","Tunapuna/Piarco",null,null,null,null,null,null,null,null,null,null,null,null,null,null,null,null,null,null,null,null,"Water data, raw numbers (weighted)",null,"Poorest","Poor","Middle","Rich","Richest","Poorest","Poor","Middle","Rich","Richest","Poorest","Poor","Middle","Rich","Richest","Arima","Chaguanas","Couva/Tabaquite/Talparo","Diego Martin","Mayaro/Rio Claro","Penal/Debe","Point Fortin","Port of Spain","Princes Town","San Fernando","San Juan/Laventille","Sangre Grande","Siparia","Tobago","Tunapuna/Piarco"]
["Water","Improved",95.243002704153099,97.920444968028292,98.38359588617611,99.080293380524438,99.80303017971751,"N/A","N/A","N/A","N/A","N/A","N/A","N/A","N/A","N/A","N/A",99.805825242718456,99.718309859154928,98.351226993864998,98.047138047138048,100,99.693016116653865,100,99.188311688311671,98.930862437633664,100,95.311130587204289,93.956043956043956,99.144568006843471,98.828696925329453,98.717527129233801,null,null,null,null,null,null,null,null,null,null,null,null,null,null,null,null,null,null,null,null,"Water","Improved","N/A","N/A","N/A","N/A","N/A","N/A","N/A","N/A","N/A","N/A","N/A","N/A","N/A","N/A","N/A","N/A","N/A","N/A","N/A","N/A","N/A","N/A","N/A","N/A","N/A","N/A","N/A","N/A","N/A","N/A"]
[null,"Not Improved",4.7569972958469524,2.079555031971708,1.616404113823855,0.91970661947559562,0.19696982028248453,"N/A","N/A","N/A","N/A","N/A","N/A","N/A","N/A","N/A","N/A",0.19417475728155312,0.28169014084507121,1.6487730061349755,1.9528619528619517,0,0.3069838833461227,0,0.81168831168831113,1.0691375623663602,0,4.6888694127958015,6.0439560439560367,0.85543199315654261,1.1713030746705742,1.2824728707661925,null,null,null,null,null,null,null,null,null,null,null,null,null,null,null,null,null,null,null,null,null,"Not Improved","N/A","N/A","N/A","N/A","N/A","N/A","N/A","N/A","N/A","N/A","N/A","N/A","N/A","N/A","N/A","N/A","N/A","N/A","N/A","N/A","N/A","N/A","N/A","N/A","N/A","N/A","N/A","N/A","N/A","N/A"]
["Water ladder","Basic",93.906186087379524,97.311383235091057,98.075502830556445,98.917970593457227,99.80303017971751,"N/A","N/A","N/A","N/A","N/A","N/A","N/A","N/A","N/A","N/A",99.805825242718456,99.718309859154928,98.044478527607325,97.239057239057232,100,98.618572524942408,97.652582159624401,99.188311688311671,98.146828225231644,100,94.741454864154335,93.956043956043956,97.775876817793034,98.682284040995626,98.717527129233801,null,null,null,null,null,null,null,null,null,null,null,null,null,null,null,null,null,null,null,null,"Water ladder","Basic","N/A","N/A","N/A","N/A","N/A","N/A","N/A","N/A","N/A","N/A","N/A","N/A","N/A","N/A","N/A","N/A","N/A","N/A","N/A","N/A","N/A","N/A","N/A","N/A","N/A","N/A","N/A","N/A","N/A","N/A"]
[null,"Limited",1.3368166167736273,0.60906173293723809,0.30809305561967992,0.16232278706723585,0,"N/A","N/A","N/A","N/A","N/A","N/A","N/A","N/A","N/A","N/A",0,0,0.30674846625766983,0.80808080808080751,0,1.0744435917114292,2.3474178403755857,0,0.78403421240199733,0,0.56967572304995717,0,1.3686911890504683,0.14641288433382177,0,null,null,null,null,null,null,null,null,null,null,null,null,null,null,null,null,null,null,null,null,null,"Limited","N/A","N/A","N/A","N/A","N/A","N/A","N/A","N/A","N/A","N/A","N/A","N/A","N/A","N/A","N/A","N/A","N/A","N/A","N/A","N/A","N/A","N/A","N/A","N/A","N/A","N/A","N/A","N/A","N/A","N/A"]
[null,"Unimproved",4.2592285633222078,2.079555031971708,1.616404113823855,0.91970661947559562,0.19696982028248453,"N/A","N/A","N/A","N/A","N/A","N/A","N/A","N/A","N/A","N/A",0.19417475728155312,0.28169014084507121,1.6487730061349755,1.9528619528619517,0,0.3069838833461227,0,0.81168831168831113,1.0691375623663602,0,4.6888694127958015,5.1648351648351598,0.85543199315654261,0.29282576866764354,1.2824728707661925,null,null,null,null,null,null,null,null,null,null,null,null,null,null,null,null,null,null,null,null,null,"Unimproved","N/A","N/A","N/A","N/A","N/A","N/A","N/A","N/A","N/A","N/A","N/A","N/A","N/A","N/A","N/A","N/A","N/A","N/A","N/A","N/A","N/A","N/A","N/A","N/A","N/A","N/A","N/A","N/A","N/A","N/A"]
[null,"Surface water",0.49776873252474513,0,0,0,0,"N/A","N/A","N/A","N/A","N/A","N/A","N/A","N/A","N/A","N/A",0,0,0,0,0,0,0,0,0,0,0,0.87912087912087811,0,0.8784773060029305,0,null,null,null,null,null,null,null,null,null,null,null,null,null,null,null,null,null,null,null,null,null,"Surface water","N/A","N/A","N/A","N/A","N/A","N/A","N/A","N/A","N/A","N/A","N/A","N/A","N/A","N/A","N/A","N/A","N/A","N/A","N/A","N/A","N/A","N/A","N/A","N/A","N/A","N/A","N/A","N/A","N/A","N/A"]
["Improved water point at more than 30 minutes","Yes",1.4035851231256227,0.62199649229137088,0.31315490437666554,0.16382953817448281,0,"N/A","N/A","N/A","N/A","N/A","N/A","N/A","N/A","N/A","N/A",0,0,0.31189083820662883,0.82417582417582369,0,1.0777521170130813,2.3474178403755857,0,0.79250720461095259,0,0.59770114942528796,0,1.3805004314063822,0.1481481481481485,0,null,null,null,null,null,null,null,null,null,null,null,null,null,null,null,null,null,null,null,null,"Improved water point at more than 30 minutes","Yes","N/A","N/A","N/A","N/A","N/A","N/A","N/A","N/A","N/A","N/A","N/A","N/A","N/A","N/A","N/A","N/A","N/A","N/A","N/A","N/A","N/A","N/A","N/A","N/A","N/A","N/A","N/A","N/A","N/A","N/A"]
[null,"No",98.596414876874434,99.378003507708641,99.68684509562334,99.836170461825532,100,"N/A","N/A","N/A","N/A","N/A","N/A","N/A","N/A","N/A","N/A",100,100,99.688109161793363,99.175824175824175,100,98.922247882986895,97.652582159624401,100,99.20749279538903,100,99.402298850574695,100,98.619499568593653,99.851851851851848,100,null,null,null,null,null,null,null,null,null,null,null,null,null,null,null,null,null,null,null,null,null,"No","N/A","N/A","N/A","N/A","N/A","N/A","N/A","N/A","N/A","N/A","N/A","N/A","N/A","N/A","N/A","N/A","N/A","N/A","N/A","N/A","N/A","N/A","N/A","N/A","N/A","N/A","N/A","N/A","N/A","N/A"]
["Manually calculated ratios","Improved wells"]
[null,"Improved springs"]
[null,"Other"]
[null,null,"NATIONAL wealth index quintile",null,null,null,null,null,null,null,null,null,null,null,null,null,null,"SUB-REGIONS:",null,null,null,null,null,null,null,null,null,null,null,null,null,null,null,null,null,null,null,null,null,null,null,null,null,null,null,null,null,null,null,null,null,null,"Raw numbers of respondents:","Use of drinking water sources","NATIONAL wealth index quintile",null,null,null,null,"URBAN wealth index quintile",null,null,null,null,"RURAL wealth index quintile",null,null,null,null,"SUB-REGIONS:"]
["Percentage based on weighted population",null,"Poorest","Poor","Middle","Rich","Richest",null,null,null,null,null,null,null,null,null,null,"Arima","Chaguanas","Couva/Tabaquite/Talparo","Diego Martin","Mayaro/Rio Claro","Penal/Debe","Point Fortin","Port of Spain","Princes Town","San Fernando","San Juan/Laventille","Sangre Grande","Siparia","Tobago","Tunapuna/Piarco",null,null,null,null,null,null,null,null,null,null,null,null,null,null,null,null,null,null,null,null,"Water data, raw numbers (weighted)",null,"Poorest","Poor","Middle","Rich","Richest","Poorest","Poor","Middle","Rich","Richest","Poorest","Poor","Middle","Rich","Richest","Arima","Chaguanas","Couva/Tabaquite/Talparo","Diego Martin","Mayaro/Rio Claro","Penal/Debe","Point Fortin","Port of Spain","Princes Town","San Fernando","San Juan/Laventille","Sangre Grande","Siparia","Tobago","Tunapuna/Piarco"]
["Piped water","Yes",79.093945235977728,86.208500918302406,93.758123184337222,94.080184708880211,97.435388942564344,"N/A","N/A","N/A","N/A","N/A","N/A","N/A","N/A","N/A","N/A",99.805825242718456,95.680751173708899,88.803680981594937,88.956228956228955,68.876611418047958,86.492709132770344,84.037558685445987,99.025974025974023,83.606557377049199,100,91.542506573181598,81.318681318681328,89.307100085543297,92.240117130307496,98.487339690891133,null,null,null,null,null,null,null,null,null,null,null,null,null,null,null,null,null,null,null,null,"Piped water","Yes","N/A","N/A","N/A","N/A","N/A","N/A","N/A","N/A","N/A","N/A","N/A","N/A","N/A","N/A","N/A","N/A","N/A","N/A","N/A","N/A","N/A","N/A","N/A","N/A","N/A","N/A","N/A","N/A","N/A","N/A"]
[null,"No",20.906054764022528,13.791499081697561,6.2418768156627626,5.9198152911198338,2.5646110574356125,"N/A","N/A","N/A","N/A","N/A","N/A","N/A","N/A","N/A","N/A",0.19417475728155312,4.3192488262910915,11.196319018404944,11.04377104377104,31.123388581952167,13.50729086722939,15.962441314553985,0.97402597402597335,16.393442622950872,0,8.4574934268185995,18.681318681318661,10.692899914456783,7.759882869692551,1.512660309108842,null,null,null,null,null,null,null,null,null,null,null,null,null,null,null,null,null,null,null,null,null,"No","N/A","N/A","N/A","N/A","N/A","N/A","N/A","N/A","N/A","N/A","N/A","N/A","N/A","N/A","N/A","N/A","N/A","N/A","N/A","N/A","N/A","N/A","N/A","N/A","N/A","N/A","N/A","N/A","N/A","N/A"]
["Piped water on premises","Yes",68.084178576015688,80.393722351175583,91.623632326149902,93.550684596729639,97.386543704840761,"N/A","N/A","N/A","N/A","N/A","N/A","N/A","N/A","N/A","N/A",99.805825242718456,95.680751173708899,85.85122699386487,84.713804713804706,68.876611418047958,84.267075978510931,72.300469483568079,93.668831168831119,80.185317177476861,98.815165876777257,81.551270815074716,79.230769230769241,85.201026518391885,89.311859443631079,97.533706017757353,null,null,null,null,null,null,null,null,null,null,null,null,null,null,null,null,null,null,null,null,"Piped water on premises","Yes","N/A","N/A","N/A","N/A","N/A","N/A","N/A","N/A","N/A","N/A","N/A","N/A","N/A","N/A","N/A","N/A","N/A","N/A","N/A","N/A","N/A","N/A","N/A","N/A","N/A","N/A","N/A","N/A","N/A","N/A"]
[null,"No",31.915821423984781,19.606277648824395,8.3763676738500656,6.4493154032703934,2.6134562951592089,"N/A","N/A","N/A","N/A","N/A","N/A","N/A","N/A","N/A","N/A",0.19417475728155312,4.3192488262910915,14.148773006135004,15.286195286195284,31.123388581952167,15.732924021488778,27.699530516431896,6.3311688311688279,19.814682822523224,1.1848341232227522,18.448729184925579,20.769230769230745,14.798973481608185,10.688140556368989,2.4662939822426773,null,null,null,null,null,null,null,null,null,null,null,null,null,null,null,null,null,null,null,null,null,"No","N/A","N/A","N/A","N/A","N/A","N/A","N/A","N/A","N/A","N/A","N/A","N/A","N/A","N/A","N/A","N/A","N/A","N/A","N/A","N/A","N/A","N/A","N/A","N/A","N/A","N/A","N/A","N/A","N/A","N/A"]
["Piped water into dwelling","Yes","N/A","N/A","N/A","N/A","N/A","N/A","N/A","N/A","N/A","N/A","N/A","N/A","N/A","N/A","N/A","N/A","N/A","N/A","N/A","N/A","N/A","N/A","N/A","N/A","N/A","N/A","N/A","N/A","N/A","N/A",null,null,null,null,null,null,null,null,null,null,null,null,null,null,null,null,null,null,null,null,"Piped water into dwelling","Yes","N/A","N/A","N/A","N/A","N/A","N/A","N/A","N/A","N/A","N/A","N/A","N/A","N/A","N/A","N/A","N/A","N/A","N/A","N/A","N/A","N/A","N/A","N/A","N/A","N/A","N/A","N/A","N/A","N/A","N/A"]
[null,"No","N/A","N/A","N/A","N/A","N/A","N/A","N/A","N/A","N/A","N/A","N/A","N/A","N/A","N/A","N/A","N/A","N/A","N/A","N/A","N/A","N/A","N/A","N/A","N/A","N/A","N/A","N/A","N/A","N/A","N/A",null,null,null,null,null,null,null,null,null,null,null,null,null,null,null,null,null,null,null,null,null,"No","N/A","N/A","N/A","N/A","N/A","N/A","N/A","N/A","N/A","N/A","N/A","N/A","N/A","N/A","N/A","N/A","N/A","N/A","N/A","N/A","N/A","N/A","N/A","N/A","N/A","N/A","N/A","N/A","N/A","N/A"]
["Water source on premises","Yes",79.921469718331295,90.225674211528698,95.820207326423073,97.712554689340351,99.130485323429369,"N/A","N/A","N/A","N/A","N/A","N/A","N/A","N/A","N/A","N/A",99.805825242718456,95.680751173708899,95.092024539877229,91.717171717171723,97.421731123388597,85.64850345356848,77.464788732394382,95.454545454545425,94.583036350677091,98.815165876777257,85.889570552147475,91.538461538461533,94.268605645851238,93.411420204978072,98.355804011838245,null,null,null,null,null,null,null,null,null,null,null,null,null,null,null,null,null,null,null,null,"Water source on premises","Yes","N/A","N/A","N/A","N/A","N/A","N/A","N/A","N/A","N/A","N/A","N/A","N/A","N/A","N/A","N/A","N/A","N/A","N/A","N/A","N/A","N/A","N/A","N/A","N/A","N/A","N/A","N/A","N/A","N/A","N/A"]
[null,"No",20.078530281668929,9.7743257884712609,4.1797926735769169,2.2874453106596961,0.86951467657062143,"N/A","N/A","N/A","N/A","N/A","N/A","N/A","N/A","N/A","N/A",0.19417475728155312,4.3192488262910915,4.9079754601227172,8.2828282828282802,2.578268876611423,14.351496546431228,22.535211267605611,4.5454545454545432,5.4169636493228932,1.1848341232227522,14.110429447852807,8.461538461538451,5.7313943541488337,6.5885797950219791,1.6441959881617851,null,null,null,null,null,null,null,null,null,null,null,null,null,null,null,null,null,null,null,null,null,"No","N/A","N/A","N/A","N/A","N/A","N/A","N/A","N/A","N/A","N/A","N/A","N/A","N/A","N/A","N/A","N/A","N/A","N/A","N/A","N/A","N/A","N/A","N/A","N/A","N/A","N/A","N/A","N/A","N/A","N/A"]
["Improved Water source on premises","Yes",83.424608835466614,91.274393414486937,96.491343605440932,97.835388794360838,99.255976963841249,"N/A","N/A","N/A","N/A","N/A","N/A","N/A","N/A","N/A","N/A",100,95.951035781544235,96.647173489278686,91.552197802197796,97.421731123388597,85.681293302540212,77.464788732394382,96.235679214402609,95.605187319884678,98.815165876777257,87.21839080459786,97.42690058479532,94.909404659189008,94.518518518518533,99.20053297801465,null,null,null,null,null,null,null,null,null,null,null,null,null,null,null,null,null,null,null,null,"Improved water source on premises","Yes","N/A","N/A","N/A","N/A","N/A","N/A","N/A","N/A","N/A","N/A","N/A","N/A","N/A","N/A","N/A","N/A","N/A","N/A","N/A","N/A","N/A","N/A","N/A","N/A","N/A","N/A","N/A","N/A","N/A","N/A"]
[null,"No",16.575391164533563,8.7256065855129918,3.5086563945590696,2.1646112056391771,0.74402303615873333,"N/A","N/A","N/A","N/A","N/A","N/A","N/A","N/A","N/A","N/A",0,4.0489642184557546,3.3528265107212607,8.4478021978021953,2.578268876611423,14.318706697459499,22.535211267605611,3.7643207855973806,4.3948126801152831,1.1848341232227522,12.781609195402325,2.5730994152046751,5.090595340811034,5.4814814814814952,0.79946702198534125,null,null,null,null,null,null,null,null,null,null,null,null,null,null,null,null,null,null,null,null,null,"No","N/A","N/A","N/A","N/A","N/A","N/A","N/A","N/A","N/A","N/A","N/A","N/A","N/A","N/A","N/A","N/A","N/A","N/A","N/A","N/A","N/A","N/A","N/A","N/A","N/A","N/A","N/A","N/A","N/A","N/A"]
["Piped water on premises available when needed","Yes","N/A","N/A","N/A","N/A","N/A","N/A","N/A","N/A","N/A","N/A","N/A","N/A","N/A","N/A","N/A","N/A","N/A","N/A","N/A","N/A","N/A","N/A","N/A","N/A","N/A","N/A","N/A","N/A","N/A","N/A",null,null,null,null,null,null,null,null,null,null,null,null,null,null,null,null,null,null,null,null,"Piped water on premises available when needed","Yes","N/A","N/A","N/A","N/A","N/A","N/A","N/A","N/A","N/A","N/A","N/A","N/A","N/A","N/A","N/A","N/A","N/A","N/A","N/A","N/A","N/A","N/A","N/A","N/A","N/A","N/A","N/A","N/A","N/A","N/A"]
[null,"No","N/A","N/A","N/A","N/A","N/A","N/A","N/A","N/A","N/A","N/A","N/A","N/A","N/A","N/A","N/A","N/A","N/A","N/A","N/A","N/A","N/A","N/A","N/A","N/A","N/A","N/A","N/A","N/A","N/A","N/A",null,null,null,null,null,null,null,null,null,null,null,null,null,null,null,null,null,null,null,null,null,"No","N/A","N/A","N/A","N/A","N/A","N/A","N/A","N/A","N/A","N/A","N/A","N/A","N/A","N/A","N/A","N/A","N/A","N/A","N/A","N/A","N/A","N/A","N/A","N/A","N/A","N/A","N/A","N/A","N/A","N/A"]
["Water point at more than 30 minutes","Yes",1.5013268866411673,0.79803718811154067,0.30809305561967992,0.16232278706723585,0.1269571412490702,"N/A","N/A","N/A","N/A","N/A","N/A","N/A","N/A","N/A","N/A",0,0,0.57515337423313084,0.80808080808080751,0,1.0744435917114292,2.3474178403755857,0.81168831168831113,0.78403421240199733,0,0.56967572304995717,0,1.7964071856287394,0.14641288433382177,0,null,null,null,null,null,null,null,null,null,null,null,null,null,null,null,null,null,null,null,null,"Water point at more than 30 minutes","Yes","N/A","N/A","N/A","N/A","N/A","N/A","N/A","N/A","N/A","N/A","N/A","N/A","N/A","N/A","N/A","N/A","N/A","N/A","N/A","N/A","N/A","N/A","N/A","N/A","N/A","N/A","N/A","N/A","N/A","N/A"]
[null,"No",98.498673113358848,99.201962811888464,99.691906944380307,99.837677212932789,99.873042858750921,"N/A","N/A","N/A","N/A","N/A","N/A","N/A","N/A","N/A","N/A",100,100,99.424846625766861,99.191919191919183,100,98.925556408288543,97.652582159624401,99.188311688311671,99.215965787598009,100,99.430324276950032,100,98.203592814371305,99.853587115666173,100,null,null,null,null,null,null,null,null,null,null,null,null,null,null,null,null,null,null,null,null,null,"No","N/A","N/A","N/A","N/A","N/A","N/A","N/A","N/A","N/A","N/A","N/A","N/A","N/A","N/A","N/A","N/A","N/A","N/A","N/A","N/A","N/A","N/A","N/A","N/A","N/A","N/A","N/A","N/A","N/A","N/A"]
["Water source available when needed","Yes","N/A","N/A","N/A","N/A","N/A","N/A","N/A","N/A","N/A","N/A","N/A","N/A","N/A","N/A","N/A",0,0,0,0,0,0,0,0,0,0,0,0,0,0,0,null,null,null,null,null,null,null,null,null,null,null,null,null,null,null,null,null,null,null,null,"Water source available when needed","Yes","N/A","N/A","N/A","N/A","N/A","N/A","N/A","N/A","N/A","N/A","N/A","N/A","N/A","N/A","N/A","N/A","N/A","N/A","N/A","N/A","N/A","N/A","N/A","N/A","N/A","N/A","N/A","N/A","N/A","N/A"]
[null,"No","N/A","N/A","N/A","N/A","N/A","N/A","N/A","N/A","N/A","N/A","N/A","N/A","N/A","N/A","N/A",0,0,0,0,0,0,0,0,0,0,0,0,0,0,0,null,null,null,null,null,null,null,null,null,null,null,null,null,null,null,null,null,null,null,null,null,"No","N/A","N/A","N/A","N/A","N/A","N/A","N/A","N/A","N/A","N/A","N/A","N/A","N/A","N/A","N/A","N/A","N/A","N/A","N/A","N/A","N/A","N/A","N/A","N/A","N/A","N/A","N/A","N/A","N/A","N/A"]
["Improved water source available when needed","Yes","N/A","N/A","N/A","N/A","N/A","N/A","N/A","N/A","N/A","N/A","N/A","N/A","N/A","N/A","N/A",0,0,0,0,0,0,0,0,0,0,0,0,0,0,0,null,null,null,null,null,null,null,null,null,null,null,null,null,null,null,null,null,null,null,null,"Improved water source available when needed","Yes","N/A","N/A","N/A","N/A","N/A","N/A","N/A","N/A","N/A","N/A","N/A","N/A","N/A","N/A","N/A","N/A","N/A","N/A","N/A","N/A","N/A","N/A","N/A","N/A","N/A","N/A","N/A","N/A","N/A","N/A"]
[null,"No","N/A","N/A","N/A","N/A","N/A","N/A","N/A","N/A","N/A","N/A","N/A","N/A","N/A","N/A","N/A",0,0,0,0,0,0,0,0,0,0,0,0,0,0,0,null,null,null,null,null,null,null,null,null,null,null,null,null,null,null,null,null,null,null,null,null,"No","N/A","N/A","N/A","N/A","N/A","N/A","N/A","N/A","N/A","N/A","N/A","N/A","N/A","N/A","N/A","N/A","N/A","N/A","N/A","N/A","N/A","N/A","N/A","N/A","N/A","N/A","N/A","N/A","N/A","N/A"]
["Microbiological quality at point of collection","Not contaminated (No E. coli in 100 mL)","N/A","N/A","N/A","N/A","N/A","N/A","N/A","N/A","N/A","N/A","N/A","N/A","N/A","N/A","N/A","N/A","N/A","N/A","N/A","N/A","N/A","N/A","N/A","N/A","N/A","N/A","N/A","N/A","N/A","N/A",null,null,null,null,null,null,null,null,null,null,null,null,null,null,null,null,null,null,null,null,"Microbiological quality at point of collection","Not contaminated (No E. coli in 100 mL)","N/A","N/A","N/A","N/A","N/A","N/A","N/A","N/A","N/A","N/A","N/A","N/A","N/A","N/A","N/A","N/A","N/A","N/A","N/A","N/A","N/A","N/A","N/A","N/A","N/A","N/A","N/A","N/A","N/A","N/A"]
[null,"Contaminated (E. coli detected in 100 mL)","N/A","N/A","N/A","N/A","N/A","N/A","N/A","N/A","N/A","N/A","N/A","N/A","N/A","N/A","N/A","N/A","N/A","N/A","N/A","N/A","N/A","N/A","N/A","N/A","N/A","N/A","N/A","N/A","N/A","N/A",null,null,null,null,null,null,null,null,null,null,null,null,null,null,null,null,null,null,null,null,null,"Contaminated (E. coli detected in 100 mL)","N/A","N/A","N/A","N/A","N/A","N/A","N/A","N/A","N/A","N/A","N/A","N/A","N/A","N/A","N/A","N/A","N/A","N/A","N/A","N/A","N/A","N/A","N/A","N/A","N/A","N/A","N/A","N/A","N/A","N/A"]
[null,"Highly contaminated (>100 CFU/100 mL)","N/A","N/A","N/A","N/A","N/A","N/A","N/A","N/A","N/A","N/A","N/A","N/A","N/A","N/A","N/A","N/A","N/A","N/A","N/A","N/A","N/A","N/A","N/A","N/A","N/A","N/A","N/A","N/A","N/A","N/A",null,null,null,null,null,null,null,null,null,null,null,null,null,null,null,null,null,null,null,null,null,"Highly contaminated (>100 CFU/100 mL)","N/A","N/A","N/A","N/A","N/A","N/A","N/A","N/A","N/A","N/A","N/A","N/A","N/A","N/A","N/A","N/A","N/A","N/A","N/A","N/A","N/A","N/A","N/A","N/A","N/A","N/A","N/A","N/A","N/A","N/A"]
["Microbiological quality of improved water sources at point of collection","Not contaminated (No E. coli in 100 mL)","N/A","N/A","N/A","N/A","N/A","N/A","N/A","N/A","N/A","N/A","N/A","N/A","N/A","N/A","N/A","N/A","N/A","N/A","N/A","N/A","N/A","N/A","N/A","N/A","N/A","N/A","N/A","N/A","N/A","N/A",null,null,null,null,null,null,null,null,null,null,null,null,null,null,null,null,null,null,null,null,"Microbiological quality of improved water sources at point of collection","Not contaminated (No E. coli in 100 mL)","N/A","N/A","N/A","N/A","N/A","N/A","N/A","N/A","N/A","N/A","N/A","N/A","N/A","N/A","N/A","N/A","N/A","N/A","N/A","N/A","N/A","N/A","N/A","N/A","N/A","N/A","N/A","N/A","N/A","N/A"]
[null,"Contaminated (E. coli detected in 100 mL)","N/A","N/A","N/A","N/A","N/A","N/A","N/A","N/A","N/A","N/A","N/A","N/A","N/A","N/A","N/A","N/A","N/A","N/A","N/A","N/A","N/A","N/A","N/A","N/A","N/A","N/A","N/A","N/A","N/A","N/A",null,null,null,null,null,null,null,null,null,null,null,null,null,null,null,null,null,null,null,null,null,"Contaminated (E. coli detected in 100 mL)","N/A","N/A","N/A","N/A","N/A","N/A","N/A","N/A","N/A","N/A","N/A","N/A","N/A","N/A","N/A","N/A","N/A","N/A","N/A","N/A","N/A","N/A","N/A","N/A","N/A","N/A","N/A","N/A","N/A","N/A"]
[null,"Highly contaminated (>100 CFU/100 mL)","N/A","N/A","N/A","N/A","N/A","N/A","N/A","N/A","N/A","N/A","N/A","N/A","N/A","N/A","N/A","N/A","N/A","N/A","N/A","N/A","N/A","N/A","N/A","N/A","N/A","N/A","N/A","N/A","N/A","N/A",null,null,null,null,null,null,null,null,null,null,null,null,null,null,null,null,null,null,null,null,null,"Highly contaminated (>100 CFU/100 mL)","N/A","N/A","N/A","N/A","N/A","N/A","N/A","N/A","N/A","N/A","N/A","N/A","N/A","N/A","N/A","N/A","N/A","N/A","N/A","N/A","N/A","N/A","N/A","N/A","N/A","N/A","N/A","N/A","N/A","N/A"]
["Microbiological quality of piped on premises at point of collection","Not contaminated (No E. coli in 100 mL)","N/A","N/A","N/A","N/A","N/A","N/A","N/A","N/A","N/A","N/A","N/A","N/A","N/A","N/A","N/A","N/A","N/A","N/A","N/A","N/A","N/A","N/A","N/A","N/A","N/A","N/A","N/A","N/A","N/A","N/A",null,null,null,null,null,null,null,null,null,null,null,null,null,null,null,null,null,null,null,null,"Microbiological quality of piped on premises at point of collection","Not contaminated (No E. coli in 100 mL)","N/A","N/A","N/A","N/A","N/A","N/A","N/A","N/A","N/A","N/A","N/A","N/A","N/A","N/A","N/A","N/A","N/A","N/A","N/A","N/A","N/A","N/A","N/A","N/A","N/A","N/A","N/A","N/A","N/A","N/A"]
[null,"Contaminated (E. coli detected in 100 mL)","N/A","N/A","N/A","N/A","N/A","N/A","N/A","N/A","N/A","N/A","N/A","N/A","N/A","N/A","N/A","N/A","N/A","N/A","N/A","N/A","N/A","N/A","N/A","N/A","N/A","N/A","N/A","N/A","N/A","N/A",null,null,null,null,null,null,null,null,null,null,null,null,null,null,null,null,null,null,null,null,null,"Contaminated (E. coli detected in 100 mL)","N/A","N/A","N/A","N/A","N/A","N/A","N/A","N/A","N/A","N/A","N/A","N/A","N/A","N/A","N/A","N/A","N/A","N/A","N/A","N/A","N/A","N/A","N/A","N/A","N/A","N/A","N/A","N/A","N/A","N/A"]
[null,"Highly contaminated (>100 CFU/100 mL)","N/A","N/A","N/A","N/A","N/A","N/A","N/A","N/A","N/A","N/A","N/A","N/A","N/A","N/A","N/A","N/A","N/A","N/A","N/A","N/A","N/A","N/A","N/A","N/A","N/A","N/A","N/A","N/A","N/A","N/A",null,null,null,null,null,null,null,null,null,null,null,null,null,null,null,null,null,null,null,null,null,"Highly contaminated (>100 CFU/100 mL)","N/A","N/A","N/A","N/A","N/A","N/A","N/A","N/A","N/A","N/A","N/A","N/A","N/A","N/A","N/A","N/A","N/A","N/A","N/A","N/A","N/A","N/A","N/A","N/A","N/A","N/A","N/A","N/A","N/A","N/A"]
[null,null,"NATIONAL wealth index quintile",null,null,null,null,null,null,null,null,null,null,null,null,null,null,"SUB-REGIONS:",null,null,null,null,null,null,null,null,null,null,null,null,null,null,null,null,null,null,null,null,null,null,null,null,null,null,null,null,null,null,null,null,null,null,"Raw numbers of respondents:","Use of drinking water sources","NATIONAL wealth index quintile",null,null,null,null,"URBAN wealth index quintile",null,null,null,null,"RURAL wealth index quintile",null,null,null,null,"SUB-REGIONS:"]
["Percentage based on weighted population",null,"Poorest","Poor","Middle","Rich","Richest",null,null,null,null,null,null,null,null,null,null,"Arima","Chaguanas","Couva/Tabaquite/Talparo","Diego Martin","Mayaro/Rio Claro","Penal/Debe","Point Fortin","Port of Spain","Princes Town","San Fernando","San Juan/Laventille","Sangre Grande","Siparia","Tobago","Tunapuna/Piarco",null,null,null,null,null,null,null,null,null,null,null,null,null,null,null,null,null,null,null,null,"Water data, raw numbers (weighted)",null,"Poorest","Poor","Middle","Rich","Richest","Poorest","Poor","Middle","Rich","Richest","Poorest","Poor","Middle","Rich","Richest","Arima","Chaguanas","Couva/Tabaquite/Talparo","Diego Martin","Mayaro/Rio Claro","Penal/Debe","Point Fortin","Port of Spain","Princes Town","San Fernando","San Juan/Laventille","Sangre Grande","Siparia","Tobago","Tunapuna/Piarco"]
["Main source of drinking water","Piped into dwelling",45.636119272582697,65.63377800188438,76.362285186406822,82.067086634753224,81.997672413549466,"N/A","N/A","N/A","N/A","N/A","N/A","N/A","N/A","N/A","N/A",92.427184466019412,69.107981220657294,69.708588957055113,68.754208754208747,59.116022099447584,50.26861089792768,50.234741784037539,84.253246753246671,67.141838916607242,95.023696682464461,66.652059596845021,70.549450549450512,68.862275449101872,70.571010248901985,85.399539625123268]
[null,"Piped into yard or plot",17.727074193436874,10.38849007113954,9.0270633478152984,4.1393245737354745,1.8936202515999745,"N/A","N/A","N/A","N/A","N/A","N/A","N/A","N/A","N/A","N/A",4.2718446601941684,6.6666666666666847,8.3972392638037121,6.1279461279461254,6.0773480662983523,28.702993092862485,14.553990610328635,0.48701298701298673,6.628652886671432,0,5.4776511831726644,6.7032967032966937,10.350727117194163,10.834553440702809,5.9848733969088954]
[null,"Public tap/standpipe",11.009766659962256,5.570072902736241,2.1344908581873061,0.52950011215056059,0,"N/A","N/A","N/A","N/A","N/A","N/A","N/A","N/A","N/A","N/A",0,0,2.9524539877300722,4.2424242424242404,0,2.2256331542593899,9.8591549295774623,5.3571428571428532,3.4212401995723534,1.1848341232227522,9.9035933391761901,2.0879120879120849,3.6783575705731333,2.9282576866764352,0.95363367313383551]
[null,"Private piped into dwelling",1.7269496233459942,1.5361593375154483,1.3243991816594469,1.3774662869757581,1.173314001286752,"N/A","N/A","N/A","N/A","N/A","N/A","N/A","N/A","N/A","N/A",1.1650485436893188,8.7323943661972088,1.3803680981595139,1.7508417508417498,2.2099447513812196,0.84420567920183742,0,0,0.35637918745545338,0,1.7966695880806343,0,1.6253207869974311,0.58565153733528708,0.36172311739559265]
[null,"Private piped into yard",2.0224884175510112,1.2858691029416784,1.2022733319588819,0.77138669867431264,0.1601655080406312,"N/A","N/A","N/A","N/A","N/A","N/A","N/A","N/A","N/A","N/A",0,1.2206572769953086,3.1825153374233244,2.3569023569023555,0.7366482504604065,0.3069838833461227,0,0.81168831168831113,0.64148253741981609,0,0.56967572304995717,0,0.8554319931565425,0.29282576866764354,0.46037487668529981]
[null,"Protected spring",0.42160115181177282,0.77349065771243075,0.20549383563352708,0.79333355728983512,0.13728472117768392,"N/A","N/A","N/A","N/A","N/A","N/A","N/A","N/A","N/A","N/A",0,0.56338028169014243,1.0352760736196354,0.26936026936026913,0,0,0,0,0,0,2.1910604732690659,0,0,0,0]
[null,"Unprotected spring",1.0094891663902406,1.108911322109448,0.96667500602463352,0.7982069204051766,0,"N/A","N/A","N/A","N/A","N/A","N/A","N/A","N/A","N/A","N/A",0,0,0.19171779141104361,1.7508417508417498,0,0,0,0,0,0,3.7686240140227936,1.9780219780219754,0,0.29282576866764354,0]
[null,"Rainwater collection",11.044206464877067,8.3595533352884868,3.0911355286482798,3.0415660607644646,1.7114349412302203,"N/A","N/A","N/A","N/A","N/A","N/A","N/A","N/A","N/A","N/A",0,3.1924882629108065,6.5567484662576936,4.3097643097643079,31.123388581952167,5.9861857252493911,12.676056338028163,0.16233766233766225,8.6956521739130626,0,0.70113935144610118,12.307692307692289,9.2386655260906583,6.1493411420205124,9.8651759289707097E-2]
[null,"Tanker-truck",3.689088792449073,2.352946765825624,1.3288433375570985,1.0235718099492994,0.44170069033397807,"N/A","N/A","N/A","N/A","N/A","N/A","N/A","N/A","N/A","N/A",0,0,1.8021472392638103,4.1077441077441064,0,6.7536454336146967,2.8169014084507031,0,5.702066999287255,0,0.52585451358457591,0.32967032967032928,0.51325919589392555,0.43923865300146525,0]
[null,"Cart with small tank/drum",0.47500571289394428,0.22595329089931793,0,0.11620345103075339,0,"N/A","N/A","N/A","N/A","N/A","N/A","N/A","N/A","N/A","N/A",0,0,0.11503067484662617,0.13468013468013457,0,0.46047582501918399,0,0,0.85531004989308801,0,0,0,8.5543199315654267E-2,0,9.8651759289707097E-2]
[null,"Surface water",0.49776873252474513,0,0,0,0,"N/A","N/A","N/A","N/A","N/A","N/A","N/A","N/A","N/A","N/A",0,0,0,0,0,0,0,0,0,0,0,0.87912087912087811,0,0.8784773060029305,0]
[null,"Bottled water",1.4907024152426824,1.7941315020850859,3.7076112783093271,5.2208541952004879,12.287837652498622,"N/A","N/A","N/A","N/A","N/A","N/A","N/A","N/A","N/A","N/A",1.9417475728155311,10.234741784037586,3.2208588957055335,5.9932659932659913,0.7366482504604065,4.1442824251726567,9.8591549295774623,8.1168831168831126,5.4882394868139821,3.7914691943128069,7.4934268185802111,1.9780219780219752,3.9349871685200961,7.027818448023444,5.3600789214074194]
[null,"Other",3.2497393969319686,0.97064370986225978,0.64972910779922144,0.12149969907041894,0.19696982028248453,"N/A","N/A","N/A","N/A","N/A","N/A","N/A","N/A","N/A","N/A",0.19417475728155312,0.28169014084507121,1.4570552147239317,0.20202020202020188,0,0.3069838833461227,0,0.81168831168831113,1.0691375623663602,0,0.92024539877300771,3.1868131868131826,0.85543199315654261,0,1.2824728707661925]
[]
[]
[]
[]
[]
[]
[]
[]
[]
[]
[]
[]
[]
[]
[]
[]
[]
[]
[]
[]
[]
[]
[]
[]
[]
[]
[]
[]
[]
[]
[]
[]
[]
[]
[]
[]
[]
[{"$f":"A1026","v":"Trinidad and Tobago"}]
[{"$f":"A1034","v":"2006"}]
["Use of sanitation facilities"]
[" by wealth quintile and sub-national region"]
["Notes:"]
["WHO/UNICEF JMP customised wealth index excludes water,"]
[" sanitation and hygiene assets."]
["Survey used for analysis:",{"$f":"A1025","v":"MICS06"}]
[{"$f":"B1030","v":""}]
[{"$f":"B1029","v":""}]
[]
[]
["Use of sanitation facilities",null,"NATIONAL wealth index quintile",null,null,null,null,null,null,null,null,null,null,null,null,null,null,"SUB-REGIONS:",null,null,null,null,null,null,null,null,null,null,null,null,null,null,null,null,null,null,null,null,null,null,null,null,null,null,null,null,null,null,null,null,null,null,"Raw numbers of respondents:","Use of sanitation facilities","NATIONAL wealth index quintile",null,null,null,null,"URBAN wealth index quintile",null,null,null,null,"RURAL wealth index quintile",null,null,null,null,"SUB-REGIONS:"]
["Weighted percentage (used in graphs)",null,"Poorest","Poor","Middle","Rich","Richest",null,null,null,null,null,null,null,null,null,null,"Arima","Chaguanas","Couva/Tabaquite/Talparo","Diego Martin","Mayaro/Rio Claro","Penal/Debe","Point Fortin","Port of Spain","Princes Town","San Fernando","San Juan/Laventille","Sangre Grande","Siparia","Tobago","Tunapuna/Piarco",null,null,null,null,null,null,null,null,null,null,null,null,null,null,null,null,null,null,null,null,"Sanitation data, raw numbers (weighted)",null,"Poorest","Poor","Middle","Rich","Richest","Poorest","Poor","Middle","Rich","Richest","Poorest","Poor","Middle","Rich","Richest","Arima","Chaguanas","Couva/Tabaquite/Talparo","Diego Martin","Mayaro/Rio Claro","Penal/Debe","Point Fortin","Port of Spain","Princes Town","San Fernando","San Juan/Laventille","Sangre Grande","Siparia","Tobago","Tunapuna/Piarco"]
["Sanitation","Improved",95.326011400543848,99.150450209389987,99.404360407261066,99.744520144521758,99.778466532192695,"N/A","N/A","N/A","N/A","N/A","N/A","N/A","N/A","N/A","N/A",97.864077669902912,99.624413145539904,98.121165644171739,97.306397306397301,100,99.769762087490392,92.488262910798127,96.266233766233725,97.576621525302897,98.933649289099534,99.912357581069244,99.560439560439576,100,99.560761346998532,99.704044722130888,null,null,null,null,null,null,null,null,null,null,null,null,null,null,null,null,null,null,null,null,"Sanitation","Improved",2745.7428410425782,3482.0502560879945,3916.206686219256,4182.8104571796066,4134.4103002551874,"N/A","N/A","N/A","N/A","N/A","N/A","N/A","N/A","N/A","N/A",545.29366260889458,1042.8661471933908,2426.1519114882344,1541.1968493669517,542.63826694957345,1257.1165463711332,189.87236660065113,623.90515291180895,1334.2327897438283,818.06097334329422,2307.2987340747595,903.87506293173851,1107.8627488831551,720.38630361194623,3100.4630247052373]
[null,"Not Improved",4.673988599456159,0.84954979061000901,0.59563959273893885,0.25547985547824875,0.22153346780732922,"N/A","N/A","N/A","N/A","N/A","N/A","N/A","N/A","N/A","N/A",2.1359223300970842,0.37558685446009493,1.8788343558282277,2.693602693602692,0,0.230237912509592,7.5117370892018753,3.7337662337662323,2.4233784746970835,1.0663507109004771,8.7642418930762647E-2,0.43956043956043905,0,0.43923865300146525,0.29595527786912129,null,null,null,null,null,null,null,null,null,null,null,null,null,null,null,null,null,null,null,null,null,"Not Improved",134.62821477074993,29.83521567179865,23.466251843523324,10.713609224294263,9.179438038951643,"N/A","N/A","N/A","N/A","N/A","N/A","N/A","N/A","N/A","N/A",11.901250572813158,3.9316348621805606,46.456210888207885,42.662888563791029,0,2.9010381839333688,15.421105916804146,24.198682153409116,33.136533857772299,8.8174236647780457,2.0239462579603189,3.9906183793895686,0,3.1781748688762415,9.2032213794020663]
["Sanitation ladder","Basic",80.051079878958959,88.857976876714901,92.799170440252155,96.285487612434778,98.662953338200339,"N/A","N/A","N/A","N/A","N/A","N/A","N/A","N/A","N/A","N/A",93.786407766990294,92.676056338028175,92.523006134969208,91.111111111111114,95.580110497237598,96.085955487336861,92.488262910798127,91.233766233766218,93.941553813257272,97.511848341232238,86.722173531989753,94.39560439560438,93.071000855432089,87.554904831625223,91.943439658007236,null,null,null,null,null,null,null,null,null,null,null,null,null,null,null,null,null,null,null,null,"Sanitation ladder","Basic",2305.7681346995405,3120.5903804330269,3655.9838045813685,4037.7550954817984,4088.1880100196031,"N/A","N/A","N/A","N/A","N/A","N/A","N/A","N/A","N/A","N/A",522.57309333352396,970.13090224305074,2287.7313647601036,1443.0722056702323,518.6542551506974,1210.6999354281984,189.87236660065113,591.28953783547513,1284.5279889571698,806.30440845692362,2002.6948222517383,856.98529697391086,1031.0989484900547,633.51619052932949,2859.1341085342492]
[null,"Limited",15.274931521585161,10.292473332675099,6.6051899670089007,3.4590325320870594,1.1155131939923084,"N/A","N/A","N/A","N/A","N/A","N/A","N/A","N/A","N/A","N/A",4.0776699029126151,6.9483568075117548,5.5981595092024747,6.1952861952861928,4.4198895027624392,3.6838066001534711,0,5.0324675324675292,3.6350677120456241,1.4218009478673026,13.190184049079805,5.164835164835158,6.9289991445679959,12.005856515373381,7.7606050641236228,null,null,null,null,null,null,null,null,null,null,null,null,null,null,null,null,null,null,null,null,null,"Limited",439.97470634304534,361.45987565496785,260.2228816378875,145.05536169781104,46.222290235582477,"N/A","N/A","N/A","N/A","N/A","N/A","N/A","N/A","N/A","N/A",22.720569275370575,72.735244950340359,138.42054672812961,98.124643696719374,23.984011798876217,46.416610942933893,0,32.615615076334024,49.704800786658438,11.756564886370727,304.60391182302862,46.889765957827429,76.763800393101306,86.870113082617252,241.32891617098744]
[null,"Unimproved",4.2038779736097363,0.79160298832174958,0.46211117148337111,0.25547985547824875,0.22153346780732922,"N/A","N/A","N/A","N/A","N/A","N/A","N/A","N/A","N/A","N/A",2.1359223300970842,0.28169014084507121,1.8788343558282277,2.693602693602692,0,0.230237912509592,7.5117370892018753,1.1363636363636356,2.3521026372059923,1.0663507109004771,8.7642418930762647E-2,0.43956043956043905,0,0.43923865300146525,0.2301874383426499,null,null,null,null,null,null,null,null,null,null,null,null,null,null,null,null,null,null,null,null,null,"Unimproved",121.08728437356669,27.800190340887895,18.205668766695254,10.713609224294263,9.179438038951643,"N/A","N/A","N/A","N/A","N/A","N/A","N/A","N/A","N/A","N/A",11.901250572813158,2.9487261466354204,46.456210888207885,42.662888563791029,0,2.9010381839333688,15.421105916804146,7.3648163075592947,32.161929920778995,8.8174236647780457,2.0239462579603189,3.9906183793895686,0,3.1781748688762415,7.1580610728682741]
[null,"Open defecation",0.47011062584642205,5.7946802288259422E-2,0.13352842125556769,0,0,"N/A","N/A","N/A","N/A","N/A","N/A","N/A","N/A","N/A","N/A",0,9.3896713615023733E-2,0,0,0,0,0,2.597402597402596,7.1275837491090663E-2,0,0,0,0,0,6.5767839526471389E-2,null,null,null,null,null,null,null,null,null,null,null,null,null,null,null,null,null,null,null,null,null,"Open defecation",13.540930397183232,2.035025330910754,5.2605830768280679,0,0,"N/A","N/A","N/A","N/A","N/A","N/A","N/A","N/A","N/A","N/A",0,0.98290871554514014,0,0,0,0,0,16.833865845849818,0.97460393699330272,0,0,0,0,0,2.0451603065337927]
["Shared among Improved Sanitation","Yes",16.023886132613345,10.380662226887557,6.6447688410723087,3.4678922983189455,1.1179899158225661,"N/A","N/A","N/A","N/A","N/A","N/A","N/A","N/A","N/A","N/A",4.1666666666666607,6.9745523091423376,5.7053536537710272,6.3667820069204133,4.4198895027624392,3.6923076923076716,0,5.2276559865092747,3.7253469685902205,1.4371257485029978,13.201754385964962,5.187637969094915,6.9289991445679959,12.058823529411793,7.7836411609498457,null,null,null,null,null,null,null,null,null,null,null,null,null,null,null,null,null,null,null,null,"Shared among improved sanitation facilities","Yes","N/A","N/A","N/A","N/A","N/A","N/A","N/A","N/A","N/A","N/A","N/A","N/A","N/A","N/A","N/A","N/A","N/A","N/A","N/A","N/A","N/A","N/A","N/A","N/A","N/A","N/A","N/A","N/A","N/A","N/A"]
[null,"No",83.976113867386943,89.619337773112449,93.355231158927694,96.532107701681127,98.882010084177381,"N/A","N/A","N/A","N/A","N/A","N/A","N/A","N/A","N/A","N/A",95.833333333333329,93.025447690857689,94.29464634622893,93.633217993079583,95.580110497237598,96.307692307692264,100,94.772344013490766,96.27465303140977,98.562874251497007,86.798245614035366,94.812362030905064,93.071000855432089,87.941176470588275,92.21635883905013,null,null,null,null,null,null,null,null,null,null,null,null,null,null,null,null,null,null,null,null,null,"No","N/A","N/A","N/A","N/A","N/A","N/A","N/A","N/A","N/A","N/A","N/A","N/A","N/A","N/A","N/A","N/A","N/A","N/A","N/A","N/A","N/A","N/A","N/A","N/A","N/A","N/A","N/A","N/A","N/A","N/A"]
["Manually calculated ratios","Improved latrines",{"$f":"C158/(C158+C159)*100","v":92.612704594364942},{"$f":"D158/(D158+D159)*100","v":95.985760528985978},96.793813321538366,100,100]
[null,"Other"]
[null,"Other"]
[null,null,"NATIONAL wealth index quintile",null,null,null,null,null,null,null,null,null,null,null,null,null,null,"SUB-REGIONS:",null,null,null,null,null,null,null,null,null,null,null,null,null,null,null,null,null,null,null,null,null,null,null,null,null,null,null,null,null,null,null,null,null,null,"Raw numbers of respondents:","Use of sanitation facilities","NATIONAL wealth index quintile",null,null,null,null,"URBAN wealth index quintile",null,null,null,null,"RURAL wealth index quintile",null,null,null,null,"SUB-REGIONS:"]
["Percentage based on weighted population",null,"Poorest","Poor","Middle","Rich","Richest",null,null,null,null,null,null,null,null,null,null,"Arima","Chaguanas","Couva/Tabaquite/Talparo","Diego Martin","Mayaro/Rio Claro","Penal/Debe","Point Fortin","Port of Spain","Princes Town","San Fernando","San Juan/Laventille","Sangre Grande","Siparia","Tobago","Tunapuna/Piarco",null,null,null,null,null,null,null,null,null,null,null,null,null,null,null,null,null,null,null,null,"Sanitation data, raw numbers (weighted)",null,"Poorest","Poor","Middle","Rich","Richest","Poorest","Poor","Middle","Rich","Richest","Poorest","Poor","Middle","Rich","Richest","Arima","Chaguanas","Couva/Tabaquite/Talparo","Diego Martin","Mayaro/Rio Claro","Penal/Debe","Point Fortin","Port of Spain","Princes Town","San Fernando","San Juan/Laventille","Sangre Grande","Siparia","Tobago","Tunapuna/Piarco"]
["Sanitation type","Sewer connection",7.3352033586440841,12.005366220702848,17.094902218526787,22.650266762454486,31.826395093317629,"N/A","N/A","N/A","N/A","N/A","N/A","N/A","N/A","N/A","N/A",45.242718446601927,8.9201877934272549,0.19171779141104361,24.915824915824917,1.2891344383057115,4.0675364543361248,22.065727699530491,72.564935064934929,16.535994297933048,45.14218009478688,21.253286590709987,0,15.226689478186476,1.6105417276720393,31.70009865175923,null,null,null,null,null,null,null,null,null,null,null,null,null,null,null,null,null,null,null,null,"Sanitation type","Sewer connection","N/A","N/A","N/A","N/A","N/A","N/A","N/A","N/A","N/A","N/A","N/A","N/A","N/A","N/A","N/A","N/A","N/A","N/A","N/A","N/A","N/A","N/A","N/A","N/A","N/A","N/A","N/A","N/A","N/A","N/A"]
[null,"Septic tank connection",38.515120911824788,64.99423047171824,72.46740966806091,75.160223630076828,67.503384443762258,"N/A","N/A","N/A","N/A","N/A","N/A","N/A","N/A","N/A","N/A",52.03883495145628,83.943661971830991,82.093558282208434,62.693602693602692,65.193370165745918,85.878741366078131,57.276995305164277,15.259740259740251,58.660014255167503,49.526066350711062,61.919368974583897,67.03296703296698,66.124893071000926,73.060029282576949,59.1910555738243,null,null,null,null,null,null,null,null,null,null,null,null,null,null,null,null,null,null,null,null,null,"Septic tank connection","N/A","N/A","N/A","N/A","N/A","N/A","N/A","N/A","N/A","N/A","N/A","N/A","N/A","N/A","N/A","N/A","N/A","N/A","N/A","N/A","N/A","N/A","N/A","N/A","N/A","N/A","N/A","N/A","N/A","N/A"]
[null,"Improved latrines",49.475687130075336,22.150853516968844,9.8420485206733161,1.9340297519902472,0.44868699511242932,"N/A","N/A","N/A","N/A","N/A","N/A","N/A","N/A","N/A","N/A",0.58252427184465938,6.7605633802817087,15.835889570552178,9.6969696969696937,33.51749539594848,9.823484267075921,13.145539906103282,8.4415584415584366,22.380612972202478,4.2654028436019082,16.739702015775698,32.52747252747249,18.648417450812644,24.890190336749683,8.8128904965471673,null,null,null,null,null,null,null,null,null,null,null,null,null,null,null,null,null,null,null,null,null,"Improved latrines","N/A","N/A","N/A","N/A","N/A","N/A","N/A","N/A","N/A","N/A","N/A","N/A","N/A","N/A","N/A","N/A","N/A","N/A","N/A","N/A","N/A","N/A","N/A","N/A","N/A","N/A","N/A","N/A","N/A","N/A"]
[null,"Unimproved facilities",4.2038779736097363,0.79160298832174958,0.46211117148337111,0.25547985547824875,0.22153346780732922,"N/A","N/A","N/A","N/A","N/A","N/A","N/A","N/A","N/A","N/A",2.1359223300970842,0.28169014084507121,1.8788343558282277,2.693602693602692,0,0.230237912509592,7.5117370892018753,1.1363636363636356,2.3521026372059923,1.0663507109004771,8.7642418930762647E-2,0.43956043956043905,0,0.43923865300146525,0.2301874383426499,null,null,null,null,null,null,null,null,null,null,null,null,null,null,null,null,null,null,null,null,null,"Unimproved facilities","N/A","N/A","N/A","N/A","N/A","N/A","N/A","N/A","N/A","N/A","N/A","N/A","N/A","N/A","N/A","N/A","N/A","N/A","N/A","N/A","N/A","N/A","N/A","N/A","N/A","N/A","N/A","N/A","N/A","N/A"]
[null,"Open defecation",0.47011062584642205,5.7946802288259422E-2,0.13352842125556769,0,0,"N/A","N/A","N/A","N/A","N/A","N/A","N/A","N/A","N/A","N/A",0,9.3896713615023733E-2,0,0,0,0,0,2.597402597402596,7.1275837491090663E-2,0,0,0,0,0,6.5767839526471389E-2,null,null,null,null,null,null,null,null,null,null,null,null,null,null,null,null,null,null,null,null,null,"Open defecation","N/A","N/A","N/A","N/A","N/A","N/A","N/A","N/A","N/A","N/A","N/A","N/A","N/A","N/A","N/A","N/A","N/A","N/A","N/A","N/A","N/A","N/A","N/A","N/A","N/A","N/A","N/A","N/A","N/A","N/A"]
["Septic tank emptying practices","Not emptied/treated and disposed in situ","N/A","N/A","N/A","N/A","N/A","N/A","N/A","N/A","N/A","N/A","N/A","N/A","N/A","N/A","N/A","N/A","N/A","N/A","N/A","N/A","N/A","N/A","N/A","N/A","N/A","N/A","N/A","N/A","N/A","N/A",null,null,null,null,null,null,null,null,null,null,null,null,null,null,null,null,null,null,null,null,"Septic tank emptying practices","Not emptied/treated and disposed in situ","N/A","N/A","N/A","N/A","N/A","N/A","N/A","N/A","N/A","N/A","N/A","N/A","N/A","N/A","N/A","N/A","N/A","N/A","N/A","N/A","N/A","N/A","N/A","N/A","N/A","N/A","N/A","N/A","N/A","N/A"]
[null,"Emptied and buried on site","N/A","N/A","N/A","N/A","N/A","N/A","N/A","N/A","N/A","N/A","N/A","N/A","N/A","N/A","N/A","N/A","N/A","N/A","N/A","N/A","N/A","N/A","N/A","N/A","N/A","N/A","N/A","N/A","N/A","N/A",null,null,null,null,null,null,null,null,null,null,null,null,null,null,null,null,null,null,null,null,null,"Emptied and buried on site","N/A","N/A","N/A","N/A","N/A","N/A","N/A","N/A","N/A","N/A","N/A","N/A","N/A","N/A","N/A","N/A","N/A","N/A","N/A","N/A","N/A","N/A","N/A","N/A","N/A","N/A","N/A","N/A","N/A","N/A"]
[null,"Emptied and discharged locally","N/A","N/A","N/A","N/A","N/A","N/A","N/A","N/A","N/A","N/A","N/A","N/A","N/A","N/A","N/A","N/A","N/A","N/A","N/A","N/A","N/A","N/A","N/A","N/A","N/A","N/A","N/A","N/A","N/A","N/A",null,null,null,null,null,null,null,null,null,null,null,null,null,null,null,null,null,null,null,null,null,"Emptied and discharged locally","N/A","N/A","N/A","N/A","N/A","N/A","N/A","N/A","N/A","N/A","N/A","N/A","N/A","N/A","N/A","N/A","N/A","N/A","N/A","N/A","N/A","N/A","N/A","N/A","N/A","N/A","N/A","N/A","N/A","N/A"]
[null,"Emptied and removed offsite","N/A","N/A","N/A","N/A","N/A","N/A","N/A","N/A","N/A","N/A","N/A","N/A","N/A","N/A","N/A","N/A","N/A","N/A","N/A","N/A","N/A","N/A","N/A","N/A","N/A","N/A","N/A","N/A","N/A","N/A",null,null,null,null,null,null,null,null,null,null,null,null,null,null,null,null,null,null,null,null,null,"Emptied and removed offsite","N/A","N/A","N/A","N/A","N/A","N/A","N/A","N/A","N/A","N/A","N/A","N/A","N/A","N/A","N/A","N/A","N/A","N/A","N/A","N/A","N/A","N/A","N/A","N/A","N/A","N/A","N/A","N/A","N/A","N/A"]
["Latrine emptying practices","Not emptied/treated and disposed in situ","N/A","N/A","N/A","N/A","N/A","N/A","N/A","N/A","N/A","N/A","N/A","N/A","N/A","N/A","N/A","N/A","N/A","N/A","N/A","N/A","N/A","N/A","N/A","N/A","N/A","N/A","N/A","N/A","N/A","N/A",null,null,null,null,null,null,null,null,null,null,null,null,null,null,null,null,null,null,null,null,"Latrine emptying practices","Not emptied/treated and disposed in situ","N/A","N/A","N/A","N/A","N/A","N/A","N/A","N/A","N/A","N/A","N/A","N/A","N/A","N/A","N/A","N/A","N/A","N/A","N/A","N/A","N/A","N/A","N/A","N/A","N/A","N/A","N/A","N/A","N/A","N/A"]
[null,"Emptied and buried on site","N/A","N/A","N/A","N/A","N/A","N/A","N/A","N/A","N/A","N/A","N/A","N/A","N/A","N/A","N/A","N/A","N/A","N/A","N/A","N/A","N/A","N/A","N/A","N/A","N/A","N/A","N/A","N/A","N/A","N/A",null,null,null,null,null,null,null,null,null,null,null,null,null,null,null,null,null,null,null,null,null,"Emptied and buried on site","N/A","N/A","N/A","N/A","N/A","N/A","N/A","N/A","N/A","N/A","N/A","N/A","N/A","N/A","N/A","N/A","N/A","N/A","N/A","N/A","N/A","N/A","N/A","N/A","N/A","N/A","N/A","N/A","N/A","N/A"]
[null,"Emptied and discharged locally","N/A","N/A","N/A","N/A","N/A","N/A","N/A","N/A","N/A","N/A","N/A","N/A","N/A","N/A","N/A","N/A","N/A","N/A","N/A","N/A","N/A","N/A","N/A","N/A","N/A","N/A","N/A","N/A","N/A","N/A",null,null,null,null,null,null,null,null,null,null,null,null,null,null,null,null,null,null,null,null,null,"Emptied and discharged locally","N/A","N/A","N/A","N/A","N/A","N/A","N/A","N/A","N/A","N/A","N/A","N/A","N/A","N/A","N/A","N/A","N/A","N/A","N/A","N/A","N/A","N/A","N/A","N/A","N/A","N/A","N/A","N/A","N/A","N/A"]
[null,"Emptied and removed offsite","N/A","N/A","N/A","N/A","N/A","N/A","N/A","N/A","N/A","N/A","N/A","N/A","N/A","N/A","N/A","N/A","N/A","N/A","N/A","N/A","N/A","N/A","N/A","N/A","N/A","N/A","N/A","N/A","N/A","N/A",null,null,null,null,null,null,null,null,null,null,null,null,null,null,null,null,null,null,null,null,null,"Emptied and removed offsite","N/A","N/A","N/A","N/A","N/A","N/A","N/A","N/A","N/A","N/A","N/A","N/A","N/A","N/A","N/A","N/A","N/A","N/A","N/A","N/A","N/A","N/A","N/A","N/A","N/A","N/A","N/A","N/A","N/A","N/A"]
["Shared among improved sanitation facilities","Yes",15.274931521585161,10.292473332675099,6.6051899670089007,3.4590325320870594,1.1155131939923084,"N/A","N/A","N/A","N/A","N/A","N/A","N/A","N/A","N/A","N/A",4.0776699029126151,6.9483568075117548,5.5981595092024747,6.1952861952861928,4.4198895027624392,3.6838066001534711,0,5.0324675324675292,3.6350677120456241,1.4218009478673026,13.190184049079805,5.164835164835158,6.9289991445679959,12.005856515373381,7.7606050641236228,null,null,null,null,null,null,null,null,null,null,null,null,null,null,null,null,null,null,null,null,"Shared among improved sanitation facilities","Yes","N/A","N/A","N/A","N/A","N/A","N/A","N/A","N/A","N/A","N/A","N/A","N/A","N/A","N/A","N/A","N/A","N/A","N/A","N/A","N/A","N/A","N/A","N/A","N/A","N/A","N/A","N/A","N/A","N/A","N/A"]
[null,"No",80.051079878958959,88.857976876714901,92.799170440252155,96.285487612434778,98.662953338200339,"N/A","N/A","N/A","N/A","N/A","N/A","N/A","N/A","N/A","N/A",93.786407766990294,92.676056338028175,92.523006134969208,91.111111111111114,95.580110497237598,96.085955487336861,92.488262910798127,91.233766233766218,93.941553813257272,97.511848341232238,86.722173531989753,94.39560439560438,93.071000855432089,87.554904831625223,91.943439658007236,null,null,null,null,null,null,null,null,null,null,null,null,null,null,null,null,null,null,null,null,null,"No","N/A","N/A","N/A","N/A","N/A","N/A","N/A","N/A","N/A","N/A","N/A","N/A","N/A","N/A","N/A","N/A","N/A","N/A","N/A","N/A","N/A","N/A","N/A","N/A","N/A","N/A","N/A","N/A","N/A","N/A"]
[null,"DK/missing",4.673988599456159,0.84954979061000901,0.59563959273893885,0.25547985547824875,0.22153346780732922,"N/A","N/A","N/A","N/A","N/A","N/A","N/A","N/A","N/A","N/A",2.1359223300970842,0.37558685446009493,1.8788343558282277,2.693602693602692,0,0.230237912509592,7.5117370892018753,3.7337662337662323,2.4233784746970835,1.0663507109004771,8.7642418930762647E-2,0.43956043956043905,0,0.43923865300146525,0.29595527786912129,null,null,null,null,null,null,null,null,null,null,null,null,null,null,null,null,null,null,null,null,null,"DK/missing","N/A","N/A","N/A","N/A","N/A","N/A","N/A","N/A","N/A","N/A","N/A","N/A","N/A","N/A","N/A","N/A","N/A","N/A","N/A","N/A","N/A","N/A","N/A","N/A","N/A","N/A","N/A","N/A","N/A","N/A"]
["Shared among all sanitation facilities","Yes",15.730581921688888,10.298440949891106,6.6948004616995531,3.4590325320870594,1.1155131939923084,"N/A","N/A","N/A","N/A","N/A","N/A","N/A","N/A","N/A","N/A",4.0776699029126151,6.9548872180451307,5.5981595092024747,6.2626262626262612,4.4198895027624392,3.6838066001534711,0.46948356807511721,5.1666666666666652,3.6376604850214052,2.0142180094786788,13.190184049079805,5.2747252747252684,6.9289991445679959,12.445095168374847,7.8644290885159371,null,null,null,null,null,null,null,null,null,null,null,null,null,null,null,null,null,null,null,null,"Shared among all sanitation facilities","Yes","N/A","N/A","N/A","N/A","N/A","N/A","N/A","N/A","N/A","N/A","N/A","N/A","N/A","N/A","N/A","N/A","N/A","N/A","N/A","N/A","N/A","N/A","N/A","N/A","N/A","N/A","N/A","N/A","N/A","N/A"]
[null,"No",84.269418078311261,89.70155905010887,93.305199538300414,96.540967467913006,98.884486806007672,"N/A","N/A","N/A","N/A","N/A","N/A","N/A","N/A","N/A","N/A",95.922330097087368,93.045112781954899,94.401840490797468,93.737373737373744,95.580110497237598,96.316193399846455,99.53051643192488,94.833333333333343,96.362339514978572,97.985781990521346,86.809815950920509,94.725274725274716,93.071000855432089,87.554904831625223,92.135570911484066,null,null,null,null,null,null,null,null,null,null,null,null,null,null,null,null,null,null,null,null,null,"No","N/A","N/A","N/A","N/A","N/A","N/A","N/A","N/A","N/A","N/A","N/A","N/A","N/A","N/A","N/A","N/A","N/A","N/A","N/A","N/A","N/A","N/A","N/A","N/A","N/A","N/A","N/A","N/A","N/A","N/A"]
["Kind of toilet facility","Flush to piped sewer system",7.3352033586440841,12.005366220702848,17.094902218526787,22.650266762454486,31.826395093317629,"N/A","N/A","N/A","N/A","N/A","N/A","N/A","N/A","N/A","N/A",45.242718446601927,8.9201877934272549,0.19171779141104361,24.915824915824917,1.2891344383057115,4.0675364543361248,22.065727699530491,72.564935064934929,16.535994297933048,45.14218009478688,21.253286590709987,0,15.226689478186476,1.6105417276720393,31.70009865175923,null,null,null,null,null,null,null,null,null,null,null,null,null,null,null,null,null,null,null,null,"Kind of toilet facility","Flush to piped sewer system",211.28107442743129,421.61471213642108,673.48323649159352,949.84438778821232,1318.7552411556585,"N/A","N/A","N/A","N/A","N/A","N/A","N/A","N/A","N/A","N/A",252.09012576958807,93.376327976788318,4.7404296824701913,394.63171921506722,6.9953367746722304,51.25167458282283,45.299498630612149,470.29612706842875,226.10811338244642,373.27093514227079,490.80696755537832,0,168.69082061693882,11.65330785254622,985.76726774928852]
[null,"Flush to septic tank",38.515120911824788,64.99423047171824,72.46740966806091,75.160223630076828,67.503384443762258,"N/A","N/A","N/A","N/A","N/A","N/A","N/A","N/A","N/A","N/A",52.03883495145628,83.943661971830991,82.093558282208434,62.693602693602692,65.193370165745918,85.878741366078131,57.276995305164277,15.259740259740251,58.660014255167503,49.526066350711062,61.919368974583897,67.03296703296698,66.124893071000926,73.060029282576949,59.1910555738243,null,null,null,null,null,null,null,null,null,null,null,null,null,null,null,null,null,null,null,null,null,"Flush to septic tank",1109.3783948557075,2282.5229374183496,2854.9789276076858,3151.8620662902626,2797.0633108129746,"N/A","N/A","N/A","N/A","N/A","N/A","N/A","N/A","N/A","N/A",289.95774122853902,878.72039169735285,2029.8519900337251,992.97873132223674,353.76417403342396,1082.0872426071505,117.58593261563159,98.89896184436769,802.09904014548658,409.52034354191386,1429.9180312489673,608.56930285690953,732.57305807243779,528.63641985641414,1840.6442758804149]
[null,"Flush to somewhere else",0,0,0.19454004466722988,0.12647953818860244,0.1269571412490702,"N/A","N/A","N/A","N/A","N/A","N/A","N/A","N/A","N/A","N/A",0,0,0.19171779141104361,0.20202020202020188,0,0,0,1.1363636363636356,0.213827512473272,0,0,0,0,0,0,null,null,null,null,null,null,null,null,null,null,null,null,null,null,null,null,null,null,null,null,null,"Flush to somewhere else",0,0,7.6642414934500991,5.3039498730155543,5.2605830768280679,"N/A","N/A","N/A","N/A","N/A","N/A","N/A","N/A","N/A","N/A",0,0,4.7404296824701913,3.1997166422843266,0,0,0,7.3648163075592947,2.9238118109799083,0,0,0,0,0,0]
[null,"Flush to unknown place/not sure/DK where",0.14053371727059094,8.735308951471743E-2,0.44017447085131489,0.17508230083018608,0.20379897925365012,"N/A","N/A","N/A","N/A","N/A","N/A","N/A","N/A","N/A","N/A",0,0,0,0.40404040404040376,0,0,0,0,0,0,0.35056967572305059,0,0,0.73206442166910879,0.65767839526471394,null,null,null,null,null,null,null,null,null,null,null,null,null,null,null,null,null,null,null,null,null,"Flush to unknown place/not sure/DK where",4.0478925159206378,3.0677404598006888,17.341434508390289,7.3421184213275286,8.4445935911024463,"N/A","N/A","N/A","N/A","N/A","N/A","N/A","N/A","N/A","N/A",0,0,0,6.3994332845686532,0,0,0,0,0,0,8.0957850318412756,0,0,5.2969581147937363,20.451603065337924]
[null,"Ventilated Improved Pit latrine (VIP)",3.804243129512634,3.1352288532903465,1.3239820564268832,0.22599160620382272,0,"N/A","N/A","N/A","N/A","N/A","N/A","N/A","N/A","N/A","N/A",0,0.56338028169014243,0,0.20202020202020188,13.996316758747721,1.2279355333844908,3.2863849765258197,7.4675324675324628,0,0,2.7607361963190233,0,1.710863986313085,0,1.3811246300558992,null,null,null,null,null,null,null,null,null,null,null,null,null,null,null,null,null,null,null,null,null,"Ventilated Improved Pit latrine (VIP)",109.57631799524906,110.10564660512483,52.160562781856989,9.4770123942100355,0,"N/A","N/A","N/A","N/A","N/A","N/A","N/A","N/A","N/A","N/A",0,5.8974522932708409,0,3.1997166422843266,75.949370696441349,15.472203647644633,6.7467338386018136,48.397364306818226,0,0,63.754307125750046,0,18.954024788420071,0,42.948366437209643]
[null,"Pit latrine with slab",45.530910283292116,18.928271574163784,8.0778919933951236,1.5329558449562382,0.24488801585877923,"N/A","N/A","N/A","N/A","N/A","N/A","N/A","N/A","N/A","N/A",0.58252427184465938,6.1971830985915668,15.835889570552178,9.0909090909090882,19.521178637200766,8.595548733691432,9.8591549295774623,0.97402597402597335,22.380612972202478,4.2654028436019082,13.628396143733609,32.52747252747249,16.937553464499548,24.158125915080575,6.7740874712265544,null,null,null,null,null,null,null,null,null,null,null,null,null,null,null,null,null,null,null,null,null,"Pit latrine with slab",1311.4591612482802,664.73921946829671,318.2425248297277,64.284872285585109,10.147154695436498,"N/A","N/A","N/A","N/A","N/A","N/A","N/A","N/A","N/A","N/A",3.245795610767225,64.871975225979256,391.55949177203718,143.98724890279476,105.9293854450366,108.30542553351239,20.240201515805445,6.3126996921936813,306.02563621589712,35.269694659112183,314.72364311283002,295.30576007482813,187.64484540535875,174.79961778819319,210.65151157298064]
[null,"Pit latrine without slab/open pit",3.6317942103443475,0.79160298832174958,0.2675711268161412,0,0,"N/A","N/A","N/A","N/A","N/A","N/A","N/A","N/A","N/A","N/A",0,0.28169014084507121,1.6871165644171842,2.49158249158249,0,0.230237912509592,7.5117370892018753,0,2.1382751247327203,0,8.7642418930762647E-2,0.32967032967032928,0,0.43923865300146525,9.8651759289707097E-2,null,null,null,null,null,null,null,null,null,null,null,null,null,null,null,null,null,null,null,null,null,"Pit latrine without slab/open pit",104.6091492414628,27.800190340887895,10.541427273245155,0,0,"N/A","N/A","N/A","N/A","N/A","N/A","N/A","N/A","N/A","N/A",0,2.9487261466354204,41.715781205737692,39.463171921506699,0,2.9010381839333688,15.421105916804146,0,29.238118109799085,0,2.0239462579603189,2.9929637845421766,0,3.1781748688762415,3.0677404598006888]
[null,"Bucket",0.14200672530756997,0,0,0,0,"N/A","N/A","N/A","N/A","N/A","N/A","N/A","N/A","N/A","N/A",0,0,0,0,0,0,0,0,0,0,0,0,0,0,0.13153567905294278,null,null,null,null,null,null,null,null,null,null,null,null,null,null,null,null,null,null,null,null,null,"Bucket",4.0903206130675853,0,0,0,0,"N/A","N/A","N/A","N/A","N/A","N/A","N/A","N/A","N/A","N/A",0,0,0,0,0,0,0,0,0,0,0,0,0,0,4.0903206130675853]
[null,"No facilities or bush or field",0.47011062584642205,5.7946802288259422E-2,0.13352842125556769,0,0,"N/A","N/A","N/A","N/A","N/A","N/A","N/A","N/A","N/A","N/A",0,9.3896713615023733E-2,0,0,0,0,0,2.597402597402596,7.1275837491090663E-2,0,0,0,0,0,6.5767839526471389E-2,null,null,null,null,null,null,null,null,null,null,null,null,null,null,null,null,null,null,null,null,null,"No facilities or bush or field",13.540930397183232,2.035025330910754,5.2605830768280679,0,0,"N/A","N/A","N/A","N/A","N/A","N/A","N/A","N/A","N/A","N/A",0,0.98290871554514014,0,0,0,0,0,16.833865845849818,0.97460393699330272,0,0,0,0,0,2.0451603065337927]
[null,"Other",0.43007703795781871,0,0,0,9.4576326558259038E-2,"N/A","N/A","N/A","N/A","N/A","N/A","N/A","N/A","N/A","N/A",1.1650485436893188,0,0,0,0,0,0,0,0,1.0663507109004771,0,0.10989010989010976,0,0,0,null,null,null,null,null,null,null,null,null,null,null,null,null,null,null,null,null,null,null,null,null,"Other",12.387814519036311,0,0,0,3.9188549621235755,"N/A","N/A","N/A","N/A","N/A","N/A","N/A","N/A","N/A","N/A",6.49159122153445,0,0,0,0,0,0,0,0,8.8174236647780457,0,0.99765459484739216,0,0,0]
[null,"Missing",0,0,0,0.12900031728964628,0,"N/A","N/A","N/A","N/A","N/A","N/A","N/A","N/A","N/A","N/A",0.97087378640776567,0,0,0,0,0,0,0,0,0,0,0,0,0,0,null,null,null,null,null,null,null,null,null,null,null,null,null,null,null,null,null,null,null,null,null,"Missing",0,0,0,5.4096593512787088,0,"N/A","N/A","N/A","N/A","N/A","N/A","N/A","N/A","N/A","N/A",5.4096593512787088,0,0,0,0,0,0,0,0,0,0,0,0,0,0]
[null,null,null,null,null,null,null,null,null,null,null,null,null,null,null,null,null,null,null,null,null,null,null,null,null,null,null,null,null,null,null,null,null,null,null,null,null,null,null,null,null,null,null,null,null,null,null,null,null,null,null,null,null,"Total",2880.371055813328,3511.8854717597933,3939.6729380627794,4193.5240664039002,4143.5897382941384,"N/A","N/A","N/A","N/A","N/A","N/A","N/A","N/A","N/A","N/A",557.19491318170776,1046.7977820555714,2472.6081223764431,1583.8597379307428,542.63826694957345,1260.0175845550666,205.29347251745529,648.10383506521839,1367.3693236016009,826.87839700807217,2309.3226803327198,907.86568131112801,1107.8627488831551,723.56447848082246,3109.6662460846392]
[]
[]
[]
[]
[]
[]
[]
[]
[]
[]
[]
[]
[]
[]
[]
[]
[]
[]
[]
[]
[]
[]
[]
[]
[]
[]
[]
[]
[]
[]
[]
[]
[]
[]
[]
[]
[]
[]
[]
[]
[]
[]
[]
[{"$f":"A1026","v":"Trinidad and Tobago"}]
[{"$f":"A1034","v":"2006"}]
["Access to hygiene facilities "]
[" by wealth quintile and sub-national region"]
["Notes:"]
["WHO/UNICEF JMP customised wealth index excludes water,"]
[" sanitation and hygiene assets."]
["Survey used for analysis:",{"$f":"A1025","v":"MICS06"}]
[]
[]
[]
[]
["Access to handwashing",null,"NATIONAL wealth index quintile",null,null,null,null,null,null,null,null,null,null,null,null,null,null,"SUB-REGIONS:",null,null,null,null,null,null,null,null,null,null,null,null,null,null,null,null,null,null,null,null,null,null,null,null,null,null,null,null,null,null,null,null,null,null,"Raw numbers of respondents:","Access to handwashing","NATIONAL wealth index quintile",null,null,null,null,"URBAN wealth index quintile",null,null,null,null,"RURAL wealth index quintile",null,null,null,null,"SUB-REGIONS:"]
["Weighted percentage (used in graphs)",null,"Poorest","Poor","Middle","Rich","Richest",null,null,null,null,null,null,null,null,null,null,"Arima","Chaguanas","Couva/Tabaquite/Talparo","Diego Martin","Mayaro/Rio Claro","Penal/Debe","Point Fortin","Port of Spain","Princes Town","San Fernando","San Juan/Laventille","Sangre Grande","Siparia","Tobago","Tunapuna/Piarco",null,null,null,null,null,null,null,null,null,null,null,null,null,null,null,null,null,null,null,null,"Hygiene data, raw numbers (weighted)",null,"Poorest","Poor","Middle","Rich","Richest","Poorest","Poor","Middle","Rich","Richest","Poorest","Poor","Middle","Rich","Richest","Arima","Chaguanas","Couva/Tabaquite/Talparo","Diego Martin","Mayaro/Rio Claro","Penal/Debe","Point Fortin","Port of Spain","Princes Town","San Fernando","San Juan/Laventille","Sangre Grande","Siparia","Tobago","Tunapuna/Piarco"]
["Hygiene ladder","Basic","N/A","N/A","N/A","N/A","N/A","N/A","N/A","N/A","N/A","N/A","N/A","N/A","N/A","N/A","N/A","N/A","N/A","N/A","N/A","N/A","N/A","N/A","N/A","N/A","N/A","N/A","N/A","N/A","N/A","N/A",null,null,null,null,null,null,null,null,null,null,null,null,null,null,null,null,null,null,null,null,"Hygiene ladder","Basic","N/A","N/A","N/A","N/A","N/A","N/A","N/A","N/A","N/A","N/A","N/A","N/A","N/A","N/A","N/A","N/A","N/A","N/A","N/A","N/A","N/A","N/A","N/A","N/A","N/A","N/A","N/A","N/A","N/A","N/A"]
[null,"Limited","N/A","N/A","N/A","N/A","N/A","N/A","N/A","N/A","N/A","N/A","N/A","N/A","N/A","N/A","N/A","N/A","N/A","N/A","N/A","N/A","N/A","N/A","N/A","N/A","N/A","N/A","N/A","N/A","N/A","N/A",null,null,null,null,null,null,null,null,null,null,null,null,null,null,null,null,null,null,null,null,null,"Limited","N/A","N/A","N/A","N/A","N/A","N/A","N/A","N/A","N/A","N/A","N/A","N/A","N/A","N/A","N/A","N/A","N/A","N/A","N/A","N/A","N/A","N/A","N/A","N/A","N/A","N/A","N/A","N/A","N/A","N/A"]
[null,"No facility","N/A","N/A","N/A","N/A","N/A","N/A","N/A","N/A","N/A","N/A","N/A","N/A","N/A","N/A","N/A","N/A","N/A","N/A","N/A","N/A","N/A","N/A","N/A","N/A","N/A","N/A","N/A","N/A","N/A","N/A",null,null,null,null,null,null,null,null,null,null,null,null,null,null,null,null,null,null,null,null,null,"No facility","N/A","N/A","N/A","N/A","N/A","N/A","N/A","N/A","N/A","N/A","N/A","N/A","N/A","N/A","N/A","N/A","N/A","N/A","N/A","N/A","N/A","N/A","N/A","N/A","N/A","N/A","N/A","N/A","N/A","N/A"]
[null,null,null,null,null,null,null,null,null,null,null,null,null,null,null,null,null,null,null,null,null,null,null,null,null,null,null,null,null,null,null,null,null,null,null,null,null,null,null,null,null,null,null,null,null,null,null,null,null,null,null,null,"Observed handwashing place","Fixed","N/A","N/A","N/A","N/A","N/A","N/A","N/A","N/A","N/A","N/A","N/A","N/A","N/A","N/A","N/A","N/A","N/A","N/A","N/A","N/A","N/A","N/A","N/A","N/A","N/A","N/A","N/A","N/A","N/A","N/A"]
[null,null,null,null,null,null,null,null,null,null,null,null,null,null,null,null,null,null,null,null,null,null,null,null,null,null,null,null,null,null,null,null,null,null,null,null,null,null,null,null,null,null,null,null,null,null,null,null,null,null,null,null,null,"Mobile","N/A","N/A","N/A","N/A","N/A","N/A","N/A","N/A","N/A","N/A","N/A","N/A","N/A","N/A","N/A","N/A","N/A","N/A","N/A","N/A","N/A","N/A","N/A","N/A","N/A","N/A","N/A","N/A","N/A","N/A"]
[null,null,null,null,null,null,null,null,null,null,null,null,null,null,null,null,null,null,null,null,null,null,null,null,null,null,null,null,null,null,null,null,null,null,null,null,null,null,null,null,null,null,null,null,null,null,null,null,null,null,null,null,"Water / Soap","Water and soap","N/A","N/A","N/A","N/A","N/A","N/A","N/A","N/A","N/A","N/A","N/A","N/A","N/A","N/A","N/A","N/A","N/A","N/A","N/A","N/A","N/A","N/A","N/A","N/A","N/A","N/A","N/A","N/A","N/A","N/A"]
[null,null,null,null,null,null,null,null,null,null,null,null,null,null,null,null,null,null,null,null,null,null,null,null,null,null,null,null,null,null,null,null,null,null,null,null,null,null,null,null,null,null,null,null,null,null,null,null,null,null,null,null,null,"Water only","N/A","N/A","N/A","N/A","N/A","N/A","N/A","N/A","N/A","N/A","N/A","N/A","N/A","N/A","N/A","N/A","N/A","N/A","N/A","N/A","N/A","N/A","N/A","N/A","N/A","N/A","N/A","N/A","N/A","N/A"]
[null,null,null,null,null,null,null,null,null,null,null,null,null,null,null,null,null,null,null,null,null,null,null,null,null,null,null,null,null,null,null,null,null,null,null,null,null,null,null,null,null,null,null,null,null,null,null,null,null,null,null,null,null,"Soap only","N/A","N/A","N/A","N/A","N/A","N/A","N/A","N/A","N/A","N/A","N/A","N/A","N/A","N/A","N/A","N/A","N/A","N/A","N/A","N/A","N/A","N/A","N/A","N/A","N/A","N/A","N/A","N/A","N/A","N/A"]
[null,null,null,null,null,null,null,null,null,null,null,null,null,null,null,null,null,null,null,null,null,null,null,null,null,null,null,null,null,null,null,null,null,null,null,null,null,null,null,null,null,null,null,null,null,null,null,null,null,null,null,null,null,"Neither","N/A","N/A","N/A","N/A","N/A","N/A","N/A","N/A","N/A","N/A","N/A","N/A","N/A","N/A","N/A","N/A","N/A","N/A","N/A","N/A","N/A","N/A","N/A","N/A","N/A","N/A","N/A","N/A","N/A","N/A"]
[]
[]
[]
[]
[]
[]
[]
[]
[]
[]
[]
[]
[]
[]
[]
[]
[]
[]
[]
[]
[]
[]
[]
[]
[]
[]
[]
[]
[null,null,null,null,null,null,null,null,null,null,null,null,null,null,null,null,null,null,null,null,null,null,null,null,null,null,null,null,null,null,null,null,null,null,null,null,null,null,null,null,null,null,null,null,null,null,null,null,null,null,null,null,"Raw numbers of respondents:","Menstrual health and hygiene","NATIONAL wealth index quintile",null,null,null,null,"URBAN wealth index quintile",null,null,null,null,"RURAL wealth index quintile",null,null,null,null,"SUB-REGIONS:"]
[null,null,null,null,null,null,null,null,null,null,null,null,null,null,null,null,null,null,null,null,null,null,null,null,null,null,null,null,null,null,null,null,null,null,null,null,null,null,null,null,null,null,null,null,null,null,null,null,null,null,null,null,"MHH data, raw numbers (weighted)",null,"Poorest","Poor","Middle","Rich","Richest","Poorest","Poor","Middle","Rich","Richest","Poorest","Poor","Middle","Rich","Richest","Arima","Chaguanas","Couva/Tabaquite/Talparo","Diego Martin","Mayaro/Rio Claro","Penal/Debe","Point Fortin","Port of Spain","Princes Town","San Fernando","San Juan/Laventille","Sangre Grande","Siparia","Tobago","Tunapuna/Piarco"]
[null,null,null,null,null,null,null,null,null,null,null,null,null,null,null,null,null,null,null,null,null,null,null,null,null,null,null,null,null,null,null,null,null,null,null,null,null,null,null,null,null,null,null,null,null,null,null,null,null,null,null,null,"Private place to wash and change","Yes","N/A","N/A","N/A","N/A","N/A","N/A","N/A","N/A","N/A","N/A","N/A","N/A","N/A","N/A","N/A","N/A","N/A","N/A","N/A","N/A","N/A","N/A","N/A","N/A","N/A","N/A","N/A","N/A","N/A","N/A"]
[null,null,null,null,null,null,null,null,null,null,null,null,null,null,null,null,null,null,null,null,null,null,null,null,null,null,null,null,null,null,null,null,null,null,null,null,null,null,null,null,null,null,null,null,null,null,null,null,null,null,null,null,null,"No","N/A","N/A","N/A","N/A","N/A","N/A","N/A","N/A","N/A","N/A","N/A","N/A","N/A","N/A","N/A","N/A","N/A","N/A","N/A","N/A","N/A","N/A","N/A","N/A","N/A","N/A","N/A","N/A","N/A","N/A"]
[null,null,null,null,null,null,null,null,null,null,null,null,null,null,null,null,null,null,null,null,null,null,null,null,null,null,null,null,null,null,null,null,null,null,null,null,null,null,null,null,null,null,null,null,null,null,null,null,null,null,null,null,null,"DK/not sure/missing","N/A","N/A","N/A","N/A","N/A","N/A","N/A","N/A","N/A","N/A","N/A","N/A","N/A","N/A","N/A","N/A","N/A","N/A","N/A","N/A","N/A","N/A","N/A","N/A","N/A","N/A","N/A","N/A","N/A","N/A"]
[null,null,null,null,null,null,null,null,null,null,null,null,null,null,null,null,null,null,null,null,null,null,null,null,null,null,null,null,null,null,null,null,null,null,null,null,null,null,null,null,null,null,null,null,null,null,null,null,null,null,null,null,"Use of menstrual materials","Materials reusable","N/A","N/A","N/A","N/A","N/A","N/A","N/A","N/A","N/A","N/A","N/A","N/A","N/A","N/A","N/A","N/A","N/A","N/A","N/A","N/A","N/A","N/A","N/A","N/A","N/A","N/A","N/A","N/A","N/A","N/A"]
[null,null,null,null,null,null,null,null,null,null,null,null,null,null,null,null,null,null,null,null,null,null,null,null,null,null,null,null,null,null,null,null,null,null,null,null,null,null,null,null,null,null,null,null,null,null,null,null,null,null,null,null,null,"Materials not reusable","N/A","N/A","N/A","N/A","N/A","N/A","N/A","N/A","N/A","N/A","N/A","N/A","N/A","N/A","N/A","N/A","N/A","N/A","N/A","N/A","N/A","N/A","N/A","N/A","N/A","N/A","N/A","N/A","N/A","N/A"]
[null,null,null,null,null,null,null,null,null,null,null,null,null,null,null,null,null,null,null,null,null,null,null,null,null,null,null,null,null,null,null,null,null,null,null,null,null,null,null,null,null,null,null,null,null,null,null,null,null,null,null,null,null,"No materials used","N/A","N/A","N/A","N/A","N/A","N/A","N/A","N/A","N/A","N/A","N/A","N/A","N/A","N/A","N/A","N/A","N/A","N/A","N/A","N/A","N/A","N/A","N/A","N/A","N/A","N/A","N/A","N/A","N/A","N/A"]
[null,null,null,null,null,null,null,null,null,null,null,null,null,null,null,null,null,null,null,null,null,null,null,null,null,null,null,null,null,null,null,null,null,null,null,null,null,null,null,null,null,null,null,null,null,null,null,null,null,null,null,null,null,"DK/not sure/missing","N/A","N/A","N/A","N/A","N/A","N/A","N/A","N/A","N/A","N/A","N/A","N/A","N/A","N/A","N/A","N/A","N/A","N/A","N/A","N/A","N/A","N/A","N/A","N/A","N/A","N/A","N/A","N/A","N/A","N/A"]
[null,null,null,null,null,null,null,null,null,null,null,null,null,null,null,null,null,null,null,null,null,null,null,null,null,null,null,null,null,null,null,null,null,null,null,null,null,null,null,null,null,null,null,null,null,null,null,null,null,null,null,null,"Use of menstrual materials with private place to wash and change","Materials reusable","N/A","N/A","N/A","N/A","N/A","N/A","N/A","N/A","N/A","N/A","N/A","N/A","N/A","N/A","N/A","N/A","N/A","N/A","N/A","N/A","N/A","N/A","N/A","N/A","N/A","N/A","N/A","N/A","N/A","N/A"]
[null,null,null,null,null,null,null,null,null,null,null,null,null,null,null,null,null,null,null,null,null,null,null,null,null,null,null,null,null,null,null,null,null,null,null,null,null,null,null,null,null,null,null,null,null,null,null,null,null,null,null,null,null,"Materials not reusable","N/A","N/A","N/A","N/A","N/A","N/A","N/A","N/A","N/A","N/A","N/A","N/A","N/A","N/A","N/A","N/A","N/A","N/A","N/A","N/A","N/A","N/A","N/A","N/A","N/A","N/A","N/A","N/A","N/A","N/A"]
[null,null,null,null,null,null,null,null,null,null,null,null,null,null,null,null,null,null,null,null,null,null,null,null,null,null,null,null,null,null,null,null,null,null,null,null,null,null,null,null,null,null,null,null,null,null,null,null,null,null,null,null,null,"No materials used","N/A","N/A","N/A","N/A","N/A","N/A","N/A","N/A","N/A","N/A","N/A","N/A","N/A","N/A","N/A","N/A","N/A","N/A","N/A","N/A","N/A","N/A","N/A","N/A","N/A","N/A","N/A","N/A","N/A","N/A"]
[null,null,null,null,null,null,null,null,null,null,null,null,null,null,null,null,null,null,null,null,null,null,null,null,null,null,null,null,null,null,null,null,null,null,null,null,null,null,null,null,null,null,null,null,null,null,null,null,null,null,null,null,"Awareness of menstruation before menarche","Yes","N/A","N/A","N/A","N/A","N/A","N/A","N/A","N/A","N/A","N/A","N/A","N/A","N/A","N/A","N/A","N/A","N/A","N/A","N/A","N/A","N/A","N/A","N/A","N/A","N/A","N/A","N/A","N/A","N/A","N/A"]
[null,null,null,null,null,null,null,null,null,null,null,null,null,null,null,null,null,null,null,null,null,null,null,null,null,null,null,null,null,null,null,null,null,null,null,null,null,null,null,null,null,null,null,null,null,null,null,null,null,null,null,null,null,"No","N/A","N/A","N/A","N/A","N/A","N/A","N/A","N/A","N/A","N/A","N/A","N/A","N/A","N/A","N/A","N/A","N/A","N/A","N/A","N/A","N/A","N/A","N/A","N/A","N/A","N/A","N/A","N/A","N/A","N/A"]
[null,null,null,null,null,null,null,null,null,null,null,null,null,null,null,null,null,null,null,null,null,null,null,null,null,null,null,null,null,null,null,null,null,null,null,null,null,null,null,null,null,null,null,null,null,null,null,null,null,null,null,null,null,"DK/not sure/missing","N/A","N/A","N/A","N/A","N/A","N/A","N/A","N/A","N/A","N/A","N/A","N/A","N/A","N/A","N/A","N/A","N/A","N/A","N/A","N/A","N/A","N/A","N/A","N/A","N/A","N/A","N/A","N/A","N/A","N/A"]
[null,null,null,null,null,null,null,null,null,null,null,null,null,null,null,null,null,null,null,null,null,null,null,null,null,null,null,null,null,null,null,null,null,null,null,null,null,null,null,null,null,null,null,null,null,null,null,null,null,null,null,null,"Participation in (all) activities during menstruation","Yes","N/A","N/A","N/A","N/A","N/A","N/A","N/A","N/A","N/A","N/A","N/A","N/A","N/A","N/A","N/A","N/A","N/A","N/A","N/A","N/A","N/A","N/A","N/A","N/A","N/A","N/A","N/A","N/A","N/A","N/A"]
[null,null,null,null,null,null,null,null,null,null,null,null,null,null,null,null,null,null,null,null,null,null,null,null,null,null,null,null,null,null,null,null,null,null,null,null,null,null,null,null,null,null,null,null,null,null,null,null,null,null,null,null,null,"No","N/A","N/A","N/A","N/A","N/A","N/A","N/A","N/A","N/A","N/A","N/A","N/A","N/A","N/A","N/A","N/A","N/A","N/A","N/A","N/A","N/A","N/A","N/A","N/A","N/A","N/A","N/A","N/A","N/A","N/A"]
[null,null,null,null,null,null,null,null,null,null,null,null,null,null,null,null,null,null,null,null,null,null,null,null,null,null,null,null,null,null,null,null,null,null,null,null,null,null,null,null,null,null,null,null,null,null,null,null,null,null,null,null,null,"DK/not sure/missing/no such activity","N/A","N/A","N/A","N/A","N/A","N/A","N/A","N/A","N/A","N/A","N/A","N/A","N/A","N/A","N/A","N/A","N/A","N/A","N/A","N/A","N/A","N/A","N/A","N/A","N/A","N/A","N/A","N/A","N/A","N/A"]
[null,null,null,null,null,null,null,null,null,null,null,null,null,null,null,null,null,null,null,null,null,null,null,null,null,null,null,null,null,null,null,null,null,null,null,null,null,null,null,null,null,null,null,null,null,null,null,null,null,null,null,null,"Participation in specific activities during menstruation","Did not go to school (amongst those usually attending school)","N/A","N/A","N/A","N/A","N/A","N/A","N/A","N/A","N/A","N/A","N/A","N/A","N/A","N/A","N/A","N/A","N/A","N/A","N/A","N/A","N/A","N/A","N/A","N/A","N/A","N/A","N/A","N/A","N/A","N/A"]
[null,null,null,null,null,null,null,null,null,null,null,null,null,null,null,null,null,null,null,null,null,null,null,null,null,null,null,null,null,null,null,null,null,null,null,null,null,null,null,null,null,null,null,null,null,null,null,null,null,null,null,null,null,"Did not go to work (amongst those who usually work)","N/A","N/A","N/A","N/A","N/A","N/A","N/A","N/A","N/A","N/A","N/A","N/A","N/A","N/A","N/A","N/A","N/A","N/A","N/A","N/A","N/A","N/A","N/A","N/A","N/A","N/A","N/A","N/A","N/A","N/A"]
[null,null,null,null,null,null,null,null,null,null,null,null,null,null,null,null,null,null,null,null,null,null,null,null,null,null,null,null,null,null,null,null,null,null,null,null,null,null,null,null,null,null,null,null,null,null,null,null,null,null,null,null,null,"Did not participate in social activities","N/A","N/A","N/A","N/A","N/A","N/A","N/A","N/A","N/A","N/A","N/A","N/A","N/A","N/A","N/A","N/A","N/A","N/A","N/A","N/A","N/A","N/A","N/A","N/A","N/A","N/A","N/A","N/A","N/A","N/A"]
[null,null,null,null,null,null,null,null,null,null,null,null,null,null,null,null,null,null,null,null,null,null,null,null,null,null,null,null,null,null,null,null,null,null,null,null,null,null,null,null,null,null,null,null,null,null,null,null,null,null,null,null,null,"Did not cook food","N/A","N/A","N/A","N/A","N/A","N/A","N/A","N/A","N/A","N/A","N/A","N/A","N/A","N/A","N/A","N/A","N/A","N/A","N/A","N/A","N/A","N/A","N/A","N/A","N/A","N/A","N/A","N/A","N/A","N/A"]
[null,null,null,null,null,null,null,null,null,null,null,null,null,null,null,null,null,null,null,null,null,null,null,null,null,null,null,null,null,null,null,null,null,null,null,null,null,null,null,null,null,null,null,null,null,null,null,null,null,null,null,null,null,"Did not eat with others","N/A","N/A","N/A","N/A","N/A","N/A","N/A","N/A","N/A","N/A","N/A","N/A","N/A","N/A","N/A","N/A","N/A","N/A","N/A","N/A","N/A","N/A","N/A","N/A","N/A","N/A","N/A","N/A","N/A","N/A"]
[null,null,null,null,null,null,null,null,null,null,null,null,null,null,null,null,null,null,null,null,null,null,null,null,null,null,null,null,null,null,null,null,null,null,null,null,null,null,null,null,null,null,null,null,null,null,null,null,null,null,null,null,null,"Did not bathe in regular place","N/A","N/A","N/A","N/A","N/A","N/A","N/A","N/A","N/A","N/A","N/A","N/A","N/A","N/A","N/A","N/A","N/A","N/A","N/A","N/A","N/A","N/A","N/A","N/A","N/A","N/A","N/A","N/A","N/A","N/A"]
[null,null,null,null,null,null,null,null,null,null,null,null,null,null,null,null,null,null,null,null,null,null,null,null,null,null,null,null,null,null,null,null,null,null,null,null,null,null,null,null,null,null,null,null,null,null,null,null,null,null,null,null,null,"Did not participate in other activities","N/A","N/A","N/A","N/A","N/A","N/A","N/A","N/A","N/A","N/A","N/A","N/A","N/A","N/A","N/A","N/A","N/A","N/A","N/A","N/A","N/A","N/A","N/A","N/A","N/A","N/A","N/A","N/A","N/A","N/A"]
[null,null,null,null,null,null,null,null,null,null,null,null,null,null,null,null,null,null,null,null,null,null,null,null,null,null,null,null,null,null,null,null,null,null,null,null,null,null,null,null,null,null,null,null,null,null,null,null,null,null,null,null,null,"DK/not sure/missing/no such activity","N/A","N/A","N/A","N/A","N/A","N/A","N/A","N/A","N/A","N/A","N/A","N/A","N/A","N/A","N/A","N/A","N/A","N/A","N/A","N/A","N/A","N/A","N/A","N/A","N/A","N/A","N/A","N/A","N/A","N/A"]
[]
[]
[]
[]
[]
[]
[]
[]
[]
[]
[]
[]
[]
[]
[]
[]
[]
[]
[]
[]
[]
[]
[]
[]
[]
[]
[]
[]
[]
[]
[]
[]
[]
[]
[]
[]
[]
[]
[]
[]
[]
[]
[]
[]
[]
[]
[]
[]
[]
[]
[]
[]
[]
[]
[null,null,null,null,null,null,null,null,null,null,null,null,null,null,null,null,null,null,null,null,null,null,null,null,null,null,null,null,null,null,null,null,null,null,null,null,null,null,null,null,null,null,null,null,null,null,null,null,null,null,null,null,"Raw numbers of respondents:","Basic water, sanitation and hygiene","NATIONAL wealth index quintile",null,null,null,null,"URBAN wealth index quintile",null,null,null,null,"RURAL wealth index quintile",null,null,null,null,"SUB-REGIONS:"]
[null,null,null,null,null,null,null,null,null,null,null,null,null,null,null,null,null,null,null,null,null,null,null,null,null,null,null,null,null,null,null,null,null,null,null,null,null,null,null,null,null,null,null,null,null,null,null,null,null,null,null,null,"WatSan data, raw numbers (weighted)",null,"Poorest","Poor","Middle","Rich","Richest","Poorest","Poor","Middle","Rich","Richest","Poorest","Poor","Middle","Rich","Richest","Arima","Chaguanas","Couva/Tabaquite/Talparo","Diego Martin","Mayaro/Rio Claro","Penal/Debe","Point Fortin","Port of Spain","Princes Town","San Fernando","San Juan/Laventille","Sangre Grande","Siparia","Tobago","Tunapuna/Piarco"]
[null,null,null,null,null,null,null,null,null,null,null,null,null,null,null,null,null,null,null,null,null,null,null,null,null,null,null,null,null,null,null,null,null,null,null,null,null,null,null,null,null,null,null,null,null,null,null,null,null,null,null,null,"Use of Basic Water Sanitation and Hygiene","Yes","N/A","N/A","N/A","N/A","N/A","N/A","N/A","N/A","N/A","N/A","N/A","N/A","N/A","N/A","N/A","N/A","N/A","N/A","N/A","N/A","N/A","N/A","N/A","N/A","N/A","N/A","N/A","N/A","N/A","N/A"]
[null,null,null,null,null,null,null,null,null,null,null,null,null,null,null,null,null,null,null,null,null,null,null,null,null,null,null,null,null,null,null,null,null,null,null,null,null,null,null,null,null,null,null,null,null,null,null,null,null,null,null,null,null,"No","N/A","N/A","N/A","N/A","N/A","N/A","N/A","N/A","N/A","N/A","N/A","N/A","N/A","N/A","N/A","N/A","N/A","N/A","N/A","N/A","N/A","N/A","N/A","N/A","N/A","N/A","N/A","N/A","N/A","N/A"]
[null,null,null,null,null,null,null,null,null,null,null,null,null,null,null,null,null,null,null,null,null,null,null,null,null,null,null,null,null,null,null,null,null,null,null,null,null,null,null,null,null,null,null,null,null,null,null,null,null,null,null,null,"Use of Basic Water and Sanitation","Yes","N/A","N/A","N/A","N/A","N/A","N/A","N/A","N/A","N/A","N/A","N/A","N/A","N/A","N/A","N/A","N/A","N/A","N/A","N/A","N/A","N/A","N/A","N/A","N/A","N/A","N/A","N/A","N/A","N/A","N/A"]
[null,null,null,null,null,null,null,null,null,null,null,null,null,null,null,null,null,null,null,null,null,null,null,null,null,null,null,null,null,null,null,null,null,null,null,null,null,null,null,null,null,null,null,null,null,null,null,null,null,null,null,null,null,"No","N/A","N/A","N/A","N/A","N/A","N/A","N/A","N/A","N/A","N/A","N/A","N/A","N/A","N/A","N/A","N/A","N/A","N/A","N/A","N/A","N/A","N/A","N/A","N/A","N/A","N/A","N/A","N/A","N/A","N/A"]
[null,null,null,null,null,null,null,null,null,null,null,null,null,null,null,null,null,null,null,null,null,null,null,null,null,null,null,null,null,null,null,null,null,null,null,null,null,null,null,null,null,null,null,null,null,null,null,null,null,null,null,null,"Use of Basic Water and Hygiene","Yes","N/A","N/A","N/A","N/A","N/A","N/A","N/A","N/A","N/A","N/A","N/A","N/A","N/A","N/A","N/A","N/A","N/A","N/A","N/A","N/A","N/A","N/A","N/A","N/A","N/A","N/A","N/A","N/A","N/A","N/A"]
[null,null,null,null,null,null,null,null,null,null,null,null,null,null,null,null,null,null,null,null,null,null,null,null,null,null,null,null,null,null,null,null,null,null,null,null,null,null,null,null,null,null,null,null,null,null,null,null,null,null,null,null,null,"No","N/A","N/A","N/A","N/A","N/A","N/A","N/A","N/A","N/A","N/A","N/A","N/A","N/A","N/A","N/A","N/A","N/A","N/A","N/A","N/A","N/A","N/A","N/A","N/A","N/A","N/A","N/A","N/A","N/A","N/A"]
[null,null,null,null,null,null,null,null,null,null,null,null,null,null,null,null,null,null,null,null,null,null,null,null,null,null,null,null,null,null,null,null,null,null,null,null,null,null,null,null,null,null,null,null,null,null,null,null,null,null,null,null,"Use of Basic Sanitation and Hygiene","Yes","N/A","N/A","N/A","N/A","N/A","N/A","N/A","N/A","N/A","N/A","N/A","N/A","N/A","N/A","N/A","N/A","N/A","N/A","N/A","N/A","N/A","N/A","N/A","N/A","N/A","N/A","N/A","N/A","N/A","N/A"]
[null,null,null,null,null,null,null,null,null,null,null,null,null,null,null,null,null,null,null,null,null,null,null,null,null,null,null,null,null,null,null,null,null,null,null,null,null,null,null,null,null,null,null,null,null,null,null,null,null,null,null,null,null,"No","N/A","N/A","N/A","N/A","N/A","N/A","N/A","N/A","N/A","N/A","N/A","N/A","N/A","N/A","N/A","N/A","N/A","N/A","N/A","N/A","N/A","N/A","N/A","N/A","N/A","N/A","N/A","N/A","N/A","N/A"]
[null,null,null,null,null,null,null,null,null,null,null,null,null,null,null,null,null,null,null,null,null,null,null,null,null,null,null,null,null,null,null,null,null,null,null,null,null,null,null,null,null,null,null,null,null,null,null,null,null,null,null,null,"Use of Basic Water","Yes","N/A","N/A","N/A","N/A","N/A","N/A","N/A","N/A","N/A","N/A","N/A","N/A","N/A","N/A","N/A","N/A","N/A","N/A","N/A","N/A","N/A","N/A","N/A","N/A","N/A","N/A","N/A","N/A","N/A","N/A"]
[null,null,null,null,null,null,null,null,null,null,null,null,null,null,null,null,null,null,null,null,null,null,null,null,null,null,null,null,null,null,null,null,null,null,null,null,null,null,null,null,null,null,null,null,null,null,null,null,null,null,null,null,null,"No","N/A","N/A","N/A","N/A","N/A","N/A","N/A","N/A","N/A","N/A","N/A","N/A","N/A","N/A","N/A","N/A","N/A","N/A","N/A","N/A","N/A","N/A","N/A","N/A","N/A","N/A","N/A","N/A","N/A","N/A"]
[null,null,null,null,null,null,null,null,null,null,null,null,null,null,null,null,null,null,null,null,null,null,null,null,null,null,null,null,null,null,null,null,null,null,null,null,null,null,null,null,null,null,null,null,null,null,null,null,null,null,null,null,"Use of Basic Sanitation","Yes","N/A","N/A","N/A","N/A","N/A","N/A","N/A","N/A","N/A","N/A","N/A","N/A","N/A","N/A","N/A","N/A","N/A","N/A","N/A","N/A","N/A","N/A","N/A","N/A","N/A","N/A","N/A","N/A","N/A","N/A"]
[null,null,null,null,null,null,null,null,null,null,null,null,null,null,null,null,null,null,null,null,null,null,null,null,null,null,null,null,null,null,null,null,null,null,null,null,null,null,null,null,null,null,null,null,null,null,null,null,null,null,null,null,null,"No","N/A","N/A","N/A","N/A","N/A","N/A","N/A","N/A","N/A","N/A","N/A","N/A","N/A","N/A","N/A","N/A","N/A","N/A","N/A","N/A","N/A","N/A","N/A","N/A","N/A","N/A","N/A","N/A","N/A","N/A"]
[null,null,null,null,null,null,null,null,null,null,null,null,null,null,null,null,null,null,null,null,null,null,null,null,null,null,null,null,null,null,null,null,null,null,null,null,null,null,null,null,null,null,null,null,null,null,null,null,null,null,null,null,"Access to Basic Hygiene","Yes","N/A","N/A","N/A","N/A","N/A","N/A","N/A","N/A","N/A","N/A","N/A","N/A","N/A","N/A","N/A","N/A","N/A","N/A","N/A","N/A","N/A","N/A","N/A","N/A","N/A","N/A","N/A","N/A","N/A","N/A"]
[null,null,null,null,null,null,null,null,null,null,null,null,null,null,null,null,null,null,null,null,null,null,null,null,null,null,null,null,null,null,null,null,null,null,null,null,null,null,null,null,null,null,null,null,null,null,null,null,null,null,null,null,null,"No","N/A","N/A","N/A","N/A","N/A","N/A","N/A","N/A","N/A","N/A","N/A","N/A","N/A","N/A","N/A","N/A","N/A","N/A","N/A","N/A","N/A","N/A","N/A","N/A","N/A","N/A","N/A","N/A","N/A","N/A"]
[]
[]
[]
[]
[]
[]
[]
[]
[]
[]
[]
[]
[]
[]
[]
[]
[]
[]
[]
[]
[]
[]
[]
[]
[]
[]
[]
[]
[]
[]
[]
[]
[]
[]
[]
[]
[]
[]
[]
[]
[]
[]
[]
[]
[null,null,"INITIAL (national) Wealth Index",null,null,null,null,"URBAN Wealth Index",null,null,null,null,"RURAL Wealth Index"]
[null,null,"Component Matrix"]
[null,null,null,null,"Component"]
[null,"Note:\n\nThe INITIAL (national) Wealth Index is based on the first component of the Principal Component Analysis (PCA) which has been obtained at national level.\n\nThe final national-level (NATIONAL) Wealth Index is based on the URBAN and RURAL specific wealth indexes. Regression procedures are used to establish the relationships between the two sets of scores (urban and rural) and the initial (national) wealth factors.\nThis allows best use of the available information for each area and a better precision of the FINAL (NATIONAL) Wealth Index.\n\nFor dependency reasons, all WASH variables (contained in the generic MICS and DHS scripts) have been excluded from the sets of asset variables used in the PCAs.\n\nThe PCA can extracts as many components as there are asset variables in the input. Only the first of the components is used to represent the Wealth Index. \n\nThe scores represent the weights of the asset variables on the Wealth Index (correlations between the variables and the component).\n\nThe communalities are the proportion of each variable's variance that can be explained by the component.\n\nProportion of explained variance is the part of the model's total variance that is explained by the component.\n\nFor more information on the procedure used:\n\nThe DHS Wealth Index, DHS Comparative Reports No. 6, Shea Oscar Rutstein, Kiersten Johnson, ORC Macro International Inc., 2004.\n\nThe DHS Wealth Index: Approaches for Rural and Urban Areas, Shea O. Rutstein, ORC Macro International Inc., 2008.\n\nMICS Methodological Paper No. 4, Review of options for reporting water, sanitation and hygiene coverage by wealth quintile, UNICEF, 2016.",null,null,"1"]
[null,null,"Household member owns: asset2j",null,0.64426182976019153]
[null,null,"Household member owns: asset2q",null,0.6434011464532664]
[null,null,"Household member owns: asset2g",null,0.60709388858795876]
[null,null,"Household member owns: asset2l",null,0.58860848576053515]
[null,null,"Household member owns: asset2m",null,0.56771387853165467]
[null,null,"Household member owns: asset2p",null,0.55475445166343262]
[null,null,"Household member owns: asset2s",null,0.54689760115181618]
[null,null,"Household member owns: asset2e",null,0.53997835711403097]
[null,null,"Household member owns: asset2i",null,0.53564090606995962]
[null,null,"Household member owns: asset2d",null,0.53398652533325552]
[null,null,"Household member owns: asset2n",null,0.49443035011047892]
[null,null,"Household member owns: asset2k",null,0.48758693114280277]
[null,null,"Household member owns: asset2c",null,0.48578539477836857]
[null,null,"Household member owns: asset2h",null,0.46354949427572206]
[null,null,"Household member owns: asset2a",null,0.45571852792152096]
[null,null,"Household member owns: asset2r",null,0.41444807723789084]
[null,null,"floor9",null,0.41269387792659518]
[null,null,"floor4",null,-0.40182130034607361]
[null,null,"Household member owns: asset2o",null,0.39436107639455087]
[null,null,"Household member owns: asset2v",null,0.33944095366573163]
[null,null,"Household member owns: asset2f",null,0.31671823393410925]
[null,null,"fuel1",null,0.30096641764921256]
[null,null,"wall19",null,-0.29609228082953187]
[null,null,"Household member owns: asset2b",null,0.26975866294894041]
[null,null,"Household member owns: asset2w",null,0.26161157545814651]
[null,null,"wall18",null,0.25599422846080028]
[null,null,"wall7",null,-0.24823068216243466]
[null,null,"fuel2",null,-0.22500070623001991]
[null,null,"wall9",null,-0.22085677891065902]
[null,null,"fuel8",null,-0.21236206897305962]
[null,null,"Household cooks outside house",null,-0.19845741928679353]
[null,null,"wall11",null,0.18926916388511381]
[null,null,"Household cooks in owm house",null,0.17883272089072744]
[null,null,"floor3",null,-0.15325679739924652]
[null,null,"roof12",null,0.12777684014707874]
[null,null,"floor11",null,0.11449537932418889]
[null,null,"wall10",null,-0.11016759943364597]
[null,null,"Household member owns: asset2u",null,9.1396816808907516E-2]
[null,null,"roof14",null,-8.6820231178058246E-2]
[null,null,"Household cooks in other house",null,-8.6132281090065793E-2]
[null,null,"roof11",null,7.5781559016748018E-2]
[null,null,"fuel5",null,-7.4094233174694907E-2]
[null,null,"Persons per sleeping rooms",null,-6.6495734242809593E-2]
[null,null,"roof13",null,6.1118229863419832E-2]
[null,null,"roof6",null,-5.744258051972842E-2]
[null,null,"roof8",null,-5.3668676310977124E-2]
[null,null,"floor8",null,-5.2433329967884371E-2]
[null,null,"wall17",null,-4.5876406731193614E-2]
[null,null,"wall3",null,-4.5660805502471001E-2]
[null,null,"floor7",null,-4.3127715647816922E-2]
[null,null,"Household member owns: asset2t",null,4.1947590012647688E-2]
[null,null,"wall14",null,-4.1035165390696751E-2]
[null,null,"roof7",null,3.4615439044184119E-2]
[null,null,"floor10",null,-9.8172859012744858E-3]
[null,null,"wall13",null,-8.7760290681614516E-3]
[null,null,"fuel3",null,4.8271078001566395E-3]
[null,null,"wall12",null,-1.7967565152741563E-3]
[]
[]
[]
[null,null,"Communalities"]
[null,null,null,null,"Extraction"]
[null,null,"Persons per sleeping rooms",null,4.42168267249036E-3]
[null,null,"floor3",null,2.3487645949073696E-2]
[null,null,"floor4",null,0.1614603574118095]
[null,null,"floor7",null,1.8599998569989527E-3]
[null,null,"floor8",null,2.7492540915210412E-3]
[null,null,"floor9",null,0.17031623687809144]
[null,null,"floor10",null,9.6379102467362794E-5]
[null,null,"floor11",null,1.3109191886589901E-2]
[null,null,"wall3",null,2.0849091591344862E-3]
[null,null,"wall7",null,6.1618471566827655E-2]
[null,null,"wall9",null,4.8777716790791723E-2]
[null,null,"wall10",null,1.2136899964972272E-2]
[null,null,"wall11",null,3.5822816397770067E-2]
[null,null,"wall12",null,3.2283339751801294E-6]
[null,null,"wall13",null,7.7018686205214762E-5]
[null,null,"wall14",null,1.6838847986418365E-3]
[null,null,"wall17",null,2.1046446945659067E-3]
[null,null,"wall18",null,6.5533045005240403E-2]
[null,null,"wall19",null,8.7670638766834369E-2]
[null,null,"roof6",null,3.2996500567654828E-3]
[null,null,"roof7",null,1.1982286202216264E-3]
[null,null,"roof8",null,2.8803268169724371E-3]
[null,null,"roof11",null,5.7428446870088625E-3]
[null,null,"roof12",null,1.6326920877972113E-2]
[null,null,"roof13",null,3.7354380216378237E-3]
[null,null,"roof14",null,7.5377525418114776E-3]
[null,null,"fuel1",null,9.0580784552600241E-2]
[null,null,"fuel2",null,5.0625317804007725E-2]
[null,null,"fuel3",null,2.3300969714333071E-5]
[null,null,"fuel5",null,5.4899553897460596E-3]
[null,null,"fuel8",null,4.509764833851853E-2]
[null,null,"Household cooks in owm house",null,3.1981142061180821E-2]
[null,null,"Household cooks in other house",null,7.4187698457781051E-3]
[null,null,"Household cooks outside house",null,3.9385347269974169E-2]
[null,null,"Household member owns: asset2a",null,0.20767937669095807]
[null,null,"Household member owns: asset2b",null,7.276973623600004E-2]
[null,null,"Household member owns: asset2c",null,0.23598744977997541]
[null,null,"Household member owns: asset2d",null,0.28514160923748355]
[null,null,"Household member owns: asset2e",null,0.29157662615156799]
[null,null,"Household member owns: asset2f",null,0.10031043970634115]
[null,null,"Household member owns: asset2g",null,0.36856298956084887]
[null,null,"Household member owns: asset2h",null,0.21487813364327768]
[null,null,"Household member owns: asset2i",null,0.28691118025544732]
[null,null,"Household member owns: asset2j",null,0.41507330528594999]
[null,null,"Household member owns: asset2k",null,0.23774101542125628]
[null,null,"Household member owns: asset2l",null,0.34645994950931008]
[null,null,"Household member owns: asset2m",null,0.32229904787745434]
[null,null,"Household member owns: asset2n",null,0.24446137111037075]
[null,null,"Household member owns: asset2o",null,0.15552065857506878]
[null,null,"Household member owns: asset2p",null,0.3077525016403958]
[null,null,"Household member owns: asset2q",null,0.41396503525737754]
[null,null,"Household member owns: asset2r",null,0.17176720872618473]
[null,null,"Household member owns: asset2s",null,0.29909698614561103]
[null,null,"Household member owns: asset2t",null,1.7596003078691801E-3]
[null,null,"Household member owns: asset2u",null,8.3533781228010001E-3]
[null,null,"Household member owns: asset2v",null,0.11522016102550137]
[null,null,"Household member owns: asset2w",null,6.8440616413693478E-2]
[]
[]
[null,null,"Total Variance Explained"]
[null,null,"Component",null,"Extraction Sums of Squared Loadings"]
[null,null,null,null,"Total","% of Variance","Cumulative %"]
[null,null,"1",null,6.1780658265486563,10.838711976401152,10.838711976401152]
[]
[]
[null,null,"Component Score Coefficient Matrix"]
[null,null,null,null,"Component"]
[null,null,null,null,"1"]
[null,null,"Persons per sleeping rooms",null,-1.0763196137707242E-2]
[null,null,"floor3",null,-2.4806598327370467E-2]
[null,null,"floor4",null,-6.5039983649793673E-2]
[null,null,"floor7",null,-6.9807795608921169E-3]
[null,null,"floor8",null,-8.487013806580946E-3]
[null,null,"floor9",null,6.6799851201511787E-2]
[null,null,"floor10",null,-1.5890549205687019E-3]
[null,null,"floor11",null,1.8532560600467273E-2]
[null,null,"wall3",null,-7.390792973790499E-3]
[null,null,"wall7",null,-4.0179352103327688E-2]
[null,null,"wall9",null,-3.5748531192656377E-2]
[null,null,"wall10",null,-1.7832053352398566E-2]
[null,null,"wall11",null,3.0635666436537149E-2]
[null,null,"wall12",null,-2.9082832163313237E-4]
[null,null,"wall13",null,-1.4205140111082522E-3]
[null,null,"wall14",null,-6.6420731896961399E-3]
[null,null,"wall17",null,-7.4256908260918004E-3]
[null,null,"wall18",null,4.1435982659933895E-2]
[null,null,"wall19",null,-4.7926371965340851E-2]
[null,null,"roof6",null,-9.2978259106407772E-3]
[null,null,"roof7",null,5.6029573034707941E-3]
[null,null,"roof8",null,-8.6869706179480526E-3]
[null,null,"roof11",null,1.2266227188952272E-2]
[null,null,"roof12",null,2.0682337115605097E-2]
[null,null,"roof13",null,9.8927773803865748E-3]
[null,null,"roof14",null,-1.4052979300571795E-2]
[null,null,"fuel1",null,4.8715314161251966E-2]
[null,null,"fuel2",null,-3.6419279519997502E-2]
[null,null,"fuel3",null,7.8132993977069322E-4]
[null,null,"fuel5",null,-1.1993111639616061E-2]
[null,null,"fuel8",null,-3.4373552327734674E-2]
[null,null,"Household cooks in owm house",null,2.8946392918353121E-2]
[null,null,"Household cooks in other house",null,-1.3941625665420133E-2]
[null,null,"Household cooks outside house",null,-3.21229046207267E-2]
[null,null,"Household member owns: asset2a",null,7.3763948251115624E-2]
[null,null,"Household member owns: asset2b",null,4.3663934720430078E-2]
[null,null,"Household member owns: asset2c",null,7.8630660212591172E-2]
[null,null,"Household member owns: asset2d",null,8.6432637709780491E-2]
[null,null,"Household member owns: asset2e",null,8.7402493316534796E-2]
[null,null,"Household member owns: asset2f",null,5.1264949715021442E-2]
[null,null,"Household member owns: asset2g",null,9.8266011666487629E-2]
[null,null,"Household member owns: asset2h",null,7.503149161728527E-2]
[null,null,"Household member owns: asset2i",null,8.6700420666963429E-2]
[null,null,"Household member owns: asset2j",null,0.1042821245108204]
[null,null,"Household member owns: asset2k",null,7.8922262214740857E-2]
[null,null,"Household member owns: asset2l",null,9.5273909713156649E-2]
[null,null,"Household member owns: asset2m",null,9.189184681264638E-2]
[null,null,"Household member owns: asset2n",null,8.0029958241265589E-2]
[null,null,"Household member owns: asset2o",null,6.3832449745013259E-2]
[null,null,"Household member owns: asset2p",null,8.9794195665497345E-2]
[null,null,"Household member owns: asset2q",null,0.10414281176617037]
[null,null,"Household member owns: asset2r",null,6.7083791088289532E-2]
[null,null,"Household member owns: asset2s",null,8.8522462613082525E-2]
[null,null,"Household member owns: asset2t",null,6.7897609365683122E-3]
[null,null,"Household member owns: asset2u",null,1.4793758981355151E-2]
[null,null,"Household member owns: asset2v",null,5.4942916309999652E-2]
[null,null,"Household member owns: asset2w",null,4.2345223052486385E-2]
[]
[]
[null,null,"Component Score Covariance Matrix"]
[null,null,"Component",null,"1"]
[null,null,"1",null,1]
[]
[]
[]
[]
[]
[]
[]
[]
[]
[]
[]
[]
[]
[]
[]
[]
[]
[]
[]
[]
[]
[]
[]
[]
[]
[]
[]
[]
[]
[]
[]
[]
[]
[]
[]
[]
[]
[]
[]
[]
[]
[]
[]
[]
[]
[]
[]
[]
[]
[]
[]
[]
[]
[]
[]
[]
[]
[]
[]
[]
[]
[]
[]
[]
[]
[]
[]
[]
[]
[]
[]
[]
[]
[]
[]
[]
[]
[]
[]
[]
[]
[]
[]
[]
[]
[]
[]
[]
[]
[]
[]
[]
[]
[]
[]
[]
[]
[]
[]
[]
[]
[]
[]
[]
[]
[]
[]
[]
[]
[]
[]
[]
[]
[]
[]
[]
[]
[]
[]
[]
[]
[]
[]
[]
[]
[]
[]
[]
[]
[]
[]
[]
[]
[]
[]
[]
[]
[]
[]
[]
[]
[]
[]
[]
[]
[]
[]
[]
[]
[]
[]
[]
[]
[]
[]
[]
[]
[]
[]
[]
[]
[]
[]
[]
[]
[]
[]
[]
[]
[]
[]
[]
[]
[]
[]
[]
[]
[]
[]
[]
[]
[]
[]
[]
[]
[]
[]
[]
[]
[]
[]
[]
[]
[]
[]
[]
[]
[]
[]
[]
[]
[]
[]
[]
[]
[]
[]
[]
[]
[]
[]
[]
[]
[]
[]
[]
[]
[]
[]
[]
[]
[]
[]
[]
[]
[]
[]
[]
[]
[]
[]
[]
[]
[]
[]
[]
[]
[]
[]
[]
[]
[]
[]
[]
[]
[]
[]
[]
[]
[]
[]
[]
[]
[]
[]
[]
[]
[]
[]
[]
[]
[]
[]
[]
[]
[]
[]
[]
[]
[]
[]
[]
[]
[]
[]
[]
[]
[]
[]
[]
[]
[]
[]
[]
[]
[]
[]
[]
[]
[]
[]
[]
[]
[]
[]
[]
[]
[]
[]
[]
[]
[]
[]
[]
[]
[]
[]
[]
[]
[]
[]
[]
[]
[]
[]
[]
[]
[]
[]
[]
[]
[]
[]
[]
[]
[]
[]
[]
[]
[]
[]
[]
[]
[]
[]
[]
[]
[]
[]
[]
[]
[]
[]
[]
[]
[]
[]
[]
[]
[]
[]
[]
[]
[]
[]
[]
[]
[]
[]
[]
[]
[]
[]
[]
[]
[]
[]
[]
[]
[]
[]
[]
[]
[]
[]
[]
[]
[]
[]
[]
[]
[]
[]
[]
[]
[]
[]
[]
[]
[]
[]
[]
[]
[]
[]
[]
[]
[]
[]
[]
[]
[]
[]
[]
[]
[]
[]
[]
[]
[]
[]
[]
[]
[]
[]
[]
[]
[]
[]
[]
[]
[]
[]
[]
[]
[]
[]
[]
[]
[]
["MICS06"]
["Trinidad and Tobago",null,"Count"]
["W_text_t","",5557]
["W_text_i","",5557]
["S_text_s","",5557]
["S_text_i","",5557]
["Urban/Rural",".00",5557]
[null,"Urban",0]
[null,"Rural",0]
["2006"]
["2006"]
["Sub-national region names","Weighted population"]
[{"$f":"R15","v":"Arima"},{"$f":"BR122+BR123","v":557.19491318170776}]
[{"$f":"S15","v":"Chaguanas"},{"$f":"BS122+BS123","v":1046.7977820555714}]
[{"$f":"T15","v":"Couva/Tabaquite/Talparo"},{"$f":"BT122+BT123","v":2472.6081223764422}]
[{"$f":"U15","v":"Diego Martin"},{"$f":"BU122+BU123","v":1583.8597379307428}]
[{"$f":"V15","v":"Mayaro/Rio Claro"},{"$f":"BV122+BV123","v":542.63826694957345}]
[{"$f":"W15","v":"Penal/Debe"},{"$f":"BW122+BW123","v":1260.0175845550666}]
[{"$f":"X15","v":"Point Fortin"},{"$f":"BX122+XR123","v":189.87236660065113}]
[{"$f":"Y15","v":"Port of Spain"},{"$f":"BY122+BY123","v":648.10383506521805}]
[{"$f":"Z15","v":"Princes Town"},{"$f":"BZ122+BZ123","v":1367.3693236016006}]
[{"$f":"AA15","v":"San Fernando"},{"$f":"CA122+CA123","v":826.87839700807228}]
[{"$f":"AB15","v":"San Juan/Laventille"},{"$f":"CB122+CB123","v":2309.3226803327198}]
[{"$f":"AC15","v":"Sangre Grande"},{"$f":"CC122+CC123","v":907.86568131112813}]
[{"$f":"AD15","v":"Siparia"},{"$f":"CD122+CD123","v":1107.8627488831551}]
[{"$f":"AE15","v":"Tobago"},{"$f":"CE122+CE123","v":723.56447848082246}]
[{"$f":"AF15","v":"Tunapuna/Piarco"},{"$f":"CF122+CF123","v":3109.6662460846392}]
[{"$f":"AG15","v":0},{"$f":"CG122+CG123","v":0}]
[{"$f":"AH15","v":0},{"$f":"CH122+CH123","v":0}]
[{"$f":"AI15","v":0},{"$f":"CI122+CI123","v":0}]
[{"$f":"AJ15","v":0},{"$f":"CJ122+CJ123","v":0}]
[{"$f":"AK15","v":0},{"$f":"CK122+CK123","v":0}]
[{"$f":"AL15","v":0},{"$f":"CL122+CL123","v":0}]
[{"$f":"AM15","v":0},{"$f":"CM122+CM123","v":0}]
[{"$f":"AN15","v":0},{"$f":"CN122+CN123","v":0}]
[{"$f":"AO15","v":0},{"$f":"CO122+CO123","v":0}]
[{"$f":"AP15","v":0},{"$f":"CP122+CP123","v":0}]
[{"$f":"AQ15","v":0},{"$f":"CQ122+CQ123","v":0}]
[{"$f":"AR15","v":0},{"$f":"CR122+CR123","v":0}]
[{"$f":"AS15","v":0},{"$f":"CS122+CS123","v":0}]
[{"$f":"AT15","v":0},{"$f":"CT122+CT123","v":0}]
[{"$f":"AU15","v":0},{"$f":"CU122+CU123","v":0}]
[{"$f":"AV15","v":0},{"$f":"CV122+CV123","v":0}]
[{"$f":"AW15","v":0},{"$f":"CW122+CW123","v":0}]
[{"$f":"AX15","v":0},{"$f":"CX122+CX123","v":0}]
[{"$f":"AY15","v":0},{"$f":"CY122+CY123","v":0}]
[]
[{"$f":"34-COUNTIF(A1037:A1071,\"0\")","v":15},"Sub-regions"]

{"sheet":"MICS11","index":6,"n_rows":1072,"n_cols":74,"rows_kept":1072,"cut":false,"hidden":false,"merged":[[346,52,347,52],[348,52,349,52],[350,52,351,52],[352,52,353,52],[152,52,163,52],[230,52,235,52],[270,52,272,52],[273,52,275,52],[276,52,283,52],[338,54,338,58],[338,59,338,63],[338,64,338,68],[340,52,341,52],[342,52,343,52],[344,52,345,52],[221,52,223,52],[224,52,225,52],[226,52,229,52],[258,54,258,58],[258,59,258,63],[258,64,258,68],[260,52,262,52],[263,52,266,52],[267,52,269,52],[119,64,119,68],[121,52,122,52],[123,52,126,52],[127,52,128,52],[132,54,132,58],[132,59,132,63],[132,64,132,68],[134,52,138,52],[219,54,219,58],[219,59,219,63],[219,64,219,68],[13,64,13,68],[15,52,16,52],[17,52,20,52],[21,52,22,52],[26,54,26,58],[26,59,26,63],[26,64,26,68],[40,52,41,52],[55,54,55,58],[55,59,55,63],[55,64,55,68],[139,52,142,52],[143,0,146,0],[143,52,146,52],[147,0,149,0],[147,52,149,52],[150,0,151,0],[150,52,151,52],[13,54,13,58],[13,59,13,63],[119,54,119,58],[119,59,119,63],[42,52,43,52],[44,52,45,52],[46,0,48,0],[46,52,48,52],[49,0,51,0],[49,52,51,52],[52,0,54,0],[52,52,54,52],[32,52,33,52],[34,52,35,52],[36,52,37,52],[38,0,39,0],[38,52,39,52],[13,2,13,6],[13,7,13,11],[28,52,29,52],[30,0,31,0],[30,52,31,52],[26,2,26,6],[26,7,26,11],[26,12,26,16],[13,12,13,16],[15,0,16,0],[17,0,20,0],[21,0,22,0],[23,0,25,0],[32,0,33,0],[55,2,55,6],[55,7,55,11],[55,12,55,16],[28,0,29,0],[34,0,35,0],[36,0,37,0],[40,0,41,0],[42,0,43,0],[44,0,45,0],[139,0,142,0],[107,0,107,1],[119,2,119,6],[119,7,119,11],[57,0,69,0],[132,12,132,16],[134,0,138,0],[119,12,119,16],[121,0,122,0],[123,0,126,0],[127,0,128,0],[129,0,131,0],[152,0,162,0],[132,2,132,6],[132,7,132,11],[219,2,219,6],[219,7,219,11],[219,12,219,16],[207,0,207,1],[1025,0,1025,1],[1030,0,1032,0],[1033,0,1033,2],[221,0,223,0],[224,0,228,0],[398,2,398,5],[398,7,398,10],[398,12,398,15],[399,2,399,4],[399,7,399,9],[399,12,399,14],[1024,0,1024,2],[400,2,401,3],[400,7,401,8],[400,12,401,13],[401,1,444,1],[402,2,402,3],[402,7,402,8],[402,12,402,13],[403,2,403,3],[403,7,403,8],[403,12,403,13],[406,2,406,3],[406,7,406,8],[406,12,406,13],[407,2,407,3],[407,7,407,8],[407,12,407,13],[404,2,404,3],[404,7,404,8],[404,12,404,13],[405,2,405,3],[405,7,405,8],[405,12,405,13],[410,2,410,3],[410,7,410,8],[410,12,410,13],[411,2,411,3],[411,7,411,8],[411,12,411,13],[408,2,408,3],[408,7,408,8],[408,12,408,13],[409,2,409,3],[409,7,409,8],[409,12,409,13],[414,2,414,3],[414,7,414,8],[414,12,414,13],[415,2,415,3],[415,7,415,8],[415,12,415,13],[412,2,412,3],[412,7,412,8],[412,12,412,13],[413,2,413,3],[413,7,413,8],[413,12,413,13],[418,2,418,3],[418,7,418,8],[418,12,418,13],[419,2,419,3],[419,7,419,8],[419,12,419,13],[416,2,416,3],[416,7,416,8],[416,12,416,13],[417,2,417,3],[417,7,417,8],[417,12,417,13],[422,2,422,3],[422,7,422,8],[422,12,422,13],[423,2,423,3],[423,7,423,8],[423,12,423,13],[420,2,420,3],[420,7,420,8],[420,12,420,13],[421,2,421,3],[421,7,421,8],[421,12,421,13],[426,2,426,3],[426,7,426,8],[426,12,426,13],[427,2,427,3],[427,7,427,8],[427,12,427,13],[424,2,424,3],[424,7,424,8],[424,12,424,13],[425,2,425,3],[425,7,425,8],[425,12,425,13],[430,2,430,3],[430,7,430,8],[430,12,430,13],[431,2,431,3],[431,7,431,8],[431,12,431,13],[428,2,428,3],[428,7,428,8],[428,12,428,13],[429,2,429,3],[429,7,429,8],[429,12,429,13],[434,2,434,3],[434,7,434,8],[434,12,434,13],[435,2,435,3],[435,7,435,8],[435,12,435,13],[432,2,432,3],[432,7,432,8],[432,12,432,13],[433,2,433,3],[433,7,433,8],[433,12,433,13],[438,2,438,3],[438,7,438,8],[438,12,438,13],[439,2,439,3],[439,7,439,8],[439,12,439,13],[436,2,436,3],[436,7,436,8],[436,12,436,13],[437,2,437,3],[437,7,437,8],[437,12,437,13],[442,2,442,3],[442,7,442,8],[442,12,442,13],[443,2,443,3],[443,7,443,8],[443,12,443,13],[440,2,440,3],[440,7,440,8],[440,12,440,13],[441,2,441,3],[441,7,441,8],[441,12,441,13],[446,2,446,3],[446,7,446,8],[446,12,446,13],[447,2,447,3],[447,7,447,8],[447,12,447,13],[444,2,444,3],[444,7,444,8],[444,12,444,13],[445,2,445,3],[445,7,445,8],[445,12,445,13],[450,2,450,3],[450,7,450,8],[450,12,450,13],[451,2,451,3],[451,7,451,8],[451,12,451,13],[448,2,448,3],[448,7,448,8],[448,12,448,13],[449,2,449,3],[449,7,449,8],[449,12,449,13],[454,2,454,3],[454,7,454,8],[454,12,454,13],[455,2,455,3],[455,7,455,8],[455,12,455,13],[452,2,452,3],[452,7,452,8],[452,12,452,13],[453,2,453,3],[453,7,453,8],[453,12,453,13],[458,2,458,3],[458,7,458,8],[458,12,458,13],[459,2,459,3],[459,7,459,8],[459,12,459,13],[456,2,456,3],[456,7,456,8],[456,12,456,13],[457,2,457,3],[457,7,457,8],[457,12,457,13],[462,2,462,3],[462,7,462,8],[462,12,462,13],[463,2,463,3],[463,7,463,8],[463,12,463,13],[460,2,460,3],[460,7,460,8],[460,12,460,13],[461,2,461,3],[461,7,461,8],[461,12,461,13],[466,2,466,3],[466,7,466,8],[466,12,466,13],[467,2,467,3],[467,7,467,8],[467,12,467,13],[464,2,464,3],[464,7,464,8],[464,12,464,13],[465,2,465,3],[465,7,465,8],[465,12,465,13],[470,2,470,3],[470,7,470,8],[470,12,470,13],[471,2,471,4],[471,7,471,8],[471,12,471,13],[468,2,468,3],[468,7,468,8],[468,12,468,13],[469,2,469,3],[469,7,469,8],[469,12,469,13],[474,2,474,3],[474,7,474,8],[474,12,474,13],[475,2,475,3],[475,7,475,8],[475,12,475,13],[472,2,472,3],[472,7,472,8],[472,12,472,13],[473,2,473,3],[473,7,473,8],[473,12,473,13],[478,2,478,3],[478,7,478,8],[478,12,478,13],[479,2,479,3],[479,7,479,8],[479,12,479,13],[476,2,476,3],[476,7,476,8],[476,12,476,13],[477,2,477,3],[477,7,477,8],[477,12,477,13],[482,2,482,3],[482,7,482,8],[482,12,482,13],[483,2,483,3],[483,7,483,8],[483,12,483,13],[480,2,480,3],[480,7,480,8],[480,12,480,13],[481,2,481,3],[481,7,481,8],[481,12,481,13],[486,2,486,3],[486,7,486,8],[486,12,486,13],[487,2,487,3],[487,7,487,8],[487,12,487,13],[484,2,484,3],[484,7,484,8],[484,12,484,13],[485,2,485,3],[485,7,485,8],[485,12,485,13],[490,2,490,3],[490,7,490,8],[490,12,490,13],[491,2,491,3],[491,7,491,9],[491,12,491,13],[488,2,488,3],[488,7,488,8],[488,12,488,13],[489,2,489,3],[489,7,489,8],[489,12,489,13],[494,2,494,3],[494,7,494,8],[494,12,494,14],[495,2,495,3],[495,7,495,8],[495,12,495,13],[492,2,492,3],[492,7,492,8],[492,12,492,13],[493,2,493,3],[493,7,493,8],[493,12,493,13],[498,2,498,3],[498,7,498,8],[498,12,498,13],[499,2,499,3],[499,7,499,8],[499,12,499,13],[496,2,496,3],[496,7,496,8],[496,12,496,13],[497,2,497,3],[497,7,497,8],[497,12,497,13],[502,2,502,3],[502,7,502,8],[502,12,502,13],[503,2,503,3],[503,7,503,8],[503,12,503,13],[500,2,500,3],[500,7,500,8],[500,12,500,13],[501,2,501,3],[501,7,501,8],[501,12,501,13],[506,2,506,3],[506,7,506,8],[506,12,506,13],[507,2,507,3],[507,7,507,8],[507,12,507,13],[504,2,504,3],[504,7,504,8],[504,12,504,13],[505,2,505,3],[505,7,505,8],[505,12,505,13],[510,2,510,3],[510,7,510,8],[510,12,510,13],[511,2,511,3],[511,7,511,8],[511,12,511,13],[508,2,508,3],[508,7,508,8],[508,12,508,13],[509,2,509,3],[509,7,509,8],[509,12,509,13],[514,2,514,3],[514,7,514,8],[514,12,514,13],[515,2,515,3],[515,7,515,8],[515,12,515,13],[512,2,512,3],[512,7,512,8],[512,12,512,13],[513,2,513,3],[513,7,513,8],[513,12,513,13],[518,2,518,3],[518,7,518,8],[518,12,518,13],[519,2,519,3],[519,7,519,8],[519,12,519,13],[516,2,516,3],[516,7,516,8],[516,12,516,13],[517,2,517,3],[517,7,517,8],[517,12,517,13],[522,2,522,3],[522,7,522,8],[522,12,522,13],[523,2,523,3],[523,7,523,8],[523,12,523,13],[520,2,520,3],[520,7,520,8],[520,12,520,13],[521,2,521,3],[521,7,521,8],[521,12,521,13],[526,2,526,3],[526,7,526,8],[526,12,526,13],[527,2,527,3],[527,7,527,8],[527,12,527,13],[524,2,524,3],[524,7,524,8],[524,12,524,13],[525,2,525,3],[525,7,525,8],[525,12,525,13],[530,2,530,3],[530,7,530,8],[530,12,530,13],[531,2,531,3],[531,7,531,8],[531,12,531,13],[528,2,528,3],[528,7,528,8],[528,12,528,13],[529,2,529,3],[529,7,529,8],[529,12,529,13],[534,2,534,3],[534,7,534,8],[534,12,534,13],[535,2,535,3],[535,7,535,8],[535,12,535,13],[532,2,532,3],[532,7,532,8],[532,12,532,13],[533,2,533,3],[533,7,533,8],[533,12,533,13],[538,2,538,3],[538,7,538,8],[538,12,538,13],[539,2,539,3],[539,7,539,8],[539,12,539,13],[536,2,536,3],[536,7,536,8],[536,12,536,13],[537,2,537,3],[537,7,537,8],[537,12,537,13],[542,2,543,3],[542,4,542,6],[542,7,542,8],[542,12,542,13],[543,7,543,8],[543,12,543,13],[540,2,540,3],[540,7,540,8],[540,12,540,13],[541,2,541,6],[541,7,541,8],[541,12,541,13],[546,2,546,3],[546,7,546,8],[546,12,546,13],[547,2,547,4],[547,7,547,8],[547,12,547,13],[544,2,544,3],[544,7,544,8],[544,12,544,13],[545,2,545,3],[545,7,545,8],[545,12,545,13],[551,2,551,3],[551,7,551,8],[551,12,551,13],[552,2,552,3],[552,7,552,8],[552,12,552,13],[548,2,549,3],[548,7,548,8],[548,12,548,13],[549,7,549,8],[549,12,549,13],[550,2,550,3],[550,7,550,8],[550,12,550,13],[555,2,555,3],[555,7,555,8],[555,12,555,13],[556,2,556,3],[556,7,556,8],[556,12,556,13],[553,2,553,3],[553,7,553,8],[553,12,553,13],[554,2,554,3],[554,7,554,8],[554,12,554,13],[559,2,559,3],[559,7,559,8],[559,12,559,13],[560,2,560,3],[560,7,560,8],[560,12,560,13],[557,2,557,3],[557,7,557,8],[557,12,557,13],[558,2,558,3],[558,7,558,8],[558,12,558,13],[563,2,563,3],[563,7,563,8],[563,12,563,13],[564,2,564,3],[564,7,564,8],[564,12,564,13],[561,2,561,3],[561,7,561,8],[561,12,561,13],[562,2,562,3],[562,7,562,8],[562,12,562,13],[567,2,567,3],[567,7,567,8],[567,12,567,13],[568,2,568,3],[568,7,568,8],[568,12,568,13],[565,2,565,3],[565,7,565,8],[565,12,565,13],[566,2,566,3],[566,7,566,8],[566,12,566,13],[571,2,571,3],[571,7,571,8],[571,12,571,13],[572,2,572,3],[572,7,572,8],[572,12,572,13],[569,2,569,3],[569,7,569,8],[569,12,569,13],[570,2,570,3],[570,7,570,8],[570,12,570,13],[575,2,575,3],[575,7,575,8],[575,12,575,13],[576,2,576,3],[576,7,576,8],[576,12,576,13],[573,2,573,3],[573,7,573,8],[573,12,573,13],[574,2,574,3],[574,7,574,8],[574,12,574,13],[579,2,579,3],[579,7,579,8],[579,12,579,13],[580,2,580,3],[580,7,580,8],[580,12,580,13],[577,2,577,3],[577,7,577,8],[577,12,577,13],[578,2,578,3],[578,7,578,8],[578,12,578,13],[584,2,584,3],[584,7,584,8],[584,12,584,13],[585,2,585,3],[585,7,585,8],[585,12,585,13],[581,2,581,3],[581,7,581,11],[581,12,581,13],[582,2,582,3],[582,7,583,8],[582,9,582,11],[582,12,582,13],[583,2,583,3],[583,12,583,13],[588,2,588,3],[588,7,589,8],[588,12,589,13],[588,14,588,16],[589,2,589,3],[590,2,590,3],[590,7,590,8],[590,12,590,13],[586,2,586,3],[586,7,586,8],[586,12,586,13],[587,2,587,3],[587,7,587,9],[587,12,587,16],[593,2,593,3],[593,7,593,8],[593,12,593,14],[594,2,594,3],[594,7,594,8],[594,12,595,13],[595,2,595,3],[595,7,595,8],[591,2,591,3],[591,7,591,8],[591,12,591,13],[592,2,592,3],[592,7,592,8],[592,12,592,13],[598,2,598,3],[598,7,598,8],[598,12,598,13],[599,2,599,3],[599,7,599,8],[599,12,599,13],[596,2,596,3],[596,7,596,8],[596,12,596,13],[597,2,597,3],[597,7,597,8],[597,12,597,13],[602,2,602,3],[602,7,602,8],[602,12,602,13],[603,2,603,3],[603,7,603,8],[603,12,603,13],[600,2,600,3],[600,7,600,8],[600,12,600,13],[601,2,601,3],[601,7,601,8],[601,12,601,13],[606,2,606,3],[606,7,606,8],[606,12,606,13],[607,2,607,3],[607,7,607,8],[607,12,607,13],[604,2,604,3],[604,7,604,8],[604,12,604,13],[605,2,605,3],[605,7,605,8],[605,12,605,13],[610,2,610,3],[610,7,610,8],[610,12,610,13],[611,2,611,3],[611,7,611,8],[611,12,611,13],[608,2,608,3],[608,7,608,8],[608,12,608,13],[609,2,609,3],[609,7,609,8],[609,12,609,13],[614,2,614,3],[614,7,614,8],[614,12,614,13],[615,2,615,3],[615,7,615,8],[615,12,615,13],[612,2,612,3],[612,7,612,8],[612,12,612,13],[613,2,613,3],[613,7,613,8],[613,12,613,13],[618,2,618,4],[618,7,618,8],[618,12,618,13],[619,2,619,3],[619,7,619,8],[619,12,619,13],[616,2,616,3],[616,7,616,8],[616,12,616,13],[617,2,617,3],[617,7,617,8],[617,12,617,13],[622,2,622,3],[622,7,622,8],[622,12,622,13],[623,2,623,3],[623,7,623,8],[623,12,623,13],[620,2,620,3],[620,7,620,8],[620,12,620,13],[621,2,621,3],[621,7,621,8],[621,12,621,13],[626,2,626,3],[626,7,626,8],[626,12,626,13],[627,2,627,3],[627,7,627,8],[627,12,627,13],[624,2,624,3],[624,7,624,8],[624,12,624,13],[625,2,625,3],[625,7,625,8],[625,12,625,13],[630,2,630,3],[630,7,630,8],[630,12,630,13],[631,2,631,3],[631,7,631,8],[631,12,631,13],[628,2,628,3],[628,7,628,8],[628,12,628,13],[629,2,629,3],[629,7,629,8],[629,12,629,13],[634,2,634,3],[634,7,634,8],[634,12,634,13],[635,2,635,3],[635,7,635,8],[635,12,635,13],[632,2,632,3],[632,7,632,8],[632,12,632,13],[633,2,633,3],[633,7,633,8],[633,12,633,13],[638,2,638,3],[638,7,638,8],[638,12,638,13],[639,2,639,3],[639,7,639,8],[639,12,639,13],[636,2,636,3],[636,7,636,8],[636,12,636,13],[637,2,637,3],[637,7,637,8],[637,12,637,13],[642,2,642,3],[642,7,642,8],[642,12,642,13],[643,2,643,3],[643,7,643,8],[643,12,643,13],[640,2,640,3],[640,7,640,8],[640,12,640,13],[641,2,641,3],[641,7,641,8],[641,12,641,13],[646,2,646,3],[646,7,646,8],[646,12,646,13],[647,2,647,3],[647,7,647,8],[647,12,647,13],[644,2,644,3],[644,7,644,8],[644,12,644,13],[645,2,645,3],[645,7,645,8],[645,12,645,13],[650,2,650,3],[650,7,650,8],[650,12,650,13],[651,2,651,3],[651,7,651,8],[651,12,651,13],[648,2,648,3],[648,7,648,8],[648,12,648,13],[649,2,649,3],[649,7,649,8],[649,12,649,13],[654,2,654,3],[654,7,654,8],[654,12,654,13],[655,2,655,3],[655,7,655,8],[655,12,655,13],[652,2,652,3],[652,7,652,8],[652,12,652,13],[653,2,653,3],[653,7,653,8],[653,12,653,13],[658,2,658,3],[658,7,658,8],[658,12,658,13],[659,2,659,3],[659,7,659,8],[659,12,659,13],[656,2,656,3],[656,7,656,8],[656,12,656,13],[657,2,657,3],[657,7,657,8],[657,12,657,13],[662,2,662,3],[662,7,662,8],[662,12,662,13],[663,2,663,3],[663,7,663,8],[663,12,663,13],[660,2,660,3],[660,7,660,8],[660,12,660,13],[661,2,661,3],[661,7,661,8],[661,12,661,13],[666,2,666,3],[666,7,666,8],[666,12,666,13],[667,2,667,3],[667,7,667,8],[667,12,667,13],[664,2,664,3],[664,7,664,8],[664,12,664,13],[665,2,665,3],[665,7,665,8],[665,12,665,13],[670,2,670,3],[670,7,670,8],[670,12,670,13],[671,2,671,3],[671,7,671,8],[671,12,671,13],[668,2,668,3],[668,7,668,8],[668,12,668,13],[669,2,669,3],[669,7,669,8],[669,12,669,13],[674,2,674,3],[674,7,674,8],[674,12,674,13],[675,2,675,3],[675,7,675,8],[675,12,675,13],[672,2,672,3],[672,7,672,8],[672,12,672,13],[673,2,673,3],[673,7,673,8],[673,12,673,13],[678,2,678,3],[678,7,678,9],[678,12,678,13],[679,2,679,3],[679,7,679,8],[679,12,679,13],[676,2,676,3],[676,7,676,8],[676,12,676,13],[677,2,677,3],[677,7,677,8],[677,12,677,13],[693,12,693,13],[682,2,682,3],[682,7,682,8],[682,12,682,13],[683,2,683,3],[683,7,683,8],[683,12,683,13],[680,2,680,3],[680,7,680,8],[680,12,680,13],[681,2,681,3],[681,7,681,8],[681,12,681,13],[686,2,686,3],[686,7,686,8],[686,12,686,13],[687,2,687,3],[687,7,687,8],[687,12,687,14],[684,2,684,3],[684,7,684,8],[684,12,684,13],[685,2,685,3],[685,7,685,8],[685,12,685,13],[698,2,698,3],[698,7,698,8],[698,12,698,13],[696,2,696,3],[696,7,696,8],[696,12,696,13],[697,2,697,3],[697,7,697,8],[697,12,697,13],[690,2,690,3],[690,7,690,8],[690,12,690,13],[691,2,691,3],[691,7,691,8],[691,12,691,13],[688,2,688,3]],"merged_total":1016,"flags":["merged_cut"]}
[]
[{"$f":"A1026","v":"Trinidad and Tobago"}]
[{"$f":"A1034","v":"2011"}]
["Use of drinking water sources"]
[" by wealth quintile and sub-national region"]
["Notes:"]
["WHO/UNICEF JMP customised wealth index excludes water,"]
[" sanitation and hygiene assets."]
["Survey used for analysis:",{"$f":"A1025","v":"MICS11"}]
[{"$f":"B1028","v":""}]
[{"$f":"B1027","v":""}]
[]
[]
["Use of drinking water sources",null,"NATIONAL wealth index quintile",null,null,null,null,"URBAN wealth index quintile",null,null,null,null,"RURAL wealth index quintile",null,null,null,null,"SUB-REGIONS:",null,null,null,null,null,null,null,null,null,null,null,null,null,null,null,null,null,null,null,null,null,null,null,null,null,null,null,null,null,null,null,null,null,null,"Raw numbers of respondents:","Use of drinking water sources","NATIONAL wealth index quintile",null,null,null,null,"URBAN wealth index quintile",null,null,null,null,"RURAL wealth index quintile",null,null,null,null,"SUB-REGIONS:"]
["Weighted percentage (used in graphs)",null,"Poorest","Poor","Middle","Rich","Richest","Poorest","Poor","Middle","Rich","Richest","Poorest","Poor","Middle","Rich","Richest","Central","East","North West","South West","Tobago",null,null,null,null,null,null,null,null,null,null,null,null,null,null,null,null,null,null,null,null,null,null,null,null,null,null,null,null,null,null,"Water data, raw numbers (weighted)",null,"Poorest","Poor","Middle","Rich","Richest","Poorest","Poor","Middle","Rich","Richest","Poorest","Poor","Middle","Rich","Richest","Central","East","North West","South West","Tobago"]
["Water","Improved",98.417915886955811,99.602948479888738,99.223671222914973,99.782170921356538,99.817578593513971,99.106364817350951,98.839702344436347,99.758815167412749,100,99.681577732755613,97.490658605398721,100,99.155681311186356,99.730828370425726,99.73589636159619,99.764615490758075,99.689743827159887,98.246194626446581,99.717837302713804,99.253269467725673,null,null,null,null,null,null,null,null,null,null,null,null,null,null,null,null,null,null,null,null,null,null,null,null,null,null,null,null,null,null,"Water","Improved","N/A","N/A","N/A","N/A","N/A","N/A","N/A","N/A","N/A","N/A","N/A","N/A","N/A","N/A","N/A","N/A","N/A","N/A","N/A","N/A"]
[null,"Not Improved",1.5820841130442007,0.39705152011126621,0.77632877708503678,0.21782907864345172,0.18242140648603258,0.89363518264906883,1.1602976555636804,0.24118483258726192,0,0.31842226724436884,2.5093413946012575,0,0.84431868881362049,0.26917162957427931,0.2641036384038164,0.23538450924192983,0.31025617284011309,1.753805373553347,0.2821626972862335,0.7467305322743274,null,null,null,null,null,null,null,null,null,null,null,null,null,null,null,null,null,null,null,null,null,null,null,null,null,null,null,null,null,null,null,"Not Improved","N/A","N/A","N/A","N/A","N/A","N/A","N/A","N/A","N/A","N/A","N/A","N/A","N/A","N/A","N/A","N/A","N/A","N/A","N/A","N/A"]
["Water ladder","Basic",97.74643859619583,99.569636955080298,99.177432503951124,99.594990517954656,99.751893378917629,98.063693498373752,98.774936361569516,99.757477295544334,99.897052806390533,99.681577732755613,97.330270830222958,100,99.152774813908295,99.464096084450475,99.458522558506971,99.72371902731922,99.687328099502636,97.659445398741966,99.710646358103105,98.443229194581974,null,null,null,null,null,null,null,null,null,null,null,null,null,null,null,null,null,null,null,null,null,null,null,null,null,null,null,null,null,null,"Water ladder","Basic","N/A","N/A","N/A","N/A","N/A","N/A","N/A","N/A","N/A","N/A","N/A","N/A","N/A","N/A","N/A","N/A","N/A","N/A","N/A","N/A"]
[null,"Limited",0.56952385719921772,2.9593624676704598E-2,3.8822318843987721E-2,0.18614086780938963,6.5685214596350835E-2,0.97971480858566695,5.1703670633336821E-2,0,0.10294719360947779,0,2.3808764466076257E-2,0,0,0.26529341394059441,0.27737380308921933,3.9022912110197205E-2,0,0.53716340736234869,0,0.80751150550137629,null,null,null,null,null,null,null,null,null,null,null,null,null,null,null,null,null,null,null,null,null,null,null,null,null,null,null,null,null,null,null,"Limited","N/A","N/A","N/A","N/A","N/A","N/A","N/A","N/A","N/A","N/A","N/A","N/A","N/A","N/A","N/A","N/A","N/A","N/A","N/A","N/A"]
[null,"Unimproved",1.4040234644329357,0.32678535855124713,0.75188719773934876,0.21886861423594137,9.1151244506442033E-2,0.9565916930405961,1.0441007912138076,0.18716999119714245,0,0.15910734653890199,1.9948437302130255,0,0.84722518609168451,0.27061050160892824,0.2641036384038164,0.10506168645053095,0.24684623723477198,1.6424875431082422,0.28935364189690044,0.74925929991665385,null,null,null,null,null,null,null,null,null,null,null,null,null,null,null,null,null,null,null,null,null,null,null,null,null,null,null,null,null,null,null,"Unimproved","N/A","N/A","N/A","N/A","N/A","N/A","N/A","N/A","N/A","N/A","N/A","N/A","N/A","N/A","N/A","N/A","N/A","N/A","N/A","N/A"]
[null,"Surface water",0.28001408217187912,7.3984061691761499E-2,3.185797946553881E-2,0,9.1270161979590564E-2,0,0.12925917658334207,5.5352713258525033E-2,0,0.15931492070546685,0.65107667509796807,0,0,0,0,0.13219637412005572,6.582566326260586E-2,0.16090365078744542,0,0,null,null,null,null,null,null,null,null,null,null,null,null,null,null,null,null,null,null,null,null,null,null,null,null,null,null,null,null,null,null,null,"Surface water","N/A","N/A","N/A","N/A","N/A","N/A","N/A","N/A","N/A","N/A","N/A","N/A","N/A","N/A","N/A","N/A","N/A","N/A","N/A","N/A"]
["Improved water point at more than 30 minutes","Yes",0.57927913533795738,2.9712704108699545E-2,3.912899041928785E-2,0.18654916538253111,6.5805257472574055E-2,0.98917719546695571,5.2317543747808358E-2,0,0.10294719360947779,0,2.4455846704317365E-2,0,0,0.26601327379515788,0.27810829722088259,3.911571730244727E-2,0,0.54702847062978865,0,0.81360753562688337,null,null,null,null,null,null,null,null,null,null,null,null,null,null,null,null,null,null,null,null,null,null,null,null,null,null,null,null,null,null,"Improved water point at more than 30 minutes","Yes","N/A","N/A","N/A","N/A","N/A","N/A","N/A","N/A","N/A","N/A","N/A","N/A","N/A","N/A","N/A","N/A","N/A","N/A","N/A","N/A"]
[null,"No",99.42072086466203,99.970287295891296,99.960871009580714,99.813450834617484,99.934194742527424,99.010822804533063,99.947682456252195,100,99.897052806390533,100,99.975544153295687,100,100,99.733986726204833,99.721891702779104,99.960884282697549,100,99.452971529370217,100,99.186392464373114,null,null,null,null,null,null,null,null,null,null,null,null,null,null,null,null,null,null,null,null,null,null,null,null,null,null,null,null,null,null,null,"No","N/A","N/A","N/A","N/A","N/A","N/A","N/A","N/A","N/A","N/A","N/A","N/A","N/A","N/A","N/A","N/A","N/A","N/A","N/A","N/A"]
["Manually calculated ratios","Improved wells"]
[null,"Improved springs"]
[null,"Other"]
[null,null,"NATIONAL wealth index quintile",null,null,null,null,"URBAN wealth index quintile",null,null,null,null,"RURAL wealth index quintile",null,null,null,null,"SUB-REGIONS:",null,null,null,null,null,null,null,null,null,null,null,null,null,null,null,null,null,null,null,null,null,null,null,null,null,null,null,null,null,null,null,null,null,null,"Raw numbers of respondents:","Use of drinking water sources","NATIONAL wealth index quintile",null,null,null,null,"URBAN wealth index quintile",null,null,null,null,"RURAL wealth index quintile",null,null,null,null,"SUB-REGIONS:"]
["Percentage based on weighted population",null,"Poorest","Poor","Middle","Rich","Richest","Poorest","Poor","Middle","Rich","Richest","Poorest","Poor","Middle","Rich","Richest","Central","East","North West","South West","Tobago",null,null,null,null,null,null,null,null,null,null,null,null,null,null,null,null,null,null,null,null,null,null,null,null,null,null,null,null,null,null,"Water data, raw numbers (weighted)",null,"Poorest","Poor","Middle","Rich","Richest","Poorest","Poor","Middle","Rich","Richest","Poorest","Poor","Middle","Rich","Richest","Central","East","North West","South West","Tobago"]
["Piped water","Yes",83.507590656463705,92.070267048457794,93.520286120997511,95.935475589760628,98.123009880784025,93.721422376421131,94.870079253768864,98.344651842662174,97.828737662729381,98.86749316777626,72.068241052653619,87.015734178261312,89.582764632999456,91.476020850411061,95.457419511418834,98.319039099858784,72.492992877087943,90.385123235094341,92.397100964974527,91.217120946757447,null,null,null,null,null,null,null,null,null,null,null,null,null,null,null,null,null,null,null,null,null,null,null,null,null,null,null,null,null,null,"Piped water","Yes","N/A","N/A","N/A","N/A","N/A","N/A","N/A","N/A","N/A","N/A","N/A","N/A","N/A","N/A","N/A","N/A","N/A","N/A","N/A","N/A"]
[null,"No",16.492409343535776,7.9297329515421593,6.4797138790024453,4.0645244102393914,1.8769901192159735,6.2785776235788768,5.1299207462311847,1.6553481573378517,2.171262337270651,1.1325068322237406,27.931758947346442,12.98426582173861,10.41723536700052,8.5239791495888273,4.5425804885811552,1.6809609001412125,27.507007122912448,9.6148767649055493,7.6028990350254011,8.7828790532424588,null,null,null,null,null,null,null,null,null,null,null,null,null,null,null,null,null,null,null,null,null,null,null,null,null,null,null,null,null,null,null,"No","N/A","N/A","N/A","N/A","N/A","N/A","N/A","N/A","N/A","N/A","N/A","N/A","N/A","N/A","N/A","N/A","N/A","N/A","N/A","N/A"]
["Piped water on premises","Yes",72.210877905979657,89.9395341940333,91.59741522557438,94.922768861072413,98.123009880784025,82.055480326986867,92.599694001303433,96.469812214731789,96.892942104467181,98.86749316777626,61.423227185753291,84.229637551359843,88.991730290288757,89.884905412415776,95.228267784195879,96.648003551323768,70.224372466013079,84.733766812311742,88.248584185912691,90.441454227330482,null,null,null,null,null,null,null,null,null,null,null,null,null,null,null,null,null,null,null,null,null,null,null,null,null,null,null,null,null,null,"Piped water on premises","Yes","N/A","N/A","N/A","N/A","N/A","N/A","N/A","N/A","N/A","N/A","N/A","N/A","N/A","N/A","N/A","N/A","N/A","N/A","N/A","N/A"]
[null,"No",27.789122094019508,10.060465805966711,8.4025847744255362,5.0772311389275746,1.8769901192159735,17.944519673013144,7.4003059986965987,3.5301877852682546,3.1070578955328334,1.1325068322237406,38.576772814246759,15.770362448640087,11.008269709711223,10.115094587584132,4.7717322158041124,3.3519964486761684,29.775627533987276,15.266233187688192,11.751415814087135,9.5585457726693814,null,null,null,null,null,null,null,null,null,null,null,null,null,null,null,null,null,null,null,null,null,null,null,null,null,null,null,null,null,null,null,"No","N/A","N/A","N/A","N/A","N/A","N/A","N/A","N/A","N/A","N/A","N/A","N/A","N/A","N/A","N/A","N/A","N/A","N/A","N/A","N/A"]
["Piped water into dwelling","Yes","N/A","N/A","N/A","N/A","N/A","N/A","N/A","N/A","N/A","N/A","N/A","N/A","N/A","N/A","N/A","N/A","N/A","N/A","N/A","N/A",null,null,null,null,null,null,null,null,null,null,null,null,null,null,null,null,null,null,null,null,null,null,null,null,null,null,null,null,null,null,"Piped water into dwelling","Yes","N/A","N/A","N/A","N/A","N/A","N/A","N/A","N/A","N/A","N/A","N/A","N/A","N/A","N/A","N/A","N/A","N/A","N/A","N/A","N/A"]
[null,"No","N/A","N/A","N/A","N/A","N/A","N/A","N/A","N/A","N/A","N/A","N/A","N/A","N/A","N/A","N/A","N/A","N/A","N/A","N/A","N/A",null,null,null,null,null,null,null,null,null,null,null,null,null,null,null,null,null,null,null,null,null,null,null,null,null,null,null,null,null,null,null,"No","N/A","N/A","N/A","N/A","N/A","N/A","N/A","N/A","N/A","N/A","N/A","N/A","N/A","N/A","N/A","N/A","N/A","N/A","N/A","N/A"]
["Water source on premises","Yes",87.504239336714306,97.726949640221548,97.601681192034746,98.252915130396616,99.449818679464002,88.007170390290483,97.039385604052654,98.148518152284339,98.409715496969966,99.431759476646775,87.026179630188778,97.566471557647091,98.595144645473667,97.668720345290197,99.008325311379281,98.475687347475642,97.285644289136414,92.36267434341454,95.721775038670074,95.793247220029215,null,null,null,null,null,null,null,null,null,null,null,null,null,null,null,null,null,null,null,null,null,null,null,null,null,null,null,null,null,null,"Water source on premises","Yes","N/A","N/A","N/A","N/A","N/A","N/A","N/A","N/A","N/A","N/A","N/A","N/A","N/A","N/A","N/A","N/A","N/A","N/A","N/A","N/A"]
[null,"No",12.495760663285244,2.2730503597784737,2.3983188079652566,1.7470848696033541,0.550181320536001,11.992829609709545,2.9606143959473492,1.8514818477156827,1.5902845030300667,0.5682405233532215,12.973820369811161,2.4335284423528827,1.4048553545263114,2.3312796547097907,0.99167468862068364,1.5243126525243833,2.7143557108636527,7.6373256565853573,4.2782249613299053,4.2067527799707527,null,null,null,null,null,null,null,null,null,null,null,null,null,null,null,null,null,null,null,null,null,null,null,null,null,null,null,null,null,null,null,"No","N/A","N/A","N/A","N/A","N/A","N/A","N/A","N/A","N/A","N/A","N/A","N/A","N/A","N/A","N/A","N/A","N/A","N/A","N/A","N/A"]
["Improved Water source on premises","Yes",88.341703778950404,97.791478390123345,97.80275808291843,98.467405773156401,99.540131024517365,88.625196167143187,97.133951117821312,98.200202841681914,98.409715496969966,99.589559890483287,88.157910517557227,97.566471557647091,99.000092877117339,97.932326384098261,99.270502319867802,98.534777669751534,97.490137826123856,93.000537651579378,95.992630433898341,96.513946325141916,null,null,null,null,null,null,null,null,null,null,null,null,null,null,null,null,null,null,null,null,null,null,null,null,null,null,null,null,null,null,"Improved water source on premises","Yes","N/A","N/A","N/A","N/A","N/A","N/A","N/A","N/A","N/A","N/A","N/A","N/A","N/A","N/A","N/A","N/A","N/A","N/A","N/A","N/A"]
[null,"No",11.658296221049094,2.2085216098766756,2.197241917081584,1.5325942268435784,0.45986897548262723,11.374803832856827,2.8660488821786632,1.7997971583181029,1.5902845030300667,0.410440109516723,11.842089482442722,2.4335284423528827,0.99990712288265637,2.0676736159017115,0.72949768013216765,1.4652223302484897,2.5098621738762263,6.9994623484206073,4.0073695661016107,3.4860536748580619,null,null,null,null,null,null,null,null,null,null,null,null,null,null,null,null,null,null,null,null,null,null,null,null,null,null,null,null,null,null,null,"No","N/A","N/A","N/A","N/A","N/A","N/A","N/A","N/A","N/A","N/A","N/A","N/A","N/A","N/A","N/A","N/A","N/A","N/A","N/A","N/A"]
["Piped water on premises available when needed","Yes","N/A","N/A","N/A","N/A","N/A","N/A","N/A","N/A","N/A","N/A","N/A","N/A","N/A","N/A","N/A","N/A","N/A","N/A","N/A","N/A",null,null,null,null,null,null,null,null,null,null,null,null,null,null,null,null,null,null,null,null,null,null,null,null,null,null,null,null,null,null,"Piped water on premises available when needed","Yes","N/A","N/A","N/A","N/A","N/A","N/A","N/A","N/A","N/A","N/A","N/A","N/A","N/A","N/A","N/A","N/A","N/A","N/A","N/A","N/A"]
[null,"No","N/A","N/A","N/A","N/A","N/A","N/A","N/A","N/A","N/A","N/A","N/A","N/A","N/A","N/A","N/A","N/A","N/A","N/A","N/A","N/A",null,null,null,null,null,null,null,null,null,null,null,null,null,null,null,null,null,null,null,null,null,null,null,null,null,null,null,null,null,null,null,"No","N/A","N/A","N/A","N/A","N/A","N/A","N/A","N/A","N/A","N/A","N/A","N/A","N/A","N/A","N/A","N/A","N/A","N/A","N/A","N/A"]
["Water point at more than 30 minutes","Yes",0.65534593160625065,2.9593624676704598E-2,7.1373508152737825E-2,0.29961530017293503,6.5745142111588079E-2,0.97971480858566695,5.1703670633336821E-2,5.6336305313356039E-2,0.10294719360947779,0,0.22307732908617445,0,0,0.26595278369129521,0.54147744149303578,3.9022912110197205E-2,0.21393340560346905,0.53858549101254249,0,1.510061112724699,null,null,null,null,null,null,null,null,null,null,null,null,null,null,null,null,null,null,null,null,null,null,null,null,null,null,null,null,null,null,"Water point at more than 30 minutes","Yes","N/A","N/A","N/A","N/A","N/A","N/A","N/A","N/A","N/A","N/A","N/A","N/A","N/A","N/A","N/A","N/A","N/A","N/A","N/A","N/A"]
[null,"No",99.344654068393695,99.970406375323293,99.928626491847268,99.700384699827055,99.934254857888419,99.020285191414331,99.948296329366656,99.943663694686649,99.897052806390533,100,99.77692267091382,100,100,99.73404721630871,99.458522558506971,99.960977087889802,99.786066594396544,99.461414508987474,100,98.489938887275315,null,null,null,null,null,null,null,null,null,null,null,null,null,null,null,null,null,null,null,null,null,null,null,null,null,null,null,null,null,null,null,"No","N/A","N/A","N/A","N/A","N/A","N/A","N/A","N/A","N/A","N/A","N/A","N/A","N/A","N/A","N/A","N/A","N/A","N/A","N/A","N/A"]
["Water source available when needed","Yes","N/A","N/A","N/A","N/A","N/A","N/A","N/A","N/A","N/A","N/A","N/A","N/A","N/A","N/A","N/A","N/A","N/A","N/A","N/A","N/A",null,null,null,null,null,null,null,null,null,null,null,null,null,null,null,null,null,null,null,null,null,null,null,null,null,null,null,null,null,null,"Water source available when needed","Yes","N/A","N/A","N/A","N/A","N/A","N/A","N/A","N/A","N/A","N/A","N/A","N/A","N/A","N/A","N/A","N/A","N/A","N/A","N/A","N/A"]
[null,"No","N/A","N/A","N/A","N/A","N/A","N/A","N/A","N/A","N/A","N/A","N/A","N/A","N/A","N/A","N/A","N/A","N/A","N/A","N/A","N/A",null,null,null,null,null,null,null,null,null,null,null,null,null,null,null,null,null,null,null,null,null,null,null,null,null,null,null,null,null,null,null,"No","N/A","N/A","N/A","N/A","N/A","N/A","N/A","N/A","N/A","N/A","N/A","N/A","N/A","N/A","N/A","N/A","N/A","N/A","N/A","N/A"]
["Improved water source available when needed","Yes","N/A","N/A","N/A","N/A","N/A","N/A","N/A","N/A","N/A","N/A","N/A","N/A","N/A","N/A","N/A","N/A","N/A","N/A","N/A","N/A",null,null,null,null,null,null,null,null,null,null,null,null,null,null,null,null,null,null,null,null,null,null,null,null,null,null,null,null,null,null,"Improved water source available when needed","Yes","N/A","N/A","N/A","N/A","N/A","N/A","N/A","N/A","N/A","N/A","N/A","N/A","N/A","N/A","N/A","N/A","N/A","N/A","N/A","N/A"]
[null,"No","N/A","N/A","N/A","N/A","N/A","N/A","N/A","N/A","N/A","N/A","N/A","N/A","N/A","N/A","N/A","N/A","N/A","N/A","N/A","N/A",null,null,null,null,null,null,null,null,null,null,null,null,null,null,null,null,null,null,null,null,null,null,null,null,null,null,null,null,null,null,null,"No","N/A","N/A","N/A","N/A","N/A","N/A","N/A","N/A","N/A","N/A","N/A","N/A","N/A","N/A","N/A","N/A","N/A","N/A","N/A","N/A"]
["Microbiological quality at point of collection","Not contaminated (No E. coli in 100 mL)","N/A","N/A","N/A","N/A","N/A","N/A","N/A","N/A","N/A","N/A","N/A","N/A","N/A","N/A","N/A","N/A","N/A","N/A","N/A","N/A",null,null,null,null,null,null,null,null,null,null,null,null,null,null,null,null,null,null,null,null,null,null,null,null,null,null,null,null,null,null,"Microbiological quality at point of collection","Not contaminated (No E. coli in 100 mL)","N/A","N/A","N/A","N/A","N/A","N/A","N/A","N/A","N/A","N/A","N/A","N/A","N/A","N/A","N/A","N/A","N/A","N/A","N/A","N/A"]
[null,"Contaminated (E. coli detected in 100 mL)","N/A","N/A","N/A","N/A","N/A","N/A","N/A","N/A","N/A","N/A","N/A","N/A","N/A","N/A","N/A","N/A","N/A","N/A","N/A","N/A",null,null,null,null,null,null,null,null,null,null,null,null,null,null,null,null,null,null,null,null,null,null,null,null,null,null,null,null,null,null,null,"Contaminated (E. coli detected in 100 mL)","N/A","N/A","N/A","N/A","N/A","N/A","N/A","N/A","N/A","N/A","N/A","N/A","N/A","N/A","N/A","N/A","N/A","N/A","N/A","N/A"]
[null,"Highly contaminated (>100 CFU/100 mL)","N/A","N/A","N/A","N/A","N/A","N/A","N/A","N/A","N/A","N/A","N/A","N/A","N/A","N/A","N/A","N/A","N/A","N/A","N/A","N/A",null,null,null,null,null,null,null,null,null,null,null,null,null,null,null,null,null,null,null,null,null,null,null,null,null,null,null,null,null,null,null,"Highly contaminated (>100 CFU/100 mL)","N/A","N/A","N/A","N/A","N/A","N/A","N/A","N/A","N/A","N/A","N/A","N/A","N/A","N/A","N/A","N/A","N/A","N/A","N/A","N/A"]
["Microbiological quality of improved water sources at point of collection","Not contaminated (No E. coli in 100 mL)","N/A","N/A","N/A","N/A","N/A","N/A","N/A","N/A","N/A","N/A","N/A","N/A","N/A","N/A","N/A","N/A","N/A","N/A","N/A","N/A",null,null,null,null,null,null,null,null,null,null,null,null,null,null,null,null,null,null,null,null,null,null,null,null,null,null,null,null,null,null,"Microbiological quality of improved water sources at point of collection","Not contaminated (No E. coli in 100 mL)","N/A","N/A","N/A","N/A","N/A","N/A","N/A","N/A","N/A","N/A","N/A","N/A","N/A","N/A","N/A","N/A","N/A","N/A","N/A","N/A"]
[null,"Contaminated (E. coli detected in 100 mL)","N/A","N/A","N/A","N/A","N/A","N/A","N/A","N/A","N/A","N/A","N/A","N/A","N/A","N/A","N/A","N/A","N/A","N/A","N/A","N/A",null,null,null,null,null,null,null,null,null,null,null,null,null,null,null,null,null,null,null,null,null,null,null,null,null,null,null,null,null,null,null,"Contaminated (E. coli detected in 100 mL)","N/A","N/A","N/A","N/A","N/A","N/A","N/A","N/A","N/A","N/A","N/A","N/A","N/A","N/A","N/A","N/A","N/A","N/A","N/A","N/A"]
[null,"Highly contaminated (>100 CFU/100 mL)","N/A","N/A","N/A","N/A","N/A","N/A","N/A","N/A","N/A","N/A","N/A","N/A","N/A","N/A","N/A","N/A","N/A","N/A","N/A","N/A",null,null,null,null,null,null,null,null,null,null,null,null,null,null,null,null,null,null,null,null,null,null,null,null,null,null,null,null,null,null,null,"Highly contaminated (>100 CFU/100 mL)","N/A","N/A","N/A","N/A","N/A","N/A","N/A","N/A","N/A","N/A","N/A","N/A","N/A","N/A","N/A","N/A","N/A","N/A","N/A","N/A"]
["Microbiological quality of piped on premises at point of collection","Not contaminated (No E. coli in 100 mL)","N/A","N/A","N/A","N/A","N/A","N/A","N/A","N/A","N/A","N/A","N/A","N/A","N/A","N/A","N/A","N/A","N/A","N/A","N/A","N/A",null,null,null,null,null,null,null,null,null,null,null,null,null,null,null,null,null,null,null,null,null,null,null,null,null,null,null,null,null,null,"Microbiological quality of piped on premises at point of collection","Not contaminated (No E. coli in 100 mL)","N/A","N/A","N/A","N/A","N/A","N/A","N/A","N/A","N/A","N/A","N/A","N/A","N/A","N/A","N/A","N/A","N/A","N/A","N/A","N/A"]
[null,"Contaminated (E. coli detected in 100 mL)","N/A","N/A","N/A","N/A","N/A","N/A","N/A","N/A","N/A","N/A","N/A","N/A","N/A","N/A","N/A","N/A","N/A","N/A","N/A","N/A",null,null,null,null,null,null,null,null,null,null,null,null,null,null,null,null,null,null,null,null,null,null,null,null,null,null,null,null,null,null,null,"Contaminated (E. coli detected in 100 mL)","N/A","N/A","N/A","N/A","N/A","N/A","N/A","N/A","N/A","N/A","N/A","N/A","N/A","N/A","N/A","N/A","N/A","N/A","N/A","N/A"]
[null,"Highly contaminated (>100 CFU/100 mL)","N/A","N/A","N/A","N/A","N/A","N/A","N/A","N/A","N/A","N/A","N/A","N/A","N/A","N/A","N/A","N/A","N/A","N/A","N/A","N/A",null,null,null,null,null,null,null,null,null,null,null,null,null,null,null,null,null,null,null,null,null,null,null,null,null,null,null,null,null,null,null,"Highly contaminated (>100 CFU/100 mL)","N/A","N/A","N/A","N/A","N/A","N/A","N/A","N/A","N/A","N/A","N/A","N/A","N/A","N/A","N/A","N/A","N/A","N/A","N/A","N/A"]
[null,null,"NATIONAL wealth index quintile",null,null,null,null,"URBAN wealth index quintile",null,null,null,null,"RURAL wealth index quintile",null,null,null,null,"SUB-REGIONS:",null,null,null,null,null,null,null,null,null,null,null,null,null,null,null,null,null,null,null,null,null,null,null,null,null,null,null,null,null,null,null,null,null,null,"Raw numbers of respondents:","Use of drinking water sources","NATIONAL wealth index quintile",null,null,null,null,"URBAN wealth index quintile",null,null,null,null,"RURAL wealth index quintile",null,null,null,null,"SUB-REGIONS:"]
["Percentage based on weighted population",null,"Poorest","Poor","Middle","Rich","Richest","Poorest","Poor","Middle","Rich","Richest","Poorest","Poor","Middle","Rich","Richest","Central","East","North West","South West","Tobago",null,null,null,null,null,null,null,null,null,null,null,null,null,null,null,null,null,null,null,null,null,null,null,null,null,null,null,null,null,null,"Water data, raw numbers (weighted)",null,"Poorest","Poor","Middle","Rich","Richest","Poorest","Poor","Middle","Rich","Richest","Poorest","Poor","Middle","Rich","Richest","Central","East","North West","South West","Tobago"]
["Main source of drinking water","Piped into dwelling",61.824692262633022,81.277250536238412,79.515628855021163,80.364872954724504,77.000869760810716,72.082265141737395,84.000460413421266,83.257738086300762,80.644414699520297,75.675796729094102,50.724343830841534,74.848732469816198,77.631543256123763,78.91053342013079,76.754509279501136,79.673566016849207,62.977907989994094,73.029595234254728,76.876889560969587,77.051392699401859]
[null,"Piped into compound, yard or plot",7.2871140212014129,2.432119476590108,0.99982518801019715,1.5514451867066923,0.5270613794736525,6.7938967793727949,0.65574167914583281,0.56226947381439607,1.7689363026139013,0,7.4494586454386909,4.2661027128346793,2.7967413372635481,1.5401505133783591,0.79611369908654905,1.0790159605524643,2.6032688081841346,2.754257265313067,4.8250634030595734,0.49500342660518609]
[null,"Piped to neighbour",5.7778429938008911,0.92769057316998504,0.94627697057100435,0.47495873088914842,0,6.1216722748732781,1.1132399768156833,0.55164809060184539,0.82640652474312981,0,5.1328184094675411,1.4617886654869012,0.3430607736618127,0.53171330236411518,0,0.789668146216436,0.73994930845777351,2.5248475200588505,2.4851750831700792,0.33750233632171783]
[null,"Public tap / standpipe",5.4823341612267553,1.20304228125456,0.70155202488651425,0.5377479977990357,0,5.4806284586402843,0.95263293684027095,1.3231915373285581,0.10938903351905267,0,5.5121954574327718,1.3243079614145776,0.24797356904888995,0.68898563005121594,0.2291517272229566,0.77966918373490524,1.5286711026170758,3.0266244302545564,1.6633416958916414,0.43816438310520223]
[null,"Protected spring",0.80008892801223508,0.49024688800345773,0.71211956610875882,0.52895327350459176,4.4858195334093257E-2,0.43103117140243463,1.4120647393253283,0.26580011489407818,0.65651099147151837,0,1.2520187801145664,0.19097489934530759,0.52488475361128395,0.24818771058885206,0.10534048255422879,0.24574300652327508,6.5317089018971181E-2,1.6200302918126759,0,0.86897153259844584]
[null,"Unprotected spring",1.126894319488754,0.32375380158546746,0.46070709886346189,0.21782907864345172,0,0.74041404811104028,0.83726112039873535,5.6025527160779298E-2,0,0,1.6473700361085037,0,0.61561150637241213,0.26917162957427931,0.2641036384038164,0.10423204777875333,0.24493908382114191,1.2858175168932449,0.13028032984407778,0.7467305322743274]
[null,"Rainwater collection",12.575946842685351,6.2880463032491365,4.1736144928302217,2.6306800549782277,1.0297764731368635,4.275946258217016,2.5064302666398111,0.48478676518315866,1.0553174050191116,0.40495138816505194,22.096923258812584,11.371921260057103,7.6302895815635514,6.6753135096707581,3.1080784687983245,1.0411576845424697,25.596270200636706,5.0149354201390013,6.0173126567753181,5.4395219657471383]
[null,"Tanker-truck",0.95315902876754954,0.29213739759857038,0.51397081668956723,0.17603294497068131,0,0.27858388097823417,5.1128084702365413E-2,0.13383495694739275,0.30628929385334741,0,1.6163020381326463,0.58972184816276318,0.79771537141971416,0.49937486399737746,0,0,0.81646361273713974,0.36094616187742623,0.88389642381914213,0.13428101943771631]
[null,"Cart with small tank / drum",3.6535595456127404E-2,0,0,0,0,6.3641315920707792E-2,0,0,0,0,0,0,0,0,0,1.9106729296069543E-2,0,0,0,0]
[null,"Surface water (river, stream, dam, lake, pond, canal, irrigation channel)",0.26306173026006846,7.329771852579875E-2,3.1556514742567182E-2,0,9.1270161979590564E-2,0,0.12782021175591354,5.5047361072738089E-2,0,0.15931492070546685,0.61746893391173507,0,0,0,0,0.13115246146317652,6.5317089018971181E-2,0.15647946398461554,0,0]
[null,"Bottled water",3.6802020531715796,6.6924150237844229,11.660683308797417,13.517479777783651,21.215012784758606,3.5786995362088314,8.1480042475458347,13.179546142342685,14.632735749259734,23.600829615496529,3.7065981851584162,5.9464501828823746,9.1834726684936445,10.636569420244134,18.74270270443278,16.136688763042592,5.3618957155143931,9.9149583027362951,6.9661584790281168,14.488432104508044]
[null,"Other",0.19212806329537804,0,0.18647031438789691,0,0,0.15322113453802882,0.19521632340903156,0.13011194435374451,0,0,0.24450242458101887,0,0,0,0,0,0,0.23382046964386735,7.8390899324983596E-2,0]
[null,"Missing",0,0,9.7594849091110727E-2,0,9.1151244506442033E-2,0,0,0,0,0.15910734653890199,0,0,0.2287071824412085,0,0,0,0,7.7687923031619352E-2,7.3491468117172096E-2,0]
[]
[]
[]
[]
[]
[]
[]
[]
[]
[]
[]
[]
[]
[]
[]
[]
[]
[]
[]
[]
[]
[]
[]
[]
[]
[]
[]
[]
[]
[]
[]
[]
[]
[]
[]
[]
[]
[{"$f":"A1026","v":"Trinidad and Tobago"}]
[{"$f":"A1034","v":"2011"}]
["Use of sanitation facilities"]
[" by wealth quintile and sub-national region"]
["Notes:"]
["WHO/UNICEF JMP customised wealth index excludes water,"]
[" sanitation and hygiene assets."]
["Survey used for analysis:",{"$f":"A1025","v":"MICS11"}]
[{"$f":"B1030","v":""}]
[{"$f":"B1029","v":""}]
[]
[]
["Use of sanitation facilities",null,"NATIONAL wealth index quintile",null,null,null,null,"URBAN wealth index quintile",null,null,null,null,"RURAL wealth index quintile",null,null,null,null,"SUB-REGIONS:",null,null,null,null,null,null,null,null,null,null,null,null,null,null,null,null,null,null,null,null,null,null,null,null,null,null,null,null,null,null,null,null,null,null,"Raw numbers of respondents:","Use of sanitation facilities","NATIONAL wealth index quintile",null,null,null,null,"URBAN wealth index quintile",null,null,null,null,"RURAL wealth index quintile",null,null,null,null,"SUB-REGIONS:"]
["Weighted percentage (used in graphs)",null,"Poorest","Poor","Middle","Rich","Richest","Poorest","Poor","Middle","Rich","Richest","Poorest","Poor","Middle","Rich","Richest","Central","East","North West","South West","Tobago",null,null,null,null,null,null,null,null,null,null,null,null,null,null,null,null,null,null,null,null,null,null,null,null,null,null,null,null,null,null,"Sanitation data, raw numbers (weighted)",null,"Poorest","Poor","Middle","Rich","Richest","Poorest","Poor","Middle","Rich","Richest","Poorest","Poor","Middle","Rich","Richest","Central","East","North West","South West","Tobago"]
["Sanitation","Improved",96.010591414771227,99.203866719016659,99.823596285238096,99.473704800744542,99.889623814636082,94.26656361903737,99.051806429156159,99.426760561260934,99.656756279201915,99.840892653461083,98.066255161415,99.703337352170863,99.586609365647064,100,99.954854078905328,99.490170316577235,99.766724682075122,96.844363651738036,99.404387911269495,99.813791814443192,null,null,null,null,null,null,null,null,null,null,null,null,null,null,null,null,null,null,null,null,null,null,null,null,null,null,null,null,null,null,"Sanitation","Improved",3433.4217566179432,3547.8121747398832,3571.9990234805055,3555.0691828076942,3574.8330525831884,1935.2751692358677,2031.3527390180423,2039.5480290795751,2046.9566663529995,2046.9923139713617,1494.0673020991408,1520.3082585413786,1520.6391201095405,1524.6944385475606,1523.3011532736884,6803.2749575376893,1352.17049358349,4066.4817604053233,4723.6058163402731,737.60216236247913]
[null,"Not Improved",3.9894085852287375,0.79613328098335268,0.17640371476188324,0.52629519925545587,0.11037618536391058,5.7334363809626634,0.94819357084386757,0.57323943873907712,0.34324372079810439,0.15910734653890199,1.9337448385849922,0.29666264782912866,0.41339063435293211,0,4.5145921094669479E-2,0.5098296834228061,0.23327531792489706,3.155636348261861,0.59561208873050775,0.18620818555680982,null,null,null,null,null,null,null,null,null,null,null,null,null,null,null,null,null,null,null,null,null,null,null,null,null,null,null,null,null,null,null,"Not Improved",142.66470012031843,28.471988445657075,6.3122740545960649,18.809150093288793,3.9501243531476979,117.70639170970883,19.445537408049042,11.758900328957267,7.0502497643315243,3.2621054039646538,29.461152862188385,4.5236065860292571,6.3122740545960649,0,0.68801894918304418,34.862856368653894,3.1616553794315942,132.5047444043856,28.302943016170875,1.3760378983660884]
["Sanitation ladder","Basic",86.042846158868898,93.394782061698137,95.804436869872617,96.64667982594753,98.978698537831463,81.471849598137197,93.412638029802011,93.512109936092386,98.260182352604403,99.249657650253013,91.80801371855668,95.013262951914754,94.465989367580434,97.513915690100333,98.782160823011282,94.166205015238901,97.081518794374816,91.630405740156135,95.53192029137692,94.728608814864643,null,null,null,null,null,null,null,null,null,null,null,null,null,null,null,null,null,null,null,null,null,null,null,null,null,null,null,null,null,null,"Sanitation ladder","Basic",3068.9747637918776,3340.0628001141599,3428.1809880545366,3448.9175618952872,3542.2330120224437,1670.4275697496093,1915.7047706793228,1918.2203909551874,2018.2709413119951,2034.8704921891942,1392.6442813610499,1448.7925095880903,1442.4497416592144,1486.7892493369168,1500.1991790476834,6434.2290198219098,1313.9149425310623,3845.1027600810025,4535.0986348921579,700.02376855222315]
[null,"Limited",9.9573565832388056,5.8090846573185644,4.0191594153654915,2.826244106201989,0.91092527680462165,12.787250517439617,5.6391683993541495,5.9146506251686137,1.3965739265975305,0.59123500320807065,6.2498033691687427,4.6900744002561465,5.120619998066652,2.4860843098996308,1.1725358603114051,5.323570236758723,2.684875287765486,5.2119508235435941,3.8718777924333549,5.0851829995785556,null,null,null,null,null,null,null,null,null,null,null,null,null,null,null,null,null,null,null,null,null,null,null,null,null,null,null,null,null,null,null,"Limited",355.15882414690384,207.74937462572478,143.81803542596913,100.85688354361969,32.600040560744553,262.1786041557412,115.64796833871968,121.32763812438884,28.685725041004648,12.121821782167322,94.803847389464067,71.515748953288892,78.18937845032633,37.905189210643172,17.807236857217767,363.75120034698222,36.337480122239938,218.71000499380503,183.80607902967847,37.578393810256081]
[null,"Unimproved",3.723343684266351,0.79613328098335268,0.17640371476188324,0.52707606785049177,0.11037618536391058,5.4212736547965612,0.94819357084386757,0.57323943873907712,0.34324372079810439,0.15910734653890199,1.7241603434629982,0.29666264782912866,0.41339063435293211,0,4.5303316677337328E-2,0.51022474800226425,0.23360591785976148,3.0014746827625354,0.54102873181678923,9.3104092778404909E-2,null,null,null,null,null,null,null,null,null,null,null,null,null,null,null,null,null,null,null,null,null,null,null,null,null,null,null,null,null,null,null,"Unimproved",132.80415878896957,28.471988445657075,6.3122740545960649,18.809150093288793,3.9501243531476979,111.15305496067269,19.445537408049042,11.758900328957267,7.0502497643315243,3.2621054039646538,26.153948279875678,4.5236065860292571,6.3122740545960649,0,0.68801894918304418,34.862856368653894,3.1616553794315942,125.95140765534946,25.683757383041211,0.68801894918304418]
[null,"Open defecation",0.2764535736253948,0,0,0,0,0.31962622962661524,0,0,0,0,0.21802256881154092,0,0,0,0,0,0,0.15616875353765755,5.5173184372959601E-2,9.3104092778404909E-2,null,null,null,null,null,null,null,null,null,null,null,null,null,null,null,null,null,null,null,null,null,null,null,null,null,null,null,null,null,null,null,"Open defecation",9.8605413313488413,0,0,0,0,6.5533367490361361,0,0,0,0,3.3072045823127061,0,0,0,0,0,0,6.5533367490361361,2.6191856331296615,0.68801894918304418]
["Shared among Improved Sanitation","Yes",10.372224535804285,5.8557038646206365,4.0262618909070937,2.8412194941909723,0.91193183237431563,13.566064710739214,5.6931504862431721,5.9487512132353473,1.4013840894889649,0.5921772006388154,6.3735901479200594,4.7040294987217184,5.141876032013033,2.4860843098996308,1.1730672987045756,5.3508717084490796,2.6911620014600897,5.3818917759558502,3.8951004559894811,5.0946696915713439,null,null,null,null,null,null,null,null,null,null,null,null,null,null,null,null,null,null,null,null,null,null,null,null,null,null,null,null,null,null,"Shared among improved sanitation facilities","Yes","N/A","N/A","N/A","N/A","N/A","N/A","N/A","N/A","N/A","N/A","N/A","N/A","N/A","N/A","N/A","N/A","N/A","N/A","N/A","N/A"]
[null,"No",89.627775464195182,94.144296135379406,95.973738109092906,97.158780505809034,99.088068167625678,86.433935289260759,94.306849513756845,94.051248786764702,98.598615910511043,99.407822799361185,93.626409852079902,95.295970501278333,94.858123967986984,97.513915690100333,98.826932701295448,94.649128291550781,97.308837998539971,94.618108224044178,96.104899544010564,94.905330308428674,null,null,null,null,null,null,null,null,null,null,null,null,null,null,null,null,null,null,null,null,null,null,null,null,null,null,null,null,null,null,null,"No","N/A","N/A","N/A","N/A","N/A","N/A","N/A","N/A","N/A","N/A","N/A","N/A","N/A","N/A","N/A","N/A","N/A","N/A","N/A","N/A"]
["Manually calculated ratios","Improved latrines"]
[null,"Other"]
[null,"Other"]
[null,null,"NATIONAL wealth index quintile",null,null,null,null,"URBAN wealth index quintile",null,null,null,null,"RURAL wealth index quintile",null,null,null,null,"SUB-REGIONS:",null,null,null,null,null,null,null,null,null,null,null,null,null,null,null,null,null,null,null,null,null,null,null,null,null,null,null,null,null,null,null,null,null,null,"Raw numbers of respondents:","Use of sanitation facilities","NATIONAL wealth index quintile",null,null,null,null,"URBAN wealth index quintile",null,null,null,null,"RURAL wealth index quintile",null,null,null,null,"SUB-REGIONS:"]
["Percentage based on weighted population",null,"Poorest","Poor","Middle","Rich","Richest","Poorest","Poor","Middle","Rich","Richest","Poorest","Poor","Middle","Rich","Richest","Central","East","North West","South West","Tobago",null,null,null,null,null,null,null,null,null,null,null,null,null,null,null,null,null,null,null,null,null,null,null,null,null,null,null,null,null,null,"Sanitation data, raw numbers (weighted)",null,"Poorest","Poor","Middle","Rich","Richest","Poorest","Poor","Middle","Rich","Richest","Poorest","Poor","Middle","Rich","Richest","Central","East","North West","South West","Tobago"]
["Sanitation type","Sewer connection",12.261676584777661,15.566560018349362,16.525450069660259,21.563517292219156,31.291530662824769,23.454544759526172,27.600133074012582,30.497209310019652,35.190960787572166,42.46567931837977,1.7353555874030375,2.462303839525128,1.8703517801422005,2.217374394686725,5.5165233542397853,17.683581377817042,1.6375927318327779,38.497135220160509,12.697637611827064,3.4835098436918663,null,null,null,null,null,null,null,null,null,null,null,null,null,null,null,null,null,null,null,null,null,null,null,null,null,null,null,null,null,null,"Sanitation type","Sewer connection","N/A","N/A","N/A","N/A","N/A","N/A","N/A","N/A","N/A","N/A","N/A","N/A","N/A","N/A","N/A","N/A","N/A","N/A","N/A","N/A"]
[null,"Septic tank connection",50.826163766148056,77.018825245690508,79.982512420738601,76.985449566375721,67.962120981975943,51.360288463952507,67.767374623304676,66.048041879176978,63.950672588331081,56.265104033085791,47.860363245732643,84.750494845447946,93.01086807206292,96.446221353586481,94.438330724665548,75.770106565433352,75.7818208686123,51.45516409490105,75.579687418041104,88.92999380528947,null,null,null,null,null,null,null,null,null,null,null,null,null,null,null,null,null,null,null,null,null,null,null,null,null,null,null,null,null,null,null,"Septic tank connection","N/A","N/A","N/A","N/A","N/A","N/A","N/A","N/A","N/A","N/A","N/A","N/A","N/A","N/A","N/A","N/A","N/A","N/A","N/A","N/A"]
[null,"Improved latrines",32.922751063844743,6.6184814549766449,3.3156337948391243,0.92473794214966176,0.63597216983526161,19.451730395558712,3.6842987318389699,2.8815093720644702,0.5151229032988115,1.1101093019955977,48.470536328279401,12.49053866719772,4.7053895134420038,1.3364042517267527,0,6.0364823733260877,22.347311081630501,6.8920643366765209,11.127062881401137,7.4002881654616521,null,null,null,null,null,null,null,null,null,null,null,null,null,null,null,null,null,null,null,null,null,null,null,null,null,null,null,null,null,null,null,"Improved latrines","N/A","N/A","N/A","N/A","N/A","N/A","N/A","N/A","N/A","N/A","N/A","N/A","N/A","N/A","N/A","N/A","N/A","N/A","N/A","N/A"]
[null,"Unimproved facilities",3.7136730444179422,0.79613328098335268,0.17640371476188324,0.52629519925545587,0.11037618536391058,5.4142256840084366,0.94819357084386757,0.57323943873907712,0.34324372079810439,0.15910734653890199,1.7166694980133814,0.29666264782912866,0.41339063435293211,0,4.5145921094669479E-2,0.5098296834228061,0.23327531792489706,2.9995668600286969,0.54049348764262872,9.3104092778404909E-2,null,null,null,null,null,null,null,null,null,null,null,null,null,null,null,null,null,null,null,null,null,null,null,null,null,null,null,null,null,null,null,"Unimproved facilities","N/A","N/A","N/A","N/A","N/A","N/A","N/A","N/A","N/A","N/A","N/A","N/A","N/A","N/A","N/A","N/A","N/A","N/A","N/A","N/A"]
[null,"Open defecation",0.27573554081079488,0,0,0,0,0.31921069695422671,0,0,0,0,0.21707534057161085,0,0,0,0,0,0,0.15606948823316391,5.5118601087879068E-2,9.3104092778404909E-2,null,null,null,null,null,null,null,null,null,null,null,null,null,null,null,null,null,null,null,null,null,null,null,null,null,null,null,null,null,null,null,"Open defecation","N/A","N/A","N/A","N/A","N/A","N/A","N/A","N/A","N/A","N/A","N/A","N/A","N/A","N/A","N/A","N/A","N/A","N/A","N/A","N/A"]
["Septic tank emptying practices","Not emptied/treated and disposed in situ","N/A","N/A","N/A","N/A","N/A","N/A","N/A","N/A","N/A","N/A","N/A","N/A","N/A","N/A","N/A","N/A","N/A","N/A","N/A","N/A",null,null,null,null,null,null,null,null,null,null,null,null,null,null,null,null,null,null,null,null,null,null,null,null,null,null,null,null,null,null,"Septic tank emptying practices","Not emptied/treated and disposed in situ","N/A","N/A","N/A","N/A","N/A","N/A","N/A","N/A","N/A","N/A","N/A","N/A","N/A","N/A","N/A","N/A","N/A","N/A","N/A","N/A"]
[null,"Emptied and buried on site","N/A","N/A","N/A","N/A","N/A","N/A","N/A","N/A","N/A","N/A","N/A","N/A","N/A","N/A","N/A","N/A","N/A","N/A","N/A","N/A",null,null,null,null,null,null,null,null,null,null,null,null,null,null,null,null,null,null,null,null,null,null,null,null,null,null,null,null,null,null,null,"Emptied and buried on site","N/A","N/A","N/A","N/A","N/A","N/A","N/A","N/A","N/A","N/A","N/A","N/A","N/A","N/A","N/A","N/A","N/A","N/A","N/A","N/A"]
[null,"Emptied and discharged locally","N/A","N/A","N/A","N/A","N/A","N/A","N/A","N/A","N/A","N/A","N/A","N/A","N/A","N/A","N/A","N/A","N/A","N/A","N/A","N/A",null,null,null,null,null,null,null,null,null,null,null,null,null,null,null,null,null,null,null,null,null,null,null,null,null,null,null,null,null,null,null,"Emptied and discharged locally","N/A","N/A","N/A","N/A","N/A","N/A","N/A","N/A","N/A","N/A","N/A","N/A","N/A","N/A","N/A","N/A","N/A","N/A","N/A","N/A"]
[null,"Emptied and removed offsite","N/A","N/A","N/A","N/A","N/A","N/A","N/A","N/A","N/A","N/A","N/A","N/A","N/A","N/A","N/A","N/A","N/A","N/A","N/A","N/A",null,null,null,null,null,null,null,null,null,null,null,null,null,null,null,null,null,null,null,null,null,null,null,null,null,null,null,null,null,null,null,"Emptied and removed offsite","N/A","N/A","N/A","N/A","N/A","N/A","N/A","N/A","N/A","N/A","N/A","N/A","N/A","N/A","N/A","N/A","N/A","N/A","N/A","N/A"]
["Latrine emptying practices","Not emptied/treated and disposed in situ","N/A","N/A","N/A","N/A","N/A","N/A","N/A","N/A","N/A","N/A","N/A","N/A","N/A","N/A","N/A","N/A","N/A","N/A","N/A","N/A",null,null,null,null,null,null,null,null,null,null,null,null,null,null,null,null,null,null,null,null,null,null,null,null,null,null,null,null,null,null,"Latrine emptying practices","Not emptied/treated and disposed in situ","N/A","N/A","N/A","N/A","N/A","N/A","N/A","N/A","N/A","N/A","N/A","N/A","N/A","N/A","N/A","N/A","N/A","N/A","N/A","N/A"]
[null,"Emptied and buried on site","N/A","N/A","N/A","N/A","N/A","N/A","N/A","N/A","N/A","N/A","N/A","N/A","N/A","N/A","N/A","N/A","N/A","N/A","N/A","N/A",null,null,null,null,null,null,null,null,null,null,null,null,null,null,null,null,null,null,null,null,null,null,null,null,null,null,null,null,null,null,null,"Emptied and buried on site","N/A","N/A","N/A","N/A","N/A","N/A","N/A","N/A","N/A","N/A","N/A","N/A","N/A","N/A","N/A","N/A","N/A","N/A","N/A","N/A"]
[null,"Emptied and discharged locally","N/A","N/A","N/A","N/A","N/A","N/A","N/A","N/A","N/A","N/A","N/A","N/A","N/A","N/A","N/A","N/A","N/A","N/A","N/A","N/A",null,null,null,null,null,null,null,null,null,null,null,null,null,null,null,null,null,null,null,null,null,null,null,null,null,null,null,null,null,null,null,"Emptied and discharged locally","N/A","N/A","N/A","N/A","N/A","N/A","N/A","N/A","N/A","N/A","N/A","N/A","N/A","N/A","N/A","N/A","N/A","N/A","N/A","N/A"]
[null,"Emptied and removed offsite","N/A","N/A","N/A","N/A","N/A","N/A","N/A","N/A","N/A","N/A","N/A","N/A","N/A","N/A","N/A","N/A","N/A","N/A","N/A","N/A",null,null,null,null,null,null,null,null,null,null,null,null,null,null,null,null,null,null,null,null,null,null,null,null,null,null,null,null,null,null,null,"Emptied and removed offsite","N/A","N/A","N/A","N/A","N/A","N/A","N/A","N/A","N/A","N/A","N/A","N/A","N/A","N/A","N/A","N/A","N/A","N/A","N/A","N/A"]
["Shared among improved sanitation facilities","Yes",9.9314943428644931,5.8090846573185644,4.0191594153654915,2.8220569966004492,0.91092527680462165,12.77062634868407,5.6391683993541495,5.9146506251686137,1.3965739265975305,0.59123500320807065,6.2226502616828645,4.6900744002561465,5.120619998066652,2.4860843098996308,1.1684621637596253,5.3194482218132784,2.6810756426050104,5.2086379592619432,3.8680473118884451,5.0851829995785556,null,null,null,null,null,null,null,null,null,null,null,null,null,null,null,null,null,null,null,null,null,null,null,null,null,null,null,null,null,null,"Shared among improved sanitation facilities","Yes","N/A","N/A","N/A","N/A","N/A","N/A","N/A","N/A","N/A","N/A","N/A","N/A","N/A","N/A","N/A","N/A","N/A","N/A","N/A","N/A"]
[null,"No",85.819367090780005,93.394782061698137,95.804436869872617,96.503496779526259,98.978698537831463,81.365931459230083,93.412638029802011,93.512109936092386,98.260182352604403,99.249657650253013,91.409141511334525,95.013262951914754,94.465989367580434,97.513915690100333,98.438965734875381,94.093292573556724,96.944128679929051,91.572162846359333,95.437409776915644,94.728608814864643,null,null,null,null,null,null,null,null,null,null,null,null,null,null,null,null,null,null,null,null,null,null,null,null,null,null,null,null,null,null,null,"No","N/A","N/A","N/A","N/A","N/A","N/A","N/A","N/A","N/A","N/A","N/A","N/A","N/A","N/A","N/A","N/A","N/A","N/A","N/A","N/A"]
[null,"DK/missing",4.2491385663549375,0.79613328098335268,0.17640371476188324,0.67444622387328934,0.11037618536391058,5.8634421920858397,0.94819357084386757,0.57323943873907712,0.34324372079810439,0.15910734653890199,2.3682082269825768,0.29666264782912866,0.41339063435293211,0,0.39257210136501308,0.58725920462988013,0.37479567746600129,3.2191991943786404,0.69454291119593181,0.18620818555680982,null,null,null,null,null,null,null,null,null,null,null,null,null,null,null,null,null,null,null,null,null,null,null,null,null,null,null,null,null,null,null,"DK/missing","N/A","N/A","N/A","N/A","N/A","N/A","N/A","N/A","N/A","N/A","N/A","N/A","N/A","N/A","N/A","N/A","N/A","N/A","N/A","N/A"]
["Shared among all sanitation facilities","Yes",10.57688903130849,5.8090846573185644,4.0191594153654915,2.8220569966004492,0.91092527680462165,13.722915939713179,5.6391683993541495,5.9146506251686137,1.3965739265975305,0.59123500320807065,6.4014825606224877,4.747330672090218,5.120619998066652,2.4860843098996308,1.1684621637596253,5.3641613878589283,2.7510582379824799,5.6260367825412754,3.8885635007217494,5.0899219252101524,null,null,null,null,null,null,null,null,null,null,null,null,null,null,null,null,null,null,null,null,null,null,null,null,null,null,null,null,null,null,"Shared among all sanitation facilities","Yes","N/A","N/A","N/A","N/A","N/A","N/A","N/A","N/A","N/A","N/A","N/A","N/A","N/A","N/A","N/A","N/A","N/A","N/A","N/A","N/A"]
[null,"No",89.150251069652668,94.141407894959428,95.883245735543383,97.029791978781731,98.997923478688932,86.14666192776545,94.360831600645867,94.085349374831452,98.603426073402503,99.249657650253013,93.133992614455678,95.136556394217024,94.650672819492129,97.513915690100333,98.484111655970054,94.558409090933907,96.944128679929051,94.232491654365688,95.938919119529288,94.910078074789865,null,null,null,null,null,null,null,null,null,null,null,null,null,null,null,null,null,null,null,null,null,null,null,null,null,null,null,null,null,null,null,"No","N/A","N/A","N/A","N/A","N/A","N/A","N/A","N/A","N/A","N/A","N/A","N/A","N/A","N/A","N/A","N/A","N/A","N/A","N/A","N/A"]
["Type of toilet facility","Flush to piped sewer system",12.261676584777661,15.566560018349362,16.525450069660259,21.563517292219156,31.291530662824769,23.454544759526172,27.600133074012582,30.497209310019652,35.190960787572166,42.46567931837977,1.7353555874030375,2.462303839525128,1.8703517801422005,2.217374394686725,5.5165233542397853,17.683581377817042,1.6375927318327779,38.497135220160509,12.697637611827064,3.4835098436918663,null,null,null,null,null,null,null,null,null,null,null,null,null,null,null,null,null,null,null,null,null,null,null,null,null,null,null,null,null,null,"Type of toilet facility","Flush to piped sewer system",438.48815571728068,556.70442068900036,591.33204681117547,770.65387231797718,1119.856035167048,481.51747911679917,566.0230533731575,625.59136785265707,722.82476842487017,870.65446694283526,26.4386361688466,37.545993561334789,28.559362582655076,33.808184077566132,84.071218601760293,1209.2276650494071,22.194820763609798,1616.489512632887,603.38015390774865,25.742378348823536]
[null,"Flush to septic tank",50.826163766148056,77.018825245690508,79.982512420738601,76.985449566375721,67.962120981975943,51.360288463952507,67.767374623304676,66.048041879176978,63.950672588331081,56.265104033085791,47.860363245732643,84.750494845447946,93.01086807206292,96.446221353586481,94.438330724665548,75.770106565433352,75.7818208686123,51.45516409490105,75.579687418041104,88.92999380528947,null,null,null,null,null,null,null,null,null,null,null,null,null,null,null,null,null,null,null,null,null,null,null,null,null,null,null,null,null,null,null,"Flush to septic tank",1817.587558920831,2754.4120499331761,2862.0232780037054,2751.3663015391157,2432.2169523920752,1054.4172518134028,1389.7721507539445,1354.8480598062067,1313.5512378678702,1153.5777820044664,729.16625269659039,1292.3025512565516,1420.2307467505304,1470.5101731674029,1439.229934671928,5181.2643086880289,1027.0953813017945,2160.5953963725883,3591.4777867121147,657.17326771440935]
[null,"Flush to somewhere else",0,8.6352087951478571E-2,0,7.976327783032619E-2,1.9224940857468537E-2,0.15042492853985476,0,0,0.13878446472703135,0,0,0,0,0,4.5145921094669479E-2,8.6848769527588812E-2,0,0,0,9.3104092778404909E-2,null,null,null,null,null,null,null,null,null,null,null,null,null,null,null,null,null,null,null,null,null,null,null,null,null,null,null,null,null,null,null,"Flush to somewhere else",0,3.0881960459887772,0,2.8506425039896408,0.68801894918304418,3.0881960459887772,0,0,2.8506425039896408,0,0,0,0,0,0.68801894918304418,5.938838549978418,0,0,0,0.68801894918304418]
[null,"Flush to unknown place / Not sure / DK where",0.30072978870459693,3.4649830575832138E-2,0.72230560413382183,0.29605540745069125,0.63597216983526161,0.52384090777168846,0.19694353283999949,1.1235083610102974,0.5151229032988115,1.1101093019955977,0,0,0,0,0,0.38118974765949731,0,0.88483517530818412,0.16751609286179989,0,null,null,null,null,null,null,null,null,null,null,null,null,null,null,null,null,null,null,null,null,null,null,null,null,null,null,null,null,null,null,null,"Flush to unknown place / Not sure / DK where",10.754357245242684,1.2391764034541057,25.846343035449717,10.580660060261977,22.76006502406133,10.754357245242684,4.0389145770153618,23.046604861888461,10.580660060261977,22.76006502406133,0,0,0,0,0,26.066280277438246,0,37.154109601000023,7.9602118900315428,0]
[null,"Ventilated Improved Pit latrine (VIP)",8.4546121912233136,2.5730771343026704,0.60184354281428876,0.29644293336189848,0,4.6056059908410854,0.72035288019940835,0.13788419558496356,0,0,13.185786720623394,4.7199860780295433,2.1209870393681247,0.5964458671645515,0,1.5388513413471165,5.7906111611049464,0.92198328488119607,3.5971865053696863,4.4839444968306168,null,null,null,null,null,null,null,null,null,null,null,null,null,null,null,null,null,null,null,null,null,null,null,null,null,null,null,null,null,null,null,"Ventilated Improved Pit latrine (VIP)",302.344241540079,92.020550060614724,21.535835486009201,10.594509764836989,0,94.552241761772265,14.772984451315171,2.8284280585935706,0,0,200.88921269920971,71.971851747371872,32.386441167672224,9.0939769656046874,0,105.22877547246212,78.482014687890441,38.713953708762716,170.93502063905007,33.135372343374108]
[null,"Pit latrine with slab",24.167409083916827,4.010754490098142,1.991484647891014,0.33223960133707187,0,14.322283496945944,2.7670023187995616,1.6201168154692087,0,0,35.284749607656025,7.7705525891681813,2.5844024740738796,0.73995838456220087,0,4.1164412843194738,16.556699920525585,5.0852458764871447,7.3623602831696378,2.9163436686310313,null,null,null,null,null,null,null,null,null,null,null,null,null,null,null,null,null,null,null,null,null,null,null,null,null,null,null,null,null,null,null,"Pit latrine with slab",864.24744319448234,143.43597765363282,71.261520144161295,11.873839125502215,0,294.03383929865146,56.745635862611387,33.233568500232721,0,0,537.57320053449553,118.48786197611928,39.462569608683545,11.282104336986247,0,281.48792805030178,224.39827683020167,213.52878809008763,349.85264319131784,21.551143955870703]
[null,"Pit latrine without slab / Open pit",3.4988868673387428,0.66027374530980565,7.880886567077254E-2,0,0,5.0761519720842507,0.94819357084386757,0,0,0,1.5226801714654083,0.12329344230228242,0.18468345191172361,0,0,0.14489269716186071,0,2.8656939212331385,0.44862915249616364,0,null,null,null,null,null,null,null,null,null,null,null,null,null,null,null,null,null,null,null,null,null,null,null,null,null,null,null,null,null,null,null,"Pit latrine without slab / Open pit",125.12321939949445,23.613265387186605,2.8200265437565166,0,0,104.21246399246489,19.445537408049042,0,0,0,23.198465690329456,1.8800176958376777,2.8200265437565166,0,0,9.9079623142139965,0,120.33010102173179,21.318447994491777,0]
[null,"Bucket",3.6650885420781543E-2,0,0,0,0,6.3842139390845348E-2,0,0,0,0,0,0,0,0,0,0,0,3.1213897646632783E-2,0,0,null,null,null,null,null,null,null,null,null,null,null,null,null,null,null,null,null,null,null,null,null,null,null,null,null,null,null,null,null,null,null,"Bucket",1.3106673498072272,0,0,0,0,1.3106673498072272,0,0,0,0,0,0,0,0,0,0,0,1.3106673498072272,0,0]
[null,"No facility, Bush, Field",0.27573554081079488,0,0,0,0,0.31921069695422671,0,0,0,0,0.21707534057161085,0,0,0,0,0,0,0.15606948823316391,5.5118601087879068E-2,9.3104092778404909E-2,null,null,null,null,null,null,null,null,null,null,null,null,null,null,null,null,null,null,null,null,null,null,null,null,null,null,null,null,null,null,null,"No facility, Bush, Field",9.8605413313488413,0,0,0,0,6.5533367490361361,0,0,0,0,3.3072045823127061,0,0,0,0,0,0,6.5533367490361361,2.6191856331296615,0.68801894918304418]
[null,"Other",0.1781352916584181,4.9507447722068408E-2,0,0,0,0.12380664399348519,0,0,0,0,0.1939893265479731,0.17336920552684629,0,0,0,4.471316604565001E-2,0.23327531792489706,2.4971118117306224E-2,1.8372867029293024E-2,0,null,null,null,null,null,null,null,null,null,null,null,null,null,null,null,null,null,null,null,null,null,null,null,null,null,null,null,null,null,null,null,"Other",6.3702720396678938,1.7705270124816928,0,0,0,2.5417275724117845,0,0,0,0,2.9554825895462224,2.6435888901915798,0,0,0,3.0575479151623242,3.1616553794315942,1.0485338798457817,0.87306187770988719,0]
[null,"Missing",0,0,9.7594849091110727E-2,0.4465319214251296,9.1151244506442033E-2,0,0,0.57323943873907712,0.20445925607107304,0.15910734653890199,0,0,0.2287071824412085,0,0,0.23337505068770653,0,7.7687923031619352E-2,7.3491468117172096E-2,0,null,null,null,null,null,null,null,null,null,null,null,null,null,null,null,null,null,null,null,null,null,null,null,null,null,null,null,null,null,null,null,"Missing",0,0,3.4922475108395488,15.958507589299151,3.2621054039646538,0,0,11.758900328957267,4.1996072603418835,3.2621054039646538,0,0,3.4922475108395488,0,0,15.958507589299151,0,3.2621054039646538,3.4922475108395488,0]
[null,null,null,null,null,null,null,null,null,null,null,null,null,null,null,null,null,null,null,null,null,null,null,null,null,null,null,null,null,null,null,null,null,null,null,null,null,null,null,null,null,null,null,null,null,null,null,null,null,null,null,null,null,"Total",3576.0864567382628,3576.2841631855399,3578.3112975351019,3573.878332900983,3578.7831769363361,2052.9815609455759,2050.798276426091,2051.3069294085321,2054.0069161173305,2050.2544193753265,1523.5284549613293,1524.831865127408,1526.9513941641367,1524.6944385475606,1523.9891722228715,6838.1378139063409,1355.3321489629213,4198.9865048097136,4751.9087593564436,738.97820026084526]
[]
[]
[]
[]
[]
[]
[]
[]
[]
[]
[]
[]
[]
[]
[]
[]
[]
[]
[]
[]
[]
[]
[]
[]
[]
[]
[]
[]
[]
[]
[]
[]
[]
[]
[]
[]
[]
[]
[]
[]
[]
[]
[]
[{"$f":"A1026","v":"Trinidad and Tobago"}]
[{"$f":"A1034","v":"2011"}]
["Access to hygiene facilities "]
[" by wealth quintile and sub-national region"]
["Notes:"]
["WHO/UNICEF JMP customised wealth index excludes water,"]
[" sanitation and hygiene assets."]
["Survey used for analysis:",{"$f":"A1025","v":"MICS11"}]
[]
[]
[]
[]
["Access to handwashing",null,"NATIONAL wealth index quintile",null,null,null,null,"URBAN wealth index quintile",null,null,null,null,"RURAL wealth index quintile",null,null,null,null,"SUB-REGIONS:",null,null,null,null,null,null,null,null,null,null,null,null,null,null,null,null,null,null,null,null,null,null,null,null,null,null,null,null,null,null,null,null,null,null,"Raw numbers of respondents:","Access to handwashing","NATIONAL wealth index quintile",null,null,null,null,"URBAN wealth index quintile",null,null,null,null,"RURAL wealth index quintile",null,null,null,null,"SUB-REGIONS:"]
["Weighted percentage (used in graphs)",null,"Poorest","Poor","Middle","Rich","Richest","Poorest","Poor","Middle","Rich","Richest","Poorest","Poor","Middle","Rich","Richest","Central","East","North West","South West","Tobago",null,null,null,null,null,null,null,null,null,null,null,null,null,null,null,null,null,null,null,null,null,null,null,null,null,null,null,null,null,null,"Hygiene data, raw numbers (weighted)",null,"Poorest","Poor","Middle","Rich","Richest","Poorest","Poor","Middle","Rich","Richest","Poorest","Poor","Middle","Rich","Richest","Central","East","North West","South West","Tobago"]
["Hygiene ladder","Basic",77.017666870655518,89.983926532022977,93.275319222739995,92.850506714727572,94.160781086983732,78.119211348526647,89.416186096928058,91.590480086532651,93.447721588221,94.394888396911696,75.938867809032345,89.613810220297978,95.415535866308133,94.618154772590572,92.508555959241647,89.42592029990233,82.620031938744262,85.243964905805669,96.089112861545573,77.44340131217659,null,null,null,null,null,null,null,null,null,null,null,null,null,null,null,null,null,null,null,null,null,null,null,null,null,null,null,null,null,null,"Hygiene ladder","Basic",2511.4828263281292,2994.8507423274077,3108.8491073594837,3095.9080201831071,3028.6486009089326,1504.3358845738426,1764.1015101403698,1787.0103385309849,1827.5713685969488,1737.3301421042022,1030.5032368475704,1234.2970017441028,1312.4396450351087,1282.8011537908646,1259.3490157430347,5684.2088691942763,855.86892552409495,3327.0538474848904,4446.7025471309062,425.90510777292138]
[null,"Limited",11.247985455494334,5.7380503382846211,2.9522461455519613,2.3538545423914869,1.1485049381599695,12.501669396220219,5.4928140348513228,3.2503687223796187,2.3118913472934279,0.73580308665254168,10.009887481117476,5.1591614055769819,2.5715075155465672,1.7958695335113275,2.4743939160449471,4.8550186265147417,4.5431902089615619,7.6246854246910871,2.0513382974409935,4.2551312435621966,null,null,null,null,null,null,null,null,null,null,null,null,null,null,null,null,null,null,null,null,null,null,null,null,null,null,null,null,null,null,null,"Limited",366.78756251737082,190.9741548009485,98.397817030114481,78.484409121467465,36.941259768033397,240.74372443299609,108.36831626096763,63.41753537531892,45.21401230346391,13.542395174192441,135.83586044121421,71.059777937833843,35.371057556474597,24.347795781719807,33.684727973752949,308.60112867039339,47.063348093092245,297.58985291347869,94.929497844375462,23.401375716594895]
[null,"No facility",11.734347673849697,4.2780231296923903,3.7724346317080117,4.7956387428809952,4.6907139748562949,9.3791192552531637,5.0909998682206457,5.1591511910877994,4.2403870644855912,4.869308516435793,14.051244709850309,5.2270283741250809,2.0129566181452918,3.5859756938981238,5.0170501247133616,5.7190610735825587,12.83677785229437,7.1313496695032823,1.8595488410133767,18.301467444261206,null,null,null,null,null,null,null,null,null,null,null,null,null,null,null,null,null,null,null,null,null,null,null,null,null,null,null,null,null,null,null,"No facility",382.64743478311647,142.3814367679721,125.73454730668188,159.90065074821132,150.8751749211682,180.6130069391815,100.44088154147981,100.65955007341381,82.929897691583321,89.619221977758812,190.67775926882828,71.994544527832119,27.688196114009845,48.617453686922744,68.298732706140015,363.52253987323206,132.97742702133439,278.33506315548067,86.054083772873156,100.65013070422961]
["Place where household members most often wash their hands","Observed",80.486599629662336,89.081984309955274,89.630181884926856,88.822062018206992,85.660117115597487,85.002205679971027,91.304437297678774,90.207264811407356,91.177170154836716,85.397817984552972,76.555123961789633,85.606604212253046,88.26808159989821,85.731863154022406,84.84533665227984,87.638040661851434,66.620737529770551,86.321870676329482,95.574900002717257,60.801047085139935,null,null,null,null,null,null,null,null,null,null,null,null,null,null,null,null,null,null,null,null,null,null,null,null,null,null,null,null,null,null,"Observed handwashing place","Fixed","N/A","N/A","N/A","N/A","N/A","N/A","N/A","N/A","N/A","N/A","N/A","N/A","N/A","N/A","N/A","N/A","N/A","N/A","N/A","N/A"]
[null,"Not in dwelling/plot/yard",6.0498248667361567,0.67558080451400482,1.1562505984860931,0.6691932283417209,0.64866958543187825,5.4507740799947495,1.1099224683116082,0.87916840817112585,0.41178893951394496,0.74967343619015392,6.1184235130466904,1.5676198008466129,0.67513474889399416,0.21345037784297125,1.4305292899114326,1.2107275543527167,3.9525620666231607,2.9156020427436742,1.1463443430634854,2.1315914247325072,null,null,null,null,null,null,null,null,null,null,null,null,null,null,null,null,null,null,null,null,null,null,null,null,null,null,null,null,null,null,null,"Mobile","N/A","N/A","N/A","N/A","N/A","N/A","N/A","N/A","N/A","N/A","N/A","N/A","N/A","N/A","N/A","N/A","N/A","N/A","N/A","N/A"]
[null,"No permission to see",8.7884723539384613,6.9367482551565152,6.8560224485727721,6.5444882677478349,10.124059587436864,6.2001991357841906,3.7979146646743449,4.8856416361696571,4.7853605922191962,10.231055138175723,10.929339577575824,9.6138650276140236,9.9186192852883632,10.70606847596564,10.673087366014085,7.0458550160919522,23.404542554496917,7.0495044677281111,2.522298454989083,25.57877701945403,null,null,null,null,null,null,null,null,null,null,null,null,null,null,null,null,null,null,null,null,null,null,null,null,null,null,null,null,null,null,"Water / Soap","Water and soap","N/A","N/A","N/A","N/A","N/A","N/A","N/A","N/A","N/A","N/A","N/A","N/A","N/A","N/A","N/A","N/A","N/A","N/A","N/A","N/A"]
[null,"Other reason",4.6503480572744165,3.3056866303742583,2.3575450680142849,3.8049560250386265,3.5671537115337348,3.3468211042500391,3.7877255693353358,4.027925144251947,3.6256803134301934,3.6214534410812087,6.3971129475879156,3.1538544924399172,1.1381643659194502,2.975218279808606,3.0510466917945491,4.1053767677034507,5.8588651265624065,3.713022813198656,0.66459286408372342,11.488584470673072,null,null,null,null,null,null,null,null,null,null,null,null,null,null,null,null,null,null,null,null,null,null,null,null,null,null,null,null,null,null,null,"Water only","N/A","N/A","N/A","N/A","N/A","N/A","N/A","N/A","N/A","N/A","N/A","N/A","N/A","N/A","N/A","N/A","N/A","N/A","N/A","N/A"]
[null,"Missing",2.4755092388014929E-2,0,0,0.15930046066479903,0,0,0,0,0,0,0,5.8056466846387537E-2,0,0.37339971236034092,0,0,0.16329272254742794,0,9.1864335146465123E-2,0,null,null,null,null,null,null,null,null,null,null,null,null,null,null,null,null,null,null,null,null,null,null,null,null,null,null,null,null,null,null,null,"Soap only","N/A","N/A","N/A","N/A","N/A","N/A","N/A","N/A","N/A","N/A","N/A","N/A","N/A","N/A","N/A","N/A","N/A","N/A","N/A","N/A"]
[null,null,null,null,null,null,null,null,null,null,null,null,null,null,null,null,null,null,null,null,null,null,null,null,null,null,null,null,null,null,null,null,null,null,null,null,null,null,null,null,null,null,null,null,null,null,null,null,null,null,null,null,null,"Neither","N/A","N/A","N/A","N/A","N/A","N/A","N/A","N/A","N/A","N/A","N/A","N/A","N/A","N/A","N/A","N/A","N/A","N/A","N/A","N/A"]
[null,null,null,null,null,null,null,null,null,null,null,null,null,null,null,null,null,null,null,null,null,null,null,null,null,null,null,null,null,null,null,null,null,null,null,null,null,null,null,null,null,null,null,null,null,null,null,null,null,null,null,null,"Place where household members most often wash their hands","Observed",2878.2703888455035,3185.8248971283579,3207.246924389598,3174.3924293045734,3065.5898606769661,1745.0796090068384,1872.4698264013373,1850.4278739063034,1872.7853809004127,1750.8725372783947,1166.3390972887842,1305.3567796819364,1347.8107025915835,1307.1489495725848,1293.033743716788,5992.8099978646778,902.93227361718664,3624.6437003983683,4541.632044975283,449.30648348951621]
[null,null,null,null,null,null,null,null,null,null,null,null,null,null,null,null,null,null,null,null,null,null,null,null,null,null,null,null,null,null,null,null,null,null,null,null,null,null,null,null,null,null,null,null,null,null,null,null,null,null,null,null,null,"Not in dwelling/plot/yard",216.34696771573536,24.160689321355814,41.374245793445098,23.916151792945364,23.214477997338737,111.90338679109307,22.762270849800387,18.034442477984992,8.4581732974226398,15.370212756371499,93.215923216310927,23.903566247355968,10.308979460723387,3.254466040030537,21.801111483726963,82.791218717576569,53.570344396656942,122.42573630876321,54.473237250420844,15.751995947402792]
[null,null,null,null,null,null,null,null,null,null,null,null,null,null,null,null,null,null,null,null,null,null,null,null,null,null,null,null,null,null,null,null,null,null,null,null,null,null,null,null,null,null,null,null,null,null,null,null,null,null,null,null,null,"No permission to see",314.2833696033797,248.07782928921171,245.32982583882225,233.89204820028675,362.31814133820075,127.28894499955639,77.887568483275217,100.21950542881656,98.291637525335531,209.76266011917417,166.51159840371804,146.59527741139851,151.45249545854358,163.23483064014169,162.65669579994193,481.8052761684005,317.20928955880447,296.00774125586122,119.85732121973848,189.02158606709608]
[null,null,null,null,null,null,null,null,null,null,null,null,null,null,null,null,null,null,null,null,null,null,null,null,null,null,null,null,null,null,null,null,null,null,null,null,null,null,null,null,null,null,null,null,null,null,null,null,null,null,null,null,null,"Other reason",166.30046706738131,118.22074744661633,84.360301513236763,135.98449895526596,127.66069692382941,68.709620148088405,77.67861069167941,82.625107595428815,74.471724394160688,74.249009221387311,97.461836052517327,48.090978280476136,17.379216653286452,45.362987646892215,46.497621222413052,280.73132115565556,79.407082624677443,155.90932684671756,31.580846522452319,84.898134756826821]
[null,null,null,null,null,null,null,null,null,null,null,null,null,null,null,null,null,null,null,null,null,null,null,null,null,null,null,null,null,null,null,null,null,null,null,null,null,null,null,null,null,null,null,null,null,null,null,null,null,null,null,null,null,"Missing",0.88526350624084638,0,0,5.6932046479107061,0,0,0,0,0,0,0,0.88526350624084638,0,5.6932046479107061,0,0,2.2131587656021159,0,4.3653093885494361,0]
[null,null,null,null,null,null,null,null,null,null,null,null,null,null,null,null,null,null,null,null,null,null,null,null,null,null,null,null,null,null,null,null,null,null,null,null,null,null,null,null,null,null,null,null,null,null,null,null,null,null,null,null,null,"Total",3576.0864567382628,3576.2841631855399,3578.3112975351019,3573.878332900983,3578.7831769363361,2052.9815609455759,2050.798276426091,2051.3069294085321,2054.0069161173305,2050.2544193753265,1523.5284549613293,1524.831865127408,1526.9513941641367,1524.6944385475606,1523.9891722228715,6838.1378139063409,1355.3321489629213,4198.9865048097136,4751.9087593564436,738.97820026084526]
[]
[]
[]
[]
[]
[]
[]
[]
[]
[]
[]
[]
[]
[]
[]
[]
[]
[]
[]
[]
[]
[]
[null,null,null,null,null,null,null,null,null,null,null,null,null,null,null,null,null,null,null,null,null,null,null,null,null,null,null,null,null,null,null,null,null,null,null,null,null,null,null,null,null,null,null,null,null,null,null,null,null,null,null,null,"Raw numbers of respondents:","Menstrual health and hygiene","NATIONAL wealth index quintile",null,null,null,null,"URBAN wealth index quintile",null,null,null,null,"RURAL wealth index quintile",null,null,null,null,"SUB-REGIONS:"]
[null,null,null,null,null,null,null,null,null,null,null,null,null,null,null,null,null,null,null,null,null,null,null,null,null,null,null,null,null,null,null,null,null,null,null,null,null,null,null,null,null,null,null,null,null,null,null,null,null,null,null,null,"MHH data, raw numbers (weighted)",null,"Poorest","Poor","Middle","Rich","Richest","Poorest","Poor","Middle","Rich","Richest","Poorest","Poor","Middle","Rich","Richest","Central","East","North West","South West","Tobago"]
[null,null,null,null,null,null,null,null,null,null,null,null,null,null,null,null,null,null,null,null,null,null,null,null,null,null,null,null,null,null,null,null,null,null,null,null,null,null,null,null,null,null,null,null,null,null,null,null,null,null,null,null,"Private place to wash and change","Yes","N/A","N/A","N/A","N/A","N/A","N/A","N/A","N/A","N/A","N/A","N/A","N/A","N/A","N/A","N/A","N/A","N/A","N/A","N/A","N/A"]
[null,null,null,null,null,null,null,null,null,null,null,null,null,null,null,null,null,null,null,null,null,null,null,null,null,null,null,null,null,null,null,null,null,null,null,null,null,null,null,null,null,null,null,null,null,null,null,null,null,null,null,null,null,"No","N/A","N/A","N/A","N/A","N/A","N/A","N/A","N/A","N/A","N/A","N/A","N/A","N/A","N/A","N/A","N/A","N/A","N/A","N/A","N/A"]
[null,null,null,null,null,null,null,null,null,null,null,null,null,null,null,null,null,null,null,null,null,null,null,null,null,null,null,null,null,null,null,null,null,null,null,null,null,null,null,null,null,null,null,null,null,null,null,null,null,null,null,null,null,"DK/not sure/missing","N/A","N/A","N/A","N/A","N/A","N/A","N/A","N/A","N/A","N/A","N/A","N/A","N/A","N/A","N/A","N/A","N/A","N/A","N/A","N/A"]
[null,null,null,null,null,null,null,null,null,null,null,null,null,null,null,null,null,null,null,null,null,null,null,null,null,null,null,null,null,null,null,null,null,null,null,null,null,null,null,null,null,null,null,null,null,null,null,null,null,null,null,null,"Use of menstrual materials","Materials reusable","N/A","N/A","N/A","N/A","N/A","N/A","N/A","N/A","N/A","N/A","N/A","N/A","N/A","N/A","N/A","N/A","N/A","N/A","N/A","N/A"]
[null,null,null,null,null,null,null,null,null,null,null,null,null,null,null,null,null,null,null,null,null,null,null,null,null,null,null,null,null,null,null,null,null,null,null,null,null,null,null,null,null,null,null,null,null,null,null,null,null,null,null,null,null,"Materials not reusable","N/A","N/A","N/A","N/A","N/A","N/A","N/A","N/A","N/A","N/A","N/A","N/A","N/A","N/A","N/A","N/A","N/A","N/A","N/A","N/A"]
[null,null,null,null,null,null,null,null,null,null,null,null,null,null,null,null,null,null,null,null,null,null,null,null,null,null,null,null,null,null,null,null,null,null,null,null,null,null,null,null,null,null,null,null,null,null,null,null,null,null,null,null,null,"No materials used","N/A","N/A","N/A","N/A","N/A","N/A","N/A","N/A","N/A","N/A","N/A","N/A","N/A","N/A","N/A","N/A","N/A","N/A","N/A","N/A"]
[null,null,null,null,null,null,null,null,null,null,null,null,null,null,null,null,null,null,null,null,null,null,null,null,null,null,null,null,null,null,null,null,null,null,null,null,null,null,null,null,null,null,null,null,null,null,null,null,null,null,null,null,null,"DK/not sure/missing","N/A","N/A","N/A","N/A","N/A","N/A","N/A","N/A","N/A","N/A","N/A","N/A","N/A","N/A","N/A","N/A","N/A","N/A","N/A","N/A"]
[null,null,null,null,null,null,null,null,null,null,null,null,null,null,null,null,null,null,null,null,null,null,null,null,null,null,null,null,null,null,null,null,null,null,null,null,null,null,null,null,null,null,null,null,null,null,null,null,null,null,null,null,"Use of menstrual materials with private place to wash and change","Materials reusable","N/A","N/A","N/A","N/A","N/A","N/A","N/A","N/A","N/A","N/A","N/A","N/A","N/A","N/A","N/A","N/A","N/A","N/A","N/A","N/A"]
[null,null,null,null,null,null,null,null,null,null,null,null,null,null,null,null,null,null,null,null,null,null,null,null,null,null,null,null,null,null,null,null,null,null,null,null,null,null,null,null,null,null,null,null,null,null,null,null,null,null,null,null,null,"Materials not reusable","N/A","N/A","N/A","N/A","N/A","N/A","N/A","N/A","N/A","N/A","N/A","N/A","N/A","N/A","N/A","N/A","N/A","N/A","N/A","N/A"]
[null,null,null,null,null,null,null,null,null,null,null,null,null,null,null,null,null,null,null,null,null,null,null,null,null,null,null,null,null,null,null,null,null,null,null,null,null,null,null,null,null,null,null,null,null,null,null,null,null,null,null,null,null,"No materials used","N/A","N/A","N/A","N/A","N/A","N/A","N/A","N/A","N/A","N/A","N/A","N/A","N/A","N/A","N/A","N/A","N/A","N/A","N/A","N/A"]
[null,null,null,null,null,null,null,null,null,null,null,null,null,null,null,null,null,null,null,null,null,null,null,null,null,null,null,null,null,null,null,null,null,null,null,null,null,null,null,null,null,null,null,null,null,null,null,null,null,null,null,null,"Awareness of menstruation before menarche","Yes","N/A","N/A","N/A","N/A","N/A","N/A","N/A","N/A","N/A","N/A","N/A","N/A","N/A","N/A","N/A","N/A","N/A","N/A","N/A","N/A"]
[null,null,null,null,null,null,null,null,null,null,null,null,null,null,null,null,null,null,null,null,null,null,null,null,null,null,null,null,null,null,null,null,null,null,null,null,null,null,null,null,null,null,null,null,null,null,null,null,null,null,null,null,null,"No","N/A","N/A","N/A","N/A","N/A","N/A","N/A","N/A","N/A","N/A","N/A","N/A","N/A","N/A","N/A","N/A","N/A","N/A","N/A","N/A"]
[null,null,null,null,null,null,null,null,null,null,null,null,null,null,null,null,null,null,null,null,null,null,null,null,null,null,null,null,null,null,null,null,null,null,null,null,null,null,null,null,null,null,null,null,null,null,null,null,null,null,null,null,null,"DK/not sure/missing","N/A","N/A","N/A","N/A","N/A","N/A","N/A","N/A","N/A","N/A","N/A","N/A","N/A","N/A","N/A","N/A","N/A","N/A","N/A","N/A"]
[null,null,null,null,null,null,null,null,null,null,null,null,null,null,null,null,null,null,null,null,null,null,null,null,null,null,null,null,null,null,null,null,null,null,null,null,null,null,null,null,null,null,null,null,null,null,null,null,null,null,null,null,"Participation in (all) activities during menstruation","Yes","N/A","N/A","N/A","N/A","N/A","N/A","N/A","N/A","N/A","N/A","N/A","N/A","N/A","N/A","N/A","N/A","N/A","N/A","N/A","N/A"]
[null,null,null,null,null,null,null,null,null,null,null,null,null,null,null,null,null,null,null,null,null,null,null,null,null,null,null,null,null,null,null,null,null,null,null,null,null,null,null,null,null,null,null,null,null,null,null,null,null,null,null,null,null,"No","N/A","N/A","N/A","N/A","N/A","N/A","N/A","N/A","N/A","N/A","N/A","N/A","N/A","N/A","N/A","N/A","N/A","N/A","N/A","N/A"]
[null,null,null,null,null,null,null,null,null,null,null,null,null,null,null,null,null,null,null,null,null,null,null,null,null,null,null,null,null,null,null,null,null,null,null,null,null,null,null,null,null,null,null,null,null,null,null,null,null,null,null,null,null,"DK/not sure/missing/no such activity","N/A","N/A","N/A","N/A","N/A","N/A","N/A","N/A","N/A","N/A","N/A","N/A","N/A","N/A","N/A","N/A","N/A","N/A","N/A","N/A"]
[null,null,null,null,null,null,null,null,null,null,null,null,null,null,null,null,null,null,null,null,null,null,null,null,null,null,null,null,null,null,null,null,null,null,null,null,null,null,null,null,null,null,null,null,null,null,null,null,null,null,null,null,"Participation in specific activities during menstruation","Did not go to school (amongst those usually attending school)","N/A","N/A","N/A","N/A","N/A","N/A","N/A","N/A","N/A","N/A","N/A","N/A","N/A","N/A","N/A","N/A","N/A","N/A","N/A","N/A"]
[null,null,null,null,null,null,null,null,null,null,null,null,null,null,null,null,null,null,null,null,null,null,null,null,null,null,null,null,null,null,null,null,null,null,null,null,null,null,null,null,null,null,null,null,null,null,null,null,null,null,null,null,null,"Did not go to work (amongst those who usually work)","N/A","N/A","N/A","N/A","N/A","N/A","N/A","N/A","N/A","N/A","N/A","N/A","N/A","N/A","N/A","N/A","N/A","N/A","N/A","N/A"]
[null,null,null,null,null,null,null,null,null,null,null,null,null,null,null,null,null,null,null,null,null,null,null,null,null,null,null,null,null,null,null,null,null,null,null,null,null,null,null,null,null,null,null,null,null,null,null,null,null,null,null,null,null,"Did not participate in social activities","N/A","N/A","N/A","N/A","N/A","N/A","N/A","N/A","N/A","N/A","N/A","N/A","N/A","N/A","N/A","N/A","N/A","N/A","N/A","N/A"]
[null,null,null,null,null,null,null,null,null,null,null,null,null,null,null,null,null,null,null,null,null,null,null,null,null,null,null,null,null,null,null,null,null,null,null,null,null,null,null,null,null,null,null,null,null,null,null,null,null,null,null,null,null,"Did not cook food","N/A","N/A","N/A","N/A","N/A","N/A","N/A","N/A","N/A","N/A","N/A","N/A","N/A","N/A","N/A","N/A","N/A","N/A","N/A","N/A"]
[null,null,null,null,null,null,null,null,null,null,null,null,null,null,null,null,null,null,null,null,null,null,null,null,null,null,null,null,null,null,null,null,null,null,null,null,null,null,null,null,null,null,null,null,null,null,null,null,null,null,null,null,null,"Did not eat with others","N/A","N/A","N/A","N/A","N/A","N/A","N/A","N/A","N/A","N/A","N/A","N/A","N/A","N/A","N/A","N/A","N/A","N/A","N/A","N/A"]
[null,null,null,null,null,null,null,null,null,null,null,null,null,null,null,null,null,null,null,null,null,null,null,null,null,null,null,null,null,null,null,null,null,null,null,null,null,null,null,null,null,null,null,null,null,null,null,null,null,null,null,null,null,"Did not bathe in regular place","N/A","N/A","N/A","N/A","N/A","N/A","N/A","N/A","N/A","N/A","N/A","N/A","N/A","N/A","N/A","N/A","N/A","N/A","N/A","N/A"]
[null,null,null,null,null,null,null,null,null,null,null,null,null,null,null,null,null,null,null,null,null,null,null,null,null,null,null,null,null,null,null,null,null,null,null,null,null,null,null,null,null,null,null,null,null,null,null,null,null,null,null,null,null,"Did not participate in other activities","N/A","N/A","N/A","N/A","N/A","N/A","N/A","N/A","N/A","N/A","N/A","N/A","N/A","N/A","N/A","N/A","N/A","N/A","N/A","N/A"]
[null,null,null,null,null,null,null,null,null,null,null,null,null,null,null,null,null,null,null,null,null,null,null,null,null,null,null,null,null,null,null,null,null,null,null,null,null,null,null,null,null,null,null,null,null,null,null,null,null,null,null,null,null,"DK/not sure/missing/no such activity","N/A","N/A","N/A","N/A","N/A","N/A","N/A","N/A","N/A","N/A","N/A","N/A","N/A","N/A","N/A","N/A","N/A","N/A","N/A","N/A"]
[]
[]
[]
[]
[]
[]
[]
[]
[]
[]
[]
[]
[]
[]
[]
[]
[]
[]
[]
[]
[]
[]
[]
[]
[]
[]
[]
[]
[]
[]
[]
[]
[]
[]
[]
[]
[]
[]
[]
[]
[]
[]
[]
[]
[]
[]
[]
[]
[]
[]
[]
[]
[]
[]
[null,null,null,null,null,null,null,null,null,null,null,null,null,null,null,null,null,null,null,null,null,null,null,null,null,null,null,null,null,null,null,null,null,null,null,null,null,null,null,null,null,null,null,null,null,null,null,null,null,null,null,null,"Raw numbers of respondents:","Basic water, sanitation and hygiene","NATIONAL wealth index quintile",null,null,null,null,"URBAN wealth index quintile",null,null,null,null,"RURAL wealth index quintile",null,null,null,null,"SUB-REGIONS:"]
[null,null,null,null,null,null,null,null,null,null,null,null,null,null,null,null,null,null,null,null,null,null,null,null,null,null,null,null,null,null,null,null,null,null,null,null,null,null,null,null,null,null,null,null,null,null,null,null,null,null,null,null,"WatSan data, raw numbers (weighted)",null,"Poorest","Poor","Middle","Rich","Richest","Poorest","Poor","Middle","Rich","Richest","Poorest","Poor","Middle","Rich","Richest","Central","East","North West","South West","Tobago"]
[null,null,null,null,null,null,null,null,null,null,null,null,null,null,null,null,null,null,null,null,null,null,null,null,null,null,null,null,null,null,null,null,null,null,null,null,null,null,null,null,null,null,null,null,null,null,null,null,null,null,null,null,"Use of Basic Water Sanitation and Hygiene","Yes","N/A","N/A","N/A","N/A","N/A","N/A","N/A","N/A","N/A","N/A","N/A","N/A","N/A","N/A","N/A","N/A","N/A","N/A","N/A","N/A"]
[null,null,null,null,null,null,null,null,null,null,null,null,null,null,null,null,null,null,null,null,null,null,null,null,null,null,null,null,null,null,null,null,null,null,null,null,null,null,null,null,null,null,null,null,null,null,null,null,null,null,null,null,null,"No","N/A","N/A","N/A","N/A","N/A","N/A","N/A","N/A","N/A","N/A","N/A","N/A","N/A","N/A","N/A","N/A","N/A","N/A","N/A","N/A"]
[null,null,null,null,null,null,null,null,null,null,null,null,null,null,null,null,null,null,null,null,null,null,null,null,null,null,null,null,null,null,null,null,null,null,null,null,null,null,null,null,null,null,null,null,null,null,null,null,null,null,null,null,"Use of Basic Water and Sanitation","Yes","N/A","N/A","N/A","N/A","N/A","N/A","N/A","N/A","N/A","N/A","N/A","N/A","N/A","N/A","N/A","N/A","N/A","N/A","N/A","N/A"]
[null,null,null,null,null,null,null,null,null,null,null,null,null,null,null,null,null,null,null,null,null,null,null,null,null,null,null,null,null,null,null,null,null,null,null,null,null,null,null,null,null,null,null,null,null,null,null,null,null,null,null,null,null,"No","N/A","N/A","N/A","N/A","N/A","N/A","N/A","N/A","N/A","N/A","N/A","N/A","N/A","N/A","N/A","N/A","N/A","N/A","N/A","N/A"]
[null,null,null,null,null,null,null,null,null,null,null,null,null,null,null,null,null,null,null,null,null,null,null,null,null,null,null,null,null,null,null,null,null,null,null,null,null,null,null,null,null,null,null,null,null,null,null,null,null,null,null,null,"Use of Basic Water and Hygiene","Yes","N/A","N/A","N/A","N/A","N/A","N/A","N/A","N/A","N/A","N/A","N/A","N/A","N/A","N/A","N/A","N/A","N/A","N/A","N/A","N/A"]
[null,null,null,null,null,null,null,null,null,null,null,null,null,null,null,null,null,null,null,null,null,null,null,null,null,null,null,null,null,null,null,null,null,null,null,null,null,null,null,null,null,null,null,null,null,null,null,null,null,null,null,null,null,"No","N/A","N/A","N/A","N/A","N/A","N/A","N/A","N/A","N/A","N/A","N/A","N/A","N/A","N/A","N/A","N/A","N/A","N/A","N/A","N/A"]
[null,null,null,null,null,null,null,null,null,null,null,null,null,null,null,null,null,null,null,null,null,null,null,null,null,null,null,null,null,null,null,null,null,null,null,null,null,null,null,null,null,null,null,null,null,null,null,null,null,null,null,null,"Use of Basic Sanitation and Hygiene","Yes","N/A","N/A","N/A","N/A","N/A","N/A","N/A","N/A","N/A","N/A","N/A","N/A","N/A","N/A","N/A","N/A","N/A","N/A","N/A","N/A"]
[null,null,null,null,null,null,null,null,null,null,null,null,null,null,null,null,null,null,null,null,null,null,null,null,null,null,null,null,null,null,null,null,null,null,null,null,null,null,null,null,null,null,null,null,null,null,null,null,null,null,null,null,null,"No","N/A","N/A","N/A","N/A","N/A","N/A","N/A","N/A","N/A","N/A","N/A","N/A","N/A","N/A","N/A","N/A","N/A","N/A","N/A","N/A"]
[null,null,null,null,null,null,null,null,null,null,null,null,null,null,null,null,null,null,null,null,null,null,null,null,null,null,null,null,null,null,null,null,null,null,null,null,null,null,null,null,null,null,null,null,null,null,null,null,null,null,null,null,"Use of Basic Water","Yes","N/A","N/A","N/A","N/A","N/A","N/A","N/A","N/A","N/A","N/A","N/A","N/A","N/A","N/A","N/A","N/A","N/A","N/A","N/A","N/A"]
[null,null,null,null,null,null,null,null,null,null,null,null,null,null,null,null,null,null,null,null,null,null,null,null,null,null,null,null,null,null,null,null,null,null,null,null,null,null,null,null,null,null,null,null,null,null,null,null,null,null,null,null,null,"No","N/A","N/A","N/A","N/A","N/A","N/A","N/A","N/A","N/A","N/A","N/A","N/A","N/A","N/A","N/A","N/A","N/A","N/A","N/A","N/A"]
[null,null,null,null,null,null,null,null,null,null,null,null,null,null,null,null,null,null,null,null,null,null,null,null,null,null,null,null,null,null,null,null,null,null,null,null,null,null,null,null,null,null,null,null,null,null,null,null,null,null,null,null,"Use of Basic Sanitation","Yes","N/A","N/A","N/A","N/A","N/A","N/A","N/A","N/A","N/A","N/A","N/A","N/A","N/A","N/A","N/A","N/A","N/A","N/A","N/A","N/A"]
[null,null,null,null,null,null,null,null,null,null,null,null,null,null,null,null,null,null,null,null,null,null,null,null,null,null,null,null,null,null,null,null,null,null,null,null,null,null,null,null,null,null,null,null,null,null,null,null,null,null,null,null,null,"No","N/A","N/A","N/A","N/A","N/A","N/A","N/A","N/A","N/A","N/A","N/A","N/A","N/A","N/A","N/A","N/A","N/A","N/A","N/A","N/A"]
[null,null,null,null,null,null,null,null,null,null,null,null,null,null,null,null,null,null,null,null,null,null,null,null,null,null,null,null,null,null,null,null,null,null,null,null,null,null,null,null,null,null,null,null,null,null,null,null,null,null,null,null,"Access to Basic Hygiene","Yes","N/A","N/A","N/A","N/A","N/A","N/A","N/A","N/A","N/A","N/A","N/A","N/A","N/A","N/A","N/A","N/A","N/A","N/A","N/A","N/A"]
[null,null,null,null,null,null,null,null,null,null,null,null,null,null,null,null,null,null,null,null,null,null,null,null,null,null,null,null,null,null,null,null,null,null,null,null,null,null,null,null,null,null,null,null,null,null,null,null,null,null,null,null,null,"No","N/A","N/A","N/A","N/A","N/A","N/A","N/A","N/A","N/A","N/A","N/A","N/A","N/A","N/A","N/A","N/A","N/A","N/A","N/A","N/A"]
[]
[]
[]
[]
[]
[]
[]
[]
[]
[]
[]
[]
[]
[]
[]
[]
[]
[]
[]
[]
[]
[]
[]
[]
[]
[]
[]
[]
[]
[]
[]
[]
[]
[]
[]
[]
[]
[]
[]
[]
[]
[]
[]
[]
[null,null,"INITIAL (national) Wealth Index",null,null,null,null,"URBAN Wealth Index",null,null,null,null,"RURAL Wealth Index"]
[null,null,"Component Matrix",null,null,null,null,"Component Matrix",null,null,null,null,"Component Matrix"]
[null,null,null,null,"Component",null,null,null,null,"Component",null,null,null,null,"Component"]
[null,"Note:\n\nThe INITIAL (national) Wealth Index is based on the first component of the Principal Component Analysis (PCA) which has been obtained at national level.\n\nThe final national-level (NATIONAL) Wealth Index is based on the URBAN and RURAL specific wealth indexes. Regression procedures are used to establish the relationships between the two sets of scores (urban and rural) and the initial (national) wealth factors.\nThis allows best use of the available information for each area and a better precision of the FINAL (NATIONAL) Wealth Index.\n\nFor dependency reasons, all WASH variables (contained in the generic MICS and DHS scripts) have been excluded from the sets of asset variables used in the PCAs.\n\nThe PCA can extracts as many components as there are asset variables in the input. Only the first of the components is used to represent the Wealth Index. \n\nThe scores represent the weights of the asset variables on the Wealth Index (correlations between the variables and the component).\n\nThe communalities are the proportion of each variable's variance that can be explained by the component.\n\nProportion of explained variance is the part of the model's total variance that is explained by the component.\n\nFor more information on the procedure used:\n\nThe DHS Wealth Index, DHS Comparative Reports No. 6, Shea Oscar Rutstein, Kiersten Johnson, ORC Macro International Inc., 2004.\n\nThe DHS Wealth Index: Approaches for Rural and Urban Areas, Shea O. Rutstein, ORC Macro International Inc., 2008.\n\nMICS Methodological Paper No. 4, Review of options for reporting water, sanitation and hygiene coverage by wealth quintile, UNICEF, 2016.",null,null,"1",null,null,null,null,"1",null,null,null,null,"1"]
[null,null,"Internet Service",null,0.64807082223868384,null,null,"Internet Service",null,0.68951180434776793,null,null,"Microwave Oven",null,0.64858400089875634]
[null,null,"Computer",null,0.63688710434995877,null,null,"Computer",null,0.65989815423341747,null,null,"Refrigetaror",null,0.62153085448695844]
[null,null,"Microwave Oven",null,0.62809016848799837,null,null,"Cable/Direct TV",null,0.60232037387164605,null,null,"Washing Machine",null,0.61940026855370212]
[null,null,"Cable/Direct TV",null,0.59539120709567772,null,null,"Water Heater (Tank/Canister)",null,0.59192137845843207,null,null,"Computer",null,0.59309581240281528]
[null,null,"Washing Machine",null,0.58325085013450551,null,null,"Canoe",null,0.58922353601392674,null,null,"Television",null,0.58052192941005154]
[null,null,"Canoe",null,0.54743468238881443,null,null,"Air Condition Unit",null,0.58562487503220439,null,null,"Internet Service",null,0.57929032093195121]
[null,null,"Refrigetaror",null,0.54616150320424472,null,null,"Microwave Oven",null,0.58533125812655118,null,null,"Electricity",null,0.56231658984675936]
[null,null,"Non-mobile telephone",null,0.53580771819449635,null,null,"Clothes Dryer",null,0.56669026531458089,null,null,"Cable/Direct TV",null,0.55910509375130191]
[null,null,"Air Condition Unit",null,0.52720242044613985,null,null,"Washing Machine",null,0.54239931965466182,null,null,"Stereo or radio with CD Player",null,0.53700455306405603]
[null,null,"Water Heater (Tank/Canister)",null,0.52055291485043242,null,null,"Non-mobile telephone",null,0.52609690581786672,null,null,"Canoe",null,0.53441197578532129]
[null,null,"Stereo or radio with CD Player",null,0.51247970886345151,null,null,"Stereo or radio with CD Player",null,0.47609816751803435,null,null,"Non-mobile telephone",null,0.5224878701064597]
[null,null,"Television",null,0.49716228140588481,null,null,"Ceramic tiles floor",null,0.44400632797534773,null,null,"DVD Player",null,0.51048232198454746]
[null,null,"Clothes Dryer",null,0.49287573467955526,null,null,"IPOD",null,0.44265171519611463,null,null,"Air Condition Unit",null,0.45841786021317255]
[null,null,"Electricity",null,0.48800772166484735,null,null,"Refrigetaror",null,0.43012552397254256,null,null,"Water Heater (Tank/Canister)",null,0.43107258956375738]
[null,null,"DVD Player",null,0.46102334556454677,null,null,"MP3 Player",null,0.41716203273115332,null,null,"Household owns bank account",null,0.41567202474683412]
[null,null,"Ceramic tiles floor",null,0.4373005754155011,null,null,"DVD Player",null,0.39343263939375994,null,null,"Clothes Dryer",null,0.39873855307998479]
[null,null,"MP3 Player",null,0.40083626860364524,null,null,"Television",null,0.37392100646442683,null,null,"Radio",null,0.39184876989932604]
[null,null,"IPOD",null,0.39462233581884659,null,null,"Electricity",null,0.3686397280701359,null,null,"Ceramic tiles floor",null,0.38711932120046533]
[null,null,"Household owns bank account",null,0.38092330982393841,null,null,"Household owns bank account",null,0.34894943578109727,null,null,"Wood planks floor",null,-0.37394796732011387]
[null,null,"Wood planks floor",null,-0.36255052724005604,null,null,"Wood planks floor",null,-0.31873216348590816,null,null,"MP3 Player",null,0.37088414256645597]
[null,null,"Sewing Machine",null,0.34588107889960867,null,null,"Sewing Machine",null,0.31367835130132499,null,null,"Sewing Machine",null,0.36821160688172017]
[null,null,"Plywood walls",null,-0.3396944459874543,null,null,"Electricity fuel",null,0.29712855799974563,null,null,"Plywood walls",null,-0.36027363533573559]
[null,null,"Radio",null,0.32384053699374227,null,null,"Radio",null,0.28512560545999727,null,null,"Mobile telephone",null,0.32770735093669934]
[null,null,"Mobile telephone",null,0.27486539392047887,null,null,"A lawn mower",null,0.28189799665583931,null,null,"IPOD",null,0.32388460888433984]
[null,null,"Wood planks/shingles walls",null,-0.270271046069682,null,null,"LPG fuel",null,-0.27255678865691568,null,null,"Stove that works with solar energy",null,0.30384261409801444]
[null,null,"Stove that works with solar energy",null,0.26156827954179651,null,null,"Plywood walls",null,-0.2641449945577577,null,null,"Smart board/Fiber cement board walls",null,0.28303215141020266]
[null,null,"Smart board/Fiber cement board walls",null,0.24710006498179773,null,null,"Mobile telephone",null,0.23123966883560296,null,null,"Wood planks/shingles walls",null,-0.26888831923438222]
[null,null,"Electricity fuel",null,0.24216265885219346,null,null,"Stove that works with solar energy",null,0.21447034221899436,null,null,"Cement walls",null,0.2488667692032582]
[null,null,"A lawn mower",null,0.2256050347081725,null,null,"Wood planks/shingles walls",null,-0.2099663270655899,null,null,"Dirt",null,-0.19003773474776633]
[null,null,"LPG fuel",null,-0.1970324338821689,null,null,"Owns dwelling",null,0.16836952870302255,null,null,"Other dwelling arrangement",null,-0.18103092995864006]
[null,null,"Cement walls",null,0.18326960653827598,null,null,"Reused wood walls",null,-0.16155639697644814,null,null,"Reused wood walls",null,-0.18047143427411827]
[null,null,"Reused wood walls",null,-0.17693300363231132,null,null,"Vinyl/asphalt strip floor",null,-0.15876609674068184,null,null,"A lawn mower",null,0.17238211141602061]
[null,null,"Dirt",null,-0.16774890583641783,null,null,"Cement floor",null,-0.15755301105761554,null,null,"Electricity fuel",null,0.14616664546690633]
[null,null,"Other dwelling arrangement",null,-0.16718016193011451,null,null,"Other dwelling arrangement",null,-0.14680496259073289,null,null,"Parquet/polished wood floor",null,-0.14295490242316791]
[null,null,"Parquet/polished wood floor",null,-0.13182446593383013,null,null,"Persons per sleeping rooms",null,-0.145662256187815,null,null,"Owns dwelling",null,0.13884537934639016]
[null,null,"Metal/jenco walls",null,-0.11932008316911483,null,null,"Smart board/Fiber cement board walls",null,0.1450977014891954,null,null,"Metal/jenco walls",null,-0.1356732910376327]
[null,null,"Owns dwelling",null,0.1114753291758265,null,null,"Dirt",null,-0.14006544450356917,null,null,"A cutlass or gilpin",null,0.13181246944199515]
[null,null,"A brushing cutlass",null,-9.6300552060160999E-2,null,null,"Soil block walls",null,-0.11355247907563754,null,null,"Finished wooden walls",null,-0.11513968581484255]
[null,null,"Finished wooden walls",null,-9.2482329891234089E-2,null,null,"Cement walls",null,0.10754857199320571,null,null,"cooks on open owen",null,-0.10668270700839187]
[null,null,"does not cook",null,-9.2237496919491416E-2,null,null,"Boat with motor",null,0.107314028531645,null,null,"Cement floor",null,0.10503831705207874]
[null,null,"Persons per sleeping rooms",null,-8.8097953124446626E-2,null,null,"does not cook",null,-0.10300858524515147,null,null,"does not cook",null,-0.10310222378353884]
[null,null,"Roof tiles",null,-8.0507019093818091E-2,null,null,"A cutlass or gilpin",null,0.10093989479165559,null,null,"Cardboard walls",null,-0.10309916318042638]
[null,null,"cooks on open owen",null,-7.8481326409303581E-2,null,null,"Metal/jenco walls",null,-0.10014226187618185,null,null,"Tapia",null,-8.3299000430269957E-2]
[null,null,"Vinyl/asphalt strip floor",null,-6.7765444562229382E-2,null,null,"pig0",null,9.9620199487723562E-2,null,null,"Small land",null,8.2657141276735846E-2]
[null,null,"Roofing shingles roof",null,6.4815618307889747E-2,null,null,"Rents dwelling",null,-9.4579538770951072E-2,null,null,"chicken0",null,-8.0959694508483837E-2]
[null,null,"Boat with motor",null,6.3787266198481268E-2,null,null,"pig5",null,-9.2598392743984681E-2,null,null,"Stone with lime/cement walls",null,8.0398606293632005E-2]
[null,null,"Natural gas fuel",null,6.1359658790384769E-2,null,null,"Medium land",null,8.3734924255800744E-2,null,null,"Dirt walls",null,-7.5672829217939858E-2]
[null,null,"A cutlass or gilpin",null,5.9005972412968746E-2,null,null,"Roofing shingles roof",null,7.2780215466552764E-2,null,null,"Carpet floor",null,7.3489435367251443E-2]
[null,null,"Metal/tin roof",null,5.6983263363524508E-2,null,null,"Natural gas fuel",null,7.0794506897226106E-2,null,null,"chicken10",null,6.8167053104366035E-2]
[null,null,"Cardboard walls",null,-5.5973819888369747E-2,null,null,"cattle5",null,-7.0100183201740163E-2,null,null,"Roof tiles",null,-5.29633762657086E-2]
[null,null,"Soil block walls",null,-5.590104841682967E-2,null,null,"Cement blocks walls",null,6.7762884311635171E-2,null,null,"LPG fuel",null,-5.0385300602938513E-2]
[null,null,"Cement roof",null,5.5667756204394736E-2,null,null,"chicken0",null,6.4622237605092198E-2,null,null,"Cement roof",null,4.9493701806100611E-2]
[null,null,"Carpet floor",null,4.9513737653253669E-2,null,null,"Parquet/polished wood floor",null,-6.1614072173785485E-2,null,null,"sheep30",null,4.7879639785829944E-2]
[null,null,"Stone with lime/cement walls",null,4.6455288165701963E-2,null,null,"Pierre",null,-6.0330225196587949E-2,null,null,"chicken30",null,4.2875370050588515E-2]
[null,null,"Tapia",null,-4.3855589065815388E-2,null,null,"pig1",null,-5.4171702115133773E-2,null,null,"sheep10",null,4.1139165379228314E-2]
[null,null,"Dirt walls",null,-3.9208892374269673E-2,null,null,"chicken30",null,-5.2897379972676725E-2,null,null,"sheep0",null,-4.0857475838161655E-2]
[null,null,"Ceramic tiles roof",null,3.845562051933455E-2,null,null,"cattle10",null,5.2833730698187635E-2,null,null,"Roofing shingles roof",null,4.0452696035662289E-2]
[null,null,"Pierre",null,-3.2837676984026606E-2,null,null,"Metal/tin roof",null,5.0430984512387957E-2,null,null,"Boat for fishing",null,3.2674516375622575E-2]
[null,null,"Wood roof",null,-2.8189470377461067E-2,null,null,"Finished wooden walls",null,-5.039513113800384E-2,null,null,"Boat with motor",null,3.2279130983968542E-2]
[null,null,"Boat for fishing",null,2.7035144561066402E-2,null,null,"Ceramic tiles roof",null,4.8995207671084347E-2,null,null,"Metal/tin roof",null,3.2220808842732915E-2]
[null,null,"Cement floor",null,-2.5807848830305596E-2,null,null,"goat1",null,-4.2526092372780662E-2,null,null,"Cement blocks walls",null,-3.203234180955581E-2]
[null,null,"No roof",null,1.9320680951642032E-2,null,null,"chicken10",null,-4.1786747207321152E-2,null,null,"pig10",null,3.1644624591383445E-2]
[null,null,"Wood planks roof",null,-1.3273063898197886E-2,null,null,"Wood roof",null,-4.0923435809517072E-2,null,null,"Medium land",null,2.9496142244280148E-2]
[null,null,"Cement blocks walls",null,1.2982652420523098E-2,null,null,"Cardboard walls",null,-4.0652180764858228E-2,null,null,"pig5",null,-2.6438153432461215E-2]
[null,null,"Rents dwelling",null,-2.9506065039348419E-3,null,null,"Small land",null,3.9614923658523073E-2,null,null,"horse1",null,-2.5795311598198593E-2]
[null,null,"Brick walls",null,-1.2237279875729095E-3,null,null,"Roof tiles",null,-3.89923394492439E-2,null,null,"cattle5",null,2.3199159026395834E-2]
[null,null,null,null,null,null,null,"Boat for fishing",null,3.746501626926383E-2,null,null,"Persons per sleeping rooms",null,-2.2862348306592103E-2]
[null,null,null,null,null,null,null,"goat10",null,3.6256476996809957E-2,null,null,"A brushing cutlass",null,-2.2520532538989686E-2]
[null,null,null,null,null,null,null,"cattle1",null,-3.5425425100843316E-2,null,null,"chicken1",null,2.0569862429435655E-2]
[null,null,"Communalities",null,null,null,null,"A brushing cutlass",null,-3.4581824995512447E-2,null,null,"goat1",null,-1.9379638280279898E-2]
[null,null,null,null,"Extraction",null,null,"goat0",null,2.6951137412887318E-2,null,null,"cattle1",null,-1.9007766116289449E-2]
[null,null,"Persons per sleeping rooms",null,7.7612493447171953E-3,null,null,"No roof",null,2.5575927699585745E-2,null,null,"Wood roof",null,-1.867983600002162E-2]
[null,null,"Dirt",null,2.8139695409315376E-2,null,null,"cattle0",null,2.5052878023879854E-2,null,null,"goat30",null,1.7865011793221777E-2]
[null,null,"Tapia",null,1.9233126923096661E-3,null,null,"Wood planks roof",null,-2.4497811180432573E-2,null,null,"goat0",null,1.7167542602454806E-2]
[null,null,"Wood planks floor",null,0.13144288480204261,null,null,"Big land",null,2.1773906507323759E-2,null,null,"cattle10",null,1.5902589219828338E-2]
[null,null,"Parquet/polished wood floor",null,1.737768981873954E-2,null,null,"chicken1",null,-2.148052716518609E-2,null,null,"horse0",null,1.4800216707333991E-2]
[null,null,"Vinyl/asphalt strip floor",null,4.5921554767165834E-3,null,null,"Dirt walls",null,-1.9780747023153852E-2,null,null,"Soil block walls",null,-1.3541316296736829E-2]
[null,null,"Ceramic tiles floor",null,0.19123179325872836,null,null,"sheep10",null,1.9144406438637008E-2,null,null,"sheep1",null,1.1568074513531913E-2]
[null,null,"Cement floor",null,6.6604506124790593E-4,null,null,"Tapia",null,1.6342937366996262E-2,null,null,"Brick walls",null,-1.1543974218409171E-2]
[null,null,"Carpet floor",null,2.4516102163952302E-3,null,null,"sheep0",null,-1.2824352856831863E-2,null,null,"horse10",null,1.0847808193797978E-2]
[null,null,"No roof",null,3.7328871243514326E-4,null,null,"Carpet floor",null,1.083186216109149E-2,null,null,"Natural gas fuel",null,-8.4826689212997106E-3]
[null,null,"Wood planks roof",null,1.7617422524564405E-4,null,null,"pig10",null,-8.0891930887402822E-3,null,null,"pig1",null,-7.7204127418122872E-3]
[null,null,"Metal/tin roof",null,3.2470923035567943E-3,null,null,"Cement roof",null,3.6378416762429195E-3,null,null,"Wood planks roof",null,-6.7445371878810901E-3]
[null,null,"Wood roof",null,7.9464624016175505E-4,null,null,"Stone with lime/cement walls",null,3.546611520714206E-3,null,null,"Rents dwelling",null,-5.9365703280046733E-3]
[null,null,"Ceramic tiles roof",null,1.4788347495270646E-3,null,null,"Brick walls",null,3.4976605077235712E-3,null,null,"goat10",null,-4.5448237286209265E-3]
[null,null,"Cement roof",null,3.0988990808319288E-3,null,null,"sheep1",null,9.1528236034834427E-4,null,null,"Big land",null,-3.9278967838323612E-3]
[null,null,"Roofing shingles roof",null,4.201064376634053E-3,null,null,null,null,null,null,null,"Vinyl/asphalt strip floor",null,-1.0394153038669703E-3]
[null,null,"Roof tiles",null,6.4813801233723906E-3,null,null,null,null,null,null,null,"cattle0",null,9.0948560710922067E-4]
[null,null,"Dirt walls",null,1.5373372412170625E-3,null,null,null,null,null,null,null,"pig0",null,8.8498949267005512E-4]
[null,null,"Pierre",null,1.0783130297072707E-3,null,null,"Communalities"]
[null,null,"Plywood walls",null,0.1153923166347235,null,null,null,null,"Extraction"]
[null,null,"Cardboard walls",null,3.1330685128956566E-3,null,null,"Persons per sleeping rooms",null,2.1217492877724651E-2]
[null,null,"Reused wood walls",null,3.1305287774351494E-2,null,null,"Dirt",null,1.9618328743982415E-2,null,null,"Communalities"]
[null,null,"Finished wooden walls",null,8.5529813421110507E-3,null,null,"Tapia",null,2.6709160178156269E-4,null,null,null,null,"Extraction"]
[null,null,"Cement walls",null,3.3587748680694487E-2,null,null,"Wood planks floor",null,0.10159019204040769,null,null,"Persons per sleeping rooms",null,5.226869700919348E-4]
[null,null,"Stone with lime/cement walls",null,2.1580937985584089E-3,null,null,"Parquet/polished wood floor",null,3.7962938898364468E-3,null,null,"Dirt",null,3.6114340628062395E-2]
[null,null,"Brick walls",null,1.4975101875692428E-6,null,null,"Vinyl/asphalt strip floor",null,2.5206673474271545E-2,null,null,"Tapia",null,6.9387234726821147E-3]
[null,null,"Cement blocks walls",null,1.6854926387211425E-4,null,null,"Ceramic tiles floor",null,0.19714161928215204,null,null,"Wood planks floor",null,0.13983708226284494]
[null,null,"Wood planks/shingles walls",null,7.3046438343600167E-2,null,null,"Cement floor",null,2.4822951293321127E-2,null,null,"Parquet/polished wood floor",null,2.0436104126817459E-2]
[null,null,"Metal/jenco walls",null,1.4237282247484479E-2,null,null,"Carpet floor",null,1.173292378768856E-4,null,null,"Vinyl/asphalt strip floor",null,1.0803841739128664E-6]
[null,null,"Soil block walls",null,3.124927214100735E-3,null,null,"No roof",null,6.5412807769443739E-4,null,null,"Ceramic tiles floor",null,0.14986136884670903]
[null,null,"Smart board/Fiber cement board walls",null,6.1058442114008661E-2,null,null,"Wood planks roof",null,6.0014275263212721E-4,null,null,"Cement floor",null,1.1033048049133014E-2]
[null,null,"Electricity fuel",null,5.8642753342363831E-2,null,null,"Metal/tin roof",null,2.5432841988887139E-3,null,null,"Carpet floor",null,5.4006971105974274E-3]
[null,null,"LPG fuel",null,3.8821780001531261E-2,null,null,"Wood roof",null,1.6747275984556644E-3,null,null,"Wood planks roof",null,4.5488781878710962E-5]
[null,null,"Natural gas fuel",null,3.7650077268724428E-3,null,null,"Ceramic tiles roof",null,2.4005303747326825E-3,null,null,"Metal/tin roof",null,1.0381805224799355E-3]
[null,null,"cooks on open owen",null,6.1593185949636517E-3,null,null,"Cement roof",null,1.3233892061409894E-5,null,null,"Wood roof",null,3.4893627298770373E-4]
[null,null,"does not cook",null,8.5077558379731879E-3,null,null,"Roofing shingles roof",null,5.2969597633578461E-3,null,null,"Cement roof",null,2.4496265184712068E-3]
[null,null,"Owns dwelling",null,1.2426749014858875E-2,null,null,"Roof tiles",null,1.5204025357250621E-3,null,null,"Roofing shingles roof",null,1.6364206165536874E-3]
[null,null,"Rents dwelling",null,8.7060787410625909E-6,null,null,"Dirt walls",null,3.9127795279400996E-4,null,null,"Roof tiles",null,2.805119225463025E-3]
[null,null,"Other dwelling arrangement",null,2.7949206542979308E-2,null,null,"Pierre",null,3.6397360722710153E-3,null,null,"Dirt walls",null,5.7263770818474918E-3]
[null,null,"Electricity",null,0.23815153640451511,null,null,"Plywood walls",null,6.9772578149917844E-2,null,null,"Plywood walls",null,0.12979709231802658]
[null,null,"Radio",null,0.10487269340039536,null,null,"Cardboard walls",null,1.6525998009387093E-3,null,null,"Cardboard walls",null,1.0629437448504185E-2]
[null,null,"Television",null,0.24717033405270419,null,null,"Reused wood walls",null,2.61004694040117E-2,null,null,"Reused wood walls",null,3.2569938588957389E-2]
[null,null,"Non-mobile telephone",null,0.28708991087679281,null,null,"Finished wooden walls",null,2.5396692424166042E-3,null,null,"Finished wooden walls",null,1.3257147249540654E-2]
[null,null,"Refrigetaror",null,0.29829238758232024,null,null,"Cement walls",null,1.156669533777775E-2,null,null,"Cement walls",null,6.1934668813667784E-2]
[null,null,"Stove that works with solar energy",null,6.8417964862455397E-2,null,null,"Stone with lime/cement walls",null,1.2578453278862733E-5,null,null,"Stone with lime/cement walls",null,6.4639358939584442E-3]
[null,null,"Washing Machine",null,0.34018155418262341,null,null,"Brick walls",null,1.223362902728911E-5,null,null,"Brick walls",null,1.3326334075529564E-4]
[null,null,"Clothes Dryer",null,0.24292648983591134,null,null,"Cement blocks walls",null,4.5918084902320522E-3,null,null,"Cement blocks walls",null,1.0260709218042172E-3]
[null,null,"Water Heater (Tank/Canister)",null,0.27097533715928157,null,null,"Wood planks/shingles walls",null,4.408585850141427E-2,null,null,"Wood planks/shingles walls",null,7.2300928220691049E-2]
[null,null,"Microwave Oven",null,0.39449725975128219,null,null,"Metal/jenco walls",null,1.0028472613677784E-2,null,null,"Metal/jenco walls",null,1.8407241900982186E-2]
[null,null,"Air Condition Unit",null,0.27794239212426841,null,null,"Soil block walls",null,1.28941655042231E-2,null,null,"Soil block walls",null,1.8336724704827044E-4]
[null,null,"Internet Service",null,0.41999579063712378,null,null,"Smart board/Fiber cement board walls",null,2.1053342977447657E-2,null,null,"Smart board/Fiber cement board walls",null,8.0107198731887888E-2]
[null,null,"Cable/Direct TV",null,0.3544906894868482,null,null,"Electricity fuel",null,8.8285379979008205E-2,null,null,"Electricity fuel",null,2.1364688247048288E-2]
[null,null,"DVD Player",null,0.21254252515552752,null,null,"LPG fuel",null,7.4287203042970595E-2,null,null,"LPG fuel",null,2.5386785168484759E-3]
[null,null,"A cutlass or gilpin",null,3.4817047804000288E-3,null,null,"Natural gas fuel",null,5.0118622068213948E-3,null,null,"Natural gas fuel",null,7.1955672028384003E-5]
[null,null,"A brushing cutlass",null,9.2737963270917781E-3,null,null,"does not cook",null,1.0610768634207637E-2,null,null,"cooks on open owen",null,1.1381199974638384E-2]
[null,null,"A lawn mower",null,5.0897631685675716E-2,null,null,"Owns dwelling",null,2.8348298195677933E-2,null,null,"does not cook",null,1.0630068549110921E-2]
[null,null,"Mobile telephone",null,7.5550984775060018E-2,null,null,"Rents dwelling",null,8.9452891541258375E-3,null,null,"Owns dwelling",null,1.9278039365842988E-2]
[null,null,"Computer",null,0.40562518368727529,null,null,"Other dwelling arrangement",null,2.1551697041266485E-2,null,null,"Rents dwelling",null,3.5242867259345514E-5]
[null,null,"Sewing Machine",null,0.11963372074075732,null,null,"Electricity",null,0.13589524911162373,null,null,"Other dwelling arrangement",null,3.2772197601690041E-2]
[null,null,"Stereo or radio with CD Player",null,0.26263545199676802,null,null,"Radio",null,8.1296610888930018E-2,null,null,"Electricity",null,0.3161999472168886]
[null,null,"Boat for fishing",null,7.308990414377583E-4,null,null,"Television",null,0.13981691907536994,null,null,"Radio",null,0.15354545847161497]
[null,null,"Boat with motor",null,4.0688153290759106E-3,null,null,"Non-mobile telephone",null,0.27677795431113333,null,null,"Television",null,0.33700571052596884]
[null,null,"MP3 Player",null,0.16066971422809365,null,null,"Refrigetaror",null,0.18500796637265429,null,null,"Non-mobile telephone",null,0.27299357440838468]
[null,null,"IPOD",null,0.15572678792712252,null,null,"Stove that works with solar energy",null,4.5997527691532557E-2,null,null,"Refrigetaror",null,0.38630060307928871]
[null,null,"Canoe",null,0.29968473148214214,null,null,"Washing Machine",null,0.29419702196184,null,null,"Stove that works with solar energy",null,9.2320334141914928E-2]
[null,null,"Household owns bank account",null,0.14510256796722418,null,null,"Clothes Dryer",null,0.32113785680231005,null,null,"Washing Machine",null,0.38365669268439828]
[null,null,null,null,null,null,null,"Water Heater (Tank/Canister)",null,0.35037091827613037,null,null,"Clothes Dryer",null,0.15899243371231986]
[null,null,null,null,null,null,null,"Microwave Oven",null,0.3426126817400113,null,null,"Water Heater (Tank/Canister)",null,0.18582357747320363]
[null,null,"Total Variance Explained",null,null,null,null,"Air Condition Unit",null,0.342956494256485,null,null,"Microwave Oven",null,0.42066120622183795]
[null,null,"Component",null,"Extraction Sums of Squared Loadings",null,null,"Internet Service",null,0.47542652833491461,null,null,"Air Condition Unit",null,0.21014693456242381]
[null,null,null,null,"Total","% of Variance","Cumulative %","Cable/Direct TV",null,0.36278983278087951,null,null,"Internet Service",null,0.33557727592544301]
[null,null,"1",null,6.3607302322199484,9.6374700488181038,9.6374700488181038,"DVD Player",null,0.15478924174034034,null,null,"Cable/Direct TV",null,0.31259850585865212]
[null,null,null,null,null,null,null,"A cutlass or gilpin",null,1.0188862360550499E-2,null,null,"DVD Player",null,0.26059220105873521]
[null,null,null,null,null,null,null,"A brushing cutlass",null,1.1959026200202495E-3,null,null,"A cutlass or gilpin",null,1.7374527100396907E-2]
[null,null,"Component Score Coefficient Matrix",null,null,null,null,"A lawn mower",null,7.9466480518575591E-2,null,null,"A brushing cutlass",null,5.071743858396932E-4]
[null,null,null,null,"Component",null,null,"Mobile telephone",null,5.3471784443199326E-2,null,null,"A lawn mower",null,2.9715592336245343E-2]
[null,null,null,null,"1",null,null,"Computer",null,0.4354655739606712,null,null,"Mobile telephone",null,0.10739210785794902]
[null,null,"Persons per sleeping rooms",null,-1.3850289181923015E-2,null,null,"Sewing Machine",null,9.8394108075117448E-2,null,null,"Computer",null,0.35176264268975543]
[null,null,"Dirt",null,-2.6372586120174447E-2,null,null,"Stereo or radio with CD Player",null,0.2266694651140303,null,null,"Sewing Machine",null,0.13557978744241844]
[null,null,"Tapia",null,-6.8947412427062503E-3,null,null,"Boat for fishing",null,1.4036274440562034E-3,null,null,"Stereo or radio with CD Player",null,0.28837389001152658]
[null,null,"Wood planks floor",null,-5.6998255546757061E-2,null,null,"Boat with motor",null,1.1516300719690717E-2,null,null,"Boat for fishing",null,1.0676240203808278E-3]
[null,null,"Parquet/polished wood floor",null,-2.07247377456884E-2,null,null,"MP3 Player",null,0.17402416155238784,null,null,"Boat with motor",null,1.0419422970801978E-3]
[null,null,"Vinyl/asphalt strip floor",null,-1.0653720891819469E-2,null,null,"IPOD",null,0.19594054096606217,null,null,"MP3 Player",null,0.13755504720725523]
[null,null,"Ceramic tiles floor",null,6.8750058476050077E-2,null,null,"Canoe",null,0.34718437539275521,null,null,"IPOD",null,0.10490123987216179]
[null,null,"Cement floor",null,-4.0573720136058084E-3,null,null,"Household owns bank account",null,0.12176570873194613,null,null,"Canoe",null,0.28559615986277082]
[null,null,"Carpet floor",null,7.7842851128073938E-3,null,null,"Small land",null,1.5693421764706112E-3,null,null,"Household owns bank account",null,0.17278323215713268]
[null,null,"No roof",null,3.0374941628201939E-3,null,null,"Medium land",null,7.011537540124688E-3,null,null,"Small land",null,6.8322030040422685E-3]
[null,null,"Wood planks roof",null,-2.0867201427540298E-3,null,null,"Big land",null,4.7410300458967594E-4,null,null,"Medium land",null,8.7002240729480793E-4]
[null,null,"Metal/tin roof",null,8.9586040097847167E-3,null,null,"cattle0",null,6.2764669727940212E-4,null,null,"Big land",null,1.5428373144440607E-5]
[null,null,"Wood roof",null,-4.4317978201101451E-3,null,null,"cattle1",null,1.2549607435754597E-3,null,null,"cattle0",null,8.2716406953882772E-7]
[null,null,"Ceramic tiles roof",null,6.0457870583065449E-3,null,null,"cattle5",null,4.9140356849175339E-3,null,null,"cattle1",null,3.6129517273156129E-4]
[null,null,"Cement roof",null,8.7517870074748025E-3,null,null,"cattle10",null,2.7914030994886144E-3,null,null,"cattle5",null,5.3820097953200332E-4]
[null,null,"Roofing shingles roof",null,1.0189964979110353E-2,null,null,"goat0",null,7.263638078483345E-4,null,null,"cattle10",null,2.5289234389460046E-4]
[null,null,"Roof tiles",null,-1.2656883117918436E-2,null,null,"goat1",null,1.8084685324982737E-3,null,null,"horse0",null,2.1904641458404822E-4]
[null,null,"Dirt walls",null,-6.1642124320347783E-3,null,null,"goat10",null,1.3145321242202096E-3,null,null,"horse1",null,6.6539810044815878E-4]
[null,null,"Pierre",null,-5.1625640115484E-3,null,null,"sheep0",null,1.6446402619653156E-4,null,null,"horse10",null,1.1767494260943056E-4]
[null,null,"Plywood walls",null,-5.3404944650340569E-2,null,null,"sheep1",null,8.3774179916483637E-7,null,null,"goat0",null,2.947245190071007E-4]
[null,null,"Cardboard walls",null,-8.7999047035255892E-3,null,null,"sheep10",null,3.6650829788772613E-4,null,null,"goat1",null,3.7557037987448997E-4]
[null,null,"Reused wood walls",null,-2.7816460873637802E-2,null,null,"chicken0",null,4.176033593088992E-3,null,null,"goat10",null,2.0655422724235822E-5]
[null,null,"Finished wooden walls",null,-1.4539577456495426E-2,null,null,"chicken1",null,4.6141304729429753E-4,null,null,"goat30",null,3.1915864637195314E-4]
[null,null,"Cement walls",null,2.8812667704398668E-2,null,null,"chicken10",null,1.7461322421685622E-3,null,null,"sheep0",null,1.6693333318659634E-3]
[null,null,"Stone with lime/cement walls",null,7.3034520361176629E-3,null,null,"chicken30",null,2.7981328079737409E-3,null,null,"sheep1",null,1.3382034795062661E-4]
[null,null,"Brick walls",null,-1.9238797164737137E-4,null,null,"pig0",null,9.924184145973838E-3,null,null,"sheep10",null,1.6924309280994974E-3]
[null,null,"Cement blocks walls",null,2.0410632028945584E-3,null,null,"pig1",null,2.9345733100507891E-3,null,null,"sheep30",null,2.2924599060208297E-3]
[null,null,"Wood planks/shingles walls",null,-4.2490568881641613E-2,null,null,"pig5",null,8.5744623387692346E-3,null,null,"chicken0",null,6.5544721349070278E-3]
[null,null,"Metal/jenco walls",null,-1.8758865541051422E-2,null,null,"pig10",null,6.5435044826923545E-5,null,null,"chicken1",null,4.231192403659085E-4]
[null,null,"Soil block walls",null,-8.7884639618366154E-3,null,null,null,null,null,null,null,"chicken10",null,4.6467471289334591E-3]
[null,null,"Smart board/Fiber cement board walls",null,3.8847751116707505E-2,null,null,null,null,null,null,null,"chicken30",null,1.8382973569749026E-3]
[null,null,"Electricity fuel",null,3.807151852243805E-2,null,null,"Total Variance Explained",null,null,null,null,"pig0",null,7.8320640213640154E-7]
[null,null,"LPG fuel",null,-3.0976385837605772E-2,null,null,"Component",null,"Extraction Sums of Squared Loadings",null,null,"pig1",null,5.9604772903937521E-5]
[null,null,"Natural gas fuel",null,9.6466375007653368E-3,null,null,null,null,"Total","% of Variance","Cumulative %","pig5",null,6.9897595691836075E-4]
[null,null,"cooks on open owen",null,-1.233841454425476E-2,null,null,"1",null,6.1733276312686698,7.1782879433356621,7.1782879433356621,"pig10",null,1.0013822655295899E-3]
[null,null,"does not cook",null,-1.450108612565695E-2]
[null,null,"Owns dwelling",null,1.7525555259544572E-2]
[null,null,"Rents dwelling",null,-4.6387857937893635E-4,null,null,"Component Score Coefficient Matrix",null,null,null,null,"Total Variance Explained"]
[null,null,"Other dwelling arrangement",null,-2.6283171243966938E-2,null,null,null,null,"Component",null,null,"Component",null,"Extraction Sums of Squared Loadings"]
[null,null,"Electricity",null,7.6721964907876389E-2,null,null,null,null,"1",null,null,null,null,"Total","% of Variance","Cumulative %"]
[null,null,"Radio",null,5.0912477839941211E-2,null,null,"Persons per sleeping rooms",null,-2.3595419664755462E-2,null,null,"1",null,6.401037589370274,7.1921770667081732,7.1921770667081732]
[null,null,"Television",null,7.8161195846278009E-2,null,null,"Dirt",null,-2.2688807863383169E-2]
[null,null,"Non-mobile telephone",null,8.4236824803603547E-2,null,null,"Tapia",null,2.6473465111777413E-3]
[null,null,"Refrigetaror",null,8.5864591527194778E-2,null,null,"Wood planks floor",null,-5.1630527735396753E-2,null,null,"Component Score Coefficient Matrix"]
[null,null,"Stove that works with solar energy",null,4.1122366456737301E-2,null,null,"Parquet/polished wood floor",null,-9.9806904564245999E-3,null,null,null,null,"Component"]
[null,null,"Washing Machine",null,9.1695580356494069E-2,null,null,"Vinyl/asphalt strip floor",null,-2.5718073982743422E-2,null,null,null,null,"1"]
[null,null,"Clothes Dryer",null,7.7487287887626294E-2,null,null,"Ceramic tiles floor",null,7.1923337703056728E-2,null,null,"Persons per sleeping rooms",null,-3.5716628729938874E-3]
[null,null,"Water Heater (Tank/Canister)",null,8.1838546180373853E-2,null,null,"Cement floor",null,-2.5521569640916193E-2,null,null,"Dirt",null,-2.9688582842154813E-2]
[null,null,"Microwave Oven",null,9.8744978258383007E-2,null,null,"Carpet floor",null,1.7546229210688199E-3,null,null,"Tapia",null,-1.3013359048007839E-2]
[null,null,"Air Condition Unit",null,8.288394589910815E-2,null,null,"No roof",null,4.1429726765254615E-3,null,null,"Wood planks floor",null,-5.8419898664726071E-2]
[null,null,"Internet Service",null,0.1018862298161797,null,null,"Wood planks roof",null,-3.9683316103859652E-3,null,null,"Parquet/polished wood floor",null,-2.2333082789665608E-2]
[null,null,"Cable/Direct TV",null,9.3604222370531356E-2,null,null,"Metal/tin roof",null,8.169173503273789E-3,null,null,"Vinyl/asphalt strip floor",null,-1.6238231526605152E-4]
[null,null,"DVD Player",null,7.2479625567086134E-2,null,null,"Wood roof",null,-6.629072398852574E-3,null,null,"Ceramic tiles floor",null,6.047758910888533E-2]
[null,null,"A cutlass or gilpin",null,9.2766035122943992E-3,null,null,"Ceramic tiles roof",null,7.9365960463393444E-3,null,null,"Cement floor",null,1.6409576664025226E-2]
[null,null,"A brushing cutlass",null,-1.5139857932090177E-2,null,null,"Cement roof",null,5.8928375319281629E-4,null,null,"Carpet floor",null,1.1480862960294104E-2]
[null,null,"A lawn mower",null,3.5468417378461028E-2,null,null,"Roofing shingles roof",null,1.1789462638903524E-2,null,null,"Wood planks roof",null,-1.0536631122243744E-3]
[null,null,"Mobile telephone",null,4.3212867687449232E-2,null,null,"Roof tiles",null,-6.3162595245622264E-3,null,null,"Metal/tin roof",null,5.0336853038075585E-3]
[null,null,"Computer",null,0.10012798548252214,null,null,"Dirt walls",null,-3.2042276393953106E-3,null,null,"Wood roof",null,-2.9182512583650236E-3]
[null,null,"Sewing Machine",null,5.4377574000476547E-2,null,null,"Pierre",null,-9.7727236913537335E-3,null,null,"Cement roof",null,7.7321373472780579E-3]
[null,null,"Stereo or radio with CD Player",null,8.0569319897818042E-2,null,null,"Plywood walls",null,-4.2788105594757452E-2,null,null,"Roofing shingles roof",null,6.3197091832172744E-3]
[null,null,"Boat for fishing",null,4.250320886762542E-3,null,null,"Cardboard walls",null,-6.5851325562165048E-3,null,null,"Roof tiles",null,-8.2741861028375972E-3]
[null,null,"Boat with motor",null,1.0028292958467281E-2,null,null,"Reused wood walls",null,-2.617006687902728E-2,null,null,"Dirt walls",null,-1.1821962949194999E-2]
[null,null,"MP3 Player",null,6.3017335112441952E-2,null,null,"Finished wooden walls",null,-8.1633657158817E-3,null,null,"Plywood walls",null,-5.6283630631073799E-2]
[null,null,"IPOD",null,6.2040413822285312E-2,null,null,"Cement walls",null,1.7421491036448297E-2,null,null,"Cardboard walls",null,-1.6106632985820216E-2]
[null,null,"Canoe",null,8.606475395164731E-2,null,null,"Stone with lime/cement walls",null,5.7450563659543674E-4,null,null,"Reused wood walls",null,-2.8194090685206053E-2]
[null,null,"Household owns bank account",null,5.988672619605704E-2,null,null,"Brick walls",null,5.6657619952122545E-4,null,null,"Finished wooden walls",null,-1.7987659689117655E-2]
[null,null,null,null,null,null,null,"Cement blocks walls",null,1.0976719260518067E-2,null,null,"Cement walls",null,3.8879129473717307E-2]
[null,null,null,null,null,null,null,"Wood planks/shingles walls",null,-3.4011855454112699E-2,null,null,"Stone with lime/cement walls",null,1.2560245924370756E-2]
[null,null,"Component Score Covariance Matrix",null,null,null,null,"Metal/jenco walls",null,-1.6221763667450418E-2,null,null,"Brick walls",null,-1.8034535897085478E-3]
[null,null,"Component",null,"1",null,null,"Soil block walls",null,-1.8394047077702497E-2,null,null,"Cement blocks walls",null,-5.0042421033036156E-3]
[null,null,"1",null,0.99999999999999978,null,null,"Smart board/Fiber cement board walls",null,2.3503969035153355E-2,null,null,"Wood planks/shingles walls",null,-4.2006989566957864E-2]
[null,null,null,null,null,null,null,"Electricity fuel",null,4.8131020374611692E-2,null,null,"Metal/jenco walls",null,-2.1195515436893422E-2]
[null,null,null,null,null,null,null,"LPG fuel",null,-4.4150708489272751E-2,null,null,"Soil block walls",null,-2.1154877014351366E-3]
[null,null,null,null,null,null,null,"Natural gas fuel",null,1.1467803286292981E-2,null,null,"Smart board/Fiber cement board walls",null,4.4216605114179151E-2]
[null,null,null,null,null,null,null,"does not cook",null,-1.6686071337506894E-2,null,null,"Electricity fuel",null,2.2834836294296158E-2]
[null,null,null,null,null,null,null,"Owns dwelling",null,2.7273706946997277E-2,null,null,"LPG fuel",null,-7.8714270771678679E-3]
[null,null,null,null,null,null,null,"Rents dwelling",null,-1.5320673779226295E-2,null,null,"Natural gas fuel",null,-1.3252021727518436E-3]
[null,null,null,null,null,null,null,"Other dwelling arrangement",null,-2.3780523464710924E-2,null,null,"cooks on open owen",null,-1.6666470946140339E-2]
[null,null,null,null,null,null,null,"Electricity",null,5.9714913914973508E-2,null,null,"does not cook",null,-1.6107111127538605E-2]
[null,null,null,null,null,null,null,"Radio",null,4.6186695813097749E-2,null,null,"Owns dwelling",null,2.1691073893545059E-2]
[null,null,null,null,null,null,null,"Television",null,6.0570413365146965E-2,null,null,"Rents dwelling",null,-9.2743875428307008E-4]
[null,null,null,null,null,null,null,"Non-mobile telephone",null,8.5220959787250028E-2,null,null,"Other dwelling arrangement",null,-2.8281497715193022E-2]
[null,null,null,null,null,null,null,"Refrigetaror",null,6.9674825258569384E-2,null,null,"Electricity",null,8.7847724997046822E-2]
[null,null,null,null,null,null,null,"Stove that works with solar energy",null,3.4741448215493298E-2,null,null,"Radio",null,6.1216445682187537E-2]
[null,null,null,null,null,null,null,"Washing Machine",null,8.7861742005614946E-2,null,null,"Television",null,9.0691848205059905E-2]
[null,null,null,null,null,null,null,"Clothes Dryer",null,9.1796564051488949E-2,null,null,"Non-mobile telephone",null,8.162549630611704E-2]
[null,null,null,null,null,null,null,"Water Heater (Tank/Canister)",null,9.5883681186833006E-2,null,null,"Refrigetaror",null,9.7098454087988534E-2]
[null,null,null,null,null,null,null,"Microwave Oven",null,9.4816166108174116E-2,null,null,"Stove that works with solar energy",null,4.7467712828711268E-2]
[null,null,null,null,null,null,null,"Air Condition Unit",null,9.4863728285850546E-2,null,null,"Washing Machine",null,9.676560399868514E-2]
[null,null,null,null,null,null,null,"Internet Service",null,0.11169208011175452,null,null,"Clothes Dryer",null,6.2292799802041492E-2]
[null,null,null,null,null,null,null,"Cable/Direct TV",null,9.7568185239483934E-2,null,null,"Water Heater (Tank/Canister)",null,6.7344174056969686E-2]
[null,null,null,null,null,null,null,"DVD Player",null,6.3731047968517807E-2,null,null,"Microwave Oven",null,0.10132482302178812]
[null,null,null,null,null,null,null,"A cutlass or gilpin",null,1.6350969982604279E-2,null,null,"Air Condition Unit",null,7.161618000407198E-2]
[null,null,null,null,null,null,null,"A brushing cutlass",null,-5.6018126788462061E-3,null,null,"Internet Service",null,9.0499440574124332E-2]
[null,null,null,null,null,null,null,"A lawn mower",null,4.5663864530369497E-2,null,null,"Cable/Direct TV",null,8.7346010071830543E-2]
[null,null,null,null,null,null,null,"Mobile telephone",null,3.7457864323342471E-2,null,null,"DVD Player",null,7.9749933484575583E-2]
[null,null,null,null,null,null,null,"Computer",null,0.10689504812460489,null,null,"A cutlass or gilpin",null,2.0592359848173095E-2]
[null,null,null,null,null,null,null,"Sewing Machine",null,5.081187489750346E-2,null,null,"A brushing cutlass",null,-3.5182628167014442E-3]
[null,null,null,null,null,null,null,"Stereo or radio with CD Player",null,7.7121804633620644E-2,null,null,"A lawn mower",null,2.6930338872292004E-2]
[null,null,null,null,null,null,null,"Boat for fishing",null,6.0688527334105654E-3,null,null,"Mobile telephone",null,5.1195973521683182E-2]
[null,null,null,null,null,null,null,"Boat with motor",null,1.7383498000022896E-2,null,null,"Computer",null,9.2656198955576391E-2]
[null,null,null,null,null,null,null,"MP3 Player",null,6.7574905731258447E-2,null,null,"Sewing Machine",null,5.7523737634845591E-2]
[null,null,null,null,null,null,null,"IPOD",null,7.1703907784519461E-2,null,null,"Stereo or radio with CD Player",null,8.389336034455093E-2]
[null,null,null,null,null,null,null,"Canoe",null,9.5446665268409947E-2,null,null,"Boat for fishing",null,5.1045656144689273E-3]
[null,null,null,null,null,null,null,"Household owns bank account",null,5.6525338783839231E-2,null,null,"Boat with motor",null,5.0427966612119398E-3]
[null,null,null,null,null,null,null,"Small land",null,6.4171101915713302E-3,null,null,"MP3 Player",null,5.7941253646495619E-2]
[null,null,null,null,null,null,null,"Medium land",null,1.3563985140149209E-2,null,null,"IPOD",null,5.059876689713412E-2]
[null,null,null,null,null,null,null,"Big land",null,3.5270939447691429E-3,null,null,"Canoe",null,8.3488335808678801E-2]
[null,null,null,null,null,null,null,"cattle0",null,4.0582453289833382E-3,null,null,"Household owns bank account",null,6.4938225864680066E-2]
[null,null,null,null,null,null,null,"cattle1",null,-5.7384650899474626E-3,null,null,"Small land",null,1.2913084812062093E-2]
[null,null,null,null,null,null,null,"cattle5",null,-1.1355331741454002E-2,null,null,"Medium land",null,4.6080251572435992E-3]
[null,null,null,null,null,null,null,"cattle10",null,8.5583876077754643E-3,null,null,"Big land",null,-6.1363438801783103E-4]
[null,null,null,null,null,null,null,"goat0",null,4.3657390345486395E-3,null,null,"cattle0",null,1.4208409096355497E-4]
[null,null,null,null,null,null,null,"goat1",null,-6.8886822331250879E-3,null,null,"cattle1",null,-2.9694820333275697E-3]
[null,null,null,null,null,null,null,"goat10",null,5.8730848518660193E-3,null,null,"cattle5",null,3.6242810173339624E-3]
[null,null,null,null,null,null,null,"sheep0",null,-2.0773808912838074E-3,null,null,"cattle10",null,2.4843767901373648E-3]
[null,null,null,null,null,null,null,"sheep1",null,1.4826401821155997E-4,null,null,"horse0",null,2.3121590055824085E-3]
[null,null,null,null,null,null,null,"sheep10",null,3.1011486158078212E-3,null,null,"horse1",null,-4.0298641021941414E-3]
[null,null,null,null,null,null,null,"chicken0",null,1.0467974723676185E-2,null,null,"horse10",null,1.6946952806232733E-3]
[null,null,null,null,null,null,null,"chicken1",null,-3.479570249339199E-3,null,null,"goat0",null,2.6819937178565647E-3]
[null,null,null,null,null,null,null,"chicken10",null,-6.7689177868458014E-3,null,null,"goat1",null,-3.0275776402972883E-3]
[null,null,null,null,null,null,null,"chicken30",null,-8.5686979749373653E-3,null,null,"goat10",null,-7.1001359782173071E-4]
[null,null,null,null,null,null,null,"pig0",null,1.6137196247795908E-2,null,null,"goat30",null,2.7909556136475229E-3]
[null,null,null,null,null,null,null,"pig1",null,-8.775121838787139E-3,null,null,"sheep0",null,-6.3829457752303496E-3]
[null,null,null,null,null,null,null,"pig5",null,-1.4999753500034949E-2,null,null,"sheep1",null,1.8072186504172621E-3]
[null,null,null,null,null,null,null,"pig10",null,-1.310345663134339E-3,null,null,"sheep10",null,6.4269526314835353E-3]
[null,null,null,null,null,null,null,null,null,null,null,null,"sheep30",null,7.4799810370337599E-3]
[null,null,null,null,null,null,null,null,null,null,null,null,"chicken0",null,-1.2647901746886717E-2]
[null,null,null,null,null,null,null,"Component Score Covariance Matrix",null,null,null,null,"chicken1",null,3.2135200180037201E-3]
[null,null,null,null,null,null,null,"Component",null,"1",null,null,"chicken10",null,1.0649375535236033E-2]
[null,null,null,null,null,null,null,"1",null,1,null,null,"chicken30",null,6.6981906373723603E-3]
[null,null,null,null,null,null,null,null,null,null,null,null,"pig0",null,1.3825719351182863E-4]
[null,null,null,null,null,null,null,null,null,null,null,null,"pig1",null,-1.2061189508764955E-3]
[null,null,null,null,null,null,null,null,null,null,null,null,"pig5",null,-4.1302918571147094E-3]
[null,null,null,null,null,null,null,null,null,null,null,null,"pig10",null,4.9436711079362062E-3]
[]
[]
[null,null,null,null,null,null,null,null,null,null,null,null,"Component Score Covariance Matrix"]
[null,null,null,null,null,null,null,null,null,null,null,null,"Component",null,"1"]
[null,null,null,null,null,null,null,null,null,null,null,null,"1",null,0.99999999999999978]
[]
[]
[]
[]
[]
[]
[]
[]
[]
[]
[]
[]
[]
[]
[]
[]
[]
[]
[]
[]
[]
[]
[]
[]
[]
[]
[]
[]
[]
[]
[]
[]
[]
[]
[]
[]
[]
[]
[]
[]
[]
[]
[]
[]
[]
[]
[]
[]
[]
[]
[]
[]
[]
[]
[]
[]
[]
[]
[]
[]
[]
[]
[]
[]
[]
[]
[]
[]
[]
[]
[]
[]
[]
[]
[]
[]
[]
[]
[]
[]
[]
[]
[]
[]
[]
[]
[]
[]
[]
[]
[]
[]
[]
[]
[]
[]
[]
[]
[]
[]
[]
[]
[]
[]
[]
[]
[]
[]
[]
[]
[]
[]
[]
[]
[]
[]
[]
[]
[]
[]
[]
[]
[]
[]
[]
[]
[]
[]
[]
[]
[]
[]
[]
[]
[]
[]
[]
[]
[]
[]
[]
[]
[]
[]
[]
[]
[]
[]
[]
[]
[]
[]
[]
[]
[]
[]
[]
[]
[]
[]
[]
[]
[]
[]
[]
[]
[]
[]
[]
[]
[]
[]
[]
[]
[]
[]
[]
[]
[]
[]
[]
[]
[]
[]
[]
[]
[]
[]
[]
[]
[]
[]
[]
[]
[]
[]
[]
[]
[]
[]
[]
[]
[]
[]
[]
[]
[]
[]
[]
[]
[]
[]
[]
[]
[]
[]
[]
[]
[]
[]
[]
[]
[]
[]
[]
[]
[]
[]
[]
[]
[]
[]
[]
[]
[]
[]
[]
[]
[]
[]
[]
[]
[]
[]
[]
[]
[]
[]
[]
[]
[]
[]
[]
[]
[]
[]
[]
[]
[]
[]
[]
[]
[]
[]
[]
[]
[]
[]
[]
[]
[]
[]
[]
[]
[]
[]
[]
[]
[]
[]
[]
[]
[]
[]
[]
[]
[]
[]
[]
[]
[]
[]
[]
[]
[]
[]
[]
[]
[]
[]
[]
[]
[]
[]
[]
[]
[]
[]
[]
[]
[]
[]
[]
[]
[]
[]
[]
[]
[]
[]
[]
[]
[]
[]
[]
[]
[]
[]
[]
[]
[]
[]
[]
[]
["MICS11"]
["Trinidad and Tobago",null,"Count"]
["W_text_t","",5573]
["W_text_i","",5573]
["S_text_s","",5573]
["S_text_i","",5573]
["Urban/Rural","Urban",2559]
[null,"Rural",3014]
[null,"Missing",0]
["2011"]
[]
["Sub-national region names","Weighted population"]
[{"$f":"R15","v":"Central"},{"$f":"BR122+BR123","v":6838.1378139063436}]
[{"$f":"S15","v":"East"},{"$f":"BS122+BS123","v":1355.3321489629216}]
[{"$f":"T15","v":"North West"},{"$f":"BT122+BT123","v":4198.986504809709}]
[{"$f":"U15","v":"South West"},{"$f":"BU122+BU123","v":4751.9087593564436}]
[{"$f":"V15","v":"Tobago"},{"$f":"BV122+BV123","v":738.97820026084526}]
[{"$f":"W15","v":0},{"$f":"BW122+BW123","v":0}]
[{"$f":"X15","v":0},{"$f":"BX122+XR123","v":0}]
[{"$f":"Y15","v":0},{"$f":"BY122+BY123","v":0}]
[{"$f":"Z15","v":0},{"$f":"BZ122+BZ123","v":0}]
[{"$f":"AA15","v":0},{"$f":"CA122+CA123","v":0}]
[{"$f":"AB15","v":0},{"$f":"CB122+CB123","v":0}]
[{"$f":"AC15","v":0},{"$f":"CC122+CC123","v":0}]
[{"$f":"AD15","v":0},{"$f":"CD122+CD123","v":0}]
[{"$f":"AE15","v":0},{"$f":"CE122+CE123","v":0}]
[{"$f":"AF15","v":0},{"$f":"CF122+CF123","v":0}]
[{"$f":"AG15","v":0},{"$f":"CG122+CG123","v":0}]
[{"$f":"AH15","v":0},{"$f":"CH122+CH123","v":0}]
[{"$f":"AI15","v":0},{"$f":"CI122+CI123","v":0}]
[{"$f":"AJ15","v":0},{"$f":"CJ122+CJ123","v":0}]
[{"$f":"AK15","v":0},{"$f":"CK122+CK123","v":0}]
[{"$f":"AL15","v":0},{"$f":"CL122+CL123","v":0}]
[{"$f":"AM15","v":0},{"$f":"CM122+CM123","v":0}]
[{"$f":"AN15","v":0},{"$f":"CN122+CN123","v":0}]
[{"$f":"AO15","v":0},{"$f":"CO122+CO123","v":0}]
[{"$f":"AP15","v":0},{"$f":"CP122+CP123","v":0}]
[{"$f":"AQ15","v":0},{"$f":"CQ122+CQ123","v":0}]
[{"$f":"AR15","v":0},{"$f":"CR122+CR123","v":0}]
[{"$f":"AS15","v":0},{"$f":"CS122+CS123","v":0}]
[{"$f":"AT15","v":0},{"$f":"CT122+CT123","v":0}]
[{"$f":"AU15","v":0},{"$f":"CU122+CU123","v":0}]
[{"$f":"AV15","v":0},{"$f":"CV122+CV123","v":0}]
[{"$f":"AW15","v":0},{"$f":"CW122+CW123","v":0}]
[{"$f":"AX15","v":0},{"$f":"CX122+CX123","v":0}]
[{"$f":"AY15","v":0},{"$f":"CY122+CY123","v":0}]
[]
[{"$f":"34-COUNTIF(A1037:A1071,\"0\")","v":5},"Sub-regions"]

{"sheet":"data_summary","index":7,"n_rows":188,"n_cols":82,"rows_kept":188,"cut":false,"hidden":false,"merged":[]}
["iso3","year","data_source","row","var1","var2","varname","total_q1","total_q2","total_q3","total_q4","total_q5","urban_q1","urban_q2","urban_q3","urban_q4","urban_q5","rural_q1","rural_q2","rural_q3","rural_q4","rural_q5","region_1_name","region_2_name","region_3_name","region_4_name","region_5_name","region_6_name","region_7_name","region_8_name","region_9_name","region_10_name","region_11_name","region_12_name","region_13_name","region_14_name","region_15_name","region_1","region_2","region_3","region_4","region_5","region_6","region_7","region_8","region_9","region_10","region_11","region_12","region_13","region_14","region_15","n_total_q1","n_total_q2","n_total_q3","n_total_q4","n_total_q5","n_urban_q1","n_urban_q2","n_urban_q3","n_urban_q4","n_urban_q5","n_rural_q1","n_rural_q2","n_rural_q3","n_rural_q4","n_rural_q5","n_region_1","n_region_2","n_region_3","n_region_4","n_region_5","n_region_6","n_region_7","n_region_8","n_region_9","n_region_10","n_region_11","n_region_12","n_region_13","n_region_14","n_region_15"]
["TTO",2000,"TTO_2000_MICS",16,"Water","Improved","w_imp",90.976933514246952,94.78375701551667,95.389408099688481,98.078219824679707,98.813559322033896,null,null,null,null,null,null,null,null,null,null,"arima borough","caroni","chaguanas borough","diego martin","nariva/mayaro","port of spain","pt. fortin borough","rest of st. george","san fernando","st anns","st. andrew/st. david","st. patrick","tacarigua","tobago","victoria",95.356037151702793,91.885441527446304,93.902439024390233,95.679012345679013,99.043062200956939,99.387442572741193,98.755186721991706,90.353697749196144,97.87556904400607,95.531587057010782,96.397694524495677,96.928982725527831,97.449313276651409,94.830659536541901,95.464956481905645]
["TTO",2000,"TTO_2000_MICS",17,"Water","Not Improved","",9.0230664857530538,5.216242984483328,4.610591900311527,1.921780175320297,1.1864406779661021,null,null,null,null,null,null,null,null,null,null,"arima borough","caroni","chaguanas borough","diego martin","nariva/mayaro","port of spain","pt. fortin borough","rest of st. george","san fernando","st anns","st. andrew/st. david","st. patrick","tacarigua","tobago","victoria",4.643962848297214,8.1145584725536999,6.0975609756097562,4.3209876543209873,0.9569377990430622,0.61255742725880558,1.244813278008299,9.6463022508038581,2.1244309559939301,4.4684129429892137,3.6023054755043229,3.0710172744721689,2.5506867233485941,5.169340463458111,4.5350435180943656]
["TTO",2000,"TTO_2000_MICS",18,"Water ladder","Basic","w_bas",87.68656716417911,93.859359524595575,93.890274314214466,97.737250928740295,98.813559322033896,null,null,null,null,null,null,null,null,null,null,"arima borough","caroni","chaguanas borough","diego martin","nariva/mayaro","port of spain","pt. fortin borough","rest of st. george","san fernando","st anns","st. andrew/st. david","st. patrick","tacarigua","tobago","victoria",95.356037151702793,91.885441527446304,93.360433604336052,93.75,99.043062200956939,97.856049004594183,93.7759336099585,90.353697749196144,97.87556904400607,94.69072164948453,94.236311239193085,96.865003198976325,96.664486592544137,94.29590017825312,91.57123224919836]
["TTO",2000,"TTO_2000_MICS",19,"Water ladder","Limited","w_lim",3.2903663500678428,0.92439749092109602,1.4962593516209479,0.33772374197906108,0,null,null,null,null,null,null,null,null,null,null,"arima borough","caroni","chaguanas borough","diego martin","nariva/mayaro","port of spain","pt. fortin borough","rest of st. george","san fernando","st anns","st. andrew/st. david","st. patrick","tacarigua","tobago","victoria",0,0,0.54200542005420049,1.929012345679012,0,1.5313935681470141,4.9792531120331951,0,0,0.82474226804123718,2.1613832853025938,0.063979526551503504,0.78482668410725964,0.53475935828876997,3.8937242327072838]
["TTO",2000,"TTO_2000_MICS",20,"Water ladder","Unimproved","w_unimp",7.08955223880597,3.565533179267085,3.8965087281795512,1.688618709895306,1.050847457627119,null,null,null,null,null,null,null,null,null,null,"arima borough","caroni","chaguanas borough","diego martin","nariva/mayaro","port of spain","pt. fortin borough","rest of st. george","san fernando","st anns","st. andrew/st. david","st. patrick","tacarigua","tobago","victoria",4.643962848297214,8.1145584725536999,6.0975609756097562,0.69444444444444442,0,0.61255742725880558,1.244813278008299,9.6463022508038581,2.1244309559939301,1.7525773195876291,1.5850144092219021,2.5591810620601412,1.5696533682145191,5.169340463458111,4.5350435180943656]
["TTO",2000,"TTO_2000_MICS",21,"Water ladder","Surface water","w_sur",1.933514246947083,1.650709805216243,0.71695760598503744,0.2364066193853428,0.13559322033898311,null,null,null,null,null,null,null,null,null,null,"arima borough","caroni","chaguanas borough","diego martin","nariva/mayaro","port of spain","pt. fortin borough","rest of st. george","san fernando","st anns","st. andrew/st. david","st. patrick","tacarigua","tobago","victoria",0,0,0,3.626543209876544,0.9569377990430622,0,0,0,0,2.731958762886598,2.0172910662824211,0.51183621241202815,0.98103335513407453,0,0]
["TTO",2000,"TTO_2000_MICS",22,"Improved water point at more than 30 minutes","Yes","",3.6167039522744222,0.9752699407871821,1.5686274509803919,0.34435261707988979,0,null,null,null,null,null,null,null,null,null,null,"arima borough","caroni","chaguanas borough","diego martin","nariva/mayaro","port of spain","pt. fortin borough","rest of st. george","san fernando","st anns","st. andrew/st. david","st. patrick","tacarigua","tobago","victoria",0,0,0.57720057720057716,2.0161290322580649,0,1.5408320493066261,5.0420168067226889,0,0,0.86346465191581223,2.2421524663677128,0.066006600660066,0.80536912751677858,0.56390977443609014,4.0786948176583504]
["TTO",2000,"TTO_2000_MICS",23,"Improved water point at more than 30 minutes","No","",96.38329604772558,99.024730059212814,98.431372549019599,99.655647382920108,100,null,null,null,null,null,null,null,null,null,null,"arima borough","caroni","chaguanas borough","diego martin","nariva/mayaro","port of spain","pt. fortin borough","rest of st. george","san fernando","st anns","st. andrew/st. david","st. patrick","tacarigua","tobago","victoria",100,100,99.422799422799429,97.983870967741936,100,98.45916795069337,94.9579831932773,100,100,99.13653534808418,97.757847533632287,99.93399339933994,99.194630872483231,99.436090225563916,95.921305182341655]
["TTO",2000,"TTO_2000_MICS",29,"Piped water","Yes","w_pip",68.147896879240164,83.591944536150535,88.442367601246104,92.447741065407968,95.627118644067792,null,null,null,null,null,null,null,null,null,null,"arima borough","caroni","chaguanas borough","diego martin","nariva/mayaro","port of spain","pt. fortin borough","rest of st. george","san fernando","st anns","st. andrew/st. david","st. patrick","tacarigua","tobago","victoria",94.427244582043343,83.890214797136039,88.888888888888886,85.18518518518519,52.87081339712919,99.387442572741193,92.116182572614107,88.745980707395503,96.509863429438553,91.884951206985107,89.625360230547543,74.28023032629558,95.487246566383249,92.335115864527623,75.217590471827762]
["TTO",2000,"TTO_2000_MICS",30,"Piped water","No","",31.852103120759839,16.40805546384945,11.55763239875389,7.552258934592043,4.3728813559322033,null,null,null,null,null,null,null,null,null,null,"arima borough","caroni","chaguanas borough","diego martin","nariva/mayaro","port of spain","pt. fortin borough","rest of st. george","san fernando","st anns","st. andrew/st. david","st. patrick","tacarigua","tobago","victoria",5.5727554179566559,16.109785202863961,11.111111111111111,14.81481481481481,47.129186602870817,0.61255742725880558,7.8838174273858916,11.2540192926045,3.4901365705614569,8.1150487930148945,10.37463976945245,25.719769673704409,4.5127534336167434,7.66488413547237,24.782409528172241]
["TTO",2000,"TTO_2000_MICS",31,"Piped water on premises","Yes","w_pop",41.926729986431482,71.739848134697922,80.373831775700936,89.345920431557659,95.186440677966104,null,null,null,null,null,null,null,null,null,null,"arima borough","caroni","chaguanas borough","diego martin","nariva/mayaro","port of spain","pt. fortin borough","rest of st. george","san fernando","st anns","st. andrew/st. david","st. patrick","tacarigua","tobago","victoria",94.427244582043343,77.028639618138428,86.58536585365853,66.743827160493822,52.87081339712919,82.542113323124042,75.103734439834028,84.726688102893888,92.41274658573596,73.70313302516692,72.334293948126799,66.538707613563659,89.601046435578809,87.878787878787875,65.50618415025194]
["TTO",2000,"TTO_2000_MICS",32,"Piped water on premises","No","",58.073270013568518,28.260151865302081,19.626168224299061,10.65407956844235,4.8135593220338979,null,null,null,null,null,null,null,null,null,null,"arima borough","caroni","chaguanas borough","diego martin","nariva/mayaro","port of spain","pt. fortin borough","rest of st. george","san fernando","st anns","st. andrew/st. david","st. patrick","tacarigua","tobago","victoria",5.5727554179566559,22.971360381861579,13.414634146341459,33.256172839506171,47.129186602870817,17.457886676875962,24.896265560165979,15.27331189710611,7.587253414264036,26.29686697483308,27.665706051873201,33.461292386436341,10.398953564421189,12.121212121212119,34.493815849748053]
["TTO",2000,"TTO_2000_MICS",35,"Water source on premises","Yes","",55.868385345997282,79.498184219214266,86.884735202492209,94.30209035738369,97.457627118644069,null,null,null,null,null,null,null,null,null,null,"arima borough","caroni","chaguanas borough","diego martin","nariva/mayaro","port of spain","pt. fortin borough","rest of st. george","san fernando","st anns","st. andrew/st. david","st. patrick","tacarigua","tobago","victoria",97.213622291021679,88.484486873508345,87.53387533875339,75.771604938271608,58.133971291866033,82.542113323124042,79.668049792531122,91.479099678456592,95.447647951441581,76.887519260400623,80.835734870316998,92.386436340371077,91.824722040549375,88.591800356506241,69.445716903344021]
["TTO",2000,"TTO_2000_MICS",36,"Water source on premises","No","",44.131614654002718,20.501815780785741,13.115264797507789,5.6979096426163176,2.542372881355933,null,null,null,null,null,null,null,null,null,null,"arima borough","caroni","chaguanas borough","diego martin","nariva/mayaro","port of spain","pt. fortin borough","rest of st. george","san fernando","st anns","st. andrew/st. david","st. patrick","tacarigua","tobago","victoria",2.7863777089783279,11.515513126491649,12.46612466124661,24.228395061728399,41.866028708133967,17.457886676875962,20.331950207468878,8.520900321543408,4.5523520485584212,23.112480739599381,19.164265129682999,7.6135636596289196,8.1752779594506215,11.408199643493759,30.554283096655979]
["TTO",2000,"TTO_2000_MICS",37,"Improved Water source on premises","Yes","w_premises",59.246830723340793,82.201323580633925,89.875898105813192,95.118597456170505,98.044596912521442,null,null,null,null,null,null,null,null,null,null,"arima borough","caroni","chaguanas borough","diego martin","nariva/mayaro","port of spain","pt. fortin borough","rest of st. george","san fernando","st anns","st. andrew/st. david","st. patrick","tacarigua","tobago","victoria",100,91.558441558441558,92.20779220779221,78.790322580645167,58.695652173913047,83.050847457627114,80.672268907563023,95.55160142348754,97.054263565891475,79.784946236559136,82.959641255605376,93.531353135313537,93.489932885906029,92.669172932330824,72.600767754318625]
["TTO",2000,"TTO_2000_MICS",38,"Improved Water source on premises","No","",40.753169276659207,17.798676419366071,10.12410189418681,4.8814025438294948,1.9554030874785591,null,null,null,null,null,null,null,null,null,null,"arima borough","caroni","chaguanas borough","diego martin","nariva/mayaro","port of spain","pt. fortin borough","rest of st. george","san fernando","st anns","st. andrew/st. david","st. patrick","tacarigua","tobago","victoria",0,8.4415584415584419,7.7922077922077921,21.20967741935484,41.304347826086953,16.949152542372879,19.327731092436981,4.4483985765124556,2.945736434108527,20.21505376344086,17.04035874439462,6.4686468646864688,6.5100671140939594,7.3308270676691727,27.399232245681379]
["TTO",2000,"TTO_2000_MICS",41,"Water point at more than 30 minutes","Yes","",4.1482488949336958,1.190082644628099,2.0625,0.33772374197906108,0,null,null,null,null,null,null,null,null,null,null,"arima borough","caroni","chaguanas borough","diego martin","nariva/mayaro","port of spain","pt. fortin borough","rest of st. george","san fernando","st anns","st. andrew/st. david","st. patrick","tacarigua","tobago","victoria",0,0.29832935560859192,0.54200542005420049,2.4691358024691361,0,1.6845329249617149,4.9792531120331951,0,0,0.82644628099173556,2.7377521613832849,0.064267352185089999,0.85022890778286464,0.53475935828876997,5.4054054054054053]
["TTO",2000,"TTO_2000_MICS",42,"Water point at more than 30 minutes","No","w_30min",95.851751105066313,98.809917355371908,97.9375,99.662276258020938,100,null,null,null,null,null,null,null,null,null,null,"arima borough","caroni","chaguanas borough","diego martin","nariva/mayaro","port of spain","pt. fortin borough","rest of st. george","san fernando","st anns","st. andrew/st. david","st. patrick","tacarigua","tobago","victoria",100,99.701670644391399,99.45799457994579,97.53086419753086,100,98.315467075038285,95.020746887966794,100,100,99.173553719008268,97.262247838616716,99.935732647814916,99.149771092217136,99.465240641711233,94.594594594594597]
["TTO",2000,"TTO_2000_MICS",43,"Water source available when needed","Yes","w_available",null,null,null,null,null,null,null,null,null,null,null,null,null,null,null,"arima borough","caroni","chaguanas borough","diego martin","nariva/mayaro","port of spain","pt. fortin borough","rest of st. george","san fernando","st anns","st. andrew/st. david","st. patrick","tacarigua","tobago","victoria",0,0,0,0,0,0,0,0,0,0,0,0,0,0,0]
["TTO",2000,"TTO_2000_MICS",44,"Water source available when needed","No","",null,null,null,null,null,null,null,null,null,null,null,null,null,null,null,"arima borough","caroni","chaguanas borough","diego martin","nariva/mayaro","port of spain","pt. fortin borough","rest of st. george","san fernando","st anns","st. andrew/st. david","st. patrick","tacarigua","tobago","victoria",0,0,0,0,0,0,0,0,0,0,0,0,0,0,0]
["TTO",2000,"TTO_2000_MICS",45,"Improved water source available when needed","Yes","",null,null,null,null,null,null,null,null,null,null,null,null,null,null,null,"arima borough","caroni","chaguanas borough","diego martin","nariva/mayaro","port of spain","pt. fortin borough","rest of st. george","san fernando","st anns","st. andrew/st. david","st. patrick","tacarigua","tobago","victoria",0,0,0,0,0,0,0,0,0,0,0,0,0,0,0]
["TTO",2000,"TTO_2000_MICS",46,"Improved water source available when needed","No","",null,null,null,null,null,null,null,null,null,null,null,null,null,null,null,"arima borough","caroni","chaguanas borough","diego martin","nariva/mayaro","port of spain","pt. fortin borough","rest of st. george","san fernando","st anns","st. andrew/st. david","st. patrick","tacarigua","tobago","victoria",0,0,0,0,0,0,0,0,0,0,0,0,0,0,0]
["TTO",2000,"TTO_2000_MICS",58,"main source of water","public piped into dwelling","",26.255088195386701,52.294486629250578,65.732087227414326,79.737019554956163,89.694915254237287,null,null,null,null,null,null,null,null,null,null,"arima borough","caroni","chaguanas borough","diego martin","nariva/mayaro","port of spain","pt. fortin borough","rest of st. george","san fernando","st anns","st. andrew/st. david","st. patrick","tacarigua","tobago","victoria",93.188854489164086,69.272076372315041,78.997289972899736,46.296296296296298,52.87081339712919,69.984686064318538,41.908713692946058,74.758842443729904,85.584218512898332,56.856702619414477,54.755043227665702,46.449136276391563,82.799215173315886,55.614973262032088,56.573522675217589]
["TTO",2000,"TTO_2000_MICS",59,"main source of water","public piped into yard or plot","",9.9050203527815466,9.3100033014196093,6.8535825545171329,2.461227242076871,1.152542372881356,null,null,null,null,null,null,null,null,null,null,"arima borough","caroni","chaguanas borough","diego martin","nariva/mayaro","port of spain","pt. fortin borough","rest of st. george","san fernando","st anns","st. andrew/st. david","st. patrick","tacarigua","tobago","victoria",1.2383900928792571,6.6229116945107398,3.3875338753387529,3.0092592592592591,0,8.5758039816232774,17.427385892116181,7.8778135048231519,0,7.8582434514637907,5.4755043227665707,7.037747920665387,5.755395683453238,2.8520499108734398,7.7874484654145677]
["TTO",2000,"TTO_2000_MICS",60,"main source of water","private piped into dwelling","",1.6282225237449119,5.6124133377352257,5.3894080996884739,5.2258934592043156,3.9322033898305082,null,null,null,null,null,null,null,null,null,null,"arima borough","caroni","chaguanas borough","diego martin","nariva/mayaro","port of spain","pt. fortin borough","rest of st. george","san fernando","st anns","st. andrew/st. david","st. patrick","tacarigua","tobago","victoria",0,0.2386634844868735,1.626016260162602,10.87962962962963,0,0.91883614088820831,7.0539419087136928,0.16077170418006431,6.8285280728376323,4.4684129429892137,3.4582132564841501,9.6609085092770322,0.45781556572923482,27.80748663101604,0.50389372423270729]
["TTO",2000,"TTO_2000_MICS",61,"main source of water","private catchment not piped","",4.1383989145183184,4.522944866292506,2.3987538940809969,1.921780175320297,0.40677966101694918,null,null,null,null,null,null,null,null,null,null,"arima borough","caroni","chaguanas borough","diego martin","nariva/mayaro","port of spain","pt. fortin borough","rest of st. george","san fernando","st anns","st. andrew/st. david","st. patrick","tacarigua","tobago","victoria",0,0.8949880668257757,2.574525745257453,6.5586419753086416,0,3.0627871362940282,8.7136929460580905,1.929260450160772,0,4.5197740112994351,8.6455331412103753,3.390914907229686,0.58862001308044476,1.6042780748663099,0.64131928538708205]
["TTO",2000,"TTO_2000_MICS",62,"main source of water","public stand pipe","",26.221166892808679,11.852096401452631,8.0685358255451707,3.1018206338503029,0.44067796610169491,null,null,null,null,null,null,null,null,null,null,"arima borough","caroni","chaguanas borough","diego martin","nariva/mayaro","port of spain","pt. fortin borough","rest of st. george","san fernando","st anns","st. andrew/st. david","st. patrick","tacarigua","tobago","victoria",0,6.8615751789976116,2.3035230352303522,18.441358024691361,0,16.845329249617151,17.012448132780079,4.019292604501608,4.0971168437025796,18.18181818181818,17.291066282420751,7.7415227127319257,5.8862001308044478,4.4563279857397502,9.7114063215758133]
["TTO",2000,"TTO_2000_MICS",63,"main source of water","truck borne","",4.1723202170963356,2.1459227467811162,0.96573208722741444,1.31490222521915,0.57627118644067798,null,null,null,null,null,null,null,null,null,null,"arima borough","caroni","chaguanas borough","diego martin","nariva/mayaro","port of spain","pt. fortin borough","rest of st. george","san fernando","st anns","st. andrew/st. david","st. patrick","tacarigua","tobago","victoria",0,0.8353221957040573,0.54200542005420049,3.7037037037037028,4.0669856459330136,0,0,0.8038585209003215,0,0.97586029789419626,1.7291066282420751,2.3672424824056302,0,2.4955436720142599,4.8098946404031153]
["TTO",2000,"TTO_2000_MICS",64,"main source of water","spring/river","",1.933514246947083,1.650709805216243,0.71651090342679125,0.23600809170600129,0.13559322033898311,null,null,null,null,null,null,null,null,null,null,"arima borough","caroni","chaguanas borough","diego martin","nariva/mayaro","port of spain","pt. fortin borough","rest of st. george","san fernando","st anns","st. andrew/st. david","st. patrick","tacarigua","tobago","victoria",0,0,0,3.626543209876544,0.9569377990430622,0,0,0,0,2.722136620441705,2.0172910662824211,0.51183621241202815,0.98103335513407453,0,0]
["TTO",2000,"TTO_2000_MICS",65,"main source of water","protected well","",0.50881953867028495,0.36315615714757338,0,0,0,null,null,null,null,null,null,null,null,null,null,"arima borough","caroni","chaguanas borough","diego martin","nariva/mayaro","port of spain","pt. fortin borough","rest of st. george","san fernando","st anns","st. andrew/st. david","st. patrick","tacarigua","tobago","victoria",0,0,3.5230352303523031,0,0,0,0,0,0,0,0,0,0,0,0]
["TTO",2000,"TTO_2000_MICS",66,"main source of water","not stated","",0.37313432835820892,0.46219874546054801,0.46728971962616822,0.64059339177343222,0.64406779661016944,null,null,null,null,null,null,null,null,null,null,"arima borough","caroni","chaguanas borough","diego martin","nariva/mayaro","port of spain","pt. fortin borough","rest of st. george","san fernando","st anns","st. andrew/st. david","st. patrick","tacarigua","tobago","victoria",0,0,0.27100271002710019,0,0,0,0,2.2508038585209,0.60698027314112291,0.51361068310220848,0.28818443804034583,0.51183621241202815,0.98103335513407453,0,1.0535959688502059]
["TTO",2000,"TTO_2000_MICS",67,"main source of water","protected spring","",0.30529172320217102,0.16507098052162431,0.031152647975077899,0.64059339177343222,0.16949152542372881,null,null,null,null,null,null,null,null,null,null,"arima borough","caroni","chaguanas borough","diego martin","nariva/mayaro","port of spain","pt. fortin borough","rest of st. george","san fernando","st anns","st. andrew/st. david","st. patrick","tacarigua","tobago","victoria",0,0.1789976133651551,0.94850948509485089,1.157407407407407,1.6746411483253589,0,0,0,0,0.0513610683102209,0.72046109510086453,0,0.065402223675604998,0,0]
["TTO",2000,"TTO_2000_MICS",68,"main source of water","rainwater collection","",17.130257801899589,8.517662594915814,5.8878504672897192,3.3378287255563048,1.4576271186440679,null,null,null,null,null,null,null,null,null,null,"arima borough","caroni","chaguanas borough","diego martin","nariva/mayaro","port of spain","pt. fortin borough","rest of st. george","san fernando","st anns","st. andrew/st. david","st. patrick","tacarigua","tobago","victoria",0,6.9809069212410506,0,4.5524691358024691,39.473684210526322,0,4.9792531120331951,0.8038585209003215,0.75872534142640369,2.1058038007190549,4.3227665706051877,20.153550863723609,0.52321778940483976,0,15.437471369674761]
["TTO",2000,"TTO_2000_MICS",69,"main source of water","bottled water","",0,0,0.062305295950155798,0.33715441672285912,0.98305084745762705,null,null,null,null,null,null,null,null,null,null,"arima borough","caroni","chaguanas borough","diego martin","nariva/mayaro","port of spain","pt. fortin borough","rest of st. george","san fernando","st anns","st. andrew/st. david","st. patrick","tacarigua","tobago","victoria",0.92879256965944268,0,0,1.080246913580247,0.9569377990430622,0,1.659751037344398,0,0.60698027314112291,0.51361068310220848,0,0.12795905310300701,0,0,0]
["TTO",2000,"TTO_2000_MICS",70,"main source of water","tube well/bore hole with pump","",0.71234735413839889,0,0,0,0,null,null,null,null,null,null,null,null,null,null,"arima borough","caroni","chaguanas borough","diego martin","nariva/mayaro","port of spain","pt. fortin borough","rest of st. george","san fernando","st anns","st. andrew/st. david","st. patrick","tacarigua","tobago","victoria",0,0,0,0,0,0,0,0,0,0,0,0,1.373446697187704,0,0]
["TTO",2000,"TTO_2000_MICS",71,"main source of water","other","",6.7164179104477606,2.4760647078243641,2.523364485981308,0.87660148347943356,0.13559322033898311,null,null,null,null,null,null,null,null,null,null,"arima borough","caroni","chaguanas borough","diego martin","nariva/mayaro","port of spain","pt. fortin borough","rest of st. george","san fernando","st anns","st. andrew/st. david","st. patrick","tacarigua","tobago","victoria",0.92879256965944268,8.1145584725536999,5.8265582655826558,0.30864197530864201,0,0.61255742725880558,1.244813278008299,5.787781350482315,1.5174506828528069,0.51361068310220848,1.2968299711815561,0.89571337172104937,0.45781556572923482,5.169340463458111,3.4814475492441588]
["TTO",2000,"TTO_2000_MICS",72,"main source of water","missing","",0,0.62726972598217234,0.90342679127725856,0.1685772083614295,0.2711864406779661,null,null,null,null,null,null,null,null,null,null,"arima borough","caroni","chaguanas borough","diego martin","nariva/mayaro","port of spain","pt. fortin borough","rest of st. george","san fernando","st anns","st. andrew/st. david","st. patrick","tacarigua","tobago","victoria",3.7151702786377712,0,0,0.38580246913580252,0,0,0,1.607717041800643,0,0.71905495634309191,0,1.1516314779270631,0.13080444735120991,0,0]
["TTO",2000,"TTO_2000_MICS",122,"Sanitation","Improved","s_imp",93.639613018909898,98.078445153140592,97.903577517923296,99.696561024949432,99.830508474576277,null,null,null,null,null,null,null,null,null,null,"arima borough","caroni","chaguanas borough","diego martin","nariva/mayaro","port of spain","pt. fortin borough","rest of st. george","san fernando","st anns","st. andrew/st. david","st. patrick","tacarigua","tobago","victoria"]
["TTO",2000,"TTO_2000_MICS",123,"Sanitation","Not Improved","",6.3603869810901017,1.9215548468594079,2.0964224820767039,0.30343897505056822,0.16949152542372301,null,null,null,null,null,null,null,null,null,null,"arima borough","caroni","chaguanas borough","diego martin","nariva/mayaro","port of spain","pt. fortin borough","rest of st. george","san fernando","st anns","st. andrew/st. david","st. patrick","tacarigua","tobago","victoria"]
["TTO",2000,"TTO_2000_MICS",124,"Sanitation ladder","Basic","s_bas",78.634908053740261,87.897253044409894,91.398111104717259,96.239191663476433,98.714413456916063,null,null,null,null,null,null,null,null,null,null,"arima borough","caroni","chaguanas borough","diego martin","nariva/mayaro","port of spain","pt. fortin borough","rest of st. george","san fernando","st anns","st. andrew/st. david","st. patrick","tacarigua","tobago","victoria"]
["TTO",2000,"TTO_2000_MICS",125,"Sanitation ladder","Limited","s_lim",15.0047049651699,10.18119210873069,6.5054664132060402,3.4573693614730692,1.116095017660155,null,null,null,null,null,null,null,null,null,null,"arima borough","caroni","chaguanas borough","diego martin","nariva/mayaro","port of spain","pt. fortin borough","rest of st. george","san fernando","st anns","st. andrew/st. david","st. patrick","tacarigua","tobago","victoria"]
["TTO",2000,"TTO_2000_MICS",126,"Sanitation ladder","Unimproved","s_unimp",6.1229378630437026,1.756483866337788,2.0964224820767039,0.30343897505049711,0.1694915254237799,null,null,null,null,null,null,null,null,null,null,"arima borough","caroni","chaguanas borough","diego martin","nariva/mayaro","port of spain","pt. fortin borough","rest of st. george","san fernando","st anns","st. andrew/st. david","st. patrick","tacarigua","tobago","victoria"]
["TTO",2000,"TTO_2000_MICS",127,"Sanitation ladder","Open defecation","s_od",0.237449118046133,0.16507098052162431,0,0,0,null,null,null,null,null,null,null,null,null,null,"arima borough","caroni","chaguanas borough","diego martin","nariva/mayaro","port of spain","pt. fortin borough","rest of st. george","san fernando","st anns","st. andrew/st. david","st. patrick","tacarigua","tobago","victoria"]
["TTO",2000,"TTO_2000_MICS",135,"Sanitation type","Sewer connection","s_sew",null,null,null,null,null,null,null,null,null,null,null,null,null,null,null,"arima borough","caroni","chaguanas borough","diego martin","nariva/mayaro","port of spain","pt. fortin borough","rest of st. george","san fernando","st anns","st. andrew/st. david","st. patrick","tacarigua","tobago","victoria",0,0,0,0,0,0,0,0,0,0,0,0,0,0,0]
["TTO",2000,"TTO_2000_MICS",136,"Sanitation type","Septic tank connection","s_sep",null,null,null,null,null,null,null,null,null,null,null,null,null,null,null,"arima borough","caroni","chaguanas borough","diego martin","nariva/mayaro","port of spain","pt. fortin borough","rest of st. george","san fernando","st anns","st. andrew/st. david","st. patrick","tacarigua","tobago","victoria",0,0,0,0,0,0,0,0,0,0,0,0,0,0,0]
["TTO",2000,"TTO_2000_MICS",137,"Sanitation type","Improved latrines","s_lat",null,null,null,null,null,null,null,null,null,null,null,null,null,null,null,"arima borough","caroni","chaguanas borough","diego martin","nariva/mayaro","port of spain","pt. fortin borough","rest of st. george","san fernando","st anns","st. andrew/st. david","st. patrick","tacarigua","tobago","victoria",0,0,0,0,0,0,0,0,0,0,0,0,0,0,0]
["TTO",2000,"TTO_2000_MICS",138,"Sanitation type","Unimproved facilities","",null,null,null,null,null,null,null,null,null,null,null,null,null,null,null,"arima borough","caroni","chaguanas borough","diego martin","nariva/mayaro","port of spain","pt. fortin borough","rest of st. george","san fernando","st anns","st. andrew/st. david","st. patrick","tacarigua","tobago","victoria",100,100,100,100,100,100,100,100,100,100,100,100,100,100,100]
["TTO",2000,"TTO_2000_MICS",139,"Sanitation type","Open defecation","",null,null,null,null,null,null,null,null,null,null,null,null,null,null,null,"arima borough","caroni","chaguanas borough","diego martin","nariva/mayaro","port of spain","pt. fortin borough","rest of st. george","san fernando","st anns","st. andrew/st. david","st. patrick","tacarigua","tobago","victoria",0,0,0,0,0,0,0,0,0,0,0,0,0,0,0]
["TTO",2000,"TTO_2000_MICS",153,"type of toilet facility","pit","",77.37449118046132,37.999339716077912,19.719626168224298,5.8664868509777479,1.4576271186440679,null,null,null,null,null,null,null,null,null,null,"arima borough","caroni","chaguanas borough","diego martin","nariva/mayaro","port of spain","pt. fortin borough","rest of st. george","san fernando","st anns","st. andrew/st. david","st. patrick","tacarigua","tobago","victoria",5.2631578947368416,30.31026252983294,20.189701897018971,28.703703703703699,42.822966507177043,23.73660030627871,48.962655601659748,24.59807073954984,7.2837632776934749,25.83461736004109,46.397694524495677,32.949456174024313,19.816873773708309,25.668449197860969,36.463582226294093,2281,1151,633,174,43,null,null,null,null,null,null,null,null,null,null,17,508,149,372,179,155,118,153,48,503,322,515,303,144,796]
["TTO",2000,"TTO_2000_MICS",154,"type of toilet facility","wc linked to sewer","",7.3609226594301216,22.746781115879831,33.208722741433021,41.200269723533381,51.762711864406782,null,null,null,null,null,null,null,null,null,null,"arima borough","caroni","chaguanas borough","diego martin","nariva/mayaro","port of spain","pt. fortin borough","rest of st. george","san fernando","st anns","st. andrew/st. david","st. patrick","tacarigua","tobago","victoria",68.730650154798766,7.0405727923627692,26.28726287262872,39.737654320987652,55.741626794258373,72.588055130168456,0,33.279742765273312,65.553869499241273,21.571648690292761,0.57636887608069165,36.78822776711452,47.351209941138002,49.376114081996427,14.93357764544205,217,689,1066,1222,1527,null,null,null,null,null,null,null,null,null,null,222,118,194,515,233,474,0,207,432,420,4,575,724,277,326]
["TTO",2000,"TTO_2000_MICS",155,"type of toilet facility","wc not linked to sewer","",14.62008141112619,38.857708814790357,45.607476635514018,52.6298044504383,46.610169491525419,null,null,null,null,null,null,null,null,null,null,"arima borough","caroni","chaguanas borough","diego martin","nariva/mayaro","port of spain","pt. fortin borough","rest of st. george","san fernando","st anns","st. andrew/st. david","st. patrick","tacarigua","tobago","victoria",25.077399380804959,62.649164677804293,53.116531165311663,31.095679012345681,1.435406698564593,3.522205206738132,51.037344398340252,40.192926045016073,27.16236722306525,51.30970724191063,53.02593659942363,29.366602687140119,32.308698495748857,24.9554367201426,47.686669720568027,431,1177,1464,1561,1375,null,null,null,null,null,null,null,null,null,null,81,1050,392,403,6,23,123,250,179,999,368,459,494,140,1041]
["TTO",2000,"TTO_2000_MICS",156,"type of toilet facility","none","",0.237449118046133,0.16507098052162431,0,0,0,null,null,null,null,null,null,null,null,null,null,"arima borough","caroni","chaguanas borough","diego martin","nariva/mayaro","port of spain","pt. fortin borough","rest of st. george","san fernando","st anns","st. andrew/st. david","st. patrick","tacarigua","tobago","victoria",0,0,0,0,0,0.15313935681470139,0,0,0,0.41088854648176681,0,0.12795905310300701,0.065402223675604998,0,0,7,5,0,0,0,null,null,null,null,null,null,null,null,null,null,0,0,0,0,0,1,0,0,0,8,0,2,1,0,0]
["TTO",2000,"TTO_2000_MICS",157,"type of toilet facility","other","",0.20352781546811399,0,0,0,0,null,null,null,null,null,null,null,null,null,null,"arima borough","caroni","chaguanas borough","diego martin","nariva/mayaro","port of spain","pt. fortin borough","rest of st. george","san fernando","st anns","st. andrew/st. david","st. patrick","tacarigua","tobago","victoria",0,0,0.40650406504065051,0.077160493827160503,0,0,0,0,0,0,0,0,0.065402223675604998,0,0.0458085203847916,6,0,0,0,0,null,null,null,null,null,null,null,null,null,null,0,0,3,1,0,0,0,0,0,0,0,0,1,0,1]
["TTO",2000,"TTO_2000_MICS",158,"type of toilet facility","missing","",0.20352781546811399,0.23109937273027401,1.4641744548286599,0.30343897505057321,0.16949152542372881,null,null,null,null,null,null,null,null,null,null,"arima borough","caroni","chaguanas borough","diego martin","nariva/mayaro","port of spain","pt. fortin borough","rest of st. george","san fernando","st anns","st. andrew/st. david","st. patrick","tacarigua","tobago","victoria",0.92879256965944268,0,0,0.38580246913580252,0,0,0,1.929260450160772,0,0.87313816127375443,0,0.76775431861804222,0.39241334205362982,0,0.87036188731103981,6,7,47,9,5,null,null,null,null,null,null,null,null,null,null,3,0,0,5,0,0,0,12,0,17,0,12,6,0,19]
["TTO",2006,"TTO_2006_MICS",16,"Water","Improved","w_imp",95.243002704153099,97.920444968028292,98.38359588617611,99.080293380524438,99.80303017971751,null,null,null,null,null,null,null,null,null,null,"Arima","Chaguanas","Couva/Tabaquite/Talparo","Diego Martin","Mayaro/Rio Claro","Penal/Debe","Point Fortin","Port of Spain","Princes Town","San Fernando","San Juan/Laventille","Sangre Grande","Siparia","Tobago","Tunapuna/Piarco",99.805825242718456,99.718309859154928,98.351226993864998,98.047138047138048,100,99.693016116653865,100,99.188311688311671,98.930862437633664,100,95.311130587204289,93.956043956043956,99.144568006843471,98.828696925329453,98.717527129233801]
["TTO",2006,"TTO_2006_MICS",17,"Water","Not Improved","",4.7569972958469524,2.079555031971708,1.616404113823855,0.91970661947559562,0.1969698202824845,null,null,null,null,null,null,null,null,null,null,"Arima","Chaguanas","Couva/Tabaquite/Talparo","Diego Martin","Mayaro/Rio Claro","Penal/Debe","Point Fortin","Port of Spain","Princes Town","San Fernando","San Juan/Laventille","Sangre Grande","Siparia","Tobago","Tunapuna/Piarco",0.19417475728155309,0.28169014084507121,1.648773006134975,1.952861952861952,0,0.3069838833461227,0,0.81168831168831113,1.0691375623663599,0,4.6888694127958006,6.0439560439560367,0.85543199315654261,1.1713030746705739,1.282472870766193]
["TTO",2006,"TTO_2006_MICS",18,"Water ladder","Basic","w_bas",93.906186087379524,97.311383235091057,98.075502830556445,98.917970593457227,99.80303017971751,null,null,null,null,null,null,null,null,null,null,"Arima","Chaguanas","Couva/Tabaquite/Talparo","Diego Martin","Mayaro/Rio Claro","Penal/Debe","Point Fortin","Port of Spain","Princes Town","San Fernando","San Juan/Laventille","Sangre Grande","Siparia","Tobago","Tunapuna/Piarco",99.805825242718456,99.718309859154928,98.044478527607325,97.239057239057232,100,98.618572524942408,97.652582159624401,99.188311688311671,98.146828225231644,100,94.741454864154335,93.956043956043956,97.775876817793034,98.682284040995626,98.717527129233801]
["TTO",2006,"TTO_2006_MICS",19,"Water ladder","Limited","w_lim",1.3368166167736271,0.60906173293723809,0.30809305561967992,0.16232278706723591,0,null,null,null,null,null,null,null,null,null,null,"Arima","Chaguanas","Couva/Tabaquite/Talparo","Diego Martin","Mayaro/Rio Claro","Penal/Debe","Point Fortin","Port of Spain","Princes Town","San Fernando","San Juan/Laventille","Sangre Grande","Siparia","Tobago","Tunapuna/Piarco",0,0,0.30674846625766983,0.80808080808080751,0,1.074443591711429,2.3474178403755861,0,0.78403421240199733,0,0.56967572304995717,0,1.368691189050468,0.1464128843338218,0]
["TTO",2006,"TTO_2006_MICS",20,"Water ladder","Unimproved","w_unimp",4.2592285633222078,2.079555031971708,1.616404113823855,0.91970661947559562,0.1969698202824845,null,null,null,null,null,null,null,null,null,null,"Arima","Chaguanas","Couva/Tabaquite/Talparo","Diego Martin","Mayaro/Rio Claro","Penal/Debe","Point Fortin","Port of Spain","Princes Town","San Fernando","San Juan/Laventille","Sangre Grande","Siparia","Tobago","Tunapuna/Piarco",0.19417475728155309,0.28169014084507121,1.648773006134975,1.952861952861952,0,0.3069838833461227,0,0.81168831168831113,1.0691375623663599,0,4.6888694127958006,5.1648351648351598,0.85543199315654261,0.29282576866764348,1.282472870766193]
["TTO",2006,"TTO_2006_MICS",21,"Water ladder","Surface water","w_sur",0.49776873252474507,0,0,0,0,null,null,null,null,null,null,null,null,null,null,"Arima","Chaguanas","Couva/Tabaquite/Talparo","Diego Martin","Mayaro/Rio Claro","Penal/Debe","Point Fortin","Port of Spain","Princes Town","San Fernando","San Juan/Laventille","Sangre Grande","Siparia","Tobago","Tunapuna/Piarco",0,0,0,0,0,0,0,0,0,0,0,0.87912087912087811,0,0.8784773060029305,0]
["TTO",2006,"TTO_2006_MICS",22,"Improved water point at more than 30 minutes","Yes","",1.4035851231256229,0.62199649229137088,0.31315490437666549,0.16382953817448281,0,null,null,null,null,null,null,null,null,null,null,"Arima","Chaguanas","Couva/Tabaquite/Talparo","Diego Martin","Mayaro/Rio Claro","Penal/Debe","Point Fortin","Port of Spain","Princes Town","San Fernando","San Juan/Laventille","Sangre Grande","Siparia","Tobago","Tunapuna/Piarco",0,0,0.31189083820662877,0.82417582417582369,0,1.077752117013081,2.3474178403755861,0,0.79250720461095259,0,0.59770114942528796,0,1.380500431406382,0.1481481481481485,0]
["TTO",2006,"TTO_2006_MICS",23,"Improved water point at more than 30 minutes","No","",98.596414876874434,99.378003507708641,99.68684509562334,99.836170461825532,100,null,null,null,null,null,null,null,null,null,null,"Arima","Chaguanas","Couva/Tabaquite/Talparo","Diego Martin","Mayaro/Rio Claro","Penal/Debe","Point Fortin","Port of Spain","Princes Town","San Fernando","San Juan/Laventille","Sangre Grande","Siparia","Tobago","Tunapuna/Piarco",100,100,99.688109161793363,99.175824175824175,100,98.922247882986895,97.652582159624401,100,99.20749279538903,100,99.402298850574695,100,98.619499568593653,99.851851851851848,100]
["TTO",2006,"TTO_2006_MICS",29,"Piped water","Yes","w_pip",79.093945235977728,86.208500918302406,93.758123184337222,94.080184708880211,97.435388942564344,null,null,null,null,null,null,null,null,null,null,"Arima","Chaguanas","Couva/Tabaquite/Talparo","Diego Martin","Mayaro/Rio Claro","Penal/Debe","Point Fortin","Port of Spain","Princes Town","San Fernando","San Juan/Laventille","Sangre Grande","Siparia","Tobago","Tunapuna/Piarco",99.805825242718456,95.680751173708899,88.803680981594937,88.956228956228955,68.876611418047958,86.492709132770344,84.037558685445987,99.025974025974023,83.606557377049199,100,91.542506573181598,81.318681318681328,89.307100085543297,92.240117130307496,98.487339690891133]
["TTO",2006,"TTO_2006_MICS",30,"Piped water","No","",20.906054764022532,13.791499081697561,6.2418768156627626,5.9198152911198338,2.564611057435612,null,null,null,null,null,null,null,null,null,null,"Arima","Chaguanas","Couva/Tabaquite/Talparo","Diego Martin","Mayaro/Rio Claro","Penal/Debe","Point Fortin","Port of Spain","Princes Town","San Fernando","San Juan/Laventille","Sangre Grande","Siparia","Tobago","Tunapuna/Piarco",0.19417475728155309,4.3192488262910924,11.196319018404941,11.04377104377104,31.12338858195217,13.50729086722939,15.962441314553979,0.97402597402597335,16.393442622950872,0,8.4574934268185995,18.681318681318661,10.692899914456779,7.759882869692551,1.512660309108842]
["TTO",2006,"TTO_2006_MICS",31,"Piped water on premises","Yes","w_pop",68.084178576015688,80.393722351175583,91.623632326149902,93.550684596729639,97.386543704840761,null,null,null,null,null,null,null,null,null,null,"Arima","Chaguanas","Couva/Tabaquite/Talparo","Diego Martin","Mayaro/Rio Claro","Penal/Debe","Point Fortin","Port of Spain","Princes Town","San Fernando","San Juan/Laventille","Sangre Grande","Siparia","Tobago","Tunapuna/Piarco",99.805825242718456,95.680751173708899,85.85122699386487,84.713804713804706,68.876611418047958,84.267075978510931,72.300469483568079,93.668831168831119,80.185317177476861,98.815165876777257,81.551270815074716,79.230769230769241,85.201026518391885,89.311859443631079,97.533706017757353]
["TTO",2006,"TTO_2006_MICS",32,"Piped water on premises","No","",31.915821423984781,19.606277648824399,8.3763676738500656,6.4493154032703934,2.6134562951592089,null,null,null,null,null,null,null,null,null,null,"Arima","Chaguanas","Couva/Tabaquite/Talparo","Diego Martin","Mayaro/Rio Claro","Penal/Debe","Point Fortin","Port of Spain","Princes Town","San Fernando","San Juan/Laventille","Sangre Grande","Siparia","Tobago","Tunapuna/Piarco",0.19417475728155309,4.3192488262910924,14.148773006135,15.28619528619528,31.12338858195217,15.732924021488779,27.699530516431899,6.3311688311688279,19.814682822523221,1.1848341232227519,18.448729184925579,20.769230769230749,14.798973481608179,10.688140556368991,2.4662939822426768]
["TTO",2006,"TTO_2006_MICS",35,"Water source on premises","Yes","",79.921469718331295,90.225674211528698,95.820207326423073,97.712554689340351,99.130485323429369,null,null,null,null,null,null,null,null,null,null,"Arima","Chaguanas","Couva/Tabaquite/Talparo","Diego Martin","Mayaro/Rio Claro","Penal/Debe","Point Fortin","Port of Spain","Princes Town","San Fernando","San Juan/Laventille","Sangre Grande","Siparia","Tobago","Tunapuna/Piarco",99.805825242718456,95.680751173708899,95.092024539877229,91.717171717171723,97.421731123388597,85.64850345356848,77.464788732394382,95.454545454545425,94.583036350677091,98.815165876777257,85.889570552147475,91.538461538461533,94.268605645851238,93.411420204978072,98.355804011838245]
["TTO",2006,"TTO_2006_MICS",36,"Water source on premises","No","",20.078530281668929,9.7743257884712609,4.1797926735769169,2.2874453106596961,0.86951467657062143,null,null,null,null,null,null,null,null,null,null,"Arima","Chaguanas","Couva/Tabaquite/Talparo","Diego Martin","Mayaro/Rio Claro","Penal/Debe","Point Fortin","Port of Spain","Princes Town","San Fernando","San Juan/Laventille","Sangre Grande","Siparia","Tobago","Tunapuna/Piarco",0.19417475728155309,4.3192488262910924,4.9079754601227172,8.2828282828282802,2.578268876611423,14.35149654643123,22.535211267605611,4.5454545454545432,5.4169636493228932,1.1848341232227519,14.110429447852811,8.461538461538451,5.7313943541488337,6.5885797950219791,1.6441959881617849]
["TTO",2006,"TTO_2006_MICS",37,"Improved Water source on premises","Yes","w_premises",83.424608835466614,91.274393414486937,96.491343605440932,97.835388794360838,99.255976963841249,null,null,null,null,null,null,null,null,null,null,"Arima","Chaguanas","Couva/Tabaquite/Talparo","Diego Martin","Mayaro/Rio Claro","Penal/Debe","Point Fortin","Port of Spain","Princes Town","San Fernando","San Juan/Laventille","Sangre Grande","Siparia","Tobago","Tunapuna/Piarco",100,95.951035781544235,96.647173489278686,91.552197802197796,97.421731123388597,85.681293302540212,77.464788732394382,96.235679214402609,95.605187319884678,98.815165876777257,87.21839080459786,97.42690058479532,94.909404659189008,94.518518518518533,99.20053297801465]
["TTO",2006,"TTO_2006_MICS",38,"Improved Water source on premises","No","",16.57539116453356,8.7256065855129918,3.5086563945590701,2.1646112056391771,0.74402303615873333,null,null,null,null,null,null,null,null,null,null,"Arima","Chaguanas","Couva/Tabaquite/Talparo","Diego Martin","Mayaro/Rio Claro","Penal/Debe","Point Fortin","Port of Spain","Princes Town","San Fernando","San Juan/Laventille","Sangre Grande","Siparia","Tobago","Tunapuna/Piarco",0,4.0489642184557546,3.3528265107212611,8.4478021978021953,2.578268876611423,14.318706697459501,22.535211267605611,3.764320785597381,4.3948126801152831,1.1848341232227519,12.78160919540232,2.5730994152046751,5.090595340811034,5.4814814814814952,0.79946702198534125]
["TTO",2006,"TTO_2006_MICS",41,"Water point at more than 30 minutes","Yes","",1.5013268866411671,0.79803718811154067,0.30809305561967992,0.16232278706723591,0.1269571412490702,null,null,null,null,null,null,null,null,null,null,"Arima","Chaguanas","Couva/Tabaquite/Talparo","Diego Martin","Mayaro/Rio Claro","Penal/Debe","Point Fortin","Port of Spain","Princes Town","San Fernando","San Juan/Laventille","Sangre Grande","Siparia","Tobago","Tunapuna/Piarco",0,0,0.57515337423313084,0.80808080808080751,0,1.074443591711429,2.3474178403755861,0.81168831168831113,0.78403421240199733,0,0.56967572304995717,0,1.7964071856287389,0.1464128843338218,0]
["TTO",2006,"TTO_2006_MICS",42,"Water point at more than 30 minutes","No","w_30min",98.498673113358848,99.201962811888464,99.691906944380307,99.837677212932789,99.873042858750921,null,null,null,null,null,null,null,null,null,null,"Arima","Chaguanas","Couva/Tabaquite/Talparo","Diego Martin","Mayaro/Rio Claro","Penal/Debe","Point Fortin","Port of Spain","Princes Town","San Fernando","San Juan/Laventille","Sangre Grande","Siparia","Tobago","Tunapuna/Piarco",100,100,99.424846625766861,99.191919191919183,100,98.925556408288543,97.652582159624401,99.188311688311671,99.215965787598009,100,99.430324276950032,100,98.203592814371305,99.853587115666173,100]
["TTO",2006,"TTO_2006_MICS",43,"Water source available when needed","Yes","w_available",null,null,null,null,null,null,null,null,null,null,null,null,null,null,null,"Arima","Chaguanas","Couva/Tabaquite/Talparo","Diego Martin","Mayaro/Rio Claro","Penal/Debe","Point Fortin","Port of Spain","Princes Town","San Fernando","San Juan/Laventille","Sangre Grande","Siparia","Tobago","Tunapuna/Piarco",0,0,0,0,0,0,0,0,0,0,0,0,0,0,0]
["TTO",2006,"TTO_2006_MICS",44,"Water source available when needed","No","",null,null,null,null,null,null,null,null,null,null,null,null,null,null,null,"Arima","Chaguanas","Couva/Tabaquite/Talparo","Diego Martin","Mayaro/Rio Claro","Penal/Debe","Point Fortin","Port of Spain","Princes Town","San Fernando","San Juan/Laventille","Sangre Grande","Siparia","Tobago","Tunapuna/Piarco",0,0,0,0,0,0,0,0,0,0,0,0,0,0,0]
["TTO",2006,"TTO_2006_MICS",45,"Improved water source available when needed","Yes","",null,null,null,null,null,null,null,null,null,null,null,null,null,null,null,"Arima","Chaguanas","Couva/Tabaquite/Talparo","Diego Martin","Mayaro/Rio Claro","Penal/Debe","Point Fortin","Port of Spain","Princes Town","San Fernando","San Juan/Laventille","Sangre Grande","Siparia","Tobago","Tunapuna/Piarco",0,0,0,0,0,0,0,0,0,0,0,0,0,0,0]
["TTO",2006,"TTO_2006_MICS",46,"Improved water source available when needed","No","",null,null,null,null,null,null,null,null,null,null,null,null,null,null,null,"Arima","Chaguanas","Couva/Tabaquite/Talparo","Diego Martin","Mayaro/Rio Claro","Penal/Debe","Point Fortin","Port of Spain","Princes Town","San Fernando","San Juan/Laventille","Sangre Grande","Siparia","Tobago","Tunapuna/Piarco",0,0,0,0,0,0,0,0,0,0,0,0,0,0,0]
["TTO",2006,"TTO_2006_MICS",58,"Main source of drinking water","Piped into dwelling","",45.636119272582697,65.63377800188438,76.362285186406822,82.067086634753224,81.997672413549466,null,null,null,null,null,null,null,null,null,null,"Arima","Chaguanas","Couva/Tabaquite/Talparo","Diego Martin","Mayaro/Rio Claro","Penal/Debe","Point Fortin","Port of Spain","Princes Town","San Fernando","San Juan/Laventille","Sangre Grande","Siparia","Tobago","Tunapuna/Piarco",92.427184466019412,69.107981220657294,69.708588957055113,68.754208754208747,59.116022099447576,50.26861089792768,50.234741784037539,84.253246753246671,67.141838916607242,95.023696682464461,66.652059596845021,70.549450549450512,68.862275449101872,70.571010248901985,85.399539625123268]
["TTO",2006,"TTO_2006_MICS",59,"Main source of drinking water","Piped into yard or plot","",17.72707419343687,10.38849007113954,9.0270633478152984,4.1393245737354736,1.893620251599974,null,null,null,null,null,null,null,null,null,null,"Arima","Chaguanas","Couva/Tabaquite/Talparo","Diego Martin","Mayaro/Rio Claro","Penal/Debe","Point Fortin","Port of Spain","Princes Town","San Fernando","San Juan/Laventille","Sangre Grande","Siparia","Tobago","Tunapuna/Piarco",4.2718446601941684,6.6666666666666847,8.3972392638037121,6.1279461279461254,6.0773480662983523,28.702993092862489,14.553990610328629,0.48701298701298668,6.628652886671432,0,5.4776511831726644,6.7032967032966937,10.350727117194159,10.834553440702811,5.9848733969088954]
["TTO",2006,"TTO_2006_MICS",60,"Main source of drinking water","Public tap/standpipe","",11.00976665996226,5.570072902736241,2.1344908581873061,0.52950011215056059,0,null,null,null,null,null,null,null,null,null,null,"Arima","Chaguanas","Couva/Tabaquite/Talparo","Diego Martin","Mayaro/Rio Claro","Penal/Debe","Point Fortin","Port of Spain","Princes Town","San Fernando","San Juan/Laventille","Sangre Grande","Siparia","Tobago","Tunapuna/Piarco",0,0,2.9524539877300722,4.2424242424242404,0,2.2256331542593899,9.8591549295774623,5.3571428571428532,3.4212401995723529,1.1848341232227519,9.9035933391761901,2.0879120879120849,3.6783575705731328,2.9282576866764352,0.95363367313383551]
["TTO",2006,"TTO_2006_MICS",61,"Main source of drinking water","Private piped into dwelling","",1.726949623345994,1.5361593375154481,1.3243991816594469,1.3774662869757579,1.173314001286752,null,null,null,null,null,null,null,null,null,null,"Arima","Chaguanas","Couva/Tabaquite/Talparo","Diego Martin","Mayaro/Rio Claro","Penal/Debe","Point Fortin","Port of Spain","Princes Town","San Fernando","San Juan/Laventille","Sangre Grande","Siparia","Tobago","Tunapuna/Piarco",1.165048543689319,8.7323943661972088,1.3803680981595139,1.75084175084175,2.20994475138122,0.84420567920183742,0,0,0.35637918745545338,0,1.796669588080634,0,1.6253207869974311,0.58565153733528708,0.36172311739559271]
["TTO",2006,"TTO_2006_MICS",62,"Main source of drinking water","Private piped into yard","",2.0224884175510112,1.285869102941678,1.2022733319588821,0.77138669867431264,0.1601655080406312,null,null,null,null,null,null,null,null,null,null,"Arima","Chaguanas","Couva/Tabaquite/Talparo","Diego Martin","Mayaro/Rio Claro","Penal/Debe","Point Fortin","Port of Spain","Princes Town","San Fernando","San Juan/Laventille","Sangre Grande","Siparia","Tobago","Tunapuna/Piarco",0,1.220657276995309,3.1825153374233239,2.3569023569023559,0.7366482504604065,0.3069838833461227,0,0.81168831168831113,0.64148253741981609,0,0.56967572304995717,0,0.8554319931565425,0.29282576866764348,0.46037487668529981]
["TTO",2006,"TTO_2006_MICS",63,"Main source of drinking water","Protected spring","",0.42160115181177282,0.77349065771243075,0.20549383563352711,0.79333355728983512,0.13728472117768389,null,null,null,null,null,null,null,null,null,null,"Arima","Chaguanas","Couva/Tabaquite/Talparo","Diego Martin","Mayaro/Rio Claro","Penal/Debe","Point Fortin","Port of Spain","Princes Town","San Fernando","San Juan/Laventille","Sangre Grande","Siparia","Tobago","Tunapuna/Piarco",0,0.56338028169014243,1.0352760736196349,0.26936026936026908,0,0,0,0,0,0,2.1910604732690659,0,0,0,0]
["TTO",2006,"TTO_2006_MICS",64,"Main source of drinking water","Unprotected spring","",1.009489166390241,1.108911322109448,0.96667500602463352,0.7982069204051766,0,null,null,null,null,null,null,null,null,null,null,"Arima","Chaguanas","Couva/Tabaquite/Talparo","Diego Martin","Mayaro/Rio Claro","Penal/Debe","Point Fortin","Port of Spain","Princes Town","San Fernando","San Juan/Laventille","Sangre Grande","Siparia","Tobago","Tunapuna/Piarco",0,0,0.19171779141104359,1.75084175084175,0,0,0,0,0,0,3.768624014022794,1.978021978021975,0,0.29282576866764348,0]
["TTO",2006,"TTO_2006_MICS",65,"Main source of drinking water","Rainwater collection","",11.044206464877069,8.3595533352884868,3.0911355286482798,3.041566060764465,1.7114349412302201,null,null,null,null,null,null,null,null,null,null,"Arima","Chaguanas","Couva/Tabaquite/Talparo","Diego Martin","Mayaro/Rio Claro","Penal/Debe","Point Fortin","Port of Spain","Princes Town","San Fernando","San Juan/Laventille","Sangre Grande","Siparia","Tobago","Tunapuna/Piarco",0,3.192488262910806,6.5567484662576936,4.3097643097643079,31.12338858195217,5.9861857252493911,12.676056338028159,0.16233766233766231,8.6956521739130626,0,0.70113935144610118,12.307692307692291,9.2386655260906583,6.1493411420205124,0.098651759289707097]
["TTO",2006,"TTO_2006_MICS",66,"Main source of drinking water","Tanker-truck","",3.689088792449073,2.352946765825624,1.328843337557098,1.023571809949299,0.44170069033397807,null,null,null,null,null,null,null,null,null,null,"Arima","Chaguanas","Couva/Tabaquite/Talparo","Diego Martin","Mayaro/Rio Claro","Penal/Debe","Point Fortin","Port of Spain","Princes Town","San Fernando","San Juan/Laventille","Sangre Grande","Siparia","Tobago","Tunapuna/Piarco",0,0,1.80214723926381,4.1077441077441064,0,6.7536454336146967,2.8169014084507031,0,5.702066999287255,0,0.52585451358457591,0.32967032967032928,0.51325919589392555,0.43923865300146531,0]
["TTO",2006,"TTO_2006_MICS",67,"Main source of drinking water","Cart with small tank/drum","",0.47500571289394428,0.2259532908993179,0,0.1162034510307534,0,null,null,null,null,null,null,null,null,null,null,"Arima","Chaguanas","Couva/Tabaquite/Talparo","Diego Martin","Mayaro/Rio Claro","Penal/Debe","Point Fortin","Port of Spain","Princes Town","San Fernando","San Juan/Laventille","Sangre Grande","Siparia","Tobago","Tunapuna/Piarco",0,0,0.1150306748466262,0.13468013468013459,0,0.46047582501918399,0,0,0.85531004989308801,0,0,0,0.085543199315654295,0,0.098651759289707097]
["TTO",2006,"TTO_2006_MICS",68,"Main source of drinking water","Surface water","",0.49776873252474507,0,0,0,0,null,null,null,null,null,null,null,null,null,null,"Arima","Chaguanas","Couva/Tabaquite/Talparo","Diego Martin","Mayaro/Rio Claro","Penal/Debe","Point Fortin","Port of Spain","Princes Town","San Fernando","San Juan/Laventille","Sangre Grande","Siparia","Tobago","Tunapuna/Piarco",0,0,0,0,0,0,0,0,0,0,0,0.87912087912087811,0,0.8784773060029305,0]
["TTO",2006,"TTO_2006_MICS",69,"Main source of drinking water","Bottled water","",1.490702415242682,1.7941315020850861,3.7076112783093271,5.2208541952004879,12.28783765249862,null,null,null,null,null,null,null,null,null,null,"Arima","Chaguanas","Couva/Tabaquite/Talparo","Diego Martin","Mayaro/Rio Claro","Penal/Debe","Point Fortin","Port of Spain","Princes Town","San Fernando","San Juan/Laventille","Sangre Grande","Siparia","Tobago","Tunapuna/Piarco",1.9417475728155309,10.23474178403759,3.220858895705534,5.9932659932659913,0.7366482504604065,4.1442824251726567,9.8591549295774623,8.1168831168831126,5.4882394868139821,3.7914691943128069,7.4934268185802111,1.978021978021975,3.9349871685200961,7.027818448023444,5.3600789214074194]
["TTO",2006,"TTO_2006_MICS",70,"Main source of drinking water","Other","",3.249739396931969,0.97064370986225978,0.64972910779922144,0.1214996990704189,0.1969698202824845,null,null,null,null,null,null,null,null,null,null,"Arima","Chaguanas","Couva/Tabaquite/Talparo","Diego Martin","Mayaro/Rio Claro","Penal/Debe","Point Fortin","Port of Spain","Princes Town","San Fernando","San Juan/Laventille","Sangre Grande","Siparia","Tobago","Tunapuna/Piarco",0.19417475728155309,0.28169014084507121,1.457055214723932,0.20202020202020191,0,0.3069838833461227,0,0.81168831168831113,1.0691375623663599,0,0.92024539877300771,3.186813186813183,0.85543199315654261,0,1.282472870766193]
["TTO",2006,"TTO_2006_MICS",122,"Sanitation","Improved","s_imp",95.326011400543848,99.150450209389987,99.404360407261066,99.744520144521758,99.778466532192695,null,null,null,null,null,null,null,null,null,null,"Arima","Chaguanas","Couva/Tabaquite/Talparo","Diego Martin","Mayaro/Rio Claro","Penal/Debe","Point Fortin","Port of Spain","Princes Town","San Fernando","San Juan/Laventille","Sangre Grande","Siparia","Tobago","Tunapuna/Piarco",97.864077669902912,99.624413145539904,98.121165644171739,97.306397306397301,100,99.769762087490392,92.488262910798127,96.266233766233725,97.576621525302897,98.933649289099534,99.912357581069244,99.560439560439576,100,99.560761346998532,99.704044722130888,2745.7428410425782,3482.050256087995,3916.206686219256,4182.8104571796066,4134.4103002551874,null,null,null,null,null,null,null,null,null,null,545.29366260889458,1042.866147193391,2426.151911488234,1541.1968493669519,542.63826694957345,1257.1165463711329,189.87236660065111,623.90515291180895,1334.2327897438281,818.06097334329422,2307.29873407476,903.87506293173851,1107.8627488831551,720.38630361194623,3100.4630247052369]
["TTO",2006,"TTO_2006_MICS",123,"Sanitation","Not Improved","",4.673988599456159,0.84954979061000901,0.59563959273893885,0.25547985547824881,0.22153346780732919,null,null,null,null,null,null,null,null,null,null,"Arima","Chaguanas","Couva/Tabaquite/Talparo","Diego Martin","Mayaro/Rio Claro","Penal/Debe","Point Fortin","Port of Spain","Princes Town","San Fernando","San Juan/Laventille","Sangre Grande","Siparia","Tobago","Tunapuna/Piarco",2.1359223300970842,0.37558685446009488,1.8788343558282281,2.693602693602692,0,0.230237912509592,7.5117370892018753,3.7337662337662318,2.423378474697083,1.0663507109004771,0.087642418930762606,0.43956043956043911,0,0.43923865300146531,0.29595527786912129,134.62821477074991,29.83521567179865,23.46625184352332,10.71360922429426,9.179438038951643,null,null,null,null,null,null,null,null,null,null,11.90125057281316,3.931634862180561,46.456210888207877,42.662888563791029,0,2.9010381839333692,15.42110591680415,24.19868215340912,33.136533857772299,8.8174236647780457,2.0239462579603189,3.9906183793895691,0,3.178174868876241,9.2032213794020663]
["TTO",2006,"TTO_2006_MICS",124,"Sanitation ladder","Basic","s_bas",80.051079878958959,88.857976876714901,92.799170440252155,96.285487612434778,98.662953338200339,null,null,null,null,null,null,null,null,null,null,"Arima","Chaguanas","Couva/Tabaquite/Talparo","Diego Martin","Mayaro/Rio Claro","Penal/Debe","Point Fortin","Port of Spain","Princes Town","San Fernando","San Juan/Laventille","Sangre Grande","Siparia","Tobago","Tunapuna/Piarco",93.786407766990294,92.676056338028175,92.523006134969208,91.111111111111114,95.580110497237598,96.085955487336861,92.488262910798127,91.233766233766218,93.941553813257272,97.511848341232238,86.722173531989753,94.39560439560438,93.071000855432089,87.554904831625223,91.943439658007236,2305.76813469954,3120.5903804330269,3655.983804581369,4037.755095481798,4088.1880100196031,null,null,null,null,null,null,null,null,null,null,522.57309333352396,970.13090224305074,2287.731364760104,1443.0722056702321,518.6542551506974,1210.6999354281979,189.87236660065111,591.28953783547513,1284.52798895717,806.30440845692362,2002.6948222517381,856.98529697391086,1031.0989484900549,633.51619052932949,2859.1341085342492]
["TTO",2006,"TTO_2006_MICS",125,"Sanitation ladder","Limited","s_lim",15.27493152158516,10.292473332675099,6.6051899670089007,3.459032532087059,1.115513193992308,null,null,null,null,null,null,null,null,null,null,"Arima","Chaguanas","Couva/Tabaquite/Talparo","Diego Martin","Mayaro/Rio Claro","Penal/Debe","Point Fortin","Port of Spain","Princes Town","San Fernando","San Juan/Laventille","Sangre Grande","Siparia","Tobago","Tunapuna/Piarco",4.0776699029126151,6.9483568075117548,5.5981595092024747,6.1952861952861928,4.4198895027624392,3.6838066001534711,0,5.0324675324675292,3.6350677120456241,1.421800947867303,13.190184049079811,5.164835164835158,6.9289991445679959,12.005856515373379,7.7606050641236228,439.97470634304528,361.45987565496779,260.2228816378875,145.05536169781101,46.222290235582477,null,null,null,null,null,null,null,null,null,null,22.720569275370579,72.735244950340359,138.42054672812961,98.124643696719374,23.984011798876221,46.416610942933893,0,32.615615076334016,49.704800786658438,11.756564886370731,304.60391182302862,46.889765957827429,76.763800393101306,86.870113082617252,241.32891617098741]
["TTO",2006,"TTO_2006_MICS",126,"Sanitation ladder","Unimproved","s_unimp",4.2038779736097363,0.79160298832174958,0.46211117148337111,0.25547985547824881,0.22153346780732919,null,null,null,null,null,null,null,null,null,null,"Arima","Chaguanas","Couva/Tabaquite/Talparo","Diego Martin","Mayaro/Rio Claro","Penal/Debe","Point Fortin","Port of Spain","Princes Town","San Fernando","San Juan/Laventille","Sangre Grande","Siparia","Tobago","Tunapuna/Piarco",2.1359223300970842,0.28169014084507121,1.8788343558282281,2.693602693602692,0,0.230237912509592,7.5117370892018753,1.136363636363636,2.3521026372059919,1.0663507109004771,0.087642418930762606,0.43956043956043911,0,0.43923865300146531,0.2301874383426499,121.0872843735667,27.800190340887891,18.205668766695251,10.71360922429426,9.179438038951643,null,null,null,null,null,null,null,null,null,null,11.90125057281316,2.94872614663542,46.456210888207877,42.662888563791029,0,2.9010381839333692,15.42110591680415,7.3648163075592947,32.161929920779002,8.8174236647780457,2.0239462579603189,3.9906183793895691,0,3.178174868876241,7.1580610728682741]
["TTO",2006,"TTO_2006_MICS",127,"Sanitation ladder","Open defecation","s_od",0.47011062584642199,0.057946802288259401,0.13352842125556769,0,0,null,null,null,null,null,null,null,null,null,null,"Arima","Chaguanas","Couva/Tabaquite/Talparo","Diego Martin","Mayaro/Rio Claro","Penal/Debe","Point Fortin","Port of Spain","Princes Town","San Fernando","San Juan/Laventille","Sangre Grande","Siparia","Tobago","Tunapuna/Piarco",0,0.093896713615023705,0,0,0,0,0,2.597402597402596,0.071275837491090704,0,0,0,0,0,0.065767839526471403,13.54093039718323,2.035025330910754,5.2605830768280679,0,0,null,null,null,null,null,null,null,null,null,null,0,0.98290871554514014,0,0,0,0,0,16.833865845849822,0.97460393699330272,0,0,0,0,0,2.0451603065337931]
["TTO",2006,"TTO_2006_MICS",128,"Shared among Improved Sanitation","Yes","s_shared",16.023886132613349,10.38066222688756,6.6447688410723087,3.467892298318946,1.1179899158225659,null,null,null,null,null,null,null,null,null,null,"Arima","Chaguanas","Couva/Tabaquite/Talparo","Diego Martin","Mayaro/Rio Claro","Penal/Debe","Point Fortin","Port of Spain","Princes Town","San Fernando","San Juan/Laventille","Sangre Grande","Siparia","Tobago","Tunapuna/Piarco",4.1666666666666607,6.9745523091423376,5.7053536537710272,6.3667820069204133,4.4198895027624392,3.6923076923076721,0,5.2276559865092747,3.725346968590221,1.437125748502998,13.201754385964961,5.187637969094915,6.9289991445679959,12.058823529411789,7.7836411609498457]
["TTO",2006,"TTO_2006_MICS",129,"Shared among Improved Sanitation","No","",83.976113867386943,89.619337773112449,93.355231158927694,96.532107701681127,98.882010084177381,null,null,null,null,null,null,null,null,null,null,"Arima","Chaguanas","Couva/Tabaquite/Talparo","Diego Martin","Mayaro/Rio Claro","Penal/Debe","Point Fortin","Port of Spain","Princes Town","San Fernando","San Juan/Laventille","Sangre Grande","Siparia","Tobago","Tunapuna/Piarco",95.833333333333329,93.025447690857689,94.29464634622893,93.633217993079583,95.580110497237598,96.307692307692264,100,94.772344013490766,96.27465303140977,98.562874251497007,86.798245614035366,94.812362030905064,93.071000855432089,87.941176470588275,92.21635883905013]
["TTO",2006,"TTO_2006_MICS",130,"Manually calculated ratios","Improved latrines","",92.612704594364942,95.985760528985978,96.793813321538366,100,100,null,null,null,null,null,null,null,null,null,null,"Arima","Chaguanas","Couva/Tabaquite/Talparo","Diego Martin","Mayaro/Rio Claro","Penal/Debe","Point Fortin","Port of Spain","Princes Town","San Fernando","San Juan/Laventille","Sangre Grande","Siparia","Tobago","Tunapuna/Piarco"]
["TTO",2006,"TTO_2006_MICS",135,"Sanitation type","Sewer connection","s_sew",7.3352033586440841,12.00536622070285,17.094902218526791,22.650266762454489,31.826395093317629,null,null,null,null,null,null,null,null,null,null,"Arima","Chaguanas","Couva/Tabaquite/Talparo","Diego Martin","Mayaro/Rio Claro","Penal/Debe","Point Fortin","Port of Spain","Princes Town","San Fernando","San Juan/Laventille","Sangre Grande","Siparia","Tobago","Tunapuna/Piarco",45.242718446601927,8.9201877934272549,0.19171779141104359,24.915824915824921,1.2891344383057119,4.0675364543361248,22.065727699530491,72.564935064934929,16.535994297933051,45.14218009478688,21.25328659070999,0,15.226689478186479,1.6105417276720391,31.70009865175923]
["TTO",2006,"TTO_2006_MICS",136,"Sanitation type","Septic tank connection","s_sep",38.515120911824788,64.99423047171824,72.46740966806091,75.160223630076828,67.503384443762258,null,null,null,null,null,null,null,null,null,null,"Arima","Chaguanas","Couva/Tabaquite/Talparo","Diego Martin","Mayaro/Rio Claro","Penal/Debe","Point Fortin","Port of Spain","Princes Town","San Fernando","San Juan/Laventille","Sangre Grande","Siparia","Tobago","Tunapuna/Piarco",52.03883495145628,83.943661971830991,82.093558282208434,62.693602693602692,65.193370165745918,85.878741366078131,57.276995305164277,15.25974025974025,58.660014255167503,49.526066350711062,61.919368974583897,67.03296703296698,66.124893071000926,73.060029282576949,59.1910555738243]
["TTO",2006,"TTO_2006_MICS",137,"Sanitation type","Improved latrines","s_lat",49.475687130075343,22.150853516968841,9.8420485206733161,1.934029751990247,0.44868699511242932,null,null,null,null,null,null,null,null,null,null,"Arima","Chaguanas","Couva/Tabaquite/Talparo","Diego Martin","Mayaro/Rio Claro","Penal/Debe","Point Fortin","Port of Spain","Princes Town","San Fernando","San Juan/Laventille","Sangre Grande","Siparia","Tobago","Tunapuna/Piarco",0.58252427184465938,6.7605633802817087,15.83588957055218,9.6969696969696937,33.51749539594848,9.823484267075921,13.145539906103281,8.4415584415584366,22.380612972202481,4.2654028436019082,16.739702015775698,32.52747252747249,18.648417450812641,24.890190336749679,8.8128904965471673]
["TTO",2006,"TTO_2006_MICS",138,"Sanitation type","Unimproved facilities","",4.2038779736097363,0.79160298832174958,0.46211117148337111,0.25547985547824881,0.22153346780732919,null,null,null,null,null,null,null,null,null,null,"Arima","Chaguanas","Couva/Tabaquite/Talparo","Diego Martin","Mayaro/Rio Claro","Penal/Debe","Point Fortin","Port of Spain","Princes Town","San Fernando","San Juan/Laventille","Sangre Grande","Siparia","Tobago","Tunapuna/Piarco",2.1359223300970842,0.28169014084507121,1.8788343558282281,2.693602693602692,0,0.230237912509592,7.5117370892018753,1.136363636363636,2.3521026372059919,1.0663507109004771,0.087642418930762606,0.43956043956043911,0,0.43923865300146531,0.2301874383426499]
["TTO",2006,"TTO_2006_MICS",139,"Sanitation type","Open defecation","",0.47011062584642199,0.057946802288259401,0.13352842125556769,0,0,null,null,null,null,null,null,null,null,null,null,"Arima","Chaguanas","Couva/Tabaquite/Talparo","Diego Martin","Mayaro/Rio Claro","Penal/Debe","Point Fortin","Port of Spain","Princes Town","San Fernando","San Juan/Laventille","Sangre Grande","Siparia","Tobago","Tunapuna/Piarco",0,0.093896713615023705,0,0,0,0,0,2.597402597402596,0.071275837491090704,0,0,0,0,0,0.065767839526471403]
["TTO",2006,"TTO_2006_MICS",148,"Shared among improved sanitation facilities","Yes","",15.27493152158516,10.292473332675099,6.6051899670089007,3.459032532087059,1.115513193992308,null,null,null,null,null,null,null,null,null,null,"Arima","Chaguanas","Couva/Tabaquite/Talparo","Diego Martin","Mayaro/Rio Claro","Penal/Debe","Point Fortin","Port of Spain","Princes Town","San Fernando","San Juan/Laventille","Sangre Grande","Siparia","Tobago","Tunapuna/Piarco",4.0776699029126151,6.9483568075117548,5.5981595092024747,6.1952861952861928,4.4198895027624392,3.6838066001534711,0,5.0324675324675292,3.6350677120456241,1.421800947867303,13.190184049079811,5.164835164835158,6.9289991445679959,12.005856515373379,7.7606050641236228]
["TTO",2006,"TTO_2006_MICS",149,"Shared among improved sanitation facilities","No","",80.051079878958959,88.857976876714901,92.799170440252155,96.285487612434778,98.662953338200339,null,null,null,null,null,null,null,null,null,null,"Arima","Chaguanas","Couva/Tabaquite/Talparo","Diego Martin","Mayaro/Rio Claro","Penal/Debe","Point Fortin","Port of Spain","Princes Town","San Fernando","San Juan/Laventille","Sangre Grande","Siparia","Tobago","Tunapuna/Piarco",93.786407766990294,92.676056338028175,92.523006134969208,91.111111111111114,95.580110497237598,96.085955487336861,92.488262910798127,91.233766233766218,93.941553813257272,97.511848341232238,86.722173531989753,94.39560439560438,93.071000855432089,87.554904831625223,91.943439658007236]
["TTO",2006,"TTO_2006_MICS",150,"Shared among improved sanitation facilities","DK/missing","",4.673988599456159,0.84954979061000901,0.59563959273893885,0.25547985547824881,0.22153346780732919,null,null,null,null,null,null,null,null,null,null,"Arima","Chaguanas","Couva/Tabaquite/Talparo","Diego Martin","Mayaro/Rio Claro","Penal/Debe","Point Fortin","Port of Spain","Princes Town","San Fernando","San Juan/Laventille","Sangre Grande","Siparia","Tobago","Tunapuna/Piarco",2.1359223300970842,0.37558685446009488,1.8788343558282281,2.693602693602692,0,0.230237912509592,7.5117370892018753,3.7337662337662318,2.423378474697083,1.0663507109004771,0.087642418930762606,0.43956043956043911,0,0.43923865300146531,0.29595527786912129]
["TTO",2006,"TTO_2006_MICS",151,"Shared among all sanitation facilities","Yes","",15.73058192168889,10.298440949891109,6.6948004616995531,3.459032532087059,1.115513193992308,null,null,null,null,null,null,null,null,null,null,"Arima","Chaguanas","Couva/Tabaquite/Talparo","Diego Martin","Mayaro/Rio Claro","Penal/Debe","Point Fortin","Port of Spain","Princes Town","San Fernando","San Juan/Laventille","Sangre Grande","Siparia","Tobago","Tunapuna/Piarco",4.0776699029126151,6.9548872180451307,5.5981595092024747,6.2626262626262612,4.4198895027624392,3.6838066001534711,0.46948356807511721,5.1666666666666652,3.6376604850214052,2.0142180094786788,13.190184049079811,5.2747252747252684,6.9289991445679959,12.44509516837485,7.8644290885159371]
["TTO",2006,"TTO_2006_MICS",152,"Shared among all sanitation facilities","No","",84.269418078311261,89.70155905010887,93.305199538300414,96.540967467913006,98.884486806007672,null,null,null,null,null,null,null,null,null,null,"Arima","Chaguanas","Couva/Tabaquite/Talparo","Diego Martin","Mayaro/Rio Claro","Penal/Debe","Point Fortin","Port of Spain","Princes Town","San Fernando","San Juan/Laventille","Sangre Grande","Siparia","Tobago","Tunapuna/Piarco",95.922330097087368,93.045112781954899,94.401840490797468,93.737373737373744,95.580110497237598,96.316193399846455,99.53051643192488,94.833333333333343,96.362339514978572,97.985781990521346,86.809815950920509,94.725274725274716,93.071000855432089,87.554904831625223,92.135570911484066]
["TTO",2006,"TTO_2006_MICS",153,"Kind of toilet facility","Flush to piped sewer system","",7.3352033586440841,12.00536622070285,17.094902218526791,22.650266762454489,31.826395093317629,null,null,null,null,null,null,null,null,null,null,"Arima","Chaguanas","Couva/Tabaquite/Talparo","Diego Martin","Mayaro/Rio Claro","Penal/Debe","Point Fortin","Port of Spain","Princes Town","San Fernando","San Juan/Laventille","Sangre Grande","Siparia","Tobago","Tunapuna/Piarco",45.242718446601927,8.9201877934272549,0.19171779141104359,24.915824915824921,1.2891344383057119,4.0675364543361248,22.065727699530491,72.564935064934929,16.535994297933051,45.14218009478688,21.25328659070999,0,15.226689478186479,1.6105417276720391,31.70009865175923,211.28107442743129,421.61471213642108,673.48323649159352,949.84438778821232,1318.755241155658,null,null,null,null,null,null,null,null,null,null,252.0901257695881,93.376327976788318,4.7404296824701913,394.63171921506722,6.9953367746722304,51.25167458282283,45.299498630612149,470.29612706842869,226.10811338244639,373.27093514227079,490.80696755537832,0,168.69082061693879,11.65330785254622,985.76726774928852]
["TTO",2006,"TTO_2006_MICS",154,"Kind of toilet facility","Flush to septic tank","",38.515120911824788,64.99423047171824,72.46740966806091,75.160223630076828,67.503384443762258,null,null,null,null,null,null,null,null,null,null,"Arima","Chaguanas","Couva/Tabaquite/Talparo","Diego Martin","Mayaro/Rio Claro","Penal/Debe","Point Fortin","Port of Spain","Princes Town","San Fernando","San Juan/Laventille","Sangre Grande","Siparia","Tobago","Tunapuna/Piarco",52.03883495145628,83.943661971830991,82.093558282208434,62.693602693602692,65.193370165745918,85.878741366078131,57.276995305164277,15.25974025974025,58.660014255167503,49.526066350711062,61.919368974583897,67.03296703296698,66.124893071000926,73.060029282576949,59.1910555738243,1109.378394855707,2282.52293741835,2854.9789276076858,3151.8620662902631,2797.063310812975,null,null,null,null,null,null,null,null,null,null,289.95774122853902,878.72039169735285,2029.8519900337251,992.97873132223674,353.76417403342401,1082.087242607151,117.58593261563161,98.89896184436769,802.09904014548658,409.52034354191392,1429.9180312489671,608.56930285690953,732.57305807243779,528.63641985641414,1840.6442758804151]
["TTO",2006,"TTO_2006_MICS",155,"Kind of toilet facility","Flush to somewhere else","",0,0,0.19454004466722991,0.12647953818860239,0.1269571412490702,null,null,null,null,null,null,null,null,null,null,"Arima","Chaguanas","Couva/Tabaquite/Talparo","Diego Martin","Mayaro/Rio Claro","Penal/Debe","Point Fortin","Port of Spain","Princes Town","San Fernando","San Juan/Laventille","Sangre Grande","Siparia","Tobago","Tunapuna/Piarco",0,0,0.19171779141104359,0.20202020202020191,0,0,0,1.136363636363636,0.213827512473272,0,0,0,0,0,0,0,0,7.6642414934500991,5.3039498730155543,5.2605830768280679,null,null,null,null,null,null,null,null,null,null,0,0,4.7404296824701913,3.1997166422843271,0,0,0,7.3648163075592947,2.9238118109799078,0,0,0,0,0,0]
["TTO",2006,"TTO_2006_MICS",156,"Kind of toilet facility","Flush to unknown place/not sure/DK where","",0.14053371727059091,0.087353089514717402,0.44017447085131489,0.17508230083018611,0.20379897925365009,null,null,null,null,null,null,null,null,null,null,"Arima","Chaguanas","Couva/Tabaquite/Talparo","Diego Martin","Mayaro/Rio Claro","Penal/Debe","Point Fortin","Port of Spain","Princes Town","San Fernando","San Juan/Laventille","Sangre Grande","Siparia","Tobago","Tunapuna/Piarco",0,0,0,0.40404040404040381,0,0,0,0,0,0,0.35056967572305059,0,0,0.73206442166910879,0.65767839526471394,4.0478925159206378,3.0677404598006892,17.341434508390289,7.3421184213275286,8.4445935911024463,null,null,null,null,null,null,null,null,null,null,0,0,0,6.3994332845686532,0,0,0,0,0,0,8.0957850318412756,0,0,5.2969581147937363,20.45160306533792]
["TTO",2006,"TTO_2006_MICS",157,"Kind of toilet facility","Ventilated Improved Pit latrine (VIP)","",3.804243129512634,3.135228853290347,1.3239820564268829,0.22599160620382269,0,null,null,null,null,null,null,null,null,null,null,"Arima","Chaguanas","Couva/Tabaquite/Talparo","Diego Martin","Mayaro/Rio Claro","Penal/Debe","Point Fortin","Port of Spain","Princes Town","San Fernando","San Juan/Laventille","Sangre Grande","Siparia","Tobago","Tunapuna/Piarco",0,0.56338028169014243,0,0.20202020202020191,13.996316758747721,1.227935533384491,3.2863849765258202,7.4675324675324628,0,0,2.7607361963190229,0,1.710863986313085,0,1.381124630055899,109.5763179952491,110.1056466051248,52.160562781856989,9.4770123942100355,0,null,null,null,null,null,null,null,null,null,null,0,5.8974522932708409,0,3.1997166422843271,75.949370696441349,15.47220364764463,6.7467338386018136,48.397364306818233,0,0,63.754307125750053,0,18.954024788420071,0,42.948366437209643]
["TTO",2006,"TTO_2006_MICS",158,"Kind of toilet facility","Pit latrine with slab","",45.530910283292123,18.92827157416378,8.0778919933951236,1.5329558449562379,0.2448880158587792,null,null,null,null,null,null,null,null,null,null,"Arima","Chaguanas","Couva/Tabaquite/Talparo","Diego Martin","Mayaro/Rio Claro","Penal/Debe","Point Fortin","Port of Spain","Princes Town","San Fernando","San Juan/Laventille","Sangre Grande","Siparia","Tobago","Tunapuna/Piarco",0.58252427184465938,6.1971830985915668,15.83588957055218,9.0909090909090882,19.521178637200769,8.595548733691432,9.8591549295774623,0.97402597402597335,22.380612972202481,4.2654028436019082,13.62839614373361,32.52747252747249,16.937553464499551,24.158125915080571,6.7740874712265544,1311.45916124828,664.73921946829671,318.2425248297277,64.284872285585109,10.1471546954365,null,null,null,null,null,null,null,null,null,null,3.245795610767225,64.871975225979256,391.55949177203718,143.98724890279479,105.9293854450366,108.30542553351241,20.240201515805449,6.3126996921936813,306.02563621589712,35.269694659112183,314.72364311283002,295.30576007482807,187.64484540535881,174.79961778819319,210.65151157298061]
["TTO",2006,"TTO_2006_MICS",159,"Kind of toilet facility","Pit latrine without slab/open pit","",3.631794210344347,0.79160298832174958,0.2675711268161412,0,0,null,null,null,null,null,null,null,null,null,null,"Arima","Chaguanas","Couva/Tabaquite/Talparo","Diego Martin","Mayaro/Rio Claro","Penal/Debe","Point Fortin","Port of Spain","Princes Town","San Fernando","San Juan/Laventille","Sangre Grande","Siparia","Tobago","Tunapuna/Piarco",0,0.28169014084507121,1.6871165644171839,2.49158249158249,0,0.230237912509592,7.5117370892018753,0,2.1382751247327199,0,0.087642418930762606,0.32967032967032928,0,0.43923865300146531,0.098651759289707097,104.6091492414628,27.800190340887891,10.54142727324516,0,0,null,null,null,null,null,null,null,null,null,null,0,2.94872614663542,41.715781205737692,39.463171921506699,0,2.9010381839333692,15.42110591680415,0,29.238118109799089,0,2.0239462579603189,2.992963784542177,0,3.178174868876241,3.0677404598006892]
["TTO",2006,"TTO_2006_MICS",160,"Kind of toilet facility","Bucket","",0.14200672530757,0,0,0,0,null,null,null,null,null,null,null,null,null,null,"Arima","Chaguanas","Couva/Tabaquite/Talparo","Diego Martin","Mayaro/Rio Claro","Penal/Debe","Point Fortin","Port of Spain","Princes Town","San Fernando","San Juan/Laventille","Sangre Grande","Siparia","Tobago","Tunapuna/Piarco",0,0,0,0,0,0,0,0,0,0,0,0,0,0,0.13153567905294281,4.0903206130675853,0,0,0,0,null,null,null,null,null,null,null,null,null,null,0,0,0,0,0,0,0,0,0,0,0,0,0,0,4.0903206130675853]
["TTO",2006,"TTO_2006_MICS",161,"Kind of toilet facility","No facilities or bush or field","",0.47011062584642199,0.057946802288259401,0.13352842125556769,0,0,null,null,null,null,null,null,null,null,null,null,"Arima","Chaguanas","Couva/Tabaquite/Talparo","Diego Martin","Mayaro/Rio Claro","Penal/Debe","Point Fortin","Port of Spain","Princes Town","San Fernando","San Juan/Laventille","Sangre Grande","Siparia","Tobago","Tunapuna/Piarco",0,0.093896713615023705,0,0,0,0,0,2.597402597402596,0.071275837491090704,0,0,0,0,0,0.065767839526471403,13.54093039718323,2.035025330910754,5.2605830768280679,0,0,null,null,null,null,null,null,null,null,null,null,0,0.98290871554514014,0,0,0,0,0,16.833865845849822,0.97460393699330272,0,0,0,0,0,2.0451603065337931]
["TTO",2006,"TTO_2006_MICS",162,"Kind of toilet facility","Other","",0.43007703795781871,0,0,0,0.094576326558258997,null,null,null,null,null,null,null,null,null,null,"Arima","Chaguanas","Couva/Tabaquite/Talparo","Diego Martin","Mayaro/Rio Claro","Penal/Debe","Point Fortin","Port of Spain","Princes Town","San Fernando","San Juan/Laventille","Sangre Grande","Siparia","Tobago","Tunapuna/Piarco",1.165048543689319,0,0,0,0,0,0,0,0,1.0663507109004771,0,0.10989010989010981,0,0,0,12.38781451903631,0,0,0,3.918854962123576,null,null,null,null,null,null,null,null,null,null,6.49159122153445,0,0,0,0,0,0,0,0,8.8174236647780457,0,0.99765459484739216,0,0,0]
["TTO",2006,"TTO_2006_MICS",163,"Kind of toilet facility","Missing","",0,0,0,0.12900031728964631,0,null,null,null,null,null,null,null,null,null,null,"Arima","Chaguanas","Couva/Tabaquite/Talparo","Diego Martin","Mayaro/Rio Claro","Penal/Debe","Point Fortin","Port of Spain","Princes Town","San Fernando","San Juan/Laventille","Sangre Grande","Siparia","Tobago","Tunapuna/Piarco",0.97087378640776567,0,0,0,0,0,0,0,0,0,0,0,0,0,0,0,0,0,5.4096593512787088,0,null,null,null,null,null,null,null,null,null,null,5.4096593512787088,0,0,0,0,0,0,0,0,0,0,0,0,0,0]
["TTO",2011,"TTO_2011_MICS",16,"Water","Improved","w_imp",98.417915886955811,99.602948479888738,99.223671222914973,99.782170921356538,99.817578593513971,99.106364817350951,98.839702344436347,99.758815167412749,100,99.681577732755613,97.490658605398721,100,99.155681311186356,99.730828370425726,99.73589636159619,"Central","East","North West","South West","Tobago","","","","","","","","","","",99.764615490758075,99.689743827159887,98.246194626446581,99.717837302713804,99.253269467725673]
["TTO",2011,"TTO_2011_MICS",17,"Water","Not Improved","",1.5820841130442009,0.39705152011126621,0.77632877708503678,0.21782907864345169,0.18242140648603261,0.89363518264906883,1.1602976555636799,0.24118483258726189,0,0.31842226724436878,2.509341394601257,0,0.84431868881362049,0.26917162957427931,0.2641036384038164,"Central","East","North West","South West","Tobago","","","","","","","","","","",0.2353845092419298,0.31025617284011309,1.753805373553347,0.2821626972862335,0.7467305322743274]
["TTO",2011,"TTO_2011_MICS",18,"Water ladder","Basic","w_bas",97.74643859619583,99.569636955080298,99.177432503951124,99.594990517954656,99.751893378917629,98.063693498373752,98.774936361569516,99.757477295544334,99.897052806390533,99.681577732755613,97.330270830222958,100,99.152774813908295,99.464096084450475,99.458522558506971,"Central","East","North West","South West","Tobago","","","","","","","","","","",99.72371902731922,99.687328099502636,97.659445398741966,99.710646358103105,98.443229194581974]
["TTO",2011,"TTO_2011_MICS",19,"Water ladder","Limited","w_lim",0.56952385719921772,0.029593624676704601,0.038822318843987701,0.1861408678093896,0.065685214596350794,0.97971480858566695,0.0517036706333368,0,0.10294719360947779,0,0.023808764466076299,0,0,0.26529341394059441,0.27737380308921927,"Central","East","North West","South West","Tobago","","","","","","","","","","",0.039022912110197198,0,0.53716340736234869,0,0.80751150550137629]
["TTO",2011,"TTO_2011_MICS",20,"Water ladder","Unimproved","w_unimp",1.4040234644329359,0.32678535855124707,0.75188719773934876,0.21886861423594139,0.091151244506442006,0.9565916930405961,1.0441007912138081,0.18716999119714239,0,0.15910734653890199,1.994843730213026,0,0.84722518609168451,0.27061050160892819,0.2641036384038164,"Central","East","North West","South West","Tobago","","","","","","","","","","",0.10506168645053091,0.246846237234772,1.642487543108242,0.28935364189690038,0.74925929991665385]
["TTO",2011,"TTO_2011_MICS",21,"Water ladder","Surface water","w_sur",0.28001408217187912,0.073984061691761499,0.031857979465538797,0,0.091270161979590606,0,0.1292591765833421,0.055352713258524998,0,0.15931492070546691,0.65107667509796807,0,0,0,0,"Central","East","North West","South West","Tobago","","","","","","","","","","",0.13219637412005569,0.065825663262605902,0.1609036507874454,0,0]
["TTO",2011,"TTO_2011_MICS",22,"Improved water point at more than 30 minutes","Yes","",0.57927913533795738,0.0297127041086995,0.039128990419287801,0.18654916538253111,0.065805257472574097,0.98917719546695571,0.0523175437478084,0,0.10294719360947779,0,0.024455846704317399,0,0,0.26601327379515788,0.27810829722088259,"Central","East","North West","South West","Tobago","","","","","","","","","","",0.039115717302447298,0,0.54702847062978865,0,0.81360753562688337]
["TTO",2011,"TTO_2011_MICS",23,"Improved water point at more than 30 minutes","No","",99.42072086466203,99.970287295891296,99.960871009580714,99.813450834617484,99.934194742527424,99.010822804533063,99.947682456252195,100,99.897052806390533,100,99.975544153295687,100,100,99.733986726204833,99.721891702779104,"Central","East","North West","South West","Tobago","","","","","","","","","","",99.960884282697549,100,99.452971529370217,100,99.186392464373114]
["TTO",2011,"TTO_2011_MICS",29,"Piped water","Yes","w_pip",83.507590656463705,92.070267048457794,93.520286120997511,95.935475589760628,98.123009880784025,93.721422376421131,94.870079253768864,98.344651842662174,97.828737662729381,98.86749316777626,72.068241052653619,87.015734178261312,89.582764632999456,91.476020850411061,95.457419511418834,"Central","East","North West","South West","Tobago","","","","","","","","","","",98.319039099858784,72.492992877087943,90.385123235094341,92.397100964974527,91.217120946757447]
["TTO",2011,"TTO_2011_MICS",30,"Piped water","No","",16.49240934353578,7.9297329515421593,6.4797138790024453,4.0645244102393914,1.876990119215973,6.2785776235788768,5.1299207462311847,1.6553481573378519,2.171262337270651,1.132506832223741,27.931758947346442,12.98426582173861,10.41723536700052,8.5239791495888273,4.5425804885811552,"Central","East","North West","South West","Tobago","","","","","","","","","","",1.680960900141212,27.507007122912452,9.6148767649055493,7.6028990350254011,8.7828790532424588]
["TTO",2011,"TTO_2011_MICS",31,"Piped water on premises","Yes","w_pop",72.210877905979657,89.9395341940333,91.59741522557438,94.922768861072413,98.123009880784025,82.055480326986867,92.599694001303433,96.469812214731789,96.892942104467181,98.86749316777626,61.423227185753291,84.229637551359843,88.991730290288757,89.884905412415776,95.228267784195879,"Central","East","North West","South West","Tobago","","","","","","","","","","",96.648003551323768,70.224372466013079,84.733766812311742,88.248584185912691,90.441454227330482]
["TTO",2011,"TTO_2011_MICS",32,"Piped water on premises","No","",27.789122094019511,10.060465805966709,8.4025847744255362,5.0772311389275746,1.876990119215973,17.94451967301314,7.4003059986965987,3.5301877852682551,3.107057895532833,1.132506832223741,38.576772814246759,15.770362448640091,11.00826970971122,10.11509458758413,4.7717322158041124,"Central","East","North West","South West","Tobago","","","","","","","","","","",3.351996448676168,29.775627533987279,15.26623318768819,11.751415814087141,9.5585457726693814]
["TTO",2011,"TTO_2011_MICS",35,"Water source on premises","Yes","",87.504239336714306,97.726949640221548,97.601681192034746,98.252915130396616,99.449818679464002,88.007170390290483,97.039385604052654,98.148518152284339,98.409715496969966,99.431759476646775,87.026179630188778,97.566471557647091,98.595144645473667,97.668720345290197,99.008325311379281,"Central","East","North West","South West","Tobago","","","","","","","","","","",98.475687347475642,97.285644289136414,92.36267434341454,95.721775038670074,95.793247220029215]
["TTO",2011,"TTO_2011_MICS",36,"Water source on premises","No","",12.495760663285241,2.2730503597784741,2.3983188079652571,1.7470848696033541,0.550181320536001,11.992829609709551,2.9606143959473492,1.8514818477156829,1.590284503030067,0.5682405233532215,12.973820369811159,2.4335284423528831,1.4048553545263109,2.3312796547097911,0.99167468862068364,"Central","East","North West","South West","Tobago","","","","","","","","","","",1.5243126525243831,2.7143557108636531,7.6373256565853573,4.2782249613299053,4.2067527799707527]
["TTO",2011,"TTO_2011_MICS",37,"Improved Water source on premises","Yes","w_premises",88.341703778950404,97.791478390123345,97.80275808291843,98.467405773156401,99.540131024517365,88.625196167143187,97.133951117821312,98.200202841681914,98.409715496969966,99.589559890483287,88.157910517557227,97.566471557647091,99.000092877117339,97.932326384098261,99.270502319867802,"Central","East","North West","South West","Tobago","","","","","","","","","","",98.534777669751534,97.490137826123856,93.000537651579378,95.992630433898341,96.513946325141916]
["TTO",2011,"TTO_2011_MICS",38,"Improved Water source on premises","No","",11.65829622104909,2.208521609876676,2.197241917081584,1.5325942268435779,0.45986897548262717,11.374803832856831,2.8660488821786632,1.7997971583181029,1.590284503030067,0.410440109516723,11.84208948244272,2.4335284423528831,0.99990712288265637,2.0676736159017119,0.72949768013216765,"Central","East","North West","South West","Tobago","","","","","","","","","","",1.4652223302484899,2.5098621738762259,6.9994623484206073,4.0073695661016107,3.4860536748580619]
["TTO",2011,"TTO_2011_MICS",41,"Water point at more than 30 minutes","Yes","",0.65534593160625065,0.029593624676704601,0.071373508152737797,0.29961530017293497,0.065745142111588106,0.97971480858566695,0.0517036706333368,0.056336305313355997,0.10294719360947779,0,0.22307732908617439,0,0,0.26595278369129521,0.54147744149303578,"Central","East","North West","South West","Tobago","","","","","","","","","","",0.039022912110197198,0.21393340560346899,0.53858549101254249,0,1.510061112724699]
["TTO",2011,"TTO_2011_MICS",42,"Water point at more than 30 minutes","No","w_30min",99.344654068393695,99.970406375323293,99.928626491847268,99.700384699827055,99.934254857888419,99.020285191414331,99.948296329366656,99.943663694686649,99.897052806390533,100,99.77692267091382,100,100,99.73404721630871,99.458522558506971,"Central","East","North West","South West","Tobago","","","","","","","","","","",99.960977087889802,99.786066594396544,99.461414508987474,100,98.489938887275315]
["TTO",2011,"TTO_2011_MICS",58,"Main source of drinking water","Piped into dwelling","",61.824692262633022,81.277250536238412,79.515628855021163,80.364872954724504,77.000869760810716,72.082265141737395,84.000460413421266,83.257738086300762,80.644414699520297,75.675796729094102,50.724343830841534,74.848732469816198,77.631543256123763,78.91053342013079,76.754509279501136,"Central","East","North West","South West","Tobago","","","","","","","","","","",79.673566016849207,62.977907989994087,73.029595234254728,76.876889560969587,77.051392699401859]
["TTO",2011,"TTO_2011_MICS",59,"Main source of drinking water","Piped into compound, yard or plot","",7.2871140212014129,2.432119476590108,0.99982518801019715,1.5514451867066921,0.5270613794736525,6.7938967793727949,0.65574167914583281,0.56226947381439607,1.7689363026139009,0,7.4494586454386909,4.2661027128346793,2.7967413372635481,1.5401505133783591,0.79611369908654905,"Central","East","North West","South West","Tobago","","","","","","","","","","",1.0790159605524641,2.6032688081841351,2.754257265313067,4.8250634030595734,0.49500342660518609]
["TTO",2011,"TTO_2011_MICS",60,"Main source of drinking water","Piped to neighbour","",5.7778429938008911,0.92769057316998504,0.94627697057100435,0.47495873088914842,0,6.1216722748732781,1.1132399768156831,0.55164809060184539,0.82640652474312981,0,5.1328184094675411,1.461788665486901,0.3430607736618127,0.53171330236411518,0,"Central","East","North West","South West","Tobago","","","","","","","","","","",0.789668146216436,0.73994930845777351,2.52484752005885,2.4851750831700792,0.33750233632171778]
["TTO",2011,"TTO_2011_MICS",61,"Main source of drinking water","Public tap / standpipe","",5.4823341612267553,1.20304228125456,0.70155202488651425,0.5377479977990357,0,5.4806284586402843,0.95263293684027095,1.3231915373285581,0.1093890335190527,0,5.5121954574327718,1.3243079614145781,0.24797356904889001,0.68898563005121594,0.2291517272229566,"Central","East","North West","South West","Tobago","","","","","","","","","","",0.77966918373490524,1.5286711026170761,3.026624430254556,1.6633416958916409,0.43816438310520223]
["TTO",2011,"TTO_2011_MICS",62,"Main source of drinking water","Protected spring","",0.80008892801223508,0.49024688800345773,0.71211956610875882,0.52895327350459176,0.044858195334093298,0.43103117140243458,1.4120647393253281,0.26580011489407818,0.65651099147151837,0,1.2520187801145659,0.19097489934530759,0.52488475361128395,0.24818771058885211,0.1053404825542288,"Central","East","North West","South West","Tobago","","","","","","","","","","",0.2457430065232751,0.065317089018971194,1.6200302918126761,0,0.86897153259844584]
["TTO",2011,"TTO_2011_MICS",63,"Main source of drinking water","Unprotected spring","",1.126894319488754,0.32375380158546752,0.46070709886346189,0.21782907864345169,0,0.74041404811104028,0.83726112039873535,0.056025527160779298,0,0,1.647370036108504,0,0.61561150637241213,0.26917162957427931,0.2641036384038164,"Central","East","North West","South West","Tobago","","","","","","","","","","",0.10423204777875331,0.24493908382114191,1.2858175168932451,0.13028032984407781,0.7467305322743274]
["TTO",2011,"TTO_2011_MICS",64,"Main source of drinking water","Rainwater collection","",12.575946842685349,6.2880463032491356,4.1736144928302217,2.6306800549782281,1.029776473136863,4.275946258217016,2.5064302666398111,0.48478676518315872,1.0553174050191121,0.40495138816505188,22.096923258812581,11.3719212600571,7.6302895815635514,6.6753135096707581,3.1080784687983249,"Central","East","North West","South West","Tobago","","","","","","","","","","",1.0411576845424699,25.59627020063671,5.0149354201390013,6.0173126567753181,5.4395219657471383]
["TTO",2011,"TTO_2011_MICS",65,"Main source of drinking water","Tanker-truck","",0.95315902876754954,0.29213739759857038,0.51397081668956723,0.17603294497068131,0,0.27858388097823422,0.051128084702365399,0.13383495694739281,0.30628929385334741,0,1.6163020381326461,0.58972184816276318,0.79771537141971416,0.49937486399737752,0,"Central","East","North West","South West","Tobago","","","","","","","","","","",0,0.81646361273713974,0.36094616187742617,0.88389642381914213,0.13428101943771631]
["TTO",2011,"TTO_2011_MICS",66,"Main source of drinking water","Cart with small tank / drum","",0.036535595456127397,0,0,0,0,0.063641315920707806,0,0,0,0,0,0,0,0,0,"Central","East","North West","South West","Tobago","","","","","","","","","","",0.019106729296069502,0,0,0,0]
["TTO",2011,"TTO_2011_MICS",67,"Main source of drinking water","Surface water (river, stream, dam, lake, pond, canal, irrigation channel)","",0.26306173026006852,0.073297718525798694,0.031556514742567203,0,0.091270161979590606,0,0.12782021175591349,0.055047361072738103,0,0.15931492070546691,0.61746893391173507,0,0,0,0,"Central","East","North West","South West","Tobago","","","","","","","","","","",0.1311524614631765,0.065317089018971194,0.15647946398461551,0,0]
["TTO",2011,"TTO_2011_MICS",68,"Main source of drinking water","Bottled water","",3.68020205317158,6.6924150237844229,11.66068330879742,13.517479777783651,21.21501278475861,3.578699536208831,8.1480042475458347,13.179546142342691,14.63273574925973,23.600829615496529,3.7065981851584162,5.9464501828823746,9.1834726684936445,10.636569420244131,18.74270270443278,"Central","East","North West","South West","Tobago","","","","","","","","","","",16.136688763042589,5.3618957155143931,9.9149583027362951,6.9661584790281168,14.488432104508041]
["TTO",2011,"TTO_2011_MICS",69,"Main source of drinking water","Other","",0.19212806329537799,0,0.18647031438789691,0,0,0.1532211345380288,0.19521632340903161,0.13011194435374451,0,0,0.2445024245810189,0,0,0,0,"Central","East","North West","South West","Tobago","","","","","","","","","","",0,0,0.23382046964386741,0.078390899324983596,0]
["TTO",2011,"TTO_2011_MICS",70,"Main source of drinking water","Missing","",0,0,0.0975948490911107,0,0.091151244506442006,0,0,0,0,0.15910734653890199,0,0,0.2287071824412085,0,0,"Central","East","North West","South West","Tobago","","","","","","","","","","",0,0,0.077687923031619394,0.073491468117172096,0]
["TTO",2011,"TTO_2011_MICS",122,"Sanitation","Improved","s_imp",96.010591414771227,99.203866719016659,99.823596285238096,99.473704800744542,99.889623814636082,94.26656361903737,99.051806429156159,99.426760561260934,99.656756279201915,99.840892653461083,98.066255161415,99.703337352170863,99.586609365647064,100,99.954854078905328,"Central","East","North West","South West","Tobago","","","","","","","","","","",99.490170316577235,99.766724682075122,96.844363651738036,99.404387911269495,99.813791814443192,null,null,null,null,null,null,null,null,null,null,3433.4217566179432,3547.8121747398832,3571.999023480505,3555.0691828076938,3574.833052583188,1935.2751692358679,2031.352739018042,2039.5480290795749,2046.956666352999,2046.9923139713619,1494.067302099141,1520.308258541379,1520.63912010954,1524.694438547561,1523.301153273688,6803.2749575376893,1352.17049358349,4066.4817604053228,4723.6058163402731,737.60216236247913]
["TTO",2011,"TTO_2011_MICS",123,"Sanitation","Not Improved","",3.989408585228738,0.79613328098335268,0.17640371476188321,0.52629519925545587,0.1103761853639106,5.7334363809626634,0.94819357084386757,0.57323943873907712,0.34324372079810439,0.15910734653890199,1.933744838584992,0.29666264782912871,0.41339063435293211,0,0.0451459210946695,"Central","East","North West","South West","Tobago","","","","","","","","","","",0.5098296834228061,0.23327531792489711,3.155636348261861,0.59561208873050775,0.18620818555680979,null,null,null,null,null,null,null,null,null,null,142.6647001203184,28.471988445657079,6.3122740545960649,18.809150093288789,3.9501243531476979,117.7063917097088,19.445537408049042,11.758900328957271,7.0502497643315243,3.2621054039646542,29.461152862188381,4.5236065860292571,6.3122740545960649,0,0.68801894918304418,34.862856368653887,3.1616553794315938,132.5047444043856,28.302943016170879,1.3760378983660879]
["TTO",2011,"TTO_2011_MICS",124,"Sanitation ladder","Basic","s_bas",86.042846158868898,93.394782061698137,95.804436869872617,96.64667982594753,98.978698537831463,81.471849598137197,93.412638029802011,93.512109936092386,98.260182352604403,99.249657650253013,91.80801371855668,95.013262951914754,94.465989367580434,97.513915690100333,98.782160823011282,"Central","East","North West","South West","Tobago","","","","","","","","","","",94.166205015238901,97.081518794374816,91.630405740156135,95.53192029137692,94.728608814864643,null,null,null,null,null,null,null,null,null,null,3068.9747637918781,3340.0628001141599,3428.180988054537,3448.9175618952868,3542.2330120224442,1670.4275697496089,1915.704770679323,1918.220390955187,2018.2709413119951,2034.870492189194,1392.6442813610499,1448.7925095880901,1442.4497416592139,1486.789249336917,1500.1991790476829,6434.2290198219098,1313.914942531062,3845.102760081003,4535.0986348921579,700.02376855222315]
["TTO",2011,"TTO_2011_MICS",125,"Sanitation ladder","Limited","s_lim",9.9573565832388056,5.8090846573185644,4.0191594153654906,2.826244106201989,0.91092527680462165,12.78725051743962,5.6391683993541486,5.9146506251686137,1.396573926597531,0.59123500320807065,6.2498033691687427,4.6900744002561474,5.120619998066652,2.4860843098996308,1.1725358603114051,"Central","East","North West","South West","Tobago","","","","","","","","","","",5.323570236758723,2.684875287765486,5.2119508235435941,3.8718777924333549,5.0851829995785556,null,null,null,null,null,null,null,null,null,null,355.15882414690378,207.74937462572481,143.8180354259691,100.8568835436197,32.600040560744553,262.1786041557412,115.64796833871971,121.3276381243888,28.685725041004648,12.12182178216732,94.803847389464067,71.515748953288892,78.18937845032633,37.905189210643172,17.80723685721777,363.75120034698222,36.337480122239938,218.710004993805,183.8060790296785,37.578393810256081]
["TTO",2011,"TTO_2011_MICS",126,"Sanitation ladder","Unimproved","s_unimp",3.723343684266351,0.79613328098335268,0.17640371476188321,0.52707606785049177,0.1103761853639106,5.4212736547965612,0.94819357084386757,0.57323943873907712,0.34324372079810439,0.15910734653890199,1.724160343462998,0.29666264782912871,0.41339063435293211,0,0.045303316677337301,"Central","East","North West","South West","Tobago","","","","","","","","","","",0.51022474800226425,0.23360591785976151,3.0014746827625349,0.54102873181678923,0.093104092778404896,null,null,null,null,null,null,null,null,null,null,132.8041587889696,28.471988445657079,6.3122740545960649,18.809150093288789,3.9501243531476979,111.1530549606727,19.445537408049042,11.758900328957271,7.0502497643315243,3.2621054039646542,26.153948279875681,4.5236065860292571,6.3122740545960649,0,0.68801894918304418,34.862856368653887,3.1616553794315938,125.9514076553495,25.683757383041211,0.68801894918304418]
["TTO",2011,"TTO_2011_MICS",127,"Sanitation ladder","Open defecation","s_od",0.2764535736253948,0,0,0,0,0.31962622962661519,0,0,0,0,0.21802256881154089,0,0,0,0,"Central","East","North West","South West","Tobago","","","","","","","","","","",0,0,0.15616875353765761,0.055173184372959601,0.093104092778404896,null,null,null,null,null,null,null,null,null,null,9.8605413313488413,0,0,0,0,6.5533367490361361,0,0,0,0,3.3072045823127061,0,0,0,0,0,0,6.5533367490361361,2.619185633129661,0.68801894918304418]
["TTO",2011,"TTO_2011_MICS",128,"Shared among Improved Sanitation","Yes","s_shared",10.372224535804291,5.8557038646206374,4.0262618909070937,2.8412194941909719,0.91193183237431563,13.56606471073921,5.6931504862431721,5.9487512132353473,1.4013840894889651,0.5921772006388154,6.3735901479200594,4.7040294987217184,5.141876032013033,2.4860843098996308,1.173067298704576,"Central","East","North West","South West","Tobago","","","","","","","","","","",5.3508717084490804,2.6911620014600901,5.3818917759558502,3.8951004559894811,5.0946696915713439]
["TTO",2011,"TTO_2011_MICS",129,"Shared among Improved Sanitation","No","",89.627775464195182,94.144296135379406,95.973738109092906,97.158780505809034,99.088068167625678,86.433935289260759,94.306849513756845,94.051248786764702,98.598615910511043,99.407822799361185,93.626409852079902,95.295970501278333,94.858123967986984,97.513915690100333,98.826932701295448,"Central","East","North West","South West","Tobago","","","","","","","","","","",94.649128291550781,97.308837998539971,94.618108224044178,96.104899544010564,94.905330308428674]
["TTO",2011,"TTO_2011_MICS",135,"Sanitation type","Sewer connection","s_sew",12.261676584777661,15.56656001834936,16.525450069660259,21.56351729221916,31.291530662824769,23.454544759526168,27.600133074012579,30.497209310019649,35.190960787572173,42.46567931837977,1.735355587403038,2.462303839525128,1.8703517801422,2.217374394686725,5.5165233542397853,"Central","East","North West","South West","Tobago","","","","","","","","","","",17.683581377817038,1.6375927318327781,38.497135220160509,12.69763761182706,3.4835098436918659]
["TTO",2011,"TTO_2011_MICS",136,"Sanitation type","Septic tank connection","s_sep",50.826163766148063,77.018825245690508,79.982512420738601,76.985449566375721,67.962120981975943,51.360288463952507,67.767374623304676,66.048041879176978,63.950672588331081,56.265104033085791,47.860363245732643,84.750494845447946,93.01086807206292,96.446221353586481,94.438330724665548,"Central","East","North West","South West","Tobago","","","","","","","","","","",75.770106565433352,75.7818208686123,51.45516409490105,75.579687418041104,88.92999380528947]
["TTO",2011,"TTO_2011_MICS",137,"Sanitation type","Improved latrines","s_lat",32.922751063844743,6.6184814549766449,3.3156337948391239,0.92473794214966176,0.63597216983526161,19.451730395558709,3.6842987318389699,2.8815093720644702,0.5151229032988115,1.1101093019955981,48.470536328279401,12.49053866719772,4.7053895134420038,1.3364042517267529,0,"Central","East","North West","South West","Tobago","","","","","","","","","","",6.0364823733260877,22.347311081630501,6.8920643366765209,11.127062881401139,7.4002881654616521]
["TTO",2011,"TTO_2011_MICS",138,"Sanitation type","Unimproved facilities","",3.7136730444179422,0.79613328098335268,0.17640371476188321,0.52629519925545587,0.1103761853639106,5.4142256840084366,0.94819357084386757,0.57323943873907712,0.34324372079810439,0.15910734653890199,1.716669498013381,0.29666264782912871,0.41339063435293211,0,0.0451459210946695,"Central","East","North West","South West","Tobago","","","","","","","","","","",0.5098296834228061,0.23327531792489711,2.9995668600286969,0.54049348764262872,0.093104092778404896]
["TTO",2011,"TTO_2011_MICS",139,"Sanitation type","Open defecation","",0.27573554081079488,0,0,0,0,0.31921069695422671,0,0,0,0,0.21707534057161079,0,0,0,0,"Central","East","North West","South West","Tobago","","","","","","","","","","",0,0,0.15606948823316391,0.055118601087879103,0.093104092778404896]
["TTO",2011,"TTO_2011_MICS",148,"Shared among improved sanitation facilities","Yes","",9.9314943428644931,5.8090846573185644,4.0191594153654906,2.8220569966004492,0.91092527680462165,12.77062634868407,5.6391683993541486,5.9146506251686137,1.396573926597531,0.59123500320807065,6.2226502616828654,4.6900744002561474,5.120619998066652,2.4860843098996308,1.1684621637596251,"Central","East","North West","South West","Tobago","","","","","","","","","","",5.3194482218132784,2.68107564260501,5.2086379592619432,3.8680473118884451,5.0851829995785556]
["TTO",2011,"TTO_2011_MICS",149,"Shared among improved sanitation facilities","No","",85.819367090780005,93.394782061698137,95.804436869872617,96.503496779526259,98.978698537831463,81.365931459230083,93.412638029802011,93.512109936092386,98.260182352604403,99.249657650253013,91.409141511334525,95.013262951914754,94.465989367580434,97.513915690100333,98.438965734875381,"Central","East","North West","South West","Tobago","","","","","","","","","","",94.093292573556724,96.944128679929051,91.572162846359333,95.437409776915644,94.728608814864643]
["TTO",2011,"TTO_2011_MICS",150,"Shared among improved sanitation facilities","DK/missing","",4.2491385663549366,0.79613328098335268,0.17640371476188321,0.67444622387328934,0.1103761853639106,5.8634421920858397,0.94819357084386757,0.57323943873907712,0.34324372079810439,0.15910734653890199,2.3682082269825768,0.29666264782912871,0.41339063435293211,0,0.39257210136501308,"Central","East","North West","South West","Tobago","","","","","","","","","","",0.58725920462988013,0.37479567746600129,3.21919919437864,0.69454291119593181,0.18620818555680979]
["TTO",2011,"TTO_2011_MICS",151,"Shared among all sanitation facilities","Yes","",10.57688903130849,5.8090846573185644,4.0191594153654906,2.8220569966004492,0.91092527680462165,13.722915939713181,5.6391683993541486,5.9146506251686137,1.396573926597531,0.59123500320807065,6.4014825606224877,4.747330672090218,5.120619998066652,2.4860843098996308,1.1684621637596251,"Central","East","North West","South West","Tobago","","","","","","","","","","",5.3641613878589283,2.7510582379824799,5.6260367825412754,3.8885635007217489,5.0899219252101524]
["TTO",2011,"TTO_2011_MICS",152,"Shared among all sanitation facilities","No","",89.150251069652668,94.141407894959428,95.883245735543383,97.029791978781731,98.997923478688932,86.14666192776545,94.360831600645867,94.085349374831452,98.603426073402503,99.249657650253013,93.133992614455678,95.136556394217024,94.650672819492129,97.513915690100333,98.484111655970054,"Central","East","North West","South West","Tobago","","","","","","","","","","",94.558409090933907,96.944128679929051,94.232491654365688,95.938919119529288,94.910078074789865]
["TTO",2011,"TTO_2011_MICS",153,"Type of toilet facility","Flush to piped sewer system","",12.261676584777661,15.56656001834936,16.525450069660259,21.56351729221916,31.291530662824769,23.454544759526168,27.600133074012579,30.497209310019649,35.190960787572173,42.46567931837977,1.735355587403038,2.462303839525128,1.8703517801422,2.217374394686725,5.5165233542397853,"Central","East","North West","South West","Tobago","","","","","","","","","","",17.683581377817038,1.6375927318327781,38.497135220160509,12.69763761182706,3.4835098436918659,null,null,null,null,null,null,null,null,null,null,438.48815571728068,556.70442068900036,591.33204681117547,770.65387231797718,1119.856035167048,481.51747911679922,566.0230533731575,625.59136785265707,722.82476842487017,870.65446694283526,26.4386361688466,37.545993561334789,28.55936258265508,33.808184077566132,84.071218601760293,1209.2276650494071,22.194820763609801,1616.489512632887,603.38015390774865,25.742378348823539]
["TTO",2011,"TTO_2011_MICS",154,"Type of toilet facility","Flush to septic tank","",50.826163766148063,77.018825245690508,79.982512420738601,76.985449566375721,67.962120981975943,51.360288463952507,67.767374623304676,66.048041879176978,63.950672588331081,56.265104033085791,47.860363245732643,84.750494845447946,93.01086807206292,96.446221353586481,94.438330724665548,"Central","East","North West","South West","Tobago","","","","","","","","","","",75.770106565433352,75.7818208686123,51.45516409490105,75.579687418041104,88.92999380528947,null,null,null,null,null,null,null,null,null,null,1817.587558920831,2754.4120499331761,2862.0232780037049,2751.3663015391162,2432.2169523920752,1054.417251813403,1389.772150753945,1354.8480598062069,1313.55123786787,1153.5777820044659,729.16625269659039,1292.3025512565521,1420.23074675053,1470.5101731674031,1439.229934671928,5181.2643086880289,1027.095381301795,2160.5953963725879,3591.4777867121152,657.17326771440935]
["TTO",2011,"TTO_2011_MICS",155,"Type of toilet facility","Flush to somewhere else","",0,0.086352087951478598,0,0.079763277830326204,0.019224940857468498,0.15042492853985481,0,0,0.13878446472703129,0,0,0,0,0,0.0451459210946695,"Central","East","North West","South West","Tobago","","","","","","","","","","",0.086848769527588798,0,0,0,0.093104092778404896,null,null,null,null,null,null,null,null,null,null,0,3.0881960459887772,0,2.8506425039896408,0.68801894918304418,3.0881960459887772,0,0,2.8506425039896408,0,0,0,0,0,0.68801894918304418,5.938838549978418,0,0,0,0.68801894918304418]
["TTO",2011,"TTO_2011_MICS",156,"Type of toilet facility","Flush to unknown place / Not sure / DK where","",0.30072978870459688,0.034649830575832097,0.72230560413382183,0.29605540745069131,0.63597216983526161,0.52384090777168846,0.19694353283999949,1.1235083610102969,0.5151229032988115,1.1101093019955981,0,0,0,0,0,"Central","East","North West","South West","Tobago","","","","","","","","","","",0.38118974765949731,0,0.88483517530818412,0.16751609286179989,0,null,null,null,null,null,null,null,null,null,null,10.75435724524268,1.239176403454106,25.846343035449721,10.58066006026198,22.76006502406133,10.75435724524268,4.0389145770153618,23.046604861888461,10.58066006026198,22.76006502406133,0,0,0,0,0,26.066280277438249,0,37.154109601000023,7.9602118900315428,0]
["TTO",2011,"TTO_2011_MICS",157,"Type of toilet facility","Ventilated Improved Pit latrine (VIP)","",8.4546121912233136,2.5730771343026699,0.60184354281428876,0.29644293336189848,0,4.6056059908410854,0.72035288019940835,0.13788419558496359,0,0,13.185786720623391,4.7199860780295433,2.1209870393681252,0.5964458671645515,0,"Central","East","North West","South West","Tobago","","","","","","","","","","",1.538851341347117,5.7906111611049456,0.92198328488119607,3.5971865053696859,4.4839444968306168,null,null,null,null,null,null,null,null,null,null,302.344241540079,92.020550060614724,21.535835486009201,10.594509764836991,0,94.552241761772265,14.772984451315169,2.828428058593571,0,0,200.88921269920971,71.971851747371872,32.386441167672217,9.0939769656046874,0,105.2287754724621,78.482014687890441,38.713953708762723,170.93502063905009,33.135372343374108]
["TTO",2011,"TTO_2011_MICS",158,"Type of toilet facility","Pit latrine with slab","",24.16740908391683,4.010754490098142,1.991484647891014,0.33223960133707192,0,14.322283496945939,2.767002318799562,1.6201168154692089,0,0,35.284749607656018,7.7705525891681813,2.58440247407388,0.73995838456220087,0,"Central","East","North West","South West","Tobago","","","","","","","","","","",4.1164412843194738,16.556699920525581,5.0852458764871447,7.3623602831696378,2.9163436686310309,null,null,null,null,null,null,null,null,null,null,864.24744319448234,143.43597765363279,71.261520144161295,11.87383912550222,0,294.03383929865151,56.745635862611387,33.233568500232721,0,0,537.57320053449553,118.48786197611931,39.462569608683538,11.282104336986251,0,281.48792805030178,224.3982768302017,213.5287880900876,349.85264319131778,21.5511439558707]
["TTO",2011,"TTO_2011_MICS",159,"Type of toilet facility","Pit latrine without slab / Open pit","",3.4988868673387432,0.66027374530980565,0.078808865670772499,0,0,5.0761519720842507,0.94819357084386757,0,0,0,1.5226801714654079,0.1232934423022824,0.18468345191172361,0,0,"Central","East","North West","South West","Tobago","","","","","","","","","","",0.14489269716186071,0,2.865693921233138,0.44862915249616359,0,null,null,null,null,null,null,null,null,null,null,125.1232193994944,23.613265387186601,2.8200265437565171,0,0,104.2124639924649,19.445537408049042,0,0,0,23.19846569032946,1.880017695837678,2.8200265437565171,0,0,9.9079623142139965,0,120.33010102173181,21.31844799449178,0]
["TTO",2011,"TTO_2011_MICS",160,"Type of toilet facility","Bucket","",0.036650885420781501,0,0,0,0,0.063842139390845307,0,0,0,0,0,0,0,0,0,"Central","East","North West","South West","Tobago","","","","","","","","","","",0,0,0.0312138976466328,0,0,null,null,null,null,null,null,null,null,null,null,1.310667349807227,0,0,0,0,1.310667349807227,0,0,0,0,0,0,0,0,0,0,0,1.310667349807227,0,0]
["TTO",2011,"TTO_2011_MICS",161,"Type of toilet facility","No facility, Bush, Field","",0.27573554081079488,0,0,0,0,0.31921069695422671,0,0,0,0,0.21707534057161079,0,0,0,0,"Central","East","North West","South West","Tobago","","","","","","","","","","",0,0,0.15606948823316391,0.055118601087879103,0.093104092778404896,null,null,null,null,null,null,null,null,null,null,9.8605413313488413,0,0,0,0,6.5533367490361361,0,0,0,0,3.3072045823127061,0,0,0,0,0,0,6.5533367490361361,2.619185633129661,0.68801894918304418]
["TTO",2011,"TTO_2011_MICS",162,"Type of toilet facility","Other","",0.1781352916584181,0.049507447722068401,0,0,0,0.1238066439934852,0,0,0,0,0.1939893265479731,0.17336920552684629,0,0,0,"Central","East","North West","South West","Tobago","","","","","","","","","","",0.044713166045650003,0.23327531792489711,0.0249711181173062,0.018372867029293,0,null,null,null,null,null,null,null,null,null,null,6.3702720396678938,1.770527012481693,0,0,0,2.541727572411784,0,0,0,0,2.955482589546222,2.6435888901915798,0,0,0,3.0575479151623242,3.1616553794315938,1.0485338798457819,0.87306187770988719,0]
["TTO",2011,"TTO_2011_MICS",163,"Type of toilet facility","Missing","",0,0,0.0975948490911107,0.4465319214251296,0.091151244506442006,0,0,0.57323943873907712,0.20445925607107299,0.15910734653890199,0,0,0.2287071824412085,0,0,"Central","East","North West","South West","Tobago","","","","","","","","","","",0.2333750506877065,0,0.077687923031619394,0.073491468117172096,0,null,null,null,null,null,null,null,null,null,null,0,0,3.4922475108395492,15.958507589299151,3.2621054039646542,0,0,11.758900328957271,4.1996072603418826,3.2621054039646542,0,0,3.4922475108395492,0,0,15.958507589299151,0,3.2621054039646542,3.4922475108395492,0]
["TTO",2011,"TTO_2011_MICS",222,"Hygiene ladder","Basic","h_bas",77.017666870655518,89.983926532022977,93.275319222739995,92.850506714727572,94.160781086983732,78.119211348526647,89.416186096928058,91.590480086532651,93.447721588221,94.394888396911696,75.938867809032345,89.613810220297978,95.415535866308133,94.618154772590572,92.508555959241647,"Central","East","North West","South West","Tobago","","","","","","","","","","",89.42592029990233,82.620031938744262,85.243964905805669,96.089112861545573,77.44340131217659,null,null,null,null,null,null,null,null,null,null,2511.4828263281288,2994.8507423274082,3108.8491073594842,3095.9080201831071,3028.6486009089331,1504.335884573843,1764.10151014037,1787.0103385309851,1827.571368596949,1737.330142104202,1030.50323684757,1234.297001744103,1312.4396450351089,1282.8011537908651,1259.3490157430349,5684.2088691942763,855.86892552409495,3327.05384748489,4446.7025471309062,425.90510777292138]
["TTO",2011,"TTO_2011_MICS",223,"Hygiene ladder","Limited","h_lim",11.24798545549433,5.7380503382846211,2.9522461455519609,2.3538545423914869,1.148504938159969,12.501669396220221,5.4928140348513228,3.2503687223796192,2.3118913472934279,0.73580308665254168,10.009887481117479,5.1591614055769819,2.5715075155465672,1.7958695335113271,2.4743939160449471,"Central","East","North West","South West","Tobago","","","","","","","","","","",4.8550186265147417,4.5431902089615619,7.6246854246910871,2.0513382974409931,4.2551312435621966,null,null,null,null,null,null,null,null,null,null,366.78756251737082,190.9741548009485,98.397817030114481,78.484409121467465,36.941259768033397,240.74372443299609,108.3683162609676,63.41753537531892,45.21401230346391,13.542395174192441,135.83586044121421,71.059777937833843,35.371057556474597,24.34779578171981,33.684727973752949,308.60112867039339,47.063348093092237,297.58985291347869,94.929497844375462,23.401375716594899]
["TTO",2011,"TTO_2011_MICS",224,"Hygiene ladder","No facility","h_nfac",11.734347673849699,4.2780231296923903,3.7724346317080122,4.7956387428809952,4.6907139748562949,9.3791192552531637,5.0909998682206457,5.1591511910877994,4.2403870644855912,4.869308516435793,14.051244709850311,5.2270283741250809,2.0129566181452918,3.5859756938981242,5.0170501247133616,"Central","East","North West","South West","Tobago","","","","","","","","","","",5.7190610735825587,12.83677785229437,7.1313496695032823,1.8595488410133769,18.30146744426121,null,null,null,null,null,null,null,null,null,null,382.64743478311652,142.3814367679721,125.7345473066819,159.90065074821129,150.8751749211682,180.6130069391815,100.4408815414798,100.6595500734138,82.929897691583321,89.619221977758812,190.67775926882831,71.994544527832119,27.688196114009841,48.617453686922737,68.298732706140015,363.52253987323212,132.97742702133439,278.33506315548073,86.054083772873156,100.6501307042296]
["TTO",2011,"TTO_2011_MICS",225,"Place where household members most often wash their hands","Observed","",80.486599629662336,89.081984309955274,89.630181884926856,88.822062018206992,85.660117115597487,85.002205679971027,91.304437297678774,90.207264811407356,91.177170154836716,85.397817984552972,76.555123961789633,85.606604212253046,88.26808159989821,85.731863154022406,84.84533665227984,"Central","East","North West","South West","Tobago","","","","","","","","","","",87.638040661851434,66.620737529770551,86.321870676329482,95.574900002717257,60.801047085139928]
["TTO",2011,"TTO_2011_MICS",226,"Place where household members most often wash their hands","Not in dwelling/plot/yard","",6.0498248667361567,0.67558080451400482,1.1562505984860929,0.6691932283417209,0.64866958543187825,5.4507740799947486,1.109922468311608,0.87916840817112585,0.41178893951394502,0.74967343619015392,6.1184235130466904,1.5676198008466129,0.67513474889399416,0.21345037784297119,1.430529289911433,"Central","East","North West","South West","Tobago","","","","","","","","","","",1.210727554352717,3.9525620666231611,2.9156020427436742,1.146344343063485,2.1315914247325072]
["TTO",2011,"TTO_2011_MICS",227,"Place where household members most often wash their hands","No permission to see","",8.7884723539384613,6.9367482551565152,6.8560224485727721,6.5444882677478349,10.124059587436861,6.2001991357841906,3.7979146646743449,4.8856416361696571,4.7853605922191962,10.231055138175719,10.929339577575821,9.6138650276140236,9.9186192852883632,10.70606847596564,10.673087366014091,"Central","East","North West","South West","Tobago","","","","","","","","","","",7.0458550160919522,23.404542554496921,7.0495044677281111,2.522298454989083,25.57877701945403]
["TTO",2011,"TTO_2011_MICS",228,"Place where household members most often wash their hands","Other reason","",4.6503480572744156,3.3056866303742578,2.3575450680142849,3.804956025038627,3.5671537115337348,3.3468211042500391,3.7877255693353362,4.027925144251947,3.6256803134301929,3.6214534410812091,6.3971129475879156,3.1538544924399168,1.13816436591945,2.975218279808606,3.0510466917945491,"Central","East","North West","South West","Tobago","","","","","","","","","","",4.1053767677034507,5.8588651265624074,3.713022813198656,0.66459286408372342,11.48858447067307]
["TTO",2011,"TTO_2011_MICS",229,"Place where household members most often wash their hands","Missing","",0.024755092388014901,0,0,0.159300460664799,0,0,0,0,0,0,0,0.058056466846387503,0,0.37339971236034092,0,"Central","East","North West","South West","Tobago","","","","","","","","","","",0,0.16329272254742791,0,0.091864335146465095,0]