{"text_format":"1","workbook":"xlsx","n_sheets":6,"sheets":["Introduction","Water","Sanitation","Hygiene","MICS19","data_summary"],"not_rendered":{"charts":99,"images":76,"macros":1,"external_links":0,"defined_names":0,"comments":0,"pivot_tables":0},"unopened":[],"bounds":{"document_bytes":16777216,"sheet_cells":100000,"rows_first":2000,"rows_last":500,"rows_between":2000,"halvings":0,"cell_chars":16384,"cell_head_chars":4096},"cells_cut":0,"cells_raw":0,"read":"whole","date_system":"1900"}

{"sheet":"Introduction","index":0,"n_rows":55,"n_cols":12,"rows_kept":55,"cut":false,"hidden":false,"merged":[[107,0,107,1],[1,0,1,1],[4,0,4,1],[5,0,5,1],[6,0,6,1],[7,0,7,1],[112,0,112,1],[113,0,113,1],[207,0,207,1],[212,0,212,1],[213,0,213,1]]}
[]
[]
[]
[null,null,"Joint Monitoring Programme for Water Supply, Sanitation and Hygiene"]
[]
[null,null,"Estimates on household water, sanitation and hygiene \nby wealth quintile and sub-national region in"]
[null,null,{"$f":"+Water!B5","v":"Tonga"}]
[]
[null,null,"Updated May 2021"]
[]
[null,null,"Follow the links below to find the following information: "]
[]
[null,null,"JMP Estimates"]
[null,null,"WASH status and trends by wealth quintile \n(customized quintiles made without water and sanitation assets)"]
[null,null,"Water"]
[null,null,"Sanitation"]
[null,null,"Hygiene"]
[]
[null,null,"Data inputs"]
[null,null," customized wealth quintiles and subnational data:"]
[null,null,{"$f":"IF(INDIRECT(CONCATENATE(\"Water\",\"!B105\"))=0,\"\",INDIRECT(CONCATENATE(\"Water\",\"!B105\")))","v":"MICS19"}]
[null,null,{"$f":"IF(INDIRECT(CONCATENATE(\"Water\",\"!B106\"))=0,\"\",INDIRECT(CONCATENATE(\"Water\",\"!B106\")))","v":""}]
[null,null,{"$f":"IF(INDIRECT(CONCATENATE(\"Water\",\"!B107\"))=0,\"\",INDIRECT(CONCATENATE(\"Water\",\"!B107\")))","v":""}]
[null,null,{"$f":"IF(INDIRECT(CONCATENATE(\"Water\",\"!B108\"))=0,\"\",INDIRECT(CONCATENATE(\"Water\",\"!B108\")))","v":""}]
[null,null,{"$f":"IF(INDIRECT(CONCATENATE(\"Water\",\"!B109\"))=0,\"\",INDIRECT(CONCATENATE(\"Water\",\"!B109\")))","v":""}]
[null,null,{"$f":"IF(INDIRECT(CONCATENATE(\"Water\",\"!B110\"))=0,\"\",INDIRECT(CONCATENATE(\"Water\",\"!B110\")))","v":""}]
[null,null,{"$f":"IF(INDIRECT(CONCATENATE(\"Water\",\"!B111\"))=0,\"\",INDIRECT(CONCATENATE(\"Water\",\"!B111\")))","v":""}]
[null,null,{"$f":"IF(INDIRECT(CONCATENATE(\"Water\",\"!B112\"))=0,\"\",INDIRECT(CONCATENATE(\"Water\",\"!B112\")))","v":""}]
[null,null,{"$f":"IF(INDIRECT(CONCATENATE(\"Water\",\"!B113\"))=0,\"\",INDIRECT(CONCATENATE(\"Water\",\"!B113\")))","v":""}]
[null,null,{"$f":"IF(INDIRECT(CONCATENATE(\"Water\",\"!B114\"))=0,\"\",INDIRECT(CONCATENATE(\"Water\",\"!B114\")))","v":""}]
[null,null,{"$f":"IF(INDIRECT(CONCATENATE(\"Water\",\"!B115\"))=0,\"\",INDIRECT(CONCATENATE(\"Water\",\"!B115\")))","v":""}]
[null,null,{"$f":"IF(INDIRECT(CONCATENATE(\"Water\",\"!B116\"))=0,\"\",INDIRECT(CONCATENATE(\"Water\",\"!B116\")))","v":""}]
[]
[]
[]
[]
[]
[]
[]
[]
[]
[]
[]
[]
[]
[]
[]
[]
[]
[]
[]
[]
[]
[]
[null,null,null,null,null,null,null,null,null,null,null,{"$f":"+IF(ISNUMBER(M48), \"\", \"Insufficient data to estimate safely managed sanitation services at national level\")","v":"Insufficient data to estimate safely managed sanitation services at national level"}]

{"sheet":"Water","index":1,"n_rows":318,"n_cols":28,"rows_kept":318,"cut":false,"hidden":false,"merged":[[3,1,3,24],[317,18,317,22],[117,18,117,22],[196,18,196,22],[296,23,296,27],[298,0,299,1],[300,0,301,1],[296,0,297,2],[296,3,296,7],[296,8,296,12],[296,13,296,17],[296,18,296,22],[196,23,196,27],[198,0,199,1],[200,0,201,1],[196,13,196,17],[96,8,96,12],[96,13,96,17],[96,18,96,22],[217,18,217,22],[98,0,99,1],[100,0,101,1],[196,0,197,2],[196,3,196,7],[196,8,196,12],[217,1,217,11],[35,3,36,3],[38,1,39,2],[38,3,39,3],[96,0,97,2],[96,3,96,7],[317,1,317,11],[6,9,6,16],[6,17,6,24],[6,1,6,8],[4,1,4,24],[117,1,117,11],[30,21,30,24],[32,1,33,2],[32,3,33,3],[30,17,30,20],[30,1,31,4],[30,5,30,8],[30,9,30,12],[30,13,30,16],[96,23,96,27],[35,1,36,2]]}
["BGD"]
[]
[]
[null,"Summary of trends in use of drinking water by wealth quintile (%)"]
[null,{"$f":"IF(ISERROR(INDIRECT(CONCATENATE($B105,\"!A2\"))),\"\",INDIRECT(CONCATENATE($B105,\"!A2\")))","v":"Tonga"}]
[]
[null,{"$f":"B118","v":"National use of drinking water sources, 2015–2020"},null,null,null,null,null,null,null,{"$f":"B218","v":"Urban use of drinking water sources,  2015–2020"},null,null,null,null,null,null,null,{"$f":"B318","v":"Rural use of drinking water sources, 2015–2020"}]
[]
[]
[]
[]
[]
[]
[]
[]
[]
[]
[]
[]
[]
[]
[]
[]
[]
[]
[]
[]
[]
[]
[]
[null,{"$f":"IF(ISERROR(INDIRECT(CONCATENATE($B105,\"!A2\"))),\"\",INDIRECT(CONCATENATE($B105,\"!A2\")))","v":"Tonga"},null,null,null,"Poorest",null,null,null,"Poor",null,null,null,"Middle",null,null,null,"Rich",null,null,null,"Richest"]
[null,null,null,null,null,"Basic","Limited","Unimproved","Surface \n water","Basic","Limited","Unimproved","Surface \nwater","Basic","Limited","Unimproved","Surface \nwater","Basic","Limited","Unimproved","Surface \nwater","Basic","Limited","Unimproved","Surface \nwater"]
[null,"NATIONAL",null,"Estimate",{"$f":"C99","v":2015},{"$f":"E99","v":99.494255864254995},{"$f":"F99","v":0},0.50574413574500454,0,{"$f":"J99","v":98.454752121486351},{"$f":"K99","v":0},1.5452478785136492,0,{"$f":"O99","v":98.373637240206094},{"$f":"P99","v":0},1.6263627597939063,0,{"$f":"T99","v":99.334421920208626},{"$f":"U99","v":0},0.66557807979137351,0,{"$f":"Y99","v":99.50972513631838},{"$f":"Z99","v":0},0.49027486368161988,0]
[null,null,null,null,{"$f":"C100","v":2020},{"$f":"E100","v":99.494255864254995},0,0.50574413574500454,0,{"$f":"J100","v":98.454752121486351},0,1.5452478785136492,0,{"$f":"O100","v":98.373637240206094},0,1.6263627597939063,0,{"$f":"T100","v":99.334421920208626},0,0.66557807979137351,0,{"$f":"Y100","v":99.50972513631838},0,0.49027486368161988,0]
[]
[null,"URBAN",null,"Estimate",{"$f":"C199","v":2015},{"$f":"E199","v":98.119595934795839},{"$f":"F199","v":0},1.8804040652041607,0,{"$f":"J199","v":97.909937345536662},{"$f":"K199","v":0},2.0900626544633383,0,{"$f":"O199","v":100},{"$f":"P199","v":0},0,0,{"$f":"T199","v":100},{"$f":"U199","v":0},0,0,{"$f":"Y199","v":100},{"$f":"Z199","v":0},0,0]
[null,null,null,null,{"$f":"C200","v":2020},{"$f":"E200","v":98.119595934795839},0,1.8804040652041607,0,{"$f":"J200","v":97.909937345536662},0,2.0900626544633383,0,{"$f":"O200","v":100},0,0,0,{"$f":"T200","v":100},0,0,0,{"$f":"Y200","v":100},0,0,0]
[]
[null,"RURAL",null,"Estimate",{"$f":"C299","v":2015},{"$f":"E299","v":99.422651096569922},{"$f":"F299","v":0},0.57734890343007805,0,{"$f":"J299","v":98.582429040163746},{"$f":"K299","v":0},1.4175709598362545,0,{"$f":"O299","v":98.403235234758171},{"$f":"P299","v":0},1.5967647652418293,0,{"$f":"T299","v":99.128999331447588},{"$f":"U299","v":0},0.87100066855241209,0,{"$f":"Y299","v":99.36652626577343},{"$f":"Z299","v":0},0.63347373422656972,0]
[null,null,null,null,{"$f":"C300","v":2020},{"$f":"E300","v":99.422651096569922},0,0.57734890343007805,0,{"$f":"J300","v":98.582429040163746},0,1.4175709598362545,0,{"$f":"O300","v":98.403235234758171},0,1.5967647652418293,0,{"$f":"T300","v":99.128999331447588},0,0.87100066855241209,0,{"$f":"Y300","v":99.36652626577343},0,0.63347373422656972,0]
[]
[]
[]
[]
[]
[]
[]
[]
[]
[]
[]
[]
[]
[]
[]
[]
[]
[]
[]
[]
[]
[]
[]
[]
[]
[]
[]
[]
[]
[]
[]
[]
[]
[]
[]
[]
[]
[]
[]
[]
[]
[]
[]
[]
[]
[]
[]
[]
[]
[]
[]
[]
[]
[]
[]
[]
["NATIONAL",null,null,"Poorest",null,null,null,null,"Poor",null,null,null,null,"Middle",null,null,null,null,"Rich",null,null,null,null,"Richest"]
[null,null,null,"Improved","Basic","Limited","Unimproved","Surface water","Improved","Basic","Limited","Unimproved","Surface water","Improved","Basic","Limited","Unimproved","Surface water","Improved","Basic","Limited","Unimproved","Surface water","Improved","Basic","Limited","Unimproved","Surface water"]
["Forecast period:",null,2015,{"$f":"IF((D101+H101)>100,D101*100/(D101+H101),D101)","v":99.494255864254995},{"$f":"D99*AVERAGEIF(E105:E116,\">0\")/100","v":99.494255864254995},{"$f":"D99*(100-AVERAGEIF(E105:E116,\">0\"))/100","v":0},{"$f":"100-(E99+F99+H99)","v":0.50574413574500454},{"$f":"IF((D101+H101)>100,H101*100/(D101+H101),H101)","v":0},{"$f":"IF((I101+M101)>100,I101*100/(I101+M101),I101)","v":98.454752121486351},{"$f":"I99*AVERAGEIF(J105:J116,\">0\")/100","v":98.454752121486351},{"$f":"I99*(100-AVERAGEIF(J105:J116,\">0\"))/100","v":0},{"$f":"100-(J99+K99+M99)","v":1.5452478785136492},{"$f":"IF((I101+M101)>100,M101*100/(I101+M101),M101)","v":0},{"$f":"IF((N101+R101)>100,N101*100/(N101+R101),N101)","v":98.373637240206094},{"$f":"N99*AVERAGEIF(O105:O116,\">0\")/100","v":98.373637240206094},{"$f":"N99*(100-AVERAGEIF(O105:O116,\">0\"))/100","v":0},{"$f":"100-(O99+P99+R99)","v":1.6263627597939063},{"$f":"IF((N101+R101)>100,R101*100/(N101+R101),R101)","v":0},{"$f":"IF((S101+W101)>100,S101*100/(S101+W101),S101)","v":99.334421920208626},{"$f":"S99*AVERAGEIF(T105:T116,\">0\")/100","v":99.334421920208626},{"$f":"S99*(100-AVERAGEIF(T105:T116,\">0\"))/100","v":0},{"$f":"100-(T99+U99+W99)","v":0.66557807979137351},{"$f":"IF((S101+W101)>100,W101*100/(S101+W101),W101)","v":0},{"$f":"IF((X101+AB101)>100,X101*100/(X101+AB101),X101)","v":99.509725136318366},{"$f":"X99*AVERAGEIF(Y105:Y116,\">0\")/100","v":99.50972513631838},{"$f":"X99*(100-AVERAGEIF(Y105:Y116,\">0\"))/100","v":0},{"$f":"100-(Y99+Z99+AB99)","v":0.49027486368161988},{"$f":"IF((X101+AB101)>100,AB101*100/(X101+AB101),AB101)","v":0}]
[null,null,2020,{"$f":"IF((D102+H102)>100,D102*100/(D102+H102),D102)","v":99.494255864254995},{"$f":"D100*AVERAGEIF(E105:E116,\">0\")/100","v":99.494255864254995},{"$f":"D100*(100-AVERAGEIF(E105:E116,\">0\"))/100","v":0},{"$f":"100-(E100+F100+H100)","v":0.50574413574500454},{"$f":"IF((D102+H102)>100,H102*100/(D102+H102),H102)","v":0},{"$f":"IF((I102+M102)>100,I102*100/(I102+M102),I102)","v":98.454752121486351},{"$f":"I100*AVERAGEIF(J105:J116,\">0\")/100","v":98.454752121486351},{"$f":"I100*(100-AVERAGEIF(J105:J116,\">0\"))/100","v":0},{"$f":"100-(J100+K100+M100)","v":1.5452478785136492},{"$f":"IF((I102+M102)>100,M102*100/(I102+M102),M102)","v":0},{"$f":"IF((N102+R102)>100,N102*100/(N102+R102),N102)","v":98.373637240206094},{"$f":"N100*AVERAGEIF(O105:O116,\">0\")/100","v":98.373637240206094},{"$f":"N100*(100-AVERAGEIF(O105:O116,\">0\"))/100","v":0},{"$f":"100-(O100+P100+R100)","v":1.6263627597939063},{"$f":"IF((N102+R102)>100,R102*100/(N102+R102),R102)","v":0},{"$f":"IF((S102+W102)>100,S102*100/(S102+W102),S102)","v":99.334421920208626},{"$f":"S100*AVERAGEIF(T105:T116,\">0\")/100","v":99.334421920208626},{"$f":"S100*(100-AVERAGEIF(T105:T116,\">0\"))/100","v":0},{"$f":"100-(T100+U100+W100)","v":0.66557807979137351},{"$f":"IF((S102+W102)>100,W102*100/(S102+W102),W102)","v":0},{"$f":"IF((X102+AB102)>100,X102*100/(X102+AB102),X102)","v":99.509725136318366},{"$f":"X100*AVERAGEIF(Y105:Y116,\">0\")/100","v":99.50972513631838},{"$f":"X100*(100-AVERAGEIF(Y105:Y116,\">0\"))/100","v":0},{"$f":"100-(Y100+Z100+AB100)","v":0.49027486368161988},{"$f":"IF((X102+AB102)>100,AB102*100/(X102+AB102),AB102)","v":0}]
["Regression period:",null,{"$f":"MinRegYear(C99,C105:C116)","v":2017},{"$f":"IF(MAX(C105:C116)-MIN(C105:C116)<5,AVERAGEIF(C105:C116,\">0\",D105:D116),\nIF(FORECAST($C101,D$105:D$116,$C$105:$C$116)<0,0,\nIF(FORECAST($C101,D$105:D$116,$C$105:$C$116)>100,100,\nFORECAST($C101,D$105:D$116,$C$105:$C$116))))","v":99.494255864254995},null,null,null,{"$f":"IF(MAX(C105:C116)-MIN(C105:C116)<5,AVERAGEIF(C105:C116,\">0\",H105:H116),\nIF(FORECAST($C101,H$105:H$116,$C$105:$C$116)<0,0,\nIF(FORECAST($C101,H$105:H$116,$C$105:$C$116)>100,100,\nFORECAST($C101,H$105:H$116,$C$105:$C$116))))","v":0},{"$f":"IF(MAX(C105:C116)-MIN(C105:C116)<5,AVERAGEIF(C105:C116,\">0\",I105:I116),\nIF(FORECAST($C101,I$105:I$116,$C$105:$C$116)<0,0,\nIF(FORECAST($C101,I$105:I$116,$C$105:$C$116)>100,100,\nFORECAST($C101,I$105:I$116,$C$105:$C$116))))","v":98.454752121486351},null,null,null,{"$f":"IF(MAX(C105:C116)-MIN(C105:C116)<5,AVERAGEIF(C105:C116,\">0\",M105:M116),\nIF(FORECAST($C101,M$105:M$116,$C$105:$C$116)<0,0,\nIF(FORECAST($C101,M$105:M$116,$C$105:$C$116)>100,100,\nFORECAST($C101,M$105:M$116,$C$105:$C$116))))","v":0},{"$f":"IF(MAX(C105:C116)-MIN(C105:C116)<5,AVERAGEIF(C105:C116,\">0\",N105:N116),\nIF(FORECAST($C101,N$105:N$116,$C$105:$C$116)<0,0,\nIF(FORECAST($C101,N$105:N$116,$C$105:$C$116)>100,100,\nFORECAST($C101,N$105:N$116,$C$105:$C$116))))","v":98.373637240206094},null,null,null,{"$f":"IF(MAX(C105:C116)-MIN(C105:C116)<5,AVERAGEIF(C105:C116,\">0\",R105:R116),\nIF(FORECAST($C101,R$105:R$116,$C$105:$C$116)<0,0,\nIF(FORECAST($C101,R$105:R$116,$C$105:$C$116)>100,100,\nFORECAST($C101,R$105:R$116,$C$105:$C$116))))","v":0},{"$f":"IF(MAX(C105:C116)-MIN(C105:C116)<5,AVERAGEIF(C105:C116,\">0\",S105:S116),\nIF(FORECAST($C101,S$105:S$116,$C$105:$C$116)<0,0,\nIF(FORECAST($C101,S$105:S$116,$C$105:$C$116)>100,100,\nFORECAST($C101,S$105:S$116,$C$105:$C$116))))","v":99.334421920208626},null,null,null,{"$f":"IF(MAX(C105:C116)-MIN(C105:C116)<5,AVERAGEIF(C105:C116,\">0\",W105:W116),\nIF(FORECAST($C101,W$105:W$116,$C$105:$C$116)<0,0,\nIF(FORECAST($C101,W$105:W$116,$C$105:$C$116)>100,100,\nFORECAST($C101,W$105:W$116,$C$105:$C$116))))","v":0},{"$f":"IF(MAX(C105:C116)-MIN(C105:C116)<5,AVERAGEIF(C105:C116,\">0\",X105:X116),\nIF(FORECAST($C101,X$105:X$116,$C$105:$C$116)<0,0,\nIF(FORECAST($C101,X$105:X$116,$C$105:$C$116)>100,100,\nFORECAST($C101,X$105:X$116,$C$105:$C$116))))","v":99.509725136318366},null,null,null,{"$f":"IF(MAX(C105:C116)-MIN(C105:C116)<5,AVERAGEIF(C105:C116,\">0\",AB105:AB116),\nIF(FORECAST($C101,AB$105:AB$116,$C$105:$C$116)<0,0,\nIF(FORECAST($C101,AB$105:AB$116,$C$105:$C$116)>100,100,\nFORECAST($C101,AB$105:AB$116,$C$105:$C$116))))","v":0}]
[null,null,{"$f":"MaxRegYear(C100,C105:C116)","v":2020},{"$f":"IF(MAX(C105:C116)-MIN(C105:C116)<5,AVERAGEIF(C105:C116,\">0\",D105:D116),\nIF(FORECAST($C102,D$105:D$116,$C$105:$C$116)<0,0,\nIF(FORECAST($C102,D$105:D$116,$C$105:$C$116)>100,100,\nFORECAST($C102,D$105:D$116,$C$105:$C$116))))","v":99.494255864254995},null,null,null,{"$f":"IF(MAX(C105:C116)-MIN(C105:C116)<5,AVERAGEIF(C105:C116,\">0\",H105:H116),\nIF(FORECAST($C102,H$105:H$116,$C$105:$C$116)<0,0,\nIF(FORECAST($C102,H$105:H$116,$C$105:$C$116)>100,100,\nFORECAST($C102,H$105:H$116,$C$105:$C$116))))","v":0},{"$f":"IF(MAX(C105:C116)-MIN(C105:C116)<5,AVERAGEIF(C105:C116,\">0\",I105:I116),\nIF(FORECAST($C102,I$105:I$116,$C$105:$C$116)<0,0,\nIF(FORECAST($C102,I$105:I$116,$C$105:$C$116)>100,100,\nFORECAST($C102,I$105:I$116,$C$105:$C$116))))","v":98.454752121486351},null,null,null,{"$f":"IF(MAX(C105:C116)-MIN(C105:C116)<5,AVERAGEIF(C105:C116,\">0\",M105:M116),\nIF(FORECAST($C102,M$105:M$116,$C$105:$C$116)<0,0,\nIF(FORECAST($C102,M$105:M$116,$C$105:$C$116)>100,100,\nFORECAST($C102,M$105:M$116,$C$105:$C$116))))","v":0},{"$f":"IF(MAX(C105:C116)-MIN(C105:C116)<5,AVERAGEIF(C105:C116,\">0\",N105:N116),\nIF(FORECAST($C102,N$105:N$116,$C$105:$C$116)<0,0,\nIF(FORECAST($C102,N$105:N$116,$C$105:$C$116)>100,100,\nFORECAST($C102,N$105:N$116,$C$105:$C$116))))","v":98.373637240206094},null,null,null,{"$f":"IF(MAX(C105:C116)-MIN(C105:C116)<5,AVERAGEIF(C105:C116,\">0\",R105:R116),\nIF(FORECAST($C102,R$105:R$116,$C$105:$C$116)<0,0,\nIF(FORECAST($C102,R$105:R$116,$C$105:$C$116)>100,100,\nFORECAST($C102,R$105:R$116,$C$105:$C$116))))","v":0},{"$f":"IF(MAX(C105:C116)-MIN(C105:C116)<5,AVERAGEIF(C105:C116,\">0\",S105:S116),\nIF(FORECAST($C102,S$105:S$116,$C$105:$C$116)<0,0,\nIF(FORECAST($C102,S$105:S$116,$C$105:$C$116)>100,100,\nFORECAST($C102,S$105:S$116,$C$105:$C$116))))","v":99.334421920208626},null,null,null,{"$f":"IF(MAX(C105:C116)-MIN(C105:C116)<5,AVERAGEIF(C105:C116,\">0\",W105:W116),\nIF(FORECAST($C102,W$105:W$116,$C$105:$C$116)<0,0,\nIF(FORECAST($C102,W$105:W$116,$C$105:$C$116)>100,100,\nFORECAST($C102,W$105:W$116,$C$105:$C$116))))","v":0},{"$f":"IF(MAX(C105:C116)-MIN(C105:C116)<5,AVERAGEIF(C105:C116,\">0\",X105:X116),\nIF(FORECAST($C102,X$105:X$116,$C$105:$C$116)<0,0,\nIF(FORECAST($C102,X$105:X$116,$C$105:$C$116)>100,100,\nFORECAST($C102,X$105:X$116,$C$105:$C$116))))","v":99.509725136318366},null,null,null,{"$f":"IF(MAX(C105:C116)-MIN(C105:C116)<5,AVERAGEIF(C105:C116,\">0\",AB105:AB116),\nIF(FORECAST($C102,AB$105:AB$116,$C$105:$C$116)<0,0,\nIF(FORECAST($C102,AB$105:AB$116,$C$105:$C$116)>100,100,\nFORECAST($C102,AB$105:AB$116,$C$105:$C$116))))","v":0}]
[]
[null,"Survey","Year","Improved","% Improved\n< = 30min",null,null,"Surface water","Improved","% Improved\n< = 30min",null,null,"Surface water","Improved","% Improved\n< = 30min",null,null,"Surface water","Improved","% Improved\n< = 30min",null,null,"Surface water","Improved","% Improved\n< = 30min",null,null,"Surface water"]
[null,"MICS19",2019,{"$f":"IF(ISERROR(INDIRECT(CONCATENATE($B105,\"!C16\"))),\"\",INDIRECT(CONCATENATE($B105,\"!C16\")))","v":99.494255864254995},{"$f":"IF(ISERROR(INDIRECT(CONCATENATE($B105,\"!C23\"))),\"\",INDIRECT(CONCATENATE($B105,\"!C23\")))","v":100},null,null,{"$f":"IF(ISERROR(INDIRECT(CONCATENATE($B105,\"!C21\"))),\"\",INDIRECT(CONCATENATE($B105,\"!C21\")))","v":0},{"$f":"IF(ISERROR(INDIRECT(CONCATENATE($B105,\"!D16\"))),\"\",INDIRECT(CONCATENATE($B105,\"!D16\")))","v":98.454752121486351},{"$f":"IF(ISERROR(INDIRECT(CONCATENATE($B105,\"!D23\"))),\"\",INDIRECT(CONCATENATE($B105,\"!D23\")))","v":100},null,null,{"$f":"IF(ISERROR(INDIRECT(CONCATENATE($B105,\"!D21\"))),\"\",INDIRECT(CONCATENATE($B105,\"!D21\")))","v":0},{"$f":"IF(ISERROR(INDIRECT(CONCATENATE($B105,\"!E16\"))),\"\",INDIRECT(CONCATENATE($B105,\"!E16\")))","v":98.373637240206094},{"$f":"IF(ISERROR(INDIRECT(CONCATENATE($B105,\"!E23\"))),\"\",INDIRECT(CONCATENATE($B105,\"!E23\")))","v":100},null,null,{"$f":"IF(ISERROR(INDIRECT(CONCATENATE($B105,\"!E21\"))),\"\",INDIRECT(CONCATENATE($B105,\"!E21\")))","v":0},{"$f":"IF(ISERROR(INDIRECT(CONCATENATE($B105,\"!F16\"))),\"\",INDIRECT(CONCATENATE($B105,\"!F16\")))","v":99.334421920208626},{"$f":"IF(ISERROR(INDIRECT(CONCATENATE($B105,\"!F23\"))),\"\",INDIRECT(CONCATENATE($B105,\"!F23\")))","v":100},null,null,{"$f":"IF(ISERROR(INDIRECT(CONCATENATE($B105,\"!F21\"))),\"\",INDIRECT(CONCATENATE($B105,\"!F21\")))","v":0},{"$f":"IF(ISERROR(INDIRECT(CONCATENATE($B105,\"!G16\"))),\"\",INDIRECT(CONCATENATE($B105,\"!G16\")))","v":99.509725136318366},{"$f":"IF(ISERROR(INDIRECT(CONCATENATE($B105,\"!G23\"))),\"\",INDIRECT(CONCATENATE($B105,\"!G23\")))","v":100},null,null,{"$f":"IF(ISERROR(INDIRECT(CONCATENATE($B105,\"!G221\"))),\"\",INDIRECT(CONCATENATE($B105,\"!G21\")))","v":0}]
[null,null,null,"","",null,null,"","","",null,null,"","","",null,null,"","","",null,null,"","","",null,null,""]
[null,null,null,"","",null,null,"","","",null,null,"","","",null,null,"","","",null,null,"","","",null,null,""]
[null,null,null,"","",null,null,"","","",null,null,"","","",null,null,"","","",null,null,"","","",null,null,""]
[null,null,null,"","",null,null,"","","",null,null,"","","",null,null,"","","",null,null,"","","",null,null,""]
[null,null,null,"","",null,null,"","","",null,null,"","","",null,null,"","","",null,null,"","","",null,null,""]
[null,null,null,{"$f":"IF(ISERROR(INDIRECT(CONCATENATE($B111,\"!C16\"))),\"\",INDIRECT(CONCATENATE($B111,\"!C16\")))","v":""},{"$f":"IF(ISERROR(INDIRECT(CONCATENATE($B111,\"!C23\"))),\"\",INDIRECT(CONCATENATE($B111,\"!C23\")))","v":""},null,null,{"$f":"IF(ISERROR(INDIRECT(CONCATENATE($B111,\"!C21\"))),\"\",INDIRECT(CONCATENATE($B111,\"!C21\")))","v":""},{"$f":"IF(ISERROR(INDIRECT(CONCATENATE($B111,\"!D16\"))),\"\",INDIRECT(CONCATENATE($B111,\"!D16\")))","v":""},{"$f":"IF(ISERROR(INDIRECT(CONCATENATE($B111,\"!D23\"))),\"\",INDIRECT(CONCATENATE($B111,\"!D23\")))","v":""},null,null,{"$f":"IF(ISERROR(INDIRECT(CONCATENATE($B111,\"!D21\"))),\"\",INDIRECT(CONCATENATE($B111,\"!D21\")))","v":""},{"$f":"IF(ISERROR(INDIRECT(CONCATENATE($B111,\"!E16\"))),\"\",INDIRECT(CONCATENATE($B111,\"!E16\")))","v":""},{"$f":"IF(ISERROR(INDIRECT(CONCATENATE($B111,\"!E23\"))),\"\",INDIRECT(CONCATENATE($B111,\"!E23\")))","v":""},null,null,{"$f":"IF(ISERROR(INDIRECT(CONCATENATE($B111,\"!E21\"))),\"\",INDIRECT(CONCATENATE($B111,\"!E21\")))","v":""},{"$f":"IF(ISERROR(INDIRECT(CONCATENATE($B111,\"!F16\"))),\"\",INDIRECT(CONCATENATE($B111,\"!F16\")))","v":""},{"$f":"IF(ISERROR(INDIRECT(CONCATENATE($B111,\"!F23\"))),\"\",INDIRECT(CONCATENATE($B111,\"!F23\")))","v":""},null,null,{"$f":"IF(ISERROR(INDIRECT(CONCATENATE($B111,\"!F21\"))),\"\",INDIRECT(CONCATENATE($B111,\"!F21\")))","v":""},{"$f":"IF(ISERROR(INDIRECT(CONCATENATE($B111,\"!G16\"))),\"\",INDIRECT(CONCATENATE($B111,\"!G16\")))","v":""},{"$f":"IF(ISERROR(INDIRECT(CONCATENATE($B111,\"!G23\"))),\"\",INDIRECT(CONCATENATE($B111,\"!G23\")))","v":""},null,null,{"$f":"IF(ISERROR(INDIRECT(CONCATENATE($B111,\"!G221\"))),\"\",INDIRECT(CONCATENATE($B111,\"!G21\")))","v":""}]
[null,null,null,{"$f":"IF(ISERROR(INDIRECT(CONCATENATE($B112,\"!C16\"))),\"\",INDIRECT(CONCATENATE($B112,\"!C16\")))","v":""},{"$f":"IF(ISERROR(INDIRECT(CONCATENATE($B112,\"!C23\"))),\"\",INDIRECT(CONCATENATE($B112,\"!C23\")))","v":""},null,null,{"$f":"IF(ISERROR(INDIRECT(CONCATENATE($B112,\"!C21\"))),\"\",INDIRECT(CONCATENATE($B112,\"!C21\")))","v":""},{"$f":"IF(ISERROR(INDIRECT(CONCATENATE($B112,\"!D16\"))),\"\",INDIRECT(CONCATENATE($B112,\"!D16\")))","v":""},{"$f":"IF(ISERROR(INDIRECT(CONCATENATE($B112,\"!D23\"))),\"\",INDIRECT(CONCATENATE($B112,\"!D23\")))","v":""},null,null,{"$f":"IF(ISERROR(INDIRECT(CONCATENATE($B112,\"!D21\"))),\"\",INDIRECT(CONCATENATE($B112,\"!D21\")))","v":""},{"$f":"IF(ISERROR(INDIRECT(CONCATENATE($B112,\"!E16\"))),\"\",INDIRECT(CONCATENATE($B112,\"!E16\")))","v":""},{"$f":"IF(ISERROR(INDIRECT(CONCATENATE($B112,\"!E23\"))),\"\",INDIRECT(CONCATENATE($B112,\"!E23\")))","v":""},null,null,{"$f":"IF(ISERROR(INDIRECT(CONCATENATE($B112,\"!E21\"))),\"\",INDIRECT(CONCATENATE($B112,\"!E21\")))","v":""},{"$f":"IF(ISERROR(INDIRECT(CONCATENATE($B112,\"!F16\"))),\"\",INDIRECT(CONCATENATE($B112,\"!F16\")))","v":""},{"$f":"IF(ISERROR(INDIRECT(CONCATENATE($B112,\"!F23\"))),\"\",INDIRECT(CONCATENATE($B112,\"!F23\")))","v":""},null,null,{"$f":"IF(ISERROR(INDIRECT(CONCATENATE($B112,\"!F21\"))),\"\",INDIRECT(CONCATENATE($B112,\"!F21\")))","v":""},{"$f":"IF(ISERROR(INDIRECT(CONCATENATE($B112,\"!G16\"))),\"\",INDIRECT(CONCATENATE($B112,\"!G16\")))","v":""},{"$f":"IF(ISERROR(INDIRECT(CONCATENATE($B112,\"!G23\"))),\"\",INDIRECT(CONCATENATE($B112,\"!G23\")))","v":""},null,null,{"$f":"IF(ISERROR(INDIRECT(CONCATENATE($B112,\"!G221\"))),\"\",INDIRECT(CONCATENATE($B112,\"!G21\")))","v":""}]
[null,null,null,"","",null,null,"","","",null,null,"","","",null,null,"","","",null,null,"","","",null,null,""]
[null,null,null,"","",null,null,"","","",null,null,"","","",null,null,"","","",null,null,"","","",null,null,""]
[null,null,null,"","",null,null,"","","",null,null,"","","",null,null,"","","",null,null,"","","",null,null,""]
[null,null,null,"","",null,null,"","","",null,null,"","","",null,null,"","","",null,null,"","","",null,null,""]
[]
[null,{"$f":"CONCATENATE(\"National use of drinking water sources, \",C99,\"–\",C100)","v":"National use of drinking water sources, 2015–2020"},null,null,null,null,null,null,null,null,null,null,null,null,null,null,null,null,"Data points used for regression"]
[]
[]
[]
[]
[]
[]
[]
[]
[]
[]
[]
[]
[]
[]
[]
[]
[]
[]
[]
[]
[]
[]
[]
[]
[]
[]
[]
[]
[]
[]
[]
[]
[]
[]
[null,null,null,null,{"$f":"IF(ISERROR(INDIRECT(CONCATENATE($B153,\"!M18\"))),\"\",INDIRECT(CONCATENATE($B153,\"!M18\")))","v":""},{"$f":"IF(ISERROR(INDIRECT(CONCATENATE($B153,\"!M19\"))),\"\",INDIRECT(CONCATENATE($B153,\"!M19\")))","v":""},{"$f":"IF(ISERROR(INDIRECT(CONCATENATE($B153,\"!M20\"))),\"\",INDIRECT(CONCATENATE($B153,\"!M20\")))","v":""},{"$f":"IF(ISERROR(INDIRECT(CONCATENATE($B153,\"!M21\"))),\"\",INDIRECT(CONCATENATE($B153,\"!M21\")))","v":""},null,{"$f":"IF(ISERROR(INDIRECT(CONCATENATE($B153,\"!N18\"))),\"\",INDIRECT(CONCATENATE($B153,\"!N18\")))","v":""},{"$f":"IF(ISERROR(INDIRECT(CONCATENATE($B153,\"!N19\"))),\"\",INDIRECT(CONCATENATE($B153,\"!N19\")))","v":""},{"$f":"IF(ISERROR(INDIRECT(CONCATENATE($B153,\"!N20\"))),\"\",INDIRECT(CONCATENATE($B153,\"!N20\")))","v":""},{"$f":"IF(ISERROR(INDIRECT(CONCATENATE($B153,\"!N21\"))),\"\",INDIRECT(CONCATENATE($B153,\"!N21\")))","v":""},null,{"$f":"IF(ISERROR(INDIRECT(CONCATENATE($B153,\"!O18\"))),\"\",INDIRECT(CONCATENATE($B153,\"!O18\")))","v":""},{"$f":"IF(ISERROR(INDIRECT(CONCATENATE($B153,\"!O19\"))),\"\",INDIRECT(CONCATENATE($B153,\"!O19\")))","v":""},{"$f":"IF(ISERROR(INDIRECT(CONCATENATE($B153,\"!O20\"))),\"\",INDIRECT(CONCATENATE($B153,\"!O20\")))","v":""},{"$f":"IF(ISERROR(INDIRECT(CONCATENATE($B153,\"!O21\"))),\"\",INDIRECT(CONCATENATE($B153,\"!O21\")))","v":""},null,{"$f":"IF(ISERROR(INDIRECT(CONCATENATE($B153,\"!P18\"))),\"\",INDIRECT(CONCATENATE($B153,\"!P18\")))","v":""},{"$f":"IF(ISERROR(INDIRECT(CONCATENATE($B153,\"!P19\"))),\"\",INDIRECT(CONCATENATE($B153,\"!P19\")))","v":""},{"$f":"IF(ISERROR(INDIRECT(CONCATENATE($B153,\"!P20\"))),\"\",INDIRECT(CONCATENATE($B153,\"!P20\")))","v":""},{"$f":"IF(ISERROR(INDIRECT(CONCATENATE($B153,\"!P21\"))),\"\",INDIRECT(CONCATENATE($B153,\"!P21\")))","v":""},null,{"$f":"IF(ISERROR(INDIRECT(CONCATENATE($B153,\"!Q18\"))),\"\",INDIRECT(CONCATENATE($B153,\"!Q18\")))","v":""},{"$f":"IF(ISERROR(INDIRECT(CONCATENATE($B153,\"!Q19\"))),\"\",INDIRECT(CONCATENATE($B153,\"!Q19\")))","v":""},{"$f":"IF(ISERROR(INDIRECT(CONCATENATE($B153,\"!Q20\"))),\"\",INDIRECT(CONCATENATE($B153,\"!Q20\")))","v":""},{"$f":"IF(ISERROR(INDIRECT(CONCATENATE($B153,\"!Q21\"))),\"\",INDIRECT(CONCATENATE($B153,\"!Q1\")))","v":""}]
[null,null,null,null,"","","","",null,"","","","",null,"","","","",null,"","","","",null,"","","",""]
[null,null,null,null,"","","","",null,"","","","",null,"","","","",null,"","","","",null,"","","",""]
[null,null,null,null,"","","","",null,"","","","",null,"","","","",null,"","","","",null,"","","",""]
[null,null,null,null,"","","","",null,"","","","",null,"","","","",null,"","","","",null,"","","",""]
[null,null,null,null,"","","","",null,"","","","",null,"","","","",null,"","","","",null,"","","",""]
[]
[]
[]
[]
[]
[]
[]
[]
[]
[]
[]
[]
[]
[]
[]
[]
[]
[]
[]
[]
[]
[]
[]
[]
[]
[]
[]
[]
[]
[]
[]
[]
[]
[]
[]
[]
[]
[]
["URBAN",null,null,"Poorest",null,null,null,null,"Poor",null,null,null,null,"Middle",null,null,null,null,"Rich",null,null,null,null,"Richest"]
[null,null,null,"Improved","Basic","Limited","Unimproved","Surface water","Improved","Basic","Limited","Unimproved","Surface water","Improved","Basic","Limited","Unimproved","Surface water","Improved","Basic","Limited","Unimproved","Surface water","Improved","Basic","Limited","Unimproved","Surface water"]
["Forecast period:",null,2015,{"$f":"IF((D201+H201)>100,D201*100/(D201+H201),D201)","v":98.119595934795825},{"$f":"D199*AVERAGEIF(E205:E216,\">0\")/100","v":98.119595934795839},{"$f":"D199*(100-AVERAGEIF(E205:E216,\">0\"))/100","v":0},{"$f":"100-(E199+F199+H199)","v":1.8804040652041607},{"$f":"IF((D201+H201)>100,H201*100/(D201+H201),H201)","v":0},{"$f":"IF((I201+M201)>100,I201*100/(I201+M201),I201)","v":97.909937345536662},{"$f":"I199*AVERAGEIF(J205:J216,\">0\")/100","v":97.909937345536662},{"$f":"I199*(100-AVERAGEIF(J205:J216,\">0\"))/100","v":0},{"$f":"100-(J199+K199+M199)","v":2.0900626544633383},{"$f":"IF((I201+M201)>100,M201*100/(I201+M201),M201)","v":0},{"$f":"IF((N201+R201)>100,N201*100/(N201+R201),N201)","v":100},{"$f":"N199*AVERAGEIF(O205:O216,\">0\")/100","v":100},{"$f":"N199*(100-AVERAGEIF(O205:O216,\">0\"))/100","v":0},{"$f":"100-(O199+P199+R199)","v":0},{"$f":"IF((N201+R201)>100,R201*100/(N201+R201),R201)","v":0},{"$f":"IF((S201+W201)>100,S201*100/(S201+W201),S201)","v":100},{"$f":"S199*AVERAGEIF(T205:T216,\">0\")/100","v":100},{"$f":"S199*(100-AVERAGEIF(T205:T216,\">0\"))/100","v":0},{"$f":"100-(T199+U199+W199)","v":0},{"$f":"IF((S201+W201)>100,W201*100/(S201+W201),W201)","v":0},{"$f":"IF((X201+AB201)>100,X201*100/(X201+AB201),X201)","v":100},{"$f":"X199*AVERAGEIF(Y205:Y216,\">0\")/100","v":100},{"$f":"X199*(100-AVERAGEIF(Y205:Y216,\">0\"))/100","v":0},{"$f":"100-(Y199+Z199+AB199)","v":0},{"$f":"IF((X201+AB201)>100,AB201*100/(X201+AB201),AB201)","v":0}]
[null,null,2020,{"$f":"IF((D202+H202)>100,D202*100/(D202+H202),D202)","v":98.119595934795825},{"$f":"D200*AVERAGEIF(E205:E216,\">0\")/100","v":98.119595934795839},{"$f":"D200*(100-AVERAGEIF(E205:E216,\">0\"))/100","v":0},{"$f":"100-(E200+F200+H200)","v":1.8804040652041607},{"$f":"IF((D202+H202)>100,H202*100/(D202+H202),H202)","v":0},{"$f":"IF((I202+M202)>100,I202*100/(I202+M202),I202)","v":97.909937345536662},{"$f":"I200*AVERAGEIF(J205:J216,\">0\")/100","v":97.909937345536662},{"$f":"I200*(100-AVERAGEIF(J205:J216,\">0\"))/100","v":0},{"$f":"100-(J200+K200+M200)","v":2.0900626544633383},{"$f":"IF((I202+M202)>100,M202*100/(I202+M202),M202)","v":0},{"$f":"IF((N202+R202)>100,N202*100/(N202+R202),N202)","v":100},{"$f":"N200*AVERAGEIF(O205:O216,\">0\")/100","v":100},{"$f":"N200*(100-AVERAGEIF(O205:O216,\">0\"))/100","v":0},{"$f":"100-(O200+P200+R200)","v":0},{"$f":"IF((N202+R202)>100,R202*100/(N202+R202),R202)","v":0},{"$f":"IF((S202+W202)>100,S202*100/(S202+W202),S202)","v":100},{"$f":"S200*AVERAGEIF(T205:T216,\">0\")/100","v":100},{"$f":"S200*(100-AVERAGEIF(T205:T216,\">0\"))/100","v":0},{"$f":"100-(T200+U200+W200)","v":0},{"$f":"IF((S202+W202)>100,W202*100/(S202+W202),W202)","v":0},{"$f":"IF((X202+AB202)>100,X202*100/(X202+AB202),X202)","v":100},{"$f":"X200*AVERAGEIF(Y205:Y216,\">0\")/100","v":100},{"$f":"X200*(100-AVERAGEIF(Y205:Y216,\">0\"))/100","v":0},{"$f":"100-(Y200+Z200+AB200)","v":0},{"$f":"IF((X202+AB202)>100,AB202*100/(X202+AB202),AB202)","v":0}]
["Regression period:",null,{"$f":"MinRegYear(C199,C205:C216)","v":2017},{"$f":"IF(MAX(C205:C216)-MIN(C205:C216)<5,AVERAGEIF(C205:C216,\">0\",D205:D216),\nIF(FORECAST($C201,D$205:D$216,$C$205:$C$216)<0,0,\nIF(FORECAST($C201,D$205:D$216,$C$205:$C$216)>100,100,\nFORECAST($C201,D$205:D$216,$C$205:$C$216))))","v":98.119595934795825},null,null,null,{"$f":"IF(MAX(C205:C216)-MIN(C205:C216)<5,AVERAGEIF(C205:C216,\">0\",H205:H216),\nIF(FORECAST($C201,H$205:H$216,$C$205:$C$216)<0,0,\nIF(FORECAST($C201,H$205:H$216,$C$205:$C$216)>100,100,\nFORECAST($C201,H$205:H$216,$C$205:$C$216))))","v":0},{"$f":"IF(MAX(C205:C216)-MIN(C205:C216)<5,AVERAGEIF(C205:C216,\">0\",I205:I216),\nIF(FORECAST($C201,I$205:I$216,$C$205:$C$216)<0,0,\nIF(FORECAST($C201,I$205:I$216,$C$205:$C$216)>100,100,\nFORECAST($C201,I$205:I$216,$C$205:$C$216))))","v":97.909937345536662},null,null,null,{"$f":"IF(MAX(C205:C216)-MIN(C205:C216)<5,AVERAGEIF(C205:C216,\">0\",M205:M216),\nIF(FORECAST($C201,M$205:M$216,$C$205:$C$216)<0,0,\nIF(FORECAST($C201,M$205:M$216,$C$205:$C$216)>100,100,\nFORECAST($C201,M$205:M$216,$C$205:$C$216))))","v":0},{"$f":"IF(MAX(C205:C216)-MIN(C205:C216)<5,AVERAGEIF(C205:C216,\">0\",N205:N216),\nIF(FORECAST($C201,N$205:N$216,$C$205:$C$216)<0,0,\nIF(FORECAST($C201,N$205:N$216,$C$205:$C$216)>100,100,\nFORECAST($C201,N$205:N$216,$C$205:$C$216))))","v":100},null,null,null,{"$f":"IF(MAX(C205:C216)-MIN(C205:C216)<5,AVERAGEIF(C205:C216,\">0\",R205:R216),\nIF(FORECAST($C201,R$205:R$216,$C$205:$C$216)<0,0,\nIF(FORECAST($C201,R$205:R$216,$C$205:$C$216)>100,100,\nFORECAST($C201,R$205:R$216,$C$205:$C$216))))","v":0},{"$f":"IF(MAX(C205:C216)-MIN(C205:C216)<5,AVERAGEIF(C205:C216,\">0\",S205:S216),\nIF(FORECAST($C201,S$205:S$216,$C$205:$C$216)<0,0,\nIF(FORECAST($C201,S$205:S$216,$C$205:$C$216)>100,100,\nFORECAST($C201,S$205:S$216,$C$205:$C$216))))","v":100},null,null,null,{"$f":"IF(MAX(C205:C216)-MIN(C205:C216)<5,AVERAGEIF(C205:C216,\">0\",W205:W216),\nIF(FORECAST($C201,W$205:W$216,$C$205:$C$216)<0,0,\nIF(FORECAST($C201,W$205:W$216,$C$205:$C$216)>100,100,\nFORECAST($C201,W$205:W$216,$C$205:$C$216))))","v":0},{"$f":"IF(MAX(C205:C216)-MIN(C205:C216)<5,AVERAGEIF(C205:C216,\">0\",X205:X216),\nIF(FORECAST($C201,X$205:X$216,$C$205:$C$216)<0,0,\nIF(FORECAST($C201,X$205:X$216,$C$205:$C$216)>100,100,\nFORECAST($C201,X$205:X$216,$C$205:$C$216))))","v":100},null,null,null,{"$f":"IF(MAX(C205:C216)-MIN(C205:C216)<5,AVERAGEIF(C205:C216,\">0\",AB205:AB216),\nIF(FORECAST($C201,AB$205:AB$216,$C$205:$C$216)<0,0,\nIF(FORECAST($C201,AB$205:AB$216,$C$205:$C$216)>100,100,\nFORECAST($C201,AB$205:AB$216,$C$205:$C$216))))","v":0}]
[null,null,{"$f":"MaxRegYear(C200,C205:C216)","v":2020},{"$f":"IF(MAX(C205:C216)-MIN(C205:C216)<5,AVERAGEIF(C205:C216,\">0\",D205:D216),\nIF(FORECAST($C202,D$205:D$216,$C$205:$C$216)<0,0,\nIF(FORECAST($C202,D$205:D$216,$C$205:$C$216)>100,100,\nFORECAST($C202,D$205:D$216,$C$205:$C$216))))","v":98.119595934795825},null,null,null,{"$f":"IF(MAX(C205:C216)-MIN(C205:C216)<5,AVERAGEIF(C205:C216,\">0\",H205:H216),\nIF(FORECAST($C202,H$205:H$216,$C$205:$C$216)<0,0,\nIF(FORECAST($C202,H$205:H$216,$C$205:$C$216)>100,100,\nFORECAST($C202,H$205:H$216,$C$205:$C$216))))","v":0},{"$f":"IF(MAX(C205:C216)-MIN(C205:C216)<5,AVERAGEIF(C205:C216,\">0\",I205:I216),\nIF(FORECAST($C202,I$205:I$216,$C$205:$C$216)<0,0,\nIF(FORECAST($C202,I$205:I$216,$C$205:$C$216)>100,100,\nFORECAST($C202,I$205:I$216,$C$205:$C$216))))","v":97.909937345536662},null,null,null,{"$f":"IF(MAX(C205:C216)-MIN(C205:C216)<5,AVERAGEIF(C205:C216,\">0\",M205:M216),\nIF(FORECAST($C202,M$205:M$216,$C$205:$C$216)<0,0,\nIF(FORECAST($C202,M$205:M$216,$C$205:$C$216)>100,100,\nFORECAST($C202,M$205:M$216,$C$205:$C$216))))","v":0},{"$f":"IF(MAX(C205:C216)-MIN(C205:C216)<5,AVERAGEIF(C205:C216,\">0\",N205:N216),\nIF(FORECAST($C202,N$205:N$216,$C$205:$C$216)<0,0,\nIF(FORECAST($C202,N$205:N$216,$C$205:$C$216)>100,100,\nFORECAST($C202,N$205:N$216,$C$205:$C$216))))","v":100},null,null,null,{"$f":"IF(MAX(C205:C216)-MIN(C205:C216)<5,AVERAGEIF(C205:C216,\">0\",R205:R216),\nIF(FORECAST($C202,R$205:R$216,$C$205:$C$216)<0,0,\nIF(FORECAST($C202,R$205:R$216,$C$205:$C$216)>100,100,\nFORECAST($C202,R$205:R$216,$C$205:$C$216))))","v":0},{"$f":"IF(MAX(C205:C216)-MIN(C205:C216)<5,AVERAGEIF(C205:C216,\">0\",S205:S216),\nIF(FORECAST($C202,S$205:S$216,$C$205:$C$216)<0,0,\nIF(FORECAST($C202,S$205:S$216,$C$205:$C$216)>100,100,\nFORECAST($C202,S$205:S$216,$C$205:$C$216))))","v":100},null,null,null,{"$f":"IF(MAX(C205:C216)-MIN(C205:C216)<5,AVERAGEIF(C205:C216,\">0\",W205:W216),\nIF(FORECAST($C202,W$205:W$216,$C$205:$C$216)<0,0,\nIF(FORECAST($C202,W$205:W$216,$C$205:$C$216)>100,100,\nFORECAST($C202,W$205:W$216,$C$205:$C$216))))","v":0},{"$f":"IF(MAX(C205:C216)-MIN(C205:C216)<5,AVERAGEIF(C205:C216,\">0\",X205:X216),\nIF(FORECAST($C202,X$205:X$216,$C$205:$C$216)<0,0,\nIF(FORECAST($C202,X$205:X$216,$C$205:$C$216)>100,100,\nFORECAST($C202,X$205:X$216,$C$205:$C$216))))","v":100},null,null,null,{"$f":"IF(MAX(C205:C216)-MIN(C205:C216)<5,AVERAGEIF(C205:C216,\">0\",AB205:AB216),\nIF(FORECAST($C202,AB$205:AB$216,$C$205:$C$216)<0,0,\nIF(FORECAST($C202,AB$205:AB$216,$C$205:$C$216)>100,100,\nFORECAST($C202,AB$205:AB$216,$C$205:$C$216))))","v":0}]
[]
[null,"Survey","Year","Improved","% Improved\n< = 30min",null,null,"Surface water","Improved","% Improved\n< = 30min",null,null,"Surface water","Improved","% Improved\n< = 30min",null,null,"Surface water","Improved","% Improved\n< = 30min",null,null,"Surface water","Improved","% Improved\n< = 30min",null,null,"Surface water"]
[null,"MICS19",2019,{"$f":"IF(ISERROR(INDIRECT(CONCATENATE($B205,\"!H16\"))),\"\",INDIRECT(CONCATENATE($B205,\"!H16\")))","v":98.119595934795825},{"$f":"IF(ISERROR(INDIRECT(CONCATENATE($B205,\"!H23\"))),\"\",INDIRECT(CONCATENATE($B205,\"!H23\")))","v":100},null,null,{"$f":"IF(ISERROR(INDIRECT(CONCATENATE($B205,\"!H21\"))),\"\",INDIRECT(CONCATENATE($B205,\"!H21\")))","v":0},{"$f":"IF(ISERROR(INDIRECT(CONCATENATE($B205,\"!I16\"))),\"\",INDIRECT(CONCATENATE($B205,\"!I16\")))","v":97.909937345536662},{"$f":"IF(ISERROR(INDIRECT(CONCATENATE($B205,\"!I23\"))),\"\",INDIRECT(CONCATENATE($B205,\"!I23\")))","v":100},null,null,{"$f":"IF(ISERROR(INDIRECT(CONCATENATE($B205,\"!I21\"))),\"\",INDIRECT(CONCATENATE($B205,\"!I21\")))","v":0},{"$f":"IF(ISERROR(INDIRECT(CONCATENATE($B205,\"!J16\"))),\"\",INDIRECT(CONCATENATE($B205,\"!J16\")))","v":100},{"$f":"IF(ISERROR(INDIRECT(CONCATENATE($B205,\"!J23\"))),\"\",INDIRECT(CONCATENATE($B205,\"!J23\")))","v":100},null,null,{"$f":"IF(ISERROR(INDIRECT(CONCATENATE($B205,\"!J21\"))),\"\",INDIRECT(CONCATENATE($B205,\"!J21\")))","v":0},{"$f":"IF(ISERROR(INDIRECT(CONCATENATE($B205,\"!K16\"))),\"\",INDIRECT(CONCATENATE($B205,\"!K16\")))","v":100},{"$f":"IF(ISERROR(INDIRECT(CONCATENATE($B205,\"!K23\"))),\"\",INDIRECT(CONCATENATE($B205,\"!K23\")))","v":100},null,null,{"$f":"IF(ISERROR(INDIRECT(CONCATENATE($B205,\"!K21\"))),\"\",INDIRECT(CONCATENATE($B205,\"!K21\")))","v":0},{"$f":"IF(ISERROR(INDIRECT(CONCATENATE($B205,\"!L16\"))),\"\",INDIRECT(CONCATENATE($B205,\"!L16\")))","v":100},{"$f":"IF(ISERROR(INDIRECT(CONCATENATE($B205,\"!L23\"))),\"\",INDIRECT(CONCATENATE($B205,\"!L23\")))","v":100},null,null,{"$f":"IF(ISERROR(INDIRECT(CONCATENATE($B205,\"!L221\"))),\"\",INDIRECT(CONCATENATE($B205,\"!L21\")))","v":0}]
[null,null,null,"","",null,null,"","","",null,null,"","","",null,null,"","","",null,null,"","","",null,null,""]
[null,null,null,"","",null,null,"","","",null,null,"","","",null,null,"","","",null,null,"","","",null,null,""]
[null,null,null,"","",null,null,"","","",null,null,"","","",null,null,"","","",null,null,"","","",null,null,""]
[null,null,null,"","",null,null,"","","",null,null,"","","",null,null,"","","",null,null,"","","",null,null,""]
[null,null,null,"","",null,null,"","","",null,null,"","","",null,null,"","","",null,null,"","","",null,null,""]
[null,null,null,"","",null,null,"","","",null,null,"","","",null,null,"","","",null,null,"","","",null,null,""]
[null,null,null,"","",null,null,"","","",null,null,"","","",null,null,"","","",null,null,"","","",null,null,""]
[null,null,null,"","",null,null,"","","",null,null,"","","",null,null,"","","",null,null,"","","",null,null,""]
[null,null,null,"","",null,null,"","","",null,null,"","","",null,null,"","","",null,null,"","","",null,null,""]
[null,null,null,"","",null,null,"","","",null,null,"","","",null,null,"","","",null,null,"","","",null,null,""]
[null,null,null,"","",null,null,"","","",null,null,"","","",null,null,"","","",null,null,"","","",null,null,""]
[]
[null,{"$f":"CONCATENATE(\"Urban use of drinking water sources,  \",C199,\"–\",C200)","v":"Urban use of drinking water sources,  2015–2020"},null,null,null,null,null,null,null,null,null,null,null,null,null,null,null,null,"Data points used for regression"]
[]
[]
[]
[]
[]
[]
[]
[]
[]
[]
[]
[]
[]
[]
[]
[]
[]
[]
[]
[]
[]
[]
[]
[]
[]
[]
[]
[]
[]
[]
[]
[]
[]
[]
[null,null,null,null,{"$f":"IF(ISERROR(INDIRECT(CONCATENATE($B253,\"!M18\"))),\"\",INDIRECT(CONCATENATE($B253,\"!M18\")))","v":""},{"$f":"IF(ISERROR(INDIRECT(CONCATENATE($B253,\"!M19\"))),\"\",INDIRECT(CONCATENATE($B253,\"!M19\")))","v":""},{"$f":"IF(ISERROR(INDIRECT(CONCATENATE($B253,\"!M20\"))),\"\",INDIRECT(CONCATENATE($B253,\"!M20\")))","v":""},{"$f":"IF(ISERROR(INDIRECT(CONCATENATE($B253,\"!M21\"))),\"\",INDIRECT(CONCATENATE($B253,\"!M21\")))","v":""},null,{"$f":"IF(ISERROR(INDIRECT(CONCATENATE($B253,\"!N18\"))),\"\",INDIRECT(CONCATENATE($B253,\"!N18\")))","v":""},{"$f":"IF(ISERROR(INDIRECT(CONCATENATE($B253,\"!N19\"))),\"\",INDIRECT(CONCATENATE($B253,\"!N19\")))","v":""},{"$f":"IF(ISERROR(INDIRECT(CONCATENATE($B253,\"!N20\"))),\"\",INDIRECT(CONCATENATE($B253,\"!N20\")))","v":""},{"$f":"IF(ISERROR(INDIRECT(CONCATENATE($B253,\"!N21\"))),\"\",INDIRECT(CONCATENATE($B253,\"!N21\")))","v":""},null,{"$f":"IF(ISERROR(INDIRECT(CONCATENATE($B253,\"!O18\"))),\"\",INDIRECT(CONCATENATE($B253,\"!O18\")))","v":""},{"$f":"IF(ISERROR(INDIRECT(CONCATENATE($B253,\"!O19\"))),\"\",INDIRECT(CONCATENATE($B253,\"!O19\")))","v":""},{"$f":"IF(ISERROR(INDIRECT(CONCATENATE($B253,\"!O20\"))),\"\",INDIRECT(CONCATENATE($B253,\"!O20\")))","v":""},{"$f":"IF(ISERROR(INDIRECT(CONCATENATE($B253,\"!O21\"))),\"\",INDIRECT(CONCATENATE($B253,\"!O21\")))","v":""},null,{"$f":"IF(ISERROR(INDIRECT(CONCATENATE($B253,\"!P18\"))),\"\",INDIRECT(CONCATENATE($B253,\"!P18\")))","v":""},{"$f":"IF(ISERROR(INDIRECT(CONCATENATE($B253,\"!P19\"))),\"\",INDIRECT(CONCATENATE($B253,\"!P19\")))","v":""},{"$f":"IF(ISERROR(INDIRECT(CONCATENATE($B253,\"!P20\"))),\"\",INDIRECT(CONCATENATE($B253,\"!P20\")))","v":""},{"$f":"IF(ISERROR(INDIRECT(CONCATENATE($B253,\"!P21\"))),\"\",INDIRECT(CONCATENATE($B253,\"!P21\")))","v":""},null,{"$f":"IF(ISERROR(INDIRECT(CONCATENATE($B253,\"!Q18\"))),\"\",INDIRECT(CONCATENATE($B253,\"!Q18\")))","v":""},{"$f":"IF(ISERROR(INDIRECT(CONCATENATE($B253,\"!Q19\"))),\"\",INDIRECT(CONCATENATE($B253,\"!Q19\")))","v":""},{"$f":"IF(ISERROR(INDIRECT(CONCATENATE($B253,\"!Q20\"))),\"\",INDIRECT(CONCATENATE($B253,\"!Q20\")))","v":""},{"$f":"IF(ISERROR(INDIRECT(CONCATENATE($B253,\"!Q21\"))),\"\",INDIRECT(CONCATENATE($B253,\"!Q1\")))","v":""}]
[null,null,null,null,{"$f":"IF(ISERROR(INDIRECT(CONCATENATE($B254,\"!M18\"))),\"\",INDIRECT(CONCATENATE($B254,\"!M18\")))","v":""},{"$f":"IF(ISERROR(INDIRECT(CONCATENATE($B254,\"!M19\"))),\"\",INDIRECT(CONCATENATE($B254,\"!M19\")))","v":""},{"$f":"IF(ISERROR(INDIRECT(CONCATENATE($B254,\"!M20\"))),\"\",INDIRECT(CONCATENATE($B254,\"!M20\")))","v":""},{"$f":"IF(ISERROR(INDIRECT(CONCATENATE($B254,\"!M21\"))),\"\",INDIRECT(CONCATENATE($B254,\"!M21\")))","v":""},null,{"$f":"IF(ISERROR(INDIRECT(CONCATENATE($B254,\"!N18\"))),\"\",INDIRECT(CONCATENATE($B254,\"!N18\")))","v":""},{"$f":"IF(ISERROR(INDIRECT(CONCATENATE($B254,\"!N19\"))),\"\",INDIRECT(CONCATENATE($B254,\"!N19\")))","v":""},{"$f":"IF(ISERROR(INDIRECT(CONCATENATE($B254,\"!N20\"))),\"\",INDIRECT(CONCATENATE($B254,\"!N20\")))","v":""},{"$f":"IF(ISERROR(INDIRECT(CONCATENATE($B254,\"!N21\"))),\"\",INDIRECT(CONCATENATE($B254,\"!N21\")))","v":""},null,{"$f":"IF(ISERROR(INDIRECT(CONCATENATE($B254,\"!O18\"))),\"\",INDIRECT(CONCATENATE($B254,\"!O18\")))","v":""},{"$f":"IF(ISERROR(INDIRECT(CONCATENATE($B254,\"!O19\"))),\"\",INDIRECT(CONCATENATE($B254,\"!O19\")))","v":""},{"$f":"IF(ISERROR(INDIRECT(CONCATENATE($B254,\"!O20\"))),\"\",INDIRECT(CONCATENATE($B254,\"!O20\")))","v":""},{"$f":"IF(ISERROR(INDIRECT(CONCATENATE($B254,\"!O21\"))),\"\",INDIRECT(CONCATENATE($B254,\"!O21\")))","v":""},null,{"$f":"IF(ISERROR(INDIRECT(CONCATENATE($B254,\"!P18\"))),\"\",INDIRECT(CONCATENATE($B254,\"!P18\")))","v":""},{"$f":"IF(ISERROR(INDIRECT(CONCATENATE($B254,\"!P19\"))),\"\",INDIRECT(CONCATENATE($B254,\"!P19\")))","v":""},{"$f":"IF(ISERROR(INDIRECT(CONCATENATE($B254,\"!P20\"))),\"\",INDIRECT(CONCATENATE($B254,\"!P20\")))","v":""},{"$f":"IF(ISERROR(INDIRECT(CONCATENATE($B254,\"!P21\"))),\"\",INDIRECT(CONCATENATE($B254,\"!P21\")))","v":""},null,{"$f":"IF(ISERROR(INDIRECT(CONCATENATE($B254,\"!Q18\"))),\"\",INDIRECT(CONCATENATE($B254,\"!Q18\")))","v":""},{"$f":"IF(ISERROR(INDIRECT(CONCATENATE($B254,\"!Q19\"))),\"\",INDIRECT(CONCATENATE($B254,\"!Q19\")))","v":""},{"$f":"IF(ISERROR(INDIRECT(CONCATENATE($B254,\"!Q20\"))),\"\",INDIRECT(CONCATENATE($B254,\"!Q20\")))","v":""},{"$f":"IF(ISERROR(INDIRECT(CONCATENATE($B254,\"!Q21\"))),\"\",INDIRECT(CONCATENATE($B254,\"!Q1\")))","v":""}]
[null,null,null,null,{"$f":"IF(ISERROR(INDIRECT(CONCATENATE($B255,\"!M18\"))),\"\",INDIRECT(CONCATENATE($B255,\"!M18\")))","v":""},{"$f":"IF(ISERROR(INDIRECT(CONCATENATE($B255,\"!M19\"))),\"\",INDIRECT(CONCATENATE($B255,\"!M19\")))","v":""},{"$f":"IF(ISERROR(INDIRECT(CONCATENATE($B255,\"!M20\"))),\"\",INDIRECT(CONCATENATE($B255,\"!M20\")))","v":""},{"$f":"IF(ISERROR(INDIRECT(CONCATENATE($B255,\"!M21\"))),\"\",INDIRECT(CONCATENATE($B255,\"!M21\")))","v":""},null,{"$f":"IF(ISERROR(INDIRECT(CONCATENATE($B255,\"!N18\"))),\"\",INDIRECT(CONCATENATE($B255,\"!N18\")))","v":""},{"$f":"IF(ISERROR(INDIRECT(CONCATENATE($B255,\"!N19\"))),\"\",INDIRECT(CONCATENATE($B255,\"!N19\")))","v":""},{"$f":"IF(ISERROR(INDIRECT(CONCATENATE($B255,\"!N20\"))),\"\",INDIRECT(CONCATENATE($B255,\"!N20\")))","v":""},{"$f":"IF(ISERROR(INDIRECT(CONCATENATE($B255,\"!N21\"))),\"\",INDIRECT(CONCATENATE($B255,\"!N21\")))","v":""},null,{"$f":"IF(ISERROR(INDIRECT(CONCATENATE($B255,\"!O18\"))),\"\",INDIRECT(CONCATENATE($B255,\"!O18\")))","v":""},{"$f":"IF(ISERROR(INDIRECT(CONCATENATE($B255,\"!O19\"))),\"\",INDIRECT(CONCATENATE($B255,\"!O19\")))","v":""},{"$f":"IF(ISERROR(INDIRECT(CONCATENATE($B255,\"!O20\"))),\"\",INDIRECT(CONCATENATE($B255,\"!O20\")))","v":""},{"$f":"IF(ISERROR(INDIRECT(CONCATENATE($B255,\"!O21\"))),\"\",INDIRECT(CONCATENATE($B255,\"!O21\")))","v":""},null,{"$f":"IF(ISERROR(INDIRECT(CONCATENATE($B255,\"!P18\"))),\"\",INDIRECT(CONCATENATE($B255,\"!P18\")))","v":""},{"$f":"IF(ISERROR(INDIRECT(CONCATENATE($B255,\"!P19\"))),\"\",INDIRECT(CONCATENATE($B255,\"!P19\")))","v":""},{"$f":"IF(ISERROR(INDIRECT(CONCATENATE($B255,\"!P20\"))),\"\",INDIRECT(CONCATENATE($B255,\"!P20\")))","v":""},{"$f":"IF(ISERROR(INDIRECT(CONCATENATE($B255,\"!P21\"))),\"\",INDIRECT(CONCATENATE($B255,\"!P21\")))","v":""},null,{"$f":"IF(ISERROR(INDIRECT(CONCATENATE($B255,\"!Q18\"))),\"\",INDIRECT(CONCATENATE($B255,\"!Q18\")))","v":""},{"$f":"IF(ISERROR(INDIRECT(CONCATENATE($B255,\"!Q19\"))),\"\",INDIRECT(CONCATENATE($B255,\"!Q19\")))","v":""},{"$f":"IF(ISERROR(INDIRECT(CONCATENATE($B255,\"!Q20\"))),\"\",INDIRECT(CONCATENATE($B255,\"!Q20\")))","v":""},{"$f":"IF(ISERROR(INDIRECT(CONCATENATE($B255,\"!Q21\"))),\"\",INDIRECT(CONCATENATE($B255,\"!Q1\")))","v":""}]
[null,null,null,null,{"$f":"IF(ISERROR(INDIRECT(CONCATENATE($B256,\"!M18\"))),\"\",INDIRECT(CONCATENATE($B256,\"!M18\")))","v":""},{"$f":"IF(ISERROR(INDIRECT(CONCATENATE($B256,\"!M19\"))),\"\",INDIRECT(CONCATENATE($B256,\"!M19\")))","v":""},{"$f":"IF(ISERROR(INDIRECT(CONCATENATE($B256,\"!M20\"))),\"\",INDIRECT(CONCATENATE($B256,\"!M20\")))","v":""},{"$f":"IF(ISERROR(INDIRECT(CONCATENATE($B256,\"!M21\"))),\"\",INDIRECT(CONCATENATE($B256,\"!M21\")))","v":""},null,{"$f":"IF(ISERROR(INDIRECT(CONCATENATE($B256,\"!N18\"))),\"\",INDIRECT(CONCATENATE($B256,\"!N18\")))","v":""},{"$f":"IF(ISERROR(INDIRECT(CONCATENATE($B256,\"!N19\"))),\"\",INDIRECT(CONCATENATE($B256,\"!N19\")))","v":""},{"$f":"IF(ISERROR(INDIRECT(CONCATENATE($B256,\"!N20\"))),\"\",INDIRECT(CONCATENATE($B256,\"!N20\")))","v":""},{"$f":"IF(ISERROR(INDIRECT(CONCATENATE($B256,\"!N21\"))),\"\",INDIRECT(CONCATENATE($B256,\"!N21\")))","v":""},null,{"$f":"IF(ISERROR(INDIRECT(CONCATENATE($B256,\"!O18\"))),\"\",INDIRECT(CONCATENATE($B256,\"!O18\")))","v":""},{"$f":"IF(ISERROR(INDIRECT(CONCATENATE($B256,\"!O19\"))),\"\",INDIRECT(CONCATENATE($B256,\"!O19\")))","v":""},{"$f":"IF(ISERROR(INDIRECT(CONCATENATE($B256,\"!O20\"))),\"\",INDIRECT(CONCATENATE($B256,\"!O20\")))","v":""},{"$f":"IF(ISERROR(INDIRECT(CONCATENATE($B256,\"!O21\"))),\"\",INDIRECT(CONCATENATE($B256,\"!O21\")))","v":""},null,{"$f":"IF(ISERROR(INDIRECT(CONCATENATE($B256,\"!P18\"))),\"\",INDIRECT(CONCATENATE($B256,\"!P18\")))","v":""},{"$f":"IF(ISERROR(INDIRECT(CONCATENATE($B256,\"!P19\"))),\"\",INDIRECT(CONCATENATE($B256,\"!P19\")))","v":""},{"$f":"IF(ISERROR(INDIRECT(CONCATENATE($B256,\"!P20\"))),\"\",INDIRECT(CONCATENATE($B256,\"!P20\")))","v":""},{"$f":"IF(ISERROR(INDIRECT(CONCATENATE($B256,\"!P21\"))),\"\",INDIRECT(CONCATENATE($B256,\"!P21\")))","v":""},null,{"$f":"IF(ISERROR(INDIRECT(CONCATENATE($B256,\"!Q18\"))),\"\",INDIRECT(CONCATENATE($B256,\"!Q18\")))","v":""},{"$f":"IF(ISERROR(INDIRECT(CONCATENATE($B256,\"!Q19\"))),\"\",INDIRECT(CONCATENATE($B256,\"!Q19\")))","v":""},{"$f":"IF(ISERROR(INDIRECT(CONCATENATE($B256,\"!Q20\"))),\"\",INDIRECT(CONCATENATE($B256,\"!Q20\")))","v":""},{"$f":"IF(ISERROR(INDIRECT(CONCATENATE($B256,\"!Q21\"))),\"\",INDIRECT(CONCATENATE($B256,\"!Q1\")))","v":""}]
[null,null,null,null,{"$f":"IF(ISERROR(INDIRECT(CONCATENATE($B257,\"!M18\"))),\"\",INDIRECT(CONCATENATE($B257,\"!M18\")))","v":""},{"$f":"IF(ISERROR(INDIRECT(CONCATENATE($B257,\"!M19\"))),\"\",INDIRECT(CONCATENATE($B257,\"!M19\")))","v":""},{"$f":"IF(ISERROR(INDIRECT(CONCATENATE($B257,\"!M20\"))),\"\",INDIRECT(CONCATENATE($B257,\"!M20\")))","v":""},{"$f":"IF(ISERROR(INDIRECT(CONCATENATE($B257,\"!M21\"))),\"\",INDIRECT(CONCATENATE($B257,\"!M21\")))","v":""},null,{"$f":"IF(ISERROR(INDIRECT(CONCATENATE($B257,\"!N18\"))),\"\",INDIRECT(CONCATENATE($B257,\"!N18\")))","v":""},{"$f":"IF(ISERROR(INDIRECT(CONCATENATE($B257,\"!N19\"))),\"\",INDIRECT(CONCATENATE($B257,\"!N19\")))","v":""},{"$f":"IF(ISERROR(INDIRECT(CONCATENATE($B257,\"!N20\"))),\"\",INDIRECT(CONCATENATE($B257,\"!N20\")))","v":""},{"$f":"IF(ISERROR(INDIRECT(CONCATENATE($B257,\"!N21\"))),\"\",INDIRECT(CONCATENATE($B257,\"!N21\")))","v":""},null,{"$f":"IF(ISERROR(INDIRECT(CONCATENATE($B257,\"!O18\"))),\"\",INDIRECT(CONCATENATE($B257,\"!O18\")))","v":""},{"$f":"IF(ISERROR(INDIRECT(CONCATENATE($B257,\"!O19\"))),\"\",INDIRECT(CONCATENATE($B257,\"!O19\")))","v":""},{"$f":"IF(ISERROR(INDIRECT(CONCATENATE($B257,\"!O20\"))),\"\",INDIRECT(CONCATENATE($B257,\"!O20\")))","v":""},{"$f":"IF(ISERROR(INDIRECT(CONCATENATE($B257,\"!O21\"))),\"\",INDIRECT(CONCATENATE($B257,\"!O21\")))","v":""},null,{"$f":"IF(ISERROR(INDIRECT(CONCATENATE($B257,\"!P18\"))),\"\",INDIRECT(CONCATENATE($B257,\"!P18\")))","v":""},{"$f":"IF(ISERROR(INDIRECT(CONCATENATE($B257,\"!P19\"))),\"\",INDIRECT(CONCATENATE($B257,\"!P19\")))","v":""},{"$f":"IF(ISERROR(INDIRECT(CONCATENATE($B257,\"!P20\"))),\"\",INDIRECT(CONCATENATE($B257,\"!P20\")))","v":""},{"$f":"IF(ISERROR(INDIRECT(CONCATENATE($B257,\"!P21\"))),\"\",INDIRECT(CONCATENATE($B257,\"!P21\")))","v":""},null,{"$f":"IF(ISERROR(INDIRECT(CONCATENATE($B257,\"!Q18\"))),\"\",INDIRECT(CONCATENATE($B257,\"!Q18\")))","v":""},{"$f":"IF(ISERROR(INDIRECT(CONCATENATE($B257,\"!Q19\"))),\"\",INDIRECT(CONCATENATE($B257,\"!Q19\")))","v":""},{"$f":"IF(ISERROR(INDIRECT(CONCATENATE($B257,\"!Q20\"))),\"\",INDIRECT(CONCATENATE($B257,\"!Q20\")))","v":""},{"$f":"IF(ISERROR(INDIRECT(CONCATENATE($B257,\"!Q21\"))),\"\",INDIRECT(CONCATENATE($B257,\"!Q1\")))","v":""}]
[]
[]
[]
[]
[]
[]
[]
[]
[]
[]
[]
[]
[]
[]
[]
[]
[]
[]
[]
[]
[]
[]
[]
[]
[]
[]
[]
[]
[]
[]
[]
[]
[]
[]
[]
[]
[]
[]
[]
["RURAL",null,null,"Poorest",null,null,null,null,"Poor",null,null,null,null,"Middle",null,null,null,null,"Rich",null,null,null,null,"Richest"]
[null,null,null,"Improved","Basic","Limited","Unimproved","Surface water","Improved","Basic","Limited","Unimproved","Surface water","Improved","Basic","Limited","Unimproved","Surface water","Improved","Basic","Limited","Unimproved","Surface water","Improved","Basic","Limited","Unimproved","Surface water"]
["Forecast period:",null,2015,{"$f":"IF((D301+H301)>100,D301*100/(D301+H301),D301)","v":99.422651096569922},{"$f":"D299*AVERAGEIF(E305:E316,\">0\")/100","v":99.422651096569922},{"$f":"D299*(100-AVERAGEIF(E305:E316,\">0\"))/100","v":0},{"$f":"100-(E299+F299+H299)","v":0.57734890343007805},{"$f":"IF((D301+H301)>100,H301*100/(D301+H301),H301)","v":0},{"$f":"IF((I301+M301)>100,I301*100/(I301+M301),I301)","v":98.582429040163746},{"$f":"I299*AVERAGEIF(J305:J316,\">0\")/100","v":98.582429040163746},{"$f":"I299*(100-AVERAGEIF(J305:J316,\">0\"))/100","v":0},{"$f":"100-(J299+K299+M299)","v":1.4175709598362545},{"$f":"IF((I301+M301)>100,M301*100/(I301+M301),M301)","v":0},{"$f":"IF((N301+R301)>100,N301*100/(N301+R301),N301)","v":98.403235234758185},{"$f":"N299*AVERAGEIF(O305:O316,\">0\")/100","v":98.403235234758171},{"$f":"N299*(100-AVERAGEIF(O305:O316,\">0\"))/100","v":0},{"$f":"100-(O299+P299+R299)","v":1.5967647652418293},{"$f":"IF((N301+R301)>100,R301*100/(N301+R301),R301)","v":0},{"$f":"IF((S301+W301)>100,S301*100/(S301+W301),S301)","v":99.128999331447602},{"$f":"S299*AVERAGEIF(T305:T316,\">0\")/100","v":99.128999331447588},{"$f":"S299*(100-AVERAGEIF(T305:T316,\">0\"))/100","v":0},{"$f":"100-(T299+U299+W299)","v":0.87100066855241209},{"$f":"IF((S301+W301)>100,W301*100/(S301+W301),W301)","v":0},{"$f":"IF((X301+AB301)>100,X301*100/(X301+AB301),X301)","v":99.36652626577343},{"$f":"X299*AVERAGEIF(Y305:Y316,\">0\")/100","v":99.36652626577343},{"$f":"X299*(100-AVERAGEIF(Y305:Y316,\">0\"))/100","v":0},{"$f":"100-(Y299+Z299+AB299)","v":0.63347373422656972},{"$f":"IF((X301+AB301)>100,AB301*100/(X301+AB301),AB301)","v":0}]
[null,null,2020,{"$f":"IF((D302+H302)>100,D302*100/(D302+H302),D302)","v":99.422651096569922},{"$f":"D300*AVERAGEIF(E305:E316,\">0\")/100","v":99.422651096569922},{"$f":"D300*(100-AVERAGEIF(E305:E316,\">0\"))/100","v":0},{"$f":"100-(E300+F300+H300)","v":0.57734890343007805},{"$f":"IF((D302+H302)>100,H302*100/(D302+H302),H302)","v":0},{"$f":"IF((I302+M302)>100,I302*100/(I302+M302),I302)","v":98.582429040163746},{"$f":"I300*AVERAGEIF(J305:J316,\">0\")/100","v":98.582429040163746},{"$f":"I300*(100-AVERAGEIF(J305:J316,\">0\"))/100","v":0},{"$f":"100-(J300+K300+M300)","v":1.4175709598362545},{"$f":"IF((I302+M302)>100,M302*100/(I302+M302),M302)","v":0},{"$f":"IF((N302+R302)>100,N302*100/(N302+R302),N302)","v":98.403235234758185},{"$f":"N300*AVERAGEIF(O305:O316,\">0\")/100","v":98.403235234758171},{"$f":"N300*(100-AVERAGEIF(O305:O316,\">0\"))/100","v":0},{"$f":"100-(O300+P300+R300)","v":1.5967647652418293},{"$f":"IF((N302+R302)>100,R302*100/(N302+R302),R302)","v":0},{"$f":"IF((S302+W302)>100,S302*100/(S302+W302),S302)","v":99.128999331447602},{"$f":"S300*AVERAGEIF(T305:T316,\">0\")/100","v":99.128999331447588},{"$f":"S300*(100-AVERAGEIF(T305:T316,\">0\"))/100","v":0},{"$f":"100-(T300+U300+W300)","v":0.87100066855241209},{"$f":"IF((S302+W302)>100,W302*100/(S302+W302),W302)","v":0},{"$f":"IF((X302+AB302)>100,X302*100/(X302+AB302),X302)","v":99.36652626577343},{"$f":"X300*AVERAGEIF(Y305:Y316,\">0\")/100","v":99.36652626577343},{"$f":"X300*(100-AVERAGEIF(Y305:Y316,\">0\"))/100","v":0},{"$f":"100-(Y300+Z300+AB300)","v":0.63347373422656972},{"$f":"IF((X302+AB302)>100,AB302*100/(X302+AB302),AB302)","v":0}]
["Regression period:",null,{"$f":"MinRegYear(C299,C305:C316)","v":2017},{"$f":"IF(MAX(C305:C316)-MIN(C305:C316)<5,AVERAGEIF(C305:C316,\">0\",D305:D316),\nIF(FORECAST($C301,D$305:D$316,$C$305:$C$316)<0,0,\nIF(FORECAST($C301,D$305:D$316,$C$305:$C$316)>100,100,\nFORECAST($C301,D$305:D$316,$C$305:$C$316))))","v":99.422651096569922},null,null,null,{"$f":"IF(MAX(C305:C316)-MIN(C305:C316)<5,AVERAGEIF(C305:C316,\">0\",H305:H316),\nIF(FORECAST($C301,H$305:H$316,$C$305:$C$316)<0,0,\nIF(FORECAST($C301,H$305:H$316,$C$305:$C$316)>100,100,\nFORECAST($C301,H$305:H$316,$C$305:$C$316))))","v":0},{"$f":"IF(MAX(C305:C316)-MIN(C305:C316)<5,AVERAGEIF(C305:C316,\">0\",I305:I316),\nIF(FORECAST($C301,I$305:I$316,$C$305:$C$316)<0,0,\nIF(FORECAST($C301,I$305:I$316,$C$305:$C$316)>100,100,\nFORECAST($C301,I$305:I$316,$C$305:$C$316))))","v":98.582429040163746},null,null,null,{"$f":"IF(MAX(C305:C316)-MIN(C305:C316)<5,AVERAGEIF(C305:C316,\">0\",M305:M316),\nIF(FORECAST($C301,M$305:M$316,$C$305:$C$316)<0,0,\nIF(FORECAST($C301,M$305:M$316,$C$305:$C$316)>100,100,\nFORECAST($C301,M$305:M$316,$C$305:$C$316))))","v":0},{"$f":"IF(MAX(C305:C316)-MIN(C305:C316)<5,AVERAGEIF(C305:C316,\">0\",N305:N316),\nIF(FORECAST($C301,N$305:N$316,$C$305:$C$316)<0,0,\nIF(FORECAST($C301,N$305:N$316,$C$305:$C$316)>100,100,\nFORECAST($C301,N$305:N$316,$C$305:$C$316))))","v":98.403235234758185},null,null,null,{"$f":"IF(MAX(C305:C316)-MIN(C305:C316)<5,AVERAGEIF(C305:C316,\">0\",R305:R316),\nIF(FORECAST($C301,R$305:R$316,$C$305:$C$316)<0,0,\nIF(FORECAST($C301,R$305:R$316,$C$305:$C$316)>100,100,\nFORECAST($C301,R$305:R$316,$C$305:$C$316))))","v":0},{"$f":"IF(MAX(C305:C316)-MIN(C305:C316)<5,AVERAGEIF(C305:C316,\">0\",S305:S316),\nIF(FORECAST($C301,S$305:S$316,$C$305:$C$316)<0,0,\nIF(FORECAST($C301,S$305:S$316,$C$305:$C$316)>100,100,\nFORECAST($C301,S$305:S$316,$C$305:$C$316))))","v":99.128999331447602},null,null,null,{"$f":"IF(MAX(C305:C316)-MIN(C305:C316)<5,AVERAGEIF(C305:C316,\">0\",W305:W316),\nIF(FORECAST($C301,W$305:W$316,$C$305:$C$316)<0,0,\nIF(FORECAST($C301,W$305:W$316,$C$305:$C$316)>100,100,\nFORECAST($C301,W$305:W$316,$C$305:$C$316))))","v":0},{"$f":"IF(MAX(C305:C316)-MIN(C305:C316)<5,AVERAGEIF(C305:C316,\">0\",X305:X316),\nIF(FORECAST($C301,X$305:X$316,$C$305:$C$316)<0,0,\nIF(FORECAST($C301,X$305:X$316,$C$305:$C$316)>100,100,\nFORECAST($C301,X$305:X$316,$C$305:$C$316))))","v":99.36652626577343},null,null,null,{"$f":"IF(MAX(C305:C316)-MIN(C305:C316)<5,AVERAGEIF(C305:C316,\">0\",AB305:AB316),\nIF(FORECAST($C301,AB$305:AB$316,$C$305:$C$316)<0,0,\nIF(FORECAST($C301,AB$305:AB$316,$C$305:$C$316)>100,100,\nFORECAST($C301,AB$305:AB$316,$C$305:$C$316))))","v":0}]
[null,null,{"$f":"MaxRegYear(C300,C305:C316)","v":2020},{"$f":"IF(MAX(C305:C316)-MIN(C305:C316)<5,AVERAGEIF(C305:C316,\">0\",D305:D316),\nIF(FORECAST($C302,D$305:D$316,$C$305:$C$316)<0,0,\nIF(FORECAST($C302,D$305:D$316,$C$305:$C$316)>100,100,\nFORECAST($C302,D$305:D$316,$C$305:$C$316))))","v":99.422651096569922},null,null,null,{"$f":"IF(MAX(C305:C316)-MIN(C305:C316)<5,AVERAGEIF(C305:C316,\">0\",H305:H316),\nIF(FORECAST($C302,H$305:H$316,$C$305:$C$316)<0,0,\nIF(FORECAST($C302,H$305:H$316,$C$305:$C$316)>100,100,\nFORECAST($C302,H$305:H$316,$C$305:$C$316))))","v":0},{"$f":"IF(MAX(C305:C316)-MIN(C305:C316)<5,AVERAGEIF(C305:C316,\">0\",I305:I316),\nIF(FORECAST($C302,I$305:I$316,$C$305:$C$316)<0,0,\nIF(FORECAST($C302,I$305:I$316,$C$305:$C$316)>100,100,\nFORECAST($C302,I$305:I$316,$C$305:$C$316))))","v":98.582429040163746},null,null,null,{"$f":"IF(MAX(C305:C316)-MIN(C305:C316)<5,AVERAGEIF(C305:C316,\">0\",M305:M316),\nIF(FORECAST($C302,M$305:M$316,$C$305:$C$316)<0,0,\nIF(FORECAST($C302,M$305:M$316,$C$305:$C$316)>100,100,\nFORECAST($C302,M$305:M$316,$C$305:$C$316))))","v":0},{"$f":"IF(MAX(C305:C316)-MIN(C305:C316)<5,AVERAGEIF(C305:C316,\">0\",N305:N316),\nIF(FORECAST($C302,N$305:N$316,$C$305:$C$316)<0,0,\nIF(FORECAST($C302,N$305:N$316,$C$305:$C$316)>100,100,\nFORECAST($C302,N$305:N$316,$C$305:$C$316))))","v":98.403235234758185},null,null,null,{"$f":"IF(MAX(C305:C316)-MIN(C305:C316)<5,AVERAGEIF(C305:C316,\">0\",R305:R316),\nIF(FORECAST($C302,R$305:R$316,$C$305:$C$316)<0,0,\nIF(FORECAST($C302,R$305:R$316,$C$305:$C$316)>100,100,\nFORECAST($C302,R$305:R$316,$C$305:$C$316))))","v":0},{"$f":"IF(MAX(C305:C316)-MIN(C305:C316)<5,AVERAGEIF(C305:C316,\">0\",S305:S316),\nIF(FORECAST($C302,S$305:S$316,$C$305:$C$316)<0,0,\nIF(FORECAST($C302,S$305:S$316,$C$305:$C$316)>100,100,\nFORECAST($C302,S$305:S$316,$C$305:$C$316))))","v":99.128999331447602},null,null,null,{"$f":"IF(MAX(C305:C316)-MIN(C305:C316)<5,AVERAGEIF(C305:C316,\">0\",W305:W316),\nIF(FORECAST($C302,W$305:W$316,$C$305:$C$316)<0,0,\nIF(FORECAST($C302,W$305:W$316,$C$305:$C$316)>100,100,\nFORECAST($C302,W$305:W$316,$C$305:$C$316))))","v":0},{"$f":"IF(MAX(C305:C316)-MIN(C305:C316)<5,AVERAGEIF(C305:C316,\">0\",X305:X316),\nIF(FORECAST($C302,X$305:X$316,$C$305:$C$316)<0,0,\nIF(FORECAST($C302,X$305:X$316,$C$305:$C$316)>100,100,\nFORECAST($C302,X$305:X$316,$C$305:$C$316))))","v":99.36652626577343},null,null,null,{"$f":"IF(MAX(C305:C316)-MIN(C305:C316)<5,AVERAGEIF(C305:C316,\">0\",AB305:AB316),\nIF(FORECAST($C302,AB$305:AB$316,$C$305:$C$316)<0,0,\nIF(FORECAST($C302,AB$305:AB$316,$C$305:$C$316)>100,100,\nFORECAST($C302,AB$305:AB$316,$C$305:$C$316))))","v":0}]
[]
[null,"Survey","Year","Improved","% Improved\n< = 30min",null,null,"Surface water","Improved","% Improved\n< = 30min",null,null,"Surface water","Improved","% Improved\n< = 30min",null,null,"Surface water","Improved","% Improved\n< = 30min",null,null,"Surface water","Improved","% Improved\n< = 30min",null,null,"Surface water"]
[null,"MICS19",2019,{"$f":"IF(ISERROR(INDIRECT(CONCATENATE($B305,\"!M16\"))),\"\",INDIRECT(CONCATENATE($B305,\"!M16\")))","v":99.422651096569922},{"$f":"IF(ISERROR(INDIRECT(CONCATENATE($B305,\"!M23\"))),\"\",INDIRECT(CONCATENATE($B305,\"!M23\")))","v":100},null,null,{"$f":"IF(ISERROR(INDIRECT(CONCATENATE($B305,\"!M21\"))),\"\",INDIRECT(CONCATENATE($B305,\"!M21\")))","v":0},{"$f":"IF(ISERROR(INDIRECT(CONCATENATE($B305,\"!N16\"))),\"\",INDIRECT(CONCATENATE($B305,\"!N16\")))","v":98.582429040163746},{"$f":"IF(ISERROR(INDIRECT(CONCATENATE($B305,\"!N23\"))),\"\",INDIRECT(CONCATENATE($B305,\"!N23\")))","v":100},null,null,{"$f":"IF(ISERROR(INDIRECT(CONCATENATE($B305,\"!N21\"))),\"\",INDIRECT(CONCATENATE($B305,\"!N21\")))","v":0},{"$f":"IF(ISERROR(INDIRECT(CONCATENATE($B305,\"!O16\"))),\"\",INDIRECT(CONCATENATE($B305,\"!O16\")))","v":98.403235234758185},{"$f":"IF(ISERROR(INDIRECT(CONCATENATE($B305,\"!O23\"))),\"\",INDIRECT(CONCATENATE($B305,\"!O23\")))","v":100},null,null,{"$f":"IF(ISERROR(INDIRECT(CONCATENATE($B305,\"!O21\"))),\"\",INDIRECT(CONCATENATE($B305,\"!O21\")))","v":0},{"$f":"IF(ISERROR(INDIRECT(CONCATENATE($B305,\"!P16\"))),\"\",INDIRECT(CONCATENATE($B305,\"!P16\")))","v":99.128999331447602},{"$f":"IF(ISERROR(INDIRECT(CONCATENATE($B305,\"!P23\"))),\"\",INDIRECT(CONCATENATE($B305,\"!P23\")))","v":100},null,null,{"$f":"IF(ISERROR(INDIRECT(CONCATENATE($B305,\"!P21\"))),\"\",INDIRECT(CONCATENATE($B305,\"!P21\")))","v":0},{"$f":"IF(ISERROR(INDIRECT(CONCATENATE($B305,\"!Q16\"))),\"\",INDIRECT(CONCATENATE($B305,\"!Q16\")))","v":99.36652626577343},{"$f":"IF(ISERROR(INDIRECT(CONCATENATE($B305,\"!Q23\"))),\"\",INDIRECT(CONCATENATE($B305,\"!Q23\")))","v":100},null,null,{"$f":"IF(ISERROR(INDIRECT(CONCATENATE($B305,\"!Q221\"))),\"\",INDIRECT(CONCATENATE($B305,\"!Q21\")))","v":0}]
[null,null,null,"","",null,null,"","","",null,null,"","","",null,null,"","","",null,null,"","","",null,null,""]
[null,null,null,"","",null,null,"","","",null,null,"","","",null,null,"","","",null,null,"","","",null,null,""]
[null,null,null,"","",null,null,"","","",null,null,"","","",null,null,"","","",null,null,"","","",null,null,""]
[null,null,null,"","",null,null,"","","",null,null,"","","",null,null,"","","",null,null,"","","",null,null,""]
[null,null,null,"","",null,null,"","","",null,null,"","","",null,null,"","","",null,null,"","","",null,null,""]
[null,null,null,"","",null,null,"","","",null,null,"","","",null,null,"","","",null,null,"","","",null,null,""]
[null,null,null,"","",null,null,"","","",null,null,"","","",null,null,"","","",null,null,"","","",null,null,""]
[null,null,null,"","",null,null,"","","",null,null,"","","",null,null,"","","",null,null,"","","",null,null,""]
[null,null,null,"","",null,null,"","","",null,null,"","","",null,null,"","","",null,null,"","","",null,null,""]
[null,null,null,"","",null,null,"","","",null,null,"","","",null,null,"","","",null,null,"","","",null,null,""]
[null,null,null,"","",null,null,"","","",null,null,"","","",null,null,"","","",null,null,"","","",null,null,""]
[]
[null,{"$f":"CONCATENATE(\"Rural use of drinking water sources, \",C299,\"–\",C300)","v":"Rural use of drinking water sources, 2015–2020"},null,null,null,null,null,null,null,null,null,null,null,null,null,null,null,null,"Data points used for regression"]

{"sheet":"Sanitation","index":2,"n_rows":318,"n_cols":28,"rows_kept":318,"cut":false,"hidden":false,"merged":[[30,21,30,24],[4,1,4,24],[3,1,3,24],[6,1,6,8],[6,9,6,16],[6,17,6,24],[30,1,31,4],[30,5,30,8],[30,9,30,12],[30,13,30,16],[30,17,30,20],[96,23,96,27],[32,1,33,2],[32,3,33,3],[35,1,36,2],[35,3,36,3],[38,1,39,2],[38,3,39,3],[96,0,97,2],[96,3,96,7],[96,8,96,12],[96,13,96,17],[96,18,96,22],[98,0,99,1],[100,0,101,1],[117,18,117,22],[196,0,197,2],[196,3,196,7],[196,8,196,12],[196,13,196,17],[196,18,196,22],[117,1,117,11],[298,0,299,1],[300,0,301,1],[317,18,317,22],[196,23,196,27],[198,0,199,1],[200,0,201,1],[217,18,217,22],[296,0,297,2],[296,3,296,7],[296,8,296,12],[296,13,296,17],[296,18,296,22],[296,23,296,27],[217,1,217,11],[317,1,317,11]]}
[]
[]
[]
[null,"Summary of trends in use of sanitation facilities by wealth quintile (%)"]
[null,{"$f":"IF(ISERROR(INDIRECT(CONCATENATE($B105,\"!A2\"))),\"\",INDIRECT(CONCATENATE($B105,\"!A2\")))","v":"Tonga"}]
[]
[null,{"$f":"B118","v":"National use of sanitation facilities, 2015–2020"},null,null,null,null,null,null,null,{"$f":"B218","v":"Urban use of sanitation facilities, 2015–2020"},null,null,null,null,null,null,null,{"$f":"B318","v":"Rural use of sanitation facilities, 2015–2020"}]
[]
[]
[]
[]
[]
[]
[]
[]
[]
[]
[]
[]
[]
[]
[]
[]
[]
[]
[]
[]
[]
[]
[]
[null,{"$f":"IF(ISERROR(INDIRECT(CONCATENATE($B105,\"!A2\"))),\"\",INDIRECT(CONCATENATE($B105,\"!A2\")))","v":"Tonga"},null,null,null,"Poorest",null,null,null,"Poor",null,null,null,"Middle",null,null,null,"Rich",null,null,null,"Richest"]
[null,null,null,null,null,"Basic","Limited","Unimproved","Open defecation","Basic","Limited","Unimproved","Open defecation","Basic","Limited","Unimproved","Open defecation","Basic","Limited","Unimproved","Open defecation","Basic","Limited","Unimproved","Open defecation"]
[null,"NATIONAL",null,"Estimate",{"$f":"C99","v":2015},{"$f":"E99","v":82.39002736591668},{"$f":"F99","v":9.8947205090490122},7.6125331742628362,0.10271895077147875,{"$f":"J99","v":87.483592588060205},{"$f":"K99","v":9.7542882974507226},2.6350113918967679,0.12710772259229994,{"$f":"O99","v":93.414700568922797},{"$f":"P99","v":5.7831380193289696},0.80216141174823008,0,{"$f":"T99","v":97.811113267055021},{"$f":"U99","v":2.1888867329449795},0,0,{"$f":"Y99","v":97.670083910829291},{"$f":"Z99","v":2.3299160891707089},0,0]
[null,null,null,null,{"$f":"C100","v":2020},{"$f":"E100","v":82.39002736591668},9.8947205090490122,7.6125331742628362,0.10271895077147875,{"$f":"J100","v":87.483592588060205},9.7542882974507226,2.6350113918967679,0.12710772259229994,{"$f":"O100","v":93.414700568922797},5.7831380193289696,0.80216141174823008,0,{"$f":"T100","v":97.811113267055021},2.1888867329449795,0,0,{"$f":"Y100","v":97.670083910829291},2.3299160891707089,0,0]
[]
[null,"URBAN",null,"Estimate",{"$f":"C199","v":2015},{"$f":"E199","v":85.775681372599976},{"$f":"F199","v":11.589691899267331},2.0844723240065122,0.55015440412617622,{"$f":"J199","v":97.367114729962594},{"$f":"K199","v":2.6328852700374057},0,0,{"$f":"O199","v":99.010240242212106},{"$f":"P199","v":0.98975975778789405},0,0,{"$f":"T199","v":98.274273906646528},{"$f":"U199","v":1.7257260933534724},0,0,{"$f":"Y199","v":97.79402400505343},{"$f":"Z199","v":2.20597599494657},0,0]
[null,null,null,null,{"$f":"C200","v":2020},{"$f":"E200","v":85.775681372599976},11.589691899267331,2.0844723240065122,0.55015440412617622,{"$f":"J200","v":97.367114729962594},2.6328852700374057,0,0,{"$f":"O200","v":99.010240242212106},0.98975975778789405,0,0,{"$f":"T200","v":98.274273906646528},1.7257260933534724,0,0,{"$f":"Y200","v":97.79402400505343},2.20597599494657,0,0]
[]
[null,"RURAL",null,"Estimate",{"$f":"C299","v":2015},{"$f":"E299","v":80.653276008422765},{"$f":"F299","v":10.67114382940763},8.5424953180744154,0.13308484409519811,{"$f":"J299","v":87.1237902051585},{"$f":"K299","v":9.2225426587402506},3.653667136101248,0,{"$f":"O299","v":90.865916712807902},{"$f":"P299","v":7.6865358569416422},1.4475474302504523,0,{"$f":"T299","v":96.685746151918906},{"$f":"U299","v":3.2405801917242201},7.3673656356874062E-2,0,{"$f":"Y299","v":97.64216459585316},{"$f":"Z299","v":2.3578354041468401},0,0]
[null,null,null,null,{"$f":"C300","v":2020},{"$f":"E300","v":80.653276008422765},10.67114382940763,8.5424953180744154,0.13308484409519811,{"$f":"J300","v":87.1237902051585},9.2225426587402506,3.653667136101248,0,{"$f":"O300","v":90.865916712807902},7.6865358569416422,1.4475474302504523,0,{"$f":"T300","v":96.685746151918906},3.2405801917242201,7.3673656356874062E-2,0,{"$f":"Y300","v":97.64216459585316},2.3578354041468401,0,0]
[]
[]
[]
[]
[]
[]
[]
[]
[]
[]
[]
[]
[]
[]
[]
[]
[]
[]
[]
[]
[]
[]
[]
[]
[]
[]
[]
[]
[]
[]
[]
[]
[]
[]
[]
[]
[]
[]
[]
[]
[]
[]
[]
[]
[]
[]
[]
[]
[]
[]
[]
[]
[]
[]
[]
[]
["NATIONAL",null,null,"Poorest",null,null,null,null,"Poor",null,null,null,null,"Middle",null,null,null,null,"Rich",null,null,null,null,"Richest"]
[null,null,null,"Improved","Basic","Limited","Unimproved","Open defecation","Improved","Basic","Limited","Unimproved","Open defecation","Improved","Basic","Limited","Unimproved","Open defecation","Improved","Basic","Limited","Unimproved","Open defecation","Improved","Basic","Limited","Unimproved","Open defecation"]
["Forecast period:",null,2015,{"$f":"IF((D101+H101)>100,D101*100/(D101+H101),D101)","v":92.284747874965703},{"$f":"D99*AVERAGEIF(E105:E116,\">0\")/100","v":82.39002736591668},{"$f":"D99*(100-AVERAGEIF(E105:E116,\">0\"))/100","v":9.8947205090490122},{"$f":"100-(E99+F99+H99)","v":7.6125331742628362},{"$f":"IF((D101+H101)>100,H101*100/(D101+H101),H101)","v":0.10271895077147875},{"$f":"IF((I101+M101)>100,I101*100/(I101+M101),I101)","v":97.237880885510918},{"$f":"I99*AVERAGEIF(J105:J116,\">0\")/100","v":87.483592588060205},{"$f":"I99*(100-AVERAGEIF(J105:J116,\">0\"))/100","v":9.7542882974507226},{"$f":"100-(J99+K99+M99)","v":2.6350113918967679},{"$f":"IF((I101+M101)>100,M101*100/(I101+M101),M101)","v":0.12710772259229994},{"$f":"IF((N101+R101)>100,N101*100/(N101+R101),N101)","v":99.19783858825177},{"$f":"N99*AVERAGEIF(O105:O116,\">0\")/100","v":93.414700568922797},{"$f":"N99*(100-AVERAGEIF(O105:O116,\">0\"))/100","v":5.7831380193289696},{"$f":"100-(O99+P99+R99)","v":0.80216141174823008},{"$f":"IF((N101+R101)>100,R101*100/(N101+R101),R101)","v":0},{"$f":"IF((S101+W101)>100,S101*100/(S101+W101),S101)","v":100},{"$f":"S99*AVERAGEIF(T105:T116,\">0\")/100","v":97.811113267055021},{"$f":"S99*(100-AVERAGEIF(T105:T116,\">0\"))/100","v":2.1888867329449795},{"$f":"100-(T99+U99+W99)","v":0},{"$f":"IF((S101+W101)>100,W101*100/(S101+W101),W101)","v":0},{"$f":"IF((X101+AB101)>100,X101*100/(X101+AB101),X101)","v":100},{"$f":"X99*AVERAGEIF(Y105:Y116,\">0\")/100","v":97.670083910829291},{"$f":"X99*(100-AVERAGEIF(Y105:Y116,\">0\"))/100","v":2.3299160891707089},{"$f":"100-(Y99+Z99+AB99)","v":0},{"$f":"IF((X101+AB101)>100,AB101*100/(X101+AB101),AB101)","v":0}]
[null,null,2020,{"$f":"IF((D102+H102)>100,D102*100/(D102+H102),D102)","v":92.284747874965703},{"$f":"D100*AVERAGEIF(E105:E116,\">0\")/100","v":82.39002736591668},{"$f":"D100*(100-AVERAGEIF(E105:E116,\">0\"))/100","v":9.8947205090490122},{"$f":"100-(E100+F100+H100)","v":7.6125331742628362},{"$f":"IF((D102+H102)>100,H102*100/(D102+H102),H102)","v":0.10271895077147875},{"$f":"IF((I102+M102)>100,I102*100/(I102+M102),I102)","v":97.237880885510918},{"$f":"I100*AVERAGEIF(J105:J116,\">0\")/100","v":87.483592588060205},{"$f":"I100*(100-AVERAGEIF(J105:J116,\">0\"))/100","v":9.7542882974507226},{"$f":"100-(J100+K100+M100)","v":2.6350113918967679},{"$f":"IF((I102+M102)>100,M102*100/(I102+M102),M102)","v":0.12710772259229994},{"$f":"IF((N102+R102)>100,N102*100/(N102+R102),N102)","v":99.19783858825177},{"$f":"N100*AVERAGEIF(O105:O116,\">0\")/100","v":93.414700568922797},{"$f":"N100*(100-AVERAGEIF(O105:O116,\">0\"))/100","v":5.7831380193289696},{"$f":"100-(O100+P100+R100)","v":0.80216141174823008},{"$f":"IF((N102+R102)>100,R102*100/(N102+R102),R102)","v":0},{"$f":"IF((S102+W102)>100,S102*100/(S102+W102),S102)","v":100},{"$f":"S100*AVERAGEIF(T105:T116,\">0\")/100","v":97.811113267055021},{"$f":"S100*(100-AVERAGEIF(T105:T116,\">0\"))/100","v":2.1888867329449795},{"$f":"100-(T100+U100+W100)","v":0},{"$f":"IF((S102+W102)>100,W102*100/(S102+W102),W102)","v":0},{"$f":"IF((X102+AB102)>100,X102*100/(X102+AB102),X102)","v":100},{"$f":"X100*AVERAGEIF(Y105:Y116,\">0\")/100","v":97.670083910829291},{"$f":"X100*(100-AVERAGEIF(Y105:Y116,\">0\"))/100","v":2.3299160891707089},{"$f":"100-(Y100+Z100+AB100)","v":0},{"$f":"IF((X102+AB102)>100,AB102*100/(X102+AB102),AB102)","v":0}]
["Regression period:",null,{"$f":"MinRegYear(C99,C105:C116)","v":2017},{"$f":"IF(MAX(C105:C116)-MIN(C105:C116)<5,AVERAGEIF(C105:C116,\">0\",D105:D116),\nIF(FORECAST($C101,D$105:D$116,$C$105:$C$116)<0,0,\nIF(FORECAST($C101,D$105:D$116,$C$105:$C$116)>100,100,\nFORECAST($C101,D$105:D$116,$C$105:$C$116))))","v":92.284747874965703},null,null,null,{"$f":"IF(MAX(C105:C116)-MIN(C105:C116)<5,AVERAGEIF(C105:C116,\">0\",H105:H116),\nIF(FORECAST($C101,H$105:H$116,$C$105:$C$116)<0,0,\nIF(FORECAST($C101,H$105:H$116,$C$105:$C$116)>100,100,\nFORECAST($C101,H$105:H$116,$C$105:$C$116))))","v":0.10271895077147875},{"$f":"IF(MAX(C105:C116)-MIN(C105:C116)<5,AVERAGEIF(C105:C116,\">0\",I105:I116),\nIF(FORECAST($C101,I$105:I$116,$C$105:$C$116)<0,0,\nIF(FORECAST($C101,I$105:I$116,$C$105:$C$116)>100,100,\nFORECAST($C101,I$105:I$116,$C$105:$C$116))))","v":97.237880885510918},null,null,null,{"$f":"IF(MAX(C105:C116)-MIN(C105:C116)<5,AVERAGEIF(C105:C116,\">0\",M105:M116),\nIF(FORECAST($C101,M$105:M$116,$C$105:$C$116)<0,0,\nIF(FORECAST($C101,M$105:M$116,$C$105:$C$116)>100,100,\nFORECAST($C101,M$105:M$116,$C$105:$C$116))))","v":0.12710772259229994},{"$f":"IF(MAX(C105:C116)-MIN(C105:C116)<5,AVERAGEIF(C105:C116,\">0\",N105:N116),\nIF(FORECAST($C101,N$105:N$116,$C$105:$C$116)<0,0,\nIF(FORECAST($C101,N$105:N$116,$C$105:$C$116)>100,100,\nFORECAST($C101,N$105:N$116,$C$105:$C$116))))","v":99.19783858825177},null,null,null,{"$f":"IF(MAX(C105:C116)-MIN(C105:C116)<5,AVERAGEIF(C105:C116,\">0\",R105:R116),\nIF(FORECAST($C101,R$105:R$116,$C$105:$C$116)<0,0,\nIF(FORECAST($C101,R$105:R$116,$C$105:$C$116)>100,100,\nFORECAST($C101,R$105:R$116,$C$105:$C$116))))","v":0},{"$f":"IF(MAX(C105:C116)-MIN(C105:C116)<5,AVERAGEIF(C105:C116,\">0\",S105:S116),\nIF(FORECAST($C101,S$105:S$116,$C$105:$C$116)<0,0,\nIF(FORECAST($C101,S$105:S$116,$C$105:$C$116)>100,100,\nFORECAST($C101,S$105:S$116,$C$105:$C$116))))","v":100},null,null,null,{"$f":"IF(MAX(C105:C116)-MIN(C105:C116)<5,AVERAGEIF(C105:C116,\">0\",W105:W116),\nIF(FORECAST($C101,W$105:W$116,$C$105:$C$116)<0,0,\nIF(FORECAST($C101,W$105:W$116,$C$105:$C$116)>100,100,\nFORECAST($C101,W$105:W$116,$C$105:$C$116))))","v":0},{"$f":"IF(MAX(C105:C116)-MIN(C105:C116)<5,AVERAGEIF(C105:C116,\">0\",X105:X116),\nIF(FORECAST($C101,X$105:X$116,$C$105:$C$116)<0,0,\nIF(FORECAST($C101,X$105:X$116,$C$105:$C$116)>100,100,\nFORECAST($C101,X$105:X$116,$C$105:$C$116))))","v":100},null,null,null,{"$f":"IF(MAX(C105:C116)-MIN(C105:C116)<5,AVERAGEIF(C105:C116,\">0\",AB105:AB116),\nIF(FORECAST($C101,AB$105:AB$116,$C$105:$C$116)<0,0,\nIF(FORECAST($C101,AB$105:AB$116,$C$105:$C$116)>100,100,\nFORECAST($C101,AB$105:AB$116,$C$105:$C$116))))","v":0}]
[null,null,{"$f":"MaxRegYear(C100,C105:C116)","v":2020},{"$f":"IF(MAX(C105:C116)-MIN(C105:C116)<5,AVERAGEIF(C105:C116,\">0\",D105:D116),\nIF(FORECAST($C102,D$105:D$116,$C$105:$C$116)<0,0,\nIF(FORECAST($C102,D$105:D$116,$C$105:$C$116)>100,100,\nFORECAST($C102,D$105:D$116,$C$105:$C$116))))","v":92.284747874965703},null,null,null,{"$f":"IF(MAX(C105:C116)-MIN(C105:C116)<5,AVERAGEIF(C105:C116,\">0\",H105:H116),\nIF(FORECAST($C102,H$105:H$116,$C$105:$C$116)<0,0,\nIF(FORECAST($C102,H$105:H$116,$C$105:$C$116)>100,100,\nFORECAST($C102,H$105:H$116,$C$105:$C$116))))","v":0.10271895077147875},{"$f":"IF(MAX(C105:C116)-MIN(C105:C116)<5,AVERAGEIF(C105:C116,\">0\",I105:I116),\nIF(FORECAST($C102,I$105:I$116,$C$105:$C$116)<0,0,\nIF(FORECAST($C102,I$105:I$116,$C$105:$C$116)>100,100,\nFORECAST($C102,I$105:I$116,$C$105:$C$116))))","v":97.237880885510918},null,null,null,{"$f":"IF(MAX(C105:C116)-MIN(C105:C116)<5,AVERAGEIF(C105:C116,\">0\",M105:M116),\nIF(FORECAST($C102,M$105:M$116,$C$105:$C$116)<0,0,\nIF(FORECAST($C102,M$105:M$116,$C$105:$C$116)>100,100,\nFORECAST($C102,M$105:M$116,$C$105:$C$116))))","v":0.12710772259229994},{"$f":"IF(MAX(C105:C116)-MIN(C105:C116)<5,AVERAGEIF(C105:C116,\">0\",N105:N116),\nIF(FORECAST($C102,N$105:N$116,$C$105:$C$116)<0,0,\nIF(FORECAST($C102,N$105:N$116,$C$105:$C$116)>100,100,\nFORECAST($C102,N$105:N$116,$C$105:$C$116))))","v":99.19783858825177},null,null,null,{"$f":"IF(MAX(C105:C116)-MIN(C105:C116)<5,AVERAGEIF(C105:C116,\">0\",R105:R116),\nIF(FORECAST($C102,R$105:R$116,$C$105:$C$116)<0,0,\nIF(FORECAST($C102,R$105:R$116,$C$105:$C$116)>100,100,\nFORECAST($C102,R$105:R$116,$C$105:$C$116))))","v":0},{"$f":"IF(MAX(C105:C116)-MIN(C105:C116)<5,AVERAGEIF(C105:C116,\">0\",S105:S116),\nIF(FORECAST($C102,S$105:S$116,$C$105:$C$116)<0,0,\nIF(FORECAST($C102,S$105:S$116,$C$105:$C$116)>100,100,\nFORECAST($C102,S$105:S$116,$C$105:$C$116))))","v":100},null,null,null,{"$f":"IF(MAX(C105:C116)-MIN(C105:C116)<5,AVERAGEIF(C105:C116,\">0\",W105:W116),\nIF(FORECAST($C102,W$105:W$116,$C$105:$C$116)<0,0,\nIF(FORECAST($C102,W$105:W$116,$C$105:$C$116)>100,100,\nFORECAST($C102,W$105:W$116,$C$105:$C$116))))","v":0},{"$f":"IF(MAX(C105:C116)-MIN(C105:C116)<5,AVERAGEIF(C105:C116,\">0\",X105:X116),\nIF(FORECAST($C102,X$105:X$116,$C$105:$C$116)<0,0,\nIF(FORECAST($C102,X$105:X$116,$C$105:$C$116)>100,100,\nFORECAST($C102,X$105:X$116,$C$105:$C$116))))","v":100},null,null,null,{"$f":"IF(MAX(C105:C116)-MIN(C105:C116)<5,AVERAGEIF(C105:C116,\">0\",AB105:AB116),\nIF(FORECAST($C102,AB$105:AB$116,$C$105:$C$116)<0,0,\nIF(FORECAST($C102,AB$105:AB$116,$C$105:$C$116)>100,100,\nFORECAST($C102,AB$105:AB$116,$C$105:$C$116))))","v":0}]
[]
[null,"Survey","Year","Improved","Not shared",null,null,"Open defecation","Improved","Not shared",null,null,"Open defecation","Improved","Not shared",null,null,"Open defecation","Improved","Not shared",null,null,"Open defecation","Improved","Not shared",null,null,"Open defecation"]
[null,"MICS19",2019,{"$f":"IF(ISERROR(INDIRECT(CONCATENATE($B105,\"!C122\"))),\"\",INDIRECT(CONCATENATE($B105,\"!C122\")))","v":92.284747874965703},{"$f":"IF(ISERROR(INDIRECT(CONCATENATE($B105,\"!C129\"))),\"\",INDIRECT(CONCATENATE($B105,\"!C129\")))","v":89.278054351456731},null,null,{"$f":"IF(ISERROR(INDIRECT(CONCATENATE($B105,\"!C127\"))),\"\",INDIRECT(CONCATENATE($B105,\"!C127\")))","v":0.10271895077147875},{"$f":"IF(ISERROR(INDIRECT(CONCATENATE($B105,\"!D122\"))),\"\",INDIRECT(CONCATENATE($B105,\"!D122\")))","v":97.237880885510918},{"$f":"IF(ISERROR(INDIRECT(CONCATENATE($B105,\"!D129\"))),\"\",INDIRECT(CONCATENATE($B105,\"!D129\")))","v":89.968633408480443},null,null,{"$f":"IF(ISERROR(INDIRECT(CONCATENATE($B105,\"!D127\"))),\"\",INDIRECT(CONCATENATE($B105,\"!D127\")))","v":0.12710772259229994},{"$f":"IF(ISERROR(INDIRECT(CONCATENATE($B105,\"!E122\"))),\"\",INDIRECT(CONCATENATE($B105,\"!E122\")))","v":99.19783858825177},{"$f":"IF(ISERROR(INDIRECT(CONCATENATE($B105,\"!E129\"))),\"\",INDIRECT(CONCATENATE($B105,\"!E129\")))","v":94.170096746428626},null,null,{"$f":"IF(ISERROR(INDIRECT(CONCATENATE($B105,\"!E127\"))),\"\",INDIRECT(CONCATENATE($B105,\"!E127\")))","v":0},{"$f":"IF(ISERROR(INDIRECT(CONCATENATE($B105,\"!F122\"))),\"\",INDIRECT(CONCATENATE($B105,\"!F122\")))","v":100},{"$f":"IF(ISERROR(INDIRECT(CONCATENATE($B105,\"!F129\"))),\"\",INDIRECT(CONCATENATE($B105,\"!F129\")))","v":97.811113267055021},null,null,{"$f":"IF(ISERROR(INDIRECT(CONCATENATE($B105,\"!F127\"))),\"\",INDIRECT(CONCATENATE($B105,\"!F127\")))","v":0},{"$f":"IF(ISERROR(INDIRECT(CONCATENATE($B105,\"!G122\"))),\"\",INDIRECT(CONCATENATE($B105,\"!G122\")))","v":100},{"$f":"IF(ISERROR(INDIRECT(CONCATENATE($B105,\"!G129\"))),\"\",INDIRECT(CONCATENATE($B105,\"!G129\")))","v":97.670083910829291},null,null,{"$f":"IF(ISERROR(INDIRECT(CONCATENATE($B105,\"!G2127\"))),\"\",INDIRECT(CONCATENATE($B105,\"!G127\")))","v":0}]
[null,null,null,"","",null,null,"","","",null,null,"","","",null,null,"","","",null,null,"","","",null,null,""]
[null,null,null,"","",null,null,"","","",null,null,"","","",null,null,"","","",null,null,"","","",null,null,""]
[null,null,null,"","",null,null,"","","",null,null,"","","",null,null,"","","",null,null,"","","",null,null,""]
[null,null,null,"","",null,null,"","","",null,null,"","","",null,null,"","","",null,null,"","","",null,null,""]
[null,null,null,"","",null,null,"","","",null,null,"","","",null,null,"","","",null,null,"","","",null,null,""]
[null,null,null,"","",null,null,"","","",null,null,"","","",null,null,"","","",null,null,"","","",null,null,""]
[null,null,null,"","",null,null,"","","",null,null,"","","",null,null,"","","",null,null,"","","",null,null,""]
[null,null,null,"","",null,null,"","","",null,null,"","","",null,null,"","","",null,null,"","","",null,null,""]
[null,null,null,"","",null,null,"","","",null,null,"","","",null,null,"","","",null,null,"","","",null,null,""]
[null,null,null,"","",null,null,"","","",null,null,"","","",null,null,"","","",null,null,"","","",null,null,""]
[null,null,null,"","",null,null,"","","",null,null,"","","",null,null,"","","",null,null,"","","",null,null,""]
[]
[null,{"$f":"CONCATENATE(\"National use of sanitation facilities, \",C99,\"–\",C100)","v":"National use of sanitation facilities, 2015–2020"},null,null,null,null,null,null,null,null,null,null,null,null,null,null,null,null,"Data points used for regression"]
[]
[]
[]
[]
[]
[]
[]
[]
[]
[]
[]
[]
[]
[]
[]
[]
[]
[]
[]
[]
[]
[]
[]
[]
[]
[]
[]
[]
[]
[]
[]
[]
[]
[]
[]
[]
[]
[]
[]
[]
[]
[]
[]
[]
[]
[]
[]
[]
[]
[]
[]
[]
[]
[]
[]
[]
[]
[]
[]
[]
[]
[]
[]
[]
[]
[]
[]
[]
[]
[]
[]
[]
[]
[]
[]
[]
[]
[]
["URBAN",null,null,"Poorest",null,null,null,null,"Poor",null,null,null,null,"Middle",null,null,null,null,"Rich",null,null,null,null,"Richest"]
[null,null,null,"Improved","Basic","Limited","Unimproved","Open defecation","Improved","Basic","Limited","Unimproved","Open defecation","Improved","Basic","Limited","Unimproved","Open defecation","Improved","Basic","Limited","Unimproved","Open defecation","Improved","Basic","Limited","Unimproved","Open defecation"]
["Forecast period:",null,2015,{"$f":"IF((D201+H201)>100,D201*100/(D201+H201),D201)","v":97.365373271867313},{"$f":"D199*AVERAGEIF(E205:E216,\">0\")/100","v":85.775681372599976},{"$f":"D199*(100-AVERAGEIF(E205:E216,\">0\"))/100","v":11.589691899267331},{"$f":"100-(E199+F199+H199)","v":2.0844723240065122},{"$f":"IF((D201+H201)>100,H201*100/(D201+H201),H201)","v":0.55015440412617622},{"$f":"IF((I201+M201)>100,I201*100/(I201+M201),I201)","v":100},{"$f":"I199*AVERAGEIF(J205:J216,\">0\")/100","v":97.367114729962594},{"$f":"I199*(100-AVERAGEIF(J205:J216,\">0\"))/100","v":2.6328852700374057},{"$f":"100-(J199+K199+M199)","v":0},{"$f":"IF((I201+M201)>100,M201*100/(I201+M201),M201)","v":0},{"$f":"IF((N201+R201)>100,N201*100/(N201+R201),N201)","v":100},{"$f":"N199*AVERAGEIF(O205:O216,\">0\")/100","v":99.010240242212106},{"$f":"N199*(100-AVERAGEIF(O205:O216,\">0\"))/100","v":0.98975975778789405},{"$f":"100-(O199+P199+R199)","v":0},{"$f":"IF((N201+R201)>100,R201*100/(N201+R201),R201)","v":0},{"$f":"IF((S201+W201)>100,S201*100/(S201+W201),S201)","v":100},{"$f":"S199*AVERAGEIF(T205:T216,\">0\")/100","v":98.274273906646528},{"$f":"S199*(100-AVERAGEIF(T205:T216,\">0\"))/100","v":1.7257260933534724},{"$f":"100-(T199+U199+W199)","v":0},{"$f":"IF((S201+W201)>100,W201*100/(S201+W201),W201)","v":0},{"$f":"IF((X201+AB201)>100,X201*100/(X201+AB201),X201)","v":100},{"$f":"X199*AVERAGEIF(Y205:Y216,\">0\")/100","v":97.79402400505343},{"$f":"X199*(100-AVERAGEIF(Y205:Y216,\">0\"))/100","v":2.20597599494657},{"$f":"100-(Y199+Z199+AB199)","v":0},{"$f":"IF((X201+AB201)>100,AB201*100/(X201+AB201),AB201)","v":0}]
[null,null,2020,{"$f":"IF((D202+H202)>100,D202*100/(D202+H202),D202)","v":97.365373271867313},{"$f":"D200*AVERAGEIF(E205:E216,\">0\")/100","v":85.775681372599976},{"$f":"D200*(100-AVERAGEIF(E205:E216,\">0\"))/100","v":11.589691899267331},{"$f":"100-(E200+F200+H200)","v":2.0844723240065122},{"$f":"IF((D202+H202)>100,H202*100/(D202+H202),H202)","v":0.55015440412617622},{"$f":"IF((I202+M202)>100,I202*100/(I202+M202),I202)","v":100},{"$f":"I200*AVERAGEIF(J205:J216,\">0\")/100","v":97.367114729962594},{"$f":"I200*(100-AVERAGEIF(J205:J216,\">0\"))/100","v":2.6328852700374057},{"$f":"100-(J200+K200+M200)","v":0},{"$f":"IF((I202+M202)>100,M202*100/(I202+M202),M202)","v":0},{"$f":"IF((N202+R202)>100,N202*100/(N202+R202),N202)","v":100},{"$f":"N200*AVERAGEIF(O205:O216,\">0\")/100","v":99.010240242212106},{"$f":"N200*(100-AVERAGEIF(O205:O216,\">0\"))/100","v":0.98975975778789405},{"$f":"100-(O200+P200+R200)","v":0},{"$f":"IF((N202+R202)>100,R202*100/(N202+R202),R202)","v":0},{"$f":"IF((S202+W202)>100,S202*100/(S202+W202),S202)","v":100},{"$f":"S200*AVERAGEIF(T205:T216,\">0\")/100","v":98.274273906646528},{"$f":"S200*(100-AVERAGEIF(T205:T216,\">0\"))/100","v":1.7257260933534724},{"$f":"100-(T200+U200+W200)","v":0},{"$f":"IF((S202+W202)>100,W202*100/(S202+W202),W202)","v":0},{"$f":"IF((X202+AB202)>100,X202*100/(X202+AB202),X202)","v":100},{"$f":"X200*AVERAGEIF(Y205:Y216,\">0\")/100","v":97.79402400505343},{"$f":"X200*(100-AVERAGEIF(Y205:Y216,\">0\"))/100","v":2.20597599494657},{"$f":"100-(Y200+Z200+AB200)","v":0},{"$f":"IF((X202+AB202)>100,AB202*100/(X202+AB202),AB202)","v":0}]
["Regression period:",null,{"$f":"MinRegYear(C199,C205:C216)","v":2017},{"$f":"IF(MAX(C205:C216)-MIN(C205:C216)<5,AVERAGEIF(C205:C216,\">0\",D205:D216),\nIF(FORECAST($C201,D$205:D$216,$C$205:$C$216)<0,0,\nIF(FORECAST($C201,D$205:D$216,$C$205:$C$216)>100,100,\nFORECAST($C201,D$205:D$216,$C$205:$C$216))))","v":97.365373271867313},null,null,null,{"$f":"IF(MAX(C205:C216)-MIN(C205:C216)<5,AVERAGEIF(C205:C216,\">0\",H205:H216),\nIF(FORECAST($C201,H$205:H$216,$C$205:$C$216)<0,0,\nIF(FORECAST($C201,H$205:H$216,$C$205:$C$216)>100,100,\nFORECAST($C201,H$205:H$216,$C$205:$C$216))))","v":0.55015440412617622},{"$f":"IF(MAX(C205:C216)-MIN(C205:C216)<5,AVERAGEIF(C205:C216,\">0\",I205:I216),\nIF(FORECAST($C201,I$205:I$216,$C$205:$C$216)<0,0,\nIF(FORECAST($C201,I$205:I$216,$C$205:$C$216)>100,100,\nFORECAST($C201,I$205:I$216,$C$205:$C$216))))","v":100},null,null,null,{"$f":"IF(MAX(C205:C216)-MIN(C205:C216)<5,AVERAGEIF(C205:C216,\">0\",M205:M216),\nIF(FORECAST($C201,M$205:M$216,$C$205:$C$216)<0,0,\nIF(FORECAST($C201,M$205:M$216,$C$205:$C$216)>100,100,\nFORECAST($C201,M$205:M$216,$C$205:$C$216))))","v":0},{"$f":"IF(MAX(C205:C216)-MIN(C205:C216)<5,AVERAGEIF(C205:C216,\">0\",N205:N216),\nIF(FORECAST($C201,N$205:N$216,$C$205:$C$216)<0,0,\nIF(FORECAST($C201,N$205:N$216,$C$205:$C$216)>100,100,\nFORECAST($C201,N$205:N$216,$C$205:$C$216))))","v":100},null,null,null,{"$f":"IF(MAX(C205:C216)-MIN(C205:C216)<5,AVERAGEIF(C205:C216,\">0\",R205:R216),\nIF(FORECAST($C201,R$205:R$216,$C$205:$C$216)<0,0,\nIF(FORECAST($C201,R$205:R$216,$C$205:$C$216)>100,100,\nFORECAST($C201,R$205:R$216,$C$205:$C$216))))","v":0},{"$f":"IF(MAX(C205:C216)-MIN(C205:C216)<5,AVERAGEIF(C205:C216,\">0\",S205:S216),\nIF(FORECAST($C201,S$205:S$216,$C$205:$C$216)<0,0,\nIF(FORECAST($C201,S$205:S$216,$C$205:$C$216)>100,100,\nFORECAST($C201,S$205:S$216,$C$205:$C$216))))","v":100},null,null,null,{"$f":"IF(MAX(C205:C216)-MIN(C205:C216)<5,AVERAGEIF(C205:C216,\">0\",W205:W216),\nIF(FORECAST($C201,W$205:W$216,$C$205:$C$216)<0,0,\nIF(FORECAST($C201,W$205:W$216,$C$205:$C$216)>100,100,\nFORECAST($C201,W$205:W$216,$C$205:$C$216))))","v":0},{"$f":"IF(MAX(C205:C216)-MIN(C205:C216)<5,AVERAGEIF(C205:C216,\">0\",X205:X216),\nIF(FORECAST($C201,X$205:X$216,$C$205:$C$216)<0,0,\nIF(FORECAST($C201,X$205:X$216,$C$205:$C$216)>100,100,\nFORECAST($C201,X$205:X$216,$C$205:$C$216))))","v":100},null,null,null,{"$f":"IF(MAX(C205:C216)-MIN(C205:C216)<5,AVERAGEIF(C205:C216,\">0\",AB205:AB216),\nIF(FORECAST($C201,AB$205:AB$216,$C$205:$C$216)<0,0,\nIF(FORECAST($C201,AB$205:AB$216,$C$205:$C$216)>100,100,\nFORECAST($C201,AB$205:AB$216,$C$205:$C$216))))","v":0}]
[null,null,{"$f":"MaxRegYear(C200,C205:C216)","v":2020},{"$f":"IF(MAX(C205:C216)-MIN(C205:C216)<5,AVERAGEIF(C205:C216,\">0\",D205:D216),\nIF(FORECAST($C202,D$205:D$216,$C$205:$C$216)<0,0,\nIF(FORECAST($C202,D$205:D$216,$C$205:$C$216)>100,100,\nFORECAST($C202,D$205:D$216,$C$205:$C$216))))","v":97.365373271867313},null,null,null,{"$f":"IF(MAX(C205:C216)-MIN(C205:C216)<5,AVERAGEIF(C205:C216,\">0\",H205:H216),\nIF(FORECAST($C202,H$205:H$216,$C$205:$C$216)<0,0,\nIF(FORECAST($C202,H$205:H$216,$C$205:$C$216)>100,100,\nFORECAST($C202,H$205:H$216,$C$205:$C$216))))","v":0.55015440412617622},{"$f":"IF(MAX(C205:C216)-MIN(C205:C216)<5,AVERAGEIF(C205:C216,\">0\",I205:I216),\nIF(FORECAST($C202,I$205:I$216,$C$205:$C$216)<0,0,\nIF(FORECAST($C202,I$205:I$216,$C$205:$C$216)>100,100,\nFORECAST($C202,I$205:I$216,$C$205:$C$216))))","v":100},null,null,null,{"$f":"IF(MAX(C205:C216)-MIN(C205:C216)<5,AVERAGEIF(C205:C216,\">0\",M205:M216),\nIF(FORECAST($C202,M$205:M$216,$C$205:$C$216)<0,0,\nIF(FORECAST($C202,M$205:M$216,$C$205:$C$216)>100,100,\nFORECAST($C202,M$205:M$216,$C$205:$C$216))))","v":0},{"$f":"IF(MAX(C205:C216)-MIN(C205:C216)<5,AVERAGEIF(C205:C216,\">0\",N205:N216),\nIF(FORECAST($C202,N$205:N$216,$C$205:$C$216)<0,0,\nIF(FORECAST($C202,N$205:N$216,$C$205:$C$216)>100,100,\nFORECAST($C202,N$205:N$216,$C$205:$C$216))))","v":100},null,null,null,{"$f":"IF(MAX(C205:C216)-MIN(C205:C216)<5,AVERAGEIF(C205:C216,\">0\",R205:R216),\nIF(FORECAST($C202,R$205:R$216,$C$205:$C$216)<0,0,\nIF(FORECAST($C202,R$205:R$216,$C$205:$C$216)>100,100,\nFORECAST($C202,R$205:R$216,$C$205:$C$216))))","v":0},{"$f":"IF(MAX(C205:C216)-MIN(C205:C216)<5,AVERAGEIF(C205:C216,\">0\",S205:S216),\nIF(FORECAST($C202,S$205:S$216,$C$205:$C$216)<0,0,\nIF(FORECAST($C202,S$205:S$216,$C$205:$C$216)>100,100,\nFORECAST($C202,S$205:S$216,$C$205:$C$216))))","v":100},null,null,null,{"$f":"IF(MAX(C205:C216)-MIN(C205:C216)<5,AVERAGEIF(C205:C216,\">0\",W205:W216),\nIF(FORECAST($C202,W$205:W$216,$C$205:$C$216)<0,0,\nIF(FORECAST($C202,W$205:W$216,$C$205:$C$216)>100,100,\nFORECAST($C202,W$205:W$216,$C$205:$C$216))))","v":0},{"$f":"IF(MAX(C205:C216)-MIN(C205:C216)<5,AVERAGEIF(C205:C216,\">0\",X205:X216),\nIF(FORECAST($C202,X$205:X$216,$C$205:$C$216)<0,0,\nIF(FORECAST($C202,X$205:X$216,$C$205:$C$216)>100,100,\nFORECAST($C202,X$205:X$216,$C$205:$C$216))))","v":100},null,null,null,{"$f":"IF(MAX(C205:C216)-MIN(C205:C216)<5,AVERAGEIF(C205:C216,\">0\",AB205:AB216),\nIF(FORECAST($C202,AB$205:AB$216,$C$205:$C$216)<0,0,\nIF(FORECAST($C202,AB$205:AB$216,$C$205:$C$216)>100,100,\nFORECAST($C202,AB$205:AB$216,$C$205:$C$216))))","v":0}]
[]
[null,"Survey","Year","Improved","Not shared",null,null,"Open defecation","Improved","Not shared",null,null,"Open defecation","Improved","Not shared",null,null,"Open defecation","Improved","Not shared",null,null,"Open defecation","Improved","Not shared",null,null,"Open defecation"]
[null,"MICS19",2019,{"$f":"IF(ISERROR(INDIRECT(CONCATENATE($B205,\"!H122\"))),\"\",INDIRECT(CONCATENATE($B205,\"!H122\")))","v":97.365373271867313},{"$f":"IF(ISERROR(INDIRECT(CONCATENATE($B205,\"!H129\"))),\"\",INDIRECT(CONCATENATE($B205,\"!H129\")))","v":88.096700593026895},null,null,{"$f":"IF(ISERROR(INDIRECT(CONCATENATE($B205,\"!H127\"))),\"\",INDIRECT(CONCATENATE($B205,\"!H127\")))","v":0.55015440412617622},{"$f":"IF(ISERROR(INDIRECT(CONCATENATE($B205,\"!I122\"))),\"\",INDIRECT(CONCATENATE($B205,\"!I122\")))","v":100},{"$f":"IF(ISERROR(INDIRECT(CONCATENATE($B205,\"!I129\"))),\"\",INDIRECT(CONCATENATE($B205,\"!I129\")))","v":97.367114729962594},null,null,{"$f":"IF(ISERROR(INDIRECT(CONCATENATE($B205,\"!I127\"))),\"\",INDIRECT(CONCATENATE($B205,\"!I127\")))","v":0},{"$f":"IF(ISERROR(INDIRECT(CONCATENATE($B205,\"!J122\"))),\"\",INDIRECT(CONCATENATE($B205,\"!J122\")))","v":100},{"$f":"IF(ISERROR(INDIRECT(CONCATENATE($B205,\"!J129\"))),\"\",INDIRECT(CONCATENATE($B205,\"!J129\")))","v":99.010240242212106},null,null,{"$f":"IF(ISERROR(INDIRECT(CONCATENATE($B205,\"!J127\"))),\"\",INDIRECT(CONCATENATE($B205,\"!J127\")))","v":0},{"$f":"IF(ISERROR(INDIRECT(CONCATENATE($B205,\"!K122\"))),\"\",INDIRECT(CONCATENATE($B205,\"!K122\")))","v":100},{"$f":"IF(ISERROR(INDIRECT(CONCATENATE($B205,\"!K129\"))),\"\",INDIRECT(CONCATENATE($B205,\"!K129\")))","v":98.274273906646528},null,null,{"$f":"IF(ISERROR(INDIRECT(CONCATENATE($B205,\"!K127\"))),\"\",INDIRECT(CONCATENATE($B205,\"!K127\")))","v":0},{"$f":"IF(ISERROR(INDIRECT(CONCATENATE($B205,\"!L122\"))),\"\",INDIRECT(CONCATENATE($B205,\"!L122\")))","v":100},{"$f":"IF(ISERROR(INDIRECT(CONCATENATE($B205,\"!L129\"))),\"\",INDIRECT(CONCATENATE($B205,\"!L129\")))","v":97.79402400505343},null,null,{"$f":"IF(ISERROR(INDIRECT(CONCATENATE($B205,\"!L2127\"))),\"\",INDIRECT(CONCATENATE($B205,\"!L127\")))","v":0}]
[null,null,null,"","",null,null,"","","",null,null,"","","",null,null,"","","",null,null,"","","",null,null,""]
[null,null,null,"","",null,null,"","","",null,null,"","","",null,null,"","","",null,null,"","","",null,null,""]
[null,null,null,"","",null,null,"","","",null,null,"","","",null,null,"","","",null,null,"","","",null,null,""]
[null,null,null,"","",null,null,"","","",null,null,"","","",null,null,"","","",null,null,"","","",null,null,""]
[null,null,null,"","",null,null,"","","",null,null,"","","",null,null,"","","",null,null,"","","",null,null,""]
[null,null,null,"","",null,null,"","","",null,null,"","","",null,null,"","","",null,null,"","","",null,null,""]
[null,null,null,"","",null,null,"","","",null,null,"","","",null,null,"","","",null,null,"","","",null,null,""]
[null,null,null,"","",null,null,"","","",null,null,"","","",null,null,"","","",null,null,"","","",null,null,""]
[null,null,null,"","",null,null,"","","",null,null,"","","",null,null,"","","",null,null,"","","",null,null,""]
[null,null,null,"","",null,null,"","","",null,null,"","","",null,null,"","","",null,null,"","","",null,null,""]
[null,null,null,"","",null,null,"","","",null,null,"","","",null,null,"","","",null,null,"","","",null,null,""]
[]
[null,{"$f":"CONCATENATE(\"Urban use of sanitation facilities, \",C199,\"–\",C200)","v":"Urban use of sanitation facilities, 2015–2020"},null,null,null,null,null,null,null,null,null,null,null,null,null,null,null,null,"Data points used for regression"]
[]
[]
[]
[]
[]
[]
[]
[]
[]
[]
[]
[]
[]
[]
[]
[]
[]
[]
[]
[]
[]
[]
[]
[]
[]
[]
[]
[]
[]
[]
[]
[]
[]
[]
[]
[]
[]
[]
[]
[]
[]
[]
[]
[]
[]
[]
[]
[]
[]
[]
[]
[]
[]
[]
[]
[]
[]
[]
[]
[]
[]
[]
[]
[]
[]
[]
[]
[]
[]
[]
[]
[]
[]
[]
[]
[]
[]
[]
["RURAL",null,null,"Poorest",null,null,null,null,"Poor",null,null,null,null,"Middle",null,null,null,null,"Rich",null,null,null,null,"Richest"]
[null,null,null,"Improved","Basic","Limited","Unimproved","Open defecation","Improved","Basic","Limited","Unimproved","Open defecation","Improved","Basic","Limited","Unimproved","Open defecation","Improved","Basic","Limited","Unimproved","Open defecation","Improved","Basic","Limited","Unimproved","Open defecation"]
["Forecast period:",null,2015,{"$f":"IF((D301+H301)>100,D301*100/(D301+H301),D301)","v":91.324419837830391},{"$f":"D299*AVERAGEIF(E305:E316,\">0\")/100","v":80.653276008422765},{"$f":"D299*(100-AVERAGEIF(E305:E316,\">0\"))/100","v":10.67114382940763},{"$f":"100-(E299+F299+H299)","v":8.5424953180744154},{"$f":"IF((D301+H301)>100,H301*100/(D301+H301),H301)","v":0.13308484409519811},{"$f":"IF((I301+M301)>100,I301*100/(I301+M301),I301)","v":96.346332863898738},{"$f":"I299*AVERAGEIF(J305:J316,\">0\")/100","v":87.1237902051585},{"$f":"I299*(100-AVERAGEIF(J305:J316,\">0\"))/100","v":9.2225426587402506},{"$f":"100-(J299+K299+M299)","v":3.653667136101248},{"$f":"IF((I301+M301)>100,M301*100/(I301+M301),M301)","v":0},{"$f":"IF((N301+R301)>100,N301*100/(N301+R301),N301)","v":98.552452569749548},{"$f":"N299*AVERAGEIF(O305:O316,\">0\")/100","v":90.865916712807902},{"$f":"N299*(100-AVERAGEIF(O305:O316,\">0\"))/100","v":7.6865358569416422},{"$f":"100-(O299+P299+R299)","v":1.4475474302504523},{"$f":"IF((N301+R301)>100,R301*100/(N301+R301),R301)","v":0},{"$f":"IF((S301+W301)>100,S301*100/(S301+W301),S301)","v":99.926326343643126},{"$f":"S299*AVERAGEIF(T305:T316,\">0\")/100","v":96.685746151918906},{"$f":"S299*(100-AVERAGEIF(T305:T316,\">0\"))/100","v":3.2405801917242201},{"$f":"100-(T299+U299+W299)","v":7.3673656356874062E-2},{"$f":"IF((S301+W301)>100,W301*100/(S301+W301),W301)","v":0},{"$f":"IF((X301+AB301)>100,X301*100/(X301+AB301),X301)","v":100},{"$f":"X299*AVERAGEIF(Y305:Y316,\">0\")/100","v":97.64216459585316},{"$f":"X299*(100-AVERAGEIF(Y305:Y316,\">0\"))/100","v":2.3578354041468401},{"$f":"100-(Y299+Z299+AB299)","v":0},{"$f":"IF((X301+AB301)>100,AB301*100/(X301+AB301),AB301)","v":0}]
[null,null,2020,{"$f":"IF((D302+H302)>100,D302*100/(D302+H302),D302)","v":91.324419837830391},{"$f":"D300*AVERAGEIF(E305:E316,\">0\")/100","v":80.653276008422765},{"$f":"D300*(100-AVERAGEIF(E305:E316,\">0\"))/100","v":10.67114382940763},{"$f":"100-(E300+F300+H300)","v":8.5424953180744154},{"$f":"IF((D302+H302)>100,H302*100/(D302+H302),H302)","v":0.13308484409519811},{"$f":"IF((I302+M302)>100,I302*100/(I302+M302),I302)","v":96.346332863898738},{"$f":"I300*AVERAGEIF(J305:J316,\">0\")/100","v":87.1237902051585},{"$f":"I300*(100-AVERAGEIF(J305:J316,\">0\"))/100","v":9.2225426587402506},{"$f":"100-(J300+K300+M300)","v":3.653667136101248},{"$f":"IF((I302+M302)>100,M302*100/(I302+M302),M302)","v":0},{"$f":"IF((N302+R302)>100,N302*100/(N302+R302),N302)","v":98.552452569749548},{"$f":"N300*AVERAGEIF(O305:O316,\">0\")/100","v":90.865916712807902},{"$f":"N300*(100-AVERAGEIF(O305:O316,\">0\"))/100","v":7.6865358569416422},{"$f":"100-(O300+P300+R300)","v":1.4475474302504523},{"$f":"IF((N302+R302)>100,R302*100/(N302+R302),R302)","v":0},{"$f":"IF((S302+W302)>100,S302*100/(S302+W302),S302)","v":99.926326343643126},{"$f":"S300*AVERAGEIF(T305:T316,\">0\")/100","v":96.685746151918906},{"$f":"S300*(100-AVERAGEIF(T305:T316,\">0\"))/100","v":3.2405801917242201},{"$f":"100-(T300+U300+W300)","v":7.3673656356874062E-2},{"$f":"IF((S302+W302)>100,W302*100/(S302+W302),W302)","v":0},{"$f":"IF((X302+AB302)>100,X302*100/(X302+AB302),X302)","v":100},{"$f":"X300*AVERAGEIF(Y305:Y316,\">0\")/100","v":97.64216459585316},{"$f":"X300*(100-AVERAGEIF(Y305:Y316,\">0\"))/100","v":2.3578354041468401},{"$f":"100-(Y300+Z300+AB300)","v":0},{"$f":"IF((X302+AB302)>100,AB302*100/(X302+AB302),AB302)","v":0}]
["Regression period:",null,{"$f":"MinRegYear(C299,C305:C316)","v":2017},{"$f":"IF(MAX(C305:C316)-MIN(C305:C316)<5,AVERAGEIF(C305:C316,\">0\",D305:D316),\nIF(FORECAST($C301,D$305:D$316,$C$305:$C$316)<0,0,\nIF(FORECAST($C301,D$305:D$316,$C$305:$C$316)>100,100,\nFORECAST($C301,D$305:D$316,$C$305:$C$316))))","v":91.324419837830391},null,null,null,{"$f":"IF(MAX(C305:C316)-MIN(C305:C316)<5,AVERAGEIF(C305:C316,\">0\",H305:H316),\nIF(FORECAST($C301,H$305:H$316,$C$305:$C$316)<0,0,\nIF(FORECAST($C301,H$305:H$316,$C$305:$C$316)>100,100,\nFORECAST($C301,H$305:H$316,$C$305:$C$316))))","v":0.13308484409519811},{"$f":"IF(MAX(C305:C316)-MIN(C305:C316)<5,AVERAGEIF(C305:C316,\">0\",I305:I316),\nIF(FORECAST($C301,I$305:I$316,$C$305:$C$316)<0,0,\nIF(FORECAST($C301,I$305:I$316,$C$305:$C$316)>100,100,\nFORECAST($C301,I$305:I$316,$C$305:$C$316))))","v":96.346332863898738},null,null,null,{"$f":"IF(MAX(C305:C316)-MIN(C305:C316)<5,AVERAGEIF(C305:C316,\">0\",M305:M316),\nIF(FORECAST($C301,M$305:M$316,$C$305:$C$316)<0,0,\nIF(FORECAST($C301,M$305:M$316,$C$305:$C$316)>100,100,\nFORECAST($C301,M$305:M$316,$C$305:$C$316))))","v":0},{"$f":"IF(MAX(C305:C316)-MIN(C305:C316)<5,AVERAGEIF(C305:C316,\">0\",N305:N316),\nIF(FORECAST($C301,N$305:N$316,$C$305:$C$316)<0,0,\nIF(FORECAST($C301,N$305:N$316,$C$305:$C$316)>100,100,\nFORECAST($C301,N$305:N$316,$C$305:$C$316))))","v":98.552452569749548},null,null,null,{"$f":"IF(MAX(C305:C316)-MIN(C305:C316)<5,AVERAGEIF(C305:C316,\">0\",R305:R316),\nIF(FORECAST($C301,R$305:R$316,$C$305:$C$316)<0,0,\nIF(FORECAST($C301,R$305:R$316,$C$305:$C$316)>100,100,\nFORECAST($C301,R$305:R$316,$C$305:$C$316))))","v":0},{"$f":"IF(MAX(C305:C316)-MIN(C305:C316)<5,AVERAGEIF(C305:C316,\">0\",S305:S316),\nIF(FORECAST($C301,S$305:S$316,$C$305:$C$316)<0,0,\nIF(FORECAST($C301,S$305:S$316,$C$305:$C$316)>100,100,\nFORECAST($C301,S$305:S$316,$C$305:$C$316))))","v":99.926326343643126},null,null,null,{"$f":"IF(MAX(C305:C316)-MIN(C305:C316)<5,AVERAGEIF(C305:C316,\">0\",W305:W316),\nIF(FORECAST($C301,W$305:W$316,$C$305:$C$316)<0,0,\nIF(FORECAST($C301,W$305:W$316,$C$305:$C$316)>100,100,\nFORECAST($C301,W$305:W$316,$C$305:$C$316))))","v":0},{"$f":"IF(MAX(C305:C316)-MIN(C305:C316)<5,AVERAGEIF(C305:C316,\">0\",X305:X316),\nIF(FORECAST($C301,X$305:X$316,$C$305:$C$316)<0,0,\nIF(FORECAST($C301,X$305:X$316,$C$305:$C$316)>100,100,\nFORECAST($C301,X$305:X$316,$C$305:$C$316))))","v":100},null,null,null,{"$f":"IF(MAX(C305:C316)-MIN(C305:C316)<5,AVERAGEIF(C305:C316,\">0\",AB305:AB316),\nIF(FORECAST($C301,AB$305:AB$316,$C$305:$C$316)<0,0,\nIF(FORECAST($C301,AB$305:AB$316,$C$305:$C$316)>100,100,\nFORECAST($C301,AB$305:AB$316,$C$305:$C$316))))","v":0}]
[null,null,{"$f":"MaxRegYear(C300,C305:C316)","v":2020},{"$f":"IF(MAX(C305:C316)-MIN(C305:C316)<5,AVERAGEIF(C305:C316,\">0\",D305:D316),\nIF(FORECAST($C302,D$305:D$316,$C$305:$C$316)<0,0,\nIF(FORECAST($C302,D$305:D$316,$C$305:$C$316)>100,100,\nFORECAST($C302,D$305:D$316,$C$305:$C$316))))","v":91.324419837830391},null,null,null,{"$f":"IF(MAX(C305:C316)-MIN(C305:C316)<5,AVERAGEIF(C305:C316,\">0\",H305:H316),\nIF(FORECAST($C302,H$305:H$316,$C$305:$C$316)<0,0,\nIF(FORECAST($C302,H$305:H$316,$C$305:$C$316)>100,100,\nFORECAST($C302,H$305:H$316,$C$305:$C$316))))","v":0.13308484409519811},{"$f":"IF(MAX(C305:C316)-MIN(C305:C316)<5,AVERAGEIF(C305:C316,\">0\",I305:I316),\nIF(FORECAST($C302,I$305:I$316,$C$305:$C$316)<0,0,\nIF(FORECAST($C302,I$305:I$316,$C$305:$C$316)>100,100,\nFORECAST($C302,I$305:I$316,$C$305:$C$316))))","v":96.346332863898738},null,null,null,{"$f":"IF(MAX(C305:C316)-MIN(C305:C316)<5,AVERAGEIF(C305:C316,\">0\",M305:M316),\nIF(FORECAST($C302,M$305:M$316,$C$305:$C$316)<0,0,\nIF(FORECAST($C302,M$305:M$316,$C$305:$C$316)>100,100,\nFORECAST($C302,M$305:M$316,$C$305:$C$316))))","v":0},{"$f":"IF(MAX(C305:C316)-MIN(C305:C316)<5,AVERAGEIF(C305:C316,\">0\",N305:N316),\nIF(FORECAST($C302,N$305:N$316,$C$305:$C$316)<0,0,\nIF(FORECAST($C302,N$305:N$316,$C$305:$C$316)>100,100,\nFORECAST($C302,N$305:N$316,$C$305:$C$316))))","v":98.552452569749548},null,null,null,{"$f":"IF(MAX(C305:C316)-MIN(C305:C316)<5,AVERAGEIF(C305:C316,\">0\",R305:R316),\nIF(FORECAST($C302,R$305:R$316,$C$305:$C$316)<0,0,\nIF(FORECAST($C302,R$305:R$316,$C$305:$C$316)>100,100,\nFORECAST($C302,R$305:R$316,$C$305:$C$316))))","v":0},{"$f":"IF(MAX(C305:C316)-MIN(C305:C316)<5,AVERAGEIF(C305:C316,\">0\",S305:S316),\nIF(FORECAST($C302,S$305:S$316,$C$305:$C$316)<0,0,\nIF(FORECAST($C302,S$305:S$316,$C$305:$C$316)>100,100,\nFORECAST($C302,S$305:S$316,$C$305:$C$316))))","v":99.926326343643126},null,null,null,{"$f":"IF(MAX(C305:C316)-MIN(C305:C316)<5,AVERAGEIF(C305:C316,\">0\",W305:W316),\nIF(FORECAST($C302,W$305:W$316,$C$305:$C$316)<0,0,\nIF(FORECAST($C302,W$305:W$316,$C$305:$C$316)>100,100,\nFORECAST($C302,W$305:W$316,$C$305:$C$316))))","v":0},{"$f":"IF(MAX(C305:C316)-MIN(C305:C316)<5,AVERAGEIF(C305:C316,\">0\",X305:X316),\nIF(FORECAST($C302,X$305:X$316,$C$305:$C$316)<0,0,\nIF(FORECAST($C302,X$305:X$316,$C$305:$C$316)>100,100,\nFORECAST($C302,X$305:X$316,$C$305:$C$316))))","v":100},null,null,null,{"$f":"IF(MAX(C305:C316)-MIN(C305:C316)<5,AVERAGEIF(C305:C316,\">0\",AB305:AB316),\nIF(FORECAST($C302,AB$305:AB$316,$C$305:$C$316)<0,0,\nIF(FORECAST($C302,AB$305:AB$316,$C$305:$C$316)>100,100,\nFORECAST($C302,AB$305:AB$316,$C$305:$C$316))))","v":0}]
[]
[null,"Survey","Year","Improved","Not shared",null,null,"Open defecation","Improved","Not shared",null,null,"Open defecation","Improved","Not shared",null,null,"Open defecation","Improved","Not shared",null,null,"Open defecation","Improved","Not shared",null,null,"Open defecation"]
[null,"MICS19",2019,{"$f":"IF(ISERROR(INDIRECT(CONCATENATE($B305,\"!M122\"))),\"\",INDIRECT(CONCATENATE($B305,\"!M122\")))","v":91.324419837830391},{"$f":"IF(ISERROR(INDIRECT(CONCATENATE($B305,\"!M129\"))),\"\",INDIRECT(CONCATENATE($B305,\"!M129\")))","v":88.315125518063027},null,null,{"$f":"IF(ISERROR(INDIRECT(CONCATENATE($B305,\"!M127\"))),\"\",INDIRECT(CONCATENATE($B305,\"!M127\")))","v":0.13308484409519811},{"$f":"IF(ISERROR(INDIRECT(CONCATENATE($B305,\"!N122\"))),\"\",INDIRECT(CONCATENATE($B305,\"!N122\")))","v":96.346332863898738},{"$f":"IF(ISERROR(INDIRECT(CONCATENATE($B305,\"!N129\"))),\"\",INDIRECT(CONCATENATE($B305,\"!N129\")))","v":90.427718020396014},null,null,{"$f":"IF(ISERROR(INDIRECT(CONCATENATE($B305,\"!N127\"))),\"\",INDIRECT(CONCATENATE($B305,\"!N127\")))","v":0},{"$f":"IF(ISERROR(INDIRECT(CONCATENATE($B305,\"!O122\"))),\"\",INDIRECT(CONCATENATE($B305,\"!O122\")))","v":98.552452569749548},{"$f":"IF(ISERROR(INDIRECT(CONCATENATE($B305,\"!O129\"))),\"\",INDIRECT(CONCATENATE($B305,\"!O129\")))","v":92.200563601903696},null,null,{"$f":"IF(ISERROR(INDIRECT(CONCATENATE($B305,\"!O127\"))),\"\",INDIRECT(CONCATENATE($B305,\"!O127\")))","v":0},{"$f":"IF(ISERROR(INDIRECT(CONCATENATE($B305,\"!P122\"))),\"\",INDIRECT(CONCATENATE($B305,\"!P122\")))","v":99.926326343643126},{"$f":"IF(ISERROR(INDIRECT(CONCATENATE($B305,\"!P129\"))),\"\",INDIRECT(CONCATENATE($B305,\"!P129\")))","v":96.757030594139948},null,null,{"$f":"IF(ISERROR(INDIRECT(CONCATENATE($B305,\"!P127\"))),\"\",INDIRECT(CONCATENATE($B305,\"!P127\")))","v":0},{"$f":"IF(ISERROR(INDIRECT(CONCATENATE($B305,\"!Q122\"))),\"\",INDIRECT(CONCATENATE($B305,\"!Q122\")))","v":100},{"$f":"IF(ISERROR(INDIRECT(CONCATENATE($B305,\"!Q129\"))),\"\",INDIRECT(CONCATENATE($B305,\"!Q129\")))","v":97.64216459585316},null,null,{"$f":"IF(ISERROR(INDIRECT(CONCATENATE($B305,\"!Q2127\"))),\"\",INDIRECT(CONCATENATE($B305,\"!Q127\")))","v":0}]
[null,null,null,"","",null,null,"","","",null,null,"","","",null,null,"","","",null,null,"","","",null,null,""]
[null,null,null,"","",null,null,"","","",null,null,"","","",null,null,"","","",null,null,"","","",null,null,""]
[null,null,null,"","",null,null,"","","",null,null,"","","",null,null,"","","",null,null,"","","",null,null,""]
[null,null,null,"","",null,null,"","","",null,null,"","","",null,null,"","","",null,null,"","","",null,null,""]
[null,null,null,"","",null,null,"","","",null,null,"","","",null,null,"","","",null,null,"","","",null,null,""]
[null,null,null,"","",null,null,"","","",null,null,"","","",null,null,"","","",null,null,"","","",null,null,""]
[null,null,null,"","",null,null,"","","",null,null,"","","",null,null,"","","",null,null,"","","",null,null,""]
[null,null,null,"","",null,null,"","","",null,null,"","","",null,null,"","","",null,null,"","","",null,null,""]
[null,null,null,"","",null,null,"","","",null,null,"","","",null,null,"","","",null,null,"","","",null,null,""]
[null,null,null,"","",null,null,"","","",null,null,"","","",null,null,"","","",null,null,"","","",null,null,""]
[null,null,null,"","",null,null,"","","",null,null,"","","",null,null,"","","",null,null,"","","",null,null,""]
[]
[null,{"$f":"CONCATENATE(\"Rural use of sanitation facilities, \",C299,\"–\",C300)","v":"Rural use of sanitation facilities, 2015–2020"},null,null,null,null,null,null,null,null,null,null,null,null,null,null,null,null,"Data points used for regression"]

{"sheet":"Hygiene","index":3,"n_rows":90,"n_cols":25,"rows_kept":90,"cut":false,"hidden":false,"merged":[[39,22,40,22],[39,23,40,23],[39,24,40,24],[31,4,32,5],[39,16,40,16],[39,17,40,17],[39,18,40,18],[39,19,40,19],[39,20,40,20],[39,21,40,21],[36,24,37,24],[39,6,40,7],[39,8,40,8],[39,9,40,9],[39,10,40,10],[39,11,40,11],[39,12,40,12],[39,13,40,13],[39,14,40,14],[39,15,40,15],[36,18,37,18],[36,12,37,12],[36,13,37,13],[36,14,37,14],[36,15,37,15],[36,16,37,16],[36,17,37,17],[36,19,37,19],[36,20,37,20],[36,21,37,21],[36,22,37,22],[36,23,37,23],[33,20,34,20],[33,21,34,21],[33,22,34,22],[33,23,34,23],[33,24,34,24],[33,15,34,15],[33,16,34,16],[33,17,34,17],[33,18,34,18],[36,6,37,7],[36,8,37,8],[36,9,37,9],[36,10,37,10],[36,11,37,11],[33,10,34,10],[33,11,34,11],[33,12,34,12],[33,13,34,13],[33,14,34,14],[6,1,6,7],[3,1,3,24],[4,1,4,24],[33,1,34,3],[31,6,32,9],[31,10,31,12],[31,13,31,15],[6,10,6,15],[6,18,6,23],[33,19,34,19],[31,16,31,18],[31,19,31,21],[31,22,31,24],[33,6,34,7],[33,8,34,8],[33,9,34,9]]}
[]
[]
[]
[null,"Access to hygiene facilities by wealth quintile (%)"]
[null,{"$f":"IF(ISERROR(INDIRECT(CONCATENATE($E$32,\"!A2\"))),\"\",INDIRECT(CONCATENATE($E$32,\"!A2\")))","v":"Tonga"}]
[]
[null,{"$f":"CONCATENATE(\"National \",IF(ISERROR(INDIRECT(CONCATENATE($E$32,\"!A2\"))),\"\",INDIRECT(CONCATENATE($E$32,\"!A210\"))))","v":"National Access to hygiene facilities "},null,null,null,null,null,null,null,null,{"$f":"CONCATENATE(\"Urban \",IF(ISERROR(INDIRECT(CONCATENATE($E$32,\"!A2\"))),\"\",INDIRECT(CONCATENATE($E$32,\"!A210\"))))","v":"Urban Access to hygiene facilities "},null,null,null,null,null,null,null,{"$f":"CONCATENATE(\"Rural \",IF(ISERROR(INDIRECT(CONCATENATE($E$32,\"!A2\"))),\"\",INDIRECT(CONCATENATE($E$32,\"!A210\"))))","v":"Rural Access to hygiene facilities "}]
[]
[]
[]
[]
[]
[]
[]
[]
[]
[]
[]
[]
[]
[]
[]
[]
[]
[]
[]
[]
[]
[]
[]
[]
[null,null,null,null,{"$f":"INDEX(B88:B100,A88)","v":"MICS19"},null,{"$f":"IF(ISERROR(INDIRECT(CONCATENATE($E$32,\"!A2\"))),\"\",INDIRECT(CONCATENATE($E$32,\"!A2\")))","v":"Tonga"},null,null,null,"Poorest",null,null,"Poor",null,null,"Middle",null,null,"Rich",null,null,"Richest"]
[null,null,null,null,null,null,null,null,null,null,"Basic","Limited","No facility","Basic","Limited","No facility","Basic","Limited","No facility","Basic","Limited","No facility","Basic","Limited","No facility"]
[null,">>>  Select Survey :   ",null,null,null,null,"NATIONAL",null,null,{"$f":"IF(ISERROR(INDIRECT(CONCATENATE(#REF!,\"!A2\"))),\"\",INDIRECT(CONCATENATE(#REF!,\"!A210\")))","v":""},{"$f":"IF(ISERROR(INDIRECT(CONCATENATE($E$32,\"!C222\"))),\"\",INDIRECT(CONCATENATE($E$32,\"!C222\")))","v":42.596680738717716},{"$f":"IF(ISERROR(INDIRECT(CONCATENATE($E$32,\"!C223\"))),\"\",INDIRECT(CONCATENATE($E$32,\"!C223\")))","v":50.932603365933829},{"$f":"IF(ISERROR(INDIRECT(CONCATENATE($E$32,\"!C224\"))),\"\",INDIRECT(CONCATENATE($E$32,\"!C224\")))","v":6.4707158953484489},{"$f":"IF(ISERROR(INDIRECT(CONCATENATE($E$32,\"!D222\"))),\"\",INDIRECT(CONCATENATE($E$32,\"!D222\")))","v":61.84512288194847},{"$f":"IF(ISERROR(INDIRECT(CONCATENATE($E$32,\"!D223\"))),\"\",INDIRECT(CONCATENATE($E$32,\"!D223\")))","v":34.081313587880281},{"$f":"IF(ISERROR(INDIRECT(CONCATENATE($E$32,\"!D224\"))),\"\",INDIRECT(CONCATENATE($E$32,\"!D224\")))","v":4.0735635301713984},{"$f":"IF(ISERROR(INDIRECT(CONCATENATE($E$32,\"!E222\"))),\"\",INDIRECT(CONCATENATE($E$32,\"!E222\")))","v":72.217887879740118},{"$f":"IF(ISERROR(INDIRECT(CONCATENATE($E$32,\"!E223\"))),\"\",INDIRECT(CONCATENATE($E$32,\"!E223\")))","v":27.290592697720317},{"$f":"IF(ISERROR(INDIRECT(CONCATENATE($E$32,\"!E224\"))),\"\",INDIRECT(CONCATENATE($E$32,\"!E224\")))","v":0.49151942253951275},{"$f":"IF(ISERROR(INDIRECT(CONCATENATE($E$32,\"!F222\"))),\"\",INDIRECT(CONCATENATE($E$32,\"!F222\")))","v":82.84564862938646},{"$f":"IF(ISERROR(INDIRECT(CONCATENATE($E$32,\"!F223\"))),\"\",INDIRECT(CONCATENATE($E$32,\"!F223\")))","v":16.143805271260668},{"$f":"IF(ISERROR(INDIRECT(CONCATENATE($E$32,\"!F224\"))),\"\",INDIRECT(CONCATENATE($E$32,\"!F224\")))","v":1.010546099352899},{"$f":"IF(ISERROR(INDIRECT(CONCATENATE($E$32,\"!G222\"))),\"\",INDIRECT(CONCATENATE($E$32,\"!G222\")))","v":90.083075291135174},{"$f":"IF(ISERROR(INDIRECT(CONCATENATE($E$32,\"!G223\"))),\"\",INDIRECT(CONCATENATE($E$32,\"!G223\")))","v":8.3933261378076622},{"$f":"IF(ISERROR(INDIRECT(CONCATENATE($E$32,\"!G224\"))),\"\",INDIRECT(CONCATENATE($E$32,\"!G224\")))","v":1.5235985710571835}]
[]
[]
[null,null,null,null,null,null,"URBAN",null,null,{"$f":"IF(ISERROR(INDIRECT(CONCATENATE(#REF!,\"!A2\"))),\"\",INDIRECT(CONCATENATE(#REF!,\"!A210\")))","v":""},{"$f":"IF(ISERROR(INDIRECT(CONCATENATE($E$32,\"!H222\"))),\"\",INDIRECT(CONCATENATE($E$32,\"!H222\")))","v":48.880188804359889},{"$f":"IF(ISERROR(INDIRECT(CONCATENATE($E$32,\"!H223\"))),\"\",INDIRECT(CONCATENATE($E$32,\"!H223\")))","v":37.013010785337258},{"$f":"IF(ISERROR(INDIRECT(CONCATENATE($E$32,\"!H224\"))),\"\",INDIRECT(CONCATENATE($E$32,\"!H224\")))","v":14.106800410302867},{"$f":"IF(ISERROR(INDIRECT(CONCATENATE($E$32,\"!I222\"))),\"\",INDIRECT(CONCATENATE($E$32,\"!I222\")))","v":82.27715296963764},{"$f":"IF(ISERROR(INDIRECT(CONCATENATE($E$32,\"!I223\"))),\"\",INDIRECT(CONCATENATE($E$32,\"!I223\")))","v":15.880199126943632},{"$f":"IF(ISERROR(INDIRECT(CONCATENATE($E$32,\"!I224\"))),\"\",INDIRECT(CONCATENATE($E$32,\"!I224\")))","v":1.8426479034187415},{"$f":"IF(ISERROR(INDIRECT(CONCATENATE($E$32,\"!J222\"))),\"\",INDIRECT(CONCATENATE($E$32,\"!J222\")))","v":87.739891915579548},{"$f":"IF(ISERROR(INDIRECT(CONCATENATE($E$32,\"!J223\"))),\"\",INDIRECT(CONCATENATE($E$32,\"!J223\")))","v":10.971196152542642},{"$f":"IF(ISERROR(INDIRECT(CONCATENATE($E$32,\"!J224\"))),\"\",INDIRECT(CONCATENATE($E$32,\"!J224\")))","v":1.2889119318778326},{"$f":"IF(ISERROR(INDIRECT(CONCATENATE($E$32,\"!K222\"))),\"\",INDIRECT(CONCATENATE($E$32,\"!K222\")))","v":87.844930007996652},{"$f":"IF(ISERROR(INDIRECT(CONCATENATE($E$32,\"!K223\"))),\"\",INDIRECT(CONCATENATE($E$32,\"!K223\")))","v":11.199970414354945},{"$f":"IF(ISERROR(INDIRECT(CONCATENATE($E$32,\"!K224\"))),\"\",INDIRECT(CONCATENATE($E$32,\"!K224\")))","v":0.95509957764838194},{"$f":"IF(ISERROR(INDIRECT(CONCATENATE($E$32,\"!L222\"))),\"\",INDIRECT(CONCATENATE($E$32,\"!L222\")))","v":95.570453637568747},{"$f":"IF(ISERROR(INDIRECT(CONCATENATE($E$32,\"!L223\"))),\"\",INDIRECT(CONCATENATE($E$32,\"!L223\")))","v":1.1416761285930697},{"$f":"IF(ISERROR(INDIRECT(CONCATENATE($E$32,\"!L224\"))),\"\",INDIRECT(CONCATENATE($E$32,\"!L224\")))","v":3.2878702338381691}]
[]
[]
[null,null,null,null,null,null,"RURAL",null,null,{"$f":"IF(ISERROR(INDIRECT(CONCATENATE(#REF!,\"!A2\"))),\"\",INDIRECT(CONCATENATE(#REF!,\"!A210\")))","v":""},{"$f":"IF(ISERROR(INDIRECT(CONCATENATE($E$32,\"!M222\"))),\"\",INDIRECT(CONCATENATE($E$32,\"!M222\")))","v":41.589410068723559},{"$f":"IF(ISERROR(INDIRECT(CONCATENATE($E$32,\"!M223\"))),\"\",INDIRECT(CONCATENATE($E$32,\"!M223\")))","v":52.139575697498373},{"$f":"IF(ISERROR(INDIRECT(CONCATENATE($E$32,\"!M224\"))),\"\",INDIRECT(CONCATENATE($E$32,\"!M224\")))","v":6.2710142337779899},{"$f":"IF(ISERROR(INDIRECT(CONCATENATE($E$32,\"!N222\"))),\"\",INDIRECT(CONCATENATE($E$32,\"!N222\")))","v":59.283288735300012},{"$f":"IF(ISERROR(INDIRECT(CONCATENATE($E$32,\"!N223\"))),\"\",INDIRECT(CONCATENATE($E$32,\"!N223\")))","v":37.706319838731588},{"$f":"IF(ISERROR(INDIRECT(CONCATENATE($E$32,\"!N224\"))),\"\",INDIRECT(CONCATENATE($E$32,\"!N224\")))","v":3.0103914259684448},{"$f":"IF(ISERROR(INDIRECT(CONCATENATE($E$32,\"!O222\"))),\"\",INDIRECT(CONCATENATE($E$32,\"!O222\")))","v":68.231696039808909},{"$f":"IF(ISERROR(INDIRECT(CONCATENATE($E$32,\"!O223\"))),\"\",INDIRECT(CONCATENATE($E$32,\"!O223\")))","v":31.117062780825105},{"$f":"IF(ISERROR(INDIRECT(CONCATENATE($E$32,\"!O224\"))),\"\",INDIRECT(CONCATENATE($E$32,\"!O224\")))","v":0.65124117936599069},{"$f":"IF(ISERROR(INDIRECT(CONCATENATE($E$32,\"!P222\"))),\"\",INDIRECT(CONCATENATE($E$32,\"!P222\")))","v":77.600744640097247},{"$f":"IF(ISERROR(INDIRECT(CONCATENATE($E$32,\"!P223\"))),\"\",INDIRECT(CONCATENATE($E$32,\"!P223\")))","v":21.767662833252533},{"$f":"IF(ISERROR(INDIRECT(CONCATENATE($E$32,\"!P224\"))),\"\",INDIRECT(CONCATENATE($E$32,\"!P224\")))","v":0.63159252665018839},{"$f":"IF(ISERROR(INDIRECT(CONCATENATE($E$32,\"!Q222\"))),\"\",INDIRECT(CONCATENATE($E$32,\"!Q222\")))","v":86.668498552584779},{"$f":"IF(ISERROR(INDIRECT(CONCATENATE($E$32,\"!Q223\"))),\"\",INDIRECT(CONCATENATE($E$32,\"!Q223\")))","v":12.642690298770729},{"$f":"IF(ISERROR(INDIRECT(CONCATENATE($E$32,\"!Q224\"))),\"\",INDIRECT(CONCATENATE($E$32,\"!Q224\")))","v":0.68881114864442261}]
[]
[]
[]
[]
[]
[]
[]
[]
[]
[]
[]
[]
[]
[]
[]
[]
[]
[]
[]
[]
[]
[]
[]
[]
[]
[]
[]
[]
[]
[]
[]
[]
[]
[]
[]
[]
[]
[]
[]
[]
[]
[]
[]
[]
[]
[]
[]
[1,"MICS19"]
[null,"Input"]
[null,"Template"]

{"sheet":"MICS19","index":4,"n_rows":1072,"n_cols":74,"rows_kept":1072,"cut":false,"hidden":false,"merged":[[1023,2,1023,3],[1023,7,1023,8],[1023,12,1023,13],[1021,2,1021,3],[1021,7,1021,8],[1021,12,1021,13],[1022,2,1022,3],[1022,7,1022,8],[1022,12,1022,13],[1019,2,1019,3],[1019,7,1019,8],[1019,12,1019,13],[1020,2,1020,3],[1020,7,1020,8],[1020,12,1020,13],[1017,2,1017,3],[1017,7,1017,8],[1017,12,1017,13],[1018,2,1018,3],[1018,7,1018,8],[1018,12,1018,13],[1015,2,1015,3],[1015,7,1015,8],[1015,12,1015,13],[1016,2,1016,3],[1016,7,1016,8],[1016,12,1016,13],[1013,2,1013,3],[1013,7,1013,8],[1013,12,1013,13],[1014,2,1014,3],[1014,7,1014,8],[1014,12,1014,13],[1011,2,1011,3],[1011,7,1011,8],[1011,12,1011,13],[1012,2,1012,3],[1012,7,1012,8],[1012,12,1012,13],[1009,2,1009,3],[1009,7,1009,8],[1009,12,1009,13],[1010,2,1010,3],[1010,7,1010,8],[1010,12,1010,13],[1007,2,1007,3],[1007,7,1007,8],[1007,12,1007,13],[1008,2,1008,3],[1008,7,1008,8],[1008,12,1008,13],[1005,2,1005,3],[1005,7,1005,8],[1005,12,1005,13],[1006,2,1006,3],[1006,7,1006,8],[1006,12,1006,13],[1003,2,1003,3],[1003,7,1003,8],[1003,12,1003,13],[1004,2,1004,3],[1004,7,1004,8],[1004,12,1004,13],[1001,2,1001,3],[1001,7,1001,8],[1001,12,1001,13],[1002,2,1002,3],[1002,7,1002,8],[1002,12,1002,13],[999,2,999,3],[999,7,999,8],[999,12,999,13],[1000,2,1000,3],[1000,7,1000,8],[1000,12,1000,13],[997,2,997,3],[997,7,997,8],[997,12,997,13],[998,2,998,3],[998,7,998,8],[998,12,998,13],[995,2,995,3],[995,7,995,8],[995,12,995,13],[996,2,996,3],[996,7,996,8],[996,12,996,13],[993,2,993,3],[993,7,993,8],[993,12,993,13],[994,2,994,3],[994,7,994,8],[994,12,994,13],[991,2,991,3],[991,7,991,8],[991,12,991,13],[992,2,992,3],[992,7,992,8],[992,12,992,13],[989,2,989,3],[989,7,989,8],[989,12,989,13],[990,2,990,3],[990,7,990,8],[990,12,990,13],[987,2,987,3],[987,7,987,8],[987,12,987,13],[988,2,988,3],[988,7,988,8],[988,12,988,13],[985,2,985,3],[985,7,985,8],[985,12,985,13],[986,2,986,3],[986,7,986,8],[986,12,986,13],[983,2,983,3],[983,7,983,8],[983,12,983,13],[984,2,984,3],[984,7,984,8],[984,12,984,13],[981,2,981,3],[981,7,981,8],[981,12,981,13],[982,2,982,3],[982,7,982,8],[982,12,982,13],[979,2,979,3],[979,7,979,8],[979,12,979,13],[980,2,980,3],[980,7,980,8],[980,12,980,13],[977,2,977,3],[977,7,977,8],[977,12,977,13],[978,2,978,3],[978,7,978,8],[978,12,978,13],[975,2,975,3],[975,7,975,8],[975,12,975,13],[976,2,976,3],[976,7,976,8],[976,12,976,13],[973,2,973,3],[973,7,973,8],[973,12,973,13],[974,2,974,3],[974,7,974,8],[974,12,974,13],[971,2,971,3],[971,7,971,8],[971,12,971,13],[972,2,972,3],[972,7,972,8],[972,12,972,13],[969,2,969,3],[969,7,969,8],[969,12,969,13],[970,2,970,3],[970,7,970,8],[970,12,970,13],[967,2,967,3],[967,7,967,8],[967,12,967,13],[968,2,968,3],[968,7,968,8],[968,12,968,13],[965,2,965,3],[965,7,965,8],[965,12,965,13],[966,2,966,3],[966,7,966,8],[966,12,966,13],[963,2,963,3],[963,7,963,8],[963,12,963,13],[964,2,964,3],[964,7,964,8],[964,12,964,13],[961,2,961,3],[961,7,961,8],[961,12,961,13],[962,2,962,3],[962,7,962,8],[962,12,962,13],[959,2,959,3],[959,7,959,8],[959,12,959,13],[960,2,960,3],[960,7,960,8],[960,12,960,13],[957,2,957,3],[957,7,957,8],[957,12,957,13],[958,2,958,3],[958,7,958,8],[958,12,958,13],[955,2,955,3],[955,7,955,8],[955,12,955,13],[956,2,956,3],[956,7,956,8],[956,12,956,13],[953,2,953,3],[953,7,953,8],[953,12,953,13],[954,2,954,3],[954,7,954,8],[954,12,954,13],[951,2,951,3],[951,7,951,8],[951,12,951,13],[952,2,952,3],[952,7,952,8],[952,12,952,13],[949,2,949,3],[949,7,949,8],[949,12,949,13],[950,2,950,3],[950,7,950,8],[950,12,950,13],[947,2,947,3],[947,7,947,8],[947,12,947,13],[948,2,948,3],[948,7,948,8],[948,12,948,13],[945,2,945,3],[945,7,945,8],[945,12,945,13],[946,2,946,3],[946,7,946,8],[946,12,946,13],[943,2,943,3],[943,7,943,8],[943,12,943,13],[944,2,944,3],[944,7,944,8],[944,12,944,13],[941,2,941,3],[941,7,941,8],[941,12,941,13],[942,2,942,3],[942,7,942,8],[942,12,942,13],[939,2,939,3],[939,7,939,8],[939,12,939,13],[940,2,940,3],[940,7,940,8],[940,12,940,13],[937,2,937,3],[937,7,937,8],[937,12,937,13],[938,2,938,3],[938,7,938,8],[938,12,938,13],[935,2,935,3],[935,7,935,8],[935,12,935,13],[936,2,936,3],[936,7,936,8],[936,12,936,13],[933,2,933,3],[933,7,933,8],[933,12,933,13],[934,2,934,3],[934,7,934,8],[934,12,934,13],[931,2,931,3],[931,7,931,8],[931,12,931,13],[932,2,932,3],[932,7,932,8],[932,12,932,13],[929,2,929,3],[929,7,929,8],[929,12,929,13],[930,2,930,3],[930,7,930,8],[930,12,930,13],[927,2,927,3],[927,7,927,8],[927,12,927,13],[928,2,928,3],[928,7,928,8],[928,12,928,13],[925,2,925,3],[925,7,925,8],[925,12,925,13],[926,2,926,3],[926,7,926,8],[926,12,926,13],[923,2,923,3],[923,7,923,8],[923,12,923,13],[924,2,924,3],[924,7,924,8],[924,12,924,13],[921,2,921,3],[921,7,921,8],[921,12,921,13],[922,2,922,3],[922,7,922,8],[922,12,922,13],[919,2,919,3],[919,7,919,8],[919,12,919,13],[920,2,920,3],[920,7,920,8],[920,12,920,13],[917,2,917,3],[917,7,917,8],[917,12,917,13],[918,2,918,3],[918,7,918,8],[918,12,918,13],[915,2,915,3],[915,7,915,8],[915,12,915,13],[916,2,916,3],[916,7,916,8],[916,12,916,13],[913,2,913,3],[913,7,913,8],[913,12,913,13],[914,2,914,3],[914,7,914,8],[914,12,914,13],[911,2,911,3],[911,7,911,8],[911,12,911,13],[912,2,912,3],[912,7,912,8],[912,12,912,13],[909,2,909,3],[909,7,909,8],[909,12,909,13],[910,2,910,3],[910,7,910,8],[910,12,910,13],[907,2,907,3],[907,7,907,8],[907,12,907,13],[908,2,908,3],[908,7,908,8],[908,12,908,13],[905,2,905,3],[905,7,905,8],[905,12,905,13],[906,2,906,3],[906,7,906,8],[906,12,906,13],[903,2,903,3],[903,7,903,8],[903,12,903,13],[904,2,904,3],[904,7,904,8],[904,12,904,13],[901,2,901,3],[901,7,901,8],[901,12,901,13],[902,2,902,3],[902,7,902,8],[902,12,902,13],[899,2,899,3],[899,7,899,8],[899,12,899,13],[900,2,900,3],[900,7,900,8],[900,12,900,13],[897,2,897,3],[897,7,897,8],[897,12,897,13],[898,2,898,3],[898,7,898,8],[898,12,898,13],[895,2,895,3],[895,7,895,8],[895,12,895,13],[896,2,896,3],[896,7,896,8],[896,12,896,13],[893,2,893,3],[893,7,893,8],[893,12,893,13],[894,2,894,3],[894,7,894,8],[894,12,894,13],[891,2,891,3],[891,7,891,8],[891,12,891,13],[892,2,892,3],[892,7,892,8],[892,12,892,13],[889,2,889,3],[889,7,889,8],[889,12,889,13],[890,2,890,3],[890,7,890,8],[890,12,890,13],[887,2,887,3],[887,7,887,8],[887,12,887,13],[888,2,888,3],[888,7,888,8],[888,12,888,13],[885,2,885,3],[885,7,885,8],[885,12,885,13],[886,2,886,3],[886,7,886,8],[886,12,886,13],[883,2,883,3],[883,7,883,8],[883,12,883,13],[884,2,884,3],[884,7,884,8],[884,12,884,13],[881,2,881,3],[881,7,881,8],[881,12,881,13],[882,2,882,3],[882,7,882,8],[882,12,882,13],[879,2,879,3],[879,7,879,8],[879,12,879,13],[880,2,880,3],[880,7,880,8],[880,12,880,13],[877,2,877,3],[877,7,877,8],[877,12,877,13],[878,2,878,3],[878,7,878,8],[878,12,878,13],[875,2,875,3],[875,7,875,8],[875,12,875,13],[876,2,876,3],[876,7,876,8],[876,12,876,13],[873,2,873,3],[873,7,873,8],[873,12,873,13],[874,2,874,3],[874,7,874,8],[874,12,874,13],[871,2,871,3],[871,7,871,8],[871,12,871,13],[872,2,872,3],[872,7,872,8],[872,12,872,13],[869,2,869,3],[869,7,869,8],[869,12,869,13],[870,2,870,3],[870,7,870,8],[870,12,870,13],[867,2,867,3],[867,7,867,8],[867,12,867,13],[868,2,868,3],[868,7,868,8],[868,12,868,13],[865,2,865,3],[865,7,865,8],[865,12,865,13],[866,2,866,3],[866,7,866,8],[866,12,866,13],[863,2,863,3],[863,7,863,8],[863,12,863,13],[864,2,864,3],[864,7,864,8],[864,12,864,13],[861,2,861,3],[861,7,861,8],[861,12,861,13],[862,2,862,3],[862,7,862,8],[862,12,862,13],[859,2,859,3],[859,7,859,8],[859,12,859,13],[860,2,860,3],[860,7,860,8],[860,12,860,13],[857,2,857,3],[857,7,857,8],[857,12,857,13],[858,2,858,3],[858,7,858,8],[858,12,858,13],[855,2,855,3],[855,7,855,8],[855,12,855,13],[856,2,856,3],[856,7,856,8],[856,12,856,13],[853,2,853,3],[853,7,853,8],[853,12,853,13],[854,2,854,3],[854,7,854,8],[854,12,854,13],[851,2,851,3],[851,7,851,8],[851,12,851,13],[852,2,852,3],[852,7,852,8],[852,12,852,13],[849,2,849,3],[849,7,849,8],[849,12,849,13],[850,2,850,3],[850,7,850,8],[850,12,850,13],[847,2,847,3],[847,7,847,8],[847,12,847,13],[848,2,848,3],[848,7,848,8],[848,12,848,13],[845,2,845,3],[845,7,845,8],[845,12,845,13],[846,2,846,3],[846,7,846,8],[846,12,846,13],[843,2,843,3],[843,7,843,8],[843,12,843,13],[844,2,844,3],[844,7,844,8],[844,12,844,13],[841,2,841,3],[841,7,841,8],[841,12,841,13],[842,2,842,3],[842,7,842,8],[842,12,842,13],[839,2,839,3],[839,7,839,8],[839,12,839,13],[840,2,840,3],[840,7,840,8],[840,12,840,13],[837,2,837,3],[837,7,837,8],[837,12,837,13],[838,2,838,3],[838,7,838,8],[838,12,838,13],[835,2,835,3],[835,7,835,8],[835,12,835,13],[836,2,836,3],[836,7,836,8],[836,12,836,13],[833,2,833,3],[833,7,833,8],[833,12,833,13],[834,2,834,3],[834,7,834,8],[834,12,834,13],[831,2,831,3],[831,7,831,8],[831,12,831,13],[832,2,832,3],[832,7,832,8],[832,12,832,13],[829,2,829,3],[829,7,829,8],[829,12,829,13],[830,2,830,3],[830,7,830,8],[830,12,830,13],[827,2,827,3],[827,7,827,8],[827,12,827,13],[828,2,828,3],[828,7,828,8],[828,12,828,13],[825,2,825,3],[825,7,825,8],[825,12,825,13],[826,2,826,3],[826,7,826,8],[826,12,826,13],[823,2,823,3],[823,7,823,8],[823,12,823,13],[824,2,824,3],[824,7,824,8],[824,12,824,13],[821,2,821,3],[821,7,821,8],[821,12,821,13],[822,2,822,3],[822,7,822,8],[822,12,822,13],[819,2,819,3],[819,7,819,8],[819,12,819,13],[820,2,820,3],[820,7,820,8],[820,12,820,13],[817,2,817,3],[817,7,817,8],[817,12,817,13],[818,2,818,3],[818,7,818,8],[818,12,818,13],[815,2,815,3],[815,7,815,8],[815,12,815,13],[816,2,816,3],[816,7,816,8],[816,12,816,13],[813,2,813,3],[813,7,813,8],[813,12,813,13],[814,2,814,3],[814,7,814,8],[814,12,814,13],[811,2,811,3],[811,7,811,8],[811,12,811,13],[812,2,812,3],[812,7,812,8],[812,12,812,13],[809,2,809,3],[809,7,809,8],[809,12,809,13],[810,2,810,3],[810,7,810,8],[810,12,810,13],[807,2,807,3],[807,7,807,8],[807,12,807,13],[808,2,808,3],[808,7,808,8],[808,12,808,13],[805,2,805,3],[805,7,805,8],[805,12,805,13],[806,2,806,3],[806,7,806,8],[806,12,806,13],[803,2,803,3],[803,7,803,8],[803,12,803,13],[804,2,804,3],[804,7,804,8],[804,12,804,13],[801,2,801,3],[801,7,801,8],[801,12,801,13],[802,2,802,3],[802,7,802,8],[802,12,802,13],[799,2,799,3],[799,7,799,8],[799,12,799,13],[800,2,800,3],[800,7,800,8],[800,12,800,13],[797,2,797,3],[797,7,797,8],[797,12,797,13],[798,2,798,3],[798,7,798,8],[798,12,798,13],[795,2,795,3],[795,7,795,8],[795,12,795,13],[796,2,796,3],[796,7,796,8],[796,12,796,13],[793,2,793,3],[793,7,793,8],[793,12,793,13],[794,2,794,3],[794,7,794,8],[794,12,794,13],[791,2,791,3],[791,7,791,8],[791,12,791,13],[792,2,792,3],[792,7,792,8],[792,12,792,13],[789,2,789,3],[789,7,789,8],[789,12,789,13],[790,2,790,3],[790,7,790,8],[790,12,790,13],[787,2,787,3],[787,7,787,8],[787,12,787,13],[788,2,788,3],[788,7,788,8],[788,12,788,13],[785,2,785,3],[785,7,785,8],[785,12,785,13],[786,2,786,3],[786,7,786,8],[786,12,786,13],[783,2,783,3],[783,7,783,8],[783,12,783,13],[784,2,784,3],[784,7,784,8],[784,12,784,13],[781,2,781,3],[781,7,781,8],[781,12,781,13],[782,2,782,3],[782,7,782,8],[782,12,782,13],[779,2,779,3],[779,7,779,8],[779,12,779,13],[780,2,780,3],[780,7,780,8],[780,12,780,13],[777,2,777,3],[777,7,777,8],[777,12,777,13],[778,2,778,3],[778,7,778,8],[778,12,778,13],[775,2,775,3],[775,7,775,8],[775,12,775,13],[776,2,776,3],[776,7,776,8],[776,12,776,13],[773,2,773,3],[773,7,773,8],[773,12,773,13],[774,2,774,3],[774,7,774,8],[774,12,774,13],[771,2,771,3],[771,7,771,8],[771,12,771,13],[772,2,772,3],[772,7,772,8],[772,12,772,13],[769,2,769,3],[769,7,769,8],[769,12,769,13],[770,2,770,3],[770,7,770,8],[770,12,770,13],[767,2,767,3],[767,7,767,8],[767,12,767,13],[768,2,768,3],[768,7,768,8],[768,12,768,13],[765,2,765,3],[765,7,765,8],[765,12,765,13],[766,2,766,3],[766,7,766,8],[766,12,766,13],[763,2,763,3],[763,7,763,8],[763,12,763,13],[764,2,764,3],[764,7,764,8],[764,12,764,13],[761,2,761,3],[761,7,761,8],[761,12,761,13],[762,2,762,3],[762,7,762,8],[762,12,762,13],[759,2,759,3],[759,7,759,8],[759,12,759,13],[760,2,760,3],[760,7,760,8],[760,12,760,13],[757,2,757,3],[757,7,757,8],[757,12,757,13],[758,2,758,3],[758,7,758,8],[758,12,758,13],[755,2,755,3],[755,7,755,8],[755,12,755,13],[756,2,756,3],[756,7,756,8],[756,12,756,13],[753,2,753,3],[753,7,753,8],[753,12,753,13],[754,2,754,3],[754,7,754,8],[754,12,754,13],[751,2,751,3],[751,7,751,8],[751,12,751,13],[752,2,752,3],[752,7,752,8],[752,12,752,13],[749,2,749,3],[749,7,749,8],[749,12,749,13],[750,2,750,3],[750,7,750,8],[750,12,750,13],[747,2,747,3],[747,7,747,8],[747,12,747,13],[748,2,748,3],[748,7,748,8],[748,12,748,13],[745,2,745,3],[745,7,745,8],[745,12,745,13],[746,2,746,3],[746,7,746,8],[746,12,746,13],[743,2,743,3],[743,7,743,8],[743,12,743,13],[744,2,744,3],[744,7,744,8],[744,12,744,13],[741,2,741,3],[741,7,741,8],[741,12,741,13],[742,2,742,3],[742,7,742,8],[742,12,742,13],[739,2,739,3],[739,7,739,8],[739,12,739,13],[740,2,740,3],[740,7,740,8],[740,12,740,13],[737,2,737,3],[737,7,737,8],[737,12,737,13],[738,2,738,3],[738,7,738,8],[738,12,738,13],[735,2,735,3],[735,7,735,8],[735,12,735,13],[736,2,736,3],[736,7,736,8],[736,12,736,13],[733,2,733,3],[733,7,733,8],[733,12,733,13],[734,2,734,3],[734,7,734,8],[734,12,734,13],[731,2,731,3],[731,7,731,8],[731,12,731,13],[732,2,732,3],[732,7,732,8],[732,12,732,13],[729,2,729,3],[729,7,729,8],[729,12,729,13],[730,2,730,3],[730,7,730,8],[730,12,730,13],[727,2,727,3],[727,7,727,8],[727,12,727,13],[728,2,728,3],[728,7,728,8],[728,12,728,13],[725,2,725,3],[725,7,725,8],[725,12,725,13],[726,2,726,3],[726,7,726,8],[726,12,726,13],[723,2,723,3],[723,7,723,8],[723,12,723,13],[724,2,724,3],[724,7,724,8],[724,12,724,13],[721,2,721,3],[721,7,721,8],[721,12,721,13],[722,2,722,3],[722,7,722,8],[722,12,722,13],[719,2,719,3],[719,7,719,8],[719,12,719,13],[720,2,720,3],[720,7,720,8],[720,12,720,13],[717,2,717,3],[717,7,717,8],[717,12,717,13],[718,2,718,3],[718,7,718,8],[718,12,718,13],[715,2,715,3],[715,7,715,8],[715,12,715,13],[716,2,716,3],[716,7,716,8],[716,12,716,13],[713,2,713,3],[713,7,713,8],[713,12,713,13],[714,2,714,3],[714,7,714,8],[714,12,714,13],[711,2,711,3],[711,7,711,8],[711,12,711,13],[712,2,712,3],[712,7,712,8],[712,12,712,13],[709,2,709,3],[709,7,709,8],[709,12,709,13],[710,2,710,3],[710,7,710,8],[710,12,710,13],[707,2,707,3],[707,7,707,8],[707,12,707,13],[708,2,708,3],[708,7,708,8],[708,12,708,13],[705,2,705,3],[705,7,705,8],[705,12,705,13],[706,2,706,3],[706,7,706,8],[706,12,706,13],[703,2,703,3],[703,7,703,8],[703,12,703,13],[704,2,704,3],[704,7,704,8],[704,12,704,13],[701,2,701,3],[701,7,701,8],[701,12,701,13],[702,2,702,3],[702,7,702,8],[702,12,702,13],[699,2,699,3],[699,7,699,8],[699,12,699,13],[700,2,700,3],[700,7,700,8],[700,12,700,13],[697,2,697,3],[697,7,697,8],[697,12,697,13],[698,2,698,3],[698,7,698,8],[698,12,698,13],[695,2,695,3],[695,7,695,8],[695,12,695,13],[696,2,696,3],[696,7,696,8],[696,12,696,13],[693,2,693,3],[693,7,693,8],[693,12,693,13],[694,2,694,3],[694,7,694,8],[694,12,694,13],[691,2,691,3],[691,7,691,8],[691,12,691,13],[692,2,692,3],[692,7,692,8],[692,12,692,13],[689,2,689,3]],"merged_total":2020,"flags":["merged_cut"]}
[]
[{"$f":"A1026","v":"Tonga"}]
[{"$f":"A1034","v":"2019"}]
["Use of drinking water sources"]
[" by wealth quintile and sub-national region"]
["Notes:"]
["WHO/UNICEF JMP customised wealth index excludes water,"]
[" sanitation and hygiene assets."]
["Survey used for analysis:",{"$f":"A1025","v":"MICS19"}]
[{"$f":"B1028","v":""}]
[{"$f":"B1027","v":""}]
[]
[]
["Use of drinking water sources",null,"NATIONAL wealth index quintile",null,null,null,null,"URBAN wealth index quintile",null,null,null,null,"RURAL wealth index quintile",null,null,null,null,"SUB-REGIONS:",null,null,null,null,null,null,null,null,null,null,null,null,null,null,null,null,null,null,null,null,null,null,null,null,null,null,null,null,null,null,null,null,null,null,"Raw numbers of respondents:","Use of drinking water sources","NATIONAL wealth index quintile",null,null,null,null,"URBAN wealth index quintile",null,null,null,null,"RURAL wealth index quintile",null,null,null,null,"SUB-REGIONS:"]
["Weighted percentage (used in graphs)",null,"Poorest","Poor","Middle","Rich","Richest","Poorest","Poor","Middle","Rich","Richest","Poorest","Poor","Middle","Rich","Richest","'EUA","HA'APAI","ONGO NIUA","TONGATAPU","VAVA'U",null,null,null,null,null,null,null,null,null,null,null,null,null,null,null,null,null,null,null,null,null,null,null,null,null,null,null,null,null,null,"Water data, raw numbers (weighted)",null,"Poorest","Poor","Middle","Rich","Richest","Poorest","Poor","Middle","Rich","Richest","Poorest","Poor","Middle","Rich","Richest","'EUA","HA'APAI","ONGO NIUA","TONGATAPU","VAVA'U"]
["Water","Improved",99.494255864254995,98.454752121486351,98.373637240206094,99.334421920208626,99.509725136318366,98.119595934795825,97.909937345536662,100,100,100,99.422651096569922,98.582429040163746,98.403235234758185,99.128999331447602,99.36652626577343,99.952830744850203,99.712981554224925,97.301327930055663,98.872785405822441,99.264516867406144,null,null,null,null,null,null,null,null,null,null,null,null,null,null,null,null,null,null,null,null,null,null,null,null,null,null,null,null,null,null,"Water","Improved",2633.6790373198028,2606.4901900873415,2600.3476711925628,2636.5261912161923,2627.1917254856767,600.15372533022708,594.64760774395666,609.06444841336338,610.80481006524542,611.66631836864929,2032.1377812094702,2000.3319630837034,2004.5040641482383,2010.5439238488257,2030.3801730899011,719.37020486045014,937.88220610505698,158.18760564774257,9226.8284550838544,2061.9663436044843]
[null,"Not Improved",0.505744135744983,1.5452478785136396,1.6263627597939139,0.66557807979138761,0.49027486368164519,1.8804040652041971,2.0900626544633343,0,0,0,0.57734890343006084,1.4175709598362471,1.5967647652418184,0.87100066855241887,0.63347373422656261,4.7169255149793421E-2,0.28701844577505919,2.6986720699443612,1.1272145941775713,0.73548313259384246,null,null,null,null,null,null,null,null,null,null,null,null,null,null,null,null,null,null,null,null,null,null,null,null,null,null,null,null,null,null,null,"Not Improved",13.387383191008059,40.908877934395768,42.990263790062883,17.665719553680457,12.94392144399497,11.50159144161533,12.693816288794331,0,0,0,11.800656154908767,28.763873324164337,32.52658770598395,17.665719553680457,12.94392144399497,0.33948169839071812,2.6996434057081045,4.3873653346212,105.19189532138881,15.277780153033309]
["Water ladder","Basic",99.494255864254995,98.454752121486351,98.373637240206094,99.334421920208626,99.509725136318366,98.119595934795825,97.909937345536662,100,100,100,99.422651096569922,98.582429040163746,98.403235234758185,99.128999331447602,99.36652626577343,99.952830744850203,99.712981554224925,97.301327930055663,98.872785405822441,99.264516867406144,null,null,null,null,null,null,null,null,null,null,null,null,null,null,null,null,null,null,null,null,null,null,null,null,null,null,null,null,null,null,"Water ladder","Basic",2633.6790373198028,2606.4901900873415,2600.3476711925628,2636.5261912161923,2627.1917254856767,600.15372533022708,594.64760774395666,609.06444841336338,610.80481006524542,611.66631836864929,2032.1377812094702,2000.3319630837034,2004.5040641482383,2010.5439238488257,2030.3801730899011,719.37020486045014,937.88220610505698,158.18760564774257,9226.8284550838544,2061.9663436044843]
[null,"Limited",0,0,0,0,0,0,0,0,0,0,0,0,0,0,0,0,0,0,0,0,null,null,null,null,null,null,null,null,null,null,null,null,null,null,null,null,null,null,null,null,null,null,null,null,null,null,null,null,null,null,null,"Limited","N/A","N/A","N/A","N/A","N/A","N/A","N/A","N/A","N/A","N/A","N/A","N/A","N/A","N/A","N/A","N/A","N/A","N/A","N/A","N/A"]
[null,"Unimproved",0.505744135744983,1.5452478785136396,1.6263627597939139,0.66557807979138761,0.49027486368164519,1.8804040652041971,2.0900626544633343,0,0,0,0.57734890343006084,1.4175709598362471,1.5967647652418184,0.87100066855241887,0.63347373422656261,4.7169255149793421E-2,0.28701844577505919,2.6986720699443612,1.1272145941775713,0.73548313259384246,null,null,null,null,null,null,null,null,null,null,null,null,null,null,null,null,null,null,null,null,null,null,null,null,null,null,null,null,null,null,null,"Unimproved",13.387383191008059,40.908877934395768,42.990263790062883,17.665719553680457,12.94392144399497,11.50159144161533,12.693816288794331,0,0,0,11.800656154908767,28.763873324164337,32.52658770598395,17.665719553680457,12.94392144399497,0.33948169839071812,2.6996434057081045,4.3873653346212,105.19189532138881,15.277780153033309]
[null,"Surface water",0,0,0,0,0,0,0,0,0,0,0,0,0,0,0,0,0,0,0,0,null,null,null,null,null,null,null,null,null,null,null,null,null,null,null,null,null,null,null,null,null,null,null,null,null,null,null,null,null,null,null,"Surface water","N/A","N/A","N/A","N/A","N/A","N/A","N/A","N/A","N/A","N/A","N/A","N/A","N/A","N/A","N/A","N/A","N/A","N/A","N/A","N/A"]
["Improved water point at more than 30 minutes","Yes",0,0,0,0,0,0,0,0,0,0,0,0,0,0,0,0,0,0,0,0,null,null,null,null,null,null,null,null,null,null,null,null,null,null,null,null,null,null,null,null,null,null,null,null,null,null,null,null,null,null,"Improved water point at more than 30 minutes","Yes","N/A","N/A","N/A","N/A","N/A","N/A","N/A","N/A","N/A","N/A","N/A","N/A","N/A","N/A","N/A","N/A","N/A","N/A","N/A","N/A"]
[null,"No",100,100,100,100,100,100,100,100,100,100,100,100,100,100,100,100,100,100,100,100,null,null,null,null,null,null,null,null,null,null,null,null,null,null,null,null,null,null,null,null,null,null,null,null,null,null,null,null,null,null,null,"No","N/A","N/A","N/A","N/A","N/A","N/A","N/A","N/A","N/A","N/A","N/A","N/A","N/A","N/A","N/A","N/A","N/A","N/A","N/A","N/A"]
["Manually calculated ratios","Improved wells"]
[null,"Improved springs"]
[null,"Other"]
[null,null,"NATIONAL wealth index quintile",null,null,null,null,"URBAN wealth index quintile",null,null,null,null,"RURAL wealth index quintile",null,null,null,null,"SUB-REGIONS:",null,null,null,null,null,null,null,null,null,null,null,null,null,null,null,null,null,null,null,null,null,null,null,null,null,null,null,null,null,null,null,null,null,null,"Raw numbers of respondents:","Use of drinking water sources","NATIONAL wealth index quintile",null,null,null,null,"URBAN wealth index quintile",null,null,null,null,"RURAL wealth index quintile",null,null,null,null,"SUB-REGIONS:"]
["Percentage based on weighted population",null,"Poorest","Poor","Middle","Rich","Richest","Poorest","Poor","Middle","Rich","Richest","Poorest","Poor","Middle","Rich","Richest","'EUA","HA'APAI","ONGO NIUA","TONGATAPU","VAVA'U",null,null,null,null,null,null,null,null,null,null,null,null,null,null,null,null,null,null,null,null,null,null,null,null,null,null,null,null,null,null,"Water data, raw numbers (weighted)",null,"Poorest","Poor","Middle","Rich","Richest","Poorest","Poor","Middle","Rich","Richest","Poorest","Poor","Middle","Rich","Richest","'EUA","HA'APAI","ONGO NIUA","TONGATAPU","VAVA'U"]
["Piped water","Yes",99.425535285245914,98.454752121486351,98.373637240206094,99.334421920208626,99.509725136318366,98.119595934795825,97.909937345536662,100,100,100,99.33365236071387,98.582429040163746,98.403235234758185,99.128999331447602,99.36652626577343,99.700078919370711,99.712981554224925,97.301327930055663,98.872785405822441,99.264516867406144,null,null,null,null,null,null,null,null,null,null,null,null,null,null,null,null,null,null,null,null,null,null,null,null,null,null,null,null,null,null,"Piped water","Yes",2631.8599579488728,2606.4901900873415,2600.3476711925628,2636.5261912161923,2627.1917254856767,600.15372533022708,594.64760774395666,609.06444841336338,610.80481006524542,611.66631836864929,2030.3187018385399,2000.3319630837034,2004.5040641482383,2010.5439238488257,2030.3801730899011,717.5511254895199,937.88220610505698,158.18760564774257,9226.8284550838544,2061.9663436044843]
[null,"No",0.57446471475407546,1.5452478785136396,1.6263627597939139,0.66557807979138761,0.49027486368164519,1.8804040652041971,2.0900626544633343,0,0,0,0.66634763928611518,1.4175709598362471,1.5967647652418184,0.87100066855241887,0.63347373422656261,0.29992108062929762,0.28701844577505919,2.6986720699443612,1.1272145941775713,0.73548313259384246,null,null,null,null,null,null,null,null,null,null,null,null,null,null,null,null,null,null,null,null,null,null,null,null,null,null,null,null,null,null,null,"No",15.206462561938347,40.908877934395768,42.990263790062883,17.665719553680457,12.94392144399497,11.50159144161533,12.693816288794331,0,0,0,13.619735525839054,28.763873324164337,32.52658770598395,17.665719553680457,12.94392144399497,2.158561069321006,2.6996434057081045,4.3873653346212,105.19189532138881,15.277780153033309]
["Piped water on premises","Yes",10.928407151357792,17.950744849195253,24.5266357563581,27.312099637566767,38.907474846577983,23.216706990183532,33.294311193338174,37.139180844493161,48.493895813969019,51.916192115903968,7.8228113979218588,17.353491032195187,18.361502247300507,23.458956309505503,30.291038508758479,5.966277583020303,4.4170658175089947,0.27565771271074863,31.480279116712325,6.8493329353066361,null,null,null,null,null,null,null,null,null,null,null,null,null,null,null,null,null,null,null,null,null,null,null,null,null,null,null,null,null,null,"Piped water on premises","Yes",289.28219600029422,475.22785184055522,648.32186712282646,724.91553924170478,1027.2101127447008,142.00622268479754,202.21014372351564,226.20154695575377,296.20304821975145,317.55386095254477,159.89344904464659,352.11896400568526,374.02942891841315,475.79681411097118,618.94408833400291,42.939877691985814,41.546119360433899,0.44815044645014723,2937.7460535359655,142.27736591524541]
[null,"No",89.071592848642283,82.049255150804825,75.473364243641853,72.687900362433297,61.092525153422031,76.783293009816504,66.705688806661826,62.860819155506874,51.506104186030996,48.083807884095997,92.177188602078104,82.646508967804834,81.63849775269945,76.54104369049449,69.708961491241467,94.033722416979685,95.582934182491002,99.724342287289261,68.519720883287633,93.150667064693323,null,null,null,null,null,null,null,null,null,null,null,null,null,null,null,null,null,null,null,null,null,null,null,null,null,null,null,null,null,null,null,"No",2357.7842245105194,2172.1712161811843,1995.0160678597977,1929.2763715281694,1612.925534184971,469.64909408704494,405.13128030923531,382.86290145760984,314.60176184549408,294.11245741610429,1884.0449883197321,1676.9768724021831,1663.0012229358081,1552.4128292915345,1424.380006199892,676.76980886685499,899.03573015033123,162.12682053591359,6394.2742968692728,1934.9667578422718]
["Piped water into dwelling","Yes",19.408934200179555,44.167501094511934,58.016236628230999,66.007672831584685,73.762834274963694,48.186636420086927,76.648707534069288,81.985327704296523,84.002862001560871,83.680351789688004,16.389474954653259,36.829547798077073,52.533983150010755,54.553802211603951,67.17477455798047,45.772400422666891,6.0322118171435211,10.402373578047014,61.166402529174434,38.748103426496797,null,null,null,null,null,null,null,null,null,null,null,null,null,null,null,null,null,null,null,null,null,null,null,null,null,null,null,null,null,null,"Piped water into dwelling","Yes",513.76737979199163,1169.2900123445997,1533.565191243315,1751.9703127833634,1947.4388818789744,294.73612363697862,465.51935184011489,499.34348396206195,513.09352169800411,511.84452698991873,334.99077828036616,747.30682093862742,1070.1333394056512,1106.4654772984809,1372.5983539920403,329.42839961243345,56.737889476095468,16.911655825987005,5708.0611316333452,804.89270149439017]
[null,"No",80.59106579982047,55.832498905488201,41.983763371768944,33.992327168415379,26.237165725036338,51.813363579913094,23.351292465930729,18.014672295703495,15.997137998439134,16.319648210311964,83.610525045346691,63.170452201922977,47.466016849989231,45.44619778839602,32.825225442019494,54.227599577333088,93.967788182856452,89.597626421953024,38.833597470825531,61.251896573503174,null,null,null,null,null,null,null,null,null,null,null,null,null,null,null,null,null,null,null,null,null,null,null,null,null,null,null,null,null,null,null,"No",2133.2990407188204,1478.1090556771414,1109.7727437393091,902.22159798651057,692.69676505069822,316.9191931348638,141.82207219263617,109.72096445130148,97.711288367241352,99.821791378730367,1708.947659084012,1281.7890154692413,966.89731244857057,921.74416610402443,670.72574054185486,390.28128694640725,883.84396003466941,145.6633151563768,3623.959218771894,1272.3514222631272]
["Water source on premises","Yes",99.425727515819801,98.454752121486351,98.462475439816359,99.634034024371132,99.651103245447885,98.119595934795825,97.909937345536662,100,100,100,99.333901314932774,98.582429040163746,98.518515475088194,99.521083071816179,99.549197916642186,100,99.168894413538311,97.890435138671378,99.019497746702271,99.377565391852357,null,null,null,null,null,null,null,null,null,null,null,null,null,null,null,null,null,null,null,null,null,null,null,null,null,null,null,null,null,null,"Water source on premises","Yes",2631.865046419844,2606.4901900873415,2602.6959650236163,2644.4784714485609,2630.9242993417606,600.15372533022708,594.64760774395666,609.06444841336338,610.80481006524542,611.66631836864929,2030.3237903095114,2000.3319630837034,2006.8523579792918,2018.4962040811945,2034.112746945985,719.70968655884087,932.76462121423651,159.14534652120457,9240.5196805913165,2064.3146374355379]
[null,"No",0.57427248418018961,1.5452478785136396,1.537524560183654,0.36596597562887306,0.34889675455210839,1.8804040652041971,2.0900626544633343,0,0,0,0.66609868506722769,1.4175709598362471,1.4814845249118045,0.47891692818383469,0.45080208335781125,0,0.83110558646169319,2.1095648613286482,0.98050225329773999,0.62243460814762708,null,null,null,null,null,null,null,null,null,null,null,null,null,null,null,null,null,null,null,null,null,null,null,null,null,null,null,null,null,null,null,"No",15.201374090967063,40.908877934395768,40.641969959009295,9.7134393213115899,9.2113475879109359,11.50159144161533,12.693816288794331,0,0,0,13.61464705486777,28.763873324164337,30.178293874930354,9.7134393213115899,9.2113475879109359,0,7.8172282965286852,3.4296244611591917,91.500669813927061,12.929486321979716]
["Improved water source on premises","Yes",99.78785994752424,100,100,100,100,100,100,100,100,100,99.725063519635555,100,100,100,100,100,99.404286801109492,100,100,100,null,null,null,null,null,null,null,null,null,null,null,null,null,null,null,null,null,null,null,null,null,null,null,null,null,null,null,null,null,null,"Improved water source on premises","Yes",2628.0919492279895,2606.4901900873415,2600.3476711925628,2636.5261912161923,2627.1917254856767,600.15372533022708,594.64760774395666,609.06444841336338,610.80481006524542,611.66631836864929,2026.5506931176569,2000.3319630837034,2004.5040641482383,2010.5439238488257,2030.3801730899011,719.37020486045014,932.29511801324372,158.18760564774257,9226.8284550838544,2061.9663436044843]
[null,"No",0.21214005247575901,0,0,0,0,0,0,0,0,0,0.27493648036443763,0,0,0,0,0,0.59571319889050711,0,0,0,null,null,null,null,null,null,null,null,null,null,null,null,null,null,null,null,null,null,null,null,null,null,null,null,null,null,null,null,null,null,null,"No",5.5870880918132944,0,0,0,0,0,0,0,0,0,5.5870880918132944,0,0,0,0,0,5.5870880918132944,0,0,0]
["Piped water on premises available when needed","Yes",96.379299177013181,92.491909397497267,91.993123046401749,93.615824497099482,97.69929044972497,83.12510745618124,92.378174909017915,97.012940770555474,100,97.875193792049913,97.467151366241083,94.847955984453165,91.845458988186508,94.766202037214711,93.940579228363319,100,78.424134514874723,100,95.039945743935391,90.65193324032181,null,null,null,null,null,null,null,null,null,null,null,null,null,null,null,null,null,null,null,null,null,null,null,null,null,null,null,null,null,null,"Piped water on premises available when needed","Yes",278.80815314895722,439.54731415603891,596.41153295903098,678.63565896871671,1003.5769915793926,118.04282520120198,186.79804025268581,219.44477277026562,296.20304821975145,310.80645680143988,155.84359000504926,333.97763999302487,343.52904574100938,450.89457014703385,581.43966168067504,42.939877691985814,32.582184532937092,0.44815044645014723,2792.0322553751848,128.97718276557666]
[null,"No",3.620700822986811,7.5080906025027154,8.0068769535982547,6.3841755029005052,2.3007095502750388,16.874892543818731,7.6218250909820675,2.9870592294445379,0,2.1248062079501064,2.5328486337588956,5.152044015546827,8.1545410118134871,5.2337979627852906,6.0594207716366739,0,21.575865485125284,0,4.9600542560645655,9.348066759678181,null,null,null,null,null,null,null,null,null,null,null,null,null,null,null,null,null,null,null,null,null,null,null,null,null,null,null,null,null,null,null,"No",10.474042851336971,35.680537684516253,51.910334163795497,46.279880272988009,23.633121165308324,23.963397483595521,15.412103470829816,6.7567741854881636,0,6.7474041511049201,4.0498590395973073,18.141324012660395,30.500383177403776,24.902243963937327,37.504426653327819,0,8.9639348274968107,0,145.71379816077948,13.300183149668751]
["Water point at more than 30 minutes","Yes",1.587839999661075E-2,0.1186636551368125,0,0.1441398786003219,0,0,0,0,0,0,2.0574382522386109E-2,0.15482066808178674,0,0.18875660595857016,0,0,0,0.25808506282212185,4.1029982500439661E-2,0.15060116820109715,null,null,null,null,null,null,null,null,null,null,null,null,null,null,null,null,null,null,null,null,null,null,null,null,null,null,null,null,null,null,"Water point at more than 30 minutes","Yes",0.4195817159928798,3.1194741871289793,0,3.8172502382168401,0,0,0,0,0,0,0.4195817159928798,3.1194741871289793,0,3.8172502382168401,0,0,0,0.4195817159928798,3.8172502382168401,3.1194741871289793]
[null,"No",99.984121600003405,99.8813363448632,100,99.855860121399687,100,100,100,100,100,100,99.979425617477631,99.845179331918217,100,99.811243394041441,100,100,100,99.741914937177881,99.958970017499553,99.849398831798894,null,null,null,null,null,null,null,null,null,null,null,null,null,null,null,null,null,null,null,null,null,null,null,null,null,null,null,null,null,null,null,"No",2642.048904292923,2625.7176230120108,2643.3379349826255,2644.4784714485609,2634.8381223935166,607.29399699267378,607.34142403275098,609.06444841336338,610.80481006524542,611.66631836864929,2038.9209211464911,2011.7757111773094,2037.030651854222,2018.4962040811945,2038.026569997741,719.70968655884087,940.58184951076521,162.15538926637086,9299.7456703063781,2068.2284604872939]
["Water source available when needed","Yes",87.00647395538769,88.975952114739158,88.491314045090164,94.701220257427394,96.48589904416086,85.965756997639218,93.540723054690275,95.998098972040125,100,96.239605623026279,84.731254436418141,91.562858830300769,88.320720323178023,91.394009450246955,94.84945507118735,90.193734786782059,86.389401506479075,72.44814516018549,93.253861301236554,85.534239170383501,null,null,null,null,null,null,null,null,null,null,null,null,null,null,null,null,null,null,null,null,null,null,null,null,null,null,null,null,null,null,"Water source available when needed","Yes",2303.1191557435523,2355.5485270490722,2339.1244733184762,2513.5521274729977,2547.3586149254661,525.81412327922237,568.11155945088774,584.69029199137083,610.80481006524542,588.66525252687245,1731.8546778869611,1857.8981562216468,1799.1201449215778,1853.6621131621062,1938.0817690036733,649.13304592966131,812.56303047092183,117.78255097143233,8702.4693141700736,1776.7549569674925]
[null,"No",12.993526044612416,11.024047885260876,11.508685954909858,5.2987797425725924,3.5141009558391318,14.034243002360776,6.4592769453097247,4.0019010279598506,0,3.7603943769736885,15.268745563581895,8.4371411696992187,11.679279676821974,8.6059905497530416,5.1505449288126304,9.8062652132179196,13.610598493520953,27.551854839814599,6.7461386987635539,14.465760829616478,null,null,null,null,null,null,null,null,null,null,null,null,null,null,null,null,null,null,null,null,null,null,null,null,null,null,null,null,null,null,null,"No",343.94726476726191,291.85054097266652,304.21346166414969,140.63978329687441,92.777032004205239,85.841193492619922,39.229864581863261,24.374156421992382,0,23.001065841776668,312.08375947741877,171.19768018622091,237.91050693264432,174.54753024039951,105.24232553022217,70.576640629179337,128.01881903984372,44.792420010931565,629.55103623517823,300.48916679002508]
["Improved water source available when needed","Yes",87.076854791747266,88.922610647697837,88.788641143009158,94.665716435306862,96.468585406074467,85.96118579282988,93.402838240500444,95.998098972040125,100,96.239605623026279,84.741320646385503,91.597484362546339,88.76373671454725,91.318392591679384,94.816619718559352,90.189107061659485,86.350224131930787,71.683988876678058,93.35330890730053,85.578344014913938,null,null,null,null,null,null,null,null,null,null,null,null,null,null,null,null,null,null,null,null,null,null,null,null,null,null,null,null,null,null,"Improved water source available when needed","Yes",2293.3248710076518,2317.7591233018056,2308.8133622457603,2495.8864079193172,2534.4146934814717,515.89925887370646,555.41774316209342,584.69029199137083,610.80481006524542,588.66525252687245,1722.0603931510609,1832.2537570846116,1779.2727099329416,1835.9963936084262,1925.1378475596784,648.79356423127058,809.86338706521371,113.39518563681112,8613.5496700211352,1764.5966510015878]
[null,"No",12.923145208252846,11.077389352302239,11.211358856990829,5.3342835646931031,3.5314145939255339,14.038814207170116,6.5971617594995617,4.0019010279598506,0,3.7603943769736885,15.258679353614536,8.4025156374536589,11.236263285452749,8.681607408320609,5.1833802814406349,9.8108929383404799,13.649775868069266,28.316011123322021,6.6466910926995109,14.421655985086051,null,null,null,null,null,null,null,null,null,null,null,null,null,null,null,null,null,null,null,null,null,null,null,null,null,null,null,null,null,null,null,"No",340.35416631215378,288.73106678553756,291.53430894680213,140.63978329687441,92.777032004205239,84.254466456520632,39.229864581863261,24.374156421992382,0,23.001065841776668,310.07738805840995,168.07820599909192,225.2313542152967,174.54753024039951,105.24232553022217,70.576640629179337,128.01881903984372,44.792420010931565,613.27878506272248,297.36969260289612]
["Microbiological quality at point of collection","Not contaminated (No E. coli in 100 mL)",19.145408868373949,24.639670786129177,34.117623255968859,23.656566779630797,43.191167620883917,18.43824672471013,67.662645934418379,30.597142139315913,66.514946025341004,54.955924858990436,18.577891025580055,24.263092770113467,22.412510949619929,17.497816203266737,33.354954505908275,30.762803567083342,10.109664912193608,15.003517499165634,32.885669928403594,25.360536169474369,null,null,null,null,null,null,null,null,null,null,null,null,null,null,null,null,null,null,null,null,null,null,null,null,null,null,null,null,null,null,"Microbiological quality at point of collection","Not contaminated (No E. coli in 100 mL)",112.31494720521549,140.41674975550862,174.66014052739121,116.01655707612613,256.8898325964073,19.981304383041795,105.13163057229937,28.120734404816623,84.75211887423707,75.630611522074176,89.228966943216378,94.008288777518757,87.266569815184653,83.819315653989975,132.35868621426991,50.41207162711725,24.948551066624155,6.1641338481201702,589.94576569513447,128.82770492365253]
[null,"Contaminated (E. coli detected in 100 mL)",58.204357727498369,62.071416430690938,56.879238539691968,58.777437011472578,38.226587861287392,63.0083570355538,20.719007967980708,49.13625224451156,12.645772268815108,28.257450887892503,55.793143437548295,60.972430690933088,69.428618955019203,68.288707093189615,50.322170270017672,45.622418543090326,81.999068674322757,60.276208872991319,50.071811925072495,59.421083399166719,null,null,null,null,null,null,null,null,null,null,null,null,null,null,null,null,null,null,null,null,null,null,null,null,null,null,null,null,null,null,null,"Contaminated (E. coli detected in 100 mL)",341.45101889551199,353.73307636987033,291.18487304638268,288.2563619375855,227.36180328845219,68.281392444734522,32.192401899646441,45.159364646690406,16.11301006205175,38.888041574950726,267.97253491219078,236.24003444939555,270.33104130230356,327.12154642350771,199.68776582233147,74.763037327896257,202.35665276793742,24.764234078510562,898.25305338742828,301.85015597603041]
[null,"Highly contaminated (>100 CFU/100 mL)",22.650233404127672,13.288912783179835,9.0031382043391623,17.565996208896614,18.582244517828688,18.553396239736088,11.618346097600931,20.266605616172509,20.839281705843888,16.786624253117061,25.628965536871618,14.764476538953408,8.1588700953608519,14.213476703543632,16.322875224074082,23.614777889826357,7.8912664134836632,24.720273627843024,17.042518146523943,15.218380431358888,null,null,null,null,null,null,null,null,null,null,null,null,null,null,null,null,null,null,null,null,null,null,null,null,null,null,null,null,null,null,null,"Highly contaminated (>100 CFU/100 mL)",132.87570855552434,75.730960733817639,46.090238237280978,86.147175148137663,110.52235784295816,20.106090516107788,18.052141664368044,18.626309320805543,26.553028844291845,23.101834077255628,123.09503352827141,57.205533823474788,31.767819696342595,68.086432987708278,64.772216059092813,38.698354389071731,19.474004806991658,10.156223393124552,305.73077693759979,77.307080990931041]
["Microbiological quality of improved water sources at point of collection","Not contaminated (No E. coli in 100 mL)",18.926123199116436,24.88214979661937,33.814022120852627,23.953827919759661,42.814869253278054,18.171339590545433,67.662645934418379,30.597142139315913,66.514946025341004,54.955924858990436,18.577891025580055,24.263092770113467,21.941735357292465,17.722984933206217,32.691086603462502,30.762803567083342,10.109664912193608,15.003517499165634,33.04082316232806,24.428944016835668,null,null,null,null,null,null,null,null,null,null,null,null,null,null,null,null,null,null,null,null,null,null,null,null,null,null,null,null,null,null,"Microbiological quality of improved water sources at point of collection","Not contaminated (No E. coli in 100 mL)",110.7282201691162,140.41674975550862,172.31184669633762,116.01655707612613,252.9760095446513,18.394577346942505,105.13163057229937,28.120734404816623,84.75211887423707,75.630611522074176,89.228966943216378,94.008288777518757,84.918275984131057,83.819315653989975,128.44486316251394,50.41207162711725,24.948551066624155,6.1641338481201702,588.35903865903515,122.56558804084295]
[null,"Contaminated (E. coli detected in 100 mL)",58.362213717607837,61.698161223955076,57.14135114458918,59.516016201878465,38.479798533095419,61.966578682028114,20.719007967980708,49.13625224451156,12.645772268815108,28.257450887892503,55.793143437548295,60.972430690933088,69.849889183158737,69.167472835540494,50.823441945593885,45.622418543090326,81.999068674322757,60.276208872991319,50.131849207750832,60.16273147854794,null,null,null,null,null,null,null,null,null,null,null,null,null,null,null,null,null,null,null,null,null,null,null,null,null,null,null,null,null,null,null,"Contaminated (E. coli detected in 100 mL)",341.45101889551199,348.17953174352289,291.18487304638268,288.2563619375855,227.36180328845219,62.727847818387005,32.192401899646441,45.159364646690406,16.11301006205175,38.888041574950726,267.97253491219078,236.24003444939555,270.33104130230356,327.12154642350771,199.68776582233147,74.763037327896257,202.35665276793742,24.764234078510562,892.69950876108078,301.85015597603041]
[null,"Highly contaminated (>100 CFU/100 mL)",22.711663083275731,13.419688979425521,9.0446267345581841,16.53015587836186,18.705332213626548,19.862081727426464,11.618346097600931,20.266605616172509,20.839281705843888,16.786624253117061,25.628965536871618,14.764476538953408,8.208375459548785,13.109542231253272,16.485471450943653,23.614777889826357,7.8912664134836632,24.720273627843024,16.827327629921143,15.408324504616367,null,null,null,null,null,null,null,null,null,null,null,null,null,null,null,null,null,null,null,null,null,null,null,null,null,null,null,null,null,null,null,"Highly contaminated (>100 CFU/100 mL)",132.87570855552434,75.730960733817639,46.090238237280978,80.061181843810814,110.52235784295816,20.106090516107788,18.052141664368044,18.626309320805543,26.553028844291845,23.101834077255628,123.09503352827141,57.205533823474788,31.767819696342595,62.00043968338143,64.772216059092813,38.698354389071731,19.474004806991658,10.156223393124552,299.64478363327294,77.307080990931041]
["Microbiological quality of piped on premises at point of collection","Not contaminated (No E. coli in 100 mL)",17.216461366053252,30.077252874462967,80.593663425202607,53.022855048161134,59.322634747862161,3.5651868136880336,96.31353410735683,49.885706832184681,89.61701555280743,33.05138081182384,35.975888198394571,39.302298403890063,22.929929823425141,50.282742622446285,58.864643557266916,55.774833430446122,6.2535205612358578,0,56.644780678165716,51.438335174149998,null,null,null,null,null,null,null,null,null,null,null,null,null,null,null,null,null,null,null,null,null,null,null,null,null,null,null,null,null,null,"Microbiological quality of piped on premises at point of collection","Not contaminated (No E. coli in 100 mL)",8.494452971029574,30.910061971502337,103.48846616130341,32.893188631868547,119.50063030463404,0.71317178778856294,65.93708011479778,14.620745157276339,54.468032257411608,17.939351333203074,8.494452971029574,30.196890183713776,9.4196106130572677,37.269519764585624,56.227945857474296,4.1220860769023178,1.4274703091720782,0,276.99066661032293,12.746577043940601]
[null,"Contaminated (E. coli detected in 100 mL)",82.783538633946748,63.183607481856619,19.406336574797386,43.140508806084718,25.763369728542447,61.812641862080675,3.6864658926431657,41.993469068830478,0,44.028210877809002,64.024111801605429,60.697701596109951,77.070070176574845,49.717257377553722,29.314002054387789,44.22516656955387,93.74647943876414,0,35.997364029265469,34.965178748019021,null,null,null,null,null,null,null,null,null,null,null,null,null,null,null,null,null,null,null,null,null,null,null,null,null,null,null,null,null,null,null,"Contaminated (E. coli detected in 100 mL)",40.844681189133013,64.933098478068302,24.919229633973362,26.762589312559918,51.898216160115865,12.364859012566644,2.5237864974691533,12.307649796178076,0,23.89726311303798,15.117064065563397,46.635487081848268,31.66036950722301,36.850382652886054,28.000953047077889,3.2684982124129616,21.399196608989826,0,176.02564153848149,8.6644784139661617]
[null,"Highly contaminated (>100 CFU/100 mL)",0,6.7391396436804278,0,3.8366361457541567,14.913995523595396,34.622171324231296,0,8.1208240989848584,10.382984447192577,22.920408310367151,0,0,0,0,11.82135438834529,0,0,0,7.3578552925688285,13.596486077830974,null,null,null,null,null,null,null,null,null,null,null,null,null,null,null,null,null,null,null,null,null,null,null,null,null,null,null,null,null,null,null,"Highly contaminated (>100 CFU/100 mL)",0,6.9257396907293032,0,2.380090554148937,30.043032866040527,6.9257396907293032,0,2.380090554148937,6.3106400978577506,12.440547029522252,0,0,0,0,11.291845738660523,0,0,0,35.979612206293197,3.3692509046255719]
[null,null,"NATIONAL wealth index quintile",null,null,null,null,"URBAN wealth index quintile",null,null,null,null,"RURAL wealth index quintile",null,null,null,null,"SUB-REGIONS:",null,null,null,null,null,null,null,null,null,null,null,null,null,null,null,null,null,null,null,null,null,null,null,null,null,null,null,null,null,null,null,null,null,null,"Raw numbers of respondents:","Use of drinking water sources","NATIONAL wealth index quintile",null,null,null,null,"URBAN wealth index quintile",null,null,null,null,"RURAL wealth index quintile",null,null,null,null,"SUB-REGIONS:"]
["Percentage based on weighted population",null,"Poorest","Poor","Middle","Rich","Richest","Poorest","Poor","Middle","Rich","Richest","Poorest","Poor","Middle","Rich","Richest","'EUA","HA'APAI","ONGO NIUA","TONGATAPU","VAVA'U",null,null,null,null,null,null,null,null,null,null,null,null,null,null,null,null,null,null,null,null,null,null,null,null,null,null,null,null,null,null,"Water data, raw numbers (weighted)",null,"Poorest","Poor","Middle","Rich","Richest","Poorest","Poor","Middle","Rich","Richest","Poorest","Poor","Middle","Rich","Richest","'EUA","HA'APAI","ONGO NIUA","TONGATAPU","VAVA'U"]
["Main source of drinking water","PIPED INTO DWELLING",1.484556807631968,3.1221914401119362,3.5814165478391584,3.4328345859499474,6.0624297313333741,1.9828876800256123,10.282668598658589,4.2620910708207154,2.9419007765649594,6.8264693296165468,1.4684815774420814,3.0830973395326153,1.8552675753984962,3.4036149670378344,5.2919659173765199,3.1334841516596947,0.79040464298054769,0,4.1504114041823001,2.430613298391151,null,null,null,null,null,null,null,null,null,null,null,null,null,null,null,null,null,null,null,null,null,null,null,null,null,null,null,null,null,null,"Main source of drinking water","PIPED INTO DWELLING",39.297204748233106,82.656867087377861,94.668942218777644,91.114017890393953,160.05636840699512,12.128437920490494,62.450905895661592,25.958881471369406,17.969271450605582,41.755213623030542,30.014859406953466,62.558999748858049,37.792369184780007,69.032446985752387,108.13201466427616,22.551988966280945,7.4344026095653959,0,387.31723686383225,50.489771912098981]
[null,"PIPED TO YARD / PLOT",5.8304731962392164,3.5959298297257805,1.5059527723194182,8.8222224927446677E-2,0.48494985406756203,4.4060327930887384,0.48319369403249907,0,1.4252599681347633,0,4.0281971635606464,5.0566168351426262,2.3265360403573605,1.4530068776812264,0.20054466820175956,1.6853686728867396,2.3355046106044117,0.27565771271074863,2.7144698423431866,0.80045143404296926,null,null,null,null,null,null,null,null,null,null,null,null,null,null,null,null,null,null,null,null,null,null,null,null,null,null,null,null,null,null,null,"PIPED TO YARD / PLOT",154.33649813453172,95.198612798875956,39.807420913641707,2.3415871575254914,12.803333966971127,26.949733837638174,2.9346354621734334,0,8.7055564413015176,0,82.333870158837726,102.60360166497833,47.392252268514945,29.470025612432288,4.0977775256696098,12.129761592994051,21.967332461832168,0.44815044645014723,253.3148780930793,16.627330377190365]
[null,"PIPED TO NEIGHBOUR",0,0.49169293628353761,0.5587300340990603,0,0,0,0,0,0,0,0,0.64152091681107426,0.72503194451385,0,0,0.33652807314149891,0,0,0.27179722145259017,0,null,null,null,null,null,null,null,null,null,null,null,null,null,null,null,null,null,null,null,null,null,null,null,null,null,null,null,null,null,null,null,"PIPED TO NEIGHBOUR",0,13.017074212699089,14.76912294548182,0,0,0,0,0,0,0,0,13.017074212699089,14.76912294548182,0,0,2.4220251403891888,0,0,25.36417201779172,0]
[null,"PUBLIC TAP / STANDPIPE",0.23571278320226163,0,1.3232891316675792,0,0,0,0,0,0,0,0.3052672144589737,0,1.7171564686585059,0,0,0,0.59400339212577458,0,0.37482776819440111,3.1406315402405557E-2,null,null,null,null,null,null,null,null,null,null,null,null,null,null,null,null,null,null,null,null,null,null,null,null,null,null,null,null,null,null,null,"PUBLIC TAP / STANDPIPE",6.239473932998516,0,34.979003606871302,0,0,0,0,0,0,0,6.239473932998516,0,34.979003606871302,0,0,0,5.5870880918132944,0,34.979003606871302,0.65238584118522169]
[null,"PROTECTED WELL",6.8720579009092453E-2,0,0,0,0,0,0,0,0,0,8.8998735856054292E-2,0,0,0,0,0.25275182547950414,0,0,0,0,null,null,null,null,null,null,null,null,null,null,null,null,null,null,null,null,null,null,null,null,null,null,null,null,null,null,null,null,null,null,null,"PROTECTED WELL",1.8190793709302877,0,0,0,0,0,0,0,0,0,1.8190793709302877,0,0,0,0,1.8190793709302877,0,0,0,0]
[null,"OWN CEMENT OR OTHER TANK",54.210492763315152,47.099023832032294,45.060360214033985,49.000572556286322,46.64603508517812,26.664166224904463,34.944652210737111,42.46168632686053,41.686015469742244,40.872645369490122,56.376210552229303,50.037677879615771,53.273214231832981,49.179200695435547,49.734952109644723,60.630446891620736,81.168982140863477,84.830448663015972,38.588674494709622,70.585461432778715,null,null,null,null,null,null,null,null,null,null,null,null,null,null,null,null,null,null,null,null,null,null,null,null,null,null,null,null,null,null,null,"OWN CEMENT OR OTHER TANK",1434.9877503311591,1246.899117976559,1191.0975951773785,1300.5692330198735,1231.5186001631089,163.09279038750998,212.23334835998295,258.61903561370565,254.62018761372792,250.00420515143446,1152.295037006488,1015.3124384904643,1085.1917031304035,997.45729105309601,1016.2462598612648,436.36319928290806,763.46071344959637,137.91307729810717,3601.102956797939,1466.2323498395251]
[null,"NEIGHBOUR?S CEMENT OR OTHER TANK",24.966455482973661,23.606164660473947,19.476650166809975,15.142732931893024,4.9496224126193651,36.646445404797426,20.219843247106688,10.74765207459421,5.1694420413644631,2.8566911456750796,25.889321072845256,19.758439904627657,19.239372950752287,21.058649801306267,6.0043605240746274,24.647714620672978,10.128698322745585,10.237230977072119,19.046015058954733,12.833051062013384,null,null,null,null,null,null,null,null,null,null,null,null,null,null,null,null,null,null,null,null,null,null,null,null,null,null,null,null,null,null,null,"NEIGHBOUR?S CEMENT OR OTHER TANK",660.87865948157616,624.949383217064,514.8336823231449,401.91719254779019,130.6767457039843,224.14993172633393,122.80348391416778,65.460127825514633,31.575200642189156,17.473417557913947,529.16178458056027,400.91768144395053,391.9119242313742,427.11356604045636,122.68854531109858,177.39198964036308,95.26869801544629,16.64317529037255,1777.3780012429027,266.57379908447479]
[null,"COMMUNITY CEMENT OR OTHER TANK",8.5448906050514815,9.0095263673986494,7.1404815181030772,6.341487669112575,4.1096191628598451,10.23448345123855,8.3401568855369081,9.067437895688224,0.27613455075435867,1.1298316616170627,8.315619835168647,10.737395072889599,5.0451347928826431,4.9468585810365981,7.9404981650416886,8.1191117509152004,2.9861965267083863,1.2688462954799968,7.1364077954243115,8.4589656245769902,null,null,null,null,null,null,null,null,null,null,null,null,null,null,null,null,null,null,null,null,null,null,null,null,null,null,null,null,null,null,null,"COMMUNITY CEMENT OR OTHER TANK",226.18892987570089,238.51811708368456,188.7470567084419,168.3152527360549,108.49952047171554,62.599762173634936,50.653227595185385,55.226540604597766,1.6866431182596793,6.9107997283764231,169.96615011610842,217.87203636266642,102.77094215838146,100.33266278606864,162.25011223231871,58.434033733873811,28.08762252093997,2.0628264966874021,665.9710277569028,175.71336636719397]
[null,"BOTTLED WATER",4.3266528961697315,11.69496284976826,19.815595054944094,25.398886646333668,37.747343753941756,18.898615918825865,23.639422709464892,33.461132632036325,48.501247193439227,48.314362493601173,3.1755095922645298,9.2676810915444374,14.336801470692064,19.179684879442345,30.827678615660663,1.1474247584738684,1.7091919181967372,0.6891442817768717,26.802950747929387,4.4260304320571393,null,null,null,null,null,null,null,null,null,null,null,null,null,null,null,null,null,null,null,null,null,null,null,null,null,null,null,null,null,null,null,"BOTTLED WATER",114.52937594656747,309.61233749025337,523.79314112987845,674.13519479259753,996.58107821689703,115.59438906378816,143.57200651678559,203.799862898176,296.24795079916163,295.52268230789383,64.905461138487595,188.0501311600874,292.04504045348426,389.00421829906196,629.90938493926774,8.2581271327108148,16.076348955863395,1.1203761161253682,2501.2568183058647,91.939457065626428]
[null,"OTHER (specify)",0.33204488640737062,1.3805080842057302,1.537524560183654,0.59526338549708235,0,1.1673685271193763,2.0900626544633343,0,0,0,0.35239425617443049,1.4175709598362471,1.4814845249118045,0.77898419806018948,0,4.7169255149793421E-2,0.28701844577505919,2.6986720699443612,0.91444566680931294,0.43402040073726789,null,null,null,null,null,null,null,null,null,null,null,null,null,null,null,null,null,null,null,null,null,null,null,null,null,null,null,null,null,null,null,"OTHER (specify)",8.7894486891127759,36.547558155227243,40.641969959009295,15.79943262563844,0,7.1402716624468114,12.693816288794331,0,0,0,7.2027216530134828,28.763873324164337,30.178293874930354,15.79943262563844,0,0.33948169839071812,2.6996434057081045,4.3873653346212,85.336255720044008,9.0156632702237296]
[]
[]
[]
[]
[]
[]
[]
[]
[]
[]
[]
[]
[]
[]
[]
[]
[]
[]
[]
[]
[]
[]
[]
[]
[]
[]
[]
[]
[]
[]
[]
[]
[]
[]
[]
[]
[]
[]
[]
[]
[{"$f":"A1026","v":"Tonga"}]
[{"$f":"A1034","v":"2019"}]
["Use of sanitation facilities"]
[" by wealth quintile and sub-national region"]
["Notes:"]
["WHO/UNICEF JMP customised wealth index excludes water,"]
[" sanitation and hygiene assets."]
["Survey used for analysis:",{"$f":"A1025","v":"MICS19"}]
[{"$f":"B1030","v":""}]
[{"$f":"B1029","v":""}]
[]
[]
["Use of sanitation facilities",null,"NATIONAL wealth index quintile",null,null,null,null,"URBAN wealth index quintile",null,null,null,null,"RURAL wealth index quintile",null,null,null,null,"SUB-REGIONS:",null,null,null,null,null,null,null,null,null,null,null,null,null,null,null,null,null,null,null,null,null,null,null,null,null,null,null,null,null,null,null,null,null,null,"Raw numbers of respondents:","Use of sanitation facilities","NATIONAL wealth index quintile",null,null,null,null,"URBAN wealth index quintile",null,null,null,null,"RURAL wealth index quintile",null,null,null,null,"SUB-REGIONS:"]
["Weighted percentage (used in graphs)",null,"Poorest","Poor","Middle","Rich","Richest","Poorest","Poor","Middle","Rich","Richest","Poorest","Poor","Middle","Rich","Richest","'EUA","HA'APAI","ONGO NIUA","TONGATAPU","VAVA'U",null,null,null,null,null,null,null,null,null,null,null,null,null,null,null,null,null,null,null,null,null,null,null,null,null,null,null,null,null,null,"Sanitation data, raw numbers (weighted)",null,"Poorest","Poor","Middle","Rich","Richest","Poorest","Poor","Middle","Rich","Richest","Poorest","Poor","Middle","Rich","Richest","'EUA","HA'APAI","ONGO NIUA","TONGATAPU","VAVA'U"]
["Sanitation","Improved",92.284747874965703,97.237880885510918,99.19783858825177,100,100,97.365373271867313,100,100,100,100,91.324419837830391,96.346332863898738,98.552452569749548,99.926326343643126,100,94.74894971608353,89.870038271251389,96.359187976643142,98.541247969406271,98.871918027697276,null,null,null,null,null,null,null,null,null,null,null,null,null,null,null,null,null,null,null,null,null,null,null,null,null,null,null,null,null,null,"Sanitation","Improved",2442.8385722512817,2574.2747523271032,2622.1340980860923,2654.1919107698723,2640.1356469296716,595.54048231212676,607.34142403275098,609.06444841336338,610.80481006524542,611.66631836864929,1866.6149197654356,1954.9594286730344,2007.5436669998921,2026.7153871996286,2043.324094533896,681.91736901941852,845.30126812776894,156.6559218918689,9195.8893140482851,2053.8111072766919]
[null,"Not Improved",7.71525212503433,2.7621191144890913,0.80216141174824529,0,0,2.6346267281326781,0,0,0,0,8.6755801621695721,3.6536671361012663,1.4475474302504467,7.3673656356861586E-2,0,5.2510502839164275,10.129961728748611,3.6408120233568897,1.4587520305937689,1.1280819723026678,null,null,null,null,null,null,null,null,null,null,null,null,null,null,null,null,null,null,null,null,null,null,null,null,null,null,null,null,null,null,null,"Not Improved",204.22784825953056,73.124315694634475,21.203836896533542,0,0,16.114834459715556,0,0,0,0,177.32351759894283,74.136407734833384,29.486984854329716,1.49425620287709,0,37.792317539422044,95.280581382996374,5.9190490904948732,136.13103635696021,23.433016480825078]
["Sanitation ladder","Basic",82.380300985921693,87.483592588060205,93.414700568922797,97.811113267055021,97.670083910829291,85.775681372600005,97.367114729962594,99.010240242212106,98.274273906646528,97.79402400505343,80.639258590043355,87.123790205158485,90.865916712807902,96.685746151918906,97.64216459585316,92.62497575638649,80.715592472366254,90.486608702301183,92.669388707451631,92.440112081393778,null,null,null,null,null,null,null,null,null,null,null,null,null,null,null,null,null,null,null,null,null,null,null,null,null,null,null,null,null,null,"Sanitation ladder","Basic",2177.5863789369059,2316.0398148482395,2469.2662169887667,2596.0946561681317,2578.6227017159258,524.65151561278265,591.35082114055729,603.03617360397504,600.26399207849136,598.17310621626336,1645.2068820436812,1767.8251995735966,1850.9665755282253,1960.9896272488866,1995.1458756115128,666.63092269149149,759.19621252015452,147.10857784069117,8644.4672594000385,1920.2067962056158]
[null,"Limited",9.8935524087983282,9.7542882974507794,5.7831380193289759,2.1888867329449448,2.3299160891707258,11.589691899267345,2.6328852700373933,0.98975975778789171,1.7257260933534813,2.205975994946562,10.669289200618239,9.2225426587402932,7.686535856941636,3.2405801917242099,2.3578354041468375,2.1239739596970755,9.1544457988851491,5.8725792743419891,5.8712755643005998,6.4318059463035437,null,null,null,null,null,null,null,null,null,null,null,null,null,null,null,null,null,null,null,null,null,null,null,null,null,null,null,null,null,null,null,"Limited",261.51961945829026,258.23493747886533,152.86788109732566,58.097254601739664,61.51294521374605,70.888966699344223,15.990602892193646,6.0282748093882645,10.54081798675411,13.493212152385816,217.67546386567065,187.13422909943876,156.57709147166671,65.725759950741846,48.178218922382989,15.286446327927223,86.105055607614489,9.5473440511777952,547.68948079217057,133.60431107107701]
[null,"Unimproved",7.6234276545084887,2.6350113918967919,0.80216141174824529,0,0,2.084472324006502,0,0,0,0,8.5583673652431784,3.6536671361012663,1.4475474302504467,7.3673656356861586E-2,0,4.8737863894073286,10.129961728748611,3.6408120233568897,1.4232621342089695,1.1280819723026678,null,null,null,null,null,null,null,null,null,null,null,null,null,null,null,null,null,null,null,null,null,null,null,null,null,null,null,null,null,null,null,"Unimproved",201.51264346685946,69.759267031342276,21.203836896533542,0,0,12.749785796423353,0,0,0,0,174.60831280627173,74.136407734833384,29.486984854329716,1.49425620287709,0,35.077112746750934,95.280581382996374,5.9190490904948732,132.76598769366802,23.433016480825078]
[null,"Open defecation",0.10271895077147875,0.12710772259229994,0,0,0,0.55015440412617622,0,0,0,0,0.13308484409519811,0,0,0,0,0.37726389450909792,0,0,3.607359403889495E-2,0,null,null,null,null,null,null,null,null,null,null,null,null,null,null,null,null,null,null,null,null,null,null,null,null,null,null,null,null,null,null,null,"Open defecation",2.7152047926711047,3.3650486632922045,0,0,0,3.3650486632922045,0,0,0,0,2.7152047926711047,0,0,0,0,2.7152047926711047,0,0,3.3650486632922045,0]
["Shared among improved sanitation facilities","Yes",10.721945648543208,10.031366591519616,5.8299032535713797,2.1888867329449448,2.3299160891707258,11.903299406973117,2.6328852700373933,0.98975975778789171,1.7257260933534813,2.205975994946562,11.684874481936971,9.5722819796040284,7.7994363980962973,3.242969405860042,2.3578354041468375,2.2416860198045376,10.186315678707764,6.0944673753015284,5.9582260863484668,6.505189819926203,null,null,null,null,null,null,null,null,null,null,null,null,null,null,null,null,null,null,null,null,null,null,null,null,null,null,null,null,null,null,"Shared among improved sanitation facilities","Yes",261.51961945829026,258.23493747886533,152.86788109732566,58.097254601739664,61.51294521374605,70.888966699344223,15.990602892193646,6.0282748093882645,10.54081798675411,13.493212152385816,217.67546386567065,187.13422909943876,156.57709147166671,65.725759950741846,48.178218922382989,15.286446327927223,86.105055607614489,9.5473440511777952,547.68948079217057,133.60431107107701]
[null,"No",89.278054351456731,89.968633408480443,94.170096746428626,97.811113267055021,97.670083910829291,88.096700593026895,97.367114729962594,99.010240242212106,98.274273906646528,97.79402400505343,88.315125518063027,90.427718020396014,92.200563601903696,96.757030594139948,97.64216459585316,97.758313980195481,89.813684321292243,93.905532624698523,94.041773913651625,93.494810180073841,null,null,null,null,null,null,null,null,null,null,null,null,null,null,null,null,null,null,null,null,null,null,null,null,null,null,null,null,null,null,null,"No",2177.5863789369059,2316.0398148482395,2469.2662169887667,2596.0946561681317,2578.6227017159258,524.65151561278265,591.35082114055729,603.03617360397504,600.26399207849136,598.17310621626336,1645.2068820436812,1767.8251995735966,1850.9665755282253,1960.9896272488866,1995.1458756115128,666.63092269149149,759.19621252015452,147.10857784069117,8644.4672594000385,1920.2067962056158]
["Manually calculated ratios","Improved latrines"]
[null,"Other"]
[null,"Other"]
[null,null,"NATIONAL wealth index quintile",null,null,null,null,"URBAN wealth index quintile",null,null,null,null,"RURAL wealth index quintile",null,null,null,null,"SUB-REGIONS:",null,null,null,null,null,null,null,null,null,null,null,null,null,null,null,null,null,null,null,null,null,null,null,null,null,null,null,null,null,null,null,null,null,null,"Raw numbers of respondents:","Use of sanitation facilities","NATIONAL wealth index quintile",null,null,null,null,"URBAN wealth index quintile",null,null,null,null,"RURAL wealth index quintile",null,null,null,null,"SUB-REGIONS:"]
["Percentage based on weighted population",null,"Poorest","Poor","Middle","Rich","Richest","Poorest","Poor","Middle","Rich","Richest","Poorest","Poor","Middle","Rich","Richest","'EUA","HA'APAI","ONGO NIUA","TONGATAPU","VAVA'U",null,null,null,null,null,null,null,null,null,null,null,null,null,null,null,null,null,null,null,null,null,null,null,null,null,null,null,null,null,null,"Sanitation data, raw numbers (weighted)",null,"Poorest","Poor","Middle","Rich","Richest","Poorest","Poor","Middle","Rich","Richest","Poorest","Poor","Middle","Rich","Richest","'EUA","HA'APAI","ONGO NIUA","TONGATAPU","VAVA'U"]
["Sanitation type","Sewer connection",1.3072111768913399,2.6947591150146488,4.7961421927063776,2.162921356098785,4.9930453674888033,0.84772818727720545,1.077150250235525,3.8061433159854725,2.081957181413495,5.7752820723362204,0.83690110175236287,3.4699714705710969,5.0080996953185331,2.7179788872051533,4.6172058955650277,0.49418505895270048,0.40470560782195641,0,4.4426605953221161,0,null,null,null,null,null,null,null,null,null,null,null,null,null,null,null,null,null,null,null,null,null,null,null,null,null,null,null,null,null,null,"Sanitation type","Sewer connection",34.602748108654843,71.341027696328638,126.77824599551518,57.408083669887972,131.82317061444252,5.1851745292545877,6.541979668752778,23.181865793329017,12.716694607572434,35.325455227263589,17.105743301442519,70.409046633898996,102.01652586905642,55.126309895939038,94.344480558319759,3.5566977388091034,3.8065874911255415,0,414.58999085489455,0]
[null,"Septic tank connection",62.885849759257638,86.32171075284181,91.291195026523781,96.679737293594243,94.932004590793468,87.720331757455099,97.669999692685593,96.193856684014506,97.594079625079786,94.224717927663775,57.00577980945102,83.246596092427367,90.183340356848433,94.024661368082292,95.38279410443495,85.918792986825366,61.9425431389243,68.528385641654893,89.385032983230559,85.768395853561046,null,null,null,null,null,null,null,null,null,null,null,null,null,null,null,null,null,null,null,null,null,null,null,null,null,null,null,null,null,null,null,"Septic tank connection",1664.6302122301879,2285.280165971154,2413.1347894350747,2566.0657666001416,2506.3336935464504,536.54607308437301,593.19036698634022,585.88258262003421,596.10933268889301,576.34086314138563,1165.1630450446719,1689.1532152627187,1837.0622859350212,1907.0172490439954,1948.9796139755758,618.36587570062022,582.62031789009779,111.41000307160277,8341.4294682115142,1781.6189629091834]
[null,"Improved latrines",28.09168693881665,8.2214110176545141,3.1105013690216059,1.1573413503069603,7.4950041717781191E-2,8.7973133271350115,1.2528500570788739,0,0.3239631935066834,0,33.481738926626981,9.6297653009002726,3.3610125175825898,3.1836860883556848,0,8.3359716703055273,27.522789524505136,27.83080233498827,4.7135543908535444,13.103522174136288,null,null,null,null,null,null,null,null,null,null,null,null,null,null,null,null,null,null,null,null,null,null,null,null,null,null,null,null,null,null,null,"Improved latrines",743.6056119124371,217.65355865962204,82.22106265550201,30.718060499842149,1.978782768779801,53.809234698499154,7.6090773776579663,0,1.978782768779801,0,684.34613141932061,195.39716677641701,68.464855195814636,64.571828259694016,0,59.994795579989692,258.87436274654556,45.245918820266191,439.86985498187261,272.1921443675094]
[null,"Unimproved facilities",7.6126780161403369,2.6350113918967919,0.80216141174824529,0,0,2.084472324006502,0,0,0,0,8.5427383532855288,3.6536671361012663,1.4475474302504467,7.3673656356861586E-2,0,4.8737863894073286,10.129961728748611,3.6408120233568897,1.4226928650868478,1.1280819723026678,null,null,null,null,null,null,null,null,null,null,null,null,null,null,null,null,null,null,null,null,null,null,null,null,null,null,null,null,null,null,null,"Unimproved facilities",201.51264346685946,69.759267031342276,21.203836896533542,0,0,12.749785796423353,0,0,0,0,174.60831280627173,74.136407734833384,29.486984854329716,1.49425620287709,0,35.077112746750934,95.280581382996374,5.9190490904948732,132.76598769366802,23.433016480825078]
[null,"Open defecation",0.10257410889399385,0.12710772259229994,0,0,0,0.55015440412617622,0,0,0,0,0.13284180888404404,0,0,0,0,0.37726389450909792,0,0,3.6059165506921315E-2,0,null,null,null,null,null,null,null,null,null,null,null,null,null,null,null,null,null,null,null,null,null,null,null,null,null,null,null,null,null,null,null,"Open defecation",2.7152047926711047,3.3650486632922045,0,0,0,3.3650486632922045,0,0,0,0,2.7152047926711047,0,0,0,0,2.7152047926711047,0,0,3.3650486632922045,0]
["Septic tank emptying practices","Not emptied/treated and disposed in situ",71.427932048698011,62.338136901245846,65.502081353662589,45.013102039802916,39.042243402256638,53.968973277058026,48.921002888336673,25.386800905696749,39.065496816007041,25.468624742343572,74.192696896327902,68.225763439517863,67.082393990466599,56.141774684201252,46.16871730378228,92.049369295944231,76.170238130248222,50.478042706976467,47.686606682532727,71.894879587158727,null,null,null,null,null,null,null,null,null,null,null,null,null,null,null,null,null,null,null,null,null,null,null,null,null,null,null,null,null,null,"Septic tank emptying practices","Not emptied/treated and disposed in situ",1189.0109368538763,1424.6010784401162,1580.653512949297,1155.0658019281727,978.52890110717408,289.56840680200952,290.19467656672242,148.73684479090235,232.87307238150029,146.78609167026343,864.465886358018,1152.4376767761523,1232.345360501203,1070.6333271471331,899.81888828473075,569.20188852376339,443.78328353209668,56.237588930327448,3977.744662206906,1280.8928080855437]
[null,"Emptied and buried on site",5.1035723223308462,4.6899590650224505,3.8159917704161583,10.350278340203753,5.5460939304720744,4.643662221495183,5.5721609018960105,12.330219185375045,4.0381418794714863,5.5819183533670111,5.0503934116682814,4.2060709652185109,4.8727735659681448,7.8415041489733186,6.8455693321509141,2.4308762758236746,1.1325516866938028,4.9259040562474992,7.1452645588036781,3.686678720891106,null,null,null,null,null,null,null,null,null,null,null,null,null,null,null,null,null,null,null,null,null,null,null,null,null,null,null,null,null,null,null,"Emptied and buried on site",84.955606780537096,107.17870430512424,92.085024973891748,265.59494923579786,139.00362085515624,24.915387296734963,33.053521703026313,72.240606605986258,24.071740610748201,32.170876417642852,58.845317662129631,71.046982945220137,89.515885459411848,149.53883670542174,133.41875074418527,15.03170937019569,6.598476237285098,5.4879498603695449,596.01720348972344,65.682567192933675]
[null,"Emptied and discharged locally",2.1716741693745241,4.4401085595945782,5.1676361356662612,4.1744735317967141,6.8345236143338708,7.7186479314929173,6.2601194696775924,4.8084736653486493,3.9276095868782779,5.3119304296824277,2.7567698993253162,2.4328536475155973,5.4673001628140403,4.3968245561174246,6.2846928209885577,0.35804224706815996,2.7225687870421513,16.387884049396533,5.8557930535598306,0.89503733369459326,null,null,null,null,null,null,null,null,null,null,null,null,null,null,null,null,null,null,null,null,null,null,null,null,null,null,null,null,null,null,null,"Emptied and discharged locally",36.150344334607311,101.46892026000238,124.70202538118086,107.11973623521936,171.29596813943846,41.414102371633433,37.134425655963845,28.172009695148887,23.41284729896509,30.614825687901615,32.120864103853791,41.094625609646044,100.43770934992074,83.84820269536138,122.48738188205351,2.2140110764612055,15.862238921841563,18.257742122803378,488.45684736712258,15.94615486221962]
[null,"Emptied and removed offsite",21.296821459596536,28.531795474137212,25.514290740254918,40.462146088196711,48.577139052937412,33.668716569953872,39.246716740089724,57.474506243579611,52.968751717643222,63.637526474607007,18.000139792678425,25.13531194774809,22.577532280751203,31.619896610707976,40.701020543078243,5.1617121811639235,19.974641396015848,28.208169187379546,39.312335705103635,23.523404358255547,null,null,null,null,null,null,null,null,null,null,null,null,null,null,null,null,null,null,null,null,null,null,null,null,null,null,null,null,null,null,null,"Emptied and removed offsite",354.51332426116602,652.03146296591308,615.69422613070333,1038.2852792009542,1217.5052034446815,180.6481766139951,232.80774306062767,336.73312152799707,315.75167239767961,366.76906936557782,209.7309769206696,424.57392993170117,414.76333062448538,602.9968824960788,793.25459306460618,31.918266730199882,116.37631919887461,31.426722158102461,3279.2107551477511,419.09743276848616]
["Latrine emptying practices","Not emptied/treated and disposed in situ",47.489709116581558,45.501395963632227,56.572561196989504,13.988403937631199,100,74.060967345680282,31.279620853080566,0,100,0,46.422100500736988,45.88178420388104,64.946547309702652,13.854698054880929,0,84.830766226864895,20.60637253047415,9.0455203383983669,65.706783674444381,39.533152878451205,null,null,null,null,null,null,null,null,null,null,null,null,null,null,null,null,null,null,null,null,null,null,null,null,null,null,null,null,null,null,"Latrine emptying practices","Not emptied/treated and disposed in situ",353.13614207179273,99.035407554651158,46.514560987598955,4.296966384523853,1.978782768779801,39.851639739015923,2.380090554148937,0,1.978782768779801,0,317.68784890038262,89.651706400853186,44.465559570269164,8.9462318338968814,0,50.894044786746527,53.344615573444173,4.0927287891823925,289.02433406203124,107.6061365559421]
[null,"Emptied and buried on site",47.616677727457507,32.149511682620854,12.460758899341945,74.840898596428502,0,24.589025339906076,68.720379146919427,0,0,0,48.366683739953118,32.401565747058562,25.983286831213142,41.400471776200369,0,12.905826121795785,77.908834408651643,69.931244179279545,23.102063302601387,42.102984381724454,null,null,null,null,null,null,null,null,null,null,null,null,null,null,null,null,null,null,null,null,null,null,null,null,null,null,null,null,null,null,null,"Emptied and buried on site",354.08028778763355,69.974556268915222,10.245368381978983,22.989672509476421,0,13.23116635522349,5.2289868235090289,0,0,0,330.99552907018671,63.311741460950429,17.789419704103253,26.733041534031194,0,7.7428239996802937,201.68599859865836,31.641033971358944,101.61901234697312,114.60101603133337]
[null,"Emptied and discharged locally",4.4202476253925109,9.755956416402098,3.7285946573869917,11.170697465940304,0,0,0,0,0,0,4.8030094558545757,8.3568673752540423,7.1644119089170735,10.061836454640478,0,2.2634076513393229,0.40568116417327504,21.023235482322132,0,17.884505892328871,null,null,null,null,null,null,null,null,null,null,null,null,null,null,null,null,null,null,null,null,null,null,null,null,null,null,null,null,null,null,null,"Emptied and discharged locally",32.869209402844952,21.2341863215809,3.0656901494198587,3.4314216058418761,0,0,0,0,0,0,32.869209402844952,16.329082082509125,4.9051042390717736,6.4971117552617343,0,1.3579267935628725,1.0502045285363331,9.5121560597248696,0,48.680220097863518]
[null,"Emptied and removed offsite",0.47336553056849207,12.593135937344815,27.238085246281557,0,0,1.3500073144136437,0,0,0,0,0.40820630345537146,13.35978267380637,1.9057539501671308,34.682993714278233,0,0,1.0791118967009121,0,11.191153022954236,0.47935684749548169,null,null,null,null,null,null,null,null,null,null,null,null,null,null,null,null,null,null,null,null,null,null,null,null,null,null,null,null,null,null,null,"Emptied and removed offsite",3.5199726501663902,27.409408514474741,22.395443136504209,0,0,0.72642860425974287,0,0,0,0,2.7935440459066472,26.104636832104298,1.3047716823704434,22.395443136504209,0,0,2.7935440459066472,0,49.226508572868248,1.3047716823704434]
["Shared among improved sanitation facilities","Yes",9.8796017142563475,9.7542882974507794,5.7831380193289759,2.1888867329449448,2.3299160891707258,11.589691899267345,2.6328852700373933,0.98975975778789171,1.7257260933534813,2.205975994946562,10.649805291902975,9.2225426587402932,7.686535856941636,3.2405801917242099,2.3578354041468375,2.1239739596970755,9.1544457988851491,5.8725792743419891,5.8689272014755858,6.4318059463035437,null,null,null,null,null,null,null,null,null,null,null,null,null,null,null,null,null,null,null,null,null,null,null,null,null,null,null,null,null,null,"Shared among improved sanitation facilities","Yes",261.51961945829026,258.23493747886533,152.86788109732566,58.097254601739664,61.51294521374605,70.888966699344223,15.990602892193646,6.0282748093882645,10.54081798675411,13.493212152385816,217.67546386567065,187.13422909943876,156.57709147166671,65.725759950741846,48.178218922382989,15.286446327927223,86.105055607614489,9.5473440511777952,547.68948079217057,133.60431107107701]
[null,"No",82.264138219723677,87.483592588060205,93.414700568922797,97.811113267055021,97.670083910829291,85.775681372600005,97.367114729962594,99.010240242212106,98.274273906646528,97.79402400505343,80.49199780034202,87.123790205158485,90.865916712807902,96.685746151918906,97.64216459585316,92.62497575638649,80.715592472366254,90.486608702301183,92.63232327847048,92.440112081393778,null,null,null,null,null,null,null,null,null,null,null,null,null,null,null,null,null,null,null,null,null,null,null,null,null,null,null,null,null,null,null,"No",2177.5863789369059,2316.0398148482395,2469.2662169887667,2596.0946561681317,2578.6227017159258,524.65151561278265,591.35082114055729,603.03617360397504,600.26399207849136,598.17310621626336,1645.2068820436812,1767.8251995735966,1850.9665755282253,1960.9896272488866,1995.1458756115128,666.63092269149149,759.19621252015452,147.10857784069117,8644.4672594000385,1920.2067962056158]
[null,"DK/missing",7.8562600660199493,2.7621191144890913,0.80216141174824529,0,0,2.6346267281326781,0,0,0,0,8.8581969077549765,3.6536671361012663,1.4475474302504467,7.3673656356861586E-2,0,5.2510502839164275,10.129961728748611,3.6408120233568897,1.4987495200540439,1.1280819723026678,null,null,null,null,null,null,null,null,null,null,null,null,null,null,null,null,null,null,null,null,null,null,null,null,null,null,null,null,null,null,null,"DK/missing",207.96042211561456,73.124315694634475,21.203836896533542,0,0,16.114834459715556,0,0,0,0,181.05609145502683,74.136407734833384,29.486984854329716,1.49425620287709,0,37.792317539422044,95.280581382996374,5.9190490904948732,139.86361021304427,23.433016480825078]
["Shared among all sanitation facilities","Yes",11.41065833846657,10.39516587630448,5.7831380193289759,2.1888867329449448,2.3299160891707258,12.353100143131678,2.6328852700373933,0.98975975778789171,1.7257260933534813,2.205975994946562,11.560752022022779,10.912044844361533,7.686535856941636,3.2405801917242099,2.3578354041468375,2.1320172911613184,9.3062104018183831,6.4163705438334162,6.4221453834941835,6.5727130218576821,null,null,null,null,null,null,null,null,null,null,null,null,null,null,null,null,null,null,null,null,null,null,null,null,null,null,null,null,null,null,"Shared among all sanitation facilities","Yes",301.31197124473539,274.85172213823091,152.86788109732566,58.097254601739664,61.51294521374605,75.142705980373378,15.990602892193646,6.0282748093882645,10.54081798675411,13.493212152385816,235.54924252599173,221.41584760389927,156.57709147166671,65.725759950741846,48.178218922382989,15.286446327927223,87.532525916786568,10.431412549758111,598.8600944833222,136.53129501798389]
[null,"No",88.589341661533467,89.604834123695582,94.216861980671027,97.811113267055021,97.670083910829291,87.64689985686833,97.367114729962594,99.010240242212106,98.274273906646528,97.79402400505343,88.439247977977175,89.087955155638497,92.313464143058383,96.759419808275766,97.64216459585316,97.867982708838667,90.693789598181638,93.583629456166619,93.577854616505903,93.427286978142305,null,null,null,null,null,null,null,null,null,null,null,null,null,null,null,null,null,null,null,null,null,null,null,null,null,null,null,null,null,null,null,"No",2339.3066706173217,2369.1822972202162,2490.4700538852999,2596.0946561681317,2578.6227017159258,533.14756212817679,591.35082114055729,603.03617360397504,600.26399207849136,598.17310621626336,1801.9414161896314,1807.6799888039693,1880.4535603825555,1962.4838834517636,1995.1458756115128,701.70803543824229,853.0493235939789,152.14355843260569,8726.0626334025546,1940.712828739534]
["Type of toilet facility","FLUSH / POUR FLUSH: FLUSH TO PIPED SEWER SYSTEM",1.3072111768913399,2.6947591150146488,4.7961421927063776,2.162921356098785,4.9930453674888033,0.84772818727720545,1.077150250235525,3.8061433159854725,2.081957181413495,5.7752820723362204,0.83690110175236287,3.4699714705710969,5.0080996953185331,2.7179788872051533,4.6172058955650277,0.49418505895270048,0.40470560782195641,0,4.4426605953221161,0,null,null,null,null,null,null,null,null,null,null,null,null,null,null,null,null,null,null,null,null,null,null,null,null,null,null,null,null,null,null,"Type of toilet facility","FLUSH / POUR FLUSH: FLUSH TO PIPED SEWER SYSTEM",34.602748108654843,71.341027696328638,126.77824599551518,57.408083669887972,131.82317061444252,5.1851745292545877,6.541979668752778,23.181865793329017,12.716694607572434,35.325455227263589,17.105743301442519,70.409046633898996,102.01652586905642,55.126309895939038,94.344480558319759,3.5566977388091034,3.8065874911255415,0,414.58999085489455,0]
[null,"FLUSH / POUR FLUSH: FLUSH TO SEPTIC TANK",62.885849759257638,86.32171075284181,91.291195026523781,96.679737293594243,94.932004590793468,87.720331757455099,97.669999692685593,96.193856684014506,97.594079625079786,94.224717927663775,57.00577980945102,83.246596092427367,90.183340356848433,94.024661368082292,95.38279410443495,85.918792986825366,61.9425431389243,68.528385641654893,89.385032983230559,85.768395853561046,null,null,null,null,null,null,null,null,null,null,null,null,null,null,null,null,null,null,null,null,null,null,null,null,null,null,null,null,null,null,null,"FLUSH / POUR FLUSH: FLUSH TO SEPTIC TANK",1664.6302122301879,2285.280165971154,2413.1347894350747,2566.0657666001416,2506.3336935464504,536.54607308437301,593.19036698634022,585.88258262003421,596.10933268889301,576.34086314138563,1165.1630450446719,1689.1532152627187,1837.0622859350212,1907.0172490439954,1948.9796139755758,618.36587570062022,582.62031789009779,111.41000307160277,8341.4294682115142,1781.6189629091834]
[null,"FLUSH / POUR FLUSH: FLUSH TO PIT LATRINE",4.6068758692297065,4.0821512174372216,1.7805658577018249,0.99544776728878737,7.4950041717781191E-2,3.706163289045413,0,0,0.3239631935066834,0,4.7064521092766993,5.1681562201815483,1.5196656897558971,2.4068782736841903,0,4.1011973895991565,0.57613862845281882,1.0025937776818359,2.6136000296760704,1.2043227558490412,null,null,null,null,null,null,null,null,null,null,null,null,null,null,null,null,null,null,null,null,null,null,null,null,null,null,null,null,null,null,null,"FLUSH / POUR FLUSH: FLUSH TO PIT LATRINE",121.94706416899513,108.07083328567101,47.066372773981087,26.421094115318297,1.978782768779801,22.668944805692451,0,0,1.978782768779801,0,96.196983697653039,104.86684268275803,30.956055906039509,48.81653725182251,0,29.516714877843455,5.4190553672474797,1.629966543137229,243.90168664756834,25.016723676948811]
[null,"FLUSH / POUR FLUSH: FLUSH TO OPEN DRAIN",0.85380433111721332,0,0,0,0,0,0,0,0,0,1.1057460113629434,0,0,0,0,0.29532055398131535,1.2985353423980526,0,8.8528840081565335E-2,0,null,null,null,null,null,null,null,null,null,null,null,null,null,null,null,null,null,null,null,null,null,null,null,null,null,null,null,null,null,null,null,"FLUSH / POUR FLUSH: FLUSH TO OPEN DRAIN",22.600767745870698,0,0,0,0,0,0,0,0,0,22.600767745870698,0,0,0,0,2.1254506334027572,12.213787740078551,0,8.2615293723893899,0]
[null,"VENTILATED IMPROVED PIT LATRINE",0.86821774039609556,0.89541726512743924,9.0041100029254528E-2,0,0,1.480660753471031,0.39188674771187521,0,0,0,0.87622835785451636,0.38384513461826347,0.58579749460039998,0,0,0.37735404119834737,1.6887554601619015,0.47128576689257023,0.23036620130925689,0.39493021747998214,null,null,null,null,null,null,null,null,null,null,null,null,null,null,null,null,null,null,null,null,null,null,null,null,null,null,null,null,null,null,null,"VENTILATED IMPROVED PIT LATRINE",22.982300262942776,23.705268331889556,2.380090554148937,0,0,9.0565402219595814,2.380090554148937,0,0,0,17.909568205275164,7.7885856447933595,11.93287452280423,0,0,2.715853587125745,15.884127340904847,0.7661926987696065,21.497820786635362,8.2036647355457148]
[null,"PIT LATRINE: PIT LATRINE WITH SLAB",19.646869267316688,2.9822371060336068,1.2398944112905259,0.16189358301817292,0,2.4781947551960899,0.86096330936699872,0,0,0,24.459367919768116,3.6684480721630233,1.2555493332262933,0.7768078146714944,0,3.3222044497140621,21.220491083982957,26.356922790413861,1.4012092444279669,11.50426920080726,null,null,null,null,null,null,null,null,null,null,null,null,null,null,null,null,null,null,null,null,null,null,null,null,null,null,null,null,null,null,null,"PIT LATRINE: PIT LATRINE WITH SLAB",520.06567905679856,78.95171735133215,32.774599327371966,4.296966384523853,0,15.158009980117825,5.2289868235090289,0,0,0,499.93442244851269,74.436327093044596,25.575924766970896,15.755291007871516,0,23.910227231880942,199.59608751299393,42.849759578359354,130.7611318417774,238.9717559550148]
[null,"PIT LATRINE: PIT LATRINE WITHOUT SLAB / OPEN PIT",4.8253772908089587,2.0073468716481533,0.32249694851225941,0,0,1.3890252046257208,0,0,0,0,5.434875850164075,2.5387887636951931,0.82511434580931131,7.3673656356861586E-2,0,4.5784658354260133,8.8314263863505591,3.6408120233568897,0.56833842963624615,0.69434042703859244,null,null,null,null,null,null,null,null,null,null,null,null,null,null,null,null,null,null,null,null,null,null,null,null,null,null,null,null,null,null,null,"PIT LATRINE: PIT LATRINE WITHOUT SLAB / OPEN PIT",127.73094192795828,53.142482371976705,8.5246841791859396,0,0,8.496046515394184,0,0,0,0,111.08551652453761,51.514457099329945,16.807832136982114,1.49425620287709,0,32.951662113348178,83.06679364291783,5.9190490904948732,53.037457912828067,14.423145719532018]
[null,"COMPOSTING TOILET",2.9697240618741794,0.26160542905624523,0,0,0,1.1322945294224787,0,0,0,0,3.4396905397276663,0.40931587393743973,0,0,0,0.53521578979396289,4.0374043519074583,0,0.46837891544025079,0,null,null,null,null,null,null,null,null,null,null,null,null,null,null,null,null,null,null,null,null,null,null,null,null,null,null,null,null,null,null,null,"COMPOSTING TOILET",78.61056842370111,6.9257396907293032,0,0,0,6.9257396907293032,0,0,0,0,70.305157067880046,8.3054113558210663,0,0,0,3.8519998831395545,37.97509252539929,0,43.709215705891566,0]
[null,"BUCKET",0.72823642503041763,0.10001111506293371,0,0,0,0.43287342650237903,0,0,0,0,0.94312536603430097,0,0,0,0,0,0,0,0.23493942762405953,0,null,null,null,null,null,null,null,null,null,null,null,null,null,null,null,null,null,null,null,null,null,null,null,null,null,null,null,null,null,null,null,"BUCKET",19.276901868908574,2.6476933280942543,0,0,0,2.6476933280942543,0,0,0,0,19.276901868908574,0,0,0,0,0,0,0,21.92459519700283,0]
[null,"NO FACILITY / BUSH / FIELD",0.10257410889399385,0.12710772259229994,0,0,0,0.55015440412617622,0,0,0,0,0.13284180888404404,0,0,0,0,0.37726389450909792,0,0,3.6059165506921315E-2,0,null,null,null,null,null,null,null,null,null,null,null,null,null,null,null,null,null,null,null,null,null,null,null,null,null,null,null,null,null,null,null,"NO FACILITY / BUSH / FIELD",2.7152047926711047,3.3650486632922045,0,0,0,3.3650486632922045,0,0,0,0,2.7152047926711047,0,0,0,0,2.7152047926711047,0,0,3.3650486632922045,0]
[null,"OTHER",1.205259969183746,0.52765340518570458,0.47966446323598588,0,0,0.26257369287840232,0,0,0,0,1.0589911257242091,1.1148783724060731,0.62243308444113554,0,0,0,0,0,0.53088616774497677,0.43374154526407521,null,null,null,null,null,null,null,null,null,null,null,null,null,null,null,null,null,null,null,null,null,null,null,null,null,null,null,null,null,null,null,"OTHER",31.904031924121892,13.969091331271306,12.679152717347604,0,0,1.606045952934916,0,0,0,0,21.645126666954848,22.621950635503431,12.679152717347604,0,0,0,0,0,49.542405211447743,9.0098707612930582]
[]
[]
[]
[]
[]
[]
[]
[]
[]
[]
[]
[]
[]
[]
[]
[]
[]
[]
[]
[]
[]
[]
[]
[]
[]
[]
[]
[]
[]
[]
[]
[]
[]
[]
[]
[]
[]
[]
[]
[]
[]
[]
[]
[]
[{"$f":"A1026","v":"Tonga"}]
[{"$f":"A1034","v":"2019"}]
["Access to hygiene facilities "]
[" by wealth quintile and sub-national region"]
["Notes:"]
["WHO/UNICEF JMP customised wealth index excludes water,"]
[" sanitation and hygiene assets."]
["Survey used for analysis:",{"$f":"A1025","v":"MICS19"}]
[]
[]
[]
[]
["Access to handwashing",null,"NATIONAL wealth index quintile",null,null,null,null,"URBAN wealth index quintile",null,null,null,null,"RURAL wealth index quintile",null,null,null,null,"SUB-REGIONS:",null,null,null,null,null,null,null,null,null,null,null,null,null,null,null,null,null,null,null,null,null,null,null,null,null,null,null,null,null,null,null,null,null,null,"Raw numbers of respondents:","Access to handwashing","NATIONAL wealth index quintile",null,null,null,null,"URBAN wealth index quintile",null,null,null,null,"RURAL wealth index quintile",null,null,null,null,"SUB-REGIONS:"]
["Weighted percentage (used in graphs)",null,"Poorest","Poor","Middle","Rich","Richest","Poorest","Poor","Middle","Rich","Richest","Poorest","Poor","Middle","Rich","Richest","'EUA","HA'APAI","ONGO NIUA","TONGATAPU","VAVA'U",null,null,null,null,null,null,null,null,null,null,null,null,null,null,null,null,null,null,null,null,null,null,null,null,null,null,null,null,null,null,"Hygiene data, raw numbers (weighted)",null,"Poorest","Poor","Middle","Rich","Richest","Poorest","Poor","Middle","Rich","Richest","Poorest","Poor","Middle","Rich","Richest","'EUA","HA'APAI","ONGO NIUA","TONGATAPU","VAVA'U"]
["Hygiene ladder","Basic",42.596680738717716,61.84512288194847,72.217887879740118,82.84564862938646,90.083075291135174,48.880188804359889,82.27715296963764,87.739891915579548,87.844930007996652,95.570453637568747,41.589410068723559,59.283288735300012,68.231696039808909,77.600744640097247,86.668498552584779,55.132246602873003,49.641194977547606,47.389259484384176,74.017835581578623,68.119257686781793,null,null,null,null,null,null,null,null,null,null,null,null,null,null,null,null,null,null,null,null,null,null,null,null,null,null,null,null,null,null,"Hygiene ladder","Basic",1095.7857362149787,1597.6897320874934,1858.7802527839449,2156.7215733117509,2307.8968276646201,287.97505928584769,491.86992535416135,531.55493887081855,532.31342498122194,568.61920700346479,819.03665619591163,1178.3025426236429,1352.8592776636165,1532.5162736398349,1721.8268164442684,394.24929437273749,466.21686884077047,75.327027958713416,6679.3723958351311,1401.7085350554428]
[null,"Limited",50.932603365933829,34.081313587880281,27.290592697720317,16.143805271260668,8.3933261378076622,37.013010785337258,15.880199126943632,10.971196152542642,11.199970414354945,1.1416761285930697,52.139575697498373,37.706319838731588,31.117062780825105,21.767662833252533,12.642690298770729,42.79333078139355,43.300990918405077,40.463039868882241,23.606541557340211,30.185659777187883,null,null,null,null,null,null,null,null,null,null,null,null,null,null,null,null,null,null,null,null,null,null,null,null,null,null,null,null,null,null,null,"Limited",1310.2246303890151,880.44719192083153,702.41897516810616,420.27183901510966,215.03407498463898,218.06020467548805,94.935131774205118,66.466841625651014,67.868397304328397,6.7926744112490507,1026.8052291241202,749.44311435445707,616.97142999522532,429.88372967013186,251.16995854284383,306.01402090413592,406.67136262155253,64.317538798051899,2130.2552391639415,621.13854999001796]
[null,"No facility",6.4707158953484489,4.0735635301713984,0.49151942253951275,1.010546099352899,1.5235985710571835,14.106800410302867,1.8426479034187415,1.2889119318778326,0.95509957764838194,3.2878702338381691,6.2710142337779899,3.0103914259684448,0.65124117936599069,0.63159252665018839,0.68881114864442261,2.0744226157334382,7.057814104047333,12.147700646733622,2.3756228610811174,1.6950825360303103,null,null,null,null,null,null,null,null,null,null,null,null,null,null,null,null,null,null,null,null,null,null,null,null,null,null,null,null,null,null,null,"No facility",166.45705858432126,105.23530913802394,12.65097364793635,26.307556393823099,39.034061586075225,83.109472034777426,11.015732241525686,7.8086203231068163,5.7876115027907389,19.561968097224117,123.4975567218506,59.833925330105622,12.912439857684994,12.473151255053494,13.684481986060373,14.834143407483378,66.285108445464189,19.309231589746915,214.37630047600578,34.88017543147955]
["Observed handwashing place","Fixed",75.789554185784908,85.704185112030046,93.00267243598843,95.614765588740241,99.3858440236245,88.802301710693783,93.883884511102423,97.947031328813097,98.319639774548122,100,73.230377136392903,84.216670125760629,92.302819509457834,93.947952860244271,96.984768369077628,87.824032911981448,66.242250386729651,77.862711670938594,92.630432120796613,90.737618076579949,null,null,null,null,null,null,null,null,null,null,null,null,null,null,null,null,null,null,null,null,null,null,null,null,null,null,null,null,null,null,"Observed handwashing place","Fixed",1899.8961722440208,2149.9806860722988,2411.6287109568011,2469.7477504599833,2510.4187247519999,460.79559549953143,556.57262299692843,585.7445806960028,593.04716206848354,575.411881414714,1417.0414756101545,1645.8132855034564,1850.1044585061277,1843.6346300390803,1913.5063521506233,622.59155974341786,610.46882018227654,118.90788491404345,8232.8907451698451,1856.8130344755273]
[null,"Mobile",24.210445814215124,14.295814887969993,6.9973275640116084,4.3852344112597557,0.61415597637548736,11.197698289306238,6.1161154888975799,2.0529686711868727,1.6803602254518677,0,26.769622863607058,15.783329874239399,7.6971804905421406,6.0520471397556896,3.0152316309223686,12.175967088018535,33.757749613270349,22.137288329061487,7.3695678792033199,9.2623819234200635,null,null,null,null,null,null,null,null,null,null,null,null,null,null,null,null,null,null,null,null,null,null,null,null,null,null,null,null,null,null,null,"Mobile",606.90861458287679,358.62572942760556,181.44592635178788,113.27144668253939,15.51316163944716,58.10491340928376,36.258218947100694,12.277199800466445,10.135643959254605,0,518.00451353023811,308.44741258133644,154.28118034920084,118.76537327088644,59.490422836489671,86.316399843667227,311.10135084647237,33.806915742487774,654.9990731930551,189.54113905857466]
["Water / Soap","Water and soap",43.93928848220262,63.688337963893517,72.574606164872037,83.496149610410725,91.368133879559494,55.497162623992089,82.96969228881656,88.88554835402968,88.250762399341781,98.819510922411141,42.61145567873249,60.29403056503152,68.585665992078162,78.093980383966041,87.269621434404755,55.780850456582797,50.589405288620895,49.325296326798387,75.447739476597448,68.759280104411872,null,null,null,null,null,null,null,null,null,null,null,null,null,null,null,null,null,null,null,null,null,null,null,null,null,null,null,null,null,null,"Water / Soap","Water and soap",1095.7857362149787,1597.6897320874934,1858.7802527839449,2156.7215733117509,2307.8968276646201,287.97505928584769,491.86992535416135,531.55493887081855,532.31342498122194,568.61920700346479,819.03665619591163,1178.3025426236429,1352.8592776636165,1532.5162736398349,1721.8268164442684,394.24929437273749,466.21686884077047,75.327027958713416,6679.3723958351311,1401.7085350554428]
[null,"Water only",50.224039256180255,33.340154841377803,24.452976389985999,15.804690844878916,8.0931370189163889,39.416049358450934,14.104570288955484,11.114451645970345,9.4932167027346424,1.1804890775888233,51.314360757073217,36.123269048433635,29.559462153130884,19.539688843604345,12.691904629826368,38.996107984744278,41.354371986919467,40.733771276158073,22.699805618078226,29.398209855636669,null,null,null,null,null,null,null,null,null,null,null,null,null,null,null,null,null,null,null,null,null,null,null,null,null,null,null,null,null,null,null,"Water only",1252.5188216080244,836.37326328840538,626.28944251161886,408.23819857224919,204.42712857015931,204.53008071275167,83.616242796602165,66.466841625651014,57.261450889848739,6.7926744112490507,986.3155759374921,705.94284987696676,583.06341475533088,383.44685451364899,250.41086903091431,275.61767040886286,381.10955664771876,62.20649760427213,2009.6089834904183,599.30414639918411]
[null,"Soap only",2.3139123784226099,1.7569088702040647,2.9724174451419243,0.46587499063780596,0.41992210762392213,2.6074601451420065,1.9092948910157386,0,1.7584961488427908,0,2.1065272831898101,2.2259192194839303,1.7190286130232344,2.3663307724295803,3.8473935768826288E-2,4.3006653546465978,2.7737232364301798,1.382342238410607,1.3627758309386595,1.0710628029068432,null,null,null,null,null,null,null,null,null,null,null,null,null,null,null,null,null,null,null,null,null,null,null,null,null,null,null,null,null,null,null,"Soap only",57.705808780990708,44.073928632426046,76.129532656487072,12.03364044286046,10.606946414479658,13.530123962736402,11.318888977602935,0,10.606946414479658,0,40.489653186627805,43.500264477490212,33.908015239894524,46.436875156482856,0.75908951192955609,30.396350495273008,25.561805973833756,2.1110411937797884,120.64625567352346,21.834403590833947]
[null,"Neither",3.5227598831944889,1.2145983245247267,0,0.23328455407256896,0.1188069939001801,2.4793278724149652,1.0164425312122505,0,0.49752474908075972,0,3.9676562810044169,1.35678116705096,0.1358432417677311,0,0,0.92237620402630482,5.2824994880294716,8.5585901586329705,0.4896790743855754,0.77144723704460672,null,null,null,null,null,null,null,null,null,null,null,null,null,null,null,null,null,null,null,null,null,null,null,null,null,null,null,null,null,null,null,"Neither",87.852811582927998,30.469491491581632,0,6.0257848156627851,3.0009837421877905,12.865244947479354,6.0257848156627851,0,3.0009837421877905,0,76.262495180385898,26.515041106693083,2.6795218399512732,0,0,6.5191936768088539,48.681939566425989,13.070233899765832,43.351184740049604,15.726519749309901]
["Place where household members most often wash their hands","OBSERVED: FIXED FACILITY OBSERVED (SINK / TAP) IN DWELLING",17.52012050508888,42.732442817094196,55.795068866850968,75.106688864342772,81.697184520302073,36.530454594656575,75.996646230514585,84.666142452738512,81.848708406888875,88.624750755133547,13.902140548343416,38.595724132734517,50.153675381845886,64.592005104020672,77.257195810565236,40.152516348367776,25.136521865761946,17.407550038537902,62.190349925469,41.544676429943543,null,null,null,null,null,null,null,null,null,null,null,null,null,null,null,null,null,null,null,null,null,null,null,null,null,null,null,null,null,null,"Place where household members most often wash their hands","OBSERVED: FIXED FACILITY OBSERVED (SINK / TAP) IN DWELLING",463.7692267232369,1131.2982928826736,1474.8522212071523,1993.4756602844823,2156.9164910584045,223.4404677691407,461.55911343353927,515.67137352264433,499.93584792555413,542.08775010731711,284.15119428401016,783.14423140878273,1021.6457405596657,1310.0612763867859,1578.6148967585111,288.98154955632504,236.42956226766162,28.300319423893445,5803.6161110329986,862.98434987507687]
[null,"OBSERVED: FIXED FACILITY OBSERVED (SINK / TAP) IN YARD /PLOT",54.253528902521808,38.478611158189871,35.43914977166186,17.94414670027966,13.389548150857253,38.805373095273552,15.644167482023366,11.505056214642345,15.244037474587596,5.4480899645208662,55.426829918957111,42.514948708478286,40.669919089943605,26.307603624109436,16.389541741713028,46.353413941416719,39.766795213959114,55.732788966623417,26.031604549933856,47.843615164630606,null,null,null,null,null,null,null,null,null,null,null,null,null,null,null,null,null,null,null,null,null,null,null,null,null,null,null,null,null,null,null,"OBSERVED: FIXED FACILITY OBSERVED (SINK / TAP) IN YARD /PLOT",1436.1269455207826,1018.6823931896271,936.77648974964643,476.27209017550177,353.50223369359503,237.35512773039068,95.013509563389277,70.073207173358782,93.111314142929601,33.324131307396634,1132.8902813261443,862.66905409467347,828.45871794646291,533.57335365229471,334.89145539211268,333.61001018709231,374.03925791461506,90.607565490150037,2429.2746341368447,993.82868460045006]
[null,"OBSERVED: MOBILE OBJECT (BUCKET / JUG / KETTLE/TINI VAI)",22.92759297160968,13.546341908157721,6.8642727799001797,4.2676434293586549,0.58758956788785033,9.4996171562680729,5.9699894511304512,2.0157472386459312,1.6593916407062883,0,25.343449883852436,15.20122445903711,7.5738271394573893,5.8556754060022485,2.9114531070050376,11.993224692635884,33.07541507507176,20.794662018518935,7.018834599568911,9.1246443733206721,null,null,null,null,null,null,null,null,null,null,null,null,null,null,null,null,null,null,null,null,null,null,null,null,null,null,null,null,null,null,null,"OBSERVED: MOBILE OBJECT (BUCKET / JUG / KETTLE/TINI VAI)",606.90861458287679,358.62572942760556,181.44592635178788,113.27144668253939,15.51316163944716,58.10491340928376,36.258218947100694,12.277199800466445,10.135643959254605,0,518.00451353023811,308.44741258133644,154.28118034920084,118.76537327088644,59.490422836489671,86.316399843667227,311.10135084647237,33.806915742487774,654.9990731930551,189.54113905857466]
[null,"NOT OBSERVED: NO HANDWASHING PLACE IN DWELLING / YARD / PLOT",2.9694852532723668,2.8241234406081004,0.47859842211281645,0.76414111187149991,1.3648191859305361,11.484282922288461,0.82160498665307857,1.2820679886091819,0.45622230124633173,3.1981437443534668,2.3109825950713776,1.6420557188859712,0.50234482276538805,0.61498333249854042,0.66971666524501827,1.1553199694214098,1.8715190908897832,3.8376126732680733,1.8326697683265285,0.92207051944971574,null,null,null,null,null,null,null,null,null,null,null,null,null,null,null,null,null,null,null,null,null,null,null,null,null,null,null,null,null,null,null,"NOT OBSERVED: NO HANDWASHING PLACE IN DWELLING / YARD / PLOT",78.604247001393247,74.765817646442287,12.65097364793635,20.28177157816031,36.03307784388744,70.244227087298071,4.9899474258629013,7.8086203231068163,2.7866277606029484,19.561968097224117,47.235061541464695,33.318884223412525,10.232918017733722,12.473151255053494,13.684481986060373,8.3149497306745239,17.603168879038183,6.2389976899810833,171.02511573595623,19.153655682169642]
[null,"NOT OBSERVED: NO PERMISSION TO SEE",2.2270087755883496,2.0410792938213049,1.4229101594741069,1.7967378224546531,2.5856112889457443,3.6802722315133685,1.567591849678512,0.42159840983839886,0,2.7290155359920862,2.8841573896151012,1.5536443799662811,1.1002335659877356,2.5047045042539477,2.5238862797997306,0.345525048158139,0,1.9693012402296688,2.6940950225592197,0.45487629244338901,null,null,null,null,null,null,null,null,null,null,null,null,null,null,null,null,null,null,null,null,null,null,null,null,null,null,null,null,null,null,null,"NOT OBSERVED: NO PERMISSION TO SEE",58.950401480428177,54.035514202209889,37.612324026100843,47.688869941334147,68.263645330494342,22.510580775729245,9.5206346628588161,2.5678060294017548,0,16.692468856711255,58.950401480428177,31.524933426480644,22.412094981158923,50.800658294015498,51.571176473783076,2.4867772410812261,0,3.2015909198587131,251.41349576448107,9.4488910551463619]
[null,"OTHER REASON",0.10226359191886662,0.37740138212893842,0,0.12064207169277565,0.37524728607655422,0,0,0.10938769552563862,0.79164017657092778,0,0.13243966416048877,0.49240260089786708,0,0.12502802911514782,0.24820639567194755,0,0.14974875431742218,0.25808506282212185,0.23244613414243864,0.11011722021203613,null,null,null,null,null,null,null,null,null,null,null,null,null,null,null,null,null,null,null,null,null,null,null,null,null,null,null,null,null,null,null,"OTHER REASON",2.7069852020925262,9.9913206731826723,0,3.2020721078548409,9.9070373638432692,0,0,0.66624156438532023,4.8353762769042286,0,2.7069852020925262,9.9913206731826723,0,2.5358305434695207,5.0716610869390415,0,1.4085096029781414,0.4195817159928798,21.691920541902643,2.2874034860996466]
[]
[]
[]
[]
[]
[]
[]
[]
[]
[]
[]
[]
[]
[]
[{"$f":"A1026","v":"Tonga"}]
[{"$f":"A1034","v":"2019"}]
["Access to menstrual health and hygiene facilities"]
[" by wealth quintile and sub-national region"]
["Notes:"]
["WHO/UNICEF JMP customised wealth index excludes water,"]
[" sanitation and hygiene assets."]
["Survey used for analysis:",{"$f":"A1025","v":"MICS19"}]
["Menstrual health and hygiene",null,"NATIONAL wealth index quintile",null,null,null,null,"URBAN wealth index quintile",null,null,null,null,"RURAL wealth index quintile",null,null,null,null,"SUB-REGIONS:",null,null,null,null,null,null,null,null,null,null,null,null,null,null,null,null,null,null,null,null,null,null,null,null,null,null,null,null,null,null,null,null,null,null,"Raw numbers of respondents:","Menstrual health and hygiene","NATIONAL wealth index quintile",null,null,null,null,"URBAN wealth index quintile",null,null,null,null,"RURAL wealth index quintile",null,null,null,null,"SUB-REGIONS:"]
["Percentage based on weighted women population",null,"Poorest","Poor","Middle","Rich","Richest","Poorest","Poor","Middle","Rich","Richest","Poorest","Poor","Middle","Rich","Richest","'EUA","HA'APAI","ONGO NIUA","TONGATAPU","VAVA'U",null,null,null,null,null,null,null,null,null,null,null,null,null,null,null,null,null,null,null,null,null,null,null,null,null,null,null,null,null,null,"MHH data, raw numbers (weighted)",null,"Poorest","Poor","Middle","Rich","Richest","Poorest","Poor","Middle","Rich","Richest","Poorest","Poor","Middle","Rich","Richest","'EUA","HA'APAI","ONGO NIUA","TONGATAPU","VAVA'U"]
["Private place to wash and change","Yes",95.166270202696552,94.514011075987185,92.950785564097558,93.547488073418208,94.498748138457188,94.96860895177673,95.689145873146728,94.481060059440878,96.652645089268603,90.094732450112332,96.909956283566984,94.617283885311338,92.690520129228389,95.024405642553717,92.274713511251619,97.698899270195241,95.768676309678185,88.921475974450516,92.980092549801924,97.816668817113197,null,null,null,null,null,null,null,null,null,null,null,null,null,null,null,null,null,null,null,null,null,null,null,null,null,null,null,null,null,null,"Private place to wash and change","Yes",348.09231139920502,566.88272944035452,547.11085045852872,533.91873328628571,522.38348559159533,116.08903834935964,124.70730103777045,120.68021587531089,126.79454733713524,115.72651888849005,210.46083935461721,407.24759804815608,431.8616055012738,413.14176086841189,451.67868491544004,137.25737903594552,168.44376628354621,25.818139821196986,1816.7260048160547,370.14282021922878]
[null,"No",4.8337297973034818,5.4859889240129416,7.0492144359024653,6.4525119265818107,5.5012518615428254,5.0313910482232629,4.3108541268532381,5.5189399405591058,3.3473549107314566,9.9052675498876965,3.0900437164329699,5.3827161146886802,7.3094798707716206,4.9755943574462789,7.7252864887483899,2.3011007298046655,4.2313236903218376,11.078524025549495,7.0199074501977643,2.1833311828868056,null,null,null,null,null,null,null,null,null,null,null,null,null,null,null,null,null,null,null,null,null,null,null,null,null,null,null,null,null,null,null,"No",17.680467819520612,32.904247100715139,41.491867784502027,36.827466619428684,30.410594628612731,6.1503412000527966,5.6181396376981061,7.0493161593501474,4.391254375821072,12.723298033460079,6.7106953624043735,23.168052586873884,34.056165700328926,21.632609015570019,37.814771881219798,3.2328210187629338,7.4423091790251252,3.2166231966989618,137.16106390564579,8.2618266526463504]
[null,"DK/not sure/missing","N/A","N/A","N/A","N/A","N/A","N/A","N/A","N/A","N/A","N/A","N/A","N/A","N/A","N/A","N/A","N/A","N/A","N/A","N/A","N/A",null,null,null,null,null,null,null,null,null,null,null,null,null,null,null,null,null,null,null,null,null,null,null,null,null,null,null,null,null,null,null,"DK/not sure/missing","N/A","N/A","N/A","N/A","N/A","N/A","N/A","N/A","N/A","N/A","N/A","N/A","N/A","N/A","N/A","N/A","N/A","N/A","N/A","N/A"]
["Use of menstrual materials","Materials reusable",1.708314384025474,0.18135074179816199,0.51452275069385633,0.34574419018895358,2.2313760013147217,0,0.64062889644789067,0.99784167329228257,2.5356415016241804,1.5570553698308929,0.73864889050192828,1.1890946982020274,0.20124900775008608,0.43011272513608456,1.5745381799221307,0.46063365778610443,0.26928556573755302,3.3001818883216343,0.83690166849220093,1.6495315053519759,null,null,null,null,null,null,null,null,null,null,null,null,null,null,null,null,null,null,null,null,null,null,null,null,null,null,null,null,null,null,"Use of menstrual materials","Materials reusable",6.2485490002432265,1.0877181311659965,3.0284948965628495,1.973321826898238,12.334914442722173,0,0.83490243239010498,1.274538499743064,3.3264016324721233,2.0000347719211748,1.6041351316732906,5.1180496819329013,0.93765489147454173,1.8700198905012348,7.7072613654840483,0.64714514734301987,0.47363581336296456,0.95819999043370985,16.35211347858532,6.2419038678674692]
[null,"Materials not reusable",92.75944956028313,94.183148147387143,91.44216402816113,95.264458109938658,90.844895549875019,85.838337137841478,83.276043983755912,91.086721848620158,95.70020995673589,91.589039257226119,92.149880649766359,95.859349815190086,94.07972150703003,96.203392534433135,91.116441593254919,98.300784318952466,98.927678706257339,78.406420767263725,92.292129860452192,92.538379007617138,null,null,null,null,null,null,null,null,null,null,null,null,null,null,null,null,null,null,null,null,null,null,null,null,null,null,null,null,null,null,null,"Materials not reusable",339.28881664463944,564.89825668440915,538.23106309000718,543.71827452324601,502.18520478194034,104.92825073283031,108.52987129892695,116.34464356295589,125.54508767272637,117.64595324647995,200.12331004700138,412.59364420155975,438.33414159822917,418.26769369859539,446.00901966493302,138.10296854504392,174.00001162265787,22.765118460589374,1803.28399079122,350.16952630473105]
[null,"No materials used",4.8077348523119392,4.8246825722400466,7.9739994382424779,4.3897976998724042,6.7288401842733352,14.161662862158494,16.083327119796177,7.9154364780875701,1.7641485416399909,6.015188109485246,5.8912238972496915,2.4880285106561728,5.0158852050235616,3.3664947404307846,7.3090202268229651,0.94818254335273922,0.80303572800508138,18.2933973444147,6.4789892213860831,5.5658686463049643,null,null,null,null,null,null,null,null,null,null,null,null,null,null,null,null,null,null,null,null,null,null,null,null,null,null,null,null,null,null,null,"No materials used",17.585385386768667,28.937817727742452,46.935177446179217,25.0546035555702,37.196630206141535,17.311128816582109,20.960666944151519,10.11034997196211,2.3143124077578481,7.72649811414471,12.794061351273092,10.708864102125812,23.369900553276718,14.636656294885338,35.777175766242799,1.3321035520400875,1.4124280265504263,5.3114445668728782,126.59213258053587,21.061505596402714]
[null,"DK/not sure/missing",0.72450120337940027,0.81081853857477693,6.9313782902547763E-2,0,0.19488826453697189,0,0,0,0,0.83871726345775777,1.220246562482038,0.46352697595169856,0.70314428019631481,0,0,0.29039947990863113,0,0,0.39197924966909359,0.24622084072583694,null,null,null,null,null,null,null,null,null,null,null,null,null,null,null,null,null,null,null,null,null,null,null,null,null,null,null,null,null,null,null,"DK/not sure/missing",2.6500281870739428,4.8631839977521354,0.40798281028146915,0,1.0773307894042796,0,0,0,0,1.0773307894042796,2.6500281870739428,1.9950926494113821,3.276074158622222,0,0,0.40798281028146915,0,0,7.6588318713567922,0.93171110287356529]
["Use of menstrual materials with private place to wash and change","Materials reusable",1.8088547071135714,0.19353742053746481,0.55395628517379691,0.3695921689715555,1.8501944725926187,0,0.66948961724160461,1.056128786726684,1.3233518900437578,0.83625675885237516,0.77192092300721982,1.2629285726184569,0.218778942102199,0.4526339546431975,1.7063593264151806,0.47288856596479278,0.28118334314947568,3.7113440281511556,0.75521666091920492,1.6906056491112678,null,null,null,null,null,null,null,null,null,null,null,null,null,null,null,null,null,null,null,null,null,null,null,null,null,null,null,null,null,null,"Use of menstrual materials with private place to wash and change","Materials reusable",6.2485490002432265,1.0877181311659965,3.0284948965628495,1.973321826898238,9.6451776614352589,0,0.83490243239010498,1.274538499743064,1.6779380386584064,0.95876158444797766,1.6041351316732906,5.1180496819329013,0.93765489147454173,1.8700198905012348,7.7072613654840483,0.64714514734301987,0.47363581336296456,0.95819999043370985,13.662376697298406,6.2419038678674692]
[null,"Materials not reusable",93.419718269014979,96.030389688177436,92.818003002922893,95.453457796046351,92.166792260944277,85.088059077131945,82.522619609945437,90.566068854676033,96.851402106589632,93.13404207095121,93.602191592178201,96.547772014801296,97.554216354714868,96.670975280329088,92.132010131967505,98.553703009314404,99.139909773895752,77.500660840101148,93.725115962135106,92.778851018721468,null,null,null,null,null,null,null,null,null,null,null,null,null,null,null,null,null,null,null,null,null,null,null,null,null,null,null,null,null,null,null,"Materials not reusable",322.71120775882559,539.709559612254,507.4386841108157,509.64389274260998,480.47116074005197,98.7779095327775,102.91173166122884,109.29532740360574,122.80229689071899,106.77742307820652,194.5154736183035,391.26226499665034,418.10325651101465,399.38816952181878,416.1406517502308,134.87014752628085,166.99499791325954,20.009228978048974,1695.5503056753373,342.54982487163238]
[null,"No materials used",4.7714270238714356,3.7760728912850117,6.6280407119032141,4.1769500349819522,5.9830132664631481,14.91194092286802,16.807890772812975,8.377802358597302,1.825246003366612,6.0297011701964243,5.6258874848146094,2.1892994125802554,2.227004703182923,2.8763907650277076,6.1616305416173214,0.97340842472074529,0.57890688295480286,18.787995131747774,5.5196673769455398,5.5305433321670812,null,null,null,null,null,null,null,null,null,null,null,null,null,null,null,null,null,null,null,null,null,null,null,null,null,null,null,null,null,null,null,"No materials used",16.482526453062118,21.222267699181334,36.235688640868176,22.301518716776709,31.189816400704007,17.311128816582109,20.960666944151519,10.11034997196211,2.3143124077578481,6.913003436431274,11.691202417566537,8.8721907201614858,9.5446199401623719,11.883571456091856,27.830771799725223,1.3321035520400875,0.97513255692375056,4.8507108527143235,99.854490572059433,20.419380376854715]
["Awareness of menstruation before menarche","Yes","N/A","N/A","N/A","N/A","N/A","N/A","N/A","N/A","N/A","N/A","N/A","N/A","N/A","N/A","N/A","N/A","N/A","N/A","N/A","N/A",null,null,null,null,null,null,null,null,null,null,null,null,null,null,null,null,null,null,null,null,null,null,null,null,null,null,null,null,null,null,"Awareness of menstruation before menarche","Yes","N/A","N/A","N/A","N/A","N/A","N/A","N/A","N/A","N/A","N/A","N/A","N/A","N/A","N/A","N/A","N/A","N/A","N/A","N/A","N/A"]
[null,"No","N/A","N/A","N/A","N/A","N/A","N/A","N/A","N/A","N/A","N/A","N/A","N/A","N/A","N/A","N/A","N/A","N/A","N/A","N/A","N/A",null,null,null,null,null,null,null,null,null,null,null,null,null,null,null,null,null,null,null,null,null,null,null,null,null,null,null,null,null,null,null,"No","N/A","N/A","N/A","N/A","N/A","N/A","N/A","N/A","N/A","N/A","N/A","N/A","N/A","N/A","N/A","N/A","N/A","N/A","N/A","N/A"]
[null,"DK/not sure/missing","N/A","N/A","N/A","N/A","N/A","N/A","N/A","N/A","N/A","N/A","N/A","N/A","N/A","N/A","N/A","N/A","N/A","N/A","N/A","N/A",null,null,null,null,null,null,null,null,null,null,null,null,null,null,null,null,null,null,null,null,null,null,null,null,null,null,null,null,null,null,null,"DK/not sure/missing","N/A","N/A","N/A","N/A","N/A","N/A","N/A","N/A","N/A","N/A","N/A","N/A","N/A","N/A","N/A","N/A","N/A","N/A","N/A","N/A"]
["Participation in (all) activities during menstruation","Yes",80.969941911015553,85.18847639049855,84.170413007586788,84.463012690281175,85.132139249425492,88.408851093313487,87.63141004231818,84.924298156702164,85.483853360894486,85.716104799044132,80.353977702832253,79.538725671337062,87.402578311667909,83.84243888727903,84.500047734745266,96.75698307819988,85.097055150246916,75.355154136551008,85.176233770314056,74.915844453388232,null,null,null,null,null,null,null,null,null,null,null,null,null,null,null,null,null,null,null,null,null,null,null,null,null,null,null,null,null,null,"Participation in (all) activities during menstruation","Yes",296.16600685970917,510.94938690397356,495.42933891904124,482.06943525566106,470.60542613564837,108.07043104323036,114.20602130777802,108.47340861927596,112.14267836661732,110.10217968699907,174.50596658341419,342.34712360509701,407.22414484245854,364.52543536753001,413.62220465163222,135.93407909346357,149.67387063798921,21.879190425317798,1664.2474172623376,283.48503665492694]
[null,"No",18.77246744454192,14.206963396141651,15.829586992413102,15.536987309718665,14.716827578863004,10.292561646896459,12.368589957681788,15.075701843297812,14.516146639105528,13.633911843721963,19.558665598902643,19.812791637903075,12.597421688332094,16.157561112721027,15.499952265254729,3.2430169217999674,14.902944849753174,23.991443312225748,14.556941267392961,25.084155546611548,null,null,null,null,null,null,null,null,null,null,null,null,null,null,null,null,null,null,null,null,null,null,null,null,null,null,null,null,null,null,null,"No",68.664575899831434,85.211516212014374,93.173379323988712,88.676764650052348,81.353751652169649,12.58156349690702,16.119419367690547,19.256123415385066,19.043123346338941,17.512734802560932,42.475854251307027,85.277356037243322,58.693626359144204,70.248934516452138,75.871252145027555,4.5561209612448268,26.212204824582255,6.9658587102775904,284.42619302500475,94.919610216947291]
[null,"DK/not sure/missing/no such activity",0.25759064444270546,0.60456021335962695,0,0,0.15103317171152011,1.2985872597900163,0,0,0,0.6499833572339121,8.7356698265167218E-2,0.64848269075991483,0,0,0,0,0,0.65340255122333502,0.26682496229251268,0,null,null,null,null,null,null,null,null,null,null,null,null,null,null,null,null,null,null,null,null,null,null,null,null,null,null,null,null,null,null,null,"DK/not sure/missing/no such activity",0.94219645918550932,3.6260734250799418,0,0,0.83490243239010498,1.5873850092750328,0,0,0,0.83490243239010498,0.18971388230058148,2.7911709926898367,0,0,0,0,0,0.18971388230058148,5.2134584343549744,0]
["Participation in specific activities during menstruation","Did not go to school (amongst those usually attending school)","N/A","N/A","N/A","N/A","N/A","N/A","N/A","N/A","N/A","N/A","N/A","N/A","N/A","N/A","N/A","N/A","N/A","N/A","N/A","N/A",null,null,null,null,null,null,null,null,null,null,null,null,null,null,null,null,null,null,null,null,null,null,null,null,null,null,null,null,null,null,"Participation in specific activities during menstruation","Did not go to school (amongst those usually attending school)","N/A","N/A","N/A","N/A","N/A","N/A","N/A","N/A","N/A","N/A","N/A","N/A","N/A","N/A","N/A","N/A","N/A","N/A","N/A","N/A"]
[null,"Did not go to work (amongst those who usually work)","N/A","N/A","N/A","N/A","N/A","N/A","N/A","N/A","N/A","N/A","N/A","N/A","N/A","N/A","N/A","N/A","N/A","N/A","N/A","N/A",null,null,null,null,null,null,null,null,null,null,null,null,null,null,null,null,null,null,null,null,null,null,null,null,null,null,null,null,null,null,null,"Did not go to work (amongst those who usually work)","N/A","N/A","N/A","N/A","N/A","N/A","N/A","N/A","N/A","N/A","N/A","N/A","N/A","N/A","N/A","N/A","N/A","N/A","N/A","N/A"]
[null,"Did not participate in social activities","N/A","N/A","N/A","N/A","N/A","N/A","N/A","N/A","N/A","N/A","N/A","N/A","N/A","N/A","N/A","N/A","N/A","N/A","N/A","N/A",null,null,null,null,null,null,null,null,null,null,null,null,null,null,null,null,null,null,null,null,null,null,null,null,null,null,null,null,null,null,null,"Did not participate in social activities","N/A","N/A","N/A","N/A","N/A","N/A","N/A","N/A","N/A","N/A","N/A","N/A","N/A","N/A","N/A","N/A","N/A","N/A","N/A","N/A"]
[null,"Did not cook food","N/A","N/A","N/A","N/A","N/A","N/A","N/A","N/A","N/A","N/A","N/A","N/A","N/A","N/A","N/A","N/A","N/A","N/A","N/A","N/A",null,null,null,null,null,null,null,null,null,null,null,null,null,null,null,null,null,null,null,null,null,null,null,null,null,null,null,null,null,null,null,"Did not cook food","N/A","N/A","N/A","N/A","N/A","N/A","N/A","N/A","N/A","N/A","N/A","N/A","N/A","N/A","N/A","N/A","N/A","N/A","N/A","N/A"]
[null,"Did not eat with others","N/A","N/A","N/A","N/A","N/A","N/A","N/A","N/A","N/A","N/A","N/A","N/A","N/A","N/A","N/A","N/A","N/A","N/A","N/A","N/A",null,null,null,null,null,null,null,null,null,null,null,null,null,null,null,null,null,null,null,null,null,null,null,null,null,null,null,null,null,null,null,"Did not eat with others","N/A","N/A","N/A","N/A","N/A","N/A","N/A","N/A","N/A","N/A","N/A","N/A","N/A","N/A","N/A","N/A","N/A","N/A","N/A","N/A"]
[null,"Did not bathe in regular place","N/A","N/A","N/A","N/A","N/A","N/A","N/A","N/A","N/A","N/A","N/A","N/A","N/A","N/A","N/A","N/A","N/A","N/A","N/A","N/A",null,null,null,null,null,null,null,null,null,null,null,null,null,null,null,null,null,null,null,null,null,null,null,null,null,null,null,null,null,null,null,"Did not bathe in regular place","N/A","N/A","N/A","N/A","N/A","N/A","N/A","N/A","N/A","N/A","N/A","N/A","N/A","N/A","N/A","N/A","N/A","N/A","N/A","N/A"]
[null,"Did not participate in other activities","N/A","N/A","N/A","N/A","N/A","N/A","N/A","N/A","N/A","N/A","N/A","N/A","N/A","N/A","N/A","N/A","N/A","N/A","N/A","N/A",null,null,null,null,null,null,null,null,null,null,null,null,null,null,null,null,null,null,null,null,null,null,null,null,null,null,null,null,null,null,null,"Did not participate in other activities","N/A","N/A","N/A","N/A","N/A","N/A","N/A","N/A","N/A","N/A","N/A","N/A","N/A","N/A","N/A","N/A","N/A","N/A","N/A","N/A"]
[null,"DK/not sure/missing/no such activity","N/A","N/A","N/A","N/A","N/A","N/A","N/A","N/A","N/A","N/A","N/A","N/A","N/A","N/A","N/A","N/A","N/A","N/A","N/A","N/A",null,null,null,null,null,null,null,null,null,null,null,null,null,null,null,null,null,null,null,null,null,null,null,null,null,null,null,null,null,null,null,"DK/not sure/missing/no such activity","N/A","N/A","N/A","N/A","N/A","N/A","N/A","N/A","N/A","N/A","N/A","N/A","N/A","N/A","N/A","N/A","N/A","N/A","N/A","N/A"]
[]
[]
[]
[]
[]
[]
[]
[]
[]
[]
[]
[]
[]
[]
[]
[]
[]
[]
[]
[]
[]
[]
[]
[]
[]
[]
[]
[]
[]
[]
[]
[]
[]
[]
[]
[]
[]
[]
[]
[]
[]
[]
[]
[]
[]
[]
[{"$f":"A1026","v":"Tonga"}]
[{"$f":"A1034","v":"2019"}]
["Use of basic water, sanitation and hygiene facilities"]
[" by wealth quintile and sub-national region"]
["Notes:"]
["WHO/UNICEF JMP customised wealth index excludes water,"]
[" sanitation and hygiene assets."]
["Survey used for analysis:",{"$f":"A1025","v":"MICS19"}]
["Basic water, sanitation and hygiene",null,"NATIONAL wealth index quintile",null,null,null,null,"URBAN wealth index quintile",null,null,null,null,"RURAL wealth index quintile",null,null,null,null,"SUB-REGIONS:",null,null,null,null,null,null,null,null,null,null,null,null,null,null,null,null,null,null,null,null,null,null,null,null,null,null,null,null,null,null,null,null,null,null,"Raw numbers of respondents:","Basic water, sanitation and hygiene","NATIONAL wealth index quintile",null,null,null,null,"URBAN wealth index quintile",null,null,null,null,"RURAL wealth index quintile",null,null,null,null,"SUB-REGIONS:"]
["Percentage based on weighted population",null,"Poorest","Poor","Middle","Rich","Richest","Poorest","Poor","Middle","Rich","Richest","Poorest","Poor","Middle","Rich","Richest","'EUA","HA'APAI","ONGO NIUA","TONGATAPU","VAVA'U",null,null,null,null,null,null,null,null,null,null,null,null,null,null,null,null,null,null,null,null,null,null,null,null,null,null,null,null,null,null,"WatSan data, raw numbers (weighted)",null,"Poorest","Poor","Middle","Rich","Richest","Poorest","Poor","Middle","Rich","Richest","Poorest","Poor","Middle","Rich","Richest","'EUA","HA'APAI","ONGO NIUA","TONGATAPU","VAVA'U"]
["Use of basic water sanitation and hygiene","Yes",36.038514442916089,55.555555555555557,66.121495327102807,79.726651480637813,86.926605504587144,45,75.396825396825392,86.04651162790698,85.9375,90.082644628099175,35.170178282009722,53.061224489795919,62.222222222222221,72.053872053872055,84.042553191489361,55.522388059701491,45.026178010471199,42.944785276073624,70.386643233743413,63.541666666666664,null,null,null,null,null,null,null,null,null,null,null,null,null,null,null,null,null,null,null,null,null,null,null,null,null,null,null,null,null,null,"Use of Basic Water Sanitation and Hygiene","Yes",262,260,283,350,379,63,95,111,110,109,217,182,196,214,237,186,172,70,801,305]
[null,"No",63.961485557083911,44.444444444444443,33.878504672897201,20.273348519362187,13.073394495412844,55.000000000000007,24.603174603174601,13.953488372093023,14.0625,9.9173553719008272,64.829821717990271,46.938775510204081,37.777777777777779,27.946127946127948,15.957446808510639,44.477611940298509,54.973821989528794,57.055214723926383,29.613356766256587,36.458333333333329,null,null,null,null,null,null,null,null,null,null,null,null,null,null,null,null,null,null,null,null,null,null,null,null,null,null,null,null,null,null,null,"No",465,208,145,89,57,77,31,18,18,12,400,161,119,83,45,149,210,93,337,175]
["Use of basic water and sanitation","Yes",81.292984869326006,89.102564102564102,92.523364485981304,96.81093394077449,97.247706422018354,84.285714285714292,94.444444444444443,98.449612403100772,97.65625,97.52066115702479,80.875202593192881,88.338192419825063,91.111111111111114,95.622895622895626,96.808510638297875,92.238805970149258,83.507853403141368,87.116564417177912,91.915641476274175,91.041666666666671,null,null,null,null,null,null,null,null,null,null,null,null,null,null,null,null,null,null,null,null,null,null,null,null,null,null,null,null,null,null,"Use of Basic Water and Sanitation","Yes",591,417,396,425,424,118,119,127,125,118,499,303,287,284,273,309,319,142,1046,437]
[null,"No",18.707015130674005,10.897435897435898,7.4766355140186906,3.1890660592255129,2.7522935779816518,15.714285714285714,5.5555555555555554,1.5503875968992249,2.34375,2.4793388429752068,19.124797406807133,11.661807580174926,8.8888888888888893,4.3771043771043772,3.1914893617021276,7.7611940298507456,16.492146596858639,12.883435582822086,8.0843585237258342,8.9583333333333339,null,null,null,null,null,null,null,null,null,null,null,null,null,null,null,null,null,null,null,null,null,null,null,null,null,null,null,null,null,null,null,"No",136,51,32,14,12,22,7,2,3,3,118,40,28,13,9,26,63,21,92,43]
["Use of basic water and hygiene","Yes",41.540577716643739,58.974358974358978,70.09345794392523,81.548974943052386,88.302752293577981,52.142857142857146,77.777777777777786,86.04651162790698,87.5,92.561983471074385,40.356564019448946,56.559766763848394,66.349206349206341,74.747474747474755,85.460992907801412,57.910447761194028,50.785340314136128,47.239263803680984,73.725834797891025,66.041666666666671,null,null,null,null,null,null,null,null,null,null,null,null,null,null,null,null,null,null,null,null,null,null,null,null,null,null,null,null,null,null,"Use of Basic Water and Hygiene","Yes",302,276,300,358,385,73,98,111,112,112,249,194,209,222,241,194,194,77,839,317]
[null,"No",58.459422283356254,41.025641025641022,29.906542056074763,18.451025056947611,11.697247706422019,47.857142857142861,22.222222222222221,13.953488372093023,12.5,7.4380165289256199,59.643435980551054,43.440233236151606,33.650793650793652,25.252525252525253,14.539007092198581,42.089552238805972,49.214659685863879,52.760736196319016,26.274165202108961,33.958333333333336,null,null,null,null,null,null,null,null,null,null,null,null,null,null,null,null,null,null,null,null,null,null,null,null,null,null,null,null,null,null,null,"No",425,192,128,81,51,67,28,18,16,9,368,149,106,75,41,141,188,86,299,163]
["Use of basic sanitation and hygiene","Yes",36.176066024759287,56.623931623931625,66.822429906542055,80.637813211845099,87.614678899082563,46.428571428571431,76.984126984126988,86.04651162790698,85.9375,90.082644628099175,35.332252836304704,53.644314868804663,62.857142857142854,73.400673400673398,85.106382978723403,55.522388059701491,45.287958115183244,42.944785276073624,71.441124780316343,64.166666666666671,null,null,null,null,null,null,null,null,null,null,null,null,null,null,null,null,null,null,null,null,null,null,null,null,null,null,null,null,null,null,"Use of Basic Sanitation and Hygiene","Yes",263,265,286,354,382,65,97,111,110,109,218,184,198,218,240,186,173,70,813,308]
[null,"No",63.823933975240706,43.376068376068375,33.177570093457945,19.362186788154897,12.385321100917432,53.571428571428569,23.015873015873016,13.953488372093023,14.0625,9.9173553719008272,64.667747163695296,46.355685131195337,37.142857142857146,26.599326599326602,14.893617021276595,44.477611940298509,54.712041884816756,57.055214723926383,28.558875219683657,35.833333333333336,null,null,null,null,null,null,null,null,null,null,null,null,null,null,null,null,null,null,null,null,null,null,null,null,null,null,null,null,null,null,null,"No",464,203,142,85,54,75,29,18,18,12,399,159,117,79,42,149,209,93,325,172]
["Use of basic water","Yes",98.899587345254474,98.71794871794873,98.831775700934571,99.088838268792713,99.311926605504581,97.857142857142847,98.412698412698404,100,100,100,98.865478119935162,99.125364431486886,98.730158730158735,98.653198653198643,98.936170212765958,99.701492537313428,99.476439790575924,98.159509202453989,98.594024604569412,99.166666666666671,null,null,null,null,null,null,null,null,null,null,null,null,null,null,null,null,null,null,null,null,null,null,null,null,null,null,null,null,null,null,"Use of Basic Water","Yes",719,462,423,435,433,137,124,129,128,121,610,340,311,293,279,334,380,160,1122,476]
[null,"No",1.1004126547455295,1.2820512820512819,1.1682242990654206,0.91116173120728927,0.68807339449541294,2.1428571428571428,1.5873015873015872,0,0,0,1.1345218800648298,0.87463556851311952,1.2698412698412698,1.3468013468013467,1.0638297872340425,0.29850746268656719,0.52356020942408377,1.8404907975460123,1.4059753954305798,0.83333333333333337,null,null,null,null,null,null,null,null,null,null,null,null,null,null,null,null,null,null,null,null,null,null,null,null,null,null,null,null,null,null,null,"No",8,6,5,4,3,3,2,0,0,0,7,3,4,4,3,1,2,3,16,4]
["Use of basic sanitation","Yes",82.393397524071531,90.384615384615387,93.45794392523365,97.722095671981776,97.935779816513758,86.428571428571431,96.031746031746039,98.449612403100772,97.65625,97.52066115702479,82.009724473257691,89.212827988338191,92.063492063492063,96.969696969696969,97.872340425531917,92.537313432835816,84.031413612565444,88.957055214723923,93.23374340949033,91.875,null,null,null,null,null,null,null,null,null,null,null,null,null,null,null,null,null,null,null,null,null,null,null,null,null,null,null,null,null,null,"Use of Basic Sanitation","Yes",599,423,400,429,427,121,121,127,125,118,506,306,290,288,276,310,321,145,1061,441]
[null,"No",17.606602475928472,9.6153846153846168,6.5420560747663545,2.2779043280182232,2.0642201834862388,13.571428571428571,3.9682539682539679,1.5503875968992249,2.34375,2.4793388429752068,17.990275526742302,10.787172011661808,7.9365079365079358,3.0303030303030303,2.1276595744680851,7.4626865671641784,15.968586387434556,11.042944785276074,6.7662565905096654,8.125,null,null,null,null,null,null,null,null,null,null,null,null,null,null,null,null,null,null,null,null,null,null,null,null,null,null,null,null,null,null,null,"No",128,45,28,10,9,19,5,2,3,3,111,37,25,9,6,25,61,18,77,39]
["Access to basic hygiene","Yes",41.67812929848693,60.042735042735039,71.028037383177562,82.460136674259672,88.9908256880734,53.571428571428569,79.365079365079367,86.04651162790698,87.5,92.561983471074385,40.518638573743921,57.142857142857139,67.301587301587304,76.094276094276097,86.524822695035468,57.910447761194028,51.047120418848166,47.239263803680984,74.868189806678387,66.666666666666657,null,null,null,null,null,null,null,null,null,null,null,null,null,null,null,null,null,null,null,null,null,null,null,null,null,null,null,null,null,null,"Access to Basic Hygiene","Yes",303,281,304,362,388,75,100,111,112,112,250,196,212,226,244,194,195,77,852,320]
[null,"No",58.32187070151307,39.957264957264961,28.971962616822427,17.539863325740317,11.009174311926607,46.428571428571431,20.634920634920633,13.953488372093023,12.5,7.4380165289256199,59.481361426256072,42.857142857142854,32.698412698412696,23.905723905723907,13.475177304964539,42.089552238805972,48.952879581151834,52.760736196319016,25.13181019332162,33.333333333333329,null,null,null,null,null,null,null,null,null,null,null,null,null,null,null,null,null,null,null,null,null,null,null,null,null,null,null,null,null,null,null,"No",424,187,124,77,48,65,26,18,16,9,367,147,103,71,38,141,187,86,286,160]
[]
[]
[]
[]
[]
[]
[]
[]
[]
[]
[]
[]
[]
[]
[]
[]
[]
[]
[]
[]
[]
[]
[]
[]
[]
[]
[]
[]
[]
[]
[]
[]
[]
[]
[]
[]
[]
[]
[]
[]
[]
[]
[]
[]
[null,null,"INITIAL (national) Wealth Index",null,null,null,null,"URBAN Wealth Index",null,null,null,null,"RURAL Wealth Index"]
[null,null,"Component Matrix",null,null,null,null,"Component Matrix",null,null,null,null,"Component Matrix"]
[null,null,"",null,"Component",null,null,"",null,"Component",null,null,"",null,"Component"]
[null,"Note:\n\nThe INITIAL (national) Wealth Index is based on the first component of the Principal Component Analysis (PCA) which has been obtained at national level.\n\nThe final national-level (NATIONAL) Wealth Index is based on the URBAN and RURAL specific wealth indexes. Regression procedures are used to establish the relationships between the two sets of scores (urban and rural) and the initial (national) wealth factors.\nThis allows best use of the available information for each area and a better precision of the FINAL (NATIONAL) Wealth Index.\n\nFor dependency reasons, all WASH variables (contained in the generic MICS and DHS scripts) have been excluded from the sets of asset variables used in the PCAs.\n\nThe PCA can extracts as many components as there are asset variables in the input. Only the first of the components is used to represent the Wealth Index. \n\nThe scores represent the weights of the asset variables on the Wealth Index (correlations between the variables and the component).\n\nThe communalities are the proportion of each variable's variance that can be explained by the component.\n\nProportion of explained variance is the part of the model's total variance that is explained by the component.\n\nFor more information on the procedure used:\n\nThe DHS Wealth Index, DHS Comparative Reports No. 6, Shea Oscar Rutstein, Kiersten Johnson, ORC Macro International Inc., 2004.\n\nThe DHS Wealth Index: Approaches for Rural and Urban Areas, Shea O. Rutstein, ORC Macro International Inc., 2008.\n\nMICS Methodological Paper No. 4, Review of options for reporting water, sanitation and hygiene coverage by wealth quintile, UNICEF, 2016.",null,null,"1",null,null,null,null,"1",null,null,null,null,"1"]
[null,null,"Wood",null,-0.62948679152182696,null,null,"No electricity",null,-0.56394816488780841,null,null,"Yes, interconnected grid",null,0.741958767855037]
[null,null,"Yes, interconnected grid",null,0.61938887908181228,null,null,"Electricity",null,0.56152071049650931,null,null,"Electricity",null,0.72762244823262123]
[null,null,"Liquefied petroleum gas (lpg)/ cooking gas stove",null,0.61454975401497525,null,null,"Yes, interconnected grid",null,0.53948068677131289,null,null,"Liquefied petroleum gas (lpg)/ cooking gas stove",null,0.63408488762996329]
[null,null,"Electricity",null,0.60985161111426611,null,null,"Cupboard/Cabinet",null,0.51243786568249017,null,null,"Yes, off-grid (generator/isolated system)",null,-0.63273829016589556]
[null,null,"Three stone stove / open fire",null,-0.60763433794789667,null,null,"Microwave",null,0.48179419056824457,null,null,"Wood",null,-0.62212100685671323]
[null,null,"Sofa",null,0.57662320946467271,null,null,"Sofa",null,0.47224619480152569,null,null,"Solar lantern",null,-0.62038156900806152]
[null,null,"In main house - in a separate room",null,0.5713813475671955,null,null,"Computer/tablet",null,0.47006621318664771,null,null,"Three stone stove / open fire",null,-0.58136999822785818]
[null,null,"Television",null,0.57056831844363165,null,null,"Car/truck/van",null,0.46574270851120536,null,null,"Television",null,0.57271347229906988]
[null,null,"Refrigetaror",null,0.54534965732288121,null,null,"Washing Machine",null,0.4610165676899507,null,null,"Sofa",null,0.55582267335775759]
[null,null,"Washing Machine",null,0.54173346505316444,null,null,"Ceramic tiles floor",null,0.46037868131263432,null,null,"In main house - in a separate room",null,0.55550150360258599]
[null,null,"Car/truck/van",null,0.53612351035627337,null,null,"Refrigetaror",null,0.43583586417122383,null,null,"Washing Machine",null,0.54130248645287604]
[null,null,"In a separate building",null,-0.49830732122792548,null,null,"Television",null,0.42898724449903575,null,null,"Car/truck/van",null,0.52083480614688726]
[null,null,"Microwave",null,0.45906677348754032,null,null,"Freezer",null,0.40684629581061327,null,null,"Refrigetaror",null,0.50163044295951054]
[null,null,"Cupboard/Cabinet",null,0.45432692812311759,null,null,"Candle",null,-0.39592841065351453,null,null,"In a separate building",null,-0.49558354733081572]
[null,null,"DVD player",null,0.44528814680759343,null,null,"Three stone stove / open fire",null,-0.38461740670557587,null,null,"DVD player",null,0.47049539412038938]
[null,null,"Ceramic tiles floor",null,0.43992792161524669,null,null,"Table",null,0.38018999791802732,null,null,"Freezer",null,0.44640435747545332]
[null,null,"Freezer",null,0.42597371952156626,null,null,"Water Heater",null,0.36894541703379907,null,null,"Microwave",null,0.39647819297976944]
[null,null,"Computer/tablet",null,0.42065900960591823,null,null,"DVD player",null,0.36872920670857101,null,null,"Chair",null,0.3727119567854274]
[null,null,"Chair",null,0.41444968031962237,null,null,"Fixed telephone line",null,0.36620658236208387,null,null,"Cupboard/Cabinet",null,0.36385506915515115]
[null,null,"Table",null,0.40030557655747107,null,null,"Battery powered flashlight, torch or lantern",null,-0.36594058095721627,null,null,"Table",null,0.35743409640110513]
[null,null,"No electricity",null,-0.39577027249611824,null,null,"Household owns bank account",null,0.36371205100407672,null,null,"No electricity",null,-0.3550245776130429]
[null,null,"Household owns bank account",null,0.3709766802850335,null,null,"Earth/sand floor",null,-0.36304756810452221,null,null,"Household owns bank account",null,0.34290779312119452]
[null,null,"Fixed telephone line",null,0.35333411035226403,null,null,"Water storage tank",null,0.35819294070128754,null,null,"Computer/tablet",null,0.33414382912544943]
[null,null,"Wristwatch",null,0.33118952091267395,null,null,"In main house - in a separate room",null,0.35501296649359321,null,null,"Ceramic tiles floor",null,0.32760870594716407]
[null,null,"Water Heater",null,0.32830773094796872,null,null,"Wristwatch",null,0.35462754775436939,null,null,"Electric Sewing Machine",null,0.31264765103035846]
[null,null,"Electric Sewing Machine",null,0.32306217143704236,null,null,"Wood",null,-0.35194657992772233,null,null,"Fixed telephone line",null,0.30160719156766741]
[null,null,"Internet at home",null,0.30961619692212211,null,null,"Outdoors - open air",null,-0.34841149515100606,null,null,"Wristwatch",null,0.29689472331085703]
[null,null,"Outdoors - open air",null,-0.30268811408401763,null,null,"Carpet floor",null,-0.33954100454641134,null,null,"Internet at home",null,0.28593189940408842]
[null,null,"Battery powered flashlight, torch or lantern",null,-0.30260361044121503,null,null,"Electric Sewing Machine",null,0.31629370522156791,null,null,"Outdoors - open air",null,-0.27218721929986922]
[null,null,"Carpet floor",null,-0.3020771893986321,null,null,"Chair",null,0.29136845264808758,null,null,"Battery powered flashlight, torch or lantern",null,-0.26899375439158391]
[null,null,"Cement walls",null,0.27042297418545125,null,null,"Internet at home",null,0.2813067264664042,null,null,"Plywood walls",null,-0.26229476537086738]
[null,null,"Plywood walls",null,-0.26760089070116105,null,null,"Air Conditioner",null,0.27903713336662045,null,null,"Cement walls",null,0.24732573438702798]
[null,null,"Persons per sleeping rooms",null,-0.25072065070581201,null,null,"Liquefied petroleum gas (lpg)/ cooking gas stove",null,0.27328801836804167,null,null,"cow0",null,-0.24255977581908034]
[null,null,"Bed",null,0.2340449973301805,null,null,"Radio",null,0.25641945020235851,null,null,"Water Heater",null,0.24036405704158284]
[null,null,"Air Conditioner",null,0.23095868312550832,null,null,"Bicycle",null,0.24361701334042909,null,null,"Bed",null,0.23247607637500112]
[null,null,"Radio",null,0.18496166629061506,null,null,"Generator",null,0.23958033270487383,null,null,"Persons per sleeping rooms",null,-0.2101302081551967]
[null,null,"Traditional solid fuel stove",null,-0.18324161997605407,null,null,"Persons per sleeping rooms",null,-0.21657416049540018,null,null,"Traditional solid fuel stove",null,-0.19093323367766368]
[null,null,"Mobile telephone",null,0.16331750361688763,null,null,"Cement walls",null,0.21442714633380267,null,null,"Radio",null,0.17077452479558453]
[null,null,"Candle",null,-0.1563978385762882,null,null,"Plywood walls",null,-0.21440938845023436,null,null,"Air Conditioner",null,0.16532667691895278]
[null,null,"Metal/Tin walls",null,-0.15440212405202913,null,null,"No food cooked",null,-0.20207199118071228,null,null,"Manufactured solid fuel stove",null,-0.15592940575345551]
[null,null,"Motorcycle/scooter",null,0.14158094091398724,null,null,"Metal/Tin walls",null,-0.19541866484289522,null,null,"cow10",null,0.15569917236014713]
[null,null,"No food cooked",null,-0.12379834044170243,null,null,"Mobile telephone",null,0.19042541342134556,null,null,"Mobile telephone",null,0.15322419971800433]
[null,null,"Wood planks floor",null,-0.10926560007297684,null,null,"Bed",null,0.17755198641942377,null,null,"Coal/lignite",null,-0.15144983174179311]
[null,null,"Outdoors - on veranda or covered porch",null,-0.10892606335226898,null,null,"Motorcycle/scooter",null,0.17705332855361192,null,null,"cow5",null,0.15117238285699253]
[null,null,"Charcoal",null,-0.10676053664835557,null,null,"In a separate building",null,-0.17054070160648488,null,null,"othercattle0",null,-0.14820566309097608]
[null,null,"Cement blocks walls",null,0.10596183114950589,null,null,"Wood",null,-0.16081216946996901,null,null,"Brick walls",null,0.1405691471108898]
[null,null,"Cardboard walls",null,-0.1056978879569193,null,null,"Boat with motor",null,0.14864464854234496,null,null,"Rechargeable flashlight, torch or lantern",null,-0.13045377619636683]
[null,null,"Earth/sand floor",null,-9.184544159599832E-2,null,null,"Cement blocks walls",null,0.1426279829372788,null,null,"Metal/Tin walls",null,-0.12944064681610773]
[null,null,"Bicycle",null,9.0957262343677736E-2,null,null,"Charcoal",null,-0.12878987148094129,null,null,"Wood planks floor",null,-0.12695856329653973]
[null,null,"Brick walls",null,8.6710114485757384E-2,null,null,"Wood planks floor",null,-0.12333807252248995,null,null,"Cardboard walls",null,-0.12594742452755828]
[null,null,"Electric stove",null,6.3473995499281913E-2,null,null,"Metal/tin roof",null,0.11264049071144495,null,null,"Candle",null,-0.11993481579819749]
[null,null,"Reused wood walls",null,-6.1914834820328786E-2,null,null,"Land area",null,0.10757928723022446,null,null,"othercattle1",null,0.11668211302939262]
[null,null,"One or more live-in servants",null,5.6475703761765174E-2,null,null,"Outdoors - on veranda or covered porch",null,-0.10493993935411652,null,null,"cow1",null,0.11146167959656977]
[null,null,"Wood",null,-5.372254166624614E-2,null,null,"Solar Panel",null,0.10303383337662701,null,null,"No food cooked",null,-0.10853507298830363]
[null,null,"Cement floor",null,-5.1334522492001981E-2,null,null,"Wood planks roof",null,-0.10265242792727687,null,null,"Cement blocks walls",null,0.10379693947781997]
[null,null,"Cement roof",null,3.8184968643508718E-2,null,null,"Traditional solid fuel stove",null,-0.10111964884117845,null,null,"Cement floor",null,-0.10144754681391488]
[null,null,"Land area",null,3.5596083064813544E-2,null,null,"In main house - no separate room",null,-8.1419834081679604E-2,null,null,"In main house - no separate room",null,9.3367635062931151E-2]
[null,null,"Wood planks roof",null,-2.0771333941288817E-2,null,null,"Cardboard walls",null,-6.6779725843606905E-2,null,null,"Outdoors - on veranda or covered porch",null,-9.3115706047633293E-2]
[null,null,"Biogas stove",null,2.0276459425911029E-2,null,null,"Cardboard roof",null,-6.199785438679218E-2,null,null,"Kerosene or paraffin lamp",null,-7.2829089026544808E-2]
[null,null,"Metal/tin roof",null,-1.8457408591833171E-4,null,null,"Ceramic tiles roof",null,5.2748115719788928E-2,null,null,"othercattle5",null,7.1271040278889863E-2]
[null,null,null,null,null,null,null,"One or more live-in servants",null,4.6670610764803423E-2,null,null,"Electric stove",null,7.0929540252630152E-2]
[null,null,null,null,null,null,null,"Cement floor",null,-4.4101375542607429E-2,null,null,"Charcoal",null,-6.5242318029225199E-2]
[null,null,null,null,null,null,null,"Calamine/cement fibre roof",null,-4.0232013572587502E-2,null,null,"Kerosene/paraffin",null,-6.4008269607037885E-2]
[null,null,"Communalities",null,null,null,null,"Biogas stove",null,3.9975389713412052E-2,null,null,"Gasoline lamp",null,-5.9083769779001795E-2]
[null,null,"",null,"Extraction",null,null,"Reused wood walls",null,-3.5206848140754518E-2,null,null,"Bicycle",null,5.2907166980604603E-2]
[null,null,"Persons per sleeping rooms",null,6.2860844690345793E-2,null,null,"Stone with lime/cement walls",null,2.7885366454038073E-2,null,null,"One or more live-in servants",null,5.1831041022983526E-2]
[null,null,"Earth/sand floor",null,8.4355851419639378E-3,null,null,"Cement roof",null,-2.2282021904003975E-2,null,null,"Reused wood walls",null,-5.04826374411479E-2]
[null,null,"Wood planks floor",null,1.1938971359307715E-2,null,null,"Electric stove",null,8.4344225673398839E-3,null,null,"othercattle10",null,5.039166230231458E-2]
[null,null,"Ceramic tiles floor",null,0.19353657621671064,null,null,null,null,null,null,null,"Earth/sand floor",null,-4.4440209006046581E-2]
[null,null,"Cement floor",null,2.6352331994818571E-3,null,null,null,null,null,null,null,"Wood roof",null,-4.4228160754340336E-2]
[null,null,"Carpet floor",null,9.1250628354977048E-2,null,null,null,null,null,null,null,"Cement roof",null,4.3654343638402718E-2]
[null,null,"Wood planks roof",null,4.3144831370053681E-4,null,null,"Communalities",null,null,null,null,"Land area",null,3.9791447354487045E-2]
[null,null,"Metal/tin roof",null,3.4067593192587695E-8,null,null,"",null,"Extraction",null,null,"Wood",null,-2.9303070422370035E-2]
[null,null,"Cement roof",null,1.458091830305744E-3,null,null,"Persons per sleeping rooms",null,4.6904366994287357E-2,null,null,"Liquid fuel stove",null,-2.6706457170105724E-2]
[null,null,"Plywood walls",null,7.1610236704054739E-2,null,null,"Earth/sand floor",null,0.13180353670660769,null,null,"Wood planks roof",null,-2.1797406964347867E-2]
[null,null,"Cardboard walls",null,1.1172043518553465E-2,null,null,"Wood planks floor",null,1.521228013356299E-2,null,null,"Cardboard roof",null,-2.0747458485580957E-2]
[null,null,"Reused wood walls",null,3.8334467708285979E-3,null,null,"Ceramic tiles floor",null,0.21194853020716012,null,null,"Garbage/plastic",null,-2.0577694759939858E-2]
[null,null,"Metal/Tin walls",null,2.3840015911778194E-2,null,null,"Cement floor",null,1.9449313247500927E-3,null,null,"Cane/palm/trunks walls",null,-1.8830088517695596E-2]
[null,null,"Cement walls",null,7.3128584967305232E-2,null,null,"Carpet floor",null,0.11528809376838613,null,null,"Metal/tin roof",null,1.7680363991650769E-2]
[null,null,"Brick walls",null,7.518643954133152E-3,null,null,"Wood planks roof",null,1.0537520959364773E-2,null,null,"No roof",null,-9.1499672821873015E-3]
[null,null,"Cement blocks walls",null,1.1227909660556395E-2,null,null,"Cardboard roof",null,3.8437339485658862E-3,null,null,"Biogas stove",null,2.8642892905913525E-3]
[null,null,"Fixed telephone line",null,0.12484499353842589,null,null,"Metal/tin roof",null,1.2687880147715117E-2]
[null,null,"Radio",null,3.4210817997000847E-2,null,null,"Calamine/cement fibre roof",null,1.6186149161048649E-3]
[null,null,"Sofa",null,0.33249432569333981,null,null,"Ceramic tiles roof",null,2.7823637119882439E-3]
[null,null,"Bed",null,5.4777060775284193E-2,null,null,"Cement roof",null,4.9648850013051297E-4,null,null,"Communalities"]
[null,null,"Table",null,0.16024455462300932,null,null,"Plywood walls",null,4.5971385855603487E-2,null,null,"",null,"Extraction"]
[null,null,"Chair",null,0.17176853751703719,null,null,"Cardboard walls",null,4.4595317837472998E-3,null,null,"Persons per sleeping rooms",null,4.4154704379346293E-2]
[null,null,"Cupboard/Cabinet",null,0.20641295761778847,null,null,"Reused wood walls",null,1.2395221560061499E-3,null,null,"Earth/sand floor",null,1.9749321765011037E-3]
[null,null,"Yes, interconnected grid",null,0.3836425835302239,null,null,"Metal/Tin walls",null,3.8188454568979811E-2,null,null,"Wood planks floor",null,1.6118476794321487E-2]
[null,null,"No electricity",null,0.15663410859165169,null,null,"Cement walls",null,4.5979001084858022E-2,null,null,"Ceramic tiles floor",null,0.10732746421237542]
[null,null,"Television",null,0.32554820601159346,null,null,"Stone with lime/cement walls",null,7.7759366227599189E-4,null,null,"Cement floor",null,1.0291604754561451E-2]
[null,null,"Refrigetaror",null,0.29740624874218397,null,null,"Cement blocks walls",null,2.0342741516756691E-2,null,null,"No roof",null,8.3721901265098068E-5]
[null,null,"Freezer",null,0.18145360972303801,null,null,"Fixed telephone line",null,0.13410726096531772,null,null,"Wood planks roof",null,4.7512695036940088E-4]
[null,null,"Washing Machine",null,0.29347514715850814,null,null,"Radio",null,6.5750934442079814E-2,null,null,"Cardboard roof",null,4.3045703361090527E-4]
[null,null,"DVD player",null,0.19828153368734089,null,null,"Sofa",null,0.22301646850452056,null,null,"Metal/tin roof",null,3.1259527087726114E-4]
[null,null,"Microwave",null,0.21074230252026066,null,null,"Bed",null,3.152470788148324E-2,null,null,"Wood roof",null,1.9561302037117709E-3]
[null,null,"Electric Sewing Machine",null,0.10436916661361695,null,null,"Table",null,0.14454443451690963,null,null,"Cement roof",null,1.9057017184997518E-3]
[null,null,"Air Conditioner",null,5.334191331106896E-2,null,null,"Chair",null,8.4895575198540851E-2,null,null,"Cane/palm/trunks walls",null,3.5457223358425154E-4]
[null,null,"Water Heater",null,0.10778596620020382,null,null,"Cupboard/Cabinet",null,0.26259256618522586,null,null,"Plywood walls",null,6.879854394095837E-2]
[null,null,"Wristwatch",null,0.1096864987623665,null,null,"Water storage tank",null,0.1283021827682361,null,null,"Cardboard walls",null,1.586275374512499E-2]
[null,null,"Bicycle",null,8.2732235730566157E-3,null,null,"Yes, interconnected grid",null,0.29103941139924738,null,null,"Reused wood walls",null,2.5484966830143876E-3]
[null,null,"Motorcycle/scooter",null,2.0045162830089943E-2,null,null,"No electricity",null,0.31803753268032675,null,null,"Metal/Tin walls",null,1.675488104817234E-2]
[null,null,"Car/truck/van",null,0.28742841835673316,null,null,"Television",null,0.18403005594287547,null,null,"Cement walls",null,6.1170018890082715E-2]
[null,null,"Computer/tablet",null,0.17695400236263201,null,null,"Refrigetaror",null,0.18995290049787747,null,null,"Brick walls",null,1.9759685119482978E-2]
[null,null,"Mobile telephone",null,2.6672606987652104E-2,null,null,"Freezer",null,0.16552390841481704,null,null,"Cement blocks walls",null,1.0773804644962222E-2]
[null,null,"Internet at home",null,9.5862189396518291E-2,null,null,"Washing Machine",null,0.21253627568462288,null,null,"Fixed telephone line",null,9.0966898005335625E-2]
[null,null,"Land area",null,1.2670811295571057E-3,null,null,"DVD player",null,0.13596122787993209,null,null,"Radio",null,2.9163938319157715E-2]
[null,null,"Household owns bank account",null,0.13762369731530397,null,null,"Microwave",null,0.23212564206530997,null,null,"Sofa",null,0.30893884421856449]
[null,null,"Electric stove",null,4.0289481046428604E-3,null,null,"Electric Sewing Machine",null,0.10004170796278809,null,null,"Bed",null,5.4045126086715356E-2]
[null,null,"Liquefied petroleum gas (lpg)/ cooking gas stove",null,0.37767140015986661,null,null,"Air Conditioner",null,7.7861721797461134E-2,null,null,"Table",null,0.12775913327007452]
[null,null,"Biogas stove",null,4.1113480685061622E-4,null,null,"Water Heater",null,0.13612072075024392,null,null,"Chair",null,0.13891420273082231]
[null,null,"Traditional solid fuel stove",null,3.3577491291448616E-2,null,null,"Wristwatch",null,0.12576069762627753,null,null,"Cupboard/Cabinet",null,0.13239051134989982]
[null,null,"Three stone stove / open fire",null,0.36921948865337872,null,null,"Bicycle",null,5.934924918891081E-2,null,null,"Yes, interconnected grid",null,0.5505028131969647]
[null,null,"No food cooked",null,1.5326029096119655E-2,null,null,"Motorcycle/scooter",null,3.1347881151913247E-2,null,null,"Yes, off-grid (generator/isolated system)",null,0.40035774384206102]
[null,null,"Charcoal",null,1.1397812185444871E-2,null,null,"Car/truck/van",null,0.21691627053135359,null,null,"No electricity",null,0.12604245070931952]
[null,null,"Wood",null,0.39625362070044406,null,null,"Boat with motor",null,2.2095231540277257E-2,null,null,"Television",null,0.32800072135285746]
[null,null,"In main house - in a separate room",null,0.32647664434770424,null,null,"Generator",null,5.7398735818978038E-2,null,null,"Refrigetaror",null,0.25163310130375477]
[null,null,"In a separate building",null,0.2483101863893509,null,null,"Solar Panel",null,1.0615970820282539E-2,null,null,"Freezer",null,0.1992768503730723]
[null,null,"Outdoors - open air",null,9.1620094407739272E-2,null,null,"Computer/tablet",null,0.22096224477963494,null,null,"Washing Machine",null,0.29300838184006606]
[null,null,"Outdoors - on veranda or covered porch",null,1.1864887277422515E-2,null,null,"Mobile telephone",null,3.6261838076690374E-2,null,null,"DVD player",null,0.22136591588850052]
[null,null,"Electricity",null,0.37191898757866609,null,null,"Internet at home",null,7.9133474355244357E-2,null,null,"Microwave",null,0.15719495750850329]
[null,null,"Battery powered flashlight, torch or lantern",null,9.156894505205862E-2,null,null,"Land area",null,1.1573303040963136E-2,null,null,"Electric Sewing Machine",null,9.7748553694800802E-2]
[null,null,"Wood",null,2.8861114830815524E-3,null,null,"Household owns bank account",null,0.13228645604559211,null,null,"Air Conditioner",null,2.7332910101063795E-2]
[null,null,"Candle",null,2.4460283911334701E-2,null,null,"Electric stove",null,7.1139484044452318E-5,null,null,"Water Heater",null,5.7774879917489287E-2]
[null,null,"One or more live-in servants",null,3.1895051153866569E-3,null,null,"Liquefied petroleum gas (lpg)/ cooking gas stove",null,7.468634098353108E-2,null,null,"Wristwatch",null,8.814647672983035E-2]
[null,null,null,null,null,null,null,"Biogas stove",null,1.5980317827391701E-3,null,null,"Bicycle",null,2.7991683179135782E-3]
[null,null,null,null,null,null,null,"Traditional solid fuel stove",null,1.0225183381763243E-2,null,null,"Car/truck/van",null,0.27126889529406562]
[null,null,"Total Variance Explained",null,null,null,null,"Three stone stove / open fire",null,0.14793054954092236,null,null,"Computer/tablet",null,0.11165209854261755]
[null,null,"Component",null,"Extraction Sums of Squared Loadings",null,null,"No food cooked",null,4.0833089619737861E-2,null,null,"Mobile telephone",null,2.3477655379222879E-2]
[null,null,null,null,"Total","% of Variance","Cumulative %","Charcoal",null,1.6586830996077374E-2,null,null,"Internet at home",null,8.1757051096829736E-2]
[null,null,"1",null,7.2163067797880229,12.027177966313371,12.027177966313371,"Wood",null,0.12386639512282063,null,null,"Land area",null,1.5833592825649141E-3]
[null,null,null,null,null,null,null,"In main house - no separate room",null,6.6291893818882352E-3,null,null,"cow0",null,5.8835244845402507E-2]
[null,null,null,null,null,null,null,"In main house - in a separate room",null,0.12603420637858112,null,null,"cow1",null,1.2423706018488379E-2]
[null,null,null,null,null,null,null,"In a separate building",null,2.9084130904432116E-2,null,null,"cow5",null,2.2853089338661127E-2]
[null,null,null,null,null,null,null,"Outdoors - open air",null,0.12139056995335952,null,null,"cow10",null,2.4242232273634805E-2]
[null,null,null,null,null,null,null,"Outdoors - on veranda or covered porch",null,1.1012390871645654E-2,null,null,"othercattle0",null,2.1964918572235908E-2]
[null,null,null,null,null,null,null,"Electricity",null,0.31530550831650461,null,null,"othercattle1",null,1.3614715501003955E-2]
[null,null,null,null,null,null,null,"Battery powered flashlight, torch or lantern",null,0.13391250879130495,null,null,"othercattle5",null,5.0795611824351414E-3]
[null,null,null,null,null,null,null,"Wood",null,2.5860553849638035E-2,null,null,"othercattle10",null,2.5393196295905125E-3]
[null,null,null,null,null,null,null,"Candle",null,0.15675930636261803,null,null,"Household owns bank account",null,0.11758575458324794]
[null,null,null,null,null,null,null,"One or more live-in servants",null,2.178145909159785E-3,null,null,"Electric stove",null,5.030999680449481E-3]
[null,null,null,null,null,null,null,null,null,null,null,null,"Liquefied petroleum gas (lpg)/ cooking gas stove",null,0.40206364472070316]
[null,null,null,null,null,null,null,null,null,null,null,null,"Biogas stove",null,8.2041531401963143E-6]
[null,null,null,null,null,null,null,"Total Variance Explained",null,null,null,null,"Liquid fuel stove",null,7.1323485457869143E-4]
[null,null,null,null,null,null,null,"Component",null,"Extraction Sums of Squared Loadings",null,null,"Manufactured solid fuel stove",null,2.4313979578625765E-2]
[null,null,null,null,null,null,null,null,null,"Total","% of Variance","Cumulative %","Traditional solid fuel stove",null,3.6455499722609322E-2]
[null,null,null,null,null,null,null,"1",null,6.177657232091553,9.0847900471934597,9.0847900471934597,"Three stone stove / open fire",null,0.33799107483945984]
[null,null,null,null,null,null,null,null,null,null,null,null,"No food cooked",null,1.1779862068576397E-2]
[null,null,null,null,null,null,null,null,null,null,null,null,"Kerosene/paraffin",null,4.0970585780872497E-3]
[null,null,null,null,null,null,null,null,null,null,null,null,"Coal/lignite",null,2.2937051534617444E-2]
[null,null,null,null,null,null,null,null,null,null,null,null,"Charcoal",null,4.2565600618265633E-3]
[null,null,null,null,null,null,null,null,null,null,null,null,"Wood",null,0.38703454717241065]
[null,null,null,null,null,null,null,null,null,null,null,null,"Garbage/plastic",null,4.2344152163325627E-4]
[null,null,null,null,null,null,null,null,null,null,null,null,"In main house - no separate room",null,8.7175152772446911E-3]
[null,null,null,null,null,null,null,null,null,null,null,null,"In main house - in a separate room",null,0.30858192050473388]
[null,null,null,null,null,null,null,null,null,null,null,null,"In a separate building",null,0.24560305238499486]
[null,null,null,null,null,null,null,null,null,null,null,null,"Outdoors - open air",null,7.4085882350195101E-2]
[null,null,null,null,null,null,null,null,null,null,null,null,"Outdoors - on veranda or covered porch",null,8.6705347127492508E-3]
[null,null,null,null,null,null,null,null,null,null,null,null,"Electricity",null,0.52943442717203359]
[null,null,null,null,null,null,null,null,null,null,null,null,"Solar lantern",null,0.38487329116490421]
[null,null,null,null,null,null,null,null,null,null,null,null,"Rechargeable flashlight, torch or lantern",null,1.7018187723891767E-2]
[null,null,null,null,null,null,null,null,null,null,null,null,"Battery powered flashlight, torch or lantern",null,7.235763990167976E-2]
[null,null,null,null,null,null,null,null,null,null,null,null,"Gasoline lamp",null,3.4908918512980857E-3]
[null,null,null,null,null,null,null,null,null,null,null,null,"Kerosene or paraffin lamp",null,5.3040762084363893E-3]
[null,null,null,null,null,null,null,null,null,null,null,null,"Wood",null,8.5866993617837761E-4]
[null,null,null,null,null,null,null,null,null,null,null,null,"Candle",null,1.4384360040547564E-2]
[null,null,null,null,null,null,null,null,null,null,null,null,"One or more live-in servants",null,2.6864568135262011E-3]
[]
[]
[null,null,null,null,null,null,null,null,null,null,null,null,"Total Variance Explained"]
[null,null,null,null,null,null,null,null,null,null,null,null,"Component",null,"Extraction Sums of Squared Loadings"]
[null,null,null,null,null,null,null,null,null,null,null,null,null,null,"Total","% of Variance","Cumulative %"]
[null,null,null,null,null,null,null,null,null,null,null,null,"1",null,7.7464669165267219,9.5635394031194103,9.5635394031194103]
[]
[]
[]
[]
[]
[]
[]
[]
[]
[]
[]
[]
[]
[]
[]
[]
[]
[]
[]
[]
[]
[]
[]
[]
[]
[]
[]
[]
[]
[]
[]
[]
[]
[]
[]
[]
[]
[]
[]
[]
[]
[]
[]
[]
[]
[]
[]
[]
[]
[]
[]
[]
[]
[]
[]
[]
[]
[]
[]
[]
[]
[]
[]
[]
[]
[]
[]
[]
[]
[]
[]
[]
[]
[]
[]
[]
[]
[]
[]
[]
[]
[]
[]
[]
[]
[]
[]
[]
[]
[]
[]
[]
[]
[]
[]
[]
[]
[]
[]
[]
[]
[]
[]
[]
[]
[]
[]
[]
[]
[]
[]
[]
[]
[]
[]
[]
[]
[]
[]
[]
[]
[]
[]
[]
[]
[]
[]
[]
[]
[]
[]
[]
[]
[]
[]
[]
[]
[]
[]
[]
[]
[]
[]
[]
[]
[]
[]
[]
[]
[]
[]
[]
[]
[]
[]
[]
[]
[]
[]
[]
[]
[]
[]
[]
[]
[]
[]
[]
[]
[]
[]
[]
[]
[]
[]
[]
[]
[]
[]
[]
[]
[]
[]
[]
[]
[]
[]
[]
[]
[]
[]
[]
[]
[]
[]
[]
[]
[]
[]
[]
[]
[]
[]
[]
[]
[]
[]
[]
[]
[]
[]
[]
[]
[]
[]
[]
[]
[]
[]
[]
[]
[]
[]
[]
[]
[]
[]
[]
[]
[]
[]
[]
[]
[]
[]
[]
[]
[]
[]
[]
[]
[]
[]
[]
[]
[]
[]
[]
[]
[]
[]
[]
[]
[]
[]
[]
[]
[]
[]
[]
[]
[]
[]
[]
[]
[]
[]
[]
[]
[]
[]
[]
[]
[]
[]
[]
[]
[]
[]
[]
[]
[]
[]
[]
[]
[]
[]
[]
[]
[]
[]
[]
[]
[]
[]
[]
[]
[]
[]
[]
[]
[]
[]
[]
[]
[]
[]
[]
[]
[]
[]
[]
[]
[]
[]
[]
[]
[]
[]
[]
[]
[]
[]
[]
[]
[]
[]
[]
[]
[]
[]
[]
[]
[]
[]
[]
[]
[]
[]
[]
[]
[]
[]
[]
[]
[]
[]
[]
[]
[]
[]
[]
[]
[]
[]
[]
[]
[]
[]
[]
[]
[]
[]
[]
[]
[]
[]
[]
[]
[]
[]
[]
[]
[]
[]
[]
[]
[]
[]
[]
[]
[]
[]
[]
[]
[]
[]
[]
[]
[]
[]
[]
[]
[]
[]
[]
[]
[]
[]
[]
[]
[]
[]
[]
[]
[]
[]
[]
[]
[]
[]
[]
[]
[]
[]
[]
[]
[]
[]
[]
[]
[]
[]
[]
[]
[]
[]
[]
[]
[]
[]
[]
[]
[]
[]
[]
[]
[]
[]
[]
[]
[]
[]
[]
[]
[]
[]
[]
[]
["MICS19"]
["Tonga",null,"Count"]
["W_text_t","",2498]
["W_text_i","",2498]
["S_text_s","",2498]
["S_text_i","",2498]
["Area","URBAN",644]
[null,"RURAL",1854]
["National","National",2498]
["2019"]
[]
["Sub-national region names","Weighted population"]
[{"$f":"R15","v":"'EUA"},{"$f":"BR122+BR123","v":719.70968655884053}]
[{"$f":"S15","v":"HA'APAI"},{"$f":"BS122+BS123","v":940.58184951076532}]
[{"$f":"T15","v":"ONGO NIUA"},{"$f":"BT122+BT123","v":162.57497098236377}]
[{"$f":"U15","v":"TONGATAPU"},{"$f":"BU122+BU123","v":9332.0203504052461}]
[{"$f":"V15","v":"VAVA'U"},{"$f":"BV122+BV123","v":2077.2441237575172}]
[{"$f":"W15","v":0},{"$f":"BW122+BW123","v":0}]
[{"$f":"X15","v":0},{"$f":"BX122+XR123","v":0}]
[{"$f":"Y15","v":0},{"$f":"BY122+BY123","v":0}]
[{"$f":"Z15","v":0},{"$f":"BZ122+BZ123","v":0}]
[{"$f":"AA15","v":0},{"$f":"CA122+CA123","v":0}]
[{"$f":"AB15","v":0},{"$f":"CB122+CB123","v":0}]
[{"$f":"AC15","v":0},{"$f":"CC122+CC123","v":0}]
[{"$f":"AD15","v":0},{"$f":"CD122+CD123","v":0}]
[{"$f":"AE15","v":0},{"$f":"CE122+CE123","v":0}]
[{"$f":"AF15","v":0},{"$f":"CF122+CF123","v":0}]
[{"$f":"AG15","v":0},{"$f":"CG122+CG123","v":0}]
[{"$f":"AH15","v":0},{"$f":"CH122+CH123","v":0}]
[{"$f":"AI15","v":0},{"$f":"CI122+CI123","v":0}]
[{"$f":"AJ15","v":0},{"$f":"CJ122+CJ123","v":0}]
[{"$f":"AK15","v":0},{"$f":"CK122+CK123","v":0}]
[{"$f":"AL15","v":0},{"$f":"CL122+CL123","v":0}]
[{"$f":"AM15","v":0},{"$f":"CM122+CM123","v":0}]
[{"$f":"AN15","v":0},{"$f":"CN122+CN123","v":0}]
[{"$f":"AO15","v":0},{"$f":"CO122+CO123","v":0}]
[{"$f":"AP15","v":0},{"$f":"CP122+CP123","v":0}]
[{"$f":"AQ15","v":0},{"$f":"CQ122+CQ123","v":0}]
[{"$f":"AR15","v":0},{"$f":"CR122+CR123","v":0}]
[{"$f":"AS15","v":0},{"$f":"CS122+CS123","v":0}]
[{"$f":"AT15","v":0},{"$f":"CT122+CT123","v":0}]
[{"$f":"AU15","v":0},{"$f":"CU122+CU123","v":0}]
[{"$f":"AV15","v":0},{"$f":"CV122+CV123","v":0}]
[{"$f":"AW15","v":0},{"$f":"CW122+CW123","v":0}]
[{"$f":"AX15","v":0},{"$f":"CX122+CX123","v":0}]
[{"$f":"AY15","v":0},{"$f":"CY122+CY123","v":0}]
[]
[{"$f":"34-COUNTIF(A1037:A1071,\"0\")","v":5},"Sub-regions"]

{"sheet":"data_summary","index":5,"n_rows":124,"n_cols":52,"rows_kept":124,"cut":false,"hidden":false,"merged":[]}
["iso3","year","data_source","row","var1","var2","varname","total_q1","total_q2","total_q3","total_q4","total_q5","urban_q1","urban_q2","urban_q3","urban_q4","urban_q5","rural_q1","rural_q2","rural_q3","rural_q4","rural_q5","region_1_name","region_2_name","region_3_name","region_4_name","region_5_name","region_1","region_2","region_3","region_4","region_5","n_total_q1","n_total_q2","n_total_q3","n_total_q4","n_total_q5","n_urban_q1","n_urban_q2","n_urban_q3","n_urban_q4","n_urban_q5","n_rural_q1","n_rural_q2","n_rural_q3","n_rural_q4","n_rural_q5","n_region_1","n_region_2","n_region_3","n_region_4","n_region_5"]
["TON",2019,"TON_2019_MICS",16,"Water","Improved","w_imp",99.494255864254995,98.454752121486351,98.373637240206094,99.334421920208626,99.509725136318366,98.119595934795825,97.909937345536662,100,100,100,99.422651096569922,98.582429040163746,98.403235234758185,99.128999331447602,99.36652626577343,"'EUA","HA'APAI","ONGO NIUA","TONGATAPU","VAVA'U",99.952830744850203,99.712981554224925,97.301327930055663,98.872785405822441,99.264516867406144,2633.6790373198028,2606.490190087341,2600.3476711925632,2636.5261912161918,2627.1917254856771,600.15372533022708,594.64760774395666,609.06444841336338,610.80481006524542,611.66631836864929,2032.1377812094699,2000.3319630837029,2004.5040641482381,2010.5439238488259,2030.3801730899011,719.37020486045014,937.88220610505698,158.1876056477426,9226.8284550838544,2061.9663436044839]
["TON",2019,"TON_2019_MICS",17,"Water","Not Improved","",0.505744135744983,1.5452478785136401,1.6263627597939141,0.66557807979138761,0.49027486368164519,1.8804040652041969,2.0900626544633338,0,0,0,0.57734890343006084,1.4175709598362469,1.596764765241818,0.87100066855241887,0.63347373422656261,"'EUA","HA'APAI","ONGO NIUA","TONGATAPU","VAVA'U",0.0471692551497934,0.28701844577505919,2.6986720699443612,1.1272145941775711,0.73548313259384246,13.387383191008061,40.908877934395768,42.990263790062883,17.665719553680461,12.94392144399497,11.50159144161533,12.693816288794331,0,0,0,11.80065615490877,28.76387332416434,32.52658770598395,17.665719553680461,12.94392144399497,0.33948169839071812,2.699643405708104,4.3873653346212,105.1918953213888,15.27778015303331]
["TON",2019,"TON_2019_MICS",18,"Water ladder","Basic","w_bas",99.494255864254995,98.454752121486351,98.373637240206094,99.334421920208626,99.509725136318366,98.119595934795825,97.909937345536662,100,100,100,99.422651096569922,98.582429040163746,98.403235234758185,99.128999331447602,99.36652626577343,"'EUA","HA'APAI","ONGO NIUA","TONGATAPU","VAVA'U",99.952830744850203,99.712981554224925,97.301327930055663,98.872785405822441,99.264516867406144,2633.6790373198028,2606.490190087341,2600.3476711925632,2636.5261912161918,2627.1917254856771,600.15372533022708,594.64760774395666,609.06444841336338,610.80481006524542,611.66631836864929,2032.1377812094699,2000.3319630837029,2004.5040641482381,2010.5439238488259,2030.3801730899011,719.37020486045014,937.88220610505698,158.1876056477426,9226.8284550838544,2061.9663436044839]
["TON",2019,"TON_2019_MICS",19,"Water ladder","Limited","w_lim",0,0,0,0,0,0,0,0,0,0,0,0,0,0,0,"'EUA","HA'APAI","ONGO NIUA","TONGATAPU","VAVA'U",0,0,0,0,0]
["TON",2019,"TON_2019_MICS",20,"Water ladder","Unimproved","w_unimp",0.505744135744983,1.5452478785136401,1.6263627597939141,0.66557807979138761,0.49027486368164519,1.8804040652041969,2.0900626544633338,0,0,0,0.57734890343006084,1.4175709598362469,1.596764765241818,0.87100066855241887,0.63347373422656261,"'EUA","HA'APAI","ONGO NIUA","TONGATAPU","VAVA'U",0.0471692551497934,0.28701844577505919,2.6986720699443612,1.1272145941775711,0.73548313259384246,13.387383191008061,40.908877934395768,42.990263790062883,17.665719553680461,12.94392144399497,11.50159144161533,12.693816288794331,0,0,0,11.80065615490877,28.76387332416434,32.52658770598395,17.665719553680461,12.94392144399497,0.33948169839071812,2.699643405708104,4.3873653346212,105.1918953213888,15.27778015303331]
["TON",2019,"TON_2019_MICS",21,"Water ladder","Surface water","w_sur",0,0,0,0,0,0,0,0,0,0,0,0,0,0,0,"'EUA","HA'APAI","ONGO NIUA","TONGATAPU","VAVA'U",0,0,0,0,0]
["TON",2019,"TON_2019_MICS",22,"Improved water point at more than 30 minutes","Yes","",0,0,0,0,0,0,0,0,0,0,0,0,0,0,0,"'EUA","HA'APAI","ONGO NIUA","TONGATAPU","VAVA'U",0,0,0,0,0]
["TON",2019,"TON_2019_MICS",23,"Improved water point at more than 30 minutes","No","",100,100,100,100,100,100,100,100,100,100,100,100,100,100,100,"'EUA","HA'APAI","ONGO NIUA","TONGATAPU","VAVA'U",100,100,100,100,100]
["TON",2019,"TON_2019_MICS",29,"Piped water","Yes","w_pip",99.425535285245914,98.454752121486351,98.373637240206094,99.334421920208626,99.509725136318366,98.119595934795825,97.909937345536662,100,100,100,99.33365236071387,98.582429040163746,98.403235234758185,99.128999331447602,99.36652626577343,"'EUA","HA'APAI","ONGO NIUA","TONGATAPU","VAVA'U",99.700078919370711,99.712981554224925,97.301327930055663,98.872785405822441,99.264516867406144,2631.8599579488732,2606.490190087341,2600.3476711925632,2636.5261912161918,2627.1917254856771,600.15372533022708,594.64760774395666,609.06444841336338,610.80481006524542,611.66631836864929,2030.3187018385399,2000.3319630837029,2004.5040641482381,2010.5439238488259,2030.3801730899011,717.5511254895199,937.88220610505698,158.1876056477426,9226.8284550838544,2061.9663436044839]
["TON",2019,"TON_2019_MICS",30,"Piped water","No","",0.57446471475407546,1.5452478785136401,1.6263627597939141,0.66557807979138761,0.49027486368164519,1.8804040652041969,2.0900626544633338,0,0,0,0.66634763928611518,1.4175709598362469,1.596764765241818,0.87100066855241887,0.63347373422656261,"'EUA","HA'APAI","ONGO NIUA","TONGATAPU","VAVA'U",0.29992108062929762,0.28701844577505919,2.6986720699443612,1.1272145941775711,0.73548313259384246,15.20646256193835,40.908877934395768,42.990263790062883,17.665719553680461,12.94392144399497,11.50159144161533,12.693816288794331,0,0,0,13.619735525839049,28.76387332416434,32.52658770598395,17.665719553680461,12.94392144399497,2.158561069321006,2.699643405708104,4.3873653346212,105.1918953213888,15.27778015303331]
["TON",2019,"TON_2019_MICS",31,"Piped water on premises","Yes","w_pop",10.92840715135779,17.950744849195249,24.5266357563581,27.312099637566771,38.907474846577983,23.216706990183528,33.294311193338167,37.139180844493161,48.493895813969019,51.916192115903968,7.8228113979218588,17.353491032195191,18.361502247300511,23.458956309505499,30.291038508758479,"'EUA","HA'APAI","ONGO NIUA","TONGATAPU","VAVA'U",5.966277583020303,4.4170658175089947,0.27565771271074863,31.480279116712321,6.8493329353066361,289.28219600029422,475.22785184055522,648.32186712282646,724.91553924170478,1027.2101127447011,142.00622268479751,202.21014372351561,226.2015469557538,296.20304821975151,317.55386095254482,159.89344904464659,352.11896400568531,374.02942891841309,475.79681411097118,618.94408833400291,42.939877691985807,41.546119360433899,0.44815044645014718,2937.746053535966,142.27736591524541]
["TON",2019,"TON_2019_MICS",32,"Piped water on premises","No","",89.071592848642283,82.049255150804825,75.473364243641853,72.687900362433297,61.092525153422031,76.783293009816504,66.705688806661826,62.860819155506867,51.506104186031003,48.083807884095997,92.177188602078104,82.646508967804834,81.63849775269945,76.54104369049449,69.708961491241467,"'EUA","HA'APAI","ONGO NIUA","TONGATAPU","VAVA'U",94.033722416979685,95.582934182491002,99.724342287289261,68.519720883287633,93.150667064693323,2357.7842245105189,2172.1712161811838,1995.0160678597981,1929.276371528169,1612.925534184971,469.64909408704489,405.13128030923531,382.86290145760978,314.60176184549408,294.11245741610429,1884.0449883197321,1676.9768724021831,1663.0012229358081,1552.412829291535,1424.380006199892,676.76980886685499,899.03573015033123,162.12682053591359,6394.2742968692728,1934.966757842272]
["TON",2019,"TON_2019_MICS",33,"Piped water into dwelling","Yes","",19.408934200179559,44.167501094511927,58.016236628230999,66.007672831584685,73.762834274963694,48.186636420086927,76.648707534069288,81.985327704296523,84.002862001560871,83.680351789688004,16.389474954653259,36.829547798077073,52.533983150010762,54.553802211603951,67.17477455798047,"'EUA","HA'APAI","ONGO NIUA","TONGATAPU","VAVA'U",45.772400422666891,6.0322118171435211,10.40237357804701,61.166402529174427,38.748103426496797,513.76737979199163,1169.2900123446,1533.565191243315,1751.9703127833629,1947.4388818789739,294.73612363697862,465.51935184011489,499.34348396206201,513.09352169800411,511.84452698991868,334.99077828036621,747.30682093862742,1070.133339405651,1106.4654772984809,1372.5983539920401,329.42839961243351,56.737889476095468,16.911655825987001,5708.0611316333452,804.89270149439017]
["TON",2019,"TON_2019_MICS",34,"Piped water into dwelling","No","",80.59106579982047,55.832498905488201,41.983763371768937,33.992327168415379,26.237165725036341,51.813363579913087,23.351292465930729,18.014672295703491,15.997137998439131,16.319648210311961,83.610525045346691,63.170452201922977,47.466016849989231,45.44619778839602,32.825225442019487,"'EUA","HA'APAI","ONGO NIUA","TONGATAPU","VAVA'U",54.227599577333088,93.967788182856452,89.597626421953024,38.833597470825531,61.251896573503167,2133.2990407188199,1478.109055677141,1109.7727437393089,902.22159798651057,692.69676505069822,316.9191931348638,141.8220721926362,109.7209644513015,97.711288367241352,99.821791378730367,1708.947659084012,1281.7890154692409,966.89731244857057,921.74416610402443,670.72574054185486,390.28128694640719,883.84396003466941,145.6633151563768,3623.959218771894,1272.351422263127]
["TON",2019,"TON_2019_MICS",35,"Water source on premises","Yes","",99.425727515819801,98.454752121486351,98.462475439816359,99.634034024371132,99.651103245447885,98.119595934795825,97.909937345536662,100,100,100,99.333901314932774,98.582429040163746,98.518515475088194,99.521083071816179,99.549197916642186,"'EUA","HA'APAI","ONGO NIUA","TONGATAPU","VAVA'U",100,99.168894413538311,97.890435138671378,99.019497746702271,99.377565391852357,2631.865046419844,2606.490190087341,2602.6959650236158,2644.4784714485609,2630.9242993417611,600.15372533022708,594.64760774395666,609.06444841336338,610.80481006524542,611.66631836864929,2030.323790309511,2000.3319630837029,2006.852357979292,2018.496204081194,2034.112746945985,719.70968655884087,932.76462121423651,159.1453465212046,9240.5196805913165,2064.3146374355379]
["TON",2019,"TON_2019_MICS",36,"Water source on premises","No","",0.57427248418018961,1.5452478785136401,1.537524560183654,0.36596597562887312,0.34889675455210839,1.8804040652041969,2.0900626544633338,0,0,0,0.66609868506722769,1.4175709598362469,1.481484524911804,0.47891692818383469,0.45080208335781119,"'EUA","HA'APAI","ONGO NIUA","TONGATAPU","VAVA'U",0,0.83110558646169319,2.1095648613286482,0.98050225329773999,0.62243460814762708,15.201374090967059,40.908877934395768,40.641969959009288,9.7134393213115899,9.2113475879109359,11.50159144161533,12.693816288794331,0,0,0,13.61464705486777,28.76387332416434,30.17829387493035,9.7134393213115899,9.2113475879109359,0,7.8172282965286852,3.4296244611591922,91.500669813927061,12.92948632197972]
["TON",2019,"TON_2019_MICS",37,"Improved water source on premises","Yes","w_premises",99.78785994752424,100,100,100,100,100,100,100,100,100,99.725063519635555,100,100,100,100,"'EUA","HA'APAI","ONGO NIUA","TONGATAPU","VAVA'U",100,99.404286801109492,100,100,100,2628.09194922799,2606.490190087341,2600.3476711925632,2636.5261912161918,2627.1917254856771,600.15372533022708,594.64760774395666,609.06444841336338,610.80481006524542,611.66631836864929,2026.5506931176569,2000.3319630837029,2004.5040641482381,2010.5439238488259,2030.3801730899011,719.37020486045014,932.29511801324372,158.1876056477426,9226.8284550838544,2061.9663436044839]
["TON",2019,"TON_2019_MICS",38,"Improved water source on premises","No","",0.21214005247575901,0,0,0,0,0,0,0,0,0,0.27493648036443757,0,0,0,0,"'EUA","HA'APAI","ONGO NIUA","TONGATAPU","VAVA'U",0,0.59571319889050711,0,0,0,5.5870880918132944,0,0,0,0,0,0,0,0,0,5.5870880918132944,0,0,0,0,0,5.5870880918132944,0,0,0]
["TON",2019,"TON_2019_MICS",39,"Piped water on premises available when needed","Yes","",96.379299177013181,92.491909397497267,91.993123046401749,93.615824497099482,97.69929044972497,83.12510745618124,92.378174909017915,97.012940770555474,100,97.875193792049913,97.467151366241083,94.847955984453165,91.845458988186508,94.766202037214711,93.940579228363319,"'EUA","HA'APAI","ONGO NIUA","TONGATAPU","VAVA'U",100,78.424134514874723,100,95.039945743935391,90.65193324032181,278.80815314895722,439.54731415603891,596.41153295903098,678.63565896871671,1003.5769915793931,118.04282520120201,186.79804025268581,219.44477277026559,296.20304821975151,310.80645680143988,155.84359000504929,333.97763999302492,343.52904574100938,450.89457014703379,581.43966168067504,42.939877691985807,32.582184532937092,0.44815044645014718,2792.0322553751848,128.97718276557671]
["TON",2019,"TON_2019_MICS",40,"Piped water on premises available when needed","No","",3.620700822986811,7.5080906025027154,8.0068769535982547,6.3841755029005052,2.3007095502750392,16.874892543818731,7.6218250909820684,2.9870592294445379,0,2.124806207950106,2.532848633758896,5.152044015546827,8.1545410118134871,5.2337979627852906,6.0594207716366739,"'EUA","HA'APAI","ONGO NIUA","TONGATAPU","VAVA'U",0,21.575865485125281,0,4.9600542560645664,9.348066759678181,10.47404285133697,35.680537684516253,51.910334163795497,46.279880272988009,23.633121165308321,23.963397483595521,15.41210347082982,6.7567741854881644,0,6.7474041511049201,4.0498590395973073,18.141324012660391,30.50038317740378,24.90224396393733,37.504426653327819,0,8.9639348274968107,0,145.7137981607795,13.300183149668751]
["TON",2019,"TON_2019_MICS",41,"Water point at more than 30 minutes","Yes","",0.015878399996610799,0.1186636551368125,0,0.1441398786003219,0,0,0,0,0,0,0.020574382522386098,0.15482066808178671,0,0.18875660595857019,0,"'EUA","HA'APAI","ONGO NIUA","TONGATAPU","VAVA'U",0,0,0.25808506282212179,0.041029982500439703,0.15060116820109709,0.4195817159928798,3.1194741871289788,0,3.8172502382168401,0,0,0,0,0,0,0.4195817159928798,3.1194741871289788,0,3.8172502382168401,0,0,0,0.4195817159928798,3.8172502382168401,3.1194741871289788]
["TON",2019,"TON_2019_MICS",42,"Water point at more than 30 minutes","No","w_30min",99.984121600003405,99.8813363448632,100,99.855860121399687,100,100,100,100,100,100,99.979425617477631,99.845179331918217,100,99.811243394041441,100,"'EUA","HA'APAI","ONGO NIUA","TONGATAPU","VAVA'U",100,100,99.741914937177881,99.958970017499553,99.849398831798894,2642.048904292923,2625.7176230120108,2643.337934982625,2644.4784714485609,2634.8381223935171,607.29399699267378,607.34142403275098,609.06444841336338,610.80481006524542,611.66631836864929,2038.9209211464911,2011.7757111773089,2037.030651854222,2018.496204081194,2038.026569997741,719.70968655884087,940.58184951076521,162.15538926637089,9299.7456703063781,2068.2284604872939]
["TON",2019,"TON_2019_MICS",43,"Water source available when needed","Yes","w_available",87.00647395538769,88.975952114739158,88.491314045090164,94.701220257427394,96.48589904416086,85.965756997639218,93.540723054690275,95.998098972040125,100,96.239605623026279,84.731254436418141,91.562858830300769,88.320720323178023,91.394009450246955,94.84945507118735,"'EUA","HA'APAI","ONGO NIUA","TONGATAPU","VAVA'U",90.193734786782059,86.389401506479075,72.44814516018549,93.253861301236554,85.534239170383501,2303.1191557435518,2355.5485270490722,2339.1244733184758,2513.5521274729981,2547.3586149254661,525.81412327922237,568.11155945088774,584.69029199137083,610.80481006524542,588.66525252687245,1731.8546778869611,1857.898156221647,1799.120144921578,1853.6621131621059,1938.0817690036729,649.13304592966131,812.56303047092183,117.7825509714323,8702.4693141700736,1776.754956967492]
["TON",2019,"TON_2019_MICS",44,"Water source available when needed","No","",12.99352604461242,11.024047885260879,11.508685954909859,5.2987797425725924,3.5141009558391318,14.03424300236078,6.4592769453097247,4.0019010279598506,0,3.7603943769736889,15.26874556358189,8.4371411696992187,11.67927967682197,8.6059905497530416,5.1505449288126304,"'EUA","HA'APAI","ONGO NIUA","TONGATAPU","VAVA'U",9.8062652132179196,13.61059849352095,27.551854839814599,6.7461386987635539,14.46576082961648,343.94726476726191,291.85054097266652,304.21346166414969,140.63978329687441,92.777032004205239,85.841193492619922,39.229864581863261,24.374156421992382,0,23.001065841776668,312.08375947741882,171.19768018622091,237.9105069326443,174.54753024039951,105.2423255302222,70.576640629179337,128.01881903984369,44.792420010931558,629.55103623517823,300.48916679002508]
["TON",2019,"TON_2019_MICS",45,"Improved water source available when needed","Yes","",87.076854791747266,88.922610647697837,88.788641143009158,94.665716435306862,96.468585406074467,85.96118579282988,93.402838240500444,95.998098972040125,100,96.239605623026279,84.741320646385503,91.597484362546339,88.76373671454725,91.318392591679384,94.816619718559352,"'EUA","HA'APAI","ONGO NIUA","TONGATAPU","VAVA'U",90.189107061659485,86.350224131930787,71.683988876678058,93.35330890730053,85.578344014913938,2293.3248710076518,2317.7591233018061,2308.8133622457599,2495.8864079193172,2534.4146934814721,515.89925887370646,555.41774316209342,584.69029199137083,610.80481006524542,588.66525252687245,1722.0603931510609,1832.2537570846121,1779.272709932942,1835.9963936084259,1925.137847559678,648.79356423127058,809.86338706521371,113.39518563681111,8613.5496700211352,1764.596651001588]
["TON",2019,"TON_2019_MICS",46,"Improved water source available when needed","No","",12.92314520825285,11.077389352302241,11.211358856990829,5.3342835646931031,3.5314145939255339,14.03881420717012,6.5971617594995617,4.0019010279598506,0,3.7603943769736889,15.258679353614539,8.4025156374536589,11.23626328545275,8.681607408320609,5.1833802814406349,"'EUA","HA'APAI","ONGO NIUA","TONGATAPU","VAVA'U",9.8108929383404799,13.64977586806927,28.316011123322021,6.6466910926995109,14.42165598508605,340.35416631215378,288.73106678553762,291.53430894680213,140.63978329687441,92.777032004205239,84.254466456520632,39.229864581863261,24.374156421992382,0,23.001065841776668,310.07738805841001,168.07820599909189,225.2313542152967,174.54753024039951,105.2423255302222,70.576640629179337,128.01881903984369,44.792420010931558,613.27878506272248,297.36969260289612]
["TON",2019,"TON_2019_MICS",47,"Microbiological quality at point of collection","Not contaminated (No E. coli in 100 mL)","w_quality",19.145408868373949,24.63967078612918,34.117623255968859,23.656566779630801,43.191167620883917,18.43824672471013,67.662645934418379,30.59714213931591,66.514946025341004,54.955924858990443,18.577891025580051,24.26309277011347,22.412510949619929,17.497816203266741,33.354954505908267,"'EUA","HA'APAI","ONGO NIUA","TONGATAPU","VAVA'U",30.762803567083338,10.10966491219361,15.00351749916563,32.885669928403587,25.360536169474369,112.3149472052155,140.41674975550859,174.66014052739121,116.01655707612611,256.8898325964073,19.981304383041799,105.1316305722994,28.12073440481662,84.75211887423707,75.630611522074176,89.228966943216378,94.008288777518757,87.266569815184653,83.819315653989975,132.35868621426991,50.41207162711725,24.948551066624159,6.1641338481201702,589.94576569513447,128.8277049236525]
["TON",2019,"TON_2019_MICS",48,"Microbiological quality at point of collection","Contaminated (E. coli detected in 100 mL)","",58.204357727498369,62.071416430690938,56.879238539691968,58.777437011472578,38.226587861287392,63.0083570355538,20.719007967980708,49.13625224451156,12.64577226881511,28.257450887892499,55.793143437548302,60.972430690933088,69.428618955019203,68.288707093189615,50.322170270017672,"'EUA","HA'APAI","ONGO NIUA","TONGATAPU","VAVA'U",45.622418543090333,81.999068674322757,60.276208872991319,50.071811925072502,59.421083399166719,341.45101889551199,353.73307636987028,291.18487304638268,288.2563619375855,227.36180328845219,68.281392444734522,32.192401899646441,45.159364646690413,16.11301006205175,38.888041574950734,267.97253491219078,236.24003444939561,270.33104130230362,327.12154642350771,199.6877658223315,74.763037327896257,202.35665276793739,24.764234078510562,898.25305338742828,301.85015597603041]
["TON",2019,"TON_2019_MICS",49,"Microbiological quality at point of collection","Highly contaminated (>100 CFU/100 mL)","",22.650233404127668,13.288912783179841,9.0031382043391623,17.56599620889661,18.582244517828691,18.553396239736092,11.618346097600931,20.266605616172509,20.839281705843892,16.786624253117061,25.628965536871618,14.76447653895341,8.1588700953608519,14.21347670354363,16.322875224074082,"'EUA","HA'APAI","ONGO NIUA","TONGATAPU","VAVA'U",23.61477788982636,7.8912664134836632,24.720273627843021,17.042518146523939,15.21838043135889,132.87570855552431,75.730960733817639,46.090238237280978,86.147175148137663,110.5223578429582,20.106090516107791,18.05214166436804,18.626309320805539,26.553028844291841,23.101834077255631,123.0950335282714,57.205533823474788,31.767819696342599,68.086432987708278,64.772216059092813,38.698354389071731,19.474004806991658,10.15622339312455,305.73077693759979,77.307080990931041]
["TON",2019,"TON_2019_MICS",50,"Microbiological quality of improved water sources at point of collection","Not contaminated (No E. coli in 100 mL)","",18.926123199116439,24.88214979661937,33.814022120852627,23.953827919759661,42.814869253278047,18.171339590545429,67.662645934418379,30.59714213931591,66.514946025341004,54.955924858990443,18.577891025580051,24.26309277011347,21.941735357292469,17.72298493320622,32.691086603462502,"'EUA","HA'APAI","ONGO NIUA","TONGATAPU","VAVA'U",30.762803567083338,10.10966491219361,15.00351749916563,33.04082316232806,24.428944016835668,110.7282201691162,140.41674975550859,172.3118466963376,116.01655707612611,252.9760095446513,18.394577346942501,105.1316305722994,28.12073440481662,84.75211887423707,75.630611522074176,89.228966943216378,94.008288777518757,84.918275984131057,83.819315653989975,128.44486316251391,50.41207162711725,24.948551066624159,6.1641338481201702,588.35903865903515,122.565588040843]
["TON",2019,"TON_2019_MICS",51,"Microbiological quality of improved water sources at point of collection","Contaminated (E. coli detected in 100 mL)","",58.362213717607837,61.698161223955083,57.14135114458918,59.516016201878458,38.479798533095419,61.966578682028107,20.719007967980708,49.13625224451156,12.64577226881511,28.257450887892499,55.793143437548302,60.972430690933088,69.849889183158737,69.167472835540494,50.823441945593878,"'EUA","HA'APAI","ONGO NIUA","TONGATAPU","VAVA'U",45.622418543090333,81.999068674322757,60.276208872991319,50.131849207750832,60.16273147854794,341.45101889551199,348.17953174352289,291.18487304638268,288.2563619375855,227.36180328845219,62.727847818386998,32.192401899646441,45.159364646690413,16.11301006205175,38.888041574950734,267.97253491219078,236.24003444939561,270.33104130230362,327.12154642350771,199.6877658223315,74.763037327896257,202.35665276793739,24.764234078510562,892.69950876108078,301.85015597603041]
["TON",2019,"TON_2019_MICS",52,"Microbiological quality of improved water sources at point of collection","Highly contaminated (>100 CFU/100 mL)","",22.711663083275731,13.419688979425519,9.0446267345581841,16.53015587836186,18.705332213626551,19.86208172742646,11.618346097600931,20.266605616172509,20.839281705843892,16.786624253117061,25.628965536871618,14.76447653895341,8.208375459548785,13.10954223125327,16.485471450943649,"'EUA","HA'APAI","ONGO NIUA","TONGATAPU","VAVA'U",23.61477788982636,7.8912664134836632,24.720273627843021,16.82732762992114,15.40832450461637,132.87570855552431,75.730960733817639,46.090238237280978,80.061181843810814,110.5223578429582,20.106090516107791,18.05214166436804,18.626309320805539,26.553028844291841,23.101834077255631,123.0950335282714,57.205533823474788,31.767819696342599,62.00043968338143,64.772216059092813,38.698354389071731,19.474004806991658,10.15622339312455,299.64478363327288,77.307080990931041]
["TON",2019,"TON_2019_MICS",53,"Microbiological quality of piped on premises at point of collection","Not contaminated (No E. coli in 100 mL)","",17.216461366053249,30.077252874462971,80.593663425202607,53.022855048161126,59.322634747862161,3.565186813688034,96.31353410735683,49.885706832184681,89.61701555280743,33.05138081182384,35.975888198394571,39.302298403890063,22.929929823425141,50.282742622446293,58.864643557266923,"'EUA","HA'APAI","ONGO NIUA","TONGATAPU","VAVA'U",55.774833430446122,6.2535205612358578,0,56.644780678165723,51.438335174149998,8.494452971029574,30.910061971502341,103.48846616130341,32.893188631868547,119.500630304634,0.71317178778856294,65.93708011479778,14.620745157276341,54.468032257411608,17.939351333203071,8.494452971029574,30.19689018371378,9.4196106130572677,37.269519764585617,56.227945857474303,4.1220860769023178,1.427470309172078,0,276.99066661032288,12.746577043940601]
["TON",2019,"TON_2019_MICS",54,"Microbiological quality of piped on premises at point of collection","Contaminated (E. coli detected in 100 mL)","",82.783538633946748,63.183607481856619,19.40633657479739,43.140508806084718,25.76336972854245,61.812641862080667,3.6864658926431662,41.993469068830478,0,44.028210877809002,64.024111801605429,60.697701596109951,77.070070176574845,49.717257377553722,29.314002054387789,"'EUA","HA'APAI","ONGO NIUA","TONGATAPU","VAVA'U",44.22516656955387,93.74647943876414,0,35.997364029265469,34.965178748019021,40.844681189133013,64.933098478068302,24.919229633973359,26.762589312559921,51.898216160115872,12.36485901256664,2.5237864974691528,12.30764979617808,0,23.89726311303798,15.117064065563399,46.635487081848268,31.66036950722301,36.850382652886047,28.000953047077889,3.268498212412962,21.399196608989829,0,176.02564153848149,8.6644784139661617]
["TON",2019,"TON_2019_MICS",55,"Microbiological quality of piped on premises at point of collection","Highly contaminated (>100 CFU/100 mL)","",0,6.7391396436804278,0,3.8366361457541571,14.9139955235954,34.622171324231303,0,8.1208240989848584,10.38298444719258,22.920408310367151,0,0,0,0,11.82135438834529,"'EUA","HA'APAI","ONGO NIUA","TONGATAPU","VAVA'U",0,0,0,7.3578552925688294,13.596486077830971,0,6.9257396907293032,0,2.380090554148937,30.04303286604053,6.9257396907293032,0,2.380090554148937,6.3106400978577506,12.44054702952225,0,0,0,0,11.29184573866052,0,0,0,35.979612206293197,3.3692509046255719]
["TON",2019,"TON_2019_MICS",58,"Main source of drinking water","PIPED INTO DWELLING","",1.484556807631968,3.1221914401119362,3.581416547839158,3.4328345859499469,6.0624297313333741,1.9828876800256121,10.28266859865859,4.2620910708207154,2.941900776564959,6.8264693296165468,1.468481577442081,3.0830973395326149,1.855267575398496,3.4036149670378339,5.2919659173765199,"'EUA","HA'APAI","ONGO NIUA","TONGATAPU","VAVA'U",3.1334841516596952,0.79040464298054769,0,4.1504114041823001,2.430613298391151,39.297204748233113,82.656867087377861,94.668942218777644,91.114017890393953,160.05636840699509,12.128437920490491,62.450905895661592,25.958881471369409,17.969271450605579,41.755213623030542,30.01485940695347,62.558999748858049,37.792369184780007,69.032446985752387,108.1320146642762,22.551988966280941,7.4344026095653959,0,387.31723686383219,50.489771912098981]
["TON",2019,"TON_2019_MICS",59,"Main source of drinking water","PIPED TO YARD / PLOT","",5.8304731962392156,3.59592982972578,1.5059527723194179,0.088222224927446705,0.48494985406756203,4.4060327930887384,0.48319369403249912,0,1.4252599681347631,0,4.0281971635606464,5.0566168351426262,2.3265360403573609,1.4530068776812259,0.20054466820175959,"'EUA","HA'APAI","ONGO NIUA","TONGATAPU","VAVA'U",1.6853686728867401,2.3355046106044122,0.27565771271074863,2.714469842343187,0.80045143404296926,154.33649813453169,95.198612798875956,39.807420913641707,2.341587157525491,12.803333966971129,26.949733837638171,2.934635462173433,0,8.7055564413015176,0,82.333870158837726,102.6036016649783,47.392252268514937,29.470025612432291,4.0977775256696098,12.129761592994051,21.967332461832171,0.44815044645014718,253.3148780930793,16.627330377190361]
["TON",2019,"TON_2019_MICS",60,"Main source of drinking water","PIPED TO NEIGHBOUR","",0,0.49169293628353761,0.5587300340990603,0,0,0,0,0,0,0,0,0.64152091681107426,0.72503194451385,0,0,"'EUA","HA'APAI","ONGO NIUA","TONGATAPU","VAVA'U",0.33652807314149891,0,0,0.27179722145259022,0,0,13.017074212699089,14.76912294548182,0,0,0,0,0,0,0,0,13.017074212699089,14.76912294548182,0,0,2.4220251403891888,0,0,25.36417201779172,0]
["TON",2019,"TON_2019_MICS",61,"Main source of drinking water","PUBLIC TAP / STANDPIPE","",0.23571278320226161,0,1.323289131667579,0,0,0,0,0,0,0,0.3052672144589737,0,1.7171564686585059,0,0,"'EUA","HA'APAI","ONGO NIUA","TONGATAPU","VAVA'U",0,0.59400339212577458,0,0.37482776819440111,0.031406315402405599,6.239473932998516,0,34.979003606871302,0,0,0,0,0,0,0,6.239473932998516,0,34.979003606871302,0,0,0,5.5870880918132944,0,34.979003606871302,0.65238584118522169]
["TON",2019,"TON_2019_MICS",62,"Main source of drinking water","PROTECTED WELL","",0.068720579009092495,0,0,0,0,0,0,0,0,0,0.088998735856054306,0,0,0,0,"'EUA","HA'APAI","ONGO NIUA","TONGATAPU","VAVA'U",0.25275182547950409,0,0,0,0,1.8190793709302879,0,0,0,0,0,0,0,0,0,1.8190793709302879,0,0,0,0,1.8190793709302879,0,0,0,0]
["TON",2019,"TON_2019_MICS",63,"Main source of drinking water","OWN CEMENT OR OTHER TANK","",54.210492763315152,47.099023832032287,45.060360214033977,49.000572556286322,46.64603508517812,26.664166224904459,34.944652210737111,42.46168632686053,41.686015469742237,40.872645369490122,56.376210552229303,50.037677879615771,53.273214231832981,49.179200695435547,49.734952109644723,"'EUA","HA'APAI","ONGO NIUA","TONGATAPU","VAVA'U",60.630446891620743,81.168982140863477,84.830448663015972,38.588674494709622,70.585461432778715,1434.9877503311591,1246.899117976559,1191.097595177378,1300.569233019874,1231.5186001631091,163.09279038751001,212.23334835998301,258.61903561370559,254.62018761372789,250.00420515143449,1152.295037006488,1015.312438490464,1085.191703130404,997.45729105309601,1016.246259861265,436.36319928290811,763.46071344959637,137.9130772981072,3601.102956797939,1466.2323498395251]
["TON",2019,"TON_2019_MICS",64,"Main source of drinking water","NEIGHBOUR?S CEMENT OR OTHER TANK","",24.966455482973661,23.606164660473951,19.476650166809971,15.14273293189302,4.9496224126193651,36.646445404797433,20.219843247106692,10.74765207459421,5.1694420413644631,2.8566911456750801,25.889321072845259,19.758439904627661,19.239372950752291,21.05864980130627,6.0043605240746274,"'EUA","HA'APAI","ONGO NIUA","TONGATAPU","VAVA'U",24.647714620672978,10.12869832274558,10.237230977072119,19.04601505895473,12.83305106201338,660.87865948157616,624.949383217064,514.8336823231449,401.91719254779019,130.6767457039843,224.1499317263339,122.8034839141678,65.460127825514633,31.575200642189159,17.473417557913951,529.16178458056027,400.91768144395053,391.9119242313742,427.11356604045642,122.68854531109859,177.39198964036311,95.26869801544629,16.64317529037255,1777.3780012429031,266.57379908447479]
["TON",2019,"TON_2019_MICS",65,"Main source of drinking water","COMMUNITY CEMENT OR OTHER TANK","",8.5448906050514815,9.0095263673986494,7.1404815181030772,6.341487669112575,4.1096191628598451,10.23448345123855,8.3401568855369081,9.067437895688224,0.27613455075435872,1.1298316616170629,8.315619835168647,10.737395072889599,5.0451347928826431,4.9468585810365981,7.9404981650416886,"'EUA","HA'APAI","ONGO NIUA","TONGATAPU","VAVA'U",8.1191117509152004,2.9861965267083859,1.2688462954799971,7.1364077954243106,8.4589656245769902,226.18892987570089,238.51811708368459,188.7470567084419,168.3152527360549,108.4995204717155,62.599762173634943,50.653227595185378,55.226540604597773,1.6866431182596791,6.9107997283764231,169.96615011610839,217.87203636266639,102.7709421583815,100.3326627860686,162.25011223231871,58.434033733873811,28.08762252093997,2.0628264966874021,665.9710277569028,175.713366367194]
["TON",2019,"TON_2019_MICS",66,"Main source of drinking water","BOTTLED WATER","",4.3266528961697306,11.69496284976826,19.81559505494409,25.398886646333668,37.747343753941763,18.898615918825861,23.639422709464888,33.461132632036318,48.501247193439227,48.314362493601173,3.1755095922645298,9.2676810915444374,14.336801470692061,19.179684879442341,30.827678615660659,"'EUA","HA'APAI","ONGO NIUA","TONGATAPU","VAVA'U",1.1474247584738679,1.709191918196737,0.6891442817768717,26.80295074792939,4.4260304320571393,114.5293759465675,309.61233749025342,523.79314112987845,674.13519479259753,996.58107821689703,115.5943890637882,143.57200651678559,203.799862898176,296.24795079916157,295.52268230789377,64.905461138487595,188.0501311600874,292.04504045348432,389.00421829906202,629.90938493926774,8.2581271327108148,16.076348955863391,1.120376116125368,2501.2568183058652,91.939457065626428]
["TON",2019,"TON_2019_MICS",67,"Main source of drinking water","OTHER (specify)","",0.33204488640737062,1.38050808420573,1.537524560183654,0.59526338549708235,0,1.1673685271193761,2.0900626544633338,0,0,0,0.35239425617443049,1.4175709598362469,1.481484524911804,0.77898419806018948,0,"'EUA","HA'APAI","ONGO NIUA","TONGATAPU","VAVA'U",0.0471692551497934,0.28701844577505919,2.6986720699443612,0.91444566680931294,0.43402040073726789,8.7894486891127759,36.547558155227243,40.641969959009288,15.79943262563844,0,7.1402716624468114,12.693816288794331,0,0,0,7.2027216530134828,28.76387332416434,30.17829387493035,15.79943262563844,0,0.33948169839071812,2.699643405708104,4.3873653346212,85.336255720044008,9.0156632702237296]
["TON",2019,"TON_2019_MICS",122,"Sanitation","Improved","s_imp",92.284747874965703,97.237880885510918,99.19783858825177,100,100,97.365373271867313,100,100,100,100,91.324419837830391,96.346332863898738,98.552452569749548,99.926326343643126,100,"'EUA","HA'APAI","ONGO NIUA","TONGATAPU","VAVA'U",94.74894971608353,89.870038271251389,96.359187976643142,98.541247969406271,98.871918027697276,2442.8385722512821,2574.2747523271032,2622.1340980860919,2654.1919107698718,2640.135646929672,595.54048231212676,607.34142403275098,609.06444841336338,610.80481006524542,611.66631836864929,1866.6149197654361,1954.9594286730339,2007.5436669998919,2026.715387199629,2043.324094533896,681.91736901941852,845.30126812776894,156.6559218918689,9195.8893140482851,2053.8111072766919]
["TON",2019,"TON_2019_MICS",123,"Sanitation","Not Improved","",7.71525212503433,2.7621191144890909,0.80216141174824529,0,0,2.6346267281326781,0,0,0,0,8.6755801621695721,3.6536671361012658,1.447547430250447,0.0736736563568616,0,"'EUA","HA'APAI","ONGO NIUA","TONGATAPU","VAVA'U",5.2510502839164266,10.12996172874861,3.6408120233568901,1.4587520305937689,1.128081972302668,204.22784825953059,73.124315694634475,21.203836896533542,0,0,16.11483445971556,0,0,0,0,177.3235175989428,74.136407734833384,29.486984854329719,1.49425620287709,0,37.792317539422037,95.280581382996374,5.9190490904948732,136.13103635696021,23.433016480825081]
["TON",2019,"TON_2019_MICS",124,"Sanitation ladder","Basic","s_bas",82.380300985921693,87.483592588060205,93.414700568922797,97.811113267055021,97.670083910829291,85.775681372600005,97.367114729962594,99.010240242212106,98.274273906646528,97.79402400505343,80.639258590043355,87.123790205158485,90.865916712807902,96.685746151918906,97.64216459585316,"'EUA","HA'APAI","ONGO NIUA","TONGATAPU","VAVA'U",92.62497575638649,80.715592472366254,90.486608702301183,92.669388707451631,92.440112081393778,2177.5863789369059,2316.03981484824,2469.2662169887672,2596.0946561681321,2578.6227017159258,524.65151561278265,591.35082114055729,603.03617360397504,600.26399207849136,598.17310621626336,1645.2068820436809,1767.825199573597,1850.9665755282249,1960.989627248887,1995.145875611513,666.63092269149149,759.19621252015452,147.1085778406912,8644.4672594000385,1920.206796205616]
["TON",2019,"TON_2019_MICS",125,"Sanitation ladder","Limited","s_lim",9.8935524087983282,9.7542882974507794,5.7831380193289759,2.1888867329449448,2.3299160891707258,11.589691899267351,2.6328852700373928,0.98975975778789171,1.725726093353481,2.205975994946562,10.669289200618239,9.2225426587402932,7.686535856941636,3.2405801917242099,2.357835404146837,"'EUA","HA'APAI","ONGO NIUA","TONGATAPU","VAVA'U",2.123973959697075,9.1544457988851491,5.8725792743419891,5.8712755643005998,6.4318059463035437,261.51961945829032,258.23493747886528,152.86788109732569,58.097254601739657,61.51294521374605,70.888966699344223,15.99060289219365,6.0282748093882654,10.54081798675411,13.493212152385819,217.67546386567071,187.13422909943881,156.57709147166671,65.725759950741846,48.178218922382989,15.286446327927219,86.105055607614489,9.5473440511777952,547.68948079217057,133.60431107107701]
["TON",2019,"TON_2019_MICS",126,"Sanitation ladder","Unimproved","s_unimp",7.6234276545084887,2.6350113918967919,0.80216141174824529,0,0,2.084472324006502,0,0,0,0,8.5583673652431784,3.6536671361012658,1.447547430250447,0.0736736563568616,0,"'EUA","HA'APAI","ONGO NIUA","TONGATAPU","VAVA'U",4.8737863894073286,10.12996172874861,3.6408120233568901,1.42326213420897,1.128081972302668,201.51264346685949,69.759267031342276,21.203836896533542,0,0,12.74978579642335,0,0,0,0,174.6083128062717,74.136407734833384,29.486984854329719,1.49425620287709,0,35.077112746750927,95.280581382996374,5.9190490904948732,132.765987693668,23.433016480825081]
["TON",2019,"TON_2019_MICS",127,"Sanitation ladder","Open defecation","s_od",0.1027189507714787,0.12710772259229991,0,0,0,0.55015440412617622,0,0,0,0,0.13308484409519811,0,0,0,0,"'EUA","HA'APAI","ONGO NIUA","TONGATAPU","VAVA'U",0.37726389450909792,0,0,0.036073594038894999,0,2.7152047926711051,3.365048663292205,0,0,0,3.365048663292205,0,0,0,0,2.7152047926711051,0,0,0,0,2.7152047926711051,0,0,3.365048663292205,0]
["TON",2019,"TON_2019_MICS",128,"Shared among improved sanitation facilities","Yes","s_shared",10.72194564854321,10.031366591519619,5.8299032535713797,2.1888867329449448,2.3299160891707258,11.903299406973121,2.6328852700373928,0.98975975778789171,1.725726093353481,2.205975994946562,11.684874481936969,9.5722819796040284,7.7994363980962973,3.242969405860042,2.357835404146837,"'EUA","HA'APAI","ONGO NIUA","TONGATAPU","VAVA'U",2.2416860198045381,10.186315678707761,6.0944673753015284,5.9582260863484668,6.505189819926203,261.51961945829032,258.23493747886528,152.86788109732569,58.097254601739657,61.51294521374605,70.888966699344223,15.99060289219365,6.0282748093882654,10.54081798675411,13.493212152385819,217.67546386567071,187.13422909943881,156.57709147166671,65.725759950741846,48.178218922382989,15.286446327927219,86.105055607614489,9.5473440511777952,547.68948079217057,133.60431107107701]
["TON",2019,"TON_2019_MICS",129,"Shared among improved sanitation facilities","No","",89.278054351456731,89.968633408480443,94.170096746428626,97.811113267055021,97.670083910829291,88.096700593026895,97.367114729962594,99.010240242212106,98.274273906646528,97.79402400505343,88.315125518063027,90.427718020396014,92.200563601903696,96.757030594139948,97.64216459585316,"'EUA","HA'APAI","ONGO NIUA","TONGATAPU","VAVA'U",97.758313980195481,89.813684321292243,93.905532624698523,94.041773913651625,93.494810180073841,2177.5863789369059,2316.03981484824,2469.2662169887672,2596.0946561681321,2578.6227017159258,524.65151561278265,591.35082114055729,603.03617360397504,600.26399207849136,598.17310621626336,1645.2068820436809,1767.825199573597,1850.9665755282249,1960.989627248887,1995.145875611513,666.63092269149149,759.19621252015452,147.1085778406912,8644.4672594000385,1920.206796205616]
["TON",2019,"TON_2019_MICS",135,"Sanitation type","Sewer connection","s_sew",1.3072111768913399,2.6947591150146488,4.7961421927063776,2.162921356098785,4.9930453674888033,0.84772818727720545,1.077150250235525,3.806143315985473,2.081957181413495,5.7752820723362204,0.83690110175236287,3.4699714705710969,5.0080996953185331,2.7179788872051529,4.6172058955650277,"'EUA","HA'APAI","ONGO NIUA","TONGATAPU","VAVA'U",0.49418505895270048,0.40470560782195641,0,4.4426605953221161,0,34.602748108654843,71.341027696328638,126.77824599551521,57.408083669887972,131.82317061444249,5.1851745292545877,6.541979668752778,23.18186579332902,12.71669460757243,35.325455227263589,17.105743301442519,70.409046633898996,102.01652586905639,55.126309895939038,94.344480558319759,3.556697738809103,3.806587491125542,0,414.58999085489461,0]
["TON",2019,"TON_2019_MICS",136,"Sanitation type","Septic tank connection","s_sep",62.885849759257638,86.32171075284181,91.291195026523781,96.679737293594243,94.932004590793468,87.720331757455099,97.669999692685593,96.193856684014506,97.594079625079786,94.224717927663775,57.00577980945102,83.246596092427367,90.183340356848433,94.024661368082292,95.38279410443495,"'EUA","HA'APAI","ONGO NIUA","TONGATAPU","VAVA'U",85.918792986825366,61.9425431389243,68.528385641654893,89.385032983230559,85.768395853561046,1664.6302122301879,2285.280165971154,2413.1347894350752,2566.0657666001421,2506.3336935464499,536.54607308437301,593.19036698634022,585.88258262003421,596.10933268889301,576.34086314138563,1165.1630450446719,1689.153215262719,1837.062285935021,1907.017249043995,1948.9796139755761,618.36587570062022,582.62031789009779,111.4100030716028,8341.4294682115142,1781.618962909183]
["TON",2019,"TON_2019_MICS",137,"Sanitation type","Improved latrines","s_lat",28.09168693881665,8.2214110176545141,3.1105013690216059,1.1573413503069601,0.074950041717781204,8.7973133271350115,1.2528500570788741,0,0.3239631935066834,0,33.481738926626981,9.6297653009002726,3.3610125175825898,3.1836860883556848,0,"'EUA","HA'APAI","ONGO NIUA","TONGATAPU","VAVA'U",8.3359716703055273,27.522789524505139,27.83080233498827,4.7135543908535444,13.103522174136289,743.6056119124371,217.65355865962201,82.22106265550201,30.718060499842149,1.978782768779801,53.809234698499147,7.6090773776579663,0,1.978782768779801,0,684.34613141932061,195.39716677641701,68.464855195814636,64.571828259694016,0,59.994795579989692,258.87436274654561,45.245918820266191,439.86985498187261,272.1921443675094]
["TON",2019,"TON_2019_MICS",138,"Sanitation type","Unimproved facilities","",7.6126780161403369,2.6350113918967919,0.80216141174824529,0,0,2.084472324006502,0,0,0,0,8.5427383532855288,3.6536671361012658,1.447547430250447,0.0736736563568616,0,"'EUA","HA'APAI","ONGO NIUA","TONGATAPU","VAVA'U",4.8737863894073286,10.12996172874861,3.6408120233568901,1.422692865086848,1.128081972302668,201.51264346685949,69.759267031342276,21.203836896533542,0,0,12.74978579642335,0,0,0,0,174.6083128062717,74.136407734833384,29.486984854329719,1.49425620287709,0,35.077112746750927,95.280581382996374,5.9190490904948732,132.765987693668,23.433016480825081]
["TON",2019,"TON_2019_MICS",139,"Sanitation type","Open defecation","",0.10257410889399381,0.12710772259229991,0,0,0,0.55015440412617622,0,0,0,0,0.13284180888404401,0,0,0,0,"'EUA","HA'APAI","ONGO NIUA","TONGATAPU","VAVA'U",0.37726389450909792,0,0,0.036059165506921301,0,2.7152047926711051,3.365048663292205,0,0,0,3.365048663292205,0,0,0,0,2.7152047926711051,0,0,0,0,2.7152047926711051,0,0,3.365048663292205,0]
["TON",2019,"TON_2019_MICS",140,"Septic tank emptying practices","Not emptied/treated and disposed in situ","s_sep_nemp",71.427932048698011,62.338136901245853,65.502081353662589,45.013102039802916,39.042243402256638,53.968973277058033,48.921002888336673,25.386800905696749,39.065496816007041,25.468624742343572,74.192696896327902,68.225763439517863,67.082393990466599,56.141774684201252,46.16871730378228,"'EUA","HA'APAI","ONGO NIUA","TONGATAPU","VAVA'U",92.049369295944231,76.170238130248222,50.478042706976467,47.686606682532727,71.894879587158727,1189.010936853876,1424.601078440116,1580.653512949297,1155.065801928173,978.52890110717408,289.56840680200952,290.19467656672242,148.73684479090241,232.87307238150029,146.7860916702634,864.465886358018,1152.4376767761521,1232.345360501203,1070.6333271471331,899.81888828473075,569.20188852376339,443.78328353209668,56.237588930327448,3977.744662206906,1280.8928080855439]
["TON",2019,"TON_2019_MICS",141,"Septic tank emptying practices","Emptied and buried on site","s_sep_ebo",5.1035723223308462,4.6899590650224514,3.8159917704161579,10.350278340203751,5.5460939304720744,4.643662221495183,5.5721609018960114,12.330219185375039,4.0381418794714863,5.5819183533670111,5.0503934116682814,4.2060709652185109,4.8727735659681448,7.8415041489733186,6.8455693321509141,"'EUA","HA'APAI","ONGO NIUA","TONGATAPU","VAVA'U",2.430876275823675,1.132551686693803,4.9259040562474992,7.1452645588036781,3.686678720891106,84.955606780537096,107.1787043051242,92.085024973891748,265.59494923579791,139.00362085515621,24.915387296734959,33.053521703026313,72.240606605986258,24.071740610748201,32.170876417642852,58.845317662129631,71.046982945220137,89.515885459411848,149.53883670542169,133.4187507441853,15.03170937019569,6.598476237285098,5.4879498603695449,596.01720348972344,65.682567192933675]
["TON",2019,"TON_2019_MICS",142,"Septic tank emptying practices","Emptied and discharged locally","s_sep_edl",2.1716741693745241,4.4401085595945782,5.1676361356662612,4.1744735317967141,6.8345236143338708,7.7186479314929173,6.2601194696775924,4.8084736653486493,3.9276095868782779,5.3119304296824277,2.7567698993253158,2.4328536475155969,5.4673001628140403,4.3968245561174246,6.2846928209885577,"'EUA","HA'APAI","ONGO NIUA","TONGATAPU","VAVA'U",0.35804224706816001,2.7225687870421509,16.387884049396529,5.8557930535598306,0.89503733369459326,36.150344334607311,101.46892026000241,124.7020253811809,107.11973623521941,171.29596813943849,41.414102371633433,37.134425655963852,28.172009695148891,23.41284729896509,30.614825687901611,32.120864103853791,41.094625609646037,100.43770934992069,83.84820269536138,122.4873818820535,2.214011076461206,15.862238921841559,18.257742122803378,488.45684736712258,15.94615486221962]
["TON",2019,"TON_2019_MICS",143,"Septic tank emptying practices","Emptied and removed offsite","s_sep_ero",21.29682145959654,28.531795474137208,25.514290740254921,40.462146088196711,48.577139052937412,33.668716569953872,39.246716740089717,57.474506243579611,52.968751717643222,63.637526474607007,18.000139792678429,25.13531194774809,22.5775322807512,31.619896610707979,40.701020543078243,"'EUA","HA'APAI","ONGO NIUA","TONGATAPU","VAVA'U",5.1617121811639226,19.974641396015851,28.20816918737955,39.312335705103642,23.523404358255551,354.51332426116602,652.03146296591308,615.69422613070333,1038.2852792009539,1217.505203444681,180.6481766139951,232.8077430606277,336.73312152799713,315.75167239767961,366.76906936557782,209.7309769206696,424.57392993170117,414.76333062448538,602.9968824960788,793.25459306460618,31.918266730199878,116.3763191988746,31.426722158102461,3279.2107551477511,419.09743276848621]
["TON",2019,"TON_2019_MICS",144,"Latrine emptying practices","Not emptied/treated and disposed in situ","s_lat_nemp",47.489709116581558,45.501395963632227,56.572561196989497,13.988403937631199,100,74.060967345680282,31.279620853080569,0,100,0,46.422100500736988,45.88178420388104,64.946547309702652,13.854698054880931,0,"'EUA","HA'APAI","ONGO NIUA","TONGATAPU","VAVA'U",84.830766226864895,20.60637253047415,9.0455203383983669,65.706783674444381,39.533152878451197,353.13614207179268,99.035407554651158,46.514560987598948,4.296966384523853,1.978782768779801,39.851639739015923,2.380090554148937,0,1.978782768779801,0,317.68784890038262,89.651706400853186,44.465559570269157,8.9462318338968814,0,50.894044786746527,53.344615573444173,4.0927287891823916,289.02433406203119,107.6061365559421]
["TON",2019,"TON_2019_MICS",145,"Latrine emptying practices","Emptied and buried on site","s_lat_ebo",47.616677727457507,32.149511682620847,12.46075889934195,74.840898596428502,0,24.58902533990608,68.720379146919427,0,0,0,48.366683739953118,32.401565747058562,25.983286831213139,41.400471776200369,0,"'EUA","HA'APAI","ONGO NIUA","TONGATAPU","VAVA'U",12.905826121795791,77.908834408651643,69.931244179279545,23.10206330260139,42.102984381724447,354.08028778763361,69.974556268915222,10.245368381978979,22.989672509476421,0,13.23116635522349,5.2289868235090289,0,0,0,330.99552907018671,63.311741460950429,17.789419704103249,26.733041534031191,0,7.7428239996802937,201.68599859865839,31.64103397135894,101.61901234697309,114.6010160313334]
["TON",2019,"TON_2019_MICS",146,"Latrine emptying practices","Emptied and discharged locally","s_lat_edl",4.4202476253925109,9.755956416402098,3.7285946573869921,11.1706974659403,0,0,0,0,0,0,4.8030094558545757,8.3568673752540423,7.1644119089170726,10.061836454640479,0,"'EUA","HA'APAI","ONGO NIUA","TONGATAPU","VAVA'U",2.2634076513393229,0.40568116417327499,21.023235482322129,0,17.884505892328871,32.869209402844952,21.2341863215809,3.0656901494198592,3.4314216058418761,0,0,0,0,0,0,32.869209402844952,16.329082082509121,4.9051042390717736,6.4971117552617343,0,1.357926793562872,1.0502045285363331,9.5121560597248696,0,48.680220097863518]
["TON",2019,"TON_2019_MICS",147,"Latrine emptying practices","Emptied and removed offsite","s_lat_ero",0.47336553056849212,12.593135937344821,27.23808524628156,0,0,1.350007314413644,0,0,0,0,0.40820630345537151,13.35978267380637,1.905753950167131,34.682993714278233,0,"'EUA","HA'APAI","ONGO NIUA","TONGATAPU","VAVA'U",0,1.0791118967009119,0,11.191153022954239,0.47935684749548169,3.5199726501663902,27.409408514474741,22.395443136504209,0,0,0.72642860425974287,0,0,0,0,2.7935440459066472,26.104636832104301,1.3047716823704429,22.395443136504209,0,0,2.7935440459066472,0,49.226508572868248,1.3047716823704429]
["TON",2019,"TON_2019_MICS",148,"Shared among improved sanitation facilities","Yes","",9.8796017142563475,9.7542882974507794,5.7831380193289759,2.1888867329449448,2.3299160891707258,11.589691899267351,2.6328852700373928,0.98975975778789171,1.725726093353481,2.205975994946562,10.649805291902981,9.2225426587402932,7.686535856941636,3.2405801917242099,2.357835404146837,"'EUA","HA'APAI","ONGO NIUA","TONGATAPU","VAVA'U",2.123973959697075,9.1544457988851491,5.8725792743419891,5.8689272014755858,6.4318059463035437,261.51961945829032,258.23493747886528,152.86788109732569,58.097254601739657,61.51294521374605,70.888966699344223,15.99060289219365,6.0282748093882654,10.54081798675411,13.493212152385819,217.67546386567071,187.13422909943881,156.57709147166671,65.725759950741846,48.178218922382989,15.286446327927219,86.105055607614489,9.5473440511777952,547.68948079217057,133.60431107107701]
["TON",2019,"TON_2019_MICS",149,"Shared among improved sanitation facilities","No","",82.264138219723677,87.483592588060205,93.414700568922797,97.811113267055021,97.670083910829291,85.775681372600005,97.367114729962594,99.010240242212106,98.274273906646528,97.79402400505343,80.49199780034202,87.123790205158485,90.865916712807902,96.685746151918906,97.64216459585316,"'EUA","HA'APAI","ONGO NIUA","TONGATAPU","VAVA'U",92.62497575638649,80.715592472366254,90.486608702301183,92.63232327847048,92.440112081393778,2177.5863789369059,2316.03981484824,2469.2662169887672,2596.0946561681321,2578.6227017159258,524.65151561278265,591.35082114055729,603.03617360397504,600.26399207849136,598.17310621626336,1645.2068820436809,1767.825199573597,1850.9665755282249,1960.989627248887,1995.145875611513,666.63092269149149,759.19621252015452,147.1085778406912,8644.4672594000385,1920.206796205616]
["TON",2019,"TON_2019_MICS",150,"Shared among improved sanitation facilities","DK/missing","",7.8562600660199493,2.7621191144890909,0.80216141174824529,0,0,2.6346267281326781,0,0,0,0,8.8581969077549765,3.6536671361012658,1.447547430250447,0.0736736563568616,0,"'EUA","HA'APAI","ONGO NIUA","TONGATAPU","VAVA'U",5.2510502839164266,10.12996172874861,3.6408120233568901,1.4987495200540439,1.128081972302668,207.96042211561459,73.124315694634475,21.203836896533542,0,0,16.11483445971556,0,0,0,0,181.0560914550268,74.136407734833384,29.486984854329719,1.49425620287709,0,37.792317539422037,95.280581382996374,5.9190490904948732,139.8636102130443,23.433016480825081]
["TON",2019,"TON_2019_MICS",151,"Shared among all sanitation facilities","Yes","",11.41065833846657,10.39516587630448,5.7831380193289759,2.1888867329449448,2.3299160891707258,12.35310014313168,2.6328852700373928,0.98975975778789171,1.725726093353481,2.205975994946562,11.560752022022781,10.91204484436153,7.686535856941636,3.2405801917242099,2.357835404146837,"'EUA","HA'APAI","ONGO NIUA","TONGATAPU","VAVA'U",2.132017291161318,9.3062104018183831,6.4163705438334162,6.4221453834941844,6.5727130218576821,301.31197124473539,274.85172213823091,152.86788109732569,58.097254601739657,61.51294521374605,75.142705980373378,15.99060289219365,6.0282748093882654,10.54081798675411,13.493212152385819,235.5492425259917,221.41584760389929,156.57709147166671,65.725759950741846,48.178218922382989,15.286446327927219,87.532525916786568,10.431412549758109,598.8600944833222,136.53129501798389]
["TON",2019,"TON_2019_MICS",152,"Shared among all sanitation facilities","No","",88.589341661533467,89.604834123695582,94.216861980671027,97.811113267055021,97.670083910829291,87.64689985686833,97.367114729962594,99.010240242212106,98.274273906646528,97.79402400505343,88.439247977977175,89.087955155638497,92.313464143058383,96.759419808275766,97.64216459585316,"'EUA","HA'APAI","ONGO NIUA","TONGATAPU","VAVA'U",97.867982708838667,90.693789598181638,93.583629456166619,93.577854616505903,93.427286978142305,2339.3066706173222,2369.1822972202158,2490.4700538852999,2596.0946561681321,2578.6227017159258,533.14756212817679,591.35082114055729,603.03617360397504,600.26399207849136,598.17310621626336,1801.9414161896309,1807.6799888039691,1880.453560382555,1962.4838834517641,1995.145875611513,701.70803543824229,853.0493235939789,152.14355843260569,8726.0626334025546,1940.712828739534]
["TON",2019,"TON_2019_MICS",153,"Type of toilet facility","FLUSH / POUR FLUSH: FLUSH TO PIPED SEWER SYSTEM","",1.3072111768913399,2.6947591150146488,4.7961421927063776,2.162921356098785,4.9930453674888033,0.84772818727720545,1.077150250235525,3.806143315985473,2.081957181413495,5.7752820723362204,0.83690110175236287,3.4699714705710969,5.0080996953185331,2.7179788872051529,4.6172058955650277,"'EUA","HA'APAI","ONGO NIUA","TONGATAPU","VAVA'U",0.49418505895270048,0.40470560782195641,0,4.4426605953221161,0,34.602748108654843,71.341027696328638,126.77824599551521,57.408083669887972,131.82317061444249,5.1851745292545877,6.541979668752778,23.18186579332902,12.71669460757243,35.325455227263589,17.105743301442519,70.409046633898996,102.01652586905639,55.126309895939038,94.344480558319759,3.556697738809103,3.806587491125542,0,414.58999085489461,0]
["TON",2019,"TON_2019_MICS",154,"Type of toilet facility","FLUSH / POUR FLUSH: FLUSH TO SEPTIC TANK","",62.885849759257638,86.32171075284181,91.291195026523781,96.679737293594243,94.932004590793468,87.720331757455099,97.669999692685593,96.193856684014506,97.594079625079786,94.224717927663775,57.00577980945102,83.246596092427367,90.183340356848433,94.024661368082292,95.38279410443495,"'EUA","HA'APAI","ONGO NIUA","TONGATAPU","VAVA'U",85.918792986825366,61.9425431389243,68.528385641654893,89.385032983230559,85.768395853561046,1664.6302122301879,2285.280165971154,2413.1347894350752,2566.0657666001421,2506.3336935464499,536.54607308437301,593.19036698634022,585.88258262003421,596.10933268889301,576.34086314138563,1165.1630450446719,1689.153215262719,1837.062285935021,1907.017249043995,1948.9796139755761,618.36587570062022,582.62031789009779,111.4100030716028,8341.4294682115142,1781.618962909183]
["TON",2019,"TON_2019_MICS",155,"Type of toilet facility","FLUSH / POUR FLUSH: FLUSH TO PIT LATRINE","",4.6068758692297056,4.0821512174372216,1.7805658577018251,0.99544776728878737,0.074950041717781204,3.706163289045413,0,0,0.3239631935066834,0,4.7064521092766993,5.1681562201815483,1.5196656897558971,2.4068782736841898,0,"'EUA","HA'APAI","ONGO NIUA","TONGATAPU","VAVA'U",4.1011973895991556,0.57613862845281882,1.0025937776818361,2.61360002967607,1.204322755849041,121.9470641689951,108.070833285671,47.066372773981087,26.421094115318301,1.978782768779801,22.668944805692451,0,0,1.978782768779801,0,96.196983697653039,104.866842682758,30.956055906039509,48.81653725182251,0,29.516714877843459,5.4190553672474797,1.629966543137229,243.90168664756831,25.016723676948811]
["TON",2019,"TON_2019_MICS",156,"Type of toilet facility","FLUSH / POUR FLUSH: FLUSH TO OPEN DRAIN","",0.85380433111721332,0,0,0,0,0,0,0,0,0,1.1057460113629429,0,0,0,0,"'EUA","HA'APAI","ONGO NIUA","TONGATAPU","VAVA'U",0.29532055398131529,1.298535342398053,0,0.088528840081565294,0,22.600767745870701,0,0,0,0,0,0,0,0,0,22.600767745870701,0,0,0,0,2.1254506334027572,12.21378774007855,0,8.2615293723893899,0]
["TON",2019,"TON_2019_MICS",157,"Type of toilet facility","VENTILATED IMPROVED PIT LATRINE","",0.86821774039609556,0.89541726512743924,0.090041100029254501,0,0,1.480660753471031,0.39188674771187521,0,0,0,0.87622835785451636,0.38384513461826347,0.58579749460039998,0,0,"'EUA","HA'APAI","ONGO NIUA","TONGATAPU","VAVA'U",0.37735404119834742,1.688755460161901,0.47128576689257018,0.23036620130925689,0.39493021747998208,22.982300262942779,23.70526833188956,2.380090554148937,0,0,9.0565402219595814,2.380090554148937,0,0,0,17.909568205275161,7.7885856447933586,11.93287452280423,0,0,2.715853587125745,15.88412734090485,0.7661926987696065,21.497820786635359,8.2036647355457148]
["TON",2019,"TON_2019_MICS",158,"Type of toilet facility","PIT LATRINE: PIT LATRINE WITH SLAB","",19.646869267316688,2.9822371060336068,1.2398944112905259,0.16189358301817289,0,2.4781947551960899,0.86096330936699872,0,0,0,24.45936791976812,3.6684480721630228,1.255549333226293,0.7768078146714944,0,"'EUA","HA'APAI","ONGO NIUA","TONGATAPU","VAVA'U",3.3222044497140621,21.22049108398296,26.356922790413861,1.4012092444279669,11.50426920080726,520.06567905679856,78.95171735133215,32.774599327371973,4.296966384523853,0,15.15800998011782,5.2289868235090289,0,0,0,499.93442244851269,74.436327093044596,25.5759247669709,15.75529100787152,0,23.910227231880938,199.5960875129939,42.849759578359347,130.7611318417774,238.9717559550148]
["TON",2019,"TON_2019_MICS",159,"Type of toilet facility","PIT LATRINE: PIT LATRINE WITHOUT SLAB / OPEN PIT","",4.8253772908089587,2.0073468716481528,0.32249694851225941,0,0,1.389025204625721,0,0,0,0,5.434875850164075,2.5387887636951931,0.82511434580931131,0.0736736563568616,0,"'EUA","HA'APAI","ONGO NIUA","TONGATAPU","VAVA'U",4.5784658354260133,8.8314263863505591,3.6408120233568901,0.56833842963624615,0.69434042703859244,127.7309419279583,53.142482371976698,8.5246841791859396,0,0,8.496046515394184,0,0,0,0,111.0855165245376,51.514457099329952,16.80783213698211,1.49425620287709,0,32.951662113348178,83.06679364291783,5.9190490904948732,53.037457912828067,14.42314571953202]
["TON",2019,"TON_2019_MICS",160,"Type of toilet facility","COMPOSTING TOILET","",2.9697240618741789,0.26160542905624518,0,0,0,1.1322945294224791,0,0,0,0,3.4396905397276658,0.40931587393743968,0,0,0,"'EUA","HA'APAI","ONGO NIUA","TONGATAPU","VAVA'U",0.53521578979396289,4.0374043519074583,0,0.46837891544025079,0,78.61056842370111,6.9257396907293032,0,0,0,6.9257396907293032,0,0,0,0,70.305157067880046,8.3054113558210663,0,0,0,3.851999883139555,37.97509252539929,0,43.709215705891573,0]
["TON",2019,"TON_2019_MICS",161,"Type of toilet facility","BUCKET","",0.72823642503041763,0.1000111150629337,0,0,0,0.43287342650237898,0,0,0,0,0.94312536603430097,0,0,0,0,"'EUA","HA'APAI","ONGO NIUA","TONGATAPU","VAVA'U",0,0,0,0.2349394276240595,0,19.27690186890857,2.6476933280942538,0,0,0,2.6476933280942538,0,0,0,0,19.27690186890857,0,0,0,0,0,0,0,21.92459519700283,0]
["TON",2019,"TON_2019_MICS",162,"Type of toilet facility","NO FACILITY / BUSH / FIELD","",0.10257410889399381,0.12710772259229991,0,0,0,0.55015440412617622,0,0,0,0,0.13284180888404401,0,0,0,0,"'EUA","HA'APAI","ONGO NIUA","TONGATAPU","VAVA'U",0.37726389450909792,0,0,0.036059165506921301,0,2.7152047926711051,3.365048663292205,0,0,0,3.365048663292205,0,0,0,0,2.7152047926711051,0,0,0,0,2.7152047926711051,0,0,3.365048663292205,0]
["TON",2019,"TON_2019_MICS",163,"Type of toilet facility","OTHER","",1.205259969183746,0.52765340518570458,0.47966446323598588,0,0,0.26257369287840232,0,0,0,0,1.0589911257242091,1.1148783724060729,0.62243308444113554,0,0,"'EUA","HA'APAI","ONGO NIUA","TONGATAPU","VAVA'U",0,0,0,0.53088616774497677,0.43374154526407521,31.904031924121892,13.96909133127131,12.6791527173476,0,0,1.606045952934916,0,0,0,0,21.645126666954852,22.621950635503431,12.6791527173476,0,0,0,0,0,49.542405211447743,9.0098707612930582]
["TON",2019,"TON_2019_MICS",222,"Hygiene ladder","Basic","h_bas",42.596680738717723,61.84512288194847,72.217887879740118,82.84564862938646,90.083075291135174,48.880188804359889,82.27715296963764,87.739891915579548,87.844930007996652,95.570453637568747,41.589410068723559,59.283288735300012,68.231696039808909,77.600744640097247,86.668498552584779,"'EUA","HA'APAI","ONGO NIUA","TONGATAPU","VAVA'U",55.132246602873003,49.641194977547613,47.389259484384183,74.017835581578623,68.119257686781793,1095.7857362149789,1597.689732087493,1858.7802527839449,2156.7215733117509,2307.8968276646201,287.97505928584769,491.86992535416141,531.55493887081855,532.31342498122194,568.61920700346479,819.03665619591163,1178.3025426236429,1352.859277663616,1532.5162736398349,1721.8268164442679,394.24929437273749,466.21686884077047,75.327027958713416,6679.3723958351311,1401.708535055443]
["TON",2019,"TON_2019_MICS",223,"Hygiene ladder","Limited","h_lim",50.932603365933829,34.081313587880281,27.290592697720321,16.143805271260671,8.3933261378076622,37.013010785337258,15.88019912694363,10.971196152542641,11.199970414354951,1.1416761285930701,52.139575697498373,37.706319838731588,31.117062780825101,21.76766283325253,12.642690298770731,"'EUA","HA'APAI","ONGO NIUA","TONGATAPU","VAVA'U",42.79333078139355,43.300990918405077,40.463039868882241,23.606541557340211,30.18565977718788,1310.2246303890149,880.44719192083153,702.41897516810616,420.27183901510972,215.03407498463901,218.06020467548811,94.935131774205118,66.466841625651014,67.868397304328397,6.7926744112490507,1026.8052291241199,749.44311435445707,616.97142999522532,429.88372967013191,251.1699585428438,306.01402090413592,406.67136262155248,64.317538798051899,2130.255239163941,621.13854999001796]
["TON",2019,"TON_2019_MICS",224,"Hygiene ladder","No facility","h_nfac",6.4707158953484489,4.0735635301713984,0.49151942253951281,1.010546099352899,1.523598571057184,14.106800410302871,1.842647903418742,1.288911931877833,0.95509957764838194,3.2878702338381691,6.2710142337779899,3.0103914259684448,0.65124117936599069,0.63159252665018839,0.68881114864442261,"'EUA","HA'APAI","ONGO NIUA","TONGATAPU","VAVA'U",2.0744226157334378,7.057814104047333,12.14770064673362,2.375622861081117,1.6950825360303099,166.45705858432129,105.23530913802389,12.65097364793635,26.307556393823099,39.034061586075232,83.109472034777426,11.01573224152569,7.8086203231068163,5.7876115027907389,19.561968097224121,123.4975567218506,59.833925330105622,12.912439857684991,12.473151255053491,13.684481986060369,14.83414340748338,66.285108445464189,19.309231589746911,214.37630047600581,34.88017543147955]
["TON",2019,"TON_2019_MICS",225,"Observed handwashing place","Fixed","",75.789554185784908,85.704185112030046,93.00267243598843,95.614765588740241,99.3858440236245,88.802301710693783,93.883884511102423,97.947031328813097,98.319639774548122,100,73.230377136392903,84.216670125760629,92.302819509457834,93.947952860244271,96.984768369077628,"'EUA","HA'APAI","ONGO NIUA","TONGATAPU","VAVA'U",87.824032911981448,66.242250386729651,77.862711670938594,92.630432120796613,90.737618076579949,1899.896172244021,2149.9806860722988,2411.6287109568011,2469.7477504599829,2510.4187247519999,460.79559549953137,556.57262299692843,585.7445806960028,593.04716206848354,575.411881414714,1417.041475610155,1645.813285503456,1850.1044585061279,1843.6346300390801,1913.5063521506229,622.59155974341786,610.46882018227654,118.90788491404351,8232.8907451698451,1856.813034475527]
["TON",2019,"TON_2019_MICS",226,"Observed handwashing place","Mobile","",24.21044581421512,14.295814887969989,6.9973275640116084,4.3852344112597557,0.61415597637548736,11.19769828930624,6.1161154888975799,2.0529686711868731,1.6803602254518679,0,26.769622863607061,15.783329874239399,7.6971804905421406,6.0520471397556896,3.015231630922369,"'EUA","HA'APAI","ONGO NIUA","TONGATAPU","VAVA'U",12.175967088018529,33.757749613270349,22.137288329061491,7.3695678792033199,9.2623819234200635,606.90861458287679,358.62572942760562,181.4459263517879,113.27144668253941,15.51316163944716,58.10491340928376,36.258218947100687,12.277199800466439,10.135643959254599,0,518.00451353023811,308.44741258133638,154.28118034920081,118.7653732708864,59.490422836489671,86.316399843667227,311.10135084647243,33.806915742487767,654.9990731930551,189.54113905857469]
["TON",2019,"TON_2019_MICS",227,"Water / Soap","Water and soap","",43.93928848220262,63.688337963893517,72.574606164872037,83.496149610410725,91.368133879559494,55.497162623992089,82.96969228881656,88.88554835402968,88.250762399341781,98.819510922411141,42.61145567873249,60.29403056503152,68.585665992078162,78.093980383966041,87.269621434404755,"'EUA","HA'APAI","ONGO NIUA","TONGATAPU","VAVA'U",55.780850456582797,50.589405288620902,49.325296326798387,75.447739476597448,68.759280104411872,1095.7857362149789,1597.689732087493,1858.7802527839449,2156.7215733117509,2307.8968276646201,287.97505928584769,491.86992535416141,531.55493887081855,532.31342498122194,568.61920700346479,819.03665619591163,1178.3025426236429,1352.859277663616,1532.5162736398349,1721.8268164442679,394.24929437273749,466.21686884077047,75.327027958713416,6679.3723958351311,1401.708535055443]
["TON",2019,"TON_2019_MICS",228,"Water / Soap","Water only","",50.224039256180262,33.340154841377803,24.452976389985999,15.80469084487892,8.0931370189163889,39.416049358450927,14.104570288955481,11.114451645970339,9.4932167027346424,1.180489077588823,51.314360757073217,36.123269048433627,29.55946215313088,19.539688843604349,12.69190462982637,"'EUA","HA'APAI","ONGO NIUA","TONGATAPU","VAVA'U",38.996107984744278,41.354371986919467,40.733771276158073,22.69980561807823,29.398209855636669,1252.5188216080239,836.37326328840538,626.28944251161886,408.23819857224919,204.42712857015931,204.5300807127517,83.616242796602165,66.466841625651014,57.261450889848739,6.7926744112490507,986.3155759374921,705.94284987696676,583.06341475533088,383.44685451364899,250.41086903091431,275.61767040886292,381.10955664771882,62.20649760427213,2009.608983490418,599.30414639918411]
["TON",2019,"TON_2019_MICS",229,"Water / Soap","Soap only","",2.3139123784226099,1.7569088702040649,2.9724174451419239,0.46587499063780602,0.41992210762392213,2.607460145142007,1.909294891015739,0,1.758496148842791,0,2.1065272831898101,2.2259192194839299,1.719028613023234,2.3663307724295799,0.038473935768826302,"'EUA","HA'APAI","ONGO NIUA","TONGATAPU","VAVA'U",4.3006653546465978,2.7737232364301798,1.382342238410607,1.3627758309386599,1.071062802906843,57.705808780990708,44.073928632426053,76.129532656487072,12.03364044286046,10.60694641447966,13.530123962736401,11.31888897760293,0,10.60694641447966,0,40.489653186627812,43.500264477490212,33.908015239894517,46.436875156482863,0.75908951192955609,30.396350495273008,25.56180597383376,2.1110411937797879,120.6462556735235,21.834403590833951]
["TON",2019,"TON_2019_MICS",230,"Water / Soap","Neither","",3.5227598831944889,1.2145983245247269,0,0.23328455407256901,0.1188069939001801,2.4793278724149652,1.01644253121225,0,0.49752474908075972,0,3.9676562810044169,1.35678116705096,0.1358432417677311,0,0,"'EUA","HA'APAI","ONGO NIUA","TONGATAPU","VAVA'U",0.92237620402630482,5.2824994880294716,8.5585901586329705,0.4896790743855754,0.77144723704460672,87.852811582927998,30.469491491581628,0,6.0257848156627851,3.000983742187791,12.865244947479351,6.0257848156627851,0,3.000983742187791,0,76.262495180385898,26.515041106693079,2.6795218399512728,0,0,6.5191936768088539,48.681939566425989,13.07023389976583,43.351184740049597,15.726519749309899]
["TON",2019,"TON_2019_MICS",231,"Place where household members most often wash their hands","OBSERVED: FIXED FACILITY OBSERVED (SINK / TAP) IN DWELLING","",17.52012050508888,42.732442817094203,55.795068866850968,75.106688864342772,81.697184520302073,36.530454594656582,75.996646230514585,84.666142452738512,81.848708406888875,88.624750755133547,13.90214054834342,38.595724132734517,50.153675381845893,64.592005104020672,77.257195810565236,"'EUA","HA'APAI","ONGO NIUA","TONGATAPU","VAVA'U",40.152516348367783,25.136521865761949,17.407550038537899,62.190349925469,41.544676429943543,463.7692267232369,1131.2982928826741,1474.8522212071521,1993.475660284482,2156.916491058405,223.4404677691407,461.55911343353932,515.67137352264433,499.93584792555413,542.08775010731711,284.15119428401022,783.14423140878273,1021.645740559666,1310.0612763867859,1578.6148967585109,288.98154955632498,236.42956226766159,28.300319423893441,5803.6161110329986,862.98434987507687]
["TON",2019,"TON_2019_MICS",232,"Place where household members most often wash their hands","OBSERVED: FIXED FACILITY OBSERVED (SINK / TAP) IN YARD /PLOT","",54.253528902521808,38.478611158189871,35.43914977166186,17.94414670027966,13.38954815085725,38.805373095273552,15.64416748202337,11.505056214642339,15.2440374745876,5.4480899645208662,55.426829918957111,42.514948708478293,40.669919089943598,26.30760362410944,16.389541741713028,"'EUA","HA'APAI","ONGO NIUA","TONGATAPU","VAVA'U",46.353413941416719,39.766795213959107,55.732788966623417,26.03160454993386,47.843615164630613,1436.126945520783,1018.682393189627,936.77648974964643,476.27209017550177,353.50223369359497,237.35512773039071,95.013509563389277,70.073207173358782,93.111314142929601,33.324131307396627,1132.8902813261441,862.66905409467347,828.45871794646291,533.57335365229471,334.89145539211268,333.61001018709231,374.03925791461512,90.607565490150037,2429.2746341368452,993.82868460045006]
["TON",2019,"TON_2019_MICS",233,"Place where household members most often wash their hands","OBSERVED: MOBILE OBJECT (BUCKET / JUG / KETTLE/TINI VAI)","",22.92759297160968,13.54634190815772,6.8642727799001797,4.2676434293586549,0.58758956788785033,9.4996171562680729,5.9699894511304512,2.0157472386459312,1.6593916407062881,0,25.34344988385244,15.20122445903711,7.5738271394573893,5.8556754060022476,2.911453107005038,"'EUA","HA'APAI","ONGO NIUA","TONGATAPU","VAVA'U",11.993224692635881,33.07541507507176,20.794662018518931,7.018834599568911,9.1246443733206721,606.90861458287679,358.62572942760562,181.4459263517879,113.27144668253941,15.51316163944716,58.10491340928376,36.258218947100687,12.277199800466439,10.135643959254599,0,518.00451353023811,308.44741258133638,154.28118034920081,118.7653732708864,59.490422836489671,86.316399843667227,311.10135084647243,33.806915742487767,654.9990731930551,189.54113905857469]
["TON",2019,"TON_2019_MICS",234,"Place where household members most often wash their hands","NOT OBSERVED: NO HANDWASHING PLACE IN DWELLING / YARD / PLOT","",2.9694852532723668,2.8241234406080999,0.47859842211281639,0.76414111187149991,1.3648191859305361,11.484282922288459,0.82160498665307857,1.2820679886091819,0.45622230124633167,3.1981437443534668,2.310982595071378,1.642055718885971,0.50234482276538805,0.61498333249854042,0.66971666524501827,"'EUA","HA'APAI","ONGO NIUA","TONGATAPU","VAVA'U",1.15531996942141,1.871519090889783,3.8376126732680729,1.8326697683265289,0.92207051944971574,78.604247001393247,74.765817646442287,12.65097364793635,20.28177157816031,36.03307784388744,70.244227087298071,4.9899474258629013,7.8086203231068163,2.7866277606029479,19.561968097224121,47.235061541464702,33.318884223412518,10.23291801773372,12.473151255053491,13.684481986060369,8.3149497306745239,17.603168879038179,6.2389976899810833,171.02511573595621,19.153655682169639]
["TON",2019,"TON_2019_MICS",235,"Place where household members most often wash their hands","NOT OBSERVED: NO PERMISSION TO SEE","",2.2270087755883501,2.0410792938213049,1.4229101594741069,1.7967378224546531,2.5856112889457439,3.680272231513368,1.567591849678512,0.42159840983839891,0,2.7290155359920858,2.8841573896151012,1.5536443799662809,1.100233565987736,2.5047045042539482,2.523886279799731,"'EUA","HA'APAI","ONGO NIUA","TONGATAPU","VAVA'U",0.345525048158139,0,1.969301240229669,2.6940950225592202,0.45487629244338901,58.950401480428177,54.035514202209889,37.612324026100843,47.688869941334147,68.263645330494342,22.510580775729249,9.5206346628588161,2.5678060294017548,0,16.692468856711251,58.950401480428177,31.52493342648064,22.412094981158919,50.800658294015498,51.571176473783083,2.4867772410812261,0,3.2015909198587131,251.4134957644811,9.4488910551463619]
["TON",2019,"TON_2019_MICS",236,"Place where household members most often wash their hands","OTHER REASON","",0.10226359191886659,0.37740138212893842,0,0.1206420716927756,0.37524728607655422,0,0,0.1093876955256386,0.79164017657092778,0,0.1324396641604888,0.49240260089786708,0,0.12502802911514779,0.24820639567194749,"'EUA","HA'APAI","ONGO NIUA","TONGATAPU","VAVA'U",0,0.14974875431742221,0.25808506282212179,0.23244613414243859,0.1101172202120361,2.7069852020925258,9.9913206731826723,0,3.2020721078548409,9.9070373638432692,0,0,0.66624156438532023,4.8353762769042294,0,2.7069852020925258,9.9913206731826723,0,2.5358305434695212,5.0716610869390406,0,1.408509602978141,0.4195817159928798,21.69192054190264,2.2874034860996471]
["TON",2019,"TON_2019_MICS",261,"Private place to wash and change","Yes","m_place",95.166270202696552,94.514011075987185,92.950785564097558,93.547488073418208,94.498748138457188,94.96860895177673,95.689145873146728,94.481060059440878,96.652645089268603,90.094732450112332,96.909956283566984,94.617283885311338,92.690520129228389,95.024405642553717,92.274713511251619,"'EUA","HA'APAI","ONGO NIUA","TONGATAPU","VAVA'U",97.698899270195241,95.768676309678185,88.921475974450516,92.980092549801924,97.816668817113197,348.09231139920502,566.88272944035452,547.11085045852872,533.91873328628571,522.38348559159533,116.0890383493596,124.70730103777041,120.68021587531091,126.7945473371352,115.72651888849001,210.46083935461721,407.24759804815608,431.8616055012738,413.14176086841189,451.67868491543999,137.25737903594549,168.44376628354621,25.81813982119699,1816.7260048160549,370.14282021922878]
["TON",2019,"TON_2019_MICS",262,"Private place to wash and change","No","",4.8337297973034818,5.4859889240129416,7.0492144359024653,6.4525119265818107,5.5012518615428254,5.0313910482232629,4.3108541268532381,5.5189399405591058,3.3473549107314571,9.9052675498876965,3.0900437164329699,5.3827161146886802,7.3094798707716206,4.9755943574462789,7.7252864887483899,"'EUA","HA'APAI","ONGO NIUA","TONGATAPU","VAVA'U",2.301100729804666,4.2313236903218376,11.078524025549489,7.0199074501977643,2.1833311828868061,17.680467819520612,32.904247100715139,41.491867784502027,36.827466619428677,30.410594628612731,6.1503412000527966,5.6181396376981061,7.0493161593501474,4.391254375821072,12.723298033460081,6.7106953624043726,23.16805258687388,34.056165700328933,21.632609015570019,37.814771881219798,3.2328210187629338,7.4423091790251252,3.2166231966989618,137.16106390564579,8.2618266526463504]
["TON",2019,"TON_2019_MICS",264,"Use of menstrual materials","Materials reusable","",1.708314384025474,0.18135074179816199,0.51452275069385633,0.34574419018895358,2.2313760013147221,0,0.64062889644789067,0.99784167329228257,2.53564150162418,1.5570553698308931,0.73864889050192828,1.189094698202027,0.20124900775008611,0.43011272513608462,1.574538179922131,"'EUA","HA'APAI","ONGO NIUA","TONGATAPU","VAVA'U",0.46063365778610438,0.26928556573755302,3.3001818883216338,0.83690166849220093,1.6495315053519759,6.2485490002432256,1.087718131165996,3.02849489656285,1.973321826898238,12.33491444272217,0,0.83490243239010498,1.274538499743064,3.3264016324721228,2.0000347719211748,1.604135131673291,5.1180496819329013,0.93765489147454173,1.8700198905012351,7.7072613654840483,0.64714514734301987,0.47363581336296462,0.95819999043370985,16.35211347858532,6.2419038678674692]
["TON",2019,"TON_2019_MICS",265,"Use of menstrual materials","Materials not reusable","",92.75944956028313,94.183148147387143,91.44216402816113,95.264458109938658,90.844895549875019,85.838337137841478,83.276043983755912,91.086721848620158,95.70020995673589,91.589039257226119,92.149880649766359,95.859349815190086,94.07972150703003,96.203392534433135,91.116441593254919,"'EUA","HA'APAI","ONGO NIUA","TONGATAPU","VAVA'U",98.300784318952466,98.927678706257339,78.406420767263725,92.292129860452192,92.538379007617138,339.28881664463938,564.89825668440915,538.23106309000718,543.71827452324601,502.18520478194029,104.92825073283031,108.52987129892691,116.34464356295589,125.5450876727264,117.64595324647991,200.12331004700141,412.59364420155981,438.33414159822922,418.26769369859539,446.00901966493302,138.10296854504389,174.00001162265789,22.76511846058937,1803.28399079122,350.16952630473111]
["TON",2019,"TON_2019_MICS",266,"Use of menstrual materials","No materials used","m_nomat",4.8077348523119392,4.8246825722400466,7.9739994382424779,4.3897976998724042,6.7288401842733352,14.16166286215849,16.083327119796181,7.9154364780875701,1.7641485416399909,6.015188109485246,5.8912238972496924,2.4880285106561728,5.0158852050235616,3.366494740430785,7.3090202268229651,"'EUA","HA'APAI","ONGO NIUA","TONGATAPU","VAVA'U",0.94818254335273922,0.80303572800508138,18.2933973444147,6.4789892213860831,5.5658686463049643,17.585385386768671,28.937817727742448,46.935177446179217,25.0546035555702,37.196630206141528,17.311128816582109,20.960666944151519,10.11034997196211,2.3143124077578481,7.72649811414471,12.79406135127309,10.70886410212581,23.369900553276722,14.63665629488534,35.777175766242799,1.332103552040087,1.4124280265504261,5.3114445668728782,126.5921325805359,21.061505596402711]
["TON",2019,"TON_2019_MICS",267,"Use of menstrual materials","DK/not sure/missing","",0.72450120337940027,0.81081853857477693,0.069313782902547805,0,0.19488826453697189,0,0,0,0,0.83871726345775777,1.220246562482038,0.46352697595169862,0.70314428019631481,0,0,"'EUA","HA'APAI","ONGO NIUA","TONGATAPU","VAVA'U",0.29039947990863108,0,0,0.39197924966909359,0.24622084072583689,2.6500281870739428,4.8631839977521354,0.40798281028146921,0,1.0773307894042801,0,0,0,0,1.0773307894042801,2.6500281870739428,1.9950926494113821,3.276074158622222,0,0,0.40798281028146921,0,0,7.6588318713567922,0.93171110287356529]
["TON",2019,"TON_2019_MICS",268,"Use of menstrual materials with private place to wash and change","Materials reusable","m_reuse",1.808854707113571,0.19353742053746481,0.55395628517379691,0.3695921689715555,1.8501944725926189,0,0.66948961724160461,1.056128786726684,1.323351890043758,0.83625675885237516,0.77192092300721982,1.2629285726184569,0.218778942102199,0.4526339546431975,1.7063593264151811,"'EUA","HA'APAI","ONGO NIUA","TONGATAPU","VAVA'U",0.47288856596479278,0.28118334314947568,3.711344028151156,0.75521666091920492,1.690605649111268,6.2485490002432256,1.087718131165996,3.02849489656285,1.973321826898238,9.6451776614352589,0,0.83490243239010498,1.274538499743064,1.677938038658406,0.95876158444797766,1.604135131673291,5.1180496819329013,0.93765489147454173,1.8700198905012351,7.7072613654840483,0.64714514734301987,0.47363581336296462,0.95819999043370985,13.662376697298409,6.2419038678674692]
["TON",2019,"TON_2019_MICS",269,"Use of menstrual materials with private place to wash and change","Materials not reusable","m_single",93.419718269014979,96.030389688177436,92.818003002922893,95.453457796046351,92.166792260944277,85.088059077131945,82.522619609945437,90.566068854676033,96.851402106589632,93.13404207095121,93.602191592178201,96.547772014801296,97.554216354714868,96.670975280329088,92.132010131967505,"'EUA","HA'APAI","ONGO NIUA","TONGATAPU","VAVA'U",98.553703009314404,99.139909773895752,77.500660840101148,93.725115962135106,92.778851018721468,322.71120775882559,539.709559612254,507.4386841108157,509.64389274260998,480.47116074005203,98.7779095327775,102.9117316612288,109.2953274036057,122.80229689071901,106.7774230782065,194.5154736183035,391.26226499665029,418.10325651101459,399.38816952181878,416.1406517502308,134.87014752628079,166.99499791325951,20.00922897804897,1695.5503056753371,342.54982487163238]
["TON",2019,"TON_2019_MICS",270,"Use of menstrual materials with private place to wash and change","No materials used","",4.7714270238714356,3.7760728912850121,6.6280407119032141,4.1769500349819522,5.9830132664631481,14.91194092286802,16.807890772812971,8.377802358597302,1.825246003366612,6.0297011701964243,5.6258874848146094,2.189299412580255,2.227004703182923,2.8763907650277081,6.1616305416173214,"'EUA","HA'APAI","ONGO NIUA","TONGATAPU","VAVA'U",0.97340842472074529,0.57890688295480286,18.78799513174777,5.5196673769455398,5.5305433321670812,16.482526453062121,21.22226769918133,36.235688640868183,22.301518716776709,31.189816400704011,17.311128816582109,20.960666944151519,10.11034997196211,2.3143124077578481,6.913003436431274,11.69120241756654,8.8721907201614858,9.5446199401623719,11.883571456091859,27.83077179972522,1.332103552040087,0.97513255692375056,4.8507108527143226,99.854490572059433,20.419380376854711]
["TON",2019,"TON_2019_MICS",274,"Participation in (all) activities during menstruation","Yes","m_participate",80.969941911015553,85.18847639049855,84.170413007586788,84.463012690281175,85.132139249425492,88.408851093313487,87.63141004231818,84.924298156702164,85.483853360894486,85.716104799044132,80.353977702832253,79.538725671337062,87.402578311667909,83.84243888727903,84.500047734745266,"'EUA","HA'APAI","ONGO NIUA","TONGATAPU","VAVA'U",96.75698307819988,85.097055150246916,75.355154136551008,85.176233770314056,74.915844453388232,296.16600685970923,510.94938690397362,495.42933891904119,482.06943525566112,470.60542613564837,108.0704310432304,114.206021307778,108.473408619276,112.1426783666173,110.10217968699909,174.50596658341419,342.34712360509701,407.22414484245849,364.52543536753001,413.62220465163222,135.93407909346359,149.67387063798921,21.879190425317798,1664.2474172623381,283.48503665492689]
["TON",2019,"TON_2019_MICS",275,"Participation in (all) activities during menstruation","No","",18.77246744454192,14.206963396141649,15.8295869924131,15.536987309718659,14.716827578863001,10.292561646896459,12.36858995768179,15.075701843297811,14.51614663910553,13.633911843721959,19.558665598902639,19.812791637903079,12.597421688332091,16.15756111272103,15.499952265254731,"'EUA","HA'APAI","ONGO NIUA","TONGATAPU","VAVA'U",3.2430169217999669,14.902944849753171,23.991443312225751,14.556941267392959,25.084155546611552,68.664575899831434,85.211516212014374,93.173379323988712,88.676764650052348,81.353751652169649,12.58156349690702,16.119419367690551,19.256123415385069,19.043123346338941,17.512734802560932,42.475854251307027,85.277356037243322,58.693626359144197,70.248934516452138,75.871252145027555,4.5561209612448268,26.212204824582251,6.9658587102775904,284.42619302500469,94.919610216947291]
["TON",2019,"TON_2019_MICS",276,"Participation in (all) activities during menstruation","DK/not sure/missing/no such activity","",0.25759064444270552,0.60456021335962695,0,0,0.15103317171152009,1.2985872597900161,0,0,0,0.6499833572339121,0.087356698265167204,0.64848269075991483,0,0,0,"'EUA","HA'APAI","ONGO NIUA","TONGATAPU","VAVA'U",0,0,0.65340255122333502,0.26682496229251268,0,0.94219645918550932,3.6260734250799418,0,0,0.83490243239010498,1.587385009275033,0,0,0,0.83490243239010498,0.1897138823005815,2.7911709926898371,0,0,0,0,0,0.1897138823005815,5.2134584343549744,0]
["TON",2019,"TON_2019_MICS",341,"Use of basic water sanitation and hygiene","Yes","wsh_bas",36.038514442916089,55.555555555555557,66.121495327102807,79.726651480637813,86.926605504587144,45,75.396825396825392,86.04651162790698,85.9375,90.082644628099175,35.170178282009722,53.061224489795919,62.222222222222221,72.053872053872055,84.042553191489361,"'EUA","HA'APAI","ONGO NIUA","TONGATAPU","VAVA'U",55.522388059701491,45.026178010471199,42.944785276073617,70.386643233743413,63.541666666666657,262,260,283,350,379,63,95,111,110,109,217,182,196,214,237,186,172,70,801,305]
["TON",2019,"TON_2019_MICS",342,"Use of basic water sanitation and hygiene","No","",63.961485557083911,44.444444444444443,33.878504672897201,20.273348519362191,13.07339449541284,55.000000000000007,24.603174603174601,13.95348837209302,14.0625,9.9173553719008272,64.829821717990271,46.938775510204081,37.777777777777779,27.946127946127952,15.957446808510641,"'EUA","HA'APAI","ONGO NIUA","TONGATAPU","VAVA'U",44.477611940298509,54.973821989528787,57.055214723926383,29.61335676625659,36.458333333333329,465,208,145,89,57,77,31,18,18,12,400,161,119,83,45,149,210,93,337,175]
["TON",2019,"TON_2019_MICS",343,"Use of basic water and sanitation","Yes","ws_bas",81.292984869326006,89.102564102564102,92.523364485981304,96.81093394077449,97.247706422018354,84.285714285714292,94.444444444444443,98.449612403100772,97.65625,97.52066115702479,80.875202593192881,88.338192419825063,91.111111111111114,95.622895622895626,96.808510638297875,"'EUA","HA'APAI","ONGO NIUA","TONGATAPU","VAVA'U",92.238805970149258,83.507853403141368,87.116564417177912,91.915641476274175,91.041666666666671,591,417,396,425,424,118,119,127,125,118,499,303,287,284,273,309,319,142,1046,437]
["TON",2019,"TON_2019_MICS",344,"Use of basic water and sanitation","No","",18.707015130674009,10.8974358974359,7.4766355140186906,3.1890660592255129,2.7522935779816522,15.71428571428571,5.5555555555555554,1.5503875968992249,2.34375,2.4793388429752068,19.124797406807129,11.66180758017493,8.8888888888888893,4.3771043771043772,3.191489361702128,"'EUA","HA'APAI","ONGO NIUA","TONGATAPU","VAVA'U",7.7611940298507456,16.492146596858639,12.88343558282209,8.0843585237258342,8.9583333333333339,136,51,32,14,12,22,7,2,3,3,118,40,28,13,9,26,63,21,92,43]
["TON",2019,"TON_2019_MICS",345,"Use of basic water and hygiene","Yes","wh_bas",41.540577716643739,58.974358974358978,70.09345794392523,81.548974943052386,88.302752293577981,52.142857142857153,77.777777777777786,86.04651162790698,87.5,92.561983471074385,40.356564019448953,56.559766763848387,66.349206349206341,74.747474747474755,85.460992907801412,"'EUA","HA'APAI","ONGO NIUA","TONGATAPU","VAVA'U",57.910447761194028,50.785340314136128,47.239263803680977,73.725834797891025,66.041666666666671,302,276,300,358,385,73,98,111,112,112,249,194,209,222,241,194,194,77,839,317]
["TON",2019,"TON_2019_MICS",346,"Use of basic water and hygiene","No","",58.459422283356247,41.025641025641022,29.906542056074759,18.451025056947611,11.69724770642202,47.857142857142861,22.222222222222221,13.95348837209302,12.5,7.4380165289256199,59.643435980551047,43.440233236151613,33.650793650793652,25.252525252525249,14.539007092198579,"'EUA","HA'APAI","ONGO NIUA","TONGATAPU","VAVA'U",42.089552238805972,49.214659685863879,52.760736196319023,26.274165202108961,33.958333333333343,425,192,128,81,51,67,28,18,16,9,368,149,106,75,41,141,188,86,299,163]
["TON",2019,"TON_2019_MICS",347,"Use of basic sanitation and hygiene","Yes","sh_bas",36.176066024759287,56.623931623931632,66.822429906542055,80.637813211845099,87.614678899082563,46.428571428571431,76.984126984126988,86.04651162790698,85.9375,90.082644628099175,35.332252836304697,53.644314868804663,62.857142857142847,73.400673400673398,85.106382978723403,"'EUA","HA'APAI","ONGO NIUA","TONGATAPU","VAVA'U",55.522388059701491,45.287958115183237,42.944785276073617,71.441124780316343,64.166666666666671,263,265,286,354,382,65,97,111,110,109,218,184,198,218,240,186,173,70,813,308]
["TON",2019,"TON_2019_MICS",348,"Use of basic sanitation and hygiene","No","",63.823933975240713,43.376068376068368,33.177570093457938,19.362186788154901,12.38532110091743,53.571428571428569,23.015873015873019,13.95348837209302,14.0625,9.9173553719008272,64.667747163695296,46.355685131195337,37.142857142857153,26.599326599326599,14.893617021276601,"'EUA","HA'APAI","ONGO NIUA","TONGATAPU","VAVA'U",44.477611940298509,54.712041884816763,57.055214723926383,28.55887521968366,35.833333333333343,464,203,142,85,54,75,29,18,18,12,399,159,117,79,42,149,209,93,325,172]
["TON",2019,"TON_2019_MICS",349,"Use of basic water","Yes","",98.899587345254474,98.71794871794873,98.831775700934571,99.088838268792713,99.311926605504581,97.857142857142847,98.412698412698404,100,100,100,98.865478119935162,99.125364431486886,98.730158730158735,98.653198653198643,98.936170212765958,"'EUA","HA'APAI","ONGO NIUA","TONGATAPU","VAVA'U",99.701492537313428,99.476439790575924,98.159509202453989,98.594024604569412,99.166666666666671,719,462,423,435,433,137,124,129,128,121,610,340,311,293,279,334,380,160,1122,476]
["TON",2019,"TON_2019_MICS",350,"Use of basic water","No","",1.10041265474553,1.2820512820512819,1.168224299065421,0.91116173120728927,0.68807339449541294,2.1428571428571428,1.587301587301587,0,0,0,1.13452188006483,0.87463556851311952,1.26984126984127,1.3468013468013471,1.063829787234043,"'EUA","HA'APAI","ONGO NIUA","TONGATAPU","VAVA'U",0.29850746268656719,0.52356020942408377,1.8404907975460121,1.40597539543058,0.83333333333333337,8,6,5,4,3,3,2,0,0,0,7,3,4,4,3,1,2,3,16,4]
["TON",2019,"TON_2019_MICS",351,"Use of basic sanitation","Yes","",82.393397524071531,90.384615384615387,93.45794392523365,97.722095671981776,97.935779816513758,86.428571428571431,96.031746031746039,98.449612403100772,97.65625,97.52066115702479,82.009724473257691,89.212827988338191,92.063492063492063,96.969696969696969,97.872340425531917,"'EUA","HA'APAI","ONGO NIUA","TONGATAPU","VAVA'U",92.537313432835816,84.031413612565444,88.957055214723923,93.23374340949033,91.875,599,423,400,429,427,121,121,127,125,118,506,306,290,288,276,310,321,145,1061,441]
["TON",2019,"TON_2019_MICS",352,"Use of basic sanitation","No","",17.606602475928469,9.6153846153846168,6.5420560747663554,2.2779043280182232,2.0642201834862388,13.571428571428569,3.9682539682539679,1.5503875968992249,2.34375,2.4793388429752068,17.990275526742298,10.787172011661809,7.9365079365079358,3.0303030303030298,2.1276595744680851,"'EUA","HA'APAI","ONGO NIUA","TONGATAPU","VAVA'U",7.4626865671641784,15.968586387434559,11.04294478527607,6.7662565905096654,8.125,128,45,28,10,9,19,5,2,3,3,111,37,25,9,6,25,61,18,77,39]
["TON",2019,"TON_2019_MICS",353,"Access to basic hygiene","Yes","",41.67812929848693,60.042735042735039,71.028037383177562,82.460136674259672,88.9908256880734,53.571428571428569,79.365079365079367,86.04651162790698,87.5,92.561983471074385,40.518638573743921,57.142857142857139,67.301587301587304,76.094276094276097,86.524822695035468,"'EUA","HA'APAI","ONGO NIUA","TONGATAPU","VAVA'U",57.910447761194028,51.047120418848174,47.239263803680977,74.868189806678387,66.666666666666657,303,281,304,362,388,75,100,111,112,112,250,196,212,226,244,194,195,77,852,320]
["TON",2019,"TON_2019_MICS",354,"Access to basic hygiene","No","",58.32187070151307,39.957264957264961,28.971962616822431,17.53986332574032,11.009174311926611,46.428571428571431,20.634920634920629,13.95348837209302,12.5,7.4380165289256199,59.481361426256072,42.857142857142847,32.698412698412703,23.90572390572391,13.475177304964539,"'EUA","HA'APAI","ONGO NIUA","TONGATAPU","VAVA'U",42.089552238805972,48.952879581151826,52.760736196319023,25.13181019332162,33.333333333333329,424,187,124,77,48,65,26,18,16,9,367,147,103,71,38,141,187,86,286,160]