{"text_format":"1","workbook":"xlsx","n_sheets":6,"sheets":["Introduction","Water","Sanitation","Hygiene","MICS14","data_summary"],"not_rendered":{"charts":99,"images":76,"macros":1,"external_links":0,"defined_names":0,"comments":0,"pivot_tables":0},"unopened":[],"bounds":{"document_bytes":16777216,"sheet_cells":100000,"rows_first":2000,"rows_last":500,"rows_between":2000,"halvings":0,"cell_chars":16384,"cell_head_chars":4096},"cells_cut":0,"cells_raw":0,"read":"whole","date_system":"1900"}

{"sheet":"Introduction","index":0,"n_rows":55,"n_cols":12,"rows_kept":55,"cut":false,"hidden":false,"merged":[[107,0,107,1],[1,0,1,1],[4,0,4,1],[5,0,5,1],[6,0,6,1],[7,0,7,1],[112,0,112,1],[113,0,113,1],[207,0,207,1],[212,0,212,1],[213,0,213,1]]}
[]
[]
[]
[null,null,"Joint Monitoring Programme for Water Supply, Sanitation and Hygiene"]
[]
[null,null,"Estimates on household water, sanitation and hygiene \nby wealth quintile and sub-national region in"]
[null,null,{"$f":"+Water!B5","v":"El Salvador"}]
[]
[null,null,"Updated May 2021"]
[]
[null,null,"Follow the links below to find the following information: "]
[]
[null,null,"JMP Estimates"]
[null,null,"WASH status and trends by wealth quintile \n(customized quintiles made without water and sanitation assets)"]
[null,null,"Water"]
[null,null,"Sanitation"]
[null,null,"Hygiene"]
[]
[null,null,"Data inputs"]
[null,null," customized wealth quintiles and subnational data:"]
[null,null,{"$f":"IF(INDIRECT(CONCATENATE(\"Water\",\"!B105\"))=0,\"\",INDIRECT(CONCATENATE(\"Water\",\"!B105\")))","v":"MICS14"}]
[null,null,{"$f":"IF(INDIRECT(CONCATENATE(\"Water\",\"!B106\"))=0,\"\",INDIRECT(CONCATENATE(\"Water\",\"!B106\")))","v":""}]
[null,null,{"$f":"IF(INDIRECT(CONCATENATE(\"Water\",\"!B107\"))=0,\"\",INDIRECT(CONCATENATE(\"Water\",\"!B107\")))","v":""}]
[null,null,{"$f":"IF(INDIRECT(CONCATENATE(\"Water\",\"!B108\"))=0,\"\",INDIRECT(CONCATENATE(\"Water\",\"!B108\")))","v":""}]
[null,null,{"$f":"IF(INDIRECT(CONCATENATE(\"Water\",\"!B109\"))=0,\"\",INDIRECT(CONCATENATE(\"Water\",\"!B109\")))","v":""}]
[null,null,{"$f":"IF(INDIRECT(CONCATENATE(\"Water\",\"!B110\"))=0,\"\",INDIRECT(CONCATENATE(\"Water\",\"!B110\")))","v":""}]
[null,null,{"$f":"IF(INDIRECT(CONCATENATE(\"Water\",\"!B111\"))=0,\"\",INDIRECT(CONCATENATE(\"Water\",\"!B111\")))","v":""}]
[null,null,{"$f":"IF(INDIRECT(CONCATENATE(\"Water\",\"!B112\"))=0,\"\",INDIRECT(CONCATENATE(\"Water\",\"!B112\")))","v":""}]
[null,null,{"$f":"IF(INDIRECT(CONCATENATE(\"Water\",\"!B113\"))=0,\"\",INDIRECT(CONCATENATE(\"Water\",\"!B113\")))","v":""}]
[null,null,{"$f":"IF(INDIRECT(CONCATENATE(\"Water\",\"!B114\"))=0,\"\",INDIRECT(CONCATENATE(\"Water\",\"!B114\")))","v":""}]
[null,null,{"$f":"IF(INDIRECT(CONCATENATE(\"Water\",\"!B115\"))=0,\"\",INDIRECT(CONCATENATE(\"Water\",\"!B115\")))","v":""}]
[null,null,{"$f":"IF(INDIRECT(CONCATENATE(\"Water\",\"!B116\"))=0,\"\",INDIRECT(CONCATENATE(\"Water\",\"!B116\")))","v":""}]
[]
[]
[]
[]
[]
[]
[]
[]
[]
[]
[]
[]
[]
[]
[]
[]
[]
[]
[]
[]
[]
[]
[null,null,null,null,null,null,null,null,null,null,null,{"$f":"+IF(ISNUMBER(M48), \"\", \"Insufficient data to estimate safely managed sanitation services at national level\")","v":"Insufficient data to estimate safely managed sanitation services at national level"}]

{"sheet":"Water","index":1,"n_rows":318,"n_cols":28,"rows_kept":318,"cut":false,"hidden":false,"merged":[[3,1,3,24],[317,18,317,22],[117,18,117,22],[196,18,196,22],[296,23,296,27],[298,0,299,1],[300,0,301,1],[296,0,297,2],[296,3,296,7],[296,8,296,12],[296,13,296,17],[296,18,296,22],[196,23,196,27],[198,0,199,1],[200,0,201,1],[196,13,196,17],[96,8,96,12],[96,13,96,17],[96,18,96,22],[217,18,217,22],[98,0,99,1],[100,0,101,1],[196,0,197,2],[196,3,196,7],[196,8,196,12],[217,1,217,11],[35,3,36,3],[38,1,39,2],[38,3,39,3],[96,0,97,2],[96,3,96,7],[317,1,317,11],[6,9,6,16],[6,17,6,24],[6,1,6,8],[4,1,4,24],[117,1,117,11],[30,21,30,24],[32,1,33,2],[32,3,33,3],[30,17,30,20],[30,1,31,4],[30,5,30,8],[30,9,30,12],[30,13,30,16],[96,23,96,27],[35,1,36,2]]}
["BGD"]
[]
[]
[null,"Summary of trends in use of drinking water by wealth quintile (%)"]
[null,{"$f":"IF(ISERROR(INDIRECT(CONCATENATE($B105,\"!A2\"))),\"\",INDIRECT(CONCATENATE($B105,\"!A2\")))","v":"El Salvador"}]
[]
[null,{"$f":"B118","v":"National use of drinking water sources, 2010–2018"},null,null,null,null,null,null,null,{"$f":"B218","v":"Urban use of drinking water sources,  2010–2018"},null,null,null,null,null,null,null,{"$f":"B318","v":"Rural use of drinking water sources, 2010–2018"}]
[]
[]
[]
[]
[]
[]
[]
[]
[]
[]
[]
[]
[]
[]
[]
[]
[]
[]
[]
[]
[]
[]
[]
[null,{"$f":"IF(ISERROR(INDIRECT(CONCATENATE($B105,\"!A2\"))),\"\",INDIRECT(CONCATENATE($B105,\"!A2\")))","v":"El Salvador"},null,null,null,"Poorest",null,null,null,"Poor",null,null,null,"Middle",null,null,null,"Rich",null,null,null,"Richest"]
[null,null,null,null,null,"Basic","Limited","Unimproved","Surface \n water","Basic","Limited","Unimproved","Surface \nwater","Basic","Limited","Unimproved","Surface \nwater","Basic","Limited","Unimproved","Surface \nwater","Basic","Limited","Unimproved","Surface \nwater"]
[null,"NATIONAL",null,"Estimate",{"$f":"C99","v":2010},{"$f":"E99","v":86.127081702126233},{"$f":"F99","v":2.7255817029877303},9.2464837550236467,1.9008528398623949,{"$f":"J99","v":94.217962431149815},{"$f":"K99","v":1.5957515786755163},3.2958203263389123,0.89046566383575465,{"$f":"O99","v":98.135814828537022},{"$f":"P99","v":0.46953309691195222},1.2679807616039938,0.12667131294704376,{"$f":"T99","v":99.398446684688892},{"$f":"U99","v":0.32496818490873325},0.2765851304023812,0,{"$f":"Y99","v":99.256059461383117},{"$f":"Z99","v":0.27011186109813523},0.15143691164092843,0.32239176587782026]
[null,null,null,null,{"$f":"C100","v":2018},{"$f":"E100","v":86.127081702126233},2.7255817029877303,9.2464837550236467,1.9008528398623949,{"$f":"J100","v":94.217962431149815},1.5957515786755163,3.2958203263389123,0.89046566383575465,{"$f":"O100","v":98.135814828537022},0.46953309691195222,1.2679807616039938,0.12667131294704376,{"$f":"T100","v":99.398446684688892},0.32496818490873325,0.2765851304023812,0,{"$f":"Y100","v":99.256059461383117},0.27011186109813523,0.15143691164092843,0.32239176587782026]
[]
[null,"URBAN",null,"Estimate",{"$f":"C199","v":2010},{"$f":"E199","v":96.799689632614189},{"$f":"F199","v":0.87354446324164203},2.3267659041441675,0,{"$f":"J199","v":99.448873411317351},{"$f":"K199","v":0.22921425913393875},0.30023714141728419,2.1675188131428918E-2,{"$f":"O199","v":99.670439807926343},{"$f":"P199","v":0.23103672103082562},9.8523471042838651E-2,0,{"$f":"T199","v":99.941798624769675},{"$f":"U199","v":2.0501515928044615E-2},3.7699859302279037E-2,0,{"$f":"Y199","v":99.627710204778055},{"$f":"Z199","v":0.27970268714380603},9.2587108078134861E-2,0]
[null,null,null,null,{"$f":"C200","v":2018},{"$f":"E200","v":96.799689632614189},0.87354446324164203,2.3267659041441675,0,{"$f":"J200","v":99.448873411317351},0.22921425913393875,0.30023714141728419,2.1675188131428918E-2,{"$f":"O200","v":99.670439807926343},0.23103672103082562,9.8523471042838651E-2,0,{"$f":"T200","v":99.941798624769675},2.0501515928044615E-2,3.7699859302279037E-2,0,{"$f":"Y200","v":99.627710204778055},0.27970268714380603,9.2587108078134861E-2,0]
[]
[null,"RURAL",null,"Estimate",{"$f":"C299","v":2010},{"$f":"E299","v":80.730945523661745},{"$f":"F299","v":3.9866481398927442},12.885609143828191,2.3967971926173166,{"$f":"J299","v":84.854045252343383},{"$f":"K299","v":2.5056978431701049},10.154468874114556,2.4857880303719551,{"$f":"O299","v":92.143012568095571},{"$f":"P299","v":1.9949534015037376},4.8628665017988055,0.99916752860188063,{"$f":"T299","v":93.640663248005296},{"$f":"U299","v":1.8509188924811926},3.0148931028699479,1.4935247566435708,{"$f":"Y299","v":95.974927704374409},{"$f":"Z299","v":1.071890049000477},1.9922727629593453,0.96090948366577333]
[null,null,null,null,{"$f":"C300","v":2018},{"$f":"E300","v":80.730945523661745},3.9866481398927442,12.885609143828191,2.3967971926173166,{"$f":"J300","v":84.854045252343383},2.5056978431701049,10.154468874114556,2.4857880303719551,{"$f":"O300","v":92.143012568095571},1.9949534015037376,4.8628665017988055,0.99916752860188063,{"$f":"T300","v":93.640663248005296},1.8509188924811926,3.0148931028699479,1.4935247566435708,{"$f":"Y300","v":95.974927704374409},1.071890049000477,1.9922727629593453,0.96090948366577333]
[]
[]
[]
[]
[]
[]
[]
[]
[]
[]
[]
[]
[]
[]
[]
[]
[]
[]
[]
[]
[]
[]
[]
[]
[]
[]
[]
[]
[]
[]
[]
[]
[]
[]
[]
[]
[]
[]
[]
[]
[]
[]
[]
[]
[]
[]
[]
[]
[]
[]
[]
[]
[]
[]
[]
[]
["NATIONAL",null,null,"Poorest",null,null,null,null,"Poor",null,null,null,null,"Middle",null,null,null,null,"Rich",null,null,null,null,"Richest"]
[null,null,null,"Improved","Basic","Limited","Unimproved","Surface water","Improved","Basic","Limited","Unimproved","Surface water","Improved","Basic","Limited","Unimproved","Surface water","Improved","Basic","Limited","Unimproved","Surface water","Improved","Basic","Limited","Unimproved","Surface water"]
["Forecast period:",null,{"$f":"MinBase(C105:C116)","v":2010},{"$f":"IF((D101+H101)>100,D101*100/(D101+H101),D101)","v":88.852663405113972},{"$f":"D99*AVERAGEIF(E105:E116,\">0\")/100","v":86.127081702126233},{"$f":"D99*(100-AVERAGEIF(E105:E116,\">0\"))/100","v":2.7255817029877303},{"$f":"100-(E99+F99+H99)","v":9.2464837550236467},{"$f":"IF((D101+H101)>100,H101*100/(D101+H101),H101)","v":1.9008528398623949},{"$f":"IF((I101+M101)>100,I101*100/(I101+M101),I101)","v":95.813714009825318},{"$f":"I99*AVERAGEIF(J105:J116,\">0\")/100","v":94.217962431149815},{"$f":"I99*(100-AVERAGEIF(J105:J116,\">0\"))/100","v":1.5957515786755163},{"$f":"100-(J99+K99+M99)","v":3.2958203263389123},{"$f":"IF((I101+M101)>100,M101*100/(I101+M101),M101)","v":0.89046566383575465},{"$f":"IF((N101+R101)>100,N101*100/(N101+R101),N101)","v":98.605347925448967},{"$f":"N99*AVERAGEIF(O105:O116,\">0\")/100","v":98.135814828537022},{"$f":"N99*(100-AVERAGEIF(O105:O116,\">0\"))/100","v":0.46953309691195222},{"$f":"100-(O99+P99+R99)","v":1.2679807616039938},{"$f":"IF((N101+R101)>100,R101*100/(N101+R101),R101)","v":0.12667131294704376},{"$f":"IF((S101+W101)>100,S101*100/(S101+W101),S101)","v":99.723414869597633},{"$f":"S99*AVERAGEIF(T105:T116,\">0\")/100","v":99.398446684688892},{"$f":"S99*(100-AVERAGEIF(T105:T116,\">0\"))/100","v":0.32496818490873325},{"$f":"100-(T99+U99+W99)","v":0.2765851304023812},{"$f":"IF((S101+W101)>100,W101*100/(S101+W101),W101)","v":0},{"$f":"IF((X101+AB101)>100,X101*100/(X101+AB101),X101)","v":99.526171322481261},{"$f":"X99*AVERAGEIF(Y105:Y116,\">0\")/100","v":99.256059461383117},{"$f":"X99*(100-AVERAGEIF(Y105:Y116,\">0\"))/100","v":0.27011186109813523},{"$f":"100-(Y99+Z99+AB99)","v":0.15143691164092843},{"$f":"IF((X101+AB101)>100,AB101*100/(X101+AB101),AB101)","v":0.32239176587782026}]
[null,null,{"$f":"MaxTarget(C105:C116)","v":2018},{"$f":"IF((D102+H102)>100,D102*100/(D102+H102),D102)","v":88.852663405113972},{"$f":"D100*AVERAGEIF(E105:E116,\">0\")/100","v":86.127081702126233},{"$f":"D100*(100-AVERAGEIF(E105:E116,\">0\"))/100","v":2.7255817029877303},{"$f":"100-(E100+F100+H100)","v":9.2464837550236467},{"$f":"IF((D102+H102)>100,H102*100/(D102+H102),H102)","v":1.9008528398623949},{"$f":"IF((I102+M102)>100,I102*100/(I102+M102),I102)","v":95.813714009825318},{"$f":"I100*AVERAGEIF(J105:J116,\">0\")/100","v":94.217962431149815},{"$f":"I100*(100-AVERAGEIF(J105:J116,\">0\"))/100","v":1.5957515786755163},{"$f":"100-(J100+K100+M100)","v":3.2958203263389123},{"$f":"IF((I102+M102)>100,M102*100/(I102+M102),M102)","v":0.89046566383575465},{"$f":"IF((N102+R102)>100,N102*100/(N102+R102),N102)","v":98.605347925448967},{"$f":"N100*AVERAGEIF(O105:O116,\">0\")/100","v":98.135814828537022},{"$f":"N100*(100-AVERAGEIF(O105:O116,\">0\"))/100","v":0.46953309691195222},{"$f":"100-(O100+P100+R100)","v":1.2679807616039938},{"$f":"IF((N102+R102)>100,R102*100/(N102+R102),R102)","v":0.12667131294704376},{"$f":"IF((S102+W102)>100,S102*100/(S102+W102),S102)","v":99.723414869597633},{"$f":"S100*AVERAGEIF(T105:T116,\">0\")/100","v":99.398446684688892},{"$f":"S100*(100-AVERAGEIF(T105:T116,\">0\"))/100","v":0.32496818490873325},{"$f":"100-(T100+U100+W100)","v":0.2765851304023812},{"$f":"IF((S102+W102)>100,W102*100/(S102+W102),W102)","v":0},{"$f":"IF((X102+AB102)>100,X102*100/(X102+AB102),X102)","v":99.526171322481261},{"$f":"X100*AVERAGEIF(Y105:Y116,\">0\")/100","v":99.256059461383117},{"$f":"X100*(100-AVERAGEIF(Y105:Y116,\">0\"))/100","v":0.27011186109813523},{"$f":"100-(Y100+Z100+AB100)","v":0.15143691164092843},{"$f":"IF((X102+AB102)>100,AB102*100/(X102+AB102),AB102)","v":0.32239176587782026}]
["Regression period:",null,{"$f":"MinRegYear(C99,C105:C116)","v":2012},{"$f":"IF(MAX(C105:C116)-MIN(C105:C116)<5,AVERAGEIF(C105:C116,\">0\",D105:D116),\nIF(FORECAST($C101,D$105:D$116,$C$105:$C$116)<0,0,\nIF(FORECAST($C101,D$105:D$116,$C$105:$C$116)>100,100,\nFORECAST($C101,D$105:D$116,$C$105:$C$116))))","v":88.852663405113972},null,null,null,{"$f":"IF(MAX(C105:C116)-MIN(C105:C116)<5,AVERAGEIF(C105:C116,\">0\",H105:H116),\nIF(FORECAST($C101,H$105:H$116,$C$105:$C$116)<0,0,\nIF(FORECAST($C101,H$105:H$116,$C$105:$C$116)>100,100,\nFORECAST($C101,H$105:H$116,$C$105:$C$116))))","v":1.9008528398623949},{"$f":"IF(MAX(C105:C116)-MIN(C105:C116)<5,AVERAGEIF(C105:C116,\">0\",I105:I116),\nIF(FORECAST($C101,I$105:I$116,$C$105:$C$116)<0,0,\nIF(FORECAST($C101,I$105:I$116,$C$105:$C$116)>100,100,\nFORECAST($C101,I$105:I$116,$C$105:$C$116))))","v":95.813714009825318},null,null,null,{"$f":"IF(MAX(C105:C116)-MIN(C105:C116)<5,AVERAGEIF(C105:C116,\">0\",M105:M116),\nIF(FORECAST($C101,M$105:M$116,$C$105:$C$116)<0,0,\nIF(FORECAST($C101,M$105:M$116,$C$105:$C$116)>100,100,\nFORECAST($C101,M$105:M$116,$C$105:$C$116))))","v":0.89046566383575465},{"$f":"IF(MAX(C105:C116)-MIN(C105:C116)<5,AVERAGEIF(C105:C116,\">0\",N105:N116),\nIF(FORECAST($C101,N$105:N$116,$C$105:$C$116)<0,0,\nIF(FORECAST($C101,N$105:N$116,$C$105:$C$116)>100,100,\nFORECAST($C101,N$105:N$116,$C$105:$C$116))))","v":98.605347925448967},null,null,null,{"$f":"IF(MAX(C105:C116)-MIN(C105:C116)<5,AVERAGEIF(C105:C116,\">0\",R105:R116),\nIF(FORECAST($C101,R$105:R$116,$C$105:$C$116)<0,0,\nIF(FORECAST($C101,R$105:R$116,$C$105:$C$116)>100,100,\nFORECAST($C101,R$105:R$116,$C$105:$C$116))))","v":0.12667131294704376},{"$f":"IF(MAX(C105:C116)-MIN(C105:C116)<5,AVERAGEIF(C105:C116,\">0\",S105:S116),\nIF(FORECAST($C101,S$105:S$116,$C$105:$C$116)<0,0,\nIF(FORECAST($C101,S$105:S$116,$C$105:$C$116)>100,100,\nFORECAST($C101,S$105:S$116,$C$105:$C$116))))","v":99.723414869597633},null,null,null,{"$f":"IF(MAX(C105:C116)-MIN(C105:C116)<5,AVERAGEIF(C105:C116,\">0\",W105:W116),\nIF(FORECAST($C101,W$105:W$116,$C$105:$C$116)<0,0,\nIF(FORECAST($C101,W$105:W$116,$C$105:$C$116)>100,100,\nFORECAST($C101,W$105:W$116,$C$105:$C$116))))","v":0},{"$f":"IF(MAX(C105:C116)-MIN(C105:C116)<5,AVERAGEIF(C105:C116,\">0\",X105:X116),\nIF(FORECAST($C101,X$105:X$116,$C$105:$C$116)<0,0,\nIF(FORECAST($C101,X$105:X$116,$C$105:$C$116)>100,100,\nFORECAST($C101,X$105:X$116,$C$105:$C$116))))","v":99.526171322481261},null,null,null,{"$f":"IF(MAX(C105:C116)-MIN(C105:C116)<5,AVERAGEIF(C105:C116,\">0\",AB105:AB116),\nIF(FORECAST($C101,AB$105:AB$116,$C$105:$C$116)<0,0,\nIF(FORECAST($C101,AB$105:AB$116,$C$105:$C$116)>100,100,\nFORECAST($C101,AB$105:AB$116,$C$105:$C$116))))","v":0.32239176587782026}]
[null,null,{"$f":"MaxRegYear(C100,C105:C116)","v":2016},{"$f":"IF(MAX(C105:C116)-MIN(C105:C116)<5,AVERAGEIF(C105:C116,\">0\",D105:D116),\nIF(FORECAST($C102,D$105:D$116,$C$105:$C$116)<0,0,\nIF(FORECAST($C102,D$105:D$116,$C$105:$C$116)>100,100,\nFORECAST($C102,D$105:D$116,$C$105:$C$116))))","v":88.852663405113972},null,null,null,{"$f":"IF(MAX(C105:C116)-MIN(C105:C116)<5,AVERAGEIF(C105:C116,\">0\",H105:H116),\nIF(FORECAST($C102,H$105:H$116,$C$105:$C$116)<0,0,\nIF(FORECAST($C102,H$105:H$116,$C$105:$C$116)>100,100,\nFORECAST($C102,H$105:H$116,$C$105:$C$116))))","v":1.9008528398623949},{"$f":"IF(MAX(C105:C116)-MIN(C105:C116)<5,AVERAGEIF(C105:C116,\">0\",I105:I116),\nIF(FORECAST($C102,I$105:I$116,$C$105:$C$116)<0,0,\nIF(FORECAST($C102,I$105:I$116,$C$105:$C$116)>100,100,\nFORECAST($C102,I$105:I$116,$C$105:$C$116))))","v":95.813714009825318},null,null,null,{"$f":"IF(MAX(C105:C116)-MIN(C105:C116)<5,AVERAGEIF(C105:C116,\">0\",M105:M116),\nIF(FORECAST($C102,M$105:M$116,$C$105:$C$116)<0,0,\nIF(FORECAST($C102,M$105:M$116,$C$105:$C$116)>100,100,\nFORECAST($C102,M$105:M$116,$C$105:$C$116))))","v":0.89046566383575465},{"$f":"IF(MAX(C105:C116)-MIN(C105:C116)<5,AVERAGEIF(C105:C116,\">0\",N105:N116),\nIF(FORECAST($C102,N$105:N$116,$C$105:$C$116)<0,0,\nIF(FORECAST($C102,N$105:N$116,$C$105:$C$116)>100,100,\nFORECAST($C102,N$105:N$116,$C$105:$C$116))))","v":98.605347925448967},null,null,null,{"$f":"IF(MAX(C105:C116)-MIN(C105:C116)<5,AVERAGEIF(C105:C116,\">0\",R105:R116),\nIF(FORECAST($C102,R$105:R$116,$C$105:$C$116)<0,0,\nIF(FORECAST($C102,R$105:R$116,$C$105:$C$116)>100,100,\nFORECAST($C102,R$105:R$116,$C$105:$C$116))))","v":0.12667131294704376},{"$f":"IF(MAX(C105:C116)-MIN(C105:C116)<5,AVERAGEIF(C105:C116,\">0\",S105:S116),\nIF(FORECAST($C102,S$105:S$116,$C$105:$C$116)<0,0,\nIF(FORECAST($C102,S$105:S$116,$C$105:$C$116)>100,100,\nFORECAST($C102,S$105:S$116,$C$105:$C$116))))","v":99.723414869597633},null,null,null,{"$f":"IF(MAX(C105:C116)-MIN(C105:C116)<5,AVERAGEIF(C105:C116,\">0\",W105:W116),\nIF(FORECAST($C102,W$105:W$116,$C$105:$C$116)<0,0,\nIF(FORECAST($C102,W$105:W$116,$C$105:$C$116)>100,100,\nFORECAST($C102,W$105:W$116,$C$105:$C$116))))","v":0},{"$f":"IF(MAX(C105:C116)-MIN(C105:C116)<5,AVERAGEIF(C105:C116,\">0\",X105:X116),\nIF(FORECAST($C102,X$105:X$116,$C$105:$C$116)<0,0,\nIF(FORECAST($C102,X$105:X$116,$C$105:$C$116)>100,100,\nFORECAST($C102,X$105:X$116,$C$105:$C$116))))","v":99.526171322481261},null,null,null,{"$f":"IF(MAX(C105:C116)-MIN(C105:C116)<5,AVERAGEIF(C105:C116,\">0\",AB105:AB116),\nIF(FORECAST($C102,AB$105:AB$116,$C$105:$C$116)<0,0,\nIF(FORECAST($C102,AB$105:AB$116,$C$105:$C$116)>100,100,\nFORECAST($C102,AB$105:AB$116,$C$105:$C$116))))","v":0.32239176587782026}]
[]
[null,"Survey","Year","Improved","% Improved\n< = 30min",null,null,"Surface water","Improved","% Improved\n< = 30min",null,null,"Surface water","Improved","% Improved\n< = 30min",null,null,"Surface water","Improved","% Improved\n< = 30min",null,null,"Surface water","Improved","% Improved\n< = 30min",null,null,"Surface water"]
[null,"MICS14",2014,{"$f":"IF(ISERROR(INDIRECT(CONCATENATE($B105,\"!C16\"))),\"\",INDIRECT(CONCATENATE($B105,\"!C16\")))","v":88.852663405113972},{"$f":"IF(ISERROR(INDIRECT(CONCATENATE($B105,\"!C23\"))),\"\",INDIRECT(CONCATENATE($B105,\"!C23\")))","v":96.932470453293291},null,null,{"$f":"IF(ISERROR(INDIRECT(CONCATENATE($B105,\"!C21\"))),\"\",INDIRECT(CONCATENATE($B105,\"!C21\")))","v":1.9008528398623949},{"$f":"IF(ISERROR(INDIRECT(CONCATENATE($B105,\"!D16\"))),\"\",INDIRECT(CONCATENATE($B105,\"!D16\")))","v":95.813714009825318},{"$f":"IF(ISERROR(INDIRECT(CONCATENATE($B105,\"!D23\"))),\"\",INDIRECT(CONCATENATE($B105,\"!D23\")))","v":98.334526956640175},null,null,{"$f":"IF(ISERROR(INDIRECT(CONCATENATE($B105,\"!D21\"))),\"\",INDIRECT(CONCATENATE($B105,\"!D21\")))","v":0.89046566383575465},{"$f":"IF(ISERROR(INDIRECT(CONCATENATE($B105,\"!E16\"))),\"\",INDIRECT(CONCATENATE($B105,\"!E16\")))","v":98.605347925448967},{"$f":"IF(ISERROR(INDIRECT(CONCATENATE($B105,\"!E23\"))),\"\",INDIRECT(CONCATENATE($B105,\"!E23\")))","v":99.523825931564133},null,null,{"$f":"IF(ISERROR(INDIRECT(CONCATENATE($B105,\"!E21\"))),\"\",INDIRECT(CONCATENATE($B105,\"!E21\")))","v":0.12667131294704376},{"$f":"IF(ISERROR(INDIRECT(CONCATENATE($B105,\"!F16\"))),\"\",INDIRECT(CONCATENATE($B105,\"!F16\")))","v":99.723414869597633},{"$f":"IF(ISERROR(INDIRECT(CONCATENATE($B105,\"!F23\"))),\"\",INDIRECT(CONCATENATE($B105,\"!F23\")))","v":99.674130508533352},null,null,{"$f":"IF(ISERROR(INDIRECT(CONCATENATE($B105,\"!F21\"))),\"\",INDIRECT(CONCATENATE($B105,\"!F21\")))","v":0},{"$f":"IF(ISERROR(INDIRECT(CONCATENATE($B105,\"!G16\"))),\"\",INDIRECT(CONCATENATE($B105,\"!G16\")))","v":99.526171322481261},{"$f":"IF(ISERROR(INDIRECT(CONCATENATE($B105,\"!G23\"))),\"\",INDIRECT(CONCATENATE($B105,\"!G23\")))","v":99.728602178191977},null,null,{"$f":"IF(ISERROR(INDIRECT(CONCATENATE($B105,\"!G221\"))),\"\",INDIRECT(CONCATENATE($B105,\"!G21\")))","v":0.32239176587782026}]
[null,null,null,"","",null,null,"","","",null,null,"","","",null,null,"","","",null,null,"","","",null,null,""]
[null,null,null,"","",null,null,"","","",null,null,"","","",null,null,"","","",null,null,"","","",null,null,""]
[null,null,null,"","",null,null,"","","",null,null,"","","",null,null,"","","",null,null,"","","",null,null,""]
[null,null,null,"","",null,null,"","","",null,null,"","","",null,null,"","","",null,null,"","","",null,null,""]
[null,null,null,"","",null,null,"","","",null,null,"","","",null,null,"","","",null,null,"","","",null,null,""]
[null,null,null,{"$f":"IF(ISERROR(INDIRECT(CONCATENATE($B111,\"!C16\"))),\"\",INDIRECT(CONCATENATE($B111,\"!C16\")))","v":""},{"$f":"IF(ISERROR(INDIRECT(CONCATENATE($B111,\"!C23\"))),\"\",INDIRECT(CONCATENATE($B111,\"!C23\")))","v":""},null,null,{"$f":"IF(ISERROR(INDIRECT(CONCATENATE($B111,\"!C21\"))),\"\",INDIRECT(CONCATENATE($B111,\"!C21\")))","v":""},{"$f":"IF(ISERROR(INDIRECT(CONCATENATE($B111,\"!D16\"))),\"\",INDIRECT(CONCATENATE($B111,\"!D16\")))","v":""},{"$f":"IF(ISERROR(INDIRECT(CONCATENATE($B111,\"!D23\"))),\"\",INDIRECT(CONCATENATE($B111,\"!D23\")))","v":""},null,null,{"$f":"IF(ISERROR(INDIRECT(CONCATENATE($B111,\"!D21\"))),\"\",INDIRECT(CONCATENATE($B111,\"!D21\")))","v":""},{"$f":"IF(ISERROR(INDIRECT(CONCATENATE($B111,\"!E16\"))),\"\",INDIRECT(CONCATENATE($B111,\"!E16\")))","v":""},{"$f":"IF(ISERROR(INDIRECT(CONCATENATE($B111,\"!E23\"))),\"\",INDIRECT(CONCATENATE($B111,\"!E23\")))","v":""},null,null,{"$f":"IF(ISERROR(INDIRECT(CONCATENATE($B111,\"!E21\"))),\"\",INDIRECT(CONCATENATE($B111,\"!E21\")))","v":""},{"$f":"IF(ISERROR(INDIRECT(CONCATENATE($B111,\"!F16\"))),\"\",INDIRECT(CONCATENATE($B111,\"!F16\")))","v":""},{"$f":"IF(ISERROR(INDIRECT(CONCATENATE($B111,\"!F23\"))),\"\",INDIRECT(CONCATENATE($B111,\"!F23\")))","v":""},null,null,{"$f":"IF(ISERROR(INDIRECT(CONCATENATE($B111,\"!F21\"))),\"\",INDIRECT(CONCATENATE($B111,\"!F21\")))","v":""},{"$f":"IF(ISERROR(INDIRECT(CONCATENATE($B111,\"!G16\"))),\"\",INDIRECT(CONCATENATE($B111,\"!G16\")))","v":""},{"$f":"IF(ISERROR(INDIRECT(CONCATENATE($B111,\"!G23\"))),\"\",INDIRECT(CONCATENATE($B111,\"!G23\")))","v":""},null,null,{"$f":"IF(ISERROR(INDIRECT(CONCATENATE($B111,\"!G221\"))),\"\",INDIRECT(CONCATENATE($B111,\"!G21\")))","v":""}]
[null,null,null,{"$f":"IF(ISERROR(INDIRECT(CONCATENATE($B112,\"!C16\"))),\"\",INDIRECT(CONCATENATE($B112,\"!C16\")))","v":""},{"$f":"IF(ISERROR(INDIRECT(CONCATENATE($B112,\"!C23\"))),\"\",INDIRECT(CONCATENATE($B112,\"!C23\")))","v":""},null,null,{"$f":"IF(ISERROR(INDIRECT(CONCATENATE($B112,\"!C21\"))),\"\",INDIRECT(CONCATENATE($B112,\"!C21\")))","v":""},{"$f":"IF(ISERROR(INDIRECT(CONCATENATE($B112,\"!D16\"))),\"\",INDIRECT(CONCATENATE($B112,\"!D16\")))","v":""},{"$f":"IF(ISERROR(INDIRECT(CONCATENATE($B112,\"!D23\"))),\"\",INDIRECT(CONCATENATE($B112,\"!D23\")))","v":""},null,null,{"$f":"IF(ISERROR(INDIRECT(CONCATENATE($B112,\"!D21\"))),\"\",INDIRECT(CONCATENATE($B112,\"!D21\")))","v":""},{"$f":"IF(ISERROR(INDIRECT(CONCATENATE($B112,\"!E16\"))),\"\",INDIRECT(CONCATENATE($B112,\"!E16\")))","v":""},{"$f":"IF(ISERROR(INDIRECT(CONCATENATE($B112,\"!E23\"))),\"\",INDIRECT(CONCATENATE($B112,\"!E23\")))","v":""},null,null,{"$f":"IF(ISERROR(INDIRECT(CONCATENATE($B112,\"!E21\"))),\"\",INDIRECT(CONCATENATE($B112,\"!E21\")))","v":""},{"$f":"IF(ISERROR(INDIRECT(CONCATENATE($B112,\"!F16\"))),\"\",INDIRECT(CONCATENATE($B112,\"!F16\")))","v":""},{"$f":"IF(ISERROR(INDIRECT(CONCATENATE($B112,\"!F23\"))),\"\",INDIRECT(CONCATENATE($B112,\"!F23\")))","v":""},null,null,{"$f":"IF(ISERROR(INDIRECT(CONCATENATE($B112,\"!F21\"))),\"\",INDIRECT(CONCATENATE($B112,\"!F21\")))","v":""},{"$f":"IF(ISERROR(INDIRECT(CONCATENATE($B112,\"!G16\"))),\"\",INDIRECT(CONCATENATE($B112,\"!G16\")))","v":""},{"$f":"IF(ISERROR(INDIRECT(CONCATENATE($B112,\"!G23\"))),\"\",INDIRECT(CONCATENATE($B112,\"!G23\")))","v":""},null,null,{"$f":"IF(ISERROR(INDIRECT(CONCATENATE($B112,\"!G221\"))),\"\",INDIRECT(CONCATENATE($B112,\"!G21\")))","v":""}]
[null,null,null,"","",null,null,"","","",null,null,"","","",null,null,"","","",null,null,"","","",null,null,""]
[null,null,null,"","",null,null,"","","",null,null,"","","",null,null,"","","",null,null,"","","",null,null,""]
[null,null,null,"","",null,null,"","","",null,null,"","","",null,null,"","","",null,null,"","","",null,null,""]
[null,null,null,"","",null,null,"","","",null,null,"","","",null,null,"","","",null,null,"","","",null,null,""]
[]
[null,{"$f":"CONCATENATE(\"National use of drinking water sources, \",C99,\"–\",C100)","v":"National use of drinking water sources, 2010–2018"},null,null,null,null,null,null,null,null,null,null,null,null,null,null,null,null,"Data points used for regression"]
[]
[]
[]
[]
[]
[]
[]
[]
[]
[]
[]
[]
[]
[]
[]
[]
[]
[]
[]
[]
[]
[]
[]
[]
[]
[]
[]
[]
[]
[]
[]
[]
[]
[]
[null,null,null,null,{"$f":"IF(ISERROR(INDIRECT(CONCATENATE($B153,\"!M18\"))),\"\",INDIRECT(CONCATENATE($B153,\"!M18\")))","v":""},{"$f":"IF(ISERROR(INDIRECT(CONCATENATE($B153,\"!M19\"))),\"\",INDIRECT(CONCATENATE($B153,\"!M19\")))","v":""},{"$f":"IF(ISERROR(INDIRECT(CONCATENATE($B153,\"!M20\"))),\"\",INDIRECT(CONCATENATE($B153,\"!M20\")))","v":""},{"$f":"IF(ISERROR(INDIRECT(CONCATENATE($B153,\"!M21\"))),\"\",INDIRECT(CONCATENATE($B153,\"!M21\")))","v":""},null,{"$f":"IF(ISERROR(INDIRECT(CONCATENATE($B153,\"!N18\"))),\"\",INDIRECT(CONCATENATE($B153,\"!N18\")))","v":""},{"$f":"IF(ISERROR(INDIRECT(CONCATENATE($B153,\"!N19\"))),\"\",INDIRECT(CONCATENATE($B153,\"!N19\")))","v":""},{"$f":"IF(ISERROR(INDIRECT(CONCATENATE($B153,\"!N20\"))),\"\",INDIRECT(CONCATENATE($B153,\"!N20\")))","v":""},{"$f":"IF(ISERROR(INDIRECT(CONCATENATE($B153,\"!N21\"))),\"\",INDIRECT(CONCATENATE($B153,\"!N21\")))","v":""},null,{"$f":"IF(ISERROR(INDIRECT(CONCATENATE($B153,\"!O18\"))),\"\",INDIRECT(CONCATENATE($B153,\"!O18\")))","v":""},{"$f":"IF(ISERROR(INDIRECT(CONCATENATE($B153,\"!O19\"))),\"\",INDIRECT(CONCATENATE($B153,\"!O19\")))","v":""},{"$f":"IF(ISERROR(INDIRECT(CONCATENATE($B153,\"!O20\"))),\"\",INDIRECT(CONCATENATE($B153,\"!O20\")))","v":""},{"$f":"IF(ISERROR(INDIRECT(CONCATENATE($B153,\"!O21\"))),\"\",INDIRECT(CONCATENATE($B153,\"!O21\")))","v":""},null,{"$f":"IF(ISERROR(INDIRECT(CONCATENATE($B153,\"!P18\"))),\"\",INDIRECT(CONCATENATE($B153,\"!P18\")))","v":""},{"$f":"IF(ISERROR(INDIRECT(CONCATENATE($B153,\"!P19\"))),\"\",INDIRECT(CONCATENATE($B153,\"!P19\")))","v":""},{"$f":"IF(ISERROR(INDIRECT(CONCATENATE($B153,\"!P20\"))),\"\",INDIRECT(CONCATENATE($B153,\"!P20\")))","v":""},{"$f":"IF(ISERROR(INDIRECT(CONCATENATE($B153,\"!P21\"))),\"\",INDIRECT(CONCATENATE($B153,\"!P21\")))","v":""},null,{"$f":"IF(ISERROR(INDIRECT(CONCATENATE($B153,\"!Q18\"))),\"\",INDIRECT(CONCATENATE($B153,\"!Q18\")))","v":""},{"$f":"IF(ISERROR(INDIRECT(CONCATENATE($B153,\"!Q19\"))),\"\",INDIRECT(CONCATENATE($B153,\"!Q19\")))","v":""},{"$f":"IF(ISERROR(INDIRECT(CONCATENATE($B153,\"!Q20\"))),\"\",INDIRECT(CONCATENATE($B153,\"!Q20\")))","v":""},{"$f":"IF(ISERROR(INDIRECT(CONCATENATE($B153,\"!Q21\"))),\"\",INDIRECT(CONCATENATE($B153,\"!Q1\")))","v":""}]
[null,null,null,null,"","","","",null,"","","","",null,"","","","",null,"","","","",null,"","","",""]
[null,null,null,null,"","","","",null,"","","","",null,"","","","",null,"","","","",null,"","","",""]
[null,null,null,null,"","","","",null,"","","","",null,"","","","",null,"","","","",null,"","","",""]
[null,null,null,null,"","","","",null,"","","","",null,"","","","",null,"","","","",null,"","","",""]
[null,null,null,null,"","","","",null,"","","","",null,"","","","",null,"","","","",null,"","","",""]
[]
[]
[]
[]
[]
[]
[]
[]
[]
[]
[]
[]
[]
[]
[]
[]
[]
[]
[]
[]
[]
[]
[]
[]
[]
[]
[]
[]
[]
[]
[]
[]
[]
[]
[]
[]
[]
[]
["URBAN",null,null,"Poorest",null,null,null,null,"Poor",null,null,null,null,"Middle",null,null,null,null,"Rich",null,null,null,null,"Richest"]
[null,null,null,"Improved","Basic","Limited","Unimproved","Surface water","Improved","Basic","Limited","Unimproved","Surface water","Improved","Basic","Limited","Unimproved","Surface water","Improved","Basic","Limited","Unimproved","Surface water","Improved","Basic","Limited","Unimproved","Surface water"]
["Forecast period:",null,{"$f":"MinBase(C205:C216)","v":2010},{"$f":"IF((D201+H201)>100,D201*100/(D201+H201),D201)","v":97.673234095855832},{"$f":"D199*AVERAGEIF(E205:E216,\">0\")/100","v":96.799689632614189},{"$f":"D199*(100-AVERAGEIF(E205:E216,\">0\"))/100","v":0.87354446324164203},{"$f":"100-(E199+F199+H199)","v":2.3267659041441675},{"$f":"IF((D201+H201)>100,H201*100/(D201+H201),H201)","v":0},{"$f":"IF((I201+M201)>100,I201*100/(I201+M201),I201)","v":99.678087670451276},{"$f":"I199*AVERAGEIF(J205:J216,\">0\")/100","v":99.448873411317351},{"$f":"I199*(100-AVERAGEIF(J205:J216,\">0\"))/100","v":0.22921425913393875},{"$f":"100-(J199+K199+M199)","v":0.30023714141728419},{"$f":"IF((I201+M201)>100,M201*100/(I201+M201),M201)","v":2.1675188131428918E-2},{"$f":"IF((N201+R201)>100,N201*100/(N201+R201),N201)","v":99.901476528957161},{"$f":"N199*AVERAGEIF(O205:O216,\">0\")/100","v":99.670439807926343},{"$f":"N199*(100-AVERAGEIF(O205:O216,\">0\"))/100","v":0.23103672103082562},{"$f":"100-(O199+P199+R199)","v":9.8523471042838651E-2},{"$f":"IF((N201+R201)>100,R201*100/(N201+R201),R201)","v":0},{"$f":"IF((S201+W201)>100,S201*100/(S201+W201),S201)","v":99.962300140697721},{"$f":"S199*AVERAGEIF(T205:T216,\">0\")/100","v":99.941798624769675},{"$f":"S199*(100-AVERAGEIF(T205:T216,\">0\"))/100","v":2.0501515928044615E-2},{"$f":"100-(T199+U199+W199)","v":3.7699859302279037E-2},{"$f":"IF((S201+W201)>100,W201*100/(S201+W201),W201)","v":0},{"$f":"IF((X201+AB201)>100,X201*100/(X201+AB201),X201)","v":99.907412891921851},{"$f":"X199*AVERAGEIF(Y205:Y216,\">0\")/100","v":99.627710204778055},{"$f":"X199*(100-AVERAGEIF(Y205:Y216,\">0\"))/100","v":0.27970268714380603},{"$f":"100-(Y199+Z199+AB199)","v":9.2587108078134861E-2},{"$f":"IF((X201+AB201)>100,AB201*100/(X201+AB201),AB201)","v":0}]
[null,null,{"$f":"MaxTarget(C205:C216)","v":2018},{"$f":"IF((D202+H202)>100,D202*100/(D202+H202),D202)","v":97.673234095855832},{"$f":"D200*AVERAGEIF(E205:E216,\">0\")/100","v":96.799689632614189},{"$f":"D200*(100-AVERAGEIF(E205:E216,\">0\"))/100","v":0.87354446324164203},{"$f":"100-(E200+F200+H200)","v":2.3267659041441675},{"$f":"IF((D202+H202)>100,H202*100/(D202+H202),H202)","v":0},{"$f":"IF((I202+M202)>100,I202*100/(I202+M202),I202)","v":99.678087670451276},{"$f":"I200*AVERAGEIF(J205:J216,\">0\")/100","v":99.448873411317351},{"$f":"I200*(100-AVERAGEIF(J205:J216,\">0\"))/100","v":0.22921425913393875},{"$f":"100-(J200+K200+M200)","v":0.30023714141728419},{"$f":"IF((I202+M202)>100,M202*100/(I202+M202),M202)","v":2.1675188131428918E-2},{"$f":"IF((N202+R202)>100,N202*100/(N202+R202),N202)","v":99.901476528957161},{"$f":"N200*AVERAGEIF(O205:O216,\">0\")/100","v":99.670439807926343},{"$f":"N200*(100-AVERAGEIF(O205:O216,\">0\"))/100","v":0.23103672103082562},{"$f":"100-(O200+P200+R200)","v":9.8523471042838651E-2},{"$f":"IF((N202+R202)>100,R202*100/(N202+R202),R202)","v":0},{"$f":"IF((S202+W202)>100,S202*100/(S202+W202),S202)","v":99.962300140697721},{"$f":"S200*AVERAGEIF(T205:T216,\">0\")/100","v":99.941798624769675},{"$f":"S200*(100-AVERAGEIF(T205:T216,\">0\"))/100","v":2.0501515928044615E-2},{"$f":"100-(T200+U200+W200)","v":3.7699859302279037E-2},{"$f":"IF((S202+W202)>100,W202*100/(S202+W202),W202)","v":0},{"$f":"IF((X202+AB202)>100,X202*100/(X202+AB202),X202)","v":99.907412891921851},{"$f":"X200*AVERAGEIF(Y205:Y216,\">0\")/100","v":99.627710204778055},{"$f":"X200*(100-AVERAGEIF(Y205:Y216,\">0\"))/100","v":0.27970268714380603},{"$f":"100-(Y200+Z200+AB200)","v":9.2587108078134861E-2},{"$f":"IF((X202+AB202)>100,AB202*100/(X202+AB202),AB202)","v":0}]
["Regression period:",null,{"$f":"MinRegYear(C199,C205:C216)","v":2012},{"$f":"IF(MAX(C205:C216)-MIN(C205:C216)<5,AVERAGEIF(C205:C216,\">0\",D205:D216),\nIF(FORECAST($C201,D$205:D$216,$C$205:$C$216)<0,0,\nIF(FORECAST($C201,D$205:D$216,$C$205:$C$216)>100,100,\nFORECAST($C201,D$205:D$216,$C$205:$C$216))))","v":97.673234095855832},null,null,null,{"$f":"IF(MAX(C205:C216)-MIN(C205:C216)<5,AVERAGEIF(C205:C216,\">0\",H205:H216),\nIF(FORECAST($C201,H$205:H$216,$C$205:$C$216)<0,0,\nIF(FORECAST($C201,H$205:H$216,$C$205:$C$216)>100,100,\nFORECAST($C201,H$205:H$216,$C$205:$C$216))))","v":0},{"$f":"IF(MAX(C205:C216)-MIN(C205:C216)<5,AVERAGEIF(C205:C216,\">0\",I205:I216),\nIF(FORECAST($C201,I$205:I$216,$C$205:$C$216)<0,0,\nIF(FORECAST($C201,I$205:I$216,$C$205:$C$216)>100,100,\nFORECAST($C201,I$205:I$216,$C$205:$C$216))))","v":99.678087670451276},null,null,null,{"$f":"IF(MAX(C205:C216)-MIN(C205:C216)<5,AVERAGEIF(C205:C216,\">0\",M205:M216),\nIF(FORECAST($C201,M$205:M$216,$C$205:$C$216)<0,0,\nIF(FORECAST($C201,M$205:M$216,$C$205:$C$216)>100,100,\nFORECAST($C201,M$205:M$216,$C$205:$C$216))))","v":2.1675188131428918E-2},{"$f":"IF(MAX(C205:C216)-MIN(C205:C216)<5,AVERAGEIF(C205:C216,\">0\",N205:N216),\nIF(FORECAST($C201,N$205:N$216,$C$205:$C$216)<0,0,\nIF(FORECAST($C201,N$205:N$216,$C$205:$C$216)>100,100,\nFORECAST($C201,N$205:N$216,$C$205:$C$216))))","v":99.901476528957161},null,null,null,{"$f":"IF(MAX(C205:C216)-MIN(C205:C216)<5,AVERAGEIF(C205:C216,\">0\",R205:R216),\nIF(FORECAST($C201,R$205:R$216,$C$205:$C$216)<0,0,\nIF(FORECAST($C201,R$205:R$216,$C$205:$C$216)>100,100,\nFORECAST($C201,R$205:R$216,$C$205:$C$216))))","v":0},{"$f":"IF(MAX(C205:C216)-MIN(C205:C216)<5,AVERAGEIF(C205:C216,\">0\",S205:S216),\nIF(FORECAST($C201,S$205:S$216,$C$205:$C$216)<0,0,\nIF(FORECAST($C201,S$205:S$216,$C$205:$C$216)>100,100,\nFORECAST($C201,S$205:S$216,$C$205:$C$216))))","v":99.962300140697721},null,null,null,{"$f":"IF(MAX(C205:C216)-MIN(C205:C216)<5,AVERAGEIF(C205:C216,\">0\",W205:W216),\nIF(FORECAST($C201,W$205:W$216,$C$205:$C$216)<0,0,\nIF(FORECAST($C201,W$205:W$216,$C$205:$C$216)>100,100,\nFORECAST($C201,W$205:W$216,$C$205:$C$216))))","v":0},{"$f":"IF(MAX(C205:C216)-MIN(C205:C216)<5,AVERAGEIF(C205:C216,\">0\",X205:X216),\nIF(FORECAST($C201,X$205:X$216,$C$205:$C$216)<0,0,\nIF(FORECAST($C201,X$205:X$216,$C$205:$C$216)>100,100,\nFORECAST($C201,X$205:X$216,$C$205:$C$216))))","v":99.907412891921851},null,null,null,{"$f":"IF(MAX(C205:C216)-MIN(C205:C216)<5,AVERAGEIF(C205:C216,\">0\",AB205:AB216),\nIF(FORECAST($C201,AB$205:AB$216,$C$205:$C$216)<0,0,\nIF(FORECAST($C201,AB$205:AB$216,$C$205:$C$216)>100,100,\nFORECAST($C201,AB$205:AB$216,$C$205:$C$216))))","v":0}]
[null,null,{"$f":"MaxRegYear(C200,C205:C216)","v":2016},{"$f":"IF(MAX(C205:C216)-MIN(C205:C216)<5,AVERAGEIF(C205:C216,\">0\",D205:D216),\nIF(FORECAST($C202,D$205:D$216,$C$205:$C$216)<0,0,\nIF(FORECAST($C202,D$205:D$216,$C$205:$C$216)>100,100,\nFORECAST($C202,D$205:D$216,$C$205:$C$216))))","v":97.673234095855832},null,null,null,{"$f":"IF(MAX(C205:C216)-MIN(C205:C216)<5,AVERAGEIF(C205:C216,\">0\",H205:H216),\nIF(FORECAST($C202,H$205:H$216,$C$205:$C$216)<0,0,\nIF(FORECAST($C202,H$205:H$216,$C$205:$C$216)>100,100,\nFORECAST($C202,H$205:H$216,$C$205:$C$216))))","v":0},{"$f":"IF(MAX(C205:C216)-MIN(C205:C216)<5,AVERAGEIF(C205:C216,\">0\",I205:I216),\nIF(FORECAST($C202,I$205:I$216,$C$205:$C$216)<0,0,\nIF(FORECAST($C202,I$205:I$216,$C$205:$C$216)>100,100,\nFORECAST($C202,I$205:I$216,$C$205:$C$216))))","v":99.678087670451276},null,null,null,{"$f":"IF(MAX(C205:C216)-MIN(C205:C216)<5,AVERAGEIF(C205:C216,\">0\",M205:M216),\nIF(FORECAST($C202,M$205:M$216,$C$205:$C$216)<0,0,\nIF(FORECAST($C202,M$205:M$216,$C$205:$C$216)>100,100,\nFORECAST($C202,M$205:M$216,$C$205:$C$216))))","v":2.1675188131428918E-2},{"$f":"IF(MAX(C205:C216)-MIN(C205:C216)<5,AVERAGEIF(C205:C216,\">0\",N205:N216),\nIF(FORECAST($C202,N$205:N$216,$C$205:$C$216)<0,0,\nIF(FORECAST($C202,N$205:N$216,$C$205:$C$216)>100,100,\nFORECAST($C202,N$205:N$216,$C$205:$C$216))))","v":99.901476528957161},null,null,null,{"$f":"IF(MAX(C205:C216)-MIN(C205:C216)<5,AVERAGEIF(C205:C216,\">0\",R205:R216),\nIF(FORECAST($C202,R$205:R$216,$C$205:$C$216)<0,0,\nIF(FORECAST($C202,R$205:R$216,$C$205:$C$216)>100,100,\nFORECAST($C202,R$205:R$216,$C$205:$C$216))))","v":0},{"$f":"IF(MAX(C205:C216)-MIN(C205:C216)<5,AVERAGEIF(C205:C216,\">0\",S205:S216),\nIF(FORECAST($C202,S$205:S$216,$C$205:$C$216)<0,0,\nIF(FORECAST($C202,S$205:S$216,$C$205:$C$216)>100,100,\nFORECAST($C202,S$205:S$216,$C$205:$C$216))))","v":99.962300140697721},null,null,null,{"$f":"IF(MAX(C205:C216)-MIN(C205:C216)<5,AVERAGEIF(C205:C216,\">0\",W205:W216),\nIF(FORECAST($C202,W$205:W$216,$C$205:$C$216)<0,0,\nIF(FORECAST($C202,W$205:W$216,$C$205:$C$216)>100,100,\nFORECAST($C202,W$205:W$216,$C$205:$C$216))))","v":0},{"$f":"IF(MAX(C205:C216)-MIN(C205:C216)<5,AVERAGEIF(C205:C216,\">0\",X205:X216),\nIF(FORECAST($C202,X$205:X$216,$C$205:$C$216)<0,0,\nIF(FORECAST($C202,X$205:X$216,$C$205:$C$216)>100,100,\nFORECAST($C202,X$205:X$216,$C$205:$C$216))))","v":99.907412891921851},null,null,null,{"$f":"IF(MAX(C205:C216)-MIN(C205:C216)<5,AVERAGEIF(C205:C216,\">0\",AB205:AB216),\nIF(FORECAST($C202,AB$205:AB$216,$C$205:$C$216)<0,0,\nIF(FORECAST($C202,AB$205:AB$216,$C$205:$C$216)>100,100,\nFORECAST($C202,AB$205:AB$216,$C$205:$C$216))))","v":0}]
[]
[null,"Survey","Year","Improved","% Improved\n< = 30min",null,null,"Surface water","Improved","% Improved\n< = 30min",null,null,"Surface water","Improved","% Improved\n< = 30min",null,null,"Surface water","Improved","% Improved\n< = 30min",null,null,"Surface water","Improved","% Improved\n< = 30min",null,null,"Surface water"]
[null,"MICS14",2014,{"$f":"IF(ISERROR(INDIRECT(CONCATENATE($B205,\"!H16\"))),\"\",INDIRECT(CONCATENATE($B205,\"!H16\")))","v":97.673234095855832},{"$f":"IF(ISERROR(INDIRECT(CONCATENATE($B205,\"!H23\"))),\"\",INDIRECT(CONCATENATE($B205,\"!H23\")))","v":99.105646013129501},null,null,{"$f":"IF(ISERROR(INDIRECT(CONCATENATE($B205,\"!H21\"))),\"\",INDIRECT(CONCATENATE($B205,\"!H21\")))","v":0},{"$f":"IF(ISERROR(INDIRECT(CONCATENATE($B205,\"!I16\"))),\"\",INDIRECT(CONCATENATE($B205,\"!I16\")))","v":99.678087670451276},{"$f":"IF(ISERROR(INDIRECT(CONCATENATE($B205,\"!I23\"))),\"\",INDIRECT(CONCATENATE($B205,\"!I23\")))","v":99.770045488942614},null,null,{"$f":"IF(ISERROR(INDIRECT(CONCATENATE($B205,\"!I21\"))),\"\",INDIRECT(CONCATENATE($B205,\"!I21\")))","v":2.1675188131428918E-2},{"$f":"IF(ISERROR(INDIRECT(CONCATENATE($B205,\"!J16\"))),\"\",INDIRECT(CONCATENATE($B205,\"!J16\")))","v":99.901476528957161},{"$f":"IF(ISERROR(INDIRECT(CONCATENATE($B205,\"!J23\"))),\"\",INDIRECT(CONCATENATE($B205,\"!J23\")))","v":99.768735429086618},null,null,{"$f":"IF(ISERROR(INDIRECT(CONCATENATE($B205,\"!J21\"))),\"\",INDIRECT(CONCATENATE($B205,\"!J21\")))","v":0},{"$f":"IF(ISERROR(INDIRECT(CONCATENATE($B205,\"!K16\"))),\"\",INDIRECT(CONCATENATE($B205,\"!K16\")))","v":99.962300140697721},{"$f":"IF(ISERROR(INDIRECT(CONCATENATE($B205,\"!K23\"))),\"\",INDIRECT(CONCATENATE($B205,\"!K23\")))","v":99.979490752114359},null,null,{"$f":"IF(ISERROR(INDIRECT(CONCATENATE($B205,\"!K21\"))),\"\",INDIRECT(CONCATENATE($B205,\"!K21\")))","v":0},{"$f":"IF(ISERROR(INDIRECT(CONCATENATE($B205,\"!L16\"))),\"\",INDIRECT(CONCATENATE($B205,\"!L16\")))","v":99.907412891921851},{"$f":"IF(ISERROR(INDIRECT(CONCATENATE($B205,\"!L23\"))),\"\",INDIRECT(CONCATENATE($B205,\"!L23\")))","v":99.720038104233183},null,null,{"$f":"IF(ISERROR(INDIRECT(CONCATENATE($B205,\"!L221\"))),\"\",INDIRECT(CONCATENATE($B205,\"!L21\")))","v":0}]
[null,null,null,"","",null,null,"","","",null,null,"","","",null,null,"","","",null,null,"","","",null,null,""]
[null,null,null,"","",null,null,"","","",null,null,"","","",null,null,"","","",null,null,"","","",null,null,""]
[null,null,null,"","",null,null,"","","",null,null,"","","",null,null,"","","",null,null,"","","",null,null,""]
[null,null,null,"","",null,null,"","","",null,null,"","","",null,null,"","","",null,null,"","","",null,null,""]
[null,null,null,"","",null,null,"","","",null,null,"","","",null,null,"","","",null,null,"","","",null,null,""]
[null,null,null,"","",null,null,"","","",null,null,"","","",null,null,"","","",null,null,"","","",null,null,""]
[null,null,null,"","",null,null,"","","",null,null,"","","",null,null,"","","",null,null,"","","",null,null,""]
[null,null,null,"","",null,null,"","","",null,null,"","","",null,null,"","","",null,null,"","","",null,null,""]
[null,null,null,"","",null,null,"","","",null,null,"","","",null,null,"","","",null,null,"","","",null,null,""]
[null,null,null,"","",null,null,"","","",null,null,"","","",null,null,"","","",null,null,"","","",null,null,""]
[null,null,null,"","",null,null,"","","",null,null,"","","",null,null,"","","",null,null,"","","",null,null,""]
[]
[null,{"$f":"CONCATENATE(\"Urban use of drinking water sources,  \",C199,\"–\",C200)","v":"Urban use of drinking water sources,  2010–2018"},null,null,null,null,null,null,null,null,null,null,null,null,null,null,null,null,"Data points used for regression"]
[]
[]
[]
[]
[]
[]
[]
[]
[]
[]
[]
[]
[]
[]
[]
[]
[]
[]
[]
[]
[]
[]
[]
[]
[]
[]
[]
[]
[]
[]
[]
[]
[]
[]
[null,null,null,null,{"$f":"IF(ISERROR(INDIRECT(CONCATENATE($B253,\"!M18\"))),\"\",INDIRECT(CONCATENATE($B253,\"!M18\")))","v":""},{"$f":"IF(ISERROR(INDIRECT(CONCATENATE($B253,\"!M19\"))),\"\",INDIRECT(CONCATENATE($B253,\"!M19\")))","v":""},{"$f":"IF(ISERROR(INDIRECT(CONCATENATE($B253,\"!M20\"))),\"\",INDIRECT(CONCATENATE($B253,\"!M20\")))","v":""},{"$f":"IF(ISERROR(INDIRECT(CONCATENATE($B253,\"!M21\"))),\"\",INDIRECT(CONCATENATE($B253,\"!M21\")))","v":""},null,{"$f":"IF(ISERROR(INDIRECT(CONCATENATE($B253,\"!N18\"))),\"\",INDIRECT(CONCATENATE($B253,\"!N18\")))","v":""},{"$f":"IF(ISERROR(INDIRECT(CONCATENATE($B253,\"!N19\"))),\"\",INDIRECT(CONCATENATE($B253,\"!N19\")))","v":""},{"$f":"IF(ISERROR(INDIRECT(CONCATENATE($B253,\"!N20\"))),\"\",INDIRECT(CONCATENATE($B253,\"!N20\")))","v":""},{"$f":"IF(ISERROR(INDIRECT(CONCATENATE($B253,\"!N21\"))),\"\",INDIRECT(CONCATENATE($B253,\"!N21\")))","v":""},null,{"$f":"IF(ISERROR(INDIRECT(CONCATENATE($B253,\"!O18\"))),\"\",INDIRECT(CONCATENATE($B253,\"!O18\")))","v":""},{"$f":"IF(ISERROR(INDIRECT(CONCATENATE($B253,\"!O19\"))),\"\",INDIRECT(CONCATENATE($B253,\"!O19\")))","v":""},{"$f":"IF(ISERROR(INDIRECT(CONCATENATE($B253,\"!O20\"))),\"\",INDIRECT(CONCATENATE($B253,\"!O20\")))","v":""},{"$f":"IF(ISERROR(INDIRECT(CONCATENATE($B253,\"!O21\"))),\"\",INDIRECT(CONCATENATE($B253,\"!O21\")))","v":""},null,{"$f":"IF(ISERROR(INDIRECT(CONCATENATE($B253,\"!P18\"))),\"\",INDIRECT(CONCATENATE($B253,\"!P18\")))","v":""},{"$f":"IF(ISERROR(INDIRECT(CONCATENATE($B253,\"!P19\"))),\"\",INDIRECT(CONCATENATE($B253,\"!P19\")))","v":""},{"$f":"IF(ISERROR(INDIRECT(CONCATENATE($B253,\"!P20\"))),\"\",INDIRECT(CONCATENATE($B253,\"!P20\")))","v":""},{"$f":"IF(ISERROR(INDIRECT(CONCATENATE($B253,\"!P21\"))),\"\",INDIRECT(CONCATENATE($B253,\"!P21\")))","v":""},null,{"$f":"IF(ISERROR(INDIRECT(CONCATENATE($B253,\"!Q18\"))),\"\",INDIRECT(CONCATENATE($B253,\"!Q18\")))","v":""},{"$f":"IF(ISERROR(INDIRECT(CONCATENATE($B253,\"!Q19\"))),\"\",INDIRECT(CONCATENATE($B253,\"!Q19\")))","v":""},{"$f":"IF(ISERROR(INDIRECT(CONCATENATE($B253,\"!Q20\"))),\"\",INDIRECT(CONCATENATE($B253,\"!Q20\")))","v":""},{"$f":"IF(ISERROR(INDIRECT(CONCATENATE($B253,\"!Q21\"))),\"\",INDIRECT(CONCATENATE($B253,\"!Q1\")))","v":""}]
[null,null,null,null,{"$f":"IF(ISERROR(INDIRECT(CONCATENATE($B254,\"!M18\"))),\"\",INDIRECT(CONCATENATE($B254,\"!M18\")))","v":""},{"$f":"IF(ISERROR(INDIRECT(CONCATENATE($B254,\"!M19\"))),\"\",INDIRECT(CONCATENATE($B254,\"!M19\")))","v":""},{"$f":"IF(ISERROR(INDIRECT(CONCATENATE($B254,\"!M20\"))),\"\",INDIRECT(CONCATENATE($B254,\"!M20\")))","v":""},{"$f":"IF(ISERROR(INDIRECT(CONCATENATE($B254,\"!M21\"))),\"\",INDIRECT(CONCATENATE($B254,\"!M21\")))","v":""},null,{"$f":"IF(ISERROR(INDIRECT(CONCATENATE($B254,\"!N18\"))),\"\",INDIRECT(CONCATENATE($B254,\"!N18\")))","v":""},{"$f":"IF(ISERROR(INDIRECT(CONCATENATE($B254,\"!N19\"))),\"\",INDIRECT(CONCATENATE($B254,\"!N19\")))","v":""},{"$f":"IF(ISERROR(INDIRECT(CONCATENATE($B254,\"!N20\"))),\"\",INDIRECT(CONCATENATE($B254,\"!N20\")))","v":""},{"$f":"IF(ISERROR(INDIRECT(CONCATENATE($B254,\"!N21\"))),\"\",INDIRECT(CONCATENATE($B254,\"!N21\")))","v":""},null,{"$f":"IF(ISERROR(INDIRECT(CONCATENATE($B254,\"!O18\"))),\"\",INDIRECT(CONCATENATE($B254,\"!O18\")))","v":""},{"$f":"IF(ISERROR(INDIRECT(CONCATENATE($B254,\"!O19\"))),\"\",INDIRECT(CONCATENATE($B254,\"!O19\")))","v":""},{"$f":"IF(ISERROR(INDIRECT(CONCATENATE($B254,\"!O20\"))),\"\",INDIRECT(CONCATENATE($B254,\"!O20\")))","v":""},{"$f":"IF(ISERROR(INDIRECT(CONCATENATE($B254,\"!O21\"))),\"\",INDIRECT(CONCATENATE($B254,\"!O21\")))","v":""},null,{"$f":"IF(ISERROR(INDIRECT(CONCATENATE($B254,\"!P18\"))),\"\",INDIRECT(CONCATENATE($B254,\"!P18\")))","v":""},{"$f":"IF(ISERROR(INDIRECT(CONCATENATE($B254,\"!P19\"))),\"\",INDIRECT(CONCATENATE($B254,\"!P19\")))","v":""},{"$f":"IF(ISERROR(INDIRECT(CONCATENATE($B254,\"!P20\"))),\"\",INDIRECT(CONCATENATE($B254,\"!P20\")))","v":""},{"$f":"IF(ISERROR(INDIRECT(CONCATENATE($B254,\"!P21\"))),\"\",INDIRECT(CONCATENATE($B254,\"!P21\")))","v":""},null,{"$f":"IF(ISERROR(INDIRECT(CONCATENATE($B254,\"!Q18\"))),\"\",INDIRECT(CONCATENATE($B254,\"!Q18\")))","v":""},{"$f":"IF(ISERROR(INDIRECT(CONCATENATE($B254,\"!Q19\"))),\"\",INDIRECT(CONCATENATE($B254,\"!Q19\")))","v":""},{"$f":"IF(ISERROR(INDIRECT(CONCATENATE($B254,\"!Q20\"))),\"\",INDIRECT(CONCATENATE($B254,\"!Q20\")))","v":""},{"$f":"IF(ISERROR(INDIRECT(CONCATENATE($B254,\"!Q21\"))),\"\",INDIRECT(CONCATENATE($B254,\"!Q1\")))","v":""}]
[null,null,null,null,{"$f":"IF(ISERROR(INDIRECT(CONCATENATE($B255,\"!M18\"))),\"\",INDIRECT(CONCATENATE($B255,\"!M18\")))","v":""},{"$f":"IF(ISERROR(INDIRECT(CONCATENATE($B255,\"!M19\"))),\"\",INDIRECT(CONCATENATE($B255,\"!M19\")))","v":""},{"$f":"IF(ISERROR(INDIRECT(CONCATENATE($B255,\"!M20\"))),\"\",INDIRECT(CONCATENATE($B255,\"!M20\")))","v":""},{"$f":"IF(ISERROR(INDIRECT(CONCATENATE($B255,\"!M21\"))),\"\",INDIRECT(CONCATENATE($B255,\"!M21\")))","v":""},null,{"$f":"IF(ISERROR(INDIRECT(CONCATENATE($B255,\"!N18\"))),\"\",INDIRECT(CONCATENATE($B255,\"!N18\")))","v":""},{"$f":"IF(ISERROR(INDIRECT(CONCATENATE($B255,\"!N19\"))),\"\",INDIRECT(CONCATENATE($B255,\"!N19\")))","v":""},{"$f":"IF(ISERROR(INDIRECT(CONCATENATE($B255,\"!N20\"))),\"\",INDIRECT(CONCATENATE($B255,\"!N20\")))","v":""},{"$f":"IF(ISERROR(INDIRECT(CONCATENATE($B255,\"!N21\"))),\"\",INDIRECT(CONCATENATE($B255,\"!N21\")))","v":""},null,{"$f":"IF(ISERROR(INDIRECT(CONCATENATE($B255,\"!O18\"))),\"\",INDIRECT(CONCATENATE($B255,\"!O18\")))","v":""},{"$f":"IF(ISERROR(INDIRECT(CONCATENATE($B255,\"!O19\"))),\"\",INDIRECT(CONCATENATE($B255,\"!O19\")))","v":""},{"$f":"IF(ISERROR(INDIRECT(CONCATENATE($B255,\"!O20\"))),\"\",INDIRECT(CONCATENATE($B255,\"!O20\")))","v":""},{"$f":"IF(ISERROR(INDIRECT(CONCATENATE($B255,\"!O21\"))),\"\",INDIRECT(CONCATENATE($B255,\"!O21\")))","v":""},null,{"$f":"IF(ISERROR(INDIRECT(CONCATENATE($B255,\"!P18\"))),\"\",INDIRECT(CONCATENATE($B255,\"!P18\")))","v":""},{"$f":"IF(ISERROR(INDIRECT(CONCATENATE($B255,\"!P19\"))),\"\",INDIRECT(CONCATENATE($B255,\"!P19\")))","v":""},{"$f":"IF(ISERROR(INDIRECT(CONCATENATE($B255,\"!P20\"))),\"\",INDIRECT(CONCATENATE($B255,\"!P20\")))","v":""},{"$f":"IF(ISERROR(INDIRECT(CONCATENATE($B255,\"!P21\"))),\"\",INDIRECT(CONCATENATE($B255,\"!P21\")))","v":""},null,{"$f":"IF(ISERROR(INDIRECT(CONCATENATE($B255,\"!Q18\"))),\"\",INDIRECT(CONCATENATE($B255,\"!Q18\")))","v":""},{"$f":"IF(ISERROR(INDIRECT(CONCATENATE($B255,\"!Q19\"))),\"\",INDIRECT(CONCATENATE($B255,\"!Q19\")))","v":""},{"$f":"IF(ISERROR(INDIRECT(CONCATENATE($B255,\"!Q20\"))),\"\",INDIRECT(CONCATENATE($B255,\"!Q20\")))","v":""},{"$f":"IF(ISERROR(INDIRECT(CONCATENATE($B255,\"!Q21\"))),\"\",INDIRECT(CONCATENATE($B255,\"!Q1\")))","v":""}]
[null,null,null,null,{"$f":"IF(ISERROR(INDIRECT(CONCATENATE($B256,\"!M18\"))),\"\",INDIRECT(CONCATENATE($B256,\"!M18\")))","v":""},{"$f":"IF(ISERROR(INDIRECT(CONCATENATE($B256,\"!M19\"))),\"\",INDIRECT(CONCATENATE($B256,\"!M19\")))","v":""},{"$f":"IF(ISERROR(INDIRECT(CONCATENATE($B256,\"!M20\"))),\"\",INDIRECT(CONCATENATE($B256,\"!M20\")))","v":""},{"$f":"IF(ISERROR(INDIRECT(CONCATENATE($B256,\"!M21\"))),\"\",INDIRECT(CONCATENATE($B256,\"!M21\")))","v":""},null,{"$f":"IF(ISERROR(INDIRECT(CONCATENATE($B256,\"!N18\"))),\"\",INDIRECT(CONCATENATE($B256,\"!N18\")))","v":""},{"$f":"IF(ISERROR(INDIRECT(CONCATENATE($B256,\"!N19\"))),\"\",INDIRECT(CONCATENATE($B256,\"!N19\")))","v":""},{"$f":"IF(ISERROR(INDIRECT(CONCATENATE($B256,\"!N20\"))),\"\",INDIRECT(CONCATENATE($B256,\"!N20\")))","v":""},{"$f":"IF(ISERROR(INDIRECT(CONCATENATE($B256,\"!N21\"))),\"\",INDIRECT(CONCATENATE($B256,\"!N21\")))","v":""},null,{"$f":"IF(ISERROR(INDIRECT(CONCATENATE($B256,\"!O18\"))),\"\",INDIRECT(CONCATENATE($B256,\"!O18\")))","v":""},{"$f":"IF(ISERROR(INDIRECT(CONCATENATE($B256,\"!O19\"))),\"\",INDIRECT(CONCATENATE($B256,\"!O19\")))","v":""},{"$f":"IF(ISERROR(INDIRECT(CONCATENATE($B256,\"!O20\"))),\"\",INDIRECT(CONCATENATE($B256,\"!O20\")))","v":""},{"$f":"IF(ISERROR(INDIRECT(CONCATENATE($B256,\"!O21\"))),\"\",INDIRECT(CONCATENATE($B256,\"!O21\")))","v":""},null,{"$f":"IF(ISERROR(INDIRECT(CONCATENATE($B256,\"!P18\"))),\"\",INDIRECT(CONCATENATE($B256,\"!P18\")))","v":""},{"$f":"IF(ISERROR(INDIRECT(CONCATENATE($B256,\"!P19\"))),\"\",INDIRECT(CONCATENATE($B256,\"!P19\")))","v":""},{"$f":"IF(ISERROR(INDIRECT(CONCATENATE($B256,\"!P20\"))),\"\",INDIRECT(CONCATENATE($B256,\"!P20\")))","v":""},{"$f":"IF(ISERROR(INDIRECT(CONCATENATE($B256,\"!P21\"))),\"\",INDIRECT(CONCATENATE($B256,\"!P21\")))","v":""},null,{"$f":"IF(ISERROR(INDIRECT(CONCATENATE($B256,\"!Q18\"))),\"\",INDIRECT(CONCATENATE($B256,\"!Q18\")))","v":""},{"$f":"IF(ISERROR(INDIRECT(CONCATENATE($B256,\"!Q19\"))),\"\",INDIRECT(CONCATENATE($B256,\"!Q19\")))","v":""},{"$f":"IF(ISERROR(INDIRECT(CONCATENATE($B256,\"!Q20\"))),\"\",INDIRECT(CONCATENATE($B256,\"!Q20\")))","v":""},{"$f":"IF(ISERROR(INDIRECT(CONCATENATE($B256,\"!Q21\"))),\"\",INDIRECT(CONCATENATE($B256,\"!Q1\")))","v":""}]
[null,null,null,null,{"$f":"IF(ISERROR(INDIRECT(CONCATENATE($B257,\"!M18\"))),\"\",INDIRECT(CONCATENATE($B257,\"!M18\")))","v":""},{"$f":"IF(ISERROR(INDIRECT(CONCATENATE($B257,\"!M19\"))),\"\",INDIRECT(CONCATENATE($B257,\"!M19\")))","v":""},{"$f":"IF(ISERROR(INDIRECT(CONCATENATE($B257,\"!M20\"))),\"\",INDIRECT(CONCATENATE($B257,\"!M20\")))","v":""},{"$f":"IF(ISERROR(INDIRECT(CONCATENATE($B257,\"!M21\"))),\"\",INDIRECT(CONCATENATE($B257,\"!M21\")))","v":""},null,{"$f":"IF(ISERROR(INDIRECT(CONCATENATE($B257,\"!N18\"))),\"\",INDIRECT(CONCATENATE($B257,\"!N18\")))","v":""},{"$f":"IF(ISERROR(INDIRECT(CONCATENATE($B257,\"!N19\"))),\"\",INDIRECT(CONCATENATE($B257,\"!N19\")))","v":""},{"$f":"IF(ISERROR(INDIRECT(CONCATENATE($B257,\"!N20\"))),\"\",INDIRECT(CONCATENATE($B257,\"!N20\")))","v":""},{"$f":"IF(ISERROR(INDIRECT(CONCATENATE($B257,\"!N21\"))),\"\",INDIRECT(CONCATENATE($B257,\"!N21\")))","v":""},null,{"$f":"IF(ISERROR(INDIRECT(CONCATENATE($B257,\"!O18\"))),\"\",INDIRECT(CONCATENATE($B257,\"!O18\")))","v":""},{"$f":"IF(ISERROR(INDIRECT(CONCATENATE($B257,\"!O19\"))),\"\",INDIRECT(CONCATENATE($B257,\"!O19\")))","v":""},{"$f":"IF(ISERROR(INDIRECT(CONCATENATE($B257,\"!O20\"))),\"\",INDIRECT(CONCATENATE($B257,\"!O20\")))","v":""},{"$f":"IF(ISERROR(INDIRECT(CONCATENATE($B257,\"!O21\"))),\"\",INDIRECT(CONCATENATE($B257,\"!O21\")))","v":""},null,{"$f":"IF(ISERROR(INDIRECT(CONCATENATE($B257,\"!P18\"))),\"\",INDIRECT(CONCATENATE($B257,\"!P18\")))","v":""},{"$f":"IF(ISERROR(INDIRECT(CONCATENATE($B257,\"!P19\"))),\"\",INDIRECT(CONCATENATE($B257,\"!P19\")))","v":""},{"$f":"IF(ISERROR(INDIRECT(CONCATENATE($B257,\"!P20\"))),\"\",INDIRECT(CONCATENATE($B257,\"!P20\")))","v":""},{"$f":"IF(ISERROR(INDIRECT(CONCATENATE($B257,\"!P21\"))),\"\",INDIRECT(CONCATENATE($B257,\"!P21\")))","v":""},null,{"$f":"IF(ISERROR(INDIRECT(CONCATENATE($B257,\"!Q18\"))),\"\",INDIRECT(CONCATENATE($B257,\"!Q18\")))","v":""},{"$f":"IF(ISERROR(INDIRECT(CONCATENATE($B257,\"!Q19\"))),\"\",INDIRECT(CONCATENATE($B257,\"!Q19\")))","v":""},{"$f":"IF(ISERROR(INDIRECT(CONCATENATE($B257,\"!Q20\"))),\"\",INDIRECT(CONCATENATE($B257,\"!Q20\")))","v":""},{"$f":"IF(ISERROR(INDIRECT(CONCATENATE($B257,\"!Q21\"))),\"\",INDIRECT(CONCATENATE($B257,\"!Q1\")))","v":""}]
[]
[]
[]
[]
[]
[]
[]
[]
[]
[]
[]
[]
[]
[]
[]
[]
[]
[]
[]
[]
[]
[]
[]
[]
[]
[]
[]
[]
[]
[]
[]
[]
[]
[]
[]
[]
[]
[]
[]
["RURAL",null,null,"Poorest",null,null,null,null,"Poor",null,null,null,null,"Middle",null,null,null,null,"Rich",null,null,null,null,"Richest"]
[null,null,null,"Improved","Basic","Limited","Unimproved","Surface water","Improved","Basic","Limited","Unimproved","Surface water","Improved","Basic","Limited","Unimproved","Surface water","Improved","Basic","Limited","Unimproved","Surface water","Improved","Basic","Limited","Unimproved","Surface water"]
["Forecast period:",null,2010,{"$f":"IF((D301+H301)>100,D301*100/(D301+H301),D301)","v":84.717593663554482},{"$f":"D299*AVERAGEIF(E305:E316,\">0\")/100","v":80.730945523661745},{"$f":"D299*(100-AVERAGEIF(E305:E316,\">0\"))/100","v":3.9866481398927442},{"$f":"100-(E299+F299+H299)","v":12.885609143828191},{"$f":"IF((D301+H301)>100,H301*100/(D301+H301),H301)","v":2.3967971926173166},{"$f":"IF((I301+M301)>100,I301*100/(I301+M301),I301)","v":87.359743095513494},{"$f":"I299*AVERAGEIF(J305:J316,\">0\")/100","v":84.854045252343383},{"$f":"I299*(100-AVERAGEIF(J305:J316,\">0\"))/100","v":2.5056978431701049},{"$f":"100-(J299+K299+M299)","v":10.154468874114556},{"$f":"IF((I301+M301)>100,M301*100/(I301+M301),M301)","v":2.4857880303719551},{"$f":"IF((N301+R301)>100,N301*100/(N301+R301),N301)","v":94.137965969599307},{"$f":"N299*AVERAGEIF(O305:O316,\">0\")/100","v":92.143012568095571},{"$f":"N299*(100-AVERAGEIF(O305:O316,\">0\"))/100","v":1.9949534015037376},{"$f":"100-(O299+P299+R299)","v":4.8628665017988055},{"$f":"IF((N301+R301)>100,R301*100/(N301+R301),R301)","v":0.99916752860188063},{"$f":"IF((S301+W301)>100,S301*100/(S301+W301),S301)","v":95.491582140486486},{"$f":"S299*AVERAGEIF(T305:T316,\">0\")/100","v":93.640663248005296},{"$f":"S299*(100-AVERAGEIF(T305:T316,\">0\"))/100","v":1.8509188924811926},{"$f":"100-(T299+U299+W299)","v":3.0148931028699479},{"$f":"IF((S301+W301)>100,W301*100/(S301+W301),W301)","v":1.4935247566435708},{"$f":"IF((X301+AB301)>100,X301*100/(X301+AB301),X301)","v":97.046817753374881},{"$f":"X299*AVERAGEIF(Y305:Y316,\">0\")/100","v":95.974927704374409},{"$f":"X299*(100-AVERAGEIF(Y305:Y316,\">0\"))/100","v":1.071890049000477},{"$f":"100-(Y299+Z299+AB299)","v":1.9922727629593453},{"$f":"IF((X301+AB301)>100,AB301*100/(X301+AB301),AB301)","v":0.96090948366577333}]
[null,null,2018,{"$f":"IF((D302+H302)>100,D302*100/(D302+H302),D302)","v":84.717593663554482},{"$f":"D300*AVERAGEIF(E305:E316,\">0\")/100","v":80.730945523661745},{"$f":"D300*(100-AVERAGEIF(E305:E316,\">0\"))/100","v":3.9866481398927442},{"$f":"100-(E300+F300+H300)","v":12.885609143828191},{"$f":"IF((D302+H302)>100,H302*100/(D302+H302),H302)","v":2.3967971926173166},{"$f":"IF((I302+M302)>100,I302*100/(I302+M302),I302)","v":87.359743095513494},{"$f":"I300*AVERAGEIF(J305:J316,\">0\")/100","v":84.854045252343383},{"$f":"I300*(100-AVERAGEIF(J305:J316,\">0\"))/100","v":2.5056978431701049},{"$f":"100-(J300+K300+M300)","v":10.154468874114556},{"$f":"IF((I302+M302)>100,M302*100/(I302+M302),M302)","v":2.4857880303719551},{"$f":"IF((N302+R302)>100,N302*100/(N302+R302),N302)","v":94.137965969599307},{"$f":"N300*AVERAGEIF(O305:O316,\">0\")/100","v":92.143012568095571},{"$f":"N300*(100-AVERAGEIF(O305:O316,\">0\"))/100","v":1.9949534015037376},{"$f":"100-(O300+P300+R300)","v":4.8628665017988055},{"$f":"IF((N302+R302)>100,R302*100/(N302+R302),R302)","v":0.99916752860188063},{"$f":"IF((S302+W302)>100,S302*100/(S302+W302),S302)","v":95.491582140486486},{"$f":"S300*AVERAGEIF(T305:T316,\">0\")/100","v":93.640663248005296},{"$f":"S300*(100-AVERAGEIF(T305:T316,\">0\"))/100","v":1.8509188924811926},{"$f":"100-(T300+U300+W300)","v":3.0148931028699479},{"$f":"IF((S302+W302)>100,W302*100/(S302+W302),W302)","v":1.4935247566435708},{"$f":"IF((X302+AB302)>100,X302*100/(X302+AB302),X302)","v":97.046817753374881},{"$f":"X300*AVERAGEIF(Y305:Y316,\">0\")/100","v":95.974927704374409},{"$f":"X300*(100-AVERAGEIF(Y305:Y316,\">0\"))/100","v":1.071890049000477},{"$f":"100-(Y300+Z300+AB300)","v":1.9922727629593453},{"$f":"IF((X302+AB302)>100,AB302*100/(X302+AB302),AB302)","v":0.96090948366577333}]
["Regression period:",null,{"$f":"MinRegYear(C299,C305:C316)","v":2012},{"$f":"IF(MAX(C305:C316)-MIN(C305:C316)<5,AVERAGEIF(C305:C316,\">0\",D305:D316),\nIF(FORECAST($C301,D$305:D$316,$C$305:$C$316)<0,0,\nIF(FORECAST($C301,D$305:D$316,$C$305:$C$316)>100,100,\nFORECAST($C301,D$305:D$316,$C$305:$C$316))))","v":84.717593663554482},null,null,null,{"$f":"IF(MAX(C305:C316)-MIN(C305:C316)<5,AVERAGEIF(C305:C316,\">0\",H305:H316),\nIF(FORECAST($C301,H$305:H$316,$C$305:$C$316)<0,0,\nIF(FORECAST($C301,H$305:H$316,$C$305:$C$316)>100,100,\nFORECAST($C301,H$305:H$316,$C$305:$C$316))))","v":2.3967971926173166},{"$f":"IF(MAX(C305:C316)-MIN(C305:C316)<5,AVERAGEIF(C305:C316,\">0\",I305:I316),\nIF(FORECAST($C301,I$305:I$316,$C$305:$C$316)<0,0,\nIF(FORECAST($C301,I$305:I$316,$C$305:$C$316)>100,100,\nFORECAST($C301,I$305:I$316,$C$305:$C$316))))","v":87.359743095513494},null,null,null,{"$f":"IF(MAX(C305:C316)-MIN(C305:C316)<5,AVERAGEIF(C305:C316,\">0\",M305:M316),\nIF(FORECAST($C301,M$305:M$316,$C$305:$C$316)<0,0,\nIF(FORECAST($C301,M$305:M$316,$C$305:$C$316)>100,100,\nFORECAST($C301,M$305:M$316,$C$305:$C$316))))","v":2.4857880303719551},{"$f":"IF(MAX(C305:C316)-MIN(C305:C316)<5,AVERAGEIF(C305:C316,\">0\",N305:N316),\nIF(FORECAST($C301,N$305:N$316,$C$305:$C$316)<0,0,\nIF(FORECAST($C301,N$305:N$316,$C$305:$C$316)>100,100,\nFORECAST($C301,N$305:N$316,$C$305:$C$316))))","v":94.137965969599307},null,null,null,{"$f":"IF(MAX(C305:C316)-MIN(C305:C316)<5,AVERAGEIF(C305:C316,\">0\",R305:R316),\nIF(FORECAST($C301,R$305:R$316,$C$305:$C$316)<0,0,\nIF(FORECAST($C301,R$305:R$316,$C$305:$C$316)>100,100,\nFORECAST($C301,R$305:R$316,$C$305:$C$316))))","v":0.99916752860188063},{"$f":"IF(MAX(C305:C316)-MIN(C305:C316)<5,AVERAGEIF(C305:C316,\">0\",S305:S316),\nIF(FORECAST($C301,S$305:S$316,$C$305:$C$316)<0,0,\nIF(FORECAST($C301,S$305:S$316,$C$305:$C$316)>100,100,\nFORECAST($C301,S$305:S$316,$C$305:$C$316))))","v":95.491582140486486},null,null,null,{"$f":"IF(MAX(C305:C316)-MIN(C305:C316)<5,AVERAGEIF(C305:C316,\">0\",W305:W316),\nIF(FORECAST($C301,W$305:W$316,$C$305:$C$316)<0,0,\nIF(FORECAST($C301,W$305:W$316,$C$305:$C$316)>100,100,\nFORECAST($C301,W$305:W$316,$C$305:$C$316))))","v":1.4935247566435708},{"$f":"IF(MAX(C305:C316)-MIN(C305:C316)<5,AVERAGEIF(C305:C316,\">0\",X305:X316),\nIF(FORECAST($C301,X$305:X$316,$C$305:$C$316)<0,0,\nIF(FORECAST($C301,X$305:X$316,$C$305:$C$316)>100,100,\nFORECAST($C301,X$305:X$316,$C$305:$C$316))))","v":97.046817753374881},null,null,null,{"$f":"IF(MAX(C305:C316)-MIN(C305:C316)<5,AVERAGEIF(C305:C316,\">0\",AB305:AB316),\nIF(FORECAST($C301,AB$305:AB$316,$C$305:$C$316)<0,0,\nIF(FORECAST($C301,AB$305:AB$316,$C$305:$C$316)>100,100,\nFORECAST($C301,AB$305:AB$316,$C$305:$C$316))))","v":0.96090948366577333}]
[null,null,{"$f":"MaxRegYear(C300,C305:C316)","v":2016},{"$f":"IF(MAX(C305:C316)-MIN(C305:C316)<5,AVERAGEIF(C305:C316,\">0\",D305:D316),\nIF(FORECAST($C302,D$305:D$316,$C$305:$C$316)<0,0,\nIF(FORECAST($C302,D$305:D$316,$C$305:$C$316)>100,100,\nFORECAST($C302,D$305:D$316,$C$305:$C$316))))","v":84.717593663554482},null,null,null,{"$f":"IF(MAX(C305:C316)-MIN(C305:C316)<5,AVERAGEIF(C305:C316,\">0\",H305:H316),\nIF(FORECAST($C302,H$305:H$316,$C$305:$C$316)<0,0,\nIF(FORECAST($C302,H$305:H$316,$C$305:$C$316)>100,100,\nFORECAST($C302,H$305:H$316,$C$305:$C$316))))","v":2.3967971926173166},{"$f":"IF(MAX(C305:C316)-MIN(C305:C316)<5,AVERAGEIF(C305:C316,\">0\",I305:I316),\nIF(FORECAST($C302,I$305:I$316,$C$305:$C$316)<0,0,\nIF(FORECAST($C302,I$305:I$316,$C$305:$C$316)>100,100,\nFORECAST($C302,I$305:I$316,$C$305:$C$316))))","v":87.359743095513494},null,null,null,{"$f":"IF(MAX(C305:C316)-MIN(C305:C316)<5,AVERAGEIF(C305:C316,\">0\",M305:M316),\nIF(FORECAST($C302,M$305:M$316,$C$305:$C$316)<0,0,\nIF(FORECAST($C302,M$305:M$316,$C$305:$C$316)>100,100,\nFORECAST($C302,M$305:M$316,$C$305:$C$316))))","v":2.4857880303719551},{"$f":"IF(MAX(C305:C316)-MIN(C305:C316)<5,AVERAGEIF(C305:C316,\">0\",N305:N316),\nIF(FORECAST($C302,N$305:N$316,$C$305:$C$316)<0,0,\nIF(FORECAST($C302,N$305:N$316,$C$305:$C$316)>100,100,\nFORECAST($C302,N$305:N$316,$C$305:$C$316))))","v":94.137965969599307},null,null,null,{"$f":"IF(MAX(C305:C316)-MIN(C305:C316)<5,AVERAGEIF(C305:C316,\">0\",R305:R316),\nIF(FORECAST($C302,R$305:R$316,$C$305:$C$316)<0,0,\nIF(FORECAST($C302,R$305:R$316,$C$305:$C$316)>100,100,\nFORECAST($C302,R$305:R$316,$C$305:$C$316))))","v":0.99916752860188063},{"$f":"IF(MAX(C305:C316)-MIN(C305:C316)<5,AVERAGEIF(C305:C316,\">0\",S305:S316),\nIF(FORECAST($C302,S$305:S$316,$C$305:$C$316)<0,0,\nIF(FORECAST($C302,S$305:S$316,$C$305:$C$316)>100,100,\nFORECAST($C302,S$305:S$316,$C$305:$C$316))))","v":95.491582140486486},null,null,null,{"$f":"IF(MAX(C305:C316)-MIN(C305:C316)<5,AVERAGEIF(C305:C316,\">0\",W305:W316),\nIF(FORECAST($C302,W$305:W$316,$C$305:$C$316)<0,0,\nIF(FORECAST($C302,W$305:W$316,$C$305:$C$316)>100,100,\nFORECAST($C302,W$305:W$316,$C$305:$C$316))))","v":1.4935247566435708},{"$f":"IF(MAX(C305:C316)-MIN(C305:C316)<5,AVERAGEIF(C305:C316,\">0\",X305:X316),\nIF(FORECAST($C302,X$305:X$316,$C$305:$C$316)<0,0,\nIF(FORECAST($C302,X$305:X$316,$C$305:$C$316)>100,100,\nFORECAST($C302,X$305:X$316,$C$305:$C$316))))","v":97.046817753374881},null,null,null,{"$f":"IF(MAX(C305:C316)-MIN(C305:C316)<5,AVERAGEIF(C305:C316,\">0\",AB305:AB316),\nIF(FORECAST($C302,AB$305:AB$316,$C$305:$C$316)<0,0,\nIF(FORECAST($C302,AB$305:AB$316,$C$305:$C$316)>100,100,\nFORECAST($C302,AB$305:AB$316,$C$305:$C$316))))","v":0.96090948366577333}]
[]
[null,"Survey","Year","Improved","% Improved\n< = 30min",null,null,"Surface water","Improved","% Improved\n< = 30min",null,null,"Surface water","Improved","% Improved\n< = 30min",null,null,"Surface water","Improved","% Improved\n< = 30min",null,null,"Surface water","Improved","% Improved\n< = 30min",null,null,"Surface water"]
[null,"MICS14",2014,{"$f":"IF(ISERROR(INDIRECT(CONCATENATE($B305,\"!M16\"))),\"\",INDIRECT(CONCATENATE($B305,\"!M16\")))","v":84.717593663554482},{"$f":"IF(ISERROR(INDIRECT(CONCATENATE($B305,\"!M23\"))),\"\",INDIRECT(CONCATENATE($B305,\"!M23\")))","v":95.294191008628943},null,null,{"$f":"IF(ISERROR(INDIRECT(CONCATENATE($B305,\"!M21\"))),\"\",INDIRECT(CONCATENATE($B305,\"!M21\")))","v":2.3967971926173166},{"$f":"IF(ISERROR(INDIRECT(CONCATENATE($B305,\"!N16\"))),\"\",INDIRECT(CONCATENATE($B305,\"!N16\")))","v":87.359743095513494},{"$f":"IF(ISERROR(INDIRECT(CONCATENATE($B305,\"!N23\"))),\"\",INDIRECT(CONCATENATE($B305,\"!N23\")))","v":97.131747697070793},null,null,{"$f":"IF(ISERROR(INDIRECT(CONCATENATE($B305,\"!N21\"))),\"\",INDIRECT(CONCATENATE($B305,\"!N21\")))","v":2.4857880303719551},{"$f":"IF(ISERROR(INDIRECT(CONCATENATE($B305,\"!O16\"))),\"\",INDIRECT(CONCATENATE($B305,\"!O16\")))","v":94.137965969599307},{"$f":"IF(ISERROR(INDIRECT(CONCATENATE($B305,\"!O23\"))),\"\",INDIRECT(CONCATENATE($B305,\"!O23\")))","v":97.880819517443172},null,null,{"$f":"IF(ISERROR(INDIRECT(CONCATENATE($B305,\"!O21\"))),\"\",INDIRECT(CONCATENATE($B305,\"!O21\")))","v":0.99916752860188063},{"$f":"IF(ISERROR(INDIRECT(CONCATENATE($B305,\"!P16\"))),\"\",INDIRECT(CONCATENATE($B305,\"!P16\")))","v":95.491582140486486},{"$f":"IF(ISERROR(INDIRECT(CONCATENATE($B305,\"!P23\"))),\"\",INDIRECT(CONCATENATE($B305,\"!P23\")))","v":98.061694181840934},null,null,{"$f":"IF(ISERROR(INDIRECT(CONCATENATE($B305,\"!P21\"))),\"\",INDIRECT(CONCATENATE($B305,\"!P21\")))","v":1.4935247566435708},{"$f":"IF(ISERROR(INDIRECT(CONCATENATE($B305,\"!Q16\"))),\"\",INDIRECT(CONCATENATE($B305,\"!Q16\")))","v":97.046817753374881},{"$f":"IF(ISERROR(INDIRECT(CONCATENATE($B305,\"!Q23\"))),\"\",INDIRECT(CONCATENATE($B305,\"!Q23\")))","v":98.895491811257045},null,null,{"$f":"IF(ISERROR(INDIRECT(CONCATENATE($B305,\"!Q221\"))),\"\",INDIRECT(CONCATENATE($B305,\"!Q21\")))","v":0.96090948366577333}]
[null,null,null,"","",null,null,"","","",null,null,"","","",null,null,"","","",null,null,"","","",null,null,""]
[null,null,null,"","",null,null,"","","",null,null,"","","",null,null,"","","",null,null,"","","",null,null,""]
[null,null,null,"","",null,null,"","","",null,null,"","","",null,null,"","","",null,null,"","","",null,null,""]
[null,null,null,"","",null,null,"","","",null,null,"","","",null,null,"","","",null,null,"","","",null,null,""]
[null,null,null,"","",null,null,"","","",null,null,"","","",null,null,"","","",null,null,"","","",null,null,""]
[null,null,null,"","",null,null,"","","",null,null,"","","",null,null,"","","",null,null,"","","",null,null,""]
[null,null,null,"","",null,null,"","","",null,null,"","","",null,null,"","","",null,null,"","","",null,null,""]
[null,null,null,"","",null,null,"","","",null,null,"","","",null,null,"","","",null,null,"","","",null,null,""]
[null,null,null,"","",null,null,"","","",null,null,"","","",null,null,"","","",null,null,"","","",null,null,""]
[null,null,null,"","",null,null,"","","",null,null,"","","",null,null,"","","",null,null,"","","",null,null,""]
[null,null,null,"","",null,null,"","","",null,null,"","","",null,null,"","","",null,null,"","","",null,null,""]
[]
[null,{"$f":"CONCATENATE(\"Rural use of drinking water sources, \",C299,\"–\",C300)","v":"Rural use of drinking water sources, 2010–2018"},null,null,null,null,null,null,null,null,null,null,null,null,null,null,null,null,"Data points used for regression"]

{"sheet":"Sanitation","index":2,"n_rows":318,"n_cols":28,"rows_kept":318,"cut":false,"hidden":false,"merged":[[30,21,30,24],[4,1,4,24],[3,1,3,24],[6,1,6,8],[6,9,6,16],[6,17,6,24],[30,1,31,4],[30,5,30,8],[30,9,30,12],[30,13,30,16],[30,17,30,20],[96,23,96,27],[32,1,33,2],[32,3,33,3],[35,1,36,2],[35,3,36,3],[38,1,39,2],[38,3,39,3],[96,0,97,2],[96,3,96,7],[96,8,96,12],[96,13,96,17],[96,18,96,22],[98,0,99,1],[100,0,101,1],[117,18,117,22],[196,0,197,2],[196,3,196,7],[196,8,196,12],[196,13,196,17],[196,18,196,22],[117,1,117,11],[298,0,299,1],[300,0,301,1],[317,18,317,22],[196,23,196,27],[198,0,199,1],[200,0,201,1],[217,18,217,22],[296,0,297,2],[296,3,296,7],[296,8,296,12],[296,13,296,17],[296,18,296,22],[296,23,296,27],[217,1,217,11],[317,1,317,11]]}
[]
[]
[]
[null,"Summary of trends in use of sanitation facilities by wealth quintile (%)"]
[null,{"$f":"IF(ISERROR(INDIRECT(CONCATENATE($B105,\"!A2\"))),\"\",INDIRECT(CONCATENATE($B105,\"!A2\")))","v":"El Salvador"}]
[]
[null,{"$f":"B118","v":"National use of sanitation facilities, 2010–2018"},null,null,null,null,null,null,null,{"$f":"B218","v":"Urban use of sanitation facilities, 2010–2018"},null,null,null,null,null,null,null,{"$f":"B318","v":"Rural use of sanitation facilities, 2010–2018"}]
[]
[]
[]
[]
[]
[]
[]
[]
[]
[]
[]
[]
[]
[]
[]
[]
[]
[]
[]
[]
[]
[]
[]
[null,{"$f":"IF(ISERROR(INDIRECT(CONCATENATE($B105,\"!A2\"))),\"\",INDIRECT(CONCATENATE($B105,\"!A2\")))","v":"El Salvador"},null,null,null,"Poorest",null,null,null,"Poor",null,null,null,"Middle",null,null,null,"Rich",null,null,null,"Richest"]
[null,null,null,null,null,"Basic","Limited","Unimproved","Open defecation","Basic","Limited","Unimproved","Open defecation","Basic","Limited","Unimproved","Open defecation","Basic","Limited","Unimproved","Open defecation","Basic","Limited","Unimproved","Open defecation"]
[null,"NATIONAL",null,"Estimate",{"$f":"C99","v":2010},{"$f":"E99","v":65.309108633923557},{"$f":"F99","v":22.843801278627094},2.4921562817344523,9.3549338057148965,{"$f":"J99","v":81.167905445136967},{"$f":"K99","v":15.731239266295251},1.4900538899109961,1.6108013986567888,{"$f":"O99","v":87.45858083051435},{"$f":"P99","v":11.441237817274111},0.65452841418901642,0.44565293802251782,{"$f":"T99","v":94.199274154289967},{"$f":"U99","v":5.0405443999747161},0.62747388929027181,0.13270755644504512,{"$f":"Y99","v":97.731015086245819},{"$f":"Z99","v":2.0683997520464157},0.18719058213535789,1.3394579572405776E-2]
[null,null,null,null,{"$f":"C100","v":2018},{"$f":"E100","v":65.309108633923557},22.843801278627094,2.4921562817344523,9.3549338057148965,{"$f":"J100","v":81.167905445136967},15.731239266295251,1.4900538899109961,1.6108013986567888,{"$f":"O100","v":87.45858083051435},11.441237817274111,0.65452841418901642,0.44565293802251782,{"$f":"T100","v":94.199274154289967},5.0405443999747161,0.62747388929027181,0.13270755644504512,{"$f":"Y100","v":97.731015086245819},2.0683997520464157,0.18719058213535789,1.3394579572405776E-2]
[]
[null,"URBAN",null,"Estimate",{"$f":"C199","v":2010},{"$f":"E199","v":75.007139726390619},{"$f":"F199","v":21.777433477437334},2.1586741796654962,1.0567526165065388,{"$f":"J199","v":85.878437927987946},{"$f":"K199","v":13.337939722494133},0.56981287216358112,0.21380947735435057,{"$f":"O199","v":93.698220604378491},{"$f":"P199","v":5.8311805239990244},0.47059887162248515,0,{"$f":"T199","v":96.618455048208375},{"$f":"U199","v":3.2276715136450762},0.15387343814654741,0,{"$f":"Y199","v":98.035635213403197},{"$f":"Z199","v":1.6784679609321389},0.28589682566466479,0]
[null,null,null,null,{"$f":"C200","v":2018},{"$f":"E200","v":75.007139726390619},21.777433477437334,2.1586741796654962,1.0567526165065388,{"$f":"J200","v":85.878437927987946},13.337939722494133,0.56981287216358112,0.21380947735435057,{"$f":"O200","v":93.698220604378491},5.8311805239990244,0.47059887162248515,0,{"$f":"T200","v":96.618455048208375},3.2276715136450762,0.15387343814654741,0,{"$f":"Y200","v":98.035635213403197},1.6784679609321389,0.28589682566466479,0]
[]
[null,"RURAL",null,"Estimate",{"$f":"C299","v":2010},{"$f":"E299","v":57.386067561061509},{"$f":"F299","v":24.944155360626215},2.6251430747987143,15.04463400351356,{"$f":"J299","v":71.536987807232379},{"$f":"K299","v":18.053854413523769},1.8113612046431626,8.5977965746006948,{"$f":"O299","v":81.257034639853003},{"$f":"P299","v":14.452794215180381},1.7680156500456405,2.5221554949209848,{"$f":"T299","v":86.827797010817008},{"$f":"U299","v":10.523281477196797},1.0368637002759726,1.6120578117102311,{"$f":"Y299","v":91.547873432144257},{"$f":"Z299","v":6.7572435290773285},1.1612621218636718,0.53362091691474367]
[null,null,null,null,{"$f":"C300","v":2018},{"$f":"E300","v":57.386067561061509},24.944155360626215,2.6251430747987143,15.04463400351356,{"$f":"J300","v":71.536987807232379},18.053854413523769,1.8113612046431626,8.5977965746006948,{"$f":"O300","v":81.257034639853003},14.452794215180381,1.7680156500456405,2.5221554949209848,{"$f":"T300","v":86.827797010817008},10.523281477196797,1.0368637002759726,1.6120578117102311,{"$f":"Y300","v":91.547873432144257},6.7572435290773285,1.1612621218636718,0.53362091691474367]
[]
[]
[]
[]
[]
[]
[]
[]
[]
[]
[]
[]
[]
[]
[]
[]
[]
[]
[]
[]
[]
[]
[]
[]
[]
[]
[]
[]
[]
[]
[]
[]
[]
[]
[]
[]
[]
[]
[]
[]
[]
[]
[]
[]
[]
[]
[]
[]
[]
[]
[]
[]
[]
[]
[]
[]
["NATIONAL",null,null,"Poorest",null,null,null,null,"Poor",null,null,null,null,"Middle",null,null,null,null,"Rich",null,null,null,null,"Richest"]
[null,null,null,"Improved","Basic","Limited","Unimproved","Open defecation","Improved","Basic","Limited","Unimproved","Open defecation","Improved","Basic","Limited","Unimproved","Open defecation","Improved","Basic","Limited","Unimproved","Open defecation","Improved","Basic","Limited","Unimproved","Open defecation"]
["Forecast period:",null,2010,{"$f":"IF((D101+H101)>100,D101*100/(D101+H101),D101)","v":88.152909912550641},{"$f":"D99*AVERAGEIF(E105:E116,\">0\")/100","v":65.309108633923557},{"$f":"D99*(100-AVERAGEIF(E105:E116,\">0\"))/100","v":22.843801278627094},{"$f":"100-(E99+F99+H99)","v":2.4921562817344523},{"$f":"IF((D101+H101)>100,H101*100/(D101+H101),H101)","v":9.3549338057148965},{"$f":"IF((I101+M101)>100,I101*100/(I101+M101),I101)","v":96.899144711432214},{"$f":"I99*AVERAGEIF(J105:J116,\">0\")/100","v":81.167905445136967},{"$f":"I99*(100-AVERAGEIF(J105:J116,\">0\"))/100","v":15.731239266295251},{"$f":"100-(J99+K99+M99)","v":1.4900538899109961},{"$f":"IF((I101+M101)>100,M101*100/(I101+M101),M101)","v":1.6108013986567888},{"$f":"IF((N101+R101)>100,N101*100/(N101+R101),N101)","v":98.89981864778845},{"$f":"N99*AVERAGEIF(O105:O116,\">0\")/100","v":87.45858083051435},{"$f":"N99*(100-AVERAGEIF(O105:O116,\">0\"))/100","v":11.441237817274111},{"$f":"100-(O99+P99+R99)","v":0.65452841418901642},{"$f":"IF((N101+R101)>100,R101*100/(N101+R101),R101)","v":0.44565293802251782},{"$f":"IF((S101+W101)>100,S101*100/(S101+W101),S101)","v":99.239818554264673},{"$f":"S99*AVERAGEIF(T105:T116,\">0\")/100","v":94.199274154289967},{"$f":"S99*(100-AVERAGEIF(T105:T116,\">0\"))/100","v":5.0405443999747161},{"$f":"100-(T99+U99+W99)","v":0.62747388929027181},{"$f":"IF((S101+W101)>100,W101*100/(S101+W101),W101)","v":0.13270755644504512},{"$f":"IF((X101+AB101)>100,X101*100/(X101+AB101),X101)","v":99.799414838292236},{"$f":"X99*AVERAGEIF(Y105:Y116,\">0\")/100","v":97.731015086245819},{"$f":"X99*(100-AVERAGEIF(Y105:Y116,\">0\"))/100","v":2.0683997520464157},{"$f":"100-(Y99+Z99+AB99)","v":0.18719058213535789},{"$f":"IF((X101+AB101)>100,AB101*100/(X101+AB101),AB101)","v":1.3394579572405776E-2}]
[null,null,2018,{"$f":"IF((D102+H102)>100,D102*100/(D102+H102),D102)","v":88.152909912550641},{"$f":"D100*AVERAGEIF(E105:E116,\">0\")/100","v":65.309108633923557},{"$f":"D100*(100-AVERAGEIF(E105:E116,\">0\"))/100","v":22.843801278627094},{"$f":"100-(E100+F100+H100)","v":2.4921562817344523},{"$f":"IF((D102+H102)>100,H102*100/(D102+H102),H102)","v":9.3549338057148965},{"$f":"IF((I102+M102)>100,I102*100/(I102+M102),I102)","v":96.899144711432214},{"$f":"I100*AVERAGEIF(J105:J116,\">0\")/100","v":81.167905445136967},{"$f":"I100*(100-AVERAGEIF(J105:J116,\">0\"))/100","v":15.731239266295251},{"$f":"100-(J100+K100+M100)","v":1.4900538899109961},{"$f":"IF((I102+M102)>100,M102*100/(I102+M102),M102)","v":1.6108013986567888},{"$f":"IF((N102+R102)>100,N102*100/(N102+R102),N102)","v":98.89981864778845},{"$f":"N100*AVERAGEIF(O105:O116,\">0\")/100","v":87.45858083051435},{"$f":"N100*(100-AVERAGEIF(O105:O116,\">0\"))/100","v":11.441237817274111},{"$f":"100-(O100+P100+R100)","v":0.65452841418901642},{"$f":"IF((N102+R102)>100,R102*100/(N102+R102),R102)","v":0.44565293802251782},{"$f":"IF((S102+W102)>100,S102*100/(S102+W102),S102)","v":99.239818554264673},{"$f":"S100*AVERAGEIF(T105:T116,\">0\")/100","v":94.199274154289967},{"$f":"S100*(100-AVERAGEIF(T105:T116,\">0\"))/100","v":5.0405443999747161},{"$f":"100-(T100+U100+W100)","v":0.62747388929027181},{"$f":"IF((S102+W102)>100,W102*100/(S102+W102),W102)","v":0.13270755644504512},{"$f":"IF((X102+AB102)>100,X102*100/(X102+AB102),X102)","v":99.799414838292236},{"$f":"X100*AVERAGEIF(Y105:Y116,\">0\")/100","v":97.731015086245819},{"$f":"X100*(100-AVERAGEIF(Y105:Y116,\">0\"))/100","v":2.0683997520464157},{"$f":"100-(Y100+Z100+AB100)","v":0.18719058213535789},{"$f":"IF((X102+AB102)>100,AB102*100/(X102+AB102),AB102)","v":1.3394579572405776E-2}]
["Regression period:",null,{"$f":"MinRegYear(C99,C105:C116)","v":2012},{"$f":"IF(MAX(C105:C116)-MIN(C105:C116)<5,AVERAGEIF(C105:C116,\">0\",D105:D116),\nIF(FORECAST($C101,D$105:D$116,$C$105:$C$116)<0,0,\nIF(FORECAST($C101,D$105:D$116,$C$105:$C$116)>100,100,\nFORECAST($C101,D$105:D$116,$C$105:$C$116))))","v":88.152909912550641},null,null,null,{"$f":"IF(MAX(C105:C116)-MIN(C105:C116)<5,AVERAGEIF(C105:C116,\">0\",H105:H116),\nIF(FORECAST($C101,H$105:H$116,$C$105:$C$116)<0,0,\nIF(FORECAST($C101,H$105:H$116,$C$105:$C$116)>100,100,\nFORECAST($C101,H$105:H$116,$C$105:$C$116))))","v":9.3549338057148965},{"$f":"IF(MAX(C105:C116)-MIN(C105:C116)<5,AVERAGEIF(C105:C116,\">0\",I105:I116),\nIF(FORECAST($C101,I$105:I$116,$C$105:$C$116)<0,0,\nIF(FORECAST($C101,I$105:I$116,$C$105:$C$116)>100,100,\nFORECAST($C101,I$105:I$116,$C$105:$C$116))))","v":96.899144711432214},null,null,null,{"$f":"IF(MAX(C105:C116)-MIN(C105:C116)<5,AVERAGEIF(C105:C116,\">0\",M105:M116),\nIF(FORECAST($C101,M$105:M$116,$C$105:$C$116)<0,0,\nIF(FORECAST($C101,M$105:M$116,$C$105:$C$116)>100,100,\nFORECAST($C101,M$105:M$116,$C$105:$C$116))))","v":1.6108013986567888},{"$f":"IF(MAX(C105:C116)-MIN(C105:C116)<5,AVERAGEIF(C105:C116,\">0\",N105:N116),\nIF(FORECAST($C101,N$105:N$116,$C$105:$C$116)<0,0,\nIF(FORECAST($C101,N$105:N$116,$C$105:$C$116)>100,100,\nFORECAST($C101,N$105:N$116,$C$105:$C$116))))","v":98.89981864778845},null,null,null,{"$f":"IF(MAX(C105:C116)-MIN(C105:C116)<5,AVERAGEIF(C105:C116,\">0\",R105:R116),\nIF(FORECAST($C101,R$105:R$116,$C$105:$C$116)<0,0,\nIF(FORECAST($C101,R$105:R$116,$C$105:$C$116)>100,100,\nFORECAST($C101,R$105:R$116,$C$105:$C$116))))","v":0.44565293802251782},{"$f":"IF(MAX(C105:C116)-MIN(C105:C116)<5,AVERAGEIF(C105:C116,\">0\",S105:S116),\nIF(FORECAST($C101,S$105:S$116,$C$105:$C$116)<0,0,\nIF(FORECAST($C101,S$105:S$116,$C$105:$C$116)>100,100,\nFORECAST($C101,S$105:S$116,$C$105:$C$116))))","v":99.239818554264673},null,null,null,{"$f":"IF(MAX(C105:C116)-MIN(C105:C116)<5,AVERAGEIF(C105:C116,\">0\",W105:W116),\nIF(FORECAST($C101,W$105:W$116,$C$105:$C$116)<0,0,\nIF(FORECAST($C101,W$105:W$116,$C$105:$C$116)>100,100,\nFORECAST($C101,W$105:W$116,$C$105:$C$116))))","v":0.13270755644504512},{"$f":"IF(MAX(C105:C116)-MIN(C105:C116)<5,AVERAGEIF(C105:C116,\">0\",X105:X116),\nIF(FORECAST($C101,X$105:X$116,$C$105:$C$116)<0,0,\nIF(FORECAST($C101,X$105:X$116,$C$105:$C$116)>100,100,\nFORECAST($C101,X$105:X$116,$C$105:$C$116))))","v":99.799414838292236},null,null,null,{"$f":"IF(MAX(C105:C116)-MIN(C105:C116)<5,AVERAGEIF(C105:C116,\">0\",AB105:AB116),\nIF(FORECAST($C101,AB$105:AB$116,$C$105:$C$116)<0,0,\nIF(FORECAST($C101,AB$105:AB$116,$C$105:$C$116)>100,100,\nFORECAST($C101,AB$105:AB$116,$C$105:$C$116))))","v":1.3394579572405776E-2}]
[null,null,{"$f":"MaxRegYear(C100,C105:C116)","v":2016},{"$f":"IF(MAX(C105:C116)-MIN(C105:C116)<5,AVERAGEIF(C105:C116,\">0\",D105:D116),\nIF(FORECAST($C102,D$105:D$116,$C$105:$C$116)<0,0,\nIF(FORECAST($C102,D$105:D$116,$C$105:$C$116)>100,100,\nFORECAST($C102,D$105:D$116,$C$105:$C$116))))","v":88.152909912550641},null,null,null,{"$f":"IF(MAX(C105:C116)-MIN(C105:C116)<5,AVERAGEIF(C105:C116,\">0\",H105:H116),\nIF(FORECAST($C102,H$105:H$116,$C$105:$C$116)<0,0,\nIF(FORECAST($C102,H$105:H$116,$C$105:$C$116)>100,100,\nFORECAST($C102,H$105:H$116,$C$105:$C$116))))","v":9.3549338057148965},{"$f":"IF(MAX(C105:C116)-MIN(C105:C116)<5,AVERAGEIF(C105:C116,\">0\",I105:I116),\nIF(FORECAST($C102,I$105:I$116,$C$105:$C$116)<0,0,\nIF(FORECAST($C102,I$105:I$116,$C$105:$C$116)>100,100,\nFORECAST($C102,I$105:I$116,$C$105:$C$116))))","v":96.899144711432214},null,null,null,{"$f":"IF(MAX(C105:C116)-MIN(C105:C116)<5,AVERAGEIF(C105:C116,\">0\",M105:M116),\nIF(FORECAST($C102,M$105:M$116,$C$105:$C$116)<0,0,\nIF(FORECAST($C102,M$105:M$116,$C$105:$C$116)>100,100,\nFORECAST($C102,M$105:M$116,$C$105:$C$116))))","v":1.6108013986567888},{"$f":"IF(MAX(C105:C116)-MIN(C105:C116)<5,AVERAGEIF(C105:C116,\">0\",N105:N116),\nIF(FORECAST($C102,N$105:N$116,$C$105:$C$116)<0,0,\nIF(FORECAST($C102,N$105:N$116,$C$105:$C$116)>100,100,\nFORECAST($C102,N$105:N$116,$C$105:$C$116))))","v":98.89981864778845},null,null,null,{"$f":"IF(MAX(C105:C116)-MIN(C105:C116)<5,AVERAGEIF(C105:C116,\">0\",R105:R116),\nIF(FORECAST($C102,R$105:R$116,$C$105:$C$116)<0,0,\nIF(FORECAST($C102,R$105:R$116,$C$105:$C$116)>100,100,\nFORECAST($C102,R$105:R$116,$C$105:$C$116))))","v":0.44565293802251782},{"$f":"IF(MAX(C105:C116)-MIN(C105:C116)<5,AVERAGEIF(C105:C116,\">0\",S105:S116),\nIF(FORECAST($C102,S$105:S$116,$C$105:$C$116)<0,0,\nIF(FORECAST($C102,S$105:S$116,$C$105:$C$116)>100,100,\nFORECAST($C102,S$105:S$116,$C$105:$C$116))))","v":99.239818554264673},null,null,null,{"$f":"IF(MAX(C105:C116)-MIN(C105:C116)<5,AVERAGEIF(C105:C116,\">0\",W105:W116),\nIF(FORECAST($C102,W$105:W$116,$C$105:$C$116)<0,0,\nIF(FORECAST($C102,W$105:W$116,$C$105:$C$116)>100,100,\nFORECAST($C102,W$105:W$116,$C$105:$C$116))))","v":0.13270755644504512},{"$f":"IF(MAX(C105:C116)-MIN(C105:C116)<5,AVERAGEIF(C105:C116,\">0\",X105:X116),\nIF(FORECAST($C102,X$105:X$116,$C$105:$C$116)<0,0,\nIF(FORECAST($C102,X$105:X$116,$C$105:$C$116)>100,100,\nFORECAST($C102,X$105:X$116,$C$105:$C$116))))","v":99.799414838292236},null,null,null,{"$f":"IF(MAX(C105:C116)-MIN(C105:C116)<5,AVERAGEIF(C105:C116,\">0\",AB105:AB116),\nIF(FORECAST($C102,AB$105:AB$116,$C$105:$C$116)<0,0,\nIF(FORECAST($C102,AB$105:AB$116,$C$105:$C$116)>100,100,\nFORECAST($C102,AB$105:AB$116,$C$105:$C$116))))","v":1.3394579572405776E-2}]
[]
[null,"Survey","Year","Improved","Not shared",null,null,"Open defecation","Improved","Not shared",null,null,"Open defecation","Improved","Not shared",null,null,"Open defecation","Improved","Not shared",null,null,"Open defecation","Improved","Not shared",null,null,"Open defecation"]
[null,"MICS14",2014,{"$f":"IF(ISERROR(INDIRECT(CONCATENATE($B105,\"!C122\"))),\"\",INDIRECT(CONCATENATE($B105,\"!C122\")))","v":88.152909912550641},{"$f":"IF(ISERROR(INDIRECT(CONCATENATE($B105,\"!C129\"))),\"\",INDIRECT(CONCATENATE($B105,\"!C129\")))","v":74.086163121230399},null,null,{"$f":"IF(ISERROR(INDIRECT(CONCATENATE($B105,\"!C127\"))),\"\",INDIRECT(CONCATENATE($B105,\"!C127\")))","v":9.3549338057148965},{"$f":"IF(ISERROR(INDIRECT(CONCATENATE($B105,\"!D122\"))),\"\",INDIRECT(CONCATENATE($B105,\"!D122\")))","v":96.899144711432214},{"$f":"IF(ISERROR(INDIRECT(CONCATENATE($B105,\"!D129\"))),\"\",INDIRECT(CONCATENATE($B105,\"!D129\")))","v":83.76534765797652},null,null,{"$f":"IF(ISERROR(INDIRECT(CONCATENATE($B105,\"!D127\"))),\"\",INDIRECT(CONCATENATE($B105,\"!D127\")))","v":1.6108013986567888},{"$f":"IF(ISERROR(INDIRECT(CONCATENATE($B105,\"!E122\"))),\"\",INDIRECT(CONCATENATE($B105,\"!E122\")))","v":98.89981864778845},{"$f":"IF(ISERROR(INDIRECT(CONCATENATE($B105,\"!E129\"))),\"\",INDIRECT(CONCATENATE($B105,\"!E129\")))","v":88.431487566200957},null,null,{"$f":"IF(ISERROR(INDIRECT(CONCATENATE($B105,\"!E127\"))),\"\",INDIRECT(CONCATENATE($B105,\"!E127\")))","v":0.44565293802251782},{"$f":"IF(ISERROR(INDIRECT(CONCATENATE($B105,\"!F122\"))),\"\",INDIRECT(CONCATENATE($B105,\"!F122\")))","v":99.239818554264673},{"$f":"IF(ISERROR(INDIRECT(CONCATENATE($B105,\"!F129\"))),\"\",INDIRECT(CONCATENATE($B105,\"!F129\")))","v":94.920844804629979},null,null,{"$f":"IF(ISERROR(INDIRECT(CONCATENATE($B105,\"!F127\"))),\"\",INDIRECT(CONCATENATE($B105,\"!F127\")))","v":0.13270755644504512},{"$f":"IF(ISERROR(INDIRECT(CONCATENATE($B105,\"!G122\"))),\"\",INDIRECT(CONCATENATE($B105,\"!G122\")))","v":99.799414838292236},{"$f":"IF(ISERROR(INDIRECT(CONCATENATE($B105,\"!G129\"))),\"\",INDIRECT(CONCATENATE($B105,\"!G129\")))","v":97.927443006155997},null,null,{"$f":"IF(ISERROR(INDIRECT(CONCATENATE($B105,\"!G2127\"))),\"\",INDIRECT(CONCATENATE($B105,\"!G127\")))","v":1.3394579572405776E-2}]
[null,null,null,"","",null,null,"","","",null,null,"","","",null,null,"","","",null,null,"","","",null,null,""]
[null,null,null,"","",null,null,"","","",null,null,"","","",null,null,"","","",null,null,"","","",null,null,""]
[null,null,null,"","",null,null,"","","",null,null,"","","",null,null,"","","",null,null,"","","",null,null,""]
[null,null,null,"","",null,null,"","","",null,null,"","","",null,null,"","","",null,null,"","","",null,null,""]
[null,null,null,"","",null,null,"","","",null,null,"","","",null,null,"","","",null,null,"","","",null,null,""]
[null,null,null,"","",null,null,"","","",null,null,"","","",null,null,"","","",null,null,"","","",null,null,""]
[null,null,null,"","",null,null,"","","",null,null,"","","",null,null,"","","",null,null,"","","",null,null,""]
[null,null,null,"","",null,null,"","","",null,null,"","","",null,null,"","","",null,null,"","","",null,null,""]
[null,null,null,"","",null,null,"","","",null,null,"","","",null,null,"","","",null,null,"","","",null,null,""]
[null,null,null,"","",null,null,"","","",null,null,"","","",null,null,"","","",null,null,"","","",null,null,""]
[null,null,null,"","",null,null,"","","",null,null,"","","",null,null,"","","",null,null,"","","",null,null,""]
[]
[null,{"$f":"CONCATENATE(\"National use of sanitation facilities, \",C99,\"–\",C100)","v":"National use of sanitation facilities, 2010–2018"},null,null,null,null,null,null,null,null,null,null,null,null,null,null,null,null,"Data points used for regression"]
[]
[]
[]
[]
[]
[]
[]
[]
[]
[]
[]
[]
[]
[]
[]
[]
[]
[]
[]
[]
[]
[]
[]
[]
[]
[]
[]
[]
[]
[]
[]
[]
[]
[]
[]
[]
[]
[]
[]
[]
[]
[]
[]
[]
[]
[]
[]
[]
[]
[]
[]
[]
[]
[]
[]
[]
[]
[]
[]
[]
[]
[]
[]
[]
[]
[]
[]
[]
[]
[]
[]
[]
[]
[]
[]
[]
[]
[]
["URBAN",null,null,"Poorest",null,null,null,null,"Poor",null,null,null,null,"Middle",null,null,null,null,"Rich",null,null,null,null,"Richest"]
[null,null,null,"Improved","Basic","Limited","Unimproved","Open defecation","Improved","Basic","Limited","Unimproved","Open defecation","Improved","Basic","Limited","Unimproved","Open defecation","Improved","Basic","Limited","Unimproved","Open defecation","Improved","Basic","Limited","Unimproved","Open defecation"]
["Forecast period:",null,{"$f":"MinBase(C205:C216)","v":2010},{"$f":"IF((D201+H201)>100,D201*100/(D201+H201),D201)","v":96.784573203827961},{"$f":"D199*AVERAGEIF(E205:E216,\">0\")/100","v":75.007139726390619},{"$f":"D199*(100-AVERAGEIF(E205:E216,\">0\"))/100","v":21.777433477437334},{"$f":"100-(E199+F199+H199)","v":2.1586741796654962},{"$f":"IF((D201+H201)>100,H201*100/(D201+H201),H201)","v":1.0567526165065388},{"$f":"IF((I201+M201)>100,I201*100/(I201+M201),I201)","v":99.216377650482073},{"$f":"I199*AVERAGEIF(J205:J216,\">0\")/100","v":85.878437927987946},{"$f":"I199*(100-AVERAGEIF(J205:J216,\">0\"))/100","v":13.337939722494133},{"$f":"100-(J199+K199+M199)","v":0.56981287216358112},{"$f":"IF((I201+M201)>100,M201*100/(I201+M201),M201)","v":0.21380947735435057},{"$f":"IF((N201+R201)>100,N201*100/(N201+R201),N201)","v":99.529401128377515},{"$f":"N199*AVERAGEIF(O205:O216,\">0\")/100","v":93.698220604378491},{"$f":"N199*(100-AVERAGEIF(O205:O216,\">0\"))/100","v":5.8311805239990244},{"$f":"100-(O199+P199+R199)","v":0.47059887162248515},{"$f":"IF((N201+R201)>100,R201*100/(N201+R201),R201)","v":0},{"$f":"IF((S201+W201)>100,S201*100/(S201+W201),S201)","v":99.846126561853453},{"$f":"S199*AVERAGEIF(T205:T216,\">0\")/100","v":96.618455048208375},{"$f":"S199*(100-AVERAGEIF(T205:T216,\">0\"))/100","v":3.2276715136450762},{"$f":"100-(T199+U199+W199)","v":0.15387343814654741},{"$f":"IF((S201+W201)>100,W201*100/(S201+W201),W201)","v":0},{"$f":"IF((X201+AB201)>100,X201*100/(X201+AB201),X201)","v":99.714103174335349},{"$f":"X199*AVERAGEIF(Y205:Y216,\">0\")/100","v":98.035635213403197},{"$f":"X199*(100-AVERAGEIF(Y205:Y216,\">0\"))/100","v":1.6784679609321389},{"$f":"100-(Y199+Z199+AB199)","v":0.28589682566466479},{"$f":"IF((X201+AB201)>100,AB201*100/(X201+AB201),AB201)","v":0}]
[null,null,{"$f":"MaxTarget(C205:C216)","v":2018},{"$f":"IF((D202+H202)>100,D202*100/(D202+H202),D202)","v":96.784573203827961},{"$f":"D200*AVERAGEIF(E205:E216,\">0\")/100","v":75.007139726390619},{"$f":"D200*(100-AVERAGEIF(E205:E216,\">0\"))/100","v":21.777433477437334},{"$f":"100-(E200+F200+H200)","v":2.1586741796654962},{"$f":"IF((D202+H202)>100,H202*100/(D202+H202),H202)","v":1.0567526165065388},{"$f":"IF((I202+M202)>100,I202*100/(I202+M202),I202)","v":99.216377650482073},{"$f":"I200*AVERAGEIF(J205:J216,\">0\")/100","v":85.878437927987946},{"$f":"I200*(100-AVERAGEIF(J205:J216,\">0\"))/100","v":13.337939722494133},{"$f":"100-(J200+K200+M200)","v":0.56981287216358112},{"$f":"IF((I202+M202)>100,M202*100/(I202+M202),M202)","v":0.21380947735435057},{"$f":"IF((N202+R202)>100,N202*100/(N202+R202),N202)","v":99.529401128377515},{"$f":"N200*AVERAGEIF(O205:O216,\">0\")/100","v":93.698220604378491},{"$f":"N200*(100-AVERAGEIF(O205:O216,\">0\"))/100","v":5.8311805239990244},{"$f":"100-(O200+P200+R200)","v":0.47059887162248515},{"$f":"IF((N202+R202)>100,R202*100/(N202+R202),R202)","v":0},{"$f":"IF((S202+W202)>100,S202*100/(S202+W202),S202)","v":99.846126561853453},{"$f":"S200*AVERAGEIF(T205:T216,\">0\")/100","v":96.618455048208375},{"$f":"S200*(100-AVERAGEIF(T205:T216,\">0\"))/100","v":3.2276715136450762},{"$f":"100-(T200+U200+W200)","v":0.15387343814654741},{"$f":"IF((S202+W202)>100,W202*100/(S202+W202),W202)","v":0},{"$f":"IF((X202+AB202)>100,X202*100/(X202+AB202),X202)","v":99.714103174335349},{"$f":"X200*AVERAGEIF(Y205:Y216,\">0\")/100","v":98.035635213403197},{"$f":"X200*(100-AVERAGEIF(Y205:Y216,\">0\"))/100","v":1.6784679609321389},{"$f":"100-(Y200+Z200+AB200)","v":0.28589682566466479},{"$f":"IF((X202+AB202)>100,AB202*100/(X202+AB202),AB202)","v":0}]
["Regression period:",null,{"$f":"MinRegYear(C199,C205:C216)","v":2012},{"$f":"IF(MAX(C205:C216)-MIN(C205:C216)<5,AVERAGEIF(C205:C216,\">0\",D205:D216),\nIF(FORECAST($C201,D$205:D$216,$C$205:$C$216)<0,0,\nIF(FORECAST($C201,D$205:D$216,$C$205:$C$216)>100,100,\nFORECAST($C201,D$205:D$216,$C$205:$C$216))))","v":96.784573203827961},null,null,null,{"$f":"IF(MAX(C205:C216)-MIN(C205:C216)<5,AVERAGEIF(C205:C216,\">0\",H205:H216),\nIF(FORECAST($C201,H$205:H$216,$C$205:$C$216)<0,0,\nIF(FORECAST($C201,H$205:H$216,$C$205:$C$216)>100,100,\nFORECAST($C201,H$205:H$216,$C$205:$C$216))))","v":1.0567526165065388},{"$f":"IF(MAX(C205:C216)-MIN(C205:C216)<5,AVERAGEIF(C205:C216,\">0\",I205:I216),\nIF(FORECAST($C201,I$205:I$216,$C$205:$C$216)<0,0,\nIF(FORECAST($C201,I$205:I$216,$C$205:$C$216)>100,100,\nFORECAST($C201,I$205:I$216,$C$205:$C$216))))","v":99.216377650482073},null,null,null,{"$f":"IF(MAX(C205:C216)-MIN(C205:C216)<5,AVERAGEIF(C205:C216,\">0\",M205:M216),\nIF(FORECAST($C201,M$205:M$216,$C$205:$C$216)<0,0,\nIF(FORECAST($C201,M$205:M$216,$C$205:$C$216)>100,100,\nFORECAST($C201,M$205:M$216,$C$205:$C$216))))","v":0.21380947735435057},{"$f":"IF(MAX(C205:C216)-MIN(C205:C216)<5,AVERAGEIF(C205:C216,\">0\",N205:N216),\nIF(FORECAST($C201,N$205:N$216,$C$205:$C$216)<0,0,\nIF(FORECAST($C201,N$205:N$216,$C$205:$C$216)>100,100,\nFORECAST($C201,N$205:N$216,$C$205:$C$216))))","v":99.529401128377515},null,null,null,{"$f":"IF(MAX(C205:C216)-MIN(C205:C216)<5,AVERAGEIF(C205:C216,\">0\",R205:R216),\nIF(FORECAST($C201,R$205:R$216,$C$205:$C$216)<0,0,\nIF(FORECAST($C201,R$205:R$216,$C$205:$C$216)>100,100,\nFORECAST($C201,R$205:R$216,$C$205:$C$216))))","v":0},{"$f":"IF(MAX(C205:C216)-MIN(C205:C216)<5,AVERAGEIF(C205:C216,\">0\",S205:S216),\nIF(FORECAST($C201,S$205:S$216,$C$205:$C$216)<0,0,\nIF(FORECAST($C201,S$205:S$216,$C$205:$C$216)>100,100,\nFORECAST($C201,S$205:S$216,$C$205:$C$216))))","v":99.846126561853453},null,null,null,{"$f":"IF(MAX(C205:C216)-MIN(C205:C216)<5,AVERAGEIF(C205:C216,\">0\",W205:W216),\nIF(FORECAST($C201,W$205:W$216,$C$205:$C$216)<0,0,\nIF(FORECAST($C201,W$205:W$216,$C$205:$C$216)>100,100,\nFORECAST($C201,W$205:W$216,$C$205:$C$216))))","v":0},{"$f":"IF(MAX(C205:C216)-MIN(C205:C216)<5,AVERAGEIF(C205:C216,\">0\",X205:X216),\nIF(FORECAST($C201,X$205:X$216,$C$205:$C$216)<0,0,\nIF(FORECAST($C201,X$205:X$216,$C$205:$C$216)>100,100,\nFORECAST($C201,X$205:X$216,$C$205:$C$216))))","v":99.714103174335349},null,null,null,{"$f":"IF(MAX(C205:C216)-MIN(C205:C216)<5,AVERAGEIF(C205:C216,\">0\",AB205:AB216),\nIF(FORECAST($C201,AB$205:AB$216,$C$205:$C$216)<0,0,\nIF(FORECAST($C201,AB$205:AB$216,$C$205:$C$216)>100,100,\nFORECAST($C201,AB$205:AB$216,$C$205:$C$216))))","v":0}]
[null,null,{"$f":"MaxRegYear(C200,C205:C216)","v":2016},{"$f":"IF(MAX(C205:C216)-MIN(C205:C216)<5,AVERAGEIF(C205:C216,\">0\",D205:D216),\nIF(FORECAST($C202,D$205:D$216,$C$205:$C$216)<0,0,\nIF(FORECAST($C202,D$205:D$216,$C$205:$C$216)>100,100,\nFORECAST($C202,D$205:D$216,$C$205:$C$216))))","v":96.784573203827961},null,null,null,{"$f":"IF(MAX(C205:C216)-MIN(C205:C216)<5,AVERAGEIF(C205:C216,\">0\",H205:H216),\nIF(FORECAST($C202,H$205:H$216,$C$205:$C$216)<0,0,\nIF(FORECAST($C202,H$205:H$216,$C$205:$C$216)>100,100,\nFORECAST($C202,H$205:H$216,$C$205:$C$216))))","v":1.0567526165065388},{"$f":"IF(MAX(C205:C216)-MIN(C205:C216)<5,AVERAGEIF(C205:C216,\">0\",I205:I216),\nIF(FORECAST($C202,I$205:I$216,$C$205:$C$216)<0,0,\nIF(FORECAST($C202,I$205:I$216,$C$205:$C$216)>100,100,\nFORECAST($C202,I$205:I$216,$C$205:$C$216))))","v":99.216377650482073},null,null,null,{"$f":"IF(MAX(C205:C216)-MIN(C205:C216)<5,AVERAGEIF(C205:C216,\">0\",M205:M216),\nIF(FORECAST($C202,M$205:M$216,$C$205:$C$216)<0,0,\nIF(FORECAST($C202,M$205:M$216,$C$205:$C$216)>100,100,\nFORECAST($C202,M$205:M$216,$C$205:$C$216))))","v":0.21380947735435057},{"$f":"IF(MAX(C205:C216)-MIN(C205:C216)<5,AVERAGEIF(C205:C216,\">0\",N205:N216),\nIF(FORECAST($C202,N$205:N$216,$C$205:$C$216)<0,0,\nIF(FORECAST($C202,N$205:N$216,$C$205:$C$216)>100,100,\nFORECAST($C202,N$205:N$216,$C$205:$C$216))))","v":99.529401128377515},null,null,null,{"$f":"IF(MAX(C205:C216)-MIN(C205:C216)<5,AVERAGEIF(C205:C216,\">0\",R205:R216),\nIF(FORECAST($C202,R$205:R$216,$C$205:$C$216)<0,0,\nIF(FORECAST($C202,R$205:R$216,$C$205:$C$216)>100,100,\nFORECAST($C202,R$205:R$216,$C$205:$C$216))))","v":0},{"$f":"IF(MAX(C205:C216)-MIN(C205:C216)<5,AVERAGEIF(C205:C216,\">0\",S205:S216),\nIF(FORECAST($C202,S$205:S$216,$C$205:$C$216)<0,0,\nIF(FORECAST($C202,S$205:S$216,$C$205:$C$216)>100,100,\nFORECAST($C202,S$205:S$216,$C$205:$C$216))))","v":99.846126561853453},null,null,null,{"$f":"IF(MAX(C205:C216)-MIN(C205:C216)<5,AVERAGEIF(C205:C216,\">0\",W205:W216),\nIF(FORECAST($C202,W$205:W$216,$C$205:$C$216)<0,0,\nIF(FORECAST($C202,W$205:W$216,$C$205:$C$216)>100,100,\nFORECAST($C202,W$205:W$216,$C$205:$C$216))))","v":0},{"$f":"IF(MAX(C205:C216)-MIN(C205:C216)<5,AVERAGEIF(C205:C216,\">0\",X205:X216),\nIF(FORECAST($C202,X$205:X$216,$C$205:$C$216)<0,0,\nIF(FORECAST($C202,X$205:X$216,$C$205:$C$216)>100,100,\nFORECAST($C202,X$205:X$216,$C$205:$C$216))))","v":99.714103174335349},null,null,null,{"$f":"IF(MAX(C205:C216)-MIN(C205:C216)<5,AVERAGEIF(C205:C216,\">0\",AB205:AB216),\nIF(FORECAST($C202,AB$205:AB$216,$C$205:$C$216)<0,0,\nIF(FORECAST($C202,AB$205:AB$216,$C$205:$C$216)>100,100,\nFORECAST($C202,AB$205:AB$216,$C$205:$C$216))))","v":0}]
[]
[null,"Survey","Year","Improved","Not shared",null,null,"Open defecation","Improved","Not shared",null,null,"Open defecation","Improved","Not shared",null,null,"Open defecation","Improved","Not shared",null,null,"Open defecation","Improved","Not shared",null,null,"Open defecation"]
[null,"MICS14",2014,{"$f":"IF(ISERROR(INDIRECT(CONCATENATE($B205,\"!H122\"))),\"\",INDIRECT(CONCATENATE($B205,\"!H122\")))","v":96.784573203827961},{"$f":"IF(ISERROR(INDIRECT(CONCATENATE($B205,\"!H129\"))),\"\",INDIRECT(CONCATENATE($B205,\"!H129\")))","v":77.499065443441964},null,null,{"$f":"IF(ISERROR(INDIRECT(CONCATENATE($B205,\"!H127\"))),\"\",INDIRECT(CONCATENATE($B205,\"!H127\")))","v":1.0567526165065388},{"$f":"IF(ISERROR(INDIRECT(CONCATENATE($B205,\"!I122\"))),\"\",INDIRECT(CONCATENATE($B205,\"!I122\")))","v":99.216377650482073},{"$f":"IF(ISERROR(INDIRECT(CONCATENATE($B205,\"!I129\"))),\"\",INDIRECT(CONCATENATE($B205,\"!I129\")))","v":86.556715697199891},null,null,{"$f":"IF(ISERROR(INDIRECT(CONCATENATE($B205,\"!I127\"))),\"\",INDIRECT(CONCATENATE($B205,\"!I127\")))","v":0.21380947735435057},{"$f":"IF(ISERROR(INDIRECT(CONCATENATE($B205,\"!J122\"))),\"\",INDIRECT(CONCATENATE($B205,\"!J122\")))","v":99.529401128377515},{"$f":"IF(ISERROR(INDIRECT(CONCATENATE($B205,\"!J129\"))),\"\",INDIRECT(CONCATENATE($B205,\"!J129\")))","v":94.141248256404452},null,null,{"$f":"IF(ISERROR(INDIRECT(CONCATENATE($B205,\"!J127\"))),\"\",INDIRECT(CONCATENATE($B205,\"!J127\")))","v":0},{"$f":"IF(ISERROR(INDIRECT(CONCATENATE($B205,\"!K122\"))),\"\",INDIRECT(CONCATENATE($B205,\"!K122\")))","v":99.846126561853453},{"$f":"IF(ISERROR(INDIRECT(CONCATENATE($B205,\"!K129\"))),\"\",INDIRECT(CONCATENATE($B205,\"!K129\")))","v":96.767354303278282},null,null,{"$f":"IF(ISERROR(INDIRECT(CONCATENATE($B205,\"!K127\"))),\"\",INDIRECT(CONCATENATE($B205,\"!K127\")))","v":0},{"$f":"IF(ISERROR(INDIRECT(CONCATENATE($B205,\"!L122\"))),\"\",INDIRECT(CONCATENATE($B205,\"!L122\")))","v":99.714103174335349},{"$f":"IF(ISERROR(INDIRECT(CONCATENATE($B205,\"!L129\"))),\"\",INDIRECT(CONCATENATE($B205,\"!L129\")))","v":98.316719593819556},null,null,{"$f":"IF(ISERROR(INDIRECT(CONCATENATE($B205,\"!L2127\"))),\"\",INDIRECT(CONCATENATE($B205,\"!L127\")))","v":0}]
[null,null,null,"","",null,null,"","","",null,null,"","","",null,null,"","","",null,null,"","","",null,null,""]
[null,null,null,"","",null,null,"","","",null,null,"","","",null,null,"","","",null,null,"","","",null,null,""]
[null,null,null,"","",null,null,"","","",null,null,"","","",null,null,"","","",null,null,"","","",null,null,""]
[null,null,null,"","",null,null,"","","",null,null,"","","",null,null,"","","",null,null,"","","",null,null,""]
[null,null,null,"","",null,null,"","","",null,null,"","","",null,null,"","","",null,null,"","","",null,null,""]
[null,null,null,"","",null,null,"","","",null,null,"","","",null,null,"","","",null,null,"","","",null,null,""]
[null,null,null,"","",null,null,"","","",null,null,"","","",null,null,"","","",null,null,"","","",null,null,""]
[null,null,null,"","",null,null,"","","",null,null,"","","",null,null,"","","",null,null,"","","",null,null,""]
[null,null,null,"","",null,null,"","","",null,null,"","","",null,null,"","","",null,null,"","","",null,null,""]
[null,null,null,"","",null,null,"","","",null,null,"","","",null,null,"","","",null,null,"","","",null,null,""]
[null,null,null,"","",null,null,"","","",null,null,"","","",null,null,"","","",null,null,"","","",null,null,""]
[]
[null,{"$f":"CONCATENATE(\"Urban use of sanitation facilities, \",C199,\"–\",C200)","v":"Urban use of sanitation facilities, 2010–2018"},null,null,null,null,null,null,null,null,null,null,null,null,null,null,null,null,"Data points used for regression"]
[]
[]
[]
[]
[]
[]
[]
[]
[]
[]
[]
[]
[]
[]
[]
[]
[]
[]
[]
[]
[]
[]
[]
[]
[]
[]
[]
[]
[]
[]
[]
[]
[]
[]
[]
[]
[]
[]
[]
[]
[]
[]
[]
[]
[]
[]
[]
[]
[]
[]
[]
[]
[]
[]
[]
[]
[]
[]
[]
[]
[]
[]
[]
[]
[]
[]
[]
[]
[]
[]
[]
[]
[]
[]
[]
[]
[]
[]
["RURAL",null,null,"Poorest",null,null,null,null,"Poor",null,null,null,null,"Middle",null,null,null,null,"Rich",null,null,null,null,"Richest"]
[null,null,null,"Improved","Basic","Limited","Unimproved","Open defecation","Improved","Basic","Limited","Unimproved","Open defecation","Improved","Basic","Limited","Unimproved","Open defecation","Improved","Basic","Limited","Unimproved","Open defecation","Improved","Basic","Limited","Unimproved","Open defecation"]
["Forecast period:",null,{"$f":"MinBase(C305:C316)","v":2010},{"$f":"IF((D301+H301)>100,D301*100/(D301+H301),D301)","v":82.330222921687721},{"$f":"D299*AVERAGEIF(E305:E316,\">0\")/100","v":57.386067561061509},{"$f":"D299*(100-AVERAGEIF(E305:E316,\">0\"))/100","v":24.944155360626215},{"$f":"100-(E299+F299+H299)","v":2.6251430747987143},{"$f":"IF((D301+H301)>100,H301*100/(D301+H301),H301)","v":15.04463400351356},{"$f":"IF((I301+M301)>100,I301*100/(I301+M301),I301)","v":89.590842220756144},{"$f":"I299*AVERAGEIF(J305:J316,\">0\")/100","v":71.536987807232379},{"$f":"I299*(100-AVERAGEIF(J305:J316,\">0\"))/100","v":18.053854413523769},{"$f":"100-(J299+K299+M299)","v":1.8113612046431626},{"$f":"IF((I301+M301)>100,M301*100/(I301+M301),M301)","v":8.5977965746006948},{"$f":"IF((N301+R301)>100,N301*100/(N301+R301),N301)","v":95.709828855033393},{"$f":"N299*AVERAGEIF(O305:O316,\">0\")/100","v":81.257034639853003},{"$f":"N299*(100-AVERAGEIF(O305:O316,\">0\"))/100","v":14.452794215180381},{"$f":"100-(O299+P299+R299)","v":1.7680156500456405},{"$f":"IF((N301+R301)>100,R301*100/(N301+R301),R301)","v":2.5221554949209848},{"$f":"IF((S301+W301)>100,S301*100/(S301+W301),S301)","v":97.351078488013812},{"$f":"S299*AVERAGEIF(T305:T316,\">0\")/100","v":86.827797010817008},{"$f":"S299*(100-AVERAGEIF(T305:T316,\">0\"))/100","v":10.523281477196797},{"$f":"100-(T299+U299+W299)","v":1.0368637002759726},{"$f":"IF((S301+W301)>100,W301*100/(S301+W301),W301)","v":1.6120578117102311},{"$f":"IF((X301+AB301)>100,X301*100/(X301+AB301),X301)","v":98.305116961221586},{"$f":"X299*AVERAGEIF(Y305:Y316,\">0\")/100","v":91.547873432144257},{"$f":"X299*(100-AVERAGEIF(Y305:Y316,\">0\"))/100","v":6.7572435290773285},{"$f":"100-(Y299+Z299+AB299)","v":1.1612621218636718},{"$f":"IF((X301+AB301)>100,AB301*100/(X301+AB301),AB301)","v":0.53362091691474367}]
[null,null,{"$f":"MaxTarget(C305:C316)","v":2018},{"$f":"IF((D302+H302)>100,D302*100/(D302+H302),D302)","v":82.330222921687721},{"$f":"D300*AVERAGEIF(E305:E316,\">0\")/100","v":57.386067561061509},{"$f":"D300*(100-AVERAGEIF(E305:E316,\">0\"))/100","v":24.944155360626215},{"$f":"100-(E300+F300+H300)","v":2.6251430747987143},{"$f":"IF((D302+H302)>100,H302*100/(D302+H302),H302)","v":15.04463400351356},{"$f":"IF((I302+M302)>100,I302*100/(I302+M302),I302)","v":89.590842220756144},{"$f":"I300*AVERAGEIF(J305:J316,\">0\")/100","v":71.536987807232379},{"$f":"I300*(100-AVERAGEIF(J305:J316,\">0\"))/100","v":18.053854413523769},{"$f":"100-(J300+K300+M300)","v":1.8113612046431626},{"$f":"IF((I302+M302)>100,M302*100/(I302+M302),M302)","v":8.5977965746006948},{"$f":"IF((N302+R302)>100,N302*100/(N302+R302),N302)","v":95.709828855033393},{"$f":"N300*AVERAGEIF(O305:O316,\">0\")/100","v":81.257034639853003},{"$f":"N300*(100-AVERAGEIF(O305:O316,\">0\"))/100","v":14.452794215180381},{"$f":"100-(O300+P300+R300)","v":1.7680156500456405},{"$f":"IF((N302+R302)>100,R302*100/(N302+R302),R302)","v":2.5221554949209848},{"$f":"IF((S302+W302)>100,S302*100/(S302+W302),S302)","v":97.351078488013812},{"$f":"S300*AVERAGEIF(T305:T316,\">0\")/100","v":86.827797010817008},{"$f":"S300*(100-AVERAGEIF(T305:T316,\">0\"))/100","v":10.523281477196797},{"$f":"100-(T300+U300+W300)","v":1.0368637002759726},{"$f":"IF((S302+W302)>100,W302*100/(S302+W302),W302)","v":1.6120578117102311},{"$f":"IF((X302+AB302)>100,X302*100/(X302+AB302),X302)","v":98.305116961221586},{"$f":"X300*AVERAGEIF(Y305:Y316,\">0\")/100","v":91.547873432144257},{"$f":"X300*(100-AVERAGEIF(Y305:Y316,\">0\"))/100","v":6.7572435290773285},{"$f":"100-(Y300+Z300+AB300)","v":1.1612621218636718},{"$f":"IF((X302+AB302)>100,AB302*100/(X302+AB302),AB302)","v":0.53362091691474367}]
["Regression period:",null,{"$f":"MinRegYear(C299,C305:C316)","v":2012},{"$f":"IF(MAX(C305:C316)-MIN(C305:C316)<5,AVERAGEIF(C305:C316,\">0\",D305:D316),\nIF(FORECAST($C301,D$305:D$316,$C$305:$C$316)<0,0,\nIF(FORECAST($C301,D$305:D$316,$C$305:$C$316)>100,100,\nFORECAST($C301,D$305:D$316,$C$305:$C$316))))","v":82.330222921687721},null,null,null,{"$f":"IF(MAX(C305:C316)-MIN(C305:C316)<5,AVERAGEIF(C305:C316,\">0\",H305:H316),\nIF(FORECAST($C301,H$305:H$316,$C$305:$C$316)<0,0,\nIF(FORECAST($C301,H$305:H$316,$C$305:$C$316)>100,100,\nFORECAST($C301,H$305:H$316,$C$305:$C$316))))","v":15.04463400351356},{"$f":"IF(MAX(C305:C316)-MIN(C305:C316)<5,AVERAGEIF(C305:C316,\">0\",I305:I316),\nIF(FORECAST($C301,I$305:I$316,$C$305:$C$316)<0,0,\nIF(FORECAST($C301,I$305:I$316,$C$305:$C$316)>100,100,\nFORECAST($C301,I$305:I$316,$C$305:$C$316))))","v":89.590842220756144},null,null,null,{"$f":"IF(MAX(C305:C316)-MIN(C305:C316)<5,AVERAGEIF(C305:C316,\">0\",M305:M316),\nIF(FORECAST($C301,M$305:M$316,$C$305:$C$316)<0,0,\nIF(FORECAST($C301,M$305:M$316,$C$305:$C$316)>100,100,\nFORECAST($C301,M$305:M$316,$C$305:$C$316))))","v":8.5977965746006948},{"$f":"IF(MAX(C305:C316)-MIN(C305:C316)<5,AVERAGEIF(C305:C316,\">0\",N305:N316),\nIF(FORECAST($C301,N$305:N$316,$C$305:$C$316)<0,0,\nIF(FORECAST($C301,N$305:N$316,$C$305:$C$316)>100,100,\nFORECAST($C301,N$305:N$316,$C$305:$C$316))))","v":95.709828855033393},null,null,null,{"$f":"IF(MAX(C305:C316)-MIN(C305:C316)<5,AVERAGEIF(C305:C316,\">0\",R305:R316),\nIF(FORECAST($C301,R$305:R$316,$C$305:$C$316)<0,0,\nIF(FORECAST($C301,R$305:R$316,$C$305:$C$316)>100,100,\nFORECAST($C301,R$305:R$316,$C$305:$C$316))))","v":2.5221554949209848},{"$f":"IF(MAX(C305:C316)-MIN(C305:C316)<5,AVERAGEIF(C305:C316,\">0\",S305:S316),\nIF(FORECAST($C301,S$305:S$316,$C$305:$C$316)<0,0,\nIF(FORECAST($C301,S$305:S$316,$C$305:$C$316)>100,100,\nFORECAST($C301,S$305:S$316,$C$305:$C$316))))","v":97.351078488013812},null,null,null,{"$f":"IF(MAX(C305:C316)-MIN(C305:C316)<5,AVERAGEIF(C305:C316,\">0\",W305:W316),\nIF(FORECAST($C301,W$305:W$316,$C$305:$C$316)<0,0,\nIF(FORECAST($C301,W$305:W$316,$C$305:$C$316)>100,100,\nFORECAST($C301,W$305:W$316,$C$305:$C$316))))","v":1.6120578117102311},{"$f":"IF(MAX(C305:C316)-MIN(C305:C316)<5,AVERAGEIF(C305:C316,\">0\",X305:X316),\nIF(FORECAST($C301,X$305:X$316,$C$305:$C$316)<0,0,\nIF(FORECAST($C301,X$305:X$316,$C$305:$C$316)>100,100,\nFORECAST($C301,X$305:X$316,$C$305:$C$316))))","v":98.305116961221586},null,null,null,{"$f":"IF(MAX(C305:C316)-MIN(C305:C316)<5,AVERAGEIF(C305:C316,\">0\",AB305:AB316),\nIF(FORECAST($C301,AB$305:AB$316,$C$305:$C$316)<0,0,\nIF(FORECAST($C301,AB$305:AB$316,$C$305:$C$316)>100,100,\nFORECAST($C301,AB$305:AB$316,$C$305:$C$316))))","v":0.53362091691474367}]
[null,null,{"$f":"MaxRegYear(C300,C305:C316)","v":2016},{"$f":"IF(MAX(C305:C316)-MIN(C305:C316)<5,AVERAGEIF(C305:C316,\">0\",D305:D316),\nIF(FORECAST($C302,D$305:D$316,$C$305:$C$316)<0,0,\nIF(FORECAST($C302,D$305:D$316,$C$305:$C$316)>100,100,\nFORECAST($C302,D$305:D$316,$C$305:$C$316))))","v":82.330222921687721},null,null,null,{"$f":"IF(MAX(C305:C316)-MIN(C305:C316)<5,AVERAGEIF(C305:C316,\">0\",H305:H316),\nIF(FORECAST($C302,H$305:H$316,$C$305:$C$316)<0,0,\nIF(FORECAST($C302,H$305:H$316,$C$305:$C$316)>100,100,\nFORECAST($C302,H$305:H$316,$C$305:$C$316))))","v":15.04463400351356},{"$f":"IF(MAX(C305:C316)-MIN(C305:C316)<5,AVERAGEIF(C305:C316,\">0\",I305:I316),\nIF(FORECAST($C302,I$305:I$316,$C$305:$C$316)<0,0,\nIF(FORECAST($C302,I$305:I$316,$C$305:$C$316)>100,100,\nFORECAST($C302,I$305:I$316,$C$305:$C$316))))","v":89.590842220756144},null,null,null,{"$f":"IF(MAX(C305:C316)-MIN(C305:C316)<5,AVERAGEIF(C305:C316,\">0\",M305:M316),\nIF(FORECAST($C302,M$305:M$316,$C$305:$C$316)<0,0,\nIF(FORECAST($C302,M$305:M$316,$C$305:$C$316)>100,100,\nFORECAST($C302,M$305:M$316,$C$305:$C$316))))","v":8.5977965746006948},{"$f":"IF(MAX(C305:C316)-MIN(C305:C316)<5,AVERAGEIF(C305:C316,\">0\",N305:N316),\nIF(FORECAST($C302,N$305:N$316,$C$305:$C$316)<0,0,\nIF(FORECAST($C302,N$305:N$316,$C$305:$C$316)>100,100,\nFORECAST($C302,N$305:N$316,$C$305:$C$316))))","v":95.709828855033393},null,null,null,{"$f":"IF(MAX(C305:C316)-MIN(C305:C316)<5,AVERAGEIF(C305:C316,\">0\",R305:R316),\nIF(FORECAST($C302,R$305:R$316,$C$305:$C$316)<0,0,\nIF(FORECAST($C302,R$305:R$316,$C$305:$C$316)>100,100,\nFORECAST($C302,R$305:R$316,$C$305:$C$316))))","v":2.5221554949209848},{"$f":"IF(MAX(C305:C316)-MIN(C305:C316)<5,AVERAGEIF(C305:C316,\">0\",S305:S316),\nIF(FORECAST($C302,S$305:S$316,$C$305:$C$316)<0,0,\nIF(FORECAST($C302,S$305:S$316,$C$305:$C$316)>100,100,\nFORECAST($C302,S$305:S$316,$C$305:$C$316))))","v":97.351078488013812},null,null,null,{"$f":"IF(MAX(C305:C316)-MIN(C305:C316)<5,AVERAGEIF(C305:C316,\">0\",W305:W316),\nIF(FORECAST($C302,W$305:W$316,$C$305:$C$316)<0,0,\nIF(FORECAST($C302,W$305:W$316,$C$305:$C$316)>100,100,\nFORECAST($C302,W$305:W$316,$C$305:$C$316))))","v":1.6120578117102311},{"$f":"IF(MAX(C305:C316)-MIN(C305:C316)<5,AVERAGEIF(C305:C316,\">0\",X305:X316),\nIF(FORECAST($C302,X$305:X$316,$C$305:$C$316)<0,0,\nIF(FORECAST($C302,X$305:X$316,$C$305:$C$316)>100,100,\nFORECAST($C302,X$305:X$316,$C$305:$C$316))))","v":98.305116961221586},null,null,null,{"$f":"IF(MAX(C305:C316)-MIN(C305:C316)<5,AVERAGEIF(C305:C316,\">0\",AB305:AB316),\nIF(FORECAST($C302,AB$305:AB$316,$C$305:$C$316)<0,0,\nIF(FORECAST($C302,AB$305:AB$316,$C$305:$C$316)>100,100,\nFORECAST($C302,AB$305:AB$316,$C$305:$C$316))))","v":0.53362091691474367}]
[]
[null,"Survey","Year","Improved","Not shared",null,null,"Open defecation","Improved","Not shared",null,null,"Open defecation","Improved","Not shared",null,null,"Open defecation","Improved","Not shared",null,null,"Open defecation","Improved","Not shared",null,null,"Open defecation"]
[null,"MICS14",2014,{"$f":"IF(ISERROR(INDIRECT(CONCATENATE($B305,\"!M122\"))),\"\",INDIRECT(CONCATENATE($B305,\"!M122\")))","v":82.330222921687721},{"$f":"IF(ISERROR(INDIRECT(CONCATENATE($B305,\"!M129\"))),\"\",INDIRECT(CONCATENATE($B305,\"!M129\")))","v":69.702310433007057},null,null,{"$f":"IF(ISERROR(INDIRECT(CONCATENATE($B305,\"!M127\"))),\"\",INDIRECT(CONCATENATE($B305,\"!M127\")))","v":15.04463400351356},{"$f":"IF(ISERROR(INDIRECT(CONCATENATE($B305,\"!N122\"))),\"\",INDIRECT(CONCATENATE($B305,\"!N122\")))","v":89.590842220756144},{"$f":"IF(ISERROR(INDIRECT(CONCATENATE($B305,\"!N129\"))),\"\",INDIRECT(CONCATENATE($B305,\"!N129\")))","v":79.848549286948099},null,null,{"$f":"IF(ISERROR(INDIRECT(CONCATENATE($B305,\"!N127\"))),\"\",INDIRECT(CONCATENATE($B305,\"!N127\")))","v":8.5977965746006948},{"$f":"IF(ISERROR(INDIRECT(CONCATENATE($B305,\"!O122\"))),\"\",INDIRECT(CONCATENATE($B305,\"!O122\")))","v":95.709828855033393},{"$f":"IF(ISERROR(INDIRECT(CONCATENATE($B305,\"!O129\"))),\"\",INDIRECT(CONCATENATE($B305,\"!O129\")))","v":84.899362596216463},null,null,{"$f":"IF(ISERROR(INDIRECT(CONCATENATE($B305,\"!O127\"))),\"\",INDIRECT(CONCATENATE($B305,\"!O127\")))","v":2.5221554949209848},{"$f":"IF(ISERROR(INDIRECT(CONCATENATE($B305,\"!P122\"))),\"\",INDIRECT(CONCATENATE($B305,\"!P122\")))","v":97.351078488013812},{"$f":"IF(ISERROR(INDIRECT(CONCATENATE($B305,\"!P129\"))),\"\",INDIRECT(CONCATENATE($B305,\"!P129\")))","v":89.190380177973623},null,null,{"$f":"IF(ISERROR(INDIRECT(CONCATENATE($B305,\"!P127\"))),\"\",INDIRECT(CONCATENATE($B305,\"!P127\")))","v":1.6120578117102311},{"$f":"IF(ISERROR(INDIRECT(CONCATENATE($B305,\"!Q122\"))),\"\",INDIRECT(CONCATENATE($B305,\"!Q122\")))","v":98.305116961221586},{"$f":"IF(ISERROR(INDIRECT(CONCATENATE($B305,\"!Q129\"))),\"\",INDIRECT(CONCATENATE($B305,\"!Q129\")))","v":93.126254524733582},null,null,{"$f":"IF(ISERROR(INDIRECT(CONCATENATE($B305,\"!Q2127\"))),\"\",INDIRECT(CONCATENATE($B305,\"!Q127\")))","v":0.53362091691474367}]
[null,null,null,"","",null,null,"","","",null,null,"","","",null,null,"","","",null,null,"","","",null,null,""]
[null,null,null,"","",null,null,"","","",null,null,"","","",null,null,"","","",null,null,"","","",null,null,""]
[null,null,null,"","",null,null,"","","",null,null,"","","",null,null,"","","",null,null,"","","",null,null,""]
[null,null,null,"","",null,null,"","","",null,null,"","","",null,null,"","","",null,null,"","","",null,null,""]
[null,null,null,"","",null,null,"","","",null,null,"","","",null,null,"","","",null,null,"","","",null,null,""]
[null,null,null,"","",null,null,"","","",null,null,"","","",null,null,"","","",null,null,"","","",null,null,""]
[null,null,null,"","",null,null,"","","",null,null,"","","",null,null,"","","",null,null,"","","",null,null,""]
[null,null,null,"","",null,null,"","","",null,null,"","","",null,null,"","","",null,null,"","","",null,null,""]
[null,null,null,"","",null,null,"","","",null,null,"","","",null,null,"","","",null,null,"","","",null,null,""]
[null,null,null,"","",null,null,"","","",null,null,"","","",null,null,"","","",null,null,"","","",null,null,""]
[null,null,null,"","",null,null,"","","",null,null,"","","",null,null,"","","",null,null,"","","",null,null,""]
[]
[null,{"$f":"CONCATENATE(\"Rural use of sanitation facilities, \",C299,\"–\",C300)","v":"Rural use of sanitation facilities, 2010–2018"},null,null,null,null,null,null,null,null,null,null,null,null,null,null,null,null,"Data points used for regression"]

{"sheet":"Hygiene","index":3,"n_rows":88,"n_cols":25,"rows_kept":88,"cut":false,"hidden":false,"merged":[[39,22,40,22],[39,23,40,23],[39,24,40,24],[31,4,32,5],[39,16,40,16],[39,17,40,17],[39,18,40,18],[39,19,40,19],[39,20,40,20],[39,21,40,21],[36,24,37,24],[39,6,40,7],[39,8,40,8],[39,9,40,9],[39,10,40,10],[39,11,40,11],[39,12,40,12],[39,13,40,13],[39,14,40,14],[39,15,40,15],[36,18,37,18],[36,12,37,12],[36,13,37,13],[36,14,37,14],[36,15,37,15],[36,16,37,16],[36,17,37,17],[36,19,37,19],[36,20,37,20],[36,21,37,21],[36,22,37,22],[36,23,37,23],[33,20,34,20],[33,21,34,21],[33,22,34,22],[33,23,34,23],[33,24,34,24],[33,15,34,15],[33,16,34,16],[33,17,34,17],[33,18,34,18],[36,6,37,7],[36,8,37,8],[36,9,37,9],[36,10,37,10],[36,11,37,11],[33,10,34,10],[33,11,34,11],[33,12,34,12],[33,13,34,13],[33,14,34,14],[6,1,6,7],[3,1,3,24],[4,1,4,24],[33,1,34,3],[31,6,32,9],[31,10,31,12],[31,13,31,15],[6,10,6,15],[6,18,6,23],[33,19,34,19],[31,16,31,18],[31,19,31,21],[31,22,31,24],[33,6,34,7],[33,8,34,8],[33,9,34,9]]}
[]
[]
[]
[null,"Access to hygiene facilities by wealth quintile (%)"]
[null,{"$f":"IF(ISERROR(INDIRECT(CONCATENATE($E$32,\"!A2\"))),\"\",INDIRECT(CONCATENATE($E$32,\"!A2\")))","v":""}]
[]
[null,{"$f":"CONCATENATE(\"National \",IF(ISERROR(INDIRECT(CONCATENATE($E$32,\"!A2\"))),\"\",INDIRECT(CONCATENATE($E$32,\"!A210\"))))","v":"National "},null,null,null,null,null,null,null,null,{"$f":"CONCATENATE(\"Urban \",IF(ISERROR(INDIRECT(CONCATENATE($E$32,\"!A2\"))),\"\",INDIRECT(CONCATENATE($E$32,\"!A210\"))))","v":"Urban "},null,null,null,null,null,null,null,{"$f":"CONCATENATE(\"Rural \",IF(ISERROR(INDIRECT(CONCATENATE($E$32,\"!A2\"))),\"\",INDIRECT(CONCATENATE($E$32,\"!A210\"))))","v":"Rural "}]
[]
[]
[]
[]
[]
[]
[]
[]
[]
[]
[]
[]
[]
[]
[]
[]
[]
[]
[]
[]
[]
[]
[]
[]
[null,null,null,null,{"$f":"INDEX(B88:B100,A88)","v":0},null,{"$f":"IF(ISERROR(INDIRECT(CONCATENATE($E$32,\"!A2\"))),\"\",INDIRECT(CONCATENATE($E$32,\"!A2\")))","v":""},null,null,null,"Poorest",null,null,"Poor",null,null,"Middle",null,null,"Rich",null,null,"Richest"]
[null,null,null,null,null,null,null,null,null,null,"Basic","Limited","No facility","Basic","Limited","No facility","Basic","Limited","No facility","Basic","Limited","No facility","Basic","Limited","No facility"]
[null,">>>  Select Survey :   ",null,null,null,null,"NATIONAL",null,null,{"$f":"IF(ISERROR(INDIRECT(CONCATENATE(#REF!,\"!A2\"))),\"\",INDIRECT(CONCATENATE(#REF!,\"!A210\")))","v":""},{"$f":"IF(ISERROR(INDIRECT(CONCATENATE($E$32,\"!C222\"))),\"\",INDIRECT(CONCATENATE($E$32,\"!C222\")))","v":""},{"$f":"IF(ISERROR(INDIRECT(CONCATENATE($E$32,\"!C223\"))),\"\",INDIRECT(CONCATENATE($E$32,\"!C223\")))","v":""},{"$f":"IF(ISERROR(INDIRECT(CONCATENATE($E$32,\"!C224\"))),\"\",INDIRECT(CONCATENATE($E$32,\"!C224\")))","v":""},{"$f":"IF(ISERROR(INDIRECT(CONCATENATE($E$32,\"!D222\"))),\"\",INDIRECT(CONCATENATE($E$32,\"!D222\")))","v":""},{"$f":"IF(ISERROR(INDIRECT(CONCATENATE($E$32,\"!D223\"))),\"\",INDIRECT(CONCATENATE($E$32,\"!D223\")))","v":""},{"$f":"IF(ISERROR(INDIRECT(CONCATENATE($E$32,\"!D224\"))),\"\",INDIRECT(CONCATENATE($E$32,\"!D224\")))","v":""},{"$f":"IF(ISERROR(INDIRECT(CONCATENATE($E$32,\"!E222\"))),\"\",INDIRECT(CONCATENATE($E$32,\"!E222\")))","v":""},{"$f":"IF(ISERROR(INDIRECT(CONCATENATE($E$32,\"!E223\"))),\"\",INDIRECT(CONCATENATE($E$32,\"!E223\")))","v":""},{"$f":"IF(ISERROR(INDIRECT(CONCATENATE($E$32,\"!E224\"))),\"\",INDIRECT(CONCATENATE($E$32,\"!E224\")))","v":""},{"$f":"IF(ISERROR(INDIRECT(CONCATENATE($E$32,\"!F222\"))),\"\",INDIRECT(CONCATENATE($E$32,\"!F222\")))","v":""},{"$f":"IF(ISERROR(INDIRECT(CONCATENATE($E$32,\"!F223\"))),\"\",INDIRECT(CONCATENATE($E$32,\"!F223\")))","v":""},{"$f":"IF(ISERROR(INDIRECT(CONCATENATE($E$32,\"!F224\"))),\"\",INDIRECT(CONCATENATE($E$32,\"!F224\")))","v":""},{"$f":"IF(ISERROR(INDIRECT(CONCATENATE($E$32,\"!G222\"))),\"\",INDIRECT(CONCATENATE($E$32,\"!G222\")))","v":""},{"$f":"IF(ISERROR(INDIRECT(CONCATENATE($E$32,\"!G223\"))),\"\",INDIRECT(CONCATENATE($E$32,\"!G223\")))","v":""},{"$f":"IF(ISERROR(INDIRECT(CONCATENATE($E$32,\"!G224\"))),\"\",INDIRECT(CONCATENATE($E$32,\"!G224\")))","v":""}]
[]
[]
[null,null,null,null,null,null,"URBAN",null,null,{"$f":"IF(ISERROR(INDIRECT(CONCATENATE(#REF!,\"!A2\"))),\"\",INDIRECT(CONCATENATE(#REF!,\"!A210\")))","v":""},{"$f":"IF(ISERROR(INDIRECT(CONCATENATE($E$32,\"!H222\"))),\"\",INDIRECT(CONCATENATE($E$32,\"!H222\")))","v":""},{"$f":"IF(ISERROR(INDIRECT(CONCATENATE($E$32,\"!H223\"))),\"\",INDIRECT(CONCATENATE($E$32,\"!H223\")))","v":""},{"$f":"IF(ISERROR(INDIRECT(CONCATENATE($E$32,\"!H224\"))),\"\",INDIRECT(CONCATENATE($E$32,\"!H224\")))","v":""},{"$f":"IF(ISERROR(INDIRECT(CONCATENATE($E$32,\"!I222\"))),\"\",INDIRECT(CONCATENATE($E$32,\"!I222\")))","v":""},{"$f":"IF(ISERROR(INDIRECT(CONCATENATE($E$32,\"!I223\"))),\"\",INDIRECT(CONCATENATE($E$32,\"!I223\")))","v":""},{"$f":"IF(ISERROR(INDIRECT(CONCATENATE($E$32,\"!I224\"))),\"\",INDIRECT(CONCATENATE($E$32,\"!I224\")))","v":""},{"$f":"IF(ISERROR(INDIRECT(CONCATENATE($E$32,\"!J222\"))),\"\",INDIRECT(CONCATENATE($E$32,\"!J222\")))","v":""},{"$f":"IF(ISERROR(INDIRECT(CONCATENATE($E$32,\"!J223\"))),\"\",INDIRECT(CONCATENATE($E$32,\"!J223\")))","v":""},{"$f":"IF(ISERROR(INDIRECT(CONCATENATE($E$32,\"!J224\"))),\"\",INDIRECT(CONCATENATE($E$32,\"!J224\")))","v":""},{"$f":"IF(ISERROR(INDIRECT(CONCATENATE($E$32,\"!K222\"))),\"\",INDIRECT(CONCATENATE($E$32,\"!K222\")))","v":""},{"$f":"IF(ISERROR(INDIRECT(CONCATENATE($E$32,\"!K223\"))),\"\",INDIRECT(CONCATENATE($E$32,\"!K223\")))","v":""},{"$f":"IF(ISERROR(INDIRECT(CONCATENATE($E$32,\"!K224\"))),\"\",INDIRECT(CONCATENATE($E$32,\"!K224\")))","v":""},{"$f":"IF(ISERROR(INDIRECT(CONCATENATE($E$32,\"!L222\"))),\"\",INDIRECT(CONCATENATE($E$32,\"!L222\")))","v":""},{"$f":"IF(ISERROR(INDIRECT(CONCATENATE($E$32,\"!L223\"))),\"\",INDIRECT(CONCATENATE($E$32,\"!L223\")))","v":""},{"$f":"IF(ISERROR(INDIRECT(CONCATENATE($E$32,\"!L224\"))),\"\",INDIRECT(CONCATENATE($E$32,\"!L224\")))","v":""}]
[]
[]
[null,null,null,null,null,null,"RURAL",null,null,{"$f":"IF(ISERROR(INDIRECT(CONCATENATE(#REF!,\"!A2\"))),\"\",INDIRECT(CONCATENATE(#REF!,\"!A210\")))","v":""},{"$f":"IF(ISERROR(INDIRECT(CONCATENATE($E$32,\"!M222\"))),\"\",INDIRECT(CONCATENATE($E$32,\"!M222\")))","v":""},{"$f":"IF(ISERROR(INDIRECT(CONCATENATE($E$32,\"!M223\"))),\"\",INDIRECT(CONCATENATE($E$32,\"!M223\")))","v":""},{"$f":"IF(ISERROR(INDIRECT(CONCATENATE($E$32,\"!M224\"))),\"\",INDIRECT(CONCATENATE($E$32,\"!M224\")))","v":""},{"$f":"IF(ISERROR(INDIRECT(CONCATENATE($E$32,\"!N222\"))),\"\",INDIRECT(CONCATENATE($E$32,\"!N222\")))","v":""},{"$f":"IF(ISERROR(INDIRECT(CONCATENATE($E$32,\"!N223\"))),\"\",INDIRECT(CONCATENATE($E$32,\"!N223\")))","v":""},{"$f":"IF(ISERROR(INDIRECT(CONCATENATE($E$32,\"!N224\"))),\"\",INDIRECT(CONCATENATE($E$32,\"!N224\")))","v":""},{"$f":"IF(ISERROR(INDIRECT(CONCATENATE($E$32,\"!O222\"))),\"\",INDIRECT(CONCATENATE($E$32,\"!O222\")))","v":""},{"$f":"IF(ISERROR(INDIRECT(CONCATENATE($E$32,\"!O223\"))),\"\",INDIRECT(CONCATENATE($E$32,\"!O223\")))","v":""},{"$f":"IF(ISERROR(INDIRECT(CONCATENATE($E$32,\"!O224\"))),\"\",INDIRECT(CONCATENATE($E$32,\"!O224\")))","v":""},{"$f":"IF(ISERROR(INDIRECT(CONCATENATE($E$32,\"!P222\"))),\"\",INDIRECT(CONCATENATE($E$32,\"!P222\")))","v":""},{"$f":"IF(ISERROR(INDIRECT(CONCATENATE($E$32,\"!P223\"))),\"\",INDIRECT(CONCATENATE($E$32,\"!P223\")))","v":""},{"$f":"IF(ISERROR(INDIRECT(CONCATENATE($E$32,\"!P224\"))),\"\",INDIRECT(CONCATENATE($E$32,\"!P224\")))","v":""},{"$f":"IF(ISERROR(INDIRECT(CONCATENATE($E$32,\"!Q222\"))),\"\",INDIRECT(CONCATENATE($E$32,\"!Q222\")))","v":""},{"$f":"IF(ISERROR(INDIRECT(CONCATENATE($E$32,\"!Q223\"))),\"\",INDIRECT(CONCATENATE($E$32,\"!Q223\")))","v":""},{"$f":"IF(ISERROR(INDIRECT(CONCATENATE($E$32,\"!Q224\"))),\"\",INDIRECT(CONCATENATE($E$32,\"!Q224\")))","v":""}]
[]
[]
[]
[]
[]
[]
[]
[]
[]
[]
[]
[]
[]
[]
[]
[]
[]
[]
[]
[]
[]
[]
[]
[]
[]
[]
[]
[]
[]
[]
[]
[]
[]
[]
[]
[]
[]
[]
[]
[]
[]
[]
[]
[]
[]
[]
[]
[2,"Template"]

{"sheet":"MICS14","index":4,"n_rows":1072,"n_cols":74,"rows_kept":1072,"cut":false,"hidden":false,"merged":[[346,52,347,52],[348,52,349,52],[350,52,351,52],[352,52,353,52],[152,52,165,52],[230,52,234,52],[270,52,272,52],[273,52,275,52],[276,52,283,52],[338,54,338,58],[338,59,338,63],[338,64,338,68],[340,52,341,52],[342,52,343,52],[344,52,345,52],[221,52,223,52],[224,52,225,52],[226,52,229,52],[258,54,258,58],[258,59,258,63],[258,64,258,68],[260,52,262,52],[263,52,266,52],[267,52,269,52],[119,64,119,68],[121,52,122,52],[123,52,126,52],[127,52,128,52],[132,54,132,58],[132,59,132,63],[132,64,132,68],[134,52,138,52],[219,54,219,58],[219,59,219,63],[219,64,219,68],[139,52,142,52],[13,64,13,68],[15,52,16,52],[17,52,20,52],[21,52,22,52],[26,54,26,58],[26,59,26,63],[26,64,26,68],[40,52,41,52],[55,54,55,58],[55,59,55,63],[55,64,55,68],[143,0,146,0],[143,52,146,52],[147,0,149,0],[147,52,149,52],[150,0,151,0],[150,52,151,52],[13,54,13,58],[13,59,13,63],[119,54,119,58],[119,59,119,63],[42,52,43,52],[44,52,45,52],[46,0,48,0],[46,52,48,52],[49,0,51,0],[49,52,51,52],[52,0,54,0],[52,52,54,52],[32,52,33,52],[34,52,35,52],[36,52,37,52],[38,0,39,0],[38,52,39,52],[13,2,13,6],[13,7,13,11],[28,52,29,52],[30,0,31,0],[30,52,31,52],[26,2,26,6],[26,7,26,11],[26,12,26,16],[13,12,13,16],[15,0,16,0],[17,0,20,0],[21,0,22,0],[23,0,25,0],[32,0,33,0],[55,2,55,6],[55,7,55,11],[55,12,55,16],[28,0,29,0],[34,0,35,0],[36,0,37,0],[40,0,41,0],[42,0,43,0],[44,0,45,0],[139,0,142,0],[107,0,107,1],[119,2,119,6],[119,7,119,11],[57,0,71,0],[132,12,132,16],[134,0,138,0],[119,12,119,16],[121,0,122,0],[123,0,126,0],[127,0,128,0],[129,0,131,0],[152,0,164,0],[132,2,132,6],[132,7,132,11],[219,2,219,6],[219,7,219,11],[219,12,219,16],[207,0,207,1],[1024,0,1024,2],[1025,0,1025,1],[400,7,401,8],[400,12,401,13],[408,2,408,3],[408,7,408,8],[408,12,408,13],[409,2,409,3],[409,7,409,8],[409,12,409,13],[406,2,406,3],[406,7,406,8],[406,12,406,13],[407,2,407,3],[407,7,407,8],[407,12,407,13],[412,2,412,3],[1030,0,1032,0],[1033,0,1033,2],[221,0,223,0],[224,0,227,0],[401,1,444,1],[402,2,402,3],[402,7,402,8],[402,12,402,13],[403,2,403,3],[403,7,403,8],[403,12,403,13],[398,2,398,5],[398,7,398,10],[398,12,398,15],[399,2,399,4],[399,7,399,9],[399,12,399,14],[404,2,404,3],[404,7,404,8],[404,12,404,13],[405,2,405,3],[405,7,405,8],[405,12,405,13],[400,2,401,3],[412,7,412,8],[412,12,412,13],[413,2,413,3],[413,7,413,8],[413,12,413,13],[410,2,410,3],[410,7,410,8],[410,12,410,13],[411,2,411,3],[411,7,411,8],[411,12,411,13],[416,2,416,3],[416,7,416,8],[416,12,416,13],[417,2,417,3],[417,7,417,8],[417,12,417,13],[414,2,414,3],[414,7,414,8],[414,12,414,13],[415,2,415,3],[415,7,415,8],[415,12,415,13],[420,2,420,3],[420,7,420,8],[420,12,420,13],[421,2,421,3],[421,7,421,8],[421,12,421,13],[418,2,418,3],[418,7,418,8],[418,12,418,13],[419,2,419,3],[419,7,419,8],[419,12,419,13],[424,2,424,3],[424,7,424,8],[424,12,424,13],[425,2,425,3],[425,7,425,8],[425,12,425,13],[422,2,422,3],[422,7,422,8],[422,12,422,13],[423,2,423,3],[423,7,423,8],[423,12,423,13],[428,2,428,3],[428,7,428,8],[428,12,428,13],[429,2,429,3],[429,7,429,8],[429,12,429,13],[426,2,426,3],[426,7,426,8],[426,12,426,13],[427,2,427,3],[427,7,427,8],[427,12,427,13],[432,2,432,3],[432,7,432,8],[432,12,432,13],[433,2,433,3],[433,7,433,8],[433,12,433,13],[430,2,430,3],[430,7,430,8],[430,12,430,13],[431,2,431,3],[431,7,431,8],[431,12,431,13],[436,2,436,3],[436,7,436,8],[436,12,436,13],[437,2,437,3],[437,7,437,8],[437,12,437,13],[434,2,434,3],[434,7,434,8],[434,12,434,13],[435,2,435,3],[435,7,435,8],[435,12,435,13],[440,2,440,3],[440,7,440,8],[440,12,440,13],[441,2,441,3],[441,7,441,8],[441,12,441,13],[438,2,438,3],[438,7,438,8],[438,12,438,13],[439,2,439,3],[439,7,439,8],[439,12,439,13],[444,2,444,3],[444,7,444,8],[444,12,444,13],[445,2,445,3],[445,7,445,8],[445,12,445,13],[442,2,442,3],[442,7,442,8],[442,12,442,13],[443,2,443,3],[443,7,443,8],[443,12,443,13],[448,2,448,3],[448,7,448,8],[448,12,448,13],[449,2,449,3],[449,7,449,8],[449,12,449,13],[446,2,446,3],[446,7,446,8],[446,12,446,13],[447,2,447,3],[447,7,447,8],[447,12,447,13],[452,2,452,4],[452,7,452,8],[452,12,452,13],[453,2,453,3],[453,7,453,9],[453,12,453,13],[450,2,450,3],[450,7,450,8],[450,12,450,13],[451,2,451,3],[451,7,451,8],[451,12,451,13],[456,2,456,3],[456,7,456,8],[456,12,456,13],[457,2,457,3],[457,7,457,8],[457,12,457,13],[454,2,454,3],[454,7,454,8],[454,12,454,13],[455,2,455,3],[455,7,455,8],[455,12,455,13],[460,2,460,3],[460,7,460,8],[460,12,460,13],[461,2,461,3],[461,7,461,8],[461,12,461,13],[458,2,458,3],[458,7,458,8],[458,12,458,13],[459,2,459,3],[459,7,459,8],[459,12,459,13],[464,2,464,3],[464,7,464,8],[464,12,464,13],[465,2,465,3],[465,7,465,8],[465,12,465,13],[462,2,462,3],[462,7,462,8],[462,12,462,13],[463,2,463,3],[463,7,463,8],[463,12,463,13],[468,2,468,3],[468,7,468,8],[468,12,468,13],[469,2,469,3],[469,7,469,8],[469,12,469,13],[466,2,466,3],[466,7,466,8],[466,12,466,13],[467,2,467,3],[467,7,467,8],[467,12,467,13],[472,2,472,3],[472,7,472,8],[472,12,472,13],[473,2,473,3],[473,7,473,8],[473,12,473,13],[470,2,470,3],[470,7,470,8],[470,12,470,13],[471,2,471,3],[471,7,471,8],[471,12,471,13],[476,2,476,3],[476,7,476,8],[476,12,476,13],[477,2,477,3],[477,7,477,8],[477,12,477,13],[474,2,474,3],[474,7,474,8],[474,12,474,13],[475,2,475,3],[475,7,475,8],[475,12,475,13],[480,2,480,3],[480,7,480,8],[480,12,480,13],[481,2,481,3],[481,7,481,8],[481,12,481,13],[478,2,478,3],[478,7,478,8],[478,12,478,13],[479,2,479,3],[479,7,479,8],[479,12,479,13],[484,2,484,3],[484,7,484,8],[484,12,484,13],[485,2,485,3],[485,7,485,8],[485,12,485,13],[482,2,482,3],[482,7,482,8],[482,12,482,13],[483,2,483,3],[483,7,483,8],[483,12,483,13],[488,2,488,3],[488,7,488,8],[488,12,488,13],[489,2,489,3],[489,7,489,8],[489,12,489,13],[486,2,486,3],[486,7,486,8],[486,12,486,14],[487,2,487,3],[487,7,487,8],[487,12,487,13],[492,2,492,3],[492,7,492,8],[492,12,492,13],[493,2,493,3],[493,7,493,8],[493,12,493,13],[490,2,490,3],[490,7,490,8],[490,12,490,13],[491,2,491,3],[491,7,491,8],[491,12,491,13],[496,2,496,3],[496,7,496,8],[496,12,496,13],[497,2,497,3],[497,7,497,8],[497,12,497,13],[494,2,494,3],[494,7,494,8],[494,12,494,13],[495,2,495,3],[495,7,495,8],[495,12,495,13],[500,2,500,3],[500,7,500,8],[500,12,500,13],[501,2,501,3],[501,7,501,8],[501,12,501,13],[498,2,498,3],[498,7,498,8],[498,12,498,13],[499,2,499,3],[499,7,499,8],[499,12,499,13],[504,2,505,3],[504,4,504,6],[504,7,504,8],[504,12,504,13],[505,7,505,11],[505,12,505,13],[502,2,502,3],[502,7,502,8],[502,12,502,13],[503,2,503,6],[503,7,503,8],[503,12,503,13],[508,2,508,3],[508,7,508,8],[508,12,508,13],[509,2,509,4],[509,7,509,8],[509,12,509,13],[506,2,506,3],[506,7,507,8],[506,9,506,11],[506,12,506,13],[507,2,507,3],[507,12,507,13],[510,2,511,3],[510,7,510,8],[510,12,510,13],[511,7,511,9],[511,12,511,13],[512,2,512,3],[512,7,513,8],[512,12,512,13],[513,2,513,3],[513,12,513,13],[516,2,516,3],[516,7,516,8],[516,12,516,13],[517,2,517,3],[517,7,517,8],[517,12,517,13],[514,2,514,3],[514,7,514,8],[514,12,514,13],[515,2,515,3],[515,7,515,8],[515,12,515,13],[520,2,520,3],[520,7,520,8],[520,12,520,13],[521,2,521,3],[521,7,521,8],[521,12,521,13],[518,2,518,3],[518,7,518,8],[518,12,518,13],[519,2,519,3],[519,7,519,8],[519,12,519,13],[524,2,524,3],[524,7,524,8],[524,12,524,13],[525,2,525,3],[525,7,525,8],[525,12,525,13],[522,2,522,3],[522,7,522,8],[522,12,522,13],[523,2,523,3],[523,7,523,8],[523,12,523,13],[528,2,528,3],[528,7,528,8],[528,12,528,13],[529,2,529,3],[529,7,529,8],[529,12,529,13],[526,2,526,3],[526,7,526,8],[526,12,526,13],[527,2,527,3],[527,7,527,8],[527,12,527,13],[532,2,532,3],[532,7,532,8],[532,12,532,13],[533,2,533,3],[533,7,533,8],[533,12,533,13],[530,2,530,3],[530,7,530,8],[530,12,530,13],[531,2,531,3],[531,7,531,8],[531,12,531,13],[536,2,536,3],[536,7,536,8],[536,12,536,13],[537,2,537,3],[537,7,537,8],[537,12,537,13],[534,2,534,3],[534,7,534,8],[534,12,534,13],[535,2,535,3],[535,7,535,8],[535,12,535,13],[540,2,540,3],[540,7,540,8],[540,12,540,13],[541,2,541,3],[541,7,541,8],[541,12,541,13],[538,2,538,3],[538,7,538,8],[538,12,538,13],[539,2,539,3],[539,7,539,8],[539,12,539,13],[544,2,544,3],[544,7,544,8],[544,12,544,13],[545,2,545,3],[545,7,545,8],[545,12,545,13],[542,2,542,3],[542,7,542,8],[542,12,542,13],[543,2,543,3],[543,7,543,8],[543,12,543,13],[548,2,548,3],[548,7,548,8],[548,12,548,13],[549,2,549,3],[549,7,549,8],[549,12,549,13],[546,2,546,3],[546,7,546,8],[546,12,546,13],[547,2,547,3],[547,7,547,8],[547,12,547,13],[552,2,552,3],[552,7,552,8],[552,12,552,13],[553,2,553,3],[553,7,553,8],[553,12,553,13],[550,2,550,3],[550,7,550,8],[550,12,550,13],[551,2,551,3],[551,7,551,8],[551,12,551,13],[556,2,556,3],[556,7,556,8],[556,12,556,13],[557,2,557,3],[557,7,557,8],[557,12,557,13],[554,2,554,3],[554,7,554,8],[554,12,554,13],[555,2,555,3],[555,7,555,8],[555,12,555,13],[560,2,560,3],[560,7,560,8],[560,12,560,13],[561,2,561,4],[561,7,561,8],[561,12,561,13],[558,2,558,3],[558,7,558,8],[558,12,558,13],[559,2,559,3],[559,7,559,8],[559,12,559,13],[564,2,564,3],[564,7,564,9],[564,12,564,13],[565,2,565,3],[565,7,565,8],[565,12,565,13],[562,2,562,3],[562,7,562,8],[562,12,562,13],[563,2,563,3],[563,7,563,8],[563,12,563,13],[568,2,568,3],[568,7,568,8],[568,12,568,13],[569,2,569,3],[569,7,569,8],[569,12,569,13],[566,2,566,3],[566,7,566,8],[566,12,566,13],[567,2,567,3],[567,7,567,8],[567,12,567,13],[572,14,572,16],[573,2,573,3],[573,7,573,8],[570,2,570,3],[570,7,570,8],[570,12,570,13],[571,2,571,3],[571,7,571,8],[571,12,571,16],[574,2,574,3],[574,7,574,8],[574,12,574,13],[575,2,575,3],[575,7,575,8],[575,12,575,13],[572,2,572,3],[572,7,572,8],[572,12,573,13],[578,2,578,3],[578,7,578,8],[578,12,579,13],[579,2,579,3],[579,7,579,8],[580,2,580,3],[580,7,580,8],[580,12,580,13],[576,2,576,3],[576,7,576,8],[576,12,576,13],[577,2,577,3],[577,7,577,8],[577,12,577,14],[583,2,583,3],[583,7,583,8],[583,12,583,13],[584,2,584,3],[584,7,584,8],[584,12,584,13],[581,2,581,3],[581,7,581,8],[581,12,581,13],[582,2,582,3],[582,7,582,8],[582,12,582,13],[587,2,587,3],[587,7,587,8],[587,12,587,13],[588,2,588,3],[588,7,588,8],[588,12,588,13],[585,2,585,3],[585,7,585,8],[585,12,585,13],[586,2,586,3],[586,7,586,8],[586,12,586,13],[591,2,591,3],[591,7,591,8],[591,12,591,13],[592,2,592,3],[592,7,592,8],[592,12,592,13],[589,2,589,3],[589,7,589,8],[589,12,589,13],[590,2,590,3],[590,7,590,8],[590,12,590,13],[595,2,595,3],[595,7,595,8],[595,12,595,13],[596,2,596,3],[596,7,596,8],[596,12,596,13],[593,2,593,3],[593,7,593,8],[593,12,593,13],[594,2,594,3],[594,7,594,8],[594,12,594,13],[599,2,599,3],[599,7,599,8],[599,12,599,13],[600,2,600,3],[600,7,600,8],[600,12,600,13],[597,2,597,3],[597,7,597,8],[597,12,597,13],[598,2,598,3],[598,7,598,8],[598,12,598,13],[603,2,603,3],[603,7,603,8],[603,12,603,13],[604,2,604,3],[604,7,604,8],[604,12,604,13],[601,2,601,3],[601,7,601,8],[601,12,601,13],[602,2,602,3],[602,7,602,8],[602,12,602,13],[607,2,607,3],[607,7,607,8],[607,12,607,13],[608,2,608,3],[608,7,608,8],[608,12,608,13],[605,2,605,3],[605,7,605,8],[605,12,605,13],[606,2,606,3],[606,7,606,8],[606,12,606,13],[611,2,611,3],[611,7,611,8],[611,12,611,13],[612,2,612,3],[612,7,612,8],[612,12,612,13],[609,2,609,3],[609,7,609,8],[609,12,609,13],[610,2,610,3],[610,7,610,8],[610,12,610,13],[615,2,615,3],[615,7,615,8],[615,12,615,13],[616,2,616,3],[616,7,616,8],[616,12,616,13],[613,2,613,3],[613,7,613,8],[613,12,613,13],[614,2,614,3],[614,7,614,8],[614,12,614,13],[619,2,619,3],[619,7,619,8],[619,12,619,13],[620,2,620,3],[620,7,620,8],[620,12,620,13],[617,2,617,3],[617,7,617,8],[617,12,617,13],[618,2,618,3],[618,7,618,8],[618,12,618,13],[623,2,623,3],[623,7,623,8],[623,12,623,13],[624,2,624,3],[624,7,624,8],[624,12,624,13],[621,2,621,3],[621,7,621,8],[621,12,621,13],[622,2,622,3],[622,7,622,8],[622,12,622,13],[627,2,627,3],[627,7,627,8],[627,12,627,13],[628,2,628,3],[628,7,628,8],[628,12,628,13],[625,2,625,3],[625,7,625,8],[625,12,625,13],[626,2,626,3],[626,7,626,8],[626,12,626,13],[631,2,631,3],[631,7,631,8],[631,12,631,13],[632,2,632,3],[632,7,632,8],[632,12,632,13],[629,2,629,3],[629,7,629,8],[629,12,629,13],[630,2,630,3],[630,7,630,8],[630,12,630,13],[635,2,635,3],[635,7,635,8],[635,12,635,13],[636,2,636,3],[636,7,636,8],[636,12,636,13],[633,2,633,3],[633,7,633,8],[633,12,633,13],[634,2,634,3],[634,7,634,8],[634,12,634,13],[639,2,639,3],[639,7,639,8],[639,12,639,13],[640,2,640,3],[640,7,640,8],[640,12,640,13],[637,2,637,3],[637,7,637,8],[637,12,637,13],[638,2,638,3],[638,7,638,8],[638,12,638,13],[643,2,643,3],[643,7,643,8],[643,12,643,13],[644,2,644,3],[644,7,644,8],[644,12,644,13],[641,2,641,3],[641,7,641,8],[641,12,641,13],[642,2,642,3],[642,7,642,8],[642,12,642,13],[647,2,647,3],[647,7,647,8],[647,12,647,13],[648,2,648,3],[648,7,648,8],[648,12,648,13],[645,2,645,3],[645,7,645,8],[645,12,645,13],[646,2,646,3],[646,7,646,8],[646,12,646,13],[651,2,651,3],[651,7,651,8],[651,12,651,13],[652,2,652,3],[652,7,652,8],[652,12,652,13],[649,2,649,3],[649,7,649,8],[649,12,649,13],[650,2,650,3],[650,7,650,8],[650,12,650,13],[655,2,655,3],[655,7,655,8],[655,12,655,13],[656,2,656,3],[656,7,656,8],[656,12,656,13],[653,2,653,3],[653,7,653,8],[653,12,653,13],[654,2,654,3],[654,7,654,8],[654,12,654,13],[659,2,659,3],[659,7,659,8],[659,12,659,13],[660,2,660,3],[660,7,660,8],[660,12,660,13],[657,2,657,3],[657,7,657,8],[657,12,657,13],[658,2,658,3],[658,7,658,8],[658,12,658,13],[663,2,663,3],[663,7,663,8],[663,12,663,14],[664,2,664,3],[664,7,664,8],[664,12,664,13],[661,2,661,3],[661,7,661,8],[661,12,661,13],[662,2,662,3],[662,7,662,8],[662,12,662,13],[667,2,667,3],[667,7,667,8],[667,12,667,13],[668,2,668,3],[668,7,668,8],[668,12,668,13],[665,2,665,3],[665,7,665,8],[665,12,665,13],[666,2,666,3],[666,7,666,8],[666,12,666,13],[671,2,671,3],[671,7,671,8],[671,12,671,13],[672,2,672,3],[672,7,672,8],[672,12,672,13],[669,2,669,3],[669,7,669,8],[669,12,669,13],[670,2,670,3],[670,7,670,8],[670,12,670,13],[675,2,675,3],[675,7,675,8],[675,12,675,13],[676,2,676,3],[676,7,676,8],[676,12,676,13],[673,2,673,3],[673,7,673,8],[673,12,673,13],[674,2,674,3],[674,7,674,8],[674,12,674,13],[679,2,679,3],[679,7,679,8],[679,12,679,13],[677,2,677,3],[677,7,677,8],[677,12,677,13],[678,2,678,3],[678,7,678,8],[678,12,678,13]]}
["SLV"]
[{"$f":"A1026","v":"El Salvador"}]
[{"$f":"A1034","v":"2014"}]
["Use of drinking water sources"]
[" by wealth quintile and sub-national region"]
["Notes:"]
["WHO/UNICEF JMP customised wealth index excludes water,"]
[" sanitation and hygiene assets."]
["Survey used for analysis:",{"$f":"A1025","v":"MICS14"}]
[{"$f":"B1028","v":""}]
[{"$f":"B1027","v":""}]
[]
[]
["Use of drinking water sources",null,"NATIONAL wealth index quintile",null,null,null,null,"URBAN wealth index quintile",null,null,null,null,"RURAL wealth index quintile",null,null,null,null,"SUB-REGIONS:",null,null,null,null,null,null,null,null,null,null,null,null,null,null,null,null,null,null,null,null,null,null,null,null,null,null,null,null,null,null,null,null,null,null,"Raw numbers of respondents:","Use of drinking water sources","NATIONAL wealth index quintile",null,null,null,null,"URBAN wealth index quintile",null,null,null,null,"RURAL wealth index quintile",null,null,null,null,"SUB-REGIONS:"]
["Weighted percentage (used in graphs)",null,"Poorest","Poor","Middle","Rich","Richest","Poorest","Poor","Middle","Rich","Richest","Poorest","Poor","Middle","Rich","Richest"," Metropolitana","Central","Occidente","Oriental","Para Central",null,null,null,null,null,null,null,null,null,null,null,null,null,null,null,null,null,null,null,null,null,null,null,null,null,null,null,null,null,null,"Water data, raw numbers (weighted)",null,"Poorest","Poor","Middle","Rich","Richest","Poorest","Poor","Middle","Rich","Richest","Poorest","Poor","Middle","Rich","Richest"," Metropolitana","Central","Occidente","Oriental","Para Central"]
["Water","Improved",88.852663405113972,95.813714009825318,98.605347925448967,99.723414869597633,99.526171322481261,97.673234095855832,99.678087670451276,99.901476528957161,99.962300140697721,99.907412891921851,84.717593663554482,87.359743095513494,94.137965969599307,95.491582140486486,97.046817753374881,99.623256917796638,95.373248891508709,95.769243519597538,96.699836667374257,93.12988872727999,null,null,null,null,null,null,null,null,null,null,null,null,null,null,null,null,null,null,null,null,null,null,null,null,null,null,null,null,null,null,"Water","Improved","N/A","N/A","N/A","N/A","N/A","N/A","N/A","N/A","N/A","N/A","N/A","N/A","N/A","N/A","N/A","N/A","N/A","N/A","N/A","N/A"]
[null,"Not Improved",11.147336594886029,4.1862859901746683,1.3946520745510522,0.27658513040237082,0.4738286775187015,2.3267659041441844,0.3219123295487325,9.8523471042831379E-2,3.7699859302274104E-2,9.2587108078152625E-2,15.282406336445503,12.640256904486542,5.8620340304007357,4.5084178595134663,2.9531822466251181,0.37674308220337249,4.6267511084910611,4.2307564804023885,3.3001633326257296,6.8701112727200364,null,null,null,null,null,null,null,null,null,null,null,null,null,null,null,null,null,null,null,null,null,null,null,null,null,null,null,null,null,null,null,"Not Improved","N/A","N/A","N/A","N/A","N/A","N/A","N/A","N/A","N/A","N/A","N/A","N/A","N/A","N/A","N/A","N/A","N/A","N/A","N/A","N/A"]
["Water ladder","Basic",{"$f":"C16*C23/100","v":86.127081702126233},{"$f":"D16*D23/100","v":94.217962431149815},{"$f":"E16*E23/100","v":98.135814828537022},99.398446684688892,99.256059461383117,96.799689632614189,99.448873411317351,99.670439807926343,99.941798624769675,99.627710204778055,80.730945523661745,84.854045252343383,92.143012568095571,93.640663248005296,95.974927704374409,99.174852762022837,93.567302065218598,95.315887349321869,95.306942296947071,91.80490913972433,null,null,null,null,null,null,null,null,null,null,null,null,null,null,null,null,null,null,null,null,null,null,null,null,null,null,null,null,null,null,"Water ladder","Basic","N/A","N/A","N/A","N/A","N/A","N/A","N/A","N/A","N/A","N/A","N/A","N/A","N/A","N/A","N/A","N/A","N/A","N/A","N/A","N/A"]
[null,"Limited",{"$f":"C16*C22/100","v":2.725581702987752},{"$f":"D16*D22/100","v":1.5957515786755345},{"$f":"E16*E22/100","v":0.46953309691187411},0.32496818490871887,0.27011186109814672,0.87354446324164858,0.22921425913394813,0.23103672103081227,2.0501515928056883E-2,0.27970268714377505,3.986648139892738,2.505697843170108,1.9949534015037702,1.8509188924811935,1.0718900490004575,0.44840415577380194,1.8059468262902327,0.45335617027566605,1.3928943704272327,1.3249795875556425,null,null,null,null,null,null,null,null,null,null,null,null,null,null,null,null,null,null,null,null,null,null,null,null,null,null,null,null,null,null,null,"Limited","N/A","N/A","N/A","N/A","N/A","N/A","N/A","N/A","N/A","N/A","N/A","N/A","N/A","N/A","N/A","N/A","N/A","N/A","N/A","N/A"]
[null,"Unimproved",{"$f":"100-C18-C19-C21","v":9.2464837550236201},{"$f":"100-D18-D19-D21","v":3.2958203263388968},{"$f":"100-E18-E19-E21","v":1.2679807616040601},0.27658513040238902,0.15143691164091594,2.3267659041441622,0.30023714141727226,9.8523471042845007E-2,3.7699859302268546E-2,9.2587108078170444E-2,12.8856091438282,10.154468874114555,4.862866501798778,3.0148931028699399,1.9922727629593604,0.24884877816160109,4.1155205861190227,3.1117809043474622,2.8768647219369132,5.5700284922806924,null,null,null,null,null,null,null,null,null,null,null,null,null,null,null,null,null,null,null,null,null,null,null,null,null,null,null,null,null,null,null,"Unimproved","N/A","N/A","N/A","N/A","N/A","N/A","N/A","N/A","N/A","N/A","N/A","N/A","N/A","N/A","N/A","N/A","N/A","N/A","N/A","N/A"]
[null,"Surface water",1.9008528398623949,0.89046566383575465,0.12667131294704376,0,0.32239176587782026,0,2.1675188131428918E-2,0,0,0,2.3967971926173166,2.4857880303719551,0.99916752860188063,1.4935247566435708,0.96090948366577333,0.12789430404175969,0.51123052237214617,1.1189755760550024,0.42329861068878327,1.3000827804393349,null,null,null,null,null,null,null,null,null,null,null,null,null,null,null,null,null,null,null,null,null,null,null,null,null,null,null,null,null,null,null,"Surface water","N/A","N/A","N/A","N/A","N/A","N/A","N/A","N/A","N/A","N/A","N/A","N/A","N/A","N/A","N/A","N/A","N/A","N/A","N/A","N/A"]
["Improved water point at more than 30 minutes","Yes",3.0675295467067332,1.6654730433598435,0.47617406843578791,0.32586949146663341,0.2713978218080344,0.89435398687050549,0.22995451105739537,0.23126457091336844,2.0509247885653729E-2,0.27996189576678626,4.7058089913710504,2.8682523029292106,2.119180482556863,1.9383058181590664,1.1045081887429344,0.45009987591933392,1.8935569955728124,0.47338388987367791,1.4404309442822296,1.4227221847496141,null,null,null,null,null,null,null,null,null,null,null,null,null,null,null,null,null,null,null,null,null,null,null,null,null,null,null,null,null,null,"Improved water point at more than 30 minutes","Yes","N/A","N/A","N/A","N/A","N/A","N/A","N/A","N/A","N/A","N/A","N/A","N/A","N/A","N/A","N/A","N/A","N/A","N/A","N/A","N/A"]
[null,"No",96.932470453293291,98.334526956640175,99.523825931564133,99.674130508533352,99.728602178191977,99.105646013129501,99.770045488942614,99.768735429086618,99.979490752114359,99.720038104233183,95.294191008628943,97.131747697070793,97.880819517443172,98.061694181840934,98.895491811257045,99.549900124080665,98.106443004427305,99.526616110126326,98.559569055717816,98.577277815250369,null,null,null,null,null,null,null,null,null,null,null,null,null,null,null,null,null,null,null,null,null,null,null,null,null,null,null,null,null,null,null,"No","N/A","N/A","N/A","N/A","N/A","N/A","N/A","N/A","N/A","N/A","N/A","N/A","N/A","N/A","N/A","N/A","N/A","N/A","N/A","N/A"]
["Manually calculated ratios","Improved wells"]
[null,"Improved springs"]
[null,"Other"]
[null,null,"NATIONAL wealth index quintile",null,null,null,null,"URBAN wealth index quintile",null,null,null,null,"RURAL wealth index quintile",null,null,null,null,"SUB-REGIONS:",null,null,null,null,null,null,null,null,null,null,null,null,null,null,null,null,null,null,null,null,null,null,null,null,null,null,null,null,null,null,null,null,null,null,"Raw numbers of respondents:","Use of drinking water sources","NATIONAL wealth index quintile",null,null,null,null,"URBAN wealth index quintile",null,null,null,null,"RURAL wealth index quintile",null,null,null,null,"SUB-REGIONS:"]
["Percentage based on weighted population",null,"Poorest","Poor","Middle","Rich","Richest","Poorest","Poor","Middle","Rich","Richest","Poorest","Poor","Middle","Rich","Richest"," Metropolitana","Central","Occidente","Oriental","Para Central",null,null,null,null,null,null,null,null,null,null,null,null,null,null,null,null,null,null,null,null,null,null,null,null,null,null,null,null,null,null,"Water data, raw numbers (weighted)",null,"Poorest","Poor","Middle","Rich","Richest","Poorest","Poor","Middle","Rich","Richest","Poorest","Poor","Middle","Rich","Richest"," Metropolitana","Central","Occidente","Oriental","Para Central"]
["Piped water","Yes",64.287758182607121,76.99003444005308,84.944444390674988,92.311980919239488,93.967709641577187,87.253882179291409,93.117633171491747,95.34552195620472,97.578881102589932,95.737839730607831,55.098322163438866,58.439230807865385,69.182381080023731,70.488785027438311,67.296680920967574,96.507348693987367,81.613261926280757,80.596743971237089,72.685080090448849,74.720388212771965,null,null,null,null,null,null,null,null,null,null,null,null,null,null,null,null,null,null,null,null,null,null,null,null,null,null,null,null,null,null,"Piped water","Yes","N/A","N/A","N/A","N/A","N/A","N/A","N/A","N/A","N/A","N/A","N/A","N/A","N/A","N/A","N/A","N/A","N/A","N/A","N/A","N/A"]
[null,"No",35.712241817393142,23.00996555994687,15.055555609324909,7.6880190807604398,6.0322903584228067,12.746117820708616,6.8823668285081725,4.6544780437952333,2.4211188974100613,4.2621602693921687,44.90167783656122,41.560769192134565,30.817618919976326,29.511214972561596,32.703319079032404,3.4926513060126383,18.386738073718998,19.403256028763039,27.314919909551062,25.279611787227939,null,null,null,null,null,null,null,null,null,null,null,null,null,null,null,null,null,null,null,null,null,null,null,null,null,null,null,null,null,null,null,"No","N/A","N/A","N/A","N/A","N/A","N/A","N/A","N/A","N/A","N/A","N/A","N/A","N/A","N/A","N/A","N/A","N/A","N/A","N/A","N/A"]
["Piped water on premises","Yes",47.105653540667518,66.31200708597521,78.490762419829466,88.981747982268288,93.507479574021986,68.423515884261704,84.722310777522196,91.759630401134586,96.103369892674863,95.375233324357325,36.168336732441645,48.63023132606731,60.268983460051295,64.591987940440106,63.855902106704718,92.93104876933684,74.326179954493682,70.873504850274657,62.705164470989004,65.697409705954882,null,null,null,null,null,null,null,null,null,null,null,null,null,null,null,null,null,null,null,null,null,null,null,null,null,null,null,null,null,null,"Piped water on premises","Yes","N/A","N/A","N/A","N/A","N/A","N/A","N/A","N/A","N/A","N/A","N/A","N/A","N/A","N/A","N/A","N/A","N/A","N/A","N/A","N/A"]
[null,"No",52.894346459332908,33.687992914024697,21.50923758017035,11.018252017731658,6.4925204259779949,31.576484115738463,15.277689222477781,8.2403695988653176,3.8966301073251484,4.6247666756426744,63.831663267558369,51.36976867393269,39.731016539948769,35.408012059559873,36.144097893295282,7.0689512306631901,25.673820045506041,29.12649514972551,37.294835529010925,34.302590294045132,null,null,null,null,null,null,null,null,null,null,null,null,null,null,null,null,null,null,null,null,null,null,null,null,null,null,null,null,null,null,null,"No","N/A","N/A","N/A","N/A","N/A","N/A","N/A","N/A","N/A","N/A","N/A","N/A","N/A","N/A","N/A","N/A","N/A","N/A","N/A","N/A"]
["Piped water into dwelling","Yes","N/A","N/A","N/A","N/A","N/A","N/A","N/A","N/A","N/A","N/A","N/A","N/A","N/A","N/A","N/A","N/A","N/A","N/A","N/A","N/A",null,null,null,null,null,null,null,null,null,null,null,null,null,null,null,null,null,null,null,null,null,null,null,null,null,null,null,null,null,null,"Piped water into dwelling","Yes","N/A","N/A","N/A","N/A","N/A","N/A","N/A","N/A","N/A","N/A","N/A","N/A","N/A","N/A","N/A","N/A","N/A","N/A","N/A","N/A"]
[null,"No","N/A","N/A","N/A","N/A","N/A","N/A","N/A","N/A","N/A","N/A","N/A","N/A","N/A","N/A","N/A","N/A","N/A","N/A","N/A","N/A",null,null,null,null,null,null,null,null,null,null,null,null,null,null,null,null,null,null,null,null,null,null,null,null,null,null,null,null,null,null,null,"No","N/A","N/A","N/A","N/A","N/A","N/A","N/A","N/A","N/A","N/A","N/A","N/A","N/A","N/A","N/A","N/A","N/A","N/A","N/A","N/A"]
["Water source on premises","Yes",56.427343038796828,75.996967561276037,86.807209925436467,93.116560310337576,96.823691621103606,73.495948945169459,89.210231004408882,94.485525356180062,97.503846725331329,97.900801896278438,46.55914908701638,60.863235321043774,72.081886828320989,78.362953871818817,80.618338687212116,93.817274566254895,78.87086741225896,77.637851792549782,77.774651403684729,76.315661953182243,null,null,null,null,null,null,null,null,null,null,null,null,null,null,null,null,null,null,null,null,null,null,null,null,null,null,null,null,null,null,"Water source on premises","Yes","N/A","N/A","N/A","N/A","N/A","N/A","N/A","N/A","N/A","N/A","N/A","N/A","N/A","N/A","N/A","N/A","N/A","N/A","N/A","N/A"]
[null,"No",43.572656961203535,24.003032438723874,13.192790074563405,6.8834396896623549,3.176308378896374,26.504051054830651,10.789768995591066,5.5144746438199306,2.4961532746686785,2.0991981037215051,53.440850912983706,39.136764678956212,27.918113171679053,21.637046128181066,19.381661312787866,6.1827254337451221,21.129132587740699,22.362148207450353,22.225348596315222,23.68433804681764,null,null,null,null,null,null,null,null,null,null,null,null,null,null,null,null,null,null,null,null,null,null,null,null,null,null,null,null,null,null,null,"No","N/A","N/A","N/A","N/A","N/A","N/A","N/A","N/A","N/A","N/A","N/A","N/A","N/A","N/A","N/A","N/A","N/A","N/A","N/A","N/A"]
["Improved Water source on premises","Yes",55.358787206749696,74.738457171257934,86.341668231672557,93.093239061166884,96.807666646016969,72.687542646715215,89.011934844580665,94.485525356180062,97.466146866029064,97.900801896278438,45.316111735563851,59.15745106671595,70.640694907343786,77.479075175494103,80.152540699085208,93.817274566254895,78.555370767207549,76.867273257143054,77.037622423450301,74.81951234811784,null,null,null,null,null,null,null,null,null,null,null,null,null,null,null,null,null,null,null,null,null,null,null,null,null,null,null,null,null,null,"Improved water source on premises","Yes","N/A","N/A","N/A","N/A","N/A","N/A","N/A","N/A","N/A","N/A","N/A","N/A","N/A","N/A","N/A","N/A","N/A","N/A","N/A","N/A"]
[null,"No",44.641212793250666,25.261542828741984,13.658331768327301,6.9067609388330498,3.1923333539829999,27.312457353284881,10.988065155419269,5.5144746438199306,2.5338531339709531,2.0991981037215051,54.683888264436234,40.842548933284029,29.359305092656268,22.520924824505787,19.847459300914764,6.1827254337451221,21.444629232792085,23.132726742857081,22.962377576549663,25.180487651882054,null,null,null,null,null,null,null,null,null,null,null,null,null,null,null,null,null,null,null,null,null,null,null,null,null,null,null,null,null,null,null,"No","N/A","N/A","N/A","N/A","N/A","N/A","N/A","N/A","N/A","N/A","N/A","N/A","N/A","N/A","N/A","N/A","N/A","N/A","N/A","N/A"]
["Piped water on premises available when needed","Yes","N/A","N/A","N/A","N/A","N/A","N/A","N/A","N/A","N/A","N/A","N/A","N/A","N/A","N/A","N/A","N/A","N/A","N/A","N/A","N/A",null,null,null,null,null,null,null,null,null,null,null,null,null,null,null,null,null,null,null,null,null,null,null,null,null,null,null,null,null,null,"Piped water on premises available when needed","Yes","N/A","N/A","N/A","N/A","N/A","N/A","N/A","N/A","N/A","N/A","N/A","N/A","N/A","N/A","N/A","N/A","N/A","N/A","N/A","N/A"]
[null,"No","N/A","N/A","N/A","N/A","N/A","N/A","N/A","N/A","N/A","N/A","N/A","N/A","N/A","N/A","N/A","N/A","N/A","N/A","N/A","N/A",null,null,null,null,null,null,null,null,null,null,null,null,null,null,null,null,null,null,null,null,null,null,null,null,null,null,null,null,null,null,null,"No","N/A","N/A","N/A","N/A","N/A","N/A","N/A","N/A","N/A","N/A","N/A","N/A","N/A","N/A","N/A","N/A","N/A","N/A","N/A","N/A"]
["Water point at more than 30 minutes","Yes",4.0112050057641877,1.9374409017889276,0.49773496880904161,0.33679149498519639,0.28798557702912275,0.98354948666596387,0.27656888804790097,0.23103317153410183,2.050149458384741E-2,0.30853502248404946,6.6979032110273273,3.2160494526898056,2.5359637847971559,1.9681771860535076,1.1026785917978521,0.51299581226744562,2.5558759134066298,0.65030500613060149,1.5946878713428492,1.8632714288075343,null,null,null,null,null,null,null,null,null,null,null,null,null,null,null,null,null,null,null,null,null,null,null,null,null,null,null,null,null,null,"Water point at more than 30 minutes","Yes","N/A","N/A","N/A","N/A","N/A","N/A","N/A","N/A","N/A","N/A","N/A","N/A","N/A","N/A","N/A","N/A","N/A","N/A","N/A","N/A"]
[null,"No",95.988794994235988,98.062559098210983,99.502265031190944,99.663208505014808,99.712014422970867,99.016450513334036,99.723431111952095,99.768966828465892,99.97949850541616,99.691464977515935,93.302096788972662,96.783950547310226,97.464036215202867,98.031822813946505,98.897321408202131,99.487004187732538,97.444124086593305,99.349694993869392,98.405312128657215,98.136728571192421,null,null,null,null,null,null,null,null,null,null,null,null,null,null,null,null,null,null,null,null,null,null,null,null,null,null,null,null,null,null,null,"No","N/A","N/A","N/A","N/A","N/A","N/A","N/A","N/A","N/A","N/A","N/A","N/A","N/A","N/A","N/A","N/A","N/A","N/A","N/A","N/A"]
["Water source available when needed","Yes","N/A","N/A","N/A","N/A","N/A","N/A","N/A","N/A","N/A","N/A","N/A","N/A","N/A","N/A","N/A","N/A","N/A","N/A","N/A","N/A",null,null,null,null,null,null,null,null,null,null,null,null,null,null,null,null,null,null,null,null,null,null,null,null,null,null,null,null,null,null,"Water source available when needed","Yes","N/A","N/A","N/A","N/A","N/A","N/A","N/A","N/A","N/A","N/A","N/A","N/A","N/A","N/A","N/A","N/A","N/A","N/A","N/A","N/A"]
[null,"No","N/A","N/A","N/A","N/A","N/A","N/A","N/A","N/A","N/A","N/A","N/A","N/A","N/A","N/A","N/A","N/A","N/A","N/A","N/A","N/A",null,null,null,null,null,null,null,null,null,null,null,null,null,null,null,null,null,null,null,null,null,null,null,null,null,null,null,null,null,null,null,"No","N/A","N/A","N/A","N/A","N/A","N/A","N/A","N/A","N/A","N/A","N/A","N/A","N/A","N/A","N/A","N/A","N/A","N/A","N/A","N/A"]
["Improved water source available when needed","Yes","N/A","N/A","N/A","N/A","N/A","N/A","N/A","N/A","N/A","N/A","N/A","N/A","N/A","N/A","N/A","N/A","N/A","N/A","N/A","N/A",null,null,null,null,null,null,null,null,null,null,null,null,null,null,null,null,null,null,null,null,null,null,null,null,null,null,null,null,null,null,"Improved water source available when needed","Yes","N/A","N/A","N/A","N/A","N/A","N/A","N/A","N/A","N/A","N/A","N/A","N/A","N/A","N/A","N/A","N/A","N/A","N/A","N/A","N/A"]
[null,"No","N/A","N/A","N/A","N/A","N/A","N/A","N/A","N/A","N/A","N/A","N/A","N/A","N/A","N/A","N/A","N/A","N/A","N/A","N/A","N/A",null,null,null,null,null,null,null,null,null,null,null,null,null,null,null,null,null,null,null,null,null,null,null,null,null,null,null,null,null,null,null,"No","N/A","N/A","N/A","N/A","N/A","N/A","N/A","N/A","N/A","N/A","N/A","N/A","N/A","N/A","N/A","N/A","N/A","N/A","N/A","N/A"]
["Microbiological quality at point of collection","Not contaminated (No E. coli in 100 mL)","N/A","N/A","N/A","N/A","N/A","N/A","N/A","N/A","N/A","N/A","N/A","N/A","N/A","N/A","N/A","N/A","N/A","N/A","N/A","N/A",null,null,null,null,null,null,null,null,null,null,null,null,null,null,null,null,null,null,null,null,null,null,null,null,null,null,null,null,null,null,"Microbiological quality at point of collection","Not contaminated (No E. coli in 100 mL)","N/A","N/A","N/A","N/A","N/A","N/A","N/A","N/A","N/A","N/A","N/A","N/A","N/A","N/A","N/A","N/A","N/A","N/A","N/A","N/A"]
[null,"Contaminated (E. coli detected in 100 mL)","N/A","N/A","N/A","N/A","N/A","N/A","N/A","N/A","N/A","N/A","N/A","N/A","N/A","N/A","N/A","N/A","N/A","N/A","N/A","N/A",null,null,null,null,null,null,null,null,null,null,null,null,null,null,null,null,null,null,null,null,null,null,null,null,null,null,null,null,null,null,null,"Contaminated (E. coli detected in 100 mL)","N/A","N/A","N/A","N/A","N/A","N/A","N/A","N/A","N/A","N/A","N/A","N/A","N/A","N/A","N/A","N/A","N/A","N/A","N/A","N/A"]
[null,"Highly contaminated (>100 CFU/100 mL)","N/A","N/A","N/A","N/A","N/A","N/A","N/A","N/A","N/A","N/A","N/A","N/A","N/A","N/A","N/A","N/A","N/A","N/A","N/A","N/A",null,null,null,null,null,null,null,null,null,null,null,null,null,null,null,null,null,null,null,null,null,null,null,null,null,null,null,null,null,null,null,"Highly contaminated (>100 CFU/100 mL)","N/A","N/A","N/A","N/A","N/A","N/A","N/A","N/A","N/A","N/A","N/A","N/A","N/A","N/A","N/A","N/A","N/A","N/A","N/A","N/A"]
["Microbiological quality of improved water sources at point of collection","Not contaminated (No E. coli in 100 mL)","N/A","N/A","N/A","N/A","N/A","N/A","N/A","N/A","N/A","N/A","N/A","N/A","N/A","N/A","N/A","N/A","N/A","N/A","N/A","N/A",null,null,null,null,null,null,null,null,null,null,null,null,null,null,null,null,null,null,null,null,null,null,null,null,null,null,null,null,null,null,"Microbiological quality of improved water sources at point of collection","Not contaminated (No E. coli in 100 mL)","N/A","N/A","N/A","N/A","N/A","N/A","N/A","N/A","N/A","N/A","N/A","N/A","N/A","N/A","N/A","N/A","N/A","N/A","N/A","N/A"]
[null,"Contaminated (E. coli detected in 100 mL)","N/A","N/A","N/A","N/A","N/A","N/A","N/A","N/A","N/A","N/A","N/A","N/A","N/A","N/A","N/A","N/A","N/A","N/A","N/A","N/A",null,null,null,null,null,null,null,null,null,null,null,null,null,null,null,null,null,null,null,null,null,null,null,null,null,null,null,null,null,null,null,"Contaminated (E. coli detected in 100 mL)","N/A","N/A","N/A","N/A","N/A","N/A","N/A","N/A","N/A","N/A","N/A","N/A","N/A","N/A","N/A","N/A","N/A","N/A","N/A","N/A"]
[null,"Highly contaminated (>100 CFU/100 mL)","N/A","N/A","N/A","N/A","N/A","N/A","N/A","N/A","N/A","N/A","N/A","N/A","N/A","N/A","N/A","N/A","N/A","N/A","N/A","N/A",null,null,null,null,null,null,null,null,null,null,null,null,null,null,null,null,null,null,null,null,null,null,null,null,null,null,null,null,null,null,null,"Highly contaminated (>100 CFU/100 mL)","N/A","N/A","N/A","N/A","N/A","N/A","N/A","N/A","N/A","N/A","N/A","N/A","N/A","N/A","N/A","N/A","N/A","N/A","N/A","N/A"]
["Microbiological quality of piped on premises at point of collection","Not contaminated (No E. coli in 100 mL)","N/A","N/A","N/A","N/A","N/A","N/A","N/A","N/A","N/A","N/A","N/A","N/A","N/A","N/A","N/A","N/A","N/A","N/A","N/A","N/A",null,null,null,null,null,null,null,null,null,null,null,null,null,null,null,null,null,null,null,null,null,null,null,null,null,null,null,null,null,null,"Microbiological quality of piped on premises at point of collection","Not contaminated (No E. coli in 100 mL)","N/A","N/A","N/A","N/A","N/A","N/A","N/A","N/A","N/A","N/A","N/A","N/A","N/A","N/A","N/A","N/A","N/A","N/A","N/A","N/A"]
[null,"Contaminated (E. coli detected in 100 mL)","N/A","N/A","N/A","N/A","N/A","N/A","N/A","N/A","N/A","N/A","N/A","N/A","N/A","N/A","N/A","N/A","N/A","N/A","N/A","N/A",null,null,null,null,null,null,null,null,null,null,null,null,null,null,null,null,null,null,null,null,null,null,null,null,null,null,null,null,null,null,null,"Contaminated (E. coli detected in 100 mL)","N/A","N/A","N/A","N/A","N/A","N/A","N/A","N/A","N/A","N/A","N/A","N/A","N/A","N/A","N/A","N/A","N/A","N/A","N/A","N/A"]
[null,"Highly contaminated (>100 CFU/100 mL)","N/A","N/A","N/A","N/A","N/A","N/A","N/A","N/A","N/A","N/A","N/A","N/A","N/A","N/A","N/A","N/A","N/A","N/A","N/A","N/A",null,null,null,null,null,null,null,null,null,null,null,null,null,null,null,null,null,null,null,null,null,null,null,null,null,null,null,null,null,null,null,"Highly contaminated (>100 CFU/100 mL)","N/A","N/A","N/A","N/A","N/A","N/A","N/A","N/A","N/A","N/A","N/A","N/A","N/A","N/A","N/A","N/A","N/A","N/A","N/A","N/A"]
[null,null,"NATIONAL wealth index quintile",null,null,null,null,"URBAN wealth index quintile",null,null,null,null,"RURAL wealth index quintile",null,null,null,null,"SUB-REGIONS:",null,null,null,null,null,null,null,null,null,null,null,null,null,null,null,null,null,null,null,null,null,null,null,null,null,null,null,null,null,null,null,null,null,null,"Raw numbers of respondents:","Use of drinking water sources","NATIONAL wealth index quintile",null,null,null,null,"URBAN wealth index quintile",null,null,null,null,"RURAL wealth index quintile",null,null,null,null,"SUB-REGIONS:"]
["Percentage based on weighted population",null,"Poorest","Poor","Middle","Rich","Richest","Poorest","Poor","Middle","Rich","Richest","Poorest","Poor","Middle","Rich","Richest"," Metropolitana","Central","Occidente","Oriental","Para Central",null,null,null,null,null,null,null,null,null,null,null,null,null,null,null,null,null,null,null,null,null,null,null,null,null,null,null,null,null,null,"Water data, raw numbers (weighted)",null,"Poorest","Poor","Middle","Rich","Richest","Poorest","Poor","Middle","Rich","Richest","Poorest","Poor","Middle","Rich","Richest"," Metropolitana","Central","Occidente","Oriental","Para Central"]
["Fuente principal de agua para beber","Tubería dentro de la vivienda",12.37303289805045,24.765155887422953,38.704297292162202,46.158937345752513,38.408246900553706,27.695439790903155,42.550725485982689,49.36077056683272,49.456382440409456,35.912302152667195,8.390636324557784,12.252678301597598,18.681238745454635,23.490766630254125,25.082571232633089,40.757176789104136,32.052039666983681,35.611838057836984,21.487032361718043,25.660039661846675]
[null,"Tubería dentro del terreno, patio o lote",34.179288834841252,38.155913546131295,30.653272914823948,18.445688117275797,9.161588616875731,38.013379585432304,31.176094778231572,19.926056420695275,10.391389627794958,5.7608763968386638,27.703378994312466,35.740419835166904,40.483616499908578,35.874472765604956,31.977402623885549,10.792646796757539,30.146982146616864,30.993078906147133,31.517260838704935,33.267433286731254]
[null,"Tubería al vecino",11.038893481142955,5.0404781951800164,2.6749504735512319,0.93854519581076312,0.12523874005946223,10.616809769343103,3.3182741424892526,1.5339266344106233,0.12602231659390711,0.10116548046628884,11.535952287411067,6.5228230224573576,5.1744772350213983,2.6716011684838432,0.62688754395628932,1.3959934462656054,3.4697490206703701,5.3382589715414408,5.8369377405129628,4.6713478772241848]
[null,"Llave/grifo público",6.0355115734519256,5.4384207493810228,3.1005149593437387,1.8866361123497914,0.14814315805340336,7.9037666923531393,4.3387655213740475,1.6004116419832448,0.92823568418704139,1.6389006266247539E-2,7.3940331435861495,3.2861764593407234,3.4779289550149204,2.6056682982210848,2.8138912703065575,1.7145711210390897,3.5477244971387751,4.3189616364565611,3.4737011638663295,4.2394025582293517]
[null,"Pozo con tubería",1.6009360847756324,2.0163130058231657,1.239226013934728,0.93945996819341171,0.69724542644971776,0.94651967942069837,1.2638514794146409,0.60717399064696009,9.7698938577522154E-2,0.48837992460928825,1.4135962507455186,2.106281576316158,2.8466296327395617,2.1856725689715297,2.966682662240804,2.9231645851548832E-2,1.0024618944632044,1.2641178674211948,2.6136499367297974,2.3065498828231181]
[null,"Pozo protegido",11.189719421398808,9.7660462792127873,7.0923753395928157,3.5285035112878429,1.9218235161349448,6.1615028607887483,3.1905381320591384,2.1962119966810816,0.61223800387030303,0.98142768681393144,13.499633895055293,12.130171412401483,12.536511897908511,12.729096815438211,15.726841962044297,0.75480335109323959,4.2261250899059055,6.9446335853721006,14.37191185288067,10.195041035695656]
[null,"Pozo no protegido",2.3172052834087924,1.2781148326262755,0.50116292066286749,7.8099236072967537E-2,3.0282107594992613E-2,0.7003752221161953,0.24394299015931964,0,3.7699859302274104E-2,0,2.4713771267518845,3.302692429950377,2.2334009479297721,0.75852024259528072,0.68255543481412784,7.7733211582533893E-2,0.33124015869359352,0.9164000052890624,1.508047185292142,2.0283693750413412]
[null,"Manantial protegido",8.1850940850610474,4.2982331824388602,1.917887092298556,0.77929727506652791,0.28386925059133161,1.2576151349099127,0.54839177765037173,0.21776395036044735,0.32744069163845263,6.8379110105897159E-2,10.714989519108853,10.73825689269191,6.2441683059487376,4.849758156449437,4.1469834663700613,0.81207702590127762,5.6528505277033885,3.1353396013155193,2.6249697389914588,4.0162743642337597]
[null,"Manantial no protegido",6.448439826622641,1.8646245355697615,0.57118253121841789,0.16589495199840476,6.422774035752371E-2,1.1934530152169958,0,8.3248019840845927E-2,0,0,9.9733799069340279,6.5427848581021495,2.5936087906331764,1.8330574969488991,0.93296050304076028,0.14174070343404163,3.7276408219706481,1.7521708922229848,1.1580353604671145,3.139064964990316]
[null,"Recogen agua de lluvia",1.7567563174185501,0.5846134618706591,0.40973975788396189,0,0,0.22381013800824409,3.6006330431371074E-2,0,0,0,2.6361571385229379,1.6176726825060466,1.0808927040523582,0.72181701412806165,0.74994871364611215,0.32951429415402961,0.64367002465901113,1.2406019779118496,0.35312889137263548,0]
[null,"Carro-tanque / camión cisterna",1.5819395905879206,1.3033215406707572,0.68725897537847724,0.55868192783448878,0.19304386440373175,1.6018449387843012,0.19221303398848247,0.23961149953736369,5.2070774198059638E-2,0,1.0540511075469028,1.9816958184996836,1.1400018687541278,1.4531568666886219,2.3376814798753593,0.54246930040547336,0.66687984999417405,1.9693839107954536,0.32970885970365515,0.83938072922059015]
[null,"Carreta con tanque/tambor pequeño",0,0,5.0281354063048803E-2,0,0,0,0,0,0,0,0,0,0,0.13197795816639199,0,0,4.7572453815892014E-2,0,0,0]
[null,"Agua de superficie (río, arroyo, represa, lago, estanque, canal, canal de irrigación)",1.6910197196367054,0.84497255576298369,0.12297260575666377,0,0.32193950880469513,0,2.0881080005063921E-2,0,0,0,2.120303812050973,2.3236444764373645,0.94746583229465031,1.4521798359325728,0.95464405800017427,0.12590415496430249,0.49321415972550614,1.058637532510734,0.3982085384056121,1.2393513910731253]
[null,"Agua embotellada/envasada",0.91149111838580643,4.445218161693826,12.075543752416106,26.487665416026424,48.586971849359202,3.2525455059122805,13.063226988829635,24.219549827809399,37.970821663428048,56.578493134154364,0.37516500270755626,0.98356709453558544,2.472500124796515,8.7775938980802639,10.617926798416741,42.494773147224791,13.91719371955725,4.9530290047997942,14.091535282893666,7.9344193312753415]
[null,"Otra (especifique)",0.69067176521789564,0.19857406621564752,0.19933401691310296,3.2590942330998511E-2,5.7379320761490035E-2,0.43293766681099272,5.7088259384348986E-2,1.527545120198545E-2,0,9.2587108078152625E-2,0.71734549070862197,0.47113513999664375,8.7558459543138192E-2,0.46466028403671322,0.38302225077005653,3.1365012222494437E-2,7.4655968101312573E-2,0.50354805037960593,0.23587224846086052,0.46332554161525441]
[]
[]
[]
[]
[]
[]
[]
[]
[]
[]
[]
[]
[]
[]
[]
[]
[]
[]
[]
[]
[]
[]
[]
[]
[]
[]
[]
[]
[]
[]
[]
[]
[]
[]
[]
[{"$f":"A1026","v":"El Salvador"}]
[{"$f":"A1034","v":"2014"}]
["Use of sanitation facilities"]
[" by wealth quintile and sub-national region"]
["Notes:"]
["WHO/UNICEF JMP customised wealth index excludes water,"]
[" sanitation and hygiene assets."]
["Survey used for analysis:",{"$f":"A1025","v":"MICS14"}]
[{"$f":"B1030","v":""}]
[{"$f":"B1029","v":""}]
[]
[]
["Use of sanitation facilities",null,"NATIONAL wealth index quintile",null,null,null,null,"URBAN wealth index quintile",null,null,null,null,"RURAL wealth index quintile",null,null,null,null,"SUB-REGIONS:",null,null,null,null,null,null,null,null,null,null,null,null,null,null,null,null,null,null,null,null,null,null,null,null,null,null,null,null,null,null,null,null,null,null,"Raw numbers of respondents:","Use of sanitation facilities","NATIONAL wealth index quintile",null,null,null,null,"URBAN wealth index quintile",null,null,null,null,"RURAL wealth index quintile",null,null,null,null,"SUB-REGIONS:"]
["Weighted percentage (used in graphs)",null,"Poorest","Poor","Middle","Rich","Richest","Poorest","Poor","Middle","Rich","Richest","Poorest","Poor","Middle","Rich","Richest"," Metropolitana","Central","Occidente","Oriental","Para Central",null,null,null,null,null,null,null,null,null,null,null,null,null,null,null,null,null,null,null,null,null,null,null,null,null,null,null,null,null,null,"Sanitation data, raw numbers (weighted)",null,"Poorest","Poor","Middle","Rich","Richest","Poorest","Poor","Middle","Rich","Richest","Poorest","Poor","Middle","Rich","Richest"," Metropolitana","Central","Occidente","Oriental","Para Central"]
["Sanitation","Improved",{"$f":"C153+C154+C155+C158+C159+C161+C162","v":88.152909912550641},{"$f":"D153+D154+D155+D158+D159+D161+D162","v":96.899144711432214},98.89981864778845,99.239818554264673,99.799414838292236,96.784573203827961,99.216377650482073,99.529401128377515,99.846126561853453,99.714103174335349,82.330222921687721,89.590842220756144,95.709828855033393,97.351078488013812,98.305116961221586,99.359129087485755,96.310991702891258,96.831847531303268,94.07391838047532,95.160237544344213,null,null,null,null,null,null,null,null,null,null,null,null,null,null,null,null,null,null,null,null,null,null,null,null,null,null,null,null,null,null,"Sanitation","Improved",6996.5223630672099,7917.058967410193,8689.8335337714743,9226.3646065947141,9656.8626588478073,5261.9130356901624,5673.3579602024502,5883.1287190120365,5997.790202205364,6033.5598560237086,2438.8531470232656,2557.0371615209733,2688.6205031904424,2954.4998549389329,2997.8816898840878,12223.778466963013,8359.6735731614099,9140.6186525507328,8259.3179143468187,4503.2535226693881]
[null,"Not Improved",{"$f":"100-C122","v":11.847090087449359},{"$f":"100-D122","v":3.1008552885677858},1.1001813522115498,0.76018144573532709,0.20058516170776386,3.2154267961720393,0.78362234951792686,0.47059887162248515,0.15387343814654741,0.28589682566465058,17.669777078312279,10.409157779243856,4.2901711449666067,2.6489215119861882,1.6948830387784142,0.64087091251424511,3.6890082971087423,3.1681524686967322,5.9260816195246804,4.8397624556557872,null,null,null,null,null,null,null,null,null,null,null,null,null,null,null,null,null,null,null,null,null,null,null,null,null,null,null,null,null,null,null,"Not Improved",2805.9421736368286,1884.1104375032276,1103.4192717857834,581.74438208722631,143.9274627679074,808.53616666493679,399.27882719290022,186.06700001952564,69.536250776533109,40.316861559280369,1286.806927018416,1177.0235621368843,1043.2111643321341,776.56265418363193,731.80431389673276,128.01656361321346,1991.2327233868916,1174.8303692682084,1462.6125278741636,1762.4515436384988]
["Sanitation ladder","Basic",{"$f":"C122*C129/100","v":65.309108633923557},{"$f":"D122*D129/100","v":81.167905445136967},87.45858083051435,94.199274154289967,97.731015086245819,75.007139726390619,85.878437927987946,93.698220604378491,96.618455048208375,98.035635213403197,57.386067561061509,71.536987807232379,81.257034639853003,86.827797010817008,91.547873432144257,92.27017237636251,83.565378468811105,84.599111657705848,82.08983332690417,82.753826438127405,null,null,null,null,null,null,null,null,null,null,null,null,null,null,null,null,null,null,null,null,null,null,null,null,null,null,null,null,null,null,"Sanitation ladder","Basic",5183.4549707153365,6631.7519683381543,7684.5490609406825,8757.7432293350776,9456.7186764259477,4077.9334271065227,4910.6723200968936,5538.4508126089486,5803.9028953353754,5931.9981251720928,1699.9369915433185,2041.757078202653,2282.6216698398734,2635.1296529777132,2791.8149328718396,11351.650891022182,7253.3702920637697,7985.887264597156,7207.1626509751259,3916.1468070969227]
[null,"Limited",{"$f":"C122*C128/100","v":22.843801278627254},{"$f":"D122*D128/100","v":15.731239266295251},11.441237817274043,5.0405443999746815,2.0683997520464237,21.777433477437413,13.337939722494248,5.8311805239990129,3.227671513645058,1.6784679609321271,24.944155360626304,18.053854413523762,14.452794215180383,10.523281477196795,6.7572435290773329,7.0889567111232381,12.745613234080029,12.232735873597665,11.984085053570993,12.406411106216792,null,null,null,null,null,null,null,null,null,null,null,null,null,null,null,null,null,null,null,null,null,null,null,null,null,null,null,null,null,null,null,"Limited",1813.0673923518859,1285.3069990720389,1005.2844728307857,468.62137725963299,200.14398242186098,1183.9796085836438,762.68564010556304,344.67790640308743,193.88730686998747,101.56173085161537,738.91615547994968,515.28008331832018,405.99883335056916,319.37020196121932,206.06675701224805,872.12757594083212,1106.3032810976292,1154.7313879536009,1052.155263371679,587.10671557246383]
[null,"Unimproved",{"$f":"100-(C124+C125+C127)","v":2.4921562817342959},{"$f":"100-(D124+D125+D127)","v":1.4900538899109961},0.65452841418908747,0.62747388929031445,0.18719058213535789,2.1586741796654252,0.56981287216345322,0.47059887162249936,0.15387343814656163,0.285896825664679,2.6251430747986291,1.8113612046431626,1.7680156500456405,1.0368637002759726,1.1612621218636718,0.51877135280479081,1.458664242728787,1.2241536945635119,1.2927861599952166,1.0741213895229009,null,null,null,null,null,null,null,null,null,null,null,null,null,null,null,null,null,null,null,null,null,null,null,null,null,null,null,null,null,null,null,"Unimproved",1888.9281048994917,1726.2330636441613,1059.775352929845,568.72828031487961,142.61468813634312,744.38653588534919,386.29495421614212,186.06700001952564,69.536250776533109,40.316861559280369,726.29500466381023,855.97661714471917,949.08856686851266,716.41576954553,711.90192924531664,112.93507626466436,1760.3719002273708,974.29816673773598,1012.1667661161098,1526.5075805788392]
[null,"Open defecation",{"$f":"C163","v":9.3549338057148965},{"$f":"D163","v":1.6108013986567888},0.44565293802251782,0.13270755644504512,1.3394579572405776E-2,1.0567526165065388,0.21380947735435057,0,0,0,15.04463400351356,8.5977965746006948,2.5221554949209848,1.6120578117102311,0.53362091691474367,0.12209955970946458,2.2303440543800859,1.9439987741329767,4.6332954595296245,3.7656410661329063,null,null,null,null,null,null,null,null,null,null,null,null,null,null,null,null,null,null,null,null,null,null,null,null,null,null,null,null,null,null,null,"Open defecation",917.01406873733845,157.87737385906664,43.643918855938672,13.016101772346641,1.3127746315643023,64.149630779587781,12.983872976758036,0,0,0,560.51192235460314,321.04694499216527,94.122597463622043,60.14688463810208,19.902384651416074,15.081487348549098,230.86082315951975,200.53220253047257,450.44576175805355,235.94396305965978]
["Shared among Improved Sanitation","Yes",25.913836878769786,16.23465234202348,11.568512433798974,5.0791551953699861,2.0725569938440112,22.500934556558114,13.443284302800226,5.8587517435955361,3.2326456967217005,1.6832804061804318,30.297689566993053,20.151450713051897,15.100637403783541,10.809619822026374,6.8737454752664222,7.1346808051038861,13.233809567031388,12.632967546801307,12.73900913226789,13.037389803104963,null,null,null,null,null,null,null,null,null,null,null,null,null,null,null,null,null,null,null,null,null,null,null,null,null,null,null,null,null,null,"Shared among improved sanitation facilities","Yes","N/A","N/A","N/A","N/A","N/A","N/A","N/A","N/A","N/A","N/A","N/A","N/A","N/A","N/A","N/A","N/A","N/A","N/A","N/A","N/A"]
[null,"No",74.086163121230399,83.76534765797652,88.431487566200957,94.920844804629979,97.927443006155997,77.499065443441964,86.556715697199891,94.141248256404452,96.767354303278282,98.316719593819556,69.702310433007057,79.848549286948099,84.899362596216463,89.190380177973623,93.126254524733582,92.865319194896117,86.766190432968486,87.367032453198959,87.260990867731948,86.962610196895014,null,null,null,null,null,null,null,null,null,null,null,null,null,null,null,null,null,null,null,null,null,null,null,null,null,null,null,null,null,null,null,"No","N/A","N/A","N/A","N/A","N/A","N/A","N/A","N/A","N/A","N/A","N/A","N/A","N/A","N/A","N/A","N/A","N/A","N/A","N/A","N/A"]
["Manually calculated ratios","Improved latrines"]
[null,"Other"]
[null,"Other"]
[null,null,"NATIONAL wealth index quintile",null,null,null,null,"URBAN wealth index quintile",null,null,null,null,"RURAL wealth index quintile",null,null,null,null,"SUB-REGIONS:",null,null,null,null,null,null,null,null,null,null,null,null,null,null,null,null,null,null,null,null,null,null,null,null,null,null,null,null,null,null,null,null,null,null,"Raw numbers of respondents:","Use of sanitation facilities","NATIONAL wealth index quintile",null,null,null,null,"URBAN wealth index quintile",null,null,null,null,"RURAL wealth index quintile",null,null,null,null,"SUB-REGIONS:"]
["Percentage based on weighted population",null,"Poorest","Poor","Middle","Rich","Richest","Poorest","Poor","Middle","Rich","Richest","Poorest","Poor","Middle","Rich","Richest"," Metropolitana","Central","Occidente","Oriental","Para Central",null,null,null,null,null,null,null,null,null,null,null,null,null,null,null,null,null,null,null,null,null,null,null,null,null,null,null,null,null,null,"Sanitation data, raw numbers (weighted)",null,"Poorest","Poor","Middle","Rich","Richest","Poorest","Poor","Middle","Rich","Richest","Poorest","Poor","Middle","Rich","Richest"," Metropolitana","Central","Occidente","Oriental","Para Central"]
["Sanitation type","Sewer connection",2.1868817211201779,8.7537129238156339,27.252577450579114,54.64112259646916,76.485688293120731,13.096709624129579,37.438864957346432,59.772223619724194,73.357406375996874,85.201864130673997,0.18784424755484724,0.25828622446167221,1.3693708842533847,2.3525877436882516,3.1919766500182614,78.662792351888911,18.740508679369277,23.936946217656399,15.139490068730652,15.953151721044295,null,null,null,null,null,null,null,null,null,null,null,null,null,null,null,null,null,null,null,null,null,null,null,null,null,null,null,null,null,null,"Sanitation type","Sewer connection","N/A","N/A","N/A","N/A","N/A","N/A","N/A","N/A","N/A","N/A","N/A","N/A","N/A","N/A","N/A","N/A","N/A","N/A","N/A","N/A"]
[null,"Septic tank connection",3.8704728314717864,13.796393912446836,21.903564827456812,21.171822887454635,16.603316789158733,10.183752709814975,18.569587175212025,19.680069613313407,17.974781673310815,11.438061091135083,1.4131013795644702,4.2267511544948757,11.030580036465517,22.441930035004447,37.414501886526594,5.6357218091250907,18.997083817848431,19.462285785846365,20.49492296581349,14.649354756841193,null,null,null,null,null,null,null,null,null,null,null,null,null,null,null,null,null,null,null,null,null,null,null,null,null,null,null,null,null,null,null,"Septic tank connection","N/A","N/A","N/A","N/A","N/A","N/A","N/A","N/A","N/A","N/A","N/A","N/A","N/A","N/A","N/A","N/A","N/A","N/A","N/A","N/A"]
[null,"Improved latrines",65.3177811275186,58.226570316581096,39.576720094722809,18.255795159573029,5.4424657381142234,63.400322897710957,37.41649915019137,17.481946349382394,7.5217346575814608,2.6963000024768835,63.860022323656281,63.993687279171631,59.645648739871305,54.392036928313317,39.772451133274615,14.66506511393098,43.025128501899687,45.211730381331961,49.321120883675917,41.268950525164385,null,null,null,null,null,null,null,null,null,null,null,null,null,null,null,null,null,null,null,null,null,null,null,null,null,null,null,null,null,null,null,"Improved latrines","N/A","N/A","N/A","N/A","N/A","N/A","N/A","N/A","N/A","N/A","N/A","N/A","N/A","N/A","N/A","N/A","N/A","N/A","N/A","N/A"]
[null,"Unimproved facilities",19.269930514174803,17.612521448499646,10.821484689218529,5.7985518000581227,1.455134600033984,12.262462151838063,6.3612392398958173,3.0657604175799351,1.1460772931108441,0.66377477571398358,19.494398045710838,22.92347876727111,25.432244844488856,19.201387481283703,19.087449413265738,0.91432116534559926,17.006934946502156,9.4450388410327797,10.411170622250189,24.362901930817269,null,null,null,null,null,null,null,null,null,null,null,null,null,null,null,null,null,null,null,null,null,null,null,null,null,null,null,null,null,null,null,"Unimproved facilities","N/A","N/A","N/A","N/A","N/A","N/A","N/A","N/A","N/A","N/A","N/A","N/A","N/A","N/A","N/A","N/A","N/A","N/A","N/A","N/A"]
[null,"Open defecation",9.3549338057148965,1.6108013986567888,0.44565293802251782,0.13270755644504512,1.3394579572405776E-2,1.0567526165065388,0.21380947735435057,0,0,0,15.04463400351356,8.5977965746006948,2.5221554949209848,1.6120578117102311,0.53362091691474367,0.12209955970946458,2.2303440543800859,1.9439987741329767,4.6332954595296245,3.7656410661329063,null,null,null,null,null,null,null,null,null,null,null,null,null,null,null,null,null,null,null,null,null,null,null,null,null,null,null,null,null,null,null,"Open defecation","N/A","N/A","N/A","N/A","N/A","N/A","N/A","N/A","N/A","N/A","N/A","N/A","N/A","N/A","N/A","N/A","N/A","N/A","N/A","N/A"]
["Septic tank emptying practices","Not emptied/treated and disposed in situ","N/A","N/A","N/A","N/A","N/A","N/A","N/A","N/A","N/A","N/A","N/A","N/A","N/A","N/A","N/A","N/A","N/A","N/A","N/A","N/A",null,null,null,null,null,null,null,null,null,null,null,null,null,null,null,null,null,null,null,null,null,null,null,null,null,null,null,null,null,null,"Septic tank emptying practices","Not emptied/treated and disposed in situ","N/A","N/A","N/A","N/A","N/A","N/A","N/A","N/A","N/A","N/A","N/A","N/A","N/A","N/A","N/A","N/A","N/A","N/A","N/A","N/A"]
[null,"Emptied and buried on site","N/A","N/A","N/A","N/A","N/A","N/A","N/A","N/A","N/A","N/A","N/A","N/A","N/A","N/A","N/A","N/A","N/A","N/A","N/A","N/A",null,null,null,null,null,null,null,null,null,null,null,null,null,null,null,null,null,null,null,null,null,null,null,null,null,null,null,null,null,null,null,"Emptied and buried on site","N/A","N/A","N/A","N/A","N/A","N/A","N/A","N/A","N/A","N/A","N/A","N/A","N/A","N/A","N/A","N/A","N/A","N/A","N/A","N/A"]
[null,"Emptied and discharged locally","N/A","N/A","N/A","N/A","N/A","N/A","N/A","N/A","N/A","N/A","N/A","N/A","N/A","N/A","N/A","N/A","N/A","N/A","N/A","N/A",null,null,null,null,null,null,null,null,null,null,null,null,null,null,null,null,null,null,null,null,null,null,null,null,null,null,null,null,null,null,null,"Emptied and discharged locally","N/A","N/A","N/A","N/A","N/A","N/A","N/A","N/A","N/A","N/A","N/A","N/A","N/A","N/A","N/A","N/A","N/A","N/A","N/A","N/A"]
[null,"Emptied and removed offsite","N/A","N/A","N/A","N/A","N/A","N/A","N/A","N/A","N/A","N/A","N/A","N/A","N/A","N/A","N/A","N/A","N/A","N/A","N/A","N/A",null,null,null,null,null,null,null,null,null,null,null,null,null,null,null,null,null,null,null,null,null,null,null,null,null,null,null,null,null,null,null,"Emptied and removed offsite","N/A","N/A","N/A","N/A","N/A","N/A","N/A","N/A","N/A","N/A","N/A","N/A","N/A","N/A","N/A","N/A","N/A","N/A","N/A","N/A"]
["Latrine emptying practices","Not emptied/treated and disposed in situ","N/A","N/A","N/A","N/A","N/A","N/A","N/A","N/A","N/A","N/A","N/A","N/A","N/A","N/A","N/A","N/A","N/A","N/A","N/A","N/A",null,null,null,null,null,null,null,null,null,null,null,null,null,null,null,null,null,null,null,null,null,null,null,null,null,null,null,null,null,null,"Latrine emptying practices","Not emptied/treated and disposed in situ","N/A","N/A","N/A","N/A","N/A","N/A","N/A","N/A","N/A","N/A","N/A","N/A","N/A","N/A","N/A","N/A","N/A","N/A","N/A","N/A"]
[null,"Emptied and buried on site","N/A","N/A","N/A","N/A","N/A","N/A","N/A","N/A","N/A","N/A","N/A","N/A","N/A","N/A","N/A","N/A","N/A","N/A","N/A","N/A",null,null,null,null,null,null,null,null,null,null,null,null,null,null,null,null,null,null,null,null,null,null,null,null,null,null,null,null,null,null,null,"Emptied and buried on site","N/A","N/A","N/A","N/A","N/A","N/A","N/A","N/A","N/A","N/A","N/A","N/A","N/A","N/A","N/A","N/A","N/A","N/A","N/A","N/A"]
[null,"Emptied and discharged locally","N/A","N/A","N/A","N/A","N/A","N/A","N/A","N/A","N/A","N/A","N/A","N/A","N/A","N/A","N/A","N/A","N/A","N/A","N/A","N/A",null,null,null,null,null,null,null,null,null,null,null,null,null,null,null,null,null,null,null,null,null,null,null,null,null,null,null,null,null,null,null,"Emptied and discharged locally","N/A","N/A","N/A","N/A","N/A","N/A","N/A","N/A","N/A","N/A","N/A","N/A","N/A","N/A","N/A","N/A","N/A","N/A","N/A","N/A"]
[null,"Emptied and removed offsite","N/A","N/A","N/A","N/A","N/A","N/A","N/A","N/A","N/A","N/A","N/A","N/A","N/A","N/A","N/A","N/A","N/A","N/A","N/A","N/A",null,null,null,null,null,null,null,null,null,null,null,null,null,null,null,null,null,null,null,null,null,null,null,null,null,null,null,null,null,null,null,"Emptied and removed offsite","N/A","N/A","N/A","N/A","N/A","N/A","N/A","N/A","N/A","N/A","N/A","N/A","N/A","N/A","N/A","N/A","N/A","N/A","N/A","N/A"]
["Shared among improved sanitation facilities","Yes",18.496036232144451,13.113812709202865,10.265072216458327,4.7778973276132826,2.0421208896254384,19.503986758085485,12.559381810692654,5.6791364516761078,3.1955970784248486,1.6721072154396697,19.833160857274795,13.799456448409217,10.879344770127233,8.5597655139882818,5.525043041246799,7.0607354945732643,10.687984698176068,11.19419412098441,10.822493224209001,9.3701620066585889,null,null,null,null,null,null,null,null,null,null,null,null,null,null,null,null,null,null,null,null,null,null,null,null,null,null,null,null,null,null,"Shared among improved sanitation facilities","Yes","N/A","N/A","N/A","N/A","N/A","N/A","N/A","N/A","N/A","N/A","N/A","N/A","N/A","N/A","N/A","N/A","N/A","N/A","N/A","N/A"]
[null,"No",52.87909944796619,67.662864443640714,78.467790156300353,89.290843315883421,96.489349930768142,67.176798473570045,80.865569472057203,91.255103130743905,95.658325628464297,97.664118008846316,45.627807093500842,54.679268209718956,61.166254890462987,70.626789193017743,74.85388662857271,91.902843780371683,70.07473630094124,77.41676826384996,74.133040694010944,62.501294996391245,null,null,null,null,null,null,null,null,null,null,null,null,null,null,null,null,null,null,null,null,null,null,null,null,null,null,null,null,null,null,null,"No","N/A","N/A","N/A","N/A","N/A","N/A","N/A","N/A","N/A","N/A","N/A","N/A","N/A","N/A","N/A","N/A","N/A","N/A","N/A","N/A"]
[null,"DK/missing",28.624864319889689,19.223322847156432,11.267137627241045,5.9312593565031682,1.4685291796063897,13.319214768344597,6.5750487172501693,3.0657604175799351,1.1460772931108441,0.66377477571398358,34.539032049224467,31.521275341871803,27.954400339409823,20.813445292993929,19.621070330180483,1.0364207250550639,19.23727900088225,11.389037615165755,15.044466081779817,28.128542996950173,null,null,null,null,null,null,null,null,null,null,null,null,null,null,null,null,null,null,null,null,null,null,null,null,null,null,null,null,null,null,null,"DK/missing","N/A","N/A","N/A","N/A","N/A","N/A","N/A","N/A","N/A","N/A","N/A","N/A","N/A","N/A","N/A","N/A","N/A","N/A","N/A","N/A"]
["Shared among all sanitation facilities","Yes",26.4810892339977,16.575333437176127,11.921849779410913,5.6884294240706073,2.1808051171220071,23.129252147181916,13.620051347312303,6.487016504771927,3.2117678805034675,1.6721072154396697,31.054461903060382,20.84374776134759,15.212872744876901,11.898069281025768,7.9635990370502663,7.2414663842685911,14.465814290695326,13.879145074317195,13.701150672452558,14.148654024523461,null,null,null,null,null,null,null,null,null,null,null,null,null,null,null,null,null,null,null,null,null,null,null,null,null,null,null,null,null,null,"Shared among all sanitation facilities","Yes","N/A","N/A","N/A","N/A","N/A","N/A","N/A","N/A","N/A","N/A","N/A","N/A","N/A","N/A","N/A","N/A","N/A","N/A","N/A","N/A"]
[null,"No",73.518910766002392,83.424666562823788,88.078150220588782,94.311570575929281,97.819194882877923,76.87074785281817,86.379948652687631,93.512983495228013,96.788232119496556,98.327892784560319,68.9455380969396,79.156252238652371,84.787127255123167,88.101930718974202,92.036400962949699,92.758533615731395,85.534185709304481,86.120854925682849,86.298849327547231,85.851345975476406,null,null,null,null,null,null,null,null,null,null,null,null,null,null,null,null,null,null,null,null,null,null,null,null,null,null,null,null,null,null,null,"No","N/A","N/A","N/A","N/A","N/A","N/A","N/A","N/A","N/A","N/A","N/A","N/A","N/A","N/A","N/A","N/A","N/A","N/A","N/A","N/A"]
["Tipo de instalación sanitaria","Inodoro conectado al alcantarillado",2.1868817211201779,8.7537129238156339,27.252577450579114,54.64112259646916,76.485688293120731,13.096709624129579,37.438864957346432,59.772223619724194,73.357406375996874,85.201864130673997,0.18784424755484724,0.25828622446167221,1.3693708842533847,2.3525877436882516,3.1919766500182614,78.662792351888911,18.740508679369277,23.936946217656399,15.139490068730652,15.953151721044295,null,null,null,null,null,null,null,null,null,null,null,null,null,null,null,null,null,null,null,null,null,null,null,null,null,null,null,null,null,null,"Tipo de instalación sanitaria","Inodoro conectado al alcantarillado",214.3683051724679,857.96623288296985,2668.9138057655091,5359.2608569010154,7496.2017826819674,795.02910491273701,2273.5262861830879,3627.6932370982745,4450.8333222722868,5175.0561883797018,6.9984381325349592,9.6445644622420765,51.102616304401721,87.776519298964843,119.05070635968301,9716.2668766331099,1939.8124928980219,2469.2034844625659,1471.850693788949,999.57743562125609]
[null,"Inodoro conectado a tanque séptico",3.8704728314717864,13.796393912446836,21.903564827456812,21.171822887454635,16.603316789158733,10.183752709814975,18.569587175212025,19.680069613313407,17.974781673310815,11.438061091135083,1.4131013795644702,4.2267511544948757,11.030580036465517,22.441930035004447,37.414501886526594,5.6357218091250907,18.997083817848431,19.462285785846365,20.49492296581349,14.649354756841193,null,null,null,null,null,null,null,null,null,null,null,null,null,null,null,null,null,null,null,null,null,null,null,null,null,null,null,null,null,null,null,"Inodoro conectado a tanque séptico",379.40172670778577,1352.207939128077,2145.0714769819715,2076.5554636922602,1627.2562317324334,618.19953514277859,1127.6635820693755,1194.4219424736491,1090.588683330529,694.73372955737284,52.647353904165648,157.82945474674827,411.64267891224341,837.32243785956769,1395.4434402460934,696.11280635661353,1966.3703450622381,2007.6221687196978,1992.5021549231628,917.8853631808139]
[null,"Letrina (pozo negro, hoyo)",23.520499181882563,17.269365593590212,12.631571957333932,4.3607256466974009,1.180916002960555,21.050646604594025,10.336723526425041,4.3588186097432349,1.0860269170269687,0.69545403676472051,22.686245946573617,22.814121708410198,18.238124040085864,17.159163587853261,12.936039550466205,4.4033927561113906,14.806990187085828,13.155364998138777,16.441253409640623,11.916871938004515,null,null,null,null,null,null,null,null,null,null,null,null,null,null,null,null,null,null,null,null,null,null,null,null,null,null,null,null,null,null,null,"Letrina (pozo negro, hoyo)",2305.588591159797,1692.5997769816088,1237.0417750975917,427.70472412548685,115.73909896273726,1277.868808899168,627.7116754770376,264.54523246288755,65.892798423281022,42.241020820543412,845.21240753039228,851.89315816124645,680.61608848997196,640.21911950540357,482.47365655728947,543.89804762612027,1532.6576796043612,1357.0349700172194,1598.4072203145486,746.6760487649716]
[null,"Baldeo a otra parte",0.196596749709568,0.35881826444729992,6.2833187306272839E-2,0.21373486925144294,0.17717980402469646,0.39966827998667481,6.0041009211936468E-2,0.17400470686272379,0.13770263606792521,0.2858968256645929,0.32122503051036005,6.4543168963776612E-2,0.37316165800822448,0.11744092759477801,5.4905271824331602E-2,0.19977649516138657,0.19840498431795395,0.3371817495963263,0.1705232666079462,3.7487131265798161E-2,null,null,null,null,null,null,null,null,null,null,null,null,null,null,null,null,null,null,null,null,null,null,null,null,null,null,null,null,null,null,null,"Baldeo a otra parte",19.271326670593165,35.168385954250084,6.1534128786926239,20.963348922998382,17.36502073035054,24.261659914517431,3.6460724129274884,10.560686219825854,8.3548684646026157,17.36502073035054,11.967752709552691,2.410081122080511,13.925764924603213,4.3817944198545398,2.0477942385699102,24.675983201603501,20.536714014432832,34.78181149048627,16.578153367427586,2.3488330829346027]
[null,"Sitio desconocido/ no está seguro/ NS dónde",0,0,2.2041903663589858E-2,0,0,0,0,0,0,0,0,0,0,5.7855352025189981E-2,0,0,0,2.0926082271037302E-2,0,0,null,null,null,null,null,null,null,null,null,null,null,null,null,null,null,null,null,null,null,null,null,null,null,null,null,null,null,null,null,null,null,"Sitio desconocido/ no está seguro/ NS dónde",0,0,2.1586193489327465,0,0,0,0,0,0,0,0,0,0,2.1586193489327465,0,0,0,2.1586193489327465,0,0]
[null,"Letrina de fosa mejorada con ventilación",7.067349656223626E-2,0.28167501722614863,0.33359809734643753,0.32393242830974689,4.7358005222939009E-2,0.27357787906120445,0.57258639408554424,0.32134267070311395,0.20220982173357788,5.9578603274310464E-2,5.1801778767950717E-2,0.14940476364403091,0.12657434964239558,4.035462357761152E-2,8.3425360486049996E-2,3.9031870412058584E-3,0.1423987473981822,0.33724626728316565,0.51170227555675818,6.1619860745188611E-2,null,null,null,null,null,null,null,null,null,null,null,null,null,null,null,null,null,null,null,null,null,null,null,null,null,null,null,null,null,null,null,"Letrina de fosa mejorada con ventilación",6.9277444373619428,27.607445609653883,32.670105027665691,31.771645618303992,4.6414586976840626,16.607406177290873,34.771092006859305,19.502915613735087,12.268730004568905,3.6187309129394802,1.9299581892009403,5.5788645985056142,4.7235416629156664,1.5056562310017991,3.111503993651902,0.48211366298976044,14.7395609106444,34.788466779582244,49.747339300890019,3.8609187365631463]
[null,"Letrina de fosa con losa",41.726608449073908,40.675529705764809,26.589508136378861,13.535291494717356,4.2141917299307297,42.076098414055657,26.507189229680812,12.743856890595145,6.2334979188209152,1.9412673624378527,41.121974598314765,41.030160807117412,41.280950350143073,37.134663364857282,26.752986222322324,10.257769170778394,28.075739567415631,31.664110421117186,32.368165198478586,29.29045872641467,null,null,null,null,null,null,null,null,null,null,null,null,null,null,null,null,null,null,null,null,null,null,null,null,null,null,null,null,null,null,null,"Letrina de fosa con losa",4090.2359955898128,3986.6775728078906,2603.9777515498035,1327.5561417376762,413.02408677299752,2554.2081805581865,1609.6853244660965,773.4496168435096,378.20666817469737,117.91018635315015,1532.0649892669749,1532.0911195522315,1540.5355778209107,1385.5175026950624,997.80238272736688,1267.0186226841859,2906.0934946861371,3266.2951687028062,3146.8105060192706,1835.2537563657841]
[null,"Letrina de fosa sin losa/Foso abierto",1.8447963157456535,0.97457917233509905,0.50805773386261965,0.40884581253569469,1.0010778110751293E-2,1.4280700472219718,0.45489255042776644,0.28868650866872669,1.6170802078618741E-2,0,1.78145513638688,1.5931576505682026,1.0878371574542474,0.71442298390362635,1.1063568500392691,0.2931901703670996,1.0884411209755864,0.73009650564376938,0.86644541278713105,0.93790712403746224,null,null,null,null,null,null,null,null,null,null,null,null,null,null,null,null,null,null,null,null,null,null,null,null,null,null,null,null,null,null,null,"Letrina de fosa sin losa/Foso abierto",180.83550462539,95.520155665566165,49.755378275351731,40.100042889163213,0.98113535217538139,86.690266790658228,27.623972360397516,17.520949225544047,0.98113535217538139,0,66.370962753330758,59.48947409581757,40.596251532955023,26.655568108982948,41.263636587784987,36.214248893541381,112.66352052528326,75.312732849764572,84.235220350979432,58.766494188077857]
[null,"Letrina abonera",16.77777423243997,16.122467558588578,10.188998178693295,5.1710779107678517,1.2679440178985364,10.103787972172507,5.7914263677322024,2.5951615459575055,0.99220385496430008,0.37787795004939073,16.869254970912074,21.112117562627962,23.664229194443166,18.222379133032959,17.926187291402137,0.39554981254078397,15.548270703773904,8.2418112287396976,9.1183844622552126,23.288780541294347,null,null,null,null,null,null,null,null,null,null,null,null,null,null,null,null,null,null,null,null,null,null,null,null,null,null,null,null,null,null,null,"Letrina abonera",1644.6353691831932,1580.1903576694751,997.8343499930611,507.18495737776834,124.26853205381721,613.34531636439601,351.69228812182035,157.50543344920629,60.200246959755106,22.951840828929825,628.49109723956258,788.33928983856345,883.10919895335246,679.88835610276647,668.59049841896172,48.857502088866134,1609.3869312813131,850.17983577519374,886.48299487473832,1459.2063022572049]
[null,"Inodoro de compostaje",0,0,0,3.5845589848522E-2,0,0,0,5.7928178340901276E-2,0,0,0,0,0,0,0,0,0,3.408261252168937E-2,0,0,null,null,null,null,null,null,null,null,null,null,null,null,null,null,null,null,null,null,null,null,null,null,null,null,null,null,null,null,null,null,null,"Inodoro de compostaje",0,0,0,3.5157745199789501,0,0,0,3.5157745199789501,0,0,0,0,0,0,0,0,0,3.5157745199789501,0,0]
[null,"No hay instalacion sanitaria",9.3549338057148965,1.6108013986567888,0.44565293802251782,0.13270755644504512,1.3394579572405776E-2,1.0567526165065388,0.21380947735435057,0,0,0,15.04463400351356,8.5977965746006948,2.5221554949209848,1.6120578117102311,0.53362091691474367,0.12209955970946458,2.2303440543800859,1.9439987741329767,4.6332954595296245,3.7656410661329063,null,null,null,null,null,null,null,null,null,null,null,null,null,null,null,null,null,null,null,null,null,null,null,null,null,null,null,null,null,null,null,"No hay instalacion sanitaria",917.01406873733845,157.87737385906664,43.643918855938672,13.016101772346641,1.3127746315643023,64.149630779587781,12.983872976758036,0,0,0,560.51192235460314,321.04694499216527,94.122597463622043,60.14688463810208,19.902384651416074,15.081487348549098,230.86082315951975,200.53220253047257,450.44576175805355,235.94396305965978]
[null,"Otros",0.45076321627960392,7.2786566386429163E-2,5.5360652847240123E-3,0,0,0.33093585245690449,5.4879312523911344E-2,0,0,0,0.52246290790152294,0.15366038511116911,8.6743510069288349E-2,0,0,2.5804687276328824E-2,0.13243398398412159,0.13129680994685011,0.1712640091657095,7.6168873343851501E-2,null,null,null,null,null,null,null,null,null,null,null,null,null,null,null,null,null,null,null,null,null,null,null,null,null,null,null,null,null,null,null,"Otros",44.185904420314614,7.1339346755536912,0.54216086881371683,0,0,20.089292815777196,3.3326213209967075,0,0,0,19.465191961364198,5.7377720882575742,3.237121778286336,0,0,3.1873420806533193,13.708117586982256,13.543855497341838,16.65016784364926,4.7725169560553393]
[null,"Omitido",0,8.3869886742235722E-2,5.6059524071619939E-2,4.8932075031315738E-3,0,0,0,7.9076560909801738E-3,0,0,0,0,0.22027332451392831,0.14714443675233607,0,0,3.9384153450591854E-2,4.6525471061353739E-3,8.4553471434194075E-2,2.2558260875807291E-2,null,null,null,null,null,null,null,null,null,null,null,null,null,null,null,null,null,null,null,null,null,null,null,null,null,null,null,null,null,null,null,"Omitido",0,8.220229679315544,5.4900509139259777,0.4799311249495074,0,0,0,0.4799311249495074,0,0,0,0,8.220229679315544,5.4900509139259777,0,0,4.0766168193595709,0.4799311249495074,8.220229679315544,1.413434094566407]
[null,null,null,null,null,null,null,null,null,null,null,null,null,null,null,null,null,null,null,null,null,null,null,null,null,null,null,null,null,null,null,null,null,null,null,null,null,null,null,null,null,null,null,null,null,null,null,null,null,null,null,null,null,"Total",9802.4645367040193,9801.1694049134203,9793.2528055572784,9808.1089886819482,9800.7901216157188,6070.4492023550956,6072.6367873953559,6069.1957190315643,6067.3264529818962,6073.8767175829908,3725.6600740416802,3734.0607236578585,3731.8316675225751,3731.0625091225661,3729.6860037808206,12351.795030576226,10350.906296548335,10315.449021818953,9721.9304422209916,6265.7050663078853]
[]
[]
[]
[]
[]
[]
[]
[]
[]
[]
[]
[]
[]
[]
[]
[]
[]
[]
[]
[]
[]
[]
[]
[]
[]
[]
[]
[]
[]
[]
[]
[]
[]
[]
[]
[]
[]
[]
[]
[]
[]
[{"$f":"A1026","v":"El Salvador"}]
[{"$f":"A1034","v":"2014"}]
["Access to hygiene facilities "]
[" by wealth quintile and sub-national region"]
["Notes:"]
["WHO/UNICEF JMP customised wealth index excludes water,"]
[" sanitation and hygiene assets."]
["Survey used for analysis:",{"$f":"A1025","v":"MICS14"}]
[]
[]
[]
[]
["Access to handwashing",null,"NATIONAL wealth index quintile",null,null,null,null,"URBAN wealth index quintile",null,null,null,null,"RURAL wealth index quintile",null,null,null,null,"SUB-REGIONS:",null,null,null,null,null,null,null,null,null,null,null,null,null,null,null,null,null,null,null,null,null,null,null,null,null,null,null,null,null,null,null,null,null,null,"Raw numbers of respondents:","Access to handwashing","NATIONAL wealth index quintile",null,null,null,null,"URBAN wealth index quintile",null,null,null,null,"RURAL wealth index quintile",null,null,null,null,"SUB-REGIONS:"]
["Weighted percentage (used in graphs)",null,"Poorest","Poor","Middle","Rich","Richest","Poorest","Poor","Middle","Rich","Richest","Poorest","Poor","Middle","Rich","Richest"," Metropolitana","Central","Occidente","Oriental","Para Central",null,null,null,null,null,null,null,null,null,null,null,null,null,null,null,null,null,null,null,null,null,null,null,null,null,null,null,null,null,null,"Hygiene data, raw numbers (weighted)",null,"Poorest","Poor","Middle","Rich","Richest","Poorest","Poor","Middle","Rich","Richest","Poorest","Poor","Middle","Rich","Richest"," Metropolitana","Central","Occidente","Oriental","Para Central"]
["Hygiene ladder","Basic",81.760965795765202,88.492991915246193,93.245483234457254,93.243480078667204,93.890873295496718,87.570330759578667,93.55983214291426,93.717917966903102,93.330312733897472,94.257158631960749,75.261346976927683,84.899414320112342,88.256768187453133,90.324397507953762,92.903692429286906,91.279483384252316,89.268981285084976,91.269222109723529,87.470263167989401,90.545766900828539,null,null,null,null,null,null,null,null,null,null,null,null,null,null,null,null,null,null,null,null,null,null,null,null,null,null,null,null,null,null,"Hygiene ladder","Basic",7842.2545060739558,8346.4528985474444,8657.9070394802711,8226.5118809559281,7920.3011860276129,5043.73431113892,5332.7572079294405,5102.2347712567243,4964.4624538638154,4795.916366897718,2762.710350625237,3134.0262233370509,3222.0870429277079,3262.1393472887084,3373.3594358198989,9672.0618627869044,8840.116444297355,8892.694494658519,8167.0942914982843,5421.4604178441241]
[null,"Limited",13.101080407084464,8.734347228957013,4.9909116391850539,4.674669608913729,3.7138404099648574,9.5764680658382524,4.827274526959954,4.4439163715304497,4.2182362692131115,3.0696848340587186,17.053097762364828,11.3066536825912,8.1202891589250115,7.7714913915901285,5.5031400106588251,5.7524908462609288,7.3047258328994769,6.4462569169025317,9.9493783068482866,6.3394266208047574,null,null,null,null,null,null,null,null,null,null,null,null,null,null,null,null,null,null,null,null,null,null,null,null,null,null,null,null,null,null,null,"Limited",1256.614398532666,823.80328846682642,463.4095670422401,412.4280329823365,313.28640975770702,551.56992264656094,275.14674234320432,241.93777586253105,224.37807146047655,156.18921629458063,625.98892513513465,417.3803720932944,296.45634007611687,280.67375543124132,199.82057543863391,609.53946349514433,723.37138866048042,628.08241454252925,928.97297699630656,379.57545308731409]
[null,"No facility",5.1379537971505584,2.7726608557967545,1.7636051263576098,2.0818503124191921,2.3952862945384306,2.8532011745832198,1.6128933301257735,1.8381656615664266,2.4514509968893683,2.6731565339806469,7.6855552607074173,3.7939319972964283,3.6229426536218483,1.9041111004561073,1.5931675600541899,2.9680257694868195,3.4262928820155496,2.2845209733739553,2.5803585251622545,3.1148064783665346,null,null,null,null,null,null,null,null,null,null,null,null,null,null,null,null,null,null,null,null,null,null,null,null,null,null,null,null,null,null,null,"No facility",492.81635711537479,261.51091443170895,163.75194495975973,183.67360715236285,202.05785944498552,164.33406766883945,91.932278359703602,100.07427562663618,130.39853907104833,136.01338464546365,282.12308073050906,140.05140629418639,132.26675779370561,68.768526707970594,57.848366206129036,314.49486553267229,339.29846194341286,222.58924326572233,240.92795217042206,186.50016019196246]
["Lugar que usan con mayor frecuencia los miembros del hogar","Lugar observado",92.822257816257476,93.562878144082845,93.13878430000851,88.079566855416772,84.009426725974706,92.172820285106994,92.347099729604579,88.054048584414431,85.521037404772343,81.531216609264874,90.955675193529757,95.108431765175311,94.284622042978015,94.95453624959805,95.803775643214067,83.239733988707513,92.392758266461371,92.29629160168362,93.562357008764835,92.583928058231265,null,null,null,null,null,null,null,null,null,null,null,null,null,null,null,null,null,null,null,null,null,null,null,null,null,null,null,null,null,null,"Observed handwashing place","Fixed","N/A","N/A","N/A","N/A","N/A","N/A","N/A","N/A","N/A","N/A","N/A","N/A","N/A","N/A","N/A","N/A","N/A","N/A","N/A","N/A"]
[null,"No está en la vivienda/patio/lote",2.1788193456727933,0.89322316976899863,0.8575150761755338,0.8469613201458942,1.0205276438183724,1.3522964113778306,0.60572869802953977,0.93293145372546726,0.78919559529622552,1.3513282134153666,3.4105631329001387,1.1438162817234632,1.1531611543565499,0.56890470113484748,0.76949896111062688,1.2491512178655759,1.4721787799428423,1.0864075226134347,1.0648629362062725,0.73294382909885269,null,null,null,null,null,null,null,null,null,null,null,null,null,null,null,null,null,null,null,null,null,null,null,null,null,null,null,null,null,null,null,"Mobile","N/A","N/A","N/A","N/A","N/A","N/A","N/A","N/A","N/A","N/A","N/A","N/A","N/A","N/A","N/A","N/A","N/A","N/A","N/A","N/A"]
[null,"No obtuvo permiso para ver el lugar",2.1502681717725909,3.7689615208798917,5.1891262705544952,10.047762200935296,13.928924601441828,5.1200642743242266,6.1390228300300143,10.297062827055894,12.329769864598109,16.229465884475438,1.471892670318399,1.1409220440205674,2.171092748640294,3.2023285432101463,2.6451992531314019,14.214118955304652,4.3292827585203408,5.5458843152840434,3.9594525371653826,4.4395488175824456,null,null,null,null,null,null,null,null,null,null,null,null,null,null,null,null,null,null,null,null,null,null,null,null,null,null,null,null,null,null,"Water / Soap","Water and soap","N/A","N/A","N/A","N/A","N/A","N/A","N/A","N/A","N/A","N/A","N/A","N/A","N/A","N/A","N/A","N/A","N/A","N/A","N/A","N/A"]
[null,"(especificar)",2.8486546662972563,1.7749371652682786,0.81457435326140537,1.0257096235019865,1.0411210287651307,1.354819029190955,0.90814874233577991,0.71595713480409473,1.3599971353332863,0.88798929284426309,4.1618690032516605,2.6068299090806613,2.39112405402512,1.2742305060569208,0.78152614254387764,1.296995838122291,1.8057801950751895,1.0714165604187982,1.413327517863483,2.2435792950873794,null,null,null,null,null,null,null,null,null,null,null,null,null,null,null,null,null,null,null,null,null,null,null,null,null,null,null,null,null,null,null,"Water only","N/A","N/A","N/A","N/A","N/A","N/A","N/A","N/A","N/A","N/A","N/A","N/A","N/A","N/A","N/A","N/A","N/A","N/A","N/A","N/A"]
[null,null,null,null,null,null,null,null,null,null,null,null,null,null,null,null,null,null,null,null,null,null,null,null,null,null,null,null,null,null,null,null,null,null,null,null,null,null,null,null,null,null,null,null,null,null,null,null,null,null,null,null,null,"Soap only","N/A","N/A","N/A","N/A","N/A","N/A","N/A","N/A","N/A","N/A","N/A","N/A","N/A","N/A","N/A","N/A","N/A","N/A","N/A","N/A"]
[null,null,null,null,null,null,null,null,null,null,null,null,null,null,null,null,null,null,null,null,null,null,null,null,null,null,null,null,null,null,null,null,null,null,null,null,null,null,null,null,null,null,null,null,null,null,null,null,null,null,null,null,null,"Neither","N/A","N/A","N/A","N/A","N/A","N/A","N/A","N/A","N/A","N/A","N/A","N/A","N/A","N/A","N/A","N/A","N/A","N/A","N/A","N/A"]
[null,null,null,null,null,null,null,null,null,null,null,null,null,null,null,null,null,null,null,null,null,null,null,null,null,null,null,null,null,null,null,null,null,null,null,null,null,null,null,null,null,null,null,null,null,null,null,null,null,null,null,null,"Lugar que usan con mayor frecuencia los miembros del hogar","Lugar observado",9098.8689046066138,9170.2561870142727,9121.316606522525,8638.9399139382585,8233.5875957853241,5595.3042337854731,5607.9039502726446,5344.1725471192549,5188.8405253242945,4952.1055831922949,3388.6992757603707,3551.4065954303455,3518.5433830038241,3542.8131027199497,3573.1800112585338,10281.601326282043,9563.4878329578332,9520.7769092010421,9096.0672684945948,5801.0358709314442]
[null,null,null,null,null,null,null,null,null,null,null,null,null,null,null,null,null,null,null,null,null,null,null,null,null,null,null,null,null,null,null,null,null,null,null,null,null,null,null,null,null,null,null,null,null,null,null,null,null,null,null,null,null,"No está en la vivienda/patio/lote",213.57799367842213,87.546316032996955,83.978619255637099,83.07088937188874,100.01977250370869,82.090466717962101,36.783703748352757,56.621435851005003,47.88307311917584,82.078009732766134,127.06598894244554,42.71079452663956,43.034033135846613,21.226190016678075,28.699895051781873,154.2925980527026,152.38384602955213,112.06781416439507,103.5252339629659,45.924098633037822]
[null,null,null,null,null,null,null,null,null,null,null,null,null,null,null,null,null,null,null,null,null,null,null,null,null,null,null,null,null,null,null,null,null,null,null,null,null,null,null,null,null,null,null,null,null,null,null,null,null,null,null,null,null,"No obtuvo permiso para ver el lugar",210.7792749820421,369.40230346743948,508.18425407498785,985.49546759132181,1365.1446663854124,310.81090090078322,372.80055876300213,624.94889628566693,748.08738858655113,985.75774974522812,54.83771755079853,42.602721933326428,81.021526725044794,119.4808796946446,98.657626316156694,1755.6988387615133,448.12000164706342,572.08286935217859,384.9352215559727,278.16903518447509]
[null,null,null,null,null,null,null,null,null,null,null,null,null,null,null,null,null,null,null,null,null,null,null,null,null,null,null,null,null,null,null,null,null,null,null,null,null,null,null,null,null,null,null,null,null,null,null,null,null,null,null,null,null,"(especificar)",279.2383634369528,173.96459839871207,79.773325704122641,100.60271778047411,102.03808694127687,82.243600950877379,55.148574611350831,43.452839775631162,82.515465951872486,53.93537491269754,155.05709178806356,97.340611767546832,89.232724657859038,47.542336691292519,29.148471154347149,160.20226747996963,186.91461591386062,110.52142910132719,137.40271820745627,140.57606155892469]
[null,null,null,null,null,null,null,null,null,null,null,null,null,null,null,null,null,null,null,null,null,null,null,null,null,null,null,null,null,null,null,null,null,null,null,null,null,null,null,null,null,null,null,null,null,null,null,null,null,null,null,null,null,"Total",9802.4645367040193,9801.1694049134203,9793.2528055572784,9808.1089886819482,9800.7901216157188,6070.4492023550956,6072.6367873953559,6069.1957190315643,6067.3264529818962,6073.8767175829908,3725.6600740416802,3734.0607236578585,3731.8316675225751,3731.0625091225661,3729.6860037808206,12351.795030576226,10350.906296548335,10315.449021818953,9721.9304422209916,6265.7050663078853]
[]
[]
[]
[]
[]
[]
[]
[]
[]
[]
[]
[]
[]
[]
[]
[]
[]
[]
[]
[]
[]
[]
[]
[null,null,null,null,null,null,null,null,null,null,null,null,null,null,null,null,null,null,null,null,null,null,null,null,null,null,null,null,null,null,null,null,null,null,null,null,null,null,null,null,null,null,null,null,null,null,null,null,null,null,null,null,"Raw numbers of respondents:","Menstrual health and hygiene","NATIONAL wealth index quintile",null,null,null,null,"URBAN wealth index quintile",null,null,null,null,"RURAL wealth index quintile",null,null,null,null,"SUB-REGIONS:"]
[null,null,null,null,null,null,null,null,null,null,null,null,null,null,null,null,null,null,null,null,null,null,null,null,null,null,null,null,null,null,null,null,null,null,null,null,null,null,null,null,null,null,null,null,null,null,null,null,null,null,null,null,"MHH data, raw numbers (weighted)",null,"Poorest","Poor","Middle","Rich","Richest","Poorest","Poor","Middle","Rich","Richest","Poorest","Poor","Middle","Rich","Richest"," Metropolitana","Central","Occidente","Oriental","Para Central"]
[null,null,null,null,null,null,null,null,null,null,null,null,null,null,null,null,null,null,null,null,null,null,null,null,null,null,null,null,null,null,null,null,null,null,null,null,null,null,null,null,null,null,null,null,null,null,null,null,null,null,null,null,"Private place to wash and change","Yes","N/A","N/A","N/A","N/A","N/A","N/A","N/A","N/A","N/A","N/A","N/A","N/A","N/A","N/A","N/A","N/A","N/A","N/A","N/A","N/A"]
[null,null,null,null,null,null,null,null,null,null,null,null,null,null,null,null,null,null,null,null,null,null,null,null,null,null,null,null,null,null,null,null,null,null,null,null,null,null,null,null,null,null,null,null,null,null,null,null,null,null,null,null,null,"No","N/A","N/A","N/A","N/A","N/A","N/A","N/A","N/A","N/A","N/A","N/A","N/A","N/A","N/A","N/A","N/A","N/A","N/A","N/A","N/A"]
[null,null,null,null,null,null,null,null,null,null,null,null,null,null,null,null,null,null,null,null,null,null,null,null,null,null,null,null,null,null,null,null,null,null,null,null,null,null,null,null,null,null,null,null,null,null,null,null,null,null,null,null,null,"DK/not sure/missing","N/A","N/A","N/A","N/A","N/A","N/A","N/A","N/A","N/A","N/A","N/A","N/A","N/A","N/A","N/A","N/A","N/A","N/A","N/A","N/A"]
[null,null,null,null,null,null,null,null,null,null,null,null,null,null,null,null,null,null,null,null,null,null,null,null,null,null,null,null,null,null,null,null,null,null,null,null,null,null,null,null,null,null,null,null,null,null,null,null,null,null,null,null,"Use of menstrual materials","Materials reusable","N/A","N/A","N/A","N/A","N/A","N/A","N/A","N/A","N/A","N/A","N/A","N/A","N/A","N/A","N/A","N/A","N/A","N/A","N/A","N/A"]
[null,null,null,null,null,null,null,null,null,null,null,null,null,null,null,null,null,null,null,null,null,null,null,null,null,null,null,null,null,null,null,null,null,null,null,null,null,null,null,null,null,null,null,null,null,null,null,null,null,null,null,null,null,"Materials not reusable","N/A","N/A","N/A","N/A","N/A","N/A","N/A","N/A","N/A","N/A","N/A","N/A","N/A","N/A","N/A","N/A","N/A","N/A","N/A","N/A"]
[null,null,null,null,null,null,null,null,null,null,null,null,null,null,null,null,null,null,null,null,null,null,null,null,null,null,null,null,null,null,null,null,null,null,null,null,null,null,null,null,null,null,null,null,null,null,null,null,null,null,null,null,null,"No materials used","N/A","N/A","N/A","N/A","N/A","N/A","N/A","N/A","N/A","N/A","N/A","N/A","N/A","N/A","N/A","N/A","N/A","N/A","N/A","N/A"]
[null,null,null,null,null,null,null,null,null,null,null,null,null,null,null,null,null,null,null,null,null,null,null,null,null,null,null,null,null,null,null,null,null,null,null,null,null,null,null,null,null,null,null,null,null,null,null,null,null,null,null,null,null,"DK/not sure/missing","N/A","N/A","N/A","N/A","N/A","N/A","N/A","N/A","N/A","N/A","N/A","N/A","N/A","N/A","N/A","N/A","N/A","N/A","N/A","N/A"]
[null,null,null,null,null,null,null,null,null,null,null,null,null,null,null,null,null,null,null,null,null,null,null,null,null,null,null,null,null,null,null,null,null,null,null,null,null,null,null,null,null,null,null,null,null,null,null,null,null,null,null,null,"Use of menstrual materials with private place to wash and change","Materials reusable","N/A","N/A","N/A","N/A","N/A","N/A","N/A","N/A","N/A","N/A","N/A","N/A","N/A","N/A","N/A","N/A","N/A","N/A","N/A","N/A"]
[null,null,null,null,null,null,null,null,null,null,null,null,null,null,null,null,null,null,null,null,null,null,null,null,null,null,null,null,null,null,null,null,null,null,null,null,null,null,null,null,null,null,null,null,null,null,null,null,null,null,null,null,null,"Materials not reusable","N/A","N/A","N/A","N/A","N/A","N/A","N/A","N/A","N/A","N/A","N/A","N/A","N/A","N/A","N/A","N/A","N/A","N/A","N/A","N/A"]
[null,null,null,null,null,null,null,null,null,null,null,null,null,null,null,null,null,null,null,null,null,null,null,null,null,null,null,null,null,null,null,null,null,null,null,null,null,null,null,null,null,null,null,null,null,null,null,null,null,null,null,null,null,"No materials used","N/A","N/A","N/A","N/A","N/A","N/A","N/A","N/A","N/A","N/A","N/A","N/A","N/A","N/A","N/A","N/A","N/A","N/A","N/A","N/A"]
[null,null,null,null,null,null,null,null,null,null,null,null,null,null,null,null,null,null,null,null,null,null,null,null,null,null,null,null,null,null,null,null,null,null,null,null,null,null,null,null,null,null,null,null,null,null,null,null,null,null,null,null,"Awareness of menstruation before menarche","Yes","N/A","N/A","N/A","N/A","N/A","N/A","N/A","N/A","N/A","N/A","N/A","N/A","N/A","N/A","N/A","N/A","N/A","N/A","N/A","N/A"]
[null,null,null,null,null,null,null,null,null,null,null,null,null,null,null,null,null,null,null,null,null,null,null,null,null,null,null,null,null,null,null,null,null,null,null,null,null,null,null,null,null,null,null,null,null,null,null,null,null,null,null,null,null,"No","N/A","N/A","N/A","N/A","N/A","N/A","N/A","N/A","N/A","N/A","N/A","N/A","N/A","N/A","N/A","N/A","N/A","N/A","N/A","N/A"]
[null,null,null,null,null,null,null,null,null,null,null,null,null,null,null,null,null,null,null,null,null,null,null,null,null,null,null,null,null,null,null,null,null,null,null,null,null,null,null,null,null,null,null,null,null,null,null,null,null,null,null,null,null,"DK/not sure/missing","N/A","N/A","N/A","N/A","N/A","N/A","N/A","N/A","N/A","N/A","N/A","N/A","N/A","N/A","N/A","N/A","N/A","N/A","N/A","N/A"]
[null,null,null,null,null,null,null,null,null,null,null,null,null,null,null,null,null,null,null,null,null,null,null,null,null,null,null,null,null,null,null,null,null,null,null,null,null,null,null,null,null,null,null,null,null,null,null,null,null,null,null,null,"Participation in (all) activities during menstruation","Yes","N/A","N/A","N/A","N/A","N/A","N/A","N/A","N/A","N/A","N/A","N/A","N/A","N/A","N/A","N/A","N/A","N/A","N/A","N/A","N/A"]
[null,null,null,null,null,null,null,null,null,null,null,null,null,null,null,null,null,null,null,null,null,null,null,null,null,null,null,null,null,null,null,null,null,null,null,null,null,null,null,null,null,null,null,null,null,null,null,null,null,null,null,null,null,"No","N/A","N/A","N/A","N/A","N/A","N/A","N/A","N/A","N/A","N/A","N/A","N/A","N/A","N/A","N/A","N/A","N/A","N/A","N/A","N/A"]
[null,null,null,null,null,null,null,null,null,null,null,null,null,null,null,null,null,null,null,null,null,null,null,null,null,null,null,null,null,null,null,null,null,null,null,null,null,null,null,null,null,null,null,null,null,null,null,null,null,null,null,null,null,"DK/not sure/missing/no such activity","N/A","N/A","N/A","N/A","N/A","N/A","N/A","N/A","N/A","N/A","N/A","N/A","N/A","N/A","N/A","N/A","N/A","N/A","N/A","N/A"]
[null,null,null,null,null,null,null,null,null,null,null,null,null,null,null,null,null,null,null,null,null,null,null,null,null,null,null,null,null,null,null,null,null,null,null,null,null,null,null,null,null,null,null,null,null,null,null,null,null,null,null,null,"Participation in specific activities during menstruation","Did not go to school (amongst those usually attending school)","N/A","N/A","N/A","N/A","N/A","N/A","N/A","N/A","N/A","N/A","N/A","N/A","N/A","N/A","N/A","N/A","N/A","N/A","N/A","N/A"]
[null,null,null,null,null,null,null,null,null,null,null,null,null,null,null,null,null,null,null,null,null,null,null,null,null,null,null,null,null,null,null,null,null,null,null,null,null,null,null,null,null,null,null,null,null,null,null,null,null,null,null,null,null,"Did not go to work (amongst those who usually work)","N/A","N/A","N/A","N/A","N/A","N/A","N/A","N/A","N/A","N/A","N/A","N/A","N/A","N/A","N/A","N/A","N/A","N/A","N/A","N/A"]
[null,null,null,null,null,null,null,null,null,null,null,null,null,null,null,null,null,null,null,null,null,null,null,null,null,null,null,null,null,null,null,null,null,null,null,null,null,null,null,null,null,null,null,null,null,null,null,null,null,null,null,null,null,"Did not participate in social activities","N/A","N/A","N/A","N/A","N/A","N/A","N/A","N/A","N/A","N/A","N/A","N/A","N/A","N/A","N/A","N/A","N/A","N/A","N/A","N/A"]
[null,null,null,null,null,null,null,null,null,null,null,null,null,null,null,null,null,null,null,null,null,null,null,null,null,null,null,null,null,null,null,null,null,null,null,null,null,null,null,null,null,null,null,null,null,null,null,null,null,null,null,null,null,"Did not cook food","N/A","N/A","N/A","N/A","N/A","N/A","N/A","N/A","N/A","N/A","N/A","N/A","N/A","N/A","N/A","N/A","N/A","N/A","N/A","N/A"]
[null,null,null,null,null,null,null,null,null,null,null,null,null,null,null,null,null,null,null,null,null,null,null,null,null,null,null,null,null,null,null,null,null,null,null,null,null,null,null,null,null,null,null,null,null,null,null,null,null,null,null,null,null,"Did not eat with others","N/A","N/A","N/A","N/A","N/A","N/A","N/A","N/A","N/A","N/A","N/A","N/A","N/A","N/A","N/A","N/A","N/A","N/A","N/A","N/A"]
[null,null,null,null,null,null,null,null,null,null,null,null,null,null,null,null,null,null,null,null,null,null,null,null,null,null,null,null,null,null,null,null,null,null,null,null,null,null,null,null,null,null,null,null,null,null,null,null,null,null,null,null,null,"Did not bathe in regular place","N/A","N/A","N/A","N/A","N/A","N/A","N/A","N/A","N/A","N/A","N/A","N/A","N/A","N/A","N/A","N/A","N/A","N/A","N/A","N/A"]
[null,null,null,null,null,null,null,null,null,null,null,null,null,null,null,null,null,null,null,null,null,null,null,null,null,null,null,null,null,null,null,null,null,null,null,null,null,null,null,null,null,null,null,null,null,null,null,null,null,null,null,null,null,"Did not participate in other activities","N/A","N/A","N/A","N/A","N/A","N/A","N/A","N/A","N/A","N/A","N/A","N/A","N/A","N/A","N/A","N/A","N/A","N/A","N/A","N/A"]
[null,null,null,null,null,null,null,null,null,null,null,null,null,null,null,null,null,null,null,null,null,null,null,null,null,null,null,null,null,null,null,null,null,null,null,null,null,null,null,null,null,null,null,null,null,null,null,null,null,null,null,null,null,"DK/not sure/missing/no such activity","N/A","N/A","N/A","N/A","N/A","N/A","N/A","N/A","N/A","N/A","N/A","N/A","N/A","N/A","N/A","N/A","N/A","N/A","N/A","N/A"]
[]
[]
[]
[]
[]
[]
[]
[]
[]
[]
[]
[]
[]
[]
[]
[]
[]
[]
[]
[]
[]
[]
[]
[]
[]
[]
[]
[]
[]
[]
[]
[]
[]
[]
[]
[]
[]
[]
[]
[]
[]
[]
[]
[]
[]
[]
[]
[]
[]
[]
[]
[]
[]
[]
[null,null,null,null,null,null,null,null,null,null,null,null,null,null,null,null,null,null,null,null,null,null,null,null,null,null,null,null,null,null,null,null,null,null,null,null,null,null,null,null,null,null,null,null,null,null,null,null,null,null,null,null,"Raw numbers of respondents:","Basic water, sanitation and hygiene","NATIONAL wealth index quintile",null,null,null,null,"URBAN wealth index quintile",null,null,null,null,"RURAL wealth index quintile",null,null,null,null,"SUB-REGIONS:"]
[null,null,null,null,null,null,null,null,null,null,null,null,null,null,null,null,null,null,null,null,null,null,null,null,null,null,null,null,null,null,null,null,null,null,null,null,null,null,null,null,null,null,null,null,null,null,null,null,null,null,null,null,"WatSan data, raw numbers (weighted)",null,"Poorest","Poor","Middle","Rich","Richest","Poorest","Poor","Middle","Rich","Richest","Poorest","Poor","Middle","Rich","Richest"," Metropolitana","Central","Occidente","Oriental","Para Central"]
[null,null,null,null,null,null,null,null,null,null,null,null,null,null,null,null,null,null,null,null,null,null,null,null,null,null,null,null,null,null,null,null,null,null,null,null,null,null,null,null,null,null,null,null,null,null,null,null,null,null,null,null,"Use of Basic Water Sanitation and Hygiene","Yes","N/A","N/A","N/A","N/A","N/A","N/A","N/A","N/A","N/A","N/A","N/A","N/A","N/A","N/A","N/A","N/A","N/A","N/A","N/A","N/A"]
[null,null,null,null,null,null,null,null,null,null,null,null,null,null,null,null,null,null,null,null,null,null,null,null,null,null,null,null,null,null,null,null,null,null,null,null,null,null,null,null,null,null,null,null,null,null,null,null,null,null,null,null,null,"No","N/A","N/A","N/A","N/A","N/A","N/A","N/A","N/A","N/A","N/A","N/A","N/A","N/A","N/A","N/A","N/A","N/A","N/A","N/A","N/A"]
[null,null,null,null,null,null,null,null,null,null,null,null,null,null,null,null,null,null,null,null,null,null,null,null,null,null,null,null,null,null,null,null,null,null,null,null,null,null,null,null,null,null,null,null,null,null,null,null,null,null,null,null,"Use of Basic Water and Sanitation","Yes","N/A","N/A","N/A","N/A","N/A","N/A","N/A","N/A","N/A","N/A","N/A","N/A","N/A","N/A","N/A","N/A","N/A","N/A","N/A","N/A"]
[null,null,null,null,null,null,null,null,null,null,null,null,null,null,null,null,null,null,null,null,null,null,null,null,null,null,null,null,null,null,null,null,null,null,null,null,null,null,null,null,null,null,null,null,null,null,null,null,null,null,null,null,null,"No","N/A","N/A","N/A","N/A","N/A","N/A","N/A","N/A","N/A","N/A","N/A","N/A","N/A","N/A","N/A","N/A","N/A","N/A","N/A","N/A"]
[null,null,null,null,null,null,null,null,null,null,null,null,null,null,null,null,null,null,null,null,null,null,null,null,null,null,null,null,null,null,null,null,null,null,null,null,null,null,null,null,null,null,null,null,null,null,null,null,null,null,null,null,"Use of Basic Water and Hygiene","Yes","N/A","N/A","N/A","N/A","N/A","N/A","N/A","N/A","N/A","N/A","N/A","N/A","N/A","N/A","N/A","N/A","N/A","N/A","N/A","N/A"]
[null,null,null,null,null,null,null,null,null,null,null,null,null,null,null,null,null,null,null,null,null,null,null,null,null,null,null,null,null,null,null,null,null,null,null,null,null,null,null,null,null,null,null,null,null,null,null,null,null,null,null,null,null,"No","N/A","N/A","N/A","N/A","N/A","N/A","N/A","N/A","N/A","N/A","N/A","N/A","N/A","N/A","N/A","N/A","N/A","N/A","N/A","N/A"]
[null,null,null,null,null,null,null,null,null,null,null,null,null,null,null,null,null,null,null,null,null,null,null,null,null,null,null,null,null,null,null,null,null,null,null,null,null,null,null,null,null,null,null,null,null,null,null,null,null,null,null,null,"Use of Basic Sanitation and Hygiene","Yes","N/A","N/A","N/A","N/A","N/A","N/A","N/A","N/A","N/A","N/A","N/A","N/A","N/A","N/A","N/A","N/A","N/A","N/A","N/A","N/A"]
[null,null,null,null,null,null,null,null,null,null,null,null,null,null,null,null,null,null,null,null,null,null,null,null,null,null,null,null,null,null,null,null,null,null,null,null,null,null,null,null,null,null,null,null,null,null,null,null,null,null,null,null,null,"No","N/A","N/A","N/A","N/A","N/A","N/A","N/A","N/A","N/A","N/A","N/A","N/A","N/A","N/A","N/A","N/A","N/A","N/A","N/A","N/A"]
[null,null,null,null,null,null,null,null,null,null,null,null,null,null,null,null,null,null,null,null,null,null,null,null,null,null,null,null,null,null,null,null,null,null,null,null,null,null,null,null,null,null,null,null,null,null,null,null,null,null,null,null,"Use of Basic Water","Yes","N/A","N/A","N/A","N/A","N/A","N/A","N/A","N/A","N/A","N/A","N/A","N/A","N/A","N/A","N/A","N/A","N/A","N/A","N/A","N/A"]
[null,null,null,null,null,null,null,null,null,null,null,null,null,null,null,null,null,null,null,null,null,null,null,null,null,null,null,null,null,null,null,null,null,null,null,null,null,null,null,null,null,null,null,null,null,null,null,null,null,null,null,null,null,"No","N/A","N/A","N/A","N/A","N/A","N/A","N/A","N/A","N/A","N/A","N/A","N/A","N/A","N/A","N/A","N/A","N/A","N/A","N/A","N/A"]
[null,null,null,null,null,null,null,null,null,null,null,null,null,null,null,null,null,null,null,null,null,null,null,null,null,null,null,null,null,null,null,null,null,null,null,null,null,null,null,null,null,null,null,null,null,null,null,null,null,null,null,null,"Use of Basic Sanitation","Yes","N/A","N/A","N/A","N/A","N/A","N/A","N/A","N/A","N/A","N/A","N/A","N/A","N/A","N/A","N/A","N/A","N/A","N/A","N/A","N/A"]
[null,null,null,null,null,null,null,null,null,null,null,null,null,null,null,null,null,null,null,null,null,null,null,null,null,null,null,null,null,null,null,null,null,null,null,null,null,null,null,null,null,null,null,null,null,null,null,null,null,null,null,null,null,"No","N/A","N/A","N/A","N/A","N/A","N/A","N/A","N/A","N/A","N/A","N/A","N/A","N/A","N/A","N/A","N/A","N/A","N/A","N/A","N/A"]
[null,null,null,null,null,null,null,null,null,null,null,null,null,null,null,null,null,null,null,null,null,null,null,null,null,null,null,null,null,null,null,null,null,null,null,null,null,null,null,null,null,null,null,null,null,null,null,null,null,null,null,null,"Access to Basic Hygiene","Yes","N/A","N/A","N/A","N/A","N/A","N/A","N/A","N/A","N/A","N/A","N/A","N/A","N/A","N/A","N/A","N/A","N/A","N/A","N/A","N/A"]
[null,null,null,null,null,null,null,null,null,null,null,null,null,null,null,null,null,null,null,null,null,null,null,null,null,null,null,null,null,null,null,null,null,null,null,null,null,null,null,null,null,null,null,null,null,null,null,null,null,null,null,null,null,"No","N/A","N/A","N/A","N/A","N/A","N/A","N/A","N/A","N/A","N/A","N/A","N/A","N/A","N/A","N/A","N/A","N/A","N/A","N/A","N/A"]
[]
[]
[]
[]
[]
[]
[]
[]
[]
[]
[]
[]
[]
[]
[]
[]
[]
[]
[]
[]
[]
[]
[]
[]
[]
[]
[]
[]
[]
[]
[]
[]
[]
[]
[]
[]
[]
[]
[]
[]
[]
[]
[]
[]
[null,null,"INITIAL (national) Wealth Index",null,null,null,null,"URBAN Wealth Index",null,null,null,null,"RURAL Wealth Index"]
[null,null,"Component Matrix",null,null,null,null,"Component Matrix",null,null,null,null,"Component Matrix"]
[null,null,null,null,"Component",null,null,null,null,"Component",null,null,null,null,"Component"]
[null,"Note:\n\nThe INITIAL (national) Wealth Index is based on the first component of the Principal Component Analysis (PCA) which has been obtained at national level.\n\nThe final national-level (NATIONAL) Wealth Index is based on the URBAN and RURAL specific wealth indexes. Regression procedures are used to establish the relationships between the two sets of scores (urban and rural) and the initial (national) wealth factors.\nThis allows best use of the available information for each area and a better precision of the FINAL (NATIONAL) Wealth Index.\n\nFor dependency reasons, all WASH variables (contained in the generic MICS and DHS scripts) have been excluded from the sets of asset variables used in the PCAs.\n\nThe PCA can extracts as many components as there are asset variables in the input. Only the first of the components is used to represent the Wealth Index. \n\nThe scores represent the weights of the asset variables on the Wealth Index (correlations between the variables and the component).\n\nThe communalities are the proportion of each variable's variance that can be explained by the component.\n\nProportion of explained variance is the part of the model's total variance that is explained by the component.\n\nFor more information on the procedure used:\n\nThe DHS Wealth Index, DHS Comparative Reports No. 6, Shea Oscar Rutstein, Kiersten Johnson, ORC Macro International Inc., 2004.\n\nThe DHS Wealth Index: Approaches for Rural and Urban Areas, Shea O. Rutstein, ORC Macro International Inc., 2008.\n\nMICS Methodological Paper No. 4, Review of options for reporting water, sanitation and hygiene coverage by wealth quintile, UNICEF, 2016.",null,null,"1",null,null,null,null,"1",null,null,null,null,"1"]
[null,null,"Wood fuel",null,-0.66976478998671962,null,null,"Refrigetaror",null,0.61761691300313981,null,null,"Refrigetaror",null,0.67399430870196431]
[null,null,"LPG fuel",null,0.65998096466210976,null,null,"Lavadora",null,0.58135620799335641,null,null,"Cocina",null,0.62625221421288024]
[null,null,"Refrigetaror",null,0.65135874993658527,null,null,"Wood fuel",null,-0.55807348812840651,null,null,"Earth/sand floor",null,-0.62581041681210259]
[null,null,"Earth/sand floor",null,-0.62163513784192292,null,null,"LPG fuel",null,0.530354371608174,null,null,"LPG fuel",null,0.587152054449397]
[null,null,"Cocina",null,0.61290423432111973,null,null,"Non-mobile telephone",null,0.518901092015844,null,null,"Wood fuel",null,-0.5771522517562534]
[null,null,"Lavadora",null,0.56433769978814807,null,null,"Earth/sand floor",null,-0.51821622574226101,null,null,"Television",null,0.55405033974804507]
[null,null,"Ventilador",null,0.54940909507074609,null,null,"Cocina",null,0.51618651265950732,null,null,"Ventilador",null,0.47115150324122346]
[null,null,"Television",null,0.53437018435228156,null,null,"Car/truck",null,0.50926776085066072,null,null,"Electricity",null,0.46410927466172502]
[null,null,"Non-mobile telephone",null,0.52945255941830294,null,null,"Laptop",null,0.4994367568942486,null,null,"Car/truck",null,0.45288169444587006]
[null,null,"Computadora",null,0.50141862803431925,null,null,"Computadora",null,0.49809482154652301,null,null,"Household owns bank account",null,0.37974110521341953]
[null,null,"Car/truck",null,0.50013761540122548,null,null,"Household owns bank account",null,0.49646650020466498,null,null,"Radio",null,0.36552326337150898]
[null,null,"Household owns bank account",null,0.49557468013254324,null,null,"Ventilador",null,0.47791696799775496,null,null,"No cattle, milk cows or bulls",null,-0.35520346740893577]
[null,null,"Laptop",null,0.49365787068887623,null,null,"Television",null,0.45676389797592859,null,null,"Carpet floor",null,0.3450527637900882]
[null,null,"Lamina de asbestof",null,0.47111885587163643,null,null,"Lamina de asbestof",null,0.44684203761837976,null,null,"Cement walls",null,0.34107553080669123]
[null,null,"Electricity",null,0.43041004330937421,null,null,"Watch",null,0.42951041808556006,null,null,"Laptop",null,0.3378783879026937]
[null,null,"Persons per sleeping rooms",null,-0.42125946794592983,null,null,"Persons per sleeping rooms",null,-0.42799151620766313,null,null,"Non-mobile telephone",null,0.33488462824446197]
[null,null,"Watch",null,0.41306719567786504,null,null,"Metal/tin roof",null,-0.42667169401803523,null,null,"Computadora",null,0.33026942845768065]
[null,null,"Carpet floor",null,0.40962498103625788,null,null,"Dispositivos moviles",null,0.3971551993503975,null,null,"Lavadora",null,0.32013773196716827]
[null,null,"Cement walls",null,0.38740593645946764,null,null,"Electricity",null,0.37359435041949229,null,null,"Ceramic tiles floor",null,0.30652249849498886]
[null,null,"Dispositivos moviles",null,0.38126316586141118,null,null,"Lamina metalica",null,-0.3649813258872045,null,null,"Mobile telephone",null,0.30408194678624684]
[null,null,"Ceramic tiles floor",null,0.35670970386875339,null,null,"Cement floor",null,-0.33867735079324851,null,null,"Watch",null,0.30277954376374977]
[null,null,"Radio",null,0.3453863464016238,null,null,"Cement walls",null,0.33668621324031522,null,null,"Lamina metalica",null,-0.30096791425091218]
[null,null,"Uncovered adobe walls",null,-0.31363165688560513,null,null,"Ceramic tiles floor",null,0.33455067636814428,null,null,"No agricultural land",null,-0.30021217818852325]
[null,null,"Metal/tin roof",null,-0.31047331291975122,null,null,"Radio",null,0.31808023893893184,null,null,"Persons per sleeping rooms",null,-0.28617961100606021]
[null,null,"Lamina metalica",null,-0.30484843844080595,null,null,"Carpet floor",null,0.2972412111921251,null,null,"Uncovered adobe walls",null,-0.26312725743272802]
[null,null,"Mobile telephone",null,0.26948244323227338,null,null,"Aire acondicionado",null,0.25053777921044457,null,null,"Bamboo with mud wall",null,-0.2349268046845587]
[null,null,"Bamboo with mud wall",null,-0.23164077534875838,null,null,"Secadora",null,0.24502220237612235,null,null,"Bicycle",null,0.22954380068194893]
[null,null,"Aire acondicionado",null,0.22883847636738611,null,null,"Uncovered adobe walls",null,-0.24013592382772994,null,null,"No horses, donkeys, mules",null,-0.2268533864383489]
[null,null,"Secadora",null,0.22160050774143802,null,null,"Mobile telephone",null,0.23465396456566506,null,null,"1-4 cattle, milk cows or bulls",null,0.22539512527903194]
[null,null,"Teja de barro o cemento",null,-0.19124872046488917,null,null,"Covered adobe walls",null,-0.13183953438644438,null,null,"Motorcycle/scooter",null,0.22330470120227444]
[null,null,"Cement floor",null,-0.19037015520206224,null,null,"Cement roof",null,0.1290608821775161,null,null,"10+ cattle, milk cows or bulls",null,0.22114810308400035]
[null,null,"Cement blocks walls",null,0.169446714168247,null,null,"No food cooked",null,-0.12011246632690627,null,null,"Metal/tin roof",null,-0.22045659967668549]
[null,null,"Cement roof",null,0.15937037394069681,null,null,"Motorcycle/scooter",null,0.11955266012354741,null,null,"3-10 manzanas de tierra para agricultura",null,0.21270566881509109]
[null,null,"Covered adobe walls",null,-0.15436133322307982,null,null,"Teja de barro o cemento",null,-0.10952527748519671,null,null,"Dispositivos moviles",null,0.21014155934345488]
[null,null,"Motorcycle/scooter",null,0.14022125738324223,null,null,"Bamboo with mud wall",null,-0.10479415037399546,null,null,"5-9 cattle, milk cows or bulls",null,0.20079758467231332]
[null,null,"Reused wood walls",null,-0.10355447394842954,null,null,"Brick walls",null,-9.4315375286291692E-2,null,null,"1 Caballo, burro, mula",null,0.19747253969215314]
[null,null,"Wood planks/shingles walls",null,-9.8073539494111225E-2,null,null,"Cement blocks walls",null,9.0386552529673911E-2,null,null,"10-19 gallinas",null,0.19169261763589948]
[null,null,"Cane/palm/trunks walls",null,-9.3916310668944444E-2,null,null,"Reused wood walls",null,-7.6837111002845432E-2,null,null,"Lamina de asbestof",null,0.18268096832899477]
[null,null,"Bicycle",null,8.108706548096499E-2,null,null,"Paja o palma",null,-6.7134128842784788E-2,null,null,"Hasta 2 manzanas de tierra para agricultura",null,0.18236149184571551]
[null,null,"No food cooked",null,-7.8819905145280672E-2,null,null,"Cane/palm/trunks walls",null,-6.4953615980319165E-2,null,null,"No gallinas",null,-0.17221170492314394]
[null,null,"Electricity fuel",null,6.8572341571031661E-2,null,null,"Wood planks/shingles walls",null,-5.7806405966336398E-2,null,null,"Cement blocks walls",null,0.17205932410743752]
[null,null,"Dirt walls",null,-6.3496134627087586E-2,null,null,"Electricity fuel",null,5.4933763719476253E-2,null,null,"20+ pollos",null,0.16573449121092579]
[null,null,"Thatch/palm leaf roof",null,-5.9294658939675643E-2,null,null,"Dirt walls",null,-3.9202497992470109E-2,null,null,"Mas de 10 manzanas de tierra para agricultura",null,0.14143816211582677]
[null,null,"Paja o palma",null,-4.037800981405712E-2,null,null,"Wood planks floor",null,-3.3117762973685252E-2,null,null,"Animal drawn cart",null,0.13791011955965105]
[null,null,"Calamine/cement fibre roof",null,4.0347513571094312E-2,null,null,"Calamine/cement fibre roof",null,2.9565175645961561E-2,null,null,"Cement floor",null,0.13336744964375241]
[null,null,"Stone with mud walls",null,-3.1975571935014123E-2,null,null,"Thatch/palm leaf roof",null,-2.7689406294795257E-2,null,null,"No pollos",null,-0.13246049070417981]
[null,null,"Ladrillo de barro",null,-1.7217365071435724E-2,null,null,"Stone with mud walls",null,-2.388832918875889E-2,null,null,"Brick walls",null,0.13034969179512393]
[null,null,null,null,null,null,null,"Ladrillo de barro",null,-2.1763630921059193E-2,null,null,"20+ gallinas",null,0.11897975125547934]
[null,null,null,null,null,null,null,null,null,null,null,null,"Reused wood walls",null,-0.11495840871636849]
[null,null,null,null,null,null,null,null,null,null,null,null,"Cane/palm/trunks walls",null,-0.10827645447747011]
[null,null,"Communalities",null,null,null,null,null,null,null,null,null,"Teja de barro o cemento",null,0.10764687772694577]
[null,null,null,null,"Extraction",null,null,"Communalities",null,null,null,null,"Aire acondicionado",null,0.10336942886324765]
[null,null,"Persons per sleeping rooms",null,0.1774595393340879,null,null,null,null,"Extraction",null,null,"Wood planks/shingles walls",null,-0.10177924472519738]
[null,null,"Earth/sand floor",null,0.38643024459974651,null,null,"Persons per sleeping rooms",null,0.18317673794573436,null,null,"No pigs",null,-9.9756773189135242E-2]
[null,null,"Ladrillo de barro",null,2.9643766000309486E-4,null,null,"Earth/sand floor",null,0.26854805662255404,null,null,"No goats",null,-9.6863594782610224E-2]
[null,null,"Ceramic tiles floor",null,0.12724181283413374,null,null,"Wood planks floor",null,1.0967862243811979E-3,null,null,"10-19 pollos",null,9.3259820447521902E-2]
[null,null,"Cement floor",null,3.6240795991657263E-2,null,null,"Ladrillo de barro",null,4.7365563086808381E-4,null,null,"Secadora",null,8.9513574026778717E-2]
[null,null,"Carpet floor",null,0.16779262508895462,null,null,"Ceramic tiles floor",null,0.11192415505838281,null,null,"2 Caballos, burros, mulas",null,8.6559907468620759E-2]
[null,null,"Thatch/palm leaf roof",null,3.5158565787724565E-3,null,null,"Cement floor",null,0.11470234794033311,null,null,"1-4 pigs",null,8.1215679211533831E-2]
[null,null,"Metal/tin roof",null,9.6393678035365762E-2,null,null,"Carpet floor",null,8.8352337630961508E-2,null,null,"Thatch/palm leaf roof",null,-7.9694955593424321E-2]
[null,null,"Calamine/cement fibre roof",null,1.6279218513696398E-3,null,null,"Thatch/palm leaf roof",null,7.6670322095824723E-4,null,null,"1 cabra",null,7.7938497285465869E-2]
[null,null,"Cement roof",null,2.5398916089997531E-2,null,null,"Metal/tin roof",null,0.18204873447621989,null,null,"No food cooked",null,-6.9296143737696519E-2]
[null,null,"Teja de barro o cemento",null,3.6576073079457316E-2,null,null,"Calamine/cement fibre roof",null,8.7409961097655866E-4,null,null,"2-4 cabras",null,6.8126563417275063E-2]
[null,null,"Lamina de asbestof",null,0.22195297635779973,null,null,"Cement roof",null,1.6656711308438692E-2,null,null,"3+ caballos, burros, mulas",null,6.335544194279244E-2]
[null,null,"Cane/palm/trunks walls",null,8.8202734096656885E-3,null,null,"Teja de barro o cemento",null,1.1995786408209336E-2,null,null,"Dirt walls",null,-5.6890955586175955E-2]
[null,null,"Dirt walls",null,4.031759112581231E-3,null,null,"Lamina de asbestof",null,0.1996678065829455,null,null,"5-9 pigs",null,5.4903509541579902E-2]
[null,null,"Bamboo with mud wall",null,5.3657448804173946E-2,null,null,"Cane/palm/trunks walls",null,4.2189722289187733E-3,null,null,"Cement roof",null,5.4479901030674856E-2]
[null,null,"Stone with mud walls",null,1.0224372005712629E-3,null,null,"Dirt walls",null,1.5368358488496228E-3,null,null,"10-19 patos",null,4.791452147185573E-2]
[null,null,"Uncovered adobe walls",null,9.8364816200809946E-2,null,null,"Bamboo with mud wall",null,1.0981813952607573E-2,null,null,"1-9 pollos",null,-4.7053239912947027E-2]
[null,null,"Reused wood walls",null,1.0723529074735972E-2,null,null,"Stone with mud walls",null,5.7065227143050996E-4,null,null,"Boat with motor",null,4.6021338616468545E-2]
[null,null,"Lamina metalica",null,9.2932570419797855E-2,null,null,"Uncovered adobe walls",null,5.766526191259732E-2,null,null,"Calamine/cement fibre roof",null,4.1231584513035401E-2]
[null,null,"Paja o palma",null,1.6303836765440931E-3,null,null,"Reused wood walls",null,5.9039416272635903E-3,null,null,"Covered adobe walls",null,3.808267610070154E-2]
[null,null,"Cement walls",null,0.15008335960403707,null,null,"Lamina metalica",null,0.13321136824638177,null,null,"No patos",null,-3.6892284267947904E-2]
[null,null,"Cement blocks walls",null,2.8712188942415597E-2,null,null,"Paja o palma",null,4.506991255479628E-3,null,null,"Stone with mud walls",null,-3.5998015401780221E-2]
[null,null,"Covered adobe walls",null,2.3827421194406687E-2,null,null,"Cement walls",null,0.11335760618610301,null,null,"10+ pigs",null,3.4380479379801605E-2]
[null,null,"Wood planks/shingles walls",null,9.6184191489029937E-3,null,null,"Brick walls",null,8.8953900153940415E-3,null,null,"Wood planks floor",null,-3.1041543129771979E-2]
[null,null,"Electricity fuel",null,4.7021660285342373E-3,null,null,"Cement blocks walls",null,8.1697288781995021E-3,null,null,"20+ patos",null,2.7289541683051356E-2]
[null,null,"LPG fuel",null,0.43557487371632897,null,null,"Covered adobe walls",null,1.738166282723445E-2,null,null,"Ladrillo de barro",null,2.5136726451979667E-2]
[null,null,"Wood fuel",null,0.44858487390595464,null,null,"Wood planks/shingles walls",null,3.3415805707448921E-3,null,null,"1-9 gallinas",null,2.3760914516151574E-2]
[null,null,"No food cooked",null,6.2125774471110421E-3,null,null,"Electricity fuel",null,3.0177183963872455E-3,null,null,"Paja o palma",null,-2.3435924702161149E-2]
[null,null,"Electricity",null,0.18525280538157737,null,null,"LPG fuel",null,0.2812757594839011,null,null,"5+ cabras",null,-1.7627172940691885E-2]
[null,null,"Radio",null,0.11929172828066247,null,null,"Wood fuel",null,0.31144601815180667]
[null,null,"Television",null,0.28555149392469137,null,null,"No food cooked",null,1.4427004567132192E-2]
[null,null,"Non-mobile telephone",null,0.28032001267459161,null,null,"Electricity",null,0.13957273866536241]
[null,null,"Refrigetaror",null,0.42426822111895102,null,null,"Radio",null,0.10117503840344796,null,null,"Communalities"]
[null,null,"Cocina",null,0.37565160044875806,null,null,"Television",null,0.2086332584941645,null,null,null,null,"Extraction"]
[null,null,"Lavadora",null,0.31847703940217792,null,null,"Non-mobile telephone",null,0.2692583432952354,null,null,"Persons per sleeping rooms",null,8.1898769755579942E-2]
[null,null,"Secadora",null,4.9106785031263131E-2,null,null,"Refrigetaror",null,0.38145065122752797,null,null,"Earth/sand floor",null,0.39163867779053757]
[null,null,"Ventilador",null,0.30185035374645613,null,null,"Cocina",null,0.26644851585158369,null,null,"Wood planks floor",null,9.6357739987749393E-4]
[null,null,"Aire acondicionado",null,5.2367048266146729E-2,null,null,"Lavadora",null,0.33797504057241468,null,null,"Ladrillo de barro",null,6.3185501672165429E-4]
[null,null,"Computadora",null,0.251420640539819,null,null,"Secadora",null,6.003587965724546E-2,null,null,"Ceramic tiles floor",null,9.3956042083610442E-2]
[null,null,"Watch",null,0.17062450814517566,null,null,"Ventilador",null,0.22840462830016714,null,null,"Cement floor",null,1.7786876624478837E-2]
[null,null,"Mobile telephone",null,7.2620787210435453E-2,null,null,"Aire acondicionado",null,6.2769178811701465E-2,null,null,"Carpet floor",null,0.1190614097991784]
[null,null,"Bicycle",null,6.5751121883143044E-3,null,null,"Computadora",null,0.2480984512514626,null,null,"Thatch/palm leaf roof",null,6.3512859470378743E-3]
[null,null,"Motorcycle/scooter",null,1.9662001022137464E-2,null,null,"Watch",null,0.18447919924403261,null,null,"Metal/tin roof",null,4.8601112341006364E-2]
[null,null,"Car/truck",null,0.25013763433922415,null,null,"Mobile telephone",null,5.5062483086384395E-2,null,null,"Calamine/cement fibre roof",null,1.7000435614555806E-3]
[null,null,"Dispositivos moviles",null,0.14536160164266593,null,null,"Motorcycle/scooter",null,1.4292838542616444E-2,null,null,"Cement roof",null,2.9680596163121271E-3]
[null,null,"Laptop",null,0.24369809329307524,null,null,"Car/truck",null,0.25935365224184576,null,null,"Teja de barro o cemento",null,1.1587850284360013E-2]
[null,null,"Household owns bank account",null,0.24559426358847256,null,null,"Dispositivos moviles",null,0.15773225237105398,null,null,"Lamina de asbestof",null,3.3372336189619191E-2]
[null,null,null,null,null,null,null,"Laptop",null,0.24943707413704477,null,null,"Cane/palm/trunks walls",null,1.1723790594211657E-2]
[null,null,null,null,null,null,null,"Household owns bank account",null,0.24647898582546862,null,null,"Dirt walls",null,3.2365808275082453E-3]
[null,null,"Total Variance Explained",null,null,null,null,null,null,null,null,null,"Bamboo with mud wall",null,5.5190603559296794E-2]
[null,null,"Component",null,"Extraction Sums of Squared Loadings",null,null,null,null,null,null,null,"Stone with mud walls",null,1.295857112866806E-3]
[null,null,null,null,"Total","% of Variance","Cumulative %","Total Variance Explained",null,null,null,null,"Uncovered adobe walls",null,6.9235953604069131E-2]
[null,null,"1",null,6.4572577056325109,13.738846182196832,13.738846182196832,"Component",null,"Extraction Sums of Squared Loadings",null,null,"Reused wood walls",null,1.3215435734599627E-2]
[null,null,null,null,null,null,null,null,null,"Total","% of Variance","Cumulative %","Lamina metalica",null,9.058168540854443E-2]
[null,null,null,null,null,null,null,"1",null,5.6308504350601556,11.730938406375325,11.730938406375325,"Paja o palma",null,5.4924256664536715E-4]
[null,null,"Component Score Coefficient Matrix",null,null,null,null,null,null,null,null,null,"Cement walls",null,0.11633251771506618]
[null,null,null,null,"Component",null,null,null,null,null,null,null,"Brick walls",null,1.69910421510838E-2]
[null,null,null,null,"1",null,null,"Component Score Coefficient Matrix",null,null,null,null,"Cement blocks walls",null,2.9604411012308228E-2]
[null,null,"Persons per sleeping rooms",null,-6.5238137790052178E-2,null,null,null,null,"Component",null,null,"Covered adobe walls",null,1.4502902189909442E-3]
[null,null,"Earth/sand floor",null,-9.626921615652502E-2,null,null,null,null,"1",null,null,"Wood planks/shingles walls",null,1.0359014656831618E-2]
[null,null,"Ladrillo de barro",null,-2.6663586705572293E-3,null,null,"Persons per sleeping rooms",null,-7.6008326121183994E-2,null,null,"LPG fuel",null,0.34474753504414768]
[null,null,"Ceramic tiles floor",null,5.5241670710711163E-2,null,null,"Earth/sand floor",null,-9.2031609029360542E-2,null,null,"Wood fuel",null,0.3331047217073137]
[null,null,"Cement floor",null,-2.9481579314390216E-2,null,null,"Wood planks floor",null,-5.8814851070238816E-3,null,null,"No food cooked",null,4.8019555369154966E-3]
[null,null,"Carpet floor",null,6.3436368766721499E-2,null,null,"Ladrillo de barro",null,-3.8650699698129496E-3,null,null,"Electricity",null,0.21539741882703251]
[null,null,"Thatch/palm leaf roof",null,-9.1826378383434108E-3,null,null,"Ceramic tiles floor",null,5.9413880767474191E-2,null,null,"Radio",null,0.13360725606575752]
[null,null,"Metal/tin roof",null,-4.8081295044014247E-2,null,null,"Cement floor",null,-6.0146749536179128E-2,null,null,"Television",null,0.30697177897492417]
[null,null,"Calamine/cement fibre roof",null,6.2483976031961911E-3,null,null,"Carpet floor",null,5.2787978409330555E-2,null,null,"Non-mobile telephone",null,0.1121477142344315]
[null,null,"Cement roof",null,2.468081362180758E-2,null,null,"Thatch/palm leaf roof",null,-4.9174465942815335E-3,null,null,"Refrigetaror",null,0.45426832816263873]
[null,null,"Teja de barro o cemento",null,-2.9617637886446366E-2,null,null,"Metal/tin roof",null,-7.5773934850300623E-2,null,null,"Cocina",null,0.39219183580653522]
[null,null,"Lamina de asbestof",null,7.2959587079928806E-2,null,null,"Calamine/cement fibre roof",null,5.2505702268125874E-3,null,null,"Lavadora",null,0.10248816742908247]
[null,null,"Cane/palm/trunks walls",null,-1.4544302697881102E-2,null,null,"Cement roof",null,2.292031792816342E-2,null,null,"Secadora",null,8.0126799350475932E-3]
[null,null,"Dirt walls",null,-9.8332972790758279E-3,null,null,"Teja de barro o cemento",null,-1.945092997023044E-2,null,null,"Ventilador",null,0.22198373900646459]
[null,null,"Bamboo with mud wall",null,-3.5872933357871672E-2,null,null,"Lamina de asbestof",null,7.9356048037814028E-2,null,null,"Aire acondicionado",null,1.0685238823514017E-2]
[null,null,"Stone with mud walls",null,-4.9518810294844826E-3,null,null,"Cane/palm/trunks walls",null,-1.1535311891058112E-2,null,null,"Computadora",null,0.10907789537376303]
[null,null,"Uncovered adobe walls",null,-4.8570410409984381E-2,null,null,"Dirt walls",null,-6.9620918624259814E-3,null,null,"Watch",null,9.1675452121784462E-2]
[null,null,"Reused wood walls",null,-1.6036912056042223E-2,null,null,"Bamboo with mud wall",null,-1.8610714594992774E-2,null,null,"Mobile telephone",null,9.2465830361313853E-2]
[null,null,"Lamina metalica",null,-4.721020165803419E-2,null,null,"Stone with mud walls",null,-4.2424016521589039E-3,null,null,"Bicycle",null,5.2690356431514297E-2]
[null,null,"Paja o palma",null,-6.2531203886808419E-3,null,null,"Uncovered adobe walls",null,-4.26464752699766E-2,null,null,"Motorcycle/scooter",null,4.9864989579037067E-2]
[null,null,"Cement walls",null,5.999542748952745E-2,null,null,"Reused wood walls",null,-1.3645738221783289E-2,null,null,"Animal drawn cart",null,1.9019201076957246E-2]
[null,null,"Cement blocks walls",null,2.6241281034895467E-2,null,null,"Lamina metalica",null,-6.4818153154036898E-2,null,null,"Car/truck",null,0.20510182916416242]
[null,null,"Covered adobe walls",null,-2.3905091024698327E-2,null,null,"Paja o palma",null,-1.1922555858485978E-2,null,null,"Boat with motor",null,2.117963608051659E-3]
[null,null,"Wood planks/shingles walls",null,-1.5188109870319105E-2,null,null,"Cement walls",null,5.9793137310832925E-2,null,null,"Dispositivos moviles",null,4.4159474963298771E-2]
[null,null,"Electricity fuel",null,1.0619421540388215E-2,null,null,"Brick walls",null,-1.6749756786122855E-2,null,null,"Laptop",null,0.11416180501172316]
[null,null,"LPG fuel",null,0.10220762353753116,null,null,"Cement blocks walls",null,1.6052025102085362E-2,null,null,"No agricultural land",null,9.0127351932697636E-2]
[null,null,"Wood fuel",null,-0.10372279077579635,null,null,"Covered adobe walls",null,-2.3413787296773743E-2,null,null,"Hasta 2 manzanas de tierra para agricultura",null,3.3255713708194967E-2]
[null,null,"No food cooked",null,-1.2206405371823393E-2,null,null,"Wood planks/shingles walls",null,-1.0266016942380185E-2,null,null,"3-10 manzanas de tierra para agricultura",null,4.5243701546075217E-2]
[null,null,"Electricity",null,6.6655237088328989E-2,null,null,"Electricity fuel",null,9.7558555946424055E-3,null,null,"Mas de 10 manzanas de tierra para agricultura",null,2.0004753702702896E-2]
[null,null,"Radio",null,5.3488084593611873E-2,null,null,"LPG fuel",null,9.4187259584441088E-2,null,null,"No cattle, milk cows or bulls",null,0.12616950325933091]
[null,null,"Television",null,8.2754972577006397E-2,null,null,"Wood fuel",null,-9.9109982508786776E-2,null,null,"1-4 cattle, milk cows or bulls",null,5.0802962499550505E-2]
[null,null,"Non-mobile telephone",null,8.1993407039721258E-2,null,null,"No food cooked",null,-2.1331141310206556E-2,null,null,"5-9 cattle, milk cows or bulls",null,4.0319670010234836E-2]
[null,null,"Refrigetaror",null,0.1008723485464148,null,null,"Electricity",null,6.6347766599043234E-2,null,null,"10+ cattle, milk cows or bulls",null,4.8906483497651643E-2]
[null,null,"Cocina",null,9.4917109129235802E-2,null,null,"Radio",null,5.6488845265437009E-2,null,null,"No horses, donkeys, mules",null,5.1462458938546861E-2]
[null,null,"Lavadora",null,8.7395876936410627E-2,null,null,"Television",null,8.1118101651557861E-2,null,null,"1 Caballo, burro, mula",null,3.8995403932468996E-2]
[null,null,"Secadora",null,3.4318052313157835E-2,null,null,"Non-mobile telephone",null,9.2153236531543642E-2,null,null,"2 Caballos, burros, mulas",null,7.4926175809761882E-3]
[null,null,"Ventilador",null,8.5083965998679248E-2,null,null,"Refrigetaror",null,0.10968448196698402,null,null,"3+ caballos, burros, mulas",null,4.0139120237665431E-3]
[null,null,"Aire acondicionado",null,3.543895672117528E-2,null,null,"Cocina",null,9.1671146057352659E-2,null,null,"No goats",null,9.3825559942097153E-3]
[null,null,"Computadora",null,7.7651946211925824E-2,null,null,"Lavadora",null,0.10324483214357399,null,null,"1 cabra",null,6.0744093591165709E-3]
[null,null,"Watch",null,6.3969445623574303E-2,null,null,"Secadora",null,4.3514244464833617E-2,null,null,"2-4 cabras",null,4.641228643048001E-3]
[null,null,"Mobile telephone",null,4.1733264416132926E-2,null,null,"Ventilador",null,8.4874740238531879E-2,null,null,"5+ cabras",null,3.1071722588106023E-4]
[null,null,"Bicycle",null,1.2557508028560592E-2,null,null,"Aire acondicionado",null,4.4493772672505372E-2,null,null,"No pollos",null,1.7545781597592108E-2]
[null,null,"Motorcycle/scooter",null,2.1715295219041763E-2,null,null,"Computadora",null,8.845818714082071E-2,null,null,"1-9 pollos",null,2.214007386305351E-3]
[null,null,"Car/truck",null,7.7453562828221564E-2,null,null,"Watch",null,7.6278072564534644E-2,null,null,"10-19 pollos",null,8.697394109904024E-3]
[null,null,"Dispositivos moviles",null,5.9044130378882745E-2,null,null,"Mobile telephone",null,4.1672917310075594E-2,null,null,"20+ pollos",null,2.7467921576944436E-2]
[null,null,"Laptop",null,7.6450080389120975E-2,null,null,"Motorcycle/scooter",null,2.1231723609485321E-2,null,null,"No pigs",null,9.9514137971085711E-3]
[null,null,"Household owns bank account",null,7.6746926129379264E-2,null,null,"Car/truck",null,9.0442423702063762E-2,null,null,"1-4 pigs",null,6.5959865497907683E-3]
[null,null,null,null,null,null,null,"Dispositivos moviles",null,7.0532010027745395E-2,null,null,"5-9 pigs",null,3.0143953599823556E-3]
[null,null,null,null,null,null,null,"Laptop",null,8.8696505555277277E-2,null,null,"10+ pigs",null,1.1820173623849635E-3]
[null,null,"Component Score Covariance Matrix",null,null,null,null,"Household owns bank account",null,8.8169008559248127E-2,null,null,"No patos",null,1.3610406385070764E-3]
[null,null,"Component",null,"1",null,null,null,null,null,null,null,"10-19 patos",null,2.2958013678769239E-3]
[null,null,"1",null,1.0000000000000004,null,null,null,null,null,null,null,"20+ patos",null,7.4471908527099743E-4]
[null,null,null,null,null,null,null,"Component Score Covariance Matrix",null,null,null,null,"No gallinas",null,2.9656871312535998E-2]
[null,null,null,null,null,null,null,"Component",null,"1",null,null,"1-9 gallinas",null,5.6458105864386253E-4]
[null,null,null,null,null,null,null,"1",null,0.99999999999999978,null,null,"10-19 gallinas",null,3.6746059656103162E-2]
[null,null,null,null,null,null,null,null,null,null,null,null,"20+ gallinas",null,1.4156181208815738E-2]
[null,null,null,null,null,null,null,null,null,null,null,null,"Household owns bank account",null,0.14420330698870937]
[]
[]
[null,null,null,null,null,null,null,null,null,null,null,null,"Total Variance Explained"]
[null,null,null,null,null,null,null,null,null,null,null,null,"Component",null,"Extraction Sums of Squared Loadings"]
[null,null,null,null,null,null,null,null,null,null,null,null,null,null,"Total","% of Variance","Cumulative %"]
[null,null,null,null,null,null,null,null,null,null,null,null,"1",null,5.5346284117281375,6.8328745823804162,6.8328745823804162]
[]
[]
[null,null,null,null,null,null,null,null,null,null,null,null,"Component Score Coefficient Matrix"]
[null,null,null,null,null,null,null,null,null,null,null,null,null,null,"Component"]
[null,null,null,null,null,null,null,null,null,null,null,null,null,null,"1"]
[null,null,null,null,null,null,null,null,null,null,null,null,"Persons per sleeping rooms",null,-5.1707104744309874E-2]
[null,null,null,null,null,null,null,null,null,null,null,null,"Earth/sand floor",null,-0.11307180360762449]
[null,null,null,null,null,null,null,null,null,null,null,null,"Wood planks floor",null,-5.6086047374008874E-3]
[null,null,null,null,null,null,null,null,null,null,null,null,"Ladrillo de barro",null,4.5417188981854255E-3]
[null,null,null,null,null,null,null,null,null,null,null,null,"Ceramic tiles floor",null,5.5382669926937335E-2]
[null,null,null,null,null,null,null,null,null,null,null,null,"Cement floor",null,2.4096911250833124E-2]
[null,null,null,null,null,null,null,null,null,null,null,null,"Carpet floor",null,6.2344341502476516E-2]
[null,null,null,null,null,null,null,null,null,null,null,null,"Thatch/palm leaf roof",null,-1.4399332649784938E-2]
[null,null,null,null,null,null,null,null,null,null,null,null,"Metal/tin roof",null,-3.9832231412234943E-2]
[null,null,null,null,null,null,null,null,null,null,null,null,"Calamine/cement fibre roof",null,7.4497475613112055E-3]
[null,null,null,null,null,null,null,null,null,null,null,null,"Cement roof",null,9.8434613812969605E-3]
[null,null,null,null,null,null,null,null,null,null,null,null,"Teja de barro o cemento",null,1.9449702801878622E-2]
[null,null,null,null,null,null,null,null,null,null,null,null,"Lamina de asbestof",null,3.3006907553519808E-2]
[null,null,null,null,null,null,null,null,null,null,null,null,"Cane/palm/trunks walls",null,-1.9563455108933279E-2]
[null,null,null,null,null,null,null,null,null,null,null,null,"Dirt walls",null,-1.0279092172768338E-2]
[null,null,null,null,null,null,null,null,null,null,null,null,"Bamboo with mud wall",null,-4.2446716781697175E-2]
[null,null,null,null,null,null,null,null,null,null,null,null,"Stone with mud walls",null,-6.5041431373240415E-3]
[null,null,null,null,null,null,null,null,null,null,null,null,"Uncovered adobe walls",null,-4.7541991595162744E-2]
[null,null,null,null,null,null,null,null,null,null,null,null,"Reused wood walls",null,-2.0770754631470149E-2]
[null,null,null,null,null,null,null,null,null,null,null,null,"Lamina metalica",null,-5.4379064295110954E-2]
[null,null,null,null,null,null,null,null,null,null,null,null,"Paja o palma",null,-4.2344170120796774E-3]
[null,null,null,null,null,null,null,null,null,null,null,null,"Cement walls",null,6.1625732647911137E-2]
[null,null,null,null,null,null,null,null,null,null,null,null,"Brick walls",null,2.3551660942387174E-2]
[null,null,null,null,null,null,null,null,null,null,null,null,"Cement blocks walls",null,3.1087782468437401E-2]
[null,null,null,null,null,null,null,null,null,null,null,null,"Covered adobe walls",null,6.8808008899030266E-3]
[null,null,null,null,null,null,null,null,null,null,null,null,"Wood planks/shingles walls",null,-1.8389535331680511E-2]
[null,null,null,null,null,null,null,null,null,null,null,null,"LPG fuel",null,0.10608698737664018]
[null,null,null,null,null,null,null,null,null,null,null,null,"Wood fuel",null,-0.10428021699401548]
[null,null,null,null,null,null,null,null,null,null,null,null,"No food cooked",null,-1.2520469050976347E-2]
[null,null,null,null,null,null,null,null,null,null,null,null,"Electricity",null,8.3855543703395818E-2]
[null,null,null,null,null,null,null,null,null,null,null,null,"Radio",null,6.604296371495294E-2]
[null,null,null,null,null,null,null,null,null,null,null,null,"Television",null,0.10010614959696056]
[null,null,null,null,null,null,null,null,null,null,null,null,"Non-mobile telephone",null,6.0507156638524406E-2]
[null,null,null,null,null,null,null,null,null,null,null,null,"Refrigetaror",null,0.12177769825951436]
[null,null,null,null,null,null,null,null,null,null,null,null,"Cocina",null,0.11315162782849567]
[null,null,null,null,null,null,null,null,null,null,null,null,"Lavadora",null,5.7842678523599055E-2]
[null,null,null,null,null,null,null,null,null,null,null,null,"Secadora",null,1.6173366551057927E-2]
[null,null,null,null,null,null,null,null,null,null,null,null,"Ventilador",null,8.5127937811115079E-2]
[null,null,null,null,null,null,null,null,null,null,null,null,"Aire acondicionado",null,1.867685076096581E-2]
[null,null,null,null,null,null,null,null,null,null,null,null,"Computadora",null,5.9673279557092618E-2]
[null,null,null,null,null,null,null,null,null,null,null,null,"Watch",null,5.4706390608291917E-2]
[null,null,null,null,null,null,null,null,null,null,null,null,"Mobile telephone",null,5.4941709572025273E-2]
[null,null,null,null,null,null,null,null,null,null,null,null,"Bicycle",null,4.1474112371398746E-2]
[null,null,null,null,null,null,null,null,null,null,null,null,"Motorcycle/scooter",null,4.0346828113894929E-2]
[null,null,null,null,null,null,null,null,null,null,null,null,"Animal drawn cart",null,2.4917683591442748E-2]
[null,null,null,null,null,null,null,null,null,null,null,null,"Car/truck",null,8.1826937737354236E-2]
[null,null,null,null,null,null,null,null,null,null,null,null,"Boat with motor",null,8.3151632219693686E-3]
[null,null,null,null,null,null,null,null,null,null,null,null,"Dispositivos moviles",null,3.7968503702643354E-2]
[null,null,null,null,null,null,null,null,null,null,null,null,"Laptop",null,6.1048070939453414E-2]
[null,null,null,null,null,null,null,null,null,null,null,null,"No agricultural land",null,-5.4242517447487454E-2]
[null,null,null,null,null,null,null,null,null,null,null,null,"Hasta 2 manzanas de tierra para agricultura",null,3.2949184349808008E-2]
[null,null,null,null,null,null,null,null,null,null,null,null,"3-10 manzanas de tierra para agricultura",null,3.8431788548686993E-2]
[null,null,null,null,null,null,null,null,null,null,null,null,"Mas de 10 manzanas de tierra para agricultura",null,2.5555132448659548E-2]
[null,null,null,null,null,null,null,null,null,null,null,null,"No cattle, milk cows or bulls",null,-6.4178376755383057E-2]
[null,null,null,null,null,null,null,null,null,null,null,null,"1-4 cattle, milk cows or bulls",null,4.0724527197057908E-2]
[null,null,null,null,null,null,null,null,null,null,null,null,"5-9 cattle, milk cows or bulls",null,3.628022872263905E-2]
[null,null,null,null,null,null,null,null,null,null,null,null,"10+ cattle, milk cows or bulls",null,3.995717266499358E-2]
[null,null,null,null,null,null,null,null,null,null,null,null,"No horses, donkeys, mules",null,-4.0988006702967796E-2]
[null,null,null,null,null,null,null,null,null,null,null,null,"1 Caballo, burro, mula",null,3.5679457589907856E-2]
[null,null,null,null,null,null,null,null,null,null,null,null,"2 Caballos, burros, mulas",null,1.5639696295634997E-2]
[null,null,null,null,null,null,null,null,null,null,null,null,"3+ caballos, burros, mulas",null,1.1447099467154703E-2]
[null,null,null,null,null,null,null,null,null,null,null,null,"No goats",null,-1.7501372734861787E-2]
[null,null,null,null,null,null,null,null,null,null,null,null,"1 cabra",null,1.4081974703181614E-2]
[null,null,null,null,null,null,null,null,null,null,null,null,"2-4 cabras",null,1.2309148573174611E-2]
[null,null,null,null,null,null,null,null,null,null,null,null,"5+ cabras",null,-3.1848882398932293E-3]
[null,null,null,null,null,null,null,null,null,null,null,null,"No pollos",null,-2.3933041362540222E-2]
[null,null,null,null,null,null,null,null,null,null,null,null,"1-9 pollos",null,-8.5016077706750841E-3]
[null,null,null,null,null,null,null,null,null,null,null,null,"10-19 pollos",null,1.6850240614148543E-2]
[null,null,null,null,null,null,null,null,null,null,null,null,"20+ pollos",null,2.9945007845463775E-2]
[null,null,null,null,null,null,null,null,null,null,null,null,"No pigs",null,-1.8024113954560338E-2]
[null,null,null,null,null,null,null,null,null,null,null,null,"1-4 pigs",null,1.4674097910427735E-2]
[null,null,null,null,null,null,null,null,null,null,null,null,"5-9 pigs",null,9.9199992225741454E-3]
[null,null,null,null,null,null,null,null,null,null,null,null,"10+ pigs",null,6.2118857531515137E-3]
[null,null,null,null,null,null,null,null,null,null,null,null,"No patos",null,-6.6657201754993026E-3]
[null,null,null,null,null,null,null,null,null,null,null,null,"10-19 patos",null,8.6572246422763656E-3]
[null,null,null,null,null,null,null,null,null,null,null,null,"20+ patos",null,4.930690852745152E-3]
[null,null,null,null,null,null,null,null,null,null,null,null,"No gallinas",null,-3.1115314726137579E-2]
[null,null,null,null,null,null,null,null,null,null,null,null,"1-9 gallinas",null,4.293136367710085E-3]
[null,null,null,null,null,null,null,null,null,null,null,null,"10-19 gallinas",null,3.4635137786250263E-2]
[null,null,null,null,null,null,null,null,null,null,null,null,"20+ gallinas",null,2.1497333227169447E-2]
[null,null,null,null,null,null,null,null,null,null,null,null,"Household owns bank account",null,6.8611851955359876E-2]
[]
[]
[null,null,null,null,null,null,null,null,null,null,null,null,"Component Score Covariance Matrix"]
[null,null,null,null,null,null,null,null,null,null,null,null,"Component",null,"1"]
[null,null,null,null,null,null,null,null,null,null,null,null,"1",null,1]
[]
[]
[]
[]
[]
[]
[]
[]
[]
[]
[]
[]
[]
[]
[]
[]
[]
[]
[]
[]
[]
[]
[]
[]
[]
[]
[]
[]
[]
[]
[]
[]
[]
[]
[]
[]
[]
[]
[]
[]
[]
[]
[]
[]
[]
[]
[]
[]
[]
[]
[]
[]
[]
[]
[]
[]
[]
[]
[]
[]
[]
[]
[]
[]
[]
[]
[]
[]
[]
[]
[]
[]
[]
[]
[]
[]
[]
[]
[]
[]
[]
[]
[]
[]
[]
[]
[]
[]
[]
[]
[]
[]
[]
[]
[]
[]
[]
[]
[]
[]
[]
[]
[]
[]
[]
[]
[]
[]
[]
[]
[]
[]
[]
[]
[]
[]
[]
[]
[]
[]
[]
[]
[]
[]
[]
[]
[]
[]
[]
[]
[]
[]
[]
[]
[]
[]
[]
[]
[]
[]
[]
[]
[]
[]
[]
[]
[]
[]
[]
[]
[]
[]
[]
[]
[]
[]
[]
[]
[]
[]
[]
[]
[]
[]
[]
[]
[]
[]
[]
[]
[]
[]
[]
[]
[]
[]
[]
[]
[]
[]
[]
[]
[]
[]
[]
[]
[]
[]
[]
[]
[]
[]
[]
[]
[]
[]
[]
[]
[]
[]
[]
[]
[]
[]
[]
[]
[]
[]
[]
[]
[]
[]
[]
[]
[]
[]
[]
[]
[]
[]
[]
[]
[]
[]
[]
[]
[]
[]
[]
[]
[]
[]
[]
[]
[]
[]
[]
[]
[]
[]
[]
[]
[]
[]
[]
[]
[]
[]
[]
[]
[]
[]
[]
[]
[]
[]
[]
[]
[]
[]
[]
[]
[]
[]
[]
[]
[]
[]
[]
[]
[]
[]
[]
[]
[]
[]
[]
[]
[]
[]
[]
[]
[]
[]
[]
[]
[]
[]
[]
[]
[]
[]
[]
[]
[]
[]
[]
[]
[]
[]
[]
[]
[]
[]
[]
[]
[]
[]
[]
[]
[]
[]
[]
[]
[]
[]
[]
[]
[]
[]
[]
[]
[]
[]
[]
[]
[]
[]
[]
[]
[]
[]
[]
[]
[]
[]
[]
[]
[]
[]
[]
[]
[]
[]
[]
[]
[]
[]
[]
[]
[]
[]
[]
[]
[]
[]
[]
[]
["MICS14"]
["El Salvador",null,"Count"]
["W_text_t","",12507]
["W_text_i","",12507]
["S_text_s","",12507]
["S_text_i","",12507]
["Urban/Rural","Urban",7350]
[null,"Rural",5157]
[null,"Missing",0]
["2014"]
[]
["Sub-national region names","Weighted population"]
[{"$f":"R15","v":" Metropolitana"},{"$f":"BR122+BR123","v":12351.795030576226}]
[{"$f":"S15","v":"Central"},{"$f":"BS122+BS123","v":10350.906296548301}]
[{"$f":"T15","v":"Occidente"},{"$f":"BT122+BT123","v":10315.449021818942}]
[{"$f":"U15","v":"Oriental"},{"$f":"BU122+BU123","v":9721.9304422209825}]
[{"$f":"V15","v":"Para Central"},{"$f":"BV122+BV123","v":6265.7050663078871}]
[{"$f":"W15","v":0},{"$f":"BW122+BW123","v":0}]
[{"$f":"X15","v":0},{"$f":"BX122+XR123","v":0}]
[{"$f":"Y15","v":0},{"$f":"BY122+BY123","v":0}]
[{"$f":"Z15","v":0},{"$f":"BZ122+BZ123","v":0}]
[{"$f":"AA15","v":0},{"$f":"CA122+CA123","v":0}]
[{"$f":"AB15","v":0},{"$f":"CB122+CB123","v":0}]
[{"$f":"AC15","v":0},{"$f":"CC122+CC123","v":0}]
[{"$f":"AD15","v":0},{"$f":"CD122+CD123","v":0}]
[{"$f":"AE15","v":0},{"$f":"CE122+CE123","v":0}]
[{"$f":"AF15","v":0},{"$f":"CF122+CF123","v":0}]
[{"$f":"AG15","v":0},{"$f":"CG122+CG123","v":0}]
[{"$f":"AH15","v":0},{"$f":"CH122+CH123","v":0}]
[{"$f":"AI15","v":0},{"$f":"CI122+CI123","v":0}]
[{"$f":"AJ15","v":0},{"$f":"CJ122+CJ123","v":0}]
[{"$f":"AK15","v":0},{"$f":"CK122+CK123","v":0}]
[{"$f":"AL15","v":0},{"$f":"CL122+CL123","v":0}]
[{"$f":"AM15","v":0},{"$f":"CM122+CM123","v":0}]
[{"$f":"AN15","v":0},{"$f":"CN122+CN123","v":0}]
[{"$f":"AO15","v":0},{"$f":"CO122+CO123","v":0}]
[{"$f":"AP15","v":0},{"$f":"CP122+CP123","v":0}]
[{"$f":"AQ15","v":0},{"$f":"CQ122+CQ123","v":0}]
[{"$f":"AR15","v":0},{"$f":"CR122+CR123","v":0}]
[{"$f":"AS15","v":0},{"$f":"CS122+CS123","v":0}]
[{"$f":"AT15","v":0},{"$f":"CT122+CT123","v":0}]
[{"$f":"AU15","v":0},{"$f":"CU122+CU123","v":0}]
[{"$f":"AV15","v":0},{"$f":"CV122+CV123","v":0}]
[{"$f":"AW15","v":0},{"$f":"CW122+CW123","v":0}]
[{"$f":"AX15","v":0},{"$f":"CX122+CX123","v":0}]
[{"$f":"AY15","v":0},{"$f":"CY122+CY123","v":0}]
[]
[{"$f":"34-COUNTIF(A1037:A1071,\"0\")","v":5},"Sub-regions"]

{"sheet":"data_summary","index":5,"n_rows":72,"n_cols":52,"rows_kept":72,"cut":false,"hidden":false,"merged":[]}
["iso3","year","data_source","row","var1","var2","varname","total_q1","total_q2","total_q3","total_q4","total_q5","urban_q1","urban_q2","urban_q3","urban_q4","urban_q5","rural_q1","rural_q2","rural_q3","rural_q4","rural_q5","region_1_name","region_2_name","region_3_name","region_4_name","region_5_name","region_1","region_2","region_3","region_4","region_5","n_total_q1","n_total_q2","n_total_q3","n_total_q4","n_total_q5","n_urban_q1","n_urban_q2","n_urban_q3","n_urban_q4","n_urban_q5","n_rural_q1","n_rural_q2","n_rural_q3","n_rural_q4","n_rural_q5","n_region_1","n_region_2","n_region_3","n_region_4","n_region_5"]
["SLV",2014,"SLV_2014_MICS",16,"Water","Improved","w_imp",88.852663405113972,95.813714009825318,98.605347925448967,99.723414869597633,99.526171322481261,97.673234095855832,99.678087670451276,99.901476528957161,99.962300140697721,99.907412891921851,84.717593663554482,87.359743095513494,94.137965969599307,95.491582140486486,97.046817753374881," Metropolitana","Central","Occidente","Oriental","Para Central",99.623256917796638,95.373248891508709,95.769243519597538,96.699836667374257,93.12988872727999]
["SLV",2014,"SLV_2014_MICS",17,"Water","Not Improved","",11.147336594886029,4.1862859901746683,1.394652074551052,0.27658513040237082,0.4738286775187015,2.3267659041441839,0.3219123295487325,0.098523471042831406,0.037699859302274097,0.092587108078152597,15.282406336445501,12.64025690448654,5.8620340304007357,4.5084178595134663,2.9531822466251181," Metropolitana","Central","Occidente","Oriental","Para Central",0.37674308220337249,4.6267511084910611,4.2307564804023876,3.30016333262573,6.8701112727200364]
["SLV",2014,"SLV_2014_MICS",18,"Water ladder","Basic","w_bas",86.127081702126233,94.217962431149815,98.135814828537022,99.398446684688892,99.256059461383117,96.799689632614189,99.448873411317351,99.670439807926343,99.941798624769675,99.627710204778055,80.730945523661745,84.854045252343383,92.143012568095571,93.640663248005296,95.974927704374409," Metropolitana","Central","Occidente","Oriental","Para Central",99.174852762022837,93.567302065218598,95.315887349321869,95.306942296947071,91.80490913972433]
["SLV",2014,"SLV_2014_MICS",19,"Water ladder","Limited","w_lim",2.725581702987752,1.595751578675535,0.46953309691187411,0.32496818490871893,0.27011186109814672,0.87354446324164858,0.22921425913394811,0.2310367210308123,0.0205015159280569,0.27970268714377511,3.986648139892738,2.505697843170108,1.99495340150377,1.850918892481193,1.071890049000457," Metropolitana","Central","Occidente","Oriental","Para Central",0.44840415577380188,1.805946826290233,0.45335617027566599,1.392894370427233,1.324979587555642]
["SLV",2014,"SLV_2014_MICS",20,"Water ladder","Unimproved","w_unimp",9.2464837550236201,3.2958203263388972,1.2679807616040599,0.27658513040238902,0.15143691164091591,2.3267659041441622,0.30023714141727231,0.098523471042845007,0.037699859302268497,0.092587108078170402,12.8856091438282,10.154468874114549,4.862866501798778,3.0148931028699399,1.99227276295936," Metropolitana","Central","Occidente","Oriental","Para Central",0.24884877816160109,4.1155205861190227,3.1117809043474618,2.8768647219369128,5.5700284922806924]
["SLV",2014,"SLV_2014_MICS",21,"Water ladder","Surface water","w_sur",1.9008528398623949,0.89046566383575465,0.12667131294704381,0,0.32239176587782031,0,0.0216751881314289,0,0,0,2.3967971926173171,2.4857880303719551,0.99916752860188063,1.493524756643571,0.96090948366577333," Metropolitana","Central","Occidente","Oriental","Para Central",0.12789430404175969,0.51123052237214617,1.118975576055002,0.42329861068878333,1.3000827804393349]
["SLV",2014,"SLV_2014_MICS",22,"Improved water point at more than 30 minutes","Yes","",3.0675295467067332,1.665473043359843,0.47617406843578791,0.32586949146663341,0.2713978218080344,0.89435398687050549,0.22995451105739539,0.23126457091336841,0.020509247885653701,0.27996189576678632,4.7058089913710504,2.8682523029292111,2.119180482556863,1.938305818159066,1.104508188742934," Metropolitana","Central","Occidente","Oriental","Para Central",0.45009987591933392,1.893556995572812,0.47338388987367791,1.4404309442822301,1.4227221847496141]
["SLV",2014,"SLV_2014_MICS",23,"Improved water point at more than 30 minutes","No","",96.932470453293291,98.334526956640175,99.523825931564133,99.674130508533352,99.728602178191977,99.105646013129501,99.770045488942614,99.768735429086618,99.979490752114359,99.720038104233183,95.294191008628943,97.131747697070793,97.880819517443172,98.061694181840934,98.895491811257045," Metropolitana","Central","Occidente","Oriental","Para Central",99.549900124080665,98.106443004427305,99.526616110126326,98.559569055717816,98.577277815250369]
["SLV",2014,"SLV_2014_MICS",29,"Piped water","Yes","w_pip",64.287758182607121,76.99003444005308,84.944444390674988,92.311980919239488,93.967709641577187,87.253882179291409,93.117633171491747,95.34552195620472,97.578881102589932,95.737839730607831,55.098322163438873,58.439230807865393,69.182381080023731,70.488785027438311,67.296680920967574," Metropolitana","Central","Occidente","Oriental","Para Central",96.507348693987367,81.613261926280757,80.596743971237089,72.685080090448849,74.720388212771965]
["SLV",2014,"SLV_2014_MICS",30,"Piped water","No","",35.712241817393142,23.00996555994687,15.055555609324911,7.6880190807604398,6.0322903584228067,12.746117820708619,6.8823668285081716,4.6544780437952333,2.4211188974100608,4.2621602693921687,44.90167783656122,41.560769192134558,30.817618919976329,29.5112149725616,32.703319079032397," Metropolitana","Central","Occidente","Oriental","Para Central",3.4926513060126378,18.386738073718998,19.403256028763039,27.314919909551062,25.279611787227939]
["SLV",2014,"SLV_2014_MICS",31,"Piped water on premises","Yes","w_pop",47.105653540667518,66.31200708597521,78.490762419829466,88.981747982268288,93.507479574021986,68.423515884261704,84.722310777522196,91.759630401134586,96.103369892674863,95.375233324357325,36.168336732441652,48.63023132606731,60.268983460051302,64.591987940440106,63.855902106704718," Metropolitana","Central","Occidente","Oriental","Para Central",92.93104876933684,74.326179954493682,70.873504850274657,62.705164470988997,65.697409705954882]
["SLV",2014,"SLV_2014_MICS",32,"Piped water on premises","No","",52.894346459332908,33.687992914024697,21.50923758017035,11.01825201773166,6.4925204259779949,31.576484115738459,15.277689222477781,8.2403695988653176,3.8966301073251479,4.6247666756426744,63.831663267558369,51.36976867393269,39.731016539948769,35.408012059559873,36.144097893295282," Metropolitana","Central","Occidente","Oriental","Para Central",7.0689512306631901,25.673820045506041,29.12649514972551,37.294835529010918,34.302590294045132]
["SLV",2014,"SLV_2014_MICS",35,"Water source on premises","Yes","",56.427343038796828,75.996967561276037,86.807209925436467,93.116560310337576,96.823691621103606,73.495948945169459,89.210231004408882,94.485525356180062,97.503846725331329,97.900801896278438,46.55914908701638,60.863235321043767,72.081886828320989,78.362953871818817,80.618338687212116," Metropolitana","Central","Occidente","Oriental","Para Central",93.817274566254895,78.87086741225896,77.637851792549782,77.774651403684729,76.315661953182243]
["SLV",2014,"SLV_2014_MICS",36,"Water source on premises","No","",43.572656961203528,24.003032438723871,13.192790074563399,6.8834396896623549,3.176308378896374,26.504051054830651,10.78976899559107,5.5144746438199306,2.496153274668679,2.0991981037215051,53.440850912983713,39.136764678956212,27.91811317167905,21.637046128181069,19.38166131278787," Metropolitana","Central","Occidente","Oriental","Para Central",6.1827254337451221,21.129132587740699,22.36214820745035,22.225348596315222,23.68433804681764]
["SLV",2014,"SLV_2014_MICS",37,"Improved Water source on premises","Yes","w_premises",55.358787206749703,74.738457171257934,86.341668231672557,93.093239061166884,96.807666646016969,72.687542646715215,89.011934844580665,94.485525356180062,97.466146866029064,97.900801896278438,45.316111735563851,59.15745106671595,70.640694907343786,77.479075175494103,80.152540699085208," Metropolitana","Central","Occidente","Oriental","Para Central",93.817274566254895,78.555370767207549,76.867273257143054,77.037622423450301,74.81951234811784]
["SLV",2014,"SLV_2014_MICS",38,"Improved Water source on premises","No","",44.641212793250673,25.26154282874198,13.658331768327299,6.9067609388330498,3.1923333539829999,27.312457353284881,10.988065155419269,5.5144746438199306,2.5338531339709531,2.0991981037215051,54.683888264436227,40.842548933284029,29.359305092656271,22.520924824505791,19.84745930091476," Metropolitana","Central","Occidente","Oriental","Para Central",6.1827254337451221,21.444629232792089,23.132726742857081,22.96237757654966,25.18048765188205]
["SLV",2014,"SLV_2014_MICS",41,"Water point at more than 30 minutes","Yes","",4.0112050057641877,1.937440901788928,0.49773496880904161,0.33679149498519639,0.28798557702912281,0.98354948666596387,0.27656888804790097,0.2310331715341018,0.0205014945838474,0.30853502248404951,6.6979032110273273,3.216049452689806,2.5359637847971559,1.968177186053508,1.1026785917978521," Metropolitana","Central","Occidente","Oriental","Para Central",0.51299581226744562,2.5558759134066298,0.65030500613060149,1.594687871342849,1.863271428807534]
["SLV",2014,"SLV_2014_MICS",42,"Water point at more than 30 minutes","No","w_30min",95.988794994235988,98.062559098210983,99.502265031190944,99.663208505014808,99.712014422970867,99.016450513334036,99.723431111952095,99.768966828465892,99.97949850541616,99.691464977515935,93.302096788972662,96.783950547310226,97.464036215202867,98.031822813946505,98.897321408202131," Metropolitana","Central","Occidente","Oriental","Para Central",99.487004187732538,97.444124086593305,99.349694993869392,98.405312128657215,98.136728571192421]
["SLV",2014,"SLV_2014_MICS",58,"Fuente principal de agua para beber","Tubería dentro de la vivienda","",12.37303289805045,24.765155887422949,38.704297292162202,46.158937345752513,38.408246900553713,27.695439790903151,42.550725485982689,49.36077056683272,49.456382440409463,35.912302152667188,8.390636324557784,12.2526783015976,18.681238745454639,23.490766630254129,25.082571232633089," Metropolitana","Central","Occidente","Oriental","Para Central",40.757176789104143,32.052039666983681,35.611838057836977,21.48703236171804,25.660039661846671]
["SLV",2014,"SLV_2014_MICS",59,"Fuente principal de agua para beber","Tubería dentro del terreno, patio o lote","",34.179288834841252,38.155913546131288,30.653272914823951,18.4456881172758,9.161588616875731,38.013379585432297,31.176094778231569,19.926056420695279,10.391389627794959,5.7608763968386638,27.70337899431247,35.740419835166897,40.483616499908578,35.874472765604963,31.977402623885549," Metropolitana","Central","Occidente","Oriental","Para Central",10.792646796757539,30.14698214661686,30.993078906147129,31.517260838704939,33.267433286731247]
["SLV",2014,"SLV_2014_MICS",60,"Fuente principal de agua para beber","Tubería al vecino","",11.038893481142949,5.0404781951800164,2.6749504735512319,0.93854519581076312,0.1252387400594622,10.616809769343099,3.318274142489253,1.533926634410623,0.12602231659390711,0.1011654804662888,11.535952287411069,6.5228230224573576,5.1744772350213983,2.6716011684838432,0.62688754395628932," Metropolitana","Central","Occidente","Oriental","Para Central",1.395993446265605,3.4697490206703701,5.3382589715414408,5.8369377405129628,4.6713478772241848]
["SLV",2014,"SLV_2014_MICS",61,"Fuente principal de agua para beber","Llave/grifo público","",6.0355115734519256,5.4384207493810228,3.1005149593437391,1.886636112349791,0.14814315805340339,7.9037666923531393,4.3387655213740466,1.600411641983245,0.92823568418704139,0.016389006266247501,7.3940331435861486,3.286176459340723,3.4779289550149199,2.6056682982210848,2.8138912703065579," Metropolitana","Central","Occidente","Oriental","Para Central",1.7145711210390899,3.5477244971387751,4.3189616364565611,3.47370116386633,4.2394025582293517]
["SLV",2014,"SLV_2014_MICS",62,"Fuente principal de agua para beber","Pozo con tubería","",1.600936084775632,2.0163130058231662,1.239226013934728,0.93945996819341171,0.69724542644971776,0.94651967942069837,1.2638514794146409,0.60717399064696009,0.097698938577522196,0.48837992460928831,1.4135962507455191,2.106281576316158,2.8466296327395622,2.1856725689715302,2.966682662240804," Metropolitana","Central","Occidente","Oriental","Para Central",0.029231645851548801,1.002461894463204,1.264117867421195,2.613649936729797,2.3065498828231181]
["SLV",2014,"SLV_2014_MICS",63,"Fuente principal de agua para beber","Pozo protegido","",11.189719421398809,9.7660462792127873,7.0923753395928157,3.5285035112878429,1.9218235161349451,6.1615028607887483,3.1905381320591379,2.196211996681082,0.61223800387030303,0.98142768681393144,13.49963389505529,12.130171412401481,12.536511897908509,12.72909681543821,15.726841962044301," Metropolitana","Central","Occidente","Oriental","Para Central",0.75480335109323959,4.2261250899059064,6.9446335853721006,14.37191185288067,10.19504103569566]
["SLV",2014,"SLV_2014_MICS",64,"Fuente principal de agua para beber","Pozo no protegido","",2.3172052834087919,1.278114832626275,0.50116292066286749,0.078099236072967496,0.030282107594992599,0.7003752221161953,0.24394299015931961,0,0.037699859302274097,0,2.471377126751884,3.302692429950377,2.2334009479297721,0.75852024259528072,0.68255543481412784," Metropolitana","Central","Occidente","Oriental","Para Central",0.077733211582533907,0.33124015869359352,0.9164000052890624,1.508047185292142,2.0283693750413412]
["SLV",2014,"SLV_2014_MICS",65,"Fuente principal de agua para beber","Manantial protegido","",8.1850940850610474,4.2982331824388602,1.917887092298556,0.77929727506652791,0.28386925059133161,1.2576151349099129,0.54839177765037173,0.21776395036044741,0.32744069163845257,0.068379110105897201,10.714989519108849,10.73825689269191,6.2441683059487376,4.849758156449437,4.1469834663700613," Metropolitana","Central","Occidente","Oriental","Para Central",0.81207702590127762,5.6528505277033876,3.1353396013155188,2.6249697389914588,4.0162743642337597]
["SLV",2014,"SLV_2014_MICS",66,"Fuente principal de agua para beber","Manantial no protegido","",6.448439826622641,1.864624535569761,0.57118253121841789,0.16589495199840479,0.064227740357523697,1.193453015216996,0,0.083248019840845899,0,0,9.9733799069340279,6.5427848581021486,2.593608790633176,1.8330574969488991,0.93296050304076028," Metropolitana","Central","Occidente","Oriental","Para Central",0.1417407034340416,3.7276408219706481,1.7521708922229851,1.158035360467115,3.139064964990316]
["SLV",2014,"SLV_2014_MICS",67,"Fuente principal de agua para beber","Recogen agua de lluvia","",1.7567563174185501,0.5846134618706591,0.40973975788396189,0,0,0.22381013800824409,0.036006330431371102,0,0,0,2.6361571385229379,1.617672682506047,1.0808927040523579,0.72181701412806165,0.74994871364611215," Metropolitana","Central","Occidente","Oriental","Para Central",0.32951429415402961,0.64367002465901113,1.24060197791185,0.35312889137263548,0]
["SLV",2014,"SLV_2014_MICS",68,"Fuente principal de agua para beber","Carro-tanque / camión cisterna","",1.581939590587921,1.303321540670757,0.68725897537847724,0.55868192783448878,0.19304386440373181,1.601844938784301,0.1922130339884825,0.23961149953736369,0.052070774198059597,0,1.054051107546903,1.981695818499684,1.140001868754128,1.4531568666886221,2.3376814798753589," Metropolitana","Central","Occidente","Oriental","Para Central",0.54246930040547336,0.66687984999417405,1.9693839107954541,0.32970885970365521,0.83938072922059015]
["SLV",2014,"SLV_2014_MICS",69,"Fuente principal de agua para beber","Carreta con tanque/tambor pequeño","",0,0,0.050281354063048803,0,0,0,0,0,0,0,0,0,0,0.13197795816639199,0," Metropolitana","Central","Occidente","Oriental","Para Central",0,0.047572453815892,0,0,0]
["SLV",2014,"SLV_2014_MICS",70,"Fuente principal de agua para beber","Agua de superficie (río, arroyo, represa, lago, estanque, canal, canal de irrigación)","",1.6910197196367049,0.84497255576298369,0.1229726057566638,0,0.32193950880469507,0,0.0208810800050639,0,0,0,2.120303812050973,2.323644476437364,0.94746583229465031,1.452179835932573,0.95464405800017427," Metropolitana","Central","Occidente","Oriental","Para Central",0.12590415496430249,0.49321415972550608,1.058637532510734,0.3982085384056121,1.2393513910731251]
["SLV",2014,"SLV_2014_MICS",71,"Fuente principal de agua para beber","Agua embotellada/envasada","",0.91149111838580643,4.445218161693826,12.07554375241611,26.48766541602642,48.586971849359202,3.252545505912281,13.063226988829641,24.219549827809399,37.970821663428048,56.578493134154357,0.37516500270755632,0.98356709453558544,2.472500124796515,8.7775938980802639,10.61792679841674," Metropolitana","Central","Occidente","Oriental","Para Central",42.494773147224791,13.91719371955725,4.9530290047997942,14.09153528289367,7.9344193312753406]
["SLV",2014,"SLV_2014_MICS",72,"Fuente principal de agua para beber","Otra (especifique)","",0.69067176521789564,0.19857406621564749,0.19933401691310301,0.032590942330998497,0.057379320761490001,0.43293766681099272,0.057088259384348999,0.0152754512019854,0,0.092587108078152597,0.71734549070862197,0.47113513999664369,0.087558459543138206,0.46466028403671322,0.38302225077005653," Metropolitana","Central","Occidente","Oriental","Para Central",0.031365012222494403,0.0746559681013126,0.50354805037960593,0.2358722484608605,0.46332554161525441]
["SLV",2014,"SLV_2014_MICS",122,"Sanitation","Improved","s_imp",88.152909912550641,96.899144711432214,98.89981864778845,99.239818554264673,99.799414838292236,96.784573203827961,99.216377650482073,99.529401128377515,99.846126561853453,99.714103174335349,82.330222921687721,89.590842220756144,95.709828855033393,97.351078488013812,98.305116961221586," Metropolitana","Central","Occidente","Oriental","Para Central",99.359129087485755,96.310991702891258,96.831847531303268,94.07391838047532,95.160237544344213,6996.5223630672099,7917.058967410193,8689.8335337714743,9226.3646065947141,9656.8626588478073,5261.9130356901624,5673.3579602024502,5883.1287190120374,5997.790202205364,6033.5598560237086,2438.853147023266,2557.0371615209729,2688.6205031904419,2954.4998549389329,2997.8816898840878,12223.778466963009,8359.6735731614099,9140.6186525507328,8259.3179143468187,4503.2535226693881]
["SLV",2014,"SLV_2014_MICS",123,"Sanitation","Not Improved","",11.847090087449359,3.1008552885677858,1.10018135221155,0.76018144573532709,0.20058516170776389,3.2154267961720389,0.78362234951792686,0.47059887162248509,0.15387343814654739,0.28589682566465058,17.669777078312279,10.409157779243859,4.2901711449666067,2.6489215119861882,1.694883038778414," Metropolitana","Central","Occidente","Oriental","Para Central",0.64087091251424511,3.6890082971087419,3.1681524686967322,5.9260816195246804,4.8397624556557872,2805.942173636829,1884.110437503228,1103.4192717857829,581.74438208722631,143.9274627679074,808.53616666493679,399.27882719290022,186.06700001952561,69.536250776533109,40.316861559280369,1286.806927018416,1177.023562136884,1043.2111643321341,776.56265418363193,731.80431389673276,128.01656361321349,1991.2327233868921,1174.830369268208,1462.612527874164,1762.4515436384991]
["SLV",2014,"SLV_2014_MICS",124,"Sanitation ladder","Basic","s_bas",65.309108633923557,81.167905445136967,87.45858083051435,94.199274154289967,97.731015086245819,75.007139726390619,85.878437927987946,93.698220604378491,96.618455048208375,98.035635213403197,57.386067561061509,71.536987807232379,81.257034639853003,86.827797010817008,91.547873432144257," Metropolitana","Central","Occidente","Oriental","Para Central",92.27017237636251,83.565378468811105,84.599111657705848,82.08983332690417,82.753826438127405,5183.4549707153355,6631.7519683381543,7684.5490609406816,8757.7432293350776,9456.7186764259477,4077.9334271065231,4910.6723200968936,5538.4508126089486,5803.9028953353754,5931.9981251720928,1699.936991543319,2041.757078202653,2282.621669839873,2635.1296529777128,2791.81493287184,11351.65089102218,7253.3702920637697,7985.887264597156,7207.1626509751259,3916.1468070969231]
["SLV",2014,"SLV_2014_MICS",125,"Sanitation ladder","Limited","s_lim",22.84380127862725,15.731239266295249,11.44123781727404,5.0405443999746824,2.0683997520464241,21.777433477437409,13.33793972249425,5.8311805239990129,3.227671513645058,1.6784679609321269,24.944155360626301,18.053854413523759,14.452794215180379,10.52328147719679,6.7572435290773329," Metropolitana","Central","Occidente","Oriental","Para Central",7.0889567111232381,12.745613234080031,12.232735873597671,11.98408505357099,12.40641110621679,1813.0673923518859,1285.3069990720389,1005.2844728307859,468.62137725963299,200.14398242186101,1183.979608583644,762.68564010556304,344.67790640308738,193.8873068699875,101.56173085161539,738.91615547994968,515.28008331832018,405.99883335056921,319.37020196121932,206.06675701224799,872.12757594083212,1106.303281097629,1154.7313879536009,1052.155263371679,587.10671557246383]
["SLV",2014,"SLV_2014_MICS",126,"Sanitation ladder","Unimproved","s_unimp",2.4921562817342959,1.4900538899109961,0.65452841418908747,0.62747388929031445,0.18719058213535791,2.1586741796654252,0.56981287216345322,0.47059887162249942,0.1538734381465616,0.285896825664679,2.6251430747986291,1.8113612046431631,1.768015650045641,1.0368637002759731,1.1612621218636721," Metropolitana","Central","Occidente","Oriental","Para Central",0.51877135280479081,1.458664242728787,1.2241536945635121,1.2927861599952171,1.0741213895229009,1888.9281048994919,1726.2330636441609,1059.775352929845,568.72828031487961,142.61468813634309,744.38653588534919,386.29495421614212,186.06700001952561,69.536250776533109,40.316861559280369,726.29500466381023,855.97661714471917,949.08856686851266,716.41576954553,711.90192924531664,112.9350762646644,1760.371900227371,974.29816673773598,1012.16676611611,1526.507580578839]
["SLV",2014,"SLV_2014_MICS",127,"Sanitation ladder","Open defecation","s_od",9.3549338057148965,1.6108013986567891,0.44565293802251782,0.13270755644504509,0.0133945795724058,1.0567526165065391,0.2138094773543506,0,0,0,15.04463400351356,8.5977965746006948,2.5221554949209848,1.6120578117102311,0.53362091691474367," Metropolitana","Central","Occidente","Oriental","Para Central",0.12209955970946459,2.2303440543800859,1.9439987741329769,4.6332954595296254,3.7656410661329058,917.01406873733845,157.87737385906661,43.643918855938672,13.016101772346641,1.3127746315643021,64.149630779587781,12.98387297675804,0,0,0,560.51192235460314,321.04694499216532,94.122597463622043,60.14688463810208,19.902384651416071,15.0814873485491,230.86082315951981,200.5322025304726,450.44576175805349,235.94396305965981]
["SLV",2014,"SLV_2014_MICS",128,"Shared among Improved Sanitation","Yes","s_shared",25.913836878769789,16.23465234202348,11.56851243379897,5.0791551953699861,2.0725569938440112,22.500934556558111,13.44328430280023,5.8587517435955361,3.232645696721701,1.6832804061804321,30.29768956699305,20.151450713051901,15.100637403783541,10.80961982202637,6.8737454752664222," Metropolitana","Central","Occidente","Oriental","Para Central",7.1346808051038861,13.23380956703139,12.632967546801311,12.73900913226789,13.03738980310496]
["SLV",2014,"SLV_2014_MICS",129,"Shared among Improved Sanitation","No","",74.086163121230399,83.76534765797652,88.431487566200957,94.920844804629979,97.927443006155997,77.499065443441964,86.556715697199891,94.141248256404452,96.767354303278282,98.316719593819556,69.702310433007057,79.848549286948099,84.899362596216463,89.190380177973623,93.126254524733582," Metropolitana","Central","Occidente","Oriental","Para Central",92.865319194896117,86.766190432968486,87.367032453198959,87.260990867731948,86.962610196895014]
["SLV",2014,"SLV_2014_MICS",135,"Sanitation type","Sewer connection","s_sew",2.1868817211201779,8.7537129238156339,27.252577450579111,54.64112259646916,76.485688293120731,13.096709624129581,37.438864957346432,59.772223619724187,73.357406375996874,85.201864130673997,0.18784424755484719,0.25828622446167221,1.3693708842533849,2.3525877436882521,3.1919766500182609," Metropolitana","Central","Occidente","Oriental","Para Central",78.662792351888911,18.740508679369281,23.936946217656399,15.13949006873065,15.953151721044289]
["SLV",2014,"SLV_2014_MICS",136,"Sanitation type","Septic tank connection","s_sep",3.870472831471786,13.79639391244684,21.903564827456812,21.171822887454631,16.603316789158729,10.18375270981497,18.569587175212021,19.68006961331341,17.974781673310819,11.438061091135079,1.41310137956447,4.2267511544948757,11.030580036465521,22.44193003500445,37.414501886526587," Metropolitana","Central","Occidente","Oriental","Para Central",5.6357218091250907,18.997083817848431,19.462285785846369,20.49492296581349,14.649354756841189]
["SLV",2014,"SLV_2014_MICS",137,"Sanitation type","Improved latrines","s_lat",65.3177811275186,58.226570316581103,39.576720094722809,18.255795159573029,5.4424657381142234,63.400322897710957,37.41649915019137,17.48194634938239,7.5217346575814608,2.696300002476884,63.860022323656281,63.993687279171631,59.645648739871312,54.392036928313317,39.772451133274608," Metropolitana","Central","Occidente","Oriental","Para Central",14.66506511393098,43.025128501899687,45.211730381331961,49.321120883675917,41.268950525164392]
["SLV",2014,"SLV_2014_MICS",138,"Sanitation type","Unimproved facilities","",19.269930514174799,17.612521448499649,10.821484689218529,5.7985518000581227,1.455134600033984,12.26246215183806,6.3612392398958173,3.0657604175799351,1.1460772931108441,0.66377477571398358,19.494398045710842,22.92347876727111,25.43224484448886,19.2013874812837,19.087449413265741," Metropolitana","Central","Occidente","Oriental","Para Central",0.91432116534559926,17.00693494650216,9.4450388410327797,10.411170622250189,24.362901930817269]
["SLV",2014,"SLV_2014_MICS",139,"Sanitation type","Open defecation","",9.3549338057148965,1.6108013986567891,0.44565293802251782,0.13270755644504509,0.0133945795724058,1.0567526165065391,0.2138094773543506,0,0,0,15.04463400351356,8.5977965746006948,2.5221554949209848,1.6120578117102311,0.53362091691474367," Metropolitana","Central","Occidente","Oriental","Para Central",0.12209955970946459,2.2303440543800859,1.9439987741329769,4.6332954595296254,3.7656410661329058]
["SLV",2014,"SLV_2014_MICS",148,"Shared among improved sanitation facilities","Yes","",18.496036232144451,13.113812709202859,10.26507221645833,4.7778973276132826,2.0421208896254379,19.503986758085489,12.559381810692649,5.6791364516761078,3.1955970784248491,1.6721072154396699,19.833160857274791,13.79945644840922,10.879344770127229,8.5597655139882818,5.525043041246799," Metropolitana","Central","Occidente","Oriental","Para Central",7.0607354945732643,10.68798469817607,11.19419412098441,10.822493224209,9.3701620066585889]
["SLV",2014,"SLV_2014_MICS",149,"Shared among improved sanitation facilities","No","",52.87909944796619,67.662864443640714,78.467790156300353,89.290843315883421,96.489349930768142,67.176798473570045,80.865569472057203,91.255103130743905,95.658325628464297,97.664118008846316,45.627807093500842,54.679268209718963,61.166254890462987,70.626789193017743,74.85388662857271," Metropolitana","Central","Occidente","Oriental","Para Central",91.902843780371683,70.07473630094124,77.41676826384996,74.133040694010944,62.501294996391238]
["SLV",2014,"SLV_2014_MICS",150,"Shared among improved sanitation facilities","DK/missing","",28.624864319889689,19.223322847156432,11.26713762724104,5.9312593565031682,1.46852917960639,13.319214768344599,6.5750487172501693,3.0657604175799351,1.1460772931108441,0.66377477571398358,34.539032049224467,31.521275341871799,27.954400339409819,20.813445292993929,19.62107033018048," Metropolitana","Central","Occidente","Oriental","Para Central",1.0364207250550641,19.23727900088225,11.38903761516575,15.04446608177982,28.12854299695017]
["SLV",2014,"SLV_2014_MICS",151,"Shared among all sanitation facilities","Yes","",26.4810892339977,16.575333437176131,11.921849779410911,5.6884294240706073,2.1808051171220071,23.129252147181919,13.6200513473123,6.487016504771927,3.211767880503468,1.6721072154396699,31.054461903060378,20.84374776134759,15.212872744876901,11.898069281025769,7.9635990370502663," Metropolitana","Central","Occidente","Oriental","Para Central",7.2414663842685911,14.465814290695331,13.879145074317201,13.70115067245256,14.148654024523459]
["SLV",2014,"SLV_2014_MICS",152,"Shared among all sanitation facilities","No","",73.518910766002392,83.424666562823788,88.078150220588782,94.311570575929281,97.819194882877923,76.87074785281817,86.379948652687631,93.512983495228013,96.788232119496556,98.327892784560319,68.9455380969396,79.156252238652371,84.787127255123167,88.101930718974202,92.036400962949699," Metropolitana","Central","Occidente","Oriental","Para Central",92.758533615731395,85.534185709304481,86.120854925682849,86.298849327547231,85.851345975476406]
["SLV",2014,"SLV_2014_MICS",153,"Tipo de instalación sanitaria","Inodoro conectado al alcantarillado","",2.1868817211201779,8.7537129238156339,27.252577450579111,54.64112259646916,76.485688293120731,13.096709624129581,37.438864957346432,59.772223619724187,73.357406375996874,85.201864130673997,0.18784424755484719,0.25828622446167221,1.3693708842533849,2.3525877436882521,3.1919766500182609," Metropolitana","Central","Occidente","Oriental","Para Central",78.662792351888911,18.740508679369281,23.936946217656399,15.13949006873065,15.953151721044289,214.3683051724679,857.96623288296985,2668.9138057655091,5359.2608569010154,7496.2017826819674,795.02910491273701,2273.5262861830879,3627.693237098274,4450.8333222722868,5175.0561883797018,6.9984381325349592,9.6445644622420765,51.102616304401721,87.776519298964843,119.05070635968301,9716.2668766331099,1939.8124928980219,2469.2034844625659,1471.850693788949,999.57743562125609]
["SLV",2014,"SLV_2014_MICS",154,"Tipo de instalación sanitaria","Inodoro conectado a tanque séptico","",3.870472831471786,13.79639391244684,21.903564827456812,21.171822887454631,16.603316789158729,10.18375270981497,18.569587175212021,19.68006961331341,17.974781673310819,11.438061091135079,1.41310137956447,4.2267511544948757,11.030580036465521,22.44193003500445,37.414501886526587," Metropolitana","Central","Occidente","Oriental","Para Central",5.6357218091250907,18.997083817848431,19.462285785846369,20.49492296581349,14.649354756841189,379.40172670778583,1352.207939128077,2145.071476981972,2076.5554636922602,1627.256231732433,618.19953514277859,1127.663582069375,1194.4219424736491,1090.588683330529,694.73372955737284,52.647353904165648,157.8294547467483,411.64267891224341,837.32243785956769,1395.4434402460929,696.11280635661353,1966.3703450622379,2007.622168719698,1992.5021549231631,917.8853631808139]
["SLV",2014,"SLV_2014_MICS",155,"Tipo de instalación sanitaria","Letrina (pozo negro, hoyo)","",23.52049918188256,17.269365593590209,12.63157195733393,4.3607256466974009,1.180916002960555,21.050646604594029,10.33672352642504,4.3588186097432349,1.086026917026969,0.69545403676472051,22.686245946573621,22.814121708410202,18.238124040085861,17.159163587853261,12.93603955046621," Metropolitana","Central","Occidente","Oriental","Para Central",4.4033927561113906,14.80699018708583,13.155364998138779,16.44125340964062,11.916871938004521,2305.588591159797,1692.599776981609,1237.0417750975921,427.70472412548679,115.7390989627373,1277.868808899168,627.7116754770376,264.54523246288761,65.892798423281022,42.241020820543412,845.21240753039228,851.89315816124645,680.61608848997196,640.21911950540357,482.47365655728947,543.89804762612027,1532.657679604361,1357.0349700172189,1598.407220314549,746.6760487649716]
["SLV",2014,"SLV_2014_MICS",156,"Tipo de instalación sanitaria","Baldeo a otra parte","",0.196596749709568,0.35881826444729992,0.062833187306272797,0.21373486925144289,0.17717980402469649,0.39966827998667481,0.060041009211936502,0.17400470686272379,0.13770263606792521,0.2858968256645929,0.32122503051036011,0.064543168963776598,0.37316165800822448,0.11744092759477801,0.054905271824331602," Metropolitana","Central","Occidente","Oriental","Para Central",0.1997764951613866,0.19840498431795389,0.3371817495963263,0.1705232666079462,0.037487131265798203,19.271326670593169,35.168385954250077,6.1534128786926239,20.963348922998382,17.36502073035054,24.261659914517431,3.646072412927488,10.56068621982585,8.3548684646026157,17.36502073035054,11.967752709552689,2.410081122080511,13.925764924603209,4.3817944198545398,2.0477942385699102,24.675983201603501,20.536714014432832,34.78181149048627,16.578153367427589,2.3488330829346031]
["SLV",2014,"SLV_2014_MICS",157,"Tipo de instalación sanitaria","Sitio desconocido/ no está seguro/ NS dónde","",0,0,0.0220419036635899,0,0,0,0,0,0,0,0,0,0,0.057855352025190002,0," Metropolitana","Central","Occidente","Oriental","Para Central",0,0,0.020926082271037299,0,0,0,0,2.158619348932747,0,0,0,0,0,0,0,0,0,0,2.158619348932747,0,0,0,2.158619348932747,0,0]
["SLV",2014,"SLV_2014_MICS",158,"Tipo de instalación sanitaria","Letrina de fosa mejorada con ventilación","",0.070673496562236301,0.28167501722614863,0.33359809734643753,0.32393242830974689,0.047358005222939002,0.27357787906120451,0.57258639408554424,0.32134267070311401,0.2022098217335779,0.059578603274310499,0.051801778767950703,0.14940476364403091,0.12657434964239561,0.040354623577611499,0.083425360486049996," Metropolitana","Central","Occidente","Oriental","Para Central",0.0039031870412059,0.1423987473981822,0.33724626728316559,0.51170227555675818,0.061619860745188597,6.9277444373619428,27.60744560965388,32.670105027665691,31.771645618303989,4.6414586976840626,16.607406177290869,34.771092006859313,19.502915613735091,12.2687300045689,3.6187309129394798,1.9299581892009401,5.5788645985056142,4.7235416629156664,1.5056562310017989,3.111503993651902,0.48211366298976038,14.7395609106444,34.788466779582237,49.747339300890019,3.8609187365631459]
["SLV",2014,"SLV_2014_MICS",159,"Tipo de instalación sanitaria","Letrina de fosa con losa","",41.726608449073908,40.675529705764809,26.589508136378861,13.535291494717359,4.2141917299307297,42.076098414055657,26.507189229680812,12.743856890595151,6.2334979188209152,1.9412673624378529,41.121974598314758,41.030160807117412,41.280950350143073,37.134663364857282,26.75298622232232," Metropolitana","Central","Occidente","Oriental","Para Central",10.25776917077839,28.075739567415631,31.66411042111719,32.368165198478593,29.29045872641467,4090.2359955898128,3986.677572807891,2603.977751549804,1327.5561417376759,413.02408677299752,2554.208180558187,1609.685324466097,773.4496168435096,378.20666817469743,117.91018635315019,1532.0649892669751,1532.091119552231,1540.5355778209109,1385.5175026950619,997.80238272736688,1267.0186226841861,2906.0934946861371,3266.2951687028062,3146.8105060192711,1835.2537563657841]
["SLV",2014,"SLV_2014_MICS",160,"Tipo de instalación sanitaria","Letrina de fosa sin losa/Foso abierto","",1.8447963157456539,0.97457917233509905,0.50805773386261965,0.40884581253569469,0.0100107781107513,1.4280700472219721,0.45489255042776638,0.28868650866872669,0.0161708020786187,0,1.78145513638688,1.593157650568203,1.0878371574542469,0.71442298390362635,1.1063568500392691," Metropolitana","Central","Occidente","Oriental","Para Central",0.2931901703670996,1.088441120975586,0.73009650564376938,0.86644541278713105,0.93790712403746224,180.83550462539,95.520155665566165,49.755378275351731,40.100042889163213,0.98113535217538139,86.690266790658228,27.62397236039752,17.520949225544051,0.98113535217538139,0,66.370962753330758,59.48947409581757,40.596251532955023,26.655568108982951,41.263636587784987,36.214248893541381,112.6635205252833,75.312732849764572,84.235220350979432,58.766494188077857]
["SLV",2014,"SLV_2014_MICS",161,"Tipo de instalación sanitaria","Letrina abonera","",16.77777423243997,16.122467558588578,10.188998178693289,5.1710779107678517,1.2679440178985359,10.10378797217251,5.7914263677322024,2.595161545957505,0.99220385496430008,0.37787795004939068,16.86925497091207,21.112117562627962,23.66422919444317,18.222379133032959,17.92618729140214," Metropolitana","Central","Occidente","Oriental","Para Central",0.39554981254078397,15.5482707037739,8.2418112287396976,9.1183844622552126,23.288780541294351,1644.635369183193,1580.1903576694749,997.8343499930611,507.18495737776828,124.2685320538172,613.34531636439601,351.69228812182041,157.50543344920629,60.200246959755113,22.951840828929829,628.49109723956258,788.33928983856345,883.10919895335246,679.88835610276647,668.59049841896172,48.857502088866127,1609.3869312813131,850.17983577519374,886.48299487473832,1459.2063022572049]
["SLV",2014,"SLV_2014_MICS",162,"Tipo de instalación sanitaria","Inodoro de compostaje","",0,0,0,0.035845589848522,0,0,0,0.057928178340901297,0,0,0,0,0,0,0," Metropolitana","Central","Occidente","Oriental","Para Central",0,0,0.034082612521689398,0,0,0,0,0,3.5157745199789501,0,0,0,3.5157745199789501,0,0,0,0,0,0,0,0,0,3.5157745199789501,0,0]
["SLV",2014,"SLV_2014_MICS",163,"Tipo de instalación sanitaria","No hay instalacion sanitaria","",9.3549338057148965,1.6108013986567891,0.44565293802251782,0.13270755644504509,0.0133945795724058,1.0567526165065391,0.2138094773543506,0,0,0,15.04463400351356,8.5977965746006948,2.5221554949209848,1.6120578117102311,0.53362091691474367," Metropolitana","Central","Occidente","Oriental","Para Central",0.12209955970946459,2.2303440543800859,1.9439987741329769,4.6332954595296254,3.7656410661329058,917.01406873733845,157.87737385906661,43.643918855938672,13.016101772346641,1.3127746315643021,64.149630779587781,12.98387297675804,0,0,0,560.51192235460314,321.04694499216532,94.122597463622043,60.14688463810208,19.902384651416071,15.0814873485491,230.86082315951981,200.5322025304726,450.44576175805349,235.94396305965981]
["SLV",2014,"SLV_2014_MICS",164,"Tipo de instalación sanitaria","Otros","",0.45076321627960392,0.072786566386429205,0.0055360652847240002,0,0,0.33093585245690449,0.054879312523911303,0,0,0,0.52246290790152294,0.15366038511116911,0.086743510069288293,0,0," Metropolitana","Central","Occidente","Oriental","Para Central",0.0258046872763288,0.13243398398412159,0.13129680994685011,0.1712640091657095,0.076168873343851501,44.185904420314607,7.1339346755536912,0.54216086881371683,0,0,20.089292815777199,3.332621320996707,0,0,0,19.465191961364201,5.7377720882575742,3.237121778286336,0,0,3.1873420806533188,13.70811758698226,13.543855497341839,16.65016784364926,4.7725169560553393]
["SLV",2014,"SLV_2014_MICS",165,"Tipo de instalación sanitaria","Omitido","",0,0.083869886742235694,0.056059524071619897,0.0048932075031315999,0,0,0,0.0079076560909801998,0,0,0,0,0.22027332451392831,0.1471444367523361,0," Metropolitana","Central","Occidente","Oriental","Para Central",0,0.039384153450591902,0.0046525471061353999,0.084553471434194102,0.022558260875807298,0,8.220229679315544,5.4900509139259777,0.4799311249495074,0,0,0,0.4799311249495074,0,0,0,0,8.220229679315544,5.4900509139259777,0,0,4.0766168193595709,0.4799311249495074,8.220229679315544,1.413434094566407]
["SLV",2014,"SLV_2014_MICS",222,"Hygiene ladder","Basic","h_bas",81.760965795765202,88.492991915246193,93.245483234457254,93.243480078667204,93.890873295496718,87.570330759578667,93.55983214291426,93.717917966903102,93.330312733897472,94.257158631960749,75.261346976927683,84.899414320112342,88.256768187453133,90.324397507953762,92.903692429286906," Metropolitana","Central","Occidente","Oriental","Para Central",91.279483384252316,89.268981285084976,91.269222109723529,87.470263167989401,90.545766900828539,7842.2545060739558,8346.4528985474444,8657.9070394802711,8226.5118809559281,7920.3011860276129,5043.73431113892,5332.7572079294396,5102.2347712567243,4964.4624538638154,4795.916366897718,2762.710350625237,3134.0262233370509,3222.0870429277079,3262.139347288708,3373.3594358198989,9672.0618627869044,8840.116444297355,8892.694494658519,8167.0942914982843,5421.4604178441241]
["SLV",2014,"SLV_2014_MICS",223,"Hygiene ladder","Limited","h_lim",13.10108040708446,8.734347228957013,4.9909116391850539,4.674669608913729,3.713840409964857,9.5764680658382524,4.827274526959954,4.4439163715304497,4.2182362692131106,3.0696848340587191,17.053097762364828,11.3066536825912,8.1202891589250115,7.7714913915901276,5.5031400106588251," Metropolitana","Central","Occidente","Oriental","Para Central",5.7524908462609288,7.3047258328994769,6.4462569169025317,9.9493783068482866,6.3394266208047574,1256.614398532666,823.80328846682642,463.4095670422401,412.4280329823365,313.28640975770702,551.56992264656094,275.14674234320432,241.93777586253111,224.37807146047649,156.1892162945806,625.98892513513465,417.3803720932944,296.45634007611687,280.67375543124132,199.82057543863391,609.53946349514433,723.37138866048042,628.08241454252925,928.97297699630656,379.57545308731409]
["SLV",2014,"SLV_2014_MICS",224,"Hygiene ladder","No facility","h_nfac",5.1379537971505584,2.772660855796754,1.76360512635761,2.0818503124191921,2.395286294538431,2.8532011745832202,1.612893330125774,1.838165661566427,2.4514509968893679,2.6731565339806469,7.6855552607074173,3.7939319972964278,3.6229426536218479,1.9041111004561071,1.5931675600541899," Metropolitana","Central","Occidente","Oriental","Para Central",2.96802576948682,3.42629288201555,2.2845209733739549,2.5803585251622549,3.114806478366535,492.81635711537479,261.51091443170901,163.7519449597597,183.67360715236279,202.0578594449855,164.33406766883951,91.932278359703602,100.07427562663619,130.3985390710483,136.01338464546359,282.12308073050912,140.05140629418639,132.26675779370561,68.768526707970594,57.848366206129043,314.49486553267229,339.29846194341292,222.5892432657223,240.92795217042209,186.50016019196249]
["SLV",2014,"SLV_2014_MICS",225,"Lugar que usan con mayor frecuencia los miembros del hogar","Lugar observado","",92.822257816257476,93.562878144082845,93.13878430000851,88.079566855416772,84.009426725974706,92.172820285106994,92.347099729604579,88.054048584414431,85.521037404772343,81.531216609264874,90.955675193529757,95.108431765175311,94.284622042978015,94.95453624959805,95.803775643214067," Metropolitana","Central","Occidente","Oriental","Para Central",83.239733988707513,92.392758266461371,92.29629160168362,93.562357008764835,92.583928058231265]
["SLV",2014,"SLV_2014_MICS",226,"Lugar que usan con mayor frecuencia los miembros del hogar","No está en la vivienda/patio/lote","",2.1788193456727929,0.89322316976899863,0.8575150761755338,0.8469613201458942,1.0205276438183719,1.3522964113778311,0.60572869802953977,0.93293145372546726,0.78919559529622552,1.351328213415367,3.4105631329001391,1.1438162817234629,1.1531611543565501,0.56890470113484748,0.76949896111062688," Metropolitana","Central","Occidente","Oriental","Para Central",1.2491512178655759,1.4721787799428421,1.0864075226134351,1.064862936206272,0.73294382909885269]
["SLV",2014,"SLV_2014_MICS",227,"Lugar que usan con mayor frecuencia los miembros del hogar","No obtuvo permiso para ver el lugar","",2.1502681717725909,3.7689615208798921,5.1891262705544952,10.047762200935299,13.92892460144183,5.1200642743242266,6.1390228300300143,10.297062827055891,12.329769864598109,16.229465884475442,1.471892670318399,1.140922044020567,2.171092748640294,3.2023285432101458,2.6451992531314019," Metropolitana","Central","Occidente","Oriental","Para Central",14.214118955304651,4.3292827585203408,5.5458843152840434,3.959452537165383,4.4395488175824456]
["SLV",2014,"SLV_2014_MICS",228,"Lugar que usan con mayor frecuencia los miembros del hogar","(especificar)","",2.8486546662972558,1.774937165268279,0.81457435326140537,1.025709623501986,1.0411210287651309,1.354819029190955,0.90814874233577991,0.71595713480409473,1.359997135333286,0.88798929284426309,4.1618690032516614,2.6068299090806608,2.39112405402512,1.274230506056921,0.78152614254387764," Metropolitana","Central","Occidente","Oriental","Para Central",1.296995838122291,1.8057801950751891,1.071416560418798,1.413327517863483,2.243579295087379]