{"text_format":"1","workbook":"xlsx","n_sheets":6,"sheets":["Introduction","Water","Sanitation","Hygiene","MICS13","data_summary"],"not_rendered":{"charts":99,"images":76,"macros":1,"external_links":0,"defined_names":0,"comments":0,"pivot_tables":0},"unopened":[],"bounds":{"document_bytes":16777216,"sheet_cells":100000,"rows_first":2000,"rows_last":500,"rows_between":2000,"halvings":0,"cell_chars":16384,"cell_head_chars":4096},"cells_cut":0,"cells_raw":0,"read":"whole","date_system":"1900"}

{"sheet":"Introduction","index":0,"n_rows":55,"n_cols":12,"rows_kept":55,"cut":false,"hidden":false,"merged":[[107,0,107,1],[1,0,1,1],[4,0,4,1],[5,0,5,1],[6,0,6,1],[7,0,7,1],[112,0,112,1],[113,0,113,1],[207,0,207,1],[212,0,212,1],[213,0,213,1]]}
[]
[]
[]
[null,null,"Joint Monitoring Programme for Water Supply, Sanitation and Hygiene"]
[]
[null,null,"Estimates on household water, sanitation and hygiene \nby wealth quintile and sub-national region in"]
[null,null,{"$f":"+Water!B5","v":"Panama"}]
[]
[null,null,"Updated May 2021"]
[]
[null,null,"Follow the links below to find the following information: "]
[]
[null,null,"JMP Estimates"]
[null,null,"WASH status and trends by wealth quintile \n(customized quintiles made without water and sanitation assets)"]
[null,null,"Water"]
[null,null,"Sanitation"]
[null,null,"Hygiene"]
[]
[null,null,"Data inputs"]
[null,null," customized wealth quintiles and subnational data:"]
[null,null,{"$f":"IF(INDIRECT(CONCATENATE(\"Water\",\"!B105\"))=0,\"\",INDIRECT(CONCATENATE(\"Water\",\"!B105\")))","v":"MICS13"}]
[null,null,{"$f":"IF(INDIRECT(CONCATENATE(\"Water\",\"!B106\"))=0,\"\",INDIRECT(CONCATENATE(\"Water\",\"!B106\")))","v":""}]
[null,null,{"$f":"IF(INDIRECT(CONCATENATE(\"Water\",\"!B107\"))=0,\"\",INDIRECT(CONCATENATE(\"Water\",\"!B107\")))","v":""}]
[null,null,{"$f":"IF(INDIRECT(CONCATENATE(\"Water\",\"!B108\"))=0,\"\",INDIRECT(CONCATENATE(\"Water\",\"!B108\")))","v":""}]
[null,null,{"$f":"IF(INDIRECT(CONCATENATE(\"Water\",\"!B109\"))=0,\"\",INDIRECT(CONCATENATE(\"Water\",\"!B109\")))","v":""}]
[null,null,{"$f":"IF(INDIRECT(CONCATENATE(\"Water\",\"!B110\"))=0,\"\",INDIRECT(CONCATENATE(\"Water\",\"!B110\")))","v":""}]
[null,null,{"$f":"IF(INDIRECT(CONCATENATE(\"Water\",\"!B111\"))=0,\"\",INDIRECT(CONCATENATE(\"Water\",\"!B111\")))","v":""}]
[null,null,{"$f":"IF(INDIRECT(CONCATENATE(\"Water\",\"!B112\"))=0,\"\",INDIRECT(CONCATENATE(\"Water\",\"!B112\")))","v":""}]
[null,null,{"$f":"IF(INDIRECT(CONCATENATE(\"Water\",\"!B113\"))=0,\"\",INDIRECT(CONCATENATE(\"Water\",\"!B113\")))","v":""}]
[null,null,{"$f":"IF(INDIRECT(CONCATENATE(\"Water\",\"!B114\"))=0,\"\",INDIRECT(CONCATENATE(\"Water\",\"!B114\")))","v":""}]
[null,null,{"$f":"IF(INDIRECT(CONCATENATE(\"Water\",\"!B115\"))=0,\"\",INDIRECT(CONCATENATE(\"Water\",\"!B115\")))","v":""}]
[null,null,{"$f":"IF(INDIRECT(CONCATENATE(\"Water\",\"!B116\"))=0,\"\",INDIRECT(CONCATENATE(\"Water\",\"!B116\")))","v":""}]
[]
[]
[]
[]
[]
[]
[]
[]
[]
[]
[]
[]
[]
[]
[]
[]
[]
[]
[]
[]
[]
[]
[null,null,null,null,null,null,null,null,null,null,null,{"$f":"+IF(ISNUMBER(M48), \"\", \"Insufficient data to estimate safely managed sanitation services at national level\")","v":"Insufficient data to estimate safely managed sanitation services at national level"}]

{"sheet":"Water","index":1,"n_rows":318,"n_cols":28,"rows_kept":318,"cut":false,"hidden":false,"merged":[[3,1,3,24],[317,18,317,22],[117,18,117,22],[196,18,196,22],[296,23,296,27],[298,0,299,1],[300,0,301,1],[296,0,297,2],[296,3,296,7],[296,8,296,12],[296,13,296,17],[296,18,296,22],[196,23,196,27],[198,0,199,1],[200,0,201,1],[196,13,196,17],[96,8,96,12],[96,13,96,17],[96,18,96,22],[217,18,217,22],[98,0,99,1],[100,0,101,1],[196,0,197,2],[196,3,196,7],[196,8,196,12],[217,1,217,11],[35,3,36,3],[38,1,39,2],[38,3,39,3],[96,0,97,2],[96,3,96,7],[317,1,317,11],[6,9,6,16],[6,17,6,24],[6,1,6,8],[4,1,4,24],[117,1,117,11],[30,21,30,24],[32,1,33,2],[32,3,33,3],[30,17,30,20],[30,1,31,4],[30,5,30,8],[30,9,30,12],[30,13,30,16],[96,23,96,27],[35,1,36,2]]}
["BGD"]
[]
[]
[null,"Summary of trends in use of drinking water by wealth quintile (%)"]
[null,{"$f":"IF(ISERROR(INDIRECT(CONCATENATE($B105,\"!A2\"))),\"\",INDIRECT(CONCATENATE($B105,\"!A2\")))","v":"Panama"}]
[]
[null,{"$f":"B118","v":"National use of drinking water sources, 2009–2017"},null,null,null,null,null,null,null,{"$f":"B218","v":"Urban use of drinking water sources,  2009–2017"},null,null,null,null,null,null,null,{"$f":"B318","v":"Rural use of drinking water sources, 2009–2017"}]
[]
[]
[]
[]
[]
[]
[]
[]
[]
[]
[]
[]
[]
[]
[]
[]
[]
[]
[]
[]
[]
[]
[]
[null,{"$f":"IF(ISERROR(INDIRECT(CONCATENATE($B105,\"!A2\"))),\"\",INDIRECT(CONCATENATE($B105,\"!A2\")))","v":"Panama"},null,null,null,"Poorest",null,null,null,"Poor",null,null,null,"Middle",null,null,null,"Rich",null,null,null,"Richest"]
[null,null,null,null,null,"Basic","Limited","Unimproved","Surface \n water","Basic","Limited","Unimproved","Surface \nwater","Basic","Limited","Unimproved","Surface \nwater","Basic","Limited","Unimproved","Surface \nwater","Basic","Limited","Unimproved","Surface \nwater"]
[null,"NATIONAL",null,"Estimate",{"$f":"C99","v":2009},{"$f":"E99","v":86.576532501155839},{"$f":"F99","v":0.17350006513257926},10.183728628980035,3.066238804731543,{"$f":"J99","v":99.832086071929282},{"$f":"K99","v":0},0.15737372832022345,1.0540199750493829E-2,{"$f":"O99","v":99.865359414657888},{"$f":"P99","v":0},0.13125021033083328,3.390375011276152E-3,{"$f":"T99","v":100},{"$f":"U99","v":0},0,0,{"$f":"Y99","v":99.776266775910983},{"$f":"Z99","v":0},0.22373322408901686,0]
[null,null,null,null,{"$f":"C100","v":2017},{"$f":"E100","v":86.576532501155839},0.17350006513257926,10.183728628980035,3.066238804731543,{"$f":"J100","v":99.832086071929282},0,0.15737372832022345,1.0540199750493829E-2,{"$f":"O100","v":99.865359414657888},0,0.13125021033083328,3.390375011276152E-3,{"$f":"T100","v":100},0,0,0,{"$f":"Y100","v":99.776266775910983},0,0.22373322408901686,0]
[]
[null,"URBAN",null,"Estimate",{"$f":"C199","v":2009},{"$f":"E199","v":99.738962499759452},{"$f":"F199","v":9.9838801301054853E-2},0.16119869893948646,0,{"$f":"J199","v":99.987742180568205},{"$f":"K199","v":0},1.2257819431795269E-2,0,{"$f":"O199","v":100},{"$f":"P199","v":0},0,0,{"$f":"T199","v":99.930705345495412},{"$f":"U199","v":0},6.9294654504588493E-2,0,{"$f":"Y199","v":100},{"$f":"Z199","v":0},0,0]
[null,null,null,null,{"$f":"C200","v":2017},{"$f":"E200","v":99.738962499759452},9.9838801301054853E-2,0.16119869893948646,0,{"$f":"J200","v":99.987742180568205},0,1.2257819431795269E-2,0,{"$f":"O200","v":100},0,0,0,{"$f":"T200","v":99.930705345495412},0,6.9294654504588493E-2,0,{"$f":"Y200","v":100},0,0,0]
[]
[null,"RURAL",null,"Estimate",{"$f":"C299","v":2009},{"$f":"E299","v":66.592767217620192},{"$f":"F299","v":0.26744083219928172},26.139408922803895,7.0003830273766221,{"$f":"J299","v":91.243012954869926},{"$f":"K299","v":0},6.0102361724760698,2.7467508726540091,{"$f":"O299","v":98.46499552438064},{"$f":"P299","v":0},1.1557258797872976,0.37927859583206092,{"$f":"T299","v":99.303349479584625},{"$f":"U299","v":0},0.65957690843082162,3.707361198454779E-2,{"$f":"Y299","v":99.150752806151729},{"$f":"Z299","v":0},0.84924719384827085,0]
[null,null,null,null,{"$f":"C300","v":2017},{"$f":"E300","v":66.592767217620192},0.26744083219928172,26.139408922803895,7.0003830273766221,{"$f":"J300","v":91.243012954869926},0,6.0102361724760698,2.7467508726540091,{"$f":"O300","v":98.46499552438064},0,1.1557258797872976,0.37927859583206092,{"$f":"T300","v":99.303349479584625},0,0.65957690843082162,3.707361198454779E-2,{"$f":"Y300","v":99.150752806151729},0,0.84924719384827085,0]
[]
[]
[]
[]
[]
[]
[]
[]
[]
[]
[]
[]
[]
[]
[]
[]
[]
[]
[]
[]
[]
[]
[]
[]
[]
[]
[]
[]
[]
[]
[]
[]
[]
[]
[]
[]
[]
[]
[]
[]
[]
[]
[]
[]
[]
[]
[]
[]
[]
[]
[]
[]
[]
[]
[]
[]
["NATIONAL",null,null,"Poorest",null,null,null,null,"Poor",null,null,null,null,"Middle",null,null,null,null,"Rich",null,null,null,null,"Richest"]
[null,null,null,"Improved","Basic","Limited","Unimproved","Surface water","Improved","Basic","Limited","Unimproved","Surface water","Improved","Basic","Limited","Unimproved","Surface water","Improved","Basic","Limited","Unimproved","Surface water","Improved","Basic","Limited","Unimproved","Surface water"]
["Forecast period:",null,{"$f":"MinBase(C105:C116)","v":2009},{"$f":"IF((D101+H101)>100,D101*100/(D101+H101),D101)","v":86.750032566288411},{"$f":"D99*AVERAGEIF(E105:E116,\">0\")/100","v":86.576532501155839},{"$f":"D99*(100-AVERAGEIF(E105:E116,\">0\"))/100","v":0.17350006513257926},{"$f":"100-(E99+F99+H99)","v":10.183728628980035},{"$f":"IF((D101+H101)>100,H101*100/(D101+H101),H101)","v":3.066238804731543},{"$f":"IF((I101+M101)>100,I101*100/(I101+M101),I101)","v":99.832086071929282},{"$f":"I99*AVERAGEIF(J105:J116,\">0\")/100","v":99.832086071929282},{"$f":"I99*(100-AVERAGEIF(J105:J116,\">0\"))/100","v":0},{"$f":"100-(J99+K99+M99)","v":0.15737372832022345},{"$f":"IF((I101+M101)>100,M101*100/(I101+M101),M101)","v":1.0540199750493829E-2},{"$f":"IF((N101+R101)>100,N101*100/(N101+R101),N101)","v":99.865359414657888},{"$f":"N99*AVERAGEIF(O105:O116,\">0\")/100","v":99.865359414657888},{"$f":"N99*(100-AVERAGEIF(O105:O116,\">0\"))/100","v":0},{"$f":"100-(O99+P99+R99)","v":0.13125021033083328},{"$f":"IF((N101+R101)>100,R101*100/(N101+R101),R101)","v":3.390375011276152E-3},{"$f":"IF((S101+W101)>100,S101*100/(S101+W101),S101)","v":100},{"$f":"S99*AVERAGEIF(T105:T116,\">0\")/100","v":100},{"$f":"S99*(100-AVERAGEIF(T105:T116,\">0\"))/100","v":0},{"$f":"100-(T99+U99+W99)","v":0},{"$f":"IF((S101+W101)>100,W101*100/(S101+W101),W101)","v":0},{"$f":"IF((X101+AB101)>100,X101*100/(X101+AB101),X101)","v":99.776266775910997},{"$f":"X99*AVERAGEIF(Y105:Y116,\">0\")/100","v":99.776266775910983},{"$f":"X99*(100-AVERAGEIF(Y105:Y116,\">0\"))/100","v":0},{"$f":"100-(Y99+Z99+AB99)","v":0.22373322408901686},{"$f":"IF((X101+AB101)>100,AB101*100/(X101+AB101),AB101)","v":0}]
[null,null,{"$f":"MaxTarget(C105:C116)","v":2017},{"$f":"IF((D102+H102)>100,D102*100/(D102+H102),D102)","v":86.750032566288411},{"$f":"D100*AVERAGEIF(E105:E116,\">0\")/100","v":86.576532501155839},{"$f":"D100*(100-AVERAGEIF(E105:E116,\">0\"))/100","v":0.17350006513257926},{"$f":"100-(E100+F100+H100)","v":10.183728628980035},{"$f":"IF((D102+H102)>100,H102*100/(D102+H102),H102)","v":3.066238804731543},{"$f":"IF((I102+M102)>100,I102*100/(I102+M102),I102)","v":99.832086071929282},{"$f":"I100*AVERAGEIF(J105:J116,\">0\")/100","v":99.832086071929282},{"$f":"I100*(100-AVERAGEIF(J105:J116,\">0\"))/100","v":0},{"$f":"100-(J100+K100+M100)","v":0.15737372832022345},{"$f":"IF((I102+M102)>100,M102*100/(I102+M102),M102)","v":1.0540199750493829E-2},{"$f":"IF((N102+R102)>100,N102*100/(N102+R102),N102)","v":99.865359414657888},{"$f":"N100*AVERAGEIF(O105:O116,\">0\")/100","v":99.865359414657888},{"$f":"N100*(100-AVERAGEIF(O105:O116,\">0\"))/100","v":0},{"$f":"100-(O100+P100+R100)","v":0.13125021033083328},{"$f":"IF((N102+R102)>100,R102*100/(N102+R102),R102)","v":3.390375011276152E-3},{"$f":"IF((S102+W102)>100,S102*100/(S102+W102),S102)","v":100},{"$f":"S100*AVERAGEIF(T105:T116,\">0\")/100","v":100},{"$f":"S100*(100-AVERAGEIF(T105:T116,\">0\"))/100","v":0},{"$f":"100-(T100+U100+W100)","v":0},{"$f":"IF((S102+W102)>100,W102*100/(S102+W102),W102)","v":0},{"$f":"IF((X102+AB102)>100,X102*100/(X102+AB102),X102)","v":99.776266775910997},{"$f":"X100*AVERAGEIF(Y105:Y116,\">0\")/100","v":99.776266775910983},{"$f":"X100*(100-AVERAGEIF(Y105:Y116,\">0\"))/100","v":0},{"$f":"100-(Y100+Z100+AB100)","v":0.22373322408901686},{"$f":"IF((X102+AB102)>100,AB102*100/(X102+AB102),AB102)","v":0}]
["Regression period:",null,{"$f":"MinRegYear(C99,C105:C116)","v":2011},{"$f":"IF(MAX(C105:C116)-MIN(C105:C116)<5,AVERAGEIF(C105:C116,\">0\",D105:D116),\nIF(FORECAST($C101,D$105:D$116,$C$105:$C$116)<0,0,\nIF(FORECAST($C101,D$105:D$116,$C$105:$C$116)>100,100,\nFORECAST($C101,D$105:D$116,$C$105:$C$116))))","v":86.750032566288411},null,null,null,{"$f":"IF(MAX(C105:C116)-MIN(C105:C116)<5,AVERAGEIF(C105:C116,\">0\",H105:H116),\nIF(FORECAST($C101,H$105:H$116,$C$105:$C$116)<0,0,\nIF(FORECAST($C101,H$105:H$116,$C$105:$C$116)>100,100,\nFORECAST($C101,H$105:H$116,$C$105:$C$116))))","v":3.066238804731543},{"$f":"IF(MAX(C105:C116)-MIN(C105:C116)<5,AVERAGEIF(C105:C116,\">0\",I105:I116),\nIF(FORECAST($C101,I$105:I$116,$C$105:$C$116)<0,0,\nIF(FORECAST($C101,I$105:I$116,$C$105:$C$116)>100,100,\nFORECAST($C101,I$105:I$116,$C$105:$C$116))))","v":99.832086071929282},null,null,null,{"$f":"IF(MAX(C105:C116)-MIN(C105:C116)<5,AVERAGEIF(C105:C116,\">0\",M105:M116),\nIF(FORECAST($C101,M$105:M$116,$C$105:$C$116)<0,0,\nIF(FORECAST($C101,M$105:M$116,$C$105:$C$116)>100,100,\nFORECAST($C101,M$105:M$116,$C$105:$C$116))))","v":1.0540199750493829E-2},{"$f":"IF(MAX(C105:C116)-MIN(C105:C116)<5,AVERAGEIF(C105:C116,\">0\",N105:N116),\nIF(FORECAST($C101,N$105:N$116,$C$105:$C$116)<0,0,\nIF(FORECAST($C101,N$105:N$116,$C$105:$C$116)>100,100,\nFORECAST($C101,N$105:N$116,$C$105:$C$116))))","v":99.865359414657888},null,null,null,{"$f":"IF(MAX(C105:C116)-MIN(C105:C116)<5,AVERAGEIF(C105:C116,\">0\",R105:R116),\nIF(FORECAST($C101,R$105:R$116,$C$105:$C$116)<0,0,\nIF(FORECAST($C101,R$105:R$116,$C$105:$C$116)>100,100,\nFORECAST($C101,R$105:R$116,$C$105:$C$116))))","v":3.390375011276152E-3},{"$f":"IF(MAX(C105:C116)-MIN(C105:C116)<5,AVERAGEIF(C105:C116,\">0\",S105:S116),\nIF(FORECAST($C101,S$105:S$116,$C$105:$C$116)<0,0,\nIF(FORECAST($C101,S$105:S$116,$C$105:$C$116)>100,100,\nFORECAST($C101,S$105:S$116,$C$105:$C$116))))","v":100},null,null,null,{"$f":"IF(MAX(C105:C116)-MIN(C105:C116)<5,AVERAGEIF(C105:C116,\">0\",W105:W116),\nIF(FORECAST($C101,W$105:W$116,$C$105:$C$116)<0,0,\nIF(FORECAST($C101,W$105:W$116,$C$105:$C$116)>100,100,\nFORECAST($C101,W$105:W$116,$C$105:$C$116))))","v":0},{"$f":"IF(MAX(C105:C116)-MIN(C105:C116)<5,AVERAGEIF(C105:C116,\">0\",X105:X116),\nIF(FORECAST($C101,X$105:X$116,$C$105:$C$116)<0,0,\nIF(FORECAST($C101,X$105:X$116,$C$105:$C$116)>100,100,\nFORECAST($C101,X$105:X$116,$C$105:$C$116))))","v":99.776266775910997},null,null,null,{"$f":"IF(MAX(C105:C116)-MIN(C105:C116)<5,AVERAGEIF(C105:C116,\">0\",AB105:AB116),\nIF(FORECAST($C101,AB$105:AB$116,$C$105:$C$116)<0,0,\nIF(FORECAST($C101,AB$105:AB$116,$C$105:$C$116)>100,100,\nFORECAST($C101,AB$105:AB$116,$C$105:$C$116))))","v":0}]
[null,null,{"$f":"MaxRegYear(C100,C105:C116)","v":2015},{"$f":"IF(MAX(C105:C116)-MIN(C105:C116)<5,AVERAGEIF(C105:C116,\">0\",D105:D116),\nIF(FORECAST($C102,D$105:D$116,$C$105:$C$116)<0,0,\nIF(FORECAST($C102,D$105:D$116,$C$105:$C$116)>100,100,\nFORECAST($C102,D$105:D$116,$C$105:$C$116))))","v":86.750032566288411},null,null,null,{"$f":"IF(MAX(C105:C116)-MIN(C105:C116)<5,AVERAGEIF(C105:C116,\">0\",H105:H116),\nIF(FORECAST($C102,H$105:H$116,$C$105:$C$116)<0,0,\nIF(FORECAST($C102,H$105:H$116,$C$105:$C$116)>100,100,\nFORECAST($C102,H$105:H$116,$C$105:$C$116))))","v":3.066238804731543},{"$f":"IF(MAX(C105:C116)-MIN(C105:C116)<5,AVERAGEIF(C105:C116,\">0\",I105:I116),\nIF(FORECAST($C102,I$105:I$116,$C$105:$C$116)<0,0,\nIF(FORECAST($C102,I$105:I$116,$C$105:$C$116)>100,100,\nFORECAST($C102,I$105:I$116,$C$105:$C$116))))","v":99.832086071929282},null,null,null,{"$f":"IF(MAX(C105:C116)-MIN(C105:C116)<5,AVERAGEIF(C105:C116,\">0\",M105:M116),\nIF(FORECAST($C102,M$105:M$116,$C$105:$C$116)<0,0,\nIF(FORECAST($C102,M$105:M$116,$C$105:$C$116)>100,100,\nFORECAST($C102,M$105:M$116,$C$105:$C$116))))","v":1.0540199750493829E-2},{"$f":"IF(MAX(C105:C116)-MIN(C105:C116)<5,AVERAGEIF(C105:C116,\">0\",N105:N116),\nIF(FORECAST($C102,N$105:N$116,$C$105:$C$116)<0,0,\nIF(FORECAST($C102,N$105:N$116,$C$105:$C$116)>100,100,\nFORECAST($C102,N$105:N$116,$C$105:$C$116))))","v":99.865359414657888},null,null,null,{"$f":"IF(MAX(C105:C116)-MIN(C105:C116)<5,AVERAGEIF(C105:C116,\">0\",R105:R116),\nIF(FORECAST($C102,R$105:R$116,$C$105:$C$116)<0,0,\nIF(FORECAST($C102,R$105:R$116,$C$105:$C$116)>100,100,\nFORECAST($C102,R$105:R$116,$C$105:$C$116))))","v":3.390375011276152E-3},{"$f":"IF(MAX(C105:C116)-MIN(C105:C116)<5,AVERAGEIF(C105:C116,\">0\",S105:S116),\nIF(FORECAST($C102,S$105:S$116,$C$105:$C$116)<0,0,\nIF(FORECAST($C102,S$105:S$116,$C$105:$C$116)>100,100,\nFORECAST($C102,S$105:S$116,$C$105:$C$116))))","v":100},null,null,null,{"$f":"IF(MAX(C105:C116)-MIN(C105:C116)<5,AVERAGEIF(C105:C116,\">0\",W105:W116),\nIF(FORECAST($C102,W$105:W$116,$C$105:$C$116)<0,0,\nIF(FORECAST($C102,W$105:W$116,$C$105:$C$116)>100,100,\nFORECAST($C102,W$105:W$116,$C$105:$C$116))))","v":0},{"$f":"IF(MAX(C105:C116)-MIN(C105:C116)<5,AVERAGEIF(C105:C116,\">0\",X105:X116),\nIF(FORECAST($C102,X$105:X$116,$C$105:$C$116)<0,0,\nIF(FORECAST($C102,X$105:X$116,$C$105:$C$116)>100,100,\nFORECAST($C102,X$105:X$116,$C$105:$C$116))))","v":99.776266775910997},null,null,null,{"$f":"IF(MAX(C105:C116)-MIN(C105:C116)<5,AVERAGEIF(C105:C116,\">0\",AB105:AB116),\nIF(FORECAST($C102,AB$105:AB$116,$C$105:$C$116)<0,0,\nIF(FORECAST($C102,AB$105:AB$116,$C$105:$C$116)>100,100,\nFORECAST($C102,AB$105:AB$116,$C$105:$C$116))))","v":0}]
[]
[null,"Survey","Year","Improved","% Improved\n< = 30min",null,null,"Surface water","Improved","% Improved\n< = 30min",null,null,"Surface water","Improved","% Improved\n< = 30min",null,null,"Surface water","Improved","% Improved\n< = 30min",null,null,"Surface water","Improved","% Improved\n< = 30min",null,null,"Surface water"]
[null,"MICS13",2013,{"$f":"IF(ISERROR(INDIRECT(CONCATENATE($B105,\"!C16\"))),\"\",INDIRECT(CONCATENATE($B105,\"!C16\")))","v":86.750032566288411},{"$f":"IF(ISERROR(INDIRECT(CONCATENATE($B105,\"!C23\"))),\"\",INDIRECT(CONCATENATE($B105,\"!C23\")))","v":99.8},null,null,{"$f":"IF(ISERROR(INDIRECT(CONCATENATE($B105,\"!C21\"))),\"\",INDIRECT(CONCATENATE($B105,\"!C21\")))","v":3.066238804731543},{"$f":"IF(ISERROR(INDIRECT(CONCATENATE($B105,\"!D16\"))),\"\",INDIRECT(CONCATENATE($B105,\"!D16\")))","v":99.832086071929282},{"$f":"IF(ISERROR(INDIRECT(CONCATENATE($B105,\"!D23\"))),\"\",INDIRECT(CONCATENATE($B105,\"!D23\")))","v":100},null,null,{"$f":"IF(ISERROR(INDIRECT(CONCATENATE($B105,\"!D21\"))),\"\",INDIRECT(CONCATENATE($B105,\"!D21\")))","v":1.0540199750493829E-2},{"$f":"IF(ISERROR(INDIRECT(CONCATENATE($B105,\"!E16\"))),\"\",INDIRECT(CONCATENATE($B105,\"!E16\")))","v":99.865359414657888},{"$f":"IF(ISERROR(INDIRECT(CONCATENATE($B105,\"!E23\"))),\"\",INDIRECT(CONCATENATE($B105,\"!E23\")))","v":100},null,null,{"$f":"IF(ISERROR(INDIRECT(CONCATENATE($B105,\"!E21\"))),\"\",INDIRECT(CONCATENATE($B105,\"!E21\")))","v":3.390375011276152E-3},{"$f":"IF(ISERROR(INDIRECT(CONCATENATE($B105,\"!F16\"))),\"\",INDIRECT(CONCATENATE($B105,\"!F16\")))","v":100},{"$f":"IF(ISERROR(INDIRECT(CONCATENATE($B105,\"!F23\"))),\"\",INDIRECT(CONCATENATE($B105,\"!F23\")))","v":100},null,null,{"$f":"IF(ISERROR(INDIRECT(CONCATENATE($B105,\"!F21\"))),\"\",INDIRECT(CONCATENATE($B105,\"!F21\")))","v":0},{"$f":"IF(ISERROR(INDIRECT(CONCATENATE($B105,\"!G16\"))),\"\",INDIRECT(CONCATENATE($B105,\"!G16\")))","v":99.776266775910997},{"$f":"IF(ISERROR(INDIRECT(CONCATENATE($B105,\"!G23\"))),\"\",INDIRECT(CONCATENATE($B105,\"!G23\")))","v":100},null,null,{"$f":"IF(ISERROR(INDIRECT(CONCATENATE($B105,\"!G221\"))),\"\",INDIRECT(CONCATENATE($B105,\"!G21\")))","v":0}]
[null,null,null,"","",null,null,"","","",null,null,"","","",null,null,"","","",null,null,"","","",null,null,""]
[null,null,null,"","",null,null,"","","",null,null,"","","",null,null,"","","",null,null,"","","",null,null,""]
[null,null,null,"","",null,null,"","","",null,null,"","","",null,null,"","","",null,null,"","","",null,null,""]
[null,null,null,"","",null,null,"","","",null,null,"","","",null,null,"","","",null,null,"","","",null,null,""]
[null,null,null,"","",null,null,"","","",null,null,"","","",null,null,"","","",null,null,"","","",null,null,""]
[null,null,null,{"$f":"IF(ISERROR(INDIRECT(CONCATENATE($B111,\"!C16\"))),\"\",INDIRECT(CONCATENATE($B111,\"!C16\")))","v":""},{"$f":"IF(ISERROR(INDIRECT(CONCATENATE($B111,\"!C23\"))),\"\",INDIRECT(CONCATENATE($B111,\"!C23\")))","v":""},null,null,{"$f":"IF(ISERROR(INDIRECT(CONCATENATE($B111,\"!C21\"))),\"\",INDIRECT(CONCATENATE($B111,\"!C21\")))","v":""},{"$f":"IF(ISERROR(INDIRECT(CONCATENATE($B111,\"!D16\"))),\"\",INDIRECT(CONCATENATE($B111,\"!D16\")))","v":""},{"$f":"IF(ISERROR(INDIRECT(CONCATENATE($B111,\"!D23\"))),\"\",INDIRECT(CONCATENATE($B111,\"!D23\")))","v":""},null,null,{"$f":"IF(ISERROR(INDIRECT(CONCATENATE($B111,\"!D21\"))),\"\",INDIRECT(CONCATENATE($B111,\"!D21\")))","v":""},{"$f":"IF(ISERROR(INDIRECT(CONCATENATE($B111,\"!E16\"))),\"\",INDIRECT(CONCATENATE($B111,\"!E16\")))","v":""},{"$f":"IF(ISERROR(INDIRECT(CONCATENATE($B111,\"!E23\"))),\"\",INDIRECT(CONCATENATE($B111,\"!E23\")))","v":""},null,null,{"$f":"IF(ISERROR(INDIRECT(CONCATENATE($B111,\"!E21\"))),\"\",INDIRECT(CONCATENATE($B111,\"!E21\")))","v":""},{"$f":"IF(ISERROR(INDIRECT(CONCATENATE($B111,\"!F16\"))),\"\",INDIRECT(CONCATENATE($B111,\"!F16\")))","v":""},{"$f":"IF(ISERROR(INDIRECT(CONCATENATE($B111,\"!F23\"))),\"\",INDIRECT(CONCATENATE($B111,\"!F23\")))","v":""},null,null,{"$f":"IF(ISERROR(INDIRECT(CONCATENATE($B111,\"!F21\"))),\"\",INDIRECT(CONCATENATE($B111,\"!F21\")))","v":""},{"$f":"IF(ISERROR(INDIRECT(CONCATENATE($B111,\"!G16\"))),\"\",INDIRECT(CONCATENATE($B111,\"!G16\")))","v":""},{"$f":"IF(ISERROR(INDIRECT(CONCATENATE($B111,\"!G23\"))),\"\",INDIRECT(CONCATENATE($B111,\"!G23\")))","v":""},null,null,{"$f":"IF(ISERROR(INDIRECT(CONCATENATE($B111,\"!G221\"))),\"\",INDIRECT(CONCATENATE($B111,\"!G21\")))","v":""}]
[null,null,null,{"$f":"IF(ISERROR(INDIRECT(CONCATENATE($B112,\"!C16\"))),\"\",INDIRECT(CONCATENATE($B112,\"!C16\")))","v":""},{"$f":"IF(ISERROR(INDIRECT(CONCATENATE($B112,\"!C23\"))),\"\",INDIRECT(CONCATENATE($B112,\"!C23\")))","v":""},null,null,{"$f":"IF(ISERROR(INDIRECT(CONCATENATE($B112,\"!C21\"))),\"\",INDIRECT(CONCATENATE($B112,\"!C21\")))","v":""},{"$f":"IF(ISERROR(INDIRECT(CONCATENATE($B112,\"!D16\"))),\"\",INDIRECT(CONCATENATE($B112,\"!D16\")))","v":""},{"$f":"IF(ISERROR(INDIRECT(CONCATENATE($B112,\"!D23\"))),\"\",INDIRECT(CONCATENATE($B112,\"!D23\")))","v":""},null,null,{"$f":"IF(ISERROR(INDIRECT(CONCATENATE($B112,\"!D21\"))),\"\",INDIRECT(CONCATENATE($B112,\"!D21\")))","v":""},{"$f":"IF(ISERROR(INDIRECT(CONCATENATE($B112,\"!E16\"))),\"\",INDIRECT(CONCATENATE($B112,\"!E16\")))","v":""},{"$f":"IF(ISERROR(INDIRECT(CONCATENATE($B112,\"!E23\"))),\"\",INDIRECT(CONCATENATE($B112,\"!E23\")))","v":""},null,null,{"$f":"IF(ISERROR(INDIRECT(CONCATENATE($B112,\"!E21\"))),\"\",INDIRECT(CONCATENATE($B112,\"!E21\")))","v":""},{"$f":"IF(ISERROR(INDIRECT(CONCATENATE($B112,\"!F16\"))),\"\",INDIRECT(CONCATENATE($B112,\"!F16\")))","v":""},{"$f":"IF(ISERROR(INDIRECT(CONCATENATE($B112,\"!F23\"))),\"\",INDIRECT(CONCATENATE($B112,\"!F23\")))","v":""},null,null,{"$f":"IF(ISERROR(INDIRECT(CONCATENATE($B112,\"!F21\"))),\"\",INDIRECT(CONCATENATE($B112,\"!F21\")))","v":""},{"$f":"IF(ISERROR(INDIRECT(CONCATENATE($B112,\"!G16\"))),\"\",INDIRECT(CONCATENATE($B112,\"!G16\")))","v":""},{"$f":"IF(ISERROR(INDIRECT(CONCATENATE($B112,\"!G23\"))),\"\",INDIRECT(CONCATENATE($B112,\"!G23\")))","v":""},null,null,{"$f":"IF(ISERROR(INDIRECT(CONCATENATE($B112,\"!G221\"))),\"\",INDIRECT(CONCATENATE($B112,\"!G21\")))","v":""}]
[null,null,null,"","",null,null,"","","",null,null,"","","",null,null,"","","",null,null,"","","",null,null,""]
[null,null,null,"","",null,null,"","","",null,null,"","","",null,null,"","","",null,null,"","","",null,null,""]
[null,null,null,"","",null,null,"","","",null,null,"","","",null,null,"","","",null,null,"","","",null,null,""]
[null,null,null,"","",null,null,"","","",null,null,"","","",null,null,"","","",null,null,"","","",null,null,""]
[]
[null,{"$f":"CONCATENATE(\"National use of drinking water sources, \",C99,\"–\",C100)","v":"National use of drinking water sources, 2009–2017"},null,null,null,null,null,null,null,null,null,null,null,null,null,null,null,null,"Data points used for regression"]
[]
[]
[]
[]
[]
[]
[]
[]
[]
[]
[]
[]
[]
[]
[]
[]
[]
[]
[]
[]
[]
[]
[]
[]
[]
[]
[]
[]
[]
[]
[]
[]
[]
[]
[null,null,null,null,{"$f":"IF(ISERROR(INDIRECT(CONCATENATE($B153,\"!M18\"))),\"\",INDIRECT(CONCATENATE($B153,\"!M18\")))","v":""},{"$f":"IF(ISERROR(INDIRECT(CONCATENATE($B153,\"!M19\"))),\"\",INDIRECT(CONCATENATE($B153,\"!M19\")))","v":""},{"$f":"IF(ISERROR(INDIRECT(CONCATENATE($B153,\"!M20\"))),\"\",INDIRECT(CONCATENATE($B153,\"!M20\")))","v":""},{"$f":"IF(ISERROR(INDIRECT(CONCATENATE($B153,\"!M21\"))),\"\",INDIRECT(CONCATENATE($B153,\"!M21\")))","v":""},null,{"$f":"IF(ISERROR(INDIRECT(CONCATENATE($B153,\"!N18\"))),\"\",INDIRECT(CONCATENATE($B153,\"!N18\")))","v":""},{"$f":"IF(ISERROR(INDIRECT(CONCATENATE($B153,\"!N19\"))),\"\",INDIRECT(CONCATENATE($B153,\"!N19\")))","v":""},{"$f":"IF(ISERROR(INDIRECT(CONCATENATE($B153,\"!N20\"))),\"\",INDIRECT(CONCATENATE($B153,\"!N20\")))","v":""},{"$f":"IF(ISERROR(INDIRECT(CONCATENATE($B153,\"!N21\"))),\"\",INDIRECT(CONCATENATE($B153,\"!N21\")))","v":""},null,{"$f":"IF(ISERROR(INDIRECT(CONCATENATE($B153,\"!O18\"))),\"\",INDIRECT(CONCATENATE($B153,\"!O18\")))","v":""},{"$f":"IF(ISERROR(INDIRECT(CONCATENATE($B153,\"!O19\"))),\"\",INDIRECT(CONCATENATE($B153,\"!O19\")))","v":""},{"$f":"IF(ISERROR(INDIRECT(CONCATENATE($B153,\"!O20\"))),\"\",INDIRECT(CONCATENATE($B153,\"!O20\")))","v":""},{"$f":"IF(ISERROR(INDIRECT(CONCATENATE($B153,\"!O21\"))),\"\",INDIRECT(CONCATENATE($B153,\"!O21\")))","v":""},null,{"$f":"IF(ISERROR(INDIRECT(CONCATENATE($B153,\"!P18\"))),\"\",INDIRECT(CONCATENATE($B153,\"!P18\")))","v":""},{"$f":"IF(ISERROR(INDIRECT(CONCATENATE($B153,\"!P19\"))),\"\",INDIRECT(CONCATENATE($B153,\"!P19\")))","v":""},{"$f":"IF(ISERROR(INDIRECT(CONCATENATE($B153,\"!P20\"))),\"\",INDIRECT(CONCATENATE($B153,\"!P20\")))","v":""},{"$f":"IF(ISERROR(INDIRECT(CONCATENATE($B153,\"!P21\"))),\"\",INDIRECT(CONCATENATE($B153,\"!P21\")))","v":""},null,{"$f":"IF(ISERROR(INDIRECT(CONCATENATE($B153,\"!Q18\"))),\"\",INDIRECT(CONCATENATE($B153,\"!Q18\")))","v":""},{"$f":"IF(ISERROR(INDIRECT(CONCATENATE($B153,\"!Q19\"))),\"\",INDIRECT(CONCATENATE($B153,\"!Q19\")))","v":""},{"$f":"IF(ISERROR(INDIRECT(CONCATENATE($B153,\"!Q20\"))),\"\",INDIRECT(CONCATENATE($B153,\"!Q20\")))","v":""},{"$f":"IF(ISERROR(INDIRECT(CONCATENATE($B153,\"!Q21\"))),\"\",INDIRECT(CONCATENATE($B153,\"!Q1\")))","v":""}]
[null,null,null,null,"","","","",null,"","","","",null,"","","","",null,"","","","",null,"","","",""]
[null,null,null,null,"","","","",null,"","","","",null,"","","","",null,"","","","",null,"","","",""]
[null,null,null,null,"","","","",null,"","","","",null,"","","","",null,"","","","",null,"","","",""]
[null,null,null,null,"","","","",null,"","","","",null,"","","","",null,"","","","",null,"","","",""]
[null,null,null,null,"","","","",null,"","","","",null,"","","","",null,"","","","",null,"","","",""]
[]
[]
[]
[]
[]
[]
[]
[]
[]
[]
[]
[]
[]
[]
[]
[]
[]
[]
[]
[]
[]
[]
[]
[]
[]
[]
[]
[]
[]
[]
[]
[]
[]
[]
[]
[]
[]
[]
["URBAN",null,null,"Poorest",null,null,null,null,"Poor",null,null,null,null,"Middle",null,null,null,null,"Rich",null,null,null,null,"Richest"]
[null,null,null,"Improved","Basic","Limited","Unimproved","Surface water","Improved","Basic","Limited","Unimproved","Surface water","Improved","Basic","Limited","Unimproved","Surface water","Improved","Basic","Limited","Unimproved","Surface water","Improved","Basic","Limited","Unimproved","Surface water"]
["Forecast period:",null,{"$f":"MinBase(C205:C216)","v":2009},{"$f":"IF((D201+H201)>100,D201*100/(D201+H201),D201)","v":99.838801301060514},{"$f":"D199*AVERAGEIF(E205:E216,\">0\")/100","v":99.738962499759452},{"$f":"D199*(100-AVERAGEIF(E205:E216,\">0\"))/100","v":9.9838801301054853E-2},{"$f":"100-(E199+F199+H199)","v":0.16119869893948646},{"$f":"IF((D201+H201)>100,H201*100/(D201+H201),H201)","v":0},{"$f":"IF((I201+M201)>100,I201*100/(I201+M201),I201)","v":99.987742180568205},{"$f":"I199*AVERAGEIF(J205:J216,\">0\")/100","v":99.987742180568205},{"$f":"I199*(100-AVERAGEIF(J205:J216,\">0\"))/100","v":0},{"$f":"100-(J199+K199+M199)","v":1.2257819431795269E-2},{"$f":"IF((I201+M201)>100,M201*100/(I201+M201),M201)","v":0},{"$f":"IF((N201+R201)>100,N201*100/(N201+R201),N201)","v":100},{"$f":"N199*AVERAGEIF(O205:O216,\">0\")/100","v":100},{"$f":"N199*(100-AVERAGEIF(O205:O216,\">0\"))/100","v":0},{"$f":"100-(O199+P199+R199)","v":0},{"$f":"IF((N201+R201)>100,R201*100/(N201+R201),R201)","v":0},{"$f":"IF((S201+W201)>100,S201*100/(S201+W201),S201)","v":99.930705345495412},{"$f":"S199*AVERAGEIF(T205:T216,\">0\")/100","v":99.930705345495412},{"$f":"S199*(100-AVERAGEIF(T205:T216,\">0\"))/100","v":0},{"$f":"100-(T199+U199+W199)","v":6.9294654504588493E-2},{"$f":"IF((S201+W201)>100,W201*100/(S201+W201),W201)","v":0},{"$f":"IF((X201+AB201)>100,X201*100/(X201+AB201),X201)","v":100},{"$f":"X199*AVERAGEIF(Y205:Y216,\">0\")/100","v":100},{"$f":"X199*(100-AVERAGEIF(Y205:Y216,\">0\"))/100","v":0},{"$f":"100-(Y199+Z199+AB199)","v":0},{"$f":"IF((X201+AB201)>100,AB201*100/(X201+AB201),AB201)","v":0}]
[null,null,{"$f":"MaxTarget(C205:C216)","v":2017},{"$f":"IF((D202+H202)>100,D202*100/(D202+H202),D202)","v":99.838801301060514},{"$f":"D200*AVERAGEIF(E205:E216,\">0\")/100","v":99.738962499759452},{"$f":"D200*(100-AVERAGEIF(E205:E216,\">0\"))/100","v":9.9838801301054853E-2},{"$f":"100-(E200+F200+H200)","v":0.16119869893948646},{"$f":"IF((D202+H202)>100,H202*100/(D202+H202),H202)","v":0},{"$f":"IF((I202+M202)>100,I202*100/(I202+M202),I202)","v":99.987742180568205},{"$f":"I200*AVERAGEIF(J205:J216,\">0\")/100","v":99.987742180568205},{"$f":"I200*(100-AVERAGEIF(J205:J216,\">0\"))/100","v":0},{"$f":"100-(J200+K200+M200)","v":1.2257819431795269E-2},{"$f":"IF((I202+M202)>100,M202*100/(I202+M202),M202)","v":0},{"$f":"IF((N202+R202)>100,N202*100/(N202+R202),N202)","v":100},{"$f":"N200*AVERAGEIF(O205:O216,\">0\")/100","v":100},{"$f":"N200*(100-AVERAGEIF(O205:O216,\">0\"))/100","v":0},{"$f":"100-(O200+P200+R200)","v":0},{"$f":"IF((N202+R202)>100,R202*100/(N202+R202),R202)","v":0},{"$f":"IF((S202+W202)>100,S202*100/(S202+W202),S202)","v":99.930705345495412},{"$f":"S200*AVERAGEIF(T205:T216,\">0\")/100","v":99.930705345495412},{"$f":"S200*(100-AVERAGEIF(T205:T216,\">0\"))/100","v":0},{"$f":"100-(T200+U200+W200)","v":6.9294654504588493E-2},{"$f":"IF((S202+W202)>100,W202*100/(S202+W202),W202)","v":0},{"$f":"IF((X202+AB202)>100,X202*100/(X202+AB202),X202)","v":100},{"$f":"X200*AVERAGEIF(Y205:Y216,\">0\")/100","v":100},{"$f":"X200*(100-AVERAGEIF(Y205:Y216,\">0\"))/100","v":0},{"$f":"100-(Y200+Z200+AB200)","v":0},{"$f":"IF((X202+AB202)>100,AB202*100/(X202+AB202),AB202)","v":0}]
["Regression period:",null,{"$f":"MinRegYear(C199,C205:C216)","v":2011},{"$f":"IF(MAX(C205:C216)-MIN(C205:C216)<5,AVERAGEIF(C205:C216,\">0\",D205:D216),\nIF(FORECAST($C201,D$205:D$216,$C$205:$C$216)<0,0,\nIF(FORECAST($C201,D$205:D$216,$C$205:$C$216)>100,100,\nFORECAST($C201,D$205:D$216,$C$205:$C$216))))","v":99.838801301060514},null,null,null,{"$f":"IF(MAX(C205:C216)-MIN(C205:C216)<5,AVERAGEIF(C205:C216,\">0\",H205:H216),\nIF(FORECAST($C201,H$205:H$216,$C$205:$C$216)<0,0,\nIF(FORECAST($C201,H$205:H$216,$C$205:$C$216)>100,100,\nFORECAST($C201,H$205:H$216,$C$205:$C$216))))","v":0},{"$f":"IF(MAX(C205:C216)-MIN(C205:C216)<5,AVERAGEIF(C205:C216,\">0\",I205:I216),\nIF(FORECAST($C201,I$205:I$216,$C$205:$C$216)<0,0,\nIF(FORECAST($C201,I$205:I$216,$C$205:$C$216)>100,100,\nFORECAST($C201,I$205:I$216,$C$205:$C$216))))","v":99.987742180568205},null,null,null,{"$f":"IF(MAX(C205:C216)-MIN(C205:C216)<5,AVERAGEIF(C205:C216,\">0\",M205:M216),\nIF(FORECAST($C201,M$205:M$216,$C$205:$C$216)<0,0,\nIF(FORECAST($C201,M$205:M$216,$C$205:$C$216)>100,100,\nFORECAST($C201,M$205:M$216,$C$205:$C$216))))","v":0},{"$f":"IF(MAX(C205:C216)-MIN(C205:C216)<5,AVERAGEIF(C205:C216,\">0\",N205:N216),\nIF(FORECAST($C201,N$205:N$216,$C$205:$C$216)<0,0,\nIF(FORECAST($C201,N$205:N$216,$C$205:$C$216)>100,100,\nFORECAST($C201,N$205:N$216,$C$205:$C$216))))","v":100},null,null,null,{"$f":"IF(MAX(C205:C216)-MIN(C205:C216)<5,AVERAGEIF(C205:C216,\">0\",R205:R216),\nIF(FORECAST($C201,R$205:R$216,$C$205:$C$216)<0,0,\nIF(FORECAST($C201,R$205:R$216,$C$205:$C$216)>100,100,\nFORECAST($C201,R$205:R$216,$C$205:$C$216))))","v":0},{"$f":"IF(MAX(C205:C216)-MIN(C205:C216)<5,AVERAGEIF(C205:C216,\">0\",S205:S216),\nIF(FORECAST($C201,S$205:S$216,$C$205:$C$216)<0,0,\nIF(FORECAST($C201,S$205:S$216,$C$205:$C$216)>100,100,\nFORECAST($C201,S$205:S$216,$C$205:$C$216))))","v":99.930705345495412},null,null,null,{"$f":"IF(MAX(C205:C216)-MIN(C205:C216)<5,AVERAGEIF(C205:C216,\">0\",W205:W216),\nIF(FORECAST($C201,W$205:W$216,$C$205:$C$216)<0,0,\nIF(FORECAST($C201,W$205:W$216,$C$205:$C$216)>100,100,\nFORECAST($C201,W$205:W$216,$C$205:$C$216))))","v":0},{"$f":"IF(MAX(C205:C216)-MIN(C205:C216)<5,AVERAGEIF(C205:C216,\">0\",X205:X216),\nIF(FORECAST($C201,X$205:X$216,$C$205:$C$216)<0,0,\nIF(FORECAST($C201,X$205:X$216,$C$205:$C$216)>100,100,\nFORECAST($C201,X$205:X$216,$C$205:$C$216))))","v":100},null,null,null,{"$f":"IF(MAX(C205:C216)-MIN(C205:C216)<5,AVERAGEIF(C205:C216,\">0\",AB205:AB216),\nIF(FORECAST($C201,AB$205:AB$216,$C$205:$C$216)<0,0,\nIF(FORECAST($C201,AB$205:AB$216,$C$205:$C$216)>100,100,\nFORECAST($C201,AB$205:AB$216,$C$205:$C$216))))","v":0}]
[null,null,{"$f":"MaxRegYear(C200,C205:C216)","v":2015},{"$f":"IF(MAX(C205:C216)-MIN(C205:C216)<5,AVERAGEIF(C205:C216,\">0\",D205:D216),\nIF(FORECAST($C202,D$205:D$216,$C$205:$C$216)<0,0,\nIF(FORECAST($C202,D$205:D$216,$C$205:$C$216)>100,100,\nFORECAST($C202,D$205:D$216,$C$205:$C$216))))","v":99.838801301060514},null,null,null,{"$f":"IF(MAX(C205:C216)-MIN(C205:C216)<5,AVERAGEIF(C205:C216,\">0\",H205:H216),\nIF(FORECAST($C202,H$205:H$216,$C$205:$C$216)<0,0,\nIF(FORECAST($C202,H$205:H$216,$C$205:$C$216)>100,100,\nFORECAST($C202,H$205:H$216,$C$205:$C$216))))","v":0},{"$f":"IF(MAX(C205:C216)-MIN(C205:C216)<5,AVERAGEIF(C205:C216,\">0\",I205:I216),\nIF(FORECAST($C202,I$205:I$216,$C$205:$C$216)<0,0,\nIF(FORECAST($C202,I$205:I$216,$C$205:$C$216)>100,100,\nFORECAST($C202,I$205:I$216,$C$205:$C$216))))","v":99.987742180568205},null,null,null,{"$f":"IF(MAX(C205:C216)-MIN(C205:C216)<5,AVERAGEIF(C205:C216,\">0\",M205:M216),\nIF(FORECAST($C202,M$205:M$216,$C$205:$C$216)<0,0,\nIF(FORECAST($C202,M$205:M$216,$C$205:$C$216)>100,100,\nFORECAST($C202,M$205:M$216,$C$205:$C$216))))","v":0},{"$f":"IF(MAX(C205:C216)-MIN(C205:C216)<5,AVERAGEIF(C205:C216,\">0\",N205:N216),\nIF(FORECAST($C202,N$205:N$216,$C$205:$C$216)<0,0,\nIF(FORECAST($C202,N$205:N$216,$C$205:$C$216)>100,100,\nFORECAST($C202,N$205:N$216,$C$205:$C$216))))","v":100},null,null,null,{"$f":"IF(MAX(C205:C216)-MIN(C205:C216)<5,AVERAGEIF(C205:C216,\">0\",R205:R216),\nIF(FORECAST($C202,R$205:R$216,$C$205:$C$216)<0,0,\nIF(FORECAST($C202,R$205:R$216,$C$205:$C$216)>100,100,\nFORECAST($C202,R$205:R$216,$C$205:$C$216))))","v":0},{"$f":"IF(MAX(C205:C216)-MIN(C205:C216)<5,AVERAGEIF(C205:C216,\">0\",S205:S216),\nIF(FORECAST($C202,S$205:S$216,$C$205:$C$216)<0,0,\nIF(FORECAST($C202,S$205:S$216,$C$205:$C$216)>100,100,\nFORECAST($C202,S$205:S$216,$C$205:$C$216))))","v":99.930705345495412},null,null,null,{"$f":"IF(MAX(C205:C216)-MIN(C205:C216)<5,AVERAGEIF(C205:C216,\">0\",W205:W216),\nIF(FORECAST($C202,W$205:W$216,$C$205:$C$216)<0,0,\nIF(FORECAST($C202,W$205:W$216,$C$205:$C$216)>100,100,\nFORECAST($C202,W$205:W$216,$C$205:$C$216))))","v":0},{"$f":"IF(MAX(C205:C216)-MIN(C205:C216)<5,AVERAGEIF(C205:C216,\">0\",X205:X216),\nIF(FORECAST($C202,X$205:X$216,$C$205:$C$216)<0,0,\nIF(FORECAST($C202,X$205:X$216,$C$205:$C$216)>100,100,\nFORECAST($C202,X$205:X$216,$C$205:$C$216))))","v":100},null,null,null,{"$f":"IF(MAX(C205:C216)-MIN(C205:C216)<5,AVERAGEIF(C205:C216,\">0\",AB205:AB216),\nIF(FORECAST($C202,AB$205:AB$216,$C$205:$C$216)<0,0,\nIF(FORECAST($C202,AB$205:AB$216,$C$205:$C$216)>100,100,\nFORECAST($C202,AB$205:AB$216,$C$205:$C$216))))","v":0}]
[]
[null,"Survey","Year","Improved","% Improved\n< = 30min",null,null,"Surface water","Improved","% Improved\n< = 30min",null,null,"Surface water","Improved","% Improved\n< = 30min",null,null,"Surface water","Improved","% Improved\n< = 30min",null,null,"Surface water","Improved","% Improved\n< = 30min",null,null,"Surface water"]
[null,"MICS13",2013,{"$f":"IF(ISERROR(INDIRECT(CONCATENATE($B205,\"!H16\"))),\"\",INDIRECT(CONCATENATE($B205,\"!H16\")))","v":99.838801301060514},{"$f":"IF(ISERROR(INDIRECT(CONCATENATE($B205,\"!H23\"))),\"\",INDIRECT(CONCATENATE($B205,\"!H23\")))","v":99.9},null,null,{"$f":"IF(ISERROR(INDIRECT(CONCATENATE($B205,\"!H21\"))),\"\",INDIRECT(CONCATENATE($B205,\"!H21\")))","v":0},{"$f":"IF(ISERROR(INDIRECT(CONCATENATE($B205,\"!I16\"))),\"\",INDIRECT(CONCATENATE($B205,\"!I16\")))","v":99.987742180568205},{"$f":"IF(ISERROR(INDIRECT(CONCATENATE($B205,\"!I23\"))),\"\",INDIRECT(CONCATENATE($B205,\"!I23\")))","v":100},null,null,{"$f":"IF(ISERROR(INDIRECT(CONCATENATE($B205,\"!I21\"))),\"\",INDIRECT(CONCATENATE($B205,\"!I21\")))","v":0},{"$f":"IF(ISERROR(INDIRECT(CONCATENATE($B205,\"!J16\"))),\"\",INDIRECT(CONCATENATE($B205,\"!J16\")))","v":100},{"$f":"IF(ISERROR(INDIRECT(CONCATENATE($B205,\"!J23\"))),\"\",INDIRECT(CONCATENATE($B205,\"!J23\")))","v":100},null,null,{"$f":"IF(ISERROR(INDIRECT(CONCATENATE($B205,\"!J21\"))),\"\",INDIRECT(CONCATENATE($B205,\"!J21\")))","v":0},{"$f":"IF(ISERROR(INDIRECT(CONCATENATE($B205,\"!K16\"))),\"\",INDIRECT(CONCATENATE($B205,\"!K16\")))","v":99.930705345495412},{"$f":"IF(ISERROR(INDIRECT(CONCATENATE($B205,\"!K23\"))),\"\",INDIRECT(CONCATENATE($B205,\"!K23\")))","v":100},null,null,{"$f":"IF(ISERROR(INDIRECT(CONCATENATE($B205,\"!K21\"))),\"\",INDIRECT(CONCATENATE($B205,\"!K21\")))","v":0},{"$f":"IF(ISERROR(INDIRECT(CONCATENATE($B205,\"!L16\"))),\"\",INDIRECT(CONCATENATE($B205,\"!L16\")))","v":100},{"$f":"IF(ISERROR(INDIRECT(CONCATENATE($B205,\"!L23\"))),\"\",INDIRECT(CONCATENATE($B205,\"!L23\")))","v":100},null,null,{"$f":"IF(ISERROR(INDIRECT(CONCATENATE($B205,\"!L221\"))),\"\",INDIRECT(CONCATENATE($B205,\"!L21\")))","v":0}]
[null,null,null,"","",null,null,"","","",null,null,"","","",null,null,"","","",null,null,"","","",null,null,""]
[null,null,null,"","",null,null,"","","",null,null,"","","",null,null,"","","",null,null,"","","",null,null,""]
[null,null,null,"","",null,null,"","","",null,null,"","","",null,null,"","","",null,null,"","","",null,null,""]
[null,null,null,"","",null,null,"","","",null,null,"","","",null,null,"","","",null,null,"","","",null,null,""]
[null,null,null,"","",null,null,"","","",null,null,"","","",null,null,"","","",null,null,"","","",null,null,""]
[null,null,null,"","",null,null,"","","",null,null,"","","",null,null,"","","",null,null,"","","",null,null,""]
[null,null,null,"","",null,null,"","","",null,null,"","","",null,null,"","","",null,null,"","","",null,null,""]
[null,null,null,"","",null,null,"","","",null,null,"","","",null,null,"","","",null,null,"","","",null,null,""]
[null,null,null,"","",null,null,"","","",null,null,"","","",null,null,"","","",null,null,"","","",null,null,""]
[null,null,null,"","",null,null,"","","",null,null,"","","",null,null,"","","",null,null,"","","",null,null,""]
[null,null,null,"","",null,null,"","","",null,null,"","","",null,null,"","","",null,null,"","","",null,null,""]
[]
[null,{"$f":"CONCATENATE(\"Urban use of drinking water sources,  \",C199,\"–\",C200)","v":"Urban use of drinking water sources,  2009–2017"},null,null,null,null,null,null,null,null,null,null,null,null,null,null,null,null,"Data points used for regression"]
[]
[]
[]
[]
[]
[]
[]
[]
[]
[]
[]
[]
[]
[]
[]
[]
[]
[]
[]
[]
[]
[]
[]
[]
[]
[]
[]
[]
[]
[]
[]
[]
[]
[]
[null,null,null,null,{"$f":"IF(ISERROR(INDIRECT(CONCATENATE($B253,\"!M18\"))),\"\",INDIRECT(CONCATENATE($B253,\"!M18\")))","v":""},{"$f":"IF(ISERROR(INDIRECT(CONCATENATE($B253,\"!M19\"))),\"\",INDIRECT(CONCATENATE($B253,\"!M19\")))","v":""},{"$f":"IF(ISERROR(INDIRECT(CONCATENATE($B253,\"!M20\"))),\"\",INDIRECT(CONCATENATE($B253,\"!M20\")))","v":""},{"$f":"IF(ISERROR(INDIRECT(CONCATENATE($B253,\"!M21\"))),\"\",INDIRECT(CONCATENATE($B253,\"!M21\")))","v":""},null,{"$f":"IF(ISERROR(INDIRECT(CONCATENATE($B253,\"!N18\"))),\"\",INDIRECT(CONCATENATE($B253,\"!N18\")))","v":""},{"$f":"IF(ISERROR(INDIRECT(CONCATENATE($B253,\"!N19\"))),\"\",INDIRECT(CONCATENATE($B253,\"!N19\")))","v":""},{"$f":"IF(ISERROR(INDIRECT(CONCATENATE($B253,\"!N20\"))),\"\",INDIRECT(CONCATENATE($B253,\"!N20\")))","v":""},{"$f":"IF(ISERROR(INDIRECT(CONCATENATE($B253,\"!N21\"))),\"\",INDIRECT(CONCATENATE($B253,\"!N21\")))","v":""},null,{"$f":"IF(ISERROR(INDIRECT(CONCATENATE($B253,\"!O18\"))),\"\",INDIRECT(CONCATENATE($B253,\"!O18\")))","v":""},{"$f":"IF(ISERROR(INDIRECT(CONCATENATE($B253,\"!O19\"))),\"\",INDIRECT(CONCATENATE($B253,\"!O19\")))","v":""},{"$f":"IF(ISERROR(INDIRECT(CONCATENATE($B253,\"!O20\"))),\"\",INDIRECT(CONCATENATE($B253,\"!O20\")))","v":""},{"$f":"IF(ISERROR(INDIRECT(CONCATENATE($B253,\"!O21\"))),\"\",INDIRECT(CONCATENATE($B253,\"!O21\")))","v":""},null,{"$f":"IF(ISERROR(INDIRECT(CONCATENATE($B253,\"!P18\"))),\"\",INDIRECT(CONCATENATE($B253,\"!P18\")))","v":""},{"$f":"IF(ISERROR(INDIRECT(CONCATENATE($B253,\"!P19\"))),\"\",INDIRECT(CONCATENATE($B253,\"!P19\")))","v":""},{"$f":"IF(ISERROR(INDIRECT(CONCATENATE($B253,\"!P20\"))),\"\",INDIRECT(CONCATENATE($B253,\"!P20\")))","v":""},{"$f":"IF(ISERROR(INDIRECT(CONCATENATE($B253,\"!P21\"))),\"\",INDIRECT(CONCATENATE($B253,\"!P21\")))","v":""},null,{"$f":"IF(ISERROR(INDIRECT(CONCATENATE($B253,\"!Q18\"))),\"\",INDIRECT(CONCATENATE($B253,\"!Q18\")))","v":""},{"$f":"IF(ISERROR(INDIRECT(CONCATENATE($B253,\"!Q19\"))),\"\",INDIRECT(CONCATENATE($B253,\"!Q19\")))","v":""},{"$f":"IF(ISERROR(INDIRECT(CONCATENATE($B253,\"!Q20\"))),\"\",INDIRECT(CONCATENATE($B253,\"!Q20\")))","v":""},{"$f":"IF(ISERROR(INDIRECT(CONCATENATE($B253,\"!Q21\"))),\"\",INDIRECT(CONCATENATE($B253,\"!Q1\")))","v":""}]
[null,null,null,null,{"$f":"IF(ISERROR(INDIRECT(CONCATENATE($B254,\"!M18\"))),\"\",INDIRECT(CONCATENATE($B254,\"!M18\")))","v":""},{"$f":"IF(ISERROR(INDIRECT(CONCATENATE($B254,\"!M19\"))),\"\",INDIRECT(CONCATENATE($B254,\"!M19\")))","v":""},{"$f":"IF(ISERROR(INDIRECT(CONCATENATE($B254,\"!M20\"))),\"\",INDIRECT(CONCATENATE($B254,\"!M20\")))","v":""},{"$f":"IF(ISERROR(INDIRECT(CONCATENATE($B254,\"!M21\"))),\"\",INDIRECT(CONCATENATE($B254,\"!M21\")))","v":""},null,{"$f":"IF(ISERROR(INDIRECT(CONCATENATE($B254,\"!N18\"))),\"\",INDIRECT(CONCATENATE($B254,\"!N18\")))","v":""},{"$f":"IF(ISERROR(INDIRECT(CONCATENATE($B254,\"!N19\"))),\"\",INDIRECT(CONCATENATE($B254,\"!N19\")))","v":""},{"$f":"IF(ISERROR(INDIRECT(CONCATENATE($B254,\"!N20\"))),\"\",INDIRECT(CONCATENATE($B254,\"!N20\")))","v":""},{"$f":"IF(ISERROR(INDIRECT(CONCATENATE($B254,\"!N21\"))),\"\",INDIRECT(CONCATENATE($B254,\"!N21\")))","v":""},null,{"$f":"IF(ISERROR(INDIRECT(CONCATENATE($B254,\"!O18\"))),\"\",INDIRECT(CONCATENATE($B254,\"!O18\")))","v":""},{"$f":"IF(ISERROR(INDIRECT(CONCATENATE($B254,\"!O19\"))),\"\",INDIRECT(CONCATENATE($B254,\"!O19\")))","v":""},{"$f":"IF(ISERROR(INDIRECT(CONCATENATE($B254,\"!O20\"))),\"\",INDIRECT(CONCATENATE($B254,\"!O20\")))","v":""},{"$f":"IF(ISERROR(INDIRECT(CONCATENATE($B254,\"!O21\"))),\"\",INDIRECT(CONCATENATE($B254,\"!O21\")))","v":""},null,{"$f":"IF(ISERROR(INDIRECT(CONCATENATE($B254,\"!P18\"))),\"\",INDIRECT(CONCATENATE($B254,\"!P18\")))","v":""},{"$f":"IF(ISERROR(INDIRECT(CONCATENATE($B254,\"!P19\"))),\"\",INDIRECT(CONCATENATE($B254,\"!P19\")))","v":""},{"$f":"IF(ISERROR(INDIRECT(CONCATENATE($B254,\"!P20\"))),\"\",INDIRECT(CONCATENATE($B254,\"!P20\")))","v":""},{"$f":"IF(ISERROR(INDIRECT(CONCATENATE($B254,\"!P21\"))),\"\",INDIRECT(CONCATENATE($B254,\"!P21\")))","v":""},null,{"$f":"IF(ISERROR(INDIRECT(CONCATENATE($B254,\"!Q18\"))),\"\",INDIRECT(CONCATENATE($B254,\"!Q18\")))","v":""},{"$f":"IF(ISERROR(INDIRECT(CONCATENATE($B254,\"!Q19\"))),\"\",INDIRECT(CONCATENATE($B254,\"!Q19\")))","v":""},{"$f":"IF(ISERROR(INDIRECT(CONCATENATE($B254,\"!Q20\"))),\"\",INDIRECT(CONCATENATE($B254,\"!Q20\")))","v":""},{"$f":"IF(ISERROR(INDIRECT(CONCATENATE($B254,\"!Q21\"))),\"\",INDIRECT(CONCATENATE($B254,\"!Q1\")))","v":""}]
[null,null,null,null,{"$f":"IF(ISERROR(INDIRECT(CONCATENATE($B255,\"!M18\"))),\"\",INDIRECT(CONCATENATE($B255,\"!M18\")))","v":""},{"$f":"IF(ISERROR(INDIRECT(CONCATENATE($B255,\"!M19\"))),\"\",INDIRECT(CONCATENATE($B255,\"!M19\")))","v":""},{"$f":"IF(ISERROR(INDIRECT(CONCATENATE($B255,\"!M20\"))),\"\",INDIRECT(CONCATENATE($B255,\"!M20\")))","v":""},{"$f":"IF(ISERROR(INDIRECT(CONCATENATE($B255,\"!M21\"))),\"\",INDIRECT(CONCATENATE($B255,\"!M21\")))","v":""},null,{"$f":"IF(ISERROR(INDIRECT(CONCATENATE($B255,\"!N18\"))),\"\",INDIRECT(CONCATENATE($B255,\"!N18\")))","v":""},{"$f":"IF(ISERROR(INDIRECT(CONCATENATE($B255,\"!N19\"))),\"\",INDIRECT(CONCATENATE($B255,\"!N19\")))","v":""},{"$f":"IF(ISERROR(INDIRECT(CONCATENATE($B255,\"!N20\"))),\"\",INDIRECT(CONCATENATE($B255,\"!N20\")))","v":""},{"$f":"IF(ISERROR(INDIRECT(CONCATENATE($B255,\"!N21\"))),\"\",INDIRECT(CONCATENATE($B255,\"!N21\")))","v":""},null,{"$f":"IF(ISERROR(INDIRECT(CONCATENATE($B255,\"!O18\"))),\"\",INDIRECT(CONCATENATE($B255,\"!O18\")))","v":""},{"$f":"IF(ISERROR(INDIRECT(CONCATENATE($B255,\"!O19\"))),\"\",INDIRECT(CONCATENATE($B255,\"!O19\")))","v":""},{"$f":"IF(ISERROR(INDIRECT(CONCATENATE($B255,\"!O20\"))),\"\",INDIRECT(CONCATENATE($B255,\"!O20\")))","v":""},{"$f":"IF(ISERROR(INDIRECT(CONCATENATE($B255,\"!O21\"))),\"\",INDIRECT(CONCATENATE($B255,\"!O21\")))","v":""},null,{"$f":"IF(ISERROR(INDIRECT(CONCATENATE($B255,\"!P18\"))),\"\",INDIRECT(CONCATENATE($B255,\"!P18\")))","v":""},{"$f":"IF(ISERROR(INDIRECT(CONCATENATE($B255,\"!P19\"))),\"\",INDIRECT(CONCATENATE($B255,\"!P19\")))","v":""},{"$f":"IF(ISERROR(INDIRECT(CONCATENATE($B255,\"!P20\"))),\"\",INDIRECT(CONCATENATE($B255,\"!P20\")))","v":""},{"$f":"IF(ISERROR(INDIRECT(CONCATENATE($B255,\"!P21\"))),\"\",INDIRECT(CONCATENATE($B255,\"!P21\")))","v":""},null,{"$f":"IF(ISERROR(INDIRECT(CONCATENATE($B255,\"!Q18\"))),\"\",INDIRECT(CONCATENATE($B255,\"!Q18\")))","v":""},{"$f":"IF(ISERROR(INDIRECT(CONCATENATE($B255,\"!Q19\"))),\"\",INDIRECT(CONCATENATE($B255,\"!Q19\")))","v":""},{"$f":"IF(ISERROR(INDIRECT(CONCATENATE($B255,\"!Q20\"))),\"\",INDIRECT(CONCATENATE($B255,\"!Q20\")))","v":""},{"$f":"IF(ISERROR(INDIRECT(CONCATENATE($B255,\"!Q21\"))),\"\",INDIRECT(CONCATENATE($B255,\"!Q1\")))","v":""}]
[null,null,null,null,{"$f":"IF(ISERROR(INDIRECT(CONCATENATE($B256,\"!M18\"))),\"\",INDIRECT(CONCATENATE($B256,\"!M18\")))","v":""},{"$f":"IF(ISERROR(INDIRECT(CONCATENATE($B256,\"!M19\"))),\"\",INDIRECT(CONCATENATE($B256,\"!M19\")))","v":""},{"$f":"IF(ISERROR(INDIRECT(CONCATENATE($B256,\"!M20\"))),\"\",INDIRECT(CONCATENATE($B256,\"!M20\")))","v":""},{"$f":"IF(ISERROR(INDIRECT(CONCATENATE($B256,\"!M21\"))),\"\",INDIRECT(CONCATENATE($B256,\"!M21\")))","v":""},null,{"$f":"IF(ISERROR(INDIRECT(CONCATENATE($B256,\"!N18\"))),\"\",INDIRECT(CONCATENATE($B256,\"!N18\")))","v":""},{"$f":"IF(ISERROR(INDIRECT(CONCATENATE($B256,\"!N19\"))),\"\",INDIRECT(CONCATENATE($B256,\"!N19\")))","v":""},{"$f":"IF(ISERROR(INDIRECT(CONCATENATE($B256,\"!N20\"))),\"\",INDIRECT(CONCATENATE($B256,\"!N20\")))","v":""},{"$f":"IF(ISERROR(INDIRECT(CONCATENATE($B256,\"!N21\"))),\"\",INDIRECT(CONCATENATE($B256,\"!N21\")))","v":""},null,{"$f":"IF(ISERROR(INDIRECT(CONCATENATE($B256,\"!O18\"))),\"\",INDIRECT(CONCATENATE($B256,\"!O18\")))","v":""},{"$f":"IF(ISERROR(INDIRECT(CONCATENATE($B256,\"!O19\"))),\"\",INDIRECT(CONCATENATE($B256,\"!O19\")))","v":""},{"$f":"IF(ISERROR(INDIRECT(CONCATENATE($B256,\"!O20\"))),\"\",INDIRECT(CONCATENATE($B256,\"!O20\")))","v":""},{"$f":"IF(ISERROR(INDIRECT(CONCATENATE($B256,\"!O21\"))),\"\",INDIRECT(CONCATENATE($B256,\"!O21\")))","v":""},null,{"$f":"IF(ISERROR(INDIRECT(CONCATENATE($B256,\"!P18\"))),\"\",INDIRECT(CONCATENATE($B256,\"!P18\")))","v":""},{"$f":"IF(ISERROR(INDIRECT(CONCATENATE($B256,\"!P19\"))),\"\",INDIRECT(CONCATENATE($B256,\"!P19\")))","v":""},{"$f":"IF(ISERROR(INDIRECT(CONCATENATE($B256,\"!P20\"))),\"\",INDIRECT(CONCATENATE($B256,\"!P20\")))","v":""},{"$f":"IF(ISERROR(INDIRECT(CONCATENATE($B256,\"!P21\"))),\"\",INDIRECT(CONCATENATE($B256,\"!P21\")))","v":""},null,{"$f":"IF(ISERROR(INDIRECT(CONCATENATE($B256,\"!Q18\"))),\"\",INDIRECT(CONCATENATE($B256,\"!Q18\")))","v":""},{"$f":"IF(ISERROR(INDIRECT(CONCATENATE($B256,\"!Q19\"))),\"\",INDIRECT(CONCATENATE($B256,\"!Q19\")))","v":""},{"$f":"IF(ISERROR(INDIRECT(CONCATENATE($B256,\"!Q20\"))),\"\",INDIRECT(CONCATENATE($B256,\"!Q20\")))","v":""},{"$f":"IF(ISERROR(INDIRECT(CONCATENATE($B256,\"!Q21\"))),\"\",INDIRECT(CONCATENATE($B256,\"!Q1\")))","v":""}]
[null,null,null,null,{"$f":"IF(ISERROR(INDIRECT(CONCATENATE($B257,\"!M18\"))),\"\",INDIRECT(CONCATENATE($B257,\"!M18\")))","v":""},{"$f":"IF(ISERROR(INDIRECT(CONCATENATE($B257,\"!M19\"))),\"\",INDIRECT(CONCATENATE($B257,\"!M19\")))","v":""},{"$f":"IF(ISERROR(INDIRECT(CONCATENATE($B257,\"!M20\"))),\"\",INDIRECT(CONCATENATE($B257,\"!M20\")))","v":""},{"$f":"IF(ISERROR(INDIRECT(CONCATENATE($B257,\"!M21\"))),\"\",INDIRECT(CONCATENATE($B257,\"!M21\")))","v":""},null,{"$f":"IF(ISERROR(INDIRECT(CONCATENATE($B257,\"!N18\"))),\"\",INDIRECT(CONCATENATE($B257,\"!N18\")))","v":""},{"$f":"IF(ISERROR(INDIRECT(CONCATENATE($B257,\"!N19\"))),\"\",INDIRECT(CONCATENATE($B257,\"!N19\")))","v":""},{"$f":"IF(ISERROR(INDIRECT(CONCATENATE($B257,\"!N20\"))),\"\",INDIRECT(CONCATENATE($B257,\"!N20\")))","v":""},{"$f":"IF(ISERROR(INDIRECT(CONCATENATE($B257,\"!N21\"))),\"\",INDIRECT(CONCATENATE($B257,\"!N21\")))","v":""},null,{"$f":"IF(ISERROR(INDIRECT(CONCATENATE($B257,\"!O18\"))),\"\",INDIRECT(CONCATENATE($B257,\"!O18\")))","v":""},{"$f":"IF(ISERROR(INDIRECT(CONCATENATE($B257,\"!O19\"))),\"\",INDIRECT(CONCATENATE($B257,\"!O19\")))","v":""},{"$f":"IF(ISERROR(INDIRECT(CONCATENATE($B257,\"!O20\"))),\"\",INDIRECT(CONCATENATE($B257,\"!O20\")))","v":""},{"$f":"IF(ISERROR(INDIRECT(CONCATENATE($B257,\"!O21\"))),\"\",INDIRECT(CONCATENATE($B257,\"!O21\")))","v":""},null,{"$f":"IF(ISERROR(INDIRECT(CONCATENATE($B257,\"!P18\"))),\"\",INDIRECT(CONCATENATE($B257,\"!P18\")))","v":""},{"$f":"IF(ISERROR(INDIRECT(CONCATENATE($B257,\"!P19\"))),\"\",INDIRECT(CONCATENATE($B257,\"!P19\")))","v":""},{"$f":"IF(ISERROR(INDIRECT(CONCATENATE($B257,\"!P20\"))),\"\",INDIRECT(CONCATENATE($B257,\"!P20\")))","v":""},{"$f":"IF(ISERROR(INDIRECT(CONCATENATE($B257,\"!P21\"))),\"\",INDIRECT(CONCATENATE($B257,\"!P21\")))","v":""},null,{"$f":"IF(ISERROR(INDIRECT(CONCATENATE($B257,\"!Q18\"))),\"\",INDIRECT(CONCATENATE($B257,\"!Q18\")))","v":""},{"$f":"IF(ISERROR(INDIRECT(CONCATENATE($B257,\"!Q19\"))),\"\",INDIRECT(CONCATENATE($B257,\"!Q19\")))","v":""},{"$f":"IF(ISERROR(INDIRECT(CONCATENATE($B257,\"!Q20\"))),\"\",INDIRECT(CONCATENATE($B257,\"!Q20\")))","v":""},{"$f":"IF(ISERROR(INDIRECT(CONCATENATE($B257,\"!Q21\"))),\"\",INDIRECT(CONCATENATE($B257,\"!Q1\")))","v":""}]
[]
[]
[]
[]
[]
[]
[]
[]
[]
[]
[]
[]
[]
[]
[]
[]
[]
[]
[]
[]
[]
[]
[]
[]
[]
[]
[]
[]
[]
[]
[]
[]
[]
[]
[]
[]
[]
[]
[]
["RURAL",null,null,"Poorest",null,null,null,null,"Poor",null,null,null,null,"Middle",null,null,null,null,"Rich",null,null,null,null,"Richest"]
[null,null,null,"Improved","Basic","Limited","Unimproved","Surface water","Improved","Basic","Limited","Unimproved","Surface water","Improved","Basic","Limited","Unimproved","Surface water","Improved","Basic","Limited","Unimproved","Surface water","Improved","Basic","Limited","Unimproved","Surface water"]
["Forecast period:",null,2009,{"$f":"IF((D301+H301)>100,D301*100/(D301+H301),D301)","v":66.860208049819477},{"$f":"D299*AVERAGEIF(E305:E316,\">0\")/100","v":66.592767217620192},{"$f":"D299*(100-AVERAGEIF(E305:E316,\">0\"))/100","v":0.26744083219928172},{"$f":"100-(E299+F299+H299)","v":26.139408922803895},{"$f":"IF((D301+H301)>100,H301*100/(D301+H301),H301)","v":7.0003830273766221},{"$f":"IF((I301+M301)>100,I301*100/(I301+M301),I301)","v":91.243012954869911},{"$f":"I299*AVERAGEIF(J305:J316,\">0\")/100","v":91.243012954869926},{"$f":"I299*(100-AVERAGEIF(J305:J316,\">0\"))/100","v":0},{"$f":"100-(J299+K299+M299)","v":6.0102361724760698},{"$f":"IF((I301+M301)>100,M301*100/(I301+M301),M301)","v":2.7467508726540091},{"$f":"IF((N301+R301)>100,N301*100/(N301+R301),N301)","v":98.464995524380655},{"$f":"N299*AVERAGEIF(O305:O316,\">0\")/100","v":98.46499552438064},{"$f":"N299*(100-AVERAGEIF(O305:O316,\">0\"))/100","v":0},{"$f":"100-(O299+P299+R299)","v":1.1557258797872976},{"$f":"IF((N301+R301)>100,R301*100/(N301+R301),R301)","v":0.37927859583206092},{"$f":"IF((S301+W301)>100,S301*100/(S301+W301),S301)","v":99.303349479584639},{"$f":"S299*AVERAGEIF(T305:T316,\">0\")/100","v":99.303349479584625},{"$f":"S299*(100-AVERAGEIF(T305:T316,\">0\"))/100","v":0},{"$f":"100-(T299+U299+W299)","v":0.65957690843082162},{"$f":"IF((S301+W301)>100,W301*100/(S301+W301),W301)","v":3.707361198454779E-2},{"$f":"IF((X301+AB301)>100,X301*100/(X301+AB301),X301)","v":99.150752806151729},{"$f":"X299*AVERAGEIF(Y305:Y316,\">0\")/100","v":99.150752806151729},{"$f":"X299*(100-AVERAGEIF(Y305:Y316,\">0\"))/100","v":0},{"$f":"100-(Y299+Z299+AB299)","v":0.84924719384827085},{"$f":"IF((X301+AB301)>100,AB301*100/(X301+AB301),AB301)","v":0}]
[null,null,2017,{"$f":"IF((D302+H302)>100,D302*100/(D302+H302),D302)","v":66.860208049819477},{"$f":"D300*AVERAGEIF(E305:E316,\">0\")/100","v":66.592767217620192},{"$f":"D300*(100-AVERAGEIF(E305:E316,\">0\"))/100","v":0.26744083219928172},{"$f":"100-(E300+F300+H300)","v":26.139408922803895},{"$f":"IF((D302+H302)>100,H302*100/(D302+H302),H302)","v":7.0003830273766221},{"$f":"IF((I302+M302)>100,I302*100/(I302+M302),I302)","v":91.243012954869911},{"$f":"I300*AVERAGEIF(J305:J316,\">0\")/100","v":91.243012954869926},{"$f":"I300*(100-AVERAGEIF(J305:J316,\">0\"))/100","v":0},{"$f":"100-(J300+K300+M300)","v":6.0102361724760698},{"$f":"IF((I302+M302)>100,M302*100/(I302+M302),M302)","v":2.7467508726540091},{"$f":"IF((N302+R302)>100,N302*100/(N302+R302),N302)","v":98.464995524380655},{"$f":"N300*AVERAGEIF(O305:O316,\">0\")/100","v":98.46499552438064},{"$f":"N300*(100-AVERAGEIF(O305:O316,\">0\"))/100","v":0},{"$f":"100-(O300+P300+R300)","v":1.1557258797872976},{"$f":"IF((N302+R302)>100,R302*100/(N302+R302),R302)","v":0.37927859583206092},{"$f":"IF((S302+W302)>100,S302*100/(S302+W302),S302)","v":99.303349479584639},{"$f":"S300*AVERAGEIF(T305:T316,\">0\")/100","v":99.303349479584625},{"$f":"S300*(100-AVERAGEIF(T305:T316,\">0\"))/100","v":0},{"$f":"100-(T300+U300+W300)","v":0.65957690843082162},{"$f":"IF((S302+W302)>100,W302*100/(S302+W302),W302)","v":3.707361198454779E-2},{"$f":"IF((X302+AB302)>100,X302*100/(X302+AB302),X302)","v":99.150752806151729},{"$f":"X300*AVERAGEIF(Y305:Y316,\">0\")/100","v":99.150752806151729},{"$f":"X300*(100-AVERAGEIF(Y305:Y316,\">0\"))/100","v":0},{"$f":"100-(Y300+Z300+AB300)","v":0.84924719384827085},{"$f":"IF((X302+AB302)>100,AB302*100/(X302+AB302),AB302)","v":0}]
["Regression period:",null,{"$f":"MinRegYear(C299,C305:C316)","v":2011},{"$f":"IF(MAX(C305:C316)-MIN(C305:C316)<5,AVERAGEIF(C305:C316,\">0\",D305:D316),\nIF(FORECAST($C301,D$305:D$316,$C$305:$C$316)<0,0,\nIF(FORECAST($C301,D$305:D$316,$C$305:$C$316)>100,100,\nFORECAST($C301,D$305:D$316,$C$305:$C$316))))","v":66.860208049819477},null,null,null,{"$f":"IF(MAX(C305:C316)-MIN(C305:C316)<5,AVERAGEIF(C305:C316,\">0\",H305:H316),\nIF(FORECAST($C301,H$305:H$316,$C$305:$C$316)<0,0,\nIF(FORECAST($C301,H$305:H$316,$C$305:$C$316)>100,100,\nFORECAST($C301,H$305:H$316,$C$305:$C$316))))","v":7.0003830273766221},{"$f":"IF(MAX(C305:C316)-MIN(C305:C316)<5,AVERAGEIF(C305:C316,\">0\",I305:I316),\nIF(FORECAST($C301,I$305:I$316,$C$305:$C$316)<0,0,\nIF(FORECAST($C301,I$305:I$316,$C$305:$C$316)>100,100,\nFORECAST($C301,I$305:I$316,$C$305:$C$316))))","v":91.243012954869911},null,null,null,{"$f":"IF(MAX(C305:C316)-MIN(C305:C316)<5,AVERAGEIF(C305:C316,\">0\",M305:M316),\nIF(FORECAST($C301,M$305:M$316,$C$305:$C$316)<0,0,\nIF(FORECAST($C301,M$305:M$316,$C$305:$C$316)>100,100,\nFORECAST($C301,M$305:M$316,$C$305:$C$316))))","v":2.7467508726540091},{"$f":"IF(MAX(C305:C316)-MIN(C305:C316)<5,AVERAGEIF(C305:C316,\">0\",N305:N316),\nIF(FORECAST($C301,N$305:N$316,$C$305:$C$316)<0,0,\nIF(FORECAST($C301,N$305:N$316,$C$305:$C$316)>100,100,\nFORECAST($C301,N$305:N$316,$C$305:$C$316))))","v":98.464995524380655},null,null,null,{"$f":"IF(MAX(C305:C316)-MIN(C305:C316)<5,AVERAGEIF(C305:C316,\">0\",R305:R316),\nIF(FORECAST($C301,R$305:R$316,$C$305:$C$316)<0,0,\nIF(FORECAST($C301,R$305:R$316,$C$305:$C$316)>100,100,\nFORECAST($C301,R$305:R$316,$C$305:$C$316))))","v":0.37927859583206092},{"$f":"IF(MAX(C305:C316)-MIN(C305:C316)<5,AVERAGEIF(C305:C316,\">0\",S305:S316),\nIF(FORECAST($C301,S$305:S$316,$C$305:$C$316)<0,0,\nIF(FORECAST($C301,S$305:S$316,$C$305:$C$316)>100,100,\nFORECAST($C301,S$305:S$316,$C$305:$C$316))))","v":99.303349479584639},null,null,null,{"$f":"IF(MAX(C305:C316)-MIN(C305:C316)<5,AVERAGEIF(C305:C316,\">0\",W305:W316),\nIF(FORECAST($C301,W$305:W$316,$C$305:$C$316)<0,0,\nIF(FORECAST($C301,W$305:W$316,$C$305:$C$316)>100,100,\nFORECAST($C301,W$305:W$316,$C$305:$C$316))))","v":3.707361198454779E-2},{"$f":"IF(MAX(C305:C316)-MIN(C305:C316)<5,AVERAGEIF(C305:C316,\">0\",X305:X316),\nIF(FORECAST($C301,X$305:X$316,$C$305:$C$316)<0,0,\nIF(FORECAST($C301,X$305:X$316,$C$305:$C$316)>100,100,\nFORECAST($C301,X$305:X$316,$C$305:$C$316))))","v":99.150752806151729},null,null,null,{"$f":"IF(MAX(C305:C316)-MIN(C305:C316)<5,AVERAGEIF(C305:C316,\">0\",AB305:AB316),\nIF(FORECAST($C301,AB$305:AB$316,$C$305:$C$316)<0,0,\nIF(FORECAST($C301,AB$305:AB$316,$C$305:$C$316)>100,100,\nFORECAST($C301,AB$305:AB$316,$C$305:$C$316))))","v":0}]
[null,null,{"$f":"MaxRegYear(C300,C305:C316)","v":2015},{"$f":"IF(MAX(C305:C316)-MIN(C305:C316)<5,AVERAGEIF(C305:C316,\">0\",D305:D316),\nIF(FORECAST($C302,D$305:D$316,$C$305:$C$316)<0,0,\nIF(FORECAST($C302,D$305:D$316,$C$305:$C$316)>100,100,\nFORECAST($C302,D$305:D$316,$C$305:$C$316))))","v":66.860208049819477},null,null,null,{"$f":"IF(MAX(C305:C316)-MIN(C305:C316)<5,AVERAGEIF(C305:C316,\">0\",H305:H316),\nIF(FORECAST($C302,H$305:H$316,$C$305:$C$316)<0,0,\nIF(FORECAST($C302,H$305:H$316,$C$305:$C$316)>100,100,\nFORECAST($C302,H$305:H$316,$C$305:$C$316))))","v":7.0003830273766221},{"$f":"IF(MAX(C305:C316)-MIN(C305:C316)<5,AVERAGEIF(C305:C316,\">0\",I305:I316),\nIF(FORECAST($C302,I$305:I$316,$C$305:$C$316)<0,0,\nIF(FORECAST($C302,I$305:I$316,$C$305:$C$316)>100,100,\nFORECAST($C302,I$305:I$316,$C$305:$C$316))))","v":91.243012954869911},null,null,null,{"$f":"IF(MAX(C305:C316)-MIN(C305:C316)<5,AVERAGEIF(C305:C316,\">0\",M305:M316),\nIF(FORECAST($C302,M$305:M$316,$C$305:$C$316)<0,0,\nIF(FORECAST($C302,M$305:M$316,$C$305:$C$316)>100,100,\nFORECAST($C302,M$305:M$316,$C$305:$C$316))))","v":2.7467508726540091},{"$f":"IF(MAX(C305:C316)-MIN(C305:C316)<5,AVERAGEIF(C305:C316,\">0\",N305:N316),\nIF(FORECAST($C302,N$305:N$316,$C$305:$C$316)<0,0,\nIF(FORECAST($C302,N$305:N$316,$C$305:$C$316)>100,100,\nFORECAST($C302,N$305:N$316,$C$305:$C$316))))","v":98.464995524380655},null,null,null,{"$f":"IF(MAX(C305:C316)-MIN(C305:C316)<5,AVERAGEIF(C305:C316,\">0\",R305:R316),\nIF(FORECAST($C302,R$305:R$316,$C$305:$C$316)<0,0,\nIF(FORECAST($C302,R$305:R$316,$C$305:$C$316)>100,100,\nFORECAST($C302,R$305:R$316,$C$305:$C$316))))","v":0.37927859583206092},{"$f":"IF(MAX(C305:C316)-MIN(C305:C316)<5,AVERAGEIF(C305:C316,\">0\",S305:S316),\nIF(FORECAST($C302,S$305:S$316,$C$305:$C$316)<0,0,\nIF(FORECAST($C302,S$305:S$316,$C$305:$C$316)>100,100,\nFORECAST($C302,S$305:S$316,$C$305:$C$316))))","v":99.303349479584639},null,null,null,{"$f":"IF(MAX(C305:C316)-MIN(C305:C316)<5,AVERAGEIF(C305:C316,\">0\",W305:W316),\nIF(FORECAST($C302,W$305:W$316,$C$305:$C$316)<0,0,\nIF(FORECAST($C302,W$305:W$316,$C$305:$C$316)>100,100,\nFORECAST($C302,W$305:W$316,$C$305:$C$316))))","v":3.707361198454779E-2},{"$f":"IF(MAX(C305:C316)-MIN(C305:C316)<5,AVERAGEIF(C305:C316,\">0\",X305:X316),\nIF(FORECAST($C302,X$305:X$316,$C$305:$C$316)<0,0,\nIF(FORECAST($C302,X$305:X$316,$C$305:$C$316)>100,100,\nFORECAST($C302,X$305:X$316,$C$305:$C$316))))","v":99.150752806151729},null,null,null,{"$f":"IF(MAX(C305:C316)-MIN(C305:C316)<5,AVERAGEIF(C305:C316,\">0\",AB305:AB316),\nIF(FORECAST($C302,AB$305:AB$316,$C$305:$C$316)<0,0,\nIF(FORECAST($C302,AB$305:AB$316,$C$305:$C$316)>100,100,\nFORECAST($C302,AB$305:AB$316,$C$305:$C$316))))","v":0}]
[]
[null,"Survey","Year","Improved","% Improved\n< = 30min",null,null,"Surface water","Improved","% Improved\n< = 30min",null,null,"Surface water","Improved","% Improved\n< = 30min",null,null,"Surface water","Improved","% Improved\n< = 30min",null,null,"Surface water","Improved","% Improved\n< = 30min",null,null,"Surface water"]
[null,"MICS13",2013,{"$f":"IF(ISERROR(INDIRECT(CONCATENATE($B305,\"!M16\"))),\"\",INDIRECT(CONCATENATE($B305,\"!M16\")))","v":66.860208049819477},{"$f":"IF(ISERROR(INDIRECT(CONCATENATE($B305,\"!M23\"))),\"\",INDIRECT(CONCATENATE($B305,\"!M23\")))","v":99.6},null,null,{"$f":"IF(ISERROR(INDIRECT(CONCATENATE($B305,\"!M21\"))),\"\",INDIRECT(CONCATENATE($B305,\"!M21\")))","v":7.0003830273766221},{"$f":"IF(ISERROR(INDIRECT(CONCATENATE($B305,\"!N16\"))),\"\",INDIRECT(CONCATENATE($B305,\"!N16\")))","v":91.243012954869911},{"$f":"IF(ISERROR(INDIRECT(CONCATENATE($B305,\"!N23\"))),\"\",INDIRECT(CONCATENATE($B305,\"!N23\")))","v":100},null,null,{"$f":"IF(ISERROR(INDIRECT(CONCATENATE($B305,\"!N21\"))),\"\",INDIRECT(CONCATENATE($B305,\"!N21\")))","v":2.7467508726540091},{"$f":"IF(ISERROR(INDIRECT(CONCATENATE($B305,\"!O16\"))),\"\",INDIRECT(CONCATENATE($B305,\"!O16\")))","v":98.464995524380655},{"$f":"IF(ISERROR(INDIRECT(CONCATENATE($B305,\"!O23\"))),\"\",INDIRECT(CONCATENATE($B305,\"!O23\")))","v":100},null,null,{"$f":"IF(ISERROR(INDIRECT(CONCATENATE($B305,\"!O21\"))),\"\",INDIRECT(CONCATENATE($B305,\"!O21\")))","v":0.37927859583206092},{"$f":"IF(ISERROR(INDIRECT(CONCATENATE($B305,\"!P16\"))),\"\",INDIRECT(CONCATENATE($B305,\"!P16\")))","v":99.303349479584639},{"$f":"IF(ISERROR(INDIRECT(CONCATENATE($B305,\"!P23\"))),\"\",INDIRECT(CONCATENATE($B305,\"!P23\")))","v":100},null,null,{"$f":"IF(ISERROR(INDIRECT(CONCATENATE($B305,\"!P21\"))),\"\",INDIRECT(CONCATENATE($B305,\"!P21\")))","v":3.707361198454779E-2},{"$f":"IF(ISERROR(INDIRECT(CONCATENATE($B305,\"!Q16\"))),\"\",INDIRECT(CONCATENATE($B305,\"!Q16\")))","v":99.150752806151729},{"$f":"IF(ISERROR(INDIRECT(CONCATENATE($B305,\"!Q23\"))),\"\",INDIRECT(CONCATENATE($B305,\"!Q23\")))","v":100},null,null,{"$f":"IF(ISERROR(INDIRECT(CONCATENATE($B305,\"!Q221\"))),\"\",INDIRECT(CONCATENATE($B305,\"!Q21\")))","v":0}]
[null,null,null,"","",null,null,"","","",null,null,"","","",null,null,"","","",null,null,"","","",null,null,""]
[null,null,null,"","",null,null,"","","",null,null,"","","",null,null,"","","",null,null,"","","",null,null,""]
[null,null,null,"","",null,null,"","","",null,null,"","","",null,null,"","","",null,null,"","","",null,null,""]
[null,null,null,"","",null,null,"","","",null,null,"","","",null,null,"","","",null,null,"","","",null,null,""]
[null,null,null,"","",null,null,"","","",null,null,"","","",null,null,"","","",null,null,"","","",null,null,""]
[null,null,null,"","",null,null,"","","",null,null,"","","",null,null,"","","",null,null,"","","",null,null,""]
[null,null,null,"","",null,null,"","","",null,null,"","","",null,null,"","","",null,null,"","","",null,null,""]
[null,null,null,"","",null,null,"","","",null,null,"","","",null,null,"","","",null,null,"","","",null,null,""]
[null,null,null,"","",null,null,"","","",null,null,"","","",null,null,"","","",null,null,"","","",null,null,""]
[null,null,null,"","",null,null,"","","",null,null,"","","",null,null,"","","",null,null,"","","",null,null,""]
[null,null,null,"","",null,null,"","","",null,null,"","","",null,null,"","","",null,null,"","","",null,null,""]
[]
[null,{"$f":"CONCATENATE(\"Rural use of drinking water sources, \",C299,\"–\",C300)","v":"Rural use of drinking water sources, 2009–2017"},null,null,null,null,null,null,null,null,null,null,null,null,null,null,null,null,"Data points used for regression"]

{"sheet":"Sanitation","index":2,"n_rows":318,"n_cols":28,"rows_kept":318,"cut":false,"hidden":false,"merged":[[30,21,30,24],[4,1,4,24],[3,1,3,24],[6,1,6,8],[6,9,6,16],[6,17,6,24],[30,1,31,4],[30,5,30,8],[30,9,30,12],[30,13,30,16],[30,17,30,20],[96,23,96,27],[32,1,33,2],[32,3,33,3],[35,1,36,2],[35,3,36,3],[38,1,39,2],[38,3,39,3],[96,0,97,2],[96,3,96,7],[96,8,96,12],[96,13,96,17],[96,18,96,22],[98,0,99,1],[100,0,101,1],[117,18,117,22],[196,0,197,2],[196,3,196,7],[196,8,196,12],[196,13,196,17],[196,18,196,22],[117,1,117,11],[298,0,299,1],[300,0,301,1],[317,18,317,22],[196,23,196,27],[198,0,199,1],[200,0,201,1],[217,18,217,22],[296,0,297,2],[296,3,296,7],[296,8,296,12],[296,13,296,17],[296,18,296,22],[296,23,296,27],[217,1,217,11],[317,1,317,11]]}
[]
[]
[]
[null,"Summary of trends in use of sanitation facilities by wealth quintile (%)"]
[null,{"$f":"IF(ISERROR(INDIRECT(CONCATENATE($B105,\"!A2\"))),\"\",INDIRECT(CONCATENATE($B105,\"!A2\")))","v":"Panama"}]
[]
[null,{"$f":"B118","v":"National use of sanitation facilities, 2009–2017"},null,null,null,null,null,null,null,{"$f":"B218","v":"Urban use of sanitation facilities, 2009–2017"},null,null,null,null,null,null,null,{"$f":"B318","v":"Rural use of sanitation facilities, 2009–2017"}]
[]
[]
[]
[]
[]
[]
[]
[]
[]
[]
[]
[]
[]
[]
[]
[]
[]
[]
[]
[]
[]
[]
[]
[null,{"$f":"IF(ISERROR(INDIRECT(CONCATENATE($B105,\"!A2\"))),\"\",INDIRECT(CONCATENATE($B105,\"!A2\")))","v":"Panama"},null,null,null,"Poorest",null,null,null,"Poor",null,null,null,"Middle",null,null,null,"Rich",null,null,null,"Richest"]
[null,null,null,null,null,"Basic","Limited","Unimproved","Open defecation","Basic","Limited","Unimproved","Open defecation","Basic","Limited","Unimproved","Open defecation","Basic","Limited","Unimproved","Open defecation","Basic","Limited","Unimproved","Open defecation"]
[null,"NATIONAL",null,"Estimate",{"$f":"C99","v":2009},{"$f":"E99","v":52.707319464783353},{"$f":"F99","v":9.2908254373946271},27.740283952145873,10.26157114567614,{"$f":"J99","v":78.239458083864363},{"$f":"K99","v":8.9939819452288194},12.448196625815584,0.31836334509123515,{"$f":"O99","v":90.496212871450695},{"$f":"P99","v":4.9167345489212941},4.5537288113204113,3.332376830759351E-2,{"$f":"T99","v":94.678550106594116},{"$f":"U99","v":2.3997751000393253},2.8516897508168313,6.998504254972851E-2,{"$f":"Y99","v":99.057350801703421},{"$f":"Z99","v":0.70387262217531754},0.23877657612126768,0]
[null,null,null,null,{"$f":"C100","v":2017},{"$f":"E100","v":52.707319464783353},9.2908254373946271,27.740283952145873,10.26157114567614,{"$f":"J100","v":78.239458083864363},8.9939819452288194,12.448196625815584,0.31836334509123515,{"$f":"O100","v":90.496212871450695},4.9167345489212941,4.5537288113204113,3.332376830759351E-2,{"$f":"T100","v":94.678550106594116},2.3997751000393253,2.8516897508168313,6.998504254972851E-2,{"$f":"Y100","v":99.057350801703421},0.70387262217531754,0.23877657612126768,0]
[]
[null,"URBAN",null,"Estimate",{"$f":"C199","v":2009},{"$f":"E199","v":72.001787277266828},{"$f":"F199","v":12.49643316662371},14.68334457378549,0.81843498232395884,{"$f":"J199","v":89.400376344627105},{"$f":"K199","v":5.9963472920041463},4.5653354936989388,3.794086966980692E-2,{"$f":"O199","v":94.145830307165966},{"$f":"P199","v":2.4439483163551152},3.4102213764789155,0,{"$f":"T199","v":96.169135700869177},{"$f":"U199","v":3.1163856884893271},0.71447861064149265,0,{"$f":"Y199","v":99.920463585531394},{"$f":"Z199","v":7.9536414468535044E-2},0,0]
[null,null,null,null,{"$f":"C200","v":2017},{"$f":"E200","v":72.001787277266828},12.49643316662371,14.68334457378549,0.81843498232395884,{"$f":"J200","v":89.400376344627105},5.9963472920041463,4.5653354936989388,3.794086966980692E-2,{"$f":"O200","v":94.145830307165966},2.4439483163551152,3.4102213764789155,0,{"$f":"T200","v":96.169135700869177},3.1163856884893271,0.71447861064149265,0,{"$f":"Y200","v":99.920463585531394},7.9536414468535044E-2,0,0]
[]
[null,"RURAL",null,"Estimate",{"$f":"C299","v":2009},{"$f":"E299","v":32.147429410352721},{"$f":"F299","v":7.7712023720306274},33.116353968441629,26.965014249175024,{"$f":"J299","v":61.92697750892998},{"$f":"K299","v":6.1271098746675294},27.654936932929758,4.2909756834727339,{"$f":"O299","v":71.171623755138341},{"$f":"P299","v":6.2889078633522368},21.73168674783507,0.80778163367434541,{"$f":"T299","v":73.915626749729313},{"$f":"U299","v":8.7494981075277014},16.288235334638145,1.04663980810484,{"$f":"Y299","v":91.183493539332218},{"$f":"Z299","v":3.1828463928936368},5.4024539419700659,0.23120612580407743]
[null,null,null,null,{"$f":"C300","v":2017},{"$f":"E300","v":32.147429410352721},7.7712023720306274,33.116353968441629,26.965014249175024,{"$f":"J300","v":61.92697750892998},6.1271098746675294,27.654936932929758,4.2909756834727339,{"$f":"O300","v":71.171623755138341},6.2889078633522368,21.73168674783507,0.80778163367434541,{"$f":"T300","v":73.915626749729313},8.7494981075277014,16.288235334638145,1.04663980810484,{"$f":"Y300","v":91.183493539332218},3.1828463928936368,5.4024539419700659,0.23120612580407743]
[]
[]
[]
[]
[]
[]
[]
[]
[]
[]
[]
[]
[]
[]
[]
[]
[]
[]
[]
[]
[]
[]
[]
[]
[]
[]
[]
[]
[]
[]
[]
[]
[]
[]
[]
[]
[]
[]
[]
[]
[]
[]
[]
[]
[]
[]
[]
[]
[]
[]
[]
[]
[]
[]
[]
[]
["NATIONAL",null,null,"Poorest",null,null,null,null,"Poor",null,null,null,null,"Middle",null,null,null,null,"Rich",null,null,null,null,"Richest"]
[null,null,null,"Improved","Basic","Limited","Unimproved","Open defecation","Improved","Basic","Limited","Unimproved","Open defecation","Improved","Basic","Limited","Unimproved","Open defecation","Improved","Basic","Limited","Unimproved","Open defecation","Improved","Basic","Limited","Unimproved","Open defecation"]
["Forecast period:",null,{"$f":"MinBase(C105:C116)","v":2009},{"$f":"IF((D101+H101)>100,D101*100/(D101+H101),D101)","v":61.998144902177977},{"$f":"D99*AVERAGEIF(E105:E116,\">0\")/100","v":52.707319464783353},{"$f":"D99*(100-AVERAGEIF(E105:E116,\">0\"))/100","v":9.2908254373946271},{"$f":"100-(E99+F99+H99)","v":27.740283952145873},{"$f":"IF((D101+H101)>100,H101*100/(D101+H101),H101)","v":10.26157114567614},{"$f":"IF((I101+M101)>100,I101*100/(I101+M101),I101)","v":87.233440029093188},{"$f":"I99*AVERAGEIF(J105:J116,\">0\")/100","v":78.239458083864363},{"$f":"I99*(100-AVERAGEIF(J105:J116,\">0\"))/100","v":8.9939819452288194},{"$f":"100-(J99+K99+M99)","v":12.448196625815584},{"$f":"IF((I101+M101)>100,M101*100/(I101+M101),M101)","v":0.31836334509123515},{"$f":"IF((N101+R101)>100,N101*100/(N101+R101),N101)","v":95.412947420371992},{"$f":"N99*AVERAGEIF(O105:O116,\">0\")/100","v":90.496212871450695},{"$f":"N99*(100-AVERAGEIF(O105:O116,\">0\"))/100","v":4.9167345489212941},{"$f":"100-(O99+P99+R99)","v":4.5537288113204113},{"$f":"IF((N101+R101)>100,R101*100/(N101+R101),R101)","v":3.332376830759351E-2},{"$f":"IF((S101+W101)>100,S101*100/(S101+W101),S101)","v":97.078325206633451},{"$f":"S99*AVERAGEIF(T105:T116,\">0\")/100","v":94.678550106594116},{"$f":"S99*(100-AVERAGEIF(T105:T116,\">0\"))/100","v":2.3997751000393253},{"$f":"100-(T99+U99+W99)","v":2.8516897508168313},{"$f":"IF((S101+W101)>100,W101*100/(S101+W101),W101)","v":6.998504254972851E-2},{"$f":"IF((X101+AB101)>100,X101*100/(X101+AB101),X101)","v":99.761223423878732},{"$f":"X99*AVERAGEIF(Y105:Y116,\">0\")/100","v":99.057350801703421},{"$f":"X99*(100-AVERAGEIF(Y105:Y116,\">0\"))/100","v":0.70387262217531754},{"$f":"100-(Y99+Z99+AB99)","v":0.23877657612126768},{"$f":"IF((X101+AB101)>100,AB101*100/(X101+AB101),AB101)","v":0}]
[null,null,{"$f":"MaxTarget(C105:C116)","v":2017},{"$f":"IF((D102+H102)>100,D102*100/(D102+H102),D102)","v":61.998144902177977},{"$f":"D100*AVERAGEIF(E105:E116,\">0\")/100","v":52.707319464783353},{"$f":"D100*(100-AVERAGEIF(E105:E116,\">0\"))/100","v":9.2908254373946271},{"$f":"100-(E100+F100+H100)","v":27.740283952145873},{"$f":"IF((D102+H102)>100,H102*100/(D102+H102),H102)","v":10.26157114567614},{"$f":"IF((I102+M102)>100,I102*100/(I102+M102),I102)","v":87.233440029093188},{"$f":"I100*AVERAGEIF(J105:J116,\">0\")/100","v":78.239458083864363},{"$f":"I100*(100-AVERAGEIF(J105:J116,\">0\"))/100","v":8.9939819452288194},{"$f":"100-(J100+K100+M100)","v":12.448196625815584},{"$f":"IF((I102+M102)>100,M102*100/(I102+M102),M102)","v":0.31836334509123515},{"$f":"IF((N102+R102)>100,N102*100/(N102+R102),N102)","v":95.412947420371992},{"$f":"N100*AVERAGEIF(O105:O116,\">0\")/100","v":90.496212871450695},{"$f":"N100*(100-AVERAGEIF(O105:O116,\">0\"))/100","v":4.9167345489212941},{"$f":"100-(O100+P100+R100)","v":4.5537288113204113},{"$f":"IF((N102+R102)>100,R102*100/(N102+R102),R102)","v":3.332376830759351E-2},{"$f":"IF((S102+W102)>100,S102*100/(S102+W102),S102)","v":97.078325206633451},{"$f":"S100*AVERAGEIF(T105:T116,\">0\")/100","v":94.678550106594116},{"$f":"S100*(100-AVERAGEIF(T105:T116,\">0\"))/100","v":2.3997751000393253},{"$f":"100-(T100+U100+W100)","v":2.8516897508168313},{"$f":"IF((S102+W102)>100,W102*100/(S102+W102),W102)","v":6.998504254972851E-2},{"$f":"IF((X102+AB102)>100,X102*100/(X102+AB102),X102)","v":99.761223423878732},{"$f":"X100*AVERAGEIF(Y105:Y116,\">0\")/100","v":99.057350801703421},{"$f":"X100*(100-AVERAGEIF(Y105:Y116,\">0\"))/100","v":0.70387262217531754},{"$f":"100-(Y100+Z100+AB100)","v":0.23877657612126768},{"$f":"IF((X102+AB102)>100,AB102*100/(X102+AB102),AB102)","v":0}]
["Regression period:",null,{"$f":"MinRegYear(C99,C105:C116)","v":2011},{"$f":"IF(MAX(C105:C116)-MIN(C105:C116)<5,AVERAGEIF(C105:C116,\">0\",D105:D116),\nIF(FORECAST($C101,D$105:D$116,$C$105:$C$116)<0,0,\nIF(FORECAST($C101,D$105:D$116,$C$105:$C$116)>100,100,\nFORECAST($C101,D$105:D$116,$C$105:$C$116))))","v":61.998144902177977},null,null,null,{"$f":"IF(MAX(C105:C116)-MIN(C105:C116)<5,AVERAGEIF(C105:C116,\">0\",H105:H116),\nIF(FORECAST($C101,H$105:H$116,$C$105:$C$116)<0,0,\nIF(FORECAST($C101,H$105:H$116,$C$105:$C$116)>100,100,\nFORECAST($C101,H$105:H$116,$C$105:$C$116))))","v":10.26157114567614},{"$f":"IF(MAX(C105:C116)-MIN(C105:C116)<5,AVERAGEIF(C105:C116,\">0\",I105:I116),\nIF(FORECAST($C101,I$105:I$116,$C$105:$C$116)<0,0,\nIF(FORECAST($C101,I$105:I$116,$C$105:$C$116)>100,100,\nFORECAST($C101,I$105:I$116,$C$105:$C$116))))","v":87.233440029093188},null,null,null,{"$f":"IF(MAX(C105:C116)-MIN(C105:C116)<5,AVERAGEIF(C105:C116,\">0\",M105:M116),\nIF(FORECAST($C101,M$105:M$116,$C$105:$C$116)<0,0,\nIF(FORECAST($C101,M$105:M$116,$C$105:$C$116)>100,100,\nFORECAST($C101,M$105:M$116,$C$105:$C$116))))","v":0.31836334509123515},{"$f":"IF(MAX(C105:C116)-MIN(C105:C116)<5,AVERAGEIF(C105:C116,\">0\",N105:N116),\nIF(FORECAST($C101,N$105:N$116,$C$105:$C$116)<0,0,\nIF(FORECAST($C101,N$105:N$116,$C$105:$C$116)>100,100,\nFORECAST($C101,N$105:N$116,$C$105:$C$116))))","v":95.412947420371992},null,null,null,{"$f":"IF(MAX(C105:C116)-MIN(C105:C116)<5,AVERAGEIF(C105:C116,\">0\",R105:R116),\nIF(FORECAST($C101,R$105:R$116,$C$105:$C$116)<0,0,\nIF(FORECAST($C101,R$105:R$116,$C$105:$C$116)>100,100,\nFORECAST($C101,R$105:R$116,$C$105:$C$116))))","v":3.332376830759351E-2},{"$f":"IF(MAX(C105:C116)-MIN(C105:C116)<5,AVERAGEIF(C105:C116,\">0\",S105:S116),\nIF(FORECAST($C101,S$105:S$116,$C$105:$C$116)<0,0,\nIF(FORECAST($C101,S$105:S$116,$C$105:$C$116)>100,100,\nFORECAST($C101,S$105:S$116,$C$105:$C$116))))","v":97.078325206633451},null,null,null,{"$f":"IF(MAX(C105:C116)-MIN(C105:C116)<5,AVERAGEIF(C105:C116,\">0\",W105:W116),\nIF(FORECAST($C101,W$105:W$116,$C$105:$C$116)<0,0,\nIF(FORECAST($C101,W$105:W$116,$C$105:$C$116)>100,100,\nFORECAST($C101,W$105:W$116,$C$105:$C$116))))","v":6.998504254972851E-2},{"$f":"IF(MAX(C105:C116)-MIN(C105:C116)<5,AVERAGEIF(C105:C116,\">0\",X105:X116),\nIF(FORECAST($C101,X$105:X$116,$C$105:$C$116)<0,0,\nIF(FORECAST($C101,X$105:X$116,$C$105:$C$116)>100,100,\nFORECAST($C101,X$105:X$116,$C$105:$C$116))))","v":99.761223423878732},null,null,null,{"$f":"IF(MAX(C105:C116)-MIN(C105:C116)<5,AVERAGEIF(C105:C116,\">0\",AB105:AB116),\nIF(FORECAST($C101,AB$105:AB$116,$C$105:$C$116)<0,0,\nIF(FORECAST($C101,AB$105:AB$116,$C$105:$C$116)>100,100,\nFORECAST($C101,AB$105:AB$116,$C$105:$C$116))))","v":0}]
[null,null,{"$f":"MaxRegYear(C100,C105:C116)","v":2015},{"$f":"IF(MAX(C105:C116)-MIN(C105:C116)<5,AVERAGEIF(C105:C116,\">0\",D105:D116),\nIF(FORECAST($C102,D$105:D$116,$C$105:$C$116)<0,0,\nIF(FORECAST($C102,D$105:D$116,$C$105:$C$116)>100,100,\nFORECAST($C102,D$105:D$116,$C$105:$C$116))))","v":61.998144902177977},null,null,null,{"$f":"IF(MAX(C105:C116)-MIN(C105:C116)<5,AVERAGEIF(C105:C116,\">0\",H105:H116),\nIF(FORECAST($C102,H$105:H$116,$C$105:$C$116)<0,0,\nIF(FORECAST($C102,H$105:H$116,$C$105:$C$116)>100,100,\nFORECAST($C102,H$105:H$116,$C$105:$C$116))))","v":10.26157114567614},{"$f":"IF(MAX(C105:C116)-MIN(C105:C116)<5,AVERAGEIF(C105:C116,\">0\",I105:I116),\nIF(FORECAST($C102,I$105:I$116,$C$105:$C$116)<0,0,\nIF(FORECAST($C102,I$105:I$116,$C$105:$C$116)>100,100,\nFORECAST($C102,I$105:I$116,$C$105:$C$116))))","v":87.233440029093188},null,null,null,{"$f":"IF(MAX(C105:C116)-MIN(C105:C116)<5,AVERAGEIF(C105:C116,\">0\",M105:M116),\nIF(FORECAST($C102,M$105:M$116,$C$105:$C$116)<0,0,\nIF(FORECAST($C102,M$105:M$116,$C$105:$C$116)>100,100,\nFORECAST($C102,M$105:M$116,$C$105:$C$116))))","v":0.31836334509123515},{"$f":"IF(MAX(C105:C116)-MIN(C105:C116)<5,AVERAGEIF(C105:C116,\">0\",N105:N116),\nIF(FORECAST($C102,N$105:N$116,$C$105:$C$116)<0,0,\nIF(FORECAST($C102,N$105:N$116,$C$105:$C$116)>100,100,\nFORECAST($C102,N$105:N$116,$C$105:$C$116))))","v":95.412947420371992},null,null,null,{"$f":"IF(MAX(C105:C116)-MIN(C105:C116)<5,AVERAGEIF(C105:C116,\">0\",R105:R116),\nIF(FORECAST($C102,R$105:R$116,$C$105:$C$116)<0,0,\nIF(FORECAST($C102,R$105:R$116,$C$105:$C$116)>100,100,\nFORECAST($C102,R$105:R$116,$C$105:$C$116))))","v":3.332376830759351E-2},{"$f":"IF(MAX(C105:C116)-MIN(C105:C116)<5,AVERAGEIF(C105:C116,\">0\",S105:S116),\nIF(FORECAST($C102,S$105:S$116,$C$105:$C$116)<0,0,\nIF(FORECAST($C102,S$105:S$116,$C$105:$C$116)>100,100,\nFORECAST($C102,S$105:S$116,$C$105:$C$116))))","v":97.078325206633451},null,null,null,{"$f":"IF(MAX(C105:C116)-MIN(C105:C116)<5,AVERAGEIF(C105:C116,\">0\",W105:W116),\nIF(FORECAST($C102,W$105:W$116,$C$105:$C$116)<0,0,\nIF(FORECAST($C102,W$105:W$116,$C$105:$C$116)>100,100,\nFORECAST($C102,W$105:W$116,$C$105:$C$116))))","v":6.998504254972851E-2},{"$f":"IF(MAX(C105:C116)-MIN(C105:C116)<5,AVERAGEIF(C105:C116,\">0\",X105:X116),\nIF(FORECAST($C102,X$105:X$116,$C$105:$C$116)<0,0,\nIF(FORECAST($C102,X$105:X$116,$C$105:$C$116)>100,100,\nFORECAST($C102,X$105:X$116,$C$105:$C$116))))","v":99.761223423878732},null,null,null,{"$f":"IF(MAX(C105:C116)-MIN(C105:C116)<5,AVERAGEIF(C105:C116,\">0\",AB105:AB116),\nIF(FORECAST($C102,AB$105:AB$116,$C$105:$C$116)<0,0,\nIF(FORECAST($C102,AB$105:AB$116,$C$105:$C$116)>100,100,\nFORECAST($C102,AB$105:AB$116,$C$105:$C$116))))","v":0}]
[]
[null,"Survey","Year","Improved","Not shared",null,null,"Open defecation","Improved","Not shared",null,null,"Open defecation","Improved","Not shared",null,null,"Open defecation","Improved","Not shared",null,null,"Open defecation","Improved","Not shared",null,null,"Open defecation"]
[null,"MICS13",2013,{"$f":"IF(ISERROR(INDIRECT(CONCATENATE($B105,\"!C122\"))),\"\",INDIRECT(CONCATENATE($B105,\"!C122\")))","v":61.998144902177977},{"$f":"IF(ISERROR(INDIRECT(CONCATENATE($B105,\"!C129\"))),\"\",INDIRECT(CONCATENATE($B105,\"!C129\")))","v":85.014349296976718},null,null,{"$f":"IF(ISERROR(INDIRECT(CONCATENATE($B105,\"!C127\"))),\"\",INDIRECT(CONCATENATE($B105,\"!C127\")))","v":10.26157114567614},{"$f":"IF(ISERROR(INDIRECT(CONCATENATE($B105,\"!D122\"))),\"\",INDIRECT(CONCATENATE($B105,\"!D122\")))","v":87.233440029093188},{"$f":"IF(ISERROR(INDIRECT(CONCATENATE($B105,\"!D129\"))),\"\",INDIRECT(CONCATENATE($B105,\"!D129\")))","v":89.689754362284418},null,null,{"$f":"IF(ISERROR(INDIRECT(CONCATENATE($B105,\"!D127\"))),\"\",INDIRECT(CONCATENATE($B105,\"!D127\")))","v":0.31836334509123515},{"$f":"IF(ISERROR(INDIRECT(CONCATENATE($B105,\"!E122\"))),\"\",INDIRECT(CONCATENATE($B105,\"!E122\")))","v":95.412947420371992},{"$f":"IF(ISERROR(INDIRECT(CONCATENATE($B105,\"!E129\"))),\"\",INDIRECT(CONCATENATE($B105,\"!E129\")))","v":94.8468895659841},null,null,{"$f":"IF(ISERROR(INDIRECT(CONCATENATE($B105,\"!E127\"))),\"\",INDIRECT(CONCATENATE($B105,\"!E127\")))","v":3.332376830759351E-2},{"$f":"IF(ISERROR(INDIRECT(CONCATENATE($B105,\"!F122\"))),\"\",INDIRECT(CONCATENATE($B105,\"!F122\")))","v":97.078325206633451},{"$f":"IF(ISERROR(INDIRECT(CONCATENATE($B105,\"!F129\"))),\"\",INDIRECT(CONCATENATE($B105,\"!F129\")))","v":97.528001132146287},null,null,{"$f":"IF(ISERROR(INDIRECT(CONCATENATE($B105,\"!F127\"))),\"\",INDIRECT(CONCATENATE($B105,\"!F127\")))","v":6.998504254972851E-2},{"$f":"IF(ISERROR(INDIRECT(CONCATENATE($B105,\"!G122\"))),\"\",INDIRECT(CONCATENATE($B105,\"!G122\")))","v":99.761223423878732},{"$f":"IF(ISERROR(INDIRECT(CONCATENATE($B105,\"!G129\"))),\"\",INDIRECT(CONCATENATE($B105,\"!G129\")))","v":99.294442672194776},null,null,{"$f":"IF(ISERROR(INDIRECT(CONCATENATE($B105,\"!G2127\"))),\"\",INDIRECT(CONCATENATE($B105,\"!G127\")))","v":0}]
[null,null,null,"","",null,null,"","","",null,null,"","","",null,null,"","","",null,null,"","","",null,null,""]
[null,null,null,"","",null,null,"","","",null,null,"","","",null,null,"","","",null,null,"","","",null,null,""]
[null,null,null,"","",null,null,"","","",null,null,"","","",null,null,"","","",null,null,"","","",null,null,""]
[null,null,null,"","",null,null,"","","",null,null,"","","",null,null,"","","",null,null,"","","",null,null,""]
[null,null,null,"","",null,null,"","","",null,null,"","","",null,null,"","","",null,null,"","","",null,null,""]
[null,null,null,"","",null,null,"","","",null,null,"","","",null,null,"","","",null,null,"","","",null,null,""]
[null,null,null,"","",null,null,"","","",null,null,"","","",null,null,"","","",null,null,"","","",null,null,""]
[null,null,null,"","",null,null,"","","",null,null,"","","",null,null,"","","",null,null,"","","",null,null,""]
[null,null,null,"","",null,null,"","","",null,null,"","","",null,null,"","","",null,null,"","","",null,null,""]
[null,null,null,"","",null,null,"","","",null,null,"","","",null,null,"","","",null,null,"","","",null,null,""]
[null,null,null,"","",null,null,"","","",null,null,"","","",null,null,"","","",null,null,"","","",null,null,""]
[]
[null,{"$f":"CONCATENATE(\"National use of sanitation facilities, \",C99,\"–\",C100)","v":"National use of sanitation facilities, 2009–2017"},null,null,null,null,null,null,null,null,null,null,null,null,null,null,null,null,"Data points used for regression"]
[]
[]
[]
[]
[]
[]
[]
[]
[]
[]
[]
[]
[]
[]
[]
[]
[]
[]
[]
[]
[]
[]
[]
[]
[]
[]
[]
[]
[]
[]
[]
[]
[]
[]
[]
[]
[]
[]
[]
[]
[]
[]
[]
[]
[]
[]
[]
[]
[]
[]
[]
[]
[]
[]
[]
[]
[]
[]
[]
[]
[]
[]
[]
[]
[]
[]
[]
[]
[]
[]
[]
[]
[]
[]
[]
[]
[]
[]
["URBAN",null,null,"Poorest",null,null,null,null,"Poor",null,null,null,null,"Middle",null,null,null,null,"Rich",null,null,null,null,"Richest"]
[null,null,null,"Improved","Basic","Limited","Unimproved","Open defecation","Improved","Basic","Limited","Unimproved","Open defecation","Improved","Basic","Limited","Unimproved","Open defecation","Improved","Basic","Limited","Unimproved","Open defecation","Improved","Basic","Limited","Unimproved","Open defecation"]
["Forecast period:",null,{"$f":"MinBase(C205:C216)","v":2009},{"$f":"IF((D201+H201)>100,D201*100/(D201+H201),D201)","v":84.498220443890546},{"$f":"D199*AVERAGEIF(E205:E216,\">0\")/100","v":72.001787277266828},{"$f":"D199*(100-AVERAGEIF(E205:E216,\">0\"))/100","v":12.49643316662371},{"$f":"100-(E199+F199+H199)","v":14.68334457378549},{"$f":"IF((D201+H201)>100,H201*100/(D201+H201),H201)","v":0.81843498232395884},{"$f":"IF((I201+M201)>100,I201*100/(I201+M201),I201)","v":95.396723636631265},{"$f":"I199*AVERAGEIF(J205:J216,\">0\")/100","v":89.400376344627105},{"$f":"I199*(100-AVERAGEIF(J205:J216,\">0\"))/100","v":5.9963472920041463},{"$f":"100-(J199+K199+M199)","v":4.5653354936989388},{"$f":"IF((I201+M201)>100,M201*100/(I201+M201),M201)","v":3.794086966980692E-2},{"$f":"IF((N201+R201)>100,N201*100/(N201+R201),N201)","v":96.58977862352107},{"$f":"N199*AVERAGEIF(O205:O216,\">0\")/100","v":94.145830307165966},{"$f":"N199*(100-AVERAGEIF(O205:O216,\">0\"))/100","v":2.4439483163551152},{"$f":"100-(O199+P199+R199)","v":3.4102213764789155},{"$f":"IF((N201+R201)>100,R201*100/(N201+R201),R201)","v":0},{"$f":"IF((S201+W201)>100,S201*100/(S201+W201),S201)","v":99.285521389358507},{"$f":"S199*AVERAGEIF(T205:T216,\">0\")/100","v":96.169135700869177},{"$f":"S199*(100-AVERAGEIF(T205:T216,\">0\"))/100","v":3.1163856884893271},{"$f":"100-(T199+U199+W199)","v":0.71447861064149265},{"$f":"IF((S201+W201)>100,W201*100/(S201+W201),W201)","v":0},{"$f":"IF((X201+AB201)>100,X201*100/(X201+AB201),X201)","v":99.999999999999929},{"$f":"X199*AVERAGEIF(Y205:Y216,\">0\")/100","v":99.920463585531394},{"$f":"X199*(100-AVERAGEIF(Y205:Y216,\">0\"))/100","v":7.9536414468535044E-2},{"$f":"100-(Y199+Z199+AB199)","v":0},{"$f":"IF((X201+AB201)>100,AB201*100/(X201+AB201),AB201)","v":0}]
[null,null,{"$f":"MaxTarget(C205:C216)","v":2017},{"$f":"IF((D202+H202)>100,D202*100/(D202+H202),D202)","v":84.498220443890546},{"$f":"D200*AVERAGEIF(E205:E216,\">0\")/100","v":72.001787277266828},{"$f":"D200*(100-AVERAGEIF(E205:E216,\">0\"))/100","v":12.49643316662371},{"$f":"100-(E200+F200+H200)","v":14.68334457378549},{"$f":"IF((D202+H202)>100,H202*100/(D202+H202),H202)","v":0.81843498232395884},{"$f":"IF((I202+M202)>100,I202*100/(I202+M202),I202)","v":95.396723636631265},{"$f":"I200*AVERAGEIF(J205:J216,\">0\")/100","v":89.400376344627105},{"$f":"I200*(100-AVERAGEIF(J205:J216,\">0\"))/100","v":5.9963472920041463},{"$f":"100-(J200+K200+M200)","v":4.5653354936989388},{"$f":"IF((I202+M202)>100,M202*100/(I202+M202),M202)","v":3.794086966980692E-2},{"$f":"IF((N202+R202)>100,N202*100/(N202+R202),N202)","v":96.58977862352107},{"$f":"N200*AVERAGEIF(O205:O216,\">0\")/100","v":94.145830307165966},{"$f":"N200*(100-AVERAGEIF(O205:O216,\">0\"))/100","v":2.4439483163551152},{"$f":"100-(O200+P200+R200)","v":3.4102213764789155},{"$f":"IF((N202+R202)>100,R202*100/(N202+R202),R202)","v":0},{"$f":"IF((S202+W202)>100,S202*100/(S202+W202),S202)","v":99.285521389358507},{"$f":"S200*AVERAGEIF(T205:T216,\">0\")/100","v":96.169135700869177},{"$f":"S200*(100-AVERAGEIF(T205:T216,\">0\"))/100","v":3.1163856884893271},{"$f":"100-(T200+U200+W200)","v":0.71447861064149265},{"$f":"IF((S202+W202)>100,W202*100/(S202+W202),W202)","v":0},{"$f":"IF((X202+AB202)>100,X202*100/(X202+AB202),X202)","v":99.999999999999929},{"$f":"X200*AVERAGEIF(Y205:Y216,\">0\")/100","v":99.920463585531394},{"$f":"X200*(100-AVERAGEIF(Y205:Y216,\">0\"))/100","v":7.9536414468535044E-2},{"$f":"100-(Y200+Z200+AB200)","v":0},{"$f":"IF((X202+AB202)>100,AB202*100/(X202+AB202),AB202)","v":0}]
["Regression period:",null,{"$f":"MinRegYear(C199,C205:C216)","v":2011},{"$f":"IF(MAX(C205:C216)-MIN(C205:C216)<5,AVERAGEIF(C205:C216,\">0\",D205:D216),\nIF(FORECAST($C201,D$205:D$216,$C$205:$C$216)<0,0,\nIF(FORECAST($C201,D$205:D$216,$C$205:$C$216)>100,100,\nFORECAST($C201,D$205:D$216,$C$205:$C$216))))","v":84.498220443890546},null,null,null,{"$f":"IF(MAX(C205:C216)-MIN(C205:C216)<5,AVERAGEIF(C205:C216,\">0\",H205:H216),\nIF(FORECAST($C201,H$205:H$216,$C$205:$C$216)<0,0,\nIF(FORECAST($C201,H$205:H$216,$C$205:$C$216)>100,100,\nFORECAST($C201,H$205:H$216,$C$205:$C$216))))","v":0.81843498232395884},{"$f":"IF(MAX(C205:C216)-MIN(C205:C216)<5,AVERAGEIF(C205:C216,\">0\",I205:I216),\nIF(FORECAST($C201,I$205:I$216,$C$205:$C$216)<0,0,\nIF(FORECAST($C201,I$205:I$216,$C$205:$C$216)>100,100,\nFORECAST($C201,I$205:I$216,$C$205:$C$216))))","v":95.396723636631265},null,null,null,{"$f":"IF(MAX(C205:C216)-MIN(C205:C216)<5,AVERAGEIF(C205:C216,\">0\",M205:M216),\nIF(FORECAST($C201,M$205:M$216,$C$205:$C$216)<0,0,\nIF(FORECAST($C201,M$205:M$216,$C$205:$C$216)>100,100,\nFORECAST($C201,M$205:M$216,$C$205:$C$216))))","v":3.794086966980692E-2},{"$f":"IF(MAX(C205:C216)-MIN(C205:C216)<5,AVERAGEIF(C205:C216,\">0\",N205:N216),\nIF(FORECAST($C201,N$205:N$216,$C$205:$C$216)<0,0,\nIF(FORECAST($C201,N$205:N$216,$C$205:$C$216)>100,100,\nFORECAST($C201,N$205:N$216,$C$205:$C$216))))","v":96.58977862352107},null,null,null,{"$f":"IF(MAX(C205:C216)-MIN(C205:C216)<5,AVERAGEIF(C205:C216,\">0\",R205:R216),\nIF(FORECAST($C201,R$205:R$216,$C$205:$C$216)<0,0,\nIF(FORECAST($C201,R$205:R$216,$C$205:$C$216)>100,100,\nFORECAST($C201,R$205:R$216,$C$205:$C$216))))","v":0},{"$f":"IF(MAX(C205:C216)-MIN(C205:C216)<5,AVERAGEIF(C205:C216,\">0\",S205:S216),\nIF(FORECAST($C201,S$205:S$216,$C$205:$C$216)<0,0,\nIF(FORECAST($C201,S$205:S$216,$C$205:$C$216)>100,100,\nFORECAST($C201,S$205:S$216,$C$205:$C$216))))","v":99.285521389358507},null,null,null,{"$f":"IF(MAX(C205:C216)-MIN(C205:C216)<5,AVERAGEIF(C205:C216,\">0\",W205:W216),\nIF(FORECAST($C201,W$205:W$216,$C$205:$C$216)<0,0,\nIF(FORECAST($C201,W$205:W$216,$C$205:$C$216)>100,100,\nFORECAST($C201,W$205:W$216,$C$205:$C$216))))","v":0},{"$f":"IF(MAX(C205:C216)-MIN(C205:C216)<5,AVERAGEIF(C205:C216,\">0\",X205:X216),\nIF(FORECAST($C201,X$205:X$216,$C$205:$C$216)<0,0,\nIF(FORECAST($C201,X$205:X$216,$C$205:$C$216)>100,100,\nFORECAST($C201,X$205:X$216,$C$205:$C$216))))","v":99.999999999999929},null,null,null,{"$f":"IF(MAX(C205:C216)-MIN(C205:C216)<5,AVERAGEIF(C205:C216,\">0\",AB205:AB216),\nIF(FORECAST($C201,AB$205:AB$216,$C$205:$C$216)<0,0,\nIF(FORECAST($C201,AB$205:AB$216,$C$205:$C$216)>100,100,\nFORECAST($C201,AB$205:AB$216,$C$205:$C$216))))","v":0}]
[null,null,{"$f":"MaxRegYear(C200,C205:C216)","v":2015},{"$f":"IF(MAX(C205:C216)-MIN(C205:C216)<5,AVERAGEIF(C205:C216,\">0\",D205:D216),\nIF(FORECAST($C202,D$205:D$216,$C$205:$C$216)<0,0,\nIF(FORECAST($C202,D$205:D$216,$C$205:$C$216)>100,100,\nFORECAST($C202,D$205:D$216,$C$205:$C$216))))","v":84.498220443890546},null,null,null,{"$f":"IF(MAX(C205:C216)-MIN(C205:C216)<5,AVERAGEIF(C205:C216,\">0\",H205:H216),\nIF(FORECAST($C202,H$205:H$216,$C$205:$C$216)<0,0,\nIF(FORECAST($C202,H$205:H$216,$C$205:$C$216)>100,100,\nFORECAST($C202,H$205:H$216,$C$205:$C$216))))","v":0.81843498232395884},{"$f":"IF(MAX(C205:C216)-MIN(C205:C216)<5,AVERAGEIF(C205:C216,\">0\",I205:I216),\nIF(FORECAST($C202,I$205:I$216,$C$205:$C$216)<0,0,\nIF(FORECAST($C202,I$205:I$216,$C$205:$C$216)>100,100,\nFORECAST($C202,I$205:I$216,$C$205:$C$216))))","v":95.396723636631265},null,null,null,{"$f":"IF(MAX(C205:C216)-MIN(C205:C216)<5,AVERAGEIF(C205:C216,\">0\",M205:M216),\nIF(FORECAST($C202,M$205:M$216,$C$205:$C$216)<0,0,\nIF(FORECAST($C202,M$205:M$216,$C$205:$C$216)>100,100,\nFORECAST($C202,M$205:M$216,$C$205:$C$216))))","v":3.794086966980692E-2},{"$f":"IF(MAX(C205:C216)-MIN(C205:C216)<5,AVERAGEIF(C205:C216,\">0\",N205:N216),\nIF(FORECAST($C202,N$205:N$216,$C$205:$C$216)<0,0,\nIF(FORECAST($C202,N$205:N$216,$C$205:$C$216)>100,100,\nFORECAST($C202,N$205:N$216,$C$205:$C$216))))","v":96.58977862352107},null,null,null,{"$f":"IF(MAX(C205:C216)-MIN(C205:C216)<5,AVERAGEIF(C205:C216,\">0\",R205:R216),\nIF(FORECAST($C202,R$205:R$216,$C$205:$C$216)<0,0,\nIF(FORECAST($C202,R$205:R$216,$C$205:$C$216)>100,100,\nFORECAST($C202,R$205:R$216,$C$205:$C$216))))","v":0},{"$f":"IF(MAX(C205:C216)-MIN(C205:C216)<5,AVERAGEIF(C205:C216,\">0\",S205:S216),\nIF(FORECAST($C202,S$205:S$216,$C$205:$C$216)<0,0,\nIF(FORECAST($C202,S$205:S$216,$C$205:$C$216)>100,100,\nFORECAST($C202,S$205:S$216,$C$205:$C$216))))","v":99.285521389358507},null,null,null,{"$f":"IF(MAX(C205:C216)-MIN(C205:C216)<5,AVERAGEIF(C205:C216,\">0\",W205:W216),\nIF(FORECAST($C202,W$205:W$216,$C$205:$C$216)<0,0,\nIF(FORECAST($C202,W$205:W$216,$C$205:$C$216)>100,100,\nFORECAST($C202,W$205:W$216,$C$205:$C$216))))","v":0},{"$f":"IF(MAX(C205:C216)-MIN(C205:C216)<5,AVERAGEIF(C205:C216,\">0\",X205:X216),\nIF(FORECAST($C202,X$205:X$216,$C$205:$C$216)<0,0,\nIF(FORECAST($C202,X$205:X$216,$C$205:$C$216)>100,100,\nFORECAST($C202,X$205:X$216,$C$205:$C$216))))","v":99.999999999999929},null,null,null,{"$f":"IF(MAX(C205:C216)-MIN(C205:C216)<5,AVERAGEIF(C205:C216,\">0\",AB205:AB216),\nIF(FORECAST($C202,AB$205:AB$216,$C$205:$C$216)<0,0,\nIF(FORECAST($C202,AB$205:AB$216,$C$205:$C$216)>100,100,\nFORECAST($C202,AB$205:AB$216,$C$205:$C$216))))","v":0}]
[]
[null,"Survey","Year","Improved","Not shared",null,null,"Open defecation","Improved","Not shared",null,null,"Open defecation","Improved","Not shared",null,null,"Open defecation","Improved","Not shared",null,null,"Open defecation","Improved","Not shared",null,null,"Open defecation"]
[null,"MICS13",2013,{"$f":"IF(ISERROR(INDIRECT(CONCATENATE($B205,\"!H122\"))),\"\",INDIRECT(CONCATENATE($B205,\"!H122\")))","v":84.498220443890546},{"$f":"IF(ISERROR(INDIRECT(CONCATENATE($B205,\"!H129\"))),\"\",INDIRECT(CONCATENATE($B205,\"!H129\")))","v":85.211010242610101},null,null,{"$f":"IF(ISERROR(INDIRECT(CONCATENATE($B205,\"!H127\"))),\"\",INDIRECT(CONCATENATE($B205,\"!H127\")))","v":0.81843498232395884},{"$f":"IF(ISERROR(INDIRECT(CONCATENATE($B205,\"!I122\"))),\"\",INDIRECT(CONCATENATE($B205,\"!I122\")))","v":95.396723636631265},{"$f":"IF(ISERROR(INDIRECT(CONCATENATE($B205,\"!I129\"))),\"\",INDIRECT(CONCATENATE($B205,\"!I129\")))","v":93.714304785933322},null,null,{"$f":"IF(ISERROR(INDIRECT(CONCATENATE($B205,\"!I127\"))),\"\",INDIRECT(CONCATENATE($B205,\"!I127\")))","v":3.794086966980692E-2},{"$f":"IF(ISERROR(INDIRECT(CONCATENATE($B205,\"!J122\"))),\"\",INDIRECT(CONCATENATE($B205,\"!J122\")))","v":96.58977862352107},{"$f":"IF(ISERROR(INDIRECT(CONCATENATE($B205,\"!J129\"))),\"\",INDIRECT(CONCATENATE($B205,\"!J129\")))","v":97.469765071228792},null,null,{"$f":"IF(ISERROR(INDIRECT(CONCATENATE($B205,\"!J127\"))),\"\",INDIRECT(CONCATENATE($B205,\"!J127\")))","v":0},{"$f":"IF(ISERROR(INDIRECT(CONCATENATE($B205,\"!K122\"))),\"\",INDIRECT(CONCATENATE($B205,\"!K122\")))","v":99.285521389358507},{"$f":"IF(ISERROR(INDIRECT(CONCATENATE($B205,\"!K129\"))),\"\",INDIRECT(CONCATENATE($B205,\"!K129\")))","v":96.861188172374},null,null,{"$f":"IF(ISERROR(INDIRECT(CONCATENATE($B205,\"!K127\"))),\"\",INDIRECT(CONCATENATE($B205,\"!K127\")))","v":0},{"$f":"IF(ISERROR(INDIRECT(CONCATENATE($B205,\"!L122\"))),\"\",INDIRECT(CONCATENATE($B205,\"!L122\")))","v":99.999999999999929},{"$f":"IF(ISERROR(INDIRECT(CONCATENATE($B205,\"!L129\"))),\"\",INDIRECT(CONCATENATE($B205,\"!L129\")))","v":99.920463585531465},null,null,{"$f":"IF(ISERROR(INDIRECT(CONCATENATE($B205,\"!L2127\"))),\"\",INDIRECT(CONCATENATE($B205,\"!L127\")))","v":0}]
[null,null,null,"","",null,null,"","","",null,null,"","","",null,null,"","","",null,null,"","","",null,null,""]
[null,null,null,"","",null,null,"","","",null,null,"","","",null,null,"","","",null,null,"","","",null,null,""]
[null,null,null,"","",null,null,"","","",null,null,"","","",null,null,"","","",null,null,"","","",null,null,""]
[null,null,null,"","",null,null,"","","",null,null,"","","",null,null,"","","",null,null,"","","",null,null,""]
[null,null,null,"","",null,null,"","","",null,null,"","","",null,null,"","","",null,null,"","","",null,null,""]
[null,null,null,"","",null,null,"","","",null,null,"","","",null,null,"","","",null,null,"","","",null,null,""]
[null,null,null,"","",null,null,"","","",null,null,"","","",null,null,"","","",null,null,"","","",null,null,""]
[null,null,null,"","",null,null,"","","",null,null,"","","",null,null,"","","",null,null,"","","",null,null,""]
[null,null,null,"","",null,null,"","","",null,null,"","","",null,null,"","","",null,null,"","","",null,null,""]
[null,null,null,"","",null,null,"","","",null,null,"","","",null,null,"","","",null,null,"","","",null,null,""]
[null,null,null,"","",null,null,"","","",null,null,"","","",null,null,"","","",null,null,"","","",null,null,""]
[]
[null,{"$f":"CONCATENATE(\"Urban use of sanitation facilities, \",C199,\"–\",C200)","v":"Urban use of sanitation facilities, 2009–2017"},null,null,null,null,null,null,null,null,null,null,null,null,null,null,null,null,"Data points used for regression"]
[]
[]
[]
[]
[]
[]
[]
[]
[]
[]
[]
[]
[]
[]
[]
[]
[]
[]
[]
[]
[]
[]
[]
[]
[]
[]
[]
[]
[]
[]
[]
[]
[]
[]
[]
[]
[]
[]
[]
[]
[]
[]
[]
[]
[]
[]
[]
[]
[]
[]
[]
[]
[]
[]
[]
[]
[]
[]
[]
[]
[]
[]
[]
[]
[]
[]
[]
[]
[]
[]
[]
[]
[]
[]
[]
[]
[]
[]
["RURAL",null,null,"Poorest",null,null,null,null,"Poor",null,null,null,null,"Middle",null,null,null,null,"Rich",null,null,null,null,"Richest"]
[null,null,null,"Improved","Basic","Limited","Unimproved","Open defecation","Improved","Basic","Limited","Unimproved","Open defecation","Improved","Basic","Limited","Unimproved","Open defecation","Improved","Basic","Limited","Unimproved","Open defecation","Improved","Basic","Limited","Unimproved","Open defecation"]
["Forecast period:",null,{"$f":"MinBase(C305:C316)","v":2009},{"$f":"IF((D301+H301)>100,D301*100/(D301+H301),D301)","v":39.918631782383351},{"$f":"D299*AVERAGEIF(E305:E316,\">0\")/100","v":32.147429410352721},{"$f":"D299*(100-AVERAGEIF(E305:E316,\">0\"))/100","v":7.7712023720306274},{"$f":"100-(E299+F299+H299)","v":33.116353968441629},{"$f":"IF((D301+H301)>100,H301*100/(D301+H301),H301)","v":26.965014249175024},{"$f":"IF((I301+M301)>100,I301*100/(I301+M301),I301)","v":68.054087383597505},{"$f":"I299*AVERAGEIF(J305:J316,\">0\")/100","v":61.92697750892998},{"$f":"I299*(100-AVERAGEIF(J305:J316,\">0\"))/100","v":6.1271098746675294},{"$f":"100-(J299+K299+M299)","v":27.654936932929758},{"$f":"IF((I301+M301)>100,M301*100/(I301+M301),M301)","v":4.2909756834727339},{"$f":"IF((N301+R301)>100,N301*100/(N301+R301),N301)","v":77.460531618490577},{"$f":"N299*AVERAGEIF(O305:O316,\">0\")/100","v":71.171623755138341},{"$f":"N299*(100-AVERAGEIF(O305:O316,\">0\"))/100","v":6.2889078633522368},{"$f":"100-(O299+P299+R299)","v":21.73168674783507},{"$f":"IF((N301+R301)>100,R301*100/(N301+R301),R301)","v":0.80778163367434541},{"$f":"IF((S301+W301)>100,S301*100/(S301+W301),S301)","v":82.665124857257013},{"$f":"S299*AVERAGEIF(T305:T316,\">0\")/100","v":73.915626749729313},{"$f":"S299*(100-AVERAGEIF(T305:T316,\">0\"))/100","v":8.7494981075277014},{"$f":"100-(T299+U299+W299)","v":16.288235334638145},{"$f":"IF((S301+W301)>100,W301*100/(S301+W301),W301)","v":1.04663980810484},{"$f":"IF((X301+AB301)>100,X301*100/(X301+AB301),X301)","v":94.366339932225856},{"$f":"X299*AVERAGEIF(Y305:Y316,\">0\")/100","v":91.183493539332218},{"$f":"X299*(100-AVERAGEIF(Y305:Y316,\">0\"))/100","v":3.1828463928936368},{"$f":"100-(Y299+Z299+AB299)","v":5.4024539419700659},{"$f":"IF((X301+AB301)>100,AB301*100/(X301+AB301),AB301)","v":0.23120612580407743}]
[null,null,{"$f":"MaxTarget(C305:C316)","v":2017},{"$f":"IF((D302+H302)>100,D302*100/(D302+H302),D302)","v":39.918631782383351},{"$f":"D300*AVERAGEIF(E305:E316,\">0\")/100","v":32.147429410352721},{"$f":"D300*(100-AVERAGEIF(E305:E316,\">0\"))/100","v":7.7712023720306274},{"$f":"100-(E300+F300+H300)","v":33.116353968441629},{"$f":"IF((D302+H302)>100,H302*100/(D302+H302),H302)","v":26.965014249175024},{"$f":"IF((I302+M302)>100,I302*100/(I302+M302),I302)","v":68.054087383597505},{"$f":"I300*AVERAGEIF(J305:J316,\">0\")/100","v":61.92697750892998},{"$f":"I300*(100-AVERAGEIF(J305:J316,\">0\"))/100","v":6.1271098746675294},{"$f":"100-(J300+K300+M300)","v":27.654936932929758},{"$f":"IF((I302+M302)>100,M302*100/(I302+M302),M302)","v":4.2909756834727339},{"$f":"IF((N302+R302)>100,N302*100/(N302+R302),N302)","v":77.460531618490577},{"$f":"N300*AVERAGEIF(O305:O316,\">0\")/100","v":71.171623755138341},{"$f":"N300*(100-AVERAGEIF(O305:O316,\">0\"))/100","v":6.2889078633522368},{"$f":"100-(O300+P300+R300)","v":21.73168674783507},{"$f":"IF((N302+R302)>100,R302*100/(N302+R302),R302)","v":0.80778163367434541},{"$f":"IF((S302+W302)>100,S302*100/(S302+W302),S302)","v":82.665124857257013},{"$f":"S300*AVERAGEIF(T305:T316,\">0\")/100","v":73.915626749729313},{"$f":"S300*(100-AVERAGEIF(T305:T316,\">0\"))/100","v":8.7494981075277014},{"$f":"100-(T300+U300+W300)","v":16.288235334638145},{"$f":"IF((S302+W302)>100,W302*100/(S302+W302),W302)","v":1.04663980810484},{"$f":"IF((X302+AB302)>100,X302*100/(X302+AB302),X302)","v":94.366339932225856},{"$f":"X300*AVERAGEIF(Y305:Y316,\">0\")/100","v":91.183493539332218},{"$f":"X300*(100-AVERAGEIF(Y305:Y316,\">0\"))/100","v":3.1828463928936368},{"$f":"100-(Y300+Z300+AB300)","v":5.4024539419700659},{"$f":"IF((X302+AB302)>100,AB302*100/(X302+AB302),AB302)","v":0.23120612580407743}]
["Regression period:",null,{"$f":"MinRegYear(C299,C305:C316)","v":2011},{"$f":"IF(MAX(C305:C316)-MIN(C305:C316)<5,AVERAGEIF(C305:C316,\">0\",D305:D316),\nIF(FORECAST($C301,D$305:D$316,$C$305:$C$316)<0,0,\nIF(FORECAST($C301,D$305:D$316,$C$305:$C$316)>100,100,\nFORECAST($C301,D$305:D$316,$C$305:$C$316))))","v":39.918631782383351},null,null,null,{"$f":"IF(MAX(C305:C316)-MIN(C305:C316)<5,AVERAGEIF(C305:C316,\">0\",H305:H316),\nIF(FORECAST($C301,H$305:H$316,$C$305:$C$316)<0,0,\nIF(FORECAST($C301,H$305:H$316,$C$305:$C$316)>100,100,\nFORECAST($C301,H$305:H$316,$C$305:$C$316))))","v":26.965014249175024},{"$f":"IF(MAX(C305:C316)-MIN(C305:C316)<5,AVERAGEIF(C305:C316,\">0\",I305:I316),\nIF(FORECAST($C301,I$305:I$316,$C$305:$C$316)<0,0,\nIF(FORECAST($C301,I$305:I$316,$C$305:$C$316)>100,100,\nFORECAST($C301,I$305:I$316,$C$305:$C$316))))","v":68.054087383597505},null,null,null,{"$f":"IF(MAX(C305:C316)-MIN(C305:C316)<5,AVERAGEIF(C305:C316,\">0\",M305:M316),\nIF(FORECAST($C301,M$305:M$316,$C$305:$C$316)<0,0,\nIF(FORECAST($C301,M$305:M$316,$C$305:$C$316)>100,100,\nFORECAST($C301,M$305:M$316,$C$305:$C$316))))","v":4.2909756834727339},{"$f":"IF(MAX(C305:C316)-MIN(C305:C316)<5,AVERAGEIF(C305:C316,\">0\",N305:N316),\nIF(FORECAST($C301,N$305:N$316,$C$305:$C$316)<0,0,\nIF(FORECAST($C301,N$305:N$316,$C$305:$C$316)>100,100,\nFORECAST($C301,N$305:N$316,$C$305:$C$316))))","v":77.460531618490577},null,null,null,{"$f":"IF(MAX(C305:C316)-MIN(C305:C316)<5,AVERAGEIF(C305:C316,\">0\",R305:R316),\nIF(FORECAST($C301,R$305:R$316,$C$305:$C$316)<0,0,\nIF(FORECAST($C301,R$305:R$316,$C$305:$C$316)>100,100,\nFORECAST($C301,R$305:R$316,$C$305:$C$316))))","v":0.80778163367434541},{"$f":"IF(MAX(C305:C316)-MIN(C305:C316)<5,AVERAGEIF(C305:C316,\">0\",S305:S316),\nIF(FORECAST($C301,S$305:S$316,$C$305:$C$316)<0,0,\nIF(FORECAST($C301,S$305:S$316,$C$305:$C$316)>100,100,\nFORECAST($C301,S$305:S$316,$C$305:$C$316))))","v":82.665124857257013},null,null,null,{"$f":"IF(MAX(C305:C316)-MIN(C305:C316)<5,AVERAGEIF(C305:C316,\">0\",W305:W316),\nIF(FORECAST($C301,W$305:W$316,$C$305:$C$316)<0,0,\nIF(FORECAST($C301,W$305:W$316,$C$305:$C$316)>100,100,\nFORECAST($C301,W$305:W$316,$C$305:$C$316))))","v":1.04663980810484},{"$f":"IF(MAX(C305:C316)-MIN(C305:C316)<5,AVERAGEIF(C305:C316,\">0\",X305:X316),\nIF(FORECAST($C301,X$305:X$316,$C$305:$C$316)<0,0,\nIF(FORECAST($C301,X$305:X$316,$C$305:$C$316)>100,100,\nFORECAST($C301,X$305:X$316,$C$305:$C$316))))","v":94.366339932225856},null,null,null,{"$f":"IF(MAX(C305:C316)-MIN(C305:C316)<5,AVERAGEIF(C305:C316,\">0\",AB305:AB316),\nIF(FORECAST($C301,AB$305:AB$316,$C$305:$C$316)<0,0,\nIF(FORECAST($C301,AB$305:AB$316,$C$305:$C$316)>100,100,\nFORECAST($C301,AB$305:AB$316,$C$305:$C$316))))","v":0.23120612580407743}]
[null,null,{"$f":"MaxRegYear(C300,C305:C316)","v":2015},{"$f":"IF(MAX(C305:C316)-MIN(C305:C316)<5,AVERAGEIF(C305:C316,\">0\",D305:D316),\nIF(FORECAST($C302,D$305:D$316,$C$305:$C$316)<0,0,\nIF(FORECAST($C302,D$305:D$316,$C$305:$C$316)>100,100,\nFORECAST($C302,D$305:D$316,$C$305:$C$316))))","v":39.918631782383351},null,null,null,{"$f":"IF(MAX(C305:C316)-MIN(C305:C316)<5,AVERAGEIF(C305:C316,\">0\",H305:H316),\nIF(FORECAST($C302,H$305:H$316,$C$305:$C$316)<0,0,\nIF(FORECAST($C302,H$305:H$316,$C$305:$C$316)>100,100,\nFORECAST($C302,H$305:H$316,$C$305:$C$316))))","v":26.965014249175024},{"$f":"IF(MAX(C305:C316)-MIN(C305:C316)<5,AVERAGEIF(C305:C316,\">0\",I305:I316),\nIF(FORECAST($C302,I$305:I$316,$C$305:$C$316)<0,0,\nIF(FORECAST($C302,I$305:I$316,$C$305:$C$316)>100,100,\nFORECAST($C302,I$305:I$316,$C$305:$C$316))))","v":68.054087383597505},null,null,null,{"$f":"IF(MAX(C305:C316)-MIN(C305:C316)<5,AVERAGEIF(C305:C316,\">0\",M305:M316),\nIF(FORECAST($C302,M$305:M$316,$C$305:$C$316)<0,0,\nIF(FORECAST($C302,M$305:M$316,$C$305:$C$316)>100,100,\nFORECAST($C302,M$305:M$316,$C$305:$C$316))))","v":4.2909756834727339},{"$f":"IF(MAX(C305:C316)-MIN(C305:C316)<5,AVERAGEIF(C305:C316,\">0\",N305:N316),\nIF(FORECAST($C302,N$305:N$316,$C$305:$C$316)<0,0,\nIF(FORECAST($C302,N$305:N$316,$C$305:$C$316)>100,100,\nFORECAST($C302,N$305:N$316,$C$305:$C$316))))","v":77.460531618490577},null,null,null,{"$f":"IF(MAX(C305:C316)-MIN(C305:C316)<5,AVERAGEIF(C305:C316,\">0\",R305:R316),\nIF(FORECAST($C302,R$305:R$316,$C$305:$C$316)<0,0,\nIF(FORECAST($C302,R$305:R$316,$C$305:$C$316)>100,100,\nFORECAST($C302,R$305:R$316,$C$305:$C$316))))","v":0.80778163367434541},{"$f":"IF(MAX(C305:C316)-MIN(C305:C316)<5,AVERAGEIF(C305:C316,\">0\",S305:S316),\nIF(FORECAST($C302,S$305:S$316,$C$305:$C$316)<0,0,\nIF(FORECAST($C302,S$305:S$316,$C$305:$C$316)>100,100,\nFORECAST($C302,S$305:S$316,$C$305:$C$316))))","v":82.665124857257013},null,null,null,{"$f":"IF(MAX(C305:C316)-MIN(C305:C316)<5,AVERAGEIF(C305:C316,\">0\",W305:W316),\nIF(FORECAST($C302,W$305:W$316,$C$305:$C$316)<0,0,\nIF(FORECAST($C302,W$305:W$316,$C$305:$C$316)>100,100,\nFORECAST($C302,W$305:W$316,$C$305:$C$316))))","v":1.04663980810484},{"$f":"IF(MAX(C305:C316)-MIN(C305:C316)<5,AVERAGEIF(C305:C316,\">0\",X305:X316),\nIF(FORECAST($C302,X$305:X$316,$C$305:$C$316)<0,0,\nIF(FORECAST($C302,X$305:X$316,$C$305:$C$316)>100,100,\nFORECAST($C302,X$305:X$316,$C$305:$C$316))))","v":94.366339932225856},null,null,null,{"$f":"IF(MAX(C305:C316)-MIN(C305:C316)<5,AVERAGEIF(C305:C316,\">0\",AB305:AB316),\nIF(FORECAST($C302,AB$305:AB$316,$C$305:$C$316)<0,0,\nIF(FORECAST($C302,AB$305:AB$316,$C$305:$C$316)>100,100,\nFORECAST($C302,AB$305:AB$316,$C$305:$C$316))))","v":0.23120612580407743}]
[]
[null,"Survey","Year","Improved","Not shared",null,null,"Open defecation","Improved","Not shared",null,null,"Open defecation","Improved","Not shared",null,null,"Open defecation","Improved","Not shared",null,null,"Open defecation","Improved","Not shared",null,null,"Open defecation"]
[null,"MICS13",2013,{"$f":"IF(ISERROR(INDIRECT(CONCATENATE($B305,\"!M122\"))),\"\",INDIRECT(CONCATENATE($B305,\"!M122\")))","v":39.918631782383351},{"$f":"IF(ISERROR(INDIRECT(CONCATENATE($B305,\"!M129\"))),\"\",INDIRECT(CONCATENATE($B305,\"!M129\")))","v":80.532392957766234},null,null,{"$f":"IF(ISERROR(INDIRECT(CONCATENATE($B305,\"!M127\"))),\"\",INDIRECT(CONCATENATE($B305,\"!M127\")))","v":26.965014249175024},{"$f":"IF(ISERROR(INDIRECT(CONCATENATE($B305,\"!N122\"))),\"\",INDIRECT(CONCATENATE($B305,\"!N122\")))","v":68.054087383597505},{"$f":"IF(ISERROR(INDIRECT(CONCATENATE($B305,\"!N129\"))),\"\",INDIRECT(CONCATENATE($B305,\"!N129\")))","v":90.996705546676253},null,null,{"$f":"IF(ISERROR(INDIRECT(CONCATENATE($B305,\"!N127\"))),\"\",INDIRECT(CONCATENATE($B305,\"!N127\")))","v":4.2909756834727339},{"$f":"IF(ISERROR(INDIRECT(CONCATENATE($B305,\"!O122\"))),\"\",INDIRECT(CONCATENATE($B305,\"!O122\")))","v":77.460531618490577},{"$f":"IF(ISERROR(INDIRECT(CONCATENATE($B305,\"!O129\"))),\"\",INDIRECT(CONCATENATE($B305,\"!O129\")))","v":91.881145491840371},null,null,{"$f":"IF(ISERROR(INDIRECT(CONCATENATE($B305,\"!O127\"))),\"\",INDIRECT(CONCATENATE($B305,\"!O127\")))","v":0.80778163367434541},{"$f":"IF(ISERROR(INDIRECT(CONCATENATE($B305,\"!P122\"))),\"\",INDIRECT(CONCATENATE($B305,\"!P122\")))","v":82.665124857257013},{"$f":"IF(ISERROR(INDIRECT(CONCATENATE($B305,\"!P129\"))),\"\",INDIRECT(CONCATENATE($B305,\"!P129\")))","v":89.415732302302814},null,null,{"$f":"IF(ISERROR(INDIRECT(CONCATENATE($B305,\"!P127\"))),\"\",INDIRECT(CONCATENATE($B305,\"!P127\")))","v":1.04663980810484},{"$f":"IF(ISERROR(INDIRECT(CONCATENATE($B305,\"!Q122\"))),\"\",INDIRECT(CONCATENATE($B305,\"!Q122\")))","v":94.366339932225856},{"$f":"IF(ISERROR(INDIRECT(CONCATENATE($B305,\"!Q129\"))),\"\",INDIRECT(CONCATENATE($B305,\"!Q129\")))","v":96.627138029111265},null,null,{"$f":"IF(ISERROR(INDIRECT(CONCATENATE($B305,\"!Q2127\"))),\"\",INDIRECT(CONCATENATE($B305,\"!Q127\")))","v":0.23120612580407743}]
[null,null,null,"","",null,null,"","","",null,null,"","","",null,null,"","","",null,null,"","","",null,null,""]
[null,null,null,"","",null,null,"","","",null,null,"","","",null,null,"","","",null,null,"","","",null,null,""]
[null,null,null,"","",null,null,"","","",null,null,"","","",null,null,"","","",null,null,"","","",null,null,""]
[null,null,null,"","",null,null,"","","",null,null,"","","",null,null,"","","",null,null,"","","",null,null,""]
[null,null,null,"","",null,null,"","","",null,null,"","","",null,null,"","","",null,null,"","","",null,null,""]
[null,null,null,"","",null,null,"","","",null,null,"","","",null,null,"","","",null,null,"","","",null,null,""]
[null,null,null,"","",null,null,"","","",null,null,"","","",null,null,"","","",null,null,"","","",null,null,""]
[null,null,null,"","",null,null,"","","",null,null,"","","",null,null,"","","",null,null,"","","",null,null,""]
[null,null,null,"","",null,null,"","","",null,null,"","","",null,null,"","","",null,null,"","","",null,null,""]
[null,null,null,"","",null,null,"","","",null,null,"","","",null,null,"","","",null,null,"","","",null,null,""]
[null,null,null,"","",null,null,"","","",null,null,"","","",null,null,"","","",null,null,"","","",null,null,""]
[]
[null,{"$f":"CONCATENATE(\"Rural use of sanitation facilities, \",C299,\"–\",C300)","v":"Rural use of sanitation facilities, 2009–2017"},null,null,null,null,null,null,null,null,null,null,null,null,null,null,null,null,"Data points used for regression"]

{"sheet":"Hygiene","index":3,"n_rows":89,"n_cols":25,"rows_kept":89,"cut":false,"hidden":false,"merged":[[39,22,40,22],[39,23,40,23],[39,24,40,24],[31,4,32,5],[39,16,40,16],[39,17,40,17],[39,18,40,18],[39,19,40,19],[39,20,40,20],[39,21,40,21],[36,24,37,24],[39,6,40,7],[39,8,40,8],[39,9,40,9],[39,10,40,10],[39,11,40,11],[39,12,40,12],[39,13,40,13],[39,14,40,14],[39,15,40,15],[36,18,37,18],[36,12,37,12],[36,13,37,13],[36,14,37,14],[36,15,37,15],[36,16,37,16],[36,17,37,17],[36,19,37,19],[36,20,37,20],[36,21,37,21],[36,22,37,22],[36,23,37,23],[33,20,34,20],[33,21,34,21],[33,22,34,22],[33,23,34,23],[33,24,34,24],[33,15,34,15],[33,16,34,16],[33,17,34,17],[33,18,34,18],[36,6,37,7],[36,8,37,8],[36,9,37,9],[36,10,37,10],[36,11,37,11],[33,10,34,10],[33,11,34,11],[33,12,34,12],[33,13,34,13],[33,14,34,14],[6,1,6,7],[3,1,3,24],[4,1,4,24],[33,1,34,3],[31,6,32,9],[31,10,31,12],[31,13,31,15],[6,10,6,15],[6,18,6,23],[33,19,34,19],[31,16,31,18],[31,19,31,21],[31,22,31,24],[33,6,34,7],[33,8,34,8],[33,9,34,9]]}
[]
[]
[]
[null,"Access to hygiene facilities by wealth quintile (%)"]
[null,{"$f":"IF(ISERROR(INDIRECT(CONCATENATE($E$32,\"!A2\"))),\"\",INDIRECT(CONCATENATE($E$32,\"!A2\")))","v":"Panama"}]
[]
[null,{"$f":"CONCATENATE(\"National \",IF(ISERROR(INDIRECT(CONCATENATE($E$32,\"!A2\"))),\"\",INDIRECT(CONCATENATE($E$32,\"!A210\"))))","v":"National Access to hygiene facilities "},null,null,null,null,null,null,null,null,{"$f":"CONCATENATE(\"Urban \",IF(ISERROR(INDIRECT(CONCATENATE($E$32,\"!A2\"))),\"\",INDIRECT(CONCATENATE($E$32,\"!A210\"))))","v":"Urban Access to hygiene facilities "},null,null,null,null,null,null,null,{"$f":"CONCATENATE(\"Rural \",IF(ISERROR(INDIRECT(CONCATENATE($E$32,\"!A2\"))),\"\",INDIRECT(CONCATENATE($E$32,\"!A210\"))))","v":"Rural Access to hygiene facilities "}]
[]
[]
[]
[]
[]
[]
[]
[]
[]
[]
[]
[]
[]
[]
[]
[]
[]
[]
[]
[]
[]
[]
[]
[]
[null,null,null,null,{"$f":"INDEX(B88:B100,A88)","v":"MICS13"},null,{"$f":"IF(ISERROR(INDIRECT(CONCATENATE($E$32,\"!A2\"))),\"\",INDIRECT(CONCATENATE($E$32,\"!A2\")))","v":"Panama"},null,null,null,"Poorest",null,null,"Poor",null,null,"Middle",null,null,"Rich",null,null,"Richest"]
[null,null,null,null,null,null,null,null,null,null,"Basic","Limited","No facility","Basic","Limited","No facility","Basic","Limited","No facility","Basic","Limited","No facility","Basic","Limited","No facility"]
[null,">>>  Select Survey :   ",null,null,null,null,"NATIONAL",null,null,{"$f":"IF(ISERROR(INDIRECT(CONCATENATE(#REF!,\"!A2\"))),\"\",INDIRECT(CONCATENATE(#REF!,\"!A210\")))","v":""},{"$f":"IF(ISERROR(INDIRECT(CONCATENATE($E$32,\"!C222\"))),\"\",INDIRECT(CONCATENATE($E$32,\"!C222\")))","v":"N/A"},{"$f":"IF(ISERROR(INDIRECT(CONCATENATE($E$32,\"!C223\"))),\"\",INDIRECT(CONCATENATE($E$32,\"!C223\")))","v":"N/A"},{"$f":"IF(ISERROR(INDIRECT(CONCATENATE($E$32,\"!C224\"))),\"\",INDIRECT(CONCATENATE($E$32,\"!C224\")))","v":"N/A"},{"$f":"IF(ISERROR(INDIRECT(CONCATENATE($E$32,\"!D222\"))),\"\",INDIRECT(CONCATENATE($E$32,\"!D222\")))","v":"N/A"},{"$f":"IF(ISERROR(INDIRECT(CONCATENATE($E$32,\"!D223\"))),\"\",INDIRECT(CONCATENATE($E$32,\"!D223\")))","v":"N/A"},{"$f":"IF(ISERROR(INDIRECT(CONCATENATE($E$32,\"!D224\"))),\"\",INDIRECT(CONCATENATE($E$32,\"!D224\")))","v":"N/A"},{"$f":"IF(ISERROR(INDIRECT(CONCATENATE($E$32,\"!E222\"))),\"\",INDIRECT(CONCATENATE($E$32,\"!E222\")))","v":"N/A"},{"$f":"IF(ISERROR(INDIRECT(CONCATENATE($E$32,\"!E223\"))),\"\",INDIRECT(CONCATENATE($E$32,\"!E223\")))","v":"N/A"},{"$f":"IF(ISERROR(INDIRECT(CONCATENATE($E$32,\"!E224\"))),\"\",INDIRECT(CONCATENATE($E$32,\"!E224\")))","v":"N/A"},{"$f":"IF(ISERROR(INDIRECT(CONCATENATE($E$32,\"!F222\"))),\"\",INDIRECT(CONCATENATE($E$32,\"!F222\")))","v":"N/A"},{"$f":"IF(ISERROR(INDIRECT(CONCATENATE($E$32,\"!F223\"))),\"\",INDIRECT(CONCATENATE($E$32,\"!F223\")))","v":"N/A"},{"$f":"IF(ISERROR(INDIRECT(CONCATENATE($E$32,\"!F224\"))),\"\",INDIRECT(CONCATENATE($E$32,\"!F224\")))","v":"N/A"},{"$f":"IF(ISERROR(INDIRECT(CONCATENATE($E$32,\"!G222\"))),\"\",INDIRECT(CONCATENATE($E$32,\"!G222\")))","v":"N/A"},{"$f":"IF(ISERROR(INDIRECT(CONCATENATE($E$32,\"!G223\"))),\"\",INDIRECT(CONCATENATE($E$32,\"!G223\")))","v":"N/A"},{"$f":"IF(ISERROR(INDIRECT(CONCATENATE($E$32,\"!G224\"))),\"\",INDIRECT(CONCATENATE($E$32,\"!G224\")))","v":"N/A"}]
[]
[]
[null,null,null,null,null,null,"URBAN",null,null,{"$f":"IF(ISERROR(INDIRECT(CONCATENATE(#REF!,\"!A2\"))),\"\",INDIRECT(CONCATENATE(#REF!,\"!A210\")))","v":""},{"$f":"IF(ISERROR(INDIRECT(CONCATENATE($E$32,\"!H222\"))),\"\",INDIRECT(CONCATENATE($E$32,\"!H222\")))","v":"N/A"},{"$f":"IF(ISERROR(INDIRECT(CONCATENATE($E$32,\"!H223\"))),\"\",INDIRECT(CONCATENATE($E$32,\"!H223\")))","v":"N/A"},{"$f":"IF(ISERROR(INDIRECT(CONCATENATE($E$32,\"!H224\"))),\"\",INDIRECT(CONCATENATE($E$32,\"!H224\")))","v":"N/A"},{"$f":"IF(ISERROR(INDIRECT(CONCATENATE($E$32,\"!I222\"))),\"\",INDIRECT(CONCATENATE($E$32,\"!I222\")))","v":"N/A"},{"$f":"IF(ISERROR(INDIRECT(CONCATENATE($E$32,\"!I223\"))),\"\",INDIRECT(CONCATENATE($E$32,\"!I223\")))","v":"N/A"},{"$f":"IF(ISERROR(INDIRECT(CONCATENATE($E$32,\"!I224\"))),\"\",INDIRECT(CONCATENATE($E$32,\"!I224\")))","v":"N/A"},{"$f":"IF(ISERROR(INDIRECT(CONCATENATE($E$32,\"!J222\"))),\"\",INDIRECT(CONCATENATE($E$32,\"!J222\")))","v":"N/A"},{"$f":"IF(ISERROR(INDIRECT(CONCATENATE($E$32,\"!J223\"))),\"\",INDIRECT(CONCATENATE($E$32,\"!J223\")))","v":"N/A"},{"$f":"IF(ISERROR(INDIRECT(CONCATENATE($E$32,\"!J224\"))),\"\",INDIRECT(CONCATENATE($E$32,\"!J224\")))","v":"N/A"},{"$f":"IF(ISERROR(INDIRECT(CONCATENATE($E$32,\"!K222\"))),\"\",INDIRECT(CONCATENATE($E$32,\"!K222\")))","v":"N/A"},{"$f":"IF(ISERROR(INDIRECT(CONCATENATE($E$32,\"!K223\"))),\"\",INDIRECT(CONCATENATE($E$32,\"!K223\")))","v":"N/A"},{"$f":"IF(ISERROR(INDIRECT(CONCATENATE($E$32,\"!K224\"))),\"\",INDIRECT(CONCATENATE($E$32,\"!K224\")))","v":"N/A"},{"$f":"IF(ISERROR(INDIRECT(CONCATENATE($E$32,\"!L222\"))),\"\",INDIRECT(CONCATENATE($E$32,\"!L222\")))","v":"N/A"},{"$f":"IF(ISERROR(INDIRECT(CONCATENATE($E$32,\"!L223\"))),\"\",INDIRECT(CONCATENATE($E$32,\"!L223\")))","v":"N/A"},{"$f":"IF(ISERROR(INDIRECT(CONCATENATE($E$32,\"!L224\"))),\"\",INDIRECT(CONCATENATE($E$32,\"!L224\")))","v":"N/A"}]
[]
[]
[null,null,null,null,null,null,"RURAL",null,null,{"$f":"IF(ISERROR(INDIRECT(CONCATENATE(#REF!,\"!A2\"))),\"\",INDIRECT(CONCATENATE(#REF!,\"!A210\")))","v":""},{"$f":"IF(ISERROR(INDIRECT(CONCATENATE($E$32,\"!M222\"))),\"\",INDIRECT(CONCATENATE($E$32,\"!M222\")))","v":"N/A"},{"$f":"IF(ISERROR(INDIRECT(CONCATENATE($E$32,\"!M223\"))),\"\",INDIRECT(CONCATENATE($E$32,\"!M223\")))","v":"N/A"},{"$f":"IF(ISERROR(INDIRECT(CONCATENATE($E$32,\"!M224\"))),\"\",INDIRECT(CONCATENATE($E$32,\"!M224\")))","v":"N/A"},{"$f":"IF(ISERROR(INDIRECT(CONCATENATE($E$32,\"!N222\"))),\"\",INDIRECT(CONCATENATE($E$32,\"!N222\")))","v":"N/A"},{"$f":"IF(ISERROR(INDIRECT(CONCATENATE($E$32,\"!N223\"))),\"\",INDIRECT(CONCATENATE($E$32,\"!N223\")))","v":"N/A"},{"$f":"IF(ISERROR(INDIRECT(CONCATENATE($E$32,\"!N224\"))),\"\",INDIRECT(CONCATENATE($E$32,\"!N224\")))","v":"N/A"},{"$f":"IF(ISERROR(INDIRECT(CONCATENATE($E$32,\"!O222\"))),\"\",INDIRECT(CONCATENATE($E$32,\"!O222\")))","v":"N/A"},{"$f":"IF(ISERROR(INDIRECT(CONCATENATE($E$32,\"!O223\"))),\"\",INDIRECT(CONCATENATE($E$32,\"!O223\")))","v":"N/A"},{"$f":"IF(ISERROR(INDIRECT(CONCATENATE($E$32,\"!O224\"))),\"\",INDIRECT(CONCATENATE($E$32,\"!O224\")))","v":"N/A"},{"$f":"IF(ISERROR(INDIRECT(CONCATENATE($E$32,\"!P222\"))),\"\",INDIRECT(CONCATENATE($E$32,\"!P222\")))","v":"N/A"},{"$f":"IF(ISERROR(INDIRECT(CONCATENATE($E$32,\"!P223\"))),\"\",INDIRECT(CONCATENATE($E$32,\"!P223\")))","v":"N/A"},{"$f":"IF(ISERROR(INDIRECT(CONCATENATE($E$32,\"!P224\"))),\"\",INDIRECT(CONCATENATE($E$32,\"!P224\")))","v":"N/A"},{"$f":"IF(ISERROR(INDIRECT(CONCATENATE($E$32,\"!Q222\"))),\"\",INDIRECT(CONCATENATE($E$32,\"!Q222\")))","v":"N/A"},{"$f":"IF(ISERROR(INDIRECT(CONCATENATE($E$32,\"!Q223\"))),\"\",INDIRECT(CONCATENATE($E$32,\"!Q223\")))","v":"N/A"},{"$f":"IF(ISERROR(INDIRECT(CONCATENATE($E$32,\"!Q224\"))),\"\",INDIRECT(CONCATENATE($E$32,\"!Q224\")))","v":"N/A"}]
[]
[]
[]
[]
[]
[]
[]
[]
[]
[]
[]
[]
[]
[]
[]
[]
[]
[]
[]
[]
[]
[]
[]
[]
[]
[]
[]
[]
[]
[]
[]
[]
[]
[]
[]
[]
[]
[]
[]
[]
[]
[]
[]
[]
[]
[]
[]
[1,"MICS13"]
[null,"Template"]

{"sheet":"MICS13","index":4,"n_rows":1072,"n_cols":81,"rows_kept":1072,"cut":false,"hidden":false,"merged":[[346,52,347,52],[348,52,349,52],[350,52,351,52],[352,52,353,52],[152,52,164,52],[270,52,272,52],[273,52,275,52],[276,52,283,52],[338,54,338,58],[338,59,338,63],[338,64,338,68],[340,52,341,52],[342,52,343,52],[344,52,345,52],[221,52,223,52],[224,52,225,52],[226,52,229,52],[258,54,258,58],[258,59,258,63],[258,64,258,68],[260,52,262,52],[263,52,266,52],[267,52,269,52],[119,64,119,68],[121,52,122,52],[123,52,126,52],[127,52,128,52],[132,54,132,58],[132,59,132,63],[132,64,132,68],[134,52,138,52],[219,54,219,58],[219,59,219,63],[219,64,219,68],[139,52,142,52],[13,64,13,68],[15,52,16,52],[17,52,20,52],[21,52,22,52],[26,54,26,58],[26,59,26,63],[26,64,26,68],[40,52,41,52],[55,54,55,58],[55,59,55,63],[55,64,55,68],[143,0,146,0],[143,52,146,52],[147,0,149,0],[147,52,149,52],[150,0,151,0],[150,52,151,52],[13,54,13,58],[13,59,13,63],[119,54,119,58],[119,59,119,63],[42,52,43,52],[44,52,45,52],[46,0,48,0],[46,52,48,52],[49,0,51,0],[49,52,51,52],[52,0,54,0],[52,52,54,52],[32,52,33,52],[34,52,35,52],[36,52,37,52],[38,0,39,0],[38,52,39,52],[13,2,13,6],[13,7,13,11],[28,52,29,52],[30,0,31,0],[30,52,31,52],[26,2,26,6],[26,7,26,11],[26,12,26,16],[13,12,13,16],[15,0,16,0],[17,0,20,0],[21,0,22,0],[23,0,25,0],[32,0,33,0],[55,2,55,6],[55,7,55,11],[55,12,55,16],[28,0,29,0],[34,0,35,0],[36,0,37,0],[40,0,41,0],[42,0,43,0],[44,0,45,0],[139,0,142,0],[107,0,107,1],[119,2,119,6],[119,7,119,11],[57,0,69,0],[132,12,132,16],[134,0,138,0],[119,12,119,16],[121,0,122,0],[123,0,126,0],[127,0,128,0],[129,0,131,0],[152,0,163,0],[132,2,132,6],[132,7,132,11],[219,2,219,6],[219,7,219,11],[219,12,219,16],[207,0,207,1],[1024,0,1024,2],[1025,0,1025,1],[403,12,403,13],[404,2,404,3],[404,7,404,8],[404,12,404,13],[409,2,409,3],[409,7,409,8],[409,12,409,13],[410,2,410,3],[410,7,410,8],[410,12,410,13],[407,2,407,3],[407,7,407,8],[407,12,407,13],[408,2,408,3],[408,7,408,8],[1030,0,1032,0],[1033,0,1033,2],[398,2,398,5],[221,0,223,0],[398,7,398,10],[398,12,398,15],[399,2,399,4],[399,7,399,9],[399,12,399,14],[400,2,401,3],[400,7,401,8],[400,12,401,13],[405,2,405,3],[405,7,405,8],[405,12,405,13],[406,2,406,3],[406,7,406,8],[406,12,406,13],[401,1,444,1],[402,2,402,3],[402,7,402,8],[402,12,402,13],[403,2,403,3],[403,7,403,8],[408,12,408,13],[413,2,413,3],[413,7,413,8],[413,12,413,13],[414,2,414,3],[414,7,414,8],[414,12,414,13],[411,2,411,3],[411,7,411,8],[411,12,411,13],[412,2,412,3],[412,7,412,8],[412,12,412,13],[417,2,417,3],[417,7,417,8],[417,12,417,13],[418,2,418,3],[418,7,418,8],[418,12,418,13],[415,2,415,3],[415,7,415,8],[415,12,415,13],[416,2,416,3],[416,7,416,8],[416,12,416,13],[421,2,421,3],[421,7,421,8],[421,12,421,13],[422,2,422,3],[422,7,422,8],[422,12,422,13],[419,2,419,3],[419,7,419,8],[419,12,419,13],[420,2,420,3],[420,7,420,8],[420,12,420,13],[425,2,425,3],[425,7,425,8],[425,12,425,13],[426,2,426,3],[426,7,426,8],[426,12,426,13],[423,2,423,3],[423,7,423,8],[423,12,423,13],[424,2,424,3],[424,7,424,8],[424,12,424,13],[429,2,429,3],[429,7,429,8],[429,12,429,13],[430,2,430,3],[430,7,430,8],[430,12,430,13],[427,2,427,3],[427,7,427,8],[427,12,427,13],[428,2,428,3],[428,7,428,8],[428,12,428,13],[433,2,433,3],[433,7,433,8],[433,12,433,13],[434,2,434,3],[434,7,434,8],[434,12,434,13],[431,2,431,3],[431,7,431,8],[431,12,431,13],[432,2,432,3],[432,7,432,8],[432,12,432,13],[437,2,437,3],[437,7,437,9],[437,12,437,13],[438,2,438,3],[438,7,438,8],[438,12,438,13],[435,2,435,3],[435,7,435,8],[435,12,435,13],[436,2,436,4],[436,7,436,8],[436,12,436,13],[441,2,441,3],[441,7,441,8],[441,12,441,13],[442,2,442,3],[442,7,442,8],[442,12,442,13],[439,2,439,3],[439,7,439,8],[439,12,439,13],[440,2,440,3],[440,7,440,8],[440,12,440,13],[445,2,445,3],[445,7,445,8],[445,12,445,13],[446,2,446,3],[446,7,446,8],[446,12,446,13],[443,2,443,3],[443,7,443,8],[443,12,443,13],[444,2,444,3],[444,7,444,8],[444,12,444,13],[449,2,449,3],[449,7,449,8],[449,12,449,13],[450,2,450,3],[450,7,450,8],[450,12,450,13],[447,2,447,3],[447,7,447,8],[447,12,447,13],[448,2,448,3],[448,7,448,8],[448,12,448,13],[453,2,453,3],[453,7,453,8],[453,12,453,13],[454,2,454,3],[454,7,454,8],[454,12,454,13],[451,2,451,3],[451,7,451,8],[451,12,451,13],[452,2,452,3],[452,7,452,8],[452,12,452,13],[457,2,457,3],[457,7,457,8],[457,12,457,14],[458,2,458,3],[458,7,458,8],[458,12,458,13],[455,2,455,3],[455,7,455,8],[455,12,455,13],[456,2,456,3],[456,7,456,8],[456,12,456,13],[461,2,461,3],[461,7,461,8],[461,12,461,13],[462,2,462,3],[462,7,462,8],[462,12,462,13],[459,2,459,3],[459,7,459,8],[459,12,459,13],[460,2,460,3],[460,7,460,8],[460,12,460,13],[465,2,465,3],[465,7,465,8],[465,12,465,13],[466,2,466,3],[466,7,466,8],[466,12,466,13],[463,2,463,3],[463,7,463,8],[463,12,463,13],[464,2,464,3],[464,7,464,8],[464,12,464,13],[469,2,469,3],[469,7,469,8],[469,12,469,13],[470,2,470,3],[470,7,470,8],[470,12,470,13],[467,2,467,3],[467,7,467,8],[467,12,467,13],[468,2,468,3],[468,7,468,8],[468,12,468,13],[471,2,471,6],[471,7,471,8],[471,12,471,13],[472,2,473,3],[472,4,472,6],[472,7,472,8],[472,12,472,13],[473,7,473,11],[473,12,473,13],[476,2,476,3],[476,7,476,8],[476,12,476,13],[477,2,477,4],[477,7,477,8],[477,12,477,13],[474,2,474,3],[474,7,475,8],[474,9,474,11],[474,12,474,13],[475,2,475,3],[475,12,475,13],[482,2,482,3],[482,7,482,8],[482,12,482,13],[483,2,483,3],[483,7,483,8],[483,12,483,13],[478,2,479,3],[478,7,478,8],[478,12,478,13],[479,7,479,9],[479,12,479,13],[480,2,480,3],[480,7,481,8],[480,12,480,13],[481,2,481,3],[481,12,481,13],[486,2,486,3],[486,7,486,8],[486,12,486,13],[487,2,487,3],[487,7,487,8],[487,12,487,13],[484,2,484,3],[484,7,484,8],[484,12,484,13],[485,2,485,3],[485,7,485,8],[485,12,485,13],[490,2,490,3],[490,7,490,8],[490,12,490,13],[491,2,491,3],[491,7,491,8],[491,12,491,13],[488,2,488,3],[488,7,488,8],[488,12,488,13],[489,2,489,3],[489,7,489,8],[489,12,489,13],[494,2,494,3],[494,7,494,8],[494,12,494,13],[495,2,495,3],[495,7,495,8],[495,12,495,13],[492,2,492,3],[492,7,492,8],[492,12,492,13],[493,2,493,3],[493,7,493,8],[493,12,493,13],[498,2,498,3],[498,7,498,8],[498,12,498,13],[499,2,499,3],[499,7,499,8],[499,12,499,13],[496,2,496,3],[496,7,496,8],[496,12,496,13],[497,2,497,3],[497,7,497,8],[497,12,497,13],[502,2,502,3],[502,7,502,8],[502,12,502,13],[503,2,503,3],[503,7,503,8],[503,12,503,13],[500,2,500,3],[500,7,500,8],[500,12,500,13],[501,2,501,3],[501,7,501,8],[501,12,501,13],[506,2,506,3],[506,7,506,8],[506,12,506,13],[507,2,507,3],[507,7,507,8],[507,12,507,13],[504,2,504,3],[504,7,504,8],[504,12,504,13],[505,2,505,3],[505,7,505,8],[505,12,505,13],[510,2,510,3],[510,7,510,8],[510,12,510,13],[511,2,511,3],[511,7,511,8],[511,12,511,13],[508,2,508,3],[508,7,508,8],[508,12,508,13],[509,2,509,3],[509,7,509,8],[509,12,509,13],[514,14,514,16],[515,2,515,3],[515,7,515,8],[512,2,512,3],[512,7,512,8],[512,12,512,13],[513,2,513,4],[513,7,513,8],[513,12,513,16],[516,2,516,3],[516,7,516,9],[516,12,516,13],[517,2,517,3],[517,7,517,8],[517,12,517,13],[514,2,514,3],[514,7,514,8],[514,12,515,13],[520,2,520,3],[520,7,520,8],[520,12,521,13],[521,2,521,3],[521,7,521,8],[522,2,522,3],[522,7,522,8],[522,12,522,13],[518,2,518,3],[518,7,518,8],[518,12,518,13],[519,2,519,3],[519,7,519,8],[519,12,519,14],[525,2,525,3],[525,7,525,8],[525,12,525,13],[526,2,526,3],[526,7,526,8],[526,12,526,13],[523,2,523,3],[523,7,523,8],[523,12,523,13],[524,2,524,3],[524,7,524,8],[524,12,524,13],[529,2,529,3],[529,7,529,8],[529,12,529,13],[530,2,530,3],[530,7,530,8],[530,12,530,13],[527,2,527,3],[527,7,527,8],[527,12,527,13],[528,2,528,3],[528,7,528,8],[528,12,528,13],[533,2,533,3],[533,7,533,8],[533,12,533,13],[534,2,534,3],[534,7,534,8],[534,12,534,13],[531,2,531,3],[531,7,531,8],[531,12,531,13],[532,2,532,3],[532,7,532,8],[532,12,532,13],[537,2,537,3],[537,7,537,8],[537,12,537,13],[538,2,538,3],[538,7,538,8],[538,12,538,13],[535,2,535,3],[535,7,535,8],[535,12,535,13],[536,2,536,3],[536,7,536,8],[536,12,536,13],[541,2,541,3],[541,7,541,8],[541,12,541,13],[542,2,542,3],[542,7,542,8],[542,12,542,13],[539,2,539,3],[539,7,539,8],[539,12,539,13],[540,2,540,3],[540,7,540,8],[540,12,540,13],[545,2,545,3],[545,7,545,8],[545,12,545,13],[546,2,546,3],[546,7,546,8],[546,12,546,13],[543,2,543,3],[543,7,543,8],[543,12,543,13],[544,2,544,3],[544,7,544,8],[544,12,544,13],[549,2,549,3],[549,7,549,8],[549,12,549,13],[550,2,550,3],[550,7,550,8],[550,12,550,13],[547,2,547,3],[547,7,547,8],[547,12,547,13],[548,2,548,3],[548,7,548,8],[548,12,548,13],[553,2,553,3],[553,7,553,8],[553,12,553,13],[554,2,554,3],[554,7,554,8],[554,12,554,13],[551,2,551,3],[551,7,551,8],[551,12,551,13],[552,2,552,3],[552,7,552,8],[552,12,552,13],[557,2,557,3],[557,7,557,8],[557,12,557,13],[558,2,558,3],[558,7,558,8],[558,12,558,13],[555,2,555,3],[555,7,555,8],[555,12,555,13],[556,2,556,3],[556,7,556,8],[556,12,556,13],[561,2,561,3],[561,7,561,8],[561,12,561,13],[562,2,562,3],[562,7,562,8],[562,12,562,13],[559,2,559,3],[559,7,559,8],[559,12,559,13],[560,2,560,3],[560,7,560,8],[560,12,560,13],[565,2,565,3],[565,7,565,8],[565,12,565,13],[566,2,566,3],[566,7,566,8],[566,12,566,13],[563,2,563,3],[563,7,563,8],[563,12,563,13],[564,2,564,3],[564,7,564,8],[564,12,564,13],[569,2,569,3],[569,7,569,8],[569,12,569,13],[570,2,570,3],[570,7,570,8],[570,12,570,13],[567,2,567,3],[567,7,567,8],[567,12,567,13],[568,2,568,3],[568,7,568,8],[568,12,568,13],[573,2,573,3],[573,7,573,8],[573,12,573,13],[574,2,574,3],[574,7,574,8],[574,12,574,13],[571,2,571,3],[571,7,571,8],[571,12,571,13],[572,2,572,3],[572,7,572,8],[572,12,572,13],[577,2,577,3],[577,7,577,8],[577,12,577,13],[578,2,578,3],[578,7,578,8],[578,12,578,13],[575,2,575,3],[575,7,575,8],[575,12,575,13],[576,2,576,3],[576,7,576,8],[576,12,576,14],[581,2,581,3],[581,7,581,8],[581,12,581,13],[582,2,582,3],[582,7,582,8],[582,12,582,13],[579,2,579,3],[579,7,579,8],[579,12,579,13],[580,2,580,3],[580,7,580,8],[580,12,580,13],[585,2,585,3],[585,7,585,8],[585,12,585,13],[586,2,586,3],[586,7,586,8],[586,12,586,13],[583,2,583,3],[583,7,583,8],[583,12,583,13],[584,2,584,3],[584,7,584,8],[584,12,584,13],[589,2,589,3],[589,7,589,8],[589,12,589,13],[590,2,590,3],[590,7,590,8],[590,12,590,13],[587,2,587,3],[587,7,587,8],[587,12,587,13],[588,2,588,3],[588,7,588,8],[588,12,588,13],[593,2,593,3],[593,7,593,8],[593,12,593,13],[594,2,594,3],[594,7,594,8],[594,12,594,13],[591,2,591,3],[591,7,591,8],[591,12,591,13],[592,2,592,3],[592,7,592,8],[592,12,592,13],[597,2,597,3],[597,7,597,8],[597,12,597,13],[598,2,598,3],[598,7,598,8],[598,12,598,13],[595,2,595,3],[595,7,595,8],[595,12,595,13],[596,2,596,3],[596,7,596,8],[596,12,596,13],[601,2,601,3],[601,7,601,8],[601,12,601,13],[602,2,602,3],[602,7,602,8],[602,12,602,13],[599,2,599,3],[599,7,599,8],[599,12,599,13],[600,2,600,3],[600,7,600,8],[600,12,600,13],[605,2,605,3],[605,7,605,8],[605,12,605,13],[606,2,606,3],[606,7,606,8],[606,12,606,13],[603,2,603,3],[603,7,603,8],[603,12,603,13],[604,2,604,3],[604,7,604,8],[604,12,604,13],[609,2,609,3],[609,7,609,8],[609,12,609,13],[610,2,610,3],[610,7,610,8],[610,12,610,13],[607,2,607,3],[607,7,607,8],[607,12,607,13],[608,2,608,3],[608,7,608,8],[608,12,608,13],[613,2,613,3],[613,7,613,8],[613,12,613,13],[614,2,614,3],[614,7,614,8],[614,12,614,13],[611,2,611,3],[611,7,611,8],[611,12,611,13],[612,2,612,3],[612,7,612,8],[612,12,612,13],[617,2,617,3],[617,7,617,8],[617,12,617,13],[618,2,618,3],[618,7,618,8],[618,12,618,13],[615,2,615,3],[615,7,615,8],[615,12,615,13],[616,2,616,3],[616,7,616,8],[616,12,616,13],[621,2,621,3],[621,7,621,8],[621,12,621,13],[622,2,622,3],[622,7,622,8],[622,12,622,13],[619,2,619,3],[619,7,619,8],[619,12,619,13],[620,2,620,3],[620,7,620,8],[620,12,620,13],[625,2,625,3],[625,7,625,8],[625,12,625,13],[626,2,626,3],[626,7,626,8],[626,12,626,13],[623,2,623,3],[623,7,623,8],[623,12,623,13],[624,2,624,3],[624,7,624,8],[624,12,624,13],[629,2,629,3],[629,7,629,8],[629,12,629,13],[630,2,630,3],[630,7,630,8],[630,12,630,13],[627,2,627,3],[627,7,627,8],[627,12,627,13],[628,2,628,3],[628,7,628,8],[628,12,628,13],[633,2,633,3],[633,7,633,8],[633,12,633,13],[634,2,634,3],[634,7,634,8],[634,12,634,13],[631,2,631,3],[631,7,631,8],[631,12,631,13],[632,2,632,3],[632,7,632,8],[632,12,632,13],[637,2,637,3],[637,7,637,8],[637,12,637,13],[638,2,638,3],[638,7,638,8],[638,12,638,13],[635,2,635,3],[635,7,635,8],[635,12,635,13],[636,2,636,3],[636,7,636,8],[636,12,636,13],[641,2,641,3],[641,7,641,8],[641,12,641,13],[642,2,642,3],[642,7,642,8],[642,12,642,13],[639,2,639,3],[639,7,639,8],[639,12,639,13],[640,2,640,3],[640,7,640,8],[640,12,640,13],[645,2,645,3],[645,7,645,8],[645,12,645,13],[646,2,646,3],[646,7,646,8],[646,12,646,13],[643,2,643,3],[643,7,643,8],[643,12,643,13],[644,2,644,3],[644,7,644,8],[644,12,644,13],[649,2,649,3],[649,7,649,8],[649,12,649,13],[650,2,650,3],[650,7,650,8],[650,12,650,13],[647,2,647,3],[647,7,647,8],[647,12,647,13],[648,2,648,3],[648,7,648,8],[648,12,648,13],[653,2,653,3],[653,7,653,8],[653,12,653,13],[654,2,654,3],[654,7,654,8],[654,12,654,13],[651,2,651,3],[651,7,651,8],[651,12,651,13],[652,2,652,3],[652,7,652,8],[652,12,652,13],[657,2,657,3],[657,7,657,8],[657,12,657,13],[658,2,658,3],[658,7,658,8],[658,12,658,13],[655,2,655,3],[655,7,655,8],[655,12,655,13],[656,2,656,3],[656,7,656,8],[656,12,656,13],[661,2,661,3],[661,7,661,8],[661,12,661,13],[662,2,662,3],[662,7,662,8],[662,12,662,13],[659,2,659,3],[659,7,659,8],[659,12,659,13],[660,2,660,3],[660,7,660,8],[660,12,660,13],[665,2,665,3],[665,7,665,8],[665,12,665,13],[666,2,666,3],[666,7,666,8],[666,12,666,13],[663,2,663,3],[663,7,663,8],[663,12,663,13],[664,2,664,3],[664,7,664,8],[664,12,664,13],[669,2,669,3],[669,7,669,8],[669,12,669,13],[670,2,670,3],[670,7,670,8],[670,12,670,13],[667,2,667,3],[667,7,667,8],[667,12,667,13],[668,2,668,3],[668,7,668,8],[668,12,668,13],[673,2,673,3],[673,7,673,8],[673,12,673,13],[674,2,674,3],[674,7,674,8],[674,12,674,13],[671,2,671,3],[671,7,671,8],[671,12,671,13],[672,2,672,3],[672,7,672,8],[672,12,672,13],[677,2,677,3],[677,7,677,8],[677,12,677,13],[678,2,678,3],[678,7,678,8],[678,12,678,13],[675,2,675,3],[675,7,675,8],[675,12,675,13],[676,2,676,3],[676,7,676,8],[676,12,676,13],[681,2,681,3],[681,7,681,8],[681,12,681,13],[682,2,682,3],[682,7,682,8],[682,12,682,13],[679,2,679,3],[679,7,679,8],[679,12,679,13],[680,2,680,3],[680,7,680,8],[680,12,680,13],[685,2,685,3],[685,7,685,8],[685,12,685,13],[686,2,686,3],[686,7,686,8],[686,12,686,13],[683,2,683,3],[683,7,683,8],[683,12,683,13],[684,2,684,3],[684,7,684,8],[684,12,684,13],[689,2,689,3],[689,7,689,8],[689,12,689,13],[687,2,687,3],[687,7,687,8],[687,12,687,13],[688,2,688,3],[688,7,688,8],[688,12,688,13]]}
["PAN"]
[{"$f":"A1026","v":"Panama"}]
[{"$f":"A1034","v":"2013"}]
["Use of drinking water sources"]
[" by wealth quintile and sub-national region"]
["Notes:"]
["WHO/UNICEF JMP customised wealth index excludes water,"]
[" sanitation and hygiene assets."]
["Survey used for analysis:",{"$f":"A1025","v":"MICS13"}]
[{"$f":"B1028","v":""}]
[{"$f":"B1027","v":""}]
[]
[]
["Use of drinking water sources",null,"NATIONAL wealth index quintile",null,null,null,null,"URBAN wealth index quintile",null,null,null,null,"RURAL wealth index quintile",null,null,null,null,"SUB-REGIONS:",null,null,null,null,null,null,null,null,null,null,null,null,null,null,null,null,null,null,null,null,null,null,null,null,null,null,null,null,null,null,null,null,null,null,"Raw numbers of respondents:","Use of drinking water sources","NATIONAL wealth index quintile",null,null,null,null,"URBAN wealth index quintile",null,null,null,null,"RURAL wealth index quintile",null,null,null,null,"SUB-REGIONS:"]
["Weighted percentage (used in graphs)",null,"Poorest","Poor","Middle","Rich","Richest","Poorest","Poor","Middle","Rich","Richest","Poorest","Poor","Middle","Rich","Richest","Bocas del Toro","Chiriquí","Coclé","Colón","Darien","Emberá Wounaan","Herrera","Kuna Yala","Los Santos","Ngöbe Buglé","Panamá","Veraguas",null,null,null,null,null,null,null,null,null,null,null,null,null,null,null,null,null,null,null,null,null,null,null,"Water data, raw numbers (weighted)",null,"Poorest","Poor","Middle","Rich","Richest","Poorest","Poor","Middle","Rich","Richest","Poorest","Poor","Middle","Rich","Richest","Bocas del Toro","Chiriquí","Coclé","Colón","Darien","Emberá Wounaan","Herrera","Kuna Yala","Los Santos","Ngöbe Buglé","Panamá","Veraguas"]
["Water","Improved",86.750032566288411,99.832086071929282,99.865359414657888,100,99.776266775910997,99.838801301060514,99.987742180568205,100,99.930705345495412,100,66.860208049819477,91.243012954869911,98.464995524380655,99.303349479584639,99.150752806151729,93.562823265734593,97.705987420496825,99.212999983049812,97.669209891084506,88.426708766709623,47.36322148662763,97.497204191772013,83.140863617429929,99.925367317016523,54.311900635550089,99.71551006706899,93.961302527510966,null,null,null,null,null,null,null,null,null,null,null,null,null,null,null,null,null,null,null,null,null,null,null,"Water","Improved","N/A","N/A","N/A","N/A","N/A","N/A","N/A","N/A","N/A","N/A","N/A","N/A","N/A","N/A","N/A","N/A","N/A","N/A","N/A","N/A","N/A","N/A","N/A","N/A","N/A","N/A","N/A"]
[null,"Not Improved",13.249967433711907,0.16791392807069719,0.13464058534213549,0,0.22373322408901544,0.16119869893945762,1.2257819431783773E-2,0,6.929465450458934E-2,0,33.139791950180324,8.7569870451301437,1.5350044756193562,0.69665052041538722,0.84924719384825831,6.4371767342653543,2.2940125795031832,0.78700001695017896,2.3307901089154854,11.573291233290393,52.636778513372221,2.5027958082280293,16.859136382570036,7.4632682983480664E-2,45.688099364449819,0.28448993293100844,6.0386974724889528,null,null,null,null,null,null,null,null,null,null,null,null,null,null,null,null,null,null,null,null,null,null,null,null,"Not Improved","N/A","N/A","N/A","N/A","N/A","N/A","N/A","N/A","N/A","N/A","N/A","N/A","N/A","N/A","N/A","N/A","N/A","N/A","N/A","N/A","N/A","N/A","N/A","N/A","N/A","N/A","N/A"]
["Water ladder","Basic",{"$f":"C16*C23/100","v":86.576532501155839},{"$f":"D16*D23/100","v":99.832086071929282},{"$f":"E16*E23/100","v":99.865359414657888},100,99.776266775910983,99.738962499759452,99.987742180568205,100,99.930705345495412,100,66.592767217620192,91.243012954869926,98.46499552438064,99.303349479584625,99.150752806151729,93.562823265734593,97.705987420496825,99.212999983049812,97.473871471302331,88.073001931642779,47.363221486627623,97.497204191772013,83.140863617429929,99.925367317016523,53.768781629194592,99.71551006706899,93.961302527510966,null,null,null,null,null,null,null,null,null,null,null,null,null,null,null,null,null,null,null,null,null,null,null,"Water ladder","Basic","N/A","N/A","N/A","N/A","N/A","N/A","N/A","N/A","N/A","N/A","N/A","N/A","N/A","N/A","N/A","N/A","N/A","N/A","N/A","N/A","N/A","N/A","N/A","N/A","N/A","N/A","N/A"]
[null,"Limited",{"$f":"C16*C22/100","v":0.17350006513257682},{"$f":"D16*D22/100","v":0},{"$f":"E16*E22/100","v":0},0,0,9.9838801301060515E-2,0,0,0,0,0.26744083219927789,0,0,0,0,0,0,0,0.19533841978216901,0.35370683506683853,0,0,0,0,0.54311900635550092,0,0,null,null,null,null,null,null,null,null,null,null,null,null,null,null,null,null,null,null,null,null,null,null,null,null,"Limited","N/A","N/A","N/A","N/A","N/A","N/A","N/A","N/A","N/A","N/A","N/A","N/A","N/A","N/A","N/A","N/A","N/A","N/A","N/A","N/A","N/A","N/A","N/A","N/A","N/A","N/A","N/A"]
[null,"Unimproved",{"$f":"100-C18-C19-C21","v":10.183728628980042},{"$f":"100-D18-D19-D21","v":0.15737372832022375},{"$f":"100-E18-E19-E21","v":0.13125021033083561},0,0.22373322408901686,0.1611986989394871,1.2257819431795269E-2,0,6.9294654504588493E-2,0,26.139408922803909,6.0102361724760653,1.1557258797872989,0.65957690843082695,0.84924719384827085,4.0323120970562716,2.2940125795031747,0.34455125054331998,1.2898441888767966,2.5868991883612313,1.5631940186722204E-13,1.5864176940229244,1.6815094551633916,7.4632682983477139E-2,41.107966507577046,0.28448993293100955,5.3228725637004803,null,null,null,null,null,null,null,null,null,null,null,null,null,null,null,null,null,null,null,null,null,null,null,null,"Unimproved","N/A","N/A","N/A","N/A","N/A","N/A","N/A","N/A","N/A","N/A","N/A","N/A","N/A","N/A","N/A","N/A","N/A","N/A","N/A","N/A","N/A","N/A","N/A","N/A","N/A","N/A","N/A"]
[null,"Surface water",3.066238804731543,1.0540199750493829E-2,3.390375011276152E-3,0,0,0,0,0,0,0,7.0003830273766221,2.7467508726540091,0.37927859583206092,3.707361198454779E-2,0,2.4048646372091356,0,0.44244876640686787,1.040945920038703,8.9863920449291523,52.636778513372221,0.9163781142050621,15.17762692740668,0,4.580132856872857,0,0.71582490878855365,null,null,null,null,null,null,null,null,null,null,null,null,null,null,null,null,null,null,null,null,null,null,null,null,"Surface water","N/A","N/A","N/A","N/A","N/A","N/A","N/A","N/A","N/A","N/A","N/A","N/A","N/A","N/A","N/A","N/A","N/A","N/A","N/A","N/A","N/A","N/A","N/A","N/A","N/A","N/A","N/A"]
["Improved water point at more than 30 minutes","Yes",0.2,0,0,0,0,0.1,0,0,0,0,0.4,0,0,0,0,0,0,0,0.2,0.4,0,0,0,0,1,0,0,null,null,null,null,null,null,null,null,null,null,null,null,null,null,null,null,null,null,null,null,null,null,null,"Improved water point at more than 30 minutes","Yes","N/A","N/A","N/A","N/A","N/A","N/A","N/A","N/A","N/A","N/A","N/A","N/A","N/A","N/A","N/A","N/A","N/A","N/A","N/A","N/A","N/A","N/A","N/A","N/A","N/A","N/A","N/A"]
[null,"No",99.8,100,100,100,100,99.9,100,100,100,100,99.6,100,100,100,100,100,100,100,99.8,99.6,100,100,100,100,99,100,100,null,null,null,null,null,null,null,null,null,null,null,null,null,null,null,null,null,null,null,null,null,null,null,null,"No","N/A","N/A","N/A","N/A","N/A","N/A","N/A","N/A","N/A","N/A","N/A","N/A","N/A","N/A","N/A","N/A","N/A","N/A","N/A","N/A","N/A","N/A","N/A","N/A","N/A","N/A","N/A"]
["Manually calculated ratios","Improved wells"]
[null,"Improved springs"]
[null,"Other"]
[null,null,"NATIONAL wealth index quintile",null,null,null,null,"URBAN wealth index quintile",null,null,null,null,"RURAL wealth index quintile",null,null,null,null,"SUB-REGIONS:",null,null,null,null,null,null,null,null,null,null,null,null,null,null,null,null,null,null,null,null,null,null,null,null,null,null,null,null,null,null,null,null,null,null,"Raw numbers of respondents:","Use of drinking water sources","NATIONAL wealth index quintile",null,null,null,null,"URBAN wealth index quintile",null,null,null,null,"RURAL wealth index quintile",null,null,null,null,"SUB-REGIONS:"]
["Percentage based on weighted population",null,"Poorest","Poor","Middle","Rich","Richest","Poorest","Poor","Middle","Rich","Richest","Poorest","Poor","Middle","Rich","Richest","Bocas del Toro","Chiriquí","Coclé","Colón","Darien","Emberá Wounaan","Herrera","Kuna Yala","Los Santos","Ngöbe Buglé","Panamá","Veraguas",null,null,null,null,null,null,null,null,null,null,null,null,null,null,null,null,null,null,null,null,null,null,null,"Water data, raw numbers (weighted)",null,"Poorest","Poor","Middle","Rich","Richest","Poorest","Poor","Middle","Rich","Richest","Poorest","Poor","Middle","Rich","Richest","Bocas del Toro","Chiriquí","Coclé","Colón","Darien","Emberá Wounaan","Herrera","Kuna Yala","Los Santos","Ngöbe Buglé","Panamá","Veraguas"]
["Piped water","Yes",78.900000000000006,96.2,98.1,98.7,95.7,97.5,99,99.3,99.1,95.2,56.6,83.2,89.8,92.3,93.9,79.3,87.4,95.4,91.7,81.5,27.7,95.3,83,98.8,49.6,98.2,92,null,null,null,null,null,null,null,null,null,null,null,null,null,null,null,null,null,null,null,null,null,null,null,"Piped water","Yes","N/A","N/A","N/A","N/A","N/A","N/A","N/A","N/A","N/A","N/A","N/A","N/A","N/A","N/A","N/A","N/A","N/A","N/A","N/A","N/A","N/A","N/A","N/A","N/A","N/A","N/A","N/A"]
[null,"No",21.1,3.8,1.9,1.3,4.3,2.5,1,0.7,0.9,4.8,43.4,16.8,10.199999999999999,7.7,6.1,20.7,12.6,4.5999999999999996,8.3000000000000007,18.5,72.3,4.7,17,1.2,50.4,1.8,8,null,null,null,null,null,null,null,null,null,null,null,null,null,null,null,null,null,null,null,null,null,null,null,null,"No","N/A","N/A","N/A","N/A","N/A","N/A","N/A","N/A","N/A","N/A","N/A","N/A","N/A","N/A","N/A","N/A","N/A","N/A","N/A","N/A","N/A","N/A","N/A","N/A","N/A","N/A","N/A"]
["Piped water on premises","Yes",78.900000000000006,96.2,98.1,98.7,95.7,97.5,99,99.3,99.1,95.2,56.6,83.2,89.8,92.3,93.9,79.3,87.4,95.4,91.7,81.5,27.7,95.3,83,98.8,49.6,98.2,92,null,null,null,null,null,null,null,null,null,null,null,null,null,null,null,null,null,null,null,null,null,null,null,"Piped water on premises","Yes","N/A","N/A","N/A","N/A","N/A","N/A","N/A","N/A","N/A","N/A","N/A","N/A","N/A","N/A","N/A","N/A","N/A","N/A","N/A","N/A","N/A","N/A","N/A","N/A","N/A","N/A","N/A"]
[null,"No",21.1,3.8,1.9,1.3,4.3,2.5,1,0.7,0.9,4.8,43.4,16.8,10.199999999999999,7.7,6.1,20.7,12.6,4.5999999999999996,8.3000000000000007,18.5,72.3,4.7,17,1.2,50.4,1.8,8,null,null,null,null,null,null,null,null,null,null,null,null,null,null,null,null,null,null,null,null,null,null,null,null,"No","N/A","N/A","N/A","N/A","N/A","N/A","N/A","N/A","N/A","N/A","N/A","N/A","N/A","N/A","N/A","N/A","N/A","N/A","N/A","N/A","N/A","N/A","N/A","N/A","N/A","N/A","N/A"]
["Piped water into dwelling","Yes","N/A","N/A","N/A","N/A","N/A","N/A","N/A","N/A","N/A","N/A","N/A","N/A","N/A","N/A","N/A","N/A","N/A","N/A","N/A","N/A","N/A","N/A","N/A","N/A","N/A","N/A","N/A",null,null,null,null,null,null,null,null,null,null,null,null,null,null,null,null,null,null,null,null,null,null,null,"Piped water into dwelling","Yes","N/A","N/A","N/A","N/A","N/A","N/A","N/A","N/A","N/A","N/A","N/A","N/A","N/A","N/A","N/A","N/A","N/A","N/A","N/A","N/A","N/A","N/A","N/A","N/A","N/A","N/A","N/A"]
[null,"No","N/A","N/A","N/A","N/A","N/A","N/A","N/A","N/A","N/A","N/A","N/A","N/A","N/A","N/A","N/A","N/A","N/A","N/A","N/A","N/A","N/A","N/A","N/A","N/A","N/A","N/A","N/A",null,null,null,null,null,null,null,null,null,null,null,null,null,null,null,null,null,null,null,null,null,null,null,null,"No","N/A","N/A","N/A","N/A","N/A","N/A","N/A","N/A","N/A","N/A","N/A","N/A","N/A","N/A","N/A","N/A","N/A","N/A","N/A","N/A","N/A","N/A","N/A","N/A","N/A","N/A","N/A"]
["Water source on premises","Yes",89.3,98.9,99,99.3,96.2,99.3,99.2,99.4,99.1,95.3,77.599999999999994,90.5,96.7,97.4,98.5,91.8,96.4,99.4,93.1,87.8,47,97.8,84,99.5,73.900000000000006,98.4,94.9,null,null,null,null,null,null,null,null,null,null,null,null,null,null,null,null,null,null,null,null,null,null,null,"Water source on premises","Yes","N/A","N/A","N/A","N/A","N/A","N/A","N/A","N/A","N/A","N/A","N/A","N/A","N/A","N/A","N/A","N/A","N/A","N/A","N/A","N/A","N/A","N/A","N/A","N/A","N/A","N/A","N/A"]
[null,"No",10.7,1.1000000000000001,1,0.7,3.8,0.7,0.8,0.6,0.9,4.7,22.4,9.5,3.3,2.6,1.5,8.1999999999999993,3.6,0.6,6.9,12.2,53,2.2000000000000002,16,0.5,26.1,1.6,5.0999999999999996,null,null,null,null,null,null,null,null,null,null,null,null,null,null,null,null,null,null,null,null,null,null,null,null,"No","N/A","N/A","N/A","N/A","N/A","N/A","N/A","N/A","N/A","N/A","N/A","N/A","N/A","N/A","N/A","N/A","N/A","N/A","N/A","N/A","N/A","N/A","N/A","N/A","N/A","N/A","N/A"]
["Improved Water source on premises","Yes",84.1,98.9,99,99.3,96.1,99.2,99.2,99.4,99.1,95.3,63.2,88.5,96.1,97.2,98,88.8,95.2,99.2,92.5,84.9,46.5,96.9,83,99.5,52.4,98.4,92.4,null,null,null,null,null,null,null,null,null,null,null,null,null,null,null,null,null,null,null,null,null,null,null,"Improved water source on premises","Yes","N/A","N/A","N/A","N/A","N/A","N/A","N/A","N/A","N/A","N/A","N/A","N/A","N/A","N/A","N/A","N/A","N/A","N/A","N/A","N/A","N/A","N/A","N/A","N/A","N/A","N/A","N/A"]
[null,"No",15.9,1.1000000000000001,1,0.7,3.9,0.8,0.8,0.6,0.9,4.7,36.799999999999997,11.5,3.9,2.8,2,11.2,4.8,0.8,7.5,15.1,53.5,3.1,17,0.5,47.6,1.6,7.6,null,null,null,null,null,null,null,null,null,null,null,null,null,null,null,null,null,null,null,null,null,null,null,null,"No","N/A","N/A","N/A","N/A","N/A","N/A","N/A","N/A","N/A","N/A","N/A","N/A","N/A","N/A","N/A","N/A","N/A","N/A","N/A","N/A","N/A","N/A","N/A","N/A","N/A","N/A","N/A"]
["Piped water on premises available when needed","Yes","N/A","N/A","N/A","N/A","N/A","N/A","N/A","N/A","N/A","N/A","N/A","N/A","N/A","N/A","N/A","N/A","N/A","N/A","N/A","N/A","N/A","N/A","N/A","N/A","N/A","N/A","N/A",null,null,null,null,null,null,null,null,null,null,null,null,null,null,null,null,null,null,null,null,null,null,null,"Piped water on premises available when needed","Yes","N/A","N/A","N/A","N/A","N/A","N/A","N/A","N/A","N/A","N/A","N/A","N/A","N/A","N/A","N/A","N/A","N/A","N/A","N/A","N/A","N/A","N/A","N/A","N/A","N/A","N/A","N/A"]
[null,"No","N/A","N/A","N/A","N/A","N/A","N/A","N/A","N/A","N/A","N/A","N/A","N/A","N/A","N/A","N/A","N/A","N/A","N/A","N/A","N/A","N/A","N/A","N/A","N/A","N/A","N/A","N/A",null,null,null,null,null,null,null,null,null,null,null,null,null,null,null,null,null,null,null,null,null,null,null,null,"No","N/A","N/A","N/A","N/A","N/A","N/A","N/A","N/A","N/A","N/A","N/A","N/A","N/A","N/A","N/A","N/A","N/A","N/A","N/A","N/A","N/A","N/A","N/A","N/A","N/A","N/A","N/A"]
["Water point at more than 30 minutes","Yes",0.6,0.1,0.1,0,0,0.1,0,0,0.1,0,1.6,0.3,0,0.2,0.3,0.2,0,0,0.7,0.7,0,0,7.3,0,2.2999999999999998,0,0.3,null,null,null,null,null,null,null,null,null,null,null,null,null,null,null,null,null,null,null,null,null,null,null,"Water point at more than 30 minutes","Yes","N/A","N/A","N/A","N/A","N/A","N/A","N/A","N/A","N/A","N/A","N/A","N/A","N/A","N/A","N/A","N/A","N/A","N/A","N/A","N/A","N/A","N/A","N/A","N/A","N/A","N/A","N/A"]
[null,"No",99.4,99.9,99.9,100,100,99.9,100,100,99.9,100,98.4,99.7,100,99.8,99.7,99.8,100,100,99.3,99.3,100,100,92.7,100,97.7,100,99.7,null,null,null,null,null,null,null,null,null,null,null,null,null,null,null,null,null,null,null,null,null,null,null,null,"No","N/A","N/A","N/A","N/A","N/A","N/A","N/A","N/A","N/A","N/A","N/A","N/A","N/A","N/A","N/A","N/A","N/A","N/A","N/A","N/A","N/A","N/A","N/A","N/A","N/A","N/A","N/A"]
["Water source available when needed","Yes","N/A","N/A","N/A","N/A","N/A","N/A","N/A","N/A","N/A","N/A","N/A","N/A","N/A","N/A","N/A","N/A","N/A","N/A","N/A","N/A","N/A","N/A","N/A","N/A","N/A","N/A","N/A",null,null,null,null,null,null,null,null,null,null,null,null,null,null,null,null,null,null,null,null,null,null,null,"Water source available when needed","Yes","N/A","N/A","N/A","N/A","N/A","N/A","N/A","N/A","N/A","N/A","N/A","N/A","N/A","N/A","N/A","N/A","N/A","N/A","N/A","N/A","N/A","N/A","N/A","N/A","N/A","N/A","N/A"]
[null,"No","N/A","N/A","N/A","N/A","N/A","N/A","N/A","N/A","N/A","N/A","N/A","N/A","N/A","N/A","N/A","N/A","N/A","N/A","N/A","N/A","N/A","N/A","N/A","N/A","N/A","N/A","N/A",null,null,null,null,null,null,null,null,null,null,null,null,null,null,null,null,null,null,null,null,null,null,null,null,"No","N/A","N/A","N/A","N/A","N/A","N/A","N/A","N/A","N/A","N/A","N/A","N/A","N/A","N/A","N/A","N/A","N/A","N/A","N/A","N/A","N/A","N/A","N/A","N/A","N/A","N/A","N/A"]
["Improved water source available when needed","Yes","N/A","N/A","N/A","N/A","N/A","N/A","N/A","N/A","N/A","N/A","N/A","N/A","N/A","N/A","N/A","N/A","N/A","N/A","N/A","N/A","N/A","N/A","N/A","N/A","N/A","N/A","N/A",null,null,null,null,null,null,null,null,null,null,null,null,null,null,null,null,null,null,null,null,null,null,null,"Improved water source available when needed","Yes","N/A","N/A","N/A","N/A","N/A","N/A","N/A","N/A","N/A","N/A","N/A","N/A","N/A","N/A","N/A","N/A","N/A","N/A","N/A","N/A","N/A","N/A","N/A","N/A","N/A","N/A","N/A"]
[null,"No","N/A","N/A","N/A","N/A","N/A","N/A","N/A","N/A","N/A","N/A","N/A","N/A","N/A","N/A","N/A","N/A","N/A","N/A","N/A","N/A","N/A","N/A","N/A","N/A","N/A","N/A","N/A",null,null,null,null,null,null,null,null,null,null,null,null,null,null,null,null,null,null,null,null,null,null,null,null,"No","N/A","N/A","N/A","N/A","N/A","N/A","N/A","N/A","N/A","N/A","N/A","N/A","N/A","N/A","N/A","N/A","N/A","N/A","N/A","N/A","N/A","N/A","N/A","N/A","N/A","N/A","N/A"]
["Microbiological quality at point of collection","Not contaminated (No E. coli in 100 mL)","N/A","N/A","N/A","N/A","N/A","N/A","N/A","N/A","N/A","N/A","N/A","N/A","N/A","N/A","N/A","N/A","N/A","N/A","N/A","N/A","N/A","N/A","N/A","N/A","N/A","N/A","N/A",null,null,null,null,null,null,null,null,null,null,null,null,null,null,null,null,null,null,null,null,null,null,null,"Microbiological quality at point of collection","Not contaminated (No E. coli in 100 mL)","N/A","N/A","N/A","N/A","N/A","N/A","N/A","N/A","N/A","N/A","N/A","N/A","N/A","N/A","N/A","N/A","N/A","N/A","N/A","N/A","N/A","N/A","N/A","N/A","N/A","N/A","N/A"]
[null,"Contaminated (E. coli detected in 100 mL)","N/A","N/A","N/A","N/A","N/A","N/A","N/A","N/A","N/A","N/A","N/A","N/A","N/A","N/A","N/A","N/A","N/A","N/A","N/A","N/A","N/A","N/A","N/A","N/A","N/A","N/A","N/A",null,null,null,null,null,null,null,null,null,null,null,null,null,null,null,null,null,null,null,null,null,null,null,null,"Contaminated (E. coli detected in 100 mL)","N/A","N/A","N/A","N/A","N/A","N/A","N/A","N/A","N/A","N/A","N/A","N/A","N/A","N/A","N/A","N/A","N/A","N/A","N/A","N/A","N/A","N/A","N/A","N/A","N/A","N/A","N/A"]
[null,"Highly contaminated (>100 CFU/100 mL)","N/A","N/A","N/A","N/A","N/A","N/A","N/A","N/A","N/A","N/A","N/A","N/A","N/A","N/A","N/A","N/A","N/A","N/A","N/A","N/A","N/A","N/A","N/A","N/A","N/A","N/A","N/A",null,null,null,null,null,null,null,null,null,null,null,null,null,null,null,null,null,null,null,null,null,null,null,null,"Highly contaminated (>100 CFU/100 mL)","N/A","N/A","N/A","N/A","N/A","N/A","N/A","N/A","N/A","N/A","N/A","N/A","N/A","N/A","N/A","N/A","N/A","N/A","N/A","N/A","N/A","N/A","N/A","N/A","N/A","N/A","N/A"]
["Microbiological quality of improved water sources at point of collection","Not contaminated (No E. coli in 100 mL)","N/A","N/A","N/A","N/A","N/A","N/A","N/A","N/A","N/A","N/A","N/A","N/A","N/A","N/A","N/A","N/A","N/A","N/A","N/A","N/A","N/A","N/A","N/A","N/A","N/A","N/A","N/A",null,null,null,null,null,null,null,null,null,null,null,null,null,null,null,null,null,null,null,null,null,null,null,"Microbiological quality of improved water sources at point of collection","Not contaminated (No E. coli in 100 mL)","N/A","N/A","N/A","N/A","N/A","N/A","N/A","N/A","N/A","N/A","N/A","N/A","N/A","N/A","N/A","N/A","N/A","N/A","N/A","N/A","N/A","N/A","N/A","N/A","N/A","N/A","N/A"]
[null,"Contaminated (E. coli detected in 100 mL)","N/A","N/A","N/A","N/A","N/A","N/A","N/A","N/A","N/A","N/A","N/A","N/A","N/A","N/A","N/A","N/A","N/A","N/A","N/A","N/A","N/A","N/A","N/A","N/A","N/A","N/A","N/A",null,null,null,null,null,null,null,null,null,null,null,null,null,null,null,null,null,null,null,null,null,null,null,null,"Contaminated (E. coli detected in 100 mL)","N/A","N/A","N/A","N/A","N/A","N/A","N/A","N/A","N/A","N/A","N/A","N/A","N/A","N/A","N/A","N/A","N/A","N/A","N/A","N/A","N/A","N/A","N/A","N/A","N/A","N/A","N/A"]
[null,"Highly contaminated (>100 CFU/100 mL)","N/A","N/A","N/A","N/A","N/A","N/A","N/A","N/A","N/A","N/A","N/A","N/A","N/A","N/A","N/A","N/A","N/A","N/A","N/A","N/A","N/A","N/A","N/A","N/A","N/A","N/A","N/A",null,null,null,null,null,null,null,null,null,null,null,null,null,null,null,null,null,null,null,null,null,null,null,null,"Highly contaminated (>100 CFU/100 mL)","N/A","N/A","N/A","N/A","N/A","N/A","N/A","N/A","N/A","N/A","N/A","N/A","N/A","N/A","N/A","N/A","N/A","N/A","N/A","N/A","N/A","N/A","N/A","N/A","N/A","N/A","N/A"]
["Microbiological quality of piped on premises at point of collection","Not contaminated (No E. coli in 100 mL)","N/A","N/A","N/A","N/A","N/A","N/A","N/A","N/A","N/A","N/A","N/A","N/A","N/A","N/A","N/A","N/A","N/A","N/A","N/A","N/A","N/A","N/A","N/A","N/A","N/A","N/A","N/A",null,null,null,null,null,null,null,null,null,null,null,null,null,null,null,null,null,null,null,null,null,null,null,"Microbiological quality of piped on premises at point of collection","Not contaminated (No E. coli in 100 mL)","N/A","N/A","N/A","N/A","N/A","N/A","N/A","N/A","N/A","N/A","N/A","N/A","N/A","N/A","N/A","N/A","N/A","N/A","N/A","N/A","N/A","N/A","N/A","N/A","N/A","N/A","N/A"]
[null,"Contaminated (E. coli detected in 100 mL)","N/A","N/A","N/A","N/A","N/A","N/A","N/A","N/A","N/A","N/A","N/A","N/A","N/A","N/A","N/A","N/A","N/A","N/A","N/A","N/A","N/A","N/A","N/A","N/A","N/A","N/A","N/A",null,null,null,null,null,null,null,null,null,null,null,null,null,null,null,null,null,null,null,null,null,null,null,null,"Contaminated (E. coli detected in 100 mL)","N/A","N/A","N/A","N/A","N/A","N/A","N/A","N/A","N/A","N/A","N/A","N/A","N/A","N/A","N/A","N/A","N/A","N/A","N/A","N/A","N/A","N/A","N/A","N/A","N/A","N/A","N/A"]
[null,"Highly contaminated (>100 CFU/100 mL)","N/A","N/A","N/A","N/A","N/A","N/A","N/A","N/A","N/A","N/A","N/A","N/A","N/A","N/A","N/A","N/A","N/A","N/A","N/A","N/A","N/A","N/A","N/A","N/A","N/A","N/A","N/A",null,null,null,null,null,null,null,null,null,null,null,null,null,null,null,null,null,null,null,null,null,null,null,null,"Highly contaminated (>100 CFU/100 mL)","N/A","N/A","N/A","N/A","N/A","N/A","N/A","N/A","N/A","N/A","N/A","N/A","N/A","N/A","N/A","N/A","N/A","N/A","N/A","N/A","N/A","N/A","N/A","N/A","N/A","N/A","N/A"]
[null,null,"NATIONAL wealth index quintile",null,null,null,null,"URBAN wealth index quintile",null,null,null,null,"RURAL wealth index quintile",null,null,null,null,"SUB-REGIONS:",null,null,null,null,null,null,null,null,null,null,null,null,null,null,null,null,null,null,null,null,null,null,null,null,null,null,null,null,null,null,null,null,null,null,"Raw numbers of respondents:","Use of drinking water sources","NATIONAL wealth index quintile",null,null,null,null,"URBAN wealth index quintile",null,null,null,null,"RURAL wealth index quintile",null,null,null,null,"SUB-REGIONS:"]
["Percentage based on weighted population",null,"Poorest","Poor","Middle","Rich","Richest","Poorest","Poor","Middle","Rich","Richest","Poorest","Poor","Middle","Rich","Richest","Bocas del Toro","Chiriquí","Coclé","Colón","Darien","Emberá Wounaan","Herrera","Kuna Yala","Los Santos","Ngöbe Buglé","Panamá","Veraguas",null,null,null,null,null,null,null,null,null,null,null,null,null,null,null,null,null,null,null,null,null,null,null,"Water data, raw numbers (weighted)",null,"Poorest","Poor","Middle","Rich","Richest","Poorest","Poor","Middle","Rich","Richest","Poorest","Poor","Middle","Rich","Richest","Bocas del Toro","Chiriquí","Coclé","Colón","Darien","Emberá Wounaan","Herrera","Kuna Yala","Los Santos","Ngöbe Buglé","Panamá","Veraguas"]
["Fuente principal de agua potable","Acueducto público del IDAAN",24.998956015922367,67.848380136098896,84.449935440817441,89.314167926600149,87.892879637994568,78.844587939192493,91.07915753067708,94.796942011317782,93.700856552188029,93.865945466319232,1.9500215792580571,19.736415527818888,27.434900703697302,35.581891687862473,44.352886082214752,42.10913768999518,62.693495120468882,41.115715014363964,66.87711629868609,33.098950811390402,0,69.255444614563132,0,61.179023276197718,0.91043618268278959,86.683515997879013,52.574066650721761]
[null,"Acueducto público de la comunidad",51.458079235144268,27.625486109746355,13.325585380548555,9.3354497169235486,7.5116681434274764,18.305241493468966,7.7293896593947462,4.392519037137899,5.3650251023635525,1.0811623753834219,52.479571646641709,59.149665627724936,60.58400847510471,55.109194662221817,48.854443811524852,35.339367474691727,23.802770414594523,51.769859909116548,24.314474270835319,47.023931889425874,27.263123523449934,25.369791120760954,83.036948434947391,36.601795393137806,47.855904079641618,11.453809828816276,35.752408786816794]
[null,"Acueducto particular",2.3959627112282575,0.7161297942434881,0.36025107260368078,6.3189743443389915E-2,0.28533781652292228,0.33570397859336309,0.20958899289063582,8.8188138749549255E-2,0,0.26285998118174381,2.1796138801970426,4.3203268111460567,1.7520299299451167,1.6065534144203653,0.70150316929480017,1.8521840108247354,0.91942709005461543,2.4669903326063567,0.52032761875523814,1.3783224050515182,0.40420087118223136,0.70288943395573844,0,0.99730081070167675,0.81965912022596621,0.10297108538922593,3.6421094689002413]
[null,"Pozo brocal protegido",1.5169702363619799,1.6411356006885214,0.61369893023762301,0.38510542398318109,0.32302975683184648,1.2224116492498343,0.12456589464496701,7.2726456933985134E-2,0,3.0603707062809724E-2,0.74393440981325754,1.1612483479615512,4.0661350920362462,2.4905056329034743,2.9995566113852936,0.73020254753821023,5.7955560058668878,0,0.82229208695866629,0.91382974329314981,1.1725804523145269,0,0,0.73291248458694447,0.16452617146262802,0.10581334480956651,0.21187888500171589]
[null,"Pozo artesanal protegido",1.7234717665237931,0.70403258048184736,8.1385546545778106E-2,0,9.9609144113356751E-2,0.34942603938475558,0,0,0,0.1423697260761817,1.3616496882219649,1.9756175528802835,2.1915668857682524,1.6891374396993877,0.26882485302913406,1.9894593099438707,2.5569269419664979,0.18570706724184124,0,1.0240566993679976,0,0.35942054413615648,0,0,1.0989310603681548,4.3643341983734249E-2,0.76897954678312674]
[null,"Pozo artesanal no protegido",4.6522609375489878,6.3927349060908856E-2,0,0,0.13944902343222576,0.15846232552392472,0,0,0,0,9.9143773692281307,4.059215324572679,1.0360971471902907,0.21194143340543831,0.46149320651777931,3.9520210338186241,2.1417568833484983,0,0.39698731202170617,1.7083482896336144,0,0.11741071108447777,1.6972813138814946,0,11.541768444931332,0.15517632705327736,2.1636272625300665]
[null,"Manantial protegido",3.1239968967474279,0.34221457311791076,0,8.5890193902049577E-2,3.0730432941546051E-2,0,0,0,0,0,6.3122238850340544,3.5697592035765764,0.55911057201864367,1.0174736767159454,0.38547660768429992,0.47116657036264248,0.46577074636954974,3.6263122777089327,0.1681871968400076,0,0,1.8096584783559391,0,0,2.3506904680631115,0.37460535202705231,0.95621489871315579]
[null,"Manantial no protegido",5.3482023094661582,4.2021953236465695E-2,0,0,3.6308350109223703E-2,0,0,0,0,0,15.793627145888072,1.7840460870100887,0.10147782758489268,0.13931741475697945,0.1201590122531012,0,0.15225569615468493,0.29454279782013271,0.36674669015274614,0.73376435625864467,0,1.0207850979066104,0,7.4632682983480664E-2,29.446479491575232,0.12931360587773111,2.9162331170736753]
[null,"Recogen agua de lluvia",0.99640212965855768,0.28096267824940091,9.1821585007545128E-2,9.7568474553082388E-2,2.2634389211784768E-2,0.30538904973181791,6.9542543058810594E-2,7.7634724436231761E-2,2.777779393769705E-2,3.2350963565315652E-2,1.7713058495357734,0.82040743623102619,0.4732259388522812,0.44406049700589711,0.23162482695671319,5.7203744358569883,0,0,0,2.3827768418818143,17.515446663783806,0,0,0,1.1117535531058269,0,0]
[null,"Carrotanque / camión cisterna",0.32766854765936909,0.16032490528315652,0.5837654497022684,0.11799220183001868,0,0.25169189973531775,0.68051525487463127,0.23436431321780957,1.2374045447248098E-2,0,6.188711111762106E-2,0.24954714084739929,0.46640443372602963,0.3870695310025617,4.7797627920992722E-2,1.441287417894505,0,0,2.3366709596137909,1.3070245538760632,0,0,0,0,0,0,0]
[null,"Agua de superficie (río, arroyo, represa, lago, estanque, canal, canal de irrigación)",3.0491632547866629,1.0492667598271079E-2,3.3757649455504702E-3,0,0,0,0,0,0,0,6.9742937838862122,2.7381244312182775,0.37468281826590788,3.6620671013267388E-2,0,2.3132435734225223,0,0.44223455314640353,1.0159489601325784,8.8889461570343151,52.636778513372221,0.91173011362538381,15.161855068688542,0,4.5666635748544691,0,0.71542659309630519]
[null,"Agua embotellada/envasada",0.20852502704241868,0.51341969401967524,0.35891600919492989,0.60063631876465018,3.6103774548674679,0.22434925170396799,9.4982305027367764E-2,0.33762531820671954,0.82467185155887612,4.584707780411251,0,0.2600253066830569,0.93761349323215148,0.97746293775275661,1.3086392161409586,3.9096438086268011,1.4720411011759476,4.8415382012236483E-2,2.6301414593953667,1.2978158224227165,1.0078699758971585,0,0.10391518248254047,0.41433535239244834,0,0.95115111616407877,5.5644290574157061E-2]
[null,"Otra",0.20034093191008623,5.1471958175051548E-2,0.13126482039658502,0,4.7975850547565979E-2,2.7363734155329E-3,1.2257819431783773E-2,0,6.929465450458934E-2,0,0.45749365117793617,0.17560120232909524,2.2746682578264857E-2,0.30877100123970225,0.26759497507737767,0.17191212702420738,0,5.0222665983642618E-2,0.55110714660845439,0.24223243036381689,0,0.45286988561155728,0,0,0.13318785308879411,0,0.24341049978890472]
[]
[]
[]
[]
[]
[]
[]
[]
[]
[]
[]
[]
[]
[]
[]
[]
[]
[]
[]
[]
[]
[]
[]
[]
[]
[]
[]
[]
[]
[]
[]
[]
[]
[]
[]
[]
[]
[{"$f":"A1026","v":"Panama"}]
[{"$f":"A1034","v":"2013"}]
["Use of sanitation facilities"]
[" by wealth quintile and sub-national region"]
["Notes:"]
["WHO/UNICEF JMP customised wealth index excludes water,"]
[" sanitation and hygiene assets."]
["Survey used for analysis:",{"$f":"A1025","v":"MICS13"}]
["Improved latrines based on :","50% Rule"]
[{"$f":"B1029","v":""}]
[]
[]
["Use of sanitation facilities",null,"NATIONAL wealth index quintile",null,null,null,null,"URBAN wealth index quintile",null,null,null,null,"RURAL wealth index quintile",null,null,null,null,"SUB-REGIONS:",null,null,null,null,null,null,null,null,null,null,null,null,null,null,null,null,null,null,null,null,null,null,null,null,null,null,null,null,null,null,null,null,null,null,"Raw numbers of respondents:","Use of sanitation facilities","NATIONAL wealth index quintile",null,null,null,null,"URBAN wealth index quintile",null,null,null,null,"RURAL wealth index quintile",null,null,null,null,"SUB-REGIONS:"]
["Weighted percentage (used in graphs)",null,"Poorest","Poor","Middle","Rich","Richest","Poorest","Poor","Middle","Rich","Richest","Poorest","Poor","Middle","Rich","Richest","Bocas del Toro","Chiriquí","Coclé","Colón","Darien","Emberá Wounaan","Herrera","Kuna Yala","Los Santos","Ngöbe Buglé","Panamá","Veraguas",null,null,null,null,null,null,null,null,null,null,null,null,null,null,null,null,null,null,null,null,null,null,null,"Sanitation data, raw numbers (weighted)",null,"Poorest","Poor","Middle","Rich","Richest","Poorest","Poor","Middle","Rich","Richest","Poorest","Poor","Middle","Rich","Richest","Bocas del Toro","Chiriquí","Coclé","Colón","Darien","Emberá Wounaan","Herrera","Kuna Yala","Los Santos","Ngöbe Buglé","Panamá","Veraguas"]
["Sanitation","Improved",{"$f":"C153+C154+C155+C157+C160+C158*0.5","v":61.998144902177977},{"$f":"D153+D154+D155+D157+D160+D158*0.5","v":87.233440029093188},95.412947420371992,97.078325206633451,99.761223423878732,84.498220443890546,95.396723636631265,96.58977862352107,99.285521389358507,99.999999999999929,39.918631782383351,68.054087383597505,77.460531618490577,82.665124857257013,94.366339932225856,70.362444222440075,90.795437538679906,79.495288985073245,91.532177125546355,64.395417131760809,40.437889722367174,85.097347485227601,0.54770110425270635,88.55547951349061,25.819619994576691,94.934734190169536,80.288241734626041,null,null,null,null,null,null,null,null,null,null,null,null,null,null,null,null,null,null,null,null,null,null,null,"Sanitation","Improved",558922.88134829293,667495.7943613925,669862.78248759604,670159.68492880394,672354.70137032855,454870.31242439465,467930.64914138761,469567.48170593468,465149.58227252233,470413.7472895963,123097.57151918094,188301.43959654454,198999.59224043941,198137.47862800062,202327.98967841468,95570.409727219419,404450.55468554469,226759.75074008503,236691.68434070927,36219.683793966127,3141.1530947174251,110809.76709950998,62.019371000827647,91124.704329812768,30775.388898705922,1794719.3476527717,208471.38076237182]
[null,"Not Improved",{"$f":"100-C122","v":38.001855097822023},{"$f":"100-D122","v":12.766559970906812},4.5870525796280077,2.9216747933665488,0.23877657612126768,15.501779556109454,4.6032763633687352,3.4102213764789298,0.71447861064149265,0,60.081368217616649,31.945912616402495,22.539468381509423,17.334875142742987,5.6336600677741444,29.637555777559925,9.2045624613200943,20.504711014926755,8.4678228744536455,35.604582868239191,59.562110277632826,14.902652514772399,99.45229889574729,11.44452048650939,74.180380005423302,5.0652658098304641,19.711758265373959,null,null,null,null,null,null,null,null,null,null,null,null,null,null,null,null,null,null,null,null,null,null,null,null,"Not Improved",112626.25969126656,4212.1289277597243,1211.7285202205435,1087.5266068522462,0,13643.673846168342,177.60434236788109,64.653069931196498,352.25042309909236,0,80042.696435129619,14942.898214195826,4608.9354067378281,4468.053424525403,836.87858394390219,31694.736740297412,2662.3137040102833,6080.9564471389413,3826.5335616714142,4522.8573775512332,1637.6792382835604,982.09625662105191,11261.560318590642,330.39515649937084,51436.918006921245,0,4701.5969385138715]
["Sanitation ladder","Basic",{"$f":"C122*C129/100","v":52.707319464783353},{"$f":"D122*D129/100","v":78.239458083864363},{"$f":"E122*E129/100","v":90.496212871450695},94.678550106594116,99.057350801703421,72.001787277266828,89.400376344627105,94.145830307165966,96.169135700869177,99.920463585531394,32.147429410352721,61.92697750892998,71.171623755138341,73.915626749729313,91.183493539332218,61.851037849215309,84.899741871728253,72.77666553508034,83.971375833802611,55.944209615773801,34.018435931466428,79.899263356225276,0.54770110425270635,83.943040442544529,20.15469362645894,90.124007113340681,73.584351240621189,null,null,null,null,null,null,null,null,null,null,null,null,null,null,null,null,null,null,null,null,null,null,null,"Sanitation ladder","Basic",475155.87386736542,598675.33834131213,635344.01354963845,653533.38642434741,667610.8535059673,387599.58851054346,438517.95472315629,457686.32126965979,450489.86343390838,470039.59706183505,99125.105946468117,171348.10652982007,182843.1048746072,177166.0774805455,195503.74585808773,84009.717039051902,378188.0304068338,207594.92477004608,217083.92150689158,31466.238944312907,2633.8148120145352,104041.06620905746,62.019371000827647,86378.446403275229,24023.147304988546,1703773.657071633,191064.48184952393]
[null,"Limited",{"$f":"C122*C128/100","v":9.2908254373947781},{"$f":"D122*D128/100","v":8.9939819452288035},{"$f":"E122*E128/100","v":4.9167345489212293},2.399775100039315,0.70387262217531654,12.496433166623699,5.9963472920041747,2.4439483163550855,3.1163856884893311,7.9536414468533101E-2,7.7712023720306078,6.1271098746675241,6.2889078633522209,8.7494981075277156,3.1828463928936439,8.5114063732247818,5.8956956669516698,6.7186234499929114,7.5608012917437382,8.4512075159870612,6.4194537909007261,5.1980841290023134,0,4.6124390709460776,5.6649263681177562,4.8107270768287913,6.7038904940048472,null,null,null,null,null,null,null,null,null,null,null,null,null,null,null,null,null,null,null,null,null,null,null,null,"Limited",83756.683596935574,68820.456020080339,34518.768937957095,16564.820078252229,4743.8478643612743,67270.723913851107,29412.69441823148,11881.160436274764,14598.240412409745,374.15022776121145,23962.141688719439,16953.333066724445,16156.487365832152,20971.40114745517,6824.2438203269503,11560.692688167537,26262.524278710953,19164.825970038946,19546.284407613417,4753.4448496532532,497.01439870955147,6768.7008904524964,0,4746.2579265375398,6752.2415937173801,90945.690581137504,17406.898912847875]
[null,"Unimproved",{"$f":"100-C124-C125-C127","v":27.740283952145727},{"$f":"100-D124-D125-D127","v":12.448196625815598},{"$f":"100-E124-E125-E127","v":4.5537288113204824},2.8516897508168402,0.23877657612126202,14.683344573785513,4.565335493698913,3.4102213764789489,0.71447861064149221,7.30526750203353E-14,33.116353968441658,27.654936932929761,21.731686747835091,16.288235334638134,5.4024539419700597,23.024290541366721,8.5506126820999349,20.170318358416669,8.2589920209674172,27.188980171638786,37.709260761375226,14.79809381102371,54.995382991567375,11.361242594854048,18.102991223708457,5.0652658098305272,18.031267538807128,null,null,null,null,null,null,null,null,null,null,null,null,null,null,null,null,null,null,null,null,null,null,null,null,"Unimproved",43715.826198016242,2073.657113933511,988.10120500098299,617.7969859478892,0,9809.1914854495826,0,64.653069931196498,352.25042309909236,0,25268.678072227191,6221.7331007017738,2964.223115809179,2347.5032726410554,367.14896303954504,23278.355051170784,0,5302.3542209387278,3324.385700358147,1094.1269840575092,595.6242627518875,865.20813339936331,6227.4460186461611,254.23327783587132,5334.4030370360661,0,1119.2448167040948]
[null,"Open defecation",10.26157114567614,0.31836334509123515,3.332376830759351E-2,6.998504254972851E-2,0,0.81843498232395884,3.794086966980692E-2,0,0,0,26.965014249175024,4.2909756834727339,0.80778163367434541,1.04663980810484,0.23120612580407743,6.6132652361931887,0.6539497792201423,0.3343926565100786,0.20883085348623304,8.4156026966003488,21.852849516257621,0.10455870374870006,44.456915904179915,8.3277891655345493E-2,56.077388781714845,0,1.6804907265668374,null,null,null,null,null,null,null,null,null,null,null,null,null,null,null,null,null,null,null,null,null,null,null,null,"Open defecation",68910.433493250297,2138.4718138262133,223.62731521956087,469.72962090435709,0,3834.4823607187586,177.60434236788109,0,0,0,54774.018362902345,8721.165113494053,1644.7122909286491,2120.550151884348,469.72962090435709,8416.3816891266342,2662.3137040102833,778.60222620021204,502.14786131326741,3428.730393493724,1042.0549755316727,116.88812322168864,5034.1142999444764,76.161878663499451,46102.514969885175,0,3582.3521218097771]
["Shared among Improved Sanitation","Yes",14.985650703023525,10.310245637715566,5.1531104340158329,2.4719988678537028,0.70555732780522262,14.788989757389887,6.2856952140667079,2.5302349287711765,3.1388118276260042,7.9536414468533156E-2,19.467607042233716,9.003294453323738,8.1188545081596075,10.584267697697204,3.3728619708887431,12.096518913295958,6.4933831773650903,8.4515995045372581,8.2602659842486599,13.123926969360053,15.874848650546596,6.1083973620971799,0,5.2085303995710559,21.940394046495072,5.0674045889169834,8.3497786838613131,null,null,null,null,null,null,null,null,null,null,null,null,null,null,null,null,null,null,null,null,null,null,null,"Shared among improved sanitation facilities","Yes","N/A","N/A","N/A","N/A","N/A","N/A","N/A","N/A","N/A","N/A","N/A","N/A","N/A","N/A","N/A","N/A","N/A","N/A","N/A","N/A","N/A","N/A","N/A","N/A","N/A","N/A","N/A"]
[null,"No",85.014349296976718,89.689754362284418,94.8468895659841,97.528001132146287,99.294442672194776,85.211010242610101,93.714304785933322,97.469765071228792,96.861188172374,99.920463585531465,80.532392957766234,90.996705546676253,91.881145491840371,89.415732302302814,96.627138029111265,87.903481086704062,93.506616822634925,91.548400495462744,91.739734015751338,86.876073030640029,84.125151349453361,93.891602637902807,100,94.79146960042894,78.059605953504942,94.932595411082957,91.650221316138683,null,null,null,null,null,null,null,null,null,null,null,null,null,null,null,null,null,null,null,null,null,null,null,null,"No","N/A","N/A","N/A","N/A","N/A","N/A","N/A","N/A","N/A","N/A","N/A","N/A","N/A","N/A","N/A","N/A","N/A","N/A","N/A","N/A","N/A","N/A","N/A","N/A","N/A","N/A","N/A"]
["Manually calculated ratios","Improved latrines"]
[null,"Other"]
[null,"Other"]
[null,null,"NATIONAL wealth index quintile",null,null,null,null,"URBAN wealth index quintile",null,null,null,null,"RURAL wealth index quintile",null,null,null,null,"SUB-REGIONS:",null,null,null,null,null,null,null,null,null,null,null,null,null,null,null,null,null,null,null,null,null,null,null,null,null,null,null,null,null,null,null,null,null,null,"Raw numbers of respondents:","Use of sanitation facilities","NATIONAL wealth index quintile",null,null,null,null,"URBAN wealth index quintile",null,null,null,null,"RURAL wealth index quintile",null,null,null,null,"SUB-REGIONS:"]
["Percentage based on weighted population",null,"Poorest","Poor","Middle","Rich","Richest","Poorest","Poor","Middle","Rich","Richest","Poorest","Poor","Middle","Rich","Richest","Bocas del Toro","Chiriquí","Coclé","Colón","Darien","Emberá Wounaan","Herrera","Kuna Yala","Los Santos","Ngöbe Buglé","Panamá","Veraguas",null,null,null,null,null,null,null,null,null,null,null,null,null,null,null,null,null,null,null,null,null,null,null,"Sanitation data, raw numbers (weighted)",null,"Poorest","Poor","Middle","Rich","Richest","Poorest","Poor","Middle","Rich","Richest","Poorest","Poor","Middle","Rich","Richest","Bocas del Toro","Chiriquí","Coclé","Colón","Darien","Emberá Wounaan","Herrera","Kuna Yala","Los Santos","Ngöbe Buglé","Panamá","Veraguas"]
["Sanitation type","Sewer connection",4.323451297697015,15.433373474358145,30.996282154411336,45.76596705430925,69.78883779970208,19.426882944457823,32.809109971757138,42.531743839469236,58.858917180320624,81.435735651333317,0.14624396735527137,1.2315747911067063,1.2975248099013206,2.1549757020050473,2.9118261216427359,4.60215344508799,3.3646522491669266,5.2021754505098103,32.663290044159758,0.85459057066522881,0,35.403446159249768,0,30.001806568639537,0,50.965147674538038,11.664721539879629,null,null,null,null,null,null,null,null,null,null,null,null,null,null,null,null,null,null,null,null,null,null,null,"Sanitation type","Sewer connection","N/A","N/A","N/A","N/A","N/A","N/A","N/A","N/A","N/A","N/A","N/A","N/A","N/A","N/A","N/A","N/A","N/A","N/A","N/A","N/A","N/A","N/A","N/A","N/A","N/A","N/A","N/A"]
[null,"Septic tank connection",17.088846016182579,43.687464761199585,52.810349596355209,44.632892316226517,29.288368956055255,36.151525228590941,48.627715850220007,46.418041638895495,38.552542593153625,18.554574312755523,2.0383883453197336,18.857297995509864,39.717426107717024,47.984172726478896,77.192721123033252,52.888746561712409,71.915662045734564,49.132363481208294,45.122247282971792,24.690494833262832,2.5882110391059663,31.195610694848053,0.54770110425270635,39.842662097492507,0.92329948824659658,28.695187638185033,36.964728474215114,null,null,null,null,null,null,null,null,null,null,null,null,null,null,null,null,null,null,null,null,null,null,null,null,"Septic tank connection","N/A","N/A","N/A","N/A","N/A","N/A","N/A","N/A","N/A","N/A","N/A","N/A","N/A","N/A","N/A","N/A","N/A","N/A","N/A","N/A","N/A","N/A","N/A","N/A","N/A","N/A","N/A"]
[null,"Improved latrines",61.816590520461411,40.252084312812073,16.012802827608276,9.4391248194672315,0.92279324424269649,41.509475167473568,18.525233308353208,11.036447774186806,2.5128691123950926,9.6900359110891135E-3,58.412694233565155,72.558942953219372,56.721423162585005,47.655554717446435,19.483531840501666,17.604609156513863,24.065735925878428,43.053823043042087,20.623508941777491,63.35384616121177,63.142345629009178,32.522438908529828,0,29.794266452680375,36.510741784957744,20.339664687276908,49.165018595753565,null,null,null,null,null,null,null,null,null,null,null,null,null,null,null,null,null,null,null,null,null,null,null,null,"Improved latrines","N/A","N/A","N/A","N/A","N/A","N/A","N/A","N/A","N/A","N/A","N/A","N/A","N/A","N/A","N/A","N/A","N/A","N/A","N/A","N/A","N/A","N/A","N/A","N/A","N/A","N/A","N/A"]
[null,"Unimproved facilities",6.5096987735468073,0.3087141065389602,0.14724165331761108,9.2037177262087197E-2,0,2.0936816771537852,0,1.3766747448415656E-2,7.567111413059012E-2,0,12.439029605843826,3.0612085766912744,1.4558442861223031,1.158657045964796,0.18071478901825891,18.291225600492552,0,2.2772453687297798,1.3821762564810851,2.6854657382598419,12.463803315272417,0.77394553362359031,54.99538299156734,0.2779869895324118,6.4885699450807408,0,0.52504066358474677,null,null,null,null,null,null,null,null,null,null,null,null,null,null,null,null,null,null,null,null,null,null,null,null,"Unimproved facilities","N/A","N/A","N/A","N/A","N/A","N/A","N/A","N/A","N/A","N/A","N/A","N/A","N/A","N/A","N/A","N/A","N/A","N/A","N/A","N/A","N/A","N/A","N/A","N/A","N/A","N/A","N/A"]
[null,"Open defecation",10.261413392112591,0.31836334509123515,3.332376830759351E-2,6.9978632734983878E-2,0,0.81843498232395884,3.794086966980692E-2,0,0,0,26.963643847915886,4.2909756834727339,0.80778163367434541,1.04663980810484,0.23120612580407743,6.6132652361931887,0.6539497792201423,0.3343926565100786,0.20877747460987514,8.4156026966003488,21.805640016612333,0.10455870374870006,44.456915904179915,8.3277891655345493E-2,56.077388781714845,0,1.6804907265668374,null,null,null,null,null,null,null,null,null,null,null,null,null,null,null,null,null,null,null,null,null,null,null,null,"Open defecation","N/A","N/A","N/A","N/A","N/A","N/A","N/A","N/A","N/A","N/A","N/A","N/A","N/A","N/A","N/A","N/A","N/A","N/A","N/A","N/A","N/A","N/A","N/A","N/A","N/A","N/A","N/A"]
["Septic tank emptying practices","Not emptied/treated and disposed in situ","N/A","N/A","N/A","N/A","N/A","N/A","N/A","N/A","N/A","N/A","N/A","N/A","N/A","N/A","N/A","N/A","N/A","N/A","N/A","N/A","N/A","N/A","N/A","N/A","N/A","N/A","N/A",null,null,null,null,null,null,null,null,null,null,null,null,null,null,null,null,null,null,null,null,null,null,null,"Septic tank emptying practices","Not emptied/treated and disposed in situ","N/A","N/A","N/A","N/A","N/A","N/A","N/A","N/A","N/A","N/A","N/A","N/A","N/A","N/A","N/A","N/A","N/A","N/A","N/A","N/A","N/A","N/A","N/A","N/A","N/A","N/A","N/A"]
[null,"Emptied and buried on site","N/A","N/A","N/A","N/A","N/A","N/A","N/A","N/A","N/A","N/A","N/A","N/A","N/A","N/A","N/A","N/A","N/A","N/A","N/A","N/A","N/A","N/A","N/A","N/A","N/A","N/A","N/A",null,null,null,null,null,null,null,null,null,null,null,null,null,null,null,null,null,null,null,null,null,null,null,null,"Emptied and buried on site","N/A","N/A","N/A","N/A","N/A","N/A","N/A","N/A","N/A","N/A","N/A","N/A","N/A","N/A","N/A","N/A","N/A","N/A","N/A","N/A","N/A","N/A","N/A","N/A","N/A","N/A","N/A"]
[null,"Emptied and discharged locally","N/A","N/A","N/A","N/A","N/A","N/A","N/A","N/A","N/A","N/A","N/A","N/A","N/A","N/A","N/A","N/A","N/A","N/A","N/A","N/A","N/A","N/A","N/A","N/A","N/A","N/A","N/A",null,null,null,null,null,null,null,null,null,null,null,null,null,null,null,null,null,null,null,null,null,null,null,null,"Emptied and discharged locally","N/A","N/A","N/A","N/A","N/A","N/A","N/A","N/A","N/A","N/A","N/A","N/A","N/A","N/A","N/A","N/A","N/A","N/A","N/A","N/A","N/A","N/A","N/A","N/A","N/A","N/A","N/A"]
[null,"Emptied and removed offsite","N/A","N/A","N/A","N/A","N/A","N/A","N/A","N/A","N/A","N/A","N/A","N/A","N/A","N/A","N/A","N/A","N/A","N/A","N/A","N/A","N/A","N/A","N/A","N/A","N/A","N/A","N/A",null,null,null,null,null,null,null,null,null,null,null,null,null,null,null,null,null,null,null,null,null,null,null,null,"Emptied and removed offsite","N/A","N/A","N/A","N/A","N/A","N/A","N/A","N/A","N/A","N/A","N/A","N/A","N/A","N/A","N/A","N/A","N/A","N/A","N/A","N/A","N/A","N/A","N/A","N/A","N/A","N/A","N/A"]
["Latrine emptying practices","Not emptied/treated and disposed in situ","N/A","N/A","N/A","N/A","N/A","N/A","N/A","N/A","N/A","N/A","N/A","N/A","N/A","N/A","N/A","N/A","N/A","N/A","N/A","N/A","N/A","N/A","N/A","N/A","N/A","N/A","N/A",null,null,null,null,null,null,null,null,null,null,null,null,null,null,null,null,null,null,null,null,null,null,null,"Latrine emptying practices","Not emptied/treated and disposed in situ","N/A","N/A","N/A","N/A","N/A","N/A","N/A","N/A","N/A","N/A","N/A","N/A","N/A","N/A","N/A","N/A","N/A","N/A","N/A","N/A","N/A","N/A","N/A","N/A","N/A","N/A","N/A"]
[null,"Emptied and buried on site","N/A","N/A","N/A","N/A","N/A","N/A","N/A","N/A","N/A","N/A","N/A","N/A","N/A","N/A","N/A","N/A","N/A","N/A","N/A","N/A","N/A","N/A","N/A","N/A","N/A","N/A","N/A",null,null,null,null,null,null,null,null,null,null,null,null,null,null,null,null,null,null,null,null,null,null,null,null,"Emptied and buried on site","N/A","N/A","N/A","N/A","N/A","N/A","N/A","N/A","N/A","N/A","N/A","N/A","N/A","N/A","N/A","N/A","N/A","N/A","N/A","N/A","N/A","N/A","N/A","N/A","N/A","N/A","N/A"]
[null,"Emptied and discharged locally","N/A","N/A","N/A","N/A","N/A","N/A","N/A","N/A","N/A","N/A","N/A","N/A","N/A","N/A","N/A","N/A","N/A","N/A","N/A","N/A","N/A","N/A","N/A","N/A","N/A","N/A","N/A",null,null,null,null,null,null,null,null,null,null,null,null,null,null,null,null,null,null,null,null,null,null,null,null,"Emptied and discharged locally","N/A","N/A","N/A","N/A","N/A","N/A","N/A","N/A","N/A","N/A","N/A","N/A","N/A","N/A","N/A","N/A","N/A","N/A","N/A","N/A","N/A","N/A","N/A","N/A","N/A","N/A","N/A"]
[null,"Emptied and removed offsite","N/A","N/A","N/A","N/A","N/A","N/A","N/A","N/A","N/A","N/A","N/A","N/A","N/A","N/A","N/A","N/A","N/A","N/A","N/A","N/A","N/A","N/A","N/A","N/A","N/A","N/A","N/A",null,null,null,null,null,null,null,null,null,null,null,null,null,null,null,null,null,null,null,null,null,null,null,null,"Emptied and removed offsite","N/A","N/A","N/A","N/A","N/A","N/A","N/A","N/A","N/A","N/A","N/A","N/A","N/A","N/A","N/A","N/A","N/A","N/A","N/A","N/A","N/A","N/A","N/A","N/A","N/A","N/A","N/A"]
["Shared among improved sanitation facilities","Yes",12.472160036908127,10.245592412113764,5.1438056984338401,2.4677674325612178,0.70555732780522262,14.358317122896471,6.2833103666376973,2.5298865977186811,3.1360221135703075,7.9536414468533156E-2,11.795860038005307,8.3413556556302471,7.9350740131223301,10.350853175133581,3.3589684470025629,9.0839424689762076,6.4509197124127935,8.2308743181357755,8.1267375827417219,11.667030855150315,10.400331379641408,6.0547348324356181,0,5.1897138084114172,8.2131761628686348,5.0674045889169834,8.1656216939805617,null,null,null,null,null,null,null,null,null,null,null,null,null,null,null,null,null,null,null,null,null,null,null,"Shared among improved sanitation facilities","Yes","N/A","N/A","N/A","N/A","N/A","N/A","N/A","N/A","N/A","N/A","N/A","N/A","N/A","N/A","N/A","N/A","N/A","N/A","N/A","N/A","N/A","N/A","N/A","N/A","N/A","N/A","N/A"]
[null,"No",70.755190473749096,89.127330136256006,94.675628879940888,97.361057922194775,99.294442672194776,82.729566217625717,93.678748763692525,97.456346654832871,96.775099858408311,99.920463585531465,48.796384362731487,84.306460084205696,89.801300067081016,87.443849970796833,96.229110638175086,66.011566694338057,92.895130508367089,89.157487656624326,90.25674786722368,77.231900709989532,55.114191678714199,93.066760930192061,0.54770110425270635,94.449021310400838,29.220865110335719,94.932595411082957,89.628846915867811,null,null,null,null,null,null,null,null,null,null,null,null,null,null,null,null,null,null,null,null,null,null,null,null,"No","N/A","N/A","N/A","N/A","N/A","N/A","N/A","N/A","N/A","N/A","N/A","N/A","N/A","N/A","N/A","N/A","N/A","N/A","N/A","N/A","N/A","N/A","N/A","N/A","N/A","N/A","N/A"]
[null,"DK/missing",16.77264948934317,0.62707745163019535,0.18056542162520453,0.17117464524401654,0,2.9121166594777441,3.794086966980692E-2,1.3766747448415656E-2,8.8878028021402988E-2,0,39.407755599263098,7.3521842601640088,2.2636259197966484,2.205296854069636,0.41192091482233639,24.904490836685735,0.6539497792201423,2.6116380252398588,1.6165145500345042,11.101068434860192,34.485476941644286,0.87850423737229033,99.452298895747305,0.3612648811877574,62.565958726795593,0,2.2055313901515836,null,null,null,null,null,null,null,null,null,null,null,null,null,null,null,null,null,null,null,null,null,null,null,null,"DK/missing","N/A","N/A","N/A","N/A","N/A","N/A","N/A","N/A","N/A","N/A","N/A","N/A","N/A","N/A","N/A","N/A","N/A","N/A","N/A","N/A","N/A","N/A","N/A","N/A","N/A","N/A","N/A"]
["Shared among all sanitation facilities","Yes",16.387925919293906,10.369919191586913,5.2313271137527968,2.4694955517838073,0.70555732780522262,14.920715978915236,6.2856952140667079,2.5298865977186811,3.1360221135703075,7.9536414468533156E-2,22.48404075603586,10.017163948467884,8.6262363331221898,10.915609752152919,3.3778048495592952,14.723958049495733,6.4933831773650903,8.380203150770047,9.093734452882229,13.213116933600222,16.335092616320036,6.2204659495460248,49.652098199231077,5.2618149902931437,27.852139445800677,5.0674045889169834,8.6549157340968979,null,null,null,null,null,null,null,null,null,null,null,null,null,null,null,null,null,null,null,null,null,null,null,"Shared among all sanitation facilities","Yes","N/A","N/A","N/A","N/A","N/A","N/A","N/A","N/A","N/A","N/A","N/A","N/A","N/A","N/A","N/A","N/A","N/A","N/A","N/A","N/A","N/A","N/A","N/A","N/A","N/A","N/A","N/A"]
[null,"No",83.610360967382647,89.630080808413055,94.76867288624716,97.521339199253333,99.294442672194776,85.079284021084717,93.714304785933322,97.470113402281285,96.850770972538896,99.920463585531465,77.509000866286101,89.982836051532104,91.373763666877778,89.084390247847097,96.622195150440689,85.276041950504307,93.506616822634925,91.619796849229957,90.880651251294211,86.786883066399866,83.388629644715863,93.779534050453947,50.34790180076898,94.738185009706839,72.147860554199326,94.932595411082957,91.345084265903083,null,null,null,null,null,null,null,null,null,null,null,null,null,null,null,null,null,null,null,null,null,null,null,null,"No","N/A","N/A","N/A","N/A","N/A","N/A","N/A","N/A","N/A","N/A","N/A","N/A","N/A","N/A","N/A","N/A","N/A","N/A","N/A","N/A","N/A","N/A","N/A","N/A","N/A","N/A","N/A"]
["Tipo de servicio sanitario","Servicio conectado al alcantarillado",4.323451297697015,15.433373474358145,30.996282154411336,45.76596705430925,69.78883779970208,19.426882944457823,32.809109971757138,42.531743839469236,58.858917180320624,81.435735651333317,0.14624396735527137,1.2315747911067063,1.2975248099013206,2.1549757020050473,2.9118261216427359,4.60215344508799,3.3646522491669266,5.2021754505098103,32.663290044159758,0.85459057066522881,0,35.403446159249768,0,30.001806568639537,0,50.965147674538038,11.664721539879629,null,null,null,null,null,null,null,null,null,null,null,null,null,null,null,null,null,null,null,null,null,null,null,"Tipo de servicio sanitario","Servicio conectado al alcantarillado",29034.100052947935,103667.19245807,208008.14889831896,307202.77768437791,469228.53197800985,91017.663691195514,153582.15167235702,199742.73655070219,273989.33817919047,383084.8957102868,297.08038715251297,2503.106028828835,2641.8711612969137,4366.0999866499824,5915.8077040644102,5856.9373225511026,13697.932282917151,12112.782108087202,78561.163122498852,348.18191510118618,0,39578.172153709922,0,27438.182045040216,0,914681.36587474076,24866.034247078023]
[null,"Servicio conectado a tanque séptico o a fosa séptica",17.088846016182579,43.687464761199585,52.810349596355209,44.632892316226517,29.288368956055255,36.151525228590941,48.627715850220007,46.418041638895495,38.552542593153625,18.554574312755523,2.0383883453197336,18.857297995509864,39.717426107717024,47.984172726478896,77.192721123033252,52.888746561712409,71.915662045734564,49.132363481208294,45.122247282971792,24.690494833262832,2.5882110391059663,31.195610694848053,0.54770110425270635,39.842662097492507,0.92329948824659658,28.695187638185033,36.964728474215114,null,null,null,null,null,null,null,null,null,null,null,null,null,null,null,null,null,null,null,null,null,null,null,null,"Servicio conectado a tanque séptico o a fosa séptica",114759.99863524688,293452.16228513402,354396.79531525914,299597.04510038259,196921.72563072533,169374.95194607976,227630.35137550821,217994.03986989523,179462.79232189019,87283.268318266113,4140.7875466319474,38326.390439972056,80868.066517278188,97218.588453485616,156828.49017774037,67308.940776597068,292777.91457572847,114400.14258744281,108527.22504250922,10059.53502289348,123.68626598309682,34874.154481095138,62.019371000827647,36438.146259256944,759.06580893537762,514998.08438777318,78798.81238753155]
[null,"Letrina de arrastre",4.3570367960707346,6.1865750434189897,2.0276589405603196,0.72870240249137308,3.7510077815027042E-2,9.9534725493324228,4.0811629840661912,0.90405957919314162,8.1602365879526496E-3,9.6900359110891135E-3,2.2527169393608246,3.1193690418707773,0.34515844606414542,2.7275592964918145,1.1586579742353347,1.2749509966690278,0.16042283855532805,6.015244431823321E-2,0,1.5264139895639655,0,6.5078512725244897E-2,0,1.5964752360377372,0,4.6048473333242104,1.1031086509442778,null,null,null,null,null,null,null,null,null,null,null,null,null,null,null,null,null,null,null,null,null,null,null,null,"Letrina de arrastre",29259.643178790506,41555.714746874677,13607.102320271437,4891.3945571166751,252.2007716770029,46633.41101322358,19104.260766537765,4245.7543014104613,37.986050869218232,45.583261043061874,4576.1752268697264,6339.9409530235007,702.77203008108268,5526.1860247053746,2353.9859469665307,1622.568253299904,653.10201959454093,140.05937674097538,0,621.89984814589957,0,72.752482020008131,0,1460.0580153926489,0,82644.086021042312,2351.5295584939868]
[null,"Servicio con conexión al mar, río o quebrada u otro lugar circundante",2.6872437998762067,9.8606948593690624E-2,6.1463513325453682E-2,4.0352011938553124E-2,0,1.2662811630147202,0,1.3766747448415656E-2,4.1793878607725515E-2,0,4.2182292521022928,1.2528954272503259,0.55017040233767522,0.39923234465672602,7.6543982755634302E-2,14.329987527319302,0,0,0,0.57004806566722099,0,0,2.5840188215873385,0,0.76619423385467467,0,0,null,null,null,null,null,null,null,null,null,null,null,null,null,null,null,null,null,null,null,null,null,null,null,null,"Servicio con conexión al mar, río o quebrada u otro lugar circundante",18046.162655707452,662.3506866174813,412.46597149701245,270.86175493607288,0,5932.7043542335141,0,64.653069931196498,194.55127087354555,0,8568.9222056477156,2546.4390145759721,1120.1938557502915,808.86681601753401,155.51048172824693,18237.079615419803,0,0,0,232.25206785190591,0,0,292.60343045648466,0,629.90595502982433,0,0]
[null,"Letrina o servicio de hueco con ventilación",14.820198883942821,9.7865442308398372,5.1721695710423354,3.1911044502367409,0.40773001418506188,6.3672565592413664,5.3133993368888337,3.3394789369327049,1.2270938827854663,0,14.276841873410129,20.211604039097463,15.824579793095273,14.668838843607871,7.8813955603627166,6.0003476254739567,6.8040877231230752,7.2075246193499654,6.8697706550521556,12.695660158162895,11.612723919399636,4.4090638410044649,0,6.0312800059990126,13.281899227702443,5.6042857342917838,13.049456194364753,null,null,null,null,null,null,null,null,null,null,null,null,null,null,null,null,null,null,null,null,null,null,null,null,"Letrina o servicio de hueco con ventilación",99524.918305472194,65736.99301474863,34709.111657367437,21420.199639404353,2741.391919271171,29831.487521775627,24872.460836527764,15683.266221907455,5712.1445132622066,0,29002.01483705857,41078.940790192508,32220.193923074006,29719.878985019324,16012.226907446295,7636.3511941195993,27700.316697347913,16782.05129438774,16523.049953512163,5172.5345669354456,554.95260540240963,4928.9746244202943,0,5515.9131297844488,10919.355755974864,100581.20037107886,27817.914343300032]
[null,"Letrina o servicio de hueco sin ventilación",42.461485864326079,24.27896503855327,8.8129743160056115,5.519317966739119,0.4775531522426073,25.179325793263494,9.1306709873981742,6.7929092580609609,1.2776149930216745,0,41.3573895277136,49.187456712476859,40.551684923425626,30.259156577346776,10.443478305903616,9.4661298817483761,17.101225364200019,35.786145979373885,13.753738286725314,49.007028866758063,50.585333891495885,28.048296554800118,0,22.166511210643645,23.228842557255305,10.130531619660923,35.012453750444529,null,null,null,null,null,null,null,null,null,null,null,null,null,null,null,null,null,null,null,null,null,null,null,null,"Letrina o servicio de hueco sin ventilación",285149.7435945152,163083.73185656554,59141.624296379123,37048.267947522807,3210.8510706453731,117968.66299007092,42741.424490457568,31901.684762019122,5947.3212073099303,0,84013.511905505453,99970.720681218198,82566.688608709243,61306.725178140339,21217.478942197085,12047.08405881245,69621.289109956822,83324.715373426501,33080.246222189176,19966.708912976308,2417.3882917633132,31355.713358264558,0,20272.404880338676,19096.967333795677,181814.61099813628,74637.090225968059]
[null,"Letrina o servicio hueco sin piso",1.5060876147374014,9.6421719686536345E-2,4.9867646610584661E-2,2.8191711717258639E-2,0,0.24742862419269493,0,0,0,0,3.927349990016034,0.44947560308279955,7.2187541196418042E-2,0.44355113161740173,9.3144095435780699E-2,0.92768988311713374,0,2.2772453687297798,0.57330173650122285,1.1852830384017841,10.770396860829807,0.63288056924136982,0.22684187444213622,0.21026773623740641,1.5812130499174009,0,9.4167260971650429E-2,null,null,null,null,null,null,null,null,null,null,null,null,null,null,null,null,null,null,null,null,null,null,null,null,"Letrina o servicio hueco sin piso",10114.11844007219,647.67233090612115,334.649065643087,189.23607878626945,0,1159.2377103796061,0,0,0,0,7978.0292932221664,913.53371310646799,146.97998977472625,898.65913013843635,189.23607878626945,1180.6258885133559,0,5302.3542209387278,1378.8951198361447,482.91442991985895,514.69920757785849,707.50898117381644,25.686620421818315,192.30056736353643,1299.9517254299221,0,200.73915423263128]
[null,"Letrina de compostaje",0.17786897612178904,0,0,0,0,9.4202656362418081E-3,0,0,0,0,0.52574589308059227,4.051315977425865E-2,0,0,0,0.86318065262250332,0,0,0,0.12474314672684399,0.94428781811363338,0,0,0,0,0,0,null,null,null,null,null,null,null,null,null,null,null,null,null,null,null,null,null,null,null,null,null,null,null,null,"Letrina de compostaje",1194.4775813217311,0,0,0,0,44.13526204963253,0,0,0,0,1068.0016159626991,82.340703309399274,0,0,0,1098.5281218392965,0,0,0,50.823527913830745,45.125931568603889,0,0,0,0,0,0]
[null,"Servicio colgante sobre el río o el mar",1.863218973972365,3.8252820701349603E-2,3.3382883953355447E-3,0,0,0.50381045572588923,0,0,0,0,4.0220967076237351,0.69925313576499504,0.37100413425715278,3.0536828391655259E-2,1.1026710826843922E-2,2.685028488223109,0,0,0,0.14965655338608946,0,0,52.18452229553786,0,4.1411626613086669,0,0,null,null,null,null,null,null,null,null,null,null,null,null,null,null,null,null,null,null,null,null,null,null,null,null,"Servicio colgante sobre el río o el mar",12512.431015397487,256.94722753255843,22.402402525028691,0,0,2360.4224493692545,0,0,0,0,8170.4980292483633,1421.192405406402,755.39605527114531,61.869303634879941,22.402402525028691,3417.1054382316925,0,0,0,60.973882879201383,0,0,5909.155967767857,0,3404.5453565763214,0,0]
[null,"No hay servicio sanitario, va al monte, campo",10.261413392112591,0.31836334509123515,3.332376830759351E-2,6.9978632734983878E-2,0,0.81843498232395884,3.794086966980692E-2,0,0,0,26.963643847915886,4.2909756834727339,0.80778163367434541,1.04663980810484,0.23120612580407743,6.6132652361931887,0.6539497792201423,0.3343926565100786,0.20877747460987514,8.4156026966003488,21.805640016612333,0.10455870374870006,44.456915904179915,8.3277891655345493E-2,56.077388781714845,0,1.6804907265668374,null,null,null,null,null,null,null,null,null,null,null,null,null,null,null,null,null,null,null,null,null,null,null,null,"No hay servicio sanitario, va al monte, campo",68910.433493250297,2138.4718138262133,223.62731521956087,469.72962090435709,0,3834.4823607187586,177.60434236788109,0,0,0,54774.018362902345,8721.165113494053,1644.7122909286491,2120.550151884348,469.72962090435709,8416.3816891266342,2662.3137040102833,778.60222620021204,502.14786131326741,3428.730393493724,1042.0549755316727,116.88812322168864,5034.1142999444764,76.161878663499451,46102.514969885175,0,3582.3521218097771]
[null,"Otro",0.44684552750007372,7.5432617557383633E-2,3.2572204986237183E-2,0,0,7.616143422048037E-2,0,0,0,0,0.27135365610176881,0.63875884389122184,0.46248220833105685,0.2853367412990131,0,0.34851970183301284,0,0,0.80887451997986237,0.7804780808047479,0.80769249359944739,0,0,6.7719253295005388E-2,0,0,0.43087340261309637,null,null,null,null,null,null,null,null,null,null,null,null,null,null,null,null,null,null,null,null,null,null,null,null,"Otro",3000.7873017004281,506.68686887735021,218.58376533585479,0,0,356.82697146720545,0,0,0,0,551.22854410895195,1298.2411824742553,941.65321501301548,578.10802285020497,0,443.54410900593678,0,0,1945.4905805220028,317.98660340654305,38.598270035352343,0,0,61.93271047233489,0,0,918.50566247146355]
[null,"Missing",6.3028574607592929E-3,0,0,2.3493453606275427E-2,0,0,0,0,3.3877235522864604E-2,0,0,2.0825566701932488E-2,0,0,0,0,0,0,0,0,0.8857139608431619,0.14106496438222046,0,0,0,0,0,null,null,null,null,null,null,null,null,null,null,null,null,null,null,null,null,null,null,null,null,null,null,null,null,"Missing",42.326785138676748,0,0,157.69915222554684,0,0,0,0,157.69915222554684,0,0,42.326785138676748,0,0,0,0,0,0,0,0,42.326785138676748,157.69915222554684,0,0,0,0,0]
[null,null,null,null,null,null,null,null,null,null,null,null,null,null,null,null,null,null,null,null,null,null,null,null,null,null,null,null,null,null,null,null,null,null,null,null,null,null,null,null,null,null,null,null,null,null,null,null,null,null,null,null,null,"Total",671549.14103955822,671707.92328915244,671074.51100781653,671247.21153565613,672354.70137032855,468513.98627056321,468108.25348375551,469632.13477586588,465501.83269562142,470413.7472895963,203140.26795431072,203244.33781074046,203608.52764717719,202605.53205252596,203164.86826235862,127265.14646751684,407112.86838955496,232840.70718722406,240518.21790238089,40742.541171517376,4778.8323330009898,111791.86335613104,11323.579689591468,91455.09948631213,82212.306905627222,1794719.3476527717,213172.97770088576]
[]
[]
[]
[]
[]
[]
[]
[]
[]
[]
[]
[]
[]
[]
[]
[]
[]
[]
[]
[]
[]
[]
[]
[]
[]
[]
[]
[]
[]
[]
[]
[]
[]
[]
[]
[]
[]
[]
[]
[]
[]
[]
[{"$f":"A1026","v":"Panama"}]
[{"$f":"A1034","v":"2013"}]
["Access to hygiene facilities "]
[" by wealth quintile and sub-national region"]
["Notes:"]
["WHO/UNICEF JMP customised wealth index excludes water,"]
[" sanitation and hygiene assets."]
["Survey used for analysis:",{"$f":"A1025","v":"MICS13"}]
[]
[]
[]
[]
["Access to handwashing",null,"NATIONAL wealth index quintile",null,null,null,null,"URBAN wealth index quintile",null,null,null,null,"RURAL wealth index quintile",null,null,null,null,"SUB-REGIONS:",null,null,null,null,null,null,null,null,null,null,null,null,null,null,null,null,null,null,null,null,null,null,null,null,null,null,null,null,null,null,null,null,null,null,"Raw numbers of respondents:","Access to handwashing","NATIONAL wealth index quintile",null,null,null,null,"URBAN wealth index quintile",null,null,null,null,"RURAL wealth index quintile",null,null,null,null,"SUB-REGIONS:"]
["Weighted percentage (used in graphs)",null,"Poorest","Poor","Middle","Rich","Richest","Poorest","Poor","Middle","Rich","Richest","Poorest","Poor","Middle","Rich","Richest","Bocas del Toro","Chiriquí","Coclé","Colón","Darien","Emberá Wounaan","Herrera","Kuna Yala","Los Santos","Ngöbe Buglé","Panamá","Veraguas",null,null,null,null,null,null,null,null,null,null,null,null,null,null,null,null,null,null,null,null,null,null,null,"Hygiene data, raw numbers (weighted)",null,"Poorest","Poor","Middle","Rich","Richest","Poorest","Poor","Middle","Rich","Richest","Poorest","Poor","Middle","Rich","Richest","Bocas del Toro","Chiriquí","Coclé","Colón","Darien","Emberá Wounaan","Herrera","Kuna Yala","Los Santos","Ngöbe Buglé","Panamá","Veraguas"]
["Hygiene ladder","Basic","N/A","N/A","N/A","N/A","N/A","N/A","N/A","N/A","N/A","N/A","N/A","N/A","N/A","N/A","N/A","N/A","N/A","N/A","N/A","N/A","N/A","N/A","N/A","N/A","N/A","N/A","N/A",null,null,null,null,null,null,null,null,null,null,null,null,null,null,null,null,null,null,null,null,null,null,null,"Hygiene ladder","Basic","N/A","N/A","N/A","N/A","N/A","N/A","N/A","N/A","N/A","N/A","N/A","N/A","N/A","N/A","N/A","N/A","N/A","N/A","N/A","N/A","N/A","N/A","N/A","N/A","N/A","N/A","N/A"]
[null,"Limited","N/A","N/A","N/A","N/A","N/A","N/A","N/A","N/A","N/A","N/A","N/A","N/A","N/A","N/A","N/A","N/A","N/A","N/A","N/A","N/A","N/A","N/A","N/A","N/A","N/A","N/A","N/A",null,null,null,null,null,null,null,null,null,null,null,null,null,null,null,null,null,null,null,null,null,null,null,null,"Limited","N/A","N/A","N/A","N/A","N/A","N/A","N/A","N/A","N/A","N/A","N/A","N/A","N/A","N/A","N/A","N/A","N/A","N/A","N/A","N/A","N/A","N/A","N/A","N/A","N/A","N/A","N/A"]
[null,"No facility","N/A","N/A","N/A","N/A","N/A","N/A","N/A","N/A","N/A","N/A","N/A","N/A","N/A","N/A","N/A","N/A","N/A","N/A","N/A","N/A","N/A","N/A","N/A","N/A","N/A","N/A","N/A",null,null,null,null,null,null,null,null,null,null,null,null,null,null,null,null,null,null,null,null,null,null,null,null,"No facility","N/A","N/A","N/A","N/A","N/A","N/A","N/A","N/A","N/A","N/A","N/A","N/A","N/A","N/A","N/A","N/A","N/A","N/A","N/A","N/A","N/A","N/A","N/A","N/A","N/A","N/A","N/A"]
[null,null,null,null,null,null,null,null,null,null,null,null,null,null,null,null,null,null,null,null,null,null,null,null,null,null,null,null,null,null,null,null,null,null,null,null,null,null,null,null,null,null,null,null,null,null,null,null,null,null,null,null,"Observed handwashing place","Fixed","N/A","N/A","N/A","N/A","N/A","N/A","N/A","N/A","N/A","N/A","N/A","N/A","N/A","N/A","N/A","N/A","N/A","N/A","N/A","N/A","N/A","N/A","N/A","N/A","N/A","N/A","N/A"]
[null,null,null,null,null,null,null,null,null,null,null,null,null,null,null,null,null,null,null,null,null,null,null,null,null,null,null,null,null,null,null,null,null,null,null,null,null,null,null,null,null,null,null,null,null,null,null,null,null,null,null,null,null,"Mobile","N/A","N/A","N/A","N/A","N/A","N/A","N/A","N/A","N/A","N/A","N/A","N/A","N/A","N/A","N/A","N/A","N/A","N/A","N/A","N/A","N/A","N/A","N/A","N/A","N/A","N/A","N/A"]
[null,null,null,null,null,null,null,null,null,null,null,null,null,null,null,null,null,null,null,null,null,null,null,null,null,null,null,null,null,null,null,null,null,null,null,null,null,null,null,null,null,null,null,null,null,null,null,null,null,null,null,null,"Water / Soap","Water and soap","N/A","N/A","N/A","N/A","N/A","N/A","N/A","N/A","N/A","N/A","N/A","N/A","N/A","N/A","N/A","N/A","N/A","N/A","N/A","N/A","N/A","N/A","N/A","N/A","N/A","N/A","N/A"]
[null,null,null,null,null,null,null,null,null,null,null,null,null,null,null,null,null,null,null,null,null,null,null,null,null,null,null,null,null,null,null,null,null,null,null,null,null,null,null,null,null,null,null,null,null,null,null,null,null,null,null,null,null,"Water only","N/A","N/A","N/A","N/A","N/A","N/A","N/A","N/A","N/A","N/A","N/A","N/A","N/A","N/A","N/A","N/A","N/A","N/A","N/A","N/A","N/A","N/A","N/A","N/A","N/A","N/A","N/A"]
[null,null,null,null,null,null,null,null,null,null,null,null,null,null,null,null,null,null,null,null,null,null,null,null,null,null,null,null,null,null,null,null,null,null,null,null,null,null,null,null,null,null,null,null,null,null,null,null,null,null,null,null,null,"Soap only","N/A","N/A","N/A","N/A","N/A","N/A","N/A","N/A","N/A","N/A","N/A","N/A","N/A","N/A","N/A","N/A","N/A","N/A","N/A","N/A","N/A","N/A","N/A","N/A","N/A","N/A","N/A"]
[null,null,null,null,null,null,null,null,null,null,null,null,null,null,null,null,null,null,null,null,null,null,null,null,null,null,null,null,null,null,null,null,null,null,null,null,null,null,null,null,null,null,null,null,null,null,null,null,null,null,null,null,null,"Neither","N/A","N/A","N/A","N/A","N/A","N/A","N/A","N/A","N/A","N/A","N/A","N/A","N/A","N/A","N/A","N/A","N/A","N/A","N/A","N/A","N/A","N/A","N/A","N/A","N/A","N/A","N/A"]
[]
[]
[]
[]
[]
[]
[]
[]
[]
[]
[]
[]
[]
[]
[]
[]
[]
[]
[]
[]
[]
[]
[]
[]
[]
[]
[]
[]
[null,null,null,null,null,null,null,null,null,null,null,null,null,null,null,null,null,null,null,null,null,null,null,null,null,null,null,null,null,null,null,null,null,null,null,null,null,null,null,null,null,null,null,null,null,null,null,null,null,null,null,null,"Raw numbers of respondents:","Menstrual health and hygiene","NATIONAL wealth index quintile",null,null,null,null,"URBAN wealth index quintile",null,null,null,null,"RURAL wealth index quintile",null,null,null,null,"SUB-REGIONS:"]
[null,null,null,null,null,null,null,null,null,null,null,null,null,null,null,null,null,null,null,null,null,null,null,null,null,null,null,null,null,null,null,null,null,null,null,null,null,null,null,null,null,null,null,null,null,null,null,null,null,null,null,null,"MHH data, raw numbers (weighted)",null,"Poorest","Poor","Middle","Rich","Richest","Poorest","Poor","Middle","Rich","Richest","Poorest","Poor","Middle","Rich","Richest","Bocas del Toro","Chiriquí","Coclé","Colón","Darien","Emberá Wounaan","Herrera","Kuna Yala","Los Santos","Ngöbe Buglé","Panamá","Veraguas"]
[null,null,null,null,null,null,null,null,null,null,null,null,null,null,null,null,null,null,null,null,null,null,null,null,null,null,null,null,null,null,null,null,null,null,null,null,null,null,null,null,null,null,null,null,null,null,null,null,null,null,null,null,"Private place to wash and change","Yes","N/A","N/A","N/A","N/A","N/A","N/A","N/A","N/A","N/A","N/A","N/A","N/A","N/A","N/A","N/A","N/A","N/A","N/A","N/A","N/A","N/A","N/A","N/A","N/A","N/A","N/A","N/A"]
[null,null,null,null,null,null,null,null,null,null,null,null,null,null,null,null,null,null,null,null,null,null,null,null,null,null,null,null,null,null,null,null,null,null,null,null,null,null,null,null,null,null,null,null,null,null,null,null,null,null,null,null,null,"No","N/A","N/A","N/A","N/A","N/A","N/A","N/A","N/A","N/A","N/A","N/A","N/A","N/A","N/A","N/A","N/A","N/A","N/A","N/A","N/A","N/A","N/A","N/A","N/A","N/A","N/A","N/A"]
[null,null,null,null,null,null,null,null,null,null,null,null,null,null,null,null,null,null,null,null,null,null,null,null,null,null,null,null,null,null,null,null,null,null,null,null,null,null,null,null,null,null,null,null,null,null,null,null,null,null,null,null,null,"DK/not sure/missing","N/A","N/A","N/A","N/A","N/A","N/A","N/A","N/A","N/A","N/A","N/A","N/A","N/A","N/A","N/A","N/A","N/A","N/A","N/A","N/A","N/A","N/A","N/A","N/A","N/A","N/A","N/A"]
[null,null,null,null,null,null,null,null,null,null,null,null,null,null,null,null,null,null,null,null,null,null,null,null,null,null,null,null,null,null,null,null,null,null,null,null,null,null,null,null,null,null,null,null,null,null,null,null,null,null,null,null,"Use of menstrual materials","Materials reusable","N/A","N/A","N/A","N/A","N/A","N/A","N/A","N/A","N/A","N/A","N/A","N/A","N/A","N/A","N/A","N/A","N/A","N/A","N/A","N/A","N/A","N/A","N/A","N/A","N/A","N/A","N/A"]
[null,null,null,null,null,null,null,null,null,null,null,null,null,null,null,null,null,null,null,null,null,null,null,null,null,null,null,null,null,null,null,null,null,null,null,null,null,null,null,null,null,null,null,null,null,null,null,null,null,null,null,null,null,"Materials not reusable","N/A","N/A","N/A","N/A","N/A","N/A","N/A","N/A","N/A","N/A","N/A","N/A","N/A","N/A","N/A","N/A","N/A","N/A","N/A","N/A","N/A","N/A","N/A","N/A","N/A","N/A","N/A"]
[null,null,null,null,null,null,null,null,null,null,null,null,null,null,null,null,null,null,null,null,null,null,null,null,null,null,null,null,null,null,null,null,null,null,null,null,null,null,null,null,null,null,null,null,null,null,null,null,null,null,null,null,null,"No materials used","N/A","N/A","N/A","N/A","N/A","N/A","N/A","N/A","N/A","N/A","N/A","N/A","N/A","N/A","N/A","N/A","N/A","N/A","N/A","N/A","N/A","N/A","N/A","N/A","N/A","N/A","N/A"]
[null,null,null,null,null,null,null,null,null,null,null,null,null,null,null,null,null,null,null,null,null,null,null,null,null,null,null,null,null,null,null,null,null,null,null,null,null,null,null,null,null,null,null,null,null,null,null,null,null,null,null,null,null,"DK/not sure/missing","N/A","N/A","N/A","N/A","N/A","N/A","N/A","N/A","N/A","N/A","N/A","N/A","N/A","N/A","N/A","N/A","N/A","N/A","N/A","N/A","N/A","N/A","N/A","N/A","N/A","N/A","N/A"]
[null,null,null,null,null,null,null,null,null,null,null,null,null,null,null,null,null,null,null,null,null,null,null,null,null,null,null,null,null,null,null,null,null,null,null,null,null,null,null,null,null,null,null,null,null,null,null,null,null,null,null,null,"Use of menstrual materials with private place to wash and change","Materials reusable","N/A","N/A","N/A","N/A","N/A","N/A","N/A","N/A","N/A","N/A","N/A","N/A","N/A","N/A","N/A","N/A","N/A","N/A","N/A","N/A","N/A","N/A","N/A","N/A","N/A","N/A","N/A"]
[null,null,null,null,null,null,null,null,null,null,null,null,null,null,null,null,null,null,null,null,null,null,null,null,null,null,null,null,null,null,null,null,null,null,null,null,null,null,null,null,null,null,null,null,null,null,null,null,null,null,null,null,null,"Materials not reusable","N/A","N/A","N/A","N/A","N/A","N/A","N/A","N/A","N/A","N/A","N/A","N/A","N/A","N/A","N/A","N/A","N/A","N/A","N/A","N/A","N/A","N/A","N/A","N/A","N/A","N/A","N/A"]
[null,null,null,null,null,null,null,null,null,null,null,null,null,null,null,null,null,null,null,null,null,null,null,null,null,null,null,null,null,null,null,null,null,null,null,null,null,null,null,null,null,null,null,null,null,null,null,null,null,null,null,null,null,"No materials used","N/A","N/A","N/A","N/A","N/A","N/A","N/A","N/A","N/A","N/A","N/A","N/A","N/A","N/A","N/A","N/A","N/A","N/A","N/A","N/A","N/A","N/A","N/A","N/A","N/A","N/A","N/A"]
[null,null,null,null,null,null,null,null,null,null,null,null,null,null,null,null,null,null,null,null,null,null,null,null,null,null,null,null,null,null,null,null,null,null,null,null,null,null,null,null,null,null,null,null,null,null,null,null,null,null,null,null,"Awareness of menstruation before menarche","Yes","N/A","N/A","N/A","N/A","N/A","N/A","N/A","N/A","N/A","N/A","N/A","N/A","N/A","N/A","N/A","N/A","N/A","N/A","N/A","N/A","N/A","N/A","N/A","N/A","N/A","N/A","N/A"]
[null,null,null,null,null,null,null,null,null,null,null,null,null,null,null,null,null,null,null,null,null,null,null,null,null,null,null,null,null,null,null,null,null,null,null,null,null,null,null,null,null,null,null,null,null,null,null,null,null,null,null,null,null,"No","N/A","N/A","N/A","N/A","N/A","N/A","N/A","N/A","N/A","N/A","N/A","N/A","N/A","N/A","N/A","N/A","N/A","N/A","N/A","N/A","N/A","N/A","N/A","N/A","N/A","N/A","N/A"]
[null,null,null,null,null,null,null,null,null,null,null,null,null,null,null,null,null,null,null,null,null,null,null,null,null,null,null,null,null,null,null,null,null,null,null,null,null,null,null,null,null,null,null,null,null,null,null,null,null,null,null,null,null,"DK/not sure/missing","N/A","N/A","N/A","N/A","N/A","N/A","N/A","N/A","N/A","N/A","N/A","N/A","N/A","N/A","N/A","N/A","N/A","N/A","N/A","N/A","N/A","N/A","N/A","N/A","N/A","N/A","N/A"]
[null,null,null,null,null,null,null,null,null,null,null,null,null,null,null,null,null,null,null,null,null,null,null,null,null,null,null,null,null,null,null,null,null,null,null,null,null,null,null,null,null,null,null,null,null,null,null,null,null,null,null,null,"Participation in (all) activities during menstruation","Yes","N/A","N/A","N/A","N/A","N/A","N/A","N/A","N/A","N/A","N/A","N/A","N/A","N/A","N/A","N/A","N/A","N/A","N/A","N/A","N/A","N/A","N/A","N/A","N/A","N/A","N/A","N/A"]
[null,null,null,null,null,null,null,null,null,null,null,null,null,null,null,null,null,null,null,null,null,null,null,null,null,null,null,null,null,null,null,null,null,null,null,null,null,null,null,null,null,null,null,null,null,null,null,null,null,null,null,null,null,"No","N/A","N/A","N/A","N/A","N/A","N/A","N/A","N/A","N/A","N/A","N/A","N/A","N/A","N/A","N/A","N/A","N/A","N/A","N/A","N/A","N/A","N/A","N/A","N/A","N/A","N/A","N/A"]
[null,null,null,null,null,null,null,null,null,null,null,null,null,null,null,null,null,null,null,null,null,null,null,null,null,null,null,null,null,null,null,null,null,null,null,null,null,null,null,null,null,null,null,null,null,null,null,null,null,null,null,null,null,"DK/not sure/missing/no such activity","N/A","N/A","N/A","N/A","N/A","N/A","N/A","N/A","N/A","N/A","N/A","N/A","N/A","N/A","N/A","N/A","N/A","N/A","N/A","N/A","N/A","N/A","N/A","N/A","N/A","N/A","N/A"]
[null,null,null,null,null,null,null,null,null,null,null,null,null,null,null,null,null,null,null,null,null,null,null,null,null,null,null,null,null,null,null,null,null,null,null,null,null,null,null,null,null,null,null,null,null,null,null,null,null,null,null,null,"Participation in specific activities during menstruation","Did not go to school (amongst those usually attending school)","N/A","N/A","N/A","N/A","N/A","N/A","N/A","N/A","N/A","N/A","N/A","N/A","N/A","N/A","N/A","N/A","N/A","N/A","N/A","N/A","N/A","N/A","N/A","N/A","N/A","N/A","N/A"]
[null,null,null,null,null,null,null,null,null,null,null,null,null,null,null,null,null,null,null,null,null,null,null,null,null,null,null,null,null,null,null,null,null,null,null,null,null,null,null,null,null,null,null,null,null,null,null,null,null,null,null,null,null,"Did not go to work (amongst those who usually work)","N/A","N/A","N/A","N/A","N/A","N/A","N/A","N/A","N/A","N/A","N/A","N/A","N/A","N/A","N/A","N/A","N/A","N/A","N/A","N/A","N/A","N/A","N/A","N/A","N/A","N/A","N/A"]
[null,null,null,null,null,null,null,null,null,null,null,null,null,null,null,null,null,null,null,null,null,null,null,null,null,null,null,null,null,null,null,null,null,null,null,null,null,null,null,null,null,null,null,null,null,null,null,null,null,null,null,null,null,"Did not participate in social activities","N/A","N/A","N/A","N/A","N/A","N/A","N/A","N/A","N/A","N/A","N/A","N/A","N/A","N/A","N/A","N/A","N/A","N/A","N/A","N/A","N/A","N/A","N/A","N/A","N/A","N/A","N/A"]
[null,null,null,null,null,null,null,null,null,null,null,null,null,null,null,null,null,null,null,null,null,null,null,null,null,null,null,null,null,null,null,null,null,null,null,null,null,null,null,null,null,null,null,null,null,null,null,null,null,null,null,null,null,"Did not cook food","N/A","N/A","N/A","N/A","N/A","N/A","N/A","N/A","N/A","N/A","N/A","N/A","N/A","N/A","N/A","N/A","N/A","N/A","N/A","N/A","N/A","N/A","N/A","N/A","N/A","N/A","N/A"]
[null,null,null,null,null,null,null,null,null,null,null,null,null,null,null,null,null,null,null,null,null,null,null,null,null,null,null,null,null,null,null,null,null,null,null,null,null,null,null,null,null,null,null,null,null,null,null,null,null,null,null,null,null,"Did not eat with others","N/A","N/A","N/A","N/A","N/A","N/A","N/A","N/A","N/A","N/A","N/A","N/A","N/A","N/A","N/A","N/A","N/A","N/A","N/A","N/A","N/A","N/A","N/A","N/A","N/A","N/A","N/A"]
[null,null,null,null,null,null,null,null,null,null,null,null,null,null,null,null,null,null,null,null,null,null,null,null,null,null,null,null,null,null,null,null,null,null,null,null,null,null,null,null,null,null,null,null,null,null,null,null,null,null,null,null,null,"Did not bathe in regular place","N/A","N/A","N/A","N/A","N/A","N/A","N/A","N/A","N/A","N/A","N/A","N/A","N/A","N/A","N/A","N/A","N/A","N/A","N/A","N/A","N/A","N/A","N/A","N/A","N/A","N/A","N/A"]
[null,null,null,null,null,null,null,null,null,null,null,null,null,null,null,null,null,null,null,null,null,null,null,null,null,null,null,null,null,null,null,null,null,null,null,null,null,null,null,null,null,null,null,null,null,null,null,null,null,null,null,null,null,"Did not participate in other activities","N/A","N/A","N/A","N/A","N/A","N/A","N/A","N/A","N/A","N/A","N/A","N/A","N/A","N/A","N/A","N/A","N/A","N/A","N/A","N/A","N/A","N/A","N/A","N/A","N/A","N/A","N/A"]
[null,null,null,null,null,null,null,null,null,null,null,null,null,null,null,null,null,null,null,null,null,null,null,null,null,null,null,null,null,null,null,null,null,null,null,null,null,null,null,null,null,null,null,null,null,null,null,null,null,null,null,null,null,"DK/not sure/missing/no such activity","N/A","N/A","N/A","N/A","N/A","N/A","N/A","N/A","N/A","N/A","N/A","N/A","N/A","N/A","N/A","N/A","N/A","N/A","N/A","N/A","N/A","N/A","N/A","N/A","N/A","N/A","N/A"]
[]
[]
[]
[]
[]
[]
[]
[]
[]
[]
[]
[]
[]
[]
[]
[]
[]
[]
[]
[]
[]
[]
[]
[]
[]
[]
[]
[]
[]
[]
[]
[]
[]
[]
[]
[]
[]
[]
[]
[]
[]
[]
[]
[]
[]
[]
[]
[]
[]
[]
[]
[]
[]
[]
[null,null,null,null,null,null,null,null,null,null,null,null,null,null,null,null,null,null,null,null,null,null,null,null,null,null,null,null,null,null,null,null,null,null,null,null,null,null,null,null,null,null,null,null,null,null,null,null,null,null,null,null,"Raw numbers of respondents:","Basic water, sanitation and hygiene","NATIONAL wealth index quintile",null,null,null,null,"URBAN wealth index quintile",null,null,null,null,"RURAL wealth index quintile",null,null,null,null,"SUB-REGIONS:"]
[null,null,null,null,null,null,null,null,null,null,null,null,null,null,null,null,null,null,null,null,null,null,null,null,null,null,null,null,null,null,null,null,null,null,null,null,null,null,null,null,null,null,null,null,null,null,null,null,null,null,null,null,"WatSan data, raw numbers (weighted)",null,"Poorest","Poor","Middle","Rich","Richest","Poorest","Poor","Middle","Rich","Richest","Poorest","Poor","Middle","Rich","Richest","Bocas del Toro","Chiriquí","Coclé","Colón","Darien","Emberá Wounaan","Herrera","Kuna Yala","Los Santos","Ngöbe Buglé","Panamá","Veraguas"]
[null,null,null,null,null,null,null,null,null,null,null,null,null,null,null,null,null,null,null,null,null,null,null,null,null,null,null,null,null,null,null,null,null,null,null,null,null,null,null,null,null,null,null,null,null,null,null,null,null,null,null,null,"Use of Basic Water Sanitation and Hygiene","Yes","N/A","N/A","N/A","N/A","N/A","N/A","N/A","N/A","N/A","N/A","N/A","N/A","N/A","N/A","N/A","N/A","N/A","N/A","N/A","N/A","N/A","N/A","N/A","N/A","N/A","N/A","N/A"]
[null,null,null,null,null,null,null,null,null,null,null,null,null,null,null,null,null,null,null,null,null,null,null,null,null,null,null,null,null,null,null,null,null,null,null,null,null,null,null,null,null,null,null,null,null,null,null,null,null,null,null,null,null,"No","N/A","N/A","N/A","N/A","N/A","N/A","N/A","N/A","N/A","N/A","N/A","N/A","N/A","N/A","N/A","N/A","N/A","N/A","N/A","N/A","N/A","N/A","N/A","N/A","N/A","N/A","N/A"]
[null,null,null,null,null,null,null,null,null,null,null,null,null,null,null,null,null,null,null,null,null,null,null,null,null,null,null,null,null,null,null,null,null,null,null,null,null,null,null,null,null,null,null,null,null,null,null,null,null,null,null,null,"Use of Basic Water and Sanitation","Yes","N/A","N/A","N/A","N/A","N/A","N/A","N/A","N/A","N/A","N/A","N/A","N/A","N/A","N/A","N/A","N/A","N/A","N/A","N/A","N/A","N/A","N/A","N/A","N/A","N/A","N/A","N/A"]
[null,null,null,null,null,null,null,null,null,null,null,null,null,null,null,null,null,null,null,null,null,null,null,null,null,null,null,null,null,null,null,null,null,null,null,null,null,null,null,null,null,null,null,null,null,null,null,null,null,null,null,null,null,"No","N/A","N/A","N/A","N/A","N/A","N/A","N/A","N/A","N/A","N/A","N/A","N/A","N/A","N/A","N/A","N/A","N/A","N/A","N/A","N/A","N/A","N/A","N/A","N/A","N/A","N/A","N/A"]
[null,null,null,null,null,null,null,null,null,null,null,null,null,null,null,null,null,null,null,null,null,null,null,null,null,null,null,null,null,null,null,null,null,null,null,null,null,null,null,null,null,null,null,null,null,null,null,null,null,null,null,null,"Use of Basic Water and Hygiene","Yes","N/A","N/A","N/A","N/A","N/A","N/A","N/A","N/A","N/A","N/A","N/A","N/A","N/A","N/A","N/A","N/A","N/A","N/A","N/A","N/A","N/A","N/A","N/A","N/A","N/A","N/A","N/A"]
[null,null,null,null,null,null,null,null,null,null,null,null,null,null,null,null,null,null,null,null,null,null,null,null,null,null,null,null,null,null,null,null,null,null,null,null,null,null,null,null,null,null,null,null,null,null,null,null,null,null,null,null,null,"No","N/A","N/A","N/A","N/A","N/A","N/A","N/A","N/A","N/A","N/A","N/A","N/A","N/A","N/A","N/A","N/A","N/A","N/A","N/A","N/A","N/A","N/A","N/A","N/A","N/A","N/A","N/A"]
[null,null,null,null,null,null,null,null,null,null,null,null,null,null,null,null,null,null,null,null,null,null,null,null,null,null,null,null,null,null,null,null,null,null,null,null,null,null,null,null,null,null,null,null,null,null,null,null,null,null,null,null,"Use of Basic Sanitation and Hygiene","Yes","N/A","N/A","N/A","N/A","N/A","N/A","N/A","N/A","N/A","N/A","N/A","N/A","N/A","N/A","N/A","N/A","N/A","N/A","N/A","N/A","N/A","N/A","N/A","N/A","N/A","N/A","N/A"]
[null,null,null,null,null,null,null,null,null,null,null,null,null,null,null,null,null,null,null,null,null,null,null,null,null,null,null,null,null,null,null,null,null,null,null,null,null,null,null,null,null,null,null,null,null,null,null,null,null,null,null,null,null,"No","N/A","N/A","N/A","N/A","N/A","N/A","N/A","N/A","N/A","N/A","N/A","N/A","N/A","N/A","N/A","N/A","N/A","N/A","N/A","N/A","N/A","N/A","N/A","N/A","N/A","N/A","N/A"]
[null,null,null,null,null,null,null,null,null,null,null,null,null,null,null,null,null,null,null,null,null,null,null,null,null,null,null,null,null,null,null,null,null,null,null,null,null,null,null,null,null,null,null,null,null,null,null,null,null,null,null,null,"Use of Basic Water","Yes","N/A","N/A","N/A","N/A","N/A","N/A","N/A","N/A","N/A","N/A","N/A","N/A","N/A","N/A","N/A","N/A","N/A","N/A","N/A","N/A","N/A","N/A","N/A","N/A","N/A","N/A","N/A"]
[null,null,null,null,null,null,null,null,null,null,null,null,null,null,null,null,null,null,null,null,null,null,null,null,null,null,null,null,null,null,null,null,null,null,null,null,null,null,null,null,null,null,null,null,null,null,null,null,null,null,null,null,null,"No","N/A","N/A","N/A","N/A","N/A","N/A","N/A","N/A","N/A","N/A","N/A","N/A","N/A","N/A","N/A","N/A","N/A","N/A","N/A","N/A","N/A","N/A","N/A","N/A","N/A","N/A","N/A"]
[null,null,null,null,null,null,null,null,null,null,null,null,null,null,null,null,null,null,null,null,null,null,null,null,null,null,null,null,null,null,null,null,null,null,null,null,null,null,null,null,null,null,null,null,null,null,null,null,null,null,null,null,"Use of Basic Sanitation","Yes","N/A","N/A","N/A","N/A","N/A","N/A","N/A","N/A","N/A","N/A","N/A","N/A","N/A","N/A","N/A","N/A","N/A","N/A","N/A","N/A","N/A","N/A","N/A","N/A","N/A","N/A","N/A"]
[null,null,null,null,null,null,null,null,null,null,null,null,null,null,null,null,null,null,null,null,null,null,null,null,null,null,null,null,null,null,null,null,null,null,null,null,null,null,null,null,null,null,null,null,null,null,null,null,null,null,null,null,null,"No","N/A","N/A","N/A","N/A","N/A","N/A","N/A","N/A","N/A","N/A","N/A","N/A","N/A","N/A","N/A","N/A","N/A","N/A","N/A","N/A","N/A","N/A","N/A","N/A","N/A","N/A","N/A"]
[null,null,null,null,null,null,null,null,null,null,null,null,null,null,null,null,null,null,null,null,null,null,null,null,null,null,null,null,null,null,null,null,null,null,null,null,null,null,null,null,null,null,null,null,null,null,null,null,null,null,null,null,"Access to Basic Hygiene","Yes","N/A","N/A","N/A","N/A","N/A","N/A","N/A","N/A","N/A","N/A","N/A","N/A","N/A","N/A","N/A","N/A","N/A","N/A","N/A","N/A","N/A","N/A","N/A","N/A","N/A","N/A","N/A"]
[null,null,null,null,null,null,null,null,null,null,null,null,null,null,null,null,null,null,null,null,null,null,null,null,null,null,null,null,null,null,null,null,null,null,null,null,null,null,null,null,null,null,null,null,null,null,null,null,null,null,null,null,null,"No","N/A","N/A","N/A","N/A","N/A","N/A","N/A","N/A","N/A","N/A","N/A","N/A","N/A","N/A","N/A","N/A","N/A","N/A","N/A","N/A","N/A","N/A","N/A","N/A","N/A","N/A","N/A"]
[]
[]
[]
[]
[]
[]
[]
[]
[]
[]
[]
[]
[]
[]
[]
[]
[]
[]
[]
[]
[]
[]
[]
[]
[]
[]
[]
[]
[]
[]
[]
[]
[]
[]
[]
[]
[]
[]
[]
[]
[]
[]
[]
[]
[null,null,"INITIAL (national) Wealth Index",null,null,null,null,"URBAN Wealth Index",null,null,null,null,"RURAL Wealth Index"]
[null,null,"Component Matrix",null,null,null,null,"Component Matrix",null,null,null,null,"Component Matrix"]
[null,null,null,null,"Component",null,null,null,null,"Component",null,null,null,null,"Component"]
[null,"Note:\n\nThe INITIAL (national) Wealth Index is based on the first component of the Principal Component Analysis (PCA) which has been obtained at national level.\n\nThe final national-level (NATIONAL) Wealth Index is based on the URBAN and RURAL specific wealth indexes. Regression procedures are used to establish the relationships between the two sets of scores (urban and rural) and the initial (national) wealth factors.\nThis allows best use of the available information for each area and a better precision of the FINAL (NATIONAL) Wealth Index.\n\nFor dependency reasons, all WASH variables (contained in the generic MICS and DHS scripts) have been excluded from the sets of asset variables used in the PCAs.\n\nThe PCA can extracts as many components as there are asset variables in the input. Only the first of the components is used to represent the Wealth Index. \n\nThe scores represent the weights of the asset variables on the Wealth Index (correlations between the variables and the component).\n\nThe communalities are the proportion of each variable's variance that can be explained by the component.\n\nProportion of explained variance is the part of the model's total variance that is explained by the component.\n\nFor more information on the procedure used:\n\nThe DHS Wealth Index, DHS Comparative Reports No. 6, Shea Oscar Rutstein, Kiersten Johnson, ORC Macro International Inc., 2004.\n\nThe DHS Wealth Index: Approaches for Rural and Urban Areas, Shea O. Rutstein, ORC Macro International Inc., 2008.\n\nMICS Methodological Paper No. 4, Review of options for reporting water, sanitation and hygiene coverage by wealth quintile, UNICEF, 2016.",null,null,"1",null,null,null,null,"1",null,null,null,null,"1"]
[null,null,"Block, brick, stone, concrete walls",null,0.81564565550647317,null,null,"Cement floor",null,0.7969039716570504,null,null,"Block, brick, stone, concrete walls",null,0.7768737622162456]
[null,null,"Cement floor",null,0.8095642607651139,null,null,"Block, brick, stone, concrete walls",null,0.7918256456170395,null,null,"Cement floor",null,0.76790234764472842]
[null,null,"Refrigetaror",null,0.75065705222247026,null,null,"Wood walls",null,-0.75085848024853752,null,null,"Television",null,0.71951279056704354]
[null,null,"Television",null,0.74367095310740428,null,null,"Wood floor",null,-0.74795257446542784,null,null,"Refrigetaror",null,0.70327554363572087]
[null,null,"Electricity",null,0.71266686402811408,null,null,"Refrigetaror",null,0.4658009448893275,null,null,"Electricity",null,0.69332024466525033]
[null,null,"Wood walls",null,-0.65406111827820579,null,null,"Internet connection",null,0.41909208278373394,null,null,"Wood walls",null,-0.59296656053351948]
[null,null,"Wood floor",null,-0.54586673251533879,null,null,"Car/truck",null,0.41678697310272256,null,null,"Earth floor",null,-0.49181878334995283]
[null,null,"Earth floor",null,-0.51633399619539233,null,null,"Non-mobile telephone",null,0.3914080046799871,null,null,"Wood floor",null,-0.46338060614642984]
[null,null,"Internet connection",null,0.49298823448801199,null,null,"Computer",null,0.38222218996937674,null,null,"No agricultural land",null,0.4602100544961169]
[null,null,"Household owns bank account",null,0.48554172338549295,null,null,"Electricity",null,0.37518247736614746,null,null,"Palma roof",null,-0.45513657432060434]
[null,null,"Car/truck",null,0.48229598719790706,null,null,"Television",null,0.35838276232558958,null,null,"Mobile telephone",null,0.40785332868892216]
[null,null,"Computer",null,0.48089777306511444,null,null,"Watch",null,0.35130198243105121,null,null,"Car/truck",null,0.40180436280432941]
[null,null,"Palma roof",null,-0.46700684199046166,null,null,"Household owns bank account",null,0.34304578382408768,null,null,"Household owns bank account",null,0.39325371564757783]
[null,null,"Mobile telephone",null,0.46558278841302281,null,null,"Persons per sleeping rooms",null,-0.31541091055127823,null,null,"Persons per sleeping rooms",null,-0.37761984661068804]
[null,null,"Non-mobile telephone",null,0.45650156961402155,null,null,"Radio - Sound equipment",null,0.27362036529506589,null,null,"Internet connection",null,0.3724184791552046]
[null,null,"Persons per sleeping rooms",null,-0.43534480702700801,null,null,"Earth floor",null,-0.24333553686211173,null,null,"No pigs",null,0.36402141578794811]
[null,null,"Watch",null,0.36533438412846847,null,null,"Metal (zinc, aluminium etc) walls",null,-0.22117016175167542,null,null,"Computer",null,0.36249902078333246]
[null,null,"Palm, straw, stalk, cane walls",null,-0.35594226279981445,null,null,"Metal roof",null,-0.21545988572680838,null,null,"Bicycle",null,0.33981566129250051]
[null,null,"Bicycle",null,0.19548849450741543,null,null,"Mobile telephone",null,0.17874143276007845,null,null,"No horses, donkeys, mules",null,0.33862144403165656]
[null,null,"Metal roof",null,0.17457206108698381,null,null,"Tejalit roof",null,0.16320824674581469,null,null,"No chickens",null,0.32994534540180304]
[null,null,"Cana, palos, desechos",null,-0.16353788534589542,null,null,"Boat with motor",null,-0.12010360839073868,null,null,"Non-mobile telephone",null,0.32708856114234347]
[null,null,"Radio - Sound equipment",null,0.15795448834193443,null,null,"Palm, straw, stalk, cane walls",null,-0.11750350442961253,null,null,"Palm, straw, stalk, cane walls",null,-0.31899508258600939]
[null,null,"Metal (zinc, aluminium etc) walls",null,-0.15255234453468328,null,null,"Cana, palos, desechos",null,-0.11750350442961167,null,null,"1-2 pigs",null,-0.30105752912311207]
[null,null,"Thatch, adobe walls",null,-0.12899188076286019,null,null,"No walls",null,-0.11305668046895219,null,null,"Metal roof",null,0.29675133045529084]
[null,null,"Tejalit roof",null,0.12126380643385697,null,null,"Concrete roof",null,9.8928564315178477E-2,null,null,"County land",null,-0.26850016870457072]
[null,null,"Motorcycle/scooter",null,9.8423143794322876E-2,null,null,"Teja roof",null,9.8304903393223342E-2,null,null,"1-2 horses, donkeys, mules",null,-0.24215468647794461]
[null,null,"No walls",null,-8.5592238038791485E-2,null,null,"Palma roof",null,-8.8684929035940316E-2,null,null,"No cattle, milk cows or bulls",null,0.23571761648209719]
[null,null,"Concrete roof",null,8.4991221448903781E-2,null,null,"Motorcycle/scooter",null,7.408439802833347E-2,null,null,"3 or more horses, donkeys, mules",null,-0.21283325709232845]
[null,null,"Teja roof",null,4.5201159864636839E-2,null,null,"Animal drawn cart",null,3.3169119146586247E-2,null,null,"Watch",null,0.19619802527250055]
[null,null,"Animal drawn cart",null,4.3304393121038336E-2,null,null,"Protected wood roof",null,3.2234911448899804E-2,null,null,"5-19 acres of agricultural land",null,-0.19495509035016367]
[null,null,"Protected wood roof",null,9.0004362919438204E-3,null,null,"Thatch, adobe walls",null,-2.7937553295781171E-2,null,null,"More than 20 acres of agricultural land",null,-0.18885764033323241]
[null,null,null,null,null,null,null,"Bicycle",null,-3.2734910451304366E-3,null,null,"3 or more pigs",null,-0.18346744151768155]
[null,null,null,null,null,null,null,null,null,null,null,null,"Cana, palos, desechos",null,-0.15356814902310104]
[null,null,null,null,null,null,null,null,null,null,null,null,"1-4 cattle, milk cows or bulls",null,-0.15285539362657197]
[null,null,"Communalities",null,null,null,null,null,null,null,null,null,"20+ chickens",null,-0.14178464470819907]
[null,null,null,null,"Extraction",null,null,"Communalities",null,null,null,null,"1-9 chickens",null,-0.13994792952798679]
[null,null,"Persons per sleeping rooms",null,0.18952510100538283,null,null,null,null,"Extraction",null,null,"Less than 5 acres of agricultural land",null,-0.13926211105544004]
[null,null,"Cement floor",null,0.65539429230816537,null,null,"Persons per sleeping rooms",null,9.9484042494786443E-2,null,null,"Motorcycle/scooter",null,0.13139676327410515]
[null,null,"Wood floor",null,0.29797048966697243,null,null,"Cement floor",null,0.63505594004278099,null,null,"10+ cattle, milk cows or bulls",null,-0.12736998708408784]
[null,null,"Earth floor",null,0.26660079562710343,null,null,"Wood floor",null,0.55943305364946139,null,null,"10-19 chickens",null,-0.12651009313581235]
[null,null,"Cana, palos, desechos",null,2.6744639943407235E-2,null,null,"Earth floor",null,5.9212183499972142E-2,null,null,"Metal (zinc, aluminium etc) walls",null,-0.11671138375889958]
[null,null,"Concrete roof",null,7.2235077233766022E-3,null,null,"Cana, palos, desechos",null,1.380707355323977E-2,null,null,"Tejalit roof",null,0.11349452230453309]
[null,null,"Teja roof",null,2.0431448531084561E-3,null,null,"Concrete roof",null,9.7868608374624046E-3,null,null,"5-9 cattle, milk cows or bulls",null,-0.11029604617506042]
[null,null,"Tejalit roof",null,1.4704910750827931E-2,null,null,"Teja roof",null,9.6638540311509737E-3,null,null,"Thatch, adobe walls",null,-8.4511999300198426E-2]
[null,null,"Metal roof",null,3.0475404512157606E-2,null,null,"Tejalit roof",null,2.6636931805842732E-2,null,null,"No walls",null,-7.7154227060005798E-2]
[null,null,"Protected wood roof",null,8.1007853445339429E-5,null,null,"Metal roof",null,4.6422962357409323E-2,null,null,"Have goats",null,-6.6760977071939884E-2]
[null,null,"Palma roof",null,0.21809539046590404,null,null,"Protected wood roof",null,1.0390895161184117E-3,null,null,"Have sheep",null,-4.8079883269980757E-2]
[null,null,"Block, brick, stone, concrete walls",null,0.66527783534658425,null,null,"Palma roof",null,7.8650166381097689E-3,null,null,"Animal drawn cart",null,3.9669201730521984E-2]
[null,null,"Wood walls",null,0.42779594644333713,null,null,"Block, brick, stone, concrete walls",null,0.62698785305684146,null,null,"Teja roof",null,3.8265497825847011E-2]
[null,null,"Thatch, adobe walls",null,1.6638905302739943E-2,null,null,"Wood walls",null,0.56378845736114336,null,null,"Radio - Sound equipment",null,2.814259645704659E-2]
[null,null,"Metal (zinc, aluminium etc) walls",null,2.3272217823028709E-2,null,null,"Thatch, adobe walls",null,7.8050688415461339E-4,null,null,"Protected wood roof",null,-2.4067132773416735E-2]
[null,null,"Palm, straw, stalk, cane walls",null,0.12669489444705218,null,null,"Metal (zinc, aluminium etc) walls",null,4.8916240449262266E-2,null,null,"Concrete roof",null,1.3850169074270606E-2]
[null,null,"No walls",null,7.3260312124891437E-3,null,null,"Palm, straw, stalk, cane walls",null,1.3807073553239972E-2]
[null,null,"Electricity",null,0.50789405908366647,null,null,"No walls",null,1.2781812998658755E-2]
[null,null,"Radio - Sound equipment",null,2.4949620387362301E-2,null,null,"Electricity",null,0.14076189132259975]
[null,null,"Television",null,0.55304648649567512,null,null,"Radio - Sound equipment",null,7.4868104304205305E-2,null,null,"Communalities"]
[null,null,"Non-mobile telephone",null,0.20839368306006537,null,null,"Television",null,0.12843820433212003,null,null,null,null,"Extraction"]
[null,null,"Refrigetaror",null,0.56348601005132848,null,null,"Non-mobile telephone",null,0.15320022612756881,null,null,"Persons per sleeping rooms",null,0.14259674855427956]
[null,null,"Computer",null,0.2312626681389863,null,null,"Refrigetaror",null,0.2169705202597903,null,null,"Cement floor",null,0.58967401551828535]
[null,null,"Internet connection",null,0.2430373993436071,null,null,"Computer",null,0.14609380250498633,null,null,"Wood floor",null,0.21472158615263273]
[null,null,"Watch",null,0.13346921222652736,null,null,"Internet connection",null,0.17563817385200811,null,null,"Earth floor",null,0.24188571565582784]
[null,null,"Mobile telephone",null,0.21676733286644556,null,null,"Watch",null,0.12341308285998662,null,null,"Cana, palos, desechos",null,2.3583176394381369E-2]
[null,null,"Bicycle",null,3.8215751484775795E-2,null,null,"Mobile telephone",null,3.1948499785125643E-2,null,null,"Concrete roof",null,1.9182718338588188E-4]
[null,null,"Motorcycle/scooter",null,9.687115234357958E-3,null,null,"Bicycle",null,1.0715743622549158E-5,null,null,"Teja roof",null,1.4642483238599022E-3]
[null,null,"Animal drawn cart",null,1.8752704635814324E-3,null,null,"Motorcycle/scooter",null,5.4884980312205406E-3,null,null,"Tejalit roof",null,1.288100659313416E-2]
[null,null,"Car/truck",null,0.23260941926720374,null,null,"Animal drawn cart",null,1.1001904649604343E-3,null,null,"Metal roof",null,8.8061352126985223E-2]
[null,null,"Household owns bank account",null,0.23575076514815455,null,null,"Car/truck",null,0.17371138094812957,null,null,"Protected wood roof",null,5.7922687993326987E-4]
[null,null,null,null,null,null,null,"Boat with motor",null,1.4424876748475915E-2,null,null,"Palma roof",null,0.20714930128429498]
[null,null,null,null,null,null,null,"Household owns bank account",null,0.1176804097994827,null,null,"Block, brick, stone, concrete walls",null,0.6035328424200237]
[null,null,"Total Variance Explained",null,null,null,null,null,null,null,null,null,"Wood walls",null,0.351609341910952]
[null,null,"Component",null,"Extraction Sums of Squared Loadings",null,null,null,null,null,null,null,"Thatch, adobe walls",null,7.1422780257167397E-3]
[null,null,null,null,"Total","% of Variance","Cumulative %","Total Variance Explained",null,null,null,null,"Metal (zinc, aluminium etc) walls",null,1.3621547098917129E-2]
[null,null,"1",null,6.1763093085368208,19.923578414634907,19.923578414634907,"Component",null,"Extraction Sums of Squared Loadings",null,null,"Palm, straw, stalk, cane walls",null,0.10175786271405496]
[null,null,null,null,null,null,null,null,null,"Total","% of Variance","Cumulative %","No walls",null,5.9527747532269306E-3]
[null,null,null,null,null,null,null,"1",null,4.2392175298139172,13.247554780668491,13.247554780668491,"Electricity",null,0.48069296166268261]
[null,null,"Component Score Coefficient Matrix",null,null,null,null,null,null,null,null,null,"Radio - Sound equipment",null,7.9200573534417133E-4]
[null,null,null,null,"Component",null,null,null,null,null,null,null,"Television",null,0.5176986557895743]
[null,null,null,null,"1",null,null,"Component Score Coefficient Matrix",null,null,null,null,"Non-mobile telephone",null,0.10698692683016857]
[null,null,"Persons per sleeping rooms",null,-7.0486237861384249E-2,null,null,null,null,"Component",null,null,"Refrigetaror",null,0.49459649027611874]
[null,null,"Cement floor",null,0.13107573152888308,null,null,null,null,"1",null,null,"Computer",null,0.13140554006887489]
[null,null,"Wood floor",null,-8.8380731152963521E-2,null,null,"Persons per sleeping rooms",null,-7.4403096404709226E-2,null,null,"Internet connection",null,0.13869552361627557]
[null,null,"Earth floor",null,-8.359911565337598E-2,null,null,"Cement floor",null,0.18798374135144483,null,null,"Watch",null,3.8493665120828767E-2]
[null,null,"Cana, palos, desechos",null,-2.6478253788205734E-2,null,null,"Wood floor",null,-0.17643646951475489,null,null,"Mobile telephone",null,0.16634433772263396]
[null,null,"Concrete roof",null,1.3760842795134941E-2,null,null,"Earth floor",null,-5.7401049875539893E-2,null,null,"Bicycle",null,0.11547468365965943]
[null,null,"Teja roof",null,7.3184741253421908E-3,null,null,"Cana, palos, desechos",null,-2.7718205919659313E-2,null,null,"Motorcycle/scooter",null,1.7265109398911228E-2]
[null,null,"Tejalit roof",null,1.9633700382564647E-2,null,null,"Concrete roof",null,2.3336515198718991E-2,null,null,"Animal drawn cart",null,1.5736455659368484E-3]
[null,null,"Metal roof",null,2.8264786034224741E-2,null,null,"Teja roof",null,2.3189398208951658E-2,null,null,"Car/truck",null,0.16144674596859318]
[null,null,"Protected wood roof",null,1.4572515465673852E-3,null,null,"Tejalit roof",null,3.8499615931003844E-2,null,null,"No agricultural land",null,0.21179329425931889]
[null,null,"Palma roof",null,-7.5612605953035802E-2,null,null,"Metal roof",null,-5.0825390348927448E-2,null,null,"Less than 5 acres of agricultural land",null,1.9393935575617714E-2]
[null,null,"Block, brick, stone, concrete walls",null,0.13206036400720694,null,null,"Protected wood roof",null,7.6039767297137895E-3,null,null,"5-19 acres of agricultural land",null,3.8007487253440483E-2]
[null,null,"Wood walls",null,-0.10589837483918921,null,null,"Palma roof",null,-2.0920117548162993E-2,null,null,"More than 20 acres of agricultural land",null,3.5667208312236569E-2]
[null,null,"Thatch, adobe walls",null,-2.0884945089224914E-2,null,null,"Block, brick, stone, concrete walls",null,0.18678580187221414,null,null,"County land",null,7.2092340594382937E-2]
[null,null,"Metal (zinc, aluminium etc) walls",null,-2.469959597454539E-2,null,null,"Wood walls",null,-0.17712195115439067,null,null,"No cattle, milk cows or bulls",null,5.5562794720001057E-2]
[null,null,"Palm, straw, stalk, cane walls",null,-5.7630252148776831E-2,null,null,"Thatch, adobe walls",null,-6.5902617875349982E-3,null,null,"1-4 cattle, milk cows or bulls",null,2.3364771360734258E-2]
[null,null,"No walls",null,-1.3858152783975199E-2,null,null,"Metal (zinc, aluminium etc) walls",null,-5.2172402146436626E-2,null,null,"5-9 cattle, milk cows or bulls",null,1.216521780185106E-2]
[null,null,"Electricity",null,0.11538717192208532,null,null,"Palm, straw, stalk, cane walls",null,-2.7718205919659514E-2,null,null,"10+ cattle, milk cows or bulls",null,1.6223113609800704E-2]
[null,null,"Radio - Sound equipment",null,2.5574251620399197E-2,null,null,"No walls",null,-2.6669233101117802E-2,null,null,"No horses, donkeys, mules",null,0.11466448235808431]
[null,null,"Television",null,0.12040701266037812,null,null,"Electricity",null,8.8502766071222636E-2,null,null,"1-2 horses, donkeys, mules",null,5.863889218323165E-2]
[null,null,"Non-mobile telephone",null,7.3911707916417102E-2,null,null,"Radio - Sound equipment",null,6.4545016473140635E-2,null,null,"3 or more horses, donkeys, mules",null,4.5297995324529175E-2]
[null,null,"Refrigetaror",null,0.12153812490979379,null,null,"Television",null,8.453983778966892E-2,null,null,"Have goats",null,4.4570280596000827E-3]
[null,null,"Computer",null,7.7861672568830601E-2,null,null,"Non-mobile telephone",null,9.2330247723137734E-2,null,null,"Have sheep",null,2.3116751752549755E-3]
[null,null,"Internet connection",null,7.9819226962388287E-2,null,null,"Refrigetaror",null,0.10987899101978237,null,null,"No chickens",null,0.10886393095231511]
[null,null,"Watch",null,5.9150921023904623E-2,null,null,"Computer",null,9.0163382105601569E-2,null,null,"1-9 chickens",null,1.9585422979170358E-2]
[null,null,"Mobile telephone",null,7.5382038877084709E-2,null,null,"Internet connection",null,9.8860716591283329E-2,null,null,"10-19 chickens",null,1.6004803665231916E-2]
[null,null,"Bicycle",null,3.1651344636709426E-2,null,null,"Watch",null,8.2869534285604757E-2,null,null,"20+ chickens",null,2.0102885475030242E-2]
[null,null,"Motorcycle/scooter",null,1.5935591771332368E-2,null,null,"Mobile telephone",null,4.2163779401035918E-2,null,null,"No pigs",null,0.13251159115226219]
[null,null,"Animal drawn cart",null,7.0113705382571301E-3,null,null,"Bicycle",null,-7.7219227890721795E-4,null,null,"1-2 pigs",null,9.0635635841713469E-2]
[null,null,"Car/truck",null,7.8088056006405532E-2,null,null,"Motorcycle/scooter",null,1.7475960482637803E-2,null,null,"3 or more pigs",null,3.3660302097043897E-2]
[null,null,"Household owns bank account",null,7.8613569873254727E-2,null,null,"Animal drawn cart",null,7.8243494025281163E-3,null,null,"Household owns bank account",null,0.15464848487062599]
[null,null,null,null,null,null,null,"Car/truck",null,9.8316958299853402E-2]
[null,null,null,null,null,null,null,"Boat with motor",null,-2.8331551175674315E-2]
[null,null,"Component Score Covariance Matrix",null,null,null,null,"Household owns bank account",null,8.0921958217875595E-2,null,null,"Total Variance Explained"]
[null,null,"Component",null,"1",null,null,null,null,null,null,null,"Component",null,"Extraction Sums of Squared Loadings"]
[null,null,"1",null,0.99999999999999989,null,null,null,null,null,null,null,null,null,"Total","% of Variance","Cumulative %"]
[null,null,null,null,null,null,null,"Component Score Covariance Matrix",null,null,null,null,"1",null,6.2635244366269704,12.045239301205712,12.045239301205712]
[null,null,null,null,null,null,null,"Component",null,"1"]
[null,null,null,null,null,null,null,"1",null,0.99999999999999989]
[null,null,null,null,null,null,null,null,null,null,null,null,"Component Score Coefficient Matrix"]
[null,null,null,null,null,null,null,null,null,null,null,null,null,null,"Component"]
[null,null,null,null,null,null,null,null,null,null,null,null,null,null,"1"]
[null,null,null,null,null,null,null,null,null,null,null,null,"Persons per sleeping rooms",null,-6.0288716110452931E-2]
[null,null,null,null,null,null,null,null,null,null,null,null,"Cement floor",null,0.12259908226018813]
[null,null,null,null,null,null,null,null,null,null,null,null,"Wood floor",null,-7.3980809180967971E-2]
[null,null,null,null,null,null,null,null,null,null,null,null,"Earth floor",null,-7.8521092769106654E-2]
[null,null,null,null,null,null,null,null,null,null,null,null,"Cana, palos, desechos",null,-2.451784942756613E-2]
[null,null,null,null,null,null,null,null,null,null,null,null,"Concrete roof",null,2.2112421232492537E-3]
[null,null,null,null,null,null,null,null,null,null,null,null,"Teja roof",null,6.1092597646914791E-3]
[null,null,null,null,null,null,null,null,null,null,null,null,"Tejalit roof",null,1.8119913708782798E-2]
[null,null,null,null,null,null,null,null,null,null,null,null,"Metal roof",null,4.7377691818361801E-2]
[null,null,null,null,null,null,null,null,null,null,null,null,"Protected wood roof",null,-3.8424265789848747E-3]
[null,null,null,null,null,null,null,null,null,null,null,null,"Palma roof",null,-7.2664612220416952E-2]
[null,null,null,null,null,null,null,null,null,null,null,null,"Block, brick, stone, concrete walls",null,0.12403140916531767]
[null,null,null,null,null,null,null,null,null,null,null,null,"Wood walls",null,-9.4669792787276733E-2]
[null,null,null,null,null,null,null,null,null,null,null,null,"Thatch, adobe walls",null,-1.3492722852009783E-2]
[null,null,null,null,null,null,null,null,null,null,null,null,"Metal (zinc, aluminium etc) walls",null,-1.8633500186637883E-2]
[null,null,null,null,null,null,null,null,null,null,null,null,"Palm, straw, stalk, cane walls",null,-5.0929007432402459E-2]
[null,null,null,null,null,null,null,null,null,null,null,null,"No walls",null,-1.2318021241975844E-2]
[null,null,null,null,null,null,null,null,null,null,null,null,"Electricity",null,0.110691712258828]
[null,null,null,null,null,null,null,null,null,null,null,null,"Radio - Sound equipment",null,4.493092785345933E-3]
[null,null,null,null,null,null,null,null,null,null,null,null,"Television",null,0.11487347065488822]
[null,null,null,null,null,null,null,null,null,null,null,null,"Non-mobile telephone",null,5.2221167882676452E-2]
[null,null,null,null,null,null,null,null,null,null,null,null,"Refrigetaror",null,0.1122811207573812]
[null,null,null,null,null,null,null,null,null,null,null,null,"Computer",null,5.7874607890656724E-2]
[null,null,null,null,null,null,null,null,null,null,null,null,"Internet connection",null,5.9458294275572296E-2]
[null,null,null,null,null,null,null,null,null,null,null,null,"Watch",null,3.1323901943321387E-2]
[null,null,null,null,null,null,null,null,null,null,null,null,"Mobile telephone",null,6.511562824021791E-2]
[null,null,null,null,null,null,null,null,null,null,null,null,"Bicycle",null,5.4253106973667024E-2]
[null,null,null,null,null,null,null,null,null,null,null,null,"Motorcycle/scooter",null,2.0978087433608683E-2]
[null,null,null,null,null,null,null,null,null,null,null,null,"Animal drawn cart",null,6.3333674406297396E-3]
[null,null,null,null,null,null,null,null,null,null,null,null,"Car/truck",null,6.4149883483285153E-2]
[null,null,null,null,null,null,null,null,null,null,null,null,"No agricultural land",null,7.3474616272743237E-2]
[null,null,null,null,null,null,null,null,null,null,null,null,"Less than 5 acres of agricultural land",null,-2.2233825774045417E-2]
[null,null,null,null,null,null,null,null,null,null,null,null,"5-19 acres of agricultural land",null,-3.1125461762411641E-2]
[null,null,null,null,null,null,null,null,null,null,null,null,"More than 20 acres of agricultural land",null,-3.0151976294505514E-2]
[null,null,null,null,null,null,null,null,null,null,null,null,"County land",null,-4.2867266092948025E-2]
[null,null,null,null,null,null,null,null,null,null,null,null,"No cattle, milk cows or bulls",null,3.7633383387745779E-2]
[null,null,null,null,null,null,null,null,null,null,null,null,"1-4 cattle, milk cows or bulls",null,-2.440405480542638E-2]
[null,null,null,null,null,null,null,null,null,null,null,null,"5-9 cattle, milk cows or bulls",null,-1.7609262531185554E-2]
[null,null,null,null,null,null,null,null,null,null,null,null,"10+ cattle, milk cows or bulls",null,-2.0335194405767986E-2]
[null,null,null,null,null,null,null,null,null,null,null,null,"No horses, donkeys, mules",null,5.4062444787716164E-2]
[null,null,null,null,null,null,null,null,null,null,null,null,"1-2 horses, donkeys, mules",null,-3.866109072104932E-2]
[null,null,null,null,null,null,null,null,null,null,null,null,"3 or more horses, donkeys, mules",null,-3.3979791927968163E-2]
[null,null,null,null,null,null,null,null,null,null,null,null,"Have goats",null,-1.0658691883046596E-2]
[null,null,null,null,null,null,null,null,null,null,null,null,"Have sheep",null,-7.6761707815532539E-3]
[null,null,null,null,null,null,null,null,null,null,null,null,"No chickens",null,5.2677266408093559E-2]
[null,null,null,null,null,null,null,null,null,null,null,null,"1-9 chickens",null,-2.2343319794462472E-2]
[null,null,null,null,null,null,null,null,null,null,null,null,"10-19 chickens",null,-2.0197908448480566E-2]
[null,null,null,null,null,null,null,null,null,null,null,null,"20+ chickens",null,-2.2636559678619671E-2]
[null,null,null,null,null,null,null,null,null,null,null,null,"No pigs",null,5.8117665137422329E-2]
[null,null,null,null,null,null,null,null,null,null,null,null,"1-2 pigs",null,-4.8065195908333906E-2]
[null,null,null,null,null,null,null,null,null,null,null,null,"3 or more pigs",null,-2.9291406679093652E-2]
[null,null,null,null,null,null,null,null,null,null,null,null,"Household owns bank account",null,6.2784733998635531E-2]
[]
[]
[null,null,null,null,null,null,null,null,null,null,null,null,"Component Score Covariance Matrix"]
[null,null,null,null,null,null,null,null,null,null,null,null,"Component",null,"1"]
[null,null,null,null,null,null,null,null,null,null,null,null,"1",null,0.99999999999999989]
[]
[]
[]
[]
[]
[]
[]
[]
[]
[]
[]
[]
[]
[]
[]
[]
[]
[]
[]
[]
[]
[]
[]
[]
[]
[]
[]
[]
[]
[]
[]
[]
[]
[]
[]
[]
[]
[]
[]
[]
[]
[]
[]
[]
[]
[]
[]
[]
[]
[]
[]
[]
[]
[]
[]
[]
[]
[]
[]
[]
[]
[]
[]
[]
[]
[]
[]
[]
[]
[]
[]
[]
[]
[]
[]
[]
[]
[]
[]
[]
[]
[]
[]
[]
[]
[]
[]
[]
[]
[]
[]
[]
[]
[]
[]
[]
[]
[]
[]
[]
[]
[]
[]
[]
[]
[]
[]
[]
[]
[]
[]
[]
[]
[]
[]
[]
[]
[]
[]
[]
[]
[]
[]
[]
[]
[]
[]
[]
[]
[]
[]
[]
[]
[]
[]
[]
[]
[]
[]
[]
[]
[]
[]
[]
[]
[]
[]
[]
[]
[]
[]
[]
[]
[]
[]
[]
[]
[]
[]
[]
[]
[]
[]
[]
[]
[]
[]
[]
[]
[]
[]
[]
[]
[]
[]
[]
[]
[]
[]
[]
[]
[]
[]
[]
[]
[]
[]
[]
[]
[]
[]
[]
[]
[]
[]
[]
[]
[]
[]
[]
[]
[]
[]
[]
[]
[]
[]
[]
[]
[]
[]
[]
[]
[]
[]
[]
[]
[]
[]
[]
[]
[]
[]
[]
[]
[]
[]
[]
[]
[]
[]
[]
[]
[]
[]
[]
[]
[]
[]
[]
[]
[]
[]
[]
[]
[]
[]
[]
[]
[]
[]
[]
[]
[]
[]
[]
[]
[]
[]
[]
[]
[]
[]
[]
[]
[]
[]
[]
[]
[]
[]
[]
[]
[]
[]
[]
[]
[]
[]
[]
[]
[]
[]
[]
[]
[]
[]
[]
[]
[]
[]
[]
[]
[]
[]
[]
[]
[]
[]
[]
[]
[]
[]
[]
[]
[]
[]
[]
[]
[]
[]
[]
[]
[]
[]
[]
[]
[]
[]
[]
[]
[]
[]
[]
[]
[]
[]
[]
[]
[]
[]
[]
[]
[]
[]
[]
[]
[]
[]
[]
[]
[]
[]
[]
[]
[]
[]
[]
[]
[]
[]
[]
[]
[]
[]
[]
[]
[]
[]
[]
[]
[]
[]
[]
[]
[]
[]
[]
[]
[]
[]
[]
[]
[]
[]
[]
[]
[]
[]
[]
[]
[]
[]
[]
[]
[]
[]
[]
[]
[]
[]
[]
[]
[]
[]
[]
[]
[]
[]
[]
[]
[]
[]
[]
[]
[]
[]
[]
[]
[]
[]
[]
[]
[]
[]
[]
[]
[]
[]
[]
[]
[]
[]
[]
[]
[]
[]
[]
[]
[]
[]
[]
[]
[]
[]
[]
[]
[]
[]
[]
[]
[]
[]
[]
[]
["MICS13"]
["Panama",null,"Count"]
["W_text_t","",7827]
["W_text_i","",7827]
["S_text_s","",7827]
["S_text_i","",7827]
["Urban/Rural","Urban",3647]
[null,"Rural",4180]
[null,"Missing",0]
["2013"]
[]
["Sub-national region names","Weighted population"]
[{"$f":"R15","v":"Bocas del Toro"},{"$f":"BR122+BR123","v":127265.14646751684}]
[{"$f":"S15","v":"Chiriquí"},{"$f":"BS122+BS123","v":407112.86838955496}]
[{"$f":"T15","v":"Coclé"},{"$f":"BT122+BT123","v":232840.70718722398}]
[{"$f":"U15","v":"Colón"},{"$f":"BU122+BU123","v":240518.21790238068}]
[{"$f":"V15","v":"Darien"},{"$f":"BV122+BV123","v":40742.541171517361}]
[{"$f":"W15","v":"Emberá Wounaan"},{"$f":"BW122+BW123","v":4778.8323330009853}]
[{"$f":"X15","v":"Herrera"},{"$f":"BX122+XR123","v":110809.76709950998}]
[{"$f":"Y15","v":"Kuna Yala"},{"$f":"BY122+BY123","v":11323.57968959147}]
[{"$f":"Z15","v":"Los Santos"},{"$f":"BZ122+BZ123","v":91455.099486312145}]
[{"$f":"AA15","v":"Ngöbe Buglé"},{"$f":"CA122+CA123","v":82212.306905627163}]
[{"$f":"AB15","v":"Panamá"},{"$f":"CB122+CB123","v":1794719.3476527717}]
[{"$f":"AC15","v":"Veraguas"},{"$f":"CC122+CC123","v":213172.97770088568}]
[{"$f":"AD15","v":0},{"$f":"CD122+CD123","v":0}]
[{"$f":"AE15","v":0},{"$f":"CE122+CE123","v":0}]
[{"$f":"AF15","v":0},{"$f":"CF122+CF123","v":0}]
[{"$f":"AG15","v":0},{"$f":"CG122+CG123","v":0}]
[{"$f":"AH15","v":0},{"$f":"CH122+CH123","v":0}]
[{"$f":"AI15","v":0},{"$f":"CI122+CI123","v":0}]
[{"$f":"AJ15","v":0},{"$f":"CJ122+CJ123","v":0}]
[{"$f":"AK15","v":0},{"$f":"CK122+CK123","v":0}]
[{"$f":"AL15","v":0},{"$f":"CL122+CL123","v":0}]
[{"$f":"AM15","v":0},{"$f":"CM122+CM123","v":0}]
[{"$f":"AN15","v":0},{"$f":"CN122+CN123","v":0}]
[{"$f":"AO15","v":0},{"$f":"CO122+CO123","v":0}]
[{"$f":"AP15","v":0},{"$f":"CP122+CP123","v":0}]
[{"$f":"AQ15","v":0},{"$f":"CQ122+CQ123","v":0}]
[{"$f":"AR15","v":0},{"$f":"CR122+CR123","v":0}]
[{"$f":"AS15","v":0},{"$f":"CS122+CS123","v":0}]
[{"$f":"AT15","v":0},{"$f":"CT122+CT123","v":0}]
[{"$f":"AU15","v":0},{"$f":"CU122+CU123","v":0}]
[{"$f":"AV15","v":0},{"$f":"CV122+CV123","v":0}]
[{"$f":"AW15","v":0},{"$f":"CW122+CW123","v":0}]
[{"$f":"AX15","v":0},{"$f":"CX122+CX123","v":0}]
[{"$f":"AY15","v":0},{"$f":"CY122+CY123","v":0}]
[]
[{"$f":"34-COUNTIF(A1037:A1071,\"0\")","v":12},"Sub-regions"]

{"sheet":"data_summary","index":5,"n_rows":62,"n_cols":73,"rows_kept":62,"cut":false,"hidden":false,"merged":[]}
["iso3","year","data_source","row","var1","var2","varname","total_q1","total_q2","total_q3","total_q4","total_q5","urban_q1","urban_q2","urban_q3","urban_q4","urban_q5","rural_q1","rural_q2","rural_q3","rural_q4","rural_q5","region_1_name","region_2_name","region_3_name","region_4_name","region_5_name","region_6_name","region_7_name","region_8_name","region_9_name","region_10_name","region_11_name","region_12_name","region_1","region_2","region_3","region_4","region_5","region_6","region_7","region_8","region_9","region_10","region_11","region_12","n_total_q1","n_total_q2","n_total_q3","n_total_q4","n_total_q5","n_urban_q1","n_urban_q2","n_urban_q3","n_urban_q4","n_urban_q5","n_rural_q1","n_rural_q2","n_rural_q3","n_rural_q4","n_rural_q5","n_region_1","n_region_2","n_region_3","n_region_4","n_region_5","n_region_6","n_region_7","n_region_8","n_region_9","n_region_10","n_region_11","n_region_12"]
["PAN",2013,"PAN_2013_MICS",16,"Water","Improved","w_imp",86.750032566288411,99.832086071929282,99.865359414657888,100,99.776266775910997,99.838801301060514,99.987742180568205,100,99.930705345495412,100,66.860208049819477,91.243012954869911,98.464995524380655,99.303349479584639,99.150752806151729,"Bocas del Toro","Chiriquí","Coclé","Colón","Darien","Emberá Wounaan","Herrera","Kuna Yala","Los Santos","Ngöbe Buglé","Panamá","Veraguas",93.562823265734593,97.705987420496825,99.212999983049812,97.669209891084506,88.426708766709623,47.36322148662763,97.497204191772013,83.140863617429929,99.925367317016523,54.311900635550089,99.71551006706899,93.961302527510966]
["PAN",2013,"PAN_2013_MICS",17,"Water","Not Improved","",13.249967433711911,0.16791392807069719,0.13464058534213549,0,0.22373322408901539,0.1611986989394576,0.012257819431783799,0,0.069294654504589298,0,33.139791950180317,8.7569870451301437,1.5350044756193559,0.69665052041538722,0.84924719384825831,"Bocas del Toro","Chiriquí","Coclé","Colón","Darien","Emberá Wounaan","Herrera","Kuna Yala","Los Santos","Ngöbe Buglé","Panamá","Veraguas",6.4371767342653543,2.2940125795031832,0.78700001695017896,2.330790108915485,11.573291233290391,52.636778513372221,2.5027958082280288,16.859136382570039,0.074632682983480705,45.688099364449819,0.28448993293100838,6.0386974724889528]
["PAN",2013,"PAN_2013_MICS",18,"Water ladder","Basic","w_bas",86.576532501155839,99.832086071929282,99.865359414657888,100,99.776266775910983,99.738962499759452,99.987742180568205,100,99.930705345495412,100,66.592767217620192,91.243012954869926,98.46499552438064,99.303349479584625,99.150752806151729,"Bocas del Toro","Chiriquí","Coclé","Colón","Darien","Emberá Wounaan","Herrera","Kuna Yala","Los Santos","Ngöbe Buglé","Panamá","Veraguas",93.562823265734593,97.705987420496825,99.212999983049812,97.473871471302331,88.073001931642779,47.363221486627623,97.497204191772013,83.140863617429929,99.925367317016523,53.768781629194592,99.71551006706899,93.961302527510966]
["PAN",2013,"PAN_2013_MICS",19,"Water ladder","Limited","w_lim",0.17350006513257679,0,0,0,0,0.099838801301060501,0,0,0,0,0.26744083219927789,0,0,0,0,"Bocas del Toro","Chiriquí","Coclé","Colón","Darien","Emberá Wounaan","Herrera","Kuna Yala","Los Santos","Ngöbe Buglé","Panamá","Veraguas",0,0,0,0.19533841978216901,0.35370683506683848,0,0,0,0,0.54311900635550092,0,0]
["PAN",2013,"PAN_2013_MICS",20,"Water ladder","Unimproved","w_unimp",10.18372862898004,0.15737372832022381,0.13125021033083559,0,0.22373322408901691,0.1611986989394871,0.012257819431795301,0,0.069294654504588493,0,26.139408922803909,6.0102361724760653,1.1557258797872989,0.65957690843082695,0.84924719384827085,"Bocas del Toro","Chiriquí","Coclé","Colón","Darien","Emberá Wounaan","Herrera","Kuna Yala","Los Santos","Ngöbe Buglé","Panamá","Veraguas",4.0323120970562716,2.2940125795031752,0.34455125054331998,1.2898441888767971,2.5868991883612309,1.56319401867e-13,1.586417694022924,1.681509455163392,0.074632682983477097,41.107966507577054,0.28448993293100949,5.3228725637004803]
["PAN",2013,"PAN_2013_MICS",21,"Water ladder","Surface water","w_sur",3.066238804731543,0.010540199750493799,0.0033903750112762002,0,0,0,0,0,0,0,7.0003830273766221,2.7467508726540091,0.37927859583206092,0.037073611984547797,0,"Bocas del Toro","Chiriquí","Coclé","Colón","Darien","Emberá Wounaan","Herrera","Kuna Yala","Los Santos","Ngöbe Buglé","Panamá","Veraguas",2.404864637209136,0,0.44244876640686792,1.040945920038703,8.9863920449291523,52.636778513372221,0.9163781142050621,15.17762692740668,0,4.580132856872857,0,0.71582490878855365]
["PAN",2013,"PAN_2013_MICS",22,"Improved water point at more than 30 minutes","Yes","",0.20000000000000001,0,0,0,0,0.10000000000000001,0,0,0,0,0.40000000000000002,0,0,0,0,"Bocas del Toro","Chiriquí","Coclé","Colón","Darien","Emberá Wounaan","Herrera","Kuna Yala","Los Santos","Ngöbe Buglé","Panamá","Veraguas",0,0,0,0.20000000000000001,0.40000000000000002,0,0,0,0,1,0,0]
["PAN",2013,"PAN_2013_MICS",23,"Improved water point at more than 30 minutes","No","",99.799999999999997,100,100,100,100,99.900000000000006,100,100,100,100,99.599999999999994,100,100,100,100,"Bocas del Toro","Chiriquí","Coclé","Colón","Darien","Emberá Wounaan","Herrera","Kuna Yala","Los Santos","Ngöbe Buglé","Panamá","Veraguas",100,100,100,99.799999999999997,99.599999999999994,100,100,100,100,99,100,100]
["PAN",2013,"PAN_2013_MICS",29,"Piped water","Yes","w_pip",78.900000000000006,96.200000000000003,98.099999999999994,98.700000000000003,95.700000000000003,97.5,99,99.299999999999997,99.099999999999994,95.200000000000003,56.600000000000001,83.200000000000003,89.799999999999997,92.299999999999997,93.900000000000006,"Bocas del Toro","Chiriquí","Coclé","Colón","Darien","Emberá Wounaan","Herrera","Kuna Yala","Los Santos","Ngöbe Buglé","Panamá","Veraguas",79.299999999999997,87.400000000000006,95.400000000000006,91.700000000000003,81.5,27.699999999999999,95.299999999999997,83,98.799999999999997,49.600000000000001,98.200000000000003,92]
["PAN",2013,"PAN_2013_MICS",30,"Piped water","No","",21.100000000000001,3.7999999999999998,1.8999999999999999,1.3,4.2999999999999998,2.5,1,0.69999999999999996,0.90000000000000002,4.7999999999999998,43.399999999999999,16.800000000000001,10.199999999999999,7.7000000000000002,6.0999999999999996,"Bocas del Toro","Chiriquí","Coclé","Colón","Darien","Emberá Wounaan","Herrera","Kuna Yala","Los Santos","Ngöbe Buglé","Panamá","Veraguas",20.699999999999999,12.6,4.5999999999999996,8.3000000000000007,18.5,72.299999999999997,4.7000000000000002,17,1.2,50.399999999999999,1.8,8]
["PAN",2013,"PAN_2013_MICS",31,"Piped water on premises","Yes","w_pop",78.900000000000006,96.200000000000003,98.099999999999994,98.700000000000003,95.700000000000003,97.5,99,99.299999999999997,99.099999999999994,95.200000000000003,56.600000000000001,83.200000000000003,89.799999999999997,92.299999999999997,93.900000000000006,"Bocas del Toro","Chiriquí","Coclé","Colón","Darien","Emberá Wounaan","Herrera","Kuna Yala","Los Santos","Ngöbe Buglé","Panamá","Veraguas",79.299999999999997,87.400000000000006,95.400000000000006,91.700000000000003,81.5,27.699999999999999,95.299999999999997,83,98.799999999999997,49.600000000000001,98.200000000000003,92]
["PAN",2013,"PAN_2013_MICS",32,"Piped water on premises","No","",21.100000000000001,3.7999999999999998,1.8999999999999999,1.3,4.2999999999999998,2.5,1,0.69999999999999996,0.90000000000000002,4.7999999999999998,43.399999999999999,16.800000000000001,10.199999999999999,7.7000000000000002,6.0999999999999996,"Bocas del Toro","Chiriquí","Coclé","Colón","Darien","Emberá Wounaan","Herrera","Kuna Yala","Los Santos","Ngöbe Buglé","Panamá","Veraguas",20.699999999999999,12.6,4.5999999999999996,8.3000000000000007,18.5,72.299999999999997,4.7000000000000002,17,1.2,50.399999999999999,1.8,8]
["PAN",2013,"PAN_2013_MICS",35,"Water source on premises","Yes","",89.299999999999997,98.900000000000006,99,99.299999999999997,96.200000000000003,99.299999999999997,99.200000000000003,99.400000000000006,99.099999999999994,95.299999999999997,77.599999999999994,90.5,96.700000000000003,97.400000000000006,98.5,"Bocas del Toro","Chiriquí","Coclé","Colón","Darien","Emberá Wounaan","Herrera","Kuna Yala","Los Santos","Ngöbe Buglé","Panamá","Veraguas",91.799999999999997,96.400000000000006,99.400000000000006,93.099999999999994,87.799999999999997,47,97.799999999999997,84,99.5,73.900000000000006,98.400000000000006,94.900000000000006]
["PAN",2013,"PAN_2013_MICS",36,"Water source on premises","No","",10.699999999999999,1.1000000000000001,1,0.69999999999999996,3.7999999999999998,0.69999999999999996,0.80000000000000004,0.59999999999999998,0.90000000000000002,4.7000000000000002,22.399999999999999,9.5,3.2999999999999998,2.6000000000000001,1.5,"Bocas del Toro","Chiriquí","Coclé","Colón","Darien","Emberá Wounaan","Herrera","Kuna Yala","Los Santos","Ngöbe Buglé","Panamá","Veraguas",8.1999999999999993,3.6000000000000001,0.59999999999999998,6.9000000000000004,12.199999999999999,53,2.2000000000000002,16,0.5,26.100000000000001,1.6000000000000001,5.0999999999999996]
["PAN",2013,"PAN_2013_MICS",37,"Improved Water source on premises","Yes","w_premises",84.099999999999994,98.900000000000006,99,99.299999999999997,96.099999999999994,99.200000000000003,99.200000000000003,99.400000000000006,99.099999999999994,95.299999999999997,63.200000000000003,88.5,96.099999999999994,97.200000000000003,98,"Bocas del Toro","Chiriquí","Coclé","Colón","Darien","Emberá Wounaan","Herrera","Kuna Yala","Los Santos","Ngöbe Buglé","Panamá","Veraguas",88.799999999999997,95.200000000000003,99.200000000000003,92.5,84.900000000000006,46.5,96.900000000000006,83,99.5,52.399999999999999,98.400000000000006,92.400000000000006]
["PAN",2013,"PAN_2013_MICS",38,"Improved Water source on premises","No","",15.9,1.1000000000000001,1,0.69999999999999996,3.8999999999999999,0.80000000000000004,0.80000000000000004,0.59999999999999998,0.90000000000000002,4.7000000000000002,36.799999999999997,11.5,3.8999999999999999,2.7999999999999998,2,"Bocas del Toro","Chiriquí","Coclé","Colón","Darien","Emberá Wounaan","Herrera","Kuna Yala","Los Santos","Ngöbe Buglé","Panamá","Veraguas",11.199999999999999,4.7999999999999998,0.80000000000000004,7.5,15.1,53.5,3.1000000000000001,17,0.5,47.600000000000001,1.6000000000000001,7.5999999999999996]
["PAN",2013,"PAN_2013_MICS",41,"Water point at more than 30 minutes","Yes","",0.59999999999999998,0.10000000000000001,0.10000000000000001,0,0,0.10000000000000001,0,0,0.10000000000000001,0,1.6000000000000001,0.29999999999999999,0,0.20000000000000001,0.29999999999999999,"Bocas del Toro","Chiriquí","Coclé","Colón","Darien","Emberá Wounaan","Herrera","Kuna Yala","Los Santos","Ngöbe Buglé","Panamá","Veraguas",0.20000000000000001,0,0,0.69999999999999996,0.69999999999999996,0,0,7.2999999999999998,0,2.2999999999999998,0,0.29999999999999999]
["PAN",2013,"PAN_2013_MICS",42,"Water point at more than 30 minutes","No","w_30min",99.400000000000006,99.900000000000006,99.900000000000006,100,100,99.900000000000006,100,100,99.900000000000006,100,98.400000000000006,99.700000000000003,100,99.799999999999997,99.700000000000003,"Bocas del Toro","Chiriquí","Coclé","Colón","Darien","Emberá Wounaan","Herrera","Kuna Yala","Los Santos","Ngöbe Buglé","Panamá","Veraguas",99.799999999999997,100,100,99.299999999999997,99.299999999999997,100,100,92.700000000000003,100,97.700000000000003,100,99.700000000000003]
["PAN",2013,"PAN_2013_MICS",58,"Fuente principal de agua potable","Acueducto público del IDAAN","",24.998956015922371,67.848380136098896,84.449935440817441,89.314167926600149,87.892879637994568,78.844587939192493,91.07915753067708,94.796942011317782,93.700856552188029,93.865945466319232,1.9500215792580571,19.736415527818892,27.434900703697298,35.581891687862473,44.352886082214752,"Bocas del Toro","Chiriquí","Coclé","Colón","Darien","Emberá Wounaan","Herrera","Kuna Yala","Los Santos","Ngöbe Buglé","Panamá","Veraguas",42.10913768999518,62.693495120468882,41.115715014363957,66.87711629868609,33.098950811390402,0,69.255444614563132,0,61.179023276197718,0.91043618268278959,86.683515997879013,52.574066650721761]
["PAN",2013,"PAN_2013_MICS",59,"Fuente principal de agua potable","Acueducto público de la comunidad","",51.458079235144268,27.625486109746351,13.325585380548549,9.3354497169235486,7.5116681434274764,18.305241493468969,7.7293896593947462,4.392519037137899,5.3650251023635516,1.0811623753834221,52.479571646641709,59.149665627724943,60.58400847510471,55.109194662221817,48.854443811524852,"Bocas del Toro","Chiriquí","Coclé","Colón","Darien","Emberá Wounaan","Herrera","Kuna Yala","Los Santos","Ngöbe Buglé","Panamá","Veraguas",35.339367474691727,23.802770414594519,51.769859909116548,24.314474270835319,47.023931889425867,27.263123523449931,25.369791120760951,83.036948434947391,36.601795393137813,47.855904079641618,11.453809828816279,35.752408786816787]
["PAN",2013,"PAN_2013_MICS",60,"Fuente principal de agua potable","Acueducto particular","",2.395962711228258,0.7161297942434881,0.36025107260368078,0.063189743443389901,0.28533781652292228,0.33570397859336309,0.20958899289063579,0.088188138749549297,0,0.26285998118174381,2.1796138801970431,4.3203268111460567,1.752029929945117,1.606553414420365,0.70150316929480017,"Bocas del Toro","Chiriquí","Coclé","Colón","Darien","Emberá Wounaan","Herrera","Kuna Yala","Los Santos","Ngöbe Buglé","Panamá","Veraguas",1.8521840108247349,0.91942709005461543,2.4669903326063571,0.52032761875523814,1.3783224050515179,0.40420087118223141,0.70288943395573844,0,0.99730081070167675,0.81965912022596621,0.10297108538922591,3.6421094689002409]
["PAN",2013,"PAN_2013_MICS",61,"Fuente principal de agua potable","Pozo brocal protegido","",1.5169702363619799,1.6411356006885209,0.61369893023762301,0.38510542398318109,0.32302975683184648,1.222411649249834,0.12456589464496701,0.072726456933985106,0,0.030603707062809699,0.74393440981325754,1.161248347961551,4.0661350920362462,2.4905056329034738,2.9995566113852941,"Bocas del Toro","Chiriquí","Coclé","Colón","Darien","Emberá Wounaan","Herrera","Kuna Yala","Los Santos","Ngöbe Buglé","Panamá","Veraguas",0.73020254753821023,5.7955560058668878,0,0.82229208695866629,0.91382974329314981,1.1725804523145269,0,0,0.73291248458694447,0.16452617146262799,0.1058133448095665,0.21187888500171589]
["PAN",2013,"PAN_2013_MICS",62,"Fuente principal de agua potable","Pozo artesanal protegido","",1.7234717665237931,0.70403258048184736,0.081385546545778106,0,0.099609144113356807,0.34942603938475558,0,0,0,0.1423697260761817,1.3616496882219651,1.975617552880284,2.191566885768252,1.6891374396993879,0.26882485302913411,"Bocas del Toro","Chiriquí","Coclé","Colón","Darien","Emberá Wounaan","Herrera","Kuna Yala","Los Santos","Ngöbe Buglé","Panamá","Veraguas",1.9894593099438711,2.5569269419664979,0.18570706724184119,0,1.024056699367998,0,0.35942054413615648,0,0,1.098931060368155,0.0436433419837342,0.76897954678312674]
["PAN",2013,"PAN_2013_MICS",63,"Fuente principal de agua potable","Pozo artesanal no protegido","",4.6522609375489878,0.063927349060908897,0,0,0.13944902343222579,0.1584623255239247,0,0,0,0,9.9143773692281307,4.059215324572679,1.0360971471902909,0.21194143340543831,0.46149320651777931,"Bocas del Toro","Chiriquí","Coclé","Colón","Darien","Emberá Wounaan","Herrera","Kuna Yala","Los Santos","Ngöbe Buglé","Panamá","Veraguas",3.9520210338186241,2.1417568833484979,0,0.39698731202170617,1.708348289633614,0,0.1174107110844778,1.6972813138814951,0,11.54176844493133,0.15517632705327741,2.163627262530067]
["PAN",2013,"PAN_2013_MICS",64,"Fuente principal de agua potable","Manantial protegido","",3.1239968967474279,0.34221457311791081,0,0.085890193902049605,0.0307304329415461,0,0,0,0,0,6.3122238850340544,3.5697592035765759,0.55911057201864367,1.0174736767159449,0.38547660768429992,"Bocas del Toro","Chiriquí","Coclé","Colón","Darien","Emberá Wounaan","Herrera","Kuna Yala","Los Santos","Ngöbe Buglé","Panamá","Veraguas",0.47116657036264248,0.46577074636954968,3.6263122777089332,0.1681871968400076,0,0,1.8096584783559391,0,0,2.350690468063112,0.37460535202705231,0.95621489871315579]
["PAN",2013,"PAN_2013_MICS",65,"Fuente principal de agua potable","Manantial no protegido","",5.3482023094661582,0.042021953236465702,0,0,0.036308350109223703,0,0,0,0,0,15.79362714588807,1.7840460870100889,0.1014778275848927,0.13931741475697951,0.1201590122531012,"Bocas del Toro","Chiriquí","Coclé","Colón","Darien","Emberá Wounaan","Herrera","Kuna Yala","Los Santos","Ngöbe Buglé","Panamá","Veraguas",0,0.1522556961546849,0.29454279782013271,0.36674669015274608,0.73376435625864467,0,1.02078509790661,0,0.074632682983480705,29.446479491575229,0.12931360587773111,2.9162331170736748]
["PAN",2013,"PAN_2013_MICS",66,"Fuente principal de agua potable","Recogen agua de lluvia","",0.99640212965855768,0.28096267824940091,0.091821585007545101,0.097568474553082402,0.022634389211784799,0.30538904973181791,0.069542543058810594,0.077634724436231803,0.027777793937697099,0.0323509635653157,1.771305849535773,0.82040743623102619,0.4732259388522812,0.44406049700589711,0.23162482695671319,"Bocas del Toro","Chiriquí","Coclé","Colón","Darien","Emberá Wounaan","Herrera","Kuna Yala","Los Santos","Ngöbe Buglé","Panamá","Veraguas",5.7203744358569883,0,0,0,2.3827768418818138,17.515446663783809,0,0,0,1.1117535531058269,0,0]
["PAN",2013,"PAN_2013_MICS",67,"Fuente principal de agua potable","Carrotanque / camión cisterna","",0.32766854765936909,0.16032490528315649,0.5837654497022684,0.1179922018300187,0,0.25169189973531769,0.68051525487463127,0.23436431321780959,0.0123740454472481,0,0.061887111117621102,0.24954714084739929,0.46640443372602958,0.3870695310025617,0.047797627920992701,"Bocas del Toro","Chiriquí","Coclé","Colón","Darien","Emberá Wounaan","Herrera","Kuna Yala","Los Santos","Ngöbe Buglé","Panamá","Veraguas",1.441287417894505,0,0,2.3366709596137909,1.307024553876063,0,0,0,0,0,0,0]
["PAN",2013,"PAN_2013_MICS",68,"Fuente principal de agua potable","Agua de superficie (río, arroyo, represa, lago, estanque, canal, canal de irrigación)","",3.0491632547866629,0.0104926675982711,0.0033757649455505002,0,0,0,0,0,0,0,6.9742937838862122,2.738124431218278,0.37468281826590788,0.036620671013267402,0,"Bocas del Toro","Chiriquí","Coclé","Colón","Darien","Emberá Wounaan","Herrera","Kuna Yala","Los Santos","Ngöbe Buglé","Panamá","Veraguas",2.3132435734225218,0,0.44223455314640348,1.015948960132578,8.8889461570343151,52.636778513372221,0.91173011362538381,15.16185506868854,0,4.5666635748544691,0,0.71542659309630519]
["PAN",2013,"PAN_2013_MICS",69,"Fuente principal de agua potable","Agua embotellada/envasada","",0.20852502704241871,0.51341969401967524,0.35891600919492989,0.60063631876465018,3.6103774548674679,0.22434925170396799,0.094982305027367805,0.33762531820671948,0.82467185155887612,4.584707780411251,0,0.2600253066830569,0.93761349323215148,0.97746293775275661,1.308639216140959,"Bocas del Toro","Chiriquí","Coclé","Colón","Darien","Emberá Wounaan","Herrera","Kuna Yala","Los Santos","Ngöbe Buglé","Panamá","Veraguas",3.9096438086268011,1.472041101175948,0.048415382012236503,2.6301414593953671,1.297815822422717,1.007869975897159,0,0.1039151824825405,0.41433535239244829,0,0.95115111616407877,0.055644290574157103]
["PAN",2013,"PAN_2013_MICS",70,"Fuente principal de agua potable","Otra","",0.2003409319100862,0.051471958175051499,0.13126482039658499,0,0.047975850547566,0.0027363734155329,0.012257819431783799,0,0.069294654504589298,0,0.45749365117793622,0.17560120232909521,0.022746682578264898,0.30877100123970219,0.26759497507737767,"Bocas del Toro","Chiriquí","Coclé","Colón","Darien","Emberá Wounaan","Herrera","Kuna Yala","Los Santos","Ngöbe Buglé","Panamá","Veraguas",0.17191212702420741,0,0.050222665983642598,0.55110714660845439,0.24223243036381689,0,0.45286988561155728,0,0,0.13318785308879411,0,0.24341049978890469]
["PAN",2013,"PAN_2013_MICS",122,"Sanitation","Improved","s_imp",61.998144902177977,87.233440029093188,95.412947420371992,97.078325206633451,99.761223423878732,84.498220443890546,95.396723636631265,96.58977862352107,99.285521389358507,99.999999999999929,39.918631782383351,68.054087383597505,77.460531618490577,82.665124857257013,94.366339932225856,"Bocas del Toro","Chiriquí","Coclé","Colón","Darien","Emberá Wounaan","Herrera","Kuna Yala","Los Santos","Ngöbe Buglé","Panamá","Veraguas",70.362444222440075,90.795437538679906,79.495288985073245,91.532177125546355,64.395417131760809,40.437889722367167,85.097347485227601,0.54770110425270635,88.55547951349061,25.819619994576691,94.934734190169536,80.288241734626041,558922.88134829293,667495.7943613925,669862.78248759604,670159.68492880394,672354.70137032855,454870.31242439471,467930.64914138761,469567.48170593468,465149.58227252233,470413.7472895963,123097.5715191809,188301.43959654449,198999.59224043941,198137.47862800059,202327.98967841471,95570.409727219419,404450.55468554469,226759.750740085,236691.6843407093,36219.683793966127,3141.1530947174251,110809.76709951001,62.019371000827647,91124.704329812768,30775.388898705922,1794719.347652772,208471.38076237179]
["PAN",2013,"PAN_2013_MICS",123,"Sanitation","Not Improved","",38.001855097822023,12.76655997090681,4.5870525796280077,2.9216747933665488,0.23877657612126771,15.501779556109449,4.6032763633687352,3.4102213764789302,0.71447861064149265,0,60.081368217616649,31.945912616402499,22.539468381509419,17.334875142742991,5.6336600677741444,"Bocas del Toro","Chiriquí","Coclé","Colón","Darien","Emberá Wounaan","Herrera","Kuna Yala","Los Santos","Ngöbe Buglé","Panamá","Veraguas",29.637555777559921,9.2045624613200943,20.504711014926759,8.4678228744536455,35.604582868239191,59.562110277632833,14.9026525147724,99.45229889574729,11.44452048650939,74.180380005423302,5.0652658098304641,19.711758265373959,112626.2596912666,4212.1289277597243,1211.728520220543,1087.526606852246,0,13643.67384616834,177.60434236788109,64.653069931196498,352.25042309909242,0,80042.696435129619,14942.898214195829,4608.9354067378281,4468.053424525403,836.87858394390219,31694.736740297409,2662.3137040102829,6080.9564471389413,3826.5335616714142,4522.8573775512332,1637.6792382835599,982.09625662105191,11261.56031859064,330.39515649937078,51436.918006921253,0,4701.5969385138706]
["PAN",2013,"PAN_2013_MICS",124,"Sanitation ladder","Basic","s_bas",52.707319464783353,78.239458083864363,90.496212871450695,94.678550106594116,99.057350801703421,72.001787277266828,89.400376344627105,94.145830307165966,96.169135700869177,99.920463585531394,32.147429410352721,61.92697750892998,71.171623755138341,73.915626749729313,91.183493539332218,"Bocas del Toro","Chiriquí","Coclé","Colón","Darien","Emberá Wounaan","Herrera","Kuna Yala","Los Santos","Ngöbe Buglé","Panamá","Veraguas",61.851037849215309,84.899741871728253,72.77666553508034,83.971375833802611,55.944209615773801,34.018435931466428,79.899263356225276,0.54770110425270635,83.943040442544529,20.15469362645894,90.124007113340681,73.584351240621189,475155.87386736542,598675.33834131213,635344.01354963845,653533.38642434741,667610.8535059673,387599.58851054352,438517.95472315629,457686.32126965979,450489.86343390838,470039.59706183511,99125.105946468117,171348.1065298201,182843.1048746072,177166.0774805455,195503.7458580877,84009.717039051902,378188.0304068338,207594.92477004611,217083.92150689161,31466.23894431291,2633.8148120145352,104041.06620905751,62.019371000827647,86378.446403275229,24023.14730498855,1703773.657071633,191064.4818495239]
["PAN",2013,"PAN_2013_MICS",125,"Sanitation ladder","Limited","s_lim",9.2908254373947781,8.9939819452288035,4.9167345489212293,2.399775100039315,0.70387262217531654,12.496433166623699,5.9963472920041747,2.443948316355085,3.1163856884893311,0.079536414468533101,7.7712023720306078,6.1271098746675241,6.2889078633522209,8.7494981075277156,3.1828463928936439,"Bocas del Toro","Chiriquí","Coclé","Colón","Darien","Emberá Wounaan","Herrera","Kuna Yala","Los Santos","Ngöbe Buglé","Panamá","Veraguas",8.5114063732247818,5.8956956669516698,6.7186234499929114,7.5608012917437382,8.4512075159870612,6.4194537909007261,5.1980841290023134,0,4.6124390709460776,5.6649263681177562,4.8107270768287913,6.7038904940048472,83756.683596935574,68820.456020080339,34518.768937957087,16564.820078252229,4743.8478643612743,67270.723913851107,29412.69441823148,11881.16043627476,14598.240412409739,374.15022776121151,23962.141688719439,16953.333066724441,16156.48736583215,20971.40114745517,6824.2438203269503,11560.692688167541,26262.524278710949,19164.82597003895,19546.284407613421,4753.4448496532532,497.01439870955147,6768.7008904524964,0,4746.2579265375398,6752.2415937173801,90945.690581137504,17406.898912847879]
["PAN",2013,"PAN_2013_MICS",126,"Sanitation ladder","Unimproved","s_unimp",27.740283952145731,12.4481966258156,4.5537288113204824,2.8516897508168402,0.23877657612126199,14.68334457378551,4.565335493698913,3.4102213764789489,0.71447861064149221,7.3052675020299997e-14,33.116353968441658,27.654936932929761,21.731686747835091,16.288235334638131,5.4024539419700597,"Bocas del Toro","Chiriquí","Coclé","Colón","Darien","Emberá Wounaan","Herrera","Kuna Yala","Los Santos","Ngöbe Buglé","Panamá","Veraguas",23.024290541366721,8.5506126820999349,20.170318358416669,8.2589920209674172,27.188980171638789,37.709260761375234,14.79809381102371,54.995382991567382,11.361242594854049,18.102991223708461,5.0652658098305272,18.031267538807128,43715.826198016242,2073.657113933511,988.10120500098299,617.7969859478892,0,9809.1914854495826,0,64.653069931196498,352.25042309909242,0,25268.678072227191,6221.7331007017738,2964.223115809179,2347.503272641055,367.14896303954498,23278.35505117078,0,5302.3542209387278,3324.385700358147,1094.1269840575089,595.6242627518875,865.20813339936331,6227.4460186461611,254.23327783587129,5334.4030370360661,0,1119.244816704095]
["PAN",2013,"PAN_2013_MICS",127,"Sanitation ladder","Open defecation","s_od",10.26157114567614,0.31836334509123521,0.033323768307593503,0.069985042549728496,0,0.81843498232395884,0.0379408696698069,0,0,0,26.96501424917502,4.2909756834727339,0.80778163367434541,1.04663980810484,0.2312061258040774,"Bocas del Toro","Chiriquí","Coclé","Colón","Darien","Emberá Wounaan","Herrera","Kuna Yala","Los Santos","Ngöbe Buglé","Panamá","Veraguas",6.6132652361931887,0.6539497792201423,0.3343926565100786,0.20883085348623301,8.4156026966003488,21.852849516257621,0.1045587037487001,44.456915904179922,0.083277891655345507,56.077388781714838,0,1.680490726566837,68910.433493250297,2138.4718138262128,223.6273152195609,469.72962090435709,0,3834.4823607187591,177.60434236788109,0,0,0,54774.018362902338,8721.165113494053,1644.7122909286491,2120.550151884348,469.72962090435709,8416.3816891266342,2662.3137040102829,778.60222620021204,502.14786131326741,3428.730393493724,1042.0549755316731,116.8881232216886,5034.1142999444764,76.161878663499451,46102.514969885167,0,3582.3521218097771]
["PAN",2013,"PAN_2013_MICS",128,"Shared among Improved Sanitation","Yes","s_shared",14.985650703023531,10.310245637715569,5.1531104340158329,2.4719988678537028,0.70555732780522262,14.78898975738989,6.2856952140667079,2.5302349287711769,3.1388118276260042,0.079536414468533198,19.46760704223372,9.003294453323738,8.1188545081596075,10.5842676976972,3.3728619708887431,"Bocas del Toro","Chiriquí","Coclé","Colón","Darien","Emberá Wounaan","Herrera","Kuna Yala","Los Santos","Ngöbe Buglé","Panamá","Veraguas",12.096518913295959,6.4933831773650903,8.4515995045372581,8.2602659842486599,13.123926969360051,15.8748486505466,6.1083973620971799,0,5.2085303995710559,21.940394046495069,5.0674045889169834,8.3497786838613131]
["PAN",2013,"PAN_2013_MICS",129,"Shared among Improved Sanitation","No","",85.014349296976718,89.689754362284418,94.8468895659841,97.528001132146287,99.294442672194776,85.211010242610101,93.714304785933322,97.469765071228792,96.861188172374,99.920463585531465,80.532392957766234,90.996705546676253,91.881145491840371,89.415732302302814,96.627138029111265,"Bocas del Toro","Chiriquí","Coclé","Colón","Darien","Emberá Wounaan","Herrera","Kuna Yala","Los Santos","Ngöbe Buglé","Panamá","Veraguas",87.903481086704062,93.506616822634925,91.548400495462744,91.739734015751338,86.876073030640029,84.125151349453361,93.891602637902807,100,94.79146960042894,78.059605953504942,94.932595411082957,91.650221316138683]
["PAN",2013,"PAN_2013_MICS",135,"Sanitation type","Sewer connection","s_sew",4.323451297697015,15.433373474358151,30.99628215441134,45.76596705430925,69.78883779970208,19.426882944457819,32.809109971757138,42.531743839469243,58.858917180320617,81.435735651333317,0.1462439673552714,1.2315747911067061,1.297524809901321,2.1549757020050468,2.9118261216427359,"Bocas del Toro","Chiriquí","Coclé","Colón","Darien","Emberá Wounaan","Herrera","Kuna Yala","Los Santos","Ngöbe Buglé","Panamá","Veraguas",4.60215344508799,3.3646522491669271,5.2021754505098103,32.663290044159758,0.85459057066522881,0,35.403446159249768,0,30.001806568639541,0,50.965147674538038,11.664721539879629]
["PAN",2013,"PAN_2013_MICS",136,"Sanitation type","Septic tank connection","s_sep",17.088846016182579,43.687464761199593,52.810349596355209,44.632892316226517,29.288368956055251,36.151525228590941,48.627715850220007,46.418041638895502,38.552542593153618,18.55457431275552,2.038388345319734,18.85729799550986,39.717426107717017,47.984172726478903,77.192721123033252,"Bocas del Toro","Chiriquí","Coclé","Colón","Darien","Emberá Wounaan","Herrera","Kuna Yala","Los Santos","Ngöbe Buglé","Panamá","Veraguas",52.888746561712409,71.915662045734564,49.132363481208287,45.122247282971792,24.690494833262829,2.5882110391059658,31.19561069484805,0.54770110425270635,39.842662097492507,0.92329948824659658,28.695187638185029,36.964728474215107]
["PAN",2013,"PAN_2013_MICS",137,"Sanitation type","Improved latrines","s_lat",61.816590520461411,40.252084312812073,16.012802827608279,9.4391248194672315,0.92279324424269649,41.509475167473568,18.525233308353211,11.03644777418681,2.512869112395093,0.0096900359110890996,58.412694233565148,72.558942953219372,56.721423162584998,47.655554717446442,19.483531840501669,"Bocas del Toro","Chiriquí","Coclé","Colón","Darien","Emberá Wounaan","Herrera","Kuna Yala","Los Santos","Ngöbe Buglé","Panamá","Veraguas",17.60460915651386,24.065735925878428,43.053823043042087,20.623508941777491,63.35384616121177,63.142345629009178,32.522438908529828,0,29.794266452680379,36.510741784957737,20.339664687276908,49.165018595753573]
["PAN",2013,"PAN_2013_MICS",138,"Sanitation type","Unimproved facilities","",6.5096987735468073,0.3087141065389602,0.1472416533176111,0.092037177262087197,0,2.0936816771537852,0,0.0137667474484157,0.075671114130590106,0,12.43902960584383,3.061208576691274,1.4558442861223031,1.158657045964796,0.18071478901825891,"Bocas del Toro","Chiriquí","Coclé","Colón","Darien","Emberá Wounaan","Herrera","Kuna Yala","Los Santos","Ngöbe Buglé","Panamá","Veraguas",18.291225600492549,0,2.2772453687297798,1.3821762564810851,2.6854657382598419,12.46380331527242,0.77394553362359031,54.99538299156734,0.2779869895324118,6.4885699450807408,0,0.52504066358474677]
["PAN",2013,"PAN_2013_MICS",139,"Sanitation type","Open defecation","",10.261413392112591,0.31836334509123521,0.033323768307593503,0.069978632734983906,0,0.81843498232395884,0.0379408696698069,0,0,0,26.96364384791589,4.2909756834727339,0.80778163367434541,1.04663980810484,0.2312061258040774,"Bocas del Toro","Chiriquí","Coclé","Colón","Darien","Emberá Wounaan","Herrera","Kuna Yala","Los Santos","Ngöbe Buglé","Panamá","Veraguas",6.6132652361931887,0.6539497792201423,0.3343926565100786,0.20877747460987511,8.4156026966003488,21.80564001661233,0.1045587037487001,44.456915904179922,0.083277891655345507,56.077388781714838,0,1.680490726566837]
["PAN",2013,"PAN_2013_MICS",148,"Shared among improved sanitation facilities","Yes","",12.47216003690813,10.24559241211376,5.1438056984338401,2.4677674325612182,0.70555732780522262,14.358317122896469,6.2833103666376973,2.5298865977186811,3.136022113570307,0.079536414468533198,11.79586003800531,8.3413556556302471,7.9350740131223301,10.350853175133579,3.3589684470025629,"Bocas del Toro","Chiriquí","Coclé","Colón","Darien","Emberá Wounaan","Herrera","Kuna Yala","Los Santos","Ngöbe Buglé","Panamá","Veraguas",9.0839424689762076,6.4509197124127926,8.2308743181357755,8.1267375827417219,11.667030855150321,10.400331379641409,6.0547348324356181,0,5.1897138084114172,8.2131761628686348,5.0674045889169834,8.1656216939805617]
["PAN",2013,"PAN_2013_MICS",149,"Shared among improved sanitation facilities","No","",70.755190473749096,89.127330136256006,94.675628879940888,97.361057922194775,99.294442672194776,82.729566217625717,93.678748763692525,97.456346654832871,96.775099858408311,99.920463585531465,48.796384362731487,84.306460084205696,89.801300067081016,87.443849970796833,96.229110638175086,"Bocas del Toro","Chiriquí","Coclé","Colón","Darien","Emberá Wounaan","Herrera","Kuna Yala","Los Santos","Ngöbe Buglé","Panamá","Veraguas",66.011566694338057,92.895130508367089,89.157487656624326,90.25674786722368,77.231900709989532,55.114191678714199,93.066760930192061,0.54770110425270635,94.449021310400838,29.220865110335719,94.932595411082957,89.628846915867811]
["PAN",2013,"PAN_2013_MICS",150,"Shared among improved sanitation facilities","DK/missing","",16.77264948934317,0.62707745163019535,0.1805654216252045,0.17117464524401649,0,2.9121166594777441,0.0379408696698069,0.0137667474484157,0.088878028021403002,0,39.407755599263098,7.3521842601640088,2.263625919796648,2.205296854069636,0.41192091482233639,"Bocas del Toro","Chiriquí","Coclé","Colón","Darien","Emberá Wounaan","Herrera","Kuna Yala","Los Santos","Ngöbe Buglé","Panamá","Veraguas",24.904490836685731,0.6539497792201423,2.6116380252398592,1.6165145500345039,11.10106843486019,34.485476941644293,0.87850423737229033,99.452298895747305,0.3612648811877574,62.565958726795593,0,2.2055313901515841]
["PAN",2013,"PAN_2013_MICS",151,"Shared among all sanitation facilities","Yes","",16.38792591929391,10.369919191586909,5.2313271137527968,2.4694955517838069,0.70555732780522262,14.92071597891524,6.2856952140667079,2.5298865977186811,3.136022113570307,0.079536414468533198,22.48404075603586,10.01716394846788,8.6262363331221898,10.915609752152919,3.3778048495592952,"Bocas del Toro","Chiriquí","Coclé","Colón","Darien","Emberá Wounaan","Herrera","Kuna Yala","Los Santos","Ngöbe Buglé","Panamá","Veraguas",14.72395804949573,6.4933831773650903,8.380203150770047,9.093734452882229,13.213116933600221,16.33509261632004,6.2204659495460248,49.652098199231077,5.2618149902931437,27.852139445800681,5.0674045889169834,8.6549157340968979]
["PAN",2013,"PAN_2013_MICS",152,"Shared among all sanitation facilities","No","",83.610360967382647,89.630080808413055,94.76867288624716,97.521339199253333,99.294442672194776,85.079284021084717,93.714304785933322,97.470113402281285,96.850770972538896,99.920463585531465,77.509000866286101,89.982836051532104,91.373763666877778,89.084390247847097,96.622195150440689,"Bocas del Toro","Chiriquí","Coclé","Colón","Darien","Emberá Wounaan","Herrera","Kuna Yala","Los Santos","Ngöbe Buglé","Panamá","Veraguas",85.276041950504307,93.506616822634925,91.619796849229957,90.880651251294211,86.786883066399866,83.388629644715863,93.779534050453947,50.34790180076898,94.738185009706839,72.147860554199326,94.932595411082957,91.345084265903083]
["PAN",2013,"PAN_2013_MICS",153,"Tipo de servicio sanitario","Servicio conectado al alcantarillado","",4.323451297697015,15.433373474358151,30.99628215441134,45.76596705430925,69.78883779970208,19.426882944457819,32.809109971757138,42.531743839469243,58.858917180320617,81.435735651333317,0.1462439673552714,1.2315747911067061,1.297524809901321,2.1549757020050468,2.9118261216427359,"Bocas del Toro","Chiriquí","Coclé","Colón","Darien","Emberá Wounaan","Herrera","Kuna Yala","Los Santos","Ngöbe Buglé","Panamá","Veraguas",4.60215344508799,3.3646522491669271,5.2021754505098103,32.663290044159758,0.85459057066522881,0,35.403446159249768,0,30.001806568639541,0,50.965147674538038,11.664721539879629,29034.100052947939,103667.19245807,208008.14889831899,307202.77768437791,469228.53197800991,91017.663691195514,153582.15167235699,199742.73655070219,273989.33817919053,383084.8957102868,297.08038715251303,2503.106028828835,2641.8711612969141,4366.0999866499824,5915.8077040644102,5856.9373225511026,13697.932282917151,12112.7821080872,78561.163122498852,348.18191510118618,0,39578.172153709922,0,27438.182045040219,0,914681.36587474076,24866.03424707802]
["PAN",2013,"PAN_2013_MICS",154,"Tipo de servicio sanitario","Servicio conectado a tanque séptico o a fosa séptica","",17.088846016182579,43.687464761199593,52.810349596355209,44.632892316226517,29.288368956055251,36.151525228590941,48.627715850220007,46.418041638895502,38.552542593153618,18.55457431275552,2.038388345319734,18.85729799550986,39.717426107717017,47.984172726478903,77.192721123033252,"Bocas del Toro","Chiriquí","Coclé","Colón","Darien","Emberá Wounaan","Herrera","Kuna Yala","Los Santos","Ngöbe Buglé","Panamá","Veraguas",52.888746561712409,71.915662045734564,49.132363481208287,45.122247282971792,24.690494833262829,2.5882110391059658,31.19561069484805,0.54770110425270635,39.842662097492507,0.92329948824659658,28.695187638185029,36.964728474215107,114759.9986352469,293452.16228513402,354396.79531525908,299597.04510038259,196921.7256307253,169374.95194607979,227630.35137550821,217994.0398698952,179462.79232189021,87283.268318266113,4140.7875466319474,38326.390439972063,80868.066517278188,97218.588453485616,156828.4901777404,67308.940776597068,292777.91457572847,114400.1425874428,108527.22504250921,10059.53502289348,123.6862659830968,34874.154481095138,62.019371000827647,36438.146259256937,759.06580893537762,514998.08438777318,78798.81238753155]
["PAN",2013,"PAN_2013_MICS",155,"Tipo de servicio sanitario","Letrina de arrastre","",4.3570367960707346,6.1865750434189897,2.02765894056032,0.72870240249137308,0.037510077815027,9.9534725493324228,4.0811629840661912,0.90405957919314162,0.0081602365879525993,0.0096900359110890996,2.2527169393608251,3.1193690418707769,0.34515844606414542,2.7275592964918149,1.1586579742353349,"Bocas del Toro","Chiriquí","Coclé","Colón","Darien","Emberá Wounaan","Herrera","Kuna Yala","Los Santos","Ngöbe Buglé","Panamá","Veraguas",1.274950996669028,0.16042283855532799,0.060152444318233203,0,1.526413989563965,0,0.065078512725244897,0,1.596475236037737,0,4.6048473333242104,1.103108650944278,29259.643178790509,41555.714746874677,13607.10232027144,4891.3945571166751,252.2007716770029,46633.41101322358,19104.260766537769,4245.7543014104613,37.986050869218232,45.583261043061867,4576.1752268697264,6339.9409530235007,702.77203008108268,5526.1860247053746,2353.9859469665312,1622.568253299904,653.10201959454093,140.05937674097541,0,621.89984814589957,0,72.752482020008131,0,1460.0580153926489,0,82644.086021042312,2351.5295584939872]
["PAN",2013,"PAN_2013_MICS",156,"Tipo de servicio sanitario","Servicio con conexión al mar, río o quebrada u otro lugar circundante","",2.6872437998762071,0.098606948593690597,0.061463513325453703,0.040352011938553103,0,1.2662811630147199,0,0.0137667474484157,0.041793878607725501,0,4.2182292521022928,1.2528954272503261,0.55017040233767522,0.39923234465672602,0.076543982755634302,"Bocas del Toro","Chiriquí","Coclé","Colón","Darien","Emberá Wounaan","Herrera","Kuna Yala","Los Santos","Ngöbe Buglé","Panamá","Veraguas",14.3299875273193,0,0,0,0.57004806566722099,0,0,2.584018821587339,0,0.76619423385467467,0,0,18046.162655707449,662.3506866174813,412.46597149701239,270.86175493607288,0,5932.7043542335141,0,64.653069931196498,194.55127087354549,0,8568.9222056477156,2546.4390145759721,1120.193855750292,808.86681601753401,155.5104817282469,18237.0796154198,0,0,0,232.25206785190591,0,0,292.60343045648472,0,629.90595502982433,0,0]
["PAN",2013,"PAN_2013_MICS",157,"Tipo de servicio sanitario","Letrina o servicio de hueco con ventilación","",14.820198883942821,9.7865442308398372,5.1721695710423354,3.1911044502367409,0.40773001418506188,6.3672565592413664,5.3133993368888337,3.3394789369327049,1.2270938827854661,0,14.276841873410129,20.211604039097459,15.824579793095269,14.668838843607871,7.8813955603627166,"Bocas del Toro","Chiriquí","Coclé","Colón","Darien","Emberá Wounaan","Herrera","Kuna Yala","Los Santos","Ngöbe Buglé","Panamá","Veraguas",6.0003476254739567,6.8040877231230752,7.2075246193499654,6.8697706550521556,12.695660158162889,11.61272391939964,4.4090638410044649,0,6.0312800059990126,13.281899227702439,5.6042857342917838,13.049456194364749,99524.918305472194,65736.99301474863,34709.111657367437,21420.199639404349,2741.391919271171,29831.487521775631,24872.46083652776,15683.266221907459,5712.1445132622066,0,29002.01483705857,41078.940790192508,32220.19392307401,29719.878985019321,16012.226907446289,7636.3511941195993,27700.316697347909,16782.05129438774,16523.04995351216,5172.5345669354456,554.95260540240963,4928.9746244202943,0,5515.9131297844488,10919.355755974861,100581.2003710789,27817.914343300032]
["PAN",2013,"PAN_2013_MICS",158,"Tipo de servicio sanitario","Letrina o servicio de hueco sin ventilación","",42.461485864326079,24.27896503855327,8.8129743160056115,5.519317966739119,0.4775531522426073,25.179325793263491,9.1306709873981742,6.7929092580609609,1.277614993021674,0,41.3573895277136,49.187456712476859,40.551684923425633,30.259156577346779,10.44347830590362,"Bocas del Toro","Chiriquí","Coclé","Colón","Darien","Emberá Wounaan","Herrera","Kuna Yala","Los Santos","Ngöbe Buglé","Panamá","Veraguas",9.4661298817483761,17.101225364200019,35.786145979373877,13.75373828672531,49.007028866758063,50.585333891495893,28.048296554800121,0,22.166511210643641,23.228842557255309,10.130531619660919,35.012453750444529,285149.7435945152,163083.73185656549,59141.624296379123,37048.267947522807,3210.8510706453731,117968.66299007089,42741.424490457568,31901.684762019118,5947.3212073099303,0,84013.511905505453,99970.720681218198,82566.688608709243,61306.725178140339,21217.478942197089,12047.08405881245,69621.289109956822,83324.715373426501,33080.246222189176,19966.708912976312,2417.3882917633132,31355.713358264558,0,20272.40488033868,19096.967333795681,181814.61099813631,74637.090225968059]
["PAN",2013,"PAN_2013_MICS",159,"Tipo de servicio sanitario","Letrina o servicio hueco sin piso","",1.5060876147374009,0.096421719686536303,0.049867646610584702,0.028191711717258601,0,0.2474286241926949,0,0,0,0,3.927349990016034,0.44947560308279949,0.072187541196418001,0.44355113161740167,0.093144095435780699,"Bocas del Toro","Chiriquí","Coclé","Colón","Darien","Emberá Wounaan","Herrera","Kuna Yala","Los Santos","Ngöbe Buglé","Panamá","Veraguas",0.92768988311713374,0,2.2772453687297798,0.57330173650122285,1.1852830384017841,10.770396860829811,0.63288056924136982,0.22684187444213619,0.21026773623740641,1.5812130499174011,0,0.094167260971650402,10114.11844007219,647.67233090612115,334.649065643087,189.23607878626939,0,1159.2377103796059,0,0,0,0,7978.0292932221664,913.53371310646799,146.97998977472619,898.65913013843635,189.23607878626939,1180.6258885133559,0,5302.3542209387278,1378.8951198361451,482.91442991985889,514.69920757785849,707.50898117381644,25.686620421818311,192.3005673635364,1299.9517254299219,0,200.73915423263131]
["PAN",2013,"PAN_2013_MICS",160,"Tipo de servicio sanitario","Letrina de compostaje","",0.17786897612178901,0,0,0,0,0.0094202656362417994,0,0,0,0,0.52574589308059227,0.040513159774258699,0,0,0,"Bocas del Toro","Chiriquí","Coclé","Colón","Darien","Emberá Wounaan","Herrera","Kuna Yala","Los Santos","Ngöbe Buglé","Panamá","Veraguas",0.86318065262250332,0,0,0,0.124743146726844,0.94428781811363338,0,0,0,0,0,0,1194.4775813217309,0,0,0,0,44.13526204963253,0,0,0,0,1068.0016159626989,82.340703309399274,0,0,0,1098.528121839297,0,0,0,50.823527913830738,45.125931568603889,0,0,0,0,0,0]
["PAN",2013,"PAN_2013_MICS",161,"Tipo de servicio sanitario","Servicio colgante sobre el río o el mar","",1.863218973972365,0.038252820701349603,0.0033382883953355,0,0,0.50381045572588923,0,0,0,0,4.0220967076237351,0.69925313576499504,0.37100413425715278,0.0305368283916553,0.011026710826843899,"Bocas del Toro","Chiriquí","Coclé","Colón","Darien","Emberá Wounaan","Herrera","Kuna Yala","Los Santos","Ngöbe Buglé","Panamá","Veraguas",2.685028488223109,0,0,0,0.14965655338608949,0,0,52.18452229553786,0,4.1411626613086669,0,0,12512.431015397489,256.94722753255837,22.402402525028691,0,0,2360.422449369255,0,0,0,0,8170.4980292483633,1421.192405406402,755.39605527114531,61.869303634879941,22.402402525028691,3417.105438231692,0,0,0,60.973882879201383,0,0,5909.155967767857,0,3404.545356576321,0,0]
["PAN",2013,"PAN_2013_MICS",162,"Tipo de servicio sanitario","No hay servicio sanitario, va al monte, campo","",10.261413392112591,0.31836334509123521,0.033323768307593503,0.069978632734983906,0,0.81843498232395884,0.0379408696698069,0,0,0,26.96364384791589,4.2909756834727339,0.80778163367434541,1.04663980810484,0.2312061258040774,"Bocas del Toro","Chiriquí","Coclé","Colón","Darien","Emberá Wounaan","Herrera","Kuna Yala","Los Santos","Ngöbe Buglé","Panamá","Veraguas",6.6132652361931887,0.6539497792201423,0.3343926565100786,0.20877747460987511,8.4156026966003488,21.80564001661233,0.1045587037487001,44.456915904179922,0.083277891655345507,56.077388781714838,0,1.680490726566837,68910.433493250297,2138.4718138262128,223.6273152195609,469.72962090435709,0,3834.4823607187591,177.60434236788109,0,0,0,54774.018362902338,8721.165113494053,1644.7122909286491,2120.550151884348,469.72962090435709,8416.3816891266342,2662.3137040102829,778.60222620021204,502.14786131326741,3428.730393493724,1042.0549755316731,116.8881232216886,5034.1142999444764,76.161878663499451,46102.514969885167,0,3582.3521218097771]
["PAN",2013,"PAN_2013_MICS",163,"Tipo de servicio sanitario","Otro","",0.44684552750007372,0.075432617557383605,0.032572204986237203,0,0,0.076161434220480398,0,0,0,0,0.27135365610176881,0.63875884389122184,0.46248220833105691,0.2853367412990131,0,"Bocas del Toro","Chiriquí","Coclé","Colón","Darien","Emberá Wounaan","Herrera","Kuna Yala","Los Santos","Ngöbe Buglé","Panamá","Veraguas",0.34851970183301278,0,0,0.80887451997986237,0.7804780808047479,0.80769249359944739,0,0,0.067719253295005402,0,0,0.43087340261309642,3000.7873017004281,506.68686887735021,218.58376533585479,0,0,356.82697146720551,0,0,0,0,551.22854410895195,1298.2411824742551,941.65321501301548,578.10802285020497,0,443.54410900593678,0,0,1945.490580522003,317.98660340654311,38.598270035352343,0,0,61.93271047233489,0,0,918.50566247146355]
["PAN",2013,"PAN_2013_MICS",164,"Tipo de servicio sanitario","Missing","",0.0063028574607592999,0,0,0.023493453606275399,0,0,0,0,0.033877235522864597,0,0,0.020825566701932498,0,0,0,"Bocas del Toro","Chiriquí","Coclé","Colón","Darien","Emberá Wounaan","Herrera","Kuna Yala","Los Santos","Ngöbe Buglé","Panamá","Veraguas",0,0,0,0,0,0.8857139608431619,0.14106496438222049,0,0,0,0,0,42.326785138676748,0,0,157.69915222554681,0,0,0,0,157.69915222554681,0,0,42.326785138676748,0,0,0,0,0,0,0,0,42.326785138676748,157.69915222554681,0,0,0,0,0]