{"text_format":"1","workbook":"xlsx","n_sheets":7,"sheets":["Introduction","Water","Sanitation","Hygiene","DHS01","ENDESA11","data_summary"],"not_rendered":{"charts":111,"images":76,"macros":1,"external_links":0,"defined_names":0,"comments":0,"pivot_tables":0},"unopened":[],"bounds":{"document_bytes":16777216,"sheet_cells":100000,"rows_first":2000,"rows_last":500,"rows_between":2000,"halvings":0,"cell_chars":16384,"cell_head_chars":4096},"cells_cut":0,"cells_raw":0,"read":"whole","date_system":"1900"}

{"sheet":"Introduction","index":0,"n_rows":55,"n_cols":12,"rows_kept":55,"cut":false,"hidden":false,"merged":[[107,0,107,1],[1,0,1,1],[4,0,4,1],[5,0,5,1],[6,0,6,1],[7,0,7,1],[112,0,112,1],[113,0,113,1],[207,0,207,1],[212,0,212,1],[213,0,213,1]]}
[]
[]
[]
[null,null,"Joint Monitoring Programme for Water Supply, Sanitation and Hygiene"]
[]
[null,null,"Estimates on household water, sanitation and hygiene \nby wealth quintile and sub-national region in"]
[null,null,{"$f":"+Water!B5","v":"Nicaragua"}]
[]
[null,null,"Updated May 2021"]
[]
[null,null,"Follow the links below to find the following information: "]
[]
[null,null,"JMP Estimates"]
[null,null,"WASH status and trends by wealth quintile \n(customized quintiles made without water and sanitation assets)"]
[null,null,"Water"]
[null,null,"Sanitation"]
[null,null,"Hygiene"]
[]
[null,null,"Data inputs"]
[null,null," customized wealth quintiles and subnational data:"]
[null,null,{"$f":"IF(INDIRECT(CONCATENATE(\"Water\",\"!B105\"))=0,\"\",INDIRECT(CONCATENATE(\"Water\",\"!B105\")))","v":"DHS01"}]
[null,null,{"$f":"IF(INDIRECT(CONCATENATE(\"Water\",\"!B106\"))=0,\"\",INDIRECT(CONCATENATE(\"Water\",\"!B106\")))","v":"ENDESA11"}]
[null,null,{"$f":"IF(INDIRECT(CONCATENATE(\"Water\",\"!B107\"))=0,\"\",INDIRECT(CONCATENATE(\"Water\",\"!B107\")))","v":""}]
[null,null,{"$f":"IF(INDIRECT(CONCATENATE(\"Water\",\"!B108\"))=0,\"\",INDIRECT(CONCATENATE(\"Water\",\"!B108\")))","v":""}]
[null,null,{"$f":"IF(INDIRECT(CONCATENATE(\"Water\",\"!B109\"))=0,\"\",INDIRECT(CONCATENATE(\"Water\",\"!B109\")))","v":""}]
[null,null,{"$f":"IF(INDIRECT(CONCATENATE(\"Water\",\"!B110\"))=0,\"\",INDIRECT(CONCATENATE(\"Water\",\"!B110\")))","v":""}]
[null,null,{"$f":"IF(INDIRECT(CONCATENATE(\"Water\",\"!B111\"))=0,\"\",INDIRECT(CONCATENATE(\"Water\",\"!B111\")))","v":""}]
[null,null,{"$f":"IF(INDIRECT(CONCATENATE(\"Water\",\"!B112\"))=0,\"\",INDIRECT(CONCATENATE(\"Water\",\"!B112\")))","v":""}]
[null,null,{"$f":"IF(INDIRECT(CONCATENATE(\"Water\",\"!B113\"))=0,\"\",INDIRECT(CONCATENATE(\"Water\",\"!B113\")))","v":""}]
[null,null,{"$f":"IF(INDIRECT(CONCATENATE(\"Water\",\"!B114\"))=0,\"\",INDIRECT(CONCATENATE(\"Water\",\"!B114\")))","v":""}]
[null,null,{"$f":"IF(INDIRECT(CONCATENATE(\"Water\",\"!B115\"))=0,\"\",INDIRECT(CONCATENATE(\"Water\",\"!B115\")))","v":""}]
[null,null,{"$f":"IF(INDIRECT(CONCATENATE(\"Water\",\"!B116\"))=0,\"\",INDIRECT(CONCATENATE(\"Water\",\"!B116\")))","v":""}]
[]
[]
[]
[]
[]
[]
[]
[]
[]
[]
[]
[]
[]
[]
[]
[]
[]
[]
[]
[]
[]
[]
[null,null,null,null,null,null,null,null,null,null,null,{"$f":"+IF(ISNUMBER(M48), \"\", \"Insufficient data to estimate safely managed sanitation services at national level\")","v":"Insufficient data to estimate safely managed sanitation services at national level"}]

{"sheet":"Water","index":1,"n_rows":318,"n_cols":28,"rows_kept":318,"cut":false,"hidden":false,"merged":[[3,1,3,24],[317,18,317,22],[117,18,117,22],[196,18,196,22],[296,23,296,27],[298,0,299,1],[300,0,301,1],[296,0,297,2],[296,3,296,7],[296,8,296,12],[296,13,296,17],[296,18,296,22],[196,23,196,27],[198,0,199,1],[200,0,201,1],[196,13,196,17],[96,8,96,12],[96,13,96,17],[96,18,96,22],[217,18,217,22],[98,0,99,1],[100,0,101,1],[196,0,197,2],[196,3,196,7],[196,8,196,12],[217,1,217,11],[35,3,36,3],[38,1,39,2],[38,3,39,3],[96,0,97,2],[96,3,96,7],[317,1,317,11],[6,9,6,16],[6,17,6,24],[6,1,6,8],[4,1,4,24],[117,1,117,11],[30,21,30,24],[32,1,33,2],[32,3,33,3],[30,17,30,20],[30,1,31,4],[30,5,30,8],[30,9,30,12],[30,13,30,16],[96,23,96,27],[35,1,36,2]]}
["BGD"]
[]
[]
[null,"Summary of trends in use of drinking water by wealth quintile (%)"]
[null,{"$f":"IF(ISERROR(INDIRECT(CONCATENATE($B105,\"!A2\"))),\"\",INDIRECT(CONCATENATE($B105,\"!A2\")))","v":"Nicaragua"}]
[]
[null,{"$f":"B118","v":"National use of drinking water sources, 2000–2017"},null,null,null,null,null,null,null,{"$f":"B218","v":"Urban use of drinking water sources,  2000–2017"},null,null,null,null,null,null,null,{"$f":"B318","v":"Rural use of drinking water sources, 2000–2017"}]
[]
[]
[]
[]
[]
[]
[]
[]
[]
[]
[]
[]
[]
[]
[]
[]
[]
[]
[]
[]
[]
[]
[]
[null,{"$f":"IF(ISERROR(INDIRECT(CONCATENATE($B105,\"!A2\"))),\"\",INDIRECT(CONCATENATE($B105,\"!A2\")))","v":"Nicaragua"},null,null,null,"Poorest",null,null,null,"Poor",null,null,null,"Middle",null,null,null,"Rich",null,null,null,"Richest"]
[null,null,null,null,null,"Basic","Limited","Unimproved","Surface \n water","Basic","Limited","Unimproved","Surface \nwater","Basic","Limited","Unimproved","Surface \nwater","Basic","Limited","Unimproved","Surface \nwater","Basic","Limited","Unimproved","Surface \nwater"]
[null,"NATIONAL",null,"Estimate",{"$f":"C99","v":2000},{"$f":"E99","v":53.1400273698763},{"$f":"F99","v":0},31.86192813914505,14.998044490978657,{"$f":"J99","v":69.932273238233847},{"$f":"K99","v":0},24.260761141294239,5.8069656204719138,{"$f":"O99","v":90.597450666042278},{"$f":"P99","v":0},8.86213096094599,0.54041837301173246,{"$f":"T99","v":96.087116088361483},{"$f":"U99","v":0},3.9128839116385166,0,{"$f":"Y99","v":98.10513418978752},{"$f":"Z99","v":0},1.8948658102124796,0]
[null,null,null,null,{"$f":"C100","v":2017},{"$f":"E100","v":50.980707832254041},0,32.223571932148843,16.795720235597116,{"$f":"J100","v":78.84992541263523},0,16.180694042410522,4.9693805449542481,{"$f":"O100","v":89.249460178758198},0,9.0929244763445354,1.6576153448972661,{"$f":"T100","v":95.450987123111204},0,4.0812482354385367,0.46776464145025898,{"$f":"Y100","v":98.084464037458346},0,1.7335297594898549,0.18200620305179882]
[]
[null,"URBAN",null,"Estimate",{"$f":"C199","v":2000},{"$f":"E199","v":89.137483229268796},{"$f":"F199","v":0},9.8484694614224111,1.0140473093087934,{"$f":"J199","v":95.830847294816977},{"$f":"K199","v":0},4.0875315358401423,8.1621169342881217E-2,{"$f":"O199","v":97.041838296737836},{"$f":"P199","v":0},2.9581617032621637,0,{"$f":"T199","v":98.070240728344913},{"$f":"U199","v":0},1.9297592716550866,0,{"$f":"Y199","v":98.754975938078758},{"$f":"Z199","v":0},1.2450240619212423,0]
[null,null,null,null,{"$f":"C200","v":2017},{"$f":"E200","v":94.433016069338919},0,4.1307559528991789,1.4362279777619023,{"$f":"J200","v":95.547187956780505},0,4.3115270903671075,0.14128495285238252,{"$f":"O200","v":97.368116322771996},0,2.4206188521369256,0.21126482509107802,{"$f":"T200","v":98.585621237314385},0,1.2882900228274252,0.12608873985819358,{"$f":"Y200","v":98.969493989382002},0,1.030506010617998,0]
[]
[null,"RURAL",null,"Estimate",{"$f":"C299","v":2000},{"$f":"E299","v":48.36352815870805},{"$f":"F299","v":0},34.006443834707056,17.630028006584894,{"$f":"J299","v":51.832452102827823},{"$f":"K299","v":0},33.368915480501443,14.798632416670728,{"$f":"O299","v":57.614513708566847},{"$f":"P299","v":0},30.993813079148026,11.391673212285127,{"$f":"T299","v":71.85015378938283},{"$f":"U299","v":0},24.916145179829755,3.2337010307874152,{"$f":"Y299","v":85.136928993751098},{"$f":"Z299","v":0},14.034584762237728,0.82848624401117377]
[null,null,null,null,{"$f":"C300","v":2017},{"$f":"E300","v":43.290965502115903},0,35.466463207422521,21.242571290461569,{"$f":"J300","v":52.606302546770678},0,32.270772567085103,15.122924886144219,{"$f":"O300","v":66.906891762799432},0,25.813183620269228,7.2799246169313392,{"$f":"T300","v":74.542053531253373},0,19.045926526100061,6.4120199426465661,{"$f":"Y300","v":79.451523830444444},0,17.164176589746432,3.3842995798091238]
[]
[]
[]
[]
[]
[]
[]
[]
[]
[]
[]
[]
[]
[]
[]
[]
[]
[]
[]
[]
[]
[]
[]
[]
[]
[]
[]
[]
[]
[]
[]
[]
[]
[]
[]
[]
[]
[]
[]
[]
[]
[]
[]
[]
[]
[]
[]
[]
[]
[]
[]
[]
[]
[]
[]
[]
["NATIONAL",null,null,"Poorest",null,null,null,null,"Poor",null,null,null,null,"Middle",null,null,null,null,"Rich",null,null,null,null,"Richest"]
[null,null,null,"Improved","Basic","Limited","Unimproved","Surface water","Improved","Basic","Limited","Unimproved","Surface water","Improved","Basic","Limited","Unimproved","Surface water","Improved","Basic","Limited","Unimproved","Surface water","Improved","Basic","Limited","Unimproved","Surface water"]
["Forecast period:",null,{"$f":"MinBase(C105:C116)","v":2000},{"$f":"IF((D101+H101)>100,D101*100/(D101+H101),D101)","v":53.140027369876293},{"$f":"D99*AVERAGEIF(E105:E116,\">0\")/100","v":53.1400273698763},{"$f":"D99*(100-AVERAGEIF(E105:E116,\">0\"))/100","v":0},{"$f":"100-(E99+F99+H99)","v":31.86192813914505},{"$f":"IF((D101+H101)>100,H101*100/(D101+H101),H101)","v":14.998044490978657},{"$f":"IF((I101+M101)>100,I101*100/(I101+M101),I101)","v":69.932273238233847},{"$f":"I99*AVERAGEIF(J105:J116,\">0\")/100","v":69.932273238233847},{"$f":"I99*(100-AVERAGEIF(J105:J116,\">0\"))/100","v":0},{"$f":"100-(J99+K99+M99)","v":24.260761141294239},{"$f":"IF((I101+M101)>100,M101*100/(I101+M101),M101)","v":5.8069656204719138},{"$f":"IF((N101+R101)>100,N101*100/(N101+R101),N101)","v":90.597450666042278},{"$f":"N99*AVERAGEIF(O105:O116,\">0\")/100","v":90.597450666042278},{"$f":"N99*(100-AVERAGEIF(O105:O116,\">0\"))/100","v":0},{"$f":"100-(O99+P99+R99)","v":8.86213096094599},{"$f":"IF((N101+R101)>100,R101*100/(N101+R101),R101)","v":0.54041837301173246},{"$f":"IF((S101+W101)>100,S101*100/(S101+W101),S101)","v":96.087116088361483},{"$f":"S99*AVERAGEIF(T105:T116,\">0\")/100","v":96.087116088361483},{"$f":"S99*(100-AVERAGEIF(T105:T116,\">0\"))/100","v":0},{"$f":"100-(T99+U99+W99)","v":3.9128839116385166},{"$f":"IF((S101+W101)>100,W101*100/(S101+W101),W101)","v":0},{"$f":"IF((X101+AB101)>100,X101*100/(X101+AB101),X101)","v":98.10513418978752},{"$f":"X99*AVERAGEIF(Y105:Y116,\">0\")/100","v":98.10513418978752},{"$f":"X99*(100-AVERAGEIF(Y105:Y116,\">0\"))/100","v":0},{"$f":"100-(Y99+Z99+AB99)","v":1.8948658102124796},{"$f":"IF((X101+AB101)>100,AB101*100/(X101+AB101),AB101)","v":0}]
[null,null,{"$f":"MaxTarget(C105:C116)","v":2017},{"$f":"IF((D102+H102)>100,D102*100/(D102+H102),D102)","v":50.980707832254041},{"$f":"D100*AVERAGEIF(E105:E116,\">0\")/100","v":50.980707832254041},{"$f":"D100*(100-AVERAGEIF(E105:E116,\">0\"))/100","v":0},{"$f":"100-(E100+F100+H100)","v":32.223571932148843},{"$f":"IF((D102+H102)>100,H102*100/(D102+H102),H102)","v":16.795720235597116},{"$f":"IF((I102+M102)>100,I102*100/(I102+M102),I102)","v":78.84992541263523},{"$f":"I100*AVERAGEIF(J105:J116,\">0\")/100","v":78.84992541263523},{"$f":"I100*(100-AVERAGEIF(J105:J116,\">0\"))/100","v":0},{"$f":"100-(J100+K100+M100)","v":16.180694042410522},{"$f":"IF((I102+M102)>100,M102*100/(I102+M102),M102)","v":4.9693805449542481},{"$f":"IF((N102+R102)>100,N102*100/(N102+R102),N102)","v":89.249460178758198},{"$f":"N100*AVERAGEIF(O105:O116,\">0\")/100","v":89.249460178758198},{"$f":"N100*(100-AVERAGEIF(O105:O116,\">0\"))/100","v":0},{"$f":"100-(O100+P100+R100)","v":9.0929244763445354},{"$f":"IF((N102+R102)>100,R102*100/(N102+R102),R102)","v":1.6576153448972661},{"$f":"IF((S102+W102)>100,S102*100/(S102+W102),S102)","v":95.450987123111204},{"$f":"S100*AVERAGEIF(T105:T116,\">0\")/100","v":95.450987123111204},{"$f":"S100*(100-AVERAGEIF(T105:T116,\">0\"))/100","v":0},{"$f":"100-(T100+U100+W100)","v":4.0812482354385367},{"$f":"IF((S102+W102)>100,W102*100/(S102+W102),W102)","v":0.46776464145025898},{"$f":"IF((X102+AB102)>100,X102*100/(X102+AB102),X102)","v":98.084464037458346},{"$f":"X100*AVERAGEIF(Y105:Y116,\">0\")/100","v":98.084464037458346},{"$f":"X100*(100-AVERAGEIF(Y105:Y116,\">0\"))/100","v":0},{"$f":"100-(Y100+Z100+AB100)","v":1.7335297594898549},{"$f":"IF((X102+AB102)>100,AB102*100/(X102+AB102),AB102)","v":0.18200620305179882}]
["Regression period:",null,{"$f":"MinRegYear(C99,C105:C116)","v":2000},{"$f":"IF(MAX(C105:C116)-MIN(C105:C116)<5,AVERAGEIF(C105:C116,\">0\",D105:D116),\nIF(FORECAST($C101,D$105:D$116,$C$105:$C$116)<0,0,\nIF(FORECAST($C101,D$105:D$116,$C$105:$C$116)>100,100,\nFORECAST($C101,D$105:D$116,$C$105:$C$116))))","v":53.140027369876293},null,null,null,{"$f":"IF(MAX(C105:C116)-MIN(C105:C116)<5,AVERAGEIF(C105:C116,\">0\",H105:H116),\nIF(FORECAST($C101,H$105:H$116,$C$105:$C$116)<0,0,\nIF(FORECAST($C101,H$105:H$116,$C$105:$C$116)>100,100,\nFORECAST($C101,H$105:H$116,$C$105:$C$116))))","v":14.998044490978657},{"$f":"IF(MAX(C105:C116)-MIN(C105:C116)<5,AVERAGEIF(C105:C116,\">0\",I105:I116),\nIF(FORECAST($C101,I$105:I$116,$C$105:$C$116)<0,0,\nIF(FORECAST($C101,I$105:I$116,$C$105:$C$116)>100,100,\nFORECAST($C101,I$105:I$116,$C$105:$C$116))))","v":69.932273238233847},null,null,null,{"$f":"IF(MAX(C105:C116)-MIN(C105:C116)<5,AVERAGEIF(C105:C116,\">0\",M105:M116),\nIF(FORECAST($C101,M$105:M$116,$C$105:$C$116)<0,0,\nIF(FORECAST($C101,M$105:M$116,$C$105:$C$116)>100,100,\nFORECAST($C101,M$105:M$116,$C$105:$C$116))))","v":5.8069656204719138},{"$f":"IF(MAX(C105:C116)-MIN(C105:C116)<5,AVERAGEIF(C105:C116,\">0\",N105:N116),\nIF(FORECAST($C101,N$105:N$116,$C$105:$C$116)<0,0,\nIF(FORECAST($C101,N$105:N$116,$C$105:$C$116)>100,100,\nFORECAST($C101,N$105:N$116,$C$105:$C$116))))","v":90.597450666042278},null,null,null,{"$f":"IF(MAX(C105:C116)-MIN(C105:C116)<5,AVERAGEIF(C105:C116,\">0\",R105:R116),\nIF(FORECAST($C101,R$105:R$116,$C$105:$C$116)<0,0,\nIF(FORECAST($C101,R$105:R$116,$C$105:$C$116)>100,100,\nFORECAST($C101,R$105:R$116,$C$105:$C$116))))","v":0.54041837301173246},{"$f":"IF(MAX(C105:C116)-MIN(C105:C116)<5,AVERAGEIF(C105:C116,\">0\",S105:S116),\nIF(FORECAST($C101,S$105:S$116,$C$105:$C$116)<0,0,\nIF(FORECAST($C101,S$105:S$116,$C$105:$C$116)>100,100,\nFORECAST($C101,S$105:S$116,$C$105:$C$116))))","v":96.087116088361483},null,null,null,{"$f":"IF(MAX(C105:C116)-MIN(C105:C116)<5,AVERAGEIF(C105:C116,\">0\",W105:W116),\nIF(FORECAST($C101,W$105:W$116,$C$105:$C$116)<0,0,\nIF(FORECAST($C101,W$105:W$116,$C$105:$C$116)>100,100,\nFORECAST($C101,W$105:W$116,$C$105:$C$116))))","v":0},{"$f":"IF(MAX(C105:C116)-MIN(C105:C116)<5,AVERAGEIF(C105:C116,\">0\",X105:X116),\nIF(FORECAST($C101,X$105:X$116,$C$105:$C$116)<0,0,\nIF(FORECAST($C101,X$105:X$116,$C$105:$C$116)>100,100,\nFORECAST($C101,X$105:X$116,$C$105:$C$116))))","v":98.10513418978752},null,null,null,{"$f":"IF(MAX(C105:C116)-MIN(C105:C116)<5,AVERAGEIF(C105:C116,\">0\",AB105:AB116),\nIF(FORECAST($C101,AB$105:AB$116,$C$105:$C$116)<0,0,\nIF(FORECAST($C101,AB$105:AB$116,$C$105:$C$116)>100,100,\nFORECAST($C101,AB$105:AB$116,$C$105:$C$116))))","v":0}]
[null,null,{"$f":"MaxRegYear(C100,C105:C116)","v":2013},{"$f":"IF(MAX(C105:C116)-MIN(C105:C116)<5,AVERAGEIF(C105:C116,\">0\",D105:D116),\nIF(FORECAST($C102,D$105:D$116,$C$105:$C$116)<0,0,\nIF(FORECAST($C102,D$105:D$116,$C$105:$C$116)>100,100,\nFORECAST($C102,D$105:D$116,$C$105:$C$116))))","v":50.980707832254041},null,null,null,{"$f":"IF(MAX(C105:C116)-MIN(C105:C116)<5,AVERAGEIF(C105:C116,\">0\",H105:H116),\nIF(FORECAST($C102,H$105:H$116,$C$105:$C$116)<0,0,\nIF(FORECAST($C102,H$105:H$116,$C$105:$C$116)>100,100,\nFORECAST($C102,H$105:H$116,$C$105:$C$116))))","v":16.795720235597116},{"$f":"IF(MAX(C105:C116)-MIN(C105:C116)<5,AVERAGEIF(C105:C116,\">0\",I105:I116),\nIF(FORECAST($C102,I$105:I$116,$C$105:$C$116)<0,0,\nIF(FORECAST($C102,I$105:I$116,$C$105:$C$116)>100,100,\nFORECAST($C102,I$105:I$116,$C$105:$C$116))))","v":78.84992541263523},null,null,null,{"$f":"IF(MAX(C105:C116)-MIN(C105:C116)<5,AVERAGEIF(C105:C116,\">0\",M105:M116),\nIF(FORECAST($C102,M$105:M$116,$C$105:$C$116)<0,0,\nIF(FORECAST($C102,M$105:M$116,$C$105:$C$116)>100,100,\nFORECAST($C102,M$105:M$116,$C$105:$C$116))))","v":4.9693805449542481},{"$f":"IF(MAX(C105:C116)-MIN(C105:C116)<5,AVERAGEIF(C105:C116,\">0\",N105:N116),\nIF(FORECAST($C102,N$105:N$116,$C$105:$C$116)<0,0,\nIF(FORECAST($C102,N$105:N$116,$C$105:$C$116)>100,100,\nFORECAST($C102,N$105:N$116,$C$105:$C$116))))","v":89.249460178758198},null,null,null,{"$f":"IF(MAX(C105:C116)-MIN(C105:C116)<5,AVERAGEIF(C105:C116,\">0\",R105:R116),\nIF(FORECAST($C102,R$105:R$116,$C$105:$C$116)<0,0,\nIF(FORECAST($C102,R$105:R$116,$C$105:$C$116)>100,100,\nFORECAST($C102,R$105:R$116,$C$105:$C$116))))","v":1.6576153448972661},{"$f":"IF(MAX(C105:C116)-MIN(C105:C116)<5,AVERAGEIF(C105:C116,\">0\",S105:S116),\nIF(FORECAST($C102,S$105:S$116,$C$105:$C$116)<0,0,\nIF(FORECAST($C102,S$105:S$116,$C$105:$C$116)>100,100,\nFORECAST($C102,S$105:S$116,$C$105:$C$116))))","v":95.450987123111204},null,null,null,{"$f":"IF(MAX(C105:C116)-MIN(C105:C116)<5,AVERAGEIF(C105:C116,\">0\",W105:W116),\nIF(FORECAST($C102,W$105:W$116,$C$105:$C$116)<0,0,\nIF(FORECAST($C102,W$105:W$116,$C$105:$C$116)>100,100,\nFORECAST($C102,W$105:W$116,$C$105:$C$116))))","v":0.46776464145025898},{"$f":"IF(MAX(C105:C116)-MIN(C105:C116)<5,AVERAGEIF(C105:C116,\">0\",X105:X116),\nIF(FORECAST($C102,X$105:X$116,$C$105:$C$116)<0,0,\nIF(FORECAST($C102,X$105:X$116,$C$105:$C$116)>100,100,\nFORECAST($C102,X$105:X$116,$C$105:$C$116))))","v":98.084464037458346},null,null,null,{"$f":"IF(MAX(C105:C116)-MIN(C105:C116)<5,AVERAGEIF(C105:C116,\">0\",AB105:AB116),\nIF(FORECAST($C102,AB$105:AB$116,$C$105:$C$116)<0,0,\nIF(FORECAST($C102,AB$105:AB$116,$C$105:$C$116)>100,100,\nFORECAST($C102,AB$105:AB$116,$C$105:$C$116))))","v":0.18200620305179882}]
[]
[null,"Survey","Year","Improved","% Improved\n< = 30min",null,null,"Surface water","Improved","% Improved\n< = 30min",null,null,"Surface water","Improved","% Improved\n< = 30min",null,null,"Surface water","Improved","% Improved\n< = 30min",null,null,"Surface water","Improved","% Improved\n< = 30min",null,null,"Surface water"]
[null,"DHS01",2001,{"$f":"IF(ISERROR(INDIRECT(CONCATENATE($B105,\"!C16\"))),\"\",INDIRECT(CONCATENATE($B105,\"!C16\")))","v":52.973925866982256},{"$f":"IF(ISERROR(INDIRECT(CONCATENATE($B105,\"!C23\"))),\"\",INDIRECT(CONCATENATE($B105,\"!C23\")))","v":"N/A"},null,null,{"$f":"IF(ISERROR(INDIRECT(CONCATENATE($B105,\"!C21\"))),\"\",INDIRECT(CONCATENATE($B105,\"!C21\")))","v":15.136327240564732},{"$f":"IF(ISERROR(INDIRECT(CONCATENATE($B105,\"!D16\"))),\"\",INDIRECT(CONCATENATE($B105,\"!D16\")))","v":70.618246482418726},{"$f":"IF(ISERROR(INDIRECT(CONCATENATE($B105,\"!D23\"))),\"\",INDIRECT(CONCATENATE($B105,\"!D23\")))","v":"N/A"},null,null,{"$f":"IF(ISERROR(INDIRECT(CONCATENATE($B105,\"!D21\"))),\"\",INDIRECT(CONCATENATE($B105,\"!D21\")))","v":5.7425359992782647},{"$f":"IF(ISERROR(INDIRECT(CONCATENATE($B105,\"!E16\"))),\"\",INDIRECT(CONCATENATE($B105,\"!E16\")))","v":90.49375909009737},{"$f":"IF(ISERROR(INDIRECT(CONCATENATE($B105,\"!E23\"))),\"\",INDIRECT(CONCATENATE($B105,\"!E23\")))","v":"N/A"},null,null,{"$f":"IF(ISERROR(INDIRECT(CONCATENATE($B105,\"!E21\"))),\"\",INDIRECT(CONCATENATE($B105,\"!E21\")))","v":0.62635660161830875},{"$f":"IF(ISERROR(INDIRECT(CONCATENATE($B105,\"!F16\"))),\"\",INDIRECT(CONCATENATE($B105,\"!F16\")))","v":96.03818309103454},{"$f":"IF(ISERROR(INDIRECT(CONCATENATE($B105,\"!F23\"))),\"\",INDIRECT(CONCATENATE($B105,\"!F23\")))","v":"N/A"},null,null,{"$f":"IF(ISERROR(INDIRECT(CONCATENATE($B105,\"!F21\"))),\"\",INDIRECT(CONCATENATE($B105,\"!F21\")))","v":2.8780103195072397E-2},{"$f":"IF(ISERROR(INDIRECT(CONCATENATE($B105,\"!G16\"))),\"\",INDIRECT(CONCATENATE($B105,\"!G16\")))","v":98.103544178069896},{"$f":"IF(ISERROR(INDIRECT(CONCATENATE($B105,\"!G23\"))),\"\",INDIRECT(CONCATENATE($B105,\"!G23\")))","v":"N/A"},null,null,{"$f":"IF(ISERROR(INDIRECT(CONCATENATE($B105,\"!G221\"))),\"\",INDIRECT(CONCATENATE($B105,\"!G21\")))","v":0}]
[null,"ENDESA11",2011,51.312910838042058,100,null,null,16.519154736425108,77.47797892426594,100,null,null,5.0982397873415977,89.45684333064807,100,null,null,1.4857388876841058,95.548853117765091,100,null,null,0.39460055174105629,98.087644060893609,100,null,null,0.15167183587649696]
[null,null,null,"","",null,null,"","","",null,null,"","","",null,null,"","","",null,null,"","","",null,null,""]
[null,null,null,"","",null,null,"","","",null,null,"","","",null,null,"","","",null,null,"","","",null,null,""]
[null,null,null,"","",null,null,"","","",null,null,"","","",null,null,"","","",null,null,"","","",null,null,""]
[null,null,null,"","",null,null,"","","",null,null,"","","",null,null,"","","",null,null,"","","",null,null,""]
[null,null,null,{"$f":"IF(ISERROR(INDIRECT(CONCATENATE($B111,\"!C16\"))),\"\",INDIRECT(CONCATENATE($B111,\"!C16\")))","v":""},{"$f":"IF(ISERROR(INDIRECT(CONCATENATE($B111,\"!C23\"))),\"\",INDIRECT(CONCATENATE($B111,\"!C23\")))","v":""},null,null,{"$f":"IF(ISERROR(INDIRECT(CONCATENATE($B111,\"!C21\"))),\"\",INDIRECT(CONCATENATE($B111,\"!C21\")))","v":""},{"$f":"IF(ISERROR(INDIRECT(CONCATENATE($B111,\"!D16\"))),\"\",INDIRECT(CONCATENATE($B111,\"!D16\")))","v":""},{"$f":"IF(ISERROR(INDIRECT(CONCATENATE($B111,\"!D23\"))),\"\",INDIRECT(CONCATENATE($B111,\"!D23\")))","v":""},null,null,{"$f":"IF(ISERROR(INDIRECT(CONCATENATE($B111,\"!D21\"))),\"\",INDIRECT(CONCATENATE($B111,\"!D21\")))","v":""},{"$f":"IF(ISERROR(INDIRECT(CONCATENATE($B111,\"!E16\"))),\"\",INDIRECT(CONCATENATE($B111,\"!E16\")))","v":""},{"$f":"IF(ISERROR(INDIRECT(CONCATENATE($B111,\"!E23\"))),\"\",INDIRECT(CONCATENATE($B111,\"!E23\")))","v":""},null,null,{"$f":"IF(ISERROR(INDIRECT(CONCATENATE($B111,\"!E21\"))),\"\",INDIRECT(CONCATENATE($B111,\"!E21\")))","v":""},{"$f":"IF(ISERROR(INDIRECT(CONCATENATE($B111,\"!F16\"))),\"\",INDIRECT(CONCATENATE($B111,\"!F16\")))","v":""},{"$f":"IF(ISERROR(INDIRECT(CONCATENATE($B111,\"!F23\"))),\"\",INDIRECT(CONCATENATE($B111,\"!F23\")))","v":""},null,null,{"$f":"IF(ISERROR(INDIRECT(CONCATENATE($B111,\"!F21\"))),\"\",INDIRECT(CONCATENATE($B111,\"!F21\")))","v":""},{"$f":"IF(ISERROR(INDIRECT(CONCATENATE($B111,\"!G16\"))),\"\",INDIRECT(CONCATENATE($B111,\"!G16\")))","v":""},{"$f":"IF(ISERROR(INDIRECT(CONCATENATE($B111,\"!G23\"))),\"\",INDIRECT(CONCATENATE($B111,\"!G23\")))","v":""},null,null,{"$f":"IF(ISERROR(INDIRECT(CONCATENATE($B111,\"!G221\"))),\"\",INDIRECT(CONCATENATE($B111,\"!G21\")))","v":""}]
[null,null,null,{"$f":"IF(ISERROR(INDIRECT(CONCATENATE($B112,\"!C16\"))),\"\",INDIRECT(CONCATENATE($B112,\"!C16\")))","v":""},{"$f":"IF(ISERROR(INDIRECT(CONCATENATE($B112,\"!C23\"))),\"\",INDIRECT(CONCATENATE($B112,\"!C23\")))","v":""},null,null,{"$f":"IF(ISERROR(INDIRECT(CONCATENATE($B112,\"!C21\"))),\"\",INDIRECT(CONCATENATE($B112,\"!C21\")))","v":""},{"$f":"IF(ISERROR(INDIRECT(CONCATENATE($B112,\"!D16\"))),\"\",INDIRECT(CONCATENATE($B112,\"!D16\")))","v":""},{"$f":"IF(ISERROR(INDIRECT(CONCATENATE($B112,\"!D23\"))),\"\",INDIRECT(CONCATENATE($B112,\"!D23\")))","v":""},null,null,{"$f":"IF(ISERROR(INDIRECT(CONCATENATE($B112,\"!D21\"))),\"\",INDIRECT(CONCATENATE($B112,\"!D21\")))","v":""},{"$f":"IF(ISERROR(INDIRECT(CONCATENATE($B112,\"!E16\"))),\"\",INDIRECT(CONCATENATE($B112,\"!E16\")))","v":""},{"$f":"IF(ISERROR(INDIRECT(CONCATENATE($B112,\"!E23\"))),\"\",INDIRECT(CONCATENATE($B112,\"!E23\")))","v":""},null,null,{"$f":"IF(ISERROR(INDIRECT(CONCATENATE($B112,\"!E21\"))),\"\",INDIRECT(CONCATENATE($B112,\"!E21\")))","v":""},{"$f":"IF(ISERROR(INDIRECT(CONCATENATE($B112,\"!F16\"))),\"\",INDIRECT(CONCATENATE($B112,\"!F16\")))","v":""},{"$f":"IF(ISERROR(INDIRECT(CONCATENATE($B112,\"!F23\"))),\"\",INDIRECT(CONCATENATE($B112,\"!F23\")))","v":""},null,null,{"$f":"IF(ISERROR(INDIRECT(CONCATENATE($B112,\"!F21\"))),\"\",INDIRECT(CONCATENATE($B112,\"!F21\")))","v":""},{"$f":"IF(ISERROR(INDIRECT(CONCATENATE($B112,\"!G16\"))),\"\",INDIRECT(CONCATENATE($B112,\"!G16\")))","v":""},{"$f":"IF(ISERROR(INDIRECT(CONCATENATE($B112,\"!G23\"))),\"\",INDIRECT(CONCATENATE($B112,\"!G23\")))","v":""},null,null,{"$f":"IF(ISERROR(INDIRECT(CONCATENATE($B112,\"!G221\"))),\"\",INDIRECT(CONCATENATE($B112,\"!G21\")))","v":""}]
[null,null,null,"","",null,null,"","","",null,null,"","","",null,null,"","","",null,null,"","","",null,null,""]
[null,null,null,"","",null,null,"","","",null,null,"","","",null,null,"","","",null,null,"","","",null,null,""]
[null,null,null,"","",null,null,"","","",null,null,"","","",null,null,"","","",null,null,"","","",null,null,""]
[null,null,null,"","",null,null,"","","",null,null,"","","",null,null,"","","",null,null,"","","",null,null,""]
[]
[null,{"$f":"CONCATENATE(\"National use of drinking water sources, \",C99,\"–\",C100)","v":"National use of drinking water sources, 2000–2017"},null,null,null,null,null,null,null,null,null,null,null,null,null,null,null,null,"Data points used for regression"]
[]
[]
[]
[]
[]
[]
[]
[]
[]
[]
[]
[]
[]
[]
[]
[]
[]
[]
[]
[]
[]
[]
[]
[]
[]
[]
[]
[]
[]
[]
[]
[]
[]
[]
[null,null,null,null,{"$f":"IF(ISERROR(INDIRECT(CONCATENATE($B153,\"!M18\"))),\"\",INDIRECT(CONCATENATE($B153,\"!M18\")))","v":""},{"$f":"IF(ISERROR(INDIRECT(CONCATENATE($B153,\"!M19\"))),\"\",INDIRECT(CONCATENATE($B153,\"!M19\")))","v":""},{"$f":"IF(ISERROR(INDIRECT(CONCATENATE($B153,\"!M20\"))),\"\",INDIRECT(CONCATENATE($B153,\"!M20\")))","v":""},{"$f":"IF(ISERROR(INDIRECT(CONCATENATE($B153,\"!M21\"))),\"\",INDIRECT(CONCATENATE($B153,\"!M21\")))","v":""},null,{"$f":"IF(ISERROR(INDIRECT(CONCATENATE($B153,\"!N18\"))),\"\",INDIRECT(CONCATENATE($B153,\"!N18\")))","v":""},{"$f":"IF(ISERROR(INDIRECT(CONCATENATE($B153,\"!N19\"))),\"\",INDIRECT(CONCATENATE($B153,\"!N19\")))","v":""},{"$f":"IF(ISERROR(INDIRECT(CONCATENATE($B153,\"!N20\"))),\"\",INDIRECT(CONCATENATE($B153,\"!N20\")))","v":""},{"$f":"IF(ISERROR(INDIRECT(CONCATENATE($B153,\"!N21\"))),\"\",INDIRECT(CONCATENATE($B153,\"!N21\")))","v":""},null,{"$f":"IF(ISERROR(INDIRECT(CONCATENATE($B153,\"!O18\"))),\"\",INDIRECT(CONCATENATE($B153,\"!O18\")))","v":""},{"$f":"IF(ISERROR(INDIRECT(CONCATENATE($B153,\"!O19\"))),\"\",INDIRECT(CONCATENATE($B153,\"!O19\")))","v":""},{"$f":"IF(ISERROR(INDIRECT(CONCATENATE($B153,\"!O20\"))),\"\",INDIRECT(CONCATENATE($B153,\"!O20\")))","v":""},{"$f":"IF(ISERROR(INDIRECT(CONCATENATE($B153,\"!O21\"))),\"\",INDIRECT(CONCATENATE($B153,\"!O21\")))","v":""},null,{"$f":"IF(ISERROR(INDIRECT(CONCATENATE($B153,\"!P18\"))),\"\",INDIRECT(CONCATENATE($B153,\"!P18\")))","v":""},{"$f":"IF(ISERROR(INDIRECT(CONCATENATE($B153,\"!P19\"))),\"\",INDIRECT(CONCATENATE($B153,\"!P19\")))","v":""},{"$f":"IF(ISERROR(INDIRECT(CONCATENATE($B153,\"!P20\"))),\"\",INDIRECT(CONCATENATE($B153,\"!P20\")))","v":""},{"$f":"IF(ISERROR(INDIRECT(CONCATENATE($B153,\"!P21\"))),\"\",INDIRECT(CONCATENATE($B153,\"!P21\")))","v":""},null,{"$f":"IF(ISERROR(INDIRECT(CONCATENATE($B153,\"!Q18\"))),\"\",INDIRECT(CONCATENATE($B153,\"!Q18\")))","v":""},{"$f":"IF(ISERROR(INDIRECT(CONCATENATE($B153,\"!Q19\"))),\"\",INDIRECT(CONCATENATE($B153,\"!Q19\")))","v":""},{"$f":"IF(ISERROR(INDIRECT(CONCATENATE($B153,\"!Q20\"))),\"\",INDIRECT(CONCATENATE($B153,\"!Q20\")))","v":""},{"$f":"IF(ISERROR(INDIRECT(CONCATENATE($B153,\"!Q21\"))),\"\",INDIRECT(CONCATENATE($B153,\"!Q1\")))","v":""}]
[null,null,null,null,"","","","",null,"","","","",null,"","","","",null,"","","","",null,"","","",""]
[null,null,null,null,"","","","",null,"","","","",null,"","","","",null,"","","","",null,"","","",""]
[null,null,null,null,"","","","",null,"","","","",null,"","","","",null,"","","","",null,"","","",""]
[null,null,null,null,"","","","",null,"","","","",null,"","","","",null,"","","","",null,"","","",""]
[null,null,null,null,"","","","",null,"","","","",null,"","","","",null,"","","","",null,"","","",""]
[]
[]
[]
[]
[]
[]
[]
[]
[]
[]
[]
[]
[]
[]
[]
[]
[]
[]
[]
[]
[]
[]
[]
[]
[]
[]
[]
[]
[]
[]
[]
[]
[]
[]
[]
[]
[]
[]
["URBAN",null,null,"Poorest",null,null,null,null,"Poor",null,null,null,null,"Middle",null,null,null,null,"Rich",null,null,null,null,"Richest"]
[null,null,null,"Improved","Basic","Limited","Unimproved","Surface water","Improved","Basic","Limited","Unimproved","Surface water","Improved","Basic","Limited","Unimproved","Surface water","Improved","Basic","Limited","Unimproved","Surface water","Improved","Basic","Limited","Unimproved","Surface water"]
["Forecast period:",null,{"$f":"MinBase(C205:C216)","v":2000},{"$f":"IF((D201+H201)>100,D201*100/(D201+H201),D201)","v":89.13748322926881},{"$f":"D199*AVERAGEIF(E205:E216,\">0\")/100","v":89.137483229268796},{"$f":"D199*(100-AVERAGEIF(E205:E216,\">0\"))/100","v":0},{"$f":"100-(E199+F199+H199)","v":9.8484694614224111},{"$f":"IF((D201+H201)>100,H201*100/(D201+H201),H201)","v":1.0140473093087934},{"$f":"IF((I201+M201)>100,I201*100/(I201+M201),I201)","v":95.830847294816977},{"$f":"I199*AVERAGEIF(J205:J216,\">0\")/100","v":95.830847294816977},{"$f":"I199*(100-AVERAGEIF(J205:J216,\">0\"))/100","v":0},{"$f":"100-(J199+K199+M199)","v":4.0875315358401423},{"$f":"IF((I201+M201)>100,M201*100/(I201+M201),M201)","v":8.1621169342881217E-2},{"$f":"IF((N201+R201)>100,N201*100/(N201+R201),N201)","v":97.041838296737836},{"$f":"N199*AVERAGEIF(O205:O216,\">0\")/100","v":97.041838296737836},{"$f":"N199*(100-AVERAGEIF(O205:O216,\">0\"))/100","v":0},{"$f":"100-(O199+P199+R199)","v":2.9581617032621637},{"$f":"IF((N201+R201)>100,R201*100/(N201+R201),R201)","v":0},{"$f":"IF((S201+W201)>100,S201*100/(S201+W201),S201)","v":98.070240728344913},{"$f":"S199*AVERAGEIF(T205:T216,\">0\")/100","v":98.070240728344913},{"$f":"S199*(100-AVERAGEIF(T205:T216,\">0\"))/100","v":0},{"$f":"100-(T199+U199+W199)","v":1.9297592716550866},{"$f":"IF((S201+W201)>100,W201*100/(S201+W201),W201)","v":0},{"$f":"IF((X201+AB201)>100,X201*100/(X201+AB201),X201)","v":98.754975938078758},{"$f":"X199*AVERAGEIF(Y205:Y216,\">0\")/100","v":98.754975938078758},{"$f":"X199*(100-AVERAGEIF(Y205:Y216,\">0\"))/100","v":0},{"$f":"100-(Y199+Z199+AB199)","v":1.2450240619212423},{"$f":"IF((X201+AB201)>100,AB201*100/(X201+AB201),AB201)","v":0}]
[null,null,{"$f":"MaxTarget(C205:C216)","v":2017},{"$f":"IF((D202+H202)>100,D202*100/(D202+H202),D202)","v":94.433016069338919},{"$f":"D200*AVERAGEIF(E205:E216,\">0\")/100","v":94.433016069338919},{"$f":"D200*(100-AVERAGEIF(E205:E216,\">0\"))/100","v":0},{"$f":"100-(E200+F200+H200)","v":4.1307559528991789},{"$f":"IF((D202+H202)>100,H202*100/(D202+H202),H202)","v":1.4362279777619023},{"$f":"IF((I202+M202)>100,I202*100/(I202+M202),I202)","v":95.547187956780505},{"$f":"I200*AVERAGEIF(J205:J216,\">0\")/100","v":95.547187956780505},{"$f":"I200*(100-AVERAGEIF(J205:J216,\">0\"))/100","v":0},{"$f":"100-(J200+K200+M200)","v":4.3115270903671075},{"$f":"IF((I202+M202)>100,M202*100/(I202+M202),M202)","v":0.14128495285238252},{"$f":"IF((N202+R202)>100,N202*100/(N202+R202),N202)","v":97.368116322772011},{"$f":"N200*AVERAGEIF(O205:O216,\">0\")/100","v":97.368116322771996},{"$f":"N200*(100-AVERAGEIF(O205:O216,\">0\"))/100","v":0},{"$f":"100-(O200+P200+R200)","v":2.4206188521369256},{"$f":"IF((N202+R202)>100,R202*100/(N202+R202),R202)","v":0.21126482509107802},{"$f":"IF((S202+W202)>100,S202*100/(S202+W202),S202)","v":98.585621237314385},{"$f":"S200*AVERAGEIF(T205:T216,\">0\")/100","v":98.585621237314385},{"$f":"S200*(100-AVERAGEIF(T205:T216,\">0\"))/100","v":0},{"$f":"100-(T200+U200+W200)","v":1.2882900228274252},{"$f":"IF((S202+W202)>100,W202*100/(S202+W202),W202)","v":0.12608873985819358},{"$f":"IF((X202+AB202)>100,X202*100/(X202+AB202),X202)","v":98.969493989382002},{"$f":"X200*AVERAGEIF(Y205:Y216,\">0\")/100","v":98.969493989382002},{"$f":"X200*(100-AVERAGEIF(Y205:Y216,\">0\"))/100","v":0},{"$f":"100-(Y200+Z200+AB200)","v":1.030506010617998},{"$f":"IF((X202+AB202)>100,AB202*100/(X202+AB202),AB202)","v":0}]
["Regression period:",null,{"$f":"MinRegYear(C199,C205:C216)","v":2000},{"$f":"IF(MAX(C205:C216)-MIN(C205:C216)<5,AVERAGEIF(C205:C216,\">0\",D205:D216),\nIF(FORECAST($C201,D$205:D$216,$C$205:$C$216)<0,0,\nIF(FORECAST($C201,D$205:D$216,$C$205:$C$216)>100,100,\nFORECAST($C201,D$205:D$216,$C$205:$C$216))))","v":89.13748322926881},null,null,null,{"$f":"IF(MAX(C205:C216)-MIN(C205:C216)<5,AVERAGEIF(C205:C216,\">0\",H205:H216),\nIF(FORECAST($C201,H$205:H$216,$C$205:$C$216)<0,0,\nIF(FORECAST($C201,H$205:H$216,$C$205:$C$216)>100,100,\nFORECAST($C201,H$205:H$216,$C$205:$C$216))))","v":1.0140473093087934},{"$f":"IF(MAX(C205:C216)-MIN(C205:C216)<5,AVERAGEIF(C205:C216,\">0\",I205:I216),\nIF(FORECAST($C201,I$205:I$216,$C$205:$C$216)<0,0,\nIF(FORECAST($C201,I$205:I$216,$C$205:$C$216)>100,100,\nFORECAST($C201,I$205:I$216,$C$205:$C$216))))","v":95.830847294816977},null,null,null,{"$f":"IF(MAX(C205:C216)-MIN(C205:C216)<5,AVERAGEIF(C205:C216,\">0\",M205:M216),\nIF(FORECAST($C201,M$205:M$216,$C$205:$C$216)<0,0,\nIF(FORECAST($C201,M$205:M$216,$C$205:$C$216)>100,100,\nFORECAST($C201,M$205:M$216,$C$205:$C$216))))","v":8.1621169342881217E-2},{"$f":"IF(MAX(C205:C216)-MIN(C205:C216)<5,AVERAGEIF(C205:C216,\">0\",N205:N216),\nIF(FORECAST($C201,N$205:N$216,$C$205:$C$216)<0,0,\nIF(FORECAST($C201,N$205:N$216,$C$205:$C$216)>100,100,\nFORECAST($C201,N$205:N$216,$C$205:$C$216))))","v":97.041838296737836},null,null,null,{"$f":"IF(MAX(C205:C216)-MIN(C205:C216)<5,AVERAGEIF(C205:C216,\">0\",R205:R216),\nIF(FORECAST($C201,R$205:R$216,$C$205:$C$216)<0,0,\nIF(FORECAST($C201,R$205:R$216,$C$205:$C$216)>100,100,\nFORECAST($C201,R$205:R$216,$C$205:$C$216))))","v":0},{"$f":"IF(MAX(C205:C216)-MIN(C205:C216)<5,AVERAGEIF(C205:C216,\">0\",S205:S216),\nIF(FORECAST($C201,S$205:S$216,$C$205:$C$216)<0,0,\nIF(FORECAST($C201,S$205:S$216,$C$205:$C$216)>100,100,\nFORECAST($C201,S$205:S$216,$C$205:$C$216))))","v":98.070240728344913},null,null,null,{"$f":"IF(MAX(C205:C216)-MIN(C205:C216)<5,AVERAGEIF(C205:C216,\">0\",W205:W216),\nIF(FORECAST($C201,W$205:W$216,$C$205:$C$216)<0,0,\nIF(FORECAST($C201,W$205:W$216,$C$205:$C$216)>100,100,\nFORECAST($C201,W$205:W$216,$C$205:$C$216))))","v":0},{"$f":"IF(MAX(C205:C216)-MIN(C205:C216)<5,AVERAGEIF(C205:C216,\">0\",X205:X216),\nIF(FORECAST($C201,X$205:X$216,$C$205:$C$216)<0,0,\nIF(FORECAST($C201,X$205:X$216,$C$205:$C$216)>100,100,\nFORECAST($C201,X$205:X$216,$C$205:$C$216))))","v":98.754975938078758},null,null,null,{"$f":"IF(MAX(C205:C216)-MIN(C205:C216)<5,AVERAGEIF(C205:C216,\">0\",AB205:AB216),\nIF(FORECAST($C201,AB$205:AB$216,$C$205:$C$216)<0,0,\nIF(FORECAST($C201,AB$205:AB$216,$C$205:$C$216)>100,100,\nFORECAST($C201,AB$205:AB$216,$C$205:$C$216))))","v":0}]
[null,null,{"$f":"MaxRegYear(C200,C205:C216)","v":2013},{"$f":"IF(MAX(C205:C216)-MIN(C205:C216)<5,AVERAGEIF(C205:C216,\">0\",D205:D216),\nIF(FORECAST($C202,D$205:D$216,$C$205:$C$216)<0,0,\nIF(FORECAST($C202,D$205:D$216,$C$205:$C$216)>100,100,\nFORECAST($C202,D$205:D$216,$C$205:$C$216))))","v":94.433016069338919},null,null,null,{"$f":"IF(MAX(C205:C216)-MIN(C205:C216)<5,AVERAGEIF(C205:C216,\">0\",H205:H216),\nIF(FORECAST($C202,H$205:H$216,$C$205:$C$216)<0,0,\nIF(FORECAST($C202,H$205:H$216,$C$205:$C$216)>100,100,\nFORECAST($C202,H$205:H$216,$C$205:$C$216))))","v":1.4362279777619023},{"$f":"IF(MAX(C205:C216)-MIN(C205:C216)<5,AVERAGEIF(C205:C216,\">0\",I205:I216),\nIF(FORECAST($C202,I$205:I$216,$C$205:$C$216)<0,0,\nIF(FORECAST($C202,I$205:I$216,$C$205:$C$216)>100,100,\nFORECAST($C202,I$205:I$216,$C$205:$C$216))))","v":95.547187956780505},null,null,null,{"$f":"IF(MAX(C205:C216)-MIN(C205:C216)<5,AVERAGEIF(C205:C216,\">0\",M205:M216),\nIF(FORECAST($C202,M$205:M$216,$C$205:$C$216)<0,0,\nIF(FORECAST($C202,M$205:M$216,$C$205:$C$216)>100,100,\nFORECAST($C202,M$205:M$216,$C$205:$C$216))))","v":0.14128495285238252},{"$f":"IF(MAX(C205:C216)-MIN(C205:C216)<5,AVERAGEIF(C205:C216,\">0\",N205:N216),\nIF(FORECAST($C202,N$205:N$216,$C$205:$C$216)<0,0,\nIF(FORECAST($C202,N$205:N$216,$C$205:$C$216)>100,100,\nFORECAST($C202,N$205:N$216,$C$205:$C$216))))","v":97.368116322772011},null,null,null,{"$f":"IF(MAX(C205:C216)-MIN(C205:C216)<5,AVERAGEIF(C205:C216,\">0\",R205:R216),\nIF(FORECAST($C202,R$205:R$216,$C$205:$C$216)<0,0,\nIF(FORECAST($C202,R$205:R$216,$C$205:$C$216)>100,100,\nFORECAST($C202,R$205:R$216,$C$205:$C$216))))","v":0.21126482509107802},{"$f":"IF(MAX(C205:C216)-MIN(C205:C216)<5,AVERAGEIF(C205:C216,\">0\",S205:S216),\nIF(FORECAST($C202,S$205:S$216,$C$205:$C$216)<0,0,\nIF(FORECAST($C202,S$205:S$216,$C$205:$C$216)>100,100,\nFORECAST($C202,S$205:S$216,$C$205:$C$216))))","v":98.585621237314385},null,null,null,{"$f":"IF(MAX(C205:C216)-MIN(C205:C216)<5,AVERAGEIF(C205:C216,\">0\",W205:W216),\nIF(FORECAST($C202,W$205:W$216,$C$205:$C$216)<0,0,\nIF(FORECAST($C202,W$205:W$216,$C$205:$C$216)>100,100,\nFORECAST($C202,W$205:W$216,$C$205:$C$216))))","v":0.12608873985819358},{"$f":"IF(MAX(C205:C216)-MIN(C205:C216)<5,AVERAGEIF(C205:C216,\">0\",X205:X216),\nIF(FORECAST($C202,X$205:X$216,$C$205:$C$216)<0,0,\nIF(FORECAST($C202,X$205:X$216,$C$205:$C$216)>100,100,\nFORECAST($C202,X$205:X$216,$C$205:$C$216))))","v":98.969493989382002},null,null,null,{"$f":"IF(MAX(C205:C216)-MIN(C205:C216)<5,AVERAGEIF(C205:C216,\">0\",AB205:AB216),\nIF(FORECAST($C202,AB$205:AB$216,$C$205:$C$216)<0,0,\nIF(FORECAST($C202,AB$205:AB$216,$C$205:$C$216)>100,100,\nFORECAST($C202,AB$205:AB$216,$C$205:$C$216))))","v":0}]
[]
[null,"Survey","Year","Improved","% Improved\n< = 30min",null,null,"Surface water","Improved","% Improved\n< = 30min",null,null,"Surface water","Improved","% Improved\n< = 30min",null,null,"Surface water","Improved","% Improved\n< = 30min",null,null,"Surface water","Improved","% Improved\n< = 30min",null,null,"Surface water"]
[null,"DHS01",2001,{"$f":"IF(ISERROR(INDIRECT(CONCATENATE($B205,\"!H16\"))),\"\",INDIRECT(CONCATENATE($B205,\"!H16\")))","v":89.544831909274222},{"$f":"IF(ISERROR(INDIRECT(CONCATENATE($B205,\"!H23\"))),\"\",INDIRECT(CONCATENATE($B205,\"!H23\")))","v":"N/A"},null,null,{"$f":"IF(ISERROR(INDIRECT(CONCATENATE($B205,\"!H21\"))),\"\",INDIRECT(CONCATENATE($B205,\"!H21\")))","v":1.0465227453436563},{"$f":"IF(ISERROR(INDIRECT(CONCATENATE($B205,\"!I16\"))),\"\",INDIRECT(CONCATENATE($B205,\"!I16\")))","v":95.809027345737263},{"$f":"IF(ISERROR(INDIRECT(CONCATENATE($B205,\"!I23\"))),\"\",INDIRECT(CONCATENATE($B205,\"!I23\")))","v":"N/A"},null,null,{"$f":"IF(ISERROR(INDIRECT(CONCATENATE($B205,\"!I21\"))),\"\",INDIRECT(CONCATENATE($B205,\"!I21\")))","v":8.621069115130528E-2},{"$f":"IF(ISERROR(INDIRECT(CONCATENATE($B205,\"!J16\"))),\"\",INDIRECT(CONCATENATE($B205,\"!J16\")))","v":97.066936606432776},{"$f":"IF(ISERROR(INDIRECT(CONCATENATE($B205,\"!J23\"))),\"\",INDIRECT(CONCATENATE($B205,\"!J23\")))","v":"N/A"},null,null,{"$f":"IF(ISERROR(INDIRECT(CONCATENATE($B205,\"!J21\"))),\"\",INDIRECT(CONCATENATE($B205,\"!J21\")))","v":0},{"$f":"IF(ISERROR(INDIRECT(CONCATENATE($B205,\"!K16\"))),\"\",INDIRECT(CONCATENATE($B205,\"!K16\")))","v":98.109885382881032},{"$f":"IF(ISERROR(INDIRECT(CONCATENATE($B205,\"!K23\"))),\"\",INDIRECT(CONCATENATE($B205,\"!K23\")))","v":"N/A"},null,null,{"$f":"IF(ISERROR(INDIRECT(CONCATENATE($B205,\"!K21\"))),\"\",INDIRECT(CONCATENATE($B205,\"!K21\")))","v":0},{"$f":"IF(ISERROR(INDIRECT(CONCATENATE($B205,\"!L16\"))),\"\",INDIRECT(CONCATENATE($B205,\"!L16\")))","v":98.77147732664055},{"$f":"IF(ISERROR(INDIRECT(CONCATENATE($B205,\"!L23\"))),\"\",INDIRECT(CONCATENATE($B205,\"!L23\")))","v":"N/A"},null,null,{"$f":"IF(ISERROR(INDIRECT(CONCATENATE($B205,\"!L221\"))),\"\",INDIRECT(CONCATENATE($B205,\"!L21\")))","v":0}]
[null,"ENDESA11",2011,93.618318709328179,100,null,null,1.3712771056922017,95.590827854939974,100,null,null,0.13210590923553736,97.317919703382145,100,null,null,0.17605402090922984,98.506331928242162,100,null,null,0.10507394988182879,98.936491212258431,100,null,null,0]
[null,null,null,"","",null,null,"","","",null,null,"","","",null,null,"","","",null,null,"","","",null,null,""]
[null,null,null,"","",null,null,"","","",null,null,"","","",null,null,"","","",null,null,"","","",null,null,""]
[null,null,null,"","",null,null,"","","",null,null,"","","",null,null,"","","",null,null,"","","",null,null,""]
[null,null,null,"","",null,null,"","","",null,null,"","","",null,null,"","","",null,null,"","","",null,null,""]
[null,null,null,"","",null,null,"","","",null,null,"","","",null,null,"","","",null,null,"","","",null,null,""]
[null,null,null,"","",null,null,"","","",null,null,"","","",null,null,"","","",null,null,"","","",null,null,""]
[null,null,null,"","",null,null,"","","",null,null,"","","",null,null,"","","",null,null,"","","",null,null,""]
[null,null,null,"","",null,null,"","","",null,null,"","","",null,null,"","","",null,null,"","","",null,null,""]
[null,null,null,"","",null,null,"","","",null,null,"","","",null,null,"","","",null,null,"","","",null,null,""]
[null,null,null,"","",null,null,"","","",null,null,"","","",null,null,"","","",null,null,"","","",null,null,""]
[]
[null,{"$f":"CONCATENATE(\"Urban use of drinking water sources,  \",C199,\"–\",C200)","v":"Urban use of drinking water sources,  2000–2017"},null,null,null,null,null,null,null,null,null,null,null,null,null,null,null,null,"Data points used for regression"]
[]
[]
[]
[]
[]
[]
[]
[]
[]
[]
[]
[]
[]
[]
[]
[]
[]
[]
[]
[]
[]
[]
[]
[]
[]
[]
[]
[]
[]
[]
[]
[]
[]
[]
[null,null,null,null,{"$f":"IF(ISERROR(INDIRECT(CONCATENATE($B253,\"!M18\"))),\"\",INDIRECT(CONCATENATE($B253,\"!M18\")))","v":""},{"$f":"IF(ISERROR(INDIRECT(CONCATENATE($B253,\"!M19\"))),\"\",INDIRECT(CONCATENATE($B253,\"!M19\")))","v":""},{"$f":"IF(ISERROR(INDIRECT(CONCATENATE($B253,\"!M20\"))),\"\",INDIRECT(CONCATENATE($B253,\"!M20\")))","v":""},{"$f":"IF(ISERROR(INDIRECT(CONCATENATE($B253,\"!M21\"))),\"\",INDIRECT(CONCATENATE($B253,\"!M21\")))","v":""},null,{"$f":"IF(ISERROR(INDIRECT(CONCATENATE($B253,\"!N18\"))),\"\",INDIRECT(CONCATENATE($B253,\"!N18\")))","v":""},{"$f":"IF(ISERROR(INDIRECT(CONCATENATE($B253,\"!N19\"))),\"\",INDIRECT(CONCATENATE($B253,\"!N19\")))","v":""},{"$f":"IF(ISERROR(INDIRECT(CONCATENATE($B253,\"!N20\"))),\"\",INDIRECT(CONCATENATE($B253,\"!N20\")))","v":""},{"$f":"IF(ISERROR(INDIRECT(CONCATENATE($B253,\"!N21\"))),\"\",INDIRECT(CONCATENATE($B253,\"!N21\")))","v":""},null,{"$f":"IF(ISERROR(INDIRECT(CONCATENATE($B253,\"!O18\"))),\"\",INDIRECT(CONCATENATE($B253,\"!O18\")))","v":""},{"$f":"IF(ISERROR(INDIRECT(CONCATENATE($B253,\"!O19\"))),\"\",INDIRECT(CONCATENATE($B253,\"!O19\")))","v":""},{"$f":"IF(ISERROR(INDIRECT(CONCATENATE($B253,\"!O20\"))),\"\",INDIRECT(CONCATENATE($B253,\"!O20\")))","v":""},{"$f":"IF(ISERROR(INDIRECT(CONCATENATE($B253,\"!O21\"))),\"\",INDIRECT(CONCATENATE($B253,\"!O21\")))","v":""},null,{"$f":"IF(ISERROR(INDIRECT(CONCATENATE($B253,\"!P18\"))),\"\",INDIRECT(CONCATENATE($B253,\"!P18\")))","v":""},{"$f":"IF(ISERROR(INDIRECT(CONCATENATE($B253,\"!P19\"))),\"\",INDIRECT(CONCATENATE($B253,\"!P19\")))","v":""},{"$f":"IF(ISERROR(INDIRECT(CONCATENATE($B253,\"!P20\"))),\"\",INDIRECT(CONCATENATE($B253,\"!P20\")))","v":""},{"$f":"IF(ISERROR(INDIRECT(CONCATENATE($B253,\"!P21\"))),\"\",INDIRECT(CONCATENATE($B253,\"!P21\")))","v":""},null,{"$f":"IF(ISERROR(INDIRECT(CONCATENATE($B253,\"!Q18\"))),\"\",INDIRECT(CONCATENATE($B253,\"!Q18\")))","v":""},{"$f":"IF(ISERROR(INDIRECT(CONCATENATE($B253,\"!Q19\"))),\"\",INDIRECT(CONCATENATE($B253,\"!Q19\")))","v":""},{"$f":"IF(ISERROR(INDIRECT(CONCATENATE($B253,\"!Q20\"))),\"\",INDIRECT(CONCATENATE($B253,\"!Q20\")))","v":""},{"$f":"IF(ISERROR(INDIRECT(CONCATENATE($B253,\"!Q21\"))),\"\",INDIRECT(CONCATENATE($B253,\"!Q1\")))","v":""}]
[null,null,null,null,{"$f":"IF(ISERROR(INDIRECT(CONCATENATE($B254,\"!M18\"))),\"\",INDIRECT(CONCATENATE($B254,\"!M18\")))","v":""},{"$f":"IF(ISERROR(INDIRECT(CONCATENATE($B254,\"!M19\"))),\"\",INDIRECT(CONCATENATE($B254,\"!M19\")))","v":""},{"$f":"IF(ISERROR(INDIRECT(CONCATENATE($B254,\"!M20\"))),\"\",INDIRECT(CONCATENATE($B254,\"!M20\")))","v":""},{"$f":"IF(ISERROR(INDIRECT(CONCATENATE($B254,\"!M21\"))),\"\",INDIRECT(CONCATENATE($B254,\"!M21\")))","v":""},null,{"$f":"IF(ISERROR(INDIRECT(CONCATENATE($B254,\"!N18\"))),\"\",INDIRECT(CONCATENATE($B254,\"!N18\")))","v":""},{"$f":"IF(ISERROR(INDIRECT(CONCATENATE($B254,\"!N19\"))),\"\",INDIRECT(CONCATENATE($B254,\"!N19\")))","v":""},{"$f":"IF(ISERROR(INDIRECT(CONCATENATE($B254,\"!N20\"))),\"\",INDIRECT(CONCATENATE($B254,\"!N20\")))","v":""},{"$f":"IF(ISERROR(INDIRECT(CONCATENATE($B254,\"!N21\"))),\"\",INDIRECT(CONCATENATE($B254,\"!N21\")))","v":""},null,{"$f":"IF(ISERROR(INDIRECT(CONCATENATE($B254,\"!O18\"))),\"\",INDIRECT(CONCATENATE($B254,\"!O18\")))","v":""},{"$f":"IF(ISERROR(INDIRECT(CONCATENATE($B254,\"!O19\"))),\"\",INDIRECT(CONCATENATE($B254,\"!O19\")))","v":""},{"$f":"IF(ISERROR(INDIRECT(CONCATENATE($B254,\"!O20\"))),\"\",INDIRECT(CONCATENATE($B254,\"!O20\")))","v":""},{"$f":"IF(ISERROR(INDIRECT(CONCATENATE($B254,\"!O21\"))),\"\",INDIRECT(CONCATENATE($B254,\"!O21\")))","v":""},null,{"$f":"IF(ISERROR(INDIRECT(CONCATENATE($B254,\"!P18\"))),\"\",INDIRECT(CONCATENATE($B254,\"!P18\")))","v":""},{"$f":"IF(ISERROR(INDIRECT(CONCATENATE($B254,\"!P19\"))),\"\",INDIRECT(CONCATENATE($B254,\"!P19\")))","v":""},{"$f":"IF(ISERROR(INDIRECT(CONCATENATE($B254,\"!P20\"))),\"\",INDIRECT(CONCATENATE($B254,\"!P20\")))","v":""},{"$f":"IF(ISERROR(INDIRECT(CONCATENATE($B254,\"!P21\"))),\"\",INDIRECT(CONCATENATE($B254,\"!P21\")))","v":""},null,{"$f":"IF(ISERROR(INDIRECT(CONCATENATE($B254,\"!Q18\"))),\"\",INDIRECT(CONCATENATE($B254,\"!Q18\")))","v":""},{"$f":"IF(ISERROR(INDIRECT(CONCATENATE($B254,\"!Q19\"))),\"\",INDIRECT(CONCATENATE($B254,\"!Q19\")))","v":""},{"$f":"IF(ISERROR(INDIRECT(CONCATENATE($B254,\"!Q20\"))),\"\",INDIRECT(CONCATENATE($B254,\"!Q20\")))","v":""},{"$f":"IF(ISERROR(INDIRECT(CONCATENATE($B254,\"!Q21\"))),\"\",INDIRECT(CONCATENATE($B254,\"!Q1\")))","v":""}]
[null,null,null,null,{"$f":"IF(ISERROR(INDIRECT(CONCATENATE($B255,\"!M18\"))),\"\",INDIRECT(CONCATENATE($B255,\"!M18\")))","v":""},{"$f":"IF(ISERROR(INDIRECT(CONCATENATE($B255,\"!M19\"))),\"\",INDIRECT(CONCATENATE($B255,\"!M19\")))","v":""},{"$f":"IF(ISERROR(INDIRECT(CONCATENATE($B255,\"!M20\"))),\"\",INDIRECT(CONCATENATE($B255,\"!M20\")))","v":""},{"$f":"IF(ISERROR(INDIRECT(CONCATENATE($B255,\"!M21\"))),\"\",INDIRECT(CONCATENATE($B255,\"!M21\")))","v":""},null,{"$f":"IF(ISERROR(INDIRECT(CONCATENATE($B255,\"!N18\"))),\"\",INDIRECT(CONCATENATE($B255,\"!N18\")))","v":""},{"$f":"IF(ISERROR(INDIRECT(CONCATENATE($B255,\"!N19\"))),\"\",INDIRECT(CONCATENATE($B255,\"!N19\")))","v":""},{"$f":"IF(ISERROR(INDIRECT(CONCATENATE($B255,\"!N20\"))),\"\",INDIRECT(CONCATENATE($B255,\"!N20\")))","v":""},{"$f":"IF(ISERROR(INDIRECT(CONCATENATE($B255,\"!N21\"))),\"\",INDIRECT(CONCATENATE($B255,\"!N21\")))","v":""},null,{"$f":"IF(ISERROR(INDIRECT(CONCATENATE($B255,\"!O18\"))),\"\",INDIRECT(CONCATENATE($B255,\"!O18\")))","v":""},{"$f":"IF(ISERROR(INDIRECT(CONCATENATE($B255,\"!O19\"))),\"\",INDIRECT(CONCATENATE($B255,\"!O19\")))","v":""},{"$f":"IF(ISERROR(INDIRECT(CONCATENATE($B255,\"!O20\"))),\"\",INDIRECT(CONCATENATE($B255,\"!O20\")))","v":""},{"$f":"IF(ISERROR(INDIRECT(CONCATENATE($B255,\"!O21\"))),\"\",INDIRECT(CONCATENATE($B255,\"!O21\")))","v":""},null,{"$f":"IF(ISERROR(INDIRECT(CONCATENATE($B255,\"!P18\"))),\"\",INDIRECT(CONCATENATE($B255,\"!P18\")))","v":""},{"$f":"IF(ISERROR(INDIRECT(CONCATENATE($B255,\"!P19\"))),\"\",INDIRECT(CONCATENATE($B255,\"!P19\")))","v":""},{"$f":"IF(ISERROR(INDIRECT(CONCATENATE($B255,\"!P20\"))),\"\",INDIRECT(CONCATENATE($B255,\"!P20\")))","v":""},{"$f":"IF(ISERROR(INDIRECT(CONCATENATE($B255,\"!P21\"))),\"\",INDIRECT(CONCATENATE($B255,\"!P21\")))","v":""},null,{"$f":"IF(ISERROR(INDIRECT(CONCATENATE($B255,\"!Q18\"))),\"\",INDIRECT(CONCATENATE($B255,\"!Q18\")))","v":""},{"$f":"IF(ISERROR(INDIRECT(CONCATENATE($B255,\"!Q19\"))),\"\",INDIRECT(CONCATENATE($B255,\"!Q19\")))","v":""},{"$f":"IF(ISERROR(INDIRECT(CONCATENATE($B255,\"!Q20\"))),\"\",INDIRECT(CONCATENATE($B255,\"!Q20\")))","v":""},{"$f":"IF(ISERROR(INDIRECT(CONCATENATE($B255,\"!Q21\"))),\"\",INDIRECT(CONCATENATE($B255,\"!Q1\")))","v":""}]
[null,null,null,null,{"$f":"IF(ISERROR(INDIRECT(CONCATENATE($B256,\"!M18\"))),\"\",INDIRECT(CONCATENATE($B256,\"!M18\")))","v":""},{"$f":"IF(ISERROR(INDIRECT(CONCATENATE($B256,\"!M19\"))),\"\",INDIRECT(CONCATENATE($B256,\"!M19\")))","v":""},{"$f":"IF(ISERROR(INDIRECT(CONCATENATE($B256,\"!M20\"))),\"\",INDIRECT(CONCATENATE($B256,\"!M20\")))","v":""},{"$f":"IF(ISERROR(INDIRECT(CONCATENATE($B256,\"!M21\"))),\"\",INDIRECT(CONCATENATE($B256,\"!M21\")))","v":""},null,{"$f":"IF(ISERROR(INDIRECT(CONCATENATE($B256,\"!N18\"))),\"\",INDIRECT(CONCATENATE($B256,\"!N18\")))","v":""},{"$f":"IF(ISERROR(INDIRECT(CONCATENATE($B256,\"!N19\"))),\"\",INDIRECT(CONCATENATE($B256,\"!N19\")))","v":""},{"$f":"IF(ISERROR(INDIRECT(CONCATENATE($B256,\"!N20\"))),\"\",INDIRECT(CONCATENATE($B256,\"!N20\")))","v":""},{"$f":"IF(ISERROR(INDIRECT(CONCATENATE($B256,\"!N21\"))),\"\",INDIRECT(CONCATENATE($B256,\"!N21\")))","v":""},null,{"$f":"IF(ISERROR(INDIRECT(CONCATENATE($B256,\"!O18\"))),\"\",INDIRECT(CONCATENATE($B256,\"!O18\")))","v":""},{"$f":"IF(ISERROR(INDIRECT(CONCATENATE($B256,\"!O19\"))),\"\",INDIRECT(CONCATENATE($B256,\"!O19\")))","v":""},{"$f":"IF(ISERROR(INDIRECT(CONCATENATE($B256,\"!O20\"))),\"\",INDIRECT(CONCATENATE($B256,\"!O20\")))","v":""},{"$f":"IF(ISERROR(INDIRECT(CONCATENATE($B256,\"!O21\"))),\"\",INDIRECT(CONCATENATE($B256,\"!O21\")))","v":""},null,{"$f":"IF(ISERROR(INDIRECT(CONCATENATE($B256,\"!P18\"))),\"\",INDIRECT(CONCATENATE($B256,\"!P18\")))","v":""},{"$f":"IF(ISERROR(INDIRECT(CONCATENATE($B256,\"!P19\"))),\"\",INDIRECT(CONCATENATE($B256,\"!P19\")))","v":""},{"$f":"IF(ISERROR(INDIRECT(CONCATENATE($B256,\"!P20\"))),\"\",INDIRECT(CONCATENATE($B256,\"!P20\")))","v":""},{"$f":"IF(ISERROR(INDIRECT(CONCATENATE($B256,\"!P21\"))),\"\",INDIRECT(CONCATENATE($B256,\"!P21\")))","v":""},null,{"$f":"IF(ISERROR(INDIRECT(CONCATENATE($B256,\"!Q18\"))),\"\",INDIRECT(CONCATENATE($B256,\"!Q18\")))","v":""},{"$f":"IF(ISERROR(INDIRECT(CONCATENATE($B256,\"!Q19\"))),\"\",INDIRECT(CONCATENATE($B256,\"!Q19\")))","v":""},{"$f":"IF(ISERROR(INDIRECT(CONCATENATE($B256,\"!Q20\"))),\"\",INDIRECT(CONCATENATE($B256,\"!Q20\")))","v":""},{"$f":"IF(ISERROR(INDIRECT(CONCATENATE($B256,\"!Q21\"))),\"\",INDIRECT(CONCATENATE($B256,\"!Q1\")))","v":""}]
[null,null,null,null,{"$f":"IF(ISERROR(INDIRECT(CONCATENATE($B257,\"!M18\"))),\"\",INDIRECT(CONCATENATE($B257,\"!M18\")))","v":""},{"$f":"IF(ISERROR(INDIRECT(CONCATENATE($B257,\"!M19\"))),\"\",INDIRECT(CONCATENATE($B257,\"!M19\")))","v":""},{"$f":"IF(ISERROR(INDIRECT(CONCATENATE($B257,\"!M20\"))),\"\",INDIRECT(CONCATENATE($B257,\"!M20\")))","v":""},{"$f":"IF(ISERROR(INDIRECT(CONCATENATE($B257,\"!M21\"))),\"\",INDIRECT(CONCATENATE($B257,\"!M21\")))","v":""},null,{"$f":"IF(ISERROR(INDIRECT(CONCATENATE($B257,\"!N18\"))),\"\",INDIRECT(CONCATENATE($B257,\"!N18\")))","v":""},{"$f":"IF(ISERROR(INDIRECT(CONCATENATE($B257,\"!N19\"))),\"\",INDIRECT(CONCATENATE($B257,\"!N19\")))","v":""},{"$f":"IF(ISERROR(INDIRECT(CONCATENATE($B257,\"!N20\"))),\"\",INDIRECT(CONCATENATE($B257,\"!N20\")))","v":""},{"$f":"IF(ISERROR(INDIRECT(CONCATENATE($B257,\"!N21\"))),\"\",INDIRECT(CONCATENATE($B257,\"!N21\")))","v":""},null,{"$f":"IF(ISERROR(INDIRECT(CONCATENATE($B257,\"!O18\"))),\"\",INDIRECT(CONCATENATE($B257,\"!O18\")))","v":""},{"$f":"IF(ISERROR(INDIRECT(CONCATENATE($B257,\"!O19\"))),\"\",INDIRECT(CONCATENATE($B257,\"!O19\")))","v":""},{"$f":"IF(ISERROR(INDIRECT(CONCATENATE($B257,\"!O20\"))),\"\",INDIRECT(CONCATENATE($B257,\"!O20\")))","v":""},{"$f":"IF(ISERROR(INDIRECT(CONCATENATE($B257,\"!O21\"))),\"\",INDIRECT(CONCATENATE($B257,\"!O21\")))","v":""},null,{"$f":"IF(ISERROR(INDIRECT(CONCATENATE($B257,\"!P18\"))),\"\",INDIRECT(CONCATENATE($B257,\"!P18\")))","v":""},{"$f":"IF(ISERROR(INDIRECT(CONCATENATE($B257,\"!P19\"))),\"\",INDIRECT(CONCATENATE($B257,\"!P19\")))","v":""},{"$f":"IF(ISERROR(INDIRECT(CONCATENATE($B257,\"!P20\"))),\"\",INDIRECT(CONCATENATE($B257,\"!P20\")))","v":""},{"$f":"IF(ISERROR(INDIRECT(CONCATENATE($B257,\"!P21\"))),\"\",INDIRECT(CONCATENATE($B257,\"!P21\")))","v":""},null,{"$f":"IF(ISERROR(INDIRECT(CONCATENATE($B257,\"!Q18\"))),\"\",INDIRECT(CONCATENATE($B257,\"!Q18\")))","v":""},{"$f":"IF(ISERROR(INDIRECT(CONCATENATE($B257,\"!Q19\"))),\"\",INDIRECT(CONCATENATE($B257,\"!Q19\")))","v":""},{"$f":"IF(ISERROR(INDIRECT(CONCATENATE($B257,\"!Q20\"))),\"\",INDIRECT(CONCATENATE($B257,\"!Q20\")))","v":""},{"$f":"IF(ISERROR(INDIRECT(CONCATENATE($B257,\"!Q21\"))),\"\",INDIRECT(CONCATENATE($B257,\"!Q1\")))","v":""}]
[]
[]
[]
[]
[]
[]
[]
[]
[]
[]
[]
[]
[]
[]
[]
[]
[]
[]
[]
[]
[]
[]
[]
[]
[]
[]
[]
[]
[]
[]
[]
[]
[]
[]
[]
[]
[]
[]
[]
["RURAL",null,null,"Poorest",null,null,null,null,"Poor",null,null,null,null,"Middle",null,null,null,null,"Rich",null,null,null,null,"Richest"]
[null,null,null,"Improved","Basic","Limited","Unimproved","Surface water","Improved","Basic","Limited","Unimproved","Surface water","Improved","Basic","Limited","Unimproved","Surface water","Improved","Basic","Limited","Unimproved","Surface water","Improved","Basic","Limited","Unimproved","Surface water"]
["Forecast period:",null,2000,{"$f":"IF((D301+H301)>100,D301*100/(D301+H301),D301)","v":48.36352815870805},{"$f":"D299*AVERAGEIF(E305:E316,\">0\")/100","v":48.36352815870805},{"$f":"D299*(100-AVERAGEIF(E305:E316,\">0\"))/100","v":0},{"$f":"100-(E299+F299+H299)","v":34.006443834707056},{"$f":"IF((D301+H301)>100,H301*100/(D301+H301),H301)","v":17.630028006584894},{"$f":"IF((I301+M301)>100,I301*100/(I301+M301),I301)","v":51.832452102827816},{"$f":"I299*AVERAGEIF(J305:J316,\">0\")/100","v":51.832452102827823},{"$f":"I299*(100-AVERAGEIF(J305:J316,\">0\"))/100","v":0},{"$f":"100-(J299+K299+M299)","v":33.368915480501443},{"$f":"IF((I301+M301)>100,M301*100/(I301+M301),M301)","v":14.798632416670728},{"$f":"IF((N301+R301)>100,N301*100/(N301+R301),N301)","v":57.614513708566847},{"$f":"N299*AVERAGEIF(O305:O316,\">0\")/100","v":57.614513708566847},{"$f":"N299*(100-AVERAGEIF(O305:O316,\">0\"))/100","v":0},{"$f":"100-(O299+P299+R299)","v":30.993813079148026},{"$f":"IF((N301+R301)>100,R301*100/(N301+R301),R301)","v":11.391673212285127},{"$f":"IF((S301+W301)>100,S301*100/(S301+W301),S301)","v":71.85015378938283},{"$f":"S299*AVERAGEIF(T305:T316,\">0\")/100","v":71.85015378938283},{"$f":"S299*(100-AVERAGEIF(T305:T316,\">0\"))/100","v":0},{"$f":"100-(T299+U299+W299)","v":24.916145179829755},{"$f":"IF((S301+W301)>100,W301*100/(S301+W301),W301)","v":3.2337010307874152},{"$f":"IF((X301+AB301)>100,X301*100/(X301+AB301),X301)","v":85.136928993751098},{"$f":"X299*AVERAGEIF(Y305:Y316,\">0\")/100","v":85.136928993751098},{"$f":"X299*(100-AVERAGEIF(Y305:Y316,\">0\"))/100","v":0},{"$f":"100-(Y299+Z299+AB299)","v":14.034584762237728},{"$f":"IF((X301+AB301)>100,AB301*100/(X301+AB301),AB301)","v":0.82848624401117377}]
[null,null,2017,{"$f":"IF((D302+H302)>100,D302*100/(D302+H302),D302)","v":43.29096550211591},{"$f":"D300*AVERAGEIF(E305:E316,\">0\")/100","v":43.290965502115903},{"$f":"D300*(100-AVERAGEIF(E305:E316,\">0\"))/100","v":0},{"$f":"100-(E300+F300+H300)","v":35.466463207422521},{"$f":"IF((D302+H302)>100,H302*100/(D302+H302),H302)","v":21.242571290461569},{"$f":"IF((I302+M302)>100,I302*100/(I302+M302),I302)","v":52.606302546770678},{"$f":"I300*AVERAGEIF(J305:J316,\">0\")/100","v":52.606302546770678},{"$f":"I300*(100-AVERAGEIF(J305:J316,\">0\"))/100","v":0},{"$f":"100-(J300+K300+M300)","v":32.270772567085103},{"$f":"IF((I302+M302)>100,M302*100/(I302+M302),M302)","v":15.122924886144219},{"$f":"IF((N302+R302)>100,N302*100/(N302+R302),N302)","v":66.906891762799432},{"$f":"N300*AVERAGEIF(O305:O316,\">0\")/100","v":66.906891762799432},{"$f":"N300*(100-AVERAGEIF(O305:O316,\">0\"))/100","v":0},{"$f":"100-(O300+P300+R300)","v":25.813183620269228},{"$f":"IF((N302+R302)>100,R302*100/(N302+R302),R302)","v":7.2799246169313392},{"$f":"IF((S302+W302)>100,S302*100/(S302+W302),S302)","v":74.542053531253373},{"$f":"S300*AVERAGEIF(T305:T316,\">0\")/100","v":74.542053531253373},{"$f":"S300*(100-AVERAGEIF(T305:T316,\">0\"))/100","v":0},{"$f":"100-(T300+U300+W300)","v":19.045926526100061},{"$f":"IF((S302+W302)>100,W302*100/(S302+W302),W302)","v":6.4120199426465661},{"$f":"IF((X302+AB302)>100,X302*100/(X302+AB302),X302)","v":79.451523830444444},{"$f":"X300*AVERAGEIF(Y305:Y316,\">0\")/100","v":79.451523830444444},{"$f":"X300*(100-AVERAGEIF(Y305:Y316,\">0\"))/100","v":0},{"$f":"100-(Y300+Z300+AB300)","v":17.164176589746432},{"$f":"IF((X302+AB302)>100,AB302*100/(X302+AB302),AB302)","v":3.3842995798091238}]
["Regression period:",null,{"$f":"MinRegYear(C299,C305:C316)","v":2000},{"$f":"IF(MAX(C305:C316)-MIN(C305:C316)<5,AVERAGEIF(C305:C316,\">0\",D305:D316),\nIF(FORECAST($C301,D$305:D$316,$C$305:$C$316)<0,0,\nIF(FORECAST($C301,D$305:D$316,$C$305:$C$316)>100,100,\nFORECAST($C301,D$305:D$316,$C$305:$C$316))))","v":48.36352815870805},null,null,null,{"$f":"IF(MAX(C305:C316)-MIN(C305:C316)<5,AVERAGEIF(C305:C316,\">0\",H305:H316),\nIF(FORECAST($C301,H$305:H$316,$C$305:$C$316)<0,0,\nIF(FORECAST($C301,H$305:H$316,$C$305:$C$316)>100,100,\nFORECAST($C301,H$305:H$316,$C$305:$C$316))))","v":17.630028006584894},{"$f":"IF(MAX(C305:C316)-MIN(C305:C316)<5,AVERAGEIF(C305:C316,\">0\",I305:I316),\nIF(FORECAST($C301,I$305:I$316,$C$305:$C$316)<0,0,\nIF(FORECAST($C301,I$305:I$316,$C$305:$C$316)>100,100,\nFORECAST($C301,I$305:I$316,$C$305:$C$316))))","v":51.832452102827816},null,null,null,{"$f":"IF(MAX(C305:C316)-MIN(C305:C316)<5,AVERAGEIF(C305:C316,\">0\",M305:M316),\nIF(FORECAST($C301,M$305:M$316,$C$305:$C$316)<0,0,\nIF(FORECAST($C301,M$305:M$316,$C$305:$C$316)>100,100,\nFORECAST($C301,M$305:M$316,$C$305:$C$316))))","v":14.798632416670728},{"$f":"IF(MAX(C305:C316)-MIN(C305:C316)<5,AVERAGEIF(C305:C316,\">0\",N305:N316),\nIF(FORECAST($C301,N$305:N$316,$C$305:$C$316)<0,0,\nIF(FORECAST($C301,N$305:N$316,$C$305:$C$316)>100,100,\nFORECAST($C301,N$305:N$316,$C$305:$C$316))))","v":57.614513708566847},null,null,null,{"$f":"IF(MAX(C305:C316)-MIN(C305:C316)<5,AVERAGEIF(C305:C316,\">0\",R305:R316),\nIF(FORECAST($C301,R$305:R$316,$C$305:$C$316)<0,0,\nIF(FORECAST($C301,R$305:R$316,$C$305:$C$316)>100,100,\nFORECAST($C301,R$305:R$316,$C$305:$C$316))))","v":11.391673212285127},{"$f":"IF(MAX(C305:C316)-MIN(C305:C316)<5,AVERAGEIF(C305:C316,\">0\",S305:S316),\nIF(FORECAST($C301,S$305:S$316,$C$305:$C$316)<0,0,\nIF(FORECAST($C301,S$305:S$316,$C$305:$C$316)>100,100,\nFORECAST($C301,S$305:S$316,$C$305:$C$316))))","v":71.85015378938283},null,null,null,{"$f":"IF(MAX(C305:C316)-MIN(C305:C316)<5,AVERAGEIF(C305:C316,\">0\",W305:W316),\nIF(FORECAST($C301,W$305:W$316,$C$305:$C$316)<0,0,\nIF(FORECAST($C301,W$305:W$316,$C$305:$C$316)>100,100,\nFORECAST($C301,W$305:W$316,$C$305:$C$316))))","v":3.2337010307874152},{"$f":"IF(MAX(C305:C316)-MIN(C305:C316)<5,AVERAGEIF(C305:C316,\">0\",X305:X316),\nIF(FORECAST($C301,X$305:X$316,$C$305:$C$316)<0,0,\nIF(FORECAST($C301,X$305:X$316,$C$305:$C$316)>100,100,\nFORECAST($C301,X$305:X$316,$C$305:$C$316))))","v":85.136928993751098},null,null,null,{"$f":"IF(MAX(C305:C316)-MIN(C305:C316)<5,AVERAGEIF(C305:C316,\">0\",AB305:AB316),\nIF(FORECAST($C301,AB$305:AB$316,$C$305:$C$316)<0,0,\nIF(FORECAST($C301,AB$305:AB$316,$C$305:$C$316)>100,100,\nFORECAST($C301,AB$305:AB$316,$C$305:$C$316))))","v":0.82848624401117377}]
[null,null,{"$f":"MaxRegYear(C300,C305:C316)","v":2013},{"$f":"IF(MAX(C305:C316)-MIN(C305:C316)<5,AVERAGEIF(C305:C316,\">0\",D305:D316),\nIF(FORECAST($C302,D$305:D$316,$C$305:$C$316)<0,0,\nIF(FORECAST($C302,D$305:D$316,$C$305:$C$316)>100,100,\nFORECAST($C302,D$305:D$316,$C$305:$C$316))))","v":43.29096550211591},null,null,null,{"$f":"IF(MAX(C305:C316)-MIN(C305:C316)<5,AVERAGEIF(C305:C316,\">0\",H305:H316),\nIF(FORECAST($C302,H$305:H$316,$C$305:$C$316)<0,0,\nIF(FORECAST($C302,H$305:H$316,$C$305:$C$316)>100,100,\nFORECAST($C302,H$305:H$316,$C$305:$C$316))))","v":21.242571290461569},{"$f":"IF(MAX(C305:C316)-MIN(C305:C316)<5,AVERAGEIF(C305:C316,\">0\",I305:I316),\nIF(FORECAST($C302,I$305:I$316,$C$305:$C$316)<0,0,\nIF(FORECAST($C302,I$305:I$316,$C$305:$C$316)>100,100,\nFORECAST($C302,I$305:I$316,$C$305:$C$316))))","v":52.606302546770678},null,null,null,{"$f":"IF(MAX(C305:C316)-MIN(C305:C316)<5,AVERAGEIF(C305:C316,\">0\",M305:M316),\nIF(FORECAST($C302,M$305:M$316,$C$305:$C$316)<0,0,\nIF(FORECAST($C302,M$305:M$316,$C$305:$C$316)>100,100,\nFORECAST($C302,M$305:M$316,$C$305:$C$316))))","v":15.122924886144219},{"$f":"IF(MAX(C305:C316)-MIN(C305:C316)<5,AVERAGEIF(C305:C316,\">0\",N305:N316),\nIF(FORECAST($C302,N$305:N$316,$C$305:$C$316)<0,0,\nIF(FORECAST($C302,N$305:N$316,$C$305:$C$316)>100,100,\nFORECAST($C302,N$305:N$316,$C$305:$C$316))))","v":66.906891762799432},null,null,null,{"$f":"IF(MAX(C305:C316)-MIN(C305:C316)<5,AVERAGEIF(C305:C316,\">0\",R305:R316),\nIF(FORECAST($C302,R$305:R$316,$C$305:$C$316)<0,0,\nIF(FORECAST($C302,R$305:R$316,$C$305:$C$316)>100,100,\nFORECAST($C302,R$305:R$316,$C$305:$C$316))))","v":7.2799246169313392},{"$f":"IF(MAX(C305:C316)-MIN(C305:C316)<5,AVERAGEIF(C305:C316,\">0\",S305:S316),\nIF(FORECAST($C302,S$305:S$316,$C$305:$C$316)<0,0,\nIF(FORECAST($C302,S$305:S$316,$C$305:$C$316)>100,100,\nFORECAST($C302,S$305:S$316,$C$305:$C$316))))","v":74.542053531253373},null,null,null,{"$f":"IF(MAX(C305:C316)-MIN(C305:C316)<5,AVERAGEIF(C305:C316,\">0\",W305:W316),\nIF(FORECAST($C302,W$305:W$316,$C$305:$C$316)<0,0,\nIF(FORECAST($C302,W$305:W$316,$C$305:$C$316)>100,100,\nFORECAST($C302,W$305:W$316,$C$305:$C$316))))","v":6.4120199426465661},{"$f":"IF(MAX(C305:C316)-MIN(C305:C316)<5,AVERAGEIF(C305:C316,\">0\",X305:X316),\nIF(FORECAST($C302,X$305:X$316,$C$305:$C$316)<0,0,\nIF(FORECAST($C302,X$305:X$316,$C$305:$C$316)>100,100,\nFORECAST($C302,X$305:X$316,$C$305:$C$316))))","v":79.451523830444444},null,null,null,{"$f":"IF(MAX(C305:C316)-MIN(C305:C316)<5,AVERAGEIF(C305:C316,\">0\",AB305:AB316),\nIF(FORECAST($C302,AB$305:AB$316,$C$305:$C$316)<0,0,\nIF(FORECAST($C302,AB$305:AB$316,$C$305:$C$316)>100,100,\nFORECAST($C302,AB$305:AB$316,$C$305:$C$316))))","v":3.3842995798091238}]
[]
[null,"Survey","Year","Improved","% Improved\n< = 30min",null,null,"Surface water","Improved","% Improved\n< = 30min",null,null,"Surface water","Improved","% Improved\n< = 30min",null,null,"Surface water","Improved","% Improved\n< = 30min",null,null,"Surface water","Improved","% Improved\n< = 30min",null,null,"Surface water"]
[null,"DHS01",2001,{"$f":"IF(ISERROR(INDIRECT(CONCATENATE($B305,\"!M16\"))),\"\",INDIRECT(CONCATENATE($B305,\"!M16\")))","v":47.973331031277951},{"$f":"IF(ISERROR(INDIRECT(CONCATENATE($B305,\"!M23\"))),\"\",INDIRECT(CONCATENATE($B305,\"!M23\")))","v":"N/A"},null,null,{"$f":"IF(ISERROR(INDIRECT(CONCATENATE($B305,\"!M21\"))),\"\",INDIRECT(CONCATENATE($B305,\"!M21\")))","v":17.907915951498481},{"$f":"IF(ISERROR(INDIRECT(CONCATENATE($B305,\"!N16\"))),\"\",INDIRECT(CONCATENATE($B305,\"!N16\")))","v":51.891979060054197},{"$f":"IF(ISERROR(INDIRECT(CONCATENATE($B305,\"!N23\"))),\"\",INDIRECT(CONCATENATE($B305,\"!N23\")))","v":"N/A"},null,null,{"$f":"IF(ISERROR(INDIRECT(CONCATENATE($B305,\"!N21\"))),\"\",INDIRECT(CONCATENATE($B305,\"!N21\")))","v":14.823577991245621},{"$f":"IF(ISERROR(INDIRECT(CONCATENATE($B305,\"!O16\"))),\"\",INDIRECT(CONCATENATE($B305,\"!O16\")))","v":58.329312020430876},{"$f":"IF(ISERROR(INDIRECT(CONCATENATE($B305,\"!O23\"))),\"\",INDIRECT(CONCATENATE($B305,\"!O23\")))","v":"N/A"},null,null,{"$f":"IF(ISERROR(INDIRECT(CONCATENATE($B305,\"!O21\"))),\"\",INDIRECT(CONCATENATE($B305,\"!O21\")))","v":11.075384858796403},{"$f":"IF(ISERROR(INDIRECT(CONCATENATE($B305,\"!P16\"))),\"\",INDIRECT(CONCATENATE($B305,\"!P16\")))","v":72.057223000295934},{"$f":"IF(ISERROR(INDIRECT(CONCATENATE($B305,\"!P23\"))),\"\",INDIRECT(CONCATENATE($B305,\"!P23\")))","v":"N/A"},null,null,{"$f":"IF(ISERROR(INDIRECT(CONCATENATE($B305,\"!P21\"))),\"\",INDIRECT(CONCATENATE($B305,\"!P21\")))","v":3.4781871009304388},{"$f":"IF(ISERROR(INDIRECT(CONCATENATE($B305,\"!Q16\"))),\"\",INDIRECT(CONCATENATE($B305,\"!Q16\")))","v":84.699590135035194},{"$f":"IF(ISERROR(INDIRECT(CONCATENATE($B305,\"!Q23\"))),\"\",INDIRECT(CONCATENATE($B305,\"!Q23\")))","v":"N/A"},null,null,{"$f":"IF(ISERROR(INDIRECT(CONCATENATE($B305,\"!Q221\"))),\"\",INDIRECT(CONCATENATE($B305,\"!Q21\")))","v":1.0250872698417604}]
[null,"ENDESA11",2011,44.071359756976321,100,null,null,20.686795400634431,52.487248632317936,100,null,null,15.073033736994461,65.477295139071373,100,null,null,7.9125013239088853,74.127915109427121,100,null,null,5.9230478023605277,80.326201547876224,100,null,null,2.9910975281478862]
[null,null,null,"","",null,null,"","","",null,null,"","","",null,null,"","","",null,null,"","","",null,null,""]
[null,null,null,"","",null,null,"","","",null,null,"","","",null,null,"","","",null,null,"","","",null,null,""]
[null,null,null,"","",null,null,"","","",null,null,"","","",null,null,"","","",null,null,"","","",null,null,""]
[null,null,null,"","",null,null,"","","",null,null,"","","",null,null,"","","",null,null,"","","",null,null,""]
[null,null,null,"","",null,null,"","","",null,null,"","","",null,null,"","","",null,null,"","","",null,null,""]
[null,null,null,"","",null,null,"","","",null,null,"","","",null,null,"","","",null,null,"","","",null,null,""]
[null,null,null,"","",null,null,"","","",null,null,"","","",null,null,"","","",null,null,"","","",null,null,""]
[null,null,null,"","",null,null,"","","",null,null,"","","",null,null,"","","",null,null,"","","",null,null,""]
[null,null,null,"","",null,null,"","","",null,null,"","","",null,null,"","","",null,null,"","","",null,null,""]
[null,null,null,"","",null,null,"","","",null,null,"","","",null,null,"","","",null,null,"","","",null,null,""]
[]
[null,{"$f":"CONCATENATE(\"Rural use of drinking water sources, \",C299,\"–\",C300)","v":"Rural use of drinking water sources, 2000–2017"},null,null,null,null,null,null,null,null,null,null,null,null,null,null,null,null,"Data points used for regression"]

{"sheet":"Sanitation","index":2,"n_rows":318,"n_cols":28,"rows_kept":318,"cut":false,"hidden":false,"merged":[[30,21,30,24],[4,1,4,24],[3,1,3,24],[6,1,6,8],[6,9,6,16],[6,17,6,24],[30,1,31,4],[30,5,30,8],[30,9,30,12],[30,13,30,16],[30,17,30,20],[96,23,96,27],[32,1,33,2],[32,3,33,3],[35,1,36,2],[35,3,36,3],[38,1,39,2],[38,3,39,3],[96,0,97,2],[96,3,96,7],[96,8,96,12],[96,13,96,17],[96,18,96,22],[98,0,99,1],[100,0,101,1],[117,18,117,22],[196,0,197,2],[196,3,196,7],[196,8,196,12],[196,13,196,17],[196,18,196,22],[117,1,117,11],[298,0,299,1],[300,0,301,1],[317,18,317,22],[196,23,196,27],[198,0,199,1],[200,0,201,1],[217,18,217,22],[296,0,297,2],[296,3,296,7],[296,8,296,12],[296,13,296,17],[296,18,296,22],[296,23,296,27],[217,1,217,11],[317,1,317,11]]}
[]
[]
[]
[null,"Summary of trends in use of sanitation facilities by wealth quintile (%)"]
[null,{"$f":"IF(ISERROR(INDIRECT(CONCATENATE($B105,\"!A2\"))),\"\",INDIRECT(CONCATENATE($B105,\"!A2\")))","v":"Nicaragua"}]
[]
[null,{"$f":"B118","v":"National use of sanitation facilities, 2000–2017"},null,null,null,null,null,null,null,{"$f":"B218","v":"Urban use of sanitation facilities, 2000–2017"},null,null,null,null,null,null,null,{"$f":"B318","v":"Rural use of sanitation facilities, 2000–2017"}]
[]
[]
[]
[]
[]
[]
[]
[]
[]
[]
[]
[]
[]
[]
[]
[]
[]
[]
[]
[]
[]
[]
[]
[null,{"$f":"IF(ISERROR(INDIRECT(CONCATENATE($B105,\"!A2\"))),\"\",INDIRECT(CONCATENATE($B105,\"!A2\")))","v":"Nicaragua"},null,null,null,"Poorest",null,null,null,"Poor",null,null,null,"Middle",null,null,null,"Rich",null,null,null,"Richest"]
[null,null,null,null,null,"Basic","Limited","Unimproved","Open defecation","Basic","Limited","Unimproved","Open defecation","Basic","Limited","Unimproved","Open defecation","Basic","Limited","Unimproved","Open defecation","Basic","Limited","Unimproved","Open defecation"]
[null,"NATIONAL",null,"Estimate",{"$f":"C99","v":2000},{"$f":"E99","v":25.822703301814773},{"$f":"F99","v":1.7184954476751488},19.447991366713268,53.01080988379681,{"$f":"J99","v":43.501166479148694},{"$f":"K99","v":4.0016949545210529},32.830448542138129,19.666690024192121,{"$f":"O99","v":49.959957630839135},{"$f":"P99","v":5.7833113011598201},38.878089095978339,5.3786419720227059,{"$f":"T99","v":62.603690149675124},{"$f":"U99","v":5.7836562656456136},30.170935462772263,1.4417181219069946,{"$f":"Y99","v":85.103795380827052},{"$f":"Z99","v":3.6026774754022539},10.889856823609264,0.40367032016142002]
[null,null,null,null,{"$f":"C100","v":2017},{"$f":"E100","v":45.850178120506236},3.0513196644925724,22.039013952381538,29.059488262619652,{"$f":"J100","v":58.858422967903515},5.4144169751085451,26.503124129660819,9.2240359273271224,{"$f":"O100","v":67.247342548209915},7.784480503481479,21.154182237167959,3.8139947111406514,{"$f":"T100","v":78.473212434409078},7.2497657198241789,12.56984249315687,1.7071793526098631,{"$f":"Y100","v":92.170349254399568},3.9018241157502329,3.5728847484948574,0.35494188135534888]
[]
[null,"URBAN",null,"Estimate",{"$f":"C199","v":2000},{"$f":"E199","v":44.691599558790557},{"$f":"F199","v":5.0173875629043616},39.342901210959667,10.948111667345415,{"$f":"J199","v":53.555828812902412},{"$f":"K199","v":6.0792380432870843},37.09748728998818,3.267445853822327,{"$f":"O199","v":62.387720489394439},{"$f":"P199","v":5.6442109948669055},30.994077634582681,0.9739908811559701,{"$f":"T199","v":75.470340926985287},{"$f":"U199","v":4.820071838081482},19.092220471943307,0.61736676298992155,{"$f":"Y199","v":92.185702894996908},{"$f":"Z199","v":2.415797327326108},5.3059518998304753,9.254787784651608E-2]
[null,null,null,null,{"$f":"C200","v":2017},{"$f":"E200","v":64.498039159921504},7.2409952364091712,21.91716845543192,6.3437971482373996,{"$f":"J200","v":72.293456948548766},8.2061867681613609,16.28129455847801,3.2190617248118585,{"$f":"O200","v":79.556501515302713},7.1974689416990358,11.931754436131683,1.3142751068665675,{"$f":"T200","v":88.980138779649764},5.6829034533619947,4.6977938280555094,0.63916393893272483,{"$f":"Y200","v":95.487464700493547},2.5023225377947167,1.9435618840731763,6.6650877638561923E-2]
[]
[null,"RURAL",null,"Estimate",{"$f":"C299","v":2000},{"$f":"E299","v":18.839391963404776},{"$f":"F299","v":1.0870750834885465},14.874135783730253,65.199397169376425,{"$f":"J299","v":28.497220673912615},{"$f":"K299","v":1.6429664420579337},20.474724944828267,49.385087939201185,{"$f":"O299","v":41.68156035118502},{"$f":"P299","v":2.3554739838077507},29.559980958057849,26.402984706949383,{"$f":"T299","v":45.705109386788237},{"$f":"U299","v":4.9839599486814024},32.26214379101998,17.04878687351038,{"$f":"Y299","v":52.415638560529267},{"$f":"Z299","v":6.4721915205113785},35.253797927722815,5.8583719912365382]
[null,null,null,null,{"$f":"C300","v":2017},{"$f":"E300","v":36.033212846599589},2.0791970324555327,18.136269186606114,43.751320934338764,{"$f":"J300","v":52.451149350755379},3.0239958912746885,26.766784083575203,17.75807067439473,{"$f":"O300","v":55.443576846031448},3.1331817170409746,27.705477891215878,13.717763545711705,{"$f":"T300","v":56.60154283448832},6.1721725711963806,29.362115047455518,7.8641695468597845,{"$f":"Y300","v":62.707626516621239},7.7430282213120538,25.229471297626503,4.3198739644402053]
[]
[]
[]
[]
[]
[]
[]
[]
[]
[]
[]
[]
[]
[]
[]
[]
[]
[]
[]
[]
[]
[]
[]
[]
[]
[]
[]
[]
[]
[]
[]
[]
[]
[]
[]
[]
[]
[]
[]
[]
[]
[]
[]
[]
[]
[]
[]
[]
[]
[]
[]
[]
[]
[]
[]
[]
["NATIONAL",null,null,"Poorest",null,null,null,null,"Poor",null,null,null,null,"Middle",null,null,null,null,"Rich",null,null,null,null,"Richest"]
[null,null,null,"Improved","Basic","Limited","Unimproved","Open defecation","Improved","Basic","Limited","Unimproved","Open defecation","Improved","Basic","Limited","Unimproved","Open defecation","Improved","Basic","Limited","Unimproved","Open defecation","Improved","Basic","Limited","Unimproved","Open defecation"]
["Forecast period:",null,2000,{"$f":"IF((D101+H101)>100,D101*100/(D101+H101),D101)","v":27.541198749489922},{"$f":"D99*AVERAGEIF(E105:E116,\">0\")/100","v":25.822703301814773},{"$f":"D99*(100-AVERAGEIF(E105:E116,\">0\"))/100","v":1.7184954476751488},{"$f":"100-(E99+F99+H99)","v":19.447991366713268},{"$f":"IF((D101+H101)>100,H101*100/(D101+H101),H101)","v":53.01080988379681},{"$f":"IF((I101+M101)>100,I101*100/(I101+M101),I101)","v":47.50286143366975},{"$f":"I99*AVERAGEIF(J105:J116,\">0\")/100","v":43.501166479148694},{"$f":"I99*(100-AVERAGEIF(J105:J116,\">0\"))/100","v":4.0016949545210529},{"$f":"100-(J99+K99+M99)","v":32.830448542138129},{"$f":"IF((I101+M101)>100,M101*100/(I101+M101),M101)","v":19.666690024192121},{"$f":"IF((N101+R101)>100,N101*100/(N101+R101),N101)","v":55.743268931998955},{"$f":"N99*AVERAGEIF(O105:O116,\">0\")/100","v":49.959957630839135},{"$f":"N99*(100-AVERAGEIF(O105:O116,\">0\"))/100","v":5.7833113011598201},{"$f":"100-(O99+P99+R99)","v":38.878089095978339},{"$f":"IF((N101+R101)>100,R101*100/(N101+R101),R101)","v":5.3786419720227059},{"$f":"IF((S101+W101)>100,S101*100/(S101+W101),S101)","v":68.387346415320735},{"$f":"S99*AVERAGEIF(T105:T116,\">0\")/100","v":62.603690149675124},{"$f":"S99*(100-AVERAGEIF(T105:T116,\">0\"))/100","v":5.7836562656456136},{"$f":"100-(T99+U99+W99)","v":30.170935462772263},{"$f":"IF((S101+W101)>100,W101*100/(S101+W101),W101)","v":1.4417181219069946},{"$f":"IF((X101+AB101)>100,X101*100/(X101+AB101),X101)","v":88.706472856229311},{"$f":"X99*AVERAGEIF(Y105:Y116,\">0\")/100","v":85.103795380827052},{"$f":"X99*(100-AVERAGEIF(Y105:Y116,\">0\"))/100","v":3.6026774754022539},{"$f":"100-(Y99+Z99+AB99)","v":10.889856823609264},{"$f":"IF((X101+AB101)>100,AB101*100/(X101+AB101),AB101)","v":0.40367032016142002}]
[null,null,2017,{"$f":"IF((D102+H102)>100,D102*100/(D102+H102),D102)","v":48.90149778499881},{"$f":"D100*AVERAGEIF(E105:E116,\">0\")/100","v":45.850178120506236},{"$f":"D100*(100-AVERAGEIF(E105:E116,\">0\"))/100","v":3.0513196644925724},{"$f":"100-(E100+F100+H100)","v":22.039013952381538},{"$f":"IF((D102+H102)>100,H102*100/(D102+H102),H102)","v":29.059488262619652},{"$f":"IF((I102+M102)>100,I102*100/(I102+M102),I102)","v":64.272839943012059},{"$f":"I100*AVERAGEIF(J105:J116,\">0\")/100","v":58.858422967903515},{"$f":"I100*(100-AVERAGEIF(J105:J116,\">0\"))/100","v":5.4144169751085451},{"$f":"100-(J100+K100+M100)","v":26.503124129660819},{"$f":"IF((I102+M102)>100,M102*100/(I102+M102),M102)","v":9.2240359273271224},{"$f":"IF((N102+R102)>100,N102*100/(N102+R102),N102)","v":75.03182305169139},{"$f":"N100*AVERAGEIF(O105:O116,\">0\")/100","v":67.247342548209915},{"$f":"N100*(100-AVERAGEIF(O105:O116,\">0\"))/100","v":7.784480503481479},{"$f":"100-(O100+P100+R100)","v":21.154182237167959},{"$f":"IF((N102+R102)>100,R102*100/(N102+R102),R102)","v":3.8139947111406514},{"$f":"IF((S102+W102)>100,S102*100/(S102+W102),S102)","v":85.72297815423326},{"$f":"S100*AVERAGEIF(T105:T116,\">0\")/100","v":78.473212434409078},{"$f":"S100*(100-AVERAGEIF(T105:T116,\">0\"))/100","v":7.2497657198241789},{"$f":"100-(T100+U100+W100)","v":12.56984249315687},{"$f":"IF((S102+W102)>100,W102*100/(S102+W102),W102)","v":1.7071793526098631},{"$f":"IF((X102+AB102)>100,X102*100/(X102+AB102),X102)","v":96.072173370149812},{"$f":"X100*AVERAGEIF(Y105:Y116,\">0\")/100","v":92.170349254399568},{"$f":"X100*(100-AVERAGEIF(Y105:Y116,\">0\"))/100","v":3.9018241157502329},{"$f":"100-(Y100+Z100+AB100)","v":3.5728847484948574},{"$f":"IF((X102+AB102)>100,AB102*100/(X102+AB102),AB102)","v":0.35494188135534888}]
["Regression period:",null,{"$f":"MinRegYear(C99,C105:C116)","v":2000},{"$f":"IF(MAX(C105:C116)-MIN(C105:C116)<5,AVERAGEIF(C105:C116,\">0\",D105:D116),\nIF(FORECAST($C101,D$105:D$116,$C$105:$C$116)<0,0,\nIF(FORECAST($C101,D$105:D$116,$C$105:$C$116)>100,100,\nFORECAST($C101,D$105:D$116,$C$105:$C$116))))","v":27.541198749489922},null,null,null,{"$f":"IF(MAX(C105:C116)-MIN(C105:C116)<5,AVERAGEIF(C105:C116,\">0\",H105:H116),\nIF(FORECAST($C101,H$105:H$116,$C$105:$C$116)<0,0,\nIF(FORECAST($C101,H$105:H$116,$C$105:$C$116)>100,100,\nFORECAST($C101,H$105:H$116,$C$105:$C$116))))","v":53.01080988379681},{"$f":"IF(MAX(C105:C116)-MIN(C105:C116)<5,AVERAGEIF(C105:C116,\">0\",I105:I116),\nIF(FORECAST($C101,I$105:I$116,$C$105:$C$116)<0,0,\nIF(FORECAST($C101,I$105:I$116,$C$105:$C$116)>100,100,\nFORECAST($C101,I$105:I$116,$C$105:$C$116))))","v":47.50286143366975},null,null,null,{"$f":"IF(MAX(C105:C116)-MIN(C105:C116)<5,AVERAGEIF(C105:C116,\">0\",M105:M116),\nIF(FORECAST($C101,M$105:M$116,$C$105:$C$116)<0,0,\nIF(FORECAST($C101,M$105:M$116,$C$105:$C$116)>100,100,\nFORECAST($C101,M$105:M$116,$C$105:$C$116))))","v":19.666690024192121},{"$f":"IF(MAX(C105:C116)-MIN(C105:C116)<5,AVERAGEIF(C105:C116,\">0\",N105:N116),\nIF(FORECAST($C101,N$105:N$116,$C$105:$C$116)<0,0,\nIF(FORECAST($C101,N$105:N$116,$C$105:$C$116)>100,100,\nFORECAST($C101,N$105:N$116,$C$105:$C$116))))","v":55.743268931998955},null,null,null,{"$f":"IF(MAX(C105:C116)-MIN(C105:C116)<5,AVERAGEIF(C105:C116,\">0\",R105:R116),\nIF(FORECAST($C101,R$105:R$116,$C$105:$C$116)<0,0,\nIF(FORECAST($C101,R$105:R$116,$C$105:$C$116)>100,100,\nFORECAST($C101,R$105:R$116,$C$105:$C$116))))","v":5.3786419720227059},{"$f":"IF(MAX(C105:C116)-MIN(C105:C116)<5,AVERAGEIF(C105:C116,\">0\",S105:S116),\nIF(FORECAST($C101,S$105:S$116,$C$105:$C$116)<0,0,\nIF(FORECAST($C101,S$105:S$116,$C$105:$C$116)>100,100,\nFORECAST($C101,S$105:S$116,$C$105:$C$116))))","v":68.387346415320735},null,null,null,{"$f":"IF(MAX(C105:C116)-MIN(C105:C116)<5,AVERAGEIF(C105:C116,\">0\",W105:W116),\nIF(FORECAST($C101,W$105:W$116,$C$105:$C$116)<0,0,\nIF(FORECAST($C101,W$105:W$116,$C$105:$C$116)>100,100,\nFORECAST($C101,W$105:W$116,$C$105:$C$116))))","v":1.4417181219069946},{"$f":"IF(MAX(C105:C116)-MIN(C105:C116)<5,AVERAGEIF(C105:C116,\">0\",X105:X116),\nIF(FORECAST($C101,X$105:X$116,$C$105:$C$116)<0,0,\nIF(FORECAST($C101,X$105:X$116,$C$105:$C$116)>100,100,\nFORECAST($C101,X$105:X$116,$C$105:$C$116))))","v":88.706472856229311},null,null,null,{"$f":"IF(MAX(C105:C116)-MIN(C105:C116)<5,AVERAGEIF(C105:C116,\">0\",AB105:AB116),\nIF(FORECAST($C101,AB$105:AB$116,$C$105:$C$116)<0,0,\nIF(FORECAST($C101,AB$105:AB$116,$C$105:$C$116)>100,100,\nFORECAST($C101,AB$105:AB$116,$C$105:$C$116))))","v":0.40367032016142002}]
[null,null,{"$f":"MaxRegYear(C100,C105:C116)","v":2013},{"$f":"IF(MAX(C105:C116)-MIN(C105:C116)<5,AVERAGEIF(C105:C116,\">0\",D105:D116),\nIF(FORECAST($C102,D$105:D$116,$C$105:$C$116)<0,0,\nIF(FORECAST($C102,D$105:D$116,$C$105:$C$116)>100,100,\nFORECAST($C102,D$105:D$116,$C$105:$C$116))))","v":48.90149778499881},null,null,null,{"$f":"IF(MAX(C105:C116)-MIN(C105:C116)<5,AVERAGEIF(C105:C116,\">0\",H105:H116),\nIF(FORECAST($C102,H$105:H$116,$C$105:$C$116)<0,0,\nIF(FORECAST($C102,H$105:H$116,$C$105:$C$116)>100,100,\nFORECAST($C102,H$105:H$116,$C$105:$C$116))))","v":29.059488262619652},{"$f":"IF(MAX(C105:C116)-MIN(C105:C116)<5,AVERAGEIF(C105:C116,\">0\",I105:I116),\nIF(FORECAST($C102,I$105:I$116,$C$105:$C$116)<0,0,\nIF(FORECAST($C102,I$105:I$116,$C$105:$C$116)>100,100,\nFORECAST($C102,I$105:I$116,$C$105:$C$116))))","v":64.272839943012059},null,null,null,{"$f":"IF(MAX(C105:C116)-MIN(C105:C116)<5,AVERAGEIF(C105:C116,\">0\",M105:M116),\nIF(FORECAST($C102,M$105:M$116,$C$105:$C$116)<0,0,\nIF(FORECAST($C102,M$105:M$116,$C$105:$C$116)>100,100,\nFORECAST($C102,M$105:M$116,$C$105:$C$116))))","v":9.2240359273271224},{"$f":"IF(MAX(C105:C116)-MIN(C105:C116)<5,AVERAGEIF(C105:C116,\">0\",N105:N116),\nIF(FORECAST($C102,N$105:N$116,$C$105:$C$116)<0,0,\nIF(FORECAST($C102,N$105:N$116,$C$105:$C$116)>100,100,\nFORECAST($C102,N$105:N$116,$C$105:$C$116))))","v":75.03182305169139},null,null,null,{"$f":"IF(MAX(C105:C116)-MIN(C105:C116)<5,AVERAGEIF(C105:C116,\">0\",R105:R116),\nIF(FORECAST($C102,R$105:R$116,$C$105:$C$116)<0,0,\nIF(FORECAST($C102,R$105:R$116,$C$105:$C$116)>100,100,\nFORECAST($C102,R$105:R$116,$C$105:$C$116))))","v":3.8139947111406514},{"$f":"IF(MAX(C105:C116)-MIN(C105:C116)<5,AVERAGEIF(C105:C116,\">0\",S105:S116),\nIF(FORECAST($C102,S$105:S$116,$C$105:$C$116)<0,0,\nIF(FORECAST($C102,S$105:S$116,$C$105:$C$116)>100,100,\nFORECAST($C102,S$105:S$116,$C$105:$C$116))))","v":85.72297815423326},null,null,null,{"$f":"IF(MAX(C105:C116)-MIN(C105:C116)<5,AVERAGEIF(C105:C116,\">0\",W105:W116),\nIF(FORECAST($C102,W$105:W$116,$C$105:$C$116)<0,0,\nIF(FORECAST($C102,W$105:W$116,$C$105:$C$116)>100,100,\nFORECAST($C102,W$105:W$116,$C$105:$C$116))))","v":1.7071793526098631},{"$f":"IF(MAX(C105:C116)-MIN(C105:C116)<5,AVERAGEIF(C105:C116,\">0\",X105:X116),\nIF(FORECAST($C102,X$105:X$116,$C$105:$C$116)<0,0,\nIF(FORECAST($C102,X$105:X$116,$C$105:$C$116)>100,100,\nFORECAST($C102,X$105:X$116,$C$105:$C$116))))","v":96.072173370149812},null,null,null,{"$f":"IF(MAX(C105:C116)-MIN(C105:C116)<5,AVERAGEIF(C105:C116,\">0\",AB105:AB116),\nIF(FORECAST($C102,AB$105:AB$116,$C$105:$C$116)<0,0,\nIF(FORECAST($C102,AB$105:AB$116,$C$105:$C$116)>100,100,\nFORECAST($C102,AB$105:AB$116,$C$105:$C$116))))","v":0.35494188135534888}]
[]
[null,"Survey","Year","Improved","Not shared",null,null,"Open defecation","Improved","Not shared",null,null,"Open defecation","Improved","Not shared",null,null,"Open defecation","Improved","Not shared",null,null,"Open defecation","Improved","Not shared",null,null,"Open defecation"]
[null,"DHS01",2001,{"$f":"IF(ISERROR(INDIRECT(CONCATENATE($B105,\"!C122\"))),\"\",INDIRECT(CONCATENATE($B105,\"!C122\")))","v":29.184298675297935},{"$f":"IF(ISERROR(INDIRECT(CONCATENATE($B105,\"!C129\"))),\"\",INDIRECT(CONCATENATE($B105,\"!C129\")))","v":93.760273605712328},null,null,{"$f":"IF(ISERROR(INDIRECT(CONCATENATE($B105,\"!C127\"))),\"\",INDIRECT(CONCATENATE($B105,\"!C127\")))","v":51.168400528321385},{"$f":"IF(ISERROR(INDIRECT(CONCATENATE($B105,\"!D122\"))),\"\",INDIRECT(CONCATENATE($B105,\"!D122\")))","v":48.792859780542557},{"$f":"IF(ISERROR(INDIRECT(CONCATENATE($B105,\"!D129\"))),\"\",INDIRECT(CONCATENATE($B105,\"!D129\")))","v":91.57588651768107},null,null,{"$f":"IF(ISERROR(INDIRECT(CONCATENATE($B105,\"!D127\"))),\"\",INDIRECT(CONCATENATE($B105,\"!D127\")))","v":18.863408939818008},{"$f":"IF(ISERROR(INDIRECT(CONCATENATE($B105,\"!E122\"))),\"\",INDIRECT(CONCATENATE($B105,\"!E122\")))","v":57.227003864282835},{"$f":"IF(ISERROR(INDIRECT(CONCATENATE($B105,\"!E129\"))),\"\",INDIRECT(CONCATENATE($B105,\"!E129\")))","v":89.625094810613163},null,null,{"$f":"IF(ISERROR(INDIRECT(CONCATENATE($B105,\"!E127\"))),\"\",INDIRECT(CONCATENATE($B105,\"!E127\")))","v":5.2582844904164041},{"$f":"IF(ISERROR(INDIRECT(CONCATENATE($B105,\"!F122\"))),\"\",INDIRECT(CONCATENATE($B105,\"!F122\")))","v":69.720856549083138},{"$f":"IF(ISERROR(INDIRECT(CONCATENATE($B105,\"!F129\"))),\"\",INDIRECT(CONCATENATE($B105,\"!F129\")))","v":91.54279765364619},null,null,{"$f":"IF(ISERROR(INDIRECT(CONCATENATE($B105,\"!F127\"))),\"\",INDIRECT(CONCATENATE($B105,\"!F127\")))","v":1.4621382165764436},{"$f":"IF(ISERROR(INDIRECT(CONCATENATE($B105,\"!G122\"))),\"\",INDIRECT(CONCATENATE($B105,\"!G122\")))","v":89.273065203454081},{"$f":"IF(ISERROR(INDIRECT(CONCATENATE($B105,\"!G129\"))),\"\",INDIRECT(CONCATENATE($B105,\"!G129\")))","v":95.938653224053581},null,null,{"$f":"IF(ISERROR(INDIRECT(CONCATENATE($B105,\"!G2127\"))),\"\",INDIRECT(CONCATENATE($B105,\"!G127\")))","v":0.39992197871479951}]
[null,"ENDESA11",2011,45.615297933381697,"N/A",null,null,32.744306973569671,61.692843249267497,"N/A",null,null,10.830598096075603,72.06435318712326,"N/A",null,null,4.0547096743532833,83.055957886708171,"N/A",null,null,1.6663391632709592,94.9389886757006,"N/A",null,null,0.36243856424859106]
[null,null,null,"","",null,null,"","","",null,null,"","","",null,null,"","","",null,null,"","","",null,null,""]
[null,null,null,"","",null,null,"","","",null,null,"","","",null,null,"","","",null,null,"","","",null,null,""]
[null,null,null,"","",null,null,"","","",null,null,"","","",null,null,"","","",null,null,"","","",null,null,""]
[null,null,null,"","",null,null,"","","",null,null,"","","",null,null,"","","",null,null,"","","",null,null,""]
[null,null,null,"","",null,null,"","","",null,null,"","","",null,null,"","","",null,null,"","","",null,null,""]
[null,null,null,"","",null,null,"","","",null,null,"","","",null,null,"","","",null,null,"","","",null,null,""]
[null,null,null,"","",null,null,"","","",null,null,"","","",null,null,"","","",null,null,"","","",null,null,""]
[null,null,null,"","",null,null,"","","",null,null,"","","",null,null,"","","",null,null,"","","",null,null,""]
[null,null,null,"","",null,null,"","","",null,null,"","","",null,null,"","","",null,null,"","","",null,null,""]
[null,null,null,"","",null,null,"","","",null,null,"","","",null,null,"","","",null,null,"","","",null,null,""]
[]
[null,{"$f":"CONCATENATE(\"National use of sanitation facilities, \",C99,\"–\",C100)","v":"National use of sanitation facilities, 2000–2017"},null,null,null,null,null,null,null,null,null,null,null,null,null,null,null,null,"Data points used for regression"]
[]
[]
[]
[]
[]
[]
[]
[]
[]
[]
[]
[]
[]
[]
[]
[]
[]
[]
[]
[]
[]
[]
[]
[]
[]
[]
[]
[]
[]
[]
[]
[]
[]
[]
[]
[]
[]
[]
[]
[]
[]
[]
[]
[]
[]
[]
[]
[]
[]
[]
[]
[]
[]
[]
[]
[]
[]
[]
[]
[]
[]
[]
[]
[]
[]
[]
[]
[]
[]
[]
[]
[]
[]
[]
[]
[]
[]
[]
["URBAN",null,null,"Poorest",null,null,null,null,"Poor",null,null,null,null,"Middle",null,null,null,null,"Rich",null,null,null,null,"Richest"]
[null,null,null,"Improved","Basic","Limited","Unimproved","Open defecation","Improved","Basic","Limited","Unimproved","Open defecation","Improved","Basic","Limited","Unimproved","Open defecation","Improved","Basic","Limited","Unimproved","Open defecation","Improved","Basic","Limited","Unimproved","Open defecation"]
["Forecast period:",null,{"$f":"MinBase(C205:C216)","v":2000},{"$f":"IF((D201+H201)>100,D201*100/(D201+H201),D201)","v":49.708987121694918},{"$f":"D199*AVERAGEIF(E205:E216,\">0\")/100","v":44.691599558790557},{"$f":"D199*(100-AVERAGEIF(E205:E216,\">0\"))/100","v":5.0173875629043616},{"$f":"100-(E199+F199+H199)","v":39.342901210959667},{"$f":"IF((D201+H201)>100,H201*100/(D201+H201),H201)","v":10.948111667345415},{"$f":"IF((I201+M201)>100,I201*100/(I201+M201),I201)","v":59.635066856189496},{"$f":"I199*AVERAGEIF(J205:J216,\">0\")/100","v":53.555828812902412},{"$f":"I199*(100-AVERAGEIF(J205:J216,\">0\"))/100","v":6.0792380432870843},{"$f":"100-(J199+K199+M199)","v":37.09748728998818},{"$f":"IF((I201+M201)>100,M201*100/(I201+M201),M201)","v":3.267445853822327},{"$f":"IF((N201+R201)>100,N201*100/(N201+R201),N201)","v":68.031931484261349},{"$f":"N199*AVERAGEIF(O205:O216,\">0\")/100","v":62.387720489394439},{"$f":"N199*(100-AVERAGEIF(O205:O216,\">0\"))/100","v":5.6442109948669055},{"$f":"100-(O199+P199+R199)","v":30.994077634582681},{"$f":"IF((N201+R201)>100,R201*100/(N201+R201),R201)","v":0.9739908811559701},{"$f":"IF((S201+W201)>100,S201*100/(S201+W201),S201)","v":80.290412765066776},{"$f":"S199*AVERAGEIF(T205:T216,\">0\")/100","v":75.470340926985287},{"$f":"S199*(100-AVERAGEIF(T205:T216,\">0\"))/100","v":4.820071838081482},{"$f":"100-(T199+U199+W199)","v":19.092220471943307},{"$f":"IF((S201+W201)>100,W201*100/(S201+W201),W201)","v":0.61736676298992155},{"$f":"IF((X201+AB201)>100,X201*100/(X201+AB201),X201)","v":94.601500222323011},{"$f":"X199*AVERAGEIF(Y205:Y216,\">0\")/100","v":92.185702894996908},{"$f":"X199*(100-AVERAGEIF(Y205:Y216,\">0\"))/100","v":2.415797327326108},{"$f":"100-(Y199+Z199+AB199)","v":5.3059518998304753},{"$f":"IF((X201+AB201)>100,AB201*100/(X201+AB201),AB201)","v":9.254787784651608E-2}]
[null,null,{"$f":"MaxTarget(C205:C216)","v":2017},{"$f":"IF((D202+H202)>100,D202*100/(D202+H202),D202)","v":71.73903439633068},{"$f":"D200*AVERAGEIF(E205:E216,\">0\")/100","v":64.498039159921504},{"$f":"D200*(100-AVERAGEIF(E205:E216,\">0\"))/100","v":7.2409952364091712},{"$f":"100-(E200+F200+H200)","v":21.91716845543192},{"$f":"IF((D202+H202)>100,H202*100/(D202+H202),H202)","v":6.3437971482373996},{"$f":"IF((I202+M202)>100,I202*100/(I202+M202),I202)","v":80.499643716710125},{"$f":"I200*AVERAGEIF(J205:J216,\">0\")/100","v":72.293456948548766},{"$f":"I200*(100-AVERAGEIF(J205:J216,\">0\"))/100","v":8.2061867681613609},{"$f":"100-(J200+K200+M200)","v":16.28129455847801},{"$f":"IF((I202+M202)>100,M202*100/(I202+M202),M202)","v":3.2190617248118585},{"$f":"IF((N202+R202)>100,N202*100/(N202+R202),N202)","v":86.753970457001742},{"$f":"N200*AVERAGEIF(O205:O216,\">0\")/100","v":79.556501515302713},{"$f":"N200*(100-AVERAGEIF(O205:O216,\">0\"))/100","v":7.1974689416990358},{"$f":"100-(O200+P200+R200)","v":11.931754436131683},{"$f":"IF((N202+R202)>100,R202*100/(N202+R202),R202)","v":1.3142751068665675},{"$f":"IF((S202+W202)>100,S202*100/(S202+W202),S202)","v":94.663042233011765},{"$f":"S200*AVERAGEIF(T205:T216,\">0\")/100","v":88.980138779649764},{"$f":"S200*(100-AVERAGEIF(T205:T216,\">0\"))/100","v":5.6829034533619947},{"$f":"100-(T200+U200+W200)","v":4.6977938280555094},{"$f":"IF((S202+W202)>100,W202*100/(S202+W202),W202)","v":0.63916393893272483},{"$f":"IF((X202+AB202)>100,X202*100/(X202+AB202),X202)","v":97.989787238288272},{"$f":"X200*AVERAGEIF(Y205:Y216,\">0\")/100","v":95.487464700493547},{"$f":"X200*(100-AVERAGEIF(Y205:Y216,\">0\"))/100","v":2.5023225377947167},{"$f":"100-(Y200+Z200+AB200)","v":1.9435618840731763},{"$f":"IF((X202+AB202)>100,AB202*100/(X202+AB202),AB202)","v":6.6650877638561923E-2}]
["Regression period:",null,{"$f":"MinRegYear(C199,C205:C216)","v":2000},{"$f":"IF(MAX(C205:C216)-MIN(C205:C216)<5,AVERAGEIF(C205:C216,\">0\",D205:D216),\nIF(FORECAST($C201,D$205:D$216,$C$205:$C$216)<0,0,\nIF(FORECAST($C201,D$205:D$216,$C$205:$C$216)>100,100,\nFORECAST($C201,D$205:D$216,$C$205:$C$216))))","v":49.708987121694918},null,null,null,{"$f":"IF(MAX(C205:C216)-MIN(C205:C216)<5,AVERAGEIF(C205:C216,\">0\",H205:H216),\nIF(FORECAST($C201,H$205:H$216,$C$205:$C$216)<0,0,\nIF(FORECAST($C201,H$205:H$216,$C$205:$C$216)>100,100,\nFORECAST($C201,H$205:H$216,$C$205:$C$216))))","v":10.948111667345415},{"$f":"IF(MAX(C205:C216)-MIN(C205:C216)<5,AVERAGEIF(C205:C216,\">0\",I205:I216),\nIF(FORECAST($C201,I$205:I$216,$C$205:$C$216)<0,0,\nIF(FORECAST($C201,I$205:I$216,$C$205:$C$216)>100,100,\nFORECAST($C201,I$205:I$216,$C$205:$C$216))))","v":59.635066856189496},null,null,null,{"$f":"IF(MAX(C205:C216)-MIN(C205:C216)<5,AVERAGEIF(C205:C216,\">0\",M205:M216),\nIF(FORECAST($C201,M$205:M$216,$C$205:$C$216)<0,0,\nIF(FORECAST($C201,M$205:M$216,$C$205:$C$216)>100,100,\nFORECAST($C201,M$205:M$216,$C$205:$C$216))))","v":3.267445853822327},{"$f":"IF(MAX(C205:C216)-MIN(C205:C216)<5,AVERAGEIF(C205:C216,\">0\",N205:N216),\nIF(FORECAST($C201,N$205:N$216,$C$205:$C$216)<0,0,\nIF(FORECAST($C201,N$205:N$216,$C$205:$C$216)>100,100,\nFORECAST($C201,N$205:N$216,$C$205:$C$216))))","v":68.031931484261349},null,null,null,{"$f":"IF(MAX(C205:C216)-MIN(C205:C216)<5,AVERAGEIF(C205:C216,\">0\",R205:R216),\nIF(FORECAST($C201,R$205:R$216,$C$205:$C$216)<0,0,\nIF(FORECAST($C201,R$205:R$216,$C$205:$C$216)>100,100,\nFORECAST($C201,R$205:R$216,$C$205:$C$216))))","v":0.9739908811559701},{"$f":"IF(MAX(C205:C216)-MIN(C205:C216)<5,AVERAGEIF(C205:C216,\">0\",S205:S216),\nIF(FORECAST($C201,S$205:S$216,$C$205:$C$216)<0,0,\nIF(FORECAST($C201,S$205:S$216,$C$205:$C$216)>100,100,\nFORECAST($C201,S$205:S$216,$C$205:$C$216))))","v":80.290412765066776},null,null,null,{"$f":"IF(MAX(C205:C216)-MIN(C205:C216)<5,AVERAGEIF(C205:C216,\">0\",W205:W216),\nIF(FORECAST($C201,W$205:W$216,$C$205:$C$216)<0,0,\nIF(FORECAST($C201,W$205:W$216,$C$205:$C$216)>100,100,\nFORECAST($C201,W$205:W$216,$C$205:$C$216))))","v":0.61736676298992155},{"$f":"IF(MAX(C205:C216)-MIN(C205:C216)<5,AVERAGEIF(C205:C216,\">0\",X205:X216),\nIF(FORECAST($C201,X$205:X$216,$C$205:$C$216)<0,0,\nIF(FORECAST($C201,X$205:X$216,$C$205:$C$216)>100,100,\nFORECAST($C201,X$205:X$216,$C$205:$C$216))))","v":94.601500222323011},null,null,null,{"$f":"IF(MAX(C205:C216)-MIN(C205:C216)<5,AVERAGEIF(C205:C216,\">0\",AB205:AB216),\nIF(FORECAST($C201,AB$205:AB$216,$C$205:$C$216)<0,0,\nIF(FORECAST($C201,AB$205:AB$216,$C$205:$C$216)>100,100,\nFORECAST($C201,AB$205:AB$216,$C$205:$C$216))))","v":9.254787784651608E-2}]
[null,null,{"$f":"MaxRegYear(C200,C205:C216)","v":2013},{"$f":"IF(MAX(C205:C216)-MIN(C205:C216)<5,AVERAGEIF(C205:C216,\">0\",D205:D216),\nIF(FORECAST($C202,D$205:D$216,$C$205:$C$216)<0,0,\nIF(FORECAST($C202,D$205:D$216,$C$205:$C$216)>100,100,\nFORECAST($C202,D$205:D$216,$C$205:$C$216))))","v":71.73903439633068},null,null,null,{"$f":"IF(MAX(C205:C216)-MIN(C205:C216)<5,AVERAGEIF(C205:C216,\">0\",H205:H216),\nIF(FORECAST($C202,H$205:H$216,$C$205:$C$216)<0,0,\nIF(FORECAST($C202,H$205:H$216,$C$205:$C$216)>100,100,\nFORECAST($C202,H$205:H$216,$C$205:$C$216))))","v":6.3437971482373996},{"$f":"IF(MAX(C205:C216)-MIN(C205:C216)<5,AVERAGEIF(C205:C216,\">0\",I205:I216),\nIF(FORECAST($C202,I$205:I$216,$C$205:$C$216)<0,0,\nIF(FORECAST($C202,I$205:I$216,$C$205:$C$216)>100,100,\nFORECAST($C202,I$205:I$216,$C$205:$C$216))))","v":80.499643716710125},null,null,null,{"$f":"IF(MAX(C205:C216)-MIN(C205:C216)<5,AVERAGEIF(C205:C216,\">0\",M205:M216),\nIF(FORECAST($C202,M$205:M$216,$C$205:$C$216)<0,0,\nIF(FORECAST($C202,M$205:M$216,$C$205:$C$216)>100,100,\nFORECAST($C202,M$205:M$216,$C$205:$C$216))))","v":3.2190617248118585},{"$f":"IF(MAX(C205:C216)-MIN(C205:C216)<5,AVERAGEIF(C205:C216,\">0\",N205:N216),\nIF(FORECAST($C202,N$205:N$216,$C$205:$C$216)<0,0,\nIF(FORECAST($C202,N$205:N$216,$C$205:$C$216)>100,100,\nFORECAST($C202,N$205:N$216,$C$205:$C$216))))","v":86.753970457001742},null,null,null,{"$f":"IF(MAX(C205:C216)-MIN(C205:C216)<5,AVERAGEIF(C205:C216,\">0\",R205:R216),\nIF(FORECAST($C202,R$205:R$216,$C$205:$C$216)<0,0,\nIF(FORECAST($C202,R$205:R$216,$C$205:$C$216)>100,100,\nFORECAST($C202,R$205:R$216,$C$205:$C$216))))","v":1.3142751068665675},{"$f":"IF(MAX(C205:C216)-MIN(C205:C216)<5,AVERAGEIF(C205:C216,\">0\",S205:S216),\nIF(FORECAST($C202,S$205:S$216,$C$205:$C$216)<0,0,\nIF(FORECAST($C202,S$205:S$216,$C$205:$C$216)>100,100,\nFORECAST($C202,S$205:S$216,$C$205:$C$216))))","v":94.663042233011765},null,null,null,{"$f":"IF(MAX(C205:C216)-MIN(C205:C216)<5,AVERAGEIF(C205:C216,\">0\",W205:W216),\nIF(FORECAST($C202,W$205:W$216,$C$205:$C$216)<0,0,\nIF(FORECAST($C202,W$205:W$216,$C$205:$C$216)>100,100,\nFORECAST($C202,W$205:W$216,$C$205:$C$216))))","v":0.63916393893272483},{"$f":"IF(MAX(C205:C216)-MIN(C205:C216)<5,AVERAGEIF(C205:C216,\">0\",X205:X216),\nIF(FORECAST($C202,X$205:X$216,$C$205:$C$216)<0,0,\nIF(FORECAST($C202,X$205:X$216,$C$205:$C$216)>100,100,\nFORECAST($C202,X$205:X$216,$C$205:$C$216))))","v":97.989787238288272},null,null,null,{"$f":"IF(MAX(C205:C216)-MIN(C205:C216)<5,AVERAGEIF(C205:C216,\">0\",AB205:AB216),\nIF(FORECAST($C202,AB$205:AB$216,$C$205:$C$216)<0,0,\nIF(FORECAST($C202,AB$205:AB$216,$C$205:$C$216)>100,100,\nFORECAST($C202,AB$205:AB$216,$C$205:$C$216))))","v":6.6650877638561923E-2}]
[]
[null,"Survey","Year","Improved","Not shared",null,null,"Open defecation","Improved","Not shared",null,null,"Open defecation","Improved","Not shared",null,null,"Open defecation","Improved","Not shared",null,null,"Open defecation","Improved","Not shared",null,null,"Open defecation"]
[null,"DHS01",2001,{"$f":"IF(ISERROR(INDIRECT(CONCATENATE($B205,\"!H122\"))),\"\",INDIRECT(CONCATENATE($B205,\"!H122\")))","v":51.403606142821019},{"$f":"IF(ISERROR(INDIRECT(CONCATENATE($B205,\"!H129\"))),\"\",INDIRECT(CONCATENATE($B205,\"!H129\")))","v":89.906477976264014},null,null,{"$f":"IF(ISERROR(INDIRECT(CONCATENATE($B205,\"!H127\"))),\"\",INDIRECT(CONCATENATE($B205,\"!H127\")))","v":10.593933627414049},{"$f":"IF(ISERROR(INDIRECT(CONCATENATE($B205,\"!I122\"))),\"\",INDIRECT(CONCATENATE($B205,\"!I122\")))","v":61.240034306998787},{"$f":"IF(ISERROR(INDIRECT(CONCATENATE($B205,\"!I129\"))),\"\",INDIRECT(CONCATENATE($B205,\"!I129\")))","v":89.805934052279639},null,null,{"$f":"IF(ISERROR(INDIRECT(CONCATENATE($B205,\"!I127\"))),\"\",INDIRECT(CONCATENATE($B205,\"!I127\")))","v":3.2637239977445986},{"$f":"IF(ISERROR(INDIRECT(CONCATENATE($B205,\"!J122\"))),\"\",INDIRECT(CONCATENATE($B205,\"!J122\")))","v":69.472088328318549},{"$f":"IF(ISERROR(INDIRECT(CONCATENATE($B205,\"!J129\"))),\"\",INDIRECT(CONCATENATE($B205,\"!J129\")))","v":91.703585549129016},null,null,{"$f":"IF(ISERROR(INDIRECT(CONCATENATE($B205,\"!J127\"))),\"\",INDIRECT(CONCATENATE($B205,\"!J127\")))","v":1.000166590826016},{"$f":"IF(ISERROR(INDIRECT(CONCATENATE($B205,\"!K122\"))),\"\",INDIRECT(CONCATENATE($B205,\"!K122\")))","v":81.395999647216485},{"$f":"IF(ISERROR(INDIRECT(CONCATENATE($B205,\"!K129\"))),\"\",INDIRECT(CONCATENATE($B205,\"!K129\")))","v":93.996703127949758},null,null,{"$f":"IF(ISERROR(INDIRECT(CONCATENATE($B205,\"!K127\"))),\"\",INDIRECT(CONCATENATE($B205,\"!K127\")))","v":0.61904346883167571},{"$f":"IF(ISERROR(INDIRECT(CONCATENATE($B205,\"!L122\"))),\"\",INDIRECT(CONCATENATE($B205,\"!L122\")))","v":94.862137685089507},{"$f":"IF(ISERROR(INDIRECT(CONCATENATE($B205,\"!L129\"))),\"\",INDIRECT(CONCATENATE($B205,\"!L129\")))","v":97.446343534036203},null,null,{"$f":"IF(ISERROR(INDIRECT(CONCATENATE($B205,\"!L2127\"))),\"\",INDIRECT(CONCATENATE($B205,\"!L127\")))","v":9.0555800907442821E-2}]
[null,"ENDESA11",2011,68.349796354079075,"N/A",null,null,7.0521532281001829,77.289708815091501,"N/A",null,null,3.2265054369673147,83.873656768888225,"N/A",null,null,1.2619236875264772,92.451868468712519,"N/A",null,null,0.63581052724921672,97.468512312755095,"N/A",null,null,7.0635031516709176E-2]
[null,null,null,"","",null,null,"","","",null,null,"","","",null,null,"","","",null,null,"","","",null,null,""]
[null,null,null,"","",null,null,"","","",null,null,"","","",null,null,"","","",null,null,"","","",null,null,""]
[null,null,null,"","",null,null,"","","",null,null,"","","",null,null,"","","",null,null,"","","",null,null,""]
[null,null,null,"","",null,null,"","","",null,null,"","","",null,null,"","","",null,null,"","","",null,null,""]
[null,null,null,"","",null,null,"","","",null,null,"","","",null,null,"","","",null,null,"","","",null,null,""]
[null,null,null,"","",null,null,"","","",null,null,"","","",null,null,"","","",null,null,"","","",null,null,""]
[null,null,null,"","",null,null,"","","",null,null,"","","",null,null,"","","",null,null,"","","",null,null,""]
[null,null,null,"","",null,null,"","","",null,null,"","","",null,null,"","","",null,null,"","","",null,null,""]
[null,null,null,"","",null,null,"","","",null,null,"","","",null,null,"","","",null,null,"","","",null,null,""]
[null,null,null,"","",null,null,"","","",null,null,"","","",null,null,"","","",null,null,"","","",null,null,""]
[]
[null,{"$f":"CONCATENATE(\"Urban use of sanitation facilities, \",C199,\"–\",C200)","v":"Urban use of sanitation facilities, 2000–2017"},null,null,null,null,null,null,null,null,null,null,null,null,null,null,null,null,"Data points used for regression"]
[]
[]
[]
[]
[]
[]
[]
[]
[]
[]
[]
[]
[]
[]
[]
[]
[]
[]
[]
[]
[]
[]
[]
[]
[]
[]
[]
[]
[]
[]
[]
[]
[]
[]
[]
[]
[]
[]
[]
[]
[]
[]
[]
[]
[]
[]
[]
[]
[]
[]
[]
[]
[]
[]
[]
[]
[]
[]
[]
[]
[]
[]
[]
[]
[]
[]
[]
[]
[]
[]
[]
[]
[]
[]
[]
[]
[]
[]
["RURAL",null,null,"Poorest",null,null,null,null,"Poor",null,null,null,null,"Middle",null,null,null,null,"Rich",null,null,null,null,"Richest"]
[null,null,null,"Improved","Basic","Limited","Unimproved","Open defecation","Improved","Basic","Limited","Unimproved","Open defecation","Improved","Basic","Limited","Unimproved","Open defecation","Improved","Basic","Limited","Unimproved","Open defecation","Improved","Basic","Limited","Unimproved","Open defecation"]
["Forecast period:",null,{"$f":"MinBase(C305:C316)","v":2000},{"$f":"IF((D301+H301)>100,D301*100/(D301+H301),D301)","v":19.926467046893322},{"$f":"D299*AVERAGEIF(E305:E316,\">0\")/100","v":18.839391963404776},{"$f":"D299*(100-AVERAGEIF(E305:E316,\">0\"))/100","v":1.0870750834885465},{"$f":"100-(E299+F299+H299)","v":14.874135783730253},{"$f":"IF((D301+H301)>100,H301*100/(D301+H301),H301)","v":65.199397169376425},{"$f":"IF((I301+M301)>100,I301*100/(I301+M301),I301)","v":30.140187115970548},{"$f":"I299*AVERAGEIF(J305:J316,\">0\")/100","v":28.497220673912615},{"$f":"I299*(100-AVERAGEIF(J305:J316,\">0\"))/100","v":1.6429664420579337},{"$f":"100-(J299+K299+M299)","v":20.474724944828267},{"$f":"IF((I301+M301)>100,M301*100/(I301+M301),M301)","v":49.385087939201185},{"$f":"IF((N301+R301)>100,N301*100/(N301+R301),N301)","v":44.037034334992768},{"$f":"N299*AVERAGEIF(O305:O316,\">0\")/100","v":41.68156035118502},{"$f":"N299*(100-AVERAGEIF(O305:O316,\">0\"))/100","v":2.3554739838077507},{"$f":"100-(O299+P299+R299)","v":29.559980958057849},{"$f":"IF((N301+R301)>100,R301*100/(N301+R301),R301)","v":26.402984706949383},{"$f":"IF((S301+W301)>100,S301*100/(S301+W301),S301)","v":50.68906933546964},{"$f":"S299*AVERAGEIF(T305:T316,\">0\")/100","v":45.705109386788237},{"$f":"S299*(100-AVERAGEIF(T305:T316,\">0\"))/100","v":4.9839599486814024},{"$f":"100-(T299+U299+W299)","v":32.26214379101998},{"$f":"IF((S301+W301)>100,W301*100/(S301+W301),W301)","v":17.04878687351038},{"$f":"IF((X301+AB301)>100,X301*100/(X301+AB301),X301)","v":58.887830081040647},{"$f":"X299*AVERAGEIF(Y305:Y316,\">0\")/100","v":52.415638560529267},{"$f":"X299*(100-AVERAGEIF(Y305:Y316,\">0\"))/100","v":6.4721915205113785},{"$f":"100-(Y299+Z299+AB299)","v":35.253797927722815},{"$f":"IF((X301+AB301)>100,AB301*100/(X301+AB301),AB301)","v":5.8583719912365382}]
[null,null,{"$f":"MaxTarget(C305:C316)","v":2017},{"$f":"IF((D302+H302)>100,D302*100/(D302+H302),D302)","v":38.112409879055122},{"$f":"D300*AVERAGEIF(E305:E316,\">0\")/100","v":36.033212846599589},{"$f":"D300*(100-AVERAGEIF(E305:E316,\">0\"))/100","v":2.0791970324555327},{"$f":"100-(E300+F300+H300)","v":18.136269186606114},{"$f":"IF((D302+H302)>100,H302*100/(D302+H302),H302)","v":43.751320934338764},{"$f":"IF((I302+M302)>100,I302*100/(I302+M302),I302)","v":55.475145242030067},{"$f":"I300*AVERAGEIF(J305:J316,\">0\")/100","v":52.451149350755379},{"$f":"I300*(100-AVERAGEIF(J305:J316,\">0\"))/100","v":3.0239958912746885},{"$f":"100-(J300+K300+M300)","v":26.766784083575203},{"$f":"IF((I302+M302)>100,M302*100/(I302+M302),M302)","v":17.75807067439473},{"$f":"IF((N302+R302)>100,N302*100/(N302+R302),N302)","v":58.576758563072417},{"$f":"N300*AVERAGEIF(O305:O316,\">0\")/100","v":55.443576846031448},{"$f":"N300*(100-AVERAGEIF(O305:O316,\">0\"))/100","v":3.1331817170409746},{"$f":"100-(O300+P300+R300)","v":27.705477891215878},{"$f":"IF((N302+R302)>100,R302*100/(N302+R302),R302)","v":13.717763545711705},{"$f":"IF((S302+W302)>100,S302*100/(S302+W302),S302)","v":62.773715405684698},{"$f":"S300*AVERAGEIF(T305:T316,\">0\")/100","v":56.60154283448832},{"$f":"S300*(100-AVERAGEIF(T305:T316,\">0\"))/100","v":6.1721725711963806},{"$f":"100-(T300+U300+W300)","v":29.362115047455518},{"$f":"IF((S302+W302)>100,W302*100/(S302+W302),W302)","v":7.8641695468597845},{"$f":"IF((X302+AB302)>100,X302*100/(X302+AB302),X302)","v":70.450654737933291},{"$f":"X300*AVERAGEIF(Y305:Y316,\">0\")/100","v":62.707626516621239},{"$f":"X300*(100-AVERAGEIF(Y305:Y316,\">0\"))/100","v":7.7430282213120538},{"$f":"100-(Y300+Z300+AB300)","v":25.229471297626503},{"$f":"IF((X302+AB302)>100,AB302*100/(X302+AB302),AB302)","v":4.3198739644402053}]
["Regression period:",null,{"$f":"MinRegYear(C299,C305:C316)","v":2000},{"$f":"IF(MAX(C305:C316)-MIN(C305:C316)<5,AVERAGEIF(C305:C316,\">0\",D305:D316),\nIF(FORECAST($C301,D$305:D$316,$C$305:$C$316)<0,0,\nIF(FORECAST($C301,D$305:D$316,$C$305:$C$316)>100,100,\nFORECAST($C301,D$305:D$316,$C$305:$C$316))))","v":19.926467046893322},null,null,null,{"$f":"IF(MAX(C305:C316)-MIN(C305:C316)<5,AVERAGEIF(C305:C316,\">0\",H305:H316),\nIF(FORECAST($C301,H$305:H$316,$C$305:$C$316)<0,0,\nIF(FORECAST($C301,H$305:H$316,$C$305:$C$316)>100,100,\nFORECAST($C301,H$305:H$316,$C$305:$C$316))))","v":65.199397169376425},{"$f":"IF(MAX(C305:C316)-MIN(C305:C316)<5,AVERAGEIF(C305:C316,\">0\",I305:I316),\nIF(FORECAST($C301,I$305:I$316,$C$305:$C$316)<0,0,\nIF(FORECAST($C301,I$305:I$316,$C$305:$C$316)>100,100,\nFORECAST($C301,I$305:I$316,$C$305:$C$316))))","v":30.140187115970548},null,null,null,{"$f":"IF(MAX(C305:C316)-MIN(C305:C316)<5,AVERAGEIF(C305:C316,\">0\",M305:M316),\nIF(FORECAST($C301,M$305:M$316,$C$305:$C$316)<0,0,\nIF(FORECAST($C301,M$305:M$316,$C$305:$C$316)>100,100,\nFORECAST($C301,M$305:M$316,$C$305:$C$316))))","v":49.385087939201185},{"$f":"IF(MAX(C305:C316)-MIN(C305:C316)<5,AVERAGEIF(C305:C316,\">0\",N305:N316),\nIF(FORECAST($C301,N$305:N$316,$C$305:$C$316)<0,0,\nIF(FORECAST($C301,N$305:N$316,$C$305:$C$316)>100,100,\nFORECAST($C301,N$305:N$316,$C$305:$C$316))))","v":44.037034334992768},null,null,null,{"$f":"IF(MAX(C305:C316)-MIN(C305:C316)<5,AVERAGEIF(C305:C316,\">0\",R305:R316),\nIF(FORECAST($C301,R$305:R$316,$C$305:$C$316)<0,0,\nIF(FORECAST($C301,R$305:R$316,$C$305:$C$316)>100,100,\nFORECAST($C301,R$305:R$316,$C$305:$C$316))))","v":26.402984706949383},{"$f":"IF(MAX(C305:C316)-MIN(C305:C316)<5,AVERAGEIF(C305:C316,\">0\",S305:S316),\nIF(FORECAST($C301,S$305:S$316,$C$305:$C$316)<0,0,\nIF(FORECAST($C301,S$305:S$316,$C$305:$C$316)>100,100,\nFORECAST($C301,S$305:S$316,$C$305:$C$316))))","v":50.68906933546964},null,null,null,{"$f":"IF(MAX(C305:C316)-MIN(C305:C316)<5,AVERAGEIF(C305:C316,\">0\",W305:W316),\nIF(FORECAST($C301,W$305:W$316,$C$305:$C$316)<0,0,\nIF(FORECAST($C301,W$305:W$316,$C$305:$C$316)>100,100,\nFORECAST($C301,W$305:W$316,$C$305:$C$316))))","v":17.04878687351038},{"$f":"IF(MAX(C305:C316)-MIN(C305:C316)<5,AVERAGEIF(C305:C316,\">0\",X305:X316),\nIF(FORECAST($C301,X$305:X$316,$C$305:$C$316)<0,0,\nIF(FORECAST($C301,X$305:X$316,$C$305:$C$316)>100,100,\nFORECAST($C301,X$305:X$316,$C$305:$C$316))))","v":58.887830081040647},null,null,null,{"$f":"IF(MAX(C305:C316)-MIN(C305:C316)<5,AVERAGEIF(C305:C316,\">0\",AB305:AB316),\nIF(FORECAST($C301,AB$305:AB$316,$C$305:$C$316)<0,0,\nIF(FORECAST($C301,AB$305:AB$316,$C$305:$C$316)>100,100,\nFORECAST($C301,AB$305:AB$316,$C$305:$C$316))))","v":5.8583719912365382}]
[null,null,{"$f":"MaxRegYear(C300,C305:C316)","v":2013},{"$f":"IF(MAX(C305:C316)-MIN(C305:C316)<5,AVERAGEIF(C305:C316,\">0\",D305:D316),\nIF(FORECAST($C302,D$305:D$316,$C$305:$C$316)<0,0,\nIF(FORECAST($C302,D$305:D$316,$C$305:$C$316)>100,100,\nFORECAST($C302,D$305:D$316,$C$305:$C$316))))","v":38.112409879055122},null,null,null,{"$f":"IF(MAX(C305:C316)-MIN(C305:C316)<5,AVERAGEIF(C305:C316,\">0\",H305:H316),\nIF(FORECAST($C302,H$305:H$316,$C$305:$C$316)<0,0,\nIF(FORECAST($C302,H$305:H$316,$C$305:$C$316)>100,100,\nFORECAST($C302,H$305:H$316,$C$305:$C$316))))","v":43.751320934338764},{"$f":"IF(MAX(C305:C316)-MIN(C305:C316)<5,AVERAGEIF(C305:C316,\">0\",I305:I316),\nIF(FORECAST($C302,I$305:I$316,$C$305:$C$316)<0,0,\nIF(FORECAST($C302,I$305:I$316,$C$305:$C$316)>100,100,\nFORECAST($C302,I$305:I$316,$C$305:$C$316))))","v":55.475145242030067},null,null,null,{"$f":"IF(MAX(C305:C316)-MIN(C305:C316)<5,AVERAGEIF(C305:C316,\">0\",M305:M316),\nIF(FORECAST($C302,M$305:M$316,$C$305:$C$316)<0,0,\nIF(FORECAST($C302,M$305:M$316,$C$305:$C$316)>100,100,\nFORECAST($C302,M$305:M$316,$C$305:$C$316))))","v":17.75807067439473},{"$f":"IF(MAX(C305:C316)-MIN(C305:C316)<5,AVERAGEIF(C305:C316,\">0\",N305:N316),\nIF(FORECAST($C302,N$305:N$316,$C$305:$C$316)<0,0,\nIF(FORECAST($C302,N$305:N$316,$C$305:$C$316)>100,100,\nFORECAST($C302,N$305:N$316,$C$305:$C$316))))","v":58.576758563072417},null,null,null,{"$f":"IF(MAX(C305:C316)-MIN(C305:C316)<5,AVERAGEIF(C305:C316,\">0\",R305:R316),\nIF(FORECAST($C302,R$305:R$316,$C$305:$C$316)<0,0,\nIF(FORECAST($C302,R$305:R$316,$C$305:$C$316)>100,100,\nFORECAST($C302,R$305:R$316,$C$305:$C$316))))","v":13.717763545711705},{"$f":"IF(MAX(C305:C316)-MIN(C305:C316)<5,AVERAGEIF(C305:C316,\">0\",S305:S316),\nIF(FORECAST($C302,S$305:S$316,$C$305:$C$316)<0,0,\nIF(FORECAST($C302,S$305:S$316,$C$305:$C$316)>100,100,\nFORECAST($C302,S$305:S$316,$C$305:$C$316))))","v":62.773715405684698},null,null,null,{"$f":"IF(MAX(C305:C316)-MIN(C305:C316)<5,AVERAGEIF(C305:C316,\">0\",W305:W316),\nIF(FORECAST($C302,W$305:W$316,$C$305:$C$316)<0,0,\nIF(FORECAST($C302,W$305:W$316,$C$305:$C$316)>100,100,\nFORECAST($C302,W$305:W$316,$C$305:$C$316))))","v":7.8641695468597845},{"$f":"IF(MAX(C305:C316)-MIN(C305:C316)<5,AVERAGEIF(C305:C316,\">0\",X305:X316),\nIF(FORECAST($C302,X$305:X$316,$C$305:$C$316)<0,0,\nIF(FORECAST($C302,X$305:X$316,$C$305:$C$316)>100,100,\nFORECAST($C302,X$305:X$316,$C$305:$C$316))))","v":70.450654737933291},null,null,null,{"$f":"IF(MAX(C305:C316)-MIN(C305:C316)<5,AVERAGEIF(C305:C316,\">0\",AB305:AB316),\nIF(FORECAST($C302,AB$305:AB$316,$C$305:$C$316)<0,0,\nIF(FORECAST($C302,AB$305:AB$316,$C$305:$C$316)>100,100,\nFORECAST($C302,AB$305:AB$316,$C$305:$C$316))))","v":4.3198739644402053}]
[]
[null,"Survey","Year","Improved","Not shared",null,null,"Open defecation","Improved","Not shared",null,null,"Open defecation","Improved","Not shared",null,null,"Open defecation","Improved","Not shared",null,null,"Open defecation","Improved","Not shared",null,null,"Open defecation"]
[null,"DHS01",2001,{"$f":"IF(ISERROR(INDIRECT(CONCATENATE($B305,\"!M122\"))),\"\",INDIRECT(CONCATENATE($B305,\"!M122\")))","v":21.325385726290499},{"$f":"IF(ISERROR(INDIRECT(CONCATENATE($B305,\"!M129\"))),\"\",INDIRECT(CONCATENATE($B305,\"!M129\")))","v":94.544566877157337},null,null,{"$f":"IF(ISERROR(INDIRECT(CONCATENATE($B305,\"!M127\"))),\"\",INDIRECT(CONCATENATE($B305,\"!M127\")))","v":63.54954515129667},{"$f":"IF(ISERROR(INDIRECT(CONCATENATE($B305,\"!N122\"))),\"\",INDIRECT(CONCATENATE($B305,\"!N122\")))","v":32.089030048744135},{"$f":"IF(ISERROR(INDIRECT(CONCATENATE($B305,\"!N129\"))),\"\",INDIRECT(CONCATENATE($B305,\"!N129\")))","v":94.548917577265584},null,null,{"$f":"IF(ISERROR(INDIRECT(CONCATENATE($B305,\"!N127\"))),\"\",INDIRECT(CONCATENATE($B305,\"!N127\")))","v":46.95224045729222},{"$f":"IF(ISERROR(INDIRECT(CONCATENATE($B305,\"!O122\"))),\"\",INDIRECT(CONCATENATE($B305,\"!O122\")))","v":45.155474660229501},{"$f":"IF(ISERROR(INDIRECT(CONCATENATE($B305,\"!O129\"))),\"\",INDIRECT(CONCATENATE($B305,\"!O129\")))","v":94.651152105544853},null,null,{"$f":"IF(ISERROR(INDIRECT(CONCATENATE($B305,\"!O127\"))),\"\",INDIRECT(CONCATENATE($B305,\"!O127\")))","v":25.427198463777092},{"$f":"IF(ISERROR(INDIRECT(CONCATENATE($B305,\"!P122\"))),\"\",INDIRECT(CONCATENATE($B305,\"!P122\")))","v":51.618657494716928},{"$f":"IF(ISERROR(INDIRECT(CONCATENATE($B305,\"!P129\"))),\"\",INDIRECT(CONCATENATE($B305,\"!P129\")))","v":90.167584423977814},null,null,{"$f":"IF(ISERROR(INDIRECT(CONCATENATE($B305,\"!P127\"))),\"\",INDIRECT(CONCATENATE($B305,\"!P127\")))","v":16.342277848383329},{"$f":"IF(ISERROR(INDIRECT(CONCATENATE($B305,\"!Q122\"))),\"\",INDIRECT(CONCATENATE($B305,\"!Q122\")))","v":59.777278131570824},{"$f":"IF(ISERROR(INDIRECT(CONCATENATE($B305,\"!Q129\"))),\"\",INDIRECT(CONCATENATE($B305,\"!Q129\")))","v":89.009288486934508},null,null,{"$f":"IF(ISERROR(INDIRECT(CONCATENATE($B305,\"!Q2127\"))),\"\",INDIRECT(CONCATENATE($B305,\"!Q127\")))","v":5.7400259891752761}]
[null,"ENDESA11",2011,35.314572520261194,"N/A",null,null,47.051024970498375,51.57745937648216,"N/A",null,null,22.623765638210482,56.339877912598411,"N/A",null,null,15.669336032055808,60.914539087189993,"N/A",null,null,9.2771875971136293,68.671758636872823,"N/A",null,null,4.5565659685627091]
[null,null,null,"","",null,null,"","","",null,null,"","","",null,null,"","","",null,null,"","","",null,null,""]
[null,null,null,"","",null,null,"","","",null,null,"","","",null,null,"","","",null,null,"","","",null,null,""]
[null,null,null,"","",null,null,"","","",null,null,"","","",null,null,"","","",null,null,"","","",null,null,""]
[null,null,null,"","",null,null,"","","",null,null,"","","",null,null,"","","",null,null,"","","",null,null,""]
[null,null,null,"","",null,null,"","","",null,null,"","","",null,null,"","","",null,null,"","","",null,null,""]
[null,null,null,"","",null,null,"","","",null,null,"","","",null,null,"","","",null,null,"","","",null,null,""]
[null,null,null,"","",null,null,"","","",null,null,"","","",null,null,"","","",null,null,"","","",null,null,""]
[null,null,null,"","",null,null,"","","",null,null,"","","",null,null,"","","",null,null,"","","",null,null,""]
[null,null,null,"","",null,null,"","","",null,null,"","","",null,null,"","","",null,null,"","","",null,null,""]
[null,null,null,"","",null,null,"","","",null,null,"","","",null,null,"","","",null,null,"","","",null,null,""]
[]
[null,{"$f":"CONCATENATE(\"Rural use of sanitation facilities, \",C299,\"–\",C300)","v":"Rural use of sanitation facilities, 2000–2017"},null,null,null,null,null,null,null,null,null,null,null,null,null,null,null,null,"Data points used for regression"]

{"sheet":"Hygiene","index":3,"n_rows":90,"n_cols":25,"rows_kept":90,"cut":false,"hidden":false,"merged":[[39,22,40,22],[39,23,40,23],[39,24,40,24],[31,4,32,5],[39,16,40,16],[39,17,40,17],[39,18,40,18],[39,19,40,19],[39,20,40,20],[39,21,40,21],[36,24,37,24],[39,6,40,7],[39,8,40,8],[39,9,40,9],[39,10,40,10],[39,11,40,11],[39,12,40,12],[39,13,40,13],[39,14,40,14],[39,15,40,15],[36,18,37,18],[36,12,37,12],[36,13,37,13],[36,14,37,14],[36,15,37,15],[36,16,37,16],[36,17,37,17],[36,19,37,19],[36,20,37,20],[36,21,37,21],[36,22,37,22],[36,23,37,23],[33,20,34,20],[33,21,34,21],[33,22,34,22],[33,23,34,23],[33,24,34,24],[33,15,34,15],[33,16,34,16],[33,17,34,17],[33,18,34,18],[36,6,37,7],[36,8,37,8],[36,9,37,9],[36,10,37,10],[36,11,37,11],[33,10,34,10],[33,11,34,11],[33,12,34,12],[33,13,34,13],[33,14,34,14],[6,1,6,7],[3,1,3,24],[4,1,4,24],[33,1,34,3],[31,6,32,9],[31,10,31,12],[31,13,31,15],[6,10,6,15],[6,18,6,23],[33,19,34,19],[31,16,31,18],[31,19,31,21],[31,22,31,24],[33,6,34,7],[33,8,34,8],[33,9,34,9]]}
[]
[]
[]
[null,"Access to hygiene facilities by wealth quintile (%)"]
[null,{"$f":"IF(ISERROR(INDIRECT(CONCATENATE($E$32,\"!A2\"))),\"\",INDIRECT(CONCATENATE($E$32,\"!A2\")))","v":"Nicaragua"}]
[]
[null,{"$f":"CONCATENATE(\"National \",IF(ISERROR(INDIRECT(CONCATENATE($E$32,\"!A2\"))),\"\",INDIRECT(CONCATENATE($E$32,\"!A210\"))))","v":"National Access to hygiene facilities "},null,null,null,null,null,null,null,null,{"$f":"CONCATENATE(\"Urban \",IF(ISERROR(INDIRECT(CONCATENATE($E$32,\"!A2\"))),\"\",INDIRECT(CONCATENATE($E$32,\"!A210\"))))","v":"Urban Access to hygiene facilities "},null,null,null,null,null,null,null,{"$f":"CONCATENATE(\"Rural \",IF(ISERROR(INDIRECT(CONCATENATE($E$32,\"!A2\"))),\"\",INDIRECT(CONCATENATE($E$32,\"!A210\"))))","v":"Rural Access to hygiene facilities "}]
[]
[]
[]
[]
[]
[]
[]
[]
[]
[]
[]
[]
[]
[]
[]
[]
[]
[]
[]
[]
[]
[]
[]
[]
[null,null,null,null,{"$f":"INDEX(B88:B100,A88)","v":"ENDESA11"},null,{"$f":"IF(ISERROR(INDIRECT(CONCATENATE($E$32,\"!A2\"))),\"\",INDIRECT(CONCATENATE($E$32,\"!A2\")))","v":"Nicaragua"},null,null,null,"Poorest",null,null,"Poor",null,null,"Middle",null,null,"Rich",null,null,"Richest"]
[null,null,null,null,null,null,null,null,null,null,"Basic","Limited","No facility","Basic","Limited","No facility","Basic","Limited","No facility","Basic","Limited","No facility","Basic","Limited","No facility"]
[null,">>>  Select Survey :   ",null,null,null,null,"NATIONAL",null,null,{"$f":"IF(ISERROR(INDIRECT(CONCATENATE(#REF!,\"!A2\"))),\"\",INDIRECT(CONCATENATE(#REF!,\"!A210\")))","v":""},{"$f":"IF(ISERROR(INDIRECT(CONCATENATE($E$32,\"!C222\"))),\"\",INDIRECT(CONCATENATE($E$32,\"!C222\")))","v":"N/A"},{"$f":"IF(ISERROR(INDIRECT(CONCATENATE($E$32,\"!C223\"))),\"\",INDIRECT(CONCATENATE($E$32,\"!C223\")))","v":"N/A"},{"$f":"IF(ISERROR(INDIRECT(CONCATENATE($E$32,\"!C224\"))),\"\",INDIRECT(CONCATENATE($E$32,\"!C224\")))","v":"N/A"},{"$f":"IF(ISERROR(INDIRECT(CONCATENATE($E$32,\"!D222\"))),\"\",INDIRECT(CONCATENATE($E$32,\"!D222\")))","v":"N/A"},{"$f":"IF(ISERROR(INDIRECT(CONCATENATE($E$32,\"!D223\"))),\"\",INDIRECT(CONCATENATE($E$32,\"!D223\")))","v":"N/A"},{"$f":"IF(ISERROR(INDIRECT(CONCATENATE($E$32,\"!D224\"))),\"\",INDIRECT(CONCATENATE($E$32,\"!D224\")))","v":"N/A"},{"$f":"IF(ISERROR(INDIRECT(CONCATENATE($E$32,\"!E222\"))),\"\",INDIRECT(CONCATENATE($E$32,\"!E222\")))","v":"N/A"},{"$f":"IF(ISERROR(INDIRECT(CONCATENATE($E$32,\"!E223\"))),\"\",INDIRECT(CONCATENATE($E$32,\"!E223\")))","v":"N/A"},{"$f":"IF(ISERROR(INDIRECT(CONCATENATE($E$32,\"!E224\"))),\"\",INDIRECT(CONCATENATE($E$32,\"!E224\")))","v":"N/A"},{"$f":"IF(ISERROR(INDIRECT(CONCATENATE($E$32,\"!F222\"))),\"\",INDIRECT(CONCATENATE($E$32,\"!F222\")))","v":"N/A"},{"$f":"IF(ISERROR(INDIRECT(CONCATENATE($E$32,\"!F223\"))),\"\",INDIRECT(CONCATENATE($E$32,\"!F223\")))","v":"N/A"},{"$f":"IF(ISERROR(INDIRECT(CONCATENATE($E$32,\"!F224\"))),\"\",INDIRECT(CONCATENATE($E$32,\"!F224\")))","v":"N/A"},{"$f":"IF(ISERROR(INDIRECT(CONCATENATE($E$32,\"!G222\"))),\"\",INDIRECT(CONCATENATE($E$32,\"!G222\")))","v":"N/A"},{"$f":"IF(ISERROR(INDIRECT(CONCATENATE($E$32,\"!G223\"))),\"\",INDIRECT(CONCATENATE($E$32,\"!G223\")))","v":"N/A"},{"$f":"IF(ISERROR(INDIRECT(CONCATENATE($E$32,\"!G224\"))),\"\",INDIRECT(CONCATENATE($E$32,\"!G224\")))","v":"N/A"}]
[]
[]
[null,null,null,null,null,null,"URBAN",null,null,{"$f":"IF(ISERROR(INDIRECT(CONCATENATE(#REF!,\"!A2\"))),\"\",INDIRECT(CONCATENATE(#REF!,\"!A210\")))","v":""},{"$f":"IF(ISERROR(INDIRECT(CONCATENATE($E$32,\"!H222\"))),\"\",INDIRECT(CONCATENATE($E$32,\"!H222\")))","v":"N/A"},{"$f":"IF(ISERROR(INDIRECT(CONCATENATE($E$32,\"!H223\"))),\"\",INDIRECT(CONCATENATE($E$32,\"!H223\")))","v":"N/A"},{"$f":"IF(ISERROR(INDIRECT(CONCATENATE($E$32,\"!H224\"))),\"\",INDIRECT(CONCATENATE($E$32,\"!H224\")))","v":"N/A"},{"$f":"IF(ISERROR(INDIRECT(CONCATENATE($E$32,\"!I222\"))),\"\",INDIRECT(CONCATENATE($E$32,\"!I222\")))","v":"N/A"},{"$f":"IF(ISERROR(INDIRECT(CONCATENATE($E$32,\"!I223\"))),\"\",INDIRECT(CONCATENATE($E$32,\"!I223\")))","v":"N/A"},{"$f":"IF(ISERROR(INDIRECT(CONCATENATE($E$32,\"!I224\"))),\"\",INDIRECT(CONCATENATE($E$32,\"!I224\")))","v":"N/A"},{"$f":"IF(ISERROR(INDIRECT(CONCATENATE($E$32,\"!J222\"))),\"\",INDIRECT(CONCATENATE($E$32,\"!J222\")))","v":"N/A"},{"$f":"IF(ISERROR(INDIRECT(CONCATENATE($E$32,\"!J223\"))),\"\",INDIRECT(CONCATENATE($E$32,\"!J223\")))","v":"N/A"},{"$f":"IF(ISERROR(INDIRECT(CONCATENATE($E$32,\"!J224\"))),\"\",INDIRECT(CONCATENATE($E$32,\"!J224\")))","v":"N/A"},{"$f":"IF(ISERROR(INDIRECT(CONCATENATE($E$32,\"!K222\"))),\"\",INDIRECT(CONCATENATE($E$32,\"!K222\")))","v":"N/A"},{"$f":"IF(ISERROR(INDIRECT(CONCATENATE($E$32,\"!K223\"))),\"\",INDIRECT(CONCATENATE($E$32,\"!K223\")))","v":"N/A"},{"$f":"IF(ISERROR(INDIRECT(CONCATENATE($E$32,\"!K224\"))),\"\",INDIRECT(CONCATENATE($E$32,\"!K224\")))","v":"N/A"},{"$f":"IF(ISERROR(INDIRECT(CONCATENATE($E$32,\"!L222\"))),\"\",INDIRECT(CONCATENATE($E$32,\"!L222\")))","v":"N/A"},{"$f":"IF(ISERROR(INDIRECT(CONCATENATE($E$32,\"!L223\"))),\"\",INDIRECT(CONCATENATE($E$32,\"!L223\")))","v":"N/A"},{"$f":"IF(ISERROR(INDIRECT(CONCATENATE($E$32,\"!L224\"))),\"\",INDIRECT(CONCATENATE($E$32,\"!L224\")))","v":"N/A"}]
[]
[]
[null,null,null,null,null,null,"RURAL",null,null,{"$f":"IF(ISERROR(INDIRECT(CONCATENATE(#REF!,\"!A2\"))),\"\",INDIRECT(CONCATENATE(#REF!,\"!A210\")))","v":""},{"$f":"IF(ISERROR(INDIRECT(CONCATENATE($E$32,\"!M222\"))),\"\",INDIRECT(CONCATENATE($E$32,\"!M222\")))","v":"N/A"},{"$f":"IF(ISERROR(INDIRECT(CONCATENATE($E$32,\"!M223\"))),\"\",INDIRECT(CONCATENATE($E$32,\"!M223\")))","v":"N/A"},{"$f":"IF(ISERROR(INDIRECT(CONCATENATE($E$32,\"!M224\"))),\"\",INDIRECT(CONCATENATE($E$32,\"!M224\")))","v":"N/A"},{"$f":"IF(ISERROR(INDIRECT(CONCATENATE($E$32,\"!N222\"))),\"\",INDIRECT(CONCATENATE($E$32,\"!N222\")))","v":"N/A"},{"$f":"IF(ISERROR(INDIRECT(CONCATENATE($E$32,\"!N223\"))),\"\",INDIRECT(CONCATENATE($E$32,\"!N223\")))","v":"N/A"},{"$f":"IF(ISERROR(INDIRECT(CONCATENATE($E$32,\"!N224\"))),\"\",INDIRECT(CONCATENATE($E$32,\"!N224\")))","v":"N/A"},{"$f":"IF(ISERROR(INDIRECT(CONCATENATE($E$32,\"!O222\"))),\"\",INDIRECT(CONCATENATE($E$32,\"!O222\")))","v":"N/A"},{"$f":"IF(ISERROR(INDIRECT(CONCATENATE($E$32,\"!O223\"))),\"\",INDIRECT(CONCATENATE($E$32,\"!O223\")))","v":"N/A"},{"$f":"IF(ISERROR(INDIRECT(CONCATENATE($E$32,\"!O224\"))),\"\",INDIRECT(CONCATENATE($E$32,\"!O224\")))","v":"N/A"},{"$f":"IF(ISERROR(INDIRECT(CONCATENATE($E$32,\"!P222\"))),\"\",INDIRECT(CONCATENATE($E$32,\"!P222\")))","v":"N/A"},{"$f":"IF(ISERROR(INDIRECT(CONCATENATE($E$32,\"!P223\"))),\"\",INDIRECT(CONCATENATE($E$32,\"!P223\")))","v":"N/A"},{"$f":"IF(ISERROR(INDIRECT(CONCATENATE($E$32,\"!P224\"))),\"\",INDIRECT(CONCATENATE($E$32,\"!P224\")))","v":"N/A"},{"$f":"IF(ISERROR(INDIRECT(CONCATENATE($E$32,\"!Q222\"))),\"\",INDIRECT(CONCATENATE($E$32,\"!Q222\")))","v":"N/A"},{"$f":"IF(ISERROR(INDIRECT(CONCATENATE($E$32,\"!Q223\"))),\"\",INDIRECT(CONCATENATE($E$32,\"!Q223\")))","v":"N/A"},{"$f":"IF(ISERROR(INDIRECT(CONCATENATE($E$32,\"!Q224\"))),\"\",INDIRECT(CONCATENATE($E$32,\"!Q224\")))","v":"N/A"}]
[]
[]
[]
[]
[]
[]
[]
[]
[]
[]
[]
[]
[]
[]
[]
[]
[]
[]
[]
[]
[]
[]
[]
[]
[]
[]
[]
[]
[]
[]
[]
[]
[]
[]
[]
[]
[]
[]
[]
[]
[]
[]
[]
[]
[]
[]
[]
[2,"DHS01"]
[null,"ENDESA11"]
[null,"Template"]

{"sheet":"DHS01","index":4,"n_rows":1072,"n_cols":86,"rows_kept":1072,"cut":false,"hidden":false,"merged":[[346,52,347,52],[348,52,349,52],[350,52,351,52],[352,52,353,52],[152,52,162,52],[270,52,272,52],[273,52,275,52],[276,52,283,52],[338,54,338,58],[338,59,338,63],[338,64,338,68],[340,52,341,52],[342,52,343,52],[344,52,345,52],[221,52,223,52],[224,52,225,52],[226,52,229,52],[258,54,258,58],[258,59,258,63],[258,64,258,68],[260,52,262,52],[263,52,266,52],[267,52,269,52],[119,64,119,68],[121,52,122,52],[123,52,126,52],[127,52,128,52],[132,54,132,58],[132,59,132,63],[132,64,132,68],[134,52,138,52],[219,54,219,58],[219,59,219,63],[219,64,219,68],[13,64,13,68],[15,52,16,52],[17,52,20,52],[21,52,22,52],[26,54,26,58],[26,59,26,63],[26,64,26,68],[40,52,41,52],[55,54,55,58],[55,59,55,63],[55,64,55,68],[139,52,142,52],[143,0,146,0],[143,52,146,52],[147,0,149,0],[147,52,149,52],[150,0,151,0],[150,52,151,52],[13,54,13,58],[13,59,13,63],[119,54,119,58],[119,59,119,63],[42,52,43,52],[44,52,45,52],[46,0,48,0],[46,52,48,52],[49,0,51,0],[49,52,51,52],[52,0,54,0],[52,52,54,52],[32,52,33,52],[34,52,35,52],[36,52,37,52],[38,0,39,0],[38,52,39,52],[13,2,13,6],[13,7,13,11],[28,52,29,52],[30,0,31,0],[30,52,31,52],[26,2,26,6],[26,7,26,11],[26,12,26,16],[13,12,13,16],[15,0,16,0],[17,0,20,0],[21,0,22,0],[23,0,25,0],[32,0,33,0],[55,2,55,6],[55,7,55,11],[55,12,55,16],[28,0,29,0],[34,0,35,0],[36,0,37,0],[40,0,41,0],[42,0,43,0],[44,0,45,0],[139,0,142,0],[119,7,119,11],[119,12,119,16],[57,0,67,0],[107,0,107,1],[121,0,122,0],[123,0,126,0],[127,0,128,0],[129,0,131,0],[132,2,132,6],[119,2,119,6],[132,7,132,11],[132,12,132,16],[134,0,138,0],[152,0,161,0],[201,0,203,0],[207,0,207,1],[219,2,219,6],[219,7,219,11],[1024,0,1024,2],[1025,0,1025,1],[1030,0,1032,0],[1033,0,1033,2],[398,2,398,5],[219,12,219,16],[221,0,223,0],[398,7,398,10],[398,12,398,15],[399,2,399,4],[399,7,399,9],[399,12,399,14],[400,2,401,3],[400,7,401,8],[400,12,401,13],[405,2,405,3],[405,7,405,8],[405,12,405,13],[406,2,406,3],[406,7,406,8],[406,12,406,13],[401,1,444,1],[402,2,402,3],[402,7,402,8],[402,12,402,13],[403,2,403,3],[403,7,403,8],[403,12,403,13],[404,2,404,3],[404,7,404,8],[404,12,404,13],[409,2,409,3],[409,7,409,8],[409,12,409,13],[410,2,410,3],[410,7,410,8],[410,12,410,13],[407,2,407,3],[407,7,407,8],[407,12,407,13],[408,2,408,3],[408,7,408,8],[408,12,408,13],[413,2,413,3],[413,7,413,8],[413,12,413,13],[414,2,414,3],[414,7,414,8],[414,12,414,13],[411,2,411,3],[411,7,411,8],[411,12,411,13],[412,2,412,3],[412,7,412,8],[412,12,412,13],[417,2,417,3],[417,7,417,8],[417,12,417,13],[418,2,418,3],[418,7,418,8],[418,12,418,13],[415,2,415,3],[415,7,415,8],[415,12,415,13],[416,2,416,3],[416,7,416,8],[416,12,416,13],[421,2,421,3],[421,7,421,8],[421,12,421,13],[422,2,422,3],[422,7,422,8],[422,12,422,13],[419,2,419,3],[419,7,419,8],[419,12,419,13],[420,2,420,3],[420,7,420,8],[420,12,420,13],[425,2,425,3],[425,7,425,8],[425,12,425,13],[426,2,426,3],[426,7,426,8],[426,12,426,13],[423,2,423,3],[423,7,423,8],[423,12,423,13],[424,2,424,3],[424,7,424,8],[424,12,424,13],[429,2,429,3],[429,7,429,8],[429,12,429,13],[430,2,430,3],[430,7,430,8],[430,12,430,13],[427,2,427,3],[427,7,427,8],[427,12,427,13],[428,2,428,3],[428,7,428,8],[428,12,428,13],[433,2,433,3],[433,7,433,8],[433,12,433,13],[434,2,434,3],[434,7,434,8],[434,12,434,13],[431,2,431,3],[431,7,431,8],[431,12,431,13],[432,2,432,3],[432,7,432,8],[432,12,432,13],[437,2,437,3],[437,7,437,8],[437,12,437,13],[438,2,438,3],[438,7,438,8],[438,12,438,13],[435,2,435,3],[435,7,435,8],[435,12,435,13],[436,2,436,3],[436,7,436,8],[436,12,436,13],[441,2,441,3],[441,7,441,8],[441,12,441,13],[442,2,442,3],[442,7,442,8],[442,12,442,13],[439,2,439,3],[439,7,439,8],[439,12,439,13],[440,2,440,3],[440,7,440,8],[440,12,440,13],[445,2,445,3],[445,7,445,8],[445,12,445,13],[446,2,446,3],[446,7,446,8],[446,12,446,13],[443,2,443,3],[443,7,443,8],[443,12,443,13],[444,2,444,3],[444,7,444,8],[444,12,444,13],[449,2,449,3],[449,7,449,8],[449,12,449,13],[450,2,450,3],[450,7,450,8],[450,12,450,13],[447,2,447,3],[447,7,447,8],[447,12,447,13],[448,2,448,3],[448,7,448,8],[448,12,448,13],[453,2,453,3],[453,7,453,8],[453,12,453,13],[454,2,454,3],[454,7,454,8],[454,12,454,13],[451,2,451,3],[451,7,451,8],[451,12,451,13],[452,2,452,3],[452,7,452,8],[452,12,452,13],[457,2,457,3],[457,7,457,8],[457,12,457,13],[458,2,458,3],[458,7,458,8],[458,12,458,13],[455,2,455,3],[455,7,455,8],[455,12,455,13],[456,2,456,3],[456,7,456,8],[456,12,456,13],[461,2,461,3],[461,7,461,8],[461,12,461,13],[462,2,462,3],[462,7,462,8],[462,12,462,13],[459,2,459,3],[459,7,459,8],[459,12,459,13],[460,2,460,4],[460,7,460,9],[460,12,460,14],[465,2,465,3],[465,7,465,8],[465,12,465,13],[466,2,466,3],[466,7,466,8],[466,12,466,13],[463,2,463,3],[463,7,463,8],[463,12,463,13],[464,2,464,3],[464,7,464,8],[464,12,464,13],[469,2,469,3],[469,7,469,8],[469,12,469,13],[470,2,470,3],[470,7,470,8],[470,12,470,13],[467,2,467,3],[467,7,467,8],[467,12,467,13],[468,2,468,3],[468,7,468,8],[468,12,468,13],[473,2,473,3],[473,7,473,8],[473,12,473,13],[474,2,474,3],[474,7,474,8],[474,12,474,13],[471,2,471,3],[471,7,471,8],[471,12,471,13],[472,2,472,3],[472,7,472,8],[472,12,472,13],[477,2,477,3],[477,7,477,8],[477,12,477,13],[478,2,478,3],[478,7,478,8],[478,12,478,13],[475,2,475,3],[475,7,475,8],[475,12,475,13],[476,2,476,3],[476,7,476,8],[476,12,476,13],[481,2,481,3],[481,7,481,8],[481,12,481,13],[482,2,482,3],[482,7,482,8],[482,12,482,13],[479,2,479,3],[479,7,479,8],[479,12,479,13],[480,2,480,3],[480,7,480,8],[480,12,480,13],[485,2,485,3],[485,7,485,8],[485,12,485,13],[486,2,486,3],[486,7,486,8],[486,12,486,13],[483,2,483,3],[483,7,483,8],[483,12,483,13],[484,2,484,3],[484,7,484,8],[484,12,484,13],[489,2,489,3],[489,7,489,8],[489,12,489,13],[490,2,490,3],[490,7,490,8],[490,12,490,13],[487,2,487,3],[487,7,487,8],[487,12,487,13],[488,2,488,3],[488,7,488,8],[488,12,488,13],[493,2,493,3],[493,7,493,8],[493,12,493,13],[494,2,494,3],[494,7,494,8],[494,12,494,13],[491,2,491,3],[491,7,491,8],[491,12,491,13],[492,2,492,3],[492,7,492,8],[492,12,492,13],[497,2,497,3],[497,7,497,8],[497,12,497,13],[498,2,498,3],[498,7,498,8],[498,12,498,13],[495,2,495,3],[495,7,495,8],[495,12,495,13],[496,2,496,3],[496,7,496,8],[496,12,496,13],[501,2,501,3],[501,7,501,8],[501,12,501,13],[502,2,502,3],[502,7,502,8],[502,12,502,13],[499,2,499,3],[499,7,499,8],[499,12,499,13],[500,2,500,3],[500,7,500,8],[500,12,500,13],[505,2,505,3],[505,7,505,8],[505,12,505,13],[506,2,506,3],[506,7,506,8],[506,12,506,13],[503,2,503,3],[503,7,503,8],[503,12,503,13],[504,2,504,3],[504,7,504,8],[504,12,504,13],[509,2,509,3],[509,7,509,8],[509,12,509,13],[510,2,510,3],[510,7,510,8],[510,12,510,13],[507,2,507,3],[507,7,507,8],[507,12,507,13],[508,2,508,3],[508,7,508,8],[508,12,508,13],[513,2,513,3],[513,7,513,8],[513,12,513,13],[514,2,514,3],[514,7,514,8],[514,12,514,13],[511,2,511,3],[511,7,511,8],[511,12,511,13],[512,2,512,3],[512,7,512,8],[512,12,512,13],[517,2,517,3],[517,7,517,8],[517,12,517,13],[518,2,518,3],[518,7,518,8],[518,12,518,13],[515,2,515,3],[515,7,515,8],[515,12,515,13],[516,2,516,3],[516,7,516,8],[516,12,516,13],[519,2,519,6],[519,7,519,11],[519,12,519,16],[520,2,521,3],[520,4,520,6],[520,7,521,8],[520,9,520,11],[520,12,521,13],[520,14,520,16],[524,2,524,3],[524,7,524,8],[524,12,524,13],[525,2,525,4],[525,7,525,9],[525,12,525,14],[522,2,522,3],[522,7,522,8],[522,12,522,13],[523,2,523,3],[523,7,523,8],[523,12,523,13],[529,2,529,3],[529,7,529,8],[529,12,529,13],[530,2,530,3],[530,7,530,8],[530,12,530,13],[526,2,527,3],[526,7,527,8],[526,12,527,13],[528,2,528,3],[528,7,528,8],[528,12,528,13],[533,2,533,3],[533,7,533,8],[533,12,533,13],[534,2,534,3],[534,7,534,8],[534,12,534,13],[531,2,531,3],[531,7,531,8],[531,12,531,13],[532,2,532,3],[532,7,532,8],[532,12,532,13],[537,2,537,3],[537,7,537,8],[537,12,537,13],[538,2,538,3],[538,7,538,8],[538,12,538,13],[535,2,535,3],[535,7,535,8],[535,12,535,13],[536,2,536,3],[536,7,536,8],[536,12,536,13],[541,2,541,3],[541,7,541,8],[541,12,541,13],[542,2,542,3],[542,7,542,8],[542,12,542,13],[539,2,539,3],[539,7,539,8],[539,12,539,13],[540,2,540,3],[540,7,540,8],[540,12,540,13],[545,2,545,3],[545,7,545,8],[545,12,545,13],[546,2,546,3],[546,7,546,8],[546,12,546,13],[543,2,543,3],[543,7,543,8],[543,12,543,13],[544,2,544,3],[544,7,544,8],[544,12,544,13],[549,2,549,3],[549,7,549,8],[549,12,549,13],[550,2,550,3],[550,7,550,8],[550,12,550,13],[547,2,547,3],[547,7,547,8],[547,12,547,13],[548,2,548,3],[548,7,548,8],[548,12,548,13],[553,2,553,3],[553,7,553,8],[553,12,553,13],[554,2,554,3],[554,7,554,8],[554,12,554,13],[551,2,551,3],[551,7,551,8],[551,12,551,13],[552,2,552,3],[552,7,552,8],[552,12,552,13],[557,2,557,3],[557,7,557,8],[557,12,557,13],[558,2,558,3],[558,7,558,8],[558,12,558,13],[555,2,555,3],[555,7,555,8],[555,12,555,13],[556,2,556,3],[556,7,556,8],[556,12,556,13],[561,2,561,3],[561,7,561,8],[561,12,561,13],[562,2,562,3],[562,7,562,8],[562,12,562,13],[559,2,559,3],[559,7,559,8],[559,12,559,13],[560,2,560,3],[560,7,560,8],[560,12,560,13],[565,2,565,3],[565,7,565,8],[565,12,565,13],[566,2,566,3],[566,7,566,8],[566,12,566,13],[563,2,563,3],[563,7,563,8],[563,12,563,13],[564,2,564,3],[564,7,564,8],[564,12,564,13],[569,2,569,3],[569,7,569,8],[569,12,569,13],[570,2,570,3],[570,7,570,8],[570,12,570,13],[567,2,567,3],[567,7,567,8],[567,12,567,13],[568,2,568,3],[568,7,568,8],[568,12,568,13],[573,2,573,3],[573,7,573,8],[573,12,573,13],[574,2,574,3],[574,7,574,8],[574,12,574,13],[571,2,571,3],[571,7,571,8],[571,12,571,13],[572,2,572,3],[572,7,572,8],[572,12,572,13],[577,2,577,3],[577,7,577,8],[577,12,577,13],[578,2,578,3],[578,7,578,8],[578,12,578,13],[575,2,575,3],[575,7,575,8],[575,12,575,13],[576,2,576,3],[576,7,576,8],[576,12,576,13],[581,2,581,3],[581,7,581,8],[581,12,581,13],[582,2,582,3],[582,7,582,8],[582,12,582,13],[579,2,579,3],[579,7,579,8],[579,12,579,13],[580,2,580,3],[580,7,580,8],[580,12,580,13],[585,2,585,4],[585,7,585,9],[585,12,585,14],[586,2,586,3],[586,7,586,8],[586,12,586,13],[583,2,583,3],[583,7,583,8],[583,12,583,13],[584,2,584,3],[584,7,584,8],[584,12,584,13],[589,2,589,3],[589,7,589,8],[589,12,589,13],[590,2,590,3],[590,7,590,8],[590,12,590,13],[587,2,587,3],[587,7,587,8],[587,12,587,13],[588,2,588,3],[588,7,588,8],[588,12,588,13],[593,2,593,3],[593,7,593,8],[593,12,593,13],[594,2,594,3],[594,7,594,8],[594,12,594,13],[591,2,591,3],[591,7,591,8],[591,12,591,13],[592,2,592,3],[592,7,592,8],[592,12,592,13],[597,2,597,3],[597,7,597,8],[597,12,597,13],[598,2,598,3],[598,7,598,8],[598,12,598,13],[595,2,595,3],[595,7,595,8],[595,12,595,13],[596,2,596,3],[596,7,596,8],[596,12,596,13],[601,2,601,3],[601,7,601,8],[601,12,601,13],[602,2,602,3],[602,7,602,8],[602,12,602,13],[599,2,599,3],[599,7,599,8],[599,12,599,13],[600,2,600,3],[600,7,600,8],[600,12,600,13],[605,2,605,3],[605,7,605,8],[605,12,605,13],[606,2,606,3],[606,7,606,8],[606,12,606,13],[603,2,603,3],[603,7,603,8],[603,12,603,13],[604,2,604,3],[604,7,604,8],[604,12,604,13],[609,2,609,3],[609,7,609,8],[609,12,609,13],[610,2,610,3],[610,7,610,8],[610,12,610,13],[607,2,607,3],[607,7,607,8],[607,12,607,13],[608,2,608,3],[608,7,608,8],[608,12,608,13],[613,2,613,3],[613,7,613,8],[613,12,613,13],[614,2,614,3],[614,7,614,8],[614,12,614,13],[611,2,611,3],[611,7,611,8],[611,12,611,13],[612,2,612,3],[612,7,612,8],[612,12,612,13],[617,2,617,3],[617,7,617,8],[617,12,617,13],[618,2,618,3],[618,7,618,8],[618,12,618,13],[615,2,615,3],[615,7,615,8],[615,12,615,13],[616,2,616,3],[616,7,616,8],[616,12,616,13],[621,2,621,3],[621,7,621,8],[621,12,621,13],[622,2,622,3],[622,7,622,8],[622,12,622,13],[619,2,619,3],[619,7,619,8],[619,12,619,13],[620,2,620,3],[620,7,620,8],[620,12,620,13],[625,2,625,3],[625,7,625,8],[625,12,625,13],[626,2,626,3],[626,7,626,8],[626,12,626,13],[623,2,623,3],[623,7,623,8],[623,12,623,13],[624,2,624,3],[624,7,624,8],[624,12,624,13],[629,2,629,3],[629,7,629,8],[629,12,629,13],[630,2,630,3],[630,7,630,8],[630,12,630,13],[627,2,627,3],[627,7,627,8],[627,12,627,13],[628,2,628,3],[628,7,628,8],[628,12,628,13],[633,2,633,3],[633,7,633,8],[633,12,633,13],[634,2,634,3],[634,7,634,8],[634,12,634,13],[631,2,631,3],[631,7,631,8],[631,12,631,13],[632,2,632,3],[632,7,632,8],[632,12,632,13],[637,2,637,3],[637,7,637,8],[637,12,637,13],[638,2,638,3],[638,7,638,8],[638,12,638,13],[635,2,635,3],[635,7,635,8],[635,12,635,13],[636,2,636,3],[636,7,636,8],[636,12,636,13],[641,2,641,3],[641,7,641,8],[641,12,641,13],[642,2,642,3],[642,7,642,8],[642,12,642,13],[639,2,639,3],[639,7,639,8],[639,12,639,13],[640,2,640,3],[640,7,640,8],[640,12,640,13],[645,2,645,3],[645,7,645,8],[645,12,645,13],[646,2,646,3],[646,7,646,8],[646,12,646,13],[643,2,643,3],[643,7,643,8],[643,12,643,13],[644,2,644,3],[644,7,644,8],[644,12,644,13],[649,2,649,3],[649,7,649,8],[649,12,649,13],[650,2,650,3],[650,7,650,8],[650,12,650,13],[647,2,647,3],[647,7,647,8],[647,12,647,13],[648,2,648,3],[648,7,648,8],[648,12,648,13],[653,2,653,3],[653,7,653,8],[653,12,653,13],[654,2,654,3],[654,7,654,8],[654,12,654,13],[651,2,651,3],[651,7,651,8],[651,12,651,13],[652,2,652,3],[652,7,652,8],[652,12,652,13],[657,2,657,3],[657,7,657,8],[657,12,657,13],[658,2,658,3],[658,7,658,8],[658,12,658,13],[655,2,655,3],[655,7,655,8],[655,12,655,13],[656,2,656,3],[656,7,656,8],[656,12,656,13],[661,2,661,3],[661,7,661,8],[661,12,661,13],[662,2,662,3],[662,7,662,8],[662,12,662,13],[659,2,659,3],[659,7,659,8],[659,12,659,13],[660,2,660,3],[660,7,660,8],[660,12,660,13],[665,2,665,3],[665,7,665,8],[665,12,665,13],[666,2,666,3],[666,7,666,8],[666,12,666,13],[663,2,663,3],[663,7,663,8],[663,12,663,13],[664,2,664,3],[664,7,664,8],[664,12,664,13],[669,2,669,3],[669,7,669,8],[669,12,669,13],[670,2,670,3],[670,7,670,8],[670,12,670,13],[667,2,667,3],[667,7,667,8],[667,12,667,13],[668,2,668,3],[668,7,668,8],[668,12,668,13],[673,2,673,3],[673,7,673,8],[673,12,673,13],[674,2,674,3],[674,7,674,8],[674,12,674,13],[671,2,671,3],[671,7,671,8],[671,12,671,13],[672,2,672,3],[672,7,672,8],[672,12,672,13],[677,2,677,3],[677,7,677,8],[677,12,677,13],[678,2,678,3],[678,7,678,8],[678,12,678,13],[675,2,675,3],[675,7,675,8],[675,12,675,13],[676,2,676,3],[676,7,676,8],[676,12,676,13],[681,2,681,3],[681,7,681,8],[681,12,681,13],[682,2,682,3],[682,7,682,8],[682,12,682,13],[679,2,679,3],[679,7,679,8],[679,12,679,13],[680,2,680,3],[680,7,680,8],[680,12,680,13],[685,2,685,3],[685,7,685,8],[685,12,685,13],[686,2,686,3],[686,7,686,8],[686,12,686,13],[683,2,683,3],[683,7,683,8],[683,12,683,13],[684,2,684,3],[684,7,684,8],[684,12,684,13],[689,2,689,3],[689,7,689,8],[689,12,689,13],[690,2,690,3],[690,7,690,8],[690,12,690,13],[687,2,687,3],[687,7,687,8],[687,12,687,13],[688,2,688,3],[688,7,688,8],[688,12,688,13],[693,2,693,3],[693,7,693,8],[693,12,693,13],[694,2,694,3],[694,7,694,8],[694,12,694,13],[691,2,691,3],[691,7,691,8],[691,12,691,13]],"merged_total":1015,"flags":["merged_cut"]}
[]
[{"$f":"A1026","v":"Nicaragua"}]
[{"$f":"A1034","v":"2001"}]
["Use of drinking water sources"]
[" by wealth quintile and sub-national region"]
["Notes:"]
["WHO/UNICEF JMP customised wealth index excludes water,"]
[" sanitation and hygiene assets."]
["Survey used for analysis:",{"$f":"A1025","v":"DHS01"}]
[{"$f":"B1028","v":""}]
[{"$f":"B1027","v":""}]
[]
[]
["Use of drinking water sources",null,"NATIONAL wealth index quintile",null,null,null,null,"URBAN wealth index quintile",null,null,null,null,"RURAL wealth index quintile",null,null,null,null,"SUB-REGIONS:",null,null,null,null,null,null,null,null,null,null,null,null,null,null,null,null,null,null,null,null,null,null,null,null,null,null,null,null,null,null,null,null,null,null,"Raw numbers of respondents:","Use of drinking water sources","NATIONAL wealth index quintile",null,null,null,null,"URBAN wealth index quintile",null,null,null,null,"RURAL wealth index quintile",null,null,null,null,"SUB-REGIONS:"]
["Weighted percentage (used in graphs)",null,"Poorest","Poor","Middle","Rich","Richest","Poorest","Poor","Middle","Rich","Richest","Poorest","Poor","Middle","Rich","Richest","Atl ntico Norte(Raan)","Atl ntico Sur(Raas)","Boaco","Carazo","Chinandega","Chontales","Estel¡","Granada","Jinotega","Le¢n","Madriz","Managua","Masaya","Matagalpa","Nueva Segovia","R¡o San Juan","Rivas",null,null,null,null,null,null,null,null,null,null,null,null,null,null,null,null,null,null,"Water data, raw numbers (weighted)",null,"Poorest","Poor","Middle","Rich","Richest","Poorest","Poor","Middle","Rich","Richest","Poorest","Poor","Middle","Rich","Richest","Atl ntico Norte(Raan)","Atl ntico Sur(Raas)","Boaco","Carazo","Chinandega","Chontales","Estel¡","Granada","Jinotega","Le¢n","Madriz","Managua","Masaya","Matagalpa","Nueva Segovia","R¡o San Juan","Rivas"]
["Water","Improved",{"$f":"C58+C59+C60+C61+C66+C67+(C62+C63+C65)*0.5","v":52.973925866982256},70.618246482418726,90.49375909009737,96.03818309103454,98.103544178069896,89.544831909274222,95.809027345737263,97.066936606432776,98.109885382881032,98.77147732664055,47.973331031277951,51.891979060054197,58.329312020430876,72.057223000295934,84.699590135035194,59.299287410926745,57.385253906250526,68.405797101449394,95.527483782861111,79.001233045622072,80.841269841269678,85.372157133011711,92.004541031462736,60.111177884615238,83.044041450777087,71.280991735537512,98.509903688897225,98.485316846986308,76.050797932119423,74.107440774107232,65.594362745097797,80.098831985624514,null,null,null,null,null,null,null,null,null,null,null,null,null,null,null,null,null,null,"Water","Improved","N/A","N/A","N/A","N/A","N/A","N/A","N/A","N/A","N/A","N/A","N/A","N/A","N/A","N/A","N/A","N/A","N/A","N/A","N/A","N/A","N/A","N/A","N/A","N/A","N/A","N/A","N/A","N/A","N/A","N/A","N/A","N/A"]
[null,"Not Improved",{"$f":"100-C16","v":47.026074133017744},{"$f":"100-D16","v":29.381753517581274},9.5062409099026297,3.96181690896546,1.896455821930104,10.455168090725778,4.1909726542627368,2.9330633935672239,1.890114617118968,1.2285226733594499,52.026668968722049,48.108020939945803,41.670687979569124,27.942776999704066,15.300409864964806,40.700712589073255,42.614746093749474,31.594202898550606,4.4725162171388888,20.998766954377928,19.158730158730322,14.627842866988289,7.9954589685372639,39.888822115384762,16.955958549222913,28.719008264462488,1.490096311102775,1.5146831530136922,23.949202067880577,25.892559225892768,34.405637254902203,19.901168014375486,null,null,null,null,null,null,null,null,null,null,null,null,null,null,null,null,null,null,null,"Not Improved","N/A","N/A","N/A","N/A","N/A","N/A","N/A","N/A","N/A","N/A","N/A","N/A","N/A","N/A","N/A","N/A","N/A","N/A","N/A","N/A","N/A","N/A","N/A","N/A","N/A","N/A","N/A","N/A","N/A","N/A","N/A","N/A"]
["Water ladder","Basic",{"$f":"C16*C42/100","v":50.116334305549934},68.217316721320671,89.517913552953189,95.706937123725268,98.026275413248513,88.161196009707979,95.616000572786945,96.873587592322025,97.995329562712229,98.692781335705817,45.715503584858851,48.70706537626419,55.053030668504341,69.948404735945246,83.360456351891301,57.947433778864166,56.369056701660682,65.881817952151295,95.072591002942715,76.92441770527644,79.3202145899008,83.664713990351487,90.607579426818319,57.731141399843665,82.327565493261631,67.010578138721215,98.292482529385211,97.610899367581951,73.133198722833328,68.444928608133168,64.397632546994458,78.726744689167475,null,null,null,null,null,null,null,null,null,null,null,null,null,null,null,null,null,null,"Water ladder","Basic","N/A","N/A","N/A","N/A","N/A","N/A","N/A","N/A","N/A","N/A","N/A","N/A","N/A","N/A","N/A","N/A","N/A","N/A","N/A","N/A","N/A","N/A","N/A","N/A","N/A","N/A","N/A","N/A","N/A","N/A","N/A","N/A"]
[null,"Limited",{"$f":"C16*C41/100","v":2.8575915614323382},2.4009297610980691,0.97584553714412592,0.33124596730927114,7.7268764821387212E-2,1.3836358995661968,0.19302677295031548,0.19334901411075825,0.11455582016880911,7.8695990934730786E-2,2.2578274464189927,3.1849136837898762,3.2762813519263863,2.1088182643507141,1.339133783143819,1.3518536320626304,1.0161972045898624,2.5239791492981074,0.45489277991838617,2.0768153403455898,1.5210552513688345,1.7074431426602328,1.3969616046443827,2.3800364847715634,0.71647595751546622,4.2704135968163204,0.21742115951200564,0.87441747940435288,2.917599209286081,5.6625121659740589,1.1967301981033285,1.372087296457049,null,null,null,null,null,null,null,null,null,null,null,null,null,null,null,null,null,null,null,"Limited","N/A","N/A","N/A","N/A","N/A","N/A","N/A","N/A","N/A","N/A","N/A","N/A","N/A","N/A","N/A","N/A","N/A","N/A","N/A","N/A","N/A","N/A","N/A","N/A","N/A","N/A","N/A","N/A","N/A","N/A","N/A","N/A"]
[null,"Unimproved",{"$f":"100-(C18+C19+C21)","v":31.88974689245299},{"$f":"100-(D18+D19+D21)","v":23.639217518302999},8.8798843082843746,3.9330368057703851,1.896455821930104,9.408645345382169,4.1047619631114287,2.9330633935672239,1.890114617118968,1.2285226733594499,34.118753017223668,33.284442948700303,30.595303120772869,24.464589898773596,14.275322595123114,30.273159144892617,33.117675781249361,24.21607378129103,2.4923181973369282,18.828606658447043,12.904761904762125,13.38731909028256,7.7035355173533873,25.796274038461718,15.531088082901661,21.217418944691289,1.2902053425401903,1.5146831530136922,18.329961789166276,14.714714714714958,21.691176470588545,17.595088349805238,null,null,null,null,null,null,null,null,null,null,null,null,null,null,null,null,null,null,null,"Unimproved","N/A","N/A","N/A","N/A","N/A","N/A","N/A","N/A","N/A","N/A","N/A","N/A","N/A","N/A","N/A","N/A","N/A","N/A","N/A","N/A","N/A","N/A","N/A","N/A","N/A","N/A","N/A","N/A","N/A","N/A","N/A","N/A"]
[null,"Surface water",{"$f":"C64","v":15.136327240564732},5.7425359992782647,0.62635660161830875,2.8780103195072397E-2,0,1.0465227453436563,8.621069115130528E-2,0,0,0,17.907915951498481,14.823577991245621,11.075384858796403,3.4781871009304388,1.0250872698417604,10.427553444180591,9.4970703125000924,7.3781291172595642,1.9801980198019795,2.1701602959309292,6.2539682539682451,1.2405237767057198,0.29192345118391116,14.09254807692305,1.424870466321243,7.5015893197711767,0.19989096856260352,0,5.6192402787143099,11.177844511177813,12.714460784313669,2.3060796645702335,null,null,null,null,null,null,null,null,null,null,null,null,null,null,null,null,null,null,null,"Surface water","N/A","N/A","N/A","N/A","N/A","N/A","N/A","N/A","N/A","N/A","N/A","N/A","N/A","N/A","N/A","N/A","N/A","N/A","N/A","N/A","N/A","N/A","N/A","N/A","N/A","N/A","N/A","N/A","N/A","N/A","N/A","N/A"]
["Improved water point at more than 30 minutes","Yes","N/A","N/A","N/A","N/A","N/A","N/A","N/A","N/A","N/A","N/A","N/A","N/A","N/A","N/A","N/A","N/A","N/A","N/A","N/A","N/A","N/A","N/A","N/A","N/A","N/A","N/A","N/A","N/A","N/A","N/A","N/A","N/A",null,null,null,null,null,null,null,null,null,null,null,null,null,null,null,null,null,null,"Improved water point at more than 30 minutes","Yes","N/A","N/A","N/A","N/A","N/A","N/A","N/A","N/A","N/A","N/A","N/A","N/A","N/A","N/A","N/A","N/A","N/A","N/A","N/A","N/A","N/A","N/A","N/A","N/A","N/A","N/A","N/A","N/A","N/A","N/A","N/A","N/A"]
[null,"No","N/A","N/A","N/A","N/A","N/A","N/A","N/A","N/A","N/A","N/A","N/A","N/A","N/A","N/A","N/A","N/A","N/A","N/A","N/A","N/A","N/A","N/A","N/A","N/A","N/A","N/A","N/A","N/A","N/A","N/A","N/A","N/A",null,null,null,null,null,null,null,null,null,null,null,null,null,null,null,null,null,null,null,"No","N/A","N/A","N/A","N/A","N/A","N/A","N/A","N/A","N/A","N/A","N/A","N/A","N/A","N/A","N/A","N/A","N/A","N/A","N/A","N/A","N/A","N/A","N/A","N/A","N/A","N/A","N/A","N/A","N/A","N/A","N/A","N/A"]
["Manually calculated ratios","Improved wells"]
[null,"Improved springs"]
[null,"Other"]
[null,null,"NATIONAL wealth index quintile",null,null,null,null,"URBAN wealth index quintile",null,null,null,null,"RURAL wealth index quintile",null,null,null,null,"SUB-REGIONS:",null,null,null,null,null,null,null,null,null,null,null,null,null,null,null,null,null,null,null,null,null,null,null,null,null,null,null,null,null,null,null,null,null,null,"Raw numbers of respondents:","Use of drinking water sources","NATIONAL wealth index quintile",null,null,null,null,"URBAN wealth index quintile",null,null,null,null,"RURAL wealth index quintile",null,null,null,null,"SUB-REGIONS:"]
["Percentage based on weighted population",null,"Poorest","Poor","Middle","Rich","Richest","Poorest","Poor","Middle","Rich","Richest","Poorest","Poor","Middle","Rich","Richest","Atl ntico Norte(Raan)","Atl ntico Sur(Raas)","Boaco","Carazo","Chinandega","Chontales","Estel¡","Granada","Jinotega","Le¢n","Madriz","Managua","Masaya","Matagalpa","Nueva Segovia","R¡o San Juan","Rivas",null,null,null,null,null,null,null,null,null,null,null,null,null,null,null,null,null,null,"Water data, raw numbers (weighted)",null,"Poorest","Poor","Middle","Rich","Richest","Poorest","Poor","Middle","Rich","Richest","Poorest","Poor","Middle","Rich","Richest","Atl ntico Norte(Raan)","Atl ntico Sur(Raas)","Boaco","Carazo","Chinandega","Chontales","Estel¡","Granada","Jinotega","Le¢n","Madriz","Managua","Masaya","Matagalpa","Nueva Segovia","R¡o San Juan","Rivas"]
["Piped water","Yes",20.822513241283058,46.682708333463054,81.48198862311024,92.098101820046779,95.843999393520392,80.164968223099009,91.545170662146617,94.168820903246484,95.842317907492443,97.266201627718985,13.736047633689278,18.093522878576227,27.212150825779997,47.332170351008656,70.369689636887458,28.361045130641511,23.071289062500195,44.031620553359801,93.820416524411016,60.024660912453562,67.936507936507809,71.640248104755315,84.138825819007394,33.223388305846981,67.305699481865219,50.063572790845612,97.383245502453192,96.599690880989172,57.614555256064634,59.559559559559425,43.903186274509729,61.725067385444788,null,null,null,null,null,null,null,null,null,null,null,null,null,null,null,null,null,null,"Piped water","Yes","N/A","N/A","N/A","N/A","N/A","N/A","N/A","N/A","N/A","N/A","N/A","N/A","N/A","N/A","N/A","N/A","N/A","N/A","N/A","N/A","N/A","N/A","N/A","N/A","N/A","N/A","N/A","N/A","N/A","N/A","N/A","N/A"]
[null,"No",79.177486758716725,53.317291666536946,18.518011376889763,7.9018981799531955,4.1560006064794903,19.835031776900696,8.454829337853349,5.8311790967534538,4.157682092507522,2.733798372280956,86.263952366310562,81.906477121423677,72.787849174219815,52.667829648991393,29.630310363112145,71.63895486935894,76.928710937500128,55.968379446640427,6.1795834755889372,39.975339087545962,32.063492063491992,28.359751895244656,15.861174180992501,66.776611694152763,32.694300518134703,49.936427209154552,2.6167544975468102,3.4003091190108288,42.385444743935274,40.440440440440305,56.096813725490122,38.274932614555297,null,null,null,null,null,null,null,null,null,null,null,null,null,null,null,null,null,null,null,"No","N/A","N/A","N/A","N/A","N/A","N/A","N/A","N/A","N/A","N/A","N/A","N/A","N/A","N/A","N/A","N/A","N/A","N/A","N/A","N/A","N/A","N/A","N/A","N/A","N/A","N/A","N/A","N/A","N/A","N/A","N/A","N/A"]
["Piped water on premises","Yes",10.086290866524664,35.805371684406836,75.728937901490951,89.353698253150171,95.291867614850318,69.005065137965516,88.871828892210416,91.470772640672493,95.375367232852142,97.028146879110679,5.8117375327043224,7.8473155546212219,16.146275363001614,36.97032538841183,61.693697545550677,21.995249406175905,17.01660156250016,34.967061923583756,87.299419597132101,55.289765721331477,59.174603174603071,58.511371467953069,77.197534868634349,23.268365817091393,63.393782383419619,35.378258105530932,96.401962565873148,91.00463678516229,46.2264150943396,51.184517851184374,33.823529411764639,56.424079065588529,null,null,null,null,null,null,null,null,null,null,null,null,null,null,null,null,null,null,"Piped water on premises","Yes","N/A","N/A","N/A","N/A","N/A","N/A","N/A","N/A","N/A","N/A","N/A","N/A","N/A","N/A","N/A","N/A","N/A","N/A","N/A","N/A","N/A","N/A","N/A","N/A","N/A","N/A","N/A","N/A","N/A","N/A","N/A","N/A"]
[null,"No",89.913709133475194,64.194628315593022,24.271062098508917,10.646301746849762,4.7081323851495309,30.994934862033801,11.128171107789466,8.5292273593274466,4.6246327671478591,2.9718531208892669,94.188262467295786,92.152684445378981,83.85372463699845,63.029674611588348,38.306302454448939,78.004750593824411,82.983398437500128,65.032938076416414,12.700580402867875,44.710234278668047,40.825396825396759,41.488628532046839,22.802465131365487,76.731634182908437,36.606217616580281,64.621741894469224,3.5980374341268639,8.9953632148377327,53.773584905660364,48.815482148815271,66.176470588235219,43.575920934411542,null,null,null,null,null,null,null,null,null,null,null,null,null,null,null,null,null,null,null,"No","N/A","N/A","N/A","N/A","N/A","N/A","N/A","N/A","N/A","N/A","N/A","N/A","N/A","N/A","N/A","N/A","N/A","N/A","N/A","N/A","N/A","N/A","N/A","N/A","N/A","N/A","N/A","N/A","N/A","N/A","N/A","N/A"]
["Piped water into dwelling","Yes","N/A","N/A","N/A","N/A","N/A","N/A","N/A","N/A","N/A","N/A","N/A","N/A","N/A","N/A","N/A","N/A","N/A","N/A","N/A","N/A","N/A","N/A","N/A","N/A","N/A","N/A","N/A","N/A","N/A","N/A","N/A","N/A",null,null,null,null,null,null,null,null,null,null,null,null,null,null,null,null,null,null,"Piped water into dwelling","Yes","N/A","N/A","N/A","N/A","N/A","N/A","N/A","N/A","N/A","N/A","N/A","N/A","N/A","N/A","N/A","N/A","N/A","N/A","N/A","N/A","N/A","N/A","N/A","N/A","N/A","N/A","N/A","N/A","N/A","N/A","N/A","N/A"]
[null,"No","N/A","N/A","N/A","N/A","N/A","N/A","N/A","N/A","N/A","N/A","N/A","N/A","N/A","N/A","N/A","N/A","N/A","N/A","N/A","N/A","N/A","N/A","N/A","N/A","N/A","N/A","N/A","N/A","N/A","N/A","N/A","N/A",null,null,null,null,null,null,null,null,null,null,null,null,null,null,null,null,null,null,null,"No","N/A","N/A","N/A","N/A","N/A","N/A","N/A","N/A","N/A","N/A","N/A","N/A","N/A","N/A","N/A","N/A","N/A","N/A","N/A","N/A","N/A","N/A","N/A","N/A","N/A","N/A","N/A","N/A","N/A","N/A","N/A","N/A"]
["Water source on premises","Yes",23.57933789409601,46.695863644476539,81.679030043254826,92.811536382108599,97.294288247603745,74.185851787605699,92.550997346495421,93.681521582528234,97.158117253864233,98.51960977114075,19.940870930562522,22.050555700118839,27.862041178408255,49.893118344371992,72.66381189223668,40.356294536817359,37.57324218750027,44.532279314888143,87.606691703653098,69.568434032059045,64.761904761904631,63.818056512749742,83.55497891663957,35.442278860569608,71.010362694300483,37.412587412587513,96.474650190805008,91.808346213292126,53.21203953279425,53.620286953620123,40.808823529411697,75.980832584606091,null,null,null,null,null,null,null,null,null,null,null,null,null,null,null,null,null,null,"Water source on premises","Yes","N/A","N/A","N/A","N/A","N/A","N/A","N/A","N/A","N/A","N/A","N/A","N/A","N/A","N/A","N/A","N/A","N/A","N/A","N/A","N/A","N/A","N/A","N/A","N/A","N/A","N/A","N/A","N/A","N/A","N/A","N/A","N/A"]
[null,"No",76.420662105903787,53.304136355523404,18.320969956745198,7.1884636178913786,2.7057117523961747,25.814148212393857,7.4490026535044951,6.318478417471729,2.8418827461357723,1.4803902288592159,80.059129069437091,77.949444299880923,72.137958821591582,50.106881655628058,27.336188107762926,59.643705463183252,62.426757812500277,55.467720685112084,12.393308296346881,30.4315659679406,35.238095238095177,36.181943487250159,16.445021083360327,64.557721139430129,28.989637305699468,62.587412587412636,3.5253498091950082,8.1916537867079011,46.787960467205714,46.379713046379514,59.191176470588161,24.019167415393859,null,null,null,null,null,null,null,null,null,null,null,null,null,null,null,null,null,null,null,"No","N/A","N/A","N/A","N/A","N/A","N/A","N/A","N/A","N/A","N/A","N/A","N/A","N/A","N/A","N/A","N/A","N/A","N/A","N/A","N/A","N/A","N/A","N/A","N/A","N/A","N/A","N/A","N/A","N/A","N/A","N/A","N/A"]
["Improved Water source on premises","Yes","N/A","N/A","N/A","N/A","N/A","N/A","N/A","N/A","N/A","N/A","N/A","N/A","N/A","N/A","N/A","N/A","N/A","N/A","N/A","N/A","N/A","N/A","N/A","N/A","N/A","N/A","N/A","N/A","N/A","N/A","N/A","N/A",null,null,null,null,null,null,null,null,null,null,null,null,null,null,null,null,null,null,"Improved water source on premises","Yes","N/A","N/A","N/A","N/A","N/A","N/A","N/A","N/A","N/A","N/A","N/A","N/A","N/A","N/A","N/A","N/A","N/A","N/A","N/A","N/A","N/A","N/A","N/A","N/A","N/A","N/A","N/A","N/A","N/A","N/A","N/A","N/A"]
[null,"No","N/A","N/A","N/A","N/A","N/A","N/A","N/A","N/A","N/A","N/A","N/A","N/A","N/A","N/A","N/A","N/A","N/A","N/A","N/A","N/A","N/A","N/A","N/A","N/A","N/A","N/A","N/A","N/A","N/A","N/A","N/A","N/A",null,null,null,null,null,null,null,null,null,null,null,null,null,null,null,null,null,null,null,"No","N/A","N/A","N/A","N/A","N/A","N/A","N/A","N/A","N/A","N/A","N/A","N/A","N/A","N/A","N/A","N/A","N/A","N/A","N/A","N/A","N/A","N/A","N/A","N/A","N/A","N/A","N/A","N/A","N/A","N/A","N/A","N/A"]
["Piped water on premises available when needed","Yes","N/A","N/A","N/A","N/A","N/A","N/A","N/A","N/A","N/A","N/A","N/A","N/A","N/A","N/A","N/A","N/A","N/A","N/A","N/A","N/A","N/A","N/A","N/A","N/A","N/A","N/A","N/A","N/A","N/A","N/A","N/A","N/A",null,null,null,null,null,null,null,null,null,null,null,null,null,null,null,null,null,null,"Piped water on premises available when needed","Yes","N/A","N/A","N/A","N/A","N/A","N/A","N/A","N/A","N/A","N/A","N/A","N/A","N/A","N/A","N/A","N/A","N/A","N/A","N/A","N/A","N/A","N/A","N/A","N/A","N/A","N/A","N/A","N/A","N/A","N/A","N/A","N/A"]
[null,"No","N/A","N/A","N/A","N/A","N/A","N/A","N/A","N/A","N/A","N/A","N/A","N/A","N/A","N/A","N/A","N/A","N/A","N/A","N/A","N/A","N/A","N/A","N/A","N/A","N/A","N/A","N/A","N/A","N/A","N/A","N/A","N/A",null,null,null,null,null,null,null,null,null,null,null,null,null,null,null,null,null,null,null,"No","N/A","N/A","N/A","N/A","N/A","N/A","N/A","N/A","N/A","N/A","N/A","N/A","N/A","N/A","N/A","N/A","N/A","N/A","N/A","N/A","N/A","N/A","N/A","N/A","N/A","N/A","N/A","N/A","N/A","N/A","N/A","N/A"]
["Water point at more than 30 minutes","Yes",5.3943360146796788,3.3998716772099544,1.0783567253213062,0.3449106976495831,7.8762460081090419E-2,1.5451878908746854,0.20147033979768672,0.19919142487694902,0.11676277035871219,7.9674814090793161E-2,4.7064220846930978,6.1375837682043297,5.6168695265577808,2.926588309324734,1.5810392718652588,2.2797131147541108,1.7708333333333497,3.6897152818129051,0.47619047619047616,2.6288391462779561,1.8815331010452927,1.9999999999999982,1.5183615819209015,3.9593908629441552,0.86276624427069204,5.9909570459683765,0.22070995034026267,0.88786583360736837,3.8363821138211325,7.640949554896129,1.8244406196213352,1.7129928894634816,null,null,null,null,null,null,null,null,null,null,null,null,null,null,null,null,null,null,"Water point at more than 30 minutes","Yes","N/A","N/A","N/A","N/A","N/A","N/A","N/A","N/A","N/A","N/A","N/A","N/A","N/A","N/A","N/A","N/A","N/A","N/A","N/A","N/A","N/A","N/A","N/A","N/A","N/A","N/A","N/A","N/A","N/A","N/A","N/A","N/A"]
[null,"No",94.605663985320348,96.600128322790056,98.921643274678644,99.655089302350419,99.921237539918906,98.454812109125271,99.798529660202306,99.800808575123057,99.883237229641296,99.920325185909206,95.293577915306685,93.862416231795422,94.383130473441966,97.073411690675314,98.41896072813465,97.720286885245983,98.229166666666686,96.310284718187106,99.523809523809518,97.371160853722003,98.118466898954665,98.000000000000014,98.481638418079058,96.040609137055824,99.137233755729312,94.009042954031656,99.779290049659735,99.112134166392636,96.163617886178855,92.359050445103861,98.175559380378658,98.287007110536521,null,null,null,null,null,null,null,null,null,null,null,null,null,null,null,null,null,null,null,"No","N/A","N/A","N/A","N/A","N/A","N/A","N/A","N/A","N/A","N/A","N/A","N/A","N/A","N/A","N/A","N/A","N/A","N/A","N/A","N/A","N/A","N/A","N/A","N/A","N/A","N/A","N/A","N/A","N/A","N/A","N/A","N/A"]
["Water source available when needed","Yes","N/A","N/A","N/A","N/A","N/A","N/A","N/A","N/A","N/A","N/A","N/A","N/A","N/A","N/A","N/A","N/A","N/A","N/A","N/A","N/A","N/A","N/A","N/A","N/A","N/A","N/A","N/A","N/A","N/A","N/A","N/A","N/A",null,null,null,null,null,null,null,null,null,null,null,null,null,null,null,null,null,null,"Water source available when needed","Yes","N/A","N/A","N/A","N/A","N/A","N/A","N/A","N/A","N/A","N/A","N/A","N/A","N/A","N/A","N/A","N/A","N/A","N/A","N/A","N/A","N/A","N/A","N/A","N/A","N/A","N/A","N/A","N/A","N/A","N/A","N/A","N/A"]
[null,"No","N/A","N/A","N/A","N/A","N/A","N/A","N/A","N/A","N/A","N/A","N/A","N/A","N/A","N/A","N/A","N/A","N/A","N/A","N/A","N/A","N/A","N/A","N/A","N/A","N/A","N/A","N/A","N/A","N/A","N/A","N/A","N/A",null,null,null,null,null,null,null,null,null,null,null,null,null,null,null,null,null,null,null,"No","N/A","N/A","N/A","N/A","N/A","N/A","N/A","N/A","N/A","N/A","N/A","N/A","N/A","N/A","N/A","N/A","N/A","N/A","N/A","N/A","N/A","N/A","N/A","N/A","N/A","N/A","N/A","N/A","N/A","N/A","N/A","N/A"]
["Improved water source available when needed","Yes","N/A","N/A","N/A","N/A","N/A","N/A","N/A","N/A","N/A","N/A","N/A","N/A","N/A","N/A","N/A","N/A","N/A","N/A","N/A","N/A","N/A","N/A","N/A","N/A","N/A","N/A","N/A","N/A","N/A","N/A","N/A","N/A",null,null,null,null,null,null,null,null,null,null,null,null,null,null,null,null,null,null,"Improved water source available when needed","Yes","N/A","N/A","N/A","N/A","N/A","N/A","N/A","N/A","N/A","N/A","N/A","N/A","N/A","N/A","N/A","N/A","N/A","N/A","N/A","N/A","N/A","N/A","N/A","N/A","N/A","N/A","N/A","N/A","N/A","N/A","N/A","N/A"]
[null,"No","N/A","N/A","N/A","N/A","N/A","N/A","N/A","N/A","N/A","N/A","N/A","N/A","N/A","N/A","N/A","N/A","N/A","N/A","N/A","N/A","N/A","N/A","N/A","N/A","N/A","N/A","N/A","N/A","N/A","N/A","N/A","N/A",null,null,null,null,null,null,null,null,null,null,null,null,null,null,null,null,null,null,null,"No","N/A","N/A","N/A","N/A","N/A","N/A","N/A","N/A","N/A","N/A","N/A","N/A","N/A","N/A","N/A","N/A","N/A","N/A","N/A","N/A","N/A","N/A","N/A","N/A","N/A","N/A","N/A","N/A","N/A","N/A","N/A","N/A"]
["Microbiological quality at point of collection","Not contaminated (No E. coli in 100 mL)","N/A","N/A","N/A","N/A","N/A","N/A","N/A","N/A","N/A","N/A","N/A","N/A","N/A","N/A","N/A","N/A","N/A","N/A","N/A","N/A","N/A","N/A","N/A","N/A","N/A","N/A","N/A","N/A","N/A","N/A","N/A","N/A",null,null,null,null,null,null,null,null,null,null,null,null,null,null,null,null,null,null,"Microbiological quality at point of collection","Not contaminated (No E. coli in 100 mL)","N/A","N/A","N/A","N/A","N/A","N/A","N/A","N/A","N/A","N/A","N/A","N/A","N/A","N/A","N/A","N/A","N/A","N/A","N/A","N/A","N/A","N/A","N/A","N/A","N/A","N/A","N/A","N/A","N/A","N/A","N/A","N/A"]
[null,"Contaminated (E. coli detected in 100 mL)","N/A","N/A","N/A","N/A","N/A","N/A","N/A","N/A","N/A","N/A","N/A","N/A","N/A","N/A","N/A","N/A","N/A","N/A","N/A","N/A","N/A","N/A","N/A","N/A","N/A","N/A","N/A","N/A","N/A","N/A","N/A","N/A",null,null,null,null,null,null,null,null,null,null,null,null,null,null,null,null,null,null,null,"Contaminated (E. coli detected in 100 mL)","N/A","N/A","N/A","N/A","N/A","N/A","N/A","N/A","N/A","N/A","N/A","N/A","N/A","N/A","N/A","N/A","N/A","N/A","N/A","N/A","N/A","N/A","N/A","N/A","N/A","N/A","N/A","N/A","N/A","N/A","N/A","N/A"]
[null,"Highly contaminated (>100 CFU/100 mL)","N/A","N/A","N/A","N/A","N/A","N/A","N/A","N/A","N/A","N/A","N/A","N/A","N/A","N/A","N/A","N/A","N/A","N/A","N/A","N/A","N/A","N/A","N/A","N/A","N/A","N/A","N/A","N/A","N/A","N/A","N/A","N/A",null,null,null,null,null,null,null,null,null,null,null,null,null,null,null,null,null,null,null,"Highly contaminated (>100 CFU/100 mL)","N/A","N/A","N/A","N/A","N/A","N/A","N/A","N/A","N/A","N/A","N/A","N/A","N/A","N/A","N/A","N/A","N/A","N/A","N/A","N/A","N/A","N/A","N/A","N/A","N/A","N/A","N/A","N/A","N/A","N/A","N/A","N/A"]
["Microbiological quality of improved water sources at point of collection","Not contaminated (No E. coli in 100 mL)","N/A","N/A","N/A","N/A","N/A","N/A","N/A","N/A","N/A","N/A","N/A","N/A","N/A","N/A","N/A","N/A","N/A","N/A","N/A","N/A","N/A","N/A","N/A","N/A","N/A","N/A","N/A","N/A","N/A","N/A","N/A","N/A",null,null,null,null,null,null,null,null,null,null,null,null,null,null,null,null,null,null,"Microbiological quality of improved water sources at point of collection","Not contaminated (No E. coli in 100 mL)","N/A","N/A","N/A","N/A","N/A","N/A","N/A","N/A","N/A","N/A","N/A","N/A","N/A","N/A","N/A","N/A","N/A","N/A","N/A","N/A","N/A","N/A","N/A","N/A","N/A","N/A","N/A","N/A","N/A","N/A","N/A","N/A"]
[null,"Contaminated (E. coli detected in 100 mL)","N/A","N/A","N/A","N/A","N/A","N/A","N/A","N/A","N/A","N/A","N/A","N/A","N/A","N/A","N/A","N/A","N/A","N/A","N/A","N/A","N/A","N/A","N/A","N/A","N/A","N/A","N/A","N/A","N/A","N/A","N/A","N/A",null,null,null,null,null,null,null,null,null,null,null,null,null,null,null,null,null,null,null,"Contaminated (E. coli detected in 100 mL)","N/A","N/A","N/A","N/A","N/A","N/A","N/A","N/A","N/A","N/A","N/A","N/A","N/A","N/A","N/A","N/A","N/A","N/A","N/A","N/A","N/A","N/A","N/A","N/A","N/A","N/A","N/A","N/A","N/A","N/A","N/A","N/A"]
[null,"Highly contaminated (>100 CFU/100 mL)","N/A","N/A","N/A","N/A","N/A","N/A","N/A","N/A","N/A","N/A","N/A","N/A","N/A","N/A","N/A","N/A","N/A","N/A","N/A","N/A","N/A","N/A","N/A","N/A","N/A","N/A","N/A","N/A","N/A","N/A","N/A","N/A",null,null,null,null,null,null,null,null,null,null,null,null,null,null,null,null,null,null,null,"Highly contaminated (>100 CFU/100 mL)","N/A","N/A","N/A","N/A","N/A","N/A","N/A","N/A","N/A","N/A","N/A","N/A","N/A","N/A","N/A","N/A","N/A","N/A","N/A","N/A","N/A","N/A","N/A","N/A","N/A","N/A","N/A","N/A","N/A","N/A","N/A","N/A"]
["Microbiological quality of piped on premises at point of collection","Not contaminated (No E. coli in 100 mL)","N/A","N/A","N/A","N/A","N/A","N/A","N/A","N/A","N/A","N/A","N/A","N/A","N/A","N/A","N/A","N/A","N/A","N/A","N/A","N/A","N/A","N/A","N/A","N/A","N/A","N/A","N/A","N/A","N/A","N/A","N/A","N/A",null,null,null,null,null,null,null,null,null,null,null,null,null,null,null,null,null,null,"Microbiological quality of piped on premises at point of collection","Not contaminated (No E. coli in 100 mL)","N/A","N/A","N/A","N/A","N/A","N/A","N/A","N/A","N/A","N/A","N/A","N/A","N/A","N/A","N/A","N/A","N/A","N/A","N/A","N/A","N/A","N/A","N/A","N/A","N/A","N/A","N/A","N/A","N/A","N/A","N/A","N/A"]
[null,"Contaminated (E. coli detected in 100 mL)","N/A","N/A","N/A","N/A","N/A","N/A","N/A","N/A","N/A","N/A","N/A","N/A","N/A","N/A","N/A","N/A","N/A","N/A","N/A","N/A","N/A","N/A","N/A","N/A","N/A","N/A","N/A","N/A","N/A","N/A","N/A","N/A",null,null,null,null,null,null,null,null,null,null,null,null,null,null,null,null,null,null,null,"Contaminated (E. coli detected in 100 mL)","N/A","N/A","N/A","N/A","N/A","N/A","N/A","N/A","N/A","N/A","N/A","N/A","N/A","N/A","N/A","N/A","N/A","N/A","N/A","N/A","N/A","N/A","N/A","N/A","N/A","N/A","N/A","N/A","N/A","N/A","N/A","N/A"]
[null,"Highly contaminated (>100 CFU/100 mL)","N/A","N/A","N/A","N/A","N/A","N/A","N/A","N/A","N/A","N/A","N/A","N/A","N/A","N/A","N/A","N/A","N/A","N/A","N/A","N/A","N/A","N/A","N/A","N/A","N/A","N/A","N/A","N/A","N/A","N/A","N/A","N/A",null,null,null,null,null,null,null,null,null,null,null,null,null,null,null,null,null,null,null,"Highly contaminated (>100 CFU/100 mL)","N/A","N/A","N/A","N/A","N/A","N/A","N/A","N/A","N/A","N/A","N/A","N/A","N/A","N/A","N/A","N/A","N/A","N/A","N/A","N/A","N/A","N/A","N/A","N/A","N/A","N/A","N/A","N/A","N/A","N/A","N/A","N/A"]
[null,null,"NATIONAL wealth index quintile",null,null,null,null,"URBAN wealth index quintile",null,null,null,null,"RURAL wealth index quintile",null,null,null,null,"SUB-REGIONS:",null,null,null,null,null,null,null,null,null,null,null,null,null,null,null,null,null,null,null,null,null,null,null,null,null,null,null,null,null,null,null,null,null,null,"Raw numbers of respondents:","Use of drinking water sources","NATIONAL wealth index quintile",null,null,null,null,"URBAN wealth index quintile",null,null,null,null,"RURAL wealth index quintile",null,null,null,null,"SUB-REGIONS:"]
["Percentage based on weighted population",null,"Poorest","Poor","Middle","Rich","Richest","Poorest","Poor","Middle","Rich","Richest","Poorest","Poor","Middle","Rich","Richest","Atl ntico Norte(Raan)","Atl ntico Sur(Raas)","Boaco","Carazo","Chinandega","Chontales","Estel¡","Granada","Jinotega","Le¢n","Madriz","Managua","Masaya","Matagalpa","Nueva Segovia","R¡o San Juan","Rivas",null,null,null,null,null,null,null,null,null,null,null,null,null,null,null,null,null,null,"Water data, raw numbers (weighted)",null,"Poorest","Poor","Middle","Rich","Richest","Poorest","Poor","Middle","Rich","Richest","Poorest","Poor","Middle","Rich","Richest","Atl ntico Norte(Raan)","Atl ntico Sur(Raas)","Boaco","Carazo","Chinandega","Chontales","Estel¡","Granada","Jinotega","Le¢n","Madriz","Managua","Masaya","Matagalpa","Nueva Segovia","R¡o San Juan","Rivas"]
["Source of drinking water","Inside dwelling",2.0867779163084252,6.3605996271993579,21.08759506699268,43.453211872173512,70.900417243020314,14.901568256743229,31.35007595764047,41.019389940654122,63.582888169854492,76.489406005466265,0.48575450666886916,1.84644708343692,2.1690457782352293,5.7384809580588811,24.158625700139762,5.9619952494062138,10.620117187500103,23.109354413702277,37.179924889040684,22.194821208384543,40.031746031745932,21.950379048931769,37.041842361336322,7.0012019230769091,29.896373056994776,16.147488874761677,50.917681264764767,25.255023183925896,21.353113059114367,19.91991991991986,18.995098039215623,29.49985025456726]
[null,"Outside dwelling / within resinct",7.9995129502162508,29.468402096072303,54.585007179696007,45.500190046263924,20.696363855296902,54.053498580227021,57.47251935333616,49.973019882544442,30.365931742988678,15.281572752556164,5.3259830260354546,6.0008684711843037,13.977229584766384,31.288295783236748,37.462567093088403,16.033254156769697,5.8105468750000542,9.6706192358366447,49.948787982246515,32.749691738594095,18.793650793650755,36.250861474844932,39.506973726889342,15.955528846153804,33.419689119170918,18.944691671964478,44.248591677267093,65.533230293663152,22.432007192627506,29.929929929929845,14.552696078431312,25.816112608565462]
[null,"Public",6.4146422902363023,6.7577532226943866,2.3404710604661196,1.2224627563534309,0.19072328603225724,3.9129461212855903,0.69579382891630714,1.1727912907014844,2.0583700252711036E-2,0,5.5235844535417744,5.8760414455735734,8.5023919147076601,6.3822013961071278,5.2366442651149567,2.1140142517814855,3.8330078125000373,4.9275362318840665,3.1751451007169669,0.83847102342785895,3.7777777777777728,10.268780151619566,1.8812844631852055,5.258413461538451,0.72538860103626912,12.460267005721613,0.49064146829002681,2.1638330757341637,9.1256462126320326,4.9049049049048925,6.9546568627450682,0.3893381251871823]
[null,"Private",4.3215800845221457,4.1267620109054892,3.4125796611531105,1.5227464340394006,0.32225896952733585,7.2469569638474951,1.9775479410198127,1.5266532290832993,0.44636697438762651,0.23805474860831119,2.4007256474431786,4.3701658783814281,2.5634835480707197,3.9954654495910673,3.3488420221785837,4.2517814726841117,2.2216796875000213,4.1370223978919718,3.3458518265619657,3.8964241676941667,4.9841269841269762,2.8600964851826309,5.0600064871877954,4.7175480769230687,3.1865284974093235,2.2250476795931449,0.49064146829002686,3.4312210200927451,2.1802652281411516,3.4701368034701279,3.1249999999999862,4.9116501946690674]
[null,"Public well",14.483272756593694,14.497925388743024,4.6758226840899786,1.4355725318091794,0.43641095090307641,6.1466847409476921,1.3811304006903198,0.65252799803008465,0.55999864699636526,0.19555743548562327,14.616358585274458,15.75862895781904,15.477047326228693,17.553102845197785,7.0216012032468536,18.622327790973991,10.424804687500096,18.234519104084352,1.5363605326049841,8.236744759556025,8.98412698412697,10.0275671950379,3.8923126824521495,5.258413461538451,6.0621761658031081,23.140495867768685,0.72687624931855832,0.83462132921174881,11.418296246347474,10.110110110110085,8.4865196078430998,3.653788559448941]
[null,"Private well",20.439818859053659,20.958693617653122,11.599890725966057,5.5314723276381708,3.0566433405875584,11.005701372701878,6.5958723367965781,4.5613539980958171,3.0759168602480504,1.8571459209742724,20.478061072355789,20.381166893755363,24.298882278139278,23.632894154106044,18.055510129535815,26.152019002375464,32.885742187500284,14.255599472990795,1.058381700238989,27.003699136867855,7.3650793650793549,6.4093728463128858,9.3415504378851555,14.242788461538424,22.072538860103645,6.2937062937063253,1.5264401235689726,1.7619783616692479,8.6086761069903197,11.011011011010979,16.452205882352885,29.439952081461534]
[null,"River",15.136327240564732,5.7425359992782647,0.62635660161830875,2.8780103195072397E-2,0,1.0465227453436563,8.621069115130528E-2,0,0,0,17.907915951498481,14.823577991245621,11.075384858796403,3.4781871009304388,1.0250872698417604,10.427553444180591,9.4970703125000924,7.3781291172595642,1.9801980198019795,2.1701602959309292,6.2539682539682451,1.2405237767057198,0.29192345118391116,14.09254807692305,1.424870466321243,7.5015893197711767,0.19989096856260352,0,5.6192402787143099,11.177844511177813,12.714460784313669,2.3060796645702335]
[null,"Spring",28.742793177407965,11.81044842202998,1.1823514299497189,0.56454745999476408,5.0559519219117138E-2,1.2562731227789048,8.8748010031763552E-2,0.16405623830084387,0.10919956780219538,0,33.143086376816719,30.298490071260435,21.4146766371775,7.7431827982439874,3.2097484795353135,15.581947743468033,22.924804687500199,15.942028985507269,0.81939228405599163,2.4167694204685346,9.4603174603174445,9.9931082012405188,1.9785922802465092,31.730769230769152,2.9274611398963719,13.000635727908522,0,0.43276661514683273,16.632951224994351,7.9746413079746183,18.443627450980333,2.0964360587002124]
[null,"Rainwater",0.31847022917147599,0.27119581133412834,0.17572164116698205,9.099335381685475E-2,0.17620246503616796,9.2599734979291456E-2,0.12540465554735028,0.16041361961341497,7.6048961658563119E-2,0.23450630398258787,0.11853038036518945,0.57931322006055508,0.5218580738781482,0.18818951452820881,7.5376077615769088E-2,0.7600950118764892,0.97656250000000921,2.635046113306987E-2,0,0,0,0.51688490696071643,0.25948751216347654,0.30048076923076861,0.15544041450777196,0,0,0.37094281298299947,0,0,0,0.77867625037436461]
[null,"Purified water",0,0,0.16335206061958335,0.48278246866634333,4.0457714538020371,0.13293263397738075,0.15481023551784998,0.52569952662265174,1.7455082962156661,5.5015858377972977,0,0,0,0,0.27410507073872181,0,0.80566406250000744,2.3188405797101486,0.17070672584499821,0.49321824907521111,0.34920634920634863,0.31013094417642989,0.64871878040869158,1.2620192307692284,0.12953367875647664,0.28607755880483282,1.2356896238415493,0.21638330757341637,2.629804450438296,1.3346680013346646,0.27573529411764591,1.1081162024558266]
[null,"Other",5.6804495924916577E-2,5.6838040895663532E-3,0.15085188828104934,0.16724064604928787,0.12464891657546617,0.20431572716709093,7.1886589351480124E-2,0.24409427635327924,1.7557079595195275E-2,0.20217099512945708,0,6.5299987282828278E-2,0,0,0.13189268896388467,9.5011876484561164E-2,0,0,0.78525093888699193,0,0,0.17229496898690547,9.7307817061303717E-2,0.18028846153846115,0,0,0.16354715609667561,0,0,0.16683350016683307,0,0]
[]
[]
[]
[]
[]
[]
[]
[]
[]
[]
[]
[]
[]
[]
[]
[]
[]
[]
[]
[]
[]
[]
[]
[]
[]
[]
[]
[]
[]
[]
[]
[]
[]
[]
[]
[]
[]
[]
[]
[{"$f":"A1026","v":"Nicaragua"}]
[{"$f":"A1034","v":"2001"}]
["Use of sanitation facilities"]
[" by wealth quintile and sub-national region"]
["Notes:"]
["WHO/UNICEF JMP customised wealth index excludes water,"]
[" sanitation and hygiene assets."]
["Survey used for analysis:",{"$f":"A1025","v":"DHS01"}]
[{"$f":"B1030","v":"Ratio of Improved latrines based on:"}]
[{"$f":"B1029","v":"Ratio of Shared improved based on:"},"all shared"]
[]
[]
["Use of sanitation facilities",null,"NATIONAL wealth index quintile",null,null,null,null,"URBAN wealth index quintile",null,null,null,null,"RURAL wealth index quintile",null,null,null,null,"SUB-REGIONS:",null,null,null,null,null,null,null,null,null,null,null,null,null,null,null,null,null,null,null,null,null,null,null,null,null,null,null,null,null,null,null,null,null,null,"Raw numbers of respondents:","Use of sanitation facilities","NATIONAL wealth index quintile",null,null,null,null,"URBAN wealth index quintile",null,null,null,null,"RURAL wealth index quintile",null,null,null,null,"SUB-REGIONS:"]
["Weighted percentage (used in graphs)",null,"Poorest","Poor","Middle","Rich","Richest","Poorest","Poor","Middle","Rich","Richest","Poorest","Poor","Middle","Rich","Richest","Atl ntico Norte(Raan)","Atl ntico Sur(Raas)","Boaco","Carazo","Chinandega","Chontales","Estel¡","Granada","Jinotega","Le¢n","Madriz","Managua","Masaya","Matagalpa","Nueva Segovia","R¡o San Juan","Rivas",null,null,null,null,null,null,null,null,null,null,null,null,null,null,null,null,null,null,"Sanitation data, raw numbers (weighted)",null,"Poorest","Poor","Middle","Rich","Richest","Poorest","Poor","Middle","Rich","Richest","Poorest","Poor","Middle","Rich","Richest","Atl ntico Norte(Raan)","Atl ntico Sur(Raas)","Boaco","Carazo","Chinandega","Chontales","Estel¡","Granada","Jinotega","Le¢n","Madriz","Managua","Masaya","Matagalpa","Nueva Segovia","R¡o San Juan","Rivas"]
["Sanitation","Improved",{"$f":"C153+C154+C155+C159+C158*0.5","v":29.184298675297935},{"$f":"D153+D154+D155+D159+D158*0.5","v":48.792859780542557},57.227003864282835,69.720856549083138,89.273065203454081,51.403606142821019,61.240034306998787,69.472088328318549,81.395999647216485,94.862137685089507,21.325385726290499,32.089030048744135,45.155474660229501,51.618657494716928,59.777278131570824,35.369622058474206,42.325581395349161,42.714097496706287,62.649368385114393,58.203799654576471,53.873015873015746,58.209471137227752,62.098083793439315,34.263729631864734,63.453554748313422,55.311004784689132,79.261415317446165,61.653786707882674,54.465691788526371,51.951951951951848,41.482843137254804,52.969406118776256,null,null,null,null,null,null,null,null,null,null,null,null,null,null,null,null,null,null,"Sanitation","Improved","N/A","N/A","N/A","N/A","N/A","N/A","N/A","N/A","N/A","N/A","N/A","N/A","N/A","N/A","N/A","N/A","N/A","N/A","N/A","N/A","N/A","N/A","N/A","N/A","N/A","N/A","N/A","N/A","N/A","N/A","N/A","N/A"]
[null,"Not Improved",{"$f":"100-C122","v":70.815701324702061},{"$f":"100-D122","v":51.207140219457443},42.772996135717165,30.279143450916862,10.726934796545919,48.596393857178981,38.759965693001213,30.527911671681451,18.604000352783515,5.1378623149104925,78.674614273709494,67.910969951255865,54.844525339770499,48.381342505283072,40.222721868429176,64.630377941525794,57.674418604650839,57.285902503293713,37.350631614885607,41.796200345423529,46.126984126984254,41.790528862772248,37.901916206560685,65.736270368135266,36.546445251686578,44.688995215310868,20.738584682553835,38.346213292117326,45.534308211473629,48.048048048048152,58.517156862745196,47.030593881223744,null,null,null,null,null,null,null,null,null,null,null,null,null,null,null,null,null,null,null,"Not Improved","N/A","N/A","N/A","N/A","N/A","N/A","N/A","N/A","N/A","N/A","N/A","N/A","N/A","N/A","N/A","N/A","N/A","N/A","N/A","N/A","N/A","N/A","N/A","N/A","N/A","N/A","N/A","N/A","N/A","N/A","N/A","N/A"]
["Sanitation ladder","Basic",{"$f":"C122*C129/100","v":27.363278287867626},{"$f":"D122*D129/100","v":44.682493901360907},51.289756470636746,63.8244226331161,85.647376448025057,46.215171835800874,54.99718482333676,63.708395952926075,76.509556146421104,92.439684572342742,20.161993569804487,30.339830572131078,42.740177004634589,46.543296575072837,53.207329941767092,32.165036308511361,40.695285706973635,40.856962822936453,58.466547053764025,53.071045765665097,50.764957264957147,56.02688879237482,54.955812175024576,32.294549767964462,57.290100641115707,51.870804487093935,72.339664072704466,52.800109765497425,52.739773905154671,49.332365121838713,39.814323787767449,48.867033144036498,null,null,null,null,null,null,null,null,null,null,null,null,null,null,null,null,null,null,"Sanitation ladder","Basic","N/A","N/A","N/A","N/A","N/A","N/A","N/A","N/A","N/A","N/A","N/A","N/A","N/A","N/A","N/A","N/A","N/A","N/A","N/A","N/A","N/A","N/A","N/A","N/A","N/A","N/A","N/A","N/A","N/A","N/A","N/A","N/A"]
[null,"Limited",{"$f":"C122*C128/100","v":1.8210203874303119},{"$f":"D122*D128/100","v":4.1103658791816544},5.9372473936460857,5.89643391596704,3.6256887554290271,5.1884343070201409,6.2428494836620283,5.7636923753924778,4.8864435007953775,2.4224531127467803,1.163392156486013,1.7491994766130563,2.4152976555949119,5.0753609196440914,6.5699481898037311,3.2045857499628436,1.6302956883755257,1.8571346737698398,4.1828213313503664,5.1327538889113784,3.1080586080585988,2.1825823448529325,7.1422716184147408,1.9691798639002733,6.1634541071977189,3.4402002975952031,6.92175124474171,8.8536769423852455,1.7259178833716957,2.6195868301131369,1.6685193494873578,4.1023729747397581,null,null,null,null,null,null,null,null,null,null,null,null,null,null,null,null,null,null,null,"Limited","N/A","N/A","N/A","N/A","N/A","N/A","N/A","N/A","N/A","N/A","N/A","N/A","N/A","N/A","N/A","N/A","N/A","N/A","N/A","N/A","N/A","N/A","N/A","N/A","N/A","N/A","N/A","N/A","N/A","N/A","N/A","N/A"]
[null,"Unimproved",{"$f":"100-(C124+C125+C127)","v":19.647300796380677},{"$f":"100-(D124+D125+D127)","v":32.343731279639428},37.514711645300764,28.817005234340414,10.327012817831118,38.002460229764935,35.496241695256614,29.527745080855439,17.984956883951838,5.04730651400304,15.125069122412839,20.958729493963645,29.41732687599341,32.03906465689974,34.482695879253896,27.430473021154725,23.525091799265013,28.27404479578378,29.395698190508682,28.349370836417975,28.507936507936677,33.667473211199493,29.26274764533953,18.059746529873451,29.177477944992233,29.856459330143323,18.501000545751907,32.720247295208509,24.971878515185708,38.705372038705505,24.54044117647075,35.002999400119961,null,null,null,null,null,null,null,null,null,null,null,null,null,null,null,null,null,null,null,"Unimproved","N/A","N/A","N/A","N/A","N/A","N/A","N/A","N/A","N/A","N/A","N/A","N/A","N/A","N/A","N/A","N/A","N/A","N/A","N/A","N/A","N/A","N/A","N/A","N/A","N/A","N/A","N/A","N/A","N/A","N/A","N/A","N/A"]
[null,"Open defecation",{"$f":"C160+C161","v":51.168400528321385},{"$f":"D160+D161","v":18.863408939818008},5.2582844904164041,1.4621382165764436,0.39992197871479951,10.593933627414049,3.2637239977445986,1.000166590826016,0.61904346883167571,9.0555800907442821E-2,63.54954515129667,46.95224045729222,25.427198463777092,16.342277848383329,5.7400259891752761,37.199904920371068,34.149326805385826,29.011857707509929,7.9549334243769252,13.44682950900555,17.619047619047585,8.1230556515727574,8.6391685612211599,47.676523838261815,7.3689673066943424,14.832535885167543,2.2375841368019067,5.6259659969088247,20.562429696287932,9.3426760093426449,33.976715686274446,12.02759448110379,null,null,null,null,null,null,null,null,null,null,null,null,null,null,null,null,null,null,null,"Open defecation","N/A","N/A","N/A","N/A","N/A","N/A","N/A","N/A","N/A","N/A","N/A","N/A","N/A","N/A","N/A","N/A","N/A","N/A","N/A","N/A","N/A","N/A","N/A","N/A","N/A","N/A","N/A","N/A","N/A","N/A","N/A","N/A"]
["Shared among Improved Sanitation","Yes",6.2397263942876693,8.4241134823189263,10.374905189386837,8.4572023463538191,4.0613467759464195,10.09352202373598,10.194065947720357,8.2964144508709889,6.0032968720502478,2.5536564659638099,5.4554331228426625,5.451082422734415,5.3488478944551439,9.8324155760221874,10.990711513065484,9.0602770497940828,3.8517975055025864,4.3478260869565242,6.6765578635014817,8.8185890257558093,5.7692307692307656,3.7495313085864237,11.50159744408945,5.7471264367816124,9.7133314778736519,6.2197392923650145,8.732813080639211,14.360313315926902,3.1688166012338685,5.0423260949576658,4.0221914008321633,7.7447969976117506,null,null,null,null,null,null,null,null,null,null,null,null,null,null,null,null,null,null,"Shared among improved sanitation facilities","Yes","N/A","N/A","N/A","N/A","N/A","N/A","N/A","N/A","N/A","N/A","N/A","N/A","N/A","N/A","N/A","N/A","N/A","N/A","N/A","N/A","N/A","N/A","N/A","N/A","N/A","N/A","N/A","N/A","N/A","N/A","N/A","N/A"]
[null,"No",93.760273605712328,91.57588651768107,89.625094810613163,91.54279765364619,95.938653224053581,89.906477976264014,89.805934052279639,91.703585549129016,93.996703127949758,97.446343534036203,94.544566877157337,94.548917577265584,94.651152105544853,90.167584423977814,89.009288486934508,90.939722950205919,96.148202494497411,95.652173913043484,93.323442136498514,91.181410974244187,94.230769230769241,96.250468691413573,88.498402555910559,94.252873563218387,90.286668522126348,93.780260707634994,91.267186919360796,85.639686684073098,96.831183398766129,94.957673905042341,95.977808599167844,92.255203002388242,null,null,null,null,null,null,null,null,null,null,null,null,null,null,null,null,null,null,null,"No","N/A","N/A","N/A","N/A","N/A","N/A","N/A","N/A","N/A","N/A","N/A","N/A","N/A","N/A","N/A","N/A","N/A","N/A","N/A","N/A","N/A","N/A","N/A","N/A","N/A","N/A","N/A","N/A","N/A","N/A","N/A","N/A"]
["Manually calculated ratios","Improved latrines"]
[null,"Other"]
[null,"Other"]
[null,null,"NATIONAL wealth index quintile",null,null,null,null,"URBAN wealth index quintile",null,null,null,null,"RURAL wealth index quintile",null,null,null,null,"SUB-REGIONS:",null,null,null,null,null,null,null,null,null,null,null,null,null,null,null,null,null,null,null,null,null,null,null,null,null,null,null,null,null,null,null,null,null,null,"Raw numbers of respondents:","Use of sanitation facilities","NATIONAL wealth index quintile",null,null,null,null,"URBAN wealth index quintile",null,null,null,null,"RURAL wealth index quintile",null,null,null,null,"SUB-REGIONS:"]
["Percentage based on weighted population",null,"Poorest","Poor","Middle","Rich","Richest","Poorest","Poor","Middle","Rich","Richest","Poorest","Poor","Middle","Rich","Richest","Atl ntico Norte(Raan)","Atl ntico Sur(Raas)","Boaco","Carazo","Chinandega","Chontales","Estel¡","Granada","Jinotega","Le¢n","Madriz","Managua","Masaya","Matagalpa","Nueva Segovia","R¡o San Juan","Rivas",null,null,null,null,null,null,null,null,null,null,null,null,null,null,null,null,null,null,"Sanitation data, raw numbers (weighted)",null,"Poorest","Poor","Middle","Rich","Richest","Poorest","Poor","Middle","Rich","Richest","Poorest","Poor","Middle","Rich","Richest","Atl ntico Norte(Raan)","Atl ntico Sur(Raas)","Boaco","Carazo","Chinandega","Chontales","Estel¡","Granada","Jinotega","Le¢n","Madriz","Managua","Masaya","Matagalpa","Nueva Segovia","R¡o San Juan","Rivas"]
["Sanitation type","Sewer connection",{"$f":"C153","v":4.2473122743376902E-3},{"$f":"D153","v":0.65718103925348315},5.5469236239257693,22.186588465197435,54.901162025269144,2.7092430902702183,11.217320312353891,22.099173978391757,43.908496428205225,66.486013417086269,0,0,0,7.2140403745655293E-2,0.42818332608989201,0.26146898027097859,1.272949816401481,8.9591567852437546,2.3898941618299752,8.3395016037502288,1.1746031746031729,15.036294503975107,12.081844754790485,5.0090525045262417,19.512195121951223,3.8277511961722674,44.678915772239527,10.108191653786733,6.0967379077615185,3.2699366032699282,3.2781862745097894,6.0887822435512957,null,null,null,null,null,null,null,null,null,null,null,null,null,null,null,null,null,null,"Sanitation type","Sewer connection","N/A","N/A","N/A","N/A","N/A","N/A","N/A","N/A","N/A","N/A","N/A","N/A","N/A","N/A","N/A","N/A","N/A","N/A","N/A","N/A","N/A","N/A","N/A","N/A","N/A","N/A","N/A","N/A","N/A","N/A","N/A","N/A"]
[null,"Septic tank connection",{"$f":"C154","v":2.1236561371688452E-2},2.4630146191624895E-2,0.52203357950521523,1.8677997757677507,4.3675503866383174,9.7479634927551406E-2,1.0222371221226747,1.9627253335511523,2.7871784184710715,4.6673528947210814,4.9245793795517009E-2,0,1.5373165209772322E-2,4.1557734946548415E-2,1.7977394693135178,1.2122652721654461,5.8261933904529322,0.60606060606060708,1.0242403550699894,1.159634838391304,1.3015873015872996,0.38022813688212898,2.1760311789542017,0.63367531683765688,1.8162947586922669,0.22328548644338225,1.0187374931781039,1.1746522411128315,1.8447694038245188,0.46713380046713254,0.7965686274509769,0.56988602279544176,null,null,null,null,null,null,null,null,null,null,null,null,null,null,null,null,null,null,null,"Septic tank connection","N/A","N/A","N/A","N/A","N/A","N/A","N/A","N/A","N/A","N/A","N/A","N/A","N/A","N/A","N/A","N/A","N/A","N/A","N/A","N/A","N/A","N/A","N/A","N/A","N/A","N/A","N/A","N/A","N/A","N/A","N/A","N/A"]
[null,"Improved latrines","N/A","N/A","N/A","N/A","N/A","N/A","N/A","N/A","N/A","N/A","N/A","N/A","N/A","N/A","N/A","N/A","N/A","N/A","N/A","N/A","N/A","N/A","N/A","N/A","N/A","N/A","N/A","N/A","N/A","N/A","N/A","N/A",null,null,null,null,null,null,null,null,null,null,null,null,null,null,null,null,null,null,null,"Improved latrines","N/A","N/A","N/A","N/A","N/A","N/A","N/A","N/A","N/A","N/A","N/A","N/A","N/A","N/A","N/A","N/A","N/A","N/A","N/A","N/A","N/A","N/A","N/A","N/A","N/A","N/A","N/A","N/A","N/A","N/A","N/A","N/A"]
[null,"Unimproved facilities","N/A","N/A","N/A","N/A","N/A","N/A","N/A","N/A","N/A","N/A","N/A","N/A","N/A","N/A","N/A","N/A","N/A","N/A","N/A","N/A","N/A","N/A","N/A","N/A","N/A","N/A","N/A","N/A","N/A","N/A","N/A","N/A",null,null,null,null,null,null,null,null,null,null,null,null,null,null,null,null,null,null,null,"Unimproved facilities","N/A","N/A","N/A","N/A","N/A","N/A","N/A","N/A","N/A","N/A","N/A","N/A","N/A","N/A","N/A","N/A","N/A","N/A","N/A","N/A","N/A","N/A","N/A","N/A","N/A","N/A","N/A","N/A","N/A","N/A","N/A","N/A"]
[null,"Open defecation",{"$f":"C160+C161","v":51.168400528321385},{"$f":"D160+D161","v":18.863408939818008},5.2582844904164041,1.4621382165764436,0.39992197871479951,10.593933627414049,3.2637239977445986,1.000166590826016,0.61904346883167571,9.0555800907442821E-2,63.54954515129667,46.95224045729222,25.427198463777092,16.342277848383329,5.7400259891752761,37.199904920371068,34.149326805385826,29.011857707509929,7.9549334243769252,13.44682950900555,17.619047619047585,8.1230556515727574,8.6391685612211599,47.676523838261815,7.3689673066943424,14.832535885167543,2.2375841368019067,5.6259659969088247,20.562429696287932,9.3426760093426449,33.976715686274446,12.02759448110379,null,null,null,null,null,null,null,null,null,null,null,null,null,null,null,null,null,null,null,"Open defecation","N/A","N/A","N/A","N/A","N/A","N/A","N/A","N/A","N/A","N/A","N/A","N/A","N/A","N/A","N/A","N/A","N/A","N/A","N/A","N/A","N/A","N/A","N/A","N/A","N/A","N/A","N/A","N/A","N/A","N/A","N/A","N/A"]
["Septic tank emptying practices","Not emptied/treated and disposed in situ","N/A","N/A","N/A","N/A","N/A","N/A","N/A","N/A","N/A","N/A","N/A","N/A","N/A","N/A","N/A","N/A","N/A","N/A","N/A","N/A","N/A","N/A","N/A","N/A","N/A","N/A","N/A","N/A","N/A","N/A","N/A","N/A",null,null,null,null,null,null,null,null,null,null,null,null,null,null,null,null,null,null,"Septic tank emptying practices","Not emptied/treated and disposed in situ","N/A","N/A","N/A","N/A","N/A","N/A","N/A","N/A","N/A","N/A","N/A","N/A","N/A","N/A","N/A","N/A","N/A","N/A","N/A","N/A","N/A","N/A","N/A","N/A","N/A","N/A","N/A","N/A","N/A","N/A","N/A","N/A"]
[null,"Emptied and buried on site","N/A","N/A","N/A","N/A","N/A","N/A","N/A","N/A","N/A","N/A","N/A","N/A","N/A","N/A","N/A","N/A","N/A","N/A","N/A","N/A","N/A","N/A","N/A","N/A","N/A","N/A","N/A","N/A","N/A","N/A","N/A","N/A",null,null,null,null,null,null,null,null,null,null,null,null,null,null,null,null,null,null,null,"Emptied and buried on site","N/A","N/A","N/A","N/A","N/A","N/A","N/A","N/A","N/A","N/A","N/A","N/A","N/A","N/A","N/A","N/A","N/A","N/A","N/A","N/A","N/A","N/A","N/A","N/A","N/A","N/A","N/A","N/A","N/A","N/A","N/A","N/A"]
[null,"Emptied and discharged locally","N/A","N/A","N/A","N/A","N/A","N/A","N/A","N/A","N/A","N/A","N/A","N/A","N/A","N/A","N/A","N/A","N/A","N/A","N/A","N/A","N/A","N/A","N/A","N/A","N/A","N/A","N/A","N/A","N/A","N/A","N/A","N/A",null,null,null,null,null,null,null,null,null,null,null,null,null,null,null,null,null,null,null,"Emptied and discharged locally","N/A","N/A","N/A","N/A","N/A","N/A","N/A","N/A","N/A","N/A","N/A","N/A","N/A","N/A","N/A","N/A","N/A","N/A","N/A","N/A","N/A","N/A","N/A","N/A","N/A","N/A","N/A","N/A","N/A","N/A","N/A","N/A"]
[null,"Emptied and removed offsite","N/A","N/A","N/A","N/A","N/A","N/A","N/A","N/A","N/A","N/A","N/A","N/A","N/A","N/A","N/A","N/A","N/A","N/A","N/A","N/A","N/A","N/A","N/A","N/A","N/A","N/A","N/A","N/A","N/A","N/A","N/A","N/A",null,null,null,null,null,null,null,null,null,null,null,null,null,null,null,null,null,null,null,"Emptied and removed offsite","N/A","N/A","N/A","N/A","N/A","N/A","N/A","N/A","N/A","N/A","N/A","N/A","N/A","N/A","N/A","N/A","N/A","N/A","N/A","N/A","N/A","N/A","N/A","N/A","N/A","N/A","N/A","N/A","N/A","N/A","N/A","N/A"]
["Latrine emptying practices","Not emptied/treated and disposed in situ","N/A","N/A","N/A","N/A","N/A","N/A","N/A","N/A","N/A","N/A","N/A","N/A","N/A","N/A","N/A","N/A","N/A","N/A","N/A","N/A","N/A","N/A","N/A","N/A","N/A","N/A","N/A","N/A","N/A","N/A","N/A","N/A",null,null,null,null,null,null,null,null,null,null,null,null,null,null,null,null,null,null,"Latrine emptying practices","Not emptied/treated and disposed in situ","N/A","N/A","N/A","N/A","N/A","N/A","N/A","N/A","N/A","N/A","N/A","N/A","N/A","N/A","N/A","N/A","N/A","N/A","N/A","N/A","N/A","N/A","N/A","N/A","N/A","N/A","N/A","N/A","N/A","N/A","N/A","N/A"]
[null,"Emptied and buried on site","N/A","N/A","N/A","N/A","N/A","N/A","N/A","N/A","N/A","N/A","N/A","N/A","N/A","N/A","N/A","N/A","N/A","N/A","N/A","N/A","N/A","N/A","N/A","N/A","N/A","N/A","N/A","N/A","N/A","N/A","N/A","N/A",null,null,null,null,null,null,null,null,null,null,null,null,null,null,null,null,null,null,null,"Emptied and buried on site","N/A","N/A","N/A","N/A","N/A","N/A","N/A","N/A","N/A","N/A","N/A","N/A","N/A","N/A","N/A","N/A","N/A","N/A","N/A","N/A","N/A","N/A","N/A","N/A","N/A","N/A","N/A","N/A","N/A","N/A","N/A","N/A"]
[null,"Emptied and discharged locally","N/A","N/A","N/A","N/A","N/A","N/A","N/A","N/A","N/A","N/A","N/A","N/A","N/A","N/A","N/A","N/A","N/A","N/A","N/A","N/A","N/A","N/A","N/A","N/A","N/A","N/A","N/A","N/A","N/A","N/A","N/A","N/A",null,null,null,null,null,null,null,null,null,null,null,null,null,null,null,null,null,null,null,"Emptied and discharged locally","N/A","N/A","N/A","N/A","N/A","N/A","N/A","N/A","N/A","N/A","N/A","N/A","N/A","N/A","N/A","N/A","N/A","N/A","N/A","N/A","N/A","N/A","N/A","N/A","N/A","N/A","N/A","N/A","N/A","N/A","N/A","N/A"]
[null,"Emptied and removed offsite","N/A","N/A","N/A","N/A","N/A","N/A","N/A","N/A","N/A","N/A","N/A","N/A","N/A","N/A","N/A","N/A","N/A","N/A","N/A","N/A","N/A","N/A","N/A","N/A","N/A","N/A","N/A","N/A","N/A","N/A","N/A","N/A",null,null,null,null,null,null,null,null,null,null,null,null,null,null,null,null,null,null,null,"Emptied and removed offsite","N/A","N/A","N/A","N/A","N/A","N/A","N/A","N/A","N/A","N/A","N/A","N/A","N/A","N/A","N/A","N/A","N/A","N/A","N/A","N/A","N/A","N/A","N/A","N/A","N/A","N/A","N/A","N/A","N/A","N/A","N/A","N/A"]
["Shared among improved sanitation facilities","Yes","N/A","N/A","N/A","N/A","N/A","N/A","N/A","N/A","N/A","N/A","N/A","N/A","N/A","N/A","N/A","N/A","N/A","N/A","N/A","N/A","N/A","N/A","N/A","N/A","N/A","N/A","N/A","N/A","N/A","N/A","N/A","N/A",null,null,null,null,null,null,null,null,null,null,null,null,null,null,null,null,null,null,"Shared among improved sanitation facilities","Yes","N/A","N/A","N/A","N/A","N/A","N/A","N/A","N/A","N/A","N/A","N/A","N/A","N/A","N/A","N/A","N/A","N/A","N/A","N/A","N/A","N/A","N/A","N/A","N/A","N/A","N/A","N/A","N/A","N/A","N/A","N/A","N/A"]
[null,"No","N/A","N/A","N/A","N/A","N/A","N/A","N/A","N/A","N/A","N/A","N/A","N/A","N/A","N/A","N/A","N/A","N/A","N/A","N/A","N/A","N/A","N/A","N/A","N/A","N/A","N/A","N/A","N/A","N/A","N/A","N/A","N/A",null,null,null,null,null,null,null,null,null,null,null,null,null,null,null,null,null,null,null,"No","N/A","N/A","N/A","N/A","N/A","N/A","N/A","N/A","N/A","N/A","N/A","N/A","N/A","N/A","N/A","N/A","N/A","N/A","N/A","N/A","N/A","N/A","N/A","N/A","N/A","N/A","N/A","N/A","N/A","N/A","N/A","N/A"]
[null,"DK/missing","N/A","N/A","N/A","N/A","N/A","N/A","N/A","N/A","N/A","N/A","N/A","N/A","N/A","N/A","N/A","N/A","N/A","N/A","N/A","N/A","N/A","N/A","N/A","N/A","N/A","N/A","N/A","N/A","N/A","N/A","N/A","N/A",null,null,null,null,null,null,null,null,null,null,null,null,null,null,null,null,null,null,null,"DK/missing","N/A","N/A","N/A","N/A","N/A","N/A","N/A","N/A","N/A","N/A","N/A","N/A","N/A","N/A","N/A","N/A","N/A","N/A","N/A","N/A","N/A","N/A","N/A","N/A","N/A","N/A","N/A","N/A","N/A","N/A","N/A","N/A"]
["Shared among all sanitation facilities","Yes",6.2326349960968708,8.4163878430088435,10.374905189386833,8.4513020526714655,4.0588023965040261,10.093522023735957,10.194065947720345,8.2862738991476999,6.0032968720502495,2.5515913648880382,5.4554331228426625,5.437972784726635,5.3385753111956404,9.8290330707010565,10.986286405516262,9.0602770497940952,3.8391224862888707,4.3429844097995582,6.6765578635014808,8.8185890257558004,5.7692307692307638,3.7495313085864228,11.481218993621528,5.7471264367816106,9.713331477873643,6.2197392923650181,8.7247076294784254,14.360313315926915,3.1688166012338703,5.042326094957664,4.0221914008321615,7.7132178049609381,null,null,null,null,null,null,null,null,null,null,null,null,null,null,null,null,null,null,"Shared among all sanitation facilities","Yes","N/A","N/A","N/A","N/A","N/A","N/A","N/A","N/A","N/A","N/A","N/A","N/A","N/A","N/A","N/A","N/A","N/A","N/A","N/A","N/A","N/A","N/A","N/A","N/A","N/A","N/A","N/A","N/A","N/A","N/A","N/A","N/A"]
[null,"No",93.653715818943823,91.491903524073308,89.625094810613135,91.478931451970908,95.878548940804507,89.906477976263801,89.80593405227954,91.591497977084629,93.996703127949786,97.36754023706014,94.544566877157337,94.321531163459781,94.469372428912052,90.136565359359395,88.973451346275667,90.939722950206033,95.831809872029339,95.545657015590223,93.3234421364985,91.181410974244102,94.230769230769198,96.250468691413545,88.341601700921274,94.252873563218358,90.286668522126277,93.780260707635037,91.182476331910195,85.639686684073169,96.831183398766171,94.957673905042299,95.977808599167801,91.879034998301037,null,null,null,null,null,null,null,null,null,null,null,null,null,null,null,null,null,null,null,"No","N/A","N/A","N/A","N/A","N/A","N/A","N/A","N/A","N/A","N/A","N/A","N/A","N/A","N/A","N/A","N/A","N/A","N/A","N/A","N/A","N/A","N/A","N/A","N/A","N/A","N/A","N/A","N/A","N/A","N/A","N/A","N/A"]
["Type of toilet facility","Flush toilet (sewer)",4.2473122743376902E-3,0.65718103925348315,5.5469236239257693,22.186588465197435,54.901162025269144,2.7092430902702183,11.217320312353891,22.099173978391757,43.908496428205225,66.486013417086269,0,0,0,7.2140403745655293E-2,0.42818332608989201,0.26146898027097859,1.272949816401481,8.9591567852437546,2.3898941618299752,8.3395016037502288,1.1746031746031729,15.036294503975107,12.081844754790485,5.0090525045262417,19.512195121951223,3.8277511961722674,44.678915772239527,10.108191653786733,6.0967379077615185,3.2699366032699282,3.2781862745097894,6.0887822435512957,null,null,null,null,null,null,null,null,null,null,null,null,null,null,null,null,null,null,"Type of toilet facility","Flush toilet (sewer)",0.51155399999999995,79.187176999999991,669.25254600000017,2673.386399999993,6614.7224939999987,185.45094100000003,766.67592400000024,1512.1588929999989,3002.4493389999921,4544.2162350000008,0,0,0,3.7597839999999998,22.349055000000003,9.5523009999999999,43.92913200000001,173.92835999999994,49.358820000000001,407.36909199999991,21.110016999999999,428.3727750000001,149.1582359999999,188.71892600000001,848.11236800000063,66.355800000000002,6797.1298159999733,320.95867499999991,320.0480189999999,67.166750000000008,31.697572999999995,114.09351099999996]
[null,"Flust toilet (septic tank)",2.1236561371688452E-2,2.4630146191624895E-2,0.52203357950521523,1.8677997757677507,4.3675503866383174,9.7479634927551406E-2,1.0222371221226747,1.9627253335511523,2.7871784184710715,4.6673528947210814,4.9245793795517009E-2,0,1.5373165209772322E-2,4.1557734946548415E-2,1.7977394693135178,1.2122652721654461,5.8261933904529322,0.60606060606060708,1.0242403550699894,1.159634838391304,1.3015873015872996,0.38022813688212898,2.1760311789542017,0.63367531683765688,1.8162947586922669,0.22328548644338225,1.0187374931781039,1.1746522411128315,1.8447694038245188,0.46713380046713254,0.7965686274509769,0.56988602279544176,null,null,null,null,null,null,null,null,null,null,null,null,null,null,null,null,null,null,null,"Flust toilet (septic tank)",2.5577700000000001,2.9678150000000003,62.98487699999999,225.06166400000001,526.22080699999981,6.6725979999999998,69.867362999999997,134.30151599999999,190.58639399999998,319.00635500000004,2.5577700000000001,0,0.80192600000000003,2.165889,93.833122000000017,44.287941000000004,201.06025800000003,11.765741999999999,21.153780000000001,56.645997999999992,23.392181000000001,10.832414999999999,26.864521,23.874080999999997,78.946629999999999,3.8707549999999999,154.98341600000001,37.297949999999993,96.841097999999988,9.5952500000000001,7.7022139999999988,10.678703000000001]
[null,"Flush toilet (sink-sumidero)",4.6720435017714591E-2,0.39570196341600639,1.5855024732758465,7.2020046374305382,16.139411225312635,0.29663005116742525,2.9556773450347777,6.9063137331180817,11.421654999274226,16.766645250800618,6.8944111313723813E-2,0,0.17462856787389319,0.59560758421336246,7.4978709944581254,1.7114333254100413,1.6156670746634179,3.6363636363636429,14.817343803345857,3.7256353318529127,7.4920634920634814,3.6985827860352551,9.158817797986341,1.2975256487628215,3.0098598858328987,1.3397129186602936,8.2954338730216985,7.5425038639876556,3.5770528683914451,2.0353687020353637,1.0110294117647014,4.4391121775644926,null,null,null,null,null,null,null,null,null,null,null,null,null,null,null,null,null,null,null,"Flush toilet (sink-sumidero)",5.6270939999999996,47.680197000000014,191.29550699999999,867.80990600000052,1944.5440229999979,20.304683000000004,202.01318999999998,472.57167800000002,781.00921900000014,1145.9742830000002,3.5808779999999998,0,9.1093270000000004,31.041631999999996,391.35183700000022,62.524151999999994,55.756206000000006,70.594452000000004,306.02468400000021,181.99033399999996,134.64767600000002,105.36985500000002,113.071566,48.885022999999997,130.82584399999996,23.224530000000001,1262.0078159999994,239.49209999999999,187.77725099999998,41.80787500000001,9.7758869999999991,83.181475999999975]
[null,"Flush toilet (rivers)",2.1236561371688452E-2,0.1501636437754891,0.72828496147339683,0.65727365740849886,0.85888209768860135,0.89889985674690298,0.77350766966955675,0.75208513263471111,0.76245229555678995,0.71785556323733934,0,4.8998151504376385E-2,3.9226582780555158E-2,8.3310739857786156E-2,0.291119036734935,1.7352032327074032,0.51407588739290577,4.9011857707509945,0,0,6.3492063492063391E-2,0,0,1.3578756789378363,0.36325895173845341,6.3795853269537794E-2,9.0958704748044988E-2,0,0.60742407199100024,0,0,0,null,null,null,null,null,null,null,null,null,null,null,null,null,null,null,null,null,null,null,"Flush toilet (rivers)",2.5577700000000001,18.094002,87.869709000000014,79.198587000000003,103.48172099999998,61.530773999999994,52.867323999999996,51.462204999999997,52.136250999999994,49.064318,0,2.5577700000000001,2.0462159999999998,4.3419549999999996,15.194976,63.392542999999996,17.740611000000001,95.149043999999961,0,0,1.1410819999999999,0,0,51.158744999999996,15.789326000000001,1.1059300000000001,13.837804999999999,0,31.886703000000004,0,0,0]
[null,"Flush toilet (rain water sewer)",0,0,5.7579442397274312E-2,0,6.8614167787856423E-2,0.10149022932821224,0,0,0.12089734681040311,0,0,0,0,0,0,0.1901592583788935,0,0,0,0,0,0,0,0,0,0,0,0,0.15748031496062967,0,0,0,null,null,null,null,null,null,null,null,null,null,null,null,null,null,null,null,null,null,null,"Flush toilet (rain water sewer)",0,0,6.9471280000000002,0,8.2669230000000002,6.9471280000000002,0,0,8.2669230000000002,0,0,0,0,0,0,6.9471280000000002,0,0,0,0,0,0,0,0,0,0,0,0,8.2669230000000002,0,0,0]
[null,"Traditional pit toilet",38.760328276649908,63.96728477456697,73.45769448285958,56.187374900520304,18.799033104708986,74.004140287378235,69.445468051173052,57.318717589881494,34.203214483168288,8.6589019015307311,29.672211533083175,41.760664903113295,57.285126782554229,63.911507834084048,68.383153685037115,51.010221060138214,45.679314565483764,45.797101449275488,58.791396381017435,56.698741672834721,56.888888888888737,67.334946422398843,58.52549529067872,30.869040434520141,57.628437986507485,59.585326953748073,36.820083682008487,65.440494590417444,48.413948256467933,77.410744077410612,49.080882352941124,70.005998800239936,null,null,null,null,null,null,null,null,null,null,null,null,null,null,null,null,null,null,null,"Traditional pit toilet",4668.3642950000112,7707.7523530000281,8862.8855180000282,6770.331732000026,2264.9864329999955,5065.6722179999988,4746.4248949999919,3922.0926819999831,2338.805175999993,591.82255899999996,1541.1406060000006,2179.9633779999995,2988.2221359999903,3330.9137749999873,3569.2629059999854,1863.5670860000012,1576.3800059999951,889.08085200000096,1214.2269720000011,2769.6277320000154,1022.4094719999987,1918.32222,722.53532600000051,1163.0088029999997,2504.8637889999995,1032.9386199999963,5601.5434639999812,2077.8884249999983,2541.4883280000035,1590.0700000000013,474.57487800000155,1311.7943579999978]
[null,"Ventilated improved pit toilet",9.7319302283092401,15.731704244397962,12.843696946146215,10.37077622042726,4.4654250138794902,11.298183222766708,11.322065501900919,9.8445164883168133,6.1770625596818149,2.6126751717161794,6.3710900546396694,11.208697597187491,16.322909535868721,18.953597854769335,15.861907499190728,6.6793439505586347,10.771113831089449,6.613965744400538,15.022191874359859,16.629657044164663,15.460317460317427,5.4268924991358425,9.4186424163689324,11.888955944477944,10.300985988583287,20.127591706539157,6.8582863380025936,10.108191653786733,18.74015748031492,7.474140807474118,11.856617647058771,6.8686262747450586,null,null,null,null,null,null,null,null,null,null,null,null,null,null,null,null,null,null,null,"Ventilated improved pit toilet",1172.131341999999,1895.5952379999981,1549.6295720000005,1249.6329549999991,538.01315299999999,773.37420099999929,773.83499700000004,673.62124800000038,422.38561800000019,178.57230900000002,330.90710400000012,585.10922500000004,851.46847600000012,987.81584600000042,827.91323600000078,244.01787100000001,371.70803999999993,128.40005399999998,310.25544000000031,812.32771600000012,277.85346699999985,154.60810500000002,116.27927000000001,447.92323399999992,447.74017300000014,348.92091499999975,1043.3704970000001,320.95867499999991,983.76383699999951,153.52399999999994,114.64449299999998,128.70647299999996]
[null,"NO FACILITY",50.823198997321441,17.382088120428008,4.5209658066129021,1.337171691863779,0.25873739819902875,10.153753616860916,2.9394189183133279,0.8329463991161995,0.46079235469821217,0,63.526340287278657,46.331309511233073,24.157003911036842,14.404654263081335,4.600330903222126,36.581887330639667,33.31701346389255,29.011857707509929,7.9549334243769252,11.867752282259945,17.460317460317427,8.1230556515727574,8.3793439428385685,44.870247435123623,6.9278671510119345,14.704944178628468,2.0374749863562078,5.2859350850077416,19.932508436445413,9.3426760093426449,33.731617647058762,11.877624475104989,null,null,null,null,null,null,null,null,null,null,null,null,null,null,null,null,null,null,null,"NO FACILITY",6121.2383409999975,2094.4586139999997,545.46773700000006,161.12331200000003,31.173768000000003,695.03662100000008,200.90196700000004,56.995221000000008,31.508838000000001,0,3299.4851919999774,2418.5572289999977,1260.126281999999,750.73586800000021,240.114554,1336.4537490000012,1149.7605509999983,563.22095400000001,164.29435800000016,579.71755400000018,313.79754999999989,231.41977500000002,103.44845400000001,1690.5123070000002,301.12500300000016,254.91686500000014,309.96683200000001,167.84077499999998,1046.356254,191.90499999999986,326.15913900000078,222.56665199999989]
[null,"Bush/field (Abonera)",0.34520153099994055,1.4813208193900014,0.73731868380350174,0.12496652471266452,0.14118458051577079,0.44018001055313266,0.32430507943127079,0.16722019170981658,0.1582511141334636,9.0555800907442821E-2,2.3204864018010276E-2,0.62093094605914934,1.2701945527402505,1.9376235853019941,1.1396950859531505,0.61801758973140386,0.83231334149327585,0,0,1.5790772267456059,0.15873015873015847,0,0.25982461838259124,2.8062764031381953,0.44110015568240768,0.12759170653907559,0.20010915044569896,0.34003091190108287,0.62992125984251868,0,0.24509803921568518,0.14997000599880048,null,null,null,null,null,null,null,null,null,null,null,null,null,null,null,null,null,null,null,"Bush/field (Abonera)",41.576699000000005,178.492085,88.959654000000015,15.057917,17.010511000000001,30.130849999999999,22.165445000000002,11.442214999999999,10.821162000000001,6.189349,1.2052339999999999,32.413437999999999,66.258446000000006,100.984272,59.486455000000007,22.578166,28.722894,0,0,77.134976000000009,2.8527049999999998,0,3.2077040000000001,105.72807299999999,19.172753,2.2118600000000002,30.443171,10.796775,33.067692000000001,0,2.3699119999999998,2.8101850000000002]
[null,"Hanging letrine (colgante)",0.2459000966838544,0.20992524858041683,0,6.6044126671673878E-2,0,0,0,0.11630115327949148,0,0,0.28896335587073207,2.9398890902625825E-2,0.73553690193554799,0,0,0,0.17135862913096855,0.47430830039525784,0,0,0,0,0,1.267350633675314,0,0,0,0,0,0,0,0,null,null,null,null,null,null,null,null,null,null,null,null,null,null,null,null,null,null,null,"Hanging letrine (colgante)",29.616653999999997,25.294990000000002,0,7.9580270000000004,0,0,0,7.9580270000000004,0,0,15.008424999999999,1.534662,38.368557000000003,0,0,0,5.9135369999999998,9.2079720000000016,0,0,0,0,0,47.748162000000001,0,0,0,0,0,0,0,0]
[null,null,null,null,null,null,null,null,null,null,null,null,null,null,null,null,null,null,null,null,null,null,null,null,null,null,null,null,null,null,null,null,null,null,null,null,null,null,null,null,null,null,null,null,null,null,null,null,null,null,null,null,null,"Total",12044.181519000031,12049.522471000031,12065.292248000065,12049.560500000031,12048.419833000013,6845.1200140000456,6834.7511050000285,6842.6036850000155,6837.9689200000203,6834.8454080000238,5193.8852090000046,5220.1357019999969,5216.4013659999991,5211.7590209999844,5219.506141000008,3653.3209369999772,3450.9712349999677,1941.3474299999966,2065.3140540000009,4884.8134020000462,1797.2041500000028,2848.925145000002,1234.5650770000025,3767.5573540000082,4346.5758860000024,1733.5452749999918,15213.282816999899,3175.2333749999912,5249.4961050000084,2054.0688750000054,966.92409600000417,1873.8313579999974]
[]
[]
[]
[]
[]
[]
[]
[]
[]
[]
[]
[]
[]
[]
[]
[]
[]
[]
[]
[]
[]
[]
[]
[]
[]
[]
[]
[]
[]
[]
[]
[]
[]
[]
[]
[]
[]
[]
[]
[]
[]
[]
[]
[]
[{"$f":"A1026","v":"Nicaragua"}]
[{"$f":"A1034","v":"2001"}]
["Access to hygiene facilities "]
[" by wealth quintile and sub-national region"]
["Notes:"]
["WHO/UNICEF JMP customised wealth index excludes water,"]
[" sanitation and hygiene assets."]
["Survey used for analysis:",{"$f":"A1025","v":"DHS01"}]
[]
[]
[]
[]
["Access to handwashing",null,"NATIONAL wealth index quintile",null,null,null,null,"URBAN wealth index quintile",null,null,null,null,"RURAL wealth index quintile",null,null,null,null,"SUB-REGIONS:",null,null,null,null,null,null,null,null,null,null,null,null,null,null,null,null,null,null,null,null,null,null,null,null,null,null,null,null,null,null,null,null,null,null,"Raw numbers of respondents:","Access to handwashing","NATIONAL wealth index quintile",null,null,null,null,"URBAN wealth index quintile",null,null,null,null,"RURAL wealth index quintile",null,null,null,null,"SUB-REGIONS:"]
["Weighted percentage (used in graphs)",null,"Poorest","Poor","Middle","Rich","Richest","Poorest","Poor","Middle","Rich","Richest","Poorest","Poor","Middle","Rich","Richest","Atl ntico Norte(Raan)","Atl ntico Sur(Raas)","Boaco","Carazo","Chinandega","Chontales","Estel¡","Granada","Jinotega","Le¢n","Madriz","Managua","Masaya","Matagalpa","Nueva Segovia","R¡o San Juan","Rivas",null,null,null,null,null,null,null,null,null,null,null,null,null,null,null,null,null,null,"Hygiene data, raw numbers (weighted)",null,"Poorest","Poor","Middle","Rich","Richest","Poorest","Poor","Middle","Rich","Richest","Poorest","Poor","Middle","Rich","Richest","Atl ntico Norte(Raan)","Atl ntico Sur(Raas)","Boaco","Carazo","Chinandega","Chontales","Estel¡","Granada","Jinotega","Le¢n","Madriz","Managua","Masaya","Matagalpa","Nueva Segovia","R¡o San Juan","Rivas"]
["Hygiene ladder","Basic","N/A","N/A","N/A","N/A","N/A","N/A","N/A","N/A","N/A","N/A","N/A","N/A","N/A","N/A","N/A","N/A","N/A","N/A","N/A","N/A","N/A","N/A","N/A","N/A","N/A","N/A","N/A","N/A","N/A","N/A","N/A","N/A",null,null,null,null,null,null,null,null,null,null,null,null,null,null,null,null,null,null,"Hygiene ladder","Basic","N/A","N/A","N/A","N/A","N/A","N/A","N/A","N/A","N/A","N/A","N/A","N/A","N/A","N/A","N/A","N/A","N/A","N/A","N/A","N/A","N/A","N/A","N/A","N/A","N/A","N/A","N/A","N/A","N/A","N/A","N/A","N/A"]
[null,"Limited","N/A","N/A","N/A","N/A","N/A","N/A","N/A","N/A","N/A","N/A","N/A","N/A","N/A","N/A","N/A","N/A","N/A","N/A","N/A","N/A","N/A","N/A","N/A","N/A","N/A","N/A","N/A","N/A","N/A","N/A","N/A","N/A",null,null,null,null,null,null,null,null,null,null,null,null,null,null,null,null,null,null,null,"Limited","N/A","N/A","N/A","N/A","N/A","N/A","N/A","N/A","N/A","N/A","N/A","N/A","N/A","N/A","N/A","N/A","N/A","N/A","N/A","N/A","N/A","N/A","N/A","N/A","N/A","N/A","N/A","N/A","N/A","N/A","N/A","N/A"]
[null,"No facility","N/A","N/A","N/A","N/A","N/A","N/A","N/A","N/A","N/A","N/A","N/A","N/A","N/A","N/A","N/A","N/A","N/A","N/A","N/A","N/A","N/A","N/A","N/A","N/A","N/A","N/A","N/A","N/A","N/A","N/A","N/A","N/A",null,null,null,null,null,null,null,null,null,null,null,null,null,null,null,null,null,null,null,"No facility","N/A","N/A","N/A","N/A","N/A","N/A","N/A","N/A","N/A","N/A","N/A","N/A","N/A","N/A","N/A","N/A","N/A","N/A","N/A","N/A","N/A","N/A","N/A","N/A","N/A","N/A","N/A","N/A","N/A","N/A","N/A","N/A"]
[null,null,null,null,null,null,null,null,null,null,null,null,null,null,null,null,null,null,null,null,null,null,null,null,null,null,null,null,null,null,null,null,null,null,null,null,null,null,null,null,null,null,null,null,null,null,null,null,null,null,null,null,"Observed handwashing place","Fixed","N/A","N/A","N/A","N/A","N/A","N/A","N/A","N/A","N/A","N/A","N/A","N/A","N/A","N/A","N/A","N/A","N/A","N/A","N/A","N/A","N/A","N/A","N/A","N/A","N/A","N/A","N/A","N/A","N/A","N/A","N/A","N/A"]
[null,null,null,null,null,null,null,null,null,null,null,null,null,null,null,null,null,null,null,null,null,null,null,null,null,null,null,null,null,null,null,null,null,null,null,null,null,null,null,null,null,null,null,null,null,null,null,null,null,null,null,null,null,"Mobile","N/A","N/A","N/A","N/A","N/A","N/A","N/A","N/A","N/A","N/A","N/A","N/A","N/A","N/A","N/A","N/A","N/A","N/A","N/A","N/A","N/A","N/A","N/A","N/A","N/A","N/A","N/A","N/A","N/A","N/A","N/A","N/A"]
[null,null,null,null,null,null,null,null,null,null,null,null,null,null,null,null,null,null,null,null,null,null,null,null,null,null,null,null,null,null,null,null,null,null,null,null,null,null,null,null,null,null,null,null,null,null,null,null,null,null,null,null,"Water / Soap","Water and soap","N/A","N/A","N/A","N/A","N/A","N/A","N/A","N/A","N/A","N/A","N/A","N/A","N/A","N/A","N/A","N/A","N/A","N/A","N/A","N/A","N/A","N/A","N/A","N/A","N/A","N/A","N/A","N/A","N/A","N/A","N/A","N/A"]
[null,null,null,null,null,null,null,null,null,null,null,null,null,null,null,null,null,null,null,null,null,null,null,null,null,null,null,null,null,null,null,null,null,null,null,null,null,null,null,null,null,null,null,null,null,null,null,null,null,null,null,null,null,"Water only","N/A","N/A","N/A","N/A","N/A","N/A","N/A","N/A","N/A","N/A","N/A","N/A","N/A","N/A","N/A","N/A","N/A","N/A","N/A","N/A","N/A","N/A","N/A","N/A","N/A","N/A","N/A","N/A","N/A","N/A","N/A","N/A"]
[null,null,null,null,null,null,null,null,null,null,null,null,null,null,null,null,null,null,null,null,null,null,null,null,null,null,null,null,null,null,null,null,null,null,null,null,null,null,null,null,null,null,null,null,null,null,null,null,null,null,null,null,null,"Soap only","N/A","N/A","N/A","N/A","N/A","N/A","N/A","N/A","N/A","N/A","N/A","N/A","N/A","N/A","N/A","N/A","N/A","N/A","N/A","N/A","N/A","N/A","N/A","N/A","N/A","N/A","N/A","N/A","N/A","N/A","N/A","N/A"]
[null,null,null,null,null,null,null,null,null,null,null,null,null,null,null,null,null,null,null,null,null,null,null,null,null,null,null,null,null,null,null,null,null,null,null,null,null,null,null,null,null,null,null,null,null,null,null,null,null,null,null,null,null,"Neither","N/A","N/A","N/A","N/A","N/A","N/A","N/A","N/A","N/A","N/A","N/A","N/A","N/A","N/A","N/A","N/A","N/A","N/A","N/A","N/A","N/A","N/A","N/A","N/A","N/A","N/A","N/A","N/A","N/A","N/A","N/A","N/A"]
[]
[]
[]
[]
[]
[]
[]
[]
[]
[]
[]
[]
[]
[]
[]
[]
[]
[]
[]
[]
[]
[]
[]
[]
[]
[]
[]
[]
[null,null,null,null,null,null,null,null,null,null,null,null,null,null,null,null,null,null,null,null,null,null,null,null,null,null,null,null,null,null,null,null,null,null,null,null,null,null,null,null,null,null,null,null,null,null,null,null,null,null,null,null,"Raw numbers of respondents:","Menstrual health and hygiene","NATIONAL wealth index quintile",null,null,null,null,"URBAN wealth index quintile",null,null,null,null,"RURAL wealth index quintile",null,null,null,null,"SUB-REGIONS:"]
[null,null,null,null,null,null,null,null,null,null,null,null,null,null,null,null,null,null,null,null,null,null,null,null,null,null,null,null,null,null,null,null,null,null,null,null,null,null,null,null,null,null,null,null,null,null,null,null,null,null,null,null,"MHH data, raw numbers (weighted)",null,"Poorest","Poor","Middle","Rich","Richest","Poorest","Poor","Middle","Rich","Richest","Poorest","Poor","Middle","Rich","Richest","Atl ntico Norte(Raan)","Atl ntico Sur(Raas)","Boaco","Carazo","Chinandega","Chontales","Estel¡","Granada","Jinotega","Le¢n","Madriz","Managua","Masaya","Matagalpa","Nueva Segovia","R¡o San Juan","Rivas"]
[null,null,null,null,null,null,null,null,null,null,null,null,null,null,null,null,null,null,null,null,null,null,null,null,null,null,null,null,null,null,null,null,null,null,null,null,null,null,null,null,null,null,null,null,null,null,null,null,null,null,null,null,"Private place to wash and change","Yes","N/A","N/A","N/A","N/A","N/A","N/A","N/A","N/A","N/A","N/A","N/A","N/A","N/A","N/A","N/A","N/A","N/A","N/A","N/A","N/A","N/A","N/A","N/A","N/A","N/A","N/A","N/A","N/A","N/A","N/A","N/A","N/A"]
[null,null,null,null,null,null,null,null,null,null,null,null,null,null,null,null,null,null,null,null,null,null,null,null,null,null,null,null,null,null,null,null,null,null,null,null,null,null,null,null,null,null,null,null,null,null,null,null,null,null,null,null,null,"No","N/A","N/A","N/A","N/A","N/A","N/A","N/A","N/A","N/A","N/A","N/A","N/A","N/A","N/A","N/A","N/A","N/A","N/A","N/A","N/A","N/A","N/A","N/A","N/A","N/A","N/A","N/A","N/A","N/A","N/A","N/A","N/A"]
[null,null,null,null,null,null,null,null,null,null,null,null,null,null,null,null,null,null,null,null,null,null,null,null,null,null,null,null,null,null,null,null,null,null,null,null,null,null,null,null,null,null,null,null,null,null,null,null,null,null,null,null,null,"DK/not sure/missing","N/A","N/A","N/A","N/A","N/A","N/A","N/A","N/A","N/A","N/A","N/A","N/A","N/A","N/A","N/A","N/A","N/A","N/A","N/A","N/A","N/A","N/A","N/A","N/A","N/A","N/A","N/A","N/A","N/A","N/A","N/A","N/A"]
[null,null,null,null,null,null,null,null,null,null,null,null,null,null,null,null,null,null,null,null,null,null,null,null,null,null,null,null,null,null,null,null,null,null,null,null,null,null,null,null,null,null,null,null,null,null,null,null,null,null,null,null,"Use of menstrual materials","Materials reusable","N/A","N/A","N/A","N/A","N/A","N/A","N/A","N/A","N/A","N/A","N/A","N/A","N/A","N/A","N/A","N/A","N/A","N/A","N/A","N/A","N/A","N/A","N/A","N/A","N/A","N/A","N/A","N/A","N/A","N/A","N/A","N/A"]
[null,null,null,null,null,null,null,null,null,null,null,null,null,null,null,null,null,null,null,null,null,null,null,null,null,null,null,null,null,null,null,null,null,null,null,null,null,null,null,null,null,null,null,null,null,null,null,null,null,null,null,null,null,"Materials not reusable","N/A","N/A","N/A","N/A","N/A","N/A","N/A","N/A","N/A","N/A","N/A","N/A","N/A","N/A","N/A","N/A","N/A","N/A","N/A","N/A","N/A","N/A","N/A","N/A","N/A","N/A","N/A","N/A","N/A","N/A","N/A","N/A"]
[null,null,null,null,null,null,null,null,null,null,null,null,null,null,null,null,null,null,null,null,null,null,null,null,null,null,null,null,null,null,null,null,null,null,null,null,null,null,null,null,null,null,null,null,null,null,null,null,null,null,null,null,null,"No materials used","N/A","N/A","N/A","N/A","N/A","N/A","N/A","N/A","N/A","N/A","N/A","N/A","N/A","N/A","N/A","N/A","N/A","N/A","N/A","N/A","N/A","N/A","N/A","N/A","N/A","N/A","N/A","N/A","N/A","N/A","N/A","N/A"]
[null,null,null,null,null,null,null,null,null,null,null,null,null,null,null,null,null,null,null,null,null,null,null,null,null,null,null,null,null,null,null,null,null,null,null,null,null,null,null,null,null,null,null,null,null,null,null,null,null,null,null,null,null,"DK/not sure/missing","N/A","N/A","N/A","N/A","N/A","N/A","N/A","N/A","N/A","N/A","N/A","N/A","N/A","N/A","N/A","N/A","N/A","N/A","N/A","N/A","N/A","N/A","N/A","N/A","N/A","N/A","N/A","N/A","N/A","N/A","N/A","N/A"]
[null,null,null,null,null,null,null,null,null,null,null,null,null,null,null,null,null,null,null,null,null,null,null,null,null,null,null,null,null,null,null,null,null,null,null,null,null,null,null,null,null,null,null,null,null,null,null,null,null,null,null,null,"Use of menstrual materials with private place to wash and change","Materials reusable","N/A","N/A","N/A","N/A","N/A","N/A","N/A","N/A","N/A","N/A","N/A","N/A","N/A","N/A","N/A","N/A","N/A","N/A","N/A","N/A","N/A","N/A","N/A","N/A","N/A","N/A","N/A","N/A","N/A","N/A","N/A","N/A"]
[null,null,null,null,null,null,null,null,null,null,null,null,null,null,null,null,null,null,null,null,null,null,null,null,null,null,null,null,null,null,null,null,null,null,null,null,null,null,null,null,null,null,null,null,null,null,null,null,null,null,null,null,null,"Materials not reusable","N/A","N/A","N/A","N/A","N/A","N/A","N/A","N/A","N/A","N/A","N/A","N/A","N/A","N/A","N/A","N/A","N/A","N/A","N/A","N/A","N/A","N/A","N/A","N/A","N/A","N/A","N/A","N/A","N/A","N/A","N/A","N/A"]
[null,null,null,null,null,null,null,null,null,null,null,null,null,null,null,null,null,null,null,null,null,null,null,null,null,null,null,null,null,null,null,null,null,null,null,null,null,null,null,null,null,null,null,null,null,null,null,null,null,null,null,null,null,"No materials used","N/A","N/A","N/A","N/A","N/A","N/A","N/A","N/A","N/A","N/A","N/A","N/A","N/A","N/A","N/A","N/A","N/A","N/A","N/A","N/A","N/A","N/A","N/A","N/A","N/A","N/A","N/A","N/A","N/A","N/A","N/A","N/A"]
[null,null,null,null,null,null,null,null,null,null,null,null,null,null,null,null,null,null,null,null,null,null,null,null,null,null,null,null,null,null,null,null,null,null,null,null,null,null,null,null,null,null,null,null,null,null,null,null,null,null,null,null,"Awareness of menstruation before menarche","Yes","N/A","N/A","N/A","N/A","N/A","N/A","N/A","N/A","N/A","N/A","N/A","N/A","N/A","N/A","N/A","N/A","N/A","N/A","N/A","N/A","N/A","N/A","N/A","N/A","N/A","N/A","N/A","N/A","N/A","N/A","N/A","N/A"]
[null,null,null,null,null,null,null,null,null,null,null,null,null,null,null,null,null,null,null,null,null,null,null,null,null,null,null,null,null,null,null,null,null,null,null,null,null,null,null,null,null,null,null,null,null,null,null,null,null,null,null,null,null,"No","N/A","N/A","N/A","N/A","N/A","N/A","N/A","N/A","N/A","N/A","N/A","N/A","N/A","N/A","N/A","N/A","N/A","N/A","N/A","N/A","N/A","N/A","N/A","N/A","N/A","N/A","N/A","N/A","N/A","N/A","N/A","N/A"]
[null,null,null,null,null,null,null,null,null,null,null,null,null,null,null,null,null,null,null,null,null,null,null,null,null,null,null,null,null,null,null,null,null,null,null,null,null,null,null,null,null,null,null,null,null,null,null,null,null,null,null,null,null,"DK/not sure/missing","N/A","N/A","N/A","N/A","N/A","N/A","N/A","N/A","N/A","N/A","N/A","N/A","N/A","N/A","N/A","N/A","N/A","N/A","N/A","N/A","N/A","N/A","N/A","N/A","N/A","N/A","N/A","N/A","N/A","N/A","N/A","N/A"]
[null,null,null,null,null,null,null,null,null,null,null,null,null,null,null,null,null,null,null,null,null,null,null,null,null,null,null,null,null,null,null,null,null,null,null,null,null,null,null,null,null,null,null,null,null,null,null,null,null,null,null,null,"Participation in (all) activities during menstruation","Yes","N/A","N/A","N/A","N/A","N/A","N/A","N/A","N/A","N/A","N/A","N/A","N/A","N/A","N/A","N/A","N/A","N/A","N/A","N/A","N/A","N/A","N/A","N/A","N/A","N/A","N/A","N/A","N/A","N/A","N/A","N/A","N/A"]
[null,null,null,null,null,null,null,null,null,null,null,null,null,null,null,null,null,null,null,null,null,null,null,null,null,null,null,null,null,null,null,null,null,null,null,null,null,null,null,null,null,null,null,null,null,null,null,null,null,null,null,null,null,"No","N/A","N/A","N/A","N/A","N/A","N/A","N/A","N/A","N/A","N/A","N/A","N/A","N/A","N/A","N/A","N/A","N/A","N/A","N/A","N/A","N/A","N/A","N/A","N/A","N/A","N/A","N/A","N/A","N/A","N/A","N/A","N/A"]
[null,null,null,null,null,null,null,null,null,null,null,null,null,null,null,null,null,null,null,null,null,null,null,null,null,null,null,null,null,null,null,null,null,null,null,null,null,null,null,null,null,null,null,null,null,null,null,null,null,null,null,null,null,"DK/not sure/missing/no such activity","N/A","N/A","N/A","N/A","N/A","N/A","N/A","N/A","N/A","N/A","N/A","N/A","N/A","N/A","N/A","N/A","N/A","N/A","N/A","N/A","N/A","N/A","N/A","N/A","N/A","N/A","N/A","N/A","N/A","N/A","N/A","N/A"]
[null,null,null,null,null,null,null,null,null,null,null,null,null,null,null,null,null,null,null,null,null,null,null,null,null,null,null,null,null,null,null,null,null,null,null,null,null,null,null,null,null,null,null,null,null,null,null,null,null,null,null,null,"Participation in specific activities during menstruation","Did not go to school (amongst those usually attending school)","N/A","N/A","N/A","N/A","N/A","N/A","N/A","N/A","N/A","N/A","N/A","N/A","N/A","N/A","N/A","N/A","N/A","N/A","N/A","N/A","N/A","N/A","N/A","N/A","N/A","N/A","N/A","N/A","N/A","N/A","N/A","N/A"]
[null,null,null,null,null,null,null,null,null,null,null,null,null,null,null,null,null,null,null,null,null,null,null,null,null,null,null,null,null,null,null,null,null,null,null,null,null,null,null,null,null,null,null,null,null,null,null,null,null,null,null,null,null,"Did not go to work (amongst those who usually work)","N/A","N/A","N/A","N/A","N/A","N/A","N/A","N/A","N/A","N/A","N/A","N/A","N/A","N/A","N/A","N/A","N/A","N/A","N/A","N/A","N/A","N/A","N/A","N/A","N/A","N/A","N/A","N/A","N/A","N/A","N/A","N/A"]
[null,null,null,null,null,null,null,null,null,null,null,null,null,null,null,null,null,null,null,null,null,null,null,null,null,null,null,null,null,null,null,null,null,null,null,null,null,null,null,null,null,null,null,null,null,null,null,null,null,null,null,null,null,"Did not participate in social activities","N/A","N/A","N/A","N/A","N/A","N/A","N/A","N/A","N/A","N/A","N/A","N/A","N/A","N/A","N/A","N/A","N/A","N/A","N/A","N/A","N/A","N/A","N/A","N/A","N/A","N/A","N/A","N/A","N/A","N/A","N/A","N/A"]
[null,null,null,null,null,null,null,null,null,null,null,null,null,null,null,null,null,null,null,null,null,null,null,null,null,null,null,null,null,null,null,null,null,null,null,null,null,null,null,null,null,null,null,null,null,null,null,null,null,null,null,null,null,"Did not cook food","N/A","N/A","N/A","N/A","N/A","N/A","N/A","N/A","N/A","N/A","N/A","N/A","N/A","N/A","N/A","N/A","N/A","N/A","N/A","N/A","N/A","N/A","N/A","N/A","N/A","N/A","N/A","N/A","N/A","N/A","N/A","N/A"]
[null,null,null,null,null,null,null,null,null,null,null,null,null,null,null,null,null,null,null,null,null,null,null,null,null,null,null,null,null,null,null,null,null,null,null,null,null,null,null,null,null,null,null,null,null,null,null,null,null,null,null,null,null,"Did not eat with others","N/A","N/A","N/A","N/A","N/A","N/A","N/A","N/A","N/A","N/A","N/A","N/A","N/A","N/A","N/A","N/A","N/A","N/A","N/A","N/A","N/A","N/A","N/A","N/A","N/A","N/A","N/A","N/A","N/A","N/A","N/A","N/A"]
[null,null,null,null,null,null,null,null,null,null,null,null,null,null,null,null,null,null,null,null,null,null,null,null,null,null,null,null,null,null,null,null,null,null,null,null,null,null,null,null,null,null,null,null,null,null,null,null,null,null,null,null,null,"Did not bathe in regular place","N/A","N/A","N/A","N/A","N/A","N/A","N/A","N/A","N/A","N/A","N/A","N/A","N/A","N/A","N/A","N/A","N/A","N/A","N/A","N/A","N/A","N/A","N/A","N/A","N/A","N/A","N/A","N/A","N/A","N/A","N/A","N/A"]
[null,null,null,null,null,null,null,null,null,null,null,null,null,null,null,null,null,null,null,null,null,null,null,null,null,null,null,null,null,null,null,null,null,null,null,null,null,null,null,null,null,null,null,null,null,null,null,null,null,null,null,null,null,"Did not participate in other activities","N/A","N/A","N/A","N/A","N/A","N/A","N/A","N/A","N/A","N/A","N/A","N/A","N/A","N/A","N/A","N/A","N/A","N/A","N/A","N/A","N/A","N/A","N/A","N/A","N/A","N/A","N/A","N/A","N/A","N/A","N/A","N/A"]
[null,null,null,null,null,null,null,null,null,null,null,null,null,null,null,null,null,null,null,null,null,null,null,null,null,null,null,null,null,null,null,null,null,null,null,null,null,null,null,null,null,null,null,null,null,null,null,null,null,null,null,null,null,"DK/not sure/missing/no such activity","N/A","N/A","N/A","N/A","N/A","N/A","N/A","N/A","N/A","N/A","N/A","N/A","N/A","N/A","N/A","N/A","N/A","N/A","N/A","N/A","N/A","N/A","N/A","N/A","N/A","N/A","N/A","N/A","N/A","N/A","N/A","N/A"]
[]
[]
[]
[]
[]
[]
[]
[]
[]
[]
[]
[]
[]
[]
[]
[]
[]
[]
[]
[]
[]
[]
[]
[]
[]
[]
[]
[]
[]
[]
[]
[]
[]
[]
[]
[]
[]
[]
[]
[]
[]
[]
[]
[]
[]
[]
[]
[]
[]
[]
[]
[]
[]
[]
[null,null,null,null,null,null,null,null,null,null,null,null,null,null,null,null,null,null,null,null,null,null,null,null,null,null,null,null,null,null,null,null,null,null,null,null,null,null,null,null,null,null,null,null,null,null,null,null,null,null,null,null,"Raw numbers of respondents:","Basic water, sanitation and hygiene","NATIONAL wealth index quintile",null,null,null,null,"URBAN wealth index quintile",null,null,null,null,"RURAL wealth index quintile",null,null,null,null,"SUB-REGIONS:"]
[null,null,null,null,null,null,null,null,null,null,null,null,null,null,null,null,null,null,null,null,null,null,null,null,null,null,null,null,null,null,null,null,null,null,null,null,null,null,null,null,null,null,null,null,null,null,null,null,null,null,null,null,"WatSan data, raw numbers (weighted)",null,"Poorest","Poor","Middle","Rich","Richest","Poorest","Poor","Middle","Rich","Richest","Poorest","Poor","Middle","Rich","Richest","Atl ntico Norte(Raan)","Atl ntico Sur(Raas)","Boaco","Carazo","Chinandega","Chontales","Estel¡","Granada","Jinotega","Le¢n","Madriz","Managua","Masaya","Matagalpa","Nueva Segovia","R¡o San Juan","Rivas"]
[null,null,null,null,null,null,null,null,null,null,null,null,null,null,null,null,null,null,null,null,null,null,null,null,null,null,null,null,null,null,null,null,null,null,null,null,null,null,null,null,null,null,null,null,null,null,null,null,null,null,null,null,"Use of Basic Water Sanitation and Hygiene","Yes","N/A","N/A","N/A","N/A","N/A","N/A","N/A","N/A","N/A","N/A","N/A","N/A","N/A","N/A","N/A","N/A","N/A","N/A","N/A","N/A","N/A","N/A","N/A","N/A","N/A","N/A","N/A","N/A","N/A","N/A","N/A","N/A"]
[null,null,null,null,null,null,null,null,null,null,null,null,null,null,null,null,null,null,null,null,null,null,null,null,null,null,null,null,null,null,null,null,null,null,null,null,null,null,null,null,null,null,null,null,null,null,null,null,null,null,null,null,null,"No","N/A","N/A","N/A","N/A","N/A","N/A","N/A","N/A","N/A","N/A","N/A","N/A","N/A","N/A","N/A","N/A","N/A","N/A","N/A","N/A","N/A","N/A","N/A","N/A","N/A","N/A","N/A","N/A","N/A","N/A","N/A","N/A"]
[null,null,null,null,null,null,null,null,null,null,null,null,null,null,null,null,null,null,null,null,null,null,null,null,null,null,null,null,null,null,null,null,null,null,null,null,null,null,null,null,null,null,null,null,null,null,null,null,null,null,null,null,"Use of Basic Water and Sanitation","Yes","N/A","N/A","N/A","N/A","N/A","N/A","N/A","N/A","N/A","N/A","N/A","N/A","N/A","N/A","N/A","N/A","N/A","N/A","N/A","N/A","N/A","N/A","N/A","N/A","N/A","N/A","N/A","N/A","N/A","N/A","N/A","N/A"]
[null,null,null,null,null,null,null,null,null,null,null,null,null,null,null,null,null,null,null,null,null,null,null,null,null,null,null,null,null,null,null,null,null,null,null,null,null,null,null,null,null,null,null,null,null,null,null,null,null,null,null,null,null,"No","N/A","N/A","N/A","N/A","N/A","N/A","N/A","N/A","N/A","N/A","N/A","N/A","N/A","N/A","N/A","N/A","N/A","N/A","N/A","N/A","N/A","N/A","N/A","N/A","N/A","N/A","N/A","N/A","N/A","N/A","N/A","N/A"]
[null,null,null,null,null,null,null,null,null,null,null,null,null,null,null,null,null,null,null,null,null,null,null,null,null,null,null,null,null,null,null,null,null,null,null,null,null,null,null,null,null,null,null,null,null,null,null,null,null,null,null,null,"Use of Basic Water and Hygiene","Yes","N/A","N/A","N/A","N/A","N/A","N/A","N/A","N/A","N/A","N/A","N/A","N/A","N/A","N/A","N/A","N/A","N/A","N/A","N/A","N/A","N/A","N/A","N/A","N/A","N/A","N/A","N/A","N/A","N/A","N/A","N/A","N/A"]
[null,null,null,null,null,null,null,null,null,null,null,null,null,null,null,null,null,null,null,null,null,null,null,null,null,null,null,null,null,null,null,null,null,null,null,null,null,null,null,null,null,null,null,null,null,null,null,null,null,null,null,null,null,"No","N/A","N/A","N/A","N/A","N/A","N/A","N/A","N/A","N/A","N/A","N/A","N/A","N/A","N/A","N/A","N/A","N/A","N/A","N/A","N/A","N/A","N/A","N/A","N/A","N/A","N/A","N/A","N/A","N/A","N/A","N/A","N/A"]
[null,null,null,null,null,null,null,null,null,null,null,null,null,null,null,null,null,null,null,null,null,null,null,null,null,null,null,null,null,null,null,null,null,null,null,null,null,null,null,null,null,null,null,null,null,null,null,null,null,null,null,null,"Use of Basic Sanitation and Hygiene","Yes","N/A","N/A","N/A","N/A","N/A","N/A","N/A","N/A","N/A","N/A","N/A","N/A","N/A","N/A","N/A","N/A","N/A","N/A","N/A","N/A","N/A","N/A","N/A","N/A","N/A","N/A","N/A","N/A","N/A","N/A","N/A","N/A"]
[null,null,null,null,null,null,null,null,null,null,null,null,null,null,null,null,null,null,null,null,null,null,null,null,null,null,null,null,null,null,null,null,null,null,null,null,null,null,null,null,null,null,null,null,null,null,null,null,null,null,null,null,null,"No","N/A","N/A","N/A","N/A","N/A","N/A","N/A","N/A","N/A","N/A","N/A","N/A","N/A","N/A","N/A","N/A","N/A","N/A","N/A","N/A","N/A","N/A","N/A","N/A","N/A","N/A","N/A","N/A","N/A","N/A","N/A","N/A"]
[null,null,null,null,null,null,null,null,null,null,null,null,null,null,null,null,null,null,null,null,null,null,null,null,null,null,null,null,null,null,null,null,null,null,null,null,null,null,null,null,null,null,null,null,null,null,null,null,null,null,null,null,"Use of Basic Water","Yes","N/A","N/A","N/A","N/A","N/A","N/A","N/A","N/A","N/A","N/A","N/A","N/A","N/A","N/A","N/A","N/A","N/A","N/A","N/A","N/A","N/A","N/A","N/A","N/A","N/A","N/A","N/A","N/A","N/A","N/A","N/A","N/A"]
[null,null,null,null,null,null,null,null,null,null,null,null,null,null,null,null,null,null,null,null,null,null,null,null,null,null,null,null,null,null,null,null,null,null,null,null,null,null,null,null,null,null,null,null,null,null,null,null,null,null,null,null,null,"No","N/A","N/A","N/A","N/A","N/A","N/A","N/A","N/A","N/A","N/A","N/A","N/A","N/A","N/A","N/A","N/A","N/A","N/A","N/A","N/A","N/A","N/A","N/A","N/A","N/A","N/A","N/A","N/A","N/A","N/A","N/A","N/A"]
[null,null,null,null,null,null,null,null,null,null,null,null,null,null,null,null,null,null,null,null,null,null,null,null,null,null,null,null,null,null,null,null,null,null,null,null,null,null,null,null,null,null,null,null,null,null,null,null,null,null,null,null,"Use of Basic Sanitation","Yes","N/A","N/A","N/A","N/A","N/A","N/A","N/A","N/A","N/A","N/A","N/A","N/A","N/A","N/A","N/A","N/A","N/A","N/A","N/A","N/A","N/A","N/A","N/A","N/A","N/A","N/A","N/A","N/A","N/A","N/A","N/A","N/A"]
[null,null,null,null,null,null,null,null,null,null,null,null,null,null,null,null,null,null,null,null,null,null,null,null,null,null,null,null,null,null,null,null,null,null,null,null,null,null,null,null,null,null,null,null,null,null,null,null,null,null,null,null,null,"No","N/A","N/A","N/A","N/A","N/A","N/A","N/A","N/A","N/A","N/A","N/A","N/A","N/A","N/A","N/A","N/A","N/A","N/A","N/A","N/A","N/A","N/A","N/A","N/A","N/A","N/A","N/A","N/A","N/A","N/A","N/A","N/A"]
[null,null,null,null,null,null,null,null,null,null,null,null,null,null,null,null,null,null,null,null,null,null,null,null,null,null,null,null,null,null,null,null,null,null,null,null,null,null,null,null,null,null,null,null,null,null,null,null,null,null,null,null,"Access to Basic Hygiene","Yes","N/A","N/A","N/A","N/A","N/A","N/A","N/A","N/A","N/A","N/A","N/A","N/A","N/A","N/A","N/A","N/A","N/A","N/A","N/A","N/A","N/A","N/A","N/A","N/A","N/A","N/A","N/A","N/A","N/A","N/A","N/A","N/A"]
[null,null,null,null,null,null,null,null,null,null,null,null,null,null,null,null,null,null,null,null,null,null,null,null,null,null,null,null,null,null,null,null,null,null,null,null,null,null,null,null,null,null,null,null,null,null,null,null,null,null,null,null,null,"No","N/A","N/A","N/A","N/A","N/A","N/A","N/A","N/A","N/A","N/A","N/A","N/A","N/A","N/A","N/A","N/A","N/A","N/A","N/A","N/A","N/A","N/A","N/A","N/A","N/A","N/A","N/A","N/A","N/A","N/A","N/A","N/A"]
[]
[]
[]
[]
[]
[]
[]
[]
[]
[]
[]
[]
[]
[]
[]
[]
[]
[]
[]
[]
[]
[]
[]
[]
[]
[]
[]
[]
[]
[]
[]
[]
[]
[]
[]
[]
[]
[]
[]
[]
[]
[]
[]
[]
[null,null,"INITIAL (national) Wealth Index",null,null,null,null,"URBAN Wealth Index",null,null,null,null,"RURAL Wealth Index"]
[null,null,"Component Matrix",null,null,null,null,"Component Matrix",null,null,null,null,"Component Matrix"]
[null,null,null,null,"Component",null,null,null,null,"Component",null,null,null,null,"Component"]
[null,"Note:\n\nThe INITIAL (national) Wealth Index is based on the first component of the Principal Component Analysis (PCA) which has been obtained at national level.\n\nThe final national-level (NATIONAL) Wealth Index is based on the URBAN and RURAL specific wealth indexes. Regression procedures are used to establish the relationships between the two sets of scores (urban and rural) and the initial (national) wealth factors.\nThis allows best use of the available information for each area and a better precision of the FINAL (NATIONAL) Wealth Index.\n\nFor dependency reasons, all WASH variables (contained in the generic MICS and DHS scripts) have been excluded from the sets of asset variables used in the PCAs.\n\nThe PCA can extracts as many components as there are asset variables in the input. Only the first of the components is used to represent the Wealth Index. \n\nThe scores represent the weights of the asset variables on the Wealth Index (correlations between the variables and the component).\n\nThe communalities are the proportion of each variable's variance that can be explained by the component.\n\nProportion of explained variance is the part of the model's total variance that is explained by the component.\n\nFor more information on the procedure used:\n\nThe DHS Wealth Index, DHS Comparative Reports No. 6, Shea Oscar Rutstein, Kiersten Johnson, ORC Macro International Inc., 2004.\n\nThe DHS Wealth Index: Approaches for Rural and Urban Areas, Shea O. Rutstein, ORC Macro International Inc., 2008.\n\nMICS Methodological Paper No. 4, Review of options for reporting water, sanitation and hygiene coverage by wealth quintile, UNICEF, 2016.",null,null,"1",null,null,null,null,"1",null,null,null,null,"1"]
[null,null,"HH has cooking machine",null,0.80645795735247683,null,null,"HH has cooking machine",null,0.76204466893937994,null,null,"Has electricity",null,0.78181523734568925]
[null,null,"light1",null,0.79209623672926699,null,null,"fuel2",null,0.74413170805564421,null,null,"light1",null,0.7801677285725539]
[null,null,"Has electricity",null,0.78938860826572832,null,null,"fuel7",null,-0.72934893901827136,null,null,"light3",null,-0.77902587579465121]
[null,null,"light3",null,-0.78792690292006085,null,null,"HH has iron",null,0.64084503128866099,null,null,"Has television",null,0.7338041335494091]
[null,null,"fuel7",null,-0.77789425192783768,null,null,"Has electricity",null,0.6298223853034296,null,null,"HH has cooking machine",null,0.68979002419942115]
[null,null,"fuel2",null,0.77667379281864501,null,null,"light1",null,0.62811445573641511,null,null,"HH has fan",null,0.65818132643126026]
[null,null,"Has television",null,0.76414354809984497,null,null,"light3",null,-0.62742905886066846,null,null,"HH has iron",null,0.65683745067012977]
[null,null,"HH has iron",null,0.74232681821426616,null,null,"Has television",null,0.62459553734928985,null,null,"fuel2",null,0.63893534516635908]
[null,null,"HH has fan",null,0.7085020809509569,null,null,"HH has fan",null,0.61390927071688162,null,null,"fuel7",null,-0.6254601300672028]
[null,null,"floor9",null,0.656381847839277,null,null,"floor9",null,0.60787705111364354,null,null,"Has refrigerator",null,0.61275391609516405]
[null,null,"Has refrigerator",null,0.64552830093031466,null,null,"Has refrigerator",null,0.60566201507864126,null,null,"floor9",null,0.50323798560324329]
[null,null,"floor1",null,-0.63026757007047995,null,null,"floor1",null,-0.60288165621783751,null,null,"wall8",null,0.46960715303101802]
[null,null,"wall8",null,0.53577887023960613,null,null,"Has telephone",null,0.5130226124114583,null,null,"floor1",null,-0.45196846238887606]
[null,null,"Has telephone",null,0.50675040019847206,null,null,"wall8",null,0.41933351969918892,null,null,"Has bicycle",null,0.39930396546567309]
[null,null,"wall5",null,-0.43982334122023015,null,null,"Number of members per sleeping room",null,-0.41541401143620871,null,null,"Has car/truck",null,0.39239658863497034]
[null,null,"Number of members per sleeping room",null,-0.42829945229463057,null,null,"Has car/truck",null,0.40062397650827936,null,null,"HH has cellular phone",null,0.37320134101072977]
[null,null,"Has car/truck",null,0.40816585840917835,null,null,"Has radio",null,0.38661190281185293,null,null,"wall5",null,-0.34786787790412604]
[null,null,"Any HH member has livestock (beast)",null,-0.37218195463374076,null,null,"HH has cellular phone",null,0.36048047875620748,null,null,"Number of members per sleeping room",null,-0.30365232410955101]
[null,null,"HH has cellular phone",null,0.37081607810683515,null,null,"wall5",null,-0.33073773971650333,null,null,"Has telephone",null,0.2774832238199117]
[null,null,"Has radio",null,0.29395613977066909,null,null,"HH has computer",null,0.30086772470097312,null,null,"floor7",null,0.27647931901096889]
[null,null,"roof1",null,-0.29331850188515007,null,null,"wall7",null,-0.28616743380325554,null,null,"roof1",null,-0.27528008763488837]
[null,null,"HH has computer",null,0.28476529087392061,null,null,"house1",null,0.26823219941603887,null,null,"house4",null,-0.24753328678011288]
[null,null,"house4",null,-0.27154501563562627,null,null,"house5",null,-0.26341868712695904,null,null,"Have bednet for sleeping",null,0.23235383362262307]
[null,null,"house1",null,0.2714520219355151,null,null,"HH has washing machine",null,0.24868206933692025,null,null,"house1",null,0.21659120727206016]
[null,null,"Has bicycle",null,0.26731100675766606,null,null,"HH has AC (air conditioner)",null,0.22187294774172167,null,null,"HH has computer",null,0.21644329005344584]
[null,null,"HH has washing machine",null,0.23400635448268489,null,null,"roof2",null,-0.188963618493105,null,null,"Any HH member has livestock (beast)",null,-0.19804055383333838]
[null,null,"roof3",null,0.22568918196496043,null,null,"wall3",null,-0.17271950841324371,null,null,"Has motorcycle/scooter",null,0.19526547335610758]
[null,null,"wall1",null,-0.21467725705857504,null,null,"roof4",null,-0.17179962373590849,null,null,"roof3",null,0.19131770979927015]
[null,null,"wall3",null,-0.21084374391171554,null,null,"house4",null,-0.1711792858293385,null,null,"wall1",null,-0.19039056327178777]
[null,null,"HH has AC (air conditioner)",null,0.19896320485684227,null,null,"wall1",null,-0.15380328038598032,null,null,"Has radio",null,0.1884869557801031]
[null,null,"Have bednet for sleeping",null,0.17840972921987489,null,null,"Has motorcycle/scooter",null,0.14880826145167272,null,null,"wall6",null,0.18169212341607996]
[null,null,"Has motorcycle/scooter",null,0.17081495284653631,null,null,"roof3",null,0.14142053851662298,null,null,"wall2",null,0.18084317318741205]
[null,null,"wall7",null,-0.16843024244202087,null,null,"roof5",null,0.12486650844598875,null,null,"HH has washing machine",null,0.17705223361544026]
[null,null,"roof5",null,0.16433796427256023,null,null,"roof1",null,-0.12210897482837547,null,null,"roof5",null,0.15068296200298031]
[null,null,"roof4",null,-0.15091528339582408,null,null,"Any HH member has livestock (beast)",null,-0.11929125437710669,null,null,"wall3",null,-0.1468851595082642]
[null,null,"house5",null,-0.14184916045308388,null,null,"Has bicycle",null,0.10974063880521169,null,null,"floor8",null,0.1277273207163091]
[null,null,"floor4",null,-0.13793403733471699,null,null,"floor4",null,-9.7034220734134494E-2,null,null,"wall10",null,0.12594810826648437]
[null,null,"roof2",null,-0.13527550459887486,null,null,"wall9",null,-9.0760910990290378E-2,null,null,"HH has AC (air conditioner)",null,0.12004574204694354]
[null,null,"floor7",null,0.12546316381245648,null,null,"fuel9",null,-8.4548643840557852E-2,null,null,"floor4",null,-0.11013078195410815]
[null,null,"wall6",null,0.11760412027872859,null,null,"floor8",null,5.7521718845434923E-2,null,null,"roof2",null,-9.8531188276576462E-2]
[null,null,"wall2",null,0.10245209329894743,null,null,"light4",null,-4.8419040894747772E-2,null,null,"wall7",null,-9.6608437754637289E-2]
[null,null,"floor8",null,8.8700853056096762E-2,null,null,"wall6",null,4.5951484615369811E-2,null,null,"fuel1",null,8.2796100446490273E-2]
[null,null,"wall10",null,8.0576449169663819E-2,null,null,"floor7",null,-3.4281631509450794E-2,null,null,"house5",null,-8.2483832909591479E-2]
[null,null,"fuel1",null,6.5942505204314911E-2,null,null,"house3",null,-3.0294457341291391E-2,null,null,"house2",null,8.0768398623040236E-2]
[null,null,"fuel4",null,4.3044722672253365E-2,null,null,"fuel6",null,-2.9824390326133519E-2,null,null,"fuel4",null,7.6451610778649398E-2]
[null,null,"light2",null,-3.6533827128479211E-2,null,null,"fuel1",null,2.8010179421495529E-2,null,null,"roof4",null,-5.288012015289982E-2]
[null,null,"Any HH member has boat?",null,-3.5903086848237654E-2,null,null,"house2",null,2.5453414808960486E-2,null,null,"house7",null,3.8100566513934987E-2]
[null,null,"light4",null,-3.2811651352316652E-2,null,null,"Have bednet for sleeping",null,-1.9516632953467023E-2,null,null,"wall9",null,3.5389970302223593E-2]
[null,null,"fuel6",null,2.0488427575672395E-2,null,null,"light2",null,-1.8841485628073518E-2,null,null,"Any HH member has boat?",null,-3.3449504755414076E-2]
[null,null,"wall9",null,-1.8031338552576E-2,null,null,"house6",null,-1.6058136495229528E-2,null,null,"light2",null,3.0744388923297967E-2]
[null,null,"fuel9",null,-1.298936954043442E-2,null,null,"wall2",null,1.3135647795128777E-2,null,null,"light4",null,-2.0726417011523508E-2]
[null,null,"house7",null,1.2359932853548449E-2,null,null,"house7",null,-1.1741196154322531E-2,null,null,"house3",null,-1.868963932400132E-2]
[null,null,"house2",null,6.7410180489646766E-3,null,null,"fuel4",null,-8.9406567852896458E-3,null,null,"house6",null,1.2500650409846187E-2]
[null,null,"house3",null,3.6019650017213118E-3,null,null,"Any HH member has boat?",null,4.3063975895852556E-3,null,null,"fuel6",null,8.4100594569985251E-3]
[null,null,"house6",null,2.9386941215621219E-3,null,null,"wall10",null,3.5179591795973112E-3,null,null,"fuel9",null,4.7545353552415634E-3]
[]
[]
[]
[null,null,"Communalities",null,null,null,null,"Communalities",null,null,null,null,"Communalities"]
[null,null,null,null,"Extraction",null,null,null,null,"Extraction",null,null,null,null,"Extraction"]
[null,null,"Number of members per sleeping room",null,0.18344042083588052,null,null,"Number of members per sleeping room",null,0.17256880089752255,null,null,"Number of members per sleeping room",null,9.2204733937131814E-2]
[null,null,"floor1",null,0.39723720988254735,null,null,"floor1",null,0.3634662914039628,null,null,"floor1",null,0.20427549099416487]
[null,null,"floor4",null,1.90257986554551E-2,null,null,"floor4",null,9.4156399934807369E-3,null,null,"floor4",null,1.2128789133823313E-2]
[null,null,"floor7",null,1.5741005473831289E-2,null,null,"floor7",null,1.1752302589497696E-3,null,null,"floor7",null,7.6440813840769103E-2]
[null,null,"floor8",null,7.8678413328792697E-3,null,null,"floor8",null,3.3087481389332631E-3,null,null,"floor8",null,1.6314268457366884E-2]
[null,null,"floor9",null,0.43083713017290376,null,null,"floor9",null,0.36951450927061918,null,null,"floor9",null,0.25324847015401009]
[null,null,"wall1",null,4.6086324698193508E-2,null,null,"wall1",null,2.3655449057488478E-2,null,null,"wall1",null,3.6248566582948623E-2]
[null,null,"wall2",null,1.0496431421336229E-2,null,null,"wall2",null,1.7254524299767151E-4,null,null,"wall2",null,3.2704253288492309E-2]
[null,null,"wall3",null,4.4455084346709084E-2,null,null,"wall3",null,2.9832028586512564E-2,null,null,"wall3",null,2.1575250083768215E-2]
[null,null,"wall5",null,0.19344457148212699,null,null,"wall5",null,0.1093874524727815,null,null,"wall5",null,0.12101206047751994]
[null,null,"wall6",null,1.383072910653366E-2,null,null,"wall6",null,2.1115389383565683E-3,null,null,"wall6",null,3.3012027711444028E-2]
[null,null,"wall7",null,2.8368746569077931E-2,null,null,"wall7",null,8.1891800169540646E-2,null,null,"wall7",null,9.333190245391627E-3]
[null,null,"wall8",null,0.2870589977952287,null,null,"wall8",null,0.17584060074331007,null,null,"wall8",null,0.22053087817789799]
[null,null,"wall9",null,3.2512916999761354E-4,null,null,"wall9",null,8.2375429637874132E-3,null,null,"wall9",null,1.2524499979922679E-3]
[null,null,"wall10",null,6.4925641607914168E-3,null,null,"wall10",null,1.2376036789312986E-5,null,null,"wall10",null,1.5862925975906068E-2]
[null,null,"roof1",null,8.6035743548148788E-2,null,null,"roof1",null,1.4910601733636836E-2,null,null,"roof1",null,7.5779126648271827E-2]
[null,null,"roof2",null,1.8299462144480211E-2,null,null,"roof2",null,3.5707249114007737E-2,null,null,"roof2",null,9.7083950631941581E-3]
[null,null,"roof3",null,5.0935606856013019E-2,null,null,"roof3",null,1.9999768714331644E-2,null,null,"roof3",null,3.6602466082837751E-2]
[null,null,"roof4",null,2.2775422762441894E-2,null,null,"roof4",null,2.9515110715799729E-2,null,null,"roof4",null,2.7963071073851217E-3]
[null,null,"roof5",null,2.7006966501249282E-2,null,null,"roof5",null,1.5591644931492179E-2,null,null,"roof5",null,2.270535503799161E-2]
[null,null,"fuel1",null,4.3484139926210988E-3,null,null,"fuel1",null,7.8457015122437163E-4,null,null,"fuel1",null,6.855194249145307E-3]
[null,null,"fuel2",null,0.60322218045129949,null,null,"fuel2",null,0.55373199893381053,null,null,"fuel2",null,0.40823837530285439]
[null,null,"fuel4",null,1.8528481499312029E-3,null,null,"fuel4",null,7.9935343752345788E-5,null,null,"fuel4",null,5.8448487906501007E-3]
[null,null,"fuel6",null,4.1977566452357299E-4,null,null,"fuel6",null,8.8949425832556656E-4,null,null,"fuel6",null,7.0729100070250324E-5]
[null,null,"fuel7",null,0.6051194671823702,null,null,"fuel7",null,0.53194987484707812,null,null,"fuel7",null,0.39120037430368226]
[null,null,"fuel9",null,1.687237210579655E-4,null,null,"fuel9",null,7.1484731752775015E-3,null,null,"fuel9",null,2.260560644424202E-5]
[null,null,"light1",null,0.627416448240667,null,null,"light1",null,0.39452776950505297,null,null,"light1",null,0.60866168470605808]
[null,null,"light2",null,1.3347205246536035E-3,null,null,"light2",null,3.5500158067290096E-4,null,null,"light2",null,9.4521745026700666E-4]
[null,null,"light3",null,0.62082880434519894,null,null,"light3",null,0.39366722390278419,null,null,"light3",null,0.60688131515762334]
[null,null,"light4",null,1.0766044644659831E-3,null,null,"light4",null,2.344403521167257E-3,null,null,"light4",null,4.295843621355711E-4]
[null,null,"house1",null,7.3686200212879374E-2,null,null,"house1",null,7.1948512803565651E-2,null,null,"house1",null,4.6911751067568529E-2]
[null,null,"house2",null,4.5441324336467535E-5,null,null,"house2",null,6.4787632543700897E-4,null,null,"house2",null,6.5235342161303281E-3]
[null,null,"house3",null,1.2974151873625211E-5,null,null,"house3",null,9.1775414560332389E-4,null,null,"house3",null,3.4930261806125648E-4]
[null,null,"house4",null,7.3736695516552514E-2,null,null,"house4",null,2.930234789704237E-2,null,null,"house4",null,6.1272728064165609E-2]
[null,null,"house5",null,2.0121184321244736E-2,null,null,"house5",null,6.9389404727690729E-2,null,null,"house5",null,6.8035826914574059E-3]
[null,null,"house6",null,8.6359231401037703E-6,null,null,"house6",null,2.578637476994225E-4,null,null,"house6",null,1.5626626066918764E-4]
[null,null,"house7",null,1.5276794014422633E-4,null,null,"house7",null,1.378556871342782E-4,null,null,"house7",null,1.4516531686827841E-3]
[null,null,"Has electricity",null,0.62313437485970347,null,null,"Has electricity",null,0.39667623702930171,null,null,"Has electricity",null,0.61123506534589644]
[null,null,"Has radio",null,8.6410212108873147E-2,null,null,"Has radio",null,0.14946876339580162,null,null,"Has radio",null,3.5527332499250545E-2]
[null,null,"Has television",null,0.58391536210262007,null,null,"Has television",null,0.39011958527664814,null,null,"Has television",null,0.53846850641419908]
[null,null,"Has refrigerator",null,0.41670678730197885,null,null,"Has refrigerator",null,0.36682647650912026,null,null,"Has refrigerator",null,0.37546736168995937]
[null,null,"Has bicycle",null,7.1455174333796986E-2,null,null,"Has bicycle",null,1.2043007805375934E-2,null,null,"Has bicycle",null,0.15944365683661146]
[null,null,"Has motorcycle/scooter",null,2.9177748115964422E-2,null,null,"Has motorcycle/scooter",null,2.2143898676269386E-2,null,null,"Has motorcycle/scooter",null,3.8128605084984758E-2]
[null,null,"Has car/truck",null,0.16659936797090144,null,null,"Has car/truck",null,0.16049957055330638,null,null,"Has car/truck",null,0.15397508277236213]
[null,null,"Has telephone",null,0.25679596810131161,null,null,"Has telephone",null,0.26319220084547734,null,null,"Has telephone",null,7.699693950149121E-2]
[null,null,"Have bednet for sleeping",null,3.1830031480309079E-2,null,null,"Have bednet for sleeping",null,3.8089896184035493E-4,null,null,"Have bednet for sleeping",null,5.3988303999129607E-2]
[null,null,"HH has iron",null,0.55104910504011617,null,null,"HH has iron",null,0.41068235412736487,null,null,"HH has iron",null,0.43143543660283518]
[null,null,"HH has fan",null,0.50197519871183627,null,null,"HH has fan",null,0.37688459267213342,null,null,"HH has fan",null,0.43320265846281319]
[null,null,"HH has cooking machine",null,0.65037443697712938,null,null,"HH has cooking machine",null,0.58071207745892917,null,null,"HH has cooking machine",null,0.47581027748503801]
[null,null,"HH has washing machine",null,5.475897393827598E-2,null,null,"HH has washing machine",null,6.1842771609692808E-2,null,null,"HH has washing machine",null,3.1347493428216432E-2]
[null,null,"HH has AC (air conditioner)",null,3.9586356886905781E-2,null,null,"HH has AC (air conditioner)",null,4.9227604939600753E-2,null,null,"HH has AC (air conditioner)",null,1.441098018360131E-2]
[null,null,"HH has computer",null,8.109127088650861E-2,null,null,"HH has computer",null,9.0521387766740555E-2,null,null,"HH has computer",null,4.6847697809160087E-2]
[null,null,"HH has cellular phone",null,0.13750456378253445,null,null,"HH has cellular phone",null,0.12994617556430454,null,null,"HH has cellular phone",null,0.139279240932207]
[null,null,"Any HH member has livestock (beast)",null,0.13851940735499188,null,null,"Any HH member has livestock (beast)",null,1.4230403370863577E-2,null,null,"Any HH member has livestock (beast)",null,3.9220060962615398E-2]
[null,null,"Any HH member has boat?",null,1.2890316452320956E-3,null,null,"Any HH member has boat?",null,1.8545060199585699E-5,null,null,"Any HH member has boat?",null,1.1188693683824688E-3]
[]
[]
[null,null,"Total Variance Explained",null,null,null,null,"Total Variance Explained",null,null,null,null,"Total Variance Explained"]
[null,null,"Component",null,"Extraction Sums of Squared Loadings",null,null,"Component",null,"Extraction Sums of Squared Loadings",null,null,"Component",null,"Extraction Sums of Squared Loadings"]
[null,null,null,null,"Total","% of Variance","Cumulative %",null,null,"Total","% of Variance","Cumulative %",null,null,"Total","% of Variance","Cumulative %"]
[null,null,"1",null,8.9454864446417748,16.264520808439588,16.264520808439588,"1",null,6.9998118415605894,12.726930621019253,12.726930621019253,"1",null,7.1022581354927272,12.913196609986777,12.913196609986777]
[]
[]
[null,null,"Component Score Coefficient Matrix",null,null,null,null,"Component Score Coefficient Matrix",null,null,null,null,"Component Score Coefficient Matrix"]
[null,null,null,null,"Component",null,null,null,null,"Component",null,null,null,null,"Component"]
[null,null,null,null,"1",null,null,null,null,"1",null,null,null,null,"1"]
[null,null,"Number of members per sleeping room",null,-4.7878833079130781E-2,null,null,"Number of members per sleeping room",null,-5.9346453996053879E-2,null,null,"Number of members per sleeping room",null,-4.275433507437347E-2]
[null,null,"floor1",null,-7.0456489311210319E-2,null,null,"floor1",null,-8.6128265996850945E-2,null,null,"floor1",null,-6.3637290248606301E-2]
[null,null,"floor4",null,-1.541940040805021E-2,null,null,"floor4",null,-1.3862404151780881E-2,null,null,"floor4",null,-1.5506445957482467E-2]
[null,null,"floor7",null,1.4025303664465026E-2,null,null,"floor7",null,-4.8975075738332697E-3,null,null,"floor7",null,3.8928368095957393E-2]
[null,null,"floor8",null,9.9157104093794014E-3,null,null,"floor8",null,8.2176092939964807E-3,null,null,"floor8",null,1.7984043705480988E-2]
[null,null,"floor9",null,7.3375757920067147E-2,null,null,"floor9",null,8.6841913021781875E-2,null,null,"floor9",null,7.085605394830255E-2]
[null,null,"wall1",null,-2.3998388280736128E-2,null,null,"wall1",null,-2.1972487813571039E-2,null,null,"wall1",null,-2.6807046384351003E-2]
[null,null,"wall2",null,1.1452937068650398E-2,null,null,"wall2",null,1.8765715554148693E-3,null,null,"wall2",null,2.5462771098626914E-2]
[null,null,"wall3",null,-2.3569846672565033E-2,null,null,"wall3",null,-2.46748787428458E-2,null,null,"wall3",null,-2.0681472949317672E-2]
[null,null,"wall5",null,-4.9167068100995047E-2,null,null,"wall5",null,-4.7249518587454804E-2,null,null,"wall5",null,-4.897989783920919E-2]
[null,null,"wall6",null,1.3146755182796333E-2,null,null,"wall6",null,6.5646742591762364E-3,null,null,"wall6",null,2.5582303536405452E-2]
[null,null,"wall7",null,-1.8828516870975566E-2,null,null,"wall7",null,-4.0882160875263647E-2,null,null,"wall7",null,-1.3602495982488671E-2]
[null,null,"wall8",null,5.9893765817568306E-2,null,null,"wall8",null,5.9906398799099661E-2,null,null,"wall8",null,6.6120822993494102E-2]
[null,null,"wall9",null,-2.0156912275437551E-3,null,null,"wall9",null,-1.2966192955560283E-2,null,null,"wall9",null,4.9829180560709624E-3]
[null,null,"wall10",null,9.0074977664214139E-3,null,null,"wall10",null,5.0257910629966185E-4,null,null,"wall10",null,1.7733530077859751E-2]
[null,null,"roof1",null,-3.2789552999752621E-2,null,null,"roof1",null,-1.7444608168374936E-2,null,null,"roof1",null,-3.8759515971294747E-2]
[null,null,"roof2",null,-1.5122207767684123E-2,null,null,"roof2",null,-2.6995528275653772E-2,null,null,"roof2",null,-1.3873219812185939E-2]
[null,null,"roof3",null,2.5229391756570737E-2,null,null,"roof3",null,2.0203477138764581E-2,null,null,"roof3",null,2.6937588883623038E-2]
[null,null,"roof4",null,-1.687055078890878E-2,null,null,"roof4",null,-2.4543463113660811E-2,null,null,"roof4",null,-7.4455362145508961E-3]
[null,null,"roof5",null,1.837104838172288E-2,null,null,"roof5",null,1.7838552131445591E-2,null,null,"roof5",null,2.1216204639192059E-2]
[null,null,"fuel1",null,7.3715952298841819E-3,null,null,"fuel1",null,4.0015617641588966E-3,null,null,"fuel1",null,1.1657714893904826E-2]
[null,null,"fuel2",null,8.6822980239812692E-2,null,null,"fuel2",null,0.10630738724110361,null,null,"fuel2",null,8.9962281428965882E-2]
[null,null,"fuel4",null,4.8118928957783594E-3,null,null,"fuel4",null,-1.27727101637297E-3,null,null,"fuel4",null,1.0764408913355483E-2]
[null,null,"fuel6",null,2.2903648339822466E-3,null,null,"fuel6",null,-4.2607417172351092E-3,null,null,"fuel6",null,1.184138804385356E-3]
[null,null,"fuel7",null,-8.6959413190300663E-2,null,null,"fuel7",null,-0.10419550632601932,null,null,"fuel7",null,-8.8064967244929751E-2]
[null,null,"fuel9",null,-1.4520584901467127E-3,null,null,"fuel9",null,-1.2078702364334976E-2,null,null,"fuel9",null,6.6943995339754188E-4]
[null,null,"light1",null,8.854702778111323E-2,null,null,"light1",null,8.9733048538113078E-2,null,null,"light1",null,0.10984784186789193]
[null,null,"light2",null,-4.0840514771963553E-3,null,null,"light2",null,-2.6917131566600591E-3,null,null,"light2",null,4.3288188540566257E-3]
[null,null,"light3",null,-8.8080945379109987E-2,null,null,"light3",null,-8.963513206674778E-2,null,null,"light3",null,-0.10968706866645105]
[null,null,"light4",null,-3.6679560754318049E-3,null,null,"light4",null,-6.9171917746795996E-3,null,null,"light4",null,-2.9182855109061161E-3]
[null,null,"house1",null,3.0345138144847471E-2,null,null,"house1",null,3.8319915661652583E-2,null,null,"house1",null,3.0496104638842999E-2]
[null,null,"house2",null,7.5356640364733387E-4,null,null,"house2",null,3.6362998584952982E-3,null,null,"house2",null,1.137221389059479E-2]
[null,null,"house3",null,4.0265725335471726E-4,null,null,"house3",null,-4.3278959530628353E-3,null,null,"house3",null,-2.6315066233092792E-3]
[null,null,"house4",null,-3.0355533744984665E-2,null,null,"house4",null,-2.4454841030580404E-2,null,null,"house4",null,-3.4852758384420507E-2]
[null,null,"house5",null,-1.5857065049609417E-2,null,null,"house5",null,-3.7632252564696156E-2,null,null,"house5",null,-1.1613747534377541E-2]
[null,null,"house6",null,3.285113827792294E-4,null,null,"house6",null,-2.2940811637087387E-3,null,null,"house6",null,1.7600951938617395E-3]
[null,null,"house7",null,1.3816948837871061E-3,null,null,"house7",null,-1.6773588233630094E-3,null,null,"house7",null,5.3645707867940968E-3]
[null,null,"Has electricity",null,8.824434681677501E-2,null,null,"Has electricity",null,8.9977045034829436E-2,null,null,"Has electricity",null,0.1100798115797364]
[null,null,"Has radio",null,3.2860833403503154E-2,null,null,"Has radio",null,5.5231756447564569E-2,null,null,"Has radio",null,2.6539017898851214E-2]
[null,null,"Has television",null,8.5422246495891418E-2,null,null,"Has television",null,8.9230332398483145E-2,null,null,"Has television",null,0.10331983427669385]
[null,null,"Has refrigerator",null,7.2162459238533358E-2,null,null,"Has refrigerator",null,8.6525470796599363E-2,null,null,"Has refrigerator",null,8.6275928642046418E-2]
[null,null,"Has bicycle",null,2.9882221432215323E-2,null,null,"Has bicycle",null,1.5677655526915607E-2,null,null,"Has bicycle",null,5.6222113847171649E-2]
[null,null,"Has motorcycle/scooter",null,1.9095099400530887E-2,null,null,"Has motorcycle/scooter",null,2.1258894498869318E-2,null,null,"Has motorcycle/scooter",null,2.7493435134424447E-2]
[null,null,"Has car/truck",null,4.5628134471509284E-2,null,null,"Has car/truck",null,5.723353506870283E-2,null,null,"Has car/truck",null,5.5249553191260833E-2]
[null,null,"Has telephone",null,5.6648724844025528E-2,null,null,"Has telephone",null,7.3290914673655172E-2,null,null,"Has telephone",null,3.9069718183463491E-2]
[null,null,"Have bednet for sleeping",null,1.9944105926932562E-2,null,null,"Have bednet for sleeping",null,-2.7881653671873331E-3,null,null,"Have bednet for sleeping",null,3.2715486988773509E-2]
[null,null,"HH has iron",null,8.298339311205484E-2,null,null,"HH has iron",null,9.1551751074752635E-2,null,null,"HH has iron",null,9.2482903062570967E-2]
[null,null,"HH has fan",null,7.9202185966682687E-2,null,null,"HH has fan",null,8.7703681843541118E-2,null,null,"HH has fan",null,9.2672121158490994E-2]
[null,null,"HH has cooking machine",null,9.0152498954993582E-2,null,null,"HH has cooking machine",null,0.10886645044011413,null,null,"HH has cooking machine",null,9.7122634947929318E-2]
[null,null,"HH has washing machine",null,2.6159153661548674E-2,null,null,"HH has washing machine",null,3.5526964862169386E-2,null,null,"HH has washing machine",null,2.4929005710260219E-2]
[null,null,"HH has AC (air conditioner)",null,2.2241742367852847E-2,null,null,"HH has AC (air conditioner)",null,3.1696987399629256E-2,null,null,"HH has AC (air conditioner)",null,1.6902475206727368E-2]
[null,null,"HH has computer",null,3.1833404771910552E-2,null,null,"HH has computer",null,4.2982258882246674E-2,null,null,"HH has computer",null,3.0475277851672998E-2]
[null,null,"HH has cellular phone",null,4.1452869042012688E-2,null,null,"HH has cellular phone",null,5.1498595521653236E-2,null,null,"HH has cellular phone",null,5.254685677301682E-2]
[null,null,"Any HH member has livestock (beast)",null,-4.1605557946675191E-2,null,null,"Any HH member has livestock (beast)",null,-1.7042065855088901E-2,null,null,"Any HH member has livestock (beast)",null,-2.7884167268386554E-2]
[null,null,"Any HH member has boat?",null,-4.013542144456898E-3,null,null,"Any HH member has boat?",null,6.1521619252913448E-4,null,null,"Any HH member has boat?",null,-4.7096999457473939E-3]
[]
[]
[null,null,"Component Score Covariance Matrix",null,null,null,null,"Component Score Covariance Matrix",null,null,null,null,"Component Score Covariance Matrix"]
[null,null,"Component",null,"1",null,null,"Component",null,"1",null,null,"Component",null,"1"]
[null,null,"1",null,1.0000000000000002,null,null,"1",null,0.99999999999999989,null,null,"1",null,1]
[]
[]
[]
[]
[]
[]
[]
[]
[]
[]
[]
[]
[]
[]
[]
[]
[]
[]
[]
[]
[]
[]
[]
[]
[]
[]
[]
[]
[]
[]
[]
[]
[]
[]
[]
[]
[]
[]
[]
[]
[]
[]
[]
[]
[]
[]
[]
[]
[]
[]
[]
[]
[]
[]
[]
[]
[]
[]
[]
[]
[]
[]
[]
[]
[]
[]
[]
[]
[]
[]
[]
[]
[]
[]
[]
[]
[]
[]
[]
[]
[]
[]
[]
[]
[]
[]
[]
[]
[]
[]
[]
[]
[]
[]
[]
[]
[]
[]
[]
[]
[]
[]
[]
[]
[]
[]
[]
[]
[]
[]
[]
[]
[]
[]
[]
[]
[]
[]
[]
[]
[]
[]
[]
[]
[]
[]
[]
[]
[]
[]
[]
[]
[]
[]
[]
[]
[]
[]
[]
[]
[]
[]
[]
[]
[]
[]
[]
[]
[]
[]
[]
[]
[]
[]
[]
[]
[]
[]
[]
[]
[]
[]
[]
[]
[]
[]
[]
[]
[]
[]
[]
[]
[]
[]
[]
[]
[]
[]
[]
[]
[]
[]
[]
[]
[]
[]
[]
[]
[]
[]
[]
[]
[]
[]
[]
[]
[]
[]
[]
[]
[]
[]
[]
[]
[]
[]
[]
[]
[]
[]
[]
[]
[]
[]
[]
[]
[]
[]
[]
[]
[]
[]
[]
[]
[]
[]
[]
[]
[]
[]
[]
[]
[]
[]
[]
[]
[]
[]
[]
[]
[]
[]
[]
[]
[]
[]
[]
[]
[]
[]
[]
[]
[]
[]
[]
[]
[]
[]
[]
[]
[]
[]
[]
[]
[]
[]
[]
[]
[]
[]
[]
[]
[]
[]
[]
[]
[]
[]
[]
[]
[]
[]
[]
[]
[]
[]
[]
[]
[]
[]
[]
[]
[]
[]
[]
[]
[]
[]
[]
[]
[]
[]
[]
[]
[]
[]
[]
[]
[]
[]
[]
[]
[]
[]
[]
[]
[]
[]
[]
[]
[]
[]
[]
[]
[]
[]
[]
[]
[]
[]
[]
[]
[]
[]
[]
[]
[]
[]
[]
[]
[]
[]
[]
[]
[]
[]
[]
[]
[]
[]
[]
[]
[]
[]
[]
[]
[]
[]
[]
[]
[]
[]
[]
[]
[]
[]
[]
[]
[]
[]
[]
[]
[]
[]
[]
[]
[]
[]
[]
[]
[]
[]
[]
[]
[]
[]
[]
[]
[]
[]
[]
[]
[]
[]
[]
[]
[]
[]
[]
[]
[]
[]
[]
[]
[]
[]
[]
[]
[]
[]
[]
[]
[]
[]
[]
[]
[]
[]
[]
[]
[]
[]
[]
[]
[]
[]
[]
[]
[]
[]
[]
[]
[]
[]
[]
[]
["DHS01"]
["Nicaragua",null,"Count"]
["W_text_t","",11328]
["W_text_i","",11328]
["S_text_s","Ratio of Shared improved based on:",11328]
["S_text_i","Ratio of Improved latrines based on:",11328]
["Urban/Rural","Urban",5970]
[null,"Rural",5358]
[null,"Missing",0]
["2001"]
[]
["Sub-national region names","Weighted population"]
[{"$f":"R15","v":"Atl ntico Norte(Raan)"},{"$f":"BR122+BR123","v":{"$error":"#VALUE!"}}]
[{"$f":"S15","v":"Atl ntico Sur(Raas)"},{"$f":"BS122+BS123","v":{"$error":"#VALUE!"}}]
[{"$f":"T15","v":"Boaco"},{"$f":"BT122+BT123","v":{"$error":"#VALUE!"}}]
[{"$f":"U15","v":"Carazo"},{"$f":"BU122+BU123","v":{"$error":"#VALUE!"}}]
[{"$f":"V15","v":"Chinandega"},{"$f":"BV122+BV123","v":{"$error":"#VALUE!"}}]
[{"$f":"W15","v":"Chontales"},{"$f":"BW122+BW123","v":{"$error":"#VALUE!"}}]
[{"$f":"X15","v":"Estel¡"},{"$f":"BX122+XR123","v":{"$error":"#VALUE!"}}]
[{"$f":"Y15","v":"Granada"},{"$f":"BY122+BY123","v":{"$error":"#VALUE!"}}]
[{"$f":"Z15","v":"Jinotega"},{"$f":"BZ122+BZ123","v":{"$error":"#VALUE!"}}]
[{"$f":"AA15","v":"Le¢n"},{"$f":"CA122+CA123","v":{"$error":"#VALUE!"}}]
[{"$f":"AB15","v":"Madriz"},{"$f":"CB122+CB123","v":{"$error":"#VALUE!"}}]
[{"$f":"AC15","v":"Managua"},{"$f":"CC122+CC123","v":{"$error":"#VALUE!"}}]
[{"$f":"AD15","v":"Masaya"},{"$f":"CD122+CD123","v":{"$error":"#VALUE!"}}]
[{"$f":"AE15","v":"Matagalpa"},{"$f":"CE122+CE123","v":{"$error":"#VALUE!"}}]
[{"$f":"AF15","v":"Nueva Segovia"},{"$f":"CF122+CF123","v":{"$error":"#VALUE!"}}]
[{"$f":"AG15","v":"R¡o San Juan"},{"$f":"CG122+CG123","v":{"$error":"#VALUE!"}}]
[{"$f":"AH15","v":"Rivas"},{"$f":"CH122+CH123","v":{"$error":"#VALUE!"}}]
[{"$f":"AI15","v":0},{"$f":"CI122+CI123","v":0}]
[{"$f":"AJ15","v":0},{"$f":"CJ122+CJ123","v":0}]
[{"$f":"AK15","v":0},{"$f":"CK122+CK123","v":0}]
[{"$f":"AL15","v":0},{"$f":"CL122+CL123","v":0}]
[{"$f":"AM15","v":0},{"$f":"CM122+CM123","v":0}]
[{"$f":"AN15","v":0},{"$f":"CN122+CN123","v":0}]
[{"$f":"AO15","v":0},{"$f":"CO122+CO123","v":0}]
[{"$f":"AP15","v":0},{"$f":"CP122+CP123","v":0}]
[{"$f":"AQ15","v":0},{"$f":"CQ122+CQ123","v":0}]
[{"$f":"AR15","v":0},{"$f":"CR122+CR123","v":0}]
[{"$f":"AS15","v":0},{"$f":"CS122+CS123","v":0}]
[{"$f":"AT15","v":0},{"$f":"CT122+CT123","v":0}]
[{"$f":"AU15","v":0},{"$f":"CU122+CU123","v":0}]
[{"$f":"AV15","v":0},{"$f":"CV122+CV123","v":0}]
[{"$f":"AW15","v":0},{"$f":"CW122+CW123","v":0}]
[{"$f":"AX15","v":0},{"$f":"CX122+CX123","v":0}]
[{"$f":"AY15","v":0},{"$f":"CY122+CY123","v":0}]
[]
[{"$f":"34-COUNTIF(A1037:A1071,\"0\")","v":17},"Sub-regions"]

{"sheet":"ENDESA11","index":5,"n_rows":1072,"n_cols":72,"rows_kept":1072,"cut":false,"hidden":false,"merged":[[346,52,347,52],[348,52,349,52],[350,52,351,52],[352,52,353,52],[152,52,158,52],[270,52,272,52],[273,52,275,52],[276,52,283,52],[338,54,338,58],[338,59,338,63],[338,64,338,68],[340,52,341,52],[342,52,343,52],[344,52,345,52],[221,52,223,52],[224,52,225,52],[226,52,229,52],[258,54,258,58],[258,59,258,63],[258,64,258,68],[260,52,262,52],[263,52,266,52],[267,52,269,52],[119,64,119,68],[121,52,122,52],[123,52,126,52],[127,52,128,52],[132,54,132,58],[132,59,132,63],[132,64,132,68],[134,52,138,52],[219,54,219,58],[219,59,219,63],[219,64,219,68],[13,64,13,68],[15,52,16,52],[17,52,20,52],[21,52,22,52],[26,54,26,58],[26,59,26,63],[26,64,26,68],[40,52,41,52],[55,54,55,58],[55,59,55,63],[55,64,55,68],[139,52,142,52],[143,0,146,0],[143,52,146,52],[147,0,149,0],[147,52,149,52],[150,0,151,0],[150,52,151,52],[13,54,13,58],[13,59,13,63],[119,54,119,58],[119,59,119,63],[42,52,43,52],[44,52,45,52],[46,0,48,0],[46,52,48,52],[49,0,51,0],[49,52,51,52],[52,0,54,0],[52,52,54,52],[32,52,33,52],[34,52,35,52],[36,52,37,52],[38,0,39,0],[38,52,39,52],[13,2,13,6],[13,7,13,11],[28,52,29,52],[30,0,31,0],[30,52,31,52],[26,2,26,6],[26,7,26,11],[26,12,26,16],[13,12,13,16],[15,0,16,0],[17,0,20,0],[21,0,22,0],[23,0,25,0],[32,0,33,0],[55,2,55,6],[55,7,55,11],[55,12,55,16],[28,0,29,0],[34,0,35,0],[36,0,37,0],[40,0,41,0],[42,0,43,0],[44,0,45,0],[139,0,142,0],[119,7,119,11],[119,12,119,16],[57,0,70,0],[107,0,107,1],[121,0,122,0],[123,0,126,0],[127,0,128,0],[129,0,131,0],[132,2,132,6],[119,2,119,6],[207,0,207,1],[219,2,219,6],[132,7,132,11],[132,12,132,16],[134,0,138,0],[152,0,157,0],[1024,0,1024,2],[1025,0,1025,1],[1030,0,1032,0],[1033,0,1033,2],[398,2,398,5],[219,7,219,11],[219,12,219,16],[221,0,223,0],[398,7,398,10],[398,12,398,15],[399,2,399,4],[399,7,399,9],[399,12,399,14],[400,2,401,3],[400,7,401,8],[400,12,401,13],[401,1,444,1],[402,2,402,3],[402,7,402,8],[402,12,402,13],[403,2,403,3],[403,7,403,8],[403,12,403,13],[404,2,404,3],[404,7,404,8],[404,12,404,13],[407,2,407,3],[407,7,407,8],[407,12,407,13],[408,2,408,3],[408,7,408,8],[408,12,408,13],[405,2,405,3],[405,7,405,8],[405,12,405,13],[406,2,406,3],[406,7,406,8],[406,12,406,13],[411,2,411,3],[411,7,411,8],[411,12,411,13],[412,2,412,3],[412,7,412,8],[412,12,412,13],[409,2,409,3],[409,7,409,8],[409,12,409,13],[410,2,410,3],[410,7,410,8],[410,12,410,13],[415,2,415,3],[415,7,415,8],[415,12,415,13],[416,2,416,3],[416,7,416,8],[416,12,416,13],[413,2,413,3],[413,7,413,8],[413,12,413,13],[414,2,414,3],[414,7,414,8],[414,12,414,13],[419,2,419,3],[419,7,419,8],[419,12,419,13],[420,2,420,3],[420,7,420,8],[420,12,420,13],[417,2,417,3],[417,7,417,8],[417,12,417,13],[418,2,418,3],[418,7,418,8],[418,12,418,13],[423,2,423,3],[423,7,423,8],[423,12,423,13],[424,2,424,3],[424,7,424,8],[424,12,424,13],[421,2,421,3],[421,7,421,8],[421,12,421,13],[422,2,422,3],[422,7,422,8],[422,12,422,13],[427,2,427,3],[427,7,427,8],[427,12,427,13],[428,2,428,3],[428,7,428,8],[428,12,428,13],[425,2,425,3],[425,7,425,8],[425,12,425,13],[426,2,426,3],[426,7,426,8],[426,12,426,13],[431,2,431,3],[431,7,431,8],[431,12,431,13],[432,2,432,3],[432,7,432,8],[432,12,432,13],[429,2,429,3],[429,7,429,8],[429,12,429,13],[430,2,430,3],[430,7,430,8],[430,12,430,13],[435,2,435,3],[435,7,435,8],[435,12,435,13],[436,2,436,3],[436,7,436,8],[436,12,436,13],[433,2,433,3],[433,7,433,8],[433,12,433,13],[434,2,434,3],[434,7,434,8],[434,12,434,13],[439,2,439,3],[439,7,439,8],[439,12,439,13],[440,2,440,3],[440,7,440,8],[440,12,440,13],[437,2,437,3],[437,7,437,8],[437,12,437,13],[438,2,438,3],[438,7,438,8],[438,12,438,13],[443,2,443,3],[443,7,443,8],[443,12,443,13],[444,2,444,3],[444,7,444,8],[444,12,444,13],[441,2,441,3],[441,7,441,8],[441,12,441,13],[442,2,442,3],[442,7,442,8],[442,12,442,13],[447,2,447,3],[447,7,447,8],[447,12,447,13],[448,2,448,3],[448,7,448,8],[448,12,448,13],[445,2,445,3],[445,7,445,8],[445,12,445,13],[446,2,446,3],[446,7,446,8],[446,12,446,13],[451,2,451,3],[451,7,451,8],[451,12,451,13],[452,2,452,3],[452,7,452,8],[452,12,452,13],[449,2,449,3],[449,7,449,8],[449,12,449,13],[450,2,450,3],[450,7,450,8],[450,12,450,13],[455,2,455,3],[455,7,455,8],[455,12,455,13],[456,2,456,3],[456,7,456,8],[456,12,456,13],[453,2,453,3],[453,7,453,8],[453,12,453,13],[454,2,454,3],[454,7,454,8],[454,12,454,13],[459,2,459,3],[459,7,459,8],[459,12,459,13],[460,2,460,3],[460,7,460,8],[460,12,460,13],[457,2,457,3],[457,7,457,8],[457,12,457,13],[458,2,458,3],[458,7,458,8],[458,12,458,13],[463,2,463,3],[463,7,463,8],[463,12,463,13],[464,2,464,3],[464,7,464,8],[464,12,464,13],[461,2,461,3],[461,7,461,8],[461,12,461,13],[462,2,462,3],[462,7,462,8],[462,12,462,13],[467,2,467,3],[467,7,467,8],[467,12,467,13],[468,2,468,3],[468,7,468,8],[468,12,468,13],[465,2,465,3],[465,7,465,8],[465,12,465,13],[466,2,466,3],[466,7,466,8],[466,12,466,13],[471,2,471,3],[471,7,471,8],[471,12,471,13],[472,2,472,3],[472,7,472,8],[472,12,472,13],[469,2,469,3],[469,7,469,8],[469,12,469,13],[470,2,470,3],[470,7,470,8],[470,12,470,13],[475,2,475,3],[475,7,475,8],[475,12,475,13],[476,2,476,3],[476,7,476,8],[476,12,476,13],[473,2,473,3],[473,7,473,8],[473,12,473,13],[474,2,474,3],[474,7,474,8],[474,12,474,13],[479,2,479,3],[479,7,479,9],[479,12,479,13],[480,2,480,3],[480,7,480,8],[480,12,480,14],[477,2,477,3],[477,7,477,8],[477,12,477,13],[478,2,478,3],[478,7,478,8],[478,12,478,13],[483,2,483,3],[483,7,483,8],[483,12,483,13],[484,2,484,3],[484,7,484,8],[484,12,484,13],[481,2,481,4],[481,7,481,8],[481,12,481,13],[482,2,482,3],[482,7,482,8],[482,12,482,13],[487,2,487,3],[487,7,487,8],[487,12,487,13],[488,2,488,3],[488,7,488,8],[488,12,488,13],[485,2,485,3],[485,7,485,8],[485,12,485,13],[486,2,486,3],[486,7,486,8],[486,12,486,13],[491,2,491,3],[491,7,491,8],[491,12,491,13],[492,2,492,3],[492,7,492,8],[492,12,492,13],[489,2,489,3],[489,7,489,8],[489,12,489,13],[490,2,490,3],[490,7,490,8],[490,12,490,13],[495,2,495,3],[495,7,495,8],[495,12,495,13],[496,2,496,3],[496,7,496,8],[496,12,496,13],[493,2,493,3],[493,7,493,8],[493,12,493,13],[494,2,494,3],[494,7,494,8],[494,12,494,13],[499,2,499,3],[499,7,499,8],[499,12,499,13],[500,2,500,3],[500,7,500,8],[500,12,500,13],[497,2,497,3],[497,7,497,8],[497,12,497,13],[498,2,498,3],[498,7,498,8],[498,12,498,13],[503,2,503,3],[503,7,503,8],[503,12,503,13],[504,2,504,3],[504,7,504,8],[504,12,504,13],[501,2,501,3],[501,7,501,8],[501,12,501,13],[502,2,502,3],[502,7,502,8],[502,12,502,13],[507,2,507,3],[507,7,507,8],[507,12,507,13],[508,2,508,3],[508,7,508,8],[508,12,508,13],[505,2,505,3],[505,7,505,8],[505,12,505,13],[506,2,506,3],[506,7,506,8],[506,12,506,13],[511,2,511,3],[511,7,511,8],[511,12,511,13],[512,2,512,3],[512,7,512,8],[512,12,512,13],[509,2,509,3],[509,7,509,8],[509,12,509,13],[510,2,510,3],[510,7,510,8],[510,12,510,13],[515,2,515,3],[515,7,515,8],[515,12,515,13],[516,2,516,3],[516,7,516,8],[516,12,516,13],[513,2,513,3],[513,7,513,8],[513,12,513,13],[514,2,514,3],[514,7,514,8],[514,12,514,13],[519,2,519,3],[519,7,519,8],[519,12,519,13],[520,2,520,3],[520,7,520,8],[520,12,520,13],[517,2,517,3],[517,7,517,8],[517,12,517,13],[518,2,518,3],[518,7,518,8],[518,12,518,13],[523,2,523,3],[523,7,523,8],[523,12,523,13],[524,2,524,3],[524,7,524,8],[524,12,524,13],[521,2,521,3],[521,7,521,8],[521,12,521,13],[522,2,522,3],[522,7,522,8],[522,12,522,13],[527,2,527,3],[527,7,527,8],[527,12,527,13],[528,2,528,3],[528,7,528,8],[528,12,528,13],[525,2,525,3],[525,7,525,8],[525,12,525,13],[526,2,526,3],[526,7,526,8],[526,12,526,13],[531,2,531,3],[531,7,531,8],[531,12,531,13],[532,2,532,3],[532,7,532,8],[532,12,532,13],[529,2,529,3],[529,7,529,8],[529,12,529,13],[530,2,530,3],[530,7,530,8],[530,12,530,13],[535,2,535,3],[535,7,535,8],[535,12,535,13],[536,2,536,3],[536,7,536,8],[536,12,536,13],[533,2,533,3],[533,7,533,8],[533,12,533,13],[534,2,534,3],[534,7,534,8],[534,12,534,13],[539,2,539,3],[539,7,539,8],[539,12,539,13],[540,2,540,3],[540,7,540,8],[540,12,540,13],[537,2,537,3],[537,7,537,8],[537,12,537,13],[538,2,538,3],[538,7,538,8],[538,12,538,13],[543,2,543,3],[543,7,543,8],[543,12,543,13],[544,2,544,3],[544,7,544,8],[544,12,544,13],[541,2,541,3],[541,7,541,8],[541,12,541,13],[542,2,542,3],[542,7,542,8],[542,12,542,13],[547,2,547,3],[547,7,547,8],[547,12,547,13],[548,2,548,3],[548,7,548,8],[548,12,548,13],[545,2,545,3],[545,7,545,8],[545,12,545,13],[546,2,546,3],[546,7,546,8],[546,12,546,13],[551,2,551,3],[551,7,551,8],[551,12,551,13],[552,2,552,3],[552,7,552,8],[552,12,552,13],[549,2,549,3],[549,7,549,8],[549,12,549,13],[550,2,550,3],[550,7,550,8],[550,12,550,13],[555,2,555,3],[555,7,555,8],[555,12,555,13],[556,2,556,3],[556,7,556,8],[556,12,556,13],[553,2,553,3],[553,7,553,8],[553,12,553,13],[554,2,554,3],[554,7,554,8],[554,12,554,13],[560,14,560,16],[561,2,561,6],[561,7,561,8],[557,2,557,3],[557,7,557,11],[557,12,557,13],[558,2,558,3],[558,7,559,8],[558,9,558,11],[558,12,558,13],[559,2,559,3],[559,12,559,16],[562,2,563,3],[562,4,562,6],[562,7,562,8],[562,12,562,13],[563,7,563,9],[563,12,563,13],[560,2,560,3],[560,7,560,8],[560,12,561,13],[568,2,569,3],[568,7,568,8],[568,12,568,13],[569,7,569,8],[569,12,569,13],[570,2,570,3],[570,7,570,8],[570,12,570,13],[564,2,564,3],[564,7,565,8],[564,12,564,13],[565,2,565,3],[565,12,565,14],[566,2,566,3],[566,7,566,8],[566,12,567,13],[567,2,567,4],[567,7,567,8],[573,2,573,3],[573,7,573,8],[573,12,573,13],[574,2,574,3],[574,7,574,8],[574,12,574,13],[571,2,571,3],[571,7,571,8],[571,12,571,13],[572,2,572,3],[572,7,572,8],[572,12,572,13],[577,2,577,3],[577,7,577,8],[577,12,577,13],[578,2,578,3],[578,7,578,8],[578,12,578,13],[575,2,575,3],[575,7,575,8],[575,12,575,13],[576,2,576,3],[576,7,576,8],[576,12,576,13],[581,2,581,3],[581,7,581,8],[581,12,581,13],[582,2,582,3],[582,7,582,8],[582,12,582,13],[579,2,579,3],[579,7,579,8],[579,12,579,13],[580,2,580,3],[580,7,580,8],[580,12,580,13],[585,2,585,3],[585,7,585,8],[585,12,585,13],[586,2,586,3],[586,7,586,8],[586,12,586,13],[583,2,583,3],[583,7,583,8],[583,12,583,13],[584,2,584,3],[584,7,584,8],[584,12,584,13],[589,2,589,3],[589,7,589,8],[589,12,589,13],[590,2,590,3],[590,7,590,8],[590,12,590,13],[587,2,587,3],[587,7,587,8],[587,12,587,13],[588,2,588,3],[588,7,588,8],[588,12,588,13],[593,2,593,3],[593,7,593,8],[593,12,593,13],[594,2,594,3],[594,7,594,8],[594,12,594,13],[591,2,591,3],[591,7,591,8],[591,12,591,13],[592,2,592,3],[592,7,592,8],[592,12,592,13],[597,2,597,3],[597,7,597,8],[597,12,597,13],[598,2,598,3],[598,7,598,8],[598,12,598,13],[595,2,595,3],[595,7,595,8],[595,12,595,13],[596,2,596,3],[596,7,596,8],[596,12,596,13],[601,2,601,3],[601,7,601,8],[601,12,601,13],[602,2,602,3],[602,7,602,8],[602,12,602,13],[599,2,599,3],[599,7,599,8],[599,12,599,13],[600,2,600,3],[600,7,600,8],[600,12,600,13],[605,2,605,3],[605,7,605,8],[605,12,605,13],[606,2,606,3],[606,7,606,8],[606,12,606,13],[603,2,603,3],[603,7,603,8],[603,12,603,13],[604,2,604,3],[604,7,604,8],[604,12,604,13],[609,2,609,3],[609,7,609,8],[609,12,609,13],[610,2,610,3],[610,7,610,8],[610,12,610,13],[607,2,607,3],[607,7,607,8],[607,12,607,13],[608,2,608,3],[608,7,608,8],[608,12,608,13],[613,2,613,3],[613,7,613,8],[613,12,613,13],[614,2,614,3],[614,7,614,8],[614,12,614,13],[611,2,611,3],[611,7,611,8],[611,12,611,13],[612,2,612,3],[612,7,612,8],[612,12,612,13],[617,2,617,3],[617,7,617,8],[617,12,617,13],[618,2,618,3],[618,7,618,8],[618,12,618,13],[615,2,615,3],[615,7,615,8],[615,12,615,13],[616,2,616,3],[616,7,616,8],[616,12,616,13],[621,2,621,3],[621,7,621,8],[621,12,621,13],[622,2,622,3],[622,7,622,8],[622,12,622,13],[619,2,619,3],[619,7,619,8],[619,12,619,13],[620,2,620,3],[620,7,620,8],[620,12,620,13],[625,2,625,3],[625,7,625,8],[625,12,625,13],[626,2,626,3],[626,7,626,8],[626,12,626,13],[623,2,623,3],[623,7,623,8],[623,12,623,13],[624,2,624,3],[624,7,624,8],[624,12,624,13],[629,2,629,3],[629,7,629,8],[629,12,629,13],[630,2,630,3],[630,7,630,8],[630,12,630,13],[627,2,627,3],[627,7,627,8],[627,12,627,13],[628,2,628,3],[628,7,628,8],[628,12,628,13],[633,2,633,3],[633,7,633,8],[633,12,633,13],[634,2,634,3],[634,7,634,8],[634,12,634,13],[631,2,631,3],[631,7,631,8],[631,12,631,13],[632,2,632,3],[632,7,632,8],[632,12,632,13],[637,2,637,3],[637,7,637,8],[637,12,637,13],[638,2,638,3],[638,7,638,8],[638,12,638,13],[635,2,635,3],[635,7,635,8],[635,12,635,13],[636,2,636,3],[636,7,636,8],[636,12,636,13],[641,2,641,3],[641,7,641,8],[641,12,641,13],[642,2,642,3],[642,7,642,9],[642,12,642,13],[639,2,639,3],[639,7,639,8],[639,12,639,13],[640,2,640,3],[640,7,640,8],[640,12,640,13],[645,2,645,3],[645,7,645,8],[645,12,645,14],[646,2,646,3],[646,7,646,8],[646,12,646,13],[643,2,643,3],[643,7,643,8],[643,12,643,13],[644,2,644,3],[644,7,644,8],[644,12,644,13],[649,2,649,3],[649,7,649,8],[649,12,649,13],[650,2,650,3],[650,7,650,8],[650,12,650,13],[647,2,647,3],[647,7,647,8],[647,12,647,13],[648,2,648,4],[648,7,648,8],[648,12,648,13],[653,2,653,3],[653,7,653,8],[653,12,653,13],[654,2,654,3],[654,7,654,8],[654,12,654,13],[651,2,651,3],[651,7,651,8],[651,12,651,13],[652,2,652,3],[652,7,652,8],[652,12,652,13],[657,2,657,3],[657,7,657,8],[657,12,657,13],[658,2,658,3],[658,7,658,8],[658,12,658,13],[655,2,655,3],[655,7,655,8],[655,12,655,13],[656,2,656,3],[656,7,656,8],[656,12,656,13],[661,2,661,3],[661,7,661,8],[661,12,661,13],[662,2,662,3],[662,7,662,8],[662,12,662,13],[659,2,659,3],[659,7,659,8],[659,12,659,13],[660,2,660,3],[660,7,660,8],[660,12,660,13],[665,2,665,3],[665,7,665,8],[665,12,665,13],[666,2,666,3],[666,7,666,8],[666,12,666,13],[663,2,663,3],[663,7,663,8],[663,12,663,13],[664,2,664,3],[664,7,664,8],[664,12,664,13],[669,2,669,3],[669,7,669,8],[669,12,669,13],[670,2,670,3],[670,7,670,8],[670,12,670,13],[667,2,667,3],[667,7,667,8],[667,12,667,13],[668,2,668,3],[668,7,668,8],[668,12,668,13],[673,2,673,3],[673,7,673,8],[673,12,673,13],[674,2,674,3],[674,7,674,8],[674,12,674,13],[671,2,671,3],[671,7,671,8],[671,12,671,13],[672,2,672,3],[672,7,672,8],[672,12,672,13],[677,2,677,3],[677,7,677,8],[677,12,677,13],[678,2,678,3],[678,7,678,8],[678,12,678,13],[675,2,675,3],[675,7,675,8],[675,12,675,13],[676,2,676,3],[676,7,676,8],[676,12,676,13],[681,2,681,3],[681,7,681,8],[681,12,681,13],[682,2,682,3],[682,7,682,8],[682,12,682,13],[679,2,679,3],[679,7,679,8],[679,12,679,13],[680,2,680,3],[680,7,680,8],[680,12,680,13],[685,2,685,3],[685,7,685,8],[685,12,685,13],[686,2,686,3],[686,7,686,8],[686,12,686,13],[683,2,683,3],[683,7,683,8],[683,12,683,13],[684,2,684,3],[684,7,684,8],[684,12,684,13],[689,2,689,3],[689,7,689,8],[689,12,689,13],[690,2,690,3],[690,7,690,8],[690,12,690,13],[687,2,687,3],[687,7,687,8],[687,12,687,13],[688,2,688,3],[688,7,688,8],[688,12,688,13],[693,2,693,3],[693,7,693,8],[693,12,693,13],[694,2,694,3],[694,7,694,8],[694,12,694,13],[691,2,691,3],[691,7,691,8],[691,12,691,13],[692,2,692,3]],"merged_total":1014,"flags":["merged_cut"]}
[]
[{"$f":"A1026","v":"Nicaragua"}]
[{"$f":"A1034","v":"2011"}]
["Use of drinking water sources"]
[" by wealth quintile and sub-national region"]
["Notes:"]
["WHO/UNICEF JMP customised wealth index excludes water,"]
[" sanitation and hygiene assets."]
["Survey used for analysis:",{"$f":"A1025","v":"ENDESA11"}]
["Improved wells, springs based on:","50% Rule"]
[{"$f":"B1027","v":""}]
[]
[]
["Use of drinking water sources",null,"NATIONAL wealth index quintile",null,null,null,null,"URBAN wealth index quintile",null,null,null,null,"RURAL wealth index quintile",null,null,null,null,"SUB-REGIONS:",null,null,null,null,null,null,null,null,null,null,null,null,null,null,null,null,null,null,null,null,null,null,null,null,null,null,null,null,null,null,null,null,null,null,"Raw numbers of respondents:","Use of drinking water sources","NATIONAL wealth index quintile",null,null,null,null,"URBAN wealth index quintile",null,null,null,null,"RURAL wealth index quintile",null,null,null,null,"SUB-REGIONS:"]
["Weighted percentage (used in graphs)",null,"Poorest","Poor","Middle","Rich","Richest","Poorest","Poor","Middle","Rich","Richest","Poorest","Poor","Middle","Rich","Richest","Atlántico","Central","Pácifico",null,null,null,null,null,null,null,null,null,null,null,null,null,null,null,null,null,null,null,null,null,null,null,null,null,null,null,null,null,null,null,null,"Water data, raw numbers (weighted)",null,"Poorest","Poor","Middle","Rich","Richest","Poorest","Poor","Middle","Rich","Richest","Poorest","Poor","Middle","Rich","Richest","Atlántico","Central","Pácifico"]
["Water","Improved",{"$f":"C58+C59+C60+C61+C67+C68+C69+(C62+C63+C65)*0.5","v":51.312910838042058},77.47797892426594,89.45684333064807,95.548853117765091,98.087644060893609,93.618318709328179,95.590827854939974,97.317919703382145,98.506331928242162,98.936491212258431,44.071359756976321,52.487248632317936,65.477295139071373,74.127915109427121,80.326201547876224,56.783466131615057,73.889261404269703,93.472979514666264,null,null,null,null,null,null,null,null,null,null,null,null,null,null,null,null,null,null,null,null,null,null,null,null,null,null,null,null,null,null,null,null,"Water","Improved","N/A","N/A","N/A","N/A","N/A","N/A","N/A","N/A","N/A","N/A","N/A","N/A","N/A","N/A","N/A","N/A","N/A","N/A"]
[null,"Not Improved",{"$f":"100-C16","v":48.687089161957942},{"$f":"100-D16","v":22.52202107573406},10.54315666935193,4.4511468822349087,1.9123559391063907,6.3816812906718212,4.4091721450600261,2.6820802966178547,1.4936680717578383,1.0635087877415685,55.928640243023679,47.512751367682064,34.522704860928627,25.872084890572879,19.673798452123776,43.216533868384943,26.110738595730297,6.5270204853337361,null,null,null,null,null,null,null,null,null,null,null,null,null,null,null,null,null,null,null,null,null,null,null,null,null,null,null,null,null,null,null,null,null,"Not Improved","N/A","N/A","N/A","N/A","N/A","N/A","N/A","N/A","N/A","N/A","N/A","N/A","N/A","N/A","N/A","N/A","N/A","N/A"]
["Water ladder","Basic",{"$f":"C16","v":51.312910838042058},{"$f":"D16","v":77.47797892426594},89.45684333064807,95.548853117765091,98.087644060893609,93.618318709328179,95.590827854939974,97.317919703382145,98.506331928242162,98.936491212258431,44.071359756976321,52.487248632317936,65.477295139071373,74.127915109427121,80.326201547876224,56.783466131615057,73.889261404269703,93.472979514666264,null,null,null,null,null,null,null,null,null,null,null,null,null,null,null,null,null,null,null,null,null,null,null,null,null,null,null,null,null,null,null,null,"Water ladder","Basic","N/A","N/A","N/A","N/A","N/A","N/A","N/A","N/A","N/A","N/A","N/A","N/A","N/A","N/A","N/A","N/A","N/A","N/A"]
[null,"Limited",0,0,0,0,0,0,0,0,0,0,0,0,0,0,0,0,0,0,null,null,null,null,null,null,null,null,null,null,null,null,null,null,null,null,null,null,null,null,null,null,null,null,null,null,null,null,null,null,null,null,null,"Limited","N/A","N/A","N/A","N/A","N/A","N/A","N/A","N/A","N/A","N/A","N/A","N/A","N/A","N/A","N/A","N/A","N/A","N/A"]
[null,"Unimproved",{"$f":"100-(C18+C19+C21)","v":32.167934425532835},{"$f":"100-(D18+D19+D21)","v":17.423781288392462},9.057417781667823,4.0565463304938589,1.7606841032298917,5.0104041849796204,4.277066235824492,2.5060262757086207,1.3885941218760109,1.0635087877415685,35.241844842389241,32.439717630687596,26.610203537019743,19.94903708821235,16.682700923975887,31.852173289804554,17.12540944322626,5.8739815929926351,null,null,null,null,null,null,null,null,null,null,null,null,null,null,null,null,null,null,null,null,null,null,null,null,null,null,null,null,null,null,null,null,null,"Unimproved","N/A","N/A","N/A","N/A","N/A","N/A","N/A","N/A","N/A","N/A","N/A","N/A","N/A","N/A","N/A","N/A","N/A","N/A"]
[null,"Surface water",{"$f":"C64+C66","v":16.519154736425108},5.0982397873415977,1.4857388876841058,0.39460055174105629,0.15167183587649696,1.3712771056922017,0.13210590923553736,0.17605402090922984,0.10507394988182879,0,20.686795400634431,15.073033736994461,7.9125013239088853,5.9230478023605277,2.9910975281478862,11.36436057858039,8.9853291525040291,0.6530388923410998,null,null,null,null,null,null,null,null,null,null,null,null,null,null,null,null,null,null,null,null,null,null,null,null,null,null,null,null,null,null,null,null,null,"Surface water","N/A","N/A","N/A","N/A","N/A","N/A","N/A","N/A","N/A","N/A","N/A","N/A","N/A","N/A","N/A","N/A","N/A","N/A"]
["Improved water point at more than 30 minutes","Yes",0,0,0,0,0,0,0,0,0,0,0,0,0,0,0,0,0,0,null,null,null,null,null,null,null,null,null,null,null,null,null,null,null,null,null,null,null,null,null,null,null,null,null,null,null,null,null,null,null,null,"Improved water point at more than 30 minutes","Yes","N/A","N/A","N/A","N/A","N/A","N/A","N/A","N/A","N/A","N/A","N/A","N/A","N/A","N/A","N/A","N/A","N/A","N/A"]
[null,"No",100,100,100,100,100,100,100,100,100,100,100,100,100,100,100,100,100,100,null,null,null,null,null,null,null,null,null,null,null,null,null,null,null,null,null,null,null,null,null,null,null,null,null,null,null,null,null,null,null,null,null,"No","N/A","N/A","N/A","N/A","N/A","N/A","N/A","N/A","N/A","N/A","N/A","N/A","N/A","N/A","N/A","N/A","N/A","N/A"]
["Manually calculated ratios","Improved wells"]
[null,"Improved springs"]
[null,"Other"]
[null,null,"NATIONAL wealth index quintile",null,null,null,null,"URBAN wealth index quintile",null,null,null,null,"RURAL wealth index quintile",null,null,null,null,"SUB-REGIONS:",null,null,null,null,null,null,null,null,null,null,null,null,null,null,null,null,null,null,null,null,null,null,null,null,null,null,null,null,null,null,null,null,null,null,"Raw numbers of respondents:","Use of drinking water sources","NATIONAL wealth index quintile",null,null,null,null,"URBAN wealth index quintile",null,null,null,null,"RURAL wealth index quintile",null,null,null,null,"SUB-REGIONS:"]
["Percentage based on weighted population",null,"Poorest","Poor","Middle","Rich","Richest","Poorest","Poor","Middle","Rich","Richest","Poorest","Poor","Middle","Rich","Richest","Atlántico","Central","Pácifico",null,null,null,null,null,null,null,null,null,null,null,null,null,null,null,null,null,null,null,null,null,null,null,null,null,null,null,null,null,null,null,null,"Water data, raw numbers (weighted)",null,"Poorest","Poor","Middle","Rich","Richest","Poorest","Poor","Middle","Rich","Richest","Poorest","Poor","Middle","Rich","Richest","Atlántico","Central","Pácifico"]
["Piped water","Yes",17.260804702520907,56.849705509600646,77.748739826587752,89.881139033492062,96.110403952554336,83.129323811587341,89.201951244345338,92.912771788038526,96.683649493978606,97.711293316440859,8.57758595171609,17.681210694236665,36.734151148946751,52.190522673008431,61.501216174775365,21.382375468685087,55.35343996737484,85.784039121906204,null,null,null,null,null,null,null,null,null,null,null,null,null,null,null,null,null,null,null,null,null,null,null,null,null,null,null,null,null,null,null,null,"Piped water","Yes","N/A","N/A","N/A","N/A","N/A","N/A","N/A","N/A","N/A","N/A","N/A","N/A","N/A","N/A","N/A","N/A","N/A","N/A"]
[null,"No",82.739195297479014,43.150294490399133,22.251260173412323,10.11886096650794,3.8895960474456106,16.870676188412776,10.798048755654648,7.0872282119613716,3.316350506021394,2.2887066835591368,91.422414048283926,82.31878930576319,63.265848851053427,47.809477326991903,38.49878382522467,78.617624531315229,44.64656003262472,14.21596087809397,null,null,null,null,null,null,null,null,null,null,null,null,null,null,null,null,null,null,null,null,null,null,null,null,null,null,null,null,null,null,null,null,null,"No","N/A","N/A","N/A","N/A","N/A","N/A","N/A","N/A","N/A","N/A","N/A","N/A","N/A","N/A","N/A","N/A","N/A","N/A"]
["Piped water on premises","Yes",11.443733810954173,50.254424263439347,75.217752845833374,88.502610384034227,95.643058524738819,80.426765541691836,87.171788089148123,92.370312261045925,96.154899105614817,97.463560814968915,5.1443058802674289,9.8977897316277357,27.759891001112486,45.532873987018085,57.353785750664009,16.533065119927222,49.717554845778565,84.114776683484877,null,null,null,null,null,null,null,null,null,null,null,null,null,null,null,null,null,null,null,null,null,null,null,null,null,null,null,null,null,null,null,null,"Piped water on premises","Yes","N/A","N/A","N/A","N/A","N/A","N/A","N/A","N/A","N/A","N/A","N/A","N/A","N/A","N/A","N/A","N/A","N/A","N/A"]
[null,"No",88.556266189045658,49.745575736560347,24.782247154166658,11.497389615965799,4.356941475261138,19.573234458308377,12.828211910851806,7.6296877389539777,3.8451008943851805,2.5364391850310519,94.855694119732618,90.102210268372176,72.240108998887663,54.46712601298217,42.646214249336076,83.466934880072927,50.282445154220937,15.885223316515077,null,null,null,null,null,null,null,null,null,null,null,null,null,null,null,null,null,null,null,null,null,null,null,null,null,null,null,null,null,null,null,null,null,"No","N/A","N/A","N/A","N/A","N/A","N/A","N/A","N/A","N/A","N/A","N/A","N/A","N/A","N/A","N/A","N/A","N/A","N/A"]
["Piped water into dwelling","Yes","N/A","N/A","N/A","N/A","N/A","N/A","N/A","N/A","N/A","N/A","N/A","N/A","N/A","N/A","N/A","N/A","N/A","N/A",null,null,null,null,null,null,null,null,null,null,null,null,null,null,null,null,null,null,null,null,null,null,null,null,null,null,null,null,null,null,null,null,"Piped water into dwelling","Yes","N/A","N/A","N/A","N/A","N/A","N/A","N/A","N/A","N/A","N/A","N/A","N/A","N/A","N/A","N/A","N/A","N/A","N/A"]
[null,"No","N/A","N/A","N/A","N/A","N/A","N/A","N/A","N/A","N/A","N/A","N/A","N/A","N/A","N/A","N/A","N/A","N/A","N/A",null,null,null,null,null,null,null,null,null,null,null,null,null,null,null,null,null,null,null,null,null,null,null,null,null,null,null,null,null,null,null,null,null,"No","N/A","N/A","N/A","N/A","N/A","N/A","N/A","N/A","N/A","N/A","N/A","N/A","N/A","N/A","N/A","N/A","N/A","N/A"]
["Water source on premises","Yes",92.785899264923415,94.551132444595069,98.151375860668821,99.129415344099726,99.682051801718487,98.150145129573474,99.403276560566084,99.442027002796706,99.705918009476719,99.872661551404207,92.212457939457337,92.940452572626171,92.017766072614748,93.978698870672488,96.909012049929515,95.52234765122563,93.291483112051026,99.265436088317045,null,null,null,null,null,null,null,null,null,null,null,null,null,null,null,null,null,null,null,null,null,null,null,null,null,null,null,null,null,null,null,null,"Water source on premises","Yes","N/A","N/A","N/A","N/A","N/A","N/A","N/A","N/A","N/A","N/A","N/A","N/A","N/A","N/A","N/A","N/A","N/A","N/A"]
[null,"No",7.2141007350763191,5.4488675554048385,1.8486241393311837,0.87058465590030254,0.31794819828150805,1.8498548704265581,0.59672343943391781,0.55797299720326654,0.29408199052326733,0.12733844859580559,7.787542060542636,7.0595474273737828,7.9822339273851419,6.0213011293274734,3.0909879500703976,4.4776523487744084,6.7085168879486723,0.73456391168305224,null,null,null,null,null,null,null,null,null,null,null,null,null,null,null,null,null,null,null,null,null,null,null,null,null,null,null,null,null,null,null,null,null,"No","N/A","N/A","N/A","N/A","N/A","N/A","N/A","N/A","N/A","N/A","N/A","N/A","N/A","N/A","N/A","N/A","N/A","N/A"]
["Improved Water source on premises","Yes","N/A","N/A","N/A","N/A","N/A","N/A","N/A","N/A","N/A","N/A","N/A","N/A","N/A","N/A","N/A","N/A","N/A","N/A",null,null,null,null,null,null,null,null,null,null,null,null,null,null,null,null,null,null,null,null,null,null,null,null,null,null,null,null,null,null,null,null,"Improved water source on premises","Yes","N/A","N/A","N/A","N/A","N/A","N/A","N/A","N/A","N/A","N/A","N/A","N/A","N/A","N/A","N/A","N/A","N/A","N/A"]
[null,"No","N/A","N/A","N/A","N/A","N/A","N/A","N/A","N/A","N/A","N/A","N/A","N/A","N/A","N/A","N/A","N/A","N/A","N/A",null,null,null,null,null,null,null,null,null,null,null,null,null,null,null,null,null,null,null,null,null,null,null,null,null,null,null,null,null,null,null,null,null,"No","N/A","N/A","N/A","N/A","N/A","N/A","N/A","N/A","N/A","N/A","N/A","N/A","N/A","N/A","N/A","N/A","N/A","N/A"]
["Piped water on premises available when needed","Yes","N/A","N/A","N/A","N/A","N/A","N/A","N/A","N/A","N/A","N/A","N/A","N/A","N/A","N/A","N/A","N/A","N/A","N/A",null,null,null,null,null,null,null,null,null,null,null,null,null,null,null,null,null,null,null,null,null,null,null,null,null,null,null,null,null,null,null,null,"Piped water on premises available when needed","Yes","N/A","N/A","N/A","N/A","N/A","N/A","N/A","N/A","N/A","N/A","N/A","N/A","N/A","N/A","N/A","N/A","N/A","N/A"]
[null,"No","N/A","N/A","N/A","N/A","N/A","N/A","N/A","N/A","N/A","N/A","N/A","N/A","N/A","N/A","N/A","N/A","N/A","N/A",null,null,null,null,null,null,null,null,null,null,null,null,null,null,null,null,null,null,null,null,null,null,null,null,null,null,null,null,null,null,null,null,null,"No","N/A","N/A","N/A","N/A","N/A","N/A","N/A","N/A","N/A","N/A","N/A","N/A","N/A","N/A","N/A","N/A","N/A","N/A"]
["Water point at more than 30 minutes","Yes",0,0,0,0,0,0,0,0,0,0,0,0,0,0,0,0,0,0,null,null,null,null,null,null,null,null,null,null,null,null,null,null,null,null,null,null,null,null,null,null,null,null,null,null,null,null,null,null,null,null,"Water point at more than 30 minutes","Yes","N/A","N/A","N/A","N/A","N/A","N/A","N/A","N/A","N/A","N/A","N/A","N/A","N/A","N/A","N/A","N/A","N/A","N/A"]
[null,"No",100,100,100,100,100,100,100,100,100,100,100,100,100,100,100,100,100,100,null,null,null,null,null,null,null,null,null,null,null,null,null,null,null,null,null,null,null,null,null,null,null,null,null,null,null,null,null,null,null,null,null,"No","N/A","N/A","N/A","N/A","N/A","N/A","N/A","N/A","N/A","N/A","N/A","N/A","N/A","N/A","N/A","N/A","N/A","N/A"]
["Water source available when needed","Yes","N/A","N/A","N/A","N/A","N/A","N/A","N/A","N/A","N/A","N/A","N/A","N/A","N/A","N/A","N/A","N/A","N/A","N/A",null,null,null,null,null,null,null,null,null,null,null,null,null,null,null,null,null,null,null,null,null,null,null,null,null,null,null,null,null,null,null,null,"Water source available when needed","Yes","N/A","N/A","N/A","N/A","N/A","N/A","N/A","N/A","N/A","N/A","N/A","N/A","N/A","N/A","N/A","N/A","N/A","N/A"]
[null,"No","N/A","N/A","N/A","N/A","N/A","N/A","N/A","N/A","N/A","N/A","N/A","N/A","N/A","N/A","N/A","N/A","N/A","N/A",null,null,null,null,null,null,null,null,null,null,null,null,null,null,null,null,null,null,null,null,null,null,null,null,null,null,null,null,null,null,null,null,null,"No","N/A","N/A","N/A","N/A","N/A","N/A","N/A","N/A","N/A","N/A","N/A","N/A","N/A","N/A","N/A","N/A","N/A","N/A"]
["Improved water source available when needed","Yes","N/A","N/A","N/A","N/A","N/A","N/A","N/A","N/A","N/A","N/A","N/A","N/A","N/A","N/A","N/A","N/A","N/A","N/A",null,null,null,null,null,null,null,null,null,null,null,null,null,null,null,null,null,null,null,null,null,null,null,null,null,null,null,null,null,null,null,null,"Improved water source available when needed","Yes","N/A","N/A","N/A","N/A","N/A","N/A","N/A","N/A","N/A","N/A","N/A","N/A","N/A","N/A","N/A","N/A","N/A","N/A"]
[null,"No","N/A","N/A","N/A","N/A","N/A","N/A","N/A","N/A","N/A","N/A","N/A","N/A","N/A","N/A","N/A","N/A","N/A","N/A",null,null,null,null,null,null,null,null,null,null,null,null,null,null,null,null,null,null,null,null,null,null,null,null,null,null,null,null,null,null,null,null,null,"No","N/A","N/A","N/A","N/A","N/A","N/A","N/A","N/A","N/A","N/A","N/A","N/A","N/A","N/A","N/A","N/A","N/A","N/A"]
["Microbiological quality at point of collection","Not contaminated (No E. coli in 100 mL)","N/A","N/A","N/A","N/A","N/A","N/A","N/A","N/A","N/A","N/A","N/A","N/A","N/A","N/A","N/A","N/A","N/A","N/A",null,null,null,null,null,null,null,null,null,null,null,null,null,null,null,null,null,null,null,null,null,null,null,null,null,null,null,null,null,null,null,null,"Microbiological quality at point of collection","Not contaminated (No E. coli in 100 mL)","N/A","N/A","N/A","N/A","N/A","N/A","N/A","N/A","N/A","N/A","N/A","N/A","N/A","N/A","N/A","N/A","N/A","N/A"]
[null,"Contaminated (E. coli detected in 100 mL)","N/A","N/A","N/A","N/A","N/A","N/A","N/A","N/A","N/A","N/A","N/A","N/A","N/A","N/A","N/A","N/A","N/A","N/A",null,null,null,null,null,null,null,null,null,null,null,null,null,null,null,null,null,null,null,null,null,null,null,null,null,null,null,null,null,null,null,null,null,"Contaminated (E. coli detected in 100 mL)","N/A","N/A","N/A","N/A","N/A","N/A","N/A","N/A","N/A","N/A","N/A","N/A","N/A","N/A","N/A","N/A","N/A","N/A"]
[null,"Highly contaminated (>100 CFU/100 mL)","N/A","N/A","N/A","N/A","N/A","N/A","N/A","N/A","N/A","N/A","N/A","N/A","N/A","N/A","N/A","N/A","N/A","N/A",null,null,null,null,null,null,null,null,null,null,null,null,null,null,null,null,null,null,null,null,null,null,null,null,null,null,null,null,null,null,null,null,null,"Highly contaminated (>100 CFU/100 mL)","N/A","N/A","N/A","N/A","N/A","N/A","N/A","N/A","N/A","N/A","N/A","N/A","N/A","N/A","N/A","N/A","N/A","N/A"]
["Microbiological quality of improved water sources at point of collection","Not contaminated (No E. coli in 100 mL)","N/A","N/A","N/A","N/A","N/A","N/A","N/A","N/A","N/A","N/A","N/A","N/A","N/A","N/A","N/A","N/A","N/A","N/A",null,null,null,null,null,null,null,null,null,null,null,null,null,null,null,null,null,null,null,null,null,null,null,null,null,null,null,null,null,null,null,null,"Microbiological quality of improved water sources at point of collection","Not contaminated (No E. coli in 100 mL)","N/A","N/A","N/A","N/A","N/A","N/A","N/A","N/A","N/A","N/A","N/A","N/A","N/A","N/A","N/A","N/A","N/A","N/A"]
[null,"Contaminated (E. coli detected in 100 mL)","N/A","N/A","N/A","N/A","N/A","N/A","N/A","N/A","N/A","N/A","N/A","N/A","N/A","N/A","N/A","N/A","N/A","N/A",null,null,null,null,null,null,null,null,null,null,null,null,null,null,null,null,null,null,null,null,null,null,null,null,null,null,null,null,null,null,null,null,null,"Contaminated (E. coli detected in 100 mL)","N/A","N/A","N/A","N/A","N/A","N/A","N/A","N/A","N/A","N/A","N/A","N/A","N/A","N/A","N/A","N/A","N/A","N/A"]
[null,"Highly contaminated (>100 CFU/100 mL)","N/A","N/A","N/A","N/A","N/A","N/A","N/A","N/A","N/A","N/A","N/A","N/A","N/A","N/A","N/A","N/A","N/A","N/A",null,null,null,null,null,null,null,null,null,null,null,null,null,null,null,null,null,null,null,null,null,null,null,null,null,null,null,null,null,null,null,null,null,"Highly contaminated (>100 CFU/100 mL)","N/A","N/A","N/A","N/A","N/A","N/A","N/A","N/A","N/A","N/A","N/A","N/A","N/A","N/A","N/A","N/A","N/A","N/A"]
["Microbiological quality of piped on premises at point of collection","Not contaminated (No E. coli in 100 mL)","N/A","N/A","N/A","N/A","N/A","N/A","N/A","N/A","N/A","N/A","N/A","N/A","N/A","N/A","N/A","N/A","N/A","N/A",null,null,null,null,null,null,null,null,null,null,null,null,null,null,null,null,null,null,null,null,null,null,null,null,null,null,null,null,null,null,null,null,"Microbiological quality of piped on premises at point of collection","Not contaminated (No E. coli in 100 mL)","N/A","N/A","N/A","N/A","N/A","N/A","N/A","N/A","N/A","N/A","N/A","N/A","N/A","N/A","N/A","N/A","N/A","N/A"]
[null,"Contaminated (E. coli detected in 100 mL)","N/A","N/A","N/A","N/A","N/A","N/A","N/A","N/A","N/A","N/A","N/A","N/A","N/A","N/A","N/A","N/A","N/A","N/A",null,null,null,null,null,null,null,null,null,null,null,null,null,null,null,null,null,null,null,null,null,null,null,null,null,null,null,null,null,null,null,null,null,"Contaminated (E. coli detected in 100 mL)","N/A","N/A","N/A","N/A","N/A","N/A","N/A","N/A","N/A","N/A","N/A","N/A","N/A","N/A","N/A","N/A","N/A","N/A"]
[null,"Highly contaminated (>100 CFU/100 mL)","N/A","N/A","N/A","N/A","N/A","N/A","N/A","N/A","N/A","N/A","N/A","N/A","N/A","N/A","N/A","N/A","N/A","N/A",null,null,null,null,null,null,null,null,null,null,null,null,null,null,null,null,null,null,null,null,null,null,null,null,null,null,null,null,null,null,null,null,null,"Highly contaminated (>100 CFU/100 mL)","N/A","N/A","N/A","N/A","N/A","N/A","N/A","N/A","N/A","N/A","N/A","N/A","N/A","N/A","N/A","N/A","N/A","N/A"]
[null,null,"NATIONAL wealth index quintile",null,null,null,null,"URBAN wealth index quintile",null,null,null,null,"RURAL wealth index quintile",null,null,null,null,"SUB-REGIONS:",null,null,null,null,null,null,null,null,null,null,null,null,null,null,null,null,null,null,null,null,null,null,null,null,null,null,null,null,null,null,null,null,null,null,"Raw numbers of respondents:","Use of drinking water sources","NATIONAL wealth index quintile",null,null,null,null,"URBAN wealth index quintile",null,null,null,null,"RURAL wealth index quintile",null,null,null,null,"SUB-REGIONS:"]
["Percentage based on weighted population",null,"Poorest","Poor","Middle","Rich","Richest","Poorest","Poor","Middle","Rich","Richest","Poorest","Poor","Middle","Rich","Richest","Atlántico","Central","Pácifico",null,null,null,null,null,null,null,null,null,null,null,null,null,null,null,null,null,null,null,null,null,null,null,null,null,null,null,null,null,null,null,null,"Water data, raw numbers (weighted)",null,"Poorest","Poor","Middle","Rich","Richest","Poorest","Poor","Middle","Rich","Richest","Poorest","Poor","Middle","Rich","Richest","Atlántico","Central","Pácifico"]
["Esta vivienda se abastece de agua por","Dentro de la vivienda",0.87092291595811022,7.3656142967665801,19.345576673583004,41.346074596729153,70.65610984505129,16.396009321979172,28.043831856145296,44.072245301402241,60.359232778562891,78.339173242008386,0.55995531848433977,0.67631533898345697,1.6461567312741261,6.1138798516203483,14.625427389294115,6.9816443107687611,18.738263140508082,38.298596791581829]
[null,"Fuera de la vivi. dentro del terreno",10.572810894996062,42.888809966672717,55.872176172250278,47.156535787304868,24.986948679687757,64.030756219712742,59.127956233002855,48.298066959643748,35.795666327051634,19.12438757296076,4.5843505617830882,9.2214743926442804,26.113734269838361,39.418994135397739,42.728358361369942,9.5514208091584525,30.979291705270434,45.816179891903154]
[null,"Puesto público",4.047378803982209,4.4780318741517977,1.4639556307146191,0.8462269338973023,0.11922127448882278,2.1792606936769845,0.7109506396774683,0.32330352965867715,0.23272091347579038,0.14971444284672364,2.2269775467193069,5.1747455400609592,6.1564140134000347,4.7448334574927493,2.3882720133454405,2.0266920979077261,4.5063662492326406,0.87774300993594956]
[null,"Puesto privado",1.7696920875845248,2.1172493720093835,1.0670313500397131,0.53230171556054695,0.34812415332670404,0.52329757621861139,1.3192125155196859,0.21915599733393051,0.29602947488799586,9.8018058625191223E-2,1.2063025247293508,2.6086754225479498,2.8178461344342076,1.9128152284975961,1.7591584107659652,2.8226182508501303,1.1295188723635627,0.791519428485154]
[null,"Pozo público",10.505827051430531,9.6881407634548484,5.6057370315269059,1.5642859000804845,0.35491841036489324,2.398935414546802,2.6554322320080668,0.35473594042646528,0.35699186127057586,0,8.2106060518477797,13.160608310708632,14.130138920104793,11.350579573314404,9.9136660859475239,9.8651913291378577,7.7681461867208546,3.2078244859729579]
[null,"Pozo privado",16.148857994127155,13.233764487859592,9.0315627232481308,5.8307097295113444,2.8733752268424926,6.9101517746559944,5.151383110855571,4.5717204941550076,2.3704752468706327,2.0897006625152414,13.66032559235423,18.567585635815828,17.3894586699762,15.50313018878334,16.433309096684283,25.154627874265344,6.4519102107645123,7.3865680111753083]
[null,"Río, quebrada o arroyo",16.1256312305152,4.7818846607193013,1.4517690363540403,0.39460055174105629,0.15167183587649696,1.3483778039917091,0.13210590923553736,0.17605402090922984,0.10507394988182879,0,20.274366318476932,14.793949760851641,7.3638200951466963,5.5127799825078787,2.9437499245542691,11.191935212963282,8.9002236759427031,0.47273370062357384]
[null,"Manantial o ojo de agua",34.365814107934661,9.5736824816345507,2.459494957458912,0.51017797559685307,0.21830622126825586,0.47008678991997987,0.53209095141973461,8.5596116835713804E-2,4.972113561023854E-2,3.7316912968288193E-2,43.981736203390227,31.07077292833511,17.175915156647115,10.479248272734127,5.2357145578992874,25.780737163921035,17.067829833862575,1.038977571261019]
[null,"Lago, laguna",0.39352350590990637,0.31635512662229676,3.3969851330065533E-2,0,0,2.2899301700492591E-2,0,0,0,0,0.41242908215749802,0.27908397614282071,0.54868122876218905,0.41026781985264932,4.7347603593617192E-2,0.17242536561710778,8.510547656132568E-2,0.18030519171752593]
[null,"De otra vivienda/vecino/empresa",3.3692110931300561,4.0976154101254361,2.8329806325173195,1.4825942349997405,0.18148568029917983,4.6505346491602442,2.0155688869380146,1.5446229340804674,0.27436637040101841,0.16168910807560705,2.4738470133456776,3.2446718680553213,4.3653878599778411,3.2361909542546323,3.0336405028352069,4.677704701083238,2.474786439148168,1.7967990947103452]
[null,"Agua de lluvia",4.5385921190117126E-2,3.2652533390973563E-2,0,0.13395129050400326,1.0580176736991286E-2,5.7336163229767978E-2,0,0.23509008133524167,1.8566753170911915E-2,0,5.607296238455213E-2,4.9387906314905174E-2,0,0,0,0.20525011462740081,5.1838081257916613E-2,1.6832107559661231E-3]
[null,"Camión, carreta o pipa",0.12725954445480711,0.25021160467456044,0.32672551542615635,9.8581756175136981E-2,6.1874322065032239E-2,0.89153709578927565,0.20385457651498251,0.11940862421924688,0.1411551888161886,0,3.7519905733880782E-2,0.11249472628127831,2.9999756782757351E-2,3.4722464748127978E-2,0,0.11785766355723253,0.36525380081492975,7.3773053089196558E-2]
[null,"Otro",1.6576848487867022,1.129297154054802,0.50902042555076277,0.10395952789932193,3.7384173992271154E-2,0.1208171954185078,0.10761308868274379,0,0,0,2.3155109185930343,1.0402341932578272,2.1540188201651449,1.2825580707966933,0.89135605371048265,1.4518951061426693,1.4523139406515906,5.7296558788121524E-2]
[null,"No hay dato",0,4.6690267862866799E-2,0,0,0,0,0,0,0,0,0,0,0.10842834349067937,0,0,0,2.9152386900362412E-2,0]
[]
[]
[]
[]
[]
[]
[]
[]
[]
[]
[]
[]
[]
[]
[]
[]
[]
[]
[]
[]
[]
[]
[]
[]
[]
[]
[]
[]
[]
[]
[]
[]
[]
[]
[]
[]
[{"$f":"A1026","v":"Nicaragua"}]
[{"$f":"A1034","v":"2011"}]
["Use of sanitation facilities"]
[" by wealth quintile and sub-national region"]
["Notes:"]
["WHO/UNICEF JMP customised wealth index excludes water,"]
[" sanitation and hygiene assets."]
["Survey used for analysis:",{"$f":"A1025","v":"ENDESA11"}]
[{"$f":"B1030","v":"Ratio of Improved latrines based on:"}]
[{"$f":"B1029","v":"Ratio of Shared improved based on:"},"DHS01"]
[]
[]
["Use of sanitation facilities",null,"NATIONAL wealth index quintile",null,null,null,null,"URBAN wealth index quintile",null,null,null,null,"RURAL wealth index quintile",null,null,null,null,"SUB-REGIONS:",null,null,null,null,null,null,null,null,null,null,null,null,null,null,null,null,null,null,null,null,null,null,null,null,null,null,null,null,null,null,null,null,null,null,"Raw numbers of respondents:","Use of sanitation facilities","NATIONAL wealth index quintile",null,null,null,null,"URBAN wealth index quintile",null,null,null,null,"RURAL wealth index quintile",null,null,null,null,"SUB-REGIONS:"]
["Weighted percentage (used in graphs)",null,"Poorest","Poor","Middle","Rich","Richest","Poorest","Poor","Middle","Rich","Richest","Poorest","Poor","Middle","Rich","Richest","Atlántico","Central","Pácifico",null,null,null,null,null,null,null,null,null,null,null,null,null,null,null,null,null,null,null,null,null,null,null,null,null,null,null,null,null,null,null,null,"Sanitation data, raw numbers (weighted)",null,"Poorest","Poor","Middle","Rich","Richest","Poorest","Poor","Middle","Rich","Richest","Poorest","Poor","Middle","Rich","Richest","Atlántico","Central","Pácifico"]
["Sanitation","Improved",{"$f":"C154+C155+C153*0.35+C153*0.65*0.5","v":45.615297933381697},{"$f":"D154+D155+D153*0.35+D153*0.65*0.5","v":61.692843249267497},72.06435318712326,83.055957886708171,94.9389886757006,{"$f":"H154+H155+H153*0.36+H153*0.64*0.5","v":68.349796354079075},{"$f":"I154+I155+I153*0.36+I153*0.64*0.5","v":77.289708815091501},83.873656768888225,92.451868468712519,97.468512312755095,{"$f":"M154+M155+M153*0.33+M153*0.67*0.5","v":35.314572520261194},{"$f":"N154+N155+N153*0.33+N153*0.67*0.5","v":51.57745937648216},56.339877912598411,60.914539087189993,68.671758636872823,53.912072544329682,63.534808594827695,79.283713044387355,null,null,null,null,null,null,null,null,null,null,null,null,null,null,null,null,null,null,null,null,null,null,null,null,null,null,null,null,null,null,null,null,"Sanitation","Improved","N/A","N/A","N/A","N/A","N/A","N/A","N/A","N/A","N/A","N/A","N/A","N/A","N/A","N/A","N/A","N/A","N/A","N/A"]
[null,"Not Improved",{"$f":"100-C122","v":54.384702066618303},{"$f":"100-D122","v":38.307156750732503},27.93564681287674,16.944042113291829,5.0610113242994004,31.650203645920925,22.710291184908499,16.126343231111775,7.5481315312874813,2.5314876872449048,64.685427479738806,48.42254062351784,43.660122087401589,39.085460912810007,31.328241363127177,46.087927455670318,36.465191405172305,20.716286955612645,null,null,null,null,null,null,null,null,null,null,null,null,null,null,null,null,null,null,null,null,null,null,null,null,null,null,null,null,null,null,null,null,null,"Not Improved","N/A","N/A","N/A","N/A","N/A","N/A","N/A","N/A","N/A","N/A","N/A","N/A","N/A","N/A","N/A","N/A","N/A","N/A"]
["Sanitation ladder","Basic",{"$f":"C122*'DHS01'!C129/100","v":42.769028148399521},{"$f":"D122*'DHS01'!D129/100","v":56.495768123480069},{"$f":"E122*'DHS01'!E129/100","v":64.587744868614351},{"$f":"F122*'DHS01'!F129/100","v":76.031747467526856},{"$f":"G122*'DHS01'!G129/100","v":91.083187120003899},{"$f":"H122*'DHS01'!H129/100","v":61.450894605901404},{"$f":"I122*'DHS01'!I129/100","v":69.410744927680028},{"$f":"J122*'DHS01'!J129/100","v":76.915150588240252},{"$f":"K122*'DHS01'!K129/100","v":86.901708340778299},{"$f":"L122*'DHS01'!L129/100","v":94.979501345801708},{"$f":"M122*'DHS01'!M129/100","v":33.388009633800571},{"$f":"N122*'DHS01'!N129/100","v":48.765929554317751},{"$f":"O122*'DHS01'!O129/100","v":53.326343539131791},{"$f":"P122*'DHS01'!P129/100","v":54.925168457919},{"$f":"Q122*'DHS01'!Q129/100","v":61.124243754145503},"N/A","N/A","N/A",null,null,null,null,null,null,null,null,null,null,null,null,null,null,null,null,null,null,null,null,null,null,null,null,null,null,null,null,null,null,null,null,"Sanitation ladder","Basic","N/A","N/A","N/A","N/A","N/A","N/A","N/A","N/A","N/A","N/A","N/A","N/A","N/A","N/A","N/A","N/A","N/A","N/A"]
[null,"Limited",{"$f":"C122*'DHS01'!C128/100","v":2.8462697849821756},{"$f":"D122*'DHS01'!D128/100","v":5.1970751257874248},{"$f":"E122*'DHS01'!E128/100","v":7.4766083185089096},{"$f":"F122*'DHS01'!F128/100","v":7.0242104191813235},{"$f":"G122*'DHS01'!G128/100","v":3.8558015556967025},{"$f":"H122*'DHS01'!H128/100","v":6.8989017481776633},{"$f":"I122*'DHS01'!I128/100","v":7.8789638874114623},{"$f":"J122*'DHS01'!J128/100","v":6.9585061806479755},{"$f":"K122*'DHS01'!K128/100","v":5.5501601279342276},{"$f":"L122*'DHS01'!L128/100","v":2.4890109669534026},{"$f":"M122*'DHS01'!M128/100","v":1.9265628864606219},{"$f":"N122*'DHS01'!N128/100","v":2.8115298221644025},{"$f":"O122*'DHS01'!O128/100","v":3.0135343734666185},{"$f":"P122*'DHS01'!P128/100","v":5.9893706292709927},{"$f":"Q122*'DHS01'!Q128/100","v":7.547514882727322},"N/A","N/A","N/A",null,null,null,null,null,null,null,null,null,null,null,null,null,null,null,null,null,null,null,null,null,null,null,null,null,null,null,null,null,null,null,null,null,"Limited","N/A","N/A","N/A","N/A","N/A","N/A","N/A","N/A","N/A","N/A","N/A","N/A","N/A","N/A","N/A","N/A","N/A","N/A"]
[null,"Unimproved",{"$f":"100-(C124+C125+C127)","v":21.640395093048625},{"$f":"100-(D124+D125+D127)","v":27.476558654656898},23.88093713852345,15.277702950020853,4.6985727600508085,24.598050417820758,19.483785747941198,14.864419543585299,6.9123210040382475,2.4608526557281749,17.634402509240431,25.798774985307361,27.990786055345779,29.808273315696383,26.771675394564468,"N/A","N/A","N/A",null,null,null,null,null,null,null,null,null,null,null,null,null,null,null,null,null,null,null,null,null,null,null,null,null,null,null,null,null,null,null,null,null,"Unimproved","N/A","N/A","N/A","N/A","N/A","N/A","N/A","N/A","N/A","N/A","N/A","N/A","N/A","N/A","N/A","N/A","N/A","N/A"]
[null,"Open defecation",{"$f":"C157","v":32.744306973569671},{"$f":"D157","v":10.830598096075603},4.0547096743532833,1.6663391632709592,0.36243856424859106,7.0521532281001829,3.2265054369673147,1.2619236875264772,0.63581052724921672,7.0635031516709176E-2,47.051024970498375,22.623765638210482,15.669336032055808,9.2771875971136293,4.5565659685627091,"N/A","N/A","N/A",null,null,null,null,null,null,null,null,null,null,null,null,null,null,null,null,null,null,null,null,null,null,null,null,null,null,null,null,null,null,null,null,null,"Open defecation","N/A","N/A","N/A","N/A","N/A","N/A","N/A","N/A","N/A","N/A","N/A","N/A","N/A","N/A","N/A","N/A","N/A","N/A"]
["Shared among Improved Sanitation","Yes","N/A","N/A","N/A","N/A","N/A","N/A","N/A","N/A","N/A","N/A","N/A","N/A","N/A","N/A","N/A","N/A","N/A","N/A",null,null,null,null,null,null,null,null,null,null,null,null,null,null,null,null,null,null,null,null,null,null,null,null,null,null,null,null,null,null,null,null,"Shared among improved sanitation facilities","Yes","N/A","N/A","N/A","N/A","N/A","N/A","N/A","N/A","N/A","N/A","N/A","N/A","N/A","N/A","N/A","N/A","N/A","N/A"]
[null,"No","N/A","N/A","N/A","N/A","N/A","N/A","N/A","N/A","N/A","N/A","N/A","N/A","N/A","N/A","N/A","N/A","N/A","N/A",null,null,null,null,null,null,null,null,null,null,null,null,null,null,null,null,null,null,null,null,null,null,null,null,null,null,null,null,null,null,null,null,null,"No","N/A","N/A","N/A","N/A","N/A","N/A","N/A","N/A","N/A","N/A","N/A","N/A","N/A","N/A","N/A","N/A","N/A","N/A"]
["Manually calculated ratios","Improved latrines"]
[null,"Other"]
[null,"Other"]
[null,null,"NATIONAL wealth index quintile",null,null,null,null,"URBAN wealth index quintile",null,null,null,null,"RURAL wealth index quintile",null,null,null,null,"SUB-REGIONS:",null,null,null,null,null,null,null,null,null,null,null,null,null,null,null,null,null,null,null,null,null,null,null,null,null,null,null,null,null,null,null,null,null,null,"Raw numbers of respondents:","Use of sanitation facilities","NATIONAL wealth index quintile",null,null,null,null,"URBAN wealth index quintile",null,null,null,null,"RURAL wealth index quintile",null,null,null,null,"SUB-REGIONS:"]
["Percentage based on weighted population",null,"Poorest","Poor","Middle","Rich","Richest","Poorest","Poor","Middle","Rich","Richest","Poorest","Poor","Middle","Rich","Richest","Atlántico","Central","Pácifico",null,null,null,null,null,null,null,null,null,null,null,null,null,null,null,null,null,null,null,null,null,null,null,null,null,null,null,null,null,null,null,null,"Sanitation data, raw numbers (weighted)",null,"Poorest","Poor","Middle","Rich","Richest","Poorest","Poor","Middle","Rich","Richest","Poorest","Poor","Middle","Rich","Richest","Atlántico","Central","Pácifico"]
["Sanitation type","Sewer connection",{"$f":"C154","v":0.32372304146442205},{"$f":"D154","v":3.1628138496225091},16.071528774705218,35.500030393804686,58.954776380543905,13.401936109748803,27.165958632073213,37.512737162874991,54.714125027063446,66.019763546743022,1.0423663256197509E-2,1.4478107836520605E-2,2.4694635850124179E-2,0.12087396151072792,1.6212988665789547,0.96392324267741103,12.780098182259861,33.894758617127486,null,null,null,null,null,null,null,null,null,null,null,null,null,null,null,null,null,null,null,null,null,null,null,null,null,null,null,null,null,null,null,null,"Sanitation type","Sewer connection","N/A","N/A","N/A","N/A","N/A","N/A","N/A","N/A","N/A","N/A","N/A","N/A","N/A","N/A","N/A","N/A","N/A","N/A"]
[null,"Septic tank connection",{"$f":"C155","v":0.45650540856472149},1.6579428953552628,6.4875055592550277,16.060099368666485,26.569857316172936,2.7570983000899316,8.7207054686433896,15.076194407939949,23.512806082417459,26.426080602572,0.37117221248499666,0.35048764109553598,1.2651048304167305,1.7127457563557591,14.098575418021472,6.8905429124135154,6.6682041225902031,13.140880386860474,null,null,null,null,null,null,null,null,null,null,null,null,null,null,null,null,null,null,null,null,null,null,null,null,null,null,null,null,null,null,null,null,null,"Septic tank connection","N/A","N/A","N/A","N/A","N/A","N/A","N/A","N/A","N/A","N/A","N/A","N/A","N/A","N/A","N/A","N/A","N/A","N/A"]
[null,"Improved latrines","N/A","N/A","N/A","N/A","N/A","N/A","N/A","N/A","N/A","N/A","N/A","N/A","N/A","N/A","N/A","N/A","N/A","N/A",null,null,null,null,null,null,null,null,null,null,null,null,null,null,null,null,null,null,null,null,null,null,null,null,null,null,null,null,null,null,null,null,null,"Improved latrines","N/A","N/A","N/A","N/A","N/A","N/A","N/A","N/A","N/A","N/A","N/A","N/A","N/A","N/A","N/A","N/A","N/A","N/A"]
[null,"Unimproved facilities","N/A","N/A","N/A","N/A","N/A","N/A","N/A","N/A","N/A","N/A","N/A","N/A","N/A","N/A","N/A","N/A","N/A","N/A",null,null,null,null,null,null,null,null,null,null,null,null,null,null,null,null,null,null,null,null,null,null,null,null,null,null,null,null,null,null,null,null,null,"Unimproved facilities","N/A","N/A","N/A","N/A","N/A","N/A","N/A","N/A","N/A","N/A","N/A","N/A","N/A","N/A","N/A","N/A","N/A","N/A"]
[null,"Open defecation",{"$f":"C157","v":32.744306973569671},{"$f":"D157","v":10.830598096075603},4.0547096743532833,1.6663391632709592,0.36243856424859106,7.0521532281001829,3.2265054369673147,1.2619236875264772,0.63581052724921672,7.0635031516709176E-2,47.051024970498375,22.623765638210482,15.669336032055808,9.2771875971136293,4.5565659685627091,22.885975364850992,14.095098305986934,4.3934324355742929,null,null,null,null,null,null,null,null,null,null,null,null,null,null,null,null,null,null,null,null,null,null,null,null,null,null,null,null,null,null,null,null,null,"Open defecation","N/A","N/A","N/A","N/A","N/A","N/A","N/A","N/A","N/A","N/A","N/A","N/A","N/A","N/A","N/A","N/A","N/A","N/A"]
["Septic tank emptying practices","Not emptied/treated and disposed in situ","N/A","N/A","N/A","N/A","N/A","N/A","N/A","N/A","N/A","N/A","N/A","N/A","N/A","N/A","N/A","N/A","N/A","N/A",null,null,null,null,null,null,null,null,null,null,null,null,null,null,null,null,null,null,null,null,null,null,null,null,null,null,null,null,null,null,null,null,"Septic tank emptying practices","Not emptied/treated and disposed in situ","N/A","N/A","N/A","N/A","N/A","N/A","N/A","N/A","N/A","N/A","N/A","N/A","N/A","N/A","N/A","N/A","N/A","N/A"]
[null,"Emptied and buried on site","N/A","N/A","N/A","N/A","N/A","N/A","N/A","N/A","N/A","N/A","N/A","N/A","N/A","N/A","N/A","N/A","N/A","N/A",null,null,null,null,null,null,null,null,null,null,null,null,null,null,null,null,null,null,null,null,null,null,null,null,null,null,null,null,null,null,null,null,null,"Emptied and buried on site","N/A","N/A","N/A","N/A","N/A","N/A","N/A","N/A","N/A","N/A","N/A","N/A","N/A","N/A","N/A","N/A","N/A","N/A"]
[null,"Emptied and discharged locally","N/A","N/A","N/A","N/A","N/A","N/A","N/A","N/A","N/A","N/A","N/A","N/A","N/A","N/A","N/A","N/A","N/A","N/A",null,null,null,null,null,null,null,null,null,null,null,null,null,null,null,null,null,null,null,null,null,null,null,null,null,null,null,null,null,null,null,null,null,"Emptied and discharged locally","N/A","N/A","N/A","N/A","N/A","N/A","N/A","N/A","N/A","N/A","N/A","N/A","N/A","N/A","N/A","N/A","N/A","N/A"]
[null,"Emptied and removed offsite","N/A","N/A","N/A","N/A","N/A","N/A","N/A","N/A","N/A","N/A","N/A","N/A","N/A","N/A","N/A","N/A","N/A","N/A",null,null,null,null,null,null,null,null,null,null,null,null,null,null,null,null,null,null,null,null,null,null,null,null,null,null,null,null,null,null,null,null,null,"Emptied and removed offsite","N/A","N/A","N/A","N/A","N/A","N/A","N/A","N/A","N/A","N/A","N/A","N/A","N/A","N/A","N/A","N/A","N/A","N/A"]
["Latrine emptying practices","Not emptied/treated and disposed in situ","N/A","N/A","N/A","N/A","N/A","N/A","N/A","N/A","N/A","N/A","N/A","N/A","N/A","N/A","N/A","N/A","N/A","N/A",null,null,null,null,null,null,null,null,null,null,null,null,null,null,null,null,null,null,null,null,null,null,null,null,null,null,null,null,null,null,null,null,"Latrine emptying practices","Not emptied/treated and disposed in situ","N/A","N/A","N/A","N/A","N/A","N/A","N/A","N/A","N/A","N/A","N/A","N/A","N/A","N/A","N/A","N/A","N/A","N/A"]
[null,"Emptied and buried on site","N/A","N/A","N/A","N/A","N/A","N/A","N/A","N/A","N/A","N/A","N/A","N/A","N/A","N/A","N/A","N/A","N/A","N/A",null,null,null,null,null,null,null,null,null,null,null,null,null,null,null,null,null,null,null,null,null,null,null,null,null,null,null,null,null,null,null,null,null,"Emptied and buried on site","N/A","N/A","N/A","N/A","N/A","N/A","N/A","N/A","N/A","N/A","N/A","N/A","N/A","N/A","N/A","N/A","N/A","N/A"]
[null,"Emptied and discharged locally","N/A","N/A","N/A","N/A","N/A","N/A","N/A","N/A","N/A","N/A","N/A","N/A","N/A","N/A","N/A","N/A","N/A","N/A",null,null,null,null,null,null,null,null,null,null,null,null,null,null,null,null,null,null,null,null,null,null,null,null,null,null,null,null,null,null,null,null,null,"Emptied and discharged locally","N/A","N/A","N/A","N/A","N/A","N/A","N/A","N/A","N/A","N/A","N/A","N/A","N/A","N/A","N/A","N/A","N/A","N/A"]
[null,"Emptied and removed offsite","N/A","N/A","N/A","N/A","N/A","N/A","N/A","N/A","N/A","N/A","N/A","N/A","N/A","N/A","N/A","N/A","N/A","N/A",null,null,null,null,null,null,null,null,null,null,null,null,null,null,null,null,null,null,null,null,null,null,null,null,null,null,null,null,null,null,null,null,null,"Emptied and removed offsite","N/A","N/A","N/A","N/A","N/A","N/A","N/A","N/A","N/A","N/A","N/A","N/A","N/A","N/A","N/A","N/A","N/A","N/A"]
["Shared among improved sanitation facilities","Yes","N/A","N/A","N/A","N/A","N/A","N/A","N/A","N/A","N/A","N/A","N/A","N/A","N/A","N/A","N/A","N/A","N/A","N/A",null,null,null,null,null,null,null,null,null,null,null,null,null,null,null,null,null,null,null,null,null,null,null,null,null,null,null,null,null,null,null,null,"Shared among improved sanitation facilities","Yes","N/A","N/A","N/A","N/A","N/A","N/A","N/A","N/A","N/A","N/A","N/A","N/A","N/A","N/A","N/A","N/A","N/A","N/A"]
[null,"No","N/A","N/A","N/A","N/A","N/A","N/A","N/A","N/A","N/A","N/A","N/A","N/A","N/A","N/A","N/A","N/A","N/A","N/A",null,null,null,null,null,null,null,null,null,null,null,null,null,null,null,null,null,null,null,null,null,null,null,null,null,null,null,null,null,null,null,null,null,"No","N/A","N/A","N/A","N/A","N/A","N/A","N/A","N/A","N/A","N/A","N/A","N/A","N/A","N/A","N/A","N/A","N/A","N/A"]
[null,"DK/missing","N/A","N/A","N/A","N/A","N/A","N/A","N/A","N/A","N/A","N/A","N/A","N/A","N/A","N/A","N/A","N/A","N/A","N/A",null,null,null,null,null,null,null,null,null,null,null,null,null,null,null,null,null,null,null,null,null,null,null,null,null,null,null,null,null,null,null,null,null,"DK/missing","N/A","N/A","N/A","N/A","N/A","N/A","N/A","N/A","N/A","N/A","N/A","N/A","N/A","N/A","N/A","N/A","N/A","N/A"]
["Shared among all sanitation facilities","Yes","N/A","N/A","N/A","N/A","N/A","N/A","N/A","N/A","N/A","N/A","N/A","N/A","N/A","N/A","N/A","N/A","N/A","N/A",null,null,null,null,null,null,null,null,null,null,null,null,null,null,null,null,null,null,null,null,null,null,null,null,null,null,null,null,null,null,null,null,"Shared among all sanitation facilities","Yes","N/A","N/A","N/A","N/A","N/A","N/A","N/A","N/A","N/A","N/A","N/A","N/A","N/A","N/A","N/A","N/A","N/A","N/A"]
[null,"No","N/A","N/A","N/A","N/A","N/A","N/A","N/A","N/A","N/A","N/A","N/A","N/A","N/A","N/A","N/A","N/A","N/A","N/A",null,null,null,null,null,null,null,null,null,null,null,null,null,null,null,null,null,null,null,null,null,null,null,null,null,null,null,null,null,null,null,null,null,"No","N/A","N/A","N/A","N/A","N/A","N/A","N/A","N/A","N/A","N/A","N/A","N/A","N/A","N/A","N/A","N/A","N/A","N/A"]
["El tipo de servicio higienico de la vivienda","Excusado o letrina",66.422325160522306,84.254942969318108,73.341213115797061,46.660486109980738,13.947192561457419,76.751120506235779,60.886830462316041,46.006948820695989,20.919025528281775,7.3862767109412797,52.530791946646616,77.011268612857293,82.782072851626396,88.843487773418801,79.626893762815612,69.259558480058274,66.295498180417482,48.493344421653234,null,null,null,null,null,null,null,null,null,null,null,null,null,null,null,null,null,null,null,null,null,null,null,null,null,null,null,null,null,null,null,null,"El tipo de servicio higienico de la vivienda","Excusado o letrina",11892.469350539572,15080.51357408546,13127.810036073939,8353.9149044672577,2496.1618236908339,7823.3673254879086,6204.8594426497812,4693.2837913808262,2133.4592313724984,752.77478725139679,4046.5437660110383,5935.7472681046238,6380.2924013189086,6845.028933211589,6135.5127420684921,8152.5817249638631,19004.525370527739,23793.762593365427]
[null,"Tubería de aguas negra",0.32372304146442205,3.1628138496225091,16.071528774705218,35.500030393804686,58.954776380543905,13.401936109748803,27.165958632073213,37.512737162874991,54.714125027063446,66.019763546743022,1.0423663256197509E-2,1.4478107836520605E-2,2.4694635850124179E-2,0.12087396151072792,1.6212988665789547,0.96392324267741103,12.780098182259861,33.894758617127486,null,null,null,null,null,null,null,null,null,null,null,null,null,null,null,null,null,null,null,null,null,null,null,null,null,null,null,null,null,null,null,null,null,"Tubería de aguas negra",57.960427301741532,566.10159013349278,2876.7451175167721,6355.7896142965847,10551.274851687151,1366.081281520401,2768.4304414758167,3826.7680385196854,5580.1048173894269,6728.4256199973415,0.80295400098297898,1.115919664561968,1.9032985287803079,9.3128464961095681,124.92638334263005,113.46394901986613,3663.5926542344823,16630.814997681362]
[null,"Sumidero o pozo septico",0.45650540856472149,1.6579428953552628,6.4875055592550277,16.060099368666485,26.569857316172936,2.7570983000899316,8.7207054686433896,15.076194407939949,23.512806082417459,26.426080602572,0.37117221248499666,0.35048764109553598,1.2651048304167305,1.7127457563557591,14.098575418021472,6.8905429124135154,6.6682041225902031,13.140880386860474,null,null,null,null,null,null,null,null,null,null,null,null,null,null,null,null,null,null,null,null,null,null,null,null,null,null,null,null,null,null,null,null,null,"Sumidero o pozo septico",81.734214612200518,296.74971529644773,1161.239867349964,2875.3387430833077,4755.2697936374552,281.03554204566109,888.71027220196061,1537.9602574005344,2397.9899601052421,2693.2225777599283,28.5920799380518,27.014307069730968,97.505878487085127,131.9600856664949,1086.3413733046975,811.08969585759394,1911.5333303439272,6447.70930777784]
[null,"Río / Quebrada",0,1.9673961583997601E-2,9.1259006135636436E-3,0.11304496427699284,6.0713187474938458E-2,1.6025475771052726E-2,0,0.14219592096265413,0.16276027214307581,0,0,0,0,4.5704911600998259E-2,0,0,9.0661160339900085E-2,2.0932440512208383E-2,null,null,null,null,null,null,null,null,null,null,null,null,null,null,null,null,null,null,null,null,null,null,null,null,null,null,null,null,null,null,null,null,null,"Río / Quebrada",0,3.521377313513276,1.6335029729300941,20.239137880446076,10.865981816894738,1.6335029729300941,0,14.505761154808042,16.599358542532769,0,0,0,0,3.521377313513276,0,0,25.989280857535665,10.270719126248521]
[null,"No tiene",32.744306973569671,10.830598096075603,4.0547096743532833,1.6663391632709592,0.36243856424859106,7.0521532281001829,3.2265054369673147,1.2619236875264772,0.63581052724921672,7.0635031516709176E-2,47.051024970498375,22.623765638210482,15.669336032055808,9.2771875971136293,4.5565659685627091,22.885975364850992,14.095098305986934,4.3934324355742929,null,null,null,null,null,null,null,null,null,null,null,null,null,null,null,null,null,null,null,null,null,null,null,null,null,null,null,null,null,null,null,null,null,"No tiene",5862.6473274874197,1938.5329316858017,725.77826429320339,298.33498817684119,64.866481445934298,718.83752022318072,328.80694520169266,128.73198811139812,64.844121774685433,7.1987921524416301,3624.4272116090569,1743.7572124195228,1207.6883578190573,714.76952461645601,351.09831916170435,2693.9210790836737,4040.5557045098958,2155.6832094956203]
[null,"No hay dato",5.3139415878862055E-2,7.4028228044379404E-2,3.591697527584356E-2,0,0.10502199010254673,2.1666380054418431E-2,0,0,5.5472562844907994E-2,9.7244108227203363E-2,3.6587207113620027E-2,0,0.25879165005105909,0,9.6665984021361423E-2,0,7.0440048405469066E-2,5.6651698272075023E-2,null,null,null,null,null,null,null,null,null,null,null,null,null,null,null,null,null,null,null,null,null,null,null,null,null,null,null,null,null,null,null,null,null,"No hay dato",9.5142540270563085,13.250067693895355,6.4290077633046296,0,18.796032333163691,2.20848957854066,0,0,5.6574552733996679,9.910664837908044,2.8183800276939279,0,19.945941693257737,0,7.4484304066199503,0,20.19261825863104,27.79674355878895]
[null,null,null,null,null,null,null,null,null,null,null,null,null,null,null,null,null,null,null,null,null,null,null,null,null,null,null,null,null,null,null,null,null,null,null,null,null,null,null,null,null,null,null,null,null,null,null,null,null,null,null,null,null,"Total",17904.325573967995,17898.669256208635,17899.635795970113,17903.617387904462,17897.234964611373,10193.163661828605,10190.807101529255,10201.249836567245,10198.654944457798,10191.532441998994,7703.1843915868394,7707.6347072584522,7707.3358778470802,7704.5927673041688,7705.3272482841357,11771.056448924975,28666.388958732256,49066.0375710054]
[]
[]
[]
[]
[]
[]
[]
[]
[]
[]
[]
[]
[]
[]
[]
[]
[]
[]
[]
[]
[]
[]
[]
[]
[]
[]
[]
[]
[]
[]
[]
[]
[]
[]
[]
[]
[]
[]
[]
[]
[]
[]
[]
[]
[]
[]
[]
[]
[{"$f":"A1026","v":"Nicaragua"}]
[{"$f":"A1034","v":"2011"}]
["Access to hygiene facilities "]
[" by wealth quintile and sub-national region"]
["Notes:"]
["WHO/UNICEF JMP customised wealth index excludes water,"]
[" sanitation and hygiene assets."]
["Survey used for analysis:",{"$f":"A1025","v":"ENDESA11"}]
[]
[]
[]
[]
["Access to handwashing",null,"NATIONAL wealth index quintile",null,null,null,null,"URBAN wealth index quintile",null,null,null,null,"RURAL wealth index quintile",null,null,null,null,"SUB-REGIONS:",null,null,null,null,null,null,null,null,null,null,null,null,null,null,null,null,null,null,null,null,null,null,null,null,null,null,null,null,null,null,null,null,null,null,"Raw numbers of respondents:","Access to handwashing","NATIONAL wealth index quintile",null,null,null,null,"URBAN wealth index quintile",null,null,null,null,"RURAL wealth index quintile",null,null,null,null,"SUB-REGIONS:"]
["Weighted percentage (used in graphs)",null,"Poorest","Poor","Middle","Rich","Richest","Poorest","Poor","Middle","Rich","Richest","Poorest","Poor","Middle","Rich","Richest","Atlántico","Central","Pácifico",null,null,null,null,null,null,null,null,null,null,null,null,null,null,null,null,null,null,null,null,null,null,null,null,null,null,null,null,null,null,null,null,"Hygiene data, raw numbers (weighted)",null,"Poorest","Poor","Middle","Rich","Richest","Poorest","Poor","Middle","Rich","Richest","Poorest","Poor","Middle","Rich","Richest","Atlántico","Central","Pácifico"]
["Hygiene ladder","Basic","N/A","N/A","N/A","N/A","N/A","N/A","N/A","N/A","N/A","N/A","N/A","N/A","N/A","N/A","N/A","N/A","N/A","N/A",null,null,null,null,null,null,null,null,null,null,null,null,null,null,null,null,null,null,null,null,null,null,null,null,null,null,null,null,null,null,null,null,"Hygiene ladder","Basic","N/A","N/A","N/A","N/A","N/A","N/A","N/A","N/A","N/A","N/A","N/A","N/A","N/A","N/A","N/A","N/A","N/A","N/A"]
[null,"Limited","N/A","N/A","N/A","N/A","N/A","N/A","N/A","N/A","N/A","N/A","N/A","N/A","N/A","N/A","N/A","N/A","N/A","N/A",null,null,null,null,null,null,null,null,null,null,null,null,null,null,null,null,null,null,null,null,null,null,null,null,null,null,null,null,null,null,null,null,null,"Limited","N/A","N/A","N/A","N/A","N/A","N/A","N/A","N/A","N/A","N/A","N/A","N/A","N/A","N/A","N/A","N/A","N/A","N/A"]
[null,"No facility","N/A","N/A","N/A","N/A","N/A","N/A","N/A","N/A","N/A","N/A","N/A","N/A","N/A","N/A","N/A","N/A","N/A","N/A",null,null,null,null,null,null,null,null,null,null,null,null,null,null,null,null,null,null,null,null,null,null,null,null,null,null,null,null,null,null,null,null,null,"No facility","N/A","N/A","N/A","N/A","N/A","N/A","N/A","N/A","N/A","N/A","N/A","N/A","N/A","N/A","N/A","N/A","N/A","N/A"]
[null,null,null,null,null,null,null,null,null,null,null,null,null,null,null,null,null,null,null,null,null,null,null,null,null,null,null,null,null,null,null,null,null,null,null,null,null,null,null,null,null,null,null,null,null,null,null,null,null,null,null,null,"Observed handwashing place","Fixed","N/A","N/A","N/A","N/A","N/A","N/A","N/A","N/A","N/A","N/A","N/A","N/A","N/A","N/A","N/A","N/A","N/A","N/A"]
[null,null,null,null,null,null,null,null,null,null,null,null,null,null,null,null,null,null,null,null,null,null,null,null,null,null,null,null,null,null,null,null,null,null,null,null,null,null,null,null,null,null,null,null,null,null,null,null,null,null,null,null,null,"Mobile","N/A","N/A","N/A","N/A","N/A","N/A","N/A","N/A","N/A","N/A","N/A","N/A","N/A","N/A","N/A","N/A","N/A","N/A"]
[null,null,null,null,null,null,null,null,null,null,null,null,null,null,null,null,null,null,null,null,null,null,null,null,null,null,null,null,null,null,null,null,null,null,null,null,null,null,null,null,null,null,null,null,null,null,null,null,null,null,null,null,"Water / Soap","Water and soap","N/A","N/A","N/A","N/A","N/A","N/A","N/A","N/A","N/A","N/A","N/A","N/A","N/A","N/A","N/A","N/A","N/A","N/A"]
[null,null,null,null,null,null,null,null,null,null,null,null,null,null,null,null,null,null,null,null,null,null,null,null,null,null,null,null,null,null,null,null,null,null,null,null,null,null,null,null,null,null,null,null,null,null,null,null,null,null,null,null,null,"Water only","N/A","N/A","N/A","N/A","N/A","N/A","N/A","N/A","N/A","N/A","N/A","N/A","N/A","N/A","N/A","N/A","N/A","N/A"]
[null,null,null,null,null,null,null,null,null,null,null,null,null,null,null,null,null,null,null,null,null,null,null,null,null,null,null,null,null,null,null,null,null,null,null,null,null,null,null,null,null,null,null,null,null,null,null,null,null,null,null,null,null,"Soap only","N/A","N/A","N/A","N/A","N/A","N/A","N/A","N/A","N/A","N/A","N/A","N/A","N/A","N/A","N/A","N/A","N/A","N/A"]
[null,null,null,null,null,null,null,null,null,null,null,null,null,null,null,null,null,null,null,null,null,null,null,null,null,null,null,null,null,null,null,null,null,null,null,null,null,null,null,null,null,null,null,null,null,null,null,null,null,null,null,null,null,"Neither","N/A","N/A","N/A","N/A","N/A","N/A","N/A","N/A","N/A","N/A","N/A","N/A","N/A","N/A","N/A","N/A","N/A","N/A"]
[]
[]
[]
[]
[]
[]
[]
[]
[]
[]
[]
[]
[]
[]
[]
[]
[]
[]
[]
[]
[]
[]
[]
[]
[]
[]
[]
[]
[null,null,null,null,null,null,null,null,null,null,null,null,null,null,null,null,null,null,null,null,null,null,null,null,null,null,null,null,null,null,null,null,null,null,null,null,null,null,null,null,null,null,null,null,null,null,null,null,null,null,null,null,"Raw numbers of respondents:","Menstrual health and hygiene","NATIONAL wealth index quintile",null,null,null,null,"URBAN wealth index quintile",null,null,null,null,"RURAL wealth index quintile",null,null,null,null,"SUB-REGIONS:"]
[null,null,null,null,null,null,null,null,null,null,null,null,null,null,null,null,null,null,null,null,null,null,null,null,null,null,null,null,null,null,null,null,null,null,null,null,null,null,null,null,null,null,null,null,null,null,null,null,null,null,null,null,"MHH data, raw numbers (weighted)",null,"Poorest","Poor","Middle","Rich","Richest","Poorest","Poor","Middle","Rich","Richest","Poorest","Poor","Middle","Rich","Richest","Atlántico","Central","Pácifico"]
[null,null,null,null,null,null,null,null,null,null,null,null,null,null,null,null,null,null,null,null,null,null,null,null,null,null,null,null,null,null,null,null,null,null,null,null,null,null,null,null,null,null,null,null,null,null,null,null,null,null,null,null,"Private place to wash and change","Yes","N/A","N/A","N/A","N/A","N/A","N/A","N/A","N/A","N/A","N/A","N/A","N/A","N/A","N/A","N/A","N/A","N/A","N/A"]
[null,null,null,null,null,null,null,null,null,null,null,null,null,null,null,null,null,null,null,null,null,null,null,null,null,null,null,null,null,null,null,null,null,null,null,null,null,null,null,null,null,null,null,null,null,null,null,null,null,null,null,null,null,"No","N/A","N/A","N/A","N/A","N/A","N/A","N/A","N/A","N/A","N/A","N/A","N/A","N/A","N/A","N/A","N/A","N/A","N/A"]
[null,null,null,null,null,null,null,null,null,null,null,null,null,null,null,null,null,null,null,null,null,null,null,null,null,null,null,null,null,null,null,null,null,null,null,null,null,null,null,null,null,null,null,null,null,null,null,null,null,null,null,null,null,"DK/not sure/missing","N/A","N/A","N/A","N/A","N/A","N/A","N/A","N/A","N/A","N/A","N/A","N/A","N/A","N/A","N/A","N/A","N/A","N/A"]
[null,null,null,null,null,null,null,null,null,null,null,null,null,null,null,null,null,null,null,null,null,null,null,null,null,null,null,null,null,null,null,null,null,null,null,null,null,null,null,null,null,null,null,null,null,null,null,null,null,null,null,null,"Use of menstrual materials","Materials reusable","N/A","N/A","N/A","N/A","N/A","N/A","N/A","N/A","N/A","N/A","N/A","N/A","N/A","N/A","N/A","N/A","N/A","N/A"]
[null,null,null,null,null,null,null,null,null,null,null,null,null,null,null,null,null,null,null,null,null,null,null,null,null,null,null,null,null,null,null,null,null,null,null,null,null,null,null,null,null,null,null,null,null,null,null,null,null,null,null,null,null,"Materials not reusable","N/A","N/A","N/A","N/A","N/A","N/A","N/A","N/A","N/A","N/A","N/A","N/A","N/A","N/A","N/A","N/A","N/A","N/A"]
[null,null,null,null,null,null,null,null,null,null,null,null,null,null,null,null,null,null,null,null,null,null,null,null,null,null,null,null,null,null,null,null,null,null,null,null,null,null,null,null,null,null,null,null,null,null,null,null,null,null,null,null,null,"No materials used","N/A","N/A","N/A","N/A","N/A","N/A","N/A","N/A","N/A","N/A","N/A","N/A","N/A","N/A","N/A","N/A","N/A","N/A"]
[null,null,null,null,null,null,null,null,null,null,null,null,null,null,null,null,null,null,null,null,null,null,null,null,null,null,null,null,null,null,null,null,null,null,null,null,null,null,null,null,null,null,null,null,null,null,null,null,null,null,null,null,null,"DK/not sure/missing","N/A","N/A","N/A","N/A","N/A","N/A","N/A","N/A","N/A","N/A","N/A","N/A","N/A","N/A","N/A","N/A","N/A","N/A"]
[null,null,null,null,null,null,null,null,null,null,null,null,null,null,null,null,null,null,null,null,null,null,null,null,null,null,null,null,null,null,null,null,null,null,null,null,null,null,null,null,null,null,null,null,null,null,null,null,null,null,null,null,"Use of menstrual materials with private place to wash and change","Materials reusable","N/A","N/A","N/A","N/A","N/A","N/A","N/A","N/A","N/A","N/A","N/A","N/A","N/A","N/A","N/A","N/A","N/A","N/A"]
[null,null,null,null,null,null,null,null,null,null,null,null,null,null,null,null,null,null,null,null,null,null,null,null,null,null,null,null,null,null,null,null,null,null,null,null,null,null,null,null,null,null,null,null,null,null,null,null,null,null,null,null,null,"Materials not reusable","N/A","N/A","N/A","N/A","N/A","N/A","N/A","N/A","N/A","N/A","N/A","N/A","N/A","N/A","N/A","N/A","N/A","N/A"]
[null,null,null,null,null,null,null,null,null,null,null,null,null,null,null,null,null,null,null,null,null,null,null,null,null,null,null,null,null,null,null,null,null,null,null,null,null,null,null,null,null,null,null,null,null,null,null,null,null,null,null,null,null,"No materials used","N/A","N/A","N/A","N/A","N/A","N/A","N/A","N/A","N/A","N/A","N/A","N/A","N/A","N/A","N/A","N/A","N/A","N/A"]
[null,null,null,null,null,null,null,null,null,null,null,null,null,null,null,null,null,null,null,null,null,null,null,null,null,null,null,null,null,null,null,null,null,null,null,null,null,null,null,null,null,null,null,null,null,null,null,null,null,null,null,null,"Awareness of menstruation before menarche","Yes","N/A","N/A","N/A","N/A","N/A","N/A","N/A","N/A","N/A","N/A","N/A","N/A","N/A","N/A","N/A","N/A","N/A","N/A"]
[null,null,null,null,null,null,null,null,null,null,null,null,null,null,null,null,null,null,null,null,null,null,null,null,null,null,null,null,null,null,null,null,null,null,null,null,null,null,null,null,null,null,null,null,null,null,null,null,null,null,null,null,null,"No","N/A","N/A","N/A","N/A","N/A","N/A","N/A","N/A","N/A","N/A","N/A","N/A","N/A","N/A","N/A","N/A","N/A","N/A"]
[null,null,null,null,null,null,null,null,null,null,null,null,null,null,null,null,null,null,null,null,null,null,null,null,null,null,null,null,null,null,null,null,null,null,null,null,null,null,null,null,null,null,null,null,null,null,null,null,null,null,null,null,null,"DK/not sure/missing","N/A","N/A","N/A","N/A","N/A","N/A","N/A","N/A","N/A","N/A","N/A","N/A","N/A","N/A","N/A","N/A","N/A","N/A"]
[null,null,null,null,null,null,null,null,null,null,null,null,null,null,null,null,null,null,null,null,null,null,null,null,null,null,null,null,null,null,null,null,null,null,null,null,null,null,null,null,null,null,null,null,null,null,null,null,null,null,null,null,"Participation in (all) activities during menstruation","Yes","N/A","N/A","N/A","N/A","N/A","N/A","N/A","N/A","N/A","N/A","N/A","N/A","N/A","N/A","N/A","N/A","N/A","N/A"]
[null,null,null,null,null,null,null,null,null,null,null,null,null,null,null,null,null,null,null,null,null,null,null,null,null,null,null,null,null,null,null,null,null,null,null,null,null,null,null,null,null,null,null,null,null,null,null,null,null,null,null,null,null,"No","N/A","N/A","N/A","N/A","N/A","N/A","N/A","N/A","N/A","N/A","N/A","N/A","N/A","N/A","N/A","N/A","N/A","N/A"]
[null,null,null,null,null,null,null,null,null,null,null,null,null,null,null,null,null,null,null,null,null,null,null,null,null,null,null,null,null,null,null,null,null,null,null,null,null,null,null,null,null,null,null,null,null,null,null,null,null,null,null,null,null,"DK/not sure/missing/no such activity","N/A","N/A","N/A","N/A","N/A","N/A","N/A","N/A","N/A","N/A","N/A","N/A","N/A","N/A","N/A","N/A","N/A","N/A"]
[null,null,null,null,null,null,null,null,null,null,null,null,null,null,null,null,null,null,null,null,null,null,null,null,null,null,null,null,null,null,null,null,null,null,null,null,null,null,null,null,null,null,null,null,null,null,null,null,null,null,null,null,"Participation in specific activities during menstruation","Did not go to school (amongst those usually attending school)","N/A","N/A","N/A","N/A","N/A","N/A","N/A","N/A","N/A","N/A","N/A","N/A","N/A","N/A","N/A","N/A","N/A","N/A"]
[null,null,null,null,null,null,null,null,null,null,null,null,null,null,null,null,null,null,null,null,null,null,null,null,null,null,null,null,null,null,null,null,null,null,null,null,null,null,null,null,null,null,null,null,null,null,null,null,null,null,null,null,null,"Did not go to work (amongst those who usually work)","N/A","N/A","N/A","N/A","N/A","N/A","N/A","N/A","N/A","N/A","N/A","N/A","N/A","N/A","N/A","N/A","N/A","N/A"]
[null,null,null,null,null,null,null,null,null,null,null,null,null,null,null,null,null,null,null,null,null,null,null,null,null,null,null,null,null,null,null,null,null,null,null,null,null,null,null,null,null,null,null,null,null,null,null,null,null,null,null,null,null,"Did not participate in social activities","N/A","N/A","N/A","N/A","N/A","N/A","N/A","N/A","N/A","N/A","N/A","N/A","N/A","N/A","N/A","N/A","N/A","N/A"]
[null,null,null,null,null,null,null,null,null,null,null,null,null,null,null,null,null,null,null,null,null,null,null,null,null,null,null,null,null,null,null,null,null,null,null,null,null,null,null,null,null,null,null,null,null,null,null,null,null,null,null,null,null,"Did not cook food","N/A","N/A","N/A","N/A","N/A","N/A","N/A","N/A","N/A","N/A","N/A","N/A","N/A","N/A","N/A","N/A","N/A","N/A"]
[null,null,null,null,null,null,null,null,null,null,null,null,null,null,null,null,null,null,null,null,null,null,null,null,null,null,null,null,null,null,null,null,null,null,null,null,null,null,null,null,null,null,null,null,null,null,null,null,null,null,null,null,null,"Did not eat with others","N/A","N/A","N/A","N/A","N/A","N/A","N/A","N/A","N/A","N/A","N/A","N/A","N/A","N/A","N/A","N/A","N/A","N/A"]
[null,null,null,null,null,null,null,null,null,null,null,null,null,null,null,null,null,null,null,null,null,null,null,null,null,null,null,null,null,null,null,null,null,null,null,null,null,null,null,null,null,null,null,null,null,null,null,null,null,null,null,null,null,"Did not bathe in regular place","N/A","N/A","N/A","N/A","N/A","N/A","N/A","N/A","N/A","N/A","N/A","N/A","N/A","N/A","N/A","N/A","N/A","N/A"]
[null,null,null,null,null,null,null,null,null,null,null,null,null,null,null,null,null,null,null,null,null,null,null,null,null,null,null,null,null,null,null,null,null,null,null,null,null,null,null,null,null,null,null,null,null,null,null,null,null,null,null,null,null,"Did not participate in other activities","N/A","N/A","N/A","N/A","N/A","N/A","N/A","N/A","N/A","N/A","N/A","N/A","N/A","N/A","N/A","N/A","N/A","N/A"]
[null,null,null,null,null,null,null,null,null,null,null,null,null,null,null,null,null,null,null,null,null,null,null,null,null,null,null,null,null,null,null,null,null,null,null,null,null,null,null,null,null,null,null,null,null,null,null,null,null,null,null,null,null,"DK/not sure/missing/no such activity","N/A","N/A","N/A","N/A","N/A","N/A","N/A","N/A","N/A","N/A","N/A","N/A","N/A","N/A","N/A","N/A","N/A","N/A"]
[]
[]
[]
[]
[]
[]
[]
[]
[]
[]
[]
[]
[]
[]
[]
[]
[]
[]
[]
[]
[]
[]
[]
[]
[]
[]
[]
[]
[]
[]
[]
[]
[]
[]
[]
[]
[]
[]
[]
[]
[]
[]
[]
[]
[]
[]
[]
[]
[]
[]
[]
[]
[]
[]
[null,null,null,null,null,null,null,null,null,null,null,null,null,null,null,null,null,null,null,null,null,null,null,null,null,null,null,null,null,null,null,null,null,null,null,null,null,null,null,null,null,null,null,null,null,null,null,null,null,null,null,null,"Raw numbers of respondents:","Basic water, sanitation and hygiene","NATIONAL wealth index quintile",null,null,null,null,"URBAN wealth index quintile",null,null,null,null,"RURAL wealth index quintile",null,null,null,null,"SUB-REGIONS:"]
[null,null,null,null,null,null,null,null,null,null,null,null,null,null,null,null,null,null,null,null,null,null,null,null,null,null,null,null,null,null,null,null,null,null,null,null,null,null,null,null,null,null,null,null,null,null,null,null,null,null,null,null,"WatSan data, raw numbers (weighted)",null,"Poorest","Poor","Middle","Rich","Richest","Poorest","Poor","Middle","Rich","Richest","Poorest","Poor","Middle","Rich","Richest","Atlántico","Central","Pácifico"]
[null,null,null,null,null,null,null,null,null,null,null,null,null,null,null,null,null,null,null,null,null,null,null,null,null,null,null,null,null,null,null,null,null,null,null,null,null,null,null,null,null,null,null,null,null,null,null,null,null,null,null,null,"Use of Basic Water Sanitation and Hygiene","Yes","N/A","N/A","N/A","N/A","N/A","N/A","N/A","N/A","N/A","N/A","N/A","N/A","N/A","N/A","N/A","N/A","N/A","N/A"]
[null,null,null,null,null,null,null,null,null,null,null,null,null,null,null,null,null,null,null,null,null,null,null,null,null,null,null,null,null,null,null,null,null,null,null,null,null,null,null,null,null,null,null,null,null,null,null,null,null,null,null,null,null,"No","N/A","N/A","N/A","N/A","N/A","N/A","N/A","N/A","N/A","N/A","N/A","N/A","N/A","N/A","N/A","N/A","N/A","N/A"]
[null,null,null,null,null,null,null,null,null,null,null,null,null,null,null,null,null,null,null,null,null,null,null,null,null,null,null,null,null,null,null,null,null,null,null,null,null,null,null,null,null,null,null,null,null,null,null,null,null,null,null,null,"Use of Basic Water and Sanitation","Yes","N/A","N/A","N/A","N/A","N/A","N/A","N/A","N/A","N/A","N/A","N/A","N/A","N/A","N/A","N/A","N/A","N/A","N/A"]
[null,null,null,null,null,null,null,null,null,null,null,null,null,null,null,null,null,null,null,null,null,null,null,null,null,null,null,null,null,null,null,null,null,null,null,null,null,null,null,null,null,null,null,null,null,null,null,null,null,null,null,null,null,"No","N/A","N/A","N/A","N/A","N/A","N/A","N/A","N/A","N/A","N/A","N/A","N/A","N/A","N/A","N/A","N/A","N/A","N/A"]
[null,null,null,null,null,null,null,null,null,null,null,null,null,null,null,null,null,null,null,null,null,null,null,null,null,null,null,null,null,null,null,null,null,null,null,null,null,null,null,null,null,null,null,null,null,null,null,null,null,null,null,null,"Use of Basic Water and Hygiene","Yes","N/A","N/A","N/A","N/A","N/A","N/A","N/A","N/A","N/A","N/A","N/A","N/A","N/A","N/A","N/A","N/A","N/A","N/A"]
[null,null,null,null,null,null,null,null,null,null,null,null,null,null,null,null,null,null,null,null,null,null,null,null,null,null,null,null,null,null,null,null,null,null,null,null,null,null,null,null,null,null,null,null,null,null,null,null,null,null,null,null,null,"No","N/A","N/A","N/A","N/A","N/A","N/A","N/A","N/A","N/A","N/A","N/A","N/A","N/A","N/A","N/A","N/A","N/A","N/A"]
[null,null,null,null,null,null,null,null,null,null,null,null,null,null,null,null,null,null,null,null,null,null,null,null,null,null,null,null,null,null,null,null,null,null,null,null,null,null,null,null,null,null,null,null,null,null,null,null,null,null,null,null,"Use of Basic Sanitation and Hygiene","Yes","N/A","N/A","N/A","N/A","N/A","N/A","N/A","N/A","N/A","N/A","N/A","N/A","N/A","N/A","N/A","N/A","N/A","N/A"]
[null,null,null,null,null,null,null,null,null,null,null,null,null,null,null,null,null,null,null,null,null,null,null,null,null,null,null,null,null,null,null,null,null,null,null,null,null,null,null,null,null,null,null,null,null,null,null,null,null,null,null,null,null,"No","N/A","N/A","N/A","N/A","N/A","N/A","N/A","N/A","N/A","N/A","N/A","N/A","N/A","N/A","N/A","N/A","N/A","N/A"]
[null,null,null,null,null,null,null,null,null,null,null,null,null,null,null,null,null,null,null,null,null,null,null,null,null,null,null,null,null,null,null,null,null,null,null,null,null,null,null,null,null,null,null,null,null,null,null,null,null,null,null,null,"Use of Basic Water","Yes","N/A","N/A","N/A","N/A","N/A","N/A","N/A","N/A","N/A","N/A","N/A","N/A","N/A","N/A","N/A","N/A","N/A","N/A"]
[null,null,null,null,null,null,null,null,null,null,null,null,null,null,null,null,null,null,null,null,null,null,null,null,null,null,null,null,null,null,null,null,null,null,null,null,null,null,null,null,null,null,null,null,null,null,null,null,null,null,null,null,null,"No","N/A","N/A","N/A","N/A","N/A","N/A","N/A","N/A","N/A","N/A","N/A","N/A","N/A","N/A","N/A","N/A","N/A","N/A"]
[null,null,null,null,null,null,null,null,null,null,null,null,null,null,null,null,null,null,null,null,null,null,null,null,null,null,null,null,null,null,null,null,null,null,null,null,null,null,null,null,null,null,null,null,null,null,null,null,null,null,null,null,"Use of Basic Sanitation","Yes","N/A","N/A","N/A","N/A","N/A","N/A","N/A","N/A","N/A","N/A","N/A","N/A","N/A","N/A","N/A","N/A","N/A","N/A"]
[null,null,null,null,null,null,null,null,null,null,null,null,null,null,null,null,null,null,null,null,null,null,null,null,null,null,null,null,null,null,null,null,null,null,null,null,null,null,null,null,null,null,null,null,null,null,null,null,null,null,null,null,null,"No","N/A","N/A","N/A","N/A","N/A","N/A","N/A","N/A","N/A","N/A","N/A","N/A","N/A","N/A","N/A","N/A","N/A","N/A"]
[null,null,null,null,null,null,null,null,null,null,null,null,null,null,null,null,null,null,null,null,null,null,null,null,null,null,null,null,null,null,null,null,null,null,null,null,null,null,null,null,null,null,null,null,null,null,null,null,null,null,null,null,"Access to Basic Hygiene","Yes","N/A","N/A","N/A","N/A","N/A","N/A","N/A","N/A","N/A","N/A","N/A","N/A","N/A","N/A","N/A","N/A","N/A","N/A"]
[null,null,null,null,null,null,null,null,null,null,null,null,null,null,null,null,null,null,null,null,null,null,null,null,null,null,null,null,null,null,null,null,null,null,null,null,null,null,null,null,null,null,null,null,null,null,null,null,null,null,null,null,null,"No","N/A","N/A","N/A","N/A","N/A","N/A","N/A","N/A","N/A","N/A","N/A","N/A","N/A","N/A","N/A","N/A","N/A","N/A"]
[]
[]
[]
[]
[]
[]
[]
[]
[]
[]
[]
[]
[]
[]
[]
[]
[]
[]
[]
[]
[]
[]
[]
[]
[]
[]
[]
[]
[]
[]
[]
[]
[]
[]
[]
[]
[]
[]
[]
[]
[]
[]
[]
[]
[null,null,"INITIAL (national) Wealth Index",null,null,null,null,"URBAN Wealth Index",null,null,null,null,"RURAL Wealth Index"]
[null,null,"Component Matrix",null,null,null,null,"Component Matrix",null,null,null,null,"Component Matrix"]
[null,null,null,null,"Component",null,null,null,null,"Component",null,null,null,null,"Component"]
[null,"Note:\n\nThe INITIAL (national) Wealth Index is based on the first component of the Principal Component Analysis (PCA) which has been obtained at national level.\n\nThe final national-level (NATIONAL) Wealth Index is based on the URBAN and RURAL specific wealth indexes. Regression procedures are used to establish the relationships between the two sets of scores (urban and rural) and the initial (national) wealth factors.\nThis allows best use of the available information for each area and a better precision of the FINAL (NATIONAL) Wealth Index.\n\nFor dependency reasons, all WASH variables (contained in the generic MICS and DHS scripts) have been excluded from the sets of asset variables used in the PCAs.\n\nThe PCA can extracts as many components as there are asset variables in the input. Only the first of the components is used to represent the Wealth Index. \n\nThe scores represent the weights of the asset variables on the Wealth Index (correlations between the variables and the component).\n\nThe communalities are the proportion of each variable's variance that can be explained by the component.\n\nProportion of explained variance is the part of the model's total variance that is explained by the component.\n\nFor more information on the procedure used:\n\nThe DHS Wealth Index, DHS Comparative Reports No. 6, Shea Oscar Rutstein, Kiersten Johnson, ORC Macro International Inc., 2004.\n\nThe DHS Wealth Index: Approaches for Rural and Urban Areas, Shea O. Rutstein, ORC Macro International Inc., 2008.\n\nMICS Methodological Paper No. 4, Review of options for reporting water, sanitation and hygiene coverage by wealth quintile, UNICEF, 2016.",null,null,"1",null,null,null,null,"1",null,null,null,null,"1"]
[null,null,"El hogar tiene cocina",null,0.80642278671772505,null,null,"fuel1",null,-0.72869247654591107,null,null,"El hogar tiene cocina",null,0.70105134095908139]
[null,null,"fuel1",null,-0.79649032103791439,null,null,"El hogar tiene cocina",null,0.69682827374092127,null,null,"El hogar tiene plancha electrica",null,0.68841455636621285]
[null,null,"fuel2",null,0.78399945734179588,null,null,"fuel2",null,0.69036943261932571,null,null,"El hogar tiene refrigerador",null,0.67263000535949569]
[null,null,"El hogar tiene refrigerador",null,0.72244430241621971,null,null,"El hogar tiene refrigerador",null,0.64991954239735961,null,null,"El hogar tiene televisor",null,0.66794417340387402]
[null,null,"El hogar tiene plancha electrica",null,0.72172550078073661,null,null,"floor1",null,-0.61466183280562814,null,null,"fuel1",null,-0.65146265843680673]
[null,null,"El hogar tiene televisor",null,0.67982563846886324,null,null,"El hogar tiene servicios de telef. convencional",null,0.56204159218905736,null,null,"fuel2",null,0.63012662641218664]
[null,null,"El hogar tiene abanico",null,0.66946852629549758,null,null,"floor5",null,0.55820192333106466,null,null,"El hogar tiene abanico",null,0.60438825371464378]
[null,null,"floor1",null,-0.65393395389656106,null,null,"El hogar tiene servicios de cable TV/SKY/Direct TV",null,0.54133506581026081,null,null,"light1",null,-0.57617720465143574]
[null,null,"floor5",null,0.63781955750852082,null,null,"El hogar tiene computadora",null,0.54015504018939442,null,null,"El hogar tiene DVD/CD player/teatro en casa",null,0.57610930443619746]
[null,null,"El hogar tiene servicios de cable TV/SKY/Direct TV",null,0.62460761814567511,null,null,"El hogar tiene abanico",null,0.52922527108384443,null,null,"El hogar tiene equipo de sonido",null,0.53368623460737652]
[null,null,"light1",null,-0.58703292711222821,null,null,"El hogar tiene micronda",null,0.52402587853691618,null,null,"floor1",null,-0.51743541286509942]
[null,null,"El hogar tiene equipo de sonido",null,0.58621543115810992,null,null,"El hogar tiene plancha electrica",null,0.49538423034482643,null,null,"floor5",null,0.51091367236999707]
[null,null,"El hogar tiene DVD/CD player/teatro en casa",null,0.55528148858069881,null,null,"El hogar tiene equipo de sonido",null,0.47620390840891141,null,null,"El hogar tiene micronda",null,0.46250284959014593]
[null,null,"wall1",null,-0.5502411563881302,null,null,"El hogar tiene lavadora de ropa",null,0.46131619354872505,null,null,"El hogar tiene servicios de cable TV/SKY/Direct TV",null,0.45955728676385577]
[null,null,"El hogar tiene servicios de telef. convencional",null,0.54079266024520833,null,null,"El hogar tiene DVD/CD player/teatro en casa",null,0.45766465485151048,null,null,"wall1",null,-0.43948179436438256]
[null,null,"El hogar tiene micronda",null,0.53098039412847753,null,null,"El hogar tiene servicios de internet",null,0.45498414181566149,null,null,"light5",null,0.42718935223603305]
[null,null,"El hogar tiene computadora",null,0.51159890233507566,null,null,"wall1",null,-0.44900716242732674,null,null,"El hogar tiene servicios de celular",null,0.42488537307832119]
[null,null,"El hogar tiene servicios de celular",null,0.49448257425336006,null,null,"Algún miembro del hogar tiene carro/camioneta/jeep",null,0.43919340961876324,null,null,"wall12",null,0.42343752505054671]
[null,null,"wall12",null,0.4720824742471954,null,null,"El hogar tiene televisor",null,0.42809912039786552,null,null,"El hogar tiene radio",null,-0.36600352354084403]
[null,null,"El hogar tiene lavadora de ropa",null,0.43530107427760223,null,null,"Number of members per sleeping room",null,0.42414058950985423,null,null,"El hogar tiene computadora",null,0.35424551710907964]
[null,null,"light5",null,0.42056883812803947,null,null,"El hogar tiene servicios de celular",null,0.38237224117030638,null,null,"Algún miembro del hogar tiene carro/camioneta/jeep",null,0.34341013620429134]
[null,null,"Algún miembro del hogar tiene carro/camioneta/jeep",null,0.41034093581096709,null,null,"El hogar tiene juegos de video",null,0.32156407045919438,null,null,"El hogar tiene lavadora de ropa",null,0.3379293329785959]
[null,null,"El hogar tiene servicios de internet",null,0.4059379342418758,null,null,"dwelling6",null,0.27158844401948928,null,null,"Algún miembro del hogar tiene moto/cuadraciclo",null,0.31089979016540875]
[null,null,"Number of members per sleeping room",null,0.40485405439557615,null,null,"wall12",null,0.26353633410530547,null,null,"El hogar tiene juegos de video",null,0.30508966023494011]
[null,null,"Algún miembro del hogar tiene bestia",null,-0.37616092679747154,null,null,"dwelling1",null,-0.24860429804523582,null,null,"floor2",null,-0.30474746790178442]
[null,null,"El hogar tiene juegos de video",null,0.32052357282009913,null,null,"El hogar tiene maquina de coser",null,0.24731672279360423,null,null,"El hogar tiene servicios de internet",null,0.3033294075831553]
[null,null,"El hogar tiene radio",null,-0.30521995973022259,null,null,"light1",null,-0.24602378676034986,null,null,"Algún miembro del hogar tiene bicicleta",null,0.30227944859865863]
[null,null,"El hogar tiene radio grabadora",null,0.30079033023074797,null,null,"El hogar tiene aire acondicionado",null,0.24131995223197725,null,null,"Number of members per sleeping room",null,0.29850123457355388]
[null,null,"light6",null,0.29899752377335415,null,null,"Algún miembro del hogar tiene moto/cuadraciclo",null,0.21776229226421612,null,null,"light6",null,0.29429626739017484]
[null,null,"fuel96",null,0.29805534706983272,null,null,"wall13",null,0.21091666622947566,null,null,"fuel96",null,0.29268067463639941]
[null,null,"El hogar tiene maquina de coser",null,0.27616083784965106,null,null,"El hogar tiene radio grabadora",null,0.2011761238459906,null,null,"El hogar tiene radio grabadora",null,0.28816395896532521]
[null,null,"Algún miembro del hogar tiene moto/cuadraciclo",null,0.24036206311674332,null,null,"wall11",null,0.17629733904093811,null,null,"El hogar tiene servicios de telef. convencional",null,0.26492679401773545]
[null,null,"wall11",null,0.23675942854123211,null,null,"roof3",null,0.16104934701448326,null,null,"wall2",null,-0.24099750821185925]
[null,null,"light3",null,0.22369149603003693,null,null,"fuel96",null,0.14599772551666265,null,null,"El hogar tiene maquina de coser",null,0.22365251420096535]
[null,null,"El hogar tiene aire acondicionado",null,0.21085767235725886,null,null,"light6",null,0.14149534048894438,null,null,"Algún miembro del hogar tiene bestia",null,-0.21385178851749939]
[null,null,"dwelling1",null,-0.18167926250529487,null,null,"fuel6",null,0.13679303475079893,null,null,"El hogar tiene aire acondicionado",null,0.21301225557061271]
[null,null,"roof5",null,0.17779448771412867,null,null,"light5",null,0.13115031488863926,null,null,"roof5",null,0.16708709625253004]
[null,null,"dwelling5",null,0.15843567397578856,null,null,"roof1",null,-0.12505326944109457,null,null,"wall11",null,0.16289315665360049]
[null,null,"light7",null,0.14822663722424456,null,null,"floor2",null,0.12317727684991918,null,null,"dwelling5",null,0.14834848260782713]
[null,null,"dwelling6",null,0.14214712369234128,null,null,"floor4",null,0.12128704734853794,null,null,"light3",null,0.13691739348241291]
[null,null,"wall14",null,0.14042924138283605,null,null,"roof6",null,0.11539427072978387,null,null,"light7",null,0.13593465808690863]
[null,null,"floor4",null,0.13666432250264424,null,null,"dwelling5",null,0.10647663355813182,null,null,"dwelling1",null,-0.13424986590839186]
[null,null,"roof1",null,-0.13609831787231205,null,null,"wall14",null,9.7141105845033271E-2,null,null,"wall14",null,0.12943829572830864]
[null,null,"Algún miembro del hogar tiene bicicleta",null,0.12432234876041917,null,null,"Algún miembro del hogar tiene bestia",null,-7.467639956978496E-2,null,null,"wall8",null,-0.1235727617993921]
[null,null,"floor2",null,-0.10733147903178762,null,null,"roof5",null,6.8187693982888903E-2,null,null,"floor4",null,0.12234023738871251]
[null,null,"roof3",null,0.10447207176664274,null,null,"wall8",null,6.3725333954383553E-2,null,null,"roof1",null,-9.4539552159899329E-2]
[null,null,"wall2",null,-0.10201458461197255,null,null,"wall96",null,6.361542441932079E-2,null,null,"roof96",null,9.3696139492572328E-2]
[null,null,"roof2",null,-8.9631204317288216E-2,null,null,"fuel3",null,5.9745452136594587E-2,null,null,"roof2",null,-9.1013354985672937E-2]
[null,null,"roof6",null,6.7575142771930136E-2,null,null,"fuel5",null,5.7083291772667306E-2,null,null,"fuel5",null,-8.2698978298915288E-2]
[null,null,"roof96",null,6.4108687879970733E-2,null,null,"light8",null,5.4523116709309843E-2,null,null,"dwelling6",null,7.7430764126510301E-2]
[null,null,"wall13",null,5.0141948300057172E-2,null,null,"roof2",null,-5.3117118759389445E-2,null,null,"dwelling2",null,-5.3345871893647631E-2]
[null,null,"light8",null,5.0074323505099501E-2,null,null,"dwelling2",null,-5.0988889653721774E-2,null,null,"wall6",null,-5.0812332274958648E-2]
[null,null,"wall96",null,4.6470295310446053E-2,null,null,"Algún miembro del hogar tiene bicicleta",null,-4.5897914028820944E-2,null,null,"roof6",null,4.9674905694505611E-2]
[null,null,"fuel6",null,4.1960713533631608E-2,null,null,"wall9",null,4.518668710738899E-2,null,null,"wall5",null,-4.7230283057205696E-2]
[null,null,"Algún miembro del hogar tiene canoa/cayuco",null,-4.182783554650963E-2,null,null,"roof96",null,-4.3435143879059682E-2,null,null,"light8",null,4.1251333170047665E-2]
[null,null,"light4",null,4.1042449141336229E-2,null,null,"light7",null,3.480235083457861E-2,null,null,"wall96",null,4.0626178627856904E-2]
[null,null,"wall4",null,-4.0862803957812527E-2,null,null,"light3",null,2.9445143463227502E-2,null,null,"wall4",null,-4.0444394653989489E-2]
[null,null,"roof4",null,-3.452305896564109E-2,null,null,"dwelling7",null,2.7573404120222588E-2,null,null,"wall9",null,-4.0196648468797024E-2]
[null,null,"light2",null,3.0930676508140045E-2,null,null,"Algún miembro del hogar tiene canoa/cayuco",null,-2.7505934540216395E-2,null,null,"light4",null,3.5426517073700182E-2]
[null,null,"dwelling2",null,-2.8757028416446753E-2,null,null,"roof4",null,-2.6955868549896188E-2,null,null,"dwelling3",null,-2.3577162648884209E-2]
[null,null,"wall5",null,-2.7485041015660613E-2,null,null,"Algún miembro del hogar tiene yate",null,-2.5794074176417207E-2,null,null,"Algún miembro del hogar tiene canoa/cayuco",null,-2.0194873078286251E-2]
[null,null,"dwelling3",null,-2.5878608654303647E-2,null,null,"wall7",null,2.5564649126713846E-2,null,null,"wall7",null,-1.7439691559182097E-2]
[null,null,"fuel5",null,-2.4554251221447214E-2,null,null,"El hogar tiene radio",null,2.5481603352286795E-2,null,null,"Algún miembro del hogar tiene lancha/panga/bote",null,1.7301627926653913E-2]
[null,null,"dwelling4",null,-2.3075640501627678E-2,null,null,"fuel4",null,1.6902867019602214E-2,null,null,"fuel4",null,-1.521944047049119E-2]
[null,null,"wall6",null,-2.2871479732649653E-2,null,null,"dwelling3",null,-1.6318925265898846E-2,null,null,"roof3",null,1.513156006356081E-2]
[null,null,"wall3",null,-2.1665285673680545E-2,null,null,"wall6",null,-1.4755306452292494E-2,null,null,"floor96",null,-1.5068176588827704E-2]
[null,null,"Algún miembro del hogar tiene yate",null,-1.5290799666380557E-2,null,null,"wall5",null,-1.4681069891692921E-2,null,null,"fuel6",null,-1.3704847654925464E-2]
[null,null,"Algún miembro del hogar tiene lancha/panga/bote",null,-1.3716637371414332E-2,null,null,"Algún miembro del hogar tiene lancha/panga/bote",null,-1.2222892651101238E-2,null,null,"wall3",null,-1.3467820212842395E-2]
[null,null,"dwelling96",null,1.2521350024800567E-2,null,null,"dwelling4",null,9.1512055943062925E-3,null,null,"dwelling96",null,-1.2700590201079045E-2]
[null,null,"wall9",null,-1.2355852057138204E-2,null,null,"floor96",null,-6.926991489813729E-3,null,null,"fuel3",null,-9.1730660678809688E-3]
[null,null,"wall8",null,-1.1592041503637908E-2,null,null,"wall3",null,-4.3193423554838189E-3,null,null,"dwelling7",null,-8.1112670715469334E-3]
[null,null,"dwelling7",null,8.7597628913861636E-3,null,null,"wall2",null,-3.1323105287435538E-3,null,null,"Algún miembro del hogar tiene yate",null,5.6248857869687892E-3]
[null,null,"fuel3",null,8.057678529189722E-3,null,null,"light2",null,1.3595770178873011E-3,null,null,"dwelling4",null,4.4851254273835179E-3]
[null,null,"fuel4",null,-6.8269425338754255E-3,null,null,"wall4",null,1.2054111666620333E-3,null,null,"wall13",null,2.7121064028743707E-3]
[null,null,"floor96",null,-1.957409871692677E-3,null,null,null,null,null,null,null,"light2",null,2.5821104693883982E-3]
[null,null,"wall7",null,5.6959662685092281E-5]
[]
[null,null,null,null,null,null,null,"Communalities"]
[null,null,null,null,null,null,null,null,null,"Extraction",null,null,"Communalities"]
[null,null,"Communalities",null,null,null,null,"Number of members per sleeping room",null,0.17989523966976667,null,null,null,null,"Extraction"]
[null,null,null,null,"Extraction",null,null,"floor1",null,0.37780916870797399,null,null,"Number of members per sleeping room",null,8.9102987041935838E-2]
[null,null,"Number of members per sleeping room",null,0.16390680536053612,null,null,"floor2",null,1.5172641532161635E-2,null,null,"floor1",null,0.26773940648687589]
[null,null,"floor1",null,0.42762961605878963,null,null,"floor4",null,1.4710547854526485E-2,null,null,"floor2",null,9.2871019192549129E-2]
[null,null,"floor2",null,1.1520046391151065E-2,null,null,"floor5",null,0.31158938721049978,null,null,"floor4",null,1.496713368432653E-2]
[null,null,"floor4",null,1.8677137045106752E-2,null,null,"floor96",null,4.7983211099951828E-5,null,null,"floor5",null,0.26103278061459673]
[null,null,"floor5",null,0.40681378794036527,null,null,"wall1",null,0.20160743191103978,null,null,"floor96",null,2.2704994571209531E-4]
[null,null,"floor96",null,3.8314534057999421E-6,null,null,"wall2",null,9.8113692484777224E-6,null,null,"wall1",null,0.19314424757773743]
[null,null,"wall1",null,0.30276533018334678,null,null,"wall3",null,1.8656718383876504E-5,null,null,"wall2",null,5.807979896432517E-2]
[null,null,"wall2",null,1.0406975473553307E-2,null,null,"wall4",null,1.4530160807135242E-6,null,null,"wall3",null,1.8138218128544616E-4]
[null,null,"wall3",null,4.6938460332218745E-4,null,null,"wall5",null,2.1553381316477237E-4,null,null,"wall4",null,1.6357490589276535E-3]
[null,null,"wall4",null,1.6697687472946191E-3,null,null,"wall6",null,2.1771906850106453E-4,null,null,"wall5",null,2.2306996376637717E-3]
[null,null,"wall5",null,7.5542747963254617E-4,null,null,"wall7",null,6.5355128497199104E-4,null,null,"wall6",null,2.5818931112208043E-3]
[null,null,"wall6",null,5.2310458516100378E-4,null,null,"wall8",null,4.0609181875977092E-3,null,null,"wall7",null,3.0414284167940724E-4]
[null,null,"wall7",null,3.244403173199494E-9,null,null,"wall9",null,2.0418366917410741E-3,null,null,"wall8",null,1.5270227458729298E-2]
[null,null,"wall8",null,1.3437542622206383E-4,null,null,"wall11",null,3.108075175291548E-2,null,null,"wall9",null,1.6157705481240421E-3]
[null,null,"wall9",null,1.5266708005788639E-4,null,null,"wall12",null,6.9451399393663196E-2,null,null,"wall11",null,2.653418048457443E-2]
[null,null,"wall11",null,5.605502700317079E-2,null,null,"wall13",null,4.4485840093356037E-2,null,null,"wall12",null,0.17929933762093236]
[null,null,"wall12",null,0.22286186249135392,null,null,"wall14",null,9.4363944447959577E-3,null,null,"wall13",null,7.3555211405121586E-6]
[null,null,"wall13",null,2.5142149793256061E-3,null,null,"wall96",null,4.0469222240503162E-3,null,null,"wall14",null,1.6754272401049083E-2]
[null,null,"wall14",null,1.9720371835358835E-2,null,null,"roof1",null,1.5638320197906997E-2,null,null,"wall96",null,1.6504863899025372E-3]
[null,null,"wall96",null,2.1594883462400642E-3,null,null,"roof2",null,2.821428305299082E-3,null,null,"roof1",null,8.9377269225943256E-3]
[null,null,"roof1",null,1.8522752127672893E-2,null,null,"roof3",null,2.5936892173791446E-2,null,null,"roof2",null,8.2834307857481172E-3]
[null,null,"roof2",null,8.0337527873674663E-3,null,null,"roof4",null,7.2661884927928248E-4,null,null,"roof3",null,2.2896410995714843E-4]
[null,null,"roof3",null,1.091441377921455E-2,null,null,"roof5",null,4.6495616107041036E-3,null,null,"roof5",null,2.791809773410224E-2]
[null,null,"roof4",null,1.1918416003451316E-3,null,null,"roof6",null,1.3315837717258654E-2,null,null,"roof6",null,2.4675962557580262E-3]
[null,null,"roof5",null,3.1610879861529453E-2,null,null,"roof96",null,1.8866117237946157E-3,null,null,"roof96",null,8.7789665558115713E-3]
[null,null,"roof6",null,4.5663999206467416E-3,null,null,"fuel1",null,0.53099272537461317,null,null,"fuel1",null,0.42440359533755151]
[null,null,"roof96",null,4.109923861691506E-3,null,null,"fuel2",null,0.47660995349512969,null,null,"fuel2",null,0.39705956531360342]
[null,null,"fuel1",null,0.63439683150707993,null,null,"fuel3",null,3.5695190510061149E-3,null,null,"fuel3",null,8.4145141085709211E-5]
[null,null,"fuel2",null,0.6146551491122304,null,null,"fuel4",null,2.8570691348235626E-4,null,null,"fuel4",null,2.3163136823482511E-4]
[null,null,"fuel3",null,6.4926183279765044E-5,null,null,"fuel5",null,3.2585021996034669E-3,null,null,"fuel5",null,6.8391210116844616E-3]
[null,null,"fuel4",null,4.6607144360837415E-5,null,null,"fuel6",null,1.8712334356333283E-2,null,null,"fuel6",null,1.8782284924471598E-4]
[null,null,"fuel5",null,6.0291125304594198E-4,null,null,"fuel96",null,2.1315335856038769E-2,null,null,"fuel96",null,8.5661977305617892E-2]
[null,null,"fuel6",null,1.7607014802514948E-3,null,null,"dwelling1",null,6.1804097006564439E-2,null,null,"dwelling1",null,1.8023026496421193E-2]
[null,null,"fuel96",null,8.8836989916918435E-2,null,null,"dwelling2",null,2.5998668681194155E-3,null,null,"dwelling2",null,2.8457820480934644E-3]
[null,null,"dwelling1",null,3.3007354424467845E-2,null,null,"dwelling3",null,2.6630732183399172E-4,null,null,"dwelling3",null,5.5588259857194066E-4]
[null,null,"dwelling2",null,8.2696668334432605E-4,null,null,"dwelling4",null,8.3744563829262782E-5,null,null,"dwelling4",null,2.0116350099362185E-5]
[null,null,"dwelling3",null,6.6970238588259963E-4,null,null,"dwelling5",null,1.1337273493872682E-2,null,null,"dwelling5",null,2.2007272292044786E-2]
[null,null,"dwelling4",null,5.3248518456035969E-4,null,null,"dwelling6",null,7.376028292492727E-2,null,null,"dwelling6",null,5.9955232332152743E-3]
[null,null,"dwelling5",null,2.5101862788162364E-2,null,null,"dwelling7",null,7.60292614777108E-4,null,null,"dwelling7",null,6.5792653505961568E-5]
[null,null,"dwelling6",null,2.0205804774005773E-2,null,null,"light1",null,6.0527703651902097E-2,null,null,"dwelling96",null,1.6130499145574506E-4]
[null,null,"dwelling7",null,7.6733445913306075E-5,null,null,"light2",null,1.8484496675673266E-6,null,null,"light1",null,0.33198017115994244]
[null,null,"dwelling96",null,1.5678420644357316E-4,null,null,"light3",null,8.6701647357004924E-4,null,null,"light2",null,6.6672944761251741E-6]
[null,null,"light1",null,0.34460765751395062,null,null,"light5",null,1.7200405095389233E-2,null,null,"light3",null,1.8746372638017886E-2]
[null,null,"light2",null,9.5670674925120642E-4,null,null,"light6",null,2.0020931380082305E-2,null,null,"light4",null,1.2550381119731705E-3]
[null,null,"light3",null,5.0037885396156029E-2,null,null,"light7",null,1.2112036236130944E-3,null,null,"light5",null,0.18249074266384152]
[null,null,"light4",null,1.6844826315191709E-3,null,null,"light8",null,2.9727702556970222E-3,null,null,"light6",null,8.6610292999789285E-2]
[null,null,"light5",null,0.17687814760436907,null,null,"El hogar tiene radio",null,6.4931210940327364E-4,null,null,"light7",null,1.8478231269204753E-2]
[null,null,"light6",null,8.9399519222597479E-2,null,null,"El hogar tiene radio grabadora",null,4.0471832805697348E-2,null,null,"light8",null,1.7016724883062747E-3]
[null,null,"light7",null,2.1971135982807803E-2,null,null,"El hogar tiene equipo de sonido",null,0.22677016238392289,null,null,"El hogar tiene radio",null,0.13395857924431318]
[null,null,"light8",null,2.5074378744933605E-3,null,null,"El hogar tiene televisor",null,0.18326885688542616,null,null,"El hogar tiene radio grabadora",null,8.3038467246569631E-2]
[null,null,"El hogar tiene radio",null,9.3159223817718698E-2,null,null,"El hogar tiene cocina",null,0.48556964308475231,null,null,"El hogar tiene equipo de sonido",null,0.28482099700939972]
[null,null,"El hogar tiene radio grabadora",null,9.0474822760322413E-2,null,null,"El hogar tiene refrigerador",null,0.42239541158999333,null,null,"El hogar tiene televisor",null,0.44614941878418451]
[null,null,"El hogar tiene equipo de sonido",null,0.34364853172788873,null,null,"El hogar tiene micronda",null,0.27460312137638682,null,null,"El hogar tiene cocina",null,0.49147298266052619]
[null,null,"El hogar tiene televisor",null,0.46216289871959754,null,null,"El hogar tiene plancha electrica",null,0.24540553567433604,null,null,"El hogar tiene refrigerador",null,0.45243112410991521]
[null,null,"El hogar tiene cocina",null,0.65031771093758151,null,null,"El hogar tiene abanico",null,0.2800793875537686,null,null,"El hogar tiene micronda",null,0.21390888587900514]
[null,null,"El hogar tiene refrigerador",null,0.52192577009365837,null,null,"El hogar tiene lavadora de ropa",null,0.21281263043028475,null,null,"El hogar tiene plancha electrica",null,0.47391460141688962]
[null,null,"El hogar tiene micronda",null,0.28194017894883333,null,null,"El hogar tiene aire acondicionado",null,5.8235319345243779E-2,null,null,"El hogar tiene abanico",null,0.36528516122823662]
[null,null,"El hogar tiene plancha electrica",null,0.52088769847720506,null,null,"El hogar tiene maquina de coser",null,6.1165561373368475E-2,null,null,"El hogar tiene lavadora de ropa",null,0.11419623408735874]
[null,null,"El hogar tiene abanico",null,0.44818810770026535,null,null,"El hogar tiene computadora",null,0.29176746744200632,null,null,"El hogar tiene aire acondicionado",null,4.5374221023280023E-2]
[null,null,"El hogar tiene lavadora de ropa",null,0.18948702526723457,null,null,"El hogar tiene DVD/CD player/teatro en casa",null,0.20945693630035223,null,null,"El hogar tiene maquina de coser",null,5.002044710841301E-2]
[null,null,"El hogar tiene aire acondicionado",null,4.4460957991921124E-2,null,null,"El hogar tiene juegos de video",null,0.10340345141028573,null,null,"El hogar tiene computadora",null,0.12548988639187925]
[null,null,"El hogar tiene maquina de coser",null,7.6264808361821271E-2,null,null,"El hogar tiene servicios de telef. convencional",null,0.31589075135041067,null,null,"El hogar tiene DVD/CD player/teatro en casa",null,0.33190193065795925]
[null,null,"El hogar tiene computadora",null,0.26173343687045431,null,null,"El hogar tiene servicios de celular",null,0.14620853081760293,null,null,"El hogar tiene juegos de video",null,9.3079700782271194E-2]
[null,null,"El hogar tiene DVD/CD player/teatro en casa",null,0.30833753156039673,null,null,"El hogar tiene servicios de cable TV/SKY/Direct TV",null,0.29304365347579941,null,null,"El hogar tiene servicios de telef. convencional",null,7.0186206188515621E-2]
[null,null,"El hogar tiene juegos de video",null,0.1027353607333614,null,null,"El hogar tiene servicios de internet",null,0.20701056930373396,null,null,"El hogar tiene servicios de celular",null,0.18052758025590418]
[null,null,"El hogar tiene servicios de telef. convencional",null,0.29245670137508933,null,null,"Algún miembro del hogar tiene carro/camioneta/jeep",null,0.19289085105255477,null,null,"El hogar tiene servicios de cable TV/SKY/Direct TV",null,0.21119289981775677]
[null,null,"El hogar tiene servicios de celular",null,0.24451301624022975,null,null,"Algún miembro del hogar tiene moto/cuadraciclo",null,4.742041593216588E-2,null,null,"El hogar tiene servicios de internet",null,9.2008729504747949E-2]
[null,null,"El hogar tiene servicios de cable TV/SKY/Direct TV",null,0.39013467664561352,null,null,"Algún miembro del hogar tiene bicicleta",null,2.1066185121970385E-3,null,null,"Algún miembro del hogar tiene carro/camioneta/jeep",null,0.11793052164784992]
[null,null,"El hogar tiene servicios de internet",null,0.16478560645656148,null,null,"Algún miembro del hogar tiene bestia",null,5.576564652706179E-3,null,null,"Algún miembro del hogar tiene moto/cuadraciclo",null,9.6658679524895194E-2]
[null,null,"Algún miembro del hogar tiene carro/camioneta/jeep",null,0.16837968360222022,null,null,"Algún miembro del hogar tiene canoa/cayuco",null,7.5657643493066929E-4,null,null,"Algún miembro del hogar tiene bicicleta",null,9.1372865045109108E-2]
[null,null,"Algún miembro del hogar tiene moto/cuadraciclo",null,5.7773921385737302E-2,null,null,"Algún miembro del hogar tiene lancha/panga/bote",null,1.4939910476034464E-4,null,null,"Algún miembro del hogar tiene bestia",null,4.5732587452133287E-2]
[null,null,"Algún miembro del hogar tiene bicicleta",null,1.5456046401307297E-2,null,null,"Algún miembro del hogar tiene yate",null,6.6533426261851305E-4,null,null,"Algún miembro del hogar tiene canoa/cayuco",null,4.0783289864809079E-4]
[null,null,"Algún miembro del hogar tiene bestia",null,0.14149704284913275,null,null,null,null,null,null,null,"Algún miembro del hogar tiene lancha/panga/bote",null,2.9934632891237057E-4]
[null,null,"Algún miembro del hogar tiene canoa/cayuco",null,1.7495678265058545E-3,null,null,null,null,null,null,null,"Algún miembro del hogar tiene yate",null,3.1639340116443493E-5]
[null,null,"Algún miembro del hogar tiene lancha/panga/bote",null,1.8814614077888026E-4,null,null,"Total Variance Explained"]
[null,null,"Algún miembro del hogar tiene yate",null,2.3380855443738376E-4,null,null,"Component",null,"Extraction Sums of Squared Loadings"]
[null,null,null,null,null,null,null,null,null,"Total","% of Variance","Cumulative %","Total Variance Explained"]
[null,null,null,null,null,null,null,"1",null,6.9474601743683335,9.388459695092342,9.388459695092342,"Component",null,"Extraction Sums of Squared Loadings"]
[null,null,"Total Variance Explained",null,null,null,null,null,null,null,null,null,null,null,"Total","% of Variance","Cumulative %"]
[null,null,"Component",null,"Extraction Sums of Squared Loadings",null,null,null,null,null,null,null,"1",null,7.4986479763780318,9.9981973018373758,9.9981973018373758]
[null,null,null,null,"Total","% of Variance","Cumulative %","Component Score Coefficient Matrix"]
[null,null,"1",null,9.7095662545772328,12.775745071812148,12.775745071812148,null,null,"Component"]
[null,null,null,null,null,null,null,null,null,"1",null,null,"Component Score Coefficient Matrix"]
[null,null,null,null,null,null,null,"Number of members per sleeping room",null,6.1049733120408602E-2,null,null,null,null,"Component"]
[null,null,"Component Score Coefficient Matrix",null,null,null,null,"floor1",null,-8.847288323772412E-2,null,null,null,null,"1"]
[null,null,null,null,"Component",null,null,"floor2",null,1.7729828420516063E-2,null,null,"Number of members per sleeping room",null,3.980734067179599E-2]
[null,null,null,null,"1",null,null,"floor4",null,1.7457753524951356E-2,null,null,"floor1",null,-6.9003827689352232E-2]
[null,null,"Number of members per sleeping room",null,4.1696409889033094E-2,null,null,"floor5",null,8.0346185414703231E-2,null,null,"floor2",null,-4.0640321943607546E-2]
[null,null,"floor1",null,-6.7349450711898379E-2,null,null,"floor96",null,-9.9705378886083855E-4,null,null,"floor4",null,1.6314972748968121E-2]
[null,null,"floor2",null,-1.10541991493379E-2,null,null,"wall1",null,-6.4628965284878465E-2,null,null,"floor5",null,6.8134105505346931E-2]
[null,null,"floor4",null,1.4075224260220549E-2,null,null,"wall2",null,-4.5085692470750216E-4,null,null,"floor96",null,-2.0094524554686295E-3]
[null,null,"floor5",null,6.5689809491525253E-2,null,null,"wall3",null,-6.2171530992281441E-4,null,null,"wall1",null,-5.8608137860161211E-2]
[null,null,"floor96",null,-2.0159601576125248E-4,null,null,"wall4",null,1.7350386132607514E-4,null,null,"wall2",null,-3.2138794749538964E-2]
[null,null,"wall1",null,-5.6670003784024689E-2,null,null,"wall5",null,-2.1131563943117861E-3,null,null,"wall3",null,-1.7960331322750759E-3]
[null,null,"wall2",null,-1.0506605747077669E-2,null,null,"wall6",null,-2.1238418187311241E-3,null,null,"wall4",null,-5.3935582496199251E-3]
[null,null,"wall3",null,-2.2313340375495361E-3,null,null,"wall7",null,3.6797115039293037E-3,null,null,"wall5",null,-6.29850650490446E-3]
[null,null,"wall4",null,-4.2085097198393592E-3,null,null,"wall8",null,9.172464808001218E-3,null,null,"wall6",null,-6.7761991808424418E-3]
[null,null,"wall5",null,-2.8307176958294877E-3,null,null,"wall9",null,6.5040584578086305E-3,null,null,"wall7",null,-2.3257114634691453E-3]
[null,null,"wall6",null,-2.35556142601815E-3,null,null,"wall11",null,2.5375796998644493E-2,null,null,"wall8",null,-1.6479338967326715E-2]
[null,null,"wall7",null,5.8663447152688878E-6,null,null,"wall12",null,3.793275923733759E-2,null,null,"wall9",null,-5.3605194690326905E-3]
[null,null,"wall8",null,-1.1938784081290191E-3,null,null,"wall13",null,3.0358816162433386E-2,null,null,"wall11",null,2.172300355567305E-2]
[null,null,"wall9",null,-1.2725441830435497E-3,null,null,"wall14",null,1.3982247239562677E-2,null,null,"wall12",null,5.6468516242453873E-2]
[null,null,"wall11",null,2.4384140581935904E-2,null,null,"wall96",null,9.1566447050709047E-3,null,null,"wall13",null,3.6167938692654327E-4]
[null,null,"wall12",null,4.862034635426158E-2,null,null,"roof1",null,-1.7999854090918119E-2,null,null,"wall14",null,1.726155116709845E-2]
[null,null,"wall13",null,5.1641800452640729E-3,null,null,"roof2",null,-7.6455449079589543E-3,null,null,"wall96",null,5.4178004829451946E-3]
[null,null,"wall14",null,1.4462977820109692E-2,null,null,"roof3",null,2.3181039253546483E-2,null,null,"roof1",null,-1.2607546381389605E-2]
[null,null,"wall96",null,4.7860320525172041E-3,null,null,"roof4",null,-3.8799601398718385E-3,null,null,"roof2",null,-1.2137301987288896E-2]
[null,null,"roof1",null,-1.40169307571441E-2,null,null,"roof5",null,9.8147657232290006E-3,null,null,"roof3",null,2.0179051091913773E-3]
[null,null,"roof2",null,-9.2312263974752475E-3,null,null,"roof6",null,1.6609562031822019E-2,null,null,"roof5",null,2.2282296325801899E-2]
[null,null,"roof3",null,1.0759705328483964E-2,null,null,"roof96",null,-6.2519457166962198E-3,null,null,"roof6",null,6.6245149593619672E-3]
[null,null,"roof4",null,-3.5555716970741523E-3,null,null,"fuel1",null,-0.10488616821933262,null,null,"roof96",null,1.2495071083177996E-2]
[null,null,"roof5",null,1.8311269839712329E-2,null,null,"fuel2",null,9.9370045353602096E-2,null,null,"fuel1",null,-8.6877349155343842E-2]
[null,null,"roof6",null,6.9596458791425638E-3,null,null,"fuel3",null,8.5996105968360829E-3,null,null,"fuel2",null,8.403203196058659E-2]
[null,null,"roof96",null,6.6026314872457822E-3,null,null,"fuel4",null,2.4329563027885985E-3,null,null,"fuel3",null,-1.2232959990624481E-3]
[null,null,"fuel1",null,-8.2031503792709293E-2,null,null,"fuel5",null,8.2164259081711592E-3,null,null,"fuel4",null,-2.0296246094542534E-3]
[null,null,"fuel2",null,8.0745054597285121E-2,null,null,"fuel6",null,1.968964647764047E-2,null,null,"fuel5",null,-1.1028518548867824E-2]
[null,null,"fuel3",null,8.2987008048801493E-4,null,null,"fuel96",null,2.1014546590033073E-2,null,null,"fuel6",null,-1.8276424894324921E-3]
[null,null,"fuel4",null,-7.0311508824167138E-4,null,null,"dwelling1",null,-3.5783479401929642E-2,null,null,"fuel96",null,3.9031126085447863E-2]
[null,null,"fuel5",null,-2.5288721017658207E-3,null,null,"dwelling2",null,-7.3392129460256609E-3,null,null,"dwelling1",null,-1.7903209529411289E-2]
[null,null,"fuel6",null,4.3215847581091179E-3,null,null,"dwelling3",null,-2.3489051907206607E-3,null,null,"dwelling2",null,-7.1140653704102209E-3]
[null,null,"fuel96",null,3.0697081543609121E-2,null,null,"dwelling4",null,1.3172015908876115E-3,null,null,"dwelling3",null,-3.144188488799065E-3]
[null,null,"dwelling1",null,-1.8711367505180633E-2,null,null,"dwelling5",null,1.5325979694127965E-2,null,null,"dwelling4",null,5.9812454745340727E-4]
[null,null,"dwelling2",null,-2.9617212203367238E-3,null,null,"dwelling6",null,3.9091759751495404E-2,null,null,"dwelling5",null,1.9783364024441356E-2]
[null,null,"dwelling3",null,-2.6652692793670456E-3,null,null,"dwelling7",null,3.9688466616837528E-3,null,null,"dwelling6",null,1.0325963343049293E-2]
[null,null,"dwelling4",null,-2.3765881911305235E-3,null,null,"light1",null,-3.5412047077005147E-2,null,null,"dwelling7",null,-1.0816972735750168E-3]
[null,null,"dwelling5",null,1.631748214304626E-2,null,null,"light2",null,1.9569410745285982E-4,null,null,"dwelling96",null,-1.6937173529265521E-3]
[null,null,"dwelling6",null,1.4639904601848825E-2,null,null,"light3",null,4.2382601302071755E-3,null,null,"light1",null,-7.6837478765037145E-2]
[null,null,"dwelling7",null,9.0217860012610572E-4,null,null,"light5",null,1.8877447527155273E-2,null,null,"light2",null,3.4434347065263887E-4]
[null,null,"dwelling96",null,1.2895890193753833E-3,null,null,"light6",null,2.03664845767625E-2,null,null,"light3",null,1.8258944000801892E-2]
[null,null,"light1",null,-6.045923285558634E-2,null,null,"light7",null,5.0093631285540764E-3,null,null,"light4",null,4.7243872742525738E-3]
[null,null,"light2",null,3.1855878725333244E-3,null,null,"light8",null,7.8479207279899387E-3,null,null,"light5",null,5.6968850062271155E-2]
[null,null,"light3",null,2.3038258369634735E-2,null,null,"El hogar tiene radio",null,3.6677581033566116E-3,null,null,"light6",null,3.9246577291967337E-2]
[null,null,"light4",null,4.2270115950841999E-3,null,null,"El hogar tiene radio grabadora",null,2.8956786911597029E-2,null,null,"light7",null,1.8127888989471843E-2]
[null,null,"light5",null,4.3314894517535951E-2,null,null,"El hogar tiene equipo de sonido",null,6.854359671838034E-2,null,null,"light8",null,5.5011694508124822E-3]
[null,null,"light6",null,3.079411746455742E-2,null,null,"El hogar tiene televisor",null,6.1619514132268988E-2,null,null,"El hogar tiene radio",null,-4.8809268643336109E-2]
[null,null,"light7",null,1.5266041071028105E-2,null,null,"El hogar tiene cocina",null,0.10029971475212913,null,null,"El hogar tiene radio grabadora",null,3.842878874606314E-2]
[null,null,"light8",null,5.1572152856461254E-3,null,null,"El hogar tiene refrigerador",null,9.3547789564184233E-2,null,null,"El hogar tiene equipo de sonido",null,7.1170994596435985E-2]
[null,null,"El hogar tiene radio",null,-3.1434973687556579E-2,null,null,"El hogar tiene micronda",null,7.5426971207439963E-2,null,null,"El hogar tiene televisor",null,8.9075280705002757E-2]
[null,null,"El hogar tiene radio grabadora",null,3.0978760775122263E-2,null,null,"El hogar tiene plancha electrica",null,7.1304364172172743E-2,null,null,"El hogar tiene cocina",null,9.3490365618909957E-2]
[null,null,"El hogar tiene equipo de sonido",null,6.0375037956176394E-2,null,null,"El hogar tiene abanico",null,7.6175358735606102E-2,null,null,"El hogar tiene refrigerador",null,8.9700170947934921E-2]
[null,null,"El hogar tiene televisor",null,7.0016066695912746E-2,null,null,"El hogar tiene lavadora de ropa",null,6.6400696365368966E-2,null,null,"El hogar tiene micronda",null,6.1678165323549743E-2]
[null,null,"El hogar tiene cocina",null,8.3054460474747308E-2,null,null,"El hogar tiene aire acondicionado",null,3.4734988927650548E-2,null,null,"El hogar tiene plancha electrica",null,9.180515721431802E-2]
[null,null,"El hogar tiene refrigerador",null,7.4405414564800848E-2,null,null,"El hogar tiene maquina de coser",null,3.5598149048200967E-2,null,null,"El hogar tiene abanico",null,8.0599630175808457E-2]
[null,null,"El hogar tiene micronda",null,5.4686314528021841E-2,null,null,"El hogar tiene computadora",null,7.7748562299388133E-2,null,null,"El hogar tiene lavadora de ropa",null,4.5065368322813479E-2]
[null,null,"El hogar tiene plancha electrica",null,7.4331384312919704E-2,null,null,"El hogar tiene DVD/CD player/teatro en casa",null,6.5875103039812893E-2,null,null,"El hogar tiene aire acondicionado",null,2.840675495657833E-2]
[null,null,"El hogar tiene abanico",null,6.8949375156681203E-2,null,null,"El hogar tiene juegos de video",null,4.6285126130777871E-2,null,null,"El hogar tiene maquina de coser",null,2.9825711902399923E-2]
[null,null,"El hogar tiene lavadora de ropa",null,4.4832185379279417E-2,null,null,"El hogar tiene servicios de telef. convencional",null,8.0898857723953541E-2,null,null,"El hogar tiene computadora",null,4.7241251786323483E-2]
[null,null,"El hogar tiene aire acondicionado",null,2.1716487310425164E-2,null,null,"El hogar tiene servicios de celular",null,5.5037701774961499E-2,null,null,"El hogar tiene DVD/CD player/teatro en casa",null,7.6828423770663207E-2]
[null,null,"El hogar tiene maquina de coser",null,2.8442139495105125E-2,null,null,"El hogar tiene servicios de cable TV/SKY/Direct TV",null,7.7918412228894743E-2,null,null,"El hogar tiene juegos de video",null,4.0685955814437812E-2]
[null,null,"El hogar tiene computadora",null,5.2690191190971111E-2,null,null,"El hogar tiene servicios de internet",null,6.5489276713562278E-2,null,null,"El hogar tiene servicios de telef. convencional",null,3.5329941457753214E-2]
[null,null,"El hogar tiene DVD/CD player/teatro en casa",null,5.7189113707209208E-2,null,null,"Algún miembro del hogar tiene carro/camioneta/jeep",null,6.3216398308997127E-2,null,null,"El hogar tiene servicios de celular",null,5.6661597452871464E-2]
[null,null,"El hogar tiene juegos de video",null,3.3011111353094647E-2,null,null,"Algún miembro del hogar tiene moto/cuadraciclo",null,3.1344158411676704E-2,null,null,"El hogar tiene servicios de cable TV/SKY/Direct TV",null,6.1285352801136478E-2]
[null,null,"El hogar tiene servicios de telef. convencional",null,5.5696891711333726E-2,null,null,"Algún miembro del hogar tiene bicicleta",null,-6.6064306778115499E-3,null,null,"El hogar tiene servicios de internet",null,4.0451213143848412E-2]
[null,null,"El hogar tiene servicios de celular",null,5.0927359810769478E-2,null,null,"Algún miembro del hogar tiene bestia",null,-1.0748733738020249E-2,null,null,"Algún miembro del hogar tiene carro/camioneta/jeep",null,4.5796273846443983E-2]
[null,null,"El hogar tiene servicios de cable TV/SKY/Direct TV",null,6.4329095838985176E-2,null,null,"Algún miembro del hogar tiene canoa/cayuco",null,-3.959135259485996E-3,null,null,"Algún miembro del hogar tiene moto/cuadraciclo",null,4.1460779482487241E-2]
[null,null,"El hogar tiene servicios de internet",null,4.1808039988450632E-2,null,null,"Algún miembro del hogar tiene lancha/panga/bote",null,-1.7593325250277593E-3,null,null,"Algún miembro del hogar tiene bicicleta",null,4.031119337124351E-2]
[null,null,"Algún miembro del hogar tiene carro/camioneta/jeep",null,4.2261510458052265E-2,null,null,"Algún miembro del hogar tiene yate",null,-3.7127343704078755E-3,null,null,"Algún miembro del hogar tiene bestia",null,-2.8518712865461551E-2]
[null,null,"Algún miembro del hogar tiene moto/cuadraciclo",null,2.4755180284539807E-2,null,null,null,null,null,null,null,"Algún miembro del hogar tiene canoa/cayuco",null,-2.6931352347654416E-3]
[null,null,"Algún miembro del hogar tiene bicicleta",null,1.2804109421655347E-2,null,null,null,null,null,null,null,"Algún miembro del hogar tiene lancha/panga/bote",null,2.3072996600396328E-3]
[null,null,"Algún miembro del hogar tiene bestia",null,-3.8741269891447903E-2,null,null,"Component Score Covariance Matrix",null,null,null,null,"Algún miembro del hogar tiene yate",null,7.5011999558961839E-4]
[null,null,"Algún miembro del hogar tiene canoa/cayuco",null,-4.3078994931201355E-3,null,null,"Component",null,"1"]
[null,null,"Algún miembro del hogar tiene lancha/panga/bote",null,-1.412693112315713E-3,null,null,"1",null,0.99999999999999989]
[null,null,"Algún miembro del hogar tiene yate",null,-1.5748179955177965E-3,null,null,null,null,null,null,null,"Component Score Covariance Matrix"]
[null,null,null,null,null,null,null,null,null,null,null,null,"Component",null,"1"]
[null,null,null,null,null,null,null,null,null,null,null,null,"1",null,1.0000000000000002]
[null,null,"Component Score Covariance Matrix"]
[null,null,"Component",null,"1"]
[null,null,"1",null,0.99999999999999989]
[]
[]
[]
[]
[]
[]
[]
[]
[]
[]
[]
[]
[]
[]
[]
[]
[]
[]
[]
[]
[]
[]
[]
[]
[]
[]
[]
[]
[]
[]
[]
[]
[]
[]
[]
[]
[]
[]
[]
[]
[]
[]
[]
[]
[]
[]
[]
[]
[]
[]
[]
[]
[]
[]
[]
[]
[]
[]
[]
[]
[]
[]
[]
[]
[]
[]
[]
[]
[]
[]
[]
[]
[]
[]
[]
[]
[]
[]
[]
[]
[]
[]
[]
[]
[]
[]
[]
[]
[]
[]
[]
[]
[]
[]
[]
[]
[]
[]
[]
[]
[]
[]
[]
[]
[]
[]
[]
[]
[]
[]
[]
[]
[]
[]
[]
[]
[]
[]
[]
[]
[]
[]
[]
[]
[]
[]
[]
[]
[]
[]
[]
[]
[]
[]
[]
[]
[]
[]
[]
[]
[]
[]
[]
[]
[]
[]
[]
[]
[]
[]
[]
[]
[]
[]
[]
[]
[]
[]
[]
[]
[]
[]
[]
[]
[]
[]
[]
[]
[]
[]
[]
[]
[]
[]
[]
[]
[]
[]
[]
[]
[]
[]
[]
[]
[]
[]
[]
[]
[]
[]
[]
[]
[]
[]
[]
[]
[]
[]
[]
[]
[]
[]
[]
[]
[]
[]
[]
[]
[]
[]
[]
[]
[]
[]
[]
[]
[]
[]
[]
[]
[]
[]
[]
[]
[]
[]
[]
[]
[]
[]
[]
[]
[]
[]
[]
[]
[]
[]
[]
[]
[]
[]
[]
[]
[]
[]
[]
[]
[]
[]
[]
[]
[]
[]
[]
[]
[]
[]
[]
[]
[]
[]
[]
[]
[]
[]
[]
[]
[]
[]
[]
[]
[]
[]
[]
[]
[]
[]
[]
[]
[]
[]
[]
[]
[]
[]
[]
[]
[]
[]
[]
[]
[]
[]
[]
[]
[]
[]
[]
[]
[]
[]
[]
[]
[]
[]
[]
[]
[]
[]
[]
[]
[]
[]
[]
[]
[]
[]
[]
[]
[]
[]
[]
[]
[]
[]
[]
[]
[]
[]
[]
[]
[]
[]
[]
[]
[]
[]
[]
[]
[]
[]
[]
[]
[]
[]
[]
[]
[]
[]
[]
[]
[]
[]
[]
[]
[]
[]
[]
[]
[]
[]
[]
[]
[]
[]
[]
[]
[]
[]
[]
[]
[]
["ENDESA11"]
["Nicaragua",null,"Count"]
["W_text_t","",19918]
["W_text_i","",19918]
["S_text_s","Ratio of Shared improved based on:",19918]
["S_text_i","Ratio of Improved latrines based on:",19918]
["Urban/Rural","Urban",10437]
[null,"Rural",9481]
[null,"Missing",0]
["2011"]
[]
["Sub-national region names","Weighted population"]
[{"$f":"R15","v":"Atlántico"},{"$f":"BR122+BR123","v":{"$error":"#VALUE!"}}]
[{"$f":"S15","v":"Central"},{"$f":"BS122+BS123","v":{"$error":"#VALUE!"}}]
[{"$f":"T15","v":"Pácifico"},{"$f":"BT122+BT123","v":{"$error":"#VALUE!"}}]
[{"$f":"U15","v":0},{"$f":"BU122+BU123","v":0}]
[{"$f":"V15","v":0},{"$f":"BV122+BV123","v":0}]
[{"$f":"W15","v":0},{"$f":"BW122+BW123","v":0}]
[{"$f":"X15","v":0},{"$f":"BX122+XR123","v":0}]
[{"$f":"Y15","v":0},{"$f":"BY122+BY123","v":0}]
[{"$f":"Z15","v":0},{"$f":"BZ122+BZ123","v":0}]
[{"$f":"AA15","v":0},{"$f":"CA122+CA123","v":0}]
[{"$f":"AB15","v":0},{"$f":"CB122+CB123","v":0}]
[{"$f":"AC15","v":0},{"$f":"CC122+CC123","v":0}]
[{"$f":"AD15","v":0},{"$f":"CD122+CD123","v":0}]
[{"$f":"AE15","v":0},{"$f":"CE122+CE123","v":0}]
[{"$f":"AF15","v":0},{"$f":"CF122+CF123","v":0}]
[{"$f":"AG15","v":0},{"$f":"CG122+CG123","v":0}]
[{"$f":"AH15","v":0},{"$f":"CH122+CH123","v":0}]
[{"$f":"AI15","v":0},{"$f":"CI122+CI123","v":0}]
[{"$f":"AJ15","v":0},{"$f":"CJ122+CJ123","v":0}]
[{"$f":"AK15","v":0},{"$f":"CK122+CK123","v":0}]
[{"$f":"AL15","v":0},{"$f":"CL122+CL123","v":0}]
[{"$f":"AM15","v":0},{"$f":"CM122+CM123","v":0}]
[{"$f":"AN15","v":0},{"$f":"CN122+CN123","v":0}]
[{"$f":"AO15","v":0},{"$f":"CO122+CO123","v":0}]
[{"$f":"AP15","v":0},{"$f":"CP122+CP123","v":0}]
[{"$f":"AQ15","v":0},{"$f":"CQ122+CQ123","v":0}]
[{"$f":"AR15","v":0},{"$f":"CR122+CR123","v":0}]
[{"$f":"AS15","v":0},{"$f":"CS122+CS123","v":0}]
[{"$f":"AT15","v":0},{"$f":"CT122+CT123","v":0}]
[{"$f":"AU15","v":0},{"$f":"CU122+CU123","v":0}]
[{"$f":"AV15","v":0},{"$f":"CV122+CV123","v":0}]
[{"$f":"AW15","v":0},{"$f":"CW122+CW123","v":0}]
[{"$f":"AX15","v":0},{"$f":"CX122+CX123","v":0}]
[{"$f":"AY15","v":0},{"$f":"CY122+CY123","v":0}]
[]
[{"$f":"34-COUNTIF(A1037:A1071,\"0\")","v":3},"Sub-regions"]

{"sheet":"data_summary","index":6,"n_rows":94,"n_cols":88,"rows_kept":94,"cut":false,"hidden":false,"merged":[]}
["iso3","year","data_source","row","var1","var2","varname","total_q1","total_q2","total_q3","total_q4","total_q5","urban_q1","urban_q2","urban_q3","urban_q4","urban_q5","rural_q1","rural_q2","rural_q3","rural_q4","rural_q5","region_1_name","region_2_name","region_3_name","region_4_name","region_5_name","region_6_name","region_7_name","region_8_name","region_9_name","region_10_name","region_11_name","region_12_name","region_13_name","region_14_name","region_15_name","region_16_name","region_17_name","region_1","region_2","region_3","region_4","region_5","region_6","region_7","region_8","region_9","region_10","region_11","region_12","region_13","region_14","region_15","region_16","region_17","n_total_q1","n_total_q2","n_total_q3","n_total_q4","n_total_q5","n_urban_q1","n_urban_q2","n_urban_q3","n_urban_q4","n_urban_q5","n_rural_q1","n_rural_q2","n_rural_q3","n_rural_q4","n_rural_q5","n_region_1","n_region_2","n_region_3","n_region_4","n_region_5","n_region_6","n_region_7","n_region_8","n_region_9","n_region_10","n_region_11","n_region_12","n_region_13","n_region_14","n_region_15","n_region_16","n_region_17"]
["NIC",2001,"NIC_2001_DHS",16,"Water","Improved","w_imp",52.973925866982263,70.618246482418726,90.49375909009737,96.03818309103454,98.103544178069896,89.544831909274222,95.809027345737263,97.066936606432776,98.109885382881032,98.77147732664055,47.973331031277951,51.891979060054197,58.329312020430883,72.057223000295934,84.699590135035194,"Atl ntico Norte(Raan)","Atl ntico Sur(Raas)","Boaco","Carazo","Chinandega","Chontales","Estel¡","Granada","Jinotega","Le¢n","Madriz","Managua","Masaya","Matagalpa","Nueva Segovia","R¡o San Juan","Rivas",59.299287410926738,57.385253906250533,68.405797101449394,95.527483782861111,79.001233045622072,80.841269841269678,85.372157133011711,92.004541031462736,60.111177884615238,83.044041450777087,71.280991735537512,98.509903688897225,98.485316846986308,76.050797932119423,74.107440774107232,65.594362745097797,80.098831985624514]
["NIC",2001,"NIC_2001_DHS",17,"Water","Not Improved","",47.026074133017737,29.38175351758127,9.5062409099026297,3.96181690896546,1.896455821930104,10.455168090725779,4.1909726542627368,2.9330633935672239,1.890114617118968,1.2285226733594501,52.026668968722049,48.108020939945803,41.670687979569117,27.942776999704069,15.300409864964809,"Atl ntico Norte(Raan)","Atl ntico Sur(Raas)","Boaco","Carazo","Chinandega","Chontales","Estel¡","Granada","Jinotega","Le¢n","Madriz","Managua","Masaya","Matagalpa","Nueva Segovia","R¡o San Juan","Rivas",40.700712589073262,42.614746093749467,31.594202898550609,4.4725162171388888,20.998766954377931,19.158730158730322,14.62784286698829,7.9954589685372639,39.888822115384762,16.95595854922291,28.719008264462492,1.490096311102775,1.5146831530136919,23.949202067880581,25.892559225892771,34.405637254902203,19.901168014375489]
["NIC",2001,"NIC_2001_DHS",18,"Water ladder","Basic","w_bas",50.116334305549927,68.217316721320671,89.517913552953189,95.706937123725268,98.026275413248513,88.161196009707979,95.616000572786945,96.873587592322025,97.995329562712229,98.692781335705817,45.715503584858851,48.70706537626419,55.053030668504341,69.948404735945246,83.360456351891301,"Atl ntico Norte(Raan)","Atl ntico Sur(Raas)","Boaco","Carazo","Chinandega","Chontales","Estel¡","Granada","Jinotega","Le¢n","Madriz","Managua","Masaya","Matagalpa","Nueva Segovia","R¡o San Juan","Rivas",57.947433778864173,56.369056701660682,65.881817952151295,95.072591002942715,76.92441770527644,79.3202145899008,83.664713990351487,90.607579426818319,57.731141399843658,82.327565493261631,67.010578138721215,98.292482529385211,97.610899367581951,73.133198722833328,68.444928608133168,64.397632546994458,78.726744689167475]
["NIC",2001,"NIC_2001_DHS",19,"Water ladder","Limited","w_lim",2.8575915614323382,2.4009297610980691,0.97584553714412592,0.33124596730927108,0.077268764821387198,1.383635899566197,0.19302677295031551,0.19334901411075819,0.11455582016880909,0.0786959909347308,2.2578274464189931,3.1849136837898762,3.2762813519263858,2.1088182643507141,1.339133783143819,"Atl ntico Norte(Raan)","Atl ntico Sur(Raas)","Boaco","Carazo","Chinandega","Chontales","Estel¡","Granada","Jinotega","Le¢n","Madriz","Managua","Masaya","Matagalpa","Nueva Segovia","R¡o San Juan","Rivas",1.35185363206263,1.016197204589862,2.523979149298107,0.45489277991838623,2.0768153403455898,1.521055251368834,1.707443142660233,1.3969616046443829,2.3800364847715629,0.71647595751546622,4.2704135968163204,0.21742115951200561,0.87441747940435288,2.917599209286081,5.6625121659740589,1.196730198103328,1.372087296457049]
["NIC",2001,"NIC_2001_DHS",20,"Water ladder","Unimproved","w_unimp",31.88974689245299,23.639217518302999,8.8798843082843746,3.9330368057703851,1.896455821930104,9.408645345382169,4.1047619631114287,2.9330633935672239,1.890114617118968,1.2285226733594501,34.118753017223668,33.284442948700303,30.595303120772869,24.4645898987736,14.275322595123111,"Atl ntico Norte(Raan)","Atl ntico Sur(Raas)","Boaco","Carazo","Chinandega","Chontales","Estel¡","Granada","Jinotega","Le¢n","Madriz","Managua","Masaya","Matagalpa","Nueva Segovia","R¡o San Juan","Rivas",30.27315914489262,33.117675781249361,24.21607378129103,2.4923181973369282,18.82860665844704,12.904761904762131,13.38731909028256,7.7035355173533873,25.796274038461721,15.531088082901659,21.217418944691289,1.29020534254019,1.5146831530136919,18.32996178916628,14.71471471471496,21.691176470588541,17.595088349805241]
["NIC",2001,"NIC_2001_DHS",21,"Water ladder","Surface water","w_sur",15.13632724056473,5.7425359992782647,0.62635660161830875,0.028780103195072401,0,1.0465227453436561,0.086210691151305294,0,0,0,17.907915951498481,14.823577991245619,11.075384858796401,3.4781871009304388,1.0250872698417599,"Atl ntico Norte(Raan)","Atl ntico Sur(Raas)","Boaco","Carazo","Chinandega","Chontales","Estel¡","Granada","Jinotega","Le¢n","Madriz","Managua","Masaya","Matagalpa","Nueva Segovia","R¡o San Juan","Rivas",10.427553444180591,9.4970703125000924,7.3781291172595642,1.98019801980198,2.1701602959309292,6.2539682539682451,1.24052377670572,0.29192345118391122,14.09254807692305,1.424870466321243,7.5015893197711767,0.19989096856260349,0,5.6192402787143099,11.17784451117781,12.714460784313671,2.3060796645702339]
["NIC",2001,"NIC_2001_DHS",29,"Piped water","Yes","w_pip",20.822513241283058,46.682708333463047,81.48198862311024,92.098101820046779,95.843999393520392,80.164968223099009,91.545170662146617,94.168820903246484,95.842317907492443,97.266201627718985,13.73604763368928,18.093522878576231,27.21215082578,47.332170351008664,70.369689636887458,"Atl ntico Norte(Raan)","Atl ntico Sur(Raas)","Boaco","Carazo","Chinandega","Chontales","Estel¡","Granada","Jinotega","Le¢n","Madriz","Managua","Masaya","Matagalpa","Nueva Segovia","R¡o San Juan","Rivas",28.361045130641511,23.071289062500199,44.031620553359801,93.820416524411016,60.024660912453562,67.936507936507809,71.640248104755315,84.138825819007394,33.223388305846981,67.305699481865219,50.063572790845612,97.383245502453192,96.599690880989172,57.614555256064627,59.559559559559418,43.903186274509729,61.725067385444788]
["NIC",2001,"NIC_2001_DHS",30,"Piped water","No","",79.177486758716725,53.317291666536953,18.51801137688976,7.9018981799531964,4.1560006064794903,19.835031776900699,8.454829337853349,5.8311790967534538,4.157682092507522,2.733798372280956,86.263952366310562,81.906477121423677,72.787849174219815,52.667829648991393,29.630310363112141,"Atl ntico Norte(Raan)","Atl ntico Sur(Raas)","Boaco","Carazo","Chinandega","Chontales","Estel¡","Granada","Jinotega","Le¢n","Madriz","Managua","Masaya","Matagalpa","Nueva Segovia","R¡o San Juan","Rivas",71.63895486935894,76.928710937500128,55.968379446640427,6.1795834755889372,39.975339087545962,32.063492063491992,28.35975189524466,15.861174180992499,66.776611694152763,32.694300518134703,49.936427209154552,2.6167544975468102,3.4003091190108292,42.385444743935267,40.440440440440312,56.096813725490122,38.274932614555297]
["NIC",2001,"NIC_2001_DHS",31,"Piped water on premises","Yes","w_pop",10.08629086652466,35.805371684406843,75.728937901490951,89.353698253150171,95.291867614850318,69.005065137965516,88.871828892210416,91.470772640672493,95.375367232852142,97.028146879110679,5.8117375327043224,7.8473155546212219,16.14627536300161,36.97032538841183,61.693697545550677,"Atl ntico Norte(Raan)","Atl ntico Sur(Raas)","Boaco","Carazo","Chinandega","Chontales","Estel¡","Granada","Jinotega","Le¢n","Madriz","Managua","Masaya","Matagalpa","Nueva Segovia","R¡o San Juan","Rivas",21.995249406175901,17.01660156250016,34.967061923583763,87.299419597132101,55.289765721331477,59.174603174603071,58.511371467953069,77.197534868634349,23.268365817091389,63.393782383419619,35.378258105530932,96.401962565873148,91.00463678516229,46.2264150943396,51.184517851184367,33.823529411764639,56.424079065588529]
["NIC",2001,"NIC_2001_DHS",32,"Piped water on premises","No","",89.913709133475194,64.194628315593022,24.271062098508921,10.64630174684976,4.7081323851495309,30.994934862033801,11.12817110778947,8.5292273593274466,4.6246327671478591,2.9718531208892669,94.188262467295786,92.152684445378981,83.85372463699845,63.029674611588348,38.306302454448939,"Atl ntico Norte(Raan)","Atl ntico Sur(Raas)","Boaco","Carazo","Chinandega","Chontales","Estel¡","Granada","Jinotega","Le¢n","Madriz","Managua","Masaya","Matagalpa","Nueva Segovia","R¡o San Juan","Rivas",78.004750593824411,82.983398437500128,65.032938076416414,12.700580402867869,44.710234278668047,40.825396825396759,41.488628532046839,22.802465131365491,76.731634182908437,36.606217616580281,64.621741894469224,3.5980374341268639,8.9953632148377327,53.773584905660357,48.815482148815271,66.176470588235219,43.575920934411542]
["NIC",2001,"NIC_2001_DHS",35,"Water source on premises","Yes","",23.57933789409601,46.695863644476539,81.679030043254826,92.811536382108599,97.294288247603745,74.185851787605699,92.550997346495421,93.681521582528234,97.158117253864233,98.51960977114075,19.940870930562522,22.050555700118839,27.862041178408251,49.893118344371992,72.66381189223668,"Atl ntico Norte(Raan)","Atl ntico Sur(Raas)","Boaco","Carazo","Chinandega","Chontales","Estel¡","Granada","Jinotega","Le¢n","Madriz","Managua","Masaya","Matagalpa","Nueva Segovia","R¡o San Juan","Rivas",40.356294536817359,37.57324218750027,44.532279314888143,87.606691703653098,69.568434032059045,64.761904761904631,63.818056512749742,83.55497891663957,35.442278860569608,71.010362694300483,37.412587412587513,96.474650190805008,91.808346213292126,53.21203953279425,53.620286953620123,40.808823529411697,75.980832584606091]
["NIC",2001,"NIC_2001_DHS",36,"Water source on premises","No","",76.420662105903787,53.304136355523397,18.320969956745198,7.1884636178913794,2.7057117523961751,25.81414821239386,7.4490026535044951,6.318478417471729,2.8418827461357719,1.4803902288592159,80.059129069437091,77.949444299880923,72.137958821591582,50.106881655628058,27.336188107762929,"Atl ntico Norte(Raan)","Atl ntico Sur(Raas)","Boaco","Carazo","Chinandega","Chontales","Estel¡","Granada","Jinotega","Le¢n","Madriz","Managua","Masaya","Matagalpa","Nueva Segovia","R¡o San Juan","Rivas",59.643705463183252,62.426757812500277,55.467720685112077,12.393308296346881,30.4315659679406,35.238095238095177,36.181943487250159,16.445021083360331,64.557721139430129,28.989637305699471,62.587412587412643,3.5253498091950082,8.1916537867079011,46.787960467205707,46.379713046379507,59.191176470588161,24.019167415393859]
["NIC",2001,"NIC_2001_DHS",41,"Water point at more than 30 minutes","Yes","",5.3943360146796788,3.399871677209954,1.078356725321306,0.3449106976495831,0.078762460081090405,1.545187890874685,0.20147033979768669,0.19919142487694899,0.1167627703587122,0.079674814090793203,4.7064220846930978,6.1375837682043297,5.6168695265577808,2.926588309324734,1.5810392718652591,"Atl ntico Norte(Raan)","Atl ntico Sur(Raas)","Boaco","Carazo","Chinandega","Chontales","Estel¡","Granada","Jinotega","Le¢n","Madriz","Managua","Masaya","Matagalpa","Nueva Segovia","R¡o San Juan","Rivas",2.2797131147541112,1.7708333333333499,3.6897152818129051,0.47619047619047622,2.6288391462779561,1.8815331010452929,1.999999999999998,1.518361581920902,3.9593908629441552,0.86276624427069204,5.9909570459683774,0.22070995034026269,0.88786583360736837,3.836382113821132,7.640949554896129,1.824440619621335,1.712992889463482]
["NIC",2001,"NIC_2001_DHS",42,"Water point at more than 30 minutes","No","w_30min",94.605663985320348,96.600128322790056,98.921643274678644,99.655089302350419,99.921237539918906,98.454812109125271,99.798529660202306,99.800808575123057,99.883237229641296,99.920325185909206,95.293577915306685,93.862416231795422,94.383130473441966,97.073411690675314,98.41896072813465,"Atl ntico Norte(Raan)","Atl ntico Sur(Raas)","Boaco","Carazo","Chinandega","Chontales","Estel¡","Granada","Jinotega","Le¢n","Madriz","Managua","Masaya","Matagalpa","Nueva Segovia","R¡o San Juan","Rivas",97.720286885245983,98.229166666666686,96.310284718187106,99.523809523809518,97.371160853722003,98.118466898954665,98.000000000000014,98.481638418079058,96.040609137055824,99.137233755729312,94.009042954031656,99.779290049659735,99.112134166392636,96.163617886178855,92.359050445103861,98.175559380378658,98.287007110536521]
["NIC",2001,"NIC_2001_DHS",58,"Source of drinking water","Inside dwelling","",2.0867779163084248,6.3605996271993579,21.08759506699268,43.453211872173512,70.900417243020314,14.90156825674323,31.35007595764047,41.019389940654122,63.582888169854492,76.489406005466265,0.48575450666886921,1.84644708343692,2.1690457782352288,5.7384809580588811,24.158625700139758,"Atl ntico Norte(Raan)","Atl ntico Sur(Raas)","Boaco","Carazo","Chinandega","Chontales","Estel¡","Granada","Jinotega","Le¢n","Madriz","Managua","Masaya","Matagalpa","Nueva Segovia","R¡o San Juan","Rivas",5.9619952494062138,10.620117187500099,23.109354413702281,37.179924889040677,22.194821208384539,40.031746031745932,21.950379048931769,37.041842361336322,7.0012019230769091,29.896373056994779,16.147488874761681,50.917681264764767,25.2550231839259,21.353113059114371,19.91991991991986,18.99509803921562,29.49985025456726]
["NIC",2001,"NIC_2001_DHS",59,"Source of drinking water","Outside dwelling / within resinct","",7.9995129502162508,29.4684020960723,54.585007179696007,45.500190046263917,20.696363855296902,54.053498580227021,57.47251935333616,49.973019882544442,30.365931742988678,15.28157275255616,5.3259830260354546,6.0008684711843037,13.977229584766381,31.288295783236752,37.462567093088403,"Atl ntico Norte(Raan)","Atl ntico Sur(Raas)","Boaco","Carazo","Chinandega","Chontales","Estel¡","Granada","Jinotega","Le¢n","Madriz","Managua","Masaya","Matagalpa","Nueva Segovia","R¡o San Juan","Rivas",16.033254156769701,5.8105468750000542,9.6706192358366447,49.948787982246508,32.749691738594088,18.793650793650759,36.250861474844932,39.506973726889342,15.955528846153801,33.419689119170918,18.944691671964481,44.248591677267093,65.533230293663152,22.432007192627509,29.929929929929841,14.55269607843131,25.816112608565462]
["NIC",2001,"NIC_2001_DHS",60,"Source of drinking water","Public","",6.4146422902363023,6.7577532226943866,2.3404710604661201,1.2224627563534309,0.19072328603225719,3.9129461212855898,0.69579382891630714,1.1727912907014839,0.020583700252711001,0,5.5235844535417744,5.8760414455735734,8.5023919147076601,6.3822013961071278,5.2366442651149567,"Atl ntico Norte(Raan)","Atl ntico Sur(Raas)","Boaco","Carazo","Chinandega","Chontales","Estel¡","Granada","Jinotega","Le¢n","Madriz","Managua","Masaya","Matagalpa","Nueva Segovia","R¡o San Juan","Rivas",2.1140142517814851,3.8330078125000369,4.9275362318840674,3.1751451007169669,0.83847102342785895,3.7777777777777728,10.26878015161957,1.881284463185205,5.258413461538451,0.72538860103626912,12.46026700572161,0.49064146829002681,2.1638330757341642,9.1256462126320326,4.9049049049048934,6.9546568627450682,0.3893381251871823]
["NIC",2001,"NIC_2001_DHS",61,"Source of drinking water","Private","",4.3215800845221457,4.1267620109054892,3.412579661153111,1.522746434039401,0.32225896952733579,7.2469569638474951,1.9775479410198129,1.526653229083299,0.44636697438762651,0.23805474860831119,2.4007256474431791,4.3701658783814281,2.5634835480707201,3.9954654495910669,3.3488420221785842,"Atl ntico Norte(Raan)","Atl ntico Sur(Raas)","Boaco","Carazo","Chinandega","Chontales","Estel¡","Granada","Jinotega","Le¢n","Madriz","Managua","Masaya","Matagalpa","Nueva Segovia","R¡o San Juan","Rivas",4.2517814726841117,2.2216796875000209,4.1370223978919718,3.3458518265619661,3.8964241676941671,4.9841269841269762,2.8600964851826309,5.0600064871877954,4.7175480769230687,3.186528497409324,2.2250476795931449,0.49064146829002692,3.4312210200927451,2.1802652281411521,3.4701368034701279,3.1249999999999858,4.9116501946690674]
["NIC",2001,"NIC_2001_DHS",62,"Source of drinking water","Public well","",14.48327275659369,14.49792538874302,4.6758226840899786,1.435572531809179,0.43641095090307641,6.1466847409476921,1.38113040069032,0.65252799803008465,0.55999864699636526,0.19555743548562329,14.61635858527446,15.75862895781904,15.477047326228689,17.553102845197781,7.0216012032468544,"Atl ntico Norte(Raan)","Atl ntico Sur(Raas)","Boaco","Carazo","Chinandega","Chontales","Estel¡","Granada","Jinotega","Le¢n","Madriz","Managua","Masaya","Matagalpa","Nueva Segovia","R¡o San Juan","Rivas",18.622327790973991,10.424804687500099,18.234519104084349,1.5363605326049841,8.236744759556025,8.98412698412697,10.0275671950379,3.892312682452149,5.258413461538451,6.0621761658031081,23.140495867768681,0.72687624931855832,0.83462132921174881,11.41829624634747,10.110110110110091,8.4865196078430998,3.653788559448941]
["NIC",2001,"NIC_2001_DHS",63,"Source of drinking water","Private well","",20.439818859053659,20.958693617653118,11.599890725966061,5.5314723276381708,3.0566433405875579,11.00570137270188,6.5958723367965781,4.5613539980958171,3.07591686024805,1.857145920974272,20.478061072355789,20.38116689375536,24.298882278139281,23.63289415410604,18.055510129535811,"Atl ntico Norte(Raan)","Atl ntico Sur(Raas)","Boaco","Carazo","Chinandega","Chontales","Estel¡","Granada","Jinotega","Le¢n","Madriz","Managua","Masaya","Matagalpa","Nueva Segovia","R¡o San Juan","Rivas",26.152019002375461,32.885742187500277,14.2555994729908,1.058381700238989,27.003699136867851,7.3650793650793549,6.4093728463128858,9.3415504378851555,14.242788461538421,22.072538860103641,6.2937062937063253,1.5264401235689731,1.7619783616692479,8.6086761069903197,11.01101101101098,16.452205882352889,29.439952081461531]
["NIC",2001,"NIC_2001_DHS",64,"Source of drinking water","River","",15.13632724056473,5.7425359992782647,0.62635660161830875,0.028780103195072401,0,1.0465227453436561,0.086210691151305294,0,0,0,17.907915951498481,14.823577991245619,11.075384858796401,3.4781871009304388,1.0250872698417599,"Atl ntico Norte(Raan)","Atl ntico Sur(Raas)","Boaco","Carazo","Chinandega","Chontales","Estel¡","Granada","Jinotega","Le¢n","Madriz","Managua","Masaya","Matagalpa","Nueva Segovia","R¡o San Juan","Rivas",10.427553444180591,9.4970703125000924,7.3781291172595642,1.98019801980198,2.1701602959309292,6.2539682539682451,1.24052377670572,0.29192345118391122,14.09254807692305,1.424870466321243,7.5015893197711767,0.19989096856260349,0,5.6192402787143099,11.17784451117781,12.714460784313671,2.3060796645702339]
["NIC",2001,"NIC_2001_DHS",65,"Source of drinking water","Spring","",28.742793177407961,11.81044842202998,1.1823514299497191,0.56454745999476408,0.050559519219117097,1.256273122778905,0.088748010031763594,0.1640562383008439,0.1091995678021954,0,33.143086376816719,30.298490071260439,21.4146766371775,7.7431827982439874,3.2097484795353139,"Atl ntico Norte(Raan)","Atl ntico Sur(Raas)","Boaco","Carazo","Chinandega","Chontales","Estel¡","Granada","Jinotega","Le¢n","Madriz","Managua","Masaya","Matagalpa","Nueva Segovia","R¡o San Juan","Rivas",15.58194774346803,22.924804687500199,15.942028985507269,0.81939228405599163,2.416769420468535,9.4603174603174445,9.9931082012405188,1.978592280246509,31.730769230769148,2.9274611398963719,13.00063572790852,0,0.43276661514683268,16.632951224994351,7.9746413079746183,18.44362745098033,2.096436058700212]
["NIC",2001,"NIC_2001_DHS",66,"Source of drinking water","Rainwater","",0.31847022917147599,0.27119581133412829,0.17572164116698211,0.090993353816854694,0.17620246503616799,0.092599734979291498,0.12540465554735031,0.16041361961341499,0.076048961658563105,0.2345063039825879,0.11853038036518949,0.57931322006055508,0.5218580738781482,0.18818951452820881,0.075376077615769102,"Atl ntico Norte(Raan)","Atl ntico Sur(Raas)","Boaco","Carazo","Chinandega","Chontales","Estel¡","Granada","Jinotega","Le¢n","Madriz","Managua","Masaya","Matagalpa","Nueva Segovia","R¡o San Juan","Rivas",0.7600950118764892,0.97656250000000921,0.026350461133069901,0,0,0,0.51688490696071643,0.25948751216347649,0.30048076923076861,0.15544041450777199,0,0,0.37094281298299953,0,0,0,0.77867625037436461]
["NIC",2001,"NIC_2001_DHS",67,"Source of drinking water","Purified water","",0,0,0.16335206061958341,0.48278246866634328,4.0457714538020371,0.13293263397738081,0.15481023551785,0.52569952662265174,1.7455082962156661,5.5015858377972977,0,0,0,0,0.27410507073872181,"Atl ntico Norte(Raan)","Atl ntico Sur(Raas)","Boaco","Carazo","Chinandega","Chontales","Estel¡","Granada","Jinotega","Le¢n","Madriz","Managua","Masaya","Matagalpa","Nueva Segovia","R¡o San Juan","Rivas",0,0.80566406250000744,2.318840579710149,0.17070672584499819,0.49321824907521111,0.34920634920634858,0.31013094417642989,0.64871878040869158,1.262019230769228,0.12953367875647659,0.28607755880483282,1.2356896238415489,0.21638330757341639,2.629804450438296,1.334668001334665,0.27573529411764591,1.1081162024558271]
["NIC",2001,"NIC_2001_DHS",68,"Source of drinking water","Other","",0.056804495924916598,0.0056838040895664001,0.15085188828104931,0.1672406460492879,0.1246489165754662,0.2043157271670909,0.071886589351480096,0.24409427635327921,0.017557079595195299,0.2021709951294571,0,0.065299987282828306,0,0,0.1318926889638847,"Atl ntico Norte(Raan)","Atl ntico Sur(Raas)","Boaco","Carazo","Chinandega","Chontales","Estel¡","Granada","Jinotega","Le¢n","Madriz","Managua","Masaya","Matagalpa","Nueva Segovia","R¡o San Juan","Rivas",0.095011876484561206,0,0,0.78525093888699193,0,0,0.17229496898690549,0.097307817061303703,0.18028846153846109,0,0,0.16354715609667561,0,0,0.1668335001668331,0,0]
["NIC",2001,"NIC_2001_DHS",122,"Sanitation","Improved","s_imp",29.184298675297931,48.792859780542557,57.227003864282842,69.720856549083138,89.273065203454081,51.403606142821019,61.240034306998787,69.472088328318549,81.395999647216485,94.862137685089507,21.325385726290499,32.089030048744142,45.155474660229501,51.618657494716928,59.777278131570817,"Atl ntico Norte(Raan)","Atl ntico Sur(Raas)","Boaco","Carazo","Chinandega","Chontales","Estel¡","Granada","Jinotega","Le¢n","Madriz","Managua","Masaya","Matagalpa","Nueva Segovia","R¡o San Juan","Rivas",35.369622058474206,42.325581395349161,42.714097496706287,62.649368385114393,58.203799654576471,53.873015873015753,58.209471137227752,62.098083793439322,34.263729631864727,63.453554748313422,55.311004784689132,79.261415317446165,61.653786707882666,54.465691788526371,51.951951951951848,41.482843137254797,52.969406118776263]
["NIC",2001,"NIC_2001_DHS",123,"Sanitation","Not Improved","",70.815701324702061,51.207140219457443,42.772996135717158,30.279143450916859,10.726934796545921,48.596393857178981,38.759965693001213,30.527911671681451,18.604000352783519,5.1378623149104934,78.674614273709494,67.910969951255865,54.844525339770499,48.381342505283072,40.222721868429183,"Atl ntico Norte(Raan)","Atl ntico Sur(Raas)","Boaco","Carazo","Chinandega","Chontales","Estel¡","Granada","Jinotega","Le¢n","Madriz","Managua","Masaya","Matagalpa","Nueva Segovia","R¡o San Juan","Rivas",64.630377941525794,57.674418604650839,57.285902503293713,37.350631614885607,41.796200345423529,46.126984126984247,41.790528862772248,37.901916206560678,65.736270368135266,36.546445251686578,44.688995215310868,20.738584682553839,38.346213292117334,45.534308211473629,48.048048048048152,58.517156862745203,47.030593881223737]
["NIC",2001,"NIC_2001_DHS",124,"Sanitation ladder","Basic","s_bas",27.36327828786763,44.682493901360907,51.289756470636753,63.8244226331161,85.647376448025057,46.215171835800867,54.99718482333676,63.708395952926082,76.509556146421104,92.439684572342742,20.161993569804491,30.339830572131081,42.740177004634589,46.543296575072837,53.207329941767092,"Atl ntico Norte(Raan)","Atl ntico Sur(Raas)","Boaco","Carazo","Chinandega","Chontales","Estel¡","Granada","Jinotega","Le¢n","Madriz","Managua","Masaya","Matagalpa","Nueva Segovia","R¡o San Juan","Rivas",32.165036308511361,40.695285706973642,40.856962822936453,58.466547053764018,53.071045765665097,50.764957264957147,56.02688879237482,54.955812175024583,32.294549767964462,57.290100641115707,51.870804487093928,72.339664072704466,52.800109765497417,52.739773905154671,49.332365121838713,39.814323787767449,48.867033144036498]
["NIC",2001,"NIC_2001_DHS",125,"Sanitation ladder","Limited","s_lim",1.8210203874303119,4.1103658791816544,5.9372473936460857,5.89643391596704,3.6256887554290271,5.1884343070201409,6.2428494836620283,5.7636923753924778,4.8864435007953766,2.4224531127467799,1.163392156486013,1.7491994766130561,2.4152976555949119,5.0753609196440914,6.5699481898037311,"Atl ntico Norte(Raan)","Atl ntico Sur(Raas)","Boaco","Carazo","Chinandega","Chontales","Estel¡","Granada","Jinotega","Le¢n","Madriz","Managua","Masaya","Matagalpa","Nueva Segovia","R¡o San Juan","Rivas",3.2045857499628441,1.630295688375526,1.85713467376984,4.1828213313503664,5.1327538889113784,3.1080586080585988,2.182582344852932,7.1422716184147408,1.9691798639002731,6.1634541071977189,3.4402002975952031,6.92175124474171,8.8536769423852455,1.7259178833716959,2.6195868301131369,1.668519349487358,4.1023729747397581]
["NIC",2001,"NIC_2001_DHS",126,"Sanitation ladder","Unimproved","s_unimp",19.64730079638068,32.343731279639428,37.514711645300757,28.81700523434041,10.32701281783112,38.002460229764942,35.496241695256607,29.527745080855439,17.984956883951838,5.04730651400304,15.125069122412841,20.958729493963649,29.41732687599341,32.03906465689974,34.482695879253903,"Atl ntico Norte(Raan)","Atl ntico Sur(Raas)","Boaco","Carazo","Chinandega","Chontales","Estel¡","Granada","Jinotega","Le¢n","Madriz","Managua","Masaya","Matagalpa","Nueva Segovia","R¡o San Juan","Rivas",27.430473021154729,23.525091799265009,28.27404479578378,29.395698190508678,28.349370836417979,28.50793650793668,33.667473211199493,29.26274764533953,18.059746529873451,29.17747794499223,29.85645933014332,18.501000545751911,32.720247295208509,24.971878515185711,38.705372038705512,24.54044117647075,35.002999400119961]
["NIC",2001,"NIC_2001_DHS",127,"Sanitation ladder","Open defecation","s_od",51.168400528321378,18.863408939818012,5.2582844904164041,1.462138216576444,0.39992197871479951,10.593933627414049,3.2637239977445991,1.000166590826016,0.61904346883167571,0.090555800907442793,63.54954515129667,46.95224045729222,25.427198463777088,16.342277848383329,5.7400259891752761,"Atl ntico Norte(Raan)","Atl ntico Sur(Raas)","Boaco","Carazo","Chinandega","Chontales","Estel¡","Granada","Jinotega","Le¢n","Madriz","Managua","Masaya","Matagalpa","Nueva Segovia","R¡o San Juan","Rivas",37.199904920371068,34.149326805385833,29.011857707509929,7.9549334243769252,13.44682950900555,17.619047619047581,8.1230556515727574,8.6391685612211599,47.676523838261822,7.3689673066943424,14.832535885167539,2.2375841368019072,5.6259659969088247,20.562429696287928,9.3426760093426449,33.976715686274453,12.02759448110379]
["NIC",2001,"NIC_2001_DHS",128,"Shared among Improved Sanitation","Yes","s_shared",6.2397263942876693,8.4241134823189263,10.37490518938684,8.4572023463538191,4.0613467759464186,10.09352202373598,10.194065947720359,8.2964144508709889,6.0032968720502478,2.5536564659638099,5.4554331228426616,5.451082422734415,5.3488478944551439,9.8324155760221874,10.990711513065481,"Atl ntico Norte(Raan)","Atl ntico Sur(Raas)","Boaco","Carazo","Chinandega","Chontales","Estel¡","Granada","Jinotega","Le¢n","Madriz","Managua","Masaya","Matagalpa","Nueva Segovia","R¡o San Juan","Rivas",9.0602770497940828,3.8517975055025859,4.3478260869565242,6.6765578635014817,8.8185890257558093,5.7692307692307656,3.7495313085864241,11.50159744408945,5.7471264367816124,9.7133314778736519,6.2197392923650154,8.732813080639211,14.3603133159269,3.168816601233869,5.0423260949576658,4.0221914008321633,7.7447969976117514]
["NIC",2001,"NIC_2001_DHS",129,"Shared among Improved Sanitation","No","",93.760273605712328,91.57588651768107,89.625094810613163,91.54279765364619,95.938653224053581,89.906477976264014,89.805934052279639,91.703585549129016,93.996703127949758,97.446343534036203,94.544566877157337,94.548917577265584,94.651152105544853,90.167584423977814,89.009288486934508,"Atl ntico Norte(Raan)","Atl ntico Sur(Raas)","Boaco","Carazo","Chinandega","Chontales","Estel¡","Granada","Jinotega","Le¢n","Madriz","Managua","Masaya","Matagalpa","Nueva Segovia","R¡o San Juan","Rivas",90.939722950205919,96.148202494497411,95.652173913043484,93.323442136498514,91.181410974244187,94.230769230769241,96.250468691413573,88.498402555910559,94.252873563218387,90.286668522126348,93.780260707634994,91.267186919360796,85.639686684073098,96.831183398766129,94.957673905042341,95.977808599167844,92.255203002388242]
["NIC",2001,"NIC_2001_DHS",135,"Sanitation type","Sewer connection","s_sew",0.0042473122743376997,0.65718103925348315,5.5469236239257693,22.186588465197431,54.901162025269137,2.7092430902702178,11.217320312353889,22.099173978391761,43.908496428205233,66.486013417086269,0,0,0,0.072140403745655293,0.42818332608989201,"Atl ntico Norte(Raan)","Atl ntico Sur(Raas)","Boaco","Carazo","Chinandega","Chontales","Estel¡","Granada","Jinotega","Le¢n","Madriz","Managua","Masaya","Matagalpa","Nueva Segovia","R¡o San Juan","Rivas",0.26146898027097859,1.272949816401481,8.9591567852437546,2.3898941618299752,8.3395016037502288,1.1746031746031731,15.03629450397511,12.081844754790479,5.0090525045262417,19.512195121951219,3.827751196172267,44.678915772239527,10.108191653786729,6.0967379077615176,3.2699366032699282,3.2781862745097889,6.0887822435512957]
["NIC",2001,"NIC_2001_DHS",136,"Sanitation type","Septic tank connection","s_sep",0.0212365613716885,0.024630146191624899,0.52203357950521523,1.8677997757677509,4.3675503866383174,0.097479634927551406,1.0222371221226749,1.9627253335511521,2.787178418471072,4.6673528947210814,0.049245793795517002,0,0.0153731652097723,0.041557734946548401,1.797739469313518,"Atl ntico Norte(Raan)","Atl ntico Sur(Raas)","Boaco","Carazo","Chinandega","Chontales","Estel¡","Granada","Jinotega","Le¢n","Madriz","Managua","Masaya","Matagalpa","Nueva Segovia","R¡o San Juan","Rivas",1.2122652721654461,5.8261933904529322,0.60606060606060708,1.024240355069989,1.159634838391304,1.3015873015873001,0.38022813688212898,2.1760311789542022,0.63367531683765688,1.8162947586922671,0.22328548644338231,1.0187374931781039,1.174652241112832,1.844769403824519,0.46713380046713249,0.7965686274509769,0.56988602279544176]
["NIC",2001,"NIC_2001_DHS",139,"Sanitation type","Open defecation","",51.168400528321378,18.863408939818012,5.2582844904164041,1.462138216576444,0.39992197871479951,10.593933627414049,3.2637239977445991,1.000166590826016,0.61904346883167571,0.090555800907442793,63.54954515129667,46.95224045729222,25.427198463777088,16.342277848383329,5.7400259891752761,"Atl ntico Norte(Raan)","Atl ntico Sur(Raas)","Boaco","Carazo","Chinandega","Chontales","Estel¡","Granada","Jinotega","Le¢n","Madriz","Managua","Masaya","Matagalpa","Nueva Segovia","R¡o San Juan","Rivas",37.199904920371068,34.149326805385833,29.011857707509929,7.9549334243769252,13.44682950900555,17.619047619047581,8.1230556515727574,8.6391685612211599,47.676523838261822,7.3689673066943424,14.832535885167539,2.2375841368019072,5.6259659969088247,20.562429696287928,9.3426760093426449,33.976715686274453,12.02759448110379]
["NIC",2001,"NIC_2001_DHS",151,"Shared among all sanitation facilities","Yes","",6.2326349960968708,8.4163878430088435,10.37490518938683,8.4513020526714655,4.0588023965040261,10.093522023735961,10.19406594772035,8.2862738991476999,6.0032968720502504,2.5515913648880382,5.4554331228426616,5.437972784726635,5.3385753111956404,9.8290330707010565,10.98628640551626,"Atl ntico Norte(Raan)","Atl ntico Sur(Raas)","Boaco","Carazo","Chinandega","Chontales","Estel¡","Granada","Jinotega","Le¢n","Madriz","Managua","Masaya","Matagalpa","Nueva Segovia","R¡o San Juan","Rivas",9.0602770497940952,3.8391224862888711,4.3429844097995582,6.6765578635014808,8.8185890257558004,5.7692307692307638,3.7495313085864228,11.48121899362153,5.7471264367816106,9.713331477873643,6.2197392923650181,8.7247076294784254,14.360313315926909,3.1688166012338699,5.042326094957664,4.0221914008321624,7.7132178049609381]
["NIC",2001,"NIC_2001_DHS",152,"Shared among all sanitation facilities","No","",93.653715818943823,91.491903524073308,89.625094810613135,91.478931451970908,95.878548940804507,89.906477976263801,89.80593405227954,91.591497977084629,93.996703127949786,97.36754023706014,94.544566877157337,94.321531163459781,94.469372428912052,90.136565359359395,88.973451346275667,"Atl ntico Norte(Raan)","Atl ntico Sur(Raas)","Boaco","Carazo","Chinandega","Chontales","Estel¡","Granada","Jinotega","Le¢n","Madriz","Managua","Masaya","Matagalpa","Nueva Segovia","R¡o San Juan","Rivas",90.939722950206033,95.831809872029339,95.545657015590223,93.3234421364985,91.181410974244102,94.230769230769198,96.250468691413545,88.341601700921274,94.252873563218358,90.286668522126277,93.780260707635037,91.182476331910195,85.639686684073169,96.831183398766171,94.957673905042299,95.977808599167801,91.879034998301037]
["NIC",2001,"NIC_2001_DHS",153,"Type of toilet facility","Flush toilet (sewer)","",0.0042473122743376997,0.65718103925348315,5.5469236239257693,22.186588465197431,54.901162025269137,2.7092430902702178,11.217320312353889,22.099173978391761,43.908496428205233,66.486013417086269,0,0,0,0.072140403745655293,0.42818332608989201,"Atl ntico Norte(Raan)","Atl ntico Sur(Raas)","Boaco","Carazo","Chinandega","Chontales","Estel¡","Granada","Jinotega","Le¢n","Madriz","Managua","Masaya","Matagalpa","Nueva Segovia","R¡o San Juan","Rivas",0.26146898027097859,1.272949816401481,8.9591567852437546,2.3898941618299752,8.3395016037502288,1.1746031746031731,15.03629450397511,12.081844754790479,5.0090525045262417,19.512195121951219,3.827751196172267,44.678915772239527,10.108191653786729,6.0967379077615176,3.2699366032699282,3.2781862745097889,6.0887822435512957,0.51155399999999995,79.187176999999991,669.25254600000017,2673.386399999993,6614.7224939999987,185.450941,766.67592400000024,1512.1588929999989,3002.4493389999921,4544.2162350000008,0,0,0,3.7597839999999998,22.349055,9.5523009999999999,43.92913200000001,173.92835999999991,49.358820000000001,407.36909199999991,21.110016999999999,428.3727750000001,149.1582359999999,188.71892600000001,848.11236800000063,66.355800000000002,6797.1298159999733,320.95867499999991,320.0480189999999,67.166750000000008,31.697572999999991,114.09351100000001]
["NIC",2001,"NIC_2001_DHS",154,"Type of toilet facility","Flust toilet (septic tank)","",0.0212365613716885,0.024630146191624899,0.52203357950521523,1.8677997757677509,4.3675503866383174,0.097479634927551406,1.0222371221226749,1.9627253335511521,2.787178418471072,4.6673528947210814,0.049245793795517002,0,0.0153731652097723,0.041557734946548401,1.797739469313518,"Atl ntico Norte(Raan)","Atl ntico Sur(Raas)","Boaco","Carazo","Chinandega","Chontales","Estel¡","Granada","Jinotega","Le¢n","Madriz","Managua","Masaya","Matagalpa","Nueva Segovia","R¡o San Juan","Rivas",1.2122652721654461,5.8261933904529322,0.60606060606060708,1.024240355069989,1.159634838391304,1.3015873015873001,0.38022813688212898,2.1760311789542022,0.63367531683765688,1.8162947586922671,0.22328548644338231,1.0187374931781039,1.174652241112832,1.844769403824519,0.46713380046713249,0.7965686274509769,0.56988602279544176,2.5577700000000001,2.9678149999999999,62.98487699999999,225.06166400000001,526.22080699999981,6.6725979999999998,69.867362999999997,134.30151599999999,190.58639400000001,319.00635499999999,2.5577700000000001,0,0.80192600000000003,2.165889,93.833122000000017,44.287940999999996,201.060258,11.765741999999999,21.153780000000001,56.645997999999992,23.392181000000001,10.832414999999999,26.864521,23.874081,78.946629999999999,3.8707549999999999,154.98341600000001,37.297949999999993,96.841097999999988,9.5952500000000001,7.7022139999999988,10.678703000000001]
["NIC",2001,"NIC_2001_DHS",155,"Type of toilet facility","Flush toilet (sink-sumidero)","",0.046720435017714598,0.39570196341600639,1.585502473275846,7.2020046374305382,16.139411225312639,0.29663005116742519,2.9556773450347782,6.9063137331180817,11.42165499927423,16.766645250800622,0.068944111313723799,0,0.17462856787389319,0.59560758421336246,7.4978709944581254,"Atl ntico Norte(Raan)","Atl ntico Sur(Raas)","Boaco","Carazo","Chinandega","Chontales","Estel¡","Granada","Jinotega","Le¢n","Madriz","Managua","Masaya","Matagalpa","Nueva Segovia","R¡o San Juan","Rivas",1.7114333254100409,1.6156670746634181,3.6363636363636429,14.81734380334586,3.7256353318529132,7.4920634920634814,3.6985827860352551,9.158817797986341,1.2975256487628219,3.0098598858328991,1.3397129186602941,8.2954338730216985,7.5425038639876556,3.5770528683914451,2.0353687020353641,1.011029411764701,4.4391121775644926,5.6270939999999996,47.680197000000007,191.29550699999999,867.80990600000052,1944.5440229999981,20.304683000000001,202.01319000000001,472.57167800000002,781.00921900000014,1145.974283,3.5808779999999998,0,9.1093270000000004,31.041632,391.35183700000022,62.524151999999987,55.756206000000013,70.594452000000004,306.02468400000021,181.99033399999999,134.64767599999999,105.369855,113.071566,48.885022999999997,130.82584399999999,23.224530000000001,1262.0078159999989,239.49209999999999,187.77725100000001,41.80787500000001,9.7758869999999991,83.181475999999975]
["NIC",2001,"NIC_2001_DHS",156,"Type of toilet facility","Flush toilet (rivers)","",0.0212365613716885,0.1501636437754891,0.72828496147339683,0.65727365740849886,0.85888209768860135,0.89889985674690298,0.77350766966955675,0.75208513263471111,0.76245229555678995,0.71785556323733934,0,0.048998151504376398,0.0392265827805552,0.083310739857786198,0.291119036734935,"Atl ntico Norte(Raan)","Atl ntico Sur(Raas)","Boaco","Carazo","Chinandega","Chontales","Estel¡","Granada","Jinotega","Le¢n","Madriz","Managua","Masaya","Matagalpa","Nueva Segovia","R¡o San Juan","Rivas",1.735203232707403,0.51407588739290577,4.9011857707509936,0,0,0.063492063492063405,0,0,1.3578756789378359,0.36325895173845341,0.063795853269537794,0.090958704748045002,0,0.60742407199100024,0,0,0,2.5577700000000001,18.094002,87.869709000000014,79.198587000000003,103.48172099999999,61.530773999999987,52.867324000000004,51.462204999999997,52.136250999999987,49.064318,0,2.5577700000000001,2.0462159999999998,4.3419549999999996,15.194976,63.392543000000003,17.740611000000001,95.149043999999961,0,0,1.1410819999999999,0,0,51.158745000000003,15.789326000000001,1.1059300000000001,13.837804999999999,0,31.886703000000001,0,0,0]
["NIC",2001,"NIC_2001_DHS",157,"Type of toilet facility","Flush toilet (rain water sewer)","",0,0,0.057579442397274298,0,0.068614167787856395,0.10149022932821219,0,0,0.12089734681040309,0,0,0,0,0,0,"Atl ntico Norte(Raan)","Atl ntico Sur(Raas)","Boaco","Carazo","Chinandega","Chontales","Estel¡","Granada","Jinotega","Le¢n","Madriz","Managua","Masaya","Matagalpa","Nueva Segovia","R¡o San Juan","Rivas",0.1901592583788935,0,0,0,0,0,0,0,0,0,0,0,0,0.1574803149606297,0,0,0,0,0,6.9471280000000002,0,8.2669230000000002,6.9471280000000002,0,0,8.2669230000000002,0,0,0,0,0,0,6.9471280000000002,0,0,0,0,0,0,0,0,0,0,0,0,8.2669230000000002,0,0,0]
["NIC",2001,"NIC_2001_DHS",158,"Type of toilet facility","Traditional pit toilet","",38.760328276649908,63.96728477456697,73.45769448285958,56.187374900520297,18.79903310470899,74.004140287378235,69.445468051173052,57.318717589881487,34.203214483168288,8.6589019015307311,29.672211533083171,41.760664903113287,57.285126782554229,63.911507834084048,68.383153685037115,"Atl ntico Norte(Raan)","Atl ntico Sur(Raas)","Boaco","Carazo","Chinandega","Chontales","Estel¡","Granada","Jinotega","Le¢n","Madriz","Managua","Masaya","Matagalpa","Nueva Segovia","R¡o San Juan","Rivas",51.010221060138207,45.679314565483757,45.797101449275488,58.791396381017442,56.698741672834721,56.888888888888737,67.334946422398843,58.52549529067872,30.869040434520141,57.628437986507492,59.585326953748073,36.820083682008487,65.440494590417444,48.413948256467933,77.410744077410612,49.080882352941117,70.005998800239936,4668.3642950000112,7707.7523530000281,8862.8855180000282,6770.331732000026,2264.986432999995,5065.6722179999988,4746.4248949999919,3922.0926819999831,2338.805175999993,591.82255899999996,1541.1406060000011,2179.963377999999,2988.2221359999899,3330.9137749999868,3569.2629059999849,1863.5670860000009,1576.3800059999951,889.08085200000096,1214.2269720000011,2769.6277320000149,1022.409471999999,1918.32222,722.53532600000051,1163.0088029999999,2504.863789,1032.938619999996,5601.5434639999812,2077.8884249999978,2541.488328000004,1590.0700000000011,474.57487800000149,1311.7943579999981]
["NIC",2001,"NIC_2001_DHS",159,"Type of toilet facility","Ventilated improved pit toilet","",9.7319302283092401,15.73170424439796,12.84369694614622,10.37077622042726,4.4654250138794902,11.29818322276671,11.322065501900919,9.8445164883168133,6.1770625596818149,2.6126751717161789,6.3710900546396694,11.20869759718749,16.322909535868721,18.953597854769331,15.86190749919073,"Atl ntico Norte(Raan)","Atl ntico Sur(Raas)","Boaco","Carazo","Chinandega","Chontales","Estel¡","Granada","Jinotega","Le¢n","Madriz","Managua","Masaya","Matagalpa","Nueva Segovia","R¡o San Juan","Rivas",6.6793439505586347,10.771113831089449,6.613965744400538,15.02219187435986,16.629657044164659,15.46031746031743,5.4268924991358416,9.4186424163689324,11.88895594447794,10.300985988583291,20.12759170653916,6.8582863380025936,10.108191653786729,18.74015748031492,7.474140807474118,11.856617647058769,6.8686262747450586,1172.131341999999,1895.5952379999981,1549.629572000001,1249.6329549999989,538.01315299999999,773.37420099999929,773.83499700000004,673.62124800000038,422.38561800000019,178.57230899999999,330.90710400000012,585.10922500000004,851.46847600000012,987.81584600000042,827.91323600000078,244.01787100000001,371.70803999999993,128.40005400000001,310.25544000000031,812.32771600000012,277.85346699999991,154.60810499999999,116.27927,447.92323399999992,447.74017300000008,348.92091499999981,1043.3704969999999,320.95867499999991,983.76383699999951,153.52399999999989,114.644493,128.70647299999999]
["NIC",2001,"NIC_2001_DHS",160,"Type of toilet facility","NO FACILITY","",50.823198997321441,17.382088120428008,4.5209658066129021,1.337171691863779,0.25873739819902869,10.15375361686092,2.9394189183133279,0.8329463991161995,0.46079235469821223,0,63.526340287278657,46.331309511233073,24.157003911036838,14.404654263081341,4.600330903222126,"Atl ntico Norte(Raan)","Atl ntico Sur(Raas)","Boaco","Carazo","Chinandega","Chontales","Estel¡","Granada","Jinotega","Le¢n","Madriz","Managua","Masaya","Matagalpa","Nueva Segovia","R¡o San Juan","Rivas",36.581887330639667,33.31701346389255,29.011857707509929,7.9549334243769252,11.867752282259939,17.46031746031743,8.1230556515727574,8.3793439428385685,44.870247435123623,6.9278671510119354,14.70494417862847,2.0374749863562078,5.2859350850077416,19.93250843644541,9.3426760093426449,33.731617647058762,11.877624475104991,6121.2383409999966,2094.4586140000001,545.46773700000006,161.123312,31.173767999999999,695.03662100000008,200.90196700000001,56.995221000000008,31.508838000000001,0,3299.4851919999769,2418.5572289999982,1260.126281999999,750.73586800000021,240.114554,1336.4537490000009,1149.760550999998,563.22095400000001,164.29435800000019,579.71755400000018,313.79754999999989,231.41977499999999,103.448454,1690.512307,301.12500300000022,254.91686500000009,309.96683200000001,167.84077500000001,1046.356254,191.90499999999989,326.15913900000078,222.56665199999989]
["NIC",2001,"NIC_2001_DHS",161,"Type of toilet facility","Bush/field (Abonera)","",0.34520153099994061,1.4813208193900009,0.73731868380350174,0.12496652471266451,0.14118458051577079,0.44018001055313272,0.32430507943127079,0.16722019170981661,0.1582511141334636,0.090555800907442793,0.0232048640180103,0.62093094605914934,1.2701945527402509,1.9376235853019941,1.1396950859531509,"Atl ntico Norte(Raan)","Atl ntico Sur(Raas)","Boaco","Carazo","Chinandega","Chontales","Estel¡","Granada","Jinotega","Le¢n","Madriz","Managua","Masaya","Matagalpa","Nueva Segovia","R¡o San Juan","Rivas",0.61801758973140386,0.83231334149327585,0,0,1.5790772267456059,0.1587301587301585,0,0.25982461838259119,2.8062764031381948,0.44110015568240768,0.12759170653907559,0.20010915044569899,0.34003091190108292,0.62992125984251868,0,0.24509803921568521,0.1499700059988005,41.576698999999998,178.492085,88.959654000000015,15.057917,17.010511000000001,30.130849999999999,22.165444999999998,11.442214999999999,10.821161999999999,6.189349,1.2052339999999999,32.413437999999999,66.258446000000006,100.984272,59.486455000000007,22.578166,28.722894,0,0,77.134976000000009,2.8527049999999998,0,3.2077040000000001,105.72807299999999,19.172753,2.2118600000000002,30.443171,10.796775,33.067692000000001,0,2.3699119999999998,2.8101850000000002]
["NIC",2001,"NIC_2001_DHS",162,"Type of toilet facility","Hanging letrine (colgante)","",0.2459000966838544,0.20992524858041681,0,0.066044126671673906,0,0,0,0.1163011532794915,0,0,0.28896335587073207,0.029398890902625801,0.73553690193554799,0,0,"Atl ntico Norte(Raan)","Atl ntico Sur(Raas)","Boaco","Carazo","Chinandega","Chontales","Estel¡","Granada","Jinotega","Le¢n","Madriz","Managua","Masaya","Matagalpa","Nueva Segovia","R¡o San Juan","Rivas",0,0.17135862913096861,0.47430830039525779,0,0,0,0,0,1.267350633675314,0,0,0,0,0,0,0,0,29.616654,25.294989999999999,0,7.9580270000000004,0,0,0,7.9580270000000004,0,0,15.008425000000001,1.534662,38.368557000000003,0,0,0,5.9135369999999998,9.2079720000000016,0,0,0,0,0,47.748162000000001,0,0,0,0,0,0,0,0]
["NIC",2011,"NIC_2011_ENDESA",16,"Water","Improved","w_imp",51.312910838042058,77.47797892426594,89.45684333064807,95.548853117765091,98.087644060893609,93.618318709328179,95.590827854939974,97.317919703382145,98.506331928242162,98.936491212258431,44.071359756976321,52.487248632317943,65.477295139071373,74.127915109427121,80.326201547876224,"Atlántico","Central","Pácifico","","","","","","","","","","","","","","",56.783466131615057,73.889261404269703,93.472979514666264]
["NIC",2011,"NIC_2011_ENDESA",17,"Water","Not Improved","",48.687089161957942,22.52202107573406,10.54315666935193,4.4511468822349087,1.9123559391063909,6.3816812906718212,4.4091721450600261,2.6820802966178552,1.4936680717578379,1.063508787741569,55.928640243023679,47.512751367682057,34.522704860928627,25.872084890572879,19.67379845212378,"Atlántico","Central","Pácifico","","","","","","","","","","","","","","",43.216533868384943,26.1107385957303,6.5270204853337361]
["NIC",2011,"NIC_2011_ENDESA",18,"Water ladder","Basic","w_bas",51.312910838042058,77.47797892426594,89.45684333064807,95.548853117765091,98.087644060893609,93.618318709328179,95.590827854939974,97.317919703382145,98.506331928242162,98.936491212258431,44.071359756976321,52.487248632317943,65.477295139071373,74.127915109427121,80.326201547876224,"Atlántico","Central","Pácifico","","","","","","","","","","","","","","",56.783466131615057,73.889261404269703,93.472979514666264]
["NIC",2011,"NIC_2011_ENDESA",19,"Water ladder","Limited","w_lim",0,0,0,0,0,0,0,0,0,0,0,0,0,0,0,"Atlántico","Central","Pácifico","","","","","","","","","","","","","","",0,0,0]
["NIC",2011,"NIC_2011_ENDESA",20,"Water ladder","Unimproved","w_unimp",32.167934425532827,17.423781288392458,9.057417781667823,4.0565463304938589,1.7606841032298921,5.0104041849796204,4.277066235824492,2.5060262757086211,1.3885941218760109,1.063508787741569,35.241844842389241,32.439717630687603,26.610203537019739,19.94903708821235,16.68270092397589,"Atlántico","Central","Pácifico","","","","","","","","","","","","","","",31.852173289804551,17.12540944322626,5.8739815929926351]
["NIC",2011,"NIC_2011_ENDESA",21,"Water ladder","Surface water","w_sur",16.519154736425111,5.0982397873415977,1.485738887684106,0.39460055174105629,0.15167183587649699,1.371277105692202,0.13210590923553739,0.17605402090922981,0.1050739498818288,0,20.686795400634431,15.073033736994461,7.9125013239088853,5.9230478023605277,2.9910975281478862,"Atlántico","Central","Pácifico","","","","","","","","","","","","","","",11.36436057858039,8.9853291525040291,0.6530388923410998]
["NIC",2011,"NIC_2011_ENDESA",22,"Improved water point at more than 30 minutes","Yes","",0,0,0,0,0,0,0,0,0,0,0,0,0,0,0,"Atlántico","Central","Pácifico","","","","","","","","","","","","","","",0,0,0]
["NIC",2011,"NIC_2011_ENDESA",23,"Improved water point at more than 30 minutes","No","",100,100,100,100,100,100,100,100,100,100,100,100,100,100,100,"Atlántico","Central","Pácifico","","","","","","","","","","","","","","",100,100,100]
["NIC",2011,"NIC_2011_ENDESA",29,"Piped water","Yes","w_pip",17.260804702520911,56.849705509600653,77.748739826587752,89.881139033492062,96.110403952554336,83.129323811587341,89.201951244345338,92.912771788038526,96.683649493978606,97.711293316440859,8.57758595171609,17.681210694236661,36.734151148946751,52.190522673008431,61.501216174775372,"Atlántico","Central","Pácifico","","","","","","","","","","","","","","",21.38237546868509,55.35343996737484,85.784039121906204]
["NIC",2011,"NIC_2011_ENDESA",30,"Piped water","No","",82.739195297479014,43.150294490399133,22.251260173412319,10.11886096650794,3.889596047445611,16.87067618841278,10.79804875565465,7.0872282119613716,3.316350506021394,2.2887066835591372,91.422414048283926,82.31878930576319,63.265848851053427,47.809477326991903,38.49878382522467,"Atlántico","Central","Pácifico","","","","","","","","","","","","","","",78.617624531315229,44.64656003262472,14.21596087809397]
["NIC",2011,"NIC_2011_ENDESA",31,"Piped water on premises","Yes","w_pop",11.44373381095417,50.254424263439347,75.217752845833374,88.502610384034227,95.643058524738819,80.426765541691836,87.171788089148123,92.370312261045925,96.154899105614817,97.463560814968915,5.1443058802674289,9.8977897316277357,27.759891001112489,45.532873987018093,57.353785750664009,"Atlántico","Central","Pácifico","","","","","","","","","","","","","","",16.533065119927219,49.717554845778572,84.114776683484877]
["NIC",2011,"NIC_2011_ENDESA",32,"Piped water on premises","No","",88.556266189045658,49.745575736560347,24.782247154166662,11.497389615965799,4.356941475261138,19.573234458308381,12.82821191085181,7.6296877389539777,3.845100894385181,2.5364391850310519,94.855694119732618,90.102210268372176,72.240108998887663,54.46712601298217,42.646214249336083,"Atlántico","Central","Pácifico","","","","","","","","","","","","","","",83.466934880072927,50.282445154220937,15.885223316515081]
["NIC",2011,"NIC_2011_ENDESA",35,"Water source on premises","Yes","",92.785899264923415,94.551132444595069,98.151375860668821,99.129415344099726,99.682051801718487,98.150145129573474,99.403276560566084,99.442027002796706,99.705918009476719,99.872661551404207,92.212457939457337,92.940452572626171,92.017766072614748,93.978698870672488,96.909012049929515,"Atlántico","Central","Pácifico","","","","","","","","","","","","","","",95.52234765122563,93.291483112051026,99.265436088317045]
["NIC",2011,"NIC_2011_ENDESA",36,"Water source on premises","No","",7.2141007350763191,5.4488675554048376,1.848624139331184,0.87058465590030254,0.31794819828150811,1.8498548704265581,0.59672343943391781,0.55797299720326654,0.29408199052326728,0.12733844859580559,7.787542060542636,7.0595474273737828,7.9822339273851419,6.0213011293274734,3.0909879500703981,"Atlántico","Central","Pácifico","","","","","","","","","","","","","","",4.4776523487744084,6.7085168879486723,0.73456391168305224]
["NIC",2011,"NIC_2011_ENDESA",41,"Water point at more than 30 minutes","Yes","",0,0,0,0,0,0,0,0,0,0,0,0,0,0,0,"Atlántico","Central","Pácifico","","","","","","","","","","","","","","",0,0,0]
["NIC",2011,"NIC_2011_ENDESA",42,"Water point at more than 30 minutes","No","w_30min",100,100,100,100,100,100,100,100,100,100,100,100,100,100,100,"Atlántico","Central","Pácifico","","","","","","","","","","","","","","",100,100,100]
["NIC",2011,"NIC_2011_ENDESA",58,"Esta vivienda se abastece de agua por","Dentro de la vivienda","",0.87092291595811022,7.3656142967665801,19.345576673583,41.346074596729153,70.65610984505129,16.396009321979172,28.043831856145299,44.072245301402241,60.359232778562891,78.339173242008386,0.55995531848433977,0.67631533898345697,1.6461567312741261,6.1138798516203483,14.625427389294121,"Atlántico","Central","Pácifico","","","","","","","","","","","","","","",6.9816443107687611,18.738263140508082,38.298596791581829]
["NIC",2011,"NIC_2011_ENDESA",59,"Esta vivienda se abastece de agua por","Fuera de la vivi. dentro del terreno","",10.57281089499606,42.888809966672717,55.872176172250278,47.156535787304868,24.98694867968776,64.030756219712742,59.127956233002863,48.298066959643748,35.795666327051627,19.12438757296076,4.5843505617830882,9.2214743926442804,26.113734269838361,39.418994135397739,42.728358361369942,"Atlántico","Central","Pácifico","","","","","","","","","","","","","","",9.5514208091584525,30.97929170527043,45.816179891903147]
["NIC",2011,"NIC_2011_ENDESA",60,"Esta vivienda se abastece de agua por","Puesto público","",4.047378803982209,4.4780318741517977,1.4639556307146191,0.8462269338973023,0.1192212744888228,2.1792606936769841,0.7109506396774683,0.32330352965867709,0.23272091347579041,0.14971444284672361,2.2269775467193069,5.1747455400609592,6.1564140134000347,4.7448334574927493,2.38827201334544,"Atlántico","Central","Pácifico","","","","","","","","","","","","","","",2.0266920979077261,4.5063662492326406,0.87774300993594956]
["NIC",2011,"NIC_2011_ENDESA",61,"Esta vivienda se abastece de agua por","Puesto privado","",1.769692087584525,2.117249372009383,1.0670313500397131,0.53230171556054695,0.34812415332670399,0.52329757621861139,1.3192125155196861,0.21915599733393051,0.29602947488799591,0.098018058625191196,1.2063025247293511,2.6086754225479498,2.8178461344342081,1.9128152284975961,1.759158410765965,"Atlántico","Central","Pácifico","","","","","","","","","","","","","","",2.8226182508501299,1.129518872363563,0.791519428485154]
["NIC",2011,"NIC_2011_ENDESA",62,"Esta vivienda se abastece de agua por","Pozo público","",10.505827051430529,9.6881407634548484,5.6057370315269059,1.564285900080485,0.35491841036489319,2.398935414546802,2.6554322320080672,0.35473594042646528,0.35699186127057592,0,8.2106060518477797,13.16060831070863,14.130138920104789,11.3505795733144,9.9136660859475239,"Atlántico","Central","Pácifico","","","","","","","","","","","","","","",9.8651913291378577,7.7681461867208554,3.2078244859729579]
["NIC",2011,"NIC_2011_ENDESA",63,"Esta vivienda se abastece de agua por","Pozo privado","",16.148857994127159,13.23376448785959,9.0315627232481308,5.8307097295113444,2.873375226842493,6.9101517746559944,5.151383110855571,4.5717204941550076,2.3704752468706332,2.089700662515241,13.66032559235423,18.567585635815831,17.3894586699762,15.50313018878334,16.43330909668428,"Atlántico","Central","Pácifico","","","","","","","","","","","","","","",25.154627874265341,6.4519102107645123,7.3865680111753083]
["NIC",2011,"NIC_2011_ENDESA",64,"Esta vivienda se abastece de agua por","Río, quebrada o arroyo","",16.1256312305152,4.7818846607193013,1.4517690363540401,0.39460055174105629,0.15167183587649699,1.3483778039917089,0.13210590923553739,0.17605402090922981,0.1050739498818288,0,20.274366318476929,14.793949760851641,7.3638200951466963,5.5127799825078787,2.9437499245542691,"Atlántico","Central","Pácifico","","","","","","","","","","","","","","",11.19193521296328,8.9002236759427031,0.47273370062357378]
["NIC",2011,"NIC_2011_ENDESA",65,"Esta vivienda se abastece de agua por","Manantial o ojo de agua","",34.365814107934661,9.5736824816345507,2.459494957458912,0.51017797559685307,0.21830622126825591,0.47008678991997987,0.53209095141973461,0.085596116835713804,0.049721135610238498,0.0373169129682882,43.981736203390227,31.07077292833511,17.175915156647111,10.479248272734131,5.2357145578992874,"Atlántico","Central","Pácifico","","","","","","","","","","","","","","",25.780737163921039,17.067829833862579,1.038977571261019]
["NIC",2011,"NIC_2011_ENDESA",66,"Esta vivienda se abastece de agua por","Lago, laguna","",0.39352350590990642,0.31635512662229681,0.033969851330065498,0,0,0.022899301700492598,0,0,0,0,0.41242908215749802,0.27908397614282071,0.54868122876218905,0.41026781985264932,0.047347603593617199,"Atlántico","Central","Pácifico","","","","","","","","","","","","","","",0.17242536561710781,0.085105476561325694,0.1803051917175259]
["NIC",2011,"NIC_2011_ENDESA",67,"Esta vivienda se abastece de agua por","De otra vivienda/vecino/empresa","",3.3692110931300561,4.0976154101254361,2.832980632517319,1.482594234999741,0.1814856802991798,4.6505346491602442,2.0155688869380151,1.5446229340804669,0.27436637040101841,0.16168910807560699,2.473847013345678,3.2446718680553208,4.3653878599778411,3.2361909542546319,3.0336405028352069,"Atlántico","Central","Pácifico","","","","","","","","","","","","","","",4.677704701083238,2.474786439148168,1.7967990947103449]
["NIC",2011,"NIC_2011_ENDESA",68,"Esta vivienda se abastece de agua por","Agua de lluvia","",0.045385921190117098,0.032652533390973598,0,0.13395129050400331,0.0105801767369913,0.057336163229767999,0,0.2350900813352417,0.018566753170911901,0,0.056072962384552102,0.049387906314905201,0,0,0,"Atlántico","Central","Pácifico","","","","","","","","","","","","","","",0.20525011462740081,0.051838081257916599,0.0016832107559660999]
["NIC",2011,"NIC_2011_ENDESA",69,"Esta vivienda se abastece de agua por","Camión, carreta o pipa","",0.12725954445480711,0.25021160467456038,0.32672551542615641,0.098581756175136995,0.061874322065032197,0.89153709578927565,0.20385457651498251,0.1194086242192469,0.1411551888161886,0,0.037519905733880803,0.1124947262812783,0.0299997567827574,0.034722464748127999,0,"Atlántico","Central","Pácifico","","","","","","","","","","","","","","",0.1178576635572325,0.36525380081492981,0.0737730530891966]
["NIC",2011,"NIC_2011_ENDESA",70,"Esta vivienda se abastece de agua por","Otro","",1.657684848786702,1.129297154054802,0.50902042555076277,0.1039595278993219,0.037384173992271202,0.1208171954185078,0.1076130886827438,0,0,0,2.3155109185930338,1.040234193257827,2.1540188201651449,1.282558070796693,0.89135605371048265,"Atlántico","Central","Pácifico","","","","","","","","","","","","","","",1.451895106142669,1.452313940651591,0.057296558788121503]
["NIC",2011,"NIC_2011_ENDESA",71,"Esta vivienda se abastece de agua por","No hay dato","",0,0.046690267862866799,0,0,0,0,0,0,0,0,0,0,0.1084283434906794,0,0,"Atlántico","Central","Pácifico","","","","","","","","","","","","","","",0,0.029152386900362402,0]
["NIC",2011,"NIC_2011_ENDESA",122,"Sanitation","Improved","s_imp",45.615297933381697,61.692843249267497,72.06435318712326,83.055957886708171,94.9389886757006,68.349796354079075,77.289708815091501,83.873656768888225,92.451868468712519,97.468512312755095,35.314572520261187,51.57745937648216,56.339877912598411,60.914539087189993,68.671758636872823,"Atlántico","Central","Pácifico","","","","","","","","","","","","","","",53.912072544329682,63.534808594827688,79.283713044387355]
["NIC",2011,"NIC_2011_ENDESA",123,"Sanitation","Not Improved","",54.384702066618303,38.307156750732503,27.93564681287674,16.944042113291829,5.0610113242994004,31.650203645920929,22.710291184908499,16.126343231111779,7.5481315312874813,2.5314876872449048,64.685427479738806,48.42254062351784,43.660122087401589,39.085460912810007,31.32824136312718,"Atlántico","Central","Pácifico","","","","","","","","","","","","","","",46.087927455670318,36.465191405172312,20.716286955612649]
["NIC",2011,"NIC_2011_ENDESA",124,"Sanitation ladder","Basic","s_bas",42.769028148399521,56.495768123480069,64.587744868614351,76.031747467526856,91.083187120003899,61.450894605901397,69.410744927680028,76.915150588240252,86.901708340778299,94.979501345801708,33.388009633800571,48.765929554317751,53.326343539131791,54.925168457919,61.124243754145503,"Atlántico","Central","Pácifico","","","","","","","","","","","","","",""]
["NIC",2011,"NIC_2011_ENDESA",125,"Sanitation ladder","Limited","s_lim",2.8462697849821761,5.1970751257874248,7.4766083185089096,7.0242104191813226,3.855801555696702,6.8989017481776633,7.8789638874114623,6.9585061806479764,5.5501601279342276,2.4890109669534031,1.9265628864606219,2.8115298221644029,3.013534373466618,5.9893706292709927,7.547514882727322,"Atlántico","Central","Pácifico","","","","","","","","","","","","","",""]
["NIC",2011,"NIC_2011_ENDESA",126,"Sanitation ladder","Unimproved","s_unimp",21.640395093048621,27.476558654656898,23.88093713852345,15.277702950020849,4.6985727600508076,24.598050417820762,19.483785747941202,14.864419543585299,6.9123210040382466,2.4608526557281749,17.634402509240431,25.798774985307361,27.990786055345779,29.808273315696379,26.771675394564468,"Atlántico","Central","Pácifico","","","","","","","","","","","","","",""]
["NIC",2011,"NIC_2011_ENDESA",127,"Sanitation ladder","Open defecation","s_od",32.744306973569671,10.830598096075599,4.0547096743532833,1.666339163270959,0.36243856424859111,7.0521532281001829,3.2265054369673152,1.261923687526477,0.63581052724921672,0.070635031516709204,47.051024970498368,22.623765638210479,15.66933603205581,9.2771875971136293,4.5565659685627091,"Atlántico","Central","Pácifico","","","","","","","","","","","","","",""]
["NIC",2011,"NIC_2011_ENDESA",135,"Sanitation type","Sewer connection","s_sew",0.32372304146442199,3.1628138496225091,16.071528774705222,35.500030393804693,58.954776380543898,13.401936109748799,27.16595863207321,37.512737162874991,54.714125027063453,66.019763546743022,0.0104236632561975,0.0144781078365206,0.0246946358501242,0.12087396151072791,1.6212988665789549,"Atlántico","Central","Pácifico","","","","","","","","","","","","","","",0.96392324267741103,12.780098182259859,33.894758617127493]
["NIC",2011,"NIC_2011_ENDESA",136,"Sanitation type","Septic tank connection","s_sep",0.45650540856472149,1.6579428953552631,6.4875055592550277,16.060099368666489,26.569857316172939,2.7570983000899321,8.7207054686433896,15.076194407939949,23.512806082417459,26.426080602572,0.37117221248499671,0.35048764109553598,1.2651048304167301,1.7127457563557591,14.09857541802147,"Atlántico","Central","Pácifico","","","","","","","","","","","","","","",6.8905429124135154,6.6682041225902031,13.14088038686047]
["NIC",2011,"NIC_2011_ENDESA",139,"Sanitation type","Open defecation","",32.744306973569671,10.830598096075599,4.0547096743532833,1.666339163270959,0.36243856424859111,7.0521532281001829,3.2265054369673152,1.261923687526477,0.63581052724921672,0.070635031516709204,47.051024970498368,22.623765638210479,15.66933603205581,9.2771875971136293,4.5565659685627091,"Atlántico","Central","Pácifico","","","","","","","","","","","","","","",22.885975364850989,14.09509830598693,4.3934324355742929]
["NIC",2011,"NIC_2011_ENDESA",153,"El tipo de servicio higienico de la vivienda","Excusado o letrina","",66.422325160522306,84.254942969318108,73.341213115797061,46.660486109980738,13.94719256145742,76.751120506235779,60.886830462316041,46.006948820695989,20.919025528281779,7.3862767109412797,52.530791946646623,77.011268612857293,82.782072851626396,88.843487773418801,79.626893762815612,"Atlántico","Central","Pácifico","","","","","","","","","","","","","","",69.259558480058274,66.295498180417482,48.493344421653227,null,null,null,null,null,null,null,null,null,null,null,null,null,null,11892.46935053957,15080.51357408546,13127.810036073941,8353.9149044672577,2496.1618236908339,7823.3673254879086,6204.8594426497812,4693.2837913808262,2133.4592313724979,752.77478725139679,4046.5437660110379,5935.7472681046238,6380.2924013189086,6845.028933211589,6135.5127420684921,8152.5817249638631,19004.525370527739,23793.762593365431]
["NIC",2011,"NIC_2011_ENDESA",154,"El tipo de servicio higienico de la vivienda","Tubería de aguas negra","",0.32372304146442199,3.1628138496225091,16.071528774705222,35.500030393804693,58.954776380543898,13.401936109748799,27.16595863207321,37.512737162874991,54.714125027063453,66.019763546743022,0.0104236632561975,0.0144781078365206,0.0246946358501242,0.12087396151072791,1.6212988665789549,"Atlántico","Central","Pácifico","","","","","","","","","","","","","","",0.96392324267741103,12.780098182259859,33.894758617127493,null,null,null,null,null,null,null,null,null,null,null,null,null,null,57.960427301741532,566.10159013349278,2876.7451175167721,6355.7896142965847,10551.274851687151,1366.081281520401,2768.4304414758171,3826.768038519685,5580.1048173894269,6728.4256199973424,0.80295400098297898,1.115919664561968,1.9032985287803079,9.3128464961095681,124.92638334263,113.46394901986611,3663.5926542344819,16630.814997681358]
["NIC",2011,"NIC_2011_ENDESA",155,"El tipo de servicio higienico de la vivienda","Sumidero o pozo septico","",0.45650540856472149,1.6579428953552631,6.4875055592550277,16.060099368666489,26.569857316172939,2.7570983000899321,8.7207054686433896,15.076194407939949,23.512806082417459,26.426080602572,0.37117221248499671,0.35048764109553598,1.2651048304167301,1.7127457563557591,14.09857541802147,"Atlántico","Central","Pácifico","","","","","","","","","","","","","","",6.8905429124135154,6.6682041225902031,13.14088038686047,null,null,null,null,null,null,null,null,null,null,null,null,null,null,81.734214612200518,296.74971529644768,1161.239867349964,2875.3387430833081,4755.2697936374552,281.03554204566109,888.71027220196061,1537.9602574005339,2397.9899601052421,2693.2225777599278,28.5920799380518,27.014307069730972,97.505878487085127,131.9600856664949,1086.341373304698,811.08969585759394,1911.533330343927,6447.70930777784]
["NIC",2011,"NIC_2011_ENDESA",156,"El tipo de servicio higienico de la vivienda","Río / Quebrada","",0,0.019673961583997601,0.0091259006135636003,0.1130449642769928,0.0607131874749385,0.016025475771052702,0,0.1421959209626541,0.16276027214307581,0,0,0,0,0.045704911600998301,0,"Atlántico","Central","Pácifico","","","","","","","","","","","","","","",0,0.090661160339900099,0.020932440512208401,null,null,null,null,null,null,null,null,null,null,null,null,null,null,0,3.521377313513276,1.6335029729300941,20.23913788044608,10.86598181689474,1.6335029729300941,0,14.50576115480804,16.599358542532769,0,0,0,0,3.521377313513276,0,0,25.989280857535661,10.270719126248521]
["NIC",2011,"NIC_2011_ENDESA",157,"El tipo de servicio higienico de la vivienda","No tiene","",32.744306973569671,10.830598096075599,4.0547096743532833,1.666339163270959,0.36243856424859111,7.0521532281001829,3.2265054369673152,1.261923687526477,0.63581052724921672,0.070635031516709204,47.051024970498368,22.623765638210479,15.66933603205581,9.2771875971136293,4.5565659685627091,"Atlántico","Central","Pácifico","","","","","","","","","","","","","","",22.885975364850989,14.09509830598693,4.3934324355742929,null,null,null,null,null,null,null,null,null,null,null,null,null,null,5862.6473274874197,1938.5329316858019,725.77826429320339,298.33498817684119,64.866481445934298,718.83752022318072,328.80694520169271,128.7319881113981,64.844121774685433,7.1987921524416301,3624.4272116090569,1743.7572124195231,1207.688357819057,714.76952461645601,351.09831916170441,2693.9210790836742,4040.5557045098958,2155.6832094956198]
["NIC",2011,"NIC_2011_ENDESA",158,"El tipo de servicio higienico de la vivienda","No hay dato","",0.053139415878862097,0.074028228044379404,0.035916975275843602,0,0.1050219901025467,0.021666380054418399,0,0,0.055472562844908001,0.097244108227203405,0.036587207113619999,0,0.25879165005105909,0,0.096665984021361395,"Atlántico","Central","Pácifico","","","","","","","","","","","","","","",0,0.070440048405469094,0.056651698272075002,null,null,null,null,null,null,null,null,null,null,null,null,null,null,9.5142540270563085,13.25006769389535,6.4290077633046296,0,18.796032333163691,2.20848957854066,0,0,5.6574552733996679,9.910664837908044,2.8183800276939279,0,19.94594169325774,0,7.4484304066199503,0,20.19261825863104,27.79674355878895]