{"text_format":"1","workbook":"xlsx","n_sheets":7,"sheets":["Introduction","Water","Sanitation","Hygiene","DHS06","DHS12","data_summary"],"not_rendered":{"charts":111,"images":76,"macros":1,"external_links":0,"defined_names":0,"comments":0,"pivot_tables":0},"unopened":[],"bounds":{"document_bytes":16777216,"sheet_cells":100000,"rows_first":2000,"rows_last":500,"rows_between":2000,"halvings":0,"cell_chars":16384,"cell_head_chars":4096},"cells_cut":0,"cells_raw":0,"read":"whole","date_system":"1900"}

{"sheet":"Introduction","index":0,"n_rows":55,"n_cols":12,"rows_kept":55,"cut":false,"hidden":false,"merged":[[107,0,107,1],[1,0,1,1],[4,0,4,1],[5,0,5,1],[6,0,6,1],[7,0,7,1],[112,0,112,1],[113,0,113,1],[207,0,207,1],[212,0,212,1],[213,0,213,1]]}
[]
[]
[]
[null,null,"Joint Monitoring Programme for Water Supply, Sanitation and Hygiene"]
[]
[null,null,"Estimates on household water, sanitation and hygiene \nby wealth quintile and sub-national region in"]
[null,null,{"$f":"+Water!B5","v":"Niger"}]
[]
[null,null,"Updated May 2021"]
[]
[null,null,"Follow the links below to find the following information: "]
[]
[null,null,"JMP Estimates"]
[null,null,"WASH status and trends by wealth quintile \n(customized quintiles made without water and sanitation assets)"]
[null,null,"Water"]
[null,null,"Sanitation"]
[null,null,"Hygiene"]
[]
[null,null,"Data inputs"]
[null,null," customized wealth quintiles and subnational data:"]
[null,null,{"$f":"IF(INDIRECT(CONCATENATE(\"Water\",\"!B105\"))=0,\"\",INDIRECT(CONCATENATE(\"Water\",\"!B105\")))","v":"DHS06"}]
[null,null,{"$f":"IF(INDIRECT(CONCATENATE(\"Water\",\"!B106\"))=0,\"\",INDIRECT(CONCATENATE(\"Water\",\"!B106\")))","v":"DHS12"}]
[null,null,{"$f":"IF(INDIRECT(CONCATENATE(\"Water\",\"!B107\"))=0,\"\",INDIRECT(CONCATENATE(\"Water\",\"!B107\")))","v":""}]
[null,null,{"$f":"IF(INDIRECT(CONCATENATE(\"Water\",\"!B108\"))=0,\"\",INDIRECT(CONCATENATE(\"Water\",\"!B108\")))","v":""}]
[null,null,{"$f":"IF(INDIRECT(CONCATENATE(\"Water\",\"!B109\"))=0,\"\",INDIRECT(CONCATENATE(\"Water\",\"!B109\")))","v":""}]
[null,null,{"$f":"IF(INDIRECT(CONCATENATE(\"Water\",\"!B110\"))=0,\"\",INDIRECT(CONCATENATE(\"Water\",\"!B110\")))","v":""}]
[null,null,{"$f":"IF(INDIRECT(CONCATENATE(\"Water\",\"!B111\"))=0,\"\",INDIRECT(CONCATENATE(\"Water\",\"!B111\")))","v":""}]
[null,null,{"$f":"IF(INDIRECT(CONCATENATE(\"Water\",\"!B112\"))=0,\"\",INDIRECT(CONCATENATE(\"Water\",\"!B112\")))","v":""}]
[null,null,{"$f":"IF(INDIRECT(CONCATENATE(\"Water\",\"!B113\"))=0,\"\",INDIRECT(CONCATENATE(\"Water\",\"!B113\")))","v":""}]
[null,null,{"$f":"IF(INDIRECT(CONCATENATE(\"Water\",\"!B114\"))=0,\"\",INDIRECT(CONCATENATE(\"Water\",\"!B114\")))","v":""}]
[null,null,{"$f":"IF(INDIRECT(CONCATENATE(\"Water\",\"!B115\"))=0,\"\",INDIRECT(CONCATENATE(\"Water\",\"!B115\")))","v":""}]
[null,null,{"$f":"IF(INDIRECT(CONCATENATE(\"Water\",\"!B116\"))=0,\"\",INDIRECT(CONCATENATE(\"Water\",\"!B116\")))","v":""}]
[]
[]
[]
[]
[]
[]
[]
[]
[]
[]
[]
[]
[]
[]
[]
[]
[]
[]
[]
[]
[]
[]
[null,null,null,null,null,null,null,null,null,null,null,{"$f":"+IF(ISNUMBER(M48), \"\", \"Insufficient data to estimate safely managed sanitation services at national level\")","v":"Insufficient data to estimate safely managed sanitation services at national level"}]

{"sheet":"Water","index":1,"n_rows":318,"n_cols":28,"rows_kept":318,"cut":false,"hidden":false,"merged":[[3,1,3,24],[317,18,317,22],[117,18,117,22],[196,18,196,22],[296,23,296,27],[298,0,299,1],[300,0,301,1],[296,0,297,2],[296,3,296,7],[296,8,296,12],[296,13,296,17],[296,18,296,22],[196,23,196,27],[198,0,199,1],[200,0,201,1],[196,13,196,17],[96,8,96,12],[96,13,96,17],[96,18,96,22],[217,18,217,22],[98,0,99,1],[100,0,101,1],[196,0,197,2],[196,3,196,7],[196,8,196,12],[217,1,217,11],[35,3,36,3],[38,1,39,2],[38,3,39,3],[96,0,97,2],[96,3,96,7],[317,1,317,11],[6,9,6,16],[6,17,6,24],[6,1,6,8],[4,1,4,24],[117,1,117,11],[30,21,30,24],[32,1,33,2],[32,3,33,3],[30,17,30,20],[30,1,31,4],[30,5,30,8],[30,9,30,12],[30,13,30,16],[96,23,96,27],[35,1,36,2]]}
["BGD"]
[]
[]
[null,"Summary of trends in use of drinking water by wealth quintile (%)"]
[null,{"$f":"IF(ISERROR(INDIRECT(CONCATENATE($B105,\"!A2\"))),\"\",INDIRECT(CONCATENATE($B105,\"!A2\")))","v":"Niger"}]
[]
[null,{"$f":"B118","v":"National use of drinking water sources, 2000–2018"},null,null,null,null,null,null,null,{"$f":"B218","v":"Urban use of drinking water sources,  2000–2018"},null,null,null,null,null,null,null,{"$f":"B318","v":"Rural use of drinking water sources, 2000–2018"}]
[]
[]
[]
[]
[]
[]
[]
[]
[]
[]
[]
[]
[]
[]
[]
[]
[]
[]
[]
[]
[]
[]
[]
[null,{"$f":"IF(ISERROR(INDIRECT(CONCATENATE($B105,\"!A2\"))),\"\",INDIRECT(CONCATENATE($B105,\"!A2\")))","v":"Niger"},null,null,null,"Poorest",null,null,null,"Poor",null,null,null,"Middle",null,null,null,"Rich",null,null,null,"Richest"]
[null,null,null,null,null,"Basic","Limited","Unimproved","Surface \n water","Basic","Limited","Unimproved","Surface \nwater","Basic","Limited","Unimproved","Surface \nwater","Basic","Limited","Unimproved","Surface \nwater","Basic","Limited","Unimproved","Surface \nwater"]
[null,"NATIONAL",null,"Estimate",{"$f":"C99","v":2000},{"$f":"E99","v":27.821997047722615},{"$f":"F99","v":13.890142454110389},56.921611751703097,1.3662487464638957,{"$f":"J99","v":23.444627196324383},{"$f":"K99","v":13.016690371831736},62.304312779010381,1.2343696528335002,{"$f":"O99","v":26.417212413249398},{"$f":"P99","v":14.224652837903523},57.717910804635693,1.6402239442113853,{"$f":"T99","v":27.425836107003583},{"$f":"U99","v":11.698038510690546},57.665539407817619,3.2105859744882537,{"$f":"Y99","v":69.253623688156665},{"$f":"Z99","v":12.413385378065819},18.269825672404068,6.3165261373455905E-2]
[null,null,null,null,{"$f":"C100","v":2018},{"$f":"E100","v":45.07599050430813},22.504205154324744,31.444484592512694,0.97531974885443162,{"$f":"J100","v":44.456234326309684},24.682543786147061,29.419425391045621,1.4417964964976306,{"$f":"O100","v":43.184039537631364},23.252944366416887,32.533150742602572,1.0298653533491802,{"$f":"T100","v":46.984063784090587},20.04027827595305,32.43614824369547,0.53950969626089318,{"$f":"Y100","v":73.052794812596375},13.094368881503126,12.572435542292169,1.280400763608327]
[]
[null,"URBAN",null,"Estimate",{"$f":"C199","v":2000},{"$f":"E199","v":65.174778386834575},{"$f":"F199","v":16.497876233258879},18.327345379906546,0,{"$f":"J199","v":74.536687165748575},{"$f":"K199","v":14.197464222047348},11.265848612204081,0,{"$f":"O199","v":88.055071573610007},{"$f":"P199","v":8.8151941839367485},3.1297342424532388,0,{"$f":"T199","v":88.302200783940293},{"$f":"U199","v":6.4426498426050829},5.2551493734546284,0,{"$f":"Y199","v":94.301282462480756},{"$f":"Z199","v":2.417981601602071},3.2807359359171784,0]
[null,null,null,null,{"$f":"C200","v":2018},{"$f":"E200","v":75.915735153135032},19.216765038763508,4.6315058693618596,0.23599393873959684,{"$f":"J200","v":83.745956758037195},15.951610811054701,0,0.30243243090810845,{"$f":"O200","v":90.750715300011365},9.0850551070418355,0.16422959294679629,0,{"$f":"T200","v":93.2},6.799999999999998,0,0,{"$f":"Y200","v":96.893350283446566},2.4844448790627327,0.62220483749069899,0]
[]
[null,"RURAL",null,"Estimate",{"$f":"C299","v":2000},{"$f":"E299","v":24.281265747780097},{"$f":"F299","v":12.620353929697258},61.55398341649348,1.5443969060291636,{"$f":"J299","v":22.540979883461592},{"$f":"K299","v":13.640368244085106},63.030481683694205,0.78817018875909639,{"$f":"O299","v":26.428008819008888},{"$f":"P299","v":13.797270966392766},58.056141763774193,1.7185784508241539,{"$f":"T299","v":24.426453493026457},{"$f":"U299","v":12.695816253214362},60.437867492199985,2.4398627615591977,{"$f":"Y299","v":26.787660981936366},{"$f":"Z299","v":12.663975221209972},57.865587335673638,2.6827764611800262]
[null,null,null,null,{"$f":"C300","v":2018},{"$f":"E300","v":43.792705376386657},22.761558113562675,32.512116647339624,0.93361986271104058,{"$f":"J300","v":42.511711866322628},25.725385832429588,29.994223748808537,1.7686785524392405,{"$f":"O300","v":43.702964709507789},22.816007451082452,32.291650620675355,1.1893772187344069,{"$f":"T300","v":41.858543226122713},21.756264108410289,35.573530857434207,0.81166180803279531,{"$f":"Y300","v":44.751191214625706},21.15630689233409,32.681296550246032,1.411205342794176]
[]
[]
[]
[]
[]
[]
[]
[]
[]
[]
[]
[]
[]
[]
[]
[]
[]
[]
[]
[]
[]
[]
[]
[]
[]
[]
[]
[]
[]
[]
[]
[]
[]
[]
[]
[]
[]
[]
[]
[]
[]
[]
[]
[]
[]
[]
[]
[]
[]
[]
[]
[]
[]
[]
[]
[]
["NATIONAL",null,null,"Poorest",null,null,null,null,"Poor",null,null,null,null,"Middle",null,null,null,null,"Rich",null,null,null,null,"Richest"]
[null,null,null,"Improved","Basic","Limited","Unimproved","Surface water","Improved","Basic","Limited","Unimproved","Surface water","Improved","Basic","Limited","Unimproved","Surface water","Improved","Basic","Limited","Unimproved","Surface water","Improved","Basic","Limited","Unimproved","Surface water"]
["Forecast period:",null,{"$f":"MinBase(C105:C116)","v":2000},{"$f":"IF((D101+H101)>100,D101*100/(D101+H101),D101)","v":41.712139501833008},{"$f":"D99*AVERAGEIF(E105:E116,\">0\")/100","v":27.821997047722615},{"$f":"D99*(100-AVERAGEIF(E105:E116,\">0\"))/100","v":13.890142454110389},{"$f":"100-(E99+F99+H99)","v":56.921611751703097},{"$f":"IF((D101+H101)>100,H101*100/(D101+H101),H101)","v":1.3662487464638957},{"$f":"IF((I101+M101)>100,I101*100/(I101+M101),I101)","v":36.461317568156119},{"$f":"I99*AVERAGEIF(J105:J116,\">0\")/100","v":23.444627196324383},{"$f":"I99*(100-AVERAGEIF(J105:J116,\">0\"))/100","v":13.016690371831736},{"$f":"100-(J99+K99+M99)","v":62.304312779010381},{"$f":"IF((I101+M101)>100,M101*100/(I101+M101),M101)","v":1.2343696528335002},{"$f":"IF((N101+R101)>100,N101*100/(N101+R101),N101)","v":40.641865251152922},{"$f":"N99*AVERAGEIF(O105:O116,\">0\")/100","v":26.417212413249398},{"$f":"N99*(100-AVERAGEIF(O105:O116,\">0\"))/100","v":14.224652837903523},{"$f":"100-(O99+P99+R99)","v":57.717910804635693},{"$f":"IF((N101+R101)>100,R101*100/(N101+R101),R101)","v":1.6402239442113853},{"$f":"IF((S101+W101)>100,S101*100/(S101+W101),S101)","v":39.123874617694128},{"$f":"S99*AVERAGEIF(T105:T116,\">0\")/100","v":27.425836107003583},{"$f":"S99*(100-AVERAGEIF(T105:T116,\">0\"))/100","v":11.698038510690546},{"$f":"100-(T99+U99+W99)","v":57.665539407817619},{"$f":"IF((S101+W101)>100,W101*100/(S101+W101),W101)","v":3.2105859744882537},{"$f":"IF((X101+AB101)>100,X101*100/(X101+AB101),X101)","v":81.667009066222477},{"$f":"X99*AVERAGEIF(Y105:Y116,\">0\")/100","v":69.253623688156665},{"$f":"X99*(100-AVERAGEIF(Y105:Y116,\">0\"))/100","v":12.413385378065819},{"$f":"100-(Y99+Z99+AB99)","v":18.269825672404068},{"$f":"IF((X101+AB101)>100,AB101*100/(X101+AB101),AB101)","v":6.3165261373455905E-2}]
[null,null,{"$f":"MaxTarget(C105:C116)","v":2018},{"$f":"IF((D102+H102)>100,D102*100/(D102+H102),D102)","v":67.580195658632874},{"$f":"D100*AVERAGEIF(E105:E116,\">0\")/100","v":45.07599050430813},{"$f":"D100*(100-AVERAGEIF(E105:E116,\">0\"))/100","v":22.504205154324744},{"$f":"100-(E100+F100+H100)","v":31.444484592512694},{"$f":"IF((D102+H102)>100,H102*100/(D102+H102),H102)","v":0.97531974885443162},{"$f":"IF((I102+M102)>100,I102*100/(I102+M102),I102)","v":69.138778112456748},{"$f":"I100*AVERAGEIF(J105:J116,\">0\")/100","v":44.456234326309684},{"$f":"I100*(100-AVERAGEIF(J105:J116,\">0\"))/100","v":24.682543786147061},{"$f":"100-(J100+K100+M100)","v":29.419425391045621},{"$f":"IF((I102+M102)>100,M102*100/(I102+M102),M102)","v":1.4417964964976306},{"$f":"IF((N102+R102)>100,N102*100/(N102+R102),N102)","v":66.436983904048247},{"$f":"N100*AVERAGEIF(O105:O116,\">0\")/100","v":43.184039537631364},{"$f":"N100*(100-AVERAGEIF(O105:O116,\">0\"))/100","v":23.252944366416887},{"$f":"100-(O100+P100+R100)","v":32.533150742602572},{"$f":"IF((N102+R102)>100,R102*100/(N102+R102),R102)","v":1.0298653533491802},{"$f":"IF((S102+W102)>100,S102*100/(S102+W102),S102)","v":67.024342060043637},{"$f":"S100*AVERAGEIF(T105:T116,\">0\")/100","v":46.984063784090587},{"$f":"S100*(100-AVERAGEIF(T105:T116,\">0\"))/100","v":20.04027827595305},{"$f":"100-(T100+U100+W100)","v":32.43614824369547},{"$f":"IF((S102+W102)>100,W102*100/(S102+W102),W102)","v":0.53950969626089318},{"$f":"IF((X102+AB102)>100,X102*100/(X102+AB102),X102)","v":86.147163694099504},{"$f":"X100*AVERAGEIF(Y105:Y116,\">0\")/100","v":73.052794812596375},{"$f":"X100*(100-AVERAGEIF(Y105:Y116,\">0\"))/100","v":13.094368881503126},{"$f":"100-(Y100+Z100+AB100)","v":12.572435542292169},{"$f":"IF((X102+AB102)>100,AB102*100/(X102+AB102),AB102)","v":1.280400763608327}]
["Regression period:",null,{"$f":"MinRegYear(C99,C105:C116)","v":2004},{"$f":"IF(MAX(C105:C116)-MIN(C105:C116)<5,AVERAGEIF(C105:C116,\">0\",D105:D116),\nIF(FORECAST($C101,D$105:D$116,$C$105:$C$116)<0,0,\nIF(FORECAST($C101,D$105:D$116,$C$105:$C$116)>100,100,\nFORECAST($C101,D$105:D$116,$C$105:$C$116))))","v":41.712139501833008},null,null,null,{"$f":"IF(MAX(C105:C116)-MIN(C105:C116)<5,AVERAGEIF(C105:C116,\">0\",H105:H116),\nIF(FORECAST($C101,H$105:H$116,$C$105:$C$116)<0,0,\nIF(FORECAST($C101,H$105:H$116,$C$105:$C$116)>100,100,\nFORECAST($C101,H$105:H$116,$C$105:$C$116))))","v":1.3662487464638957},{"$f":"IF(MAX(C105:C116)-MIN(C105:C116)<5,AVERAGEIF(C105:C116,\">0\",I105:I116),\nIF(FORECAST($C101,I$105:I$116,$C$105:$C$116)<0,0,\nIF(FORECAST($C101,I$105:I$116,$C$105:$C$116)>100,100,\nFORECAST($C101,I$105:I$116,$C$105:$C$116))))","v":36.461317568156119},null,null,null,{"$f":"IF(MAX(C105:C116)-MIN(C105:C116)<5,AVERAGEIF(C105:C116,\">0\",M105:M116),\nIF(FORECAST($C101,M$105:M$116,$C$105:$C$116)<0,0,\nIF(FORECAST($C101,M$105:M$116,$C$105:$C$116)>100,100,\nFORECAST($C101,M$105:M$116,$C$105:$C$116))))","v":1.2343696528335002},{"$f":"IF(MAX(C105:C116)-MIN(C105:C116)<5,AVERAGEIF(C105:C116,\">0\",N105:N116),\nIF(FORECAST($C101,N$105:N$116,$C$105:$C$116)<0,0,\nIF(FORECAST($C101,N$105:N$116,$C$105:$C$116)>100,100,\nFORECAST($C101,N$105:N$116,$C$105:$C$116))))","v":40.641865251152922},null,null,null,{"$f":"IF(MAX(C105:C116)-MIN(C105:C116)<5,AVERAGEIF(C105:C116,\">0\",R105:R116),\nIF(FORECAST($C101,R$105:R$116,$C$105:$C$116)<0,0,\nIF(FORECAST($C101,R$105:R$116,$C$105:$C$116)>100,100,\nFORECAST($C101,R$105:R$116,$C$105:$C$116))))","v":1.6402239442113853},{"$f":"IF(MAX(C105:C116)-MIN(C105:C116)<5,AVERAGEIF(C105:C116,\">0\",S105:S116),\nIF(FORECAST($C101,S$105:S$116,$C$105:$C$116)<0,0,\nIF(FORECAST($C101,S$105:S$116,$C$105:$C$116)>100,100,\nFORECAST($C101,S$105:S$116,$C$105:$C$116))))","v":39.123874617694128},null,null,null,{"$f":"IF(MAX(C105:C116)-MIN(C105:C116)<5,AVERAGEIF(C105:C116,\">0\",W105:W116),\nIF(FORECAST($C101,W$105:W$116,$C$105:$C$116)<0,0,\nIF(FORECAST($C101,W$105:W$116,$C$105:$C$116)>100,100,\nFORECAST($C101,W$105:W$116,$C$105:$C$116))))","v":3.2105859744882537},{"$f":"IF(MAX(C105:C116)-MIN(C105:C116)<5,AVERAGEIF(C105:C116,\">0\",X105:X116),\nIF(FORECAST($C101,X$105:X$116,$C$105:$C$116)<0,0,\nIF(FORECAST($C101,X$105:X$116,$C$105:$C$116)>100,100,\nFORECAST($C101,X$105:X$116,$C$105:$C$116))))","v":81.667009066222477},null,null,null,{"$f":"IF(MAX(C105:C116)-MIN(C105:C116)<5,AVERAGEIF(C105:C116,\">0\",AB105:AB116),\nIF(FORECAST($C101,AB$105:AB$116,$C$105:$C$116)<0,0,\nIF(FORECAST($C101,AB$105:AB$116,$C$105:$C$116)>100,100,\nFORECAST($C101,AB$105:AB$116,$C$105:$C$116))))","v":6.3165261373455905E-2}]
[null,null,{"$f":"MaxRegYear(C100,C105:C116)","v":2014},{"$f":"IF(MAX(C105:C116)-MIN(C105:C116)<5,AVERAGEIF(C105:C116,\">0\",D105:D116),\nIF(FORECAST($C102,D$105:D$116,$C$105:$C$116)<0,0,\nIF(FORECAST($C102,D$105:D$116,$C$105:$C$116)>100,100,\nFORECAST($C102,D$105:D$116,$C$105:$C$116))))","v":67.580195658632874},null,null,null,{"$f":"IF(MAX(C105:C116)-MIN(C105:C116)<5,AVERAGEIF(C105:C116,\">0\",H105:H116),\nIF(FORECAST($C102,H$105:H$116,$C$105:$C$116)<0,0,\nIF(FORECAST($C102,H$105:H$116,$C$105:$C$116)>100,100,\nFORECAST($C102,H$105:H$116,$C$105:$C$116))))","v":0.97531974885443162},{"$f":"IF(MAX(C105:C116)-MIN(C105:C116)<5,AVERAGEIF(C105:C116,\">0\",I105:I116),\nIF(FORECAST($C102,I$105:I$116,$C$105:$C$116)<0,0,\nIF(FORECAST($C102,I$105:I$116,$C$105:$C$116)>100,100,\nFORECAST($C102,I$105:I$116,$C$105:$C$116))))","v":69.138778112456748},null,null,null,{"$f":"IF(MAX(C105:C116)-MIN(C105:C116)<5,AVERAGEIF(C105:C116,\">0\",M105:M116),\nIF(FORECAST($C102,M$105:M$116,$C$105:$C$116)<0,0,\nIF(FORECAST($C102,M$105:M$116,$C$105:$C$116)>100,100,\nFORECAST($C102,M$105:M$116,$C$105:$C$116))))","v":1.4417964964976306},{"$f":"IF(MAX(C105:C116)-MIN(C105:C116)<5,AVERAGEIF(C105:C116,\">0\",N105:N116),\nIF(FORECAST($C102,N$105:N$116,$C$105:$C$116)<0,0,\nIF(FORECAST($C102,N$105:N$116,$C$105:$C$116)>100,100,\nFORECAST($C102,N$105:N$116,$C$105:$C$116))))","v":66.436983904048247},null,null,null,{"$f":"IF(MAX(C105:C116)-MIN(C105:C116)<5,AVERAGEIF(C105:C116,\">0\",R105:R116),\nIF(FORECAST($C102,R$105:R$116,$C$105:$C$116)<0,0,\nIF(FORECAST($C102,R$105:R$116,$C$105:$C$116)>100,100,\nFORECAST($C102,R$105:R$116,$C$105:$C$116))))","v":1.0298653533491802},{"$f":"IF(MAX(C105:C116)-MIN(C105:C116)<5,AVERAGEIF(C105:C116,\">0\",S105:S116),\nIF(FORECAST($C102,S$105:S$116,$C$105:$C$116)<0,0,\nIF(FORECAST($C102,S$105:S$116,$C$105:$C$116)>100,100,\nFORECAST($C102,S$105:S$116,$C$105:$C$116))))","v":67.024342060043637},null,null,null,{"$f":"IF(MAX(C105:C116)-MIN(C105:C116)<5,AVERAGEIF(C105:C116,\">0\",W105:W116),\nIF(FORECAST($C102,W$105:W$116,$C$105:$C$116)<0,0,\nIF(FORECAST($C102,W$105:W$116,$C$105:$C$116)>100,100,\nFORECAST($C102,W$105:W$116,$C$105:$C$116))))","v":0.53950969626089318},{"$f":"IF(MAX(C105:C116)-MIN(C105:C116)<5,AVERAGEIF(C105:C116,\">0\",X105:X116),\nIF(FORECAST($C102,X$105:X$116,$C$105:$C$116)<0,0,\nIF(FORECAST($C102,X$105:X$116,$C$105:$C$116)>100,100,\nFORECAST($C102,X$105:X$116,$C$105:$C$116))))","v":86.147163694099504},null,null,null,{"$f":"IF(MAX(C105:C116)-MIN(C105:C116)<5,AVERAGEIF(C105:C116,\">0\",AB105:AB116),\nIF(FORECAST($C102,AB$105:AB$116,$C$105:$C$116)<0,0,\nIF(FORECAST($C102,AB$105:AB$116,$C$105:$C$116)>100,100,\nFORECAST($C102,AB$105:AB$116,$C$105:$C$116))))","v":1.280400763608327}]
[]
[null,"Survey","Year","Improved","% Improved\n< = 30min",null,null,"Surface water","Improved","% Improved\n< = 30min",null,null,"Surface water","Improved","% Improved\n< = 30min",null,null,"Surface water","Improved","% Improved\n< = 30min",null,null,"Surface water","Improved","% Improved\n< = 30min",null,null,"Surface water"]
[null,"DHS06",2006,{"$f":"IF(ISERROR(INDIRECT(CONCATENATE($B105,\"!C16\"))),\"\",INDIRECT(CONCATENATE($B105,\"!C16\")))","v":46.885750733193248},{"$f":"IF(ISERROR(INDIRECT(CONCATENATE($B105,\"!C23\"))),\"\",INDIRECT(CONCATENATE($B105,\"!C23\")))","v":"N/A"},null,null,{"$f":"IF(ISERROR(INDIRECT(CONCATENATE($B105,\"!C21\"))),\"\",INDIRECT(CONCATENATE($B105,\"!C21\")))","v":1.2880629469420131},{"$f":"IF(ISERROR(INDIRECT(CONCATENATE($B105,\"!D16\"))),\"\",INDIRECT(CONCATENATE($B105,\"!D16\")))","v":42.996809677016216},{"$f":"IF(ISERROR(INDIRECT(CONCATENATE($B105,\"!D23\"))),\"\",INDIRECT(CONCATENATE($B105,\"!D23\")))","v":"N/A"},null,null,{"$f":"IF(ISERROR(INDIRECT(CONCATENATE($B105,\"!D21\"))),\"\",INDIRECT(CONCATENATE($B105,\"!D21\")))","v":1.2758550215663325},{"$f":"IF(ISERROR(INDIRECT(CONCATENATE($B105,\"!E16\"))),\"\",INDIRECT(CONCATENATE($B105,\"!E16\")))","v":45.80088898173166},{"$f":"IF(ISERROR(INDIRECT(CONCATENATE($B105,\"!E23\"))),\"\",INDIRECT(CONCATENATE($B105,\"!E23\")))","v":"N/A"},null,null,{"$f":"IF(ISERROR(INDIRECT(CONCATENATE($B105,\"!E21\"))),\"\",INDIRECT(CONCATENATE($B105,\"!E21\")))","v":1.518152226038938},{"$f":"IF(ISERROR(INDIRECT(CONCATENATE($B105,\"!F16\"))),\"\",INDIRECT(CONCATENATE($B105,\"!F16\")))","v":44.703968106164368},{"$f":"IF(ISERROR(INDIRECT(CONCATENATE($B105,\"!F23\"))),\"\",INDIRECT(CONCATENATE($B105,\"!F23\")))","v":"N/A"},null,null,{"$f":"IF(ISERROR(INDIRECT(CONCATENATE($B105,\"!F21\"))),\"\",INDIRECT(CONCATENATE($B105,\"!F21\")))","v":2.6763707188428509},{"$f":"IF(ISERROR(INDIRECT(CONCATENATE($B105,\"!G16\"))),\"\",INDIRECT(CONCATENATE($B105,\"!G16\")))","v":82.563039991797908},{"$f":"IF(ISERROR(INDIRECT(CONCATENATE($B105,\"!G23\"))),\"\",INDIRECT(CONCATENATE($B105,\"!G23\")))","v":"N/A"},null,null,{"$f":"IF(ISERROR(INDIRECT(CONCATENATE($B105,\"!G221\"))),\"\",INDIRECT(CONCATENATE($B105,\"!G21\")))","v":0.306612361820435}]
[null,"DHS12",2012,62.406584427273245,66.7,null,null,1.0535055483763287,62.603286003596573,64.3,null,null,1.4003111277648101,61.277960173469005,65,null,null,1.1519370715216213,61.444248571574398,70.099999999999994,null,null,1.0737249519064349,85.251132768524073,84.8,null,null,1.0369536631613658]
[null,null,null,"","",null,null,"","","",null,null,"","","",null,null,"","","",null,null,"","","",null,null,""]
[null,null,null,"","",null,null,"","","",null,null,"","","",null,null,"","","",null,null,"","","",null,null,""]
[null,null,null,"","",null,null,"","","",null,null,"","","",null,null,"","","",null,null,"","","",null,null,""]
[null,null,null,"","",null,null,"","","",null,null,"","","",null,null,"","","",null,null,"","","",null,null,""]
[null,null,null,{"$f":"IF(ISERROR(INDIRECT(CONCATENATE($B111,\"!C16\"))),\"\",INDIRECT(CONCATENATE($B111,\"!C16\")))","v":""},{"$f":"IF(ISERROR(INDIRECT(CONCATENATE($B111,\"!C23\"))),\"\",INDIRECT(CONCATENATE($B111,\"!C23\")))","v":""},null,null,{"$f":"IF(ISERROR(INDIRECT(CONCATENATE($B111,\"!C21\"))),\"\",INDIRECT(CONCATENATE($B111,\"!C21\")))","v":""},{"$f":"IF(ISERROR(INDIRECT(CONCATENATE($B111,\"!D16\"))),\"\",INDIRECT(CONCATENATE($B111,\"!D16\")))","v":""},{"$f":"IF(ISERROR(INDIRECT(CONCATENATE($B111,\"!D23\"))),\"\",INDIRECT(CONCATENATE($B111,\"!D23\")))","v":""},null,null,{"$f":"IF(ISERROR(INDIRECT(CONCATENATE($B111,\"!D21\"))),\"\",INDIRECT(CONCATENATE($B111,\"!D21\")))","v":""},{"$f":"IF(ISERROR(INDIRECT(CONCATENATE($B111,\"!E16\"))),\"\",INDIRECT(CONCATENATE($B111,\"!E16\")))","v":""},{"$f":"IF(ISERROR(INDIRECT(CONCATENATE($B111,\"!E23\"))),\"\",INDIRECT(CONCATENATE($B111,\"!E23\")))","v":""},null,null,{"$f":"IF(ISERROR(INDIRECT(CONCATENATE($B111,\"!E21\"))),\"\",INDIRECT(CONCATENATE($B111,\"!E21\")))","v":""},{"$f":"IF(ISERROR(INDIRECT(CONCATENATE($B111,\"!F16\"))),\"\",INDIRECT(CONCATENATE($B111,\"!F16\")))","v":""},{"$f":"IF(ISERROR(INDIRECT(CONCATENATE($B111,\"!F23\"))),\"\",INDIRECT(CONCATENATE($B111,\"!F23\")))","v":""},null,null,{"$f":"IF(ISERROR(INDIRECT(CONCATENATE($B111,\"!F21\"))),\"\",INDIRECT(CONCATENATE($B111,\"!F21\")))","v":""},{"$f":"IF(ISERROR(INDIRECT(CONCATENATE($B111,\"!G16\"))),\"\",INDIRECT(CONCATENATE($B111,\"!G16\")))","v":""},{"$f":"IF(ISERROR(INDIRECT(CONCATENATE($B111,\"!G23\"))),\"\",INDIRECT(CONCATENATE($B111,\"!G23\")))","v":""},null,null,{"$f":"IF(ISERROR(INDIRECT(CONCATENATE($B111,\"!G221\"))),\"\",INDIRECT(CONCATENATE($B111,\"!G21\")))","v":""}]
[null,null,null,{"$f":"IF(ISERROR(INDIRECT(CONCATENATE($B112,\"!C16\"))),\"\",INDIRECT(CONCATENATE($B112,\"!C16\")))","v":""},{"$f":"IF(ISERROR(INDIRECT(CONCATENATE($B112,\"!C23\"))),\"\",INDIRECT(CONCATENATE($B112,\"!C23\")))","v":""},null,null,{"$f":"IF(ISERROR(INDIRECT(CONCATENATE($B112,\"!C21\"))),\"\",INDIRECT(CONCATENATE($B112,\"!C21\")))","v":""},{"$f":"IF(ISERROR(INDIRECT(CONCATENATE($B112,\"!D16\"))),\"\",INDIRECT(CONCATENATE($B112,\"!D16\")))","v":""},{"$f":"IF(ISERROR(INDIRECT(CONCATENATE($B112,\"!D23\"))),\"\",INDIRECT(CONCATENATE($B112,\"!D23\")))","v":""},null,null,{"$f":"IF(ISERROR(INDIRECT(CONCATENATE($B112,\"!D21\"))),\"\",INDIRECT(CONCATENATE($B112,\"!D21\")))","v":""},{"$f":"IF(ISERROR(INDIRECT(CONCATENATE($B112,\"!E16\"))),\"\",INDIRECT(CONCATENATE($B112,\"!E16\")))","v":""},{"$f":"IF(ISERROR(INDIRECT(CONCATENATE($B112,\"!E23\"))),\"\",INDIRECT(CONCATENATE($B112,\"!E23\")))","v":""},null,null,{"$f":"IF(ISERROR(INDIRECT(CONCATENATE($B112,\"!E21\"))),\"\",INDIRECT(CONCATENATE($B112,\"!E21\")))","v":""},{"$f":"IF(ISERROR(INDIRECT(CONCATENATE($B112,\"!F16\"))),\"\",INDIRECT(CONCATENATE($B112,\"!F16\")))","v":""},{"$f":"IF(ISERROR(INDIRECT(CONCATENATE($B112,\"!F23\"))),\"\",INDIRECT(CONCATENATE($B112,\"!F23\")))","v":""},null,null,{"$f":"IF(ISERROR(INDIRECT(CONCATENATE($B112,\"!F21\"))),\"\",INDIRECT(CONCATENATE($B112,\"!F21\")))","v":""},{"$f":"IF(ISERROR(INDIRECT(CONCATENATE($B112,\"!G16\"))),\"\",INDIRECT(CONCATENATE($B112,\"!G16\")))","v":""},{"$f":"IF(ISERROR(INDIRECT(CONCATENATE($B112,\"!G23\"))),\"\",INDIRECT(CONCATENATE($B112,\"!G23\")))","v":""},null,null,{"$f":"IF(ISERROR(INDIRECT(CONCATENATE($B112,\"!G221\"))),\"\",INDIRECT(CONCATENATE($B112,\"!G21\")))","v":""}]
[null,null,null,"","",null,null,"","","",null,null,"","","",null,null,"","","",null,null,"","","",null,null,""]
[null,null,null,"","",null,null,"","","",null,null,"","","",null,null,"","","",null,null,"","","",null,null,""]
[null,null,null,"","",null,null,"","","",null,null,"","","",null,null,"","","",null,null,"","","",null,null,""]
[null,null,null,"","",null,null,"","","",null,null,"","","",null,null,"","","",null,null,"","","",null,null,""]
[]
[null,{"$f":"CONCATENATE(\"National use of drinking water sources, \",C99,\"–\",C100)","v":"National use of drinking water sources, 2000–2018"},null,null,null,null,null,null,null,null,null,null,null,null,null,null,null,null,"Data points used for regression"]
[]
[]
[]
[]
[]
[]
[]
[]
[]
[]
[]
[]
[]
[]
[]
[]
[]
[]
[]
[]
[]
[]
[]
[]
[]
[]
[]
[]
[]
[]
[]
[]
[]
[]
[null,null,null,null,{"$f":"IF(ISERROR(INDIRECT(CONCATENATE($B153,\"!M18\"))),\"\",INDIRECT(CONCATENATE($B153,\"!M18\")))","v":""},{"$f":"IF(ISERROR(INDIRECT(CONCATENATE($B153,\"!M19\"))),\"\",INDIRECT(CONCATENATE($B153,\"!M19\")))","v":""},{"$f":"IF(ISERROR(INDIRECT(CONCATENATE($B153,\"!M20\"))),\"\",INDIRECT(CONCATENATE($B153,\"!M20\")))","v":""},{"$f":"IF(ISERROR(INDIRECT(CONCATENATE($B153,\"!M21\"))),\"\",INDIRECT(CONCATENATE($B153,\"!M21\")))","v":""},null,{"$f":"IF(ISERROR(INDIRECT(CONCATENATE($B153,\"!N18\"))),\"\",INDIRECT(CONCATENATE($B153,\"!N18\")))","v":""},{"$f":"IF(ISERROR(INDIRECT(CONCATENATE($B153,\"!N19\"))),\"\",INDIRECT(CONCATENATE($B153,\"!N19\")))","v":""},{"$f":"IF(ISERROR(INDIRECT(CONCATENATE($B153,\"!N20\"))),\"\",INDIRECT(CONCATENATE($B153,\"!N20\")))","v":""},{"$f":"IF(ISERROR(INDIRECT(CONCATENATE($B153,\"!N21\"))),\"\",INDIRECT(CONCATENATE($B153,\"!N21\")))","v":""},null,{"$f":"IF(ISERROR(INDIRECT(CONCATENATE($B153,\"!O18\"))),\"\",INDIRECT(CONCATENATE($B153,\"!O18\")))","v":""},{"$f":"IF(ISERROR(INDIRECT(CONCATENATE($B153,\"!O19\"))),\"\",INDIRECT(CONCATENATE($B153,\"!O19\")))","v":""},{"$f":"IF(ISERROR(INDIRECT(CONCATENATE($B153,\"!O20\"))),\"\",INDIRECT(CONCATENATE($B153,\"!O20\")))","v":""},{"$f":"IF(ISERROR(INDIRECT(CONCATENATE($B153,\"!O21\"))),\"\",INDIRECT(CONCATENATE($B153,\"!O21\")))","v":""},null,{"$f":"IF(ISERROR(INDIRECT(CONCATENATE($B153,\"!P18\"))),\"\",INDIRECT(CONCATENATE($B153,\"!P18\")))","v":""},{"$f":"IF(ISERROR(INDIRECT(CONCATENATE($B153,\"!P19\"))),\"\",INDIRECT(CONCATENATE($B153,\"!P19\")))","v":""},{"$f":"IF(ISERROR(INDIRECT(CONCATENATE($B153,\"!P20\"))),\"\",INDIRECT(CONCATENATE($B153,\"!P20\")))","v":""},{"$f":"IF(ISERROR(INDIRECT(CONCATENATE($B153,\"!P21\"))),\"\",INDIRECT(CONCATENATE($B153,\"!P21\")))","v":""},null,{"$f":"IF(ISERROR(INDIRECT(CONCATENATE($B153,\"!Q18\"))),\"\",INDIRECT(CONCATENATE($B153,\"!Q18\")))","v":""},{"$f":"IF(ISERROR(INDIRECT(CONCATENATE($B153,\"!Q19\"))),\"\",INDIRECT(CONCATENATE($B153,\"!Q19\")))","v":""},{"$f":"IF(ISERROR(INDIRECT(CONCATENATE($B153,\"!Q20\"))),\"\",INDIRECT(CONCATENATE($B153,\"!Q20\")))","v":""},{"$f":"IF(ISERROR(INDIRECT(CONCATENATE($B153,\"!Q21\"))),\"\",INDIRECT(CONCATENATE($B153,\"!Q1\")))","v":""}]
[null,null,null,null,"","","","",null,"","","","",null,"","","","",null,"","","","",null,"","","",""]
[null,null,null,null,"","","","",null,"","","","",null,"","","","",null,"","","","",null,"","","",""]
[null,null,null,null,"","","","",null,"","","","",null,"","","","",null,"","","","",null,"","","",""]
[null,null,null,null,"","","","",null,"","","","",null,"","","","",null,"","","","",null,"","","",""]
[null,null,null,null,"","","","",null,"","","","",null,"","","","",null,"","","","",null,"","","",""]
[]
[]
[]
[]
[]
[]
[]
[]
[]
[]
[]
[]
[]
[]
[]
[]
[]
[]
[]
[]
[]
[]
[]
[]
[]
[]
[]
[]
[]
[]
[]
[]
[]
[]
[]
[]
[]
[]
["URBAN",null,null,"Poorest",null,null,null,null,"Poor",null,null,null,null,"Middle",null,null,null,null,"Rich",null,null,null,null,"Richest"]
[null,null,null,"Improved","Basic","Limited","Unimproved","Surface water","Improved","Basic","Limited","Unimproved","Surface water","Improved","Basic","Limited","Unimproved","Surface water","Improved","Basic","Limited","Unimproved","Surface water","Improved","Basic","Limited","Unimproved","Surface water"]
["Forecast period:",null,{"$f":"MinBase(C205:C216)","v":2000},{"$f":"IF((D201+H201)>100,D201*100/(D201+H201),D201)","v":81.672654620093454},{"$f":"D199*AVERAGEIF(E205:E216,\">0\")/100","v":65.174778386834575},{"$f":"D199*(100-AVERAGEIF(E205:E216,\">0\"))/100","v":16.497876233258879},{"$f":"100-(E199+F199+H199)","v":18.327345379906546},{"$f":"IF((D201+H201)>100,H201*100/(D201+H201),H201)","v":0},{"$f":"IF((I201+M201)>100,I201*100/(I201+M201),I201)","v":88.734151387795919},{"$f":"I199*AVERAGEIF(J205:J216,\">0\")/100","v":74.536687165748575},{"$f":"I199*(100-AVERAGEIF(J205:J216,\">0\"))/100","v":14.197464222047348},{"$f":"100-(J199+K199+M199)","v":11.265848612204081},{"$f":"IF((I201+M201)>100,M201*100/(I201+M201),M201)","v":0},{"$f":"IF((N201+R201)>100,N201*100/(N201+R201),N201)","v":96.870265757546747},{"$f":"N199*AVERAGEIF(O205:O216,\">0\")/100","v":88.055071573610007},{"$f":"N199*(100-AVERAGEIF(O205:O216,\">0\"))/100","v":8.8151941839367485},{"$f":"100-(O199+P199+R199)","v":3.1297342424532388},{"$f":"IF((N201+R201)>100,R201*100/(N201+R201),R201)","v":0},{"$f":"IF((S201+W201)>100,S201*100/(S201+W201),S201)","v":94.744850626545372},{"$f":"S199*AVERAGEIF(T205:T216,\">0\")/100","v":88.302200783940293},{"$f":"S199*(100-AVERAGEIF(T205:T216,\">0\"))/100","v":6.4426498426050829},{"$f":"100-(T199+U199+W199)","v":5.2551493734546284},{"$f":"IF((S201+W201)>100,W201*100/(S201+W201),W201)","v":0},{"$f":"IF((X201+AB201)>100,X201*100/(X201+AB201),X201)","v":96.719264064082836},{"$f":"X199*AVERAGEIF(Y205:Y216,\">0\")/100","v":94.301282462480756},{"$f":"X199*(100-AVERAGEIF(Y205:Y216,\">0\"))/100","v":2.417981601602071},{"$f":"100-(Y199+Z199+AB199)","v":3.2807359359171784},{"$f":"IF((X201+AB201)>100,AB201*100/(X201+AB201),AB201)","v":0}]
[null,null,{"$f":"MaxTarget(C205:C216)","v":2018},{"$f":"IF((D202+H202)>100,D202*100/(D202+H202),D202)","v":95.132500191898544},{"$f":"D200*AVERAGEIF(E205:E216,\">0\")/100","v":75.915735153135032},{"$f":"D200*(100-AVERAGEIF(E205:E216,\">0\"))/100","v":19.216765038763508},{"$f":"100-(E200+F200+H200)","v":4.6315058693618596},{"$f":"IF((D202+H202)>100,H202*100/(D202+H202),H202)","v":0.23599393873959684},{"$f":"IF((I202+M202)>100,I202*100/(I202+M202),I202)","v":99.697567569091888},{"$f":"I200*AVERAGEIF(J205:J216,\">0\")/100","v":83.745956758037195},{"$f":"I200*(100-AVERAGEIF(J205:J216,\">0\"))/100","v":15.951610811054701},{"$f":"100-(J200+K200+M200)","v":0},{"$f":"IF((I202+M202)>100,M202*100/(I202+M202),M202)","v":0.30243243090810845},{"$f":"IF((N202+R202)>100,N202*100/(N202+R202),N202)","v":99.83577040705319},{"$f":"N200*AVERAGEIF(O205:O216,\">0\")/100","v":90.750715300011365},{"$f":"N200*(100-AVERAGEIF(O205:O216,\">0\"))/100","v":9.0850551070418355},{"$f":"100-(O200+P200+R200)","v":0.16422959294679629},{"$f":"IF((N202+R202)>100,R202*100/(N202+R202),R202)","v":0},{"$f":"IF((S202+W202)>100,S202*100/(S202+W202),S202)","v":100},{"$f":"S200*AVERAGEIF(T205:T216,\">0\")/100","v":93.2},{"$f":"S200*(100-AVERAGEIF(T205:T216,\">0\"))/100","v":6.799999999999998},{"$f":"100-(T200+U200+W200)","v":0},{"$f":"IF((S202+W202)>100,W202*100/(S202+W202),W202)","v":0},{"$f":"IF((X202+AB202)>100,X202*100/(X202+AB202),X202)","v":99.377795162509301},{"$f":"X200*AVERAGEIF(Y205:Y216,\">0\")/100","v":96.893350283446566},{"$f":"X200*(100-AVERAGEIF(Y205:Y216,\">0\"))/100","v":2.4844448790627327},{"$f":"100-(Y200+Z200+AB200)","v":0.62220483749069899},{"$f":"IF((X202+AB202)>100,AB202*100/(X202+AB202),AB202)","v":0}]
["Regression period:",null,{"$f":"MinRegYear(C199,C205:C216)","v":2004},{"$f":"IF(MAX(C205:C216)-MIN(C205:C216)<5,AVERAGEIF(C205:C216,\">0\",D205:D216),\nIF(FORECAST($C201,D$205:D$216,$C$205:$C$216)<0,0,\nIF(FORECAST($C201,D$205:D$216,$C$205:$C$216)>100,100,\nFORECAST($C201,D$205:D$216,$C$205:$C$216))))","v":81.672654620093454},null,null,null,{"$f":"IF(MAX(C205:C216)-MIN(C205:C216)<5,AVERAGEIF(C205:C216,\">0\",H205:H216),\nIF(FORECAST($C201,H$205:H$216,$C$205:$C$216)<0,0,\nIF(FORECAST($C201,H$205:H$216,$C$205:$C$216)>100,100,\nFORECAST($C201,H$205:H$216,$C$205:$C$216))))","v":0},{"$f":"IF(MAX(C205:C216)-MIN(C205:C216)<5,AVERAGEIF(C205:C216,\">0\",I205:I216),\nIF(FORECAST($C201,I$205:I$216,$C$205:$C$216)<0,0,\nIF(FORECAST($C201,I$205:I$216,$C$205:$C$216)>100,100,\nFORECAST($C201,I$205:I$216,$C$205:$C$216))))","v":88.734151387795919},null,null,null,{"$f":"IF(MAX(C205:C216)-MIN(C205:C216)<5,AVERAGEIF(C205:C216,\">0\",M205:M216),\nIF(FORECAST($C201,M$205:M$216,$C$205:$C$216)<0,0,\nIF(FORECAST($C201,M$205:M$216,$C$205:$C$216)>100,100,\nFORECAST($C201,M$205:M$216,$C$205:$C$216))))","v":0},{"$f":"IF(MAX(C205:C216)-MIN(C205:C216)<5,AVERAGEIF(C205:C216,\">0\",N205:N216),\nIF(FORECAST($C201,N$205:N$216,$C$205:$C$216)<0,0,\nIF(FORECAST($C201,N$205:N$216,$C$205:$C$216)>100,100,\nFORECAST($C201,N$205:N$216,$C$205:$C$216))))","v":96.870265757546747},null,null,null,{"$f":"IF(MAX(C205:C216)-MIN(C205:C216)<5,AVERAGEIF(C205:C216,\">0\",R205:R216),\nIF(FORECAST($C201,R$205:R$216,$C$205:$C$216)<0,0,\nIF(FORECAST($C201,R$205:R$216,$C$205:$C$216)>100,100,\nFORECAST($C201,R$205:R$216,$C$205:$C$216))))","v":0},{"$f":"IF(MAX(C205:C216)-MIN(C205:C216)<5,AVERAGEIF(C205:C216,\">0\",S205:S216),\nIF(FORECAST($C201,S$205:S$216,$C$205:$C$216)<0,0,\nIF(FORECAST($C201,S$205:S$216,$C$205:$C$216)>100,100,\nFORECAST($C201,S$205:S$216,$C$205:$C$216))))","v":94.744850626545372},null,null,null,{"$f":"IF(MAX(C205:C216)-MIN(C205:C216)<5,AVERAGEIF(C205:C216,\">0\",W205:W216),\nIF(FORECAST($C201,W$205:W$216,$C$205:$C$216)<0,0,\nIF(FORECAST($C201,W$205:W$216,$C$205:$C$216)>100,100,\nFORECAST($C201,W$205:W$216,$C$205:$C$216))))","v":0},{"$f":"IF(MAX(C205:C216)-MIN(C205:C216)<5,AVERAGEIF(C205:C216,\">0\",X205:X216),\nIF(FORECAST($C201,X$205:X$216,$C$205:$C$216)<0,0,\nIF(FORECAST($C201,X$205:X$216,$C$205:$C$216)>100,100,\nFORECAST($C201,X$205:X$216,$C$205:$C$216))))","v":96.719264064082836},null,null,null,{"$f":"IF(MAX(C205:C216)-MIN(C205:C216)<5,AVERAGEIF(C205:C216,\">0\",AB205:AB216),\nIF(FORECAST($C201,AB$205:AB$216,$C$205:$C$216)<0,0,\nIF(FORECAST($C201,AB$205:AB$216,$C$205:$C$216)>100,100,\nFORECAST($C201,AB$205:AB$216,$C$205:$C$216))))","v":0}]
[null,null,{"$f":"MaxRegYear(C200,C205:C216)","v":2014},{"$f":"IF(MAX(C205:C216)-MIN(C205:C216)<5,AVERAGEIF(C205:C216,\">0\",D205:D216),\nIF(FORECAST($C202,D$205:D$216,$C$205:$C$216)<0,0,\nIF(FORECAST($C202,D$205:D$216,$C$205:$C$216)>100,100,\nFORECAST($C202,D$205:D$216,$C$205:$C$216))))","v":95.132500191898544},null,null,null,{"$f":"IF(MAX(C205:C216)-MIN(C205:C216)<5,AVERAGEIF(C205:C216,\">0\",H205:H216),\nIF(FORECAST($C202,H$205:H$216,$C$205:$C$216)<0,0,\nIF(FORECAST($C202,H$205:H$216,$C$205:$C$216)>100,100,\nFORECAST($C202,H$205:H$216,$C$205:$C$216))))","v":0.23599393873959684},{"$f":"IF(MAX(C205:C216)-MIN(C205:C216)<5,AVERAGEIF(C205:C216,\">0\",I205:I216),\nIF(FORECAST($C202,I$205:I$216,$C$205:$C$216)<0,0,\nIF(FORECAST($C202,I$205:I$216,$C$205:$C$216)>100,100,\nFORECAST($C202,I$205:I$216,$C$205:$C$216))))","v":100},null,null,null,{"$f":"IF(MAX(C205:C216)-MIN(C205:C216)<5,AVERAGEIF(C205:C216,\">0\",M205:M216),\nIF(FORECAST($C202,M$205:M$216,$C$205:$C$216)<0,0,\nIF(FORECAST($C202,M$205:M$216,$C$205:$C$216)>100,100,\nFORECAST($C202,M$205:M$216,$C$205:$C$216))))","v":0.30334985926162972},{"$f":"IF(MAX(C205:C216)-MIN(C205:C216)<5,AVERAGEIF(C205:C216,\">0\",N205:N216),\nIF(FORECAST($C202,N$205:N$216,$C$205:$C$216)<0,0,\nIF(FORECAST($C202,N$205:N$216,$C$205:$C$216)>100,100,\nFORECAST($C202,N$205:N$216,$C$205:$C$216))))","v":99.83577040705319},null,null,null,{"$f":"IF(MAX(C205:C216)-MIN(C205:C216)<5,AVERAGEIF(C205:C216,\">0\",R205:R216),\nIF(FORECAST($C202,R$205:R$216,$C$205:$C$216)<0,0,\nIF(FORECAST($C202,R$205:R$216,$C$205:$C$216)>100,100,\nFORECAST($C202,R$205:R$216,$C$205:$C$216))))","v":0},{"$f":"IF(MAX(C205:C216)-MIN(C205:C216)<5,AVERAGEIF(C205:C216,\">0\",S205:S216),\nIF(FORECAST($C202,S$205:S$216,$C$205:$C$216)<0,0,\nIF(FORECAST($C202,S$205:S$216,$C$205:$C$216)>100,100,\nFORECAST($C202,S$205:S$216,$C$205:$C$216))))","v":100},null,null,null,{"$f":"IF(MAX(C205:C216)-MIN(C205:C216)<5,AVERAGEIF(C205:C216,\">0\",W205:W216),\nIF(FORECAST($C202,W$205:W$216,$C$205:$C$216)<0,0,\nIF(FORECAST($C202,W$205:W$216,$C$205:$C$216)>100,100,\nFORECAST($C202,W$205:W$216,$C$205:$C$216))))","v":0},{"$f":"IF(MAX(C205:C216)-MIN(C205:C216)<5,AVERAGEIF(C205:C216,\">0\",X205:X216),\nIF(FORECAST($C202,X$205:X$216,$C$205:$C$216)<0,0,\nIF(FORECAST($C202,X$205:X$216,$C$205:$C$216)>100,100,\nFORECAST($C202,X$205:X$216,$C$205:$C$216))))","v":99.377795162509301},null,null,null,{"$f":"IF(MAX(C205:C216)-MIN(C205:C216)<5,AVERAGEIF(C205:C216,\">0\",AB205:AB216),\nIF(FORECAST($C202,AB$205:AB$216,$C$205:$C$216)<0,0,\nIF(FORECAST($C202,AB$205:AB$216,$C$205:$C$216)>100,100,\nFORECAST($C202,AB$205:AB$216,$C$205:$C$216))))","v":0}]
[]
[null,"Survey","Year","Improved","% Improved\n< = 30min",null,null,"Surface water","Improved","% Improved\n< = 30min",null,null,"Surface water","Improved","% Improved\n< = 30min",null,null,"Surface water","Improved","% Improved\n< = 30min",null,null,"Surface water","Improved","% Improved\n< = 30min",null,null,"Surface water"]
[null,"DHS06",2006,{"$f":"IF(ISERROR(INDIRECT(CONCATENATE($B205,\"!H16\"))),\"\",INDIRECT(CONCATENATE($B205,\"!H16\")))","v":84.364623734454597},{"$f":"IF(ISERROR(INDIRECT(CONCATENATE($B205,\"!H23\"))),\"\",INDIRECT(CONCATENATE($B205,\"!H23\")))","v":"N/A"},null,null,{"$f":"IF(ISERROR(INDIRECT(CONCATENATE($B205,\"!H21\"))),\"\",INDIRECT(CONCATENATE($B205,\"!H21\")))","v":4.0279141495893608E-2},{"$f":"IF(ISERROR(INDIRECT(CONCATENATE($B205,\"!I16\"))),\"\",INDIRECT(CONCATENATE($B205,\"!I16\")))","v":91.078429625841721},{"$f":"IF(ISERROR(INDIRECT(CONCATENATE($B205,\"!I23\"))),\"\",INDIRECT(CONCATENATE($B205,\"!I23\")))","v":"N/A"},null,null,{"$f":"IF(ISERROR(INDIRECT(CONCATENATE($B205,\"!I21\"))),\"\",INDIRECT(CONCATENATE($B205,\"!I21\")))","v":6.0215033146006409E-2},{"$f":"IF(ISERROR(INDIRECT(CONCATENATE($B205,\"!J16\"))),\"\",INDIRECT(CONCATENATE($B205,\"!J16\")))","v":97.463366687447987},{"$f":"IF(ISERROR(INDIRECT(CONCATENATE($B205,\"!J23\"))),\"\",INDIRECT(CONCATENATE($B205,\"!J23\")))","v":"N/A"},null,null,{"$f":"IF(ISERROR(INDIRECT(CONCATENATE($B205,\"!J21\"))),\"\",INDIRECT(CONCATENATE($B205,\"!J21\")))","v":0},{"$f":"IF(ISERROR(INDIRECT(CONCATENATE($B205,\"!K16\"))),\"\",INDIRECT(CONCATENATE($B205,\"!K16\")))","v":95.843336924097372},{"$f":"IF(ISERROR(INDIRECT(CONCATENATE($B205,\"!K23\"))),\"\",INDIRECT(CONCATENATE($B205,\"!K23\")))","v":"N/A"},null,null,{"$f":"IF(ISERROR(INDIRECT(CONCATENATE($B205,\"!K21\"))),\"\",INDIRECT(CONCATENATE($B205,\"!K21\")))","v":0},{"$f":"IF(ISERROR(INDIRECT(CONCATENATE($B205,\"!L16\"))),\"\",INDIRECT(CONCATENATE($B205,\"!L16\")))","v":97.250970283768112},{"$f":"IF(ISERROR(INDIRECT(CONCATENATE($B205,\"!L23\"))),\"\",INDIRECT(CONCATENATE($B205,\"!L23\")))","v":"N/A"},null,null,{"$f":"IF(ISERROR(INDIRECT(CONCATENATE($B205,\"!L221\"))),\"\",INDIRECT(CONCATENATE($B205,\"!L21\")))","v":0}]
[null,"DHS12",2012,92.440531077537486,79.8,null,null,0.18706523942867234,98.111264339979613,84,null,null,0.24256615273272794,99.24266947715185,90.9,null,null,0,99.138795816753188,93.2,null,null,0,98.846088942824011,97.5,null,null,0]
[null,null,null,"","",null,null,"","","",null,null,"","","",null,null,"","","",null,null,"","","",null,null,""]
[null,null,null,"","",null,null,"","","",null,null,"","","",null,null,"","","",null,null,"","","",null,null,""]
[null,null,null,"","",null,null,"","","",null,null,"","","",null,null,"","","",null,null,"","","",null,null,""]
[null,null,null,"","",null,null,"","","",null,null,"","","",null,null,"","","",null,null,"","","",null,null,""]
[null,null,null,"","",null,null,"","","",null,null,"","","",null,null,"","","",null,null,"","","",null,null,""]
[null,null,null,"","",null,null,"","","",null,null,"","","",null,null,"","","",null,null,"","","",null,null,""]
[null,null,null,"","",null,null,"","","",null,null,"","","",null,null,"","","",null,null,"","","",null,null,""]
[null,null,null,"","",null,null,"","","",null,null,"","","",null,null,"","","",null,null,"","","",null,null,""]
[null,null,null,"","",null,null,"","","",null,null,"","","",null,null,"","","",null,null,"","","",null,null,""]
[null,null,null,"","",null,null,"","","",null,null,"","","",null,null,"","","",null,null,"","","",null,null,""]
[]
[null,{"$f":"CONCATENATE(\"Urban use of drinking water sources,  \",C199,\"–\",C200)","v":"Urban use of drinking water sources,  2000–2018"},null,null,null,null,null,null,null,null,null,null,null,null,null,null,null,null,"Data points used for regression"]
[]
[]
[]
[]
[]
[]
[]
[]
[]
[]
[]
[]
[]
[]
[]
[]
[]
[]
[]
[]
[]
[]
[]
[]
[]
[]
[]
[]
[]
[]
[]
[]
[]
[]
[null,null,null,null,{"$f":"IF(ISERROR(INDIRECT(CONCATENATE($B253,\"!M18\"))),\"\",INDIRECT(CONCATENATE($B253,\"!M18\")))","v":""},{"$f":"IF(ISERROR(INDIRECT(CONCATENATE($B253,\"!M19\"))),\"\",INDIRECT(CONCATENATE($B253,\"!M19\")))","v":""},{"$f":"IF(ISERROR(INDIRECT(CONCATENATE($B253,\"!M20\"))),\"\",INDIRECT(CONCATENATE($B253,\"!M20\")))","v":""},{"$f":"IF(ISERROR(INDIRECT(CONCATENATE($B253,\"!M21\"))),\"\",INDIRECT(CONCATENATE($B253,\"!M21\")))","v":""},null,{"$f":"IF(ISERROR(INDIRECT(CONCATENATE($B253,\"!N18\"))),\"\",INDIRECT(CONCATENATE($B253,\"!N18\")))","v":""},{"$f":"IF(ISERROR(INDIRECT(CONCATENATE($B253,\"!N19\"))),\"\",INDIRECT(CONCATENATE($B253,\"!N19\")))","v":""},{"$f":"IF(ISERROR(INDIRECT(CONCATENATE($B253,\"!N20\"))),\"\",INDIRECT(CONCATENATE($B253,\"!N20\")))","v":""},{"$f":"IF(ISERROR(INDIRECT(CONCATENATE($B253,\"!N21\"))),\"\",INDIRECT(CONCATENATE($B253,\"!N21\")))","v":""},null,{"$f":"IF(ISERROR(INDIRECT(CONCATENATE($B253,\"!O18\"))),\"\",INDIRECT(CONCATENATE($B253,\"!O18\")))","v":""},{"$f":"IF(ISERROR(INDIRECT(CONCATENATE($B253,\"!O19\"))),\"\",INDIRECT(CONCATENATE($B253,\"!O19\")))","v":""},{"$f":"IF(ISERROR(INDIRECT(CONCATENATE($B253,\"!O20\"))),\"\",INDIRECT(CONCATENATE($B253,\"!O20\")))","v":""},{"$f":"IF(ISERROR(INDIRECT(CONCATENATE($B253,\"!O21\"))),\"\",INDIRECT(CONCATENATE($B253,\"!O21\")))","v":""},null,{"$f":"IF(ISERROR(INDIRECT(CONCATENATE($B253,\"!P18\"))),\"\",INDIRECT(CONCATENATE($B253,\"!P18\")))","v":""},{"$f":"IF(ISERROR(INDIRECT(CONCATENATE($B253,\"!P19\"))),\"\",INDIRECT(CONCATENATE($B253,\"!P19\")))","v":""},{"$f":"IF(ISERROR(INDIRECT(CONCATENATE($B253,\"!P20\"))),\"\",INDIRECT(CONCATENATE($B253,\"!P20\")))","v":""},{"$f":"IF(ISERROR(INDIRECT(CONCATENATE($B253,\"!P21\"))),\"\",INDIRECT(CONCATENATE($B253,\"!P21\")))","v":""},null,{"$f":"IF(ISERROR(INDIRECT(CONCATENATE($B253,\"!Q18\"))),\"\",INDIRECT(CONCATENATE($B253,\"!Q18\")))","v":""},{"$f":"IF(ISERROR(INDIRECT(CONCATENATE($B253,\"!Q19\"))),\"\",INDIRECT(CONCATENATE($B253,\"!Q19\")))","v":""},{"$f":"IF(ISERROR(INDIRECT(CONCATENATE($B253,\"!Q20\"))),\"\",INDIRECT(CONCATENATE($B253,\"!Q20\")))","v":""},{"$f":"IF(ISERROR(INDIRECT(CONCATENATE($B253,\"!Q21\"))),\"\",INDIRECT(CONCATENATE($B253,\"!Q1\")))","v":""}]
[null,null,null,null,{"$f":"IF(ISERROR(INDIRECT(CONCATENATE($B254,\"!M18\"))),\"\",INDIRECT(CONCATENATE($B254,\"!M18\")))","v":""},{"$f":"IF(ISERROR(INDIRECT(CONCATENATE($B254,\"!M19\"))),\"\",INDIRECT(CONCATENATE($B254,\"!M19\")))","v":""},{"$f":"IF(ISERROR(INDIRECT(CONCATENATE($B254,\"!M20\"))),\"\",INDIRECT(CONCATENATE($B254,\"!M20\")))","v":""},{"$f":"IF(ISERROR(INDIRECT(CONCATENATE($B254,\"!M21\"))),\"\",INDIRECT(CONCATENATE($B254,\"!M21\")))","v":""},null,{"$f":"IF(ISERROR(INDIRECT(CONCATENATE($B254,\"!N18\"))),\"\",INDIRECT(CONCATENATE($B254,\"!N18\")))","v":""},{"$f":"IF(ISERROR(INDIRECT(CONCATENATE($B254,\"!N19\"))),\"\",INDIRECT(CONCATENATE($B254,\"!N19\")))","v":""},{"$f":"IF(ISERROR(INDIRECT(CONCATENATE($B254,\"!N20\"))),\"\",INDIRECT(CONCATENATE($B254,\"!N20\")))","v":""},{"$f":"IF(ISERROR(INDIRECT(CONCATENATE($B254,\"!N21\"))),\"\",INDIRECT(CONCATENATE($B254,\"!N21\")))","v":""},null,{"$f":"IF(ISERROR(INDIRECT(CONCATENATE($B254,\"!O18\"))),\"\",INDIRECT(CONCATENATE($B254,\"!O18\")))","v":""},{"$f":"IF(ISERROR(INDIRECT(CONCATENATE($B254,\"!O19\"))),\"\",INDIRECT(CONCATENATE($B254,\"!O19\")))","v":""},{"$f":"IF(ISERROR(INDIRECT(CONCATENATE($B254,\"!O20\"))),\"\",INDIRECT(CONCATENATE($B254,\"!O20\")))","v":""},{"$f":"IF(ISERROR(INDIRECT(CONCATENATE($B254,\"!O21\"))),\"\",INDIRECT(CONCATENATE($B254,\"!O21\")))","v":""},null,{"$f":"IF(ISERROR(INDIRECT(CONCATENATE($B254,\"!P18\"))),\"\",INDIRECT(CONCATENATE($B254,\"!P18\")))","v":""},{"$f":"IF(ISERROR(INDIRECT(CONCATENATE($B254,\"!P19\"))),\"\",INDIRECT(CONCATENATE($B254,\"!P19\")))","v":""},{"$f":"IF(ISERROR(INDIRECT(CONCATENATE($B254,\"!P20\"))),\"\",INDIRECT(CONCATENATE($B254,\"!P20\")))","v":""},{"$f":"IF(ISERROR(INDIRECT(CONCATENATE($B254,\"!P21\"))),\"\",INDIRECT(CONCATENATE($B254,\"!P21\")))","v":""},null,{"$f":"IF(ISERROR(INDIRECT(CONCATENATE($B254,\"!Q18\"))),\"\",INDIRECT(CONCATENATE($B254,\"!Q18\")))","v":""},{"$f":"IF(ISERROR(INDIRECT(CONCATENATE($B254,\"!Q19\"))),\"\",INDIRECT(CONCATENATE($B254,\"!Q19\")))","v":""},{"$f":"IF(ISERROR(INDIRECT(CONCATENATE($B254,\"!Q20\"))),\"\",INDIRECT(CONCATENATE($B254,\"!Q20\")))","v":""},{"$f":"IF(ISERROR(INDIRECT(CONCATENATE($B254,\"!Q21\"))),\"\",INDIRECT(CONCATENATE($B254,\"!Q1\")))","v":""}]
[null,null,null,null,{"$f":"IF(ISERROR(INDIRECT(CONCATENATE($B255,\"!M18\"))),\"\",INDIRECT(CONCATENATE($B255,\"!M18\")))","v":""},{"$f":"IF(ISERROR(INDIRECT(CONCATENATE($B255,\"!M19\"))),\"\",INDIRECT(CONCATENATE($B255,\"!M19\")))","v":""},{"$f":"IF(ISERROR(INDIRECT(CONCATENATE($B255,\"!M20\"))),\"\",INDIRECT(CONCATENATE($B255,\"!M20\")))","v":""},{"$f":"IF(ISERROR(INDIRECT(CONCATENATE($B255,\"!M21\"))),\"\",INDIRECT(CONCATENATE($B255,\"!M21\")))","v":""},null,{"$f":"IF(ISERROR(INDIRECT(CONCATENATE($B255,\"!N18\"))),\"\",INDIRECT(CONCATENATE($B255,\"!N18\")))","v":""},{"$f":"IF(ISERROR(INDIRECT(CONCATENATE($B255,\"!N19\"))),\"\",INDIRECT(CONCATENATE($B255,\"!N19\")))","v":""},{"$f":"IF(ISERROR(INDIRECT(CONCATENATE($B255,\"!N20\"))),\"\",INDIRECT(CONCATENATE($B255,\"!N20\")))","v":""},{"$f":"IF(ISERROR(INDIRECT(CONCATENATE($B255,\"!N21\"))),\"\",INDIRECT(CONCATENATE($B255,\"!N21\")))","v":""},null,{"$f":"IF(ISERROR(INDIRECT(CONCATENATE($B255,\"!O18\"))),\"\",INDIRECT(CONCATENATE($B255,\"!O18\")))","v":""},{"$f":"IF(ISERROR(INDIRECT(CONCATENATE($B255,\"!O19\"))),\"\",INDIRECT(CONCATENATE($B255,\"!O19\")))","v":""},{"$f":"IF(ISERROR(INDIRECT(CONCATENATE($B255,\"!O20\"))),\"\",INDIRECT(CONCATENATE($B255,\"!O20\")))","v":""},{"$f":"IF(ISERROR(INDIRECT(CONCATENATE($B255,\"!O21\"))),\"\",INDIRECT(CONCATENATE($B255,\"!O21\")))","v":""},null,{"$f":"IF(ISERROR(INDIRECT(CONCATENATE($B255,\"!P18\"))),\"\",INDIRECT(CONCATENATE($B255,\"!P18\")))","v":""},{"$f":"IF(ISERROR(INDIRECT(CONCATENATE($B255,\"!P19\"))),\"\",INDIRECT(CONCATENATE($B255,\"!P19\")))","v":""},{"$f":"IF(ISERROR(INDIRECT(CONCATENATE($B255,\"!P20\"))),\"\",INDIRECT(CONCATENATE($B255,\"!P20\")))","v":""},{"$f":"IF(ISERROR(INDIRECT(CONCATENATE($B255,\"!P21\"))),\"\",INDIRECT(CONCATENATE($B255,\"!P21\")))","v":""},null,{"$f":"IF(ISERROR(INDIRECT(CONCATENATE($B255,\"!Q18\"))),\"\",INDIRECT(CONCATENATE($B255,\"!Q18\")))","v":""},{"$f":"IF(ISERROR(INDIRECT(CONCATENATE($B255,\"!Q19\"))),\"\",INDIRECT(CONCATENATE($B255,\"!Q19\")))","v":""},{"$f":"IF(ISERROR(INDIRECT(CONCATENATE($B255,\"!Q20\"))),\"\",INDIRECT(CONCATENATE($B255,\"!Q20\")))","v":""},{"$f":"IF(ISERROR(INDIRECT(CONCATENATE($B255,\"!Q21\"))),\"\",INDIRECT(CONCATENATE($B255,\"!Q1\")))","v":""}]
[null,null,null,null,{"$f":"IF(ISERROR(INDIRECT(CONCATENATE($B256,\"!M18\"))),\"\",INDIRECT(CONCATENATE($B256,\"!M18\")))","v":""},{"$f":"IF(ISERROR(INDIRECT(CONCATENATE($B256,\"!M19\"))),\"\",INDIRECT(CONCATENATE($B256,\"!M19\")))","v":""},{"$f":"IF(ISERROR(INDIRECT(CONCATENATE($B256,\"!M20\"))),\"\",INDIRECT(CONCATENATE($B256,\"!M20\")))","v":""},{"$f":"IF(ISERROR(INDIRECT(CONCATENATE($B256,\"!M21\"))),\"\",INDIRECT(CONCATENATE($B256,\"!M21\")))","v":""},null,{"$f":"IF(ISERROR(INDIRECT(CONCATENATE($B256,\"!N18\"))),\"\",INDIRECT(CONCATENATE($B256,\"!N18\")))","v":""},{"$f":"IF(ISERROR(INDIRECT(CONCATENATE($B256,\"!N19\"))),\"\",INDIRECT(CONCATENATE($B256,\"!N19\")))","v":""},{"$f":"IF(ISERROR(INDIRECT(CONCATENATE($B256,\"!N20\"))),\"\",INDIRECT(CONCATENATE($B256,\"!N20\")))","v":""},{"$f":"IF(ISERROR(INDIRECT(CONCATENATE($B256,\"!N21\"))),\"\",INDIRECT(CONCATENATE($B256,\"!N21\")))","v":""},null,{"$f":"IF(ISERROR(INDIRECT(CONCATENATE($B256,\"!O18\"))),\"\",INDIRECT(CONCATENATE($B256,\"!O18\")))","v":""},{"$f":"IF(ISERROR(INDIRECT(CONCATENATE($B256,\"!O19\"))),\"\",INDIRECT(CONCATENATE($B256,\"!O19\")))","v":""},{"$f":"IF(ISERROR(INDIRECT(CONCATENATE($B256,\"!O20\"))),\"\",INDIRECT(CONCATENATE($B256,\"!O20\")))","v":""},{"$f":"IF(ISERROR(INDIRECT(CONCATENATE($B256,\"!O21\"))),\"\",INDIRECT(CONCATENATE($B256,\"!O21\")))","v":""},null,{"$f":"IF(ISERROR(INDIRECT(CONCATENATE($B256,\"!P18\"))),\"\",INDIRECT(CONCATENATE($B256,\"!P18\")))","v":""},{"$f":"IF(ISERROR(INDIRECT(CONCATENATE($B256,\"!P19\"))),\"\",INDIRECT(CONCATENATE($B256,\"!P19\")))","v":""},{"$f":"IF(ISERROR(INDIRECT(CONCATENATE($B256,\"!P20\"))),\"\",INDIRECT(CONCATENATE($B256,\"!P20\")))","v":""},{"$f":"IF(ISERROR(INDIRECT(CONCATENATE($B256,\"!P21\"))),\"\",INDIRECT(CONCATENATE($B256,\"!P21\")))","v":""},null,{"$f":"IF(ISERROR(INDIRECT(CONCATENATE($B256,\"!Q18\"))),\"\",INDIRECT(CONCATENATE($B256,\"!Q18\")))","v":""},{"$f":"IF(ISERROR(INDIRECT(CONCATENATE($B256,\"!Q19\"))),\"\",INDIRECT(CONCATENATE($B256,\"!Q19\")))","v":""},{"$f":"IF(ISERROR(INDIRECT(CONCATENATE($B256,\"!Q20\"))),\"\",INDIRECT(CONCATENATE($B256,\"!Q20\")))","v":""},{"$f":"IF(ISERROR(INDIRECT(CONCATENATE($B256,\"!Q21\"))),\"\",INDIRECT(CONCATENATE($B256,\"!Q1\")))","v":""}]
[null,null,null,null,{"$f":"IF(ISERROR(INDIRECT(CONCATENATE($B257,\"!M18\"))),\"\",INDIRECT(CONCATENATE($B257,\"!M18\")))","v":""},{"$f":"IF(ISERROR(INDIRECT(CONCATENATE($B257,\"!M19\"))),\"\",INDIRECT(CONCATENATE($B257,\"!M19\")))","v":""},{"$f":"IF(ISERROR(INDIRECT(CONCATENATE($B257,\"!M20\"))),\"\",INDIRECT(CONCATENATE($B257,\"!M20\")))","v":""},{"$f":"IF(ISERROR(INDIRECT(CONCATENATE($B257,\"!M21\"))),\"\",INDIRECT(CONCATENATE($B257,\"!M21\")))","v":""},null,{"$f":"IF(ISERROR(INDIRECT(CONCATENATE($B257,\"!N18\"))),\"\",INDIRECT(CONCATENATE($B257,\"!N18\")))","v":""},{"$f":"IF(ISERROR(INDIRECT(CONCATENATE($B257,\"!N19\"))),\"\",INDIRECT(CONCATENATE($B257,\"!N19\")))","v":""},{"$f":"IF(ISERROR(INDIRECT(CONCATENATE($B257,\"!N20\"))),\"\",INDIRECT(CONCATENATE($B257,\"!N20\")))","v":""},{"$f":"IF(ISERROR(INDIRECT(CONCATENATE($B257,\"!N21\"))),\"\",INDIRECT(CONCATENATE($B257,\"!N21\")))","v":""},null,{"$f":"IF(ISERROR(INDIRECT(CONCATENATE($B257,\"!O18\"))),\"\",INDIRECT(CONCATENATE($B257,\"!O18\")))","v":""},{"$f":"IF(ISERROR(INDIRECT(CONCATENATE($B257,\"!O19\"))),\"\",INDIRECT(CONCATENATE($B257,\"!O19\")))","v":""},{"$f":"IF(ISERROR(INDIRECT(CONCATENATE($B257,\"!O20\"))),\"\",INDIRECT(CONCATENATE($B257,\"!O20\")))","v":""},{"$f":"IF(ISERROR(INDIRECT(CONCATENATE($B257,\"!O21\"))),\"\",INDIRECT(CONCATENATE($B257,\"!O21\")))","v":""},null,{"$f":"IF(ISERROR(INDIRECT(CONCATENATE($B257,\"!P18\"))),\"\",INDIRECT(CONCATENATE($B257,\"!P18\")))","v":""},{"$f":"IF(ISERROR(INDIRECT(CONCATENATE($B257,\"!P19\"))),\"\",INDIRECT(CONCATENATE($B257,\"!P19\")))","v":""},{"$f":"IF(ISERROR(INDIRECT(CONCATENATE($B257,\"!P20\"))),\"\",INDIRECT(CONCATENATE($B257,\"!P20\")))","v":""},{"$f":"IF(ISERROR(INDIRECT(CONCATENATE($B257,\"!P21\"))),\"\",INDIRECT(CONCATENATE($B257,\"!P21\")))","v":""},null,{"$f":"IF(ISERROR(INDIRECT(CONCATENATE($B257,\"!Q18\"))),\"\",INDIRECT(CONCATENATE($B257,\"!Q18\")))","v":""},{"$f":"IF(ISERROR(INDIRECT(CONCATENATE($B257,\"!Q19\"))),\"\",INDIRECT(CONCATENATE($B257,\"!Q19\")))","v":""},{"$f":"IF(ISERROR(INDIRECT(CONCATENATE($B257,\"!Q20\"))),\"\",INDIRECT(CONCATENATE($B257,\"!Q20\")))","v":""},{"$f":"IF(ISERROR(INDIRECT(CONCATENATE($B257,\"!Q21\"))),\"\",INDIRECT(CONCATENATE($B257,\"!Q1\")))","v":""}]
[]
[]
[]
[]
[]
[]
[]
[]
[]
[]
[]
[]
[]
[]
[]
[]
[]
[]
[]
[]
[]
[]
[]
[]
[]
[]
[]
[]
[]
[]
[]
[]
[]
[]
[]
[]
[]
[]
[]
["RURAL",null,null,"Poorest",null,null,null,null,"Poor",null,null,null,null,"Middle",null,null,null,null,"Rich",null,null,null,null,"Richest"]
[null,null,null,"Improved","Basic","Limited","Unimproved","Surface water","Improved","Basic","Limited","Unimproved","Surface water","Improved","Basic","Limited","Unimproved","Surface water","Improved","Basic","Limited","Unimproved","Surface water","Improved","Basic","Limited","Unimproved","Surface water"]
["Forecast period:",null,2000,{"$f":"IF((D301+H301)>100,D301*100/(D301+H301),D301)","v":36.901619677477356},{"$f":"D299*AVERAGEIF(E305:E316,\">0\")/100","v":24.281265747780097},{"$f":"D299*(100-AVERAGEIF(E305:E316,\">0\"))/100","v":12.620353929697258},{"$f":"100-(E299+F299+H299)","v":61.55398341649348},{"$f":"IF((D301+H301)>100,H301*100/(D301+H301),H301)","v":1.5443969060291636},{"$f":"IF((I301+M301)>100,I301*100/(I301+M301),I301)","v":36.181348127546698},{"$f":"I299*AVERAGEIF(J305:J316,\">0\")/100","v":22.540979883461592},{"$f":"I299*(100-AVERAGEIF(J305:J316,\">0\"))/100","v":13.640368244085106},{"$f":"100-(J299+K299+M299)","v":63.030481683694205},{"$f":"IF((I301+M301)>100,M301*100/(I301+M301),M301)","v":0.78817018875909639},{"$f":"IF((N301+R301)>100,N301*100/(N301+R301),N301)","v":40.225279785401653},{"$f":"N299*AVERAGEIF(O305:O316,\">0\")/100","v":26.428008819008888},{"$f":"N299*(100-AVERAGEIF(O305:O316,\">0\"))/100","v":13.797270966392766},{"$f":"100-(O299+P299+R299)","v":58.056141763774193},{"$f":"IF((N301+R301)>100,R301*100/(N301+R301),R301)","v":1.7185784508241539},{"$f":"IF((S301+W301)>100,S301*100/(S301+W301),S301)","v":37.122269746240818},{"$f":"S299*AVERAGEIF(T305:T316,\">0\")/100","v":24.426453493026457},{"$f":"S299*(100-AVERAGEIF(T305:T316,\">0\"))/100","v":12.695816253214362},{"$f":"100-(T299+U299+W299)","v":60.437867492199985},{"$f":"IF((S301+W301)>100,W301*100/(S301+W301),W301)","v":2.4398627615591977},{"$f":"IF((X301+AB301)>100,X301*100/(X301+AB301),X301)","v":39.451636203146336},{"$f":"X299*AVERAGEIF(Y305:Y316,\">0\")/100","v":26.787660981936366},{"$f":"X299*(100-AVERAGEIF(Y305:Y316,\">0\"))/100","v":12.663975221209972},{"$f":"100-(Y299+Z299+AB299)","v":57.865587335673638},{"$f":"IF((X301+AB301)>100,AB301*100/(X301+AB301),AB301)","v":2.6827764611800262}]
[null,null,2018,{"$f":"IF((D302+H302)>100,D302*100/(D302+H302),D302)","v":66.554263489949335},{"$f":"D300*AVERAGEIF(E305:E316,\">0\")/100","v":43.792705376386657},{"$f":"D300*(100-AVERAGEIF(E305:E316,\">0\"))/100","v":22.761558113562675},{"$f":"100-(E300+F300+H300)","v":32.512116647339624},{"$f":"IF((D302+H302)>100,H302*100/(D302+H302),H302)","v":0.93361986271104058},{"$f":"IF((I302+M302)>100,I302*100/(I302+M302),I302)","v":68.237097698752223},{"$f":"I300*AVERAGEIF(J305:J316,\">0\")/100","v":42.511711866322628},{"$f":"I300*(100-AVERAGEIF(J305:J316,\">0\"))/100","v":25.725385832429588},{"$f":"100-(J300+K300+M300)","v":29.994223748808537},{"$f":"IF((I302+M302)>100,M302*100/(I302+M302),M302)","v":1.7686785524392405},{"$f":"IF((N302+R302)>100,N302*100/(N302+R302),N302)","v":66.518972160590238},{"$f":"N300*AVERAGEIF(O305:O316,\">0\")/100","v":43.702964709507789},{"$f":"N300*(100-AVERAGEIF(O305:O316,\">0\"))/100","v":22.816007451082452},{"$f":"100-(O300+P300+R300)","v":32.291650620675355},{"$f":"IF((N302+R302)>100,R302*100/(N302+R302),R302)","v":1.1893772187344069},{"$f":"IF((S302+W302)>100,S302*100/(S302+W302),S302)","v":63.614807334532998},{"$f":"S300*AVERAGEIF(T305:T316,\">0\")/100","v":41.858543226122713},{"$f":"S300*(100-AVERAGEIF(T305:T316,\">0\"))/100","v":21.756264108410289},{"$f":"100-(T300+U300+W300)","v":35.573530857434207},{"$f":"IF((S302+W302)>100,W302*100/(S302+W302),W302)","v":0.81166180803279531},{"$f":"IF((X302+AB302)>100,X302*100/(X302+AB302),X302)","v":65.907498106959792},{"$f":"X300*AVERAGEIF(Y305:Y316,\">0\")/100","v":44.751191214625706},{"$f":"X300*(100-AVERAGEIF(Y305:Y316,\">0\"))/100","v":21.15630689233409},{"$f":"100-(Y300+Z300+AB300)","v":32.681296550246032},{"$f":"IF((X302+AB302)>100,AB302*100/(X302+AB302),AB302)","v":1.411205342794176}]
["Regression period:",null,{"$f":"MinRegYear(C299,C305:C316)","v":2004},{"$f":"IF(MAX(C305:C316)-MIN(C305:C316)<5,AVERAGEIF(C305:C316,\">0\",D305:D316),\nIF(FORECAST($C301,D$305:D$316,$C$305:$C$316)<0,0,\nIF(FORECAST($C301,D$305:D$316,$C$305:$C$316)>100,100,\nFORECAST($C301,D$305:D$316,$C$305:$C$316))))","v":36.901619677477356},null,null,null,{"$f":"IF(MAX(C305:C316)-MIN(C305:C316)<5,AVERAGEIF(C305:C316,\">0\",H305:H316),\nIF(FORECAST($C301,H$305:H$316,$C$305:$C$316)<0,0,\nIF(FORECAST($C301,H$305:H$316,$C$305:$C$316)>100,100,\nFORECAST($C301,H$305:H$316,$C$305:$C$316))))","v":1.5443969060291636},{"$f":"IF(MAX(C305:C316)-MIN(C305:C316)<5,AVERAGEIF(C305:C316,\">0\",I305:I316),\nIF(FORECAST($C301,I$305:I$316,$C$305:$C$316)<0,0,\nIF(FORECAST($C301,I$305:I$316,$C$305:$C$316)>100,100,\nFORECAST($C301,I$305:I$316,$C$305:$C$316))))","v":36.181348127546698},null,null,null,{"$f":"IF(MAX(C305:C316)-MIN(C305:C316)<5,AVERAGEIF(C305:C316,\">0\",M305:M316),\nIF(FORECAST($C301,M$305:M$316,$C$305:$C$316)<0,0,\nIF(FORECAST($C301,M$305:M$316,$C$305:$C$316)>100,100,\nFORECAST($C301,M$305:M$316,$C$305:$C$316))))","v":0.78817018875909639},{"$f":"IF(MAX(C305:C316)-MIN(C305:C316)<5,AVERAGEIF(C305:C316,\">0\",N305:N316),\nIF(FORECAST($C301,N$305:N$316,$C$305:$C$316)<0,0,\nIF(FORECAST($C301,N$305:N$316,$C$305:$C$316)>100,100,\nFORECAST($C301,N$305:N$316,$C$305:$C$316))))","v":40.225279785401653},null,null,null,{"$f":"IF(MAX(C305:C316)-MIN(C305:C316)<5,AVERAGEIF(C305:C316,\">0\",R305:R316),\nIF(FORECAST($C301,R$305:R$316,$C$305:$C$316)<0,0,\nIF(FORECAST($C301,R$305:R$316,$C$305:$C$316)>100,100,\nFORECAST($C301,R$305:R$316,$C$305:$C$316))))","v":1.7185784508241539},{"$f":"IF(MAX(C305:C316)-MIN(C305:C316)<5,AVERAGEIF(C305:C316,\">0\",S305:S316),\nIF(FORECAST($C301,S$305:S$316,$C$305:$C$316)<0,0,\nIF(FORECAST($C301,S$305:S$316,$C$305:$C$316)>100,100,\nFORECAST($C301,S$305:S$316,$C$305:$C$316))))","v":37.122269746240818},null,null,null,{"$f":"IF(MAX(C305:C316)-MIN(C305:C316)<5,AVERAGEIF(C305:C316,\">0\",W305:W316),\nIF(FORECAST($C301,W$305:W$316,$C$305:$C$316)<0,0,\nIF(FORECAST($C301,W$305:W$316,$C$305:$C$316)>100,100,\nFORECAST($C301,W$305:W$316,$C$305:$C$316))))","v":2.4398627615591977},{"$f":"IF(MAX(C305:C316)-MIN(C305:C316)<5,AVERAGEIF(C305:C316,\">0\",X305:X316),\nIF(FORECAST($C301,X$305:X$316,$C$305:$C$316)<0,0,\nIF(FORECAST($C301,X$305:X$316,$C$305:$C$316)>100,100,\nFORECAST($C301,X$305:X$316,$C$305:$C$316))))","v":39.451636203146336},null,null,null,{"$f":"IF(MAX(C305:C316)-MIN(C305:C316)<5,AVERAGEIF(C305:C316,\">0\",AB305:AB316),\nIF(FORECAST($C301,AB$305:AB$316,$C$305:$C$316)<0,0,\nIF(FORECAST($C301,AB$305:AB$316,$C$305:$C$316)>100,100,\nFORECAST($C301,AB$305:AB$316,$C$305:$C$316))))","v":2.6827764611800262}]
[null,null,{"$f":"MaxRegYear(C300,C305:C316)","v":2014},{"$f":"IF(MAX(C305:C316)-MIN(C305:C316)<5,AVERAGEIF(C305:C316,\">0\",D305:D316),\nIF(FORECAST($C302,D$305:D$316,$C$305:$C$316)<0,0,\nIF(FORECAST($C302,D$305:D$316,$C$305:$C$316)>100,100,\nFORECAST($C302,D$305:D$316,$C$305:$C$316))))","v":66.554263489949335},null,null,null,{"$f":"IF(MAX(C305:C316)-MIN(C305:C316)<5,AVERAGEIF(C305:C316,\">0\",H305:H316),\nIF(FORECAST($C302,H$305:H$316,$C$305:$C$316)<0,0,\nIF(FORECAST($C302,H$305:H$316,$C$305:$C$316)>100,100,\nFORECAST($C302,H$305:H$316,$C$305:$C$316))))","v":0.93361986271104058},{"$f":"IF(MAX(C305:C316)-MIN(C305:C316)<5,AVERAGEIF(C305:C316,\">0\",I305:I316),\nIF(FORECAST($C302,I$305:I$316,$C$305:$C$316)<0,0,\nIF(FORECAST($C302,I$305:I$316,$C$305:$C$316)>100,100,\nFORECAST($C302,I$305:I$316,$C$305:$C$316))))","v":68.237097698752223},null,null,null,{"$f":"IF(MAX(C305:C316)-MIN(C305:C316)<5,AVERAGEIF(C305:C316,\">0\",M305:M316),\nIF(FORECAST($C302,M$305:M$316,$C$305:$C$316)<0,0,\nIF(FORECAST($C302,M$305:M$316,$C$305:$C$316)>100,100,\nFORECAST($C302,M$305:M$316,$C$305:$C$316))))","v":1.7686785524392405},{"$f":"IF(MAX(C305:C316)-MIN(C305:C316)<5,AVERAGEIF(C305:C316,\">0\",N305:N316),\nIF(FORECAST($C302,N$305:N$316,$C$305:$C$316)<0,0,\nIF(FORECAST($C302,N$305:N$316,$C$305:$C$316)>100,100,\nFORECAST($C302,N$305:N$316,$C$305:$C$316))))","v":66.518972160590238},null,null,null,{"$f":"IF(MAX(C305:C316)-MIN(C305:C316)<5,AVERAGEIF(C305:C316,\">0\",R305:R316),\nIF(FORECAST($C302,R$305:R$316,$C$305:$C$316)<0,0,\nIF(FORECAST($C302,R$305:R$316,$C$305:$C$316)>100,100,\nFORECAST($C302,R$305:R$316,$C$305:$C$316))))","v":1.1893772187344069},{"$f":"IF(MAX(C305:C316)-MIN(C305:C316)<5,AVERAGEIF(C305:C316,\">0\",S305:S316),\nIF(FORECAST($C302,S$305:S$316,$C$305:$C$316)<0,0,\nIF(FORECAST($C302,S$305:S$316,$C$305:$C$316)>100,100,\nFORECAST($C302,S$305:S$316,$C$305:$C$316))))","v":63.614807334532998},null,null,null,{"$f":"IF(MAX(C305:C316)-MIN(C305:C316)<5,AVERAGEIF(C305:C316,\">0\",W305:W316),\nIF(FORECAST($C302,W$305:W$316,$C$305:$C$316)<0,0,\nIF(FORECAST($C302,W$305:W$316,$C$305:$C$316)>100,100,\nFORECAST($C302,W$305:W$316,$C$305:$C$316))))","v":0.81166180803279531},{"$f":"IF(MAX(C305:C316)-MIN(C305:C316)<5,AVERAGEIF(C305:C316,\">0\",X305:X316),\nIF(FORECAST($C302,X$305:X$316,$C$305:$C$316)<0,0,\nIF(FORECAST($C302,X$305:X$316,$C$305:$C$316)>100,100,\nFORECAST($C302,X$305:X$316,$C$305:$C$316))))","v":65.907498106959792},null,null,null,{"$f":"IF(MAX(C305:C316)-MIN(C305:C316)<5,AVERAGEIF(C305:C316,\">0\",AB305:AB316),\nIF(FORECAST($C302,AB$305:AB$316,$C$305:$C$316)<0,0,\nIF(FORECAST($C302,AB$305:AB$316,$C$305:$C$316)>100,100,\nFORECAST($C302,AB$305:AB$316,$C$305:$C$316))))","v":1.411205342794176}]
[]
[null,"Survey","Year","Improved","% Improved\n< = 30min",null,null,"Surface water","Improved","% Improved\n< = 30min",null,null,"Surface water","Improved","% Improved\n< = 30min",null,null,"Surface water","Improved","% Improved\n< = 30min",null,null,"Surface water","Improved","% Improved\n< = 30min",null,null,"Surface water"]
[null,"DHS06",2006,{"$f":"IF(ISERROR(INDIRECT(CONCATENATE($B305,\"!M16\"))),\"\",INDIRECT(CONCATENATE($B305,\"!M16\")))","v":42.832148439971675},{"$f":"IF(ISERROR(INDIRECT(CONCATENATE($B305,\"!M23\"))),\"\",INDIRECT(CONCATENATE($B305,\"!M23\")))","v":"N/A"},null,null,{"$f":"IF(ISERROR(INDIRECT(CONCATENATE($B305,\"!M21\"))),\"\",INDIRECT(CONCATENATE($B305,\"!M21\")))","v":1.4222414973655431},{"$f":"IF(ISERROR(INDIRECT(CONCATENATE($B305,\"!N16\"))),\"\",INDIRECT(CONCATENATE($B305,\"!N16\")))","v":42.592498041787863},{"$f":"IF(ISERROR(INDIRECT(CONCATENATE($B305,\"!N23\"))),\"\",INDIRECT(CONCATENATE($B305,\"!N23\")))","v":"N/A"},null,null,{"$f":"IF(ISERROR(INDIRECT(CONCATENATE($B305,\"!N21\"))),\"\",INDIRECT(CONCATENATE($B305,\"!N21\")))","v":0.98427186149513979},{"$f":"IF(ISERROR(INDIRECT(CONCATENATE($B305,\"!O16\"))),\"\",INDIRECT(CONCATENATE($B305,\"!O16\")))","v":45.484018260439591},{"$f":"IF(ISERROR(INDIRECT(CONCATENATE($B305,\"!O23\"))),\"\",INDIRECT(CONCATENATE($B305,\"!O23\")))","v":"N/A"},null,null,{"$f":"IF(ISERROR(INDIRECT(CONCATENATE($B305,\"!O21\"))),\"\",INDIRECT(CONCATENATE($B305,\"!O21\")))","v":1.6127382044061986},{"$f":"IF(ISERROR(INDIRECT(CONCATENATE($B305,\"!P16\"))),\"\",INDIRECT(CONCATENATE($B305,\"!P16\")))","v":42.420777263899005},{"$f":"IF(ISERROR(INDIRECT(CONCATENATE($B305,\"!P23\"))),\"\",INDIRECT(CONCATENATE($B305,\"!P23\")))","v":"N/A"},null,null,{"$f":"IF(ISERROR(INDIRECT(CONCATENATE($B305,\"!P21\"))),\"\",INDIRECT(CONCATENATE($B305,\"!P21\")))","v":2.1142225708539226},{"$f":"IF(ISERROR(INDIRECT(CONCATENATE($B305,\"!Q16\"))),\"\",INDIRECT(CONCATENATE($B305,\"!Q16\")))","v":44.742808583908364},{"$f":"IF(ISERROR(INDIRECT(CONCATENATE($B305,\"!Q23\"))),\"\",INDIRECT(CONCATENATE($B305,\"!Q23\")))","v":"N/A"},null,null,{"$f":"IF(ISERROR(INDIRECT(CONCATENATE($B305,\"!Q221\"))),\"\",INDIRECT(CONCATENATE($B305,\"!Q21\")))","v":2.4284622375028637}]
[null,"DHS12",2012,60.623734727454746,65.8,null,null,1.055775271374674,61.825947784511527,62.3,null,null,1.5725768797032156,61.260233685552315,65.7,null,null,1.2952174651523505,58.316299816874285,65.8,null,null,1.1373019987380888,60.616325726196095,67.900000000000006,null,null,1.6655195664713467]
[null,null,null,"","",null,null,"","","",null,null,"","","",null,null,"","","",null,null,"","","",null,null,""]
[null,null,null,"","",null,null,"","","",null,null,"","","",null,null,"","","",null,null,"","","",null,null,""]
[null,null,null,"","",null,null,"","","",null,null,"","","",null,null,"","","",null,null,"","","",null,null,""]
[null,null,null,"","",null,null,"","","",null,null,"","","",null,null,"","","",null,null,"","","",null,null,""]
[null,null,null,"","",null,null,"","","",null,null,"","","",null,null,"","","",null,null,"","","",null,null,""]
[null,null,null,"","",null,null,"","","",null,null,"","","",null,null,"","","",null,null,"","","",null,null,""]
[null,null,null,"","",null,null,"","","",null,null,"","","",null,null,"","","",null,null,"","","",null,null,""]
[null,null,null,"","",null,null,"","","",null,null,"","","",null,null,"","","",null,null,"","","",null,null,""]
[null,null,null,"","",null,null,"","","",null,null,"","","",null,null,"","","",null,null,"","","",null,null,""]
[null,null,null,"","",null,null,"","","",null,null,"","","",null,null,"","","",null,null,"","","",null,null,""]
[]
[null,{"$f":"CONCATENATE(\"Rural use of drinking water sources, \",C299,\"–\",C300)","v":"Rural use of drinking water sources, 2000–2018"},null,null,null,null,null,null,null,null,null,null,null,null,null,null,null,null,"Data points used for regression"]

{"sheet":"Sanitation","index":2,"n_rows":318,"n_cols":28,"rows_kept":318,"cut":false,"hidden":false,"merged":[[30,21,30,24],[4,1,4,24],[3,1,3,24],[6,1,6,8],[6,9,6,16],[6,17,6,24],[30,1,31,4],[30,5,30,8],[30,9,30,12],[30,13,30,16],[30,17,30,20],[96,23,96,27],[32,1,33,2],[32,3,33,3],[35,1,36,2],[35,3,36,3],[38,1,39,2],[38,3,39,3],[96,0,97,2],[96,3,96,7],[96,8,96,12],[96,13,96,17],[96,18,96,22],[98,0,99,1],[100,0,101,1],[117,18,117,22],[196,0,197,2],[196,3,196,7],[196,8,196,12],[196,13,196,17],[196,18,196,22],[117,1,117,11],[298,0,299,1],[300,0,301,1],[317,18,317,22],[196,23,196,27],[198,0,199,1],[200,0,201,1],[217,18,217,22],[296,0,297,2],[296,3,296,7],[296,8,296,12],[296,13,296,17],[296,18,296,22],[296,23,296,27],[217,1,217,11],[317,1,317,11]]}
[]
[]
[]
[null,"Summary of trends in use of sanitation facilities by wealth quintile (%)"]
[null,{"$f":"IF(ISERROR(INDIRECT(CONCATENATE($B105,\"!A2\"))),\"\",INDIRECT(CONCATENATE($B105,\"!A2\")))","v":"Niger"}]
[]
[null,{"$f":"B118","v":"National use of sanitation facilities, 2000–2018"},null,null,null,null,null,null,null,{"$f":"B218","v":"Urban use of sanitation facilities, 2000–2018"},null,null,null,null,null,null,null,{"$f":"B318","v":"Rural use of sanitation facilities, 2000–2018"}]
[]
[]
[]
[]
[]
[]
[]
[]
[]
[]
[]
[]
[]
[]
[]
[]
[]
[]
[]
[]
[]
[]
[]
[null,{"$f":"IF(ISERROR(INDIRECT(CONCATENATE($B105,\"!A2\"))),\"\",INDIRECT(CONCATENATE($B105,\"!A2\")))","v":"Niger"},null,null,null,"Poorest",null,null,null,"Poor",null,null,null,"Middle",null,null,null,"Rich",null,null,null,"Richest"]
[null,null,null,null,null,"Basic","Limited","Unimproved","Open defecation","Basic","Limited","Unimproved","Open defecation","Basic","Limited","Unimproved","Open defecation","Basic","Limited","Unimproved","Open defecation","Basic","Limited","Unimproved","Open defecation"]
[null,"NATIONAL",null,"Estimate",{"$f":"C99","v":2000},{"$f":"E99","v":1.1758894104718525},{"$f":"F99","v":1.0662247504259608},3.230845982178721,94.527039856923466,{"$f":"J99","v":0},{"$f":"K99","v":0},0,100,{"$f":"O99","v":0.31551198734267977},{"$f":"P99","v":0.38058721587959504},0.53133425766918663,98.772566539108539,{"$f":"T99","v":3.3724386227663548},{"$f":"U99","v":2.2208370420680823},2.9585656110834861,91.448158724082077,{"$f":"Y99","v":37.845902994166117},{"$f":"Z99","v":30.140321618467574},8.0071651325932862,24.006610254773022]
[null,null,null,null,{"$f":"C100","v":2018},{"$f":"E100","v":3.056009602620132},2.7710029929987074,7.7495990210476293,86.423388383333531,{"$f":"J100","v":3.6706959424417165},3.7005534347046249,12.518117397748938,80.110633225104721,{"$f":"O100","v":5.2326691576591688},6.3119217849861311,9.7576319454583427,78.697777111896357,{"$f":"T100","v":10.197860137100154},6.7155515861468551,9.6736594093326858,73.412928867420305,{"$f":"Y100","v":35.578040956457507},28.334205611316484,7.1620000155078287,28.92575341671818]
[]
[null,"URBAN",null,"Estimate",{"$f":"C199","v":2000},{"$f":"E199","v":13.266999688974805},{"$f":"F199","v":17.638013113383867},9.4487854431331471,59.646201754508184,{"$f":"J199","v":28.575333435480431},{"$f":"K199","v":32.592896356346003},7.9014663801322058,30.93030382804136,{"$f":"O199","v":34.663303140383171},{"$f":"P199","v":43.711124564284653},11.440104897498713,10.185467397833463,{"$f":"T199","v":43.635007537194163},{"$f":"U199","v":46.490211198512604},7.2083595335910786,2.6664217307021545,{"$f":"Y199","v":66.930844747949152},{"$f":"Z199","v":29.351167887113796},3.4283459805979533,0.2896413843390917]
[null,null,null,null,{"$f":"C200","v":2018},{"$f":"E200","v":20.21736479079734},26.878280972184466,15.44307508590191,37.461279151116287,{"$f":"J200","v":35.063828405991082},39.993644437204601,10.270838120419739,14.671689036384578,{"$f":"O200","v":37.666748537104255},47.498529801645169,11.812121269304043,3.0226003919465256,{"$f":"T200","v":45.30382419102142},48.268224840927871,6.2054801575925467,0.2224708104581623,{"$f":"Y200","v":67.389433071730195},29.552272518813218,3.0484422102454118,9.8521992111599843E-3]
[]
[null,"RURAL",null,"Estimate",{"$f":"C299","v":2000},{"$f":"E299","v":9.9846837069815814E-2},{"$f":"F299","v":8.7810031650139314E-2},0.34825187320200257,99.464091258078042,{"$f":"J299","v":0},{"$f":"K299","v":0},0,100,{"$f":"O299","v":0.47280343028957084},{"$f":"P299","v":0.57294141378268926},1.3729319022452273,97.581323253682513,{"$f":"T299","v":0.1086495880835191},{"$f":"U299","v":6.9985357839957962E-2},0.15278943220346264,99.66857562187306,{"$f":"Y299","v":9.4052267472460223},{"$f":"Z299","v":4.3262638200762034},5.1393120563134289,81.129197376364345]
[null,null,null,null,{"$f":"C300","v":2018},{"$f":"E300","v":2.5961578897781341},2.2831840563039019,7.8141484363810605,87.306509617536904,{"$f":"J300","v":3.045997698671099},2.8195240500398904,11.733007014793429,82.401471236495581,{"$f":"O300","v":3.3433521803638864},4.051461563673378,8.7532061673166481,83.851980088646087,{"$f":"T300","v":7.3085364573082003},4.7077080389656842,11.775519603469093,76.208235900257023,{"$f":"Y300","v":13.505955424611802},6.2125377600459419,7.6320538968525398,72.649452918489715]
[]
[]
[]
[]
[]
[]
[]
[]
[]
[]
[]
[]
[]
[]
[]
[]
[]
[]
[]
[]
[]
[]
[]
[]
[]
[]
[]
[]
[]
[]
[]
[]
[]
[]
[]
[]
[]
[]
[]
[]
[]
[]
[]
[]
[]
[]
[]
[]
[]
[]
[]
[]
[]
[]
[]
[]
["NATIONAL",null,null,"Poorest",null,null,null,null,"Poor",null,null,null,null,"Middle",null,null,null,null,"Rich",null,null,null,null,"Richest"]
[null,null,null,"Improved","Basic","Limited","Unimproved","Open defecation","Improved","Basic","Limited","Unimproved","Open defecation","Improved","Basic","Limited","Unimproved","Open defecation","Improved","Basic","Limited","Unimproved","Open defecation","Improved","Basic","Limited","Unimproved","Open defecation"]
["Forecast period:",null,2000,{"$f":"IF((D101+H101)>100,D101*100/(D101+H101),D101)","v":2.2421141608978132},{"$f":"D99*AVERAGEIF(E105:E116,\">0\")/100","v":1.1758894104718525},{"$f":"D99*(100-AVERAGEIF(E105:E116,\">0\"))/100","v":1.0662247504259608},{"$f":"100-(E99+F99+H99)","v":3.230845982178721},{"$f":"IF((D101+H101)>100,H101*100/(D101+H101),H101)","v":94.527039856923466},{"$f":"IF((I101+M101)>100,I101*100/(I101+M101),I101)","v":0},{"$f":"I99*AVERAGEIF(J105:J116,\">0\")/100","v":0},{"$f":"I99*(100-AVERAGEIF(J105:J116,\">0\"))/100","v":0},{"$f":"100-(J99+K99+M99)","v":0},{"$f":"IF((I101+M101)>100,M101*100/(I101+M101),M101)","v":100},{"$f":"IF((N101+R101)>100,N101*100/(N101+R101),N101)","v":0.69609920322227481},{"$f":"N99*AVERAGEIF(O105:O116,\">0\")/100","v":0.31551198734267977},{"$f":"N99*(100-AVERAGEIF(O105:O116,\">0\"))/100","v":0.38058721587959504},{"$f":"100-(O99+P99+R99)","v":0.53133425766918663},{"$f":"IF((N101+R101)>100,R101*100/(N101+R101),R101)","v":98.772566539108539},{"$f":"IF((S101+W101)>100,S101*100/(S101+W101),S101)","v":5.5932756648344366},{"$f":"S99*AVERAGEIF(T105:T116,\">0\")/100","v":3.3724386227663548},{"$f":"S99*(100-AVERAGEIF(T105:T116,\">0\"))/100","v":2.2208370420680823},{"$f":"100-(T99+U99+W99)","v":2.9585656110834861},{"$f":"IF((S101+W101)>100,W101*100/(S101+W101),W101)","v":91.448158724082077},{"$f":"IF((X101+AB101)>100,X101*100/(X101+AB101),X101)","v":67.986224612633691},{"$f":"X99*AVERAGEIF(Y105:Y116,\">0\")/100","v":37.845902994166117},{"$f":"X99*(100-AVERAGEIF(Y105:Y116,\">0\"))/100","v":30.140321618467574},{"$f":"100-(Y99+Z99+AB99)","v":8.0071651325932862},{"$f":"IF((X101+AB101)>100,AB101*100/(X101+AB101),AB101)","v":24.006610254773022}]
[null,null,2018,{"$f":"IF((D102+H102)>100,D102*100/(D102+H102),D102)","v":5.8270125956188394},{"$f":"D100*AVERAGEIF(E105:E116,\">0\")/100","v":3.056009602620132},{"$f":"D100*(100-AVERAGEIF(E105:E116,\">0\"))/100","v":2.7710029929987074},{"$f":"100-(E100+F100+H100)","v":7.7495990210476293},{"$f":"IF((D102+H102)>100,H102*100/(D102+H102),H102)","v":86.423388383333531},{"$f":"IF((I102+M102)>100,I102*100/(I102+M102),I102)","v":7.3712493771463414},{"$f":"I100*AVERAGEIF(J105:J116,\">0\")/100","v":3.6706959424417165},{"$f":"I100*(100-AVERAGEIF(J105:J116,\">0\"))/100","v":3.7005534347046249},{"$f":"100-(J100+K100+M100)","v":12.518117397748938},{"$f":"IF((I102+M102)>100,M102*100/(I102+M102),M102)","v":80.110633225104721},{"$f":"IF((N102+R102)>100,N102*100/(N102+R102),N102)","v":11.5445909426453},{"$f":"N100*AVERAGEIF(O105:O116,\">0\")/100","v":5.2326691576591688},{"$f":"N100*(100-AVERAGEIF(O105:O116,\">0\"))/100","v":6.3119217849861311},{"$f":"100-(O100+P100+R100)","v":9.7576319454583427},{"$f":"IF((N102+R102)>100,R102*100/(N102+R102),R102)","v":78.697777111896357},{"$f":"IF((S102+W102)>100,S102*100/(S102+W102),S102)","v":16.913411723247009},{"$f":"S100*AVERAGEIF(T105:T116,\">0\")/100","v":10.197860137100154},{"$f":"S100*(100-AVERAGEIF(T105:T116,\">0\"))/100","v":6.7155515861468551},{"$f":"100-(T100+U100+W100)","v":9.6736594093326858},{"$f":"IF((S102+W102)>100,W102*100/(S102+W102),W102)","v":73.412928867420305},{"$f":"IF((X102+AB102)>100,X102*100/(X102+AB102),X102)","v":63.912246567773991},{"$f":"X100*AVERAGEIF(Y105:Y116,\">0\")/100","v":35.578040956457507},{"$f":"X100*(100-AVERAGEIF(Y105:Y116,\">0\"))/100","v":28.334205611316484},{"$f":"100-(Y100+Z100+AB100)","v":7.1620000155078287},{"$f":"IF((X102+AB102)>100,AB102*100/(X102+AB102),AB102)","v":28.92575341671818}]
["Regression period:",null,{"$f":"MinRegYear(C99,C105:C116)","v":2004},{"$f":"IF(MAX(C105:C116)-MIN(C105:C116)<5,AVERAGEIF(C105:C116,\">0\",D105:D116),\nIF(FORECAST($C101,D$105:D$116,$C$105:$C$116)<0,0,\nIF(FORECAST($C101,D$105:D$116,$C$105:$C$116)>100,100,\nFORECAST($C101,D$105:D$116,$C$105:$C$116))))","v":2.2421141608978132},null,null,null,{"$f":"IF(MAX(C105:C116)-MIN(C105:C116)<5,AVERAGEIF(C105:C116,\">0\",H105:H116),\nIF(FORECAST($C101,H$105:H$116,$C$105:$C$116)<0,0,\nIF(FORECAST($C101,H$105:H$116,$C$105:$C$116)>100,100,\nFORECAST($C101,H$105:H$116,$C$105:$C$116))))","v":94.527039856923466},{"$f":"IF(MAX(C105:C116)-MIN(C105:C116)<5,AVERAGEIF(C105:C116,\">0\",I105:I116),\nIF(FORECAST($C101,I$105:I$116,$C$105:$C$116)<0,0,\nIF(FORECAST($C101,I$105:I$116,$C$105:$C$116)>100,100,\nFORECAST($C101,I$105:I$116,$C$105:$C$116))))","v":0},null,null,null,{"$f":"IF(MAX(C105:C116)-MIN(C105:C116)<5,AVERAGEIF(C105:C116,\">0\",M105:M116),\nIF(FORECAST($C101,M$105:M$116,$C$105:$C$116)<0,0,\nIF(FORECAST($C101,M$105:M$116,$C$105:$C$116)>100,100,\nFORECAST($C101,M$105:M$116,$C$105:$C$116))))","v":100},{"$f":"IF(MAX(C105:C116)-MIN(C105:C116)<5,AVERAGEIF(C105:C116,\">0\",N105:N116),\nIF(FORECAST($C101,N$105:N$116,$C$105:$C$116)<0,0,\nIF(FORECAST($C101,N$105:N$116,$C$105:$C$116)>100,100,\nFORECAST($C101,N$105:N$116,$C$105:$C$116))))","v":0.69609920322227481},null,null,null,{"$f":"IF(MAX(C105:C116)-MIN(C105:C116)<5,AVERAGEIF(C105:C116,\">0\",R105:R116),\nIF(FORECAST($C101,R$105:R$116,$C$105:$C$116)<0,0,\nIF(FORECAST($C101,R$105:R$116,$C$105:$C$116)>100,100,\nFORECAST($C101,R$105:R$116,$C$105:$C$116))))","v":98.772566539108539},{"$f":"IF(MAX(C105:C116)-MIN(C105:C116)<5,AVERAGEIF(C105:C116,\">0\",S105:S116),\nIF(FORECAST($C101,S$105:S$116,$C$105:$C$116)<0,0,\nIF(FORECAST($C101,S$105:S$116,$C$105:$C$116)>100,100,\nFORECAST($C101,S$105:S$116,$C$105:$C$116))))","v":5.5932756648344366},null,null,null,{"$f":"IF(MAX(C105:C116)-MIN(C105:C116)<5,AVERAGEIF(C105:C116,\">0\",W105:W116),\nIF(FORECAST($C101,W$105:W$116,$C$105:$C$116)<0,0,\nIF(FORECAST($C101,W$105:W$116,$C$105:$C$116)>100,100,\nFORECAST($C101,W$105:W$116,$C$105:$C$116))))","v":91.448158724082077},{"$f":"IF(MAX(C105:C116)-MIN(C105:C116)<5,AVERAGEIF(C105:C116,\">0\",X105:X116),\nIF(FORECAST($C101,X$105:X$116,$C$105:$C$116)<0,0,\nIF(FORECAST($C101,X$105:X$116,$C$105:$C$116)>100,100,\nFORECAST($C101,X$105:X$116,$C$105:$C$116))))","v":67.986224612633691},null,null,null,{"$f":"IF(MAX(C105:C116)-MIN(C105:C116)<5,AVERAGEIF(C105:C116,\">0\",AB105:AB116),\nIF(FORECAST($C101,AB$105:AB$116,$C$105:$C$116)<0,0,\nIF(FORECAST($C101,AB$105:AB$116,$C$105:$C$116)>100,100,\nFORECAST($C101,AB$105:AB$116,$C$105:$C$116))))","v":24.006610254773022}]
[null,null,{"$f":"MaxRegYear(C100,C105:C116)","v":2014},{"$f":"IF(MAX(C105:C116)-MIN(C105:C116)<5,AVERAGEIF(C105:C116,\">0\",D105:D116),\nIF(FORECAST($C102,D$105:D$116,$C$105:$C$116)<0,0,\nIF(FORECAST($C102,D$105:D$116,$C$105:$C$116)>100,100,\nFORECAST($C102,D$105:D$116,$C$105:$C$116))))","v":5.8270125956188394},null,null,null,{"$f":"IF(MAX(C105:C116)-MIN(C105:C116)<5,AVERAGEIF(C105:C116,\">0\",H105:H116),\nIF(FORECAST($C102,H$105:H$116,$C$105:$C$116)<0,0,\nIF(FORECAST($C102,H$105:H$116,$C$105:$C$116)>100,100,\nFORECAST($C102,H$105:H$116,$C$105:$C$116))))","v":86.423388383333531},{"$f":"IF(MAX(C105:C116)-MIN(C105:C116)<5,AVERAGEIF(C105:C116,\">0\",I105:I116),\nIF(FORECAST($C102,I$105:I$116,$C$105:$C$116)<0,0,\nIF(FORECAST($C102,I$105:I$116,$C$105:$C$116)>100,100,\nFORECAST($C102,I$105:I$116,$C$105:$C$116))))","v":7.3712493771463414},null,null,null,{"$f":"IF(MAX(C105:C116)-MIN(C105:C116)<5,AVERAGEIF(C105:C116,\">0\",M105:M116),\nIF(FORECAST($C102,M$105:M$116,$C$105:$C$116)<0,0,\nIF(FORECAST($C102,M$105:M$116,$C$105:$C$116)>100,100,\nFORECAST($C102,M$105:M$116,$C$105:$C$116))))","v":80.110633225104721},{"$f":"IF(MAX(C105:C116)-MIN(C105:C116)<5,AVERAGEIF(C105:C116,\">0\",N105:N116),\nIF(FORECAST($C102,N$105:N$116,$C$105:$C$116)<0,0,\nIF(FORECAST($C102,N$105:N$116,$C$105:$C$116)>100,100,\nFORECAST($C102,N$105:N$116,$C$105:$C$116))))","v":11.5445909426453},null,null,null,{"$f":"IF(MAX(C105:C116)-MIN(C105:C116)<5,AVERAGEIF(C105:C116,\">0\",R105:R116),\nIF(FORECAST($C102,R$105:R$116,$C$105:$C$116)<0,0,\nIF(FORECAST($C102,R$105:R$116,$C$105:$C$116)>100,100,\nFORECAST($C102,R$105:R$116,$C$105:$C$116))))","v":78.697777111896357},{"$f":"IF(MAX(C105:C116)-MIN(C105:C116)<5,AVERAGEIF(C105:C116,\">0\",S105:S116),\nIF(FORECAST($C102,S$105:S$116,$C$105:$C$116)<0,0,\nIF(FORECAST($C102,S$105:S$116,$C$105:$C$116)>100,100,\nFORECAST($C102,S$105:S$116,$C$105:$C$116))))","v":16.913411723247009},null,null,null,{"$f":"IF(MAX(C105:C116)-MIN(C105:C116)<5,AVERAGEIF(C105:C116,\">0\",W105:W116),\nIF(FORECAST($C102,W$105:W$116,$C$105:$C$116)<0,0,\nIF(FORECAST($C102,W$105:W$116,$C$105:$C$116)>100,100,\nFORECAST($C102,W$105:W$116,$C$105:$C$116))))","v":73.412928867420305},{"$f":"IF(MAX(C105:C116)-MIN(C105:C116)<5,AVERAGEIF(C105:C116,\">0\",X105:X116),\nIF(FORECAST($C102,X$105:X$116,$C$105:$C$116)<0,0,\nIF(FORECAST($C102,X$105:X$116,$C$105:$C$116)>100,100,\nFORECAST($C102,X$105:X$116,$C$105:$C$116))))","v":63.912246567773991},null,null,null,{"$f":"IF(MAX(C105:C116)-MIN(C105:C116)<5,AVERAGEIF(C105:C116,\">0\",AB105:AB116),\nIF(FORECAST($C102,AB$105:AB$116,$C$105:$C$116)<0,0,\nIF(FORECAST($C102,AB$105:AB$116,$C$105:$C$116)>100,100,\nFORECAST($C102,AB$105:AB$116,$C$105:$C$116))))","v":28.92575341671818}]
[]
[null,"Survey","Year","Improved","Not shared",null,null,"Open defecation","Improved","Not shared",null,null,"Open defecation","Improved","Not shared",null,null,"Open defecation","Improved","Not shared",null,null,"Open defecation","Improved","Not shared",null,null,"Open defecation"]
[null,"DHS06",2006,{"$f":"IF(ISERROR(INDIRECT(CONCATENATE($B105,\"!C122\"))),\"\",INDIRECT(CONCATENATE($B105,\"!C122\")))","v":2.9590938478419728},{"$f":"IF(ISERROR(INDIRECT(CONCATENATE($B105,\"!C129\"))),\"\",INDIRECT(CONCATENATE($B105,\"!C129\")))","v":"N/A"},null,null,{"$f":"IF(ISERROR(INDIRECT(CONCATENATE($B105,\"!C127\"))),\"\",INDIRECT(CONCATENATE($B105,\"!C127\")))","v":92.906309562205408},{"$f":"IF(ISERROR(INDIRECT(CONCATENATE($B105,\"!D122\"))),\"\",INDIRECT(CONCATENATE($B105,\"!D122\")))","v":1.2505866346507779},{"$f":"IF(ISERROR(INDIRECT(CONCATENATE($B105,\"!D129\"))),\"\",INDIRECT(CONCATENATE($B105,\"!D129\")))","v":"N/A"},null,null,{"$f":"IF(ISERROR(INDIRECT(CONCATENATE($B105,\"!D127\"))),\"\",INDIRECT(CONCATENATE($B105,\"!D127\")))","v":96.610818645553536},{"$f":"IF(ISERROR(INDIRECT(CONCATENATE($B105,\"!E122\"))),\"\",INDIRECT(CONCATENATE($B105,\"!E122\")))","v":2.8657975511069655},{"$f":"IF(ISERROR(INDIRECT(CONCATENATE($B105,\"!E129\"))),\"\",INDIRECT(CONCATENATE($B105,\"!E129\")))","v":"N/A"},null,null,{"$f":"IF(ISERROR(INDIRECT(CONCATENATE($B105,\"!E127\"))),\"\",INDIRECT(CONCATENATE($B105,\"!E127\")))","v":94.757608653665955},{"$f":"IF(ISERROR(INDIRECT(CONCATENATE($B105,\"!F122\"))),\"\",INDIRECT(CONCATENATE($B105,\"!F122\")))","v":7.8573028765168296},{"$f":"IF(ISERROR(INDIRECT(CONCATENATE($B105,\"!F129\"))),\"\",INDIRECT(CONCATENATE($B105,\"!F129\")))","v":"N/A"},null,null,{"$f":"IF(ISERROR(INDIRECT(CONCATENATE($B105,\"!F127\"))),\"\",INDIRECT(CONCATENATE($B105,\"!F127\")))","v":87.841112752749666},{"$f":"IF(ISERROR(INDIRECT(CONCATENATE($B105,\"!G122\"))),\"\",INDIRECT(CONCATENATE($B105,\"!G122\")))","v":67.171429003661615},{"$f":"IF(ISERROR(INDIRECT(CONCATENATE($B105,\"!G129\"))),\"\",INDIRECT(CONCATENATE($B105,\"!G129\")))","v":"N/A"},null,null,{"$f":"IF(ISERROR(INDIRECT(CONCATENATE($B105,\"!G2127\"))),\"\",INDIRECT(CONCATENATE($B105,\"!G127\")))","v":24.990438887162032}]
[null,"DHS12",2012,5.1100329086745795,52.445563699619527,null,null,88.044118678051419,5.8410836915223889,49.797473326872662,null,null,84.23567958021728,9.3748925947607731,45.32572166182068,null,null,82.712734997338544,14.649384511564362,60.294518361919145,null,null,77.019974838752674,64.727042176745826,55.667016678454182,null,null,27.94192478432916]
[null,null,null,"","",null,null,"","","",null,null,"","","",null,null,"","","",null,null,"","","",null,null,""]
[null,null,null,"","",null,null,"","","",null,null,"","","",null,null,"","","",null,null,"","","",null,null,""]
[null,null,null,"","",null,null,"","","",null,null,"","","",null,null,"","","",null,null,"","","",null,null,""]
[null,null,null,"","",null,null,"","","",null,null,"","","",null,null,"","","",null,null,"","","",null,null,""]
[null,null,null,"","",null,null,"","","",null,null,"","","",null,null,"","","",null,null,"","","",null,null,""]
[null,null,null,"","",null,null,"","","",null,null,"","","",null,null,"","","",null,null,"","","",null,null,""]
[null,null,null,"","",null,null,"","","",null,null,"","","",null,null,"","","",null,null,"","","",null,null,""]
[null,null,null,"","",null,null,"","","",null,null,"","","",null,null,"","","",null,null,"","","",null,null,""]
[null,null,null,"","",null,null,"","","",null,null,"","","",null,null,"","","",null,null,"","","",null,null,""]
[null,null,null,"","",null,null,"","","",null,null,"","","",null,null,"","","",null,null,"","","",null,null,""]
[]
[null,{"$f":"CONCATENATE(\"National use of sanitation facilities, \",C99,\"–\",C100)","v":"National use of sanitation facilities, 2000–2018"},null,null,null,null,null,null,null,null,null,null,null,null,null,null,null,null,"Data points used for regression"]
[]
[]
[]
[]
[]
[]
[]
[]
[]
[]
[]
[]
[]
[]
[]
[]
[]
[]
[]
[]
[]
[]
[]
[]
[]
[]
[]
[]
[]
[]
[]
[]
[]
[]
[]
[]
[]
[]
[]
[]
[]
[]
[]
[]
[]
[]
[]
[]
[]
[]
[]
[]
[]
[]
[]
[]
[]
[]
[]
[]
[]
[]
[]
[]
[]
[]
[]
[]
[]
[]
[]
[]
[]
[]
[]
[]
[]
[]
["URBAN",null,null,"Poorest",null,null,null,null,"Poor",null,null,null,null,"Middle",null,null,null,null,"Rich",null,null,null,null,"Richest"]
[null,null,null,"Improved","Basic","Limited","Unimproved","Open defecation","Improved","Basic","Limited","Unimproved","Open defecation","Improved","Basic","Limited","Unimproved","Open defecation","Improved","Basic","Limited","Unimproved","Open defecation","Improved","Basic","Limited","Unimproved","Open defecation"]
["Forecast period:",null,{"$f":"MinBase(C205:C216)","v":2000},{"$f":"IF((D201+H201)>100,D201*100/(D201+H201),D201)","v":30.905012802358669},{"$f":"D199*AVERAGEIF(E205:E216,\">0\")/100","v":13.266999688974805},{"$f":"D199*(100-AVERAGEIF(E205:E216,\">0\"))/100","v":17.638013113383867},{"$f":"100-(E199+F199+H199)","v":9.4487854431331471},{"$f":"IF((D201+H201)>100,H201*100/(D201+H201),H201)","v":59.646201754508184},{"$f":"IF((I201+M201)>100,I201*100/(I201+M201),I201)","v":61.168229791826434},{"$f":"I199*AVERAGEIF(J205:J216,\">0\")/100","v":28.575333435480431},{"$f":"I199*(100-AVERAGEIF(J205:J216,\">0\"))/100","v":32.592896356346003},{"$f":"100-(J199+K199+M199)","v":7.9014663801322058},{"$f":"IF((I201+M201)>100,M201*100/(I201+M201),M201)","v":30.93030382804136},{"$f":"IF((N201+R201)>100,N201*100/(N201+R201),N201)","v":78.374427704667823},{"$f":"N199*AVERAGEIF(O205:O216,\">0\")/100","v":34.663303140383171},{"$f":"N199*(100-AVERAGEIF(O205:O216,\">0\"))/100","v":43.711124564284653},{"$f":"100-(O199+P199+R199)","v":11.440104897498713},{"$f":"IF((N201+R201)>100,R201*100/(N201+R201),R201)","v":10.185467397833463},{"$f":"IF((S201+W201)>100,S201*100/(S201+W201),S201)","v":90.125218735706767},{"$f":"S199*AVERAGEIF(T205:T216,\">0\")/100","v":43.635007537194163},{"$f":"S199*(100-AVERAGEIF(T205:T216,\">0\"))/100","v":46.490211198512604},{"$f":"100-(T199+U199+W199)","v":7.2083595335910786},{"$f":"IF((S201+W201)>100,W201*100/(S201+W201),W201)","v":2.6664217307021545},{"$f":"IF((X201+AB201)>100,X201*100/(X201+AB201),X201)","v":96.282012635062955},{"$f":"X199*AVERAGEIF(Y205:Y216,\">0\")/100","v":66.930844747949152},{"$f":"X199*(100-AVERAGEIF(Y205:Y216,\">0\"))/100","v":29.351167887113796},{"$f":"100-(Y199+Z199+AB199)","v":3.4283459805979533},{"$f":"IF((X201+AB201)>100,AB201*100/(X201+AB201),AB201)","v":0.2896413843390917}]
[null,null,{"$f":"MaxTarget(C205:C216)","v":2018},{"$f":"IF((D202+H202)>100,D202*100/(D202+H202),D202)","v":47.095645762981803},{"$f":"D200*AVERAGEIF(E205:E216,\">0\")/100","v":20.21736479079734},{"$f":"D200*(100-AVERAGEIF(E205:E216,\">0\"))/100","v":26.878280972184466},{"$f":"100-(E200+F200+H200)","v":15.44307508590191},{"$f":"IF((D202+H202)>100,H202*100/(D202+H202),H202)","v":37.461279151116287},{"$f":"IF((I202+M202)>100,I202*100/(I202+M202),I202)","v":75.057472843195683},{"$f":"I200*AVERAGEIF(J205:J216,\">0\")/100","v":35.063828405991082},{"$f":"I200*(100-AVERAGEIF(J205:J216,\">0\"))/100","v":39.993644437204601},{"$f":"100-(J200+K200+M200)","v":10.270838120419739},{"$f":"IF((I202+M202)>100,M202*100/(I202+M202),M202)","v":14.671689036384578},{"$f":"IF((N202+R202)>100,N202*100/(N202+R202),N202)","v":85.165278338749431},{"$f":"N200*AVERAGEIF(O205:O216,\">0\")/100","v":37.666748537104255},{"$f":"N200*(100-AVERAGEIF(O205:O216,\">0\"))/100","v":47.498529801645169},{"$f":"100-(O200+P200+R200)","v":11.812121269304043},{"$f":"IF((N202+R202)>100,R202*100/(N202+R202),R202)","v":3.0226003919465256},{"$f":"IF((S202+W202)>100,S202*100/(S202+W202),S202)","v":93.572049031949291},{"$f":"S200*AVERAGEIF(T205:T216,\">0\")/100","v":45.30382419102142},{"$f":"S200*(100-AVERAGEIF(T205:T216,\">0\"))/100","v":48.268224840927871},{"$f":"100-(T200+U200+W200)","v":6.2054801575925467},{"$f":"IF((S202+W202)>100,W202*100/(S202+W202),W202)","v":0.2224708104581623},{"$f":"IF((X202+AB202)>100,X202*100/(X202+AB202),X202)","v":96.941705590543421},{"$f":"X200*AVERAGEIF(Y205:Y216,\">0\")/100","v":67.389433071730195},{"$f":"X200*(100-AVERAGEIF(Y205:Y216,\">0\"))/100","v":29.552272518813218},{"$f":"100-(Y200+Z200+AB200)","v":3.0484422102454118},{"$f":"IF((X202+AB202)>100,AB202*100/(X202+AB202),AB202)","v":9.8521992111599843E-3}]
["Regression period:",null,{"$f":"MinRegYear(C199,C205:C216)","v":2004},{"$f":"IF(MAX(C205:C216)-MIN(C205:C216)<5,AVERAGEIF(C205:C216,\">0\",D205:D216),\nIF(FORECAST($C201,D$205:D$216,$C$205:$C$216)<0,0,\nIF(FORECAST($C201,D$205:D$216,$C$205:$C$216)>100,100,\nFORECAST($C201,D$205:D$216,$C$205:$C$216))))","v":30.905012802358669},null,null,null,{"$f":"IF(MAX(C205:C216)-MIN(C205:C216)<5,AVERAGEIF(C205:C216,\">0\",H205:H216),\nIF(FORECAST($C201,H$205:H$216,$C$205:$C$216)<0,0,\nIF(FORECAST($C201,H$205:H$216,$C$205:$C$216)>100,100,\nFORECAST($C201,H$205:H$216,$C$205:$C$216))))","v":59.646201754508184},{"$f":"IF(MAX(C205:C216)-MIN(C205:C216)<5,AVERAGEIF(C205:C216,\">0\",I205:I216),\nIF(FORECAST($C201,I$205:I$216,$C$205:$C$216)<0,0,\nIF(FORECAST($C201,I$205:I$216,$C$205:$C$216)>100,100,\nFORECAST($C201,I$205:I$216,$C$205:$C$216))))","v":61.168229791826434},null,null,null,{"$f":"IF(MAX(C205:C216)-MIN(C205:C216)<5,AVERAGEIF(C205:C216,\">0\",M205:M216),\nIF(FORECAST($C201,M$205:M$216,$C$205:$C$216)<0,0,\nIF(FORECAST($C201,M$205:M$216,$C$205:$C$216)>100,100,\nFORECAST($C201,M$205:M$216,$C$205:$C$216))))","v":30.93030382804136},{"$f":"IF(MAX(C205:C216)-MIN(C205:C216)<5,AVERAGEIF(C205:C216,\">0\",N205:N216),\nIF(FORECAST($C201,N$205:N$216,$C$205:$C$216)<0,0,\nIF(FORECAST($C201,N$205:N$216,$C$205:$C$216)>100,100,\nFORECAST($C201,N$205:N$216,$C$205:$C$216))))","v":78.374427704667823},null,null,null,{"$f":"IF(MAX(C205:C216)-MIN(C205:C216)<5,AVERAGEIF(C205:C216,\">0\",R205:R216),\nIF(FORECAST($C201,R$205:R$216,$C$205:$C$216)<0,0,\nIF(FORECAST($C201,R$205:R$216,$C$205:$C$216)>100,100,\nFORECAST($C201,R$205:R$216,$C$205:$C$216))))","v":10.185467397833463},{"$f":"IF(MAX(C205:C216)-MIN(C205:C216)<5,AVERAGEIF(C205:C216,\">0\",S205:S216),\nIF(FORECAST($C201,S$205:S$216,$C$205:$C$216)<0,0,\nIF(FORECAST($C201,S$205:S$216,$C$205:$C$216)>100,100,\nFORECAST($C201,S$205:S$216,$C$205:$C$216))))","v":90.125218735706767},null,null,null,{"$f":"IF(MAX(C205:C216)-MIN(C205:C216)<5,AVERAGEIF(C205:C216,\">0\",W205:W216),\nIF(FORECAST($C201,W$205:W$216,$C$205:$C$216)<0,0,\nIF(FORECAST($C201,W$205:W$216,$C$205:$C$216)>100,100,\nFORECAST($C201,W$205:W$216,$C$205:$C$216))))","v":2.6664217307021545},{"$f":"IF(MAX(C205:C216)-MIN(C205:C216)<5,AVERAGEIF(C205:C216,\">0\",X205:X216),\nIF(FORECAST($C201,X$205:X$216,$C$205:$C$216)<0,0,\nIF(FORECAST($C201,X$205:X$216,$C$205:$C$216)>100,100,\nFORECAST($C201,X$205:X$216,$C$205:$C$216))))","v":96.282012635062955},null,null,null,{"$f":"IF(MAX(C205:C216)-MIN(C205:C216)<5,AVERAGEIF(C205:C216,\">0\",AB205:AB216),\nIF(FORECAST($C201,AB$205:AB$216,$C$205:$C$216)<0,0,\nIF(FORECAST($C201,AB$205:AB$216,$C$205:$C$216)>100,100,\nFORECAST($C201,AB$205:AB$216,$C$205:$C$216))))","v":0.2896413843390917}]
[null,null,{"$f":"MaxRegYear(C200,C205:C216)","v":2014},{"$f":"IF(MAX(C205:C216)-MIN(C205:C216)<5,AVERAGEIF(C205:C216,\">0\",D205:D216),\nIF(FORECAST($C202,D$205:D$216,$C$205:$C$216)<0,0,\nIF(FORECAST($C202,D$205:D$216,$C$205:$C$216)>100,100,\nFORECAST($C202,D$205:D$216,$C$205:$C$216))))","v":47.095645762981803},null,null,null,{"$f":"IF(MAX(C205:C216)-MIN(C205:C216)<5,AVERAGEIF(C205:C216,\">0\",H205:H216),\nIF(FORECAST($C202,H$205:H$216,$C$205:$C$216)<0,0,\nIF(FORECAST($C202,H$205:H$216,$C$205:$C$216)>100,100,\nFORECAST($C202,H$205:H$216,$C$205:$C$216))))","v":37.461279151116287},{"$f":"IF(MAX(C205:C216)-MIN(C205:C216)<5,AVERAGEIF(C205:C216,\">0\",I205:I216),\nIF(FORECAST($C202,I$205:I$216,$C$205:$C$216)<0,0,\nIF(FORECAST($C202,I$205:I$216,$C$205:$C$216)>100,100,\nFORECAST($C202,I$205:I$216,$C$205:$C$216))))","v":75.057472843195683},null,null,null,{"$f":"IF(MAX(C205:C216)-MIN(C205:C216)<5,AVERAGEIF(C205:C216,\">0\",M205:M216),\nIF(FORECAST($C202,M$205:M$216,$C$205:$C$216)<0,0,\nIF(FORECAST($C202,M$205:M$216,$C$205:$C$216)>100,100,\nFORECAST($C202,M$205:M$216,$C$205:$C$216))))","v":14.671689036384578},{"$f":"IF(MAX(C205:C216)-MIN(C205:C216)<5,AVERAGEIF(C205:C216,\">0\",N205:N216),\nIF(FORECAST($C202,N$205:N$216,$C$205:$C$216)<0,0,\nIF(FORECAST($C202,N$205:N$216,$C$205:$C$216)>100,100,\nFORECAST($C202,N$205:N$216,$C$205:$C$216))))","v":85.165278338749431},null,null,null,{"$f":"IF(MAX(C205:C216)-MIN(C205:C216)<5,AVERAGEIF(C205:C216,\">0\",R205:R216),\nIF(FORECAST($C202,R$205:R$216,$C$205:$C$216)<0,0,\nIF(FORECAST($C202,R$205:R$216,$C$205:$C$216)>100,100,\nFORECAST($C202,R$205:R$216,$C$205:$C$216))))","v":3.0226003919465256},{"$f":"IF(MAX(C205:C216)-MIN(C205:C216)<5,AVERAGEIF(C205:C216,\">0\",S205:S216),\nIF(FORECAST($C202,S$205:S$216,$C$205:$C$216)<0,0,\nIF(FORECAST($C202,S$205:S$216,$C$205:$C$216)>100,100,\nFORECAST($C202,S$205:S$216,$C$205:$C$216))))","v":93.572049031949291},null,null,null,{"$f":"IF(MAX(C205:C216)-MIN(C205:C216)<5,AVERAGEIF(C205:C216,\">0\",W205:W216),\nIF(FORECAST($C202,W$205:W$216,$C$205:$C$216)<0,0,\nIF(FORECAST($C202,W$205:W$216,$C$205:$C$216)>100,100,\nFORECAST($C202,W$205:W$216,$C$205:$C$216))))","v":0.2224708104581623},{"$f":"IF(MAX(C205:C216)-MIN(C205:C216)<5,AVERAGEIF(C205:C216,\">0\",X205:X216),\nIF(FORECAST($C202,X$205:X$216,$C$205:$C$216)<0,0,\nIF(FORECAST($C202,X$205:X$216,$C$205:$C$216)>100,100,\nFORECAST($C202,X$205:X$216,$C$205:$C$216))))","v":96.941705590543421},null,null,null,{"$f":"IF(MAX(C205:C216)-MIN(C205:C216)<5,AVERAGEIF(C205:C216,\">0\",AB205:AB216),\nIF(FORECAST($C202,AB$205:AB$216,$C$205:$C$216)<0,0,\nIF(FORECAST($C202,AB$205:AB$216,$C$205:$C$216)>100,100,\nFORECAST($C202,AB$205:AB$216,$C$205:$C$216))))","v":9.8521992111599843E-3}]
[]
[null,"Survey","Year","Improved","Not shared",null,null,"Open defecation","Improved","Not shared",null,null,"Open defecation","Improved","Not shared",null,null,"Open defecation","Improved","Not shared",null,null,"Open defecation","Improved","Not shared",null,null,"Open defecation"]
[null,"DHS06",2006,{"$f":"IF(ISERROR(INDIRECT(CONCATENATE($B205,\"!H122\"))),\"\",INDIRECT(CONCATENATE($B205,\"!H122\")))","v":34.143139394483434},{"$f":"IF(ISERROR(INDIRECT(CONCATENATE($B205,\"!H129\"))),\"\",INDIRECT(CONCATENATE($B205,\"!H129\")))","v":"N/A"},null,null,{"$f":"IF(ISERROR(INDIRECT(CONCATENATE($B205,\"!H127\"))),\"\",INDIRECT(CONCATENATE($B205,\"!H127\")))","v":55.209217233829897},{"$f":"IF(ISERROR(INDIRECT(CONCATENATE($B205,\"!I122\"))),\"\",INDIRECT(CONCATENATE($B205,\"!I122\")))","v":63.94607840210022},{"$f":"IF(ISERROR(INDIRECT(CONCATENATE($B205,\"!I129\"))),\"\",INDIRECT(CONCATENATE($B205,\"!I129\")))","v":"N/A"},null,null,{"$f":"IF(ISERROR(INDIRECT(CONCATENATE($B205,\"!I127\"))),\"\",INDIRECT(CONCATENATE($B205,\"!I127\")))","v":27.678580869710341},{"$f":"IF(ISERROR(INDIRECT(CONCATENATE($B205,\"!J122\"))),\"\",INDIRECT(CONCATENATE($B205,\"!J122\")))","v":79.732597831484256},{"$f":"IF(ISERROR(INDIRECT(CONCATENATE($B205,\"!J129\"))),\"\",INDIRECT(CONCATENATE($B205,\"!J129\")))","v":"N/A"},null,null,{"$f":"IF(ISERROR(INDIRECT(CONCATENATE($B205,\"!J127\"))),\"\",INDIRECT(CONCATENATE($B205,\"!J127\")))","v":8.752893996656006},{"$f":"IF(ISERROR(INDIRECT(CONCATENATE($B205,\"!K122\"))),\"\",INDIRECT(CONCATENATE($B205,\"!K122\")))","v":90.814584794955351},{"$f":"IF(ISERROR(INDIRECT(CONCATENATE($B205,\"!K129\"))),\"\",INDIRECT(CONCATENATE($B205,\"!K129\")))","v":"N/A"},null,null,{"$f":"IF(ISERROR(INDIRECT(CONCATENATE($B205,\"!K127\"))),\"\",INDIRECT(CONCATENATE($B205,\"!K127\")))","v":2.17763154665337},{"$f":"IF(ISERROR(INDIRECT(CONCATENATE($B205,\"!L122\"))),\"\",INDIRECT(CONCATENATE($B205,\"!L122\")))","v":96.413951226159043},{"$f":"IF(ISERROR(INDIRECT(CONCATENATE($B205,\"!L129\"))),\"\",INDIRECT(CONCATENATE($B205,\"!L129\")))","v":"N/A"},null,null,{"$f":"IF(ISERROR(INDIRECT(CONCATENATE($B205,\"!L2127\"))),\"\",INDIRECT(CONCATENATE($B205,\"!L127\")))","v":0.23368354731349733}]
[null,"DHS12",2012,43.857519170857387,42.928309960001918,null,null,41.898263671794851,72.279624232921634,46.715972544457692,null,null,17.923411994716243,83.807108211933269,44.227822971801672,null,null,4.455173793123822,92.88268297270082,48.41597962181298,null,null,0.71126099450698754,96.809766999447319,69.515419252437809,null,null,6.5810036236741296E-2]
[null,null,null,"","",null,null,"","","",null,null,"","","",null,null,"","","",null,null,"","","",null,null,""]
[null,null,null,"","",null,null,"","","",null,null,"","","",null,null,"","","",null,null,"","","",null,null,""]
[null,null,null,"","",null,null,"","","",null,null,"","","",null,null,"","","",null,null,"","","",null,null,""]
[null,null,null,"","",null,null,"","","",null,null,"","","",null,null,"","","",null,null,"","","",null,null,""]
[null,null,null,"","",null,null,"","","",null,null,"","","",null,null,"","","",null,null,"","","",null,null,""]
[null,null,null,"","",null,null,"","","",null,null,"","","",null,null,"","","",null,null,"","","",null,null,""]
[null,null,null,"","",null,null,"","","",null,null,"","","",null,null,"","","",null,null,"","","",null,null,""]
[null,null,null,"","",null,null,"","","",null,null,"","","",null,null,"","","",null,null,"","","",null,null,""]
[null,null,null,"","",null,null,"","","",null,null,"","","",null,null,"","","",null,null,"","","",null,null,""]
[null,null,null,"","",null,null,"","","",null,null,"","","",null,null,"","","",null,null,"","","",null,null,""]
[]
[null,{"$f":"CONCATENATE(\"Urban use of sanitation facilities, \",C199,\"–\",C200)","v":"Urban use of sanitation facilities, 2000–2018"},null,null,null,null,null,null,null,null,null,null,null,null,null,null,null,null,"Data points used for regression"]
[]
[]
[]
[]
[]
[]
[]
[]
[]
[]
[]
[]
[]
[]
[]
[]
[]
[]
[]
[]
[]
[]
[]
[]
[]
[]
[]
[]
[]
[]
[]
[]
[]
[]
[]
[]
[]
[]
[]
[]
[]
[]
[]
[]
[]
[]
[]
[]
[]
[]
[]
[]
[]
[]
[]
[]
[]
[]
[]
[]
[]
[]
[]
[]
[]
[]
[]
[]
[]
[]
[]
[]
[]
[]
[]
[]
[]
[]
["RURAL",null,null,"Poorest",null,null,null,null,"Poor",null,null,null,null,"Middle",null,null,null,null,"Rich",null,null,null,null,"Richest"]
[null,null,null,"Improved","Basic","Limited","Unimproved","Open defecation","Improved","Basic","Limited","Unimproved","Open defecation","Improved","Basic","Limited","Unimproved","Open defecation","Improved","Basic","Limited","Unimproved","Open defecation","Improved","Basic","Limited","Unimproved","Open defecation"]
["Forecast period:",null,{"$f":"MinBase(C305:C316)","v":2000},{"$f":"IF((D301+H301)>100,D301*100/(D301+H301),D301)","v":0.18765686871995513},{"$f":"D299*AVERAGEIF(E305:E316,\">0\")/100","v":9.9846837069815814E-2},{"$f":"D299*(100-AVERAGEIF(E305:E316,\">0\"))/100","v":8.7810031650139314E-2},{"$f":"100-(E299+F299+H299)","v":0.34825187320200257},{"$f":"IF((D301+H301)>100,H301*100/(D301+H301),H301)","v":99.464091258078042},{"$f":"IF((I301+M301)>100,I301*100/(I301+M301),I301)","v":0},{"$f":"I299*AVERAGEIF(J305:J316,\">0\")/100","v":0},{"$f":"I299*(100-AVERAGEIF(J305:J316,\">0\"))/100","v":0},{"$f":"100-(J299+K299+M299)","v":0},{"$f":"IF((I301+M301)>100,M301*100/(I301+M301),M301)","v":100},{"$f":"IF((N301+R301)>100,N301*100/(N301+R301),N301)","v":1.0457448440722601},{"$f":"N299*AVERAGEIF(O305:O316,\">0\")/100","v":0.47280343028957084},{"$f":"N299*(100-AVERAGEIF(O305:O316,\">0\"))/100","v":0.57294141378268926},{"$f":"100-(O299+P299+R299)","v":1.3729319022452273},{"$f":"IF((N301+R301)>100,R301*100/(N301+R301),R301)","v":97.581323253682513},{"$f":"IF((S301+W301)>100,S301*100/(S301+W301),S301)","v":0.17863494592347706},{"$f":"S299*AVERAGEIF(T305:T316,\">0\")/100","v":0.1086495880835191},{"$f":"S299*(100-AVERAGEIF(T305:T316,\">0\"))/100","v":6.9985357839957962E-2},{"$f":"100-(T299+U299+W299)","v":0.15278943220346264},{"$f":"IF((S301+W301)>100,W301*100/(S301+W301),W301)","v":99.66857562187306},{"$f":"IF((X301+AB301)>100,X301*100/(X301+AB301),X301)","v":13.731490567322226},{"$f":"X299*AVERAGEIF(Y305:Y316,\">0\")/100","v":9.4052267472460223},{"$f":"X299*(100-AVERAGEIF(Y305:Y316,\">0\"))/100","v":4.3262638200762034},{"$f":"100-(Y299+Z299+AB299)","v":5.1393120563134289},{"$f":"IF((X301+AB301)>100,AB301*100/(X301+AB301),AB301)","v":81.129197376364345}]
[null,null,{"$f":"MaxTarget(C305:C316)","v":2018},{"$f":"IF((D302+H302)>100,D302*100/(D302+H302),D302)","v":4.879341946082036},{"$f":"D300*AVERAGEIF(E305:E316,\">0\")/100","v":2.5961578897781341},{"$f":"D300*(100-AVERAGEIF(E305:E316,\">0\"))/100","v":2.2831840563039019},{"$f":"100-(E300+F300+H300)","v":7.8141484363810605},{"$f":"IF((D302+H302)>100,H302*100/(D302+H302),H302)","v":87.306509617536904},{"$f":"IF((I302+M302)>100,I302*100/(I302+M302),I302)","v":5.8655217487109894},{"$f":"I300*AVERAGEIF(J305:J316,\">0\")/100","v":3.045997698671099},{"$f":"I300*(100-AVERAGEIF(J305:J316,\">0\"))/100","v":2.8195240500398904},{"$f":"100-(J300+K300+M300)","v":11.733007014793429},{"$f":"IF((I302+M302)>100,M302*100/(I302+M302),M302)","v":82.401471236495581},{"$f":"IF((N302+R302)>100,N302*100/(N302+R302),N302)","v":7.3948137440372648},{"$f":"N300*AVERAGEIF(O305:O316,\">0\")/100","v":3.3433521803638864},{"$f":"N300*(100-AVERAGEIF(O305:O316,\">0\"))/100","v":4.051461563673378},{"$f":"100-(O300+P300+R300)","v":8.7532061673166481},{"$f":"IF((N302+R302)>100,R302*100/(N302+R302),R302)","v":83.851980088646087},{"$f":"IF((S302+W302)>100,S302*100/(S302+W302),S302)","v":12.016244496273885},{"$f":"S300*AVERAGEIF(T305:T316,\">0\")/100","v":7.3085364573082003},{"$f":"S300*(100-AVERAGEIF(T305:T316,\">0\"))/100","v":4.7077080389656842},{"$f":"100-(T300+U300+W300)","v":11.775519603469093},{"$f":"IF((S302+W302)>100,W302*100/(S302+W302),W302)","v":76.208235900257023},{"$f":"IF((X302+AB302)>100,X302*100/(X302+AB302),X302)","v":19.718493184657746},{"$f":"X300*AVERAGEIF(Y305:Y316,\">0\")/100","v":13.505955424611802},{"$f":"X300*(100-AVERAGEIF(Y305:Y316,\">0\"))/100","v":6.2125377600459419},{"$f":"100-(Y300+Z300+AB300)","v":7.6320538968525398},{"$f":"IF((X302+AB302)>100,AB302*100/(X302+AB302),AB302)","v":72.649452918489715}]
["Regression period:",null,{"$f":"MinRegYear(C299,C305:C316)","v":2004},{"$f":"IF(MAX(C305:C316)-MIN(C305:C316)<5,AVERAGEIF(C305:C316,\">0\",D305:D316),\nIF(FORECAST($C301,D$305:D$316,$C$305:$C$316)<0,0,\nIF(FORECAST($C301,D$305:D$316,$C$305:$C$316)>100,100,\nFORECAST($C301,D$305:D$316,$C$305:$C$316))))","v":0.18765686871995513},null,null,null,{"$f":"IF(MAX(C305:C316)-MIN(C305:C316)<5,AVERAGEIF(C305:C316,\">0\",H305:H316),\nIF(FORECAST($C301,H$305:H$316,$C$305:$C$316)<0,0,\nIF(FORECAST($C301,H$305:H$316,$C$305:$C$316)>100,100,\nFORECAST($C301,H$305:H$316,$C$305:$C$316))))","v":99.464091258078042},{"$f":"IF(MAX(C305:C316)-MIN(C305:C316)<5,AVERAGEIF(C305:C316,\">0\",I305:I316),\nIF(FORECAST($C301,I$305:I$316,$C$305:$C$316)<0,0,\nIF(FORECAST($C301,I$305:I$316,$C$305:$C$316)>100,100,\nFORECAST($C301,I$305:I$316,$C$305:$C$316))))","v":0},null,null,null,{"$f":"IF(MAX(C305:C316)-MIN(C305:C316)<5,AVERAGEIF(C305:C316,\">0\",M305:M316),\nIF(FORECAST($C301,M$305:M$316,$C$305:$C$316)<0,0,\nIF(FORECAST($C301,M$305:M$316,$C$305:$C$316)>100,100,\nFORECAST($C301,M$305:M$316,$C$305:$C$316))))","v":100},{"$f":"IF(MAX(C305:C316)-MIN(C305:C316)<5,AVERAGEIF(C305:C316,\">0\",N305:N316),\nIF(FORECAST($C301,N$305:N$316,$C$305:$C$316)<0,0,\nIF(FORECAST($C301,N$305:N$316,$C$305:$C$316)>100,100,\nFORECAST($C301,N$305:N$316,$C$305:$C$316))))","v":1.0457448440722601},null,null,null,{"$f":"IF(MAX(C305:C316)-MIN(C305:C316)<5,AVERAGEIF(C305:C316,\">0\",R305:R316),\nIF(FORECAST($C301,R$305:R$316,$C$305:$C$316)<0,0,\nIF(FORECAST($C301,R$305:R$316,$C$305:$C$316)>100,100,\nFORECAST($C301,R$305:R$316,$C$305:$C$316))))","v":97.581323253682513},{"$f":"IF(MAX(C305:C316)-MIN(C305:C316)<5,AVERAGEIF(C305:C316,\">0\",S305:S316),\nIF(FORECAST($C301,S$305:S$316,$C$305:$C$316)<0,0,\nIF(FORECAST($C301,S$305:S$316,$C$305:$C$316)>100,100,\nFORECAST($C301,S$305:S$316,$C$305:$C$316))))","v":0.17863494592347706},null,null,null,{"$f":"IF(MAX(C305:C316)-MIN(C305:C316)<5,AVERAGEIF(C305:C316,\">0\",W305:W316),\nIF(FORECAST($C301,W$305:W$316,$C$305:$C$316)<0,0,\nIF(FORECAST($C301,W$305:W$316,$C$305:$C$316)>100,100,\nFORECAST($C301,W$305:W$316,$C$305:$C$316))))","v":99.66857562187306},{"$f":"IF(MAX(C305:C316)-MIN(C305:C316)<5,AVERAGEIF(C305:C316,\">0\",X305:X316),\nIF(FORECAST($C301,X$305:X$316,$C$305:$C$316)<0,0,\nIF(FORECAST($C301,X$305:X$316,$C$305:$C$316)>100,100,\nFORECAST($C301,X$305:X$316,$C$305:$C$316))))","v":13.731490567322226},null,null,null,{"$f":"IF(MAX(C305:C316)-MIN(C305:C316)<5,AVERAGEIF(C305:C316,\">0\",AB305:AB316),\nIF(FORECAST($C301,AB$305:AB$316,$C$305:$C$316)<0,0,\nIF(FORECAST($C301,AB$305:AB$316,$C$305:$C$316)>100,100,\nFORECAST($C301,AB$305:AB$316,$C$305:$C$316))))","v":81.129197376364345}]
[null,null,{"$f":"MaxRegYear(C300,C305:C316)","v":2014},{"$f":"IF(MAX(C305:C316)-MIN(C305:C316)<5,AVERAGEIF(C305:C316,\">0\",D305:D316),\nIF(FORECAST($C302,D$305:D$316,$C$305:$C$316)<0,0,\nIF(FORECAST($C302,D$305:D$316,$C$305:$C$316)>100,100,\nFORECAST($C302,D$305:D$316,$C$305:$C$316))))","v":4.879341946082036},null,null,null,{"$f":"IF(MAX(C305:C316)-MIN(C305:C316)<5,AVERAGEIF(C305:C316,\">0\",H305:H316),\nIF(FORECAST($C302,H$305:H$316,$C$305:$C$316)<0,0,\nIF(FORECAST($C302,H$305:H$316,$C$305:$C$316)>100,100,\nFORECAST($C302,H$305:H$316,$C$305:$C$316))))","v":87.306509617536904},{"$f":"IF(MAX(C305:C316)-MIN(C305:C316)<5,AVERAGEIF(C305:C316,\">0\",I305:I316),\nIF(FORECAST($C302,I$305:I$316,$C$305:$C$316)<0,0,\nIF(FORECAST($C302,I$305:I$316,$C$305:$C$316)>100,100,\nFORECAST($C302,I$305:I$316,$C$305:$C$316))))","v":5.8655217487109894},null,null,null,{"$f":"IF(MAX(C305:C316)-MIN(C305:C316)<5,AVERAGEIF(C305:C316,\">0\",M305:M316),\nIF(FORECAST($C302,M$305:M$316,$C$305:$C$316)<0,0,\nIF(FORECAST($C302,M$305:M$316,$C$305:$C$316)>100,100,\nFORECAST($C302,M$305:M$316,$C$305:$C$316))))","v":82.401471236495581},{"$f":"IF(MAX(C305:C316)-MIN(C305:C316)<5,AVERAGEIF(C305:C316,\">0\",N305:N316),\nIF(FORECAST($C302,N$305:N$316,$C$305:$C$316)<0,0,\nIF(FORECAST($C302,N$305:N$316,$C$305:$C$316)>100,100,\nFORECAST($C302,N$305:N$316,$C$305:$C$316))))","v":7.3948137440372648},null,null,null,{"$f":"IF(MAX(C305:C316)-MIN(C305:C316)<5,AVERAGEIF(C305:C316,\">0\",R305:R316),\nIF(FORECAST($C302,R$305:R$316,$C$305:$C$316)<0,0,\nIF(FORECAST($C302,R$305:R$316,$C$305:$C$316)>100,100,\nFORECAST($C302,R$305:R$316,$C$305:$C$316))))","v":83.851980088646087},{"$f":"IF(MAX(C305:C316)-MIN(C305:C316)<5,AVERAGEIF(C305:C316,\">0\",S305:S316),\nIF(FORECAST($C302,S$305:S$316,$C$305:$C$316)<0,0,\nIF(FORECAST($C302,S$305:S$316,$C$305:$C$316)>100,100,\nFORECAST($C302,S$305:S$316,$C$305:$C$316))))","v":12.016244496273885},null,null,null,{"$f":"IF(MAX(C305:C316)-MIN(C305:C316)<5,AVERAGEIF(C305:C316,\">0\",W305:W316),\nIF(FORECAST($C302,W$305:W$316,$C$305:$C$316)<0,0,\nIF(FORECAST($C302,W$305:W$316,$C$305:$C$316)>100,100,\nFORECAST($C302,W$305:W$316,$C$305:$C$316))))","v":76.208235900257023},{"$f":"IF(MAX(C305:C316)-MIN(C305:C316)<5,AVERAGEIF(C305:C316,\">0\",X305:X316),\nIF(FORECAST($C302,X$305:X$316,$C$305:$C$316)<0,0,\nIF(FORECAST($C302,X$305:X$316,$C$305:$C$316)>100,100,\nFORECAST($C302,X$305:X$316,$C$305:$C$316))))","v":19.718493184657746},null,null,null,{"$f":"IF(MAX(C305:C316)-MIN(C305:C316)<5,AVERAGEIF(C305:C316,\">0\",AB305:AB316),\nIF(FORECAST($C302,AB$305:AB$316,$C$305:$C$316)<0,0,\nIF(FORECAST($C302,AB$305:AB$316,$C$305:$C$316)>100,100,\nFORECAST($C302,AB$305:AB$316,$C$305:$C$316))))","v":72.649452918489715}]
[]
[null,"Survey","Year","Improved","Not shared",null,null,"Open defecation","Improved","Not shared",null,null,"Open defecation","Improved","Not shared",null,null,"Open defecation","Improved","Not shared",null,null,"Open defecation","Improved","Not shared",null,null,"Open defecation"]
[null,"DHS06",2006,{"$f":"IF(ISERROR(INDIRECT(CONCATENATE($B305,\"!M122\"))),\"\",INDIRECT(CONCATENATE($B305,\"!M122\")))","v":1.1259938841923909},{"$f":"IF(ISERROR(INDIRECT(CONCATENATE($B305,\"!M129\"))),\"\",INDIRECT(CONCATENATE($B305,\"!M129\")))","v":"N/A"},null,null,{"$f":"IF(ISERROR(INDIRECT(CONCATENATE($B305,\"!M127\"))),\"\",INDIRECT(CONCATENATE($B305,\"!M127\")))","v":97.032574929969712},{"$f":"IF(ISERROR(INDIRECT(CONCATENATE($B305,\"!N122\"))),\"\",INDIRECT(CONCATENATE($B305,\"!N122\")))","v":0.93705582968021839},{"$f":"IF(ISERROR(INDIRECT(CONCATENATE($B305,\"!N129\"))),\"\",INDIRECT(CONCATENATE($B305,\"!N129\")))","v":"N/A"},null,null,{"$f":"IF(ISERROR(INDIRECT(CONCATENATE($B305,\"!N127\"))),\"\",INDIRECT(CONCATENATE($B305,\"!N127\")))","v":97.221884494310459},{"$f":"IF(ISERROR(INDIRECT(CONCATENATE($B305,\"!O122\"))),\"\",INDIRECT(CONCATENATE($B305,\"!O122\")))","v":2.3155586240651975},{"$f":"IF(ISERROR(INDIRECT(CONCATENATE($B305,\"!O129\"))),\"\",INDIRECT(CONCATENATE($B305,\"!O129\")))","v":"N/A"},null,null,{"$f":"IF(ISERROR(INDIRECT(CONCATENATE($B305,\"!O127\"))),\"\",INDIRECT(CONCATENATE($B305,\"!O127\")))","v":94.835454620675335},{"$f":"IF(ISERROR(INDIRECT(CONCATENATE($B305,\"!P122\"))),\"\",INDIRECT(CONCATENATE($B305,\"!P122\")))","v":2.5461568559933339},{"$f":"IF(ISERROR(INDIRECT(CONCATENATE($B305,\"!P129\"))),\"\",INDIRECT(CONCATENATE($B305,\"!P129\")))","v":"N/A"},null,null,{"$f":"IF(ISERROR(INDIRECT(CONCATENATE($B305,\"!P127\"))),\"\",INDIRECT(CONCATENATE($B305,\"!P127\")))","v":94.976507677549478},{"$f":"IF(ISERROR(INDIRECT(CONCATENATE($B305,\"!Q122\"))),\"\",INDIRECT(CONCATENATE($B305,\"!Q122\")))","v":14.928891090789159},{"$f":"IF(ISERROR(INDIRECT(CONCATENATE($B305,\"!Q129\"))),\"\",INDIRECT(CONCATENATE($B305,\"!Q129\")))","v":"N/A"},null,null,{"$f":"IF(ISERROR(INDIRECT(CONCATENATE($B305,\"!Q2127\"))),\"\",INDIRECT(CONCATENATE($B305,\"!Q127\")))","v":79.433248484789559}]
[null,"DHS12",2012,3.9410049306096351,53.207131585905152,null,null,89.738025945645091,4.6334052689534042,51.930549901046561,null,null,86.106574550949077,6.1249999640442692,45.212121577230604,null,null,86.597848721653364,9.6487225862035118,60.822135065365082,null,null,80.900303844579881,18.521092661190398,68.49385142227959,null,null,74.345401810064786]
[null,null,null,"","",null,null,"","","",null,null,"","","",null,null,"","","",null,null,"","","",null,null,""]
[null,null,null,"","",null,null,"","","",null,null,"","","",null,null,"","","",null,null,"","","",null,null,""]
[null,null,null,"","",null,null,"","","",null,null,"","","",null,null,"","","",null,null,"","","",null,null,""]
[null,null,null,"","",null,null,"","","",null,null,"","","",null,null,"","","",null,null,"","","",null,null,""]
[null,null,null,"","",null,null,"","","",null,null,"","","",null,null,"","","",null,null,"","","",null,null,""]
[null,null,null,"","",null,null,"","","",null,null,"","","",null,null,"","","",null,null,"","","",null,null,""]
[null,null,null,"","",null,null,"","","",null,null,"","","",null,null,"","","",null,null,"","","",null,null,""]
[null,null,null,"","",null,null,"","","",null,null,"","","",null,null,"","","",null,null,"","","",null,null,""]
[null,null,null,"","",null,null,"","","",null,null,"","","",null,null,"","","",null,null,"","","",null,null,""]
[null,null,null,"","",null,null,"","","",null,null,"","","",null,null,"","","",null,null,"","","",null,null,""]
[]
[null,{"$f":"CONCATENATE(\"Rural use of sanitation facilities, \",C299,\"–\",C300)","v":"Rural use of sanitation facilities, 2000–2018"},null,null,null,null,null,null,null,null,null,null,null,null,null,null,null,null,"Data points used for regression"]

{"sheet":"Hygiene","index":3,"n_rows":90,"n_cols":25,"rows_kept":90,"cut":false,"hidden":false,"merged":[[39,22,40,22],[39,23,40,23],[39,24,40,24],[31,4,32,5],[39,16,40,16],[39,17,40,17],[39,18,40,18],[39,19,40,19],[39,20,40,20],[39,21,40,21],[36,24,37,24],[39,6,40,7],[39,8,40,8],[39,9,40,9],[39,10,40,10],[39,11,40,11],[39,12,40,12],[39,13,40,13],[39,14,40,14],[39,15,40,15],[36,18,37,18],[36,12,37,12],[36,13,37,13],[36,14,37,14],[36,15,37,15],[36,16,37,16],[36,17,37,17],[36,19,37,19],[36,20,37,20],[36,21,37,21],[36,22,37,22],[36,23,37,23],[33,20,34,20],[33,21,34,21],[33,22,34,22],[33,23,34,23],[33,24,34,24],[33,15,34,15],[33,16,34,16],[33,17,34,17],[33,18,34,18],[36,6,37,7],[36,8,37,8],[36,9,37,9],[36,10,37,10],[36,11,37,11],[33,10,34,10],[33,11,34,11],[33,12,34,12],[33,13,34,13],[33,14,34,14],[6,1,6,7],[3,1,3,24],[4,1,4,24],[33,1,34,3],[31,6,32,9],[31,10,31,12],[31,13,31,15],[6,10,6,15],[6,18,6,23],[33,19,34,19],[31,16,31,18],[31,19,31,21],[31,22,31,24],[33,6,34,7],[33,8,34,8],[33,9,34,9]]}
[]
[]
[]
[null,"Access to hygiene facilities by wealth quintile (%)"]
[null,{"$f":"IF(ISERROR(INDIRECT(CONCATENATE($E$32,\"!A2\"))),\"\",INDIRECT(CONCATENATE($E$32,\"!A2\")))","v":"Niger"}]
[]
[null,{"$f":"CONCATENATE(\"National \",IF(ISERROR(INDIRECT(CONCATENATE($E$32,\"!A2\"))),\"\",INDIRECT(CONCATENATE($E$32,\"!A210\"))))","v":"National Access to hygiene facilities "},null,null,null,null,null,null,null,null,{"$f":"CONCATENATE(\"Urban \",IF(ISERROR(INDIRECT(CONCATENATE($E$32,\"!A2\"))),\"\",INDIRECT(CONCATENATE($E$32,\"!A210\"))))","v":"Urban Access to hygiene facilities "},null,null,null,null,null,null,null,{"$f":"CONCATENATE(\"Rural \",IF(ISERROR(INDIRECT(CONCATENATE($E$32,\"!A2\"))),\"\",INDIRECT(CONCATENATE($E$32,\"!A210\"))))","v":"Rural Access to hygiene facilities "}]
[]
[]
[]
[]
[]
[]
[]
[]
[]
[]
[]
[]
[]
[]
[]
[]
[]
[]
[]
[]
[]
[]
[]
[]
[null,null,null,null,{"$f":"INDEX(B88:B100,A88)","v":"DHS06"},null,{"$f":"IF(ISERROR(INDIRECT(CONCATENATE($E$32,\"!A2\"))),\"\",INDIRECT(CONCATENATE($E$32,\"!A2\")))","v":"Niger"},null,null,null,"Poorest",null,null,"Poor",null,null,"Middle",null,null,"Rich",null,null,"Richest"]
[null,null,null,null,null,null,null,null,null,null,"Basic","Limited","No facility","Basic","Limited","No facility","Basic","Limited","No facility","Basic","Limited","No facility","Basic","Limited","No facility"]
[null,">>>  Select Survey :   ",null,null,null,null,"NATIONAL",null,null,{"$f":"IF(ISERROR(INDIRECT(CONCATENATE(#REF!,\"!A2\"))),\"\",INDIRECT(CONCATENATE(#REF!,\"!A210\")))","v":""},{"$f":"IF(ISERROR(INDIRECT(CONCATENATE($E$32,\"!C222\"))),\"\",INDIRECT(CONCATENATE($E$32,\"!C222\")))","v":3.8261092318604808},{"$f":"IF(ISERROR(INDIRECT(CONCATENATE($E$32,\"!C223\"))),\"\",INDIRECT(CONCATENATE($E$32,\"!C223\")))","v":72.665355137908136},{"$f":"IF(ISERROR(INDIRECT(CONCATENATE($E$32,\"!C224\"))),\"\",INDIRECT(CONCATENATE($E$32,\"!C224\")))","v":23.508535630231439},{"$f":"IF(ISERROR(INDIRECT(CONCATENATE($E$32,\"!D222\"))),\"\",INDIRECT(CONCATENATE($E$32,\"!D222\")))","v":4.4292656944100441},{"$f":"IF(ISERROR(INDIRECT(CONCATENATE($E$32,\"!D223\"))),\"\",INDIRECT(CONCATENATE($E$32,\"!D223\")))","v":81.519916003823894},{"$f":"IF(ISERROR(INDIRECT(CONCATENATE($E$32,\"!D224\"))),\"\",INDIRECT(CONCATENATE($E$32,\"!D224\")))","v":14.050818301765936},{"$f":"IF(ISERROR(INDIRECT(CONCATENATE($E$32,\"!E222\"))),\"\",INDIRECT(CONCATENATE($E$32,\"!E222\")))","v":4.6850956823181491},{"$f":"IF(ISERROR(INDIRECT(CONCATENATE($E$32,\"!E223\"))),\"\",INDIRECT(CONCATENATE($E$32,\"!E223\")))","v":81.527801351465769},{"$f":"IF(ISERROR(INDIRECT(CONCATENATE($E$32,\"!E224\"))),\"\",INDIRECT(CONCATENATE($E$32,\"!E224\")))","v":13.787102966216015},{"$f":"IF(ISERROR(INDIRECT(CONCATENATE($E$32,\"!F222\"))),\"\",INDIRECT(CONCATENATE($E$32,\"!F222\")))","v":7.7266901022384316},{"$f":"IF(ISERROR(INDIRECT(CONCATENATE($E$32,\"!F223\"))),\"\",INDIRECT(CONCATENATE($E$32,\"!F223\")))","v":76.232987782971279},{"$f":"IF(ISERROR(INDIRECT(CONCATENATE($E$32,\"!F224\"))),\"\",INDIRECT(CONCATENATE($E$32,\"!F224\")))","v":16.040322114790285},{"$f":"IF(ISERROR(INDIRECT(CONCATENATE($E$32,\"!G222\"))),\"\",INDIRECT(CONCATENATE($E$32,\"!G222\")))","v":26.606881897480083},{"$f":"IF(ISERROR(INDIRECT(CONCATENATE($E$32,\"!G223\"))),\"\",INDIRECT(CONCATENATE($E$32,\"!G223\")))","v":60.626735452560276},{"$f":"IF(ISERROR(INDIRECT(CONCATENATE($E$32,\"!G224\"))),\"\",INDIRECT(CONCATENATE($E$32,\"!G224\")))","v":12.766382649959764}]
[]
[]
[null,null,null,null,null,null,"URBAN",null,null,{"$f":"IF(ISERROR(INDIRECT(CONCATENATE(#REF!,\"!A2\"))),\"\",INDIRECT(CONCATENATE(#REF!,\"!A210\")))","v":""},{"$f":"IF(ISERROR(INDIRECT(CONCATENATE($E$32,\"!H222\"))),\"\",INDIRECT(CONCATENATE($E$32,\"!H222\")))","v":13.403120435186377},{"$f":"IF(ISERROR(INDIRECT(CONCATENATE($E$32,\"!H223\"))),\"\",INDIRECT(CONCATENATE($E$32,\"!H223\")))","v":67.014591978917736},{"$f":"IF(ISERROR(INDIRECT(CONCATENATE($E$32,\"!H224\"))),\"\",INDIRECT(CONCATENATE($E$32,\"!H224\")))","v":19.582287585895848},{"$f":"IF(ISERROR(INDIRECT(CONCATENATE($E$32,\"!I222\"))),\"\",INDIRECT(CONCATENATE($E$32,\"!I222\")))","v":21.375363247086867},{"$f":"IF(ISERROR(INDIRECT(CONCATENATE($E$32,\"!I223\"))),\"\",INDIRECT(CONCATENATE($E$32,\"!I223\")))","v":64.673784508619008},{"$f":"IF(ISERROR(INDIRECT(CONCATENATE($E$32,\"!I224\"))),\"\",INDIRECT(CONCATENATE($E$32,\"!I224\")))","v":13.950852244294119},{"$f":"IF(ISERROR(INDIRECT(CONCATENATE($E$32,\"!J222\"))),\"\",INDIRECT(CONCATENATE($E$32,\"!J222\")))","v":26.292691995445765},{"$f":"IF(ISERROR(INDIRECT(CONCATENATE($E$32,\"!J223\"))),\"\",INDIRECT(CONCATENATE($E$32,\"!J223\")))","v":61.887165266078803},{"$f":"IF(ISERROR(INDIRECT(CONCATENATE($E$32,\"!J224\"))),\"\",INDIRECT(CONCATENATE($E$32,\"!J224\")))","v":11.820142738475411},{"$f":"IF(ISERROR(INDIRECT(CONCATENATE($E$32,\"!K222\"))),\"\",INDIRECT(CONCATENATE($E$32,\"!K222\")))","v":32.408205842475112},{"$f":"IF(ISERROR(INDIRECT(CONCATENATE($E$32,\"!K223\"))),\"\",INDIRECT(CONCATENATE($E$32,\"!K223\")))","v":55.173380538688541},{"$f":"IF(ISERROR(INDIRECT(CONCATENATE($E$32,\"!K224\"))),\"\",INDIRECT(CONCATENATE($E$32,\"!K224\")))","v":12.418413618836329},{"$f":"IF(ISERROR(INDIRECT(CONCATENATE($E$32,\"!L222\"))),\"\",INDIRECT(CONCATENATE($E$32,\"!L222\")))","v":54.72264096003633},{"$f":"IF(ISERROR(INDIRECT(CONCATENATE($E$32,\"!L223\"))),\"\",INDIRECT(CONCATENATE($E$32,\"!L223\")))","v":36.595753651030236},{"$f":"IF(ISERROR(INDIRECT(CONCATENATE($E$32,\"!L224\"))),\"\",INDIRECT(CONCATENATE($E$32,\"!L224\")))","v":8.6816053889333595}]
[]
[]
[null,null,null,null,null,null,"RURAL",null,null,{"$f":"IF(ISERROR(INDIRECT(CONCATENATE(#REF!,\"!A2\"))),\"\",INDIRECT(CONCATENATE(#REF!,\"!A210\")))","v":""},{"$f":"IF(ISERROR(INDIRECT(CONCATENATE($E$32,\"!M222\"))),\"\",INDIRECT(CONCATENATE($E$32,\"!M222\")))","v":2.6815455610678351},{"$f":"IF(ISERROR(INDIRECT(CONCATENATE($E$32,\"!M223\"))),\"\",INDIRECT(CONCATENATE($E$32,\"!M223\")))","v":73.483452751913148},{"$f":"IF(ISERROR(INDIRECT(CONCATENATE($E$32,\"!M224\"))),\"\",INDIRECT(CONCATENATE($E$32,\"!M224\")))","v":23.83500168701908},{"$f":"IF(ISERROR(INDIRECT(CONCATENATE($E$32,\"!N222\"))),\"\",INDIRECT(CONCATENATE($E$32,\"!N222\")))","v":4.1988057224158286},{"$f":"IF(ISERROR(INDIRECT(CONCATENATE($E$32,\"!N223\"))),\"\",INDIRECT(CONCATENATE($E$32,\"!N223\")))","v":81.908382025092791},{"$f":"IF(ISERROR(INDIRECT(CONCATENATE($E$32,\"!N224\"))),\"\",INDIRECT(CONCATENATE($E$32,\"!N224\")))","v":13.892812252491241},{"$f":"IF(ISERROR(INDIRECT(CONCATENATE($E$32,\"!O222\"))),\"\",INDIRECT(CONCATENATE($E$32,\"!O222\")))","v":4.4033475640324058},{"$f":"IF(ISERROR(INDIRECT(CONCATENATE($E$32,\"!O223\"))),\"\",INDIRECT(CONCATENATE($E$32,\"!O223\")))","v":82.476736945748769},{"$f":"IF(ISERROR(INDIRECT(CONCATENATE($E$32,\"!O224\"))),\"\",INDIRECT(CONCATENATE($E$32,\"!O224\")))","v":13.119915490218883},{"$f":"IF(ISERROR(INDIRECT(CONCATENATE($E$32,\"!P222\"))),\"\",INDIRECT(CONCATENATE($E$32,\"!P222\")))","v":5.4323267805131454},{"$f":"IF(ISERROR(INDIRECT(CONCATENATE($E$32,\"!P223\"))),\"\",INDIRECT(CONCATENATE($E$32,\"!P223\")))","v":79.750761298005742},{"$f":"IF(ISERROR(INDIRECT(CONCATENATE($E$32,\"!P224\"))),\"\",INDIRECT(CONCATENATE($E$32,\"!P224\")))","v":14.816911921481013},{"$f":"IF(ISERROR(INDIRECT(CONCATENATE($E$32,\"!Q222\"))),\"\",INDIRECT(CONCATENATE($E$32,\"!Q222\")))","v":8.6119662401225021},{"$f":"IF(ISERROR(INDIRECT(CONCATENATE($E$32,\"!Q223\"))),\"\",INDIRECT(CONCATENATE($E$32,\"!Q223\")))","v":74.889729287707112},{"$f":"IF(ISERROR(INDIRECT(CONCATENATE($E$32,\"!Q224\"))),\"\",INDIRECT(CONCATENATE($E$32,\"!Q224\")))","v":16.498304472170322}]
[]
[]
[]
[]
[]
[]
[]
[]
[]
[]
[]
[]
[]
[]
[]
[]
[]
[]
[]
[]
[]
[]
[]
[]
[]
[]
[]
[]
[]
[]
[]
[]
[]
[]
[]
[]
[]
[]
[]
[]
[]
[]
[]
[]
[]
[]
[]
[1,"DHS06"]
[null,"DHS12"]
[null,"Template"]

{"sheet":"DHS06","index":4,"n_rows":1072,"n_cols":77,"rows_kept":1072,"cut":false,"hidden":false,"merged":[[346,52,347,52],[348,52,349,52],[350,52,351,52],[352,52,353,52],[152,52,156,52],[230,52,234,52],[270,52,272,52],[273,52,275,52],[276,52,283,52],[338,54,338,58],[338,59,338,63],[338,64,338,68],[340,52,341,52],[342,52,343,52],[344,52,345,52],[221,52,223,52],[224,52,225,52],[226,52,229,52],[258,54,258,58],[258,59,258,63],[258,64,258,68],[260,52,262,52],[263,52,266,52],[267,52,269,52],[119,64,119,68],[121,52,122,52],[123,52,126,52],[127,52,128,52],[132,54,132,58],[132,59,132,63],[132,64,132,68],[134,52,138,52],[219,54,219,58],[219,59,219,63],[219,64,219,68],[139,52,142,52],[13,64,13,68],[15,52,16,52],[17,52,20,52],[21,52,22,52],[26,54,26,58],[26,59,26,63],[26,64,26,68],[40,52,41,52],[55,54,55,58],[55,59,55,63],[55,64,55,68],[143,0,146,0],[143,52,146,52],[147,0,149,0],[147,52,149,52],[150,0,151,0],[150,52,151,52],[13,54,13,58],[13,59,13,63],[119,54,119,58],[119,59,119,63],[42,52,43,52],[44,52,45,52],[46,0,48,0],[46,52,48,52],[49,0,51,0],[49,52,51,52],[52,0,54,0],[52,52,54,52],[32,52,33,52],[34,52,35,52],[36,52,37,52],[38,0,39,0],[38,52,39,52],[13,2,13,6],[13,7,13,11],[28,52,29,52],[30,0,31,0],[30,52,31,52],[26,2,26,6],[26,7,26,11],[26,12,26,16],[13,12,13,16],[15,0,16,0],[17,0,20,0],[21,0,22,0],[23,0,25,0],[32,0,33,0],[55,2,55,6],[55,7,55,11],[55,12,55,16],[28,0,29,0],[34,0,35,0],[36,0,37,0],[40,0,41,0],[42,0,43,0],[44,0,45,0],[139,0,142,0],[119,7,119,11],[119,12,119,16],[57,0,65,0],[107,0,107,1],[121,0,122,0],[123,0,126,0],[127,0,128,0],[129,0,131,0],[132,2,132,6],[119,2,119,6],[132,7,132,11],[132,12,132,16],[134,0,138,0],[152,0,155,0],[201,0,203,0],[207,0,207,1],[219,2,219,6],[219,7,219,11],[1024,0,1024,2],[1025,0,1025,1],[1030,0,1032,0],[1033,0,1033,2],[412,2,412,3],[412,7,412,8],[416,2,416,3],[416,7,416,8],[420,2,420,3],[420,7,420,8],[424,2,424,3],[424,7,424,8],[428,2,428,3],[428,7,428,8],[432,2,432,3],[432,7,432,8],[436,2,436,3],[436,7,436,8],[440,2,440,3],[219,12,219,16],[221,0,223,0],[224,0,227,0],[401,1,444,1],[402,2,402,3],[402,7,402,8],[402,12,402,13],[403,2,403,3],[403,7,403,8],[403,12,403,13],[398,2,398,5],[398,7,398,10],[398,12,398,15],[399,2,399,4],[399,7,399,9],[399,12,399,14],[404,2,404,3],[404,7,404,8],[404,12,404,13],[405,2,405,3],[405,7,405,8],[405,12,405,13],[400,2,401,3],[400,7,401,8],[400,12,401,13],[408,2,408,3],[408,7,408,8],[408,12,408,13],[409,2,409,3],[409,7,409,8],[409,12,409,13],[406,2,406,3],[406,7,406,8],[406,12,406,13],[407,2,407,3],[407,7,407,8],[407,12,407,13],[412,12,412,13],[413,2,413,3],[413,7,413,8],[413,12,413,13],[410,2,410,3],[410,7,410,8],[410,12,410,13],[411,2,411,3],[411,7,411,8],[411,12,411,13],[416,12,416,13],[417,2,417,3],[417,7,417,8],[417,12,417,13],[414,2,414,3],[414,7,414,8],[414,12,414,13],[415,2,415,3],[415,7,415,8],[415,12,415,13],[420,12,420,13],[421,2,421,3],[421,7,421,8],[421,12,421,13],[418,2,418,3],[418,7,418,8],[418,12,418,13],[419,2,419,3],[419,7,419,8],[419,12,419,13],[424,12,424,13],[425,2,425,3],[425,7,425,8],[425,12,425,13],[422,2,422,3],[422,7,422,8],[422,12,422,13],[423,2,423,3],[423,7,423,8],[423,12,423,13],[428,12,428,13],[429,2,429,3],[429,7,429,8],[429,12,429,13],[426,2,426,3],[426,7,426,8],[426,12,426,13],[427,2,427,4],[427,7,427,9],[427,12,427,14],[432,12,432,13],[433,2,433,3],[433,7,433,8],[433,12,433,13],[430,2,430,3],[430,7,430,8],[430,12,430,13],[431,2,431,3],[431,7,431,8],[431,12,431,13],[436,12,436,13],[437,2,437,3],[437,7,437,8],[437,12,437,13],[434,2,434,3],[434,7,434,8],[434,12,434,13],[435,2,435,3],[435,7,435,8],[435,12,435,13],[440,7,440,8],[440,12,440,13],[441,2,441,3],[441,7,441,8],[441,12,441,13],[438,2,438,3],[438,7,438,8],[438,12,438,13],[439,2,439,3],[439,7,439,8],[439,12,439,13],[444,2,444,3],[444,7,444,8],[444,12,444,13],[445,2,445,3],[445,7,445,8],[445,12,445,13],[442,2,442,3],[442,7,442,8],[442,12,442,13],[443,2,443,3],[443,7,443,8],[443,12,443,13],[448,2,448,3],[448,7,448,8],[448,12,448,13],[449,2,449,3],[449,7,449,8],[449,12,449,13],[446,2,446,3],[446,7,446,8],[446,12,446,13],[447,2,447,3],[447,7,447,8],[447,12,447,13],[454,14,454,16],[452,2,452,3],[452,7,452,8],[452,12,452,13],[453,2,453,6],[453,7,453,11],[453,12,453,16],[450,2,450,3],[450,7,450,8],[450,12,450,13],[451,2,451,3],[451,7,451,8],[451,12,451,13],[456,2,456,3],[456,7,456,8],[456,12,456,13],[457,2,457,3],[457,7,457,8],[457,12,457,13],[454,2,455,3],[454,4,454,6],[454,7,455,8],[454,9,454,11],[454,12,455,13],[460,2,461,3],[460,7,461,8],[460,12,461,13],[462,2,462,3],[462,7,462,8],[462,12,462,13],[458,2,458,3],[458,7,458,8],[458,12,458,13],[459,2,459,4],[459,7,459,9],[459,12,459,14],[465,2,465,3],[465,7,465,8],[465,12,465,13],[466,2,466,3],[466,7,466,8],[466,12,466,13],[463,2,463,3],[463,7,463,8],[463,12,463,13],[464,2,464,3],[464,7,464,8],[464,12,464,13],[469,2,469,3],[469,7,469,8],[469,12,469,13],[470,2,470,3],[470,7,470,8],[470,12,470,13],[467,2,467,3],[467,7,467,8],[467,12,467,13],[468,2,468,3],[468,7,468,8],[468,12,468,13],[473,2,473,3],[473,7,473,8],[473,12,473,13],[474,2,474,3],[474,7,474,8],[474,12,474,13],[471,2,471,3],[471,7,471,8],[471,12,471,13],[472,2,472,3],[472,7,472,8],[472,12,472,13],[477,2,477,3],[477,7,477,8],[477,12,477,13],[478,2,478,3],[478,7,478,8],[478,12,478,13],[475,2,475,3],[475,7,475,8],[475,12,475,13],[476,2,476,3],[476,7,476,8],[476,12,476,13],[481,2,481,3],[481,7,481,8],[481,12,481,13],[482,2,482,3],[482,7,482,8],[482,12,482,13],[479,2,479,3],[479,7,479,8],[479,12,479,13],[480,2,480,3],[480,7,480,8],[480,12,480,13],[485,2,485,3],[485,7,485,8],[485,12,485,13],[486,2,486,4],[486,7,486,9],[486,12,486,14],[483,2,483,3],[483,7,483,8],[483,12,483,13],[484,2,484,3],[484,7,484,8],[484,12,484,13],[489,2,489,3],[489,7,489,8],[489,12,489,13],[490,2,490,3],[490,7,490,8],[490,12,490,13],[487,2,487,3],[487,7,487,8],[487,12,487,13],[488,2,488,3],[488,7,488,8],[488,12,488,13],[493,2,493,3],[493,7,493,8],[493,12,493,13],[494,2,494,3],[494,7,494,8],[494,12,494,13],[491,2,491,3],[491,7,491,8],[491,12,491,13],[492,2,492,3],[492,7,492,8],[492,12,492,13],[497,2,497,3],[497,7,497,8],[497,12,497,13],[498,2,498,3],[498,7,498,8],[498,12,498,13],[495,2,495,3],[495,7,495,8],[495,12,495,13],[496,2,496,3],[496,7,496,8],[496,12,496,13],[501,2,501,3],[501,7,501,8],[501,12,501,13],[502,2,502,3],[502,7,502,8],[502,12,502,13],[499,2,499,3],[499,7,499,8],[499,12,499,13],[500,2,500,3],[500,7,500,8],[500,12,500,13],[505,2,505,3],[505,7,505,8],[505,12,505,13],[506,2,506,3],[506,7,506,8],[506,12,506,13],[503,2,503,3],[503,7,503,8],[503,12,503,13],[504,2,504,3],[504,7,504,8],[504,12,504,13],[509,2,509,3],[509,7,509,8],[509,12,509,13],[510,2,510,3],[510,7,510,8],[510,12,510,13],[507,2,507,3],[507,7,507,8],[507,12,507,13],[508,2,508,3],[508,7,508,8],[508,12,508,13],[513,2,513,3],[513,7,513,8],[513,12,513,13],[514,2,514,3],[514,7,514,8],[514,12,514,13],[511,2,511,3],[511,7,511,8],[511,12,511,13],[512,2,512,3],[512,7,512,8],[512,12,512,13],[517,2,517,3],[517,7,517,8],[517,12,517,13],[518,2,518,3],[518,7,518,8],[518,12,518,13],[515,2,515,3],[515,7,515,8],[515,12,515,13],[516,2,516,3],[516,7,516,8],[516,12,516,13],[521,2,521,3],[521,7,521,8],[521,12,521,13],[522,2,522,3],[522,7,522,8],[522,12,522,13],[519,2,519,3],[519,7,519,8],[519,12,519,13],[520,2,520,3],[520,7,520,8],[520,12,520,13],[525,2,525,3],[525,7,525,8],[525,12,525,13],[526,2,526,3],[526,7,526,8],[526,12,526,13],[523,2,523,3],[523,7,523,8],[523,12,523,13],[524,2,524,3],[524,7,524,8],[524,12,524,13],[529,2,529,3],[529,7,529,8],[529,12,529,13],[530,2,530,3],[530,7,530,8],[530,12,530,13],[527,2,527,3],[527,7,527,8],[527,12,527,13],[528,2,528,3],[528,7,528,8],[528,12,528,13],[533,2,533,3],[533,7,533,8],[533,12,533,13],[534,2,534,3],[534,7,534,8],[534,12,534,13],[531,2,531,3],[531,7,531,8],[531,12,531,13],[532,2,532,3],[532,7,532,8],[532,12,532,13],[537,2,537,3],[537,7,537,8],[537,12,537,13],[538,2,538,3],[538,7,538,8],[538,12,538,13],[535,2,535,3],[535,7,535,8],[535,12,535,13],[536,2,536,3],[536,7,536,8],[536,12,536,13],[541,2,541,3],[541,7,541,8],[541,12,541,13],[542,2,542,3],[542,7,542,8],[542,12,542,13],[539,2,539,3],[539,7,539,8],[539,12,539,13],[540,2,540,3],[540,7,540,8],[540,12,540,13],[545,2,545,3],[545,7,545,8],[545,12,545,13],[546,2,546,3],[546,7,546,8],[546,12,546,13],[543,2,543,3],[543,7,543,8],[543,12,543,13],[544,2,544,3],[544,7,544,8],[544,12,544,13],[549,2,549,3],[549,7,549,8],[549,12,549,13],[550,2,550,3],[550,7,550,8],[550,12,550,13],[547,2,547,3],[547,7,547,8],[547,12,547,13],[548,2,548,3],[548,7,548,8],[548,12,548,13],[553,2,553,3],[553,7,553,8],[553,12,553,13],[554,2,554,3],[554,7,554,8],[554,12,554,13],[551,2,551,3],[551,7,551,8],[551,12,551,13],[552,2,552,3],[552,7,552,8],[552,12,552,13],[557,2,557,3],[557,7,557,8],[557,12,557,13],[558,2,558,3],[558,7,558,8],[558,12,558,13],[555,2,555,3],[555,7,555,8],[555,12,555,13],[556,2,556,3],[556,7,556,8],[556,12,556,13],[561,2,561,3],[561,7,561,8],[561,12,561,13],[562,2,562,3],[562,7,562,8],[562,12,562,13],[559,2,559,3],[559,7,559,8],[559,12,559,13],[560,2,560,3],[560,7,560,8],[560,12,560,13],[565,2,565,3],[565,7,565,8],[565,12,565,13],[566,2,566,3],[566,7,566,8],[566,12,566,13],[563,2,563,3],[563,7,563,8],[563,12,563,13],[564,2,564,3],[564,7,564,8],[564,12,564,13],[569,2,569,3],[569,7,569,8],[569,12,569,13],[570,2,570,3],[570,7,570,8],[570,12,570,13],[567,2,567,3],[567,7,567,8],[567,12,567,13],[568,2,568,3],[568,7,568,8],[568,12,568,13],[573,2,573,3],[573,7,573,8],[573,12,573,13],[574,2,574,3],[574,7,574,8],[574,12,574,13],[571,2,571,3],[571,7,571,8],[571,12,571,13],[572,2,572,3],[572,7,572,8],[572,12,572,13],[577,2,577,3],[577,7,577,8],[577,12,577,13],[578,2,578,3],[578,7,578,8],[578,12,578,13],[575,2,575,3],[575,7,575,8],[575,12,575,13],[576,2,576,3],[576,7,576,8],[576,12,576,13],[581,2,581,3],[581,7,581,8],[581,12,581,13],[582,2,582,3],[582,7,582,8],[582,12,582,13],[579,2,579,3],[579,7,579,8],[579,12,579,13],[580,2,580,3],[580,7,580,8],[580,12,580,13],[585,2,585,3],[585,7,585,8],[585,12,585,13],[586,2,586,3],[586,7,586,8],[586,12,586,13],[583,2,583,3],[583,7,583,8],[583,12,583,13],[584,2,584,3],[584,7,584,8],[584,12,584,13],[589,2,589,3],[589,7,589,8],[589,12,589,13],[590,2,590,3],[590,7,590,8],[590,12,590,13],[587,2,587,3],[587,7,587,8],[587,12,587,13],[588,2,588,3],[588,7,588,8],[588,12,588,13],[593,2,593,3],[593,7,593,8],[593,12,593,13],[594,2,594,3],[594,7,594,8],[594,12,594,13],[591,2,591,3],[591,7,591,8],[591,12,591,13],[592,2,592,3],[592,7,592,8],[592,12,592,13],[597,2,597,3],[597,7,597,8],[597,12,597,13],[598,2,598,3],[598,7,598,8],[598,12,598,13],[595,2,595,3],[595,7,595,8],[595,12,595,13],[596,2,596,3],[596,7,596,8],[596,12,596,13],[601,2,601,3],[601,7,601,8],[601,12,601,13],[602,2,602,3],[602,7,602,8],[602,12,602,13],[599,2,599,3],[599,7,599,8],[599,12,599,13],[600,2,600,3],[600,7,600,8],[600,12,600,13],[605,2,605,3],[605,7,605,8],[605,12,605,13],[606,2,606,3],[606,7,606,8],[606,12,606,13],[603,2,603,3],[603,7,603,8],[603,12,603,13],[604,2,604,3],[604,7,604,8],[604,12,604,13],[609,2,609,3],[609,7,609,8],[609,12,609,13],[610,2,610,3],[610,7,610,8],[610,12,610,13],[607,2,607,3],[607,7,607,8],[607,12,607,13],[608,2,608,3],[608,7,608,8],[608,12,608,13],[613,2,613,3],[613,7,613,8],[613,12,613,13],[614,2,614,3],[614,7,614,8],[614,12,614,13],[611,2,611,3],[611,7,611,8],[611,12,611,13],[612,2,612,3],[612,7,612,8],[612,12,612,13],[617,2,617,3],[617,7,617,8],[617,12,617,13],[618,2,618,3],[618,7,618,8],[618,12,618,13],[615,2,615,3],[615,7,615,8],[615,12,615,13],[616,2,616,3],[616,7,616,8],[616,12,616,13],[621,2,621,3],[621,7,621,8],[621,12,621,13],[622,2,622,3],[622,7,622,8],[622,12,622,13],[619,2,619,3],[619,7,619,8],[619,12,619,13],[620,2,620,3],[620,7,620,8],[620,12,620,13],[625,2,625,3],[625,7,625,8],[625,12,625,13],[626,2,626,3],[626,7,626,8],[626,12,626,13],[623,2,623,3],[623,7,623,8],[623,12,623,13],[624,2,624,3],[624,7,624,8],[624,12,624,13],[629,2,629,3],[629,7,629,8],[629,12,629,13],[630,2,630,3],[630,7,630,8],[630,12,630,13],[627,2,627,3],[627,7,627,8],[627,12,627,13],[628,2,628,3],[628,7,628,8],[628,12,628,13],[633,2,633,3],[633,7,633,8],[633,12,633,13],[634,2,634,3],[634,7,634,8],[634,12,634,13],[631,2,631,3],[631,7,631,8],[631,12,631,13],[632,2,632,3],[632,7,632,8],[632,12,632,13],[637,2,637,3],[637,7,637,8],[637,12,637,13],[638,2,638,3],[638,7,638,8],[638,12,638,13],[635,2,635,3],[635,7,635,8],[635,12,635,13],[636,2,636,3],[636,7,636,8],[636,12,636,13],[641,2,641,3],[641,7,641,8],[641,12,641,13],[642,2,642,3],[642,7,642,8],[642,12,642,13],[639,2,639,3],[639,7,639,8],[639,12,639,13],[640,2,640,3],[640,7,640,8],[640,12,640,13],[645,2,645,3],[645,7,645,8],[645,12,645,13],[646,2,646,3],[646,7,646,8],[646,12,646,13],[643,2,643,3],[643,7,643,8],[643,12,643,13],[644,2,644,3],[644,7,644,8],[644,12,644,13],[649,2,649,3],[649,7,649,8],[649,12,649,13],[650,2,650,3],[650,7,650,8],[650,12,650,13],[647,2,647,3],[647,7,647,8],[647,12,647,13],[648,2,648,3],[648,7,648,8],[648,12,648,13],[653,2,653,3],[653,7,653,8],[653,12,653,13],[654,2,654,3],[654,7,654,8],[654,12,654,13],[651,2,651,3],[651,7,651,8],[651,12,651,13],[652,2,652,3],[652,7,652,8],[652,12,652,13],[657,2,657,3],[657,7,657,8],[657,12,657,13],[658,2,658,3],[658,7,658,8],[658,12,658,13],[655,2,655,3],[655,7,655,8],[655,12,655,13],[656,2,656,3],[656,7,656,8],[656,12,656,13],[661,2,661,3],[661,7,661,8],[661,12,661,13],[662,2,662,3],[662,7,662,8],[662,12,662,13],[659,2,659,3],[659,7,659,8],[659,12,659,13],[660,2,660,3],[660,7,660,8],[660,12,660,13],[665,2,665,3],[665,7,665,8],[665,12,665,13],[666,2,666,3],[666,7,666,8],[666,12,666,13],[663,2,663,3],[663,7,663,8],[663,12,663,13],[664,2,664,3],[664,7,664,8],[664,12,664,13],[669,2,669,3],[669,7,669,8],[669,12,669,13],[670,2,670,3],[670,7,670,8],[670,12,670,13],[667,2,667,3],[667,7,667,8],[667,12,667,13],[668,2,668,3],[668,7,668,8],[668,12,668,13],[673,2,673,3],[673,7,673,8],[673,12,673,13],[674,2,674,3],[674,7,674,8],[674,12,674,13],[671,2,671,3],[671,7,671,8],[671,12,671,13],[672,2,672,3],[672,7,672,8],[672,12,672,13],[677,2,677,3],[677,7,677,8],[677,12,677,13],[678,2,678,3],[678,7,678,8],[678,12,678,13],[675,2,675,3],[675,7,675,8],[675,12,675,13],[676,2,676,3],[676,7,676,8],[676,12,676,13],[681,2,681,3],[681,7,681,8],[681,12,681,13],[682,2,682,3],[682,7,682,8],[682,12,682,13],[679,2,679,3],[679,7,679,8],[679,12,679,13],[680,2,680,3],[680,7,680,8],[680,12,680,13],[685,2,685,3],[685,7,685,8],[685,12,685,13],[686,2,686,3],[686,7,686,8],[686,12,686,13],[683,2,683,3],[683,7,683,8],[683,12,683,13],[684,2,684,3],[684,7,684,8],[684,12,684,13],[689,2,689,3],[689,7,689,8],[689,12,689,13],[687,2,687,3],[687,7,687,8],[687,12,687,13],[688,2,688,3],[688,7,688,8],[688,12,688,13]]}
[]
[{"$f":"A1026","v":"Niger"}]
[{"$f":"A1034","v":"2006"}]
["Use of drinking water sources"]
[" by wealth quintile and sub-national region"]
["Notes:"]
["WHO/UNICEF JMP customised wealth index excludes water,"]
[" sanitation and hygiene assets."]
["Survey used for analysis:",{"$f":"A1025","v":"DHS06"}]
["Improved springs based on:","DHS12"]
["Time to source based on:","DHS12"]
[]
[]
["Use of drinking water sources",null,"NATIONAL wealth index quintile",null,null,null,null,"URBAN wealth index quintile",null,null,null,null,"RURAL wealth index quintile",null,null,null,null,"SUB-REGIONS:",null,null,null,null,null,null,null,null,null,null,null,null,null,null,null,null,null,null,null,null,null,null,null,null,null,null,null,null,null,null,null,null,null,null,"Raw numbers of respondents:","Use of drinking water sources","NATIONAL wealth index quintile",null,null,null,null,"URBAN wealth index quintile",null,null,null,null,"RURAL wealth index quintile",null,null,null,null,"SUB-REGIONS:"]
["Weighted percentage (used in graphs)",null,"Poorest","Poor","Middle","Rich","Richest","Poorest","Poor","Middle","Rich","Richest","Poorest","Poor","Middle","Rich","Richest","Agadez","Diffa","Dosso","Maradi","Niamey","Tahoua","Tillabéri","Zinder",null,null,null,null,null,null,null,null,null,null,null,null,null,null,null,null,null,null,null,null,null,null,null,null,null,null,null,"Water data, raw numbers (weighted)",null,"Poorest","Poor","Middle","Rich","Richest","Poorest","Poor","Middle","Rich","Richest","Poorest","Poor","Middle","Rich","Richest","Agadez","Diffa","Dosso","Maradi","Niamey","Tahoua","Tillabéri","Zinder"]
["Water","Improved",{"$f":"C58+C59+C60+(C61+C62)*'DHS12'!C24/100+C63*'DHS12'!C25/100","v":46.885750733193248},{"$f":"D58+D59+D60+(D61+D62)*'DHS12'!D24/100+D63*'DHS12'!D25/100","v":42.996809677016216},{"$f":"E58+E59+E60+(E61+E62)*'DHS12'!E24/100+E63*'DHS12'!E25/100","v":45.80088898173166},{"$f":"F58+F59+F60+(F61+F62)*'DHS12'!F24/100+F63*'DHS12'!F25/100","v":44.703968106164368},{"$f":"G58+G59+G60+(G61+G62)*'DHS12'!G24/100+G63*'DHS12'!G25/100","v":82.563039991797908},{"$f":"H58+H59+H60+(H61+H62)*'DHS12'!H24/100+H63*'DHS12'!H25/100","v":84.364623734454597},{"$f":"I58+I59+I60+(I61+I62)*'DHS12'!I24/100+I63*'DHS12'!I25/100","v":91.078429625841721},{"$f":"J58+J59+J60+(J61+J62)*'DHS12'!J24/100+J63*'DHS12'!J25/100","v":97.463366687447987},{"$f":"K58+K59+K60+(K61+K62)*'DHS12'!K24/100+K63*'DHS12'!K25/100","v":95.843336924097372},{"$f":"L58+L59+L60+(L61+L62)*'DHS12'!L24/100+L63*'DHS12'!L25/100","v":97.250970283768112},{"$f":"M58+M59+M60+(M61+M62)*'DHS12'!M24/100+M63*'DHS12'!M25/100","v":42.832148439971675},{"$f":"N58+N59+N60+(N61+N62)*'DHS12'!N24/100+N63*'DHS12'!N25/100","v":42.592498041787863},{"$f":"O58+O59+O60+(O61+O62)*'DHS12'!O24/100+O63*'DHS12'!O25/100","v":45.484018260439591},{"$f":"P58+P59+P60+(P61+P62)*'DHS12'!P24/100+P63*'DHS12'!P25/100","v":42.420777263899005},{"$f":"Q58+Q59+Q60+(Q61+Q62)*'DHS12'!Q24/100+Q63*'DHS12'!Q25/100","v":44.742808583908364},{"$f":"R58+R59+R60+(R61+R62)*'DHS12'!R24/100+R63*'DHS12'!R25/100","v":68.601653374755358},{"$f":"S58+S59+S60+(S61+S62)*'DHS12'!S24/100+S63*'DHS12'!S25/100","v":66.119835365207024},{"$f":"T58+T59+T60+(T61+T62)*'DHS12'!T24/100+T63*'DHS12'!T25/100","v":31.830015817942193},{"$f":"U58+U59+U60+(U61+U62)*'DHS12'!U24/100+U63*'DHS12'!U25/100","v":58.376775224109814},{"$f":"V58+V59+V60+(V61+V62)*'DHS12'!V24/100+V63*'DHS12'!V25/100","v":94.184189477835503},{"$f":"W58+W59+W60+(W61+W62)*'DHS12'!W24/100+W63*'DHS12'!W25/100","v":46.824787723816705},{"$f":"X58+X59+X60+(X61+X62)*'DHS12'!X24/100+X63*'DHS12'!X25/100","v":59.835527041219237},{"$f":"Y58+Y59+Y60+(Y61+Y62)*'DHS12'!Y24/100+Y63*'DHS12'!Y25/100","v":46.061361206785051},null,null,null,null,null,null,null,null,null,null,null,null,null,null,null,null,null,null,null,null,null,null,null,null,null,null,null,"Water","Improved","N/A","N/A","N/A","N/A","N/A","N/A","N/A","N/A","N/A","N/A","N/A","N/A","N/A","N/A","N/A","N/A","N/A","N/A","N/A","N/A","N/A","N/A","N/A"]
[null,"Not Improved",{"$f":"100-C16","v":53.114249266806752},{"$f":"100-D16","v":57.003190322983784},54.19911101826834,55.296031893835632,17.436960008202092,15.635376265545403,8.9215703741582786,2.5366333125520129,4.1566630759026282,2.7490297162318882,57.167851560028325,57.407501958212137,54.515981739560409,57.579222736100995,55.257191416091636,31.398346625244642,33.880164634792976,68.169984182057803,41.623224775890186,5.8158105221644973,53.175212276183295,40.164472958780763,53.938638793214949,null,null,null,null,null,null,null,null,null,null,null,null,null,null,null,null,null,null,null,null,null,null,null,null,null,null,null,null,"Not Improved","N/A","N/A","N/A","N/A","N/A","N/A","N/A","N/A","N/A","N/A","N/A","N/A","N/A","N/A","N/A","N/A","N/A","N/A","N/A","N/A","N/A","N/A","N/A"]
["Water ladder","Basic",{"$f":"C16*'DHS12'!C23/100","v":31.272795739039896},{"$f":"D16*'DHS12'!D23/100","v":27.646948622321425},{"$f":"E16*'DHS12'!E23/100","v":29.770577838125579},{"$f":"F16*'DHS12'!F23/100","v":31.337481642421221},{"$f":"G16*'DHS12'!G23/100","v":70.013457913044618},{"$f":"H16*'DHS12'!H23/100","v":67.322969740094763},{"$f":"I16*'DHS12'!I23/100","v":76.505880885707043},{"$f":"J16*'DHS12'!J23/100","v":88.594200318890231},{"$f":"K16*'DHS12'!K23/100","v":89.32599001325876},{"$f":"L16*'DHS12'!L23/100","v":94.819696026673896},{"$f":"M16*'DHS12'!M23/100","v":28.183553673501361},{"$f":"N16*'DHS12'!N23/100","v":26.535126280033836},{"$f":"O16*'DHS12'!O23/100","v":29.882999997108815},{"$f":"P16*'DHS12'!P23/100","v":27.912871439645546},{"$f":"Q16*'DHS12'!Q23/100","v":30.380367028473785},{"$f":"R16*'DHS12'!R23/100","v":62.701911184526395},{"$f":"S16*'DHS12'!S23/100","v":59.573971664051527},{"$f":"T16*'DHS12'!T23/100","v":25.750482796715236},{"$f":"U16*'DHS12'!U23/100","v":30.822937318329981},{"$f":"V16*'DHS12'!V23/100","v":91.170295414544768},{"$f":"W16*'DHS12'!W23/100","v":35.961436971891231},{"$f":"X16*'DHS12'!X23/100","v":46.432368983986123},{"$f":"Y16*'DHS12'!Y23/100","v":28.972596199067798},null,null,null,null,null,null,null,null,null,null,null,null,null,null,null,null,null,null,null,null,null,null,null,null,null,null,null,"Water ladder","Basic","N/A","N/A","N/A","N/A","N/A","N/A","N/A","N/A","N/A","N/A","N/A","N/A","N/A","N/A","N/A","N/A","N/A","N/A","N/A","N/A","N/A","N/A","N/A"]
[null,"Limited",{"$f":"C16*'DHS12'!C22/100","v":15.612954994153352},{"$f":"D16*'DHS12'!D22/100","v":15.349861054694792},{"$f":"E16*'DHS12'!E22/100","v":16.030311143606081},{"$f":"F16*'DHS12'!F22/100","v":13.366486463743145},{"$f":"G16*'DHS12'!G22/100","v":12.54958207875328},{"$f":"H16*'DHS12'!H22/100","v":17.04165399435983},{"$f":"I16*'DHS12'!I22/100","v":14.572548740134675},{"$f":"J16*'DHS12'!J22/100","v":8.8691663685577673},{"$f":"K16*'DHS12'!K22/100","v":6.5173469108386213},{"$f":"L16*'DHS12'!L22/100","v":2.4312742570942025},{"$f":"M16*'DHS12'!M22/100","v":14.648594766470314},{"$f":"N16*'DHS12'!N22/100","v":16.057371761754027},{"$f":"O16*'DHS12'!O22/100","v":15.601018263330777},{"$f":"P16*'DHS12'!P22/100","v":14.507905824253463},{"$f":"Q16*'DHS12'!Q22/100","v":14.362441555434586},{"$f":"R16*'DHS12'!R22/100","v":5.8997421902289604},{"$f":"S16*'DHS12'!S22/100","v":6.5458637011554961},{"$f":"T16*'DHS12'!T22/100","v":6.0795330212269594},{"$f":"U16*'DHS12'!U22/100","v":27.553837905779833},{"$f":"V16*'DHS12'!V22/100","v":3.0138940632907363},{"$f":"W16*'DHS12'!W22/100","v":10.863350751925475},{"$f":"X16*'DHS12'!X22/100","v":13.403158057233108},{"$f":"Y16*'DHS12'!Y22/100","v":17.088765007717253},null,null,null,null,null,null,null,null,null,null,null,null,null,null,null,null,null,null,null,null,null,null,null,null,null,null,null,null,"Limited","N/A","N/A","N/A","N/A","N/A","N/A","N/A","N/A","N/A","N/A","N/A","N/A","N/A","N/A","N/A","N/A","N/A","N/A","N/A","N/A","N/A","N/A","N/A"]
[null,"Unimproved",{"$f":"100-(C18+C19+C21)","v":51.826186319864739},{"$f":"100-(D18+D19+D21)","v":55.727335301417455},52.680958792229404,52.619661174992778,17.130347646381665,15.595097124049516,8.8613553410122705,2.5366333125519986,4.156663075902614,2.7490297162319024,55.745610062662784,56.423230096716999,52.903243535154211,55.465000165247062,52.828729178588766,31.025618824228232,33.880164634792976,68.169984182057803,41.537087645307153,5.8158105221644973,53.175212276183295,30.38485133400674,53.938638793214949,null,null,null,null,null,null,null,null,null,null,null,null,null,null,null,null,null,null,null,null,null,null,null,null,null,null,null,null,"Unimproved","N/A","N/A","N/A","N/A","N/A","N/A","N/A","N/A","N/A","N/A","N/A","N/A","N/A","N/A","N/A","N/A","N/A","N/A","N/A","N/A","N/A","N/A","N/A"]
[null,"Surface water",{"$f":"C64","v":1.2880629469420131},1.2758550215663325,1.518152226038938,2.6763707188428509,0.306612361820435,4.0279141495893608E-2,6.0215033146006409E-2,0,0,0,1.4222414973655431,0.98427186149513979,1.6127382044061986,2.1142225708539226,2.4284622375028637,0.37272780101641068,0,0,8.6137130583030658E-2,0,0,9.779621624774034,0,null,null,null,null,null,null,null,null,null,null,null,null,null,null,null,null,null,null,null,null,null,null,null,null,null,null,null,null,"Surface water","N/A","N/A","N/A","N/A","N/A","N/A","N/A","N/A","N/A","N/A","N/A","N/A","N/A","N/A","N/A","N/A","N/A","N/A","N/A","N/A","N/A","N/A","N/A"]
["Improved water point at more than 30 minutes","Yes","N/A","N/A","N/A","N/A","N/A","N/A","N/A","N/A","N/A","N/A","N/A","N/A","N/A","N/A","N/A","N/A","N/A","N/A","N/A","N/A","N/A","N/A","N/A",null,null,null,null,null,null,null,null,null,null,null,null,null,null,null,null,null,null,null,null,null,null,null,null,null,null,null,"Improved water point at more than 30 minutes","Yes","N/A","N/A","N/A","N/A","N/A","N/A","N/A","N/A","N/A","N/A","N/A","N/A","N/A","N/A","N/A","N/A","N/A","N/A","N/A","N/A","N/A","N/A","N/A"]
[null,"No","N/A","N/A","N/A","N/A","N/A","N/A","N/A","N/A","N/A","N/A","N/A","N/A","N/A","N/A","N/A","N/A","N/A","N/A","N/A","N/A","N/A","N/A","N/A",null,null,null,null,null,null,null,null,null,null,null,null,null,null,null,null,null,null,null,null,null,null,null,null,null,null,null,null,"No","N/A","N/A","N/A","N/A","N/A","N/A","N/A","N/A","N/A","N/A","N/A","N/A","N/A","N/A","N/A","N/A","N/A","N/A","N/A","N/A","N/A","N/A","N/A"]
["Manually calculated ratios","Improved wells"]
[null,"Improved springs"]
[null,"Other"]
[null,null,"NATIONAL wealth index quintile",null,null,null,null,"URBAN wealth index quintile",null,null,null,null,"RURAL wealth index quintile",null,null,null,null,"SUB-REGIONS:",null,null,null,null,null,null,null,null,null,null,null,null,null,null,null,null,null,null,null,null,null,null,null,null,null,null,null,null,null,null,null,null,null,null,"Raw numbers of respondents:","Use of drinking water sources","NATIONAL wealth index quintile",null,null,null,null,"URBAN wealth index quintile",null,null,null,null,"RURAL wealth index quintile",null,null,null,null,"SUB-REGIONS:"]
["Percentage based on weighted population",null,"Poorest","Poor","Middle","Rich","Richest","Poorest","Poor","Middle","Rich","Richest","Poorest","Poor","Middle","Rich","Richest","Agadez","Diffa","Dosso","Maradi","Niamey","Tahoua","Tillabéri","Zinder",null,null,null,null,null,null,null,null,null,null,null,null,null,null,null,null,null,null,null,null,null,null,null,null,null,null,null,"Water data, raw numbers (weighted)",null,"Poorest","Poor","Middle","Rich","Richest","Poorest","Poor","Middle","Rich","Richest","Poorest","Poor","Middle","Rich","Richest","Agadez","Diffa","Dosso","Maradi","Niamey","Tahoua","Tillabéri","Zinder"]
["Piped water","Yes",13.048490524198295,6.4516448820350885,9.5867828851265706,14.234116579441261,71.570708892481491,78.369931642383676,88.53099166505072,94.58823277219588,95.843336924097414,96.721316525121964,5.9142642381426089,5.1719177344877183,9.0810736517871771,7.7638931534301143,12.681242529531067,52.354140129033368,25.684631772624407,13.589126948402392,15.26788356302583,91.255074946127351,20.315845726727673,6.0301216864346756,22.755605037957054,null,null,null,null,null,null,null,null,null,null,null,null,null,null,null,null,null,null,null,null,null,null,null,null,null,null,null,"Piped water","Yes","N/A","N/A","N/A","N/A","N/A","N/A","N/A","N/A","N/A","N/A","N/A","N/A","N/A","N/A","N/A","N/A","N/A","N/A","N/A","N/A","N/A","N/A","N/A"]
[null,"No",86.9515094758017,93.54835511796496,90.413217114873419,85.765883420558836,28.42929110751858,21.630068357616299,11.46900833494929,5.4117672278041091,4.1566630759026086,3.2786834748780183,94.085735761857393,94.828082265512279,90.918926348212864,92.236106846569882,87.318757470468995,47.645859870966689,74.315368227375643,86.410873051597562,84.732116436974238,8.7449250538726897,79.684154273272284,93.969878313565374,77.24439496204289,null,null,null,null,null,null,null,null,null,null,null,null,null,null,null,null,null,null,null,null,null,null,null,null,null,null,null,null,"No","N/A","N/A","N/A","N/A","N/A","N/A","N/A","N/A","N/A","N/A","N/A","N/A","N/A","N/A","N/A","N/A","N/A","N/A","N/A","N/A","N/A","N/A","N/A"]
["Piped water on premises","Yes",0.55978308901721974,0.16556215077981037,0.35277393838905402,0.90008893349004282,34.582001436003026,8.764506751329991,19.968825845179328,33.519631382068468,56.347722705291659,82.09102213528098,0,4.7758796956692953E-2,0,2.5895485735466597E-2,0.50176700641757477,27.828756602366735,7.5600615675553557,3.3248262787100962,4.5598353616421026,43.578764492364577,3.7723972240790502,2.5429023035644618,3.7135382224895293,null,null,null,null,null,null,null,null,null,null,null,null,null,null,null,null,null,null,null,null,null,null,null,null,null,null,null,"Piped water on premises","Yes","N/A","N/A","N/A","N/A","N/A","N/A","N/A","N/A","N/A","N/A","N/A","N/A","N/A","N/A","N/A","N/A","N/A","N/A","N/A","N/A","N/A","N/A","N/A"]
[null,"No",99.440216910982784,99.834437849220151,99.647226061610979,99.099911066509961,65.417998563997031,91.235493248669968,80.03117415482069,66.480368617931518,43.652277294708327,17.908977864719077,100,99.952241203043314,100,99.974104514264525,99.49823299358242,72.171243397633276,92.439938432444592,96.675173721289866,95.440164638357956,56.421235507635338,96.227602775920758,97.45709769643554,96.286461777510439,null,null,null,null,null,null,null,null,null,null,null,null,null,null,null,null,null,null,null,null,null,null,null,null,null,null,null,null,"No","N/A","N/A","N/A","N/A","N/A","N/A","N/A","N/A","N/A","N/A","N/A","N/A","N/A","N/A","N/A","N/A","N/A","N/A","N/A","N/A","N/A","N/A","N/A"]
["Piped water into dwelling","Yes","N/A","N/A","N/A","N/A","N/A","N/A","N/A","N/A","N/A","N/A","N/A","N/A","N/A","N/A","N/A","N/A","N/A","N/A","N/A","N/A","N/A","N/A","N/A",null,null,null,null,null,null,null,null,null,null,null,null,null,null,null,null,null,null,null,null,null,null,null,null,null,null,null,"Piped water into dwelling","Yes","N/A","N/A","N/A","N/A","N/A","N/A","N/A","N/A","N/A","N/A","N/A","N/A","N/A","N/A","N/A","N/A","N/A","N/A","N/A","N/A","N/A","N/A","N/A"]
[null,"No","N/A","N/A","N/A","N/A","N/A","N/A","N/A","N/A","N/A","N/A","N/A","N/A","N/A","N/A","N/A","N/A","N/A","N/A","N/A","N/A","N/A","N/A","N/A",null,null,null,null,null,null,null,null,null,null,null,null,null,null,null,null,null,null,null,null,null,null,null,null,null,null,null,null,"No","N/A","N/A","N/A","N/A","N/A","N/A","N/A","N/A","N/A","N/A","N/A","N/A","N/A","N/A","N/A","N/A","N/A","N/A","N/A","N/A","N/A","N/A","N/A"]
["Water source on premises","Yes",5.9414624177548188,5.4992760305194546,4.8678614555112221,10.723568102172621,46.516880155158532,23.444907687099562,32.248416378859197,43.037638706909433,65.473934413062381,87.302297244147468,4.3978204014911055,4.0983933186814534,5.2899268914198316,6.1661063739504813,14.564478681206827,33.178251348195062,10.229738403205468,8.4877265767754508,11.946260904396008,54.910658603566752,7.3155200593325613,17.87097458580174,10.137712066444511,null,null,null,null,null,null,null,null,null,null,null,null,null,null,null,null,null,null,null,null,null,null,null,null,null,null,null,"Water source on premises","Yes","N/A","N/A","N/A","N/A","N/A","N/A","N/A","N/A","N/A","N/A","N/A","N/A","N/A","N/A","N/A","N/A","N/A","N/A","N/A","N/A","N/A","N/A","N/A"]
[null,"No",94.058537582245123,94.500723969480504,95.132138544488811,89.27643189782745,53.48311984484149,76.555092312900371,67.751583621140782,56.962361293090538,34.526065586937612,12.697702755852571,95.602179598508883,95.901606681318512,94.710073108580133,93.833893626049488,85.43552131879315,66.821748651804967,89.770261596794526,91.512273423224485,88.053739095603987,45.08934139643317,92.684479940667302,82.129025414198381,89.862287933555535,null,null,null,null,null,null,null,null,null,null,null,null,null,null,null,null,null,null,null,null,null,null,null,null,null,null,null,null,"No","N/A","N/A","N/A","N/A","N/A","N/A","N/A","N/A","N/A","N/A","N/A","N/A","N/A","N/A","N/A","N/A","N/A","N/A","N/A","N/A","N/A","N/A","N/A"]
["Improved Water source on premises","Yes","N/A","N/A","N/A","N/A","N/A","N/A","N/A","N/A","N/A","N/A","N/A","N/A","N/A","N/A","N/A","N/A","N/A","N/A","N/A","N/A","N/A","N/A","N/A",null,null,null,null,null,null,null,null,null,null,null,null,null,null,null,null,null,null,null,null,null,null,null,null,null,null,null,"Improved water source on premises","Yes","N/A","N/A","N/A","N/A","N/A","N/A","N/A","N/A","N/A","N/A","N/A","N/A","N/A","N/A","N/A","N/A","N/A","N/A","N/A","N/A","N/A","N/A","N/A"]
[null,"No","N/A","N/A","N/A","N/A","N/A","N/A","N/A","N/A","N/A","N/A","N/A","N/A","N/A","N/A","N/A","N/A","N/A","N/A","N/A","N/A","N/A","N/A","N/A",null,null,null,null,null,null,null,null,null,null,null,null,null,null,null,null,null,null,null,null,null,null,null,null,null,null,null,null,"No","N/A","N/A","N/A","N/A","N/A","N/A","N/A","N/A","N/A","N/A","N/A","N/A","N/A","N/A","N/A","N/A","N/A","N/A","N/A","N/A","N/A","N/A","N/A"]
["Piped water on premises available when needed","Yes","N/A","N/A","N/A","N/A","N/A","N/A","N/A","N/A","N/A","N/A","N/A","N/A","N/A","N/A","N/A","N/A","N/A","N/A","N/A","N/A","N/A","N/A","N/A",null,null,null,null,null,null,null,null,null,null,null,null,null,null,null,null,null,null,null,null,null,null,null,null,null,null,null,"Piped water on premises available when needed","Yes","N/A","N/A","N/A","N/A","N/A","N/A","N/A","N/A","N/A","N/A","N/A","N/A","N/A","N/A","N/A","N/A","N/A","N/A","N/A","N/A","N/A","N/A","N/A"]
[null,"No","N/A","N/A","N/A","N/A","N/A","N/A","N/A","N/A","N/A","N/A","N/A","N/A","N/A","N/A","N/A","N/A","N/A","N/A","N/A","N/A","N/A","N/A","N/A",null,null,null,null,null,null,null,null,null,null,null,null,null,null,null,null,null,null,null,null,null,null,null,null,null,null,null,null,"No","N/A","N/A","N/A","N/A","N/A","N/A","N/A","N/A","N/A","N/A","N/A","N/A","N/A","N/A","N/A","N/A","N/A","N/A","N/A","N/A","N/A","N/A","N/A"]
["Water point at more than 30 minutes","Yes",35.311763009291766,33.802477498998179,32.915954191688428,25.946307976186105,5.5145258501939898,9.8102808506811368,3.0223994662365272,1.3252605199244074,0.6956309176216765,0.23726228542432587,38.14443655178016,33.345552494391399,37.175603074345283,28.943029109827339,21.365995145392215,22.195915036217695,14.984096677324244,22.431966886851949,22.764701358418613,0.5594828470960268,34.529928871946453,35.212719240000688,31.810175653493715,null,null,null,null,null,null,null,null,null,null,null,null,null,null,null,null,null,null,null,null,null,null,null,null,null,null,null,"Water point at more than 30 minutes","Yes","N/A","N/A","N/A","N/A","N/A","N/A","N/A","N/A","N/A","N/A","N/A","N/A","N/A","N/A","N/A","N/A","N/A","N/A","N/A","N/A","N/A","N/A","N/A"]
[null,"No",64.688236990708248,66.197522501001657,67.084045808311487,74.053692023813923,94.485474149806009,90.189719149318819,96.977600533763479,98.674739480075573,99.304369082378315,99.762737714575692,61.855563448219833,66.654447505608402,62.824396925654646,71.056970890172508,78.634004854607724,77.804084963782358,85.015903322675797,77.568033113147905,77.235298641581366,99.440517152903979,65.470071128053348,64.787280759999163,68.189824346506185,null,null,null,null,null,null,null,null,null,null,null,null,null,null,null,null,null,null,null,null,null,null,null,null,null,null,null,null,"No","N/A","N/A","N/A","N/A","N/A","N/A","N/A","N/A","N/A","N/A","N/A","N/A","N/A","N/A","N/A","N/A","N/A","N/A","N/A","N/A","N/A","N/A","N/A"]
["Water source available when needed","Yes","N/A","N/A","N/A","N/A","N/A","N/A","N/A","N/A","N/A","N/A","N/A","N/A","N/A","N/A","N/A","N/A","N/A","N/A","N/A","N/A","N/A","N/A","N/A",null,null,null,null,null,null,null,null,null,null,null,null,null,null,null,null,null,null,null,null,null,null,null,null,null,null,null,"Water source available when needed","Yes","N/A","N/A","N/A","N/A","N/A","N/A","N/A","N/A","N/A","N/A","N/A","N/A","N/A","N/A","N/A","N/A","N/A","N/A","N/A","N/A","N/A","N/A","N/A"]
[null,"No","N/A","N/A","N/A","N/A","N/A","N/A","N/A","N/A","N/A","N/A","N/A","N/A","N/A","N/A","N/A","N/A","N/A","N/A","N/A","N/A","N/A","N/A","N/A",null,null,null,null,null,null,null,null,null,null,null,null,null,null,null,null,null,null,null,null,null,null,null,null,null,null,null,null,"No","N/A","N/A","N/A","N/A","N/A","N/A","N/A","N/A","N/A","N/A","N/A","N/A","N/A","N/A","N/A","N/A","N/A","N/A","N/A","N/A","N/A","N/A","N/A"]
["Improved water source available when needed","Yes","N/A","N/A","N/A","N/A","N/A","N/A","N/A","N/A","N/A","N/A","N/A","N/A","N/A","N/A","N/A","N/A","N/A","N/A","N/A","N/A","N/A","N/A","N/A",null,null,null,null,null,null,null,null,null,null,null,null,null,null,null,null,null,null,null,null,null,null,null,null,null,null,null,"Improved water source available when needed","Yes","N/A","N/A","N/A","N/A","N/A","N/A","N/A","N/A","N/A","N/A","N/A","N/A","N/A","N/A","N/A","N/A","N/A","N/A","N/A","N/A","N/A","N/A","N/A"]
[null,"No","N/A","N/A","N/A","N/A","N/A","N/A","N/A","N/A","N/A","N/A","N/A","N/A","N/A","N/A","N/A","N/A","N/A","N/A","N/A","N/A","N/A","N/A","N/A",null,null,null,null,null,null,null,null,null,null,null,null,null,null,null,null,null,null,null,null,null,null,null,null,null,null,null,null,"No","N/A","N/A","N/A","N/A","N/A","N/A","N/A","N/A","N/A","N/A","N/A","N/A","N/A","N/A","N/A","N/A","N/A","N/A","N/A","N/A","N/A","N/A","N/A"]
["Microbiological quality at point of collection","Not contaminated (No E. coli in 100 mL)","N/A","N/A","N/A","N/A","N/A","N/A","N/A","N/A","N/A","N/A","N/A","N/A","N/A","N/A","N/A","N/A","N/A","N/A","N/A","N/A","N/A","N/A","N/A",null,null,null,null,null,null,null,null,null,null,null,null,null,null,null,null,null,null,null,null,null,null,null,null,null,null,null,"Microbiological quality at point of collection","Not contaminated (No E. coli in 100 mL)","N/A","N/A","N/A","N/A","N/A","N/A","N/A","N/A","N/A","N/A","N/A","N/A","N/A","N/A","N/A","N/A","N/A","N/A","N/A","N/A","N/A","N/A","N/A"]
[null,"Contaminated (E. coli detected in 100 mL)","N/A","N/A","N/A","N/A","N/A","N/A","N/A","N/A","N/A","N/A","N/A","N/A","N/A","N/A","N/A","N/A","N/A","N/A","N/A","N/A","N/A","N/A","N/A",null,null,null,null,null,null,null,null,null,null,null,null,null,null,null,null,null,null,null,null,null,null,null,null,null,null,null,null,"Contaminated (E. coli detected in 100 mL)","N/A","N/A","N/A","N/A","N/A","N/A","N/A","N/A","N/A","N/A","N/A","N/A","N/A","N/A","N/A","N/A","N/A","N/A","N/A","N/A","N/A","N/A","N/A"]
[null,"Highly contaminated (>100 CFU/100 mL)","N/A","N/A","N/A","N/A","N/A","N/A","N/A","N/A","N/A","N/A","N/A","N/A","N/A","N/A","N/A","N/A","N/A","N/A","N/A","N/A","N/A","N/A","N/A",null,null,null,null,null,null,null,null,null,null,null,null,null,null,null,null,null,null,null,null,null,null,null,null,null,null,null,null,"Highly contaminated (>100 CFU/100 mL)","N/A","N/A","N/A","N/A","N/A","N/A","N/A","N/A","N/A","N/A","N/A","N/A","N/A","N/A","N/A","N/A","N/A","N/A","N/A","N/A","N/A","N/A","N/A"]
["Microbiological quality of improved water sources at point of collection","Not contaminated (No E. coli in 100 mL)","N/A","N/A","N/A","N/A","N/A","N/A","N/A","N/A","N/A","N/A","N/A","N/A","N/A","N/A","N/A","N/A","N/A","N/A","N/A","N/A","N/A","N/A","N/A",null,null,null,null,null,null,null,null,null,null,null,null,null,null,null,null,null,null,null,null,null,null,null,null,null,null,null,"Microbiological quality of improved water sources at point of collection","Not contaminated (No E. coli in 100 mL)","N/A","N/A","N/A","N/A","N/A","N/A","N/A","N/A","N/A","N/A","N/A","N/A","N/A","N/A","N/A","N/A","N/A","N/A","N/A","N/A","N/A","N/A","N/A"]
[null,"Contaminated (E. coli detected in 100 mL)","N/A","N/A","N/A","N/A","N/A","N/A","N/A","N/A","N/A","N/A","N/A","N/A","N/A","N/A","N/A","N/A","N/A","N/A","N/A","N/A","N/A","N/A","N/A",null,null,null,null,null,null,null,null,null,null,null,null,null,null,null,null,null,null,null,null,null,null,null,null,null,null,null,null,"Contaminated (E. coli detected in 100 mL)","N/A","N/A","N/A","N/A","N/A","N/A","N/A","N/A","N/A","N/A","N/A","N/A","N/A","N/A","N/A","N/A","N/A","N/A","N/A","N/A","N/A","N/A","N/A"]
[null,"Highly contaminated (>100 CFU/100 mL)","N/A","N/A","N/A","N/A","N/A","N/A","N/A","N/A","N/A","N/A","N/A","N/A","N/A","N/A","N/A","N/A","N/A","N/A","N/A","N/A","N/A","N/A","N/A",null,null,null,null,null,null,null,null,null,null,null,null,null,null,null,null,null,null,null,null,null,null,null,null,null,null,null,null,"Highly contaminated (>100 CFU/100 mL)","N/A","N/A","N/A","N/A","N/A","N/A","N/A","N/A","N/A","N/A","N/A","N/A","N/A","N/A","N/A","N/A","N/A","N/A","N/A","N/A","N/A","N/A","N/A"]
["Microbiological quality of piped on premises at point of collection","Not contaminated (No E. coli in 100 mL)","N/A","N/A","N/A","N/A","N/A","N/A","N/A","N/A","N/A","N/A","N/A","N/A","N/A","N/A","N/A","N/A","N/A","N/A","N/A","N/A","N/A","N/A","N/A",null,null,null,null,null,null,null,null,null,null,null,null,null,null,null,null,null,null,null,null,null,null,null,null,null,null,null,"Microbiological quality of piped on premises at point of collection","Not contaminated (No E. coli in 100 mL)","N/A","N/A","N/A","N/A","N/A","N/A","N/A","N/A","N/A","N/A","N/A","N/A","N/A","N/A","N/A","N/A","N/A","N/A","N/A","N/A","N/A","N/A","N/A"]
[null,"Contaminated (E. coli detected in 100 mL)","N/A","N/A","N/A","N/A","N/A","N/A","N/A","N/A","N/A","N/A","N/A","N/A","N/A","N/A","N/A","N/A","N/A","N/A","N/A","N/A","N/A","N/A","N/A",null,null,null,null,null,null,null,null,null,null,null,null,null,null,null,null,null,null,null,null,null,null,null,null,null,null,null,null,"Contaminated (E. coli detected in 100 mL)","N/A","N/A","N/A","N/A","N/A","N/A","N/A","N/A","N/A","N/A","N/A","N/A","N/A","N/A","N/A","N/A","N/A","N/A","N/A","N/A","N/A","N/A","N/A"]
[null,"Highly contaminated (>100 CFU/100 mL)","N/A","N/A","N/A","N/A","N/A","N/A","N/A","N/A","N/A","N/A","N/A","N/A","N/A","N/A","N/A","N/A","N/A","N/A","N/A","N/A","N/A","N/A","N/A",null,null,null,null,null,null,null,null,null,null,null,null,null,null,null,null,null,null,null,null,null,null,null,null,null,null,null,null,"Highly contaminated (>100 CFU/100 mL)","N/A","N/A","N/A","N/A","N/A","N/A","N/A","N/A","N/A","N/A","N/A","N/A","N/A","N/A","N/A","N/A","N/A","N/A","N/A","N/A","N/A","N/A","N/A"]
[null,null,"NATIONAL wealth index quintile",null,null,null,null,"URBAN wealth index quintile",null,null,null,null,"RURAL wealth index quintile",null,null,null,null,"SUB-REGIONS:",null,null,null,null,null,null,null,null,null,null,null,null,null,null,null,null,null,null,null,null,null,null,null,null,null,null,null,null,null,null,null,null,null,null,"Raw numbers of respondents:","Use of drinking water sources","NATIONAL wealth index quintile",null,null,null,null,"URBAN wealth index quintile",null,null,null,null,"RURAL wealth index quintile",null,null,null,null,"SUB-REGIONS:"]
["Percentage based on weighted population",null,"Poorest","Poor","Middle","Rich","Richest","Poorest","Poor","Middle","Rich","Richest","Poorest","Poor","Middle","Rich","Richest","Agadez","Diffa","Dosso","Maradi","Niamey","Tahoua","Tillabéri","Zinder",null,null,null,null,null,null,null,null,null,null,null,null,null,null,null,null,null,null,null,null,null,null,null,null,null,null,null,"Water data, raw numbers (weighted)",null,"Poorest","Poor","Middle","Rich","Richest","Poorest","Poor","Middle","Rich","Richest","Poorest","Poor","Middle","Rich","Richest","Agadez","Diffa","Dosso","Maradi","Niamey","Tahoua","Tillabéri","Zinder"]
["Source of drinking water","Piped into dwelling",0.10986805542728884,4.6525660533625141E-2,0.31189635069144517,0.7579852136701507,25.84944231806719,4.8474068825807493,13.970559932058904,22.518949652814793,39.819187486434771,67.316422640637768,0,4.7758796956692953E-2,0,0,0.41818554217059106,24.820956009886412,3.6571798816100705,1.646804383558425,3.7623029172195954,31.593168562040063,2.1247160796123064,2.3289821763550522,3.2159190109205698]
[null,"Piped into yard/plot",0.44991503358993096,0.11903649024618526,4.0877587697608832E-2,0.14346023503327512,8.7325591179358586,3.9298626746392396,6.0348550486653201,11.000681729253655,16.528535218856895,14.774599494643176,0,0,0,2.592429990882952E-2,8.3581464246983622E-2,3.0651578942192397,3.9028816859452822,1.682440974151985,0.79753244442250648,12.024887744647545,1.647681144466743,0.21392012720940842,0.49761921156895961]
[null,"Public tap",12.488707435181077,6.2860827312552772,9.2340089467375162,13.354123228381354,36.988707456478537,69.706783764060503,68.687793155093047,61.068601390127434,39.495614218805706,14.630294389841064,5.9142642381426089,5.1241589375310248,9.0810736517871771,7.7466078172997364,12.179475523113494,24.575932311267469,18.124570205069045,10.277943113459292,10.708048201383731,47.71929672838008,16.543448502648619,3.4872193828702152,19.042066815467528]
[null,"Protected well",18.576848457367142,21.865995214293253,18.972127495681686,25.864320926994015,8.0707045072030503,4.9391710247422074,2.8987844787399641,1.9007683597506704,1.7491027497892695,0.75457461642142087,20.153819453423417,21.541376815677417,21.07639573754161,21.947304536054805,26.472891053256003,17.556609142214089,30.347346394677473,20.633394219090249,24.235053032263199,2.8261673491725299,14.605684465765565,18.557752975506279,19.856371282029102]
[null,"Open well",66.684651256147149,70.31215172295407,69.922937393152736,56.741398203367467,19.061359437380908,15.062621780107008,7.1563369848669751,2.4664273757514907,1.0097940932784057,0.74870935736588418,72.32052979392239,72.269324057682141,68.144574200764424,68.091232414483528,57.945526532249914,27.841988383987466,43.850093374275282,65.609548587616146,60.023356701386135,4.5313023523925233,65.009763131248945,65.444928307100128,56.859291072400573]
[null,"Spring",6.731184894663314E-2,9.4353159151076796E-2,0,0.1859811511056583,0,0.37860995781606227,0,0,0,0,0,3.3109530657452008E-2,8.5218205500536243E-2,7.4708361399076106E-2,0.15157475538820123,0.53588087549877428,0,0,0,0,0,0.12175114449463713,0.18833065779838004]
[null,"Surface water",1.2880629469420131,1.2758550215663325,1.518152226038938,2.6763707188428509,0.306612361820435,4.0279141495893608E-2,6.0215033146006409E-2,0,0,0,1.4222414973655431,0.98427186149513979,1.6127382044061986,2.1142225708539226,2.4284622375028637,0.37272780101641068,0,0,8.6137130583030658E-2,0,0,9.779621624774034,0]
[null,"Bottled water",0,0,0,0,5.2147990158743052E-2,0,0,0,0,0.28998394921761328,0,0,0,0,0,0,0,0,0,0.14251603956363576,0,0,0]
[null,"Other",0.33463496639881679,0,0,0.27636032260512622,0.93846681095546192,1.0952647745583062,1.191455367429783,1.0445714923019476,1.3977662328349332,1.4854155518730994,0.18914501714602028,0,0,0,0.32030289207185991,1.2307475819102018,0.11792845842286138,0.14986872212388258,0.38756957274176496,1.1626612238035652,6.8706676257709445E-2,6.5824261690107161E-2,0.34040194981476735]
[]
[]
[]
[]
[]
[]
[]
[]
[]
[]
[]
[]
[]
[]
[]
[]
[]
[]
[]
[]
[]
[]
[]
[]
[]
[]
[]
[]
[]
[]
[]
[]
[]
[]
[]
[]
[]
[]
[]
[]
[]
[{"$f":"A1026","v":"Niger"}]
[{"$f":"A1034","v":"2006"}]
["Use of sanitation facilities"]
[" by wealth quintile and sub-national region"]
["Notes:"]
["WHO/UNICEF JMP customised wealth index excludes water,"]
[" sanitation and hygiene assets."]
["Survey used for analysis:",{"$f":"A1025","v":"DHS06"}]
[{"$f":"B1030","v":"Ratio of Improved latrines based on:"},"DHS12"]
[{"$f":"B1029","v":"Ratio of Shared improved based on:"},"DHS12"]
[]
[]
["Use of sanitation facilities",null,"NATIONAL wealth index quintile",null,null,null,null,"URBAN wealth index quintile",null,null,null,null,"RURAL wealth index quintile",null,null,null,null,"SUB-REGIONS:",null,null,null,null,null,null,null,null,null,null,null,null,null,null,null,null,null,null,null,null,null,null,null,null,null,null,null,null,null,null,null,null,null,null,"Raw numbers of respondents:","Use of sanitation facilities","NATIONAL wealth index quintile",null,null,null,null,"URBAN wealth index quintile",null,null,null,null,"RURAL wealth index quintile",null,null,null,null,"SUB-REGIONS:"]
["Weighted percentage (used in graphs)",null,"Poorest","Poor","Middle","Rich","Richest","Poorest","Poor","Middle","Rich","Richest","Poorest","Poor","Middle","Rich","Richest","Agadez","Diffa","Dosso","Maradi","Niamey","Tahoua","Tillabéri","Zinder",null,null,null,null,null,null,null,null,null,null,null,null,null,null,null,null,null,null,null,null,null,null,null,null,null,null,null,"Sanitation data, raw numbers (weighted)",null,"Poorest","Poor","Middle","Rich","Richest","Poorest","Poor","Middle","Rich","Richest","Poorest","Poor","Middle","Rich","Richest","Agadez","Diffa","Dosso","Maradi","Niamey","Tahoua","Tillabéri","Zinder"]
["Sanitation","Improved",{"$f":"C153+(C155+C154)*'DHS12'!C130/100","v":2.9590938478419728},{"$f":"D153+(D155+D154)*'DHS12'!D130/100","v":1.2505866346507779},{"$f":"E153+(E155+E154)*'DHS12'!E130/100","v":2.8657975511069655},{"$f":"F153+(F155+F154)*'DHS12'!F130/100","v":7.8573028765168296},{"$f":"G153+(G155+G154)*'DHS12'!G130/100","v":67.171429003661615},{"$f":"H153+(H155+H154)*'DHS12'!H130/100","v":34.143139394483434},{"$f":"I153+(I155+I154)*'DHS12'!I130/100","v":63.94607840210022},{"$f":"J153+(J155+J154)*'DHS12'!J130/100","v":79.732597831484256},{"$f":"K153+(K155+K154)*'DHS12'!K130/100","v":90.814584794955351},{"$f":"L153+(L155+L154)*'DHS12'!L130/100","v":96.413951226159043},{"$f":"M153+(M155+M154)*'DHS12'!M130/100","v":1.1259938841923909},{"$f":"N153+(N155+N154)*'DHS12'!N130/100","v":0.93705582968021839},{"$f":"O153+(O155+O154)*'DHS12'!O130/100","v":2.3155586240651975},{"$f":"P153+(P155+P154)*'DHS12'!P130/100","v":2.5461568559933339},{"$f":"Q153+(Q155+Q154)*'DHS12'!Q130/100","v":14.928891090789159},{"$f":"R153+(R155+R154)*'DHS12'!R130/100","v":39.936856550896501},{"$f":"S153+(S155+S154)*'DHS12'!S130/100","v":12.368480400331762},{"$f":"T153+(T155+T154)*'DHS12'!T130/100","v":10.444855960988574},{"$f":"U153+(U155+U154)*'DHS12'!U130/100","v":15.081562487258859},{"$f":"V153+(V155+V154)*'DHS12'!V130/100","v":79.661124011771378},{"$f":"W153+(W155+W154)*'DHS12'!W130/100","v":6.5276823252484286},{"$f":"X153+(X155+X154)*'DHS12'!X130/100","v":2.7821507542499151},{"$f":"Y153+(Y155+Y154)*'DHS12'!Y130/100","v":10.324823342701839},null,null,null,null,null,null,null,null,null,null,null,null,null,null,null,null,null,null,null,null,null,null,null,null,null,null,null,"Sanitation","Improved","N/A","N/A","N/A","N/A","N/A","N/A","N/A","N/A","N/A","N/A","N/A","N/A","N/A","N/A","N/A","N/A","N/A","N/A","N/A","N/A","N/A","N/A","N/A"]
[null,"Not Improved",{"$f":"100-C122","v":97.04090615215803},{"$f":"100-D122","v":98.749413365349227},97.134202448893035,92.142697123483174,32.828570996338385,65.856860605516573,36.05392159789978,20.267402168515744,9.1854152050446487,3.5860487738409574,98.874006115807603,99.062944170319781,97.684441375934796,97.453843144006669,85.071108909210835,60.063143449103499,87.631519599668238,89.555144039011424,84.918437512741136,20.338875988228622,93.472317674751565,97.217849245750088,89.675176657298167,null,null,null,null,null,null,null,null,null,null,null,null,null,null,null,null,null,null,null,null,null,null,null,null,null,null,null,null,"Not Improved","N/A","N/A","N/A","N/A","N/A","N/A","N/A","N/A","N/A","N/A","N/A","N/A","N/A","N/A","N/A","N/A","N/A","N/A","N/A","N/A","N/A","N/A","N/A"]
["Sanitation ladder","Basic",{"$f":"C122*'DHS12'!C129/100","v":1.5519134489014843},{"$f":"D122*'DHS12'!D129/100","v":0.62276054581965556},{"$f":"E122*'DHS12'!E129/100","v":1.2989434214060165},{"$f":"F122*'DHS12'!F129/100","v":4.7375229256330407},{"$f":"G122*'DHS12'!G129/100","v":37.392330586624318},{"$f":"H122*'DHS12'!H129/100","v":14.657072709339371},{"$f":"I122*'DHS12'!I129/100","v":29.873032429582526},{"$f":"J122*'DHS12'!J129/100","v":35.263992219727434},{"$f":"K122*'DHS12'!K129/100","v":43.968770867959655},{"$f":"L122*'DHS12'!L129/100","v":67.022562412705369},{"$f":"M122*'DHS12'!M129/100","v":0.59910904761148986},{"$f":"N122*'DHS12'!N129/100","v":0.48661824523275166},{"$f":"O122*'DHS12'!O129/100","v":1.0469131803044052},{"$f":"P122*'DHS12'!P129/100","v":1.5486269619283186},{"$f":"Q122*'DHS12'!Q129/100","v":10.225372482719061},{"$f":"R122*'DHS12'!R129/100","v":25.462724055774153},{"$f":"S122*'DHS12'!S129/100","v":11.81377417978266},{"$f":"T122*'DHS12'!T129/100","v":5.1666932134078527},{"$f":"U122*'DHS12'!U129/100","v":7.6352343021162712},{"$f":"V122*'DHS12'!V129/100","v":32.141175161414736},{"$f":"W122*'DHS12'!W129/100","v":4.1572986067280251},{"$f":"X122*'DHS12'!X129/100","v":1.2752393388302024},{"$f":"Y122*'DHS12'!Y129/100","v":7.543602882259294},null,null,null,null,null,null,null,null,null,null,null,null,null,null,null,null,null,null,null,null,null,null,null,null,null,null,null,"Sanitation ladder","Basic","N/A","N/A","N/A","N/A","N/A","N/A","N/A","N/A","N/A","N/A","N/A","N/A","N/A","N/A","N/A","N/A","N/A","N/A","N/A","N/A","N/A","N/A","N/A"]
[null,"Limited",{"$f":"C122*'DHS12'!C128/100","v":1.4071803989404899},{"$f":"D122*'DHS12'!D128/100","v":0.62782608883112234},{"$f":"E122*'DHS12'!E128/100","v":1.5668541297009475},{"$f":"F122*'DHS12'!F128/100","v":3.1197799508837933},{"$f":"G122*'DHS12'!G128/100","v":29.779098417037336},{"$f":"H122*'DHS12'!H128/100","v":19.486066685144074},{"$f":"I122*'DHS12'!I128/100","v":34.073045972517704},{"$f":"J122*'DHS12'!J128/100","v":44.46860561175685},{"$f":"K122*'DHS12'!K128/100","v":46.845813926995653},{"$f":"L122*'DHS12'!L128/100","v":29.391388813453535},{"$f":"M122*'DHS12'!M128/100","v":0.52688483658090102},{"$f":"N122*'DHS12'!N128/100","v":0.45043758444746695},{"$f":"O122*'DHS12'!O128/100","v":1.2686454437607926},{"$f":"P122*'DHS12'!P128/100","v":0.9975298940650158},{"$f":"Q122*'DHS12'!Q128/100","v":4.7035186080701052},{"$f":"R122*'DHS12'!R128/100","v":14.474132495122289},{"$f":"S122*'DHS12'!S128/100","v":0.55470622054910512},{"$f":"T122*'DHS12'!T128/100","v":5.2781627475807298},{"$f":"U122*'DHS12'!U128/100","v":7.4463281851425833},{"$f":"V122*'DHS12'!V128/100","v":47.519948850356478},{"$f":"W122*'DHS12'!W128/100","v":2.3703837185204031},{"$f":"X122*'DHS12'!X128/100","v":1.5069114154197125},{"$f":"Y122*'DHS12'!Y128/100","v":2.781220460442547},null,null,null,null,null,null,null,null,null,null,null,null,null,null,null,null,null,null,null,null,null,null,null,null,null,null,null,null,"Limited","N/A","N/A","N/A","N/A","N/A","N/A","N/A","N/A","N/A","N/A","N/A","N/A","N/A","N/A","N/A","N/A","N/A","N/A","N/A","N/A","N/A","N/A","N/A"]
[null,"Unimproved",{"$f":"100-(C124+C125+C127)","v":4.134596589952622},{"$f":"100-(D124+D125+D127)","v":2.1385947197956909},2.3765937952270804,4.3015843707334938,7.8381321091763141,10.647643371686655,8.3753407281894283,11.514508171859717,7.0077836583913182,3.3523652265275956,1.8414311858378909,1.8410596760093227,2.8489867552594603,2.4773354664571912,5.6378604244212767,2.7450198298299568,9.2817930386901821,2.5845215206517196,5.3175881123375035,9.0873861953607076,5.7068827859577596,4.2680602216078114,5.306887439422411,null,null,null,null,null,null,null,null,null,null,null,null,null,null,null,null,null,null,null,null,null,null,null,null,null,null,null,null,"Unimproved","N/A","N/A","N/A","N/A","N/A","N/A","N/A","N/A","N/A","N/A","N/A","N/A","N/A","N/A","N/A","N/A","N/A","N/A","N/A","N/A","N/A","N/A","N/A"]
[null,"Open defecation",{"$f":"C156","v":92.906309562205408},{"$f":"D156","v":96.610818645553536},94.757608653665955,87.841112752749666,24.990438887162032,55.209217233829897,27.678580869710341,8.752893996656006,2.17763154665337,0.23368354731349733,97.032574929969712,97.221884494310459,94.835454620675335,94.976507677549478,79.433248484789559,57.318123619273599,78.349726560978056,86.970622518359704,79.600849400403646,11.251489792868071,87.765434888793806,92.949789024142277,84.368289217875741,null,null,null,null,null,null,null,null,null,null,null,null,null,null,null,null,null,null,null,null,null,null,null,null,null,null,null,null,"Open defecation","N/A","N/A","N/A","N/A","N/A","N/A","N/A","N/A","N/A","N/A","N/A","N/A","N/A","N/A","N/A","N/A","N/A","N/A","N/A","N/A","N/A","N/A","N/A"]
["Shared among Improved Sanitation","Yes","N/A","N/A","N/A","N/A","N/A","N/A","N/A","N/A","N/A","N/A","N/A","N/A","N/A","N/A","N/A","N/A","N/A","N/A","N/A","N/A","N/A","N/A","N/A",null,null,null,null,null,null,null,null,null,null,null,null,null,null,null,null,null,null,null,null,null,null,null,null,null,null,null,"Shared among improved sanitation facilities","Yes","N/A","N/A","N/A","N/A","N/A","N/A","N/A","N/A","N/A","N/A","N/A","N/A","N/A","N/A","N/A","N/A","N/A","N/A","N/A","N/A","N/A","N/A","N/A"]
[null,"No","N/A","N/A","N/A","N/A","N/A","N/A","N/A","N/A","N/A","N/A","N/A","N/A","N/A","N/A","N/A","N/A","N/A","N/A","N/A","N/A","N/A","N/A","N/A",null,null,null,null,null,null,null,null,null,null,null,null,null,null,null,null,null,null,null,null,null,null,null,null,null,null,null,null,"No","N/A","N/A","N/A","N/A","N/A","N/A","N/A","N/A","N/A","N/A","N/A","N/A","N/A","N/A","N/A","N/A","N/A","N/A","N/A","N/A","N/A","N/A","N/A"]
["Manually calculated ratios","Improved latrines"]
[null,"Other"]
[null,"Other"]
[null,null,"NATIONAL wealth index quintile",null,null,null,null,"URBAN wealth index quintile",null,null,null,null,"RURAL wealth index quintile",null,null,null,null,"SUB-REGIONS:",null,null,null,null,null,null,null,null,null,null,null,null,null,null,null,null,null,null,null,null,null,null,null,null,null,null,null,null,null,null,null,null,null,null,"Raw numbers of respondents:","Use of sanitation facilities","NATIONAL wealth index quintile",null,null,null,null,"URBAN wealth index quintile",null,null,null,null,"RURAL wealth index quintile",null,null,null,null,"SUB-REGIONS:"]
["Percentage based on weighted population",null,"Poorest","Poor","Middle","Rich","Richest","Poorest","Poor","Middle","Rich","Richest","Poorest","Poor","Middle","Rich","Richest","Agadez","Diffa","Dosso","Maradi","Niamey","Tahoua","Tillabéri","Zinder",null,null,null,null,null,null,null,null,null,null,null,null,null,null,null,null,null,null,null,null,null,null,null,null,null,null,null,"Sanitation data, raw numbers (weighted)",null,"Poorest","Poor","Middle","Rich","Richest","Poorest","Poor","Middle","Rich","Richest","Poorest","Poor","Middle","Rich","Richest","Agadez","Diffa","Dosso","Maradi","Niamey","Tahoua","Tillabéri","Zinder"]
["Sanitation type","Sewer connection","N/A","N/A","N/A","N/A","N/A","N/A","N/A","N/A","N/A","N/A","N/A","N/A","N/A","N/A","N/A","N/A","N/A","N/A","N/A","N/A","N/A","N/A","N/A",null,null,null,null,null,null,null,null,null,null,null,null,null,null,null,null,null,null,null,null,null,null,null,null,null,null,null,"Sanitation type","Sewer connection","N/A","N/A","N/A","N/A","N/A","N/A","N/A","N/A","N/A","N/A","N/A","N/A","N/A","N/A","N/A","N/A","N/A","N/A","N/A","N/A","N/A","N/A","N/A"]
[null,"Septic tank connection","N/A","N/A","N/A","N/A","N/A","N/A","N/A","N/A","N/A","N/A","N/A","N/A","N/A","N/A","N/A","N/A","N/A","N/A","N/A","N/A","N/A","N/A","N/A",null,null,null,null,null,null,null,null,null,null,null,null,null,null,null,null,null,null,null,null,null,null,null,null,null,null,null,null,"Septic tank connection","N/A","N/A","N/A","N/A","N/A","N/A","N/A","N/A","N/A","N/A","N/A","N/A","N/A","N/A","N/A","N/A","N/A","N/A","N/A","N/A","N/A","N/A","N/A"]
[null,"Improved latrines","N/A","N/A","N/A","N/A","N/A","N/A","N/A","N/A","N/A","N/A","N/A","N/A","N/A","N/A","N/A","N/A","N/A","N/A","N/A","N/A","N/A","N/A","N/A",null,null,null,null,null,null,null,null,null,null,null,null,null,null,null,null,null,null,null,null,null,null,null,null,null,null,null,null,"Improved latrines","N/A","N/A","N/A","N/A","N/A","N/A","N/A","N/A","N/A","N/A","N/A","N/A","N/A","N/A","N/A","N/A","N/A","N/A","N/A","N/A","N/A","N/A","N/A"]
[null,"Unimproved facilities","N/A","N/A","N/A","N/A","N/A","N/A","N/A","N/A","N/A","N/A","N/A","N/A","N/A","N/A","N/A","N/A","N/A","N/A","N/A","N/A","N/A","N/A","N/A",null,null,null,null,null,null,null,null,null,null,null,null,null,null,null,null,null,null,null,null,null,null,null,null,null,null,null,null,"Unimproved facilities","N/A","N/A","N/A","N/A","N/A","N/A","N/A","N/A","N/A","N/A","N/A","N/A","N/A","N/A","N/A","N/A","N/A","N/A","N/A","N/A","N/A","N/A","N/A"]
[null,"Open defecation",92.751006947929582,96.610818645553536,94.757608653665955,87.841112752749666,24.983778352980266,55.209217233829897,27.637684704912829,8.752893996656006,2.17763154665337,0.23368354731349733,96.852477047143637,97.221884494310459,94.835454620675335,94.976507677549478,79.433248484789559,57.318123619273599,78.349726560978056,86.757064880230317,79.600849400403646,11.243301752345285,87.765434888793806,92.949789024142277,84.368289217875741,null,null,null,null,null,null,null,null,null,null,null,null,null,null,null,null,null,null,null,null,null,null,null,null,null,null,null,null,"Open defecation","N/A","N/A","N/A","N/A","N/A","N/A","N/A","N/A","N/A","N/A","N/A","N/A","N/A","N/A","N/A","N/A","N/A","N/A","N/A","N/A","N/A","N/A","N/A"]
["Septic tank emptying practices","Not emptied/treated and disposed in situ","N/A","N/A","N/A","N/A","N/A","N/A","N/A","N/A","N/A","N/A","N/A","N/A","N/A","N/A","N/A","N/A","N/A","N/A","N/A","N/A","N/A","N/A","N/A",null,null,null,null,null,null,null,null,null,null,null,null,null,null,null,null,null,null,null,null,null,null,null,null,null,null,null,"Septic tank emptying practices","Not emptied/treated and disposed in situ","N/A","N/A","N/A","N/A","N/A","N/A","N/A","N/A","N/A","N/A","N/A","N/A","N/A","N/A","N/A","N/A","N/A","N/A","N/A","N/A","N/A","N/A","N/A"]
[null,"Emptied and buried on site","N/A","N/A","N/A","N/A","N/A","N/A","N/A","N/A","N/A","N/A","N/A","N/A","N/A","N/A","N/A","N/A","N/A","N/A","N/A","N/A","N/A","N/A","N/A",null,null,null,null,null,null,null,null,null,null,null,null,null,null,null,null,null,null,null,null,null,null,null,null,null,null,null,null,"Emptied and buried on site","N/A","N/A","N/A","N/A","N/A","N/A","N/A","N/A","N/A","N/A","N/A","N/A","N/A","N/A","N/A","N/A","N/A","N/A","N/A","N/A","N/A","N/A","N/A"]
[null,"Emptied and discharged locally","N/A","N/A","N/A","N/A","N/A","N/A","N/A","N/A","N/A","N/A","N/A","N/A","N/A","N/A","N/A","N/A","N/A","N/A","N/A","N/A","N/A","N/A","N/A",null,null,null,null,null,null,null,null,null,null,null,null,null,null,null,null,null,null,null,null,null,null,null,null,null,null,null,null,"Emptied and discharged locally","N/A","N/A","N/A","N/A","N/A","N/A","N/A","N/A","N/A","N/A","N/A","N/A","N/A","N/A","N/A","N/A","N/A","N/A","N/A","N/A","N/A","N/A","N/A"]
[null,"Emptied and removed offsite","N/A","N/A","N/A","N/A","N/A","N/A","N/A","N/A","N/A","N/A","N/A","N/A","N/A","N/A","N/A","N/A","N/A","N/A","N/A","N/A","N/A","N/A","N/A",null,null,null,null,null,null,null,null,null,null,null,null,null,null,null,null,null,null,null,null,null,null,null,null,null,null,null,null,"Emptied and removed offsite","N/A","N/A","N/A","N/A","N/A","N/A","N/A","N/A","N/A","N/A","N/A","N/A","N/A","N/A","N/A","N/A","N/A","N/A","N/A","N/A","N/A","N/A","N/A"]
["Latrine emptying practices","Not emptied/treated and disposed in situ","N/A","N/A","N/A","N/A","N/A","N/A","N/A","N/A","N/A","N/A","N/A","N/A","N/A","N/A","N/A","N/A","N/A","N/A","N/A","N/A","N/A","N/A","N/A",null,null,null,null,null,null,null,null,null,null,null,null,null,null,null,null,null,null,null,null,null,null,null,null,null,null,null,"Latrine emptying practices","Not emptied/treated and disposed in situ","N/A","N/A","N/A","N/A","N/A","N/A","N/A","N/A","N/A","N/A","N/A","N/A","N/A","N/A","N/A","N/A","N/A","N/A","N/A","N/A","N/A","N/A","N/A"]
[null,"Emptied and buried on site","N/A","N/A","N/A","N/A","N/A","N/A","N/A","N/A","N/A","N/A","N/A","N/A","N/A","N/A","N/A","N/A","N/A","N/A","N/A","N/A","N/A","N/A","N/A",null,null,null,null,null,null,null,null,null,null,null,null,null,null,null,null,null,null,null,null,null,null,null,null,null,null,null,null,"Emptied and buried on site","N/A","N/A","N/A","N/A","N/A","N/A","N/A","N/A","N/A","N/A","N/A","N/A","N/A","N/A","N/A","N/A","N/A","N/A","N/A","N/A","N/A","N/A","N/A"]
[null,"Emptied and discharged locally","N/A","N/A","N/A","N/A","N/A","N/A","N/A","N/A","N/A","N/A","N/A","N/A","N/A","N/A","N/A","N/A","N/A","N/A","N/A","N/A","N/A","N/A","N/A",null,null,null,null,null,null,null,null,null,null,null,null,null,null,null,null,null,null,null,null,null,null,null,null,null,null,null,null,"Emptied and discharged locally","N/A","N/A","N/A","N/A","N/A","N/A","N/A","N/A","N/A","N/A","N/A","N/A","N/A","N/A","N/A","N/A","N/A","N/A","N/A","N/A","N/A","N/A","N/A"]
[null,"Emptied and removed offsite","N/A","N/A","N/A","N/A","N/A","N/A","N/A","N/A","N/A","N/A","N/A","N/A","N/A","N/A","N/A","N/A","N/A","N/A","N/A","N/A","N/A","N/A","N/A",null,null,null,null,null,null,null,null,null,null,null,null,null,null,null,null,null,null,null,null,null,null,null,null,null,null,null,null,"Emptied and removed offsite","N/A","N/A","N/A","N/A","N/A","N/A","N/A","N/A","N/A","N/A","N/A","N/A","N/A","N/A","N/A","N/A","N/A","N/A","N/A","N/A","N/A","N/A","N/A"]
["Shared among improved sanitation facilities","Yes","N/A","N/A","N/A","N/A","N/A","N/A","N/A","N/A","N/A","N/A","N/A","N/A","N/A","N/A","N/A","N/A","N/A","N/A","N/A","N/A","N/A","N/A","N/A",null,null,null,null,null,null,null,null,null,null,null,null,null,null,null,null,null,null,null,null,null,null,null,null,null,null,null,"Shared among improved sanitation facilities","Yes","N/A","N/A","N/A","N/A","N/A","N/A","N/A","N/A","N/A","N/A","N/A","N/A","N/A","N/A","N/A","N/A","N/A","N/A","N/A","N/A","N/A","N/A","N/A"]
[null,"No","N/A","N/A","N/A","N/A","N/A","N/A","N/A","N/A","N/A","N/A","N/A","N/A","N/A","N/A","N/A","N/A","N/A","N/A","N/A","N/A","N/A","N/A","N/A",null,null,null,null,null,null,null,null,null,null,null,null,null,null,null,null,null,null,null,null,null,null,null,null,null,null,null,null,"No","N/A","N/A","N/A","N/A","N/A","N/A","N/A","N/A","N/A","N/A","N/A","N/A","N/A","N/A","N/A","N/A","N/A","N/A","N/A","N/A","N/A","N/A","N/A"]
[null,"DK/missing","N/A","N/A","N/A","N/A","N/A","N/A","N/A","N/A","N/A","N/A","N/A","N/A","N/A","N/A","N/A","N/A","N/A","N/A","N/A","N/A","N/A","N/A","N/A",null,null,null,null,null,null,null,null,null,null,null,null,null,null,null,null,null,null,null,null,null,null,null,null,null,null,null,null,"DK/missing","N/A","N/A","N/A","N/A","N/A","N/A","N/A","N/A","N/A","N/A","N/A","N/A","N/A","N/A","N/A","N/A","N/A","N/A","N/A","N/A","N/A","N/A","N/A"]
["Shared among all sanitation facilities","Yes",39.522717602429253,36.737682712512445,22.114397545611659,35.095861203179489,39.086650400232507,42.705027138071742,57.215703351671685,49.984929772004371,46.741598293443047,23.994185605343038,27.963911334002983,20.375205702502942,31.028981864983852,27.566627442448322,21.314413973524541,27.563580375310607,13.248559912262683,43.790234094730913,29.026284163345768,55.815837962320245,35.999683917459393,39.007778408380553,17.292065986293228,null,null,null,null,null,null,null,null,null,null,null,null,null,null,null,null,null,null,null,null,null,null,null,null,null,null,null,"Shared among all sanitation facilities","Yes","N/A","N/A","N/A","N/A","N/A","N/A","N/A","N/A","N/A","N/A","N/A","N/A","N/A","N/A","N/A","N/A","N/A","N/A","N/A","N/A","N/A","N/A","N/A"]
[null,"No",56.490725286730367,63.262317287487548,75.601265079578525,64.548314194484846,59.625974727728291,55.767352043053897,42.036463751660094,48.706877638246823,52.099874008978716,75.630403998690326,66.139210631937289,79.624794297497061,66.033472364503879,72.433372557551692,76.162255146643886,71.419866227324704,86.751440087737322,53.890543695229795,69.017843400970818,44.184162037679627,62.560656955047122,59.582318433014748,79.48313009522488,null,null,null,null,null,null,null,null,null,null,null,null,null,null,null,null,null,null,null,null,null,null,null,null,null,null,null,null,"No","N/A","N/A","N/A","N/A","N/A","N/A","N/A","N/A","N/A","N/A","N/A","N/A","N/A","N/A","N/A","N/A","N/A","N/A","N/A","N/A","N/A","N/A","N/A"]
["Type of toilet facility","Flush toilet",2.8299006525350761E-2,2.485749224039429E-2,0.10872554036710574,0.19720859752698303,6.0107286214653399,1.2923307338359991,1.3880434512647553,2.517750395594653,3.2059663179616829,26.044989627914394,0,0,0,0,0.21164739931896437,12.366547974554701,0.19031690970925713,8.8023459634355844E-3,0.14215002499702623,10.661564543547177,0.32715793184749292,0.11198607749201665,0.32600411071784724,null,null,null,null,null,null,null,null,null,null,null,null,null,null,null,null,null,null,null,null,null,null,null,null,null,null,null,"Type of toilet facility","Flush toilet",2.6840520000000003,2.3006160000000002,10.312742,18.543236,565.61681300000021,21.860064000000005,23.532511000000003,42.677528000000002,54.195967999999993,440.8580330000002,0,0,0,0,16.333355000000001,147.88095799999996,2.4102960000000002,0.56789500000000004,13.576311,367.26619600000009,28.997704000000002,7.4650680000000005,31.293030999999999]
[null,"Traditional pit toilet",4.4379328040169534,1.7538351579676803,3.1673911879675236,7.6476166536771251,39.279853691711715,27.550309099895028,43.721291089187972,51.75233920288138,46.941896454469727,31.283941398410231,1.9330944343087555,1.5047644420141741,3.3728380580250961,2.7112357890591161,14.999432998665165,18.975662888253041,19.600251344757854,7.6817187013074024,10.907537851890373,43.965259831293793,5.1382974839074329,4.9161348390531154,10.302305350114848,null,null,null,null,null,null,null,null,null,null,null,null,null,null,null,null,null,null,null,null,null,null,null,null,null,null,null,null,"Traditional pit toilet",420.92086899999998,162.32133100000001,300.43068100000005,719.09420899999986,3696.2816090000024,466.01965300000012,741.23887300000035,877.23624599999971,793.53968999999984,529.53666199999998,165.09543500000001,106.90268999999999,252.52885600000002,209.40712899999997,1157.5434650000002,226.91370400000005,248.23021499999999,495.596249,1041.7453400000004,1514.5013350000008,455.43395100000021,327.71288799999996,988.91501700000003]
[null,"Ventilated improved pit latrine",2.6274586272523064,1.610488704238304,1.9662746179994546,4.314061996046278,29.718978799661073,15.948142932439008,27.212084589836987,36.977016404867967,47.674505680915203,42.437385426361793,1.0343306357214717,1.27335106367533,1.7917073212995418,2.3122565333913867,5.3556711172262448,11.339665517918702,1.8597051845548533,5.3388564343694194,9.3494627227090028,34.1216858322909,6.769109695451152,2.0220900593126427,5.0034013212914852,null,null,null,null,null,null,null,null,null,null,null,null,null,null,null,null,null,null,null,null,null,null,null,null,null,null,null,null,"Ventilated improved pit latrine",249.20435199999997,149.05429899999999,186.50339900000003,405.64494000000013,2796.5917500000041,269.766412,461.34627800000015,626.78479000000016,805.9242449999997,718.32865099999981,88.336742999999998,90.462434000000002,134.147502,178.59125500000002,413.31043000000005,135.60135000000002,23.552504999999993,344.44338899999985,892.93838399999993,1175.4130179999995,599.98129400000005,134.79389700000002,480.27490300000022]
[null,"No facility, bush, field",92.906309562205408,96.610818645553536,94.757608653665955,87.841112752749666,24.990438887162032,55.209217233829897,27.678580869710341,8.752893996656006,2.17763154665337,0.23368354731349733,97.032574929969712,97.221884494310459,94.835454620675335,94.976507677549478,79.433248484789559,57.318123619273599,78.349726560978056,86.970622518359704,79.600849400403646,11.251489792868071,87.765434888793806,92.949789024142277,84.368289217875741,null,null,null,null,null,null,null,null,null,null,null,null,null,null,null,null,null,null,null,null,null,null,null,null,null,null,null,null,"No facility, bush, field",8811.8063710000042,8941.5453900000193,8987.8676830000259,8259.5713610000112,2351.6304410000002,933.87628299999983,469.25512900000018,148.36732000000006,36.812254999999993,3.9555119999999997,8287.0422070000004,6906.9155870000131,7100.4561890000059,7335.6798680000138,6130.0608959999981,685.41836000000001,992.27143199999966,5611.0248199999996,7602.4319190000242,387.58775399999996,7779.1056080000053,6196.0960790000117,8098.4852739999997]
[null,null,null,null,null,null,null,null,null,null,null,null,null,null,null,null,null,null,null,null,null,null,null,null,null,null,null,null,null,null,null,null,null,null,null,null,null,null,null,null,null,null,null,null,null,null,null,null,null,null,null,null,null,"Total",9484.6156440000032,9255.2216360000275,9485.1145050000214,9402.8537460000061,9410.1206129999919,1691.5224120000012,1695.3727909999998,1695.0658839999999,1690.4721579999998,1692.6788580000016,8540.474385000005,7104.2807110000158,7487.1325470000083,7723.6782520000161,7717.2481460000035,1195.8143719999996,1266.4644479999993,6451.6323530000027,9550.6919540000199,3444.7683030000026,8863.5185570000158,6666.0679320000081,9598.9682250000078]
[]
[]
[]
[]
[]
[]
[]
[]
[]
[]
[]
[]
[]
[]
[]
[]
[]
[]
[]
[]
[]
[]
[]
[]
[]
[]
[]
[]
[]
[]
[]
[]
[]
[]
[]
[]
[]
[]
[]
[]
[]
[]
[]
[]
[]
[]
[]
[]
[]
[]
[{"$f":"A1026","v":"Niger"}]
[{"$f":"A1034","v":"2006"}]
["Access to hygiene facilities "]
[" by wealth quintile and sub-national region"]
["Notes:"]
["WHO/UNICEF JMP customised wealth index excludes water,"]
[" sanitation and hygiene assets."]
["Survey used for analysis:",{"$f":"A1025","v":"DHS06"}]
[]
[]
[]
[]
["Access to handwashing",null,"NATIONAL wealth index quintile",null,null,null,null,"URBAN wealth index quintile",null,null,null,null,"RURAL wealth index quintile",null,null,null,null,"SUB-REGIONS:",null,null,null,null,null,null,null,null,null,null,null,null,null,null,null,null,null,null,null,null,null,null,null,null,null,null,null,null,null,null,null,null,null,null,"Raw numbers of respondents:","Access to handwashing","NATIONAL wealth index quintile",null,null,null,null,"URBAN wealth index quintile",null,null,null,null,"RURAL wealth index quintile",null,null,null,null,"SUB-REGIONS:"]
["Weighted percentage (used in graphs)",null,"Poorest","Poor","Middle","Rich","Richest","Poorest","Poor","Middle","Rich","Richest","Poorest","Poor","Middle","Rich","Richest","Agadez","Diffa","Dosso","Maradi","Niamey","Tahoua","Tillabéri","Zinder",null,null,null,null,null,null,null,null,null,null,null,null,null,null,null,null,null,null,null,null,null,null,null,null,null,null,null,"Hygiene data, raw numbers (weighted)",null,"Poorest","Poor","Middle","Rich","Richest","Poorest","Poor","Middle","Rich","Richest","Poorest","Poor","Middle","Rich","Richest","Agadez","Diffa","Dosso","Maradi","Niamey","Tahoua","Tillabéri","Zinder"]
["Hygiene ladder","Basic",3.8261092318604808,4.4292656944100441,4.6850956823181491,7.7266901022384316,26.606881897480083,13.403120435186377,21.375363247086867,26.292691995445765,32.408205842475112,54.72264096003633,2.6815455610678351,4.1988057224158286,4.4033475640324058,5.4323267805131454,8.6119662401225021,19.380105677472169,8.8014289841320572,7.5152843032124688,10.00687005488078,30.941693116265188,4.8990254797141297,3.830450124187045,9.4307107366218972,null,null,null,null,null,null,null,null,null,null,null,null,null,null,null,null,null,null,null,null,null,null,null,null,null,null,null,"Hygiene ladder","Basic",363,409,444,725,2500,225,363,446,543,925,229,298,330,419,665,232,111,485,954,1065,433,255,905]
[null,"Limited",72.665355137908136,81.519916003823894,81.527801351465769,76.232987782971279,60.626735452560276,67.014591978917736,64.673784508619008,61.887165266078803,55.173380538688541,36.595753651030236,73.483452751913148,81.908382025092791,82.476736945748769,79.750761298005742,74.889729287707112,68.271934935399841,66.222844180462985,82.520380870866887,76.394357503457272,53.977346027572949,67.618806472666222,73.96253718922965,83.162929930419622,null,null,null,null,null,null,null,null,null,null,null,null,null,null,null,null,null,null,null,null,null,null,null,null,null,null,null,null,"Limited",6904,7534,7731,7154,5696,1125,1098,1049,925,618,6288,5808,6173,6156,5779,816,839,5330,7286,1858,5978,4928,7983]
[null,"No facility",23.508535630231439,14.050818301765936,13.787102966216015,16.040322114790285,12.766382649959764,19.582287585895848,13.950852244294119,11.820142738475411,12.418413618836329,8.6816053889333595,23.83500168701908,13.892812252491241,13.119915490218883,14.816911921481013,16.498304472170322,12.347959387128029,24.975726835405045,9.9643348259205347,13.598772441661897,15.080960856161768,27.482168047619492,22.207012686583312,7.4063593329584068,null,null,null,null,null,null,null,null,null,null,null,null,null,null,null,null,null,null,null,null,null,null,null,null,null,null,null,null,"No facility",2233,1299,1307,1505,1199,329,237,200,208,147,2039,985,982,1144,1273,148,316,644,1297,519,2430,1480,711]
["Place for hand washing","Inside dewelling/cour",76.491464369768565,85.828041201108533,86.186403207791301,83.799958628006991,87.070127522619146,79.797867555537849,86.049147755705889,88.179857261524603,86.826250704804522,91.153228015328551,76.16499831298097,85.949079792773375,86.846260917410717,85.129604722949267,83.501695527829639,87.652040612872099,75.02427316459503,89.91201138792772,86.283217369906581,84.815139403587736,72.335535439664696,77.757259270006557,92.593640667041626,null,null,null,null,null,null,null,null,null,null,null,null,null,null,null,null,null,null,null,null,null,null,null,null,null,null,null,"Observed handwashing place","Fixed","N/A","N/A","N/A","N/A","N/A","N/A","N/A","N/A","N/A","N/A","N/A","N/A","N/A","N/A","N/A","N/A","N/A","N/A","N/A","N/A","N/A","N/A","N/A"]
[null,"Elsewhere",18.662159038914371,10.824658235121243,11.672441301751027,11.177176529488042,10.072114273122844,17.276959319413368,12.135107656949314,9.7737333730681115,10.953750058745424,7.5597138462043603,18.685047467474554,10.735535165707763,10.786071943171111,11.229439959845681,11.242237395848013,8.0895752940490713,21.566875203748342,4.4268471527983397,10.443770459817285,13.867725589331133,25.467109810666539,11.866681589046834,7.30285070820723,null,null,null,null,null,null,null,null,null,null,null,null,null,null,null,null,null,null,null,null,null,null,null,null,null,null,null,null,"Mobile","N/A","N/A","N/A","N/A","N/A","N/A","N/A","N/A","N/A","N/A","N/A","N/A","N/A","N/A","N/A","N/A","N/A","N/A","N/A","N/A","N/A","N/A","N/A"]
[null,"Nowhere",4.8463765913170844,3.206356235119328,2.1104247913346574,4.8326315528762196,2.6703421227202382,2.1543916144103665,1.8157445873448004,2.0464093654072979,1.3575626129892171,1.1061892166671101,5.1499542195445374,3.1317674378421598,2.3287357864375173,3.5781689628052034,5.2560670763223083,4.2583840930789565,3.4088516316567006,5.5238027880788483,3.1364282446000402,1.1947834810888129,1.9459731131693927,10.330132066226879,0.10350862475117728,null,null,null,null,null,null,null,null,null,null,null,null,null,null,null,null,null,null,null,null,null,null,null,null,null,null,null,"Water / Soap","Water and soap","N/A","N/A","N/A","N/A","N/A","N/A","N/A","N/A","N/A","N/A","N/A","N/A","N/A","N/A","N/A","N/A","N/A","N/A","N/A","N/A","N/A","N/A","N/A"]
[null,"missing",0,0.14094432865075865,3.0730699122962179E-2,0.19023328962879296,0.18741608153790076,0.77078151063835809,0,0,0.86243662346079297,0.18086892179993169,0,0.18361760367664012,3.8931352980627242E-2,6.2786354399786956E-2,0,0,0,0.13733867119499987,0.13658392567605132,0.12235152599231743,0.25138163649923478,4.592707471976594E-2,0,null,null,null,null,null,null,null,null,null,null,null,null,null,null,null,null,null,null,null,null,null,null,null,null,null,null,null,null,"Water only","N/A","N/A","N/A","N/A","N/A","N/A","N/A","N/A","N/A","N/A","N/A","N/A","N/A","N/A","N/A","N/A","N/A","N/A","N/A","N/A","N/A","N/A","N/A"]
[null,null,null,null,null,null,null,null,null,null,null,null,null,null,null,null,null,null,null,null,null,null,null,null,null,null,null,null,null,null,null,null,null,null,null,null,null,null,null,null,null,null,null,null,null,null,null,null,null,null,null,null,null,"Soap only","N/A","N/A","N/A","N/A","N/A","N/A","N/A","N/A","N/A","N/A","N/A","N/A","N/A","N/A","N/A","N/A","N/A","N/A","N/A","N/A","N/A","N/A","N/A"]
[null,null,null,null,null,null,null,null,null,null,null,null,null,null,null,null,null,null,null,null,null,null,null,null,null,null,null,null,null,null,null,null,null,null,null,null,null,null,null,null,null,null,null,null,null,null,null,null,null,null,null,null,null,"Neither","N/A","N/A","N/A","N/A","N/A","N/A","N/A","N/A","N/A","N/A","N/A","N/A","N/A","N/A","N/A","N/A","N/A","N/A","N/A","N/A","N/A","N/A","N/A"]
[null,null,null,null,null,null,null,null,null,null,null,null,null,null,null,null,null,null,null,null,null,null,null,null,null,null,null,null,null,null,null,null,null,null,null,null,null,null,null,null,null,null,null,null,null,null,null,null,null,null,null,null,"Place for hand washing","Inside dewelling/cour",7267,7944,8175,7880,8196,1350,1461,1495,1468,1543,6517,6106,6502,6575,6444,1048,950,5815,8241,2924,6411,5183,8888]
[null,null,null,null,null,null,null,null,null,null,null,null,null,null,null,null,null,null,null,null,null,null,null,null,null,null,null,null,null,null,null,null,null,null,null,null,null,null,null,null,null,null,null,null,null,null,null,null,null,null,null,null,null,"Elsewhere",1773,1002,1107,1051,948,292,206,166,185,128,1599,763,808,867,868,97,273,286,997,478,2257,791,701]
[null,null,null,null,null,null,null,null,null,null,null,null,null,null,null,null,null,null,null,null,null,null,null,null,null,null,null,null,null,null,null,null,null,null,null,null,null,null,null,null,null,null,null,null,null,null,null,null,null,null,null,null,null,"Nowhere",460,297,200,454,251,36,31,35,23,19,441,222,174,276,406,51,43,357,300,41,172,689,10]
[null,null,null,null,null,null,null,null,null,null,null,null,null,null,null,null,null,null,null,null,null,null,null,null,null,null,null,null,null,null,null,null,null,null,null,null,null,null,null,null,null,null,null,null,null,null,null,null,null,null,null,null,null,"missing",0,13,3,18,18,13,0,0,15,3,0,13,3,5,0,0,0,9,13,4,22,3,0]
[null,null,null,null,null,null,null,null,null,null,null,null,null,null,null,null,null,null,null,null,null,null,null,null,null,null,null,null,null,null,null,null,null,null,null,null,null,null,null,null,null,null,null,null,null,null,null,null,null,null,null,null,null,"Total",9500,9255,9485,9403,9413,1692,1698,1695,1690,1693,8556,7104,7487,7724,7717,1196,1266,6468,9551,3447,8864,6666,9599]
[]
[]
[]
[]
[]
[]
[]
[]
[]
[]
[]
[]
[]
[]
[]
[]
[]
[]
[]
[]
[]
[]
[]
[null,null,null,null,null,null,null,null,null,null,null,null,null,null,null,null,null,null,null,null,null,null,null,null,null,null,null,null,null,null,null,null,null,null,null,null,null,null,null,null,null,null,null,null,null,null,null,null,null,null,null,null,"Raw numbers of respondents:","Menstrual health and hygiene","NATIONAL wealth index quintile",null,null,null,null,"URBAN wealth index quintile",null,null,null,null,"RURAL wealth index quintile",null,null,null,null,"SUB-REGIONS:"]
[null,null,null,null,null,null,null,null,null,null,null,null,null,null,null,null,null,null,null,null,null,null,null,null,null,null,null,null,null,null,null,null,null,null,null,null,null,null,null,null,null,null,null,null,null,null,null,null,null,null,null,null,"MHH data, raw numbers (weighted)",null,"Poorest","Poor","Middle","Rich","Richest","Poorest","Poor","Middle","Rich","Richest","Poorest","Poor","Middle","Rich","Richest","Agadez","Diffa","Dosso","Maradi","Niamey","Tahoua","Tillabéri","Zinder"]
[null,null,null,null,null,null,null,null,null,null,null,null,null,null,null,null,null,null,null,null,null,null,null,null,null,null,null,null,null,null,null,null,null,null,null,null,null,null,null,null,null,null,null,null,null,null,null,null,null,null,null,null,"Private place to wash and change","Yes","N/A","N/A","N/A","N/A","N/A","N/A","N/A","N/A","N/A","N/A","N/A","N/A","N/A","N/A","N/A","N/A","N/A","N/A","N/A","N/A","N/A","N/A","N/A"]
[null,null,null,null,null,null,null,null,null,null,null,null,null,null,null,null,null,null,null,null,null,null,null,null,null,null,null,null,null,null,null,null,null,null,null,null,null,null,null,null,null,null,null,null,null,null,null,null,null,null,null,null,null,"No","N/A","N/A","N/A","N/A","N/A","N/A","N/A","N/A","N/A","N/A","N/A","N/A","N/A","N/A","N/A","N/A","N/A","N/A","N/A","N/A","N/A","N/A","N/A"]
[null,null,null,null,null,null,null,null,null,null,null,null,null,null,null,null,null,null,null,null,null,null,null,null,null,null,null,null,null,null,null,null,null,null,null,null,null,null,null,null,null,null,null,null,null,null,null,null,null,null,null,null,null,"DK/not sure/missing","N/A","N/A","N/A","N/A","N/A","N/A","N/A","N/A","N/A","N/A","N/A","N/A","N/A","N/A","N/A","N/A","N/A","N/A","N/A","N/A","N/A","N/A","N/A"]
[null,null,null,null,null,null,null,null,null,null,null,null,null,null,null,null,null,null,null,null,null,null,null,null,null,null,null,null,null,null,null,null,null,null,null,null,null,null,null,null,null,null,null,null,null,null,null,null,null,null,null,null,"Use of menstrual materials","Materials reusable","N/A","N/A","N/A","N/A","N/A","N/A","N/A","N/A","N/A","N/A","N/A","N/A","N/A","N/A","N/A","N/A","N/A","N/A","N/A","N/A","N/A","N/A","N/A"]
[null,null,null,null,null,null,null,null,null,null,null,null,null,null,null,null,null,null,null,null,null,null,null,null,null,null,null,null,null,null,null,null,null,null,null,null,null,null,null,null,null,null,null,null,null,null,null,null,null,null,null,null,null,"Materials not reusable","N/A","N/A","N/A","N/A","N/A","N/A","N/A","N/A","N/A","N/A","N/A","N/A","N/A","N/A","N/A","N/A","N/A","N/A","N/A","N/A","N/A","N/A","N/A"]
[null,null,null,null,null,null,null,null,null,null,null,null,null,null,null,null,null,null,null,null,null,null,null,null,null,null,null,null,null,null,null,null,null,null,null,null,null,null,null,null,null,null,null,null,null,null,null,null,null,null,null,null,null,"No materials used","N/A","N/A","N/A","N/A","N/A","N/A","N/A","N/A","N/A","N/A","N/A","N/A","N/A","N/A","N/A","N/A","N/A","N/A","N/A","N/A","N/A","N/A","N/A"]
[null,null,null,null,null,null,null,null,null,null,null,null,null,null,null,null,null,null,null,null,null,null,null,null,null,null,null,null,null,null,null,null,null,null,null,null,null,null,null,null,null,null,null,null,null,null,null,null,null,null,null,null,null,"DK/not sure/missing","N/A","N/A","N/A","N/A","N/A","N/A","N/A","N/A","N/A","N/A","N/A","N/A","N/A","N/A","N/A","N/A","N/A","N/A","N/A","N/A","N/A","N/A","N/A"]
[null,null,null,null,null,null,null,null,null,null,null,null,null,null,null,null,null,null,null,null,null,null,null,null,null,null,null,null,null,null,null,null,null,null,null,null,null,null,null,null,null,null,null,null,null,null,null,null,null,null,null,null,"Use of menstrual materials with private place to wash and change","Materials reusable","N/A","N/A","N/A","N/A","N/A","N/A","N/A","N/A","N/A","N/A","N/A","N/A","N/A","N/A","N/A","N/A","N/A","N/A","N/A","N/A","N/A","N/A","N/A"]
[null,null,null,null,null,null,null,null,null,null,null,null,null,null,null,null,null,null,null,null,null,null,null,null,null,null,null,null,null,null,null,null,null,null,null,null,null,null,null,null,null,null,null,null,null,null,null,null,null,null,null,null,null,"Materials not reusable","N/A","N/A","N/A","N/A","N/A","N/A","N/A","N/A","N/A","N/A","N/A","N/A","N/A","N/A","N/A","N/A","N/A","N/A","N/A","N/A","N/A","N/A","N/A"]
[null,null,null,null,null,null,null,null,null,null,null,null,null,null,null,null,null,null,null,null,null,null,null,null,null,null,null,null,null,null,null,null,null,null,null,null,null,null,null,null,null,null,null,null,null,null,null,null,null,null,null,null,null,"No materials used","N/A","N/A","N/A","N/A","N/A","N/A","N/A","N/A","N/A","N/A","N/A","N/A","N/A","N/A","N/A","N/A","N/A","N/A","N/A","N/A","N/A","N/A","N/A"]
[null,null,null,null,null,null,null,null,null,null,null,null,null,null,null,null,null,null,null,null,null,null,null,null,null,null,null,null,null,null,null,null,null,null,null,null,null,null,null,null,null,null,null,null,null,null,null,null,null,null,null,null,"Awareness of menstruation before menarche","Yes","N/A","N/A","N/A","N/A","N/A","N/A","N/A","N/A","N/A","N/A","N/A","N/A","N/A","N/A","N/A","N/A","N/A","N/A","N/A","N/A","N/A","N/A","N/A"]
[null,null,null,null,null,null,null,null,null,null,null,null,null,null,null,null,null,null,null,null,null,null,null,null,null,null,null,null,null,null,null,null,null,null,null,null,null,null,null,null,null,null,null,null,null,null,null,null,null,null,null,null,null,"No","N/A","N/A","N/A","N/A","N/A","N/A","N/A","N/A","N/A","N/A","N/A","N/A","N/A","N/A","N/A","N/A","N/A","N/A","N/A","N/A","N/A","N/A","N/A"]
[null,null,null,null,null,null,null,null,null,null,null,null,null,null,null,null,null,null,null,null,null,null,null,null,null,null,null,null,null,null,null,null,null,null,null,null,null,null,null,null,null,null,null,null,null,null,null,null,null,null,null,null,null,"DK/not sure/missing","N/A","N/A","N/A","N/A","N/A","N/A","N/A","N/A","N/A","N/A","N/A","N/A","N/A","N/A","N/A","N/A","N/A","N/A","N/A","N/A","N/A","N/A","N/A"]
[null,null,null,null,null,null,null,null,null,null,null,null,null,null,null,null,null,null,null,null,null,null,null,null,null,null,null,null,null,null,null,null,null,null,null,null,null,null,null,null,null,null,null,null,null,null,null,null,null,null,null,null,"Participation in (all) activities during menstruation","Yes","N/A","N/A","N/A","N/A","N/A","N/A","N/A","N/A","N/A","N/A","N/A","N/A","N/A","N/A","N/A","N/A","N/A","N/A","N/A","N/A","N/A","N/A","N/A"]
[null,null,null,null,null,null,null,null,null,null,null,null,null,null,null,null,null,null,null,null,null,null,null,null,null,null,null,null,null,null,null,null,null,null,null,null,null,null,null,null,null,null,null,null,null,null,null,null,null,null,null,null,null,"No","N/A","N/A","N/A","N/A","N/A","N/A","N/A","N/A","N/A","N/A","N/A","N/A","N/A","N/A","N/A","N/A","N/A","N/A","N/A","N/A","N/A","N/A","N/A"]
[null,null,null,null,null,null,null,null,null,null,null,null,null,null,null,null,null,null,null,null,null,null,null,null,null,null,null,null,null,null,null,null,null,null,null,null,null,null,null,null,null,null,null,null,null,null,null,null,null,null,null,null,null,"DK/not sure/missing/no such activity","N/A","N/A","N/A","N/A","N/A","N/A","N/A","N/A","N/A","N/A","N/A","N/A","N/A","N/A","N/A","N/A","N/A","N/A","N/A","N/A","N/A","N/A","N/A"]
[null,null,null,null,null,null,null,null,null,null,null,null,null,null,null,null,null,null,null,null,null,null,null,null,null,null,null,null,null,null,null,null,null,null,null,null,null,null,null,null,null,null,null,null,null,null,null,null,null,null,null,null,"Participation in specific activities during menstruation","Did not go to school (amongst those usually attending school)","N/A","N/A","N/A","N/A","N/A","N/A","N/A","N/A","N/A","N/A","N/A","N/A","N/A","N/A","N/A","N/A","N/A","N/A","N/A","N/A","N/A","N/A","N/A"]
[null,null,null,null,null,null,null,null,null,null,null,null,null,null,null,null,null,null,null,null,null,null,null,null,null,null,null,null,null,null,null,null,null,null,null,null,null,null,null,null,null,null,null,null,null,null,null,null,null,null,null,null,null,"Did not go to work (amongst those who usually work)","N/A","N/A","N/A","N/A","N/A","N/A","N/A","N/A","N/A","N/A","N/A","N/A","N/A","N/A","N/A","N/A","N/A","N/A","N/A","N/A","N/A","N/A","N/A"]
[null,null,null,null,null,null,null,null,null,null,null,null,null,null,null,null,null,null,null,null,null,null,null,null,null,null,null,null,null,null,null,null,null,null,null,null,null,null,null,null,null,null,null,null,null,null,null,null,null,null,null,null,null,"Did not participate in social activities","N/A","N/A","N/A","N/A","N/A","N/A","N/A","N/A","N/A","N/A","N/A","N/A","N/A","N/A","N/A","N/A","N/A","N/A","N/A","N/A","N/A","N/A","N/A"]
[null,null,null,null,null,null,null,null,null,null,null,null,null,null,null,null,null,null,null,null,null,null,null,null,null,null,null,null,null,null,null,null,null,null,null,null,null,null,null,null,null,null,null,null,null,null,null,null,null,null,null,null,null,"Did not cook food","N/A","N/A","N/A","N/A","N/A","N/A","N/A","N/A","N/A","N/A","N/A","N/A","N/A","N/A","N/A","N/A","N/A","N/A","N/A","N/A","N/A","N/A","N/A"]
[null,null,null,null,null,null,null,null,null,null,null,null,null,null,null,null,null,null,null,null,null,null,null,null,null,null,null,null,null,null,null,null,null,null,null,null,null,null,null,null,null,null,null,null,null,null,null,null,null,null,null,null,null,"Did not eat with others","N/A","N/A","N/A","N/A","N/A","N/A","N/A","N/A","N/A","N/A","N/A","N/A","N/A","N/A","N/A","N/A","N/A","N/A","N/A","N/A","N/A","N/A","N/A"]
[null,null,null,null,null,null,null,null,null,null,null,null,null,null,null,null,null,null,null,null,null,null,null,null,null,null,null,null,null,null,null,null,null,null,null,null,null,null,null,null,null,null,null,null,null,null,null,null,null,null,null,null,null,"Did not bathe in regular place","N/A","N/A","N/A","N/A","N/A","N/A","N/A","N/A","N/A","N/A","N/A","N/A","N/A","N/A","N/A","N/A","N/A","N/A","N/A","N/A","N/A","N/A","N/A"]
[null,null,null,null,null,null,null,null,null,null,null,null,null,null,null,null,null,null,null,null,null,null,null,null,null,null,null,null,null,null,null,null,null,null,null,null,null,null,null,null,null,null,null,null,null,null,null,null,null,null,null,null,null,"Did not participate in other activities","N/A","N/A","N/A","N/A","N/A","N/A","N/A","N/A","N/A","N/A","N/A","N/A","N/A","N/A","N/A","N/A","N/A","N/A","N/A","N/A","N/A","N/A","N/A"]
[null,null,null,null,null,null,null,null,null,null,null,null,null,null,null,null,null,null,null,null,null,null,null,null,null,null,null,null,null,null,null,null,null,null,null,null,null,null,null,null,null,null,null,null,null,null,null,null,null,null,null,null,null,"DK/not sure/missing/no such activity","N/A","N/A","N/A","N/A","N/A","N/A","N/A","N/A","N/A","N/A","N/A","N/A","N/A","N/A","N/A","N/A","N/A","N/A","N/A","N/A","N/A","N/A","N/A"]
[]
[]
[]
[]
[]
[]
[]
[]
[]
[]
[]
[]
[]
[]
[]
[]
[]
[]
[]
[]
[]
[]
[]
[]
[]
[]
[]
[]
[]
[]
[]
[]
[]
[]
[]
[]
[]
[]
[]
[]
[]
[]
[]
[]
[]
[]
[]
[]
[]
[]
[]
[]
[]
[]
[null,null,null,null,null,null,null,null,null,null,null,null,null,null,null,null,null,null,null,null,null,null,null,null,null,null,null,null,null,null,null,null,null,null,null,null,null,null,null,null,null,null,null,null,null,null,null,null,null,null,null,null,"Raw numbers of respondents:","Basic water, sanitation and hygiene","NATIONAL wealth index quintile",null,null,null,null,"URBAN wealth index quintile",null,null,null,null,"RURAL wealth index quintile",null,null,null,null,"SUB-REGIONS:"]
[null,null,null,null,null,null,null,null,null,null,null,null,null,null,null,null,null,null,null,null,null,null,null,null,null,null,null,null,null,null,null,null,null,null,null,null,null,null,null,null,null,null,null,null,null,null,null,null,null,null,null,null,"WatSan data, raw numbers (weighted)",null,"Poorest","Poor","Middle","Rich","Richest","Poorest","Poor","Middle","Rich","Richest","Poorest","Poor","Middle","Rich","Richest","Agadez","Diffa","Dosso","Maradi","Niamey","Tahoua","Tillabéri","Zinder"]
[null,null,null,null,null,null,null,null,null,null,null,null,null,null,null,null,null,null,null,null,null,null,null,null,null,null,null,null,null,null,null,null,null,null,null,null,null,null,null,null,null,null,null,null,null,null,null,null,null,null,null,null,"Use of Basic Water Sanitation and Hygiene","Yes","N/A","N/A","N/A","N/A","N/A","N/A","N/A","N/A","N/A","N/A","N/A","N/A","N/A","N/A","N/A","N/A","N/A","N/A","N/A","N/A","N/A","N/A","N/A"]
[null,null,null,null,null,null,null,null,null,null,null,null,null,null,null,null,null,null,null,null,null,null,null,null,null,null,null,null,null,null,null,null,null,null,null,null,null,null,null,null,null,null,null,null,null,null,null,null,null,null,null,null,null,"No","N/A","N/A","N/A","N/A","N/A","N/A","N/A","N/A","N/A","N/A","N/A","N/A","N/A","N/A","N/A","N/A","N/A","N/A","N/A","N/A","N/A","N/A","N/A"]
[null,null,null,null,null,null,null,null,null,null,null,null,null,null,null,null,null,null,null,null,null,null,null,null,null,null,null,null,null,null,null,null,null,null,null,null,null,null,null,null,null,null,null,null,null,null,null,null,null,null,null,null,"Use of Basic Water and Sanitation","Yes","N/A","N/A","N/A","N/A","N/A","N/A","N/A","N/A","N/A","N/A","N/A","N/A","N/A","N/A","N/A","N/A","N/A","N/A","N/A","N/A","N/A","N/A","N/A"]
[null,null,null,null,null,null,null,null,null,null,null,null,null,null,null,null,null,null,null,null,null,null,null,null,null,null,null,null,null,null,null,null,null,null,null,null,null,null,null,null,null,null,null,null,null,null,null,null,null,null,null,null,null,"No","N/A","N/A","N/A","N/A","N/A","N/A","N/A","N/A","N/A","N/A","N/A","N/A","N/A","N/A","N/A","N/A","N/A","N/A","N/A","N/A","N/A","N/A","N/A"]
[null,null,null,null,null,null,null,null,null,null,null,null,null,null,null,null,null,null,null,null,null,null,null,null,null,null,null,null,null,null,null,null,null,null,null,null,null,null,null,null,null,null,null,null,null,null,null,null,null,null,null,null,"Use of Basic Water and Hygiene","Yes","N/A","N/A","N/A","N/A","N/A","N/A","N/A","N/A","N/A","N/A","N/A","N/A","N/A","N/A","N/A","N/A","N/A","N/A","N/A","N/A","N/A","N/A","N/A"]
[null,null,null,null,null,null,null,null,null,null,null,null,null,null,null,null,null,null,null,null,null,null,null,null,null,null,null,null,null,null,null,null,null,null,null,null,null,null,null,null,null,null,null,null,null,null,null,null,null,null,null,null,null,"No","N/A","N/A","N/A","N/A","N/A","N/A","N/A","N/A","N/A","N/A","N/A","N/A","N/A","N/A","N/A","N/A","N/A","N/A","N/A","N/A","N/A","N/A","N/A"]
[null,null,null,null,null,null,null,null,null,null,null,null,null,null,null,null,null,null,null,null,null,null,null,null,null,null,null,null,null,null,null,null,null,null,null,null,null,null,null,null,null,null,null,null,null,null,null,null,null,null,null,null,"Use of Basic Sanitation and Hygiene","Yes","N/A","N/A","N/A","N/A","N/A","N/A","N/A","N/A","N/A","N/A","N/A","N/A","N/A","N/A","N/A","N/A","N/A","N/A","N/A","N/A","N/A","N/A","N/A"]
[null,null,null,null,null,null,null,null,null,null,null,null,null,null,null,null,null,null,null,null,null,null,null,null,null,null,null,null,null,null,null,null,null,null,null,null,null,null,null,null,null,null,null,null,null,null,null,null,null,null,null,null,null,"No","N/A","N/A","N/A","N/A","N/A","N/A","N/A","N/A","N/A","N/A","N/A","N/A","N/A","N/A","N/A","N/A","N/A","N/A","N/A","N/A","N/A","N/A","N/A"]
[null,null,null,null,null,null,null,null,null,null,null,null,null,null,null,null,null,null,null,null,null,null,null,null,null,null,null,null,null,null,null,null,null,null,null,null,null,null,null,null,null,null,null,null,null,null,null,null,null,null,null,null,"Use of Basic Water","Yes","N/A","N/A","N/A","N/A","N/A","N/A","N/A","N/A","N/A","N/A","N/A","N/A","N/A","N/A","N/A","N/A","N/A","N/A","N/A","N/A","N/A","N/A","N/A"]
[null,null,null,null,null,null,null,null,null,null,null,null,null,null,null,null,null,null,null,null,null,null,null,null,null,null,null,null,null,null,null,null,null,null,null,null,null,null,null,null,null,null,null,null,null,null,null,null,null,null,null,null,null,"No","N/A","N/A","N/A","N/A","N/A","N/A","N/A","N/A","N/A","N/A","N/A","N/A","N/A","N/A","N/A","N/A","N/A","N/A","N/A","N/A","N/A","N/A","N/A"]
[null,null,null,null,null,null,null,null,null,null,null,null,null,null,null,null,null,null,null,null,null,null,null,null,null,null,null,null,null,null,null,null,null,null,null,null,null,null,null,null,null,null,null,null,null,null,null,null,null,null,null,null,"Use of Basic Sanitation","Yes","N/A","N/A","N/A","N/A","N/A","N/A","N/A","N/A","N/A","N/A","N/A","N/A","N/A","N/A","N/A","N/A","N/A","N/A","N/A","N/A","N/A","N/A","N/A"]
[null,null,null,null,null,null,null,null,null,null,null,null,null,null,null,null,null,null,null,null,null,null,null,null,null,null,null,null,null,null,null,null,null,null,null,null,null,null,null,null,null,null,null,null,null,null,null,null,null,null,null,null,null,"No","N/A","N/A","N/A","N/A","N/A","N/A","N/A","N/A","N/A","N/A","N/A","N/A","N/A","N/A","N/A","N/A","N/A","N/A","N/A","N/A","N/A","N/A","N/A"]
[null,null,null,null,null,null,null,null,null,null,null,null,null,null,null,null,null,null,null,null,null,null,null,null,null,null,null,null,null,null,null,null,null,null,null,null,null,null,null,null,null,null,null,null,null,null,null,null,null,null,null,null,"Access to Basic Hygiene","Yes","N/A","N/A","N/A","N/A","N/A","N/A","N/A","N/A","N/A","N/A","N/A","N/A","N/A","N/A","N/A","N/A","N/A","N/A","N/A","N/A","N/A","N/A","N/A"]
[null,null,null,null,null,null,null,null,null,null,null,null,null,null,null,null,null,null,null,null,null,null,null,null,null,null,null,null,null,null,null,null,null,null,null,null,null,null,null,null,null,null,null,null,null,null,null,null,null,null,null,null,null,"No","N/A","N/A","N/A","N/A","N/A","N/A","N/A","N/A","N/A","N/A","N/A","N/A","N/A","N/A","N/A","N/A","N/A","N/A","N/A","N/A","N/A","N/A","N/A"]
[]
[]
[]
[]
[]
[]
[]
[]
[]
[]
[]
[]
[]
[]
[]
[]
[]
[]
[]
[]
[]
[]
[]
[]
[]
[]
[]
[]
[]
[]
[]
[]
[]
[]
[]
[]
[]
[]
[]
[]
[]
[]
[]
[]
[null,null,"INITIAL (national) Wealth Index",null,null,null,null,"URBAN Wealth Index",null,null,null,null,"RURAL Wealth Index"]
[null,null,"Component Matrix",null,null,null,null,"Component Matrix",null,null,null,null,"Component Matrix"]
[null,null,null,null,"Component",null,null,null,null,"Component",null,null,null,null,"Component"]
[null,"Note:\n\nThe INITIAL (national) Wealth Index is based on the first component of the Principal Component Analysis (PCA) which has been obtained at national level.\n\nThe final national-level (NATIONAL) Wealth Index is based on the URBAN and RURAL specific wealth indexes. Regression procedures are used to establish the relationships between the two sets of scores (urban and rural) and the initial (national) wealth factors.\nThis allows best use of the available information for each area and a better precision of the FINAL (NATIONAL) Wealth Index.\n\nFor dependency reasons, all WASH variables (contained in the generic MICS and DHS scripts) have been excluded from the sets of asset variables used in the PCAs.\n\nThe PCA can extracts as many components as there are asset variables in the input. Only the first of the components is used to represent the Wealth Index. \n\nThe scores represent the weights of the asset variables on the Wealth Index (correlations between the variables and the component).\n\nThe communalities are the proportion of each variable's variance that can be explained by the component.\n\nProportion of explained variance is the part of the model's total variance that is explained by the component.\n\nFor more information on the procedure used:\n\nThe DHS Wealth Index, DHS Comparative Reports No. 6, Shea Oscar Rutstein, Kiersten Johnson, ORC Macro International Inc., 2004.\n\nThe DHS Wealth Index: Approaches for Rural and Urban Areas, Shea O. Rutstein, ORC Macro International Inc., 2008.\n\nMICS Methodological Paper No. 4, Review of options for reporting water, sanitation and hygiene coverage by wealth quintile, UNICEF, 2016.",null,null,"1",null,null,null,null,"1",null,null,null,null,"1"]
[null,null,"Has television",null,0.83464410112672172,null,null,"Has television",null,0.78622051884592525,null,null,"if has a floor made of dirt, dung",null,-0.63790834724927215]
[null,null,"Has electricity",null,0.80295055472114052,null,null,"If hh has a cell phone",null,0.72967715182152049,null,null,"Has television",null,0.62602480963656948]
[null,null,"If hh has a cell phone",null,0.79583255265512043,null,null,"Has electricity",null,0.72536428500707029,null,null,"if has a finished floor - cemt, vinyl/asphalt strips",null,0.62396564730642945]
[null,null,"if has a floor made of dirt, dung",null,-0.78617698319791762,null,null,"Has refrigerator",null,0.71838047561731266,null,null,"Has electricity",null,0.51335797667812832]
[null,null,"Has refrigerator",null,0.74002530043123105,null,null,"If hh has own personal car",null,0.677313097307914,null,null,"Has refrigerator",null,0.4980440853418297]
[null,null,"if has a finished floor - cemt, vinyl/asphalt strips",null,0.66243644194386808,null,null,"Has car/truck",null,0.66994194627057424,null,null,"Has car/truck",null,0.47225911663015563]
[null,null,"If hh has own personal car",null,0.66161013140862979,null,null,"if has a floor made of dirt, dung",null,-0.65117749185379614,null,null,"If hh has own personal car",null,0.46078662692446609]
[null,null,"Has car/truck",null,0.65901054318697194,null,null,"if has a finished floor - cemt, vinyl/asphalt strips",null,0.4403093509388939,null,null,"If hh has a cell phone",null,0.43342046068943479]
[null,null,"If hh has a landline phone",null,0.44697955787586841,null,null,"If hh has a landline phone",null,0.43942381885145537,null,null,"Has motorcycle/scooter",null,0.40721082137233361]
[null,null,"if has a nicely finished floor - parquet, ceramic tile, carpet",null,0.4424661109990593,null,null,"if has a nicely finished floor - parquet, ceramic tile, carpet",null,0.42736429603095666,null,null,"If hh has a landline phone",null,0.38862424050030908]
[null,null,"Has motorcycle/scooter",null,0.41814700958060153,null,null,"if cooking fuel is wood/straw",null,-0.39170213100530582,null,null,"Has radio",null,0.24598537159931091]
[null,null,"if cooking fuel is wood/straw",null,-0.40254523007538401,null,null,"Has radio",null,0.37957689464206235,null,null,"Has bicycle",null,0.23047348199106488]
[null,null,"if cooking fuel is nat gas",null,0.3789050388218308,null,null,"Has motorcycle/scooter",null,0.37956614909361158,null,null,"If hh has a car/truck",null,0.17337368800223296]
[null,null,"Has bicycle",null,0.36260691728903433,null,null,"if cooking fuel is nat gas",null,0.36640391873501021,null,null,"Has an animal-drawn cart",null,0.12659841592541279]
[null,null,"Has radio",null,0.35713306642093018,null,null,"Has bicycle",null,0.3304796408703749,null,null,"if has a nicely finished floor - parquet, ceramic tile, carpet",null,0.11492985651537273]
[null,null,"if cooking fuel is electric",null,0.29762815278937083,null,null,"if cooking fuel is electric",null,0.29493617707545128,null,null,"if cooking fuel is nat gas",null,0.11244341734614928]
[null,null,"if cooking fuel is charcoal",null,0.21429124517721798,null,null,"memsleep",null,-0.26698579884613755,null,null,"if cooking fuel is charcoal",null,9.0213238055552203E-2]
[null,null,"memsleep",null,-0.15799273767703489,null,null,"if cooking fuel is charcoal",null,0.11333240812321367,null,null,"memsleep",null,-8.5420096193932177E-2]
[null,null,"Has an animal-drawn cart",null,-0.1301198803636576,null,null,"Has an animal-drawn cart",null,-7.0853040827757341E-2,null,null,"if cooking fuel is wood/straw",null,-4.8191396942168854E-2]
[null,null,"If hh has a car/truck",null,0.10719506780219079,null,null,"If hh has a car/truck",null,6.9742196387168429E-2,null,null,"Pirogues",null,3.2079469943360132E-2]
[null,null,"if cooking fuel is dung",null,-2.3457969860983096E-2,null,null,"if cooking fuel is dung",null,-6.7460964673845929E-3,null,null,"if cooking fuel is dung",null,-1.8425272917023856E-2]
[null,null,"Pirogues",null,5.069449878862947E-3,null,null,"Pirogues",null,3.6372950342980865E-3,null,null,"if cooking fuel is electric",null,-2.9296424490628647E-3]
[]
[]
[]
[null,null,"Communalities",null,null,null,null,"Communalities",null,null,null,null,"Communalities"]
[null,null,null,null,"Extraction",null,null,null,null,"Extraction",null,null,null,null,"Extraction"]
[null,null,"Has electricity",null,0.64472959332698732,null,null,"Has electricity",null,0.52615334596381824,null,null,"Has electricity",null,0.26353641221906177]
[null,null,"Has radio",null,0.12754402713121651,null,null,"Has radio",null,0.14407861894611129,null,null,"Has radio",null,6.0508803040851079E-2]
[null,null,"Has television",null,0.69663077554563324,null,null,"Has television",null,0.61814270425435591,null,null,"Has television",null,0.39190706228050304]
[null,null,"Has refrigerator",null,0.5476374452783338,null,null,"Has refrigerator",null,0.51607050774815633,null,null,"Has refrigerator",null,0.24804791094397974]
[null,null,"Has bicycle",null,0.13148377646585657,null,null,"Has bicycle",null,0.10921679302981196,null,null,"Has bicycle",null,5.3118025901085705E-2]
[null,null,"Has motorcycle/scooter",null,0.17484692162119966,null,null,"Has motorcycle/scooter",null,0.14407046153775377,null,null,"Has motorcycle/scooter",null,0.16582065304273058]
[null,null,"Has car/truck",null,0.43429489603158783,null,null,"Has car/truck",null,0.44882221137280498,null,null,"Has car/truck",null,0.22302867324029493]
[null,null,"if has a floor made of dirt, dung",null,0.61807424891017881,null,null,"if has a floor made of dirt, dung",null,0.42403212589700073,null,null,"if has a floor made of dirt, dung",null,0.40692705949029795]
[null,null,"if has a finished floor - cemt, vinyl/asphalt strips",null,0.43882203961525168,null,null,"if has a finished floor - cemt, vinyl/asphalt strips",null,0.19387232452423003,null,null,"if has a finished floor - cemt, vinyl/asphalt strips",null,0.38933312901853151]
[null,null,"if has a nicely finished floor - parquet, ceramic tile, carpet",null,0.19577625938263188,null,null,"if has a nicely finished floor - parquet, ceramic tile, carpet",null,0.18264024152203515,null,null,"if has a nicely finished floor - parquet, ceramic tile, carpet",null,1.3208871918644163E-2]
[null,null,"if cooking fuel is electric",null,8.8582517332813068E-2,null,null,"if cooking fuel is electric",null,8.6987348547881954E-2,null,null,"if cooking fuel is electric",null,8.5828048793510602E-6]
[null,null,"if cooking fuel is nat gas",null,0.14356902844457312,null,null,"if cooking fuel is nat gas",null,0.13425183166437196,null,null,"if cooking fuel is nat gas",null,1.2643522104480305E-2]
[null,null,"if cooking fuel is charcoal",null,4.5920737759602551E-2,null,null,"if cooking fuel is charcoal",null,1.2844234731006668E-2,null,null,"if cooking fuel is charcoal",null,8.1384283204677318E-3]
[null,null,"if cooking fuel is wood/straw",null,0.16204266225644384,null,null,"if cooking fuel is wood/straw",null,0.15343055943409775,null,null,"if cooking fuel is wood/straw",null,2.3224107392376815E-3]
[null,null,"if cooking fuel is dung",null,5.5027634999879128E-4,null,null,"if cooking fuel is dung",null,4.5509817547258882E-5,null,null,"if cooking fuel is dung",null,3.3949068206681277E-4]
[null,null,"memsleep",null,2.4961705158684361E-2,null,null,"memsleep",null,7.1281416785510227E-2,null,null,"memsleep",null,7.2965928337806263E-3]
[null,null,"Has an animal-drawn cart",null,1.6931183265852565E-2,null,null,"Has an animal-drawn cart",null,5.020153394539849E-3,null,null,"Has an animal-drawn cart",null,1.602715891482381E-2]
[null,null,"Pirogues",null,2.5699322074303549E-5,null,null,"Pirogues",null,1.3229915166529518E-5,null,null,"Pirogues",null,1.0290923918469461E-3]
[null,null,"If hh has a landline phone",null,0.19979072515890681,null,null,"If hh has a landline phone",null,0.19309329257399666,null,null,"If hh has a landline phone",null,0.15102880030444207]
[null,null,"If hh has a cell phone",null,0.63334945186556502,null,null,"If hh has a cell phone",null,0.53242874589036626,null,null,"If hh has a cell phone",null,0.18785329574424189]
[null,null,"If hh has a car/truck",null,1.1490782561116282E-2,null,null,"If hh has a car/truck",null,4.863973956906369E-3,null,null,"If hh has a car/truck",null,3.0058435691495619E-2]
[null,null,"If hh has own personal car",null,0.43772796598254438,null,null,"If hh has own personal car",null,0.45875303178483978,null,null,"If hh has own personal car",null,0.21232431555242709]
[]
[]
[null,null,"Total Variance Explained",null,null,null,null,"Total Variance Explained",null,null,null,null,"Total Variance Explained"]
[null,null,"Component",null,"Extraction Sums of Squared Loadings",null,null,"Component",null,"Extraction Sums of Squared Loadings",null,null,"Component",null,"Extraction Sums of Squared Loadings"]
[null,null,null,null,"Total","% of Variance","Cumulative %",null,null,"Total","% of Variance","Cumulative %",null,null,"Total","% of Variance","Cumulative %"]
[null,null,"1",null,5.7747827187670522,26.249012358032054,26.249012358032054,"1",null,4.9601126632923087,22.545966651328676,22.545966651328676,"1",null,2.8445067271801703,12.929576032637138,12.929576032637138]
[]
[]
[null,null,"Component Score Coefficient Matrix",null,null,null,null,"Component Score Coefficient Matrix",null,null,null,null,"Component Score Coefficient Matrix"]
[null,null,null,null,"Component",null,null,null,null,"Component",null,null,null,null,"Component"]
[null,null,null,null,"1",null,null,null,null,"1",null,null,null,null,"1"]
[null,null,"Has electricity",null,0.1390442885602759,null,null,"Has electricity",null,0.14623947765847817,null,null,"Has electricity",null,0.18047346197948097]
[null,null,"Has radio",null,6.184355045260994E-2,null,null,"Has radio",null,7.6525861489225841E-2,null,null,"Has radio",null,8.6477338671356319E-2]
[null,null,"Has television",null,0.14453255503696644,null,null,"Has television",null,0.1585086009566698,null,null,"Has television",null,0.22008202816140404]
[null,null,"Has refrigerator",null,0.12814773065422461,null,null,"Has refrigerator",null,0.14483148355353742,null,null,"Has refrigerator",null,0.17508978993892313]
[null,null,"Has bicycle",null,6.2791439080577716E-2,null,null,"Has bicycle",null,6.6627446452197467E-2,null,null,"Has bicycle",null,8.1024059387456229E-2]
[null,null,"Has motorcycle/scooter",null,7.2409132939616164E-2,null,null,"Has motorcycle/scooter",null,7.652369509721417E-2,null,null,"Has motorcycle/scooter",null,0.14315691978553052]
[null,null,"Has car/truck",null,0.11411867342563398,null,null,"Has car/truck",null,0.13506587284368168,null,null,"Has car/truck",null,0.16602496036221989]
[null,null,"if has a floor made of dirt, dung",null,-0.13613966472590863,null,null,"if has a floor made of dirt, dung",null,-0.1312828026413361,null,null,"if has a floor made of dirt, dung",null,-0.22425974287698255]
[null,null,"if has a finished floor - cemt, vinyl/asphalt strips",null,0.11471192496837386,null,null,"if has a finished floor - cemt, vinyl/asphalt strips",null,8.8770030204643691E-2,null,null,"if has a finished floor - cemt, vinyl/asphalt strips",null,0.2193581197556112]
[null,null,"if has a nicely finished floor - parquet, ceramic tile, carpet",null,7.6620391198636867E-2,null,null,"if has a nicely finished floor - parquet, ceramic tile, carpet",null,8.6160199382908906E-2,null,null,"if has a nicely finished floor - parquet, ceramic tile, carpet",null,4.0404142980989023E-2]
[null,null,"if cooking fuel is electric",null,5.1539281611779161E-2,null,null,"if cooking fuel is electric",null,5.9461588293779878E-2,null,null,"if cooking fuel is electric",null,-1.0299298718717011E-3]
[null,null,"if cooking fuel is nat gas",null,6.5613730814573237E-2,null,null,"if cooking fuel is nat gas",null,7.3870079896896354E-2,null,null,"if cooking fuel is nat gas",null,3.9530023350522081E-2]
[null,null,"if cooking fuel is charcoal",null,3.7108105293868154E-2,null,null,"if cooking fuel is charcoal",null,2.284875683609745E-2,null,null,"if cooking fuel is charcoal",null,3.1714897065820202E-2]
[null,null,"if cooking fuel is wood/straw",null,-6.9707424448573821E-2,null,null,"if cooking fuel is wood/straw",null,-7.8970410068329139E-2,null,null,"if cooking fuel is wood/straw",null,-1.6941917022619307E-2]
[null,null,"if cooking fuel is dung",null,-4.0621389588821619E-3,null,null,"if cooking fuel is dung",null,-1.3600692011110137E-3,null,null,"if cooking fuel is dung",null,-6.4774931769239598E-3]
[null,null,"memsleep",null,-2.7359079184674017E-2,null,null,"memsleep",null,-5.3826559388859503E-2,null,null,"memsleep",null,-3.0029845026456038E-2]
[null,null,"Has an animal-drawn cart",null,-2.253242878572562E-2,null,null,"Has an animal-drawn cart",null,-1.4284562798766783E-2,null,null,"Has an animal-drawn cart",null,4.4506281077040355E-2]
[null,null,"Pirogues",null,8.7785984784987758E-4,null,null,"Pirogues",null,7.3330895510018655E-4,null,null,"Pirogues",null,1.127769171253158E-2]
[null,null,"If hh has a landline phone",null,7.7401969847845808E-2,null,null,"If hh has a landline phone",null,8.8591499564807219E-2,null,null,"If hh has a landline phone",null,0.1366227180223834]
[null,null,"If hh has a cell phone",null,0.13781168771403315,null,null,"If hh has a cell phone",null,0.14710898750779428,null,null,"If hh has a cell phone",null,0.15237104435295015]
[null,null,"If hh has a car/truck",null,1.8562614910830364E-2,null,null,"If hh has a car/truck",null,1.4060607313075943E-2,null,null,"If hh has a car/truck",null,6.0950352602647064E-2]
[null,null,"If hh has own personal car",null,0.11456883550934487,null,null,"If hh has own personal car",null,0.13655195824893679,null,null,"If hh has own personal car",null,0.16199175151231063]
[]
[]
[null,null,"Component Score Covariance Matrix",null,null,null,null,"Component Score Covariance Matrix",null,null,null,null,"Component Score Covariance Matrix"]
[null,null,"Component",null,"1",null,null,"Component",null,"1",null,null,"Component",null,"1"]
[null,null,"1",null,1,null,null,"1",null,1.0000000000000002,null,null,"1",null,1]
[]
[]
[]
[]
[]
[]
[]
[]
[]
[]
[]
[]
[]
[]
[]
[]
[]
[]
[]
[]
[]
[]
[]
[]
[]
[]
[]
[]
[]
[]
[]
[]
[]
[]
[]
[]
[]
[]
[]
[]
[]
[]
[]
[]
[]
[]
[]
[]
[]
[]
[]
[]
[]
[]
[]
[]
[]
[]
[]
[]
[]
[]
[]
[]
[]
[]
[]
[]
[]
[]
[]
[]
[]
[]
[]
[]
[]
[]
[]
[]
[]
[]
[]
[]
[]
[]
[]
[]
[]
[]
[]
[]
[]
[]
[]
[]
[]
[]
[]
[]
[]
[]
[]
[]
[]
[]
[]
[]
[]
[]
[]
[]
[]
[]
[]
[]
[]
[]
[]
[]
[]
[]
[]
[]
[]
[]
[]
[]
[]
[]
[]
[]
[]
[]
[]
[]
[]
[]
[]
[]
[]
[]
[]
[]
[]
[]
[]
[]
[]
[]
[]
[]
[]
[]
[]
[]
[]
[]
[]
[]
[]
[]
[]
[]
[]
[]
[]
[]
[]
[]
[]
[]
[]
[]
[]
[]
[]
[]
[]
[]
[]
[]
[]
[]
[]
[]
[]
[]
[]
[]
[]
[]
[]
[]
[]
[]
[]
[]
[]
[]
[]
[]
[]
[]
[]
[]
[]
[]
[]
[]
[]
[]
[]
[]
[]
[]
[]
[]
[]
[]
[]
[]
[]
[]
[]
[]
[]
[]
[]
[]
[]
[]
[]
[]
[]
[]
[]
[]
[]
[]
[]
[]
[]
[]
[]
[]
[]
[]
[]
[]
[]
[]
[]
[]
[]
[]
[]
[]
[]
[]
[]
[]
[]
[]
[]
[]
[]
[]
[]
[]
[]
[]
[]
[]
[]
[]
[]
[]
[]
[]
[]
[]
[]
[]
[]
[]
[]
[]
[]
[]
[]
[]
[]
[]
[]
[]
[]
[]
[]
[]
[]
[]
[]
[]
[]
[]
[]
[]
[]
[]
[]
[]
[]
[]
[]
[]
[]
[]
[]
[]
[]
[]
[]
[]
[]
[]
[]
[]
[]
[]
[]
[]
[]
[]
[]
[]
[]
[]
[]
[]
[]
[]
[]
[]
[]
[]
[]
[]
[]
[]
[]
[]
[]
[]
[]
[]
[]
[]
[]
[]
[]
[]
[]
[]
[]
[]
[]
[]
[]
[]
[]
[]
[]
[]
[]
[]
[]
[]
[]
[]
[]
[]
[]
[]
[]
[]
[]
[]
[]
[]
[]
[]
[]
[]
[]
[]
[]
[]
[]
[]
[]
[]
[]
[]
[]
[]
[]
[]
[]
[]
[]
[]
[]
[]
[]
[]
[]
[]
[]
[]
[]
[]
[]
[]
[]
[]
[]
[]
[]
[]
[]
[]
[]
[]
[]
[]
[]
[]
[]
[]
[]
[]
[]
[]
[]
[]
[]
[]
[]
[]
[]
[]
[]
[]
[]
[]
[]
[]
[]
[]
[]
[]
[]
[]
[]
[]
[]
[]
[]
[]
[]
[]
[]
[]
[]
[]
[]
[]
[]
[]
[]
[]
[]
[]
[]
[]
[]
[]
[]
[]
[]
[]
[]
[]
[]
[]
[]
[]
[]
[]
[]
[]
[]
[]
[]
[]
[]
[]
[]
[]
[]
[]
[]
[]
[]
[]
[]
[]
[]
[]
[]
[]
[]
[]
[]
[]
[]
[]
[]
[]
[]
[]
[]
[]
[]
["DHS06"]
["Niger",null,"Count"]
["W_text_t","",7660]
["W_text_i","",7660]
["S_text_s","Ratio of Shared improved based on:",7660]
["S_text_i","Ratio of Improved latrines based on:",7660]
["Urban/Rural","Urban",2362]
[null,"Rural",5298]
[null,"Missing",0]
["2006"]
[]
["Sub-national region names","Weighted population"]
[{"$f":"R15","v":"Agadez"},{"$f":"BR122+BR123","v":{"$error":"#VALUE!"}}]
[{"$f":"S15","v":"Diffa"},{"$f":"BS122+BS123","v":{"$error":"#VALUE!"}}]
[{"$f":"T15","v":"Dosso"},{"$f":"BT122+BT123","v":{"$error":"#VALUE!"}}]
[{"$f":"U15","v":"Maradi"},{"$f":"BU122+BU123","v":{"$error":"#VALUE!"}}]
[{"$f":"V15","v":"Niamey"},{"$f":"BV122+BV123","v":{"$error":"#VALUE!"}}]
[{"$f":"W15","v":"Tahoua"},{"$f":"BW122+BW123","v":{"$error":"#VALUE!"}}]
[{"$f":"X15","v":"Tillabéri"},{"$f":"BX122+XR123","v":{"$error":"#VALUE!"}}]
[{"$f":"Y15","v":"Zinder"},{"$f":"BY122+BY123","v":{"$error":"#VALUE!"}}]
[{"$f":"Z15","v":0},{"$f":"BZ122+BZ123","v":0}]
[{"$f":"AA15","v":0},{"$f":"CA122+CA123","v":0}]
[{"$f":"AB15","v":0},{"$f":"CB122+CB123","v":0}]
[{"$f":"AC15","v":0},{"$f":"CC122+CC123","v":0}]
[{"$f":"AD15","v":0},{"$f":"CD122+CD123","v":0}]
[{"$f":"AE15","v":0},{"$f":"CE122+CE123","v":0}]
[{"$f":"AF15","v":0},{"$f":"CF122+CF123","v":0}]
[{"$f":"AG15","v":0},{"$f":"CG122+CG123","v":0}]
[{"$f":"AH15","v":0},{"$f":"CH122+CH123","v":0}]
[{"$f":"AI15","v":0},{"$f":"CI122+CI123","v":0}]
[{"$f":"AJ15","v":0},{"$f":"CJ122+CJ123","v":0}]
[{"$f":"AK15","v":0},{"$f":"CK122+CK123","v":0}]
[{"$f":"AL15","v":0},{"$f":"CL122+CL123","v":0}]
[{"$f":"AM15","v":0},{"$f":"CM122+CM123","v":0}]
[{"$f":"AN15","v":0},{"$f":"CN122+CN123","v":0}]
[{"$f":"AO15","v":0},{"$f":"CO122+CO123","v":0}]
[{"$f":"AP15","v":0},{"$f":"CP122+CP123","v":0}]
[{"$f":"AQ15","v":0},{"$f":"CQ122+CQ123","v":0}]
[{"$f":"AR15","v":0},{"$f":"CR122+CR123","v":0}]
[{"$f":"AS15","v":0},{"$f":"CS122+CS123","v":0}]
[{"$f":"AT15","v":0},{"$f":"CT122+CT123","v":0}]
[{"$f":"AU15","v":0},{"$f":"CU122+CU123","v":0}]
[{"$f":"AV15","v":0},{"$f":"CV122+CV123","v":0}]
[{"$f":"AW15","v":0},{"$f":"CW122+CW123","v":0}]
[{"$f":"AX15","v":0},{"$f":"CX122+CX123","v":0}]
[{"$f":"AY15","v":0},{"$f":"CY122+CY123","v":0}]
[]
[{"$f":"34-COUNTIF(A1037:A1071,\"0\")","v":8},"Sub-regions"]

{"sheet":"DHS12","index":5,"n_rows":1072,"n_cols":77,"rows_kept":1072,"cut":false,"hidden":false,"merged":[[346,52,347,52],[348,52,349,52],[350,52,351,52],[352,52,353,52],[152,52,160,52],[270,52,272,52],[273,52,275,52],[276,52,283,52],[338,54,338,58],[338,59,338,63],[338,64,338,68],[340,52,341,52],[342,52,343,52],[344,52,345,52],[221,52,223,52],[224,52,225,52],[226,52,229,52],[258,54,258,58],[258,59,258,63],[258,64,258,68],[260,52,262,52],[263,52,266,52],[267,52,269,52],[119,64,119,68],[121,52,122,52],[123,52,126,52],[127,52,128,52],[132,54,132,58],[132,59,132,63],[132,64,132,68],[134,52,138,52],[219,54,219,58],[219,59,219,63],[219,64,219,68],[13,64,13,68],[15,52,16,52],[17,52,20,52],[21,52,22,52],[26,54,26,58],[26,59,26,63],[26,64,26,68],[40,52,41,52],[55,54,55,58],[55,59,55,63],[55,64,55,68],[139,52,142,52],[143,0,146,0],[143,52,146,52],[147,0,149,0],[147,52,149,52],[150,0,151,0],[150,52,151,52],[13,54,13,58],[13,59,13,63],[119,54,119,58],[119,59,119,63],[42,52,43,52],[44,52,45,52],[46,0,48,0],[46,52,48,52],[49,0,51,0],[49,52,51,52],[52,0,54,0],[52,52,54,52],[32,52,33,52],[34,52,35,52],[36,52,37,52],[38,0,39,0],[38,52,39,52],[13,2,13,6],[13,7,13,11],[28,52,29,52],[30,0,31,0],[30,52,31,52],[26,2,26,6],[26,7,26,11],[26,12,26,16],[13,12,13,16],[15,0,16,0],[17,0,20,0],[21,0,22,0],[23,0,25,0],[32,0,33,0],[55,2,55,6],[55,7,55,11],[55,12,55,16],[28,0,29,0],[34,0,35,0],[36,0,37,0],[40,0,41,0],[42,0,43,0],[44,0,45,0],[139,0,142,0],[107,0,107,1],[119,2,119,6],[119,7,119,11],[57,0,71,0],[132,12,132,16],[134,0,138,0],[119,12,119,16],[121,0,122,0],[123,0,126,0],[127,0,128,0],[129,0,131,0],[152,0,159,0],[132,2,132,6],[132,7,132,11],[219,2,219,6],[219,7,219,11],[219,12,219,16],[207,0,207,1],[1024,0,1024,2],[1025,0,1025,1],[1030,0,1032,0],[1033,0,1033,2],[398,2,398,5],[221,0,223,0],[398,7,398,10],[398,12,398,15],[399,2,399,4],[399,7,399,9],[399,12,399,14],[400,2,401,3],[400,7,401,8],[400,12,401,13],[405,2,405,3],[405,7,405,8],[405,12,405,13],[406,2,406,3],[406,7,406,8],[406,12,406,13],[401,1,444,1],[402,2,402,3],[402,7,402,8],[402,12,402,13],[403,2,403,3],[403,7,403,8],[403,12,403,13],[404,2,404,3],[404,7,404,8],[404,12,404,13],[409,2,409,3],[409,7,409,8],[409,12,409,13],[410,2,410,3],[410,7,410,8],[410,12,410,13],[407,2,407,3],[407,7,407,8],[407,12,407,13],[408,2,408,3],[408,7,408,8],[408,12,408,13],[413,2,413,3],[413,7,413,8],[413,12,413,13],[414,2,414,3],[414,7,414,8],[414,12,414,13],[411,2,411,3],[411,7,411,8],[411,12,411,13],[412,2,412,3],[412,7,412,8],[412,12,412,13],[417,2,417,3],[417,7,417,8],[417,12,417,13],[418,2,418,3],[418,7,418,8],[418,12,418,13],[415,2,415,3],[415,7,415,8],[415,12,415,13],[416,2,416,3],[416,7,416,8],[416,12,416,13],[421,2,421,3],[421,7,421,8],[421,12,421,13],[422,2,422,3],[422,7,422,8],[422,12,422,13],[419,2,419,3],[419,7,419,8],[419,12,419,13],[420,2,420,3],[420,7,420,8],[420,12,420,13],[425,2,425,3],[425,7,425,8],[425,12,425,13],[426,2,426,3],[426,7,426,8],[426,12,426,13],[423,2,423,3],[423,7,423,8],[423,12,423,13],[424,2,424,3],[424,7,424,8],[424,12,424,13],[429,2,429,3],[429,7,429,8],[429,12,429,13],[430,2,430,3],[430,7,430,8],[430,12,430,13],[427,2,427,3],[427,7,427,8],[427,12,427,13],[428,2,428,3],[428,7,428,8],[428,12,428,13],[433,2,433,3],[433,7,433,8],[433,12,433,13],[434,2,434,3],[434,7,434,8],[434,12,434,13],[431,2,431,3],[431,7,431,8],[431,12,431,13],[432,2,432,3],[432,7,432,8],[432,12,432,13],[437,2,437,3],[437,7,437,8],[437,12,437,13],[438,2,438,3],[438,7,438,8],[438,12,438,13],[435,2,435,3],[435,7,435,8],[435,12,435,13],[436,2,436,3],[436,7,436,8],[436,12,436,13],[441,2,441,3],[441,7,441,8],[441,12,441,13],[442,2,442,3],[442,7,442,8],[442,12,442,13],[439,2,439,3],[439,7,439,8],[439,12,439,13],[440,2,440,3],[440,7,440,8],[440,12,440,13],[445,2,445,3],[445,7,445,8],[445,12,445,13],[446,2,446,3],[446,7,446,8],[446,12,446,13],[443,2,443,3],[443,7,443,8],[443,12,443,13],[444,2,444,3],[444,7,444,8],[444,12,444,13],[449,2,449,3],[449,7,449,8],[449,12,449,13],[450,2,450,3],[450,7,450,8],[450,12,450,13],[447,2,447,3],[447,7,447,8],[447,12,447,13],[448,2,448,3],[448,7,448,8],[448,12,448,13],[453,2,453,3],[453,7,453,8],[453,12,453,13],[454,2,454,3],[454,7,454,8],[454,12,454,13],[451,2,451,3],[451,7,451,8],[451,12,451,13],[452,2,452,3],[452,7,452,8],[452,12,452,13],[457,2,457,3],[457,7,457,8],[457,12,457,13],[458,2,458,3],[458,7,458,8],[458,12,458,13],[455,2,455,3],[455,7,455,8],[455,12,455,13],[456,2,456,3],[456,7,456,8],[456,12,456,13],[461,2,461,3],[461,7,461,8],[461,12,461,13],[462,2,462,3],[462,7,462,8],[462,12,462,13],[459,2,459,3],[459,7,459,8],[459,12,459,13],[460,2,460,3],[460,7,460,8],[460,12,460,13],[465,2,465,3],[465,7,465,8],[465,12,465,13],[466,2,466,3],[466,7,466,8],[466,12,466,13],[463,2,463,3],[463,7,463,8],[463,12,463,13],[464,2,464,3],[464,7,464,8],[464,12,464,13],[469,2,469,3],[469,7,469,8],[469,12,469,13],[470,2,470,4],[470,7,470,8],[470,12,470,13],[467,2,467,3],[467,7,467,8],[467,12,467,13],[468,2,468,3],[468,7,468,8],[468,12,468,13],[473,2,473,3],[473,7,473,8],[473,12,473,13],[474,2,474,3],[474,7,474,8],[474,12,474,13],[471,2,471,3],[471,7,471,8],[471,12,471,13],[472,2,472,3],[472,7,472,8],[472,12,472,13],[477,2,477,3],[477,7,477,8],[477,12,477,13],[478,2,478,3],[478,7,478,8],[478,12,478,13],[475,2,475,3],[475,7,475,8],[475,12,475,13],[476,2,476,3],[476,7,476,8],[476,12,476,13],[481,2,481,3],[481,7,481,8],[481,12,481,13],[482,2,482,3],[482,7,482,8],[482,12,482,13],[479,2,479,3],[479,7,479,8],[479,12,479,13],[480,2,480,3],[480,7,480,8],[480,12,480,13],[485,2,485,3],[485,7,485,8],[485,12,485,13],[486,2,486,3],[486,7,486,8],[486,12,486,13],[483,2,483,3],[483,7,483,8],[483,12,483,13],[484,2,484,3],[484,7,484,8],[484,12,484,13],[489,2,489,3],[489,7,489,8],[489,12,489,13],[490,2,490,3],[490,7,490,8],[490,12,490,13],[487,2,487,3],[487,7,487,8],[487,12,487,13],[488,2,488,3],[488,7,488,8],[488,12,488,13],[493,2,493,3],[493,7,493,8],[493,12,493,13],[494,2,494,3],[494,7,494,8],[494,12,494,13],[491,2,491,3],[491,7,491,8],[491,12,491,14],[492,2,492,3],[492,7,492,8],[492,12,492,13],[497,2,497,3],[497,7,497,8],[497,12,497,13],[498,2,498,3],[498,7,498,9],[498,12,498,13],[495,2,495,3],[495,7,495,8],[495,12,495,13],[496,2,496,3],[496,7,496,8],[496,12,496,13],[501,2,501,3],[501,7,501,8],[501,12,501,13],[502,2,502,3],[502,7,502,8],[502,12,502,13],[499,2,499,3],[499,7,499,8],[499,12,499,13],[500,2,500,3],[500,7,500,8],[500,12,500,13],[505,2,505,3],[505,7,505,8],[505,12,505,13],[506,2,506,3],[506,7,506,8],[506,12,506,13],[503,2,503,3],[503,7,503,8],[503,12,503,13],[504,2,504,3],[504,7,504,8],[504,12,504,13],[509,2,509,3],[509,7,509,8],[509,12,509,13],[510,2,510,3],[510,7,510,8],[510,12,510,13],[507,2,507,3],[507,7,507,8],[507,12,507,13],[508,2,508,3],[508,7,508,8],[508,12,508,13],[513,2,513,3],[513,7,513,8],[513,12,513,13],[514,2,514,3],[514,7,514,8],[514,12,514,13],[511,2,511,3],[511,7,511,8],[511,12,511,13],[512,2,512,3],[512,7,512,8],[512,12,512,13],[517,2,517,3],[517,7,517,8],[517,12,517,13],[518,2,518,3],[518,7,518,8],[518,12,518,13],[515,2,515,3],[515,7,515,8],[515,12,515,13],[516,2,516,3],[516,7,516,8],[516,12,516,13],[521,2,521,3],[521,7,521,8],[521,12,521,13],[522,2,522,3],[522,7,522,8],[522,12,522,13],[519,2,519,3],[519,7,519,8],[519,12,519,13],[520,2,520,3],[520,7,520,8],[520,12,520,13],[525,2,525,3],[525,7,525,8],[525,12,525,13],[526,2,526,3],[526,7,526,8],[526,12,526,13],[523,2,523,3],[523,7,523,8],[523,12,523,13],[524,2,524,3],[524,7,524,8],[524,12,524,13],[529,2,529,3],[529,7,529,8],[529,12,529,13],[530,2,530,3],[530,7,530,8],[530,12,530,13],[527,2,527,3],[527,7,527,8],[527,12,527,13],[528,2,528,3],[528,7,528,8],[528,12,528,13],[533,2,533,3],[533,7,533,8],[533,12,533,13],[534,2,534,3],[534,7,534,8],[534,12,534,13],[531,2,531,3],[531,7,531,8],[531,12,531,13],[532,2,532,3],[532,7,532,8],[532,12,532,13],[537,2,537,3],[537,7,537,8],[537,12,537,13],[538,2,538,3],[538,7,538,8],[538,12,538,13],[535,2,535,3],[535,7,535,8],[535,12,535,13],[536,2,536,3],[536,7,536,8],[536,12,536,13],[542,2,542,3],[542,7,542,8],[542,12,542,13],[543,2,543,3],[543,7,543,8],[543,12,543,13],[539,2,539,6],[539,7,539,8],[539,12,539,13],[540,2,541,3],[540,4,540,6],[540,7,540,8],[540,12,540,13],[541,7,541,8],[541,12,541,13],[546,2,547,3],[546,7,546,8],[546,12,546,13],[547,7,547,8],[547,12,547,13],[548,2,548,3],[548,7,548,8],[548,12,548,13],[544,2,544,3],[544,7,544,8],[544,12,544,13],[545,2,545,4],[545,7,545,8],[545,12,545,13],[551,2,551,3],[551,7,551,8],[551,12,551,13],[552,2,552,3],[552,7,552,8],[552,12,552,13],[549,2,549,3],[549,7,549,8],[549,12,549,13],[550,2,550,3],[550,7,550,8],[550,12,550,13],[555,2,555,3],[555,7,555,8],[555,12,555,13],[556,2,556,3],[556,7,556,8],[556,12,556,13],[553,2,553,3],[553,7,553,8],[553,12,553,13],[554,2,554,3],[554,7,554,8],[554,12,554,13],[559,2,559,3],[559,7,559,8],[559,12,559,13],[560,2,560,3],[560,7,560,8],[560,12,560,13],[557,2,557,3],[557,7,557,8],[557,12,557,13],[558,2,558,3],[558,7,558,8],[558,12,558,13],[563,2,563,3],[563,7,563,8],[563,12,563,13],[564,2,564,3],[564,7,564,8],[564,12,564,13],[561,2,561,3],[561,7,561,8],[561,12,561,13],[562,2,562,3],[562,7,562,8],[562,12,562,13],[567,2,567,3],[567,7,567,8],[567,12,567,13],[568,2,568,3],[568,7,568,8],[568,12,568,13],[565,2,565,3],[565,7,565,8],[565,12,565,13],[566,2,566,3],[566,7,566,8],[566,12,566,13],[571,2,571,3],[571,7,571,8],[571,12,571,13],[572,2,572,3],[572,7,572,8],[572,12,572,13],[569,2,569,3],[569,7,569,8],[569,12,569,13],[570,2,570,3],[570,7,570,8],[570,12,570,13],[575,2,575,3],[575,7,575,8],[575,12,575,13],[576,2,576,3],[576,7,576,8],[576,12,576,13],[573,2,573,3],[573,7,573,8],[573,12,573,13],[574,2,574,3],[574,7,574,8],[574,12,574,13],[579,2,579,3],[579,7,579,8],[579,12,579,13],[580,2,580,3],[580,7,580,8],[580,12,580,13],[577,2,577,3],[577,7,577,8],[577,12,577,13],[578,2,578,3],[578,7,578,8],[578,12,578,13],[584,2,584,3],[584,7,584,8],[584,12,584,13],[585,2,585,3],[585,7,585,8],[585,12,585,13],[581,2,581,3],[581,7,581,8],[581,12,581,16],[582,2,582,3],[582,7,582,8],[582,12,583,13],[582,14,582,16],[583,2,583,3],[583,7,583,8],[588,2,588,3],[588,7,588,8],[588,12,589,13],[589,2,589,3],[589,7,589,8],[590,2,590,3],[590,7,590,8],[590,12,590,13],[586,2,586,3],[586,7,586,8],[586,12,586,13],[587,2,587,3],[587,7,587,8],[587,12,587,14],[593,2,593,3],[593,7,593,8],[593,12,593,13],[594,2,594,3],[594,7,594,8],[594,12,594,13],[591,2,591,3],[591,7,591,8],[591,12,591,13],[592,2,592,3],[592,7,592,8],[592,12,592,13],[595,2,595,3],[595,7,595,11],[595,12,595,13],[596,2,596,3],[596,7,597,8],[596,9,596,11],[596,12,596,13],[597,2,597,3],[597,12,597,13],[600,2,600,3],[600,7,600,8],[600,12,600,13],[601,2,601,3],[601,7,601,9],[601,12,601,13],[598,2,598,3],[598,7,598,8],[598,12,598,13],[599,2,599,3],[599,7,599,8],[599,12,599,13],[605,2,605,3],[605,7,605,8],[605,12,605,13],[606,2,606,3],[606,7,606,8],[606,12,606,13],[602,2,602,3],[602,7,603,8],[602,12,602,13],[603,2,603,3],[603,12,603,13],[604,2,604,3],[604,7,604,8],[604,12,604,13],[609,2,609,3],[609,7,609,8],[609,12,609,13],[610,2,610,3],[610,7,610,8],[610,12,610,13],[607,2,607,3],[607,7,607,8],[607,12,607,13],[608,2,608,3],[608,7,608,8],[608,12,608,13],[613,2,613,3],[613,7,613,8],[613,12,613,13],[614,2,614,3],[614,7,614,8],[614,12,614,13],[611,2,611,3],[611,7,611,8],[611,12,611,13],[612,2,612,3],[612,7,612,8],[612,12,612,13],[617,2,617,3],[617,7,617,8],[617,12,617,13],[618,2,618,3],[618,7,618,8],[618,12,618,13],[615,2,615,4],[615,7,615,8],[615,12,615,13],[616,2,616,3],[616,7,616,8],[616,12,616,13],[621,2,621,3],[621,7,621,8],[621,12,621,13],[622,2,622,3],[622,7,622,8],[622,12,622,13],[619,2,619,3],[619,7,619,8],[619,12,619,13],[620,2,620,3],[620,7,620,8],[620,12,620,13],[625,2,625,3],[625,7,625,8],[625,12,625,13],[626,2,626,3],[626,7,626,8],[626,12,626,13],[623,2,623,3],[623,7,623,8],[623,12,623,13],[624,2,624,3],[624,7,624,8],[624,12,624,13],[629,2,629,3],[629,7,629,8],[629,12,629,13],[630,2,630,3],[630,7,630,8],[630,12,630,13],[627,2,627,3],[627,7,627,8],[627,12,627,13],[628,2,628,3],[628,7,628,8],[628,12,628,13],[633,2,633,3],[633,7,633,8],[633,12,633,13],[634,2,634,3],[634,7,634,8],[634,12,634,13],[631,2,631,3],[631,7,631,8],[631,12,631,13],[632,2,632,3],[632,7,632,8],[632,12,632,13],[637,2,637,3],[637,7,637,8],[637,12,637,13],[638,2,638,3],[638,7,638,8],[638,12,638,13],[635,2,635,3],[635,7,635,8],[635,12,635,13],[636,2,636,3],[636,7,636,8],[636,12,636,13],[641,2,641,3],[641,7,641,8],[641,12,641,13],[642,2,642,3],[642,7,642,8],[642,12,642,13],[639,2,639,3],[639,7,639,8],[639,12,639,13],[640,2,640,3],[640,7,640,8],[640,12,640,13],[645,2,645,3],[645,7,645,8],[645,12,645,13],[646,2,646,3],[646,7,646,8],[646,12,646,13],[643,2,643,3],[643,7,643,8],[643,12,643,13],[644,2,644,3],[644,7,644,8],[644,12,644,13],[649,2,649,3],[649,7,649,8],[649,12,649,13],[650,2,650,3],[650,7,650,8],[650,12,650,13],[647,2,647,3],[647,7,647,8],[647,12,647,13],[648,2,648,3],[648,7,648,8],[648,12,648,13],[653,2,653,3],[653,7,653,8],[653,12,653,13],[654,2,654,3],[654,7,654,8],[654,12,654,13],[651,2,651,3],[651,7,651,8],[651,12,651,13],[652,2,652,3],[652,7,652,8],[652,12,652,13],[657,2,657,3],[657,7,657,8],[657,12,657,13],[658,2,658,3],[658,7,658,8],[658,12,658,13],[655,2,655,3],[655,7,655,8],[655,12,655,13],[656,2,656,3],[656,7,656,8],[656,12,656,13],[661,2,661,3],[661,7,661,8],[661,12,661,13],[662,2,662,3],[662,7,662,8],[662,12,662,13],[659,2,659,3],[659,7,659,8],[659,12,659,13],[660,2,660,3],[660,7,660,8],[660,12,660,13],[665,2,665,3],[665,7,665,8],[665,12,665,13],[666,2,666,3],[666,7,666,8],[666,12,666,13],[663,2,663,3],[663,7,663,8],[663,12,663,13],[664,2,664,3],[664,7,664,8],[664,12,664,13],[669,2,669,3],[669,7,669,8],[669,12,669,13],[670,2,670,3],[670,7,670,8],[670,12,670,13],[667,2,667,3],[667,7,667,8],[667,12,667,13],[668,2,668,3],[668,7,668,8],[668,12,668,13],[673,2,673,3],[673,7,673,8],[673,12,673,13],[674,2,674,3],[674,7,674,8],[674,12,674,13],[671,2,671,3],[671,7,671,8],[671,12,671,13],[672,2,672,3],[672,7,672,8],[672,12,672,13],[677,2,677,3],[677,7,677,8],[677,12,677,13],[678,2,678,3],[678,7,678,8],[678,12,678,14],[675,2,675,3],[675,7,675,8],[675,12,675,13],[676,2,676,3],[676,7,676,8],[676,12,676,13],[681,2,681,3],[681,7,681,8],[681,12,681,13],[682,2,682,3],[682,7,682,8],[682,12,682,13],[679,2,679,3],[679,7,679,8],[679,12,679,13],[680,2,680,3],[680,7,680,8],[680,12,680,13],[685,2,685,3],[685,7,685,8],[685,12,685,13],[686,2,686,3],[686,7,686,8],[686,12,686,13],[683,2,683,3],[683,7,683,8],[683,12,683,13],[684,2,684,3],[684,7,684,8],[684,12,684,13],[687,2,687,3],[687,7,687,8],[687,12,687,13],[688,2,688,3],[688,7,688,8],[688,12,688,13],[693,2,693,3],[693,7,693,8],[693,12,693,13],[694,2,694,3],[694,7,694,8],[694,12,694,13],[691,2,691,3],[691,7,691,8],[691,12,691,13],[692,2,692,3],[692,7,692,8],[692,12,692,13],[699,8,699,9],[697,2,697,3],[697,7,697,8],[697,12,697,13]],"merged_total":1015,"flags":["merged_cut"]}
[]
[{"$f":"A1026","v":"Niger"}]
[{"$f":"A1034","v":"2012"}]
["Use of drinking water sources"]
[" by wealth quintile and sub-national region"]
["Notes:"]
["WHO/UNICEF JMP customised wealth index excludes water,"]
[" sanitation and hygiene assets."]
["Survey used for analysis:",{"$f":"A1025","v":"DHS12"}]
[{"$f":"B1028","v":""}]
[{"$f":"B1027","v":""}]
[]
[]
["Use of drinking water sources",null,"NATIONAL wealth index quintile",null,null,null,null,"URBAN wealth index quintile",null,null,null,null,"RURAL wealth index quintile",null,null,null,null,"SUB-REGIONS:",null,null,null,null,null,null,null,null,null,null,null,null,null,null,null,null,null,null,null,null,null,null,null,null,null,null,null,null,null,null,null,null,null,null,"Raw numbers of respondents:","Use of drinking water sources","NATIONAL wealth index quintile",null,null,null,null,"URBAN wealth index quintile",null,null,null,null,"RURAL wealth index quintile",null,null,null,null,"SUB-REGIONS:"]
["Weighted percentage (used in graphs)",null,"Poorest","Poor","Middle","Rich","Richest","Poorest","Poor","Middle","Rich","Richest","Poorest","Poor","Middle","Rich","Richest","Agadez","Diffa","Dosso","Maradi","Niamey","Tahoua","Tillaberi","Zinder",null,null,null,null,null,null,null,null,null,null,null,null,null,null,null,null,null,null,null,null,null,null,null,null,null,null,null,"Water data, raw numbers (weighted)",null,"Poorest","Poor","Middle","Rich","Richest","Poorest","Poor","Middle","Rich","Richest","Poorest","Poor","Middle","Rich","Richest","Agadez","Diffa","Dosso","Maradi","Niamey","Tahoua","Tillaberi","Zinder"]
["Water","Improved",62.406584427273245,62.603286003596573,61.277960173469005,61.444248571574398,85.251132768524073,92.440531077537486,98.111264339979613,99.24266947715185,99.138795816753188,98.846088942824011,60.623734727454746,61.825947784511527,61.260233685552315,58.316299816874285,60.616325726196095,75.293181368342971,74.586041352832197,44.710423098319716,72.921724174006613,98.526718811480663,56.326618175527528,73.057476467809181,67.50967966055498,null,null,null,null,null,null,null,null,null,null,null,null,null,null,null,null,null,null,null,null,null,null,null,null,null,null,null,"Water","Improved","N/A","N/A","N/A","N/A","N/A","N/A","N/A","N/A","N/A","N/A","N/A","N/A","N/A","N/A","N/A","N/A","N/A","N/A","N/A","N/A","N/A","N/A","N/A"]
[null,"Not Improved",37.59341557272672,37.396713996403427,38.722039826530889,38.555751428425545,14.748867231475998,7.559468922462548,1.8887356600203982,0.75733052284816627,0.86120418324681069,1.1539110571760192,39.376265272545382,38.174052215488146,38.73976631444765,41.683700183125715,39.383674273804054,24.706818631656976,25.413958647167927,55.289576901680405,27.078275825993547,1.4732811885193409,43.673381824472536,26.942523532190833,32.490320339444814,null,null,null,null,null,null,null,null,null,null,null,null,null,null,null,null,null,null,null,null,null,null,null,null,null,null,null,null,"Not Improved","N/A","N/A","N/A","N/A","N/A","N/A","N/A","N/A","N/A","N/A","N/A","N/A","N/A","N/A","N/A","N/A","N/A","N/A","N/A","N/A","N/A","N/A","N/A"]
["Water ladder","Basic",{"$f":"C16*C23/100","v":41.625191812991254},{"$f":"D16*D23/100","v":40.253912900312592},{"$f":"E16*E23/100","v":39.830674112754856},43.07241824867365,72.292960587708407,73.767543799874915,82.413462045582875,90.211586554731042,92.397357701213963,96.374936719253412,39.890417450665225,38.517565469750679,40.247973531407872,38.37212527950328,41.158485168087154,68.817967770665476,67.202023258901804,36.170732286540648,38.502670363875488,95.373863809513281,43.258842758805137,56.692601739019921,42.463588506489074,null,null,null,null,null,null,null,null,null,null,null,null,null,null,null,null,null,null,null,null,null,null,null,null,null,null,null,"Water ladder","Basic","N/A","N/A","N/A","N/A","N/A","N/A","N/A","N/A","N/A","N/A","N/A","N/A","N/A","N/A","N/A","N/A","N/A","N/A","N/A","N/A","N/A","N/A","N/A"]
[null,"Limited",{"$f":"C16*C22/100","v":20.781392614281991},{"$f":"D16*D22/100","v":22.34937310328398},{"$f":"E16*E22/100","v":21.447286060714148},18.371830322900745,12.958172180815659,18.672987277662571,15.697802294396737,9.0310829224208184,6.741438115539216,2.4711522235706003,20.733317276789524,23.308382314760848,21.012260154144442,19.944174537371008,19.457840558108945,6.475213597677496,7.3840180939303881,8.5396908117790673,34.419053810131125,3.1528550019673816,13.067775416722386,16.364874728789253,25.046091154065898,null,null,null,null,null,null,null,null,null,null,null,null,null,null,null,null,null,null,null,null,null,null,null,null,null,null,null,null,"Limited","N/A","N/A","N/A","N/A","N/A","N/A","N/A","N/A","N/A","N/A","N/A","N/A","N/A","N/A","N/A","N/A","N/A","N/A","N/A","N/A","N/A","N/A","N/A"]
[null,"Unimproved",{"$f":"100-C18-C19-C21","v":36.539910024350426},{"$f":"100-D18-D19-D21","v":35.996402868638619},{"$f":"100-E18-E19-E21","v":37.570102755009373},37.482026476519174,13.711913568314568,7.3724036830338422,1.6461695072876594,0.75733052284813951,0.86120418324682113,1.1539110571759874,38.320490001170583,36.60147533578526,37.444548849295337,40.54639818438762,37.718154707332559,24.706818631657029,25.222023209192134,55.227803378309197,27.027327097240267,1.4732811885193371,42.993155508525454,20.496143889202664,31.461215953253557,null,null,null,null,null,null,null,null,null,null,null,null,null,null,null,null,null,null,null,null,null,null,null,null,null,null,null,null,"Unimproved","N/A","N/A","N/A","N/A","N/A","N/A","N/A","N/A","N/A","N/A","N/A","N/A","N/A","N/A","N/A","N/A","N/A","N/A","N/A","N/A","N/A","N/A","N/A"]
[null,"Surface water",1.0535055483763287,1.4003111277648101,1.1519370715216213,1.0737249519064349,1.0369536631613658,0.18706523942867234,0.24256615273272794,0,0,0,1.055775271374674,1.5725768797032156,1.2952174651523505,1.1373019987380888,1.6655195664713467,0,0.19193543797567705,6.1773523371089073E-2,5.094872875312003E-2,0,0.68022631594702354,6.4463796429881635,1.0291043861914702,null,null,null,null,null,null,null,null,null,null,null,null,null,null,null,null,null,null,null,null,null,null,null,null,null,null,null,null,"Surface water","N/A","N/A","N/A","N/A","N/A","N/A","N/A","N/A","N/A","N/A","N/A","N/A","N/A","N/A","N/A","N/A","N/A","N/A","N/A","N/A","N/A","N/A","N/A"]
["Improved water point at more than 30 minutes","Yes",33.299999999999997,35.700000000000003,35,29.9,15.2,20.2,16,9.1,6.8,2.5,34.200000000000003,37.700000000000003,34.299999999999997,34.200000000000003,32.1,8.6,9.9,19.100000000000001,47.2,3.2,23.2,22.4,37.1,null,null,null,null,null,null,null,null,null,null,null,null,null,null,null,null,null,null,null,null,null,null,null,null,null,null,null,"Improved water point at more than 30 minutes","Yes","N/A","N/A","N/A","N/A","N/A","N/A","N/A","N/A","N/A","N/A","N/A","N/A","N/A","N/A","N/A","N/A","N/A","N/A","N/A","N/A","N/A","N/A","N/A"]
[null,"No",66.7,64.3,65,70.099999999999994,84.8,79.8,84,90.9,93.2,97.5,65.8,62.3,65.7,65.8,67.900000000000006,91.4,90.1,80.900000000000006,52.8,96.8,76.8,77.599999999999994,62.9,null,null,null,null,null,null,null,null,null,null,null,null,null,null,null,null,null,null,null,null,null,null,null,null,null,null,null,null,"No","N/A","N/A","N/A","N/A","N/A","N/A","N/A","N/A","N/A","N/A","N/A","N/A","N/A","N/A","N/A","N/A","N/A","N/A","N/A","N/A","N/A","N/A","N/A"]
["Manually calculated ratios","Improved wells",{"$f":"C62/(C62+C63)*100","v":39.686447368027721},39.635409558983945,40.738038879764311,36.83207994423941,40.514172168279146,29.40021662332396,23.721458747737831,65.834784822657184,0,35.233114160840096,39.922296833993329,39.886852789908858,40.784781139206153,38.459720493989444,37.97934973360843,34.800526878869192,54.496763929450786,21.129644645376658,51.162716929213623,38.693145310027624,33.29622930874924,64.039116092690236,30.354797447796251]
[null,"Improved springs",{"$f":"C64/(C64+C65)*100","v":0},10.575938962638459,17.182214442419024,12.364113424545279,0,0,50,50,50,50,{"$f":"M64/(M64+M65)*100","v":0},7.3820096900753223,16.859412789786223,26.336407689207896,0,63.569356590633184,50,{"$f":"T64/(T64+T65)*100","v":36.126600782753393},{"$f":"U64/(U64+U65)*100","v":0},50,{"$f":"W64/(W64+W65)*100","v":12.199498576910143},{"$f":"X64/(X64+X65)*100","v":8.8958237629977415},{"$f":"Y64/(Y64+Y65)*100","v":10.020806291558447}]
[null,"Other"]
[null,null,"NATIONAL wealth index quintile",null,null,null,null,"URBAN wealth index quintile",null,null,null,null,"RURAL wealth index quintile",null,null,null,null,"SUB-REGIONS:",null,null,null,null,null,null,null,null,null,null,null,null,null,null,null,null,null,null,null,null,null,null,null,null,null,null,null,null,null,null,null,null,null,null,"Raw numbers of respondents:","Use of drinking water sources","NATIONAL wealth index quintile",null,null,null,null,"URBAN wealth index quintile",null,null,null,null,"RURAL wealth index quintile",null,null,null,null,"SUB-REGIONS:"]
["Percentage based on weighted population",null,"Poorest","Poor","Middle","Rich","Richest","Poorest","Poor","Middle","Rich","Richest","Poorest","Poor","Middle","Rich","Richest","Agadez","Diffa","Dosso","Maradi","Niamey","Tahoua","Tillaberi","Zinder",null,null,null,null,null,null,null,null,null,null,null,null,null,null,null,null,null,null,null,null,null,null,null,null,null,null,null,"Water data, raw numbers (weighted)",null,"Poorest","Poor","Middle","Rich","Richest","Poorest","Poor","Middle","Rich","Richest","Poorest","Poor","Middle","Rich","Richest","Agadez","Diffa","Dosso","Maradi","Niamey","Tahoua","Tillaberi","Zinder"]
["Piped water","Yes",21.8,21.4,20.100000000000001,26,70.900000000000006,86.1,94.5,95.5,97.4,97.1,18.3,19.8,18.2,18.3,24.6,55.2,39.799999999999997,18.899999999999999,36,95,29.9,16.399999999999999,22.8,null,null,null,null,null,null,null,null,null,null,null,null,null,null,null,null,null,null,null,null,null,null,null,null,null,null,null,"Piped water","Yes","N/A","N/A","N/A","N/A","N/A","N/A","N/A","N/A","N/A","N/A","N/A","N/A","N/A","N/A","N/A","N/A","N/A","N/A","N/A","N/A","N/A","N/A","N/A"]
[null,"No",78.2,78.599999999999994,79.900000000000006,74,29.1,13.9,5.5,4.5,2.6,2.9,81.7,80.2,81.8,81.7,75.400000000000006,44.8,60.2,81.099999999999994,64,5,70.099999999999994,83.6,77.2,null,null,null,null,null,null,null,null,null,null,null,null,null,null,null,null,null,null,null,null,null,null,null,null,null,null,null,null,"No","N/A","N/A","N/A","N/A","N/A","N/A","N/A","N/A","N/A","N/A","N/A","N/A","N/A","N/A","N/A","N/A","N/A","N/A","N/A","N/A","N/A","N/A","N/A"]
["Piped water on premises","Yes",0.4,0.7,0.8,2.8,34.200000000000003,10.9,21.4,34.4,57.5,82.3,0.1,0.4,0.1,1.2,4.2,31.9,7,3.6,5.9,48.7,4.5999999999999996,3.8,2.4,null,null,null,null,null,null,null,null,null,null,null,null,null,null,null,null,null,null,null,null,null,null,null,null,null,null,null,"Piped water on premises","Yes","N/A","N/A","N/A","N/A","N/A","N/A","N/A","N/A","N/A","N/A","N/A","N/A","N/A","N/A","N/A","N/A","N/A","N/A","N/A","N/A","N/A","N/A","N/A"]
[null,"No",99.6,99.3,99.2,97.2,65.8,89.1,78.599999999999994,65.599999999999994,42.5,17.7,99.9,99.6,99.9,98.8,95.8,68.099999999999994,93,96.4,94.1,51.3,95.4,96.2,97.6,null,null,null,null,null,null,null,null,null,null,null,null,null,null,null,null,null,null,null,null,null,null,null,null,null,null,null,null,"No","N/A","N/A","N/A","N/A","N/A","N/A","N/A","N/A","N/A","N/A","N/A","N/A","N/A","N/A","N/A","N/A","N/A","N/A","N/A","N/A","N/A","N/A","N/A"]
["Piped water into dwelling","Yes","N/A","N/A","N/A","N/A","N/A","N/A","N/A","N/A","N/A","N/A","N/A","N/A","N/A","N/A","N/A","N/A","N/A","N/A","N/A","N/A","N/A","N/A","N/A",null,null,null,null,null,null,null,null,null,null,null,null,null,null,null,null,null,null,null,null,null,null,null,null,null,null,null,"Piped water into dwelling","Yes","N/A","N/A","N/A","N/A","N/A","N/A","N/A","N/A","N/A","N/A","N/A","N/A","N/A","N/A","N/A","N/A","N/A","N/A","N/A","N/A","N/A","N/A","N/A"]
[null,"No","N/A","N/A","N/A","N/A","N/A","N/A","N/A","N/A","N/A","N/A","N/A","N/A","N/A","N/A","N/A","N/A","N/A","N/A","N/A","N/A","N/A","N/A","N/A",null,null,null,null,null,null,null,null,null,null,null,null,null,null,null,null,null,null,null,null,null,null,null,null,null,null,null,null,"No","N/A","N/A","N/A","N/A","N/A","N/A","N/A","N/A","N/A","N/A","N/A","N/A","N/A","N/A","N/A","N/A","N/A","N/A","N/A","N/A","N/A","N/A","N/A"]
["Water source on premises","Yes",2.6,2.8,2.8,5.2,42.3,21.2,31.5,49,67.5,90.3,1.8,2.2000000000000002,1.7,3,7,35.4,14.2,6.4,7.6,65,7.5,4.7,5,null,null,null,null,null,null,null,null,null,null,null,null,null,null,null,null,null,null,null,null,null,null,null,null,null,null,null,"Water source on premises","Yes","N/A","N/A","N/A","N/A","N/A","N/A","N/A","N/A","N/A","N/A","N/A","N/A","N/A","N/A","N/A","N/A","N/A","N/A","N/A","N/A","N/A","N/A","N/A"]
[null,"No",97.4,97.2,97.2,94.8,57.7,78.8,68.5,51,32.5,9.6999999999999993,98.2,97.8,98.3,97,93,64.599999999999994,85.8,93.6,92.4,35,92.5,95.3,95,null,null,null,null,null,null,null,null,null,null,null,null,null,null,null,null,null,null,null,null,null,null,null,null,null,null,null,null,"No","N/A","N/A","N/A","N/A","N/A","N/A","N/A","N/A","N/A","N/A","N/A","N/A","N/A","N/A","N/A","N/A","N/A","N/A","N/A","N/A","N/A","N/A","N/A"]
["Improved Water source on premises","Yes",1.8,1.9,2.2999999999999998,4.5,41.5,19.899999999999999,31.2,49,67.5,89.4,0.9,1.6,1,2.5,5.9,35.299999999999997,13.8,4.4000000000000004,7.1,64.599999999999994,6.8,4.5,4.4000000000000004,null,null,null,null,null,null,null,null,null,null,null,null,null,null,null,null,null,null,null,null,null,null,null,null,null,null,null,"Improved water source on premises","Yes","N/A","N/A","N/A","N/A","N/A","N/A","N/A","N/A","N/A","N/A","N/A","N/A","N/A","N/A","N/A","N/A","N/A","N/A","N/A","N/A","N/A","N/A","N/A"]
[null,"No",98.2,98.1,97.7,95.5,58.5,80.099999999999994,68.8,51,32.5,10.6,99.1,98.4,99,97.5,94.1,64.7,86.2,95.6,92.9,35.4,93.2,95.5,95.6,null,null,null,null,null,null,null,null,null,null,null,null,null,null,null,null,null,null,null,null,null,null,null,null,null,null,null,null,"No","N/A","N/A","N/A","N/A","N/A","N/A","N/A","N/A","N/A","N/A","N/A","N/A","N/A","N/A","N/A","N/A","N/A","N/A","N/A","N/A","N/A","N/A","N/A"]
["Piped water on premises available when needed","Yes","N/A","N/A","N/A","N/A","N/A","N/A","N/A","N/A","N/A","N/A","N/A","N/A","N/A","N/A","N/A","N/A","N/A","N/A","N/A","N/A","N/A","N/A","N/A",null,null,null,null,null,null,null,null,null,null,null,null,null,null,null,null,null,null,null,null,null,null,null,null,null,null,null,"Piped water on premises available when needed","Yes","N/A","N/A","N/A","N/A","N/A","N/A","N/A","N/A","N/A","N/A","N/A","N/A","N/A","N/A","N/A","N/A","N/A","N/A","N/A","N/A","N/A","N/A","N/A"]
[null,"No","N/A","N/A","N/A","N/A","N/A","N/A","N/A","N/A","N/A","N/A","N/A","N/A","N/A","N/A","N/A","N/A","N/A","N/A","N/A","N/A","N/A","N/A","N/A",null,null,null,null,null,null,null,null,null,null,null,null,null,null,null,null,null,null,null,null,null,null,null,null,null,null,null,null,"No","N/A","N/A","N/A","N/A","N/A","N/A","N/A","N/A","N/A","N/A","N/A","N/A","N/A","N/A","N/A","N/A","N/A","N/A","N/A","N/A","N/A","N/A","N/A"]
["Water point at more than 30 minutes","Yes",38.4,39.700000000000003,38.700000000000003,36.9,19.399999999999999,19.399999999999999,16,9.4,6.8,2.5,39.5,40.299999999999997,38.6,40.200000000000003,37.700000000000003,22.7,13.2,20.7,53.3,3.3,35.9,25.7,40.6,null,null,null,null,null,null,null,null,null,null,null,null,null,null,null,null,null,null,null,null,null,null,null,null,null,null,null,"Water point at more than 30 minutes","Yes","N/A","N/A","N/A","N/A","N/A","N/A","N/A","N/A","N/A","N/A","N/A","N/A","N/A","N/A","N/A","N/A","N/A","N/A","N/A","N/A","N/A","N/A","N/A"]
[null,"No",61.6,60.3,61.3,63.1,80.599999999999994,80.599999999999994,84,90.6,93.2,97.5,60.5,59.7,61.4,59.8,62.3,77.3,86.8,79.3,46.7,96.7,64.099999999999994,74.3,59.4,null,null,null,null,null,null,null,null,null,null,null,null,null,null,null,null,null,null,null,null,null,null,null,null,null,null,null,null,"No","N/A","N/A","N/A","N/A","N/A","N/A","N/A","N/A","N/A","N/A","N/A","N/A","N/A","N/A","N/A","N/A","N/A","N/A","N/A","N/A","N/A","N/A","N/A"]
["Water source available when needed","Yes","N/A","N/A","N/A","N/A","N/A","N/A","N/A","N/A","N/A","N/A","N/A","N/A","N/A","N/A","N/A","N/A","N/A","N/A","N/A","N/A","N/A","N/A","N/A",null,null,null,null,null,null,null,null,null,null,null,null,null,null,null,null,null,null,null,null,null,null,null,null,null,null,null,"Water source available when needed","Yes","N/A","N/A","N/A","N/A","N/A","N/A","N/A","N/A","N/A","N/A","N/A","N/A","N/A","N/A","N/A","N/A","N/A","N/A","N/A","N/A","N/A","N/A","N/A"]
[null,"No","N/A","N/A","N/A","N/A","N/A","N/A","N/A","N/A","N/A","N/A","N/A","N/A","N/A","N/A","N/A","N/A","N/A","N/A","N/A","N/A","N/A","N/A","N/A",null,null,null,null,null,null,null,null,null,null,null,null,null,null,null,null,null,null,null,null,null,null,null,null,null,null,null,null,"No","N/A","N/A","N/A","N/A","N/A","N/A","N/A","N/A","N/A","N/A","N/A","N/A","N/A","N/A","N/A","N/A","N/A","N/A","N/A","N/A","N/A","N/A","N/A"]
["Improved water source available when needed","Yes","N/A","N/A","N/A","N/A","N/A","N/A","N/A","N/A","N/A","N/A","N/A","N/A","N/A","N/A","N/A","N/A","N/A","N/A","N/A","N/A","N/A","N/A","N/A",null,null,null,null,null,null,null,null,null,null,null,null,null,null,null,null,null,null,null,null,null,null,null,null,null,null,null,"Improved water source available when needed","Yes","N/A","N/A","N/A","N/A","N/A","N/A","N/A","N/A","N/A","N/A","N/A","N/A","N/A","N/A","N/A","N/A","N/A","N/A","N/A","N/A","N/A","N/A","N/A"]
[null,"No","N/A","N/A","N/A","N/A","N/A","N/A","N/A","N/A","N/A","N/A","N/A","N/A","N/A","N/A","N/A","N/A","N/A","N/A","N/A","N/A","N/A","N/A","N/A",null,null,null,null,null,null,null,null,null,null,null,null,null,null,null,null,null,null,null,null,null,null,null,null,null,null,null,null,"No","N/A","N/A","N/A","N/A","N/A","N/A","N/A","N/A","N/A","N/A","N/A","N/A","N/A","N/A","N/A","N/A","N/A","N/A","N/A","N/A","N/A","N/A","N/A"]
["Microbiological quality at point of collection","Not contaminated (No E. coli in 100 mL)","N/A","N/A","N/A","N/A","N/A","N/A","N/A","N/A","N/A","N/A","N/A","N/A","N/A","N/A","N/A","N/A","N/A","N/A","N/A","N/A","N/A","N/A","N/A",null,null,null,null,null,null,null,null,null,null,null,null,null,null,null,null,null,null,null,null,null,null,null,null,null,null,null,"Microbiological quality at point of collection","Not contaminated (No E. coli in 100 mL)","N/A","N/A","N/A","N/A","N/A","N/A","N/A","N/A","N/A","N/A","N/A","N/A","N/A","N/A","N/A","N/A","N/A","N/A","N/A","N/A","N/A","N/A","N/A"]
[null,"Contaminated (E. coli detected in 100 mL)","N/A","N/A","N/A","N/A","N/A","N/A","N/A","N/A","N/A","N/A","N/A","N/A","N/A","N/A","N/A","N/A","N/A","N/A","N/A","N/A","N/A","N/A","N/A",null,null,null,null,null,null,null,null,null,null,null,null,null,null,null,null,null,null,null,null,null,null,null,null,null,null,null,null,"Contaminated (E. coli detected in 100 mL)","N/A","N/A","N/A","N/A","N/A","N/A","N/A","N/A","N/A","N/A","N/A","N/A","N/A","N/A","N/A","N/A","N/A","N/A","N/A","N/A","N/A","N/A","N/A"]
[null,"Highly contaminated (>100 CFU/100 mL)","N/A","N/A","N/A","N/A","N/A","N/A","N/A","N/A","N/A","N/A","N/A","N/A","N/A","N/A","N/A","N/A","N/A","N/A","N/A","N/A","N/A","N/A","N/A",null,null,null,null,null,null,null,null,null,null,null,null,null,null,null,null,null,null,null,null,null,null,null,null,null,null,null,null,"Highly contaminated (>100 CFU/100 mL)","N/A","N/A","N/A","N/A","N/A","N/A","N/A","N/A","N/A","N/A","N/A","N/A","N/A","N/A","N/A","N/A","N/A","N/A","N/A","N/A","N/A","N/A","N/A"]
["Microbiological quality of improved water sources at point of collection","Not contaminated (No E. coli in 100 mL)","N/A","N/A","N/A","N/A","N/A","N/A","N/A","N/A","N/A","N/A","N/A","N/A","N/A","N/A","N/A","N/A","N/A","N/A","N/A","N/A","N/A","N/A","N/A",null,null,null,null,null,null,null,null,null,null,null,null,null,null,null,null,null,null,null,null,null,null,null,null,null,null,null,"Microbiological quality of improved water sources at point of collection","Not contaminated (No E. coli in 100 mL)","N/A","N/A","N/A","N/A","N/A","N/A","N/A","N/A","N/A","N/A","N/A","N/A","N/A","N/A","N/A","N/A","N/A","N/A","N/A","N/A","N/A","N/A","N/A"]
[null,"Contaminated (E. coli detected in 100 mL)","N/A","N/A","N/A","N/A","N/A","N/A","N/A","N/A","N/A","N/A","N/A","N/A","N/A","N/A","N/A","N/A","N/A","N/A","N/A","N/A","N/A","N/A","N/A",null,null,null,null,null,null,null,null,null,null,null,null,null,null,null,null,null,null,null,null,null,null,null,null,null,null,null,null,"Contaminated (E. coli detected in 100 mL)","N/A","N/A","N/A","N/A","N/A","N/A","N/A","N/A","N/A","N/A","N/A","N/A","N/A","N/A","N/A","N/A","N/A","N/A","N/A","N/A","N/A","N/A","N/A"]
[null,"Highly contaminated (>100 CFU/100 mL)","N/A","N/A","N/A","N/A","N/A","N/A","N/A","N/A","N/A","N/A","N/A","N/A","N/A","N/A","N/A","N/A","N/A","N/A","N/A","N/A","N/A","N/A","N/A",null,null,null,null,null,null,null,null,null,null,null,null,null,null,null,null,null,null,null,null,null,null,null,null,null,null,null,null,"Highly contaminated (>100 CFU/100 mL)","N/A","N/A","N/A","N/A","N/A","N/A","N/A","N/A","N/A","N/A","N/A","N/A","N/A","N/A","N/A","N/A","N/A","N/A","N/A","N/A","N/A","N/A","N/A"]
["Microbiological quality of piped on premises at point of collection","Not contaminated (No E. coli in 100 mL)","N/A","N/A","N/A","N/A","N/A","N/A","N/A","N/A","N/A","N/A","N/A","N/A","N/A","N/A","N/A","N/A","N/A","N/A","N/A","N/A","N/A","N/A","N/A",null,null,null,null,null,null,null,null,null,null,null,null,null,null,null,null,null,null,null,null,null,null,null,null,null,null,null,"Microbiological quality of piped on premises at point of collection","Not contaminated (No E. coli in 100 mL)","N/A","N/A","N/A","N/A","N/A","N/A","N/A","N/A","N/A","N/A","N/A","N/A","N/A","N/A","N/A","N/A","N/A","N/A","N/A","N/A","N/A","N/A","N/A"]
[null,"Contaminated (E. coli detected in 100 mL)","N/A","N/A","N/A","N/A","N/A","N/A","N/A","N/A","N/A","N/A","N/A","N/A","N/A","N/A","N/A","N/A","N/A","N/A","N/A","N/A","N/A","N/A","N/A",null,null,null,null,null,null,null,null,null,null,null,null,null,null,null,null,null,null,null,null,null,null,null,null,null,null,null,null,"Contaminated (E. coli detected in 100 mL)","N/A","N/A","N/A","N/A","N/A","N/A","N/A","N/A","N/A","N/A","N/A","N/A","N/A","N/A","N/A","N/A","N/A","N/A","N/A","N/A","N/A","N/A","N/A"]
[null,"Highly contaminated (>100 CFU/100 mL)","N/A","N/A","N/A","N/A","N/A","N/A","N/A","N/A","N/A","N/A","N/A","N/A","N/A","N/A","N/A","N/A","N/A","N/A","N/A","N/A","N/A","N/A","N/A",null,null,null,null,null,null,null,null,null,null,null,null,null,null,null,null,null,null,null,null,null,null,null,null,null,null,null,null,"Highly contaminated (>100 CFU/100 mL)","N/A","N/A","N/A","N/A","N/A","N/A","N/A","N/A","N/A","N/A","N/A","N/A","N/A","N/A","N/A","N/A","N/A","N/A","N/A","N/A","N/A","N/A","N/A"]
[null,null,"NATIONAL wealth index quintile",null,null,null,null,"URBAN wealth index quintile",null,null,null,null,"RURAL wealth index quintile",null,null,null,null,"SUB-REGIONS:",null,null,null,null,null,null,null,null,null,null,null,null,null,null,null,null,null,null,null,null,null,null,null,null,null,null,null,null,null,null,null,null,null,null,"Raw numbers of respondents:","Use of drinking water sources","NATIONAL wealth index quintile",null,null,null,null,"URBAN wealth index quintile",null,null,null,null,"RURAL wealth index quintile",null,null,null,null,"SUB-REGIONS:"]
["Percentage based on weighted population",null,"Poorest","Poor","Middle","Rich","Richest","Poorest","Poor","Middle","Rich","Richest","Poorest","Poor","Middle","Rich","Richest","Agadez","Diffa","Dosso","Maradi","Niamey","Tahoua","Tillaberi","Zinder",null,null,null,null,null,null,null,null,null,null,null,null,null,null,null,null,null,null,null,null,null,null,null,null,null,null,null,"Water data, raw numbers (weighted)",null,"Poorest","Poor","Middle","Rich","Richest","Poorest","Poor","Middle","Rich","Richest","Poorest","Poor","Middle","Rich","Richest","Agadez","Diffa","Dosso","Maradi","Niamey","Tahoua","Tillaberi","Zinder"]
["Source of drinking water","Piped into dwelling",0.16911856446299392,0.18190951469435013,0.12992705134419649,0.91594362039284838,13.13038171032791,3.7149346459442421,6.1257330055509511,10.15792863987464,25.099647792430829,35.564794011475598,2.455873222215393E-2,9.2904121821229271E-2,7.2614831197204299E-2,0.29477773631619736,1.0759370480989547,6.5444068271632947,4.7703961526907177,0,1.2367225726184976,24.738472596998012,1.7838999047673436,0.75731249592978633,1.1440556188126341]
[null,"Piped to yard/plot",0.25213219610390281,0.48754192433708338,0.69355833567691616,1.8768036017098719,21.023733722028087,7.2078007136442075,15.28997887472204,24.25526152020316,32.372858561184266,46.726281302214005,2.9993864404694346E-2,0.31178695067209378,6.0695471980441687E-2,0.85852209069526786,3.1719071453202963,25.404726528399447,2.239541101047501,3.5679937788613993,4.6492279381223041,23.988345690137919,2.8604853276291577,3.0547887037107677,1.2554702187315814]
[null,"Public tap/standpipe",21.389806125663778,20.684700101375146,19.226814508103292,23.165212725230571,36.790919688945252,75.129320074113295,73.084787235530342,61.076695402900036,39.877737039584346,14.77312430506816,18.291784622879813,19.404408501803154,18.057967114741491,17.188464988540648,20.352514389269107,23.214773753312418,32.808579052170572,15.357847835235205,30.141580361326785,46.28924214052229,25.205709644713163,12.598798994400431,20.394533811625742]
[null,"Tube well or borehole",16.77605958456256,17.868543912938538,15.666807554846004,14.049113281274664,4.6712817297956493,3.818932327050057,2.613612004826356,1.6037617745648436,0.98045535990862409,0.36426712089921109,16.952994799183585,17.998699867420743,17.461755666861535,14.782649115316653,13.527516601373076,6.4586681337240135,4.5576325223920469,10.953716987621007,8.8898887664460737,1.5159971637555281,5.3140594835219082,22.083654540379037,31.190893052760245]
[null,"Protected well",23.770137655616942,23.249530291341518,25.369803561187975,21.293760723895865,9.0939110764725086,2.3395968551686939,0.39992259923538392,1.2024400112465896,0,0.48199877922172202,25.272639945145762,23.89200771308067,25.419039376618169,24.991270898566111,22.481815818515784,12.511365242352046,30.209892524531085,14.764123418955977,27.855990275348102,0.53708398342160091,21.046591169496772,34.435387822488536,13.475168298667056]
[null,"Unprotected well",36.12471117070227,35.408953498872457,36.905662462263258,36.519321665512443,13.352335729954035,5.6181569435316554,1.2859880502246628,0.62401087559942803,0.22883097349160422,0.88602897166451777,38.031934063297641,36.007447977053914,36.905775582810421,39.989104875282258,36.713025526072393,23.440289414775922,25.224394479445035,55.109855375980779,26.589887401336583,0.85097578561043863,42.163542849992233,19.337040536214513,30.917051158048015]
[null,"Protected spring",0,5.9971050055363816E-2,0.12607710238078879,0.11446465775155551,0,0,0,0,0,0,0,4.8394683203815625E-2,0.11044569219417183,0.20061498743949394,0,0.20155615751686895,0,6.6741077646134614E-2,0,0,0.11587264539928012,0.10907380747320536,4.9558659957745464E-2]
[null,"Unprotected spring",0.31559565844304721,0.50708072915046465,0.60768805229876621,0.81131670498101138,0.16426070796830378,0.14023716871061548,0,0,0,0,0.28556978148074036,0.60718130809946624,0.54465240387405001,0.56112514738421526,0.85123507403994503,0.1155088063694697,0,0.11800112394509943,0.27499022711310872,0,0.83394217419167416,1.1170499375463265,0.44499894864001588]
[null,"River/dam/lake/ponds/stream/canal/irrigation channel",1.0454294364903625,1.3895861516327885,1.1458950034795494,1.0657090451397331,1.0113039177182594,0.18312241604466648,0.22850688036782377,0,0,0,1.0475669373359766,1.559422930334754,1.2893383277631711,1.1334701604592035,1.6560876158110565,0,0.18956416772289475,6.1720401754542326E-2,5.0194233397758671E-2,0,0.67589680028864507,6.4348275756554525,1.0216748639179474]
[null,"Rainwater",3.2498097561715109E-2,6.5019969706369238E-2,6.4972059929818887E-2,3.3882963718188117E-3,0,0,0,0,0,0,3.8882657666905442E-2,7.7745946509871169E-2,7.7715531959319503E-2,0,4.0498306192583164E-3,0,0,0,0.14831426014492077,0,0,0,0]
[null,"Tanker truck",1.0765183373407997E-2,0,0,0,2.1620275943587831E-3,0,0,0,0,0,1.2880105951888052E-2,0,0,0,2.5848929996532145E-3,2.2353657319744383E-2,0,0,0,0,0,1.8460103427356111E-2,0]
[null,"Cart with small tank",0,0,0,0,7.2230716671005404E-2,0,0,0.44100360559760526,0,0,0,0,0,0,0,0,0,0,0,0.21664320074422061,0,0,0]
[null,"Water vendor",6.0670199280440937E-3,6.0692391482337982E-3,0,2.5561664947310405E-2,0.45593471745954001,0.22994646161693788,0.59723062011455064,0.50557852276503024,0.80809706364508749,0.87108000839634037,0,0,0,0,0,0.93533106855503512,0,0,0,1.2092090662832082,0,0,0]
[null,"Bottled water",0,0,0,0,1.0577379229924E-2,0,0,0,0,6.4543415548738242E-2,0,0,0,0,0,0,0,0,0,3.1724969617753042E-2,0,0,0]
[null,"Other",0.10767930709100768,9.1093616747712131E-2,6.2794308489285258E-2,0.15940401279237043,0.2209668758354017,1.617952394175608,0.3742407294279117,0.13331964724873813,0.6323732097552065,0.26788208551150133,1.1194490431018075E-2,0,0,0,0.16332605788066801,1.1510204105115898,0,0,0.16320396414608904,0.62230540290890202,0,5.3605482774529319E-2,0.10659536883882989]
[]
[]
[]
[]
[]
[]
[]
[]
[]
[]
[]
[]
[]
[]
[]
[]
[]
[]
[]
[]
[]
[]
[]
[]
[]
[]
[]
[]
[]
[]
[]
[]
[]
[]
[]
[{"$f":"A1026","v":"Niger"}]
[{"$f":"A1034","v":"2012"}]
["Use of sanitation facilities"]
[" by wealth quintile and sub-national region"]
["Notes:"]
["WHO/UNICEF JMP customised wealth index excludes water,"]
[" sanitation and hygiene assets."]
["Survey used for analysis:",{"$f":"A1025","v":"DHS12"}]
[{"$f":"B1030","v":""}]
[{"$f":"B1029","v":""}]
[]
[]
["Use of sanitation facilities",null,"NATIONAL wealth index quintile",null,null,null,null,"URBAN wealth index quintile",null,null,null,null,"RURAL wealth index quintile",null,null,null,null,"SUB-REGIONS:",null,null,null,null,null,null,null,null,null,null,null,null,null,null,null,null,null,null,null,null,null,null,null,null,null,null,null,null,null,null,null,null,null,null,"Raw numbers of respondents:","Use of sanitation facilities","NATIONAL wealth index quintile",null,null,null,null,"URBAN wealth index quintile",null,null,null,null,"RURAL wealth index quintile",null,null,null,null,"SUB-REGIONS:"]
["Weighted percentage (used in graphs)",null,"Poorest","Poor","Middle","Rich","Richest","Poorest","Poor","Middle","Rich","Richest","Poorest","Poor","Middle","Rich","Richest","Agadez","Diffa","Dosso","Maradi","Niamey","Tahoua","Tillaberi","Zinder",null,null,null,null,null,null,null,null,null,null,null,null,null,null,null,null,null,null,null,null,null,null,null,null,null,null,null,"Sanitation data, raw numbers (weighted)",null,"Poorest","Poor","Middle","Rich","Richest","Poorest","Poor","Middle","Rich","Richest","Poorest","Poor","Middle","Rich","Richest","Agadez","Diffa","Dosso","Maradi","Niamey","Tahoua","Tillaberi","Zinder"]
["Sanitation","Improved",5.1100329086745795,5.8410836915223889,9.3748925947607731,14.649384511564362,64.727042176745826,43.857519170857387,72.279624232921634,83.807108211933269,92.88268297270082,96.809766999447319,3.9410049306096351,4.6334052689534042,6.1249999640442692,9.6487225862035118,18.521092661190398,48.578490133765236,22.843605260743271,12.623162611195331,19.819523006161219,84.425268170483136,12.199454055114838,7.4918388887509462,15.606661340926134,null,null,null,null,null,null,null,null,null,null,null,null,null,null,null,null,null,null,null,null,null,null,null,null,null,null,null,"Sanitation","Improved",652.11453499999993,745.13469100000009,1196.8170890000008,1868.5929729999993,8258.6101089999993,917.21359299999972,1510.2893069999998,1751.3858680000008,1944.1692020000005,2024.2610010000037,420.34816700000005,494.32280899999989,653.71188900000016,1029.0236429999998,1976.5439180000003,599.48436100000038,431.28347299999984,976.52412099999901,2828.7667069999998,3591.4556780000098,1694.5608690000006,557.539851,2041.6543369999997]
[null,"Not Improved",94.889967091325403,94.158916308477615,90.625107405239177,85.350615488435494,35.272957823254401,56.142480829142535,27.720375767078391,16.192891788066774,7.1173170272991557,3.1902330005526793,96.058995069390392,95.36659473104659,93.875000035955779,90.351277413796495,81.478907338809719,51.421509866234558,77.156394739256697,87.376837388804645,80.180476993838695,15.574731829516939,87.800545944885116,92.508161111249038,84.393338659073777,null,null,null,null,null,null,null,null,null,null,null,null,null,null,null,null,null,null,null,null,null,null,null,null,null,null,null,null,"Not Improved",12109.340168999992,12011.653780999999,11569.378117000015,10886.843758999981,4500.5239890000012,1174.1349610000009,579.21976699999993,338.39613900000001,148.975763,66.706742999999989,10245.666577999986,10174.349157000024,10019.135341000012,9635.8455539999977,8695.3098119999941,634.56873399999881,1456.6999170000026,6759.4462619999886,11443.860873999954,662.54997199999991,12195.903911999972,6884.4227870000032,11040.287357000016]
["Sanitation ladder","Basic",{"$f":"C122*C129/100","v":2.6799855641904471},{"$f":"D122*D129/100","v":2.9087120932861708},{"$f":"E122*E129/100","v":4.2492377235959067},8.8327758342333134,36.03161336399917,18.827291770432922,33.766129411888862,37.066059457760105,44.970060860255984,67.297715406973978,2.0968956792364786,2.406152835311568,2.769242430349026,5.8685590834630865,12.68580968913848,30.972409852683928,21.81910673483199,6.2442228824028492,10.033887538911696,34.063382433769554,7.7694916540291823,3.4339935233628065,11.402660516905941,null,null,null,null,null,null,null,null,null,null,null,null,null,null,null,null,null,null,null,null,null,null,null,null,null,null,null,"Sanitation ladder","Basic",336.95852700000006,371.05824900000005,525.7511209999999,1111.2326390000003,4585.2071920000017,389.47529699999996,705.54633800000022,767.9644940000004,940.45635400000003,1403.6690950000009,218.53530300000003,256.70455300000003,278.88404500000013,625.87414999999999,1343.0980990000007,380.0633839999997,411.94111099999998,474.77515699999987,1423.3010719999986,1443.8279769999999,1068.7369440000002,255.55651499999991,1472.0055680000005]
[null,"Limited",{"$f":"C122*C128/100","v":2.4300473444841351},{"$f":"D122*D128/100","v":2.9323715982362182},{"$f":"E122*E128/100","v":5.1256548711648611},5.8166086773310566,28.695428812746695,25.030227400424479,38.513494821032793,46.741048754173192,47.912622112444787,29.512051592473188,1.8441092513731567,2.2272524336418371,3.3557575336952441,3.7801635027404275,5.8352829720519264,17.606080281081237,1.0244985259112884,6.3789397287924894,9.7856354672495183,50.361885736713411,4.4299624010856551,4.0578453653881397,4.2040008240201958,null,null,null,null,null,null,null,null,null,null,null,null,null,null,null,null,null,null,null,null,null,null,null,null,null,null,null,null,"Limited",305.53342700000007,374.07644199999999,634.18875800000012,731.77509900000018,3651.6401650000021,517.79381600000011,804.74296900000002,968.41872000000069,1001.9939719999995,615.55068399999993,192.19028299999999,237.61825599999997,337.95063399999998,403.14949299999995,617.8050639999999,216.04474699999983,19.342362000000001,485.01825899999989,1388.0866610000003,2134.6646870000027,609.36605499999985,301.98333600000001,542.70778400000006]
[null,"Unimproved",{"$f":"100-C124-C125-C127","v":6.8458484132739983},{"$f":"100-D124-D125-D127","v":9.9232367282603349},{"$f":"100-E124-E125-E127","v":7.9123724079006905},8.3306406496829482,7.3310330389249714,14.244217157347748,9.7969637723620941,11.73771799494288,6.4060560327922422,3.1244229643160923,6.3209691237452716,9.2600201800975128,7.2771513143023725,9.4509735692166146,7.1335055287448057,3.6126486019095125,10.59951348406733,6.4518204755002841,6.6064500080883874,9.5078511569219781,8.7890506406069306,10.68664292856127,7.9707475279836615,null,null,null,null,null,null,null,null,null,null,null,null,null,null,null,null,null,null,null,null,null,null,null,null,null,null,null,null,"Unimproved",882.10196100000041,1265.886318999999,1040.6110560000002,1082.3153390000011,941.45726800000034,302.062794,204.70844700000004,245.96111299999998,134.10026500000001,65.33399399999999,682.83061300000008,987.92117700000028,808.61411299999997,1007.933969000001,772.90545800000029,46.196139000000002,200.117054,512.65024699999992,955.70041700000036,405.25097599999998,1233.8435930000001,795.295974,1063.3175430000006]
[null,"Open defecation",88.044118678051419,84.23567958021728,82.712734997338544,77.019974838752674,27.94192478432916,41.898263671794851,17.923411994716243,4.455173793123822,0.71126099450698754,6.5810036236741296E-2,89.738025945645091,86.106574550949077,86.597848721653364,80.900303844579881,74.345401810064786,47.80886126432533,66.556881255189396,80.925016913304376,73.574026985750393,6.0668806725950493,79.011495304278228,81.821518182687782,76.422591131090201,null,null,null,null,null,null,null,null,null,null,null,null,null,null,null,null,null,null,null,null,null,null,null,null,null,null,null,null,"Open defecation",11227.238207999997,10745.767462000014,10528.767061000019,9804.5284199999824,3559.0667210000061,872.0721670000006,374.51132000000013,92.435026000000008,14.875498,1.372749,9562.8359649999948,9186.4279800000168,9210.5212280000105,8627.9115850000035,7922.4043539999948,588.37259499999925,1256.5828630000012,6246.7960149999935,10488.160456999964,257.29899599999999,10962.060318999986,6089.1268130000044,9976.9698140000164]
["Shared among Improved Sanitation","Yes",47.554436300380523,50.202526673127338,54.674278338179263,39.705481638080911,44.332983321545882,57.07169003999811,53.284027455542336,55.772177028198364,51.58402037818697,30.484580747562042,46.792868414094855,48.06945009895346,54.78787842276941,39.17786493463494,31.50614857772046,36.242543217381424,4.4848372847340734,50.533609724199266,49.373718349364388,59.652621576535303,36.312792204240601,54.163542831667478,26.937220794276051,null,null,null,null,null,null,null,null,null,null,null,null,null,null,null,null,null,null,null,null,null,null,null,null,null,null,null,"Shared among improved sanitation facilities","Yes","N/A","N/A","N/A","N/A","N/A","N/A","N/A","N/A","N/A","N/A","N/A","N/A","N/A","N/A","N/A","N/A","N/A","N/A","N/A","N/A","N/A","N/A","N/A"]
[null,"No",52.445563699619527,49.797473326872662,45.32572166182068,60.294518361919145,55.667016678454182,42.928309960001918,46.715972544457692,44.227822971801672,48.41597962181298,69.515419252437809,53.207131585905152,51.930549901046561,45.212121577230604,60.822135065365082,68.49385142227959,63.757456782618426,95.515162715265959,49.466390275800798,50.626281650635583,40.347378423464498,63.687207795759385,45.836457168332515,73.06277920572397,null,null,null,null,null,null,null,null,null,null,null,null,null,null,null,null,null,null,null,null,null,null,null,null,null,null,null,null,"No","N/A","N/A","N/A","N/A","N/A","N/A","N/A","N/A","N/A","N/A","N/A","N/A","N/A","N/A","N/A","N/A","N/A","N/A","N/A","N/A","N/A","N/A","N/A"]
["Manually calculated ratios","Improved latrines",{"$f":"(C155+C156)/(C155+C156+C157)*100","v":41.480997476598695},{"$f":"(D155+D156)/(D155+D156+D157)*100","v":36.433149500853162},53.705716634987255,64.03862286642331,88.640196034974153,75.521787847135798,88.192665796580584,87.022887641872956,92.593479037213925,95.452652073808181,37.945149670819525,33.729908917075399,44.835671951593945,50.684995468477133,72.302473166817705,90.94510937486298,56.748313883991507,80.15048111377196,73.74938065112481,88.362477084824278,52.072834161155626,38.484838930298061,65.327393544418882]
[null,"Other"]
[null,"Other"]
[null,null,"NATIONAL wealth index quintile",null,null,null,null,"URBAN wealth index quintile",null,null,null,null,"RURAL wealth index quintile",null,null,null,null,"SUB-REGIONS:",null,null,null,null,null,null,null,null,null,null,null,null,null,null,null,null,null,null,null,null,null,null,null,null,null,null,null,null,null,null,null,null,null,null,"Raw numbers of respondents:","Use of sanitation facilities","NATIONAL wealth index quintile",null,null,null,null,"URBAN wealth index quintile",null,null,null,null,"RURAL wealth index quintile",null,null,null,null,"SUB-REGIONS:"]
["Percentage based on weighted population",null,"Poorest","Poor","Middle","Rich","Richest","Poorest","Poor","Middle","Rich","Richest","Poorest","Poor","Middle","Rich","Richest","Agadez","Diffa","Dosso","Maradi","Niamey","Tahoua","Tillaberi","Zinder",null,null,null,null,null,null,null,null,null,null,null,null,null,null,null,null,null,null,null,null,null,null,null,null,null,null,null,"Sanitation data, raw numbers (weighted)",null,"Poorest","Poor","Middle","Rich","Richest","Poorest","Poor","Middle","Rich","Richest","Poorest","Poor","Middle","Rich","Richest","Agadez","Diffa","Dosso","Maradi","Niamey","Tahoua","Tillaberi","Zinder"]
["Sanitation type","Sewer connection",2.9682282215151463E-2,0,0.13486845314654017,0.12222156973182344,2.3420905188765295,0.435403987660681,0.32141123882001393,0.97201253202291549,1.1970070118865366,10.915727210758904,3.5513648635969577E-2,0,3.5250574836533079E-2,0.18696347448507769,0.17337365623732204,0.73786533471641169,0.32649159058544414,4.2254401686739294E-2,0.17335232674982004,5.8521371968558533,1.8282037642639509E-2,0.12646643711892278,0.23883348306260951,null,null,null,null,null,null,null,null,null,null,null,null,null,null,null,null,null,null,null,null,null,null,null,null,null,null,null,"Sanitation type","Sewer connection","N/A","N/A","N/A","N/A","N/A","N/A","N/A","N/A","N/A","N/A","N/A","N/A","N/A","N/A","N/A","N/A","N/A","N/A","N/A","N/A","N/A","N/A","N/A"]
[null,"Septic tank connection",0.40958999747588676,0.40346837382285639,0.54925750287011454,0.89935317316267926,9.1111487666096878,4.7539381615676817,8.2268088776914325,9.3848815495136968,13.755349381642084,20.306447204572422,0.1204741068450494,9.8736459735291993E-2,0.37093584445506933,0.38431491510021959,1.5663007873703327,14.011457910569053,8.610036924106609,0.6029442292398195,1.0738697911801165,11.174517175359167,2.6177550048388158,0.78779935954846392,0.13828272150377285,null,null,null,null,null,null,null,null,null,null,null,null,null,null,null,null,null,null,null,null,null,null,null,null,null,null,null,null,"Septic tank connection","N/A","N/A","N/A","N/A","N/A","N/A","N/A","N/A","N/A","N/A","N/A","N/A","N/A","N/A","N/A","N/A","N/A","N/A","N/A","N/A","N/A","N/A","N/A"]
[null,"Improved latrines",4.6707606289835422,5.4376153176995334,8.6907666387441154,13.627809768669859,53.273802891259677,38.66817702162902,63.731404116410154,73.450214130396603,77.930326579172132,65.587592584115825,3.7850171751286159,4.534668809218112,5.718813544752666,9.0774441966182131,16.78141821758274,33.829166888479783,13.907076746051219,11.977963980268774,18.572300888231279,67.39861379826803,9.5634170126333782,6.5775730920835578,15.229545136359754,null,null,null,null,null,null,null,null,null,null,null,null,null,null,null,null,null,null,null,null,null,null,null,null,null,null,null,null,"Improved latrines","N/A","N/A","N/A","N/A","N/A","N/A","N/A","N/A","N/A","N/A","N/A","N/A","N/A","N/A","N/A","N/A","N/A","N/A","N/A","N/A","N/A","N/A","N/A"]
[null,"Unimproved facilities",6.9122367430690428,9.9232367282604503,8.1513014583305168,8.4851296097511089,7.3786924784149441,14.443445757631451,9.7969637723621634,11.76970191991896,6.4066401153443255,3.1245816291272197,6.4019282677262161,9.2600201800974364,7.576367351413869,9.4509735692166803,7.2424667499636124,3.743448250903656,10.599513484067234,6.6268382842644176,6.6960369530852866,9.5263384523243264,8.8826660047236743,10.686642928561282,8.1281324123901744,null,null,null,null,null,null,null,null,null,null,null,null,null,null,null,null,null,null,null,null,null,null,null,null,null,null,null,null,"Unimproved facilities","N/A","N/A","N/A","N/A","N/A","N/A","N/A","N/A","N/A","N/A","N/A","N/A","N/A","N/A","N/A","N/A","N/A","N/A","N/A","N/A","N/A","N/A","N/A"]
[null,"Open defecation",87.977730348256401,84.23567958021728,82.473805946908698,76.865485878684396,27.894265344839503,41.699035071511076,17.923411994716243,4.423189868147813,0.7106769119548294,6.5651371425459806E-2,89.657066801664271,86.106574550949077,86.2986326845419,80.900303844579881,74.236440588846108,47.678061615330932,66.556881255189396,80.749999104540294,73.484440040753469,6.0483933771926139,78.917879940161527,81.821518182687782,76.265206246683618,null,null,null,null,null,null,null,null,null,null,null,null,null,null,null,null,null,null,null,null,null,null,null,null,null,null,null,null,"Open defecation","N/A","N/A","N/A","N/A","N/A","N/A","N/A","N/A","N/A","N/A","N/A","N/A","N/A","N/A","N/A","N/A","N/A","N/A","N/A","N/A","N/A","N/A","N/A"]
["Septic tank emptying practices","Not emptied/treated and disposed in situ","N/A","N/A","N/A","N/A","N/A","N/A","N/A","N/A","N/A","N/A","N/A","N/A","N/A","N/A","N/A","N/A","N/A","N/A","N/A","N/A","N/A","N/A","N/A",null,null,null,null,null,null,null,null,null,null,null,null,null,null,null,null,null,null,null,null,null,null,null,null,null,null,null,"Septic tank emptying practices","Not emptied/treated and disposed in situ","N/A","N/A","N/A","N/A","N/A","N/A","N/A","N/A","N/A","N/A","N/A","N/A","N/A","N/A","N/A","N/A","N/A","N/A","N/A","N/A","N/A","N/A","N/A"]
[null,"Emptied and buried on site","N/A","N/A","N/A","N/A","N/A","N/A","N/A","N/A","N/A","N/A","N/A","N/A","N/A","N/A","N/A","N/A","N/A","N/A","N/A","N/A","N/A","N/A","N/A",null,null,null,null,null,null,null,null,null,null,null,null,null,null,null,null,null,null,null,null,null,null,null,null,null,null,null,null,"Emptied and buried on site","N/A","N/A","N/A","N/A","N/A","N/A","N/A","N/A","N/A","N/A","N/A","N/A","N/A","N/A","N/A","N/A","N/A","N/A","N/A","N/A","N/A","N/A","N/A"]
[null,"Emptied and discharged locally","N/A","N/A","N/A","N/A","N/A","N/A","N/A","N/A","N/A","N/A","N/A","N/A","N/A","N/A","N/A","N/A","N/A","N/A","N/A","N/A","N/A","N/A","N/A",null,null,null,null,null,null,null,null,null,null,null,null,null,null,null,null,null,null,null,null,null,null,null,null,null,null,null,null,"Emptied and discharged locally","N/A","N/A","N/A","N/A","N/A","N/A","N/A","N/A","N/A","N/A","N/A","N/A","N/A","N/A","N/A","N/A","N/A","N/A","N/A","N/A","N/A","N/A","N/A"]
[null,"Emptied and removed offsite","N/A","N/A","N/A","N/A","N/A","N/A","N/A","N/A","N/A","N/A","N/A","N/A","N/A","N/A","N/A","N/A","N/A","N/A","N/A","N/A","N/A","N/A","N/A",null,null,null,null,null,null,null,null,null,null,null,null,null,null,null,null,null,null,null,null,null,null,null,null,null,null,null,null,"Emptied and removed offsite","N/A","N/A","N/A","N/A","N/A","N/A","N/A","N/A","N/A","N/A","N/A","N/A","N/A","N/A","N/A","N/A","N/A","N/A","N/A","N/A","N/A","N/A","N/A"]
["Latrine emptying practices","Not emptied/treated and disposed in situ","N/A","N/A","N/A","N/A","N/A","N/A","N/A","N/A","N/A","N/A","N/A","N/A","N/A","N/A","N/A","N/A","N/A","N/A","N/A","N/A","N/A","N/A","N/A",null,null,null,null,null,null,null,null,null,null,null,null,null,null,null,null,null,null,null,null,null,null,null,null,null,null,null,"Latrine emptying practices","Not emptied/treated and disposed in situ","N/A","N/A","N/A","N/A","N/A","N/A","N/A","N/A","N/A","N/A","N/A","N/A","N/A","N/A","N/A","N/A","N/A","N/A","N/A","N/A","N/A","N/A","N/A"]
[null,"Emptied and buried on site","N/A","N/A","N/A","N/A","N/A","N/A","N/A","N/A","N/A","N/A","N/A","N/A","N/A","N/A","N/A","N/A","N/A","N/A","N/A","N/A","N/A","N/A","N/A",null,null,null,null,null,null,null,null,null,null,null,null,null,null,null,null,null,null,null,null,null,null,null,null,null,null,null,null,"Emptied and buried on site","N/A","N/A","N/A","N/A","N/A","N/A","N/A","N/A","N/A","N/A","N/A","N/A","N/A","N/A","N/A","N/A","N/A","N/A","N/A","N/A","N/A","N/A","N/A"]
[null,"Emptied and discharged locally","N/A","N/A","N/A","N/A","N/A","N/A","N/A","N/A","N/A","N/A","N/A","N/A","N/A","N/A","N/A","N/A","N/A","N/A","N/A","N/A","N/A","N/A","N/A",null,null,null,null,null,null,null,null,null,null,null,null,null,null,null,null,null,null,null,null,null,null,null,null,null,null,null,null,"Emptied and discharged locally","N/A","N/A","N/A","N/A","N/A","N/A","N/A","N/A","N/A","N/A","N/A","N/A","N/A","N/A","N/A","N/A","N/A","N/A","N/A","N/A","N/A","N/A","N/A"]
[null,"Emptied and removed offsite","N/A","N/A","N/A","N/A","N/A","N/A","N/A","N/A","N/A","N/A","N/A","N/A","N/A","N/A","N/A","N/A","N/A","N/A","N/A","N/A","N/A","N/A","N/A",null,null,null,null,null,null,null,null,null,null,null,null,null,null,null,null,null,null,null,null,null,null,null,null,null,null,null,null,"Emptied and removed offsite","N/A","N/A","N/A","N/A","N/A","N/A","N/A","N/A","N/A","N/A","N/A","N/A","N/A","N/A","N/A","N/A","N/A","N/A","N/A","N/A","N/A","N/A","N/A"]
["Shared among improved sanitation facilities","Yes",2.3941896444159507,2.9323715982362182,4.9677194165254175,5.7369662393775274,28.619811790930282,24.758848304346287,38.513494821032793,46.340657387045866,47.870261675831856,29.43855474415194,1.8018940306649682,2.2272524336418371,3.1664524631259039,3.7801635027404275,5.789107306289897,17.506924772957156,1.0244985259112884,6.2696498950647621,9.7255158738104495,50.180109351758837,4.3869378354676716,4.0578453653881388,4.1485262409395274,null,null,null,null,null,null,null,null,null,null,null,null,null,null,null,null,null,null,null,null,null,null,null,null,null,null,null,"Shared among improved sanitation facilities","Yes","N/A","N/A","N/A","N/A","N/A","N/A","N/A","N/A","N/A","N/A","N/A","N/A","N/A","N/A","N/A","N/A","N/A","N/A","N/A","N/A","N/A","N/A","N/A"]
[null,"No",2.6404397838310909,2.9087120932861708,4.1183070798799983,8.7118352930418528,35.936664328332007,18.623165242114855,33.766129411888855,36.748545610384348,44.93030199654612,67.130117096631707,2.048893689205193,2.406152835311568,2.6130238631739506,5.8685590834630856,12.58542454741837,30.797976646215464,21.81910673483199,6.1372411409864176,9.9722427697526985,33.940433929606975,7.6940329992547696,3.4339935233628056,11.252194837981348,null,null,null,null,null,null,null,null,null,null,null,null,null,null,null,null,null,null,null,null,null,null,null,null,null,null,null,null,"No","N/A","N/A","N/A","N/A","N/A","N/A","N/A","N/A","N/A","N/A","N/A","N/A","N/A","N/A","N/A","N/A","N/A","N/A","N/A","N/A","N/A","N/A","N/A"]
[null,"DK/missing",94.965370571752956,94.158916308477615,90.913973503594548,85.551198467580477,35.44352388073797,56.617986453538826,27.720375767078391,16.910797002569847,7.1994363276219584,3.4313281592162079,96.149212280129888,95.36659473104659,94.220523673700214,90.351277413796495,81.625468146291851,51.695098580827093,77.156394739256697,87.593108963948822,80.302241356436753,15.879456718634092,87.919029165277507,92.508161111249038,84.599278921079048,null,null,null,null,null,null,null,null,null,null,null,null,null,null,null,null,null,null,null,null,null,null,null,null,null,null,null,null,"DK/missing","N/A","N/A","N/A","N/A","N/A","N/A","N/A","N/A","N/A","N/A","N/A","N/A","N/A","N/A","N/A","N/A","N/A","N/A","N/A","N/A","N/A","N/A","N/A"]
["Shared among all sanitation facilities","Yes",37.285416008198091,31.280626004001849,40.97199277878935,35.741820364630797,44.201611905216822,53.664978751040138,52.514366441555183,54.478034229947369,51.733408736067368,30.94761978026267,35.768943543312155,27.980063330815241,38.032623931965041,29.562890923819591,32.971403107587157,36.70718180276463,6.0116126573964612,54.204945797186845,44.327292642112056,58.76226721942448,32.075926778177447,44.663809594190738,18.914229587161351,null,null,null,null,null,null,null,null,null,null,null,null,null,null,null,null,null,null,null,null,null,null,null,null,null,null,null,"Shared among all sanitation facilities","Yes","N/A","N/A","N/A","N/A","N/A","N/A","N/A","N/A","N/A","N/A","N/A","N/A","N/A","N/A","N/A","N/A","N/A","N/A","N/A","N/A","N/A","N/A","N/A"]
[null,"No",62.087385612362766,68.509919794423254,57.029584340014708,62.882718126282455,55.512409776126802,45.173951605445126,47.48563355844496,44.625902433524146,48.104365813694542,68.81112667481284,63.358797021095711,72.01993666918483,58.909694269390414,69.700551137438268,66.459728262332618,62.769923359927915,93.988387342603374,44.671565553027307,54.817042717689603,40.766650221109707,67.263211300215559,54.75695781489226,80.218097981615173,null,null,null,null,null,null,null,null,null,null,null,null,null,null,null,null,null,null,null,null,null,null,null,null,null,null,null,null,"No","N/A","N/A","N/A","N/A","N/A","N/A","N/A","N/A","N/A","N/A","N/A","N/A","N/A","N/A","N/A","N/A","N/A","N/A","N/A","N/A","N/A","N/A","N/A"]
["Type of toilet facility","Flush to piped sewer system",2.9703818273253239E-2,0,0.13486845314654017,0.12226105788668974,2.3436021622017149,0.435403987660681,0.32141123882001393,0.97336086594469895,1.1979528345960355,10.915727210758904,3.5544482228643877E-2,0,3.5250574836533079E-2,0.18703572535157739,0.17343349915532214,0.74064474682650239,0.32649159058544414,4.2254401686739294E-2,0.17340386388570003,5.8544115322518735,1.8296788544246607E-2,0.12653648617861127,0.23883348306260951,null,null,null,null,null,null,null,null,null,null,null,null,null,null,null,null,null,null,null,null,null,null,null,null,null,null,null,"Type of toilet facility","Flush to piped sewer system",3.7878910000000001,0,17.217569999999998,15.589895,298.83046999999976,9.1058149999999998,6.7159169999999992,20.312943000000001,25.055092000000002,228.24433499999998,3.7878910000000001,0,3.7622399999999998,19.939409999999999,18.502182999999999,9.1056500000000007,6.1641069999999996,3.2687879999999998,24.741931999999998,248.95024699999999,2.5394600000000001,9.4115850000000005,31.244057000000002]
[null,"Flush to septic tank",0.40988717657820806,0.40360258170531987,0.54925750287011454,0.89964374214701859,9.1170293280597292,4.7539381615676817,8.2268088776914325,9.397899853011074,13.766218258510021,20.306447204572422,0.12057870464563972,9.8775733754247544E-2,0.37093584445506933,0.38446343119782217,1.5668414231948078,14.064236668378063,8.610036924106609,0.6029442292398195,1.0741890495043807,11.178859964854775,2.6198671461253977,0.78823571725424535,0.13828272150377285,null,null,null,null,null,null,null,null,null,null,null,null,null,null,null,null,null,null,null,null,null,null,null,null,null,null,null,null,"Flush to septic tank",52.269642000000005,51.469607000000003,70.119284999999991,114.71642499999996,1162.5036890000006,99.421416999999991,171.89991799999999,196.12356600000001,287.91940300000005,424.60126099999979,12.849786000000002,10.533868999999999,39.589416,40.986683000000006,167.15332899999996,172.90882999999997,162.55606699999996,46.643586999999997,153.26943600000004,475.36459200000007,363.61833700000005,58.627733999999997,18.090065000000003]
[null,"Ventilated Improved Pit latrine (VIP)",0.64187818707841715,0.20280285159795611,0.44875426135638791,1.0441273517173255,6.591380243016487,5.7320833378403879,9.491473258852194,10.182527084369191,9.2332191016147007,8.4573982313903979,0.62296489133747512,0.10805381986314154,0.13502276093199536,0.25025311970523367,1.1150016178977005,0.74236311519355536,0.42958963743849393,7.6079065826485714E-2,4.8455978050481807,3.6597428856379723,0.81719901350995638,0.12974406940609762,1.1114373722265243,null,null,null,null,null,null,null,null,null,null,null,null,null,null,null,null,null,null,null,null,null,null,null,null,null,null,null,null,"Ventilated Improved Pit latrine (VIP)",81.853605000000002,25.862528000000001,57.288845000000002,133.13998799999999,840.46059000000025,119.877842,198.32519500000004,212.49785099999997,193.11207199999998,176.84146900000002,66.387888000000004,11.523324000000001,14.410772999999999,26.678857999999998,118.95028399999998,9.1267759999999996,8.1105809999999998,5.8854540000000002,691.38858100000027,155.62518800000001,113.42122700000002,9.6501599999999996,145.39758899999995]
[null,"Pit latrine with slab",4.0322713245913082,5.2366212096978222,8.2420123773877254,12.588085380061381,46.716806882284864,32.936093683788656,54.239930857557951,63.369574019715103,68.758684621137533,57.130194352725418,3.1653385042254145,4.4284187269940132,5.5837907838206702,8.8306989985036246,15.672208996616128,33.214232440415927,13.477487108612726,11.901884914442288,13.732224573505308,63.765064258385216,8.7539342628210761,6.4514723040146231,14.118107764133228,null,null,null,null,null,null,null,null,null,null,null,null,null,null,null,null,null,null,null,null,null,null,null,null,null,null,null,null,"Pit latrine with slab",514.20339700000011,667.8025560000001,1052.1913890000003,1605.1466650000004,5956.8153600000105,688.80851900000005,1133.3482769999989,1322.4515080000008,1438.0826350000002,1194.5739360000002,337.32260199999996,472.26561599999985,595.94946000000004,941.41869199999962,1671.9381220000002,408.34310500000055,254.45271799999992,920.72629199999892,1959.3667579999999,2711.5156510000043,1214.9818450000002,479.85037199999994,1846.9226259999998]
[null,"Pit latrine without slab/open pit",6.5940209664067089,9.4904519879005775,7.49143366185183,7.6552730410084839,6.8317826738041374,12.533175758707117,8.5324327239557203,10.968308522834477,6.2385459090266728,3.1245816291272197,6.1953267348412604,8.9129339072486697,7.0362390636411209,8.8354983702924876,6.4308203590353648,3.3808663365359912,10.599513484067234,2.9663804750892671,6.612656801789492,8.8799880229323556,8.8091477867472268,10.519586322779496,8.0831026061290618,null,null,null,null,null,null,null,null,null,null,null,null,null,null,null,null,null,null,null,null,null,null,null,null,null,null,null,null,"Pit latrine without slab/open pit",840.88289400000042,1210.2743049999995,956.37104500000021,976.14812900000061,871.11407400000053,262.11239000000006,178.28595600000006,228.89622299999999,130.478711,65.33399399999999,660.22124699999995,950.51359900000023,750.96704599999987,941.93034100000057,686.05094000000031,41.565117000000001,200.117054,229.47831500000007,943.51937300000031,377.60844100000003,1222.6450770000001,782.43029999999999,1057.4267700000005]
[null,"No facility/bush/field",88.041562822414178,84.263699353061483,82.473805946908698,76.890320089347142,27.912268995714484,41.699035071511076,17.923411994716243,4.4293255266349529,0.71123845784033268,6.5651371425459806E-2,89.734908690186387,86.140824829419444,86.2986326845419,80.931567261506416,74.262064581113421,47.857656692649797,66.556881255189396,80.749999104540294,73.506286748221726,6.0507439842758162,78.981555002252136,81.866838668830638,76.265206246683618,null,null,null,null,null,null,null,null,null,null,null,null,null,null,null,null,null,null,null,null,null,null,null,null,null,null,null,null,"No facility/bush/field",11227.238207999997,10745.767462000014,10528.767061000019,9804.5284199999824,3559.0667210000061,872.0721670000006,374.51132000000013,92.435026000000008,14.875498,1.372749,9562.8359649999948,9186.4279800000168,9210.5212280000105,8627.9115850000035,7922.4043539999948,588.37259499999925,1256.5828630000012,6246.7960149999935,10488.160456999964,257.29899599999999,10962.060318999986,6089.1268130000044,9976.9698140000164]
[null,"Bucket toilet",0.22912763842436254,0.34330577756403141,0.52726437998037201,0.72637229039681694,0.47168808077078778,1.1964787004127473,0.97046307442836244,0.67900412749052086,0,0,0.12533799253529043,0.28522645796832485,0.41953063728056356,0.58048309344292348,0.77962952298738331,0,0,3.4559004334802461,5.5641158045202026E-2,0.21105246688449666,0,4.9820493263236371E-2,3.9064407406309211E-2,null,null,null,null,null,null,null,null,null,null,null,null,null,null,null,null,null,null,null,null,null,null,null,null,null,null,null,null,"Bucket toilet",29.218819999999997,43.780228999999999,67.311599999999999,92.622032999999988,60.14449599999999,25.022540000000003,20.277913999999999,14.17005,0,0,13.356972000000001,30.417775999999996,44.775864000000006,61.883848000000008,83.172213999999983,0,0,267.34743400000008,7.9390949999999991,8.9746959999999998,0,3.7055699999999998,5.1103829999999997]
[null,"Other",2.154806623358849E-2,5.9516238472929819E-2,0.13260341649831398,7.3917047435023253E-2,1.5441634148160145E-2,0.71379129851159118,0.29406797397808299,0,9.4140817274675936E-2,0,0,2.5766524752093498E-2,0.1205976504921826,0,0,0,0,0.20455737569490673,0,0.4001368847774337,0,6.7765938273066942E-2,5.9653988548039648E-3,null,null,null,null,null,null,null,null,null,null,null,null,null,null,null,null,null,null,null,null,null,null,null,null,null,null,null,null,"Other",2.7478530000000001,7.589836,16.928411000000001,9.4253970000000002,1.9689480000000001,14.927864,6.144577,0,1.9689480000000001,0,0,2.7478530000000001,12.871203000000001,0,0,0,0,15.824498000000002,0,17.015233000000002,0,5.040324,0.78039000000000003]
[null,null,null,null,null,null,null,null,null,null,null,null,null,null,null,null,null,null,null,null,null,null,null,null,null,null,null,null,null,null,null,null,null,null,null,null,null,null,null,null,null,null,null,null,null,null,null,null,null,null,null,null,null,"Total",12752.202309999995,12752.546522999999,12766.195206000022,12751.316951999999,12750.904347999971,2091.348554000002,2089.5090739999991,2086.8871670000003,2091.4923590000008,2090.9677440000037,10656.762350999983,10664.430017000024,10672.847230000007,10660.749416999995,10668.171425999983,1229.4220730000018,1887.9833900000031,7735.9703829999889,14268.385631999965,4252.3530440000068,13879.26626499998,7437.8428580000036,13081.941694000026]
[]
[]
[]
[]
[]
[]
[]
[]
[]
[]
[]
[]
[]
[]
[]
[]
[]
[]
[]
[]
[]
[]
[]
[]
[]
[]
[]
[]
[]
[]
[]
[]
[]
[]
[]
[]
[]
[]
[]
[]
[]
[]
[]
[]
[]
[]
[{"$f":"A1026","v":"Niger"}]
[{"$f":"A1034","v":"2012"}]
["Access to hygiene facilities "]
[" by wealth quintile and sub-national region"]
["Notes:"]
["WHO/UNICEF JMP customised wealth index excludes water,"]
[" sanitation and hygiene assets."]
["Survey used for analysis:",{"$f":"A1025","v":"DHS12"}]
[]
[]
[]
[]
["Access to handwashing",null,"NATIONAL wealth index quintile",null,null,null,null,"URBAN wealth index quintile",null,null,null,null,"RURAL wealth index quintile",null,null,null,null,"SUB-REGIONS:",null,null,null,null,null,null,null,null,null,null,null,null,null,null,null,null,null,null,null,null,null,null,null,null,null,null,null,null,null,null,null,null,null,null,"Raw numbers of respondents:","Access to handwashing","NATIONAL wealth index quintile",null,null,null,null,"URBAN wealth index quintile",null,null,null,null,"RURAL wealth index quintile",null,null,null,null,"SUB-REGIONS:"]
["Weighted percentage (used in graphs)",null,"Poorest","Poor","Middle","Rich","Richest","Poorest","Poor","Middle","Rich","Richest","Poorest","Poor","Middle","Rich","Richest","Agadez","Diffa","Dosso","Maradi","Niamey","Tahoua","Tillaberi","Zinder",null,null,null,null,null,null,null,null,null,null,null,null,null,null,null,null,null,null,null,null,null,null,null,null,null,null,null,"Hygiene data, raw numbers (weighted)",null,"Poorest","Poor","Middle","Rich","Richest","Poorest","Poor","Middle","Rich","Richest","Poorest","Poor","Middle","Rich","Richest","Agadez","Diffa","Dosso","Maradi","Niamey","Tahoua","Tillaberi","Zinder"]
["Hygiene ladder","Basic","N/A","N/A","N/A","N/A","N/A","N/A","N/A","N/A","N/A","N/A","N/A","N/A","N/A","N/A","N/A","N/A","N/A","N/A","N/A","N/A","N/A","N/A","N/A",null,null,null,null,null,null,null,null,null,null,null,null,null,null,null,null,null,null,null,null,null,null,null,null,null,null,null,"Hygiene ladder","Basic","N/A","N/A","N/A","N/A","N/A","N/A","N/A","N/A","N/A","N/A","N/A","N/A","N/A","N/A","N/A","N/A","N/A","N/A","N/A","N/A","N/A","N/A","N/A"]
[null,"Limited","N/A","N/A","N/A","N/A","N/A","N/A","N/A","N/A","N/A","N/A","N/A","N/A","N/A","N/A","N/A","N/A","N/A","N/A","N/A","N/A","N/A","N/A","N/A",null,null,null,null,null,null,null,null,null,null,null,null,null,null,null,null,null,null,null,null,null,null,null,null,null,null,null,null,"Limited","N/A","N/A","N/A","N/A","N/A","N/A","N/A","N/A","N/A","N/A","N/A","N/A","N/A","N/A","N/A","N/A","N/A","N/A","N/A","N/A","N/A","N/A","N/A"]
[null,"No facility","N/A","N/A","N/A","N/A","N/A","N/A","N/A","N/A","N/A","N/A","N/A","N/A","N/A","N/A","N/A","N/A","N/A","N/A","N/A","N/A","N/A","N/A","N/A",null,null,null,null,null,null,null,null,null,null,null,null,null,null,null,null,null,null,null,null,null,null,null,null,null,null,null,null,"No facility","N/A","N/A","N/A","N/A","N/A","N/A","N/A","N/A","N/A","N/A","N/A","N/A","N/A","N/A","N/A","N/A","N/A","N/A","N/A","N/A","N/A","N/A","N/A"]
[null,null,null,null,null,null,null,null,null,null,null,null,null,null,null,null,null,null,null,null,null,null,null,null,null,null,null,null,null,null,null,null,null,null,null,null,null,null,null,null,null,null,null,null,null,null,null,null,null,null,null,null,"Observed handwashing place","Fixed","N/A","N/A","N/A","N/A","N/A","N/A","N/A","N/A","N/A","N/A","N/A","N/A","N/A","N/A","N/A","N/A","N/A","N/A","N/A","N/A","N/A","N/A","N/A"]
[null,null,null,null,null,null,null,null,null,null,null,null,null,null,null,null,null,null,null,null,null,null,null,null,null,null,null,null,null,null,null,null,null,null,null,null,null,null,null,null,null,null,null,null,null,null,null,null,null,null,null,null,null,"Mobile","N/A","N/A","N/A","N/A","N/A","N/A","N/A","N/A","N/A","N/A","N/A","N/A","N/A","N/A","N/A","N/A","N/A","N/A","N/A","N/A","N/A","N/A","N/A"]
[null,null,null,null,null,null,null,null,null,null,null,null,null,null,null,null,null,null,null,null,null,null,null,null,null,null,null,null,null,null,null,null,null,null,null,null,null,null,null,null,null,null,null,null,null,null,null,null,null,null,null,null,"Water / Soap","Water and soap","N/A","N/A","N/A","N/A","N/A","N/A","N/A","N/A","N/A","N/A","N/A","N/A","N/A","N/A","N/A","N/A","N/A","N/A","N/A","N/A","N/A","N/A","N/A"]
[null,null,null,null,null,null,null,null,null,null,null,null,null,null,null,null,null,null,null,null,null,null,null,null,null,null,null,null,null,null,null,null,null,null,null,null,null,null,null,null,null,null,null,null,null,null,null,null,null,null,null,null,null,"Water only","N/A","N/A","N/A","N/A","N/A","N/A","N/A","N/A","N/A","N/A","N/A","N/A","N/A","N/A","N/A","N/A","N/A","N/A","N/A","N/A","N/A","N/A","N/A"]
[null,null,null,null,null,null,null,null,null,null,null,null,null,null,null,null,null,null,null,null,null,null,null,null,null,null,null,null,null,null,null,null,null,null,null,null,null,null,null,null,null,null,null,null,null,null,null,null,null,null,null,null,null,"Soap only","N/A","N/A","N/A","N/A","N/A","N/A","N/A","N/A","N/A","N/A","N/A","N/A","N/A","N/A","N/A","N/A","N/A","N/A","N/A","N/A","N/A","N/A","N/A"]
[null,null,null,null,null,null,null,null,null,null,null,null,null,null,null,null,null,null,null,null,null,null,null,null,null,null,null,null,null,null,null,null,null,null,null,null,null,null,null,null,null,null,null,null,null,null,null,null,null,null,null,null,null,"Neither","N/A","N/A","N/A","N/A","N/A","N/A","N/A","N/A","N/A","N/A","N/A","N/A","N/A","N/A","N/A","N/A","N/A","N/A","N/A","N/A","N/A","N/A","N/A"]
[]
[]
[]
[]
[]
[]
[]
[]
[]
[]
[]
[]
[]
[]
[]
[]
[]
[]
[]
[]
[]
[]
[]
[]
[]
[]
[]
[]
[null,null,null,null,null,null,null,null,null,null,null,null,null,null,null,null,null,null,null,null,null,null,null,null,null,null,null,null,null,null,null,null,null,null,null,null,null,null,null,null,null,null,null,null,null,null,null,null,null,null,null,null,"Raw numbers of respondents:","Menstrual health and hygiene","NATIONAL wealth index quintile",null,null,null,null,"URBAN wealth index quintile",null,null,null,null,"RURAL wealth index quintile",null,null,null,null,"SUB-REGIONS:"]
[null,null,null,null,null,null,null,null,null,null,null,null,null,null,null,null,null,null,null,null,null,null,null,null,null,null,null,null,null,null,null,null,null,null,null,null,null,null,null,null,null,null,null,null,null,null,null,null,null,null,null,null,"MHH data, raw numbers (weighted)",null,"Poorest","Poor","Middle","Rich","Richest","Poorest","Poor","Middle","Rich","Richest","Poorest","Poor","Middle","Rich","Richest","Agadez","Diffa","Dosso","Maradi","Niamey","Tahoua","Tillaberi","Zinder"]
[null,null,null,null,null,null,null,null,null,null,null,null,null,null,null,null,null,null,null,null,null,null,null,null,null,null,null,null,null,null,null,null,null,null,null,null,null,null,null,null,null,null,null,null,null,null,null,null,null,null,null,null,"Private place to wash and change","Yes","N/A","N/A","N/A","N/A","N/A","N/A","N/A","N/A","N/A","N/A","N/A","N/A","N/A","N/A","N/A","N/A","N/A","N/A","N/A","N/A","N/A","N/A","N/A"]
[null,null,null,null,null,null,null,null,null,null,null,null,null,null,null,null,null,null,null,null,null,null,null,null,null,null,null,null,null,null,null,null,null,null,null,null,null,null,null,null,null,null,null,null,null,null,null,null,null,null,null,null,null,"No","N/A","N/A","N/A","N/A","N/A","N/A","N/A","N/A","N/A","N/A","N/A","N/A","N/A","N/A","N/A","N/A","N/A","N/A","N/A","N/A","N/A","N/A","N/A"]
[null,null,null,null,null,null,null,null,null,null,null,null,null,null,null,null,null,null,null,null,null,null,null,null,null,null,null,null,null,null,null,null,null,null,null,null,null,null,null,null,null,null,null,null,null,null,null,null,null,null,null,null,null,"DK/not sure/missing","N/A","N/A","N/A","N/A","N/A","N/A","N/A","N/A","N/A","N/A","N/A","N/A","N/A","N/A","N/A","N/A","N/A","N/A","N/A","N/A","N/A","N/A","N/A"]
[null,null,null,null,null,null,null,null,null,null,null,null,null,null,null,null,null,null,null,null,null,null,null,null,null,null,null,null,null,null,null,null,null,null,null,null,null,null,null,null,null,null,null,null,null,null,null,null,null,null,null,null,"Use of menstrual materials","Materials reusable","N/A","N/A","N/A","N/A","N/A","N/A","N/A","N/A","N/A","N/A","N/A","N/A","N/A","N/A","N/A","N/A","N/A","N/A","N/A","N/A","N/A","N/A","N/A"]
[null,null,null,null,null,null,null,null,null,null,null,null,null,null,null,null,null,null,null,null,null,null,null,null,null,null,null,null,null,null,null,null,null,null,null,null,null,null,null,null,null,null,null,null,null,null,null,null,null,null,null,null,null,"Materials not reusable","N/A","N/A","N/A","N/A","N/A","N/A","N/A","N/A","N/A","N/A","N/A","N/A","N/A","N/A","N/A","N/A","N/A","N/A","N/A","N/A","N/A","N/A","N/A"]
[null,null,null,null,null,null,null,null,null,null,null,null,null,null,null,null,null,null,null,null,null,null,null,null,null,null,null,null,null,null,null,null,null,null,null,null,null,null,null,null,null,null,null,null,null,null,null,null,null,null,null,null,null,"No materials used","N/A","N/A","N/A","N/A","N/A","N/A","N/A","N/A","N/A","N/A","N/A","N/A","N/A","N/A","N/A","N/A","N/A","N/A","N/A","N/A","N/A","N/A","N/A"]
[null,null,null,null,null,null,null,null,null,null,null,null,null,null,null,null,null,null,null,null,null,null,null,null,null,null,null,null,null,null,null,null,null,null,null,null,null,null,null,null,null,null,null,null,null,null,null,null,null,null,null,null,null,"DK/not sure/missing","N/A","N/A","N/A","N/A","N/A","N/A","N/A","N/A","N/A","N/A","N/A","N/A","N/A","N/A","N/A","N/A","N/A","N/A","N/A","N/A","N/A","N/A","N/A"]
[null,null,null,null,null,null,null,null,null,null,null,null,null,null,null,null,null,null,null,null,null,null,null,null,null,null,null,null,null,null,null,null,null,null,null,null,null,null,null,null,null,null,null,null,null,null,null,null,null,null,null,null,"Use of menstrual materials with private place to wash and change","Materials reusable","N/A","N/A","N/A","N/A","N/A","N/A","N/A","N/A","N/A","N/A","N/A","N/A","N/A","N/A","N/A","N/A","N/A","N/A","N/A","N/A","N/A","N/A","N/A"]
[null,null,null,null,null,null,null,null,null,null,null,null,null,null,null,null,null,null,null,null,null,null,null,null,null,null,null,null,null,null,null,null,null,null,null,null,null,null,null,null,null,null,null,null,null,null,null,null,null,null,null,null,null,"Materials not reusable","N/A","N/A","N/A","N/A","N/A","N/A","N/A","N/A","N/A","N/A","N/A","N/A","N/A","N/A","N/A","N/A","N/A","N/A","N/A","N/A","N/A","N/A","N/A"]
[null,null,null,null,null,null,null,null,null,null,null,null,null,null,null,null,null,null,null,null,null,null,null,null,null,null,null,null,null,null,null,null,null,null,null,null,null,null,null,null,null,null,null,null,null,null,null,null,null,null,null,null,null,"No materials used","N/A","N/A","N/A","N/A","N/A","N/A","N/A","N/A","N/A","N/A","N/A","N/A","N/A","N/A","N/A","N/A","N/A","N/A","N/A","N/A","N/A","N/A","N/A"]
[null,null,null,null,null,null,null,null,null,null,null,null,null,null,null,null,null,null,null,null,null,null,null,null,null,null,null,null,null,null,null,null,null,null,null,null,null,null,null,null,null,null,null,null,null,null,null,null,null,null,null,null,"Awareness of menstruation before menarche","Yes","N/A","N/A","N/A","N/A","N/A","N/A","N/A","N/A","N/A","N/A","N/A","N/A","N/A","N/A","N/A","N/A","N/A","N/A","N/A","N/A","N/A","N/A","N/A"]
[null,null,null,null,null,null,null,null,null,null,null,null,null,null,null,null,null,null,null,null,null,null,null,null,null,null,null,null,null,null,null,null,null,null,null,null,null,null,null,null,null,null,null,null,null,null,null,null,null,null,null,null,null,"No","N/A","N/A","N/A","N/A","N/A","N/A","N/A","N/A","N/A","N/A","N/A","N/A","N/A","N/A","N/A","N/A","N/A","N/A","N/A","N/A","N/A","N/A","N/A"]
[null,null,null,null,null,null,null,null,null,null,null,null,null,null,null,null,null,null,null,null,null,null,null,null,null,null,null,null,null,null,null,null,null,null,null,null,null,null,null,null,null,null,null,null,null,null,null,null,null,null,null,null,null,"DK/not sure/missing","N/A","N/A","N/A","N/A","N/A","N/A","N/A","N/A","N/A","N/A","N/A","N/A","N/A","N/A","N/A","N/A","N/A","N/A","N/A","N/A","N/A","N/A","N/A"]
[null,null,null,null,null,null,null,null,null,null,null,null,null,null,null,null,null,null,null,null,null,null,null,null,null,null,null,null,null,null,null,null,null,null,null,null,null,null,null,null,null,null,null,null,null,null,null,null,null,null,null,null,"Participation in (all) activities during menstruation","Yes","N/A","N/A","N/A","N/A","N/A","N/A","N/A","N/A","N/A","N/A","N/A","N/A","N/A","N/A","N/A","N/A","N/A","N/A","N/A","N/A","N/A","N/A","N/A"]
[null,null,null,null,null,null,null,null,null,null,null,null,null,null,null,null,null,null,null,null,null,null,null,null,null,null,null,null,null,null,null,null,null,null,null,null,null,null,null,null,null,null,null,null,null,null,null,null,null,null,null,null,null,"No","N/A","N/A","N/A","N/A","N/A","N/A","N/A","N/A","N/A","N/A","N/A","N/A","N/A","N/A","N/A","N/A","N/A","N/A","N/A","N/A","N/A","N/A","N/A"]
[null,null,null,null,null,null,null,null,null,null,null,null,null,null,null,null,null,null,null,null,null,null,null,null,null,null,null,null,null,null,null,null,null,null,null,null,null,null,null,null,null,null,null,null,null,null,null,null,null,null,null,null,null,"DK/not sure/missing/no such activity","N/A","N/A","N/A","N/A","N/A","N/A","N/A","N/A","N/A","N/A","N/A","N/A","N/A","N/A","N/A","N/A","N/A","N/A","N/A","N/A","N/A","N/A","N/A"]
[null,null,null,null,null,null,null,null,null,null,null,null,null,null,null,null,null,null,null,null,null,null,null,null,null,null,null,null,null,null,null,null,null,null,null,null,null,null,null,null,null,null,null,null,null,null,null,null,null,null,null,null,"Participation in specific activities during menstruation","Did not go to school (amongst those usually attending school)","N/A","N/A","N/A","N/A","N/A","N/A","N/A","N/A","N/A","N/A","N/A","N/A","N/A","N/A","N/A","N/A","N/A","N/A","N/A","N/A","N/A","N/A","N/A"]
[null,null,null,null,null,null,null,null,null,null,null,null,null,null,null,null,null,null,null,null,null,null,null,null,null,null,null,null,null,null,null,null,null,null,null,null,null,null,null,null,null,null,null,null,null,null,null,null,null,null,null,null,null,"Did not go to work (amongst those who usually work)","N/A","N/A","N/A","N/A","N/A","N/A","N/A","N/A","N/A","N/A","N/A","N/A","N/A","N/A","N/A","N/A","N/A","N/A","N/A","N/A","N/A","N/A","N/A"]
[null,null,null,null,null,null,null,null,null,null,null,null,null,null,null,null,null,null,null,null,null,null,null,null,null,null,null,null,null,null,null,null,null,null,null,null,null,null,null,null,null,null,null,null,null,null,null,null,null,null,null,null,null,"Did not participate in social activities","N/A","N/A","N/A","N/A","N/A","N/A","N/A","N/A","N/A","N/A","N/A","N/A","N/A","N/A","N/A","N/A","N/A","N/A","N/A","N/A","N/A","N/A","N/A"]
[null,null,null,null,null,null,null,null,null,null,null,null,null,null,null,null,null,null,null,null,null,null,null,null,null,null,null,null,null,null,null,null,null,null,null,null,null,null,null,null,null,null,null,null,null,null,null,null,null,null,null,null,null,"Did not cook food","N/A","N/A","N/A","N/A","N/A","N/A","N/A","N/A","N/A","N/A","N/A","N/A","N/A","N/A","N/A","N/A","N/A","N/A","N/A","N/A","N/A","N/A","N/A"]
[null,null,null,null,null,null,null,null,null,null,null,null,null,null,null,null,null,null,null,null,null,null,null,null,null,null,null,null,null,null,null,null,null,null,null,null,null,null,null,null,null,null,null,null,null,null,null,null,null,null,null,null,null,"Did not eat with others","N/A","N/A","N/A","N/A","N/A","N/A","N/A","N/A","N/A","N/A","N/A","N/A","N/A","N/A","N/A","N/A","N/A","N/A","N/A","N/A","N/A","N/A","N/A"]
[null,null,null,null,null,null,null,null,null,null,null,null,null,null,null,null,null,null,null,null,null,null,null,null,null,null,null,null,null,null,null,null,null,null,null,null,null,null,null,null,null,null,null,null,null,null,null,null,null,null,null,null,null,"Did not bathe in regular place","N/A","N/A","N/A","N/A","N/A","N/A","N/A","N/A","N/A","N/A","N/A","N/A","N/A","N/A","N/A","N/A","N/A","N/A","N/A","N/A","N/A","N/A","N/A"]
[null,null,null,null,null,null,null,null,null,null,null,null,null,null,null,null,null,null,null,null,null,null,null,null,null,null,null,null,null,null,null,null,null,null,null,null,null,null,null,null,null,null,null,null,null,null,null,null,null,null,null,null,null,"Did not participate in other activities","N/A","N/A","N/A","N/A","N/A","N/A","N/A","N/A","N/A","N/A","N/A","N/A","N/A","N/A","N/A","N/A","N/A","N/A","N/A","N/A","N/A","N/A","N/A"]
[null,null,null,null,null,null,null,null,null,null,null,null,null,null,null,null,null,null,null,null,null,null,null,null,null,null,null,null,null,null,null,null,null,null,null,null,null,null,null,null,null,null,null,null,null,null,null,null,null,null,null,null,null,"DK/not sure/missing/no such activity","N/A","N/A","N/A","N/A","N/A","N/A","N/A","N/A","N/A","N/A","N/A","N/A","N/A","N/A","N/A","N/A","N/A","N/A","N/A","N/A","N/A","N/A","N/A"]
[]
[]
[]
[]
[]
[]
[]
[]
[]
[]
[]
[]
[]
[]
[]
[]
[]
[]
[]
[]
[]
[]
[]
[]
[]
[]
[]
[]
[]
[]
[]
[]
[]
[]
[]
[]
[]
[]
[]
[]
[]
[]
[]
[]
[]
[]
[]
[]
[]
[]
[]
[]
[]
[]
[null,null,null,null,null,null,null,null,null,null,null,null,null,null,null,null,null,null,null,null,null,null,null,null,null,null,null,null,null,null,null,null,null,null,null,null,null,null,null,null,null,null,null,null,null,null,null,null,null,null,null,null,"Raw numbers of respondents:","Basic water, sanitation and hygiene","NATIONAL wealth index quintile",null,null,null,null,"URBAN wealth index quintile",null,null,null,null,"RURAL wealth index quintile",null,null,null,null,"SUB-REGIONS:"]
[null,null,null,null,null,null,null,null,null,null,null,null,null,null,null,null,null,null,null,null,null,null,null,null,null,null,null,null,null,null,null,null,null,null,null,null,null,null,null,null,null,null,null,null,null,null,null,null,null,null,null,null,"WatSan data, raw numbers (weighted)",null,"Poorest","Poor","Middle","Rich","Richest","Poorest","Poor","Middle","Rich","Richest","Poorest","Poor","Middle","Rich","Richest","Agadez","Diffa","Dosso","Maradi","Niamey","Tahoua","Tillaberi","Zinder"]
[null,null,null,null,null,null,null,null,null,null,null,null,null,null,null,null,null,null,null,null,null,null,null,null,null,null,null,null,null,null,null,null,null,null,null,null,null,null,null,null,null,null,null,null,null,null,null,null,null,null,null,null,"Use of Basic Water Sanitation and Hygiene","Yes","N/A","N/A","N/A","N/A","N/A","N/A","N/A","N/A","N/A","N/A","N/A","N/A","N/A","N/A","N/A","N/A","N/A","N/A","N/A","N/A","N/A","N/A","N/A"]
[null,null,null,null,null,null,null,null,null,null,null,null,null,null,null,null,null,null,null,null,null,null,null,null,null,null,null,null,null,null,null,null,null,null,null,null,null,null,null,null,null,null,null,null,null,null,null,null,null,null,null,null,null,"No","N/A","N/A","N/A","N/A","N/A","N/A","N/A","N/A","N/A","N/A","N/A","N/A","N/A","N/A","N/A","N/A","N/A","N/A","N/A","N/A","N/A","N/A","N/A"]
[null,null,null,null,null,null,null,null,null,null,null,null,null,null,null,null,null,null,null,null,null,null,null,null,null,null,null,null,null,null,null,null,null,null,null,null,null,null,null,null,null,null,null,null,null,null,null,null,null,null,null,null,"Use of Basic Water and Sanitation","Yes","N/A","N/A","N/A","N/A","N/A","N/A","N/A","N/A","N/A","N/A","N/A","N/A","N/A","N/A","N/A","N/A","N/A","N/A","N/A","N/A","N/A","N/A","N/A"]
[null,null,null,null,null,null,null,null,null,null,null,null,null,null,null,null,null,null,null,null,null,null,null,null,null,null,null,null,null,null,null,null,null,null,null,null,null,null,null,null,null,null,null,null,null,null,null,null,null,null,null,null,null,"No","N/A","N/A","N/A","N/A","N/A","N/A","N/A","N/A","N/A","N/A","N/A","N/A","N/A","N/A","N/A","N/A","N/A","N/A","N/A","N/A","N/A","N/A","N/A"]
[null,null,null,null,null,null,null,null,null,null,null,null,null,null,null,null,null,null,null,null,null,null,null,null,null,null,null,null,null,null,null,null,null,null,null,null,null,null,null,null,null,null,null,null,null,null,null,null,null,null,null,null,"Use of Basic Water and Hygiene","Yes","N/A","N/A","N/A","N/A","N/A","N/A","N/A","N/A","N/A","N/A","N/A","N/A","N/A","N/A","N/A","N/A","N/A","N/A","N/A","N/A","N/A","N/A","N/A"]
[null,null,null,null,null,null,null,null,null,null,null,null,null,null,null,null,null,null,null,null,null,null,null,null,null,null,null,null,null,null,null,null,null,null,null,null,null,null,null,null,null,null,null,null,null,null,null,null,null,null,null,null,null,"No","N/A","N/A","N/A","N/A","N/A","N/A","N/A","N/A","N/A","N/A","N/A","N/A","N/A","N/A","N/A","N/A","N/A","N/A","N/A","N/A","N/A","N/A","N/A"]
[null,null,null,null,null,null,null,null,null,null,null,null,null,null,null,null,null,null,null,null,null,null,null,null,null,null,null,null,null,null,null,null,null,null,null,null,null,null,null,null,null,null,null,null,null,null,null,null,null,null,null,null,"Use of Basic Sanitation and Hygiene","Yes","N/A","N/A","N/A","N/A","N/A","N/A","N/A","N/A","N/A","N/A","N/A","N/A","N/A","N/A","N/A","N/A","N/A","N/A","N/A","N/A","N/A","N/A","N/A"]
[null,null,null,null,null,null,null,null,null,null,null,null,null,null,null,null,null,null,null,null,null,null,null,null,null,null,null,null,null,null,null,null,null,null,null,null,null,null,null,null,null,null,null,null,null,null,null,null,null,null,null,null,null,"No","N/A","N/A","N/A","N/A","N/A","N/A","N/A","N/A","N/A","N/A","N/A","N/A","N/A","N/A","N/A","N/A","N/A","N/A","N/A","N/A","N/A","N/A","N/A"]
[null,null,null,null,null,null,null,null,null,null,null,null,null,null,null,null,null,null,null,null,null,null,null,null,null,null,null,null,null,null,null,null,null,null,null,null,null,null,null,null,null,null,null,null,null,null,null,null,null,null,null,null,"Use of Basic Water","Yes","N/A","N/A","N/A","N/A","N/A","N/A","N/A","N/A","N/A","N/A","N/A","N/A","N/A","N/A","N/A","N/A","N/A","N/A","N/A","N/A","N/A","N/A","N/A"]
[null,null,null,null,null,null,null,null,null,null,null,null,null,null,null,null,null,null,null,null,null,null,null,null,null,null,null,null,null,null,null,null,null,null,null,null,null,null,null,null,null,null,null,null,null,null,null,null,null,null,null,null,null,"No","N/A","N/A","N/A","N/A","N/A","N/A","N/A","N/A","N/A","N/A","N/A","N/A","N/A","N/A","N/A","N/A","N/A","N/A","N/A","N/A","N/A","N/A","N/A"]
[null,null,null,null,null,null,null,null,null,null,null,null,null,null,null,null,null,null,null,null,null,null,null,null,null,null,null,null,null,null,null,null,null,null,null,null,null,null,null,null,null,null,null,null,null,null,null,null,null,null,null,null,"Use of Basic Sanitation","Yes","N/A","N/A","N/A","N/A","N/A","N/A","N/A","N/A","N/A","N/A","N/A","N/A","N/A","N/A","N/A","N/A","N/A","N/A","N/A","N/A","N/A","N/A","N/A"]
[null,null,null,null,null,null,null,null,null,null,null,null,null,null,null,null,null,null,null,null,null,null,null,null,null,null,null,null,null,null,null,null,null,null,null,null,null,null,null,null,null,null,null,null,null,null,null,null,null,null,null,null,null,"No","N/A","N/A","N/A","N/A","N/A","N/A","N/A","N/A","N/A","N/A","N/A","N/A","N/A","N/A","N/A","N/A","N/A","N/A","N/A","N/A","N/A","N/A","N/A"]
[null,null,null,null,null,null,null,null,null,null,null,null,null,null,null,null,null,null,null,null,null,null,null,null,null,null,null,null,null,null,null,null,null,null,null,null,null,null,null,null,null,null,null,null,null,null,null,null,null,null,null,null,"Access to Basic Hygiene","Yes","N/A","N/A","N/A","N/A","N/A","N/A","N/A","N/A","N/A","N/A","N/A","N/A","N/A","N/A","N/A","N/A","N/A","N/A","N/A","N/A","N/A","N/A","N/A"]
[null,null,null,null,null,null,null,null,null,null,null,null,null,null,null,null,null,null,null,null,null,null,null,null,null,null,null,null,null,null,null,null,null,null,null,null,null,null,null,null,null,null,null,null,null,null,null,null,null,null,null,null,null,"No","N/A","N/A","N/A","N/A","N/A","N/A","N/A","N/A","N/A","N/A","N/A","N/A","N/A","N/A","N/A","N/A","N/A","N/A","N/A","N/A","N/A","N/A","N/A"]
[]
[]
[]
[]
[]
[]
[]
[]
[]
[]
[]
[]
[]
[]
[]
[]
[]
[]
[]
[]
[]
[]
[]
[]
[]
[]
[]
[]
[]
[]
[]
[]
[]
[]
[]
[]
[]
[]
[]
[]
[]
[]
[]
[]
[null,null,"INITIAL (national) Wealth Index",null,null,null,null,"URBAN Wealth Index",null,null,null,null,"RURAL Wealth Index"]
[null,null,"Component Matrix",null,null,null,null,"Component Matrix",null,null,null,null,"Component Matrix"]
[null,null,null,null,"Component",null,null,null,null,"Component",null,null,null,null,"Component"]
[null,"Note:\n\nThe INITIAL (national) Wealth Index is based on the first component of the Principal Component Analysis (PCA) which has been obtained at national level.\n\nThe final national-level (NATIONAL) Wealth Index is based on the URBAN and RURAL specific wealth indexes. Regression procedures are used to establish the relationships between the two sets of scores (urban and rural) and the initial (national) wealth factors.\nThis allows best use of the available information for each area and a better precision of the FINAL (NATIONAL) Wealth Index.\n\nFor dependency reasons, all WASH variables (contained in the generic MICS and DHS scripts) have been excluded from the sets of asset variables used in the PCAs.\n\nThe PCA can extracts as many components as there are asset variables in the input. Only the first of the components is used to represent the Wealth Index. \n\nThe scores represent the weights of the asset variables on the Wealth Index (correlations between the variables and the component).\n\nThe communalities are the proportion of each variable's variance that can be explained by the component.\n\nProportion of explained variance is the part of the model's total variance that is explained by the component.\n\nFor more information on the procedure used:\n\nThe DHS Wealth Index, DHS Comparative Reports No. 6, Shea Oscar Rutstein, Kiersten Johnson, ORC Macro International Inc., 2004.\n\nThe DHS Wealth Index: Approaches for Rural and Urban Areas, Shea O. Rutstein, ORC Macro International Inc., 2008.\n\nMICS Methodological Paper No. 4, Review of options for reporting water, sanitation and hygiene coverage by wealth quintile, UNICEF, 2016.",null,null,"1",null,null,null,null,"1",null,null,null,null,"1"]
[null,null,"Has television",null,0.77522563500704667,null,null,"Has refrigerator",null,0.689125832151809,null,null,"sheep1",null,-0.46774290746159841]
[null,null,"Cement walls",null,0.73989337550179934,null,null,"Oven",null,0.68219275523465484,null,null,"Has television",null,0.4364029519832634]
[null,null,"Has refrigerator",null,0.72582553717085463,null,null,"Cane/palm/trunks/dirt/staw walls",null,-0.67050824639375495,null,null,"dairy1",null,-0.43054185433385594]
[null,null,"Has electricity",null,0.72581302449773033,null,null,"Has bank account",null,0.66060879679019069,null,null,"equine1",null,-0.40234919545921866]
[null,null,"VCR/DVD",null,0.72195627900246306,null,null,"Cement walls",null,0.64590712036226783,null,null,"VCR/DVD",null,0.39614902491292553]
[null,null,"Cane/palm/trunks/dirt/staw walls",null,-0.70884311426508262,null,null,"Has television",null,0.64474045946667169,null,null,"Cane/palm/trunks/dirt/staw walls",null,-0.39271842649241751]
[null,null,"Earth, sand floor",null,-0.68660855934701059,null,null,"Computer",null,0.64203954254100659,null,null,"goats1",null,-0.37986687851497075]
[null,null,"Has bank account",null,0.67251936873852491,null,null,"Parabolic antenna",null,0.64094586278826948,null,null,"camels1",null,-0.37720397956199647]
[null,null,"Oven",null,0.67180093187369971,null,null,"VCR/DVD",null,0.63631256808852155,null,null,"goats4",null,0.37429676147413776]
[null,null,"Parabolic antenna",null,0.66169307817779599,null,null,"Air conditioning",null,0.62857539378575633,null,null,"Has refrigerator",null,0.37024925374333362]
[null,null,"Metal roof",null,0.62849130744389059,null,null,"Has car/truck",null,0.61686050920316926,null,null,"Cement walls",null,0.36594019284469137]
[null,null,"Computer",null,0.62240421180587302,null,null,"Has electricity",null,0.58855873875103915,null,null,"Parabolic antenna",null,0.34515625296565561]
[null,null,"Has car/truck",null,0.61841684214585846,null,null,"Earth, sand floor",null,-0.50386982173220474,null,null,"Earth, sand floor",null,-0.34150486135436925]
[null,null,"Air conditioning",null,0.60576310054450277,null,null,"Ceramic/mosaic floor",null,0.49635046887467216,null,null,"Has electricity",null,0.33967294463193459]
[null,null,"Ceramic/mosaic floor",null,0.49002832943000812,null,null,"Has telephone (land-line)",null,0.49589133265576574,null,null,"equine2",null,0.33575599727506145]
[null,null,"Thatch, palm, sod roof",null,-0.48624866939178535,null,null,"Metal roof",null,0.46967015769612774,null,null,"sheep4",null,0.33352697108466867]
[null,null,"Has telephone (land-line)",null,0.48295928671619709,null,null,"Thatch, palm, sod roof",null,-0.45668137358880684,null,null,"chicks1",null,-0.32687952299633638]
[null,null,"Natural gas for cooking",null,0.45501702251270426,null,null,"Natural gas for cooking",null,0.45308289965514897,null,null,"Metal roof",null,0.32562550066737589]
[null,null,"Cement floor",null,0.44312877366964115,null,null,"Wood for cooking",null,-0.42673545800819085,null,null,"Has motorcycle/scooter",null,0.32167528815530277]
[null,null,"Has mobile telephone",null,0.39320667744207172,null,null,"Has watch",null,0.38184050677739989,null,null,"Oven",null,0.31542376646064219]
[null,null,"Has motorcycle/scooter",null,0.38617017255806579,null,null,"Electricity for cooking",null,0.34844490446234372,null,null,"Computer",null,0.30615341977489335]
[null,null,"Electricity for cooking",null,0.33045820446185181,null,null,"Has mobile telephone",null,0.3450967938909501,null,null,"Cement floor",null,0.29952756997755098]
[null,null,"Has bicycle",null,0.30007100346139465,null,null,"Has radio",null,0.29343094030003425,null,null,"camels2",null,0.29403385690039585]
[null,null,"Concrete roof",null,0.29882903946804257,null,null,"Concrete roof",null,0.28756768667812393,null,null,"Has car/truck",null,0.29366593300932631]
[null,null,"Has watch",null,0.28532289641798769,null,null,"Number of members per sleeping room",null,-0.28563585015096421,null,null,"Thatch, palm, sod roof",null,-0.29135093295012371]
[null,null,"Carpeted floor",null,0.25983922720142899,null,null,"Has motorcycle/scooter",null,0.28489522664274447,null,null,"Has watch",null,0.29014777848995488]
[null,null,"Has radio",null,0.25818472358746614,null,null,"Has bicycle",null,0.26682993173967273,null,null,"Has mobile telephone",null,0.27851903160044089]
[null,null,"Wood for cooking",null,-0.24153681940248159,null,null,"Carpeted floor",null,0.24424698594366676,null,null,"dairy4",null,0.26684182788959854]
[null,null,"Charcoal for cooking",null,0.22355654068850386,null,null,"goats1",null,0.2317848135528294,null,null,"dairy2",null,0.26450258583149322]
[null,null,"Vinyl strips/asphalt floor",null,0.22198679338930638,null,null,"goats2",null,-0.20748142323687371,null,null,"Has bank account",null,0.25441294148132643]
[null,null,"Number of members per sleeping room",null,-0.1975345518081206,null,null,"equine2",null,-0.14143124994959164,null,null,"Has radio",null,0.25111142490516497]
[null,null,"Stone walls with lime/cement",null,0.13747930717425841,null,null,"Palm/bamboo roof",null,-0.13650325171076308,null,null,"sheep3",null,0.24158852729803346]
[null,null,"Has animal-drawn cart",null,-0.11793714599495529,null,null,"equine1",null,0.1296954519096547,null,null,"chicks3",null,0.23799925526847077]
[null,null,"Wood planks roof",null,0.10433430355483546,null,null,"Charcoal for cooking",null,0.12526387657035748,null,null,"Ceramic/mosaic floor",null,0.21800572581405706]
[null,null,"Straw/shrubs/grass for cooking",null,-9.806754935595427E-2,null,null,"Cement floor",null,0.11835182024484499,null,null,"Air conditioning",null,0.21701619829313107]
[null,null,"Brick walls",null,9.5545572866010745E-2,null,null,"Wood roof",null,-0.11413999005693035,null,null,"Has animal-drawn cart",null,0.21699335446251966]
[null,null,"Plow",null,-8.9555400883121292E-2,null,null,"Mat roof",null,-0.11380900336029462,null,null,"Mat roof",null,0.21185088611324804]
[null,null,"Cement block walls",null,8.4472783493483514E-2,null,null,"Stone walls with lime/cement",null,0.10565399743927401,null,null,"equine3",null,0.1998592195834186]
[null,null,"Zinc/cement fiber roof",null,8.1819109173104004E-2,null,null,"dairy2",null,-9.7210036229867666E-2,null,null,"Has bicycle",null,0.19844030916806699]
[null,null,"Palm/bamboo roof",null,-6.5425246370138093E-2,null,null,"goats3",null,-9.6917096435084435E-2,null,null,"sheep2",null,0.19184618724848942]
[null,null,"Coal/lignite for cooking",null,6.4265750482702236E-2,null,null,"Other type of walls",null,9.3169668794313404E-2,null,null,"camels4",null,0.1903331228611542]
[null,null,"Other type of walls",null,6.1236587760361651E-2,null,null,"Zinc/cement fiber roof",null,9.112101715623773E-2,null,null,"dairy3",null,0.18479713407912046]
[null,null,"Cyclomotor",null,6.1051531745638696E-2,null,null,"Straw/shrubs/grass for cooking",null,-8.6047844286856454E-2,null,null,"ducks1",null,-0.17945695593105482]
[null,null,"Dung for cooking",null,-5.4608023511341808E-2,null,null,"sheep2",null,-8.4613737749026627E-2,null,null,"Other type of walls",null,0.1735230365776568]
[null,null,"Ag. crops for cooking",null,-5.0183185648522269E-2,null,null,"ducks1",null,-8.2248838394756468E-2,null,null,"goats3",null,0.1699220732304359]
[null,null,"Mat roof",null,-4.9486958478840777E-2,null,null,"Has animal-drawn cart",null,-7.3856617949286094E-2,null,null,"ducks2",null,0.16987193741522635]
[null,null,"Shingles roof",null,4.9029571628858792E-2,null,null,"camels4",null,7.3132856877757668E-2,null,null,"Has telephone (land-line)",null,0.16835929009249612]
[null,null,"Other type of roof",null,-3.9769859914409324E-2,null,null,"Motor pump",null,7.2243367760068899E-2,null,null,"chicks2",null,0.16237875251818396]
[null,null,"Motor pump",null,3.2262708509368791E-2,null,null,"sheep3",null,6.9512697894883652E-2,null,null,"Plow",null,0.15618377924754775]
[null,null,"Wood roof",null,3.2089646880180164E-2,null,null,"Plow",null,-6.8782435092812247E-2,null,null,"equine4",null,0.15042198183577385]
[null,null,"Skin roof",null,-2.408410586829348E-2,null,null,"ducks4",null,6.5635296644342631E-2,null,null,"Wood for cooking",null,0.14780328613737206]
[null,null,"No walls",null,-2.2137286874299496E-2,null,null,"ducks3",null,6.1607550686161257E-2,null,null,"camels3",null,0.13792470091796963]
[null,null,"Reused wood walls",null,-1.6733608757280492E-2,null,null,"Cyclomotor",null,6.0105696301006463E-2,null,null,"chicks4",null,0.12877504868348547]
[null,null,"Metal sheet walls",null,1.5672898023688531E-2,null,null,"ducks2",null,5.8151512731271518E-2,null,null,"No walls",null,0.12547158724895624]
[null,null,"Kerosene for cooking",null,1.0676713788754344E-2,null,null,"dairy1",null,5.3221387400789716E-2,null,null,"Vinyl strips/asphalt floor",null,0.12462518468677806]
[null,null,"Rudimentary wood plank floor",null,-1.0078799441279073E-2,null,null,"chicks3",null,5.2899179356889876E-2,null,null,"Reused wood walls",null,0.11655520031194883]
[null,null,"Other type of flooring",null,-9.2689481489918665E-3,null,null,"chicks4",null,5.2795214102449965E-2,null,null,"Does not cook",null,-0.1108440205280784]
[null,null,"Rudimentary palm, bamboo floor",null,-9.0807240525998707E-3,null,null,"Wood planks roof",null,5.1192514832829009E-2,null,null,"Rudimentary palm, bamboo floor",null,0.11028179367223853]
[null,null,"No roof",null,-7.8583425939724276E-3,null,null,"Coal/lignite for cooking",null,4.8837789942742037E-2,null,null,"Straw/shrubs/grass for cooking",null,-0.10436824575967084]
[null,null,"Stone walls with mud",null,7.2995236495557577E-3,null,null,"chicks2",null,-4.7992877481025237E-2,null,null,"Motor pump",null,9.3976756214602331E-2]
[null,null,"Other fuel for cooking",null,-4.2687682121594133E-3,null,null,"dairy3",null,4.7648292955431257E-2,null,null,"Concrete roof",null,9.3025389508578457E-2]
[null,null,"Cardboard roof",null,-1.3283005584298342E-3,null,null,"dairy4",null,4.6803838100790682E-2,null,null,"ducks3",null,7.6225637137098845E-2]
[null,null,"Wood planks, shingles walls",null,-1.2689572304219843E-3,null,null,"Shingles roof",null,4.6528690643364047E-2,null,null,"Natural gas for cooking",null,7.5862101655872094E-2]
[null,null,"Does not cook",null,-8.0535723655894608E-4,null,null,"Cement block walls",null,4.4843025381771207E-2,null,null,"Other type of roof",null,7.1532423459517297E-2]
[null,null,"Pinasse/pirogue",null,-1.688703224281076E-4,null,null,"No walls",null,-4.4607862429348354E-2,null,null,"Pinasse/pirogue",null,6.6335791734319444E-2]
[null,null,null,null,null,null,null,"Does not cook",null,-4.1361445758125899E-2,null,null,"Carpeted floor",null,6.0340783946776513E-2]
[null,null,null,null,null,null,null,"camels1",null,-4.0089701125234037E-2,null,null,"Other type of flooring",null,5.9184814545130519E-2]
[null,null,null,null,null,null,null,"camels3",null,3.4928207328526625E-2,null,null,"Ag. crops for cooking",null,-5.4220562578339015E-2]
[null,null,"Communalities",null,null,null,null,"Skin roof",null,-3.2300586514909933E-2,null,null,"Rudimentary wood plank floor",null,5.1098591085831729E-2]
[null,null,null,null,"Extraction",null,null,"sheep1",null,3.1345310201615635E-2,null,null,"Palm/bamboo roof",null,4.6317170632052498E-2]
[null,null,"Has electricity",null,0.52680454653054287,null,null,"sheep4",null,3.0607458212550977E-2,null,null,"Cyclomotor",null,3.6529179242830292E-2]
[null,null,"Has radio",null,6.6659351493936286E-2,null,null,"Reused wood walls",null,-2.7008894845363163E-2,null,null,"landarea",null,-3.5047337806743732E-2]
[null,null,"Has television",null,0.6009747851720787,null,null,"Vinyl strips/asphalt floor",null,2.6307128983266818E-2,null,null,"Charcoal for cooking",null,3.2133277656275862E-2]
[null,null,"Has refrigerator",null,0.52682271040935968,null,null,"Other type of roof",null,2.5688842749777688E-2,null,null,"Number of members per sleeping room",null,3.0906953663207854E-2]
[null,null,"Has bicycle",null,9.0042607118328316E-2,null,null,"camels2",null,-2.5632313609676927E-2,null,null,"Dung for cooking",null,-3.0226084278489551E-2]
[null,null,"Has motorcycle/scooter",null,0.14912740217352632,null,null,"Cardboard roof",null,-2.5341735182274082E-2,null,null,"Cement block walls",null,2.2524854313558933E-2]
[null,null,"Has car/truck",null,0.3824393906496556,null,null,"equine3",null,2.1234404382442826E-2,null,null,"Wood planks roof",null,2.0400932104522405E-2]
[null,null,"Has telephone (land-line)",null,0.23324967262541788,null,null,"equine4",null,2.1156422709048314E-2,null,null,"Brick walls",null,1.8118601632467309E-2]
[null,null,"Has mobile telephone",null,0.15461149118503342,null,null,"Rudimentary wood plank floor",null,-2.0679879599962279E-2,null,null,"Skin roof",null,1.7046701094839703E-2]
[null,null,"Has watch",null,8.1409155220349735E-2,null,null,"Rudimentary palm, bamboo floor",null,-1.9452220582616215E-2,null,null,"No roof",null,1.5006986145845901E-2]
[null,null,"Has animal-drawn cart",null,1.3909170405435399E-2,null,null,"Ag. crops for cooking",null,-1.8514979884551603E-2,null,null,"Coal/lignite for cooking",null,-1.353615633032334E-2]
[null,null,"Has bank account",null,0.45228230132846403,null,null,"Wood planks, shingles walls",null,-1.6362881586117844E-2,null,null,"Other fuel for cooking",null,-1.1483150028886941E-2]
[null,null,"VCR/DVD",null,0.52122086879108231,null,null,"Dung for cooking",null,-1.5985739247442701E-2,null,null,"Stone walls with mud",null,1.1103479159730237E-2]
[null,null,"Air conditioning",null,0.36694893398128936,null,null,"Metal sheet walls",null,-1.4450376368466437E-2,null,null,"goats2",null,8.291422633136418E-3]
[null,null,"Oven",null,0.45131649206637131,null,null,"Pinasse/pirogue",null,-1.3345266557771919E-2,null,null,"Cardboard roof",null,-5.0417832025842577E-3]
[null,null,"Parabolic antenna",null,0.43783772970840684,null,null,"Other fuel for cooking",null,-1.3197012926528766E-2,null,null,"Wood roof",null,2.7323210117624181E-3]
[null,null,"Computer",null,0.38738700287369005,null,null,"goats4",null,-1.2701916505411113E-2]
[null,null,"Plow",null,8.020169827336561E-3,null,null,"Other type of flooring",null,-1.2290995161746778E-2]
[null,null,"Motor pump",null,1.0408823603604974E-3,null,null,"Stone walls with mud",null,-9.8919774851770736E-3]
[null,null,"Pinasse/pirogue",null,2.8517185796973021E-8,null,null,"Brick walls",null,-7.6110085885036779E-3,null,null,"Communalities"]
[null,null,"Cyclomotor",null,3.7272895284887293E-3,null,null,"landarea",null,-4.0456775165022682E-3,null,null,null,null,"Extraction"]
[null,null,"Number of members per sleeping room",null,3.9019899158035082E-2,null,null,"Kerosene for cooking",null,2.7554786544104972E-3,null,null,"Has electricity",null,0.1153777093149293]
[null,null,"Earth, sand floor",null,0.47143131376857739,null,null,"chicks1",null,2.1790685275337785E-3,null,null,"Has radio",null,6.3056947717902309E-2]
[null,null,"Rudimentary wood plank floor",null,1.0158219817752736E-4,null,null,null,null,null,null,null,"Has television",null,0.1904475364997065]
[null,null,"Rudimentary palm, bamboo floor",null,8.2459549319465814E-5,null,null,null,null,null,null,null,"Has refrigerator",null,0.13708450989749543]
[null,null,"Vinyl strips/asphalt floor",null,4.9278136439266602E-2,null,null,null,null,null,null,null,"Has bicycle",null,3.9378556302718012E-2]
[null,null,"Cement floor",null,0.19636311005396007,null,null,"Communalities",null,null,null,null,"Has motorcycle/scooter",null,0.10347499100979707]
[null,null,"Ceramic/mosaic floor",null,0.24012776364396457,null,null,null,null,"Extraction",null,null,"Has car/truck",null,8.6239680210238132E-2]
[null,null,"Carpeted floor",null,6.7516423992635841E-2,null,null,"Has electricity",null,0.34640138896021394,null,null,"Has telephone (land-line)",null,2.8344850560449261E-2]
[null,null,"Other type of flooring",null,8.5913399788699747E-5,null,null,"Has radio",null,8.6101716725362265E-2,null,null,"Has mobile telephone",null,7.7572850963647397E-2]
[null,null,"No walls",null,4.9005947015503279E-4,null,null,"Has television",null,0.4156902600732949,null,null,"Has watch",null,8.4185733362655918E-2]
[null,null,"Cane/palm/trunks/dirt/staw walls",null,0.50245856064102101,null,null,"Has refrigerator",null,0.47489441253892323,null,null,"Has animal-drawn cart",null,4.7086115880896701E-2]
[null,null,"Stone walls with mud",null,5.328304551042381E-5,null,null,"Has bicycle",null,7.1198212472198416E-2,null,null,"Has bank account",null,6.472594479318082E-2]
[null,null,"Reused wood walls",null,2.8001366204173439E-4,null,null,"Has motorcycle/scooter",null,8.1165290163820736E-2,null,null,"VCR/DVD",null,0.1569340499394617]
[null,null,"Cement walls",null,0.54744220711144664,null,null,"Has car/truck",null,0.38051688781439325,null,null,"Air conditioning",null,4.7096030321603581E-2]
[null,null,"Stone walls with lime/cement",null,1.8900559901114101E-2,null,null,"Has telephone (land-line)",null,0.24590821380311131,null,null,"Oven",null,9.9492152448217741E-2]
[null,null,"Brick walls",null,9.1289564942941687E-3,null,null,"Has mobile telephone",null,0.11909179715381289,null,null,"Parabolic antenna",null,0.11913283896129165]
[null,null,"Cement block walls",null,7.1356511511369404E-3,null,null,"Has watch",null,0.14580217261602157,null,null,"Computer",null,9.372991643986206E-2]
[null,null,"Wood planks, shingles walls",null,1.6102524526402328E-6,null,null,"Has animal-drawn cart",null,5.4548000149068085E-3,null,null,"Plow",null,2.4393372900046728E-2]
[null,null,"Metal sheet walls",null,2.4563973246093985E-4,null,null,"Has bank account",null,0.43640398239658346,null,null,"Motor pump",null,8.8316307086187974E-3]
[null,null,"Other type of walls",null,3.7499196805324741E-3,null,null,"VCR/DVD",null,0.40489368430740935,null,null,"Pinasse/pirogue",null,4.4004372650190042E-3]
[null,null,"No roof",null,6.1753548324241307E-5,null,null,"Air conditioning",null,0.39510702567291867,null,null,"Cyclomotor",null,1.3343809361548234E-3]
[null,null,"Thatch, palm, sod roof",null,0.23643776848528178,null,null,"Oven",null,0.46538695529464968,null,null,"Number of members per sleeping room",null,9.5523978473967741E-4]
[null,null,"Mat roof",null,2.4489590594865109E-3,null,null,"Parabolic antenna",null,0.41081159902539915,null,null,"Earth, sand floor",null,0.11662557032866697]
[null,null,"Palm/bamboo roof",null,4.2804628625932682E-3,null,null,"Computer",null,0.41221477418626501,null,null,"Rudimentary wood plank floor",null,2.6110660109570417E-3]
[null,null,"Wood planks roof",null,1.0885646898272551E-2,null,null,"Plow",null,4.7310233772969298E-3,null,null,"Rudimentary palm, bamboo floor",null,1.2162074015566191E-2]
[null,null,"Cardboard roof",null,1.7643823735250093E-6,null,null,"Motor pump",null,5.2191041853165629E-3,null,null,"Vinyl strips/asphalt floor",null,1.5531436658213542E-2]
[null,null,"Skin roof",null,5.8004415547516848E-4,null,null,"Pinasse/pirogue",null,1.7809613949798555E-4,null,null,"Cement floor",null,8.9716765176656693E-2]
[null,null,"Metal roof",null,0.39500132353253098,null,null,"Cyclomotor",null,3.612694727828822E-3,null,null,"Ceramic/mosaic floor",null,4.7526496487713822E-2]
[null,null,"Wood roof",null,1.0297454368946566E-3,null,null,"Number of members per sleeping room",null,8.1587838891464079E-2,null,null,"Carpeted floor",null,3.6410102073115621E-3]
[null,null,"Zinc/cement fiber roof",null,6.6943666258803122E-3,null,null,"Earth, sand floor",null,0.25388479725244378,null,null,"Other type of flooring",null,3.502842272741493E-3]
[null,null,"Concrete roof",null,8.9298794829392944E-2,null,null,"Rudimentary wood plank floor",null,4.2765742026893604E-4,null,null,"No walls",null,1.5743119206772439E-2]
[null,null,"Shingles roof",null,2.4038988941093948E-3,null,null,"Rudimentary palm, bamboo floor",null,3.7838888559475791E-4,null,null,"Cane/palm/trunks/dirt/staw walls",null,0.15422776250668033]
[null,null,"Other type of roof",null,1.5816417576117415E-3,null,null,"Vinyl strips/asphalt floor",null,6.9206503534223701E-4,null,null,"Stone walls with mud",null,1.2328724945056369E-4]
[null,null,"Electricity for cooking",null,0.10920262489615105,null,null,"Cement floor",null,1.4007153355268099E-2,null,null,"Reused wood walls",null,1.3585114719758516E-2]
[null,null,"Natural gas for cooking",null,0.20704049077632683,null,null,"Ceramic/mosaic floor",null,0.24636378795210689,null,null,"Cement walls",null,0.13391222473920991]
[null,null,"Kerosene for cooking",null,1.1399221732697714E-4,null,null,"Carpeted floor",null,5.9656590142565746E-2,null,null,"Brick walls",null,3.2828372511604703E-4]
[null,null,"Coal/lignite for cooking",null,4.1300866851049422E-3,null,null,"Other type of flooring",null,1.5106856206608272E-4,null,null,"Cement block walls",null,5.0736906184705441E-4]
[null,null,"Charcoal for cooking",null,4.9977526884610685E-2,null,null,"No walls",null,1.9898613905156683E-3,null,null,"Other type of walls",null,3.0110244223130821E-2]
[null,null,"Wood for cooking",null,5.8340035127067008E-2,null,null,"Cane/palm/trunks/dirt/staw walls",null,0.44958130848202837,null,null,"No roof",null,2.2520963318161083E-4]
[null,null,"Straw/shrubs/grass for cooking",null,9.6172442366825265E-3,null,null,"Stone walls with mud",null,9.7851218567250137E-5,null,null,"Thatch, palm, sod roof",null,8.4885366130907483E-2]
[null,null,"Ag. crops for cooking",null,2.5183521218340513E-3,null,null,"Reused wood walls",null,7.2948040076788482E-4,null,null,"Mat roof",null,4.4880797946968393E-2]
[null,null,"Dung for cooking",null,2.9820362318152597E-3,null,null,"Cement walls",null,0.41719600813467717,null,null,"Palm/bamboo roof",null,2.1452802953586666E-3]
[null,null,"Does not cook",null,6.4860027847786219E-7,null,null,"Stone walls with lime/cement",null,1.1162767174898117E-2,null,null,"Wood planks roof",null,4.1619803073333293E-4]
[null,null,"Other fuel for cooking",null,1.8222382049142674E-5,null,null,"Brick walls",null,5.7927451734276745E-5,null,null,"Cardboard roof",null,2.5419577861860774E-5]
[null,null,null,null,null,null,null,"Cement block walls",null,2.0108969253901767E-3,null,null,"Skin roof",null,2.905900182168091E-4]
[null,null,null,null,null,null,null,"Wood planks, shingles walls",null,2.677438938013144E-4,null,null,"Metal roof",null,0.10603196668487921]
[null,null,"Total Variance Explained",null,null,null,null,"Metal sheet walls",null,2.0881337719033324E-4,null,null,"Wood roof",null,7.465578111318404E-6]
[null,null,"Component",null,"Extraction Sums of Squared Loadings",null,null,"Other type of walls",null,8.680587183242057E-3,null,null,"Concrete roof",null,8.6537230932227389E-3]
[null,null,null,null,"Total","% of Variance","Cumulative %","Thatch, palm, sod roof",null,0.20855787698295936,null,null,"Other type of roof",null,5.1168876059917009E-3]
[null,null,"1",null,8.8043731245399837,13.339959279606036,13.339959279606036,"Mat roof",null,1.2952489245863553E-2,null,null,"Natural gas for cooking",null,5.7550584676458712E-3]
[null,null,null,null,null,null,null,"Palm/bamboo roof",null,1.8633137727611944E-2,null,null,"Coal/lignite for cooking",null,1.8322752819895265E-4]
[null,null,null,null,null,null,null,"Wood planks roof",null,2.6206735749094183E-3,null,null,"Charcoal for cooking",null,1.0325475329353176E-3]
[null,null,"Component Score Coefficient Matrix",null,null,null,null,"Cardboard roof",null,6.4220354204850801E-4,null,null,"Wood for cooking",null,2.1845811393005881E-2]
[null,null,null,null,"Component",null,null,"Skin roof",null,1.0433278892071813E-3,null,null,"Straw/shrubs/grass for cooking",null,1.0892730722951049E-2]
[null,null,null,null,"1",null,null,"Metal roof",null,0.22059005703030551,null,null,"Ag. crops for cooking",null,2.9398694063115772E-3]
[null,null,"Has electricity",null,8.2437785658436999E-2,null,null,"Wood roof",null,1.3027937330196158E-2,null,null,"Dung for cooking",null,9.1361617081035318E-4]
[null,null,"Has radio",null,2.9324600392938931E-2,null,null,"Zinc/cement fiber roof",null,8.3030397675873703E-3,null,null,"Does not cook",null,1.2286396886829067E-2]
[null,null,"Has television",null,8.8050066034377802E-2,null,null,"Concrete roof",null,8.2695174421407655E-2,null,null,"Other fuel for cooking",null,1.3186273458592614E-4]
[null,null,"Has refrigerator",null,8.243920684685635E-2,null,null,"Shingles roof",null,2.164919052985873E-3,null,null,"landarea",null,1.2283158873400086E-3]
[null,null,"Has bicycle",null,3.4082040733260377E-2,null,null,"Other type of roof",null,6.5991664182280571E-4,null,null,"dairy1",null,0.18536628833323524]
[null,null,"Has motorcycle/scooter",null,4.3861177518898335E-2,null,null,"Electricity for cooking",null,0.12141385144577184,null,null,"dairy2",null,6.9961617911546439E-2]
[null,null,"Has car/truck",null,7.0239735799267358E-2,null,null,"Natural gas for cooking",null,0.2052841139599178,null,null,"dairy3",null,3.4149980763856426E-2]
[null,null,"Has telephone (land-line)",null,5.485447741532775E-2,null,null,"Kerosene for cooking",null,7.5926626149118838E-6,null,null,"dairy4",null,7.1204561111462131E-2]
[null,null,"Has mobile telephone",null,4.4660383184591153E-2,null,null,"Coal/lignite for cooking",null,2.3851297264913954E-3,null,null,"equine1",null,0.16188487508668054]
[null,null,"Has watch",null,3.2406951906970148E-2,null,null,"Charcoal for cooking",null,1.5691038773433752E-2,null,null,"equine2",null,0.11273208970617107]
[null,null,"Has animal-drawn cart",null,-1.3395291672298061E-2,null,null,"Wood for cooking",null,0.18210315112146042,null,null,"equine3",null,3.9943707652493131E-2]
[null,null,"Has bank account",null,7.6384696471353056E-2,null,null,"Straw/shrubs/grass for cooking",null,7.4042315064150946E-3,null,null,"equine4",null,2.2626772619401877E-2]
[null,null,"VCR/DVD",null,8.1999736811493251E-2,null,null,"Ag. crops for cooking",null,3.4280448012535049E-4,null,null,"goats1",null,0.14429884539270754]
[null,null,"Air conditioning",null,6.880252483349325E-2,null,null,"Dung for cooking",null,2.5554385928722992E-4,null,null,"goats2",null,6.8747689281286857E-5]
[null,null,"Oven",null,7.6303096469324205E-2,null,null,"Does not cook",null,1.7107691952023909E-3,null,null,"goats3",null,2.8873510970929619E-2]
[null,null,"Parabolic antenna",null,7.5155047249586965E-2,null,null,"Other fuel for cooking",null,1.7416115018296734E-4,null,null,"goats4",null,0.14009806565002758]
[null,null,"Computer",null,7.0692620928465344E-2,null,null,"landarea",null,1.6367506567531961E-5,null,null,"sheep1",null,0.21878342748062943]
[null,null,"Plow",null,-1.0171695317354061E-2,null,null,"dairy1",null,2.8325160768649382E-3,null,null,"sheep2",null,3.6804959561782466E-2]
[null,null,"Motor pump",null,3.6643958693032422E-3,null,null,"dairy2",null,9.4497911438121834E-3,null,null,"sheep3",null,5.8365016522032659E-2]
[null,null,"Pinasse/pirogue",null,-1.9180277805063021E-5,null,null,"dairy3",null,2.2703598215665999E-3,null,null,"sheep4",null,0.11124024044091341]
[null,null,"Cyclomotor",null,6.9342281252793405E-3,null,null,"dairy4",null,2.1905992609650253E-3,null,null,"chicks1",null,0.10685022255431241]
[null,null,"Number of members per sleeping room",null,-2.2435958700744128E-2,null,null,"equine1",null,1.6820910246049557E-2,null,null,"chicks2",null,2.6366859269361633E-2]
[null,null,"Earth, sand floor",null,-7.7984945621314181E-2,null,null,"equine2",null,2.0002798462303864E-2,null,null,"chicks3",null,5.6643645508346711E-2]
[null,null,"Rudimentary wood plank floor",null,-1.1447492398052675E-3,null,null,"equine3",null,4.5089992947710709E-4,null,null,"chicks4",null,1.6583013163434052E-2]
[null,null,"Rudimentary palm, bamboo floor",null,-1.0313879164536575E-3,null,null,"equine4",null,4.475942218439352E-4,null,null,"camels1",null,0.14228284219740706]
[null,null,"Vinyl strips/asphalt floor",null,2.5213242356866256E-2,null,null,"goats1",null,5.3724199793719889E-2,null,null,"camels2",null,8.6455909003722464E-2]
[null,null,"Cement floor",null,5.0330530907933789E-2,null,null,"goats2",null,4.304854098839872E-2,null,null,"camels3",null,1.902322312331137E-2]
[null,null,"Ceramic/mosaic floor",null,5.5657378725144785E-2,null,null,"goats3",null,9.3929235814074561E-3,null,null,"camels4",null,3.6226697658079218E-2]
[null,null,"Carpeted floor",null,2.9512518781966691E-2,null,null,"goats4",null,1.6133868291043525E-4,null,null,"ducks1",null,3.220479903204055E-2]
[null,null,"Other type of flooring",null,-1.0527663943679304E-3,null,null,"sheep1",null,9.8252847163550917E-4,null,null,"ducks2",null,2.8856475121202579E-2]
[null,null,"No walls",null,-2.5143512844312968E-3,null,null,"sheep2",null,7.1594846158610538E-3,null,null,"ducks3",null,5.8103477569566627E-3]
[null,null,"Cane/palm/trunks/dirt/staw walls",null,-8.0510344602429465E-2,null,null,"sheep3",null,4.8320151686253622E-3]
[null,null,"Stone walls with mud",null,8.290793161877892E-4,null,null,"sheep4",null,9.3681649823305424E-4]
[null,null,"Reused wood walls",null,-1.9006019532088836E-3,null,null,"chicks1",null,4.7483396476882298E-6,null,null,"Total Variance Explained"]
[null,null,"Cement walls",null,8.4037030806830768E-2,null,null,"chicks2",null,2.3033162889086992E-3,null,null,"Component",null,"Extraction Sums of Squared Loadings"]
[null,null,"Stone walls with lime/cement",null,1.5614888786467865E-2,null,null,"chicks3",null,2.7983231766324041E-3,null,null,null,null,"Total","% of Variance","Cumulative %"]
[null,null,"Brick walls",null,1.0852058575266582E-2,null,null,"chicks4",null,2.7873346321235317E-3,null,null,"1",null,4.5367252254157977,5.2752618900183696,5.2752618900183696]
[null,null,"Cement block walls",null,9.5944120380401423E-3,null,null,"camels1",null,1.6071841363105913E-3]
[null,null,"Wood planks, shingles walls",null,-1.4412806141587573E-4,null,null,"camels2",null,6.5701550098482909E-4]
[null,null,"Metal sheet walls",null,1.7801265123583026E-3,null,null,"camels3",null,1.2199796671845411E-3,null,null,"Component Score Coefficient Matrix"]
[null,null,"Other type of walls",null,6.9552467727293397E-3,null,null,"camels4",null,5.3484147551025873E-3,null,null,null,null,"Component"]
[null,null,"No roof",null,-8.9254992749787806E-4,null,null,"ducks1",null,6.7648714172867655E-3,null,null,null,null,"1"]
[null,null,"Thatch, palm, sod roof",null,-5.52280852382879E-2,null,null,"ducks2",null,3.3815984329352337E-3,null,null,"Has electricity",null,7.4871835466033348E-2]
[null,null,"Mat roof",null,-5.6207248124126282E-3,null,null,"ducks3",null,3.7954903015479284E-3,null,null,"Has radio",null,5.5350811968593552E-2]
[null,null,"Palm/bamboo roof",null,-7.4309942848493809E-3,null,null,"ducks4",null,4.3079921655908553E-3,null,null,"Has television",null,9.6193384060033416E-2]
[null,null,"Wood planks roof",null,1.1850281908660793E-2,null,null,null,null,null,null,null,"Has refrigerator",null,8.1611566790316198E-2]
[null,null,"Cardboard roof",null,-1.508682718963295E-4,null,null,null,null,null,null,null,"Has bicycle",null,4.3740870188998429E-2]
[null,null,"Skin roof",null,-2.7354708310992721E-3,null,null,"Total Variance Explained",null,null,null,null,"Has motorcycle/scooter",null,7.090473241650222E-2]
[null,null,"Metal roof",null,7.1383992767426976E-2,null,null,"Component",null,"Extraction Sums of Squared Loadings",null,null,"Has car/truck",null,6.4730817587131131E-2]
[null,null,"Wood roof",null,3.644739543209308E-3,null,null,null,null,"Total","% of Variance","Cumulative %","Has telephone (land-line)",null,3.7110312334833057E-2]
[null,null,"Zinc/cement fiber roof",null,9.2930079195591743E-3,null,null,"1",null,7.7782757791514632,8.3637373969370579,8.3637373969370579,"Has mobile telephone",null,6.1392087411446493E-2]
[null,null,"Concrete roof",null,3.394097856156636E-2,null,null,null,null,null,null,null,"Has watch",null,6.3955334315704007E-2]
[null,null,"Shingles roof",null,5.5687748503299066E-3,null,null,null,null,null,null,null,"Has animal-drawn cart",null,4.7830393881223419E-2]
[null,null,"Other type of roof",null,-4.5170575294634901E-3,null,null,"Component Score Coefficient Matrix",null,null,null,null,"Has bank account",null,5.6078543187064886E-2]
[null,null,"Electricity for cooking",null,3.753341660870578E-2,null,null,null,null,"Component",null,null,"VCR/DVD",null,8.7320480132586822E-2]
[null,null,"Natural gas for cooking",null,5.168079726703749E-2,null,null,null,null,"1",null,null,"Air conditioning",null,4.783542919402646E-2]
[null,null,"Kerosene for cooking",null,1.212660303888721E-3,null,null,"Has electricity",null,7.56669929765907E-2,null,null,"Oven",null,6.9526751299277378E-2]
[null,null,"Coal/lignite for cooking",null,7.2992988340734415E-3,null,null,"Has radio",null,3.7724419734066678E-2,null,null,"Parabolic antenna",null,7.6080484449886784E-2]
[null,null,"Charcoal for cooking",null,2.5391534130396638E-2,null,null,"Has television",null,8.28898945952527E-2,null,null,"Computer",null,6.7483350779048781E-2]
[null,null,"Wood for cooking",null,-2.7433732758242409E-2,null,null,"Has refrigerator",null,8.8596220000184453E-2,null,null,"Plow",null,3.4426545908614797E-2]
[null,null,"Straw/shrubs/grass for cooking",null,-1.1138504464629693E-2,null,null,"Has bicycle",null,3.4304509034620706E-2,null,null,"Motor pump",null,2.0714667859565869E-2]
[null,null,"Ag. crops for cooking",null,-5.6998022390315579E-3,null,null,"Has motorcycle/scooter",null,3.6627041099052404E-2,null,null,"Pinasse/pirogue",null,1.4621954920851457E-2]
[null,null,"Dung for cooking",null,-6.2023749719483873E-3,null,null,"Has car/truck",null,7.9305559061890588E-2,null,null,"Cyclomotor",null,8.0518826747948673E-3]
[null,null,"Does not cook",null,-9.1472410944762751E-5,null,null,"Has telephone (land-line)",null,6.3753375006955965E-2,null,null,"Number of members per sleeping room",null,6.8126130915004204E-3]
[null,null,"Other fuel for cooking",null,-4.8484635439419215E-4,null,null,"Has mobile telephone",null,4.4366747038711581E-2,null,null,"Earth, sand floor",null,-7.5275632617373231E-2]
[null,null,null,null,null,null,null,"Has watch",null,4.9090636230829959E-2,null,null,"Rudimentary wood plank floor",null,1.1263320687699018E-2]
[null,null,null,null,null,null,null,"Has animal-drawn cart",null,-9.4952429106779715E-3,null,null,"Rudimentary palm, bamboo floor",null,2.4308678218908676E-2]
[null,null,"Component Score Covariance Matrix",null,null,null,null,"Has bank account",null,8.4929978769955242E-2,null,null,"Vinyl strips/asphalt floor",null,2.7470295972213305E-2]
[null,null,"Component",null,"1",null,null,"VCR/DVD",null,8.1806377937134217E-2,null,null,"Cement floor",null,6.6022859021641303E-2]
[null,null,"1",null,1.0000000000000002,null,null,"Air conditioning",null,8.0811662074332893E-2,null,null,"Ceramic/mosaic floor",null,4.8053544127543354E-2]
[null,null,null,null,null,null,null,"Oven",null,8.7704881467840654E-2,null,null,"Carpeted floor",null,1.330051544861772E-2]
[null,null,null,null,null,null,null,"Parabolic antenna",null,8.2402049115593429E-2,null,null,"Other type of flooring",null,1.3045712844490413E-2]
[null,null,null,null,null,null,null,"Computer",null,8.2542656080914531E-2,null,null,"No walls",null,2.7656862828287471E-2]
[null,null,null,null,null,null,null,"Plow",null,-8.8428897413451932E-3,null,null,"Cane/palm/trunks/dirt/staw walls",null,-8.6564296266460436E-2]
[null,null,null,null,null,null,null,"Motor pump",null,9.2878383090641697E-3,null,null,"Stone walls with mud",null,2.4474656515510234E-3]
[null,null,null,null,null,null,null,"Pinasse/pirogue",null,-1.7157101312275361E-3,null,null,"Reused wood walls",null,2.5691483288205183E-2]
[null,null,null,null,null,null,null,"Cyclomotor",null,7.7273804642040405E-3,null,null,"Cement walls",null,8.0661749315256909E-2]
[null,null,null,null,null,null,null,"Number of members per sleeping room",null,-3.6722258024917249E-2,null,null,"Brick walls",null,3.9937621813555431E-3]
[null,null,null,null,null,null,null,"Earth, sand floor",null,-6.4779115068503312E-2,null,null,"Cement block walls",null,4.9650029910053677E-3]
[null,null,null,null,null,null,null,"Rudimentary wood plank floor",null,-2.6586714314490744E-3,null,null,"Other type of walls",null,3.8248522437625304E-2]
[null,null,null,null,null,null,null,"Rudimentary palm, bamboo floor",null,-2.5008396635607939E-3,null,null,"No roof",null,3.3078895900005697E-3]
[null,null,null,null,null,null,null,"Vinyl strips/asphalt floor",null,3.3821286015313645E-3,null,null,"Thatch, palm, sod roof",null,-6.4220537606709704E-2]
[null,null,null,null,null,null,null,"Cement floor",null,1.5215688361432216E-2,null,null,"Mat roof",null,4.6696873975617871E-2]
[null,null,null,null,null,null,null,"Ceramic/mosaic floor",null,6.381240302703943E-2,null,null,"Palm/bamboo roof",null,1.0209384155022849E-2]
[null,null,null,null,null,null,null,"Carpeted floor",null,3.1401173329227455E-2,null,null,"Wood planks roof",null,4.4968410231749564E-3]
[null,null,null,null,null,null,null,"Other type of flooring",null,-1.5801696302271777E-3,null,null,"Cardboard roof",null,-1.1113265520995206E-3]
[null,null,null,null,null,null,null,"No walls",null,-5.7349293977096115E-3,null,null,"Skin roof",null,3.757490314674579E-3]
[null,null,null,null,null,null,null,"Cane/palm/trunks/dirt/staw walls",null,-8.6202683657855758E-2,null,null,"Metal roof",null,7.177545134167386E-2]
[null,null,null,null,null,null,null,"Stone walls with mud",null,-1.2717442484735605E-3,null,null,"Wood roof",null,6.022672469682131E-4]
[null,null,null,null,null,null,null,"Reused wood walls",null,-3.4723498641892566E-3,null,null,"Concrete roof",null,2.0504964459259832E-2]
[null,null,null,null,null,null,null,"Cement walls",null,8.303988424960812E-2,null,null,"Other type of roof",null,1.5767413697169913E-2]
[null,null,null,null,null,null,null,"Stone walls with lime/cement",null,1.3583215668755819E-2,null,null,"Natural gas for cooking",null,1.6721775705276318E-2]
[null,null,null,null,null,null,null,"Brick walls",null,-9.7849559524539878E-4,null,null,"Coal/lignite for cooking",null,-2.9836844106164119E-3]
[null,null,null,null,null,null,null,"Cement block walls",null,5.7651626986492841E-3,null,null,"Charcoal for cooking",null,7.0829234876861663E-3]
[null,null,null,null,null,null,null,"Wood planks, shingles walls",null,-2.1036643660766272E-3,null,null,"Wood for cooking",null,3.2579289860744369E-2]
[null,null,null,null,null,null,null,"Metal sheet walls",null,-1.8577865813396038E-3,null,null,"Straw/shrubs/grass for cooking",null,-2.3005194402115316E-2]
[null,null,null,null,null,null,null,"Other type of walls",null,1.197819046787222E-2,null,null,"Ag. crops for cooking",null,-1.1951475984170857E-2]
[null,null,null,null,null,null,null,"Thatch, palm, sod roof",null,-5.8712417321699358E-2,null,null,"Dung for cooking",null,-6.6625336066544107E-3]
[null,null,null,null,null,null,null,"Mat roof",null,-1.4631649300137071E-2,null,null,"Does not cook",null,-2.4432606124590542E-2]
[null,null,null,null,null,null,null,"Palm/bamboo roof",null,-1.7549294417747469E-2,null,null,"Other fuel for cooking",null,-2.5311539620155184E-3]
[null,null,null,null,null,null,null,"Wood planks roof",null,6.581473360721294E-3,null,null,"landarea",null,-7.7252502775350691E-3]
[null,null,null,null,null,null,null,"Cardboard roof",null,-3.2580144882750138E-3,null,null,"dairy1",null,-9.4901461503963183E-2]
[null,null,null,null,null,null,null,"Skin roof",null,-4.1526666618695836E-3,null,null,"dairy2",null,5.8302536012030844E-2]
[null,null,null,null,null,null,null,"Metal roof",null,6.0382296929482798E-2,null,null,"dairy3",null,4.0733596349155916E-2]
[null,null,null,null,null,null,null,"Wood roof",null,-1.4674202007965056E-2,null,null,"dairy4",null,5.8818159494140876E-2]
[null,null,null,null,null,null,null,"Zinc/cement fiber roof",null,1.1714809264088371E-2,null,null,"equine1",null,-8.8687142259611468E-2]
[null,null,null,null,null,null,null,"Concrete roof",null,3.6970621104603585E-2,null,null,"equine2",null,7.4008448956546402E-2]
[null,null,null,null,null,null,null,"Shingles roof",null,5.9818772134664399E-3,null,null,"equine3",null,4.4053631122237792E-2]
[null,null,null,null,null,null,null,"Other type of roof",null,3.3026397467974715E-3,null,null,"equine4",null,3.3156511439810084E-2]
[null,null,null,null,null,null,null,"Electricity for cooking",null,4.479719083711324E-2,null,null,"goats1",null,-8.3731515496435094E-2]
[null,null,null,null,null,null,null,"Natural gas for cooking",null,5.8249786009075669E-2,null,null,"goats2",null,1.827622838316486E-3]
[null,null,null,null,null,null,null,"Kerosene for cooking",null,3.5425314461029494E-4,null,null,"goats3",null,3.7454786170097468E-2]
[null,null,null,null,null,null,null,"Coal/lignite for cooking",null,6.2787424011944443E-3,null,null,"goats4",null,8.2503731849846162E-2]
[null,null,null,null,null,null,null,"Charcoal for cooking",null,1.610432441931528E-2,null,null,"sheep1",null,-0.10310144084574335]
[null,null,null,null,null,null,null,"Wood for cooking",null,-5.4862474682627387E-2,null,null,"sheep2",null,4.2287371995491853E-2]
[null,null,null,null,null,null,null,"Straw/shrubs/grass for cooking",null,-1.106258594192497E-2,null,null,"sheep3",null,5.325174333781512E-2]
[null,null,null,null,null,null,null,"Ag. crops for cooking",null,-2.3803450032175918E-3,null,null,"sheep4",null,7.3517119621036894E-2]
[null,null,null,null,null,null,null,"Dung for cooking",null,-2.0551777413562724E-3,null,null,"chicks1",null,-7.2051867096795008E-2]
[null,null,null,null,null,null,null,"Does not cook",null,-5.3175596922121543E-3,null,null,"chicks2",null,3.5792062434925567E-2]
[null,null,null,null,null,null,null,"Other fuel for cooking",null,-1.6966501704531282E-3,null,null,"chicks3",null,5.2460584109247616E-2]
[null,null,null,null,null,null,null,"landarea",null,-5.2012523486839066E-4,null,null,"chicks4",null,2.838502273888167E-2]
[null,null,null,null,null,null,null,"dairy1",null,6.842311704020821E-3,null,null,"camels1",null,-8.3144550489593572E-2]
[null,null,null,null,null,null,null,"dairy2",null,-1.2497633021758504E-2,null,null,"camels2",null,6.4811916589779195E-2]
[null,null,null,null,null,null,null,"dairy3",null,6.1258168658850573E-3,null,null,"camels3",null,3.0401819388417701E-2]
[null,null,null,null,null,null,null,"dairy4",null,6.0172510501930992E-3,null,null,"camels4",null,4.1953857331906173E-2]
[null,null,null,null,null,null,null,"equine1",null,1.6674061911932273E-2,null,null,"ducks1",null,-3.9556496594877498E-2]
[null,null,null,null,null,null,null,"equine2",null,-1.8182853625308266E-2,null,null,"ducks2",null,3.744373506765717E-2]
[null,null,null,null,null,null,null,"equine3",null,2.7299629102067275E-3,null,null,"ducks3",null,1.6801907400092249E-2]
[null,null,null,null,null,null,null,"equine4",null,2.7199373369809067E-3]
[null,null,null,null,null,null,null,"goats1",null,2.9798996607203736E-2]
[null,null,null,null,null,null,null,"goats2",null,-2.6674475054355558E-2,null,null,"Component Score Covariance Matrix"]
[null,null,null,null,null,null,null,"goats3",null,-1.2459971745262187E-2,null,null,"Component",null,"1"]
[null,null,null,null,null,null,null,"goats4",null,-1.6329989918147099E-3,null,null,"1",null,1.0000000000000004]
[null,null,null,null,null,null,null,"sheep1",null,4.0298532851756408E-3]
[null,null,null,null,null,null,null,"sheep2",null,-1.0878212620825486E-2]
[null,null,null,null,null,null,null,"sheep3",null,8.9367746617061775E-3]
[null,null,null,null,null,null,null,"sheep4",null,3.9349926746734569E-3]
[null,null,null,null,null,null,null,"chicks1",null,2.8014801601332459E-4]
[null,null,null,null,null,null,null,"chicks2",null,-6.1701177540738747E-3]
[null,null,null,null,null,null,null,"chicks3",null,6.8008876078524292E-3]
[null,null,null,null,null,null,null,"chicks4",null,6.7875215023822976E-3]
[null,null,null,null,null,null,null,"camels1",null,-5.1540601366550486E-3]
[null,null,null,null,null,null,null,"camels2",null,-3.2953721798320164E-3]
[null,null,null,null,null,null,null,"camels3",null,4.4904819937275318E-3]
[null,null,null,null,null,null,null,"camels4",null,9.402193873580527E-3]
[null,null,null,null,null,null,null,"ducks1",null,-1.0574173599657205E-2]
[null,null,null,null,null,null,null,"ducks2",null,7.4761443772845132E-3]
[null,null,null,null,null,null,null,"ducks3",null,7.920463665134032E-3]
[null,null,null,null,null,null,null,"ducks4",null,8.4382835615405289E-3]
[]
[]
[null,null,null,null,null,null,null,null,"Component Score Covariance Matrix"]
[null,null,null,null,null,null,null,null,"Component","1"]
[null,null,null,null,null,null,null,null,"1",1.0000000000000004]
[]
[]
[]
[]
[]
[]
[]
[]
[]
[]
[]
[]
[]
[]
[]
[]
[]
[]
[]
[]
[]
[]
[]
[]
[]
[]
[]
[]
[]
[]
[]
[]
[]
[]
[]
[]
[]
[]
[]
[]
[]
[]
[]
[]
[]
[]
[]
[]
[]
[]
[]
[]
[]
[]
[]
[]
[]
[]
[]
[]
[]
[]
[]
[]
[]
[]
[]
[]
[]
[]
[]
[]
[]
[]
[]
[]
[]
[]
[]
[]
[]
[]
[]
[]
[]
[]
[]
[]
[]
[]
[]
[]
[]
[]
[]
[]
[]
[]
[]
[]
[]
[]
[]
[]
[]
[]
[]
[]
[]
[]
[]
[]
[]
[]
[]
[]
[]
[]
[]
[]
[]
[]
[]
[]
[]
[]
[]
[]
[]
[]
[]
[]
[]
[]
[]
[]
[]
[]
[]
[]
[]
[]
[]
[]
[]
[]
[]
[]
[]
[]
[]
[]
[]
[]
[]
[]
[]
[]
[]
[]
[]
[]
[]
[]
[]
[]
[]
[]
[]
[]
[]
[]
[]
[]
[]
[]
[]
[]
[]
[]
[]
[]
[]
[]
[]
[]
[]
[]
[]
[]
[]
[]
[]
[]
[]
[]
[]
[]
[]
[]
[]
[]
[]
[]
[]
[]
[]
[]
[]
[]
[]
[]
[]
[]
[]
[]
[]
[]
[]
[]
[]
[]
[]
[]
[]
[]
[]
[]
[]
[]
[]
[]
[]
[]
[]
[]
[]
[]
[]
[]
[]
[]
[]
[]
[]
[]
[]
[]
[]
[]
[]
[]
[]
[]
[]
[]
[]
[]
[]
[]
[]
[]
[]
[]
[]
[]
[]
[]
[]
[]
[]
[]
[]
[]
[]
[]
[]
[]
[]
[]
[]
[]
[]
[]
[]
[]
[]
[]
[]
[]
[]
[]
[]
[]
[]
[]
[]
[]
[]
[]
[]
[]
[]
[]
[]
[]
[]
[]
[]
[]
[]
[]
[]
[]
[]
[]
[]
[]
[]
[]
[]
[]
["DHS12"]
["Niger",null,"Count"]
["W_text_t","",10750]
["W_text_i","",10750]
["S_text_s","",10750]
["S_text_i","",10750]
["Urban/Rural","Urban",2977]
[null,"Rural",7773]
[null,"Missing",0]
["2012"]
[]
["Sub-national region names","Weighted population"]
[{"$f":"R15","v":"Agadez"},{"$f":"BR122+BR123","v":1234.0530949999993}]
[{"$f":"S15","v":"Diffa"},{"$f":"BS122+BS123","v":1887.9833900000026}]
[{"$f":"T15","v":"Dosso"},{"$f":"BT122+BT123","v":7735.9703829999871}]
[{"$f":"U15","v":"Maradi"},{"$f":"BU122+BU123","v":14272.627580999953}]
[{"$f":"V15","v":"Niamey"},{"$f":"BV122+BV123","v":4254.0056500000101}]
[{"$f":"W15","v":"Tahoua"},{"$f":"BW122+BW123","v":13890.464780999973}]
[{"$f":"X15","v":"Tillaberi"},{"$f":"BX122+XR123","v":557.539851}]
[{"$f":"Y15","v":"Zinder"},{"$f":"BY122+BY123","v":13081.941694000016}]
[{"$f":"Z15","v":0},{"$f":"BZ122+BZ123","v":0}]
[{"$f":"AA15","v":0},{"$f":"CA122+CA123","v":0}]
[{"$f":"AB15","v":0},{"$f":"CB122+CB123","v":0}]
[{"$f":"AC15","v":0},{"$f":"CC122+CC123","v":0}]
[{"$f":"AD15","v":0},{"$f":"CD122+CD123","v":0}]
[{"$f":"AE15","v":0},{"$f":"CE122+CE123","v":0}]
[{"$f":"AF15","v":0},{"$f":"CF122+CF123","v":0}]
[{"$f":"AG15","v":0},{"$f":"CG122+CG123","v":0}]
[{"$f":"AH15","v":0},{"$f":"CH122+CH123","v":0}]
[{"$f":"AI15","v":0},{"$f":"CI122+CI123","v":0}]
[{"$f":"AJ15","v":0},{"$f":"CJ122+CJ123","v":0}]
[{"$f":"AK15","v":0},{"$f":"CK122+CK123","v":0}]
[{"$f":"AL15","v":0},{"$f":"CL122+CL123","v":0}]
[{"$f":"AM15","v":0},{"$f":"CM122+CM123","v":0}]
[{"$f":"AN15","v":0},{"$f":"CN122+CN123","v":0}]
[{"$f":"AO15","v":0},{"$f":"CO122+CO123","v":0}]
[{"$f":"AP15","v":0},{"$f":"CP122+CP123","v":0}]
[{"$f":"AQ15","v":0},{"$f":"CQ122+CQ123","v":0}]
[{"$f":"AR15","v":0},{"$f":"CR122+CR123","v":0}]
[{"$f":"AS15","v":0},{"$f":"CS122+CS123","v":0}]
[{"$f":"AT15","v":0},{"$f":"CT122+CT123","v":0}]
[{"$f":"AU15","v":0},{"$f":"CU122+CU123","v":0}]
[{"$f":"AV15","v":0},{"$f":"CV122+CV123","v":0}]
[{"$f":"AW15","v":0},{"$f":"CW122+CW123","v":0}]
[{"$f":"AX15","v":0},{"$f":"CX122+CX123","v":0}]
[{"$f":"AY15","v":0},{"$f":"CY122+CY123","v":0}]
[]
[{"$f":"34-COUNTIF(A1037:A1071,\"0\")","v":8},"Sub-regions"]

{"sheet":"data_summary","index":6,"n_rows":106,"n_cols":61,"rows_kept":106,"cut":false,"hidden":false,"merged":[]}
["iso3","year","data_source","row","var1","var2","varname","total_q1","total_q2","total_q3","total_q4","total_q5","urban_q1","urban_q2","urban_q3","urban_q4","urban_q5","rural_q1","rural_q2","rural_q3","rural_q4","rural_q5","region_1_name","region_2_name","region_3_name","region_4_name","region_5_name","region_6_name","region_7_name","region_8_name","region_1","region_2","region_3","region_4","region_5","region_6","region_7","region_8","n_total_q1","n_total_q2","n_total_q3","n_total_q4","n_total_q5","n_urban_q1","n_urban_q2","n_urban_q3","n_urban_q4","n_urban_q5","n_rural_q1","n_rural_q2","n_rural_q3","n_rural_q4","n_rural_q5","n_region_1","n_region_2","n_region_3","n_region_4","n_region_5","n_region_6","n_region_7","n_region_8"]
["NER",2006,"NER_2006_DHS",16,"Water","Improved","w_imp",46.885750733193248,42.996809677016223,45.80088898173166,44.703968106164368,82.563039991797908,84.364623734454597,91.078429625841721,97.463366687447987,95.843336924097372,97.250970283768112,42.832148439971682,42.592498041787863,45.484018260439591,42.420777263899012,44.742808583908356,"Agadez","Diffa","Dosso","Maradi","Niamey","Tahoua","Tillabéri","Zinder",68.601653374755358,66.119835365207024,31.83001581794219,58.376775224109807,94.184189477835503,46.824787723816698,59.835527041219237,46.061361206785051]
["NER",2006,"NER_2006_DHS",17,"Water","Not Improved","",53.114249266806752,57.003190322983777,54.19911101826834,55.296031893835632,17.436960008202089,15.6353762655454,8.9215703741582786,2.5366333125520129,4.1566630759026282,2.7490297162318882,57.167851560028318,57.407501958212137,54.515981739560409,57.579222736100988,55.257191416091644,"Agadez","Diffa","Dosso","Maradi","Niamey","Tahoua","Tillabéri","Zinder",31.398346625244638,33.880164634792983,68.169984182057803,41.623224775890193,5.8158105221644973,53.175212276183302,40.164472958780763,53.938638793214949]
["NER",2006,"NER_2006_DHS",18,"Water ladder","Basic","w_bas",31.2727957390399,27.646948622321421,29.770577838125579,31.337481642421221,70.013457913044618,67.322969740094763,76.505880885707043,88.594200318890231,89.32599001325876,94.819696026673896,28.183553673501361,26.53512628003384,29.882999997108811,27.912871439645549,30.380367028473781,"Agadez","Diffa","Dosso","Maradi","Niamey","Tahoua","Tillabéri","Zinder",62.701911184526402,59.573971664051527,25.750482796715239,30.822937318329981,91.170295414544768,35.961436971891231,46.432368983986123,28.972596199067802]
["NER",2006,"NER_2006_DHS",19,"Water ladder","Limited","w_lim",15.61295499415335,15.34986105469479,16.030311143606081,13.366486463743151,12.54958207875328,17.04165399435983,14.572548740134669,8.8691663685577673,6.5173469108386213,2.431274257094203,14.64859476647031,16.05737176175403,15.601018263330779,14.507905824253459,14.362441555434589,"Agadez","Diffa","Dosso","Maradi","Niamey","Tahoua","Tillabéri","Zinder",5.8997421902289604,6.5458637011554961,6.0795330212269594,27.553837905779829,3.0138940632907358,10.863350751925481,13.40315805723311,17.088765007717249]
["NER",2006,"NER_2006_DHS",20,"Water ladder","Unimproved","w_unimp",51.826186319864739,55.727335301417448,52.680958792229397,52.619661174992778,17.130347646381669,15.59509712404952,8.8613553410122705,2.5366333125519991,4.156663075902614,2.749029716231902,55.745610062662777,56.423230096716999,52.903243535154211,55.465000165247062,52.828729178588773,"Agadez","Diffa","Dosso","Maradi","Niamey","Tahoua","Tillabéri","Zinder",31.025618824228228,33.880164634792983,68.169984182057803,41.537087645307153,5.8158105221644973,53.175212276183302,30.38485133400674,53.938638793214949]
["NER",2006,"NER_2006_DHS",21,"Water ladder","Surface water","w_sur",1.2880629469420131,1.275855021566332,1.518152226038938,2.6763707188428509,0.306612361820435,0.040279141495893601,0.060215033146006403,0,0,0,1.4222414973655431,0.98427186149513979,1.6127382044061991,2.1142225708539231,2.4284622375028642,"Agadez","Diffa","Dosso","Maradi","Niamey","Tahoua","Tillabéri","Zinder",0.37272780101641068,0,0,0.086137130583030699,0,0,9.779621624774034,0]
["NER",2006,"NER_2006_DHS",29,"Piped water","Yes","w_pip",13.048490524198289,6.4516448820350876,9.5867828851265706,14.23411657944126,71.570708892481491,78.369931642383676,88.53099166505072,94.58823277219588,95.843336924097414,96.721316525121964,5.9142642381426089,5.1719177344877183,9.0810736517871771,7.7638931534301143,12.681242529531071,"Agadez","Diffa","Dosso","Maradi","Niamey","Tahoua","Tillabéri","Zinder",52.354140129033368,25.68463177262441,13.58912694840239,15.26788356302583,91.255074946127351,20.31584572672767,6.0301216864346756,22.75560503795705]
["NER",2006,"NER_2006_DHS",30,"Piped water","No","",86.9515094758017,93.54835511796496,90.413217114873419,85.765883420558836,28.42929110751858,21.630068357616299,11.46900833494929,5.4117672278041091,4.1566630759026086,3.2786834748780178,94.085735761857393,94.828082265512279,90.918926348212864,92.236106846569882,87.318757470468995,"Agadez","Diffa","Dosso","Maradi","Niamey","Tahoua","Tillabéri","Zinder",47.645859870966689,74.315368227375643,86.410873051597562,84.732116436974238,8.7449250538726897,79.684154273272284,93.969878313565374,77.24439496204289]
["NER",2006,"NER_2006_DHS",31,"Piped water on premises","Yes","w_pop",0.55978308901721974,0.1655621507798104,0.35277393838905402,0.90008893349004282,34.582001436003033,8.764506751329991,19.968825845179332,33.519631382068468,56.347722705291659,82.09102213528098,0,0.047758796956693002,0,0.0258954857354666,0.50176700641757477,"Agadez","Diffa","Dosso","Maradi","Niamey","Tahoua","Tillabéri","Zinder",27.828756602366731,7.5600615675553557,3.3248262787100962,4.5598353616421026,43.578764492364577,3.7723972240790502,2.5429023035644618,3.7135382224895288]
["NER",2006,"NER_2006_DHS",32,"Piped water on premises","No","",99.440216910982784,99.834437849220151,99.647226061610979,99.099911066509961,65.417998563997031,91.235493248669968,80.03117415482069,66.480368617931518,43.652277294708327,17.90897786471908,100,99.952241203043314,100,99.974104514264525,99.49823299358242,"Agadez","Diffa","Dosso","Maradi","Niamey","Tahoua","Tillabéri","Zinder",72.171243397633276,92.439938432444592,96.675173721289866,95.440164638357956,56.421235507635338,96.227602775920758,97.45709769643554,96.286461777510439]
["NER",2006,"NER_2006_DHS",35,"Water source on premises","Yes","",5.9414624177548188,5.4992760305194546,4.8678614555112221,10.723568102172621,46.516880155158532,23.444907687099558,32.248416378859197,43.037638706909433,65.473934413062381,87.302297244147468,4.3978204014911064,4.0983933186814534,5.2899268914198316,6.1661063739504813,14.564478681206831,"Agadez","Diffa","Dosso","Maradi","Niamey","Tahoua","Tillabéri","Zinder",33.178251348195062,10.22973840320547,8.4877265767754508,11.946260904396009,54.910658603566752,7.3155200593325613,17.87097458580174,10.137712066444511]
["NER",2006,"NER_2006_DHS",36,"Water source on premises","No","",94.058537582245123,94.500723969480504,95.132138544488811,89.27643189782745,53.48311984484149,76.555092312900371,67.751583621140782,56.962361293090538,34.526065586937612,12.697702755852569,95.602179598508883,95.901606681318512,94.710073108580133,93.833893626049488,85.43552131879315,"Agadez","Diffa","Dosso","Maradi","Niamey","Tahoua","Tillabéri","Zinder",66.821748651804967,89.770261596794526,91.512273423224485,88.053739095603987,45.08934139643317,92.684479940667302,82.129025414198381,89.862287933555535]
["NER",2006,"NER_2006_DHS",41,"Water point at more than 30 minutes","Yes","",35.311763009291766,33.802477498998179,32.915954191688428,25.946307976186109,5.5145258501939898,9.8102808506811368,3.0223994662365272,1.325260519924407,0.6956309176216765,0.2372622854243259,38.14443655178016,33.345552494391399,37.175603074345283,28.943029109827339,21.365995145392219,"Agadez","Diffa","Dosso","Maradi","Niamey","Tahoua","Tillabéri","Zinder",22.195915036217691,14.98409667732424,22.431966886851949,22.764701358418609,0.5594828470960268,34.529928871946453,35.212719240000688,31.810175653493719]
["NER",2006,"NER_2006_DHS",42,"Water point at more than 30 minutes","No","w_30min",64.688236990708248,66.197522501001657,67.084045808311487,74.053692023813923,94.485474149806009,90.189719149318819,96.977600533763479,98.674739480075573,99.304369082378315,99.762737714575692,61.855563448219833,66.654447505608402,62.824396925654654,71.056970890172508,78.634004854607724,"Agadez","Diffa","Dosso","Maradi","Niamey","Tahoua","Tillabéri","Zinder",77.804084963782358,85.015903322675797,77.568033113147905,77.235298641581366,99.440517152903979,65.470071128053348,64.787280759999163,68.189824346506185]
["NER",2006,"NER_2006_DHS",58,"Source of drinking water","Piped into dwelling","",0.10986805542728879,0.046525660533625099,0.31189635069144522,0.7579852136701507,25.84944231806719,4.8474068825807493,13.970559932058899,22.51894965281479,39.819187486434771,67.316422640637768,0,0.047758796956693002,0,0,0.41818554217059112,"Agadez","Diffa","Dosso","Maradi","Niamey","Tahoua","Tillabéri","Zinder",24.820956009886409,3.65717988161007,1.646804383558425,3.762302917219595,31.593168562040059,2.1247160796123059,2.3289821763550518,3.2159190109205702]
["NER",2006,"NER_2006_DHS",59,"Source of drinking water","Piped into yard/plot","",0.44991503358993101,0.1190364902461853,0.040877587697608797,0.1434602350332751,8.7325591179358586,3.92986267463924,6.0348550486653201,11.00068172925365,16.528535218856899,14.77459949464318,0,0,0,0.025924299908829499,0.083581464246983594,"Agadez","Diffa","Dosso","Maradi","Niamey","Tahoua","Tillabéri","Zinder",3.0651578942192401,3.9028816859452822,1.682440974151985,0.79753244442250648,12.02488774464755,1.647681144466743,0.21392012720940839,0.49761921156895961]
["NER",2006,"NER_2006_DHS",60,"Source of drinking water","Public tap","",12.48870743518108,6.2860827312552772,9.2340089467375162,13.354123228381351,36.988707456478537,69.706783764060503,68.687793155093047,61.068601390127426,39.495614218805713,14.63029438984106,5.9142642381426089,5.1241589375310248,9.0810736517871771,7.7466078172997364,12.17947552311349,"Agadez","Diffa","Dosso","Maradi","Niamey","Tahoua","Tillabéri","Zinder",24.575932311267469,18.124570205069041,10.27794311345929,10.708048201383731,47.71929672838008,16.543448502648619,3.4872193828702152,19.042066815467528]
["NER",2006,"NER_2006_DHS",61,"Source of drinking water","Protected well","",18.576848457367142,21.86599521429325,18.97212749568169,25.864320926994019,8.0707045072030503,4.9391710247422074,2.8987844787399641,1.9007683597506699,1.7491027497892691,0.75457461642142087,20.15381945342342,21.54137681567742,21.07639573754161,21.947304536054801,26.472891053255999,"Agadez","Diffa","Dosso","Maradi","Niamey","Tahoua","Tillabéri","Zinder",17.556609142214089,30.347346394677469,20.633394219090249,24.235053032263199,2.8261673491725299,14.60568446576556,18.557752975506279,19.856371282029102]
["NER",2006,"NER_2006_DHS",62,"Source of drinking water","Open well","",66.684651256147149,70.31215172295407,69.922937393152736,56.741398203367467,19.061359437380911,15.06262178010701,7.1563369848669751,2.4664273757514912,1.009794093278406,0.74870935736588418,72.32052979392239,72.269324057682141,68.144574200764424,68.091232414483528,57.945526532249907,"Agadez","Diffa","Dosso","Maradi","Niamey","Tahoua","Tillabéri","Zinder",27.84198838398747,43.850093374275282,65.609548587616146,60.023356701386128,4.5313023523925233,65.009763131248945,65.444928307100128,56.859291072400573]
["NER",2006,"NER_2006_DHS",63,"Source of drinking water","Spring","",0.067311848946633099,0.094353159151076796,0,0.1859811511056583,0,0.37860995781606233,0,0,0,0,0,0.033109530657452001,0.085218205500536201,0.074708361399076106,0.1515747553882012,"Agadez","Diffa","Dosso","Maradi","Niamey","Tahoua","Tillabéri","Zinder",0.53588087549877428,0,0,0,0,0,0.1217511444946371,0.18833065779838001]
["NER",2006,"NER_2006_DHS",64,"Source of drinking water","Surface water","",1.2880629469420131,1.275855021566332,1.518152226038938,2.6763707188428509,0.306612361820435,0.040279141495893601,0.060215033146006403,0,0,0,1.4222414973655431,0.98427186149513979,1.6127382044061991,2.1142225708539231,2.4284622375028642,"Agadez","Diffa","Dosso","Maradi","Niamey","Tahoua","Tillabéri","Zinder",0.37272780101641068,0,0,0.086137130583030699,0,0,9.779621624774034,0]
["NER",2006,"NER_2006_DHS",65,"Source of drinking water","Bottled water","",0,0,0,0,0.0521479901587431,0,0,0,0,0.28998394921761328,0,0,0,0,0,"Agadez","Diffa","Dosso","Maradi","Niamey","Tahoua","Tillabéri","Zinder",0,0,0,0,0.14251603956363579,0,0,0]
["NER",2006,"NER_2006_DHS",66,"Source of drinking water","Other","",0.33463496639881679,0,0,0.27636032260512622,0.93846681095546192,1.095264774558306,1.191455367429783,1.044571492301948,1.397766232834933,1.4854155518730989,0.18914501714602031,0,0,0,0.32030289207185991,"Agadez","Diffa","Dosso","Maradi","Niamey","Tahoua","Tillabéri","Zinder",1.2307475819102021,0.1179284584228614,0.14986872212388261,0.38756957274176501,1.162661223803565,0.068706676257709404,0.065824261690107203,0.34040194981476729]
["NER",2006,"NER_2006_DHS",122,"Sanitation","Improved","s_imp",2.9590938478419728,1.2505866346507779,2.865797551106966,7.8573028765168296,67.171429003661615,34.143139394483427,63.94607840210022,79.732597831484256,90.814584794955351,96.413951226159043,1.1259938841923911,0.93705582968021839,2.315558624065198,2.5461568559933339,14.928891090789159,"Agadez","Diffa","Dosso","Maradi","Niamey","Tahoua","Tillabéri","Zinder",39.936856550896501,12.368480400331761,10.444855960988569,15.081562487258861,79.661124011771378,6.5276823252484286,2.7821507542499151,10.324823342701841]
["NER",2006,"NER_2006_DHS",123,"Sanitation","Not Improved","",97.04090615215803,98.749413365349227,97.134202448893035,92.142697123483174,32.828570996338392,65.856860605516573,36.05392159789978,20.267402168515741,9.1854152050446487,3.586048773840957,98.874006115807603,99.062944170319781,97.684441375934796,97.453843144006669,85.071108909210835,"Agadez","Diffa","Dosso","Maradi","Niamey","Tahoua","Tillabéri","Zinder",60.063143449103499,87.631519599668238,89.555144039011424,84.918437512741136,20.338875988228619,93.472317674751565,97.217849245750088,89.675176657298167]
["NER",2006,"NER_2006_DHS",124,"Sanitation ladder","Basic","s_bas",1.5519134489014841,0.62276054581965556,1.298943421406016,4.7375229256330407,37.392330586624318,14.657072709339371,29.87303242958253,35.263992219727427,43.968770867959662,67.022562412705369,0.59910904761148986,0.48661824523275171,1.0469131803044049,1.5486269619283191,10.22537248271906,"Agadez","Diffa","Dosso","Maradi","Niamey","Tahoua","Tillabéri","Zinder",25.462724055774149,11.81377417978266,5.1666932134078527,7.6352343021162712,32.141175161414743,4.1572986067280251,1.2752393388302019,7.543602882259294]
["NER",2006,"NER_2006_DHS",125,"Sanitation ladder","Limited","s_lim",1.4071803989404901,0.62782608883112234,1.566854129700948,3.1197799508837929,29.779098417037339,19.48606668514407,34.073045972517697,44.46860561175685,46.845813926995653,29.391388813453531,0.52688483658090102,0.45043758444746701,1.268645443760793,0.9975298940650158,4.7035186080701052,"Agadez","Diffa","Dosso","Maradi","Niamey","Tahoua","Tillabéri","Zinder",14.474132495122291,0.55470622054910512,5.2781627475807298,7.4463281851425833,47.519948850356478,2.3703837185204031,1.506911415419713,2.781220460442547]
["NER",2006,"NER_2006_DHS",126,"Sanitation ladder","Unimproved","s_unimp",4.134596589952622,2.1385947197956909,2.3765937952270799,4.3015843707334938,7.8381321091763141,10.647643371686661,8.3753407281894283,11.51450817185972,7.0077836583913182,3.3523652265275961,1.8414311858378909,1.841059676009323,2.8489867552594599,2.4773354664571912,5.6378604244212767,"Agadez","Diffa","Dosso","Maradi","Niamey","Tahoua","Tillabéri","Zinder",2.7450198298299568,9.2817930386901821,2.58452152065172,5.3175881123375044,9.0873861953607076,5.7068827859577604,4.2680602216078114,5.306887439422411]
["NER",2006,"NER_2006_DHS",127,"Sanitation ladder","Open defecation","s_od",92.906309562205408,96.610818645553536,94.757608653665955,87.841112752749666,24.990438887162028,55.209217233829897,27.678580869710341,8.752893996656006,2.17763154665337,0.2336835473134973,97.032574929969712,97.221884494310459,94.835454620675335,94.976507677549478,79.433248484789559,"Agadez","Diffa","Dosso","Maradi","Niamey","Tahoua","Tillabéri","Zinder",57.318123619273599,78.349726560978056,86.970622518359704,79.600849400403646,11.251489792868069,87.765434888793806,92.949789024142277,84.368289217875741]
["NER",2006,"NER_2006_DHS",139,"Sanitation ladder","Open defecation","",92.751006947929582,96.610818645553536,94.757608653665955,87.841112752749666,24.98377835298027,55.209217233829897,27.637684704912829,8.752893996656006,2.17763154665337,0.2336835473134973,96.852477047143637,97.221884494310459,94.835454620675335,94.976507677549478,79.433248484789559,"Agadez","Diffa","Dosso","Maradi","Niamey","Tahoua","Tillabéri","Zinder",57.318123619273599,78.349726560978056,86.757064880230317,79.600849400403646,11.243301752345291,87.765434888793806,92.949789024142277,84.368289217875741]
["NER",2006,"NER_2006_DHS",151,"Shared among all sanitation facilities","Yes","",39.522717602429253,36.737682712512438,22.114397545611659,35.095861203179489,39.086650400232507,42.705027138071742,57.215703351671692,49.984929772004371,46.741598293443047,23.994185605343041,27.963911334002979,20.375205702502939,31.028981864983852,27.566627442448318,21.314413973524541,"Agadez","Diffa","Dosso","Maradi","Niamey","Tahoua","Tillabéri","Zinder",27.563580375310611,13.24855991226268,43.790234094730913,29.026284163345771,55.815837962320238,35.999683917459393,39.007778408380553,17.292065986293231]
["NER",2006,"NER_2006_DHS",152,"Shared among all sanitation facilities","No","",56.490725286730367,63.262317287487548,75.601265079578525,64.548314194484846,59.625974727728291,55.767352043053897,42.036463751660087,48.706877638246823,52.099874008978723,75.630403998690326,66.139210631937289,79.624794297497061,66.033472364503879,72.433372557551692,76.162255146643886,"Agadez","Diffa","Dosso","Maradi","Niamey","Tahoua","Tillabéri","Zinder",71.419866227324704,86.751440087737322,53.890543695229788,69.017843400970818,44.184162037679627,62.560656955047122,59.582318433014748,79.48313009522488]
["NER",2006,"NER_2006_DHS",153,"Type of toilet facility","Flush toilet","",0.028299006525350799,0.0248574922403943,0.1087255403671057,0.197208597526983,6.0107286214653399,1.2923307338359991,1.388043451264755,2.517750395594653,3.2059663179616829,26.04498962791439,0,0,0,0,0.2116473993189644,"Agadez","Diffa","Dosso","Maradi","Niamey","Tahoua","Tillabéri","Zinder",12.366547974554701,0.1903169097092571,0.0088023459634356,0.1421500249970262,10.661564543547181,0.32715793184749292,0.11198607749201669,0.32600411071784718,2.6840519999999999,2.3006160000000002,10.312742,18.543236,565.61681300000021,21.860064000000001,23.532511,42.677528000000002,54.195967999999993,440.8580330000002,0,0,0,0,16.333355000000001,147.88095799999999,2.4102960000000002,0.56789500000000004,13.576311,367.26619600000009,28.997703999999999,7.4650679999999996,31.293030999999999]
["NER",2006,"NER_2006_DHS",154,"Type of toilet facility","Traditional pit toilet","",4.4379328040169526,1.7538351579676801,3.1673911879675241,7.6476166536771251,39.279853691711708,27.550309099895031,43.721291089187972,51.75233920288138,46.941896454469727,31.283941398410231,1.933094434308755,1.5047644420141739,3.3728380580250961,2.7112357890591161,14.999432998665171,"Agadez","Diffa","Dosso","Maradi","Niamey","Tahoua","Tillabéri","Zinder",18.975662888253041,19.600251344757851,7.6817187013074024,10.907537851890369,43.965259831293793,5.1382974839074329,4.9161348390531154,10.30230535011485,420.92086899999998,162.32133099999999,300.43068099999999,719.09420899999986,3696.2816090000019,466.01965300000012,741.23887300000035,877.23624599999971,793.53968999999984,529.53666199999998,165.09543500000001,106.90269000000001,252.52885599999999,209.407129,1157.543465,226.91370400000011,248.23021499999999,495.596249,1041.7453399999999,1514.5013350000011,455.43395100000021,327.71288800000002,988.91501700000003]
["NER",2006,"NER_2006_DHS",155,"Type of toilet facility","Ventilated improved pit latrine","",2.6274586272523059,1.610488704238304,1.966274617999455,4.314061996046278,29.71897879966107,15.94814293243901,27.212084589836991,36.977016404867967,47.674505680915203,42.437385426361793,1.0343306357214721,1.27335106367533,1.791707321299542,2.3122565333913871,5.3556711172262448,"Agadez","Diffa","Dosso","Maradi","Niamey","Tahoua","Tillabéri","Zinder",11.3396655179187,1.8597051845548529,5.3388564343694194,9.3494627227090028,34.1216858322909,6.769109695451152,2.0220900593126432,5.0034013212914852,249.204352,149.05429899999999,186.503399,405.64494000000008,2796.5917500000041,269.766412,461.34627800000021,626.78479000000016,805.9242449999997,718.32865099999981,88.336742999999998,90.462434000000002,134.147502,178.59125499999999,413.31043000000011,135.60135,23.552504999999989,344.44338899999991,892.93838399999993,1175.413018,599.98129400000005,134.79389699999999,480.27490300000022]
["NER",2006,"NER_2006_DHS",156,"Type of toilet facility","No facility, bush, field","",92.906309562205408,96.610818645553536,94.757608653665955,87.841112752749666,24.990438887162028,55.209217233829897,27.678580869710341,8.752893996656006,2.17763154665337,0.2336835473134973,97.032574929969712,97.221884494310459,94.835454620675335,94.976507677549478,79.433248484789559,"Agadez","Diffa","Dosso","Maradi","Niamey","Tahoua","Tillabéri","Zinder",57.318123619273599,78.349726560978056,86.970622518359704,79.600849400403646,11.251489792868069,87.765434888793806,92.949789024142277,84.368289217875741,8811.8063710000042,8941.5453900000193,8987.8676830000259,8259.5713610000112,2351.6304409999998,933.87628299999983,469.25512900000018,148.36732000000009,36.812254999999993,3.9555120000000001,8287.0422070000004,6906.9155870000131,7100.4561890000059,7335.6798680000138,6130.0608959999981,685.41836000000001,992.27143199999966,5611.0248199999996,7602.4319190000242,387.58775400000002,7779.1056080000053,6196.0960790000117,8098.4852739999997]
["NER",2006,"NER_2006_DHS",222,"Hygiene ladder","Basic","h_bas",3.8261092318604808,4.4292656944100441,4.6850956823181491,7.7266901022384316,26.606881897480079,13.403120435186381,21.37536324708687,26.292691995445761,32.408205842475112,54.72264096003633,2.6815455610678351,4.1988057224158286,4.4033475640324058,5.4323267805131454,8.6119662401225021,"Agadez","Diffa","Dosso","Maradi","Niamey","Tahoua","Tillabéri","Zinder",19.380105677472169,8.8014289841320572,7.5152843032124688,10.00687005488078,30.941693116265188,4.8990254797141297,3.830450124187045,9.4307107366218972,363,409,444,725,2500,225,363,446,543,925,229,298,330,419,665,232,111,485,954,1065,433,255,905]
["NER",2006,"NER_2006_DHS",223,"Hygiene ladder","Limited","h_lim",72.665355137908136,81.519916003823894,81.527801351465769,76.232987782971279,60.626735452560283,67.014591978917736,64.673784508619008,61.887165266078803,55.173380538688541,36.595753651030243,73.483452751913148,81.908382025092791,82.476736945748769,79.750761298005742,74.889729287707112,"Agadez","Diffa","Dosso","Maradi","Niamey","Tahoua","Tillabéri","Zinder",68.271934935399841,66.222844180462985,82.520380870866887,76.394357503457272,53.977346027572949,67.618806472666222,73.96253718922965,83.162929930419622,6904,7534,7731,7154,5696,1125,1098,1049,925,618,6288,5808,6173,6156,5779,816,839,5330,7286,1858,5978,4928,7983]
["NER",2006,"NER_2006_DHS",224,"Hygiene ladder","No facility","h_nfac",23.508535630231439,14.05081830176594,13.787102966216009,16.040322114790289,12.766382649959761,19.582287585895848,13.95085224429412,11.820142738475409,12.418413618836331,8.6816053889333595,23.83500168701908,13.89281225249124,13.119915490218879,14.81691192148101,16.498304472170322,"Agadez","Diffa","Dosso","Maradi","Niamey","Tahoua","Tillabéri","Zinder",12.34795938712803,24.975726835405041,9.9643348259205347,13.5987724416619,15.08096085616177,27.482168047619489,22.207012686583312,7.4063593329584068,2233,1299,1307,1505,1199,329,237,200,208,147,2039,985,982,1144,1273,148,316,644,1297,519,2430,1480,711]
["NER",2006,"NER_2006_DHS",225,"Place for hand washing","Inside dewelling/cour","",76.491464369768565,85.828041201108533,86.186403207791301,83.799958628006991,87.070127522619146,79.797867555537849,86.049147755705889,88.179857261524603,86.826250704804522,91.153228015328551,76.16499831298097,85.949079792773375,86.846260917410717,85.129604722949267,83.501695527829639,"Agadez","Diffa","Dosso","Maradi","Niamey","Tahoua","Tillabéri","Zinder",87.652040612872099,75.02427316459503,89.91201138792772,86.283217369906581,84.815139403587736,72.335535439664696,77.757259270006557,92.593640667041626]
["NER",2006,"NER_2006_DHS",226,"Place for hand washing","Elsewhere","",18.662159038914371,10.824658235121239,11.67244130175103,11.17717652948804,10.072114273122841,17.276959319413368,12.135107656949311,9.7737333730681115,10.95375005874542,7.5597138462043603,18.685047467474551,10.735535165707759,10.786071943171111,11.22943995984568,11.24223739584801,"Agadez","Diffa","Dosso","Maradi","Niamey","Tahoua","Tillabéri","Zinder",8.0895752940490713,21.566875203748339,4.4268471527983397,10.443770459817291,13.86772558933113,25.467109810666539,11.866681589046831,7.30285070820723]
["NER",2006,"NER_2006_DHS",227,"Place for hand washing","Nowhere","",4.8463765913170844,3.206356235119328,2.110424791334657,4.8326315528762196,2.6703421227202382,2.154391614410367,1.8157445873447999,2.0464093654072979,1.3575626129892171,1.1061892166671099,5.1499542195445374,3.1317674378421598,2.3287357864375169,3.5781689628052029,5.2560670763223083,"Agadez","Diffa","Dosso","Maradi","Niamey","Tahoua","Tillabéri","Zinder",4.2583840930789556,3.408851631656701,5.5238027880788483,3.1364282446000402,1.1947834810888129,1.9459731131693929,10.330132066226881,0.10350862475117729]
["NER",2006,"NER_2006_DHS",228,"Place for hand washing","missing","",0,0.14094432865075859,0.0307306991229622,0.19023328962879299,0.18741608153790079,0.77078151063835809,0,0,0.86243662346079297,0.18086892179993169,0,0.1836176036766401,0.0389313529806272,0.062786354399786998,0,"Agadez","Diffa","Dosso","Maradi","Niamey","Tahoua","Tillabéri","Zinder",0,0,0.1373386711949999,0.13658392567605129,0.1223515259923174,0.25138163649923478,0.045927074719765898,0]
["NER",2012,"NER_2012_DHS",16,"Water","Improved","w_imp",62.406584427273238,62.603286003596573,61.277960173468998,61.444248571574398,85.251132768524073,92.440531077537486,98.111264339979613,99.24266947715185,99.138795816753188,98.846088942824011,60.623734727454753,61.825947784511527,61.260233685552308,58.316299816874277,60.616325726196102,"Agadez","Diffa","Dosso","Maradi","Niamey","Tahoua","Tillaberi","Zinder",75.293181368342971,74.586041352832197,44.710423098319723,72.921724174006613,98.526718811480663,56.326618175527528,73.057476467809181,67.50967966055498]
["NER",2012,"NER_2012_DHS",17,"Water","Not Improved","",37.59341557272672,37.396713996403427,38.722039826530889,38.555751428425538,14.748867231476,7.559468922462548,1.8887356600203979,0.75733052284816627,0.86120418324681069,1.1539110571760189,39.376265272545382,38.174052215488153,38.73976631444765,41.683700183125723,39.383674273804047,"Agadez","Diffa","Dosso","Maradi","Niamey","Tahoua","Tillaberi","Zinder",24.706818631656979,25.413958647167931,55.289576901680412,27.078275825993551,1.4732811885193411,43.673381824472543,26.94252353219083,32.490320339444807]
["NER",2012,"NER_2012_DHS",18,"Water ladder","Basic","w_bas",41.625191812991247,40.253912900312592,39.830674112754863,43.07241824867365,72.292960587708407,73.767543799874915,82.413462045582875,90.211586554731042,92.397357701213963,96.374936719253412,39.890417450665232,38.517565469750679,40.247973531407872,38.37212527950328,41.158485168087147,"Agadez","Diffa","Dosso","Maradi","Niamey","Tahoua","Tillaberi","Zinder",68.817967770665476,67.202023258901804,36.170732286540648,38.502670363875488,95.373863809513281,43.258842758805137,56.692601739019921,42.463588506489067]
["NER",2012,"NER_2012_DHS",19,"Water ladder","Limited","w_lim",20.781392614281991,22.34937310328398,21.447286060714148,18.371830322900749,12.95817218081566,18.672987277662571,15.697802294396739,9.0310829224208184,6.741438115539216,2.4711522235705998,20.733317276789521,23.308382314760848,21.012260154144439,19.944174537371008,19.457840558108941,"Agadez","Diffa","Dosso","Maradi","Niamey","Tahoua","Tillaberi","Zinder",6.475213597677496,7.3840180939303881,8.5396908117790673,34.419053810131118,3.152855001967382,13.067775416722389,16.36487472878925,25.046091154065898]
["NER",2012,"NER_2012_DHS",20,"Water ladder","Unimproved","w_unimp",36.539910024350426,35.996402868638619,37.570102755009373,37.482026476519167,13.71191356831457,7.3724036830338422,1.646169507287659,0.75733052284813951,0.86120418324682113,1.153911057175987,38.320490001170583,36.60147533578526,37.444548849295337,40.54639818438762,37.718154707332559,"Agadez","Diffa","Dosso","Maradi","Niamey","Tahoua","Tillaberi","Zinder",24.706818631657029,25.22202320919213,55.227803378309197,27.027327097240271,1.4732811885193371,42.993155508525447,20.49614388920266,31.461215953253561]
["NER",2012,"NER_2012_DHS",21,"Water ladder","Surface water","w_sur",1.0535055483763289,1.4003111277648099,1.1519370715216211,1.0737249519064349,1.0369536631613661,0.18706523942867229,0.24256615273272791,0,0,0,1.055775271374674,1.572576879703216,1.29521746515235,1.137301998738089,1.6655195664713469,"Agadez","Diffa","Dosso","Maradi","Niamey","Tahoua","Tillaberi","Zinder",0,0.19193543797567711,0.061773523371089101,0.050948728753120003,0,0.68022631594702354,6.4463796429881626,1.0291043861914699]
["NER",2012,"NER_2012_DHS",22,"Improved water point at more than 30 minutes","Yes","",33.299999999999997,35.700000000000003,35,29.899999999999999,15.199999999999999,20.199999999999999,16,9.0999999999999996,6.7999999999999998,2.5,34.200000000000003,37.700000000000003,34.299999999999997,34.200000000000003,32.100000000000001,"Agadez","Diffa","Dosso","Maradi","Niamey","Tahoua","Tillaberi","Zinder",8.5999999999999996,9.9000000000000004,19.100000000000001,47.200000000000003,3.2000000000000002,23.199999999999999,22.399999999999999,37.100000000000001]
["NER",2012,"NER_2012_DHS",23,"Improved water point at more than 30 minutes","No","",66.700000000000003,64.299999999999997,65,70.099999999999994,84.799999999999997,79.799999999999997,84,90.900000000000006,93.200000000000003,97.5,65.799999999999997,62.299999999999997,65.700000000000003,65.799999999999997,67.900000000000006,"Agadez","Diffa","Dosso","Maradi","Niamey","Tahoua","Tillaberi","Zinder",91.400000000000006,90.099999999999994,80.900000000000006,52.799999999999997,96.799999999999997,76.799999999999997,77.599999999999994,62.899999999999999]
["NER",2012,"NER_2012_DHS",24,"Manually calculated ratios","Improved wells","",39.686447368027721,39.635409558983937,40.738038879764311,36.83207994423941,40.514172168279153,29.40021662332396,23.721458747737831,65.834784822657184,0,35.233114160840103,39.922296833993329,39.886852789908858,40.784781139206153,38.459720493989437,37.97934973360843,"Agadez","Diffa","Dosso","Maradi","Niamey","Tahoua","Tillaberi","Zinder",34.800526878869192,54.496763929450793,21.129644645376661,51.162716929213623,38.693145310027617,33.29622930874924,64.039116092690236,30.354797447796251]
["NER",2012,"NER_2012_DHS",25,"Manually calculated ratios","Improved springs","",0,10.57593896263846,17.182214442419021,12.36411342454528,0,0,50,50,50,50,0,7.3820096900753223,16.859412789786219,26.336407689207899,0,"Agadez","Diffa","Dosso","Maradi","Niamey","Tahoua","Tillaberi","Zinder",63.569356590633177,50,36.126600782753393,0,50,12.199498576910139,8.8958237629977415,10.020806291558451]
["NER",2012,"NER_2012_DHS",29,"Piped water","Yes","w_pip",21.800000000000001,21.399999999999999,20.100000000000001,26,70.900000000000006,86.099999999999994,94.5,95.5,97.400000000000006,97.099999999999994,18.300000000000001,19.800000000000001,18.199999999999999,18.300000000000001,24.600000000000001,"Agadez","Diffa","Dosso","Maradi","Niamey","Tahoua","Tillaberi","Zinder",55.200000000000003,39.799999999999997,18.899999999999999,36,95,29.899999999999999,16.399999999999999,22.800000000000001]
["NER",2012,"NER_2012_DHS",30,"Piped water","No","",78.200000000000003,78.599999999999994,79.900000000000006,74,29.100000000000001,13.9,5.5,4.5,2.6000000000000001,2.8999999999999999,81.700000000000003,80.200000000000003,81.799999999999997,81.700000000000003,75.400000000000006,"Agadez","Diffa","Dosso","Maradi","Niamey","Tahoua","Tillaberi","Zinder",44.799999999999997,60.200000000000003,81.099999999999994,64,5,70.099999999999994,83.599999999999994,77.200000000000003]
["NER",2012,"NER_2012_DHS",31,"Piped water on premises","Yes","w_pop",0.40000000000000002,0.69999999999999996,0.80000000000000004,2.7999999999999998,34.200000000000003,10.9,21.399999999999999,34.399999999999999,57.5,82.299999999999997,0.10000000000000001,0.40000000000000002,0.10000000000000001,1.2,4.2000000000000002,"Agadez","Diffa","Dosso","Maradi","Niamey","Tahoua","Tillaberi","Zinder",31.899999999999999,7,3.6000000000000001,5.9000000000000004,48.700000000000003,4.5999999999999996,3.7999999999999998,2.3999999999999999]
["NER",2012,"NER_2012_DHS",32,"Piped water on premises","No","",99.599999999999994,99.299999999999997,99.200000000000003,97.200000000000003,65.799999999999997,89.099999999999994,78.599999999999994,65.599999999999994,42.5,17.699999999999999,99.900000000000006,99.599999999999994,99.900000000000006,98.799999999999997,95.799999999999997,"Agadez","Diffa","Dosso","Maradi","Niamey","Tahoua","Tillaberi","Zinder",68.099999999999994,93,96.400000000000006,94.099999999999994,51.299999999999997,95.400000000000006,96.200000000000003,97.599999999999994]
["NER",2012,"NER_2012_DHS",35,"Water source on premises","Yes","",2.6000000000000001,2.7999999999999998,2.7999999999999998,5.2000000000000002,42.299999999999997,21.199999999999999,31.5,49,67.5,90.299999999999997,1.8,2.2000000000000002,1.7,3,7,"Agadez","Diffa","Dosso","Maradi","Niamey","Tahoua","Tillaberi","Zinder",35.399999999999999,14.199999999999999,6.4000000000000004,7.5999999999999996,65,7.5,4.7000000000000002,5]
["NER",2012,"NER_2012_DHS",36,"Water source on premises","No","",97.400000000000006,97.200000000000003,97.200000000000003,94.799999999999997,57.700000000000003,78.799999999999997,68.5,51,32.5,9.6999999999999993,98.200000000000003,97.799999999999997,98.299999999999997,97,93,"Agadez","Diffa","Dosso","Maradi","Niamey","Tahoua","Tillaberi","Zinder",64.599999999999994,85.799999999999997,93.599999999999994,92.400000000000006,35,92.5,95.299999999999997,95]
["NER",2012,"NER_2012_DHS",37,"Improved Water source on premises","Yes","w_premises",1.8,1.8999999999999999,2.2999999999999998,4.5,41.5,19.899999999999999,31.199999999999999,49,67.5,89.400000000000006,0.90000000000000002,1.6000000000000001,1,2.5,5.9000000000000004,"Agadez","Diffa","Dosso","Maradi","Niamey","Tahoua","Tillaberi","Zinder",35.299999999999997,13.800000000000001,4.4000000000000004,7.0999999999999996,64.599999999999994,6.7999999999999998,4.5,4.4000000000000004]
["NER",2012,"NER_2012_DHS",38,"Improved Water source on premises","No","",98.200000000000003,98.099999999999994,97.700000000000003,95.5,58.5,80.099999999999994,68.799999999999997,51,32.5,10.6,99.099999999999994,98.400000000000006,99,97.5,94.099999999999994,"Agadez","Diffa","Dosso","Maradi","Niamey","Tahoua","Tillaberi","Zinder",64.700000000000003,86.200000000000003,95.599999999999994,92.900000000000006,35.399999999999999,93.200000000000003,95.5,95.599999999999994]
["NER",2012,"NER_2012_DHS",41,"Water point at more than 30 minutes","Yes","",38.399999999999999,39.700000000000003,38.700000000000003,36.899999999999999,19.399999999999999,19.399999999999999,16,9.4000000000000004,6.7999999999999998,2.5,39.5,40.299999999999997,38.600000000000001,40.200000000000003,37.700000000000003,"Agadez","Diffa","Dosso","Maradi","Niamey","Tahoua","Tillaberi","Zinder",22.699999999999999,13.199999999999999,20.699999999999999,53.299999999999997,3.2999999999999998,35.899999999999999,25.699999999999999,40.600000000000001]
["NER",2012,"NER_2012_DHS",42,"Water point at more than 30 minutes","No","w_30min",61.600000000000001,60.299999999999997,61.299999999999997,63.100000000000001,80.599999999999994,80.599999999999994,84,90.599999999999994,93.200000000000003,97.5,60.5,59.700000000000003,61.399999999999999,59.799999999999997,62.299999999999997,"Agadez","Diffa","Dosso","Maradi","Niamey","Tahoua","Tillaberi","Zinder",77.299999999999997,86.799999999999997,79.299999999999997,46.700000000000003,96.700000000000003,64.099999999999994,74.299999999999997,59.399999999999999]
["NER",2012,"NER_2012_DHS",58,"Source of drinking water","Piped into dwelling","",0.16911856446299389,0.1819095146943501,0.12992705134419649,0.91594362039284838,13.13038171032791,3.7149346459442421,6.1257330055509511,10.15792863987464,25.099647792430829,35.564794011475598,0.024558732222153899,0.092904121821229299,0.072614831197204299,0.29477773631619741,1.075937048098955,"Agadez","Diffa","Dosso","Maradi","Niamey","Tahoua","Tillaberi","Zinder",6.5444068271632947,4.7703961526907177,0,1.2367225726184981,24.738472596998012,1.7838999047673441,0.75731249592978633,1.1440556188126341]
["NER",2012,"NER_2012_DHS",59,"Source of drinking water","Piped to yard/plot","",0.25213219610390281,0.48754192433708338,0.69355833567691616,1.8768036017098719,21.023733722028091,7.2078007136442066,15.28997887472204,24.25526152020316,32.372858561184273,46.726281302214012,0.029993864404694301,0.31178695067209378,0.060695471980441701,0.85852209069526786,3.1719071453202958,"Agadez","Diffa","Dosso","Maradi","Niamey","Tahoua","Tillaberi","Zinder",25.404726528399451,2.239541101047501,3.5679937788613989,4.6492279381223041,23.988345690137919,2.8604853276291582,3.0547887037107682,1.2554702187315809]
["NER",2012,"NER_2012_DHS",60,"Source of drinking water","Public tap/standpipe","",21.389806125663782,20.684700101375149,19.226814508103288,23.165212725230571,36.790919688945252,75.129320074113295,73.084787235530342,61.076695402900043,39.877737039584353,14.77312430506816,18.29178462287981,19.40440850180315,18.057967114741491,17.188464988540652,20.35251438926911,"Agadez","Diffa","Dosso","Maradi","Niamey","Tahoua","Tillaberi","Zinder",23.214773753312421,32.808579052170572,15.35784783523521,30.141580361326781,46.28924214052229,25.20570964471316,12.598798994400431,20.394533811625742]
["NER",2012,"NER_2012_DHS",61,"Source of drinking water","Tube well or borehole","",16.77605958456256,17.868543912938541,15.666807554846001,14.049113281274661,4.6712817297956493,3.818932327050057,2.613612004826356,1.603761774564844,0.98045535990862409,0.36426712089921109,16.952994799183589,17.99869986742074,17.461755666861539,14.78264911531665,13.52751660137308,"Agadez","Diffa","Dosso","Maradi","Niamey","Tahoua","Tillaberi","Zinder",6.4586681337240126,4.5576325223920469,10.953716987621011,8.8898887664460737,1.5159971637555281,5.3140594835219082,22.08365454037904,31.190893052760249]
["NER",2012,"NER_2012_DHS",62,"Source of drinking water","Protected well","",23.770137655616939,23.249530291341522,25.369803561187979,21.293760723895861,9.0939110764725086,2.3395968551686939,0.39992259923538392,1.2024400112465901,0,0.48199877922172202,25.272639945145759,23.89200771308067,25.419039376618169,24.991270898566111,22.481815818515781,"Agadez","Diffa","Dosso","Maradi","Niamey","Tahoua","Tillaberi","Zinder",12.511365242352049,30.209892524531089,14.764123418955981,27.855990275348098,0.53708398342160091,21.046591169496772,34.435387822488543,13.475168298667059]
["NER",2012,"NER_2012_DHS",63,"Source of drinking water","Unprotected well","",36.12471117070227,35.408953498872457,36.905662462263258,36.519321665512443,13.35233572995404,5.6181569435316554,1.285988050224663,0.62401087559942803,0.22883097349160419,0.88602897166451777,38.031934063297641,36.007447977053907,36.905775582810421,39.989104875282258,36.713025526072393,"Agadez","Diffa","Dosso","Maradi","Niamey","Tahoua","Tillaberi","Zinder",23.440289414775918,25.224394479445031,55.109855375980779,26.589887401336579,0.85097578561043863,42.163542849992233,19.337040536214509,30.917051158048011]
["NER",2012,"NER_2012_DHS",64,"Source of drinking water","Protected spring","",0,0.059971050055363802,0.12607710238078881,0.1144646577515555,0,0,0,0,0,0,0,0.048394683203815597,0.1104456921941718,0.20061498743949391,0,"Agadez","Diffa","Dosso","Maradi","Niamey","Tahoua","Tillaberi","Zinder",0.20155615751686901,0,0.0667410776461346,0,0,0.11587264539928011,0.1090738074732054,0.049558659957745499]
["NER",2012,"NER_2012_DHS",65,"Source of drinking water","Unprotected spring","",0.31559565844304721,0.50708072915046465,0.60768805229876621,0.81131670498101138,0.1642607079683038,0.14023716871061551,0,0,0,0,0.28556978148074041,0.60718130809946624,0.54465240387405001,0.56112514738421526,0.85123507403994503,"Agadez","Diffa","Dosso","Maradi","Niamey","Tahoua","Tillaberi","Zinder",0.1155088063694697,0,0.1180011239450994,0.27499022711310872,0,0.83394217419167416,1.117049937546327,0.44499894864001588]
["NER",2012,"NER_2012_DHS",66,"Source of drinking water","River/dam/lake/ponds/stream/canal/irrigation channel","",1.045429436490362,1.389586151632789,1.145895003479549,1.0657090451397331,1.011303917718259,0.1831224160446665,0.22850688036782379,0,0,0,1.0475669373359771,1.559422930334754,1.2893383277631709,1.133470160459203,1.656087615811056,"Agadez","Diffa","Dosso","Maradi","Niamey","Tahoua","Tillaberi","Zinder",0,0.18956416772289469,0.061720401754542298,0.050194233397758699,0,0.67589680028864507,6.4348275756554516,1.0216748639179469]
["NER",2012,"NER_2012_DHS",67,"Source of drinking water","Rainwater","",0.032498097561715102,0.065019969706369196,0.064972059929818901,0.0033882963718188,0,0,0,0,0,0,0.0388826576669054,0.077745946509871197,0.077715531959319503,0,0.0040498306192582999,"Agadez","Diffa","Dosso","Maradi","Niamey","Tahoua","Tillaberi","Zinder",0,0,0,0.1483142601449208,0,0,0,0]
["NER",2012,"NER_2012_DHS",68,"Source of drinking water","Tanker truck","",0.010765183373408,0,0,0,0.0021620275943588,0,0,0,0,0,0.012880105951888101,0,0,0,0.0025848929996532002,"Agadez","Diffa","Dosso","Maradi","Niamey","Tahoua","Tillaberi","Zinder",0.0223536573197444,0,0,0,0,0,0.0184601034273561,0]
["NER",2012,"NER_2012_DHS",69,"Source of drinking water","Cart with small tank","",0,0,0,0,0.072230716671005404,0,0,0.44100360559760532,0,0,0,0,0,0,0,"Agadez","Diffa","Dosso","Maradi","Niamey","Tahoua","Tillaberi","Zinder",0,0,0,0,0.21664320074422061,0,0,0]
["NER",2012,"NER_2012_DHS",70,"Source of drinking water","Water vendor","",0.0060670199280440998,0.0060692391482337999,0,0.025561664947310402,0.45593471745954001,0.22994646161693791,0.59723062011455064,0.50557852276503024,0.80809706364508749,0.87108000839634037,0,0,0,0,0,"Agadez","Diffa","Dosso","Maradi","Niamey","Tahoua","Tillaberi","Zinder",0.93533106855503512,0,0,0,1.209209066283208,0,0,0]
["NER",2012,"NER_2012_DHS",71,"Source of drinking water","Bottled water","",0,0,0,0,0.010577379229924,0,0,0,0,0.064543415548738201,0,0,0,0,0,"Agadez","Diffa","Dosso","Maradi","Niamey","Tahoua","Tillaberi","Zinder",0,0,0,0,0.031724969617753,0,0,0]
["NER",2012,"NER_2012_DHS",72,"Source of drinking water","Other","",0.1076793070910077,0.091093616747712103,0.0627943084892853,0.1594040127923704,0.2209668758354017,1.617952394175608,0.3742407294279117,0.1333196472487381,0.6323732097552065,0.26788208551150128,0.011194490431018099,0,0,0,0.16332605788066801,"Agadez","Diffa","Dosso","Maradi","Niamey","Tahoua","Tillaberi","Zinder",1.15102041051159,0,0,0.16320396414608901,0.62230540290890202,0,0.053605482774529298,0.1065953688388299]
["NER",2012,"NER_2012_DHS",122,"Sanitation","Improved","s_imp",5.1100329086745786,5.8410836915223889,9.3748925947607731,14.64938451156436,64.727042176745826,43.857519170857387,72.279624232921634,83.807108211933269,92.88268297270082,96.809766999447319,3.9410049306096351,4.6334052689534042,6.1249999640442692,9.6487225862035118,18.521092661190401,"Agadez","Diffa","Dosso","Maradi","Niamey","Tahoua","Tillaberi","Zinder",48.578490133765243,22.843605260743271,12.62316261119533,19.819523006161219,84.425268170483136,12.19945405511484,7.4918388887509462,15.606661340926131,652.11453499999993,745.13469100000009,1196.817089000001,1868.5929729999989,8258.6101089999993,917.21359299999972,1510.289307,1751.385868000001,1944.169202,2024.2610010000039,420.34816699999999,494.32280899999989,653.71188900000016,1029.023643,1976.5439180000001,599.48436100000038,431.28347299999979,976.52412099999901,2828.7667070000002,3591.4556780000098,1694.560869000001,557.539851,2041.6543369999999]
["NER",2012,"NER_2012_DHS",123,"Sanitation","Not Improved","",94.889967091325403,94.158916308477615,90.625107405239177,85.350615488435494,35.272957823254401,56.142480829142542,27.720375767078391,16.19289178806677,7.1173170272991557,3.1902330005526789,96.058995069390392,95.36659473104659,93.875000035955779,90.351277413796495,81.478907338809719,"Agadez","Diffa","Dosso","Maradi","Niamey","Tahoua","Tillaberi","Zinder",51.421509866234558,77.156394739256697,87.376837388804645,80.180476993838695,15.57473182951694,87.800545944885116,92.508161111249038,84.393338659073777,12109.34016899999,12011.653781000001,11569.378117000009,10886.843758999979,4500.5239890000012,1174.1349610000011,579.21976699999993,338.39613900000001,148.975763,66.706742999999989,10245.666577999989,10174.349157000021,10019.13534100001,9635.8455539999977,8695.3098119999941,634.56873399999881,1456.6999170000031,6759.4462619999886,11443.860873999951,662.54997199999991,12195.903911999971,6884.4227870000032,11040.287357000019]
["NER",2012,"NER_2012_DHS",124,"Sanitation ladder","Basic","s_bas",2.6799855641904471,2.9087120932861712,4.2492377235959067,8.8327758342333134,36.03161336399917,18.827291770432922,33.766129411888862,37.066059457760097,44.970060860255977,67.297715406973978,2.096895679236479,2.406152835311568,2.769242430349026,5.8685590834630874,12.68580968913848,"Agadez","Diffa","Dosso","Maradi","Niamey","Tahoua","Tillaberi","Zinder",30.972409852683931,21.81910673483199,6.2442228824028492,10.033887538911699,34.063382433769547,7.7694916540291823,3.4339935233628061,11.402660516905939,336.95852700000012,371.05824899999999,525.7511209999999,1111.2326390000001,4585.2071920000017,389.47529700000001,705.54633800000022,767.9644940000004,940.45635400000003,1403.6690950000011,218.535303,256.70455299999998,278.88404500000013,625.87414999999999,1343.098099000001,380.0633839999997,411.94111099999998,474.77515699999992,1423.3010719999991,1443.8279769999999,1068.736944,255.55651499999991,1472.005568]
["NER",2012,"NER_2012_DHS",125,"Sanitation ladder","Limited","s_lim",2.4300473444841351,2.9323715982362182,5.1256548711648611,5.8166086773310566,28.695428812746691,25.030227400424479,38.513494821032793,46.741048754173192,47.912622112444787,29.512051592473188,1.844109251373157,2.2272524336418371,3.3557575336952441,3.780163502740427,5.8352829720519264,"Agadez","Diffa","Dosso","Maradi","Niamey","Tahoua","Tillaberi","Zinder",17.60608028108124,1.024498525911288,6.3789397287924894,9.7856354672495183,50.361885736713411,4.4299624010856551,4.0578453653881397,4.2040008240201958,305.53342700000007,374.07644199999999,634.18875800000012,731.77509900000018,3651.6401650000021,517.79381600000011,804.74296900000002,968.41872000000069,1001.993972,615.55068399999993,192.19028299999999,237.618256,337.95063399999998,403.14949299999989,617.8050639999999,216.0447469999998,19.342362000000001,485.01825899999989,1388.086661,2134.6646870000031,609.36605499999985,301.98333600000001,542.70778400000006]
["NER",2012,"NER_2012_DHS",126,"Sanitation ladder","Unimproved","s_unimp",6.8458484132739983,9.9232367282603349,7.9123724079006914,8.3306406496829482,7.3310330389249714,14.24421715734775,9.7969637723620941,11.73771799494288,6.4060560327922422,3.1244229643160919,6.3209691237452716,9.2600201800975128,7.2771513143023716,9.4509735692166146,7.1335055287448057,"Agadez","Diffa","Dosso","Maradi","Niamey","Tahoua","Tillaberi","Zinder",3.612648601909513,10.59951348406733,6.4518204755002841,6.6064500080883866,9.5078511569219781,8.7890506406069306,10.68664292856127,7.9707475279836606,882.10196100000041,1265.886318999999,1040.611056,1082.3153390000009,941.45726800000034,302.062794,204.70844700000001,245.96111300000001,134.10026500000001,65.33399399999999,682.83061300000008,987.92117700000028,808.61411299999997,1007.933969000001,772.90545800000029,46.196139000000002,200.117054,512.65024699999992,955.70041700000036,405.25097599999998,1233.8435930000001,795.295974,1063.317543000001]
["NER",2012,"NER_2012_DHS",127,"Sanitation ladder","Open defecation","s_od",88.044118678051419,84.23567958021728,82.712734997338544,77.019974838752674,27.94192478432916,41.898263671794851,17.92341199471624,4.455173793123822,0.71126099450698754,0.065810036236741296,89.738025945645091,86.106574550949077,86.597848721653364,80.900303844579881,74.345401810064786,"Agadez","Diffa","Dosso","Maradi","Niamey","Tahoua","Tillaberi","Zinder",47.80886126432533,66.556881255189396,80.925016913304376,73.574026985750393,6.0668806725950493,79.011495304278228,81.821518182687782,76.422591131090201,11227.238208000001,10745.767462000011,10528.76706100002,9804.5284199999824,3559.0667210000061,872.0721670000006,374.51132000000013,92.435026000000008,14.875498,1.372749,9562.8359649999948,9186.4279800000168,9210.5212280000105,8627.9115850000035,7922.4043539999948,588.37259499999925,1256.582863000001,6246.7960149999944,10488.16045699996,257.29899599999999,10962.060318999989,6089.1268130000044,9976.9698140000164]
["NER",2012,"NER_2012_DHS",128,"Shared among Improved Sanitation","Yes","s_shared",47.554436300380523,50.202526673127338,54.674278338179263,39.705481638080911,44.332983321545882,57.07169003999811,53.284027455542343,55.772177028198357,51.58402037818697,30.484580747562038,46.792868414094848,48.06945009895346,54.78787842276941,39.17786493463494,31.50614857772046,"Agadez","Diffa","Dosso","Maradi","Niamey","Tahoua","Tillaberi","Zinder",36.242543217381417,4.4848372847340734,50.533609724199273,49.373718349364388,59.652621576535303,36.312792204240601,54.163542831667478,26.937220794276051]
["NER",2012,"NER_2012_DHS",129,"Shared among Improved Sanitation","No","",52.445563699619527,49.797473326872662,45.32572166182068,60.294518361919152,55.667016678454182,42.928309960001918,46.715972544457692,44.227822971801672,48.41597962181298,69.515419252437809,53.207131585905152,51.930549901046561,45.212121577230597,60.822135065365082,68.49385142227959,"Agadez","Diffa","Dosso","Maradi","Niamey","Tahoua","Tillaberi","Zinder",63.757456782618434,95.515162715265959,49.466390275800798,50.626281650635583,40.347378423464498,63.687207795759377,45.836457168332522,73.06277920572397]
["NER",2012,"NER_2012_DHS",130,"Manually calculated ratios","Improved latrines","",41.480997476598702,36.433149500853162,53.705716634987247,64.03862286642331,88.640196034974153,75.521787847135798,88.192665796580584,87.022887641872956,92.593479037213925,95.452652073808181,37.945149670819532,33.729908917075399,44.835671951593937,50.684995468477133,72.302473166817705,"Agadez","Diffa","Dosso","Maradi","Niamey","Tahoua","Tillaberi","Zinder",90.94510937486298,56.748313883991507,80.15048111377196,73.74938065112481,88.362477084824278,52.072834161155633,38.484838930298061,65.327393544418882]
["NER",2012,"NER_2012_DHS",135,"Sanitation type","Sewer connection","s_sew",0.029682282215151502,0,0.1348684531465402,0.1222215697318234,2.34209051887653,0.435403987660681,0.32141123882001388,0.97201253202291549,1.197007011886537,10.915727210758901,0.035513648635969598,0,0.0352505748365331,0.18696347448507769,0.17337365623732201,"Agadez","Diffa","Dosso","Maradi","Niamey","Tahoua","Tillaberi","Zinder",0.73786533471641169,0.32649159058544408,0.042254401686739301,0.17335232674982001,5.8521371968558533,0.018282037642639502,0.1264664371189228,0.23883348306260949]
["NER",2012,"NER_2012_DHS",136,"Sanitation type","Septic tank connection","s_sep",0.40958999747588681,0.40346837382285639,0.54925750287011454,0.89935317316267926,9.1111487666096878,4.7539381615676817,8.2268088776914325,9.3848815495136968,13.75534938164208,20.306447204572422,0.1204741068450494,0.098736459735292006,0.37093584445506927,0.38431491510021959,1.566300787370333,"Agadez","Diffa","Dosso","Maradi","Niamey","Tahoua","Tillaberi","Zinder",14.01145791056905,8.610036924106609,0.6029442292398195,1.0738697911801161,11.174517175359171,2.6177550048388158,0.78779935954846392,0.13828272150377291]
["NER",2012,"NER_2012_DHS",137,"Sanitation type","Improved latrines","s_lat",4.6707606289835422,5.4376153176995334,8.6907666387441154,13.627809768669859,53.273802891259677,38.66817702162902,63.731404116410147,73.450214130396603,77.930326579172132,65.587592584115825,3.7850171751286159,4.534668809218112,5.718813544752666,9.0774441966182131,16.78141821758274,"Agadez","Diffa","Dosso","Maradi","Niamey","Tahoua","Tillaberi","Zinder",33.829166888479783,13.907076746051221,11.97796398026877,18.572300888231279,67.39861379826803,9.5634170126333782,6.5775730920835578,15.22954513635975]
["NER",2012,"NER_2012_DHS",138,"Sanitation type","Unimproved facilities","",6.9122367430690428,9.9232367282604503,8.1513014583305168,8.4851296097511089,7.3786924784149441,14.44344575763145,9.7969637723621634,11.76970191991896,6.4066401153443264,3.1245816291272202,6.4019282677262161,9.2600201800974364,7.576367351413869,9.4509735692166803,7.2424667499636124,"Agadez","Diffa","Dosso","Maradi","Niamey","Tahoua","Tillaberi","Zinder",3.743448250903656,10.599513484067231,6.6268382842644176,6.6960369530852866,9.5263384523243264,8.8826660047236743,10.68664292856128,8.1281324123901744]
["NER",2012,"NER_2012_DHS",139,"Sanitation type","Open defecation","",87.977730348256401,84.23567958021728,82.473805946908698,76.865485878684396,27.8942653448395,41.699035071511076,17.92341199471624,4.423189868147813,0.7106769119548294,0.065651371425459806,89.657066801664271,86.106574550949077,86.2986326845419,80.900303844579881,74.236440588846108,"Agadez","Diffa","Dosso","Maradi","Niamey","Tahoua","Tillaberi","Zinder",47.678061615330932,66.556881255189396,80.749999104540294,73.484440040753469,6.0483933771926139,78.917879940161527,81.821518182687782,76.265206246683618]
["NER",2012,"NER_2012_DHS",148,"Shared among improved sanitation facilities","Yes","",2.3941896444159512,2.9323715982362182,4.9677194165254166,5.7369662393775274,28.619811790930282,24.758848304346291,38.513494821032793,46.340657387045873,47.870261675831863,29.43855474415194,1.801894030664968,2.2272524336418371,3.1664524631259039,3.780163502740427,5.789107306289897,"Agadez","Diffa","Dosso","Maradi","Niamey","Tahoua","Tillaberi","Zinder",17.506924772957159,1.024498525911288,6.2696498950647621,9.7255158738104495,50.180109351758837,4.3869378354676716,4.0578453653881388,4.1485262409395274]
["NER",2012,"NER_2012_DHS",149,"Shared among improved sanitation facilities","No","",2.6404397838310909,2.9087120932861712,4.1183070798799983,8.7118352930418528,35.936664328332007,18.623165242114851,33.766129411888848,36.748545610384348,44.93030199654612,67.130117096631707,2.048893689205193,2.406152835311568,2.6130238631739511,5.8685590834630856,12.58542454741837,"Agadez","Diffa","Dosso","Maradi","Niamey","Tahoua","Tillaberi","Zinder",30.79797664621546,21.81910673483199,6.1372411409864176,9.9722427697526985,33.940433929606982,7.6940329992547696,3.4339935233628061,11.252194837981349]
["NER",2012,"NER_2012_DHS",150,"Shared among improved sanitation facilities","DK/missing","",94.965370571752956,94.158916308477615,90.913973503594548,85.551198467580477,35.44352388073797,56.617986453538833,27.720375767078391,16.910797002569851,7.1994363276219584,3.4313281592162079,96.149212280129888,95.36659473104659,94.220523673700214,90.351277413796495,81.625468146291851,"Agadez","Diffa","Dosso","Maradi","Niamey","Tahoua","Tillaberi","Zinder",51.695098580827093,77.156394739256697,87.593108963948822,80.302241356436753,15.87945671863409,87.919029165277507,92.508161111249038,84.599278921079048]
["NER",2012,"NER_2012_DHS",151,"Shared among all sanitation facilities","Yes","",37.285416008198091,31.280626004001849,40.97199277878935,35.741820364630797,44.201611905216822,53.664978751040138,52.514366441555183,54.478034229947369,51.733408736067368,30.94761978026267,35.768943543312147,27.980063330815241,38.032623931965041,29.562890923819591,32.971403107587157,"Agadez","Diffa","Dosso","Maradi","Niamey","Tahoua","Tillaberi","Zinder",36.70718180276463,6.0116126573964612,54.204945797186838,44.327292642112063,58.76226721942448,32.075926778177447,44.663809594190738,18.914229587161351]
["NER",2012,"NER_2012_DHS",152,"Shared among all sanitation facilities","No","",62.087385612362773,68.509919794423254,57.029584340014708,62.882718126282462,55.512409776126802,45.173951605445133,47.48563355844496,44.625902433524153,48.104365813694542,68.81112667481284,63.358797021095711,72.01993666918483,58.909694269390407,69.700551137438268,66.459728262332618,"Agadez","Diffa","Dosso","Maradi","Niamey","Tahoua","Tillaberi","Zinder",62.769923359927922,93.988387342603374,44.671565553027307,54.817042717689603,40.766650221109707,67.263211300215559,54.75695781489226,80.218097981615173]
["NER",2012,"NER_2012_DHS",153,"Type of toilet facility","Flush to piped sewer system","",0.029703818273253201,0,0.1348684531465402,0.1222610578866897,2.3436021622017149,0.435403987660681,0.32141123882001388,0.97336086594469895,1.197952834596036,10.915727210758901,0.035544482228643898,0,0.0352505748365331,0.18703572535157739,0.17343349915532211,"Agadez","Diffa","Dosso","Maradi","Niamey","Tahoua","Tillaberi","Zinder",0.74064474682650239,0.32649159058544408,0.042254401686739301,0.1734038638857,5.8544115322518726,0.018296788544246601,0.1265364861786113,0.23883348306260949,3.7878910000000001,0,17.217569999999998,15.589895,298.83046999999982,9.1058149999999998,6.7159169999999992,20.312943000000001,25.055091999999998,228.24433500000001,3.7878910000000001,0,3.7622399999999998,19.939409999999999,18.502182999999999,9.1056500000000007,6.1641069999999996,3.2687879999999998,24.741931999999998,248.95024699999999,2.5394600000000001,9.4115850000000005,31.244057000000002]
["NER",2012,"NER_2012_DHS",154,"Type of toilet facility","Flush to septic tank","",0.40988717657820811,0.40360258170531987,0.54925750287011454,0.89964374214701859,9.1170293280597292,4.7539381615676817,8.2268088776914325,9.397899853011074,13.766218258510021,20.306447204572422,0.1205787046456397,0.098775733754247502,0.37093584445506927,0.38446343119782223,1.566841423194808,"Agadez","Diffa","Dosso","Maradi","Niamey","Tahoua","Tillaberi","Zinder",14.06423666837806,8.610036924106609,0.6029442292398195,1.0741890495043811,11.17885996485477,2.6198671461253982,0.78823571725424535,0.13828272150377291,52.269641999999997,51.469607000000003,70.119284999999991,114.716425,1162.503689000001,99.421416999999991,171.89991800000001,196.12356600000001,287.91940299999999,424.60126099999979,12.849786,10.533868999999999,39.589416,40.986683000000014,167.15332900000001,172.90882999999999,162.55606700000001,46.643586999999997,153.26943600000001,475.36459200000007,363.61833700000011,58.627733999999997,18.090064999999999]
["NER",2012,"NER_2012_DHS",155,"Type of toilet facility","Ventilated Improved Pit latrine (VIP)","",0.64187818707841715,0.20280285159795611,0.44875426135638791,1.044127351717326,6.591380243016487,5.7320833378403879,9.491473258852194,10.182527084369189,9.2332191016147007,8.4573982313903979,0.62296489133747512,0.1080538198631415,0.13502276093199539,0.25025311970523367,1.1150016178977,"Agadez","Diffa","Dosso","Maradi","Niamey","Tahoua","Tillaberi","Zinder",0.74236311519355536,0.42958963743849388,0.076079065826485701,4.8455978050481807,3.6597428856379719,0.81719901350995638,0.12974406940609759,1.1114373722265241,81.853605000000002,25.862528000000001,57.288845000000002,133.13998799999999,840.46059000000025,119.877842,198.32519500000001,212.497851,193.11207200000001,176.84146899999999,66.387888000000004,11.523324000000001,14.410773000000001,26.678858000000002,118.950284,9.1267759999999996,8.1105809999999998,5.8854540000000002,691.38858100000027,155.62518800000001,113.421227,9.6501599999999996,145.39758900000001]
["NER",2012,"NER_2012_DHS",156,"Type of toilet facility","Pit latrine with slab","",4.0322713245913082,5.2366212096978222,8.2420123773877254,12.588085380061379,46.716806882284857,32.936093683788663,54.239930857557951,63.369574019715103,68.758684621137533,57.130194352725418,3.165338504225415,4.4284187269940132,5.5837907838206702,8.8306989985036246,15.67220899661613,"Agadez","Diffa","Dosso","Maradi","Niamey","Tahoua","Tillaberi","Zinder",33.214232440415927,13.477487108612729,11.90188491444229,13.732224573505309,63.765064258385223,8.7539342628210761,6.4514723040146231,14.11810776413323,514.20339700000011,667.8025560000001,1052.1913890000001,1605.146665,5956.8153600000114,688.80851900000005,1133.3482769999989,1322.451508000001,1438.082635,1194.573936,337.32260200000002,472.26561599999991,595.94946000000004,941.41869199999962,1671.938122,408.34310500000049,254.45271799999989,920.72629199999892,1959.3667579999999,2711.5156510000038,1214.981845,479.85037199999988,1846.922626]
["NER",2012,"NER_2012_DHS",157,"Type of toilet facility","Pit latrine without slab/open pit","",6.5940209664067089,9.4904519879005775,7.49143366185183,7.6552730410084839,6.8317826738041374,12.53317575870712,8.5324327239557203,10.96830852283448,6.2385459090266728,3.1245816291272202,6.1953267348412604,8.9129339072486697,7.0362390636411209,8.8354983702924876,6.4308203590353648,"Agadez","Diffa","Dosso","Maradi","Niamey","Tahoua","Tillaberi","Zinder",3.3808663365359908,10.599513484067231,2.9663804750892671,6.612656801789492,8.8799880229323556,8.8091477867472268,10.519586322779499,8.0831026061290618,840.88289400000042,1210.274304999999,956.37104500000021,976.14812900000061,871.11407400000053,262.11239000000012,178.28595600000011,228.89622299999999,130.478711,65.33399399999999,660.22124699999995,950.51359900000023,750.96704599999987,941.93034100000057,686.05094000000031,41.565117000000001,200.117054,229.47831500000009,943.51937300000031,377.60844100000003,1222.6450769999999,782.43029999999999,1057.42677]
["NER",2012,"NER_2012_DHS",158,"Type of toilet facility","No facility/bush/field","",88.041562822414178,84.263699353061483,82.473805946908698,76.890320089347142,27.912268995714481,41.699035071511076,17.92341199471624,4.4293255266349529,0.71123845784033268,0.065651371425459806,89.734908690186387,86.140824829419444,86.2986326845419,80.931567261506416,74.262064581113421,"Agadez","Diffa","Dosso","Maradi","Niamey","Tahoua","Tillaberi","Zinder",47.857656692649797,66.556881255189396,80.749999104540294,73.506286748221726,6.0507439842758162,78.981555002252136,81.866838668830638,76.265206246683618,11227.238208000001,10745.767462000011,10528.76706100002,9804.5284199999824,3559.0667210000061,872.0721670000006,374.51132000000013,92.435026000000008,14.875498,1.372749,9562.8359649999948,9186.4279800000168,9210.5212280000105,8627.9115850000035,7922.4043539999948,588.37259499999925,1256.582863000001,6246.7960149999944,10488.16045699996,257.29899599999999,10962.060318999989,6089.1268130000044,9976.9698140000164]
["NER",2012,"NER_2012_DHS",159,"Type of toilet facility","Bucket toilet","",0.22912763842436251,0.34330577756403141,0.52726437998037201,0.72637229039681694,0.47168808077078778,1.1964787004127471,0.97046307442836244,0.67900412749052086,0,0,0.1253379925352904,0.28522645796832491,0.41953063728056361,0.58048309344292348,0.77962952298738331,"Agadez","Diffa","Dosso","Maradi","Niamey","Tahoua","Tillaberi","Zinder",0,0,3.4559004334802461,0.055641158045201998,0.21105246688449669,0,0.049820493263236398,0.039064407406309197,29.218820000000001,43.780228999999999,67.311599999999999,92.622032999999988,60.14449599999999,25.022539999999999,20.277913999999999,14.17005,0,0,13.356972000000001,30.417776,44.775864000000013,61.883848000000008,83.172213999999983,0,0,267.34743400000008,7.9390949999999991,8.9746959999999998,0,3.7055699999999998,5.1103829999999997]
["NER",2012,"NER_2012_DHS",160,"Type of toilet facility","Other","",0.0215480662335885,0.059516238472929799,0.132603416498314,0.073917047435023295,0.0154416341481601,0.71379129851159118,0.29406797397808299,0,0.094140817274675895,0,0,0.025766524752093501,0.1205976504921826,0,0,"Agadez","Diffa","Dosso","Maradi","Niamey","Tahoua","Tillaberi","Zinder",0,0,0.2045573756949067,0,0.4001368847774337,0,0.0677659382730669,0.0059653988548040004,2.7478530000000001,7.589836,16.928411000000001,9.4253970000000002,1.9689479999999999,14.927864,6.144577,0,1.9689479999999999,0,0,2.7478530000000001,12.871203,0,0,0,0,15.824498,0,17.015232999999998,0,5.040324,0.78039000000000003]