{"text_format":"1","workbook":"xlsx","n_sheets":8,"sheets":["Introduction","Water","Sanitation","Hygiene","MICS06","MICS13","MICS18","data_summary"],"not_rendered":{"charts":123,"images":76,"macros":1,"external_links":0,"defined_names":0,"comments":0,"pivot_tables":0},"unopened":[],"bounds":{"document_bytes":16777216,"sheet_cells":100000,"rows_first":2000,"rows_last":500,"rows_between":2000,"halvings":0,"cell_chars":16384,"cell_head_chars":4096},"cells_cut":0,"cells_raw":0,"read":"whole","date_system":"1900"}

{"sheet":"Introduction","index":0,"n_rows":55,"n_cols":12,"rows_kept":55,"cut":false,"hidden":false,"merged":[[112,0,112,1],[113,0,113,1],[207,0,207,1],[212,0,212,1],[213,0,213,1],[107,0,107,1],[1,0,1,1],[4,0,4,1],[5,0,5,1],[6,0,6,1],[7,0,7,1]]}
[]
[]
[]
[null,null,"Joint Monitoring Programme for Water Supply, Sanitation and Hygiene"]
[]
[null,null,"Estimates on household water, sanitation and hygiene \nby wealth quintile and sub-national region in"]
[null,null,{"$f":"+Water!B5","v":"Montenegro"}]
[]
[null,null,"Updated May 2021"]
[]
[null,null,"Follow the links below to find the following information: "]
[]
[null,null,"JMP Estimates"]
[null,null,"WASH status and trends by wealth quintile \n(customized quintiles made without water and sanitation assets)"]
[null,null,"Water"]
[null,null,"Sanitation"]
[null,null,"Hygiene"]
[]
[null,null,"Data inputs"]
[null,null," customized wealth quintiles and subnational data:"]
[null,null,{"$f":"IF(INDIRECT(CONCATENATE(\"Water\",\"!B105\"))=0,\"\",INDIRECT(CONCATENATE(\"Water\",\"!B105\")))","v":"MICS06"}]
[null,null,{"$f":"IF(INDIRECT(CONCATENATE(\"Water\",\"!B106\"))=0,\"\",INDIRECT(CONCATENATE(\"Water\",\"!B106\")))","v":"MICS13"}]
[null,null,{"$f":"IF(INDIRECT(CONCATENATE(\"Water\",\"!B107\"))=0,\"\",INDIRECT(CONCATENATE(\"Water\",\"!B107\")))","v":"MICS18"}]
[null,null,{"$f":"IF(INDIRECT(CONCATENATE(\"Water\",\"!B108\"))=0,\"\",INDIRECT(CONCATENATE(\"Water\",\"!B108\")))","v":""}]
[null,null,{"$f":"IF(INDIRECT(CONCATENATE(\"Water\",\"!B109\"))=0,\"\",INDIRECT(CONCATENATE(\"Water\",\"!B109\")))","v":""}]
[null,null,{"$f":"IF(INDIRECT(CONCATENATE(\"Water\",\"!B110\"))=0,\"\",INDIRECT(CONCATENATE(\"Water\",\"!B110\")))","v":""}]
[null,null,{"$f":"IF(INDIRECT(CONCATENATE(\"Water\",\"!B111\"))=0,\"\",INDIRECT(CONCATENATE(\"Water\",\"!B111\")))","v":""}]
[null,null,{"$f":"IF(INDIRECT(CONCATENATE(\"Water\",\"!B112\"))=0,\"\",INDIRECT(CONCATENATE(\"Water\",\"!B112\")))","v":""}]
[null,null,{"$f":"IF(INDIRECT(CONCATENATE(\"Water\",\"!B113\"))=0,\"\",INDIRECT(CONCATENATE(\"Water\",\"!B113\")))","v":""}]
[null,null,{"$f":"IF(INDIRECT(CONCATENATE(\"Water\",\"!B114\"))=0,\"\",INDIRECT(CONCATENATE(\"Water\",\"!B114\")))","v":""}]
[null,null,{"$f":"IF(INDIRECT(CONCATENATE(\"Water\",\"!B115\"))=0,\"\",INDIRECT(CONCATENATE(\"Water\",\"!B115\")))","v":""}]
[null,null,{"$f":"IF(INDIRECT(CONCATENATE(\"Water\",\"!B116\"))=0,\"\",INDIRECT(CONCATENATE(\"Water\",\"!B116\")))","v":""}]
[]
[]
[]
[]
[]
[]
[]
[]
[]
[]
[]
[]
[]
[]
[]
[]
[]
[]
[]
[]
[]
[]
[null,null,null,null,null,null,null,null,null,null,null,{"$f":"+IF(ISNUMBER(M48), \"\", \"Insufficient data to estimate safely managed sanitation services at national level\")","v":"Insufficient data to estimate safely managed sanitation services at national level"}]

{"sheet":"Water","index":1,"n_rows":318,"n_cols":28,"rows_kept":318,"cut":false,"hidden":false,"merged":[[317,1,317,11],[6,9,6,16],[6,17,6,24],[6,1,6,8],[4,1,4,24],[117,1,117,11],[30,21,30,24],[32,1,33,2],[32,3,33,3],[30,17,30,20],[30,1,31,4],[30,5,30,8],[30,9,30,12],[30,13,30,16],[96,23,96,27],[35,1,36,2],[35,3,36,3],[38,1,39,2],[38,3,39,3],[96,0,97,2],[96,3,96,7],[96,8,96,12],[96,13,96,17],[96,18,96,22],[217,18,217,22],[98,0,99,1],[100,0,101,1],[196,0,197,2],[196,3,196,7],[196,8,196,12],[217,1,217,11],[3,1,3,24],[317,18,317,22],[117,18,117,22],[196,18,196,22],[296,23,296,27],[298,0,299,1],[300,0,301,1],[296,0,297,2],[296,3,296,7],[296,8,296,12],[296,13,296,17],[296,18,296,22],[196,23,196,27],[198,0,199,1],[200,0,201,1],[196,13,196,17]]}
["BGD"]
[]
[]
[null,"Summary of trends in use of drinking water by wealth quintile (%)"]
[null,{"$f":"IF(ISERROR(INDIRECT(CONCATENATE($B105,\"!A2\"))),\"\",INDIRECT(CONCATENATE($B105,\"!A2\")))","v":"Montenegro"}]
[]
[null,{"$f":"B118","v":"National use of drinking water sources, 2000–2020"},null,null,null,null,null,null,null,{"$f":"B218","v":"Urban use of drinking water sources,  2000–2020"},null,null,null,null,null,null,null,{"$f":"B318","v":"Rural use of drinking water sources, 2000–2020"}]
[]
[]
[]
[]
[]
[]
[]
[]
[]
[]
[]
[]
[]
[]
[]
[]
[]
[]
[]
[]
[]
[]
[]
[null,{"$f":"IF(ISERROR(INDIRECT(CONCATENATE($B105,\"!A2\"))),\"\",INDIRECT(CONCATENATE($B105,\"!A2\")))","v":"Montenegro"},null,null,null,"Poorest",null,null,null,"Poor",null,null,null,"Middle",null,null,null,"Rich",null,null,null,"Richest"]
[null,null,null,null,null,"Basic","Limited","Unimproved","Surface \n water","Basic","Limited","Unimproved","Surface \nwater","Basic","Limited","Unimproved","Surface \nwater","Basic","Limited","Unimproved","Surface \nwater","Basic","Limited","Unimproved","Surface \nwater"]
[null,"NATIONAL",null,"Estimate",{"$f":"C99","v":2000},{"$f":"E99","v":93.070244429895979},{"$f":"F99","v":0.70670408655281347},4.5712980105238756,1.6517534730273269,{"$f":"J99","v":98.845266056407823},{"$f":"K99","v":0.55699235007420922},0.59774159351796641,0,{"$f":"O99","v":99.133658044428302},{"$f":"P99","v":0.32196791606594855},0.54437403950575458,0,{"$f":"T99","v":99.486076041634291},{"$f":"U99","v":0.51392395836569449},0,0,{"$f":"Y99","v":99.334213978396363},{"$f":"Z99","v":0.66578602160363687},0,0]
[null,null,null,null,{"$f":"C100","v":2020},{"$f":"E100","v":99.246398930938923},0.7536010690610766,0,0,{"$f":"J100","v":98.466020184484591},0.5548553023643279,0.97912451315107774,0,{"$f":"O100","v":99.387749884706039},0.32279315970082911,0.28945695559313833,0,{"$f":"T100","v":98.605859598331065},0.50937694699727276,0.88476345467165629,0,{"$f":"Y100","v":98.646010388796427},0.66117334776627457,0.69281626343729386,0]
[]
[null,"URBAN",null,"Estimate",{"$f":"C199","v":2000},{"$f":"E199","v":99.1953297285567},{"$f":"F199","v":0.80467027144329961},0,0,{"$f":"J199","v":99.425190252058641},{"$f":"K199","v":0.57480974794135875},0,0,{"$f":"O199","v":99.55557613485135},{"$f":"P199","v":0.44442386514866428},0,0,{"$f":"T199","v":99.566666666666663},{"$f":"U199","v":0.43333333333333712},0,0,{"$f":"Y199","v":99.505409455756379},{"$f":"Z199","v":0.49459054424362137},0,0]
[null,null,null,null,{"$f":"C200","v":2020},{"$f":"E200","v":99.1953297285567},0.80467027144329961,0,0,{"$f":"J200","v":99.052895542291097},0.57265738969352575,0.37444706801537109,0,{"$f":"O200","v":99.55557613485135},0.44442386514866428,0,0,{"$f":"T200","v":99.279415339286658},0.43208316016429121,0.28850150054904589,0,{"$f":"Y200","v":99.226032707674207},0.49320190518732543,0.28076538713847299,0]
[]
[null,"RURAL",null,"Estimate",{"$f":"C299","v":2000},{"$f":"E299","v":86.989211090981996},{"$f":"F299","v":1.0145621934721678},11.019337421545529,0.97688929400030133,{"$f":"J299","v":93.798739543807685},{"$f":"K299","v":0.47603693703236366},2.3809167740311068,3.3443067451288471,{"$f":"O299","v":99.762951266417787},{"$f":"P299","v":3.3265405557337327E-2},0.20378332802486909,0,{"$f":"T299","v":98.478016088901626},{"$f":"U299","v":0.48902359865274797},1.0329603124456241,0,{"$f":"Y299","v":99.192445318703435},{"$f":"Z299","v":0.80755468129656549},0,0]
[null,null,null,null,{"$f":"C300","v":2020},{"$f":"E300","v":98.847137849200166},1.1528621507998338,0,0,{"$f":"J300","v":99.495053762202119},0.50494623779788128,0,0,{"$f":"O300","v":97.595068708382144},3.2542537081833349E-2,2.3723887545360185,0,{"$f":"T300","v":97.526567089883741},0.48429887904614821,1.9891340310701082,0,{"$f":"Y300","v":97.140149304024703},0.79084633976173313,2.0690043562135685,0]
[]
[]
[]
[]
[]
[]
[]
[]
[]
[]
[]
[]
[]
[]
[]
[]
[]
[]
[]
[]
[]
[]
[]
[]
[]
[]
[]
[]
[]
[]
[]
[]
[]
[]
[]
[]
[]
[]
[]
[]
[]
[]
[]
[]
[]
[]
[]
[]
[]
[]
[]
[]
[]
[]
[]
[]
["NATIONAL",null,null,"Poorest",null,null,null,null,"Poor",null,null,null,null,"Middle",null,null,null,null,"Rich",null,null,null,null,"Richest"]
[null,null,null,"Improved","Basic","Limited","Unimproved","Surface water","Improved","Basic","Limited","Unimproved","Surface water","Improved","Basic","Limited","Unimproved","Surface water","Improved","Basic","Limited","Unimproved","Surface water","Improved","Basic","Limited","Unimproved","Surface water"]
["Forecast period:",null,2000,{"$f":"IF((D101+H101)>100,D101*100/(D101+H101),D101)","v":93.776948516448783},{"$f":"D99*AVERAGEIF(E105:E116,\">0\")/100","v":93.070244429895979},{"$f":"D99*(100-AVERAGEIF(E105:E116,\">0\"))/100","v":0.70670408655281347},{"$f":"100-(E99+F99+H99)","v":4.5712980105238756},{"$f":"IF((D101+H101)>100,H101*100/(D101+H101),H101)","v":1.6517534730273269},{"$f":"IF((I101+M101)>100,I101*100/(I101+M101),I101)","v":99.402258406482019},{"$f":"I99*AVERAGEIF(J105:J116,\">0\")/100","v":98.845266056407823},{"$f":"I99*(100-AVERAGEIF(J105:J116,\">0\"))/100","v":0.55699235007420922},{"$f":"100-(J99+K99+M99)","v":0.59774159351796641},{"$f":"IF((I101+M101)>100,M101*100/(I101+M101),M101)","v":0},{"$f":"IF((N101+R101)>100,N101*100/(N101+R101),N101)","v":99.455625960494245},{"$f":"N99*AVERAGEIF(O105:O116,\">0\")/100","v":99.133658044428302},{"$f":"N99*(100-AVERAGEIF(O105:O116,\">0\"))/100","v":0.32196791606594855},{"$f":"100-(O99+P99+R99)","v":0.54437403950575458},{"$f":"IF((N101+R101)>100,R101*100/(N101+R101),R101)","v":0},{"$f":"IF((S101+W101)>100,S101*100/(S101+W101),S101)","v":100},{"$f":"S99*AVERAGEIF(T105:T116,\">0\")/100","v":99.486076041634291},{"$f":"S99*(100-AVERAGEIF(T105:T116,\">0\"))/100","v":0.51392395836569449},{"$f":"100-(T99+U99+W99)","v":0},{"$f":"IF((S101+W101)>100,W101*100/(S101+W101),W101)","v":0},{"$f":"IF((X101+AB101)>100,X101*100/(X101+AB101),X101)","v":100},{"$f":"X99*AVERAGEIF(Y105:Y116,\">0\")/100","v":99.334213978396363},{"$f":"X99*(100-AVERAGEIF(Y105:Y116,\">0\"))/100","v":0.66578602160363687},{"$f":"100-(Y99+Z99+AB99)","v":0},{"$f":"IF((X101+AB101)>100,AB101*100/(X101+AB101),AB101)","v":0}]
[null,null,2020,{"$f":"IF((D102+H102)>100,D102*100/(D102+H102),D102)","v":100},{"$f":"D100*AVERAGEIF(E105:E116,\">0\")/100","v":99.246398930938923},{"$f":"D100*(100-AVERAGEIF(E105:E116,\">0\"))/100","v":0.7536010690610766},{"$f":"100-(E100+F100+H100)","v":0},{"$f":"IF((D102+H102)>100,H102*100/(D102+H102),H102)","v":0},{"$f":"IF((I102+M102)>100,I102*100/(I102+M102),I102)","v":99.020875486848922},{"$f":"I100*AVERAGEIF(J105:J116,\">0\")/100","v":98.466020184484591},{"$f":"I100*(100-AVERAGEIF(J105:J116,\">0\"))/100","v":0.5548553023643279},{"$f":"100-(J100+K100+M100)","v":0.97912451315107774},{"$f":"IF((I102+M102)>100,M102*100/(I102+M102),M102)","v":0},{"$f":"IF((N102+R102)>100,N102*100/(N102+R102),N102)","v":99.710543044406876},{"$f":"N100*AVERAGEIF(O105:O116,\">0\")/100","v":99.387749884706039},{"$f":"N100*(100-AVERAGEIF(O105:O116,\">0\"))/100","v":0.32279315970082911},{"$f":"100-(O100+P100+R100)","v":0.28945695559313833},{"$f":"IF((N102+R102)>100,R102*100/(N102+R102),R102)","v":0},{"$f":"IF((S102+W102)>100,S102*100/(S102+W102),S102)","v":99.115236545328344},{"$f":"S100*AVERAGEIF(T105:T116,\">0\")/100","v":98.605859598331065},{"$f":"S100*(100-AVERAGEIF(T105:T116,\">0\"))/100","v":0.50937694699727276},{"$f":"100-(T100+U100+W100)","v":0.88476345467165629},{"$f":"IF((S102+W102)>100,W102*100/(S102+W102),W102)","v":0},{"$f":"IF((X102+AB102)>100,X102*100/(X102+AB102),X102)","v":99.307183736562692},{"$f":"X100*AVERAGEIF(Y105:Y116,\">0\")/100","v":98.646010388796427},{"$f":"X100*(100-AVERAGEIF(Y105:Y116,\">0\"))/100","v":0.66117334776627457},{"$f":"100-(Y100+Z100+AB100)","v":0.69281626343729386},{"$f":"IF((X102+AB102)>100,AB102*100/(X102+AB102),AB102)","v":0}]
["Regression period:",null,{"$f":"MinRegYear(C99,C105:C116)","v":2004},{"$f":"IF(MAX(C105:C116)-MIN(C105:C116)<5,AVERAGEIF(C105:C116,\">0\",D105:D116),\nIF(FORECAST($C101,D$105:D$116,$C$105:$C$116)<0,0,\nIF(FORECAST($C101,D$105:D$116,$C$105:$C$116)>100,100,\nFORECAST($C101,D$105:D$116,$C$105:$C$116))))","v":93.776948516448783},null,null,null,{"$f":"IF(MAX(C105:C116)-MIN(C105:C116)<5,AVERAGEIF(C105:C116,\">0\",H105:H116),\nIF(FORECAST($C101,H$105:H$116,$C$105:$C$116)<0,0,\nIF(FORECAST($C101,H$105:H$116,$C$105:$C$116)>100,100,\nFORECAST($C101,H$105:H$116,$C$105:$C$116))))","v":1.6517534730273269},{"$f":"IF(MAX(C105:C116)-MIN(C105:C116)<5,AVERAGEIF(C105:C116,\">0\",I105:I116),\nIF(FORECAST($C101,I$105:I$116,$C$105:$C$116)<0,0,\nIF(FORECAST($C101,I$105:I$116,$C$105:$C$116)>100,100,\nFORECAST($C101,I$105:I$116,$C$105:$C$116))))","v":99.402258406482019},null,null,null,{"$f":"IF(MAX(C105:C116)-MIN(C105:C116)<5,AVERAGEIF(C105:C116,\">0\",M105:M116),\nIF(FORECAST($C101,M$105:M$116,$C$105:$C$116)<0,0,\nIF(FORECAST($C101,M$105:M$116,$C$105:$C$116)>100,100,\nFORECAST($C101,M$105:M$116,$C$105:$C$116))))","v":0},{"$f":"IF(MAX(C105:C116)-MIN(C105:C116)<5,AVERAGEIF(C105:C116,\">0\",N105:N116),\nIF(FORECAST($C101,N$105:N$116,$C$105:$C$116)<0,0,\nIF(FORECAST($C101,N$105:N$116,$C$105:$C$116)>100,100,\nFORECAST($C101,N$105:N$116,$C$105:$C$116))))","v":99.455625960494245},null,null,null,{"$f":"IF(MAX(C105:C116)-MIN(C105:C116)<5,AVERAGEIF(C105:C116,\">0\",R105:R116),\nIF(FORECAST($C101,R$105:R$116,$C$105:$C$116)<0,0,\nIF(FORECAST($C101,R$105:R$116,$C$105:$C$116)>100,100,\nFORECAST($C101,R$105:R$116,$C$105:$C$116))))","v":0},{"$f":"IF(MAX(C105:C116)-MIN(C105:C116)<5,AVERAGEIF(C105:C116,\">0\",S105:S116),\nIF(FORECAST($C101,S$105:S$116,$C$105:$C$116)<0,0,\nIF(FORECAST($C101,S$105:S$116,$C$105:$C$116)>100,100,\nFORECAST($C101,S$105:S$116,$C$105:$C$116))))","v":100},null,null,null,{"$f":"IF(MAX(C105:C116)-MIN(C105:C116)<5,AVERAGEIF(C105:C116,\">0\",W105:W116),\nIF(FORECAST($C101,W$105:W$116,$C$105:$C$116)<0,0,\nIF(FORECAST($C101,W$105:W$116,$C$105:$C$116)>100,100,\nFORECAST($C101,W$105:W$116,$C$105:$C$116))))","v":0},{"$f":"IF(MAX(C105:C116)-MIN(C105:C116)<5,AVERAGEIF(C105:C116,\">0\",X105:X116),\nIF(FORECAST($C101,X$105:X$116,$C$105:$C$116)<0,0,\nIF(FORECAST($C101,X$105:X$116,$C$105:$C$116)>100,100,\nFORECAST($C101,X$105:X$116,$C$105:$C$116))))","v":100},null,null,null,{"$f":"IF(MAX(C105:C116)-MIN(C105:C116)<5,AVERAGEIF(C105:C116,\">0\",AB105:AB116),\nIF(FORECAST($C101,AB$105:AB$116,$C$105:$C$116)<0,0,\nIF(FORECAST($C101,AB$105:AB$116,$C$105:$C$116)>100,100,\nFORECAST($C101,AB$105:AB$116,$C$105:$C$116))))","v":0}]
[null,null,{"$f":"MaxRegYear(C100,C105:C116)","v":2020},{"$f":"IF(MAX(C105:C116)-MIN(C105:C116)<5,AVERAGEIF(C105:C116,\">0\",D105:D116),\nIF(FORECAST($C102,D$105:D$116,$C$105:$C$116)<0,0,\nIF(FORECAST($C102,D$105:D$116,$C$105:$C$116)>100,100,\nFORECAST($C102,D$105:D$116,$C$105:$C$116))))","v":100},null,null,null,{"$f":"IF(MAX(C105:C116)-MIN(C105:C116)<5,AVERAGEIF(C105:C116,\">0\",H105:H116),\nIF(FORECAST($C102,H$105:H$116,$C$105:$C$116)<0,0,\nIF(FORECAST($C102,H$105:H$116,$C$105:$C$116)>100,100,\nFORECAST($C102,H$105:H$116,$C$105:$C$116))))","v":0},{"$f":"IF(MAX(C105:C116)-MIN(C105:C116)<5,AVERAGEIF(C105:C116,\">0\",I105:I116),\nIF(FORECAST($C102,I$105:I$116,$C$105:$C$116)<0,0,\nIF(FORECAST($C102,I$105:I$116,$C$105:$C$116)>100,100,\nFORECAST($C102,I$105:I$116,$C$105:$C$116))))","v":99.020875486848922},null,null,null,{"$f":"IF(MAX(C105:C116)-MIN(C105:C116)<5,AVERAGEIF(C105:C116,\">0\",M105:M116),\nIF(FORECAST($C102,M$105:M$116,$C$105:$C$116)<0,0,\nIF(FORECAST($C102,M$105:M$116,$C$105:$C$116)>100,100,\nFORECAST($C102,M$105:M$116,$C$105:$C$116))))","v":0},{"$f":"IF(MAX(C105:C116)-MIN(C105:C116)<5,AVERAGEIF(C105:C116,\">0\",N105:N116),\nIF(FORECAST($C102,N$105:N$116,$C$105:$C$116)<0,0,\nIF(FORECAST($C102,N$105:N$116,$C$105:$C$116)>100,100,\nFORECAST($C102,N$105:N$116,$C$105:$C$116))))","v":99.710543044406876},null,null,null,{"$f":"IF(MAX(C105:C116)-MIN(C105:C116)<5,AVERAGEIF(C105:C116,\">0\",R105:R116),\nIF(FORECAST($C102,R$105:R$116,$C$105:$C$116)<0,0,\nIF(FORECAST($C102,R$105:R$116,$C$105:$C$116)>100,100,\nFORECAST($C102,R$105:R$116,$C$105:$C$116))))","v":0},{"$f":"IF(MAX(C105:C116)-MIN(C105:C116)<5,AVERAGEIF(C105:C116,\">0\",S105:S116),\nIF(FORECAST($C102,S$105:S$116,$C$105:$C$116)<0,0,\nIF(FORECAST($C102,S$105:S$116,$C$105:$C$116)>100,100,\nFORECAST($C102,S$105:S$116,$C$105:$C$116))))","v":99.115236545328344},null,null,null,{"$f":"IF(MAX(C105:C116)-MIN(C105:C116)<5,AVERAGEIF(C105:C116,\">0\",W105:W116),\nIF(FORECAST($C102,W$105:W$116,$C$105:$C$116)<0,0,\nIF(FORECAST($C102,W$105:W$116,$C$105:$C$116)>100,100,\nFORECAST($C102,W$105:W$116,$C$105:$C$116))))","v":0},{"$f":"IF(MAX(C105:C116)-MIN(C105:C116)<5,AVERAGEIF(C105:C116,\">0\",X105:X116),\nIF(FORECAST($C102,X$105:X$116,$C$105:$C$116)<0,0,\nIF(FORECAST($C102,X$105:X$116,$C$105:$C$116)>100,100,\nFORECAST($C102,X$105:X$116,$C$105:$C$116))))","v":99.307183736562692},null,null,null,{"$f":"IF(MAX(C105:C116)-MIN(C105:C116)<5,AVERAGEIF(C105:C116,\">0\",AB105:AB116),\nIF(FORECAST($C102,AB$105:AB$116,$C$105:$C$116)<0,0,\nIF(FORECAST($C102,AB$105:AB$116,$C$105:$C$116)>100,100,\nFORECAST($C102,AB$105:AB$116,$C$105:$C$116))))","v":0}]
[]
[null,"Survey","Year","Improved","% Improved\n< = 30min",null,null,"Surface water","Improved","% Improved\n< = 30min",null,null,"Surface water","Improved","% Improved\n< = 30min",null,null,"Surface water","Improved","% Improved\n< = 30min",null,null,"Surface water","Improved","% Improved\n< = 30min",null,null,"Surface water"]
[null,"MICS06",2006,{"$f":"IF(ISERROR(INDIRECT(CONCATENATE($B105,\"!C16\"))),\"\",INDIRECT(CONCATENATE($B105,\"!C16\")))","v":94.260101814274819},{"$f":"IF(ISERROR(INDIRECT(CONCATENATE($B105,\"!C23\"))),\"\",INDIRECT(CONCATENATE($B105,\"!C23\")))","v":99.309520376474566},null,null,{"$f":"IF(ISERROR(INDIRECT(CONCATENATE($B105,\"!C21\"))),\"\",INDIRECT(CONCATENATE($B105,\"!C21\")))","v":1.2846971456879381},{"$f":"IF(ISERROR(INDIRECT(CONCATENATE($B105,\"!D16\"))),\"\",INDIRECT(CONCATENATE($B105,\"!D16\")))","v":99.22447325577302},{"$f":"IF(ISERROR(INDIRECT(CONCATENATE($B105,\"!D23\"))),\"\",INDIRECT(CONCATENATE($B105,\"!D23\")))","v":99.718079385414683},null,null,{"$f":"IF(ISERROR(INDIRECT(CONCATENATE($B105,\"!D21\"))),\"\",INDIRECT(CONCATENATE($B105,\"!D21\")))","v":0},{"$f":"IF(ISERROR(INDIRECT(CONCATENATE($B105,\"!E16\"))),\"\",INDIRECT(CONCATENATE($B105,\"!E16\")))","v":99.445414271064621},{"$f":"IF(ISERROR(INDIRECT(CONCATENATE($B105,\"!E23\"))),\"\",INDIRECT(CONCATENATE($B105,\"!E23\")))","v":100},null,null,{"$f":"IF(ISERROR(INDIRECT(CONCATENATE($B105,\"!E21\"))),\"\",INDIRECT(CONCATENATE($B105,\"!E21\")))","v":0},{"$f":"IF(ISERROR(INDIRECT(CONCATENATE($B105,\"!F16\"))),\"\",INDIRECT(CONCATENATE($B105,\"!F16\")))","v":100},{"$f":"IF(ISERROR(INDIRECT(CONCATENATE($B105,\"!F23\"))),\"\",INDIRECT(CONCATENATE($B105,\"!F23\")))","v":100},null,null,{"$f":"IF(ISERROR(INDIRECT(CONCATENATE($B105,\"!F21\"))),\"\",INDIRECT(CONCATENATE($B105,\"!F21\")))","v":0},{"$f":"IF(ISERROR(INDIRECT(CONCATENATE($B105,\"!G16\"))),\"\",INDIRECT(CONCATENATE($B105,\"!G16\")))","v":100},{"$f":"IF(ISERROR(INDIRECT(CONCATENATE($B105,\"!G23\"))),\"\",INDIRECT(CONCATENATE($B105,\"!G23\")))","v":99.726259370417154},null,null,{"$f":"IF(ISERROR(INDIRECT(CONCATENATE($B105,\"!G221\"))),\"\",INDIRECT(CONCATENATE($B105,\"!G21\")))","v":0}]
[null,"MICS13",2013,98.3,98.6,null,null,0,99.5,99.2,null,null,0,99.7,99.1,null,null,0,100,98.7,null,null,0,99.9,98.6,null,null,0]
[null,"MICS18",2018,99.065344094371824,99.82967641634221,null,null,"N/A",98.886391151746267,99.400895377322072,null,null,"N/A",99.619771554031615,99.928809341985854,null,null,"N/A",99.049859935377256,99.758228124902942,null,null,"N/A",99.299340170298862,99.676382564771941,null,null,"N/A"]
[null,null,null,"","",null,null,"","","",null,null,"","","",null,null,"","","",null,null,"","","",null,null,""]
[null,null,null,"","",null,null,"","","",null,null,"","","",null,null,"","","",null,null,"","","",null,null,""]
[null,null,null,"","",null,null,"","","",null,null,"","","",null,null,"","","",null,null,"","","",null,null,""]
[null,null,null,{"$f":"IF(ISERROR(INDIRECT(CONCATENATE($B111,\"!C16\"))),\"\",INDIRECT(CONCATENATE($B111,\"!C16\")))","v":""},{"$f":"IF(ISERROR(INDIRECT(CONCATENATE($B111,\"!C23\"))),\"\",INDIRECT(CONCATENATE($B111,\"!C23\")))","v":""},null,null,{"$f":"IF(ISERROR(INDIRECT(CONCATENATE($B111,\"!C21\"))),\"\",INDIRECT(CONCATENATE($B111,\"!C21\")))","v":""},{"$f":"IF(ISERROR(INDIRECT(CONCATENATE($B111,\"!D16\"))),\"\",INDIRECT(CONCATENATE($B111,\"!D16\")))","v":""},{"$f":"IF(ISERROR(INDIRECT(CONCATENATE($B111,\"!D23\"))),\"\",INDIRECT(CONCATENATE($B111,\"!D23\")))","v":""},null,null,{"$f":"IF(ISERROR(INDIRECT(CONCATENATE($B111,\"!D21\"))),\"\",INDIRECT(CONCATENATE($B111,\"!D21\")))","v":""},{"$f":"IF(ISERROR(INDIRECT(CONCATENATE($B111,\"!E16\"))),\"\",INDIRECT(CONCATENATE($B111,\"!E16\")))","v":""},{"$f":"IF(ISERROR(INDIRECT(CONCATENATE($B111,\"!E23\"))),\"\",INDIRECT(CONCATENATE($B111,\"!E23\")))","v":""},null,null,{"$f":"IF(ISERROR(INDIRECT(CONCATENATE($B111,\"!E21\"))),\"\",INDIRECT(CONCATENATE($B111,\"!E21\")))","v":""},{"$f":"IF(ISERROR(INDIRECT(CONCATENATE($B111,\"!F16\"))),\"\",INDIRECT(CONCATENATE($B111,\"!F16\")))","v":""},{"$f":"IF(ISERROR(INDIRECT(CONCATENATE($B111,\"!F23\"))),\"\",INDIRECT(CONCATENATE($B111,\"!F23\")))","v":""},null,null,{"$f":"IF(ISERROR(INDIRECT(CONCATENATE($B111,\"!F21\"))),\"\",INDIRECT(CONCATENATE($B111,\"!F21\")))","v":""},{"$f":"IF(ISERROR(INDIRECT(CONCATENATE($B111,\"!G16\"))),\"\",INDIRECT(CONCATENATE($B111,\"!G16\")))","v":""},{"$f":"IF(ISERROR(INDIRECT(CONCATENATE($B111,\"!G23\"))),\"\",INDIRECT(CONCATENATE($B111,\"!G23\")))","v":""},null,null,{"$f":"IF(ISERROR(INDIRECT(CONCATENATE($B111,\"!G221\"))),\"\",INDIRECT(CONCATENATE($B111,\"!G21\")))","v":""}]
[null,null,null,{"$f":"IF(ISERROR(INDIRECT(CONCATENATE($B112,\"!C16\"))),\"\",INDIRECT(CONCATENATE($B112,\"!C16\")))","v":""},{"$f":"IF(ISERROR(INDIRECT(CONCATENATE($B112,\"!C23\"))),\"\",INDIRECT(CONCATENATE($B112,\"!C23\")))","v":""},null,null,{"$f":"IF(ISERROR(INDIRECT(CONCATENATE($B112,\"!C21\"))),\"\",INDIRECT(CONCATENATE($B112,\"!C21\")))","v":""},{"$f":"IF(ISERROR(INDIRECT(CONCATENATE($B112,\"!D16\"))),\"\",INDIRECT(CONCATENATE($B112,\"!D16\")))","v":""},{"$f":"IF(ISERROR(INDIRECT(CONCATENATE($B112,\"!D23\"))),\"\",INDIRECT(CONCATENATE($B112,\"!D23\")))","v":""},null,null,{"$f":"IF(ISERROR(INDIRECT(CONCATENATE($B112,\"!D21\"))),\"\",INDIRECT(CONCATENATE($B112,\"!D21\")))","v":""},{"$f":"IF(ISERROR(INDIRECT(CONCATENATE($B112,\"!E16\"))),\"\",INDIRECT(CONCATENATE($B112,\"!E16\")))","v":""},{"$f":"IF(ISERROR(INDIRECT(CONCATENATE($B112,\"!E23\"))),\"\",INDIRECT(CONCATENATE($B112,\"!E23\")))","v":""},null,null,{"$f":"IF(ISERROR(INDIRECT(CONCATENATE($B112,\"!E21\"))),\"\",INDIRECT(CONCATENATE($B112,\"!E21\")))","v":""},{"$f":"IF(ISERROR(INDIRECT(CONCATENATE($B112,\"!F16\"))),\"\",INDIRECT(CONCATENATE($B112,\"!F16\")))","v":""},{"$f":"IF(ISERROR(INDIRECT(CONCATENATE($B112,\"!F23\"))),\"\",INDIRECT(CONCATENATE($B112,\"!F23\")))","v":""},null,null,{"$f":"IF(ISERROR(INDIRECT(CONCATENATE($B112,\"!F21\"))),\"\",INDIRECT(CONCATENATE($B112,\"!F21\")))","v":""},{"$f":"IF(ISERROR(INDIRECT(CONCATENATE($B112,\"!G16\"))),\"\",INDIRECT(CONCATENATE($B112,\"!G16\")))","v":""},{"$f":"IF(ISERROR(INDIRECT(CONCATENATE($B112,\"!G23\"))),\"\",INDIRECT(CONCATENATE($B112,\"!G23\")))","v":""},null,null,{"$f":"IF(ISERROR(INDIRECT(CONCATENATE($B112,\"!G221\"))),\"\",INDIRECT(CONCATENATE($B112,\"!G21\")))","v":""}]
[null,null,null,"","",null,null,"","","",null,null,"","","",null,null,"","","",null,null,"","","",null,null,""]
[null,null,null,"","",null,null,"","","",null,null,"","","",null,null,"","","",null,null,"","","",null,null,""]
[null,null,null,"","",null,null,"","","",null,null,"","","",null,null,"","","",null,null,"","","",null,null,""]
[null,null,null,"","",null,null,"","","",null,null,"","","",null,null,"","","",null,null,"","","",null,null,""]
[]
[null,{"$f":"CONCATENATE(\"National use of drinking water sources, \",C99,\"–\",C100)","v":"National use of drinking water sources, 2000–2020"},null,null,null,null,null,null,null,null,null,null,null,null,null,null,null,null,"Data points used for regression"]
[]
[]
[]
[]
[]
[]
[]
[]
[]
[]
[]
[]
[]
[]
[]
[]
[]
[]
[]
[]
[]
[]
[]
[]
[]
[]
[]
[]
[]
[]
[]
[]
[]
[]
[null,null,null,null,{"$f":"IF(ISERROR(INDIRECT(CONCATENATE($B153,\"!M18\"))),\"\",INDIRECT(CONCATENATE($B153,\"!M18\")))","v":""},{"$f":"IF(ISERROR(INDIRECT(CONCATENATE($B153,\"!M19\"))),\"\",INDIRECT(CONCATENATE($B153,\"!M19\")))","v":""},{"$f":"IF(ISERROR(INDIRECT(CONCATENATE($B153,\"!M20\"))),\"\",INDIRECT(CONCATENATE($B153,\"!M20\")))","v":""},{"$f":"IF(ISERROR(INDIRECT(CONCATENATE($B153,\"!M21\"))),\"\",INDIRECT(CONCATENATE($B153,\"!M21\")))","v":""},null,{"$f":"IF(ISERROR(INDIRECT(CONCATENATE($B153,\"!N18\"))),\"\",INDIRECT(CONCATENATE($B153,\"!N18\")))","v":""},{"$f":"IF(ISERROR(INDIRECT(CONCATENATE($B153,\"!N19\"))),\"\",INDIRECT(CONCATENATE($B153,\"!N19\")))","v":""},{"$f":"IF(ISERROR(INDIRECT(CONCATENATE($B153,\"!N20\"))),\"\",INDIRECT(CONCATENATE($B153,\"!N20\")))","v":""},{"$f":"IF(ISERROR(INDIRECT(CONCATENATE($B153,\"!N21\"))),\"\",INDIRECT(CONCATENATE($B153,\"!N21\")))","v":""},null,{"$f":"IF(ISERROR(INDIRECT(CONCATENATE($B153,\"!O18\"))),\"\",INDIRECT(CONCATENATE($B153,\"!O18\")))","v":""},{"$f":"IF(ISERROR(INDIRECT(CONCATENATE($B153,\"!O19\"))),\"\",INDIRECT(CONCATENATE($B153,\"!O19\")))","v":""},{"$f":"IF(ISERROR(INDIRECT(CONCATENATE($B153,\"!O20\"))),\"\",INDIRECT(CONCATENATE($B153,\"!O20\")))","v":""},{"$f":"IF(ISERROR(INDIRECT(CONCATENATE($B153,\"!O21\"))),\"\",INDIRECT(CONCATENATE($B153,\"!O21\")))","v":""},null,{"$f":"IF(ISERROR(INDIRECT(CONCATENATE($B153,\"!P18\"))),\"\",INDIRECT(CONCATENATE($B153,\"!P18\")))","v":""},{"$f":"IF(ISERROR(INDIRECT(CONCATENATE($B153,\"!P19\"))),\"\",INDIRECT(CONCATENATE($B153,\"!P19\")))","v":""},{"$f":"IF(ISERROR(INDIRECT(CONCATENATE($B153,\"!P20\"))),\"\",INDIRECT(CONCATENATE($B153,\"!P20\")))","v":""},{"$f":"IF(ISERROR(INDIRECT(CONCATENATE($B153,\"!P21\"))),\"\",INDIRECT(CONCATENATE($B153,\"!P21\")))","v":""},null,{"$f":"IF(ISERROR(INDIRECT(CONCATENATE($B153,\"!Q18\"))),\"\",INDIRECT(CONCATENATE($B153,\"!Q18\")))","v":""},{"$f":"IF(ISERROR(INDIRECT(CONCATENATE($B153,\"!Q19\"))),\"\",INDIRECT(CONCATENATE($B153,\"!Q19\")))","v":""},{"$f":"IF(ISERROR(INDIRECT(CONCATENATE($B153,\"!Q20\"))),\"\",INDIRECT(CONCATENATE($B153,\"!Q20\")))","v":""},{"$f":"IF(ISERROR(INDIRECT(CONCATENATE($B153,\"!Q21\"))),\"\",INDIRECT(CONCATENATE($B153,\"!Q1\")))","v":""}]
[null,null,null,null,"","","","",null,"","","","",null,"","","","",null,"","","","",null,"","","",""]
[null,null,null,null,"","","","",null,"","","","",null,"","","","",null,"","","","",null,"","","",""]
[null,null,null,null,"","","","",null,"","","","",null,"","","","",null,"","","","",null,"","","",""]
[null,null,null,null,"","","","",null,"","","","",null,"","","","",null,"","","","",null,"","","",""]
[null,null,null,null,"","","","",null,"","","","",null,"","","","",null,"","","","",null,"","","",""]
[]
[]
[]
[]
[]
[]
[]
[]
[]
[]
[]
[]
[]
[]
[]
[]
[]
[]
[]
[]
[]
[]
[]
[]
[]
[]
[]
[]
[]
[]
[]
[]
[]
[]
[]
[]
[]
[]
["URBAN",null,null,"Poorest",null,null,null,null,"Poor",null,null,null,null,"Middle",null,null,null,null,"Rich",null,null,null,null,"Richest"]
[null,null,null,"Improved","Basic","Limited","Unimproved","Surface water","Improved","Basic","Limited","Unimproved","Surface water","Improved","Basic","Limited","Unimproved","Surface water","Improved","Basic","Limited","Unimproved","Surface water","Improved","Basic","Limited","Unimproved","Surface water"]
["Forecast period:",null,2000,{"$f":"IF((D201+H201)>100,D201*100/(D201+H201),D201)","v":100},{"$f":"D199*AVERAGEIF(E205:E216,\">0\")/100","v":99.1953297285567},{"$f":"D199*(100-AVERAGEIF(E205:E216,\">0\"))/100","v":0.80467027144329961},{"$f":"100-(E199+F199+H199)","v":0},{"$f":"IF((D201+H201)>100,H201*100/(D201+H201),H201)","v":0},{"$f":"IF((I201+M201)>100,I201*100/(I201+M201),I201)","v":100},{"$f":"I199*AVERAGEIF(J205:J216,\">0\")/100","v":99.425190252058641},{"$f":"I199*(100-AVERAGEIF(J205:J216,\">0\"))/100","v":0.57480974794135875},{"$f":"100-(J199+K199+M199)","v":0},{"$f":"IF((I201+M201)>100,M201*100/(I201+M201),M201)","v":0},{"$f":"IF((N201+R201)>100,N201*100/(N201+R201),N201)","v":100},{"$f":"N199*AVERAGEIF(O205:O216,\">0\")/100","v":99.55557613485135},{"$f":"N199*(100-AVERAGEIF(O205:O216,\">0\"))/100","v":0.44442386514866428},{"$f":"100-(O199+P199+R199)","v":0},{"$f":"IF((N201+R201)>100,R201*100/(N201+R201),R201)","v":0},{"$f":"IF((S201+W201)>100,S201*100/(S201+W201),S201)","v":100},{"$f":"S199*AVERAGEIF(T205:T216,\">0\")/100","v":99.566666666666663},{"$f":"S199*(100-AVERAGEIF(T205:T216,\">0\"))/100","v":0.43333333333333712},{"$f":"100-(T199+U199+W199)","v":0},{"$f":"IF((S201+W201)>100,W201*100/(S201+W201),W201)","v":0},{"$f":"IF((X201+AB201)>100,X201*100/(X201+AB201),X201)","v":100},{"$f":"X199*AVERAGEIF(Y205:Y216,\">0\")/100","v":99.505409455756379},{"$f":"X199*(100-AVERAGEIF(Y205:Y216,\">0\"))/100","v":0.49459054424362137},{"$f":"100-(Y199+Z199+AB199)","v":0},{"$f":"IF((X201+AB201)>100,AB201*100/(X201+AB201),AB201)","v":0}]
[null,null,2020,{"$f":"IF((D202+H202)>100,D202*100/(D202+H202),D202)","v":100},{"$f":"D200*AVERAGEIF(E205:E216,\">0\")/100","v":99.1953297285567},{"$f":"D200*(100-AVERAGEIF(E205:E216,\">0\"))/100","v":0.80467027144329961},{"$f":"100-(E200+F200+H200)","v":0},{"$f":"IF((D202+H202)>100,H202*100/(D202+H202),H202)","v":0},{"$f":"IF((I202+M202)>100,I202*100/(I202+M202),I202)","v":99.625552931984629},{"$f":"I200*AVERAGEIF(J205:J216,\">0\")/100","v":99.052895542291097},{"$f":"I200*(100-AVERAGEIF(J205:J216,\">0\"))/100","v":0.57265738969352575},{"$f":"100-(J200+K200+M200)","v":0.37444706801537109},{"$f":"IF((I202+M202)>100,M202*100/(I202+M202),M202)","v":0},{"$f":"IF((N202+R202)>100,N202*100/(N202+R202),N202)","v":100},{"$f":"N200*AVERAGEIF(O205:O216,\">0\")/100","v":99.55557613485135},{"$f":"N200*(100-AVERAGEIF(O205:O216,\">0\"))/100","v":0.44442386514866428},{"$f":"100-(O200+P200+R200)","v":0},{"$f":"IF((N202+R202)>100,R202*100/(N202+R202),R202)","v":0},{"$f":"IF((S202+W202)>100,S202*100/(S202+W202),S202)","v":99.711498499450954},{"$f":"S200*AVERAGEIF(T205:T216,\">0\")/100","v":99.279415339286658},{"$f":"S200*(100-AVERAGEIF(T205:T216,\">0\"))/100","v":0.43208316016429121},{"$f":"100-(T200+U200+W200)","v":0.28850150054904589},{"$f":"IF((S202+W202)>100,W202*100/(S202+W202),W202)","v":0},{"$f":"IF((X202+AB202)>100,X202*100/(X202+AB202),X202)","v":99.719234612861527},{"$f":"X200*AVERAGEIF(Y205:Y216,\">0\")/100","v":99.226032707674207},{"$f":"X200*(100-AVERAGEIF(Y205:Y216,\">0\"))/100","v":0.49320190518732543},{"$f":"100-(Y200+Z200+AB200)","v":0.28076538713847299},{"$f":"IF((X202+AB202)>100,AB202*100/(X202+AB202),AB202)","v":0}]
["Regression period:",null,{"$f":"MinRegYear(C199,C205:C216)","v":2004},{"$f":"IF(MAX(C205:C216)-MIN(C205:C216)<5,AVERAGEIF(C205:C216,\">0\",D205:D216),\nIF(FORECAST($C201,D$205:D$216,$C$205:$C$216)<0,0,\nIF(FORECAST($C201,D$205:D$216,$C$205:$C$216)>100,100,\nFORECAST($C201,D$205:D$216,$C$205:$C$216))))","v":100},null,null,null,{"$f":"IF(MAX(C205:C216)-MIN(C205:C216)<5,AVERAGEIF(C205:C216,\">0\",H205:H216),\nIF(FORECAST($C201,H$205:H$216,$C$205:$C$216)<0,0,\nIF(FORECAST($C201,H$205:H$216,$C$205:$C$216)>100,100,\nFORECAST($C201,H$205:H$216,$C$205:$C$216))))","v":0},{"$f":"IF(MAX(C205:C216)-MIN(C205:C216)<5,AVERAGEIF(C205:C216,\">0\",I205:I216),\nIF(FORECAST($C201,I$205:I$216,$C$205:$C$216)<0,0,\nIF(FORECAST($C201,I$205:I$216,$C$205:$C$216)>100,100,\nFORECAST($C201,I$205:I$216,$C$205:$C$216))))","v":100},null,null,null,{"$f":"IF(MAX(C205:C216)-MIN(C205:C216)<5,AVERAGEIF(C205:C216,\">0\",M205:M216),\nIF(FORECAST($C201,M$205:M$216,$C$205:$C$216)<0,0,\nIF(FORECAST($C201,M$205:M$216,$C$205:$C$216)>100,100,\nFORECAST($C201,M$205:M$216,$C$205:$C$216))))","v":0},{"$f":"IF(MAX(C205:C216)-MIN(C205:C216)<5,AVERAGEIF(C205:C216,\">0\",N205:N216),\nIF(FORECAST($C201,N$205:N$216,$C$205:$C$216)<0,0,\nIF(FORECAST($C201,N$205:N$216,$C$205:$C$216)>100,100,\nFORECAST($C201,N$205:N$216,$C$205:$C$216))))","v":100},null,null,null,{"$f":"IF(MAX(C205:C216)-MIN(C205:C216)<5,AVERAGEIF(C205:C216,\">0\",R205:R216),\nIF(FORECAST($C201,R$205:R$216,$C$205:$C$216)<0,0,\nIF(FORECAST($C201,R$205:R$216,$C$205:$C$216)>100,100,\nFORECAST($C201,R$205:R$216,$C$205:$C$216))))","v":0},{"$f":"IF(MAX(C205:C216)-MIN(C205:C216)<5,AVERAGEIF(C205:C216,\">0\",S205:S216),\nIF(FORECAST($C201,S$205:S$216,$C$205:$C$216)<0,0,\nIF(FORECAST($C201,S$205:S$216,$C$205:$C$216)>100,100,\nFORECAST($C201,S$205:S$216,$C$205:$C$216))))","v":100},null,null,null,{"$f":"IF(MAX(C205:C216)-MIN(C205:C216)<5,AVERAGEIF(C205:C216,\">0\",W205:W216),\nIF(FORECAST($C201,W$205:W$216,$C$205:$C$216)<0,0,\nIF(FORECAST($C201,W$205:W$216,$C$205:$C$216)>100,100,\nFORECAST($C201,W$205:W$216,$C$205:$C$216))))","v":0},{"$f":"IF(MAX(C205:C216)-MIN(C205:C216)<5,AVERAGEIF(C205:C216,\">0\",X205:X216),\nIF(FORECAST($C201,X$205:X$216,$C$205:$C$216)<0,0,\nIF(FORECAST($C201,X$205:X$216,$C$205:$C$216)>100,100,\nFORECAST($C201,X$205:X$216,$C$205:$C$216))))","v":100},null,null,null,{"$f":"IF(MAX(C205:C216)-MIN(C205:C216)<5,AVERAGEIF(C205:C216,\">0\",AB205:AB216),\nIF(FORECAST($C201,AB$205:AB$216,$C$205:$C$216)<0,0,\nIF(FORECAST($C201,AB$205:AB$216,$C$205:$C$216)>100,100,\nFORECAST($C201,AB$205:AB$216,$C$205:$C$216))))","v":0}]
[null,null,{"$f":"MaxRegYear(C200,C205:C216)","v":2020},{"$f":"IF(MAX(C205:C216)-MIN(C205:C216)<5,AVERAGEIF(C205:C216,\">0\",D205:D216),\nIF(FORECAST($C202,D$205:D$216,$C$205:$C$216)<0,0,\nIF(FORECAST($C202,D$205:D$216,$C$205:$C$216)>100,100,\nFORECAST($C202,D$205:D$216,$C$205:$C$216))))","v":100},null,null,null,{"$f":"IF(MAX(C205:C216)-MIN(C205:C216)<5,AVERAGEIF(C205:C216,\">0\",H205:H216),\nIF(FORECAST($C202,H$205:H$216,$C$205:$C$216)<0,0,\nIF(FORECAST($C202,H$205:H$216,$C$205:$C$216)>100,100,\nFORECAST($C202,H$205:H$216,$C$205:$C$216))))","v":0},{"$f":"IF(MAX(C205:C216)-MIN(C205:C216)<5,AVERAGEIF(C205:C216,\">0\",I205:I216),\nIF(FORECAST($C202,I$205:I$216,$C$205:$C$216)<0,0,\nIF(FORECAST($C202,I$205:I$216,$C$205:$C$216)>100,100,\nFORECAST($C202,I$205:I$216,$C$205:$C$216))))","v":99.625552931984629},null,null,null,{"$f":"IF(MAX(C205:C216)-MIN(C205:C216)<5,AVERAGEIF(C205:C216,\">0\",M205:M216),\nIF(FORECAST($C202,M$205:M$216,$C$205:$C$216)<0,0,\nIF(FORECAST($C202,M$205:M$216,$C$205:$C$216)>100,100,\nFORECAST($C202,M$205:M$216,$C$205:$C$216))))","v":0},{"$f":"IF(MAX(C205:C216)-MIN(C205:C216)<5,AVERAGEIF(C205:C216,\">0\",N205:N216),\nIF(FORECAST($C202,N$205:N$216,$C$205:$C$216)<0,0,\nIF(FORECAST($C202,N$205:N$216,$C$205:$C$216)>100,100,\nFORECAST($C202,N$205:N$216,$C$205:$C$216))))","v":100},null,null,null,{"$f":"IF(MAX(C205:C216)-MIN(C205:C216)<5,AVERAGEIF(C205:C216,\">0\",R205:R216),\nIF(FORECAST($C202,R$205:R$216,$C$205:$C$216)<0,0,\nIF(FORECAST($C202,R$205:R$216,$C$205:$C$216)>100,100,\nFORECAST($C202,R$205:R$216,$C$205:$C$216))))","v":0},{"$f":"IF(MAX(C205:C216)-MIN(C205:C216)<5,AVERAGEIF(C205:C216,\">0\",S205:S216),\nIF(FORECAST($C202,S$205:S$216,$C$205:$C$216)<0,0,\nIF(FORECAST($C202,S$205:S$216,$C$205:$C$216)>100,100,\nFORECAST($C202,S$205:S$216,$C$205:$C$216))))","v":99.711498499450954},null,null,null,{"$f":"IF(MAX(C205:C216)-MIN(C205:C216)<5,AVERAGEIF(C205:C216,\">0\",W205:W216),\nIF(FORECAST($C202,W$205:W$216,$C$205:$C$216)<0,0,\nIF(FORECAST($C202,W$205:W$216,$C$205:$C$216)>100,100,\nFORECAST($C202,W$205:W$216,$C$205:$C$216))))","v":0},{"$f":"IF(MAX(C205:C216)-MIN(C205:C216)<5,AVERAGEIF(C205:C216,\">0\",X205:X216),\nIF(FORECAST($C202,X$205:X$216,$C$205:$C$216)<0,0,\nIF(FORECAST($C202,X$205:X$216,$C$205:$C$216)>100,100,\nFORECAST($C202,X$205:X$216,$C$205:$C$216))))","v":99.719234612861527},null,null,null,{"$f":"IF(MAX(C205:C216)-MIN(C205:C216)<5,AVERAGEIF(C205:C216,\">0\",AB205:AB216),\nIF(FORECAST($C202,AB$205:AB$216,$C$205:$C$216)<0,0,\nIF(FORECAST($C202,AB$205:AB$216,$C$205:$C$216)>100,100,\nFORECAST($C202,AB$205:AB$216,$C$205:$C$216))))","v":0}]
[]
[null,"Survey","Year","Improved","% Improved\n< = 30min",null,null,"Surface water","Improved","% Improved\n< = 30min",null,null,"Surface water","Improved","% Improved\n< = 30min",null,null,"Surface water","Improved","% Improved\n< = 30min",null,null,"Surface water","Improved","% Improved\n< = 30min",null,null,"Surface water"]
[null,"MICS06",2006,{"$f":"IF(ISERROR(INDIRECT(CONCATENATE($B205,\"!H16\"))),\"\",INDIRECT(CONCATENATE($B205,\"!H16\")))","v":100},{"$f":"IF(ISERROR(INDIRECT(CONCATENATE($B205,\"!H23\"))),\"\",INDIRECT(CONCATENATE($B205,\"!H23\")))","v":99.785989185670061},null,null,{"$f":"IF(ISERROR(INDIRECT(CONCATENATE($B205,\"!H21\"))),\"\",INDIRECT(CONCATENATE($B205,\"!H21\")))","v":0},{"$f":"IF(ISERROR(INDIRECT(CONCATENATE($B205,\"!I16\"))),\"\",INDIRECT(CONCATENATE($B205,\"!I16\")))","v":100},{"$f":"IF(ISERROR(INDIRECT(CONCATENATE($B205,\"!I23\"))),\"\",INDIRECT(CONCATENATE($B205,\"!I23\")))","v":100},null,null,{"$f":"IF(ISERROR(INDIRECT(CONCATENATE($B205,\"!I21\"))),\"\",INDIRECT(CONCATENATE($B205,\"!I21\")))","v":0},{"$f":"IF(ISERROR(INDIRECT(CONCATENATE($B205,\"!J16\"))),\"\",INDIRECT(CONCATENATE($B205,\"!J16\")))","v":100},{"$f":"IF(ISERROR(INDIRECT(CONCATENATE($B205,\"!J23\"))),\"\",INDIRECT(CONCATENATE($B205,\"!J23\")))","v":100},null,null,{"$f":"IF(ISERROR(INDIRECT(CONCATENATE($B205,\"!J21\"))),\"\",INDIRECT(CONCATENATE($B205,\"!J21\")))","v":0},{"$f":"IF(ISERROR(INDIRECT(CONCATENATE($B205,\"!K16\"))),\"\",INDIRECT(CONCATENATE($B205,\"!K16\")))","v":100},{"$f":"IF(ISERROR(INDIRECT(CONCATENATE($B205,\"!K23\"))),\"\",INDIRECT(CONCATENATE($B205,\"!K23\")))","v":100},null,null,{"$f":"IF(ISERROR(INDIRECT(CONCATENATE($B205,\"!K21\"))),\"\",INDIRECT(CONCATENATE($B205,\"!K21\")))","v":0},{"$f":"IF(ISERROR(INDIRECT(CONCATENATE($B205,\"!L16\"))),\"\",INDIRECT(CONCATENATE($B205,\"!L16\")))","v":100},{"$f":"IF(ISERROR(INDIRECT(CONCATENATE($B205,\"!L23\"))),\"\",INDIRECT(CONCATENATE($B205,\"!L23\")))","v":100},null,null,{"$f":"IF(ISERROR(INDIRECT(CONCATENATE($B205,\"!L221\"))),\"\",INDIRECT(CONCATENATE($B205,\"!L21\")))","v":0}]
[null,"MICS13",2013,100,97.8,null,null,0,100,98.9,null,null,0,100,98.7,null,null,0,100,98.7,null,null,0,99.9,99,null,null,0]
[null,"MICS18",2018,100,100,null,null,"N/A",99.597884429421939,99.375570756175918,null,null,"N/A",100,99.966728404554033,null,null,"N/A",99.690180654582818,100,null,null,"N/A",99.741838155683809,99.51622836726915,null,null,"N/A"]
[null,null,null,"","",null,null,"","","",null,null,"","","",null,null,"","","",null,null,"","","",null,null,""]
[null,null,null,"","",null,null,"","","",null,null,"","","",null,null,"","","",null,null,"","","",null,null,""]
[null,null,null,"","",null,null,"","","",null,null,"","","",null,null,"","","",null,null,"","","",null,null,""]
[null,null,null,"","",null,null,"","","",null,null,"","","",null,null,"","","",null,null,"","","",null,null,""]
[null,null,null,"","",null,null,"","","",null,null,"","","",null,null,"","","",null,null,"","","",null,null,""]
[null,null,null,"","",null,null,"","","",null,null,"","","",null,null,"","","",null,null,"","","",null,null,""]
[null,null,null,"","",null,null,"","","",null,null,"","","",null,null,"","","",null,null,"","","",null,null,""]
[null,null,null,"","",null,null,"","","",null,null,"","","",null,null,"","","",null,null,"","","",null,null,""]
[null,null,null,"","",null,null,"","","",null,null,"","","",null,null,"","","",null,null,"","","",null,null,""]
[]
[null,{"$f":"CONCATENATE(\"Urban use of drinking water sources,  \",C199,\"–\",C200)","v":"Urban use of drinking water sources,  2000–2020"},null,null,null,null,null,null,null,null,null,null,null,null,null,null,null,null,"Data points used for regression"]
[]
[]
[]
[]
[]
[]
[]
[]
[]
[]
[]
[]
[]
[]
[]
[]
[]
[]
[]
[]
[]
[]
[]
[]
[]
[]
[]
[]
[]
[]
[]
[]
[]
[]
[null,null,null,null,{"$f":"IF(ISERROR(INDIRECT(CONCATENATE($B253,\"!M18\"))),\"\",INDIRECT(CONCATENATE($B253,\"!M18\")))","v":""},{"$f":"IF(ISERROR(INDIRECT(CONCATENATE($B253,\"!M19\"))),\"\",INDIRECT(CONCATENATE($B253,\"!M19\")))","v":""},{"$f":"IF(ISERROR(INDIRECT(CONCATENATE($B253,\"!M20\"))),\"\",INDIRECT(CONCATENATE($B253,\"!M20\")))","v":""},{"$f":"IF(ISERROR(INDIRECT(CONCATENATE($B253,\"!M21\"))),\"\",INDIRECT(CONCATENATE($B253,\"!M21\")))","v":""},null,{"$f":"IF(ISERROR(INDIRECT(CONCATENATE($B253,\"!N18\"))),\"\",INDIRECT(CONCATENATE($B253,\"!N18\")))","v":""},{"$f":"IF(ISERROR(INDIRECT(CONCATENATE($B253,\"!N19\"))),\"\",INDIRECT(CONCATENATE($B253,\"!N19\")))","v":""},{"$f":"IF(ISERROR(INDIRECT(CONCATENATE($B253,\"!N20\"))),\"\",INDIRECT(CONCATENATE($B253,\"!N20\")))","v":""},{"$f":"IF(ISERROR(INDIRECT(CONCATENATE($B253,\"!N21\"))),\"\",INDIRECT(CONCATENATE($B253,\"!N21\")))","v":""},null,{"$f":"IF(ISERROR(INDIRECT(CONCATENATE($B253,\"!O18\"))),\"\",INDIRECT(CONCATENATE($B253,\"!O18\")))","v":""},{"$f":"IF(ISERROR(INDIRECT(CONCATENATE($B253,\"!O19\"))),\"\",INDIRECT(CONCATENATE($B253,\"!O19\")))","v":""},{"$f":"IF(ISERROR(INDIRECT(CONCATENATE($B253,\"!O20\"))),\"\",INDIRECT(CONCATENATE($B253,\"!O20\")))","v":""},{"$f":"IF(ISERROR(INDIRECT(CONCATENATE($B253,\"!O21\"))),\"\",INDIRECT(CONCATENATE($B253,\"!O21\")))","v":""},null,{"$f":"IF(ISERROR(INDIRECT(CONCATENATE($B253,\"!P18\"))),\"\",INDIRECT(CONCATENATE($B253,\"!P18\")))","v":""},{"$f":"IF(ISERROR(INDIRECT(CONCATENATE($B253,\"!P19\"))),\"\",INDIRECT(CONCATENATE($B253,\"!P19\")))","v":""},{"$f":"IF(ISERROR(INDIRECT(CONCATENATE($B253,\"!P20\"))),\"\",INDIRECT(CONCATENATE($B253,\"!P20\")))","v":""},{"$f":"IF(ISERROR(INDIRECT(CONCATENATE($B253,\"!P21\"))),\"\",INDIRECT(CONCATENATE($B253,\"!P21\")))","v":""},null,{"$f":"IF(ISERROR(INDIRECT(CONCATENATE($B253,\"!Q18\"))),\"\",INDIRECT(CONCATENATE($B253,\"!Q18\")))","v":""},{"$f":"IF(ISERROR(INDIRECT(CONCATENATE($B253,\"!Q19\"))),\"\",INDIRECT(CONCATENATE($B253,\"!Q19\")))","v":""},{"$f":"IF(ISERROR(INDIRECT(CONCATENATE($B253,\"!Q20\"))),\"\",INDIRECT(CONCATENATE($B253,\"!Q20\")))","v":""},{"$f":"IF(ISERROR(INDIRECT(CONCATENATE($B253,\"!Q21\"))),\"\",INDIRECT(CONCATENATE($B253,\"!Q1\")))","v":""}]
[null,null,null,null,{"$f":"IF(ISERROR(INDIRECT(CONCATENATE($B254,\"!M18\"))),\"\",INDIRECT(CONCATENATE($B254,\"!M18\")))","v":""},{"$f":"IF(ISERROR(INDIRECT(CONCATENATE($B254,\"!M19\"))),\"\",INDIRECT(CONCATENATE($B254,\"!M19\")))","v":""},{"$f":"IF(ISERROR(INDIRECT(CONCATENATE($B254,\"!M20\"))),\"\",INDIRECT(CONCATENATE($B254,\"!M20\")))","v":""},{"$f":"IF(ISERROR(INDIRECT(CONCATENATE($B254,\"!M21\"))),\"\",INDIRECT(CONCATENATE($B254,\"!M21\")))","v":""},null,{"$f":"IF(ISERROR(INDIRECT(CONCATENATE($B254,\"!N18\"))),\"\",INDIRECT(CONCATENATE($B254,\"!N18\")))","v":""},{"$f":"IF(ISERROR(INDIRECT(CONCATENATE($B254,\"!N19\"))),\"\",INDIRECT(CONCATENATE($B254,\"!N19\")))","v":""},{"$f":"IF(ISERROR(INDIRECT(CONCATENATE($B254,\"!N20\"))),\"\",INDIRECT(CONCATENATE($B254,\"!N20\")))","v":""},{"$f":"IF(ISERROR(INDIRECT(CONCATENATE($B254,\"!N21\"))),\"\",INDIRECT(CONCATENATE($B254,\"!N21\")))","v":""},null,{"$f":"IF(ISERROR(INDIRECT(CONCATENATE($B254,\"!O18\"))),\"\",INDIRECT(CONCATENATE($B254,\"!O18\")))","v":""},{"$f":"IF(ISERROR(INDIRECT(CONCATENATE($B254,\"!O19\"))),\"\",INDIRECT(CONCATENATE($B254,\"!O19\")))","v":""},{"$f":"IF(ISERROR(INDIRECT(CONCATENATE($B254,\"!O20\"))),\"\",INDIRECT(CONCATENATE($B254,\"!O20\")))","v":""},{"$f":"IF(ISERROR(INDIRECT(CONCATENATE($B254,\"!O21\"))),\"\",INDIRECT(CONCATENATE($B254,\"!O21\")))","v":""},null,{"$f":"IF(ISERROR(INDIRECT(CONCATENATE($B254,\"!P18\"))),\"\",INDIRECT(CONCATENATE($B254,\"!P18\")))","v":""},{"$f":"IF(ISERROR(INDIRECT(CONCATENATE($B254,\"!P19\"))),\"\",INDIRECT(CONCATENATE($B254,\"!P19\")))","v":""},{"$f":"IF(ISERROR(INDIRECT(CONCATENATE($B254,\"!P20\"))),\"\",INDIRECT(CONCATENATE($B254,\"!P20\")))","v":""},{"$f":"IF(ISERROR(INDIRECT(CONCATENATE($B254,\"!P21\"))),\"\",INDIRECT(CONCATENATE($B254,\"!P21\")))","v":""},null,{"$f":"IF(ISERROR(INDIRECT(CONCATENATE($B254,\"!Q18\"))),\"\",INDIRECT(CONCATENATE($B254,\"!Q18\")))","v":""},{"$f":"IF(ISERROR(INDIRECT(CONCATENATE($B254,\"!Q19\"))),\"\",INDIRECT(CONCATENATE($B254,\"!Q19\")))","v":""},{"$f":"IF(ISERROR(INDIRECT(CONCATENATE($B254,\"!Q20\"))),\"\",INDIRECT(CONCATENATE($B254,\"!Q20\")))","v":""},{"$f":"IF(ISERROR(INDIRECT(CONCATENATE($B254,\"!Q21\"))),\"\",INDIRECT(CONCATENATE($B254,\"!Q1\")))","v":""}]
[null,null,null,null,{"$f":"IF(ISERROR(INDIRECT(CONCATENATE($B255,\"!M18\"))),\"\",INDIRECT(CONCATENATE($B255,\"!M18\")))","v":""},{"$f":"IF(ISERROR(INDIRECT(CONCATENATE($B255,\"!M19\"))),\"\",INDIRECT(CONCATENATE($B255,\"!M19\")))","v":""},{"$f":"IF(ISERROR(INDIRECT(CONCATENATE($B255,\"!M20\"))),\"\",INDIRECT(CONCATENATE($B255,\"!M20\")))","v":""},{"$f":"IF(ISERROR(INDIRECT(CONCATENATE($B255,\"!M21\"))),\"\",INDIRECT(CONCATENATE($B255,\"!M21\")))","v":""},null,{"$f":"IF(ISERROR(INDIRECT(CONCATENATE($B255,\"!N18\"))),\"\",INDIRECT(CONCATENATE($B255,\"!N18\")))","v":""},{"$f":"IF(ISERROR(INDIRECT(CONCATENATE($B255,\"!N19\"))),\"\",INDIRECT(CONCATENATE($B255,\"!N19\")))","v":""},{"$f":"IF(ISERROR(INDIRECT(CONCATENATE($B255,\"!N20\"))),\"\",INDIRECT(CONCATENATE($B255,\"!N20\")))","v":""},{"$f":"IF(ISERROR(INDIRECT(CONCATENATE($B255,\"!N21\"))),\"\",INDIRECT(CONCATENATE($B255,\"!N21\")))","v":""},null,{"$f":"IF(ISERROR(INDIRECT(CONCATENATE($B255,\"!O18\"))),\"\",INDIRECT(CONCATENATE($B255,\"!O18\")))","v":""},{"$f":"IF(ISERROR(INDIRECT(CONCATENATE($B255,\"!O19\"))),\"\",INDIRECT(CONCATENATE($B255,\"!O19\")))","v":""},{"$f":"IF(ISERROR(INDIRECT(CONCATENATE($B255,\"!O20\"))),\"\",INDIRECT(CONCATENATE($B255,\"!O20\")))","v":""},{"$f":"IF(ISERROR(INDIRECT(CONCATENATE($B255,\"!O21\"))),\"\",INDIRECT(CONCATENATE($B255,\"!O21\")))","v":""},null,{"$f":"IF(ISERROR(INDIRECT(CONCATENATE($B255,\"!P18\"))),\"\",INDIRECT(CONCATENATE($B255,\"!P18\")))","v":""},{"$f":"IF(ISERROR(INDIRECT(CONCATENATE($B255,\"!P19\"))),\"\",INDIRECT(CONCATENATE($B255,\"!P19\")))","v":""},{"$f":"IF(ISERROR(INDIRECT(CONCATENATE($B255,\"!P20\"))),\"\",INDIRECT(CONCATENATE($B255,\"!P20\")))","v":""},{"$f":"IF(ISERROR(INDIRECT(CONCATENATE($B255,\"!P21\"))),\"\",INDIRECT(CONCATENATE($B255,\"!P21\")))","v":""},null,{"$f":"IF(ISERROR(INDIRECT(CONCATENATE($B255,\"!Q18\"))),\"\",INDIRECT(CONCATENATE($B255,\"!Q18\")))","v":""},{"$f":"IF(ISERROR(INDIRECT(CONCATENATE($B255,\"!Q19\"))),\"\",INDIRECT(CONCATENATE($B255,\"!Q19\")))","v":""},{"$f":"IF(ISERROR(INDIRECT(CONCATENATE($B255,\"!Q20\"))),\"\",INDIRECT(CONCATENATE($B255,\"!Q20\")))","v":""},{"$f":"IF(ISERROR(INDIRECT(CONCATENATE($B255,\"!Q21\"))),\"\",INDIRECT(CONCATENATE($B255,\"!Q1\")))","v":""}]
[null,null,null,null,{"$f":"IF(ISERROR(INDIRECT(CONCATENATE($B256,\"!M18\"))),\"\",INDIRECT(CONCATENATE($B256,\"!M18\")))","v":""},{"$f":"IF(ISERROR(INDIRECT(CONCATENATE($B256,\"!M19\"))),\"\",INDIRECT(CONCATENATE($B256,\"!M19\")))","v":""},{"$f":"IF(ISERROR(INDIRECT(CONCATENATE($B256,\"!M20\"))),\"\",INDIRECT(CONCATENATE($B256,\"!M20\")))","v":""},{"$f":"IF(ISERROR(INDIRECT(CONCATENATE($B256,\"!M21\"))),\"\",INDIRECT(CONCATENATE($B256,\"!M21\")))","v":""},null,{"$f":"IF(ISERROR(INDIRECT(CONCATENATE($B256,\"!N18\"))),\"\",INDIRECT(CONCATENATE($B256,\"!N18\")))","v":""},{"$f":"IF(ISERROR(INDIRECT(CONCATENATE($B256,\"!N19\"))),\"\",INDIRECT(CONCATENATE($B256,\"!N19\")))","v":""},{"$f":"IF(ISERROR(INDIRECT(CONCATENATE($B256,\"!N20\"))),\"\",INDIRECT(CONCATENATE($B256,\"!N20\")))","v":""},{"$f":"IF(ISERROR(INDIRECT(CONCATENATE($B256,\"!N21\"))),\"\",INDIRECT(CONCATENATE($B256,\"!N21\")))","v":""},null,{"$f":"IF(ISERROR(INDIRECT(CONCATENATE($B256,\"!O18\"))),\"\",INDIRECT(CONCATENATE($B256,\"!O18\")))","v":""},{"$f":"IF(ISERROR(INDIRECT(CONCATENATE($B256,\"!O19\"))),\"\",INDIRECT(CONCATENATE($B256,\"!O19\")))","v":""},{"$f":"IF(ISERROR(INDIRECT(CONCATENATE($B256,\"!O20\"))),\"\",INDIRECT(CONCATENATE($B256,\"!O20\")))","v":""},{"$f":"IF(ISERROR(INDIRECT(CONCATENATE($B256,\"!O21\"))),\"\",INDIRECT(CONCATENATE($B256,\"!O21\")))","v":""},null,{"$f":"IF(ISERROR(INDIRECT(CONCATENATE($B256,\"!P18\"))),\"\",INDIRECT(CONCATENATE($B256,\"!P18\")))","v":""},{"$f":"IF(ISERROR(INDIRECT(CONCATENATE($B256,\"!P19\"))),\"\",INDIRECT(CONCATENATE($B256,\"!P19\")))","v":""},{"$f":"IF(ISERROR(INDIRECT(CONCATENATE($B256,\"!P20\"))),\"\",INDIRECT(CONCATENATE($B256,\"!P20\")))","v":""},{"$f":"IF(ISERROR(INDIRECT(CONCATENATE($B256,\"!P21\"))),\"\",INDIRECT(CONCATENATE($B256,\"!P21\")))","v":""},null,{"$f":"IF(ISERROR(INDIRECT(CONCATENATE($B256,\"!Q18\"))),\"\",INDIRECT(CONCATENATE($B256,\"!Q18\")))","v":""},{"$f":"IF(ISERROR(INDIRECT(CONCATENATE($B256,\"!Q19\"))),\"\",INDIRECT(CONCATENATE($B256,\"!Q19\")))","v":""},{"$f":"IF(ISERROR(INDIRECT(CONCATENATE($B256,\"!Q20\"))),\"\",INDIRECT(CONCATENATE($B256,\"!Q20\")))","v":""},{"$f":"IF(ISERROR(INDIRECT(CONCATENATE($B256,\"!Q21\"))),\"\",INDIRECT(CONCATENATE($B256,\"!Q1\")))","v":""}]
[null,null,null,null,{"$f":"IF(ISERROR(INDIRECT(CONCATENATE($B257,\"!M18\"))),\"\",INDIRECT(CONCATENATE($B257,\"!M18\")))","v":""},{"$f":"IF(ISERROR(INDIRECT(CONCATENATE($B257,\"!M19\"))),\"\",INDIRECT(CONCATENATE($B257,\"!M19\")))","v":""},{"$f":"IF(ISERROR(INDIRECT(CONCATENATE($B257,\"!M20\"))),\"\",INDIRECT(CONCATENATE($B257,\"!M20\")))","v":""},{"$f":"IF(ISERROR(INDIRECT(CONCATENATE($B257,\"!M21\"))),\"\",INDIRECT(CONCATENATE($B257,\"!M21\")))","v":""},null,{"$f":"IF(ISERROR(INDIRECT(CONCATENATE($B257,\"!N18\"))),\"\",INDIRECT(CONCATENATE($B257,\"!N18\")))","v":""},{"$f":"IF(ISERROR(INDIRECT(CONCATENATE($B257,\"!N19\"))),\"\",INDIRECT(CONCATENATE($B257,\"!N19\")))","v":""},{"$f":"IF(ISERROR(INDIRECT(CONCATENATE($B257,\"!N20\"))),\"\",INDIRECT(CONCATENATE($B257,\"!N20\")))","v":""},{"$f":"IF(ISERROR(INDIRECT(CONCATENATE($B257,\"!N21\"))),\"\",INDIRECT(CONCATENATE($B257,\"!N21\")))","v":""},null,{"$f":"IF(ISERROR(INDIRECT(CONCATENATE($B257,\"!O18\"))),\"\",INDIRECT(CONCATENATE($B257,\"!O18\")))","v":""},{"$f":"IF(ISERROR(INDIRECT(CONCATENATE($B257,\"!O19\"))),\"\",INDIRECT(CONCATENATE($B257,\"!O19\")))","v":""},{"$f":"IF(ISERROR(INDIRECT(CONCATENATE($B257,\"!O20\"))),\"\",INDIRECT(CONCATENATE($B257,\"!O20\")))","v":""},{"$f":"IF(ISERROR(INDIRECT(CONCATENATE($B257,\"!O21\"))),\"\",INDIRECT(CONCATENATE($B257,\"!O21\")))","v":""},null,{"$f":"IF(ISERROR(INDIRECT(CONCATENATE($B257,\"!P18\"))),\"\",INDIRECT(CONCATENATE($B257,\"!P18\")))","v":""},{"$f":"IF(ISERROR(INDIRECT(CONCATENATE($B257,\"!P19\"))),\"\",INDIRECT(CONCATENATE($B257,\"!P19\")))","v":""},{"$f":"IF(ISERROR(INDIRECT(CONCATENATE($B257,\"!P20\"))),\"\",INDIRECT(CONCATENATE($B257,\"!P20\")))","v":""},{"$f":"IF(ISERROR(INDIRECT(CONCATENATE($B257,\"!P21\"))),\"\",INDIRECT(CONCATENATE($B257,\"!P21\")))","v":""},null,{"$f":"IF(ISERROR(INDIRECT(CONCATENATE($B257,\"!Q18\"))),\"\",INDIRECT(CONCATENATE($B257,\"!Q18\")))","v":""},{"$f":"IF(ISERROR(INDIRECT(CONCATENATE($B257,\"!Q19\"))),\"\",INDIRECT(CONCATENATE($B257,\"!Q19\")))","v":""},{"$f":"IF(ISERROR(INDIRECT(CONCATENATE($B257,\"!Q20\"))),\"\",INDIRECT(CONCATENATE($B257,\"!Q20\")))","v":""},{"$f":"IF(ISERROR(INDIRECT(CONCATENATE($B257,\"!Q21\"))),\"\",INDIRECT(CONCATENATE($B257,\"!Q1\")))","v":""}]
[]
[]
[]
[]
[]
[]
[]
[]
[]
[]
[]
[]
[]
[]
[]
[]
[]
[]
[]
[]
[]
[]
[]
[]
[]
[]
[]
[]
[]
[]
[]
[]
[]
[]
[]
[]
[]
[]
[]
["RURAL",null,null,"Poorest",null,null,null,null,"Poor",null,null,null,null,"Middle",null,null,null,null,"Rich",null,null,null,null,"Richest"]
[null,null,null,"Improved","Basic","Limited","Unimproved","Surface water","Improved","Basic","Limited","Unimproved","Surface water","Improved","Basic","Limited","Unimproved","Surface water","Improved","Basic","Limited","Unimproved","Surface water","Improved","Basic","Limited","Unimproved","Surface water"]
["Forecast period:",null,2000,{"$f":"IF((D301+H301)>100,D301*100/(D301+H301),D301)","v":88.003773284454155},{"$f":"D299*AVERAGEIF(E305:E316,\">0\")/100","v":86.989211090981996},{"$f":"D299*(100-AVERAGEIF(E305:E316,\">0\"))/100","v":1.0145621934721678},{"$f":"100-(E299+F299+H299)","v":11.019337421545529},{"$f":"IF((D301+H301)>100,H301*100/(D301+H301),H301)","v":0.97688929400030133},{"$f":"IF((I301+M301)>100,I301*100/(I301+M301),I301)","v":94.274776480840046},{"$f":"I299*AVERAGEIF(J305:J316,\">0\")/100","v":93.798739543807685},{"$f":"I299*(100-AVERAGEIF(J305:J316,\">0\"))/100","v":0.47603693703236366},{"$f":"100-(J299+K299+M299)","v":2.3809167740311068},{"$f":"IF((I301+M301)>100,M301*100/(I301+M301),M301)","v":3.3443067451288471},{"$f":"IF((N301+R301)>100,N301*100/(N301+R301),N301)","v":99.796216671975117},{"$f":"N299*AVERAGEIF(O305:O316,\">0\")/100","v":99.762951266417787},{"$f":"N299*(100-AVERAGEIF(O305:O316,\">0\"))/100","v":3.3265405557337327E-2},{"$f":"100-(O299+P299+R299)","v":0.20378332802486909},{"$f":"IF((N301+R301)>100,R301*100/(N301+R301),R301)","v":0},{"$f":"IF((S301+W301)>100,S301*100/(S301+W301),S301)","v":98.967039687554362},{"$f":"S299*AVERAGEIF(T305:T316,\">0\")/100","v":98.478016088901626},{"$f":"S299*(100-AVERAGEIF(T305:T316,\">0\"))/100","v":0.48902359865274797},{"$f":"100-(T299+U299+W299)","v":1.0329603124456241},{"$f":"IF((S301+W301)>100,W301*100/(S301+W301),W301)","v":0},{"$f":"IF((X301+AB301)>100,X301*100/(X301+AB301),X301)","v":100},{"$f":"X299*AVERAGEIF(Y305:Y316,\">0\")/100","v":99.192445318703435},{"$f":"X299*(100-AVERAGEIF(Y305:Y316,\">0\"))/100","v":0.80755468129656549},{"$f":"100-(Y299+Z299+AB299)","v":0},{"$f":"IF((X301+AB301)>100,AB301*100/(X301+AB301),AB301)","v":0}]
[null,null,2020,{"$f":"IF((D302+H302)>100,D302*100/(D302+H302),D302)","v":100},{"$f":"D300*AVERAGEIF(E305:E316,\">0\")/100","v":98.847137849200166},{"$f":"D300*(100-AVERAGEIF(E305:E316,\">0\"))/100","v":1.1528621507998338},{"$f":"100-(E300+F300+H300)","v":0},{"$f":"IF((D302+H302)>100,H302*100/(D302+H302),H302)","v":0},{"$f":"IF((I302+M302)>100,I302*100/(I302+M302),I302)","v":100},{"$f":"I300*AVERAGEIF(J305:J316,\">0\")/100","v":99.495053762202119},{"$f":"I300*(100-AVERAGEIF(J305:J316,\">0\"))/100","v":0.50494623779788128},{"$f":"100-(J300+K300+M300)","v":0},{"$f":"IF((I302+M302)>100,M302*100/(I302+M302),M302)","v":0},{"$f":"IF((N302+R302)>100,N302*100/(N302+R302),N302)","v":97.627611245463982},{"$f":"N300*AVERAGEIF(O305:O316,\">0\")/100","v":97.595068708382144},{"$f":"N300*(100-AVERAGEIF(O305:O316,\">0\"))/100","v":3.2542537081833349E-2},{"$f":"100-(O300+P300+R300)","v":2.3723887545360185},{"$f":"IF((N302+R302)>100,R302*100/(N302+R302),R302)","v":0},{"$f":"IF((S302+W302)>100,S302*100/(S302+W302),S302)","v":98.010865968929878},{"$f":"S300*AVERAGEIF(T305:T316,\">0\")/100","v":97.526567089883741},{"$f":"S300*(100-AVERAGEIF(T305:T316,\">0\"))/100","v":0.48429887904614821},{"$f":"100-(T300+U300+W300)","v":1.9891340310701082},{"$f":"IF((S302+W302)>100,W302*100/(S302+W302),W302)","v":0},{"$f":"IF((X302+AB302)>100,X302*100/(X302+AB302),X302)","v":97.930995643786446},{"$f":"X300*AVERAGEIF(Y305:Y316,\">0\")/100","v":97.140149304024703},{"$f":"X300*(100-AVERAGEIF(Y305:Y316,\">0\"))/100","v":0.79084633976173313},{"$f":"100-(Y300+Z300+AB300)","v":2.0690043562135685},{"$f":"IF((X302+AB302)>100,AB302*100/(X302+AB302),AB302)","v":0}]
["Regression period:",null,{"$f":"MinRegYear(C299,C305:C316)","v":2004},{"$f":"IF(MAX(C305:C316)-MIN(C305:C316)<5,AVERAGEIF(C305:C316,\">0\",D305:D316),\nIF(FORECAST($C301,D$305:D$316,$C$305:$C$316)<0,0,\nIF(FORECAST($C301,D$305:D$316,$C$305:$C$316)>100,100,\nFORECAST($C301,D$305:D$316,$C$305:$C$316))))","v":88.003773284454155},null,null,null,{"$f":"IF(MAX(C305:C316)-MIN(C305:C316)<5,AVERAGEIF(C305:C316,\">0\",H305:H316),\nIF(FORECAST($C301,H$305:H$316,$C$305:$C$316)<0,0,\nIF(FORECAST($C301,H$305:H$316,$C$305:$C$316)>100,100,\nFORECAST($C301,H$305:H$316,$C$305:$C$316))))","v":0.97688929400030133},{"$f":"IF(MAX(C305:C316)-MIN(C305:C316)<5,AVERAGEIF(C305:C316,\">0\",I305:I316),\nIF(FORECAST($C301,I$305:I$316,$C$305:$C$316)<0,0,\nIF(FORECAST($C301,I$305:I$316,$C$305:$C$316)>100,100,\nFORECAST($C301,I$305:I$316,$C$305:$C$316))))","v":94.274776480840046},null,null,null,{"$f":"IF(MAX(C305:C316)-MIN(C305:C316)<5,AVERAGEIF(C305:C316,\">0\",M305:M316),\nIF(FORECAST($C301,M$305:M$316,$C$305:$C$316)<0,0,\nIF(FORECAST($C301,M$305:M$316,$C$305:$C$316)>100,100,\nFORECAST($C301,M$305:M$316,$C$305:$C$316))))","v":3.3443067451288471},{"$f":"IF(MAX(C305:C316)-MIN(C305:C316)<5,AVERAGEIF(C305:C316,\">0\",N305:N316),\nIF(FORECAST($C301,N$305:N$316,$C$305:$C$316)<0,0,\nIF(FORECAST($C301,N$305:N$316,$C$305:$C$316)>100,100,\nFORECAST($C301,N$305:N$316,$C$305:$C$316))))","v":99.796216671975117},null,null,null,{"$f":"IF(MAX(C305:C316)-MIN(C305:C316)<5,AVERAGEIF(C305:C316,\">0\",R305:R316),\nIF(FORECAST($C301,R$305:R$316,$C$305:$C$316)<0,0,\nIF(FORECAST($C301,R$305:R$316,$C$305:$C$316)>100,100,\nFORECAST($C301,R$305:R$316,$C$305:$C$316))))","v":0},{"$f":"IF(MAX(C305:C316)-MIN(C305:C316)<5,AVERAGEIF(C305:C316,\">0\",S305:S316),\nIF(FORECAST($C301,S$305:S$316,$C$305:$C$316)<0,0,\nIF(FORECAST($C301,S$305:S$316,$C$305:$C$316)>100,100,\nFORECAST($C301,S$305:S$316,$C$305:$C$316))))","v":98.967039687554362},null,null,null,{"$f":"IF(MAX(C305:C316)-MIN(C305:C316)<5,AVERAGEIF(C305:C316,\">0\",W305:W316),\nIF(FORECAST($C301,W$305:W$316,$C$305:$C$316)<0,0,\nIF(FORECAST($C301,W$305:W$316,$C$305:$C$316)>100,100,\nFORECAST($C301,W$305:W$316,$C$305:$C$316))))","v":0},{"$f":"IF(MAX(C305:C316)-MIN(C305:C316)<5,AVERAGEIF(C305:C316,\">0\",X305:X316),\nIF(FORECAST($C301,X$305:X$316,$C$305:$C$316)<0,0,\nIF(FORECAST($C301,X$305:X$316,$C$305:$C$316)>100,100,\nFORECAST($C301,X$305:X$316,$C$305:$C$316))))","v":100},null,null,null,{"$f":"IF(MAX(C305:C316)-MIN(C305:C316)<5,AVERAGEIF(C305:C316,\">0\",AB305:AB316),\nIF(FORECAST($C301,AB$305:AB$316,$C$305:$C$316)<0,0,\nIF(FORECAST($C301,AB$305:AB$316,$C$305:$C$316)>100,100,\nFORECAST($C301,AB$305:AB$316,$C$305:$C$316))))","v":0}]
[null,null,{"$f":"MaxRegYear(C300,C305:C316)","v":2020},{"$f":"IF(MAX(C305:C316)-MIN(C305:C316)<5,AVERAGEIF(C305:C316,\">0\",D305:D316),\nIF(FORECAST($C302,D$305:D$316,$C$305:$C$316)<0,0,\nIF(FORECAST($C302,D$305:D$316,$C$305:$C$316)>100,100,\nFORECAST($C302,D$305:D$316,$C$305:$C$316))))","v":100},null,null,null,{"$f":"IF(MAX(C305:C316)-MIN(C305:C316)<5,AVERAGEIF(C305:C316,\">0\",H305:H316),\nIF(FORECAST($C302,H$305:H$316,$C$305:$C$316)<0,0,\nIF(FORECAST($C302,H$305:H$316,$C$305:$C$316)>100,100,\nFORECAST($C302,H$305:H$316,$C$305:$C$316))))","v":0},{"$f":"IF(MAX(C305:C316)-MIN(C305:C316)<5,AVERAGEIF(C305:C316,\">0\",I305:I316),\nIF(FORECAST($C302,I$305:I$316,$C$305:$C$316)<0,0,\nIF(FORECAST($C302,I$305:I$316,$C$305:$C$316)>100,100,\nFORECAST($C302,I$305:I$316,$C$305:$C$316))))","v":100},null,null,null,{"$f":"IF(MAX(C305:C316)-MIN(C305:C316)<5,AVERAGEIF(C305:C316,\">0\",M305:M316),\nIF(FORECAST($C302,M$305:M$316,$C$305:$C$316)<0,0,\nIF(FORECAST($C302,M$305:M$316,$C$305:$C$316)>100,100,\nFORECAST($C302,M$305:M$316,$C$305:$C$316))))","v":0},{"$f":"IF(MAX(C305:C316)-MIN(C305:C316)<5,AVERAGEIF(C305:C316,\">0\",N305:N316),\nIF(FORECAST($C302,N$305:N$316,$C$305:$C$316)<0,0,\nIF(FORECAST($C302,N$305:N$316,$C$305:$C$316)>100,100,\nFORECAST($C302,N$305:N$316,$C$305:$C$316))))","v":97.627611245463982},null,null,null,{"$f":"IF(MAX(C305:C316)-MIN(C305:C316)<5,AVERAGEIF(C305:C316,\">0\",R305:R316),\nIF(FORECAST($C302,R$305:R$316,$C$305:$C$316)<0,0,\nIF(FORECAST($C302,R$305:R$316,$C$305:$C$316)>100,100,\nFORECAST($C302,R$305:R$316,$C$305:$C$316))))","v":0},{"$f":"IF(MAX(C305:C316)-MIN(C305:C316)<5,AVERAGEIF(C305:C316,\">0\",S305:S316),\nIF(FORECAST($C302,S$305:S$316,$C$305:$C$316)<0,0,\nIF(FORECAST($C302,S$305:S$316,$C$305:$C$316)>100,100,\nFORECAST($C302,S$305:S$316,$C$305:$C$316))))","v":98.010865968929878},null,null,null,{"$f":"IF(MAX(C305:C316)-MIN(C305:C316)<5,AVERAGEIF(C305:C316,\">0\",W305:W316),\nIF(FORECAST($C302,W$305:W$316,$C$305:$C$316)<0,0,\nIF(FORECAST($C302,W$305:W$316,$C$305:$C$316)>100,100,\nFORECAST($C302,W$305:W$316,$C$305:$C$316))))","v":0},{"$f":"IF(MAX(C305:C316)-MIN(C305:C316)<5,AVERAGEIF(C305:C316,\">0\",X305:X316),\nIF(FORECAST($C302,X$305:X$316,$C$305:$C$316)<0,0,\nIF(FORECAST($C302,X$305:X$316,$C$305:$C$316)>100,100,\nFORECAST($C302,X$305:X$316,$C$305:$C$316))))","v":97.930995643786446},null,null,null,{"$f":"IF(MAX(C305:C316)-MIN(C305:C316)<5,AVERAGEIF(C305:C316,\">0\",AB305:AB316),\nIF(FORECAST($C302,AB$305:AB$316,$C$305:$C$316)<0,0,\nIF(FORECAST($C302,AB$305:AB$316,$C$305:$C$316)>100,100,\nFORECAST($C302,AB$305:AB$316,$C$305:$C$316))))","v":0}]
[]
[null,"Survey","Year","Improved","% Improved\n< = 30min",null,null,"Surface water","Improved","% Improved\n< = 30min",null,null,"Surface water","Improved","% Improved\n< = 30min",null,null,"Surface water","Improved","% Improved\n< = 30min",null,null,"Surface water","Improved","% Improved\n< = 30min",null,null,"Surface water"]
[null,"MICS06",2006,{"$f":"IF(ISERROR(INDIRECT(CONCATENATE($B305,\"!M16\"))),\"\",INDIRECT(CONCATENATE($B305,\"!M16\")))","v":88.816054185281899},{"$f":"IF(ISERROR(INDIRECT(CONCATENATE($B305,\"!M23\"))),\"\",INDIRECT(CONCATENATE($B305,\"!M23\")))","v":98.457799097412121},null,null,{"$f":"IF(ISERROR(INDIRECT(CONCATENATE($B305,\"!M21\"))),\"\",INDIRECT(CONCATENATE($B305,\"!M21\")))","v":0.78202500644468431},{"$f":"IF(ISERROR(INDIRECT(CONCATENATE($B305,\"!N16\"))),\"\",INDIRECT(CONCATENATE($B305,\"!N16\")))","v":94.886964640211914},{"$f":"IF(ISERROR(INDIRECT(CONCATENATE($B305,\"!N23\"))),\"\",INDIRECT(CONCATENATE($B305,\"!N23\")))","v":99.224756872270021},null,null,{"$f":"IF(ISERROR(INDIRECT(CONCATENATE($B305,\"!N21\"))),\"\",INDIRECT(CONCATENATE($B305,\"!N21\")))","v":2.6011274684335413},{"$f":"IF(ISERROR(INDIRECT(CONCATENATE($B305,\"!O16\"))),\"\",INDIRECT(CONCATENATE($B305,\"!O16\")))","v":99.098631043478974},{"$f":"IF(ISERROR(INDIRECT(CONCATENATE($B305,\"!O23\"))),\"\",INDIRECT(CONCATENATE($B305,\"!O23\")))","v":100},null,null,{"$f":"IF(ISERROR(INDIRECT(CONCATENATE($B305,\"!O21\"))),\"\",INDIRECT(CONCATENATE($B305,\"!O21\")))","v":0},{"$f":"IF(ISERROR(INDIRECT(CONCATENATE($B305,\"!P16\"))),\"\",INDIRECT(CONCATENATE($B305,\"!P16\")))","v":98.526347960571329},{"$f":"IF(ISERROR(INDIRECT(CONCATENATE($B305,\"!P23\"))),\"\",INDIRECT(CONCATENATE($B305,\"!P23\")))","v":100},null,null,{"$f":"IF(ISERROR(INDIRECT(CONCATENATE($B305,\"!P21\"))),\"\",INDIRECT(CONCATENATE($B305,\"!P21\")))","v":0},{"$f":"IF(ISERROR(INDIRECT(CONCATENATE($B305,\"!Q16\"))),\"\",INDIRECT(CONCATENATE($B305,\"!Q16\")))","v":100},{"$f":"IF(ISERROR(INDIRECT(CONCATENATE($B305,\"!Q23\"))),\"\",INDIRECT(CONCATENATE($B305,\"!Q23\")))","v":99.277335956110278},null,null,{"$f":"IF(ISERROR(INDIRECT(CONCATENATE($B305,\"!Q221\"))),\"\",INDIRECT(CONCATENATE($B305,\"!Q21\")))","v":0}]
[null,"MICS13",2013,96.6,98.6,null,null,0.1,97.9,99.8,null,null,0,99.6,99.9,null,null,0,99.2,99.4,null,null,0,100,98.3,null,null,0]
[null,"MICS18",2018,97.699796243320563,99.483614450188398,null,null,"N/A",99.266486363272932,99.460404414336324,null,null,"N/A",97.30157299352274,100,null,null,"N/A",97.680749666740979,99.117616773635049,null,null,"N/A",97.778113548499789,100,null,null,"N/A"]
[null,null,null,"","",null,null,"","","",null,null,"","","",null,null,"","","",null,null,"","","",null,null,""]
[null,null,null,"","",null,null,"","","",null,null,"","","",null,null,"","","",null,null,"","","",null,null,""]
[null,null,null,"","",null,null,"","","",null,null,"","","",null,null,"","","",null,null,"","","",null,null,""]
[null,null,null,"","",null,null,"","","",null,null,"","","",null,null,"","","",null,null,"","","",null,null,""]
[null,null,null,"","",null,null,"","","",null,null,"","","",null,null,"","","",null,null,"","","",null,null,""]
[null,null,null,"","",null,null,"","","",null,null,"","","",null,null,"","","",null,null,"","","",null,null,""]
[null,null,null,"","",null,null,"","","",null,null,"","","",null,null,"","","",null,null,"","","",null,null,""]
[null,null,null,"","",null,null,"","","",null,null,"","","",null,null,"","","",null,null,"","","",null,null,""]
[null,null,null,"","",null,null,"","","",null,null,"","","",null,null,"","","",null,null,"","","",null,null,""]
[]
[null,{"$f":"CONCATENATE(\"Rural use of drinking water sources, \",C299,\"–\",C300)","v":"Rural use of drinking water sources, 2000–2020"},null,null,null,null,null,null,null,null,null,null,null,null,null,null,null,null,"Data points used for regression"]

{"sheet":"Sanitation","index":2,"n_rows":318,"n_cols":28,"rows_kept":318,"cut":false,"hidden":false,"merged":[[298,0,299,1],[300,0,301,1],[317,18,317,22],[196,23,196,27],[198,0,199,1],[200,0,201,1],[217,18,217,22],[296,0,297,2],[296,3,296,7],[296,8,296,12],[296,13,296,17],[296,18,296,22],[296,23,296,27],[217,1,217,11],[317,1,317,11],[98,0,99,1],[100,0,101,1],[117,18,117,22],[196,0,197,2],[196,3,196,7],[196,8,196,12],[196,13,196,17],[196,18,196,22],[117,1,117,11],[96,23,96,27],[32,1,33,2],[32,3,33,3],[35,1,36,2],[35,3,36,3],[38,1,39,2],[38,3,39,3],[96,0,97,2],[96,3,96,7],[96,8,96,12],[96,13,96,17],[96,18,96,22],[30,21,30,24],[4,1,4,24],[3,1,3,24],[6,1,6,8],[6,9,6,16],[6,17,6,24],[30,1,31,4],[30,5,30,8],[30,9,30,12],[30,13,30,16],[30,17,30,20]]}
[]
[]
[]
[null,"Summary of trends in use of sanitation facilities by wealth quintile (%)"]
[null,{"$f":"IF(ISERROR(INDIRECT(CONCATENATE($B105,\"!A2\"))),\"\",INDIRECT(CONCATENATE($B105,\"!A2\")))","v":"Montenegro"}]
[]
[null,{"$f":"B118","v":"National use of sanitation facilities, 2000–2020"},null,null,null,null,null,null,null,{"$f":"B218","v":"Urban use of sanitation facilities, 2000–2020"},null,null,null,null,null,null,null,{"$f":"B318","v":"Rural use of sanitation facilities, 2000–2020"}]
[]
[]
[]
[]
[]
[]
[]
[]
[]
[]
[]
[]
[]
[]
[]
[]
[]
[]
[]
[]
[]
[]
[]
[null,{"$f":"IF(ISERROR(INDIRECT(CONCATENATE($B105,\"!A2\"))),\"\",INDIRECT(CONCATENATE($B105,\"!A2\")))","v":"Montenegro"},null,null,null,"Poorest",null,null,null,"Poor",null,null,null,"Middle",null,null,null,"Rich",null,null,null,"Richest"]
[null,null,null,null,null,"Basic","Limited","Unimproved","Open defecation","Basic","Limited","Unimproved","Open defecation","Basic","Limited","Unimproved","Open defecation","Basic","Limited","Unimproved","Open defecation","Basic","Limited","Unimproved","Open defecation"]
[null,"NATIONAL",null,"Estimate",{"$f":"C99","v":2000},{"$f":"E99","v":90.172598348441227},{"$f":"F99","v":3.1445865963457886},5.5821147279103656,1.1007003273026186,{"$f":"J99","v":98.915915685823578},{"$f":"K99","v":0.45770324199553142},0.6263810721808909,0,{"$f":"O99","v":99.524654729756719},{"$f":"P99","v":0.46730757797679023},8.0376922664839867E-3,0,{"$f":"T99","v":99.324035401301771},{"$f":"U99","v":0.44956093861076019},0,0.2264036600874722,{"$f":"Y99","v":99.868161178769881},{"$f":"Z99","v":0.1318388212301187},0,0]
[null,null,null,null,{"$f":"C100","v":2020},{"$f":"E100","v":86.321213940658055},3.010277371504654,10.519404426464178,0.14910426137311106,{"$f":"J100","v":95.059656981457735},0.43985958055112057,4.50048343799115,0,{"$f":"O100","v":97.608485833679666},0.45831040789615402,1.9332037584241846,0,{"$f":"T100","v":98.5323079920135},0.44597741810834174,1.0217145898781581,0,{"$f":"Y100","v":99.390740347863144},0.13120856431105138,0.47805108782580419,0]
[]
[null,"URBAN",null,"Estimate",{"$f":"C199","v":2000},{"$f":"E199","v":94.004444114654319},{"$f":"F199","v":4.1340979908504805},1.8613788797214283,7.9014773781693748E-5,{"$f":"J199","v":99.465187107587468},{"$f":"K199","v":0.13727493179270714},0.39753796061982882,0,{"$f":"O199","v":98.88597982899924},{"$f":"P199","v":0.67451413774798252},7.5904858015832133E-2,0.36360117523695834,{"$f":"T199","v":99.593804116215111},{"$f":"U199","v":0.39422498798402278},1.1970895800871517E-2,0,{"$f":"Y199","v":99.915870001475213},{"$f":"Z199","v":8.4129998524787197E-2},0,0]
[null,null,null,null,{"$f":"C200","v":2020},{"$f":"E200","v":92.401973956592357},4.0636250603073059,3.1932706986023334,0.34113028449799998,{"$f":"J200","v":98.556117447336746},0.13602029708849897,1.3078622555747614,0,{"$f":"O200","v":98.470164098010684},0.6716778045313343,0.85815809745798788,0,{"$f":"T200","v":99.36889902276711},0.39333473975473915,0.23776623747815506,0,{"$f":"Y200","v":99.186878805830474},8.3516181838676484E-2,0.7296050123308504,0]
[]
[null,"RURAL",null,"Estimate",{"$f":"C299","v":2000},{"$f":"E299","v":91.666052680764437},{"$f":"F299","v":2.1653368884345818},4.8420459068142065,1.3265645239867752,{"$f":"J299","v":91.205981051887974},{"$f":"K299","v":0.32679917249411744},6.9082777632877708,1.5589420123301352,{"$f":"O299","v":99.829202858527424},{"$f":"P299","v":0},0.17079714147257619,0,{"$f":"T299","v":99.400884417163013},{"$f":"U299","v":0.59911558283698696},0,0,{"$f":"Y299","v":99.78150025649569},{"$f":"Z299","v":0.21849974350431012},0,0]
[null,null,null,null,{"$f":"C300","v":2020},{"$f":"E300","v":78.205676746337474},1.8473756837068476,19.563297907027135,0.38364966292854774,{"$f":"J300","v":90.591263849317713},0.32459658587862372,9.0841395648036638,0,{"$f":"O300","v":91.678152544468958},0,8.3218474555310422,0,{"$f":"T300","v":95.862584449553736},0.57778930732368483,3.5596262431225796,0,{"$f":"Y300","v":98.788697868794969},0.21632572260358757,0.99497640860144543,0]
[]
[]
[]
[]
[]
[]
[]
[]
[]
[]
[]
[]
[]
[]
[]
[]
[]
[]
[]
[]
[]
[]
[]
[]
[]
[]
[]
[]
[]
[]
[]
[]
[]
[]
[]
[]
[]
[]
[]
[]
[]
[]
[]
[]
[]
[]
[]
[]
[]
[]
[]
[]
[]
[]
[]
[]
["NATIONAL",null,null,"Poorest",null,null,null,null,"Poor",null,null,null,null,"Middle",null,null,null,null,"Rich",null,null,null,null,"Richest"]
[null,null,null,"Improved","Basic","Limited","Unimproved","Open defecation","Improved","Basic","Limited","Unimproved","Open defecation","Improved","Basic","Limited","Unimproved","Open defecation","Improved","Basic","Limited","Unimproved","Open defecation","Improved","Basic","Limited","Unimproved","Open defecation"]
["Forecast period:",null,2000,{"$f":"IF((D101+H101)>100,D101*100/(D101+H101),D101)","v":93.317184944787016},{"$f":"D99*AVERAGEIF(E105:E116,\">0\")/100","v":90.172598348441227},{"$f":"D99*(100-AVERAGEIF(E105:E116,\">0\"))/100","v":3.1445865963457886},{"$f":"100-(E99+F99+H99)","v":5.5821147279103656},{"$f":"IF((D101+H101)>100,H101*100/(D101+H101),H101)","v":1.1007003273026186},{"$f":"IF((I101+M101)>100,I101*100/(I101+M101),I101)","v":99.373618927819109},{"$f":"I99*AVERAGEIF(J105:J116,\">0\")/100","v":98.915915685823578},{"$f":"I99*(100-AVERAGEIF(J105:J116,\">0\"))/100","v":0.45770324199553142},{"$f":"100-(J99+K99+M99)","v":0.6263810721808909},{"$f":"IF((I101+M101)>100,M101*100/(I101+M101),M101)","v":0},{"$f":"IF((N101+R101)>100,N101*100/(N101+R101),N101)","v":99.991962307733502},{"$f":"N99*AVERAGEIF(O105:O116,\">0\")/100","v":99.524654729756719},{"$f":"N99*(100-AVERAGEIF(O105:O116,\">0\"))/100","v":0.46730757797679023},{"$f":"100-(O99+P99+R99)","v":8.0376922664839867E-3},{"$f":"IF((N101+R101)>100,R101*100/(N101+R101),R101)","v":0},{"$f":"IF((S101+W101)>100,S101*100/(S101+W101),S101)","v":99.77359633991253},{"$f":"S99*AVERAGEIF(T105:T116,\">0\")/100","v":99.324035401301771},{"$f":"S99*(100-AVERAGEIF(T105:T116,\">0\"))/100","v":0.44956093861076019},{"$f":"100-(T99+U99+W99)","v":0},{"$f":"IF((S101+W101)>100,W101*100/(S101+W101),W101)","v":0.2264036600874722},{"$f":"IF((X101+AB101)>100,X101*100/(X101+AB101),X101)","v":100},{"$f":"X99*AVERAGEIF(Y105:Y116,\">0\")/100","v":99.868161178769881},{"$f":"X99*(100-AVERAGEIF(Y105:Y116,\">0\"))/100","v":0.1318388212301187},{"$f":"100-(Y99+Z99+AB99)","v":0},{"$f":"IF((X101+AB101)>100,AB101*100/(X101+AB101),AB101)","v":0}]
[null,null,2020,{"$f":"IF((D102+H102)>100,D102*100/(D102+H102),D102)","v":89.331491312162711},{"$f":"D100*AVERAGEIF(E105:E116,\">0\")/100","v":86.321213940658055},{"$f":"D100*(100-AVERAGEIF(E105:E116,\">0\"))/100","v":3.010277371504654},{"$f":"100-(E100+F100+H100)","v":10.519404426464178},{"$f":"IF((D102+H102)>100,H102*100/(D102+H102),H102)","v":0.14910426137311106},{"$f":"IF((I102+M102)>100,I102*100/(I102+M102),I102)","v":95.499516562008864},{"$f":"I100*AVERAGEIF(J105:J116,\">0\")/100","v":95.059656981457735},{"$f":"I100*(100-AVERAGEIF(J105:J116,\">0\"))/100","v":0.43985958055112057},{"$f":"100-(J100+K100+M100)","v":4.50048343799115},{"$f":"IF((I102+M102)>100,M102*100/(I102+M102),M102)","v":0},{"$f":"IF((N102+R102)>100,N102*100/(N102+R102),N102)","v":98.066796241575815},{"$f":"N100*AVERAGEIF(O105:O116,\">0\")/100","v":97.608485833679666},{"$f":"N100*(100-AVERAGEIF(O105:O116,\">0\"))/100","v":0.45831040789615402},{"$f":"100-(O100+P100+R100)","v":1.9332037584241846},{"$f":"IF((N102+R102)>100,R102*100/(N102+R102),R102)","v":0},{"$f":"IF((S102+W102)>100,S102*100/(S102+W102),S102)","v":98.978285410121842},{"$f":"S100*AVERAGEIF(T105:T116,\">0\")/100","v":98.5323079920135},{"$f":"S100*(100-AVERAGEIF(T105:T116,\">0\"))/100","v":0.44597741810834174},{"$f":"100-(T100+U100+W100)","v":1.0217145898781581},{"$f":"IF((S102+W102)>100,W102*100/(S102+W102),W102)","v":0},{"$f":"IF((X102+AB102)>100,X102*100/(X102+AB102),X102)","v":99.521948912174196},{"$f":"X100*AVERAGEIF(Y105:Y116,\">0\")/100","v":99.390740347863144},{"$f":"X100*(100-AVERAGEIF(Y105:Y116,\">0\"))/100","v":0.13120856431105138},{"$f":"100-(Y100+Z100+AB100)","v":0.47805108782580419},{"$f":"IF((X102+AB102)>100,AB102*100/(X102+AB102),AB102)","v":0}]
["Regression period:",null,{"$f":"MinRegYear(C99,C105:C116)","v":2004},{"$f":"IF(MAX(C105:C116)-MIN(C105:C116)<5,AVERAGEIF(C105:C116,\">0\",D105:D116),\nIF(FORECAST($C101,D$105:D$116,$C$105:$C$116)<0,0,\nIF(FORECAST($C101,D$105:D$116,$C$105:$C$116)>100,100,\nFORECAST($C101,D$105:D$116,$C$105:$C$116))))","v":93.317184944787016},null,null,null,{"$f":"IF(MAX(C105:C116)-MIN(C105:C116)<5,AVERAGEIF(C105:C116,\">0\",H105:H116),\nIF(FORECAST($C101,H$105:H$116,$C$105:$C$116)<0,0,\nIF(FORECAST($C101,H$105:H$116,$C$105:$C$116)>100,100,\nFORECAST($C101,H$105:H$116,$C$105:$C$116))))","v":1.1007003273026186},{"$f":"IF(MAX(C105:C116)-MIN(C105:C116)<5,AVERAGEIF(C105:C116,\">0\",I105:I116),\nIF(FORECAST($C101,I$105:I$116,$C$105:$C$116)<0,0,\nIF(FORECAST($C101,I$105:I$116,$C$105:$C$116)>100,100,\nFORECAST($C101,I$105:I$116,$C$105:$C$116))))","v":99.373618927819109},null,null,null,{"$f":"IF(MAX(C105:C116)-MIN(C105:C116)<5,AVERAGEIF(C105:C116,\">0\",M105:M116),\nIF(FORECAST($C101,M$105:M$116,$C$105:$C$116)<0,0,\nIF(FORECAST($C101,M$105:M$116,$C$105:$C$116)>100,100,\nFORECAST($C101,M$105:M$116,$C$105:$C$116))))","v":0},{"$f":"IF(MAX(C105:C116)-MIN(C105:C116)<5,AVERAGEIF(C105:C116,\">0\",N105:N116),\nIF(FORECAST($C101,N$105:N$116,$C$105:$C$116)<0,0,\nIF(FORECAST($C101,N$105:N$116,$C$105:$C$116)>100,100,\nFORECAST($C101,N$105:N$116,$C$105:$C$116))))","v":99.991962307733502},null,null,null,{"$f":"IF(MAX(C105:C116)-MIN(C105:C116)<5,AVERAGEIF(C105:C116,\">0\",R105:R116),\nIF(FORECAST($C101,R$105:R$116,$C$105:$C$116)<0,0,\nIF(FORECAST($C101,R$105:R$116,$C$105:$C$116)>100,100,\nFORECAST($C101,R$105:R$116,$C$105:$C$116))))","v":0},{"$f":"IF(MAX(C105:C116)-MIN(C105:C116)<5,AVERAGEIF(C105:C116,\">0\",S105:S116),\nIF(FORECAST($C101,S$105:S$116,$C$105:$C$116)<0,0,\nIF(FORECAST($C101,S$105:S$116,$C$105:$C$116)>100,100,\nFORECAST($C101,S$105:S$116,$C$105:$C$116))))","v":99.908205445281595},null,null,null,{"$f":"IF(MAX(C105:C116)-MIN(C105:C116)<5,AVERAGEIF(C105:C116,\">0\",W105:W116),\nIF(FORECAST($C101,W$105:W$116,$C$105:$C$116)<0,0,\nIF(FORECAST($C101,W$105:W$116,$C$105:$C$116)>100,100,\nFORECAST($C101,W$105:W$116,$C$105:$C$116))))","v":0.22670911158220264},{"$f":"IF(MAX(C105:C116)-MIN(C105:C116)<5,AVERAGEIF(C105:C116,\">0\",X105:X116),\nIF(FORECAST($C101,X$105:X$116,$C$105:$C$116)<0,0,\nIF(FORECAST($C101,X$105:X$116,$C$105:$C$116)>100,100,\nFORECAST($C101,X$105:X$116,$C$105:$C$116))))","v":100},null,null,null,{"$f":"IF(MAX(C105:C116)-MIN(C105:C116)<5,AVERAGEIF(C105:C116,\">0\",AB105:AB116),\nIF(FORECAST($C101,AB$105:AB$116,$C$105:$C$116)<0,0,\nIF(FORECAST($C101,AB$105:AB$116,$C$105:$C$116)>100,100,\nFORECAST($C101,AB$105:AB$116,$C$105:$C$116))))","v":0}]
[null,null,{"$f":"MaxRegYear(C100,C105:C116)","v":2020},{"$f":"IF(MAX(C105:C116)-MIN(C105:C116)<5,AVERAGEIF(C105:C116,\">0\",D105:D116),\nIF(FORECAST($C102,D$105:D$116,$C$105:$C$116)<0,0,\nIF(FORECAST($C102,D$105:D$116,$C$105:$C$116)>100,100,\nFORECAST($C102,D$105:D$116,$C$105:$C$116))))","v":89.331491312162711},null,null,null,{"$f":"IF(MAX(C105:C116)-MIN(C105:C116)<5,AVERAGEIF(C105:C116,\">0\",H105:H116),\nIF(FORECAST($C102,H$105:H$116,$C$105:$C$116)<0,0,\nIF(FORECAST($C102,H$105:H$116,$C$105:$C$116)>100,100,\nFORECAST($C102,H$105:H$116,$C$105:$C$116))))","v":0.14910426137311106},{"$f":"IF(MAX(C105:C116)-MIN(C105:C116)<5,AVERAGEIF(C105:C116,\">0\",I105:I116),\nIF(FORECAST($C102,I$105:I$116,$C$105:$C$116)<0,0,\nIF(FORECAST($C102,I$105:I$116,$C$105:$C$116)>100,100,\nFORECAST($C102,I$105:I$116,$C$105:$C$116))))","v":95.499516562008864},null,null,null,{"$f":"IF(MAX(C105:C116)-MIN(C105:C116)<5,AVERAGEIF(C105:C116,\">0\",M105:M116),\nIF(FORECAST($C102,M$105:M$116,$C$105:$C$116)<0,0,\nIF(FORECAST($C102,M$105:M$116,$C$105:$C$116)>100,100,\nFORECAST($C102,M$105:M$116,$C$105:$C$116))))","v":0},{"$f":"IF(MAX(C105:C116)-MIN(C105:C116)<5,AVERAGEIF(C105:C116,\">0\",N105:N116),\nIF(FORECAST($C102,N$105:N$116,$C$105:$C$116)<0,0,\nIF(FORECAST($C102,N$105:N$116,$C$105:$C$116)>100,100,\nFORECAST($C102,N$105:N$116,$C$105:$C$116))))","v":98.066796241575815},null,null,null,{"$f":"IF(MAX(C105:C116)-MIN(C105:C116)<5,AVERAGEIF(C105:C116,\">0\",R105:R116),\nIF(FORECAST($C102,R$105:R$116,$C$105:$C$116)<0,0,\nIF(FORECAST($C102,R$105:R$116,$C$105:$C$116)>100,100,\nFORECAST($C102,R$105:R$116,$C$105:$C$116))))","v":0},{"$f":"IF(MAX(C105:C116)-MIN(C105:C116)<5,AVERAGEIF(C105:C116,\">0\",S105:S116),\nIF(FORECAST($C102,S$105:S$116,$C$105:$C$116)<0,0,\nIF(FORECAST($C102,S$105:S$116,$C$105:$C$116)>100,100,\nFORECAST($C102,S$105:S$116,$C$105:$C$116))))","v":98.978285410121842},null,null,null,{"$f":"IF(MAX(C105:C116)-MIN(C105:C116)<5,AVERAGEIF(C105:C116,\">0\",W105:W116),\nIF(FORECAST($C102,W$105:W$116,$C$105:$C$116)<0,0,\nIF(FORECAST($C102,W$105:W$116,$C$105:$C$116)>100,100,\nFORECAST($C102,W$105:W$116,$C$105:$C$116))))","v":0},{"$f":"IF(MAX(C105:C116)-MIN(C105:C116)<5,AVERAGEIF(C105:C116,\">0\",X105:X116),\nIF(FORECAST($C102,X$105:X$116,$C$105:$C$116)<0,0,\nIF(FORECAST($C102,X$105:X$116,$C$105:$C$116)>100,100,\nFORECAST($C102,X$105:X$116,$C$105:$C$116))))","v":99.521948912174196},null,null,null,{"$f":"IF(MAX(C105:C116)-MIN(C105:C116)<5,AVERAGEIF(C105:C116,\">0\",AB105:AB116),\nIF(FORECAST($C102,AB$105:AB$116,$C$105:$C$116)<0,0,\nIF(FORECAST($C102,AB$105:AB$116,$C$105:$C$116)>100,100,\nFORECAST($C102,AB$105:AB$116,$C$105:$C$116))))","v":0}]
[]
[null,"Survey","Year","Improved","Not shared",null,null,"Open defecation","Improved","Not shared",null,null,"Open defecation","Improved","Not shared",null,null,"Open defecation","Improved","Not shared",null,null,"Open defecation","Improved","Not shared",null,null,"Open defecation"]
[null,"MICS06",2006,{"$f":"IF(ISERROR(INDIRECT(CONCATENATE($B105,\"!C122\"))),\"\",INDIRECT(CONCATENATE($B105,\"!C122\")))","v":93.871016576736793},{"$f":"IF(ISERROR(INDIRECT(CONCATENATE($B105,\"!C129\"))),\"\",INDIRECT(CONCATENATE($B105,\"!C129\")))","v":"N/A"},null,null,{"$f":"IF(ISERROR(INDIRECT(CONCATENATE($B105,\"!C127\"))),\"\",INDIRECT(CONCATENATE($B105,\"!C127\")))","v":1.0877510590378483},{"$f":"IF(ISERROR(INDIRECT(CONCATENATE($B105,\"!D122\"))),\"\",INDIRECT(CONCATENATE($B105,\"!D122\")))","v":99.397289087419722},{"$f":"IF(ISERROR(INDIRECT(CONCATENATE($B105,\"!D129\"))),\"\",INDIRECT(CONCATENATE($B105,\"!D129\")))","v":"N/A"},null,null,{"$f":"IF(ISERROR(INDIRECT(CONCATENATE($B105,\"!D127\"))),\"\",INDIRECT(CONCATENATE($B105,\"!D127\")))","v":0},{"$f":"IF(ISERROR(INDIRECT(CONCATENATE($B105,\"!E122\"))),\"\",INDIRECT(CONCATENATE($B105,\"!E122\")))","v":99.930523980687127},{"$f":"IF(ISERROR(INDIRECT(CONCATENATE($B105,\"!E129\"))),\"\",INDIRECT(CONCATENATE($B105,\"!E129\")))","v":"N/A"},null,null,{"$f":"IF(ISERROR(INDIRECT(CONCATENATE($B105,\"!E127\"))),\"\",INDIRECT(CONCATENATE($B105,\"!E127\")))","v":0},{"$f":"IF(ISERROR(INDIRECT(CONCATENATE($B105,\"!F122\"))),\"\",INDIRECT(CONCATENATE($B105,\"!F122\")))","v":99.786049409848687},{"$f":"IF(ISERROR(INDIRECT(CONCATENATE($B105,\"!F129\"))),\"\",INDIRECT(CONCATENATE($B105,\"!F129\")))","v":"N/A"},null,null,{"$f":"IF(ISERROR(INDIRECT(CONCATENATE($B105,\"!F127\"))),\"\",INDIRECT(CONCATENATE($B105,\"!F127\")))","v":0.21395059015117446},{"$f":"IF(ISERROR(INDIRECT(CONCATENATE($B105,\"!G122\"))),\"\",INDIRECT(CONCATENATE($B105,\"!G122\")))","v":99.999999999999886},{"$f":"IF(ISERROR(INDIRECT(CONCATENATE($B105,\"!G129\"))),\"\",INDIRECT(CONCATENATE($B105,\"!G129\")))","v":"N/A"},null,null,{"$f":"IF(ISERROR(INDIRECT(CONCATENATE($B105,\"!G2127\"))),\"\",INDIRECT(CONCATENATE($B105,\"!G127\")))","v":0}]
[null,"MICS13",2013,88.550328269969185,97.568808331868368,null,null,0.31102696427389004,95.975397254266113,99.608716257980518,null,null,0,98.478958560583806,99.458819381336809,null,null,0,99.399323899995338,99.52349710539292,null,null,0,99.68762573178654,99.736322357539763,null,null,0]
[null,"MICS18",2018,91.302563686679676,95.691625749579018,null,null,0.41645410558127743,96.69488549519285,99.470107182417706,null,null,0,98.558332403558182,99.606490335180965,null,null,0,99.086242971063683,99.57534075331435,null,null,0,99.622038416043125,100,null,null,0]
[null,null,null,"","",null,null,"","","",null,null,"","","",null,null,"","","",null,null,"","","",null,null,""]
[null,null,null,"","",null,null,"","","",null,null,"","","",null,null,"","","",null,null,"","","",null,null,""]
[null,null,null,"","",null,null,"","","",null,null,"","","",null,null,"","","",null,null,"","","",null,null,""]
[null,null,null,"","",null,null,"","","",null,null,"","","",null,null,"","","",null,null,"","","",null,null,""]
[null,null,null,"","",null,null,"","","",null,null,"","","",null,null,"","","",null,null,"","","",null,null,""]
[null,null,null,"","",null,null,"","","",null,null,"","","",null,null,"","","",null,null,"","","",null,null,""]
[null,null,null,"","",null,null,"","","",null,null,"","","",null,null,"","","",null,null,"","","",null,null,""]
[null,null,null,"","",null,null,"","","",null,null,"","","",null,null,"","","",null,null,"","","",null,null,""]
[null,null,null,"","",null,null,"","","",null,null,"","","",null,null,"","","",null,null,"","","",null,null,""]
[]
[null,{"$f":"CONCATENATE(\"National use of sanitation facilities, \",C99,\"–\",C100)","v":"National use of sanitation facilities, 2000–2020"},null,null,null,null,null,null,null,null,null,null,null,null,null,null,null,null,"Data points used for regression"]
[]
[]
[]
[]
[]
[]
[]
[]
[]
[]
[]
[]
[]
[]
[]
[]
[]
[]
[]
[]
[]
[]
[]
[]
[]
[]
[]
[]
[]
[]
[]
[]
[]
[]
[]
[]
[]
[]
[]
[]
[]
[]
[]
[]
[]
[]
[]
[]
[]
[]
[]
[]
[]
[]
[]
[]
[]
[]
[]
[]
[]
[]
[]
[]
[]
[]
[]
[]
[]
[]
[]
[]
[]
[]
[]
[]
[]
[]
["URBAN",null,null,"Poorest",null,null,null,null,"Poor",null,null,null,null,"Middle",null,null,null,null,"Rich",null,null,null,null,"Richest"]
[null,null,null,"Improved","Basic","Limited","Unimproved","Open defecation","Improved","Basic","Limited","Unimproved","Open defecation","Improved","Basic","Limited","Unimproved","Open defecation","Improved","Basic","Limited","Unimproved","Open defecation","Improved","Basic","Limited","Unimproved","Open defecation"]
["Forecast period:",null,2000,{"$f":"IF((D201+H201)>100,D201*100/(D201+H201),D201)","v":98.138542105504797},{"$f":"D199*AVERAGEIF(E205:E216,\">0\")/100","v":94.004444114654319},{"$f":"D199*(100-AVERAGEIF(E205:E216,\">0\"))/100","v":4.1340979908504805},{"$f":"100-(E199+F199+H199)","v":1.8613788797214283},{"$f":"IF((D201+H201)>100,H201*100/(D201+H201),H201)","v":7.9014773781693748E-5},{"$f":"IF((I201+M201)>100,I201*100/(I201+M201),I201)","v":99.602462039380171},{"$f":"I199*AVERAGEIF(J205:J216,\">0\")/100","v":99.465187107587468},{"$f":"I199*(100-AVERAGEIF(J205:J216,\">0\"))/100","v":0.13727493179270714},{"$f":"100-(J199+K199+M199)","v":0.39753796061982882},{"$f":"IF((I201+M201)>100,M201*100/(I201+M201),M201)","v":0},{"$f":"IF((N201+R201)>100,N201*100/(N201+R201),N201)","v":99.560493966747231},{"$f":"N199*AVERAGEIF(O205:O216,\">0\")/100","v":98.88597982899924},{"$f":"N199*(100-AVERAGEIF(O205:O216,\">0\"))/100","v":0.67451413774798252},{"$f":"100-(O199+P199+R199)","v":7.5904858015832133E-2},{"$f":"IF((N201+R201)>100,R201*100/(N201+R201),R201)","v":0.36360117523695834},{"$f":"IF((S201+W201)>100,S201*100/(S201+W201),S201)","v":99.988029104199128},{"$f":"S199*AVERAGEIF(T205:T216,\">0\")/100","v":99.593804116215111},{"$f":"S199*(100-AVERAGEIF(T205:T216,\">0\"))/100","v":0.39422498798402278},{"$f":"100-(T199+U199+W199)","v":1.1970895800871517E-2},{"$f":"IF((S201+W201)>100,W201*100/(S201+W201),W201)","v":0},{"$f":"IF((X201+AB201)>100,X201*100/(X201+AB201),X201)","v":100},{"$f":"X199*AVERAGEIF(Y205:Y216,\">0\")/100","v":99.915870001475213},{"$f":"X199*(100-AVERAGEIF(Y205:Y216,\">0\"))/100","v":8.4129998524787197E-2},{"$f":"100-(Y199+Z199+AB199)","v":0},{"$f":"IF((X201+AB201)>100,AB201*100/(X201+AB201),AB201)","v":0}]
[null,null,2020,{"$f":"IF((D202+H202)>100,D202*100/(D202+H202),D202)","v":96.46559901689966},{"$f":"D200*AVERAGEIF(E205:E216,\">0\")/100","v":92.401973956592357},{"$f":"D200*(100-AVERAGEIF(E205:E216,\">0\"))/100","v":4.0636250603073059},{"$f":"100-(E200+F200+H200)","v":3.1932706986023334},{"$f":"IF((D202+H202)>100,H202*100/(D202+H202),H202)","v":0.34113028449799998},{"$f":"IF((I202+M202)>100,I202*100/(I202+M202),I202)","v":98.692137744425239},{"$f":"I200*AVERAGEIF(J205:J216,\">0\")/100","v":98.556117447336746},{"$f":"I200*(100-AVERAGEIF(J205:J216,\">0\"))/100","v":0.13602029708849897},{"$f":"100-(J200+K200+M200)","v":1.3078622555747614},{"$f":"IF((I202+M202)>100,M202*100/(I202+M202),M202)","v":0},{"$f":"IF((N202+R202)>100,N202*100/(N202+R202),N202)","v":99.141841902542012},{"$f":"N200*AVERAGEIF(O205:O216,\">0\")/100","v":98.470164098010684},{"$f":"N200*(100-AVERAGEIF(O205:O216,\">0\"))/100","v":0.6716778045313343},{"$f":"100-(O200+P200+R200)","v":0.85815809745798788},{"$f":"IF((N202+R202)>100,R202*100/(N202+R202),R202)","v":0},{"$f":"IF((S202+W202)>100,S202*100/(S202+W202),S202)","v":99.762233762521845},{"$f":"S200*AVERAGEIF(T205:T216,\">0\")/100","v":99.36889902276711},{"$f":"S200*(100-AVERAGEIF(T205:T216,\">0\"))/100","v":0.39333473975473915},{"$f":"100-(T200+U200+W200)","v":0.23776623747815506},{"$f":"IF((S202+W202)>100,W202*100/(S202+W202),W202)","v":0},{"$f":"IF((X202+AB202)>100,X202*100/(X202+AB202),X202)","v":99.27039498766915},{"$f":"X200*AVERAGEIF(Y205:Y216,\">0\")/100","v":99.186878805830474},{"$f":"X200*(100-AVERAGEIF(Y205:Y216,\">0\"))/100","v":8.3516181838676484E-2},{"$f":"100-(Y200+Z200+AB200)","v":0.7296050123308504},{"$f":"IF((X202+AB202)>100,AB202*100/(X202+AB202),AB202)","v":0}]
["Regression period:",null,{"$f":"MinRegYear(C199,C205:C216)","v":2004},{"$f":"IF(MAX(C205:C216)-MIN(C205:C216)<5,AVERAGEIF(C205:C216,\">0\",D205:D216),\nIF(FORECAST($C201,D$205:D$216,$C$205:$C$216)<0,0,\nIF(FORECAST($C201,D$205:D$216,$C$205:$C$216)>100,100,\nFORECAST($C201,D$205:D$216,$C$205:$C$216))))","v":98.138542105504797},null,null,null,{"$f":"IF(MAX(C205:C216)-MIN(C205:C216)<5,AVERAGEIF(C205:C216,\">0\",H205:H216),\nIF(FORECAST($C201,H$205:H$216,$C$205:$C$216)<0,0,\nIF(FORECAST($C201,H$205:H$216,$C$205:$C$216)>100,100,\nFORECAST($C201,H$205:H$216,$C$205:$C$216))))","v":7.9014773781693748E-5},{"$f":"IF(MAX(C205:C216)-MIN(C205:C216)<5,AVERAGEIF(C205:C216,\">0\",I205:I216),\nIF(FORECAST($C201,I$205:I$216,$C$205:$C$216)<0,0,\nIF(FORECAST($C201,I$205:I$216,$C$205:$C$216)>100,100,\nFORECAST($C201,I$205:I$216,$C$205:$C$216))))","v":99.602462039380171},null,null,null,{"$f":"IF(MAX(C205:C216)-MIN(C205:C216)<5,AVERAGEIF(C205:C216,\">0\",M205:M216),\nIF(FORECAST($C201,M$205:M$216,$C$205:$C$216)<0,0,\nIF(FORECAST($C201,M$205:M$216,$C$205:$C$216)>100,100,\nFORECAST($C201,M$205:M$216,$C$205:$C$216))))","v":0},{"$f":"IF(MAX(C205:C216)-MIN(C205:C216)<5,AVERAGEIF(C205:C216,\">0\",N205:N216),\nIF(FORECAST($C201,N$205:N$216,$C$205:$C$216)<0,0,\nIF(FORECAST($C201,N$205:N$216,$C$205:$C$216)>100,100,\nFORECAST($C201,N$205:N$216,$C$205:$C$216))))","v":99.560493966747231},null,null,null,{"$f":"IF(MAX(C205:C216)-MIN(C205:C216)<5,AVERAGEIF(C205:C216,\">0\",R205:R216),\nIF(FORECAST($C201,R$205:R$216,$C$205:$C$216)<0,0,\nIF(FORECAST($C201,R$205:R$216,$C$205:$C$216)>100,100,\nFORECAST($C201,R$205:R$216,$C$205:$C$216))))","v":0.36360117523695834},{"$f":"IF(MAX(C205:C216)-MIN(C205:C216)<5,AVERAGEIF(C205:C216,\">0\",S205:S216),\nIF(FORECAST($C201,S$205:S$216,$C$205:$C$216)<0,0,\nIF(FORECAST($C201,S$205:S$216,$C$205:$C$216)>100,100,\nFORECAST($C201,S$205:S$216,$C$205:$C$216))))","v":99.988029104199128},null,null,null,{"$f":"IF(MAX(C205:C216)-MIN(C205:C216)<5,AVERAGEIF(C205:C216,\">0\",W205:W216),\nIF(FORECAST($C201,W$205:W$216,$C$205:$C$216)<0,0,\nIF(FORECAST($C201,W$205:W$216,$C$205:$C$216)>100,100,\nFORECAST($C201,W$205:W$216,$C$205:$C$216))))","v":0},{"$f":"IF(MAX(C205:C216)-MIN(C205:C216)<5,AVERAGEIF(C205:C216,\">0\",X205:X216),\nIF(FORECAST($C201,X$205:X$216,$C$205:$C$216)<0,0,\nIF(FORECAST($C201,X$205:X$216,$C$205:$C$216)>100,100,\nFORECAST($C201,X$205:X$216,$C$205:$C$216))))","v":100},null,null,null,{"$f":"IF(MAX(C205:C216)-MIN(C205:C216)<5,AVERAGEIF(C205:C216,\">0\",AB205:AB216),\nIF(FORECAST($C201,AB$205:AB$216,$C$205:$C$216)<0,0,\nIF(FORECAST($C201,AB$205:AB$216,$C$205:$C$216)>100,100,\nFORECAST($C201,AB$205:AB$216,$C$205:$C$216))))","v":0}]
[null,null,{"$f":"MaxRegYear(C200,C205:C216)","v":2020},{"$f":"IF(MAX(C205:C216)-MIN(C205:C216)<5,AVERAGEIF(C205:C216,\">0\",D205:D216),\nIF(FORECAST($C202,D$205:D$216,$C$205:$C$216)<0,0,\nIF(FORECAST($C202,D$205:D$216,$C$205:$C$216)>100,100,\nFORECAST($C202,D$205:D$216,$C$205:$C$216))))","v":96.46559901689966},null,null,null,{"$f":"IF(MAX(C205:C216)-MIN(C205:C216)<5,AVERAGEIF(C205:C216,\">0\",H205:H216),\nIF(FORECAST($C202,H$205:H$216,$C$205:$C$216)<0,0,\nIF(FORECAST($C202,H$205:H$216,$C$205:$C$216)>100,100,\nFORECAST($C202,H$205:H$216,$C$205:$C$216))))","v":0.34113028449799998},{"$f":"IF(MAX(C205:C216)-MIN(C205:C216)<5,AVERAGEIF(C205:C216,\">0\",I205:I216),\nIF(FORECAST($C202,I$205:I$216,$C$205:$C$216)<0,0,\nIF(FORECAST($C202,I$205:I$216,$C$205:$C$216)>100,100,\nFORECAST($C202,I$205:I$216,$C$205:$C$216))))","v":98.692137744425239},null,null,null,{"$f":"IF(MAX(C205:C216)-MIN(C205:C216)<5,AVERAGEIF(C205:C216,\">0\",M205:M216),\nIF(FORECAST($C202,M$205:M$216,$C$205:$C$216)<0,0,\nIF(FORECAST($C202,M$205:M$216,$C$205:$C$216)>100,100,\nFORECAST($C202,M$205:M$216,$C$205:$C$216))))","v":0},{"$f":"IF(MAX(C205:C216)-MIN(C205:C216)<5,AVERAGEIF(C205:C216,\">0\",N205:N216),\nIF(FORECAST($C202,N$205:N$216,$C$205:$C$216)<0,0,\nIF(FORECAST($C202,N$205:N$216,$C$205:$C$216)>100,100,\nFORECAST($C202,N$205:N$216,$C$205:$C$216))))","v":99.141841902542012},null,null,null,{"$f":"IF(MAX(C205:C216)-MIN(C205:C216)<5,AVERAGEIF(C205:C216,\">0\",R205:R216),\nIF(FORECAST($C202,R$205:R$216,$C$205:$C$216)<0,0,\nIF(FORECAST($C202,R$205:R$216,$C$205:$C$216)>100,100,\nFORECAST($C202,R$205:R$216,$C$205:$C$216))))","v":0},{"$f":"IF(MAX(C205:C216)-MIN(C205:C216)<5,AVERAGEIF(C205:C216,\">0\",S205:S216),\nIF(FORECAST($C202,S$205:S$216,$C$205:$C$216)<0,0,\nIF(FORECAST($C202,S$205:S$216,$C$205:$C$216)>100,100,\nFORECAST($C202,S$205:S$216,$C$205:$C$216))))","v":99.762233762521845},null,null,null,{"$f":"IF(MAX(C205:C216)-MIN(C205:C216)<5,AVERAGEIF(C205:C216,\">0\",W205:W216),\nIF(FORECAST($C202,W$205:W$216,$C$205:$C$216)<0,0,\nIF(FORECAST($C202,W$205:W$216,$C$205:$C$216)>100,100,\nFORECAST($C202,W$205:W$216,$C$205:$C$216))))","v":0},{"$f":"IF(MAX(C205:C216)-MIN(C205:C216)<5,AVERAGEIF(C205:C216,\">0\",X205:X216),\nIF(FORECAST($C202,X$205:X$216,$C$205:$C$216)<0,0,\nIF(FORECAST($C202,X$205:X$216,$C$205:$C$216)>100,100,\nFORECAST($C202,X$205:X$216,$C$205:$C$216))))","v":99.27039498766915},null,null,null,{"$f":"IF(MAX(C205:C216)-MIN(C205:C216)<5,AVERAGEIF(C205:C216,\">0\",AB205:AB216),\nIF(FORECAST($C202,AB$205:AB$216,$C$205:$C$216)<0,0,\nIF(FORECAST($C202,AB$205:AB$216,$C$205:$C$216)>100,100,\nFORECAST($C202,AB$205:AB$216,$C$205:$C$216))))","v":0}]
[]
[null,"Survey","Year","Improved","Not shared",null,null,"Open defecation","Improved","Not shared",null,null,"Open defecation","Improved","Not shared",null,null,"Open defecation","Improved","Not shared",null,null,"Open defecation","Improved","Not shared",null,null,"Open defecation"]
[null,"MICS06",2006,{"$f":"IF(ISERROR(INDIRECT(CONCATENATE($B205,\"!H122\"))),\"\",INDIRECT(CONCATENATE($B205,\"!H122\")))","v":98.885845157936117},{"$f":"IF(ISERROR(INDIRECT(CONCATENATE($B205,\"!H129\"))),\"\",INDIRECT(CONCATENATE($B205,\"!H129\")))","v":"N/A"},null,null,{"$f":"IF(ISERROR(INDIRECT(CONCATENATE($B205,\"!H127\"))),\"\",INDIRECT(CONCATENATE($B205,\"!H127\")))","v":0},{"$f":"IF(ISERROR(INDIRECT(CONCATENATE($B205,\"!I122\"))),\"\",INDIRECT(CONCATENATE($B205,\"!I122\")))","v":99.888200440398791},{"$f":"IF(ISERROR(INDIRECT(CONCATENATE($B205,\"!I129\"))),\"\",INDIRECT(CONCATENATE($B205,\"!I129\")))","v":"N/A"},null,null,{"$f":"IF(ISERROR(INDIRECT(CONCATENATE($B205,\"!I127\"))),\"\",INDIRECT(CONCATENATE($B205,\"!I127\")))","v":0},{"$f":"IF(ISERROR(INDIRECT(CONCATENATE($B205,\"!J122\"))),\"\",INDIRECT(CONCATENATE($B205,\"!J122\")))","v":99.656861228564225},{"$f":"IF(ISERROR(INDIRECT(CONCATENATE($B205,\"!J129\"))),\"\",INDIRECT(CONCATENATE($B205,\"!J129\")))","v":"N/A"},null,null,{"$f":"IF(ISERROR(INDIRECT(CONCATENATE($B205,\"!J127\"))),\"\",INDIRECT(CONCATENATE($B205,\"!J127\")))","v":0.34313877143574456},{"$f":"IF(ISERROR(INDIRECT(CONCATENATE($B205,\"!K122\"))),\"\",INDIRECT(CONCATENATE($B205,\"!K122\")))","v":99.999999999999972},{"$f":"IF(ISERROR(INDIRECT(CONCATENATE($B205,\"!K129\"))),\"\",INDIRECT(CONCATENATE($B205,\"!K129\")))","v":"N/A"},null,null,{"$f":"IF(ISERROR(INDIRECT(CONCATENATE($B205,\"!K127\"))),\"\",INDIRECT(CONCATENATE($B205,\"!K127\")))","v":0},{"$f":"IF(ISERROR(INDIRECT(CONCATENATE($B205,\"!L122\"))),\"\",INDIRECT(CONCATENATE($B205,\"!L122\")))","v":100.00000000000011},{"$f":"IF(ISERROR(INDIRECT(CONCATENATE($B205,\"!L129\"))),\"\",INDIRECT(CONCATENATE($B205,\"!L129\")))","v":"N/A"},null,null,{"$f":"IF(ISERROR(INDIRECT(CONCATENATE($B205,\"!L2127\"))),\"\",INDIRECT(CONCATENATE($B205,\"!L127\")))","v":0}]
[null,"MICS13",2013,94.902101365747711,96.642691519540747,null,null,0.29442537036798971,98.131535172536829,99.724354340280385,null,null,0,98.96812513300948,99.164016217310532,null,null,0,99.764550472080487,99.328571445414269,null,null,0,99.501752886257876,99.831740002950426,null,null,0]
[null,"MICS18",2018,98.013706216885041,94.932284219540264,null,null,0.23870428289743886,99.365268794337794,100,null,null,0,99.402351688347366,99.481000272918479,null,null,0,99.846731619146212,99.88288418279258,null,null,0,99.432472183848262,100,null,null,0]
[null,null,null,"","",null,null,"","","",null,null,"","","",null,null,"","","",null,null,"","","",null,null,""]
[null,null,null,"","",null,null,"","","",null,null,"","","",null,null,"","","",null,null,"","","",null,null,""]
[null,null,null,"","",null,null,"","","",null,null,"","","",null,null,"","","",null,null,"","","",null,null,""]
[null,null,null,"","",null,null,"","","",null,null,"","","",null,null,"","","",null,null,"","","",null,null,""]
[null,null,null,"","",null,null,"","","",null,null,"","","",null,null,"","","",null,null,"","","",null,null,""]
[null,null,null,"","",null,null,"","","",null,null,"","","",null,null,"","","",null,null,"","","",null,null,""]
[null,null,null,"","",null,null,"","","",null,null,"","","",null,null,"","","",null,null,"","","",null,null,""]
[null,null,null,"","",null,null,"","","",null,null,"","","",null,null,"","","",null,null,"","","",null,null,""]
[null,null,null,"","",null,null,"","","",null,null,"","","",null,null,"","","",null,null,"","","",null,null,""]
[]
[null,{"$f":"CONCATENATE(\"Urban use of sanitation facilities, \",C199,\"–\",C200)","v":"Urban use of sanitation facilities, 2000–2020"},null,null,null,null,null,null,null,null,null,null,null,null,null,null,null,null,"Data points used for regression"]
[]
[]
[]
[]
[]
[]
[]
[]
[]
[]
[]
[]
[]
[]
[]
[]
[]
[]
[]
[]
[]
[]
[]
[]
[]
[]
[]
[]
[]
[]
[]
[]
[]
[]
[]
[]
[]
[]
[]
[]
[]
[]
[]
[]
[]
[]
[]
[]
[]
[]
[]
[]
[]
[]
[]
[]
[]
[]
[]
[]
[]
[]
[]
[]
[]
[]
[]
[]
[]
[]
[]
[]
[]
[]
[]
[]
[]
[]
["RURAL",null,null,"Poorest",null,null,null,null,"Poor",null,null,null,null,"Middle",null,null,null,null,"Rich",null,null,null,null,"Richest"]
[null,null,null,"Improved","Basic","Limited","Unimproved","Open defecation","Improved","Basic","Limited","Unimproved","Open defecation","Improved","Basic","Limited","Unimproved","Open defecation","Improved","Basic","Limited","Unimproved","Open defecation","Improved","Basic","Limited","Unimproved","Open defecation"]
["Forecast period:",null,2000,{"$f":"IF((D301+H301)>100,D301*100/(D301+H301),D301)","v":93.831389569199018},{"$f":"D299*AVERAGEIF(E305:E316,\">0\")/100","v":91.666052680764437},{"$f":"D299*(100-AVERAGEIF(E305:E316,\">0\"))/100","v":2.1653368884345818},{"$f":"100-(E299+F299+H299)","v":4.8420459068142065},{"$f":"IF((D301+H301)>100,H301*100/(D301+H301),H301)","v":1.3265645239867752},{"$f":"IF((I301+M301)>100,I301*100/(I301+M301),I301)","v":91.532780224382094},{"$f":"I299*AVERAGEIF(J305:J316,\">0\")/100","v":91.205981051887974},{"$f":"I299*(100-AVERAGEIF(J305:J316,\">0\"))/100","v":0.32679917249411744},{"$f":"100-(J299+K299+M299)","v":6.9082777632877708},{"$f":"IF((I301+M301)>100,M301*100/(I301+M301),M301)","v":1.5589420123301352},{"$f":"IF((N301+R301)>100,N301*100/(N301+R301),N301)","v":99.829202858527424},{"$f":"N299*AVERAGEIF(O305:O316,\">0\")/100","v":99.829202858527424},{"$f":"N299*(100-AVERAGEIF(O305:O316,\">0\"))/100","v":0},{"$f":"100-(O299+P299+R299)","v":0.17079714147257619},{"$f":"IF((N301+R301)>100,R301*100/(N301+R301),R301)","v":0},{"$f":"IF((S301+W301)>100,S301*100/(S301+W301),S301)","v":100},{"$f":"S299*AVERAGEIF(T305:T316,\">0\")/100","v":99.400884417163013},{"$f":"S299*(100-AVERAGEIF(T305:T316,\">0\"))/100","v":0.59911558283698696},{"$f":"100-(T299+U299+W299)","v":0},{"$f":"IF((S301+W301)>100,W301*100/(S301+W301),W301)","v":0},{"$f":"IF((X301+AB301)>100,X301*100/(X301+AB301),X301)","v":100},{"$f":"X299*AVERAGEIF(Y305:Y316,\">0\")/100","v":99.78150025649569},{"$f":"X299*(100-AVERAGEIF(Y305:Y316,\">0\"))/100","v":0.21849974350431012},{"$f":"100-(Y299+Z299+AB299)","v":0},{"$f":"IF((X301+AB301)>100,AB301*100/(X301+AB301),AB301)","v":0}]
[null,null,2020,{"$f":"IF((D302+H302)>100,D302*100/(D302+H302),D302)","v":80.053052430044318},{"$f":"D300*AVERAGEIF(E305:E316,\">0\")/100","v":78.205676746337474},{"$f":"D300*(100-AVERAGEIF(E305:E316,\">0\"))/100","v":1.8473756837068476},{"$f":"100-(E300+F300+H300)","v":19.563297907027135},{"$f":"IF((D302+H302)>100,H302*100/(D302+H302),H302)","v":0.38364966292854774},{"$f":"IF((I302+M302)>100,I302*100/(I302+M302),I302)","v":90.915860435196336},{"$f":"I300*AVERAGEIF(J305:J316,\">0\")/100","v":90.591263849317713},{"$f":"I300*(100-AVERAGEIF(J305:J316,\">0\"))/100","v":0.32459658587862372},{"$f":"100-(J300+K300+M300)","v":9.0841395648036638},{"$f":"IF((I302+M302)>100,M302*100/(I302+M302),M302)","v":0},{"$f":"IF((N302+R302)>100,N302*100/(N302+R302),N302)","v":91.678152544468958},{"$f":"N300*AVERAGEIF(O305:O316,\">0\")/100","v":91.678152544468958},{"$f":"N300*(100-AVERAGEIF(O305:O316,\">0\"))/100","v":0},{"$f":"100-(O300+P300+R300)","v":8.3218474555310422},{"$f":"IF((N302+R302)>100,R302*100/(N302+R302),R302)","v":0},{"$f":"IF((S302+W302)>100,S302*100/(S302+W302),S302)","v":96.44037375687742},{"$f":"S300*AVERAGEIF(T305:T316,\">0\")/100","v":95.862584449553736},{"$f":"S300*(100-AVERAGEIF(T305:T316,\">0\"))/100","v":0.57778930732368483},{"$f":"100-(T300+U300+W300)","v":3.5596262431225796},{"$f":"IF((S302+W302)>100,W302*100/(S302+W302),W302)","v":0},{"$f":"IF((X302+AB302)>100,X302*100/(X302+AB302),X302)","v":99.005023591398555},{"$f":"X300*AVERAGEIF(Y305:Y316,\">0\")/100","v":98.788697868794969},{"$f":"X300*(100-AVERAGEIF(Y305:Y316,\">0\"))/100","v":0.21632572260358757},{"$f":"100-(Y300+Z300+AB300)","v":0.99497640860144543},{"$f":"IF((X302+AB302)>100,AB302*100/(X302+AB302),AB302)","v":0}]
["Regression period:",null,{"$f":"MinRegYear(C299,C305:C316)","v":2004},{"$f":"IF(MAX(C305:C316)-MIN(C305:C316)<5,AVERAGEIF(C305:C316,\">0\",D305:D316),\nIF(FORECAST($C301,D$305:D$316,$C$305:$C$316)<0,0,\nIF(FORECAST($C301,D$305:D$316,$C$305:$C$316)>100,100,\nFORECAST($C301,D$305:D$316,$C$305:$C$316))))","v":93.831389569199018},null,null,null,{"$f":"IF(MAX(C305:C316)-MIN(C305:C316)<5,AVERAGEIF(C305:C316,\">0\",H305:H316),\nIF(FORECAST($C301,H$305:H$316,$C$305:$C$316)<0,0,\nIF(FORECAST($C301,H$305:H$316,$C$305:$C$316)>100,100,\nFORECAST($C301,H$305:H$316,$C$305:$C$316))))","v":1.3265645239867752},{"$f":"IF(MAX(C305:C316)-MIN(C305:C316)<5,AVERAGEIF(C305:C316,\">0\",I305:I316),\nIF(FORECAST($C301,I$305:I$316,$C$305:$C$316)<0,0,\nIF(FORECAST($C301,I$305:I$316,$C$305:$C$316)>100,100,\nFORECAST($C301,I$305:I$316,$C$305:$C$316))))","v":91.532780224382094},null,null,null,{"$f":"IF(MAX(C305:C316)-MIN(C305:C316)<5,AVERAGEIF(C305:C316,\">0\",M305:M316),\nIF(FORECAST($C301,M$305:M$316,$C$305:$C$316)<0,0,\nIF(FORECAST($C301,M$305:M$316,$C$305:$C$316)>100,100,\nFORECAST($C301,M$305:M$316,$C$305:$C$316))))","v":1.5589420123301352},{"$f":"IF(MAX(C305:C316)-MIN(C305:C316)<5,AVERAGEIF(C305:C316,\">0\",N305:N316),\nIF(FORECAST($C301,N$305:N$316,$C$305:$C$316)<0,0,\nIF(FORECAST($C301,N$305:N$316,$C$305:$C$316)>100,100,\nFORECAST($C301,N$305:N$316,$C$305:$C$316))))","v":99.829202858527424},null,null,null,{"$f":"IF(MAX(C305:C316)-MIN(C305:C316)<5,AVERAGEIF(C305:C316,\">0\",R305:R316),\nIF(FORECAST($C301,R$305:R$316,$C$305:$C$316)<0,0,\nIF(FORECAST($C301,R$305:R$316,$C$305:$C$316)>100,100,\nFORECAST($C301,R$305:R$316,$C$305:$C$316))))","v":0},{"$f":"IF(MAX(C305:C316)-MIN(C305:C316)<5,AVERAGEIF(C305:C316,\">0\",S305:S316),\nIF(FORECAST($C301,S$305:S$316,$C$305:$C$316)<0,0,\nIF(FORECAST($C301,S$305:S$316,$C$305:$C$316)>100,100,\nFORECAST($C301,S$305:S$316,$C$305:$C$316))))","v":100},null,null,null,{"$f":"IF(MAX(C305:C316)-MIN(C305:C316)<5,AVERAGEIF(C305:C316,\">0\",W305:W316),\nIF(FORECAST($C301,W$305:W$316,$C$305:$C$316)<0,0,\nIF(FORECAST($C301,W$305:W$316,$C$305:$C$316)>100,100,\nFORECAST($C301,W$305:W$316,$C$305:$C$316))))","v":0},{"$f":"IF(MAX(C305:C316)-MIN(C305:C316)<5,AVERAGEIF(C305:C316,\">0\",X305:X316),\nIF(FORECAST($C301,X$305:X$316,$C$305:$C$316)<0,0,\nIF(FORECAST($C301,X$305:X$316,$C$305:$C$316)>100,100,\nFORECAST($C301,X$305:X$316,$C$305:$C$316))))","v":100},null,null,null,{"$f":"IF(MAX(C305:C316)-MIN(C305:C316)<5,AVERAGEIF(C305:C316,\">0\",AB305:AB316),\nIF(FORECAST($C301,AB$305:AB$316,$C$305:$C$316)<0,0,\nIF(FORECAST($C301,AB$305:AB$316,$C$305:$C$316)>100,100,\nFORECAST($C301,AB$305:AB$316,$C$305:$C$316))))","v":0}]
[null,null,{"$f":"MaxRegYear(C300,C305:C316)","v":2020},{"$f":"IF(MAX(C305:C316)-MIN(C305:C316)<5,AVERAGEIF(C305:C316,\">0\",D305:D316),\nIF(FORECAST($C302,D$305:D$316,$C$305:$C$316)<0,0,\nIF(FORECAST($C302,D$305:D$316,$C$305:$C$316)>100,100,\nFORECAST($C302,D$305:D$316,$C$305:$C$316))))","v":80.053052430044318},null,null,null,{"$f":"IF(MAX(C305:C316)-MIN(C305:C316)<5,AVERAGEIF(C305:C316,\">0\",H305:H316),\nIF(FORECAST($C302,H$305:H$316,$C$305:$C$316)<0,0,\nIF(FORECAST($C302,H$305:H$316,$C$305:$C$316)>100,100,\nFORECAST($C302,H$305:H$316,$C$305:$C$316))))","v":0.38364966292854774},{"$f":"IF(MAX(C305:C316)-MIN(C305:C316)<5,AVERAGEIF(C305:C316,\">0\",I305:I316),\nIF(FORECAST($C302,I$305:I$316,$C$305:$C$316)<0,0,\nIF(FORECAST($C302,I$305:I$316,$C$305:$C$316)>100,100,\nFORECAST($C302,I$305:I$316,$C$305:$C$316))))","v":90.915860435196336},null,null,null,{"$f":"IF(MAX(C305:C316)-MIN(C305:C316)<5,AVERAGEIF(C305:C316,\">0\",M305:M316),\nIF(FORECAST($C302,M$305:M$316,$C$305:$C$316)<0,0,\nIF(FORECAST($C302,M$305:M$316,$C$305:$C$316)>100,100,\nFORECAST($C302,M$305:M$316,$C$305:$C$316))))","v":0},{"$f":"IF(MAX(C305:C316)-MIN(C305:C316)<5,AVERAGEIF(C305:C316,\">0\",N305:N316),\nIF(FORECAST($C302,N$305:N$316,$C$305:$C$316)<0,0,\nIF(FORECAST($C302,N$305:N$316,$C$305:$C$316)>100,100,\nFORECAST($C302,N$305:N$316,$C$305:$C$316))))","v":91.678152544468958},null,null,null,{"$f":"IF(MAX(C305:C316)-MIN(C305:C316)<5,AVERAGEIF(C305:C316,\">0\",R305:R316),\nIF(FORECAST($C302,R$305:R$316,$C$305:$C$316)<0,0,\nIF(FORECAST($C302,R$305:R$316,$C$305:$C$316)>100,100,\nFORECAST($C302,R$305:R$316,$C$305:$C$316))))","v":0},{"$f":"IF(MAX(C305:C316)-MIN(C305:C316)<5,AVERAGEIF(C305:C316,\">0\",S305:S316),\nIF(FORECAST($C302,S$305:S$316,$C$305:$C$316)<0,0,\nIF(FORECAST($C302,S$305:S$316,$C$305:$C$316)>100,100,\nFORECAST($C302,S$305:S$316,$C$305:$C$316))))","v":96.44037375687742},null,null,null,{"$f":"IF(MAX(C305:C316)-MIN(C305:C316)<5,AVERAGEIF(C305:C316,\">0\",W305:W316),\nIF(FORECAST($C302,W$305:W$316,$C$305:$C$316)<0,0,\nIF(FORECAST($C302,W$305:W$316,$C$305:$C$316)>100,100,\nFORECAST($C302,W$305:W$316,$C$305:$C$316))))","v":0},{"$f":"IF(MAX(C305:C316)-MIN(C305:C316)<5,AVERAGEIF(C305:C316,\">0\",X305:X316),\nIF(FORECAST($C302,X$305:X$316,$C$305:$C$316)<0,0,\nIF(FORECAST($C302,X$305:X$316,$C$305:$C$316)>100,100,\nFORECAST($C302,X$305:X$316,$C$305:$C$316))))","v":99.005023591398555},null,null,null,{"$f":"IF(MAX(C305:C316)-MIN(C305:C316)<5,AVERAGEIF(C305:C316,\">0\",AB305:AB316),\nIF(FORECAST($C302,AB$305:AB$316,$C$305:$C$316)<0,0,\nIF(FORECAST($C302,AB$305:AB$316,$C$305:$C$316)>100,100,\nFORECAST($C302,AB$305:AB$316,$C$305:$C$316))))","v":0}]
[]
[null,"Survey","Year","Improved","Not shared",null,null,"Open defecation","Improved","Not shared",null,null,"Open defecation","Improved","Not shared",null,null,"Open defecation","Improved","Not shared",null,null,"Open defecation","Improved","Not shared",null,null,"Open defecation"]
[null,"MICS06",2006,{"$f":"IF(ISERROR(INDIRECT(CONCATENATE($B305,\"!M122\"))),\"\",INDIRECT(CONCATENATE($B305,\"!M122\")))","v":92.482542544619761},{"$f":"IF(ISERROR(INDIRECT(CONCATENATE($B305,\"!M129\"))),\"\",INDIRECT(CONCATENATE($B305,\"!M129\")))","v":"N/A"},null,null,{"$f":"IF(ISERROR(INDIRECT(CONCATENATE($B305,\"!M127\"))),\"\",INDIRECT(CONCATENATE($B305,\"!M127\")))","v":1.3993286715769651},{"$f":"IF(ISERROR(INDIRECT(CONCATENATE($B305,\"!N122\"))),\"\",INDIRECT(CONCATENATE($B305,\"!N122\")))","v":92.680393821171776},{"$f":"IF(ISERROR(INDIRECT(CONCATENATE($B305,\"!N129\"))),\"\",INDIRECT(CONCATENATE($B305,\"!N129\")))","v":"N/A"},null,null,{"$f":"IF(ISERROR(INDIRECT(CONCATENATE($B305,\"!N127\"))),\"\",INDIRECT(CONCATENATE($B305,\"!N127\")))","v":1.4712093449695964},{"$f":"IF(ISERROR(INDIRECT(CONCATENATE($B305,\"!O122\"))),\"\",INDIRECT(CONCATENATE($B305,\"!O122\")))","v":99.018425914651175},{"$f":"IF(ISERROR(INDIRECT(CONCATENATE($B305,\"!O129\"))),\"\",INDIRECT(CONCATENATE($B305,\"!O129\")))","v":"N/A"},null,null,{"$f":"IF(ISERROR(INDIRECT(CONCATENATE($B305,\"!O127\"))),\"\",INDIRECT(CONCATENATE($B305,\"!O127\")))","v":0},{"$f":"IF(ISERROR(INDIRECT(CONCATENATE($B305,\"!P122\"))),\"\",INDIRECT(CONCATENATE($B305,\"!P122\")))","v":99.999999999999943},{"$f":"IF(ISERROR(INDIRECT(CONCATENATE($B305,\"!P129\"))),\"\",INDIRECT(CONCATENATE($B305,\"!P129\")))","v":"N/A"},null,null,{"$f":"IF(ISERROR(INDIRECT(CONCATENATE($B305,\"!P127\"))),\"\",INDIRECT(CONCATENATE($B305,\"!P127\")))","v":0},{"$f":"IF(ISERROR(INDIRECT(CONCATENATE($B305,\"!Q122\"))),\"\",INDIRECT(CONCATENATE($B305,\"!Q122\")))","v":99.999999999999986},{"$f":"IF(ISERROR(INDIRECT(CONCATENATE($B305,\"!Q129\"))),\"\",INDIRECT(CONCATENATE($B305,\"!Q129\")))","v":"N/A"},null,null,{"$f":"IF(ISERROR(INDIRECT(CONCATENATE($B305,\"!Q2127\"))),\"\",INDIRECT(CONCATENATE($B305,\"!Q127\")))","v":0}]
[null,"MICS13",2013,85.184806645668161,98.688185148571648,null,null,0.33866650210762533,88.246414273914155,100,null,null,0,94.744786627955506,100,null,null,0,98.453003212168184,100,null,null,0,99.96936805218472,99.56300051299138,null,null,0]
[null,"MICS18",2018,82.298167737379771,96.696436355221195,null,null,0.76839392787227889,92.707595407457617,99.285940683342048,null,null,0,92.988379917259579,100,null,null,0,96.847966484376713,98.80176883432604,null,null,0,98.944782041047404,100,null,null,0]
[null,null,null,"","",null,null,"","","",null,null,"","","",null,null,"","","",null,null,"","","",null,null,""]
[null,null,null,"","",null,null,"","","",null,null,"","","",null,null,"","","",null,null,"","","",null,null,""]
[null,null,null,"","",null,null,"","","",null,null,"","","",null,null,"","","",null,null,"","","",null,null,""]
[null,null,null,"","",null,null,"","","",null,null,"","","",null,null,"","","",null,null,"","","",null,null,""]
[null,null,null,"","",null,null,"","","",null,null,"","","",null,null,"","","",null,null,"","","",null,null,""]
[null,null,null,"","",null,null,"","","",null,null,"","","",null,null,"","","",null,null,"","","",null,null,""]
[null,null,null,"","",null,null,"","","",null,null,"","","",null,null,"","","",null,null,"","","",null,null,""]
[null,null,null,"","",null,null,"","","",null,null,"","","",null,null,"","","",null,null,"","","",null,null,""]
[null,null,null,"","",null,null,"","","",null,null,"","","",null,null,"","","",null,null,"","","",null,null,""]
[]
[null,{"$f":"CONCATENATE(\"Rural use of sanitation facilities, \",C299,\"–\",C300)","v":"Rural use of sanitation facilities, 2000–2020"},null,null,null,null,null,null,null,null,null,null,null,null,null,null,null,null,"Data points used for regression"]

{"sheet":"Hygiene","index":3,"n_rows":91,"n_cols":25,"rows_kept":91,"cut":false,"hidden":false,"merged":[[6,1,6,7],[3,1,3,24],[4,1,4,24],[33,1,34,3],[31,6,32,9],[31,10,31,12],[31,13,31,15],[6,10,6,15],[6,18,6,23],[33,19,34,19],[31,16,31,18],[31,19,31,21],[31,22,31,24],[33,6,34,7],[33,8,34,8],[33,9,34,9],[33,15,34,15],[33,16,34,16],[33,17,34,17],[33,18,34,18],[36,6,37,7],[36,8,37,8],[36,9,37,9],[36,10,37,10],[36,11,37,11],[33,10,34,10],[33,11,34,11],[33,12,34,12],[33,13,34,13],[33,14,34,14],[33,20,34,20],[33,21,34,21],[33,22,34,22],[33,23,34,23],[33,24,34,24],[36,19,37,19],[36,20,37,20],[36,21,37,21],[36,22,37,22],[36,23,37,23],[39,12,40,12],[39,13,40,13],[39,14,40,14],[39,15,40,15],[36,18,37,18],[36,12,37,12],[36,13,37,13],[36,14,37,14],[36,15,37,15],[36,16,37,16],[36,17,37,17],[39,22,40,22],[39,23,40,23],[39,24,40,24],[31,4,32,5],[39,16,40,16],[39,17,40,17],[39,18,40,18],[39,19,40,19],[39,20,40,20],[39,21,40,21],[36,24,37,24],[39,6,40,7],[39,8,40,8],[39,9,40,9],[39,10,40,10],[39,11,40,11]]}
[]
[]
[]
[null,"Access to hygiene facilities by wealth quintile (%)"]
[null,{"$f":"IF(ISERROR(INDIRECT(CONCATENATE($E$32,\"!A2\"))),\"\",INDIRECT(CONCATENATE($E$32,\"!A2\")))","v":"Montenegro"}]
[]
[null,{"$f":"CONCATENATE(\"National \",IF(ISERROR(INDIRECT(CONCATENATE($E$32,\"!A2\"))),\"\",INDIRECT(CONCATENATE($E$32,\"!A210\"))))","v":"National Access to hygiene facilities "},null,null,null,null,null,null,null,null,{"$f":"CONCATENATE(\"Urban \",IF(ISERROR(INDIRECT(CONCATENATE($E$32,\"!A2\"))),\"\",INDIRECT(CONCATENATE($E$32,\"!A210\"))))","v":"Urban Access to hygiene facilities "},null,null,null,null,null,null,null,{"$f":"CONCATENATE(\"Rural \",IF(ISERROR(INDIRECT(CONCATENATE($E$32,\"!A2\"))),\"\",INDIRECT(CONCATENATE($E$32,\"!A210\"))))","v":"Rural Access to hygiene facilities "}]
[]
[]
[]
[]
[]
[]
[]
[]
[]
[]
[]
[]
[]
[]
[]
[]
[]
[]
[]
[]
[]
[]
[]
[]
[null,null,null,null,{"$f":"INDEX(B88:B100,A88)","v":"MICS18"},null,{"$f":"IF(ISERROR(INDIRECT(CONCATENATE($E$32,\"!A2\"))),\"\",INDIRECT(CONCATENATE($E$32,\"!A2\")))","v":"Montenegro"},null,null,null,"Poorest",null,null,"Poor",null,null,"Middle",null,null,"Rich",null,null,"Richest"]
[null,null,null,null,null,null,null,null,null,null,"Basic","Limited","No facility","Basic","Limited","No facility","Basic","Limited","No facility","Basic","Limited","No facility","Basic","Limited","No facility"]
[null,">>>  Select Survey :   ",null,null,null,null,"NATIONAL",null,null,{"$f":"IF(ISERROR(INDIRECT(CONCATENATE(#REF!,\"!A2\"))),\"\",INDIRECT(CONCATENATE(#REF!,\"!A210\")))","v":""},{"$f":"IF(ISERROR(INDIRECT(CONCATENATE($E$32,\"!C222\"))),\"\",INDIRECT(CONCATENATE($E$32,\"!C222\")))","v":99.503233520723228},{"$f":"IF(ISERROR(INDIRECT(CONCATENATE($E$32,\"!C223\"))),\"\",INDIRECT(CONCATENATE($E$32,\"!C223\")))","v":0.49676647927673334},{"$f":"IF(ISERROR(INDIRECT(CONCATENATE($E$32,\"!C224\"))),\"\",INDIRECT(CONCATENATE($E$32,\"!C224\")))","v":"N/A"},{"$f":"IF(ISERROR(INDIRECT(CONCATENATE($E$32,\"!D222\"))),\"\",INDIRECT(CONCATENATE($E$32,\"!D222\")))","v":99.969356469602516},{"$f":"IF(ISERROR(INDIRECT(CONCATENATE($E$32,\"!D223\"))),\"\",INDIRECT(CONCATENATE($E$32,\"!D223\")))","v":3.064353039747484E-2},{"$f":"IF(ISERROR(INDIRECT(CONCATENATE($E$32,\"!D224\"))),\"\",INDIRECT(CONCATENATE($E$32,\"!D224\")))","v":"N/A"},{"$f":"IF(ISERROR(INDIRECT(CONCATENATE($E$32,\"!E222\"))),\"\",INDIRECT(CONCATENATE($E$32,\"!E222\")))","v":99.850929107955793},{"$f":"IF(ISERROR(INDIRECT(CONCATENATE($E$32,\"!E223\"))),\"\",INDIRECT(CONCATENATE($E$32,\"!E223\")))","v":0.14907089204421706},{"$f":"IF(ISERROR(INDIRECT(CONCATENATE($E$32,\"!E224\"))),\"\",INDIRECT(CONCATENATE($E$32,\"!E224\")))","v":"N/A"},{"$f":"IF(ISERROR(INDIRECT(CONCATENATE($E$32,\"!F222\"))),\"\",INDIRECT(CONCATENATE($E$32,\"!F222\")))","v":100},{"$f":"IF(ISERROR(INDIRECT(CONCATENATE($E$32,\"!F223\"))),\"\",INDIRECT(CONCATENATE($E$32,\"!F223\")))","v":0},{"$f":"IF(ISERROR(INDIRECT(CONCATENATE($E$32,\"!F224\"))),\"\",INDIRECT(CONCATENATE($E$32,\"!F224\")))","v":"N/A"},{"$f":"IF(ISERROR(INDIRECT(CONCATENATE($E$32,\"!G222\"))),\"\",INDIRECT(CONCATENATE($E$32,\"!G222\")))","v":100},{"$f":"IF(ISERROR(INDIRECT(CONCATENATE($E$32,\"!G223\"))),\"\",INDIRECT(CONCATENATE($E$32,\"!G223\")))","v":0},{"$f":"IF(ISERROR(INDIRECT(CONCATENATE($E$32,\"!G224\"))),\"\",INDIRECT(CONCATENATE($E$32,\"!G224\")))","v":"N/A"}]
[]
[]
[null,null,null,null,null,null,"URBAN",null,null,{"$f":"IF(ISERROR(INDIRECT(CONCATENATE(#REF!,\"!A2\"))),\"\",INDIRECT(CONCATENATE(#REF!,\"!A210\")))","v":""},{"$f":"IF(ISERROR(INDIRECT(CONCATENATE($E$32,\"!H222\"))),\"\",INDIRECT(CONCATENATE($E$32,\"!H222\")))","v":99.871216582983251},{"$f":"IF(ISERROR(INDIRECT(CONCATENATE($E$32,\"!H223\"))),\"\",INDIRECT(CONCATENATE($E$32,\"!H223\")))","v":0.12878341701674489},{"$f":"IF(ISERROR(INDIRECT(CONCATENATE($E$32,\"!H224\"))),\"\",INDIRECT(CONCATENATE($E$32,\"!H224\")))","v":"N/A"},{"$f":"IF(ISERROR(INDIRECT(CONCATENATE($E$32,\"!I222\"))),\"\",INDIRECT(CONCATENATE($E$32,\"!I222\")))","v":100},{"$f":"IF(ISERROR(INDIRECT(CONCATENATE($E$32,\"!I223\"))),\"\",INDIRECT(CONCATENATE($E$32,\"!I223\")))","v":0},{"$f":"IF(ISERROR(INDIRECT(CONCATENATE($E$32,\"!I224\"))),\"\",INDIRECT(CONCATENATE($E$32,\"!I224\")))","v":"N/A"},{"$f":"IF(ISERROR(INDIRECT(CONCATENATE($E$32,\"!J222\"))),\"\",INDIRECT(CONCATENATE($E$32,\"!J222\")))","v":99.775755294752884},{"$f":"IF(ISERROR(INDIRECT(CONCATENATE($E$32,\"!J223\"))),\"\",INDIRECT(CONCATENATE($E$32,\"!J223\")))","v":0.22424470524712842},{"$f":"IF(ISERROR(INDIRECT(CONCATENATE($E$32,\"!J224\"))),\"\",INDIRECT(CONCATENATE($E$32,\"!J224\")))","v":"N/A"},{"$f":"IF(ISERROR(INDIRECT(CONCATENATE($E$32,\"!K222\"))),\"\",INDIRECT(CONCATENATE($E$32,\"!K222\")))","v":100},{"$f":"IF(ISERROR(INDIRECT(CONCATENATE($E$32,\"!K223\"))),\"\",INDIRECT(CONCATENATE($E$32,\"!K223\")))","v":0},{"$f":"IF(ISERROR(INDIRECT(CONCATENATE($E$32,\"!K224\"))),\"\",INDIRECT(CONCATENATE($E$32,\"!K224\")))","v":"N/A"},{"$f":"IF(ISERROR(INDIRECT(CONCATENATE($E$32,\"!L222\"))),\"\",INDIRECT(CONCATENATE($E$32,\"!L222\")))","v":100},{"$f":"IF(ISERROR(INDIRECT(CONCATENATE($E$32,\"!L223\"))),\"\",INDIRECT(CONCATENATE($E$32,\"!L223\")))","v":0},{"$f":"IF(ISERROR(INDIRECT(CONCATENATE($E$32,\"!L224\"))),\"\",INDIRECT(CONCATENATE($E$32,\"!L224\")))","v":"N/A"}]
[]
[]
[null,null,null,null,null,null,"RURAL",null,null,{"$f":"IF(ISERROR(INDIRECT(CONCATENATE(#REF!,\"!A2\"))),\"\",INDIRECT(CONCATENATE(#REF!,\"!A210\")))","v":""},{"$f":"IF(ISERROR(INDIRECT(CONCATENATE($E$32,\"!M222\"))),\"\",INDIRECT(CONCATENATE($E$32,\"!M222\")))","v":98.77150320953443},{"$f":"IF(ISERROR(INDIRECT(CONCATENATE($E$32,\"!M223\"))),\"\",INDIRECT(CONCATENATE($E$32,\"!M223\")))","v":1.2284967904655644},{"$f":"IF(ISERROR(INDIRECT(CONCATENATE($E$32,\"!M224\"))),\"\",INDIRECT(CONCATENATE($E$32,\"!M224\")))","v":"N/A"},{"$f":"IF(ISERROR(INDIRECT(CONCATENATE($E$32,\"!N222\"))),\"\",INDIRECT(CONCATENATE($E$32,\"!N222\")))","v":99.908496854611926},{"$f":"IF(ISERROR(INDIRECT(CONCATENATE($E$32,\"!N223\"))),\"\",INDIRECT(CONCATENATE($E$32,\"!N223\")))","v":9.1503145388067392E-2},{"$f":"IF(ISERROR(INDIRECT(CONCATENATE($E$32,\"!N224\"))),\"\",INDIRECT(CONCATENATE($E$32,\"!N224\")))","v":"N/A"},{"$f":"IF(ISERROR(INDIRECT(CONCATENATE($E$32,\"!O222\"))),\"\",INDIRECT(CONCATENATE($E$32,\"!O222\")))","v":100},{"$f":"IF(ISERROR(INDIRECT(CONCATENATE($E$32,\"!O223\"))),\"\",INDIRECT(CONCATENATE($E$32,\"!O223\")))","v":0},{"$f":"IF(ISERROR(INDIRECT(CONCATENATE($E$32,\"!O224\"))),\"\",INDIRECT(CONCATENATE($E$32,\"!O224\")))","v":"N/A"},{"$f":"IF(ISERROR(INDIRECT(CONCATENATE($E$32,\"!P222\"))),\"\",INDIRECT(CONCATENATE($E$32,\"!P222\")))","v":100},{"$f":"IF(ISERROR(INDIRECT(CONCATENATE($E$32,\"!P223\"))),\"\",INDIRECT(CONCATENATE($E$32,\"!P223\")))","v":0},{"$f":"IF(ISERROR(INDIRECT(CONCATENATE($E$32,\"!P224\"))),\"\",INDIRECT(CONCATENATE($E$32,\"!P224\")))","v":"N/A"},{"$f":"IF(ISERROR(INDIRECT(CONCATENATE($E$32,\"!Q222\"))),\"\",INDIRECT(CONCATENATE($E$32,\"!Q222\")))","v":100},{"$f":"IF(ISERROR(INDIRECT(CONCATENATE($E$32,\"!Q223\"))),\"\",INDIRECT(CONCATENATE($E$32,\"!Q223\")))","v":0},{"$f":"IF(ISERROR(INDIRECT(CONCATENATE($E$32,\"!Q224\"))),\"\",INDIRECT(CONCATENATE($E$32,\"!Q224\")))","v":"N/A"}]
[]
[]
[]
[]
[]
[]
[]
[]
[]
[]
[]
[]
[]
[]
[]
[]
[]
[]
[]
[]
[]
[]
[]
[]
[]
[]
[]
[]
[]
[]
[]
[]
[]
[]
[]
[]
[]
[]
[]
[]
[]
[]
[]
[]
[]
[]
[]
[3,"MICS06"]
[null,"MICS13"]
[null,"MICS18"]
[null,"Template"]

{"sheet":"MICS06","index":4,"n_rows":1072,"n_cols":72,"rows_kept":1072,"cut":false,"hidden":false,"merged":[[798,2,798,3],[798,7,798,8],[798,12,798,13],[796,2,796,3],[796,7,796,8],[796,12,796,13],[797,2,797,3],[797,7,797,8],[797,12,797,13],[794,2,794,3],[794,7,794,8],[794,12,794,13],[795,2,795,3],[795,7,795,8],[795,12,795,13],[792,2,792,3],[792,7,792,8],[792,12,792,13],[793,2,793,3],[793,7,793,8],[793,12,793,13],[790,2,790,3],[790,7,790,8],[790,12,790,13],[791,2,791,3],[791,7,791,8],[791,12,791,13],[788,2,788,3],[788,7,788,8],[788,12,788,13],[789,2,789,3],[789,7,789,8],[789,12,789,13],[786,2,786,3],[786,7,786,8],[786,12,786,13],[787,2,787,3],[787,7,787,8],[787,12,787,13],[784,2,784,3],[784,7,784,8],[784,12,784,13],[785,2,785,3],[785,7,785,8],[785,12,785,13],[782,2,782,3],[782,7,782,8],[782,12,782,13],[783,2,783,3],[783,7,783,8],[783,12,783,13],[780,2,780,3],[780,7,780,8],[780,12,780,13],[781,2,781,3],[781,7,781,8],[781,12,781,13],[778,2,778,3],[778,7,778,8],[778,12,778,13],[779,2,779,3],[779,7,779,8],[779,12,779,13],[776,2,776,3],[776,7,776,8],[776,12,776,13],[777,2,777,3],[777,7,777,8],[777,12,777,13],[774,2,774,3],[774,7,774,8],[774,12,774,13],[775,2,775,3],[775,7,775,8],[775,12,775,13],[772,2,772,3],[772,7,772,8],[772,12,772,13],[773,2,773,3],[773,7,773,8],[773,12,773,13],[770,2,770,3],[770,7,770,8],[770,12,770,13],[771,2,771,3],[771,7,771,8],[771,12,771,13],[768,2,768,3],[768,7,768,8],[768,12,768,13],[769,2,769,3],[769,7,769,8],[769,12,769,13],[766,2,766,3],[766,7,766,8],[766,12,766,13],[767,2,767,3],[767,7,767,8],[767,12,767,13],[764,2,764,3],[764,7,764,8],[764,12,764,13],[765,2,765,3],[765,7,765,8],[765,12,765,13],[762,2,762,3],[762,7,762,8],[762,12,762,13],[763,2,763,3],[763,7,763,8],[763,12,763,13],[760,2,760,3],[760,7,760,8],[760,12,760,13],[761,2,761,3],[761,7,761,8],[761,12,761,13],[758,2,758,3],[758,7,758,8],[758,12,758,13],[759,2,759,3],[759,7,759,8],[759,12,759,13],[756,2,756,3],[756,7,756,8],[756,12,756,13],[757,2,757,3],[757,7,757,8],[757,12,757,13],[754,2,754,3],[754,7,754,8],[754,12,754,13],[755,2,755,3],[755,7,755,8],[755,12,755,13],[752,2,752,3],[752,7,752,8],[752,12,752,13],[753,2,753,3],[753,7,753,8],[753,12,753,13],[750,2,750,3],[750,7,750,8],[750,12,750,13],[751,2,751,3],[751,7,751,8],[751,12,751,13],[748,2,748,3],[748,7,748,8],[748,12,748,13],[749,2,749,3],[749,7,749,8],[749,12,749,13],[746,2,746,3],[746,7,746,8],[746,12,746,13],[747,2,747,3],[747,7,747,8],[747,12,747,13],[744,2,744,3],[744,7,744,8],[744,12,744,13],[745,2,745,3],[745,7,745,8],[745,12,745,13],[742,2,742,3],[742,7,742,8],[742,12,742,13],[743,2,743,3],[743,7,743,8],[743,12,743,13],[740,2,740,3],[740,7,740,8],[740,12,740,13],[741,2,741,3],[741,7,741,8],[741,12,741,13],[738,2,738,3],[738,7,738,8],[738,12,738,13],[739,2,739,3],[739,7,739,8],[739,12,739,13],[736,2,736,3],[736,7,736,8],[736,12,736,13],[737,2,737,3],[737,7,737,8],[737,12,737,13],[734,2,734,3],[734,7,734,8],[734,12,734,13],[735,2,735,3],[735,7,735,8],[735,12,735,13],[732,2,732,3],[732,7,732,8],[732,12,732,13],[733,2,733,3],[733,7,733,8],[733,12,733,13],[730,2,730,3],[730,7,730,8],[730,12,730,13],[731,2,731,3],[731,7,731,8],[731,12,731,13],[728,2,728,3],[728,7,728,8],[728,12,728,13],[729,2,729,3],[729,7,729,8],[729,12,729,13],[726,2,726,3],[726,7,726,8],[726,12,726,13],[727,2,727,3],[727,7,727,8],[727,12,727,13],[724,2,724,3],[724,7,724,8],[724,12,724,13],[725,2,725,3],[725,7,725,8],[725,12,725,13],[722,2,722,3],[722,7,722,8],[722,12,722,13],[723,2,723,3],[723,7,723,8],[723,12,723,13],[720,2,720,3],[720,7,720,8],[720,12,720,13],[721,2,721,3],[721,7,721,8],[721,12,721,13],[718,2,718,3],[718,7,718,8],[718,12,718,13],[719,2,719,3],[719,7,719,8],[719,12,719,13],[716,2,716,3],[716,7,716,8],[716,12,716,13],[717,2,717,3],[717,7,717,8],[717,12,717,13],[714,2,714,3],[714,7,714,8],[714,12,714,13],[715,2,715,3],[715,7,715,8],[715,12,715,13],[712,2,712,3],[712,7,712,8],[712,12,712,13],[713,2,713,3],[713,7,713,8],[713,12,713,13],[710,2,710,3],[710,7,710,8],[710,12,710,13],[711,2,711,3],[711,7,711,8],[711,12,711,13],[708,2,708,3],[708,7,708,8],[708,12,708,13],[709,2,709,3],[709,7,709,8],[709,12,709,13],[706,2,706,3],[706,7,706,8],[706,12,706,13],[707,2,707,3],[707,7,707,8],[707,12,707,13],[704,2,704,3],[704,7,704,8],[704,12,704,13],[705,2,705,3],[705,7,705,8],[705,12,705,13],[702,2,702,3],[702,7,702,8],[702,12,702,13],[703,2,703,3],[703,7,703,8],[703,12,703,13],[700,2,700,3],[700,7,700,8],[700,12,700,13],[701,2,701,3],[701,7,701,8],[701,12,701,13],[698,2,698,3],[698,7,698,8],[698,12,698,13],[699,2,699,3],[699,7,699,8],[699,12,699,13],[696,2,696,3],[696,7,696,8],[696,12,696,13],[697,2,697,3],[697,7,697,8],[697,12,697,13],[694,2,694,3],[694,7,694,8],[694,12,694,13],[695,2,695,3],[695,7,695,8],[695,12,695,13],[692,2,692,3],[692,7,692,8],[692,12,692,13],[693,2,693,3],[693,7,693,8],[693,12,693,13],[690,2,690,3],[690,7,690,8],[690,12,690,13],[691,2,691,3],[691,7,691,8],[691,12,691,13],[688,2,688,3],[688,7,688,8],[688,12,688,13],[689,2,689,3],[689,7,689,8],[689,12,689,13],[686,2,686,3],[686,7,686,8],[686,12,686,13],[687,2,687,3],[687,7,687,8],[687,12,687,13],[684,2,684,3],[684,7,684,8],[684,12,684,13],[685,2,685,3],[685,7,685,8],[685,12,685,13],[682,2,682,3],[682,7,682,8],[682,12,682,13],[683,2,683,3],[683,7,683,8],[683,12,683,13],[680,2,680,3],[680,7,680,8],[680,12,680,13],[681,2,681,3],[681,7,681,8],[681,12,681,13],[678,2,678,3],[678,7,678,8],[678,12,678,13],[679,2,679,3],[679,7,679,8],[679,12,679,13],[676,2,676,3],[676,7,676,8],[676,12,676,13],[677,2,677,3],[677,7,677,8],[677,12,677,13],[674,2,674,3],[674,7,674,8],[674,12,674,13],[675,2,675,3],[675,7,675,8],[675,12,675,13],[672,2,672,3],[672,7,672,8],[672,12,672,13],[673,2,673,3],[673,7,673,8],[673,12,673,13],[670,2,670,3],[670,7,670,8],[670,12,670,13],[671,2,671,3],[671,7,671,8],[671,12,671,13],[668,2,668,3],[668,7,668,8],[668,12,668,13],[669,2,669,3],[669,7,669,8],[669,12,669,13],[666,2,666,3],[666,7,666,8],[666,12,666,13],[667,2,667,3],[667,7,667,8],[667,12,667,13],[664,2,664,3],[664,7,664,8],[664,12,664,13],[665,2,665,3],[665,7,665,8],[665,12,665,13],[662,2,662,3],[662,7,662,8],[662,12,662,13],[663,2,663,3],[663,7,663,8],[663,12,663,13],[660,2,660,3],[660,7,660,8],[660,12,660,14],[661,2,661,3],[661,7,661,8],[661,12,661,13],[658,2,658,3],[658,7,658,8],[658,12,658,13],[659,2,659,3],[659,7,659,8],[659,12,659,13],[656,2,656,3],[656,7,656,8],[656,12,656,13],[657,2,657,3],[657,7,657,8],[657,12,657,13],[654,2,654,3],[654,7,654,8],[654,12,654,13],[655,2,655,3],[655,7,655,8],[655,12,655,13],[652,2,652,3],[652,7,652,8],[652,12,652,13],[653,2,653,3],[653,7,653,8],[653,12,653,13],[650,2,650,3],[650,7,650,8],[650,12,650,13],[651,2,651,3],[651,7,651,9],[651,12,651,13],[648,2,648,3],[648,7,648,8],[648,12,648,13],[649,2,649,3],[649,7,649,8],[649,12,649,13],[646,2,646,3],[646,7,646,8],[646,12,646,13],[647,2,647,3],[647,7,647,8],[647,12,647,13],[644,2,644,3],[644,7,644,8],[644,12,644,13],[645,2,645,3],[645,7,645,8],[645,12,645,13],[642,2,642,3],[642,7,642,8],[642,12,642,13],[643,2,643,3],[643,7,643,8],[643,12,643,13],[640,2,640,3],[640,7,640,8],[640,12,640,13],[641,2,641,3],[641,7,641,8],[641,12,641,13],[638,2,638,3],[638,7,638,8],[638,12,638,13],[639,2,639,3],[639,7,639,8],[639,12,639,13],[636,2,636,3],[636,7,636,8],[636,12,636,13],[637,2,637,3],[637,7,637,8],[637,12,637,13],[634,2,634,3],[634,7,634,8],[634,12,634,13],[635,2,635,3],[635,7,635,8],[635,12,635,13],[632,2,632,3],[632,7,632,8],[632,12,632,13],[633,2,633,3],[633,7,633,8],[633,12,633,13],[630,2,630,3],[630,7,630,8],[630,12,630,13],[631,2,631,3],[631,7,631,8],[631,12,631,13],[628,2,628,3],[628,7,628,8],[628,12,628,13],[629,2,629,3],[629,7,629,8],[629,12,629,13],[626,2,626,3],[626,7,626,8],[626,12,626,13],[627,2,627,3],[627,7,627,8],[627,12,627,13],[624,2,624,3],[624,7,624,8],[624,12,624,13],[625,2,625,3],[625,7,625,8],[625,12,625,13],[622,2,622,3],[622,7,622,8],[622,12,622,13],[623,2,623,3],[623,7,623,8],[623,12,623,13],[620,2,620,3],[620,7,620,8],[620,12,620,13],[621,2,621,3],[621,7,621,8],[621,12,621,13],[618,2,618,3],[618,7,618,8],[618,12,618,13],[619,2,619,3],[619,7,619,8],[619,12,619,13],[616,2,616,3],[616,7,616,8],[616,12,616,13],[617,2,617,3],[617,7,617,8],[617,12,617,13],[614,2,614,3],[614,7,614,8],[614,12,614,13],[615,2,615,4],[615,7,615,8],[615,12,615,13],[612,2,612,3],[612,7,612,8],[612,12,612,13],[613,2,613,3],[613,7,613,8],[613,12,613,13],[610,2,610,3],[610,7,610,8],[610,12,610,13],[611,2,611,3],[611,7,611,8],[611,12,611,13],[608,2,608,3],[608,7,608,8],[608,12,608,13],[609,2,609,3],[609,7,609,8],[609,12,609,13],[606,2,606,3],[606,7,606,8],[606,12,606,13],[607,2,607,3],[607,7,607,8],[607,12,607,13],[604,2,604,3],[604,7,604,8],[604,12,604,13],[605,2,605,3],[605,7,605,8],[605,12,605,13],[602,2,602,3],[602,7,602,8],[602,12,602,13],[603,2,603,3],[603,7,603,8],[603,12,603,13],[600,2,600,3],[600,7,600,8],[600,12,600,13],[601,2,601,3],[601,7,601,8],[601,12,601,13],[598,2,598,3],[598,7,598,8],[598,12,598,13],[599,2,599,3],[599,7,599,8],[599,12,599,13],[596,2,596,3],[596,7,596,8],[596,12,596,13],[597,2,597,3],[597,7,597,8],[597,12,597,13],[594,2,594,3],[594,7,594,8],[594,12,594,13],[595,2,595,3],[595,7,595,8],[595,12,595,13],[592,2,592,3],[592,7,592,8],[592,12,592,13],[593,2,593,3],[593,7,593,8],[593,12,593,13],[590,2,590,3],[590,7,590,8],[590,12,590,13],[591,2,591,3],[591,7,591,8],[591,12,591,13],[588,2,588,3],[588,7,588,8],[588,12,588,13],[589,2,589,3],[589,7,589,8],[589,12,589,13],[586,2,586,3],[586,7,586,8],[586,12,586,13],[587,2,587,3],[587,7,587,8],[587,12,587,13],[584,2,584,3],[584,7,584,8],[584,12,584,13],[585,2,585,3],[585,7,585,8],[585,12,585,13],[582,2,582,3],[582,7,582,8],[582,12,582,13],[583,2,583,3],[583,7,583,8],[583,12,583,13],[580,2,580,3],[580,7,580,8],[580,12,580,13],[581,2,581,3],[581,7,581,8],[581,12,581,13],[578,2,578,3],[578,7,578,8],[578,12,578,13],[579,2,579,3],[579,7,579,8],[579,12,579,13],[575,2,575,3],[575,7,575,8],[575,12,575,14],[576,2,576,3],[576,7,576,8],[576,12,577,13],[577,2,577,3],[577,7,577,8],[573,2,573,3],[573,7,573,8],[573,12,573,13],[574,2,574,3],[574,7,574,8],[574,12,574,13],[570,2,570,3],[570,7,571,8],[570,12,571,13],[570,14,570,16],[571,2,571,3],[572,2,572,3],[572,7,572,8],[572,12,572,13],[568,2,568,3],[568,7,568,8],[568,12,568,13],[569,2,569,3],[569,7,569,9],[569,12,569,16],[566,2,566,3],[566,7,566,8],[566,12,566,13],[567,2,567,3],[567,7,567,8],[567,12,567,13],[563,2,563,3],[563,7,563,11],[563,12,563,13],[564,2,564,3],[564,7,565,8],[564,9,564,11],[564,12,564,13],[565,2,565,3],[565,12,565,13],[561,2,561,3],[561,7,561,8],[561,12,561,13],[562,2,562,3],[562,7,562,8],[562,12,562,13],[559,2,559,3],[559,7,559,8],[559,12,559,13],[560,2,560,3],[560,7,560,8],[560,12,560,13],[557,2,557,3],[557,7,557,8],[557,12,557,13],[558,2,558,3],[558,7,558,8],[558,12,558,13],[555,2,555,3],[555,7,555,8],[555,12,555,13],[556,2,556,3],[556,7,556,8],[556,12,556,13],[553,2,553,3],[553,7,553,8],[553,12,553,13],[554,2,554,3],[554,7,554,8],[554,12,554,13],[551,2,551,3],[551,7,551,8],[551,12,551,13],[552,2,552,3],[552,7,552,8],[552,12,552,13],[549,2,549,3],[549,7,549,8],[549,12,549,13],[550,2,550,3],[550,7,550,8],[550,12,550,13],[546,2,547,3],[546,7,546,8],[546,12,546,13],[547,7,547,8],[547,12,547,13],[548,2,548,3],[548,7,548,8],[548,12,548,13],[544,2,544,3],[544,7,544,8],[544,12,544,13],[545,2,545,4],[545,7,545,8],[545,12,545,13],[542,2,542,3],[542,7,542,8],[542,12,542,13],[543,2,543,3],[543,7,543,8],[543,12,543,13],[540,2,541,3],[540,4,540,6],[540,7,540,8],[540,12,540,13],[541,7,541,8],[541,12,541,13],[537,2,537,3],[537,7,537,8],[537,12,537,13],[538,2,538,3],[538,7,538,8],[538,12,538,13],[535,2,535,3],[535,7,535,8],[535,12,535,13],[536,2,536,3],[536,7,536,8],[536,12,536,13],[534,2,534,3],[534,7,534,8],[534,12,534,13],[531,2,531,3],[531,7,531,8],[531,12,531,13],[532,2,532,3],[532,7,532,8],[532,12,532,13],[529,2,529,3],[529,7,529,8],[529,12,529,13],[530,2,530,3],[530,7,530,8],[530,12,530,13],[539,2,539,6],[539,7,539,8],[539,12,539,13],[528,2,528,3],[528,7,528,8],[528,12,528,13],[525,2,525,3],[525,7,525,8],[525,12,525,13],[526,2,526,3],[526,7,526,8],[526,12,526,13],[523,2,523,3],[523,7,523,8],[523,12,523,13],[524,2,524,3],[524,7,524,8],[524,12,524,13],[533,2,533,3],[533,7,533,8],[533,12,533,13],[522,2,522,3],[522,7,522,8],[522,12,522,13],[519,2,519,3],[519,7,519,8],[519,12,519,13],[520,2,520,3],[520,7,520,8],[520,12,520,13],[517,2,517,3],[517,7,517,8],[517,12,517,13],[518,2,518,3],[518,7,518,8],[518,12,518,13],[527,2,527,3],[527,7,527,8],[527,12,527,13],[516,2,516,3],[516,7,516,8],[516,12,516,13],[513,2,513,3],[513,7,513,8],[513,12,513,13],[514,2,514,3],[514,7,514,8],[514,12,514,13],[511,2,511,3],[511,7,511,8],[511,12,511,13],[512,2,512,3],[512,7,512,8],[512,12,512,13],[521,2,521,3],[521,7,521,8],[521,12,521,13],[510,2,510,3],[510,7,510,8],[510,12,510,13],[507,2,507,3],[507,7,507,8],[507,12,507,13],[508,2,508,3],[508,7,508,8],[508,12,508,13],[505,2,505,3],[505,7,505,8],[505,12,505,13],[506,2,506,3],[506,7,506,8],[506,12,506,13],[515,2,515,3],[515,7,515,8],[515,12,515,13],[504,2,504,3],[504,7,504,8],[504,12,504,13],[501,2,501,3],[501,7,501,8],[501,12,501,13],[502,2,502,3],[502,7,502,8],[502,12,502,13],[499,2,499,3],[499,7,499,8],[499,12,499,13],[500,2,500,3],[500,7,500,8],[500,12,500,13],[509,2,509,3],[509,7,509,8],[509,12,509,13],[498,2,498,3],[498,7,498,8],[498,12,498,13],[495,2,495,3],[495,7,495,8],[495,12,495,13],[496,2,496,3],[496,7,496,8],[496,12,496,13],[493,2,493,3],[493,7,493,8],[493,12,493,13],[494,2,494,3],[494,7,494,8],[494,12,494,13],[503,2,503,3],[503,7,503,8],[503,12,503,13],[492,2,492,3],[492,7,492,8],[492,12,492,13],[489,2,489,3],[489,7,489,8],[489,12,489,13],[490,2,490,3],[490,7,490,8],[490,12,490,13],[487,2,487,3],[487,7,487,8],[487,12,487,13],[488,2,488,3],[488,7,488,8],[488,12,488,13],[497,2,497,3],[497,7,497,8],[497,12,497,13],[486,2,486,3],[486,7,486,8],[486,12,486,13],[483,2,483,3],[483,7,483,8],[483,12,483,13],[484,2,484,3],[484,7,484,8],[484,12,484,13],[481,2,481,3],[481,7,481,8],[481,12,481,13],[482,2,482,3],[482,7,482,9],[482,12,482,13],[491,2,491,3],[491,7,491,8],[491,12,491,13],[480,2,480,3],[480,7,480,8],[480,12,480,13],[477,2,477,3],[477,7,477,8],[477,12,477,13],[478,2,478,3],[478,7,478,8],[478,12,478,13],[475,2,475,3],[475,7,475,8],[475,12,475,13],[476,2,476,3],[476,7,476,8],[476,12,476,13],[485,2,485,3],[485,7,485,8],[485,12,485,14],[474,2,474,3],[474,7,474,8],[474,12,474,13],[471,2,471,3],[471,7,471,8],[471,12,471,13],[472,2,472,3],[472,7,472,8],[472,12,472,13],[469,2,469,3],[469,7,469,8],[469,12,469,13],[470,2,470,4],[470,7,470,8],[470,12,470,13],[479,2,479,3],[479,7,479,8],[479,12,479,13],[468,2,468,3],[468,7,468,8],[468,12,468,13],[465,2,465,3],[465,7,465,8],[465,12,465,13],[466,2,466,3],[466,7,466,8],[466,12,466,13],[463,2,463,3],[463,7,463,8],[463,12,463,13],[464,2,464,3],[464,7,464,8],[464,12,464,13],[473,2,473,3]],"merged_total":1315,"flags":["merged_cut"]}
[]
[{"$f":"A1026","v":"Montenegro"}]
[{"$f":"A1034","v":"2006"}]
["Use of drinking water sources"]
[" by wealth quintile and sub-national region"]
["Notes:"]
["WHO/UNICEF JMP customised wealth index excludes water,"]
[" sanitation and hygiene assets."]
["Survey used for analysis:",{"$f":"A1025","v":"MICS06"}]
[{"$f":"B1028","v":""}]
[{"$f":"B1027","v":""}]
[]
[]
["Use of drinking water sources",null,"NATIONAL wealth index quintile",null,null,null,null,"URBAN wealth index quintile",null,null,null,null,"RURAL wealth index quintile",null,null,null,null,"SUB-REGIONS:",null,null,null,null,null,null,null,null,null,null,null,null,null,null,null,null,null,null,null,null,null,null,null,null,null,null,null,null,null,null,null,null,null,null,"Raw numbers of respondents:","Use of drinking water sources","NATIONAL wealth index quintile",null,null,null,null,"URBAN wealth index quintile",null,null,null,null,"RURAL wealth index quintile",null,null,null,null,"SUB-REGIONS:"]
["Weighted percentage (used in graphs)",null,"Poorest","Poor","Middle","Rich","Richest","Poorest","Poor","Middle","Rich","Richest","Poorest","Poor","Middle","Rich","Richest","Central","North","South",null,null,null,null,null,null,null,null,null,null,null,null,null,null,null,null,null,null,null,null,null,null,null,null,null,null,null,null,null,null,null,null,"Water data, raw numbers (weighted)",null,"Poorest","Poor","Middle","Rich","Richest","Poorest","Poor","Middle","Rich","Richest","Poorest","Poor","Middle","Rich","Richest","Central","North","South"]
["Water","Improved",94.260101814274819,99.22447325577302,99.445414271064621,100,100,100,100,100,100,100,88.816054185281899,94.886964640211914,99.098631043478974,98.526347960571329,100,99.394428594257263,96.826563788779282,99.265789204533974,null,null,null,null,null,null,null,null,null,null,null,null,null,null,null,null,null,null,null,null,null,null,null,null,null,null,null,null,null,null,null,null,"Water","Improved","N/A","N/A","N/A","N/A","N/A","N/A","N/A","N/A","N/A","N/A","N/A","N/A","N/A","N/A","N/A","N/A","N/A","N/A"]
[null,"Not Improved",5.7398981857251616,0.77552674422695855,0.55458572893537883,0,0,0,0,0,0,0,11.183945814718037,5.1130353597880722,0.90136895652102311,1.4736520394286559,0,0.60557140574276858,3.1734362112206935,0.73421079546599632,null,null,null,null,null,null,null,null,null,null,null,null,null,null,null,null,null,null,null,null,null,null,null,null,null,null,null,null,null,null,null,null,null,"Not Improved","N/A","N/A","N/A","N/A","N/A","N/A","N/A","N/A","N/A","N/A","N/A","N/A","N/A","N/A","N/A","N/A","N/A","N/A"]
["Water ladder","Basic",93.609255018132913,98.944739010951309,99.445414271064621,100,99.726259370417154,99.785989185670061,100,100,100,100,87.446332195993548,94.151359967727103,99.098631043478974,98.526347960571329,99.277335956110278,99.213233782627555,96.484294354784623,99.039878190544428,null,null,null,null,null,null,null,null,null,null,null,null,null,null,null,null,null,null,null,null,null,null,null,null,null,null,null,null,null,null,null,null,"Water ladder","Basic","N/A","N/A","N/A","N/A","N/A","N/A","N/A","N/A","N/A","N/A","N/A","N/A","N/A","N/A","N/A","N/A","N/A","N/A"]
[null,"Limited",0.65084679614188601,0.27973424482171294,0,0,0.27374062958283951,0.21401081432993579,0,0,0,0,1.3697219892883317,0.73560467248479822,0,0,0.72266404388971417,0.18119481162971973,0.34226943399466303,0.22591101398953731,null,null,null,null,null,null,null,null,null,null,null,null,null,null,null,null,null,null,null,null,null,null,null,null,null,null,null,null,null,null,null,null,null,"Limited","N/A","N/A","N/A","N/A","N/A","N/A","N/A","N/A","N/A","N/A","N/A","N/A","N/A","N/A","N/A","N/A","N/A","N/A"]
[null,"Unimproved",4.4552010400372231,0.77552674422695855,0.55458572893537883,0,0,0,0,0,0,0,10.401920808273351,2.5119078913545301,0.90136895652102311,1.4736520394286559,0,0.17124320832755263,2.9780219166275512,0.73421079546599632,null,null,null,null,null,null,null,null,null,null,null,null,null,null,null,null,null,null,null,null,null,null,null,null,null,null,null,null,null,null,null,null,null,"Unimproved","N/A","N/A","N/A","N/A","N/A","N/A","N/A","N/A","N/A","N/A","N/A","N/A","N/A","N/A","N/A","N/A","N/A","N/A"]
[null,"Surface water",1.2846971456879381,0,0,0,0,0,0,0,0,0,0.78202500644468431,2.6011274684335413,0,0,0,0.434328197415216,0.19541429459314219,0,null,null,null,null,null,null,null,null,null,null,null,null,null,null,null,null,null,null,null,null,null,null,null,null,null,null,null,null,null,null,null,null,null,"Surface water","N/A","N/A","N/A","N/A","N/A","N/A","N/A","N/A","N/A","N/A","N/A","N/A","N/A","N/A","N/A","N/A","N/A","N/A"]
["Improved water point at more than 30 minutes","Yes",0.6904796235254238,0.28192061458531109,0,0,0.27374062958283951,0.21401081432993579,0,0,0,0,1.5422009025878507,0.77524312772995796,0,0,0.72266404388971417,0.18229876079813659,0.35348712233690444,0.22758194519972527,null,null,null,null,null,null,null,null,null,null,null,null,null,null,null,null,null,null,null,null,null,null,null,null,null,null,null,null,null,null,null,null,"Improved water point at more than 30 minutes","Yes","N/A","N/A","N/A","N/A","N/A","N/A","N/A","N/A","N/A","N/A","N/A","N/A","N/A","N/A","N/A","N/A","N/A","N/A"]
[null,"No",99.309520376474566,99.718079385414683,100,100,99.726259370417154,99.785989185670061,100,100,100,100,98.457799097412121,99.224756872270021,100,100,99.277335956110278,99.817701239201867,99.646512877663113,99.772418054800269,null,null,null,null,null,null,null,null,null,null,null,null,null,null,null,null,null,null,null,null,null,null,null,null,null,null,null,null,null,null,null,null,null,"No","N/A","N/A","N/A","N/A","N/A","N/A","N/A","N/A","N/A","N/A","N/A","N/A","N/A","N/A","N/A","N/A","N/A","N/A"]
["Manually calculated ratios","Improved wells"]
[null,"Improved springs"]
[null,"Other"]
[null,null,"NATIONAL wealth index quintile",null,null,null,null,"URBAN wealth index quintile",null,null,null,null,"RURAL wealth index quintile",null,null,null,null,"SUB-REGIONS:",null,null,null,null,null,null,null,null,null,null,null,null,null,null,null,null,null,null,null,null,null,null,null,null,null,null,null,null,null,null,null,null,null,null,"Raw numbers of respondents:","Use of drinking water sources","NATIONAL wealth index quintile",null,null,null,null,"URBAN wealth index quintile",null,null,null,null,"RURAL wealth index quintile",null,null,null,null,"SUB-REGIONS:"]
["Percentage based on weighted population",null,"Poorest","Poor","Middle","Rich","Richest","Poorest","Poor","Middle","Rich","Richest","Poorest","Poor","Middle","Rich","Richest","Central","North","South",null,null,null,null,null,null,null,null,null,null,null,null,null,null,null,null,null,null,null,null,null,null,null,null,null,null,null,null,null,null,null,null,"Water data, raw numbers (weighted)",null,"Poorest","Poor","Middle","Rich","Richest","Poorest","Poor","Middle","Rich","Richest","Poorest","Poor","Middle","Rich","Richest","Central","North","South"]
["Piped water","Yes",71.213900427566045,89.967310042831528,88.106151239110687,91.523132127336169,94.445294814640974,99.872023547030906,98.867826730915894,99.840223928540411,99.705937669885287,100,46.500620509632377,73.207439728050673,79.732665956435739,64.915665022345792,67.356756188129211,87.86009383101657,82.781042336456295,90.866732189064521,null,null,null,null,null,null,null,null,null,null,null,null,null,null,null,null,null,null,null,null,null,null,null,null,null,null,null,null,null,null,null,null,"Piped water","Yes","N/A","N/A","N/A","N/A","N/A","N/A","N/A","N/A","N/A","N/A","N/A","N/A","N/A","N/A","N/A","N/A","N/A","N/A"]
[null,"No",28.786099572433805,10.032689957168399,11.89384876088919,8.4768678726637816,5.5547051853590244,0.12797645296910651,1.1321732690841211,0.15977607145959094,0.29406233011471078,0,53.499379490367502,26.792560271949323,20.26733404356419,35.084334977654173,32.643243811870775,12.139906168983437,17.21895766354352,9.1332678109354468,null,null,null,null,null,null,null,null,null,null,null,null,null,null,null,null,null,null,null,null,null,null,null,null,null,null,null,null,null,null,null,null,null,"No","N/A","N/A","N/A","N/A","N/A","N/A","N/A","N/A","N/A","N/A","N/A","N/A","N/A","N/A","N/A","N/A","N/A","N/A"]
["Piped water on premises","Yes",66.036638073787827,89.687575798009817,87.943165607351276,91.156009083304539,94.445294814640974,92.815550994997835,98.867826730915894,99.840223928540411,99.705937669885287,100,44.397764679590637,73.207439728050673,78.995878470660102,64.482577591298963,66.387002732062228,85.812797417773695,82.391240498548655,90.259410834801713,null,null,null,null,null,null,null,null,null,null,null,null,null,null,null,null,null,null,null,null,null,null,null,null,null,null,null,null,null,null,null,null,"Piped water on premises","Yes","N/A","N/A","N/A","N/A","N/A","N/A","N/A","N/A","N/A","N/A","N/A","N/A","N/A","N/A","N/A","N/A","N/A","N/A"]
[null,"No",33.963361926212045,10.312424201990112,12.05683439264863,8.8439909166954234,5.5547051853590244,7.184449005002155,1.1321732690841211,0.15977607145959094,0.29406233011471078,0,55.602235320409257,26.792560271949323,21.004121529339837,35.517422408701009,33.612997267937764,14.187202582226313,17.608759501451175,9.740589165198287,null,null,null,null,null,null,null,null,null,null,null,null,null,null,null,null,null,null,null,null,null,null,null,null,null,null,null,null,null,null,null,null,null,"No","N/A","N/A","N/A","N/A","N/A","N/A","N/A","N/A","N/A","N/A","N/A","N/A","N/A","N/A","N/A","N/A","N/A","N/A"]
["Piped water into dwelling","Yes","N/A","N/A","N/A","N/A","N/A","N/A","N/A","N/A","N/A","N/A","N/A","N/A","N/A","N/A","N/A","N/A","N/A","N/A",null,null,null,null,null,null,null,null,null,null,null,null,null,null,null,null,null,null,null,null,null,null,null,null,null,null,null,null,null,null,null,null,"Piped water into dwelling","Yes","N/A","N/A","N/A","N/A","N/A","N/A","N/A","N/A","N/A","N/A","N/A","N/A","N/A","N/A","N/A","N/A","N/A","N/A"]
[null,"No","N/A","N/A","N/A","N/A","N/A","N/A","N/A","N/A","N/A","N/A","N/A","N/A","N/A","N/A","N/A","N/A","N/A","N/A",null,null,null,null,null,null,null,null,null,null,null,null,null,null,null,null,null,null,null,null,null,null,null,null,null,null,null,null,null,null,null,null,null,"No","N/A","N/A","N/A","N/A","N/A","N/A","N/A","N/A","N/A","N/A","N/A","N/A","N/A","N/A","N/A","N/A","N/A","N/A"]
["Water source on premises","Yes",83.803204523381581,97.27225473530055,97.999344649256244,99.183835987114207,99.539581725519781,92.815550994997835,99.44100220199411,99.840223928540411,100,100,75.523415250552802,91.857311176617415,94.438922439999189,94.679441533645473,97.814761167780958,95.349692617887058,94.165139803530607,97.700375566591703,null,null,null,null,null,null,null,null,null,null,null,null,null,null,null,null,null,null,null,null,null,null,null,null,null,null,null,null,null,null,null,null,"Water source on premises","Yes","N/A","N/A","N/A","N/A","N/A","N/A","N/A","N/A","N/A","N/A","N/A","N/A","N/A","N/A","N/A","N/A","N/A","N/A"]
[null,"No",16.196795476618348,2.7277452646994398,2.000655350743711,0.81616401288580209,0.46041827448021427,7.184449005002155,0.55899779800590643,0.15977607145959094,0,0,24.476584749447127,8.1426888233825725,5.5610775600007996,5.3205584663545062,2.1852388322190293,4.6503073821129801,5.8348601964693838,2.2996244334082854,null,null,null,null,null,null,null,null,null,null,null,null,null,null,null,null,null,null,null,null,null,null,null,null,null,null,null,null,null,null,null,null,null,"No","N/A","N/A","N/A","N/A","N/A","N/A","N/A","N/A","N/A","N/A","N/A","N/A","N/A","N/A","N/A","N/A","N/A","N/A"]
["Improved Water source on premises","Yes",87.831925647349564,97.773831109557591,98.545865958316853,99.183835987114207,99.539581725519781,92.815550994997835,99.44100220199411,99.840223928540411,100,100,82.425562689595964,95.716358356218606,95.297908200734511,96.095555649271276,97.814761167780958,95.930621028185186,96.525131981197859,98.252321457033091,null,null,null,null,null,null,null,null,null,null,null,null,null,null,null,null,null,null,null,null,null,null,null,null,null,null,null,null,null,null,null,null,"Improved water source on premises","Yes","N/A","N/A","N/A","N/A","N/A","N/A","N/A","N/A","N/A","N/A","N/A","N/A","N/A","N/A","N/A","N/A","N/A","N/A"]
[null,"No",12.168074352650356,2.2261688904424131,1.4541340416830977,0.81616401288580209,0.46041827448021427,7.184449005002155,0.55899779800590643,0.15977607145959094,0,0,17.574437310404019,4.2836416437813956,4.7020917992654763,3.9044443507287219,2.1852388322190293,4.0693789718148299,3.4748680188021615,1.7476785429669492,null,null,null,null,null,null,null,null,null,null,null,null,null,null,null,null,null,null,null,null,null,null,null,null,null,null,null,null,null,null,null,null,null,"No","N/A","N/A","N/A","N/A","N/A","N/A","N/A","N/A","N/A","N/A","N/A","N/A","N/A","N/A","N/A","N/A","N/A","N/A"]
["Piped water on premises available when needed","Yes","N/A","N/A","N/A","N/A","N/A","N/A","N/A","N/A","N/A","N/A","N/A","N/A","N/A","N/A","N/A","N/A","N/A","N/A",null,null,null,null,null,null,null,null,null,null,null,null,null,null,null,null,null,null,null,null,null,null,null,null,null,null,null,null,null,null,null,null,"Piped water on premises available when needed","Yes","N/A","N/A","N/A","N/A","N/A","N/A","N/A","N/A","N/A","N/A","N/A","N/A","N/A","N/A","N/A","N/A","N/A","N/A"]
[null,"No","N/A","N/A","N/A","N/A","N/A","N/A","N/A","N/A","N/A","N/A","N/A","N/A","N/A","N/A","N/A","N/A","N/A","N/A",null,null,null,null,null,null,null,null,null,null,null,null,null,null,null,null,null,null,null,null,null,null,null,null,null,null,null,null,null,null,null,null,null,"No","N/A","N/A","N/A","N/A","N/A","N/A","N/A","N/A","N/A","N/A","N/A","N/A","N/A","N/A","N/A","N/A","N/A","N/A"]
["Water point at more than 30 minutes","Yes",0.65084679614188601,0.27973424482171294,0.21298643665623893,0,0.27374062958283951,0.21401081432993579,0,0,0,0,1.3697219892883317,0.73560467248479822,0,0.5659501865502945,0.72266404388971417,0.27488545271954817,0.34226943399466303,0.22591101398953731,null,null,null,null,null,null,null,null,null,null,null,null,null,null,null,null,null,null,null,null,null,null,null,null,null,null,null,null,null,null,null,null,"Water point at more than 30 minutes","Yes","N/A","N/A","N/A","N/A","N/A","N/A","N/A","N/A","N/A","N/A","N/A","N/A","N/A","N/A","N/A","N/A","N/A","N/A"]
[null,"No",99.349153203858094,99.720265755178275,99.787013563343763,100,99.726259370417154,99.785989185670061,100,100,100,100,98.630278010711649,99.264395327515203,100,99.43404981344969,99.277335956110278,99.725114547280484,99.657730566005327,99.774088986010455,null,null,null,null,null,null,null,null,null,null,null,null,null,null,null,null,null,null,null,null,null,null,null,null,null,null,null,null,null,null,null,null,null,"No","N/A","N/A","N/A","N/A","N/A","N/A","N/A","N/A","N/A","N/A","N/A","N/A","N/A","N/A","N/A","N/A","N/A","N/A"]
["Water source available when needed","Yes","N/A","N/A","N/A","N/A","N/A","N/A","N/A","N/A","N/A","N/A","N/A","N/A","N/A","N/A","N/A","N/A","N/A","N/A",null,null,null,null,null,null,null,null,null,null,null,null,null,null,null,null,null,null,null,null,null,null,null,null,null,null,null,null,null,null,null,null,"Water source available when needed","Yes","N/A","N/A","N/A","N/A","N/A","N/A","N/A","N/A","N/A","N/A","N/A","N/A","N/A","N/A","N/A","N/A","N/A","N/A"]
[null,"No","N/A","N/A","N/A","N/A","N/A","N/A","N/A","N/A","N/A","N/A","N/A","N/A","N/A","N/A","N/A","N/A","N/A","N/A",null,null,null,null,null,null,null,null,null,null,null,null,null,null,null,null,null,null,null,null,null,null,null,null,null,null,null,null,null,null,null,null,null,"No","N/A","N/A","N/A","N/A","N/A","N/A","N/A","N/A","N/A","N/A","N/A","N/A","N/A","N/A","N/A","N/A","N/A","N/A"]
["Improved water source available when needed","Yes","N/A","N/A","N/A","N/A","N/A","N/A","N/A","N/A","N/A","N/A","N/A","N/A","N/A","N/A","N/A","N/A","N/A","N/A",null,null,null,null,null,null,null,null,null,null,null,null,null,null,null,null,null,null,null,null,null,null,null,null,null,null,null,null,null,null,null,null,"Improved water source available when needed","Yes","N/A","N/A","N/A","N/A","N/A","N/A","N/A","N/A","N/A","N/A","N/A","N/A","N/A","N/A","N/A","N/A","N/A","N/A"]
[null,"No","N/A","N/A","N/A","N/A","N/A","N/A","N/A","N/A","N/A","N/A","N/A","N/A","N/A","N/A","N/A","N/A","N/A","N/A",null,null,null,null,null,null,null,null,null,null,null,null,null,null,null,null,null,null,null,null,null,null,null,null,null,null,null,null,null,null,null,null,null,"No","N/A","N/A","N/A","N/A","N/A","N/A","N/A","N/A","N/A","N/A","N/A","N/A","N/A","N/A","N/A","N/A","N/A","N/A"]
["Microbiological quality at point of collection","Not contaminated (No E. coli in 100 mL)","N/A","N/A","N/A","N/A","N/A","N/A","N/A","N/A","N/A","N/A","N/A","N/A","N/A","N/A","N/A","N/A","N/A","N/A",null,null,null,null,null,null,null,null,null,null,null,null,null,null,null,null,null,null,null,null,null,null,null,null,null,null,null,null,null,null,null,null,"Microbiological quality at point of collection","Not contaminated (No E. coli in 100 mL)","N/A","N/A","N/A","N/A","N/A","N/A","N/A","N/A","N/A","N/A","N/A","N/A","N/A","N/A","N/A","N/A","N/A","N/A"]
[null,"Contaminated (E. coli detected in 100 mL)","N/A","N/A","N/A","N/A","N/A","N/A","N/A","N/A","N/A","N/A","N/A","N/A","N/A","N/A","N/A","N/A","N/A","N/A",null,null,null,null,null,null,null,null,null,null,null,null,null,null,null,null,null,null,null,null,null,null,null,null,null,null,null,null,null,null,null,null,null,"Contaminated (E. coli detected in 100 mL)","N/A","N/A","N/A","N/A","N/A","N/A","N/A","N/A","N/A","N/A","N/A","N/A","N/A","N/A","N/A","N/A","N/A","N/A"]
[null,"Highly contaminated (>100 CFU/100 mL)","N/A","N/A","N/A","N/A","N/A","N/A","N/A","N/A","N/A","N/A","N/A","N/A","N/A","N/A","N/A","N/A","N/A","N/A",null,null,null,null,null,null,null,null,null,null,null,null,null,null,null,null,null,null,null,null,null,null,null,null,null,null,null,null,null,null,null,null,null,"Highly contaminated (>100 CFU/100 mL)","N/A","N/A","N/A","N/A","N/A","N/A","N/A","N/A","N/A","N/A","N/A","N/A","N/A","N/A","N/A","N/A","N/A","N/A"]
["Microbiological quality of improved water sources at point of collection","Not contaminated (No E. coli in 100 mL)","N/A","N/A","N/A","N/A","N/A","N/A","N/A","N/A","N/A","N/A","N/A","N/A","N/A","N/A","N/A","N/A","N/A","N/A",null,null,null,null,null,null,null,null,null,null,null,null,null,null,null,null,null,null,null,null,null,null,null,null,null,null,null,null,null,null,null,null,"Microbiological quality of improved water sources at point of collection","Not contaminated (No E. coli in 100 mL)","N/A","N/A","N/A","N/A","N/A","N/A","N/A","N/A","N/A","N/A","N/A","N/A","N/A","N/A","N/A","N/A","N/A","N/A"]
[null,"Contaminated (E. coli detected in 100 mL)","N/A","N/A","N/A","N/A","N/A","N/A","N/A","N/A","N/A","N/A","N/A","N/A","N/A","N/A","N/A","N/A","N/A","N/A",null,null,null,null,null,null,null,null,null,null,null,null,null,null,null,null,null,null,null,null,null,null,null,null,null,null,null,null,null,null,null,null,null,"Contaminated (E. coli detected in 100 mL)","N/A","N/A","N/A","N/A","N/A","N/A","N/A","N/A","N/A","N/A","N/A","N/A","N/A","N/A","N/A","N/A","N/A","N/A"]
[null,"Highly contaminated (>100 CFU/100 mL)","N/A","N/A","N/A","N/A","N/A","N/A","N/A","N/A","N/A","N/A","N/A","N/A","N/A","N/A","N/A","N/A","N/A","N/A",null,null,null,null,null,null,null,null,null,null,null,null,null,null,null,null,null,null,null,null,null,null,null,null,null,null,null,null,null,null,null,null,null,"Highly contaminated (>100 CFU/100 mL)","N/A","N/A","N/A","N/A","N/A","N/A","N/A","N/A","N/A","N/A","N/A","N/A","N/A","N/A","N/A","N/A","N/A","N/A"]
["Microbiological quality of piped on premises at point of collection","Not contaminated (No E. coli in 100 mL)","N/A","N/A","N/A","N/A","N/A","N/A","N/A","N/A","N/A","N/A","N/A","N/A","N/A","N/A","N/A","N/A","N/A","N/A",null,null,null,null,null,null,null,null,null,null,null,null,null,null,null,null,null,null,null,null,null,null,null,null,null,null,null,null,null,null,null,null,"Microbiological quality of piped on premises at point of collection","Not contaminated (No E. coli in 100 mL)","N/A","N/A","N/A","N/A","N/A","N/A","N/A","N/A","N/A","N/A","N/A","N/A","N/A","N/A","N/A","N/A","N/A","N/A"]
[null,"Contaminated (E. coli detected in 100 mL)","N/A","N/A","N/A","N/A","N/A","N/A","N/A","N/A","N/A","N/A","N/A","N/A","N/A","N/A","N/A","N/A","N/A","N/A",null,null,null,null,null,null,null,null,null,null,null,null,null,null,null,null,null,null,null,null,null,null,null,null,null,null,null,null,null,null,null,null,null,"Contaminated (E. coli detected in 100 mL)","N/A","N/A","N/A","N/A","N/A","N/A","N/A","N/A","N/A","N/A","N/A","N/A","N/A","N/A","N/A","N/A","N/A","N/A"]
[null,"Highly contaminated (>100 CFU/100 mL)","N/A","N/A","N/A","N/A","N/A","N/A","N/A","N/A","N/A","N/A","N/A","N/A","N/A","N/A","N/A","N/A","N/A","N/A",null,null,null,null,null,null,null,null,null,null,null,null,null,null,null,null,null,null,null,null,null,null,null,null,null,null,null,null,null,null,null,null,null,"Highly contaminated (>100 CFU/100 mL)","N/A","N/A","N/A","N/A","N/A","N/A","N/A","N/A","N/A","N/A","N/A","N/A","N/A","N/A","N/A","N/A","N/A","N/A"]
[null,null,"NATIONAL wealth index quintile",null,null,null,null,"URBAN wealth index quintile",null,null,null,null,"RURAL wealth index quintile",null,null,null,null,"SUB-REGIONS:",null,null,null,null,null,null,null,null,null,null,null,null,null,null,null,null,null,null,null,null,null,null,null,null,null,null,null,null,null,null,null,null,null,null,"Raw numbers of respondents:","Use of drinking water sources","NATIONAL wealth index quintile",null,null,null,null,"URBAN wealth index quintile",null,null,null,null,"RURAL wealth index quintile",null,null,null,null,"SUB-REGIONS:"]
["Percentage based on weighted population",null,"Poorest","Poor","Middle","Rich","Richest","Poorest","Poor","Middle","Rich","Richest","Poorest","Poor","Middle","Rich","Richest","Central","North","South",null,null,null,null,null,null,null,null,null,null,null,null,null,null,null,null,null,null,null,null,null,null,null,null,null,null,null,null,null,null,null,null,"Water data, raw numbers (weighted)",null,"Poorest","Poor","Middle","Rich","Richest","Poorest","Poor","Middle","Rich","Richest","Poorest","Poor","Middle","Rich","Richest","Central","North","South"]
["Main source of drinking water","Public watersupply",45.052760668811651,80.960154635577425,84.346306468316683,84.199544201067127,90.668294549519842,91.283074952921055,97.288425101905062,95.469324875131321,95.448500647665469,96.454110668571005,18.126495315423234,38.740564146629779,65.688771876574449,56.938121837758594,56.849603620020403,83.770529228307709,64.355304486155831,80.268126702122416]
[null,"Local watersupply",20.983877404976113,8.3803941855706032,1.44270000862685,0.82818658610361084,1.0228385390370014,1.5324760420767829,0,0,0,0,26.271269364167395,34.466875581420901,13.30710659408566,5.5923004909111382,3.9845719804593003,1.4566545259531825,18.03593601239259,1.6912883162574026]
[null,"Public tap/standpipe",5.1772623537782057,0.27973424482171294,0.16298563175943512,0,0,7.0564725520330498,0,0,0,0,2.102855830041761,0,0.73678748577564657,0.43308743104683467,0,2.0472964132428721,0.38980183790765532,0.30416805857544144]
[null,"Tubewell/borehole",3.7154083264951585,4.137599419291357,8.3539633847927828,7.6914157763481965,5.0987514425046214,0.12797645296910651,0.55899779800590643,0,0,0,6.9178655650403433,3.7744124638724883,9.0927453386953836,25.492616880059348,30.293561160752347,9.6824197054819336,1.9469584076310928,3.3182535221372875]
[null,"Protected well or spring",18.881023563598387,4.1896023525493105,2.7421667119212514,9.9622041070392298E-2,0.45595374285440404,0,0,0.15977607145959094,0.29406233011471078,0,34.560750057832522,17.55442531019219,8.763680008867242,7.2865192099939273,0.72266404388971417,1.0545356261204326,12.098563044691742,4.6733970859602323]
[null,"Unprotected well or spring",3.8309154304785666,0.41215403756531327,0.34159929227913993,0,0,0,0,0,0,0,8.750979128001239,1.5563628845423843,0.90136895652102311,0.90770185287836136,0,3.0707246692810029E-2,2.395886037962641,0.73421079546599632]
[null,"Tanker-truck",0.44976949661510984,0.92996144110077572,0.10649321832811946,0,0,0,0.57317547107821476,0,0,0,0.83681805277661303,0.35068713809657892,1.5095397394805399,0.28297509327514725,0,0.49602265011915536,0,0.29445090037716182]
[null,"Surface water",1.2846971456879381,0,0,0,0,0,0,0,0,0,0.78202500644468431,2.6011274684335413,0,0,0,0.434328197415216,0.19541429459314219,0]
[null,"Bottled water",0,0.34702697686176115,2.2907988473193392,7.1812313954106104,2.7541617260841353,0,1.5794016290108828,4.3708990534090244,4.2574370222197961,3.5458893314290778,0,0,0,2.5007270175263265,8.1495991948782276,0.88697044503194822,0,8.7161046191040477]
[null,"Other",0.62428560955865653,0.36337270666164517,0.21298643665623893,0,0,0,0,0,0,0,1.6509416802721115,0.95554500681214583,0,0.5659501865502945,0,0.14053596163474258,0.58213587866491034,0]
[]
[]
[]
[]
[]
[]
[]
[]
[]
[]
[]
[]
[]
[]
[]
[]
[]
[]
[]
[]
[]
[]
[]
[]
[]
[]
[]
[]
[]
[]
[]
[]
[]
[]
[]
[]
[]
[]
[]
[]
[{"$f":"A1026","v":"Montenegro"}]
[{"$f":"A1034","v":"2006"}]
["Use of sanitation facilities"]
[" by wealth quintile and sub-national region"]
["Notes:"]
["WHO/UNICEF JMP customised wealth index excludes water,"]
[" sanitation and hygiene assets."]
["Survey used for analysis:",{"$f":"A1025","v":"MICS06"}]
[{"$f":"B1030","v":"Ratio of Improved latrines based on:"},"MICS13"]
[{"$f":"B1029","v":"Ratio of Shared improved based on:"},"MICS13"]
[]
[]
["Use of sanitation facilities",null,"NATIONAL wealth index quintile",null,null,null,null,"URBAN wealth index quintile",null,null,null,null,"RURAL wealth index quintile",null,null,null,null,"SUB-REGIONS:",null,null,null,null,null,null,null,null,null,null,null,null,null,null,null,null,null,null,null,null,null,null,null,null,null,null,null,null,null,null,null,null,null,null,"Raw numbers of respondents:","Use of sanitation facilities","NATIONAL wealth index quintile",null,null,null,null,"URBAN wealth index quintile",null,null,null,null,"RURAL wealth index quintile",null,null,null,null,"SUB-REGIONS:"]
["Weighted percentage (used in graphs)",null,"Poorest","Poor","Middle","Rich","Richest","Poorest","Poor","Middle","Rich","Richest","Poorest","Poor","Middle","Rich","Richest","Central","North","South",null,null,null,null,null,null,null,null,null,null,null,null,null,null,null,null,null,null,null,null,null,null,null,null,null,null,null,null,null,null,null,null,"Sanitation data, raw numbers (weighted)",null,"Poorest","Poor","Middle","Rich","Richest","Poorest","Poor","Middle","Rich","Richest","Poorest","Poor","Middle","Rich","Richest","Central","North","South"]
["Sanitation","Improved",{"$f":"C153+C154+C155+C156*MICS13!C130/100","v":93.871016576736793},{"$f":"D153+D154+D155+D156*MICS13!D130/100","v":99.397289087419722},{"$f":"E153+E154+E155+E156*MICS13!E130/100","v":99.930523980687127},{"$f":"F153+F154+F155+F156*MICS13!F130/100","v":99.786049409848687},{"$f":"G153+G154+G155+G156*MICS13!G130/100","v":99.999999999999886},{"$f":"H153+H154+H155+H156*MICS13!H130/100","v":98.885845157936117},{"$f":"I153+I154+I155+I156*MICS13!I130/100","v":99.888200440398791},{"$f":"J153+J154+J155+J156*MICS13!J130/100","v":99.656861228564225},{"$f":"K153+K154+K155+K156*MICS13!K130/100","v":99.999999999999972},{"$f":"L153+L154+L155+L156*MICS13!L130/100","v":100.00000000000011},{"$f":"M153+M154+M155+M156*MICS13!M130/100","v":92.482542544619761},{"$f":"N153+N154+N155+N156*MICS13!N130/100","v":92.680393821171776},{"$f":"O153+O154+O155+O156*MICS13!O130/100","v":99.018425914651175},{"$f":"P153+P154+P155+P156*MICS13!P130/100","v":99.999999999999943},{"$f":"Q153+Q154+Q155+Q156*MICS13!Q130/100","v":99.999999999999986},{"$f":"R153+R154+R155+R156*MICS13!R130/100","v":99.29078019675454},{"$f":"S153+S154+S155+S156*MICS13!S130/100","v":96.82538130478261},{"$f":"T153+T154+T155+T156*MICS13!T130/100","v":99.822971681652717},null,null,null,null,null,null,null,null,null,null,null,null,null,null,null,null,null,null,null,null,null,null,null,null,null,null,null,null,null,null,null,null,"Sanitation","Improved","N/A","N/A","N/A","N/A","N/A","N/A","N/A","N/A","N/A","N/A","N/A","N/A","N/A","N/A","N/A","N/A","N/A","N/A"]
[null,"Not Improved",{"$f":"100-C122","v":6.1289834232632074},{"$f":"100-D122","v":0.60271091258027809},6.947601931287295E-2,0.21395059015131324,1.1368683772161603E-13,1.1141548420638827,0.11179955960120935,0.34313877143577542,0,-1.1368683772161603E-13,7.5174574553802387,7.3196061788282236,0.98157408534882507,0,0,0.70921980324546041,3.17461869521739,0.17702831834728272,null,null,null,null,null,null,null,null,null,null,null,null,null,null,null,null,null,null,null,null,null,null,null,null,null,null,null,null,null,null,null,null,null,"Not Improved","N/A","N/A","N/A","N/A","N/A","N/A","N/A","N/A","N/A","N/A","N/A","N/A","N/A","N/A","N/A","N/A","N/A","N/A"]
["Sanitation ladder","Basic",{"$f":"C122*MICS13!C129/100","v":91.58883224293271},{"$f":"D122*MICS13!D129/100","v":99.008363655212548},{"$f":"E122*MICS13!E129/100","v":99.389719352775089},{"$f":"F122*MICS13!F129/100","v":99.310565995996711},{"$f":"G122*MICS13!G129/100","v":99.736322357539649},{"$f":"H122*MICS13!H129/100","v":95.565942292474915},{"$f":"I122*MICS13!I129/100","v":99.612862951312806},{"$f":"J122*MICS13!J129/100","v":98.823746030356091},{"$f":"K122*MICS13!K129/100","v":99.328571445414241},{"$f":"L122*MICS13!L129/100","v":99.831740002950539},{"$f":"M122*MICS13!M129/100","v":91.269342816540899},{"$f":"N122*MICS13!N129/100","v":92.680393821171776},{"$f":"O122*MICS13!O129/100","v":99.018425914651175},{"$f":"P122*MICS13!P129/100","v":99.999999999999943},{"$f":"Q122*MICS13!Q129/100","v":99.563000512991366},{"$f":"R122*MICS13!R129/100","v":98.249235074577498},{"$f":"S122*MICS13!S129/100","v":96.305178659451371},{"$f":"T122*MICS13!T129/100","v":99.271483940805851},null,null,null,null,null,null,null,null,null,null,null,null,null,null,null,null,null,null,null,null,null,null,null,null,null,null,null,null,null,null,null,null,"Sanitation ladder","Basic","N/A","N/A","N/A","N/A","N/A","N/A","N/A","N/A","N/A","N/A","N/A","N/A","N/A","N/A","N/A","N/A","N/A","N/A"]
[null,"Limited",{"$f":"C122*MICS13!C128/100","v":2.2821843338040613},{"$f":"D122*MICS13!D128/100","v":0.3889254322071849},{"$f":"E122*MICS13!E128/100","v":0.54080462791206441},{"$f":"F122*MICS13!F128/100","v":0.47548341385197657},{"$f":"G122*MICS13!G128/100","v":0.26367764246025677},{"$f":"H122*MICS13!H128/100","v":3.3199028654611857},{"$f":"I122*MICS13!I128/100","v":0.27533748908598754},{"$f":"J122*MICS13!J128/100","v":0.83311519820814584},{"$f":"K122*MICS13!K128/100","v":0.67142855458571393},{"$f":"L122*MICS13!L128/100","v":0.16825999704956252},{"$f":"M122*MICS13!M128/100","v":1.2131997280788644},{"$f":"N122*MICS13!N128/100","v":0},{"$f":"O122*MICS13!O128/100","v":0},{"$f":"P122*MICS13!P128/100","v":0},{"$f":"Q122*MICS13!Q128/100","v":0.43699948700862667},{"$f":"R122*MICS13!R128/100","v":1.0415451221770586},{"$f":"S122*MICS13!S128/100","v":0.5202026453312395},{"$f":"T122*MICS13!T128/100","v":0.55148774084690411},null,null,null,null,null,null,null,null,null,null,null,null,null,null,null,null,null,null,null,null,null,null,null,null,null,null,null,null,null,null,null,null,null,"Limited","N/A","N/A","N/A","N/A","N/A","N/A","N/A","N/A","N/A","N/A","N/A","N/A","N/A","N/A","N/A","N/A","N/A","N/A"]
[null,"Unimproved",{"$f":"100-(C124+C125+C127)","v":5.0412323642253796},{"$f":"100-(D124+D125+D127)","v":0.60271091258026388},6.9476019312844528E-2,1.4210854715202004E-13,0,1.1141548420638969,0.11179955960120935,0,0,0,6.1181287838032716,5.8483968338586294,0.98157408534882507,0,0,0.463561829702968,2.8272155048295815,0,null,null,null,null,null,null,null,null,null,null,null,null,null,null,null,null,null,null,null,null,null,null,null,null,null,null,null,null,null,null,null,null,null,"Unimproved","N/A","N/A","N/A","N/A","N/A","N/A","N/A","N/A","N/A","N/A","N/A","N/A","N/A","N/A","N/A","N/A","N/A","N/A"]
[null,"Open defecation",{"$f":"C157","v":1.0877510590378483},{"$f":"D157","v":0},0,0.21395059015117446,0,0,0,0.34313877143574456,0,0,1.3993286715769651,1.4712093449695964,0,0,0,0.24565797354248023,0.34740319038780842,0.17702831834721014,null,null,null,null,null,null,null,null,null,null,null,null,null,null,null,null,null,null,null,null,null,null,null,null,null,null,null,null,null,null,null,null,null,"Open defecation","N/A","N/A","N/A","N/A","N/A","N/A","N/A","N/A","N/A","N/A","N/A","N/A","N/A","N/A","N/A","N/A","N/A","N/A"]
["Shared among Improved Sanitation","Yes","N/A","N/A","N/A","N/A","N/A","N/A","N/A","N/A","N/A","N/A","N/A","N/A","N/A","N/A","N/A","N/A","N/A","N/A",null,null,null,null,null,null,null,null,null,null,null,null,null,null,null,null,null,null,null,null,null,null,null,null,null,null,null,null,null,null,null,null,"Shared among improved sanitation facilities","Yes","N/A","N/A","N/A","N/A","N/A","N/A","N/A","N/A","N/A","N/A","N/A","N/A","N/A","N/A","N/A","N/A","N/A","N/A"]
[null,"No","N/A","N/A","N/A","N/A","N/A","N/A","N/A","N/A","N/A","N/A","N/A","N/A","N/A","N/A","N/A","N/A","N/A","N/A",null,null,null,null,null,null,null,null,null,null,null,null,null,null,null,null,null,null,null,null,null,null,null,null,null,null,null,null,null,null,null,null,null,"No","N/A","N/A","N/A","N/A","N/A","N/A","N/A","N/A","N/A","N/A","N/A","N/A","N/A","N/A","N/A","N/A","N/A","N/A"]
["Manually calculated ratios","Improved latrines"]
[null,"Other"]
[null,"Other"]
[null,null,"NATIONAL wealth index quintile",null,null,null,null,"URBAN wealth index quintile",null,null,null,null,"RURAL wealth index quintile",null,null,null,null,"SUB-REGIONS:",null,null,null,null,null,null,null,null,null,null,null,null,null,null,null,null,null,null,null,null,null,null,null,null,null,null,null,null,null,null,null,null,null,null,"Raw numbers of respondents:","Use of sanitation facilities","NATIONAL wealth index quintile",null,null,null,null,"URBAN wealth index quintile",null,null,null,null,"RURAL wealth index quintile",null,null,null,null,"SUB-REGIONS:"]
["Percentage based on weighted population",null,"Poorest","Poor","Middle","Rich","Richest","Poorest","Poor","Middle","Rich","Richest","Poorest","Poor","Middle","Rich","Richest","Central","North","South",null,null,null,null,null,null,null,null,null,null,null,null,null,null,null,null,null,null,null,null,null,null,null,null,null,null,null,null,null,null,null,null,"Sanitation data, raw numbers (weighted)",null,"Poorest","Poor","Middle","Rich","Richest","Poorest","Poor","Middle","Rich","Richest","Poorest","Poor","Middle","Rich","Richest","Central","North","South"]
["Sanitation type","Sewer connection",28.676529621845155,53.98394854642239,46.197068116261789,58.530243098771408,68.939757630358017,58.368034408870763,55.636607526272876,66.955252149742464,72.606425844245024,79.077133722266538,8.8682669593537202,29.422391884381717,44.83098224773773,21.885653836861334,25.986985064395224,37.210754604814404,59.976527312067596,66.794117150832449,null,null,null,null,null,null,null,null,null,null,null,null,null,null,null,null,null,null,null,null,null,null,null,null,null,null,null,null,null,null,null,null,"Sanitation type","Sewer connection","N/A","N/A","N/A","N/A","N/A","N/A","N/A","N/A","N/A","N/A","N/A","N/A","N/A","N/A","N/A","N/A","N/A","N/A"]
[null,"Septic tank connection",32.20233754676547,42.582104465510305,53.386075767862629,41.255806311077272,30.960562390019557,33.664705439906378,43.692595116120017,32.701609078821761,27.2327068803584,20.922866277733572,18.708256430279764,50.189226950000389,49.586564557226673,77.186891094409845,74.013014935604758,58.676003876953473,18.687712076879123,31.858128182592534,null,null,null,null,null,null,null,null,null,null,null,null,null,null,null,null,null,null,null,null,null,null,null,null,null,null,null,null,null,null,null,null,null,"Septic tank connection","N/A","N/A","N/A","N/A","N/A","N/A","N/A","N/A","N/A","N/A","N/A","N/A","N/A","N/A","N/A","N/A","N/A","N/A"]
[null,"Improved latrines","N/A","N/A","N/A","N/A","N/A","N/A","N/A","N/A","N/A","N/A","N/A","N/A","N/A","N/A","N/A","N/A","N/A","N/A",null,null,null,null,null,null,null,null,null,null,null,null,null,null,null,null,null,null,null,null,null,null,null,null,null,null,null,null,null,null,null,null,null,"Improved latrines","N/A","N/A","N/A","N/A","N/A","N/A","N/A","N/A","N/A","N/A","N/A","N/A","N/A","N/A","N/A","N/A","N/A","N/A"]
[null,"Unimproved facilities","N/A","N/A","N/A","N/A","N/A","N/A","N/A","N/A","N/A","N/A","N/A","N/A","N/A","N/A","N/A","N/A","N/A","N/A",null,null,null,null,null,null,null,null,null,null,null,null,null,null,null,null,null,null,null,null,null,null,null,null,null,null,null,null,null,null,null,null,null,"Unimproved facilities","N/A","N/A","N/A","N/A","N/A","N/A","N/A","N/A","N/A","N/A","N/A","N/A","N/A","N/A","N/A","N/A","N/A","N/A"]
[null,"Open defecation",1.0850873602183033,0,0,0.21395059015117446,0,0,0,0.34313877143574456,0,0,1.3902666781238835,1.4712093449695964,0,0,0,0.24565797354248023,0.34740319038780842,0.17667054022629708,null,null,null,null,null,null,null,null,null,null,null,null,null,null,null,null,null,null,null,null,null,null,null,null,null,null,null,null,null,null,null,null,null,"Open defecation","N/A","N/A","N/A","N/A","N/A","N/A","N/A","N/A","N/A","N/A","N/A","N/A","N/A","N/A","N/A","N/A","N/A","N/A"]
["Septic tank emptying practices","Not emptied/treated and disposed in situ","N/A","N/A","N/A","N/A","N/A","N/A","N/A","N/A","N/A","N/A","N/A","N/A","N/A","N/A","N/A","N/A","N/A","N/A",null,null,null,null,null,null,null,null,null,null,null,null,null,null,null,null,null,null,null,null,null,null,null,null,null,null,null,null,null,null,null,null,"Septic tank emptying practices","Not emptied/treated and disposed in situ","N/A","N/A","N/A","N/A","N/A","N/A","N/A","N/A","N/A","N/A","N/A","N/A","N/A","N/A","N/A","N/A","N/A","N/A"]
[null,"Emptied and buried on site","N/A","N/A","N/A","N/A","N/A","N/A","N/A","N/A","N/A","N/A","N/A","N/A","N/A","N/A","N/A","N/A","N/A","N/A",null,null,null,null,null,null,null,null,null,null,null,null,null,null,null,null,null,null,null,null,null,null,null,null,null,null,null,null,null,null,null,null,null,"Emptied and buried on site","N/A","N/A","N/A","N/A","N/A","N/A","N/A","N/A","N/A","N/A","N/A","N/A","N/A","N/A","N/A","N/A","N/A","N/A"]
[null,"Emptied and discharged locally","N/A","N/A","N/A","N/A","N/A","N/A","N/A","N/A","N/A","N/A","N/A","N/A","N/A","N/A","N/A","N/A","N/A","N/A",null,null,null,null,null,null,null,null,null,null,null,null,null,null,null,null,null,null,null,null,null,null,null,null,null,null,null,null,null,null,null,null,null,"Emptied and discharged locally","N/A","N/A","N/A","N/A","N/A","N/A","N/A","N/A","N/A","N/A","N/A","N/A","N/A","N/A","N/A","N/A","N/A","N/A"]
[null,"Emptied and removed offsite","N/A","N/A","N/A","N/A","N/A","N/A","N/A","N/A","N/A","N/A","N/A","N/A","N/A","N/A","N/A","N/A","N/A","N/A",null,null,null,null,null,null,null,null,null,null,null,null,null,null,null,null,null,null,null,null,null,null,null,null,null,null,null,null,null,null,null,null,null,"Emptied and removed offsite","N/A","N/A","N/A","N/A","N/A","N/A","N/A","N/A","N/A","N/A","N/A","N/A","N/A","N/A","N/A","N/A","N/A","N/A"]
["Latrine emptying practices","Not emptied/treated and disposed in situ","N/A","N/A","N/A","N/A","N/A","N/A","N/A","N/A","N/A","N/A","N/A","N/A","N/A","N/A","N/A","N/A","N/A","N/A",null,null,null,null,null,null,null,null,null,null,null,null,null,null,null,null,null,null,null,null,null,null,null,null,null,null,null,null,null,null,null,null,"Latrine emptying practices","Not emptied/treated and disposed in situ","N/A","N/A","N/A","N/A","N/A","N/A","N/A","N/A","N/A","N/A","N/A","N/A","N/A","N/A","N/A","N/A","N/A","N/A"]
[null,"Emptied and buried on site","N/A","N/A","N/A","N/A","N/A","N/A","N/A","N/A","N/A","N/A","N/A","N/A","N/A","N/A","N/A","N/A","N/A","N/A",null,null,null,null,null,null,null,null,null,null,null,null,null,null,null,null,null,null,null,null,null,null,null,null,null,null,null,null,null,null,null,null,null,"Emptied and buried on site","N/A","N/A","N/A","N/A","N/A","N/A","N/A","N/A","N/A","N/A","N/A","N/A","N/A","N/A","N/A","N/A","N/A","N/A"]
[null,"Emptied and discharged locally","N/A","N/A","N/A","N/A","N/A","N/A","N/A","N/A","N/A","N/A","N/A","N/A","N/A","N/A","N/A","N/A","N/A","N/A",null,null,null,null,null,null,null,null,null,null,null,null,null,null,null,null,null,null,null,null,null,null,null,null,null,null,null,null,null,null,null,null,null,"Emptied and discharged locally","N/A","N/A","N/A","N/A","N/A","N/A","N/A","N/A","N/A","N/A","N/A","N/A","N/A","N/A","N/A","N/A","N/A","N/A"]
[null,"Emptied and removed offsite","N/A","N/A","N/A","N/A","N/A","N/A","N/A","N/A","N/A","N/A","N/A","N/A","N/A","N/A","N/A","N/A","N/A","N/A",null,null,null,null,null,null,null,null,null,null,null,null,null,null,null,null,null,null,null,null,null,null,null,null,null,null,null,null,null,null,null,null,null,"Emptied and removed offsite","N/A","N/A","N/A","N/A","N/A","N/A","N/A","N/A","N/A","N/A","N/A","N/A","N/A","N/A","N/A","N/A","N/A","N/A"]
["Shared among improved sanitation facilities","Yes","N/A","N/A","N/A","N/A","N/A","N/A","N/A","N/A","N/A","N/A","N/A","N/A","N/A","N/A","N/A","N/A","N/A","N/A",null,null,null,null,null,null,null,null,null,null,null,null,null,null,null,null,null,null,null,null,null,null,null,null,null,null,null,null,null,null,null,null,"Shared among improved sanitation facilities","Yes","N/A","N/A","N/A","N/A","N/A","N/A","N/A","N/A","N/A","N/A","N/A","N/A","N/A","N/A","N/A","N/A","N/A","N/A"]
[null,"No","N/A","N/A","N/A","N/A","N/A","N/A","N/A","N/A","N/A","N/A","N/A","N/A","N/A","N/A","N/A","N/A","N/A","N/A",null,null,null,null,null,null,null,null,null,null,null,null,null,null,null,null,null,null,null,null,null,null,null,null,null,null,null,null,null,null,null,null,null,"No","N/A","N/A","N/A","N/A","N/A","N/A","N/A","N/A","N/A","N/A","N/A","N/A","N/A","N/A","N/A","N/A","N/A","N/A"]
[null,"DK/missing","N/A","N/A","N/A","N/A","N/A","N/A","N/A","N/A","N/A","N/A","N/A","N/A","N/A","N/A","N/A","N/A","N/A","N/A",null,null,null,null,null,null,null,null,null,null,null,null,null,null,null,null,null,null,null,null,null,null,null,null,null,null,null,null,null,null,null,null,null,"DK/missing","N/A","N/A","N/A","N/A","N/A","N/A","N/A","N/A","N/A","N/A","N/A","N/A","N/A","N/A","N/A","N/A","N/A","N/A"]
["Shared among all sanitation facilities","Yes",11.68212971241481,3.1319031399863864,1.1939546247872284,0.91730367136411795,1.6695060988399648,11.800267067355955,1.5169147550003979,1.3331957251537194,1.5453272854042763,1.2117436502897043,10.823377467210324,4.9294368411246516,2.6938170467451066,1.2614207194722953,0.72266404388971417,4.0673029788588355,4.4558311408236673,2.0555571488091067,null,null,null,null,null,null,null,null,null,null,null,null,null,null,null,null,null,null,null,null,null,null,null,null,null,null,null,null,null,null,null,null,"Shared among all sanitation facilities","Yes","N/A","N/A","N/A","N/A","N/A","N/A","N/A","N/A","N/A","N/A","N/A","N/A","N/A","N/A","N/A","N/A","N/A","N/A"]
[null,"No",88.317870287585194,96.868096860013608,98.806045375212747,99.08269632863589,98.330493901160025,88.199732932644054,98.483085244999629,98.666804274846285,98.454672714595688,98.788256349710295,89.176622532789651,95.070563158875359,97.306182953254847,98.738579280527688,99.277335956110278,95.932697021141209,95.54416885917621,97.944442851190885,null,null,null,null,null,null,null,null,null,null,null,null,null,null,null,null,null,null,null,null,null,null,null,null,null,null,null,null,null,null,null,null,null,"No","N/A","N/A","N/A","N/A","N/A","N/A","N/A","N/A","N/A","N/A","N/A","N/A","N/A","N/A","N/A","N/A","N/A","N/A"]
["Kind of toilet facility","Flush to piped sewer system",28.746925463602064,53.98394854642239,46.197068116261789,58.530243098771408,68.939757630358017,58.368034408870763,55.636607526272876,66.955252149742464,72.606425844245024,79.077133722266538,8.926071823981772,29.422391884381717,44.83098224773773,21.885653836861334,25.986985064395224,37.210754604814404,59.976527312067596,66.929382904204019,null,null,null,null,null,null,null,null,null,null,null,null,null,null,null,null,null,null,null,null,null,null,null,null,null,null,null,null,null,null,null,null,"Kind of toilet facility","Flush to piped sewer system",515.43003499999952,970.13856999999996,831.71123399999965,1052.5886289999996,1239.0692899999981,651.49616999999921,622.46312499999954,750.76962399999934,808.61377199999947,883.1642259999993,60.274481000000002,201.07045300000001,305.87978300000003,148.28301899999997,176.92310499999999,1522.9385069999998,1631.3244629999999,1454.6747880000021]
[null,"Flush to septic tank",32.28138862749379,42.582104465510305,53.386075767862629,41.255806311077272,30.960562390019557,33.664705439906378,43.692595116120017,32.701609078821761,27.2327068803584,20.922866277733572,18.830200011290096,50.189226950000389,49.586564557226673,77.186891094409845,74.013014935604758,58.676003876953473,18.687712076879123,31.922644548605643,null,null,null,null,null,null,null,null,null,null,null,null,null,null,null,null,null,null,null,null,null,null,null,null,null,null,null,null,null,null,null,null,null,"Flush to septic tank",578.80267199999992,765.23750199999972,961.1388939999996,741.9308429999993,556.46093600000029,375.76092600000004,488.83335099999988,366.68332900000007,303.28915900000004,233.67471900000001,127.15341699999998,342.98947000000004,338.32690799999983,522.96839399999965,503.89117399999975,2401.4548130000071,508.29421499999984,693.82181900000012]
[null,"Pit latrine with watertight tank",0.84703730655241827,0,0,0,0,0,0,0,0,0,1.8118045583323028,0.43208836904403541,0,0,0,0,0.5583696767084142,0,null,null,null,null,null,null,null,null,null,null,null,null,null,null,null,null,null,null,null,null,null,null,null,null,null,null,null,null,null,null,null,null,null,"Pit latrine with watertight tank",15.18731,0,0,0,0,0,0,0,0,0,12.234449999999999,2.9528599999999998,0,0,0,0,15.18731,0]
[null,"Traditional pit latrine",34.131683358195218,2.8312360754870243,0.3473800965627093,0,9.9679979622302392E-2,7.9672601512228409,0.55899779800590643,0,0.16086727539655873,0,66.625126964746499,12.636686617745625,4.6008791096867796,0.92745506872876382,0,3.8018877359233967,18.169511658782568,0.9709442288430582,null,null,null,null,null,null,null,null,null,null,null,null,null,null,null,null,null,null,null,null,null,null,null,null,null,null,null,null,null,null,null,null,null,"Traditional pit latrine",611.9783060000002,50.879777999999995,6.2540750000000003,0,1.7915700000000001,88.929489000000018,6.2540750000000003,0,1.7915700000000001,0,449.89498499999985,86.358182999999983,31.391591999999999,6.2838349999999998,0,155.60128499999996,494.19948399999993,21.102959999999999]
[null,"No facilities",1.0877510590378483,0,0,0.21395059015117446,0,0,0,0.34313877143574456,0,0,1.3993286715769651,1.4712093449695964,0,0,0,0.24565797354248023,0.34740319038780842,0.17702831834721014,null,null,null,null,null,null,null,null,null,null,null,null,null,null,null,null,null,null,null,null,null,null,null,null,null,null,null,null,null,null,null,null,null,"No facilities",19.503288000000001,0,0,3.8476170000000005,0,0,0,3.8476170000000005,0,0,9.4491520000000016,10.054136,0,0,0,10.054136,9.4491520000000016,3.8476170000000005]
[null,"Other",2.905214185118453,0.60271091258020182,6.9476019312541853E-2,0,0,0,0.11179955960118129,0,0,0,2.4074679700722497,5.8483968338586703,0.98157408534878554,0,0,6.569580876647764E-2,2.260476085174068,0,null,null,null,null,null,null,null,null,null,null,null,null,null,null,null,null,null,null,null,null,null,null,null,null,null,null,null,null,null,null,null,null,null,"Other",52.090254000000002,10.831239999999999,1.250815,0,0,0,1.250815,0,0,0,16.256746,39.967511999999999,6.6972360000000002,0,0,2.6887569999999998,61.483552000000003,0]
[null,null,null,null,null,null,null,null,null,null,null,null,null,null,null,null,null,null,null,null,null,null,null,null,null,null,null,null,null,null,null,null,null,null,null,null,null,null,null,null,null,null,null,null,null,null,null,null,null,null,null,null,null,"Total",1792.9918650000034,1797.0870900000011,1800.3550180000052,1798.3670890000017,1797.3217960000006,1116.1865849999995,1118.8013659999997,1121.3005699999999,1113.6945009999997,1116.8389449999981,675.26323100000059,683.39261399999987,682.29551900000013,677.53524800000002,680.81427899999983,4092.7374979999972,2719.938176000011,2173.4471840000037]
[]
[]
[]
[]
[]
[]
[]
[]
[]
[]
[]
[]
[]
[]
[]
[]
[]
[]
[]
[]
[]
[]
[]
[]
[]
[]
[]
[]
[]
[]
[]
[]
[]
[]
[]
[]
[]
[]
[]
[]
[]
[]
[]
[]
[]
[]
[]
[]
[{"$f":"A1026","v":"Montenegro"}]
[{"$f":"A1034","v":"2006"}]
["Access to hygiene facilities "]
[" by wealth quintile and sub-national region"]
["Notes:"]
["WHO/UNICEF JMP customised wealth index excludes water,"]
[" sanitation and hygiene assets."]
["Survey used for analysis:",{"$f":"A1025","v":"MICS06"}]
[]
[]
[]
[]
["Access to handwashing",null,"NATIONAL wealth index quintile",null,null,null,null,"URBAN wealth index quintile",null,null,null,null,"RURAL wealth index quintile",null,null,null,null,"SUB-REGIONS:",null,null,null,null,null,null,null,null,null,null,null,null,null,null,null,null,null,null,null,null,null,null,null,null,null,null,null,null,null,null,null,null,null,null,"Raw numbers of respondents:","Access to handwashing","NATIONAL wealth index quintile",null,null,null,null,"URBAN wealth index quintile",null,null,null,null,"RURAL wealth index quintile",null,null,null,null,"SUB-REGIONS:"]
["Weighted percentage (used in graphs)",null,"Poorest","Poor","Middle","Rich","Richest","Poorest","Poor","Middle","Rich","Richest","Poorest","Poor","Middle","Rich","Richest","Central","North","South",null,null,null,null,null,null,null,null,null,null,null,null,null,null,null,null,null,null,null,null,null,null,null,null,null,null,null,null,null,null,null,null,"Hygiene data, raw numbers (weighted)",null,"Poorest","Poor","Middle","Rich","Richest","Poorest","Poor","Middle","Rich","Richest","Poorest","Poor","Middle","Rich","Richest","Central","North","South"]
["Hygiene ladder","Basic","N/A","N/A","N/A","N/A","N/A","N/A","N/A","N/A","N/A","N/A","N/A","N/A","N/A","N/A","N/A","N/A","N/A","N/A",null,null,null,null,null,null,null,null,null,null,null,null,null,null,null,null,null,null,null,null,null,null,null,null,null,null,null,null,null,null,null,null,"Hygiene ladder","Basic","N/A","N/A","N/A","N/A","N/A","N/A","N/A","N/A","N/A","N/A","N/A","N/A","N/A","N/A","N/A","N/A","N/A","N/A"]
[null,"Limited","N/A","N/A","N/A","N/A","N/A","N/A","N/A","N/A","N/A","N/A","N/A","N/A","N/A","N/A","N/A","N/A","N/A","N/A",null,null,null,null,null,null,null,null,null,null,null,null,null,null,null,null,null,null,null,null,null,null,null,null,null,null,null,null,null,null,null,null,null,"Limited","N/A","N/A","N/A","N/A","N/A","N/A","N/A","N/A","N/A","N/A","N/A","N/A","N/A","N/A","N/A","N/A","N/A","N/A"]
[null,"No facility","N/A","N/A","N/A","N/A","N/A","N/A","N/A","N/A","N/A","N/A","N/A","N/A","N/A","N/A","N/A","N/A","N/A","N/A",null,null,null,null,null,null,null,null,null,null,null,null,null,null,null,null,null,null,null,null,null,null,null,null,null,null,null,null,null,null,null,null,null,"No facility","N/A","N/A","N/A","N/A","N/A","N/A","N/A","N/A","N/A","N/A","N/A","N/A","N/A","N/A","N/A","N/A","N/A","N/A"]
[null,null,null,null,null,null,null,null,null,null,null,null,null,null,null,null,null,null,null,null,null,null,null,null,null,null,null,null,null,null,null,null,null,null,null,null,null,null,null,null,null,null,null,null,null,null,null,null,null,null,null,null,"Observed handwashing place","Fixed","N/A","N/A","N/A","N/A","N/A","N/A","N/A","N/A","N/A","N/A","N/A","N/A","N/A","N/A","N/A","N/A","N/A","N/A"]
[null,null,null,null,null,null,null,null,null,null,null,null,null,null,null,null,null,null,null,null,null,null,null,null,null,null,null,null,null,null,null,null,null,null,null,null,null,null,null,null,null,null,null,null,null,null,null,null,null,null,null,null,null,"Mobile","N/A","N/A","N/A","N/A","N/A","N/A","N/A","N/A","N/A","N/A","N/A","N/A","N/A","N/A","N/A","N/A","N/A","N/A"]
[null,null,null,null,null,null,null,null,null,null,null,null,null,null,null,null,null,null,null,null,null,null,null,null,null,null,null,null,null,null,null,null,null,null,null,null,null,null,null,null,null,null,null,null,null,null,null,null,null,null,null,null,"Water / Soap","Water and soap","N/A","N/A","N/A","N/A","N/A","N/A","N/A","N/A","N/A","N/A","N/A","N/A","N/A","N/A","N/A","N/A","N/A","N/A"]
[null,null,null,null,null,null,null,null,null,null,null,null,null,null,null,null,null,null,null,null,null,null,null,null,null,null,null,null,null,null,null,null,null,null,null,null,null,null,null,null,null,null,null,null,null,null,null,null,null,null,null,null,null,"Water only","N/A","N/A","N/A","N/A","N/A","N/A","N/A","N/A","N/A","N/A","N/A","N/A","N/A","N/A","N/A","N/A","N/A","N/A"]
[null,null,null,null,null,null,null,null,null,null,null,null,null,null,null,null,null,null,null,null,null,null,null,null,null,null,null,null,null,null,null,null,null,null,null,null,null,null,null,null,null,null,null,null,null,null,null,null,null,null,null,null,null,"Soap only","N/A","N/A","N/A","N/A","N/A","N/A","N/A","N/A","N/A","N/A","N/A","N/A","N/A","N/A","N/A","N/A","N/A","N/A"]
[null,null,null,null,null,null,null,null,null,null,null,null,null,null,null,null,null,null,null,null,null,null,null,null,null,null,null,null,null,null,null,null,null,null,null,null,null,null,null,null,null,null,null,null,null,null,null,null,null,null,null,null,null,"Neither","N/A","N/A","N/A","N/A","N/A","N/A","N/A","N/A","N/A","N/A","N/A","N/A","N/A","N/A","N/A","N/A","N/A","N/A"]
[]
[]
[]
[]
[]
[]
[]
[]
[]
[]
[]
[]
[]
[]
[]
[]
[]
[]
[]
[]
[]
[]
[]
[]
[]
[]
[]
[]
[null,null,null,null,null,null,null,null,null,null,null,null,null,null,null,null,null,null,null,null,null,null,null,null,null,null,null,null,null,null,null,null,null,null,null,null,null,null,null,null,null,null,null,null,null,null,null,null,null,null,null,null,"Raw numbers of respondents:","Menstrual health and hygiene","NATIONAL wealth index quintile",null,null,null,null,"URBAN wealth index quintile",null,null,null,null,"RURAL wealth index quintile",null,null,null,null,"SUB-REGIONS:"]
[null,null,null,null,null,null,null,null,null,null,null,null,null,null,null,null,null,null,null,null,null,null,null,null,null,null,null,null,null,null,null,null,null,null,null,null,null,null,null,null,null,null,null,null,null,null,null,null,null,null,null,null,"MHH data, raw numbers (weighted)",null,"Poorest","Poor","Middle","Rich","Richest","Poorest","Poor","Middle","Rich","Richest","Poorest","Poor","Middle","Rich","Richest","Central","North","South"]
[null,null,null,null,null,null,null,null,null,null,null,null,null,null,null,null,null,null,null,null,null,null,null,null,null,null,null,null,null,null,null,null,null,null,null,null,null,null,null,null,null,null,null,null,null,null,null,null,null,null,null,null,"Private place to wash and change","Yes","N/A","N/A","N/A","N/A","N/A","N/A","N/A","N/A","N/A","N/A","N/A","N/A","N/A","N/A","N/A","N/A","N/A","N/A"]
[null,null,null,null,null,null,null,null,null,null,null,null,null,null,null,null,null,null,null,null,null,null,null,null,null,null,null,null,null,null,null,null,null,null,null,null,null,null,null,null,null,null,null,null,null,null,null,null,null,null,null,null,null,"No","N/A","N/A","N/A","N/A","N/A","N/A","N/A","N/A","N/A","N/A","N/A","N/A","N/A","N/A","N/A","N/A","N/A","N/A"]
[null,null,null,null,null,null,null,null,null,null,null,null,null,null,null,null,null,null,null,null,null,null,null,null,null,null,null,null,null,null,null,null,null,null,null,null,null,null,null,null,null,null,null,null,null,null,null,null,null,null,null,null,null,"DK/not sure/missing","N/A","N/A","N/A","N/A","N/A","N/A","N/A","N/A","N/A","N/A","N/A","N/A","N/A","N/A","N/A","N/A","N/A","N/A"]
[null,null,null,null,null,null,null,null,null,null,null,null,null,null,null,null,null,null,null,null,null,null,null,null,null,null,null,null,null,null,null,null,null,null,null,null,null,null,null,null,null,null,null,null,null,null,null,null,null,null,null,null,"Use of menstrual materials","Materials reusable","N/A","N/A","N/A","N/A","N/A","N/A","N/A","N/A","N/A","N/A","N/A","N/A","N/A","N/A","N/A","N/A","N/A","N/A"]
[null,null,null,null,null,null,null,null,null,null,null,null,null,null,null,null,null,null,null,null,null,null,null,null,null,null,null,null,null,null,null,null,null,null,null,null,null,null,null,null,null,null,null,null,null,null,null,null,null,null,null,null,null,"Materials not reusable","N/A","N/A","N/A","N/A","N/A","N/A","N/A","N/A","N/A","N/A","N/A","N/A","N/A","N/A","N/A","N/A","N/A","N/A"]
[null,null,null,null,null,null,null,null,null,null,null,null,null,null,null,null,null,null,null,null,null,null,null,null,null,null,null,null,null,null,null,null,null,null,null,null,null,null,null,null,null,null,null,null,null,null,null,null,null,null,null,null,null,"No materials used","N/A","N/A","N/A","N/A","N/A","N/A","N/A","N/A","N/A","N/A","N/A","N/A","N/A","N/A","N/A","N/A","N/A","N/A"]
[null,null,null,null,null,null,null,null,null,null,null,null,null,null,null,null,null,null,null,null,null,null,null,null,null,null,null,null,null,null,null,null,null,null,null,null,null,null,null,null,null,null,null,null,null,null,null,null,null,null,null,null,null,"DK/not sure/missing","N/A","N/A","N/A","N/A","N/A","N/A","N/A","N/A","N/A","N/A","N/A","N/A","N/A","N/A","N/A","N/A","N/A","N/A"]
[null,null,null,null,null,null,null,null,null,null,null,null,null,null,null,null,null,null,null,null,null,null,null,null,null,null,null,null,null,null,null,null,null,null,null,null,null,null,null,null,null,null,null,null,null,null,null,null,null,null,null,null,"Use of menstrual materials with private place to wash and change","Materials reusable","N/A","N/A","N/A","N/A","N/A","N/A","N/A","N/A","N/A","N/A","N/A","N/A","N/A","N/A","N/A","N/A","N/A","N/A"]
[null,null,null,null,null,null,null,null,null,null,null,null,null,null,null,null,null,null,null,null,null,null,null,null,null,null,null,null,null,null,null,null,null,null,null,null,null,null,null,null,null,null,null,null,null,null,null,null,null,null,null,null,null,"Materials not reusable","N/A","N/A","N/A","N/A","N/A","N/A","N/A","N/A","N/A","N/A","N/A","N/A","N/A","N/A","N/A","N/A","N/A","N/A"]
[null,null,null,null,null,null,null,null,null,null,null,null,null,null,null,null,null,null,null,null,null,null,null,null,null,null,null,null,null,null,null,null,null,null,null,null,null,null,null,null,null,null,null,null,null,null,null,null,null,null,null,null,null,"No materials used","N/A","N/A","N/A","N/A","N/A","N/A","N/A","N/A","N/A","N/A","N/A","N/A","N/A","N/A","N/A","N/A","N/A","N/A"]
[null,null,null,null,null,null,null,null,null,null,null,null,null,null,null,null,null,null,null,null,null,null,null,null,null,null,null,null,null,null,null,null,null,null,null,null,null,null,null,null,null,null,null,null,null,null,null,null,null,null,null,null,"Awareness of menstruation before menarche","Yes","N/A","N/A","N/A","N/A","N/A","N/A","N/A","N/A","N/A","N/A","N/A","N/A","N/A","N/A","N/A","N/A","N/A","N/A"]
[null,null,null,null,null,null,null,null,null,null,null,null,null,null,null,null,null,null,null,null,null,null,null,null,null,null,null,null,null,null,null,null,null,null,null,null,null,null,null,null,null,null,null,null,null,null,null,null,null,null,null,null,null,"No","N/A","N/A","N/A","N/A","N/A","N/A","N/A","N/A","N/A","N/A","N/A","N/A","N/A","N/A","N/A","N/A","N/A","N/A"]
[null,null,null,null,null,null,null,null,null,null,null,null,null,null,null,null,null,null,null,null,null,null,null,null,null,null,null,null,null,null,null,null,null,null,null,null,null,null,null,null,null,null,null,null,null,null,null,null,null,null,null,null,null,"DK/not sure/missing","N/A","N/A","N/A","N/A","N/A","N/A","N/A","N/A","N/A","N/A","N/A","N/A","N/A","N/A","N/A","N/A","N/A","N/A"]
[null,null,null,null,null,null,null,null,null,null,null,null,null,null,null,null,null,null,null,null,null,null,null,null,null,null,null,null,null,null,null,null,null,null,null,null,null,null,null,null,null,null,null,null,null,null,null,null,null,null,null,null,"Participation in (all) activities during menstruation","Yes","N/A","N/A","N/A","N/A","N/A","N/A","N/A","N/A","N/A","N/A","N/A","N/A","N/A","N/A","N/A","N/A","N/A","N/A"]
[null,null,null,null,null,null,null,null,null,null,null,null,null,null,null,null,null,null,null,null,null,null,null,null,null,null,null,null,null,null,null,null,null,null,null,null,null,null,null,null,null,null,null,null,null,null,null,null,null,null,null,null,null,"No","N/A","N/A","N/A","N/A","N/A","N/A","N/A","N/A","N/A","N/A","N/A","N/A","N/A","N/A","N/A","N/A","N/A","N/A"]
[null,null,null,null,null,null,null,null,null,null,null,null,null,null,null,null,null,null,null,null,null,null,null,null,null,null,null,null,null,null,null,null,null,null,null,null,null,null,null,null,null,null,null,null,null,null,null,null,null,null,null,null,null,"DK/not sure/missing/no such activity","N/A","N/A","N/A","N/A","N/A","N/A","N/A","N/A","N/A","N/A","N/A","N/A","N/A","N/A","N/A","N/A","N/A","N/A"]
[null,null,null,null,null,null,null,null,null,null,null,null,null,null,null,null,null,null,null,null,null,null,null,null,null,null,null,null,null,null,null,null,null,null,null,null,null,null,null,null,null,null,null,null,null,null,null,null,null,null,null,null,"Participation in specific activities during menstruation","Did not go to school (amongst those usually attending school)","N/A","N/A","N/A","N/A","N/A","N/A","N/A","N/A","N/A","N/A","N/A","N/A","N/A","N/A","N/A","N/A","N/A","N/A"]
[null,null,null,null,null,null,null,null,null,null,null,null,null,null,null,null,null,null,null,null,null,null,null,null,null,null,null,null,null,null,null,null,null,null,null,null,null,null,null,null,null,null,null,null,null,null,null,null,null,null,null,null,null,"Did not go to work (amongst those who usually work)","N/A","N/A","N/A","N/A","N/A","N/A","N/A","N/A","N/A","N/A","N/A","N/A","N/A","N/A","N/A","N/A","N/A","N/A"]
[null,null,null,null,null,null,null,null,null,null,null,null,null,null,null,null,null,null,null,null,null,null,null,null,null,null,null,null,null,null,null,null,null,null,null,null,null,null,null,null,null,null,null,null,null,null,null,null,null,null,null,null,null,"Did not participate in social activities","N/A","N/A","N/A","N/A","N/A","N/A","N/A","N/A","N/A","N/A","N/A","N/A","N/A","N/A","N/A","N/A","N/A","N/A"]
[null,null,null,null,null,null,null,null,null,null,null,null,null,null,null,null,null,null,null,null,null,null,null,null,null,null,null,null,null,null,null,null,null,null,null,null,null,null,null,null,null,null,null,null,null,null,null,null,null,null,null,null,null,"Did not cook food","N/A","N/A","N/A","N/A","N/A","N/A","N/A","N/A","N/A","N/A","N/A","N/A","N/A","N/A","N/A","N/A","N/A","N/A"]
[null,null,null,null,null,null,null,null,null,null,null,null,null,null,null,null,null,null,null,null,null,null,null,null,null,null,null,null,null,null,null,null,null,null,null,null,null,null,null,null,null,null,null,null,null,null,null,null,null,null,null,null,null,"Did not eat with others","N/A","N/A","N/A","N/A","N/A","N/A","N/A","N/A","N/A","N/A","N/A","N/A","N/A","N/A","N/A","N/A","N/A","N/A"]
[null,null,null,null,null,null,null,null,null,null,null,null,null,null,null,null,null,null,null,null,null,null,null,null,null,null,null,null,null,null,null,null,null,null,null,null,null,null,null,null,null,null,null,null,null,null,null,null,null,null,null,null,null,"Did not bathe in regular place","N/A","N/A","N/A","N/A","N/A","N/A","N/A","N/A","N/A","N/A","N/A","N/A","N/A","N/A","N/A","N/A","N/A","N/A"]
[null,null,null,null,null,null,null,null,null,null,null,null,null,null,null,null,null,null,null,null,null,null,null,null,null,null,null,null,null,null,null,null,null,null,null,null,null,null,null,null,null,null,null,null,null,null,null,null,null,null,null,null,null,"Did not participate in other activities","N/A","N/A","N/A","N/A","N/A","N/A","N/A","N/A","N/A","N/A","N/A","N/A","N/A","N/A","N/A","N/A","N/A","N/A"]
[null,null,null,null,null,null,null,null,null,null,null,null,null,null,null,null,null,null,null,null,null,null,null,null,null,null,null,null,null,null,null,null,null,null,null,null,null,null,null,null,null,null,null,null,null,null,null,null,null,null,null,null,null,"DK/not sure/missing/no such activity","N/A","N/A","N/A","N/A","N/A","N/A","N/A","N/A","N/A","N/A","N/A","N/A","N/A","N/A","N/A","N/A","N/A","N/A"]
[]
[]
[]
[]
[]
[]
[]
[]
[]
[]
[]
[]
[]
[]
[]
[]
[]
[]
[]
[]
[]
[]
[]
[]
[]
[]
[]
[]
[]
[]
[]
[]
[]
[]
[]
[]
[]
[]
[]
[]
[]
[]
[]
[]
[]
[]
[]
[]
[]
[]
[]
[]
[]
[]
[null,null,null,null,null,null,null,null,null,null,null,null,null,null,null,null,null,null,null,null,null,null,null,null,null,null,null,null,null,null,null,null,null,null,null,null,null,null,null,null,null,null,null,null,null,null,null,null,null,null,null,null,"Raw numbers of respondents:","Basic water, sanitation and hygiene","NATIONAL wealth index quintile",null,null,null,null,"URBAN wealth index quintile",null,null,null,null,"RURAL wealth index quintile",null,null,null,null,"SUB-REGIONS:"]
[null,null,null,null,null,null,null,null,null,null,null,null,null,null,null,null,null,null,null,null,null,null,null,null,null,null,null,null,null,null,null,null,null,null,null,null,null,null,null,null,null,null,null,null,null,null,null,null,null,null,null,null,"WatSan data, raw numbers (weighted)",null,"Poorest","Poor","Middle","Rich","Richest","Poorest","Poor","Middle","Rich","Richest","Poorest","Poor","Middle","Rich","Richest","Central","North","South"]
[null,null,null,null,null,null,null,null,null,null,null,null,null,null,null,null,null,null,null,null,null,null,null,null,null,null,null,null,null,null,null,null,null,null,null,null,null,null,null,null,null,null,null,null,null,null,null,null,null,null,null,null,"Use of Basic Water Sanitation and Hygiene","Yes","N/A","N/A","N/A","N/A","N/A","N/A","N/A","N/A","N/A","N/A","N/A","N/A","N/A","N/A","N/A","N/A","N/A","N/A"]
[null,null,null,null,null,null,null,null,null,null,null,null,null,null,null,null,null,null,null,null,null,null,null,null,null,null,null,null,null,null,null,null,null,null,null,null,null,null,null,null,null,null,null,null,null,null,null,null,null,null,null,null,null,"No","N/A","N/A","N/A","N/A","N/A","N/A","N/A","N/A","N/A","N/A","N/A","N/A","N/A","N/A","N/A","N/A","N/A","N/A"]
[null,null,null,null,null,null,null,null,null,null,null,null,null,null,null,null,null,null,null,null,null,null,null,null,null,null,null,null,null,null,null,null,null,null,null,null,null,null,null,null,null,null,null,null,null,null,null,null,null,null,null,null,"Use of Basic Water and Sanitation","Yes","N/A","N/A","N/A","N/A","N/A","N/A","N/A","N/A","N/A","N/A","N/A","N/A","N/A","N/A","N/A","N/A","N/A","N/A"]
[null,null,null,null,null,null,null,null,null,null,null,null,null,null,null,null,null,null,null,null,null,null,null,null,null,null,null,null,null,null,null,null,null,null,null,null,null,null,null,null,null,null,null,null,null,null,null,null,null,null,null,null,null,"No","N/A","N/A","N/A","N/A","N/A","N/A","N/A","N/A","N/A","N/A","N/A","N/A","N/A","N/A","N/A","N/A","N/A","N/A"]
[null,null,null,null,null,null,null,null,null,null,null,null,null,null,null,null,null,null,null,null,null,null,null,null,null,null,null,null,null,null,null,null,null,null,null,null,null,null,null,null,null,null,null,null,null,null,null,null,null,null,null,null,"Use of Basic Water and Hygiene","Yes","N/A","N/A","N/A","N/A","N/A","N/A","N/A","N/A","N/A","N/A","N/A","N/A","N/A","N/A","N/A","N/A","N/A","N/A"]
[null,null,null,null,null,null,null,null,null,null,null,null,null,null,null,null,null,null,null,null,null,null,null,null,null,null,null,null,null,null,null,null,null,null,null,null,null,null,null,null,null,null,null,null,null,null,null,null,null,null,null,null,null,"No","N/A","N/A","N/A","N/A","N/A","N/A","N/A","N/A","N/A","N/A","N/A","N/A","N/A","N/A","N/A","N/A","N/A","N/A"]
[null,null,null,null,null,null,null,null,null,null,null,null,null,null,null,null,null,null,null,null,null,null,null,null,null,null,null,null,null,null,null,null,null,null,null,null,null,null,null,null,null,null,null,null,null,null,null,null,null,null,null,null,"Use of Basic Sanitation and Hygiene","Yes","N/A","N/A","N/A","N/A","N/A","N/A","N/A","N/A","N/A","N/A","N/A","N/A","N/A","N/A","N/A","N/A","N/A","N/A"]
[null,null,null,null,null,null,null,null,null,null,null,null,null,null,null,null,null,null,null,null,null,null,null,null,null,null,null,null,null,null,null,null,null,null,null,null,null,null,null,null,null,null,null,null,null,null,null,null,null,null,null,null,null,"No","N/A","N/A","N/A","N/A","N/A","N/A","N/A","N/A","N/A","N/A","N/A","N/A","N/A","N/A","N/A","N/A","N/A","N/A"]
[null,null,null,null,null,null,null,null,null,null,null,null,null,null,null,null,null,null,null,null,null,null,null,null,null,null,null,null,null,null,null,null,null,null,null,null,null,null,null,null,null,null,null,null,null,null,null,null,null,null,null,null,"Use of Basic Water","Yes","N/A","N/A","N/A","N/A","N/A","N/A","N/A","N/A","N/A","N/A","N/A","N/A","N/A","N/A","N/A","N/A","N/A","N/A"]
[null,null,null,null,null,null,null,null,null,null,null,null,null,null,null,null,null,null,null,null,null,null,null,null,null,null,null,null,null,null,null,null,null,null,null,null,null,null,null,null,null,null,null,null,null,null,null,null,null,null,null,null,null,"No","N/A","N/A","N/A","N/A","N/A","N/A","N/A","N/A","N/A","N/A","N/A","N/A","N/A","N/A","N/A","N/A","N/A","N/A"]
[null,null,null,null,null,null,null,null,null,null,null,null,null,null,null,null,null,null,null,null,null,null,null,null,null,null,null,null,null,null,null,null,null,null,null,null,null,null,null,null,null,null,null,null,null,null,null,null,null,null,null,null,"Use of Basic Sanitation","Yes","N/A","N/A","N/A","N/A","N/A","N/A","N/A","N/A","N/A","N/A","N/A","N/A","N/A","N/A","N/A","N/A","N/A","N/A"]
[null,null,null,null,null,null,null,null,null,null,null,null,null,null,null,null,null,null,null,null,null,null,null,null,null,null,null,null,null,null,null,null,null,null,null,null,null,null,null,null,null,null,null,null,null,null,null,null,null,null,null,null,null,"No","N/A","N/A","N/A","N/A","N/A","N/A","N/A","N/A","N/A","N/A","N/A","N/A","N/A","N/A","N/A","N/A","N/A","N/A"]
[null,null,null,null,null,null,null,null,null,null,null,null,null,null,null,null,null,null,null,null,null,null,null,null,null,null,null,null,null,null,null,null,null,null,null,null,null,null,null,null,null,null,null,null,null,null,null,null,null,null,null,null,"Access to Basic Hygiene","Yes","N/A","N/A","N/A","N/A","N/A","N/A","N/A","N/A","N/A","N/A","N/A","N/A","N/A","N/A","N/A","N/A","N/A","N/A"]
[null,null,null,null,null,null,null,null,null,null,null,null,null,null,null,null,null,null,null,null,null,null,null,null,null,null,null,null,null,null,null,null,null,null,null,null,null,null,null,null,null,null,null,null,null,null,null,null,null,null,null,null,null,"No","N/A","N/A","N/A","N/A","N/A","N/A","N/A","N/A","N/A","N/A","N/A","N/A","N/A","N/A","N/A","N/A","N/A","N/A"]
[]
[]
[]
[]
[]
[]
[]
[]
[]
[]
[]
[]
[]
[]
[]
[]
[]
[]
[]
[]
[]
[]
[]
[]
[]
[]
[]
[]
[]
[]
[]
[]
[]
[]
[]
[]
[]
[]
[]
[]
[]
[]
[]
[]
[null,null,"INITIAL (national) Wealth Index",null,null,null,null,"URBAN Wealth Index",null,null,null,null,"RURAL Wealth Index"]
[null,null,"Component Matrix",null,null,null,null,"Component Matrix",null,null,null,null,"Component Matrix"]
[null,null,null,null,"Component",null,null,null,null,"Component",null,null,null,null,"Component"]
[null,"Note:\n\nThe INITIAL (national) Wealth Index is based on the first component of the Principal Component Analysis (PCA) which has been obtained at national level.\n\nThe final national-level (NATIONAL) Wealth Index is based on the URBAN and RURAL specific wealth indexes. Regression procedures are used to establish the relationships between the two sets of scores (urban and rural) and the initial (national) wealth factors.\nThis allows best use of the available information for each area and a better precision of the FINAL (NATIONAL) Wealth Index.\n\nFor dependency reasons, all WASH variables (contained in the generic MICS and DHS scripts) have been excluded from the sets of asset variables used in the PCAs.\n\nThe PCA can extracts as many components as there are asset variables in the input. Only the first of the components is used to represent the Wealth Index. \n\nThe scores represent the weights of the asset variables on the Wealth Index (correlations between the variables and the component).\n\nThe communalities are the proportion of each variable's variance that can be explained by the component.\n\nProportion of explained variance is the part of the model's total variance that is explained by the component.\n\nFor more information on the procedure used:\n\nThe DHS Wealth Index, DHS Comparative Reports No. 6, Shea Oscar Rutstein, Kiersten Johnson, ORC Macro International Inc., 2004.\n\nThe DHS Wealth Index: Approaches for Rural and Urban Areas, Shea O. Rutstein, ORC Macro International Inc., 2008.\n\nMICS Methodological Paper No. 4, Review of options for reporting water, sanitation and hygiene coverage by wealth quintile, UNICEF, 2016.",null,null,"1",null,null,null,null,"1",null,null,null,null,"1"]
[null,null,"fuel1",null,0.71019243932030607,null,null,"Household has chimney",null,-0.64910245637010322,null,null,"fuel1",null,0.76770557493674063]
[null,null,"Household has chimney",null,-0.70180857833381893,null,null,"fuel1",null,0.63162531462487825,null,null,"Household has chimney",null,-0.74351764597302017]
[null,null,"fuel8",null,-0.66924166209427294,null,null,"fuel8",null,-0.57254206889318049,null,null,"fuel8",null,-0.71095736718837554]
[null,null,"Household member owns: asset9f",null,0.64610493012452908,null,null,"floor21",null,-0.56040231938964791,null,null,"Household member owns: asset9f",null,0.65991605348136362]
[null,null,"Household member owns: asset9g",null,0.63433584597906612,null,null,"Household member owns: asset9g",null,0.54158434445779902,null,null,"Household member owns: asset9g",null,0.62503214543019725]
[null,null,"floor21",null,-0.6099849740660831,null,null,"floor31",null,0.53670055075564738,null,null,"floor21",null,-0.60770335624121807]
[null,null,"floor31",null,0.60252504429958487,null,null,"Household member owns: asset9j",null,0.52466073332264651,null,null,"floor31",null,0.55261068604144825]
[null,null,"Household member owns: asset9j",null,0.52194087125875677,null,null,"Household member owns: asset9f",null,0.50543062410753747,null,null,"Household member owns: asset9j",null,0.51283545249471651]
[null,null,"Household member owns: asset9e",null,0.47320821480315112,null,null,"Household member owns: asset9i",null,0.44069155070000726,null,null,"Household member owns: asset10e",null,0.50877848953749893]
[null,null,"Household member owns: asset9d",null,0.47263101900897275,null,null,"Household member owns: asset9h",null,0.43947532659196886,null,null,"cattle1",null,-0.48976045092513731]
[null,null,"Household member owns: asset10e",null,0.47251461855060251,null,null,"Household member owns: asset10e",null,0.42814905731998376,null,null,"Household member owns: asset9d",null,0.4598399811341371]
[null,null,"Household member owns: asset9i",null,0.45581088089298377,null,null,"Household member owns: asset9d",null,0.41089742292550341,null,null,"Household member owns: asset9e",null,0.44909429965737591]
[null,null,"Household member owns: asset9h",null,0.42378888929028707,null,null,"Household member owns: asset9e",null,0.40680570734535404,null,null,"Household member owns: asset9i",null,0.42090416286047916]
[null,null,"roof35",null,0.40505970103099481,null,null,"roof35",null,0.39115843994031596,null,null,"cow1",null,-0.41341742211856702]
[null,null,"roof96",null,-0.35686931100939312,null,null,"Dwelling owns to family",null,-0.38244100091962102,null,null,"roof96",null,-0.3831289024620359]
[null,null,"Household member owns: asset9c",null,0.34395116498685857,null,null,"roof96",null,-0.36862226070403881,null,null,"roof35",null,0.37985875055923757]
[null,null,"Household member owns: asset10a",null,0.31512920607579459,null,null,"wall24",null,-0.32427061709238347,null,null,"chicken1",null,-0.37586267053151146]
[null,null,"Household member owns: asset10b",null,0.29922144964889102,null,null,"Household member owns dwelling",null,0.28717595852026556,null,null,"Household member owns: asset10b",null,0.36701389297466763]
[null,null,"wall36",null,-0.27770375258325686,null,null,"floor34",null,-0.26714060505272125,null,null,"Household member owns: asset9h",null,0.35169962287346357]
[null,null,"Household member owns: asset9b",null,0.25084397089336852,null,null,"Persons per sleeping rooms",null,-0.26638425436036051,null,null,"Household member owns: asset9c",null,0.34875735122227347]
[null,null,"Household has hood",null,-0.23286116754227534,null,null,"Household member owns: asset10a",null,0.25169946444930436,null,null,"wall34",null,0.31088717168258212]
[null,null,"floor34",null,-0.22788654697420238,null,null,"wall36",null,-0.23636852665038238,null,null,"wall36",null,-0.29071169218420906]
[null,null,"wall31",null,0.22479576980622581,null,null,"fuel6",null,-0.2324895014126542,null,null,"Household member owns: asset9b",null,0.28647573558586187]
[null,null,"Household member owns: asset9a",null,0.22127125984695556,null,null,"Household member owns: asset10b",null,0.21454309482200595,null,null,"Household member owns: asset10a",null,0.28207060632829617]
[null,null,"wall26",null,-0.21703819248978873,null,null,"wall31",null,0.21126524981035125,null,null,"horse1",null,-0.28016046273846612]
[null,null,"floor11",null,-0.20341506326171718,null,null,"Household member owns: asset9k",null,0.20994305667400193,null,null,"floor33",null,0.27185061249915066]
[null,null,"Persons per sleeping rooms",null,-0.19994101798640473,null,null,"Household member owns: asset9b",null,0.19878830901407929,null,null,"roof31",null,-0.25202939307934863]
[null,null,"roof23",null,-0.19936216928407338,null,null,"cattle1",null,-0.19873093107611256,null,null,"wall26",null,-0.22997608287386401]
[null,null,"Household member owns: asset9k",null,0.19478329762968541,null,null,"Household member rents dwelling",null,-0.19006266813982733,null,null,"Small land",null,-0.22677809630279921]
[null,null,"wall22",null,-0.19121887217828873,null,null,"roof31",null,-0.18703530978512714,null,null,"Household has hood",null,-0.20659458275537448]
[null,null,"Dwelling owns to family",null,-0.18551353488907768,null,null,"cow1",null,-0.18657862318342744,null,null,"Persons per sleeping rooms",null,-0.20145996177575839]
[null,null,"fuel6",null,-0.17919771943601948,null,null,"wall26",null,-0.17982172408698816,null,null,"Household member owns: asset9a",null,0.19319430553898301]
[null,null,"roof31",null,-0.17606374944925593,null,null,"roof23",null,-0.17182738694136104,null,null,"sheep1",null,-0.18347172862236247]
[null,null,"Household member owns dwelling",null,0.1726404801533177,null,null,"Household member owns: asset9c",null,0.16425666507100556,null,null,"floor11",null,-0.17974000690354883]
[null,null,"wall24",null,-0.16931350222161701,null,null,"fuel7",null,-0.12318973065165646,null,null,"wall22",null,-0.17231507632953025]
[null,null,"wall34",null,0.15582695302487112,null,null,"Household has hood",null,-0.11953440575154294,null,null,"wall32",null,-0.16599526907642659]
[null,null,"Household cooks at open sky",null,-0.14550910394624098,null,null,"sheep30",null,-0.11839240420191274,null,null,"sheep10",null,-0.1630110739925022]
[null,null,"wall32",null,-0.13557146716382576,null,null,"Household member owns: asset10c",null,0.11738929383135142,null,null,"Household cooks at open sky",null,-0.15747789993194414]
[null,null,"Household cooks in owm house",null,0.12972039930513427,null,null,"wall96",null,-0.1134490162010061,null,null,"roof23",null,-0.15318614638219288]
[null,null,"Household cooks outside house",null,-0.12292339310006192,null,null,"wall22",null,-0.11203075629339571,null,null,"fuel6",null,-0.14443888171228561]
[null,null,"floor33",null,0.11900496470113499,null,null,"Household cooks in owm house",null,0.10241320403084424,null,null,"wall31",null,0.12655979268476819]
[null,null,"roof32",null,-0.11893268976467122,null,null,"floor11",null,-9.4901127218481138E-2,null,null,"floor34",null,-0.12566690955134752]
[null,null,"wall21",null,-0.10953375224303039,null,null,"Household cooks outside house",null,-8.8481537772626365E-2,null,null,"Dwelling is free",null,-0.12355693917615374]
[null,null,"Household member owns: asset10c",null,0.10608838830896379,null,null,"horse1",null,-8.4565857940500422E-2,null,null,"wall21",null,-0.11738005409310724]
[null,null,"wall96",null,-9.9902805903833242E-2,null,null,"wall25",null,-8.3101778994961031E-2,null,null,"roof32",null,-0.11675042613351071]
[null,null,"wall25",null,-9.9601873884904948E-2,null,null,"floor33",null,7.0594377960035121E-2,null,null,"wall96",null,-0.1154612975257114]
[null,null,"Dwelling is free",null,-8.0380107112369426E-2,null,null,"Household cooks at open sky",null,-6.8252626948543546E-2,null,null,"Household member owns: asset9k",null,0.11290191326616995]
[null,null,"Household cooks on open owen",null,-7.7980788744289001E-2,null,null,"roof34",null,-6.4974163224601048E-2,null,null,"Household member owns dwelling",null,0.11236939547053812]
[null,null,"wall33",null,7.5827843245490439E-2,null,null,"goat1",null,-5.9768660794769814E-2,null,null,"Household cooks in owm house",null,0.11039911263566421]
[null,null,"roof36",null,6.6660787635595728E-2,null,null,"Big land",null,5.6373463890652661E-2,null,null,"wall33",null,0.10818853557949808]
[null,null,"Household member rents dwelling",null,-6.3305630298704244E-2,null,null,"Household member owns: asset10g",null,5.6362076364434584E-2,null,null,"roof21",null,0.10500366377774312]
[null,null,"fuel7",null,-5.9411993871533397E-2,null,null,"wall34",null,5.5982938003395634E-2,null,null,"roof34",null,0.1048026748547634]
[null,null,"Household member owns: asset10g",null,5.7504261209870892E-2,null,null,"Household cooks in separate house",null,-5.5911558722147703E-2,null,null,"Household cooks outside house",null,-9.8069403840740241E-2]
[null,null,"Household cooks in separate house",null,-4.9835009761477721E-2,null,null,"roof36",null,5.4223244737315893E-2,null,null,"roof36",null,9.6360562407285841E-2]
[null,null,"Household member owns: asset10d",null,-4.4533678090445047E-2,null,null,"cattle5",null,-5.2392175134662038E-2,null,null,"Household member owns: asset10f",null,9.3213827742479355E-2]
[null,null,"Household member owns: asset10f",null,4.075342736520951E-2,null,null,"Household member owns: asset10f",null,4.9868558776583444E-2,null,null,"Household cooks on open owen",null,-9.048511333689091E-2]
[null,null,"roof34",null,-3.8119511265400828E-2,null,null,"roof33",null,-4.7495889506954422E-2,null,null,"wall25",null,-8.9330271073986542E-2]
[null,null,"chimney",null,-3.6020011075962872E-2,null,null,"wall35",null,-4.2850483276239124E-2,null,null,"goat1",null,-8.4622954103856257E-2]
[null,null,"fuel2",null,3.5619220517851755E-2,null,null,"chicken1",null,-3.9023492359995873E-2,null,null,"sheep30",null,-8.1409284087118908E-2]
[null,null,"roof21",null,1.8061686573572541E-2,null,null,"cow5",null,-3.5338924617023558E-2,null,null,"fuel2",null,7.957104867772323E-2]
[null,null,"floor32",null,1.0459749465133873E-2,null,null,"wall33",null,3.5098336424954746E-2,null,null,"Household member owns: asset10c",null,6.7806657277058868E-2]
[null,null,"wall35",null,-8.8979220826919652E-3,null,null,"chicken30",null,3.0975278508518035E-2,null,null,"Household member owns: asset10g",null,6.4899021859081127E-2]
[null,null,"floor96",null,-5.869097495009498E-3,null,null,"floor32",null,-2.3162571122905286E-2,null,null,"Household member owns: asset10d",null,6.4784538063782357E-2]
[null,null,"wall23",null,-8.0803666901179229E-4,null,null,"chimney",null,-2.1212468983131332E-2,null,null,"cattle5",null,-5.8636272564109242E-2]
[null,null,"roof33",null,-6.9442215907266041E-4,null,null,"Household member owns: asset10d",null,-2.0524704642797806E-2,null,null,"chicken10",null,-4.9230653557146196E-2]
[null,null,null,null,null,null,null,"sheep1",null,-1.8415128865326615E-2,null,null,"wall24",null,-4.8948010847222022E-2]
[null,null,null,null,null,null,null,"Medium land",null,-1.6353698609470755E-2,null,null,"chimney",null,-4.7776884820777923E-2]
[null,null,null,null,null,null,null,"wall23",null,-1.2251581194415728E-2,null,null,"floor32",null,4.7331433551077828E-2]
[null,null,"Communalities",null,null,null,null,"sheep10",null,-1.1061300040622028E-2,null,null,"Household cooks in separate house",null,-4.7285785488523538E-2]
[null,null,null,null,"Extraction",null,null,"wall32",null,-1.1031148812882009E-2,null,null,"cattle10",null,-4.1566442168685137E-2]
[null,null,"Persons per sleeping rooms",null,3.9976410673439822E-2,null,null,"Household cooks on open owen",null,-1.1012544052634516E-2,null,null,"Medium land",null,-4.0175036053933286E-2]
[null,null,"floor11",null,4.1377687961768404E-2,null,null,"Dwelling is free",null,1.012139863528951E-2,null,null,"fuel7",null,-3.6000185068027324E-2]
[null,null,"floor21",null,0.37208166858640007,null,null,"fuel2",null,7.2673922438258936E-3,null,null,"Big land",null,-3.4672650184228486E-2]
[null,null,"floor31",null,0.3630364290082167,null,null,"roof21",null,-6.7628652090853721E-3,null,null,"cow10",null,-2.5315602349830164E-2]
[null,null,"floor32",null,1.0940635887336835E-4,null,null,"floor96",null,-3.69926904044879E-3,null,null,"roof33",null,2.2432806239096183E-2]
[null,null,"floor33",null,1.4162181623518384E-2,null,null,"chicken10",null,7.4833517868474033E-4,null,null,"cow5",null,-2.1814767710944927E-2]
[null,null,"floor34",null,5.1932278291825347E-2,null,null,"Small land",null,3.3778406025416899E-4,null,null,"Household member rents dwelling",null,-9.6166423430403183E-3]
[null,null,"floor96",null,3.4446305405926767E-5,null,null,null,null,null,null,null,"floor96",null,-7.2907653501932011E-3]
[null,null,"roof21",null,3.2622452188197059E-4,null,null,null,null,null,null,null,"Dwelling owns to family",null,-7.9140040138462502E-4]
[null,null,"roof23",null,3.9745274541651533E-2,null,null,null,null,null,null,null,"chicken30",null,-2.5236819958676345E-4]
[null,null,"roof31",null,3.0998443870130368E-2,null,null,"Communalities"]
[null,null,"roof32",null,1.4144984694659531E-2,null,null,null,null,"Extraction"]
[null,null,"roof33",null,4.8222213501113526E-7,null,null,"Persons per sleeping rooms",null,7.096057097112525E-2]
[null,null,"roof34",null,1.4530971391130206E-3,null,null,"floor11",null,9.0062239473383422E-3,null,null,"Communalities"]
[null,null,"roof35",null,0.16407336139931891,null,null,"floor21",null,0.31405075957729695,null,null,null,null,"Extraction"]
[null,null,"roof36",null,4.4436606081979923E-3,null,null,"floor31",null,0.28804748118141521,null,null,"Persons per sleeping rooms",null,4.0586116198690035E-2]
[null,null,"roof96",null,0.12735570514031896,null,null,"floor32",null,5.3650470102364586E-4,null,null,"floor11",null,3.2306470081687778E-2]
[null,null,"wall21",null,1.1997642880437564E-2,null,null,"floor33",null,4.9835661995642922E-3,null,null,"floor21",null,0.36930336918684081]
[null,null,"wall22",null,3.6564657077136721E-2,null,null,"floor34",null,7.1364102867934001E-2,null,null,"floor31",null,0.30537857032720012]
[null,null,"wall23",null,6.5292325846767274E-7,null,null,"floor96",null,1.3684591433622911E-5,null,null,"floor32",null,2.2402646020000961E-3]
[null,null,"wall24",null,2.8667062034549506E-2,null,null,"roof21",null,4.5736345836257334E-5,null,null,"floor33",null,7.3902755516163363E-2]
[null,null,"wall25",null,9.9205332813845099E-3,null,null,"roof23",null,2.9524650903096212E-2,null,null,"floor34",null,1.5792172156186557E-2]
[null,null,"wall26",null,4.7105576999234587E-2,null,null,"roof31",null,3.4982207106418479E-2,null,null,"floor96",null,5.3155259391577792E-5]
[null,null,"wall31",null,5.0533138122773665E-2,null,null,"roof33",null,2.2558595200568234E-3,null,null,"roof21",null,1.1025769406749321E-2]
[null,null,"wall32",null,1.8379622708952287E-2,null,null,"roof34",null,4.2216418867370995E-3,null,null,"roof23",null,2.3465995443426625E-2]
[null,null,"wall33",null,5.7498618112626701E-3,null,null,"roof35",null,0.15300492513654176,null,null,"roof31",null,6.3518814975944818E-2]
[null,null,"wall34",null,2.4282039289015393E-2,null,null,"roof36",null,2.9401602698428558E-3,null,null,"roof32",null,1.3630662002356339E-2]
[null,null,"wall35",null,7.9173017389657323E-5,null,null,"roof96",null,0.13588237108655635,null,null,"roof33",null,5.0323079576083268E-4]
[null,null,"wall36",null,7.711937419882274E-2,null,null,"wall22",null,1.2550890355670221E-2,null,null,"roof34",null,1.0983600656713256E-2]
[null,null,"wall96",null,9.9805706274589782E-3,null,null,"wall23",null,1.501012417633611E-4,null,null,"roof35",null,0.14429267037642507]
[null,null,"fuel1",null,0.50437330086772658,null,null,"wall24",null,0.10515143310947518,null,null,"roof36",null,9.2853579874484296E-3]
[null,null,"fuel2",null,1.2687288702993515E-3,null,null,"wall25",null,6.9059056721273463E-3,null,null,"roof96",null,0.14678775590176421]
[null,null,"fuel6",null,3.2111822651070356E-2,null,null,"wall26",null,3.2335852453616899E-2,null,null,"wall21",null,1.3778077098900781E-2]
[null,null,"fuel7",null,3.529785015791122E-3,null,null,"wall31",null,4.4633005777430117E-2,null,null,"wall22",null,2.9692485530451836E-2]
[null,null,"fuel8",null,0.44788440228270499,null,null,"wall32",null,1.2168624413194816E-4,null,null,"wall24",null,2.3959077658997647E-3]
[null,null,"Household cooks at open sky",null,2.1172899331237963E-2,null,null,"wall33",null,1.231893219799305E-3,null,null,"wall25",null,7.9798973301519159E-3]
[null,null,"Household cooks on open owen",null,6.0810034131814298E-3,null,null,"wall34",null,3.1340893474920391E-3,null,null,"wall26",null,5.2888998694006366E-2]
[null,null,"Household has chimney",null,0.49253528062293606,null,null,"wall35",null,1.8361639170072488E-3,null,null,"wall31",null,1.6017381124411503E-2]
[null,null,"chimney",null,1.2974411979124879E-3,null,null,"wall36",null,5.5870080390872524E-2,null,null,"wall32",null,2.7554429355755264E-2]
[null,null,"Household has hood",null,5.4224323349151629E-2,null,null,"wall96",null,1.2870679276976145E-2,null,null,"wall33",null,1.1704759230836321E-2]
[null,null,"Household cooks in owm house",null,1.6827381995883479E-2,null,null,"fuel1",null,0.39895053807497644,null,null,"wall34",null,9.6650833516795293E-2]
[null,null,"Household cooks in separate house",null,2.4835281979265797E-3,null,null,"fuel2",null,5.2814990025620755E-5,null,null,"wall36",null,8.4513287972606321E-2]
[null,null,"Household cooks outside house",null,1.5110160571232351E-2,null,null,"fuel6",null,5.4051368267104542E-2,null,null,"wall96",null,1.3331311226320848E-2]
[null,null,"Household member owns: asset9a",null,4.8960970434258927E-2,null,null,"fuel7",null,1.5175709738027668E-2,null,null,"fuel1",null,0.58937184978895152]
[null,null,"Household member owns: asset9b",null,6.2922697733553107E-2,null,null,"fuel8",null,0.32780442065248344,null,null,"fuel2",null,6.3315517876725994E-3]
[null,null,"Household member owns: asset9c",null,0.1183024038958172,null,null,"Household cooks at open sky",null,4.6584210853770529E-3,null,null,"fuel6",null,2.0862590550295636E-2]
[null,null,"Household member owns: asset9d",null,0.22338008012945995,null,null,"Household cooks on open owen",null,1.2127612651121585E-4,null,null,"fuel7",null,1.2960133249322176E-3]
[null,null,"Household member owns: asset9e",null,0.22392601455718522,null,null,"Household has chimney",null,0.42133399886570178,null,null,"fuel8",null,0.50546037795942667]
[null,null,"Household member owns: asset9f",null,0.41745158073122263,null,null,"chimney",null,4.4996884036030876E-4,null,null,"Household cooks at open sky",null,2.4799288966975412E-2]
[null,null,"Household member owns: asset9g",null,0.40238196549397748,null,null,"Household has hood",null,1.42884741583745E-2,null,null,"Household cooks on open owen",null,8.1875557355899926E-3]
[null,null,"Household member owns: asset9h",null,0.1795970226858952,null,null,"Household cooks in owm house",null,1.0488464359863331E-2,null,null,"Household has chimney",null,0.55281848987326132]
[null,null,"Household member owns: asset9i",null,0.20776355914043784,null,null,"Household cooks in separate house",null,3.1261023987401711E-3,null,null,"chimney",null,2.2826307231778799E-3]
[null,null,"Household member owns: asset9j",null,0.27242227309035011,null,null,"Household cooks outside house",null,7.8289825266087062E-3,null,null,"Household has hood",null,4.2681321623867279E-2]
[null,null,"Household member owns: asset9k",null,3.7940533035494613E-2,null,null,"Household member owns: asset9b",null,3.9516791800677076E-2,null,null,"Household cooks in owm house",null,1.2187964070742073E-2]
[null,null,"Household member owns: asset10a",null,9.9306416521960608E-2,null,null,"Household member owns: asset9c",null,2.6980252020248497E-2,null,null,"Household cooks in separate house",null,2.2359455092666632E-3]
[null,null,"Household member owns: asset10b",null,8.9533475929983827E-2,null,null,"Household member owns: asset9d",null,0.16883669216682001,null,null,"Household cooks outside house",null,9.6176079696781974E-3]
[null,null,"Household member owns: asset10c",null,1.1254746133993486E-2,null,null,"Household member owns: asset9e",null,0.16549088352875382,null,null,"Household member owns: asset9a",null,3.7324039692689923E-2]
[null,null,"Household member owns: asset10d",null,1.9832484842633854E-3,null,null,"Household member owns: asset9f",null,0.25546011578573485,null,null,"Household member owns: asset9b",null,8.2068347079460646E-2]
[null,null,"Household member owns: asset10e",null,0.22327006474402139,null,null,"Household member owns: asset9g",null,0.29331360216178387,null,null,"Household member owns: asset9c",null,0.12163169003157621]
[null,null,"Household member owns: asset10f",null,1.6608418420114074E-3,null,null,"Household member owns: asset9h",null,0.19313856268311769,null,null,"Household member owns: asset9d",null,0.21145280824944357]
[null,null,"Household member owns: asset10g",null,3.3067400572930621E-3,null,null,"Household member owns: asset9i",null,0.19420904285837706,null,null,"Household member owns: asset9e",null,0.20168568998474895]
[null,null,"Household member owns dwelling",null,2.9804735387568084E-2,null,null,"Household member owns: asset9j",null,0.27526888509065722,null,null,"Household member owns: asset9f",null,0.43548919764241795]
[null,null,"Household member rents dwelling",null,4.0076028275162203E-3,null,null,"Household member owns: asset9k",null,4.4076087045623186E-2,null,null,"Household member owns: asset9g",null,0.39066518282107526]
[null,null,"Dwelling owns to family",null,3.4415271627041041E-2,null,null,"Household member owns: asset10a",null,6.3352620404066626E-2,null,null,"Household member owns: asset9h",null,0.12369262472933649]
[null,null,"Dwelling is free",null,6.4609616193959819E-3,null,null,"Household member owns: asset10b",null,4.602873953580424E-2,null,null,"Household member owns: asset9i",null,0.17716031431328078]
[null,null,null,null,null,null,null,"Household member owns: asset10c",null,1.3780246306223362E-2,null,null,"Household member owns: asset9j",null,0.26300020133546065]
[null,null,null,null,null,null,null,"Household member owns: asset10d",null,4.212635006740858E-4,null,null,"Household member owns: asset9k",null,1.2746842019161764E-2]
[null,null,"Total Variance Explained",null,null,null,null,"Household member owns: asset10e",null,0.18331161528399073,null,null,"Household member owns: asset10a",null,7.9563826954412636E-2]
[null,null,"Component",null,"Extraction Sums of Squared Loadings",null,null,"Household member owns: asset10f",null,2.4868731544535577E-3,null,null,"Household member owns: asset10b",null,0.1346991976364208]
[null,null,null,null,"Total","% of Variance","Cumulative %","Household member owns: asset10g",null,3.1766836521103558E-3,null,null,"Household member owns: asset10c",null,4.5977427710885204E-3]
[null,null,"1",null,5.8845849123882878,9.0532075575204427,9.0532075575204427,"Household member owns dwelling",null,8.2470031152033288E-2,null,null,"Household member owns: asset10d",null,4.1970363721376648E-3]
[null,null,null,null,null,null,null,"Household member rents dwelling",null,3.6123817820430136E-2,null,null,"Household member owns: asset10e",null,0.25885555141605893]
[null,null,null,null,null,null,null,"Dwelling owns to family",null,0.14626111918440157,null,null,"Household member owns: asset10f",null,8.6888176824046134E-3]
[null,null,"Component Score Coefficient Matrix",null,null,null,null,"Dwelling is free",null,1.0244271033444036E-4,null,null,"Household member owns: asset10g",null,4.2118830382654902E-3]
[null,null,null,null,"Component",null,null,"Small land",null,1.1409807136179207E-7,null,null,"Household member owns dwelling",null,1.2626881038414193E-2]
[null,null,null,null,"1",null,null,"Medium land",null,2.6744345820940571E-4,null,null,"Household member rents dwelling",null,9.2479809953955976E-5]
[null,null,"Persons per sleeping rooms",null,-3.3977080960372733E-2,null,null,"Big land",null,3.1779674310307197E-3,null,null,"Dwelling owns to family",null,6.2631459531174555E-7]
[null,null,"floor11",null,-3.4567444652465758E-2,null,null,"cattle1",null,3.9493982966378599E-2,null,null,"Dwelling is free",null,1.5266317218579753E-2]
[null,null,"floor21",null,-0.10365811406373567,null,null,"cattle5",null,2.744940015341099E-3,null,null,"Small land",null,5.1428304962721674E-2]
[null,null,"floor31",null,0.10239040701598902,null,null,"cow1",null,3.481158262902341E-2,null,null,"Medium land",null,1.6140335219348395E-3]
[null,null,"floor32",null,1.7774829696337465E-3,null,null,"cow5",null,1.2488395930876737E-3,null,null,"Big land",null,1.2021926707978796E-3]
[null,null,"floor33",null,2.0223170618305555E-2,null,null,"horse1",null,7.1513843292128985E-3,null,null,"cattle1",null,0.23986529929039382]
[null,null,"floor34",null,-3.872601897449951E-2,null,null,"goat1",null,3.572292813200254E-3,null,null,"cattle5",null,3.43821246021251E-3]
[null,null,"floor96",null,-9.9736813766656933E-4,null,null,"sheep1",null,3.3911697112658549E-4,null,null,"cattle10",null,1.7277691145626459E-3]
[null,null,"roof21",null,3.0693221089475478E-3,null,null,"sheep10",null,1.2235235858866489E-4,null,null,"cow1",null,0.17091396491116143]
[null,null,"roof23",null,-3.3878714004852602E-2,null,null,"sheep30",null,1.4016761372709087E-2,null,null,"cow5",null,4.7588409028248536E-4]
[null,null,"roof31",null,-2.9919484903447438E-2,null,null,"chicken1",null,1.5228329559706564E-3,null,null,"cow10",null,6.4087972233472655E-4]
[null,null,"roof32",null,-2.0210888539358641E-2,null,null,"chicken10",null,5.6000553965712225E-7,null,null,"horse1",null,7.8489884881831465E-2]
[null,null,"roof33",null,-1.1800699104719449E-4,null,null,"chicken30",null,9.5946787868025928E-4,null,null,"goat1",null,7.1610443612633622E-3]
[null,null,"roof34",null,-6.4778589880063161E-3,null,null,null,null,null,null,null,"sheep1",null,3.3661875203677818E-2]
[null,null,"roof35",null,6.8834031127371284E-2,null,null,null,null,null,null,null,"sheep10",null,2.6572610244189027E-2]
[null,null,"roof36",null,1.1328035643645954E-2,null,null,"Total Variance Explained",null,null,null,null,"sheep30",null,6.6274715355772321E-3]
[null,null,"roof96",null,-6.0644772116060085E-2,null,null,"Component",null,"Extraction Sums of Squared Loadings",null,null,"chicken1",null,0.14127274709907953]
[null,null,"wall21",null,-1.861367519949263E-2,null,null,null,null,"Total","% of Variance","Cumulative %","chicken10",null,2.4236572496637515E-3]
[null,null,"wall22",null,-3.2494878572613135E-2,null,null,"1",null,5.0001787741052208,6.4937386676691178,6.4937386676691178,"chicken30",null,6.3689708162664468E-8]
[null,null,"wall23",null,-1.3731413192979939E-4]
[null,null,"wall24",null,-2.8772378127330019E-2]
[null,null,"wall25",null,-1.6925896281184096E-2,null,null,"Component Score Coefficient Matrix",null,null,null,null,"Total Variance Explained"]
[null,null,"wall26",null,-3.6882498208646412E-2,null,null,null,null,"Component",null,null,"Component",null,"Extraction Sums of Squared Loadings"]
[null,null,"wall31",null,3.8200786147716805E-2,null,null,null,null,"1",null,null,null,null,"Total","% of Variance","Cumulative %"]
[null,null,"wall32",null,-2.3038407837130421E-2,null,null,"Persons per sleeping rooms",null,-5.3274946035910459E-2,null,null,"1",null,6.7449304807651007,8.4311631009563772,8.4311631009563772]
[null,null,"wall33",null,1.2885844010145371E-2,null,null,"floor11",null,-1.8979546833395703E-2]
[null,null,"wall34",null,2.648053436986229E-2,null,null,"floor21",null,-0.11207645660428045]
[null,null,"wall35",null,-1.5120730204708185E-3,null,null,"floor31",null,0.10733627236191964,null,null,"Component Score Coefficient Matrix"]
[null,null,"wall36",null,-4.7191731739418374E-2,null,null,"floor32",null,-4.6323485957860009E-3,null,null,null,null,"Component"]
[null,null,"wall96",null,-1.6977035320455119E-2,null,null,"floor33",null,1.4118370792185916E-2,null,null,null,null,"1"]
[null,null,"fuel1",null,0.12068692182947378,null,null,"floor34",null,-5.3426210765939251E-2,null,null,"Persons per sleeping rooms",null,-2.9868352587216904E-2]
[null,null,"fuel2",null,6.0529707784258173E-3,null,null,"floor96",null,-7.3982735569505162E-4,null,null,"floor11",null,-2.6648163004218298E-2]
[null,null,"fuel6",null,-3.0452057724372473E-2,null,null,"roof21",null,-1.3525246825390926E-3,null,null,"floor21",null,-9.0097793887459671E-2]
[null,null,"fuel7",null,-1.0096208102369067E-2,null,null,"roof23",null,-3.4364248700709601E-2,null,null,"floor31",null,8.1929782318344052E-2]
[null,null,"fuel8",null,-0.1137279301867798,null,null,"roof31",null,-3.7405724522039122E-2,null,null,"floor32",null,7.0173345279177547E-3]
[null,null,"Household cooks at open sky",null,-2.4727165316267889E-2,null,null,"roof33",null,-9.498838272128338E-3,null,null,"floor33",null,4.0304435053022787E-2]
[null,null,"Household cooks on open owen",null,-1.3251705924087025E-2,null,null,"roof34",null,-1.2994368033616586E-2,null,null,"floor34",null,-1.8631312792580883E-2]
[null,null,"Household has chimney",null,-0.11926220604895418,null,null,"roof35",null,7.822889092806759E-2,null,null,"floor96",null,-1.0809252031558651E-3]
[null,null,"chimney",null,-6.1210793305290197E-3,null,null,"roof36",null,1.0844261212844158E-2,null,null,"roof21",null,1.556779036895755E-2]
[null,null,"Household has hood",null,-3.9571383710013883E-2,null,null,"roof96",null,-7.3721816230461396E-2,null,null,"roof23",null,-2.2711301001402836E-2]
[null,null,"Household cooks in owm house",null,2.2044103575095939E-2,null,null,"wall22",null,-2.2405350159393763E-2,null,null,"roof31",null,-3.7365751033027722E-2]
[null,null,"Household cooks in separate house",null,-8.4687383228279293E-3,null,null,"wall23",null,-2.4502286313969131E-3,null,null,"roof32",null,-1.7309359446543524E-2]
[null,null,"Household cooks outside house",null,-2.0889050787810427E-2,null,null,"wall24",null,-6.485180465380691E-2,null,null,"roof33",null,3.3258765680490099E-3]
[null,null,"Household member owns: asset9a",null,3.7601846713288659E-2,null,null,"wall25",null,-1.6619761562391748E-2,null,null,"roof34",null,1.5537991852345275E-2]
[null,null,"Household member owns: asset9b",null,4.2627300757490855E-2,null,null,"wall26",null,-3.596305896466015E-2,null,null,"roof35",null,5.6317667267661596E-2]
[null,null,"Household member owns: asset9c",null,5.844952024785454E-2,null,null,"wall31",null,4.2251539265844962E-2,null,null,"roof36",null,1.4286368507738179E-2]
[null,null,"Household member owns: asset9d",null,8.0316798218678973E-2,null,null,"wall32",null,-2.2061508820464181E-3,null,null,"roof96",null,-5.6802498343700707E-2]
[null,null,"Household member owns: asset9e",null,8.0414884286391791E-2,null,null,"wall33",null,7.0194163070170582E-3,null,null,"wall21",null,-1.7402707771095139E-2]
[null,null,"Household member owns: asset9f",null,0.10979617759688409,null,null,"wall34",null,1.1196187283006448E-2,null,null,"wall22",null,-2.5547346532470712E-2]
[null,null,"Household member owns: asset9g",null,0.10779619215684286,null,null,"wall35",null,-8.5697902439312683E-3,null,null,"wall24",null,-7.257007464615068E-3]
[null,null,"Household member owns: asset9h",null,7.2016785482714743E-2,null,null,"wall36",null,-4.7272015127635195E-2,null,null,"wall25",null,-1.3244061051293969E-2]
[null,null,"Household member owns: asset9i",null,7.7458459293094084E-2,null,null,"wall96",null,-2.2688991999352613E-2,null,null,"wall26",null,-3.4096138356014175E-2]
[null,null,"Household member owns: asset9j",null,8.8696293626413916E-2,null,null,"fuel1",null,0.12632054635644649,null,null,"wall31",null,1.8763691196771553E-2]
[null,null,"Household member owns: asset9k",null,3.3100601066971713E-2,null,null,"fuel2",null,1.4534264817614227E-3,null,null,"wall32",null,-2.4610375088342976E-2]
[null,null,"Household member owns: asset10a",null,5.3551645658537685E-2,null,null,"fuel6",null,-4.6496237817868442E-2,null,null,"wall33",null,1.6039977860116642E-2]
[null,null,"Household member owns: asset10b",null,5.0848352790180157E-2,null,null,"fuel7",null,-2.4637065236472713E-2,null,null,"wall34",null,4.6091975679980204E-2]
[null,null,"Household member owns: asset10c",null,1.8028185486052797E-2,null,null,"fuel8",null,-0.11450431969717656,null,null,"wall36",null,-4.3100769238948886E-2]
[null,null,"Household member owns: asset10d",null,-7.5678537659797035E-3,null,null,"Household cooks at open sky",null,-1.3650037335066549E-2,null,null,"wall96",null,-1.7118233887655172E-2]
[null,null,"Household member owns: asset10e",null,8.0297017646199648E-2,null,null,"Household cooks on open owen",null,-2.2024300630341374E-3,null,null,"fuel1",null,0.11381964234117019]
[null,null,"Household member owns: asset10f",null,6.9254548913747485E-3,null,null,"Household has chimney",null,-0.12981584973154481,null,null,"fuel2",null,1.1797163648260054E-2]
[null,null,"Household member owns: asset10g",null,9.7720165595388628E-3,null,null,"chimney",null,-4.242342112443228E-3,null,null,"fuel6",null,-2.1414435941806989E-2]
[null,null,"Household member owns dwelling",null,2.9337749853838156E-2,null,null,"Household has hood",null,-2.3906026394612975E-2,null,null,"fuel7",null,-5.33736932807404E-3]
[null,null,"Household member rents dwelling",null,-1.0757875235249403E-2,null,null,"Household cooks in owm house",null,2.0481908479196533E-2,null,null,"fuel8",null,-0.10540618160792807]
[null,null,"Dwelling owns to family",null,-3.1525339110755751E-2,null,null,"Household cooks in separate house",null,-1.1181911937169296E-2,null,null,"Household cooks at open sky",null,-2.3347594223696273E-2]
[null,null,"Dwelling is free",null,-1.3659435339806621E-2,null,null,"Household cooks outside house",null,-1.76956748488378E-2,null,null,"Household cooks on open owen",null,-1.3415277384241758E-2]
[null,null,null,null,null,null,null,"Household member owns: asset9b",null,3.9756240325557635E-2,null,null,"Household has chimney",null,-0.11023355216089353]
[null,null,null,null,null,null,null,"Household member owns: asset9c",null,3.2850158462664009E-2,null,null,"chimney",null,-7.0833769090765247E-3]
[null,null,"Component Score Covariance Matrix",null,null,null,null,"Household member owns: asset9d",null,8.2176546377390941E-2,null,null,"Household has hood",null,-3.0629608910652525E-2]
[null,null,"Component",null,"1",null,null,"Household member owns: asset9e",null,8.1358232520026594E-2,null,null,"Household cooks in owm house",null,1.6367716902419623E-2]
[null,null,"1",null,1,null,null,"Household member owns: asset9f",null,0.10108251063442908,null,null,"Household cooks in separate house",null,-7.0105667691269906E-3]
[null,null,null,null,null,null,null,"Household member owns: asset9g",null,0.10831299617976466,null,null,"Household cooks outside house",null,-1.453972047901907E-2]
[null,null,null,null,null,null,null,"Household member owns: asset9h",null,8.7891922758424321E-2,null,null,"Household member owns: asset9a",null,2.8642890551641147E-2]
[null,null,null,null,null,null,null,"Household member owns: asset9i",null,8.8135158883167891E-2,null,null,"Household member owns: asset9b",null,4.2472748444601617E-2]
[null,null,null,null,null,null,null,"Household member owns: asset9j",null,0.10492839496854477,null,null,"Household member owns: asset9c",null,5.1706589447711081E-2]
[null,null,null,null,null,null,null,"Household member owns: asset9k",null,4.1987110093192843E-2,null,null,"Household member owns: asset9d",null,6.817564427765252E-2]
[null,null,null,null,null,null,null,"Household member owns: asset10a",null,5.03380930603518E-2,null,null,"Household member owns: asset9e",null,6.6582494947588208E-2]
[null,null,null,null,null,null,null,"Household member owns: asset10b",null,4.2907084829261595E-2,null,null,"Household member owns: asset9f",null,9.7838822114369256E-2]
[null,null,null,null,null,null,null,"Household member owns: asset10c",null,2.3477019349644791E-2,null,null,"Household member owns: asset9g",null,9.2666951455265101E-2]
[null,null,null,null,null,null,null,"Household member owns: asset10d",null,-4.1047941623788622E-3,null,null,"Household member owns: asset9h",null,5.2142809162588906E-2]
[null,null,null,null,null,null,null,"Household member owns: asset10e",null,8.5626749894877674E-2,null,null,"Household member owns: asset9i",null,6.2403039447299788E-2]
[null,null,null,null,null,null,null,"Household member owns: asset10f",null,9.9733551597877418E-3,null,null,"Household member owns: asset9j",null,7.6032726201878356E-2]
[null,null,null,null,null,null,null,"Household member owns: asset10g",null,1.1272012244106322E-2,null,null,"Household member owns: asset9k",null,1.673878086484935E-2]
[null,null,null,null,null,null,null,"Household member owns dwelling",null,5.7433138192475044E-2,null,null,"Household member owns: asset10a",null,4.1819646196901948E-2]
[null,null,null,null,null,null,null,"Household member rents dwelling",null,-3.8011174545221925E-2,null,null,"Household member owns: asset10b",null,5.4413295143856857E-2]
[null,null,null,null,null,null,null,"Dwelling owns to family",null,-7.6485465459794219E-2,null,null,"Household member owns: asset10c",null,1.0052980897346082E-2]
[null,null,null,null,null,null,null,"Dwelling is free",null,2.0242073518862793E-3,null,null,"Household member owns: asset10d",null,9.6049230230811286E-3]
[null,null,null,null,null,null,null,"Small land",null,6.7554396655470646E-5,null,null,"Household member owns: asset10e",null,7.5431242914721128E-2]
[null,null,null,null,null,null,null,"Medium land",null,-3.2706227813619009E-3,null,null,"Household member owns: asset10f",null,1.3819835209317949E-2]
[null,null,null,null,null,null,null,"Big land",null,1.1274289667921057E-2,null,null,"Household member owns: asset10g",null,9.6218963329803547E-3]
[null,null,null,null,null,null,null,"cattle1",null,-3.97447651482572E-2,null,null,"Household member owns dwelling",null,1.6659830044355284E-2]
[null,null,null,null,null,null,null,"cattle5",null,-1.0478060385758426E-2,null,null,"Household member rents dwelling",null,-1.4257585560688347E-3]
[null,null,null,null,null,null,null,"cow1",null,-3.7314390467331961E-2,null,null,"Dwelling owns to family",null,-1.1733262539050721E-4]
[null,null,null,null,null,null,null,"cow5",null,-7.0675322250547817E-3,null,null,"Dwelling is free",null,-1.8318489646188065E-2]
[null,null,null,null,null,null,null,"horse1",null,-1.6912566882297812E-2,null,null,"Small land",null,-3.3622006475754675E-2]
[null,null,null,null,null,null,null,"goat1",null,-1.1953304770681001E-2,null,null,"Medium land",null,-5.9563306350603196E-3]
[null,null,null,null,null,null,null,"sheep1",null,-3.6828940918461448E-3,null,null,"Big land",null,-5.1405496740265086E-3]
[null,null,null,null,null,null,null,"sheep10",null,-2.2121809119917801E-3,null,null,"cattle1",null,-7.2611638077192203E-2]
[null,null,null,null,null,null,null,"sheep30",null,-2.3677634250807163E-2,null,null,"cattle5",null,-8.6933842730218831E-3]
[null,null,null,null,null,null,null,"chicken1",null,-7.8044194263792313E-3,null,null,"cattle10",null,-6.1626198056781347E-3]
[null,null,null,null,null,null,null,"chicken10",null,1.4966168461019768E-4,null,null,"cow1",null,-6.1293059031154284E-2]
[null,null,null,null,null,null,null,"chicken30",null,6.1948342065151554E-3,null,null,"cow5",null,-3.2342464867733387E-3]
[null,null,null,null,null,null,null,null,null,null,null,null,"cow10",null,-3.7532784692183418E-3]
[null,null,null,null,null,null,null,null,null,null,null,null,"horse1",null,-4.1536449269183075E-2]
[null,null,null,null,null,null,null,"Component Score Covariance Matrix",null,null,null,null,"goat1",null,-1.2546156605346836E-2]
[null,null,null,null,null,null,null,"Component",null,"1",null,null,"sheep1",null,-2.7201426188984336E-2]
[null,null,null,null,null,null,null,"1",null,1,null,null,"sheep10",null,-2.4167939826417802E-2]
[null,null,null,null,null,null,null,null,null,null,null,null,"sheep30",null,-1.2069699505321572E-2]
[null,null,null,null,null,null,null,null,null,null,null,null,"chicken1",null,-5.5725210453003243E-2]
[null,null,null,null,null,null,null,null,null,null,null,null,"chicken10",null,-7.2989119306032949E-3]
[null,null,null,null,null,null,null,null,null,null,null,null,"chicken30",null,-3.7415982315378372E-5]
[]
[]
[null,null,null,null,null,null,null,null,null,null,null,null,"Component Score Covariance Matrix"]
[null,null,null,null,null,null,null,null,null,null,null,null,"Component",null,"1"]
[null,null,null,null,null,null,null,null,null,null,null,null,"1",null,1]
[]
[]
[]
[]
[]
[]
[]
[]
[]
[]
[]
[]
[]
[]
[]
[]
[]
[]
[]
[]
[]
[]
[]
[]
[]
[]
[]
[]
[]
[]
[]
[]
[]
[]
[]
[]
[]
[]
[]
[]
[]
[]
[]
[]
[]
[]
[]
[]
[]
[]
[]
[]
[]
[]
[]
[]
[]
[]
[]
[]
[]
[]
[]
[]
[]
[]
[]
[]
[]
[]
[]
[]
[]
[]
[]
[]
[]
[]
[]
[]
[]
[]
[]
[]
[]
[]
[]
[]
[]
[]
[]
[]
[]
[]
[]
[]
[]
[]
[]
[]
[]
[]
[]
[]
[]
[]
[]
[]
[]
[]
[]
[]
[]
[]
[]
[]
[]
[]
[]
[]
[]
[]
[]
[]
[]
[]
[]
[]
[]
[]
[]
[]
[]
[]
[]
[]
[]
[]
[]
[]
[]
[]
[]
[]
[]
[]
[]
[]
[]
[]
[]
[]
[]
[]
[]
[]
[]
[]
[]
[]
[]
[]
[]
[]
[]
[]
[]
[]
[]
[]
[]
[]
[]
[]
[]
[]
[]
[]
[]
[]
[]
[]
[]
[]
[]
[]
[]
[]
[]
[]
[]
[]
[]
[]
[]
[]
[]
[]
[]
[]
[]
[]
[]
[]
[]
[]
[]
[]
[]
[]
[]
[]
[]
[]
[]
[]
[]
[]
[]
[]
[]
[]
[]
[]
[]
[]
[]
[]
[]
[]
[]
[]
[]
[]
[]
[]
[]
[]
[]
[]
[]
[]
[]
[]
[]
[]
[]
[]
[]
[]
[]
[]
[]
[]
[]
[]
[]
[]
[]
[]
[]
[]
[]
[]
[]
[]
[]
[]
[]
[]
[]
[]
[]
[]
[]
[]
[]
[]
[]
[]
[]
[]
[]
[]
[]
[]
[]
[]
[]
[]
[]
[]
[]
[]
[]
[]
[]
[]
[]
[]
[]
[]
[]
[]
[]
[]
[]
[]
[]
[]
[]
[]
[]
[]
[]
[]
[]
[]
[]
[]
[]
[]
[]
[]
[]
[]
[]
[]
[]
[]
[]
[]
[]
[]
[]
[]
[]
[]
[]
[]
[]
[]
[]
[]
[]
[]
[]
[]
[]
[]
[]
[]
[]
[]
[]
[]
[]
[]
[]
[]
[]
["MICS06"]
["Montenegro",null,"Count"]
["W_text_t","",2358]
["W_text_i","",2358]
["S_text_s","Ratio of Shared improved based on:",2358]
["S_text_i","Ratio of Improved latrines based on:",2358]
["Urban/Rural","Urban",1490]
[null,"Rural",868]
[null,"Missing",0]
["2006"]
[]
["Sub-national region names","Weighted population"]
[{"$f":"R15","v":"Central"},{"$f":"BR122+BR123","v":{"$error":"#VALUE!"}}]
[{"$f":"S15","v":"North"},{"$f":"BS122+BS123","v":{"$error":"#VALUE!"}}]
[{"$f":"T15","v":"South"},{"$f":"BT122+BT123","v":{"$error":"#VALUE!"}}]
[{"$f":"U15","v":0},{"$f":"BU122+BU123","v":0}]
[{"$f":"V15","v":0},{"$f":"BV122+BV123","v":0}]
[{"$f":"W15","v":0},{"$f":"BW122+BW123","v":0}]
[{"$f":"X15","v":0},{"$f":"BX122+XR123","v":0}]
[{"$f":"Y15","v":0},{"$f":"BY122+BY123","v":0}]
[{"$f":"Z15","v":0},{"$f":"BZ122+BZ123","v":0}]
[{"$f":"AA15","v":0},{"$f":"CA122+CA123","v":0}]
[{"$f":"AB15","v":0},{"$f":"CB122+CB123","v":0}]
[{"$f":"AC15","v":0},{"$f":"CC122+CC123","v":0}]
[{"$f":"AD15","v":0},{"$f":"CD122+CD123","v":0}]
[{"$f":"AE15","v":0},{"$f":"CE122+CE123","v":0}]
[{"$f":"AF15","v":0},{"$f":"CF122+CF123","v":0}]
[{"$f":"AG15","v":0},{"$f":"CG122+CG123","v":0}]
[{"$f":"AH15","v":0},{"$f":"CH122+CH123","v":0}]
[{"$f":"AI15","v":0},{"$f":"CI122+CI123","v":0}]
[{"$f":"AJ15","v":0},{"$f":"CJ122+CJ123","v":0}]
[{"$f":"AK15","v":0},{"$f":"CK122+CK123","v":0}]
[{"$f":"AL15","v":0},{"$f":"CL122+CL123","v":0}]
[{"$f":"AM15","v":0},{"$f":"CM122+CM123","v":0}]
[{"$f":"AN15","v":0},{"$f":"CN122+CN123","v":0}]
[{"$f":"AO15","v":0},{"$f":"CO122+CO123","v":0}]
[{"$f":"AP15","v":0},{"$f":"CP122+CP123","v":0}]
[{"$f":"AQ15","v":0},{"$f":"CQ122+CQ123","v":0}]
[{"$f":"AR15","v":0},{"$f":"CR122+CR123","v":0}]
[{"$f":"AS15","v":0},{"$f":"CS122+CS123","v":0}]
[{"$f":"AT15","v":0},{"$f":"CT122+CT123","v":0}]
[{"$f":"AU15","v":0},{"$f":"CU122+CU123","v":0}]
[{"$f":"AV15","v":0},{"$f":"CV122+CV123","v":0}]
[{"$f":"AW15","v":0},{"$f":"CW122+CW123","v":0}]
[{"$f":"AX15","v":0},{"$f":"CX122+CX123","v":0}]
[{"$f":"AY15","v":0},{"$f":"CY122+CY123","v":0}]
[]
[{"$f":"34-COUNTIF(A1037:A1071,\"0\")","v":3},"Sub-regions"]

{"sheet":"MICS13","index":5,"n_rows":1072,"n_cols":72,"rows_kept":1072,"cut":false,"hidden":false,"merged":[[551,2,551,3],[551,7,551,8],[551,12,551,13],[552,2,552,3],[552,7,552,8],[552,12,552,13],[549,2,549,3],[549,7,549,8],[549,12,549,13],[550,2,550,3],[550,7,550,8],[550,12,550,13],[547,2,547,3],[547,7,547,8],[547,12,547,13],[548,2,548,3],[548,7,548,8],[548,12,548,13],[545,2,545,3],[545,7,545,8],[545,12,545,13],[546,2,546,4],[546,7,546,8],[546,12,546,13],[543,2,543,3],[543,7,543,8],[543,12,543,13],[544,2,544,3],[544,7,544,8],[544,12,544,13],[541,2,541,3],[541,7,541,8],[541,12,541,13],[542,2,542,3],[542,7,542,8],[542,12,542,13],[539,2,539,3],[539,7,539,8],[539,12,539,13],[540,2,540,3],[540,7,540,8],[540,12,540,13],[537,2,537,3],[537,7,537,9],[537,12,537,13],[538,2,538,3],[538,7,538,8],[538,12,538,13],[535,2,535,3],[535,7,535,8],[535,12,535,13],[536,2,536,3],[536,7,536,8],[536,12,536,13],[533,2,533,3],[533,7,533,8],[533,12,533,13],[534,2,534,3],[534,7,534,8],[534,12,534,13],[531,2,531,3],[531,7,531,8],[531,12,531,14],[532,2,532,3],[532,7,532,8],[532,12,532,13],[529,2,529,3],[529,7,529,8],[529,12,529,13],[530,2,530,3],[530,7,530,8],[530,12,530,13],[527,2,527,3],[527,7,527,8],[527,12,527,13],[528,2,528,3],[528,7,528,8],[528,12,528,13],[525,2,525,3],[525,7,525,8],[525,12,525,13],[526,2,526,3],[526,7,526,8],[526,12,526,13],[523,2,523,3],[523,7,523,8],[523,12,523,13],[524,2,524,3],[524,7,524,8],[524,12,524,13],[521,2,521,3],[521,7,521,8],[521,12,521,13],[522,2,522,3],[522,7,522,8],[522,12,522,13],[519,2,519,3],[519,7,519,8],[519,12,519,13],[520,2,520,3],[520,7,520,8],[520,12,520,13],[517,2,517,3],[517,7,517,8],[517,12,517,13],[518,2,518,3],[518,7,518,8],[518,12,518,13],[515,2,515,3],[515,7,515,8],[515,12,515,13],[516,2,516,3],[516,7,516,8],[516,12,516,13],[513,2,513,3],[513,7,513,8],[513,12,513,13],[514,2,514,3],[514,7,514,8],[514,12,514,13],[511,2,511,3],[511,7,511,8],[511,12,511,13],[512,2,512,3],[512,7,512,8],[512,12,512,13],[509,2,509,3],[509,7,509,8],[509,12,509,13],[510,2,510,3],[510,7,510,8],[510,12,510,13],[507,2,507,3],[507,7,507,8],[507,12,507,13],[508,2,508,3],[508,7,508,8],[508,12,508,13],[505,2,505,3],[505,7,505,8],[505,12,505,13],[506,2,506,3],[506,7,506,8],[506,12,506,13],[503,2,503,3],[503,7,503,8],[503,12,503,13],[504,2,504,3],[504,7,504,8],[504,12,504,13],[500,2,501,3],[500,7,500,8],[500,12,500,13],[501,7,501,8],[501,12,501,13],[502,2,502,3],[502,7,502,8],[502,12,502,13],[498,2,498,3],[498,7,498,8],[498,12,498,13],[499,2,499,4],[499,7,499,8],[499,12,499,13],[496,2,496,3],[496,7,496,8],[496,12,496,13],[497,2,497,3],[497,7,497,8],[497,12,497,13],[493,2,493,6],[493,7,493,9],[493,12,493,13],[494,2,495,3],[494,4,494,6],[494,7,495,8],[494,12,494,13],[495,12,495,13],[490,2,490,3],[490,7,490,8],[490,12,491,13],[491,2,491,3],[491,7,491,8],[492,2,492,3],[492,7,492,8],[492,12,492,13],[488,2,488,3],[488,7,489,8],[488,9,488,11],[488,12,488,13],[489,2,489,3],[489,12,489,14],[486,2,486,3],[486,7,486,8],[486,12,486,13],[487,2,487,3],[487,7,487,11],[487,12,487,13],[483,2,483,3],[483,7,483,8],[483,12,483,16],[484,2,484,3],[484,7,484,8],[484,12,485,13],[484,14,484,16],[485,2,485,3],[485,7,485,8],[481,2,481,3],[481,7,481,8],[481,12,481,13],[482,2,482,3],[482,7,482,8],[482,12,482,13],[479,2,479,3],[479,7,479,8],[479,12,479,13],[480,2,480,3],[480,7,480,8],[480,12,480,13],[477,2,477,3],[477,7,477,8],[477,12,477,13],[478,2,478,3],[478,7,478,8],[478,12,478,13],[475,2,475,3],[475,7,475,8],[475,12,475,13],[476,2,476,3],[476,7,476,8],[476,12,476,13],[473,2,473,3],[473,7,473,8],[473,12,473,13],[474,2,474,3],[474,7,474,8],[474,12,474,13],[471,2,471,3],[471,7,471,8],[471,12,471,13],[472,2,472,3],[472,7,472,8],[472,12,472,13],[469,2,469,3],[469,7,469,8],[469,12,469,13],[470,2,470,3],[470,7,470,8],[470,12,470,13],[467,2,467,3],[467,7,467,8],[467,12,467,13],[468,2,468,3],[468,7,468,8],[468,12,468,13],[465,2,465,3],[465,7,465,8],[465,12,465,13],[466,2,466,3],[466,7,466,8],[466,12,466,13],[463,2,463,3],[463,7,463,8],[463,12,463,13],[464,2,464,3],[464,7,464,8],[464,12,464,13],[461,2,461,3],[461,7,461,8],[461,12,461,13],[462,2,462,3],[462,7,462,8],[462,12,462,13],[459,2,459,3],[459,7,459,8],[459,12,459,13],[460,2,460,3],[460,7,460,8],[460,12,460,13],[457,2,457,3],[457,7,457,8],[457,12,457,13],[458,2,458,3],[458,7,458,8],[458,12,458,13],[455,2,455,3],[455,7,455,8],[455,12,455,13],[456,2,456,3],[456,7,456,8],[456,12,456,13],[453,2,453,3],[453,7,453,8],[453,12,453,13],[454,2,454,3],[454,7,454,8],[454,12,454,13],[451,2,451,3],[451,7,451,8],[451,12,451,13],[452,2,452,3],[452,7,452,8],[452,12,452,13],[449,2,449,3],[449,7,449,8],[449,12,449,13],[450,2,450,3],[450,7,450,8],[450,12,450,13],[447,2,447,4],[447,7,447,8],[447,12,447,13],[448,2,448,3],[448,7,448,8],[448,12,448,13],[445,2,445,3],[445,7,445,8],[445,12,445,13],[446,2,446,3],[446,7,446,8],[446,12,446,13],[443,2,443,3],[443,7,443,8],[443,12,443,13],[444,2,444,3],[444,7,444,9],[444,12,444,13],[441,2,441,3],[441,7,441,8],[441,12,441,13],[442,2,442,3],[442,7,442,8],[442,12,442,14],[439,2,439,3],[439,7,439,8],[439,12,439,13],[440,2,440,3],[440,7,440,8],[440,12,440,13],[437,2,437,3],[437,7,437,8],[437,12,437,13],[438,2,438,3],[438,7,438,8],[438,12,438,13],[435,2,435,3],[435,7,435,8],[435,12,435,13],[436,2,436,3],[436,7,436,8],[436,12,436,13],[433,2,433,3],[433,7,433,8],[433,12,433,13],[434,2,434,3],[434,7,434,8],[434,12,434,13],[431,2,431,3],[431,7,431,8],[431,12,431,13],[432,2,432,3],[432,7,432,8],[432,12,432,13],[429,2,429,3],[429,7,429,8],[429,12,429,13],[430,2,430,3],[430,7,430,8],[430,12,430,13],[427,2,427,3],[427,7,427,8],[427,12,427,13],[428,2,428,3],[428,7,428,8],[428,12,428,13],[425,2,425,3],[425,7,425,8],[425,12,425,13],[426,2,426,3],[426,7,426,8],[426,12,426,13],[423,2,423,3],[423,7,423,8],[423,12,423,13],[424,2,424,3],[424,7,424,8],[424,12,424,13],[421,2,421,3],[421,7,421,8],[421,12,421,13],[422,2,422,3],[422,7,422,8],[422,12,422,13],[419,2,419,3],[419,7,419,8],[419,12,419,13],[420,2,420,3],[420,7,420,8],[420,12,420,13],[417,2,417,3],[417,7,417,8],[417,12,417,13],[418,2,418,3],[418,7,418,8],[418,12,418,13],[415,2,415,3],[415,7,415,8],[415,12,415,13],[416,2,416,3],[416,7,416,8],[416,12,416,13],[413,2,413,3],[413,7,413,8],[413,12,413,13],[414,2,414,3],[414,7,414,8],[414,12,414,13],[411,2,411,3],[411,7,411,8],[411,12,411,13],[412,2,412,3],[412,7,412,8],[412,12,412,13],[410,2,410,3],[410,7,410,8],[410,12,410,13],[407,2,407,3],[407,7,407,8],[407,12,407,13],[408,2,408,3],[408,7,408,8],[408,12,408,13],[402,7,402,8],[402,12,402,13],[403,2,403,3],[403,7,403,8],[403,12,403,13],[404,2,404,3],[404,7,404,8],[404,12,404,13],[409,2,409,3],[409,7,409,8],[409,12,409,13],[219,12,219,16],[207,0,207,1],[1024,0,1024,2],[1025,0,1025,1],[1030,0,1032,0],[1033,0,1033,2],[398,2,398,5],[221,0,223,0],[398,7,398,10],[398,12,398,15],[399,2,399,4],[399,7,399,9],[399,12,399,14],[400,2,401,3],[400,7,401,8],[400,12,401,13],[405,2,405,3],[405,7,405,8],[405,12,405,13],[406,2,406,3],[406,7,406,8],[406,12,406,13],[401,1,444,1],[402,2,402,3],[152,0,162,0],[132,2,132,6],[132,7,132,11],[219,2,219,6],[219,7,219,11],[139,0,142,0],[107,0,107,1],[119,2,119,6],[119,7,119,11],[143,0,146,0],[57,0,70,0],[132,12,132,16],[134,0,138,0],[119,12,119,16],[121,0,122,0],[123,0,126,0],[127,0,128,0],[129,0,131,0],[55,2,55,6],[55,7,55,11],[55,12,55,16],[36,0,37,0],[40,0,41,0],[42,0,43,0],[44,0,45,0],[13,2,13,6],[13,7,13,11],[28,52,29,52],[30,0,31,0],[30,52,31,52],[26,2,26,6],[26,7,26,11],[26,12,26,16],[13,12,13,16],[15,0,16,0],[17,0,20,0],[21,0,22,0],[23,0,25,0],[147,0,149,0],[147,52,149,52],[150,0,151,0],[150,52,151,52],[13,54,13,58],[13,59,13,63],[119,54,119,58],[119,59,119,63],[42,52,43,52],[44,52,45,52],[46,0,48,0],[46,52,48,52],[49,0,51,0],[49,52,51,52],[52,0,54,0],[52,52,54,52],[32,52,33,52],[34,52,35,52],[36,52,37,52],[38,0,39,0],[38,52,39,52],[32,0,33,0],[28,0,29,0],[34,0,35,0],[13,64,13,68],[15,52,16,52],[17,52,20,52],[21,52,22,52],[26,54,26,58],[26,59,26,63],[26,64,26,68],[40,52,41,52],[55,54,55,58],[55,59,55,63],[55,64,55,68],[119,64,119,68],[121,52,122,52],[123,52,126,52],[127,52,128,52],[132,54,132,58],[132,59,132,63],[132,64,132,68],[134,52,138,52],[219,54,219,58],[219,59,219,63],[219,64,219,68],[139,52,142,52],[143,52,146,52],[338,59,338,63],[338,64,338,68],[340,52,341,52],[342,52,343,52],[344,52,345,52],[221,52,223,52],[224,52,225,52],[226,52,229,52],[258,54,258,58],[258,59,258,63],[258,64,258,68],[260,52,262,52],[263,52,266,52],[267,52,269,52],[346,52,347,52],[348,52,349,52],[350,52,351,52],[352,52,353,52],[152,52,163,52],[270,52,272,52],[273,52,275,52],[276,52,283,52],[338,54,338,58]]}
[]
[{"$f":"A1026","v":"Montenegro"}]
[{"$f":"A1034","v":"2013"}]
["Use of drinking water sources"]
[" by wealth quintile and sub-national region"]
["Notes:"]
["WHO/UNICEF JMP customised wealth index excludes water,"]
[" sanitation and hygiene assets."]
["Survey used for analysis:",{"$f":"A1025","v":"MICS13"}]
[{"$f":"B1028","v":""}]
[{"$f":"B1027","v":""}]
[]
[]
["Use of drinking water sources",null,"NATIONAL wealth index quintile",null,null,null,null,"URBAN wealth index quintile",null,null,null,null,"RURAL wealth index quintile",null,null,null,null,"SUB-REGIONS:",null,null,null,null,null,null,null,null,null,null,null,null,null,null,null,null,null,null,null,null,null,null,null,null,null,null,null,null,null,null,null,null,null,null,"Raw numbers of respondents:","Use of drinking water sources","NATIONAL wealth index quintile",null,null,null,null,"URBAN wealth index quintile",null,null,null,null,"RURAL wealth index quintile",null,null,null,null,"SUB-REGIONS:"]
["Weighted percentage (used in graphs)",null,"Poorest","Poor","Middle","Rich","Richest","Poorest","Poor","Middle","Rich","Richest","Poorest","Poor","Middle","Rich","Richest","Centre","North","South",null,null,null,null,null,null,null,null,null,null,null,null,null,null,null,null,null,null,null,null,null,null,null,null,null,null,null,null,null,null,null,null,"Water data, raw numbers (weighted)",null,"Poorest","Poor","Middle","Rich","Richest","Poorest","Poor","Middle","Rich","Richest","Poorest","Poor","Middle","Rich","Richest","Centre","North","South"]
["Water","Improved",98.3,99.5,99.7,100,99.9,100,100,100,100,99.9,96.6,97.9,99.6,99.2,100,99.7,99.1,99.7,null,null,null,null,null,null,null,null,null,null,null,null,null,null,null,null,null,null,null,null,null,null,null,null,null,null,null,null,null,null,null,null,"Water","Improved","N/A","N/A","N/A","N/A","N/A","N/A","N/A","N/A","N/A","N/A","N/A","N/A","N/A","N/A","N/A","N/A","N/A","N/A"]
[null,"Not Improved",1.7,0.5,0.3,0,0.1,0,0,0,0,0.1,3.4,2.1,0.4,0.8,0,0.3,0.9,0.3,null,null,null,null,null,null,null,null,null,null,null,null,null,null,null,null,null,null,null,null,null,null,null,null,null,null,null,null,null,null,null,null,null,"Not Improved","N/A","N/A","N/A","N/A","N/A","N/A","N/A","N/A","N/A","N/A","N/A","N/A","N/A","N/A","N/A","N/A","N/A","N/A"]
["Water ladder","Basic",97,98.7,98.8,98.7,98.6,97.8,98.9,98.7,98.7,98.9,95.2,97.7,99.5,98.7,98.3,99.7,96.2,98.4,null,null,null,null,null,null,null,null,null,null,null,null,null,null,null,null,null,null,null,null,null,null,null,null,null,null,null,null,null,null,null,null,"Water ladder","Basic","N/A","N/A","N/A","N/A","N/A","N/A","N/A","N/A","N/A","N/A","N/A","N/A","N/A","N/A","N/A","N/A","N/A","N/A"]
[null,"Limited",1.3,0.8,0.9,1.3,1.4,2.2000000000000002,1.1000000000000001,1.3,1.3,1,1.4,0.2,0.1,0.6,1.7,0,2.8,1.2,null,null,null,null,null,null,null,null,null,null,null,null,null,null,null,null,null,null,null,null,null,null,null,null,null,null,null,null,null,null,null,null,null,"Limited","N/A","N/A","N/A","N/A","N/A","N/A","N/A","N/A","N/A","N/A","N/A","N/A","N/A","N/A","N/A","N/A","N/A","N/A"]
[null,"Unimproved",1.6,0.5,0.3,0,0.1,0,0,0,0,0.1,3.3,2.1,0.4,0.8,0,0.3,0.9,0.3,null,null,null,null,null,null,null,null,null,null,null,null,null,null,null,null,null,null,null,null,null,null,null,null,null,null,null,null,null,null,null,null,null,"Unimproved","N/A","N/A","N/A","N/A","N/A","N/A","N/A","N/A","N/A","N/A","N/A","N/A","N/A","N/A","N/A","N/A","N/A","N/A"]
[null,"Surface water",0,0,0,0,0,0,0,0,0,0,0.1,0,0,0,0,0,0,0,null,null,null,null,null,null,null,null,null,null,null,null,null,null,null,null,null,null,null,null,null,null,null,null,null,null,null,null,null,null,null,null,null,"Surface water","N/A","N/A","N/A","N/A","N/A","N/A","N/A","N/A","N/A","N/A","N/A","N/A","N/A","N/A","N/A","N/A","N/A","N/A"]
["Improved water point at more than 30 minutes","Yes",1.4,0.8,0.9,1.3,1.4,2.2000000000000002,1.1000000000000001,1.3,1.3,1,1.4,0.2,0.1,0.6,1.7,0,2.9,1.2,null,null,null,null,null,null,null,null,null,null,null,null,null,null,null,null,null,null,null,null,null,null,null,null,null,null,null,null,null,null,null,null,"Improved water point at more than 30 minutes","Yes","N/A","N/A","N/A","N/A","N/A","N/A","N/A","N/A","N/A","N/A","N/A","N/A","N/A","N/A","N/A","N/A","N/A","N/A"]
[null,"No",98.6,99.2,99.1,98.7,98.6,97.8,98.9,98.7,98.7,99,98.6,99.8,99.9,99.4,98.3,100,97.1,98.8,null,null,null,null,null,null,null,null,null,null,null,null,null,null,null,null,null,null,null,null,null,null,null,null,null,null,null,null,null,null,null,null,null,"No","N/A","N/A","N/A","N/A","N/A","N/A","N/A","N/A","N/A","N/A","N/A","N/A","N/A","N/A","N/A","N/A","N/A","N/A"]
["Manually calculated ratios","Improved wells"]
[null,"Improved springs"]
[null,"Other"]
[null,null,"NATIONAL wealth index quintile",null,null,null,null,"URBAN wealth index quintile",null,null,null,null,"RURAL wealth index quintile",null,null,null,null,"SUB-REGIONS:",null,null,null,null,null,null,null,null,null,null,null,null,null,null,null,null,null,null,null,null,null,null,null,null,null,null,null,null,null,null,null,null,null,null,"Raw numbers of respondents:","Use of drinking water sources","NATIONAL wealth index quintile",null,null,null,null,"URBAN wealth index quintile",null,null,null,null,"RURAL wealth index quintile",null,null,null,null,"SUB-REGIONS:"]
["Percentage based on weighted population",null,"Poorest","Poor","Middle","Rich","Richest","Poorest","Poor","Middle","Rich","Richest","Poorest","Poor","Middle","Rich","Richest","Centre","North","South",null,null,null,null,null,null,null,null,null,null,null,null,null,null,null,null,null,null,null,null,null,null,null,null,null,null,null,null,null,null,null,null,"Water data, raw numbers (weighted)",null,"Poorest","Poor","Middle","Rich","Richest","Poorest","Poor","Middle","Rich","Richest","Poorest","Poor","Middle","Rich","Richest","Centre","North","South"]
["Piped water","Yes",68.900000000000006,81.3,90.2,90.3,93.3,91.6,94.3,95.8,96.1,96.1,51.1,60.8,66.5,77.900000000000006,83.1,89.5,68.5,96.2,null,null,null,null,null,null,null,null,null,null,null,null,null,null,null,null,null,null,null,null,null,null,null,null,null,null,null,null,null,null,null,null,"Piped water","Yes","N/A","N/A","N/A","N/A","N/A","N/A","N/A","N/A","N/A","N/A","N/A","N/A","N/A","N/A","N/A","N/A","N/A","N/A"]
[null,"No",31.1,18.7,9.8000000000000007,9.6999999999999993,6.7,8.4,5.7,4.2,3.9,3.9,48.9,39.200000000000003,33.5,22.1,16.899999999999999,10.5,31.5,3.8,null,null,null,null,null,null,null,null,null,null,null,null,null,null,null,null,null,null,null,null,null,null,null,null,null,null,null,null,null,null,null,null,null,"No","N/A","N/A","N/A","N/A","N/A","N/A","N/A","N/A","N/A","N/A","N/A","N/A","N/A","N/A","N/A","N/A","N/A","N/A"]
["Piped water on premises","Yes",67.599999999999994,81.3,90.2,90.3,93.3,90.4,94.3,95.8,96.1,96.1,49.5,60.8,66.5,77.900000000000006,83.1,89.2,68.2,96.2,null,null,null,null,null,null,null,null,null,null,null,null,null,null,null,null,null,null,null,null,null,null,null,null,null,null,null,null,null,null,null,null,"Piped water on premises","Yes","N/A","N/A","N/A","N/A","N/A","N/A","N/A","N/A","N/A","N/A","N/A","N/A","N/A","N/A","N/A","N/A","N/A","N/A"]
[null,"No",32.4,18.7,9.8000000000000007,9.6999999999999993,6.7,9.6,5.7,4.2,3.9,3.9,50.5,39.200000000000003,33.5,22.1,16.899999999999999,10.8,31.8,3.8,null,null,null,null,null,null,null,null,null,null,null,null,null,null,null,null,null,null,null,null,null,null,null,null,null,null,null,null,null,null,null,null,null,"No","N/A","N/A","N/A","N/A","N/A","N/A","N/A","N/A","N/A","N/A","N/A","N/A","N/A","N/A","N/A","N/A","N/A","N/A"]
["Piped water into dwelling","Yes","N/A","N/A","N/A","N/A","N/A","N/A","N/A","N/A","N/A","N/A","N/A","N/A","N/A","N/A","N/A","N/A","N/A","N/A",null,null,null,null,null,null,null,null,null,null,null,null,null,null,null,null,null,null,null,null,null,null,null,null,null,null,null,null,null,null,null,null,"Piped water into dwelling","Yes","N/A","N/A","N/A","N/A","N/A","N/A","N/A","N/A","N/A","N/A","N/A","N/A","N/A","N/A","N/A","N/A","N/A","N/A"]
[null,"No","N/A","N/A","N/A","N/A","N/A","N/A","N/A","N/A","N/A","N/A","N/A","N/A","N/A","N/A","N/A","N/A","N/A","N/A",null,null,null,null,null,null,null,null,null,null,null,null,null,null,null,null,null,null,null,null,null,null,null,null,null,null,null,null,null,null,null,null,null,"No","N/A","N/A","N/A","N/A","N/A","N/A","N/A","N/A","N/A","N/A","N/A","N/A","N/A","N/A","N/A","N/A","N/A","N/A"]
["Water source on premises","Yes",92.4,96.8,96.8,96.4,97.5,94.5,95.9,97,97,97.7,90.6,95,96.6,97.7,96.4,98.6,90.9,97.3,null,null,null,null,null,null,null,null,null,null,null,null,null,null,null,null,null,null,null,null,null,null,null,null,null,null,null,null,null,null,null,null,"Water source on premises","Yes","N/A","N/A","N/A","N/A","N/A","N/A","N/A","N/A","N/A","N/A","N/A","N/A","N/A","N/A","N/A","N/A","N/A","N/A"]
[null,"No",7.6,3.2,3.2,3.6,2.5,5.5,4.0999999999999996,3,3,2.2999999999999998,9.4,5,3.4,2.2999999999999998,3.6,1.4,9.1,2.7,null,null,null,null,null,null,null,null,null,null,null,null,null,null,null,null,null,null,null,null,null,null,null,null,null,null,null,null,null,null,null,null,null,"No","N/A","N/A","N/A","N/A","N/A","N/A","N/A","N/A","N/A","N/A","N/A","N/A","N/A","N/A","N/A","N/A","N/A","N/A"]
["Improved Water source on premises","Yes",91.6,96.6,96.5,96.4,97.5,94.5,95.9,97,97,97.7,88.8,94,96.6,96.9,96.4,98.4,90.3,97.2,null,null,null,null,null,null,null,null,null,null,null,null,null,null,null,null,null,null,null,null,null,null,null,null,null,null,null,null,null,null,null,null,"Improved water source on premises","Yes","N/A","N/A","N/A","N/A","N/A","N/A","N/A","N/A","N/A","N/A","N/A","N/A","N/A","N/A","N/A","N/A","N/A","N/A"]
[null,"No",8.4,3.4,3.5,3.6,2.5,5.5,4.0999999999999996,3,3,2.2999999999999998,11.2,6,3.4,3.1,3.6,1.6,9.6999999999999993,2.8,null,null,null,null,null,null,null,null,null,null,null,null,null,null,null,null,null,null,null,null,null,null,null,null,null,null,null,null,null,null,null,null,null,"No","N/A","N/A","N/A","N/A","N/A","N/A","N/A","N/A","N/A","N/A","N/A","N/A","N/A","N/A","N/A","N/A","N/A","N/A"]
["Piped water on premises available when needed","Yes","N/A","N/A","N/A","N/A","N/A","N/A","N/A","N/A","N/A","N/A","N/A","N/A","N/A","N/A","N/A","N/A","N/A","N/A",null,null,null,null,null,null,null,null,null,null,null,null,null,null,null,null,null,null,null,null,null,null,null,null,null,null,null,null,null,null,null,null,"Piped water on premises available when needed","Yes","N/A","N/A","N/A","N/A","N/A","N/A","N/A","N/A","N/A","N/A","N/A","N/A","N/A","N/A","N/A","N/A","N/A","N/A"]
[null,"No","N/A","N/A","N/A","N/A","N/A","N/A","N/A","N/A","N/A","N/A","N/A","N/A","N/A","N/A","N/A","N/A","N/A","N/A",null,null,null,null,null,null,null,null,null,null,null,null,null,null,null,null,null,null,null,null,null,null,null,null,null,null,null,null,null,null,null,null,null,"No","N/A","N/A","N/A","N/A","N/A","N/A","N/A","N/A","N/A","N/A","N/A","N/A","N/A","N/A","N/A","N/A","N/A","N/A"]
["Water point at more than 30 minutes","Yes",1.5,0.8,0.9,1.3,1.4,2.2000000000000002,1.1000000000000001,1.3,1.3,1.1000000000000001,1.9,0.2,0.1,0.6,1.7,0,3,1.3,null,null,null,null,null,null,null,null,null,null,null,null,null,null,null,null,null,null,null,null,null,null,null,null,null,null,null,null,null,null,null,null,"Water point at more than 30 minutes","Yes","N/A","N/A","N/A","N/A","N/A","N/A","N/A","N/A","N/A","N/A","N/A","N/A","N/A","N/A","N/A","N/A","N/A","N/A"]
[null,"No",98.5,99.2,99.1,98.7,98.6,97.8,98.9,98.7,98.7,98.9,98.1,99.8,99.9,99.4,98.3,100,97,98.7,null,null,null,null,null,null,null,null,null,null,null,null,null,null,null,null,null,null,null,null,null,null,null,null,null,null,null,null,null,null,null,null,null,"No","N/A","N/A","N/A","N/A","N/A","N/A","N/A","N/A","N/A","N/A","N/A","N/A","N/A","N/A","N/A","N/A","N/A","N/A"]
["Water source available when needed","Yes","N/A","N/A","N/A","N/A","N/A","N/A","N/A","N/A","N/A","N/A","N/A","N/A","N/A","N/A","N/A","N/A","N/A","N/A",null,null,null,null,null,null,null,null,null,null,null,null,null,null,null,null,null,null,null,null,null,null,null,null,null,null,null,null,null,null,null,null,"Water source available when needed","Yes","N/A","N/A","N/A","N/A","N/A","N/A","N/A","N/A","N/A","N/A","N/A","N/A","N/A","N/A","N/A","N/A","N/A","N/A"]
[null,"No","N/A","N/A","N/A","N/A","N/A","N/A","N/A","N/A","N/A","N/A","N/A","N/A","N/A","N/A","N/A","N/A","N/A","N/A",null,null,null,null,null,null,null,null,null,null,null,null,null,null,null,null,null,null,null,null,null,null,null,null,null,null,null,null,null,null,null,null,null,"No","N/A","N/A","N/A","N/A","N/A","N/A","N/A","N/A","N/A","N/A","N/A","N/A","N/A","N/A","N/A","N/A","N/A","N/A"]
["Improved water source available when needed","Yes","N/A","N/A","N/A","N/A","N/A","N/A","N/A","N/A","N/A","N/A","N/A","N/A","N/A","N/A","N/A","N/A","N/A","N/A",null,null,null,null,null,null,null,null,null,null,null,null,null,null,null,null,null,null,null,null,null,null,null,null,null,null,null,null,null,null,null,null,"Improved water source available when needed","Yes","N/A","N/A","N/A","N/A","N/A","N/A","N/A","N/A","N/A","N/A","N/A","N/A","N/A","N/A","N/A","N/A","N/A","N/A"]
[null,"No","N/A","N/A","N/A","N/A","N/A","N/A","N/A","N/A","N/A","N/A","N/A","N/A","N/A","N/A","N/A","N/A","N/A","N/A",null,null,null,null,null,null,null,null,null,null,null,null,null,null,null,null,null,null,null,null,null,null,null,null,null,null,null,null,null,null,null,null,null,"No","N/A","N/A","N/A","N/A","N/A","N/A","N/A","N/A","N/A","N/A","N/A","N/A","N/A","N/A","N/A","N/A","N/A","N/A"]
["Microbiological quality at point of collection","Not contaminated (No E. coli in 100 mL)","N/A","N/A","N/A","N/A","N/A","N/A","N/A","N/A","N/A","N/A","N/A","N/A","N/A","N/A","N/A","N/A","N/A","N/A",null,null,null,null,null,null,null,null,null,null,null,null,null,null,null,null,null,null,null,null,null,null,null,null,null,null,null,null,null,null,null,null,"Microbiological quality at point of collection","Not contaminated (No E. coli in 100 mL)","N/A","N/A","N/A","N/A","N/A","N/A","N/A","N/A","N/A","N/A","N/A","N/A","N/A","N/A","N/A","N/A","N/A","N/A"]
[null,"Contaminated (E. coli detected in 100 mL)","N/A","N/A","N/A","N/A","N/A","N/A","N/A","N/A","N/A","N/A","N/A","N/A","N/A","N/A","N/A","N/A","N/A","N/A",null,null,null,null,null,null,null,null,null,null,null,null,null,null,null,null,null,null,null,null,null,null,null,null,null,null,null,null,null,null,null,null,null,"Contaminated (E. coli detected in 100 mL)","N/A","N/A","N/A","N/A","N/A","N/A","N/A","N/A","N/A","N/A","N/A","N/A","N/A","N/A","N/A","N/A","N/A","N/A"]
[null,"Highly contaminated (>100 CFU/100 mL)","N/A","N/A","N/A","N/A","N/A","N/A","N/A","N/A","N/A","N/A","N/A","N/A","N/A","N/A","N/A","N/A","N/A","N/A",null,null,null,null,null,null,null,null,null,null,null,null,null,null,null,null,null,null,null,null,null,null,null,null,null,null,null,null,null,null,null,null,null,"Highly contaminated (>100 CFU/100 mL)","N/A","N/A","N/A","N/A","N/A","N/A","N/A","N/A","N/A","N/A","N/A","N/A","N/A","N/A","N/A","N/A","N/A","N/A"]
["Microbiological quality of improved water sources at point of collection","Not contaminated (No E. coli in 100 mL)","N/A","N/A","N/A","N/A","N/A","N/A","N/A","N/A","N/A","N/A","N/A","N/A","N/A","N/A","N/A","N/A","N/A","N/A",null,null,null,null,null,null,null,null,null,null,null,null,null,null,null,null,null,null,null,null,null,null,null,null,null,null,null,null,null,null,null,null,"Microbiological quality of improved water sources at point of collection","Not contaminated (No E. coli in 100 mL)","N/A","N/A","N/A","N/A","N/A","N/A","N/A","N/A","N/A","N/A","N/A","N/A","N/A","N/A","N/A","N/A","N/A","N/A"]
[null,"Contaminated (E. coli detected in 100 mL)","N/A","N/A","N/A","N/A","N/A","N/A","N/A","N/A","N/A","N/A","N/A","N/A","N/A","N/A","N/A","N/A","N/A","N/A",null,null,null,null,null,null,null,null,null,null,null,null,null,null,null,null,null,null,null,null,null,null,null,null,null,null,null,null,null,null,null,null,null,"Contaminated (E. coli detected in 100 mL)","N/A","N/A","N/A","N/A","N/A","N/A","N/A","N/A","N/A","N/A","N/A","N/A","N/A","N/A","N/A","N/A","N/A","N/A"]
[null,"Highly contaminated (>100 CFU/100 mL)","N/A","N/A","N/A","N/A","N/A","N/A","N/A","N/A","N/A","N/A","N/A","N/A","N/A","N/A","N/A","N/A","N/A","N/A",null,null,null,null,null,null,null,null,null,null,null,null,null,null,null,null,null,null,null,null,null,null,null,null,null,null,null,null,null,null,null,null,null,"Highly contaminated (>100 CFU/100 mL)","N/A","N/A","N/A","N/A","N/A","N/A","N/A","N/A","N/A","N/A","N/A","N/A","N/A","N/A","N/A","N/A","N/A","N/A"]
["Microbiological quality of piped on premises at point of collection","Not contaminated (No E. coli in 100 mL)","N/A","N/A","N/A","N/A","N/A","N/A","N/A","N/A","N/A","N/A","N/A","N/A","N/A","N/A","N/A","N/A","N/A","N/A",null,null,null,null,null,null,null,null,null,null,null,null,null,null,null,null,null,null,null,null,null,null,null,null,null,null,null,null,null,null,null,null,"Microbiological quality of piped on premises at point of collection","Not contaminated (No E. coli in 100 mL)","N/A","N/A","N/A","N/A","N/A","N/A","N/A","N/A","N/A","N/A","N/A","N/A","N/A","N/A","N/A","N/A","N/A","N/A"]
[null,"Contaminated (E. coli detected in 100 mL)","N/A","N/A","N/A","N/A","N/A","N/A","N/A","N/A","N/A","N/A","N/A","N/A","N/A","N/A","N/A","N/A","N/A","N/A",null,null,null,null,null,null,null,null,null,null,null,null,null,null,null,null,null,null,null,null,null,null,null,null,null,null,null,null,null,null,null,null,null,"Contaminated (E. coli detected in 100 mL)","N/A","N/A","N/A","N/A","N/A","N/A","N/A","N/A","N/A","N/A","N/A","N/A","N/A","N/A","N/A","N/A","N/A","N/A"]
[null,"Highly contaminated (>100 CFU/100 mL)","N/A","N/A","N/A","N/A","N/A","N/A","N/A","N/A","N/A","N/A","N/A","N/A","N/A","N/A","N/A","N/A","N/A","N/A",null,null,null,null,null,null,null,null,null,null,null,null,null,null,null,null,null,null,null,null,null,null,null,null,null,null,null,null,null,null,null,null,null,"Highly contaminated (>100 CFU/100 mL)","N/A","N/A","N/A","N/A","N/A","N/A","N/A","N/A","N/A","N/A","N/A","N/A","N/A","N/A","N/A","N/A","N/A","N/A"]
[null,null,"NATIONAL wealth index quintile",null,null,null,null,"URBAN wealth index quintile",null,null,null,null,"RURAL wealth index quintile",null,null,null,null,"SUB-REGIONS:",null,null,null,null,null,null,null,null,null,null,null,null,null,null,null,null,null,null,null,null,null,null,null,null,null,null,null,null,null,null,null,null,null,null,"Raw numbers of respondents:","Use of drinking water sources","NATIONAL wealth index quintile",null,null,null,null,"URBAN wealth index quintile",null,null,null,null,"RURAL wealth index quintile",null,null,null,null,"SUB-REGIONS:"]
["Percentage based on weighted population",null,"Poorest","Poor","Middle","Rich","Richest","Poorest","Poor","Middle","Rich","Richest","Poorest","Poor","Middle","Rich","Richest","Centre","North","South",null,null,null,null,null,null,null,null,null,null,null,null,null,null,null,null,null,null,null,null,null,null,null,null,null,null,null,null,null,null,null,null,"Water data, raw numbers (weighted)",null,"Poorest","Poor","Middle","Rich","Richest","Poorest","Poor","Middle","Rich","Richest","Poorest","Poor","Middle","Rich","Richest","Centre","North","South"]
["Main source of drinking water","Piped into dwelling",65.2,79.5,88.3,87.9,89.1,88,91.7,94.4,93.7,92.6,47.2,59.2,66.099999999999994,75.599999999999994,76.7,87.5,67,90.3]
[null,"Piped into compound, yard or plot",1.6,0.1,0.2,0.1,0,1.1000000000000001,0.2,0,0,0,2.2999999999999998,0.4,0,0,0.4,0.4,0.6,0.1]
[null,"Piped to neighbour",1,0,0,0,0,1.1000000000000001,0,0,0,0,0.7,0,0,0,0,0.3,0.1,0]
[null,"Public tap / standpipe",0.3,0,0,0,0,0,0,0,0,0,0.8,0,0,0,0,0,0.2,0]
[null,"Tube well, Borehole",0.9,2.7,0.4,2.1,1.3,0.6,0.4,0.8,0.1,0.7,0.7,2.7,5.5,2.8,3.8,3,0.1,0.3]
[null,"Protected well",10.9,6.9,3.3,1.9,1.1000000000000001,0.9,0.4,0,0.3,0,19.7,14.6,13.1,9.8000000000000007,4.8,4.4000000000000004,8.9,0.4]
[null,"Unprotected well",0.2,0.2,0,0,0,0,0,0,0,0,0.3,0.9,0,0,0,0.1,0.1,0]
[null,"Protected spring",15.3,7.6,5.2,5.0999999999999996,4,6.7,5,3.4,3.2,3.1,21,17.7,11.7,5.9,7.3,0.8,21.4,2.8]
[null,"Unprotected spring",1.4,0.1,0,0,0.1,0,0,0,0,0.1,3,0.7,0.3,0,0,0.1,0.8,0.1]
[null,"Rainwater collection",1.7,0.6,0.6,0.4,0,0,0,0,0,0,3.5,1.5,1.6,2.4,0,1.4,0,0]
[null,"Tanker-truck",0.3,0,0,0,0,0.1,0,0,0,0,0.5,0,0,0,0,0,0.1,0]
[null,"Surface water (river, stream, dam, lake, pond, canal, irrigation channel)",0,0,0,0,0,0,0,0,0,0,0.1,0,0,0,0,0,0,0]
[null,"Bottled water",1.2,2.2000000000000002,1.7,2.5,4.5999999999999996,1.5,2.2999999999999998,1.5,2.6,3.5,0.1,1.8,1.6,2.8,7,1.8,0.8,5.8]
[null,"Other",0,0.2,0.3,0,0,0,0,0,0,0,0,0.5,0.1,0.8,0,0.1,0,0.3]
[]
[]
[]
[]
[]
[]
[]
[]
[]
[]
[]
[]
[]
[]
[]
[]
[]
[]
[]
[]
[]
[]
[]
[]
[]
[]
[]
[]
[]
[]
[]
[]
[]
[]
[]
[]
[{"$f":"A1026","v":"Montenegro"}]
[{"$f":"A1034","v":"2013"}]
["Use of sanitation facilities"]
[" by wealth quintile and sub-national region"]
["Notes:"]
["WHO/UNICEF JMP customised wealth index excludes water,"]
[" sanitation and hygiene assets."]
["Survey used for analysis:",{"$f":"A1025","v":"MICS13"}]
[{"$f":"B1030","v":""}]
[{"$f":"B1029","v":""}]
[]
[]
["Use of sanitation facilities",null,"NATIONAL wealth index quintile",null,null,null,null,"URBAN wealth index quintile",null,null,null,null,"RURAL wealth index quintile",null,null,null,null,"SUB-REGIONS:",null,null,null,null,null,null,null,null,null,null,null,null,null,null,null,null,null,null,null,null,null,null,null,null,null,null,null,null,null,null,null,null,null,null,"Raw numbers of respondents:","Use of sanitation facilities","NATIONAL wealth index quintile",null,null,null,null,"URBAN wealth index quintile",null,null,null,null,"RURAL wealth index quintile",null,null,null,null,"SUB-REGIONS:"]
["Weighted percentage (used in graphs)",null,"Poorest","Poor","Middle","Rich","Richest","Poorest","Poor","Middle","Rich","Richest","Poorest","Poor","Middle","Rich","Richest","Centre","North","South",null,null,null,null,null,null,null,null,null,null,null,null,null,null,null,null,null,null,null,null,null,null,null,null,null,null,null,null,null,null,null,null,"Sanitation data, raw numbers (weighted)",null,"Poorest","Poor","Middle","Rich","Richest","Poorest","Poor","Middle","Rich","Richest","Poorest","Poor","Middle","Rich","Richest","Centre","North","South"]
["Sanitation","Improved",88.550328269969185,95.975397254266113,98.478958560583806,99.399323899995338,99.68762573178654,94.902101365747711,98.131535172536829,98.96812513300948,99.764550472080487,99.501752886257876,85.184806645668161,88.246414273914155,94.744786627955506,98.453003212168184,99.96936805218472,99.608245976460125,88.832564910870587,99.804993051791541,null,null,null,null,null,null,null,null,null,null,null,null,null,null,null,null,null,null,null,null,null,null,null,null,null,null,null,null,null,null,null,null,"Sanitation","Improved",2443.9696139509397,2648.3910727314242,2715.28423914631,2738.4307271824996,2758.7233002922535,1645.887237808621,1703.4292338164785,1713.0574568746824,1731.762159996892,1726.3469515842694,874.83575099456891,905.78696837228347,969.36635366248333,1010.8662505229523,1023.4605896702118,6421.7231334588787,3680.4614551181612,3202.6143647263802]
[null,"Not Improved",11.449671730030801,4.0246027457339029,1.5210414394162433,0.60067610000467964,0.31237426821344794,5.0978986342523003,1.868464827463207,1.0318748669905276,0.23544952791950863,0.49824711374212649,14.815193354331862,11.753585726085868,5.255213372044472,1.5469967878317967,3.0631947815289294E-2,0.3917540235398983,11.167435089129443,0.19500694820844916,null,null,null,null,null,null,null,null,null,null,null,null,null,null,null,null,null,null,null,null,null,null,null,null,null,null,null,null,null,null,null,null,null,"Not Improved",316.00842531713522,111.05681547588765,41.938500446210021,16.548501788522124,8.6445450556798704,88.412861053740613,32.433993862040687,17.860911612542161,4.0870487674301224,8.6445450556798704,152.14991164067814,120.64223651387631,53.767887453070315,15.883790148245096,0.31360197613150764,25.256301332585345,462.68296361040149,6.257523140447951]
["Sanitation ladder","Basic",{"$f":"C122*C129/100","v":86.397500066966472},{"$f":"D122*D129/100","v":95.599861128471559},{"$f":"E122*E129/100","v":97.946009523392561},98.92568324439199,99.42477175043237,91.715945068461423,97.861039855017495,98.140767656865705,99.094702792856836,99.33433123978719,84.06733970092975,88.246414273914155,94.744786627955506,98.453003212168184,99.532502426630913,98.563370686732227,88.355304355472072,99.253604636719061,null,null,null,null,null,null,null,null,null,null,null,null,null,null,null,null,null,null,null,null,null,null,null,null,null,null,null,null,null,null,null,null,"Sanitation ladder","Basic",2384.5520283248957,2632.7645058053808,2696.2031666586204,2720.4735441799394,2751.4491637320416,1590.6297259948756,1694.5829940863407,1697.1118906393529,1720.1346143571623,1723.4422002544684,863.35952568741743,901.89276371165374,969.36635366248333,1005.9342681635225,1018.9880721436175,6350.5068833625037,3660.6878610543745,3174.2476642839952]
[null,"Limited",{"$f":"C122*C128/100","v":2.1528282030026746},{"$f":"D122*D128/100","v":0.37553612579456214},{"$f":"E122*E128/100","v":0.5329490371912482},0.4736406556033414,0.26285398135417931,3.1861562972862756,0.2704953175193241,0.82735747614377952,0.6698476792236252,0.16742164647068031,1.1174669447383991,0,0,0,0.43686562555381331,1.0448752897279154,0.47726055539851892,0.55138841507249936,null,null,null,null,null,null,null,null,null,null,null,null,null,null,null,null,null,null,null,null,null,null,null,null,null,null,null,null,null,null,null,null,null,"Limited",59.417585626043362,10.342046222336339,14.67072409314971,13.025200643130031,7.2741365602124111,55.257511813745232,4.6839555938433035,14.307185934007151,11.627545639729474,2.9047513298009009,11.476225307151495,0,0,0,4.4725175265942925,67.32204543574656,19.773594063786671,17.634053645338632]
[null,"Unimproved",{"$f":"100-C124-C125-C127","v":11.138644765756965},{"$f":"100-D124-D125-D127","v":4.0246027457338789},{"$f":"100-E124-E125-E127","v":1.5210414394161904},0.60067610000466809,0.31237426821345043,4.8034732638843112,1.868464827463181,1.0318748669905151,0.23544952791953877,0.49824711374212988,14.476526852224225,11.753585726085845,5.2552133720444942,1.5469967878318158,3.0631947815273841E-2,0.27424559529926884,11.142982460313149,0.19500694820843989,null,null,null,null,null,null,null,null,null,null,null,null,null,null,null,null,null,null,null,null,null,null,null,null,null,null,null,null,null,null,null,null,null,"Unimproved",307.4241494069737,111.05681547588765,41.938500446210021,16.548501788522124,8.6445450556798704,83.306641564372697,32.433993862040687,17.860911612542161,4.0870487674301224,8.6445450556798704,148.67185521988452,120.64223651387631,53.767887453070315,15.883790148245096,0.31360197613150764,17.685133148457115,461.66985588436819,6.257523140447951]
[null,"Open defecation",0.31102696427389004,0,0,0,0,0.29442537036798971,0,0,0,0,0.33866650210762533,0,0,0,0,0.11750842824058828,2.4452628816260185E-2,0,null,null,null,null,null,null,null,null,null,null,null,null,null,null,null,null,null,null,null,null,null,null,null,null,null,null,null,null,null,null,null,null,null,"Open defecation",8.5842759101615282,0,0,0,0,5.1062194893679189,0,0,0,0,3.478056420793608,0,0,0,0,7.571168184128231,1.0131077260332959,0]
["Shared among Improved Sanitation","Yes",2.4311916681316035,0.39128374201948879,0.54118061866320444,0.47650289460707651,0.26367764246025704,3.3573084804592437,0.27564565971961391,0.83598378268946882,0.67142855458571415,0.16825999704956232,1.3118148514283501,0,0,0,0.43699948700862679,1.0489847296124912,0.53725855588811866,0.55246576169427597,null,null,null,null,null,null,null,null,null,null,null,null,null,null,null,null,null,null,null,null,null,null,null,null,null,null,null,null,null,null,null,null,"Shared among improved sanitation facilities","Yes","N/A","N/A","N/A","N/A","N/A","N/A","N/A","N/A","N/A","N/A","N/A","N/A","N/A","N/A","N/A","N/A","N/A","N/A"]
[null,"No",97.568808331868368,99.608716257980518,99.458819381336809,99.52349710539292,99.736322357539763,96.642691519540747,99.724354340280385,99.164016217310532,99.328571445414269,99.831740002950426,98.688185148571648,100,100,100,99.56300051299138,98.951015270387529,99.462741444111884,99.447534238305749,null,null,null,null,null,null,null,null,null,null,null,null,null,null,null,null,null,null,null,null,null,null,null,null,null,null,null,null,null,null,null,null,null,"No","N/A","N/A","N/A","N/A","N/A","N/A","N/A","N/A","N/A","N/A","N/A","N/A","N/A","N/A","N/A","N/A","N/A","N/A"]
["Manually calculated ratios","Improved latrines",{"$f":"C159/(C159+C160)*100","v":93.741831726580159},{"$f":"D159/(D159+D160)*100","v":100},100,100,100,86.015834541403052,100,100,100,100,94.430538472828218,100,100,100,100,89.535040259674858,96.880821948887402,100]
[null,"Other"]
[null,"Other"]
[null,null,"NATIONAL wealth index quintile",null,null,null,null,"URBAN wealth index quintile",null,null,null,null,"RURAL wealth index quintile",null,null,null,null,"SUB-REGIONS:",null,null,null,null,null,null,null,null,null,null,null,null,null,null,null,null,null,null,null,null,null,null,null,null,null,null,null,null,null,null,null,null,null,null,"Raw numbers of respondents:","Use of sanitation facilities","NATIONAL wealth index quintile",null,null,null,null,"URBAN wealth index quintile",null,null,null,null,"RURAL wealth index quintile",null,null,null,null,"SUB-REGIONS:"]
["Percentage based on weighted population",null,"Poorest","Poor","Middle","Rich","Richest","Poorest","Poor","Middle","Rich","Richest","Poorest","Poor","Middle","Rich","Richest","Centre","North","South",null,null,null,null,null,null,null,null,null,null,null,null,null,null,null,null,null,null,null,null,null,null,null,null,null,null,null,null,null,null,null,null,"Sanitation data, raw numbers (weighted)",null,"Poorest","Poor","Middle","Rich","Richest","Poorest","Poor","Middle","Rich","Richest","Poorest","Poor","Middle","Rich","Richest","Centre","North","South"]
["Sanitation type","Sewer connection",30.865524447253236,40.138516127030513,55.454370390419207,49.989660419821107,55.492178206103361,57.411844428185631,58.634696836058964,66.937076520809285,61.852363151134263,72.005753940342245,10.596615856163066,21.287895319000004,17.298060771396585,22.275839452315775,16.921230777690063,40.541502463906255,48.993610278760997,54.778838338158472,null,null,null,null,null,null,null,null,null,null,null,null,null,null,null,null,null,null,null,null,null,null,null,null,null,null,null,null,null,null,null,null,"Sanitation type","Sewer connection","N/A","N/A","N/A","N/A","N/A","N/A","N/A","N/A","N/A","N/A","N/A","N/A","N/A","N/A","N/A","N/A","N/A","N/A"]
[null,"Septic tank connection",46.551155800883684,55.013602503157635,43.024588170164719,49.409663480174189,44.195447525683271,34.597633131580608,39.496838336477865,32.031048612200209,37.912187320946309,27.495998945915641,52.390857992372894,62.54182529548914,76.807538126949353,76.177163759852377,83.048137274494664,57.164499975057446,34.870059853550892,44.979457660023058,null,null,null,null,null,null,null,null,null,null,null,null,null,null,null,null,null,null,null,null,null,null,null,null,null,null,null,null,null,null,null,null,null,"Septic tank connection","N/A","N/A","N/A","N/A","N/A","N/A","N/A","N/A","N/A","N/A","N/A","N/A","N/A","N/A","N/A","N/A","N/A","N/A"]
[null,"Improved latrines",11.133648021832416,0.82327862407817198,0,0,0,2.8926238059813745,0,0,0,0,22.197332797132059,4.4166936594249471,0.63918772960959358,0,0,1.9022435374967124,4.968894778558548,4.6697053610223214E-2,null,null,null,null,null,null,null,null,null,null,null,null,null,null,null,null,null,null,null,null,null,null,null,null,null,null,null,null,null,null,null,null,null,"Improved latrines","N/A","N/A","N/A","N/A","N/A","N/A","N/A","N/A","N/A","N/A","N/A","N/A","N/A","N/A","N/A","N/A","N/A","N/A"]
[null,"Unimproved facilities",11.138644765756911,4.0246027457339029,1.5210414394162433,0.60067610000467964,0.31237426821344794,4.8034732638843103,1.868464827463207,1.0318748669905276,0.23544952791950863,0.49824711374212649,14.476526852224236,11.753585726085868,5.255213372044472,1.5469967878317967,3.0631947815289294E-2,0.27431657456542158,11.142982460313183,0.19500694820844916,null,null,null,null,null,null,null,null,null,null,null,null,null,null,null,null,null,null,null,null,null,null,null,null,null,null,null,null,null,null,null,null,null,"Unimproved facilities","N/A","N/A","N/A","N/A","N/A","N/A","N/A","N/A","N/A","N/A","N/A","N/A","N/A","N/A","N/A","N/A","N/A","N/A"]
[null,"Open defecation",0.31102696427389004,0,0,0,0,0.29442537036798971,0,0,0,0,0.33866650210762533,0,0,0,0,0.11743744897447672,2.4452628816260185E-2,0,null,null,null,null,null,null,null,null,null,null,null,null,null,null,null,null,null,null,null,null,null,null,null,null,null,null,null,null,null,null,null,null,null,"Open defecation","N/A","N/A","N/A","N/A","N/A","N/A","N/A","N/A","N/A","N/A","N/A","N/A","N/A","N/A","N/A","N/A","N/A","N/A"]
["Septic tank emptying practices","Not emptied/treated and disposed in situ","N/A","N/A","N/A","N/A","N/A","N/A","N/A","N/A","N/A","N/A","N/A","N/A","N/A","N/A","N/A","N/A","N/A","N/A",null,null,null,null,null,null,null,null,null,null,null,null,null,null,null,null,null,null,null,null,null,null,null,null,null,null,null,null,null,null,null,null,"Septic tank emptying practices","Not emptied/treated and disposed in situ","N/A","N/A","N/A","N/A","N/A","N/A","N/A","N/A","N/A","N/A","N/A","N/A","N/A","N/A","N/A","N/A","N/A","N/A"]
[null,"Emptied and buried on site","N/A","N/A","N/A","N/A","N/A","N/A","N/A","N/A","N/A","N/A","N/A","N/A","N/A","N/A","N/A","N/A","N/A","N/A",null,null,null,null,null,null,null,null,null,null,null,null,null,null,null,null,null,null,null,null,null,null,null,null,null,null,null,null,null,null,null,null,null,"Emptied and buried on site","N/A","N/A","N/A","N/A","N/A","N/A","N/A","N/A","N/A","N/A","N/A","N/A","N/A","N/A","N/A","N/A","N/A","N/A"]
[null,"Emptied and discharged locally","N/A","N/A","N/A","N/A","N/A","N/A","N/A","N/A","N/A","N/A","N/A","N/A","N/A","N/A","N/A","N/A","N/A","N/A",null,null,null,null,null,null,null,null,null,null,null,null,null,null,null,null,null,null,null,null,null,null,null,null,null,null,null,null,null,null,null,null,null,"Emptied and discharged locally","N/A","N/A","N/A","N/A","N/A","N/A","N/A","N/A","N/A","N/A","N/A","N/A","N/A","N/A","N/A","N/A","N/A","N/A"]
[null,"Emptied and removed offsite","N/A","N/A","N/A","N/A","N/A","N/A","N/A","N/A","N/A","N/A","N/A","N/A","N/A","N/A","N/A","N/A","N/A","N/A",null,null,null,null,null,null,null,null,null,null,null,null,null,null,null,null,null,null,null,null,null,null,null,null,null,null,null,null,null,null,null,null,null,"Emptied and removed offsite","N/A","N/A","N/A","N/A","N/A","N/A","N/A","N/A","N/A","N/A","N/A","N/A","N/A","N/A","N/A","N/A","N/A","N/A"]
["Latrine emptying practices","Not emptied/treated and disposed in situ","N/A","N/A","N/A","N/A","N/A","N/A","N/A","N/A","N/A","N/A","N/A","N/A","N/A","N/A","N/A","N/A","N/A","N/A",null,null,null,null,null,null,null,null,null,null,null,null,null,null,null,null,null,null,null,null,null,null,null,null,null,null,null,null,null,null,null,null,"Latrine emptying practices","Not emptied/treated and disposed in situ","N/A","N/A","N/A","N/A","N/A","N/A","N/A","N/A","N/A","N/A","N/A","N/A","N/A","N/A","N/A","N/A","N/A","N/A"]
[null,"Emptied and buried on site","N/A","N/A","N/A","N/A","N/A","N/A","N/A","N/A","N/A","N/A","N/A","N/A","N/A","N/A","N/A","N/A","N/A","N/A",null,null,null,null,null,null,null,null,null,null,null,null,null,null,null,null,null,null,null,null,null,null,null,null,null,null,null,null,null,null,null,null,null,"Emptied and buried on site","N/A","N/A","N/A","N/A","N/A","N/A","N/A","N/A","N/A","N/A","N/A","N/A","N/A","N/A","N/A","N/A","N/A","N/A"]
[null,"Emptied and discharged locally","N/A","N/A","N/A","N/A","N/A","N/A","N/A","N/A","N/A","N/A","N/A","N/A","N/A","N/A","N/A","N/A","N/A","N/A",null,null,null,null,null,null,null,null,null,null,null,null,null,null,null,null,null,null,null,null,null,null,null,null,null,null,null,null,null,null,null,null,null,"Emptied and discharged locally","N/A","N/A","N/A","N/A","N/A","N/A","N/A","N/A","N/A","N/A","N/A","N/A","N/A","N/A","N/A","N/A","N/A","N/A"]
[null,"Emptied and removed offsite","N/A","N/A","N/A","N/A","N/A","N/A","N/A","N/A","N/A","N/A","N/A","N/A","N/A","N/A","N/A","N/A","N/A","N/A",null,null,null,null,null,null,null,null,null,null,null,null,null,null,null,null,null,null,null,null,null,null,null,null,null,null,null,null,null,null,null,null,null,"Emptied and removed offsite","N/A","N/A","N/A","N/A","N/A","N/A","N/A","N/A","N/A","N/A","N/A","N/A","N/A","N/A","N/A","N/A","N/A","N/A"]
["Shared among improved sanitation facilities","Yes",2.1528282030026746,0.37478679218889327,0.5320833853023369,0.47278761691408155,0.26285398135417931,3.186156297286276,0.26983436938793032,0.82656618558570383,0.66984767922362531,0.16742164647068031,1.1174669447383991,0,0,0,0.43686562555381325,1.0442416656774118,0.47726055539851892,0.54954059437571623,null,null,null,null,null,null,null,null,null,null,null,null,null,null,null,null,null,null,null,null,null,null,null,null,null,null,null,null,null,null,null,null,"Shared among improved sanitation facilities","Yes","N/A","N/A","N/A","N/A","N/A","N/A","N/A","N/A","N/A","N/A","N/A","N/A","N/A","N/A","N/A","N/A","N/A","N/A"]
[null,"No",86.397500066966487,95.409104011591566,97.786918987077684,98.747515609982671,99.42477175043237,91.715945068461423,97.62191900064704,98.046905130632041,99.09470279285685,99.33433123978719,84.06733970092975,87.867020873756402,94.744786627955506,97.972654328402299,99.532502426630899,98.503600757459537,88.355304355472057,98.920984545573418,null,null,null,null,null,null,null,null,null,null,null,null,null,null,null,null,null,null,null,null,null,null,null,null,null,null,null,null,null,null,null,null,null,"No","N/A","N/A","N/A","N/A","N/A","N/A","N/A","N/A","N/A","N/A","N/A","N/A","N/A","N/A","N/A","N/A","N/A","N/A"]
[null,"DK/missing",11.449671730030801,4.2161091962195467,1.6809976276200123,0.77969677310325569,0.31237426821344794,5.0978986342523003,2.1082466299650595,1.126528683782269,0.23544952791950863,0.49824711374212649,14.815193354331862,12.132979126243615,5.255213372044472,2.0273456715976828,3.0631947815289294E-2,0.45215757686309416,11.167435089129443,0.52947486005087363,null,null,null,null,null,null,null,null,null,null,null,null,null,null,null,null,null,null,null,null,null,null,null,null,null,null,null,null,null,null,null,null,null,"DK/missing","N/A","N/A","N/A","N/A","N/A","N/A","N/A","N/A","N/A","N/A","N/A","N/A","N/A","N/A","N/A","N/A","N/A","N/A"]
["Shared among all sanitation facilities","Yes",2.5479778780169662,0.37478679218889327,0.5320833853023369,0.47278761691408155,0.26285398135417931,3.5772442017014598,0.26983436938793032,0.82656618558570383,0.66984767922362531,0.16742164647068031,1.5206108915856493,0,0,0,0.43686562555381325,1.1479629547855152,0.57605457435787066,0.54954059437571623,null,null,null,null,null,null,null,null,null,null,null,null,null,null,null,null,null,null,null,null,null,null,null,null,null,null,null,null,null,null,null,null,"Shared among all sanitation facilities","Yes","N/A","N/A","N/A","N/A","N/A","N/A","N/A","N/A","N/A","N/A","N/A","N/A","N/A","N/A","N/A","N/A","N/A","N/A"]
[null,"No",97.452022121983035,99.433706757325453,99.307960426493921,99.348191709987347,99.737146018645802,96.42275579829851,99.490383828110225,99.078779997622561,99.330152320776364,99.832578353529314,98.479389108414352,99.620606599842247,100,99.519651116234101,99.563134374446179,98.791562472095379,99.423945425642103,99.115991493781848,null,null,null,null,null,null,null,null,null,null,null,null,null,null,null,null,null,null,null,null,null,null,null,null,null,null,null,null,null,null,null,null,null,"No","N/A","N/A","N/A","N/A","N/A","N/A","N/A","N/A","N/A","N/A","N/A","N/A","N/A","N/A","N/A","N/A","N/A","N/A"]
["Type of toilet facility","Flush to piped sewer system",30.865524447253236,40.138516127030513,55.454370390419207,49.989660419821107,55.492178206103361,57.411844428185631,58.634696836058964,66.937076520809285,61.852363151134263,72.005753940342245,10.596615856163066,21.287895319000004,17.298060771396585,22.275839452315775,16.921230777690063,40.541502463906255,48.993610278760997,54.778838338158472,null,null,null,null,null,null,null,null,null,null,null,null,null,null,null,null,null,null,null,null,null,null,null,null,null,null,null,null,null,null,null,null,"Type of toilet facility","Flush to piped sewer system",851.88169644910829,1107.6014356250946,1529.0005105024989,1377.2047611992193,1535.6726963588783,995.69367467672862,1017.8181410379274,1158.626152827037,1073.6637563609993,1249.2937079564231,108.82572556732789,218.50517465980971,176.98238280113577,228.71719063650292,173.23519361090871,2613.7023264035101,2029.8760297981091,1757.7827439331836]
[null,"Flush to septic tank",46.551155800883684,55.013602503157635,43.024588170164719,49.409663480174189,44.195447525683271,34.597633131580608,39.496838336477865,32.031048612200209,37.912187320946309,27.495998945915641,52.390857992372894,62.54182529548914,76.807538126949353,76.177163759852377,83.048137274494664,57.164499975057446,34.870059853550892,44.979457660023058,null,null,null,null,null,null,null,null,null,null,null,null,null,null,null,null,null,null,null,null,null,null,null,null,null,null,null,null,null,null,null,null,null,"Flush to septic tank",1284.8016771298564,1518.0716925001477,1186.2837286438144,1361.2259659832791,1223.0506039333779,600.02678560503955,685.6110927785511,554.43130404764565,658.0984036358941,477.05324362784643,538.046600113262,641.94756010178025,785.84422233470298,782.14905988644909,850.22539605930319,3685.3835573933243,1444.7169386297028,1443.3331721674426]
[null,"Flush to pit (latrine)",0.25664476502401201,0.41468835562329665,0,0,0,0.48985365864956204,0,0,0,0,0.26045694035494893,7.9529282090550699E-2,0.63918772960959358,0,0,5.4877935560541824E-2,0.36176578682371779,0,null,null,null,null,null,null,null,null,null,null,null,null,null,null,null,null,null,null,null,null,null,null,null,null,null,null,null,null,null,null,null,null,null,"Flush to pit (latrine)",7.0833391535938874,11.443109071888685,0,0,0,8.4955324862402488,0,0,0,0,2.6748554347837619,0.81631177781371045,6.5397485266448534,0,0,3.5379692198262425,14.98847900565633,0]
[null,"Flush to somewhere else",5.7336225102624034,1.826383274926151,0,0.29259031040103567,0,1.0309759003697982,0,0,0,0,8.7534232430997871,7.8666340165836113,1.9667771144922477,0.78507932390837176,0,0,5.2304625961439939,0,null,null,null,null,null,null,null,null,null,null,null,null,null,null,null,null,null,null,null,null,null,null,null,null,null,null,null,null,null,null,null,null,null,"Flush to somewhere else",158.2467221377733,50.398094710521214,0,8.0608022775303709,0,17.880216059360531,0,0,0,0,89.896401696416063,80.745428987723315,20.122770104794647,8.0608022775303709,0,0,216.70561912582491,0]
[null,"Flush to unknown place / Not sure / DK where",3.8955198384729876E-2,0,0,0,0,6.1993591609498251E-2,0,0,0,0,0,0,0,0,0,0,2.5950215872556952E-2,0,null,null,null,null,null,null,null,null,null,null,null,null,null,null,null,null,null,null,null,null,null,null,null,null,null,null,null,null,null,null,null,null,null,"Flush to unknown place / Not sure / DK where",1.0751549205718567,0,0,0,0,1.0751549205718567,0,0,0,0,0,0,0,0,0,0,1.0751549205718567,0]
[null,"Ventilated Improved Pit latrine (VIP)",4.4655222970795758E-2,0,0,0,0,0,0,0,0,0,0,0.12007397504992551,0,0,0,1.9117082035798715E-2,0,0,null,null,null,null,null,null,null,null,null,null,null,null,null,null,null,null,null,null,null,null,null,null,null,null,null,null,null,null,null,null,null,null,null,"Ventilated Improved Pit latrine (VIP)",1.232474347380156,0,0,0,0,0,0,0,0,0,0,1.232474347380156,0,0,0,1.232474347380156,0,0]
[null,"Pit latrine with slab",10.793392835452879,0.40859026845487534,0,0,0,2.3407765557223148,0,0,0,0,21.936875856777114,4.2170904022844704,0,0,0,1.8282485199003713,4.5811787758622726,4.6697053610223214E-2,null,null,null,null,null,null,null,null,null,null,null,null,null,null,null,null,null,null,null,null,null,null,null,null,null,null,null,null,null,null,null,null,null,"Pit latrine with slab",297.89527195043331,11.27483553429864,0,0,0,40.596090120039079,0,0,0,0,225.28856987919391,43.285447485499041,0,0,0,117.86680609485624,189.8048527641152,1.4984486257605545]
[null,"Pit latrine without slab / Open pit",0.72056271315888387,0,0,0,0,0.38055558992535743,0,0,0,0,1.2938249435675873,0,0,0,0,0.21368781541368662,0.14749577881813766,0,null,null,null,null,null,null,null,null,null,null,null,null,null,null,null,null,null,null,null,null,null,null,null,null,null,null,null,null,null,null,null,null,null,"Pit latrine without slab / Open pit",19.887372642339411,0,0,0,0,6.5999759723017171,0,0,0,0,13.287396670037694,0,0,0,0,13.776409514375516,6.1109631279638945,0]
[null,"No facility, Bush, Field",0.31102696427389004,0,0,0,0,0.29442537036798971,0,0,0,0,0.33866650210762533,0,0,0,0,0.11743744897447672,2.4452628816260185E-2,0,null,null,null,null,null,null,null,null,null,null,null,null,null,null,null,null,null,null,null,null,null,null,null,null,null,null,null,null,null,null,null,null,null,"No facility, Bush, Field",8.5842759101615282,0,0,0,0,5.1062194893679189,0,0,0,0,3.478056420793608,0,0,0,0,7.571168184128231,1.0131077260332959,0]
[null,"Other",4.6202901043929403,2.1982194708077509,1.3716819248607288,0.29670269194418764,0.31237426821344794,3.3919417735891542,1.6312241028827834,1.0318748669905276,0.23544952791950863,0.49824711374212649,4.2568261708847253,3.8869517095022568,3.2884362575522235,0.76191746392342508,0,0,5.7147080895617739,0.18847970523000537,null,null,null,null,null,null,null,null,null,null,null,null,null,null,null,null,null,null,null,null,null,null,null,null,null,null,null,null,null,null,null,null,null,"Other",127.5189922317212,60.658720765366418,37.820325947140383,8.1740975348602447,8.6445450556798704,58.826449532710441,28.315819362971041,17.860911612542161,4.0870487674301224,8.6445450556798704,43.716994458291104,39.896807526152998,33.645117348275662,7.8229878707147247,0,0,236.76860925930825,6.0480722754599068]
[null,"Missing",6.4169437942678667E-2,0,0.14935951455551452,1.1383097659456304E-2,0,0,0.2372407245804235,0,0,0,0.17245249467213966,0,0,0,3.0631947815289294E-2,6.0628759151734962E-2,5.0315995789278624E-2,6.5272429784437929E-3,null,null,null,null,null,null,null,null,null,null,null,null,null,null,null,null,null,null,null,null,null,null,null,null,null,null,null,null,null,null,null,null,null,"Missing",1.7710623951396873,0,4.1181744990696441,0.31360197613150764,0,0,4.1181744990696441,0,0,0,1.7710623951396873,0,0,0,0.31360197613150764,3.9087236340815994,2.0846643712711952,0.20945086498804436]
[null,null,null,null,null,null,null,null,null,null,null,null,null,null,null,null,null,null,null,null,null,null,null,null,null,null,null,null,null,null,null,null,null,null,null,null,null,null,null,null,null,null,null,null,null,null,null,null,null,null,null,null,null,"Total",2759.9780392680755,2759.4478882073113,2757.2227395925188,2754.9792289710213,2767.3678453479338,1734.3000988623614,1735.8632276785186,1730.9183684872246,1735.8492087643222,1734.9914966399492,1026.9856626352469,1026.4292048861596,1023.1342411155539,1026.7500406711977,1023.7741916463433,6446.9794347914622,4143.1444187285615,3208.8718878668283]
[]
[]
[]
[]
[]
[]
[]
[]
[]
[]
[]
[]
[]
[]
[]
[]
[]
[]
[]
[]
[]
[]
[]
[]
[]
[]
[]
[]
[]
[]
[]
[]
[]
[]
[]
[]
[]
[]
[]
[]
[]
[]
[]
[{"$f":"A1026","v":"Montenegro"}]
[{"$f":"A1034","v":"2013"}]
["Access to hygiene facilities "]
[" by wealth quintile and sub-national region"]
["Notes:"]
["WHO/UNICEF JMP customised wealth index excludes water,"]
[" sanitation and hygiene assets."]
["Survey used for analysis:",{"$f":"A1025","v":"MICS13"}]
[]
[]
[]
[]
["Access to handwashing",null,"NATIONAL wealth index quintile",null,null,null,null,"URBAN wealth index quintile",null,null,null,null,"RURAL wealth index quintile",null,null,null,null,"SUB-REGIONS:",null,null,null,null,null,null,null,null,null,null,null,null,null,null,null,null,null,null,null,null,null,null,null,null,null,null,null,null,null,null,null,null,null,null,"Raw numbers of respondents:","Access to handwashing","NATIONAL wealth index quintile",null,null,null,null,"URBAN wealth index quintile",null,null,null,null,"RURAL wealth index quintile",null,null,null,null,"SUB-REGIONS:"]
["Weighted percentage (used in graphs)",null,"Poorest","Poor","Middle","Rich","Richest","Poorest","Poor","Middle","Rich","Richest","Poorest","Poor","Middle","Rich","Richest","Centre","North","South",null,null,null,null,null,null,null,null,null,null,null,null,null,null,null,null,null,null,null,null,null,null,null,null,null,null,null,null,null,null,null,null,"Hygiene data, raw numbers (weighted)",null,"Poorest","Poor","Middle","Rich","Richest","Poorest","Poor","Middle","Rich","Richest","Poorest","Poor","Middle","Rich","Richest","Centre","North","South"]
["Hygiene ladder","Basic","N/A","N/A","N/A","N/A","N/A","N/A","N/A","N/A","N/A","N/A","N/A","N/A","N/A","N/A","N/A","N/A","N/A","N/A",null,null,null,null,null,null,null,null,null,null,null,null,null,null,null,null,null,null,null,null,null,null,null,null,null,null,null,null,null,null,null,null,"Hygiene ladder","Basic","N/A","N/A","N/A","N/A","N/A","N/A","N/A","N/A","N/A","N/A","N/A","N/A","N/A","N/A","N/A","N/A","N/A","N/A"]
[null,"Limited","N/A","N/A","N/A","N/A","N/A","N/A","N/A","N/A","N/A","N/A","N/A","N/A","N/A","N/A","N/A","N/A","N/A","N/A",null,null,null,null,null,null,null,null,null,null,null,null,null,null,null,null,null,null,null,null,null,null,null,null,null,null,null,null,null,null,null,null,null,"Limited","N/A","N/A","N/A","N/A","N/A","N/A","N/A","N/A","N/A","N/A","N/A","N/A","N/A","N/A","N/A","N/A","N/A","N/A"]
[null,"No facility","N/A","N/A","N/A","N/A","N/A","N/A","N/A","N/A","N/A","N/A","N/A","N/A","N/A","N/A","N/A","N/A","N/A","N/A",null,null,null,null,null,null,null,null,null,null,null,null,null,null,null,null,null,null,null,null,null,null,null,null,null,null,null,null,null,null,null,null,null,"No facility","N/A","N/A","N/A","N/A","N/A","N/A","N/A","N/A","N/A","N/A","N/A","N/A","N/A","N/A","N/A","N/A","N/A","N/A"]
[null,null,null,null,null,null,null,null,null,null,null,null,null,null,null,null,null,null,null,null,null,null,null,null,null,null,null,null,null,null,null,null,null,null,null,null,null,null,null,null,null,null,null,null,null,null,null,null,null,null,null,null,"Observed handwashing place","Fixed","N/A","N/A","N/A","N/A","N/A","N/A","N/A","N/A","N/A","N/A","N/A","N/A","N/A","N/A","N/A","N/A","N/A","N/A"]
[null,null,null,null,null,null,null,null,null,null,null,null,null,null,null,null,null,null,null,null,null,null,null,null,null,null,null,null,null,null,null,null,null,null,null,null,null,null,null,null,null,null,null,null,null,null,null,null,null,null,null,null,null,"Mobile","N/A","N/A","N/A","N/A","N/A","N/A","N/A","N/A","N/A","N/A","N/A","N/A","N/A","N/A","N/A","N/A","N/A","N/A"]
[null,null,null,null,null,null,null,null,null,null,null,null,null,null,null,null,null,null,null,null,null,null,null,null,null,null,null,null,null,null,null,null,null,null,null,null,null,null,null,null,null,null,null,null,null,null,null,null,null,null,null,null,"Water / Soap","Water and soap","N/A","N/A","N/A","N/A","N/A","N/A","N/A","N/A","N/A","N/A","N/A","N/A","N/A","N/A","N/A","N/A","N/A","N/A"]
[null,null,null,null,null,null,null,null,null,null,null,null,null,null,null,null,null,null,null,null,null,null,null,null,null,null,null,null,null,null,null,null,null,null,null,null,null,null,null,null,null,null,null,null,null,null,null,null,null,null,null,null,null,"Water only","N/A","N/A","N/A","N/A","N/A","N/A","N/A","N/A","N/A","N/A","N/A","N/A","N/A","N/A","N/A","N/A","N/A","N/A"]
[null,null,null,null,null,null,null,null,null,null,null,null,null,null,null,null,null,null,null,null,null,null,null,null,null,null,null,null,null,null,null,null,null,null,null,null,null,null,null,null,null,null,null,null,null,null,null,null,null,null,null,null,null,"Soap only","N/A","N/A","N/A","N/A","N/A","N/A","N/A","N/A","N/A","N/A","N/A","N/A","N/A","N/A","N/A","N/A","N/A","N/A"]
[null,null,null,null,null,null,null,null,null,null,null,null,null,null,null,null,null,null,null,null,null,null,null,null,null,null,null,null,null,null,null,null,null,null,null,null,null,null,null,null,null,null,null,null,null,null,null,null,null,null,null,null,null,"Neither","N/A","N/A","N/A","N/A","N/A","N/A","N/A","N/A","N/A","N/A","N/A","N/A","N/A","N/A","N/A","N/A","N/A","N/A"]
[]
[]
[]
[]
[]
[]
[]
[]
[]
[]
[]
[]
[]
[]
[]
[]
[]
[]
[]
[]
[]
[]
[]
[]
[]
[]
[]
[]
[null,null,null,null,null,null,null,null,null,null,null,null,null,null,null,null,null,null,null,null,null,null,null,null,null,null,null,null,null,null,null,null,null,null,null,null,null,null,null,null,null,null,null,null,null,null,null,null,null,null,null,null,"Raw numbers of respondents:","Menstrual health and hygiene","NATIONAL wealth index quintile",null,null,null,null,"URBAN wealth index quintile",null,null,null,null,"RURAL wealth index quintile",null,null,null,null,"SUB-REGIONS:"]
[null,null,null,null,null,null,null,null,null,null,null,null,null,null,null,null,null,null,null,null,null,null,null,null,null,null,null,null,null,null,null,null,null,null,null,null,null,null,null,null,null,null,null,null,null,null,null,null,null,null,null,null,"MHH data, raw numbers (weighted)",null,"Poorest","Poor","Middle","Rich","Richest","Poorest","Poor","Middle","Rich","Richest","Poorest","Poor","Middle","Rich","Richest","Centre","North","South"]
[null,null,null,null,null,null,null,null,null,null,null,null,null,null,null,null,null,null,null,null,null,null,null,null,null,null,null,null,null,null,null,null,null,null,null,null,null,null,null,null,null,null,null,null,null,null,null,null,null,null,null,null,"Private place to wash and change","Yes","N/A","N/A","N/A","N/A","N/A","N/A","N/A","N/A","N/A","N/A","N/A","N/A","N/A","N/A","N/A","N/A","N/A","N/A"]
[null,null,null,null,null,null,null,null,null,null,null,null,null,null,null,null,null,null,null,null,null,null,null,null,null,null,null,null,null,null,null,null,null,null,null,null,null,null,null,null,null,null,null,null,null,null,null,null,null,null,null,null,null,"No","N/A","N/A","N/A","N/A","N/A","N/A","N/A","N/A","N/A","N/A","N/A","N/A","N/A","N/A","N/A","N/A","N/A","N/A"]
[null,null,null,null,null,null,null,null,null,null,null,null,null,null,null,null,null,null,null,null,null,null,null,null,null,null,null,null,null,null,null,null,null,null,null,null,null,null,null,null,null,null,null,null,null,null,null,null,null,null,null,null,null,"DK/not sure/missing","N/A","N/A","N/A","N/A","N/A","N/A","N/A","N/A","N/A","N/A","N/A","N/A","N/A","N/A","N/A","N/A","N/A","N/A"]
[null,null,null,null,null,null,null,null,null,null,null,null,null,null,null,null,null,null,null,null,null,null,null,null,null,null,null,null,null,null,null,null,null,null,null,null,null,null,null,null,null,null,null,null,null,null,null,null,null,null,null,null,"Use of menstrual materials","Materials reusable","N/A","N/A","N/A","N/A","N/A","N/A","N/A","N/A","N/A","N/A","N/A","N/A","N/A","N/A","N/A","N/A","N/A","N/A"]
[null,null,null,null,null,null,null,null,null,null,null,null,null,null,null,null,null,null,null,null,null,null,null,null,null,null,null,null,null,null,null,null,null,null,null,null,null,null,null,null,null,null,null,null,null,null,null,null,null,null,null,null,null,"Materials not reusable","N/A","N/A","N/A","N/A","N/A","N/A","N/A","N/A","N/A","N/A","N/A","N/A","N/A","N/A","N/A","N/A","N/A","N/A"]
[null,null,null,null,null,null,null,null,null,null,null,null,null,null,null,null,null,null,null,null,null,null,null,null,null,null,null,null,null,null,null,null,null,null,null,null,null,null,null,null,null,null,null,null,null,null,null,null,null,null,null,null,null,"No materials used","N/A","N/A","N/A","N/A","N/A","N/A","N/A","N/A","N/A","N/A","N/A","N/A","N/A","N/A","N/A","N/A","N/A","N/A"]
[null,null,null,null,null,null,null,null,null,null,null,null,null,null,null,null,null,null,null,null,null,null,null,null,null,null,null,null,null,null,null,null,null,null,null,null,null,null,null,null,null,null,null,null,null,null,null,null,null,null,null,null,null,"DK/not sure/missing","N/A","N/A","N/A","N/A","N/A","N/A","N/A","N/A","N/A","N/A","N/A","N/A","N/A","N/A","N/A","N/A","N/A","N/A"]
[null,null,null,null,null,null,null,null,null,null,null,null,null,null,null,null,null,null,null,null,null,null,null,null,null,null,null,null,null,null,null,null,null,null,null,null,null,null,null,null,null,null,null,null,null,null,null,null,null,null,null,null,"Use of menstrual materials with private place to wash and change","Materials reusable","N/A","N/A","N/A","N/A","N/A","N/A","N/A","N/A","N/A","N/A","N/A","N/A","N/A","N/A","N/A","N/A","N/A","N/A"]
[null,null,null,null,null,null,null,null,null,null,null,null,null,null,null,null,null,null,null,null,null,null,null,null,null,null,null,null,null,null,null,null,null,null,null,null,null,null,null,null,null,null,null,null,null,null,null,null,null,null,null,null,null,"Materials not reusable","N/A","N/A","N/A","N/A","N/A","N/A","N/A","N/A","N/A","N/A","N/A","N/A","N/A","N/A","N/A","N/A","N/A","N/A"]
[null,null,null,null,null,null,null,null,null,null,null,null,null,null,null,null,null,null,null,null,null,null,null,null,null,null,null,null,null,null,null,null,null,null,null,null,null,null,null,null,null,null,null,null,null,null,null,null,null,null,null,null,null,"No materials used","N/A","N/A","N/A","N/A","N/A","N/A","N/A","N/A","N/A","N/A","N/A","N/A","N/A","N/A","N/A","N/A","N/A","N/A"]
[null,null,null,null,null,null,null,null,null,null,null,null,null,null,null,null,null,null,null,null,null,null,null,null,null,null,null,null,null,null,null,null,null,null,null,null,null,null,null,null,null,null,null,null,null,null,null,null,null,null,null,null,"Awareness of menstruation before menarche","Yes","N/A","N/A","N/A","N/A","N/A","N/A","N/A","N/A","N/A","N/A","N/A","N/A","N/A","N/A","N/A","N/A","N/A","N/A"]
[null,null,null,null,null,null,null,null,null,null,null,null,null,null,null,null,null,null,null,null,null,null,null,null,null,null,null,null,null,null,null,null,null,null,null,null,null,null,null,null,null,null,null,null,null,null,null,null,null,null,null,null,null,"No","N/A","N/A","N/A","N/A","N/A","N/A","N/A","N/A","N/A","N/A","N/A","N/A","N/A","N/A","N/A","N/A","N/A","N/A"]
[null,null,null,null,null,null,null,null,null,null,null,null,null,null,null,null,null,null,null,null,null,null,null,null,null,null,null,null,null,null,null,null,null,null,null,null,null,null,null,null,null,null,null,null,null,null,null,null,null,null,null,null,null,"DK/not sure/missing","N/A","N/A","N/A","N/A","N/A","N/A","N/A","N/A","N/A","N/A","N/A","N/A","N/A","N/A","N/A","N/A","N/A","N/A"]
[null,null,null,null,null,null,null,null,null,null,null,null,null,null,null,null,null,null,null,null,null,null,null,null,null,null,null,null,null,null,null,null,null,null,null,null,null,null,null,null,null,null,null,null,null,null,null,null,null,null,null,null,"Participation in (all) activities during menstruation","Yes","N/A","N/A","N/A","N/A","N/A","N/A","N/A","N/A","N/A","N/A","N/A","N/A","N/A","N/A","N/A","N/A","N/A","N/A"]
[null,null,null,null,null,null,null,null,null,null,null,null,null,null,null,null,null,null,null,null,null,null,null,null,null,null,null,null,null,null,null,null,null,null,null,null,null,null,null,null,null,null,null,null,null,null,null,null,null,null,null,null,null,"No","N/A","N/A","N/A","N/A","N/A","N/A","N/A","N/A","N/A","N/A","N/A","N/A","N/A","N/A","N/A","N/A","N/A","N/A"]
[null,null,null,null,null,null,null,null,null,null,null,null,null,null,null,null,null,null,null,null,null,null,null,null,null,null,null,null,null,null,null,null,null,null,null,null,null,null,null,null,null,null,null,null,null,null,null,null,null,null,null,null,null,"DK/not sure/missing/no such activity","N/A","N/A","N/A","N/A","N/A","N/A","N/A","N/A","N/A","N/A","N/A","N/A","N/A","N/A","N/A","N/A","N/A","N/A"]
[null,null,null,null,null,null,null,null,null,null,null,null,null,null,null,null,null,null,null,null,null,null,null,null,null,null,null,null,null,null,null,null,null,null,null,null,null,null,null,null,null,null,null,null,null,null,null,null,null,null,null,null,"Participation in specific activities during menstruation","Did not go to school (amongst those usually attending school)","N/A","N/A","N/A","N/A","N/A","N/A","N/A","N/A","N/A","N/A","N/A","N/A","N/A","N/A","N/A","N/A","N/A","N/A"]
[null,null,null,null,null,null,null,null,null,null,null,null,null,null,null,null,null,null,null,null,null,null,null,null,null,null,null,null,null,null,null,null,null,null,null,null,null,null,null,null,null,null,null,null,null,null,null,null,null,null,null,null,null,"Did not go to work (amongst those who usually work)","N/A","N/A","N/A","N/A","N/A","N/A","N/A","N/A","N/A","N/A","N/A","N/A","N/A","N/A","N/A","N/A","N/A","N/A"]
[null,null,null,null,null,null,null,null,null,null,null,null,null,null,null,null,null,null,null,null,null,null,null,null,null,null,null,null,null,null,null,null,null,null,null,null,null,null,null,null,null,null,null,null,null,null,null,null,null,null,null,null,null,"Did not participate in social activities","N/A","N/A","N/A","N/A","N/A","N/A","N/A","N/A","N/A","N/A","N/A","N/A","N/A","N/A","N/A","N/A","N/A","N/A"]
[null,null,null,null,null,null,null,null,null,null,null,null,null,null,null,null,null,null,null,null,null,null,null,null,null,null,null,null,null,null,null,null,null,null,null,null,null,null,null,null,null,null,null,null,null,null,null,null,null,null,null,null,null,"Did not cook food","N/A","N/A","N/A","N/A","N/A","N/A","N/A","N/A","N/A","N/A","N/A","N/A","N/A","N/A","N/A","N/A","N/A","N/A"]
[null,null,null,null,null,null,null,null,null,null,null,null,null,null,null,null,null,null,null,null,null,null,null,null,null,null,null,null,null,null,null,null,null,null,null,null,null,null,null,null,null,null,null,null,null,null,null,null,null,null,null,null,null,"Did not eat with others","N/A","N/A","N/A","N/A","N/A","N/A","N/A","N/A","N/A","N/A","N/A","N/A","N/A","N/A","N/A","N/A","N/A","N/A"]
[null,null,null,null,null,null,null,null,null,null,null,null,null,null,null,null,null,null,null,null,null,null,null,null,null,null,null,null,null,null,null,null,null,null,null,null,null,null,null,null,null,null,null,null,null,null,null,null,null,null,null,null,null,"Did not bathe in regular place","N/A","N/A","N/A","N/A","N/A","N/A","N/A","N/A","N/A","N/A","N/A","N/A","N/A","N/A","N/A","N/A","N/A","N/A"]
[null,null,null,null,null,null,null,null,null,null,null,null,null,null,null,null,null,null,null,null,null,null,null,null,null,null,null,null,null,null,null,null,null,null,null,null,null,null,null,null,null,null,null,null,null,null,null,null,null,null,null,null,null,"Did not participate in other activities","N/A","N/A","N/A","N/A","N/A","N/A","N/A","N/A","N/A","N/A","N/A","N/A","N/A","N/A","N/A","N/A","N/A","N/A"]
[null,null,null,null,null,null,null,null,null,null,null,null,null,null,null,null,null,null,null,null,null,null,null,null,null,null,null,null,null,null,null,null,null,null,null,null,null,null,null,null,null,null,null,null,null,null,null,null,null,null,null,null,null,"DK/not sure/missing/no such activity","N/A","N/A","N/A","N/A","N/A","N/A","N/A","N/A","N/A","N/A","N/A","N/A","N/A","N/A","N/A","N/A","N/A","N/A"]
[]
[]
[]
[]
[]
[]
[]
[]
[]
[]
[]
[]
[]
[]
[]
[]
[]
[]
[]
[]
[]
[]
[]
[]
[]
[]
[]
[]
[]
[]
[]
[]
[]
[]
[]
[]
[]
[]
[]
[]
[]
[]
[]
[]
[]
[]
[]
[]
[]
[]
[]
[]
[]
[]
[null,null,null,null,null,null,null,null,null,null,null,null,null,null,null,null,null,null,null,null,null,null,null,null,null,null,null,null,null,null,null,null,null,null,null,null,null,null,null,null,null,null,null,null,null,null,null,null,null,null,null,null,"Raw numbers of respondents:","Basic water, sanitation and hygiene","NATIONAL wealth index quintile",null,null,null,null,"URBAN wealth index quintile",null,null,null,null,"RURAL wealth index quintile",null,null,null,null,"SUB-REGIONS:"]
[null,null,null,null,null,null,null,null,null,null,null,null,null,null,null,null,null,null,null,null,null,null,null,null,null,null,null,null,null,null,null,null,null,null,null,null,null,null,null,null,null,null,null,null,null,null,null,null,null,null,null,null,"WatSan data, raw numbers (weighted)",null,"Poorest","Poor","Middle","Rich","Richest","Poorest","Poor","Middle","Rich","Richest","Poorest","Poor","Middle","Rich","Richest","Centre","North","South"]
[null,null,null,null,null,null,null,null,null,null,null,null,null,null,null,null,null,null,null,null,null,null,null,null,null,null,null,null,null,null,null,null,null,null,null,null,null,null,null,null,null,null,null,null,null,null,null,null,null,null,null,null,"Use of Basic Water Sanitation and Hygiene","Yes","N/A","N/A","N/A","N/A","N/A","N/A","N/A","N/A","N/A","N/A","N/A","N/A","N/A","N/A","N/A","N/A","N/A","N/A"]
[null,null,null,null,null,null,null,null,null,null,null,null,null,null,null,null,null,null,null,null,null,null,null,null,null,null,null,null,null,null,null,null,null,null,null,null,null,null,null,null,null,null,null,null,null,null,null,null,null,null,null,null,null,"No","N/A","N/A","N/A","N/A","N/A","N/A","N/A","N/A","N/A","N/A","N/A","N/A","N/A","N/A","N/A","N/A","N/A","N/A"]
[null,null,null,null,null,null,null,null,null,null,null,null,null,null,null,null,null,null,null,null,null,null,null,null,null,null,null,null,null,null,null,null,null,null,null,null,null,null,null,null,null,null,null,null,null,null,null,null,null,null,null,null,"Use of Basic Water and Sanitation","Yes","N/A","N/A","N/A","N/A","N/A","N/A","N/A","N/A","N/A","N/A","N/A","N/A","N/A","N/A","N/A","N/A","N/A","N/A"]
[null,null,null,null,null,null,null,null,null,null,null,null,null,null,null,null,null,null,null,null,null,null,null,null,null,null,null,null,null,null,null,null,null,null,null,null,null,null,null,null,null,null,null,null,null,null,null,null,null,null,null,null,null,"No","N/A","N/A","N/A","N/A","N/A","N/A","N/A","N/A","N/A","N/A","N/A","N/A","N/A","N/A","N/A","N/A","N/A","N/A"]
[null,null,null,null,null,null,null,null,null,null,null,null,null,null,null,null,null,null,null,null,null,null,null,null,null,null,null,null,null,null,null,null,null,null,null,null,null,null,null,null,null,null,null,null,null,null,null,null,null,null,null,null,"Use of Basic Water and Hygiene","Yes","N/A","N/A","N/A","N/A","N/A","N/A","N/A","N/A","N/A","N/A","N/A","N/A","N/A","N/A","N/A","N/A","N/A","N/A"]
[null,null,null,null,null,null,null,null,null,null,null,null,null,null,null,null,null,null,null,null,null,null,null,null,null,null,null,null,null,null,null,null,null,null,null,null,null,null,null,null,null,null,null,null,null,null,null,null,null,null,null,null,null,"No","N/A","N/A","N/A","N/A","N/A","N/A","N/A","N/A","N/A","N/A","N/A","N/A","N/A","N/A","N/A","N/A","N/A","N/A"]
[null,null,null,null,null,null,null,null,null,null,null,null,null,null,null,null,null,null,null,null,null,null,null,null,null,null,null,null,null,null,null,null,null,null,null,null,null,null,null,null,null,null,null,null,null,null,null,null,null,null,null,null,"Use of Basic Sanitation and Hygiene","Yes","N/A","N/A","N/A","N/A","N/A","N/A","N/A","N/A","N/A","N/A","N/A","N/A","N/A","N/A","N/A","N/A","N/A","N/A"]
[null,null,null,null,null,null,null,null,null,null,null,null,null,null,null,null,null,null,null,null,null,null,null,null,null,null,null,null,null,null,null,null,null,null,null,null,null,null,null,null,null,null,null,null,null,null,null,null,null,null,null,null,null,"No","N/A","N/A","N/A","N/A","N/A","N/A","N/A","N/A","N/A","N/A","N/A","N/A","N/A","N/A","N/A","N/A","N/A","N/A"]
[null,null,null,null,null,null,null,null,null,null,null,null,null,null,null,null,null,null,null,null,null,null,null,null,null,null,null,null,null,null,null,null,null,null,null,null,null,null,null,null,null,null,null,null,null,null,null,null,null,null,null,null,"Use of Basic Water","Yes","N/A","N/A","N/A","N/A","N/A","N/A","N/A","N/A","N/A","N/A","N/A","N/A","N/A","N/A","N/A","N/A","N/A","N/A"]
[null,null,null,null,null,null,null,null,null,null,null,null,null,null,null,null,null,null,null,null,null,null,null,null,null,null,null,null,null,null,null,null,null,null,null,null,null,null,null,null,null,null,null,null,null,null,null,null,null,null,null,null,null,"No","N/A","N/A","N/A","N/A","N/A","N/A","N/A","N/A","N/A","N/A","N/A","N/A","N/A","N/A","N/A","N/A","N/A","N/A"]
[null,null,null,null,null,null,null,null,null,null,null,null,null,null,null,null,null,null,null,null,null,null,null,null,null,null,null,null,null,null,null,null,null,null,null,null,null,null,null,null,null,null,null,null,null,null,null,null,null,null,null,null,"Use of Basic Sanitation","Yes","N/A","N/A","N/A","N/A","N/A","N/A","N/A","N/A","N/A","N/A","N/A","N/A","N/A","N/A","N/A","N/A","N/A","N/A"]
[null,null,null,null,null,null,null,null,null,null,null,null,null,null,null,null,null,null,null,null,null,null,null,null,null,null,null,null,null,null,null,null,null,null,null,null,null,null,null,null,null,null,null,null,null,null,null,null,null,null,null,null,null,"No","N/A","N/A","N/A","N/A","N/A","N/A","N/A","N/A","N/A","N/A","N/A","N/A","N/A","N/A","N/A","N/A","N/A","N/A"]
[null,null,null,null,null,null,null,null,null,null,null,null,null,null,null,null,null,null,null,null,null,null,null,null,null,null,null,null,null,null,null,null,null,null,null,null,null,null,null,null,null,null,null,null,null,null,null,null,null,null,null,null,"Access to Basic Hygiene","Yes","N/A","N/A","N/A","N/A","N/A","N/A","N/A","N/A","N/A","N/A","N/A","N/A","N/A","N/A","N/A","N/A","N/A","N/A"]
[null,null,null,null,null,null,null,null,null,null,null,null,null,null,null,null,null,null,null,null,null,null,null,null,null,null,null,null,null,null,null,null,null,null,null,null,null,null,null,null,null,null,null,null,null,null,null,null,null,null,null,null,null,"No","N/A","N/A","N/A","N/A","N/A","N/A","N/A","N/A","N/A","N/A","N/A","N/A","N/A","N/A","N/A","N/A","N/A","N/A"]
[]
[]
[]
[]
[]
[]
[]
[]
[]
[]
[]
[]
[]
[]
[]
[]
[]
[]
[]
[]
[]
[]
[]
[]
[]
[]
[]
[]
[]
[]
[]
[]
[]
[]
[]
[]
[]
[]
[]
[]
[]
[]
[]
[]
[null,null,"INITIAL (national) Wealth Index",null,null,null,null,"URBAN Wealth Index",null,null,null,null,"RURAL Wealth Index"]
[null,null,"Component Matrix",null,null,null,null,"Component Matrix",null,null,null,null,"Component Matrix"]
[null,null,null,null,"Component",null,null,null,null,"Component",null,null,null,null,"Component"]
[null,"Note:\n\nThe INITIAL (national) Wealth Index is based on the first component of the Principal Component Analysis (PCA) which has been obtained at national level.\n\nThe final national-level (NATIONAL) Wealth Index is based on the URBAN and RURAL specific wealth indexes. Regression procedures are used to establish the relationships between the two sets of scores (urban and rural) and the initial (national) wealth factors.\nThis allows best use of the available information for each area and a better precision of the FINAL (NATIONAL) Wealth Index.\n\nFor dependency reasons, all WASH variables (contained in the generic MICS and DHS scripts) have been excluded from the sets of asset variables used in the PCAs.\n\nThe PCA can extracts as many components as there are asset variables in the input. Only the first of the components is used to represent the Wealth Index. \n\nThe scores represent the weights of the asset variables on the Wealth Index (correlations between the variables and the component).\n\nThe communalities are the proportion of each variable's variance that can be explained by the component.\n\nProportion of explained variance is the part of the model's total variance that is explained by the component.\n\nFor more information on the procedure used:\n\nThe DHS Wealth Index, DHS Comparative Reports No. 6, Shea Oscar Rutstein, Kiersten Johnson, ORC Macro International Inc., 2004.\n\nThe DHS Wealth Index: Approaches for Rural and Urban Areas, Shea O. Rutstein, ORC Macro International Inc., 2008.\n\nMICS Methodological Paper No. 4, Review of options for reporting water, sanitation and hygiene coverage by wealth quintile, UNICEF, 2016.",null,null,"1",null,null,null,null,"1",null,null,null,null,"1"]
[null,null,"PC/Laptop",null,0.67691584457559406,null,null,"Refrigetaror",null,0.63011166868098178,null,null,"PC/Laptop",null,0.74609818531548333]
[null,null,"Internet",null,0.65952244056368658,null,null,"Bed",null,0.61474047333424331,null,null,"Internet",null,0.7247396208621838]
[null,null,"Washing machine",null,0.56565475525555542,null,null,"Washing machine",null,0.57466819448108752,null,null,"Car/truck",null,0.59536133935068047]
[null,null,"Vacuum cleaner",null,0.55891048580807823,null,null,"Electricity",null,0.56968296565631049,null,null,"Dishwashing machine",null,0.58331461835902254]
[null,null,"Electric stove",null,0.54466697710056833,null,null,"Television",null,0.56195378453196998,null,null,"Vacuum cleaner",null,0.56321947690443985]
[null,null,"Dishwashing machine",null,0.54247334055169727,null,null,"Closet",null,0.55198170271686442,null,null,"Household owns bank account",null,0.54944984371413663]
[null,null,"Car/truck",null,0.53453659985917146,null,null,"Electric stove",null,0.5432952959067896,null,null,"Bicycle",null,0.5483842148037017]
[null,null,"Household owns bank account",null,0.52922574703914493,null,null,"Vacuum cleaner",null,0.53300866892008869,null,null,"Washing machine",null,0.5478795223738997]
[null,null,"Parquet or ploished wood",null,0.49597053546019265,null,null,"PC/Laptop",null,0.51243086467347154,null,null,"Parquet or ploished wood",null,0.52326387124524198]
[null,null,"Refrigetaror",null,0.44143424281002347,null,null,"Internet",null,0.50011479310800178,null,null,"Electric stove",null,0.52289403543245505]
[null,null,"Bicycle",null,0.43026977761073021,null,null,"Car/truck",null,0.44513208613710981,null,null,"Wood planks",null,-0.47419998010241421]
[null,null,"Closet",null,0.42087145778299057,null,null,"Dishwashing machine",null,0.41795054342627236,null,null,"Drying machine",null,0.36985889022477508]
[null,null,"Wood planks",null,-0.40804352433788699,null,null,"Table with chairs",null,0.41712471101758714,null,null,"Stone with lime/cement",null,-0.36742525851320756]
[null,null,"Television",null,0.39992912378678408,null,null,"Household owns bank account",null,0.39427484371620114,null,null,"Closet",null,0.34355532436717995]
[null,null,"Drying machine",null,0.31713797827429635,null,null,"Mobile telephone",null,0.36180604521129972,null,null,"Refrigetaror",null,0.33971090576068363]
[null,null,"Cement",null,-0.31269984426520486,null,null,"Parquet or ploished wood",null,0.34645409857441051,null,null,"Television",null,0.32729723436631419]
[null,null,"Bed",null,0.30790436736159338,null,null,"Cement",null,-0.34584106696196648,null,null,"Motorcycle",null,0.303580565237904]
[null,null,"Mobile telephone",null,0.30762134581782741,null,null,"Bicycle",null,0.28748699728942373,null,null,"Cement",null,-0.27139140195545319]
[null,null,"Electricity",null,0.30384408788046502,null,null,"Drying machine",null,0.23289145722898144,null,null,"Mobile telephone",null,0.25681989768267482]
[null,null,"Stone with lime/cement",null,-0.3011303119020961,null,null,"Wood planks",null,-0.18971654774266244,null,null,"Bricks",null,0.23862780179266271]
[null,null,"Table with chairs",null,0.28121887170011745,null,null,"Persons per sleeping rooms",null,-0.16249294154018454,null,null,"Vinyl or asphalt strips",null,-0.20792610415802937]
[null,null,"Motorcycle",null,0.22890112782156849,null,null,"Motorcycle",null,0.1578262608327031,null,null,"Cement",null,0.19296598800591483]
[null,null,"Vinyl or asphalt strips",null,-0.209668990729455,null,null,"Vinyl or asphalt strips",null,-0.15749281168225862,null,null,"Table with chairs",null,0.188872096830935]
[null,null,"Cement",null,0.15964283583739797,null,null,"Carpet",null,-0.12424638411893599,null,null,"Cement",null,0.18189219227265785]
[null,null,"Wood planks",null,-0.15568582735996711,null,null,"Video monitoring system",null,0.12213455459640515,null,null,"Metal",null,-0.1710643799860081]
[null,null,"Video monitoring system",null,0.15201474391350969,null,null,"Reused wood",null,-0.11361176795000665,null,null,"Video monitoring system",null,0.15074757915381676]
[null,null,"Carpet",null,-0.14804868816636413,null,null,"Stone with lime/cement",null,-7.6924860731773542E-2,null,null,"Wood planks/shingles",null,-0.14975770359722429]
[null,null,"Bricks",null,0.13592721052270659,null,null,"Metal",null,-6.7953032894814358E-2,null,null,"Wood planks",null,-0.1434265639284652]
[null,null,"Wood planks/shingles",null,-0.12617937922053235,null,null,"Bricks",null,5.7661925913020218E-2,null,null,"Stone with mud",null,-0.13431646774112954]
[null,null,"Metal",null,-0.11773615979114321,null,null,"Cement",null,5.5384047939840982E-2,null,null,"Ceramic tile",null,0.12912019850255149]
[null,null,"Stone with mud",null,-9.6840599064360142E-2,null,null,"Wood planks/shingles",null,-3.9851075527788396E-2,null,null,"Carpet",null,-0.12641168446882081]
[null,null,"Reused wood",null,-9.0694852050998226E-2,null,null,"Ceramic tile",null,-2.2876817147833451E-2,null,null,"Electricity",null,9.0283294269457984E-2]
[null,null,"Cement",null,8.5429397540567803E-2,null,null,"Plywood",null,-1.8282679256146257E-2,null,null,"Roofing shingles",null,-8.8094115750271026E-2]
[null,null,"Persons per sleeping rooms",null,-5.6907463198548058E-2,null,null,"Stone with mud",null,-1.3438095167606389E-2,null,null,"Wood",null,-8.2609865563779805E-2]
[null,null,"Cement blocks",null,3.8243229347189385E-2,null,null,"Covered adobe",null,8.6502712424947458E-3,null,null,"Bed",null,5.590894463662982E-2]
[null,null,"Wood",null,-3.7640764172980568E-2,null,null,"Wood",null,-5.4953012870236568E-3,null,null,"Persons per sleeping rooms",null,2.7009316249570654E-2]
[null,null,"Bamboo with mud",null,-3.1102284636919757E-2,null,null,"Cement blocks",null,4.0644866963619446E-3,null,null,"Cement blocks",null,-2.1847618767884366E-2]
[null,null,"Plywood",null,-2.781450612958165E-2,null,null,"Cement",null,-3.0757825685367567E-3]
[null,null,"Ceramic tile",null,2.1757492104979043E-2,null,null,"Roofing shingles",null,1.8220109813758649E-3]
[null,null,"Covered adobe",null,1.9677415645523548E-2]
[null,null,"Cane/Palm/Trunks",null,-3.5854484073142736E-3,null,null,null,null,null,null,null,"Communalities"]
[null,null,"Calamine/Cement",null,4.2683214134922761E-4,null,null,null,null,null,null,null,null,null,"Extraction"]
[null,null,null,null,null,null,null,"Communalities",null,null,null,null,"Persons per sleeping rooms",null,7.295031642693214E-4]
[null,null,null,null,null,null,null,null,null,"Extraction",null,null,"Wood planks",null,0.22486562112913003]
[null,null,null,null,null,null,null,"Persons per sleeping rooms",null,2.640395605038183E-2,null,null,"Parquet or ploished wood",null,0.27380507895055717]
[null,null,"Communalities",null,null,null,null,"Wood planks",null,3.5992368487393921E-2,null,null,"Vinyl or asphalt strips",null,4.3233264790335679E-2]
[null,null,null,null,"Extraction",null,null,"Parquet or ploished wood",null,0.12003044241900736,null,null,"Ceramic tile",null,1.66720256613383E-2]
[null,null,"Persons per sleeping rooms",null,3.2384593676941017E-3,null,null,"Vinyl or asphalt strips",null,2.4803985731583378E-2,null,null,"Cement",null,7.3653293055346361E-2]
[null,null,"Wood planks",null,0.16649951775408378,null,null,"Ceramic tile",null,5.2334876281540663E-4,null,null,"Carpet",null,1.5979913970244713E-2]
[null,null,"Parquet or ploished wood",null,0.2459867720446702,null,null,"Cement",null,0.11960604359739138,null,null,"Wood planks",null,2.0571179240326115E-2]
[null,null,"Vinyl or asphalt strips",null,4.3961085673508288E-2,null,null,"Carpet",null,1.5437163966630189E-2,null,null,"Metal",null,2.9263022099997368E-2]
[null,null,"Ceramic tile",null,4.7338846269822537E-4,null,null,"Metal",null,4.6176146796037222E-3,null,null,"Wood",null,6.8243898884657725E-3]
[null,null,"Cement",null,9.7781192603483377E-2,null,null,"Wood",null,3.0198336235163858E-5,null,null,"Cement",null,3.3084769609753532E-2]
[null,null,"Carpet",null,2.1918414067781326E-2,null,null,"Cement",null,3.0673927662026039E-3,null,null,"Roofing shingles",null,7.7605732298221498E-3]
[null,null,"Wood planks",null,2.4238076840757485E-2,null,null,"Roofing shingles",null,3.3197240162542425E-6,null,null,"Stone with mud",null,1.8040913506453891E-2]
[null,null,"Metal",null,1.3861803322365607E-2,null,null,"Stone with mud",null,1.805824017336462E-4,null,null,"Cement",null,3.7235872527098868E-2]
[null,null,"Wood",null,1.4168271275259376E-3,null,null,"Plywood",null,3.3425636078312062E-4,null,null,"Stone with lime/cement",null,0.1350013205934974]
[null,null,"Calamine/Cement",null,1.8218567688876701E-7,null,null,"Reused wood",null,1.2907633816726157E-2,null,null,"Bricks",null,5.6943227788398325E-2]
[null,null,"Cement",null,2.5485835034206396E-2,null,null,"Cement",null,9.4604384089145682E-6,null,null,"Cement blocks",null,4.773184458268132E-4]
[null,null,"Cane/Palm/Trunks",null,1.2855440281512462E-5,null,null,"Stone with lime/cement",null,5.917434198602755E-3,null,null,"Wood planks/shingles",null,2.2427369786714085E-2]
[null,null,"Bamboo with mud",null,9.6735210963597477E-4,null,null,"Bricks",null,3.3248976999986327E-3,null,null,"Electricity",null,8.1510732241455441E-3]
[null,null,"Stone with mud",null,9.3781016271441506E-3,null,null,"Cement blocks",null,1.6520052104903235E-5,null,null,"Television",null,0.107123479623838]
[null,null,"Plywood",null,7.7364675123253518E-4,null,null,"Covered adobe",null,7.4827192568731598E-5,null,null,"Refrigetaror",null,0.11540349949274407]
[null,null,"Reused wood",null,8.2255561885524568E-3,null,null,"Wood planks/shingles",null,1.5881082207214951E-3,null,null,"Electric stove",null,0.27341817229083754]
[null,null,"Cement",null,7.2981819641443719E-3,null,null,"Electricity",null,0.32453868135896902,null,null,"Bed",null,3.1258100903817383E-3]
[null,null,"Stone with lime/cement",null,9.0679464746253685E-2,null,null,"Television",null,0.31579205594980375,null,null,"Table with chairs",null,3.5672668961314088E-2]
[null,null,"Bricks",null,1.8476206560484199E-2,null,null,"Refrigetaror",null,0.39704071500793137,null,null,"Vacuum cleaner",null,0.31721617916451084]
[null,null,"Cement blocks",null,1.4625445909017274E-3,null,null,"Electric stove",null,0.29516977855444609,null,null,"PC/Laptop",null,0.55666250213105728]
[null,null,"Covered adobe",null,3.8720068648669489E-4,null,null,"Bed",null,0.37790584955520951,null,null,"Internet",null,0.52524751804746195]
[null,null,"Wood planks/shingles",null,1.592123574047891E-2,null,null,"Table with chairs",null,0.17399302454150559,null,null,"Closet",null,0.11803026090103823]
[null,null,"Electricity",null,9.2321229739911748E-2,null,null,"Vacuum cleaner",null,0.2840982411439647,null,null,"Washing machine",null,0.30017197103665244]
[null,null,"Television",null,0.15994330405286486,null,null,"PC/Laptop",null,0.26258539107000173,null,null,"Drying machine",null,0.13679559867830224]
[null,null,"Refrigetaror",null,0.19486419072525876,null,null,"Internet",null,0.2501148062854594,null,null,"Dishwashing machine",null,0.34025594399133213]
[null,null,"Electric stove",null,0.29666211594387104,null,null,"Closet",null,0.30468380013420887,null,null,"Video monitoring system",null,2.2724832620736247E-2]
[null,null,"Bed",null,9.4805099440343044E-2,null,null,"Washing machine",null,0.33024353374815302,null,null,"Mobile telephone",null,6.5956459845739571E-2]
[null,null,"Table with chairs",null,7.9084053800287116E-2,null,null,"Drying machine",null,5.4238430850238495E-2,null,null,"Bicycle",null,0.30072524704587245]
[null,null,"Vacuum cleaner",null,0.31238093114622201,null,null,"Dishwashing machine",null,0.17468265675031638,null,null,"Motorcycle",null,9.2161159590165284E-2]
[null,null,"PC/Laptop",null,0.45821506063748979,null,null,"Video monitoring system",null,1.4916849426462271E-2,null,null,"Car/truck",null,0.35445512439343613]
[null,null,"Internet",null,0.43496984960708152,null,null,"Mobile telephone",null,0.13090361435144104,null,null,"Household owns bank account",null,0.30189513075748919]
[null,null,"Closet",null,0.1771327839763796,null,null,"Bicycle",null,8.2648773610489126E-2]
[null,null,"Washing machine",null,0.31996530214322227,null,null,"Motorcycle",null,2.4909128608432432E-2]
[null,null,"Drying machine",null,0.10057649726390806,null,null,"Car/truck",null,0.19814257410877534,null,null,"Total Variance Explained"]
[null,null,"Dishwashing machine",null,0.29427732520931771,null,null,"Household owns bank account",null,0.15545265238743483,null,null,"Component",null,"Extraction Sums of Squared Loadings"]
[null,null,"Video monitoring system",null,2.3108482367089931E-2,null,null,null,null,null,null,null,null,null,"Total","% of Variance","Cumulative %"]
[null,null,"Mobile telephone",null,9.4630892402771366E-2,null,null,null,null,null,null,null,"1",null,4.9917612893246304,13.491246727904407,13.491246727904407]
[null,null,"Bicycle",null,0.18513208152518723,null,null,"Total Variance Explained"]
[null,null,"Motorcycle",null,5.2395726317986037E-2,null,null,"Component",null,"Extraction Sums of Squared Loadings"]
[null,null,"Car/truck",null,0.28572937658900399,null,null,null,null,"Total","% of Variance","Cumulative %","Component Score Coefficient Matrix"]
[null,null,"Household owns bank account",null,0.28007989132914102,null,null,"1",null,4.5269301123461529,11.60751310857988,11.60751310857988,null,null,"Component"]
[null,null,null,null,null,null,null,null,null,null,null,null,null,null,"1"]
[null,null,null,null,null,null,null,null,null,null,null,null,"Persons per sleeping rooms",null,5.410778818156374E-3]
[null,null,"Total Variance Explained",null,null,null,null,"Component Score Coefficient Matrix",null,null,null,null,"Wood planks",null,-9.4996525798727055E-2]
[null,null,"Component",null,"Extraction Sums of Squared Loadings",null,null,null,null,"Component",null,null,"Parquet or ploished wood",null,0.10482549964163812]
[null,null,null,null,"Total","% of Variance","Cumulative %",null,null,"1",null,null,"Vinyl or asphalt strips",null,-4.1653855644639845E-2]
[null,null,"1",null,4.7347180951073851,11.27313832168425,11.27313832168425,"Persons per sleeping rooms",null,-3.5894731640990586E-2,null,null,"Ceramic tile",null,2.5866661288208571E-2]
[null,null,null,null,null,null,null,"Wood planks",null,-4.1908433095809119E-2,null,null,"Cement",null,-5.4367864612406509E-2]
[null,null,null,null,null,null,null,"Parquet or ploished wood",null,7.653179748225783E-2,null,null,"Carpet",null,-2.53240644217432E-2]
[null,null,"Component Score Coefficient Matrix",null,null,null,null,"Vinyl or asphalt strips",null,-3.4790201698217837E-2,null,null,"Wood planks",null,-2.8732656794946698E-2]
[null,null,null,null,"Component",null,null,"Ceramic tile",null,-5.0534946597567808E-3,null,null,"Metal",null,-3.4269343037666093E-2]
[null,null,null,null,"1",null,null,"Cement",null,-7.6396378644937563E-2,null,null,"Wood",null,-1.6549241996096468E-2]
[null,null,"Persons per sleeping rooms",null,-1.2019187215676751E-2,null,null,"Carpet",null,-2.7446057490501729E-2,null,null,"Cement",null,3.6438479672826526E-2]
[null,null,"Wood planks",null,-8.6181165624103009E-2,null,null,"Metal",null,-1.5010842051545749E-2,null,null,"Roofing shingles",null,-1.7647902342339351E-2]
[null,null,"Parquet or ploished wood",null,0.10475186177878325,null,null,"Wood",null,-1.21391343595884E-3,null,null,"Stone with mud",null,-2.6907630384565558E-2]
[null,null,"Vinyl or asphalt strips",null,-4.428331032973562E-2,null,null,"Cement",null,1.2234350114836944E-2,null,null,"Cement",null,3.8656894194558443E-2]
[null,null,"Ceramic tile",null,4.5953088796273052E-3,null,null,"Roofing shingles",null,4.0248268388477033E-4,null,null,"Stone with lime/cement",null,-7.3606335963817521E-2]
[null,null,"Cement",null,-6.6044025849888069E-2,null,null,"Stone with mud",null,-2.9684786011953436E-3,null,null,"Bricks",null,4.78043295665984E-2]
[null,null,"Carpet",null,-3.1268744029206319E-2,null,null,"Plywood",null,-4.0386484444026385E-3,null,null,"Cement blocks",null,-4.3767354850496641E-3]
[null,null,"Wood planks",null,-3.2881752246420939E-2,null,null,"Reused wood",null,-2.509686810497844E-2,null,null,"Wood planks/shingles",null,-3.000097458936905E-2]
[null,null,"Metal",null,-2.4866561731057599E-2,null,null,"Cement",null,-6.7944114271794741E-4,null,null,"Electricity",null,1.8086460677223821E-2]
[null,null,"Wood",null,-7.9499483215012545E-3,null,null,"Stone with lime/cement",null,-1.699272107647052E-2,null,null,"Television",null,6.5567485181286897E-2]
[null,null,"Calamine/Cement",null,9.0149430816228348E-5,null,null,"Bricks",null,1.2737533931827369E-2,null,null,"Refrigetaror",null,6.8054317117925631E-2]
[null,null,"Cement",null,3.3717495451812581E-2,null,null,"Cement blocks",null,8.9784613313932074E-4,null,null,"Electric stove",null,0.10475141039911408]
[null,null,"Cane/Palm/Trunks",null,-7.5726755749604027E-4,null,null,"Covered adobe",null,1.9108470923602586E-3,null,null,"Bed",null,1.1200244041356019E-2]
[null,null,"Bamboo with mud",null,-6.5689834140409053E-3,null,null,"Wood planks/shingles",null,-8.8031126036392342E-3,null,null,"Table with chairs",null,3.7836764597469132E-2]
[null,null,"Stone with mud",null,-2.0453297771715336E-2,null,null,"Electricity",null,0.12584311034593446,null,null,"Vacuum cleaner",null,0.11282980981260861]
[null,null,"Plywood",null,-5.8745854707429653E-3,null,null,"Television",null,0.12413573229225942,null,null,"PC/Laptop",null,0.14946591835452697]
[null,null,"Reused wood",null,-1.9155280257280291E-2,null,null,"Refrigetaror",null,0.13919182603736208,null,null,"Internet",null,0.14518715516547445]
[null,null,"Cement",null,1.8043185639467357E-2,null,null,"Electric stove",null,0.12001406746374933,null,null,"Closet",null,6.8824469852335826E-2]
[null,null,"Stone with lime/cement",null,-6.3600473323484411E-2,null,null,"Bed",null,0.13579632512056702,null,null,"Washing machine",null,0.10975675530510519]
[null,null,"Bricks",null,2.8708617449297948E-2,null,null,"Table with chairs",null,9.2142953539303837E-2,null,null,"Drying machine",null,7.4093865629302938E-2]
[null,null,"Cement blocks",null,8.0771924703833976E-3,null,null,"Vacuum cleaner",null,0.11774174897607342,null,null,"Dishwashing machine",null,0.1168554713556712]
[null,null,"Covered adobe",null,4.1559846331415554E-3,null,null,"PC/Laptop",null,0.11319610684422431,null,null,"Video monitoring system",null,3.0199276451020451E-2]
[null,null,"Wood planks/shingles",null,-2.6649818782435997E-2,null,null,"Internet",null,0.11047548353884556,null,null,"Mobile telephone",null,5.1448753815994633E-2]
[null,null,"Electricity",null,6.417363859412073E-2,null,null,"Closet",null,0.1219328969120734,null,null,"Bicycle",null,0.10985786038616772]
[null,null,"Television",null,8.4467357032312104E-2,null,null,"Washing machine",null,0.12694434864673812,null,null,"Motorcycle",null,6.0816322664936077E-2]
[null,null,"Refrigetaror",null,9.323347957424942E-2,null,null,"Drying machine",null,5.1445781456582226E-2,null,null,"Car/truck",null,0.11926879208425271]
[null,null,"Electric stove",null,0.1150368334840039,null,null,"Dishwashing machine",null,9.2325380126017195E-2,null,null,"Household owns bank account",null,0.11007133792418899]
[null,null,"Bed",null,6.5031193236143453E-2,null,null,"Video monitoring system",null,2.6979553818008244E-2]
[null,null,"Table with chairs",null,5.9395061342873749E-2,null,null,"Mobile telephone",null,7.9923046354207578E-2]
[null,null,"Vacuum cleaner",null,0.1180451453668652,null,null,"Bicycle",null,6.3505949982609528E-2,null,null,"Component Score Covariance Matrix"]
[null,null,"PC/Laptop",null,0.14296856348746176,null,null,"Motorcycle",null,3.4863860699388426E-2,null,null,"Component",null,"1"]
[null,null,"Internet",null,0.13929497539572702,null,null,"Car/truck",null,9.8329789744956542E-2,null,null,"1",null,1.0000000000000004]
[null,null,"Closet",null,8.8890499778201709E-2,null,null,"Household owns bank account",null,8.7095412107403167E-2]
[null,null,"Washing machine",null,0.11946957430054266]
[null,null,"Drying machine",null,6.6981385565913737E-2]
[null,null,"Dishwashing machine",null,0.11457352468613949,null,null,"Component Score Covariance Matrix"]
[null,null,"Video monitoring system",null,3.2106398070582902E-2,null,null,"Component",null,"1"]
[null,null,"Mobile telephone",null,6.4971417439975476E-2,null,null,"1",null,0.99999999999999978]
[null,null,"Bicycle",null,9.0875479588816283E-2]
[null,null,"Motorcycle",null,4.8345249542544724E-2]
[null,null,"Car/truck",null,0.11289723888979457]
[null,null,"Household owns bank account",null,0.11177555588494693]
[]
[]
[null,null,"Component Score Covariance Matrix"]
[null,null,"Component",null,"1"]
[null,null,"1",null,1.0000000000000002]
[]
[]
[]
[]
[]
[]
[]
[]
[]
[]
[]
[]
[]
[]
[]
[]
[]
[]
[]
[]
[]
[]
[]
[]
[]
[]
[]
[]
[]
[]
[]
[]
[]
[]
[]
[]
[]
[]
[]
[]
[]
[]
[]
[]
[]
[]
[]
[]
[]
[]
[]
[]
[]
[]
[]
[]
[]
[]
[]
[]
[]
[]
[]
[]
[]
[]
[]
[]
[]
[]
[]
[]
[]
[]
[]
[]
[]
[]
[]
[]
[]
[]
[]
[]
[]
[]
[]
[]
[]
[]
[]
[]
[]
[]
[]
[]
[]
[]
[]
[]
[]
[]
[]
[]
[]
[]
[]
[]
[]
[]
[]
[]
[]
[]
[]
[]
[]
[]
[]
[]
[]
[]
[]
[]
[]
[]
[]
[]
[]
[]
[]
[]
[]
[]
[]
[]
[]
[]
[]
[]
[]
[]
[]
[]
[]
[]
[]
[]
[]
[]
[]
[]
[]
[]
[]
[]
[]
[]
[]
[]
[]
[]
[]
[]
[]
[]
[]
[]
[]
[]
[]
[]
[]
[]
[]
[]
[]
[]
[]
[]
[]
[]
[]
[]
[]
[]
[]
[]
[]
[]
[]
[]
[]
[]
[]
[]
[]
[]
[]
[]
[]
[]
[]
[]
[]
[]
[]
[]
[]
[]
[]
[]
[]
[]
[]
[]
[]
[]
[]
[]
[]
[]
[]
[]
[]
[]
[]
[]
[]
[]
[]
[]
[]
[]
[]
[]
[]
[]
[]
[]
[]
[]
[]
[]
[]
[]
[]
[]
[]
[]
[]
[]
[]
[]
[]
[]
[]
[]
[]
[]
[]
[]
[]
[]
[]
[]
[]
[]
[]
[]
[]
[]
[]
[]
[]
[]
[]
[]
[]
[]
[]
[]
[]
[]
[]
[]
[]
[]
[]
[]
[]
[]
[]
[]
[]
[]
[]
[]
[]
[]
[]
[]
[]
[]
[]
[]
[]
[]
[]
[]
[]
[]
[]
[]
[]
[]
[]
[]
[]
[]
[]
[]
[]
[]
[]
[]
[]
[]
[]
[]
[]
[]
[]
[]
[]
[]
[]
[]
[]
[]
[]
[]
[]
[]
[]
[]
[]
[]
[]
[]
[]
[]
[]
[]
[]
[]
[]
[]
[]
[]
[]
[]
[]
[]
[]
[]
[]
[]
[]
[]
[]
[]
[]
[]
[]
[]
[]
[]
[]
[]
[]
[]
[]
[]
[]
[]
[]
[]
[]
[]
[]
[]
[]
[]
[]
[]
[]
[]
[]
[]
[]
[]
[]
[]
[]
[]
[]
[]
[]
[]
[]
[]
[]
[]
[]
[]
[]
[]
[]
[]
[]
[]
[]
[]
[]
[]
[]
[]
[]
[]
[]
[]
[]
[]
[]
[]
[]
[]
[]
[]
[]
[]
[]
[]
[]
[]
[]
[]
[]
[]
[]
[]
[]
[]
[]
[]
[]
[]
[]
[]
[]
[]
[]
[]
[]
[]
[]
[]
[]
[]
[]
[]
[]
[]
[]
["MICS13"]
["Montenegro",null,"Count"]
["W_text_t","",4052]
["W_text_i","",4052]
["S_text_s","",4052]
["S_text_i","",4052]
["Urban/Rural","Urban",2517]
[null,"Rural",1535]
[null,"Missing",0]
["2013"]
[]
["Sub-national region names","Weighted population"]
[{"$f":"R15","v":"Centre"},{"$f":"BR122+BR123","v":6446.979434791464}]
[{"$f":"S15","v":"North"},{"$f":"BS122+BS123","v":4143.1444187285624}]
[{"$f":"T15","v":"South"},{"$f":"BT122+BT123","v":3208.8718878668283}]
[{"$f":"U15","v":0},{"$f":"BU122+BU123","v":0}]
[{"$f":"V15","v":0},{"$f":"BV122+BV123","v":0}]
[{"$f":"W15","v":0},{"$f":"BW122+BW123","v":0}]
[{"$f":"X15","v":0},{"$f":"BX122+XR123","v":0}]
[{"$f":"Y15","v":0},{"$f":"BY122+BY123","v":0}]
[{"$f":"Z15","v":0},{"$f":"BZ122+BZ123","v":0}]
[{"$f":"AA15","v":0},{"$f":"CA122+CA123","v":0}]
[{"$f":"AB15","v":0},{"$f":"CB122+CB123","v":0}]
[{"$f":"AC15","v":0},{"$f":"CC122+CC123","v":0}]
[{"$f":"AD15","v":0},{"$f":"CD122+CD123","v":0}]
[{"$f":"AE15","v":0},{"$f":"CE122+CE123","v":0}]
[{"$f":"AF15","v":0},{"$f":"CF122+CF123","v":0}]
[{"$f":"AG15","v":0},{"$f":"CG122+CG123","v":0}]
[{"$f":"AH15","v":0},{"$f":"CH122+CH123","v":0}]
[{"$f":"AI15","v":0},{"$f":"CI122+CI123","v":0}]
[{"$f":"AJ15","v":0},{"$f":"CJ122+CJ123","v":0}]
[{"$f":"AK15","v":0},{"$f":"CK122+CK123","v":0}]
[{"$f":"AL15","v":0},{"$f":"CL122+CL123","v":0}]
[{"$f":"AM15","v":0},{"$f":"CM122+CM123","v":0}]
[{"$f":"AN15","v":0},{"$f":"CN122+CN123","v":0}]
[{"$f":"AO15","v":0},{"$f":"CO122+CO123","v":0}]
[{"$f":"AP15","v":0},{"$f":"CP122+CP123","v":0}]
[{"$f":"AQ15","v":0},{"$f":"CQ122+CQ123","v":0}]
[{"$f":"AR15","v":0},{"$f":"CR122+CR123","v":0}]
[{"$f":"AS15","v":0},{"$f":"CS122+CS123","v":0}]
[{"$f":"AT15","v":0},{"$f":"CT122+CT123","v":0}]
[{"$f":"AU15","v":0},{"$f":"CU122+CU123","v":0}]
[{"$f":"AV15","v":0},{"$f":"CV122+CV123","v":0}]
[{"$f":"AW15","v":0},{"$f":"CW122+CW123","v":0}]
[{"$f":"AX15","v":0},{"$f":"CX122+CX123","v":0}]
[{"$f":"AY15","v":0},{"$f":"CY122+CY123","v":0}]
[]
[{"$f":"34-COUNTIF(A1037:A1071,\"0\")","v":3},"Sub-regions"]

{"sheet":"MICS18","index":6,"n_rows":1072,"n_cols":72,"rows_kept":1072,"cut":false,"hidden":false,"merged":[[1023,2,1023,3],[1023,7,1023,8],[1023,12,1023,13],[1021,2,1021,3],[1021,7,1021,8],[1021,12,1021,13],[1022,2,1022,3],[1022,7,1022,8],[1022,12,1022,13],[1019,2,1019,3],[1019,7,1019,8],[1019,12,1019,13],[1020,2,1020,3],[1020,7,1020,8],[1020,12,1020,13],[1017,2,1017,3],[1017,7,1017,8],[1017,12,1017,13],[1018,2,1018,3],[1018,7,1018,8],[1018,12,1018,13],[1015,2,1015,3],[1015,7,1015,8],[1015,12,1015,13],[1016,2,1016,3],[1016,7,1016,8],[1016,12,1016,13],[1013,2,1013,3],[1013,7,1013,8],[1013,12,1013,13],[1014,2,1014,3],[1014,7,1014,8],[1014,12,1014,13],[1011,2,1011,3],[1011,7,1011,8],[1011,12,1011,13],[1012,2,1012,3],[1012,7,1012,8],[1012,12,1012,13],[1009,2,1009,3],[1009,7,1009,8],[1009,12,1009,13],[1010,2,1010,3],[1010,7,1010,8],[1010,12,1010,13],[1007,2,1007,3],[1007,7,1007,8],[1007,12,1007,13],[1008,2,1008,3],[1008,7,1008,8],[1008,12,1008,13],[1005,2,1005,3],[1005,7,1005,8],[1005,12,1005,13],[1006,2,1006,3],[1006,7,1006,8],[1006,12,1006,13],[1003,2,1003,3],[1003,7,1003,8],[1003,12,1003,13],[1004,2,1004,3],[1004,7,1004,8],[1004,12,1004,13],[1001,2,1001,3],[1001,7,1001,8],[1001,12,1001,13],[1002,2,1002,3],[1002,7,1002,8],[1002,12,1002,13],[999,2,999,3],[999,7,999,8],[999,12,999,13],[1000,2,1000,3],[1000,7,1000,8],[1000,12,1000,13],[997,2,997,3],[997,7,997,8],[997,12,997,13],[998,2,998,3],[998,7,998,8],[998,12,998,13],[995,2,995,3],[995,7,995,8],[995,12,995,13],[996,2,996,3],[996,7,996,8],[996,12,996,13],[993,2,993,3],[993,7,993,8],[993,12,993,13],[994,2,994,3],[994,7,994,8],[994,12,994,13],[991,2,991,3],[991,7,991,8],[991,12,991,13],[992,2,992,3],[992,7,992,8],[992,12,992,13],[989,2,989,3],[989,7,989,8],[989,12,989,13],[990,2,990,3],[990,7,990,8],[990,12,990,13],[987,2,987,3],[987,7,987,8],[987,12,987,13],[988,2,988,3],[988,7,988,8],[988,12,988,13],[985,2,985,3],[985,7,985,8],[985,12,985,13],[986,2,986,3],[986,7,986,8],[986,12,986,13],[983,2,983,3],[983,7,983,8],[983,12,983,13],[984,2,984,3],[984,7,984,8],[984,12,984,13],[981,2,981,3],[981,7,981,8],[981,12,981,13],[982,2,982,3],[982,7,982,8],[982,12,982,13],[979,2,979,3],[979,7,979,8],[979,12,979,13],[980,2,980,3],[980,7,980,8],[980,12,980,13],[977,2,977,3],[977,7,977,8],[977,12,977,13],[978,2,978,3],[978,7,978,8],[978,12,978,13],[975,2,975,3],[975,7,975,8],[975,12,975,13],[976,2,976,3],[976,7,976,8],[976,12,976,13],[973,2,973,3],[973,7,973,8],[973,12,973,13],[974,2,974,3],[974,7,974,8],[974,12,974,13],[971,2,971,3],[971,7,971,8],[971,12,971,13],[972,2,972,3],[972,7,972,8],[972,12,972,13],[969,2,969,3],[969,7,969,8],[969,12,969,13],[970,2,970,3],[970,7,970,8],[970,12,970,13],[967,2,967,3],[967,7,967,8],[967,12,967,13],[968,2,968,3],[968,7,968,8],[968,12,968,13],[965,2,965,3],[965,7,965,8],[965,12,965,13],[966,2,966,3],[966,7,966,8],[966,12,966,13],[963,2,963,3],[963,7,963,8],[963,12,963,13],[964,2,964,3],[964,7,964,8],[964,12,964,13],[961,2,961,3],[961,7,961,8],[961,12,961,13],[962,2,962,3],[962,7,962,8],[962,12,962,13],[959,2,959,3],[959,7,959,8],[959,12,959,13],[960,2,960,3],[960,7,960,8],[960,12,960,13],[957,2,957,3],[957,7,957,8],[957,12,957,13],[958,2,958,3],[958,7,958,8],[958,12,958,13],[955,2,955,3],[955,7,955,8],[955,12,955,13],[956,2,956,3],[956,7,956,8],[956,12,956,13],[953,2,953,3],[953,7,953,8],[953,12,953,13],[954,2,954,3],[954,7,954,8],[954,12,954,13],[951,2,951,3],[951,7,951,8],[951,12,951,13],[952,2,952,3],[952,7,952,8],[952,12,952,13],[949,2,949,3],[949,7,949,8],[949,12,949,13],[950,2,950,3],[950,7,950,8],[950,12,950,13],[947,2,947,3],[947,7,947,8],[947,12,947,13],[948,2,948,3],[948,7,948,8],[948,12,948,13],[945,2,945,3],[945,7,945,8],[945,12,945,13],[946,2,946,3],[946,7,946,8],[946,12,946,13],[943,2,943,3],[943,7,943,8],[943,12,943,13],[944,2,944,3],[944,7,944,8],[944,12,944,13],[941,2,941,3],[941,7,941,8],[941,12,941,13],[942,2,942,3],[942,7,942,8],[942,12,942,13],[939,2,939,3],[939,7,939,8],[939,12,939,13],[940,2,940,3],[940,7,940,8],[940,12,940,13],[937,2,937,3],[937,7,937,8],[937,12,937,13],[938,2,938,3],[938,7,938,8],[938,12,938,13],[935,2,935,3],[935,7,935,8],[935,12,935,13],[936,2,936,3],[936,7,936,8],[936,12,936,13],[933,2,933,3],[933,7,933,8],[933,12,933,13],[934,2,934,3],[934,7,934,8],[934,12,934,13],[931,2,931,3],[931,7,931,8],[931,12,931,13],[932,2,932,3],[932,7,932,8],[932,12,932,13],[929,2,929,3],[929,7,929,8],[929,12,929,13],[930,2,930,3],[930,7,930,8],[930,12,930,13],[927,2,927,3],[927,7,927,8],[927,12,927,13],[928,2,928,3],[928,7,928,8],[928,12,928,13],[925,2,925,3],[925,7,925,8],[925,12,925,13],[926,2,926,3],[926,7,926,8],[926,12,926,13],[923,2,923,3],[923,7,923,8],[923,12,923,13],[924,2,924,3],[924,7,924,8],[924,12,924,13],[921,2,921,3],[921,7,921,8],[921,12,921,13],[922,2,922,3],[922,7,922,8],[922,12,922,13],[919,2,919,3],[919,7,919,8],[919,12,919,13],[920,2,920,3],[920,7,920,8],[920,12,920,13],[917,2,917,3],[917,7,917,8],[917,12,917,13],[918,2,918,3],[918,7,918,8],[918,12,918,13],[915,2,915,3],[915,7,915,8],[915,12,915,13],[916,2,916,3],[916,7,916,8],[916,12,916,13],[913,2,913,3],[913,7,913,8],[913,12,913,13],[914,2,914,3],[914,7,914,8],[914,12,914,13],[911,2,911,3],[911,7,911,8],[911,12,911,13],[912,2,912,3],[912,7,912,8],[912,12,912,13],[909,2,909,3],[909,7,909,8],[909,12,909,13],[910,2,910,3],[910,7,910,8],[910,12,910,13],[907,2,907,3],[907,7,907,8],[907,12,907,13],[908,2,908,3],[908,7,908,8],[908,12,908,13],[905,2,905,3],[905,7,905,8],[905,12,905,13],[906,2,906,3],[906,7,906,8],[906,12,906,13],[903,2,903,3],[903,7,903,8],[903,12,903,13],[904,2,904,3],[904,7,904,8],[904,12,904,13],[901,2,901,3],[901,7,901,8],[901,12,901,13],[902,2,902,3],[902,7,902,8],[902,12,902,13],[899,2,899,3],[899,7,899,8],[899,12,899,13],[900,2,900,3],[900,7,900,8],[900,12,900,13],[897,2,897,3],[897,7,897,8],[897,12,897,13],[898,2,898,3],[898,7,898,8],[898,12,898,13],[895,2,895,3],[895,7,895,8],[895,12,895,13],[896,2,896,3],[896,7,896,8],[896,12,896,13],[893,2,893,3],[893,7,893,8],[893,12,893,13],[894,2,894,3],[894,7,894,8],[894,12,894,13],[891,2,891,3],[891,7,891,8],[891,12,891,13],[892,2,892,3],[892,7,892,8],[892,12,892,13],[889,2,889,3],[889,7,889,8],[889,12,889,13],[890,2,890,3],[890,7,890,8],[890,12,890,13],[887,2,887,3],[887,7,887,8],[887,12,887,13],[888,2,888,3],[888,7,888,8],[888,12,888,13],[885,2,885,3],[885,7,885,8],[885,12,885,13],[886,2,886,3],[886,7,886,8],[886,12,886,13],[883,2,883,3],[883,7,883,8],[883,12,883,13],[884,2,884,3],[884,7,884,8],[884,12,884,13],[881,2,881,3],[881,7,881,8],[881,12,881,13],[882,2,882,3],[882,7,882,8],[882,12,882,13],[879,2,879,3],[879,7,879,8],[879,12,879,13],[880,2,880,3],[880,7,880,8],[880,12,880,13],[877,2,877,3],[877,7,877,8],[877,12,877,13],[878,2,878,3],[878,7,878,8],[878,12,878,13],[875,2,875,3],[875,7,875,8],[875,12,875,13],[876,2,876,3],[876,7,876,8],[876,12,876,13],[873,2,873,3],[873,7,873,8],[873,12,873,13],[874,2,874,3],[874,7,874,8],[874,12,874,13],[871,2,871,3],[871,7,871,8],[871,12,871,13],[872,2,872,3],[872,7,872,8],[872,12,872,13],[869,2,869,3],[869,7,869,8],[869,12,869,13],[870,2,870,3],[870,7,870,8],[870,12,870,13],[867,2,867,3],[867,7,867,8],[867,12,867,13],[868,2,868,3],[868,7,868,8],[868,12,868,13],[865,2,865,3],[865,7,865,8],[865,12,865,13],[866,2,866,3],[866,7,866,8],[866,12,866,13],[863,2,863,3],[863,7,863,8],[863,12,863,13],[864,2,864,3],[864,7,864,8],[864,12,864,13],[861,2,861,3],[861,7,861,8],[861,12,861,13],[862,2,862,3],[862,7,862,8],[862,12,862,13],[859,2,859,3],[859,7,859,8],[859,12,859,13],[860,2,860,3],[860,7,860,8],[860,12,860,13],[857,2,857,3],[857,7,857,8],[857,12,857,13],[858,2,858,3],[858,7,858,8],[858,12,858,13],[855,2,855,3],[855,7,855,8],[855,12,855,13],[856,2,856,3],[856,7,856,8],[856,12,856,13],[853,2,853,3],[853,7,853,8],[853,12,853,13],[854,2,854,3],[854,7,854,8],[854,12,854,13],[851,2,851,3],[851,7,851,8],[851,12,851,13],[852,2,852,3],[852,7,852,8],[852,12,852,13],[849,2,849,3],[849,7,849,8],[849,12,849,13],[850,2,850,3],[850,7,850,8],[850,12,850,13],[847,2,847,3],[847,7,847,8],[847,12,847,13],[848,2,848,3],[848,7,848,8],[848,12,848,13],[845,2,845,3],[845,7,845,8],[845,12,845,13],[846,2,846,3],[846,7,846,8],[846,12,846,13],[843,2,843,3],[843,7,843,8],[843,12,843,13],[844,2,844,3],[844,7,844,8],[844,12,844,13],[841,2,841,3],[841,7,841,8],[841,12,841,13],[842,2,842,3],[842,7,842,8],[842,12,842,13],[839,2,839,3],[839,7,839,8],[839,12,839,13],[840,2,840,3],[840,7,840,8],[840,12,840,13],[837,2,837,3],[837,7,837,8],[837,12,837,13],[838,2,838,3],[838,7,838,8],[838,12,838,13],[835,2,835,3],[835,7,835,8],[835,12,835,13],[836,2,836,3],[836,7,836,8],[836,12,836,13],[833,2,833,3],[833,7,833,8],[833,12,833,13],[834,2,834,3],[834,7,834,8],[834,12,834,13],[831,2,831,3],[831,7,831,8],[831,12,831,13],[832,2,832,3],[832,7,832,8],[832,12,832,13],[829,2,829,3],[829,7,829,8],[829,12,829,13],[830,2,830,3],[830,7,830,8],[830,12,830,13],[827,2,827,3],[827,7,827,8],[827,12,827,13],[828,2,828,3],[828,7,828,8],[828,12,828,13],[825,2,825,3],[825,7,825,8],[825,12,825,13],[826,2,826,3],[826,7,826,8],[826,12,826,13],[823,2,823,3],[823,7,823,8],[823,12,823,13],[824,2,824,3],[824,7,824,8],[824,12,824,13],[821,2,821,3],[821,7,821,8],[821,12,821,13],[822,2,822,3],[822,7,822,8],[822,12,822,13],[819,2,819,3],[819,7,819,8],[819,12,819,13],[820,2,820,3],[820,7,820,8],[820,12,820,13],[817,2,817,3],[817,7,817,8],[817,12,817,13],[818,2,818,3],[818,7,818,8],[818,12,818,13],[815,2,815,3],[815,7,815,8],[815,12,815,13],[816,2,816,3],[816,7,816,8],[816,12,816,13],[813,2,813,3],[813,7,813,8],[813,12,813,13],[814,2,814,3],[814,7,814,8],[814,12,814,13],[811,2,811,3],[811,7,811,8],[811,12,811,13],[812,2,812,3],[812,7,812,8],[812,12,812,13],[809,2,809,3],[809,7,809,8],[809,12,809,13],[810,2,810,3],[810,7,810,8],[810,12,810,13],[807,2,807,3],[807,7,807,8],[807,12,807,13],[808,2,808,3],[808,7,808,8],[808,12,808,13],[805,2,805,3],[805,7,805,8],[805,12,805,13],[806,2,806,3],[806,7,806,8],[806,12,806,13],[803,2,803,3],[803,7,803,8],[803,12,803,13],[804,2,804,3],[804,7,804,8],[804,12,804,13],[801,2,801,3],[801,7,801,8],[801,12,801,13],[802,2,802,3],[802,7,802,8],[802,12,802,13],[799,2,799,3],[799,7,799,8],[799,12,799,13],[800,2,800,3],[800,7,800,8],[800,12,800,13],[797,2,797,3],[797,7,797,8],[797,12,797,13],[798,2,798,3],[798,7,798,8],[798,12,798,13],[795,2,795,3],[795,7,795,8],[795,12,795,13],[796,2,796,3],[796,7,796,8],[796,12,796,13],[793,2,793,3],[793,7,793,8],[793,12,793,13],[794,2,794,3],[794,7,794,8],[794,12,794,13],[791,2,791,3],[791,7,791,8],[791,12,791,13],[792,2,792,3],[792,7,792,8],[792,12,792,13],[789,2,789,3],[789,7,789,8],[789,12,789,13],[790,2,790,3],[790,7,790,8],[790,12,790,13],[787,2,787,3],[787,7,787,8],[787,12,787,13],[788,2,788,3],[788,7,788,8],[788,12,788,13],[785,2,785,3],[785,7,785,8],[785,12,785,13],[786,2,786,3],[786,7,786,8],[786,12,786,13],[783,2,783,3],[783,7,783,8],[783,12,783,13],[784,2,784,3],[784,7,784,8],[784,12,784,13],[781,2,781,3],[781,7,781,8],[781,12,781,13],[782,2,782,3],[782,7,782,8],[782,12,782,13],[779,2,779,3],[779,7,779,8],[779,12,779,13],[780,2,780,3],[780,7,780,8],[780,12,780,13],[777,2,777,3],[777,7,777,8],[777,12,777,13],[778,2,778,3],[778,7,778,8],[778,12,778,13],[775,2,775,3],[775,7,775,8],[775,12,775,13],[776,2,776,3],[776,7,776,8],[776,12,776,13],[773,2,773,3],[773,7,773,8],[773,12,773,13],[774,2,774,3],[774,7,774,8],[774,12,774,13],[771,2,771,3],[771,7,771,8],[771,12,771,13],[772,2,772,3],[772,7,772,8],[772,12,772,13],[769,2,769,3],[769,7,769,8],[769,12,769,13],[770,2,770,3],[770,7,770,8],[770,12,770,13],[767,2,767,3],[767,7,767,8],[767,12,767,13],[768,2,768,3],[768,7,768,8],[768,12,768,13],[765,2,765,3],[765,7,765,8],[765,12,765,13],[766,2,766,3],[766,7,766,8],[766,12,766,13],[763,2,763,3],[763,7,763,8],[763,12,763,13],[764,2,764,3],[764,7,764,8],[764,12,764,13],[761,2,761,3],[761,7,761,8],[761,12,761,13],[762,2,762,3],[762,7,762,8],[762,12,762,13],[759,2,759,3],[759,7,759,8],[759,12,759,13],[760,2,760,3],[760,7,760,8],[760,12,760,13],[757,2,757,3],[757,7,757,8],[757,12,757,13],[758,2,758,3],[758,7,758,8],[758,12,758,13],[755,2,755,3],[755,7,755,8],[755,12,755,13],[756,2,756,3],[756,7,756,8],[756,12,756,13],[753,2,753,3],[753,7,753,8],[753,12,753,13],[754,2,754,3],[754,7,754,8],[754,12,754,13],[751,2,751,3],[751,7,751,8],[751,12,751,13],[752,2,752,3],[752,7,752,8],[752,12,752,13],[749,2,749,3],[749,7,749,8],[749,12,749,13],[750,2,750,3],[750,7,750,8],[750,12,750,13],[747,2,747,3],[747,7,747,8],[747,12,747,13],[748,2,748,3],[748,7,748,8],[748,12,748,13],[745,2,745,3],[745,7,745,8],[745,12,745,13],[746,2,746,3],[746,7,746,8],[746,12,746,13],[743,2,743,3],[743,7,743,8],[743,12,743,13],[744,2,744,3],[744,7,744,8],[744,12,744,13],[741,2,741,3],[741,7,741,8],[741,12,741,13],[742,2,742,3],[742,7,742,8],[742,12,742,13],[739,2,739,3],[739,7,739,8],[739,12,739,13],[740,2,740,3],[740,7,740,8],[740,12,740,13],[737,2,737,3],[737,7,737,8],[737,12,737,13],[738,2,738,3],[738,7,738,8],[738,12,738,13],[735,2,735,3],[735,7,735,8],[735,12,735,13],[736,2,736,3],[736,7,736,8],[736,12,736,13],[733,2,733,3],[733,7,733,8],[733,12,733,13],[734,2,734,3],[734,7,734,8],[734,12,734,13],[731,2,731,3],[731,7,731,8],[731,12,731,13],[732,2,732,3],[732,7,732,8],[732,12,732,13],[729,2,729,3],[729,7,729,8],[729,12,729,13],[730,2,730,3],[730,7,730,8],[730,12,730,13],[727,2,727,3],[727,7,727,8],[727,12,727,13],[728,2,728,3],[728,7,728,8],[728,12,728,13],[725,2,725,3],[725,7,725,8],[725,12,725,13],[726,2,726,3],[726,7,726,8],[726,12,726,13],[723,2,723,3],[723,7,723,8],[723,12,723,13],[724,2,724,3],[724,7,724,8],[724,12,724,13],[721,2,721,3],[721,7,721,8],[721,12,721,13],[722,2,722,3],[722,7,722,8],[722,12,722,13],[719,2,719,3],[719,7,719,8],[719,12,719,13],[720,2,720,3],[720,7,720,8],[720,12,720,13],[717,2,717,3],[717,7,717,8],[717,12,717,13],[718,2,718,3],[718,7,718,8],[718,12,718,13],[715,2,715,3],[715,7,715,8],[715,12,715,13],[716,2,716,3],[716,7,716,8],[716,12,716,13],[713,2,713,3],[713,7,713,8],[713,12,713,13],[714,2,714,3],[714,7,714,8],[714,12,714,13],[711,2,711,3],[711,7,711,8],[711,12,711,13],[712,2,712,3],[712,7,712,8],[712,12,712,13],[709,2,709,3],[709,7,709,8],[709,12,709,13],[710,2,710,3],[710,7,710,8],[710,12,710,13],[707,2,707,3],[707,7,707,8],[707,12,707,13],[708,2,708,3],[708,7,708,8],[708,12,708,13],[705,2,705,3],[705,7,705,8],[705,12,705,13],[706,2,706,3],[706,7,706,8],[706,12,706,13],[703,2,703,3],[703,7,703,8],[703,12,703,13],[704,2,704,3],[704,7,704,8],[704,12,704,13],[701,2,701,3],[701,7,701,8],[701,12,701,13],[702,2,702,3],[702,7,702,8],[702,12,702,13],[699,2,699,3],[699,7,699,8],[699,12,699,13],[700,2,700,3],[700,7,700,8],[700,12,700,13],[697,2,697,3],[697,7,697,8],[697,12,697,13],[698,2,698,3],[698,7,698,8],[698,12,698,13],[695,2,695,3],[695,7,695,8],[695,12,695,13],[696,2,696,3],[696,7,696,8],[696,12,696,13],[693,2,693,3],[693,7,693,8],[693,12,693,13],[694,2,694,3],[694,7,694,8],[694,12,694,13],[691,2,691,3],[691,7,691,8],[691,12,691,13],[692,2,692,3],[692,7,692,8],[692,12,692,13],[689,2,689,3]],"merged_total":2020,"flags":["merged_cut"]}
[]
[{"$f":"A1026","v":"Montenegro"}]
[{"$f":"A1034","v":"2018"}]
["Use of drinking water sources"]
[" by wealth quintile and sub-national region"]
["Notes:"]
["WHO/UNICEF JMP customised wealth index excludes water,"]
[" sanitation and hygiene assets."]
["Survey used for analysis:",{"$f":"A1025","v":"MICS18"}]
[{"$f":"B1028","v":""}]
[{"$f":"B1027","v":""}]
[]
[]
["Use of drinking water sources",null,"NATIONAL wealth index quintile",null,null,null,null,"URBAN wealth index quintile",null,null,null,null,"RURAL wealth index quintile",null,null,null,null,"SUB-REGIONS:",null,null,null,null,null,null,null,null,null,null,null,null,null,null,null,null,null,null,null,null,null,null,null,null,null,null,null,null,null,null,null,null,null,null,"Raw numbers of respondents:","Use of drinking water sources","NATIONAL wealth index quintile",null,null,null,null,"URBAN wealth index quintile",null,null,null,null,"RURAL wealth index quintile",null,null,null,null,"SUB-REGIONS:"]
["Weighted percentage (used in graphs)",null,"Poorest","Poor","Middle","Rich","Richest","Poorest","Poor","Middle","Rich","Richest","Poorest","Poor","Middle","Rich","Richest","CENTRE","NORTH","SOUTH",null,null,null,null,null,null,null,null,null,null,null,null,null,null,null,null,null,null,null,null,null,null,null,null,null,null,null,null,null,null,null,null,"Water data, raw numbers (weighted)",null,"Poorest","Poor","Middle","Rich","Richest","Poorest","Poor","Middle","Rich","Richest","Poorest","Poor","Middle","Rich","Richest","CENTRE","NORTH","SOUTH"]
["Water","Improved",99.065344094371824,98.886391151746267,99.619771554031615,99.049859935377256,99.299340170298862,100,99.597884429421939,100,99.690180654582818,99.741838155683809,97.699796243320563,99.266486363272932,97.30157299352274,97.680749666740979,97.778113548499789,99.331834984472238,99.07767728311012,98.909469309983876,null,null,null,null,null,null,null,null,null,null,null,null,null,null,null,null,null,null,null,null,null,null,null,null,null,null,null,null,null,null,null,null,"Water","Improved",2493.2935464771363,2489.8316079500478,2508.3099125964941,2494.6932715404046,2498.7493623645119,1678.7064611152002,1665.5436618875976,1673.8105688419473,1673.2202484978914,1671.5301295395577,822.38298903166276,837.02585540680445,818.87137657082042,821.98192824424473,821.80448179287055,6929.3568778540357,3009.3221560114621,2546.1986670630831]
[null,"Not Improved",0.93465590562814804,1.1136088482536777,0.38022844596841227,0.9501400646227417,0.70065982970111862,0,0.40211557057804742,0,0.30981934541718192,0.25816184431616845,2.3002037566794398,0.7335136367270747,2.6984270064772464,2.3192503332590051,2.2218864515002124,0.66816501552777918,0.92232271688989376,1.0905306900161282,null,null,null,null,null,null,null,null,null,null,null,null,null,null,null,null,null,null,null,null,null,null,null,null,null,null,null,null,null,null,null,null,null,"Not Improved",23.523579905596872,28.039232466477678,9.573709768612007,23.930453084757215,17.631268241032746,0,6.7244504615675904,0,5.200070846742519,4.3264221820177635,19.361846324518034,6.1850671029814457,22.709444147598681,19.516454035389561,18.67448836566092,46.610976698584395,28.014041740183163,28.073225027708954]
["Water ladder","Basic",98.896612450147373,98.293958211156792,99.547361202714498,98.809842536509478,98.977990192441354,100,98.975966112814504,99.966728404554033,99.690180654582818,99.259315436722304,97.195288613324664,98.730848784813276,97.30157299352274,96.818831116294106,97.774296965531605,99.13163980814204,98.779818780029061,98.43741951121126,null,null,null,null,null,null,null,null,null,null,null,null,null,null,null,null,null,null,null,null,null,null,null,null,null,null,null,null,null,null,null,null,"Water ladder","Basic",2489.046879557668,2474.914911689923,2496.6934496159233,2487.2240558603103,2490.6629737652502,1678.7064611152002,1655.1435201941129,1663.4191543166328,1673.2202484978914,1663.443740940296,818.13632211219453,832.50930084016568,818.87137657082042,814.72889758566635,820.36324831609818,6905.6389698768207,3000.2751918792997,2532.6281087329421]
[null,"Limited",0.16873164422445244,0.59243294058944529,7.0918909113990708E-2,0.23947338838241922,0.3213499778575164,0,0.62191831660744568,3.327159544596018E-2,0,0.48252271896152188,0.5045076299958815,0.5356375784596592,0,0.86191855044687737,0,0.19925157304000055,0.29785850308107459,0.47143891156458007,null,null,null,null,null,null,null,null,null,null,null,null,null,null,null,null,null,null,null,null,null,null,null,null,null,null,null,null,null,null,null,null,null,"Limited",4.2466669194682023,14.91669626012381,1.7786787484827813,6.027982203322038,8.0863885992617508,0,10.400141693485038,0.55363029322627055,0,8.0863885992617508,4.2466669194682023,4.5165545666387708,0,7.2530306585785489,0,13.880123745126156,9.0469641321626764,12.12932485336975]
[null,"Unimproved",0.93465590562814804,1.1136088482536777,0.38171988817152758,0.95068407510810449,0.70065982970111862,0,0.40211557057804742,0,0.30981934541718192,0.25816184431616845,2.3002037566794398,0.7335136367270747,2.6984270064772464,2.3192503332590051,2.225703034468403,0.66910861881796135,0.92232271688989376,1.0911415772242063,null,null,null,null,null,null,null,null,null,null,null,null,null,null,null,null,null,null,null,null,null,null,null,null,null,null,null,null,null,null,null,null,null,"Unimproved",23.523579905596872,28.039232466477678,9.573709768612007,23.930453084757215,17.631268241032746,0,6.7244504615675904,0,5.200070846742519,4.3264221820177635,19.361846324518034,6.1850671029814457,22.709444147598681,19.516454035389561,18.67448836566092,46.610976698584395,28.014041740183163,28.073225027708954]
[null,"Surface water","N/A","N/A","N/A","N/A","N/A","N/A","N/A","N/A","N/A","N/A","N/A","N/A","N/A","N/A","N/A","N/A","N/A","N/A",null,null,null,null,null,null,null,null,null,null,null,null,null,null,null,null,null,null,null,null,null,null,null,null,null,null,null,null,null,null,null,null,null,"Surface water","N/A","N/A","N/A","N/A","N/A","N/A","N/A","N/A","N/A","N/A","N/A","N/A","N/A","N/A","N/A","N/A","N/A","N/A"]
["Improved water point at more than 30 minutes","Yes",0.17032358365778752,0.59910462267788334,7.1190658014150893E-2,0.24177187509705719,0.32361743522806857,0,0.62442924382410525,3.327159544596018E-2,0,0.48377163273085838,0.51638554981159768,0.5395955856636796,0,0.88238322636496869,0,0.20059376319837216,0.30063129379785214,0.47663972578620062,null,null,null,null,null,null,null,null,null,null,null,null,null,null,null,null,null,null,null,null,null,null,null,null,null,null,null,null,null,null,null,null,"Improved water point at more than 30 minutes","Yes",4.2466669194682023,14.91669626012381,1.7786787484827813,6.027982203322038,8.0863885992617508,0,10.400141693485038,0.55363029322627055,0,8.0863885992617508,4.2466669194682023,4.5165545666387708,0,7.2530306585785489,0,13.880123745126156,9.0469641321626764,12.12932485336975]
[null,"No",99.82967641634221,99.400895377322072,99.928809341985854,99.758228124902942,99.676382564771941,100,99.375570756175918,99.966728404554033,100,99.51622836726915,99.483614450188398,99.460404414336324,100,99.117616773635049,100,99.79940623680163,99.699368706202151,99.523360274213829,null,null,null,null,null,null,null,null,null,null,null,null,null,null,null,null,null,null,null,null,null,null,null,null,null,null,null,null,null,null,null,null,null,"No",2489.046879557668,2474.914911689923,2496.6934496159233,2487.2240558603103,2490.6629737652502,1678.7064611152002,1655.1435201941129,1663.4191543166328,1673.2202484978914,1663.443740940296,818.13632211219453,832.50930084016568,818.87137657082042,814.72889758566635,820.36324831609818,6905.6389698768207,3000.2751918792997,2532.6281087329421]
["Manually calculated ratios","Improved wells"]
[null,"Improved springs"]
[null,"Other"]
[null,null,"NATIONAL wealth index quintile",null,null,null,null,"URBAN wealth index quintile",null,null,null,null,"RURAL wealth index quintile",null,null,null,null,"SUB-REGIONS:",null,null,null,null,null,null,null,null,null,null,null,null,null,null,null,null,null,null,null,null,null,null,null,null,null,null,null,null,null,null,null,null,null,null,"Raw numbers of respondents:","Use of drinking water sources","NATIONAL wealth index quintile",null,null,null,null,"URBAN wealth index quintile",null,null,null,null,"RURAL wealth index quintile",null,null,null,null,"SUB-REGIONS:"]
["Percentage based on weighted population",null,"Poorest","Poor","Middle","Rich","Richest","Poorest","Poor","Middle","Rich","Richest","Poorest","Poor","Middle","Rich","Richest","CENTRE","NORTH","SOUTH",null,null,null,null,null,null,null,null,null,null,null,null,null,null,null,null,null,null,null,null,null,null,null,null,null,null,null,null,null,null,null,null,"Water data, raw numbers (weighted)",null,"Poorest","Poor","Middle","Rich","Richest","Poorest","Poor","Middle","Rich","Richest","Poorest","Poor","Middle","Rich","Richest","CENTRE","NORTH","SOUTH"]
["Piped water","Yes",84.972369066555146,89.875074826039651,90.607064697037487,93.443584685912811,96.622994394755708,97.606540837185719,97.691335281254908,96.237537931849545,98.838534762907599,98.490999558332376,68.663854953883529,78.058283749865637,73.843153351878627,82.599672381772351,85.974903509035187,93.279130017471431,86.687277939827197,90.421928663981632,null,null,null,null,null,null,null,null,null,null,null,null,null,null,null,null,null,null,null,null,null,null,null,null,null,null,null,null,null,null,null,null,"Piped water","Yes",2138.5991373602042,2262.9383018473868,2281.3804427124624,2353.4922930396046,2431.4023156607141,1638.5273075048831,1633.6610484365358,1610.8340810965758,1658.9260508031507,1650.5678689543813,577.97445283077377,658.19597450254821,621.44981602310111,695.07490686089238,722.60098360753,6507.1221250251501,2632.9840717119478,2327.706293883266]
[null,"No",15.027630933444913,10.12492517396028,9.3929353029625471,6.5564153140872188,3.3770056052442432,2.3934591628142701,2.3086647187450962,3.7624620681504517,1.1614652370924021,1.5090004416676186,31.33614504611646,21.941716250134302,26.156846648121352,17.400327618227649,14.025096490964783,6.7208699825286002,13.312722060172858,9.5780713360185779,null,null,null,null,null,null,null,null,null,null,null,null,null,null,null,null,null,null,null,null,null,null,null,null,null,null,null,null,null,null,null,null,null,"No",378.21798902253107,254.93253856913822,236.50317965264421,165.131431585558,84.978314944829677,40.179153610316931,38.607063912629791,62.976487745371571,19.494268541483205,25.288682767194299,263.770382525407,185.01494800723705,220.13100469531801,146.42347541874213,117.87798655100114,468.84572952747141,404.3521260396987,246.56559820753122]
["Piped water on premises","Yes",84.361172189823606,88.758250244821753,90.607064697037487,93.359637372562091,96.226969834937051,97.060194428960799,96.958321091169097,96.11122035508221,98.244792825869496,98.490999558332376,67.712929072402815,76.651617662807723,73.580806410890204,82.599672381772351,85.974903509035187,92.798776352154178,86.478744920686495,89.810511342541133,null,null,null,null,null,null,null,null,null,null,null,null,null,null,null,null,null,null,null,null,null,null,null,null,null,null,null,null,null,null,null,null,"Piped water on premises","Yes",2123.2164296907085,2234.8181013782973,2281.3804427124624,2351.3779760893676,2421.4368303449965,1629.3557550499406,1621.4030858767362,1608.719764146339,1648.9605654874329,1650.5678689543813,569.97008333534461,646.334812413235,619.24195448400098,695.07490686089238,722.60098360753,6473.6128077444537,2626.6502228373229,2311.9667496340489]
[null,"No",15.638827810176439,11.241749755178182,9.3929353029625471,6.6403626274379475,3.7730301650629099,2.9398055710391837,3.0416789088309315,3.888779644917796,1.7552071741304969,1.5090004416676186,32.287070927597163,23.348382337192206,26.419193589109785,17.400327618227649,14.025096490964783,7.2012236478458558,13.521255079313555,10.189488657459094,null,null,null,null,null,null,null,null,null,null,null,null,null,null,null,null,null,null,null,null,null,null,null,null,null,null,null,null,null,null,null,null,null,"No",393.60069669202647,283.05273903822774,236.50317965264421,167.24574853579486,94.943800260547491,49.350706065259388,50.865026472429712,65.090804695608426,29.459753857201008,25.288682767194299,271.7747520208361,196.87611009655029,222.33886623441813,146.42347541874213,117.87798655100114,502.35504680816842,410.68597491432348,262.30514245674885]
["Piped water into dwelling","Yes",81.878429434534524,87.644898955638766,90.040654733056186,92.689982652737228,95.585600656746905,95.244197710546558,96.802386335177772,96.029790545982266,97.815164063867016,97.944375630299447,64.376654596679131,74.323053073546248,71.832454940674793,81.26533249303472,84.39266301113625,92.153828070126735,83.9573831189945,89.180735637626071,null,null,null,null,null,null,null,null,null,null,null,null,null,null,null,null,null,null,null,null,null,null,null,null,null,null,null,null,null,null,null,null,"Piped water into dwelling","Yes",2060.7303348215664,2206.7853539165576,2267.1188989939328,2334.5118934427865,2405.2975405743455,1598.8705008042807,1618.7954386762237,1607.3567833954362,1641.7495890482344,1641.4072360431635,541.88716524263396,626.70010145888705,604.52816383191964,683.84645828305338,709.30258496535782,6428.6214229117304,2550.0679881582487,2295.7546106792038]
[null,"No",18.121570565465539,12.35510104436114,9.9593452669438527,7.3100173472627779,4.4143993432530735,4.7558022894534435,3.1976136648222471,3.9702094540177568,2.1848359361329797,2.0556243697005723,35.62334540332084,25.67694692645367,28.167545059325182,18.734667506965287,15.607336988863702,7.846171929873293,16.042616881005557,10.819264362374167,null,null,null,null,null,null,null,null,null,null,null,null,null,null,null,null,null,null,null,null,null,null,null,null,null,null,null,null,null,null,null,null,null,"No",456.08679156116909,311.08548649996692,250.76472337117357,184.1118311823752,111.08309003119872,79.835960310919575,53.472673672941959,66.45378544651139,36.670730296399483,34.449315678412383,299.85767011354659,216.51082105089807,237.05265688649942,157.65192399658122,131.17638519317319,547.34643164089175,487.26820959339773,278.51728141159418]
["Water source on premises","Yes",97.575043918547138,97.413389465381201,98.812385153737324,97.72390169096181,98.744865186754907,98.817629520489461,98.745548822945111,97.708884930407564,99.337745214716108,99.488159919335615,95.913492547658663,95.841739596988432,97.736048854805247,95.738088802201787,97.415024860082397,99.145691385164071,98.568654092934736,94.487714287130018,null,null,null,null,null,null,null,null,null,null,null,null,null,null,null,null,null,null,null,null,null,null,null,null,null,null,null,null,null,null,null,null,"Water source on premises","Yes",2455.7854164174687,2452.7433280102182,2487.9808626542813,2461.2973726179339,2484.7966612770583,1658.857931481338,1651.2903253302877,1635.4616426627786,1667.3049004625971,1667.2788461954246,807.34686992965214,808.14801660519288,822.52784209002516,805.63446849596801,818.75279772369788,6916.3715602029915,2993.861410401315,2432.3706703726434]
[null,"No",2.4249560814528053,2.5866105346187664,1.187614846262697,2.2760983090381841,1.2551348132450835,1.1823704795105345,1.2544511770548845,2.2911150695924301,0.66225478528387505,0.51184008066437137,4.0865074523413236,4.1582604030115577,2.2639511451947412,4.2619111977981534,2.5849751399176086,0.8543086148359178,1.4313459070652985,5.5122857128701472,null,null,null,null,null,null,null,null,null,null,null,null,null,null,null,null,null,null,null,null,null,null,null,null,null,null,null,null,null,null,null,null,null,"No",61.031709965263843,65.127512406307957,29.902759710824974,57.32635200722784,31.583969328486358,19.848529633862118,20.977787018877603,38.348926179168629,11.115418882036735,8.577705526150865,34.397965426528536,35.062905904592895,19.052978628393952,35.863913783666057,21.726172434833572,59.596294349627378,43.474787350330928,141.90122171815273]
["Improved water source on premises","Yes",97.73449373410476,97.680061716312466,98.965243209558736,97.955220055552275,98.819990357467219,98.817629520489461,99.044501135529529,97.708884930407564,99.335687044666372,99.486835123425877,96.306806672002921,95.873163417374968,97.954311309951578,96.542675243114402,97.954525790678304,99.23812890558068,98.782869446441339,94.844097923225632,null,null,null,null,null,null,null,null,null,null,null,null,null,null,null,null,null,null,null,null,null,null,null,null,null,null,null,null,null,null,null,null,"Improved water source on premises","Yes",2436.8078249545351,2432.0690512778615,2482.3550054505904,2443.6822838484595,2469.2638789458842,1658.857931481338,1649.6294111110017,1635.4616426627786,1662.1048296158544,1662.9524240134067,792.01079535016243,802.48316619984632,802.11981743426736,793.56334354193086,804.9946830667476,6876.5641107725087,2972.6947765956361,2414.9191571091765]
[null,"No",2.2655062658952274,2.3199382836875242,1.0347567904412933,2.0447799444477126,1.1800096425327711,1.1823704795105345,0.95549886447049581,2.2911150695924301,0.66431295533361112,0.51316487657411791,3.6931933279970899,4.1268365826250246,2.0456886900484244,3.4573247568855789,2.0454742093217098,0.76187109441929912,1.2171305535587069,5.1559020767745132,null,null,null,null,null,null,null,null,null,null,null,null,null,null,null,null,null,null,null,null,null,null,null,null,null,null,null,null,null,null,null,null,null,"No",56.485721522600862,57.762556672185831,25.954907145904293,51.010987691944706,29.485483418627371,19.848529633862118,15.91425077659631,38.348926179168629,11.115418882036735,8.577705526150865,30.372193681500413,34.542689206958045,16.751559136553116,28.41858470231373,16.809798726123095,52.792767081525518,36.627379415827122,131.27950995391046]
["Piped water on premises available when needed","Yes",79.584937083719765,85.896385990345749,83.15162191079834,90.103762005857618,90.409474046753516,84.851713794115355,84.407718491699157,87.97148549434921,90.615517918095208,91.239245630884483,73.114417115272175,79.108800612053031,84.599818484887308,81.468071120662543,87.42132297791801,88.818241158990574,81.821446669000295,82.97881362819389,null,null,null,null,null,null,null,null,null,null,null,null,null,null,null,null,null,null,null,null,null,null,null,null,null,null,null,null,null,null,null,null,"Piped water on premises available when needed","Yes",1665.482639315007,1907.5184645054401,1887.5191132404314,2118.6800154337157,2159.7683246786601,1353.829426748697,1359.4973113647777,1405.1791092763904,1487.9401091300101,1484.0739834838437,416.73030416206831,511.30771803827304,523.87756947573337,566.26411946331075,630.26890603014647,5674.921461990546,2146.969851335431,1917.0772438472713]
[null,"No",20.41506291628016,14.103614009654317,16.84837808920166,9.8962379941425151,9.5905259532464822,15.14828620588457,15.592281508300829,12.028514505650792,9.3844820819048405,8.7607543691154941,26.88558288472781,20.891199387946962,15.40018151511271,18.53192887933746,12.578677022081958,11.181758841009424,18.178553330999883,17.02118637180617,null,null,null,null,null,null,null,null,null,null,null,null,null,null,null,null,null,null,null,null,null,null,null,null,null,null,null,null,null,null,null,null,null,"No",427.22824335239164,313.20181669455735,382.45358225946478,232.69796065565529,229.10557095066028,241.69453642502845,251.13419918656308,192.13290765738205,154.09664496647656,142.50016585511614,153.23977917327625,135.02709437496191,95.364385008267774,128.81078739758166,90.686673868075388,714.44336660593353,476.99970522932438,393.24410207747081]
["Water point at more than 30 minutes","Yes",0.232931313373724,0.68383633805125132,7.0918909113990708E-2,0.23947338838241922,0.3213499778575164,0,0.62191831660744568,3.327159544596018E-2,0,0.48252271896152188,0.69646464598947577,0.5356375784596592,0.27346387122703381,0.86191855044687737,0,0.19925157304000055,0.42682703027178925,0.47143891156458007,null,null,null,null,null,null,null,null,null,null,null,null,null,null,null,null,null,null,null,null,null,null,null,null,null,null,null,null,null,null,null,null,"Water point at more than 30 minutes","Yes",5.8624551876981208,17.218115751964643,1.7786787484827813,6.027982203322038,8.0863885992617508,0,10.400141693485038,0.55363029322627055,0,8.0863885992617508,5.8624551876981208,4.5165545666387708,2.3014194918408322,7.2530306585785489,0,13.880123745126156,12.964171892233425,12.12932485336975]
[null,"No",99.767068686626274,99.316163661948693,99.929081090886001,99.760526611617578,99.678650022142492,100,99.378081683392537,99.966728404554033,100,99.517477281038481,99.303535354010535,99.464362421540343,99.726536128772977,99.138081449553084,100,99.800748426959998,99.573172969728219,99.528561088435438,null,null,null,null,null,null,null,null,null,null,null,null,null,null,null,null,null,null,null,null,null,null,null,null,null,null,null,null,null,null,null,null,null,"No",2510.9546711950356,2500.6527246645605,2506.2671593845348,2511.1545089450674,2508.2942420062832,1678.7064611152002,1661.8679706556802,1663.4191543166328,1678.420319344634,1667.770163122314,835.88238016848277,838.69436794314709,839.27940122657844,834.24535162105565,839.03773668175904,6952.2499465754054,3024.3720258594117,2560.7013337606504]
["Water source available when needed","Yes",79.091443779954261,85.903357128398056,83.227080046861005,89.538527338529576,89.99385482814553,84.636811370529372,84.19214644331305,86.455217172943776,90.184715941581871,91.131197140723145,73.31515267812884,81.354795348933195,85.154824249435421,82.785424395300168,87.779018722925059,88.341035310273853,81.934014993660625,82.372686966449336,null,null,null,null,null,null,null,null,null,null,null,null,null,null,null,null,null,null,null,null,null,null,null,null,null,null,null,null,null,null,null,null,"Water source available when needed","Yes",1966.4597249835524,2150.8250792597205,2086.0666829684637,2255.1385922281925,2235.2832914349174,1392.1694710854197,1398.8495976016277,1437.2339697288264,1507.4343776714929,1505.3623740209925,617.12651120164821,685.99252036768792,716.64666879972606,696.63800704978075,736.31987334764392,6088.2166886163814,2486.4151181680149,2119.1415640904379]
[null,"No",20.908556220045714,14.096642871601897,16.772919953139017,10.461472661470541,10.00614517185449,15.363188629470544,15.807853556686949,13.54478282705624,9.815284058418154,8.8688028592768351,26.684847321871125,18.645204651066766,14.845175750564582,17.214575604699846,12.220981277074904,11.658964689726078,18.065985006339478,17.627313033550866,null,null,null,null,null,null,null,null,null,null,null,null,null,null,null,null,null,null,null,null,null,null,null,null,null,null,null,null,null,null,null,null,null,"No",519.85185437587177,352.94794097850325,420.40919218407601,263.48513239697235,248.5344044549515,252.70519815356514,262.64693942214257,225.16885190055476,164.06213028219437,146.50045808516194,224.61832415453233,157.21840214209757,124.93415191869316,144.86037522985379,102.51369310157926,803.50318678826204,548.24041331106093,453.4849242910513]
["Improved water source available when needed","Yes",78.933979656565697,85.910319687880516,83.232454720792788,89.475376857721272,89.959950526552333,84.636811370529372,84.127908516526105,86.455217172943776,90.154085033810588,91.107907709796351,72.813410084938567,81.217019626509867,85.246866544259092,82.588378249417417,87.727068837222816,88.287064418887425,81.876836254552273,82.322820617062632,null,null,null,null,null,null,null,null,null,null,null,null,null,null,null,null,null,null,null,null,null,null,null,null,null,null,null,null,null,null,null,null,"Improved water source available when needed","Yes",1943.9765784732253,2126.9108116955804,2078.2329642256718,2232.136206154993,2218.5800902054411,1392.1694710854197,1392.1251471400599,1437.2339697288264,1502.2343068247508,1501.0359518389746,598.80509827239996,679.80745326470651,698.06218955446457,678.8615440402117,719.501519005099,6043.3457029436177,2461.7429293149421,2094.7480184963415]
[null,"No",21.06602034343431,14.089680312119505,16.767545279207216,10.524623142278834,10.040049473447617,15.363188629470544,15.872091483473891,13.54478282705624,9.8459149661894596,8.892092290203637,27.186589915061411,18.782980373490084,14.753133455740929,17.411621750582608,12.272931162777152,11.712935581112514,18.123163745447808,17.677179382937585,null,null,null,null,null,null,null,null,null,null,null,null,null,null,null,null,null,null,null,null,null,null,null,null,null,null,null,null,null,null,null,null,null,"No",518.81142098060207,348.82297607616613,418.66920115825542,262.55706538541438,247.60633744339353,252.70519815356514,262.64693942214257,225.16885190055476,164.06213028219437,146.50045808516194,223.57789075926263,157.21840214209757,120.80918701635601,143.12038420403323,100.65755907846335,801.76319576244146,544.89856042395036,449.80524485743905]
["Microbiological quality at point of collection","Not contaminated (No E. coli in 100 mL)","N/A","N/A","N/A","N/A","N/A","N/A","N/A","N/A","N/A","N/A","N/A","N/A","N/A","N/A","N/A","N/A","N/A","N/A",null,null,null,null,null,null,null,null,null,null,null,null,null,null,null,null,null,null,null,null,null,null,null,null,null,null,null,null,null,null,null,null,"Microbiological quality at point of collection","Not contaminated (No E. coli in 100 mL)","N/A","N/A","N/A","N/A","N/A","N/A","N/A","N/A","N/A","N/A","N/A","N/A","N/A","N/A","N/A","N/A","N/A","N/A"]
[null,"Contaminated (E. coli detected in 100 mL)","N/A","N/A","N/A","N/A","N/A","N/A","N/A","N/A","N/A","N/A","N/A","N/A","N/A","N/A","N/A","N/A","N/A","N/A",null,null,null,null,null,null,null,null,null,null,null,null,null,null,null,null,null,null,null,null,null,null,null,null,null,null,null,null,null,null,null,null,null,"Contaminated (E. coli detected in 100 mL)","N/A","N/A","N/A","N/A","N/A","N/A","N/A","N/A","N/A","N/A","N/A","N/A","N/A","N/A","N/A","N/A","N/A","N/A"]
[null,"Highly contaminated (>100 CFU/100 mL)","N/A","N/A","N/A","N/A","N/A","N/A","N/A","N/A","N/A","N/A","N/A","N/A","N/A","N/A","N/A","N/A","N/A","N/A",null,null,null,null,null,null,null,null,null,null,null,null,null,null,null,null,null,null,null,null,null,null,null,null,null,null,null,null,null,null,null,null,null,"Highly contaminated (>100 CFU/100 mL)","N/A","N/A","N/A","N/A","N/A","N/A","N/A","N/A","N/A","N/A","N/A","N/A","N/A","N/A","N/A","N/A","N/A","N/A"]
["Microbiological quality of improved water sources at point of collection","Not contaminated (No E. coli in 100 mL)","N/A","N/A","N/A","N/A","N/A","N/A","N/A","N/A","N/A","N/A","N/A","N/A","N/A","N/A","N/A","N/A","N/A","N/A",null,null,null,null,null,null,null,null,null,null,null,null,null,null,null,null,null,null,null,null,null,null,null,null,null,null,null,null,null,null,null,null,"Microbiological quality of improved water sources at point of collection","Not contaminated (No E. coli in 100 mL)","N/A","N/A","N/A","N/A","N/A","N/A","N/A","N/A","N/A","N/A","N/A","N/A","N/A","N/A","N/A","N/A","N/A","N/A"]
[null,"Contaminated (E. coli detected in 100 mL)","N/A","N/A","N/A","N/A","N/A","N/A","N/A","N/A","N/A","N/A","N/A","N/A","N/A","N/A","N/A","N/A","N/A","N/A",null,null,null,null,null,null,null,null,null,null,null,null,null,null,null,null,null,null,null,null,null,null,null,null,null,null,null,null,null,null,null,null,null,"Contaminated (E. coli detected in 100 mL)","N/A","N/A","N/A","N/A","N/A","N/A","N/A","N/A","N/A","N/A","N/A","N/A","N/A","N/A","N/A","N/A","N/A","N/A"]
[null,"Highly contaminated (>100 CFU/100 mL)","N/A","N/A","N/A","N/A","N/A","N/A","N/A","N/A","N/A","N/A","N/A","N/A","N/A","N/A","N/A","N/A","N/A","N/A",null,null,null,null,null,null,null,null,null,null,null,null,null,null,null,null,null,null,null,null,null,null,null,null,null,null,null,null,null,null,null,null,null,"Highly contaminated (>100 CFU/100 mL)","N/A","N/A","N/A","N/A","N/A","N/A","N/A","N/A","N/A","N/A","N/A","N/A","N/A","N/A","N/A","N/A","N/A","N/A"]
["Microbiological quality of piped on premises at point of collection","Not contaminated (No E. coli in 100 mL)","N/A","N/A","N/A","N/A","N/A","N/A","N/A","N/A","N/A","N/A","N/A","N/A","N/A","N/A","N/A","N/A","N/A","N/A",null,null,null,null,null,null,null,null,null,null,null,null,null,null,null,null,null,null,null,null,null,null,null,null,null,null,null,null,null,null,null,null,"Microbiological quality of piped on premises at point of collection","Not contaminated (No E. coli in 100 mL)","N/A","N/A","N/A","N/A","N/A","N/A","N/A","N/A","N/A","N/A","N/A","N/A","N/A","N/A","N/A","N/A","N/A","N/A"]
[null,"Contaminated (E. coli detected in 100 mL)","N/A","N/A","N/A","N/A","N/A","N/A","N/A","N/A","N/A","N/A","N/A","N/A","N/A","N/A","N/A","N/A","N/A","N/A",null,null,null,null,null,null,null,null,null,null,null,null,null,null,null,null,null,null,null,null,null,null,null,null,null,null,null,null,null,null,null,null,null,"Contaminated (E. coli detected in 100 mL)","N/A","N/A","N/A","N/A","N/A","N/A","N/A","N/A","N/A","N/A","N/A","N/A","N/A","N/A","N/A","N/A","N/A","N/A"]
[null,"Highly contaminated (>100 CFU/100 mL)","N/A","N/A","N/A","N/A","N/A","N/A","N/A","N/A","N/A","N/A","N/A","N/A","N/A","N/A","N/A","N/A","N/A","N/A",null,null,null,null,null,null,null,null,null,null,null,null,null,null,null,null,null,null,null,null,null,null,null,null,null,null,null,null,null,null,null,null,null,"Highly contaminated (>100 CFU/100 mL)","N/A","N/A","N/A","N/A","N/A","N/A","N/A","N/A","N/A","N/A","N/A","N/A","N/A","N/A","N/A","N/A","N/A","N/A"]
[null,null,"NATIONAL wealth index quintile",null,null,null,null,"URBAN wealth index quintile",null,null,null,null,"RURAL wealth index quintile",null,null,null,null,"SUB-REGIONS:",null,null,null,null,null,null,null,null,null,null,null,null,null,null,null,null,null,null,null,null,null,null,null,null,null,null,null,null,null,null,null,null,null,null,"Raw numbers of respondents:","Use of drinking water sources","NATIONAL wealth index quintile",null,null,null,null,"URBAN wealth index quintile",null,null,null,null,"RURAL wealth index quintile",null,null,null,null,"SUB-REGIONS:"]
["Percentage based on weighted population",null,"Poorest","Poor","Middle","Rich","Richest","Poorest","Poor","Middle","Rich","Richest","Poorest","Poor","Middle","Rich","Richest","CENTRE","NORTH","SOUTH",null,null,null,null,null,null,null,null,null,null,null,null,null,null,null,null,null,null,null,null,null,null,null,null,null,null,null,null,null,null,null,null,"Water data, raw numbers (weighted)",null,"Poorest","Poor","Middle","Rich","Richest","Poorest","Poor","Middle","Rich","Richest","Poorest","Poor","Middle","Rich","Richest","CENTRE","NORTH","SOUTH"]
["Main source of drinking water","PIPED WATER: PIPED INTO DWELLING",81.804359524905394,86.73875091649245,88.024995075251994,88.638357112970994,89.19831206471558,94.633298747119241,96.297376728228841,93.63603078057659,92.904872031645297,92.210208068660123,64.155185560845524,73.951531556557683,70.098646023750305,78.150525457035428,77.83365873089727,91.316672826841625,83.620810715437017,78.708532387706271,null,null,null,null,null,null,null,null,null,null,null,null,null,null,null,null,null,null,null,null,null,null,null,null,null,null,null,null,null,null,null,null,"Main source of drinking water","PIPED WATER: PIPED INTO DWELLING",2058.8661306505242,2183.9697166678861,2216.3669345874605,2232.4666913652622,2244.5690476235918,1588.6153004343405,1610.3503240549169,1567.2897794493899,1559.3342498402646,1545.3108132747377,540.02296107159145,623.56739144816538,589.93676051917737,657.63540746398701,654.17553333815124,6370.2217422474587,2539.8451527133543,2026.1716259339]
[null,"PIPED WATER: PIPED TO YARD/PLOT",2.4827427552891046,1.1133512891829538,0.56640996398130317,0.66965471982483016,0.64136917819016326,1.8159967184142602,0.15593475599131565,8.1429809099960199E-2,0.42962876200248329,0.54662392803295357,3.3362744757236662,2.3285645892614637,1.7483514702153979,1.3343398887376416,1.5822404978989222,0.64494828202743371,2.521361801692001,0.62977570491507318,null,null,null,null,null,null,null,null,null,null,null,null,null,null,null,null,null,null,null,null,null,null,null,null,null,null,null,null,null,null,null,null,null,"PIPED WATER: PIPED TO YARD/PLOT",62.486094869142761,28.032747461739071,14.261543718529326,16.866082646580328,16.139289770651231,30.485254245660197,2.6076472005122513,1.3629807509029555,7.2109764391984772,9.1606329112180838,28.082918092710461,19.634710954347796,14.713790652081293,11.22844857783913,13.29839864217208,44.991384832723149,76.58223467907419,16.212138954845376]
[null,"PIPED WATER: PIPED TO NEIGHBOUR",0.16909145474887574,0.1450048623855191,0,0,0.39602455981866691,0.10682119372346659,0.11109587347838941,0,0.59374193703809452,0,0.50558346349325978,0,0,0,0,0.19519184644783819,8.5114123141150813E-2,6.4892936365301968E-2,null,null,null,null,null,null,null,null,null,null,null,null,null,null,null,null,null,null,null,null,null,null,null,null,null,null,null,null,null,null,null,null,null,"PIPED WATER: PIPED TO NEIGHBOUR",4.2557226923694156,3.6510351471910982,0,0,9.9654853157178032,1.7932142808762184,1.8578208663148799,0,9.9654853157178032,0,4.2557226923694156,0,0,0,0,13.616520462908902,2.585202071565083,1.6705206208043326]
[null,"PIPED WATER: PUBLIC TAP/STANDPIPE",0.44210542198264829,0.55876669297643333,0,8.3947313350727873E-2,0,0.43952521450144716,0,0.12631757676734481,0,0,0.44534241798745189,1.4066660870579006,0.26234694098843325,0,0,0.13607653191962529,0.12341889599954746,0.54652438507521695,null,null,null,null,null,null,null,null,null,null,null,null,null,null,null,null,null,null,null,null,null,null,null,null,null,null,null,null,null,null,null,null,null,"PIPED WATER: PUBLIC TAP/STANDPIPE",11.126984977125948,14.069023628413355,0,2.1143169502368577,0,7.3783381740662364,0,2.1143169502368577,0,0,3.7486468030597115,11.861162089313231,2.2078615391001235,0,0,9.492655124303095,3.7486468030597115,14.069023628413355]
[null,"TUBE WELL/BOREHOLE",1.8527956849715563,2.9997774405710396,3.27242666058762,2.4143930621002152,1.2007454764957661,0.44680457762242909,0,0.80385813960206709,0.46472901812577283,0.42916042595617265,3.5252201827257794,6.246090646881246,9.9296324931154683,4.2333194136711088,6.9132729118285443,3.828391395434283,0.64432808700699029,0.34747437861466829,null,null,null,null,null,null,null,null,null,null,null,null,null,null,null,null,null,null,null,null,null,null,null,null,null,null,null,null,null,null,null,null,null,"TUBE WELL/BOREHOLE",46.631479116244414,75.530521453531406,82.395894940845025,60.809476467759936,30.21532659341171,7.5005373131061965,0,13.455062499155654,7.800106270113778,7.1921131157827407,29.673358823027971,52.667718564364804,83.565882629883987,35.623314382772087,58.104604973585261,267.06735309195403,19.570410218944026,8.9449352608945443]
[null,"DUG WELL: PROTECTED WELL",1.8967199730532891,1.6010298292776333,1.3417104826240609,0.35751032869055677,0,0.59204163158603795,0.43728492934785679,0.54340553289134985,0,0,3.5938295817592225,2.9825780495508027,3.0494324973243541,2.2027412696959505,0.58172996626871099,0.88677110694616645,1.4247959186934616,0.99830850538284976,null,null,null,null,null,null,null,null,null,null,null,null,null,null,null,null,null,null,null,null,null,null,null,null,null,null,null,null,null,null,null,null,null,"DUG WELL: PROTECTED WELL",47.736973121327161,40.311863217752027,33.782708501547042,9.0043399563857598,0,9.9386411219266702,7.3125764335927856,9.095579241207318,0,0,30.250874895960891,25.149423886191702,25.663439038236486,18.536032150297302,4.8893180295988339,61.860867364024998,43.275842182564602,25.699175250422392]
[null,"DUG WELL: UNPROTECTED WELL",0.14691717083140746,0,0,0.37572742371189544,0,0,0,0,0,0,0.43928235277109856,0,0,1.1245606923087399,0,0.12634786790961375,2.7963100842190284E-2,0.13586274733361745,null,null,null,null,null,null,null,null,null,null,null,null,null,null,null,null,null,null,null,null,null,null,null,null,null,null,null,null,null,null,null,null,null,"DUG WELL: UNPROTECTED WELL",3.697636517081841,0,0,9.4631600335307038,0,0,0,0,0,0,3.697636517081841,0,0,9.4631600335307038,0,8.8139866502872586,0.84933338389364055,3.4974765164316461]
[null,"SPRING: PROTECTED SPRING",8.9577804498239715,3.3880880031101643,2.994095292330158,2.834371858673705,1.1527373807100216,1.1624056618460079,1.0388710907393004,1.8274506292598647,0.38691687354944737,0.54853944174668301,19.083107604578725,9.7783678946192776,7.8691697667728082,7.297533039206308,3.8861803444828382,0.30120870501641395,10.237386035055939,6.0049925543853773,null,null,null,null,null,null,null,null,null,null,null,null,null,null,null,null,null,null,null,null,null,null,null,null,null,null,null,null,null,null,null,null,null,"SPRING: PROTECTED SPRING",225.45095250493401,85.307679877961419,75.387835003585678,71.387162076655088,29.007260169936686,19.513378949777842,17.372709978847283,30.588061772920287,6.4940914246269079,9.1927341732887431,160.63107268700401,82.452266130619932,66.225423506932316,61.408622471242928,32.662528537812626,21.012222437059261,310.94383174632594,154.58483544968763]
[null,"SPRING: UNPROTECTED SPRING",0.7055609871933487,0.27241383202629393,0.18888330058375596,0.14873022809181036,0,0,0,0,0,0,1.6152099318703133,0.49355783588424057,1.1177807718457609,0.26237264213378358,0.44569286602172675,0,0.8943596160477032,0.23128156617030687,null,null,null,null,null,null,null,null,null,null,null,null,null,null,null,null,null,null,null,null,null,null,null,null,null,null,null,null,null,null,null,null,null,"SPRING: UNPROTECTED SPRING",17.757679762757288,6.8590284418513132,4.7558616907810451,3.7459548104094522,0,0,0,0,0,0,13.59594618167845,4.1617335810788401,9.4070285935322353,2.2078615391001235,3.7459548104094522,0,27.16470835628952,5.9538163495095757]
[null,"RAINWATER",1.1529041407912273,0.85750137419159278,0.63531939880750576,0,0.32286291833733582,0.19220729175979481,0.13886984184798679,0,0,0.27313872964859448,2.1377873116456376,1.7087074469718262,2.6101848844314679,0.79447083462885515,0.42202681688447491,0.86141205340629201,0,0.56856857505946834,null,null,null,null,null,null,null,null,null,null,null,null,null,null,null,null,null,null,null,null,null,null,null,null,null,null,null,null,null,null,null,null,null,"RAINWATER",29.016488866209311,21.590777056941121,15.996603092282637,0,8.1244599404485172,3.2265962255062193,2.3222760828936,0,0,4.5774132961050524,17.994714286676899,14.408007826604546,21.966815372666471,6.6854592210853268,3.5470466443434656,60.091827940864569,0,14.636501015017032]
[null,"TANKER-TRUCK",0.23277477917671699,0.1649196785561777,0.76915502264478919,0,0,0,0.29152328623190449,0.5877477663971703,0,0,0.69599660872765523,0.49245857538408183,0,0.55301272776642263,0,0.17492170619766315,8.3889302526570855E-2,0.56819663256008845,null,null,null,null,null,null,null,null,null,null,null,null,null,null,null,null,null,null,null,null,null,null,null,null,null,null,null,null,null,null,null,null,null,"TANKER-TRUCK",5.8585155082192033,4.152464496474666,19.366428345771766,0,0,0,4.8750509557285238,9.8377842320883158,0,0,5.8585155082192033,4.152464496474666,0,4.6535931579549255,0,12.202481994983959,2.5480001516809216,14.626926203800753]
[null,"PACKAGED WATER: BOTTLED WATER",7.4069909629144254E-2,1.9716989556717357,2.1724521532894352,4.4128407008732022,6.747140959223338,0.61089896342732197,1.4179476206560511,2.3937597654056568,5.2201113776389185,5.9004545446516357,0.221469035833607,0.37152151698857688,3.1077024567482332,4.0471240348157727,7.3048318606887115,1.4260576226639652,0.33657240355749196,10.777078338570208,null,null,null,null,null,null,null,null,null,null,null,null,null,null,null,null,null,null,null,null,null,null,null,null,null,null,null,null,null,null,null,null,null,"PACKAGED WATER: BOTTLED WATER",1.8642041710425163,49.644833065655817,54.699816971392764,111.14285282210774,169.78374821754926,10.255200369940237,23.711885910044849,40.067003946046086,87.615410054712711,98.883154067897905,1.8642041710425163,3.1327100107217296,26.153827840988257,34.056483281824995,61.395575594528765,99.4813213444355,10.222835444894447,277.43129845841815]
[null,"OTHER (specify)",8.2177747603391929E-2,0.18869712555794918,3.4552649899405305E-2,6.4467251712167981E-2,0.34080746250913813,0,0.11109587347838941,0,0,9.187486130383582E-2,0.24571147203802771,0.23995580084283405,0.20675269480775563,0,1.0303660050287509,0.10200005518909404,0,0.41851128786179409,null,null,null,null,null,null,null,null,null,null,null,null,null,null,null,null,null,null,null,null,null,null,null,null,null,null,null,null,null,null,null,null,null,"OTHER (specify)",2.0682636257577447,4.7511499011277643,0.86999551291027921,1.6236874962364833,8.576012974238207,0,1.8578208663148799,0,0,1.5396908825454432,2.0682636257577447,2.0233335219026056,1.7399910258205584,0,8.6600095879292471,7.1154910616171305,0,10.773618448653348]
[]
[]
[]
[]
[]
[]
[]
[]
[]
[]
[]
[]
[]
[]
[]
[]
[]
[]
[]
[]
[]
[]
[]
[]
[]
[]
[]
[]
[]
[]
[]
[]
[]
[]
[]
[]
[]
[{"$f":"A1026","v":"Montenegro"}]
[{"$f":"A1034","v":"2018"}]
["Use of sanitation facilities"]
[" by wealth quintile and sub-national region"]
["Notes:"]
["WHO/UNICEF JMP customised wealth index excludes water,"]
[" sanitation and hygiene assets."]
["Survey used for analysis:",{"$f":"A1025","v":"MICS18"}]
[{"$f":"B1030","v":""}]
[{"$f":"B1029","v":""}]
[]
[]
["Use of sanitation facilities",null,"NATIONAL wealth index quintile",null,null,null,null,"URBAN wealth index quintile",null,null,null,null,"RURAL wealth index quintile",null,null,null,null,"SUB-REGIONS:",null,null,null,null,null,null,null,null,null,null,null,null,null,null,null,null,null,null,null,null,null,null,null,null,null,null,null,null,null,null,null,null,null,null,"Raw numbers of respondents:","Use of sanitation facilities","NATIONAL wealth index quintile",null,null,null,null,"URBAN wealth index quintile",null,null,null,null,"RURAL wealth index quintile",null,null,null,null,"SUB-REGIONS:"]
["Weighted percentage (used in graphs)",null,"Poorest","Poor","Middle","Rich","Richest","Poorest","Poor","Middle","Rich","Richest","Poorest","Poor","Middle","Rich","Richest","CENTRE","NORTH","SOUTH",null,null,null,null,null,null,null,null,null,null,null,null,null,null,null,null,null,null,null,null,null,null,null,null,null,null,null,null,null,null,null,null,"Sanitation data, raw numbers (weighted)",null,"Poorest","Poor","Middle","Rich","Richest","Poorest","Poor","Middle","Rich","Richest","Poorest","Poor","Middle","Rich","Richest","CENTRE","NORTH","SOUTH"]
["Sanitation","Improved",91.302563686679676,96.69488549519285,98.558332403558182,99.086242971063683,99.622038416043125,98.013706216885041,99.365268794337794,99.402351688347366,99.846731619146212,99.432472183848262,82.298167737379771,92.707595407457617,92.988379917259579,96.847966484376713,98.944782041047404,99.511647889276873,89.390708032809997,99.431509340802123,null,null,null,null,null,null,null,null,null,null,null,null,null,null,null,null,null,null,null,null,null,null,null,null,null,null,null,null,null,null,null,null,"Sanitation","Improved",2297.9185596928569,2434.6523260576105,2481.5841100653524,2495.6096233089415,2506.869678515724,1645.36241904132,1661.653704797747,1663.8070682370001,1675.8478316972535,1666.3455996317543,692.74057652216084,781.72057047186331,782.57237088043485,814.97407123675259,831.6100851241988,6941.9005682915449,2715.0963325070252,2559.6373968418993]
[null,"Not Improved",8.6974363133203312,3.3051145048071042,1.4416675964418388,0.91375702893634636,0.377961583956897,1.986293783114933,0.63473120566219365,0.59764831165263743,0.15326838085378525,0.56752781615173742,17.701832262620208,7.292404592542348,7.0116200827404231,3.1520335156232675,1.0552179589526045,0.4883521107231264,10.609291967190044,0.56849065919788011,null,null,null,null,null,null,null,null,null,null,null,null,null,null,null,null,null,null,null,null,null,null,null,null,null,null,null,null,null,null,null,null,null,"Not Improved",218.89856668987713,83.218514358915172,36.299512299753722,23.014101316220824,9.5109520898212701,33.344042073879926,10.614407551418266,10.003500604947304,2.5724876473804521,9.5109520898212701,149.00425883401977,61.490352037922321,59.008449837984358,26.524311042881685,8.8688850343327239,34.067286261074514,322.23986524462077,14.634495248892684]
["Sanitation ladder","Basic",87.363879911292855,96.182506241984399,98.170495840065712,98.665464078093649,99.622038416043125,93.046650159918514,99.365268794337794,98.886453754372212,99.72979530345556,99.432472183848262,79.579395387688606,92.032537654367644,92.988379917259579,95.68750396663944,98.944782041047404,98.33106480272491,89.073197480715365,97.868891764172773,null,null,null,null,null,null,null,null,null,null,null,null,null,null,null,null,null,null,null,null,null,null,null,null,null,null,null,null,null,null,null,null,"Sanitation ladder","Basic",2197.4616376571571,2421.7512782487311,2471.8188367516318,2485.0117862823831,2506.869678515724,1561.9801280858089,1661.653704797747,1655.1719140936868,1673.8851488140085,1666.3455996317543,669.85545068354361,774.63001742141114,782.57237088043485,805.20879792303197,831.6100851241988,6858.0493760931768,2705.4524695765735,2519.4113717858595]
[null,"Limited",3.9334297821598585,0.51237925320845257,0.38783656349247575,0.42077889297002025,0,4.9670560569665216,0,0.5158979339751496,0.11693631569064308,0,2.7187723496911742,0.66189321967919124,0,1.1604625177372756,0,1.1804766940936637,0.31751055209463064,1.5626175766293982,null,null,null,null,null,null,null,null,null,null,null,null,null,null,null,null,null,null,null,null,null,null,null,null,null,null,null,null,null,null,null,null,null,"Limited",98.937467744002404,12.901047808879589,9.7652733137206909,10.597837026558047,0,83.382290955510911,0,8.6351541433133061,1.9626828832447409,0,22.885125838617341,5.571098758753755,0,9.7652733137206909,0,82.331737906668536,9.6438629304513093,40.226025056040889]
[null,"Unimproved",8.2862362009660497,3.3051145048071042,1.4416675964418388,0.91375702893634636,0.377961583956897,1.7475895002174942,0.63473120566219365,0.59764831165263743,0.15326838085378525,0.56752781615173742,16.933438334747926,7.3055691259531459,7.0116200827404231,3.1520335156232675,1.0552179589526045,0.43100386318711481,10.451344500399827,0.5035977228325782,null,null,null,null,null,null,null,null,null,null,null,null,null,null,null,null,null,null,null,null,null,null,null,null,null,null,null,null,null,null,null,null,null,"Unimproved",208.42350626686368,83.218514358915172,36.299512299753722,23.014101316220824,9.5109520898212701,29.336897853921915,10.614407551418266,10.003500604947304,2.5724876473804521,9.5109520898212701,142.53634263096436,61.490352037922321,59.008449837984358,26.524311042881685,8.8688850343327239,30.060142041116496,317.44246966236972,12.963974628088351]
[null,"Open defecation",0.41645410558127743,0,0,0,0,0.23870428289743886,0,0,0,0,0.76839392787227889,0,0,0,0,5.7454639994298347E-2,0.15794746679021868,6.4892936365301968E-2,null,null,null,null,null,null,null,null,null,null,null,null,null,null,null,null,null,null,null,null,null,null,null,null,null,null,null,null,null,null,null,null,null,"Open defecation",10.475060423013415,0,0,0,0,4.0071442199580121,0,0,0,0,6.4679162030554043,0,0,0,0,4.0071442199580121,4.7973955822510703,1.6705206208043326]
["Shared among improved sanitation facilities","Yes",4.3083742504210303,0.52989281758229634,0.3935096648190386,0.42465924668563831,0,5.0677157804597295,0,0.51899972708153419,0.11711581720740055,0,3.303563644778825,0.71405931665794631,0,1.1982311656739626,0,1.1862711363298537,0.35519413491846541,1.5715517012555011,null,null,null,null,null,null,null,null,null,null,null,null,null,null,null,null,null,null,null,null,null,null,null,null,null,null,null,null,null,null,null,null,"Shared among improved sanitation facilities","Yes",98.937467744002404,12.901047808879589,9.7652733137206909,10.597837026558047,0,83.382290955510911,0,8.6351541433133061,1.9626828832447409,0,22.885125838617341,5.571098758753755,0,9.7652733137206909,0,82.331737906668536,9.6438629304513093,40.226025056040889]
[null,"No",95.691625749579018,99.470107182417706,99.606490335180965,99.57534075331435,100,94.932284219540264,100,99.481000272918479,99.88288418279258,100,96.696436355221195,99.285940683342048,100,98.80176883432604,100,98.813728863670136,99.644805865081523,98.428448298744541,null,null,null,null,null,null,null,null,null,null,null,null,null,null,null,null,null,null,null,null,null,null,null,null,null,null,null,null,null,null,null,null,null,"No",2197.4616376571571,2421.7512782487311,2471.8188367516318,2485.0117862823831,2506.869678515724,1561.9801280858089,1661.653704797747,1655.1719140936868,1673.8851488140085,1666.3455996317543,669.85545068354361,774.63001742141114,782.57237088043485,805.20879792303197,831.6100851241988,6858.0493760931768,2705.4524695765735,2519.4113717858595]
["Manually calculated ratios","Improved latrines"]
[null,"Other"]
[null,"Other"]
[null,null,"NATIONAL wealth index quintile",null,null,null,null,"URBAN wealth index quintile",null,null,null,null,"RURAL wealth index quintile",null,null,null,null,"SUB-REGIONS:",null,null,null,null,null,null,null,null,null,null,null,null,null,null,null,null,null,null,null,null,null,null,null,null,null,null,null,null,null,null,null,null,null,null,"Raw numbers of respondents:","Use of sanitation facilities","NATIONAL wealth index quintile",null,null,null,null,"URBAN wealth index quintile",null,null,null,null,"RURAL wealth index quintile",null,null,null,null,"SUB-REGIONS:"]
["Percentage based on weighted population",null,"Poorest","Poor","Middle","Rich","Richest","Poorest","Poor","Middle","Rich","Richest","Poorest","Poor","Middle","Rich","Richest","CENTRE","NORTH","SOUTH",null,null,null,null,null,null,null,null,null,null,null,null,null,null,null,null,null,null,null,null,null,null,null,null,null,null,null,null,null,null,null,null,"Sanitation data, raw numbers (weighted)",null,"Poorest","Poor","Middle","Rich","Richest","Poorest","Poor","Middle","Rich","Richest","Poorest","Poor","Middle","Rich","Richest","CENTRE","NORTH","SOUTH"]
["Sanitation type","Sewer connection",33.658787108353273,42.65545496286213,43.092989920702117,49.594767137785574,64.85782411180459,46.149716417887582,59.003209920840092,56.487470302569541,62.840418354839798,74.084603268347607,21.748726491727105,22.316066887349759,18.412182192471853,19.270358707016261,23.297567177866917,37.114021971899753,59.851179332393833,57.507609772418043,null,null,null,null,null,null,null,null,null,null,null,null,null,null,null,null,null,null,null,null,null,null,null,null,null,null,null,null,null,null,null,null,"Sanitation type","Sewer connection",847.13011847573887,1074.0092623569099,1085.0313356008044,1249.1055713048706,1632.0697233816634,774.71827129342114,986.6918647686482,945.49324799586532,1054.7263504288062,1241.5516776895399,183.06878199985439,188.17151346872276,154.95339400757527,162.15975677902452,195.8111526885279,2589.0622422913229,1817.881534644049,1480.4022341846151]
[null,"Septic tank connection",49.371596611599209,52.817070608816572,55.131520614696782,49.061599392547841,33.843724161378027,44.974358986366219,39.980185410591815,42.914881385777896,36.332498438083505,24.581974569559726,49.716267509646393,67.589890756595253,73.910706878174764,76.47001372670249,74.998947441564241,59.695373706394172,27.084109033534197,41.213767038962438,null,null,null,null,null,null,null,null,null,null,null,null,null,null,null,null,null,null,null,null,null,null,null,null,null,null,null,null,null,null,null,null,null,"Septic tank connection",1242.5927990893265,1329.8656196216002,1388.1475283182922,1235.6770819812641,851.63691947248549,754.98747014927437,668.57589187940027,718.313820241136,609.81203631036533,411.95863136649831,418.48411409431145,569.92534137204325,622.01833354412827,643.49392843921589,630.35038108659728,4164.330080413114,822.63544751405732,1060.9544205557895]
[null,"Improved latrines",8.2721799667271849,1.2223599235141445,0.33382186815930348,0.42987644073033066,0.9204901428605049,6.8896308126311743,0.38187346290592716,0,0.67381482622298916,0.76589434594095529,10.833173736006291,2.8016377635125855,0.66549084661297531,1.107594050657996,0.64826742161617656,2.7022522109829605,2.4554196668821344,0.71013252942180005,null,null,null,null,null,null,null,null,null,null,null,null,null,null,null,null,null,null,null,null,null,null,null,null,null,null,null,null,null,null,null,null,null,"Improved latrines",208.19564212779133,30.777444079100402,8.4052461462563368,10.826970022808329,23.163035661575051,115.65667759862319,6.3859481496993382,0,11.309444958083386,12.835290575716609,91.187680427995176,23.623715631097006,5.6006433287314339,9.3203860185125116,5.4485513490729058,188.50824558710877,74.579350348923924,18.280742101498774]
[null,"Unimproved facilities",8.2812336296526219,3.3051145048071042,1.4416675964418388,0.91375702893634636,0.377961583956897,1.7475895002174942,0.63473120566219365,0.59764831165263743,0.15326838085378525,0.56752781615173742,16.933438334747926,7.292404592542348,7.0116200827404231,3.1520335156232675,1.0552179589526045,0.43090998507825412,10.451344500399827,0.5035977228325782,null,null,null,null,null,null,null,null,null,null,null,null,null,null,null,null,null,null,null,null,null,null,null,null,null,null,null,null,null,null,null,null,null,"Unimproved facilities",208.42350626686368,83.218514358915172,36.299512299753722,23.014101316220824,9.5109520898212701,29.336897853921915,10.614407551418266,10.003500604947304,2.5724876473804521,9.5109520898212701,142.53634263096436,61.490352037922321,59.008449837984358,26.524311042881685,8.8688850343327239,30.060142041116496,317.44246966236972,12.963974628088351]
[null,"Open defecation",0.41620268366770752,0,0,0,0,0.23870428289743886,0,0,0,0,0.76839392787227889,0,0,0,0,5.7442125644872215E-2,0.15794746679021868,6.4892936365301968E-2,null,null,null,null,null,null,null,null,null,null,null,null,null,null,null,null,null,null,null,null,null,null,null,null,null,null,null,null,null,null,null,null,null,"Open defecation",10.475060423013415,0,0,0,0,4.0071442199580121,0,0,0,0,6.4679162030554043,0,0,0,0,4.0071442199580121,4.7973955822510703,1.6705206208043326]
["Septic tank emptying practices","Not emptied/treated and disposed in situ",70.662173376526241,73.324066148639005,73.53961916582719,70.664215042824793,64.820643380756067,61.686142374512166,78.283430026405355,76.427453102573224,68.153275944713371,64.009183117289282,82.247661605296713,74.662362959656164,69.411523832051174,74.763238115267455,63.312037484288687,72.75662657966015,79.879053763783887,57.632774585204125,null,null,null,null,null,null,null,null,null,null,null,null,null,null,null,null,null,null,null,null,null,null,null,null,null,null,null,null,null,null,null,null,"Septic tank emptying practices","Not emptied/treated and disposed in situ",878.04307805673022,974.27596025685239,1020.8384057851152,869.73659395533969,552.03653047011653,465.72264574600894,523.38414049282585,548.98895809409635,412.28437292037597,263.69135471886062,344.19339803221305,425.51972697425441,430.96140401331519,481.09689797629972,399.08766955590306,3029.826086150631,657.11341139969807,607.99107097381773]
[null,"Emptied and buried on site",1.2132399857883778,1.592259400022479,1.7321790559780073,3.1394080546648881,0.94875171958888127,0.49182717762285383,0,1.6288438588675767,2.3743503807751578,0,1.4364098587841914,1.4465981520556939,3.5916501826453486,2.0040125291823472,4.4054039582382387,0.78870494763188315,6.2873894913307495,2.1262677639289334,null,null,null,null,null,null,null,null,null,null,null,null,null,null,null,null,null,null,null,null,null,null,null,null,null,null,null,null,null,null,null,null,null,"Emptied and buried on site",15.075632699078751,21.156765267084069,24.045200751605833,38.639898098994699,8.0799199181489829,3.713233565841362,0,11.700210548394828,14.363323615217579,0,6.0111470722963736,8.2445294563850826,22.29979288716876,12.895698950449573,27.769480639158779,32.844277379941012,51.722294678960523,22.430844676010803]
[null,"Emptied and discharged locally",3.5286861401412373,1.9982406607428054,1.4112186359800982,3.8684664385720451,1.6855106586687998,3.8937827623872554,0.10728560827016381,1.3567398922631397,2.9965629811154102,2.7002464619437996,2.2758156053373666,3.9013644709992032,2.1937266435162837,1.6350491945909411,4.2743520730245237,2.2941121426409432,5.3788303552951993,1.1539206271277138,null,null,null,null,null,null,null,null,null,null,null,null,null,null,null,null,null,null,null,null,null,null,null,null,null,null,null,null,null,null,null,null,null,"Emptied and discharged locally",43.84719987985811,26.551143994428077,19.58979661452485,47.613163495485935,14.354431050867367,29.39757197085607,0.71728571235048733,9.7456501508508317,18.127317762212598,11.123898368145969,9.5239267744161697,22.234864779509817,13.620382641342415,10.521442294187008,26.943394581292957,95.534402034406611,44.248165164304623,12.173167836453091]
[null,"Emptied and removed offsite",24.59590049754415,23.085433790595857,23.316983142214749,22.327910463938267,32.545094240986245,33.928247685477693,21.609284365324509,20.586963146296057,26.475810693396092,33.29057042076694,14.040112930581747,19.989674417288928,24.803099341787185,21.597700160959242,28.008206484448557,24.160556330067113,8.4547263895901139,39.0870370237392,null,null,null,null,null,null,null,null,null,null,null,null,null,null,null,null,null,null,null,null,null,null,null,null,null,null,null,null,null,null,null,null,null,"Emptied and removed offsite",305.62688845365943,306.74217014485959,323.6741251670469,274.81237547571527,277.16603803335255,256.15401886656775,144.47446567422412,147.87900144779397,160.16197105683088,137.1433782794918,58.75564221538589,113.92622016189392,153.99717404392368,138.97988921827948,176.54983631024251,1006.1253148481395,69.551576271093737,412.34470615540101]
["Latrine emptying practices","Not emptied/treated and disposed in situ",86.650788780807247,80.850393101132582,100,79.177549370551134,100,97.422575241078931,0,0,0,100,73.026532247405285,90.570863250636563,52.718484285330682,100,38.952640444110379,96.295210767168442,62.8853393872715,100,null,null,null,null,null,null,null,null,null,null,null,null,null,null,null,null,null,null,null,null,null,null,null,null,null,null,null,null,null,null,null,null,"Latrine emptying practices","Not emptied/treated and disposed in situ",174.84172357200487,18.805133276339024,4.9236672170020288,5.2832670257092733,3.834050652746591,105.00044694887616,0,0,0,3.834050652746591,65.403509692284473,20.676837222935056,2.5660629842482456,9.3203860185125116,0.88654822419879076,148.23038398469927,45.876721062951951,13.580736696150581]
[null,"Emptied and buried on site",6.4877600450425552,19.149606898867415,0,0,0,0,0,0,0,0,14.616620168536739,9.4291367493634404,47.281515714669304,0,0,1.5361834959706535,20.808169655225377,0,null,null,null,null,null,null,null,null,null,null,null,null,null,null,null,null,null,null,null,null,null,null,null,null,null,null,null,null,null,null,null,null,null,"Emptied and buried on site",13.090834652021975,4.4540403096402317,0,0,0,0,0,0,0,0,13.090834652021975,2.1526208177993995,2.3014194918408322,0,0,2.3646977628956436,15.180177198766565,0]
[null,"Emptied and discharged locally",5.4847332087823899,0,0,0,0,0,0,0,0,0,12.356847584057967,0,0,0,0,1.2659964430198578,12.498687030863877,0,null,null,null,null,null,null,null,null,null,null,null,null,null,null,null,null,null,null,null,null,null,null,null,null,null,null,null,null,null,null,null,null,null,"Emptied and discharged locally",11.066953008147703,0,0,0,0,0,0,0,0,0,11.066953008147703,0,0,0,0,1.9487899489190257,9.118163059228678,0]
[null,"Emptied and removed offsite",1.3767179653678336,0,0,20.822450629448856,0,2.5774247589210644,0,0,0,0,0,0,0,0,61.047359555889628,0.90260929384104638,3.8078039266392638,0,null,null,null,null,null,null,null,null,null,null,null,null,null,null,null,null,null,null,null,null,null,null,null,null,null,null,null,null,null,null,null,null,null,"Emptied and removed offsite",2.7779059524357317,0,0,1.3894161625308292,0,2.7779059524357317,0,0,0,0,0,0,0,0,1.3894161625308292,1.3894161625308292,2.7779059524357317,0]
["Shared among improved sanitation facilities","Yes",3.9310550896560028,0.51237925320845257,0.38783656349247575,0.42077889297002025,0,4.9670560569665216,0,0.5158979339751496,0.11693631569064308,0,2.7187723496911742,0.66070049735261815,0,1.1604625177372756,0,1.1802195712948653,0.31751055209463064,1.5626175766293982,null,null,null,null,null,null,null,null,null,null,null,null,null,null,null,null,null,null,null,null,null,null,null,null,null,null,null,null,null,null,null,null,"Shared among improved sanitation facilities","Yes",98.937467744002404,12.901047808879589,9.7652733137206909,10.597837026558047,0,83.382290955510911,0,8.6351541433133061,1.9626828832447409,0,22.885125838617341,5.571098758753755,0,9.7652733137206909,0,82.331737906668536,9.6438629304513093,40.226025056040889]
[null,"No",87.311136539166569,96.182506241984399,98.170495840065712,98.665464078093649,99.622038416043125,93.046650159918514,99.365268794337794,98.886453754372212,99.72979530345556,99.432472183848262,79.579395387688606,91.86669630841044,92.988379917259579,95.68750396663944,98.944782041047404,98.309647049441494,89.073197480715365,97.868891764172773,null,null,null,null,null,null,null,null,null,null,null,null,null,null,null,null,null,null,null,null,null,null,null,null,null,null,null,null,null,null,null,null,null,"No",2197.4616376571571,2421.7512782487311,2471.8188367516318,2485.0117862823831,2506.869678515724,1561.9801280858089,1661.653704797747,1655.1719140936868,1673.8851488140085,1666.3455996317543,669.85545068354361,774.63001742141114,782.57237088043485,805.20879792303197,831.6100851241988,6858.0493760931768,2705.4524695765735,2519.4113717858595]
[null,"DK/missing",8.7578083711774823,3.3051145048071042,1.4416675964418388,0.91375702893634636,0.377961583956897,1.986293783114933,0.63473120566219365,0.59764831165263743,0.15326838085378525,0.56752781615173742,17.701832262620208,7.4726031942369122,7.0116200827404231,3.1520335156232675,1.0552179589526045,0.5101333792636179,10.609291967190044,0.56849065919788011,null,null,null,null,null,null,null,null,null,null,null,null,null,null,null,null,null,null,null,null,null,null,null,null,null,null,null,null,null,null,null,null,null,"DK/missing",220.41802098157561,83.218514358915172,36.299512299753722,23.014101316220824,9.5109520898212701,33.344042073879926,10.614407551418266,10.003500604947304,2.5724876473804521,9.5109520898212701,149.00425883401977,63.009806329620801,59.008449837984358,26.524311042881685,8.8688850343327239,35.586740552772987,322.23986524462077,14.634495248892684]
["Shared among all sanitation facilities","Yes",4.0197335473644396,0.51237925320845257,0.38783656349247575,0.42077889297002025,0,4.978941002382145,0,0.5158979339751496,0.11693631569064308,0,2.8953237812806241,0.71546173677138114,0,1.1604625177372756,0,1.1811553226320555,0.34582035963806551,1.5988671595222739,null,null,null,null,null,null,null,null,null,null,null,null,null,null,null,null,null,null,null,null,null,null,null,null,null,null,null,null,null,null,null,null,"Shared among all sanitation facilities","Yes",100.68719482318956,12.901047808879589,9.7652733137206909,10.597837026558047,0,83.382290955510911,0,8.6351541433133061,1.9626828832447409,0,24.183971279788572,6.0219803967696661,0,9.7652733137206909,0,82.331737906668536,10.487136591826083,41.132478473853254]
[null,"No",95.980266452635547,99.487620746791521,99.612163436507529,99.579221107029966,100,95.021058997617843,100,99.48410206602486,99.883063684309363,100,97.104676218719362,99.284538263228626,100,98.839537482262713,100,98.818844677367935,99.654179640361946,98.401132840477771,null,null,null,null,null,null,null,null,null,null,null,null,null,null,null,null,null,null,null,null,null,null,null,null,null,null,null,null,null,null,null,null,null,"No",2404.1354168448315,2504.9697926076465,2508.1183490513849,2508.0258875986033,2516.3806306055449,1591.3170259397311,1672.2681123491654,1665.1754146986341,1676.4576364613893,1675.8565517215757,811.0929478733367,835.66948782131783,841.5808207184192,831.73310896591363,840.47897015853141,6888.1095181342935,3022.0516655775682,2531.4688929961353]
["Type of toilet facility","FLUSH/POUR FLUSH: FLUSH TO PIPED SEWER SYSTEM",33.658787108353273,42.65545496286213,43.092989920702117,49.594767137785574,64.85782411180459,46.149716417887582,59.003209920840092,56.487470302569541,62.840418354839798,74.084603268347607,21.748726491727105,22.316066887349759,18.412182192471853,19.270358707016261,23.297567177866917,37.114021971899753,59.851179332393833,57.507609772418043,null,null,null,null,null,null,null,null,null,null,null,null,null,null,null,null,null,null,null,null,null,null,null,null,null,null,null,null,null,null,null,null,"Type of toilet facility","FLUSH/POUR FLUSH: FLUSH TO PIPED SEWER SYSTEM",847.13011847573887,1074.0092623569099,1085.0313356008044,1249.1055713048706,1632.0697233816634,774.71827129342114,986.6918647686482,945.49324799586532,1054.7263504288062,1241.5516776895399,183.06878199985439,188.17151346872276,154.95339400757527,162.15975677902452,195.8111526885279,2589.0622422913229,1817.881534644049,1480.4022341846151]
[null,"FLUSH/POUR FLUSH: FLUSH TO SEPTIC TANK",49.371596611599209,52.817070608816572,55.131520614696782,49.061599392547841,33.843724161378027,44.974358986366219,39.980185410591815,42.914881385777896,36.332498438083505,24.581974569559726,49.716267509646393,67.589890756595253,73.910706878174764,76.47001372670249,74.998947441564241,59.695373706394172,27.084109033534197,41.213767038962438,null,null,null,null,null,null,null,null,null,null,null,null,null,null,null,null,null,null,null,null,null,null,null,null,null,null,null,null,null,null,null,null,null,"FLUSH/POUR FLUSH: FLUSH TO SEPTIC TANK",1242.5927990893265,1329.8656196216002,1388.1475283182922,1235.6770819812641,851.63691947248549,754.98747014927437,668.57589187940027,718.313820241136,609.81203631036533,411.95863136649831,418.48411409431145,569.92534137204325,622.01833354412827,643.49392843921589,630.35038108659728,4164.330080413114,822.63544751405732,1060.9544205557895]
[null,"FLUSH/POUR FLUSH: FLUSH TO PIT LATRINE",3.5842200490929081,0.22728873587594783,0.1955478471390634,3.519970909234299E-2,0,2.6299973021338134,0,0,0,0,5.4099663929430619,0.16313486803791247,0.57837374097165506,0.58510715180030703,0.10548130954800329,0.89471666671277306,1.1529248463956965,0.16734695156970808,null,null,null,null,null,null,null,null,null,null,null,null,null,null,null,null,null,null,null,null,null,null,null,null,null,null,null,null,null,null,null,null,null,"FLUSH/POUR FLUSH: FLUSH TO PIT LATRINE",90.208264042813937,5.7228368041718269,4.9236672170020288,0.88654822419879076,0,44.149934638075777,0,0,0,0,45.538112707103295,1.3755710257176035,4.8674824760890782,4.9236672170020288,0.88654822419879076,62.415147059207747,35.018203692449042,4.3079655365297853]
[null,"FLUSH/POUR FLUSH: FLUSH TO OPEN DRAIN",7.384847585801638,3.059944752582255,1.2986246013462115,0.81161840369317684,0,1.0191039877765329,0.4876332749821306,0.38247126512788099,0,0,15.556459017372909,7.0013981950702009,7.0116200827404231,3.1520335156232675,1.0552179589526045,1.5617794449079592E-2,10.023532010799077,0.40827765441919689,null,null,null,null,null,null,null,null,null,null,null,null,null,null,null,null,null,null,null,null,null,null,null,null,null,null,null,null,null,null,null,null,null,"FLUSH/POUR FLUSH: FLUSH TO OPEN DRAIN",185.86310879671748,77.045456658124237,32.6978561533004,20.441613668840372,0,17.107764488287316,8.1545357627300916,6.4018444584939775,0,0,130.94569034303734,59.036554309234937,59.008449837984358,26.524311042881685,8.8688850343327239,1.0894923203578957,304.44836605722367,10.510176899400966]
[null,"FLUSH/POUR FLUSH: FLUSH TO DK WHERE",0.25501355962265043,0.29859635261820711,0.13827402102024006,0.16494273415877136,0.76812644215025261,0.46930924969917415,0.38187346290592716,0,0.67381482622298916,0.53711279248353416,0.19321568808352904,9.4194414370069368E-2,8.7117105641320358E-2,0,0.37747368762181782,0.49562954487383315,5.3546363314832451E-2,0.18257610704558908,null,null,null,null,null,null,null,null,null,null,null,null,null,null,null,null,null,null,null,null,null,null,null,null,null,null,null,null,null,null,null,null,null,"FLUSH/POUR FLUSH: FLUSH TO DK WHERE",6.4182249431811105,7.5182704931211468,3.481578929254308,4.154286834568226,19.328985008828464,7.8783246973113048,6.3859481496993382,0,11.309444958083386,9.0012399229700186,1.6263830755410136,0.79425759036255228,0.73316085264235609,0,3.1725869623432863,34.574957728064049,1.6263830755410136,4.700005405348195]
[null,"PIT LATRINE: VENTILATED IMPROVED PIT LATRINE",1.085657529689948,0.19554883983594309,0,0,0,1.1888599692513722,0,0,0,0,0.47154574894555068,0.98682316967733796,0,0,0,0.35666930887875575,0.24253309624131708,0,null,null,null,null,null,null,null,null,null,null,null,null,null,null,null,null,null,null,null,null,null,null,null,null,null,null,null,null,null,null,null,null,null,"PIT LATRINE: VENTILATED IMPROVED PIT LATRINE",27.324014641100327,4.9236672170020288,0,0,0,19.957469117434968,0,0,0,0,3.9692119880907955,8.321000752576591,0,0,0,24.881136334436995,7.3665455236653576,0]
[null,"PIT LATRINE: PIT LATRINE WITH SLAB",3.3472888283216826,0.50092599518404657,0,0.2297339974792163,0,2.6014642915468147,0,0,0,0,4.7584459060341482,1.5574853114272658,0,0.52248689885768906,0.16531242444635552,0.95523669051759996,1.0064153609302884,0.21127218626688818,null,null,null,null,null,null,null,null,null,null,null,null,null,null,null,null,null,null,null,null,null,null,null,null,null,null,null,null,null,null,null,null,null,"PIT LATRINE: PIT LATRINE WITH SLAB",84.245138500696058,12.612669564805405,0,5.7861349640413122,0,43.670949145801146,0,0,0,0,40.053972657260069,13.132886262440259,0,4.3967188015104828,1.3894161625308292,66.637004465400068,30.568218057268513,5.4387205068742048]
[null,"PIT LATRINE: PIT LATRINE WITHOUT SLAB/OPEN PIT",0.46052818722612232,9.7455266143892327E-2,0,0,0,0,0,0,0,0,1.3769793173750158,0.29100639747214696,0,0,0,0,0.38160583923856845,9.532006841338117E-2,null,null,null,null,null,null,null,null,null,null,null,null,null,null,null,null,null,null,null,null,null,null,null,null,null,null,null,null,null,null,null,null,null,"PIT LATRINE: PIT LATRINE WITHOUT SLAB/OPEN PIT",11.590652287926989,2.4537977286873849,0,0,0,0,0,0,0,0,11.590652287926989,2.4537977286873849,0,0,0,0,11.590652287926989,2.4537977286873849]
[null,"COMPOSTING TOILET",0,0,0,0,0.15236370071025226,0,0,0,0,0.22878155345742113,0,0,0,0,0,0,0,0.14893728453961491,null,null,null,null,null,null,null,null,null,null,null,null,null,null,null,null,null,null,null,null,null,null,null,null,null,null,null,null,null,null,null,null,null,"COMPOSTING TOILET",0,0,0,0,3.834050652746591,0,0,0,0,3.834050652746591,0,0,0,0,0,0,0,3.834050652746591]
[null,"NO FACILITY/BUSH/FIELD",0.41620268366770752,0,0,0,0,0.23870428289743886,0,0,0,0,0.76839392787227889,0,0,0,0,5.7442125644872215E-2,0.15794746679021868,6.4892936365301968E-2,null,null,null,null,null,null,null,null,null,null,null,null,null,null,null,null,null,null,null,null,null,null,null,null,null,null,null,null,null,null,null,null,null,"NO FACILITY/BUSH/FIELD",10.475060423013415,0,0,0,0,4.0071442199580121,0,0,0,0,6.4679162030554043,0,0,0,0,4.0071442199580121,4.7973955822510703,1.6705206208043326]
[null,"NO RESPONSE",0.43585785662486165,0.14771448608095711,0.14304299509562757,0.10213862524316954,0.377961583956897,0.72848551244096149,0.14709793068006299,0.21517704652475647,0.15326838085378525,0.56752781615173742,0,0,0,0,0,0.4152921906291745,4.6206650362186054E-2,0,null,null,null,null,null,null,null,null,null,null,null,null,null,null,null,null,null,null,null,null,null,null,null,null,null,null,null,null,null,null,null,null,null,"NO RESPONSE",10.969745182219221,3.7192599721035484,3.6016561464533279,2.5724876473804521,9.5109520898212701,12.229133365634596,2.4598717886881731,3.6016561464533279,2.5724876473804521,9.5109520898212701,0,0,0,0,0,28.970649720758601,1.4034513172192185,0]
[]
[]
[]
[]
[]
[]
[]
[]
[]
[]
[]
[]
[]
[]
[]
[]
[]
[]
[]
[]
[]
[]
[]
[]
[]
[]
[]
[]
[]
[]
[]
[]
[]
[]
[]
[]
[]
[]
[]
[]
[]
[]
[]
[]
[{"$f":"A1026","v":"Montenegro"}]
[{"$f":"A1034","v":"2018"}]
["Access to hygiene facilities "]
[" by wealth quintile and sub-national region"]
["Notes:"]
["WHO/UNICEF JMP customised wealth index excludes water,"]
[" sanitation and hygiene assets."]
["Survey used for analysis:",{"$f":"A1025","v":"MICS18"}]
[]
[]
[]
[]
["Access to handwashing",null,"NATIONAL wealth index quintile",null,null,null,null,"URBAN wealth index quintile",null,null,null,null,"RURAL wealth index quintile",null,null,null,null,"SUB-REGIONS:",null,null,null,null,null,null,null,null,null,null,null,null,null,null,null,null,null,null,null,null,null,null,null,null,null,null,null,null,null,null,null,null,null,null,"Raw numbers of respondents:","Access to handwashing","NATIONAL wealth index quintile",null,null,null,null,"URBAN wealth index quintile",null,null,null,null,"RURAL wealth index quintile",null,null,null,null,"SUB-REGIONS:"]
["Weighted percentage (used in graphs)",null,"Poorest","Poor","Middle","Rich","Richest","Poorest","Poor","Middle","Rich","Richest","Poorest","Poor","Middle","Rich","Richest","CENTRE","NORTH","SOUTH",null,null,null,null,null,null,null,null,null,null,null,null,null,null,null,null,null,null,null,null,null,null,null,null,null,null,null,null,null,null,null,null,"Hygiene data, raw numbers (weighted)",null,"Poorest","Poor","Middle","Rich","Richest","Poorest","Poor","Middle","Rich","Richest","Poorest","Poor","Middle","Rich","Richest","CENTRE","NORTH","SOUTH"]
["Hygiene ladder","Basic",99.503233520723228,99.969356469602516,99.850929107955793,100,100,99.871216582983251,100,99.775755294752884,100,100,98.77150320953443,99.908496854611926,100,100,100,100,99.464789725381962,99.970027854527615,null,null,null,null,null,null,null,null,null,null,null,null,null,null,null,null,null,null,null,null,null,null,null,null,null,null,null,null,null,null,null,null,"Hygiene ladder","Basic",2504.3144225541678,2517.0992759001742,2514.1301907886109,2518.6237246251617,2516.3806306055449,1676.5445655728952,1672.2681123491654,1670.0571372654524,1678.420319344634,1675.8565517215757,831.4040270699204,842.43935799343365,841.5808207184192,841.49838227963448,840.47897015853141,6975.9678545526194,3021.0800623465852,2573.5003275744398]
[null,"Limited",0.49676647927673334,3.064353039747484E-2,0.14907089204421706,0,0,0.12878341701674489,0,0.22424470524712842,0,0,1.2284967904655644,9.1503145388067392E-2,0,0,0,0,0.53521027461805837,2.9972145472385917E-2,null,null,null,null,null,null,null,null,null,null,null,null,null,null,null,null,null,null,null,null,null,null,null,null,null,null,null,null,null,null,null,null,null,"Limited",12.502703828565361,0.77156451635219359,3.7534315764949082,0,0,2.1618955423050288,0,3.7534315764949082,0,0,10.340808286260332,0.77156451635219359,0,0,0,0,16.25613540506027,0.77156451635219359]
[null,"No facility","N/A","N/A","N/A","N/A","N/A","N/A","N/A","N/A","N/A","N/A","N/A","N/A","N/A","N/A","N/A","N/A","N/A","N/A",null,null,null,null,null,null,null,null,null,null,null,null,null,null,null,null,null,null,null,null,null,null,null,null,null,null,null,null,null,null,null,null,null,"No facility","N/A","N/A","N/A","N/A","N/A","N/A","N/A","N/A","N/A","N/A","N/A","N/A","N/A","N/A","N/A","N/A","N/A","N/A"]
["Observed handwashing place","Fixed",99.541566568780112,100,100,100,100,99.63969636648136,100,100,100,100,99.407771608168488,99.938305270514476,100,100,100,99.913370961151116,99.875022453125567,99.934929839827873,null,null,null,null,null,null,null,null,null,null,null,null,null,null,null,null,null,null,null,null,null,null,null,null,null,null,null,null,null,null,null,null,"Observed handwashing place","Fixed",2492.3418894380998,2504.4304650178942,2517.8836223651056,2518.6237246251617,2503.575029718309,1665.6474177880764,1661.311036089591,1673.8105688419473,1672.6259546868353,1670.0765508025679,828.36555929724955,842.69070581215101,841.5808207184192,841.49838227963448,839.24773484810203,6946.7143048742118,3024.5502910497939,2565.5901352405504]
[null,"Mobile",0.45843343121986802,0,0,0,0,0.36030363351864747,0,0,0,0,0.59222839183149711,6.1694729485530071E-2,0,0,0,8.6629038848884912E-2,0.12497754687443123,6.507016017210171E-2,null,null,null,null,null,null,null,null,null,null,null,null,null,null,null,null,null,null,null,null,null,null,null,null,null,null,null,null,null,null,null,null,null,"Mobile",11.478349030790417,0,0,0,0,6.0230895785013896,0,0,0,0,4.9350427546541731,0.52021669763485501,0,0,0,6.0230895785013896,3.7847388314846961,1.6705206208043326]
["Water / Soap","Water and soap",99.503233520723228,99.969356469602516,99.850929107955793,100,100,99.871216582983251,100,99.775755294752884,100,100,98.77150320953443,99.908496854611926,100,100,100,100,99.464789725381962,99.970027854527615,null,null,null,null,null,null,null,null,null,null,null,null,null,null,null,null,null,null,null,null,null,null,null,null,null,null,null,null,null,null,null,null,"Water / Soap","Water and soap",2504.3144225541678,2517.0992759001742,2514.1301907886109,2518.6237246251617,2516.3806306055449,1676.5445655728952,1672.2681123491654,1670.0571372654524,1678.420319344634,1675.8565517215757,831.4040270699204,842.43935799343365,841.5808207184192,841.49838227963448,840.47897015853141,6975.9678545526194,3021.0800623465852,2573.5003275744398]
[null,"Water only",0.49676647927673334,3.064353039747484E-2,0.14907089204421706,0,0,0.12878341701674489,0,0.22424470524712842,0,0,1.2284967904655644,9.1503145388067392E-2,0,0,0,0,0.53521027461805837,2.9972145472385917E-2,null,null,null,null,null,null,null,null,null,null,null,null,null,null,null,null,null,null,null,null,null,null,null,null,null,null,null,null,null,null,null,null,null,"Water only",12.502703828565361,0.77156451635219359,3.7534315764949082,0,0,2.1618955423050288,0,3.7534315764949082,0,0,10.340808286260332,0.77156451635219359,0,0,0,0,16.25613540506027,0.77156451635219359]
[null,"Soap only","N/A","N/A","N/A","N/A","N/A","N/A","N/A","N/A","N/A","N/A","N/A","N/A","N/A","N/A","N/A","N/A","N/A","N/A",null,null,null,null,null,null,null,null,null,null,null,null,null,null,null,null,null,null,null,null,null,null,null,null,null,null,null,null,null,null,null,null,null,"Soap only","N/A","N/A","N/A","N/A","N/A","N/A","N/A","N/A","N/A","N/A","N/A","N/A","N/A","N/A","N/A","N/A","N/A","N/A"]
[null,"Neither","N/A","N/A","N/A","N/A","N/A","N/A","N/A","N/A","N/A","N/A","N/A","N/A","N/A","N/A","N/A","N/A","N/A","N/A",null,null,null,null,null,null,null,null,null,null,null,null,null,null,null,null,null,null,null,null,null,null,null,null,null,null,null,null,null,null,null,null,null,"Neither","N/A","N/A","N/A","N/A","N/A","N/A","N/A","N/A","N/A","N/A","N/A","N/A","N/A","N/A","N/A","N/A","N/A","N/A"]
["Place where household members wash their hands","IN DWELING",90.315107970088633,98.486929815727393,99.615500794539884,99.575118097196565,99.041767698713642,93.277580025921338,98.164756812490822,100,98.98109337695486,99.655101690352311,85.984017150495788,97.589040074603545,99.69723642828437,99.152316567573195,98.580284321233563,97.147119696711755,96.807669022807204,98.820422656834566,null,null,null,null,null,null,null,null,null,null,null,null,null,null,null,null,null,null,null,null,null,null,null,null,null,null,null,null,null,null,null,null,"Place where household members wash their hands","IN DWELING",2273.066105102248,2479.77368745169,2508.2023798427012,2507.9225482195156,2492.2678585797694,1565.8567626670429,1641.577925740389,1673.8105688419473,1661.3187835482961,1670.0765508025679,723.76602359607114,822.88144508150913,839.03282056673834,834.36513990891046,828.5465584424561,6776.9518416663686,2940.3743734293289,2543.9063641002126]
[null,"IN YARD/PLOT",8.7124241978996295,0.97927094473696952,0.38449920546013888,0.42488190280343363,0.44934263922616885,5.9444969941165375,1.1800207277456798,0,0.6736793524374235,0,12.426513511890786,2.3492651959109123,0.30276357171564461,0.84768343242678479,1.2732235767454883,2.4335327620102518,2.7713730762757018,0.84232637612831585,null,null,null,null,null,null,null,null,null,null,null,null,null,null,null,null,null,null,null,null,null,null,null,null,null,null,null,null,null,null,null,null,null,"IN YARD/PLOT",219.2757843358514,24.656777566203594,9.6812425224047942,10.701176405646098,11.307171138539065,99.790655121033183,19.733110349201567,0,11.307171138539065,0,104.59953570117865,19.809260730641732,2.5480001516809216,7.133242370723873,10.701176405646098,169.76246320784168,84.175917620465199,21.683771140338198]
[null,"MOBILE OBJECT (BUCKET/JUG/KETTLE)",0.45606607291676926,0,0,0,0,0.35879349475429573,0,0,0,0,0.58628726276246534,6.1694729485530071E-2,0,0,0,8.6340558100058223E-2,0.12460717500704427,6.4892936365301968E-2,null,null,null,null,null,null,null,null,null,null,null,null,null,null,null,null,null,null,null,null,null,null,null,null,null,null,null,null,null,null,null,null,null,"MOBILE OBJECT (BUCKET/JUG/KETTLE)",11.478349030790417,0,0,0,0,6.0230895785013896,0,0,0,0,4.9350427546541731,0.52021669763485501,0,0,0,6.0230895785013896,3.7847388314846961,1.6705206208043326]
[null,"NO PLACE FOR HANDWASHING",0.51640175909492247,0.53379923953556829,0,0,0.50888966206016817,0.41912948520780929,0.65522245976348559,0,0.34522727060771685,0.34489830964769908,1.0031820748509652,0,0,0,0.14649210202095994,0.33300698317790661,0.29635072591007761,0.27235803067184339,null,null,null,null,null,null,null,null,null,null,null,null,null,null,null,null,null,null,null,null,null,null,null,null,null,null,null,null,null,null,null,null,null,"NO PLACE FOR HANDWASHING",12.996887913842716,13.440375398631243,0,0,12.805600887236087,7.0359537486223713,10.957076259574611,0,5.7943646577988055,5.7800009190079322,8.4442333042769757,0,0,0,1.2312353104293494,23.230460099906214,9.0011678703665492,7.0112362294372819]
[null,"OTHER (specify)","N/A","N/A","N/A","N/A","N/A","N/A","N/A","N/A","N/A","N/A","N/A","N/A","N/A","N/A","N/A","N/A","N/A","N/A",null,null,null,null,null,null,null,null,null,null,null,null,null,null,null,null,null,null,null,null,null,null,null,null,null,null,null,null,null,null,null,null,null,"OTHER (specify)","N/A","N/A","N/A","N/A","N/A","N/A","N/A","N/A","N/A","N/A","N/A","N/A","N/A","N/A","N/A","N/A","N/A","N/A"]
[null,"NO RESPONSE","N/A","N/A","N/A","N/A","N/A","N/A","N/A","N/A","N/A","N/A","N/A","N/A","N/A","N/A","N/A","N/A","N/A","N/A",null,null,null,null,null,null,null,null,null,null,null,null,null,null,null,null,null,null,null,null,null,null,null,null,null,null,null,null,null,null,null,null,null,"NO RESPONSE","N/A","N/A","N/A","N/A","N/A","N/A","N/A","N/A","N/A","N/A","N/A","N/A","N/A","N/A","N/A","N/A","N/A","N/A"]
[]
[]
[]
[]
[]
[]
[]
[]
[]
[]
[]
[]
[]
[]
[{"$f":"A1026","v":"Montenegro"}]
[{"$f":"A1034","v":"2018"}]
["Access to menstrual health and hygiene facilities"]
[" by wealth quintile and sub-national region"]
["Notes:"]
["WHO/UNICEF JMP customised wealth index excludes water,"]
[" sanitation and hygiene assets."]
["Survey used for analysis:",{"$f":"A1025","v":"MICS18"}]
["Menstrual health and hygiene",null,"NATIONAL wealth index quintile",null,null,null,null,"URBAN wealth index quintile",null,null,null,null,"RURAL wealth index quintile",null,null,null,null,"SUB-REGIONS:",null,null,null,null,null,null,null,null,null,null,null,null,null,null,null,null,null,null,null,null,null,null,null,null,null,null,null,null,null,null,null,null,null,null,"Raw numbers of respondents:","Menstrual health and hygiene","NATIONAL wealth index quintile",null,null,null,null,"URBAN wealth index quintile",null,null,null,null,"RURAL wealth index quintile",null,null,null,null,"SUB-REGIONS:"]
["Percentage based on weighted women population",null,"Poorest","Poor","Middle","Rich","Richest","Poorest","Poor","Middle","Rich","Richest","Poorest","Poor","Middle","Rich","Richest","CENTRE","NORTH","SOUTH",null,null,null,null,null,null,null,null,null,null,null,null,null,null,null,null,null,null,null,null,null,null,null,null,null,null,null,null,null,null,null,null,"MHH data, raw numbers (weighted)",null,"Poorest","Poor","Middle","Rich","Richest","Poorest","Poor","Middle","Rich","Richest","Poorest","Poor","Middle","Rich","Richest","CENTRE","NORTH","SOUTH"]
["Private place to wash and change","Yes",96.316559136090916,96.501922281671668,97.997947291043303,96.560527778011334,98.940799406009972,95.718832201766915,95.309139305684326,98.522212107959504,95.476176268352518,99.757141892600856,98.064618492431663,97.802153343380922,98.100384497726623,97.790998315666073,98.081617076695153,97.760457338169715,98.201116486950824,95.187858810507137,null,null,null,null,null,null,null,null,null,null,null,null,null,null,null,null,null,null,null,null,null,null,null,null,null,null,null,null,null,null,null,null,"Private place to wash and change","Yes",381.61069681251269,348.31825413579219,378.44721532333585,439.01401455791029,546.2360543395248,248.87315065544988,215.75337673881219,270.12372050879793,337.85117487639468,356.79556952404204,126.72775625653323,140.84071649475558,132.39061890390266,118.79760884108816,145.47254236929987,1228.3356829518793,479.17083853799801,386.1197136792004]
[null,"No",3.6834408639090941,3.4980777183283194,2.0020527089567008,3.4394722219886571,1.0592005939900249,4.281167798233132,4.6908606943156439,1.4777878920404826,4.5238237316474885,0.24285810739915117,1.9353815075683141,2.1978466566190744,1.8996155022734205,2.2090016843339075,1.9183829233048462,2.2395426618302525,1.7988835130491445,4.8121411894928823,null,null,null,null,null,null,null,null,null,null,null,null,null,null,null,null,null,null,null,null,null,null,null,null,null,null,null,null,null,null,null,null,null,"No",14.593964395654199,12.626114536071279,7.7315014607908346,15.637616559087474,5.8476741312850935,11.131223542145001,10.618803631873826,4.0517316347242192,16.007963686931099,0.86861647295689148,2.5010708217199467,3.1650253832042345,2.563611481372472,2.6835201863642721,2.8453042415969194,28.139293124450884,8.7776244529203407,19.519953505517655]
[null,"DK/not sure/missing","N/A","N/A","N/A","N/A","N/A","N/A","N/A","N/A","N/A","N/A","N/A","N/A","N/A","N/A","N/A","N/A","N/A","N/A",null,null,null,null,null,null,null,null,null,null,null,null,null,null,null,null,null,null,null,null,null,null,null,null,null,null,null,null,null,null,null,null,null,"DK/not sure/missing","N/A","N/A","N/A","N/A","N/A","N/A","N/A","N/A","N/A","N/A","N/A","N/A","N/A","N/A","N/A","N/A","N/A","N/A"]
["Use of menstrual materials","Materials reusable",3.6022510740160172,2.6664994822947397,4.3764103565506103,3.979328105659659,4.990731243385464,2.5745665229428547,1.0371107173569998,5.4163682077798567,3.7325087133294446,6.0812956999416894,5.8596745999976703,5.3026664915144597,1.9031232158176956,3.2901077191209076,3.8792296906217043,3.986782603892125,0.8379565514665035,7.9631949431702491,null,null,null,null,null,null,null,null,null,null,null,null,null,null,null,null,null,null,null,null,null,null,null,null,null,null,null,null,null,null,null,null,"Use of menstrual materials","Materials reusable",14.281721181043617,9.6245797220072564,16.944705582846289,18.096450483347901,27.776376258304765,6.6939855762783438,2.3477301437391036,14.904733680461655,13.211922450983597,22.022786316084101,7.587735604765272,7.6361442204193812,2.5683452891902689,3.9968600034074426,5.7535899422206658,50.311383255953949,4.0897164089611246,32.322733562634753]
[null,"Materials not reusable",92.299649201360353,94.796569603505247,92.917576326767616,92.335415190330778,92.406662604251494,93.302482064403264,97.884920387748892,91.772901979269534,93.441958315809799,90.108937105894299,90.037261846379948,89.843551171543552,94.219883629925761,92.677909649301967,96.120770309378329,93.403630192318403,94.707306561770594,88.96897335930008,null,null,null,null,null,null,null,null,null,null,null,null,null,null,null,null,null,null,null,null,null,null,null,null,null,null,null,null,null,null,null,null,null,"Materials not reusable",365.93725087917136,342.16287967795569,359.76081904021464,419.90587970734714,514.29782612953784,242.59053460237479,221.58422853585739,252.54019125202723,330.75553247276645,326.32023913449888,116.58991055025864,129.37987239408577,127.1537188226681,112.58617100101432,142.56425666867617,1178.7113326709689,462.22686011145504,361.1264626518041]
[null,"No materials used",3.8994496967233681,2.3943582641740475,1.8615475150442449,3.6852567040095749,1.7984655049742573,4.122951412653916,1.0779688948940864,2.4458681643689495,2.8255329708607881,2.5739128889420542,3.4948494158174936,4.4964299530551743,2.1982006792985844,4.0319826315770868,0,1.9958451983903047,4.2415896533585506,3.0033071490466572,null,null,null,null,null,null,null,null,null,null,null,null,null,null,null,null,null,null,null,null,null,null,null,null,null,null,null,null,null,null,null,null,null,"No materials used",15.460014358749444,8.6423013203656058,7.2075906967201409,16.759127091753058,10.009526082967383,10.719854018941708,2.4402216910895325,6.7305272110334506,10.001509805026163,9.3211605464159693,4.5255061340269735,6.4751173119199041,2.9665648090712931,4.8980980230306335,0,25.186658685061094,20.701429895215298,12.190470970279231]
[null,"DK/not sure/missing",0.19865002790021891,0.14257265002593128,0.84446580163752771,0,0.80414064738881796,0,0,0.36486164858171721,0,1.2358543052219435,0.60821413780483879,0.35735238388685686,1.6787924749580523,0,0,0.61374200539910273,0.21314723340428843,6.4524548483048824E-2,null,null,null,null,null,null,null,null,null,null,null,null,null,null,null,null,null,null,null,null,null,null,null,null,null,null,null,null,null,null,null,null,null,"DK/not sure/missing",0.78758094668690681,0.51460795153484318,3.269625838928047,0,4.4755191368142828,0,0,1.0040243745824959,0,4.4755191368142828,0.78758094668690681,0.51460795153484318,2.2656014643455511,0,0,7.7451449757423294,1.0402827407371025,0.26190615748464752]
["Use of menstrual materials with private place to wash and change","Materials reusable",3.7476469437757189,2.4505780116633598,4.300519054336851,3.2792554252520247,5.0850499591958016,2.6897178577313752,1.0881545305227045,5.5177433704776062,2.8154002605208253,6.1723822258953627,6.0123696190616753,4.6568412987482253,1.3843623038117803,3.3644279900902019,3.9551037250826844,4.1034671684438697,0.85535558423822322,6.9290298776977703,null,null,null,null,null,null,null,null,null,null,null,null,null,null,null,null,null,null,null,null,null,null,null,null,null,null,null,null,null,null,null,null,"Use of menstrual materials with private place to wash and change","Materials reusable",14.281721181043617,8.5231996771548406,16.177761982917755,14.396390890006987,27.776376258304765,6.6939855762783438,2.3477301437391036,14.904733680461655,9.5118628576426847,22.022786316084101,7.587735604765272,6.5347641755669645,1.8014016892617339,3.9968600034074426,5.7535899422206658,50.311383255953949,4.0897164089611246,26.754350324512881]
[null,"Materials not reusable",93.467971290098433,95.174325227433826,94.017671632195231,93.145781489341445,93.082495737678741,94.951368972493441,97.780821831296322,91.990610505903263,94.503040451816574,91.215152445891562,90.401710020981,90.728823294148611,97.30612521521158,92.615802433130725,96.044896274917349,94.189342801132682,95.136166101211728,90.272562986443333,null,null,null,null,null,null,null,null,null,null,null,null,null,null,null,null,null,null,null,null,null,null,null,null,null,null,null,null,null,null,null,null,null,"Materials not reusable",356.19243897561302,331.01977337227839,353.67719445863816,408.92303470769679,508.45015199825269,236.30846355232569,210.96542490398349,248.48845961730302,319.27963246037683,325.45162266154199,114.08883972853873,127.3162270557339,126.61961240605136,110.02535869954565,139.71895242707924,1154.8273520344201,454.87507974392889,348.56016173413087]
[null,"No materials used",2.7843817661257879,2.3750967609028319,1.6818093134678889,3.5749630854065413,1.8324543031254663,2.3589131697751529,1.1310236381809349,2.4916461236192089,2.6815592876626324,2.6124653282130734,3.5859203599573433,4.6143354071032014,1.3095124809766931,4.0197695767790567,0,1.7071900304233518,4.0084783145500706,2.7984071358588363,null,null,null,null,null,null,null,null,null,null,null,null,null,null,null,null,null,null,null,null,null,null,null,null,null,null,null,null,null,null,null,null,null,"No materials used",10.610861866653497,8.260673134824243,6.3266574174343093,15.694588960206591,10.009526082967383,5.8707015268457647,2.4402216910895325,6.7305272110334506,9.0596795583752829,9.3211605464159693,4.5255061340269735,6.4751173119199041,1.7040033442440992,4.775390138135049,0,20.931346197158643,19.165759644370926,10.805201620556451]
["Awareness of menstruation before menarche","Yes","N/A","N/A","N/A","N/A","N/A","N/A","N/A","N/A","N/A","N/A","N/A","N/A","N/A","N/A","N/A","N/A","N/A","N/A",null,null,null,null,null,null,null,null,null,null,null,null,null,null,null,null,null,null,null,null,null,null,null,null,null,null,null,null,null,null,null,null,"Awareness of menstruation before menarche","Yes","N/A","N/A","N/A","N/A","N/A","N/A","N/A","N/A","N/A","N/A","N/A","N/A","N/A","N/A","N/A","N/A","N/A","N/A"]
[null,"No","N/A","N/A","N/A","N/A","N/A","N/A","N/A","N/A","N/A","N/A","N/A","N/A","N/A","N/A","N/A","N/A","N/A","N/A",null,null,null,null,null,null,null,null,null,null,null,null,null,null,null,null,null,null,null,null,null,null,null,null,null,null,null,null,null,null,null,null,null,"No","N/A","N/A","N/A","N/A","N/A","N/A","N/A","N/A","N/A","N/A","N/A","N/A","N/A","N/A","N/A","N/A","N/A","N/A"]
[null,"DK/not sure/missing","N/A","N/A","N/A","N/A","N/A","N/A","N/A","N/A","N/A","N/A","N/A","N/A","N/A","N/A","N/A","N/A","N/A","N/A",null,null,null,null,null,null,null,null,null,null,null,null,null,null,null,null,null,null,null,null,null,null,null,null,null,null,null,null,null,null,null,null,null,"DK/not sure/missing","N/A","N/A","N/A","N/A","N/A","N/A","N/A","N/A","N/A","N/A","N/A","N/A","N/A","N/A","N/A","N/A","N/A","N/A"]
["Participation in (all) activities during menstruation","Yes",92.993352279241648,92.147141333240015,96.842732845432622,91.916013265717638,92.134160154920664,93.460679078099744,93.028661386326888,94.562320371766489,92.482954067724748,92.092524476471056,92.271281585007415,93.045064531408912,96.165186544999315,94.878730739944189,90.229033963308567,92.404761396884709,96.267064380476555,91.414104924618229,null,null,null,null,null,null,null,null,null,null,null,null,null,null,null,null,null,null,null,null,null,null,null,null,null,null,null,null,null,null,null,null,"Participation in (all) activities during menstruation","Yes",368.44399634408649,332.59991753443296,374.418698001709,417.99860140310579,512.78118854782986,243.00185375783559,210.59100914989068,259.68915598592469,327.36095506411482,333.50359658937708,119.24109492237733,133.99023545928185,129.77898740036792,115.2597533098008,133.82576019219397,1165.5911434186407,469.83938743641403,370.81187097611024]
[null,"No",6.7659979462568725,7.8528586667600067,3.1572671545674122,7.6373869644107293,7.7911088294794952,6.1726095437921078,6.9713386136730833,5.4376796282335125,7.5170459322752778,7.7926241630578801,7.7287184149925165,6.9549354685911506,3.834813455000742,5.121269260055767,8.4016341133279511,7.4342295649738794,3.5375766542224012,8.4833601381458159,null,null,null,null,null,null,null,null,null,null,null,null,null,null,null,null,null,null,null,null,null,null,null,null,null,null,null,null,null,null,null,null,null,"No",26.807199240318571,28.344451137430624,12.206799855013013,34.731892257653953,43.362136681642248,16.049054815997678,15.781171220795319,14.933077230192744,26.608009664661378,28.220186166284094,9.9877321558757917,10.015506418678047,5.1752429849072286,6.2213757176516058,12.461122797014529,93.775169245409728,17.265436096192964,34.411873830455718]
[null,"DK/not sure/missing/no such activity",0.24064977450144595,0,0,0.4465997698716494,7.4731015599854872E-2,0.36671137810822713,0,0,0,0.11485136047106521,0,0,0,0,1.3693319233635359,0.16100903814131154,0.19535896530100544,0.10253493723597995,null,null,null,null,null,null,null,null,null,null,null,null,null,null,null,null,null,null,null,null,null,null,null,null,null,null,null,null,null,null,null,null,null,"DK/not sure/missing/no such activity",0.95346562376167143,0,0,2.0309636216883722,0.41592237815208849,0.95346562376167143,0,0,0,0.41592237815208849,0,0,0,0,2.0309636216883722,2.0309636216883722,0.95346562376167143,0.41592237815208849]
["Participation in specific activities during menstruation","Did not go to school (amongst those usually attending school)","N/A","N/A","N/A","N/A","N/A","N/A","N/A","N/A","N/A","N/A","N/A","N/A","N/A","N/A","N/A","N/A","N/A","N/A",null,null,null,null,null,null,null,null,null,null,null,null,null,null,null,null,null,null,null,null,null,null,null,null,null,null,null,null,null,null,null,null,"Participation in specific activities during menstruation","Did not go to school (amongst those usually attending school)","N/A","N/A","N/A","N/A","N/A","N/A","N/A","N/A","N/A","N/A","N/A","N/A","N/A","N/A","N/A","N/A","N/A","N/A"]
[null,"Did not go to work (amongst those who usually work)","N/A","N/A","N/A","N/A","N/A","N/A","N/A","N/A","N/A","N/A","N/A","N/A","N/A","N/A","N/A","N/A","N/A","N/A",null,null,null,null,null,null,null,null,null,null,null,null,null,null,null,null,null,null,null,null,null,null,null,null,null,null,null,null,null,null,null,null,null,"Did not go to work (amongst those who usually work)","N/A","N/A","N/A","N/A","N/A","N/A","N/A","N/A","N/A","N/A","N/A","N/A","N/A","N/A","N/A","N/A","N/A","N/A"]
[null,"Did not participate in social activities","N/A","N/A","N/A","N/A","N/A","N/A","N/A","N/A","N/A","N/A","N/A","N/A","N/A","N/A","N/A","N/A","N/A","N/A",null,null,null,null,null,null,null,null,null,null,null,null,null,null,null,null,null,null,null,null,null,null,null,null,null,null,null,null,null,null,null,null,null,"Did not participate in social activities","N/A","N/A","N/A","N/A","N/A","N/A","N/A","N/A","N/A","N/A","N/A","N/A","N/A","N/A","N/A","N/A","N/A","N/A"]
[null,"Did not cook food","N/A","N/A","N/A","N/A","N/A","N/A","N/A","N/A","N/A","N/A","N/A","N/A","N/A","N/A","N/A","N/A","N/A","N/A",null,null,null,null,null,null,null,null,null,null,null,null,null,null,null,null,null,null,null,null,null,null,null,null,null,null,null,null,null,null,null,null,null,"Did not cook food","N/A","N/A","N/A","N/A","N/A","N/A","N/A","N/A","N/A","N/A","N/A","N/A","N/A","N/A","N/A","N/A","N/A","N/A"]
[null,"Did not eat with others","N/A","N/A","N/A","N/A","N/A","N/A","N/A","N/A","N/A","N/A","N/A","N/A","N/A","N/A","N/A","N/A","N/A","N/A",null,null,null,null,null,null,null,null,null,null,null,null,null,null,null,null,null,null,null,null,null,null,null,null,null,null,null,null,null,null,null,null,null,"Did not eat with others","N/A","N/A","N/A","N/A","N/A","N/A","N/A","N/A","N/A","N/A","N/A","N/A","N/A","N/A","N/A","N/A","N/A","N/A"]
[null,"Did not bathe in regular place","N/A","N/A","N/A","N/A","N/A","N/A","N/A","N/A","N/A","N/A","N/A","N/A","N/A","N/A","N/A","N/A","N/A","N/A",null,null,null,null,null,null,null,null,null,null,null,null,null,null,null,null,null,null,null,null,null,null,null,null,null,null,null,null,null,null,null,null,null,"Did not bathe in regular place","N/A","N/A","N/A","N/A","N/A","N/A","N/A","N/A","N/A","N/A","N/A","N/A","N/A","N/A","N/A","N/A","N/A","N/A"]
[null,"Did not participate in other activities","N/A","N/A","N/A","N/A","N/A","N/A","N/A","N/A","N/A","N/A","N/A","N/A","N/A","N/A","N/A","N/A","N/A","N/A",null,null,null,null,null,null,null,null,null,null,null,null,null,null,null,null,null,null,null,null,null,null,null,null,null,null,null,null,null,null,null,null,null,"Did not participate in other activities","N/A","N/A","N/A","N/A","N/A","N/A","N/A","N/A","N/A","N/A","N/A","N/A","N/A","N/A","N/A","N/A","N/A","N/A"]
[null,"DK/not sure/missing/no such activity","N/A","N/A","N/A","N/A","N/A","N/A","N/A","N/A","N/A","N/A","N/A","N/A","N/A","N/A","N/A","N/A","N/A","N/A",null,null,null,null,null,null,null,null,null,null,null,null,null,null,null,null,null,null,null,null,null,null,null,null,null,null,null,null,null,null,null,null,null,"DK/not sure/missing/no such activity","N/A","N/A","N/A","N/A","N/A","N/A","N/A","N/A","N/A","N/A","N/A","N/A","N/A","N/A","N/A","N/A","N/A","N/A"]
[]
[]
[]
[]
[]
[]
[]
[]
[]
[]
[]
[]
[]
[]
[]
[]
[]
[]
[]
[]
[]
[]
[]
[]
[]
[]
[]
[]
[]
[]
[]
[]
[]
[]
[]
[]
[]
[]
[]
[]
[]
[]
[]
[]
[]
[]
[{"$f":"A1026","v":"Montenegro"}]
[{"$f":"A1034","v":"2018"}]
["Use of basic water, sanitation and hygiene facilities"]
[" by wealth quintile and sub-national region"]
["Notes:"]
["WHO/UNICEF JMP customised wealth index excludes water,"]
[" sanitation and hygiene assets."]
["Survey used for analysis:",{"$f":"A1025","v":"MICS18"}]
["Basic water, sanitation and hygiene",null,"NATIONAL wealth index quintile",null,null,null,null,"URBAN wealth index quintile",null,null,null,null,"RURAL wealth index quintile",null,null,null,null,"SUB-REGIONS:",null,null,null,null,null,null,null,null,null,null,null,null,null,null,null,null,null,null,null,null,null,null,null,null,null,null,null,null,null,null,null,null,null,null,"Raw numbers of respondents:","Basic water, sanitation and hygiene","NATIONAL wealth index quintile",null,null,null,null,"URBAN wealth index quintile",null,null,null,null,"RURAL wealth index quintile",null,null,null,null,"SUB-REGIONS:"]
["Percentage based on weighted population",null,"Poorest","Poor","Middle","Rich","Richest","Poorest","Poor","Middle","Rich","Richest","Poorest","Poor","Middle","Rich","Richest","CENTRE","NORTH","SOUTH",null,null,null,null,null,null,null,null,null,null,null,null,null,null,null,null,null,null,null,null,null,null,null,null,null,null,null,null,null,null,null,null,"WatSan data, raw numbers (weighted)",null,"Poorest","Poor","Middle","Rich","Richest","Poorest","Poor","Middle","Rich","Richest","Poorest","Poor","Middle","Rich","Richest","CENTRE","NORTH","SOUTH"]
["Use of basic water sanitation and hygiene","Yes",84.73804100227791,93.506493506493499,96.395193591455268,97.196261682242991,98.341625207296843,95.274102079395078,97.97570850202429,97.477064220183479,99.328859060402692,98.563218390804593,74.137931034482762,87.936507936507937,89.078498293515366,93.851132686084142,95.439739413680783,97.085020242914979,88.860918816865947,96.606786427145707,null,null,null,null,null,null,null,null,null,null,null,null,null,null,null,null,null,null,null,null,null,null,null,null,null,null,null,null,null,null,null,null,"Use of Basic Water Sanitation and Hygiene","Yes",744,792,722,728,593,504,484,425,444,343,258,277,261,290,293,1199,1412,968]
[null,"No",15.261958997722095,6.4935064935064926,3.6048064085447264,2.8037383177570092,1.6583747927031509,4.7258979206049148,2.0242914979757085,2.522935779816514,0.67114093959731547,1.4367816091954022,25.862068965517242,12.063492063492063,10.921501706484642,6.1488673139158578,4.5602605863192185,2.9149797570850202,11.139081183134046,3.3932135728542914,null,null,null,null,null,null,null,null,null,null,null,null,null,null,null,null,null,null,null,null,null,null,null,null,null,null,null,null,null,null,null,null,null,"No",134,55,27,21,10,25,10,11,3,5,90,38,32,19,14,36,177,34]
["Use of basic water and sanitation","Yes",84.965831435079735,93.624557260920895,96.528704939919891,97.196261682242991,98.341625207296843,95.463137996219288,97.97570850202429,97.706422018348633,99.328859060402692,98.563218390804593,74.425287356321832,88.253968253968253,89.078498293515366,93.851132686084142,95.439739413680783,97.085020242914979,89.049716803020772,96.706586826347305,null,null,null,null,null,null,null,null,null,null,null,null,null,null,null,null,null,null,null,null,null,null,null,null,null,null,null,null,null,null,null,null,"Use of Basic Water and Sanitation","Yes",746,793,723,728,593,505,484,426,444,343,259,278,261,290,293,1199,1415,969]
[null,"No",15.034168564920272,6.3754427390791024,3.4712950600801067,2.8037383177570092,1.6583747927031509,4.536862003780719,2.0242914979757085,2.2935779816513762,0.67114093959731547,1.4367816091954022,25.574712643678161,11.746031746031745,10.921501706484642,6.1488673139158578,4.5602605863192185,2.9149797570850202,10.950283196979232,3.293413173652695,null,null,null,null,null,null,null,null,null,null,null,null,null,null,null,null,null,null,null,null,null,null,null,null,null,null,null,null,null,null,null,null,null,"No",132,54,26,21,10,24,10,10,3,5,89,37,32,19,14,36,174,33]
["Use of basic water and hygiene","Yes",97.15261958997722,98.22904368358914,98.798397863818423,98.6648865153538,98.507462686567166,99.810964083175804,99.190283400809719,99.311926605504581,99.776286353467555,98.850574712643677,93.965517241379317,97.777777777777771,96.928327645051198,97.087378640776706,97.068403908794792,98.542510121457497,98.04908747640026,98.103792415169664,null,null,null,null,null,null,null,null,null,null,null,null,null,null,null,null,null,null,null,null,null,null,null,null,null,null,null,null,null,null,null,null,"Use of Basic Water and Hygiene","Yes",853,832,740,739,594,528,490,433,446,344,327,308,284,300,298,1217,1558,983]
[null,"No",2.8473804100227791,1.7709563164108619,1.2016021361815754,1.3351134846461949,1.4925373134328357,0.1890359168241966,0.80971659919028338,0.68807339449541294,0.22371364653243847,1.1494252873563218,6.0344827586206895,2.2222222222222223,3.0716723549488054,2.912621359223301,2.9315960912052117,1.4574898785425101,1.9509125235997484,1.8962075848303395,null,null,null,null,null,null,null,null,null,null,null,null,null,null,null,null,null,null,null,null,null,null,null,null,null,null,null,null,null,null,null,null,null,"No",25,15,9,10,9,1,4,3,1,4,21,7,9,9,9,18,31,19]
["Use of basic sanitation and hygiene","Yes",86.902050113895214,95.159386068476977,97.463284379172237,98.531375166889191,99.834162520729691,95.274102079395078,98.785425101214571,97.935779816513758,99.552572706935123,99.712643678160916,78.735632183908038,89.841269841269849,92.150170648464169,96.763754045307451,98.371335504885991,98.542510121457497,90.371302706104473,98.403193612774459,null,null,null,null,null,null,null,null,null,null,null,null,null,null,null,null,null,null,null,null,null,null,null,null,null,null,null,null,null,null,null,null,"Use of Basic Sanitation and Hygiene","Yes",763,806,730,738,602,504,488,427,445,347,274,283,270,299,302,1217,1436,986]
[null,"No",13.097949886104784,4.8406139315230226,2.5367156208277701,1.4686248331108143,0.16583747927031509,4.7258979206049148,1.214574898785425,2.0642201834862388,0.44742729306487694,0.28735632183908044,21.264367816091951,10.158730158730158,7.8498293515358366,3.2362459546925564,1.6286644951140066,1.4574898785425101,9.6286972938955309,1.5968063872255487,null,null,null,null,null,null,null,null,null,null,null,null,null,null,null,null,null,null,null,null,null,null,null,null,null,null,null,null,null,null,null,null,null,"No",115,41,19,11,1,25,6,9,2,1,74,32,23,10,5,18,153,16]
["Use of basic water","Yes",97.494305239179951,98.347107438016536,98.931909212283045,98.6648865153538,98.507462686567166,100,99.190283400809719,99.541284403669721,99.776286353467555,98.850574712643677,94.540229885057471,98.095238095238088,96.928327645051198,97.087378640776706,97.068403908794792,98.542510121457497,98.300818124606664,98.203592814371248,null,null,null,null,null,null,null,null,null,null,null,null,null,null,null,null,null,null,null,null,null,null,null,null,null,null,null,null,null,null,null,null,"Use of Basic Water","Yes",856,833,741,739,594,529,490,434,446,344,329,309,284,300,298,1217,1562,984]
[null,"No",2.5056947608200453,1.6528925619834711,1.0680907877169559,1.3351134846461949,1.4925373134328357,0,0.80971659919028338,0.45871559633027525,0.22371364653243847,1.1494252873563218,5.4597701149425291,1.9047619047619049,3.0716723549488054,2.912621359223301,2.9315960912052117,1.4574898785425101,1.6991818753933292,1.7964071856287425,null,null,null,null,null,null,null,null,null,null,null,null,null,null,null,null,null,null,null,null,null,null,null,null,null,null,null,null,null,null,null,null,null,"No",22,14,8,10,9,0,4,2,1,4,19,6,9,9,9,18,27,18]
["Use of basic sanitation","Yes",87.129840546697039,95.277449822904373,97.596795727636859,98.531375166889191,99.834162520729691,95.463137996219288,98.785425101214571,98.165137614678898,99.552572706935123,99.712643678160916,79.022988505747122,90.158730158730165,92.150170648464169,96.763754045307451,98.371335504885991,98.542510121457497,90.560100692259283,98.502994011976057,null,null,null,null,null,null,null,null,null,null,null,null,null,null,null,null,null,null,null,null,null,null,null,null,null,null,null,null,null,null,null,null,"Use of Basic Sanitation","Yes",765,807,731,738,602,505,488,428,445,347,275,284,270,299,302,1217,1439,987]
[null,"No",12.870159453302962,4.7225501770956315,2.4032042723631508,1.4686248331108143,0.16583747927031509,4.536862003780719,1.214574898785425,1.834862385321101,0.44742729306487694,0.28735632183908044,20.977011494252874,9.8412698412698418,7.8498293515358366,3.2362459546925564,1.6286644951140066,1.4574898785425101,9.4398993077407169,1.4970059880239521,null,null,null,null,null,null,null,null,null,null,null,null,null,null,null,null,null,null,null,null,null,null,null,null,null,null,null,null,null,null,null,null,null,"No",113,40,18,11,1,24,6,8,2,1,73,31,23,10,5,18,150,15]
["Access to basic hygiene","Yes",99.658314350797255,99.881936245572618,99.866488651535377,100,100,99.810964083175804,100,99.77064220183486,100,100,99.425287356321832,99.682539682539684,100,100,100,100,99.748269351793581,99.900199600798402,null,null,null,null,null,null,null,null,null,null,null,null,null,null,null,null,null,null,null,null,null,null,null,null,null,null,null,null,null,null,null,null,"Access to Basic Hygiene","Yes",875,846,748,749,603,528,494,435,447,348,346,314,293,309,307,1235,1585,1001]
[null,"No",0.34168564920273348,0.11806375442739078,0.13351134846461948,0,0,0.1890359168241966,0,0.22935779816513763,0,0,0.57471264367816088,0.31746031746031744,0,0,0,0,0.25173064820641916,9.9800399201596793E-2,null,null,null,null,null,null,null,null,null,null,null,null,null,null,null,null,null,null,null,null,null,null,null,null,null,null,null,null,null,null,null,null,null,"No",3,1,1,0,0,1,0,1,0,0,2,1,0,0,0,0,4,1]
[]
[]
[]
[]
[]
[]
[]
[]
[]
[]
[]
[]
[]
[]
[]
[]
[]
[]
[]
[]
[]
[]
[]
[]
[]
[]
[]
[]
[]
[]
[]
[]
[]
[]
[]
[]
[]
[]
[]
[]
[]
[]
[]
[]
[null,null,"INITIAL (national) Wealth Index",null,null,null,null,"URBAN Wealth Index",null,null,null,null,"RURAL Wealth Index"]
[null,null,"Component Matrix",null,null,null,null,"Component Matrix",null,null,null,null,"Component Matrix"]
[null,null,"",null,"Component",null,null,"",null,"Component",null,null,"",null,"Component"]
[null,"Note:\n\nThe INITIAL (national) Wealth Index is based on the first component of the Principal Component Analysis (PCA) which has been obtained at national level.\n\nThe final national-level (NATIONAL) Wealth Index is based on the URBAN and RURAL specific wealth indexes. Regression procedures are used to establish the relationships between the two sets of scores (urban and rural) and the initial (national) wealth factors.\nThis allows best use of the available information for each area and a better precision of the FINAL (NATIONAL) Wealth Index.\n\nFor dependency reasons, all WASH variables (contained in the generic MICS and DHS scripts) have been excluded from the sets of asset variables used in the PCAs.\n\nThe PCA can extracts as many components as there are asset variables in the input. Only the first of the components is used to represent the Wealth Index. \n\nThe scores represent the weights of the asset variables on the Wealth Index (correlations between the variables and the component).\n\nThe communalities are the proportion of each variable's variance that can be explained by the component.\n\nProportion of explained variance is the part of the model's total variance that is explained by the component.\n\nFor more information on the procedure used:\n\nThe DHS Wealth Index, DHS Comparative Reports No. 6, Shea Oscar Rutstein, Kiersten Johnson, ORC Macro International Inc., 2004.\n\nThe DHS Wealth Index: Approaches for Rural and Urban Areas, Shea O. Rutstein, ORC Macro International Inc., 2008.\n\nMICS Methodological Paper No. 4, Review of options for reporting water, sanitation and hygiene coverage by wealth quintile, UNICEF, 2016.",null,null,"1",null,null,null,null,"1",null,null,null,null,"1"]
[null,null,"Changes furniture",null,0.63832802805322286,null,null,"Changes furniture",null,0.6946837188170315,null,null,"Shoe cabinet",null,0.62998954768049975]
[null,null,"Does not change furniture by need",null,-0.63475371584571438,null,null,"Does not change furniture by need",null,-0.69235426916737353,null,null,"Vacuum cleaner",null,0.62850610302719689]
[null,null,"Shoe cabinet",null,0.60141020377731358,null,null,"Can afford an unexpected required expense of 170 EUR",null,0.63188025408328352,null,null,"Has smart flat TV",null,0.61002605755971506]
[null,null,"Has pctablet",null,0.59279730446213375,null,null,"Has pctablet",null,0.60356276598869574,null,null,"Changes furniture",null,0.60990077610930571]
[null,null,"Has smart flat TV",null,0.58285872247767301,null,null,"Entire household can afford to go for a week's annual holiday",null,0.60198591174548888,null,null,"Has pctablet",null,0.60265893719322261]
[null,null,"Lack smart flat TV by need",null,-0.57368546836132939,null,null,"Can afford an unexpected required expense of 230 EUR",null,0.57668803231748489,null,null,"Has washing mashine",null,0.59855409185137454]
[null,null,"Only CRT television",null,-0.55187853467767534,null,null,"Can afford a meal with meat, chicken, fish every second day",null,0.5638887118500937,null,null,"Does not change furniture by need",null,-0.59322799811419236]
[null,null,"Can afford a meal with meat, chicken, fish every second day",null,0.55100965433236448,null,null,"Lack smart flat TV by need",null,-0.55156851139295027,null,null,"Has car",null,0.58947784041830431]
[null,null,"Vacuum cleaner",null,0.55080022583325461,null,null,"Has smart flat TV",null,0.55143310864809592,null,null,"Internet at home",null,0.58073987535158123]
[null,null,"Internet at home",null,0.54851994660997128,null,null,"Lack pactablet by need",null,-0.54879098515461655,null,null,"Water heater",null,0.58029708187530349]
[null,null,"Can afford an unexpected required expense of 170 EUR",null,0.54471025285957253,null,null,"Only CRT television",null,-0.5453247294936131,null,null,"Lack washing mashine by need",null,-0.56750068763110417]
[null,null,"Entire household can afford to go for a week's annual holiday",null,0.5394231454340207,null,null,"Dishwasher",null,0.52830072283582974,null,null,"Shower unit/bathtub",null,0.56241581027700704]
[null,null,"Lack pactablet by need",null,-0.53005839750824968,null,null,"Has car",null,0.5241408920001136,null,null,"Only CRT television",null,-0.55615116182996638]
[null,null,"Has washing mashine",null,0.52852528687802158,null,null,"Shoe cabinet",null,0.51360484259282857,null,null,"Lack smart flat TV by need",null,-0.55560462727132687]
[null,null,"Living room seating set",null,0.52223402016993392,null,null,"Internet at home",null,0.51242993294957251,null,null,"Living room seating set",null,0.54784672702463699]
[null,null,"Lack washing mashine by need",null,-0.51622287140325618,null,null,"Lack car by need",null,-0.49937592146392895,null,null,"Can afford an unexpected required expense of 170 EUR",null,0.53020023696939211]
[null,null,"Has car",null,0.5149612888228714,null,null,"Lack fixedphone by need",null,-0.47491753792009345,null,null,"Dresser",null,0.52682681021792876]
[null,null,"Dishwasher",null,0.51040991608723496,null,null,"Living room seating set",null,0.43885779396343771,null,null,"Can afford a meal with meat, chicken, fish every second day",null,0.52552347708898939]
[null,null,"Electric stove",null,0.49832763922384288,null,null,"Rot in window frames or floor",null,-0.41971860466542343,null,null,"Freezer",null,0.51808278899721039]
[null,null,"Dresser",null,0.49335460901518741,null,null,"Dinning table and chairs set",null,0.41776636580878923,null,null,"Leaking roof",null,-0.51320014921235935]
[null,null,"Water heater",null,0.49250707025876606,null,null,"Vacuum cleaner",null,0.40875935843524652,null,null,"Electric stove",null,0.51315430285571428]
[null,null,"Lack car by need",null,-0.48824707817833135,null,null,"Dresser",null,0.40694815514108268,null,null,"Entire household can afford to go for a week's annual holiday",null,0.49159432776400402]
[null,null,"Shower unit/bathtub",null,0.48561386629149872,null,null,"Electric stove",null,0.40686957148195169,null,null,"Dishwasher",null,0.4913909934002556]
[null,null,"Lack fixedphone by need",null,-0.4681067634079486,null,null,"Bicycle",null,0.3970273244140845,null,null,"Dinning table and chairs set",null,0.49086857533307737]
[null,null,"Dinning table and chairs set",null,0.45558186158373365,null,null,"Freezer",null,0.3919304210974881,null,null,"Lack car by need",null,-0.48801406872178793]
[null,null,"Leaking roof",null,-0.44869969240173752,null,null,"Has washing mashine",null,0.38671583465120507,null,null,"Can afford an unexpected required expense of 230 EUR",null,0.47699060041534852]
[null,null,"Rot in window frames or floor",null,-0.44829837199504613,null,null,"Lack washing mashine by need",null,-0.38197113152222595,null,null,"Rot in window frames or floor",null,-0.47466689574207521]
[null,null,"Freezer",null,0.43301336813672603,null,null,"Leaking roof",null,-0.35817834392131415,null,null,"Lack pactablet by need",null,-0.46277620495344968]
[null,null,"Wardrobe",null,0.40778053799461067,null,null,"Late with payment of utility bills",null,-0.33755617491269274,null,null,"Wardrobe",null,0.45437261627655362]
[null,null,"Bicycle",null,0.37877305838140968,null,null,"Has fixedphone",null,0.31118762233473118,null,null,"Lack fixedphone by need",null,-0.42225834615922614]
[null,null,"Wood planks floor",null,-0.35753629038213908,null,null,"Drying machine",null,0.30158193390488586,null,null,"Wood planks floor",null,-0.42112670527970858]
[null,null,"Has fixedphone",null,0.33263404006535346,null,null,"Can afford to keep home adequately warm",null,0.27904693305448747,null,null,"Refrigerator",null,0.38716132630422256]
[null,null,"Parquet/polished wood or laminated floor",null,0.32110566574859445,null,null,"Shower unit/bathtub",null,0.27788060632012984,null,null,"Bicycle",null,0.38520818898266634]
[null,null,"Cement floor",null,-0.2774577125781329,null,null,"Second dwelling",null,0.27635602665101983,null,null,"Has fixedphone",null,0.357962312492134]
[null,null,"Drying machine",null,0.27740080515793125,null,null,"Water heater",null,0.25177064142071554,null,null,"Parquet/polished wood or laminated floor",null,0.29719128516870341]
[null,null,"Wood",null,-0.26252491759173885,null,null,"Parquet/polished wood or laminated floor",null,0.25028739402006484,null,null,"Cement floor",null,-0.28343782825942171]
[null,null,"Late with payment of utility bills",null,-0.26159139592029645,null,null,"Wood",null,-0.23668309409894248,null,null,"Drying machine",null,0.2631369779368094]
[null,null,"Can afford to keep home adequately warm",null,0.24536064370893615,null,null,"Lack pctablet at will",null,-0.22520719930869293,null,null,"Lack car at will",null,-0.26214707005553756]
[null,null,"Electricity",null,0.23772580391891071,null,null,"Cement floor",null,-0.22061000671725967,null,null,"Lack pctablet at will",null,-0.24464989818068486]
[null,null,"Second dwelling",null,0.22852933865564404,null,null,"Has mobile",null,0.21935663257806234,null,null,"Reused wood walls",null,-0.24263572019145507]
[null,null,"Asbestos roof",null,-0.21061797497541251,null,null,"Electricity",null,0.21343538207409726,null,null,"Roofing tiles roof",null,0.23943011330537081]
[null,null,"Cement walls",null,0.20243236332715814,null,null,"Wood planks floor",null,-0.21071466398444927,null,null,"Cement walls",null,0.2278136092146146]
[null,null,"Dwelling too dark (not enough daylight)",null,-0.19452050811633317,null,null,"Dwelling too dark (not enough daylight)",null,-0.19159788989350571,null,null,"Wood planks roof",null,-0.21998282663571253]
[null,null,"Reused wood walls",null,-0.19189218293978463,null,null,"Carpet/itison floor",null,-0.18938522096588917,null,null,"Asbestos roof",null,-0.21613800790122434]
[null,null,"Has mobile",null,0.18996662287757976,null,null,"Asbestos roof",null,-0.18832431000491953,null,null,"Has mobile",null,0.21371996383355604]
[null,null,"Does not have hire-purchase instalments or other loan payments",null,-0.18898241034544325,null,null,"Motorcycle/scooter",null,0.18566543946191993,null,null,"Plywood walls",null,-0.20700616064611557]
[null,null,"Plywood walls",null,-0.17910940932459232,null,null,"Lack mobile at will",null,-0.18003052718599691,null,null,"Late with payment of utility bills",null,-0.20605142886047528]
[null,null,"Apartment in building with 10 or more dwellings",null,0.17399271705921407,null,null,"Video surveillance system",null,0.1778750771475259,null,null,"Dwelling too dark (not enough daylight)",null,-0.20508128415144206]
[null,null,"Motorcycle/scooter",null,0.17374442593352044,null,null,"Radio",null,0.16414701369406581,null,null,"Can afford to keep home adequately warm",null,0.20420285129579205]
[null,null,"Detached house",null,-0.17227018088181151,null,null,"Cement walls",null,0.16381723355580827,null,null,"Lack smart flat TV at will",null,-0.20133863649688349]
[null,null,"Wood planks roof",null,-0.16666145723533379,null,null,"Lack car at will",null,-0.1609894945751153,null,null,"Metal/tin roof",null,-0.19991196640032566]
[null,null,"Roofing tiles roof",null,0.16213369035453185,null,null,"Late with payment of hire-purchase instalments or other loan payments",null,-0.15431686665417732,null,null,"Wood",null,-0.19879626248923535]
[null,null,"Metal/tin roof",null,-0.15806952021313508,null,null,"Lack smart flat TV at will",null,-0.14943848353670686,null,null,"Motorcycle/scooter",null,0.1978555765711015]
[null,null,"Video surveillance system",null,0.15376776611911583,null,null,"Processed biomass (pellets) or woodchips",null,0.14843729365512542,null,null,"Lack washing mashine at will",null,-0.1972633421532895]
[null,null,"Wood planks/shingles walls",null,-0.15320150775940108,null,null,"Late with payment of rent",null,-0.14372491728323888,null,null,"Electricity",null,0.18657461443037421]
[null,null,"Lack mobile by need",null,-0.14602658183603834,null,null,"Apartment in building with 10 or more dwellings",null,0.13896500141469451,null,null,"Wood planks/shingles walls",null,-0.17989650043116023]
[null,null,"Stone with mud walls",null,-0.145212435920995,null,null,"No electricity",null,-0.13801822592770152,null,null,"Stone with mud walls",null,-0.17619204247283057]
[null,null,"No electricity",null,-0.13594440107310174,null,null,"Lack mobile by need",null,-0.12905613313019526,null,null,"Second dwelling",null,0.17313105214053484]
[null,null,"Processed biomass (pellets) or woodchips",null,0.13379153336982413,null,null,"Persons per sleeping rooms",null,-0.12728347690811717,null,null,"Lack mobile at will",null,-0.15599634202028431]
[null,null,"Carpet/itison floor",null,-0.13370258340605323,null,null,"Metal/tin roof",null,-0.12369167835324767,null,null,"Detached house",null,-0.14647212057781622]
[null,null,"Radio",null,0.12661542973027481,null,null,"Brick walls",null,-0.11834380113996611,null,null,"Lack mobile by need",null,-0.14526555577800646]
[null,null,"Late with payment of hire-purchase instalments or other loan payments",null,-0.10870955128011063,null,null,"Plywood walls",null,-0.11421826258622839,null,null,"Pressed dirt (straw, thatch, mud) walls",null,-0.14167499138180312]
[null,null,"Pressed dirt (straw, thatch, mud) walls",null,-0.10853014169453577,null,null,"Pollution, grime or other environmental problem",null,-0.10986142159234391,null,null,"No electricity",null,-0.1292010455340506]
[null,null,"Persons per sleeping rooms",null,-0.10279286896845154,null,null,"Too much noise in dwelling",null,-0.10722387865322364,null,null,"Cane/trunks walls",null,-0.12897810803079565]
[null,null,"Mortgage on main dwelling",null,9.9861489901978656E-2,null,null,"Wood planks/shingles walls",null,-9.9691058422560347E-2,null,null,"Ceramic tiles floor",null,0.12512572274914963]
[null,null,"Cane/trunks walls",null,-9.6780984920558116E-2,null,null,"Lack washing mashine at will",null,-9.7549685516687731E-2,null,null,"Cement blocks walls",null,0.12456168075878638]
[null,null,"Wood roof",null,-9.5673509641614266E-2,null,null,"Speedboat or yacht",null,9.7354019067363115E-2,null,null,"Video surveillance system",null,0.11954597689087035]
[null,null,"Cement roof",null,9.0083201787620179E-2,null,null,"Roofing tiles roof",null,9.58122082380502E-2,null,null,"Wood roof",null,-0.11790385101147138]
[null,null,"Speedboat or yacht",null,8.8125427384113747E-2,null,null,"Vinyl or linoleum floor",null,-9.4988576165776759E-2,null,null,"Processed biomass (pellets) or woodchips",null,0.1167020221725996]
[null,null,"Vinyl or linoleum floor",null,-8.2498925389992497E-2,null,null,"Water scooter/ski jet",null,8.2991195566687381E-2,null,null,"Does not have utility bills",null,-0.10779347094068104]
[null,null,"Apartment in building with less than 10 dwellings",null,7.5947256881446809E-2,null,null,"Detached house",null,-7.9551342598461861E-2,null,null,"Apartment in building with less than 10 dwellings",null,0.10280706347392861]
[null,null,"Water scooter/ski jet",null,6.857322324167732E-2,null,null,"Roofing shingles roof",null,7.258766506845131E-2,null,null,"Radio",null,0.10041017226330275]
[null,null,"Cement blocks walls",null,6.2611781455901627E-2,null,null,"Reused wood walls",null,-6.8669764667007679E-2,null,null,"Speedboat or yacht",null,9.7758401001055775E-2]
[null,null,"Brick walls",null,-5.8797911892175724E-2,null,null,"Cement roof",null,6.6116777378479777E-2,null,null,"Cement roof",null,9.3101399433680523E-2]
[null,null,"Stone with lime/cement walls",null,-5.8225935170780903E-2,null,null,"Solar panel",null,6.3061533951585744E-2,null,null,"Late with payment of hire-purchase instalments or other loan payments",null,-8.8555238941847469E-2]
[null,null,"Solar panel",null,5.5568002160291098E-2,null,null,"cow1",null,-4.2903696097296051E-2,null,null,"Persons per sleeping rooms",null,-8.6932878507784597E-2]
[null,null,null,null,null,null,null,"Land area (hectares)",null,3.9232955889045726E-2,null,null,"Semi-detached or terraced house",null,8.6667432765051872E-2]
[null,null,null,null,null,null,null,"Lack fixedphone at will",null,-3.8492282331339035E-2,null,null,"Carpet/itison floor",null,-7.5930797501754993E-2]
[null,null,null,null,null,null,null,"Does not change furniture at will",null,-3.5053157741963291E-2,null,null,"Vinyl or linoleum floor",null,-6.9723102716591864E-2]
[null,null,"Communalities",null,null,null,null,"pig1",null,-1.7887041639175216E-2,null,null,"Stone with lime/cement walls",null,-6.7487148817868978E-2]
[null,null,"",null,"Extraction",null,null,null,null,null,null,null,"Apartment in building with 10 or more dwellings",null,6.6213544681600137E-2]
[null,null,"Persons per sleeping rooms",null,1.0566373910765247E-2,null,null,null,null,null,null,null,"Water scooter/ski jet",null,5.8409551940368336E-2]
[null,null,"Detached house",null,2.9677015221052056E-2,null,null,null,null,null,null,null,"Lack fixedphone at will",null,-5.5951167806662865E-2]
[null,null,"Apartment in building with less than 10 dwellings",null,5.7679858278164697E-3,null,null,"Communalities",null,null,null,null,"Mortgage on main dwelling",null,5.4154112116234977E-2]
[null,null,"Apartment in building with 10 or more dwellings",null,3.0273465589647722E-2,null,null,"",null,"Extraction",null,null,"Solar panel",null,5.0697808245492547E-2]
[null,null,"Wood planks floor",null,0.12783219894022127,null,null,"Persons per sleeping rooms",null,1.6201083493819199E-2,null,null,"Does not change furniture at will",null,-5.0298879904107155E-2]
[null,null,"Parquet/polished wood or laminated floor",null,0.10310884857584807,null,null,"Detached house",null,6.3284161092178525E-3,null,null,"Uncovered adobe walls",null,-4.6284224482600576E-2]
[null,null,"Vinyl or linoleum floor",null,6.8060726905035491E-3,null,null,"Apartment in building with 10 or more dwellings",null,1.9311271618186045E-2,null,null,"Solar air heater",null,4.5939664178637041E-2]
[null,null,"Cement floor",null,7.6982782269089806E-2,null,null,"Wood planks floor",null,4.4400669618079362E-2,null,null,"Brick walls",null,-3.5540723880711701E-2]
[null,null,"Carpet/itison floor",null,1.787638080945262E-2,null,null,"Parquet/polished wood or laminated floor",null,6.2643779605355193E-2,null,null,"Liquefied petroleum gas (lpg)/cooking gas",null,3.1702089787205026E-2]
[null,null,"Wood planks roof",null,2.7776041327804996E-2,null,null,"Vinyl or linoleum floor",null,9.0228296020015732E-3,null,null,"Calamine/cement fibre roof",null,-1.4392510248948741E-2]
[null,null,"Metal/tin roof",null,2.4985973220410723E-2,null,null,"Cement floor",null,4.8668775063789353E-2,null,null,"Crime, violence or vandalism in local area",null,-7.0276825675215475E-3]
[null,null,"Wood roof",null,9.1534204471440585E-3,null,null,"Carpet/itison floor",null,3.5866761920298668E-2]
[null,null,"Roofing tiles roof",null,2.6287333547979214E-2,null,null,"Metal/tin roof",null,1.5299631293843277E-2]
[null,null,"Cement roof",null,8.1149832443090947E-3,null,null,"Roofing tiles roof",null,9.1799792474514946E-3]
[null,null,"Asbestos roof",null,4.4359931382743495E-2,null,null,"Cement roof",null,4.3714282509154552E-3,null,null,"Communalities"]
[null,null,"Cane/trunks walls",null,9.3665590421932975E-3,null,null,"Roofing shingles roof",null,5.2689691200896666E-3,null,null,"",null,"Extraction"]
[null,null,"Pressed dirt (straw, thatch, mud) walls",null,1.1778791656236012E-2,null,null,"Asbestos roof",null,3.5466045738829034E-2,null,null,"Persons per sleeping rooms",null,7.5573253656492367E-3]
[null,null,"Stone with mud walls",null,2.1086651546109079E-2,null,null,"Plywood walls",null,1.3045811508216619E-2,null,null,"Detached house",null,2.1454082106562335E-2]
[null,null,"Plywood walls",null,3.208018050860436E-2,null,null,"Reused wood walls",null,4.7155365794222161E-3,null,null,"Semi-detached or terraced house",null,7.511243902084787E-3]
[null,null,"Reused wood walls",null,3.6822609873395772E-2,null,null,"Cement walls",null,2.6836086009878236E-2,null,null,"Apartment in building with less than 10 dwellings",null,1.0569292300132385E-2]
[null,null,"Cement walls",null,4.0978861722218561E-2,null,null,"Brick walls",null,1.4005255268255842E-2,null,null,"Apartment in building with 10 or more dwellings",null,4.3842334993022579E-3]
[null,null,"Stone with lime/cement walls",null,3.3902595265119803E-3,null,null,"Wood planks/shingles walls",null,9.9383071294103405E-3,null,null,"Wood planks floor",null,0.17734770189974253]
[null,null,"Brick walls",null,3.4571944428800593E-3,null,null,"Has fixedphone",null,9.6837736294343293E-2,null,null,"Parquet/polished wood or laminated floor",null,8.8322659980225593E-2]
[null,null,"Cement blocks walls",null,3.9202351770815866E-3,null,null,"Lack fixedphone at will",null,1.4816557990755153E-3,null,null,"Vinyl or linoleum floor",null,4.8613110524284202E-3]
[null,null,"Wood planks/shingles walls",null,2.347070197975383E-2,null,null,"Lack fixedphone by need",null,0.22554666782408339,null,null,"Ceramic tiles floor",null,1.565644649349706E-2]
[null,null,"Has fixedphone",null,0.11064540461019917,null,null,"Radio",null,2.6944242104679831E-2,null,null,"Cement floor",null,8.0337002488417436E-2]
[null,null,"Lack fixedphone by need",null,0.21912394194826518,null,null,"Dinning table and chairs set",null,0.1745287364010831,null,null,"Carpet/itison floor",null,5.7654860092525226E-3]
[null,null,"Radio",null,1.603146704578216E-2,null,null,"Dresser",null,0.1656068009727307,null,null,"Wood planks roof",null,4.8392444014637957E-2]
[null,null,"Dinning table and chairs set",null,0.20755483260410024,null,null,"Shoe cabinet",null,0.26378993433480419,null,null,"Metal/tin roof",null,3.9964794310044932E-2]
[null,null,"Wardrobe",null,0.16628496716717411,null,null,"Living room seating set",null,0.19259616332245516,null,null,"Wood roof",null,1.3901318083335241E-2]
[null,null,"Dresser",null,0.24339877023652842,null,null,"No electricity",null,1.9049030688230061E-2,null,null,"Calamine/cement fibre roof",null,2.0714435126609453E-4]
[null,null,"Shoe cabinet",null,0.36169423320746985,null,null,"Only CRT television",null,0.29737906059728231,null,null,"Roofing tiles roof",null,5.7326779157422708E-2]
[null,null,"Living room seating set",null,0.27272837182285092,null,null,"Has smart flat TV",null,0.30407847331330273,null,null,"Cement roof",null,8.6678705765097282E-3]
[null,null,"No electricity",null,1.8480880183124344E-2,null,null,"Lack smart flat TV at will",null,2.2331860361750607E-2,null,null,"Asbestos roof",null,4.6715638459509712E-2]
[null,null,"Only CRT television",null,0.30456991703797809,null,null,"Lack smart flat TV by need",null,0.30422782276023513,null,null,"Cane/trunks walls",null,1.6635352351203593E-2]
[null,null,"Has smart flat TV",null,0.33972429036830504,null,null,"Has washing mashine",null,0.14954913676997819,null,null,"Pressed dirt (straw, thatch, mud) walls",null,2.0071803183033986E-2]
[null,null,"Lack smart flat TV by need",null,0.32911501660895787,null,null,"Lack washing mashine at will",null,9.5159411444046757E-3,null,null,"Stone with mud walls",null,3.1043635830747731E-2]
[null,null,"Has washing mashine",null,0.27933897886949499,null,null,"Lack washing mashine by need",null,0.14590194531636963,null,null,"Uncovered adobe walls",null,2.1422294359557626E-3]
[null,null,"Lack washing mashine by need",null,0.26648605295982275,null,null,"Freezer",null,0.15360945498165435,null,null,"Plywood walls",null,4.2851550545445406E-2]
[null,null,"Freezer",null,0.18750057698511183,null,null,"Vacuum cleaner",null,0.16708421310839433,null,null,"Reused wood walls",null,5.8872092712826077E-2]
[null,null,"Vacuum cleaner",null,0.30338088877796426,null,null,"Electric stove",null,0.16554284819790699,null,null,"Cement walls",null,5.1899040543389133E-2]
[null,null,"Electric stove",null,0.24833043601440852,null,null,"Drying machine",null,9.0951662857810936E-2,null,null,"Stone with lime/cement walls",null,4.5545152555651943E-3]
[null,null,"Drying machine",null,7.6951206702268543E-2,null,null,"Dishwasher",null,0.2791016537488602,null,null,"Brick walls",null,1.2631430539649911E-3]
[null,null,"Dishwasher",null,0.26051828244017822,null,null,"Video surveillance system",null,3.1639543070238293E-2,null,null,"Cement blocks walls",null,1.5515612313453811E-2]
[null,null,"Video surveillance system",null,2.3644525897263107E-2,null,null,"Water heater",null,6.338845588139852E-2,null,null,"Wood planks/shingles walls",null,3.2362750867378436E-2]
[null,null,"Water heater",null,0.24256321425487312,null,null,"Solar panel",null,3.9767570643270012E-3,null,null,"Has fixedphone",null,0.1281370171647162]
[null,null,"Solar panel",null,3.0878028640861162E-3,null,null,"Shower unit/bathtub",null,7.7217631368842979E-2,null,null,"Lack fixedphone at will",null,3.130533178929347E-3]
[null,null,"Shower unit/bathtub",null,0.23582082713457761,null,null,"Changes furniture",null,0.48258546918946049,null,null,"Lack fixedphone by need",null,0.17830211090112486]
[null,null,"Changes furniture",null,0.4074626713983161,null,null,"Does not change furniture at will",null,1.228723867682961E-3,null,null,"Radio",null,1.0082202693946132E-2]
[null,null,"Does not change furniture by need",null,0.40291227977994193,null,null,"Does not change furniture by need",null,0.4793544340342879,null,null,"Dinning table and chairs set",null,0.24095195824952506]
[null,null,"Bicycle",null,0.1434690297556068,null,null,"Bicycle",null,0.15763069633140669,null,null,"Wardrobe",null,0.20645447442200024]
[null,null,"Motorcycle/scooter",null,3.0187125542968568E-2,null,null,"Motorcycle/scooter",null,3.4471655410587859E-2,null,null,"Dresser",null,0.27754648796439751]
[null,null,"Water scooter/ski jet",null,4.7022869457529143E-3,null,null,"Water scooter/ski jet",null,6.8875385415881514E-3,null,null,"Shoe cabinet",null,0.39688683018668069]
[null,null,"Speedboat or yacht",null,7.7660909516327047E-3,null,null,"Speedboat or yacht",null,9.4778050285685006E-3,null,null,"Living room seating set",null,0.30013603631160712]
[null,null,"Has car",null,0.26518512898611279,null,null,"Has car",null,0.27472367466667474,null,null,"No electricity",null,1.6692910167091814E-2]
[null,null,"Lack car by need",null,0.23838520934967761,null,null,"Lack car at will",null,2.5917617363551079E-2,null,null,"Only CRT television",null,0.30930411480482145]
[null,null,"Has pctablet",null,0.35140864417757167,null,null,"Lack car by need",null,0.24937631093794813,null,null,"Has smart flat TV",null,0.37213179090184878]
[null,null,"Lack pactablet by need",null,0.28096190476901362,null,null,"Has pctablet",null,0.36428801248792508,null,null,"Lack smart flat TV at will",null,4.0537246546424183E-2]
[null,null,"Has mobile",null,3.6087317807512613E-2,null,null,"Lack pctablet at will",null,5.0718282620465342E-2,null,null,"Lack smart flat TV by need",null,0.30869650184531006]
[null,null,"Lack mobile by need",null,2.1323762602717202E-2,null,null,"Lack pactablet by need",null,0.30117154538697455,null,null,"Refrigerator",null,0.1498938925856447]
[null,null,"Internet at home",null,0.30087413182900574,null,null,"Has mobile",null,4.8117332255987043E-2,null,null,"Has washing mashine",null,0.35826700087202373]
[null,null,"Second dwelling",null,5.2225658626386041E-2,null,null,"Lack mobile at will",null,3.2410990718867973E-2,null,null,"Lack washing mashine at will",null,3.8912826157485765E-2]
[null,null,"Dwelling too dark (not enough daylight)",null,3.783822807783644E-2,null,null,"Lack mobile by need",null,1.6655485498518682E-2,null,null,"Lack washing mashine by need",null,0.32205703046177608]
[null,null,"Leaking roof",null,0.20133141396141385,null,null,"Internet at home",null,0.26258443618270338,null,null,"Freezer",null,0.26840977625512802]
[null,null,"Rot in window frames or floor",null,0.20097143033340875,null,null,"Second dwelling",null,7.6372653466339174E-2,null,null,"Vacuum cleaner",null,0.39501992154243343]
[null,null,"Mortgage on main dwelling",null,9.9723171654429853E-3,null,null,"Dwelling too dark (not enough daylight)",null,3.6709751411643933E-2,null,null,"Electric stove",null,0.26332733853933415]
[null,null,"Late with payment of utility bills",null,6.8430058419529288E-2,null,null,"Leaking roof",null,0.12829172605421521,null,null,"Drying machine",null,6.9241069157716911E-2]
[null,null,"Late with payment of hire-purchase instalments or other loan payments",null,1.1817766539523003E-2,null,null,"Rot in window frames or floor",null,0.17616370710229001,null,null,"Dishwasher",null,0.24146510839489005]
[null,null,"Does not have hire-purchase instalments or other loan payments",null,3.5714351419973492E-2,null,null,"Too much noise in dwelling",null,1.1496960153441227E-2,null,null,"Video surveillance system",null,1.4291240590792507E-2]
[null,null,"Entire household can afford to go for a week's annual holiday",null,0.29097732982993263,null,null,"Pollution, grime or other environmental problem",null,1.2069531954290729E-2,null,null,"Water heater",null,0.33674470323299266]
[null,null,"Can afford a meal with meat, chicken, fish every second day",null,0.3036116391674718,null,null,"Land area (hectares)",null,1.5392248277918076E-3,null,null,"Solar panel",null,2.5702677608967321E-3]
[null,null,"Can afford an unexpected required expense of 170 EUR",null,0.29670925957033945,null,null,"cow1",null,1.8407271388091364E-3,null,null,"Shower unit/bathtub",null,0.31631154364954239]
[null,null,"Can afford to keep home adequately warm",null,6.0201845481263505E-2,null,null,"pig1",null,3.19946258601588E-4,null,null,"Changes furniture",null,0.37197895669873343]
[null,null,"Electricity",null,5.6513557848892386E-2,null,null,"Late with payment of rent",null,2.0656851848073858E-2,null,null,"Does not change furniture at will",null,2.5299773196077948E-3]
[null,null,"Wood",null,6.8919332356549276E-2,null,null,"Late with payment of utility bills",null,0.11394417122168841,null,null,"Does not change furniture by need",null,0.35191945774657218]
[null,null,"Processed biomass (pellets) or woodchips",null,1.7900174401448764E-2,null,null,"Late with payment of hire-purchase instalments or other loan payments",null,2.3813695333963145E-2,null,null,"Bicycle",null,0.1483853488593056]
[null,null,null,null,null,null,null,"Entire household can afford to go for a week's annual holiday",null,0.36238703794004751,null,null,"Motorcycle/scooter",null,3.9146829180283012E-2]
[null,null,null,null,null,null,null,"Can afford a meal with meat, chicken, fish every second day",null,0.31797047935195799,null,null,"Water scooter/ski jet",null,3.4116757578745863E-3]
[null,null,"Total Variance Explained",null,null,null,null,"Can afford an unexpected required expense of 170 EUR",null,0.39927265550035496,null,null,"Speedboat or yacht",null,9.5567049662832228E-3]
[null,null,"Component",null,"Extraction Sums of Squared Loadings",null,null,"Can afford an unexpected required expense of 230 EUR",null,0.33256908661821249,null,null,"Has car",null,0.34748412434422782]
[null,null,null,null,"Total","% of Variance","Cumulative %","Can afford to keep home adequately warm",null,7.7867190847115617E-2,null,null,"Lack car at will",null,6.8721086338702914E-2]
[null,null,"1",null,9.6567556853157992,12.706257480678683,12.706257480678683,"Electricity",null,4.555466232111588E-2,null,null,"Lack car by need",null,0.23815773127039394]
[null,null,null,null,null,null,null,"Wood",null,5.601888703224886E-2,null,null,"Has pctablet",null,0.36319779457886464]
[null,null,null,null,null,null,null,"Processed biomass (pellets) or woodchips",null,2.203363014765794E-2,null,null,"Lack pctablet at will",null,5.9853572679819472E-2]
[null,null,null,null,null,null,null,null,null,null,null,null,"Lack pactablet by need",null,0.21416181587111727]
[null,null,null,null,null,null,null,null,null,null,null,null,"Has mobile",null,4.5676222941016503E-2]
[null,null,null,null,null,null,null,"Total Variance Explained",null,null,null,null,"Lack mobile at will",null,2.433485872370952E-2]
[null,null,null,null,null,null,null,"Component",null,"Extraction Sums of Squared Loadings",null,null,"Lack mobile by need",null,2.1102081695493106E-2]
[null,null,null,null,null,null,null,null,null,"Total","% of Variance","Cumulative %","Internet at home",null,0.33725880282337012]
[null,null,null,null,null,null,null,"1",null,8.8269406525143594,11.033675815642949,11.033675815642949,"Second dwelling",null,2.9974361215288594E-2]
[null,null,null,null,null,null,null,null,null,null,null,null,"Dwelling too dark (not enough daylight)",null,4.2058333109204517E-2]
[null,null,null,null,null,null,null,null,null,null,null,null,"Leaking roof",null,0.26337439315158789]
[null,null,null,null,null,null,null,null,null,null,null,null,"Rot in window frames or floor",null,0.22530866191341811]
[null,null,null,null,null,null,null,null,null,null,null,null,"Crime, violence or vandalism in local area",null,4.9388322269846248E-5]
[null,null,null,null,null,null,null,null,null,null,null,null,"Mortgage on main dwelling",null,2.9326678590977481E-3]
[null,null,null,null,null,null,null,null,null,null,null,null,"Late with payment of utility bills",null,4.2457191335443505E-2]
[null,null,null,null,null,null,null,null,null,null,null,null,"Does not have utility bills",null,1.1619432377439447E-2]
[null,null,null,null,null,null,null,null,null,null,null,null,"Late with payment of hire-purchase instalments or other loan payments",null,7.8420303440476982E-3]
[null,null,null,null,null,null,null,null,null,null,null,null,"Entire household can afford to go for a week's annual holiday",null,0.24166498308974302]
[null,null,null,null,null,null,null,null,null,null,null,null,"Can afford a meal with meat, chicken, fish every second day",null,0.27617492497170154]
[null,null,null,null,null,null,null,null,null,null,null,null,"Can afford an unexpected required expense of 170 EUR",null,0.28111229128239956]
[null,null,null,null,null,null,null,null,null,null,null,null,"Can afford an unexpected required expense of 230 EUR",null,0.22752003288459469]
[null,null,null,null,null,null,null,null,null,null,null,null,"Can afford to keep home adequately warm",null,4.1698804477331361E-2]
[null,null,null,null,null,null,null,null,null,null,null,null,"Solar air heater",null,2.1104527448459471E-3]
[null,null,null,null,null,null,null,null,null,null,null,null,"Electricity",null,3.4810086749842803E-2]
[null,null,null,null,null,null,null,null,null,null,null,null,"Liquefied petroleum gas (lpg)/cooking gas",null,1.0050224968760093E-3]
[null,null,null,null,null,null,null,null,null,null,null,null,"Wood",null,3.9519953979688958E-2]
[null,null,null,null,null,null,null,null,null,null,null,null,"Processed biomass (pellets) or woodchips",null,1.3619361979173929E-2]
[]
[]
[null,null,null,null,null,null,null,null,null,null,null,null,"Total Variance Explained"]
[null,null,null,null,null,null,null,null,null,null,null,null,"Component",null,"Extraction Sums of Squared Loadings"]
[null,null,null,null,null,null,null,null,null,null,null,null,null,null,"Total","% of Variance","Cumulative %"]
[null,null,null,null,null,null,null,null,null,null,null,null,"1",null,10.913385850761436,11.862375924740691,11.862375924740691]
[]
[]
[]
[]
[]
[]
[]
[]
[]
[]
[]
[]
[]
[]
[]
[]
[]
[]
[]
[]
[]
[]
[]
[]
[]
[]
[]
[]
[]
[]
[]
[]
[]
[]
[]
[]
[]
[]
[]
[]
[]
[]
[]
[]
[]
[]
[]
[]
[]
[]
[]
[]
[]
[]
[]
[]
[]
[]
[]
[]
[]
[]
[]
[]
[]
[]
[]
[]
[]
[]
[]
[]
[]
[]
[]
[]
[]
[]
[]
[]
[]
[]
[]
[]
[]
[]
[]
[]
[]
[]
[]
[]
[]
[]
[]
[]
[]
[]
[]
[]
[]
[]
[]
[]
[]
[]
[]
[]
[]
[]
[]
[]
[]
[]
[]
[]
[]
[]
[]
[]
[]
[]
[]
[]
[]
[]
[]
[]
[]
[]
[]
[]
[]
[]
[]
[]
[]
[]
[]
[]
[]
[]
[]
[]
[]
[]
[]
[]
[]
[]
[]
[]
[]
[]
[]
[]
[]
[]
[]
[]
[]
[]
[]
[]
[]
[]
[]
[]
[]
[]
[]
[]
[]
[]
[]
[]
[]
[]
[]
[]
[]
[]
[]
[]
[]
[]
[]
[]
[]
[]
[]
[]
[]
[]
[]
[]
[]
[]
[]
[]
[]
[]
[]
[]
[]
[]
[]
[]
[]
[]
[]
[]
[]
[]
[]
[]
[]
[]
[]
[]
[]
[]
[]
[]
[]
[]
[]
[]
[]
[]
[]
[]
[]
[]
[]
[]
[]
[]
[]
[]
[]
[]
[]
[]
[]
[]
[]
[]
[]
[]
[]
[]
[]
[]
[]
[]
[]
[]
[]
[]
[]
[]
[]
[]
[]
[]
[]
[]
[]
[]
[]
[]
[]
[]
[]
[]
[]
[]
[]
[]
[]
[]
[]
[]
[]
[]
[]
[]
[]
[]
[]
[]
[]
[]
[]
[]
[]
[]
[]
[]
[]
[]
[]
[]
[]
[]
[]
[]
[]
[]
[]
[]
[]
[]
[]
[]
[]
[]
[]
[]
[]
[]
[]
[]
[]
[]
[]
[]
[]
[]
[]
[]
[]
[]
[]
[]
[]
[]
[]
[]
[]
[]
[]
[]
[]
[]
[]
[]
[]
[]
[]
[]
[]
[]
[]
[]
[]
[]
[]
[]
[]
[]
[]
[]
[]
[]
[]
[]
[]
[]
[]
[]
[]
[]
[]
[]
[]
[]
[]
[]
[]
[]
[]
[]
[]
[]
[]
[]
[]
[]
[]
[]
[]
[]
[]
[]
[]
[]
[]
[]
[]
[]
[]
[]
[]
[]
[]
[]
[]
[]
[]
[]
[]
[]
[]
[]
[]
[]
[]
[]
[]
[]
[]
[]
[]
[]
[]
["MICS18"]
["Montenegro",null,"Count"]
["W_text_t","",3826]
["W_text_i","",3826]
["S_text_s","",3826]
["S_text_i","",3826]
["Area","URBAN",2254]
[null,"RURAL",1572]
["National","National",3826]
["2018"]
[]
["Sub-national region names","Weighted population"]
[{"$f":"R15","v":"CENTRE"},{"$f":"BR122+BR123","v":6975.9678545526194}]
[{"$f":"S15","v":"NORTH"},{"$f":"BS122+BS123","v":3037.3361977516461}]
[{"$f":"T15","v":"SOUTH"},{"$f":"BT122+BT123","v":2574.2718920907919}]
[{"$f":"U15","v":0},{"$f":"BU122+BU123","v":0}]
[{"$f":"V15","v":0},{"$f":"BV122+BV123","v":0}]
[{"$f":"W15","v":0},{"$f":"BW122+BW123","v":0}]
[{"$f":"X15","v":0},{"$f":"BX122+XR123","v":0}]
[{"$f":"Y15","v":0},{"$f":"BY122+BY123","v":0}]
[{"$f":"Z15","v":0},{"$f":"BZ122+BZ123","v":0}]
[{"$f":"AA15","v":0},{"$f":"CA122+CA123","v":0}]
[{"$f":"AB15","v":0},{"$f":"CB122+CB123","v":0}]
[{"$f":"AC15","v":0},{"$f":"CC122+CC123","v":0}]
[{"$f":"AD15","v":0},{"$f":"CD122+CD123","v":0}]
[{"$f":"AE15","v":0},{"$f":"CE122+CE123","v":0}]
[{"$f":"AF15","v":0},{"$f":"CF122+CF123","v":0}]
[{"$f":"AG15","v":0},{"$f":"CG122+CG123","v":0}]
[{"$f":"AH15","v":0},{"$f":"CH122+CH123","v":0}]
[{"$f":"AI15","v":0},{"$f":"CI122+CI123","v":0}]
[{"$f":"AJ15","v":0},{"$f":"CJ122+CJ123","v":0}]
[{"$f":"AK15","v":0},{"$f":"CK122+CK123","v":0}]
[{"$f":"AL15","v":0},{"$f":"CL122+CL123","v":0}]
[{"$f":"AM15","v":0},{"$f":"CM122+CM123","v":0}]
[{"$f":"AN15","v":0},{"$f":"CN122+CN123","v":0}]
[{"$f":"AO15","v":0},{"$f":"CO122+CO123","v":0}]
[{"$f":"AP15","v":0},{"$f":"CP122+CP123","v":0}]
[{"$f":"AQ15","v":0},{"$f":"CQ122+CQ123","v":0}]
[{"$f":"AR15","v":0},{"$f":"CR122+CR123","v":0}]
[{"$f":"AS15","v":0},{"$f":"CS122+CS123","v":0}]
[{"$f":"AT15","v":0},{"$f":"CT122+CT123","v":0}]
[{"$f":"AU15","v":0},{"$f":"CU122+CU123","v":0}]
[{"$f":"AV15","v":0},{"$f":"CV122+CV123","v":0}]
[{"$f":"AW15","v":0},{"$f":"CW122+CW123","v":0}]
[{"$f":"AX15","v":0},{"$f":"CX122+CX123","v":0}]
[{"$f":"AY15","v":0},{"$f":"CY122+CY123","v":0}]
[]
[{"$f":"34-COUNTIF(A1037:A1071,\"0\")","v":3},"Sub-regions"]

{"sheet":"data_summary","index":7,"n_rows":219,"n_cols":46,"rows_kept":219,"cut":false,"hidden":false,"merged":[]}
["iso3","year","data_source","row","var1","var2","varname","total_q1","total_q2","total_q3","total_q4","total_q5","urban_q1","urban_q2","urban_q3","urban_q4","urban_q5","rural_q1","rural_q2","rural_q3","rural_q4","rural_q5","region_1_name","region_2_name","region_3_name","region_1","region_2","region_3","n_total_q1","n_total_q2","n_total_q3","n_total_q4","n_total_q5","n_urban_q1","n_urban_q2","n_urban_q3","n_urban_q4","n_urban_q5","n_rural_q1","n_rural_q2","n_rural_q3","n_rural_q4","n_rural_q5","n_region_1","n_region_2","n_region_3"]
["MNE",2006,"MNE_2006_MICS",16,"Water","Improved","w_imp",94.260101814274819,99.22447325577302,99.445414271064621,100,100,100,100,100,100,100,88.816054185281899,94.886964640211914,99.098631043478974,98.526347960571329,100,"Central","North","South",99.394428594257263,96.826563788779282,99.265789204533974]
["MNE",2006,"MNE_2006_MICS",17,"Water","Not Improved","",5.7398981857251616,0.77552674422695855,0.55458572893537883,0,0,0,0,0,0,0,11.18394581471804,5.1130353597880722,0.90136895652102311,1.4736520394286561,0,"Central","North","South",0.60557140574276858,3.173436211220694,0.73421079546599632]
["MNE",2006,"MNE_2006_MICS",18,"Water ladder","Basic","w_bas",93.609255018132913,98.944739010951309,99.445414271064621,100,99.726259370417154,99.785989185670061,100,100,100,100,87.446332195993548,94.151359967727103,99.098631043478974,98.526347960571329,99.277335956110278,"Central","North","South",99.213233782627555,96.484294354784623,99.039878190544428]
["MNE",2006,"MNE_2006_MICS",19,"Water ladder","Limited","w_lim",0.65084679614188601,0.27973424482171289,0,0,0.27374062958283951,0.21401081432993579,0,0,0,0,1.3697219892883321,0.73560467248479822,0,0,0.72266404388971417,"Central","North","South",0.1811948116297197,0.34226943399466297,0.22591101398953731]
["MNE",2006,"MNE_2006_MICS",20,"Water ladder","Unimproved","w_unimp",4.4552010400372231,0.77552674422695855,0.55458572893537883,0,0,0,0,0,0,0,10.401920808273349,2.5119078913545301,0.90136895652102311,1.4736520394286561,0,"Central","North","South",0.1712432083275526,2.9780219166275508,0.73421079546599632]
["MNE",2006,"MNE_2006_MICS",21,"Water ladder","Surface water","w_sur",1.2846971456879379,0,0,0,0,0,0,0,0,0,0.78202500644468431,2.6011274684335408,0,0,0,"Central","North","South",0.434328197415216,0.19541429459314219,0]
["MNE",2006,"MNE_2006_MICS",22,"Improved water point at more than 30 minutes","Yes","",0.6904796235254238,0.28192061458531109,0,0,0.27374062958283951,0.21401081432993579,0,0,0,0,1.5422009025878509,0.77524312772995796,0,0,0.72266404388971417,"Central","North","South",0.18229876079813659,0.35348712233690438,0.2275819451997253]
["MNE",2006,"MNE_2006_MICS",23,"Improved water point at more than 30 minutes","No","",99.309520376474566,99.718079385414683,100,100,99.726259370417154,99.785989185670061,100,100,100,100,98.457799097412121,99.224756872270021,100,100,99.277335956110278,"Central","North","South",99.817701239201867,99.646512877663113,99.772418054800269]
["MNE",2006,"MNE_2006_MICS",29,"Piped water","Yes","w_pip",71.213900427566045,89.967310042831528,88.106151239110687,91.523132127336169,94.445294814640974,99.872023547030906,98.867826730915894,99.840223928540411,99.705937669885287,100,46.500620509632377,73.207439728050673,79.732665956435739,64.915665022345792,67.356756188129211,"Central","North","South",87.86009383101657,82.781042336456295,90.866732189064521]
["MNE",2006,"MNE_2006_MICS",30,"Piped water","No","",28.786099572433809,10.032689957168399,11.89384876088919,8.4768678726637816,5.5547051853590244,0.12797645296910651,1.1321732690841211,0.15977607145959091,0.29406233011471078,0,53.499379490367502,26.79256027194932,20.26733404356419,35.084334977654173,32.643243811870782,"Central","North","South",12.13990616898344,17.21895766354352,9.1332678109354468]
["MNE",2006,"MNE_2006_MICS",31,"Piped water on premises","Yes","w_pop",66.036638073787827,89.687575798009817,87.943165607351276,91.156009083304539,94.445294814640974,92.815550994997835,98.867826730915894,99.840223928540411,99.705937669885287,100,44.397764679590637,73.207439728050673,78.995878470660102,64.482577591298963,66.387002732062228,"Central","North","South",85.812797417773695,82.391240498548655,90.259410834801713]
["MNE",2006,"MNE_2006_MICS",32,"Piped water on premises","No","",33.963361926212038,10.31242420199011,12.05683439264863,8.8439909166954234,5.5547051853590244,7.184449005002155,1.1321732690841211,0.15977607145959091,0.29406233011471078,0,55.602235320409257,26.79256027194932,21.004121529339841,35.517422408701009,33.612997267937757,"Central","North","South",14.187202582226311,17.608759501451171,9.740589165198287]
["MNE",2006,"MNE_2006_MICS",35,"Water source on premises","Yes","",83.803204523381581,97.27225473530055,97.999344649256244,99.183835987114207,99.539581725519781,92.815550994997835,99.44100220199411,99.840223928540411,100,100,75.523415250552802,91.857311176617415,94.438922439999189,94.679441533645473,97.814761167780958,"Central","North","South",95.349692617887058,94.165139803530607,97.700375566591703]
["MNE",2006,"MNE_2006_MICS",36,"Water source on premises","No","",16.196795476618352,2.7277452646994398,2.000655350743711,0.81616401288580209,0.46041827448021427,7.184449005002155,0.55899779800590643,0.15977607145959091,0,0,24.476584749447131,8.1426888233825725,5.5610775600007996,5.3205584663545062,2.1852388322190288,"Central","North","South",4.6503073821129801,5.8348601964693838,2.2996244334082849]
["MNE",2006,"MNE_2006_MICS",37,"Improved Water source on premises","Yes","w_premises",87.831925647349564,97.773831109557591,98.545865958316853,99.183835987114207,99.539581725519781,92.815550994997835,99.44100220199411,99.840223928540411,100,100,82.425562689595964,95.716358356218606,95.297908200734511,96.095555649271276,97.814761167780958,"Central","North","South",95.930621028185186,96.525131981197859,98.252321457033091]
["MNE",2006,"MNE_2006_MICS",38,"Improved Water source on premises","No","",12.168074352650359,2.2261688904424131,1.4541340416830979,0.81616401288580209,0.46041827448021427,7.184449005002155,0.55899779800590643,0.15977607145959091,0,0,17.574437310404019,4.2836416437813956,4.7020917992654763,3.9044443507287219,2.1852388322190288,"Central","North","South",4.0693789718148299,3.474868018802161,1.747678542966949]
["MNE",2006,"MNE_2006_MICS",41,"Water point at more than 30 minutes","Yes","",0.65084679614188601,0.27973424482171289,0.2129864366562389,0,0.27374062958283951,0.21401081432993579,0,0,0,0,1.3697219892883321,0.73560467248479822,0,0.5659501865502945,0.72266404388971417,"Central","North","South",0.27488545271954817,0.34226943399466297,0.22591101398953731]
["MNE",2006,"MNE_2006_MICS",42,"Water point at more than 30 minutes","No","w_30min",99.349153203858094,99.720265755178275,99.787013563343763,100,99.726259370417154,99.785989185670061,100,100,100,100,98.630278010711649,99.264395327515203,100,99.43404981344969,99.277335956110278,"Central","North","South",99.725114547280484,99.657730566005327,99.774088986010455]
["MNE",2006,"MNE_2006_MICS",58,"Main source of drinking water","Public watersupply","",45.052760668811651,80.960154635577425,84.346306468316683,84.199544201067127,90.668294549519842,91.283074952921055,97.288425101905062,95.469324875131321,95.448500647665469,96.454110668571005,18.126495315423231,38.740564146629779,65.688771876574449,56.938121837758587,56.849603620020403,"Central","North","South",83.770529228307709,64.355304486155831,80.268126702122416]
["MNE",2006,"MNE_2006_MICS",59,"Main source of drinking water","Local watersupply","",20.983877404976109,8.3803941855706032,1.44270000862685,0.82818658610361084,1.0228385390370009,1.5324760420767829,0,0,0,0,26.271269364167399,34.466875581420901,13.30710659408566,5.5923004909111382,3.9845719804592998,"Central","North","South",1.456654525953182,18.03593601239259,1.6912883162574031]
["MNE",2006,"MNE_2006_MICS",60,"Main source of drinking water","Public tap/standpipe","",5.1772623537782057,0.27973424482171289,0.16298563175943509,0,0,7.0564725520330498,0,0,0,0,2.102855830041761,0,0.73678748577564657,0.43308743104683473,0,"Central","North","South",2.0472964132428721,0.38980183790765532,0.30416805857544138]
["MNE",2006,"MNE_2006_MICS",61,"Main source of drinking water","Tubewell/borehole","",3.715408326495159,4.137599419291357,8.3539633847927828,7.6914157763481974,5.0987514425046214,0.12797645296910651,0.55899779800590643,0,0,0,6.9178655650403433,3.7744124638724879,9.0927453386953836,25.492616880059352,30.293561160752351,"Central","North","South",9.6824197054819336,1.9469584076310931,3.318253522137288]
["MNE",2006,"MNE_2006_MICS",62,"Main source of drinking water","Protected well or spring","",18.88102356359839,4.1896023525493096,2.7421667119212509,0.099622041070392298,0.45595374285440399,0,0,0.15977607145959091,0.29406233011471078,0,34.560750057832522,17.55442531019219,8.763680008867242,7.2865192099939273,0.72266404388971417,"Central","North","South",1.0545356261204331,12.09856304469174,4.6733970859602323]
["MNE",2006,"MNE_2006_MICS",63,"Main source of drinking water","Unprotected well or spring","",3.8309154304785671,0.41215403756531332,0.34159929227913988,0,0,0,0,0,0,0,8.750979128001239,1.556362884542384,0.90136895652102311,0.90770185287836136,0,"Central","North","South",0.030707246692810001,2.395886037962641,0.73421079546599632]
["MNE",2006,"MNE_2006_MICS",64,"Main source of drinking water","Tanker-truck","",0.44976949661510979,0.92996144110077572,0.1064932183281195,0,0,0,0.57317547107821476,0,0,0,0.83681805277661303,0.35068713809657892,1.5095397394805401,0.28297509327514719,0,"Central","North","South",0.49602265011915542,0,0.29445090037716182]
["MNE",2006,"MNE_2006_MICS",65,"Main source of drinking water","Surface water","",1.2846971456879379,0,0,0,0,0,0,0,0,0,0.78202500644468431,2.6011274684335408,0,0,0,"Central","North","South",0.434328197415216,0.19541429459314219,0]
["MNE",2006,"MNE_2006_MICS",66,"Main source of drinking water","Bottled water","",0,0.34702697686176109,2.2907988473193388,7.1812313954106104,2.7541617260841349,0,1.579401629010883,4.3708990534090244,4.2574370222197961,3.5458893314290778,0,0,0,2.500727017526327,8.1495991948782276,"Central","North","South",0.88697044503194822,0,8.7161046191040477]
["MNE",2006,"MNE_2006_MICS",67,"Main source of drinking water","Other","",0.62428560955865653,0.36337270666164517,0.2129864366562389,0,0,0,0,0,0,0,1.650941680272112,0.95554500681214583,0,0.5659501865502945,0,"Central","North","South",0.14053596163474261,0.58213587866491034,0]
["MNE",2006,"MNE_2006_MICS",122,"Sanitation","Improved","s_imp",93.871016576736793,99.397289087419722,99.930523980687127,99.786049409848687,99.999999999999886,98.885845157936117,99.888200440398791,99.656861228564225,99.999999999999972,100.0000000000001,92.482542544619761,92.680393821171776,99.018425914651175,99.999999999999943,99.999999999999986,"Central","North","South",99.29078019675454,96.82538130478261,99.822971681652717]
["MNE",2006,"MNE_2006_MICS",123,"Sanitation","Not Improved","",6.1289834232632074,0.60271091258027809,0.069476019312872894,0.21395059015131321,1.1368683772200001e-13,1.1141548420638829,0.11179955960120939,0.34313877143577542,0,-1.1368683772200001e-13,7.5174574553802387,7.3196061788282236,0.98157408534882507,0,0,"Central","North","South",0.70921980324546041,3.17461869521739,0.17702831834728269]
["MNE",2006,"MNE_2006_MICS",124,"Sanitation ladder","Basic","s_bas",91.58883224293271,99.008363655212548,99.389719352775089,99.310565995996711,99.736322357539649,95.565942292474915,99.612862951312806,98.823746030356091,99.328571445414241,99.831740002950539,91.269342816540899,92.680393821171776,99.018425914651175,99.999999999999943,99.563000512991366,"Central","North","South",98.249235074577498,96.305178659451371,99.271483940805851]
["MNE",2006,"MNE_2006_MICS",125,"Sanitation ladder","Limited","s_lim",2.2821843338040608,0.3889254322071849,0.54080462791206441,0.47548341385197662,0.26367764246025682,3.3199028654611862,0.27533748908598749,0.83311519820814584,0.67142855458571393,0.16825999704956249,1.213199728078864,0,0,0,0.43699948700862667,"Central","North","South",1.0415451221770591,0.5202026453312395,0.55148774084690411]
["MNE",2006,"MNE_2006_MICS",126,"Sanitation ladder","Unimproved","s_unimp",5.0412323642253796,0.60271091258026388,0.0694760193128445,1.4210854715199999e-13,0,1.1141548420638969,0.11179955960120939,0,0,0,6.1181287838032716,5.8483968338586294,0.98157408534882507,0,0,"Central","North","South",0.463561829702968,2.8272155048295819,0]
["MNE",2006,"MNE_2006_MICS",127,"Sanitation ladder","Open defecation","s_od",1.0877510590378481,0,0,0.21395059015117451,0,0,0,0.34313877143574462,0,0,1.3993286715769651,1.471209344969596,0,0,0,"Central","North","South",0.2456579735424802,0.34740319038780842,0.17702831834721011]
["MNE",2006,"MNE_2006_MICS",135,"Sanitation type","Sewer connection","s_sew",28.676529621845159,53.98394854642239,46.197068116261789,58.530243098771408,68.939757630358017,58.368034408870763,55.636607526272883,66.955252149742464,72.606425844245024,79.077133722266538,8.8682669593537202,29.422391884381721,44.83098224773773,21.88565383686133,25.98698506439522,"Central","North","South",37.210754604814397,59.976527312067603,66.794117150832449]
["MNE",2006,"MNE_2006_MICS",136,"Sanitation type","Septic tank connection","s_sep",32.20233754676547,42.582104465510312,53.386075767862629,41.255806311077272,30.960562390019561,33.664705439906378,43.692595116120017,32.701609078821761,27.2327068803584,20.922866277733569,18.708256430279761,50.189226950000389,49.586564557226673,77.186891094409845,74.013014935604758,"Central","North","South",58.676003876953473,18.687712076879119,31.85812818259253]
["MNE",2006,"MNE_2006_MICS",139,"Sanitation type","Open defecation","",1.0850873602183031,0,0,0.21395059015117451,0,0,0,0.34313877143574462,0,0,1.390266678123883,1.471209344969596,0,0,0,"Central","North","South",0.2456579735424802,0.34740319038780842,0.17667054022629711]
["MNE",2006,"MNE_2006_MICS",151,"Shared among all sanitation facilities","Yes","",11.68212971241481,3.1319031399863859,1.1939546247872279,0.91730367136411795,1.669506098839965,11.800267067355961,1.5169147550003981,1.333195725153719,1.5453272854042761,1.2117436502897041,10.823377467210319,4.9294368411246516,2.693817046745107,1.2614207194722951,0.72266404388971417,"Central","North","South",4.0673029788588364,4.4558311408236673,2.0555571488091071]
["MNE",2006,"MNE_2006_MICS",152,"Shared among all sanitation facilities","No","",88.317870287585194,96.868096860013608,98.806045375212747,99.08269632863589,98.330493901160025,88.199732932644054,98.483085244999629,98.666804274846285,98.454672714595688,98.788256349710295,89.176622532789651,95.070563158875359,97.306182953254847,98.738579280527688,99.277335956110278,"Central","North","South",95.932697021141209,95.54416885917621,97.944442851190885]
["MNE",2006,"MNE_2006_MICS",153,"Kind of toilet facility","Flush to piped sewer system","",28.746925463602061,53.98394854642239,46.197068116261789,58.530243098771408,68.939757630358017,58.368034408870763,55.636607526272883,66.955252149742464,72.606425844245024,79.077133722266538,8.926071823981772,29.422391884381721,44.83098224773773,21.88565383686133,25.98698506439522,"Central","North","South",37.210754604814397,59.976527312067603,66.929382904204019,515.43003499999952,970.13856999999996,831.71123399999965,1052.5886290000001,1239.0692899999981,651.49616999999921,622.46312499999954,750.76962399999934,808.61377199999947,883.1642259999993,60.274481000000002,201.07045299999999,305.87978299999997,148.283019,176.92310499999999,1522.9385070000001,1631.3244629999999,1454.6747880000021]
["MNE",2006,"MNE_2006_MICS",154,"Kind of toilet facility","Flush to septic tank","",32.28138862749379,42.582104465510312,53.386075767862629,41.255806311077272,30.960562390019561,33.664705439906378,43.692595116120017,32.701609078821761,27.2327068803584,20.922866277733569,18.830200011290099,50.189226950000389,49.586564557226673,77.186891094409845,74.013014935604758,"Central","North","South",58.676003876953473,18.687712076879119,31.922644548605639,578.80267199999992,765.23750199999972,961.1388939999996,741.9308429999993,556.46093600000029,375.76092599999998,488.83335099999988,366.68332900000013,303.28915899999998,233.67471900000001,127.153417,342.98946999999998,338.32690799999978,522.96839399999965,503.89117399999981,2401.4548130000071,508.29421499999978,693.82181900000012]
["MNE",2006,"MNE_2006_MICS",155,"Kind of toilet facility","Pit latrine with watertight tank","",0.84703730655241827,0,0,0,0,0,0,0,0,0,1.811804558332303,0.43208836904403541,0,0,0,"Central","North","South",0,0.5583696767084142,0,15.18731,0,0,0,0,0,0,0,0,0,12.234450000000001,2.9528599999999998,0,0,0,0,15.18731,0]
["MNE",2006,"MNE_2006_MICS",156,"Kind of toilet facility","Traditional pit latrine","",34.131683358195218,2.8312360754870238,0.3473800965627093,0,0.099679979622302406,7.9672601512228409,0.55899779800590643,0,0.16086727539655871,0,66.625126964746499,12.636686617745619,4.6008791096867796,0.92745506872876382,0,"Central","North","South",3.8018877359233971,18.169511658782572,0.9709442288430582,611.9783060000002,50.879777999999988,6.2540750000000003,0,1.7915700000000001,88.929489000000018,6.2540750000000003,0,1.7915700000000001,0,449.89498499999979,86.358182999999983,31.391591999999999,6.2838349999999998,0,155.60128499999999,494.19948399999993,21.102959999999999]
["MNE",2006,"MNE_2006_MICS",157,"Kind of toilet facility","No facilities","",1.0877510590378481,0,0,0.21395059015117451,0,0,0,0.34313877143574462,0,0,1.3993286715769651,1.471209344969596,0,0,0,"Central","North","South",0.2456579735424802,0.34740319038780842,0.17702831834721011,19.503288000000001,0,0,3.847617000000001,0,0,0,3.847617000000001,0,0,9.4491520000000016,10.054136,0,0,0,10.054136,9.4491520000000016,3.847617000000001]
["MNE",2006,"MNE_2006_MICS",158,"Kind of toilet facility","Other","",2.905214185118453,0.60271091258020182,0.069476019312541895,0,0,0,0.11179955960118131,0,0,0,2.4074679700722501,5.8483968338586703,0.98157408534878554,0,0,"Central","North","South",0.065695808766477598,2.260476085174068,0,52.090254000000002,10.831239999999999,1.250815,0,0,0,1.250815,0,0,0,16.256746,39.967511999999999,6.6972360000000002,0,0,2.6887569999999998,61.483552000000003,0]
["MNE",2013,"MNE_2013_MICS",16,"Water","Improved","w_imp",98.299999999999997,99.5,99.700000000000003,100,99.900000000000006,100,100,100,100,99.900000000000006,96.599999999999994,97.900000000000006,99.599999999999994,99.200000000000003,100,"Centre","North","South",99.700000000000003,99.099999999999994,99.700000000000003]
["MNE",2013,"MNE_2013_MICS",17,"Water","Not Improved","",1.7,0.5,0.29999999999999999,0,0.10000000000000001,0,0,0,0,0.10000000000000001,3.3999999999999999,2.1000000000000001,0.40000000000000002,0.80000000000000004,0,"Centre","North","South",0.29999999999999999,0.90000000000000002,0.29999999999999999]
["MNE",2013,"MNE_2013_MICS",18,"Water ladder","Basic","w_bas",97,98.700000000000003,98.799999999999997,98.700000000000003,98.599999999999994,97.799999999999997,98.900000000000006,98.700000000000003,98.700000000000003,98.900000000000006,95.200000000000003,97.700000000000003,99.5,98.700000000000003,98.299999999999997,"Centre","North","South",99.700000000000003,96.200000000000003,98.400000000000006]
["MNE",2013,"MNE_2013_MICS",19,"Water ladder","Limited","w_lim",1.3,0.80000000000000004,0.90000000000000002,1.3,1.3999999999999999,2.2000000000000002,1.1000000000000001,1.3,1.3,1,1.3999999999999999,0.20000000000000001,0.10000000000000001,0.59999999999999998,1.7,"Centre","North","South",0,2.7999999999999998,1.2]
["MNE",2013,"MNE_2013_MICS",20,"Water ladder","Unimproved","w_unimp",1.6000000000000001,0.5,0.29999999999999999,0,0.10000000000000001,0,0,0,0,0.10000000000000001,3.2999999999999998,2.1000000000000001,0.40000000000000002,0.80000000000000004,0,"Centre","North","South",0.29999999999999999,0.90000000000000002,0.29999999999999999]
["MNE",2013,"MNE_2013_MICS",21,"Water ladder","Surface water","w_sur",0,0,0,0,0,0,0,0,0,0,0.10000000000000001,0,0,0,0,"Centre","North","South",0,0,0]
["MNE",2013,"MNE_2013_MICS",22,"Improved water point at more than 30 minutes","Yes","",1.3999999999999999,0.80000000000000004,0.90000000000000002,1.3,1.3999999999999999,2.2000000000000002,1.1000000000000001,1.3,1.3,1,1.3999999999999999,0.20000000000000001,0.10000000000000001,0.59999999999999998,1.7,"Centre","North","South",0,2.8999999999999999,1.2]
["MNE",2013,"MNE_2013_MICS",23,"Improved water point at more than 30 minutes","No","",98.599999999999994,99.200000000000003,99.099999999999994,98.700000000000003,98.599999999999994,97.799999999999997,98.900000000000006,98.700000000000003,98.700000000000003,99,98.599999999999994,99.799999999999997,99.900000000000006,99.400000000000006,98.299999999999997,"Centre","North","South",100,97.099999999999994,98.799999999999997]
["MNE",2013,"MNE_2013_MICS",29,"Piped water","Yes","w_pip",68.900000000000006,81.299999999999997,90.200000000000003,90.299999999999997,93.299999999999997,91.599999999999994,94.299999999999997,95.799999999999997,96.099999999999994,96.099999999999994,51.100000000000001,60.799999999999997,66.5,77.900000000000006,83.099999999999994,"Centre","North","South",89.5,68.5,96.200000000000003]
["MNE",2013,"MNE_2013_MICS",30,"Piped water","No","",31.100000000000001,18.699999999999999,9.8000000000000007,9.6999999999999993,6.7000000000000002,8.4000000000000004,5.7000000000000002,4.2000000000000002,3.8999999999999999,3.8999999999999999,48.899999999999999,39.200000000000003,33.5,22.100000000000001,16.899999999999999,"Centre","North","South",10.5,31.5,3.7999999999999998]
["MNE",2013,"MNE_2013_MICS",31,"Piped water on premises","Yes","w_pop",67.599999999999994,81.299999999999997,90.200000000000003,90.299999999999997,93.299999999999997,90.400000000000006,94.299999999999997,95.799999999999997,96.099999999999994,96.099999999999994,49.5,60.799999999999997,66.5,77.900000000000006,83.099999999999994,"Centre","North","South",89.200000000000003,68.200000000000003,96.200000000000003]
["MNE",2013,"MNE_2013_MICS",32,"Piped water on premises","No","",32.399999999999999,18.699999999999999,9.8000000000000007,9.6999999999999993,6.7000000000000002,9.5999999999999996,5.7000000000000002,4.2000000000000002,3.8999999999999999,3.8999999999999999,50.5,39.200000000000003,33.5,22.100000000000001,16.899999999999999,"Centre","North","South",10.800000000000001,31.800000000000001,3.7999999999999998]
["MNE",2013,"MNE_2013_MICS",35,"Water source on premises","Yes","",92.400000000000006,96.799999999999997,96.799999999999997,96.400000000000006,97.5,94.5,95.900000000000006,97,97,97.700000000000003,90.599999999999994,95,96.599999999999994,97.700000000000003,96.400000000000006,"Centre","North","South",98.599999999999994,90.900000000000006,97.299999999999997]
["MNE",2013,"MNE_2013_MICS",36,"Water source on premises","No","",7.5999999999999996,3.2000000000000002,3.2000000000000002,3.6000000000000001,2.5,5.5,4.0999999999999996,3,3,2.2999999999999998,9.4000000000000004,5,3.3999999999999999,2.2999999999999998,3.6000000000000001,"Centre","North","South",1.3999999999999999,9.0999999999999996,2.7000000000000002]
["MNE",2013,"MNE_2013_MICS",37,"Improved Water source on premises","Yes","w_premises",91.599999999999994,96.599999999999994,96.5,96.400000000000006,97.5,94.5,95.900000000000006,97,97,97.700000000000003,88.799999999999997,94,96.599999999999994,96.900000000000006,96.400000000000006,"Centre","North","South",98.400000000000006,90.299999999999997,97.200000000000003]
["MNE",2013,"MNE_2013_MICS",38,"Improved Water source on premises","No","",8.4000000000000004,3.3999999999999999,3.5,3.6000000000000001,2.5,5.5,4.0999999999999996,3,3,2.2999999999999998,11.199999999999999,6,3.3999999999999999,3.1000000000000001,3.6000000000000001,"Centre","North","South",1.6000000000000001,9.6999999999999993,2.7999999999999998]
["MNE",2013,"MNE_2013_MICS",41,"Water point at more than 30 minutes","Yes","",1.5,0.80000000000000004,0.90000000000000002,1.3,1.3999999999999999,2.2000000000000002,1.1000000000000001,1.3,1.3,1.1000000000000001,1.8999999999999999,0.20000000000000001,0.10000000000000001,0.59999999999999998,1.7,"Centre","North","South",0,3,1.3]
["MNE",2013,"MNE_2013_MICS",42,"Water point at more than 30 minutes","No","w_30min",98.5,99.200000000000003,99.099999999999994,98.700000000000003,98.599999999999994,97.799999999999997,98.900000000000006,98.700000000000003,98.700000000000003,98.900000000000006,98.099999999999994,99.799999999999997,99.900000000000006,99.400000000000006,98.299999999999997,"Centre","North","South",100,97,98.700000000000003]
["MNE",2013,"MNE_2013_MICS",58,"Main source of drinking water","Piped into dwelling","",65.200000000000003,79.5,88.299999999999997,87.900000000000006,89.099999999999994,88,91.700000000000003,94.400000000000006,93.700000000000003,92.599999999999994,47.200000000000003,59.200000000000003,66.099999999999994,75.599999999999994,76.700000000000003,"Centre","North","South",87.5,67,90.299999999999997]
["MNE",2013,"MNE_2013_MICS",59,"Main source of drinking water","Piped into compound, yard or plot","",1.6000000000000001,0.10000000000000001,0.20000000000000001,0.10000000000000001,0,1.1000000000000001,0.20000000000000001,0,0,0,2.2999999999999998,0.40000000000000002,0,0,0.40000000000000002,"Centre","North","South",0.40000000000000002,0.59999999999999998,0.10000000000000001]
["MNE",2013,"MNE_2013_MICS",60,"Main source of drinking water","Piped to neighbour","",1,0,0,0,0,1.1000000000000001,0,0,0,0,0.69999999999999996,0,0,0,0,"Centre","North","South",0.29999999999999999,0.10000000000000001,0]
["MNE",2013,"MNE_2013_MICS",61,"Main source of drinking water","Public tap / standpipe","",0.29999999999999999,0,0,0,0,0,0,0,0,0,0.80000000000000004,0,0,0,0,"Centre","North","South",0,0.20000000000000001,0]
["MNE",2013,"MNE_2013_MICS",62,"Main source of drinking water","Tube well, Borehole","",0.90000000000000002,2.7000000000000002,0.40000000000000002,2.1000000000000001,1.3,0.59999999999999998,0.40000000000000002,0.80000000000000004,0.10000000000000001,0.69999999999999996,0.69999999999999996,2.7000000000000002,5.5,2.7999999999999998,3.7999999999999998,"Centre","North","South",3,0.10000000000000001,0.29999999999999999]
["MNE",2013,"MNE_2013_MICS",63,"Main source of drinking water","Protected well","",10.9,6.9000000000000004,3.2999999999999998,1.8999999999999999,1.1000000000000001,0.90000000000000002,0.40000000000000002,0,0.29999999999999999,0,19.699999999999999,14.6,13.1,9.8000000000000007,4.7999999999999998,"Centre","North","South",4.4000000000000004,8.9000000000000004,0.40000000000000002]
["MNE",2013,"MNE_2013_MICS",64,"Main source of drinking water","Unprotected well","",0.20000000000000001,0.20000000000000001,0,0,0,0,0,0,0,0,0.29999999999999999,0.90000000000000002,0,0,0,"Centre","North","South",0.10000000000000001,0.10000000000000001,0]
["MNE",2013,"MNE_2013_MICS",65,"Main source of drinking water","Protected spring","",15.300000000000001,7.5999999999999996,5.2000000000000002,5.0999999999999996,4,6.7000000000000002,5,3.3999999999999999,3.2000000000000002,3.1000000000000001,21,17.699999999999999,11.699999999999999,5.9000000000000004,7.2999999999999998,"Centre","North","South",0.80000000000000004,21.399999999999999,2.7999999999999998]
["MNE",2013,"MNE_2013_MICS",66,"Main source of drinking water","Unprotected spring","",1.3999999999999999,0.10000000000000001,0,0,0.10000000000000001,0,0,0,0,0.10000000000000001,3,0.69999999999999996,0.29999999999999999,0,0,"Centre","North","South",0.10000000000000001,0.80000000000000004,0.10000000000000001]
["MNE",2013,"MNE_2013_MICS",67,"Main source of drinking water","Rainwater collection","",1.7,0.59999999999999998,0.59999999999999998,0.40000000000000002,0,0,0,0,0,0,3.5,1.5,1.6000000000000001,2.3999999999999999,0,"Centre","North","South",1.3999999999999999,0,0]
["MNE",2013,"MNE_2013_MICS",68,"Main source of drinking water","Tanker-truck","",0.29999999999999999,0,0,0,0,0.10000000000000001,0,0,0,0,0.5,0,0,0,0,"Centre","North","South",0,0.10000000000000001,0]
["MNE",2013,"MNE_2013_MICS",69,"Main source of drinking water","Surface water (river, stream, dam, lake, pond, canal, irrigation channel)","",0,0,0,0,0,0,0,0,0,0,0.10000000000000001,0,0,0,0,"Centre","North","South",0,0,0]
["MNE",2013,"MNE_2013_MICS",70,"Main source of drinking water","Bottled water","",1.2,2.2000000000000002,1.7,2.5,4.5999999999999996,1.5,2.2999999999999998,1.5,2.6000000000000001,3.5,0.10000000000000001,1.8,1.6000000000000001,2.7999999999999998,7,"Centre","North","South",1.8,0.80000000000000004,5.7999999999999998]
["MNE",2013,"MNE_2013_MICS",71,"Main source of drinking water","Other","",0,0.20000000000000001,0.29999999999999999,0,0,0,0,0,0,0,0,0.5,0.10000000000000001,0.80000000000000004,0,"Centre","North","South",0.10000000000000001,0,0.29999999999999999]
["MNE",2013,"MNE_2013_MICS",122,"Sanitation","Improved","s_imp",88.550328269969185,95.975397254266113,98.478958560583806,99.399323899995338,99.68762573178654,94.902101365747711,98.131535172536829,98.96812513300948,99.764550472080487,99.501752886257876,85.184806645668161,88.246414273914155,94.744786627955506,98.453003212168184,99.96936805218472,"Centre","North","South",99.608245976460125,88.832564910870587,99.804993051791541,2443.9696139509401,2648.3910727314242,2715.28423914631,2738.4307271825,2758.723300292253,1645.887237808621,1703.429233816478,1713.057456874682,1731.762159996892,1726.3469515842689,874.83575099456891,905.78696837228347,969.36635366248333,1010.866250522952,1023.460589670212,6421.7231334588787,3680.4614551181612,3202.6143647263798]
["MNE",2013,"MNE_2013_MICS",123,"Sanitation","Not Improved","",11.449671730030801,4.0246027457339029,1.521041439416243,0.60067610000467964,0.31237426821344788,5.0978986342523003,1.868464827463207,1.031874866990528,0.2354495279195086,0.49824711374212649,14.815193354331861,11.75358572608587,5.255213372044472,1.5469967878317969,0.030631947815289301,"Centre","North","South",0.3917540235398983,11.167435089129439,0.19500694820844919,316.00842531713522,111.0568154758876,41.938500446210021,16.54850178852212,8.6445450556798704,88.412861053740613,32.433993862040687,17.860911612542161,4.0870487674301224,8.6445450556798704,152.14991164067811,120.6422365138763,53.767887453070323,15.883790148245099,0.31360197613150759,25.256301332585341,462.68296361040149,6.257523140447951]
["MNE",2013,"MNE_2013_MICS",124,"Sanitation ladder","Basic","s_bas",86.397500066966472,95.599861128471559,97.946009523392561,98.92568324439199,99.42477175043237,91.715945068461423,97.861039855017495,98.140767656865705,99.094702792856836,99.33433123978719,84.06733970092975,88.246414273914155,94.744786627955506,98.453003212168184,99.532502426630913,"Centre","North","South",98.563370686732227,88.355304355472072,99.253604636719061,2384.5520283248961,2632.7645058053808,2696.2031666586199,2720.4735441799389,2751.4491637320421,1590.629725994876,1694.5829940863409,1697.1118906393531,1720.134614357162,1723.4422002544679,863.35952568741743,901.89276371165374,969.36635366248333,1005.934268163522,1018.988072143618,6350.5068833625037,3660.687861054374,3174.2476642839952]
["MNE",2013,"MNE_2013_MICS",125,"Sanitation ladder","Limited","s_lim",2.1528282030026751,0.37553612579456208,0.5329490371912482,0.4736406556033414,0.26285398135417931,3.186156297286276,0.2704953175193241,0.82735747614377952,0.6698476792236252,0.16742164647068031,1.1174669447383989,0,0,0,0.43686562555381331,"Centre","North","South",1.044875289727915,0.47726055539851892,0.55138841507249936,59.417585626043362,10.342046222336339,14.67072409314971,13.025200643130029,7.2741365602124111,55.257511813745232,4.6839555938433044,14.307185934007149,11.627545639729471,2.9047513298009009,11.476225307151489,0,0,0,4.4725175265942916,67.32204543574656,19.773594063786671,17.634053645338629]
["MNE",2013,"MNE_2013_MICS",126,"Sanitation ladder","Unimproved","s_unimp",11.138644765756959,4.0246027457338789,1.52104143941619,0.60067610000466809,0.31237426821345038,4.8034732638843112,1.868464827463181,1.0318748669905149,0.2354495279195388,0.49824711374212988,14.476526852224231,11.75358572608584,5.2552133720444942,1.546996787831816,0.0306319478152738,"Centre","North","South",0.27424559529926879,11.142982460313149,0.19500694820843989,307.4241494069737,111.0568154758876,41.938500446210021,16.54850178852212,8.6445450556798704,83.306641564372697,32.433993862040687,17.860911612542161,4.0870487674301224,8.6445450556798704,148.67185521988449,120.6422365138763,53.767887453070323,15.883790148245099,0.31360197613150759,17.685133148457119,461.66985588436819,6.257523140447951]
["MNE",2013,"MNE_2013_MICS",127,"Sanitation ladder","Open defecation","s_od",0.31102696427388998,0,0,0,0,0.29442537036798971,0,0,0,0,0.33866650210762528,0,0,0,0,"Centre","North","South",0.1175084282405883,0.024452628816260199,0,8.5842759101615282,0,0,0,0,5.1062194893679189,0,0,0,0,3.478056420793608,0,0,0,0,7.571168184128231,1.0131077260332959,0]
["MNE",2013,"MNE_2013_MICS",128,"Shared among Improved Sanitation","Yes","s_shared",2.431191668131603,0.39128374201948879,0.54118061866320444,0.47650289460707651,0.26367764246025699,3.3573084804592441,0.27564565971961391,0.83598378268946882,0.67142855458571415,0.16825999704956229,1.3118148514283501,0,0,0,0.43699948700862679,"Centre","North","South",1.048984729612491,0.53725855588811866,0.55246576169427597]
["MNE",2013,"MNE_2013_MICS",129,"Shared among Improved Sanitation","No","",97.568808331868368,99.608716257980518,99.458819381336809,99.52349710539292,99.736322357539763,96.642691519540747,99.724354340280385,99.164016217310532,99.328571445414269,99.831740002950426,98.688185148571648,100,100,100,99.56300051299138,"Centre","North","South",98.951015270387529,99.462741444111884,99.447534238305749]
["MNE",2013,"MNE_2013_MICS",130,"Manually calculated ratios","Improved latrines","",93.741831726580159,100,100,100,100,86.015834541403052,100,100,100,100,94.430538472828218,100,100,100,100,"Centre","North","South",89.535040259674858,96.880821948887402,100]
["MNE",2013,"MNE_2013_MICS",135,"Sanitation type","Sewer connection","s_sew",30.86552444725324,40.138516127030513,55.454370390419207,49.989660419821107,55.492178206103361,57.411844428185631,58.634696836058957,66.937076520809285,61.852363151134263,72.005753940342245,10.596615856163069,21.287895319,17.298060771396589,22.275839452315779,16.921230777690059,"Centre","North","South",40.541502463906262,48.993610278760997,54.778838338158472]
["MNE",2013,"MNE_2013_MICS",136,"Sanitation type","Septic tank connection","s_sep",46.551155800883677,55.013602503157642,43.024588170164719,49.409663480174189,44.195447525683271,34.597633131580608,39.496838336477857,32.031048612200209,37.912187320946309,27.495998945915641,52.390857992372887,62.54182529548914,76.807538126949353,76.177163759852377,83.048137274494664,"Centre","North","South",57.164499975057453,34.870059853550892,44.979457660023058]
["MNE",2013,"MNE_2013_MICS",137,"Sanitation type","Improved latrines","s_lat",11.133648021832419,0.82327862407817198,0,0,0,2.892623805981374,0,0,0,0,22.197332797132059,4.4166936594249471,0.63918772960959358,0,0,"Centre","North","South",1.9022435374967119,4.968894778558548,0.046697053610223201]
["MNE",2013,"MNE_2013_MICS",138,"Sanitation type","Unimproved facilities","",11.13864476575691,4.0246027457339029,1.521041439416243,0.60067610000467964,0.31237426821344788,4.8034732638843103,1.868464827463207,1.031874866990528,0.2354495279195086,0.49824711374212649,14.476526852224239,11.75358572608587,5.255213372044472,1.5469967878317969,0.030631947815289301,"Centre","North","South",0.27431657456542158,11.14298246031318,0.19500694820844919]
["MNE",2013,"MNE_2013_MICS",139,"Sanitation type","Open defecation","",0.31102696427388998,0,0,0,0,0.29442537036798971,0,0,0,0,0.33866650210762528,0,0,0,0,"Centre","North","South",0.11743744897447669,0.024452628816260199,0]
["MNE",2013,"MNE_2013_MICS",148,"Shared among improved sanitation facilities","Yes","",2.1528282030026751,0.37478679218889333,0.5320833853023369,0.47278761691408161,0.26285398135417931,3.186156297286276,0.26983436938793032,0.82656618558570383,0.66984767922362531,0.16742164647068031,1.1174669447383989,0,0,0,0.43686562555381331,"Centre","North","South",1.0442416656774121,0.47726055539851892,0.54954059437571623]
["MNE",2013,"MNE_2013_MICS",149,"Shared among improved sanitation facilities","No","",86.397500066966487,95.409104011591566,97.786918987077684,98.747515609982671,99.42477175043237,91.715945068461423,97.62191900064704,98.046905130632041,99.09470279285685,99.33433123978719,84.06733970092975,87.867020873756402,94.744786627955506,97.972654328402299,99.532502426630899,"Centre","North","South",98.503600757459537,88.355304355472057,98.920984545573418]
["MNE",2013,"MNE_2013_MICS",150,"Shared among improved sanitation facilities","DK/missing","",11.449671730030801,4.2161091962195467,1.680997627620012,0.77969677310325569,0.31237426821344788,5.0978986342523003,2.10824662996506,1.126528683782269,0.2354495279195086,0.49824711374212649,14.815193354331861,12.132979126243621,5.255213372044472,2.0273456715976832,0.030631947815289301,"Centre","North","South",0.45215757686309421,11.167435089129439,0.52947486005087363]
["MNE",2013,"MNE_2013_MICS",151,"Shared among all sanitation facilities","Yes","",2.5479778780169662,0.37478679218889333,0.5320833853023369,0.47278761691408161,0.26285398135417931,3.5772442017014598,0.26983436938793032,0.82656618558570383,0.66984767922362531,0.16742164647068031,1.5206108915856491,0,0,0,0.43686562555381331,"Centre","North","South",1.147962954785515,0.57605457435787066,0.54954059437571623]
["MNE",2013,"MNE_2013_MICS",152,"Shared among all sanitation facilities","No","",97.452022121983035,99.433706757325453,99.307960426493921,99.348191709987347,99.737146018645802,96.42275579829851,99.490383828110225,99.078779997622561,99.330152320776364,99.832578353529314,98.479389108414352,99.620606599842247,100,99.519651116234101,99.563134374446179,"Centre","North","South",98.791562472095379,99.423945425642103,99.115991493781848]
["MNE",2013,"MNE_2013_MICS",153,"Type of toilet facility","Flush to piped sewer system","",30.86552444725324,40.138516127030513,55.454370390419207,49.989660419821107,55.492178206103361,57.411844428185631,58.634696836058957,66.937076520809285,61.852363151134263,72.005753940342245,10.596615856163069,21.287895319,17.298060771396589,22.275839452315779,16.921230777690059,"Centre","North","South",40.541502463906262,48.993610278760997,54.778838338158472,851.88169644910829,1107.6014356250951,1529.0005105024991,1377.2047611992191,1535.6726963588781,995.69367467672862,1017.818141037927,1158.626152827037,1073.6637563609991,1249.2937079564231,108.82572556732789,218.50517465980971,176.9823828011358,228.71719063650289,173.23519361090871,2613.7023264035101,2029.8760297981089,1757.7827439331841]
["MNE",2013,"MNE_2013_MICS",154,"Type of toilet facility","Flush to septic tank","",46.551155800883677,55.013602503157642,43.024588170164719,49.409663480174189,44.195447525683271,34.597633131580608,39.496838336477857,32.031048612200209,37.912187320946309,27.495998945915641,52.390857992372887,62.54182529548914,76.807538126949353,76.177163759852377,83.048137274494664,"Centre","North","South",57.164499975057453,34.870059853550892,44.979457660023058,1284.801677129856,1518.0716925001479,1186.2837286438139,1361.2259659832789,1223.0506039333779,600.02678560503955,685.6110927785511,554.43130404764565,658.0984036358941,477.05324362784643,538.046600113262,641.94756010178025,785.84422233470298,782.14905988644909,850.22539605930319,3685.3835573933238,1444.716938629703,1443.3331721674431]
["MNE",2013,"MNE_2013_MICS",155,"Type of toilet facility","Flush to pit (latrine)","",0.25664476502401201,0.41468835562329659,0,0,0,0.48985365864956198,0,0,0,0,0.26045694035494887,0.079529282090550699,0.63918772960959358,0,0,"Centre","North","South",0.054877935560541803,0.36176578682371779,0,7.0833391535938874,11.44310907188868,0,0,0,8.4955324862402488,0,0,0,0,2.6748554347837619,0.81631177781371045,6.5397485266448534,0,0,3.537969219826242,14.98847900565633,0]
["MNE",2013,"MNE_2013_MICS",156,"Type of toilet facility","Flush to somewhere else","",5.7336225102624034,1.826383274926151,0,0.29259031040103572,0,1.030975900369798,0,0,0,0,8.7534232430997871,7.8666340165836113,1.9667771144922479,0.78507932390837176,0,"Centre","North","South",0,5.2304625961439939,0,158.2467221377733,50.398094710521207,0,8.0608022775303709,0,17.880216059360531,0,0,0,0,89.896401696416063,80.745428987723315,20.12277010479465,8.0608022775303709,0,0,216.70561912582491,0]
["MNE",2013,"MNE_2013_MICS",157,"Type of toilet facility","Flush to unknown place / Not sure / DK where","",0.038955198384729897,0,0,0,0,0.0619935916094983,0,0,0,0,0,0,0,0,0,"Centre","North","South",0,0.025950215872557001,0,1.0751549205718569,0,0,0,0,1.0751549205718569,0,0,0,0,0,0,0,0,0,0,1.0751549205718569,0]
["MNE",2013,"MNE_2013_MICS",158,"Type of toilet facility","Ventilated Improved Pit latrine (VIP)","",0.044655222970795799,0,0,0,0,0,0,0,0,0,0,0.12007397504992549,0,0,0,"Centre","North","South",0.019117082035798701,0,0,1.232474347380156,0,0,0,0,0,0,0,0,0,0,1.232474347380156,0,0,0,1.232474347380156,0,0]
["MNE",2013,"MNE_2013_MICS",159,"Type of toilet facility","Pit latrine with slab","",10.793392835452879,0.40859026845487528,0,0,0,2.3407765557223148,0,0,0,0,21.93687585677711,4.2170904022844704,0,0,0,"Centre","North","South",1.8282485199003711,4.5811787758622726,0.046697053610223201,297.89527195043331,11.27483553429864,0,0,0,40.596090120039079,0,0,0,0,225.28856987919389,43.285447485499041,0,0,0,117.8668060948562,189.8048527641152,1.498448625760554]
["MNE",2013,"MNE_2013_MICS",160,"Type of toilet facility","Pit latrine without slab / Open pit","",0.72056271315888387,0,0,0,0,0.38055558992535737,0,0,0,0,1.293824943567587,0,0,0,0,"Centre","North","South",0.21368781541368659,0.14749577881813769,0,19.887372642339411,0,0,0,0,6.5999759723017171,0,0,0,0,13.28739667003769,0,0,0,0,13.776409514375519,6.1109631279638954,0]
["MNE",2013,"MNE_2013_MICS",161,"Type of toilet facility","No facility, Bush, Field","",0.31102696427388998,0,0,0,0,0.29442537036798971,0,0,0,0,0.33866650210762528,0,0,0,0,"Centre","North","South",0.11743744897447669,0.024452628816260199,0,8.5842759101615282,0,0,0,0,5.1062194893679189,0,0,0,0,3.478056420793608,0,0,0,0,7.571168184128231,1.0131077260332959,0]
["MNE",2013,"MNE_2013_MICS",162,"Type of toilet facility","Other","",4.6202901043929403,2.1982194708077509,1.371681924860729,0.29670269194418758,0.31237426821344788,3.3919417735891542,1.631224102882783,1.031874866990528,0.2354495279195086,0.49824711374212649,4.2568261708847253,3.8869517095022572,3.288436257552223,0.76191746392342508,0,"Centre","North","South",0,5.7147080895617739,0.1884797052300054,127.5189922317212,60.658720765366418,37.820325947140383,8.1740975348602447,8.6445450556798704,58.826449532710441,28.315819362971041,17.860911612542161,4.0870487674301224,8.6445450556798704,43.716994458291097,39.896807526152998,33.645117348275662,7.8229878707147247,0,0,236.76860925930819,6.0480722754599068]
["MNE",2013,"MNE_2013_MICS",163,"Type of toilet facility","Missing","",0.064169437942678695,0,0.14935951455551449,0.0113830976594563,0,0,0.2372407245804235,0,0,0,0.17245249467213969,0,0,0,0.030631947815289301,"Centre","North","South",0.060628759151734997,0.050315995789278603,0.0065272429784437999,1.7710623951396871,0,4.1181744990696441,0.31360197613150759,0,0,4.1181744990696441,0,0,0,1.7710623951396871,0,0,0,0.31360197613150759,3.908723634081599,2.0846643712711952,0.20945086498804441]
["MNE",2018,"MNE_2018_MICS",16,"Water","Improved","w_imp",99.065344094371824,98.886391151746267,99.619771554031615,99.049859935377256,99.299340170298862,100,99.597884429421939,100,99.690180654582818,99.741838155683809,97.699796243320563,99.266486363272932,97.30157299352274,97.680749666740979,97.778113548499789,"CENTRE","NORTH","SOUTH",99.331834984472238,99.07767728311012,98.909469309983876,2493.2935464771358,2489.8316079500478,2508.3099125964941,2494.693271540405,2498.7493623645119,1678.7064611152,1665.5436618875981,1673.8105688419471,1673.2202484978909,1671.5301295395579,822.38298903166276,837.02585540680445,818.87137657082042,821.98192824424473,821.80448179287055,6929.3568778540357,3009.3221560114621,2546.1986670630831]
["MNE",2018,"MNE_2018_MICS",17,"Water","Not Improved","",0.93465590562814804,1.1136088482536779,0.38022844596841232,0.9501400646227417,0.70065982970111862,0,0.40211557057804742,0,0.30981934541718192,0.25816184431616851,2.3002037566794402,0.7335136367270747,2.698427006477246,2.3192503332590051,2.2218864515002119,"CENTRE","NORTH","SOUTH",0.66816501552777918,0.92232271688989376,1.090530690016128,23.523579905596868,28.039232466477682,9.573709768612007,23.930453084757211,17.63126824103275,0,6.7244504615675904,0,5.200070846742519,4.3264221820177644,19.36184632451803,6.1850671029814457,22.709444147598681,19.516454035389561,18.67448836566092,46.610976698584388,28.01404174018316,28.073225027708951]
["MNE",2018,"MNE_2018_MICS",18,"Water ladder","Basic","w_bas",98.896612450147373,98.293958211156792,99.547361202714498,98.809842536509478,98.977990192441354,100,98.975966112814504,99.966728404554033,99.690180654582818,99.259315436722304,97.195288613324664,98.730848784813276,97.30157299352274,96.818831116294106,97.774296965531605,"CENTRE","NORTH","SOUTH",99.13163980814204,98.779818780029061,98.43741951121126,2489.046879557668,2474.914911689923,2496.6934496159229,2487.2240558603098,2490.6629737652502,1678.7064611152,1655.1435201941131,1663.419154316633,1673.2202484978909,1663.443740940296,818.13632211219453,832.50930084016568,818.87137657082042,814.72889758566635,820.36324831609818,6905.6389698768207,3000.2751918793001,2532.6281087329421]
["MNE",2018,"MNE_2018_MICS",19,"Water ladder","Limited","w_lim",0.16873164422445239,0.59243294058944529,0.070918909113990694,0.23947338838241919,0.3213499778575164,0,0.62191831660744568,0.0332715954459602,0,0.48252271896152188,0.5045076299958815,0.5356375784596592,0,0.86191855044687737,0,"CENTRE","NORTH","SOUTH",0.19925157304000049,0.29785850308107459,0.47143891156458012,4.2466669194682023,14.91669626012381,1.7786787484827811,6.027982203322038,8.0863885992617508,0,10.40014169348504,0.55363029322627055,0,8.0863885992617508,4.2466669194682023,4.5165545666387708,0,7.2530306585785489,0,13.880123745126159,9.0469641321626764,12.12932485336975]
["MNE",2018,"MNE_2018_MICS",20,"Water ladder","Unimproved","w_unimp",0.93465590562814804,1.1136088482536779,0.38171988817152758,0.95068407510810449,0.70065982970111862,0,0.40211557057804742,0,0.30981934541718192,0.25816184431616851,2.3002037566794402,0.7335136367270747,2.698427006477246,2.3192503332590051,2.225703034468403,"CENTRE","NORTH","SOUTH",0.66910861881796135,0.92232271688989376,1.0911415772242059,23.523579905596868,28.039232466477682,9.573709768612007,23.930453084757211,17.63126824103275,0,6.7244504615675904,0,5.200070846742519,4.3264221820177644,19.36184632451803,6.1850671029814457,22.709444147598681,19.516454035389561,18.67448836566092,46.610976698584388,28.01404174018316,28.073225027708951]
["MNE",2018,"MNE_2018_MICS",22,"Improved water point at more than 30 minutes","Yes","",0.17032358365778749,0.59910462267788334,0.071190658014150907,0.24177187509705719,0.32361743522806857,0,0.62442924382410525,0.0332715954459602,0,0.48377163273085838,0.51638554981159768,0.5395955856636796,0,0.88238322636496869,0,"CENTRE","NORTH","SOUTH",0.20059376319837219,0.30063129379785208,0.47663972578620062,4.2466669194682023,14.91669626012381,1.7786787484827811,6.027982203322038,8.0863885992617508,0,10.40014169348504,0.55363029322627055,0,8.0863885992617508,4.2466669194682023,4.5165545666387708,0,7.2530306585785489,0,13.880123745126159,9.0469641321626764,12.12932485336975]
["MNE",2018,"MNE_2018_MICS",23,"Improved water point at more than 30 minutes","No","",99.82967641634221,99.400895377322072,99.928809341985854,99.758228124902942,99.676382564771941,100,99.375570756175918,99.966728404554033,100,99.51622836726915,99.483614450188398,99.460404414336324,100,99.117616773635049,100,"CENTRE","NORTH","SOUTH",99.79940623680163,99.699368706202151,99.523360274213829,2489.046879557668,2474.914911689923,2496.6934496159229,2487.2240558603098,2490.6629737652502,1678.7064611152,1655.1435201941131,1663.419154316633,1673.2202484978909,1663.443740940296,818.13632211219453,832.50930084016568,818.87137657082042,814.72889758566635,820.36324831609818,6905.6389698768207,3000.2751918793001,2532.6281087329421]
["MNE",2018,"MNE_2018_MICS",29,"Piped water","Yes","w_pip",84.972369066555146,89.875074826039651,90.607064697037487,93.443584685912811,96.622994394755708,97.606540837185719,97.691335281254908,96.237537931849545,98.838534762907599,98.490999558332376,68.663854953883529,78.058283749865637,73.843153351878627,82.599672381772351,85.974903509035187,"CENTRE","NORTH","SOUTH",93.279130017471431,86.687277939827197,90.421928663981632,2138.5991373602042,2262.9383018473868,2281.3804427124619,2353.4922930396051,2431.4023156607141,1638.5273075048831,1633.661048436536,1610.834081096576,1658.9260508031509,1650.5678689543811,577.97445283077377,658.19597450254821,621.44981602310111,695.07490686089238,722.60098360753,6507.1221250251501,2632.9840717119482,2327.706293883266]
["MNE",2018,"MNE_2018_MICS",30,"Piped water","No","",15.027630933444909,10.12492517396028,9.3929353029625471,6.5564153140872188,3.3770056052442432,2.3934591628142701,2.3086647187450962,3.7624620681504521,1.1614652370924019,1.509000441667619,31.33614504611646,21.941716250134299,26.156846648121348,17.400327618227649,14.02509649096478,"CENTRE","NORTH","SOUTH",6.7208699825286002,13.31272206017286,9.5780713360185779,378.21798902253113,254.93253856913819,236.50317965264421,165.131431585558,84.978314944829677,40.179153610316931,38.607063912629791,62.976487745371571,19.494268541483201,25.288682767194299,263.770382525407,185.01494800723711,220.13100469531801,146.4234754187421,117.8779865510011,468.84572952747141,404.3521260396987,246.5655982075312]
["MNE",2018,"MNE_2018_MICS",31,"Piped water on premises","Yes","w_pop",84.361172189823606,88.758250244821753,90.607064697037487,93.359637372562091,96.226969834937051,97.060194428960799,96.958321091169097,96.11122035508221,98.244792825869496,98.490999558332376,67.712929072402815,76.651617662807723,73.580806410890204,82.599672381772351,85.974903509035187,"CENTRE","NORTH","SOUTH",92.798776352154178,86.478744920686495,89.810511342541133,2123.216429690709,2234.8181013782969,2281.3804427124619,2351.3779760893681,2421.436830344996,1629.3557550499411,1621.403085876736,1608.719764146339,1648.9605654874331,1650.5678689543811,569.97008333534461,646.334812413235,619.24195448400098,695.07490686089238,722.60098360753,6473.6128077444537,2626.6502228373229,2311.9667496340489]
["MNE",2018,"MNE_2018_MICS",32,"Piped water on premises","No","",15.638827810176441,11.24174975517818,9.3929353029625471,6.6403626274379466,3.7730301650629099,2.9398055710391842,3.0416789088309319,3.888779644917796,1.7552071741304971,1.509000441667619,32.287070927597163,23.348382337192209,26.419193589109781,17.400327618227649,14.02509649096478,"CENTRE","NORTH","SOUTH",7.2012236478458558,13.52125507931355,10.189488657459091,393.60069669202647,283.05273903822768,236.50317965264421,167.24574853579489,94.943800260547491,49.350706065259388,50.865026472429712,65.090804695608426,29.459753857201012,25.288682767194299,271.7747520208361,196.87611009655029,222.33886623441811,146.4234754187421,117.8779865510011,502.35504680816842,410.68597491432348,262.30514245674891]
["MNE",2018,"MNE_2018_MICS",33,"Piped water into dwelling","Yes","",81.878429434534524,87.644898955638766,90.040654733056186,92.689982652737228,95.585600656746905,95.244197710546558,96.802386335177772,96.029790545982266,97.815164063867016,97.944375630299447,64.376654596679131,74.323053073546248,71.832454940674793,81.26533249303472,84.39266301113625,"CENTRE","NORTH","SOUTH",92.153828070126735,83.9573831189945,89.180735637626071,2060.730334821566,2206.7853539165581,2267.1188989939328,2334.511893442786,2405.297540574345,1598.8705008042809,1618.795438676224,1607.356783395436,1641.7495890482339,1641.407236043163,541.88716524263396,626.70010145888705,604.52816383191964,683.84645828305338,709.30258496535782,6428.6214229117304,2550.0679881582491,2295.7546106792038]
["MNE",2018,"MNE_2018_MICS",34,"Piped water into dwelling","No","",18.121570565465539,12.35510104436114,9.9593452669438527,7.3100173472627779,4.4143993432530726,4.7558022894534444,3.1976136648222471,3.9702094540177568,2.1848359361329801,2.0556243697005718,35.62334540332084,25.67694692645367,28.167545059325182,18.734667506965291,15.6073369888637,"CENTRE","NORTH","SOUTH",7.846171929873293,16.042616881005561,10.81926436237417,456.08679156116909,311.08548649996692,250.7647233711736,184.1118311823752,111.08309003119869,79.835960310919575,53.472673672941959,66.45378544651139,36.670730296399483,34.449315678412383,299.85767011354659,216.5108210508981,237.05265688649939,157.65192399658119,131.17638519317319,547.34643164089175,487.26820959339773,278.51728141159418]
["MNE",2018,"MNE_2018_MICS",35,"Water source on premises","Yes","",97.575043918547138,97.413389465381201,98.812385153737324,97.72390169096181,98.744865186754907,98.817629520489461,98.745548822945111,97.708884930407564,99.337745214716108,99.488159919335615,95.913492547658663,95.841739596988432,97.736048854805247,95.738088802201787,97.415024860082397,"CENTRE","NORTH","SOUTH",99.145691385164071,98.568654092934736,94.487714287130018,2455.7854164174692,2452.7433280102182,2487.9808626542808,2461.2973726179339,2484.7966612770579,1658.857931481338,1651.2903253302879,1635.461642662779,1667.3049004625971,1667.2788461954251,807.34686992965214,808.14801660519288,822.52784209002516,805.63446849596801,818.75279772369788,6916.3715602029924,2993.861410401315,2432.370670372643]
["MNE",2018,"MNE_2018_MICS",36,"Water source on premises","No","",2.4249560814528048,2.586610534618766,1.187614846262697,2.2760983090381841,1.255134813245083,1.182370479510535,1.254451177054885,2.2911150695924301,0.66225478528387505,0.51184008066437137,4.0865074523413236,4.1582604030115577,2.2639511451947412,4.2619111977981534,2.5849751399176091,"CENTRE","NORTH","SOUTH",0.8543086148359178,1.431345907065299,5.5122857128701472,61.031709965263843,65.127512406307957,29.90275971082497,57.32635200722784,31.583969328486361,19.848529633862121,20.977787018877599,38.348926179168629,11.115418882036741,8.577705526150865,34.397965426528543,35.062905904592903,19.052978628393952,35.863913783666057,21.726172434833568,59.596294349627378,43.474787350330928,141.9012217181527]
["MNE",2018,"MNE_2018_MICS",37,"Improved water source on premises","Yes","w_premises",97.73449373410476,97.680061716312466,98.965243209558736,97.955220055552275,98.819990357467219,98.817629520489461,99.044501135529529,97.708884930407564,99.335687044666372,99.486835123425877,96.306806672002921,95.873163417374968,97.954311309951578,96.542675243114402,97.954525790678304,"CENTRE","NORTH","SOUTH",99.23812890558068,98.782869446441339,94.844097923225632,2436.8078249545351,2432.069051277861,2482.3550054505899,2443.68228384846,2469.2638789458838,1658.857931481338,1649.6294111110019,1635.461642662779,1662.104829615854,1662.9524240134069,792.01079535016243,802.48316619984632,802.11981743426736,793.56334354193086,804.9946830667476,6876.5641107725087,2972.6947765956361,2414.919157109176]
["MNE",2018,"MNE_2018_MICS",38,"Improved water source on premises","No","",2.265506265895227,2.3199382836875242,1.0347567904412931,2.044779944447713,1.1800096425327711,1.182370479510535,0.95549886447049581,2.2911150695924301,0.66431295533361112,0.51316487657411791,3.6931933279970899,4.1268365826250246,2.0456886900484239,3.4573247568855789,2.0454742093217102,"CENTRE","NORTH","SOUTH",0.76187109441929912,1.2171305535587069,5.1559020767745132,56.485721522600862,57.762556672185831,25.95490714590429,51.010987691944713,29.485483418627371,19.848529633862121,15.91425077659631,38.348926179168629,11.115418882036741,8.577705526150865,30.372193681500409,34.542689206958038,16.751559136553119,28.41858470231373,16.809798726123091,52.792767081525518,36.627379415827122,131.27950995391049]
["MNE",2018,"MNE_2018_MICS",39,"Piped water on premises available when needed","Yes","",79.584937083719765,85.896385990345749,83.15162191079834,90.103762005857618,90.409474046753516,84.851713794115355,84.407718491699157,87.97148549434921,90.615517918095208,91.239245630884483,73.114417115272175,79.108800612053031,84.599818484887308,81.468071120662543,87.42132297791801,"CENTRE","NORTH","SOUTH",88.818241158990574,81.821446669000295,82.97881362819389,1665.482639315007,1907.5184645054401,1887.5191132404309,2118.6800154337161,2159.7683246786601,1353.829426748697,1359.4973113647779,1405.1791092763899,1487.9401091300099,1484.0739834838439,416.73030416206831,511.30771803827298,523.87756947573337,566.26411946331075,630.26890603014647,5674.921461990546,2146.969851335431,1917.0772438472709]
["MNE",2018,"MNE_2018_MICS",40,"Piped water on premises available when needed","No","",20.41506291628016,14.10361400965432,16.84837808920166,9.8962379941425151,9.5905259532464822,15.14828620588457,15.592281508300831,12.02851450565079,9.3844820819048405,8.7607543691154941,26.88558288472781,20.891199387946958,15.40018151511271,18.53192887933746,12.57867702208196,"CENTRE","NORTH","SOUTH",11.181758841009421,18.178553330999879,17.02118637180617,427.22824335239159,313.20181669455741,382.45358225946478,232.69796065565529,229.10557095066031,241.69453642502839,251.13419918656311,192.13290765738199,154.09664496647659,142.50016585511611,153.23977917327619,135.02709437496191,95.364385008267774,128.81078739758169,90.686673868075388,714.44336660593353,476.99970522932438,393.24410207747081]
["MNE",2018,"MNE_2018_MICS",41,"Water point at more than 30 minutes","Yes","",0.232931313373724,0.68383633805125132,0.070918909113990694,0.23947338838241919,0.3213499778575164,0,0.62191831660744568,0.0332715954459602,0,0.48252271896152188,0.69646464598947577,0.5356375784596592,0.27346387122703381,0.86191855044687737,0,"CENTRE","NORTH","SOUTH",0.19925157304000049,0.42682703027178931,0.47143891156458012,5.8624551876981208,17.218115751964639,1.7786787484827811,6.027982203322038,8.0863885992617508,0,10.40014169348504,0.55363029322627055,0,8.0863885992617508,5.8624551876981208,4.5165545666387708,2.3014194918408322,7.2530306585785489,0,13.880123745126159,12.964171892233431,12.12932485336975]
["MNE",2018,"MNE_2018_MICS",42,"Water point at more than 30 minutes","No","w_30min",99.767068686626274,99.316163661948693,99.929081090886001,99.760526611617578,99.678650022142492,100,99.378081683392537,99.966728404554033,100,99.517477281038481,99.303535354010535,99.464362421540343,99.726536128772977,99.138081449553084,100,"CENTRE","NORTH","SOUTH",99.800748426959998,99.573172969728219,99.528561088435438,2510.9546711950361,2500.652724664561,2506.2671593845348,2511.1545089450669,2508.2942420062832,1678.7064611152,1661.86797065568,1663.419154316633,1678.420319344634,1667.770163122314,835.88238016848277,838.69436794314709,839.27940122657844,834.24535162105565,839.03773668175904,6952.2499465754054,3024.3720258594121,2560.70133376065]
["MNE",2018,"MNE_2018_MICS",43,"Water source available when needed","Yes","w_available",79.091443779954261,85.903357128398056,83.227080046861005,89.538527338529576,89.99385482814553,84.636811370529372,84.19214644331305,86.455217172943776,90.184715941581871,91.131197140723145,73.31515267812884,81.354795348933195,85.154824249435421,82.785424395300168,87.779018722925059,"CENTRE","NORTH","SOUTH",88.341035310273853,81.934014993660625,82.372686966449336,1966.459724983552,2150.82507925972,2086.0666829684642,2255.138592228192,2235.2832914349169,1392.1694710854199,1398.8495976016279,1437.233969728826,1507.4343776714929,1505.362374020993,617.12651120164821,685.99252036768792,716.64666879972606,696.63800704978075,736.31987334764392,6088.2166886163814,2486.4151181680149,2119.1415640904379]
["MNE",2018,"MNE_2018_MICS",44,"Water source available when needed","No","",20.90855622004571,14.096642871601899,16.77291995313902,10.461472661470539,10.00614517185449,15.363188629470541,15.80785355668695,13.54478282705624,9.815284058418154,8.8688028592768351,26.684847321871121,18.64520465106677,14.84517575056458,17.214575604699849,12.2209812770749,"CENTRE","NORTH","SOUTH",11.65896468972608,18.065985006339481,17.62731303355087,519.85185437587177,352.94794097850331,420.40919218407601,263.48513239697229,248.5344044549515,252.70519815356511,262.64693942214262,225.16885190055481,164.0621302821944,146.50045808516191,224.6183241545323,157.2184021420976,124.9341519186932,144.86037522985379,102.51369310157931,803.50318678826204,548.24041331106093,453.4849242910513]
["MNE",2018,"MNE_2018_MICS",45,"Improved water source available when needed","Yes","",78.933979656565697,85.910319687880516,83.232454720792788,89.475376857721272,89.959950526552333,84.636811370529372,84.127908516526105,86.455217172943776,90.154085033810588,91.107907709796351,72.813410084938567,81.217019626509867,85.246866544259092,82.588378249417417,87.727068837222816,"CENTRE","NORTH","SOUTH",88.287064418887425,81.876836254552273,82.322820617062632,1943.9765784732249,2126.9108116955799,2078.2329642256718,2232.136206154993,2218.5800902054411,1392.1694710854199,1392.1251471400601,1437.233969728826,1502.234306824751,1501.0359518389751,598.80509827239996,679.80745326470651,698.06218955446457,678.8615440402117,719.501519005099,6043.3457029436177,2461.7429293149421,2094.748018496342]
["MNE",2018,"MNE_2018_MICS",46,"Improved water source available when needed","No","",21.06602034343431,14.0896803121195,16.767545279207219,10.524623142278831,10.04004947344762,15.363188629470541,15.87209148347389,13.54478282705624,9.8459149661894596,8.892092290203637,27.186589915061411,18.78298037349008,14.753133455740929,17.411621750582611,12.27293116277715,"CENTRE","NORTH","SOUTH",11.712935581112511,18.123163745447808,17.677179382937581,518.81142098060207,348.82297607616613,418.66920115825542,262.55706538541438,247.6063374433935,252.70519815356511,262.64693942214262,225.16885190055481,164.0621302821944,146.50045808516191,223.5778907592626,157.2184021420976,120.80918701635601,143.1203842040332,100.65755907846339,801.76319576244146,544.89856042395036,449.80524485743899]
["MNE",2018,"MNE_2018_MICS",58,"Main source of drinking water","PIPED WATER: PIPED INTO DWELLING","",81.804359524905394,86.73875091649245,88.024995075251994,88.638357112970994,89.19831206471558,94.633298747119241,96.297376728228841,93.63603078057659,92.904872031645297,92.210208068660123,64.155185560845524,73.951531556557683,70.098646023750305,78.150525457035428,77.83365873089727,"CENTRE","NORTH","SOUTH",91.316672826841625,83.620810715437017,78.708532387706271,2058.8661306505242,2183.9697166678861,2216.36693458746,2232.4666913652618,2244.5690476235918,1588.61530043434,1610.3503240549171,1567.2897794493899,1559.3342498402651,1545.3108132747379,540.02296107159145,623.56739144816538,589.93676051917737,657.63540746398701,654.17553333815124,6370.2217422474587,2539.8451527133539,2026.1716259339]
["MNE",2018,"MNE_2018_MICS",59,"Main source of drinking water","PIPED WATER: PIPED TO YARD/PLOT","",2.482742755289105,1.113351289182954,0.56640996398130317,0.66965471982483016,0.64136917819016326,1.81599671841426,0.15593475599131559,0.081429809099960199,0.42962876200248329,0.54662392803295357,3.3362744757236662,2.3285645892614641,1.7483514702153979,1.3343398887376421,1.582240497898922,"CENTRE","NORTH","SOUTH",0.64494828202743371,2.521361801692001,0.62977570491507318,62.486094869142761,28.032747461739071,14.26154371852933,16.866082646580331,16.139289770651231,30.485254245660201,2.6076472005122509,1.362980750902955,7.2109764391984772,9.1606329112180838,28.082918092710461,19.634710954347799,14.71379065208129,11.22844857783913,13.29839864217208,44.991384832723149,76.58223467907419,16.212138954845379]
["MNE",2018,"MNE_2018_MICS",60,"Main source of drinking water","PIPED WATER: PIPED TO NEIGHBOUR","",0.16909145474887571,0.1450048623855191,0,0,0.39602455981866691,0.1068211937234666,0.1110958734783894,0,0.59374193703809452,0,0.50558346349325978,0,0,0,0,"CENTRE","NORTH","SOUTH",0.19519184644783821,0.085114123141150799,0.064892936365301995,4.2557226923694156,3.6510351471910978,0,0,9.9654853157178032,1.7932142808762179,1.8578208663148801,0,9.9654853157178032,0,4.2557226923694156,0,0,0,0,13.6165204629089,2.585202071565083,1.6705206208043331]
["MNE",2018,"MNE_2018_MICS",61,"Main source of drinking water","PIPED WATER: PUBLIC TAP/STANDPIPE","",0.44210542198264829,0.55876669297643333,0,0.083947313350727901,0,0.43952521450144721,0,0.12631757676734481,0,0,0.44534241798745189,1.4066660870579011,0.26234694098843331,0,0,"CENTRE","NORTH","SOUTH",0.13607653191962529,0.1234188959995475,0.54652438507521695,11.12698497712595,14.069023628413349,0,2.1143169502368582,0,7.3783381740662364,0,2.1143169502368582,0,0,3.748646803059712,11.861162089313231,2.2078615391001239,0,0,9.492655124303095,3.748646803059712,14.069023628413349]
["MNE",2018,"MNE_2018_MICS",62,"Main source of drinking water","TUBE WELL/BOREHOLE","",1.8527956849715559,2.99977744057104,3.27242666058762,2.4143930621002152,1.2007454764957659,0.44680457762242909,0,0.80385813960206709,0.46472901812577277,0.42916042595617271,3.525220182725779,6.246090646881246,9.9296324931154683,4.2333194136711088,6.9132729118285443,"CENTRE","NORTH","SOUTH",3.828391395434283,0.64432808700699029,0.34747437861466829,46.631479116244407,75.530521453531406,82.395894940845025,60.809476467759943,30.21532659341171,7.5005373131061974,0,13.45506249915565,7.800106270113778,7.1921131157827407,29.673358823027971,52.667718564364797,83.565882629883987,35.623314382772087,58.104604973585261,267.06735309195398,19.57041021894403,8.9449352608945443]
["MNE",2018,"MNE_2018_MICS",63,"Main source of drinking water","DUG WELL: PROTECTED WELL","",1.8967199730532891,1.601029829277633,1.3417104826240609,0.35751032869055682,0,0.59204163158603795,0.43728492934785679,0.54340553289134985,0,0,3.593829581759223,2.9825780495508032,3.0494324973243541,2.202741269695951,0.58172996626871099,"CENTRE","NORTH","SOUTH",0.88677110694616645,1.424795918693462,0.99830850538284976,47.736973121327161,40.311863217752027,33.782708501547042,9.0043399563857598,0,9.9386411219266702,7.3125764335927856,9.095579241207318,0,0,30.250874895960891,25.149423886191698,25.66343903823649,18.536032150297299,4.8893180295988339,61.860867364024998,43.275842182564602,25.699175250422389]
["MNE",2018,"MNE_2018_MICS",64,"Main source of drinking water","DUG WELL: UNPROTECTED WELL","",0.14691717083140751,0,0,0.37572742371189538,0,0,0,0,0,0,0.43928235277109862,0,0,1.1245606923087399,0,"CENTRE","NORTH","SOUTH",0.12634786790961369,0.027963100842190301,0.13586274733361739,3.697636517081841,0,0,9.4631600335307038,0,0,0,0,0,0,3.697636517081841,0,0,9.4631600335307038,0,8.8139866502872586,0.84933338389364055,3.4974765164316461]
["MNE",2018,"MNE_2018_MICS",65,"Main source of drinking water","SPRING: PROTECTED SPRING","",8.9577804498239715,3.3880880031101639,2.994095292330158,2.834371858673705,1.1527373807100221,1.1624056618460079,1.0388710907393,1.8274506292598649,0.38691687354944743,0.54853944174668301,19.083107604578721,9.7783678946192776,7.8691697667728082,7.297533039206308,3.8861803444828378,"CENTRE","NORTH","SOUTH",0.30120870501641389,10.237386035055939,6.0049925543853773,225.45095250493401,85.307679877961419,75.387835003585678,71.387162076655088,29.007260169936689,19.513378949777842,17.372709978847279,30.588061772920291,6.4940914246269079,9.1927341732887431,160.63107268700401,82.452266130619932,66.225423506932316,61.408622471242928,32.662528537812634,21.012222437059261,310.94383174632588,154.5848354496876]
["MNE",2018,"MNE_2018_MICS",66,"Main source of drinking water","SPRING: UNPROTECTED SPRING","",0.7055609871933487,0.27241383202629388,0.18888330058375599,0.14873022809181041,0,0,0,0,0,0,1.615209931870313,0.49355783588424063,1.1177807718457611,0.26237264213378358,0.44569286602172681,"CENTRE","NORTH","SOUTH",0,0.8943596160477032,0.2312815661703069,17.757679762757292,6.8590284418513132,4.7558616907810451,3.7459548104094522,0,0,0,0,0,0,13.59594618167845,4.1617335810788401,9.4070285935322353,2.2078615391001239,3.7459548104094522,0,27.16470835628952,5.9538163495095757]
["MNE",2018,"MNE_2018_MICS",67,"Main source of drinking water","RAINWATER","",1.1529041407912271,0.85750137419159278,0.63531939880750576,0,0.32286291833733582,0.19220729175979481,0.13886984184798681,0,0,0.27313872964859448,2.1377873116456381,1.708707446971826,2.6101848844314679,0.79447083462885515,0.42202681688447491,"CENTRE","NORTH","SOUTH",0.86141205340629201,0,0.56856857505946834,29.016488866209311,21.590777056941121,15.996603092282641,0,8.1244599404485172,3.2265962255062188,2.3222760828936,0,0,4.5774132961050524,17.994714286676899,14.40800782660455,21.966815372666471,6.6854592210853268,3.5470466443434661,60.091827940864569,0,14.63650101501703]
["MNE",2018,"MNE_2018_MICS",68,"Main source of drinking water","TANKER-TRUCK","",0.23277477917671699,0.1649196785561777,0.76915502264478919,0,0,0,0.29152328623190449,0.5877477663971703,0,0,0.69599660872765523,0.49245857538408178,0,0.55301272776642263,0,"CENTRE","NORTH","SOUTH",0.17492170619766309,0.083889302526570897,0.56819663256008845,5.8585155082192033,4.152464496474666,19.366428345771769,0,0,0,4.8750509557285238,9.8377842320883158,0,0,5.8585155082192033,4.152464496474666,0,4.6535931579549246,0,12.202481994983961,2.5480001516809221,14.62692620380075]
["MNE",2018,"MNE_2018_MICS",69,"Main source of drinking water","PACKAGED WATER: BOTTLED WATER","",0.074069909629144295,1.9716989556717359,2.1724521532894352,4.4128407008732022,6.747140959223338,0.61089896342732197,1.4179476206560511,2.3937597654056568,5.2201113776389194,5.9004545446516357,0.221469035833607,0.37152151698857688,3.1077024567482332,4.0471240348157727,7.3048318606887106,"CENTRE","NORTH","SOUTH",1.426057622663965,0.33657240355749202,10.77707833857021,1.8642041710425159,49.644833065655817,54.699816971392757,111.1428528221077,169.78374821754929,10.255200369940241,23.711885910044849,40.067003946046093,87.615410054712711,98.883154067897905,1.8642041710425159,3.1327100107217301,26.15382784098826,34.056483281825003,61.395575594528758,99.4813213444355,10.22283544489445,277.43129845841821]
["MNE",2018,"MNE_2018_MICS",70,"Main source of drinking water","OTHER (specify)","",0.082177747603391901,0.18869712555794921,0.034552649899405298,0.064467251712167994,0.34080746250913813,0,0.1110958734783894,0,0,0.091874861303835806,0.24571147203802771,0.23995580084283399,0.2067526948077556,0,1.0303660050287511,"CENTRE","NORTH","SOUTH",0.102000055189094,0,0.41851128786179409,2.0682636257577451,4.7511499011277643,0.86999551291027921,1.6236874962364829,8.576012974238207,0,1.8578208663148801,0,0,1.539690882545443,2.0682636257577451,2.0233335219026061,1.739991025820558,0,8.6600095879292471,7.1154910616171314,0,10.77361844865335]
["MNE",2018,"MNE_2018_MICS",122,"Sanitation","Improved","s_imp",91.302563686679676,96.69488549519285,98.558332403558182,99.086242971063683,99.622038416043125,98.013706216885041,99.365268794337794,99.402351688347366,99.846731619146212,99.432472183848262,82.298167737379771,92.707595407457617,92.988379917259579,96.847966484376713,98.944782041047404,"CENTRE","NORTH","SOUTH",99.511647889276873,89.390708032809997,99.431509340802123,2297.9185596928569,2434.65232605761,2481.584110065352,2495.609623308942,2506.869678515724,1645.36241904132,1661.653704797747,1663.8070682370001,1675.847831697253,1666.3455996317541,692.74057652216084,781.72057047186331,782.57237088043485,814.97407123675259,831.6100851241988,6941.9005682915449,2715.0963325070252,2559.6373968418989]
["MNE",2018,"MNE_2018_MICS",123,"Sanitation","Not Improved","",8.6974363133203312,3.3051145048071038,1.4416675964418391,0.91375702893634636,0.377961583956897,1.986293783114933,0.63473120566219365,0.59764831165263743,0.15326838085378519,0.56752781615173742,17.701832262620211,7.292404592542348,7.0116200827404231,3.1520335156232679,1.055217958952605,"CENTRE","NORTH","SOUTH",0.4883521107231264,10.609291967190041,0.56849065919788011,218.8985666898771,83.218514358915172,36.299512299753722,23.01410131622082,9.5109520898212701,33.344042073879933,10.614407551418269,10.0035006049473,2.5724876473804521,9.5109520898212701,149.00425883401979,61.490352037922321,59.008449837984358,26.524311042881681,8.8688850343327239,34.067286261074507,322.23986524462077,14.63449524889268]
["MNE",2018,"MNE_2018_MICS",124,"Sanitation ladder","Basic","s_bas",87.363879911292855,96.182506241984399,98.170495840065712,98.665464078093649,99.622038416043125,93.046650159918514,99.365268794337794,98.886453754372212,99.72979530345556,99.432472183848262,79.579395387688606,92.032537654367644,92.988379917259579,95.68750396663944,98.944782041047404,"CENTRE","NORTH","SOUTH",98.33106480272491,89.073197480715365,97.868891764172773,2197.4616376571571,2421.7512782487311,2471.8188367516318,2485.0117862823831,2506.869678515724,1561.9801280858089,1661.653704797747,1655.1719140936871,1673.885148814009,1666.3455996317541,669.85545068354361,774.63001742141114,782.57237088043485,805.20879792303197,831.6100851241988,6858.0493760931768,2705.452469576574,2519.41137178586]
["MNE",2018,"MNE_2018_MICS",125,"Sanitation ladder","Limited","s_lim",3.9334297821598589,0.51237925320845257,0.38783656349247569,0.42077889297002019,0,4.9670560569665216,0,0.5158979339751496,0.1169363156906431,0,2.7187723496911742,0.66189321967919124,0,1.160462517737276,0,"CENTRE","NORTH","SOUTH",1.180476694093664,0.31751055209463058,1.5626175766293979,98.937467744002404,12.901047808879589,9.7652733137206909,10.59783702655805,0,83.382290955510911,0,8.6351541433133061,1.9626828832447409,0,22.885125838617341,5.571098758753755,0,9.7652733137206909,0,82.331737906668536,9.6438629304513093,40.226025056040889]
["MNE",2018,"MNE_2018_MICS",126,"Sanitation ladder","Unimproved","s_unimp",8.2862362009660497,3.3051145048071038,1.4416675964418391,0.91375702893634636,0.377961583956897,1.7475895002174939,0.63473120566219365,0.59764831165263743,0.15326838085378519,0.56752781615173742,16.93343833474793,7.3055691259531459,7.0116200827404231,3.1520335156232679,1.055217958952605,"CENTRE","NORTH","SOUTH",0.43100386318711481,10.451344500399831,0.5035977228325782,208.42350626686371,83.218514358915172,36.299512299753722,23.01410131622082,9.5109520898212701,29.336897853921911,10.614407551418269,10.0035006049473,2.5724876473804521,9.5109520898212701,142.53634263096441,61.490352037922321,59.008449837984358,26.524311042881681,8.8688850343327239,30.060142041116499,317.44246966236972,12.96397462808835]
["MNE",2018,"MNE_2018_MICS",127,"Sanitation ladder","Open defecation","s_od",0.41645410558127738,0,0,0,0,0.23870428289743889,0,0,0,0,0.76839392787227889,0,0,0,0,"CENTRE","NORTH","SOUTH",0.057454639994298298,0.1579474667902187,0.064892936365301995,10.475060423013421,0,0,0,0,4.0071442199580121,0,0,0,0,6.4679162030554043,0,0,0,0,4.0071442199580121,4.7973955822510703,1.6705206208043331]
["MNE",2018,"MNE_2018_MICS",128,"Shared among improved sanitation facilities","Yes","s_shared",4.3083742504210303,0.52989281758229634,0.3935096648190386,0.42465924668563831,0,5.0677157804597286,0,0.51899972708153419,0.11711581720740059,0,3.303563644778825,0.71405931665794631,0,1.198231165673963,0,"CENTRE","NORTH","SOUTH",1.1862711363298539,0.35519413491846541,1.5715517012555009,98.937467744002404,12.901047808879589,9.7652733137206909,10.59783702655805,0,83.382290955510911,0,8.6351541433133061,1.9626828832447409,0,22.885125838617341,5.571098758753755,0,9.7652733137206909,0,82.331737906668536,9.6438629304513093,40.226025056040889]
["MNE",2018,"MNE_2018_MICS",129,"Shared among improved sanitation facilities","No","",95.691625749579018,99.470107182417706,99.606490335180965,99.57534075331435,100,94.932284219540264,100,99.481000272918479,99.88288418279258,100,96.696436355221195,99.285940683342048,100,98.80176883432604,100,"CENTRE","NORTH","SOUTH",98.813728863670136,99.644805865081523,98.428448298744541,2197.4616376571571,2421.7512782487311,2471.8188367516318,2485.0117862823831,2506.869678515724,1561.9801280858089,1661.653704797747,1655.1719140936871,1673.885148814009,1666.3455996317541,669.85545068354361,774.63001742141114,782.57237088043485,805.20879792303197,831.6100851241988,6858.0493760931768,2705.452469576574,2519.41137178586]
["MNE",2018,"MNE_2018_MICS",135,"Sanitation type","Sewer connection","s_sew",33.658787108353273,42.65545496286213,43.092989920702117,49.594767137785567,64.85782411180459,46.149716417887582,59.003209920840092,56.487470302569541,62.840418354839798,74.084603268347607,21.748726491727101,22.316066887349759,18.41218219247185,19.270358707016261,23.29756717786692,"CENTRE","NORTH","SOUTH",37.114021971899753,59.851179332393833,57.507609772418043,847.13011847573887,1074.0092623569101,1085.0313356008039,1249.1055713048711,1632.0697233816629,774.71827129342114,986.6918647686482,945.49324799586532,1054.726350428806,1241.5516776895399,183.06878199985439,188.17151346872279,154.9533940075753,162.15975677902449,195.8111526885279,2589.0622422913229,1817.881534644049,1480.4022341846151]
["MNE",2018,"MNE_2018_MICS",136,"Sanitation type","Septic tank connection","s_sep",49.371596611599209,52.817070608816572,55.131520614696782,49.061599392547841,33.843724161378027,44.974358986366219,39.980185410591822,42.914881385777903,36.332498438083498,24.58197456955973,49.716267509646393,67.589890756595253,73.910706878174764,76.47001372670249,74.998947441564241,"CENTRE","NORTH","SOUTH",59.695373706394172,27.084109033534201,41.213767038962438,1242.592799089326,1329.8656196216,1388.147528318292,1235.6770819812641,851.63691947248549,754.98747014927437,668.57589187940027,718.313820241136,609.81203631036533,411.95863136649831,418.48411409431151,569.92534137204325,622.01833354412827,643.49392843921589,630.35038108659728,4164.330080413114,822.63544751405732,1060.95442055579]
["MNE",2018,"MNE_2018_MICS",137,"Sanitation type","Improved latrines","s_lat",8.2721799667271849,1.222359923514144,0.33382186815930348,0.42987644073033071,0.9204901428605049,6.8896308126311743,0.38187346290592722,0,0.67381482622298916,0.76589434594095529,10.833173736006289,2.801637763512586,0.66549084661297531,1.107594050657996,0.64826742161617656,"CENTRE","NORTH","SOUTH",2.702252210982961,2.455419666882134,0.71013252942180005,208.1956421277913,30.777444079100398,8.4052461462563368,10.826970022808331,23.163035661575051,115.6566775986232,6.3859481496993382,0,11.30944495808339,12.835290575716609,91.187680427995176,23.62371563109701,5.6006433287314339,9.3203860185125116,5.4485513490729058,188.5082455871088,74.579350348923924,18.28074210149877]
["MNE",2018,"MNE_2018_MICS",138,"Sanitation type","Unimproved facilities","",8.2812336296526219,3.3051145048071038,1.4416675964418391,0.91375702893634636,0.377961583956897,1.7475895002174939,0.63473120566219365,0.59764831165263743,0.15326838085378519,0.56752781615173742,16.93343833474793,7.292404592542348,7.0116200827404231,3.1520335156232679,1.055217958952605,"CENTRE","NORTH","SOUTH",0.43090998507825412,10.451344500399831,0.5035977228325782,208.42350626686371,83.218514358915172,36.299512299753722,23.01410131622082,9.5109520898212701,29.336897853921911,10.614407551418269,10.0035006049473,2.5724876473804521,9.5109520898212701,142.53634263096441,61.490352037922321,59.008449837984358,26.524311042881681,8.8688850343327239,30.060142041116499,317.44246966236972,12.96397462808835]
["MNE",2018,"MNE_2018_MICS",139,"Sanitation type","Open defecation","",0.41620268366770752,0,0,0,0,0.23870428289743889,0,0,0,0,0.76839392787227889,0,0,0,0,"CENTRE","NORTH","SOUTH",0.057442125644872201,0.1579474667902187,0.064892936365301995,10.475060423013421,0,0,0,0,4.0071442199580121,0,0,0,0,6.4679162030554043,0,0,0,0,4.0071442199580121,4.7973955822510703,1.6705206208043331]
["MNE",2018,"MNE_2018_MICS",140,"Septic tank emptying practices","Not emptied/treated and disposed in situ","s_sep_nemp",70.662173376526241,73.324066148639005,73.53961916582719,70.664215042824793,64.820643380756067,61.686142374512173,78.283430026405355,76.427453102573224,68.153275944713371,64.009183117289282,82.247661605296713,74.662362959656164,69.411523832051174,74.763238115267455,63.312037484288687,"CENTRE","NORTH","SOUTH",72.75662657966015,79.879053763783887,57.632774585204118,878.04307805673022,974.27596025685239,1020.838405785115,869.73659395533969,552.03653047011653,465.72264574600888,523.38414049282585,548.98895809409635,412.28437292037597,263.69135471886062,344.19339803221311,425.51972697425441,430.96140401331519,481.09689797629972,399.08766955590312,3029.826086150631,657.11341139969807,607.99107097381773]
["MNE",2018,"MNE_2018_MICS",141,"Septic tank emptying practices","Emptied and buried on site","s_sep_ebo",1.213239985788378,1.592259400022479,1.732179055978007,3.1394080546648881,0.94875171958888127,0.49182717762285377,0,1.6288438588675771,2.3743503807751578,0,1.4364098587841909,1.4465981520556941,3.5916501826453491,2.0040125291823472,4.4054039582382387,"CENTRE","NORTH","SOUTH",0.78870494763188315,6.2873894913307504,2.1262677639289329,15.075632699078749,21.156765267084069,24.045200751605829,38.639898098994699,8.0799199181489829,3.713233565841362,0,11.70021054839483,14.363323615217579,0,6.0111470722963736,8.2445294563850826,22.29979288716876,12.895698950449569,27.769480639158779,32.844277379941012,51.722294678960523,22.4308446760108]
["MNE",2018,"MNE_2018_MICS",142,"Septic tank emptying practices","Emptied and discharged locally","s_sep_edl",3.5286861401412368,1.9982406607428049,1.411218635980098,3.8684664385720451,1.6855106586688,3.893782762387255,0.1072856082701638,1.35673989226314,2.9965629811154102,2.7002464619438,2.275815605337367,3.9013644709992028,2.1937266435162841,1.6350491945909409,4.2743520730245237,"CENTRE","NORTH","SOUTH",2.2941121426409432,5.3788303552951993,1.153920627127714,43.84719987985811,26.551143994428081,19.58979661452485,47.613163495485942,14.354431050867371,29.39757197085607,0.71728571235048733,9.7456501508508317,18.127317762212598,11.123898368145969,9.5239267744161697,22.23486477950982,13.62038264134241,10.521442294187009,26.94339458129296,95.534402034406611,44.248165164304623,12.173167836453089]
["MNE",2018,"MNE_2018_MICS",143,"Septic tank emptying practices","Emptied and removed offsite","s_sep_ero",24.59590049754415,23.085433790595861,23.316983142214749,22.32791046393827,32.545094240986238,33.928247685477693,21.609284365324509,20.586963146296061,26.475810693396092,33.29057042076694,14.040112930581749,19.989674417288931,24.803099341787181,21.597700160959239,28.008206484448561,"CENTRE","NORTH","SOUTH",24.160556330067109,8.4547263895901139,39.0870370237392,305.62688845365938,306.74217014485959,323.6741251670469,274.81237547571533,277.16603803335249,256.15401886656781,144.47446567422409,147.879001447794,160.16197105683091,137.1433782794918,58.75564221538589,113.92622016189389,153.99717404392371,138.97988921827951,176.54983631024251,1006.12531484814,69.551576271093737,412.34470615540101]
["MNE",2018,"MNE_2018_MICS",144,"Latrine emptying practices","Not emptied/treated and disposed in situ","s_lat_nemp",86.650788780807247,80.850393101132582,100,79.177549370551134,100,97.422575241078931,0,0,0,100,73.026532247405285,90.570863250636563,52.718484285330682,100,38.952640444110379,"CENTRE","NORTH","SOUTH",96.295210767168442,62.8853393872715,100,174.8417235720049,18.805133276339021,4.9236672170020288,5.2832670257092733,3.834050652746591,105.0004469488762,0,0,0,3.834050652746591,65.403509692284473,20.67683722293506,2.5660629842482461,9.3203860185125116,0.88654822419879076,148.2303839846993,45.876721062951951,13.580736696150581]
["MNE",2018,"MNE_2018_MICS",145,"Latrine emptying practices","Emptied and buried on site","s_lat_ebo",6.4877600450425552,19.149606898867411,0,0,0,0,0,0,0,0,14.616620168536739,9.4291367493634404,47.281515714669297,0,0,"CENTRE","NORTH","SOUTH",1.536183495970654,20.808169655225381,0,13.09083465202198,4.4540403096402317,0,0,0,0,0,0,0,0,13.09083465202198,2.1526208177994,2.3014194918408322,0,0,2.364697762895644,15.180177198766559,0]
["MNE",2018,"MNE_2018_MICS",146,"Latrine emptying practices","Emptied and discharged locally","s_lat_edl",5.4847332087823899,0,0,0,0,0,0,0,0,0,12.35684758405797,0,0,0,0,"CENTRE","NORTH","SOUTH",1.265996443019858,12.498687030863881,0,11.066953008147699,0,0,0,0,0,0,0,0,0,11.066953008147699,0,0,0,0,1.9487899489190259,9.118163059228678,0]
["MNE",2018,"MNE_2018_MICS",147,"Latrine emptying practices","Emptied and removed offsite","s_lat_ero",1.3767179653678341,0,0,20.822450629448859,0,2.5774247589210639,0,0,0,0,0,0,0,0,61.047359555889628,"CENTRE","NORTH","SOUTH",0.90260929384104638,3.8078039266392638,0,2.7779059524357321,0,0,1.389416162530829,0,2.7779059524357321,0,0,0,0,0,0,0,0,1.389416162530829,1.389416162530829,2.7779059524357321,0]
["MNE",2018,"MNE_2018_MICS",148,"Shared among improved sanitation facilities","Yes","",3.9310550896560028,0.51237925320845257,0.38783656349247569,0.42077889297002019,0,4.9670560569665216,0,0.5158979339751496,0.1169363156906431,0,2.7187723496911742,0.66070049735261815,0,1.160462517737276,0,"CENTRE","NORTH","SOUTH",1.1802195712948651,0.31751055209463058,1.5626175766293979,98.937467744002404,12.901047808879589,9.7652733137206909,10.59783702655805,0,83.382290955510911,0,8.6351541433133061,1.9626828832447409,0,22.885125838617341,5.571098758753755,0,9.7652733137206909,0,82.331737906668536,9.6438629304513093,40.226025056040889]
["MNE",2018,"MNE_2018_MICS",149,"Shared among improved sanitation facilities","No","",87.311136539166569,96.182506241984399,98.170495840065712,98.665464078093649,99.622038416043125,93.046650159918514,99.365268794337794,98.886453754372212,99.72979530345556,99.432472183848262,79.579395387688606,91.86669630841044,92.988379917259579,95.68750396663944,98.944782041047404,"CENTRE","NORTH","SOUTH",98.309647049441494,89.073197480715365,97.868891764172773,2197.4616376571571,2421.7512782487311,2471.8188367516318,2485.0117862823831,2506.869678515724,1561.9801280858089,1661.653704797747,1655.1719140936871,1673.885148814009,1666.3455996317541,669.85545068354361,774.63001742141114,782.57237088043485,805.20879792303197,831.6100851241988,6858.0493760931768,2705.452469576574,2519.41137178586]
["MNE",2018,"MNE_2018_MICS",150,"Shared among improved sanitation facilities","DK/missing","",8.7578083711774823,3.3051145048071038,1.4416675964418391,0.91375702893634636,0.377961583956897,1.986293783114933,0.63473120566219365,0.59764831165263743,0.15326838085378519,0.56752781615173742,17.701832262620211,7.4726031942369122,7.0116200827404231,3.1520335156232679,1.055217958952605,"CENTRE","NORTH","SOUTH",0.5101333792636179,10.609291967190041,0.56849065919788011,220.41802098157561,83.218514358915172,36.299512299753722,23.01410131622082,9.5109520898212701,33.344042073879933,10.614407551418269,10.0035006049473,2.5724876473804521,9.5109520898212701,149.00425883401979,63.009806329620801,59.008449837984358,26.524311042881681,8.8688850343327239,35.586740552772987,322.23986524462077,14.63449524889268]
["MNE",2018,"MNE_2018_MICS",151,"Shared among all sanitation facilities","Yes","",4.0197335473644404,0.51237925320845257,0.38783656349247569,0.42077889297002019,0,4.978941002382145,0,0.5158979339751496,0.1169363156906431,0,2.8953237812806241,0.71546173677138114,0,1.160462517737276,0,"CENTRE","NORTH","SOUTH",1.181155322632055,0.34582035963806551,1.5988671595222741,100.6871948231896,12.901047808879589,9.7652733137206909,10.59783702655805,0,83.382290955510911,0,8.6351541433133061,1.9626828832447409,0,24.183971279788569,6.0219803967696661,0,9.7652733137206909,0,82.331737906668536,10.487136591826079,41.132478473853247]
["MNE",2018,"MNE_2018_MICS",152,"Shared among all sanitation facilities","No","",95.980266452635547,99.487620746791521,99.612163436507529,99.579221107029966,100,95.021058997617843,100,99.48410206602486,99.883063684309363,100,97.104676218719362,99.284538263228626,100,98.839537482262713,100,"CENTRE","NORTH","SOUTH",98.818844677367935,99.654179640361946,98.401132840477771,2404.135416844832,2504.969792607646,2508.1183490513849,2508.0258875986028,2516.3806306055449,1591.3170259397309,1672.268112349165,1665.1754146986341,1676.457636461389,1675.8565517215759,811.0929478733367,835.66948782131783,841.5808207184192,831.73310896591363,840.47897015853141,6888.1095181342926,3022.0516655775682,2531.4688929961349]
["MNE",2018,"MNE_2018_MICS",153,"Type of toilet facility","FLUSH/POUR FLUSH: FLUSH TO PIPED SEWER SYSTEM","",33.658787108353273,42.65545496286213,43.092989920702117,49.594767137785567,64.85782411180459,46.149716417887582,59.003209920840092,56.487470302569541,62.840418354839798,74.084603268347607,21.748726491727101,22.316066887349759,18.41218219247185,19.270358707016261,23.29756717786692,"CENTRE","NORTH","SOUTH",37.114021971899753,59.851179332393833,57.507609772418043,847.13011847573887,1074.0092623569101,1085.0313356008039,1249.1055713048711,1632.0697233816629,774.71827129342114,986.6918647686482,945.49324799586532,1054.726350428806,1241.5516776895399,183.06878199985439,188.17151346872279,154.9533940075753,162.15975677902449,195.8111526885279,2589.0622422913229,1817.881534644049,1480.4022341846151]
["MNE",2018,"MNE_2018_MICS",154,"Type of toilet facility","FLUSH/POUR FLUSH: FLUSH TO SEPTIC TANK","",49.371596611599209,52.817070608816572,55.131520614696782,49.061599392547841,33.843724161378027,44.974358986366219,39.980185410591822,42.914881385777903,36.332498438083498,24.58197456955973,49.716267509646393,67.589890756595253,73.910706878174764,76.47001372670249,74.998947441564241,"CENTRE","NORTH","SOUTH",59.695373706394172,27.084109033534201,41.213767038962438,1242.592799089326,1329.8656196216,1388.147528318292,1235.6770819812641,851.63691947248549,754.98747014927437,668.57589187940027,718.313820241136,609.81203631036533,411.95863136649831,418.48411409431151,569.92534137204325,622.01833354412827,643.49392843921589,630.35038108659728,4164.330080413114,822.63544751405732,1060.95442055579]
["MNE",2018,"MNE_2018_MICS",155,"Type of toilet facility","FLUSH/POUR FLUSH: FLUSH TO PIT LATRINE","",3.5842200490929081,0.22728873587594781,0.1955478471390634,0.035199709092342997,0,2.629997302133813,0,0,0,0,5.4099663929430619,0.16313486803791249,0.57837374097165506,0.58510715180030703,0.1054813095480033,"CENTRE","NORTH","SOUTH",0.89471666671277306,1.152924846395696,0.16734695156970811,90.208264042813937,5.7228368041718269,4.9236672170020288,0.88654822419879076,0,44.149934638075777,0,0,0,0,45.538112707103288,1.375571025717603,4.8674824760890782,4.9236672170020288,0.88654822419879076,62.415147059207747,35.018203692449042,4.3079655365297853]
["MNE",2018,"MNE_2018_MICS",156,"Type of toilet facility","FLUSH/POUR FLUSH: FLUSH TO OPEN DRAIN","",7.384847585801638,3.059944752582255,1.298624601346211,0.81161840369317684,0,1.0191039877765331,0.4876332749821306,0.38247126512788099,0,0,15.55645901737291,7.0013981950702009,7.0116200827404231,3.1520335156232679,1.055217958952605,"CENTRE","NORTH","SOUTH",0.015617794449079601,10.02353201079908,0.40827765441919689,185.86310879671751,77.045456658124237,32.6978561533004,20.441613668840368,0,17.107764488287319,8.1545357627300916,6.4018444584939784,0,0,130.94569034303731,59.036554309234937,59.008449837984358,26.524311042881681,8.8688850343327239,1.0894923203578959,304.44836605722372,10.510176899400969]
["MNE",2018,"MNE_2018_MICS",157,"Type of toilet facility","FLUSH/POUR FLUSH: FLUSH TO DK WHERE","",0.25501355962265038,0.29859635261820711,0.13827402102024011,0.16494273415877139,0.76812644215025261,0.46930924969917409,0.38187346290592722,0,0.67381482622298916,0.53711279248353416,0.19321568808352901,0.094194414370069396,0.0871171056413204,0,0.37747368762181782,"CENTRE","NORTH","SOUTH",0.49562954487383309,0.0535463633148325,0.1825761070455891,6.4182249431811096,7.5182704931211468,3.481578929254308,4.154286834568226,19.328985008828461,7.8783246973113048,6.3859481496993382,0,11.30944495808339,9.0012399229700186,1.626383075541014,0.79425759036255228,0.73316085264235609,0,3.1725869623432859,34.574957728064049,1.626383075541014,4.700005405348195]
["MNE",2018,"MNE_2018_MICS",158,"Type of toilet facility","PIT LATRINE: VENTILATED IMPROVED PIT LATRINE","",1.085657529689948,0.19554883983594309,0,0,0,1.1888599692513719,0,0,0,0,0.47154574894555068,0.98682316967733796,0,0,0,"CENTRE","NORTH","SOUTH",0.35666930887875581,0.24253309624131711,0,27.32401464110033,4.9236672170020288,0,0,0,19.957469117434972,0,0,0,0,3.969211988090795,8.321000752576591,0,0,0,24.881136334436999,7.3665455236653576,0]
["MNE",2018,"MNE_2018_MICS",159,"Type of toilet facility","PIT LATRINE: PIT LATRINE WITH SLAB","",3.3472888283216831,0.50092599518404657,0,0.2297339974792163,0,2.6014642915468151,0,0,0,0,4.7584459060341482,1.557485311427266,0,0.52248689885768906,0.16531242444635549,"CENTRE","NORTH","SOUTH",0.95523669051759996,1.0064153609302879,0.21127218626688821,84.245138500696058,12.612669564805399,0,5.7861349640413122,0,43.670949145801153,0,0,0,0,40.053972657260069,13.132886262440261,0,4.3967188015104828,1.389416162530829,66.637004465400068,30.56821805726851,5.4387205068742048]
["MNE",2018,"MNE_2018_MICS",160,"Type of toilet facility","PIT LATRINE: PIT LATRINE WITHOUT SLAB/OPEN PIT","",0.46052818722612232,0.0974552661438923,0,0,0,0,0,0,0,0,1.376979317375016,0.29100639747214702,0,0,0,"CENTRE","NORTH","SOUTH",0,0.38160583923856839,0.095320068413381198,11.590652287926989,2.4537977286873849,0,0,0,0,0,0,0,0,11.590652287926989,2.4537977286873849,0,0,0,0,11.590652287926989,2.4537977286873849]
["MNE",2018,"MNE_2018_MICS",161,"Type of toilet facility","COMPOSTING TOILET","",0,0,0,0,0.15236370071025229,0,0,0,0,0.2287815534574211,0,0,0,0,0,"CENTRE","NORTH","SOUTH",0,0,0.14893728453961491,0,0,0,0,3.834050652746591,0,0,0,0,3.834050652746591,0,0,0,0,0,0,0,3.834050652746591]
["MNE",2018,"MNE_2018_MICS",162,"Type of toilet facility","NO FACILITY/BUSH/FIELD","",0.41620268366770752,0,0,0,0,0.23870428289743889,0,0,0,0,0.76839392787227889,0,0,0,0,"CENTRE","NORTH","SOUTH",0.057442125644872201,0.1579474667902187,0.064892936365301995,10.475060423013421,0,0,0,0,4.0071442199580121,0,0,0,0,6.4679162030554043,0,0,0,0,4.0071442199580121,4.7973955822510703,1.6705206208043331]
["MNE",2018,"MNE_2018_MICS",163,"Type of toilet facility","NO RESPONSE","",0.43585785662486171,0.14771448608095711,0.1430429950956276,0.1021386252431695,0.377961583956897,0.72848551244096149,0.14709793068006299,0.2151770465247565,0.15326838085378519,0.56752781615173742,0,0,0,0,0,"CENTRE","NORTH","SOUTH",0.4152921906291745,0.046206650362186102,0,10.969745182219221,3.719259972103548,3.6016561464533279,2.5724876473804521,9.5109520898212701,12.229133365634601,2.4598717886881731,3.6016561464533279,2.5724876473804521,9.5109520898212701,0,0,0,0,0,28.970649720758601,1.403451317219218,0]
["MNE",2018,"MNE_2018_MICS",222,"Hygiene ladder","Basic","h_bas",99.503233520723228,99.969356469602516,99.850929107955793,100,100,99.871216582983251,100,99.775755294752884,100,100,98.77150320953443,99.908496854611926,100,100,100,"CENTRE","NORTH","SOUTH",100,99.464789725381962,99.970027854527615,2504.3144225541678,2517.0992759001738,2514.1301907886109,2518.6237246251621,2516.3806306055449,1676.544565572895,1672.268112349165,1670.057137265452,1678.420319344634,1675.8565517215759,831.4040270699204,842.43935799343365,841.5808207184192,841.49838227963448,840.47897015853141,6975.9678545526194,3021.0800623465848,2573.5003275744398]
["MNE",2018,"MNE_2018_MICS",223,"Hygiene ladder","Limited","h_lim",0.49676647927673329,0.030643530397474798,0.14907089204421711,0,0,0.12878341701674489,0,0.22424470524712839,0,0,1.2284967904655639,0.091503145388067406,0,0,0,"CENTRE","NORTH","SOUTH",0,0.53521027461805837,0.0299721454723859,12.502703828565361,0.77156451635219359,3.7534315764949082,0,0,2.1618955423050288,0,3.7534315764949082,0,0,10.34080828626033,0.77156451635219359,0,0,0,0,16.25613540506027,0.77156451635219359]
["MNE",2018,"MNE_2018_MICS",225,"Observed handwashing place","Fixed","",99.541566568780112,100,100,100,100,99.63969636648136,100,100,100,100,99.407771608168488,99.938305270514476,100,100,100,"CENTRE","NORTH","SOUTH",99.913370961151116,99.875022453125567,99.934929839827873,2492.3418894381002,2504.4304650178942,2517.883622365106,2518.6237246251621,2503.575029718309,1665.6474177880759,1661.311036089591,1673.8105688419471,1672.625954686835,1670.0765508025679,828.36555929724955,842.69070581215101,841.5808207184192,841.49838227963448,839.24773484810203,6946.7143048742118,3024.5502910497939,2565.5901352405499]
["MNE",2018,"MNE_2018_MICS",226,"Observed handwashing place","Mobile","",0.45843343121986802,0,0,0,0,0.36030363351864753,0,0,0,0,0.59222839183149711,0.061694729485530099,0,0,0,"CENTRE","NORTH","SOUTH",0.086629038848884898,0.1249775468744312,0.065070160172101696,11.478349030790421,0,0,0,0,6.0230895785013896,0,0,0,0,4.9350427546541731,0.52021669763485501,0,0,0,6.0230895785013896,3.7847388314846961,1.6705206208043331]
["MNE",2018,"MNE_2018_MICS",227,"Water / Soap","Water and soap","",99.503233520723228,99.969356469602516,99.850929107955793,100,100,99.871216582983251,100,99.775755294752884,100,100,98.77150320953443,99.908496854611926,100,100,100,"CENTRE","NORTH","SOUTH",100,99.464789725381962,99.970027854527615,2504.3144225541678,2517.0992759001738,2514.1301907886109,2518.6237246251621,2516.3806306055449,1676.544565572895,1672.268112349165,1670.057137265452,1678.420319344634,1675.8565517215759,831.4040270699204,842.43935799343365,841.5808207184192,841.49838227963448,840.47897015853141,6975.9678545526194,3021.0800623465848,2573.5003275744398]
["MNE",2018,"MNE_2018_MICS",228,"Water / Soap","Water only","",0.49676647927673329,0.030643530397474798,0.14907089204421711,0,0,0.12878341701674489,0,0.22424470524712839,0,0,1.2284967904655639,0.091503145388067406,0,0,0,"CENTRE","NORTH","SOUTH",0,0.53521027461805837,0.0299721454723859,12.502703828565361,0.77156451635219359,3.7534315764949082,0,0,2.1618955423050288,0,3.7534315764949082,0,0,10.34080828626033,0.77156451635219359,0,0,0,0,16.25613540506027,0.77156451635219359]
["MNE",2018,"MNE_2018_MICS",231,"Place where household members wash their hands","IN DWELING","",90.315107970088633,98.486929815727393,99.615500794539884,99.575118097196565,99.041767698713642,93.277580025921338,98.164756812490822,100,98.98109337695486,99.655101690352311,85.984017150495788,97.589040074603545,99.69723642828437,99.152316567573195,98.580284321233563,"CENTRE","NORTH","SOUTH",97.147119696711755,96.807669022807204,98.820422656834566,2273.066105102248,2479.77368745169,2508.2023798427008,2507.9225482195161,2492.2678585797689,1565.8567626670431,1641.577925740389,1673.8105688419471,1661.3187835482961,1670.0765508025679,723.76602359607114,822.88144508150913,839.03282056673834,834.36513990891046,828.5465584424561,6776.9518416663686,2940.3743734293289,2543.9063641002131]
["MNE",2018,"MNE_2018_MICS",232,"Place where household members wash their hands","IN YARD/PLOT","",8.7124241978996295,0.97927094473696952,0.38449920546013888,0.42488190280343358,0.44934263922616879,5.9444969941165384,1.18002072774568,0,0.6736793524374235,0,12.426513511890789,2.3492651959109119,0.30276357171564461,0.84768343242678479,1.273223576745488,"CENTRE","NORTH","SOUTH",2.4335327620102518,2.7713730762757018,0.84232637612831585,219.2757843358514,24.656777566203591,9.6812425224047942,10.7011764056461,11.30717113853906,99.790655121033183,19.733110349201571,0,11.30717113853906,0,104.5995357011787,19.809260730641729,2.5480001516809221,7.133242370723873,10.7011764056461,169.76246320784171,84.175917620465199,21.683771140338202]
["MNE",2018,"MNE_2018_MICS",233,"Place where household members wash their hands","MOBILE OBJECT (BUCKET/JUG/KETTLE)","",0.45606607291676932,0,0,0,0,0.35879349475429573,0,0,0,0,0.58628726276246534,0.061694729485530099,0,0,0,"CENTRE","NORTH","SOUTH",0.086340558100058196,0.1246071750070443,0.064892936365301995,11.478349030790421,0,0,0,0,6.0230895785013896,0,0,0,0,4.9350427546541731,0.52021669763485501,0,0,0,6.0230895785013896,3.7847388314846961,1.6705206208043331]
["MNE",2018,"MNE_2018_MICS",234,"Place where household members wash their hands","NO PLACE FOR HANDWASHING","",0.51640175909492247,0.53379923953556829,0,0,0.50888966206016817,0.41912948520780929,0.65522245976348559,0,0.34522727060771691,0.34489830964769908,1.003182074850965,0,0,0,0.14649210202095991,"CENTRE","NORTH","SOUTH",0.33300698317790661,0.29635072591007761,0.27235803067184339,12.99688791384272,13.44037539863124,0,0,12.805600887236089,7.0359537486223713,10.95707625957461,0,5.7943646577988046,5.7800009190079322,8.4442333042769757,0,0,0,1.231235310429349,23.23046009990621,9.0011678703665492,7.0112362294372819]
["MNE",2018,"MNE_2018_MICS",261,"Private place to wash and change","Yes","m_place",96.316559136090916,96.501922281671668,97.997947291043303,96.560527778011334,98.940799406009972,95.718832201766915,95.309139305684326,98.522212107959504,95.476176268352518,99.757141892600856,98.064618492431663,97.802153343380922,98.100384497726623,97.790998315666073,98.081617076695153,"CENTRE","NORTH","SOUTH",97.760457338169715,98.201116486950824,95.187858810507137,381.61069681251269,348.31825413579219,378.44721532333591,439.01401455791029,546.2360543395248,248.8731506554499,215.75337673881219,270.12372050879787,337.85117487639468,356.79556952404198,126.7277562565332,140.84071649475561,132.39061890390269,118.79760884108821,145.4725423692999,1228.3356829518791,479.17083853799801,386.1197136792004]
["MNE",2018,"MNE_2018_MICS",262,"Private place to wash and change","No","",3.6834408639090941,3.4980777183283189,2.0020527089567008,3.4394722219886571,1.0592005939900251,4.281167798233132,4.6908606943156439,1.477787892040483,4.5238237316474894,0.2428581073991512,1.9353815075683141,2.197846656619074,1.89961550227342,2.209001684333908,1.9183829233048459,"CENTRE","NORTH","SOUTH",2.239542661830253,1.798883513049145,4.8121411894928823,14.593964395654201,12.626114536071279,7.7315014607908346,15.637616559087469,5.8476741312850944,11.131223542144999,10.618803631873829,4.0517316347242192,16.007963686931099,0.86861647295689148,2.5010708217199471,3.165025383204235,2.563611481372472,2.6835201863642721,2.845304241596919,28.13929312445088,8.7776244529203407,19.519953505517659]
["MNE",2018,"MNE_2018_MICS",264,"Use of menstrual materials","Materials reusable","",3.6022510740160172,2.6664994822947401,4.3764103565506103,3.979328105659659,4.990731243385464,2.5745665229428552,1.037110717357,5.4163682077798567,3.732508713329445,6.0812956999416894,5.8596745999976703,5.3026664915144597,1.9031232158176961,3.290107719120908,3.8792296906217039,"CENTRE","NORTH","SOUTH",3.986782603892125,0.8379565514665035,7.9631949431702491,14.28172118104362,9.6245797220072564,16.944705582846289,18.096450483347901,27.776376258304769,6.6939855762783438,2.347730143739104,14.904733680461661,13.2119224509836,22.022786316084101,7.587735604765272,7.6361442204193812,2.5683452891902689,3.9968600034074431,5.7535899422206658,50.311383255953949,4.0897164089611246,32.322733562634753]
["MNE",2018,"MNE_2018_MICS",265,"Use of menstrual materials","Materials not reusable","",92.299649201360353,94.796569603505247,92.917576326767616,92.335415190330778,92.406662604251494,93.302482064403264,97.884920387748892,91.772901979269534,93.441958315809799,90.108937105894299,90.037261846379948,89.843551171543552,94.219883629925761,92.677909649301967,96.120770309378329,"CENTRE","NORTH","SOUTH",93.403630192318403,94.707306561770594,88.96897335930008,365.93725087917142,342.16287967795569,359.76081904021459,419.90587970734708,514.29782612953784,242.59053460237479,221.58422853585739,252.5401912520272,330.75553247276639,326.32023913449888,116.58991055025859,129.37987239408579,127.1537188226681,112.58617100101431,142.56425666867619,1178.7113326709691,462.22686011145498,361.1264626518041]
["MNE",2018,"MNE_2018_MICS",266,"Use of menstrual materials","No materials used","m_nomat",3.8994496967233681,2.394358264174048,1.8615475150442451,3.6852567040095749,1.7984655049742571,4.122951412653916,1.077968894894086,2.445868164368949,2.8255329708607881,2.5739128889420542,3.4948494158174941,4.4964299530551743,2.198200679298584,4.0319826315770868,0,"CENTRE","NORTH","SOUTH",1.9958451983903049,4.2415896533585506,3.0033071490466572,15.46001435874944,8.6423013203656058,7.2075906967201409,16.759127091753061,10.00952608296738,10.71985401894171,2.440221691089532,6.7305272110334506,10.00150980502616,9.3211605464159693,4.5255061340269744,6.4751173119199041,2.9665648090712931,4.8980980230306326,0,25.18665868506109,20.701429895215298,12.190470970279231]
["MNE",2018,"MNE_2018_MICS",267,"Use of menstrual materials","DK/not sure/missing","",0.19865002790021891,0.14257265002593131,0.84446580163752771,0,0.80414064738881796,0,0,0.36486164858171721,0,1.2358543052219439,0.60821413780483879,0.35735238388685692,1.6787924749580521,0,0,"CENTRE","NORTH","SOUTH",0.61374200539910273,0.2131472334042884,0.064524548483048796,0.78758094668690681,0.51460795153484318,3.269625838928047,0,4.4755191368142828,0,0,1.0040243745824959,0,4.4755191368142828,0.78758094668690681,0.51460795153484318,2.2656014643455511,0,0,7.7451449757423294,1.040282740737102,0.26190615748464752]
["MNE",2018,"MNE_2018_MICS",268,"Use of menstrual materials with private place to wash and change","Materials reusable","m_reuse",3.7476469437757189,2.4505780116633602,4.300519054336851,3.2792554252520252,5.0850499591958016,2.6897178577313752,1.0881545305227049,5.5177433704776062,2.8154002605208248,6.1723822258953627,6.0123696190616753,4.6568412987482253,1.38436230381178,3.3644279900902019,3.9551037250826839,"CENTRE","NORTH","SOUTH",4.1034671684438697,0.85535558423822322,6.9290298776977703,14.28172118104362,8.5231996771548406,16.177761982917751,14.396390890006989,27.776376258304769,6.6939855762783438,2.347730143739104,14.904733680461661,9.5118628576426847,22.022786316084101,7.587735604765272,6.5347641755669654,1.8014016892617339,3.9968600034074431,5.7535899422206658,50.311383255953949,4.0897164089611246,26.754350324512881]
["MNE",2018,"MNE_2018_MICS",269,"Use of menstrual materials with private place to wash and change","Materials not reusable","m_single",93.467971290098433,95.174325227433826,94.017671632195231,93.145781489341445,93.082495737678741,94.951368972493441,97.780821831296322,91.990610505903263,94.503040451816574,91.215152445891562,90.401710020981,90.728823294148611,97.30612521521158,92.615802433130725,96.044896274917349,"CENTRE","NORTH","SOUTH",94.189342801132682,95.136166101211728,90.272562986443333,356.19243897561302,331.01977337227839,353.67719445863821,408.92303470769679,508.45015199825269,236.30846355232569,210.96542490398349,248.48845961730299,319.27963246037677,325.45162266154199,114.0888397285387,127.3162270557339,126.6196124060514,110.02535869954561,139.71895242707919,1154.8273520344201,454.87507974392889,348.56016173413087]
["MNE",2018,"MNE_2018_MICS",270,"Use of menstrual materials with private place to wash and change","No materials used","",2.7843817661257879,2.3750967609028319,1.6818093134678891,3.5749630854065408,1.8324543031254661,2.3589131697751529,1.1310236381809351,2.4916461236192089,2.681559287662632,2.612465328213073,3.5859203599573428,4.6143354071032006,1.3095124809766929,4.0197695767790567,0,"CENTRE","NORTH","SOUTH",1.707190030423352,4.0084783145500706,2.7984071358588358,10.610861866653501,8.260673134824243,6.3266574174343093,15.694588960206589,10.00952608296738,5.8707015268457647,2.440221691089532,6.7305272110334506,9.0596795583752829,9.3211605464159693,4.5255061340269744,6.4751173119199041,1.7040033442440989,4.775390138135049,0,20.931346197158639,19.165759644370929,10.805201620556449]
["MNE",2018,"MNE_2018_MICS",274,"Participation in (all) activities during menstruation","Yes","m_participate",92.993352279241648,92.147141333240015,96.842732845432622,91.916013265717638,92.134160154920664,93.460679078099744,93.028661386326888,94.562320371766489,92.482954067724748,92.092524476471056,92.271281585007415,93.045064531408912,96.165186544999315,94.878730739944189,90.229033963308567,"CENTRE","NORTH","SOUTH",92.404761396884709,96.267064380476555,91.414104924618229,368.44399634408649,332.59991753443302,374.418698001709,417.99860140310579,512.78118854782986,243.00185375783559,210.59100914989071,259.68915598592469,327.36095506411482,333.50359658937708,119.2410949223773,133.99023545928179,129.7789874003679,115.2597533098008,133.825760192194,1165.591143418641,469.83938743641397,370.81187097611019]
["MNE",2018,"MNE_2018_MICS",275,"Participation in (all) activities during menstruation","No","",6.7659979462568716,7.8528586667600067,3.1572671545674118,7.6373869644107293,7.7911088294794952,6.1726095437921078,6.9713386136730833,5.4376796282335116,7.5170459322752778,7.7926241630578801,7.7287184149925174,6.9549354685911506,3.834813455000742,5.121269260055767,8.4016341133279511,"CENTRE","NORTH","SOUTH",7.4342295649738794,3.5375766542224012,8.4833601381458159,26.807199240318571,28.344451137430621,12.20679985501301,34.731892257653953,43.362136681642248,16.049054815997678,15.78117122079532,14.93307723019274,26.608009664661381,28.22018616628409,9.9877321558757917,10.015506418678051,5.1752429849072286,6.2213757176516058,12.46112279701453,93.775169245409728,17.26543609619296,34.411873830455718]
["MNE",2018,"MNE_2018_MICS",276,"Participation in (all) activities during menstruation","DK/not sure/missing/no such activity","",0.24064977450144601,0,0,0.4465997698716494,0.0747310155998549,0.36671137810822713,0,0,0,0.1148513604710652,0,0,0,0,1.3693319233635359,"CENTRE","NORTH","SOUTH",0.16100903814131151,0.19535896530100541,0.10253493723598001,0.95346562376167143,0,0,2.0309636216883722,0.41592237815208849,0.95346562376167143,0,0,0,0.41592237815208849,0,0,0,0,2.0309636216883722,2.0309636216883722,0.95346562376167143,0.41592237815208849]
["MNE",2018,"MNE_2018_MICS",341,"Use of basic water sanitation and hygiene","Yes","wsh_bas",84.73804100227791,93.506493506493499,96.395193591455268,97.196261682242991,98.341625207296843,95.274102079395078,97.97570850202429,97.477064220183479,99.328859060402692,98.563218390804593,74.137931034482762,87.936507936507937,89.078498293515366,93.851132686084142,95.439739413680783,"CENTRE","NORTH","SOUTH",97.085020242914979,88.860918816865947,96.606786427145707,744,792,722,728,593,504,484,425,444,343,258,277,261,290,293,1199,1412,968]
["MNE",2018,"MNE_2018_MICS",342,"Use of basic water sanitation and hygiene","No","",15.2619589977221,6.4935064935064926,3.604806408544726,2.8037383177570092,1.6583747927031509,4.7258979206049148,2.024291497975709,2.522935779816514,0.67114093959731547,1.436781609195402,25.862068965517238,12.06349206349206,10.921501706484641,6.1488673139158578,4.5602605863192176,"CENTRE","NORTH","SOUTH",2.9149797570850202,11.139081183134049,3.3932135728542909,134,55,27,21,10,25,10,11,3,5,90,38,32,19,14,36,177,34]
["MNE",2018,"MNE_2018_MICS",343,"Use of basic water and sanitation","Yes","ws_bas",84.965831435079735,93.624557260920895,96.528704939919891,97.196261682242991,98.341625207296843,95.463137996219288,97.97570850202429,97.706422018348633,99.328859060402692,98.563218390804593,74.425287356321832,88.253968253968253,89.078498293515366,93.851132686084142,95.439739413680783,"CENTRE","NORTH","SOUTH",97.085020242914979,89.049716803020772,96.706586826347305,746,793,723,728,593,505,484,426,444,343,259,278,261,290,293,1199,1415,969]
["MNE",2018,"MNE_2018_MICS",344,"Use of basic water and sanitation","No","",15.03416856492027,6.3754427390791024,3.4712950600801071,2.8037383177570092,1.6583747927031509,4.536862003780719,2.024291497975709,2.2935779816513762,0.67114093959731547,1.436781609195402,25.574712643678161,11.74603174603175,10.921501706484641,6.1488673139158578,4.5602605863192176,"CENTRE","NORTH","SOUTH",2.9149797570850202,10.95028319697923,3.293413173652695,132,54,26,21,10,24,10,10,3,5,89,37,32,19,14,36,174,33]
["MNE",2018,"MNE_2018_MICS",345,"Use of basic water and hygiene","Yes","wh_bas",97.15261958997722,98.22904368358914,98.798397863818423,98.6648865153538,98.507462686567166,99.810964083175804,99.190283400809719,99.311926605504581,99.776286353467555,98.850574712643677,93.965517241379317,97.777777777777771,96.928327645051198,97.087378640776706,97.068403908794792,"CENTRE","NORTH","SOUTH",98.542510121457497,98.04908747640026,98.103792415169664,853,832,740,739,594,528,490,433,446,344,327,308,284,300,298,1217,1558,983]
["MNE",2018,"MNE_2018_MICS",346,"Use of basic water and hygiene","No","",2.8473804100227791,1.7709563164108619,1.201602136181575,1.3351134846461949,1.4925373134328359,0.1890359168241966,0.80971659919028338,0.68807339449541294,0.2237136465324385,1.149425287356322,6.0344827586206904,2.2222222222222219,3.071672354948805,2.912621359223301,2.9315960912052121,"CENTRE","NORTH","SOUTH",1.4574898785425101,1.950912523599748,1.896207584830339,25,15,9,10,9,1,4,3,1,4,21,7,9,9,9,18,31,19]
["MNE",2018,"MNE_2018_MICS",347,"Use of basic sanitation and hygiene","Yes","sh_bas",86.902050113895214,95.159386068476977,97.463284379172237,98.531375166889191,99.834162520729691,95.274102079395078,98.785425101214571,97.935779816513758,99.552572706935123,99.712643678160916,78.735632183908038,89.841269841269849,92.150170648464169,96.763754045307451,98.371335504885991,"CENTRE","NORTH","SOUTH",98.542510121457497,90.371302706104473,98.403193612774459,763,806,730,738,602,504,488,427,445,347,274,283,270,299,302,1217,1436,986]
["MNE",2018,"MNE_2018_MICS",348,"Use of basic sanitation and hygiene","No","",13.097949886104781,4.8406139315230234,2.5367156208277701,1.468624833110814,0.16583747927031511,4.7258979206049148,1.214574898785425,2.0642201834862388,0.44742729306487689,0.28735632183908039,21.264367816091951,10.15873015873016,7.8498293515358366,3.2362459546925559,1.628664495114007,"CENTRE","NORTH","SOUTH",1.4574898785425101,9.6286972938955309,1.5968063872255489,115,41,19,11,1,25,6,9,2,1,74,32,23,10,5,18,153,16]
["MNE",2018,"MNE_2018_MICS",349,"Use of basic water","Yes","",97.494305239179951,98.347107438016536,98.931909212283045,98.6648865153538,98.507462686567166,100,99.190283400809719,99.541284403669721,99.776286353467555,98.850574712643677,94.540229885057471,98.095238095238088,96.928327645051198,97.087378640776706,97.068403908794792,"CENTRE","NORTH","SOUTH",98.542510121457497,98.300818124606664,98.203592814371248,856,833,741,739,594,529,490,434,446,344,329,309,284,300,298,1217,1562,984]
["MNE",2018,"MNE_2018_MICS",350,"Use of basic water","No","",2.5056947608200448,1.6528925619834709,1.0680907877169561,1.3351134846461949,1.4925373134328359,0,0.80971659919028338,0.45871559633027531,0.2237136465324385,1.149425287356322,5.4597701149425291,1.9047619047619051,3.071672354948805,2.912621359223301,2.9315960912052121,"CENTRE","NORTH","SOUTH",1.4574898785425101,1.699181875393329,1.796407185628742,22,14,8,10,9,0,4,2,1,4,19,6,9,9,9,18,27,18]
["MNE",2018,"MNE_2018_MICS",351,"Use of basic sanitation","Yes","",87.129840546697039,95.277449822904373,97.596795727636859,98.531375166889191,99.834162520729691,95.463137996219288,98.785425101214571,98.165137614678898,99.552572706935123,99.712643678160916,79.022988505747122,90.158730158730165,92.150170648464169,96.763754045307451,98.371335504885991,"CENTRE","NORTH","SOUTH",98.542510121457497,90.560100692259283,98.502994011976057,765,807,731,738,602,505,488,428,445,347,275,284,270,299,302,1217,1439,987]
["MNE",2018,"MNE_2018_MICS",352,"Use of basic sanitation","No","",12.870159453302961,4.7225501770956324,2.4032042723631508,1.468624833110814,0.16583747927031511,4.536862003780719,1.214574898785425,1.834862385321101,0.44742729306487689,0.28735632183908039,20.977011494252871,9.8412698412698418,7.8498293515358366,3.2362459546925559,1.628664495114007,"CENTRE","NORTH","SOUTH",1.4574898785425101,9.4398993077407169,1.4970059880239519,113,40,18,11,1,24,6,8,2,1,73,31,23,10,5,18,150,15]
["MNE",2018,"MNE_2018_MICS",353,"Access to basic hygiene","Yes","",99.658314350797255,99.881936245572618,99.866488651535377,100,100,99.810964083175804,100,99.77064220183486,100,100,99.425287356321832,99.682539682539684,100,100,100,"CENTRE","NORTH","SOUTH",100,99.748269351793581,99.900199600798402,875,846,748,749,603,528,494,435,447,348,346,314,293,309,307,1235,1585,1001]
["MNE",2018,"MNE_2018_MICS",354,"Access to basic hygiene","No","",0.34168564920273348,0.1180637544273908,0.13351134846461951,0,0,0.1890359168241966,0,0.2293577981651376,0,0,0.57471264367816088,0.31746031746031739,0,0,0,"CENTRE","NORTH","SOUTH",0,0.25173064820641922,0.099800399201596807,3,1,1,0,0,1,0,1,0,0,2,1,0,0,0,0,4,1]