{"text_format":"1","workbook":"xlsx","n_sheets":8,"sheets":["Introduction","Water","Sanitation","Hygiene","WHS03","ENG12","MICS15","data_summary"],"not_rendered":{"charts":117,"images":76,"macros":1,"external_links":0,"defined_names":0,"comments":0,"pivot_tables":0},"unopened":[],"bounds":{"document_bytes":16777216,"sheet_cells":100000,"rows_first":2000,"rows_last":500,"rows_between":2000,"halvings":0,"cell_chars":16384,"cell_head_chars":4096},"cells_cut":0,"cells_raw":0,"read":"whole","date_system":"1900"}

{"sheet":"Introduction","index":0,"n_rows":55,"n_cols":12,"rows_kept":55,"cut":false,"hidden":false,"merged":[[112,0,112,1],[113,0,113,1],[207,0,207,1],[212,0,212,1],[213,0,213,1],[107,0,107,1],[1,0,1,1],[4,0,4,1],[5,0,5,1],[6,0,6,1],[7,0,7,1]]}
[]
[]
[]
[null,null,"Joint Monitoring Programme for Water Supply, Sanitation and Hygiene"]
[]
[null,null,"Estimates on household water, sanitation and hygiene \nby wealth quintile and sub-national region in"]
[null,null,{"$f":"+Water!B5","v":"Mexico"}]
[]
[null,null,"Updated May 2021"]
[]
[null,null,"Follow the links below to find the following information: "]
[]
[null,null,"JMP Estimates"]
[null,null,"WASH status and trends by wealth quintile \n(customized quintiles made without water and sanitation assets)"]
[null,null,"Water"]
[null,null,"Sanitation"]
[null,null,"Hygiene"]
[]
[null,null,"Data inputs"]
[null,null," customized wealth quintiles and subnational data:"]
[null,null,{"$f":"IF(INDIRECT(CONCATENATE(\"Water\",\"!B105\"))=0,\"\",INDIRECT(CONCATENATE(\"Water\",\"!B105\")))","v":"WHS03"}]
[null,null,{"$f":"IF(INDIRECT(CONCATENATE(\"Water\",\"!B106\"))=0,\"\",INDIRECT(CONCATENATE(\"Water\",\"!B106\")))","v":"ENG12"}]
[null,null,{"$f":"IF(INDIRECT(CONCATENATE(\"Water\",\"!B107\"))=0,\"\",INDIRECT(CONCATENATE(\"Water\",\"!B107\")))","v":"MICS15"}]
[null,null,{"$f":"IF(INDIRECT(CONCATENATE(\"Water\",\"!B108\"))=0,\"\",INDIRECT(CONCATENATE(\"Water\",\"!B108\")))","v":""}]
[null,null,{"$f":"IF(INDIRECT(CONCATENATE(\"Water\",\"!B109\"))=0,\"\",INDIRECT(CONCATENATE(\"Water\",\"!B109\")))","v":""}]
[null,null,{"$f":"IF(INDIRECT(CONCATENATE(\"Water\",\"!B110\"))=0,\"\",INDIRECT(CONCATENATE(\"Water\",\"!B110\")))","v":""}]
[null,null,{"$f":"IF(INDIRECT(CONCATENATE(\"Water\",\"!B111\"))=0,\"\",INDIRECT(CONCATENATE(\"Water\",\"!B111\")))","v":""}]
[null,null,{"$f":"IF(INDIRECT(CONCATENATE(\"Water\",\"!B112\"))=0,\"\",INDIRECT(CONCATENATE(\"Water\",\"!B112\")))","v":""}]
[null,null,{"$f":"IF(INDIRECT(CONCATENATE(\"Water\",\"!B113\"))=0,\"\",INDIRECT(CONCATENATE(\"Water\",\"!B113\")))","v":""}]
[null,null,{"$f":"IF(INDIRECT(CONCATENATE(\"Water\",\"!B114\"))=0,\"\",INDIRECT(CONCATENATE(\"Water\",\"!B114\")))","v":""}]
[null,null,{"$f":"IF(INDIRECT(CONCATENATE(\"Water\",\"!B115\"))=0,\"\",INDIRECT(CONCATENATE(\"Water\",\"!B115\")))","v":""}]
[null,null,{"$f":"IF(INDIRECT(CONCATENATE(\"Water\",\"!B116\"))=0,\"\",INDIRECT(CONCATENATE(\"Water\",\"!B116\")))","v":""}]
[]
[]
[]
[]
[]
[]
[]
[]
[]
[]
[]
[]
[]
[]
[]
[]
[]
[]
[]
[]
[]
[]
[null,null,null,null,null,null,null,null,null,null,null,{"$f":"+IF(ISNUMBER(M48), \"\", \"Insufficient data to estimate safely managed sanitation services at national level\")","v":"Insufficient data to estimate safely managed sanitation services at national level"}]

{"sheet":"Water","index":1,"n_rows":318,"n_cols":28,"rows_kept":318,"cut":false,"hidden":false,"merged":[[317,1,317,11],[6,9,6,16],[6,17,6,24],[6,1,6,8],[4,1,4,24],[117,1,117,11],[30,21,30,24],[32,1,33,2],[32,3,33,3],[30,17,30,20],[30,1,31,4],[30,5,30,8],[30,9,30,12],[30,13,30,16],[96,23,96,27],[35,1,36,2],[35,3,36,3],[38,1,39,2],[38,3,39,3],[96,0,97,2],[96,3,96,7],[96,8,96,12],[96,13,96,17],[96,18,96,22],[217,18,217,22],[98,0,99,1],[100,0,101,1],[196,0,197,2],[196,3,196,7],[196,8,196,12],[217,1,217,11],[3,1,3,24],[317,18,317,22],[117,18,117,22],[196,18,196,22],[296,23,296,27],[298,0,299,1],[300,0,301,1],[296,0,297,2],[296,3,296,7],[296,8,296,12],[296,13,296,17],[296,18,296,22],[196,23,196,27],[198,0,199,1],[200,0,201,1],[196,13,196,17]]}
["BGD"]
[]
[]
[null,"Summary of trends in use of drinking water by wealth quintile (%)"]
[null,{"$f":"IF(ISERROR(INDIRECT(CONCATENATE($B105,\"!A2\"))),\"\",INDIRECT(CONCATENATE($B105,\"!A2\")))","v":"Mexico"}]
[]
[null,{"$f":"B118","v":"National use of drinking water sources, 2000–2020"},null,null,null,null,null,null,null,{"$f":"B218","v":"Urban use of drinking water sources,  2000–2020"},null,null,null,null,null,null,null,{"$f":"B318","v":"Rural use of drinking water sources, 2000–2020"}]
[]
[]
[]
[]
[]
[]
[]
[]
[]
[]
[]
[]
[]
[]
[]
[]
[]
[]
[]
[]
[]
[]
[]
[null,{"$f":"IF(ISERROR(INDIRECT(CONCATENATE($B105,\"!A2\"))),\"\",INDIRECT(CONCATENATE($B105,\"!A2\")))","v":"Mexico"},null,null,null,"Poorest",null,null,null,"Poor",null,null,null,"Middle",null,null,null,"Rich",null,null,null,"Richest"]
[null,null,null,null,null,"Basic","Limited","Unimproved","Surface \n water","Basic","Limited","Unimproved","Surface \nwater","Basic","Limited","Unimproved","Surface \nwater","Basic","Limited","Unimproved","Surface \nwater","Basic","Limited","Unimproved","Surface \nwater"]
[null,"NATIONAL",null,"Estimate",{"$f":"C99","v":2000},{"$f":"E99","v":83.661535304580852},{"$f":"F99","v":1.4335387495366521},3.7105967460433931,11.194329199839103,{"$f":"J99","v":98.460710923781392},{"$f":"K99","v":0.11958742027403843},0.67149136070518978,0.74821029523937455,{"$f":"O99","v":99.50938057499485},{"$f":"P99","v":0.11479436272461432},0.30463996442256303,7.1185097857979163E-2,{"$f":"T99","v":99.80593817350568},{"$f":"U99","v":0},0.19406182649431969,0,{"$f":"Y99","v":99.959496795005421},{"$f":"Z99","v":0},1.633229543431014E-2,2.4170909560274012E-2]
[null,null,null,null,{"$f":"C100","v":2020},{"$f":"E100","v":96.529331907314543},1.6540281893254147,1.8166399033600413,0,{"$f":"J100","v":99.256034362048553},0.12055339621889499,0.62341224173255227,0,{"$f":"O100","v":99.809552352266763},0.11514064191639239,0,7.5307005816832043E-2,{"$f":"T100","v":99.757650837526811},0,0,0.24234916247318228,{"$f":"Y100","v":99.742566618822153},0,0.25743338117784731,0]
[]
[null,"URBAN",null,"Estimate",{"$f":"C199","v":2000},{"$f":"E199","v":98.277783105442609},{"$f":"F199","v":0.12512365611944265},1.1001187181748264,0.49697452026312305,{"$f":"J199","v":99.540536852536533},{"$f":"K199","v":6.8769550276852054E-2},0.27921867977707393,0.11147491740953974,{"$f":"O199","v":99.59991346524707},{"$f":"P199","v":6.6831867301765144E-2},0.33103214583094598,2.2225216202245157E-3,{"$f":"T199","v":99.853664577082455},{"$f":"U199","v":0},0.14633542291754509,0,{"$f":"Y199","v":99.990098489237766},{"$f":"Z199","v":0},0,9.901510762240065E-3]
[null,null,null,null,{"$f":"C200","v":2020},{"$f":"E200","v":98.970523039420314},0.12600562710556301,0.82613480416208063,7.7336529312049151E-2,{"$f":"J200","v":99.700716822466077},6.888021377982001E-2,0.1878227599411133,4.2580203812985218E-2,{"$f":"O200","v":99.905984012041031},6.7037241638515446E-2,0,2.6978746320473236E-2,{"$f":"T200","v":99.960940355200947},0,3.9059644799053217E-2,0,{"$f":"Y200","v":99.704306335609672},0,0.29569366439032763,0]
[]
[null,"RURAL",null,"Estimate",{"$f":"C299","v":2000},{"$f":"E299","v":66.679781188243908},{"$f":"F299","v":3.5303250439373421},8.3344512405478923,21.455442527270861,{"$f":"J299","v":77.936166728440114},{"$f":"K299","v":0.6004231884245016},3.6399046731103226,17.823505410025064,{"$f":"O299","v":87.065489789590757},{"$f":"P299","v":1.2598756592279754},1.9013517686560135,9.7732827825252571,{"$f":"T299","v":96.06501256356016},{"$f":"U299","v":0.49417461506785842},0.87783558000965911,2.5629772413623186,{"$f":"Y299","v":99.339986875833944},{"$f":"Z299","v":4.6805743981467571E-2},0.40511854538573289,0.20808883479885765]
[null,null,null,null,{"$f":"C300","v":2020},{"$f":"E300","v":87.695755407044174},4.6430044616744368,7.6612401312813887,0,{"$f":"J300","v":96.848461869464074},0.74612422846365789,2.4054139020722687,0,{"$f":"O300","v":98.225843517467965},1.421370851457489,0.3527856310745392,0,{"$f":"T300","v":99.488215850291212},0.51178414970878805,0,0,{"$f":"Y300","v":99.047367764186305},4.666787145244275E-2,9.5480634019295962E-2,0.8104837303419572]
[]
[]
[]
[]
[]
[]
[]
[]
[]
[]
[]
[]
[]
[]
[]
[]
[]
[]
[]
[]
[]
[]
[]
[]
[]
[]
[]
[]
[]
[]
[]
[]
[]
[]
[]
[]
[]
[]
[]
[]
[]
[]
[]
[]
[]
[]
[]
[]
[]
[]
[]
[]
[]
[]
[]
[]
["NATIONAL",null,null,"Poorest",null,null,null,null,"Poor",null,null,null,null,"Middle",null,null,null,null,"Rich",null,null,null,null,"Richest"]
[null,null,null,"Improved","Basic","Limited","Unimproved","Surface water","Improved","Basic","Limited","Unimproved","Surface water","Improved","Basic","Limited","Unimproved","Surface water","Improved","Basic","Limited","Unimproved","Surface water","Improved","Basic","Limited","Unimproved","Surface water"]
["Forecast period:",null,2000,{"$f":"IF((D101+H101)>100,D101*100/(D101+H101),D101)","v":85.095074054117504},{"$f":"D99*AVERAGEIF(E105:E116,\">0\")/100","v":83.661535304580852},{"$f":"D99*(100-AVERAGEIF(E105:E116,\">0\"))/100","v":1.4335387495366521},{"$f":"100-(E99+F99+H99)","v":3.7105967460433931},{"$f":"IF((D101+H101)>100,H101*100/(D101+H101),H101)","v":11.194329199839103},{"$f":"IF((I101+M101)>100,I101*100/(I101+M101),I101)","v":98.580298344055421},{"$f":"I99*AVERAGEIF(J105:J116,\">0\")/100","v":98.460710923781392},{"$f":"I99*(100-AVERAGEIF(J105:J116,\">0\"))/100","v":0.11958742027403843},{"$f":"100-(J99+K99+M99)","v":0.67149136070518978},{"$f":"IF((I101+M101)>100,M101*100/(I101+M101),M101)","v":0.74821029523937455},{"$f":"IF((N101+R101)>100,N101*100/(N101+R101),N101)","v":99.624174937719459},{"$f":"N99*AVERAGEIF(O105:O116,\">0\")/100","v":99.50938057499485},{"$f":"N99*(100-AVERAGEIF(O105:O116,\">0\"))/100","v":0.11479436272461432},{"$f":"100-(O99+P99+R99)","v":0.30463996442256303},{"$f":"IF((N101+R101)>100,R101*100/(N101+R101),R101)","v":7.1185097857979163E-2},{"$f":"IF((S101+W101)>100,S101*100/(S101+W101),S101)","v":99.805938173505666},{"$f":"S99*AVERAGEIF(T105:T116,\">0\")/100","v":99.80593817350568},{"$f":"S99*(100-AVERAGEIF(T105:T116,\">0\"))/100","v":0},{"$f":"100-(T99+U99+W99)","v":0.19406182649431969},{"$f":"IF((S101+W101)>100,W101*100/(S101+W101),W101)","v":0},{"$f":"IF((X101+AB101)>100,X101*100/(X101+AB101),X101)","v":99.959496795005421},{"$f":"X99*AVERAGEIF(Y105:Y116,\">0\")/100","v":99.959496795005421},{"$f":"X99*(100-AVERAGEIF(Y105:Y116,\">0\"))/100","v":0},{"$f":"100-(Y99+Z99+AB99)","v":1.633229543431014E-2},{"$f":"IF((X101+AB101)>100,AB101*100/(X101+AB101),AB101)","v":2.4170909560274012E-2}]
[null,null,2020,{"$f":"IF((D102+H102)>100,D102*100/(D102+H102),D102)","v":98.183360096639944},{"$f":"D100*AVERAGEIF(E105:E116,\">0\")/100","v":96.529331907314543},{"$f":"D100*(100-AVERAGEIF(E105:E116,\">0\"))/100","v":1.6540281893254147},{"$f":"100-(E100+F100+H100)","v":1.8166399033600413},{"$f":"IF((D102+H102)>100,H102*100/(D102+H102),H102)","v":0},{"$f":"IF((I102+M102)>100,I102*100/(I102+M102),I102)","v":99.376587758267448},{"$f":"I100*AVERAGEIF(J105:J116,\">0\")/100","v":99.256034362048553},{"$f":"I100*(100-AVERAGEIF(J105:J116,\">0\"))/100","v":0.12055339621889499},{"$f":"100-(J100+K100+M100)","v":0.62341224173255227},{"$f":"IF((I102+M102)>100,M102*100/(I102+M102),M102)","v":0},{"$f":"IF((N102+R102)>100,N102*100/(N102+R102),N102)","v":99.924692994183161},{"$f":"N100*AVERAGEIF(O105:O116,\">0\")/100","v":99.809552352266763},{"$f":"N100*(100-AVERAGEIF(O105:O116,\">0\"))/100","v":0.11514064191639239},{"$f":"100-(O100+P100+R100)","v":0},{"$f":"IF((N102+R102)>100,R102*100/(N102+R102),R102)","v":7.5307005816832043E-2},{"$f":"IF((S102+W102)>100,S102*100/(S102+W102),S102)","v":99.757650837526825},{"$f":"S100*AVERAGEIF(T105:T116,\">0\")/100","v":99.757650837526811},{"$f":"S100*(100-AVERAGEIF(T105:T116,\">0\"))/100","v":0},{"$f":"100-(T100+U100+W100)","v":0},{"$f":"IF((S102+W102)>100,W102*100/(S102+W102),W102)","v":0.24234916247318228},{"$f":"IF((X102+AB102)>100,X102*100/(X102+AB102),X102)","v":99.742566618822153},{"$f":"X100*AVERAGEIF(Y105:Y116,\">0\")/100","v":99.742566618822153},{"$f":"X100*(100-AVERAGEIF(Y105:Y116,\">0\"))/100","v":0},{"$f":"100-(Y100+Z100+AB100)","v":0.25743338117784731},{"$f":"IF((X102+AB102)>100,AB102*100/(X102+AB102),AB102)","v":0}]
["Regression period:",null,{"$f":"MinRegYear(C99,C105:C116)","v":2001},{"$f":"IF(MAX(C105:C116)-MIN(C105:C116)<5,AVERAGEIF(C105:C116,\">0\",D105:D116),\nIF(FORECAST($C101,D$105:D$116,$C$105:$C$116)<0,0,\nIF(FORECAST($C101,D$105:D$116,$C$105:$C$116)>100,100,\nFORECAST($C101,D$105:D$116,$C$105:$C$116))))","v":85.095074054117504},null,null,null,{"$f":"IF(MAX(C105:C116)-MIN(C105:C116)<5,AVERAGEIF(C105:C116,\">0\",H105:H116),\nIF(FORECAST($C101,H$105:H$116,$C$105:$C$116)<0,0,\nIF(FORECAST($C101,H$105:H$116,$C$105:$C$116)>100,100,\nFORECAST($C101,H$105:H$116,$C$105:$C$116))))","v":11.194329199839103},{"$f":"IF(MAX(C105:C116)-MIN(C105:C116)<5,AVERAGEIF(C105:C116,\">0\",I105:I116),\nIF(FORECAST($C101,I$105:I$116,$C$105:$C$116)<0,0,\nIF(FORECAST($C101,I$105:I$116,$C$105:$C$116)>100,100,\nFORECAST($C101,I$105:I$116,$C$105:$C$116))))","v":98.580298344055421},null,null,null,{"$f":"IF(MAX(C105:C116)-MIN(C105:C116)<5,AVERAGEIF(C105:C116,\">0\",M105:M116),\nIF(FORECAST($C101,M$105:M$116,$C$105:$C$116)<0,0,\nIF(FORECAST($C101,M$105:M$116,$C$105:$C$116)>100,100,\nFORECAST($C101,M$105:M$116,$C$105:$C$116))))","v":0.74821029523937455},{"$f":"IF(MAX(C105:C116)-MIN(C105:C116)<5,AVERAGEIF(C105:C116,\">0\",N105:N116),\nIF(FORECAST($C101,N$105:N$116,$C$105:$C$116)<0,0,\nIF(FORECAST($C101,N$105:N$116,$C$105:$C$116)>100,100,\nFORECAST($C101,N$105:N$116,$C$105:$C$116))))","v":99.624174937719459},null,null,null,{"$f":"IF(MAX(C105:C116)-MIN(C105:C116)<5,AVERAGEIF(C105:C116,\">0\",R105:R116),\nIF(FORECAST($C101,R$105:R$116,$C$105:$C$116)<0,0,\nIF(FORECAST($C101,R$105:R$116,$C$105:$C$116)>100,100,\nFORECAST($C101,R$105:R$116,$C$105:$C$116))))","v":7.1185097857979163E-2},{"$f":"IF(MAX(C105:C116)-MIN(C105:C116)<5,AVERAGEIF(C105:C116,\">0\",S105:S116),\nIF(FORECAST($C101,S$105:S$116,$C$105:$C$116)<0,0,\nIF(FORECAST($C101,S$105:S$116,$C$105:$C$116)>100,100,\nFORECAST($C101,S$105:S$116,$C$105:$C$116))))","v":99.805938173505666},null,null,null,{"$f":"IF(MAX(C105:C116)-MIN(C105:C116)<5,AVERAGEIF(C105:C116,\">0\",W105:W116),\nIF(FORECAST($C101,W$105:W$116,$C$105:$C$116)<0,0,\nIF(FORECAST($C101,W$105:W$116,$C$105:$C$116)>100,100,\nFORECAST($C101,W$105:W$116,$C$105:$C$116))))","v":0},{"$f":"IF(MAX(C105:C116)-MIN(C105:C116)<5,AVERAGEIF(C105:C116,\">0\",X105:X116),\nIF(FORECAST($C101,X$105:X$116,$C$105:$C$116)<0,0,\nIF(FORECAST($C101,X$105:X$116,$C$105:$C$116)>100,100,\nFORECAST($C101,X$105:X$116,$C$105:$C$116))))","v":99.959496795005421},null,null,null,{"$f":"IF(MAX(C105:C116)-MIN(C105:C116)<5,AVERAGEIF(C105:C116,\">0\",AB105:AB116),\nIF(FORECAST($C101,AB$105:AB$116,$C$105:$C$116)<0,0,\nIF(FORECAST($C101,AB$105:AB$116,$C$105:$C$116)>100,100,\nFORECAST($C101,AB$105:AB$116,$C$105:$C$116))))","v":2.4170909560274012E-2}]
[null,null,{"$f":"MaxRegYear(C100,C105:C116)","v":2017},{"$f":"IF(MAX(C105:C116)-MIN(C105:C116)<5,AVERAGEIF(C105:C116,\">0\",D105:D116),\nIF(FORECAST($C102,D$105:D$116,$C$105:$C$116)<0,0,\nIF(FORECAST($C102,D$105:D$116,$C$105:$C$116)>100,100,\nFORECAST($C102,D$105:D$116,$C$105:$C$116))))","v":98.183360096639944},null,null,null,{"$f":"IF(MAX(C105:C116)-MIN(C105:C116)<5,AVERAGEIF(C105:C116,\">0\",H105:H116),\nIF(FORECAST($C102,H$105:H$116,$C$105:$C$116)<0,0,\nIF(FORECAST($C102,H$105:H$116,$C$105:$C$116)>100,100,\nFORECAST($C102,H$105:H$116,$C$105:$C$116))))","v":0},{"$f":"IF(MAX(C105:C116)-MIN(C105:C116)<5,AVERAGEIF(C105:C116,\">0\",I105:I116),\nIF(FORECAST($C102,I$105:I$116,$C$105:$C$116)<0,0,\nIF(FORECAST($C102,I$105:I$116,$C$105:$C$116)>100,100,\nFORECAST($C102,I$105:I$116,$C$105:$C$116))))","v":99.376587758267448},null,null,null,{"$f":"IF(MAX(C105:C116)-MIN(C105:C116)<5,AVERAGEIF(C105:C116,\">0\",M105:M116),\nIF(FORECAST($C102,M$105:M$116,$C$105:$C$116)<0,0,\nIF(FORECAST($C102,M$105:M$116,$C$105:$C$116)>100,100,\nFORECAST($C102,M$105:M$116,$C$105:$C$116))))","v":0},{"$f":"IF(MAX(C105:C116)-MIN(C105:C116)<5,AVERAGEIF(C105:C116,\">0\",N105:N116),\nIF(FORECAST($C102,N$105:N$116,$C$105:$C$116)<0,0,\nIF(FORECAST($C102,N$105:N$116,$C$105:$C$116)>100,100,\nFORECAST($C102,N$105:N$116,$C$105:$C$116))))","v":99.949659118348379},null,null,null,{"$f":"IF(MAX(C105:C116)-MIN(C105:C116)<5,AVERAGEIF(C105:C116,\">0\",R105:R116),\nIF(FORECAST($C102,R$105:R$116,$C$105:$C$116)<0,0,\nIF(FORECAST($C102,R$105:R$116,$C$105:$C$116)>100,100,\nFORECAST($C102,R$105:R$116,$C$105:$C$116))))","v":7.5325821226731204E-2},{"$f":"IF(MAX(C105:C116)-MIN(C105:C116)<5,AVERAGEIF(C105:C116,\">0\",S105:S116),\nIF(FORECAST($C102,S$105:S$116,$C$105:$C$116)<0,0,\nIF(FORECAST($C102,S$105:S$116,$C$105:$C$116)>100,100,\nFORECAST($C102,S$105:S$116,$C$105:$C$116))))","v":99.866880581355417},null,null,null,{"$f":"IF(MAX(C105:C116)-MIN(C105:C116)<5,AVERAGEIF(C105:C116,\">0\",W105:W116),\nIF(FORECAST($C102,W$105:W$116,$C$105:$C$116)<0,0,\nIF(FORECAST($C102,W$105:W$116,$C$105:$C$116)>100,100,\nFORECAST($C102,W$105:W$116,$C$105:$C$116))))","v":0.24261452294139474},{"$f":"IF(MAX(C105:C116)-MIN(C105:C116)<5,AVERAGEIF(C105:C116,\">0\",X105:X116),\nIF(FORECAST($C102,X$105:X$116,$C$105:$C$116)<0,0,\nIF(FORECAST($C102,X$105:X$116,$C$105:$C$116)>100,100,\nFORECAST($C102,X$105:X$116,$C$105:$C$116))))","v":99.742566618822153},null,null,null,{"$f":"IF(MAX(C105:C116)-MIN(C105:C116)<5,AVERAGEIF(C105:C116,\">0\",AB105:AB116),\nIF(FORECAST($C102,AB$105:AB$116,$C$105:$C$116)<0,0,\nIF(FORECAST($C102,AB$105:AB$116,$C$105:$C$116)>100,100,\nFORECAST($C102,AB$105:AB$116,$C$105:$C$116))))","v":0}]
[]
[null,"Survey","Year","Improved","% Improved\n< = 30min",null,null,"Surface water","Improved","% Improved\n< = 30min",null,null,"Surface water","Improved","% Improved\n< = 30min",null,null,"Surface water","Improved","% Improved\n< = 30min",null,null,"Surface water","Improved","% Improved\n< = 30min",null,null,"Surface water"]
[null,"WHS03",2003,{"$f":"IF(ISERROR(INDIRECT(CONCATENATE($B105,\"!C16\"))),\"\",INDIRECT(CONCATENATE($B105,\"!C16\")))","v":86.439525759120116},{"$f":"IF(ISERROR(INDIRECT(CONCATENATE($B105,\"!C23\"))),\"\",INDIRECT(CONCATENATE($B105,\"!C23\")))","v":"N/A"},null,null,{"$f":"IF(ISERROR(INDIRECT(CONCATENATE($B105,\"!C21\"))),\"\",INDIRECT(CONCATENATE($B105,\"!C21\")))","v":9.8519864965723176},{"$f":"IF(ISERROR(INDIRECT(CONCATENATE($B105,\"!D16\"))),\"\",INDIRECT(CONCATENATE($B105,\"!D16\")))","v":98.739291273705007},{"$f":"IF(ISERROR(INDIRECT(CONCATENATE($B105,\"!D23\"))),\"\",INDIRECT(CONCATENATE($B105,\"!D23\")))","v":"N/A"},null,null,{"$f":"IF(ISERROR(INDIRECT(CONCATENATE($B105,\"!D21\"))),\"\",INDIRECT(CONCATENATE($B105,\"!D21\")))","v":0.66335753298293354},{"$f":"IF(ISERROR(INDIRECT(CONCATENATE($B105,\"!E16\"))),\"\",INDIRECT(CONCATENATE($B105,\"!E16\")))","v":99.657983369799126},{"$f":"IF(ISERROR(INDIRECT(CONCATENATE($B105,\"!E23\"))),\"\",INDIRECT(CONCATENATE($B105,\"!E23\")))","v":"N/A"},null,null,{"$f":"IF(ISERROR(INDIRECT(CONCATENATE($B105,\"!E21\"))),\"\",INDIRECT(CONCATENATE($B105,\"!E21\")))","v":7.1591776045981631E-2},{"$f":"IF(ISERROR(INDIRECT(CONCATENATE($B105,\"!F16\"))),\"\",INDIRECT(CONCATENATE($B105,\"!F16\")))","v":99.781970795279847},{"$f":"IF(ISERROR(INDIRECT(CONCATENATE($B105,\"!F23\"))),\"\",INDIRECT(CONCATENATE($B105,\"!F23\")))","v":"N/A"},null,null,{"$f":"IF(ISERROR(INDIRECT(CONCATENATE($B105,\"!F21\"))),\"\",INDIRECT(CONCATENATE($B105,\"!F21\")))","v":4.1700890431220451E-3},{"$f":"IF(ISERROR(INDIRECT(CONCATENATE($B105,\"!G16\"))),\"\",INDIRECT(CONCATENATE($B105,\"!G16\")))","v":99.943987348567191},{"$f":"IF(ISERROR(INDIRECT(CONCATENATE($B105,\"!G23\"))),\"\",INDIRECT(CONCATENATE($B105,\"!G23\")))","v":"N/A"},null,null,{"$f":"IF(ISERROR(INDIRECT(CONCATENATE($B105,\"!G221\"))),\"\",INDIRECT(CONCATENATE($B105,\"!G21\")))","v":2.1183493771925826E-2}]
[null,"ENG12",2012,95.259606909602482,"N/A",null,null,0.33355641886141979,98.889920304833836,"N/A",null,null,6.1674309709942976E-2,99.875453673897638,"N/A",null,null,7.4475494106362519E-2,99.974176795730486,"N/A",null,null,0.18831529542001285,99.763929996540782,"N/A",null,null,0]
[null,"MICS15",2015,95.672572190386617,98.315368115638549,null,null,0.33355641886141979,99.455421840110191,99.878690344538555,null,null,6.1674309709942976E-2,99.888342324272912,99.884772583766562,null,null,7.4475494106362519E-2,99.764507242753098,100,null,null,0.18831529542001285,99.804503367599068,100,null,null,0]
[null,null,null,"","",null,null,"","","",null,null,"","","",null,null,"","","",null,null,"","","",null,null,""]
[null,null,null,"","",null,null,"","","",null,null,"","","",null,null,"","","",null,null,"","","",null,null,""]
[null,null,null,"","",null,null,"","","",null,null,"","","",null,null,"","","",null,null,"","","",null,null,""]
[null,null,null,{"$f":"IF(ISERROR(INDIRECT(CONCATENATE($B111,\"!C16\"))),\"\",INDIRECT(CONCATENATE($B111,\"!C16\")))","v":""},{"$f":"IF(ISERROR(INDIRECT(CONCATENATE($B111,\"!C23\"))),\"\",INDIRECT(CONCATENATE($B111,\"!C23\")))","v":""},null,null,{"$f":"IF(ISERROR(INDIRECT(CONCATENATE($B111,\"!C21\"))),\"\",INDIRECT(CONCATENATE($B111,\"!C21\")))","v":""},{"$f":"IF(ISERROR(INDIRECT(CONCATENATE($B111,\"!D16\"))),\"\",INDIRECT(CONCATENATE($B111,\"!D16\")))","v":""},{"$f":"IF(ISERROR(INDIRECT(CONCATENATE($B111,\"!D23\"))),\"\",INDIRECT(CONCATENATE($B111,\"!D23\")))","v":""},null,null,{"$f":"IF(ISERROR(INDIRECT(CONCATENATE($B111,\"!D21\"))),\"\",INDIRECT(CONCATENATE($B111,\"!D21\")))","v":""},{"$f":"IF(ISERROR(INDIRECT(CONCATENATE($B111,\"!E16\"))),\"\",INDIRECT(CONCATENATE($B111,\"!E16\")))","v":""},{"$f":"IF(ISERROR(INDIRECT(CONCATENATE($B111,\"!E23\"))),\"\",INDIRECT(CONCATENATE($B111,\"!E23\")))","v":""},null,null,{"$f":"IF(ISERROR(INDIRECT(CONCATENATE($B111,\"!E21\"))),\"\",INDIRECT(CONCATENATE($B111,\"!E21\")))","v":""},{"$f":"IF(ISERROR(INDIRECT(CONCATENATE($B111,\"!F16\"))),\"\",INDIRECT(CONCATENATE($B111,\"!F16\")))","v":""},{"$f":"IF(ISERROR(INDIRECT(CONCATENATE($B111,\"!F23\"))),\"\",INDIRECT(CONCATENATE($B111,\"!F23\")))","v":""},null,null,{"$f":"IF(ISERROR(INDIRECT(CONCATENATE($B111,\"!F21\"))),\"\",INDIRECT(CONCATENATE($B111,\"!F21\")))","v":""},{"$f":"IF(ISERROR(INDIRECT(CONCATENATE($B111,\"!G16\"))),\"\",INDIRECT(CONCATENATE($B111,\"!G16\")))","v":""},{"$f":"IF(ISERROR(INDIRECT(CONCATENATE($B111,\"!G23\"))),\"\",INDIRECT(CONCATENATE($B111,\"!G23\")))","v":""},null,null,{"$f":"IF(ISERROR(INDIRECT(CONCATENATE($B111,\"!G221\"))),\"\",INDIRECT(CONCATENATE($B111,\"!G21\")))","v":""}]
[null,null,null,{"$f":"IF(ISERROR(INDIRECT(CONCATENATE($B112,\"!C16\"))),\"\",INDIRECT(CONCATENATE($B112,\"!C16\")))","v":""},{"$f":"IF(ISERROR(INDIRECT(CONCATENATE($B112,\"!C23\"))),\"\",INDIRECT(CONCATENATE($B112,\"!C23\")))","v":""},null,null,{"$f":"IF(ISERROR(INDIRECT(CONCATENATE($B112,\"!C21\"))),\"\",INDIRECT(CONCATENATE($B112,\"!C21\")))","v":""},{"$f":"IF(ISERROR(INDIRECT(CONCATENATE($B112,\"!D16\"))),\"\",INDIRECT(CONCATENATE($B112,\"!D16\")))","v":""},{"$f":"IF(ISERROR(INDIRECT(CONCATENATE($B112,\"!D23\"))),\"\",INDIRECT(CONCATENATE($B112,\"!D23\")))","v":""},null,null,{"$f":"IF(ISERROR(INDIRECT(CONCATENATE($B112,\"!D21\"))),\"\",INDIRECT(CONCATENATE($B112,\"!D21\")))","v":""},{"$f":"IF(ISERROR(INDIRECT(CONCATENATE($B112,\"!E16\"))),\"\",INDIRECT(CONCATENATE($B112,\"!E16\")))","v":""},{"$f":"IF(ISERROR(INDIRECT(CONCATENATE($B112,\"!E23\"))),\"\",INDIRECT(CONCATENATE($B112,\"!E23\")))","v":""},null,null,{"$f":"IF(ISERROR(INDIRECT(CONCATENATE($B112,\"!E21\"))),\"\",INDIRECT(CONCATENATE($B112,\"!E21\")))","v":""},{"$f":"IF(ISERROR(INDIRECT(CONCATENATE($B112,\"!F16\"))),\"\",INDIRECT(CONCATENATE($B112,\"!F16\")))","v":""},{"$f":"IF(ISERROR(INDIRECT(CONCATENATE($B112,\"!F23\"))),\"\",INDIRECT(CONCATENATE($B112,\"!F23\")))","v":""},null,null,{"$f":"IF(ISERROR(INDIRECT(CONCATENATE($B112,\"!F21\"))),\"\",INDIRECT(CONCATENATE($B112,\"!F21\")))","v":""},{"$f":"IF(ISERROR(INDIRECT(CONCATENATE($B112,\"!G16\"))),\"\",INDIRECT(CONCATENATE($B112,\"!G16\")))","v":""},{"$f":"IF(ISERROR(INDIRECT(CONCATENATE($B112,\"!G23\"))),\"\",INDIRECT(CONCATENATE($B112,\"!G23\")))","v":""},null,null,{"$f":"IF(ISERROR(INDIRECT(CONCATENATE($B112,\"!G221\"))),\"\",INDIRECT(CONCATENATE($B112,\"!G21\")))","v":""}]
[null,null,null,"","",null,null,"","","",null,null,"","","",null,null,"","","",null,null,"","","",null,null,""]
[null,null,null,"","",null,null,"","","",null,null,"","","",null,null,"","","",null,null,"","","",null,null,""]
[null,null,null,"","",null,null,"","","",null,null,"","","",null,null,"","","",null,null,"","","",null,null,""]
[null,null,null,"","",null,null,"","","",null,null,"","","",null,null,"","","",null,null,"","","",null,null,""]
[]
[null,{"$f":"CONCATENATE(\"National use of drinking water sources, \",C99,\"–\",C100)","v":"National use of drinking water sources, 2000–2020"},null,null,null,null,null,null,null,null,null,null,null,null,null,null,null,null,"Data points used for regression"]
[]
[]
[]
[]
[]
[]
[]
[]
[]
[]
[]
[]
[]
[]
[]
[]
[]
[]
[]
[]
[]
[]
[]
[]
[]
[]
[]
[]
[]
[]
[]
[]
[]
[]
[null,null,null,null,{"$f":"IF(ISERROR(INDIRECT(CONCATENATE($B153,\"!M18\"))),\"\",INDIRECT(CONCATENATE($B153,\"!M18\")))","v":""},{"$f":"IF(ISERROR(INDIRECT(CONCATENATE($B153,\"!M19\"))),\"\",INDIRECT(CONCATENATE($B153,\"!M19\")))","v":""},{"$f":"IF(ISERROR(INDIRECT(CONCATENATE($B153,\"!M20\"))),\"\",INDIRECT(CONCATENATE($B153,\"!M20\")))","v":""},{"$f":"IF(ISERROR(INDIRECT(CONCATENATE($B153,\"!M21\"))),\"\",INDIRECT(CONCATENATE($B153,\"!M21\")))","v":""},null,{"$f":"IF(ISERROR(INDIRECT(CONCATENATE($B153,\"!N18\"))),\"\",INDIRECT(CONCATENATE($B153,\"!N18\")))","v":""},{"$f":"IF(ISERROR(INDIRECT(CONCATENATE($B153,\"!N19\"))),\"\",INDIRECT(CONCATENATE($B153,\"!N19\")))","v":""},{"$f":"IF(ISERROR(INDIRECT(CONCATENATE($B153,\"!N20\"))),\"\",INDIRECT(CONCATENATE($B153,\"!N20\")))","v":""},{"$f":"IF(ISERROR(INDIRECT(CONCATENATE($B153,\"!N21\"))),\"\",INDIRECT(CONCATENATE($B153,\"!N21\")))","v":""},null,{"$f":"IF(ISERROR(INDIRECT(CONCATENATE($B153,\"!O18\"))),\"\",INDIRECT(CONCATENATE($B153,\"!O18\")))","v":""},{"$f":"IF(ISERROR(INDIRECT(CONCATENATE($B153,\"!O19\"))),\"\",INDIRECT(CONCATENATE($B153,\"!O19\")))","v":""},{"$f":"IF(ISERROR(INDIRECT(CONCATENATE($B153,\"!O20\"))),\"\",INDIRECT(CONCATENATE($B153,\"!O20\")))","v":""},{"$f":"IF(ISERROR(INDIRECT(CONCATENATE($B153,\"!O21\"))),\"\",INDIRECT(CONCATENATE($B153,\"!O21\")))","v":""},null,{"$f":"IF(ISERROR(INDIRECT(CONCATENATE($B153,\"!P18\"))),\"\",INDIRECT(CONCATENATE($B153,\"!P18\")))","v":""},{"$f":"IF(ISERROR(INDIRECT(CONCATENATE($B153,\"!P19\"))),\"\",INDIRECT(CONCATENATE($B153,\"!P19\")))","v":""},{"$f":"IF(ISERROR(INDIRECT(CONCATENATE($B153,\"!P20\"))),\"\",INDIRECT(CONCATENATE($B153,\"!P20\")))","v":""},{"$f":"IF(ISERROR(INDIRECT(CONCATENATE($B153,\"!P21\"))),\"\",INDIRECT(CONCATENATE($B153,\"!P21\")))","v":""},null,{"$f":"IF(ISERROR(INDIRECT(CONCATENATE($B153,\"!Q18\"))),\"\",INDIRECT(CONCATENATE($B153,\"!Q18\")))","v":""},{"$f":"IF(ISERROR(INDIRECT(CONCATENATE($B153,\"!Q19\"))),\"\",INDIRECT(CONCATENATE($B153,\"!Q19\")))","v":""},{"$f":"IF(ISERROR(INDIRECT(CONCATENATE($B153,\"!Q20\"))),\"\",INDIRECT(CONCATENATE($B153,\"!Q20\")))","v":""},{"$f":"IF(ISERROR(INDIRECT(CONCATENATE($B153,\"!Q21\"))),\"\",INDIRECT(CONCATENATE($B153,\"!Q1\")))","v":""}]
[null,null,null,null,"","","","",null,"","","","",null,"","","","",null,"","","","",null,"","","",""]
[null,null,null,null,"","","","",null,"","","","",null,"","","","",null,"","","","",null,"","","",""]
[null,null,null,null,"","","","",null,"","","","",null,"","","","",null,"","","","",null,"","","",""]
[null,null,null,null,"","","","",null,"","","","",null,"","","","",null,"","","","",null,"","","",""]
[null,null,null,null,"","","","",null,"","","","",null,"","","","",null,"","","","",null,"","","",""]
[]
[]
[]
[]
[]
[]
[]
[]
[]
[]
[]
[]
[]
[]
[]
[]
[]
[]
[]
[]
[]
[]
[]
[]
[]
[]
[]
[]
[]
[]
[]
[]
[]
[]
[]
[]
[]
[]
["URBAN",null,null,"Poorest",null,null,null,null,"Poor",null,null,null,null,"Middle",null,null,null,null,"Rich",null,null,null,null,"Richest"]
[null,null,null,"Improved","Basic","Limited","Unimproved","Surface water","Improved","Basic","Limited","Unimproved","Surface water","Improved","Basic","Limited","Unimproved","Surface water","Improved","Basic","Limited","Unimproved","Surface water","Improved","Basic","Limited","Unimproved","Surface water"]
["Forecast period:",null,{"$f":"MinBase(C205:C216)","v":2000},{"$f":"IF((D201+H201)>100,D201*100/(D201+H201),D201)","v":98.402906761562065},{"$f":"D199*AVERAGEIF(E205:E216,\">0\")/100","v":98.277783105442609},{"$f":"D199*(100-AVERAGEIF(E205:E216,\">0\"))/100","v":0.12512365611944265},{"$f":"100-(E199+F199+H199)","v":1.1001187181748264},{"$f":"IF((D201+H201)>100,H201*100/(D201+H201),H201)","v":0.49697452026312305},{"$f":"IF((I201+M201)>100,I201*100/(I201+M201),I201)","v":99.609306402813388},{"$f":"I199*AVERAGEIF(J205:J216,\">0\")/100","v":99.540536852536533},{"$f":"I199*(100-AVERAGEIF(J205:J216,\">0\"))/100","v":6.8769550276852054E-2},{"$f":"100-(J199+K199+M199)","v":0.27921867977707393},{"$f":"IF((I201+M201)>100,M201*100/(I201+M201),M201)","v":0.11147491740953974},{"$f":"IF((N201+R201)>100,N201*100/(N201+R201),N201)","v":99.666745332548828},{"$f":"N199*AVERAGEIF(O205:O216,\">0\")/100","v":99.59991346524707},{"$f":"N199*(100-AVERAGEIF(O205:O216,\">0\"))/100","v":6.6831867301765144E-2},{"$f":"100-(O199+P199+R199)","v":0.33103214583094598},{"$f":"IF((N201+R201)>100,R201*100/(N201+R201),R201)","v":2.2225216202245157E-3},{"$f":"IF((S201+W201)>100,S201*100/(S201+W201),S201)","v":99.853664577082455},{"$f":"S199*AVERAGEIF(T205:T216,\">0\")/100","v":99.853664577082455},{"$f":"S199*(100-AVERAGEIF(T205:T216,\">0\"))/100","v":0},{"$f":"100-(T199+U199+W199)","v":0.14633542291754509},{"$f":"IF((S201+W201)>100,W201*100/(S201+W201),W201)","v":0},{"$f":"IF((X201+AB201)>100,X201*100/(X201+AB201),X201)","v":99.990098489237766},{"$f":"X199*AVERAGEIF(Y205:Y216,\">0\")/100","v":99.990098489237766},{"$f":"X199*(100-AVERAGEIF(Y205:Y216,\">0\"))/100","v":0},{"$f":"100-(Y199+Z199+AB199)","v":0},{"$f":"IF((X201+AB201)>100,AB201*100/(X201+AB201),AB201)","v":9.901510762240065E-3}]
[null,null,{"$f":"MaxTarget(C205:C216)","v":2020},{"$f":"IF((D202+H202)>100,D202*100/(D202+H202),D202)","v":99.096528666525884},{"$f":"D200*AVERAGEIF(E205:E216,\">0\")/100","v":98.970523039420314},{"$f":"D200*(100-AVERAGEIF(E205:E216,\">0\"))/100","v":0.12600562710556301},{"$f":"100-(E200+F200+H200)","v":0.82613480416208063},{"$f":"IF((D202+H202)>100,H202*100/(D202+H202),H202)","v":7.7336529312049151E-2},{"$f":"IF((I202+M202)>100,I202*100/(I202+M202),I202)","v":99.769597036245898},{"$f":"I200*AVERAGEIF(J205:J216,\">0\")/100","v":99.700716822466077},{"$f":"I200*(100-AVERAGEIF(J205:J216,\">0\"))/100","v":6.888021377982001E-2},{"$f":"100-(J200+K200+M200)","v":0.1878227599411133},{"$f":"IF((I202+M202)>100,M202*100/(I202+M202),M202)","v":4.2580203812985218E-2},{"$f":"IF((N202+R202)>100,N202*100/(N202+R202),N202)","v":99.973021253679534},{"$f":"N200*AVERAGEIF(O205:O216,\">0\")/100","v":99.905984012041031},{"$f":"N200*(100-AVERAGEIF(O205:O216,\">0\"))/100","v":6.7037241638515446E-2},{"$f":"100-(O200+P200+R200)","v":0},{"$f":"IF((N202+R202)>100,R202*100/(N202+R202),R202)","v":2.6978746320473236E-2},{"$f":"IF((S202+W202)>100,S202*100/(S202+W202),S202)","v":99.960940355200947},{"$f":"S200*AVERAGEIF(T205:T216,\">0\")/100","v":99.960940355200947},{"$f":"S200*(100-AVERAGEIF(T205:T216,\">0\"))/100","v":0},{"$f":"100-(T200+U200+W200)","v":3.9059644799053217E-2},{"$f":"IF((S202+W202)>100,W202*100/(S202+W202),W202)","v":0},{"$f":"IF((X202+AB202)>100,X202*100/(X202+AB202),X202)","v":99.704306335609672},{"$f":"X200*AVERAGEIF(Y205:Y216,\">0\")/100","v":99.704306335609672},{"$f":"X200*(100-AVERAGEIF(Y205:Y216,\">0\"))/100","v":0},{"$f":"100-(Y200+Z200+AB200)","v":0.29569366439032763},{"$f":"IF((X202+AB202)>100,AB202*100/(X202+AB202),AB202)","v":0}]
["Regression period:",null,{"$f":"MinRegYear(C199,C205:C216)","v":2001},{"$f":"IF(MAX(C205:C216)-MIN(C205:C216)<5,AVERAGEIF(C205:C216,\">0\",D205:D216),\nIF(FORECAST($C201,D$205:D$216,$C$205:$C$216)<0,0,\nIF(FORECAST($C201,D$205:D$216,$C$205:$C$216)>100,100,\nFORECAST($C201,D$205:D$216,$C$205:$C$216))))","v":98.402906761562065},null,null,null,{"$f":"IF(MAX(C205:C216)-MIN(C205:C216)<5,AVERAGEIF(C205:C216,\">0\",H205:H216),\nIF(FORECAST($C201,H$205:H$216,$C$205:$C$216)<0,0,\nIF(FORECAST($C201,H$205:H$216,$C$205:$C$216)>100,100,\nFORECAST($C201,H$205:H$216,$C$205:$C$216))))","v":0.49697452026312305},{"$f":"IF(MAX(C205:C216)-MIN(C205:C216)<5,AVERAGEIF(C205:C216,\">0\",I205:I216),\nIF(FORECAST($C201,I$205:I$216,$C$205:$C$216)<0,0,\nIF(FORECAST($C201,I$205:I$216,$C$205:$C$216)>100,100,\nFORECAST($C201,I$205:I$216,$C$205:$C$216))))","v":99.609306402813388},null,null,null,{"$f":"IF(MAX(C205:C216)-MIN(C205:C216)<5,AVERAGEIF(C205:C216,\">0\",M205:M216),\nIF(FORECAST($C201,M$205:M$216,$C$205:$C$216)<0,0,\nIF(FORECAST($C201,M$205:M$216,$C$205:$C$216)>100,100,\nFORECAST($C201,M$205:M$216,$C$205:$C$216))))","v":0.11147491740953974},{"$f":"IF(MAX(C205:C216)-MIN(C205:C216)<5,AVERAGEIF(C205:C216,\">0\",N205:N216),\nIF(FORECAST($C201,N$205:N$216,$C$205:$C$216)<0,0,\nIF(FORECAST($C201,N$205:N$216,$C$205:$C$216)>100,100,\nFORECAST($C201,N$205:N$216,$C$205:$C$216))))","v":99.666745332548828},null,null,null,{"$f":"IF(MAX(C205:C216)-MIN(C205:C216)<5,AVERAGEIF(C205:C216,\">0\",R205:R216),\nIF(FORECAST($C201,R$205:R$216,$C$205:$C$216)<0,0,\nIF(FORECAST($C201,R$205:R$216,$C$205:$C$216)>100,100,\nFORECAST($C201,R$205:R$216,$C$205:$C$216))))","v":2.2225216202245157E-3},{"$f":"IF(MAX(C205:C216)-MIN(C205:C216)<5,AVERAGEIF(C205:C216,\">0\",S205:S216),\nIF(FORECAST($C201,S$205:S$216,$C$205:$C$216)<0,0,\nIF(FORECAST($C201,S$205:S$216,$C$205:$C$216)>100,100,\nFORECAST($C201,S$205:S$216,$C$205:$C$216))))","v":99.853664577082455},null,null,null,{"$f":"IF(MAX(C205:C216)-MIN(C205:C216)<5,AVERAGEIF(C205:C216,\">0\",W205:W216),\nIF(FORECAST($C201,W$205:W$216,$C$205:$C$216)<0,0,\nIF(FORECAST($C201,W$205:W$216,$C$205:$C$216)>100,100,\nFORECAST($C201,W$205:W$216,$C$205:$C$216))))","v":0},{"$f":"IF(MAX(C205:C216)-MIN(C205:C216)<5,AVERAGEIF(C205:C216,\">0\",X205:X216),\nIF(FORECAST($C201,X$205:X$216,$C$205:$C$216)<0,0,\nIF(FORECAST($C201,X$205:X$216,$C$205:$C$216)>100,100,\nFORECAST($C201,X$205:X$216,$C$205:$C$216))))","v":100},null,null,null,{"$f":"IF(MAX(C205:C216)-MIN(C205:C216)<5,AVERAGEIF(C205:C216,\">0\",AB205:AB216),\nIF(FORECAST($C201,AB$205:AB$216,$C$205:$C$216)<0,0,\nIF(FORECAST($C201,AB$205:AB$216,$C$205:$C$216)>100,100,\nFORECAST($C201,AB$205:AB$216,$C$205:$C$216))))","v":9.9024912584777525E-3}]
[null,null,{"$f":"MaxRegYear(C200,C205:C216)","v":2017},{"$f":"IF(MAX(C205:C216)-MIN(C205:C216)<5,AVERAGEIF(C205:C216,\">0\",D205:D216),\nIF(FORECAST($C202,D$205:D$216,$C$205:$C$216)<0,0,\nIF(FORECAST($C202,D$205:D$216,$C$205:$C$216)>100,100,\nFORECAST($C202,D$205:D$216,$C$205:$C$216))))","v":99.096528666525884},null,null,null,{"$f":"IF(MAX(C205:C216)-MIN(C205:C216)<5,AVERAGEIF(C205:C216,\">0\",H205:H216),\nIF(FORECAST($C202,H$205:H$216,$C$205:$C$216)<0,0,\nIF(FORECAST($C202,H$205:H$216,$C$205:$C$216)>100,100,\nFORECAST($C202,H$205:H$216,$C$205:$C$216))))","v":7.7336529312049151E-2},{"$f":"IF(MAX(C205:C216)-MIN(C205:C216)<5,AVERAGEIF(C205:C216,\">0\",I205:I216),\nIF(FORECAST($C202,I$205:I$216,$C$205:$C$216)<0,0,\nIF(FORECAST($C202,I$205:I$216,$C$205:$C$216)>100,100,\nFORECAST($C202,I$205:I$216,$C$205:$C$216))))","v":99.769597036245898},null,null,null,{"$f":"IF(MAX(C205:C216)-MIN(C205:C216)<5,AVERAGEIF(C205:C216,\">0\",M205:M216),\nIF(FORECAST($C202,M$205:M$216,$C$205:$C$216)<0,0,\nIF(FORECAST($C202,M$205:M$216,$C$205:$C$216)>100,100,\nFORECAST($C202,M$205:M$216,$C$205:$C$216))))","v":4.2580203812985218E-2},{"$f":"IF(MAX(C205:C216)-MIN(C205:C216)<5,AVERAGEIF(C205:C216,\">0\",N205:N216),\nIF(FORECAST($C202,N$205:N$216,$C$205:$C$216)<0,0,\nIF(FORECAST($C202,N$205:N$216,$C$205:$C$216)>100,100,\nFORECAST($C202,N$205:N$216,$C$205:$C$216))))","v":100},null,null,null,{"$f":"IF(MAX(C205:C216)-MIN(C205:C216)<5,AVERAGEIF(C205:C216,\">0\",R205:R216),\nIF(FORECAST($C202,R$205:R$216,$C$205:$C$216)<0,0,\nIF(FORECAST($C202,R$205:R$216,$C$205:$C$216)>100,100,\nFORECAST($C202,R$205:R$216,$C$205:$C$216))))","v":2.6986026812188868E-2},{"$f":"IF(MAX(C205:C216)-MIN(C205:C216)<5,AVERAGEIF(C205:C216,\">0\",S205:S216),\nIF(FORECAST($C202,S$205:S$216,$C$205:$C$216)<0,0,\nIF(FORECAST($C202,S$205:S$216,$C$205:$C$216)>100,100,\nFORECAST($C202,S$205:S$216,$C$205:$C$216))))","v":99.960940355200947},null,null,null,{"$f":"IF(MAX(C205:C216)-MIN(C205:C216)<5,AVERAGEIF(C205:C216,\">0\",W205:W216),\nIF(FORECAST($C202,W$205:W$216,$C$205:$C$216)<0,0,\nIF(FORECAST($C202,W$205:W$216,$C$205:$C$216)>100,100,\nFORECAST($C202,W$205:W$216,$C$205:$C$216))))","v":0},{"$f":"IF(MAX(C205:C216)-MIN(C205:C216)<5,AVERAGEIF(C205:C216,\">0\",X205:X216),\nIF(FORECAST($C202,X$205:X$216,$C$205:$C$216)<0,0,\nIF(FORECAST($C202,X$205:X$216,$C$205:$C$216)>100,100,\nFORECAST($C202,X$205:X$216,$C$205:$C$216))))","v":99.704306335609672},null,null,null,{"$f":"IF(MAX(C205:C216)-MIN(C205:C216)<5,AVERAGEIF(C205:C216,\">0\",AB205:AB216),\nIF(FORECAST($C202,AB$205:AB$216,$C$205:$C$216)<0,0,\nIF(FORECAST($C202,AB$205:AB$216,$C$205:$C$216)>100,100,\nFORECAST($C202,AB$205:AB$216,$C$205:$C$216))))","v":0}]
[]
[null,"Survey","Year","Improved","% Improved\n< = 30min",null,null,"Surface water","Improved","% Improved\n< = 30min",null,null,"Surface water","Improved","% Improved\n< = 30min",null,null,"Surface water","Improved","% Improved\n< = 30min",null,null,"Surface water","Improved","% Improved\n< = 30min",null,null,"Surface water"]
[null,"WHS03",2003,{"$f":"IF(ISERROR(INDIRECT(CONCATENATE($B205,\"!H16\"))),\"\",INDIRECT(CONCATENATE($B205,\"!H16\")))","v":98.489609499682558},{"$f":"IF(ISERROR(INDIRECT(CONCATENATE($B205,\"!H23\"))),\"\",INDIRECT(CONCATENATE($B205,\"!H23\")))","v":"N/A"},null,null,{"$f":"IF(ISERROR(INDIRECT(CONCATENATE($B205,\"!H21\"))),\"\",INDIRECT(CONCATENATE($B205,\"!H21\")))","v":0.44451977139424004},{"$f":"IF(ISERROR(INDIRECT(CONCATENATE($B205,\"!I16\"))),\"\",INDIRECT(CONCATENATE($B205,\"!I16\")))","v":99.629342731992466},{"$f":"IF(ISERROR(INDIRECT(CONCATENATE($B205,\"!I23\"))),\"\",INDIRECT(CONCATENATE($B205,\"!I23\")))","v":"N/A"},null,null,{"$f":"IF(ISERROR(INDIRECT(CONCATENATE($B205,\"!I21\"))),\"\",INDIRECT(CONCATENATE($B205,\"!I21\")))","v":0.10286307820997044},{"$f":"IF(ISERROR(INDIRECT(CONCATENATE($B205,\"!J16\"))),\"\",INDIRECT(CONCATENATE($B205,\"!J16\")))","v":99.710941761132446},{"$f":"IF(ISERROR(INDIRECT(CONCATENATE($B205,\"!J23\"))),\"\",INDIRECT(CONCATENATE($B205,\"!J23\")))","v":"N/A"},null,null,{"$f":"IF(ISERROR(INDIRECT(CONCATENATE($B205,\"!J21\"))),\"\",INDIRECT(CONCATENATE($B205,\"!J21\")))","v":5.3179597692195463E-3},{"$f":"IF(ISERROR(INDIRECT(CONCATENATE($B205,\"!K16\"))),\"\",INDIRECT(CONCATENATE($B205,\"!K16\")))","v":99.867074049347266},{"$f":"IF(ISERROR(INDIRECT(CONCATENATE($B205,\"!K23\"))),\"\",INDIRECT(CONCATENATE($B205,\"!K23\")))","v":"N/A"},null,null,{"$f":"IF(ISERROR(INDIRECT(CONCATENATE($B205,\"!K21\"))),\"\",INDIRECT(CONCATENATE($B205,\"!K21\")))","v":0},{"$f":"IF(ISERROR(INDIRECT(CONCATENATE($B205,\"!L16\"))),\"\",INDIRECT(CONCATENATE($B205,\"!L16\")))","v":99.991512150349877},{"$f":"IF(ISERROR(INDIRECT(CONCATENATE($B205,\"!L23\"))),\"\",INDIRECT(CONCATENATE($B205,\"!L23\")))","v":"N/A"},null,null,{"$f":"IF(ISERROR(INDIRECT(CONCATENATE($B205,\"!L221\"))),\"\",INDIRECT(CONCATENATE($B205,\"!L21\")))","v":8.4878496501238996E-3}]
[null,"ENG12",null,98.412595403414571,"N/A",null,null,0.12979127818093358,99.426325737514631,"N/A",null,null,5.1192043012554374E-2,100.00000000000045,"N/A",null,null,2.3890588663193116E-2,99.999999999999986,"N/A",null,null,0,99.678603486653486,"N/A",null,null,0]
[null,"MICS15",2015,99.009825928405419,99.872845569061667,null,null,0.12979127818093358,99.749560707066848,99.930960717667531,null,null,5.1192043012554374E-2,99.976120332634153,99.932944667673482,null,null,2.3890588663193116E-2,99.947530882936135,100,null,null,0,99.745335737715422,100,null,null,0]
[null,null,null,"","",null,null,"","","",null,null,"","","",null,null,"","","",null,null,"","","",null,null,""]
[null,null,null,"","",null,null,"","","",null,null,"","","",null,null,"","","",null,null,"","","",null,null,""]
[null,null,null,"","",null,null,"","","",null,null,"","","",null,null,"","","",null,null,"","","",null,null,""]
[null,null,null,"","",null,null,"","","",null,null,"","","",null,null,"","","",null,null,"","","",null,null,""]
[null,null,null,"","",null,null,"","","",null,null,"","","",null,null,"","","",null,null,"","","",null,null,""]
[null,null,null,"","",null,null,"","","",null,null,"","","",null,null,"","","",null,null,"","","",null,null,""]
[null,null,null,"","",null,null,"","","",null,null,"","","",null,null,"","","",null,null,"","","",null,null,""]
[null,null,null,"","",null,null,"","","",null,null,"","","",null,null,"","","",null,null,"","","",null,null,""]
[null,null,null,"","",null,null,"","","",null,null,"","","",null,null,"","","",null,null,"","","",null,null,""]
[]
[null,{"$f":"CONCATENATE(\"Urban use of drinking water sources,  \",C199,\"–\",C200)","v":"Urban use of drinking water sources,  2000–2020"},null,null,null,null,null,null,null,null,null,null,null,null,null,null,null,null,"Data points used for regression"]
[]
[]
[]
[]
[]
[]
[]
[]
[]
[]
[]
[]
[]
[]
[]
[]
[]
[]
[]
[]
[]
[]
[]
[]
[]
[]
[]
[]
[]
[]
[]
[]
[]
[]
[null,null,null,null,{"$f":"IF(ISERROR(INDIRECT(CONCATENATE($B253,\"!M18\"))),\"\",INDIRECT(CONCATENATE($B253,\"!M18\")))","v":""},{"$f":"IF(ISERROR(INDIRECT(CONCATENATE($B253,\"!M19\"))),\"\",INDIRECT(CONCATENATE($B253,\"!M19\")))","v":""},{"$f":"IF(ISERROR(INDIRECT(CONCATENATE($B253,\"!M20\"))),\"\",INDIRECT(CONCATENATE($B253,\"!M20\")))","v":""},{"$f":"IF(ISERROR(INDIRECT(CONCATENATE($B253,\"!M21\"))),\"\",INDIRECT(CONCATENATE($B253,\"!M21\")))","v":""},null,{"$f":"IF(ISERROR(INDIRECT(CONCATENATE($B253,\"!N18\"))),\"\",INDIRECT(CONCATENATE($B253,\"!N18\")))","v":""},{"$f":"IF(ISERROR(INDIRECT(CONCATENATE($B253,\"!N19\"))),\"\",INDIRECT(CONCATENATE($B253,\"!N19\")))","v":""},{"$f":"IF(ISERROR(INDIRECT(CONCATENATE($B253,\"!N20\"))),\"\",INDIRECT(CONCATENATE($B253,\"!N20\")))","v":""},{"$f":"IF(ISERROR(INDIRECT(CONCATENATE($B253,\"!N21\"))),\"\",INDIRECT(CONCATENATE($B253,\"!N21\")))","v":""},null,{"$f":"IF(ISERROR(INDIRECT(CONCATENATE($B253,\"!O18\"))),\"\",INDIRECT(CONCATENATE($B253,\"!O18\")))","v":""},{"$f":"IF(ISERROR(INDIRECT(CONCATENATE($B253,\"!O19\"))),\"\",INDIRECT(CONCATENATE($B253,\"!O19\")))","v":""},{"$f":"IF(ISERROR(INDIRECT(CONCATENATE($B253,\"!O20\"))),\"\",INDIRECT(CONCATENATE($B253,\"!O20\")))","v":""},{"$f":"IF(ISERROR(INDIRECT(CONCATENATE($B253,\"!O21\"))),\"\",INDIRECT(CONCATENATE($B253,\"!O21\")))","v":""},null,{"$f":"IF(ISERROR(INDIRECT(CONCATENATE($B253,\"!P18\"))),\"\",INDIRECT(CONCATENATE($B253,\"!P18\")))","v":""},{"$f":"IF(ISERROR(INDIRECT(CONCATENATE($B253,\"!P19\"))),\"\",INDIRECT(CONCATENATE($B253,\"!P19\")))","v":""},{"$f":"IF(ISERROR(INDIRECT(CONCATENATE($B253,\"!P20\"))),\"\",INDIRECT(CONCATENATE($B253,\"!P20\")))","v":""},{"$f":"IF(ISERROR(INDIRECT(CONCATENATE($B253,\"!P21\"))),\"\",INDIRECT(CONCATENATE($B253,\"!P21\")))","v":""},null,{"$f":"IF(ISERROR(INDIRECT(CONCATENATE($B253,\"!Q18\"))),\"\",INDIRECT(CONCATENATE($B253,\"!Q18\")))","v":""},{"$f":"IF(ISERROR(INDIRECT(CONCATENATE($B253,\"!Q19\"))),\"\",INDIRECT(CONCATENATE($B253,\"!Q19\")))","v":""},{"$f":"IF(ISERROR(INDIRECT(CONCATENATE($B253,\"!Q20\"))),\"\",INDIRECT(CONCATENATE($B253,\"!Q20\")))","v":""},{"$f":"IF(ISERROR(INDIRECT(CONCATENATE($B253,\"!Q21\"))),\"\",INDIRECT(CONCATENATE($B253,\"!Q1\")))","v":""}]
[null,null,null,null,{"$f":"IF(ISERROR(INDIRECT(CONCATENATE($B254,\"!M18\"))),\"\",INDIRECT(CONCATENATE($B254,\"!M18\")))","v":""},{"$f":"IF(ISERROR(INDIRECT(CONCATENATE($B254,\"!M19\"))),\"\",INDIRECT(CONCATENATE($B254,\"!M19\")))","v":""},{"$f":"IF(ISERROR(INDIRECT(CONCATENATE($B254,\"!M20\"))),\"\",INDIRECT(CONCATENATE($B254,\"!M20\")))","v":""},{"$f":"IF(ISERROR(INDIRECT(CONCATENATE($B254,\"!M21\"))),\"\",INDIRECT(CONCATENATE($B254,\"!M21\")))","v":""},null,{"$f":"IF(ISERROR(INDIRECT(CONCATENATE($B254,\"!N18\"))),\"\",INDIRECT(CONCATENATE($B254,\"!N18\")))","v":""},{"$f":"IF(ISERROR(INDIRECT(CONCATENATE($B254,\"!N19\"))),\"\",INDIRECT(CONCATENATE($B254,\"!N19\")))","v":""},{"$f":"IF(ISERROR(INDIRECT(CONCATENATE($B254,\"!N20\"))),\"\",INDIRECT(CONCATENATE($B254,\"!N20\")))","v":""},{"$f":"IF(ISERROR(INDIRECT(CONCATENATE($B254,\"!N21\"))),\"\",INDIRECT(CONCATENATE($B254,\"!N21\")))","v":""},null,{"$f":"IF(ISERROR(INDIRECT(CONCATENATE($B254,\"!O18\"))),\"\",INDIRECT(CONCATENATE($B254,\"!O18\")))","v":""},{"$f":"IF(ISERROR(INDIRECT(CONCATENATE($B254,\"!O19\"))),\"\",INDIRECT(CONCATENATE($B254,\"!O19\")))","v":""},{"$f":"IF(ISERROR(INDIRECT(CONCATENATE($B254,\"!O20\"))),\"\",INDIRECT(CONCATENATE($B254,\"!O20\")))","v":""},{"$f":"IF(ISERROR(INDIRECT(CONCATENATE($B254,\"!O21\"))),\"\",INDIRECT(CONCATENATE($B254,\"!O21\")))","v":""},null,{"$f":"IF(ISERROR(INDIRECT(CONCATENATE($B254,\"!P18\"))),\"\",INDIRECT(CONCATENATE($B254,\"!P18\")))","v":""},{"$f":"IF(ISERROR(INDIRECT(CONCATENATE($B254,\"!P19\"))),\"\",INDIRECT(CONCATENATE($B254,\"!P19\")))","v":""},{"$f":"IF(ISERROR(INDIRECT(CONCATENATE($B254,\"!P20\"))),\"\",INDIRECT(CONCATENATE($B254,\"!P20\")))","v":""},{"$f":"IF(ISERROR(INDIRECT(CONCATENATE($B254,\"!P21\"))),\"\",INDIRECT(CONCATENATE($B254,\"!P21\")))","v":""},null,{"$f":"IF(ISERROR(INDIRECT(CONCATENATE($B254,\"!Q18\"))),\"\",INDIRECT(CONCATENATE($B254,\"!Q18\")))","v":""},{"$f":"IF(ISERROR(INDIRECT(CONCATENATE($B254,\"!Q19\"))),\"\",INDIRECT(CONCATENATE($B254,\"!Q19\")))","v":""},{"$f":"IF(ISERROR(INDIRECT(CONCATENATE($B254,\"!Q20\"))),\"\",INDIRECT(CONCATENATE($B254,\"!Q20\")))","v":""},{"$f":"IF(ISERROR(INDIRECT(CONCATENATE($B254,\"!Q21\"))),\"\",INDIRECT(CONCATENATE($B254,\"!Q1\")))","v":""}]
[null,null,null,null,{"$f":"IF(ISERROR(INDIRECT(CONCATENATE($B255,\"!M18\"))),\"\",INDIRECT(CONCATENATE($B255,\"!M18\")))","v":""},{"$f":"IF(ISERROR(INDIRECT(CONCATENATE($B255,\"!M19\"))),\"\",INDIRECT(CONCATENATE($B255,\"!M19\")))","v":""},{"$f":"IF(ISERROR(INDIRECT(CONCATENATE($B255,\"!M20\"))),\"\",INDIRECT(CONCATENATE($B255,\"!M20\")))","v":""},{"$f":"IF(ISERROR(INDIRECT(CONCATENATE($B255,\"!M21\"))),\"\",INDIRECT(CONCATENATE($B255,\"!M21\")))","v":""},null,{"$f":"IF(ISERROR(INDIRECT(CONCATENATE($B255,\"!N18\"))),\"\",INDIRECT(CONCATENATE($B255,\"!N18\")))","v":""},{"$f":"IF(ISERROR(INDIRECT(CONCATENATE($B255,\"!N19\"))),\"\",INDIRECT(CONCATENATE($B255,\"!N19\")))","v":""},{"$f":"IF(ISERROR(INDIRECT(CONCATENATE($B255,\"!N20\"))),\"\",INDIRECT(CONCATENATE($B255,\"!N20\")))","v":""},{"$f":"IF(ISERROR(INDIRECT(CONCATENATE($B255,\"!N21\"))),\"\",INDIRECT(CONCATENATE($B255,\"!N21\")))","v":""},null,{"$f":"IF(ISERROR(INDIRECT(CONCATENATE($B255,\"!O18\"))),\"\",INDIRECT(CONCATENATE($B255,\"!O18\")))","v":""},{"$f":"IF(ISERROR(INDIRECT(CONCATENATE($B255,\"!O19\"))),\"\",INDIRECT(CONCATENATE($B255,\"!O19\")))","v":""},{"$f":"IF(ISERROR(INDIRECT(CONCATENATE($B255,\"!O20\"))),\"\",INDIRECT(CONCATENATE($B255,\"!O20\")))","v":""},{"$f":"IF(ISERROR(INDIRECT(CONCATENATE($B255,\"!O21\"))),\"\",INDIRECT(CONCATENATE($B255,\"!O21\")))","v":""},null,{"$f":"IF(ISERROR(INDIRECT(CONCATENATE($B255,\"!P18\"))),\"\",INDIRECT(CONCATENATE($B255,\"!P18\")))","v":""},{"$f":"IF(ISERROR(INDIRECT(CONCATENATE($B255,\"!P19\"))),\"\",INDIRECT(CONCATENATE($B255,\"!P19\")))","v":""},{"$f":"IF(ISERROR(INDIRECT(CONCATENATE($B255,\"!P20\"))),\"\",INDIRECT(CONCATENATE($B255,\"!P20\")))","v":""},{"$f":"IF(ISERROR(INDIRECT(CONCATENATE($B255,\"!P21\"))),\"\",INDIRECT(CONCATENATE($B255,\"!P21\")))","v":""},null,{"$f":"IF(ISERROR(INDIRECT(CONCATENATE($B255,\"!Q18\"))),\"\",INDIRECT(CONCATENATE($B255,\"!Q18\")))","v":""},{"$f":"IF(ISERROR(INDIRECT(CONCATENATE($B255,\"!Q19\"))),\"\",INDIRECT(CONCATENATE($B255,\"!Q19\")))","v":""},{"$f":"IF(ISERROR(INDIRECT(CONCATENATE($B255,\"!Q20\"))),\"\",INDIRECT(CONCATENATE($B255,\"!Q20\")))","v":""},{"$f":"IF(ISERROR(INDIRECT(CONCATENATE($B255,\"!Q21\"))),\"\",INDIRECT(CONCATENATE($B255,\"!Q1\")))","v":""}]
[null,null,null,null,{"$f":"IF(ISERROR(INDIRECT(CONCATENATE($B256,\"!M18\"))),\"\",INDIRECT(CONCATENATE($B256,\"!M18\")))","v":""},{"$f":"IF(ISERROR(INDIRECT(CONCATENATE($B256,\"!M19\"))),\"\",INDIRECT(CONCATENATE($B256,\"!M19\")))","v":""},{"$f":"IF(ISERROR(INDIRECT(CONCATENATE($B256,\"!M20\"))),\"\",INDIRECT(CONCATENATE($B256,\"!M20\")))","v":""},{"$f":"IF(ISERROR(INDIRECT(CONCATENATE($B256,\"!M21\"))),\"\",INDIRECT(CONCATENATE($B256,\"!M21\")))","v":""},null,{"$f":"IF(ISERROR(INDIRECT(CONCATENATE($B256,\"!N18\"))),\"\",INDIRECT(CONCATENATE($B256,\"!N18\")))","v":""},{"$f":"IF(ISERROR(INDIRECT(CONCATENATE($B256,\"!N19\"))),\"\",INDIRECT(CONCATENATE($B256,\"!N19\")))","v":""},{"$f":"IF(ISERROR(INDIRECT(CONCATENATE($B256,\"!N20\"))),\"\",INDIRECT(CONCATENATE($B256,\"!N20\")))","v":""},{"$f":"IF(ISERROR(INDIRECT(CONCATENATE($B256,\"!N21\"))),\"\",INDIRECT(CONCATENATE($B256,\"!N21\")))","v":""},null,{"$f":"IF(ISERROR(INDIRECT(CONCATENATE($B256,\"!O18\"))),\"\",INDIRECT(CONCATENATE($B256,\"!O18\")))","v":""},{"$f":"IF(ISERROR(INDIRECT(CONCATENATE($B256,\"!O19\"))),\"\",INDIRECT(CONCATENATE($B256,\"!O19\")))","v":""},{"$f":"IF(ISERROR(INDIRECT(CONCATENATE($B256,\"!O20\"))),\"\",INDIRECT(CONCATENATE($B256,\"!O20\")))","v":""},{"$f":"IF(ISERROR(INDIRECT(CONCATENATE($B256,\"!O21\"))),\"\",INDIRECT(CONCATENATE($B256,\"!O21\")))","v":""},null,{"$f":"IF(ISERROR(INDIRECT(CONCATENATE($B256,\"!P18\"))),\"\",INDIRECT(CONCATENATE($B256,\"!P18\")))","v":""},{"$f":"IF(ISERROR(INDIRECT(CONCATENATE($B256,\"!P19\"))),\"\",INDIRECT(CONCATENATE($B256,\"!P19\")))","v":""},{"$f":"IF(ISERROR(INDIRECT(CONCATENATE($B256,\"!P20\"))),\"\",INDIRECT(CONCATENATE($B256,\"!P20\")))","v":""},{"$f":"IF(ISERROR(INDIRECT(CONCATENATE($B256,\"!P21\"))),\"\",INDIRECT(CONCATENATE($B256,\"!P21\")))","v":""},null,{"$f":"IF(ISERROR(INDIRECT(CONCATENATE($B256,\"!Q18\"))),\"\",INDIRECT(CONCATENATE($B256,\"!Q18\")))","v":""},{"$f":"IF(ISERROR(INDIRECT(CONCATENATE($B256,\"!Q19\"))),\"\",INDIRECT(CONCATENATE($B256,\"!Q19\")))","v":""},{"$f":"IF(ISERROR(INDIRECT(CONCATENATE($B256,\"!Q20\"))),\"\",INDIRECT(CONCATENATE($B256,\"!Q20\")))","v":""},{"$f":"IF(ISERROR(INDIRECT(CONCATENATE($B256,\"!Q21\"))),\"\",INDIRECT(CONCATENATE($B256,\"!Q1\")))","v":""}]
[null,null,null,null,{"$f":"IF(ISERROR(INDIRECT(CONCATENATE($B257,\"!M18\"))),\"\",INDIRECT(CONCATENATE($B257,\"!M18\")))","v":""},{"$f":"IF(ISERROR(INDIRECT(CONCATENATE($B257,\"!M19\"))),\"\",INDIRECT(CONCATENATE($B257,\"!M19\")))","v":""},{"$f":"IF(ISERROR(INDIRECT(CONCATENATE($B257,\"!M20\"))),\"\",INDIRECT(CONCATENATE($B257,\"!M20\")))","v":""},{"$f":"IF(ISERROR(INDIRECT(CONCATENATE($B257,\"!M21\"))),\"\",INDIRECT(CONCATENATE($B257,\"!M21\")))","v":""},null,{"$f":"IF(ISERROR(INDIRECT(CONCATENATE($B257,\"!N18\"))),\"\",INDIRECT(CONCATENATE($B257,\"!N18\")))","v":""},{"$f":"IF(ISERROR(INDIRECT(CONCATENATE($B257,\"!N19\"))),\"\",INDIRECT(CONCATENATE($B257,\"!N19\")))","v":""},{"$f":"IF(ISERROR(INDIRECT(CONCATENATE($B257,\"!N20\"))),\"\",INDIRECT(CONCATENATE($B257,\"!N20\")))","v":""},{"$f":"IF(ISERROR(INDIRECT(CONCATENATE($B257,\"!N21\"))),\"\",INDIRECT(CONCATENATE($B257,\"!N21\")))","v":""},null,{"$f":"IF(ISERROR(INDIRECT(CONCATENATE($B257,\"!O18\"))),\"\",INDIRECT(CONCATENATE($B257,\"!O18\")))","v":""},{"$f":"IF(ISERROR(INDIRECT(CONCATENATE($B257,\"!O19\"))),\"\",INDIRECT(CONCATENATE($B257,\"!O19\")))","v":""},{"$f":"IF(ISERROR(INDIRECT(CONCATENATE($B257,\"!O20\"))),\"\",INDIRECT(CONCATENATE($B257,\"!O20\")))","v":""},{"$f":"IF(ISERROR(INDIRECT(CONCATENATE($B257,\"!O21\"))),\"\",INDIRECT(CONCATENATE($B257,\"!O21\")))","v":""},null,{"$f":"IF(ISERROR(INDIRECT(CONCATENATE($B257,\"!P18\"))),\"\",INDIRECT(CONCATENATE($B257,\"!P18\")))","v":""},{"$f":"IF(ISERROR(INDIRECT(CONCATENATE($B257,\"!P19\"))),\"\",INDIRECT(CONCATENATE($B257,\"!P19\")))","v":""},{"$f":"IF(ISERROR(INDIRECT(CONCATENATE($B257,\"!P20\"))),\"\",INDIRECT(CONCATENATE($B257,\"!P20\")))","v":""},{"$f":"IF(ISERROR(INDIRECT(CONCATENATE($B257,\"!P21\"))),\"\",INDIRECT(CONCATENATE($B257,\"!P21\")))","v":""},null,{"$f":"IF(ISERROR(INDIRECT(CONCATENATE($B257,\"!Q18\"))),\"\",INDIRECT(CONCATENATE($B257,\"!Q18\")))","v":""},{"$f":"IF(ISERROR(INDIRECT(CONCATENATE($B257,\"!Q19\"))),\"\",INDIRECT(CONCATENATE($B257,\"!Q19\")))","v":""},{"$f":"IF(ISERROR(INDIRECT(CONCATENATE($B257,\"!Q20\"))),\"\",INDIRECT(CONCATENATE($B257,\"!Q20\")))","v":""},{"$f":"IF(ISERROR(INDIRECT(CONCATENATE($B257,\"!Q21\"))),\"\",INDIRECT(CONCATENATE($B257,\"!Q1\")))","v":""}]
[]
[]
[]
[]
[]
[]
[]
[]
[]
[]
[]
[]
[]
[]
[]
[]
[]
[]
[]
[]
[]
[]
[]
[]
[]
[]
[]
[]
[]
[]
[]
[]
[]
[]
[]
[]
[]
[]
[]
["RURAL",null,null,"Poorest",null,null,null,null,"Poor",null,null,null,null,"Middle",null,null,null,null,"Rich",null,null,null,null,"Richest"]
[null,null,null,"Improved","Basic","Limited","Unimproved","Surface water","Improved","Basic","Limited","Unimproved","Surface water","Improved","Basic","Limited","Unimproved","Surface water","Improved","Basic","Limited","Unimproved","Surface water","Improved","Basic","Limited","Unimproved","Surface water"]
["Forecast period:",null,2000,{"$f":"IF((D301+H301)>100,D301*100/(D301+H301),D301)","v":70.210106232181261},{"$f":"D299*AVERAGEIF(E305:E316,\">0\")/100","v":66.679781188243908},{"$f":"D299*(100-AVERAGEIF(E305:E316,\">0\"))/100","v":3.5303250439373421},{"$f":"100-(E299+F299+H299)","v":8.3344512405478923},{"$f":"IF((D301+H301)>100,H301*100/(D301+H301),H301)","v":21.455442527270861},{"$f":"IF((I301+M301)>100,I301*100/(I301+M301),I301)","v":78.536589916864614},{"$f":"I299*AVERAGEIF(J305:J316,\">0\")/100","v":77.936166728440114},{"$f":"I299*(100-AVERAGEIF(J305:J316,\">0\"))/100","v":0.6004231884245016},{"$f":"100-(J299+K299+M299)","v":3.6399046731103226},{"$f":"IF((I301+M301)>100,M301*100/(I301+M301),M301)","v":17.823505410025064},{"$f":"IF((N301+R301)>100,N301*100/(N301+R301),N301)","v":88.325365448818729},{"$f":"N299*AVERAGEIF(O305:O316,\">0\")/100","v":87.065489789590757},{"$f":"N299*(100-AVERAGEIF(O305:O316,\">0\"))/100","v":1.2598756592279754},{"$f":"100-(O299+P299+R299)","v":1.9013517686560135},{"$f":"IF((N301+R301)>100,R301*100/(N301+R301),R301)","v":9.7732827825252571},{"$f":"IF((S301+W301)>100,S301*100/(S301+W301),S301)","v":96.559187178628008},{"$f":"S299*AVERAGEIF(T305:T316,\">0\")/100","v":96.06501256356016},{"$f":"S299*(100-AVERAGEIF(T305:T316,\">0\"))/100","v":0.49417461506785842},{"$f":"100-(T299+U299+W299)","v":0.87783558000965911},{"$f":"IF((S301+W301)>100,W301*100/(S301+W301),W301)","v":2.5629772413623186},{"$f":"IF((X301+AB301)>100,X301*100/(X301+AB301),X301)","v":99.386792619815424},{"$f":"X299*AVERAGEIF(Y305:Y316,\">0\")/100","v":99.339986875833944},{"$f":"X299*(100-AVERAGEIF(Y305:Y316,\">0\"))/100","v":4.6805743981467571E-2},{"$f":"100-(Y299+Z299+AB299)","v":0.40511854538573289},{"$f":"IF((X301+AB301)>100,AB301*100/(X301+AB301),AB301)","v":0.20808883479885765}]
[null,null,2020,{"$f":"IF((D302+H302)>100,D302*100/(D302+H302),D302)","v":92.338759868718626},{"$f":"D300*AVERAGEIF(E305:E316,\">0\")/100","v":87.695755407044174},{"$f":"D300*(100-AVERAGEIF(E305:E316,\">0\"))/100","v":4.6430044616744368},{"$f":"100-(E300+F300+H300)","v":7.6612401312813887},{"$f":"IF((D302+H302)>100,H302*100/(D302+H302),H302)","v":0},{"$f":"IF((I302+M302)>100,I302*100/(I302+M302),I302)","v":97.594586097927731},{"$f":"I300*AVERAGEIF(J305:J316,\">0\")/100","v":96.848461869464074},{"$f":"I300*(100-AVERAGEIF(J305:J316,\">0\"))/100","v":0.74612422846365789},{"$f":"100-(J300+K300+M300)","v":2.4054139020722687},{"$f":"IF((I302+M302)>100,M302*100/(I302+M302),M302)","v":0},{"$f":"IF((N302+R302)>100,N302*100/(N302+R302),N302)","v":99.647214368925461},{"$f":"N300*AVERAGEIF(O305:O316,\">0\")/100","v":98.225843517467965},{"$f":"N300*(100-AVERAGEIF(O305:O316,\">0\"))/100","v":1.421370851457489},{"$f":"100-(O300+P300+R300)","v":0.3527856310745392},{"$f":"IF((N302+R302)>100,R302*100/(N302+R302),R302)","v":0},{"$f":"IF((S302+W302)>100,S302*100/(S302+W302),S302)","v":100},{"$f":"S300*AVERAGEIF(T305:T316,\">0\")/100","v":99.488215850291212},{"$f":"S300*(100-AVERAGEIF(T305:T316,\">0\"))/100","v":0.51178414970878805},{"$f":"100-(T300+U300+W300)","v":0},{"$f":"IF((S302+W302)>100,W302*100/(S302+W302),W302)","v":0},{"$f":"IF((X302+AB302)>100,X302*100/(X302+AB302),X302)","v":99.094035635638761},{"$f":"X300*AVERAGEIF(Y305:Y316,\">0\")/100","v":99.047367764186305},{"$f":"X300*(100-AVERAGEIF(Y305:Y316,\">0\"))/100","v":4.666787145244275E-2},{"$f":"100-(Y300+Z300+AB300)","v":9.5480634019295962E-2},{"$f":"IF((X302+AB302)>100,AB302*100/(X302+AB302),AB302)","v":0.8104837303419572}]
["Regression period:",null,{"$f":"MinRegYear(C299,C305:C316)","v":2001},{"$f":"IF(MAX(C305:C316)-MIN(C305:C316)<5,AVERAGEIF(C305:C316,\">0\",D305:D316),\nIF(FORECAST($C301,D$305:D$316,$C$305:$C$316)<0,0,\nIF(FORECAST($C301,D$305:D$316,$C$305:$C$316)>100,100,\nFORECAST($C301,D$305:D$316,$C$305:$C$316))))","v":70.210106232181261},null,null,null,{"$f":"IF(MAX(C305:C316)-MIN(C305:C316)<5,AVERAGEIF(C305:C316,\">0\",H305:H316),\nIF(FORECAST($C301,H$305:H$316,$C$305:$C$316)<0,0,\nIF(FORECAST($C301,H$305:H$316,$C$305:$C$316)>100,100,\nFORECAST($C301,H$305:H$316,$C$305:$C$316))))","v":21.455442527270861},{"$f":"IF(MAX(C305:C316)-MIN(C305:C316)<5,AVERAGEIF(C305:C316,\">0\",I305:I316),\nIF(FORECAST($C301,I$305:I$316,$C$305:$C$316)<0,0,\nIF(FORECAST($C301,I$305:I$316,$C$305:$C$316)>100,100,\nFORECAST($C301,I$305:I$316,$C$305:$C$316))))","v":78.536589916864614},null,null,null,{"$f":"IF(MAX(C305:C316)-MIN(C305:C316)<5,AVERAGEIF(C305:C316,\">0\",M305:M316),\nIF(FORECAST($C301,M$305:M$316,$C$305:$C$316)<0,0,\nIF(FORECAST($C301,M$305:M$316,$C$305:$C$316)>100,100,\nFORECAST($C301,M$305:M$316,$C$305:$C$316))))","v":17.823505410025064},{"$f":"IF(MAX(C305:C316)-MIN(C305:C316)<5,AVERAGEIF(C305:C316,\">0\",N305:N316),\nIF(FORECAST($C301,N$305:N$316,$C$305:$C$316)<0,0,\nIF(FORECAST($C301,N$305:N$316,$C$305:$C$316)>100,100,\nFORECAST($C301,N$305:N$316,$C$305:$C$316))))","v":88.325365448818729},null,null,null,{"$f":"IF(MAX(C305:C316)-MIN(C305:C316)<5,AVERAGEIF(C305:C316,\">0\",R305:R316),\nIF(FORECAST($C301,R$305:R$316,$C$305:$C$316)<0,0,\nIF(FORECAST($C301,R$305:R$316,$C$305:$C$316)>100,100,\nFORECAST($C301,R$305:R$316,$C$305:$C$316))))","v":9.7732827825252571},{"$f":"IF(MAX(C305:C316)-MIN(C305:C316)<5,AVERAGEIF(C305:C316,\">0\",S305:S316),\nIF(FORECAST($C301,S$305:S$316,$C$305:$C$316)<0,0,\nIF(FORECAST($C301,S$305:S$316,$C$305:$C$316)>100,100,\nFORECAST($C301,S$305:S$316,$C$305:$C$316))))","v":96.559187178628008},null,null,null,{"$f":"IF(MAX(C305:C316)-MIN(C305:C316)<5,AVERAGEIF(C305:C316,\">0\",W305:W316),\nIF(FORECAST($C301,W$305:W$316,$C$305:$C$316)<0,0,\nIF(FORECAST($C301,W$305:W$316,$C$305:$C$316)>100,100,\nFORECAST($C301,W$305:W$316,$C$305:$C$316))))","v":2.5629772413623186},{"$f":"IF(MAX(C305:C316)-MIN(C305:C316)<5,AVERAGEIF(C305:C316,\">0\",X305:X316),\nIF(FORECAST($C301,X$305:X$316,$C$305:$C$316)<0,0,\nIF(FORECAST($C301,X$305:X$316,$C$305:$C$316)>100,100,\nFORECAST($C301,X$305:X$316,$C$305:$C$316))))","v":99.386792619815424},null,null,null,{"$f":"IF(MAX(C305:C316)-MIN(C305:C316)<5,AVERAGEIF(C305:C316,\">0\",AB305:AB316),\nIF(FORECAST($C301,AB$305:AB$316,$C$305:$C$316)<0,0,\nIF(FORECAST($C301,AB$305:AB$316,$C$305:$C$316)>100,100,\nFORECAST($C301,AB$305:AB$316,$C$305:$C$316))))","v":0.20808883479885765}]
[null,null,{"$f":"MaxRegYear(C300,C305:C316)","v":2017},{"$f":"IF(MAX(C305:C316)-MIN(C305:C316)<5,AVERAGEIF(C305:C316,\">0\",D305:D316),\nIF(FORECAST($C302,D$305:D$316,$C$305:$C$316)<0,0,\nIF(FORECAST($C302,D$305:D$316,$C$305:$C$316)>100,100,\nFORECAST($C302,D$305:D$316,$C$305:$C$316))))","v":92.338759868718626},null,null,null,{"$f":"IF(MAX(C305:C316)-MIN(C305:C316)<5,AVERAGEIF(C305:C316,\">0\",H305:H316),\nIF(FORECAST($C302,H$305:H$316,$C$305:$C$316)<0,0,\nIF(FORECAST($C302,H$305:H$316,$C$305:$C$316)>100,100,\nFORECAST($C302,H$305:H$316,$C$305:$C$316))))","v":0},{"$f":"IF(MAX(C305:C316)-MIN(C305:C316)<5,AVERAGEIF(C305:C316,\">0\",I305:I316),\nIF(FORECAST($C302,I$305:I$316,$C$305:$C$316)<0,0,\nIF(FORECAST($C302,I$305:I$316,$C$305:$C$316)>100,100,\nFORECAST($C302,I$305:I$316,$C$305:$C$316))))","v":97.594586097927731},null,null,null,{"$f":"IF(MAX(C305:C316)-MIN(C305:C316)<5,AVERAGEIF(C305:C316,\">0\",M305:M316),\nIF(FORECAST($C302,M$305:M$316,$C$305:$C$316)<0,0,\nIF(FORECAST($C302,M$305:M$316,$C$305:$C$316)>100,100,\nFORECAST($C302,M$305:M$316,$C$305:$C$316))))","v":0},{"$f":"IF(MAX(C305:C316)-MIN(C305:C316)<5,AVERAGEIF(C305:C316,\">0\",N305:N316),\nIF(FORECAST($C302,N$305:N$316,$C$305:$C$316)<0,0,\nIF(FORECAST($C302,N$305:N$316,$C$305:$C$316)>100,100,\nFORECAST($C302,N$305:N$316,$C$305:$C$316))))","v":99.647214368925461},null,null,null,{"$f":"IF(MAX(C305:C316)-MIN(C305:C316)<5,AVERAGEIF(C305:C316,\">0\",R305:R316),\nIF(FORECAST($C302,R$305:R$316,$C$305:$C$316)<0,0,\nIF(FORECAST($C302,R$305:R$316,$C$305:$C$316)>100,100,\nFORECAST($C302,R$305:R$316,$C$305:$C$316))))","v":0},{"$f":"IF(MAX(C305:C316)-MIN(C305:C316)<5,AVERAGEIF(C305:C316,\">0\",S305:S316),\nIF(FORECAST($C302,S$305:S$316,$C$305:$C$316)<0,0,\nIF(FORECAST($C302,S$305:S$316,$C$305:$C$316)>100,100,\nFORECAST($C302,S$305:S$316,$C$305:$C$316))))","v":100},null,null,null,{"$f":"IF(MAX(C305:C316)-MIN(C305:C316)<5,AVERAGEIF(C305:C316,\">0\",W305:W316),\nIF(FORECAST($C302,W$305:W$316,$C$305:$C$316)<0,0,\nIF(FORECAST($C302,W$305:W$316,$C$305:$C$316)>100,100,\nFORECAST($C302,W$305:W$316,$C$305:$C$316))))","v":0},{"$f":"IF(MAX(C305:C316)-MIN(C305:C316)<5,AVERAGEIF(C305:C316,\">0\",X305:X316),\nIF(FORECAST($C302,X$305:X$316,$C$305:$C$316)<0,0,\nIF(FORECAST($C302,X$305:X$316,$C$305:$C$316)>100,100,\nFORECAST($C302,X$305:X$316,$C$305:$C$316))))","v":99.094035635638761},null,null,null,{"$f":"IF(MAX(C305:C316)-MIN(C305:C316)<5,AVERAGEIF(C305:C316,\">0\",AB305:AB316),\nIF(FORECAST($C302,AB$305:AB$316,$C$305:$C$316)<0,0,\nIF(FORECAST($C302,AB$305:AB$316,$C$305:$C$316)>100,100,\nFORECAST($C302,AB$305:AB$316,$C$305:$C$316))))","v":0.8104837303419572}]
[]
[null,"Survey","Year","Improved","% Improved\n< = 30min",null,null,"Surface water","Improved","% Improved\n< = 30min",null,null,"Surface water","Improved","% Improved\n< = 30min",null,null,"Surface water","Improved","% Improved\n< = 30min",null,null,"Surface water","Improved","% Improved\n< = 30min",null,null,"Surface water"]
[null,"WHS03",2003,{"$f":"IF(ISERROR(INDIRECT(CONCATENATE($B305,\"!M16\"))),\"\",INDIRECT(CONCATENATE($B305,\"!M16\")))","v":72.976187936748261},{"$f":"IF(ISERROR(INDIRECT(CONCATENATE($B305,\"!M23\"))),\"\",INDIRECT(CONCATENATE($B305,\"!M23\")))","v":"N/A"},null,null,{"$f":"IF(ISERROR(INDIRECT(CONCATENATE($B305,\"!M21\"))),\"\",INDIRECT(CONCATENATE($B305,\"!M21\")))","v":18.538961939767315},{"$f":"IF(ISERROR(INDIRECT(CONCATENATE($B305,\"!N16\"))),\"\",INDIRECT(CONCATENATE($B305,\"!N16\")))","v":80.918839439497731},{"$f":"IF(ISERROR(INDIRECT(CONCATENATE($B305,\"!N23\"))),\"\",INDIRECT(CONCATENATE($B305,\"!N23\")))","v":"N/A"},null,null,{"$f":"IF(ISERROR(INDIRECT(CONCATENATE($B305,\"!N21\"))),\"\",INDIRECT(CONCATENATE($B305,\"!N21\")))","v":15.313947486800302},{"$f":"IF(ISERROR(INDIRECT(CONCATENATE($B305,\"!O16\"))),\"\",INDIRECT(CONCATENATE($B305,\"!O16\")))","v":89.740596563832028},{"$f":"IF(ISERROR(INDIRECT(CONCATENATE($B305,\"!O23\"))),\"\",INDIRECT(CONCATENATE($B305,\"!O23\")))","v":"N/A"},null,null,{"$f":"IF(ISERROR(INDIRECT(CONCATENATE($B305,\"!O21\"))),\"\",INDIRECT(CONCATENATE($B305,\"!O21\")))","v":8.3770995278788405},{"$f":"IF(ISERROR(INDIRECT(CONCATENATE($B305,\"!P16\"))),\"\",INDIRECT(CONCATENATE($B305,\"!P16\")))","v":97.008243005519276},{"$f":"IF(ISERROR(INDIRECT(CONCATENATE($B305,\"!P23\"))),\"\",INDIRECT(CONCATENATE($B305,\"!P23\")))","v":"N/A"},null,null,{"$f":"IF(ISERROR(INDIRECT(CONCATENATE($B305,\"!P21\"))),\"\",INDIRECT(CONCATENATE($B305,\"!P21\")))","v":2.2186410996080106},{"$f":"IF(ISERROR(INDIRECT(CONCATENATE($B305,\"!Q16\"))),\"\",INDIRECT(CONCATENATE($B305,\"!Q16\")))","v":99.350197996793355},{"$f":"IF(ISERROR(INDIRECT(CONCATENATE($B305,\"!Q23\"))),\"\",INDIRECT(CONCATENATE($B305,\"!Q23\")))","v":"N/A"},null,null,{"$f":"IF(ISERROR(INDIRECT(CONCATENATE($B305,\"!Q221\"))),\"\",INDIRECT(CONCATENATE($B305,\"!Q21\")))","v":0.2833881967417336}]
[null,"ENG12",null,89.600917970742486,"N/A",null,null,1.0400784147461297,94.462651086171661,"N/A",null,null,0.25659994745111198,98.078127437425906,"N/A",null,null,0,99.307578103459178,"N/A",null,null,0.15262424908184707,99.51525367342623,"N/A",null,null,0.73518436839905965]
[null,"MICS15",2015,89.572678164151327,94.971770827033453,null,null,1.0400784147461297,95.212336575295012,99.235486046618419,null,null,0.25659994745111198,98.231983253911949,98.573597003730455,null,null,0,99.702577966866812,99.488215850291212,null,null,0.15262424908184707,99.130630258660858,99.952905468878029,null,null,0.73518436839905965]
[null,null,null,"","",null,null,"","","",null,null,"","","",null,null,"","","",null,null,"","","",null,null,""]
[null,null,null,"","",null,null,"","","",null,null,"","","",null,null,"","","",null,null,"","","",null,null,""]
[null,null,null,"","",null,null,"","","",null,null,"","","",null,null,"","","",null,null,"","","",null,null,""]
[null,null,null,"","",null,null,"","","",null,null,"","","",null,null,"","","",null,null,"","","",null,null,""]
[null,null,null,"","",null,null,"","","",null,null,"","","",null,null,"","","",null,null,"","","",null,null,""]
[null,null,null,"","",null,null,"","","",null,null,"","","",null,null,"","","",null,null,"","","",null,null,""]
[null,null,null,"","",null,null,"","","",null,null,"","","",null,null,"","","",null,null,"","","",null,null,""]
[null,null,null,"","",null,null,"","","",null,null,"","","",null,null,"","","",null,null,"","","",null,null,""]
[null,null,null,"","",null,null,"","","",null,null,"","","",null,null,"","","",null,null,"","","",null,null,""]
[]
[null,{"$f":"CONCATENATE(\"Rural use of drinking water sources, \",C299,\"–\",C300)","v":"Rural use of drinking water sources, 2000–2020"},null,null,null,null,null,null,null,null,null,null,null,null,null,null,null,null,"Data points used for regression"]

{"sheet":"Sanitation","index":2,"n_rows":318,"n_cols":28,"rows_kept":318,"cut":false,"hidden":false,"merged":[[298,0,299,1],[300,0,301,1],[317,18,317,22],[196,23,196,27],[198,0,199,1],[200,0,201,1],[217,18,217,22],[296,0,297,2],[296,3,296,7],[296,8,296,12],[296,13,296,17],[296,18,296,22],[296,23,296,27],[217,1,217,11],[317,1,317,11],[98,0,99,1],[100,0,101,1],[117,18,117,22],[196,0,197,2],[196,3,196,7],[196,8,196,12],[196,13,196,17],[196,18,196,22],[117,1,117,11],[96,23,96,27],[32,1,33,2],[32,3,33,3],[35,1,36,2],[35,3,36,3],[38,1,39,2],[38,3,39,3],[96,0,97,2],[96,3,96,7],[96,8,96,12],[96,13,96,17],[96,18,96,22],[30,21,30,24],[4,1,4,24],[3,1,3,24],[6,1,6,8],[6,9,6,16],[6,17,6,24],[30,1,31,4],[30,5,30,8],[30,9,30,12],[30,13,30,16],[30,17,30,20]]}
[]
[]
[]
[null,"Summary of trends in use of sanitation facilities by wealth quintile (%)"]
[null,{"$f":"IF(ISERROR(INDIRECT(CONCATENATE($B105,\"!A2\"))),\"\",INDIRECT(CONCATENATE($B105,\"!A2\")))","v":"Mexico"}]
[]
[null,{"$f":"B118","v":"National use of sanitation facilities, 2000–2020"},null,null,null,null,null,null,null,{"$f":"B218","v":"Urban use of sanitation facilities, 2000–2020"},null,null,null,null,null,null,null,{"$f":"B318","v":"Rural use of sanitation facilities, 2000–2020"}]
[]
[]
[]
[]
[]
[]
[]
[]
[]
[]
[]
[]
[]
[]
[]
[]
[]
[]
[]
[]
[]
[]
[]
[null,{"$f":"IF(ISERROR(INDIRECT(CONCATENATE($B105,\"!A2\"))),\"\",INDIRECT(CONCATENATE($B105,\"!A2\")))","v":"Mexico"},null,null,null,"Poorest",null,null,null,"Poor",null,null,null,"Middle",null,null,null,"Rich",null,null,null,"Richest"]
[null,null,null,null,null,"Basic","Limited","Unimproved","Open defecation","Basic","Limited","Unimproved","Open defecation","Basic","Limited","Unimproved","Open defecation","Basic","Limited","Unimproved","Open defecation","Basic","Limited","Unimproved","Open defecation"]
[null,"NATIONAL",null,"Estimate",{"$f":"C99","v":2000},{"$f":"E99","v":66.829241895163662},{"$f":"F99","v":9.1750775562607458},5.6882874394234477,18.307393109152144,{"$f":"J99","v":89.667421011587891},{"$f":"K99","v":6.3939108494367565},1.0772366028638913,2.8614315361114677,{"$f":"O99","v":96.415582642908987},{"$f":"P99","v":2.7433593577082336},0.2671623634688558,0.573895635913928,{"$f":"T99","v":98.01436250969104},{"$f":"U99","v":1.5831728566794021},0.12931857452772988,0.27314605910182621,{"$f":"Y99","v":99.571715505943303},{"$f":"Z99","v":0.32069865517002344},4.4687902318301553E-2,6.2897936568374391E-2]
[null,null,null,null,{"$f":"C100","v":2020},{"$f":"E100","v":80.471801327384796},11.048083104533831,4.0149490847743436,4.4651664833070299,{"$f":"J100","v":91.018491539123957},6.490251576167938,1.3936113148861722,1.0976455698219354,{"$f":"O100","v":96.75316962255414},2.7529648838510359,0.45419564060973983,3.9669852985085186E-2,{"$f":"T100","v":98.076922477970044},1.5841833539285601,0.33889416810139039,0,{"$f":"Y100","v":99.280218359560664},0.3197598067997226,0.40002183363961308,0]
[]
[null,"URBAN",null,"Estimate",{"$f":"C199","v":2000},{"$f":"E199","v":81.836381631978597},{"$f":"F199","v":12.049271429552689},1.1044839441989609,5.0098629942697528,{"$f":"J199","v":95.294759554214977},{"$f":"K199","v":3.8900844752506871},0.11773622050591825,0.69741975002842338,{"$f":"O199","v":97.142519663417957},{"$f":"P199","v":2.5997519114663055},0.126455740774432,0.13127268434130634,{"$f":"T199","v":98.457104766345381},{"$f":"U199","v":1.4107139417493695},7.3450955875557611E-2,5.8730336029701569E-2,{"$f":"Y199","v":99.798923473704278},{"$f":"Z199","v":0.19446304006754506},2.9412547192464444E-3,3.6722315089257052E-3]
[null,null,null,null,{"$f":"C200","v":2020},{"$f":"E200","v":83.111515961662704},12.237017262654144,1.4820253619582928,3.1694414137248543,{"$f":"J200","v":94.954187848705047},3.8761817936078411,0.77273647151488944,0.3968938861722151,{"$f":"O200","v":96.931908947908312},2.5941154958975243,0.42449862305369379,4.9476933140470081E-2,{"$f":"T200","v":98.404950441244424},1.4099666636964849,0.16286739701655506,2.2215498042541526E-2,{"$f":"Y200","v":99.331421222416665},0.19355208926908521,0.45666553076961236,1.836115754462786E-2]
[]
[null,"RURAL",null,"Estimate",{"$f":"C299","v":2000},{"$f":"E299","v":54.392208393418052},{"$f":"F299","v":5.8552664360500009},12.641540863228329,27.110984307303625,{"$f":"J299","v":64.255248276758621},{"$f":"K299","v":6.3789833554729816},4.5868145725498835,24.778953795218513,{"$f":"O299","v":73.786508577709242},{"$f":"P299","v":5.8228179092799408},5.312552754005992,15.078120759004833,{"$f":"T299","v":86.528798058447251},{"$f":"U299","v":3.2001488677643706},2.9039115983554211,7.3671414754329589,{"$f":"Y299","v":95.862336797420397},{"$f":"Z299","v":1.0600456858621505},0.41366994028879844,2.6639475764286544]
[null,null,null,null,{"$f":"C300","v":2020},{"$f":"E300","v":75.154534391441885},8.0903099127047984,8.2371815851993233,8.517974110653995,{"$f":"J300","v":85.335752063405906},8.4717646672938134,3.3011242420870985,2.8913590272131842,{"$f":"O300","v":87.913536830930738},6.9376438402444016,4.102953379647488,1.0458659491773687,{"$f":"T300","v":95.565646387767586},3.5343643035282981,0.89998930870412153,0,{"$f":"Y300","v":98.504557432418366},1.0892633606945976,0.4061792068870318,0]
[]
[]
[]
[]
[]
[]
[]
[]
[]
[]
[]
[]
[]
[]
[]
[]
[]
[]
[]
[]
[]
[]
[]
[]
[]
[]
[]
[]
[]
[]
[]
[]
[]
[]
[]
[]
[]
[]
[]
[]
[]
[]
[]
[]
[]
[]
[]
[]
[]
[]
[]
[]
[]
[]
[]
[]
["NATIONAL",null,null,"Poorest",null,null,null,null,"Poor",null,null,null,null,"Middle",null,null,null,null,"Rich",null,null,null,null,"Richest"]
[null,null,null,"Improved","Basic","Limited","Unimproved","Open defecation","Improved","Basic","Limited","Unimproved","Open defecation","Improved","Basic","Limited","Unimproved","Open defecation","Improved","Basic","Limited","Unimproved","Open defecation","Improved","Basic","Limited","Unimproved","Open defecation"]
["Forecast period:",null,2000,{"$f":"IF((D101+H101)>100,D101*100/(D101+H101),D101)","v":76.004319451424408},{"$f":"D99*AVERAGEIF(E105:E116,\">0\")/100","v":66.829241895163662},{"$f":"D99*(100-AVERAGEIF(E105:E116,\">0\"))/100","v":9.1750775562607458},{"$f":"100-(E99+F99+H99)","v":5.6882874394234477},{"$f":"IF((D101+H101)>100,H101*100/(D101+H101),H101)","v":18.307393109152144},{"$f":"IF((I101+M101)>100,I101*100/(I101+M101),I101)","v":96.061331861024641},{"$f":"I99*AVERAGEIF(J105:J116,\">0\")/100","v":89.667421011587891},{"$f":"I99*(100-AVERAGEIF(J105:J116,\">0\"))/100","v":6.3939108494367565},{"$f":"100-(J99+K99+M99)","v":1.0772366028638913},{"$f":"IF((I101+M101)>100,M101*100/(I101+M101),M101)","v":2.8614315361114677},{"$f":"IF((N101+R101)>100,N101*100/(N101+R101),N101)","v":99.15894200061723},{"$f":"N99*AVERAGEIF(O105:O116,\">0\")/100","v":96.415582642908987},{"$f":"N99*(100-AVERAGEIF(O105:O116,\">0\"))/100","v":2.7433593577082336},{"$f":"100-(O99+P99+R99)","v":0.2671623634688558},{"$f":"IF((N101+R101)>100,R101*100/(N101+R101),R101)","v":0.573895635913928},{"$f":"IF((S101+W101)>100,S101*100/(S101+W101),S101)","v":99.597535366370437},{"$f":"S99*AVERAGEIF(T105:T116,\">0\")/100","v":98.01436250969104},{"$f":"S99*(100-AVERAGEIF(T105:T116,\">0\"))/100","v":1.5831728566794021},{"$f":"100-(T99+U99+W99)","v":0.12931857452772988},{"$f":"IF((S101+W101)>100,W101*100/(S101+W101),W101)","v":0.27314605910182621},{"$f":"IF((X101+AB101)>100,X101*100/(X101+AB101),X101)","v":99.892414161113322},{"$f":"X99*AVERAGEIF(Y105:Y116,\">0\")/100","v":99.571715505943303},{"$f":"X99*(100-AVERAGEIF(Y105:Y116,\">0\"))/100","v":0.32069865517002344},{"$f":"100-(Y99+Z99+AB99)","v":4.4687902318301553E-2},{"$f":"IF((X101+AB101)>100,AB101*100/(X101+AB101),AB101)","v":6.2897936568374391E-2}]
[null,null,2020,{"$f":"IF((D102+H102)>100,D102*100/(D102+H102),D102)","v":91.519884431918626},{"$f":"D100*AVERAGEIF(E105:E116,\">0\")/100","v":80.471801327384796},{"$f":"D100*(100-AVERAGEIF(E105:E116,\">0\"))/100","v":11.048083104533831},{"$f":"100-(E100+F100+H100)","v":4.0149490847743436},{"$f":"IF((D102+H102)>100,H102*100/(D102+H102),H102)","v":4.4651664833070299},{"$f":"IF((I102+M102)>100,I102*100/(I102+M102),I102)","v":97.508743115291892},{"$f":"I100*AVERAGEIF(J105:J116,\">0\")/100","v":91.018491539123957},{"$f":"I100*(100-AVERAGEIF(J105:J116,\">0\"))/100","v":6.490251576167938},{"$f":"100-(J100+K100+M100)","v":1.3936113148861722},{"$f":"IF((I102+M102)>100,M102*100/(I102+M102),M102)","v":1.0976455698219354},{"$f":"IF((N102+R102)>100,N102*100/(N102+R102),N102)","v":99.506134506405175},{"$f":"N100*AVERAGEIF(O105:O116,\">0\")/100","v":96.75316962255414},{"$f":"N100*(100-AVERAGEIF(O105:O116,\">0\"))/100","v":2.7529648838510359},{"$f":"100-(O100+P100+R100)","v":0.45419564060973983},{"$f":"IF((N102+R102)>100,R102*100/(N102+R102),R102)","v":3.9669852985085186E-2},{"$f":"IF((S102+W102)>100,S102*100/(S102+W102),S102)","v":99.661105831898595},{"$f":"S100*AVERAGEIF(T105:T116,\">0\")/100","v":98.076922477970044},{"$f":"S100*(100-AVERAGEIF(T105:T116,\">0\"))/100","v":1.5841833539285601},{"$f":"100-(T100+U100+W100)","v":0.33889416810139039},{"$f":"IF((S102+W102)>100,W102*100/(S102+W102),W102)","v":0},{"$f":"IF((X102+AB102)>100,X102*100/(X102+AB102),X102)","v":99.599978166360387},{"$f":"X100*AVERAGEIF(Y105:Y116,\">0\")/100","v":99.280218359560664},{"$f":"X100*(100-AVERAGEIF(Y105:Y116,\">0\"))/100","v":0.3197598067997226},{"$f":"100-(Y100+Z100+AB100)","v":0.40002183363961308},{"$f":"IF((X102+AB102)>100,AB102*100/(X102+AB102),AB102)","v":0}]
["Regression period:",null,{"$f":"MinRegYear(C99,C105:C116)","v":2001},{"$f":"IF(MAX(C105:C116)-MIN(C105:C116)<5,AVERAGEIF(C105:C116,\">0\",D105:D116),\nIF(FORECAST($C101,D$105:D$116,$C$105:$C$116)<0,0,\nIF(FORECAST($C101,D$105:D$116,$C$105:$C$116)>100,100,\nFORECAST($C101,D$105:D$116,$C$105:$C$116))))","v":76.004319451424408},null,null,null,{"$f":"IF(MAX(C105:C116)-MIN(C105:C116)<5,AVERAGEIF(C105:C116,\">0\",H105:H116),\nIF(FORECAST($C101,H$105:H$116,$C$105:$C$116)<0,0,\nIF(FORECAST($C101,H$105:H$116,$C$105:$C$116)>100,100,\nFORECAST($C101,H$105:H$116,$C$105:$C$116))))","v":18.307393109152144},{"$f":"IF(MAX(C105:C116)-MIN(C105:C116)<5,AVERAGEIF(C105:C116,\">0\",I105:I116),\nIF(FORECAST($C101,I$105:I$116,$C$105:$C$116)<0,0,\nIF(FORECAST($C101,I$105:I$116,$C$105:$C$116)>100,100,\nFORECAST($C101,I$105:I$116,$C$105:$C$116))))","v":96.061331861024641},null,null,null,{"$f":"IF(MAX(C105:C116)-MIN(C105:C116)<5,AVERAGEIF(C105:C116,\">0\",M105:M116),\nIF(FORECAST($C101,M$105:M$116,$C$105:$C$116)<0,0,\nIF(FORECAST($C101,M$105:M$116,$C$105:$C$116)>100,100,\nFORECAST($C101,M$105:M$116,$C$105:$C$116))))","v":2.8614315361114677},{"$f":"IF(MAX(C105:C116)-MIN(C105:C116)<5,AVERAGEIF(C105:C116,\">0\",N105:N116),\nIF(FORECAST($C101,N$105:N$116,$C$105:$C$116)<0,0,\nIF(FORECAST($C101,N$105:N$116,$C$105:$C$116)>100,100,\nFORECAST($C101,N$105:N$116,$C$105:$C$116))))","v":99.15894200061723},null,null,null,{"$f":"IF(MAX(C105:C116)-MIN(C105:C116)<5,AVERAGEIF(C105:C116,\">0\",R105:R116),\nIF(FORECAST($C101,R$105:R$116,$C$105:$C$116)<0,0,\nIF(FORECAST($C101,R$105:R$116,$C$105:$C$116)>100,100,\nFORECAST($C101,R$105:R$116,$C$105:$C$116))))","v":0.573895635913928},{"$f":"IF(MAX(C105:C116)-MIN(C105:C116)<5,AVERAGEIF(C105:C116,\">0\",S105:S116),\nIF(FORECAST($C101,S$105:S$116,$C$105:$C$116)<0,0,\nIF(FORECAST($C101,S$105:S$116,$C$105:$C$116)>100,100,\nFORECAST($C101,S$105:S$116,$C$105:$C$116))))","v":99.597535366370437},null,null,null,{"$f":"IF(MAX(C105:C116)-MIN(C105:C116)<5,AVERAGEIF(C105:C116,\">0\",W105:W116),\nIF(FORECAST($C101,W$105:W$116,$C$105:$C$116)<0,0,\nIF(FORECAST($C101,W$105:W$116,$C$105:$C$116)>100,100,\nFORECAST($C101,W$105:W$116,$C$105:$C$116))))","v":0.27314605910182621},{"$f":"IF(MAX(C105:C116)-MIN(C105:C116)<5,AVERAGEIF(C105:C116,\">0\",X105:X116),\nIF(FORECAST($C101,X$105:X$116,$C$105:$C$116)<0,0,\nIF(FORECAST($C101,X$105:X$116,$C$105:$C$116)>100,100,\nFORECAST($C101,X$105:X$116,$C$105:$C$116))))","v":99.892414161113322},null,null,null,{"$f":"IF(MAX(C105:C116)-MIN(C105:C116)<5,AVERAGEIF(C105:C116,\">0\",AB105:AB116),\nIF(FORECAST($C101,AB$105:AB$116,$C$105:$C$116)<0,0,\nIF(FORECAST($C101,AB$105:AB$116,$C$105:$C$116)>100,100,\nFORECAST($C101,AB$105:AB$116,$C$105:$C$116))))","v":6.2897936568374391E-2}]
[null,null,{"$f":"MaxRegYear(C100,C105:C116)","v":2017},{"$f":"IF(MAX(C105:C116)-MIN(C105:C116)<5,AVERAGEIF(C105:C116,\">0\",D105:D116),\nIF(FORECAST($C102,D$105:D$116,$C$105:$C$116)<0,0,\nIF(FORECAST($C102,D$105:D$116,$C$105:$C$116)>100,100,\nFORECAST($C102,D$105:D$116,$C$105:$C$116))))","v":91.519884431918626},null,null,null,{"$f":"IF(MAX(C105:C116)-MIN(C105:C116)<5,AVERAGEIF(C105:C116,\">0\",H105:H116),\nIF(FORECAST($C102,H$105:H$116,$C$105:$C$116)<0,0,\nIF(FORECAST($C102,H$105:H$116,$C$105:$C$116)>100,100,\nFORECAST($C102,H$105:H$116,$C$105:$C$116))))","v":4.4651664833070299},{"$f":"IF(MAX(C105:C116)-MIN(C105:C116)<5,AVERAGEIF(C105:C116,\">0\",I105:I116),\nIF(FORECAST($C102,I$105:I$116,$C$105:$C$116)<0,0,\nIF(FORECAST($C102,I$105:I$116,$C$105:$C$116)>100,100,\nFORECAST($C102,I$105:I$116,$C$105:$C$116))))","v":97.508743115291892},null,null,null,{"$f":"IF(MAX(C105:C116)-MIN(C105:C116)<5,AVERAGEIF(C105:C116,\">0\",M105:M116),\nIF(FORECAST($C102,M$105:M$116,$C$105:$C$116)<0,0,\nIF(FORECAST($C102,M$105:M$116,$C$105:$C$116)>100,100,\nFORECAST($C102,M$105:M$116,$C$105:$C$116))))","v":1.0976455698219354},{"$f":"IF(MAX(C105:C116)-MIN(C105:C116)<5,AVERAGEIF(C105:C116,\">0\",N105:N116),\nIF(FORECAST($C102,N$105:N$116,$C$105:$C$116)<0,0,\nIF(FORECAST($C102,N$105:N$116,$C$105:$C$116)>100,100,\nFORECAST($C102,N$105:N$116,$C$105:$C$116))))","v":99.506134506405175},null,null,null,{"$f":"IF(MAX(C105:C116)-MIN(C105:C116)<5,AVERAGEIF(C105:C116,\">0\",R105:R116),\nIF(FORECAST($C102,R$105:R$116,$C$105:$C$116)<0,0,\nIF(FORECAST($C102,R$105:R$116,$C$105:$C$116)>100,100,\nFORECAST($C102,R$105:R$116,$C$105:$C$116))))","v":3.9669852985085186E-2},{"$f":"IF(MAX(C105:C116)-MIN(C105:C116)<5,AVERAGEIF(C105:C116,\">0\",S105:S116),\nIF(FORECAST($C102,S$105:S$116,$C$105:$C$116)<0,0,\nIF(FORECAST($C102,S$105:S$116,$C$105:$C$116)>100,100,\nFORECAST($C102,S$105:S$116,$C$105:$C$116))))","v":99.661105831898595},null,null,null,{"$f":"IF(MAX(C105:C116)-MIN(C105:C116)<5,AVERAGEIF(C105:C116,\">0\",W105:W116),\nIF(FORECAST($C102,W$105:W$116,$C$105:$C$116)<0,0,\nIF(FORECAST($C102,W$105:W$116,$C$105:$C$116)>100,100,\nFORECAST($C102,W$105:W$116,$C$105:$C$116))))","v":0},{"$f":"IF(MAX(C105:C116)-MIN(C105:C116)<5,AVERAGEIF(C105:C116,\">0\",X105:X116),\nIF(FORECAST($C102,X$105:X$116,$C$105:$C$116)<0,0,\nIF(FORECAST($C102,X$105:X$116,$C$105:$C$116)>100,100,\nFORECAST($C102,X$105:X$116,$C$105:$C$116))))","v":99.599978166360387},null,null,null,{"$f":"IF(MAX(C105:C116)-MIN(C105:C116)<5,AVERAGEIF(C105:C116,\">0\",AB105:AB116),\nIF(FORECAST($C102,AB$105:AB$116,$C$105:$C$116)<0,0,\nIF(FORECAST($C102,AB$105:AB$116,$C$105:$C$116)>100,100,\nFORECAST($C102,AB$105:AB$116,$C$105:$C$116))))","v":0}]
[]
[null,"Survey","Year","Improved","Not shared",null,null,"Open defecation","Improved","Not shared",null,null,"Open defecation","Improved","Not shared",null,null,"Open defecation","Improved","Not shared",null,null,"Open defecation","Improved","Not shared",null,null,"Open defecation"]
[null,"WHS03",2003,{"$f":"IF(ISERROR(INDIRECT(CONCATENATE($B105,\"!C122\"))),\"\",INDIRECT(CONCATENATE($B105,\"!C122\")))","v":78.687664968942755},{"$f":"IF(ISERROR(INDIRECT(CONCATENATE($B105,\"!C129\"))),\"\",INDIRECT(CONCATENATE($B105,\"!C129\")))","v":"N/A"},null,null,{"$f":"IF(ISERROR(INDIRECT(CONCATENATE($B105,\"!C127\"))),\"\",INDIRECT(CONCATENATE($B105,\"!C127\")))","v":15.714045699554369},{"$f":"IF(ISERROR(INDIRECT(CONCATENATE($B105,\"!D122\"))),\"\",INDIRECT(CONCATENATE($B105,\"!D122\")))","v":96.457227049284882},{"$f":"IF(ISERROR(INDIRECT(CONCATENATE($B105,\"!D129\"))),\"\",INDIRECT(CONCATENATE($B105,\"!D129\")))","v":"N/A"},null,null,{"$f":"IF(ISERROR(INDIRECT(CONCATENATE($B105,\"!D127\"))),\"\",INDIRECT(CONCATENATE($B105,\"!D127\")))","v":2.3161600996064564},{"$f":"IF(ISERROR(INDIRECT(CONCATENATE($B105,\"!E122\"))),\"\",INDIRECT(CONCATENATE($B105,\"!E122\")))","v":99.301775477890146},{"$f":"IF(ISERROR(INDIRECT(CONCATENATE($B105,\"!E129\"))),\"\",INDIRECT(CONCATENATE($B105,\"!E129\")))","v":"N/A"},null,null,{"$f":"IF(ISERROR(INDIRECT(CONCATENATE($B105,\"!E127\"))),\"\",INDIRECT(CONCATENATE($B105,\"!E127\")))","v":0.47433858657623179},{"$f":"IF(ISERROR(INDIRECT(CONCATENATE($B105,\"!F122\"))),\"\",INDIRECT(CONCATENATE($B105,\"!F122\")))","v":99.712290388904592},{"$f":"IF(ISERROR(INDIRECT(CONCATENATE($B105,\"!F129\"))),\"\",INDIRECT(CONCATENATE($B105,\"!F129\")))","v":"N/A"},null,null,{"$f":"IF(ISERROR(INDIRECT(CONCATENATE($B105,\"!F127\"))),\"\",INDIRECT(CONCATENATE($B105,\"!F127\")))","v":0.23055648306393575},{"$f":"IF(ISERROR(INDIRECT(CONCATENATE($B105,\"!G122\"))),\"\",INDIRECT(CONCATENATE($B105,\"!G122\")))","v":99.87845050967654},{"$f":"IF(ISERROR(INDIRECT(CONCATENATE($B105,\"!G129\"))),\"\",INDIRECT(CONCATENATE($B105,\"!G129\")))","v":"N/A"},null,null,{"$f":"IF(ISERROR(INDIRECT(CONCATENATE($B105,\"!G2127\"))),\"\",INDIRECT(CONCATENATE($B105,\"!G127\")))","v":5.2639168887053035E-2}]
[null,"ENG12",2012,83.695670795688059,"N/A",null,null,12.243138629352654,96.196551972425993,"N/A",null,null,2.9480214471626827,98.999899192148732,"N/A",null,null,0.33773071603671834,99.214005204048476,"N/A",null,null,9.8233202156572927E-2,99.60100102309147,"N/A",null,null,2.764412767319583E-2]
[null,"MICS15",2015,91.812138494226517,87.928215629738403,null,null,3.6062375674359748,97.972723052938989,93.343928586491955,null,null,0.34372424345168434,99.761038685329964,97.233371693607666,null,null,8.1115964364114057E-3,99.973585666736994,98.410429684975952,null,null,0,99.704305209426451,99.678955946892245,null,null,0]
[null,null,null,"","",null,null,"","","",null,null,"","","",null,null,"","","",null,null,"","","",null,null,""]
[null,null,null,"","",null,null,"","","",null,null,"","","",null,null,"","","",null,null,"","","",null,null,""]
[null,null,null,"","",null,null,"","","",null,null,"","","",null,null,"","","",null,null,"","","",null,null,""]
[null,null,null,"","",null,null,"","","",null,null,"","","",null,null,"","","",null,null,"","","",null,null,""]
[null,null,null,"","",null,null,"","","",null,null,"","","",null,null,"","","",null,null,"","","",null,null,""]
[null,null,null,"","",null,null,"","","",null,null,"","","",null,null,"","","",null,null,"","","",null,null,""]
[null,null,null,"","",null,null,"","","",null,null,"","","",null,null,"","","",null,null,"","","",null,null,""]
[null,null,null,"","",null,null,"","","",null,null,"","","",null,null,"","","",null,null,"","","",null,null,""]
[null,null,null,"","",null,null,"","","",null,null,"","","",null,null,"","","",null,null,"","","",null,null,""]
[]
[null,{"$f":"CONCATENATE(\"National use of sanitation facilities, \",C99,\"–\",C100)","v":"National use of sanitation facilities, 2000–2020"},null,null,null,null,null,null,null,null,null,null,null,null,null,null,null,null,"Data points used for regression"]
[]
[]
[]
[]
[]
[]
[]
[]
[]
[]
[]
[]
[]
[]
[]
[]
[]
[]
[]
[]
[]
[]
[]
[]
[]
[]
[]
[]
[]
[]
[]
[]
[]
[]
[]
[]
[]
[]
[]
[]
[]
[]
[]
[]
[]
[]
[]
[]
[]
[]
[]
[]
[]
[]
[]
[]
[]
[]
[]
[]
[]
[]
[]
[]
[]
[]
[]
[]
[]
[]
[]
[]
[]
[]
[]
[]
[]
[]
["URBAN",null,null,"Poorest",null,null,null,null,"Poor",null,null,null,null,"Middle",null,null,null,null,"Rich",null,null,null,null,"Richest"]
[null,null,null,"Improved","Basic","Limited","Unimproved","Open defecation","Improved","Basic","Limited","Unimproved","Open defecation","Improved","Basic","Limited","Unimproved","Open defecation","Improved","Basic","Limited","Unimproved","Open defecation","Improved","Basic","Limited","Unimproved","Open defecation"]
["Forecast period:",null,2000,{"$f":"IF((D201+H201)>100,D201*100/(D201+H201),D201)","v":93.885653061531286},{"$f":"D199*AVERAGEIF(E205:E216,\">0\")/100","v":81.836381631978597},{"$f":"D199*(100-AVERAGEIF(E205:E216,\">0\"))/100","v":12.049271429552689},{"$f":"100-(E199+F199+H199)","v":1.1044839441989609},{"$f":"IF((D201+H201)>100,H201*100/(D201+H201),H201)","v":5.0098629942697528},{"$f":"IF((I201+M201)>100,I201*100/(I201+M201),I201)","v":99.184844029465665},{"$f":"I199*AVERAGEIF(J205:J216,\">0\")/100","v":95.294759554214977},{"$f":"I199*(100-AVERAGEIF(J205:J216,\">0\"))/100","v":3.8900844752506871},{"$f":"100-(J199+K199+M199)","v":0.11773622050591825},{"$f":"IF((I201+M201)>100,M201*100/(I201+M201),M201)","v":0.69741975002842338},{"$f":"IF((N201+R201)>100,N201*100/(N201+R201),N201)","v":99.742271574884256},{"$f":"N199*AVERAGEIF(O205:O216,\">0\")/100","v":97.142519663417957},{"$f":"N199*(100-AVERAGEIF(O205:O216,\">0\"))/100","v":2.5997519114663055},{"$f":"100-(O199+P199+R199)","v":0.126455740774432},{"$f":"IF((N201+R201)>100,R201*100/(N201+R201),R201)","v":0.13127268434130634},{"$f":"IF((S201+W201)>100,S201*100/(S201+W201),S201)","v":99.867818708094745},{"$f":"S199*AVERAGEIF(T205:T216,\">0\")/100","v":98.457104766345381},{"$f":"S199*(100-AVERAGEIF(T205:T216,\">0\"))/100","v":1.4107139417493695},{"$f":"100-(T199+U199+W199)","v":7.3450955875557611E-2},{"$f":"IF((S201+W201)>100,W201*100/(S201+W201),W201)","v":5.8730336029701569E-2},{"$f":"IF((X201+AB201)>100,X201*100/(X201+AB201),X201)","v":99.99338651377181},{"$f":"X199*AVERAGEIF(Y205:Y216,\">0\")/100","v":99.798923473704278},{"$f":"X199*(100-AVERAGEIF(Y205:Y216,\">0\"))/100","v":0.19446304006754506},{"$f":"100-(Y199+Z199+AB199)","v":2.9412547192464444E-3},{"$f":"IF((X201+AB201)>100,AB201*100/(X201+AB201),AB201)","v":3.6722315089257052E-3}]
[null,null,2020,{"$f":"IF((D202+H202)>100,D202*100/(D202+H202),D202)","v":95.348533224316839},{"$f":"D200*AVERAGEIF(E205:E216,\">0\")/100","v":83.111515961662704},{"$f":"D200*(100-AVERAGEIF(E205:E216,\">0\"))/100","v":12.237017262654144},{"$f":"100-(E200+F200+H200)","v":1.4820253619582928},{"$f":"IF((D202+H202)>100,H202*100/(D202+H202),H202)","v":3.1694414137248543},{"$f":"IF((I202+M202)>100,I202*100/(I202+M202),I202)","v":98.830369642312888},{"$f":"I200*AVERAGEIF(J205:J216,\">0\")/100","v":94.954187848705047},{"$f":"I200*(100-AVERAGEIF(J205:J216,\">0\"))/100","v":3.8761817936078411},{"$f":"100-(J200+K200+M200)","v":0.77273647151488944},{"$f":"IF((I202+M202)>100,M202*100/(I202+M202),M202)","v":0.3968938861722151},{"$f":"IF((N202+R202)>100,N202*100/(N202+R202),N202)","v":99.526024443805838},{"$f":"N200*AVERAGEIF(O205:O216,\">0\")/100","v":96.931908947908312},{"$f":"N200*(100-AVERAGEIF(O205:O216,\">0\"))/100","v":2.5941154958975243},{"$f":"100-(O200+P200+R200)","v":0.42449862305369379},{"$f":"IF((N202+R202)>100,R202*100/(N202+R202),R202)","v":4.9476933140470081E-2},{"$f":"IF((S202+W202)>100,S202*100/(S202+W202),S202)","v":99.814917104940903},{"$f":"S200*AVERAGEIF(T205:T216,\">0\")/100","v":98.404950441244424},{"$f":"S200*(100-AVERAGEIF(T205:T216,\">0\"))/100","v":1.4099666636964849},{"$f":"100-(T200+U200+W200)","v":0.16286739701655506},{"$f":"IF((S202+W202)>100,W202*100/(S202+W202),W202)","v":2.2215498042541526E-2},{"$f":"IF((X202+AB202)>100,X202*100/(X202+AB202),X202)","v":99.524973311685756},{"$f":"X200*AVERAGEIF(Y205:Y216,\">0\")/100","v":99.331421222416665},{"$f":"X200*(100-AVERAGEIF(Y205:Y216,\">0\"))/100","v":0.19355208926908521},{"$f":"100-(Y200+Z200+AB200)","v":0.45666553076961236},{"$f":"IF((X202+AB202)>100,AB202*100/(X202+AB202),AB202)","v":1.836115754462786E-2}]
["Regression period:",null,{"$f":"MinRegYear(C199,C205:C216)","v":2001},{"$f":"IF(MAX(C205:C216)-MIN(C205:C216)<5,AVERAGEIF(C205:C216,\">0\",D205:D216),\nIF(FORECAST($C201,D$205:D$216,$C$205:$C$216)<0,0,\nIF(FORECAST($C201,D$205:D$216,$C$205:$C$216)>100,100,\nFORECAST($C201,D$205:D$216,$C$205:$C$216))))","v":93.885653061531286},null,null,null,{"$f":"IF(MAX(C205:C216)-MIN(C205:C216)<5,AVERAGEIF(C205:C216,\">0\",H205:H216),\nIF(FORECAST($C201,H$205:H$216,$C$205:$C$216)<0,0,\nIF(FORECAST($C201,H$205:H$216,$C$205:$C$216)>100,100,\nFORECAST($C201,H$205:H$216,$C$205:$C$216))))","v":5.0098629942697528},{"$f":"IF(MAX(C205:C216)-MIN(C205:C216)<5,AVERAGEIF(C205:C216,\">0\",I205:I216),\nIF(FORECAST($C201,I$205:I$216,$C$205:$C$216)<0,0,\nIF(FORECAST($C201,I$205:I$216,$C$205:$C$216)>100,100,\nFORECAST($C201,I$205:I$216,$C$205:$C$216))))","v":99.184844029465665},null,null,null,{"$f":"IF(MAX(C205:C216)-MIN(C205:C216)<5,AVERAGEIF(C205:C216,\">0\",M205:M216),\nIF(FORECAST($C201,M$205:M$216,$C$205:$C$216)<0,0,\nIF(FORECAST($C201,M$205:M$216,$C$205:$C$216)>100,100,\nFORECAST($C201,M$205:M$216,$C$205:$C$216))))","v":0.69741975002842338},{"$f":"IF(MAX(C205:C216)-MIN(C205:C216)<5,AVERAGEIF(C205:C216,\">0\",N205:N216),\nIF(FORECAST($C201,N$205:N$216,$C$205:$C$216)<0,0,\nIF(FORECAST($C201,N$205:N$216,$C$205:$C$216)>100,100,\nFORECAST($C201,N$205:N$216,$C$205:$C$216))))","v":99.742271574884256},null,null,null,{"$f":"IF(MAX(C205:C216)-MIN(C205:C216)<5,AVERAGEIF(C205:C216,\">0\",R205:R216),\nIF(FORECAST($C201,R$205:R$216,$C$205:$C$216)<0,0,\nIF(FORECAST($C201,R$205:R$216,$C$205:$C$216)>100,100,\nFORECAST($C201,R$205:R$216,$C$205:$C$216))))","v":0.13127268434130634},{"$f":"IF(MAX(C205:C216)-MIN(C205:C216)<5,AVERAGEIF(C205:C216,\">0\",S205:S216),\nIF(FORECAST($C201,S$205:S$216,$C$205:$C$216)<0,0,\nIF(FORECAST($C201,S$205:S$216,$C$205:$C$216)>100,100,\nFORECAST($C201,S$205:S$216,$C$205:$C$216))))","v":99.867818708094745},null,null,null,{"$f":"IF(MAX(C205:C216)-MIN(C205:C216)<5,AVERAGEIF(C205:C216,\">0\",W205:W216),\nIF(FORECAST($C201,W$205:W$216,$C$205:$C$216)<0,0,\nIF(FORECAST($C201,W$205:W$216,$C$205:$C$216)>100,100,\nFORECAST($C201,W$205:W$216,$C$205:$C$216))))","v":5.8730336029701569E-2},{"$f":"IF(MAX(C205:C216)-MIN(C205:C216)<5,AVERAGEIF(C205:C216,\">0\",X205:X216),\nIF(FORECAST($C201,X$205:X$216,$C$205:$C$216)<0,0,\nIF(FORECAST($C201,X$205:X$216,$C$205:$C$216)>100,100,\nFORECAST($C201,X$205:X$216,$C$205:$C$216))))","v":99.99338651377181},null,null,null,{"$f":"IF(MAX(C205:C216)-MIN(C205:C216)<5,AVERAGEIF(C205:C216,\">0\",AB205:AB216),\nIF(FORECAST($C201,AB$205:AB$216,$C$205:$C$216)<0,0,\nIF(FORECAST($C201,AB$205:AB$216,$C$205:$C$216)>100,100,\nFORECAST($C201,AB$205:AB$216,$C$205:$C$216))))","v":3.6722315089257052E-3}]
[null,null,{"$f":"MaxRegYear(C200,C205:C216)","v":2017},{"$f":"IF(MAX(C205:C216)-MIN(C205:C216)<5,AVERAGEIF(C205:C216,\">0\",D205:D216),\nIF(FORECAST($C202,D$205:D$216,$C$205:$C$216)<0,0,\nIF(FORECAST($C202,D$205:D$216,$C$205:$C$216)>100,100,\nFORECAST($C202,D$205:D$216,$C$205:$C$216))))","v":95.348533224316839},null,null,null,{"$f":"IF(MAX(C205:C216)-MIN(C205:C216)<5,AVERAGEIF(C205:C216,\">0\",H205:H216),\nIF(FORECAST($C202,H$205:H$216,$C$205:$C$216)<0,0,\nIF(FORECAST($C202,H$205:H$216,$C$205:$C$216)>100,100,\nFORECAST($C202,H$205:H$216,$C$205:$C$216))))","v":3.1694414137248543},{"$f":"IF(MAX(C205:C216)-MIN(C205:C216)<5,AVERAGEIF(C205:C216,\">0\",I205:I216),\nIF(FORECAST($C202,I$205:I$216,$C$205:$C$216)<0,0,\nIF(FORECAST($C202,I$205:I$216,$C$205:$C$216)>100,100,\nFORECAST($C202,I$205:I$216,$C$205:$C$216))))","v":98.830369642312888},null,null,null,{"$f":"IF(MAX(C205:C216)-MIN(C205:C216)<5,AVERAGEIF(C205:C216,\">0\",M205:M216),\nIF(FORECAST($C202,M$205:M$216,$C$205:$C$216)<0,0,\nIF(FORECAST($C202,M$205:M$216,$C$205:$C$216)>100,100,\nFORECAST($C202,M$205:M$216,$C$205:$C$216))))","v":0.3968938861722151},{"$f":"IF(MAX(C205:C216)-MIN(C205:C216)<5,AVERAGEIF(C205:C216,\">0\",N205:N216),\nIF(FORECAST($C202,N$205:N$216,$C$205:$C$216)<0,0,\nIF(FORECAST($C202,N$205:N$216,$C$205:$C$216)>100,100,\nFORECAST($C202,N$205:N$216,$C$205:$C$216))))","v":99.526024443805838},null,null,null,{"$f":"IF(MAX(C205:C216)-MIN(C205:C216)<5,AVERAGEIF(C205:C216,\">0\",R205:R216),\nIF(FORECAST($C202,R$205:R$216,$C$205:$C$216)<0,0,\nIF(FORECAST($C202,R$205:R$216,$C$205:$C$216)>100,100,\nFORECAST($C202,R$205:R$216,$C$205:$C$216))))","v":4.9476933140470081E-2},{"$f":"IF(MAX(C205:C216)-MIN(C205:C216)<5,AVERAGEIF(C205:C216,\">0\",S205:S216),\nIF(FORECAST($C202,S$205:S$216,$C$205:$C$216)<0,0,\nIF(FORECAST($C202,S$205:S$216,$C$205:$C$216)>100,100,\nFORECAST($C202,S$205:S$216,$C$205:$C$216))))","v":99.814917104940903},null,null,null,{"$f":"IF(MAX(C205:C216)-MIN(C205:C216)<5,AVERAGEIF(C205:C216,\">0\",W205:W216),\nIF(FORECAST($C202,W$205:W$216,$C$205:$C$216)<0,0,\nIF(FORECAST($C202,W$205:W$216,$C$205:$C$216)>100,100,\nFORECAST($C202,W$205:W$216,$C$205:$C$216))))","v":2.2215498042541526E-2},{"$f":"IF(MAX(C205:C216)-MIN(C205:C216)<5,AVERAGEIF(C205:C216,\">0\",X205:X216),\nIF(FORECAST($C202,X$205:X$216,$C$205:$C$216)<0,0,\nIF(FORECAST($C202,X$205:X$216,$C$205:$C$216)>100,100,\nFORECAST($C202,X$205:X$216,$C$205:$C$216))))","v":99.524973311685756},null,null,null,{"$f":"IF(MAX(C205:C216)-MIN(C205:C216)<5,AVERAGEIF(C205:C216,\">0\",AB205:AB216),\nIF(FORECAST($C202,AB$205:AB$216,$C$205:$C$216)<0,0,\nIF(FORECAST($C202,AB$205:AB$216,$C$205:$C$216)>100,100,\nFORECAST($C202,AB$205:AB$216,$C$205:$C$216))))","v":1.836115754462786E-2}]
[]
[null,"Survey","Year","Improved","Not shared",null,null,"Open defecation","Improved","Not shared",null,null,"Open defecation","Improved","Not shared",null,null,"Open defecation","Improved","Not shared",null,null,"Open defecation","Improved","Not shared",null,null,"Open defecation"]
[null,"WHS03",2003,{"$f":"IF(ISERROR(INDIRECT(CONCATENATE($B205,\"!H122\"))),\"\",INDIRECT(CONCATENATE($B205,\"!H122\")))","v":94.659190432019727},{"$f":"IF(ISERROR(INDIRECT(CONCATENATE($B205,\"!H129\"))),\"\",INDIRECT(CONCATENATE($B205,\"!H129\")))","v":"N/A"},null,null,{"$f":"IF(ISERROR(INDIRECT(CONCATENATE($B205,\"!H127\"))),\"\",INDIRECT(CONCATENATE($B205,\"!H127\")))","v":3.9991314859857763},{"$f":"IF(ISERROR(INDIRECT(CONCATENATE($B205,\"!I122\"))),\"\",INDIRECT(CONCATENATE($B205,\"!I122\")))","v":99.193604930384538},{"$f":"IF(ISERROR(INDIRECT(CONCATENATE($B205,\"!I129\"))),\"\",INDIRECT(CONCATENATE($B205,\"!I129\")))","v":"N/A"},null,null,{"$f":"IF(ISERROR(INDIRECT(CONCATENATE($B205,\"!I127\"))),\"\",INDIRECT(CONCATENATE($B205,\"!I127\")))","v":0.54589856118515734},{"$f":"IF(ISERROR(INDIRECT(CONCATENATE($B205,\"!J122\"))),\"\",INDIRECT(CONCATENATE($B205,\"!J122\")))","v":99.864222238435914},{"$f":"IF(ISERROR(INDIRECT(CONCATENATE($B205,\"!J129\"))),\"\",INDIRECT(CONCATENATE($B205,\"!J129\")))","v":"N/A"},null,null,{"$f":"IF(ISERROR(INDIRECT(CONCATENATE($B205,\"!J127\"))),\"\",INDIRECT(CONCATENATE($B205,\"!J127\")))","v":0.10114774809434413},{"$f":"IF(ISERROR(INDIRECT(CONCATENATE($B205,\"!K122\"))),\"\",INDIRECT(CONCATENATE($B205,\"!K122\")))","v":99.910021899766946},{"$f":"IF(ISERROR(INDIRECT(CONCATENATE($B205,\"!K129\"))),\"\",INDIRECT(CONCATENATE($B205,\"!K129\")))","v":"N/A"},null,null,{"$f":"IF(ISERROR(INDIRECT(CONCATENATE($B205,\"!K127\"))),\"\",INDIRECT(CONCATENATE($B205,\"!K127\")))","v":4.5239363684327599E-2},{"$f":"IF(ISERROR(INDIRECT(CONCATENATE($B205,\"!L122\"))),\"\",INDIRECT(CONCATENATE($B205,\"!L122\")))","v":99.962204093806122},{"$f":"IF(ISERROR(INDIRECT(CONCATENATE($B205,\"!L129\"))),\"\",INDIRECT(CONCATENATE($B205,\"!L129\")))","v":"N/A"},null,null,{"$f":"IF(ISERROR(INDIRECT(CONCATENATE($B205,\"!L2127\"))),\"\",INDIRECT(CONCATENATE($B205,\"!L127\")))","v":0}]
[null,"ENG12",2012,92.528673772885341,"N/A",null,null,6.8672884005086434,98.728862091046324,"N/A",null,null,0.94663004207226253,98.997675452522046,"N/A",null,null,0.15463997477816296,99.636185287660808,"N/A",null,null,6.9332855301443938E-2,99.561875516157244,"N/A",null,null,3.580425721202421E-2]
[null,"MICS15",2015,96.9377052543894,87.166014149514652,null,null,1.0574576791453509,99.033889538645852,96.077944656448693,null,null,9.2593251570512167E-2,100,97.393530475677537,null,null,0,99.967977481534405,98.587418890290607,null,null,0,99.665632652831789,99.805524098295479,null,null,0]
[null,null,null,"","",null,null,"","","",null,null,"","","",null,null,"","","",null,null,"","","",null,null,""]
[null,null,null,"","",null,null,"","","",null,null,"","","",null,null,"","","",null,null,"","","",null,null,""]
[null,null,null,"","",null,null,"","","",null,null,"","","",null,null,"","","",null,null,"","","",null,null,""]
[null,null,null,"","",null,null,"","","",null,null,"","","",null,null,"","","",null,null,"","","",null,null,""]
[null,null,null,"","",null,null,"","","",null,null,"","","",null,null,"","","",null,null,"","","",null,null,""]
[null,null,null,"","",null,null,"","","",null,null,"","","",null,null,"","","",null,null,"","","",null,null,""]
[null,null,null,"","",null,null,"","","",null,null,"","","",null,null,"","","",null,null,"","","",null,null,""]
[null,null,null,"","",null,null,"","","",null,null,"","","",null,null,"","","",null,null,"","","",null,null,""]
[null,null,null,"","",null,null,"","","",null,null,"","","",null,null,"","","",null,null,"","","",null,null,""]
[]
[null,{"$f":"CONCATENATE(\"Urban use of sanitation facilities, \",C199,\"–\",C200)","v":"Urban use of sanitation facilities, 2000–2020"},null,null,null,null,null,null,null,null,null,null,null,null,null,null,null,null,"Data points used for regression"]
[]
[]
[]
[]
[]
[]
[]
[]
[]
[]
[]
[]
[]
[]
[]
[]
[]
[]
[]
[]
[]
[]
[]
[]
[]
[]
[]
[]
[]
[]
[]
[]
[]
[]
[]
[]
[]
[]
[]
[]
[]
[]
[]
[]
[]
[]
[]
[]
[]
[]
[]
[]
[]
[]
[]
[]
[]
[]
[]
[]
[]
[]
[]
[]
[]
[]
[]
[]
[]
[]
[]
[]
[]
[]
[]
[]
[]
[]
["RURAL",null,null,"Poorest",null,null,null,null,"Poor",null,null,null,null,"Middle",null,null,null,null,"Rich",null,null,null,null,"Richest"]
[null,null,null,"Improved","Basic","Limited","Unimproved","Open defecation","Improved","Basic","Limited","Unimproved","Open defecation","Improved","Basic","Limited","Unimproved","Open defecation","Improved","Basic","Limited","Unimproved","Open defecation","Improved","Basic","Limited","Unimproved","Open defecation"]
["Forecast period:",null,2000,{"$f":"IF((D301+H301)>100,D301*100/(D301+H301),D301)","v":60.247474829468047},{"$f":"D299*AVERAGEIF(E305:E316,\">0\")/100","v":54.392208393418052},{"$f":"D299*(100-AVERAGEIF(E305:E316,\">0\"))/100","v":5.8552664360500009},{"$f":"100-(E299+F299+H299)","v":12.641540863228329},{"$f":"IF((D301+H301)>100,H301*100/(D301+H301),H301)","v":27.110984307303625},{"$f":"IF((I301+M301)>100,I301*100/(I301+M301),I301)","v":70.634231632231604},{"$f":"I299*AVERAGEIF(J305:J316,\">0\")/100","v":64.255248276758621},{"$f":"I299*(100-AVERAGEIF(J305:J316,\">0\"))/100","v":6.3789833554729816},{"$f":"100-(J299+K299+M299)","v":4.5868145725498835},{"$f":"IF((I301+M301)>100,M301*100/(I301+M301),M301)","v":24.778953795218513},{"$f":"IF((N301+R301)>100,N301*100/(N301+R301),N301)","v":79.609326486989175},{"$f":"N299*AVERAGEIF(O305:O316,\">0\")/100","v":73.786508577709242},{"$f":"N299*(100-AVERAGEIF(O305:O316,\">0\"))/100","v":5.8228179092799408},{"$f":"100-(O299+P299+R299)","v":5.312552754005992},{"$f":"IF((N301+R301)>100,R301*100/(N301+R301),R301)","v":15.078120759004833},{"$f":"IF((S301+W301)>100,S301*100/(S301+W301),S301)","v":89.72894692621162},{"$f":"S299*AVERAGEIF(T305:T316,\">0\")/100","v":86.528798058447251},{"$f":"S299*(100-AVERAGEIF(T305:T316,\">0\"))/100","v":3.2001488677643706},{"$f":"100-(T299+U299+W299)","v":2.9039115983554211},{"$f":"IF((S301+W301)>100,W301*100/(S301+W301),W301)","v":7.3671414754329589},{"$f":"IF((X301+AB301)>100,X301*100/(X301+AB301),X301)","v":96.922382483282547},{"$f":"X299*AVERAGEIF(Y305:Y316,\">0\")/100","v":95.862336797420397},{"$f":"X299*(100-AVERAGEIF(Y305:Y316,\">0\"))/100","v":1.0600456858621505},{"$f":"100-(Y299+Z299+AB299)","v":0.41366994028879844},{"$f":"IF((X301+AB301)>100,AB301*100/(X301+AB301),AB301)","v":2.6639475764286544}]
[null,null,2020,{"$f":"IF((D302+H302)>100,D302*100/(D302+H302),D302)","v":83.244844304146682},{"$f":"D300*AVERAGEIF(E305:E316,\">0\")/100","v":75.154534391441885},{"$f":"D300*(100-AVERAGEIF(E305:E316,\">0\"))/100","v":8.0903099127047984},{"$f":"100-(E300+F300+H300)","v":8.2371815851993233},{"$f":"IF((D302+H302)>100,H302*100/(D302+H302),H302)","v":8.517974110653995},{"$f":"IF((I302+M302)>100,I302*100/(I302+M302),I302)","v":93.807516730699717},{"$f":"I300*AVERAGEIF(J305:J316,\">0\")/100","v":85.335752063405906},{"$f":"I300*(100-AVERAGEIF(J305:J316,\">0\"))/100","v":8.4717646672938134},{"$f":"100-(J300+K300+M300)","v":3.3011242420870985},{"$f":"IF((I302+M302)>100,M302*100/(I302+M302),M302)","v":2.8913590272131842},{"$f":"IF((N302+R302)>100,N302*100/(N302+R302),N302)","v":94.851180671175143},{"$f":"N300*AVERAGEIF(O305:O316,\">0\")/100","v":87.913536830930738},{"$f":"N300*(100-AVERAGEIF(O305:O316,\">0\"))/100","v":6.9376438402444016},{"$f":"100-(O300+P300+R300)","v":4.102953379647488},{"$f":"IF((N302+R302)>100,R302*100/(N302+R302),R302)","v":1.0458659491773687},{"$f":"IF((S302+W302)>100,S302*100/(S302+W302),S302)","v":99.100010691295893},{"$f":"S300*AVERAGEIF(T305:T316,\">0\")/100","v":95.565646387767586},{"$f":"S300*(100-AVERAGEIF(T305:T316,\">0\"))/100","v":3.5343643035282981},{"$f":"100-(T300+U300+W300)","v":0.89998930870412153},{"$f":"IF((S302+W302)>100,W302*100/(S302+W302),W302)","v":0},{"$f":"IF((X302+AB302)>100,X302*100/(X302+AB302),X302)","v":99.593820793112968},{"$f":"X300*AVERAGEIF(Y305:Y316,\">0\")/100","v":98.504557432418366},{"$f":"X300*(100-AVERAGEIF(Y305:Y316,\">0\"))/100","v":1.0892633606945976},{"$f":"100-(Y300+Z300+AB300)","v":0.4061792068870318},{"$f":"IF((X302+AB302)>100,AB302*100/(X302+AB302),AB302)","v":0}]
["Regression period:",null,{"$f":"MinRegYear(C299,C305:C316)","v":2001},{"$f":"IF(MAX(C305:C316)-MIN(C305:C316)<5,AVERAGEIF(C305:C316,\">0\",D305:D316),\nIF(FORECAST($C301,D$305:D$316,$C$305:$C$316)<0,0,\nIF(FORECAST($C301,D$305:D$316,$C$305:$C$316)>100,100,\nFORECAST($C301,D$305:D$316,$C$305:$C$316))))","v":60.247474829468047},null,null,null,{"$f":"IF(MAX(C305:C316)-MIN(C305:C316)<5,AVERAGEIF(C305:C316,\">0\",H305:H316),\nIF(FORECAST($C301,H$305:H$316,$C$305:$C$316)<0,0,\nIF(FORECAST($C301,H$305:H$316,$C$305:$C$316)>100,100,\nFORECAST($C301,H$305:H$316,$C$305:$C$316))))","v":27.110984307303625},{"$f":"IF(MAX(C305:C316)-MIN(C305:C316)<5,AVERAGEIF(C305:C316,\">0\",I305:I316),\nIF(FORECAST($C301,I$305:I$316,$C$305:$C$316)<0,0,\nIF(FORECAST($C301,I$305:I$316,$C$305:$C$316)>100,100,\nFORECAST($C301,I$305:I$316,$C$305:$C$316))))","v":70.634231632231604},null,null,null,{"$f":"IF(MAX(C305:C316)-MIN(C305:C316)<5,AVERAGEIF(C305:C316,\">0\",M305:M316),\nIF(FORECAST($C301,M$305:M$316,$C$305:$C$316)<0,0,\nIF(FORECAST($C301,M$305:M$316,$C$305:$C$316)>100,100,\nFORECAST($C301,M$305:M$316,$C$305:$C$316))))","v":24.778953795218513},{"$f":"IF(MAX(C305:C316)-MIN(C305:C316)<5,AVERAGEIF(C305:C316,\">0\",N305:N316),\nIF(FORECAST($C301,N$305:N$316,$C$305:$C$316)<0,0,\nIF(FORECAST($C301,N$305:N$316,$C$305:$C$316)>100,100,\nFORECAST($C301,N$305:N$316,$C$305:$C$316))))","v":79.609326486989175},null,null,null,{"$f":"IF(MAX(C305:C316)-MIN(C305:C316)<5,AVERAGEIF(C305:C316,\">0\",R305:R316),\nIF(FORECAST($C301,R$305:R$316,$C$305:$C$316)<0,0,\nIF(FORECAST($C301,R$305:R$316,$C$305:$C$316)>100,100,\nFORECAST($C301,R$305:R$316,$C$305:$C$316))))","v":15.078120759004833},{"$f":"IF(MAX(C305:C316)-MIN(C305:C316)<5,AVERAGEIF(C305:C316,\">0\",S305:S316),\nIF(FORECAST($C301,S$305:S$316,$C$305:$C$316)<0,0,\nIF(FORECAST($C301,S$305:S$316,$C$305:$C$316)>100,100,\nFORECAST($C301,S$305:S$316,$C$305:$C$316))))","v":89.72894692621162},null,null,null,{"$f":"IF(MAX(C305:C316)-MIN(C305:C316)<5,AVERAGEIF(C305:C316,\">0\",W305:W316),\nIF(FORECAST($C301,W$305:W$316,$C$305:$C$316)<0,0,\nIF(FORECAST($C301,W$305:W$316,$C$305:$C$316)>100,100,\nFORECAST($C301,W$305:W$316,$C$305:$C$316))))","v":7.3671414754329589},{"$f":"IF(MAX(C305:C316)-MIN(C305:C316)<5,AVERAGEIF(C305:C316,\">0\",X305:X316),\nIF(FORECAST($C301,X$305:X$316,$C$305:$C$316)<0,0,\nIF(FORECAST($C301,X$305:X$316,$C$305:$C$316)>100,100,\nFORECAST($C301,X$305:X$316,$C$305:$C$316))))","v":96.922382483282547},null,null,null,{"$f":"IF(MAX(C305:C316)-MIN(C305:C316)<5,AVERAGEIF(C305:C316,\">0\",AB305:AB316),\nIF(FORECAST($C301,AB$305:AB$316,$C$305:$C$316)<0,0,\nIF(FORECAST($C301,AB$305:AB$316,$C$305:$C$316)>100,100,\nFORECAST($C301,AB$305:AB$316,$C$305:$C$316))))","v":2.6639475764286544}]
[null,null,{"$f":"MaxRegYear(C300,C305:C316)","v":2017},{"$f":"IF(MAX(C305:C316)-MIN(C305:C316)<5,AVERAGEIF(C305:C316,\">0\",D305:D316),\nIF(FORECAST($C302,D$305:D$316,$C$305:$C$316)<0,0,\nIF(FORECAST($C302,D$305:D$316,$C$305:$C$316)>100,100,\nFORECAST($C302,D$305:D$316,$C$305:$C$316))))","v":83.244844304146682},null,null,null,{"$f":"IF(MAX(C305:C316)-MIN(C305:C316)<5,AVERAGEIF(C305:C316,\">0\",H305:H316),\nIF(FORECAST($C302,H$305:H$316,$C$305:$C$316)<0,0,\nIF(FORECAST($C302,H$305:H$316,$C$305:$C$316)>100,100,\nFORECAST($C302,H$305:H$316,$C$305:$C$316))))","v":8.517974110653995},{"$f":"IF(MAX(C305:C316)-MIN(C305:C316)<5,AVERAGEIF(C305:C316,\">0\",I305:I316),\nIF(FORECAST($C302,I$305:I$316,$C$305:$C$316)<0,0,\nIF(FORECAST($C302,I$305:I$316,$C$305:$C$316)>100,100,\nFORECAST($C302,I$305:I$316,$C$305:$C$316))))","v":93.807516730699717},null,null,null,{"$f":"IF(MAX(C305:C316)-MIN(C305:C316)<5,AVERAGEIF(C305:C316,\">0\",M305:M316),\nIF(FORECAST($C302,M$305:M$316,$C$305:$C$316)<0,0,\nIF(FORECAST($C302,M$305:M$316,$C$305:$C$316)>100,100,\nFORECAST($C302,M$305:M$316,$C$305:$C$316))))","v":2.8913590272131842},{"$f":"IF(MAX(C305:C316)-MIN(C305:C316)<5,AVERAGEIF(C305:C316,\">0\",N305:N316),\nIF(FORECAST($C302,N$305:N$316,$C$305:$C$316)<0,0,\nIF(FORECAST($C302,N$305:N$316,$C$305:$C$316)>100,100,\nFORECAST($C302,N$305:N$316,$C$305:$C$316))))","v":94.851180671175143},null,null,null,{"$f":"IF(MAX(C305:C316)-MIN(C305:C316)<5,AVERAGEIF(C305:C316,\">0\",R305:R316),\nIF(FORECAST($C302,R$305:R$316,$C$305:$C$316)<0,0,\nIF(FORECAST($C302,R$305:R$316,$C$305:$C$316)>100,100,\nFORECAST($C302,R$305:R$316,$C$305:$C$316))))","v":1.0458659491773687},{"$f":"IF(MAX(C305:C316)-MIN(C305:C316)<5,AVERAGEIF(C305:C316,\">0\",S305:S316),\nIF(FORECAST($C302,S$305:S$316,$C$305:$C$316)<0,0,\nIF(FORECAST($C302,S$305:S$316,$C$305:$C$316)>100,100,\nFORECAST($C302,S$305:S$316,$C$305:$C$316))))","v":99.100010691295893},null,null,null,{"$f":"IF(MAX(C305:C316)-MIN(C305:C316)<5,AVERAGEIF(C305:C316,\">0\",W305:W316),\nIF(FORECAST($C302,W$305:W$316,$C$305:$C$316)<0,0,\nIF(FORECAST($C302,W$305:W$316,$C$305:$C$316)>100,100,\nFORECAST($C302,W$305:W$316,$C$305:$C$316))))","v":0},{"$f":"IF(MAX(C305:C316)-MIN(C305:C316)<5,AVERAGEIF(C305:C316,\">0\",X305:X316),\nIF(FORECAST($C302,X$305:X$316,$C$305:$C$316)<0,0,\nIF(FORECAST($C302,X$305:X$316,$C$305:$C$316)>100,100,\nFORECAST($C302,X$305:X$316,$C$305:$C$316))))","v":99.593820793112968},null,null,null,{"$f":"IF(MAX(C305:C316)-MIN(C305:C316)<5,AVERAGEIF(C305:C316,\">0\",AB305:AB316),\nIF(FORECAST($C302,AB$305:AB$316,$C$305:$C$316)<0,0,\nIF(FORECAST($C302,AB$305:AB$316,$C$305:$C$316)>100,100,\nFORECAST($C302,AB$305:AB$316,$C$305:$C$316))))","v":0}]
[]
[null,"Survey","Year","Improved","Not shared",null,null,"Open defecation","Improved","Not shared",null,null,"Open defecation","Improved","Not shared",null,null,"Open defecation","Improved","Not shared",null,null,"Open defecation","Improved","Not shared",null,null,"Open defecation"]
[null,"WHS03",2003,{"$f":"IF(ISERROR(INDIRECT(CONCATENATE($B305,\"!M122\"))),\"\",INDIRECT(CONCATENATE($B305,\"!M122\")))","v":64.322379991590026},{"$f":"IF(ISERROR(INDIRECT(CONCATENATE($B305,\"!M129\"))),\"\",INDIRECT(CONCATENATE($B305,\"!M129\")))","v":"N/A"},null,null,{"$f":"IF(ISERROR(INDIRECT(CONCATENATE($B305,\"!M127\"))),\"\",INDIRECT(CONCATENATE($B305,\"!M127\")))","v":23.893484681504763},{"$f":"IF(ISERROR(INDIRECT(CONCATENATE($B305,\"!N122\"))),\"\",INDIRECT(CONCATENATE($B305,\"!N122\")))","v":74.407180077212047},{"$f":"IF(ISERROR(INDIRECT(CONCATENATE($B305,\"!N129\"))),\"\",INDIRECT(CONCATENATE($B305,\"!N129\")))","v":"N/A"},null,null,{"$f":"IF(ISERROR(INDIRECT(CONCATENATE($B305,\"!N127\"))),\"\",INDIRECT(CONCATENATE($B305,\"!N127\")))","v":21.130316118769077},{"$f":"IF(ISERROR(INDIRECT(CONCATENATE($B305,\"!O122\"))),\"\",INDIRECT(CONCATENATE($B305,\"!O122\")))","v":81.677595160277633},{"$f":"IF(ISERROR(INDIRECT(CONCATENATE($B305,\"!O129\"))),\"\",INDIRECT(CONCATENATE($B305,\"!O129\")))","v":"N/A"},null,null,{"$f":"IF(ISERROR(INDIRECT(CONCATENATE($B305,\"!O127\"))),\"\",INDIRECT(CONCATENATE($B305,\"!O127\")))","v":12.866756506228928},{"$f":"IF(ISERROR(INDIRECT(CONCATENATE($B305,\"!P122\"))),\"\",INDIRECT(CONCATENATE($B305,\"!P122\")))","v":90.767471946542116},{"$f":"IF(ISERROR(INDIRECT(CONCATENATE($B305,\"!P129\"))),\"\",INDIRECT(CONCATENATE($B305,\"!P129\")))","v":"N/A"},null,null,{"$f":"IF(ISERROR(INDIRECT(CONCATENATE($B305,\"!P127\"))),\"\",INDIRECT(CONCATENATE($B305,\"!P127\")))","v":6.4301797350278358},{"$f":"IF(ISERROR(INDIRECT(CONCATENATE($B305,\"!Q122\"))),\"\",INDIRECT(CONCATENATE($B305,\"!Q122\")))","v":97.369455765606517},{"$f":"IF(ISERROR(INDIRECT(CONCATENATE($B305,\"!Q129\"))),\"\",INDIRECT(CONCATENATE($B305,\"!Q129\")))","v":"N/A"},null,null,{"$f":"IF(ISERROR(INDIRECT(CONCATENATE($B305,\"!Q2127\"))),\"\",INDIRECT(CONCATENATE($B305,\"!Q127\")))","v":2.3265748863427764}]
[null,"ENG12",2012,71.25723043216081,"N/A",null,null,17.901783201977192,83.060713906741285,"N/A",null,null,13.381985714009199,89.435953637555684,"N/A",null,null,7.2602751834390684,96.70298506592745,"N/A",null,null,2.0816621994404523,98.306422346910068,"N/A",null,null,0.17325265216868102]
[null,"MICS15",2015,83.970875053173373,90.281308133455425,null,null,8.1619803315826491,93.539719516407061,90.968991651687844,null,null,2.8892433818678809,93.435059598947703,92.685759111111707,null,null,1.4279005957631403,97.530053869744975,96.433537919044113,null,null,0.75275046995964723,99.599321485169796,98.906294233898976,null,null,3.4909217916982233E-2]
[null,null,null,"","",null,null,"","","",null,null,"","","",null,null,"","","",null,null,"","","",null,null,""]
[null,null,null,"","",null,null,"","","",null,null,"","","",null,null,"","","",null,null,"","","",null,null,""]
[null,null,null,"","",null,null,"","","",null,null,"","","",null,null,"","","",null,null,"","","",null,null,""]
[null,null,null,"","",null,null,"","","",null,null,"","","",null,null,"","","",null,null,"","","",null,null,""]
[null,null,null,"","",null,null,"","","",null,null,"","","",null,null,"","","",null,null,"","","",null,null,""]
[null,null,null,"","",null,null,"","","",null,null,"","","",null,null,"","","",null,null,"","","",null,null,""]
[null,null,null,"","",null,null,"","","",null,null,"","","",null,null,"","","",null,null,"","","",null,null,""]
[null,null,null,"","",null,null,"","","",null,null,"","","",null,null,"","","",null,null,"","","",null,null,""]
[null,null,null,"","",null,null,"","","",null,null,"","","",null,null,"","","",null,null,"","","",null,null,""]
[]
[null,{"$f":"CONCATENATE(\"Rural use of sanitation facilities, \",C299,\"–\",C300)","v":"Rural use of sanitation facilities, 2000–2020"},null,null,null,null,null,null,null,null,null,null,null,null,null,null,null,null,"Data points used for regression"]

{"sheet":"Hygiene","index":3,"n_rows":91,"n_cols":25,"rows_kept":91,"cut":false,"hidden":false,"merged":[[6,1,6,7],[3,1,3,24],[4,1,4,24],[33,1,34,3],[31,6,32,9],[31,10,31,12],[31,13,31,15],[6,10,6,15],[6,18,6,23],[33,19,34,19],[31,16,31,18],[31,19,31,21],[31,22,31,24],[33,6,34,7],[33,8,34,8],[33,9,34,9],[33,15,34,15],[33,16,34,16],[33,17,34,17],[33,18,34,18],[36,6,37,7],[36,8,37,8],[36,9,37,9],[36,10,37,10],[36,11,37,11],[33,10,34,10],[33,11,34,11],[33,12,34,12],[33,13,34,13],[33,14,34,14],[33,20,34,20],[33,21,34,21],[33,22,34,22],[33,23,34,23],[33,24,34,24],[36,19,37,19],[36,20,37,20],[36,21,37,21],[36,22,37,22],[36,23,37,23],[39,12,40,12],[39,13,40,13],[39,14,40,14],[39,15,40,15],[36,18,37,18],[36,12,37,12],[36,13,37,13],[36,14,37,14],[36,15,37,15],[36,16,37,16],[36,17,37,17],[39,22,40,22],[39,23,40,23],[39,24,40,24],[31,4,32,5],[39,16,40,16],[39,17,40,17],[39,18,40,18],[39,19,40,19],[39,20,40,20],[39,21,40,21],[36,24,37,24],[39,6,40,7],[39,8,40,8],[39,9,40,9],[39,10,40,10],[39,11,40,11]]}
[]
[]
[]
[null,"Access to hygiene facilities by wealth quintile (%)"]
[null,{"$f":"IF(ISERROR(INDIRECT(CONCATENATE($E$32,\"!A2\"))),\"\",INDIRECT(CONCATENATE($E$32,\"!A2\")))","v":"Mexico"}]
[]
[null,{"$f":"CONCATENATE(\"National \",IF(ISERROR(INDIRECT(CONCATENATE($E$32,\"!A2\"))),\"\",INDIRECT(CONCATENATE($E$32,\"!A210\"))))","v":"National Access to hygiene facilities "},null,null,null,null,null,null,null,null,{"$f":"CONCATENATE(\"Urban \",IF(ISERROR(INDIRECT(CONCATENATE($E$32,\"!A2\"))),\"\",INDIRECT(CONCATENATE($E$32,\"!A210\"))))","v":"Urban Access to hygiene facilities "},null,null,null,null,null,null,null,{"$f":"CONCATENATE(\"Rural \",IF(ISERROR(INDIRECT(CONCATENATE($E$32,\"!A2\"))),\"\",INDIRECT(CONCATENATE($E$32,\"!A210\"))))","v":"Rural Access to hygiene facilities "}]
[]
[]
[]
[]
[]
[]
[]
[]
[]
[]
[]
[]
[]
[]
[]
[]
[]
[]
[]
[]
[]
[]
[]
[]
[null,null,null,null,{"$f":"INDEX(B88:B100,A88)","v":"MICS15"},null,{"$f":"IF(ISERROR(INDIRECT(CONCATENATE($E$32,\"!A2\"))),\"\",INDIRECT(CONCATENATE($E$32,\"!A2\")))","v":"Mexico"},null,null,null,"Poorest",null,null,"Poor",null,null,"Middle",null,null,"Rich",null,null,"Richest"]
[null,null,null,null,null,null,null,null,null,null,"Basic","Limited","No facility","Basic","Limited","No facility","Basic","Limited","No facility","Basic","Limited","No facility","Basic","Limited","No facility"]
[null,">>>  Select Survey :   ",null,null,null,null,"NATIONAL",null,null,{"$f":"IF(ISERROR(INDIRECT(CONCATENATE(#REF!,\"!A2\"))),\"\",INDIRECT(CONCATENATE(#REF!,\"!A210\")))","v":""},{"$f":"IF(ISERROR(INDIRECT(CONCATENATE($E$32,\"!C222\"))),\"\",INDIRECT(CONCATENATE($E$32,\"!C222\")))","v":79.603522380454422},{"$f":"IF(ISERROR(INDIRECT(CONCATENATE($E$32,\"!C223\"))),\"\",INDIRECT(CONCATENATE($E$32,\"!C223\")))","v":14.991055784271143},{"$f":"IF(ISERROR(INDIRECT(CONCATENATE($E$32,\"!C224\"))),\"\",INDIRECT(CONCATENATE($E$32,\"!C224\")))","v":5.405421835274443},{"$f":"IF(ISERROR(INDIRECT(CONCATENATE($E$32,\"!D222\"))),\"\",INDIRECT(CONCATENATE($E$32,\"!D222\")))","v":85.588588317261411},{"$f":"IF(ISERROR(INDIRECT(CONCATENATE($E$32,\"!D223\"))),\"\",INDIRECT(CONCATENATE($E$32,\"!D223\")))","v":9.8760274746624575},{"$f":"IF(ISERROR(INDIRECT(CONCATENATE($E$32,\"!D224\"))),\"\",INDIRECT(CONCATENATE($E$32,\"!D224\")))","v":4.5353842080762323},{"$f":"IF(ISERROR(INDIRECT(CONCATENATE($E$32,\"!E222\"))),\"\",INDIRECT(CONCATENATE($E$32,\"!E222\")))","v":91.017774295916539},{"$f":"IF(ISERROR(INDIRECT(CONCATENATE($E$32,\"!E223\"))),\"\",INDIRECT(CONCATENATE($E$32,\"!E223\")))","v":5.7421373815629586},{"$f":"IF(ISERROR(INDIRECT(CONCATENATE($E$32,\"!E224\"))),\"\",INDIRECT(CONCATENATE($E$32,\"!E224\")))","v":3.2400883225205011},{"$f":"IF(ISERROR(INDIRECT(CONCATENATE($E$32,\"!F222\"))),\"\",INDIRECT(CONCATENATE($E$32,\"!F222\")))","v":95.494437707325304},{"$f":"IF(ISERROR(INDIRECT(CONCATENATE($E$32,\"!F223\"))),\"\",INDIRECT(CONCATENATE($E$32,\"!F223\")))","v":3.3797959602563696},{"$f":"IF(ISERROR(INDIRECT(CONCATENATE($E$32,\"!F224\"))),\"\",INDIRECT(CONCATENATE($E$32,\"!F224\")))","v":1.1257663324183276},{"$f":"IF(ISERROR(INDIRECT(CONCATENATE($E$32,\"!G222\"))),\"\",INDIRECT(CONCATENATE($E$32,\"!G222\")))","v":96.5147307260156},{"$f":"IF(ISERROR(INDIRECT(CONCATENATE($E$32,\"!G223\"))),\"\",INDIRECT(CONCATENATE($E$32,\"!G223\")))","v":2.7091286640708345},{"$f":"IF(ISERROR(INDIRECT(CONCATENATE($E$32,\"!G224\"))),\"\",INDIRECT(CONCATENATE($E$32,\"!G224\")))","v":0.77614060991356337}]
[]
[]
[null,null,null,null,null,null,"URBAN",null,null,{"$f":"IF(ISERROR(INDIRECT(CONCATENATE(#REF!,\"!A2\"))),\"\",INDIRECT(CONCATENATE(#REF!,\"!A210\")))","v":""},{"$f":"IF(ISERROR(INDIRECT(CONCATENATE($E$32,\"!H222\"))),\"\",INDIRECT(CONCATENATE($E$32,\"!H222\")))","v":83.189148206783941},{"$f":"IF(ISERROR(INDIRECT(CONCATENATE($E$32,\"!H223\"))),\"\",INDIRECT(CONCATENATE($E$32,\"!H223\")))","v":13.177984205411878},{"$f":"IF(ISERROR(INDIRECT(CONCATENATE($E$32,\"!H224\"))),\"\",INDIRECT(CONCATENATE($E$32,\"!H224\")))","v":3.6328675878042032},{"$f":"IF(ISERROR(INDIRECT(CONCATENATE($E$32,\"!I222\"))),\"\",INDIRECT(CONCATENATE($E$32,\"!I222\")))","v":87.448913559220671},{"$f":"IF(ISERROR(INDIRECT(CONCATENATE($E$32,\"!I223\"))),\"\",INDIRECT(CONCATENATE($E$32,\"!I223\")))","v":8.4081615289710516},{"$f":"IF(ISERROR(INDIRECT(CONCATENATE($E$32,\"!I224\"))),\"\",INDIRECT(CONCATENATE($E$32,\"!I224\")))","v":4.1429249118084037},{"$f":"IF(ISERROR(INDIRECT(CONCATENATE($E$32,\"!J222\"))),\"\",INDIRECT(CONCATENATE($E$32,\"!J222\")))","v":94.144773071123396},{"$f":"IF(ISERROR(INDIRECT(CONCATENATE($E$32,\"!J223\"))),\"\",INDIRECT(CONCATENATE($E$32,\"!J223\")))","v":4.307278584061212},{"$f":"IF(ISERROR(INDIRECT(CONCATENATE($E$32,\"!J224\"))),\"\",INDIRECT(CONCATENATE($E$32,\"!J224\")))","v":1.5479483448154403},{"$f":"IF(ISERROR(INDIRECT(CONCATENATE($E$32,\"!K222\"))),\"\",INDIRECT(CONCATENATE($E$32,\"!K222\")))","v":96.595314956701415},{"$f":"IF(ISERROR(INDIRECT(CONCATENATE($E$32,\"!K223\"))),\"\",INDIRECT(CONCATENATE($E$32,\"!K223\")))","v":2.2386160427226636},{"$f":"IF(ISERROR(INDIRECT(CONCATENATE($E$32,\"!K224\"))),\"\",INDIRECT(CONCATENATE($E$32,\"!K224\")))","v":1.1660690005758809},{"$f":"IF(ISERROR(INDIRECT(CONCATENATE($E$32,\"!L222\"))),\"\",INDIRECT(CONCATENATE($E$32,\"!L222\")))","v":96.13198251018045},{"$f":"IF(ISERROR(INDIRECT(CONCATENATE($E$32,\"!L223\"))),\"\",INDIRECT(CONCATENATE($E$32,\"!L223\")))","v":2.9706203159738678},{"$f":"IF(ISERROR(INDIRECT(CONCATENATE($E$32,\"!L224\"))),\"\",INDIRECT(CONCATENATE($E$32,\"!L224\")))","v":0.89739717384571938}]
[]
[]
[null,null,null,null,null,null,"RURAL",null,null,{"$f":"IF(ISERROR(INDIRECT(CONCATENATE(#REF!,\"!A2\"))),\"\",INDIRECT(CONCATENATE(#REF!,\"!A210\")))","v":""},{"$f":"IF(ISERROR(INDIRECT(CONCATENATE($E$32,\"!M222\"))),\"\",INDIRECT(CONCATENATE($E$32,\"!M222\")))","v":74.624995949810597},{"$f":"IF(ISERROR(INDIRECT(CONCATENATE($E$32,\"!M223\"))),\"\",INDIRECT(CONCATENATE($E$32,\"!M223\")))","v":19.591606816466893},{"$f":"IF(ISERROR(INDIRECT(CONCATENATE($E$32,\"!M224\"))),\"\",INDIRECT(CONCATENATE($E$32,\"!M224\")))","v":5.7833972337225763},{"$f":"IF(ISERROR(INDIRECT(CONCATENATE($E$32,\"!N222\"))),\"\",INDIRECT(CONCATENATE($E$32,\"!N222\")))","v":84.557092436514893},{"$f":"IF(ISERROR(INDIRECT(CONCATENATE($E$32,\"!N223\"))),\"\",INDIRECT(CONCATENATE($E$32,\"!N223\")))","v":10.328546626018928},{"$f":"IF(ISERROR(INDIRECT(CONCATENATE($E$32,\"!N224\"))),\"\",INDIRECT(CONCATENATE($E$32,\"!N224\")))","v":5.1143609374662971},{"$f":"IF(ISERROR(INDIRECT(CONCATENATE($E$32,\"!O222\"))),\"\",INDIRECT(CONCATENATE($E$32,\"!O222\")))","v":81.891640422029852},{"$f":"IF(ISERROR(INDIRECT(CONCATENATE($E$32,\"!O223\"))),\"\",INDIRECT(CONCATENATE($E$32,\"!O223\")))","v":10.662286043659554},{"$f":"IF(ISERROR(INDIRECT(CONCATENATE($E$32,\"!O224\"))),\"\",INDIRECT(CONCATENATE($E$32,\"!O224\")))","v":7.4460735343106421},{"$f":"IF(ISERROR(INDIRECT(CONCATENATE($E$32,\"!P222\"))),\"\",INDIRECT(CONCATENATE($E$32,\"!P222\")))","v":85.441081729355446},{"$f":"IF(ISERROR(INDIRECT(CONCATENATE($E$32,\"!P223\"))),\"\",INDIRECT(CONCATENATE($E$32,\"!P223\")))","v":8.532615002035616},{"$f":"IF(ISERROR(INDIRECT(CONCATENATE($E$32,\"!P224\"))),\"\",INDIRECT(CONCATENATE($E$32,\"!P224\")))","v":6.0263032686089426},{"$f":"IF(ISERROR(INDIRECT(CONCATENATE($E$32,\"!Q222\"))),\"\",INDIRECT(CONCATENATE($E$32,\"!Q222\")))","v":91.114264998055987},{"$f":"IF(ISERROR(INDIRECT(CONCATENATE($E$32,\"!Q223\"))),\"\",INDIRECT(CONCATENATE($E$32,\"!Q223\")))","v":5.9583633377974685},{"$f":"IF(ISERROR(INDIRECT(CONCATENATE($E$32,\"!Q224\"))),\"\",INDIRECT(CONCATENATE($E$32,\"!Q224\")))","v":2.9273716641465524}]
[]
[]
[]
[]
[]
[]
[]
[]
[]
[]
[]
[]
[]
[]
[]
[]
[]
[]
[]
[]
[]
[]
[]
[]
[]
[]
[]
[]
[]
[]
[]
[]
[]
[]
[]
[]
[]
[]
[]
[]
[]
[]
[]
[]
[]
[]
[]
[3,"WHS03"]
[null,"ENG12"]
[null,"MICS15"]
[null,"Template"]

{"sheet":"WHS03","index":4,"n_rows":1072,"n_cols":69,"rows_kept":1072,"cut":false,"hidden":false,"merged":[[340,52,341,52],[342,52,343,52],[344,52,345,52],[346,52,347,52],[348,52,349,52],[350,52,351,52],[352,52,353,52],[152,52,160,52],[260,52,262,52],[263,52,266,52],[267,52,269,52],[270,52,272,52],[273,52,275,52],[276,52,283,52],[338,54,338,58],[338,59,338,63],[338,64,338,68],[219,54,219,58],[219,59,219,63],[219,64,219,68],[221,52,223,52],[224,52,225,52],[226,52,229,52],[258,54,258,58],[258,59,258,63],[258,64,258,68],[150,52,151,52],[13,54,13,58],[13,59,13,63],[13,64,13,68],[15,52,16,52],[17,52,20,52],[21,52,22,52],[26,54,26,58],[26,59,26,63],[26,64,26,68],[55,54,55,58],[55,59,55,63],[55,64,55,68],[119,54,119,58],[119,59,119,63],[119,64,119,68],[121,52,122,52],[123,52,126,52],[127,52,128,52],[132,54,132,58],[132,59,132,63],[132,64,132,68],[134,52,138,52],[49,52,51,52],[52,0,54,0],[52,52,54,52],[139,0,142,0],[139,52,142,52],[143,0,146,0],[143,52,146,52],[147,0,149,0],[147,52,149,52],[38,52,39,52],[40,52,41,52],[42,52,43,52],[44,52,45,52],[46,0,48,0],[46,52,48,52],[28,52,29,52],[30,0,31,0],[30,52,31,52],[32,0,33,0],[32,52,33,52],[34,52,35,52],[36,52,37,52],[28,0,29,0],[34,0,35,0],[36,0,37,0],[40,0,41,0],[42,0,43,0],[698,2,698,3],[698,7,698,8],[698,12,698,13],[696,2,696,3],[696,7,696,8],[696,12,696,13],[697,2,697,3],[697,7,697,8],[697,12,697,13],[694,2,694,3],[694,7,694,8],[694,12,694,13],[695,2,695,3],[695,7,695,8],[695,12,695,13],[692,2,692,3],[692,7,692,8],[692,12,692,13],[693,2,693,3],[693,7,693,8],[693,12,693,13],[690,2,690,3],[690,7,690,8],[690,12,690,13],[691,2,691,3],[691,7,691,8],[691,12,691,13],[688,2,688,3],[688,7,688,8],[688,12,688,13],[689,2,689,3],[689,7,689,8],[689,12,689,13],[686,2,686,3],[686,7,686,8],[686,12,686,13],[687,2,687,3],[687,7,687,8],[687,12,687,13],[684,2,684,3],[684,7,684,8],[684,12,684,13],[685,2,685,3],[685,7,685,8],[685,12,685,13],[682,2,682,3],[682,7,682,8],[682,12,682,13],[683,2,683,3],[683,7,683,8],[683,12,683,13],[680,2,680,3],[680,7,680,8],[680,12,680,13],[681,2,681,3],[681,7,681,8],[681,12,681,13],[678,2,678,3],[678,7,678,8],[678,12,678,13],[679,2,679,3],[679,7,679,8],[679,12,679,13],[676,2,676,3],[676,7,676,8],[676,12,676,13],[677,2,677,3],[677,7,677,8],[677,12,677,13],[674,2,674,3],[674,7,674,8],[674,12,674,13],[675,2,675,3],[675,7,675,8],[675,12,675,13],[672,2,672,3],[672,7,672,8],[672,12,672,13],[673,2,673,3],[673,7,673,8],[673,12,673,13],[670,2,670,3],[670,7,670,8],[670,12,670,13],[671,2,671,3],[671,7,671,8],[671,12,671,13],[668,2,668,3],[668,7,668,8],[668,12,668,13],[669,2,669,3],[669,7,669,8],[669,12,669,13],[666,2,666,3],[666,7,666,8],[666,12,666,13],[667,2,667,3],[667,7,667,8],[667,12,667,13],[664,2,664,3],[664,7,664,8],[664,12,664,13],[665,2,665,3],[665,7,665,8],[665,12,665,13],[662,2,662,3],[662,7,662,8],[662,12,662,13],[663,2,663,3],[663,7,663,8],[663,12,663,13],[660,2,660,3],[660,7,660,8],[660,12,660,13],[661,2,661,3],[661,7,661,8],[661,12,661,13],[658,2,658,3],[658,7,658,8],[658,12,658,13],[659,2,659,3],[659,7,659,8],[659,12,659,13],[656,2,656,3],[656,7,656,8],[656,12,656,13],[657,2,657,3],[657,7,657,8],[657,12,657,13],[654,2,654,3],[654,7,654,8],[654,12,654,13],[655,2,655,3],[655,7,655,8],[655,12,655,13],[652,2,652,3],[652,7,652,8],[652,12,652,13],[653,2,653,3],[653,7,653,8],[653,12,653,13],[650,2,650,3],[650,7,650,8],[650,12,650,13],[651,2,651,3],[651,7,651,8],[651,12,651,13],[648,2,648,3],[648,7,648,8],[648,12,648,13],[649,2,649,3],[649,7,649,8],[649,12,649,13],[646,2,646,3],[646,7,646,8],[646,12,646,13],[647,2,647,3],[647,7,647,8],[647,12,647,13],[644,2,644,3],[644,7,644,8],[644,12,644,13],[645,2,645,3],[645,7,645,8],[645,12,645,13],[642,2,642,3],[642,7,642,8],[642,12,642,13],[643,2,643,3],[643,7,643,8],[643,12,643,13],[640,2,640,3],[640,7,640,8],[640,12,640,13],[641,2,641,3],[641,7,641,8],[641,12,641,13],[638,2,638,3],[638,7,638,8],[638,12,638,13],[639,2,639,3],[639,7,639,8],[639,12,639,13],[636,2,636,3],[636,7,636,8],[636,12,636,13],[637,2,637,3],[637,7,637,8],[637,12,637,13],[634,2,634,3],[634,7,634,8],[634,12,634,13],[635,2,635,3],[635,7,635,8],[635,12,635,13],[632,2,632,3],[632,7,632,8],[632,12,632,13],[633,2,633,3],[633,7,633,8],[633,12,633,13],[630,2,630,3],[630,7,630,8],[630,12,630,13],[631,2,631,3],[631,7,631,8],[631,12,631,13],[628,2,628,3],[628,7,628,8],[628,12,628,13],[629,2,629,3],[629,7,629,8],[629,12,629,13],[626,2,626,3],[626,7,626,8],[626,12,626,13],[627,2,627,3],[627,7,627,8],[627,12,627,13],[624,2,624,3],[624,7,624,8],[624,12,624,13],[625,2,625,3],[625,7,625,8],[625,12,625,13],[622,2,622,3],[622,7,622,8],[622,12,622,13],[623,2,623,3],[623,7,623,8],[623,12,623,13],[620,2,620,3],[620,7,620,8],[620,12,620,13],[621,2,621,3],[621,7,621,8],[621,12,621,13],[618,2,618,3],[618,7,618,8],[618,12,618,13],[619,2,619,3],[619,7,619,8],[619,12,619,13],[616,2,616,3],[616,7,616,8],[616,12,616,13],[617,2,617,3],[617,7,617,8],[617,12,617,13],[614,2,614,3],[614,7,614,8],[614,12,614,13],[615,2,615,3],[615,7,615,8],[615,12,615,13],[612,2,612,3],[612,7,612,8],[612,12,612,13],[613,2,613,3],[613,7,613,8],[613,12,613,13],[610,2,610,3],[610,7,610,8],[610,12,610,13],[611,2,611,3],[611,7,611,8],[611,12,611,13],[608,2,608,3],[608,7,608,8],[608,12,608,13],[609,2,609,3],[609,7,609,8],[609,12,609,13],[606,2,606,3],[606,7,606,8],[606,12,606,13],[607,2,607,3],[607,7,607,8],[607,12,607,13],[604,2,604,3],[604,7,604,8],[604,12,604,13],[605,2,605,3],[605,7,605,8],[605,12,605,13],[602,2,602,3],[602,7,602,8],[602,12,602,13],[603,2,603,3],[603,7,603,8],[603,12,603,13],[600,2,600,3],[600,7,600,8],[600,12,600,13],[601,2,601,3],[601,7,601,8],[601,12,601,13],[598,2,598,3],[598,7,598,8],[598,12,598,13],[599,2,599,3],[599,7,599,8],[599,12,599,13],[596,2,596,3],[596,7,596,8],[596,12,596,13],[597,2,597,3],[597,7,597,8],[597,12,597,13],[594,2,594,3],[594,7,594,8],[594,12,594,13],[595,2,595,3],[595,7,595,8],[595,12,595,13],[592,2,592,3],[592,7,592,8],[592,12,592,13],[593,2,593,3],[593,7,593,8],[593,12,593,13],[590,2,590,3],[590,7,590,8],[590,12,590,13],[591,2,591,3],[591,7,591,8],[591,12,591,13],[588,2,588,3],[588,7,588,8],[588,12,588,13],[589,2,589,3],[589,7,589,8],[589,12,589,13],[586,2,586,3],[586,7,586,8],[586,12,586,13],[587,2,587,3],[587,7,587,8],[587,12,587,13],[584,2,584,3],[584,7,584,8],[584,12,584,13],[585,2,585,3],[585,7,585,8],[585,12,585,13],[582,2,582,3],[582,7,582,8],[582,12,582,13],[583,2,583,3],[583,7,583,8],[583,12,583,13],[580,2,580,3],[580,7,580,8],[580,12,580,13],[581,2,581,3],[581,7,581,8],[581,12,581,13],[578,2,578,3],[578,7,578,8],[578,12,578,13],[579,2,579,3],[579,7,579,8],[579,12,579,13],[576,2,576,3],[576,7,576,8],[576,12,576,13],[577,2,577,3],[577,7,577,8],[577,12,577,13],[574,2,574,3],[574,7,574,8],[574,12,574,13],[575,2,575,3],[575,7,575,8],[575,12,575,13],[572,2,572,3],[572,7,572,8],[572,12,572,13],[573,2,573,3],[573,7,573,8],[573,12,573,13],[570,2,570,3],[570,7,570,8],[570,12,570,13],[571,2,571,3],[571,7,571,8],[571,12,571,13],[568,2,568,3],[568,7,568,8],[568,12,568,13],[569,2,569,3],[569,7,569,8],[569,12,569,13],[566,2,566,3],[566,7,566,8],[566,12,566,13],[567,2,567,4],[567,7,567,8],[567,12,567,13],[564,2,564,3],[564,7,564,8],[564,12,564,14],[565,2,565,3],[565,7,565,8],[565,12,565,13],[562,2,562,3],[562,7,562,8],[562,12,562,13],[563,2,563,3],[563,7,563,8],[563,12,563,13],[560,2,560,3],[560,7,560,8],[560,12,560,13],[561,2,561,3],[561,7,561,8],[561,12,561,13],[558,2,558,3],[558,7,558,8],[558,12,558,13],[559,2,559,3],[559,7,559,8],[559,12,559,13],[556,2,556,3],[556,7,556,8],[556,12,556,13],[557,2,557,3],[557,7,557,8],[557,12,557,13],[554,2,554,3],[554,7,554,8],[554,12,554,13],[555,2,555,3],[555,7,555,8],[555,12,555,13],[552,2,552,3],[552,7,552,8],[552,12,552,13],[553,2,553,3],[553,7,553,8],[553,12,553,13],[550,2,550,3],[550,7,550,8],[550,12,550,13],[551,2,551,3],[551,7,551,8],[551,12,551,13],[548,2,548,3],[548,7,548,8],[548,12,548,13],[549,2,549,3],[549,7,549,8],[549,12,549,13],[546,2,546,3],[546,7,546,9],[546,12,546,13],[547,2,547,3],[547,7,547,8],[547,12,547,13],[544,2,544,3],[544,7,544,8],[544,12,544,13],[545,2,545,3],[545,7,545,8],[545,12,545,13],[542,2,542,3],[542,7,542,8],[542,12,542,13],[543,2,543,3],[543,7,543,8],[543,12,543,13],[540,2,540,3],[540,7,540,8],[540,12,540,13],[541,2,541,3],[541,7,541,8],[541,12,541,13],[538,2,538,3],[538,7,538,8],[538,12,538,13],[539,2,539,3],[539,7,539,8],[539,12,539,13],[536,2,536,3],[536,7,536,8],[536,12,536,13],[537,2,537,3],[537,7,537,8],[537,12,537,13],[534,2,534,3],[534,7,534,8],[534,12,534,13],[535,2,535,3],[535,7,535,8],[535,12,535,13],[532,2,532,3],[532,7,532,8],[532,12,532,13],[533,2,533,3],[533,7,533,8],[533,12,533,13],[530,2,530,3],[530,7,530,8],[530,12,530,13],[531,2,531,3],[531,7,531,8],[531,12,531,13],[528,2,528,3],[528,7,528,8],[528,12,528,13],[529,2,529,3],[529,7,529,8],[529,12,529,13],[526,2,526,3],[526,7,526,8],[526,12,526,13],[527,2,527,3],[527,7,527,8],[527,12,527,13],[524,2,524,3],[524,7,524,8],[524,12,524,13],[525,2,525,3],[525,7,525,8],[525,12,525,13],[522,2,522,3],[522,7,522,8],[522,12,522,13],[523,2,523,3],[523,7,523,8],[523,12,523,13],[520,2,520,3],[520,7,520,8],[520,12,520,13],[521,2,521,3],[521,7,521,8],[521,12,521,13],[518,2,518,3],[518,7,518,8],[518,12,518,13],[519,2,519,3],[519,7,519,8],[519,12,519,13],[516,2,516,3],[516,7,516,8],[516,12,516,13],[517,2,517,3],[517,7,517,8],[517,12,517,13],[512,2,512,3],[512,7,512,8],[512,12,513,13],[513,2,513,4],[513,7,513,8],[514,2,515,3],[514,7,514,8],[514,12,514,13],[515,7,515,8],[515,12,515,13],[510,2,510,3],[510,7,510,8],[510,12,510,13],[511,2,511,3],[511,7,511,8],[511,12,511,14],[508,2,509,3],[508,4,508,6],[508,7,508,8],[508,12,508,13],[509,7,509,8],[509,12,509,13],[505,2,505,3],[505,7,505,8],[505,12,505,16],[506,2,506,3],[506,7,506,8],[506,12,507,13],[506,14,506,16],[507,2,507,6],[507,7,507,8],[503,2,503,3],[503,7,503,8],[503,12,503,13],[504,2,504,3],[504,7,504,8],[504,12,504,13],[500,2,500,3],[500,7,501,8],[500,12,500,13],[501,2,501,3],[501,12,501,13],[502,2,502,3],[502,7,502,8],[502,12,502,13],[498,2,498,3],[498,7,498,8],[498,12,498,13],[499,2,499,3],[499,7,499,9],[499,12,499,13],[496,2,496,3],[496,7,496,8],[496,12,496,13],[497,2,497,3],[497,7,497,8],[497,12,497,13],[494,2,494,3],[494,7,495,8],[494,9,494,11],[494,12,494,13],[495,2,495,3],[495,12,495,13],[492,2,492,3],[492,7,492,8],[492,12,492,13],[493,2,493,3],[493,7,493,11],[493,12,493,13],[490,2,490,3],[490,7,490,8],[490,12,490,13],[491,2,491,3],[491,7,491,8],[491,12,491,13],[488,2,488,3],[488,7,488,8],[488,12,488,13],[489,2,489,3],[489,7,489,8],[489,12,489,13],[486,2,486,3],[486,7,486,8],[486,12,486,13],[487,2,487,3],[487,7,487,8],[487,12,487,13],[484,2,484,3],[484,7,484,8],[484,12,484,13],[485,2,485,3],[485,7,485,8],[485,12,485,13],[482,2,482,3],[482,7,482,8],[482,12,482,13],[483,2,483,3],[483,7,483,8],[483,12,483,13],[480,2,480,3],[480,7,480,8],[480,12,480,13],[481,2,481,3],[481,7,481,8],[481,12,481,13],[478,2,478,3],[478,7,478,8],[478,12,478,13],[479,2,479,3],[479,7,479,8],[479,12,479,13],[476,2,476,3],[476,7,476,8],[476,12,476,13],[477,2,477,3],[477,7,477,8],[477,12,477,13],[474,2,474,3],[474,7,474,8],[474,12,474,13],[475,2,475,3],[475,7,475,8],[475,12,475,13],[472,2,472,3],[472,7,472,8],[472,12,472,13],[473,2,473,3],[473,7,473,8],[473,12,473,13],[470,2,470,3],[470,7,470,8],[470,12,470,13],[471,2,471,3],[471,7,471,8],[471,12,471,13],[468,2,468,3],[468,7,468,8],[468,12,468,13],[469,2,469,3],[469,7,469,8],[469,12,469,13],[466,2,466,3],[466,7,466,8],[466,12,466,13],[467,2,467,3],[467,7,467,8],[467,12,467,13],[464,2,464,3],[464,7,464,8],[464,12,464,13],[465,2,465,3],[465,7,465,8],[465,12,465,13],[462,2,462,3],[462,7,462,8],[462,12,462,13],[463,2,463,3],[463,7,463,8],[463,12,463,13],[460,2,460,3],[460,7,460,8],[460,12,460,13],[461,2,461,3],[461,7,461,8],[461,12,461,13],[458,2,458,3],[458,7,458,8],[458,12,458,13],[459,2,459,3],[459,7,459,8],[459,12,459,13],[456,2,456,3],[456,7,456,8],[456,12,456,13],[457,2,457,3],[457,7,457,8],[457,12,457,13],[454,2,454,4],[454,7,454,8],[454,12,454,13],[455,2,455,3],[455,7,455,8],[455,12,455,13],[452,2,452,3],[452,7,452,8],[452,12,452,13],[453,2,453,3],[453,7,453,8],[453,12,453,14],[450,2,450,3],[450,7,450,8],[450,12,450,13],[451,2,451,3],[451,7,451,8],[451,12,451,13],[448,2,448,3],[448,7,448,8],[448,12,448,13],[449,2,449,3],[449,7,449,8],[449,12,449,13],[446,2,446,3],[446,7,446,8],[446,12,446,13],[447,2,447,3],[447,7,447,9],[447,12,447,13],[444,2,444,3],[444,7,444,8],[444,12,444,13],[445,2,445,3],[445,7,445,8],[445,12,445,13],[442,2,442,3],[442,7,442,8],[442,12,442,13],[443,2,443,3],[443,7,443,8],[443,12,443,13],[440,2,440,3],[440,7,440,8],[440,12,440,13],[441,2,441,3],[441,7,441,8],[441,12,441,13],[438,2,438,3],[438,7,438,8],[438,12,438,13],[439,2,439,3],[439,7,439,8],[439,12,439,13],[436,2,436,3],[436,7,436,8],[436,12,436,13],[437,2,437,3],[437,7,437,8],[437,12,437,13],[434,2,434,3],[434,7,434,8],[434,12,434,13],[435,2,435,3],[435,7,435,8],[435,12,435,13],[432,2,432,3],[432,7,432,8],[432,12,432,13],[433,2,433,3],[433,7,433,8],[433,12,433,13],[430,2,430,3],[430,7,430,8],[430,12,430,13],[431,2,431,3],[431,7,431,8],[431,12,431,13],[428,2,428,3],[428,7,428,8],[428,12,428,13],[429,2,429,3],[429,7,429,8],[429,12,429,13],[426,2,426,3],[426,7,426,8],[426,12,426,13],[427,2,427,3],[427,7,427,8],[427,12,427,13],[424,2,424,3],[424,7,424,8],[424,12,424,13],[425,2,425,3],[425,7,425,8],[425,12,425,13],[414,2,414,3],[414,7,414,8],[414,12,414,13],[422,2,422,3],[422,7,422,8],[422,12,422,13],[423,2,423,3],[423,7,423,8],[423,12,423,13],[420,2,420,3],[420,7,420,8],[420,12,420,13],[421,2,421,3],[421,7,421,8],[421,12,421,13],[418,2,418,3],[418,7,418,8],[418,12,418,13],[419,2,419,3],[419,7,419,8],[419,12,419,13],[404,7,404,8],[404,12,404,13],[405,2,405,3],[405,7,405,8],[405,12,405,13],[410,2,410,3],[410,7,410,8],[410,12,410,13],[411,2,411,3],[411,7,411,8],[416,2,416,3],[416,7,416,8],[416,12,416,13],[417,2,417,3],[417,7,417,8],[417,12,417,13],[415,2,415,3],[415,7,415,8],[415,12,415,13],[412,2,412,3],[412,7,412,8],[412,12,412,13],[413,2,413,3],[413,7,413,8],[413,12,413,13],[411,12,411,13],[408,2,408,3],[408,7,408,8],[408,12,408,13],[409,2,409,3],[409,7,409,8],[409,12,409,13],[1030,0,1031,0],[1032,0,1032,2],[1033,0,1033,2],[219,2,219,6],[219,7,219,11],[219,12,219,16],[221,0,223,0],[398,2,398,5],[398,7,398,10],[398,12,398,15],[399,2,399,4],[399,7,399,9],[399,12,399,14],[1024,0,1024,2],[1025,0,1025,1],[400,2,401,3],[400,7,401,8],[400,12,401,13],[401,1,444,1],[402,2,402,3],[402,7,402,8],[402,12,402,13],[403,2,403,3],[403,7,403,8],[403,12,403,13],[406,2,406,3],[406,7,406,8],[406,12,406,13],[407,2,407,3],[407,7,407,8],[407,12,407,13],[404,2,404,3],[21,0,22,0],[23,0,25,0],[26,2,26,6],[26,7,26,11],[26,12,26,16],[44,0,45,0],[38,0,39,0],[49,0,51,0],[13,2,13,6],[13,7,13,11],[13,12,13,16],[15,0,16,0],[17,0,20,0],[207,0,207,1],[132,7,132,11],[132,12,132,16],[134,0,138,0]],"merged_total":1015,"flags":["merged_cut"]}
[]
[{"$f":"A1026","v":"Mexico"}]
[{"$f":"A1034","v":"2003"}]
["Use of drinking water sources"]
[" by wealth quintile and sub-national region"]
["Notes:"]
["WHO/UNICEF JMP customised wealth index excludes water,"]
[" sanitation and hygiene assets."]
["Survey used for analysis:",{"$f":"A1025","v":"WHS03"}]
[{"$f":"B1028","v":""}]
["Time to improved source based on:","MICS15"]
[]
[]
["Use of drinking water sources",null,"NATIONAL wealth index quintile",null,null,null,null,"URBAN wealth index quintile",null,null,null,null,"RURAL wealth index quintile",null,null,null,null,null,null,null,null,null,null,null,null,null,null,null,null,null,null,null,null,null,null,null,null,null,null,null,null,null,null,null,null,null,null,null,null,null,null,null,"Raw numbers of respondents:","Use of drinking water sources","NATIONAL wealth index quintile",null,null,null,null,"URBAN wealth index quintile",null,null,null,null,"RURAL wealth index quintile"]
["Weighted percentage (used in graphs)",null,"Poorest","Poor","Middle","Rich","Richest","Poorest","Poor","Middle","Rich","Richest","Poorest","Poor","Middle","Rich","Richest",null,null,null,null,null,null,null,null,null,null,null,null,null,null,null,null,null,null,null,null,null,null,null,null,null,null,null,null,null,null,null,null,null,null,null,"Water data, raw numbers (weighted)",null,"Poorest","Poor","Middle","Rich","Richest","Poorest","Poor","Middle","Rich","Richest","Poorest","Poor","Middle","Rich","Richest"]
["Water","Improved",{"$f":"C58+C59+C60+C61+C63+C65","v":86.439525759120116},98.739291273705007,99.657983369799126,99.781970795279847,99.943987348567191,98.489609499682558,99.629342731992466,99.710941761132446,99.867074049347266,99.991512150349877,72.976187936748261,80.918839439497731,89.740596563832028,97.008243005519276,99.350197996793355,null,null,null,null,null,null,null,null,null,null,null,null,null,null,null,null,null,null,null,null,null,null,null,null,null,null,null,null,null,null,null,null,null,null,null,"Water","Improved","N/A","N/A","N/A","N/A","N/A","N/A","N/A","N/A","N/A","N/A","N/A","N/A","N/A","N/A","N/A"]
[null,"Not Improved",{"$f":"100-C16","v":13.560474240879884},{"$f":"100-D16","v":1.2607087262949932},0.34201663020087381,0.2180292047201533,5.601265143280898E-2,1.5103905003174418,0.37065726800753396,0.289058238867554,0.1329259506527336,8.4878496501232803E-3,27.023812063251739,19.081160560502269,10.259403436167972,2.9917569944807241,0.64980200320664494,null,null,null,null,null,null,null,null,null,null,null,null,null,null,null,null,null,null,null,null,null,null,null,null,null,null,null,null,null,null,null,null,null,null,null,null,"Not Improved","N/A","N/A","N/A","N/A","N/A","N/A","N/A","N/A","N/A","N/A","N/A","N/A","N/A","N/A","N/A"]
["Water ladder","Basic",{"$f":"C16*MICS15!C23/100","v":84.983337947491151},{"$f":"D16*MICS15!D23/100","v":98.6195109796558},{"$f":"E16*MICS15!E23/100","v":99.543150050491747},{"$f":"F16*MICS15!F23/100","v":99.781970795279847},{"$f":"G16*MICS15!G23/100","v":99.943987348567191},{"$f":"H16*MICS15!H23/100","v":98.364375597189849},{"$f":"I16*MICS15!I23/100","v":99.560559348777758},{"$f":"J16*MICS15!J23/100","v":99.644080257768621},{"$f":"K16*MICS15!K23/100","v":99.867074049347266},{"$f":"L16*MICS15!L23/100","v":99.991512150349877},{"$f":"M16*MICS15!M23/100","v":69.306777965593795},{"$f":"N16*MICS15!N23/100","v":80.300203621068334},{"$f":"O16*MICS15!O23/100","v":88.460534005575369},{"$f":"P16*MICS15!P23/100","v":96.511770193906045},{"$f":"Q16*MICS15!Q23/100","v":99.30340948687801},null,null,null,null,null,null,null,null,null,null,null,null,null,null,null,null,null,null,null,null,null,null,null,null,null,null,null,null,null,null,null,null,null,null,null,"Water ladder","Basic","N/A","N/A","N/A","N/A","N/A","N/A","N/A","N/A","N/A","N/A","N/A","N/A","N/A","N/A","N/A"]
[null,"Limited",{"$f":"C16*MICS15!C22/100","v":1.4561878116289435},{"$f":"D16*MICS15!D22/100","v":0.11978029404920924},{"$f":"E16*MICS15!E22/100","v":0.11483331930735248},{"$f":"F16*MICS15!F22/100","v":0},{"$f":"G16*MICS15!G22/100","v":0},{"$f":"H16*MICS15!H22/100","v":0.12523390249269956},{"$f":"I16*MICS15!I22/100","v":6.8783383214741964E-2},{"$f":"J16*MICS15!J22/100","v":6.6861503363844957E-2},{"$f":"K16*MICS15!K22/100","v":0},{"$f":"L16*MICS15!L22/100","v":0},{"$f":"M16*MICS15!M22/100","v":3.6694099711544839},{"$f":"N16*MICS15!N22/100","v":0.61863581842941762},{"$f":"O16*MICS15!O22/100","v":1.2800625582566494},{"$f":"P16*MICS15!P22/100","v":0.49647281161322598},{"$f":"Q16*MICS15!Q22/100","v":4.6788509915334481E-2},null,null,null,null,null,null,null,null,null,null,null,null,null,null,null,null,null,null,null,null,null,null,null,null,null,null,null,null,null,null,null,null,null,null,null,null,"Limited","N/A","N/A","N/A","N/A","N/A","N/A","N/A","N/A","N/A","N/A","N/A","N/A","N/A","N/A","N/A"]
[null,"Unimproved",{"$f":"100-(C18+C19+C21)","v":3.7084877443075754},{"$f":"100-(D18+D19+D21)","v":0.59735119331206477},0.27042485415492479,0.21385911567702465,3.4829157660880128E-2,1.0658707289232154,0.26779418979754155,0.28374027909832478,0.1329259506527336,0,8.4848501234844065,3.7672130737019529,1.8823039082891455,0.77311589487271704,0.36641380646491939,null,null,null,null,null,null,null,null,null,null,null,null,null,null,null,null,null,null,null,null,null,null,null,null,null,null,null,null,null,null,null,null,null,null,null,null,"Unimproved","N/A","N/A","N/A","N/A","N/A","N/A","N/A","N/A","N/A","N/A","N/A","N/A","N/A","N/A","N/A"]
[null,"Surface water",{"$f":"C64","v":9.8519864965723176},0.66335753298293354,7.1591776045981631E-2,4.1700890431220451E-3,2.1183493771925826E-2,0.44451977139424004,0.10286307820997044,5.3179597692195463E-3,0,8.4878496501238996E-3,18.538961939767315,15.313947486800302,8.3770995278788405,2.2186410996080106,0.2833881967417336,null,null,null,null,null,null,null,null,null,null,null,null,null,null,null,null,null,null,null,null,null,null,null,null,null,null,null,null,null,null,null,null,null,null,null,null,"Surface water","N/A","N/A","N/A","N/A","N/A","N/A","N/A","N/A","N/A","N/A","N/A","N/A","N/A","N/A","N/A"]
["Improved water point at more than 30 minutes","Yes","N/A","N/A","N/A","N/A","N/A","N/A","N/A","N/A","N/A","N/A","N/A","N/A","N/A","N/A","N/A",null,null,null,null,null,null,null,null,null,null,null,null,null,null,null,null,null,null,null,null,null,null,null,null,null,null,null,null,null,null,null,null,null,null,null,"Improved water point at more than 30 minutes","Yes","N/A","N/A","N/A","N/A","N/A","N/A","N/A","N/A","N/A","N/A","N/A","N/A","N/A","N/A","N/A"]
[null,"No","N/A","N/A","N/A","N/A","N/A","N/A","N/A","N/A","N/A","N/A","N/A","N/A","N/A","N/A","N/A",null,null,null,null,null,null,null,null,null,null,null,null,null,null,null,null,null,null,null,null,null,null,null,null,null,null,null,null,null,null,null,null,null,null,null,null,"No","N/A","N/A","N/A","N/A","N/A","N/A","N/A","N/A","N/A","N/A","N/A","N/A","N/A","N/A","N/A"]
["Manually calculated ratios","Improved wells"]
[null,"Improved springs"]
[null,"Other"]
[null,null,"NATIONAL wealth index quintile",null,null,null,null,"URBAN wealth index quintile",null,null,null,null,"RURAL wealth index quintile",null,null,null,null,null,null,null,null,null,null,null,null,null,null,null,null,null,null,null,null,null,null,null,null,null,null,null,null,null,null,null,null,null,null,null,null,null,null,null,"Raw numbers of respondents:","Use of drinking water sources","NATIONAL wealth index quintile",null,null,null,null,"URBAN wealth index quintile",null,null,null,null,"RURAL wealth index quintile"]
["Percentage based on weighted population",null,"Poorest","Poor","Middle","Rich","Richest","Poorest","Poor","Middle","Rich","Richest","Poorest","Poor","Middle","Rich","Richest",null,null,null,null,null,null,null,null,null,null,null,null,null,null,null,null,null,null,null,null,null,null,null,null,null,null,null,null,null,null,null,null,null,null,null,"Water data, raw numbers (weighted)",null,"Poorest","Poor","Middle","Rich","Richest","Poorest","Poor","Middle","Rich","Richest","Poorest","Poor","Middle","Rich","Richest"]
["Piped water","Yes",70.37203308699668,93.077011582739416,96.35917989146391,97.926445207677233,98.945612353245721,90.580150101922953,96.230046389043338,97.593886016788232,98.723260440345626,99.638538314753816,51.562706776788673,62.16769687669035,75.617067593941442,87.404178507715557,91.330530811586698,null,null,null,null,null,null,null,null,null,null,null,null,null,null,null,null,null,null,null,null,null,null,null,null,null,null,null,null,null,null,null,null,null,null,null,"Piped water","Yes","N/A","N/A","N/A","N/A","N/A","N/A","N/A","N/A","N/A","N/A","N/A","N/A","N/A","N/A","N/A"]
[null,"No",29.627966913003327,6.9229884172605889,3.6408201085360887,2.0735547923227768,1.0543876467542732,9.4198498980770502,3.7699536109566645,2.4061139832117631,1.2767395596543667,0.36146168524618738,48.437293223211334,37.83230312330965,24.382932406058558,12.59582149228444,8.6694691884133093,null,null,null,null,null,null,null,null,null,null,null,null,null,null,null,null,null,null,null,null,null,null,null,null,null,null,null,null,null,null,null,null,null,null,null,null,"No","N/A","N/A","N/A","N/A","N/A","N/A","N/A","N/A","N/A","N/A","N/A","N/A","N/A","N/A","N/A"]
["Piped water on premises","Yes",68.638089240103682,92.222225384774973,95.502102285303707,96.625415265692666,97.318045740706566,89.212521828955275,95.510113079147629,96.794033112926442,97.104868733614254,97.844725832790118,49.112687364971265,60.062488455499299,74.656644198339222,86.762533058801594,90.829870245678009,null,null,null,null,null,null,null,null,null,null,null,null,null,null,null,null,null,null,null,null,null,null,null,null,null,null,null,null,null,null,null,null,null,null,null,"Piped water on premises","Yes","N/A","N/A","N/A","N/A","N/A","N/A","N/A","N/A","N/A","N/A","N/A","N/A","N/A","N/A","N/A"]
[null,"No",31.361910759896311,7.7777746152250264,4.4978977146963013,3.3745847343073452,2.6819542592934433,10.787478171044723,4.4898869208523733,3.2059668870735485,2.8951312663857385,2.1552741672098841,50.887312635028735,39.937511544500701,25.343355801660767,13.237466941198409,9.1701297543219926,null,null,null,null,null,null,null,null,null,null,null,null,null,null,null,null,null,null,null,null,null,null,null,null,null,null,null,null,null,null,null,null,null,null,null,null,"No","N/A","N/A","N/A","N/A","N/A","N/A","N/A","N/A","N/A","N/A","N/A","N/A","N/A","N/A","N/A"]
["Piped water into dwelling","Yes","N/A","N/A","N/A","N/A","N/A","N/A","N/A","N/A","N/A","N/A","N/A","N/A","N/A","N/A","N/A",null,null,null,null,null,null,null,null,null,null,null,null,null,null,null,null,null,null,null,null,null,null,null,null,null,null,null,null,null,null,null,null,null,null,null,"Piped water into dwelling","Yes","N/A","N/A","N/A","N/A","N/A","N/A","N/A","N/A","N/A","N/A","N/A","N/A","N/A","N/A","N/A"]
[null,"No","N/A","N/A","N/A","N/A","N/A","N/A","N/A","N/A","N/A","N/A","N/A","N/A","N/A","N/A","N/A",null,null,null,null,null,null,null,null,null,null,null,null,null,null,null,null,null,null,null,null,null,null,null,null,null,null,null,null,null,null,null,null,null,null,null,null,"No","N/A","N/A","N/A","N/A","N/A","N/A","N/A","N/A","N/A","N/A","N/A","N/A","N/A","N/A","N/A"]
["Water source on premises","Yes","N/A","N/A","N/A","N/A","N/A","N/A","N/A","N/A","N/A","N/A","N/A","N/A","N/A","N/A","N/A",null,null,null,null,null,null,null,null,null,null,null,null,null,null,null,null,null,null,null,null,null,null,null,null,null,null,null,null,null,null,null,null,null,null,null,"Water source on premises","Yes","N/A","N/A","N/A","N/A","N/A","N/A","N/A","N/A","N/A","N/A","N/A","N/A","N/A","N/A","N/A"]
[null,"No","N/A","N/A","N/A","N/A","N/A","N/A","N/A","N/A","N/A","N/A","N/A","N/A","N/A","N/A","N/A",null,null,null,null,null,null,null,null,null,null,null,null,null,null,null,null,null,null,null,null,null,null,null,null,null,null,null,null,null,null,null,null,null,null,null,null,"No","N/A","N/A","N/A","N/A","N/A","N/A","N/A","N/A","N/A","N/A","N/A","N/A","N/A","N/A","N/A"]
["Improved Water source on premises","Yes","N/A","N/A","N/A","N/A","N/A","N/A","N/A","N/A","N/A","N/A","N/A","N/A","N/A","N/A","N/A",null,null,null,null,null,null,null,null,null,null,null,null,null,null,null,null,null,null,null,null,null,null,null,null,null,null,null,null,null,null,null,null,null,null,null,"Improved water source on premises","Yes","N/A","N/A","N/A","N/A","N/A","N/A","N/A","N/A","N/A","N/A","N/A","N/A","N/A","N/A","N/A"]
[null,"No","N/A","N/A","N/A","N/A","N/A","N/A","N/A","N/A","N/A","N/A","N/A","N/A","N/A","N/A","N/A",null,null,null,null,null,null,null,null,null,null,null,null,null,null,null,null,null,null,null,null,null,null,null,null,null,null,null,null,null,null,null,null,null,null,null,null,"No","N/A","N/A","N/A","N/A","N/A","N/A","N/A","N/A","N/A","N/A","N/A","N/A","N/A","N/A","N/A"]
["Piped water on premises available when needed","Yes","N/A","N/A","N/A","N/A","N/A","N/A","N/A","N/A","N/A","N/A","N/A","N/A","N/A","N/A","N/A",null,null,null,null,null,null,null,null,null,null,null,null,null,null,null,null,null,null,null,null,null,null,null,null,null,null,null,null,null,null,null,null,null,null,null,"Piped water on premises available when needed","Yes","N/A","N/A","N/A","N/A","N/A","N/A","N/A","N/A","N/A","N/A","N/A","N/A","N/A","N/A","N/A"]
[null,"No","N/A","N/A","N/A","N/A","N/A","N/A","N/A","N/A","N/A","N/A","N/A","N/A","N/A","N/A","N/A",null,null,null,null,null,null,null,null,null,null,null,null,null,null,null,null,null,null,null,null,null,null,null,null,null,null,null,null,null,null,null,null,null,null,null,null,"No","N/A","N/A","N/A","N/A","N/A","N/A","N/A","N/A","N/A","N/A","N/A","N/A","N/A","N/A","N/A"]
["Water point at more than 30 minutes","Yes","N/A","N/A","N/A","N/A","N/A","N/A","N/A","N/A","N/A","N/A","N/A","N/A","N/A","N/A","N/A",null,null,null,null,null,null,null,null,null,null,null,null,null,null,null,null,null,null,null,null,null,null,null,null,null,null,null,null,null,null,null,null,null,null,null,"Water point at more than 30 minutes","Yes","N/A","N/A","N/A","N/A","N/A","N/A","N/A","N/A","N/A","N/A","N/A","N/A","N/A","N/A","N/A"]
[null,"No","N/A","N/A","N/A","N/A","N/A","N/A","N/A","N/A","N/A","N/A","N/A","N/A","N/A","N/A","N/A",null,null,null,null,null,null,null,null,null,null,null,null,null,null,null,null,null,null,null,null,null,null,null,null,null,null,null,null,null,null,null,null,null,null,null,null,"No","N/A","N/A","N/A","N/A","N/A","N/A","N/A","N/A","N/A","N/A","N/A","N/A","N/A","N/A","N/A"]
["Water source available when needed","Yes","N/A","N/A","N/A","N/A","N/A","N/A","N/A","N/A","N/A","N/A","N/A","N/A","N/A","N/A","N/A",null,null,null,null,null,null,null,null,null,null,null,null,null,null,null,null,null,null,null,null,null,null,null,null,null,null,null,null,null,null,null,null,null,null,null,"Water source available when needed","Yes","N/A","N/A","N/A","N/A","N/A","N/A","N/A","N/A","N/A","N/A","N/A","N/A","N/A","N/A","N/A"]
[null,"No","N/A","N/A","N/A","N/A","N/A","N/A","N/A","N/A","N/A","N/A","N/A","N/A","N/A","N/A","N/A",null,null,null,null,null,null,null,null,null,null,null,null,null,null,null,null,null,null,null,null,null,null,null,null,null,null,null,null,null,null,null,null,null,null,null,null,"No","N/A","N/A","N/A","N/A","N/A","N/A","N/A","N/A","N/A","N/A","N/A","N/A","N/A","N/A","N/A"]
["Improved water source available when needed","Yes","N/A","N/A","N/A","N/A","N/A","N/A","N/A","N/A","N/A","N/A","N/A","N/A","N/A","N/A","N/A",null,null,null,null,null,null,null,null,null,null,null,null,null,null,null,null,null,null,null,null,null,null,null,null,null,null,null,null,null,null,null,null,null,null,null,"Improved water source available when needed","Yes","N/A","N/A","N/A","N/A","N/A","N/A","N/A","N/A","N/A","N/A","N/A","N/A","N/A","N/A","N/A"]
[null,"No","N/A","N/A","N/A","N/A","N/A","N/A","N/A","N/A","N/A","N/A","N/A","N/A","N/A","N/A","N/A",null,null,null,null,null,null,null,null,null,null,null,null,null,null,null,null,null,null,null,null,null,null,null,null,null,null,null,null,null,null,null,null,null,null,null,null,"No","N/A","N/A","N/A","N/A","N/A","N/A","N/A","N/A","N/A","N/A","N/A","N/A","N/A","N/A","N/A"]
["Microbiological quality at point of collection","Not contaminated (No E. coli in 100 mL)","N/A","N/A","N/A","N/A","N/A","N/A","N/A","N/A","N/A","N/A","N/A","N/A","N/A","N/A","N/A",null,null,null,null,null,null,null,null,null,null,null,null,null,null,null,null,null,null,null,null,null,null,null,null,null,null,null,null,null,null,null,null,null,null,null,"Microbiological quality at point of collection","Not contaminated (No E. coli in 100 mL)","N/A","N/A","N/A","N/A","N/A","N/A","N/A","N/A","N/A","N/A","N/A","N/A","N/A","N/A","N/A"]
[null,"Contaminated (E. coli detected in 100 mL)","N/A","N/A","N/A","N/A","N/A","N/A","N/A","N/A","N/A","N/A","N/A","N/A","N/A","N/A","N/A",null,null,null,null,null,null,null,null,null,null,null,null,null,null,null,null,null,null,null,null,null,null,null,null,null,null,null,null,null,null,null,null,null,null,null,null,"Contaminated (E. coli detected in 100 mL)","N/A","N/A","N/A","N/A","N/A","N/A","N/A","N/A","N/A","N/A","N/A","N/A","N/A","N/A","N/A"]
[null,"Highly contaminated (>100 CFU/100 mL)","N/A","N/A","N/A","N/A","N/A","N/A","N/A","N/A","N/A","N/A","N/A","N/A","N/A","N/A","N/A",null,null,null,null,null,null,null,null,null,null,null,null,null,null,null,null,null,null,null,null,null,null,null,null,null,null,null,null,null,null,null,null,null,null,null,null,"Highly contaminated (>100 CFU/100 mL)","N/A","N/A","N/A","N/A","N/A","N/A","N/A","N/A","N/A","N/A","N/A","N/A","N/A","N/A","N/A"]
["Microbiological quality of improved water sources at point of collection","Not contaminated (No E. coli in 100 mL)","N/A","N/A","N/A","N/A","N/A","N/A","N/A","N/A","N/A","N/A","N/A","N/A","N/A","N/A","N/A",null,null,null,null,null,null,null,null,null,null,null,null,null,null,null,null,null,null,null,null,null,null,null,null,null,null,null,null,null,null,null,null,null,null,null,"Microbiological quality of improved water sources at point of collection","Not contaminated (No E. coli in 100 mL)","N/A","N/A","N/A","N/A","N/A","N/A","N/A","N/A","N/A","N/A","N/A","N/A","N/A","N/A","N/A"]
[null,"Contaminated (E. coli detected in 100 mL)","N/A","N/A","N/A","N/A","N/A","N/A","N/A","N/A","N/A","N/A","N/A","N/A","N/A","N/A","N/A",null,null,null,null,null,null,null,null,null,null,null,null,null,null,null,null,null,null,null,null,null,null,null,null,null,null,null,null,null,null,null,null,null,null,null,null,"Contaminated (E. coli detected in 100 mL)","N/A","N/A","N/A","N/A","N/A","N/A","N/A","N/A","N/A","N/A","N/A","N/A","N/A","N/A","N/A"]
[null,"Highly contaminated (>100 CFU/100 mL)","N/A","N/A","N/A","N/A","N/A","N/A","N/A","N/A","N/A","N/A","N/A","N/A","N/A","N/A","N/A",null,null,null,null,null,null,null,null,null,null,null,null,null,null,null,null,null,null,null,null,null,null,null,null,null,null,null,null,null,null,null,null,null,null,null,null,"Highly contaminated (>100 CFU/100 mL)","N/A","N/A","N/A","N/A","N/A","N/A","N/A","N/A","N/A","N/A","N/A","N/A","N/A","N/A","N/A"]
["Microbiological quality of piped on premises at point of collection","Not contaminated (No E. coli in 100 mL)","N/A","N/A","N/A","N/A","N/A","N/A","N/A","N/A","N/A","N/A","N/A","N/A","N/A","N/A","N/A",null,null,null,null,null,null,null,null,null,null,null,null,null,null,null,null,null,null,null,null,null,null,null,null,null,null,null,null,null,null,null,null,null,null,null,"Microbiological quality of piped on premises at point of collection","Not contaminated (No E. coli in 100 mL)","N/A","N/A","N/A","N/A","N/A","N/A","N/A","N/A","N/A","N/A","N/A","N/A","N/A","N/A","N/A"]
[null,"Contaminated (E. coli detected in 100 mL)","N/A","N/A","N/A","N/A","N/A","N/A","N/A","N/A","N/A","N/A","N/A","N/A","N/A","N/A","N/A",null,null,null,null,null,null,null,null,null,null,null,null,null,null,null,null,null,null,null,null,null,null,null,null,null,null,null,null,null,null,null,null,null,null,null,null,"Contaminated (E. coli detected in 100 mL)","N/A","N/A","N/A","N/A","N/A","N/A","N/A","N/A","N/A","N/A","N/A","N/A","N/A","N/A","N/A"]
[null,"Highly contaminated (>100 CFU/100 mL)","N/A","N/A","N/A","N/A","N/A","N/A","N/A","N/A","N/A","N/A","N/A","N/A","N/A","N/A","N/A",null,null,null,null,null,null,null,null,null,null,null,null,null,null,null,null,null,null,null,null,null,null,null,null,null,null,null,null,null,null,null,null,null,null,null,null,"Highly contaminated (>100 CFU/100 mL)","N/A","N/A","N/A","N/A","N/A","N/A","N/A","N/A","N/A","N/A","N/A","N/A","N/A","N/A","N/A"]
[null,null,"NATIONAL wealth index quintile",null,null,null,null,"URBAN wealth index quintile",null,null,null,null,"RURAL wealth index quintile",null,null,null,null,null,null,null,null,null,null,null,null,null,null,null,null,null,null,null,null,null,null,null,null,null,null,null,null,null,null,null,null,null,null,null,null,null,null,null,"Raw numbers of respondents:","Use of drinking water sources","NATIONAL wealth index quintile",null,null,null,null,"URBAN wealth index quintile",null,null,null,null,"RURAL wealth index quintile"]
["Percentage based on weighted population",null,"Poorest","Poor","Middle","Rich","Richest","Poorest","Poor","Middle","Rich","Richest","Poorest","Poor","Middle","Rich","Richest",null,null,null,null,null,null,null,null,null,null,null,null,null,null,null,null,null,null,null,null,null,null,null,null,null,null,null,null,null,null,null,null,null,null,null,"Water data, raw numbers (weighted)",null,"Poorest","Poor","Middle","Rich","Richest","Poorest","Poor","Middle","Rich","Richest","Poorest","Poor","Middle","Rich","Richest"]
["main source of drinking water","Piped water through house connection or yard",68.638089240103682,92.222225384774973,95.502102285303707,96.625415265692666,97.318045740706566,89.212521828955275,95.510113079147629,96.794033112926442,97.104868733614254,97.844725832790118,49.112687364971265,60.062488455499299,74.656644198339222,86.762533058801594,90.829870245678009]
[null,"Public standpipe",1.7339438468929851,0.85478619796443711,0.85707760616021278,1.3010299419845681,1.6275666125391699,1.3676282729676743,0.71993330989570847,0.79985290386178476,1.6183917067313722,1.7938124819636965,2.4500194118174048,2.1052084211910485,0.96042339560221024,0.64164544891397113,0.50066056590868357]
[null,"Protected tube well or bore hole",8.7178932296903842,2.9612997371013678,1.7021146268517318,0.84870805439126917,0.50499906528805694,4.1487854680838865,1.7634013356280065,0.67983795932462643,0.61293320591084755,0.13383610381746322,11.550825372833128,10.929567776764053,7.4536273953639069,5.2812500552718253,4.6744119730824432]
[null,"Protected dug well or protected spring",4.4197747528924278,1.4611321345720252,0.68406323183380924,0.32234249773126106,0.25946536981414536,1.7523515848306002,0.85316828773034437,0.49841667692436775,0.12091962710944514,0.1380976525162336,6.804406893066389,4.8003901815948087,3.8991051437007846,2.757485914146363,1.7094945485933852]
[null,"Unprotected dug well or spring",3.7084877443075612,0.59735119331207043,0.27042485415490453,0.21385911567703081,3.4829157660900799E-2,1.0658707289232154,0.26779418979755421,0.28374027909834115,0.132925950652729,0,8.4848501234844367,3.7672130737019534,1.882303908289112,0.77311589487272292,0.36641380646491462]
[null,"Rainwater (into tank or cistern )",0.6791667674692119,8.2415117097678306E-2,3.0072236518946249E-2,9.6455602554331634E-3,1.9294526819137282E-2,0.18694417667184571,4.0991697214961834E-2,1.9576315150566556E-2,1.2557244871246263E-2,2.4933439722961085E-2,1.1829538627266341,0.89692123947597902,0.36997398877720938,0.19127464780840828,0]
[null,"Water taken directly from pond-water or stream",9.8519864965723176,0.66335753298293354,7.1591776045981631E-2,4.1700890431220451E-3,2.1183493771925826E-2,0.44451977139424004,0.10286307820997044,5.3179597692195463E-3,0,8.4878496501238996E-3,18.538961939767315,15.313947486800302,8.3770995278788405,2.2186410996080106,0.2833881967417336]
[null,"Tanker-truck, vendor",2.2506579220714218,1.1574327021945132,0.88255338313071496,0.67482947522466052,0.21461603340010715,1.8213781681732617,0.74173502237582745,0.91922479294464177,0.39740353111009863,5.6106639539405562E-2,1.8752950313334324,2.1242633649725562,2.4008224420487045,1.374053880577109,1.6357606635308319]
[]
[]
[]
[]
[]
[]
[]
[]
[]
[]
[]
[]
[]
[]
[]
[]
[]
[]
[]
[]
[]
[]
[]
[]
[]
[]
[]
[]
[]
[]
[]
[]
[]
[]
[]
[]
[]
[]
[]
[]
[]
[]
[{"$f":"A1026","v":"Mexico"}]
[{"$f":"A1034","v":"2003"}]
["Use of sanitation facilities"]
[" by wealth quintile and sub-national region"]
["Notes:"]
["WHO/UNICEF JMP customised wealth index excludes water,"]
[" sanitation and hygiene assets."]
["Survey used for analysis:",{"$f":"A1025","v":"WHS03"}]
["Ratio of Shared improved based on:","MICS15"]
[{"$f":"B1029","v":""}]
[]
[]
["Use of sanitation facilities",null,"NATIONAL wealth index quintile",null,null,null,null,"URBAN wealth index quintile",null,null,null,null,"RURAL wealth index quintile",null,null,null,null,null,null,null,null,null,null,null,null,null,null,null,null,null,null,null,null,null,null,null,null,null,null,null,null,null,null,null,null,null,null,null,null,null,null,null,"Raw numbers of respondents:","Use of sanitation facilities","NATIONAL wealth index quintile",null,null,null,null,"URBAN wealth index quintile",null,null,null,null,"RURAL wealth index quintile"]
["Weighted percentage (used in graphs)",null,"Poorest","Poor","Middle","Rich","Richest","Poorest","Poor","Middle","Rich","Richest","Poorest","Poor","Middle","Rich","Richest",null,null,null,null,null,null,null,null,null,null,null,null,null,null,null,null,null,null,null,null,null,null,null,null,null,null,null,null,null,null,null,null,null,null,null,"Sanitation data, raw numbers (weighted)",null,"Poorest","Poor","Middle","Rich","Richest","Poorest","Poor","Middle","Rich","Richest","Poorest","Poor","Middle","Rich","Richest"]
["Sanitation","Improved",{"$f":"C153+C154+C155+(C156+C157)*MICS15!C130/100","v":78.687664968942755},{"$f":"D153+D154+D155+(D156+D157)*MICS15!D130/100","v":96.457227049284882},{"$f":"E153+E154+E155+(E156+E157)*MICS15!E130/100","v":99.301775477890146},{"$f":"F153+F154+F155+(F156+F157)*MICS15!F130/100","v":99.712290388904592},{"$f":"G153+G154+G155+(G156+G157)*MICS15!G130/100","v":99.87845050967654},{"$f":"H153+H154+H155+(H156+H157)*MICS15!H130/100","v":94.659190432019727},{"$f":"I153+I154+I155+(I156+I157)*MICS15!I130/100","v":99.193604930384538},{"$f":"J153+J154+J155+(J156+J157)*MICS15!J130/100","v":99.864222238435914},{"$f":"K153+K154+K155+(K156+K157)*MICS15!K130/100","v":99.910021899766946},{"$f":"L153+L154+L155+(L156+L157)*MICS15!L130/100","v":99.962204093806122},{"$f":"M153+M154+M155+(M156+M157)*MICS15!M130/100","v":64.322379991590026},{"$f":"N153+N154+N155+(N156+N157)*MICS15!N130/100","v":74.407180077212047},{"$f":"O153+O154+O155+(O156+O157)*MICS15!O130/100","v":81.677595160277633},{"$f":"P153+P154+P155+(P156+P157)*MICS15!P130/100","v":90.767471946542116},{"$f":"Q153+Q154+Q155+(Q156+Q157)*MICS15!Q130/100","v":97.369455765606517},null,null,null,null,null,null,null,null,null,null,null,null,null,null,null,null,null,null,null,null,null,null,null,null,null,null,null,null,null,null,null,null,null,null,null,"Sanitation","Improved",3596328.1209068298,4174056.5438499451,4462077.1428909302,4388568.6731834412,4393063.9540481567,3190614.9550666809,3368393.5376243591,3445419.5166244507,3378577.0531272888,3402052.3517990112,721329.13069915771,763511.91365814209,854368.98345184326,928914.72562408447,960912.26720428467]
[null,"Not Improved",{"$f":"100-C122","v":21.312335031057245},{"$f":"100-D122","v":3.5427729507151184},0.69822452210985375,0.28770961109540849,0.12154949032345996,5.3408095679802727,0.80639506961546203,0.13577776156408561,8.9978100233054192E-2,3.7795906193878182E-2,35.677620008409974,25.592819922787953,18.322404839722367,9.2325280534578837,2.6305442343934828,null,null,null,null,null,null,null,null,null,null,null,null,null,null,null,null,null,null,null,null,null,null,null,null,null,null,null,null,null,null,null,null,null,null,null,null,"Not Improved",803806.65816497803,130915.49431610107,33373.967231750488,14726.334022521973,4915.8716659545898,176605.96884155273,31062.85897064209,7433.2803192138672,3713.2302856445313,1286.3226928710938,277813.52476501465,235950.68737030029,148906.90765380859,77060.25951385498,27905.28498840332]
["Sanitation ladder","Basic",{"$f":"C122*MICS15!C129/100","v":69.188659727898113},{"$f":"D122*MICS15!D129/100","v":90.036965133394872},{"$f":"E122*MICS15!E129/100","v":96.55446444876867},{"$f":"F122*MICS15!F129/100","v":98.127293420451991},{"$f":"G122*MICS15!G129/100","v":99.557796683979049},{"$f":"H122*MICS15!H129/100","v":82.51064332579034},{"$f":"I122*MICS15!I129/100","v":95.303176847751217},{"$f":"J122*MICS15!J129/100","v":97.261291720089432},{"$f":"K122*MICS15!K129/100","v":98.498711803704325},{"$f":"L122*MICS15!L129/100","v":99.767801696030986},{"$f":"M122*MICS15!M129/100","v":58.071086078979469},{"$f":"N122*MICS15!N129/100","v":67.687461432695358},{"$f":"O122*MICS15!O129/100","v":75.703499098003959},{"$f":"P122*MICS15!P129/100","v":87.530284477726411},{"$f":"Q122*MICS15!Q129/100","v":96.304520413476894},null,null,null,null,null,null,null,null,null,null,null,null,null,null,null,null,null,null,null,null,null,null,null,null,null,null,null,null,null,null,null,null,null,null,null,"Sanitation ladder","Basic",112367.46813964844,31205.449668884277,12050.307975769043,4574.2519149780273,2600.811637878418,41946.376670837402,12505.275413513184,3940.7974700927734,2183.1036834716797,1286.3226928710938,39083.527435302734,24761.080284118652,19817.841659545898,12374.259880065918,4899.7041473388672]
[null,"Limited",{"$f":"C122*MICS15!C128/100","v":9.4990052410446495},{"$f":"D122*MICS15!D128/100","v":6.4202619158900633},{"$f":"E122*MICS15!E128/100","v":2.7473110291214971},{"$f":"F122*MICS15!F128/100","v":1.5849969684525527},{"$f":"G122*MICS15!G128/100","v":0.32065382569750078},{"$f":"H122*MICS15!H128/100","v":12.148547106229469},{"$f":"I122*MICS15!I128/100","v":3.8904280826333779},{"$f":"J122*MICS15!J128/100","v":2.6029305183464824},{"$f":"K122*MICS15!K128/100","v":1.4113100960626503},{"$f":"L122*MICS15!L128/100","v":0.19440239777514587},{"$f":"M122*MICS15!M128/100","v":6.2512939126105778},{"$f":"N122*MICS15!N128/100","v":6.7197186445166963},{"$f":"O122*MICS15!O128/100","v":5.9740960622736985},{"$f":"P122*MICS15!P128/100","v":3.2371874688157147},{"$f":"Q122*MICS15!Q128/100","v":1.0649353521296221},null,null,null,null,null,null,null,null,null,null,null,null,null,null,null,null,null,null,null,null,null,null,null,null,null,null,null,null,null,null,null,null,null,null,null,null,"Limited",691439.19002532959,99710.044647216797,21323.659255981445,10152.082107543945,2315.0600280761719,134659.59217071533,18557.583557128906,3492.4828491210938,1530.1266021728516,0,238729.99732971191,211189.60708618164,129089.0659942627,64685.999633789063,23005.580841064453]
[null,"Unimproved",{"$f":"100-(C124+C125+C127)","v":5.5982893315028832},{"$f":"100-(D124+D125+D127)","v":1.2266128511085981},0.22388593553360181,5.7153128031515621E-2,6.8910321436391087E-2,1.3416780819944165,0.26049650843025063,3.4630013469737264E-2,4.4738736548694646E-2,3.7795906193863971E-2,11.784135326905187,4.4625038040188798,5.4556483334934143,2.8023483184300346,0.30396934805069975,null,null,null,null,null,null,null,null,null,null,null,null,null,null,null,null,null,null,null,null,null,null,null,null,null,null,null,null,null,null,null,null,null,null,null,null,"Unimproved",1053155.8691101074,3024090.3763122559,3846491.609085083,3986892.2779006958,4126116.3553619385,2189689.0083084106,2911642.8559951782,3145701.9511413574,3169813.9714126587,3287370.7541656494,40416.609359741211,83373.654373168945,240648.76027679443,413174.69986724854,554914.22286987305]
[null,"Open defecation",{"$f":"C159","v":15.714045699554369},{"$f":"D159","v":2.3161600996064564},0.47433858657623179,0.23055648306393575,5.2639168887053035E-2,3.9991314859857763,0.54589856118515734,0.10114774809434413,4.5239363684327599E-2,0,23.893484681504763,21.130316118769077,12.866756506228928,6.4301797350278358,2.3265748863427764,null,null,null,null,null,null,null,null,null,null,null,null,null,null,null,null,null,null,null,null,null,null,null,null,null,null,null,null,null,null,null,null,null,null,null,null,"Open defecation",1256989.4518966675,781412.68655014038,481407.64762878418,332903.38096237183,227576.45625305176,667321.5763053894,359563.2074508667,251754.22999572754,173233.73444747925,104026.58673858643,255963.7540435791,317412.52191162109,327361.05155181885,312082.47891998291,311570.48192596436]
["Shared among Improved Sanitation","Yes","N/A","N/A","N/A","N/A","N/A","N/A","N/A","N/A","N/A","N/A","N/A","N/A","N/A","N/A","N/A",null,null,null,null,null,null,null,null,null,null,null,null,null,null,null,null,null,null,null,null,null,null,null,null,null,null,null,null,null,null,null,null,null,null,null,"Shared among improved sanitation facilities","Yes","N/A","N/A","N/A","N/A","N/A","N/A","N/A","N/A","N/A","N/A","N/A","N/A","N/A","N/A","N/A"]
[null,"No","N/A","N/A","N/A","N/A","N/A","N/A","N/A","N/A","N/A","N/A","N/A","N/A","N/A","N/A","N/A",null,null,null,null,null,null,null,null,null,null,null,null,null,null,null,null,null,null,null,null,null,null,null,null,null,null,null,null,null,null,null,null,null,null,null,null,"No","N/A","N/A","N/A","N/A","N/A","N/A","N/A","N/A","N/A","N/A","N/A","N/A","N/A","N/A","N/A"]
["Manually calculated ratios","Improved latrines"]
[null,"Other"]
[null,"Other"]
[null,null,"NATIONAL wealth index quintile",null,null,null,null,"URBAN wealth index quintile",null,null,null,null,"RURAL wealth index quintile",null,null,null,null,null,null,null,null,null,null,null,null,null,null,null,null,null,null,null,null,null,null,null,null,null,null,null,null,null,null,null,null,null,null,null,null,null,null,null,"Raw numbers of respondents:","Use of sanitation facilities","NATIONAL wealth index quintile",null,null,null,null,"URBAN wealth index quintile",null,null,null,null,"RURAL wealth index quintile"]
["Percentage based on weighted population",null,"Poorest","Poor","Middle","Rich","Richest","Poorest","Poor","Middle","Rich","Richest","Poorest","Poor","Middle","Rich","Richest",null,null,null,null,null,null,null,null,null,null,null,null,null,null,null,null,null,null,null,null,null,null,null,null,null,null,null,null,null,null,null,null,null,null,null,"Sanitation data, raw numbers (weighted)",null,"Poorest","Poor","Middle","Rich","Richest","Poorest","Poor","Middle","Rich","Richest","Poorest","Poor","Middle","Rich","Richest"]
["Sanitation type","Sewer connection",23.934627505484428,70.246458037403272,85.56408500191904,90.543383338526567,93.818446624910806,65.029561700599785,85.650248637151762,91.104432657129621,93.717975271304226,96.592524828768418,4.0451290052234672,8.3418483380346444,23.986299522416456,41.072065008713309,56.118969737072234,null,null,null,null,null,null,null,null,null,null,null,null,null,null,null,null,null,null,null,null,null,null,null,null,null,null,null,null,null,null,null,null,null,null,null,"Sanitation type","Sewer connection","N/A","N/A","N/A","N/A","N/A","N/A","N/A","N/A","N/A","N/A","N/A","N/A","N/A","N/A","N/A"]
[null,"Septic tank connection",28.567067033383569,18.151399814504458,10.708772842502263,7.5603242666588928,5.1745679896587422,19.818170277073744,10.577079553396128,7.2911949857396445,5.121787899076363,3.0566040199956759,25.618339147442949,31.75831907917366,32.629215398672976,31.022886605593886,31.509400418212795,null,null,null,null,null,null,null,null,null,null,null,null,null,null,null,null,null,null,null,null,null,null,null,null,null,null,null,null,null,null,null,null,null,null,null,null,"Septic tank connection","N/A","N/A","N/A","N/A","N/A","N/A","N/A","N/A","N/A","N/A","N/A","N/A","N/A","N/A","N/A"]
[null,"Improved latrines",29.230531892283771,8.56111207506369,2.9847479794614267,1.5618534349351327,0.89520970976199754,9.907409641113663,2.8589122153665549,1.3890929705958235,1.0504523352531303,0.31307524504202278,42.531340742170464,36.292077062224131,28.542415317849436,20.244792350271759,9.5495435127598185,null,null,null,null,null,null,null,null,null,null,null,null,null,null,null,null,null,null,null,null,null,null,null,null,null,null,null,null,null,null,null,null,null,null,null,null,"Improved latrines","N/A","N/A","N/A","N/A","N/A","N/A","N/A","N/A","N/A","N/A","N/A","N/A","N/A","N/A","N/A"]
[null,"Unimproved facilities",2.5537278692938568,0.72486997342212833,0.26805558954105035,0.10388247681548236,5.9136506781408839E-2,1.2457268952270433,0.36786103290040278,0.11413163844056773,6.4545130681947185E-2,3.7795906193883025E-2,3.9117064236583587,2.4774394017984878,1.975313254832209,1.2300763003932107,0.49551144561237281,null,null,null,null,null,null,null,null,null,null,null,null,null,null,null,null,null,null,null,null,null,null,null,null,null,null,null,null,null,null,null,null,null,null,null,null,"Unimproved facilities","N/A","N/A","N/A","N/A","N/A","N/A","N/A","N/A","N/A","N/A","N/A","N/A","N/A","N/A","N/A"]
[null,"Open defecation",15.714045699554369,2.3161600996064564,0.47433858657623179,0.23055648306393575,5.2639168887053035E-2,3.9991314859857763,0.54589856118515734,0.10114774809434413,4.5239363684327599E-2,0,23.893484681504763,21.130316118769077,12.866756506228928,6.4301797350278358,2.3265748863427764,null,null,null,null,null,null,null,null,null,null,null,null,null,null,null,null,null,null,null,null,null,null,null,null,null,null,null,null,null,null,null,null,null,null,null,null,"Open defecation","N/A","N/A","N/A","N/A","N/A","N/A","N/A","N/A","N/A","N/A","N/A","N/A","N/A","N/A","N/A"]
["Septic tank emptying practices","Not emptied/treated and disposed in situ","N/A","N/A","N/A","N/A","N/A","N/A","N/A","N/A","N/A","N/A","N/A","N/A","N/A","N/A","N/A",null,null,null,null,null,null,null,null,null,null,null,null,null,null,null,null,null,null,null,null,null,null,null,null,null,null,null,null,null,null,null,null,null,null,null,"Septic tank emptying practices","Not emptied/treated and disposed in situ","N/A","N/A","N/A","N/A","N/A","N/A","N/A","N/A","N/A","N/A","N/A","N/A","N/A","N/A","N/A"]
[null,"Emptied and buried on site","N/A","N/A","N/A","N/A","N/A","N/A","N/A","N/A","N/A","N/A","N/A","N/A","N/A","N/A","N/A",null,null,null,null,null,null,null,null,null,null,null,null,null,null,null,null,null,null,null,null,null,null,null,null,null,null,null,null,null,null,null,null,null,null,null,null,"Emptied and buried on site","N/A","N/A","N/A","N/A","N/A","N/A","N/A","N/A","N/A","N/A","N/A","N/A","N/A","N/A","N/A"]
[null,"Emptied and discharged locally","N/A","N/A","N/A","N/A","N/A","N/A","N/A","N/A","N/A","N/A","N/A","N/A","N/A","N/A","N/A",null,null,null,null,null,null,null,null,null,null,null,null,null,null,null,null,null,null,null,null,null,null,null,null,null,null,null,null,null,null,null,null,null,null,null,null,"Emptied and discharged locally","N/A","N/A","N/A","N/A","N/A","N/A","N/A","N/A","N/A","N/A","N/A","N/A","N/A","N/A","N/A"]
[null,"Emptied and removed offsite","N/A","N/A","N/A","N/A","N/A","N/A","N/A","N/A","N/A","N/A","N/A","N/A","N/A","N/A","N/A",null,null,null,null,null,null,null,null,null,null,null,null,null,null,null,null,null,null,null,null,null,null,null,null,null,null,null,null,null,null,null,null,null,null,null,null,"Emptied and removed offsite","N/A","N/A","N/A","N/A","N/A","N/A","N/A","N/A","N/A","N/A","N/A","N/A","N/A","N/A","N/A"]
["Latrine emptying practices","Not emptied/treated and disposed in situ","N/A","N/A","N/A","N/A","N/A","N/A","N/A","N/A","N/A","N/A","N/A","N/A","N/A","N/A","N/A",null,null,null,null,null,null,null,null,null,null,null,null,null,null,null,null,null,null,null,null,null,null,null,null,null,null,null,null,null,null,null,null,null,null,null,"Latrine emptying practices","Not emptied/treated and disposed in situ","N/A","N/A","N/A","N/A","N/A","N/A","N/A","N/A","N/A","N/A","N/A","N/A","N/A","N/A","N/A"]
[null,"Emptied and buried on site","N/A","N/A","N/A","N/A","N/A","N/A","N/A","N/A","N/A","N/A","N/A","N/A","N/A","N/A","N/A",null,null,null,null,null,null,null,null,null,null,null,null,null,null,null,null,null,null,null,null,null,null,null,null,null,null,null,null,null,null,null,null,null,null,null,null,"Emptied and buried on site","N/A","N/A","N/A","N/A","N/A","N/A","N/A","N/A","N/A","N/A","N/A","N/A","N/A","N/A","N/A"]
[null,"Emptied and discharged locally","N/A","N/A","N/A","N/A","N/A","N/A","N/A","N/A","N/A","N/A","N/A","N/A","N/A","N/A","N/A",null,null,null,null,null,null,null,null,null,null,null,null,null,null,null,null,null,null,null,null,null,null,null,null,null,null,null,null,null,null,null,null,null,null,null,null,"Emptied and discharged locally","N/A","N/A","N/A","N/A","N/A","N/A","N/A","N/A","N/A","N/A","N/A","N/A","N/A","N/A","N/A"]
[null,"Emptied and removed offsite","N/A","N/A","N/A","N/A","N/A","N/A","N/A","N/A","N/A","N/A","N/A","N/A","N/A","N/A","N/A",null,null,null,null,null,null,null,null,null,null,null,null,null,null,null,null,null,null,null,null,null,null,null,null,null,null,null,null,null,null,null,null,null,null,null,null,"Emptied and removed offsite","N/A","N/A","N/A","N/A","N/A","N/A","N/A","N/A","N/A","N/A","N/A","N/A","N/A","N/A","N/A"]
["Shared among improved sanitation facilities","Yes","N/A","N/A","N/A","N/A","N/A","N/A","N/A","N/A","N/A","N/A","N/A","N/A","N/A","N/A","N/A",null,null,null,null,null,null,null,null,null,null,null,null,null,null,null,null,null,null,null,null,null,null,null,null,null,null,null,null,null,null,null,null,null,null,null,"Shared among improved sanitation facilities","Yes","N/A","N/A","N/A","N/A","N/A","N/A","N/A","N/A","N/A","N/A","N/A","N/A","N/A","N/A","N/A"]
[null,"No","N/A","N/A","N/A","N/A","N/A","N/A","N/A","N/A","N/A","N/A","N/A","N/A","N/A","N/A","N/A",null,null,null,null,null,null,null,null,null,null,null,null,null,null,null,null,null,null,null,null,null,null,null,null,null,null,null,null,null,null,null,null,null,null,null,null,"No","N/A","N/A","N/A","N/A","N/A","N/A","N/A","N/A","N/A","N/A","N/A","N/A","N/A","N/A","N/A"]
[null,"DK/missing","N/A","N/A","N/A","N/A","N/A","N/A","N/A","N/A","N/A","N/A","N/A","N/A","N/A","N/A","N/A",null,null,null,null,null,null,null,null,null,null,null,null,null,null,null,null,null,null,null,null,null,null,null,null,null,null,null,null,null,null,null,null,null,null,null,null,"DK/missing","N/A","N/A","N/A","N/A","N/A","N/A","N/A","N/A","N/A","N/A","N/A","N/A","N/A","N/A","N/A"]
["Shared among all sanitation facilities","Yes","N/A","N/A","N/A","N/A","N/A","N/A","N/A","N/A","N/A","N/A","N/A","N/A","N/A","N/A","N/A",null,null,null,null,null,null,null,null,null,null,null,null,null,null,null,null,null,null,null,null,null,null,null,null,null,null,null,null,null,null,null,null,null,null,null,"Shared among all sanitation facilities","Yes","N/A","N/A","N/A","N/A","N/A","N/A","N/A","N/A","N/A","N/A","N/A","N/A","N/A","N/A","N/A"]
[null,"No","N/A","N/A","N/A","N/A","N/A","N/A","N/A","N/A","N/A","N/A","N/A","N/A","N/A","N/A","N/A",null,null,null,null,null,null,null,null,null,null,null,null,null,null,null,null,null,null,null,null,null,null,null,null,null,null,null,null,null,null,null,null,null,null,null,null,"No","N/A","N/A","N/A","N/A","N/A","N/A","N/A","N/A","N/A","N/A","N/A","N/A","N/A","N/A","N/A"]
["What type of toilet facilities","Flush to piped sewage system",23.934627505484428,70.246458037403272,85.56408500191904,90.543383338526567,93.818446624910806,65.029561700599785,85.650248637151762,91.104432657129621,93.717975271304226,96.592524828768418,4.0451290052234672,8.3418483380346444,23.986299522416456,41.072065008713309,56.118969737072234,null,null,null,null,null,null,null,null,null,null,null,null,null,null,null,null,null,null,null,null,null,null,null,null,null,null,null,null,null,null,null,null,null,null,null,"What type of toilet facilities","Flush to piped sewage system",1053155.8691101074,3024090.3763122559,3846491.609085083,3986892.2779006958,4126116.3553619385,2189689.0083084106,2911642.8559951782,3145701.9511413574,3169813.9714126587,3287370.7541656494,40416.609359741211,83373.654373168945,240648.76027679443,413174.69986724854,554914.22286987305]
[null,"Flush to septic tank",28.567067033383569,18.151399814504458,10.708772842502263,7.5603242666588928,5.1745679896587422,19.818170277073744,10.577079553396128,7.2911949857396445,5.121787899076363,3.0566040199956759,25.618339147442949,31.75831907917366,32.629215398672976,31.022886605593886,31.509400418212795,null,null,null,null,null,null,null,null,null,null,null,null,null,null,null,null,null,null,null,null,null,null,null,null,null,null,null,null,null,null,null,null,null,null,null,null,"Flush to septic tank",1256989.4518966675,781412.68655014038,481407.64762878418,332903.38096237183,227576.45625305176,667321.5763053894,359563.2074508667,251754.22999572754,173233.73444747925,104026.58673858643,255963.7540435791,317412.52191162109,327361.05155181885,312082.47891998291,311570.48192596436]
[null,"Pour flush latrine",6.6345015738589375,2.5155852093912632,0.95511114352265292,0.43583139116266351,0.35876656858973666,2.5392938687502893,1.1105803648277439,0.41202164210561754,0.29890974840826856,0.14780076910315093,7.4158492647499514,9.5251142806980056,8.0045007361809155,4.6959865013133868,2.8985830836069182,null,null,null,null,null,null,null,null,null,null,null,null,null,null,null,null,null,null,null,null,null,null,null,null,null,null,null,null,null,null,null,null,null,null,null,null,"Pour flush latrine",291927.01116943359,108295.23986053467,42936.554504394531,19190.941886901855,15778.481307983398,85503.634468078613,37753.695251464844,14226.500793457031,10109.995376586914,5030.1607360839844,74094.913269042969,95199.954940795898,80307.226089477539,47240.449508666992,28661.698295593262]
[null,"Covered dry latrine (with privacy)",22.596030318424834,6.0455268656724268,2.0296368359387738,1.1260220437724691,0.53644314117226088,7.3681157723633737,1.748331850538811,0.97707132849020584,0.75154258684486175,0.16527447593887187,35.115491477420512,26.766962781526125,20.537914581668517,15.548805848958372,6.6509604291528994,null,null,null,null,null,null,null,null,null,null,null,null,null,null,null,null,null,null,null,null,null,null,null,null,null,null,null,null,null,null,null,null,null,null,null,null,"Covered dry latrine (with privacy)",994255.78873062134,260258.24112701416,91241.331672668457,49582.07243347168,23592.661125183105,248100.73598480225,59433.778926849365,33736.834693908691,25419.351890563965,5624.8501586914063,350853.85402679443,267525.78243255615,206051.94553375244,156417.09732818604,65765.864112854004]
[null,"Uncovered dry latrine (without privacy)",1.686474166259621,0.45174336032759177,0.13290159165155424,5.0857202407610526E-2,1.5619468779711588E-2,0.55425913193524767,0.20436498248667295,7.9501624970828022E-2,1.9806394133229637E-2,0,3.3209487429738846,1.5543700260208841,1.1587749115805366,0.99017905845875331,0.32634779013435949,null,null,null,null,null,null,null,null,null,null,null,null,null,null,null,null,null,null,null,null,null,null,null,null,null,null,null,null,null,null,null,null,null,null,null,null,"Uncovered dry latrine (without privacy)",74207.136329650879,19447.425346374512,5974.5260772705078,2239.3926544189453,686.94108581542969,18663.129463195801,6947.298469543457,2745.0740814208984,669.90974426269531,0,33181.01545715332,15535.347091674805,11625.709320068359,9960.9536361694336,3226.9842300415039]
[null,"Bucket latrine (where fresh excreta are manually removed)",0.30233130712844147,0.17367693437549112,1.5528471668123552E-2,1.1774892151711853E-2,0,0.34881211181207877,6.3017394265676499E-3,1.2252860665302283E-2,0,0,0.21505771382194611,0.32004692116997829,0.29612654947803474,7.1175241684060989E-2,5.8581076226322797E-2,null,null,null,null,null,null,null,null,null,null,null,null,null,null,null,null,null,null,null,null,null,null,null,null,null,null,null,null,null,null,null,null,null,null,null,null,"Bucket latrine (where fresh excreta are manually removed)",13302.984992980957,7476.7434616088867,698.07485198974609,518.48323822021484,0,11745.2744140625,214.22488403320313,423.0732421875,0,0,2148.7333526611328,3198.7492828369141,2970.9662780761719,716.005126953125,579.25996398925781]
[null,"No facilities (open defecation)",15.714045699554369,2.3161600996064564,0.47433858657623179,0.23055648306393575,5.2639168887053035E-2,3.9991314859857763,0.54589856118515734,0.10114774809434413,4.5239363684327599E-2,0,23.893484681504763,21.130316118769077,12.866756506228928,6.4301797350278358,2.3265748863427764,null,null,null,null,null,null,null,null,null,null,null,null,null,null,null,null,null,null,null,null,null,null,null,null,null,null,null,null,null,null,null,null,null,null,null,null,"No facilities (open defecation)",691439.19002532959,99710.044647216797,21323.659255981445,10152.082107543945,2315.0600280761719,134659.59217071533,18557.583557128906,3492.4828491210938,1530.1266021728516,0,238729.99732971191,211189.60708618164,129089.0659942627,64685.999633789063,23005.580841064453]
[null,"Other",0.56492239590579474,9.9449678719045531E-2,0.11962552622137251,4.1250382256159991E-2,4.3517038001697247E-2,0.34265565147971694,0.15719431098716216,2.2377152804437417E-2,4.4738736548717552E-2,3.7795906193883025E-2,0.37569996686252832,0.6030224546076256,0.52041179377363733,0.16872200025039641,0.11058257925169052,null,null,null,null,null,null,null,null,null,null,null,null,null,null,null,null,null,null,null,null,null,null,null,null,null,null,null,null,null,null,null,null,null,null,null,null,"Other",24857.346817016602,4281.2808609008789,5377.7070465087891,1816.3760223388672,1913.8705520629883,11537.972793579102,5343.7520599365234,772.650146484375,1513.1939392089844,1286.3226928710938,3753.7786254882813,6026.9839096069336,5221.1660614013672,1697.3011169433594,1093.4599533081055]
[null,null,null,null,null,null,null,null,null,null,null,null,null,null,null,null,null,null,null,null,null,null,null,null,null,null,null,null,null,null,null,null,null,null,null,null,null,null,null,null,null,null,null,null,null,null,null,null,null,null,null,null,null,"Total",4400134.7790718079,4304972.0381660461,4495451.1101226807,4403295.0072059631,4397979.8257141113,3367220.9239082336,3399456.3965950012,3452852.7969436646,3382290.2834129333,3403338.6744918823,999142.65546417236,999462.60102844238,1003275.8911056519,1005974.9851379395,988817.55219268799]
[]
[]
[]
[]
[]
[]
[]
[]
[]
[]
[]
[]
[]
[]
[]
[]
[]
[]
[]
[]
[]
[]
[]
[]
[]
[]
[]
[]
[]
[]
[]
[]
[]
[]
[]
[]
[]
[]
[]
[]
[]
[]
[]
[]
[]
[]
[{"$f":"A1026","v":"Mexico"}]
[{"$f":"A1034","v":"2003"}]
["Access to hygiene facilities "]
[" by wealth quintile and sub-national region"]
["Notes:"]
["WHO/UNICEF JMP customised wealth index excludes water,"]
[" sanitation and hygiene assets."]
["Survey used for analysis:",{"$f":"A1025","v":"WHS03"}]
[]
[]
[]
[]
["Access to handwashing",null,"NATIONAL wealth index quintile",null,null,null,null,"URBAN wealth index quintile",null,null,null,null,"RURAL wealth index quintile",null,null,null,null,null,null,null,null,null,null,null,null,null,null,null,null,null,null,null,null,null,null,null,null,null,null,null,null,null,null,null,null,null,null,null,null,null,null,null,"Raw numbers of respondents:","Access to handwashing","NATIONAL wealth index quintile",null,null,null,null,"URBAN wealth index quintile",null,null,null,null,"RURAL wealth index quintile"]
["Weighted percentage (used in graphs)",null,"Poorest","Poor","Middle","Rich","Richest","Poorest","Poor","Middle","Rich","Richest","Poorest","Poor","Middle","Rich","Richest",null,null,null,null,null,null,null,null,null,null,null,null,null,null,null,null,null,null,null,null,null,null,null,null,null,null,null,null,null,null,null,null,null,null,null,"Hygiene data, raw numbers (weighted)",null,"Poorest","Poor","Middle","Rich","Richest","Poorest","Poor","Middle","Rich","Richest","Poorest","Poor","Middle","Rich","Richest"]
["Hygiene ladder","Basic","N/A","N/A","N/A","N/A","N/A","N/A","N/A","N/A","N/A","N/A","N/A","N/A","N/A","N/A","N/A",null,null,null,null,null,null,null,null,null,null,null,null,null,null,null,null,null,null,null,null,null,null,null,null,null,null,null,null,null,null,null,null,null,null,null,"Hygiene ladder","Basic","N/A","N/A","N/A","N/A","N/A","N/A","N/A","N/A","N/A","N/A","N/A","N/A","N/A","N/A","N/A"]
[null,"Limited","N/A","N/A","N/A","N/A","N/A","N/A","N/A","N/A","N/A","N/A","N/A","N/A","N/A","N/A","N/A",null,null,null,null,null,null,null,null,null,null,null,null,null,null,null,null,null,null,null,null,null,null,null,null,null,null,null,null,null,null,null,null,null,null,null,null,"Limited","N/A","N/A","N/A","N/A","N/A","N/A","N/A","N/A","N/A","N/A","N/A","N/A","N/A","N/A","N/A"]
[null,"No facility","N/A","N/A","N/A","N/A","N/A","N/A","N/A","N/A","N/A","N/A","N/A","N/A","N/A","N/A","N/A",null,null,null,null,null,null,null,null,null,null,null,null,null,null,null,null,null,null,null,null,null,null,null,null,null,null,null,null,null,null,null,null,null,null,null,null,"No facility","N/A","N/A","N/A","N/A","N/A","N/A","N/A","N/A","N/A","N/A","N/A","N/A","N/A","N/A","N/A"]
[null,null,null,null,null,null,null,null,null,null,null,null,null,null,null,null,null,null,null,null,null,null,null,null,null,null,null,null,null,null,null,null,null,null,null,null,null,null,null,null,null,null,null,null,null,null,null,null,null,null,null,null,"Observed handwashing place","Fixed","N/A","N/A","N/A","N/A","N/A","N/A","N/A","N/A","N/A","N/A","N/A","N/A","N/A","N/A","N/A"]
[null,null,null,null,null,null,null,null,null,null,null,null,null,null,null,null,null,null,null,null,null,null,null,null,null,null,null,null,null,null,null,null,null,null,null,null,null,null,null,null,null,null,null,null,null,null,null,null,null,null,null,null,null,"Mobile","N/A","N/A","N/A","N/A","N/A","N/A","N/A","N/A","N/A","N/A","N/A","N/A","N/A","N/A","N/A"]
[null,null,null,null,null,null,null,null,null,null,null,null,null,null,null,null,null,null,null,null,null,null,null,null,null,null,null,null,null,null,null,null,null,null,null,null,null,null,null,null,null,null,null,null,null,null,null,null,null,null,null,null,"Water / Soap","Water and soap","N/A","N/A","N/A","N/A","N/A","N/A","N/A","N/A","N/A","N/A","N/A","N/A","N/A","N/A","N/A"]
[null,null,null,null,null,null,null,null,null,null,null,null,null,null,null,null,null,null,null,null,null,null,null,null,null,null,null,null,null,null,null,null,null,null,null,null,null,null,null,null,null,null,null,null,null,null,null,null,null,null,null,null,null,"Water only","N/A","N/A","N/A","N/A","N/A","N/A","N/A","N/A","N/A","N/A","N/A","N/A","N/A","N/A","N/A"]
[null,null,null,null,null,null,null,null,null,null,null,null,null,null,null,null,null,null,null,null,null,null,null,null,null,null,null,null,null,null,null,null,null,null,null,null,null,null,null,null,null,null,null,null,null,null,null,null,null,null,null,null,null,"Soap only","N/A","N/A","N/A","N/A","N/A","N/A","N/A","N/A","N/A","N/A","N/A","N/A","N/A","N/A","N/A"]
[null,null,null,null,null,null,null,null,null,null,null,null,null,null,null,null,null,null,null,null,null,null,null,null,null,null,null,null,null,null,null,null,null,null,null,null,null,null,null,null,null,null,null,null,null,null,null,null,null,null,null,null,null,"Neither","N/A","N/A","N/A","N/A","N/A","N/A","N/A","N/A","N/A","N/A","N/A","N/A","N/A","N/A","N/A"]
[]
[]
[]
[]
[]
[]
[]
[]
[]
[]
[]
[]
[]
[]
[]
[]
[]
[]
[]
[]
[]
[]
[]
[]
[]
[]
[]
[]
[null,null,null,null,null,null,null,null,null,null,null,null,null,null,null,null,null,null,null,null,null,null,null,null,null,null,null,null,null,null,null,null,null,null,null,null,null,null,null,null,null,null,null,null,null,null,null,null,null,null,null,null,"Raw numbers of respondents:","Menstrual health and hygiene","NATIONAL wealth index quintile",null,null,null,null,"URBAN wealth index quintile",null,null,null,null,"RURAL wealth index quintile"]
[null,null,null,null,null,null,null,null,null,null,null,null,null,null,null,null,null,null,null,null,null,null,null,null,null,null,null,null,null,null,null,null,null,null,null,null,null,null,null,null,null,null,null,null,null,null,null,null,null,null,null,null,"MHH data, raw numbers (weighted)",null,"Poorest","Poor","Middle","Rich","Richest","Poorest","Poor","Middle","Rich","Richest","Poorest","Poor","Middle","Rich","Richest"]
[null,null,null,null,null,null,null,null,null,null,null,null,null,null,null,null,null,null,null,null,null,null,null,null,null,null,null,null,null,null,null,null,null,null,null,null,null,null,null,null,null,null,null,null,null,null,null,null,null,null,null,null,"Private place to wash and change","Yes","N/A","N/A","N/A","N/A","N/A","N/A","N/A","N/A","N/A","N/A","N/A","N/A","N/A","N/A","N/A"]
[null,null,null,null,null,null,null,null,null,null,null,null,null,null,null,null,null,null,null,null,null,null,null,null,null,null,null,null,null,null,null,null,null,null,null,null,null,null,null,null,null,null,null,null,null,null,null,null,null,null,null,null,null,"No","N/A","N/A","N/A","N/A","N/A","N/A","N/A","N/A","N/A","N/A","N/A","N/A","N/A","N/A","N/A"]
[null,null,null,null,null,null,null,null,null,null,null,null,null,null,null,null,null,null,null,null,null,null,null,null,null,null,null,null,null,null,null,null,null,null,null,null,null,null,null,null,null,null,null,null,null,null,null,null,null,null,null,null,null,"DK/not sure/missing","N/A","N/A","N/A","N/A","N/A","N/A","N/A","N/A","N/A","N/A","N/A","N/A","N/A","N/A","N/A"]
[null,null,null,null,null,null,null,null,null,null,null,null,null,null,null,null,null,null,null,null,null,null,null,null,null,null,null,null,null,null,null,null,null,null,null,null,null,null,null,null,null,null,null,null,null,null,null,null,null,null,null,null,"Use of menstrual materials","Materials reusable","N/A","N/A","N/A","N/A","N/A","N/A","N/A","N/A","N/A","N/A","N/A","N/A","N/A","N/A","N/A"]
[null,null,null,null,null,null,null,null,null,null,null,null,null,null,null,null,null,null,null,null,null,null,null,null,null,null,null,null,null,null,null,null,null,null,null,null,null,null,null,null,null,null,null,null,null,null,null,null,null,null,null,null,null,"Materials not reusable","N/A","N/A","N/A","N/A","N/A","N/A","N/A","N/A","N/A","N/A","N/A","N/A","N/A","N/A","N/A"]
[null,null,null,null,null,null,null,null,null,null,null,null,null,null,null,null,null,null,null,null,null,null,null,null,null,null,null,null,null,null,null,null,null,null,null,null,null,null,null,null,null,null,null,null,null,null,null,null,null,null,null,null,null,"No materials used","N/A","N/A","N/A","N/A","N/A","N/A","N/A","N/A","N/A","N/A","N/A","N/A","N/A","N/A","N/A"]
[null,null,null,null,null,null,null,null,null,null,null,null,null,null,null,null,null,null,null,null,null,null,null,null,null,null,null,null,null,null,null,null,null,null,null,null,null,null,null,null,null,null,null,null,null,null,null,null,null,null,null,null,null,"DK/not sure/missing","N/A","N/A","N/A","N/A","N/A","N/A","N/A","N/A","N/A","N/A","N/A","N/A","N/A","N/A","N/A"]
[null,null,null,null,null,null,null,null,null,null,null,null,null,null,null,null,null,null,null,null,null,null,null,null,null,null,null,null,null,null,null,null,null,null,null,null,null,null,null,null,null,null,null,null,null,null,null,null,null,null,null,null,"Use of menstrual materials with private place to wash and change","Materials reusable","N/A","N/A","N/A","N/A","N/A","N/A","N/A","N/A","N/A","N/A","N/A","N/A","N/A","N/A","N/A"]
[null,null,null,null,null,null,null,null,null,null,null,null,null,null,null,null,null,null,null,null,null,null,null,null,null,null,null,null,null,null,null,null,null,null,null,null,null,null,null,null,null,null,null,null,null,null,null,null,null,null,null,null,null,"Materials not reusable","N/A","N/A","N/A","N/A","N/A","N/A","N/A","N/A","N/A","N/A","N/A","N/A","N/A","N/A","N/A"]
[null,null,null,null,null,null,null,null,null,null,null,null,null,null,null,null,null,null,null,null,null,null,null,null,null,null,null,null,null,null,null,null,null,null,null,null,null,null,null,null,null,null,null,null,null,null,null,null,null,null,null,null,null,"No materials used","N/A","N/A","N/A","N/A","N/A","N/A","N/A","N/A","N/A","N/A","N/A","N/A","N/A","N/A","N/A"]
[null,null,null,null,null,null,null,null,null,null,null,null,null,null,null,null,null,null,null,null,null,null,null,null,null,null,null,null,null,null,null,null,null,null,null,null,null,null,null,null,null,null,null,null,null,null,null,null,null,null,null,null,"Awareness of menstruation before menarche","Yes","N/A","N/A","N/A","N/A","N/A","N/A","N/A","N/A","N/A","N/A","N/A","N/A","N/A","N/A","N/A"]
[null,null,null,null,null,null,null,null,null,null,null,null,null,null,null,null,null,null,null,null,null,null,null,null,null,null,null,null,null,null,null,null,null,null,null,null,null,null,null,null,null,null,null,null,null,null,null,null,null,null,null,null,null,"No","N/A","N/A","N/A","N/A","N/A","N/A","N/A","N/A","N/A","N/A","N/A","N/A","N/A","N/A","N/A"]
[null,null,null,null,null,null,null,null,null,null,null,null,null,null,null,null,null,null,null,null,null,null,null,null,null,null,null,null,null,null,null,null,null,null,null,null,null,null,null,null,null,null,null,null,null,null,null,null,null,null,null,null,null,"DK/not sure/missing","N/A","N/A","N/A","N/A","N/A","N/A","N/A","N/A","N/A","N/A","N/A","N/A","N/A","N/A","N/A"]
[null,null,null,null,null,null,null,null,null,null,null,null,null,null,null,null,null,null,null,null,null,null,null,null,null,null,null,null,null,null,null,null,null,null,null,null,null,null,null,null,null,null,null,null,null,null,null,null,null,null,null,null,"Participation in (all) activities during menstruation","Yes","N/A","N/A","N/A","N/A","N/A","N/A","N/A","N/A","N/A","N/A","N/A","N/A","N/A","N/A","N/A"]
[null,null,null,null,null,null,null,null,null,null,null,null,null,null,null,null,null,null,null,null,null,null,null,null,null,null,null,null,null,null,null,null,null,null,null,null,null,null,null,null,null,null,null,null,null,null,null,null,null,null,null,null,null,"No","N/A","N/A","N/A","N/A","N/A","N/A","N/A","N/A","N/A","N/A","N/A","N/A","N/A","N/A","N/A"]
[null,null,null,null,null,null,null,null,null,null,null,null,null,null,null,null,null,null,null,null,null,null,null,null,null,null,null,null,null,null,null,null,null,null,null,null,null,null,null,null,null,null,null,null,null,null,null,null,null,null,null,null,null,"DK/not sure/missing/no such activity","N/A","N/A","N/A","N/A","N/A","N/A","N/A","N/A","N/A","N/A","N/A","N/A","N/A","N/A","N/A"]
[null,null,null,null,null,null,null,null,null,null,null,null,null,null,null,null,null,null,null,null,null,null,null,null,null,null,null,null,null,null,null,null,null,null,null,null,null,null,null,null,null,null,null,null,null,null,null,null,null,null,null,null,"Participation in specific activities during menstruation","Did not go to school (amongst those usually attending school)","N/A","N/A","N/A","N/A","N/A","N/A","N/A","N/A","N/A","N/A","N/A","N/A","N/A","N/A","N/A"]
[null,null,null,null,null,null,null,null,null,null,null,null,null,null,null,null,null,null,null,null,null,null,null,null,null,null,null,null,null,null,null,null,null,null,null,null,null,null,null,null,null,null,null,null,null,null,null,null,null,null,null,null,null,"Did not go to work (amongst those who usually work)","N/A","N/A","N/A","N/A","N/A","N/A","N/A","N/A","N/A","N/A","N/A","N/A","N/A","N/A","N/A"]
[null,null,null,null,null,null,null,null,null,null,null,null,null,null,null,null,null,null,null,null,null,null,null,null,null,null,null,null,null,null,null,null,null,null,null,null,null,null,null,null,null,null,null,null,null,null,null,null,null,null,null,null,null,"Did not participate in social activities","N/A","N/A","N/A","N/A","N/A","N/A","N/A","N/A","N/A","N/A","N/A","N/A","N/A","N/A","N/A"]
[null,null,null,null,null,null,null,null,null,null,null,null,null,null,null,null,null,null,null,null,null,null,null,null,null,null,null,null,null,null,null,null,null,null,null,null,null,null,null,null,null,null,null,null,null,null,null,null,null,null,null,null,null,"Did not cook food","N/A","N/A","N/A","N/A","N/A","N/A","N/A","N/A","N/A","N/A","N/A","N/A","N/A","N/A","N/A"]
[null,null,null,null,null,null,null,null,null,null,null,null,null,null,null,null,null,null,null,null,null,null,null,null,null,null,null,null,null,null,null,null,null,null,null,null,null,null,null,null,null,null,null,null,null,null,null,null,null,null,null,null,null,"Did not eat with others","N/A","N/A","N/A","N/A","N/A","N/A","N/A","N/A","N/A","N/A","N/A","N/A","N/A","N/A","N/A"]
[null,null,null,null,null,null,null,null,null,null,null,null,null,null,null,null,null,null,null,null,null,null,null,null,null,null,null,null,null,null,null,null,null,null,null,null,null,null,null,null,null,null,null,null,null,null,null,null,null,null,null,null,null,"Did not bathe in regular place","N/A","N/A","N/A","N/A","N/A","N/A","N/A","N/A","N/A","N/A","N/A","N/A","N/A","N/A","N/A"]
[null,null,null,null,null,null,null,null,null,null,null,null,null,null,null,null,null,null,null,null,null,null,null,null,null,null,null,null,null,null,null,null,null,null,null,null,null,null,null,null,null,null,null,null,null,null,null,null,null,null,null,null,null,"Did not participate in other activities","N/A","N/A","N/A","N/A","N/A","N/A","N/A","N/A","N/A","N/A","N/A","N/A","N/A","N/A","N/A"]
[null,null,null,null,null,null,null,null,null,null,null,null,null,null,null,null,null,null,null,null,null,null,null,null,null,null,null,null,null,null,null,null,null,null,null,null,null,null,null,null,null,null,null,null,null,null,null,null,null,null,null,null,null,"DK/not sure/missing/no such activity","N/A","N/A","N/A","N/A","N/A","N/A","N/A","N/A","N/A","N/A","N/A","N/A","N/A","N/A","N/A"]
[]
[]
[]
[]
[]
[]
[]
[]
[]
[]
[]
[]
[]
[]
[]
[]
[]
[]
[]
[]
[]
[]
[]
[]
[]
[]
[]
[]
[]
[]
[]
[]
[]
[]
[]
[]
[]
[]
[]
[]
[]
[]
[]
[]
[]
[]
[]
[]
[]
[]
[]
[]
[]
[]
[null,null,null,null,null,null,null,null,null,null,null,null,null,null,null,null,null,null,null,null,null,null,null,null,null,null,null,null,null,null,null,null,null,null,null,null,null,null,null,null,null,null,null,null,null,null,null,null,null,null,null,null,"Raw numbers of respondents:","Basic water, sanitation and hygiene","NATIONAL wealth index quintile",null,null,null,null,"URBAN wealth index quintile",null,null,null,null,"RURAL wealth index quintile"]
[null,null,null,null,null,null,null,null,null,null,null,null,null,null,null,null,null,null,null,null,null,null,null,null,null,null,null,null,null,null,null,null,null,null,null,null,null,null,null,null,null,null,null,null,null,null,null,null,null,null,null,null,"WatSan data, raw numbers (weighted)",null,"Poorest","Poor","Middle","Rich","Richest","Poorest","Poor","Middle","Rich","Richest","Poorest","Poor","Middle","Rich","Richest"]
[null,null,null,null,null,null,null,null,null,null,null,null,null,null,null,null,null,null,null,null,null,null,null,null,null,null,null,null,null,null,null,null,null,null,null,null,null,null,null,null,null,null,null,null,null,null,null,null,null,null,null,null,"Use of Basic Water Sanitation and Hygiene","Yes","N/A","N/A","N/A","N/A","N/A","N/A","N/A","N/A","N/A","N/A","N/A","N/A","N/A","N/A","N/A"]
[null,null,null,null,null,null,null,null,null,null,null,null,null,null,null,null,null,null,null,null,null,null,null,null,null,null,null,null,null,null,null,null,null,null,null,null,null,null,null,null,null,null,null,null,null,null,null,null,null,null,null,null,null,"No","N/A","N/A","N/A","N/A","N/A","N/A","N/A","N/A","N/A","N/A","N/A","N/A","N/A","N/A","N/A"]
[null,null,null,null,null,null,null,null,null,null,null,null,null,null,null,null,null,null,null,null,null,null,null,null,null,null,null,null,null,null,null,null,null,null,null,null,null,null,null,null,null,null,null,null,null,null,null,null,null,null,null,null,"Use of Basic Water and Sanitation","Yes","N/A","N/A","N/A","N/A","N/A","N/A","N/A","N/A","N/A","N/A","N/A","N/A","N/A","N/A","N/A"]
[null,null,null,null,null,null,null,null,null,null,null,null,null,null,null,null,null,null,null,null,null,null,null,null,null,null,null,null,null,null,null,null,null,null,null,null,null,null,null,null,null,null,null,null,null,null,null,null,null,null,null,null,null,"No","N/A","N/A","N/A","N/A","N/A","N/A","N/A","N/A","N/A","N/A","N/A","N/A","N/A","N/A","N/A"]
[null,null,null,null,null,null,null,null,null,null,null,null,null,null,null,null,null,null,null,null,null,null,null,null,null,null,null,null,null,null,null,null,null,null,null,null,null,null,null,null,null,null,null,null,null,null,null,null,null,null,null,null,"Use of Basic Water and Hygiene","Yes","N/A","N/A","N/A","N/A","N/A","N/A","N/A","N/A","N/A","N/A","N/A","N/A","N/A","N/A","N/A"]
[null,null,null,null,null,null,null,null,null,null,null,null,null,null,null,null,null,null,null,null,null,null,null,null,null,null,null,null,null,null,null,null,null,null,null,null,null,null,null,null,null,null,null,null,null,null,null,null,null,null,null,null,null,"No","N/A","N/A","N/A","N/A","N/A","N/A","N/A","N/A","N/A","N/A","N/A","N/A","N/A","N/A","N/A"]
[null,null,null,null,null,null,null,null,null,null,null,null,null,null,null,null,null,null,null,null,null,null,null,null,null,null,null,null,null,null,null,null,null,null,null,null,null,null,null,null,null,null,null,null,null,null,null,null,null,null,null,null,"Use of Basic Sanitation and Hygiene","Yes","N/A","N/A","N/A","N/A","N/A","N/A","N/A","N/A","N/A","N/A","N/A","N/A","N/A","N/A","N/A"]
[null,null,null,null,null,null,null,null,null,null,null,null,null,null,null,null,null,null,null,null,null,null,null,null,null,null,null,null,null,null,null,null,null,null,null,null,null,null,null,null,null,null,null,null,null,null,null,null,null,null,null,null,null,"No","N/A","N/A","N/A","N/A","N/A","N/A","N/A","N/A","N/A","N/A","N/A","N/A","N/A","N/A","N/A"]
[null,null,null,null,null,null,null,null,null,null,null,null,null,null,null,null,null,null,null,null,null,null,null,null,null,null,null,null,null,null,null,null,null,null,null,null,null,null,null,null,null,null,null,null,null,null,null,null,null,null,null,null,"Use of Basic Water","Yes","N/A","N/A","N/A","N/A","N/A","N/A","N/A","N/A","N/A","N/A","N/A","N/A","N/A","N/A","N/A"]
[null,null,null,null,null,null,null,null,null,null,null,null,null,null,null,null,null,null,null,null,null,null,null,null,null,null,null,null,null,null,null,null,null,null,null,null,null,null,null,null,null,null,null,null,null,null,null,null,null,null,null,null,null,"No","N/A","N/A","N/A","N/A","N/A","N/A","N/A","N/A","N/A","N/A","N/A","N/A","N/A","N/A","N/A"]
[null,null,null,null,null,null,null,null,null,null,null,null,null,null,null,null,null,null,null,null,null,null,null,null,null,null,null,null,null,null,null,null,null,null,null,null,null,null,null,null,null,null,null,null,null,null,null,null,null,null,null,null,"Use of Basic Sanitation","Yes","N/A","N/A","N/A","N/A","N/A","N/A","N/A","N/A","N/A","N/A","N/A","N/A","N/A","N/A","N/A"]
[null,null,null,null,null,null,null,null,null,null,null,null,null,null,null,null,null,null,null,null,null,null,null,null,null,null,null,null,null,null,null,null,null,null,null,null,null,null,null,null,null,null,null,null,null,null,null,null,null,null,null,null,null,"No","N/A","N/A","N/A","N/A","N/A","N/A","N/A","N/A","N/A","N/A","N/A","N/A","N/A","N/A","N/A"]
[null,null,null,null,null,null,null,null,null,null,null,null,null,null,null,null,null,null,null,null,null,null,null,null,null,null,null,null,null,null,null,null,null,null,null,null,null,null,null,null,null,null,null,null,null,null,null,null,null,null,null,null,"Access to Basic Hygiene","Yes","N/A","N/A","N/A","N/A","N/A","N/A","N/A","N/A","N/A","N/A","N/A","N/A","N/A","N/A","N/A"]
[null,null,null,null,null,null,null,null,null,null,null,null,null,null,null,null,null,null,null,null,null,null,null,null,null,null,null,null,null,null,null,null,null,null,null,null,null,null,null,null,null,null,null,null,null,null,null,null,null,null,null,null,null,"No","N/A","N/A","N/A","N/A","N/A","N/A","N/A","N/A","N/A","N/A","N/A","N/A","N/A","N/A","N/A"]
[]
[]
[]
[]
[]
[]
[]
[]
[]
[]
[]
[]
[]
[]
[]
[]
[]
[]
[]
[]
[]
[]
[]
[]
[]
[]
[]
[]
[]
[]
[]
[]
[]
[]
[]
[]
[]
[]
[]
[]
[]
[]
[]
[]
[null,null,"INITIAL (national) Wealth Index",null,null,null,null,"URBAN Wealth Index",null,null,null,null,"RURAL Wealth Index"]
[null,null,"Component Matrix",null,null,null,null,"Component Matrix",null,null,null,null,"Component Matrix"]
[null,null,null,null,"Component",null,null,null,null,"Component",null,null,null,null,"Component"]
[null,"Note:\n\nThe INITIAL (national) Wealth Index is based on the first component of the Principal Component Analysis (PCA) which has been obtained at national level.\n\nThe final national-level (NATIONAL) Wealth Index is based on the URBAN and RURAL specific wealth indexes. Regression procedures are used to establish the relationships between the two sets of scores (urban and rural) and the initial (national) wealth factors.\nThis allows best use of the available information for each area and a better precision of the FINAL (NATIONAL) Wealth Index.\n\nFor dependency reasons, all WASH variables (contained in the generic MICS and DHS scripts) have been excluded from the sets of asset variables used in the PCAs.\n\nThe PCA can extracts as many components as there are asset variables in the input. Only the first of the components is used to represent the Wealth Index. \n\nThe scores represent the weights of the asset variables on the Wealth Index (correlations between the variables and the component).\n\nThe communalities are the proportion of each variable's variance that can be explained by the component.\n\nProportion of explained variance is the part of the model's total variance that is explained by the component.\n\nFor more information on the procedure used:\n\nThe DHS Wealth Index, DHS Comparative Reports No. 6, Shea Oscar Rutstein, Kiersten Johnson, ORC Macro International Inc., 2004.\n\nThe DHS Wealth Index: Approaches for Rural and Urban Areas, Shea O. Rutstein, ORC Macro International Inc., 2008.\n\nMICS Methodological Paper No. 4, Review of options for reporting water, sanitation and hygiene coverage by wealth quintile, UNICEF, 2016.",null,null,"1",null,null,null,null,"1",null,null,null,null,"1"]
[null,null,"Uses gaz fuel",null,-0.81047442129750635,null,null,"Uses wood fuel",null,0.70419616633169535,null,null,"Uses gaz fuel",null,-0.80796607853958879]
[null,null,"Uses wood fuel",null,0.7867496908397511,null,null,"Uses gaz fuel",null,-0.70371961529473459,null,null,"Uses wood fuel",null,0.76593966728452922]
[null,null,"Uses open fire without chimney",null,0.68404176926087501,null,null,"Uses open fire without chimney",null,0.63690021744128955,null,null,"Has hard floor",null,-0.66842109316172493]
[null,null,"Has hard floor",null,-0.66885413190073806,null,null,"Has hard floor",null,-0.57462387444154261,null,null,"Has hearth floor",null,0.66842109316172493]
[null,null,"Has hearth floor",null,0.66885413190073806,null,null,"Has hearth floor",null,0.57462387444154261,null,null,"Has Vacuum cleaner",null,0.64445403123935885]
[null,null,"Has Vacuum cleaner",null,0.64433970816860131,null,null,"Has Vacuum cleaner",null,0.56901055379921806,null,null,"Uses open fire without chimney",null,0.6346944304986526]
[null,null,"Has Clothes washing machine",null,0.56881341259574414,null,null,"Permanent Income question 1",null,0.51705482218328458,null,null,"Has Clothes washing machine",null,0.56919014203069529]
[null,null,"Has Cellular phone",null,0.5605113612484256,null,null,"Has Clothes washing machine",null,0.51140500562278224,null,null,"Has Cellular phone",null,0.56786575667285266]
[null,null,"Has cement, brick, stone or wood wall",null,-0.48079530634732315,null,null,"Uses separate room as kitchen",null,-0.51016175947790388,null,null,"Permanent Income question 1",null,0.54523015726126889]
[null,null,"Has Refrigerator",null,0.47017962153620996,null,null,"Has Refrigerator",null,0.46975955188832003,null,null,"Has DVD",null,0.48192877280754493]
[null,null,"Uses separate room as kitchen",null,-0.46843850982136404,null,null,"Has Bicycle",null,0.42004982580096029,null,null,"Uses separate room as kitchen",null,-0.45224958859010689]
[null,null,"Has DVD",null,0.45692395746378683,null,null,"Has Cellular phone",null,0.40519930802744869,null,null,"Has cement, brick, stone or wood wall",null,-0.44463424295401061]
[null,null,"Has Bicycle",null,0.39813208670037897,null,null,"Has cement, brick, stone or wood wall",null,-0.39804101961165833,null,null,"Has Bicycle",null,0.42539515336239714]
[null,null,"Has Telephone",null,0.35059978044941353,null,null,"Kooks outdoor",null,0.35821953211308299,null,null,"Has Refrigerator",null,0.37124027490783629]
[null,null,"Has Video",null,0.33679978211358524,null,null,"Has DVD",null,0.34381118104056113,null,null,"Has Video",null,0.36649722743018842]
[null,null,"Kooks outdoor",null,0.32865248316264362,null,null,"Has Telephone",null,0.33878067748034624,null,null,"Has Stereo",null,0.30029690424271843]
[null,null,"Has mud brick wall",null,0.32625057235306587,null,null,"Has Computer",null,0.3369707469325206,null,null,"Has mud brick wall",null,0.29177876488538185]
[null,null,"Uses open fire with chimney",null,0.32595514226070005,null,null,"Uses living or sleeping room as kitchen",null,0.27644230820750781,null,null,"Has Telephone",null,0.28131106124827143]
[null,null,"Has Computer",null,0.30853949541274639,null,null,"Has thatch wall",null,0.27489444234485033,null,null,"Kooks outdoor",null,0.28085492179758254]
[null,null,"Has thatch wall",null,0.30616178030847746,null,null,"Uses open fire with chimney",null,0.25840069123361081,null,null,"Has thatch wall",null,0.27912819617534051]
[null,null,"Uses separate building as kitchen",null,0.25659912758734654,null,null,"Uses separate building as kitchen",null,0.22573584393731472,null,null,"Uses open fire with chimney",null,0.25385788390131192]
[null,null,"Has Stereo",null,0.20983345560597186,null,null,"Has mud brick wall",null,0.21735393899408875,null,null,"Uses separate building as kitchen",null,0.23463076621353599]
[null,null,"Uses living or sleeping room as kitchen",null,0.19464277525035506,null,null,"Heats house",null,-0.18699046627864577,null,null,"Has Camera",null,0.19616276980414377]
[null,null,"Has Camera",null,0.16990611726367139,null,null,"Has plastic sheet wall",null,0.17073041119560142,null,null,"Has Computer",null,0.19120520386793891]
[null,null,"Has TV",null,0.14881370069389072,null,null,"Has Video",null,0.16051382509107393,null,null,"Has TV",null,0.17299820489437692]
[null,null,"Uses charcoal fuel",null,0.14403466513074445,null,null,"Uses gaz heating",null,-0.15254419868483471,null,null,"Uses living or sleeping room as kitchen",null,0.17251340931322867]
[null,null,"Has Car",null,0.14126238171677513,null,null,"Has Stereo",null,0.14856407021527368,null,null,"Has Car",null,0.16714027175765619]
[null,null,"Uses closed stove with chimney",null,0.13509423380703875,null,null,"Has TV",null,0.13777700622603728,null,null,"Uses charcoal fuel",null,0.12654623294963233]
[null,null,"Uses gaz heating",null,-0.13165953507177777,null,null,"Has Car",null,0.13360472378616711,null,null,"Uses wood heating",null,0.10948119841202678]
[null,null,"Uses electricity heating",null,-0.1218443511953043,null,null,"Uses electricity heating",null,-0.1332111101732327,null,null,"Uses closed stove with chimney",null,0.10185929575134056]
[null,null,"Has plastic sheet wall",null,0.11638283867335902,null,null,"Has Camera",null,0.1137519746387804,null,null,"Uses gaz heating",null,-0.1008490611722775]
[null,null,"Heats house",null,-0.11190070606489173,null,null,"Has metal sheet wall",null,0.11285844252363153,null,null,"Uses electricity heating",null,-9.3657303388761937E-2]
[null,null,"Has Dish washing machine",null,0.10866383883025296,null,null,"Has Dish washing machine",null,0.11244721708584006,null,null,"Uses open fire with chimney",null,9.1182015325833157E-2]
[null,null,"Uses coal fuel",null,0.10390955169837685,null,null,"Uses closed stove with chimney",null,0.10975303197915649,null,null,"Has metal sheet wall",null,8.7157758399759172E-2]
[null,null,"Has metal sheet wall",null,8.9307947742024663E-2,null,null,"Uses electricity fuel",null,9.034607167498411E-2,null,null,"Has Dish washing machine",null,8.3929899473297778E-2]
[null,null,"Uses agriculture crop fuel",null,8.9061323782048438E-2,null,null,"Uses closed stove with chimney",null,3.4769319983845352E-2,null,null,"Has plastic sheet wall",null,8.2023493253293348E-2]
[null,null,"Uses wood heating",null,8.7236093993248623E-2,null,null,"Uses coal heating",null,2.6369312205543945E-2,null,null,"Uses agriculture crop fuel",null,6.5011713763690498E-2]
[null,null,"Uses closed stove with chimney",null,6.9431468853178593E-2,null,null,"Uses kerozene heating",null,-1.5246041181020051E-2,null,null,"Uses coal fuel",null,6.047019889634464E-2]
[null,null,"Uses open fire with chimney",null,6.1525342335808114E-2,null,null,"Uses open fire with chimney",null,-1.263426773166299E-2,null,null,"Uses agriculture crop heating",null,4.8241447072282152E-2]
[null,null,"Uses shrubs grass fuel",null,4.765741875696021E-2,null,null,"Uses agriculture crop heating",null,-5.5409453976333258E-3,null,null,"Uses closed stove with chimney",null,4.6178018202553614E-2]
[null,null,"Uses agriculture crop heating",null,3.0887076148156375E-2,null,null,"Uses open fire without chimney",null,-4.8895849833725654E-3,null,null,"Uses shrubs grass fuel",null,4.340933112187751E-2]
[null,null,"Uses coal heating",null,3.0832904791758604E-2,null,null,"Uses wood heating",null,5.3744828059444291E-4,null,null,"Uses kerozene heating",null,-3.476304631674363E-2]
[null,null,"Uses electricity fuel",null,3.0162236413347834E-2,null,null,null,null,null,null,null,"Heats house",null,1.6517679992490521E-2]
[null,null,"Uses kerozene fuel",null,2.5111656414269455E-2,null,null,null,null,null,null,null,"Uses coal heating",null,1.2763601661740853E-2]
[null,null,"Uses shrubs grass heating",null,1.8021023484393387E-2,null,null,null,null,null,null,null,"Uses electricity fuel",null,-1.2647123278394306E-2]
[null,null,"Uses kerozene heating",null,-1.0761158943154438E-2,null,null,"Communalities",null,null,null,null,"Uses charcoal heating",null,-1.2023489320949583E-2]
[null,null,"Uses charcoal heating",null,5.3327351282567428E-3,null,null,null,null,"Extraction",null,null,"Uses open fire without chimney",null,5.3550588914947897E-3]
[null,null,"Uses animal dung fuel",null,4.5466144595170807E-3,null,null,"Has hard floor",null,0.33019259707820975,null,null,"Uses animal dung fuel",null,8.8302400890541064E-4]
[null,null,"Uses open fire without chimney",null,-3.863100934782926E-4,null,null,"Has hearth floor",null,0.33019259707820975]
[null,null,null,null,null,null,null,"Has cement, brick, stone or wood wall",null,0.15843665329348858]
[null,null,null,null,null,null,null,"Has mud brick wall",null,4.7242734796246057E-2]
[null,null,null,null,null,null,null,"Has thatch wall",null,7.5566954432086247E-2,null,null,"Communalities"]
[null,null,"Communalities",null,null,null,null,"Has plastic sheet wall",null,2.9148873307019145E-2,null,null,null,null,"Extraction"]
[null,null,null,null,"Extraction",null,null,"Has metal sheet wall",null,1.2737028048859842E-2,null,null,"Has hard floor",null,0.44678675778351534]
[null,null,"Has hard floor",null,0.44736584976068988,null,null,"Uses gaz fuel",null,0.49522129695056927,null,null,"Has hearth floor",null,0.44678675778351534]
[null,null,"Has hearth floor",null,0.44736584976068988,null,null,"Uses electricity fuel",null,8.1624126671013663E-3,null,null,"Has cement, brick, stone or wood wall",null,0.19769961000728614]
[null,null,"Has cement, brick, stone or wood wall",null,0.2311641266056163,null,null,"Uses wood fuel",null,0.49589224067625676,null,null,"Has mud brick wall",null,8.5134847638038941E-2]
[null,null,"Has mud brick wall",null,0.10643943596070307,null,null,"Uses open fire without chimney",null,0.4056418869767619,null,null,"Has thatch wall",null,7.7912549900099382E-2]
[null,null,"Has thatch wall",null,9.3735035721656423E-2,null,null,"Uses open fire with chimney",null,6.6770917230007873E-2,null,null,"Has plastic sheet wall",null,6.7278534454730593E-3]
[null,null,"Has plastic sheet wall",null,1.3544965137669113E-2,null,null,"Uses closed stove with chimney",null,1.2045728028617747E-2,null,null,"Has metal sheet wall",null,7.5964748492707906E-3]
[null,null,"Has metal sheet wall",null,7.975909529892208E-3,null,null,"Uses living or sleeping room as kitchen",null,7.6420349767094747E-2,null,null,"Uses gaz fuel",null,0.65280918407064092]
[null,null,"Uses gaz fuel",null,0.65686878757752787,null,null,"Uses separate room as kitchen",null,0.26026502083359065,null,null,"Uses electricity fuel",null,1.5994972721890312E-4]
[null,null,"Uses electricity fuel",null,9.0976050545468594E-4,null,null,"Uses separate building as kitchen",null,5.0956671238091708E-2,null,null,"Uses coal fuel",null,3.6566449545634805E-3]
[null,null,"Uses kerozene fuel",null,6.3059528786832029E-4,null,null,"Kooks outdoor",null,0.12832123318731609,null,null,"Uses charcoal fuel",null,1.6013949073742609E-2]
[null,null,"Uses coal fuel",null,1.079719493415765E-2,null,null,"Heats house",null,3.4965434479105363E-2,null,null,"Uses wood fuel",null,0.58666357391993529]
[null,null,"Uses charcoal fuel",null,2.0745984759325691E-2,null,null,"Uses gaz heating",null,2.3269732552398326E-2,null,null,"Uses agriculture crop fuel",null,4.2265229264920245E-3]
[null,null,"Uses wood fuel",null,0.61897507603644397,null,null,"Uses electricity heating",null,1.7745199873585141E-2,null,null,"Uses animal dung fuel",null,7.7973140030338275E-7]
[null,null,"Uses agriculture crop fuel",null,7.9319193938108667E-3,null,null,"Uses kerozene heating",null,2.3244177169335929E-4,null,null,"Uses shrubs grass fuel",null,1.8843700284488034E-3]
[null,null,"Uses animal dung fuel",null,2.0671703043489794E-5,null,null,"Uses coal heating",null,6.9534062619344889E-4,null,null,"Uses open fire without chimney",null,0.40283702010600897]
[null,null,"Uses shrubs grass fuel",null,2.271229562576263E-3,null,null,"Uses wood heating",null,2.8885065431392305E-7,null,null,"Uses open fire with chimney",null,6.4443825218851961E-2]
[null,null,"Uses open fire without chimney",null,0.46791314209354817,null,null,"Uses agriculture crop heating",null,3.0702075899553934E-5,null,null,"Uses closed stove with chimney",null,1.0375316130959066E-2]
[null,null,"Uses open fire with chimney",null,0.1062467547661932,null,null,"Uses open fire without chimney",null,2.390804130962249E-5,null,null,"Uses living or sleeping room as kitchen",null,2.9760876392873573E-2]
[null,null,"Uses closed stove with chimney",null,1.8250452007910853E-2,null,null,"Uses open fire with chimney",null,1.5962472111534067E-4,null,null,"Uses separate room as kitchen",null,0.20452969037992094]
[null,null,"Uses living or sleeping room as kitchen",null,3.7885809957160232E-2,null,null,"Uses closed stove with chimney",null,1.2089056121390278E-3,null,null,"Uses separate building as kitchen",null,5.5051596453950982E-2]
[null,null,"Uses separate room as kitchen",null,0.21943463748366018,null,null,"Permanent Income question 1",null,0.26734568914298801,null,null,"Kooks outdoor",null,7.8879487097926207E-2]
[null,null,"Uses separate building as kitchen",null,6.5843112278587343E-2,null,null,"Has Car",null,1.785022221797801E-2,null,null,"Heats house",null,2.7283375233432163E-4]
[null,null,"Kooks outdoor",null,0.10801245468897175,null,null,"Has TV",null,1.8982503444609514E-2,null,null,"Uses gaz heating",null,1.0170533139329769E-2]
[null,null,"Heats house",null,1.2521768017821297E-2,null,null,"Has Bicycle",null,0.17644185615541708,null,null,"Uses electricity heating",null,8.771690478054598E-3]
[null,null,"Uses gaz heating",null,1.7334233175316682E-2,null,null,"Has Video",null,2.5764688045367874E-2,null,null,"Uses kerozene heating",null,1.2084693892200629E-3]
[null,null,"Uses electricity heating",null,1.4846045918204653E-2,null,null,"Has Stereo",null,2.2071282958928767E-2,null,null,"Uses coal heating",null,1.6290952737959386E-4]
[null,null,"Uses kerozene heating",null,1.1580254179983274E-4,null,null,"Has DVD",null,0.1182061282085055,null,null,"Uses charcoal heating",null,1.4456429545098867E-4]
[null,null,"Uses coal heating",null,9.506680178976507E-4,null,null,"Has Camera",null,1.2939511734221738E-2,null,null,"Uses wood heating",null,1.1986132805733574E-2]
[null,null,"Uses charcoal heating",null,2.843806394814346E-5,null,null,"Has Clothes washing machine",null,0.26153507977603796,null,null,"Uses agriculture crop heating",null,2.3272372156278001E-3]
[null,null,"Uses wood heating",null,7.6101360951989086E-3,null,null,"Has Dish washing machine",null,1.264437663035004E-2,null,null,"Uses open fire without chimney",null,2.8676655731377405E-5]
[null,null,"Uses agriculture crop heating",null,9.5401147298201049E-4,null,null,"Has Vacuum cleaner",null,0.32377301033489281,null,null,"Uses open fire with chimney",null,8.3141599188804732E-3]
[null,null,"Uses shrubs grass heating",null,3.2475728742505799E-4,null,null,"Has Refrigerator",null,0.22067403659031523,null,null,"Uses closed stove with chimney",null,2.1324093651153729E-3]
[null,null,"Uses open fire without chimney",null,1.4923548832320718E-7,null,null,"Has Telephone",null,0.11477234743404238,null,null,"Permanent Income question 1",null,0.29727592438714801]
[null,null,"Uses open fire with chimney",null,3.7853677495383823E-3,null,null,"Has Cellular phone",null,0.16418647922592325,null,null,"Has Car",null,2.7935870443223165E-2]
[null,null,"Uses closed stove with chimney",null,4.8207288671099089E-3,null,null,"Has Computer",null,0.11354928428826085,null,null,"Has TV",null,2.9928378896676818E-2]
[null,null,"Has Car",null,1.9955060488295887E-2,null,null,null,null,null,null,null,"Has Bicycle",null,0.18096103650421738]
[null,null,"Has TV",null,2.2145517514210889E-2,null,null,null,null,null,null,null,"Has Video",null,0.13432021771401526]
[null,null,"Has Bicycle",null,0.15850915846039809,null,null,"Total Variance Explained",null,null,null,null,"Has Stereo",null,9.0178230697760403E-2]
[null,null,"Has Video",null,0.1134340932317585,null,null,"Component",null,"Extraction Sums of Squared Loadings",null,null,"Has DVD",null,0.23225534205978626]
[null,null,"Has Stereo",null,4.4030079091543363E-2,null,null,null,null,"Total","% of Variance","Cumulative %","Has Camera",null,3.8479832257233497E-2]
[null,null,"Has DVD",null,0.20877950290436847,null,null,"1",null,4.9322832703814594,11.743531596146333,11.743531596146333,"Has Clothes washing machine",null,0.32397741778492306]
[null,null,"Has Camera",null,2.8868088683616452E-2,null,null,null,null,null,null,null,"Has Dish washing machine",null,7.0442280255978706E-3]
[null,null,"Has Clothes washing machine",null,0.32354869834881628,null,null,null,null,null,null,null,"Has Vacuum cleaner",null,0.4153209983806605]
[null,null,"Has Dish washing machine",null,1.1807829869327191E-2,null,null,"Component Score Coefficient Matrix",null,null,null,null,"Has Refrigerator",null,0.13781934171364585]
[null,null,"Has Vacuum cleaner",null,0.41517365952279828,null,null,null,null,"Component",null,null,"Has Telephone",null,7.9135913180628722E-2]
[null,null,"Has Refrigerator",null,0.22106887650793364,null,null,null,null,"1",null,null,"Has Cellular phone",null,0.32247151760163151]
[null,null,"Has Telephone",null,0.12292020605117697,null,null,"Has hard floor",null,-0.11650261003705524,null,null,"Has Computer",null,3.6559429986180079E-2]
[null,null,"Has Cellular phone",null,0.31417298608856309,null,null,"Has hearth floor",null,0.11650261003705524]
[null,null,"Has Computer",null,9.5196620229552151E-2,null,null,"Has cement, brick, stone or wood wall",null,-8.0701167753666772E-2]
[null,null,null,null,null,null,null,"Has mud brick wall",null,4.4067610694484456E-2,null,null,"Total Variance Explained"]
[null,null,null,null,null,null,null,"Has thatch wall",null,5.5733709374642261E-2,null,null,"Component",null,"Extraction Sums of Squared Loadings"]
[null,null,"Total Variance Explained",null,null,null,null,"Has plastic sheet wall",null,3.4614883581574434E-2,null,null,null,null,"Total","% of Variance","Cumulative %"]
[null,null,"Component",null,"Extraction Sums of Squared Loadings",null,null,"Has metal sheet wall",null,2.2881581680709744E-2,null,null,"1",null,5.7791209337963192,12.039835278742332,12.039835278742332]
[null,null,null,null,"Total","% of Variance","Cumulative %","Uses gaz fuel",null,-0.14267623668749857]
[null,null,"1",null,5.8532312389482479,11.945369875404587,11.945369875404587,"Uses electricity fuel",null,1.8317291753601334E-2]
[null,null,null,null,null,null,null,"Uses wood fuel",null,0.14277285543602472,null,null,"Component Score Coefficient Matrix"]
[null,null,null,null,null,null,null,"Uses open fire without chimney",null,0.12912888058678595,null,null,null,null,"Component"]
[null,null,"Component Score Coefficient Matrix",null,null,null,null,"Uses open fire with chimney",null,5.2389669665835373E-2,null,null,null,null,"1"]
[null,null,null,null,"Component",null,null,"Uses closed stove with chimney",null,2.2251972557664611E-2,null,null,"Has hard floor",null,-0.11566137840320941]
[null,null,null,null,"1",null,null,"Uses living or sleeping room as kitchen",null,5.6047532765920796E-2,null,null,"Has hearth floor",null,0.11566137840320941]
[null,null,"Has hard floor",null,-0.1142709222642847,null,null,"Uses separate room as kitchen",null,-0.10343318327668725,null,null,"Has cement, brick, stone or wood wall",null,-7.693804093175971E-2]
[null,null,"Has hearth floor",null,0.1142709222642847,null,null,"Uses separate building as kitchen",null,4.5767007197836079E-2,null,null,"Has mud brick wall",null,5.0488433834124949E-2]
[null,null,"Has cement, brick, stone or wood wall",null,-8.2141860917443618E-2,null,null,"Kooks outdoor",null,7.2627526132613737E-2,null,null,"Has thatch wall",null,4.8299421204875272E-2]
[null,null,"Has mud brick wall",null,5.5738541505441871E-2,null,null,"Heats house",null,-3.7911542388802025E-2,null,null,"Has plastic sheet wall",null,1.4193074378080527E-2]
[null,null,"Has thatch wall",null,5.2306455666954119E-2,null,null,"Uses gaz heating",null,-3.0927704335407535E-2,null,null,"Has metal sheet wall",null,1.5081490662370517E-2]
[null,null,"Has plastic sheet wall",null,1.9883519704284151E-2,null,null,"Uses electricity heating",null,-2.7008000731257725E-2,null,null,"Uses gaz fuel",null,-0.13980778180546463]
[null,null,"Has metal sheet wall",null,1.5257888181105276E-2,null,null,"Uses kerozene heating",null,-3.0910716893681033E-3,null,null,"Uses electricity fuel",null,-2.188416443136513E-3]
[null,null,"Uses gaz fuel",null,-0.1384661545411861,null,null,"Uses coal heating",null,5.3462688089900732E-3,null,null,"Uses coal fuel",null,1.0463563505431199E-2]
[null,null,"Uses electricity fuel",null,5.1530915458531598E-3,null,null,"Uses wood heating",null,1.0896541239264164E-4,null,null,"Uses charcoal fuel",null,2.189714221233709E-2]
[null,null,"Uses kerozene fuel",null,4.2902211426695154E-3,null,null,"Uses agriculture crop heating",null,-1.1234037247833889E-3,null,null,"Uses wood fuel",null,0.13253567040020073]
[null,null,"Uses coal fuel",null,1.7752510956161725E-2,null,null,"Uses open fire without chimney",null,-9.9134309919600557E-4,null,null,"Uses agriculture crop fuel",null,1.1249412239065941E-2]
[null,null,"Uses charcoal fuel",null,2.4607718241561504E-2,null,null,"Uses open fire with chimney",null,-2.5615454423577469E-3,null,null,"Uses animal dung fuel",null,1.5279555818627764E-4]
[null,null,"Uses wood fuel",null,0.1344128838793528,null,null,"Uses closed stove with chimney",null,7.0493355871582616E-3,null,null,"Uses shrubs grass fuel",null,7.5114072917248694E-3]
[null,null,"Uses agriculture crop fuel",null,1.5215753512251745E-2,null,null,"Permanent Income question 1",null,0.10483072318417266,null,null,"Uses open fire without chimney",null,0.10982542808318085]
[null,null,"Uses animal dung fuel",null,7.7677000513207985E-4,null,null,"Has Car",null,2.7087804260649089E-2,null,null,"Uses open fire with chimney",null,4.3926729827844603E-2]
[null,null,"Uses shrubs grass fuel",null,8.1420700483932438E-3,null,null,"Has TV",null,2.7933717240733763E-2,null,null,"Uses closed stove with chimney",null,1.7625396131731221E-2]
[null,null,"Uses open fire without chimney",null,0.11686566638768037,null,null,"Has Bicycle",null,8.5163362032220413E-2,null,null,"Uses living or sleeping room as kitchen",null,2.9851150597034519E-2]
[null,null,"Uses open fire with chimney",null,5.5688068513635225E-2,null,null,"Has Video",null,3.2543513073339747E-2,null,null,"Uses separate room as kitchen",null,-7.8255775189847596E-2]
[null,null,"Uses closed stove with chimney",null,2.3080283059398399E-2,null,null,"Has Stereo",null,3.0120749776762892E-2,null,null,"Uses separate building as kitchen",null,4.0599732883493486E-2]
[null,null,"Uses living or sleeping room as kitchen",null,3.3253901529666868E-2,null,null,"Has DVD",null,6.9706292642427864E-2,null,null,"Kooks outdoor",null,4.8598208103786511E-2]
[null,null,"Uses separate room as kitchen",null,-8.0030754073802238E-2,null,null,"Has Camera",null,2.3062741615402577E-2,null,null,"Heats house",null,2.8581647938694396E-3]
[null,null,"Uses separate building as kitchen",null,4.3838884389172737E-2,null,null,"Has Clothes washing machine",null,0.10368524628214035,null,null,"Uses gaz heating",null,-1.7450588476616201E-2]
[null,null,"Kooks outdoor",null,5.6148897890064962E-2,null,null,"Has Dish washing machine",null,2.2798207426789476E-2,null,null,"Uses electricity heating",null,-1.6206150461578629E-2]
[null,null,"Heats house",null,-1.9117766152870953E-2,null,null,"Has Vacuum cleaner",null,0.1153645325312411,null,null,"Uses kerozene heating",null,-6.0152827246526741E-3]
[null,null,"Uses gaz heating",null,-2.2493479190723947E-2,null,null,"Has Refrigerator",null,9.5241803062943137E-2,null,null,"Uses coal heating",null,2.2085714779040643E-3]
[null,null,"Uses electricity heating",null,-2.0816596204936234E-2,null,null,"Has Telephone",null,6.868637888556331E-2,null,null,"Uses charcoal heating",null,-2.0805048827817699E-3]
[null,null,"Uses kerozene heating",null,-1.8384988571010365E-3,null,null,"Has Cellular phone",null,8.2152481075181819E-2,null,null,"Uses wood heating",null,1.8944264995698627E-2]
[null,null,"Uses coal heating",null,5.2676724245220305E-3,null,null,"Has Computer",null,6.8319422965027618E-2,null,null,"Uses agriculture crop heating",null,8.347540677019925E-3]
[null,null,"Uses charcoal heating",null,9.1107542322468849E-4,null,null,null,null,null,null,null,"Uses open fire without chimney",null,9.2662170472647268E-4]
[null,null,"Uses wood heating",null,1.4903920660568991E-2,null,null,null,null,null,null,null,"Uses open fire with chimney",null,1.577783479016686E-2]
[null,null,"Uses agriculture crop heating",null,5.2769273734871941E-3,null,null,"Component Score Covariance Matrix",null,null,null,null,"Uses closed stove with chimney",null,7.990491760174875E-3]
[null,null,"Uses shrubs grass heating",null,3.0788162552811663E-3,null,null,"Component",null,"1",null,null,"Permanent Income question 1",null,9.4344825710907187E-2]
[null,null,"Uses open fire without chimney",null,-6.5999458710554488E-5,null,null,"1",null,1,null,null,"Has Car",null,2.892140061998345E-2]
[null,null,"Uses open fire with chimney",null,1.0511346609101923E-2,null,null,null,null,null,null,null,"Has TV",null,2.9935038023288771E-2]
[null,null,"Uses closed stove with chimney",null,1.1862075154518337E-2,null,null,null,null,null,null,null,"Has Bicycle",null,7.3608972408707493E-2]
[null,null,"Has Car",null,2.4134085251372745E-2,null,null,null,null,null,null,null,"Has Video",null,6.3417469824331135E-2]
[null,null,"Has TV",null,2.5424196417128168E-2,null,null,null,null,null,null,null,"Has Stereo",null,5.1962384536129204E-2]
[null,null,"Has Bicycle",null,6.8019196653491223E-2,null,null,null,null,null,null,null,"Has DVD",null,8.339136320702753E-2]
[null,null,"Has Video",null,5.7540829733920426E-2,null,null,null,null,null,null,null,"Has Camera",null,3.3943357830943321E-2]
[null,null,"Has Stereo",null,3.5849165536073417E-2,null,null,null,null,null,null,null,"Has Clothes washing machine",null,9.8490782344087896E-2]
[null,null,"Has DVD",null,7.8063541112701765E-2,null,null,null,null,null,null,null,"Has Dish washing machine",null,1.4522952614207368E-2]
[null,null,"Has Camera",null,2.9027747295048159E-2,null,null,null,null,null,null,null,"Has Vacuum cleaner",null,0.11151419716285732]
[null,null,"Has Clothes washing machine",null,9.7179385090884043E-2,null,null,null,null,null,null,null,"Has Refrigerator",null,6.4238191095261896E-2]
[null,null,"Has Dish washing machine",null,1.8564760966077686E-2,null,null,null,null,null,null,null,"Has Telephone",null,4.8677136967867095E-2]
[null,null,"Has Vacuum cleaner",null,0.11008273581967369,null,null,null,null,null,null,null,"Has Cellular phone",null,9.8261615075741326E-2]
[null,null,"Has Refrigerator",null,8.0328215705466527E-2,null,null,null,null,null,null,null,"Has Computer",null,3.3085516994422144E-2]
[null,null,"Has Telephone",null,5.9898501551838894E-2]
[null,null,"Has Cellular phone",null,9.5761014449369755E-2]
[null,null,"Has Computer",null,5.2712678316838041E-2,null,null,null,null,null,null,null,"Component Score Covariance Matrix"]
[null,null,null,null,null,null,null,null,null,null,null,null,"Component",null,"1"]
[null,null,null,null,null,null,null,null,null,null,null,null,"1",null,1]
[null,null,"Component Score Covariance Matrix"]
[null,null,"Component",null,"1"]
[null,null,"1",null,1]
[]
[]
[]
[]
[]
[]
[]
[]
[]
[]
[]
[]
[]
[]
[]
[]
[]
[]
[]
[]
[]
[]
[]
[]
[]
[]
[]
[]
[]
[]
[]
[]
[]
[]
[]
[]
[]
[]
[]
[]
[]
[]
[]
[]
[]
[]
[]
[]
[]
[]
[]
[]
[]
[]
[]
[]
[]
[]
[]
[]
[]
[]
[]
[]
[]
[]
[]
[]
[]
[]
[]
[]
[]
[]
[]
[]
[]
[]
[]
[]
[]
[]
[]
[]
[]
[]
[]
[]
[]
[]
[]
[]
[]
[]
[]
[]
[]
[]
[]
[]
[]
[]
[]
[]
[]
[]
[]
[]
[]
[]
[]
[]
[]
[]
[]
[]
[]
[]
[]
[]
[]
[]
[]
[]
[]
[]
[]
[]
[]
[]
[]
[]
[]
[]
[]
[]
[]
[]
[]
[]
[]
[]
[]
[]
[]
[]
[]
[]
[]
[]
[]
[]
[]
[]
[]
[]
[]
[]
[]
[]
[]
[]
[]
[]
[]
[]
[]
[]
[]
[]
[]
[]
[]
[]
[]
[]
[]
[]
[]
[]
[]
[]
[]
[]
[]
[]
[]
[]
[]
[]
[]
[]
[]
[]
[]
[]
[]
[]
[]
[]
[]
[]
[]
[]
[]
[]
[]
[]
[]
[]
[]
[]
[]
[]
[]
[]
[]
[]
[]
[]
[]
[]
[]
[]
[]
[]
[]
[]
[]
[]
[]
[]
[]
[]
[]
[]
[]
[]
[]
[]
[]
[]
[]
[]
[]
[]
[]
[]
[]
[]
[]
[]
[]
[]
[]
[]
[]
[]
[]
[]
[]
[]
[]
[]
[]
[]
[]
[]
[]
[]
[]
[]
[]
[]
[]
[]
[]
[]
[]
[]
[]
[]
[]
[]
[]
[]
[]
[]
[]
[]
[]
[]
[]
[]
[]
[]
[]
[]
[]
[]
[]
[]
[]
[]
[]
[]
[]
[]
[]
[]
[]
[]
[]
[]
[]
[]
[]
[]
[]
[]
[]
[]
[]
[]
[]
[]
[]
[]
[]
[]
[]
[]
[]
[]
[]
[]
[]
[]
[]
[]
[]
[]
[]
[]
[]
[]
[]
[]
[]
[]
[]
[]
[]
[]
[]
[]
[]
[]
[]
[]
[]
[]
[]
[]
[]
[]
[]
[]
[]
[]
[]
[]
[]
[]
[]
[]
[]
[]
[]
[]
[]
[]
[]
[]
[]
[]
[]
[]
[]
[]
[]
[]
[]
[]
[]
[]
[]
[]
[]
[]
[]
[]
[]
[]
[]
[]
[]
[]
[]
[]
[]
[]
[]
[]
[]
[]
[]
[]
[]
[]
[]
[]
[]
[]
[]
[]
[]
[]
[]
[]
[]
[]
[]
[]
[]
[]
[]
[]
[]
[]
[]
[]
[]
[]
[]
[]
[]
[]
[]
[]
[]
[]
[]
[]
["WHS03"]
["Mexico",null,"Count"]
["W_text_t","",38742]
["W_text_i","",38742]
["S_text_s","",38742]
["S_text_i","",38742]
["Urban/Rural","Urban",29529]
[null,"Rural",9213]
["2003"]
["2003"]
[]
["Sub-national region names","Weighted population"]
[{"$f":"R15","v":0},{"$f":"#REF!+#REF!","v":{"$error":"#REF!"}}]
[{"$f":"S15","v":0},{"$f":"#REF!+#REF!","v":{"$error":"#REF!"}}]
[{"$f":"T15","v":0},{"$f":"#REF!+#REF!","v":{"$error":"#REF!"}}]
[{"$f":"U15","v":0},{"$f":"#REF!+#REF!","v":{"$error":"#REF!"}}]
[{"$f":"V15","v":0},{"$f":"#REF!+#REF!","v":{"$error":"#REF!"}}]
[{"$f":"W15","v":0},{"$f":"#REF!+#REF!","v":{"$error":"#REF!"}}]
[{"$f":"X15","v":0},{"$f":"#REF!+WI123","v":{"$error":"#REF!"}}]
[{"$f":"Y15","v":0},{"$f":"#REF!+#REF!","v":{"$error":"#REF!"}}]
[{"$f":"Z15","v":0},{"$f":"#REF!+#REF!","v":{"$error":"#REF!"}}]
[{"$f":"AA15","v":0},{"$f":"#REF!+#REF!","v":{"$error":"#REF!"}}]
[{"$f":"AB15","v":0},{"$f":"#REF!+#REF!","v":{"$error":"#REF!"}}]
[{"$f":"AC15","v":0},{"$f":"#REF!+#REF!","v":{"$error":"#REF!"}}]
[{"$f":"AD15","v":0},{"$f":"#REF!+#REF!","v":{"$error":"#REF!"}}]
[{"$f":"AE15","v":0},{"$f":"#REF!+#REF!","v":{"$error":"#REF!"}}]
[{"$f":"AF15","v":0},{"$f":"#REF!+#REF!","v":{"$error":"#REF!"}}]
[{"$f":"AG15","v":0},{"$f":"#REF!+#REF!","v":{"$error":"#REF!"}}]
[{"$f":"AH15","v":0},{"$f":"#REF!+#REF!","v":{"$error":"#REF!"}}]
[{"$f":"AI15","v":0},{"$f":"#REF!+#REF!","v":{"$error":"#REF!"}}]
[{"$f":"AJ15","v":0},{"$f":"#REF!+#REF!","v":{"$error":"#REF!"}}]
[{"$f":"AK15","v":0},{"$f":"#REF!+#REF!","v":{"$error":"#REF!"}}]
[{"$f":"AL15","v":0},{"$f":"#REF!+#REF!","v":{"$error":"#REF!"}}]
[{"$f":"AM15","v":0},{"$f":"#REF!+#REF!","v":{"$error":"#REF!"}}]
[{"$f":"AN15","v":0},{"$f":"#REF!+#REF!","v":{"$error":"#REF!"}}]
[{"$f":"AO15","v":0},{"$f":"#REF!+#REF!","v":{"$error":"#REF!"}}]
[{"$f":"AP15","v":0},{"$f":"#REF!+#REF!","v":{"$error":"#REF!"}}]
[{"$f":"AQ15","v":0},{"$f":"#REF!+#REF!","v":{"$error":"#REF!"}}]
[{"$f":"AR15","v":0},{"$f":"#REF!+#REF!","v":{"$error":"#REF!"}}]
[{"$f":"AS15","v":0},{"$f":"#REF!+#REF!","v":{"$error":"#REF!"}}]
[{"$f":"AT15","v":0},{"$f":"#REF!+#REF!","v":{"$error":"#REF!"}}]
[{"$f":"AU15","v":0},{"$f":"#REF!+#REF!","v":{"$error":"#REF!"}}]
[{"$f":"AV15","v":0},{"$f":"#REF!+#REF!","v":{"$error":"#REF!"}}]
[{"$f":"AW15","v":0},{"$f":"#REF!+#REF!","v":{"$error":"#REF!"}}]
[{"$f":"AX15","v":0},{"$f":"#REF!+#REF!","v":{"$error":"#REF!"}}]
[{"$f":"AY15","v":0},{"$f":"#REF!+#REF!","v":{"$error":"#REF!"}}]
[]
[{"$f":"34-COUNTIF(A1037:A1071,\"0\")","v":0},"Sub-regions"]

{"sheet":"ENG12","index":5,"n_rows":1072,"n_cols":69,"rows_kept":1072,"cut":false,"hidden":false,"merged":[[340,52,341,52],[342,52,343,52],[344,52,345,52],[346,52,347,52],[348,52,349,52],[350,52,351,52],[352,52,353,52],[260,52,262,52],[263,52,266,52],[267,52,269,52],[270,52,272,52],[273,52,275,52],[276,52,283,52],[338,54,338,58],[338,59,338,63],[338,64,338,68],[219,54,219,58],[219,59,219,63],[219,64,219,68],[221,52,223,52],[224,52,225,52],[226,52,229,52],[258,54,258,58],[258,59,258,63],[258,64,258,68],[13,54,13,58],[13,59,13,63],[13,64,13,68],[15,52,16,52],[17,52,20,52],[21,52,22,52],[26,54,26,58],[26,59,26,63],[26,64,26,68],[55,54,55,58],[55,59,55,63],[55,64,55,68],[119,54,119,58],[119,59,119,63],[119,64,119,68],[132,54,132,58],[132,59,132,63],[132,64,132,68],[49,52,51,52],[52,52,54,52],[139,0,142,0],[143,0,146,0],[147,0,149,0],[38,52,39,52],[40,52,41,52],[42,52,43,52],[44,52,45,52],[46,0,48,0],[46,52,48,52],[28,52,29,52],[30,0,31,0],[30,52,31,52],[32,0,33,0],[32,52,33,52],[34,52,35,52],[36,52,37,52],[57,0,62,0],[107,0,107,1],[119,2,119,6],[119,7,119,11],[119,12,119,16],[55,2,55,6],[55,7,55,11],[55,12,55,16],[28,0,29,0],[34,0,35,0],[36,0,37,0],[40,0,41,0],[42,0,43,0],[44,0,45,0],[697,2,697,3],[697,7,697,8],[697,12,697,13],[698,2,698,3],[698,7,698,8],[698,12,698,13],[695,2,695,3],[695,7,695,8],[695,12,695,13],[696,2,696,3],[696,7,696,8],[696,12,696,13],[693,2,693,3],[693,7,693,8],[693,12,693,13],[694,2,694,3],[694,7,694,8],[694,12,694,13],[691,2,691,3],[691,7,691,8],[691,12,691,13],[692,2,692,3],[692,7,692,8],[692,12,692,13],[689,2,689,3],[689,7,689,8],[689,12,689,13],[690,2,690,3],[690,7,690,8],[690,12,690,13],[687,2,687,3],[687,7,687,8],[687,12,687,13],[688,2,688,3],[688,7,688,8],[688,12,688,13],[685,2,685,3],[685,7,685,8],[685,12,685,13],[686,2,686,3],[686,7,686,8],[686,12,686,13],[683,2,683,3],[683,7,683,8],[683,12,683,13],[684,2,684,3],[684,7,684,8],[684,12,684,13],[681,2,681,3],[681,7,681,8],[681,12,681,13],[682,2,682,3],[682,7,682,8],[682,12,682,13],[679,2,679,3],[679,7,679,8],[679,12,679,13],[680,2,680,3],[680,7,680,8],[680,12,680,13],[677,2,677,3],[677,7,677,8],[677,12,677,13],[678,2,678,3],[678,7,678,8],[678,12,678,13],[675,2,675,3],[675,7,675,8],[675,12,675,13],[676,2,676,3],[676,7,676,8],[676,12,676,13],[673,2,673,3],[673,7,673,8],[673,12,673,13],[674,2,674,3],[674,7,674,8],[674,12,674,13],[671,2,671,3],[671,7,671,8],[671,12,671,13],[672,2,672,3],[672,7,672,8],[672,12,672,13],[669,2,669,3],[669,7,669,8],[669,12,669,13],[670,2,670,3],[670,7,670,8],[670,12,670,13],[667,2,667,3],[667,7,667,8],[667,12,667,13],[668,2,668,3],[668,7,668,8],[668,12,668,13],[665,2,665,3],[665,7,665,8],[665,12,665,13],[666,2,666,3],[666,7,666,8],[666,12,666,13],[663,2,663,3],[663,7,663,8],[663,12,663,13],[664,2,664,3],[664,7,664,8],[664,12,664,13],[661,2,661,3],[661,7,661,8],[661,12,661,13],[662,2,662,3],[662,7,662,8],[662,12,662,13],[659,2,659,3],[659,7,659,8],[659,12,659,13],[660,2,660,3],[660,7,660,8],[660,12,660,13],[657,2,657,3],[657,7,657,8],[657,12,657,13],[658,2,658,3],[658,7,658,8],[658,12,658,13],[655,2,655,3],[655,7,655,8],[655,12,655,13],[656,2,656,3],[656,7,656,8],[656,12,656,13],[653,2,653,3],[653,7,653,8],[653,12,653,13],[654,2,654,3],[654,7,654,8],[654,12,654,13],[651,2,651,3],[651,7,651,8],[651,12,651,13],[652,2,652,3],[652,7,652,8],[652,12,652,13],[649,2,649,3],[649,7,649,8],[649,12,649,13],[650,2,650,3],[650,7,650,8],[650,12,650,13],[647,2,647,3],[647,7,647,8],[647,12,647,13],[648,2,648,3],[648,7,648,8],[648,12,648,13],[645,2,645,3],[645,7,645,8],[645,12,645,13],[646,2,646,3],[646,7,646,8],[646,12,646,13],[643,2,643,3],[643,7,643,8],[643,12,643,13],[644,2,644,3],[644,7,644,8],[644,12,644,13],[641,2,641,3],[641,7,641,8],[641,12,641,13],[642,2,642,3],[642,7,642,8],[642,12,642,13],[639,2,639,3],[639,7,639,8],[639,12,639,13],[640,2,640,3],[640,7,640,8],[640,12,640,13],[637,2,637,3],[637,7,637,8],[637,12,637,13],[638,2,638,3],[638,7,638,8],[638,12,638,13],[635,2,635,3],[635,7,635,8],[635,12,635,13],[636,2,636,3],[636,7,636,8],[636,12,636,13],[633,2,633,3],[633,7,633,8],[633,12,633,13],[634,2,634,3],[634,7,634,8],[634,12,634,13],[631,2,631,3],[631,7,631,8],[631,12,631,13],[632,2,632,3],[632,7,632,8],[632,12,632,13],[629,2,629,3],[629,7,629,8],[629,12,629,13],[630,2,630,3],[630,7,630,8],[630,12,630,13],[627,2,627,3],[627,7,627,8],[627,12,627,13],[628,2,628,3],[628,7,628,8],[628,12,628,13],[625,2,625,3],[625,7,625,8],[625,12,625,13],[626,2,626,3],[626,7,626,8],[626,12,626,13],[623,2,623,3],[623,7,623,8],[623,12,623,13],[624,2,624,3],[624,7,624,8],[624,12,624,13],[621,2,621,3],[621,7,621,8],[621,12,621,13],[622,2,622,3],[622,7,622,8],[622,12,622,13],[619,2,619,3],[619,7,619,8],[619,12,619,13],[620,2,620,3],[620,7,620,8],[620,12,620,13],[617,2,617,3],[617,7,617,8],[617,12,617,13],[618,2,618,3],[618,7,618,8],[618,12,618,13],[615,2,615,3],[615,7,615,8],[615,12,615,13],[616,2,616,3],[616,7,616,8],[616,12,616,13],[613,2,613,3],[613,7,613,8],[613,12,613,13],[614,2,614,3],[614,7,614,8],[614,12,614,13],[611,2,611,3],[611,7,611,8],[611,12,611,13],[612,2,612,3],[612,7,612,8],[612,12,612,13],[609,2,609,3],[609,7,609,8],[609,12,609,13],[610,2,610,3],[610,7,610,8],[610,12,610,13],[607,2,607,3],[607,7,607,8],[607,12,607,13],[608,2,608,3],[608,7,608,8],[608,12,608,13],[605,2,605,3],[605,7,605,8],[605,12,605,13],[606,2,606,3],[606,7,606,8],[606,12,606,13],[603,2,603,3],[603,7,603,8],[603,12,603,13],[604,2,604,3],[604,7,604,8],[604,12,604,13],[601,2,601,3],[601,7,601,8],[601,12,601,13],[602,2,602,3],[602,7,602,8],[602,12,602,13],[599,2,599,3],[599,7,599,8],[599,12,599,13],[600,2,600,3],[600,7,600,8],[600,12,600,13],[597,2,597,3],[597,7,597,8],[597,12,597,13],[598,2,598,3],[598,7,598,8],[598,12,598,13],[595,2,595,3],[595,7,595,8],[595,12,595,13],[596,2,596,3],[596,7,596,8],[596,12,596,13],[593,2,593,3],[593,7,593,8],[593,12,593,13],[594,2,594,3],[594,7,594,8],[594,12,594,13],[591,2,591,3],[591,7,591,8],[591,12,591,13],[592,2,592,3],[592,7,592,8],[592,12,592,13],[589,2,589,3],[589,7,589,8],[589,12,589,13],[590,2,590,3],[590,7,590,8],[590,12,590,13],[587,2,587,3],[587,7,587,8],[587,12,587,13],[588,2,588,3],[588,7,588,8],[588,12,588,13],[585,2,585,3],[585,7,585,8],[585,12,585,13],[586,2,586,3],[586,7,586,8],[586,12,586,13],[583,2,583,3],[583,7,583,8],[583,12,583,13],[584,2,584,3],[584,7,584,8],[584,12,584,13],[581,2,581,3],[581,7,581,8],[581,12,581,13],[582,2,582,3],[582,7,582,8],[582,12,582,13],[579,2,579,4],[579,7,579,9],[579,12,579,14],[580,2,580,3],[580,7,580,8],[580,12,580,13],[577,2,577,3],[577,7,577,8],[577,12,577,13],[578,2,578,3],[578,7,578,8],[578,12,578,13],[575,2,575,3],[575,7,575,8],[575,12,575,13],[576,2,576,3],[576,7,576,8],[576,12,576,13],[573,2,573,3],[573,7,573,8],[573,12,573,13],[574,2,574,3],[574,7,574,8],[574,12,574,13],[571,2,571,3],[571,7,571,8],[571,12,571,13],[572,2,572,3],[572,7,572,8],[572,12,572,13],[569,2,569,3],[569,7,569,8],[569,12,569,13],[570,2,570,3],[570,7,570,8],[570,12,570,13],[567,2,567,3],[567,7,567,8],[567,12,567,13],[568,2,568,3],[568,7,568,8],[568,12,568,13],[565,2,565,3],[565,7,565,8],[565,12,565,13],[566,2,566,3],[566,7,566,8],[566,12,566,13],[563,2,563,3],[563,7,563,8],[563,12,563,13],[564,2,564,3],[564,7,564,8],[564,12,564,13],[561,2,561,3],[561,7,561,8],[561,12,561,13],[562,2,562,3],[562,7,562,8],[562,12,562,13],[559,2,559,3],[559,7,559,8],[559,12,559,13],[560,2,560,3],[560,7,560,8],[560,12,560,13],[557,2,557,3],[557,7,557,8],[557,12,557,13],[558,2,558,3],[558,7,558,8],[558,12,558,13],[555,2,555,3],[555,7,555,8],[555,12,555,13],[556,2,556,3],[556,7,556,8],[556,12,556,13],[553,2,553,3],[553,7,553,8],[553,12,553,13],[554,2,554,3],[554,7,554,8],[554,12,554,13],[551,2,551,3],[551,7,551,8],[551,12,551,13],[552,2,552,3],[552,7,552,8],[552,12,552,13],[549,2,549,3],[549,7,549,8],[549,12,549,13],[550,2,550,3],[550,7,550,8],[550,12,550,13],[547,2,547,3],[547,7,547,8],[547,12,547,13],[548,2,548,3],[548,7,548,8],[548,12,548,13],[545,2,545,3],[545,7,545,8],[545,12,545,13],[546,2,546,3],[546,7,546,8],[546,12,546,13],[543,2,543,3],[543,7,543,8],[543,12,543,13],[544,2,544,3],[544,7,544,8],[544,12,544,13],[541,2,541,3],[541,7,541,8],[541,12,541,13],[542,2,542,3],[542,7,542,8],[542,12,542,13],[539,2,539,3],[539,7,539,8],[539,12,539,13],[540,2,540,3],[540,7,540,8],[540,12,540,13],[537,2,537,3],[537,7,537,8],[537,12,537,13],[538,2,538,3],[538,7,538,8],[538,12,538,13],[535,2,535,3],[535,7,535,8],[535,12,535,13],[536,2,536,3],[536,7,536,8],[536,12,536,13],[533,2,533,3],[533,7,533,8],[533,12,533,13],[534,2,534,3],[534,7,534,8],[534,12,534,13],[531,2,531,3],[531,7,531,8],[531,12,531,13],[532,2,532,3],[532,7,532,8],[532,12,532,13],[529,2,529,3],[529,7,529,8],[529,12,529,13],[530,2,530,3],[530,7,530,8],[530,12,530,13],[527,2,527,3],[527,7,527,8],[527,12,527,13],[528,2,528,3],[528,7,528,8],[528,12,528,13],[525,2,525,3],[525,7,525,8],[525,12,525,13],[526,2,526,3],[526,7,526,8],[526,12,526,13],[522,2,523,3],[522,7,523,8],[522,12,523,13],[524,2,524,3],[524,7,524,8],[524,12,524,13],[520,2,520,3],[520,7,520,8],[520,12,520,13],[521,2,521,4],[521,7,521,9],[521,12,521,14],[518,2,518,3],[518,7,518,8],[518,12,518,13],[519,2,519,3],[519,7,519,8],[519,12,519,13],[515,2,515,6],[515,7,515,11],[515,12,515,16],[516,2,517,3],[516,4,516,6],[516,7,517,8],[516,9,516,11],[516,12,517,13],[516,14,516,16],[513,2,513,3],[513,7,513,8],[513,12,513,13],[514,2,514,3],[514,7,514,8],[514,12,514,13],[511,2,511,3],[511,7,511,8],[511,12,511,13],[512,2,512,3],[512,7,512,8],[512,12,512,13],[509,2,509,3],[509,7,509,8],[509,12,509,13],[510,2,510,3],[510,7,510,8],[510,12,510,13],[507,2,507,3],[507,7,507,8],[507,12,507,13],[508,2,508,3],[508,7,508,8],[508,12,508,13],[505,2,505,3],[505,7,505,8],[505,12,505,13],[506,2,506,3],[506,7,506,8],[506,12,506,13],[503,2,503,3],[503,7,503,8],[503,12,503,13],[504,2,504,3],[504,7,504,8],[504,12,504,13],[501,2,501,3],[501,7,501,8],[501,12,501,13],[502,2,502,3],[502,7,502,8],[502,12,502,13],[499,2,499,3],[499,7,499,8],[499,12,499,13],[500,2,500,3],[500,7,500,8],[500,12,500,13],[497,2,497,3],[497,7,497,8],[497,12,497,13],[498,2,498,3],[498,7,498,8],[498,12,498,13],[495,2,495,3],[495,7,495,8],[495,12,495,13],[496,2,496,3],[496,7,496,8],[496,12,496,13],[493,2,493,3],[493,7,493,8],[493,12,493,13],[494,2,494,3],[494,7,494,8],[494,12,494,13],[491,2,491,3],[491,7,491,8],[491,12,491,13],[492,2,492,3],[492,7,492,8],[492,12,492,13],[489,2,489,3],[489,7,489,8],[489,12,489,13],[490,2,490,3],[490,7,490,8],[490,12,490,13],[487,2,487,3],[487,7,487,8],[487,12,487,13],[488,2,488,3],[488,7,488,8],[488,12,488,13],[485,2,485,3],[485,7,485,8],[485,12,485,13],[486,2,486,3],[486,7,486,8],[486,12,486,13],[483,2,483,3],[483,7,483,8],[483,12,483,13],[484,2,484,3],[484,7,484,8],[484,12,484,13],[481,2,481,3],[481,7,481,8],[481,12,481,13],[482,2,482,3],[482,7,482,8],[482,12,482,13],[479,2,479,3],[479,7,479,8],[479,12,479,13],[480,2,480,3],[480,7,480,8],[480,12,480,13],[477,2,477,3],[477,7,477,8],[477,12,477,13],[478,2,478,3],[478,7,478,8],[478,12,478,13],[475,2,475,3],[475,7,475,8],[475,12,475,13],[476,2,476,3],[476,7,476,8],[476,12,476,13],[473,2,473,3],[473,7,473,8],[473,12,473,13],[474,2,474,3],[474,7,474,8],[474,12,474,13],[471,2,471,3],[471,7,471,8],[471,12,471,13],[472,2,472,3],[472,7,472,8],[472,12,472,13],[469,2,469,3],[469,7,469,8],[469,12,469,13],[470,2,470,3],[470,7,470,8],[470,12,470,13],[467,2,467,3],[467,7,467,8],[467,12,467,13],[468,2,468,3],[468,7,468,8],[468,12,468,13],[465,2,465,3],[465,7,465,8],[465,12,465,13],[466,2,466,3],[466,7,466,8],[466,12,466,13],[463,2,463,3],[463,7,463,8],[463,12,463,13],[464,2,464,3],[464,7,464,8],[464,12,464,13],[461,2,461,3],[461,7,461,8],[461,12,461,13],[462,2,462,3],[462,7,462,8],[462,12,462,13],[459,2,459,3],[459,7,459,8],[459,12,459,13],[460,2,460,3],[460,7,460,8],[460,12,460,13],[457,2,457,3],[457,7,457,8],[457,12,457,13],[458,2,458,4],[458,7,458,9],[458,12,458,14],[455,2,455,3],[455,7,455,8],[455,12,455,13],[456,2,456,3],[456,7,456,8],[456,12,456,13],[453,2,453,3],[453,7,453,8],[453,12,453,13],[454,2,454,3],[454,7,454,8],[454,12,454,13],[451,2,451,3],[451,7,451,8],[451,12,451,13],[452,2,452,3],[452,7,452,8],[452,12,452,13],[449,2,449,3],[449,7,449,8],[449,12,449,13],[450,2,450,3],[450,7,450,8],[450,12,450,13],[447,2,447,3],[447,7,447,8],[447,12,447,13],[448,2,448,3],[448,7,448,8],[448,12,448,13],[445,2,445,3],[445,7,445,8],[445,12,445,13],[446,2,446,3],[446,7,446,8],[446,12,446,13],[443,2,443,3],[443,7,443,8],[443,12,443,13],[444,2,444,3],[444,7,444,8],[444,12,444,13],[441,2,441,3],[441,7,441,8],[441,12,441,13],[442,2,442,3],[442,7,442,8],[442,12,442,13],[439,2,439,3],[439,7,439,8],[439,12,439,13],[440,2,440,3],[440,7,440,8],[440,12,440,13],[437,2,437,3],[437,7,437,8],[437,12,437,13],[438,2,438,3],[438,7,438,8],[438,12,438,13],[435,2,435,3],[435,7,435,8],[435,12,435,13],[436,2,436,3],[436,7,436,8],[436,12,436,13],[433,2,433,3],[433,7,433,8],[433,12,433,13],[434,2,434,3],[434,7,434,8],[434,12,434,13],[431,2,431,3],[431,7,431,8],[431,12,431,13],[432,2,432,3],[432,7,432,8],[432,12,432,13],[429,2,429,3],[429,7,429,8],[429,12,429,13],[430,2,430,3],[430,7,430,8],[430,12,430,13],[427,2,427,3],[427,7,427,8],[427,12,427,13],[428,2,428,3],[428,7,428,8],[428,12,428,13],[425,2,425,3],[425,7,425,8],[425,12,425,13],[426,2,426,3],[426,7,426,8],[426,12,426,13],[423,2,423,3],[423,7,423,8],[423,12,423,13],[424,2,424,3],[424,7,424,8],[424,12,424,13],[421,2,421,3],[421,7,421,8],[421,12,421,13],[422,2,422,3],[422,7,422,8],[422,12,422,13],[405,12,405,13],[406,2,406,3],[406,7,406,8],[406,12,406,13],[419,2,419,3],[419,7,419,8],[419,12,419,13],[420,2,420,3],[420,7,420,8],[420,12,420,13],[417,2,417,3],[417,7,417,8],[417,12,417,13],[418,2,418,3],[418,7,418,8],[418,12,418,13],[415,2,415,3],[415,7,415,8],[415,12,415,13],[416,2,416,3],[416,7,416,8],[416,12,416,13],[410,12,410,13],[407,2,407,3],[407,7,407,8],[407,12,407,13],[408,2,408,3],[408,7,408,8],[408,12,408,13],[413,2,413,3],[413,7,413,8],[413,12,413,13],[414,2,414,3],[414,7,414,8],[414,12,414,13],[411,2,411,3],[411,7,411,8],[411,12,411,13],[412,2,412,3],[412,7,412,8],[412,12,412,13],[1024,0,1024,2],[1025,0,1025,1],[1030,0,1032,0],[1033,0,1033,2],[398,2,398,5],[219,12,219,16],[221,0,223,0],[398,7,398,10],[398,12,398,15],[399,2,399,4],[399,7,399,9],[399,12,399,14],[400,2,401,3],[400,7,401,8],[400,12,401,13],[405,2,405,3],[405,7,405,8],[401,1,444,1],[402,2,402,3],[402,7,402,8],[402,12,402,13],[403,2,403,3],[403,7,403,8],[403,12,403,13],[404,2,404,3],[404,7,404,8],[404,12,404,13],[409,2,409,3],[409,7,409,8],[409,12,409,13],[410,2,410,3],[410,7,410,8],[26,12,26,16],[13,12,13,16],[15,0,16,0],[17,0,20,0],[21,0,22,0],[23,0,25,0],[38,0,39,0],[49,0,51,0],[13,2,13,6],[13,7,13,11],[26,2,26,6],[26,7,26,11],[207,0,207,1],[219,2,219,6],[219,7,219,11],[161,0,162,1],[161,2,161,6],[161,7,161,11],[161,12,161,16],[163,0,169,0],[132,7,132,11]],"merged_total":1011,"flags":["merged_cut"]}
[]
[{"$f":"A1026","v":"Mexico"}]
[{"$f":"A1034","v":"2012"}]
["Use of drinking water sources"]
[" by wealth quintile and sub-national region"]
["Notes:"]
["WHO/UNICEF JMP customised wealth index excludes water,"]
[" sanitation and hygiene assets."]
["Survey used for analysis:",{"$f":"A1025","v":"ENG12"}]
[{"$f":"B1028","v":""}]
[{"$f":"B1027","v":"Time to improved source based on:"},"MICS15"]
[]
[]
["Use of drinking water sources",null,"NATIONAL wealth index quintile",null,null,null,null,"URBAN wealth index quintile",null,null,null,null,"RURAL wealth index quintile",null,null,null,null,null,null,null,null,null,null,null,null,null,null,null,null,null,null,null,null,null,null,null,null,null,null,null,null,null,null,null,null,null,null,null,null,null,null,null,"Raw numbers of respondents:","Use of drinking water sources","NATIONAL wealth index quintile",null,null,null,null,"URBAN wealth index quintile",null,null,null,null,"RURAL wealth index quintile"]
["Weighted percentage (used in graphs)",null,"Poorest","Poor","Middle","Rich","Richest","Poorest","Poor","Middle","Rich","Richest","Poorest","Poor","Middle","Rich","Richest",null,null,null,null,null,null,null,null,null,null,null,null,null,null,null,null,null,null,null,null,null,null,null,null,null,null,null,null,null,null,null,null,null,null,null,"Water data, raw numbers (weighted)",null,"Poorest","Poor","Middle","Rich","Richest","Poorest","Poor","Middle","Rich","Richest","Poorest","Poor","Middle","Rich","Richest"]
["Water","Improved",{"$f":"C58+C59+C60+C61+C62+C63*MICS15!C24/100","v":95.259606909602482},{"$f":"D58+D59+D60+D61+D62+D63*MICS15!D24/100","v":98.889920304833836},{"$f":"E58+E59+E60+E61+E62+E63*MICS15!E24/100","v":99.875453673897638},{"$f":"F58+F59+F60+F61+F62+F63*MICS15!F24/100","v":99.974176795730486},{"$f":"G58+G59+G60+G61+G62+G63*MICS15!G24/100","v":99.763929996540782},{"$f":"H58+H59+H60+H61+H62+H63*MICS15!H24/100","v":98.412595403414571},{"$f":"I58+I59+I60+I61+I62+I63*MICS15!I24/100","v":99.426325737514631},{"$f":"J58+J59+J60+J61+J62+J63*MICS15!J24/100","v":100.00000000000045},{"$f":"K58+K59+K60+K61+K62+K63*MICS15!K24/100","v":99.999999999999986},{"$f":"L58+L59+L60+L61+L62+L63*MICS15!L24/100","v":99.678603486653486},{"$f":"M58+M59+M60+M61+M62+M63*MICS15!M24/100","v":89.600917970742486},{"$f":"N58+N59+N60+N61+N62+N63*MICS15!N24/100","v":94.462651086171661},{"$f":"O58+O59+O60+O61+O62+O63*MICS15!O24/100","v":98.078127437425906},{"$f":"P58+P59+P60+P61+P62+P63*MICS15!P24/100","v":99.307578103459178},{"$f":"Q58+Q59+Q60+Q61+Q62+Q63*MICS15!Q24/100","v":99.51525367342623},null,null,null,null,null,null,null,null,null,null,null,null,null,null,null,null,null,null,null,null,null,null,null,null,null,null,null,null,null,null,null,null,null,null,null,"Water","Improved","N/A","N/A","N/A","N/A","N/A","N/A","N/A","N/A","N/A","N/A","N/A","N/A","N/A","N/A","N/A"]
[null,"Not Improved",{"$f":"100-C16","v":4.740393090397518},{"$f":"100-D16","v":1.1100796951661636},0.1245463261023616,2.5823204269514122E-2,0.23607000345921847,1.5874045965854293,0.57367426248536901,-4.5474735088646412E-13,0,0.32139651334651376,10.399082029257514,5.5373489138283389,1.9218725625740944,0.69242189654082154,0.48474632657377015,null,null,null,null,null,null,null,null,null,null,null,null,null,null,null,null,null,null,null,null,null,null,null,null,null,null,null,null,null,null,null,null,null,null,null,null,"Not Improved","N/A","N/A","N/A","N/A","N/A","N/A","N/A","N/A","N/A","N/A","N/A","N/A","N/A","N/A","N/A"]
["Water ladder","Basic",{"$f":"C16*MICS15!C23/100","v":93.654833198685935},{"$f":"D16*MICS15!D23/100","v":98.769957283225935},{"$f":"E16*MICS15!E23/100","v":99.760369769177771},{"$f":"F16*MICS15!F23/100","v":99.974176795730486},{"$f":"G16*MICS15!G23/100","v":99.763929996540767},{"$f":"H16*MICS15!H23/100","v":98.28745942775771},{"$f":"I16*MICS15!I23/100","v":99.357682515775906},{"$f":"J16*MICS15!J23/100","v":99.932944667673922},{"$f":"K16*MICS15!K23/100","v":99.999999999999986},{"$f":"L16*MICS15!L23/100","v":99.678603486653486},{"$f":"M16*MICS15!M23/100","v":85.095578474091781},{"$f":"N16*MICS15!N23/100","v":93.740470937883728},{"$f":"O16*MICS15!O23/100","v":96.679138088973389},{"$f":"P16*MICS15!P23/100","v":98.799337659266001},{"$f":"Q16*MICS15!Q23/100","v":99.4683874313139},null,null,null,null,null,null,null,null,null,null,null,null,null,null,null,null,null,null,null,null,null,null,null,null,null,null,null,null,null,null,null,null,null,null,null,"Water ladder","Basic","N/A","N/A","N/A","N/A","N/A","N/A","N/A","N/A","N/A","N/A","N/A","N/A","N/A","N/A","N/A"]
[null,"Limited",{"$f":"C16*MICS15!C22/100","v":1.6047737109165212},{"$f":"D16*MICS15!D22/100","v":0.11996302160789654},{"$f":"E16*MICS15!E22/100","v":0.11508390471984016},{"$f":"F16*MICS15!F22/100","v":0},{"$f":"G16*MICS15!G22/100","v":0},{"$f":"H16*MICS15!H22/100","v":0.1251359756568477},{"$f":"I16*MICS15!I22/100","v":6.8643221738741489E-2},{"$f":"J16*MICS15!J22/100","v":6.7055332326535128E-2},{"$f":"K16*MICS15!K22/100","v":0},{"$f":"L16*MICS15!L22/100","v":0},{"$f":"M16*MICS15!M22/100","v":4.5053394966507163},{"$f":"N16*MICS15!N22/100","v":0.72218014828796284},{"$f":"O16*MICS15!O22/100","v":1.3989893484524896},{"$f":"P16*MICS15!P22/100","v":0.50824044419317327},{"$f":"Q16*MICS15!Q22/100","v":4.6866242112334922E-2},null,null,null,null,null,null,null,null,null,null,null,null,null,null,null,null,null,null,null,null,null,null,null,null,null,null,null,null,null,null,null,null,null,null,null,null,"Limited","N/A","N/A","N/A","N/A","N/A","N/A","N/A","N/A","N/A","N/A","N/A","N/A","N/A","N/A","N/A"]
[null,"Unimproved",{"$f":"100-(C18+C19+C21)","v":4.4068366715361265},{"$f":"100-(D18+D19+D21)","v":1.0484053854562205},5.0070831996023912E-2,-0.16249209115049723,0.23607000345923268,1.4576133184045119,0.52248221947280626,-2.389058866364735E-2,0,0.32139651334651376,9.3590036145113658,5.2807489663772031,1.9218725625741229,0.5397976474589683,-0.25043804182529072,null,null,null,null,null,null,null,null,null,null,null,null,null,null,null,null,null,null,null,null,null,null,null,null,null,null,null,null,null,null,null,null,null,null,null,null,"Unimproved","N/A","N/A","N/A","N/A","N/A","N/A","N/A","N/A","N/A","N/A","N/A","N/A","N/A","N/A","N/A"]
[null,"Surface water",{"$f":"MICS15!C21","v":0.33355641886141979},{"$f":"MICS15!D21","v":6.1674309709942976E-2},{"$f":"MICS15!E21","v":7.4475494106362519E-2},{"$f":"MICS15!F21","v":0.18831529542001285},{"$f":"MICS15!G21","v":0},{"$f":"MICS15!H21","v":0.12979127818093358},{"$f":"MICS15!I21","v":5.1192043012554374E-2},{"$f":"MICS15!J21","v":2.3890588663193116E-2},{"$f":"MICS15!K21","v":0},{"$f":"MICS15!L21","v":0},{"$f":"MICS15!M21","v":1.0400784147461297},{"$f":"MICS15!N21","v":0.25659994745111198},{"$f":"MICS15!O21","v":0},{"$f":"MICS15!P21","v":0.15262424908184707},{"$f":"MICS15!Q21","v":0.73518436839905965},null,null,null,null,null,null,null,null,null,null,null,null,null,null,null,null,null,null,null,null,null,null,null,null,null,null,null,null,null,null,null,null,null,null,null,null,"Surface water","N/A","N/A","N/A","N/A","N/A","N/A","N/A","N/A","N/A","N/A","N/A","N/A","N/A","N/A","N/A"]
["Improved water point at more than 30 minutes","Yes","N/A","N/A","N/A","N/A","N/A","N/A","N/A","N/A","N/A","N/A","N/A","N/A","N/A","N/A","N/A",null,null,null,null,null,null,null,null,null,null,null,null,null,null,null,null,null,null,null,null,null,null,null,null,null,null,null,null,null,null,null,null,null,null,null,"Improved water point at more than 30 minutes","Yes","N/A","N/A","N/A","N/A","N/A","N/A","N/A","N/A","N/A","N/A","N/A","N/A","N/A","N/A","N/A"]
[null,"No","N/A","N/A","N/A","N/A","N/A","N/A","N/A","N/A","N/A","N/A","N/A","N/A","N/A","N/A","N/A",null,null,null,null,null,null,null,null,null,null,null,null,null,null,null,null,null,null,null,null,null,null,null,null,null,null,null,null,null,null,null,null,null,null,null,null,"No","N/A","N/A","N/A","N/A","N/A","N/A","N/A","N/A","N/A","N/A","N/A","N/A","N/A","N/A","N/A"]
["Manually calculated ratios","Improved wells"]
[null,"Improved springs"]
[null,"Other"]
[null,null,"NATIONAL wealth index quintile",null,null,null,null,"URBAN wealth index quintile",null,null,null,null,"RURAL wealth index quintile",null,null,null,null,null,null,null,null,null,null,null,null,null,null,null,null,null,null,null,null,null,null,null,null,null,null,null,null,null,null,null,null,null,null,null,null,null,null,null,"Raw numbers of respondents:","Use of drinking water sources","NATIONAL wealth index quintile",null,null,null,null,"URBAN wealth index quintile",null,null,null,null,"RURAL wealth index quintile"]
["Percentage based on weighted population",null,"Poorest","Poor","Middle","Rich","Richest","Poorest","Poor","Middle","Rich","Richest","Poorest","Poor","Middle","Rich","Richest",null,null,null,null,null,null,null,null,null,null,null,null,null,null,null,null,null,null,null,null,null,null,null,null,null,null,null,null,null,null,null,null,null,null,null,"Water data, raw numbers (weighted)",null,"Poorest","Poor","Middle","Rich","Richest","Poorest","Poor","Middle","Rich","Richest","Poorest","Poor","Middle","Rich","Richest"]
["Piped water","Yes",78.038679627033375,91.196809491239776,95.905858401431374,97.324773356909105,98.337050716647795,89.323922145256802,95.541945560129435,98.768278368855206,97.718958548295134,99.07462194248815,65.733590787020304,74.251865945085015,82.640071272650601,85.777849227147016,87.265172131464183,null,null,null,null,null,null,null,null,null,null,null,null,null,null,null,null,null,null,null,null,null,null,null,null,null,null,null,null,null,null,null,null,null,null,null,"Piped water","Yes","N/A","N/A","N/A","N/A","N/A","N/A","N/A","N/A","N/A","N/A","N/A","N/A","N/A","N/A","N/A"]
[null,"No",21.961320372966483,8.8031905087602453,4.0941415985687239,2.6752266430909368,1.6629492833521886,10.676077854742982,4.4580544398705504,1.2317216311448616,2.2810414517048745,0.92537805751188551,34.266409212979489,25.748134054915084,17.35992872734937,14.22215077285288,12.734827868535801,null,null,null,null,null,null,null,null,null,null,null,null,null,null,null,null,null,null,null,null,null,null,null,null,null,null,null,null,null,null,null,null,null,null,null,null,"No","N/A","N/A","N/A","N/A","N/A","N/A","N/A","N/A","N/A","N/A","N/A","N/A","N/A","N/A","N/A"]
["Piped water on premises","Yes",73.544398119445859,89.542096437550896,95.336510633221565,97.261966074080988,97.910304918362783,85.174119863069492,94.926133008774357,98.358834900979218,97.690037767793442,98.727622477696698,61.154057986122858,70.579505345954658,79.739334791049089,85.154332483446666,86.342636882443102,null,null,null,null,null,null,null,null,null,null,null,null,null,null,null,null,null,null,null,null,null,null,null,null,null,null,null,null,null,null,null,null,null,null,null,"Piped water on premises","Yes","N/A","N/A","N/A","N/A","N/A","N/A","N/A","N/A","N/A","N/A","N/A","N/A","N/A","N/A","N/A"]
[null,"No",26.455601880554124,10.457903562449127,4.6634893667785438,2.7380339259190833,2.0896950816372035,14.825880136930126,5.0738669912255476,1.6411650990207935,2.3099622322065323,1.2723775223033142,38.845942013876943,29.420494654045466,20.260665208950972,14.845667516553204,13.657363117556914,null,null,null,null,null,null,null,null,null,null,null,null,null,null,null,null,null,null,null,null,null,null,null,null,null,null,null,null,null,null,null,null,null,null,null,null,"No","N/A","N/A","N/A","N/A","N/A","N/A","N/A","N/A","N/A","N/A","N/A","N/A","N/A","N/A","N/A"]
["Piped water into dwelling","Yes","N/A","N/A","N/A","N/A","N/A","N/A","N/A","N/A","N/A","N/A","N/A","N/A","N/A","N/A","N/A",null,null,null,null,null,null,null,null,null,null,null,null,null,null,null,null,null,null,null,null,null,null,null,null,null,null,null,null,null,null,null,null,null,null,null,"Piped water into dwelling","Yes","N/A","N/A","N/A","N/A","N/A","N/A","N/A","N/A","N/A","N/A","N/A","N/A","N/A","N/A","N/A"]
[null,"No","N/A","N/A","N/A","N/A","N/A","N/A","N/A","N/A","N/A","N/A","N/A","N/A","N/A","N/A","N/A",null,null,null,null,null,null,null,null,null,null,null,null,null,null,null,null,null,null,null,null,null,null,null,null,null,null,null,null,null,null,null,null,null,null,null,null,"No","N/A","N/A","N/A","N/A","N/A","N/A","N/A","N/A","N/A","N/A","N/A","N/A","N/A","N/A","N/A"]
["Water source on premises","Yes","N/A","N/A","N/A","N/A","N/A","N/A","N/A","N/A","N/A","N/A","N/A","N/A","N/A","N/A","N/A",null,null,null,null,null,null,null,null,null,null,null,null,null,null,null,null,null,null,null,null,null,null,null,null,null,null,null,null,null,null,null,null,null,null,null,"Water source on premises","Yes","N/A","N/A","N/A","N/A","N/A","N/A","N/A","N/A","N/A","N/A","N/A","N/A","N/A","N/A","N/A"]
[null,"No","N/A","N/A","N/A","N/A","N/A","N/A","N/A","N/A","N/A","N/A","N/A","N/A","N/A","N/A","N/A",null,null,null,null,null,null,null,null,null,null,null,null,null,null,null,null,null,null,null,null,null,null,null,null,null,null,null,null,null,null,null,null,null,null,null,null,"No","N/A","N/A","N/A","N/A","N/A","N/A","N/A","N/A","N/A","N/A","N/A","N/A","N/A","N/A","N/A"]
["Improved Water source on premises","Yes","N/A","N/A","N/A","N/A","N/A","N/A","N/A","N/A","N/A","N/A","N/A","N/A","N/A","N/A","N/A",null,null,null,null,null,null,null,null,null,null,null,null,null,null,null,null,null,null,null,null,null,null,null,null,null,null,null,null,null,null,null,null,null,null,null,"Improved water source on premises","Yes","N/A","N/A","N/A","N/A","N/A","N/A","N/A","N/A","N/A","N/A","N/A","N/A","N/A","N/A","N/A"]
[null,"No","N/A","N/A","N/A","N/A","N/A","N/A","N/A","N/A","N/A","N/A","N/A","N/A","N/A","N/A","N/A",null,null,null,null,null,null,null,null,null,null,null,null,null,null,null,null,null,null,null,null,null,null,null,null,null,null,null,null,null,null,null,null,null,null,null,null,"No","N/A","N/A","N/A","N/A","N/A","N/A","N/A","N/A","N/A","N/A","N/A","N/A","N/A","N/A","N/A"]
["Piped water on premises available when needed","Yes","N/A","N/A","N/A","N/A","N/A","N/A","N/A","N/A","N/A","N/A","N/A","N/A","N/A","N/A","N/A",null,null,null,null,null,null,null,null,null,null,null,null,null,null,null,null,null,null,null,null,null,null,null,null,null,null,null,null,null,null,null,null,null,null,null,"Piped water on premises available when needed","Yes","N/A","N/A","N/A","N/A","N/A","N/A","N/A","N/A","N/A","N/A","N/A","N/A","N/A","N/A","N/A"]
[null,"No","N/A","N/A","N/A","N/A","N/A","N/A","N/A","N/A","N/A","N/A","N/A","N/A","N/A","N/A","N/A",null,null,null,null,null,null,null,null,null,null,null,null,null,null,null,null,null,null,null,null,null,null,null,null,null,null,null,null,null,null,null,null,null,null,null,null,"No","N/A","N/A","N/A","N/A","N/A","N/A","N/A","N/A","N/A","N/A","N/A","N/A","N/A","N/A","N/A"]
["Water point at more than 30 minutes","Yes","N/A","N/A","N/A","N/A","N/A","N/A","N/A","N/A","N/A","N/A","N/A","N/A","N/A","N/A","N/A",null,null,null,null,null,null,null,null,null,null,null,null,null,null,null,null,null,null,null,null,null,null,null,null,null,null,null,null,null,null,null,null,null,null,null,"Water point at more than 30 minutes","Yes","N/A","N/A","N/A","N/A","N/A","N/A","N/A","N/A","N/A","N/A","N/A","N/A","N/A","N/A","N/A"]
[null,"No","N/A","N/A","N/A","N/A","N/A","N/A","N/A","N/A","N/A","N/A","N/A","N/A","N/A","N/A","N/A",null,null,null,null,null,null,null,null,null,null,null,null,null,null,null,null,null,null,null,null,null,null,null,null,null,null,null,null,null,null,null,null,null,null,null,null,"No","N/A","N/A","N/A","N/A","N/A","N/A","N/A","N/A","N/A","N/A","N/A","N/A","N/A","N/A","N/A"]
["Water source available when needed","Yes","N/A","N/A","N/A","N/A","N/A","N/A","N/A","N/A","N/A","N/A","N/A","N/A","N/A","N/A","N/A",null,null,null,null,null,null,null,null,null,null,null,null,null,null,null,null,null,null,null,null,null,null,null,null,null,null,null,null,null,null,null,null,null,null,null,"Water source available when needed","Yes","N/A","N/A","N/A","N/A","N/A","N/A","N/A","N/A","N/A","N/A","N/A","N/A","N/A","N/A","N/A"]
[null,"No","N/A","N/A","N/A","N/A","N/A","N/A","N/A","N/A","N/A","N/A","N/A","N/A","N/A","N/A","N/A",null,null,null,null,null,null,null,null,null,null,null,null,null,null,null,null,null,null,null,null,null,null,null,null,null,null,null,null,null,null,null,null,null,null,null,null,"No","N/A","N/A","N/A","N/A","N/A","N/A","N/A","N/A","N/A","N/A","N/A","N/A","N/A","N/A","N/A"]
["Improved water source available when needed","Yes","N/A","N/A","N/A","N/A","N/A","N/A","N/A","N/A","N/A","N/A","N/A","N/A","N/A","N/A","N/A",null,null,null,null,null,null,null,null,null,null,null,null,null,null,null,null,null,null,null,null,null,null,null,null,null,null,null,null,null,null,null,null,null,null,null,"Improved water source available when needed","Yes","N/A","N/A","N/A","N/A","N/A","N/A","N/A","N/A","N/A","N/A","N/A","N/A","N/A","N/A","N/A"]
[null,"No","N/A","N/A","N/A","N/A","N/A","N/A","N/A","N/A","N/A","N/A","N/A","N/A","N/A","N/A","N/A",null,null,null,null,null,null,null,null,null,null,null,null,null,null,null,null,null,null,null,null,null,null,null,null,null,null,null,null,null,null,null,null,null,null,null,null,"No","N/A","N/A","N/A","N/A","N/A","N/A","N/A","N/A","N/A","N/A","N/A","N/A","N/A","N/A","N/A"]
["Microbiological quality at point of collection","Not contaminated (No E. coli in 100 mL)","N/A","N/A","N/A","N/A","N/A","N/A","N/A","N/A","N/A","N/A","N/A","N/A","N/A","N/A","N/A",null,null,null,null,null,null,null,null,null,null,null,null,null,null,null,null,null,null,null,null,null,null,null,null,null,null,null,null,null,null,null,null,null,null,null,"Microbiological quality at point of collection","Not contaminated (No E. coli in 100 mL)","N/A","N/A","N/A","N/A","N/A","N/A","N/A","N/A","N/A","N/A","N/A","N/A","N/A","N/A","N/A"]
[null,"Contaminated (E. coli detected in 100 mL)","N/A","N/A","N/A","N/A","N/A","N/A","N/A","N/A","N/A","N/A","N/A","N/A","N/A","N/A","N/A",null,null,null,null,null,null,null,null,null,null,null,null,null,null,null,null,null,null,null,null,null,null,null,null,null,null,null,null,null,null,null,null,null,null,null,null,"Contaminated (E. coli detected in 100 mL)","N/A","N/A","N/A","N/A","N/A","N/A","N/A","N/A","N/A","N/A","N/A","N/A","N/A","N/A","N/A"]
[null,"Highly contaminated (>100 CFU/100 mL)","N/A","N/A","N/A","N/A","N/A","N/A","N/A","N/A","N/A","N/A","N/A","N/A","N/A","N/A","N/A",null,null,null,null,null,null,null,null,null,null,null,null,null,null,null,null,null,null,null,null,null,null,null,null,null,null,null,null,null,null,null,null,null,null,null,null,"Highly contaminated (>100 CFU/100 mL)","N/A","N/A","N/A","N/A","N/A","N/A","N/A","N/A","N/A","N/A","N/A","N/A","N/A","N/A","N/A"]
["Microbiological quality of improved water sources at point of collection","Not contaminated (No E. coli in 100 mL)","N/A","N/A","N/A","N/A","N/A","N/A","N/A","N/A","N/A","N/A","N/A","N/A","N/A","N/A","N/A",null,null,null,null,null,null,null,null,null,null,null,null,null,null,null,null,null,null,null,null,null,null,null,null,null,null,null,null,null,null,null,null,null,null,null,"Microbiological quality of improved water sources at point of collection","Not contaminated (No E. coli in 100 mL)","N/A","N/A","N/A","N/A","N/A","N/A","N/A","N/A","N/A","N/A","N/A","N/A","N/A","N/A","N/A"]
[null,"Contaminated (E. coli detected in 100 mL)","N/A","N/A","N/A","N/A","N/A","N/A","N/A","N/A","N/A","N/A","N/A","N/A","N/A","N/A","N/A",null,null,null,null,null,null,null,null,null,null,null,null,null,null,null,null,null,null,null,null,null,null,null,null,null,null,null,null,null,null,null,null,null,null,null,null,"Contaminated (E. coli detected in 100 mL)","N/A","N/A","N/A","N/A","N/A","N/A","N/A","N/A","N/A","N/A","N/A","N/A","N/A","N/A","N/A"]
[null,"Highly contaminated (>100 CFU/100 mL)","N/A","N/A","N/A","N/A","N/A","N/A","N/A","N/A","N/A","N/A","N/A","N/A","N/A","N/A","N/A",null,null,null,null,null,null,null,null,null,null,null,null,null,null,null,null,null,null,null,null,null,null,null,null,null,null,null,null,null,null,null,null,null,null,null,null,"Highly contaminated (>100 CFU/100 mL)","N/A","N/A","N/A","N/A","N/A","N/A","N/A","N/A","N/A","N/A","N/A","N/A","N/A","N/A","N/A"]
["Microbiological quality of piped on premises at point of collection","Not contaminated (No E. coli in 100 mL)","N/A","N/A","N/A","N/A","N/A","N/A","N/A","N/A","N/A","N/A","N/A","N/A","N/A","N/A","N/A",null,null,null,null,null,null,null,null,null,null,null,null,null,null,null,null,null,null,null,null,null,null,null,null,null,null,null,null,null,null,null,null,null,null,null,"Microbiological quality of piped on premises at point of collection","Not contaminated (No E. coli in 100 mL)","N/A","N/A","N/A","N/A","N/A","N/A","N/A","N/A","N/A","N/A","N/A","N/A","N/A","N/A","N/A"]
[null,"Contaminated (E. coli detected in 100 mL)","N/A","N/A","N/A","N/A","N/A","N/A","N/A","N/A","N/A","N/A","N/A","N/A","N/A","N/A","N/A",null,null,null,null,null,null,null,null,null,null,null,null,null,null,null,null,null,null,null,null,null,null,null,null,null,null,null,null,null,null,null,null,null,null,null,null,"Contaminated (E. coli detected in 100 mL)","N/A","N/A","N/A","N/A","N/A","N/A","N/A","N/A","N/A","N/A","N/A","N/A","N/A","N/A","N/A"]
[null,"Highly contaminated (>100 CFU/100 mL)","N/A","N/A","N/A","N/A","N/A","N/A","N/A","N/A","N/A","N/A","N/A","N/A","N/A","N/A","N/A",null,null,null,null,null,null,null,null,null,null,null,null,null,null,null,null,null,null,null,null,null,null,null,null,null,null,null,null,null,null,null,null,null,null,null,null,"Highly contaminated (>100 CFU/100 mL)","N/A","N/A","N/A","N/A","N/A","N/A","N/A","N/A","N/A","N/A","N/A","N/A","N/A","N/A","N/A"]
[null,null,"NATIONAL wealth index quintile",null,null,null,null,"URBAN wealth index quintile",null,null,null,null,"RURAL wealth index quintile",null,null,null,null,null,null,null,null,null,null,null,null,null,null,null,null,null,null,null,null,null,null,null,null,null,null,null,null,null,null,null,null,null,null,null,null,null,null,null,"Raw numbers of respondents:","Use of drinking water sources","NATIONAL wealth index quintile",null,null,null,null,"URBAN wealth index quintile",null,null,null,null,"RURAL wealth index quintile"]
["Percentage based on weighted population",null,"Poorest","Poor","Middle","Rich","Richest","Poorest","Poor","Middle","Rich","Richest","Poorest","Poor","Middle","Rich","Richest",null,null,null,null,null,null,null,null,null,null,null,null,null,null,null,null,null,null,null,null,null,null,null,null,null,null,null,null,null,null,null,null,null,null,null,"Water data, raw numbers (weighted)",null,"Poorest","Poor","Middle","Rich","Richest","Poorest","Poor","Middle","Rich","Richest","Poorest","Poor","Middle","Rich","Richest"]
["Disponibilidad de agua","Agua entubada dentro de la vivienda",17.910066522075187,47.888067818690388,80.518702047231343,93.929019107036353,97.123813451183565,35.855519873692046,69.834534004395337,90.703316681665385,96.061823498184367,98.391887646960868,6.6897612341539983,11.007237018580657,22.934255104675284,45.059005407552334,74.27070560525587]
[null,"Agua entubada fuera de la vivienda, pero dentro del terreno",55.634331597370426,41.654028618860636,14.817808585990541,3.3329469670445611,0.78649146717926222,49.318599989378079,25.091599004379393,7.6555182193142706,1.6282142696091018,0.33573483073585958,54.464296751968888,59.572268327374047,56.805079686373908,40.095327075894261,12.071931277187444]
[null,"Agua entubada de llave pública (o hidrante)",0.84830683819865305,0.29905358727375092,0.19884508511717422,2.1829126293807913E-2,1.7779471440858202E-2,0.51763388183423709,4.8479286166133964E-2,0.23013648245315049,0,2.3027703246341329E-2,1.3783305303109259,0.89497151190176727,0.73465853616317411,0.13896328113550832,0.1174058465560492]
[null,"Agua entubada que acarrean de otra vivienda",3.6459746693889712,1.3556594664151222,0.37050268309264539,4.0978156534338922E-2,0.40896632684415613,3.6321684003529247,0.56733326518886673,0.17930698542278153,2.89207805016568E-2,0.32397176154508778,3.2012022705865268,2.7773890872286158,2.1660779454384169,0.48455346256481596,0.80512940246506237]
[null,"Agua de pipa",2.7729621462597023,2.512922552524933,0.65433269972773167,0.92663894275161507,0.69782073623431817,3.5102092797376936,1.8101305033258255,0.62385243779502209,0.9577287800051747,0.60398154416534222,0.56832932176698259,1.3548738568580247,2.7088174124477491,2.0038102775611097,1.128416041509652]
[null,"Agua de un pozo, río, lago, arroyo u otra",19.188358226706811,6.2902679562353141,3.4398088988409916,1.7485877003393209,0.96512854711787044,7.1658685750052884,2.6479239365447214,0.60786919334983869,1.3233126716996997,0.32139651334654312,33.698079891212515,24.393260198057064,14.651111314901621,12.218340495291777,11.606411827026147]
[]
[]
[]
[]
[]
[]
[]
[]
[]
[]
[]
[]
[]
[]
[]
[]
[]
[]
[]
[]
[]
[]
[]
[]
[]
[]
[]
[]
[]
[]
[]
[]
[]
[]
[]
[]
[]
[]
[]
[]
[]
[]
[]
[]
[{"$f":"A1026","v":"Mexico"}]
[{"$f":"A1034","v":"2012"}]
["Use of sanitation facilities"]
[" by wealth quintile and sub-national region"]
["Notes:"]
["WHO/UNICEF JMP customised wealth index excludes water,"]
[" sanitation and hygiene assets."]
["Survey used for analysis:",{"$f":"A1025","v":"ENG12"}]
[{"$f":"B1030","v":"Ratio of Improved latrines based on:"},"MICS15"]
[{"$f":"B1029","v":"Ratio of Shared improved based on:"},"MICS15"]
[]
[]
["Use of sanitation facilities",null,"NATIONAL wealth index quintile",null,null,null,null,"URBAN wealth index quintile",null,null,null,null,"RURAL wealth index quintile",null,null,null,null,null,null,null,null,null,null,null,null,null,null,null,null,null,null,null,null,null,null,null,null,null,null,null,null,null,null,null,null,null,null,null,null,null,null,null,null,"Use of sanitation facilities","NATIONAL wealth index quintile",null,null,null,null,"URBAN wealth index quintile",null,null,null,null,"RURAL wealth index quintile"]
["Weighted percentage (used in graphs)",null,"Poorest","Poor","Middle","Rich","Richest","Poorest","Poor","Middle","Rich","Richest","Poorest","Poor","Middle","Rich","Richest",null,null,null,null,null,null,null,null,null,null,null,null,null,null,null,null,null,null,null,null,null,null,null,null,null,null,null,null,null,null,null,null,null,null,null,null,null,"Poorest","Poor","Middle","Rich","Richest","Poorest","Poor","Middle","Rich","Richest","Poorest","Poor","Middle","Rich","Richest"]
["Sanitation","Improved",{"$f":"C153+C154+C155+C156*MICS15!C130/100","v":83.695670795688059},{"$f":"D153+D154+D155+D156*MICS15!D130/100","v":96.196551972425993},{"$f":"E153+E154+E155+E156*MICS15!E130/100","v":98.999899192148732},{"$f":"F153+F154+F155+F156*MICS15!F130/100","v":99.214005204048476},{"$f":"G153+G154+G155+G156*MICS15!G130/100","v":99.60100102309147},{"$f":"H153+H154+H155+H156*MICS15!H130/100","v":92.528673772885341},{"$f":"I153+I154+I155+I156*MICS15!I130/100","v":98.728862091046324},{"$f":"J153+J154+J155+J156*MICS15!J130/100","v":98.997675452522046},{"$f":"K153+K154+K155+K156*MICS15!K130/100","v":99.636185287660808},{"$f":"L153+L154+L155+L156*MICS15!L130/100","v":99.561875516157244},{"$f":"M153+M154+M155+M156*MICS15!M130/100","v":71.25723043216081},{"$f":"N153+N154+N155+N156*MICS15!N130/100","v":83.060713906741285},{"$f":"O153+O154+O155+O156*MICS15!O130/100","v":89.435953637555684},{"$f":"P153+P154+P155+P156*MICS15!P130/100","v":96.70298506592745},{"$f":"Q153+Q154+Q155+Q156*MICS15!Q130/100","v":98.306422346910068},null,null,null,null,null,null,null,null,null,null,null,null,null,null,null,null,null,null,null,null,null,null,null,null,null,null,null,null,null,null,null,null,null,null,null,null,"Improved","N/A","N/A","N/A","N/A","N/A","N/A","N/A","N/A","N/A","N/A","N/A","N/A","N/A","N/A","N/A"]
[null,"Not Improved",{"$f":"100-C122","v":16.304329204311941},{"$f":"100-D122","v":3.8034480275740066},1.0001008078512683,0.78599479595152388,0.39899897690852981,7.471326227114659,1.2711379089536763,1.0023245474779543,0.36381471233919171,0.43812448384275626,28.74276956783919,16.939286093258715,10.564046362444316,3.2970149340725499,1.6935776530899318,null,null,null,null,null,null,null,null,null,null,null,null,null,null,null,null,null,null,null,null,null,null,null,null,null,null,null,null,null,null,null,null,null,null,null,null,"Not Improved","N/A","N/A","N/A","N/A","N/A","N/A","N/A","N/A","N/A","N/A","N/A","N/A","N/A","N/A","N/A"]
["Sanitation ladder","Basic",{"$f":"C122*MICS15!C129/100","v":73.592109889988592},{"$f":"D122*MICS15!D129/100","v":89.793640775808939},{"$f":"E122*MICS15!E129/100","v":96.260939957798868},{"$f":"F122*MICS15!F129/100","v":97.636928828978512},{"$f":"G122*MICS15!G129/100","v":99.281237932471043},{"$f":"H122*MICS15!H129/100","v":80.653556873231494},{"$f":"I122*MICS15!I129/100","v":94.856661479777046},{"$f":"J122*MICS15!J129/100","v":96.417331212064397},{"$f":"K122*MICS15!K129/100","v":98.228743355852259},{"$f":"L122*MICS15!L129/100","v":99.368251660993266},{"$f":"M122*MICS15!M129/100","v":64.331959773825474},{"$f":"N122*MICS15!N129/100","v":75.559493899655806},{"$f":"O122*MICS15!O129/100","v":82.894392547230424},{"$f":"P122*MICS15!P129/100","v":93.254109772398721},{"$f":"Q122*MICS15!Q129/100","v":97.23123933725428},null,null,null,null,null,null,null,null,null,null,null,null,null,null,null,null,null,null,null,null,null,null,null,null,null,null,null,null,null,null,null,null,null,null,null,null,"Basic","N/A","N/A","N/A","N/A","N/A","N/A","N/A","N/A","N/A","N/A","N/A","N/A","N/A","N/A","N/A"]
[null,"Limited",{"$f":"C122*MICS15!C128/100","v":10.10356090569948},{"$f":"D122*MICS15!D128/100","v":6.4029111966171186},{"$f":"E122*MICS15!E128/100","v":2.7389592343498892},{"$f":"F122*MICS15!F128/100","v":1.5770763750699175},{"$f":"G122*MICS15!G128/100","v":0.31976309062044139},{"$f":"H122*MICS15!H128/100","v":11.875116899653928},{"$f":"I122*MICS15!I128/100","v":3.8722006112693412},{"$f":"J122*MICS15!J128/100","v":2.5803442404576411},{"$f":"K122*MICS15!K128/100","v":1.4074419318085705},{"$f":"L122*MICS15!L128/100","v":0.19362385516398234},{"$f":"M122*MICS15!M128/100","v":6.9252706583353634},{"$f":"N122*MICS15!N128/100","v":7.5012200070855002},{"$f":"O122*MICS15!O128/100","v":6.5415610903253034},{"$f":"P122*MICS15!P128/100","v":3.4488752935287557},{"$f":"Q122*MICS15!Q128/100","v":1.0751830096557784},null,null,null,null,null,null,null,null,null,null,null,null,null,null,null,null,null,null,null,null,null,null,null,null,null,null,null,null,null,null,null,null,null,null,null,null,"Limited","N/A","N/A","N/A","N/A","N/A","N/A","N/A","N/A","N/A","N/A","N/A","N/A","N/A","N/A","N/A"]
[null,"Unimproved",{"$f":"100-(C124+C125+C127)","v":4.0611905749592694},{"$f":"100-(D124+D125+D127)","v":0.85542658041126174},0.66237009181452322,0.68776159379498836,0.37135484923531692,0.60403782660593208,0.32450786688136191,0.84768457269980502,0.29448185703772367,0.40232022663073508,10.840986365861966,3.5573003792494831,3.30377117900521,1.2153527346320629,1.520325000921261,null,null,null,null,null,null,null,null,null,null,null,null,null,null,null,null,null,null,null,null,null,null,null,null,null,null,null,null,null,null,null,null,null,null,null,null,"Unimproved","N/A","N/A","N/A","N/A","N/A","N/A","N/A","N/A","N/A","N/A","N/A","N/A","N/A","N/A","N/A"]
[null,"Open defecation",{"$f":"C157","v":12.243138629352654},{"$f":"D157","v":2.9480214471626827},0.33773071603671834,9.8233202156572927E-2,2.764412767319583E-2,6.8672884005086434,0.94663004207226253,0.15463997477816296,6.9332855301443938E-2,3.580425721202421E-2,17.901783201977192,13.381985714009199,7.2602751834390684,2.0816621994404523,0.17325265216868102,null,null,null,null,null,null,null,null,null,null,null,null,null,null,null,null,null,null,null,null,null,null,null,null,null,null,null,null,null,null,null,null,null,null,null,null,"Open defecation","N/A","N/A","N/A","N/A","N/A","N/A","N/A","N/A","N/A","N/A","N/A","N/A","N/A","N/A","N/A"]
["Shared among Improved Sanitation","Yes","N/A","N/A","N/A","N/A","N/A","N/A","N/A","N/A","N/A","N/A","N/A","N/A","N/A","N/A","N/A",null,null,null,null,null,null,null,null,null,null,null,null,null,null,null,null,null,null,null,null,null,null,null,null,null,null,null,null,null,null,null,null,null,null,null,null,"Yes","N/A","N/A","N/A","N/A","N/A","N/A","N/A","N/A","N/A","N/A","N/A","N/A","N/A","N/A","N/A"]
[null,"No","N/A","N/A","N/A","N/A","N/A","N/A","N/A","N/A","N/A","N/A","N/A","N/A","N/A","N/A","N/A",null,null,null,null,null,null,null,null,null,null,null,null,null,null,null,null,null,null,null,null,null,null,null,null,null,null,null,null,null,null,null,null,null,null,null,null,"No","N/A","N/A","N/A","N/A","N/A","N/A","N/A","N/A","N/A","N/A","N/A","N/A","N/A","N/A","N/A"]
["Manually calculated ratios","Improved latrines"]
[null,"Other"]
[null,"Other"]
[null,null,"NATIONAL wealth index quintile",null,null,null,null,"URBAN wealth index quintile",null,null,null,null,"RURAL wealth index quintile",null,null,null,null,null,null,null,null,null,null,null,null,null,null,null,null,null,null,null,null,null,null,null,null,null,null,null,null,null,null,null,null,null,null,null,null,null,null,null,null,"Use of sanitation facilities","NATIONAL wealth index quintile",null,null,null,null,"URBAN wealth index quintile",null,null,null,null,"RURAL wealth index quintile"]
["Percentage based on weighted population",null,"Poorest","Poor","Middle","Rich","Richest","Poorest","Poor","Middle","Rich","Richest","Poorest","Poor","Middle","Rich","Richest",null,null,null,null,null,null,null,null,null,null,null,null,null,null,null,null,null,null,null,null,null,null,null,null,null,null,null,null,null,null,null,null,null,null,null,null,null,"Poorest","Poor","Middle","Rich","Richest","Poorest","Poor","Middle","Rich","Richest","Poorest","Poor","Middle","Rich","Richest"]
["Sanitation type","Sewer connection",32.559469655284175,70.076133334569263,85.002095141335815,91.130303197388713,95.305231791200171,70.462023748382691,87.562317309878551,91.695667684609617,94.107510964447243,96.245443195230592,4.7915722972206192,9.8177333226405157,27.171077564252062,47.061025349309176,66.258047735431674,null,null,null,null,null,null,null,null,null,null,null,null,null,null,null,null,null,null,null,null,null,null,null,null,null,null,null,null,null,null,null,null,null,null,null,null,"Sewer connection","N/A","N/A","N/A","N/A","N/A","N/A","N/A","N/A","N/A","N/A","N/A","N/A","N/A","N/A","N/A"]
[null,"Septic tank connection",32.666439332783241,21.605253451728288,12.966128356130413,7.9920891075604672,4.1992691345895929,15.024724111284804,9.5261630568163014,7.0761464558865255,5.4175006552102962,3.2737995023623707,39.266017128112132,46.427091946362687,47.85719836461837,44.856826661163915,30.816049199908147,null,null,null,null,null,null,null,null,null,null,null,null,null,null,null,null,null,null,null,null,null,null,null,null,null,null,null,null,null,null,null,null,null,null,null,null,"Septic tank connection","N/A","N/A","N/A","N/A","N/A","N/A","N/A","N/A","N/A","N/A","N/A","N/A","N/A","N/A","N/A"]
[null,"Improved latrines","N/A","N/A","N/A","N/A","N/A","N/A","N/A","N/A","N/A","N/A","N/A","N/A","N/A","N/A","N/A",null,null,null,null,null,null,null,null,null,null,null,null,null,null,null,null,null,null,null,null,null,null,null,null,null,null,null,null,null,null,null,null,null,null,null,null,"Improved latrines","N/A","N/A","N/A","N/A","N/A","N/A","N/A","N/A","N/A","N/A","N/A","N/A","N/A","N/A","N/A"]
[null,"Unimproved facilities","N/A","N/A","N/A","N/A","N/A","N/A","N/A","N/A","N/A","N/A","N/A","N/A","N/A","N/A","N/A",null,null,null,null,null,null,null,null,null,null,null,null,null,null,null,null,null,null,null,null,null,null,null,null,null,null,null,null,null,null,null,null,null,null,null,null,"Unimproved facilities","N/A","N/A","N/A","N/A","N/A","N/A","N/A","N/A","N/A","N/A","N/A","N/A","N/A","N/A","N/A"]
[null,"Open defecation",12.243138629352654,2.9480214471626827,0.33773071603671834,9.8233202156572927E-2,2.764412767319583E-2,6.8672884005086434,0.94663004207226253,0.15463997477816296,6.9332855301443938E-2,3.580425721202421E-2,17.901783201977192,13.381985714009199,7.2602751834390684,2.0816621994404523,0.17325265216868102,null,null,null,null,null,null,null,null,null,null,null,null,null,null,null,null,null,null,null,null,null,null,null,null,null,null,null,null,null,null,null,null,null,null,null,null,"Open defecation","N/A","N/A","N/A","N/A","N/A","N/A","N/A","N/A","N/A","N/A","N/A","N/A","N/A","N/A","N/A"]
["Septic tank emptying practices","Not emptied/treated and disposed in situ","N/A","N/A","N/A","N/A","N/A","N/A","N/A","N/A","N/A","N/A","N/A","N/A","N/A","N/A","N/A",null,null,null,null,null,null,null,null,null,null,null,null,null,null,null,null,null,null,null,null,null,null,null,null,null,null,null,null,null,null,null,null,null,null,null,null,"Not emptied/treated and disposed in situ","N/A","N/A","N/A","N/A","N/A","N/A","N/A","N/A","N/A","N/A","N/A","N/A","N/A","N/A","N/A"]
[null,"Emptied and buried on site","N/A","N/A","N/A","N/A","N/A","N/A","N/A","N/A","N/A","N/A","N/A","N/A","N/A","N/A","N/A",null,null,null,null,null,null,null,null,null,null,null,null,null,null,null,null,null,null,null,null,null,null,null,null,null,null,null,null,null,null,null,null,null,null,null,null,"Emptied and buried on site","N/A","N/A","N/A","N/A","N/A","N/A","N/A","N/A","N/A","N/A","N/A","N/A","N/A","N/A","N/A"]
[null,"Emptied and discharged locally","N/A","N/A","N/A","N/A","N/A","N/A","N/A","N/A","N/A","N/A","N/A","N/A","N/A","N/A","N/A",null,null,null,null,null,null,null,null,null,null,null,null,null,null,null,null,null,null,null,null,null,null,null,null,null,null,null,null,null,null,null,null,null,null,null,null,"Emptied and discharged locally","N/A","N/A","N/A","N/A","N/A","N/A","N/A","N/A","N/A","N/A","N/A","N/A","N/A","N/A","N/A"]
[null,"Emptied and removed offsite","N/A","N/A","N/A","N/A","N/A","N/A","N/A","N/A","N/A","N/A","N/A","N/A","N/A","N/A","N/A",null,null,null,null,null,null,null,null,null,null,null,null,null,null,null,null,null,null,null,null,null,null,null,null,null,null,null,null,null,null,null,null,null,null,null,null,"Emptied and removed offsite","N/A","N/A","N/A","N/A","N/A","N/A","N/A","N/A","N/A","N/A","N/A","N/A","N/A","N/A","N/A"]
["Latrine emptying practices","Not emptied/treated and disposed in situ","N/A","N/A","N/A","N/A","N/A","N/A","N/A","N/A","N/A","N/A","N/A","N/A","N/A","N/A","N/A",null,null,null,null,null,null,null,null,null,null,null,null,null,null,null,null,null,null,null,null,null,null,null,null,null,null,null,null,null,null,null,null,null,null,null,null,"Not emptied/treated and disposed in situ","N/A","N/A","N/A","N/A","N/A","N/A","N/A","N/A","N/A","N/A","N/A","N/A","N/A","N/A","N/A"]
[null,"Emptied and buried on site","N/A","N/A","N/A","N/A","N/A","N/A","N/A","N/A","N/A","N/A","N/A","N/A","N/A","N/A","N/A",null,null,null,null,null,null,null,null,null,null,null,null,null,null,null,null,null,null,null,null,null,null,null,null,null,null,null,null,null,null,null,null,null,null,null,null,"Emptied and buried on site","N/A","N/A","N/A","N/A","N/A","N/A","N/A","N/A","N/A","N/A","N/A","N/A","N/A","N/A","N/A"]
[null,"Emptied and discharged locally","N/A","N/A","N/A","N/A","N/A","N/A","N/A","N/A","N/A","N/A","N/A","N/A","N/A","N/A","N/A",null,null,null,null,null,null,null,null,null,null,null,null,null,null,null,null,null,null,null,null,null,null,null,null,null,null,null,null,null,null,null,null,null,null,null,null,"Emptied and discharged locally","N/A","N/A","N/A","N/A","N/A","N/A","N/A","N/A","N/A","N/A","N/A","N/A","N/A","N/A","N/A"]
[null,"Emptied and removed offsite","N/A","N/A","N/A","N/A","N/A","N/A","N/A","N/A","N/A","N/A","N/A","N/A","N/A","N/A","N/A",null,null,null,null,null,null,null,null,null,null,null,null,null,null,null,null,null,null,null,null,null,null,null,null,null,null,null,null,null,null,null,null,null,null,null,null,"Emptied and removed offsite","N/A","N/A","N/A","N/A","N/A","N/A","N/A","N/A","N/A","N/A","N/A","N/A","N/A","N/A","N/A"]
["Shared among improved sanitation facilities","Yes","N/A","N/A","N/A","N/A","N/A","N/A","N/A","N/A","N/A","N/A","N/A","N/A","N/A","N/A","N/A",null,null,null,null,null,null,null,null,null,null,null,null,null,null,null,null,null,null,null,null,null,null,null,null,null,null,null,null,null,null,null,null,null,null,null,null,"Yes","N/A","N/A","N/A","N/A","N/A","N/A","N/A","N/A","N/A","N/A","N/A","N/A","N/A","N/A","N/A"]
[null,"No","N/A","N/A","N/A","N/A","N/A","N/A","N/A","N/A","N/A","N/A","N/A","N/A","N/A","N/A","N/A",null,null,null,null,null,null,null,null,null,null,null,null,null,null,null,null,null,null,null,null,null,null,null,null,null,null,null,null,null,null,null,null,null,null,null,null,"No","N/A","N/A","N/A","N/A","N/A","N/A","N/A","N/A","N/A","N/A","N/A","N/A","N/A","N/A","N/A"]
[null,"DK/missing","N/A","N/A","N/A","N/A","N/A","N/A","N/A","N/A","N/A","N/A","N/A","N/A","N/A","N/A","N/A",null,null,null,null,null,null,null,null,null,null,null,null,null,null,null,null,null,null,null,null,null,null,null,null,null,null,null,null,null,null,null,null,null,null,null,null,"DK/missing","N/A","N/A","N/A","N/A","N/A","N/A","N/A","N/A","N/A","N/A","N/A","N/A","N/A","N/A","N/A"]
["Shared among all sanitation facilities","Yes",16.307327706840084,11.851328354262822,5.6056122531662087,2.5441349895753769,1.6392688862991298,17.411309449238654,8.5218467618797096,4.423397158015006,2.0306733873618406,1.3309605232606905,14.772849349389613,12.963925479904576,13.446816824991972,7.6614540391925265,2.6944285341539191,null,null,null,null,null,null,null,null,null,null,null,null,null,null,null,null,null,null,null,null,null,null,null,null,null,null,null,null,null,null,null,null,null,null,null,null,"Yes","N/A","N/A","N/A","N/A","N/A","N/A","N/A","N/A","N/A","N/A","N/A","N/A","N/A","N/A","N/A"]
[null,"No",83.692672293160058,88.148671645737252,94.3943877468339,97.455865010424617,98.36073111370095,82.588690550761726,91.4781532381201,95.57660284198522,97.96932661263827,98.669039476739385,85.227150650610383,87.036074520095625,86.553183175008058,92.338545960807465,97.305571465846072,null,null,null,null,null,null,null,null,null,null,null,null,null,null,null,null,null,null,null,null,null,null,null,null,null,null,null,null,null,null,null,null,null,null,null,null,"No","N/A","N/A","N/A","N/A","N/A","N/A","N/A","N/A","N/A","N/A","N/A","N/A","N/A","N/A","N/A"]
["sanit","Sewage",32.559469655284175,70.076133334569263,85.002095141335815,91.130303197388713,95.305231791200171,70.462023748382691,87.562317309878551,91.695667684609617,94.107510964447243,96.245443195230592,4.7915722972206192,9.8177333226405157,27.171077564252062,47.061025349309176,66.258047735431674,null,null,null,null,null,null,null,null,null,null,null,null,null,null,null,null,null,null,null,null,null,null,null,null,null,null,null,null,null,null,null,null,null,null,null,null,"Yes","N/A","N/A","N/A","N/A","N/A","N/A","N/A","N/A","N/A","N/A","N/A","N/A","N/A","N/A","N/A"]
[null,"Septic tank",32.666439332783241,21.605253451728288,12.966128356130413,7.9920891075604672,4.1992691345895929,15.024724111284804,9.5261630568163014,7.0761464558865255,5.4175006552102962,3.2737995023623707,39.266017128112132,46.427091946362687,47.85719836461837,44.856826661163915,30.816049199908147,null,null,null,null,null,null,null,null,null,null,null,null,null,null,null,null,null,null,null,null,null,null,null,null,null,null,null,null,null,null,null,null,null,null,null,null,"No","N/A","N/A","N/A","N/A","N/A","N/A","N/A","N/A","N/A","N/A","N/A","N/A","N/A","N/A","N/A"]
[null,"Pour Flush",1.8948572530046652,0.99002515276632597,0.36090182129673043,8.8383422393892852E-3,1.118593008400314E-2,1.6965386800330478,0.30345965461204422,0.14158652853214895,0,1.4487847929877085E-2,1.0071691564824528,2.2672304369588518,2.6045896316560806,0.73073386418327924,0.33426744094260458]
[null,"Dry latrine",20.585675538782986,4.1314357541491358,0.69947426842993077,8.3065906976085471E-2,8.9427577131820229E-2,5.8233227770753659,1.4068052978599714,8.4274783493750796E-2,0.11117366800328127,2.814497063441718E-2,36.954192494296244,28.054780478946679,15.013146327333448,4.7977308139678643,0.91575081417839876]
[null,"No facility",12.243138629352654,2.9480214471626827,0.33773071603671834,9.8233202156572927E-2,2.764412767319583E-2,6.8672884005086434,0.94663004207226253,0.15463997477816296,6.9332855301443938E-2,3.580425721202421E-2,17.901783201977192,13.381985714009199,7.2602751834390684,2.0816621994404523,0.17325265216868102]
[null,"missing",5.0419590792174465E-2,0.24913085962408338,0.63366969677043561,0.68747024367877396,0.36724143932133402,0.12610228271547871,0.25462463876067376,0.84768457270005515,0.2944818570378081,0.40232022663070355,7.9265721911270612E-2,5.1178101082280499E-2,9.3712928701200474E-2,0.47202111193511609,1.5026321573707924]
[]
[]
[]
["Mexico\nENG12\nWeighted population",null,"COMPOSITE wealth index quintile",null,null,null,null,"URBAN wealth index quintile",null,null,null,null,"RURAL wealth index quintile"]
[null,null,"Poorest","Poor","Middle","Rich","Richest","Poorest","Poor","Middle","Rich","Richest","Poorest","Poor","Middle","Rich","Richest"]
["sanit","Sewage",76213.800000000236,164021.40999999922,198940.16999999876,213536.48999999918,222885.78999999914,126700.82999999974,157535.01999999941,164938.37999999968,168621.00999999928,173785.69999999949,2596.9100000000003,5325.3299999999981,14755.020000000002,25497.559999999976,35841.900000000052]
[null,"Septic tank",76464.189999999988,50569.629999999852,30346.119999999944,18727.059999999976,9820.6299999999992,27016.61,17138.699999999953,12728.279999999997,9707.029999999997,5911.3400000000011,21281.18000000004,25182.960000000032,25988.440000000024,24303.329999999987,16669.759999999998]
[null,"Pour Flush",4435.3999999999996,2317.2700000000009,844.66000000000008,20.71,26.16,3050.6199999999994,545.95999999999992,254.68000000000004,0,26.16,545.86,1229.7899999999997,1414.3999999999999,395.90999999999997,180.82000000000002]
[null,"Dry latrine",48186.060000000034,9670.1099999999969,1637.06,194.64,209.14000000000004,10471.17,2531.0099999999998,151.58999999999997,199.20000000000002,50.82,20028.229999999992,15217.459999999994,8152.7599999999993,2599.4000000000015,495.37000000000012]
[null,"No facility",28658.209999999959,6900.1899999999978,790.42999999999984,230.18,64.649999999999991,12348.369999999994,1703.1,278.15999999999997,124.23,64.649999999999991,9702.3100000000031,7258.6500000000005,3942.6300000000019,1127.8399999999997,93.72]
[null,"missing",118.02000000000001,583.12,1483.0500000000004,1610.8799999999999,858.85000000000014,226.75,458.09999999999991,1524.7800000000002,527.65000000000009,726.44999999999982,42.96,27.76,50.89,255.73999999999998,812.83999999999992]
[null,"Total",234075.68000000046,234061.72999999957,234041.48999999859,234319.95999999915,233865.21999999887,179814.34999999969,179911.88999999969,179875.86999999921,179179.11999999915,180565.1199999995,54197.450000000084,54241.94999999991,54304.139999999905,54179.780000000072,54094.409999999887]
[]
[]
[]
[]
[]
[]
[]
[]
[]
[]
[]
[]
[]
[]
[]
[]
[]
[]
[]
[]
[]
[]
[]
[]
[]
[]
[]
[]
[]
[]
[]
[]
[]
[]
[]
[]
[]
[{"$f":"A1026","v":"Mexico"}]
[{"$f":"A1034","v":"2012"}]
["Access to hygiene facilities "]
[" by wealth quintile and sub-national region"]
["Notes:"]
["WHO/UNICEF JMP customised wealth index excludes water,"]
[" sanitation and hygiene assets."]
["Survey used for analysis:",{"$f":"A1025","v":"ENG12"}]
[]
[]
[]
[]
["Access to handwashing",null,"NATIONAL wealth index quintile",null,null,null,null,"URBAN wealth index quintile",null,null,null,null,"RURAL wealth index quintile",null,null,null,null,null,null,null,null,null,null,null,null,null,null,null,null,null,null,null,null,null,null,null,null,null,null,null,null,null,null,null,null,null,null,null,null,null,null,null,"Raw numbers of respondents:","Access to handwashing","NATIONAL wealth index quintile",null,null,null,null,"URBAN wealth index quintile",null,null,null,null,"RURAL wealth index quintile"]
["Weighted percentage (used in graphs)",null,"Poorest","Poor","Middle","Rich","Richest","Poorest","Poor","Middle","Rich","Richest","Poorest","Poor","Middle","Rich","Richest",null,null,null,null,null,null,null,null,null,null,null,null,null,null,null,null,null,null,null,null,null,null,null,null,null,null,null,null,null,null,null,null,null,null,null,"Hygiene data, raw numbers (weighted)",null,"Poorest","Poor","Middle","Rich","Richest","Poorest","Poor","Middle","Rich","Richest","Poorest","Poor","Middle","Rich","Richest"]
["Hygiene ladder","Basic","N/A","N/A","N/A","N/A","N/A","N/A","N/A","N/A","N/A","N/A","N/A","N/A","N/A","N/A","N/A",null,null,null,null,null,null,null,null,null,null,null,null,null,null,null,null,null,null,null,null,null,null,null,null,null,null,null,null,null,null,null,null,null,null,null,"Hygiene ladder","Basic","N/A","N/A","N/A","N/A","N/A","N/A","N/A","N/A","N/A","N/A","N/A","N/A","N/A","N/A","N/A"]
[null,"Limited","N/A","N/A","N/A","N/A","N/A","N/A","N/A","N/A","N/A","N/A","N/A","N/A","N/A","N/A","N/A",null,null,null,null,null,null,null,null,null,null,null,null,null,null,null,null,null,null,null,null,null,null,null,null,null,null,null,null,null,null,null,null,null,null,null,null,"Limited","N/A","N/A","N/A","N/A","N/A","N/A","N/A","N/A","N/A","N/A","N/A","N/A","N/A","N/A","N/A"]
[null,"No facility","N/A","N/A","N/A","N/A","N/A","N/A","N/A","N/A","N/A","N/A","N/A","N/A","N/A","N/A","N/A",null,null,null,null,null,null,null,null,null,null,null,null,null,null,null,null,null,null,null,null,null,null,null,null,null,null,null,null,null,null,null,null,null,null,null,null,"No facility","N/A","N/A","N/A","N/A","N/A","N/A","N/A","N/A","N/A","N/A","N/A","N/A","N/A","N/A","N/A"]
[null,null,null,null,null,null,null,null,null,null,null,null,null,null,null,null,null,null,null,null,null,null,null,null,null,null,null,null,null,null,null,null,null,null,null,null,null,null,null,null,null,null,null,null,null,null,null,null,null,null,null,null,"Observed handwashing place","Fixed","N/A","N/A","N/A","N/A","N/A","N/A","N/A","N/A","N/A","N/A","N/A","N/A","N/A","N/A","N/A"]
[null,null,null,null,null,null,null,null,null,null,null,null,null,null,null,null,null,null,null,null,null,null,null,null,null,null,null,null,null,null,null,null,null,null,null,null,null,null,null,null,null,null,null,null,null,null,null,null,null,null,null,null,null,"Mobile","N/A","N/A","N/A","N/A","N/A","N/A","N/A","N/A","N/A","N/A","N/A","N/A","N/A","N/A","N/A"]
[null,null,null,null,null,null,null,null,null,null,null,null,null,null,null,null,null,null,null,null,null,null,null,null,null,null,null,null,null,null,null,null,null,null,null,null,null,null,null,null,null,null,null,null,null,null,null,null,null,null,null,null,"Water / Soap","Water and soap","N/A","N/A","N/A","N/A","N/A","N/A","N/A","N/A","N/A","N/A","N/A","N/A","N/A","N/A","N/A"]
[null,null,null,null,null,null,null,null,null,null,null,null,null,null,null,null,null,null,null,null,null,null,null,null,null,null,null,null,null,null,null,null,null,null,null,null,null,null,null,null,null,null,null,null,null,null,null,null,null,null,null,null,null,"Water only","N/A","N/A","N/A","N/A","N/A","N/A","N/A","N/A","N/A","N/A","N/A","N/A","N/A","N/A","N/A"]
[null,null,null,null,null,null,null,null,null,null,null,null,null,null,null,null,null,null,null,null,null,null,null,null,null,null,null,null,null,null,null,null,null,null,null,null,null,null,null,null,null,null,null,null,null,null,null,null,null,null,null,null,null,"Soap only","N/A","N/A","N/A","N/A","N/A","N/A","N/A","N/A","N/A","N/A","N/A","N/A","N/A","N/A","N/A"]
[null,null,null,null,null,null,null,null,null,null,null,null,null,null,null,null,null,null,null,null,null,null,null,null,null,null,null,null,null,null,null,null,null,null,null,null,null,null,null,null,null,null,null,null,null,null,null,null,null,null,null,null,null,"Neither","N/A","N/A","N/A","N/A","N/A","N/A","N/A","N/A","N/A","N/A","N/A","N/A","N/A","N/A","N/A"]
[]
[]
[]
[]
[]
[]
[]
[]
[]
[]
[]
[]
[]
[]
[]
[]
[]
[]
[]
[]
[]
[]
[]
[]
[]
[]
[]
[]
[null,null,null,null,null,null,null,null,null,null,null,null,null,null,null,null,null,null,null,null,null,null,null,null,null,null,null,null,null,null,null,null,null,null,null,null,null,null,null,null,null,null,null,null,null,null,null,null,null,null,null,null,"Raw numbers of respondents:","Menstrual health and hygiene","NATIONAL wealth index quintile",null,null,null,null,"URBAN wealth index quintile",null,null,null,null,"RURAL wealth index quintile"]
[null,null,null,null,null,null,null,null,null,null,null,null,null,null,null,null,null,null,null,null,null,null,null,null,null,null,null,null,null,null,null,null,null,null,null,null,null,null,null,null,null,null,null,null,null,null,null,null,null,null,null,null,"MHH data, raw numbers (weighted)",null,"Poorest","Poor","Middle","Rich","Richest","Poorest","Poor","Middle","Rich","Richest","Poorest","Poor","Middle","Rich","Richest"]
[null,null,null,null,null,null,null,null,null,null,null,null,null,null,null,null,null,null,null,null,null,null,null,null,null,null,null,null,null,null,null,null,null,null,null,null,null,null,null,null,null,null,null,null,null,null,null,null,null,null,null,null,"Private place to wash and change","Yes","N/A","N/A","N/A","N/A","N/A","N/A","N/A","N/A","N/A","N/A","N/A","N/A","N/A","N/A","N/A"]
[null,null,null,null,null,null,null,null,null,null,null,null,null,null,null,null,null,null,null,null,null,null,null,null,null,null,null,null,null,null,null,null,null,null,null,null,null,null,null,null,null,null,null,null,null,null,null,null,null,null,null,null,null,"No","N/A","N/A","N/A","N/A","N/A","N/A","N/A","N/A","N/A","N/A","N/A","N/A","N/A","N/A","N/A"]
[null,null,null,null,null,null,null,null,null,null,null,null,null,null,null,null,null,null,null,null,null,null,null,null,null,null,null,null,null,null,null,null,null,null,null,null,null,null,null,null,null,null,null,null,null,null,null,null,null,null,null,null,null,"DK/not sure/missing","N/A","N/A","N/A","N/A","N/A","N/A","N/A","N/A","N/A","N/A","N/A","N/A","N/A","N/A","N/A"]
[null,null,null,null,null,null,null,null,null,null,null,null,null,null,null,null,null,null,null,null,null,null,null,null,null,null,null,null,null,null,null,null,null,null,null,null,null,null,null,null,null,null,null,null,null,null,null,null,null,null,null,null,"Use of menstrual materials","Materials reusable","N/A","N/A","N/A","N/A","N/A","N/A","N/A","N/A","N/A","N/A","N/A","N/A","N/A","N/A","N/A"]
[null,null,null,null,null,null,null,null,null,null,null,null,null,null,null,null,null,null,null,null,null,null,null,null,null,null,null,null,null,null,null,null,null,null,null,null,null,null,null,null,null,null,null,null,null,null,null,null,null,null,null,null,null,"Materials not reusable","N/A","N/A","N/A","N/A","N/A","N/A","N/A","N/A","N/A","N/A","N/A","N/A","N/A","N/A","N/A"]
[null,null,null,null,null,null,null,null,null,null,null,null,null,null,null,null,null,null,null,null,null,null,null,null,null,null,null,null,null,null,null,null,null,null,null,null,null,null,null,null,null,null,null,null,null,null,null,null,null,null,null,null,null,"No materials used","N/A","N/A","N/A","N/A","N/A","N/A","N/A","N/A","N/A","N/A","N/A","N/A","N/A","N/A","N/A"]
[null,null,null,null,null,null,null,null,null,null,null,null,null,null,null,null,null,null,null,null,null,null,null,null,null,null,null,null,null,null,null,null,null,null,null,null,null,null,null,null,null,null,null,null,null,null,null,null,null,null,null,null,null,"DK/not sure/missing","N/A","N/A","N/A","N/A","N/A","N/A","N/A","N/A","N/A","N/A","N/A","N/A","N/A","N/A","N/A"]
[null,null,null,null,null,null,null,null,null,null,null,null,null,null,null,null,null,null,null,null,null,null,null,null,null,null,null,null,null,null,null,null,null,null,null,null,null,null,null,null,null,null,null,null,null,null,null,null,null,null,null,null,"Use of menstrual materials with private place to wash and change","Materials reusable","N/A","N/A","N/A","N/A","N/A","N/A","N/A","N/A","N/A","N/A","N/A","N/A","N/A","N/A","N/A"]
[null,null,null,null,null,null,null,null,null,null,null,null,null,null,null,null,null,null,null,null,null,null,null,null,null,null,null,null,null,null,null,null,null,null,null,null,null,null,null,null,null,null,null,null,null,null,null,null,null,null,null,null,null,"Materials not reusable","N/A","N/A","N/A","N/A","N/A","N/A","N/A","N/A","N/A","N/A","N/A","N/A","N/A","N/A","N/A"]
[null,null,null,null,null,null,null,null,null,null,null,null,null,null,null,null,null,null,null,null,null,null,null,null,null,null,null,null,null,null,null,null,null,null,null,null,null,null,null,null,null,null,null,null,null,null,null,null,null,null,null,null,null,"No materials used","N/A","N/A","N/A","N/A","N/A","N/A","N/A","N/A","N/A","N/A","N/A","N/A","N/A","N/A","N/A"]
[null,null,null,null,null,null,null,null,null,null,null,null,null,null,null,null,null,null,null,null,null,null,null,null,null,null,null,null,null,null,null,null,null,null,null,null,null,null,null,null,null,null,null,null,null,null,null,null,null,null,null,null,"Awareness of menstruation before menarche","Yes","N/A","N/A","N/A","N/A","N/A","N/A","N/A","N/A","N/A","N/A","N/A","N/A","N/A","N/A","N/A"]
[null,null,null,null,null,null,null,null,null,null,null,null,null,null,null,null,null,null,null,null,null,null,null,null,null,null,null,null,null,null,null,null,null,null,null,null,null,null,null,null,null,null,null,null,null,null,null,null,null,null,null,null,null,"No","N/A","N/A","N/A","N/A","N/A","N/A","N/A","N/A","N/A","N/A","N/A","N/A","N/A","N/A","N/A"]
[null,null,null,null,null,null,null,null,null,null,null,null,null,null,null,null,null,null,null,null,null,null,null,null,null,null,null,null,null,null,null,null,null,null,null,null,null,null,null,null,null,null,null,null,null,null,null,null,null,null,null,null,null,"DK/not sure/missing","N/A","N/A","N/A","N/A","N/A","N/A","N/A","N/A","N/A","N/A","N/A","N/A","N/A","N/A","N/A"]
[null,null,null,null,null,null,null,null,null,null,null,null,null,null,null,null,null,null,null,null,null,null,null,null,null,null,null,null,null,null,null,null,null,null,null,null,null,null,null,null,null,null,null,null,null,null,null,null,null,null,null,null,"Participation in (all) activities during menstruation","Yes","N/A","N/A","N/A","N/A","N/A","N/A","N/A","N/A","N/A","N/A","N/A","N/A","N/A","N/A","N/A"]
[null,null,null,null,null,null,null,null,null,null,null,null,null,null,null,null,null,null,null,null,null,null,null,null,null,null,null,null,null,null,null,null,null,null,null,null,null,null,null,null,null,null,null,null,null,null,null,null,null,null,null,null,null,"No","N/A","N/A","N/A","N/A","N/A","N/A","N/A","N/A","N/A","N/A","N/A","N/A","N/A","N/A","N/A"]
[null,null,null,null,null,null,null,null,null,null,null,null,null,null,null,null,null,null,null,null,null,null,null,null,null,null,null,null,null,null,null,null,null,null,null,null,null,null,null,null,null,null,null,null,null,null,null,null,null,null,null,null,null,"DK/not sure/missing/no such activity","N/A","N/A","N/A","N/A","N/A","N/A","N/A","N/A","N/A","N/A","N/A","N/A","N/A","N/A","N/A"]
[null,null,null,null,null,null,null,null,null,null,null,null,null,null,null,null,null,null,null,null,null,null,null,null,null,null,null,null,null,null,null,null,null,null,null,null,null,null,null,null,null,null,null,null,null,null,null,null,null,null,null,null,"Participation in specific activities during menstruation","Did not go to school (amongst those usually attending school)","N/A","N/A","N/A","N/A","N/A","N/A","N/A","N/A","N/A","N/A","N/A","N/A","N/A","N/A","N/A"]
[null,null,null,null,null,null,null,null,null,null,null,null,null,null,null,null,null,null,null,null,null,null,null,null,null,null,null,null,null,null,null,null,null,null,null,null,null,null,null,null,null,null,null,null,null,null,null,null,null,null,null,null,null,"Did not go to work (amongst those who usually work)","N/A","N/A","N/A","N/A","N/A","N/A","N/A","N/A","N/A","N/A","N/A","N/A","N/A","N/A","N/A"]
[null,null,null,null,null,null,null,null,null,null,null,null,null,null,null,null,null,null,null,null,null,null,null,null,null,null,null,null,null,null,null,null,null,null,null,null,null,null,null,null,null,null,null,null,null,null,null,null,null,null,null,null,null,"Did not participate in social activities","N/A","N/A","N/A","N/A","N/A","N/A","N/A","N/A","N/A","N/A","N/A","N/A","N/A","N/A","N/A"]
[null,null,null,null,null,null,null,null,null,null,null,null,null,null,null,null,null,null,null,null,null,null,null,null,null,null,null,null,null,null,null,null,null,null,null,null,null,null,null,null,null,null,null,null,null,null,null,null,null,null,null,null,null,"Did not cook food","N/A","N/A","N/A","N/A","N/A","N/A","N/A","N/A","N/A","N/A","N/A","N/A","N/A","N/A","N/A"]
[null,null,null,null,null,null,null,null,null,null,null,null,null,null,null,null,null,null,null,null,null,null,null,null,null,null,null,null,null,null,null,null,null,null,null,null,null,null,null,null,null,null,null,null,null,null,null,null,null,null,null,null,null,"Did not eat with others","N/A","N/A","N/A","N/A","N/A","N/A","N/A","N/A","N/A","N/A","N/A","N/A","N/A","N/A","N/A"]
[null,null,null,null,null,null,null,null,null,null,null,null,null,null,null,null,null,null,null,null,null,null,null,null,null,null,null,null,null,null,null,null,null,null,null,null,null,null,null,null,null,null,null,null,null,null,null,null,null,null,null,null,null,"Did not bathe in regular place","N/A","N/A","N/A","N/A","N/A","N/A","N/A","N/A","N/A","N/A","N/A","N/A","N/A","N/A","N/A"]
[null,null,null,null,null,null,null,null,null,null,null,null,null,null,null,null,null,null,null,null,null,null,null,null,null,null,null,null,null,null,null,null,null,null,null,null,null,null,null,null,null,null,null,null,null,null,null,null,null,null,null,null,null,"Did not participate in other activities","N/A","N/A","N/A","N/A","N/A","N/A","N/A","N/A","N/A","N/A","N/A","N/A","N/A","N/A","N/A"]
[null,null,null,null,null,null,null,null,null,null,null,null,null,null,null,null,null,null,null,null,null,null,null,null,null,null,null,null,null,null,null,null,null,null,null,null,null,null,null,null,null,null,null,null,null,null,null,null,null,null,null,null,null,"DK/not sure/missing/no such activity","N/A","N/A","N/A","N/A","N/A","N/A","N/A","N/A","N/A","N/A","N/A","N/A","N/A","N/A","N/A"]
[]
[]
[]
[]
[]
[]
[]
[]
[]
[]
[]
[]
[]
[]
[]
[]
[]
[]
[]
[]
[]
[]
[]
[]
[]
[]
[]
[]
[]
[]
[]
[]
[]
[]
[]
[]
[]
[]
[]
[]
[]
[]
[]
[]
[]
[]
[]
[]
[]
[]
[]
[]
[]
[]
[null,null,null,null,null,null,null,null,null,null,null,null,null,null,null,null,null,null,null,null,null,null,null,null,null,null,null,null,null,null,null,null,null,null,null,null,null,null,null,null,null,null,null,null,null,null,null,null,null,null,null,null,"Raw numbers of respondents:","Basic water, sanitation and hygiene","NATIONAL wealth index quintile",null,null,null,null,"URBAN wealth index quintile",null,null,null,null,"RURAL wealth index quintile"]
[null,null,null,null,null,null,null,null,null,null,null,null,null,null,null,null,null,null,null,null,null,null,null,null,null,null,null,null,null,null,null,null,null,null,null,null,null,null,null,null,null,null,null,null,null,null,null,null,null,null,null,null,"WatSan data, raw numbers (weighted)",null,"Poorest","Poor","Middle","Rich","Richest","Poorest","Poor","Middle","Rich","Richest","Poorest","Poor","Middle","Rich","Richest"]
[null,null,null,null,null,null,null,null,null,null,null,null,null,null,null,null,null,null,null,null,null,null,null,null,null,null,null,null,null,null,null,null,null,null,null,null,null,null,null,null,null,null,null,null,null,null,null,null,null,null,null,null,"Use of Basic Water Sanitation and Hygiene","Yes","N/A","N/A","N/A","N/A","N/A","N/A","N/A","N/A","N/A","N/A","N/A","N/A","N/A","N/A","N/A"]
[null,null,null,null,null,null,null,null,null,null,null,null,null,null,null,null,null,null,null,null,null,null,null,null,null,null,null,null,null,null,null,null,null,null,null,null,null,null,null,null,null,null,null,null,null,null,null,null,null,null,null,null,null,"No","N/A","N/A","N/A","N/A","N/A","N/A","N/A","N/A","N/A","N/A","N/A","N/A","N/A","N/A","N/A"]
[null,null,null,null,null,null,null,null,null,null,null,null,null,null,null,null,null,null,null,null,null,null,null,null,null,null,null,null,null,null,null,null,null,null,null,null,null,null,null,null,null,null,null,null,null,null,null,null,null,null,null,null,"Use of Basic Water and Sanitation","Yes","N/A","N/A","N/A","N/A","N/A","N/A","N/A","N/A","N/A","N/A","N/A","N/A","N/A","N/A","N/A"]
[null,null,null,null,null,null,null,null,null,null,null,null,null,null,null,null,null,null,null,null,null,null,null,null,null,null,null,null,null,null,null,null,null,null,null,null,null,null,null,null,null,null,null,null,null,null,null,null,null,null,null,null,null,"No","N/A","N/A","N/A","N/A","N/A","N/A","N/A","N/A","N/A","N/A","N/A","N/A","N/A","N/A","N/A"]
[null,null,null,null,null,null,null,null,null,null,null,null,null,null,null,null,null,null,null,null,null,null,null,null,null,null,null,null,null,null,null,null,null,null,null,null,null,null,null,null,null,null,null,null,null,null,null,null,null,null,null,null,"Use of Basic Water and Hygiene","Yes","N/A","N/A","N/A","N/A","N/A","N/A","N/A","N/A","N/A","N/A","N/A","N/A","N/A","N/A","N/A"]
[null,null,null,null,null,null,null,null,null,null,null,null,null,null,null,null,null,null,null,null,null,null,null,null,null,null,null,null,null,null,null,null,null,null,null,null,null,null,null,null,null,null,null,null,null,null,null,null,null,null,null,null,null,"No","N/A","N/A","N/A","N/A","N/A","N/A","N/A","N/A","N/A","N/A","N/A","N/A","N/A","N/A","N/A"]
[null,null,null,null,null,null,null,null,null,null,null,null,null,null,null,null,null,null,null,null,null,null,null,null,null,null,null,null,null,null,null,null,null,null,null,null,null,null,null,null,null,null,null,null,null,null,null,null,null,null,null,null,"Use of Basic Sanitation and Hygiene","Yes","N/A","N/A","N/A","N/A","N/A","N/A","N/A","N/A","N/A","N/A","N/A","N/A","N/A","N/A","N/A"]
[null,null,null,null,null,null,null,null,null,null,null,null,null,null,null,null,null,null,null,null,null,null,null,null,null,null,null,null,null,null,null,null,null,null,null,null,null,null,null,null,null,null,null,null,null,null,null,null,null,null,null,null,null,"No","N/A","N/A","N/A","N/A","N/A","N/A","N/A","N/A","N/A","N/A","N/A","N/A","N/A","N/A","N/A"]
[null,null,null,null,null,null,null,null,null,null,null,null,null,null,null,null,null,null,null,null,null,null,null,null,null,null,null,null,null,null,null,null,null,null,null,null,null,null,null,null,null,null,null,null,null,null,null,null,null,null,null,null,"Use of Basic Water","Yes","N/A","N/A","N/A","N/A","N/A","N/A","N/A","N/A","N/A","N/A","N/A","N/A","N/A","N/A","N/A"]
[null,null,null,null,null,null,null,null,null,null,null,null,null,null,null,null,null,null,null,null,null,null,null,null,null,null,null,null,null,null,null,null,null,null,null,null,null,null,null,null,null,null,null,null,null,null,null,null,null,null,null,null,null,"No","N/A","N/A","N/A","N/A","N/A","N/A","N/A","N/A","N/A","N/A","N/A","N/A","N/A","N/A","N/A"]
[null,null,null,null,null,null,null,null,null,null,null,null,null,null,null,null,null,null,null,null,null,null,null,null,null,null,null,null,null,null,null,null,null,null,null,null,null,null,null,null,null,null,null,null,null,null,null,null,null,null,null,null,"Use of Basic Sanitation","Yes","N/A","N/A","N/A","N/A","N/A","N/A","N/A","N/A","N/A","N/A","N/A","N/A","N/A","N/A","N/A"]
[null,null,null,null,null,null,null,null,null,null,null,null,null,null,null,null,null,null,null,null,null,null,null,null,null,null,null,null,null,null,null,null,null,null,null,null,null,null,null,null,null,null,null,null,null,null,null,null,null,null,null,null,null,"No","N/A","N/A","N/A","N/A","N/A","N/A","N/A","N/A","N/A","N/A","N/A","N/A","N/A","N/A","N/A"]
[null,null,null,null,null,null,null,null,null,null,null,null,null,null,null,null,null,null,null,null,null,null,null,null,null,null,null,null,null,null,null,null,null,null,null,null,null,null,null,null,null,null,null,null,null,null,null,null,null,null,null,null,"Access to Basic Hygiene","Yes","N/A","N/A","N/A","N/A","N/A","N/A","N/A","N/A","N/A","N/A","N/A","N/A","N/A","N/A","N/A"]
[null,null,null,null,null,null,null,null,null,null,null,null,null,null,null,null,null,null,null,null,null,null,null,null,null,null,null,null,null,null,null,null,null,null,null,null,null,null,null,null,null,null,null,null,null,null,null,null,null,null,null,null,null,"No","N/A","N/A","N/A","N/A","N/A","N/A","N/A","N/A","N/A","N/A","N/A","N/A","N/A","N/A","N/A"]
[]
[]
[]
[]
[]
[]
[]
[]
[]
[]
[]
[]
[]
[]
[]
[]
[]
[]
[]
[]
[]
[]
[]
[]
[]
[]
[]
[]
[]
[]
[]
[]
[]
[]
[]
[]
[]
[]
[]
[]
[]
[]
[]
[]
[null,null,"INITIAL (national) Wealth Index",null,null,null,null,"URBAN Wealth Index",null,null,null,null,"RURAL Wealth Index"]
[null,null,"Component Matrix",null,null,null,null,"Component Matrix",null,null,null,null,"Component Matrix"]
[null,null,null,null,"Component",null,null,null,null,"Component",null,null,null,null,"Component"]
[null,"Note:\n\nThe INITIAL (national) Wealth Index is based on the first component of the Principal Component Analysis (PCA) which has been obtained at national level.\n\nThe final national-level (NATIONAL) Wealth Index is based on the URBAN and RURAL specific wealth indexes. Regression procedures are used to establish the relationships between the two sets of scores (urban and rural) and the initial (national) wealth factors.\nThis allows best use of the available information for each area and a better precision of the FINAL (NATIONAL) Wealth Index.\n\nFor dependency reasons, all WASH variables (contained in the generic MICS and DHS scripts) have been excluded from the sets of asset variables used in the PCAs.\n\nThe PCA can extracts as many components as there are asset variables in the input. Only the first of the components is used to represent the Wealth Index. \n\nThe scores represent the weights of the asset variables on the Wealth Index (correlations between the variables and the component).\n\nThe communalities are the proportion of each variable's variance that can be explained by the component.\n\nProportion of explained variance is the part of the model's total variance that is explained by the component.\n\nFor more information on the procedure used:\n\nThe DHS Wealth Index, DHS Comparative Reports No. 6, Shea Oscar Rutstein, Kiersten Johnson, ORC Macro International Inc., 2004.\n\nThe DHS Wealth Index: Approaches for Rural and Urban Areas, Shea O. Rutstein, ORC Macro International Inc., 2008.\n\nMICS Methodological Paper No. 4, Review of options for reporting water, sanitation and hygiene coverage by wealth quintile, UNICEF, 2016.",null,null,"1",null,null,null,null,"1",null,null,null,null,"1"]
[null,null,"Dispone de regadera",null,0.73263107039716868,null,null,"roof3",null,-0.72048159558948666,null,null,"Dispone de regadera",null,0.73198610091256378]
[null,null,"roof3",null,-0.71814215973578055,null,null,"Dispone de regadera",null,0.71249442986826605,null,null,"Dispone de tinaco",null,0.68274257582043285]
[null,null,"wall9",null,-0.69274182303534904,null,null,"Dispone de fregadero",null,0.67692532971713792,null,null,"fuel1",null,0.67410091535073524]
[null,null,"Dispone de fregadero",null,0.68600228928828522,null,null,"wall9",null,-0.65928642852364783,null,null,"fuel3",null,-0.6686872254940871]
[null,null,"roof2",null,0.62478514497191506,null,null,"roof2",null,0.64568126998347419,null,null,"wall9",null,-0.6416864506049702]
[null,null,"Dispone de calentador de agua",null,0.62432451803832734,null,null,"Dispone de calentador de agua",null,0.62979345348344673,null,null,"Dispone de fregadero",null,0.61403084220744997]
[null,null,"Dispone de tinaco",null,0.60532417728039345,null,null,"Dispone de tinaco",null,0.59459017052233054,null,null,"Dispone de calentador de agua",null,0.61087963044048821]
[null,null,"fuel1",null,0.55980985720831322,null,null,"floor8",null,-0.4552080055838873,null,null,"roof3",null,-0.59964103371211919]
[null,null,"floor8",null,-0.54315403873197887,null,null,"Dispone de bomba de agua",null,0.45114214151476528,null,null,"floor8",null,-0.51713667184788437]
[null,null,"wall3",null,0.47682937037073142,null,null,"wall3",null,0.44758984206562014,null,null,"wall3",null,0.43357457595673204]
[null,null,"Dispone de bomba de agua",null,0.44844532115278307,null,null,"Number of members per sleeping room",null,0.43388549200726462,null,null,"Dispone de bomba de agua",null,0.41999899757064524]
[null,null,"Dispone de cisterna",null,0.42965302627060309,null,null,"Dispone de cisterna",null,0.41993086476075497,null,null,"floor6",null,0.39691011066319215]
[null,null,"Number of members per sleeping room",null,0.41810911236128484,null,null,"fuel1",null,0.41100493835413726,null,null,"Dispone de cisterna",null,0.3860210601656211]
[null,null,"fuel3",null,-0.40341961250499581,null,null,"Dispone de tanque de gas estacionario",null,0.37766195168706262,null,null,"roof2",null,0.37188539371980533]
[null,null,"Dispone de tanque de gas estacionario",null,0.37017944343424386,null,null,"Tiene cocina",null,0.37562472187679263,null,null,"Number of members per sleeping room",null,0.34945158182666297]
[null,null,"Dispone de medidor de luz",null,0.3450095216437426,null,null,"Utiliza cocina de dormitorio",null,-0.30507025370415031,null,null,"Dispone de medidor de luz",null,0.33504567635809768]
[null,null,"floor6",null,0.34448935110142953,null,null,"floor6",null,0.30308312552949501,null,null,"Dispone de tanque de gas estacionario",null,0.3264773030186946]
[null,null,"Tiene cocina",null,0.34087494350201514,null,null,"Dispone de medidor de luz",null,0.30013417651368107,null,null,"roof1",null,0.30023601151722012]
[null,null,"floor7",null,0.31513293771882045,null,null,"roof1",null,0.29313836319663672,null,null,"Dispone de aire acondicionado",null,0.2798052367154617]
[null,null,"roof1",null,0.30710914145593465,null,null,"wall4",null,0.29180611100179077,null,null,"Tiene cocina",null,0.27651660821358132]
[null,null,"Dispone de aire acondicionado",null,0.26761984415117174,null,null,"wall2",null,0.25455598362060028,null,null,"Dispone de lavadero",null,0.26955740702125408]
[null,null,"Utiliza cocina de dormitorio",null,-0.26595498849245613,null,null,"Dispone de aire acondicionado",null,0.24545071456825396,null,null,"floor7",null,0.2112639227763432]
[null,null,"wall4",null,0.26188973911295838,null,null,"fuel3",null,-0.23277173344576238,null,null,"Utiliza cocina de dormitorio",null,-0.20254510185299204]
[null,null,"wall2",null,0.2383457639005484,null,null,"floor7",null,0.22478878996644602,null,null,"wall2",null,0.19648605651065074]
[null,null,"sit3",null,-0.21468602698810901,null,null,"Dispone de pileta o tanque",null,-0.20640024690307118,null,null,"wall5",null,0.19022630562326867]
[null,null,"dwelling2",null,-0.21101082001632898,null,null,"sit3",null,-0.19943447944229428,null,null,"floor4",null,0.162546622579017]
[null,null,"Dispone de pileta o tanque",null,-0.20151706558352636,null,null,"dwelling2",null,-0.19427428855089254,null,null,"floor5",null,0.14659604518166766]
[null,null,"wall8",null,0.16791181843920233,null,null,"wall8",null,0.15769263054469651,null,null,"wall8",null,0.14013003443047822]
[null,null,"Dispone de lavadero",null,0.16232370918137509,null,null,"sit2",null,0.15278545458793216,null,null,"sit3",null,-0.13856112318297295]
[null,null,"wall5",null,0.15780215157275121,null,null,"dwelling3",null,0.13613794813843583,null,null,"sit1",null,-0.11417160468240392]
[null,null,"floor4",null,0.14718270238538381,null,null,"floor2",null,0.13296159816222861,null,null,"Dispone de  calefacción",null,0.11342325883520502]
[null,null,"floor5",null,0.13290566652889552,null,null,"fuel4",null,-0.13070802771243314,null,null,"wall4",null,0.10968411269779856]
[null,null,"fuel4",null,-0.12953233089713198,null,null,"floor4",null,0.12379374830074492,null,null,"dwelling2",null,-8.2986458651775868E-2]
[null,null,"Dispone decalefacción",null,0.12103264273797194,null,null,"wall6",null,0.12336196234836294,null,null,"sit4",null,7.5306467209382999E-2]
[null,null,"wall7",null,0.11659076995949115,null,null,"Dispone de lavadero",null,0.12183047728331388,null,null,"floor2",null,6.9943442393018002E-2]
[null,null,"dwelling1",null,0.11272486504559769,null,null,"Dispone de  calefacción",null,0.12065379454532332,null,null,"fuel4",null,-6.3650971048700544E-2]
[null,null,"floor2",null,0.11172142097031343,null,null,"floor5",null,0.11305610532124062,null,null,"floor1",null,6.1215168686821531E-2]
[null,null,"sit2",null,0.1113203820810494,null,null,"wall5",null,0.10918327376645716,null,null,"Dispone de pileta o tanque",null,-5.7959925428404543E-2]
[null,null,"wall6",null,0.10405318079620539,null,null,"fuel6",null,0.10100771114759304,null,null,"wall6",null,5.2647094164573673E-2]
[null,null,"sit4",null,0.10372460939871159,null,null,"fuel2",null,9.7866069932479025E-2,null,null,"fuel6",null,4.9120707179910489E-2]
[null,null,"sit1",null,-9.3835080339065333E-2,null,null,"floor1",null,8.6723666924313325E-2,null,null,"dwelling3",null,4.3756383495808522E-2]
[null,null,"fuel6",null,7.7825964727527355E-2,null,null,"wall7",null,7.4056609089703185E-2,null,null,"wall1",null,4.3626172531445746E-2]
[null,null,"fuel2",null,7.5696457839099937E-2,null,null,"dwelling1",null,5.7700585287962729E-2,null,null,"Estufa con chimenea",null,4.1496256844177445E-2]
[null,null,"floor1",null,7.4892529816145789E-2,null,null,"fuel5",null,5.2207110000508816E-2,null,null,"dwelling5",null,-2.7003036752854443E-2]
[null,null,"dwelling3",null,7.2083946635775095E-2,null,null,"wall1",null,4.4704092642229479E-2,null,null,"wall7",null,2.1985523161922635E-2]
[null,null,"wall1",null,3.9536694908789721E-2,null,null,"sit6",null,2.5117330752100171E-2,null,null,"sit2",null,2.1234713501702945E-2]
[null,null,"Dispone dechimenea",null,-3.3133961697862528E-2,null,null,"sit5",null,2.4375737562872049E-2,null,null,"sit6",null,-1.9035737775986408E-2]
[null,null,"fuel5",null,2.7618633859184432E-2,null,null,"Dispone de  chimenea",null,1.8628764333660185E-2,null,null,"fuel5",null,-1.8582411714665008E-2]
[null,null,"sit5",null,1.2589994280385111E-2,null,null,"dwelling4",null,1.7934828184348186E-2,null,null,"sit5",null,-1.6207274128417954E-2]
[null,null,"dwelling5",null,-1.1614212744323671E-2,null,null,"Estufa con chimenea",null,1.6417897054105582E-2,null,null,"dwelling4",null,-1.5534424777873E-2]
[null,null,"sit6",null,9.7009864037829498E-3,null,null,"dwelling5",null,-5.4495819577199574E-3,null,null,"Dispone de  chimenea",null,1.406940558997464E-2]
[null,null,"dwelling4",null,6.2827225219837532E-3,null,null,"sit1",null,-1.6708840009668309E-3,null,null,"fuel2",null,1.1509985345548087E-2]
[null,null,"Estufa con chimenea",null,1.6153561594451935E-3,null,null,"sit4",null,-1.4704385012821316E-3,null,null,"dwelling1",null,9.0524434714715739E-3]
[]
[]
[]
[null,null,"Communalities",null,null,null,null,"Communalities",null,null,null,null,"Communalities"]
[null,null,null,null,"Extraction",null,null,null,null,"Extraction",null,null,null,null,"Extraction"]
[null,null,"Number of members per sleeping room",null,0.17481522983954151,null,null,"Number of members per sleeping room",null,0.18825662017438607,null,null,"Number of members per sleeping room",null,0.12211640804115692]
[null,null,"floor1",null,5.6088910222622862E-3,null,null,"floor1",null,7.5209944047992371E-3,null,null,"floor1",null,3.7472968773560153E-3]
[null,null,"floor2",null,1.2481675903625989E-2,null,null,"floor2",null,1.7678786585853954E-2,null,null,"floor2",null,4.8920851337854281E-3]
[null,null,"floor4",null,2.1662747881464463E-2,null,null,"floor4",null,1.5324892118348187E-2,null,null,"floor4",null,2.6421404511845398E-2]
[null,null,"floor5",null,1.7663916195489977E-2,null,null,"floor5",null,1.2781682950407451E-2,null,null,"floor5",null,2.1490400462905547E-2]
[null,null,"floor6",null,0.11867291302228399,null,null,"floor6",null,9.1859380980727628E-2,null,null,"floor6",null,0.15753763594666745]
[null,null,"floor7",null,9.9308768435293973E-2,null,null,"floor7",null,5.0530000094578982E-2,null,null,"floor7",null,4.4632445066848707E-2]
[null,null,"floor8",null,0.29501630979086002,null,null,"floor8",null,0.20721432834766038,null,null,"floor8",null,0.26743033736990646]
[null,null,"wall1",null,1.5631502443107191E-3,null,null,"wall1",null,1.9984558989650358E-3,null,null,"wall1",null,1.9032429297434713E-3]
[null,null,"wall2",null,5.6808703169335964E-2,null,null,"wall2",null,6.4798748797051317E-2,null,null,"wall2",null,3.8606770403106637E-2]
[null,null,"wall3",null,0.22736624844814815,null,null,"wall3",null,0.20033666672032677,null,null,"wall3",null,0.18798691291606001]
[null,null,"wall4",null,6.8586235452653396E-2,null,null,"wall4",null,8.515080641798943E-2,null,null,"wall4",null,1.2030604578303374E-2]
[null,null,"wall5",null,2.4901519040989546E-2,null,null,"wall5",null,1.1920987270361132E-2,null,null,"wall5",null,3.6186047351077215E-2]
[null,null,"wall6",null,1.0827064433807806E-2,null,null,"wall6",null,1.5218173754438916E-2,null,null,"wall6",null,2.7717165239734875E-3]
[null,null,"wall7",null,1.3593407639746985E-2,null,null,"wall7",null,5.4843813498651082E-3,null,null,"wall7",null,4.8336322870343667E-4]
[null,null,"wall8",null,2.8194378771559649E-2,null,null,"wall8",null,2.486696572810615E-2,null,null,"wall8",null,1.9636426549487013E-2]
[null,null,"wall9",null,0.47989123338233886,null,null,"wall9",null,0.43465859483546698,null,null,"wall9",null,0.41176150089000485]
[null,null,"roof1",null,9.4316024765801282E-2,null,null,"roof1",null,8.59300999776033E-2,null,null,"roof1",null,9.0141662611768342E-2]
[null,null,"roof2",null,0.39035647737757695,null,null,"roof2",null,0.41690430240747212,null,null,"roof2",null,0.13829874606213463]
[null,null,"roof3",null,0.51572816158997137,null,null,"roof3",null,0.51909372958317257,null,null,"roof3",null,0.35956936931133887]
[null,null,"fuel1",null,0.31338707622759204,null,null,"fuel1",null,0.16892505935148816,null,null,"fuel1",null,0.45441204407669911]
[null,null,"fuel2",null,5.7299537293866347E-3,null,null,"fuel2",null,9.5777676440288746E-3,null,null,"fuel2",null,1.3247976265473173E-4]
[null,null,"fuel3",null,0.16274738375368097,null,null,"fuel3",null,5.4182679891345051E-2,null,null,"fuel3",null,0.44714260553898011]
[null,null,"fuel4",null,1.6778624747644091E-2,null,null,"fuel4",null,1.7084588508474191E-2,null,null,"fuel4",null,4.0514461154425151E-3]
[null,null,"fuel5",null,7.6278893624768878E-4,null,null,"fuel5",null,2.7255823346052275E-3,null,null,"fuel5",null,3.4530602513331934E-4]
[null,null,"fuel6",null,6.0568807857703322E-3,null,null,"fuel6",null,1.020255771127559E-2,null,null,"fuel6",null,2.41284387385451E-3]
[null,null,"dwelling1",null,1.2706895199548211E-2,null,null,"dwelling1",null,3.3293575425734608E-3,null,null,"dwelling1",null,8.194673280418832E-5]
[null,null,"dwelling2",null,4.4525566163963581E-2,null,null,"dwelling2",null,3.7742499191955457E-2,null,null,"dwelling2",null,6.886752319562906E-3]
[null,null,"dwelling3",null,5.1960953625892715E-3,null,null,"dwelling3",null,1.8533540923343444E-2,null,null,"dwelling3",null,1.9146210966322645E-3]
[null,null,"dwelling4",null,3.9472602288241894E-5,null,null,"dwelling4",null,3.2165806200209004E-4,null,null,"dwelling4",null,2.4131835317939461E-4]
[null,null,"dwelling5",null,1.3488993767041038E-4,null,null,"dwelling5",null,2.9697943513906883E-5,null,null,"dwelling5",null,7.2916399387600787E-4]
[null,null,"sit1",null,8.805022302238846E-3,null,null,"sit1",null,2.7918533446869243E-6,null,null,"sit1",null,1.3035155315755116E-2]
[null,null,"sit2",null,1.2392227466670824E-2,null,null,"sit2",null,2.334339513364108E-2,null,null,"sit2",null,4.5091305749940535E-4]
[null,null,"sit3",null,4.6090090183939073E-2,null,null,"sit3",null,3.9774111590418902E-2,null,null,"sit3",null,1.9199184857727005E-2]
[null,null,"sit4",null,1.0758794594915288E-2,null,null,"sit4",null,2.1621893860528414E-6,null,null,"sit4",null,5.671064003557877E-3]
[null,null,"sit5",null,1.5850795598012981E-4,null,null,"sit5",null,5.9417658173401141E-4,null,null,"sit5",null,2.6267573467368596E-4]
[null,null,"sit6",null,9.4109137206381649E-5,null,null,"sit6",null,6.3088030411039692E-4,null,null,"sit6",null,3.6235931267611593E-4]
[null,null,"Tiene cocina",null,0.11619572710750201,null,null,"Tiene cocina",null,0.14109393168501783,null,null,"Tiene cocina",null,7.6461434617943233E-2]
[null,null,"Utiliza cocina de dormitorio",null,7.073205590402247E-2,null,null,"Utiliza cocina de dormitorio",null,9.3067859695114635E-2,null,null,"Utiliza cocina de dormitorio",null,4.1024518284638919E-2]
[null,null,"Estufa con chimenea",null,2.6093755218575251E-6,null,null,"Estufa con chimenea",null,2.6954734367920876E-4,null,null,"Estufa con chimenea",null,1.7219393320779435E-3]
[null,null,"Dispone de lavadero",null,2.6348986562399635E-2,null,null,"Dispone de lavadero",null,1.4842665195080059E-2,null,null,"Dispone de lavadero",null,7.2661195680022037E-2]
[null,null,"Dispone de fregadero",null,0.47059914090876814,null,null,"Dispone de fregadero",null,0.4582279020126559,null,null,"Dispone de fregadero",null,0.37703387518199033]
[null,null,"Dispone de regadera",null,0.53674828531130114,null,null,"Dispone de regadera",null,0.50764831259330545,null,null,"Dispone de regadera",null,0.535803651929178]
[null,null,"Dispone de tinaco",null,0.36641735960018518,null,null,"Dispone de tinaco",null,0.35353747088177412,null,null,"Dispone de tinaco",null,0.46613742483791948]
[null,null,"Dispone de cisterna",null,0.18460172298348754,null,null,"Dispone de cisterna",null,0.17634193117871549,null,null,"Dispone de cisterna",null,0.14901225889139005]
[null,null,"Dispone de pileta o tanque",null,4.0609127721395265E-2,null,null,"Dispone de pileta o tanque",null,4.2601061921648746E-2,null,null,"Dispone de pileta o tanque",null,3.3593529556662158E-3]
[null,null,"Dispone de calentador de agua",null,0.38978110382378972,null,null,"Dispone de calentador de agua",null,0.3966397940506064,null,null,"Dispone de calentador de agua",null,0.37317392288710743]
[null,null,"Dispone de medidor de luz",null,0.11903157002484409,null,null,"Dispone de medidor de luz",null,9.0080523911545474E-2,null,null,"Dispone de medidor de luz",null,0.11225560524625514]
[null,null,"Dispone de bomba de agua",null,0.20110320606382276,null,null,"Dispone de bomba de agua",null,0.20352923185052851,null,null,"Dispone de bomba de agua",null,0.17639915796034686]
[null,null,"Dispone de tanque de gas estacionario",null,0.13703282034128655,null,null,"Dispone de tanque de gas estacionario",null,0.14262854975208122,null,null,"Dispone de tanque de gas estacionario",null,0.10658742938636054]
[null,null,"Dispone de aire acondicionado",null,7.1620380983497448E-2,null,null,"Dispone de aire acondicionado",null,6.0246053282066475E-2,null,null,"Dispone de aire acondicionado",null,7.8290970493395562E-2]
[null,null,"Dispone decalefacción",null,1.4648900608137552E-2,null,null,"Dispone de  calefacción",null,1.4557338138185091E-2,null,null,"Dispone de  calefacción",null,1.2864835644797913E-2]
[null,null,"Dispone dechimenea",null,1.0978594177954212E-3,null,null,"Dispone de  chimenea",null,3.4703086059904983E-4,null,null,"Dispone de  chimenea",null,1.9794817365520966E-4]
[]
[]
[null,null,"Total Variance Explained",null,null,null,null,"Total Variance Explained",null,null,null,null,"Total Variance Explained"]
[null,null,"Component",null,"Extraction Sums of Squared Loadings",null,null,"Component",null,"Extraction Sums of Squared Loadings",null,null,"Component",null,"Extraction Sums of Squared Loadings"]
[null,null,null,null,"Total","% of Variance","Cumulative %",null,null,"Total","% of Variance","Cumulative %",null,null,"Total","% of Variance","Cumulative %"]
[null,null,"1",null,6.050298292232152,11.415657155155005,11.415657155155005,"1",null,5.5401903095074241,10.453189263221555,10.453189263221555,"1",null,5.4879617784396268,10.354644864980427,10.354644864980427]
[]
[]
[null,null,"Component Score Coefficient Matrix",null,null,null,null,"Component Score Coefficient Matrix",null,null,null,null,"Component Score Coefficient Matrix"]
[null,null,null,null,"Component",null,null,null,null,"Component",null,null,null,null,"Component"]
[null,null,null,null,"1",null,null,null,null,"1",null,null,null,null,"1"]
[null,null,"Number of members per sleeping room",null,6.9105536977918297E-2,null,null,"Number of members per sleeping room",null,7.831599056492361E-2,null,null,"Number of members per sleeping room",null,6.3676023255034644E-2]
[null,null,"floor1",null,1.2378320241218306E-2,null,null,"floor1",null,1.5653553773322258E-2,null,null,"floor1",null,1.1154445158003019E-2]
[null,null,"floor2",null,1.8465440144290104E-2,null,null,"floor2",null,2.3999464049827952E-2,null,null,"floor2",null,1.2744885117057937E-2]
[null,null,"floor4",null,2.4326519995608899E-2,null,null,"floor4",null,2.2344674349598539E-2,null,null,"floor4",null,2.9618759958862786E-2]
[null,null,"floor5",null,2.1966795703201984E-2,null,null,"floor5",null,2.0406538224368758E-2,null,null,"floor5",null,2.6712293397813863E-2]
[null,null,"floor6",null,5.6937581332760411E-2,null,null,"floor6",null,5.47062661384356E-2,null,null,"floor6",null,7.2323774597432472E-2]
[null,null,"floor7",null,5.2085520828520616E-2,null,null,"floor7",null,4.0574200056032357E-2,null,null,"floor7",null,3.849588085804985E-2]
[null,null,"floor8",null,-8.9773100845180268E-2,null,null,"floor8",null,-8.2164687520338939E-2,null,null,"floor8",null,-9.4231099400061802E-2]
[null,null,"wall1",null,6.5346687054339183E-3,null,null,"wall1",null,8.0690536145506721E-3,null,null,"wall1",null,7.9494308256370227E-3]
[null,null,"wall2",null,3.9394051729078457E-2,null,null,"wall2",null,4.5947155133599149E-2,null,null,"wall2",null,3.58031022159409E-2]
[null,null,"wall3",null,7.8810886230671048E-2,null,null,"wall3",null,8.0789614988048167E-2,null,null,"wall3",null,7.9004663928255128E-2]
[null,null,"wall4",null,4.3285426017621809E-2,null,null,"wall4",null,5.267077387233926E-2,null,null,"wall4",null,1.9986311334876803E-2]
[null,null,"wall5",null,2.608171431404465E-2,null,null,"wall5",null,1.9707495170173065E-2,null,null,"wall5",null,3.466246911022676E-2]
[null,null,"wall6",null,1.7198024918836985E-2,null,null,"wall6",null,2.2266737324287154E-2,null,null,"wall6",null,9.5931962156526971E-3]
[null,null,"wall7",null,1.9270251536057246E-2,null,null,"wall7",null,1.3367159781969212E-2,null,null,"wall7",null,4.0061363488893874E-3]
[null,null,"wall8",null,2.775265124610149E-2,null,null,"wall8",null,2.8463395972893379E-2,null,null,"wall8",null,2.5534076235917393E-2]
[null,null,"wall9",null,-0.11449713544285005,null,null,"wall9",null,-0.11900068259248386,null,null,"wall9",null,-0.11692618799313481]
[null,null,"roof1",null,5.0759338899079652E-2,null,null,"roof1",null,5.2911244347254124E-2,null,null,"roof1",null,5.4708109064597971E-2]
[null,null,"roof2",null,0.10326518045797235,null,null,"roof2",null,0.11654496216049327,null,null,"roof2",null,6.7763845437265824E-2]
[null,null,"roof3",null,-0.11869533121330363,null,null,"roof3",null,-0.13004636218959498,null,null,"roof3",null,-0.1092647977374604]
[null,null,"fuel1",null,9.2525992962535608E-2,null,null,"fuel1",null,7.4186068599271557E-2,null,null,"fuel1",null,0.12283265492100422]
[null,null,"fuel2",null,1.2511194354877511E-2,null,null,"fuel2",null,1.766474876585607E-2,null,null,"fuel2",null,2.0973151436234458E-3]
[null,null,"fuel3",null,-6.6677640178987141E-2,null,null,"fuel3",null,-4.2015115084820621E-2,null,null,"fuel3",null,-0.12184618852870595]
[null,null,"fuel4",null,-2.1409247055378371E-2,null,null,"fuel4",null,-2.3592696353431648E-2,null,null,"fuel4",null,-1.1598289787433288E-2]
[null,null,"fuel5",null,4.5648383807197412E-3,null,null,"fuel5",null,9.4233423553911344E-3,null,null,"fuel5",null,-3.386031547754052E-3]
[null,null,"fuel6",null,1.2863161610964942E-2,null,null,"fuel6",null,1.8231812537965613E-2,null,null,"fuel6",null,8.950628514376573E-3]
[null,null,"dwelling1",null,1.8631290491961813E-2,null,null,"dwelling1",null,1.0414910330597086E-2,null,null,"dwelling1",null,1.6495092052272683E-3]
[null,null,"dwelling2",null,-3.4876101941492911E-2,null,null,"dwelling2",null,-3.506635651441465E-2,null,null,"dwelling2",null,-1.5121544573761796E-2]
[null,null,"dwelling3",null,1.1914114503795975E-2,null,null,"dwelling3",null,2.4572792726057061E-2,null,null,"dwelling3",null,7.9731574785583924E-3]
[null,null,"dwelling4",null,1.038415334009235E-3,null,null,"dwelling4",null,3.2372224025536706E-3,null,null,"dwelling4",null,-2.8306364739824866E-3]
[null,null,"dwelling5",null,-1.9196099404280463E-3,null,null,"dwelling5",null,-9.8364526365963016E-4,null,null,"dwelling5",null,-4.9204126856240834E-3]
[null,null,"sit1",null,-1.5509165962864705E-2,null,null,"sit1",null,-3.0159324998266869E-4,null,null,"sit1",null,-2.0804008717944453E-2]
[null,null,"sit2",null,1.8399155992684071E-2,null,null,"sit2",null,2.7577654566439663E-2,null,null,"sit2",null,3.8693260556454784E-3]
[null,null,"sit3",null,-3.548354421859494E-2,null,null,"sit3",null,-3.5997766917870724E-2,null,null,"sit3",null,-2.5248193915514035E-2]
[null,null,"sit4",null,1.7143718274499193E-2,null,null,"sit4",null,-2.6541299470502627E-4,null,null,"sit4",null,1.372211947707745E-2]
[null,null,"sit5",null,2.0808881929919283E-3,null,null,"sit5",null,4.3998014871513124E-3,null,null,"sit5",null,-2.9532410725036269E-3]
[null,null,"sit6",null,1.6033897727386166E-3,null,null,"sit6",null,4.5336584754131571E-3,null,null,"sit6",null,-3.4686352683379611E-3]
[null,null,"Tiene cocina",null,5.6340188043233701E-2,null,null,"Tiene cocina",null,6.7799967310182396E-2,null,null,"Tiene cocina",null,5.0386030256246127E-2]
[null,null,"Utiliza cocina de dormitorio",null,-4.3957334935685745E-2,null,null,"Utiliza cocina de dormitorio",null,-5.5064941213413661E-2,null,null,"Utiliza cocina de dormitorio",null,-3.6907163356844845E-2]
[null,null,"Estufa con chimenea",null,2.6698785438713238E-4,null,null,"Estufa con chimenea",null,2.9634175248332384E-3,null,null,"Estufa con chimenea",null,7.5613239522189122E-3]
[null,null,"Dispone de lavadero",null,2.6829042361395473E-2,null,null,"Dispone de lavadero",null,2.1990305472763767E-2,null,null,"Dispone de lavadero",null,4.9117945405570303E-2]
[null,null,"Dispone de fregadero",null,0.1133832178438258,null,null,"Dispone de fregadero",null,0.12218449040558738,null,null,"Dispone de fregadero",null,0.11188686565197531]
[null,null,"Dispone de regadera",null,0.1210900744080301,null,null,"Dispone de regadera",null,0.12860468504945885,null,null,"Dispone de regadera",null,0.13338032050228435]
[null,null,"Dispone de tinaco",null,0.10004865017276193,null,null,"Dispone de tinaco",null,0.10732305883102333,null,null,"Dispone de tinaco",null,0.12440731247486106]
[null,null,"Dispone de cisterna",null,7.10135278490691E-2,null,null,"Dispone de cisterna",null,7.5797191305886913E-2,null,null,"Dispone de cisterna",null,7.0339604346766629E-2]
[null,null,"Dispone de pileta o tanque",null,-3.3306963698343572E-2,null,null,"Dispone de pileta o tanque",null,-3.7255082474129335E-2,null,null,"Dispone de pileta o tanque",null,-1.056128445648251E-2]
[null,null,"Dispone de calentador de agua",null,0.10318904752843082,null,null,"Dispone de calentador de agua",null,0.11367722375938409,null,null,"Dispone de calentador de agua",null,0.11131266125803405]
[null,null,"Dispone de medidor de luz",null,5.7023555695872537E-2,null,null,"Dispone de medidor de luz",null,5.4173983156973159E-2,null,null,"Dispone de medidor de luz",null,6.1051022198146593E-2]
[null,null,"Dispone de bomba de agua",null,7.4119539152066677E-2,null,null,"Dispone de bomba de agua",null,8.1430802248898954E-2,null,null,"Dispone de bomba de agua",null,7.6530962591736945E-2]
[null,null,"Dispone de tanque de gas estacionario",null,6.1183668234921461E-2,null,null,"Dispone de tanque de gas estacionario",null,6.8167685691042701E-2,null,null,"Dispone de tanque de gas estacionario",null,5.9489718806226964E-2]
[null,null,"Dispone de aire acondicionado",null,4.4232504122112978E-2,null,null,"Dispone de aire acondicionado",null,4.4303661220272579E-2,null,null,"Dispone de aire acondicionado",null,5.0985274317092232E-2]
[null,null,"Dispone decalefacción",null,2.000440918646328E-2,null,null,"Dispone de  calefacción",null,2.1777915162638269E-2,null,null,"Dispone de  calefacción",null,2.0667647373348558E-2]
[null,null,"Dispone dechimenea",null,-5.476417871892781E-3,null,null,"Dispone de  chimenea",null,3.3624773325370591E-3,null,null,"Dispone de  chimenea",null,2.5636850543035209E-3]
[]
[]
[null,null,"Component Score Covariance Matrix",null,null,null,null,"Component Score Covariance Matrix",null,null,null,null,"Component Score Covariance Matrix"]
[null,null,"Component",null,"1",null,null,"Component",null,"1",null,null,"Component",null,"1"]
[null,null,"1",null,1,null,null,"1",null,1.0000000000000002,null,null,"1",null,1.0000000000000002]
[]
[]
[]
[]
[]
[]
[]
[]
[]
[]
[]
[]
[]
[]
[]
[]
[]
[]
[]
[]
[]
[]
[]
[]
[]
[]
[]
[]
[]
[]
[]
[]
[]
[]
[]
[]
[]
[]
[]
[]
[]
[]
[]
[]
[]
[]
[]
[]
[]
[]
[]
[]
[]
[]
[]
[]
[]
[]
[]
[]
[]
[]
[]
[]
[]
[]
[]
[]
[]
[]
[]
[]
[]
[]
[]
[]
[]
[]
[]
[]
[]
[]
[]
[]
[]
[]
[]
[]
[]
[]
[]
[]
[]
[]
[]
[]
[]
[]
[]
[]
[]
[]
[]
[]
[]
[]
[]
[]
[]
[]
[]
[]
[]
[]
[]
[]
[]
[]
[]
[]
[]
[]
[]
[]
[]
[]
[]
[]
[]
[]
[]
[]
[]
[]
[]
[]
[]
[]
[]
[]
[]
[]
[]
[]
[]
[]
[]
[]
[]
[]
[]
[]
[]
[]
[]
[]
[]
[]
[]
[]
[]
[]
[]
[]
[]
[]
[]
[]
[]
[]
[]
[]
[]
[]
[]
[]
[]
[]
[]
[]
[]
[]
[]
[]
[]
[]
[]
[]
[]
[]
[]
[]
[]
[]
[]
[]
[]
[]
[]
[]
[]
[]
[]
[]
[]
[]
[]
[]
[]
[]
[]
[]
[]
[]
[]
[]
[]
[]
[]
[]
[]
[]
[]
[]
[]
[]
[]
[]
[]
[]
[]
[]
[]
[]
[]
[]
[]
[]
[]
[]
[]
[]
[]
[]
[]
[]
[]
[]
[]
[]
[]
[]
[]
[]
[]
[]
[]
[]
[]
[]
[]
[]
[]
[]
[]
[]
[]
[]
[]
[]
[]
[]
[]
[]
[]
[]
[]
[]
[]
[]
[]
[]
[]
[]
[]
[]
[]
[]
[]
[]
[]
[]
[]
[]
[]
[]
[]
[]
[]
[]
[]
[]
[]
[]
[]
[]
[]
[]
[]
[]
[]
[]
[]
[]
[]
[]
[]
[]
[]
[]
[]
[]
[]
[]
[]
[]
[]
[]
[]
[]
[]
[]
[]
[]
[]
[]
[]
[]
[]
[]
[]
[]
[]
[]
[]
[]
[]
[]
[]
[]
[]
[]
[]
[]
[]
[]
[]
[]
[]
[]
[]
[]
[]
[]
[]
[]
[]
[]
[]
[]
[]
[]
[]
[]
[]
[]
[]
[]
[]
[]
[]
[]
[]
[]
[]
[]
[]
[]
[]
[]
[]
[]
[]
[]
[]
[]
[]
[]
[]
[]
[]
[]
[]
[]
[]
[]
[]
[]
[]
[]
[]
[]
[]
[]
[]
[]
[]
[]
[]
[]
[]
[]
[]
[]
[]
[]
[]
[]
[]
[]
[]
[]
[]
[]
[]
[]
[]
[]
[]
[]
[]
[]
["ENG12"]
["Mexico",null,"Count"]
["W_text_t","Time to improved source based on:",57757]
["W_text_i","",57757]
["S_text_s","Ratio of Shared improved based on:",57757]
["S_text_i","Ratio of Improved latrines based on:",57757]
["Urban/Rural","Urban",49679]
[null,"Rural",8078]
[null,"Missing",0]
["2012"]
[]
["Sub-national region names","Weighted population"]
[{"$f":"R15","v":0},{"$f":"#REF!+#REF!","v":{"$error":"#REF!"}}]
[{"$f":"S15","v":0},{"$f":"#REF!+#REF!","v":{"$error":"#REF!"}}]
[{"$f":"T15","v":0},{"$f":"#REF!+#REF!","v":{"$error":"#REF!"}}]
[{"$f":"U15","v":0},{"$f":"#REF!+#REF!","v":{"$error":"#REF!"}}]
[{"$f":"V15","v":0},{"$f":"#REF!+#REF!","v":{"$error":"#REF!"}}]
[{"$f":"W15","v":0},{"$f":"#REF!+#REF!","v":{"$error":"#REF!"}}]
[{"$f":"X15","v":0},{"$f":"#REF!+WH123","v":{"$error":"#REF!"}}]
[{"$f":"Y15","v":0},{"$f":"#REF!+#REF!","v":{"$error":"#REF!"}}]
[{"$f":"Z15","v":0},{"$f":"#REF!+#REF!","v":{"$error":"#REF!"}}]
[{"$f":"AA15","v":0},{"$f":"#REF!+#REF!","v":{"$error":"#REF!"}}]
[{"$f":"AB15","v":0},{"$f":"#REF!+#REF!","v":{"$error":"#REF!"}}]
[{"$f":"AC15","v":0},{"$f":"#REF!+#REF!","v":{"$error":"#REF!"}}]
[{"$f":"AD15","v":0},{"$f":"#REF!+#REF!","v":{"$error":"#REF!"}}]
[{"$f":"AE15","v":0},{"$f":"#REF!+#REF!","v":{"$error":"#REF!"}}]
[{"$f":"AF15","v":0},{"$f":"#REF!+#REF!","v":{"$error":"#REF!"}}]
[{"$f":"AG15","v":0},{"$f":"#REF!+#REF!","v":{"$error":"#REF!"}}]
[{"$f":"AH15","v":0},{"$f":"#REF!+#REF!","v":{"$error":"#REF!"}}]
[{"$f":"AI15","v":0},{"$f":"#REF!+#REF!","v":{"$error":"#REF!"}}]
[{"$f":"AJ15","v":0},{"$f":"#REF!+#REF!","v":{"$error":"#REF!"}}]
[{"$f":"AK15","v":0},{"$f":"#REF!+#REF!","v":{"$error":"#REF!"}}]
[{"$f":"AL15","v":0},{"$f":"#REF!+#REF!","v":{"$error":"#REF!"}}]
[{"$f":"AM15","v":0},{"$f":"#REF!+#REF!","v":{"$error":"#REF!"}}]
[{"$f":"AN15","v":0},{"$f":"#REF!+#REF!","v":{"$error":"#REF!"}}]
[{"$f":"AO15","v":0},{"$f":"#REF!+#REF!","v":{"$error":"#REF!"}}]
[{"$f":"AP15","v":0},{"$f":"#REF!+#REF!","v":{"$error":"#REF!"}}]
[{"$f":"AQ15","v":0},{"$f":"#REF!+#REF!","v":{"$error":"#REF!"}}]
[{"$f":"AR15","v":0},{"$f":"#REF!+#REF!","v":{"$error":"#REF!"}}]
[{"$f":"AS15","v":0},{"$f":"#REF!+#REF!","v":{"$error":"#REF!"}}]
[{"$f":"AT15","v":0},{"$f":"#REF!+#REF!","v":{"$error":"#REF!"}}]
[{"$f":"AU15","v":0},{"$f":"#REF!+#REF!","v":{"$error":"#REF!"}}]
[{"$f":"AV15","v":0},{"$f":"#REF!+#REF!","v":{"$error":"#REF!"}}]
[{"$f":"AW15","v":0},{"$f":"#REF!+#REF!","v":{"$error":"#REF!"}}]
[{"$f":"AX15","v":0},{"$f":"#REF!+#REF!","v":{"$error":"#REF!"}}]
[{"$f":"AY15","v":0},{"$f":"#REF!+#REF!","v":{"$error":"#REF!"}}]
[]
[{"$f":"34-COUNTIF(A1037:A1071,\"0\")","v":0},"Sub-regions"]

{"sheet":"MICS15","index":6,"n_rows":1072,"n_cols":74,"rows_kept":1072,"cut":false,"hidden":false,"merged":[[340,52,341,52],[342,52,343,52],[344,52,345,52],[346,52,347,52],[348,52,349,52],[350,52,351,52],[352,52,353,52],[152,52,164,52],[230,52,234,52],[260,52,262,52],[263,52,266,52],[267,52,269,52],[270,52,272,52],[273,52,275,52],[276,52,283,52],[338,54,338,58],[338,59,338,63],[338,64,338,68],[219,54,219,58],[219,59,219,63],[219,64,219,68],[221,52,223,52],[224,52,225,52],[226,52,229,52],[258,54,258,58],[258,59,258,63],[258,64,258,68],[150,52,151,52],[13,54,13,58],[13,59,13,63],[13,64,13,68],[15,52,16,52],[17,52,20,52],[21,52,22,52],[26,54,26,58],[26,59,26,63],[26,64,26,68],[55,54,55,58],[55,59,55,63],[55,64,55,68],[119,54,119,58],[119,59,119,63],[119,64,119,68],[121,52,122,52],[123,52,126,52],[127,52,128,52],[132,54,132,58],[132,59,132,63],[132,64,132,68],[134,52,138,52],[49,52,51,52],[52,0,54,0],[52,52,54,52],[139,0,142,0],[139,52,142,52],[143,0,146,0],[143,52,146,52],[147,0,149,0],[147,52,149,52],[38,52,39,52],[40,52,41,52],[42,52,43,52],[44,52,45,52],[46,0,48,0],[46,52,48,52],[28,52,29,52],[30,0,31,0],[30,52,31,52],[32,0,33,0],[32,52,33,52],[34,52,35,52],[36,52,37,52],[107,0,107,1],[57,0,72,0],[55,2,55,6],[55,7,55,11],[55,12,55,16],[28,0,29,0],[34,0,35,0],[36,0,37,0],[40,0,41,0],[697,2,697,3],[697,7,697,8],[697,12,697,13],[698,2,698,3],[698,7,698,8],[698,12,698,13],[695,2,695,3],[695,7,695,8],[695,12,695,13],[696,2,696,3],[696,7,696,8],[696,12,696,13],[693,2,693,3],[693,7,693,8],[693,12,693,13],[694,2,694,3],[694,7,694,8],[694,12,694,13],[691,2,691,3],[691,7,691,8],[691,12,691,13],[692,2,692,3],[692,7,692,8],[692,12,692,13],[689,2,689,3],[689,7,689,8],[689,12,689,13],[690,2,690,3],[690,7,690,8],[690,12,690,13],[687,2,687,3],[687,7,687,8],[687,12,687,13],[688,2,688,3],[688,7,688,8],[688,12,688,13],[685,2,685,3],[685,7,685,8],[685,12,685,13],[686,2,686,3],[686,7,686,8],[686,12,686,13],[683,2,683,3],[683,7,683,8],[683,12,683,13],[684,2,684,3],[684,7,684,8],[684,12,684,13],[681,2,681,3],[681,7,681,8],[681,12,681,13],[682,2,682,3],[682,7,682,8],[682,12,682,13],[679,2,679,3],[679,7,679,8],[679,12,679,13],[680,2,680,3],[680,7,680,8],[680,12,680,13],[677,2,677,3],[677,7,677,8],[677,12,677,13],[678,2,678,3],[678,7,678,8],[678,12,678,13],[675,2,675,3],[675,7,675,8],[675,12,675,13],[676,2,676,3],[676,7,676,8],[676,12,676,13],[673,2,673,3],[673,7,673,8],[673,12,673,13],[674,2,674,3],[674,7,674,8],[674,12,674,13],[671,2,671,3],[671,7,671,8],[671,12,671,13],[672,2,672,3],[672,7,672,8],[672,12,672,13],[669,2,669,3],[669,7,669,8],[669,12,669,13],[670,2,670,3],[670,7,670,8],[670,12,670,13],[667,2,667,3],[667,7,667,8],[667,12,667,13],[668,2,668,3],[668,7,668,8],[668,12,668,13],[665,2,665,3],[665,7,665,8],[665,12,665,13],[666,2,666,3],[666,7,666,8],[666,12,666,13],[663,2,663,3],[663,7,663,8],[663,12,663,13],[664,2,664,3],[664,7,664,8],[664,12,664,13],[661,2,661,3],[661,7,661,8],[661,12,661,13],[662,2,662,3],[662,7,662,8],[662,12,662,13],[659,2,659,3],[659,7,659,8],[659,12,659,13],[660,2,660,3],[660,7,660,8],[660,12,660,13],[657,2,657,3],[657,7,657,8],[657,12,657,13],[658,2,658,3],[658,7,658,8],[658,12,658,13],[655,2,655,3],[655,7,655,8],[655,12,655,13],[656,2,656,3],[656,7,656,8],[656,12,656,13],[653,2,653,3],[653,7,653,8],[653,12,653,13],[654,2,654,3],[654,7,654,8],[654,12,654,13],[651,2,651,3],[651,7,651,8],[651,12,651,13],[652,2,652,3],[652,7,652,8],[652,12,652,13],[649,2,649,3],[649,7,649,8],[649,12,649,13],[650,2,650,3],[650,7,650,8],[650,12,650,13],[647,2,647,3],[647,7,647,8],[647,12,647,13],[648,2,648,3],[648,7,648,8],[648,12,648,13],[645,2,645,3],[645,7,645,8],[645,12,645,13],[646,2,646,3],[646,7,646,8],[646,12,646,13],[643,2,643,3],[643,7,643,8],[643,12,643,13],[644,2,644,3],[644,7,644,8],[644,12,644,13],[641,2,641,3],[641,7,641,8],[641,12,641,13],[642,2,642,3],[642,7,642,8],[642,12,642,13],[639,2,639,3],[639,7,639,8],[639,12,639,13],[640,2,640,3],[640,7,640,8],[640,12,640,13],[637,2,637,3],[637,7,637,8],[637,12,637,13],[638,2,638,3],[638,7,638,8],[638,12,638,13],[635,2,635,3],[635,7,635,8],[635,12,635,13],[636,2,636,3],[636,7,636,8],[636,12,636,13],[633,2,633,3],[633,7,633,8],[633,12,633,13],[634,2,634,3],[634,7,634,8],[634,12,634,13],[631,2,631,3],[631,7,631,8],[631,12,631,13],[632,2,632,3],[632,7,632,8],[632,12,632,13],[629,2,629,3],[629,7,629,8],[629,12,629,13],[630,2,630,3],[630,7,630,8],[630,12,630,13],[627,2,627,3],[627,7,627,8],[627,12,627,13],[628,2,628,3],[628,7,628,8],[628,12,628,13],[625,2,625,3],[625,7,625,8],[625,12,625,13],[626,2,626,3],[626,7,626,8],[626,12,626,13],[623,2,623,3],[623,7,623,8],[623,12,623,13],[624,2,624,3],[624,7,624,8],[624,12,624,13],[621,2,621,3],[621,7,621,8],[621,12,621,13],[622,2,622,3],[622,7,622,8],[622,12,622,13],[619,2,619,3],[619,7,619,8],[619,12,619,13],[620,2,620,3],[620,7,620,8],[620,12,620,13],[617,2,617,3],[617,7,617,8],[617,12,617,13],[618,2,618,3],[618,7,618,8],[618,12,618,13],[615,2,615,3],[615,7,615,9],[615,12,615,14],[616,2,616,3],[616,7,616,8],[616,12,616,13],[613,2,613,3],[613,7,613,8],[613,12,613,13],[614,2,614,3],[614,7,614,8],[614,12,614,13],[611,2,611,3],[611,7,611,8],[611,12,611,13],[612,2,612,3],[612,7,612,8],[612,12,612,13],[609,2,609,3],[609,7,609,8],[609,12,609,13],[610,2,610,3],[610,7,610,8],[610,12,610,13],[607,2,607,3],[607,7,607,8],[607,12,607,13],[608,2,608,3],[608,7,608,8],[608,12,608,13],[605,2,605,3],[605,7,605,8],[605,12,605,13],[606,2,606,3],[606,7,606,8],[606,12,606,13],[603,2,603,3],[603,7,603,8],[603,12,603,13],[604,2,604,3],[604,7,604,8],[604,12,604,13],[601,2,601,3],[601,7,601,8],[601,12,601,13],[602,2,602,3],[602,7,602,8],[602,12,602,13],[599,2,599,3],[599,7,599,8],[599,12,599,13],[600,2,600,3],[600,7,600,8],[600,12,600,13],[597,2,597,4],[597,7,597,8],[597,12,597,13],[598,2,598,3],[598,7,598,8],[598,12,598,13],[595,2,595,3],[595,7,595,8],[595,12,595,13],[596,2,596,3],[596,7,596,8],[596,12,596,13],[593,2,593,3],[593,7,593,8],[593,12,593,13],[594,2,594,3],[594,7,594,8],[594,12,594,13],[591,2,591,3],[591,7,591,8],[591,12,591,13],[592,2,592,3],[592,7,592,8],[592,12,592,13],[589,2,589,3],[589,7,589,8],[589,12,589,13],[590,2,590,3],[590,7,590,8],[590,12,590,13],[587,2,587,3],[587,7,587,8],[587,12,587,13],[588,2,588,3],[588,7,588,8],[588,12,588,13],[585,2,585,3],[585,7,585,8],[585,12,585,13],[586,2,586,3],[586,7,586,8],[586,12,586,13],[583,2,583,3],[583,7,583,8],[583,12,583,13],[584,2,584,3],[584,7,584,8],[584,12,584,13],[581,2,581,3],[581,7,581,8],[581,12,581,13],[582,2,582,3],[582,7,582,8],[582,12,582,13],[579,2,579,3],[579,7,579,8],[579,12,579,13],[580,2,580,3],[580,7,580,8],[580,12,580,13],[577,2,577,3],[577,7,577,8],[577,12,577,13],[578,2,578,3],[578,7,578,8],[578,12,578,13],[575,2,575,3],[575,7,575,8],[575,12,575,13],[576,2,576,3],[576,7,576,8],[576,12,576,13],[573,2,573,3],[573,7,573,8],[573,12,573,13],[574,2,574,3],[574,7,574,8],[574,12,574,13],[571,2,571,3],[571,7,571,8],[571,12,571,13],[572,2,572,3],[572,7,572,8],[572,12,572,13],[569,2,569,3],[569,7,569,8],[569,12,569,13],[570,2,570,3],[570,7,570,8],[570,12,570,13],[567,2,567,3],[567,7,567,8],[567,12,567,13],[568,2,568,3],[568,7,568,8],[568,12,568,13],[565,2,565,3],[565,7,565,8],[565,12,565,13],[566,2,566,3],[566,7,566,8],[566,12,566,13],[563,2,563,3],[563,7,563,8],[563,12,563,13],[564,2,564,3],[564,7,564,8],[564,12,564,13],[561,2,561,3],[561,7,561,8],[561,12,561,13],[562,2,562,3],[562,7,562,8],[562,12,562,13],[559,2,559,3],[559,7,559,8],[559,12,559,13],[560,2,560,3],[560,7,560,8],[560,12,560,13],[557,2,557,3],[557,7,557,8],[557,12,557,13],[558,2,558,3],[558,7,558,8],[558,12,558,13],[555,2,555,3],[555,7,555,8],[555,12,555,13],[556,2,556,3],[556,7,556,8],[556,12,556,13],[553,2,553,3],[553,7,553,8],[553,12,553,13],[554,2,554,3],[554,7,554,8],[554,12,554,13],[551,2,551,3],[551,7,551,8],[551,12,551,13],[552,2,552,3],[552,7,552,8],[552,12,552,13],[549,2,549,3],[549,7,549,8],[549,12,549,13],[550,2,550,3],[550,7,550,8],[550,12,550,13],[546,2,546,3],[546,7,547,8],[546,12,547,13],[547,2,547,3],[548,2,548,3],[548,7,548,8],[548,12,548,13],[544,2,544,3],[544,7,544,8],[544,12,544,13],[545,2,545,3],[545,7,545,9],[545,12,545,14],[542,2,542,3],[542,7,542,8],[542,12,542,13],[543,2,543,3],[543,7,543,8],[543,12,543,13],[539,2,539,3],[539,7,539,11],[539,12,539,16],[540,2,540,3],[540,7,541,8],[540,9,540,11],[540,12,541,13],[540,14,540,16],[541,2,541,3],[537,2,537,3],[537,7,537,8],[537,12,537,13],[538,2,538,3],[538,7,538,8],[538,12,538,13],[534,2,535,3],[534,7,534,8],[534,12,534,13],[535,7,535,8],[535,12,535,13],[536,2,536,3],[536,7,536,8],[536,12,536,13],[532,2,532,3],[532,7,532,8],[532,12,532,13],[533,2,533,4],[533,7,533,8],[533,12,533,13],[530,2,530,3],[530,7,530,8],[530,12,530,13],[531,2,531,3],[531,7,531,8],[531,12,531,13],[528,2,529,3],[528,4,528,6],[528,7,528,8],[528,12,528,13],[529,7,529,8],[529,12,529,13],[526,2,526,3],[526,7,526,8],[526,12,526,13],[527,2,527,6],[527,7,527,8],[527,12,527,13],[524,2,524,3],[524,7,524,8],[524,12,524,13],[525,2,525,3],[525,7,525,8],[525,12,525,13],[522,2,522,3],[522,7,522,8],[522,12,522,13],[523,2,523,3],[523,7,523,8],[523,12,523,13],[520,2,520,3],[520,7,520,8],[520,12,520,13],[521,2,521,3],[521,7,521,8],[521,12,521,13],[518,2,518,3],[518,7,518,8],[518,12,518,13],[519,2,519,3],[519,7,519,8],[519,12,519,13],[516,2,516,3],[516,7,516,8],[516,12,516,13],[517,2,517,3],[517,7,517,8],[517,12,517,13],[514,2,514,3],[514,7,514,8],[514,12,514,13],[515,2,515,3],[515,7,515,8],[515,12,515,13],[512,2,512,3],[512,7,512,8],[512,12,512,13],[513,2,513,3],[513,7,513,8],[513,12,513,13],[510,2,510,3],[510,7,510,8],[510,12,510,13],[511,2,511,3],[511,7,511,8],[511,12,511,13],[508,2,508,3],[508,7,508,8],[508,12,508,13],[509,2,509,3],[509,7,509,8],[509,12,509,13],[506,2,506,3],[506,7,506,8],[506,12,506,13],[507,2,507,3],[507,7,507,8],[507,12,507,13],[504,2,504,3],[504,7,504,8],[504,12,504,13],[505,2,505,3],[505,7,505,8],[505,12,505,13],[502,7,502,8],[502,12,502,13],[503,2,503,3],[503,7,503,8],[503,12,503,13],[500,2,500,3],[500,7,500,8],[500,12,500,13],[501,2,501,3],[501,7,501,8],[501,12,501,13],[498,2,498,3],[498,7,498,8],[498,12,498,13],[499,2,499,3],[499,7,499,8],[499,12,499,13],[496,7,496,8],[496,12,496,13],[497,2,497,3],[497,7,497,8],[497,12,497,13],[494,2,494,3],[494,7,494,8],[494,12,494,13],[495,2,495,3],[495,7,495,8],[495,12,495,13],[492,2,492,3],[492,7,492,8],[492,12,492,13],[493,2,493,3],[493,7,493,8],[493,12,493,13],[490,7,490,8],[490,12,490,13],[491,2,491,3],[491,7,491,8],[491,12,491,13],[488,2,488,3],[488,7,488,8],[488,12,488,13],[489,2,489,3],[489,7,489,8],[489,12,489,13],[486,2,486,3],[486,7,486,8],[486,12,486,13],[487,2,487,3],[487,7,487,8],[487,12,487,13],[484,7,484,8],[484,12,484,13],[485,2,485,3],[485,7,485,8],[485,12,485,13],[482,2,482,3],[482,7,482,8],[482,12,482,13],[483,2,483,3],[483,7,483,8],[483,12,483,13],[480,2,480,3],[480,7,480,8],[480,12,480,13],[481,2,481,3],[481,7,481,8],[481,12,481,13],[478,7,478,8],[478,12,478,13],[479,2,479,3],[479,7,479,8],[479,12,479,13],[476,2,476,3],[476,7,476,8],[476,12,476,13],[477,2,477,3],[477,7,477,8],[477,12,477,13],[474,2,474,3],[474,7,474,8],[474,12,474,13],[475,2,475,3],[475,7,475,8],[475,12,475,13],[472,7,472,8],[472,12,472,13],[473,2,473,3],[473,7,473,8],[473,12,473,13],[470,2,470,3],[470,7,470,9],[470,12,470,14],[471,2,471,3],[471,7,471,8],[471,12,471,13],[468,2,468,3],[468,7,468,8],[468,12,468,13],[469,2,469,3],[469,7,469,8],[469,12,469,13],[466,7,466,8],[466,12,466,13],[467,2,467,3],[467,7,467,8],[467,12,467,13],[464,2,464,4],[464,7,464,8],[464,12,464,13],[465,2,465,3],[465,7,465,8],[465,12,465,13],[462,2,462,3],[462,7,462,8],[462,12,462,13],[463,2,463,3],[463,7,463,8],[463,12,463,13],[460,7,460,8],[460,12,460,13],[461,2,461,3],[461,7,461,8],[461,12,461,13],[458,2,458,3],[458,7,458,8],[458,12,458,13],[459,2,459,3],[459,7,459,8],[459,12,459,13],[457,2,457,3],[457,7,457,8],[457,12,457,13],[454,2,454,3],[454,7,454,8],[454,12,454,13],[455,2,455,3],[455,7,455,8],[455,12,455,13],[453,7,453,8],[453,12,453,13],[450,2,450,3],[450,7,450,8],[450,12,450,13],[451,2,451,3],[451,7,451,8],[451,12,451,13],[456,2,456,3],[456,7,456,8],[456,12,456,13],[449,7,449,8],[449,12,449,13],[446,2,446,3],[446,7,446,8],[446,12,446,13],[447,2,447,3],[447,7,447,8],[447,12,447,13],[452,2,452,3],[452,7,452,8],[452,12,452,13],[445,7,445,8],[445,12,445,13],[442,2,442,3],[442,7,442,8],[442,12,442,13],[443,2,443,3],[443,7,443,8],[443,12,443,13],[448,2,448,3],[448,7,448,8],[448,12,448,13],[441,7,441,8],[441,12,441,13],[438,2,438,3],[438,7,438,8],[438,12,438,13],[439,2,439,3],[439,7,439,8],[439,12,439,13],[444,2,444,3],[444,7,444,8],[444,12,444,13],[437,7,437,8],[437,12,437,13],[434,2,434,3],[434,7,434,8],[434,12,434,13],[435,2,435,3],[435,7,435,8],[435,12,435,13],[440,2,440,3],[440,7,440,8],[440,12,440,13],[433,7,433,8],[433,12,433,13],[430,2,430,3],[430,7,430,8],[430,12,430,13],[431,2,431,3],[431,7,431,8],[431,12,431,13],[436,2,436,3],[436,7,436,8],[436,12,436,13],[429,7,429,8],[429,12,429,13],[426,2,426,3],[426,7,426,8],[426,12,426,13],[427,2,427,3],[427,7,427,8],[427,12,427,13],[432,2,432,3],[432,7,432,8],[432,12,432,13],[425,7,425,8],[425,12,425,13],[422,2,422,3],[422,7,422,8],[422,12,422,13],[423,2,423,3],[423,7,423,8],[423,12,423,13],[428,2,428,3],[428,7,428,8],[428,12,428,13],[421,7,421,8],[421,12,421,13],[418,2,418,3],[418,7,418,8],[418,12,418,13],[419,2,419,3],[419,7,419,8],[419,12,419,13],[424,2,424,3],[424,7,424,8],[424,12,424,13],[417,7,417,8],[417,12,417,13],[414,2,414,3],[414,7,414,8],[414,12,414,13],[415,2,415,3],[415,7,415,8],[415,12,415,13],[420,2,420,3],[420,7,420,8],[420,12,420,13],[399,12,399,14],[413,7,413,8],[413,12,413,13],[410,2,410,3],[410,7,410,8],[410,12,410,13],[411,2,411,3],[411,7,411,8],[411,12,411,13],[416,2,416,3],[416,7,416,8],[416,12,416,13],[409,7,409,8],[409,12,409,13],[406,2,406,3],[406,7,406,8],[406,12,406,13],[407,2,407,3],[407,7,407,8],[407,12,407,13],[412,2,412,3],[412,7,412,8],[412,12,412,13],[1030,0,1032,0],[1033,0,1033,2],[224,0,227,0],[401,1,444,1],[402,2,402,3],[404,2,404,3],[409,2,409,3],[413,2,413,3],[417,2,417,3],[421,2,421,3],[425,2,425,3],[429,2,429,3],[433,2,433,3],[437,2,437,3],[441,2,441,3],[445,2,445,3],[449,2,449,3],[453,2,453,3],[405,2,405,3],[400,2,401,3],[408,2,408,3],[403,2,403,3],[398,2,398,5],[399,2,399,4],[460,2,460,3],[466,2,466,3],[472,2,472,3],[478,2,478,3],[484,2,484,3],[490,2,490,3],[496,2,496,3],[502,2,502,3],[221,0,223,0],[207,0,207,1],[134,0,138,0],[152,0,163,0],[150,0,151,0],[127,0,128,0],[129,0,131,0],[132,2,132,6],[132,7,132,11],[132,12,132,16],[119,2,119,6],[119,7,119,11],[119,12,119,16],[121,0,122,0],[123,0,126,0],[1024,0,1024,2],[1025,0,1025,1],[404,7,404,8],[404,12,404,13],[405,7,405,8],[405,12,405,13],[400,7,401,8],[400,12,401,13],[408,7,408,8],[408,12,408,13],[402,7,402,8],[402,12,402,13],[403,7,403,8],[403,12,403,13],[398,7,398,10],[398,12,398,15],[399,7,399,9],[42,0,43,0]],"merged_total":1016,"flags":["merged_cut"]}
[]
[{"$f":"A1026","v":"Mexico"}]
[{"$f":"A1034","v":"2015"}]
["Use of drinking water sources"]
[" by wealth quintile and sub-national region"]
["Notes:"]
["WHO/UNICEF JMP customised wealth index excludes water,"]
[" sanitation and hygiene assets."]
["Survey used for analysis:",{"$f":"A1025","v":"MICS15"}]
[{"$f":"B1028","v":""}]
[{"$f":"B1027","v":""}]
[]
[]
["Use of drinking water sources",null,"NATIONAL wealth index quintile",null,null,null,null,"URBAN wealth index quintile",null,null,null,null,"RURAL wealth index quintile",null,null,null,null,"SUB-REGIONS:",null,null,null,null,null,null,null,null,null,null,null,null,null,null,null,null,null,null,null,null,null,null,null,null,null,null,null,null,null,null,null,null,null,null,"Raw numbers of respondents:","Use of drinking water sources","NATIONAL wealth index quintile",null,null,null,null,"URBAN wealth index quintile",null,null,null,null,"RURAL wealth index quintile",null,null,null,null,"SUB-REGIONS:"]
["Weighted percentage (used in graphs)",null,"Poorest","Poor","Middle","Rich","Richest","Poorest","Poor","Middle","Rich","Richest","Poorest","Poor","Middle","Rich","Richest","Centro","DF-Edo México","Noreste","Noroeste","Sur",null,null,null,null,null,null,null,null,null,null,null,null,null,null,null,null,null,null,null,null,null,null,null,null,null,null,null,null,null,null,"Water data, raw numbers (weighted)",null,"Poorest","Poor","Middle","Rich","Richest","Poorest","Poor","Middle","Rich","Richest","Poorest","Poor","Middle","Rich","Richest","Centro","DF-Edo México","Noreste","Noroeste","Sur"]
["Water","Improved",95.672572190386617,99.455421840110191,99.888342324272912,99.764507242753098,99.804503367599068,99.009825928405419,99.749560707066848,99.976120332634153,99.947530882936135,99.745335737715422,89.572678164151327,95.212336575295012,98.231983253911949,99.702577966866812,99.130630258660858,99.112383855788252,99.231691729534148,99.404496640514949,99.971579303627351,96.933880612539696,null,null,null,null,null,null,null,null,null,null,null,null,null,null,null,null,null,null,null,null,null,null,null,null,null,null,null,null,null,null,"Water","Improved","N/A","N/A","N/A","N/A","N/A","N/A","N/A","N/A","N/A","N/A","N/A","N/A","N/A","N/A","N/A","N/A","N/A","N/A","N/A","N/A"]
[null,"Not Improved",4.3274278096133587,0.5445781598897993,0.11165767572709064,0.23549275724690757,0.1954966324009117,0.99017407159464643,0.25043929293315387,2.3879667365853834E-2,5.2469117063850962E-2,0.25466426228458133,10.427321835848705,4.7876634247049763,1.7680167460880463,0.29742203313318544,0.86936974133915101,0.88761614421173152,0.76830827046587513,0.59550335948516564,2.8420696372652564E-2,3.0661193874604651,null,null,null,null,null,null,null,null,null,null,null,null,null,null,null,null,null,null,null,null,null,null,null,null,null,null,null,null,null,null,null,"Not Improved","N/A","N/A","N/A","N/A","N/A","N/A","N/A","N/A","N/A","N/A","N/A","N/A","N/A","N/A","N/A","N/A","N/A","N/A","N/A","N/A"]
["Water ladder","Basic",93.992200166333902,99.331716051893082,99.772852243375738,99.764259102938425,99.804179902250809,98.877959324926849,99.678535517811596,99.909070098923891,99.94740405380152,99.745335737715422,84.694822869053908,94.411702872267625,96.82818935874154,99.191326520605855,99.079194067004693,98.731644915586998,98.860455612680539,99.368840346982211,99.96422812935117,95.875128897467135,null,null,null,null,null,null,null,null,null,null,null,null,null,null,null,null,null,null,null,null,null,null,null,null,null,null,null,null,null,null,"Water ladder","Basic","N/A","N/A","N/A","N/A","N/A","N/A","N/A","N/A","N/A","N/A","N/A","N/A","N/A","N/A","N/A","N/A","N/A","N/A","N/A","N/A"]
[null,"Limited",1.6105544872216215,0.12064531692478929,0.11509830454488681,0,0,0.12588777839127324,6.8864889386442293E-2,6.7039312412911944E-2,0,0,4.4841217073336015,0.72735134460326833,1.401146185417534,0.51025690096025433,4.6682866962588741E-2,0.37316627668166669,0.36626882448222808,3.5323104282333352E-2,7.0960094870002269E-3,1.0451948225038903,null,null,null,null,null,null,null,null,null,null,null,null,null,null,null,null,null,null,null,null,null,null,null,null,null,null,null,null,null,null,null,"Limited","N/A","N/A","N/A","N/A","N/A","N/A","N/A","N/A","N/A","N/A","N/A","N/A","N/A","N/A","N/A","N/A","N/A","N/A","N/A","N/A"]
[null,"Unimproved",4.0636889275829997,0.48596432147215707,3.7573957973021155E-2,4.7425601641571218E-2,0.19582009774919309,0.86636161850096216,0.20140754978942524,0,5.2595946198471993E-2,0.25466426228458133,9.7809770088664241,4.6043458356780098,1.7706644558409166,0.14579232935203365,0.13893869763365513,0.7242516437198574,0.71147550247905733,0.40713615207852649,1.0137156410000325E-2,2.8584452794336941,null,null,null,null,null,null,null,null,null,null,null,null,null,null,null,null,null,null,null,null,null,null,null,null,null,null,null,null,null,null,null,"Unimproved","N/A","N/A","N/A","N/A","N/A","N/A","N/A","N/A","N/A","N/A","N/A","N/A","N/A","N/A","N/A","N/A","N/A","N/A","N/A","N/A"]
[null,"Surface water",0.33355641886141979,6.1674309709942976E-2,7.4475494106362519E-2,0.18831529542001285,0,0.12979127818093358,5.1192043012554374E-2,2.3890588663193116E-2,0,0,1.0400784147461297,0.25659994745111198,0,0.15262424908184707,0.73518436839905965,0.17093716401146758,6.1800060358155155E-2,0.18870039665702157,1.8538704751814256E-2,0.22123100059545539,null,null,null,null,null,null,null,null,null,null,null,null,null,null,null,null,null,null,null,null,null,null,null,null,null,null,null,null,null,null,null,"Surface water","N/A","N/A","N/A","N/A","N/A","N/A","N/A","N/A","N/A","N/A","N/A","N/A","N/A","N/A","N/A","N/A","N/A","N/A","N/A","N/A"]
["Improved water point at more than 30 minutes","Yes",1.6846318843614236,0.12130965546145013,0.11522741623342157,0,0,0.12715443093832471,6.9039282332487573E-2,6.7055332326534822E-2,0,0,5.028229172966566,0.76451395338160522,1.4264029962695284,0.51178414970878217,4.7094531121965794E-2,0.37653699370629334,0.36912316370392201,3.5534833809703972E-2,7.0980449125045411E-3,1.0784062437964408,null,null,null,null,null,null,null,null,null,null,null,null,null,null,null,null,null,null,null,null,null,null,null,null,null,null,null,null,null,null,"Improved water point at more than 30 minutes","Yes","N/A","N/A","N/A","N/A","N/A","N/A","N/A","N/A","N/A","N/A","N/A","N/A","N/A","N/A","N/A","N/A","N/A","N/A","N/A","N/A"]
[null,"No",98.315368115638549,99.878690344538555,99.884772583766562,100,100,99.872845569061667,99.930960717667531,99.932944667673482,100,100,94.971770827033453,99.235486046618419,98.573597003730455,99.488215850291212,99.952905468878029,99.62346300629369,99.630876836296039,99.964465166190294,99.992901955087504,98.921593756203563,null,null,null,null,null,null,null,null,null,null,null,null,null,null,null,null,null,null,null,null,null,null,null,null,null,null,null,null,null,null,null,"No","N/A","N/A","N/A","N/A","N/A","N/A","N/A","N/A","N/A","N/A","N/A","N/A","N/A","N/A","N/A","N/A","N/A","N/A","N/A","N/A"]
["Manually calculated ratios","Improved wells",{"$f":"(C62+C63+C65)/(C62+C63+C64+C65+C66)*100","v":75.295473253154682},82.352425955623858,96.379266123047444,98.523196505128169,75.540045503345823,77.847701503728231,78.334941779550519,100,100,0,69.140431553285268,77.299676759609341,86.882411024892619,94.332930099570845,95.82346091282713,80.575535155159088,73.733396850076744,85.561739073527676,95.591824561953089,75.83671104167891]
[null,"Improved springs"]
[null,"Other"]
[null,null,"NATIONAL wealth index quintile",null,null,null,null,"URBAN wealth index quintile",null,null,null,null,"RURAL wealth index quintile",null,null,null,null,"SUB-REGIONS:",null,null,null,null,null,null,null,null,null,null,null,null,null,null,null,null,null,null,null,null,null,null,null,null,null,null,null,null,null,null,null,null,null,null,"Raw numbers of respondents:","Use of drinking water sources","NATIONAL wealth index quintile",null,null,null,null,"URBAN wealth index quintile",null,null,null,null,"RURAL wealth index quintile",null,null,null,null,"SUB-REGIONS:"]
["Percentage based on weighted population",null,"Poorest","Poor","Middle","Rich","Richest","Poorest","Poor","Middle","Rich","Richest","Poorest","Poor","Middle","Rich","Richest","Centro","DF-Edo México","Noreste","Noroeste","Sur",null,null,null,null,null,null,null,null,null,null,null,null,null,null,null,null,null,null,null,null,null,null,null,null,null,null,null,null,null,null,"Water data, raw numbers (weighted)",null,"Poorest","Poor","Middle","Rich","Richest","Poorest","Poor","Middle","Rich","Richest","Poorest","Poor","Middle","Rich","Richest","Centro","DF-Edo México","Noreste","Noroeste","Sur"]
["Piped water","Yes",77.3868971097382,93.520279068103051,97.038096772104211,98.629828933963836,98.937918503681431,93.32816569628605,96.552708657126146,98.475889149406441,99.390390085047471,98.864590446938564,58.709300819024357,71.837150401400436,80.687914148940294,91.332280150898654,93.122220016389676,92.699315557285303,97.422531754227961,95.974855550477642,98.364287298127991,80.886640365063428,null,null,null,null,null,null,null,null,null,null,null,null,null,null,null,null,null,null,null,null,null,null,null,null,null,null,null,null,null,null,"Piped water","Yes","N/A","N/A","N/A","N/A","N/A","N/A","N/A","N/A","N/A","N/A","N/A","N/A","N/A","N/A","N/A","N/A","N/A","N/A","N/A","N/A"]
[null,"No",22.613102890261779,6.4797209318969156,2.9619032278957769,1.3701710660361741,1.0620814963185574,6.67183430371401,3.4472913428738567,1.5241108505935801,0.60960991495252881,1.1354095530614601,41.290699180975771,28.162849598599632,19.312085851059777,8.6677198491013918,6.8777799836103712,7.3006844427145694,2.5774682457720655,4.0251444495223687,1.6357127018720306,19.113359634936657,null,null,null,null,null,null,null,null,null,null,null,null,null,null,null,null,null,null,null,null,null,null,null,null,null,null,null,null,null,null,null,"No","N/A","N/A","N/A","N/A","N/A","N/A","N/A","N/A","N/A","N/A","N/A","N/A","N/A","N/A","N/A","N/A","N/A","N/A","N/A","N/A"]
["Piped water on premises","Yes",74.250693629665491,91.627824881125065,95.592134926278206,96.142548270176363,96.158093981415135,91.404590154442772,94.373393877743666,97.654518603870841,96.350121746506289,95.729015268484545,53.439542038335205,68.807151283136093,78.546928868214891,89.891193985205859,91.112831279477192,91.292165821757521,95.734245771314221,91.710153564403186,95.059806621966374,80.058416651074253,null,null,null,null,null,null,null,null,null,null,null,null,null,null,null,null,null,null,null,null,null,null,null,null,null,null,null,null,null,null,"Piped water on premises","Yes","N/A","N/A","N/A","N/A","N/A","N/A","N/A","N/A","N/A","N/A","N/A","N/A","N/A","N/A","N/A","N/A","N/A","N/A","N/A","N/A"]
[null,"No",25.74930637033447,8.3721751188749334,4.4078650737217586,3.857451729823671,3.841906018584877,8.5954098455573273,5.6266061222562787,2.3454813961292156,3.6498782534937568,4.2709847315154894,46.560457961664994,31.192848716864006,21.453071131785155,10.108806014794212,8.8871687205229097,8.707834178242372,4.2657542286857852,8.2898464355969139,4.9401933780336913,19.941583348925811,null,null,null,null,null,null,null,null,null,null,null,null,null,null,null,null,null,null,null,null,null,null,null,null,null,null,null,null,null,null,null,"No","N/A","N/A","N/A","N/A","N/A","N/A","N/A","N/A","N/A","N/A","N/A","N/A","N/A","N/A","N/A","N/A","N/A","N/A","N/A","N/A"]
["Piped water into dwelling","Yes","N/A","N/A","N/A","N/A","N/A","N/A","N/A","N/A","N/A","N/A","N/A","N/A","N/A","N/A","N/A","N/A","N/A","N/A","N/A","N/A",null,null,null,null,null,null,null,null,null,null,null,null,null,null,null,null,null,null,null,null,null,null,null,null,null,null,null,null,null,null,"Piped water into dwelling","Yes","N/A","N/A","N/A","N/A","N/A","N/A","N/A","N/A","N/A","N/A","N/A","N/A","N/A","N/A","N/A","N/A","N/A","N/A","N/A","N/A"]
[null,"No","N/A","N/A","N/A","N/A","N/A","N/A","N/A","N/A","N/A","N/A","N/A","N/A","N/A","N/A","N/A","N/A","N/A","N/A","N/A","N/A",null,null,null,null,null,null,null,null,null,null,null,null,null,null,null,null,null,null,null,null,null,null,null,null,null,null,null,null,null,null,null,"No","N/A","N/A","N/A","N/A","N/A","N/A","N/A","N/A","N/A","N/A","N/A","N/A","N/A","N/A","N/A","N/A","N/A","N/A","N/A","N/A"]
["Water source on premises","Yes",86.98618854027896,97.251856800031845,98.981071650739807,99.376107991370617,99.794156472519973,96.89829939230799,98.190433335484656,99.793320606515607,99.641597773838868,100,73.490513184461477,84.709461084417384,91.036089426029804,96.25851524144376,96.711897095986572,94.902387858235642,97.511501743227697,97.938473760085344,98.922483683708762,92.706302830911767,null,null,null,null,null,null,null,null,null,null,null,null,null,null,null,null,null,null,null,null,null,null,null,null,null,null,null,null,null,null,"Water source on premises","Yes","N/A","N/A","N/A","N/A","N/A","N/A","N/A","N/A","N/A","N/A","N/A","N/A","N/A","N/A","N/A","N/A","N/A","N/A","N/A","N/A"]
[null,"No",13.013811459720944,2.7481431999681423,1.0189283492601868,0.6238920086294002,0.20584352748001289,3.1017006076921252,1.8095666645153212,0.2066793934844055,0.35840222616110567,0,26.509486815538608,15.290538915582699,8.9639105739702281,3.7414847585562674,3.2881029040134595,5.0976121417643476,2.4884982567723122,2.0615262399148344,1.0775163162912949,7.2936971690883494,null,null,null,null,null,null,null,null,null,null,null,null,null,null,null,null,null,null,null,null,null,null,null,null,null,null,null,null,null,null,null,"No","N/A","N/A","N/A","N/A","N/A","N/A","N/A","N/A","N/A","N/A","N/A","N/A","N/A","N/A","N/A","N/A","N/A","N/A","N/A","N/A"]
["Improved Water source on premises","Yes",89.130495485223122,97.452508854107677,99.091715156721904,99.592241731467155,99.79375326710273,97.399298229815798,98.303439765771657,99.793271240375446,99.693906286233741,100,78.491430226181436,86.225750502468387,91.717363244916044,96.453805788675709,97.560054691104952,95.411031233642788,97.926939364117516,98.300606244211707,98.93222716876042,94.294060173302114,null,null,null,null,null,null,null,null,null,null,null,null,null,null,null,null,null,null,null,null,null,null,null,null,null,null,null,null,null,null,"Improved water source on premises","Yes","N/A","N/A","N/A","N/A","N/A","N/A","N/A","N/A","N/A","N/A","N/A","N/A","N/A","N/A","N/A","N/A","N/A","N/A","N/A","N/A"]
[null,"No",10.869504514776816,2.5474911458923253,0.90828484327808212,0.40775826853286806,0.20624673289726397,2.6007017701842385,1.6965602342283368,0.20672875962455337,0.30609371376625577,0,21.508569773818667,13.774249497531715,8.282636755083999,3.5461942113243281,2.4399453088950658,4.5889687663572252,2.0730606358824164,1.6993937557883347,1.0677728312396138,5.7059398266978443,null,null,null,null,null,null,null,null,null,null,null,null,null,null,null,null,null,null,null,null,null,null,null,null,null,null,null,null,null,null,null,"No","N/A","N/A","N/A","N/A","N/A","N/A","N/A","N/A","N/A","N/A","N/A","N/A","N/A","N/A","N/A","N/A","N/A","N/A","N/A","N/A"]
["Piped water on premises available when needed","Yes","N/A","N/A","N/A","N/A","N/A","N/A","N/A","N/A","N/A","N/A","N/A","N/A","N/A","N/A","N/A","N/A","N/A","N/A","N/A","N/A",null,null,null,null,null,null,null,null,null,null,null,null,null,null,null,null,null,null,null,null,null,null,null,null,null,null,null,null,null,null,"Piped water on premises available when needed","Yes","N/A","N/A","N/A","N/A","N/A","N/A","N/A","N/A","N/A","N/A","N/A","N/A","N/A","N/A","N/A","N/A","N/A","N/A","N/A","N/A"]
[null,"No","N/A","N/A","N/A","N/A","N/A","N/A","N/A","N/A","N/A","N/A","N/A","N/A","N/A","N/A","N/A","N/A","N/A","N/A","N/A","N/A",null,null,null,null,null,null,null,null,null,null,null,null,null,null,null,null,null,null,null,null,null,null,null,null,null,null,null,null,null,null,null,"No","N/A","N/A","N/A","N/A","N/A","N/A","N/A","N/A","N/A","N/A","N/A","N/A","N/A","N/A","N/A","N/A","N/A","N/A","N/A","N/A"]
["Water point at more than 30 minutes","Yes",2.2977951607184379,0.12064531692478929,0.12261309613949102,0,0,0.12588777839127324,6.8864889386442293E-2,6.7039312412911944E-2,0,0,6.7133287107760342,1.5105397969839407,1.401146185417534,0.51025690096025433,7.9124496569126235E-2,0.44970692552074892,0.39852854572083779,4.3072428001552039E-2,7.0960094870002269E-3,1.602737212232578,null,null,null,null,null,null,null,null,null,null,null,null,null,null,null,null,null,null,null,null,null,null,null,null,null,null,null,null,null,null,"Water point at more than 30 minutes","Yes","N/A","N/A","N/A","N/A","N/A","N/A","N/A","N/A","N/A","N/A","N/A","N/A","N/A","N/A","N/A","N/A","N/A","N/A","N/A","N/A"]
[null,"No",97.702204839281549,99.879354683075221,99.877386903860526,100,100,99.87411222160874,99.931135110613567,99.93296068758707,100,100,93.286671289224017,98.489460203016051,98.598853814582455,99.489743099039757,99.920875503430864,99.550293074479228,99.601471454279192,99.956927571998477,99.992903990513,98.397262787767488,null,null,null,null,null,null,null,null,null,null,null,null,null,null,null,null,null,null,null,null,null,null,null,null,null,null,null,null,null,null,null,"No","N/A","N/A","N/A","N/A","N/A","N/A","N/A","N/A","N/A","N/A","N/A","N/A","N/A","N/A","N/A","N/A","N/A","N/A","N/A","N/A"]
["Water source available when needed","Yes",67.957401283054253,71.306902396252411,89.027562065998026,64.125128780873325,89.08913599968227,50.146131405520137,72.394001719840801,95.13601327831914,60.404523058745454,88.416669343183202,68.911874948767732,77.960953906761887,87.097839127560022,80.718388863790338,85.905115097720881,72.609223565629378,87.250953076405409,65.478550418361138,82.211257901298779,81.219987197723185,null,null,null,null,null,null,null,null,null,null,null,null,null,null,null,null,null,null,null,null,null,null,null,null,null,null,null,null,null,null,"Water source available when needed","Yes","N/A","N/A","N/A","N/A","N/A","N/A","N/A","N/A","N/A","N/A","N/A","N/A","N/A","N/A","N/A","N/A","N/A","N/A","N/A","N/A"]
[null,"No",32.042598716945804,28.693097603747564,10.972437934001986,35.874871219126675,10.910864000317723,49.853868594479835,27.605998280159199,4.8639867216808579,39.595476941254539,11.583330656816813,31.088125051232279,22.03904609323811,12.902160872440001,19.281611136209662,14.094884902279118,27.390776434370643,12.749046923594577,34.521449581638876,17.788742098701206,18.780012802276751,null,null,null,null,null,null,null,null,null,null,null,null,null,null,null,null,null,null,null,null,null,null,null,null,null,null,null,null,null,null,null,"No","N/A","N/A","N/A","N/A","N/A","N/A","N/A","N/A","N/A","N/A","N/A","N/A","N/A","N/A","N/A","N/A","N/A","N/A","N/A","N/A"]
["Improved water source available when needed","Yes",67.957401283054253,71.306902396252411,89.027562065998026,64.125128780873325,89.08913599968227,50.146131405520137,72.394001719840801,95.13601327831914,60.404523058745454,88.416669343183202,68.911874948767732,77.960953906761887,87.097839127560022,80.718388863790338,85.905115097720881,72.609223565629378,87.250953076405409,65.478550418361138,82.211257901298779,81.219987197723185,null,null,null,null,null,null,null,null,null,null,null,null,null,null,null,null,null,null,null,null,null,null,null,null,null,null,null,null,null,null,"Improved water source available when needed","Yes","N/A","N/A","N/A","N/A","N/A","N/A","N/A","N/A","N/A","N/A","N/A","N/A","N/A","N/A","N/A","N/A","N/A","N/A","N/A","N/A"]
[null,"No",32.042598716945804,28.693097603747564,10.972437934001986,35.874871219126675,10.910864000317723,49.853868594479835,27.605998280159199,4.8639867216808579,39.595476941254539,11.583330656816813,31.088125051232279,22.03904609323811,12.902160872440001,19.281611136209662,14.094884902279118,27.390776434370643,12.749046923594577,34.521449581638876,17.788742098701206,18.780012802276751,null,null,null,null,null,null,null,null,null,null,null,null,null,null,null,null,null,null,null,null,null,null,null,null,null,null,null,null,null,null,null,"No","N/A","N/A","N/A","N/A","N/A","N/A","N/A","N/A","N/A","N/A","N/A","N/A","N/A","N/A","N/A","N/A","N/A","N/A","N/A","N/A"]
["Microbiological quality at point of collection","Not contaminated (No E. coli in 100 mL)","N/A","N/A","N/A","N/A","N/A","N/A","N/A","N/A","N/A","N/A","N/A","N/A","N/A","N/A","N/A","N/A","N/A","N/A","N/A","N/A",null,null,null,null,null,null,null,null,null,null,null,null,null,null,null,null,null,null,null,null,null,null,null,null,null,null,null,null,null,null,"Microbiological quality at point of collection","Not contaminated (No E. coli in 100 mL)","N/A","N/A","N/A","N/A","N/A","N/A","N/A","N/A","N/A","N/A","N/A","N/A","N/A","N/A","N/A","N/A","N/A","N/A","N/A","N/A"]
[null,"Contaminated (E. coli detected in 100 mL)","N/A","N/A","N/A","N/A","N/A","N/A","N/A","N/A","N/A","N/A","N/A","N/A","N/A","N/A","N/A","N/A","N/A","N/A","N/A","N/A",null,null,null,null,null,null,null,null,null,null,null,null,null,null,null,null,null,null,null,null,null,null,null,null,null,null,null,null,null,null,null,"Contaminated (E. coli detected in 100 mL)","N/A","N/A","N/A","N/A","N/A","N/A","N/A","N/A","N/A","N/A","N/A","N/A","N/A","N/A","N/A","N/A","N/A","N/A","N/A","N/A"]
[null,"Highly contaminated (>100 CFU/100 mL)","N/A","N/A","N/A","N/A","N/A","N/A","N/A","N/A","N/A","N/A","N/A","N/A","N/A","N/A","N/A","N/A","N/A","N/A","N/A","N/A",null,null,null,null,null,null,null,null,null,null,null,null,null,null,null,null,null,null,null,null,null,null,null,null,null,null,null,null,null,null,null,"Highly contaminated (>100 CFU/100 mL)","N/A","N/A","N/A","N/A","N/A","N/A","N/A","N/A","N/A","N/A","N/A","N/A","N/A","N/A","N/A","N/A","N/A","N/A","N/A","N/A"]
["Microbiological quality of improved water sources at point of collection","Not contaminated (No E. coli in 100 mL)","N/A","N/A","N/A","N/A","N/A","N/A","N/A","N/A","N/A","N/A","N/A","N/A","N/A","N/A","N/A","N/A","N/A","N/A","N/A","N/A",null,null,null,null,null,null,null,null,null,null,null,null,null,null,null,null,null,null,null,null,null,null,null,null,null,null,null,null,null,null,"Microbiological quality of improved water sources at point of collection","Not contaminated (No E. coli in 100 mL)","N/A","N/A","N/A","N/A","N/A","N/A","N/A","N/A","N/A","N/A","N/A","N/A","N/A","N/A","N/A","N/A","N/A","N/A","N/A","N/A"]
[null,"Contaminated (E. coli detected in 100 mL)","N/A","N/A","N/A","N/A","N/A","N/A","N/A","N/A","N/A","N/A","N/A","N/A","N/A","N/A","N/A","N/A","N/A","N/A","N/A","N/A",null,null,null,null,null,null,null,null,null,null,null,null,null,null,null,null,null,null,null,null,null,null,null,null,null,null,null,null,null,null,null,"Contaminated (E. coli detected in 100 mL)","N/A","N/A","N/A","N/A","N/A","N/A","N/A","N/A","N/A","N/A","N/A","N/A","N/A","N/A","N/A","N/A","N/A","N/A","N/A","N/A"]
[null,"Highly contaminated (>100 CFU/100 mL)","N/A","N/A","N/A","N/A","N/A","N/A","N/A","N/A","N/A","N/A","N/A","N/A","N/A","N/A","N/A","N/A","N/A","N/A","N/A","N/A",null,null,null,null,null,null,null,null,null,null,null,null,null,null,null,null,null,null,null,null,null,null,null,null,null,null,null,null,null,null,null,"Highly contaminated (>100 CFU/100 mL)","N/A","N/A","N/A","N/A","N/A","N/A","N/A","N/A","N/A","N/A","N/A","N/A","N/A","N/A","N/A","N/A","N/A","N/A","N/A","N/A"]
["Microbiological quality of piped on premises at point of collection","Not contaminated (No E. coli in 100 mL)","N/A","N/A","N/A","N/A","N/A","N/A","N/A","N/A","N/A","N/A","N/A","N/A","N/A","N/A","N/A","N/A","N/A","N/A","N/A","N/A",null,null,null,null,null,null,null,null,null,null,null,null,null,null,null,null,null,null,null,null,null,null,null,null,null,null,null,null,null,null,"Microbiological quality of piped on premises at point of collection","Not contaminated (No E. coli in 100 mL)","N/A","N/A","N/A","N/A","N/A","N/A","N/A","N/A","N/A","N/A","N/A","N/A","N/A","N/A","N/A","N/A","N/A","N/A","N/A","N/A"]
[null,"Contaminated (E. coli detected in 100 mL)","N/A","N/A","N/A","N/A","N/A","N/A","N/A","N/A","N/A","N/A","N/A","N/A","N/A","N/A","N/A","N/A","N/A","N/A","N/A","N/A",null,null,null,null,null,null,null,null,null,null,null,null,null,null,null,null,null,null,null,null,null,null,null,null,null,null,null,null,null,null,null,"Contaminated (E. coli detected in 100 mL)","N/A","N/A","N/A","N/A","N/A","N/A","N/A","N/A","N/A","N/A","N/A","N/A","N/A","N/A","N/A","N/A","N/A","N/A","N/A","N/A"]
[null,"Highly contaminated (>100 CFU/100 mL)","N/A","N/A","N/A","N/A","N/A","N/A","N/A","N/A","N/A","N/A","N/A","N/A","N/A","N/A","N/A","N/A","N/A","N/A","N/A","N/A",null,null,null,null,null,null,null,null,null,null,null,null,null,null,null,null,null,null,null,null,null,null,null,null,null,null,null,null,null,null,null,"Highly contaminated (>100 CFU/100 mL)","N/A","N/A","N/A","N/A","N/A","N/A","N/A","N/A","N/A","N/A","N/A","N/A","N/A","N/A","N/A","N/A","N/A","N/A","N/A","N/A"]
[null,null,"NATIONAL wealth index quintile",null,null,null,null,"URBAN wealth index quintile",null,null,null,null,"RURAL wealth index quintile",null,null,null,null,"SUB-REGIONS:",null,null,null,null,null,null,null,null,null,null,null,null,null,null,null,null,null,null,null,null,null,null,null,null,null,null,null,null,null,null,null,null,null,null,"Raw numbers of respondents:","Use of drinking water sources","NATIONAL wealth index quintile",null,null,null,null,"URBAN wealth index quintile",null,null,null,null,"RURAL wealth index quintile",null,null,null,null,"SUB-REGIONS:"]
["Percentage based on weighted population",null,"Poorest","Poor","Middle","Rich","Richest","Poorest","Poor","Middle","Rich","Richest","Poorest","Poor","Middle","Rich","Richest","Centro","DF-Edo México","Noreste","Noroeste","Sur",null,null,null,null,null,null,null,null,null,null,null,null,null,null,null,null,null,null,null,null,null,null,null,null,null,null,null,null,null,null,"Water data, raw numbers (weighted)",null,"Poorest","Poor","Middle","Rich","Richest","Poorest","Poor","Middle","Rich","Richest","Poorest","Poor","Middle","Rich","Richest","Centro","DF-Edo México","Noreste","Noroeste","Sur"]
["Principal fuente de agua potable","Tubería dentro de la vivienda",16.285031496493385,16.998000034243844,16.802179016681198,13.522748272360008,9.0421525821479687,14.991155681369353,16.716088155743158,14.924766952375865,11.771775467586229,9.8706444142492167,12.592040232330795,18.236365240228082,19.895298089518803,19.68328815261934,16.681660983278036,11.891658478253401,20.354472106708602,23.013288386931951,10.016151253336622,5.8927592978605414]
[null,"Tubería dentro del terreno, patio o lote",19.219944686400982,5.4012417646106403,3.145376445784636,1.8473878022637489,0.4641138554653545,7.5707983153195855,3.420982452283444,1.612460292378707,1.2113995143517673,0.26232721690359861,28.096675618311739,26.071264200284709,14.888242736502278,7.9865086078117207,5.9452518563232903,13.618542706837353,4.45724866009677,2.8751861144780291,3.029441988317306,8.1759080459779163]
[null,"Tubería del vecino",0.66319103327177664,1.2289970718805936E-2,0,0,0,0.17971893905177203,0,0,0,0,2.1617468470929868,0.11016445095784586,5.2896588795146429E-2,0,0,0.32785232647448276,0.11351581204408423,0,0.22837710121202745,6.7252567815995229E-2]
[null,"Llave/grifo público",1.4868657917579566,1.1640695824499057,0.84386893785521366,1.8934125732440927,1.1448846480367687,1.0433141232891789,1.1937052803094779,0.31035440640920875,2.4098598691456323,1.3475635018484375,1.4588244451957919,1.6524334932122409,1.9914532932199909,1.3263839534482484,0.86834509760474221,0.61653059444486202,0.33093230294297948,2.7121392998468252,2.3171186067763103,0.40964388304743388]
[null,"Pozo con tubería",1.7225773413706447,0.34672890600935946,0.25606088480013417,0.17639216820856607,0.10960484096342868,0.24059521447622415,7.9248856923685024E-2,0,0.1001371410142963,0,3.3042112441321105,2.1989100715386938,2.2716370280860132,0.54624641088642267,1.5408585101305807,0.55801021151020147,0.15689186208012113,0.69199876211031552,0.15290300908567886,1.0542146884404728]
[null,"Pozo protegido",7.7800285676956076,1.5756376148627356,0.68234282645295219,2.8606106473954521E-2,0,1.7226413788898762,0.57009403944581749,0.62207293592422197,1.3374244764374939E-2,0,12.878200045360019,10.307777504366824,8.2695883213963111,1.5922401518827642,0.62281806985346366,1.2926668301021296,0.86540587005981462,0.8056312830036525,2.8794790520238318E-2,6.8862258573521826]
[null,"Pozo no protegido",2.6536545090418047,0.36703865449240075,3.7442582157051499E-2,7.110205765296496E-3,0,0.39726130266967219,0.13318400919138268,0,0,0,5.9932367933399391,4.0495837942274475,1.1297913327454292,0.14530644121272371,0.13818317387731383,0.21968745845493209,0.30188830723572779,0.32695181459470074,4.0187814103990012E-3,2.1040331888585295]
[null,"Manantial protegido",2.4530626009961027,0.33271327380631283,5.8269535852785131E-2,0.26935068388830335,0,0.98080112974633704,7.2663813240586003E-2,0,6.4794497116711633E-2,0,4.4485104638691295,2.8129366825550282,1.1689721512940996,0.28025585664216962,1.0066971874996606,0.85778538540615024,0.44869615297725679,0.86782953520623174,3.6171618782014699E-2,0.93751474807147672]
[null,"Manantial no protegido",1.2690133449765921,0.11620986175663391,0,0,3.5490174843219278E-2,0.44049242887174833,6.6501048892635514E-2,0,0,4.623138047853706E-2,3.214998209879623,0.44927619026987575,0.63822541334261684,0,0,0.43324563216475137,0.22213492059548642,7.2211678357881712E-2,6.0281721155985013E-3,0.72468388204394585]
[null,"Recogen agua de lluvia",1.8506468157729641,0.11751651049817374,7.9308464797394368E-2,0,0,0,0,0,0,0,6.9041316346366095,0.91117058508837379,0.61080898389239391,7.9538464591191946E-2,0.34171052654299983,0.82968712370811459,0,0.38662125906849232,0,0.9436841900322549]
[null,"Carro-tanque / camión cisterna",0.1355591478859951,4.684538464380316E-2,0,0,4.0658568428648158E-2,1.9849475575777646E-2,0,0,0,0,0.38576828871819097,6.2186655970434136E-2,0.13728057116878251,0.13617355512009136,0.17530029421484059,0,2.8874187092312823E-2,6.6783686253516966E-2,1.5228751511070397E-2,9.8827447126420664E-2]
[null,"Carreta con tanque / tambor pequeño",0,0,0,0,3.7337689165815584E-2,0,0,0,0,4.863805043620327E-2,0,0,0,0,0,0,3.4100815512733376E-2,0,0,0]
[null,"Agua de superficie (río, arroyo, represa, lago, estanque, canal, canal de irrigación)",0.32826035604838527,6.1329643640764625E-2,7.4215093570039137E-2,0.18811707558167032,0,0.12901228195186162,5.0754234849135681E-2,2.3879667365853834E-2,0,0,1.0022342498507046,0.252731513166987,0,0.15211559192046176,0.7311865674618373,0.169491156627469,6.1403075139536696E-2,0.18859487620205378,1.8373742846655054E-2,0.22025713041066228]
[null,"Agua embotellada/envasada",44.075664708741158,73.460378798266788,78.020936212048682,82.026609636314404,88.965751183391134,72.260951670687291,77.696778109120771,82.506465745546194,84.376190148957136,88.216162554277986,17.34256934450416,32.849127691092946,48.945805490038261,68.071942813865007,71.947987733213409,69.119650199051776,72.441553960019462,67.985018313615967,84.147392184086186,72.467849886815117]
[null,"Otra",7.6499599546577438E-2,0,0,0,0.16000645755769241,2.3408058101364173E-2,0,0,0,0.2084328818060443,0.21685258277844172,3.6071927040664926E-2,0,0,0,6.5191896964579055E-2,0.14613520043485762,7.7449903305293584E-3,0,1.7145186147328153E-2]
[null,"NR",0,0,0,4.0265475899940763E-2,0,0,0,0,5.2469117063850962E-2,0,0,0,0,0,0,0,3.674676706026659E-2,0,0,0]
[]
[]
[]
[]
[]
[]
[]
[]
[]
[]
[]
[]
[]
[]
[]
[]
[]
[]
[]
[]
[]
[]
[]
[]
[]
[]
[]
[]
[]
[]
[]
[]
[]
[]
[{"$f":"A1026","v":"Mexico"}]
[{"$f":"A1034","v":"2015"}]
["Use of sanitation facilities"]
[" by wealth quintile and sub-national region"]
["Notes:"]
["WHO/UNICEF JMP customised wealth index excludes water,"]
[" sanitation and hygiene assets."]
["Survey used for analysis:",{"$f":"A1025","v":"MICS15"}]
[{"$f":"B1030","v":""}]
[{"$f":"B1029","v":""}]
[]
[]
["Use of sanitation facilities",null,"NATIONAL wealth index quintile",null,null,null,null,"URBAN wealth index quintile",null,null,null,null,"RURAL wealth index quintile",null,null,null,null,"SUB-REGIONS:",null,null,null,null,null,null,null,null,null,null,null,null,null,null,null,null,null,null,null,null,null,null,null,null,null,null,null,null,null,null,null,null,null,null,"Raw numbers of respondents:","Use of sanitation facilities","NATIONAL wealth index quintile",null,null,null,null,"URBAN wealth index quintile",null,null,null,null,"RURAL wealth index quintile",null,null,null,null,"SUB-REGIONS:"]
["Weighted percentage (used in graphs)",null,"Poorest","Poor","Middle","Rich","Richest","Poorest","Poor","Middle","Rich","Richest","Poorest","Poor","Middle","Rich","Richest","Centro","DF-Edo México","Noreste","Noroeste","Sur",null,null,null,null,null,null,null,null,null,null,null,null,null,null,null,null,null,null,null,null,null,null,null,null,null,null,null,null,null,null,"Sanitation data, raw numbers (weighted)",null,"Poorest","Poor","Middle","Rich","Richest","Poorest","Poor","Middle","Rich","Richest","Poorest","Poor","Middle","Rich","Richest","Centro","DF-Edo México","Noreste","Noroeste","Sur"]
["Sanitation","Improved",91.812138494226517,97.972723052938989,99.761038685329964,99.973585666736994,99.704305209426451,96.9377052543894,99.033889538645852,100,99.967977481534405,99.665632652831789,83.970875053173373,93.539719516407061,93.435059598947703,97.530053869744975,99.599321485169796,96.376022729012789,98.538336342854663,98.414876053173074,99.214234631890491,96.29864142402802,null,null,null,null,null,null,null,null,null,null,null,null,null,null,null,null,null,null,null,null,null,null,null,null,null,null,null,null,null,null,"Sanitation","Improved",7413.3303749894676,7916.5922446481236,8054.4025142052797,8070.8328685933484,8055.2314953767254,6012.1856168933209,6124.3026317918011,6220.0481023687307,6193.3136000779514,6181.3141986901628,1566.4399732681291,1762.9284025049396,1754.1476525674293,1829.3728932230817,1866.3364264274051,5980.3287503495376,8716.6982255830389,8638.6887204103441,8020.4432247031427,8154.2305767669095]
[null,"Not Improved",8.1878615057734727,2.0272769470609764,0.23896131467000511,2.6414333263022935E-2,0.29569479057352582,3.0622947456106808,0.96611046135412182,0,3.2022518465594223E-2,0.33436734716820576,16.029124946826737,6.4602804835929808,6.5649404010523078,2.4699461302550905,0.40067851483021344,3.62397727098719,1.4616636571453758,1.5851239468270908,0.78576536810950026,3.7013585759720939,null,null,null,null,null,null,null,null,null,null,null,null,null,null,null,null,null,null,null,null,null,null,null,null,null,null,null,null,null,null,null,"Not Improved",661.12524337699062,163.81217605011139,19.293008964620146,2.1324199555254602,23.889540025815219,189.92696779785658,59.74472848270544,0,1.9838902828492828,20.737636190286789,299.01632009097278,121.75589163143425,123.25003958022498,46.328821928515204,7.508092388217797,224.87518005631182,129.29872250235323,139.13945644263214,63.520991178764753,313.41803819300054]
["Sanitation ladder","Basic",80.725986384509511,91.451588640776919,97.000751198572729,98.384427134077796,99.383926002916184,84.496223078043471,95.148917933952433,97.393530475677537,98.555835908326955,99.471387339065998,75.805654302578546,85.087835746099273,86.600994265204321,94.051681480944666,98.509997963088992,91.171845011709323,90.882142725583989,95.595078646942639,97.356120011839465,91.554871852770958,null,null,null,null,null,null,null,null,null,null,null,null,null,null,null,null,null,null,null,null,null,null,null,null,null,null,null,null,null,null,"Sanitation ladder","Basic",6515.6600825496216,7389.6582113281047,7822.4434783200504,7940.0689204605796,8021.6058814138078,5239.5482319330622,5878.9388533623896,6054.0217269807035,6103.3511908849905,6161.5184005004248,1413.696384679276,1602.4635180357461,1625.8450677118683,1764.1290026669949,1845.9241973167248,5651.3276323282898,8037.6893765627347,8386.005326234721,7865.5496382457104,7748.8646007007064]
[null,"Limited",11.082980516903415,6.5211344121621408,2.7600094425701891,1.5891503099172719,0.32009382637131634,12.440896167891468,3.8841309870895633,2.6064695243224572,1.4121285821535454,0.19382482003213281,8.1604023151670813,8.4471526067375127,6.8340653337434079,3.4783723888003228,1.0893235220807953,5.2002844422986882,7.6558767969220582,2.8188208482179289,1.8576466637402798,4.7420116518767905,null,null,null,null,null,null,null,null,null,null,null,null,null,null,null,null,null,null,null,null,null,null,null,null,null,null,null,null,null,null,null,"Limited",894.54383877952444,526.93403332002367,222.57578005697556,128.25162836511447,25.835833051604936,771.45076011186745,239.98768527667596,162.01921271251092,87.450089425312086,12.006017278424371,152.18299158045374,159.0856526656687,128.30258485556163,65.243890556087194,20.412229110680276,322.34195941691297,677.0918659422282,247.27890788353935,150.08211134743061,401.34626898313138]
[null,"Unimproved",4.5847955311510873,1.6835527036092928,0.23112776242065791,2.6422556004901572E-2,0.29598017071250887,2.0054230749198374,0.87435782738754553,0,3.2035509519527931E-2,0.33478784090186503,7.8719630506718801,3.5757682652953968,5.1370398052891693,1.7171956602954439,0.36576929691323123,2.1846671165283249,0.89256235398913053,0.98546549244970583,0.32537863746015466,2.642590899999032,null,null,null,null,null,null,null,null,null,null,null,null,null,null,null,null,null,null,null,null,null,null,null,null,null,null,null,null,null,null,null,"Unimproved",370.05393884794137,136.03786708722998,18.638864498121372,2.1324199555254602,23.889540025815219,124.35480005738147,54.023695852624428,0,1.9838902828492828,20.737636190286789,146.80390015029712,67.342624757599665,96.442666749205202,32.209468452670414,6.8539479217190244,135.41756933283344,78.938928324350442,86.44920832196064,26.287837106248357,223.65908732924046]
[null,"Open defecation",3.6062375674359748,0.34372424345168434,8.1115964364114057E-3,0,0,1.0574576791453509,9.2593251570512167E-2,0,0,0,8.1619803315826491,2.8892433818678809,1.4279005957631403,0.75275046995964723,3.4909217916982233E-2,1.4432034294636369,0.56941812350473353,0.60063501238963213,0.46085468696014587,1.0605255953533648,null,null,null,null,null,null,null,null,null,null,null,null,null,null,null,null,null,null,null,null,null,null,null,null,null,null,null,null,null,null,null,"Open defecation",291.07130452904903,27.77430896288147,0.65414446649877289,0,0,65.57216774047501,5.7210326300810106,0,0,0,152.21241994067537,54.413266873834573,26.807372831019798,14.119353475844802,0.65414446649877289,89.457610723478453,50.359794178002801,52.690248120671498,37.233154072516392,89.758950863760191]
["Shared among Improved Sanitation","Yes",12.071784370261607,6.6560714135081094,2.7666283063923611,1.5895703150239964,0.32104405310776707,12.83398585048543,3.9220553435513659,2.6064695243224572,1.4125811097094176,0.19447590170452383,9.71869186654461,9.031008348312179,7.3142408888883255,3.5664620809559064,1.0937057661010214,5.3960460059984818,7.769464856327307,2.8642507437239955,1.8723678436830458,4.9243666869529781,null,null,null,null,null,null,null,null,null,null,null,null,null,null,null,null,null,null,null,null,null,null,null,null,null,null,null,null,null,null,"Shared among improved sanitation facilities","Yes","N/A","N/A","N/A","N/A","N/A","N/A","N/A","N/A","N/A","N/A","N/A","N/A","N/A","N/A","N/A","N/A","N/A","N/A","N/A","N/A"]
[null,"No",87.928215629738403,93.343928586491955,97.233371693607666,98.410429684975952,99.678955946892245,87.166014149514652,96.077944656448693,97.393530475677537,98.587418890290607,99.805524098295479,90.281308133455425,90.968991651687844,92.685759111111707,96.433537919044113,98.906294233898976,94.603953994001472,92.230535143672569,97.135749256275744,98.127632156317006,95.075633313047064,null,null,null,null,null,null,null,null,null,null,null,null,null,null,null,null,null,null,null,null,null,null,null,null,null,null,null,null,null,null,null,"No","N/A","N/A","N/A","N/A","N/A","N/A","N/A","N/A","N/A","N/A","N/A","N/A","N/A","N/A","N/A","N/A","N/A","N/A","N/A","N/A"]
["Manually calculated ratios","Improved latrines",{"$f":"(C158+C159)/(C158+C159+C160)*100","v":80.516689983718095},{"$f":"(D158+D159)/(D158+D159+D160)*100","v":85.324817887386388},95.896861923372725,99.64925427676468,95.400289210505647,91.79273479787085,95.032487564068475,100,100,100,70.878214574404012,87.502585233919163,78.618351008409675,84.506600067417551,98.067941269957743,88.663040360496609,76.752315862790894,81.959174518762808,94.827151075358856,82.713261418207367]
[null,"Other"]
[null,"Other"]
[null,null,"NATIONAL wealth index quintile",null,null,null,null,"URBAN wealth index quintile",null,null,null,null,"RURAL wealth index quintile",null,null,null,null,"SUB-REGIONS:",null,null,null,null,null,null,null,null,null,null,null,null,null,null,null,null,null,null,null,null,null,null,null,null,null,null,null,null,null,null,null,null,null,null,"Raw numbers of respondents:","Use of sanitation facilities","NATIONAL wealth index quintile",null,null,null,null,"URBAN wealth index quintile",null,null,null,null,"RURAL wealth index quintile",null,null,null,null,"SUB-REGIONS:"]
["Percentage based on weighted population",null,"Poorest","Poor","Middle","Rich","Richest","Poorest","Poor","Middle","Rich","Richest","Poorest","Poor","Middle","Rich","Richest","Centro","DF-Edo México","Noreste","Noroeste","Sur",null,null,null,null,null,null,null,null,null,null,null,null,null,null,null,null,null,null,null,null,null,null,null,null,null,null,null,null,null,null,"Sanitation data, raw numbers (weighted)",null,"Poorest","Poor","Middle","Rich","Richest","Poorest","Poor","Middle","Rich","Richest","Poorest","Poor","Middle","Rich","Richest","Centro","DF-Edo México","Noreste","Noroeste","Sur"]
["Sanitation type","Sewer connection",38.879667483298363,74.671856141144872,87.476287642423046,92.085562348485368,97.392586303730283,79.1134314272377,87.852636892044359,94.227749410394267,96.938560766688283,98.353586727288985,8.3831198357141083,24.268414503953366,28.180049052301783,48.630566603697432,62.815235307756801,76.373564897358605,93.026905745950941,82.543864848852294,82.80588692219149,54.682587961359552,null,null,null,null,null,null,null,null,null,null,null,null,null,null,null,null,null,null,null,null,null,null,null,null,null,null,null,null,null,null,"Sanitation type","Sewer connection","N/A","N/A","N/A","N/A","N/A","N/A","N/A","N/A","N/A","N/A","N/A","N/A","N/A","N/A","N/A","N/A","N/A","N/A","N/A","N/A"]
[null,"Septic tank connection",21.501551964128591,15.262894704478521,7.89274528416483,5.2379540170972323,1.974013473068122,10.002970914926724,7.3743567684331675,3.745663476968228,2.275591179544707,1.0656437987465268,19.865347254307331,32.000999745216092,32.527616533138811,33.429601789749235,24.608338867697363,7.1766190702196671,2.6473559247518716,7.6600738580726757,10.076415520361802,23.885538143136518,null,null,null,null,null,null,null,null,null,null,null,null,null,null,null,null,null,null,null,null,null,null,null,null,null,null,null,null,null,null,null,"Septic tank connection","N/A","N/A","N/A","N/A","N/A","N/A","N/A","N/A","N/A","N/A","N/A","N/A","N/A","N/A","N/A","N/A","N/A","N/A","N/A","N/A"]
[null,"Improved latrines",31.430919046799506,8.037972207315681,4.3920057587420818,2.6500693011543821,0.33770543262807295,7.8213029122249296,3.8068958781682745,2.0265871126375039,0.75382553530139373,0.24640212679631579,55.722407963152044,37.270305267237767,32.727394013507265,15.469885476298471,12.175747309715803,12.825838761434492,2.8640746721517161,8.2109373462479738,6.3319321893372749,17.730515319531946,null,null,null,null,null,null,null,null,null,null,null,null,null,null,null,null,null,null,null,null,null,null,null,null,null,null,null,null,null,null,null,"Improved latrines","N/A","N/A","N/A","N/A","N/A","N/A","N/A","N/A","N/A","N/A","N/A","N/A","N/A","N/A","N/A","N/A","N/A","N/A","N/A","N/A"]
[null,"Unimproved facilities",4.5830202844412549,1.6835527036092928,0.23085914553789569,2.6414333263022935E-2,0.29569479057352582,2.0050393855204995,0.87359770560079175,0,3.2022518465594223E-2,0.33436734716820576,7.8695974101837303,3.5731514804424243,5.1370398052891693,1.7171956602954439,0.36576929691323123,2.1823226255188755,0.89236893012308616,0.9848587438738694,0.32518497613587621,2.641336426432471,null,null,null,null,null,null,null,null,null,null,null,null,null,null,null,null,null,null,null,null,null,null,null,null,null,null,null,null,null,null,null,"Unimproved facilities","N/A","N/A","N/A","N/A","N/A","N/A","N/A","N/A","N/A","N/A","N/A","N/A","N/A","N/A","N/A","N/A","N/A","N/A","N/A","N/A"]
[null,"Open defecation",3.6048412213322139,0.34372424345168434,8.1021691321094321E-3,0,0,1.0572553600901797,9.2512755753330067E-2,0,0,0,8.1595275366429902,2.8871290031505565,1.4279005957631403,0.75275046995964723,3.4909217916982233E-2,1.4416546454683157,0.56929472702228978,0.60026520295322161,0.46058039197362399,1.0600221495396247,null,null,null,null,null,null,null,null,null,null,null,null,null,null,null,null,null,null,null,null,null,null,null,null,null,null,null,null,null,null,null,"Open defecation","N/A","N/A","N/A","N/A","N/A","N/A","N/A","N/A","N/A","N/A","N/A","N/A","N/A","N/A","N/A","N/A","N/A","N/A","N/A","N/A"]
["Septic tank emptying practices","Not emptied/treated and disposed in situ","N/A","N/A","N/A","N/A","N/A","N/A","N/A","N/A","N/A","N/A","N/A","N/A","N/A","N/A","N/A","N/A","N/A","N/A","N/A","N/A",null,null,null,null,null,null,null,null,null,null,null,null,null,null,null,null,null,null,null,null,null,null,null,null,null,null,null,null,null,null,"Septic tank emptying practices","Not emptied/treated and disposed in situ","N/A","N/A","N/A","N/A","N/A","N/A","N/A","N/A","N/A","N/A","N/A","N/A","N/A","N/A","N/A","N/A","N/A","N/A","N/A","N/A"]
[null,"Emptied and buried on site","N/A","N/A","N/A","N/A","N/A","N/A","N/A","N/A","N/A","N/A","N/A","N/A","N/A","N/A","N/A","N/A","N/A","N/A","N/A","N/A",null,null,null,null,null,null,null,null,null,null,null,null,null,null,null,null,null,null,null,null,null,null,null,null,null,null,null,null,null,null,null,"Emptied and buried on site","N/A","N/A","N/A","N/A","N/A","N/A","N/A","N/A","N/A","N/A","N/A","N/A","N/A","N/A","N/A","N/A","N/A","N/A","N/A","N/A"]
[null,"Emptied and discharged locally","N/A","N/A","N/A","N/A","N/A","N/A","N/A","N/A","N/A","N/A","N/A","N/A","N/A","N/A","N/A","N/A","N/A","N/A","N/A","N/A",null,null,null,null,null,null,null,null,null,null,null,null,null,null,null,null,null,null,null,null,null,null,null,null,null,null,null,null,null,null,null,"Emptied and discharged locally","N/A","N/A","N/A","N/A","N/A","N/A","N/A","N/A","N/A","N/A","N/A","N/A","N/A","N/A","N/A","N/A","N/A","N/A","N/A","N/A"]
[null,"Emptied and removed offsite","N/A","N/A","N/A","N/A","N/A","N/A","N/A","N/A","N/A","N/A","N/A","N/A","N/A","N/A","N/A","N/A","N/A","N/A","N/A","N/A",null,null,null,null,null,null,null,null,null,null,null,null,null,null,null,null,null,null,null,null,null,null,null,null,null,null,null,null,null,null,null,"Emptied and removed offsite","N/A","N/A","N/A","N/A","N/A","N/A","N/A","N/A","N/A","N/A","N/A","N/A","N/A","N/A","N/A","N/A","N/A","N/A","N/A","N/A"]
["Latrine emptying practices","Not emptied/treated and disposed in situ","N/A","N/A","N/A","N/A","N/A","N/A","N/A","N/A","N/A","N/A","N/A","N/A","N/A","N/A","N/A","N/A","N/A","N/A","N/A","N/A",null,null,null,null,null,null,null,null,null,null,null,null,null,null,null,null,null,null,null,null,null,null,null,null,null,null,null,null,null,null,"Latrine emptying practices","Not emptied/treated and disposed in situ","N/A","N/A","N/A","N/A","N/A","N/A","N/A","N/A","N/A","N/A","N/A","N/A","N/A","N/A","N/A","N/A","N/A","N/A","N/A","N/A"]
[null,"Emptied and buried on site","N/A","N/A","N/A","N/A","N/A","N/A","N/A","N/A","N/A","N/A","N/A","N/A","N/A","N/A","N/A","N/A","N/A","N/A","N/A","N/A",null,null,null,null,null,null,null,null,null,null,null,null,null,null,null,null,null,null,null,null,null,null,null,null,null,null,null,null,null,null,null,"Emptied and buried on site","N/A","N/A","N/A","N/A","N/A","N/A","N/A","N/A","N/A","N/A","N/A","N/A","N/A","N/A","N/A","N/A","N/A","N/A","N/A","N/A"]
[null,"Emptied and discharged locally","N/A","N/A","N/A","N/A","N/A","N/A","N/A","N/A","N/A","N/A","N/A","N/A","N/A","N/A","N/A","N/A","N/A","N/A","N/A","N/A",null,null,null,null,null,null,null,null,null,null,null,null,null,null,null,null,null,null,null,null,null,null,null,null,null,null,null,null,null,null,null,"Emptied and discharged locally","N/A","N/A","N/A","N/A","N/A","N/A","N/A","N/A","N/A","N/A","N/A","N/A","N/A","N/A","N/A","N/A","N/A","N/A","N/A","N/A"]
[null,"Emptied and removed offsite","N/A","N/A","N/A","N/A","N/A","N/A","N/A","N/A","N/A","N/A","N/A","N/A","N/A","N/A","N/A","N/A","N/A","N/A","N/A","N/A",null,null,null,null,null,null,null,null,null,null,null,null,null,null,null,null,null,null,null,null,null,null,null,null,null,null,null,null,null,null,null,"Emptied and removed offsite","N/A","N/A","N/A","N/A","N/A","N/A","N/A","N/A","N/A","N/A","N/A","N/A","N/A","N/A","N/A","N/A","N/A","N/A","N/A","N/A"]
["Shared among improved sanitation facilities","Yes",11.078689153294267,6.5211344121621408,2.7568017572402539,1.588655763787731,0.31978519616667267,12.438515902082434,3.8807543231043913,2.6047903496246345,1.4115559351487927,0.19358137593920641,8.1579499944445271,8.4409708915501529,6.8340653337434079,3.4783723888003228,1.0893235220807953,5.1947037201697608,7.6542177203528965,2.8170853074523738,1.8565410155153395,4.7397605549440014,null,null,null,null,null,null,null,null,null,null,null,null,null,null,null,null,null,null,null,null,null,null,null,null,null,null,null,null,null,null,"Shared among improved sanitation facilities","Yes","N/A","N/A","N/A","N/A","N/A","N/A","N/A","N/A","N/A","N/A","N/A","N/A","N/A","N/A","N/A","N/A","N/A","N/A","N/A","N/A"]
[null,"No",80.694729038188754,91.451588640776919,96.888016842735667,98.353809742291361,99.28810134497671,84.480056761077961,95.066200351696935,97.330786311366296,98.515869502330304,99.346451215514449,75.782873590335029,85.02556757231585,86.600994265204321,94.051681480944666,98.509997963088992,91.074003299657306,90.862447994653635,95.536221002235237,97.298174858232343,91.511409519411217,null,null,null,null,null,null,null,null,null,null,null,null,null,null,null,null,null,null,null,null,null,null,null,null,null,null,null,null,null,null,null,"No","N/A","N/A","N/A","N/A","N/A","N/A","N/A","N/A","N/A","N/A","N/A","N/A","N/A","N/A","N/A","N/A","N/A","N/A","N/A","N/A"]
[null,"DK/missing",8.2265818085169649,2.0272769470609764,0.3551814000240785,5.7534493920893326E-2,0.39211345885660964,3.0814273368397429,1.0530453251987097,6.4423339009075514E-2,7.2574562520934763E-2,0.45996740854634133,16.059176415220591,6.5334615361340527,6.5649404010523078,2.4699461302550905,0.40067851483021344,3.7312929801728756,1.4833342849933691,1.6466936903123162,0.84528412625235838,3.7488299256449351,null,null,null,null,null,null,null,null,null,null,null,null,null,null,null,null,null,null,null,null,null,null,null,null,null,null,null,null,null,null,null,"DK/missing","N/A","N/A","N/A","N/A","N/A","N/A","N/A","N/A","N/A","N/A","N/A","N/A","N/A","N/A","N/A","N/A","N/A","N/A","N/A","N/A"]
["Shared among all sanitation facilities","Yes",12.036616304719255,6.543626442646433,2.8325787049856488,1.588655763787731,0.31978519616667267,12.87207201352599,3.8843478403345304,2.6047903496246345,1.4115559351487927,0.19358137593920641,9.3057985084025496,9.0796618327392977,7.4474025962861248,3.8324042441357538,1.0897039292000898,5.4345373038923874,7.871741951179767,2.9788870300585595,1.9073745262882584,4.8750603310685019,null,null,null,null,null,null,null,null,null,null,null,null,null,null,null,null,null,null,null,null,null,null,null,null,null,null,null,null,null,null,"Shared among all sanitation facilities","Yes","N/A","N/A","N/A","N/A","N/A","N/A","N/A","N/A","N/A","N/A","N/A","N/A","N/A","N/A","N/A","N/A","N/A","N/A","N/A","N/A"]
[null,"No",87.911359062896992,93.456373557353601,97.051191792549389,98.380224075554366,99.583796135550244,87.108590953426628,96.028636795509598,97.330786311366296,98.547892020795885,99.68081856268266,90.60761601200646,90.844981469647067,92.552597403713904,96.167595755864298,98.910296070799902,94.441487932865769,92.106463344871798,96.959171412842664,98.032831315400202,95.076959721185332,null,null,null,null,null,null,null,null,null,null,null,null,null,null,null,null,null,null,null,null,null,null,null,null,null,null,null,null,null,null,null,"No","N/A","N/A","N/A","N/A","N/A","N/A","N/A","N/A","N/A","N/A","N/A","N/A","N/A","N/A","N/A","N/A","N/A","N/A","N/A","N/A"]
["Tipo de instalación sanitaria","Excusado conectado al alcantarillado",38.879667483298363,74.671856141144872,87.476287642423046,92.085562348485368,97.392586303730283,79.1134314272377,87.852636892044359,94.227749410394267,96.938560766688283,98.353586727288985,8.3831198357141083,24.268414503953366,28.180049052301783,48.630566603697432,62.815235307756801,76.373564897358605,93.026905745950941,82.543864848852294,82.80588692219149,54.682587961359552,null,null,null,null,null,null,null,null,null,null,null,null,null,null,null,null,null,null,null,null,null,null,null,null,null,null,null,null,null,null,"Tipo de instalación sanitaria","Excusado conectado al alcantarillado",3139.3214955073818,6033.787964646498,7062.5691192215354,7434.0354841582539,7868.464926987248,4906.704086729731,5432.8486726540177,5861.0113391059913,6005.6322223705192,6099.9404302905605,156.38343655516383,457.38299659192268,529.05159055399054,912.16437187349197,1177.0598437955366,4739.1354508019595,8229.1572431850909,7245.5586269659843,6693.998267433597,4630.3294021342917]
[null,"Excusado conectado a tanque séptico",21.501551964128591,15.262894704478521,7.89274528416483,5.2379540170972323,1.974013473068122,10.002970914926724,7.3743567684331675,3.745663476968228,2.275591179544707,1.0656437987465268,19.865347254307331,32.000999745216092,32.527616533138811,33.429601789749235,24.608338867697363,7.1766190702196671,2.6473559247518716,7.6600738580726757,10.076415520361802,23.885538143136518,null,null,null,null,null,null,null,null,null,null,null,null,null,null,null,null,null,null,null,null,null,null,null,null,null,null,null,null,null,null,null,"Excusado conectado a tanque séptico",1736.1332706035648,1233.3036184271996,637.2362226628195,422.85820963041084,159.48293774432693,620.39551795766806,456.03371507551577,232.98207002028087,140.97964323720498,66.09178077344869,370.57937055311521,603.11781616470842,610.6727221037869,627.03961413867501,461.12200904392154,445.32384861552663,234.18502430850828,672.38812148165107,814.57382490961879,2022.543439753018]
[null,"Letrina (pozo negro, hoyo)",18.491333156254424,3.4396595226488933,1.5694954852133391,0.28711009389205588,1.3087421021356415E-2,3.9780174981936991,1.4900296878456112,0.27815496779152082,5.2233760504605382E-2,0,37.201810739978654,18.756752373905307,16.225189346198832,8.7984941581106906,2.4243327076545049,7.408549130671199,1.1033087407849245,5.1781892502891331,2.8525828069274271,8.024851829797063,null,null,null,null,null,null,null,null,null,null,null,null,null,null,null,null,null,null,null,null,null,null,null,null,null,null,null,null,null,null,null,"Letrina (pozo negro, hoyo)",1493.074488946045,277.93840012508906,126.7162867260231,23.178298219825749,1.0573485847281003,246.72112387668838,92.144141578523005,17.301372795760845,3.2360368536628883,0,693.98351969247335,353.50556608104461,304.61133033212394,165.03350583119519,45.428225560238324,459.71558184245777,97.598657537793756,454.5325550626506,230.6017733404129,679.51625481839517]
[null,"Descarga a otra parte",1.0467395904980561,0.72709812587805622,0.1223886536302238,1.9181775989956434E-2,0.28123760460538727,1.1449271410987618,0.59424012336516074,0,3.2022518465594223E-2,0.33436734716820576,0.5321600685950123,0.50807920996581668,0.78082088738080502,0.50472244750282447,0.17685318399359151,1.421984518354692,0.49110684222579165,2.7345821818649467E-2,0.10574381796292212,0.41089739368394818,null,null,null,null,null,null,null,null,null,null,null,null,null,null,null,null,null,null,null,null,null,null,null,null,null,null,null,null,null,null,null,"Descarga a otra parte",84.518523674636356,58.752469106264485,9.8812872490112973,1.5485381173963848,22.721526473136073,71.009670303631168,36.748090662655201,0,1.9838902828492828,20.737636190286789,9.9272134903497591,9.575689071997914,14.659113319494066,9.4670876045655916,3.3139536946148231,88.237039222708049,43.443296275132056,2.4003692527894178,8.5482924046299296,34.793347465185171]
[null,"Descarga a sitio desconocido / no estáseguro dónde / NS dónde",0.40626833214003449,0.13702234925908111,0.24969954867813329,0.30814031417057636,2.476878506825789E-2,4.985613842830236E-2,0,0.30658509695836222,0.40153133310741695,3.2265130604182388E-2,1.4547429573620736,0.15794829203211908,0.56830588653792202,5.8124421846564266E-2,0,1.87738792019576E-2,0.51940896546576298,0,0.32413881362186459,0.20782550766575689,null,null,null,null,null,null,null,null,null,null,null,null,null,null,null,null,null,null,null,null,null,null,null,null,null,null,null,null,null,null,null,"Descarga a sitio desconocido / no estáseguro dónde / NS dónde",32.803956170124721,11.071959966875369,20.159981283001898,24.876060603016072,2.0011001246632674,3.0921338357027928,0,19.069740505503944,24.876060603016072,2.0011001246632674,27.137594050309087,2.9768266527860012,10.669361598202213,1.0902407774979548,0,1.1649574901295194,45.946901233183283,0,26.203265702975685,17.597933721392845]
[null,"Letrina de fosa mejorada con ventilación",1.2829694032625956,0.59319517832578517,9.3164199754188409E-2,0.1425245709718457,9.1272060399583878E-3,0.84353254408165557,2.8459305724383085E-2,0.11977382227076293,0,0,0.90451395010902469,0.69765634269527121,1.8169048764001512,1.7761953858648909,0.657213632568453,0.28746492982128008,3.378754788766853E-2,0.10051675591842238,0.76095560805193141,0.94625227562078384,null,null,null,null,null,null,null,null,null,null,null,null,null,null,null,null,null,null,null,null,null,null,null,null,null,null,null,null,null,null,null,"Letrina de fosa mejorada con ventilación",103.59279506365928,47.932569412805535,7.5217938247509739,11.505959142210306,0.73739802311880953,52.316838072453976,1.7599369444011641,7.4499893592870858,0,0,16.873312406619785,13.14861951782401,34.110530218054627,33.316127317111267,12.315161630793003,17.837785123808491,2.9888454549760475,8.8231881234657976,61.515379053664724,80.125317710629844]
[null,"Letrina de fosa con losa",10.946087531707875,3.8680951570819229,2.4419636928417723,1.9122943221199045,0.29072202049850021,2.8098023073961427,2.288406884598281,1.3220732256168575,0.3000604416893714,0.21413699619213339,15.784450349826448,17.188487270664737,14.116993904370334,4.8370715104763251,8.9318397324639491,4.9887749521078506,1.2075694180133614,2.8427628673641681,2.3942549607360539,8.4078748508713961,null,null,null,null,null,null,null,null,null,null,null,null,null,null,null,null,null,null,null,null,null,null,null,null,null,null,null,null,null,null,null,"Letrina de fosa con losa",883.83697969529703,312.55773206966211,197.15671334640058,154.37885683963086,23.487783912641625,174.26710251195911,141.51616553934011,82.233590581906412,18.589637013547161,13.280887501492089,294.45202242297989,323.94871998984809,265.0321177612737,90.72903328511363,167.36878925617171,309.56365940729893,106.82155386347445,249.53283997260513,193.55071426288004,711.94929835737366]
[null,"Letrina de fosa sin losa/Foso abierto",2.9591691799423563,0.7673060400288253,0.10847049190767187,7.2325572730664962E-3,1.4457185968138542E-2,0.3266477250545422,0.12110660162460749,0,0,0,6.8570073362664035,2.5545594419214872,4.3335051731308925,1.2124732127926192,0.18891611291963969,0.674649982073247,0.37599744477263303,0.64787370465727268,0.17211766263863354,1.9549749039508986,null,null,null,null,null,null,null,null,null,null,null,null,null,null,null,null,null,null,null,null,null,null,null,null,null,null,null,null,null,null,null,"Letrina de fosa sin losa/Foso abierto",238.93680210682425,62.001431178773785,8.7575772491100743,0.58388183812907513,1.1680135526791458,20.259059663215183,7.4892896008847032,0,0,0,127.91447489047677,48.145380586272054,81.357126109458576,22.742380848104819,3.5399942271042013,41.863407204091494,33.260722489466161,56.869240597827215,13.91393025691948,165.5404053772119]
[null,"Excusado de compostaje",0.30426062343462118,0,3.7682832254647219E-2,0,0,0.14009442412513048,0,0,0,0,0.37688996587584611,0.46946098794030111,0,0,0.16236123702888891,0.12227586963220195,0,8.9468472676244887E-2,0,0.1437108555769652,null,null,null,null,null,null,null,null,null,null,null,null,null,null,null,null,null,null,null,null,null,null,null,null,null,null,null,null,null,null,null,"Excusado de compostaje",24.567389003393586,0,3.0423971407470765,0,0,8.6888139091153445,0,0,0,0,7.0307175874699341,8.8478575068083085,0,0,3.0423971407470765,7.5874670683553296,0,7.8533888039754167,0,12.168930271809916]
[null,"Excusado colgante, Letrina colgante",6.6358203172972863E-2,0,0,0,0,0,0,0,0,0,0.26436622297991519,0,2.2713744777471595E-2,0,0,0,0,0,5.2749778309853588E-3,5.8240918681743532E-2,null,null,null,null,null,null,null,null,null,null,null,null,null,null,null,null,null,null,null,null,null,null,null,null,null,null,null,null,null,null,null,"Excusado colgante, Letrina colgante",5.3580636643471378,0,0,0,0,0,0,0,0,0,4.9316363440945779,0,0.42642732025256008,0,0,0,0,0,0.42642732025256008,4.9316363440945779]
[null,"No hay instalación sanitaria, va al monte, campo",3.6048412213322139,0.34372424345168434,8.1021691321094321E-3,0,0,1.0572553600901797,9.2512755753330067E-2,0,0,0,8.1595275366429902,2.8871290031505565,1.4279005957631403,0.75275046995964723,3.4909217916982233E-2,1.4416546454683157,0.56929472702228978,0.60026520295322161,0.46058039197362399,1.0600221495396247,null,null,null,null,null,null,null,null,null,null,null,null,null,null,null,null,null,null,null,null,null,null,null,null,null,null,null,null,null,null,null,"No hay instalación sanitaria, va al monte, campo",291.07130452904903,27.77430896288147,0.65414446649877289,0,0,65.57216774047501,5.7210326300810106,0,0,0,152.21241994067537,54.413266873834573,26.807372831019798,14.119353475844802,0.65414446649877289,89.457610723478453,50.359794178002801,52.690248120671498,37.233154072516392,89.758950863760191]
[null,"Otro",0.51075331082787034,0.18914853770241066,0,0,0,0.5334645193671953,0.15825098061102341,0,0,0,0.21606378234240073,0.51051282855512015,0,0,0,8.568812509093586E-2,2.5264643124661597E-2,0.30963921739794714,4.2048517703335238E-2,0.21722321011588167,null,null,null,null,null,null,null,null,null,null,null,null,null,null,null,null,null,null,null,null,null,null,null,null,null,null,null,null,null,null,null,"Otro",41.240549402133674,15.283966802191664,0,0,0,33.086070090535102,9.7863155890845164,0,0,0,4.0305754253760213,9.621555099329699,0,0,0,5.3171229060338341,2.2349095597522299,27.179598471344001,3.39918712444639,18.393698142748889]
[null,null,null,null,null,null,null,null,null,null,null,null,null,null,null,null,null,null,null,null,null,null,null,null,null,null,null,null,null,null,null,null,null,null,null,null,null,null,null,null,null,null,null,null,null,null,null,null,null,null,null,null,null,"Total",8074.455618366459,8080.4044206982371,8073.6955231699021,8072.9652885488722,8079.1210354025425,6202.1125846911727,6184.0473602745078,6220.0481023687307,6195.297490360801,6202.0518348804499,1865.4562933590996,1884.6842941363732,1877.3976921476542,1875.7017151515959,1873.8445188156229,6205.2039304058508,8845.9969480853888,8777.8281768529614,8083.9642158819079,8467.6486149599004]
[]
[]
[]
[]
[]
[]
[]
[]
[]
[]
[]
[]
[]
[]
[]
[]
[]
[]
[]
[]
[]
[]
[]
[]
[]
[]
[]
[]
[]
[]
[]
[]
[]
[]
[]
[]
[]
[]
[]
[]
[]
[]
[{"$f":"A1026","v":"Mexico"}]
[{"$f":"A1034","v":"2015"}]
["Access to hygiene facilities "]
[" by wealth quintile and sub-national region"]
["Notes:"]
["WHO/UNICEF JMP customised wealth index excludes water,"]
[" sanitation and hygiene assets."]
["Survey used for analysis:",{"$f":"A1025","v":"MICS15"}]
[]
[]
[]
[]
["Access to handwashing",null,"NATIONAL wealth index quintile",null,null,null,null,"URBAN wealth index quintile",null,null,null,null,"RURAL wealth index quintile",null,null,null,null,"SUB-REGIONS:",null,null,null,null,null,null,null,null,null,null,null,null,null,null,null,null,null,null,null,null,null,null,null,null,null,null,null,null,null,null,null,null,null,null,"Raw numbers of respondents:","Access to handwashing","NATIONAL wealth index quintile",null,null,null,null,"URBAN wealth index quintile",null,null,null,null,"RURAL wealth index quintile",null,null,null,null,"SUB-REGIONS:"]
["Weighted percentage (used in graphs)",null,"Poorest","Poor","Middle","Rich","Richest","Poorest","Poor","Middle","Rich","Richest","Poorest","Poor","Middle","Rich","Richest","Centro","DF-Edo México","Noreste","Noroeste","Sur",null,null,null,null,null,null,null,null,null,null,null,null,null,null,null,null,null,null,null,null,null,null,null,null,null,null,null,null,null,null,"Hygiene data, raw numbers (weighted)",null,"Poorest","Poor","Middle","Rich","Richest","Poorest","Poor","Middle","Rich","Richest","Poorest","Poor","Middle","Rich","Richest","Centro","DF-Edo México","Noreste","Noroeste","Sur"]
["Hygiene ladder","Basic",79.603522380454422,85.588588317261411,91.017774295916539,95.494437707325304,96.5147307260156,83.189148206783941,87.448913559220671,94.144773071123396,96.595314956701415,96.13198251018045,74.624995949810597,84.557092436514893,81.891640422029852,85.441081729355446,91.114264998055987,87.600779786174954,88.675663820866731,92.35296276799248,92.176317454068396,86.241245033363938,null,null,null,null,null,null,null,null,null,null,null,null,null,null,null,null,null,null,null,null,null,null,null,null,null,null,null,null,null,null,"Hygiene ladder","Basic",6196.0512897049375,6727.0203051193057,6946.5386893314717,7187.598737049555,7101.6723036245694,5004.0567503616821,5165.4709941223091,5520.5987745224356,5489.0384277872035,5414.806174072065,1354.3303565826752,1514.7220932923085,1498.3922648160296,1561.3997363639282,1636.0657529092186,5246.2530709694502,6676.171573540274,7982.9690861186637,7081.96233464532,7171.5252595561351]
[null,"Limited",14.991055784271143,9.8760274746624575,5.7421373815629586,3.3797959602563696,2.7091286640708345,13.177984205411878,8.4081615289710516,4.307278584061212,2.2386160427226636,2.9706203159738678,19.591606816466893,10.328546626018928,10.662286043659554,8.532615002035616,5.9583633377974685,6.2816381047607113,6.7482561095027105,5.4208921988806003,6.9056312612961968,11.444077091871206,null,null,null,null,null,null,null,null,null,null,null,null,null,null,null,null,null,null,null,null,null,null,null,null,null,null,null,null,null,null,null,"Limited",1166.8497542387477,776.22775024286386,438.24384620524779,254.38777125298895,199.34101101316443,792.69210276483352,496.65699348434663,252.57649572038335,127.20958039293743,167.32551236063148,355.55791337822535,185.02147265501955,195.09057152526606,155.92994078510029,106.98954988626961,376.19600280111354,508.05952465427089,468.58068811024395,530.56383505251847,951.65008233486515]
[null,"No facility",5.405421835274443,4.5353842080762323,3.2400883225205011,1.1257663324183276,0.77614060991356337,3.6328675878042032,4.1429249118084037,1.5479483448154403,1.1660690005758809,0.89739717384571938,5.7833972337225763,5.1143609374662971,7.4460735343106421,6.0263032686089426,2.9273716641465524,6.1175821090641653,4.5760800696305539,2.2261450331268473,0.91805128463542973,2.3146778747649375,null,null,null,null,null,null,null,null,null,null,null,null,null,null,null,null,null,null,null,null,null,null,null,null,null,null,null,null,null,null,null,"No facility",420.73855442953396,356.46833601405604,247.28575339651601,84.733277281574956,57.1093783475241,218.52700704103748,244.71611586438732,90.770857017799813,66.261987514420127,50.547503865532235,104.95987755998844,91.616625901223543,136.24270962901622,110.12815081930569,52.564464256494063,366.3709844241676,344.52175898933228,192.42747008899812,70.534436595393643,192.48064937131355]
["Lugar usado conmayor frecuencia para el lavado de las manos","Lugar observado",91.187584549920004,92.85733318176915,91.467191379014238,92.184051860828149,90.36890625409427,93.46410233562635,91.560230019896068,92.815604883252618,90.653403116128047,90.004595818414273,91.66059135494028,90.187177302615979,90.20373485193916,91.556651213609015,93.020273843061403,90.608610721401845,81.214487641774383,96.282925616105686,94.168231902141827,95.931889846488076,null,null,null,null,null,null,null,null,null,null,null,null,null,null,null,null,null,null,null,null,null,null,null,null,null,null,null,null,null,null,"Observed handwashing place","Fixed","N/A","N/A","N/A","N/A","N/A","N/A","N/A","N/A","N/A","N/A","N/A","N/A","N/A","N/A","N/A","N/A","N/A","N/A","N/A","N/A"]
[null,"No está en la vivienda/patio/lote",5.0223081365180953,4.3172095931327643,2.9925955474429,1.0495929841512535,0.70687613290198248,3.4629676634367694,3.7972555252717441,1.4046491203128337,1.0695529571827094,0.81501259923775826,5.3920975187038813,4.4848159488530976,7.2569978219777713,5.8713040527557991,2.8051667963208504,5.9042537285346741,3.7283464558361823,2.1441232641020513,0.83045185181126502,2.2002148232822418,null,null,null,null,null,null,null,null,null,null,null,null,null,null,null,null,null,null,null,null,null,null,null,null,null,null,null,null,null,null,null,"Mobile","N/A","N/A","N/A","N/A","N/A","N/A","N/A","N/A","N/A","N/A","N/A","N/A","N/A","N/A","N/A","N/A","N/A","N/A","N/A","N/A"]
[null,"No obtuvo permiso para ver el lugar",3.6016795897885845,2.7311507918677544,5.4699515602153213,6.7663551550205829,8.9242176130037532,3.0124690897227446,4.4825539109578472,5.7250678651907405,8.2770439266892435,9.1803915823479727,2.7129097593105542,4.9517100863085108,2.5392673260830794,2.5720447336352503,4.1745593606178,3.4871355500633028,14.890849484032639,1.52487528621292,4.9592452277442973,1.7949802903850374,null,null,null,null,null,null,null,null,null,null,null,null,null,null,null,null,null,null,null,null,null,null,null,null,null,null,null,null,null,null,"Water / Soap","Water and soap","N/A","N/A","N/A","N/A","N/A","N/A","N/A","N/A","N/A","N/A","N/A","N/A","N/A","N/A","N/A","N/A","N/A","N/A","N/A","N/A"]
[null,"Otra razón",0.18842772377329481,9.430643323034682E-2,7.0261513327536787E-2,0,0,6.0460911214278962E-2,0.15996054387434547,5.4678131243826762E-2,0,0,0.23440136704533898,0.37629666222245672,0,0,0,0,0.16631641835687191,4.8075833579392248E-2,4.207101830263734E-2,7.2915039844761331E-2,null,null,null,null,null,null,null,null,null,null,null,null,null,null,null,null,null,null,null,null,null,null,null,null,null,null,null,null,null,null,null,"Water only","N/A","N/A","N/A","N/A","N/A","N/A","N/A","N/A","N/A","N/A","N/A","N/A","N/A","N/A","N/A","N/A","N/A","N/A","N/A","N/A"]
[null,null,null,null,null,null,null,null,null,null,null,null,null,null,null,null,null,null,null,null,null,null,null,null,null,null,null,null,null,null,null,null,null,null,null,null,null,null,null,null,null,null,null,null,null,null,null,null,null,null,null,null,null,"Soap only","N/A","N/A","N/A","N/A","N/A","N/A","N/A","N/A","N/A","N/A","N/A","N/A","N/A","N/A","N/A","N/A","N/A","N/A","N/A","N/A"]
[null,null,null,null,null,null,null,null,null,null,null,null,null,null,null,null,null,null,null,null,null,null,null,null,null,null,null,null,null,null,null,null,null,null,null,null,null,null,null,null,null,null,null,null,null,null,null,null,null,null,null,null,null,"Neither","N/A","N/A","N/A","N/A","N/A","N/A","N/A","N/A","N/A","N/A","N/A","N/A","N/A","N/A","N/A","N/A","N/A","N/A","N/A","N/A"]
[null,null,null,null,null,null,null,null,null,null,null,null,null,null,null,null,null,null,null,null,null,null,null,null,null,null,null,null,null,null,null,null,null,null,null,null,null,null,null,null,null,null,null,null,null,null,null,null,null,null,null,null,"Lugar usado conmayor frecuencia para el lavado de las manos","Lugar observado",7362.9010439436815,7503.2480553621654,7384.7825355367186,7441.986508302547,7301.0133146377339,5796.748853126518,5662.1279876066501,5773.1752702428139,5616.2480081801414,5582.1316864326955,1709.8882699609003,1699.7435659473272,1693.4828363412951,1717.3296771490288,1743.0553027954888,5622.4490737705646,7184.2310981945466,8451.5497742289026,7612.5261696978368,8123.1753418910048]
[null,null,null,null,null,null,null,null,null,null,null,null,null,null,null,null,null,null,null,null,null,null,null,null,null,null,null,null,null,null,null,null,null,null,null,null,null,null,null,null,null,null,null,null,null,null,null,null,null,null,null,null,null,"No está en la vivienda/patio/lote",405.52404150076114,348.84799481430827,241.61305274047925,84.733277281574956,57.1093783475241,214.77715325779772,234.82408007344517,87.369850952957478,66.261987514420127,50.547503865532235,100.5872225067214,84.524621808957491,136.24270962901622,110.12815081930569,52.564464256494063,366.3709844241676,329.80941369731846,188.20745602280928,67.133430530551308,186.30646000980116]
[null,null,null,null,null,null,null,null,null,null,null,null,null,null,null,null,null,null,null,null,null,null,null,null,null,null,null,null,null,null,null,null,null,null,null,null,null,null,null,null,null,null,null,null,null,null,null,null,null,null,null,null,null,"No obtuvo permiso para ver el lugar",290.81601999324238,220.68802932201694,441.6272342366666,546.24550296474888,720.9983424172849,186.83672452362597,277.20325680347042,356.10197510811867,512.78749466623981,569.37264458222285,50.608145838211932,93.324102287823152,47.672146177343187,48.243887183262686,78.224751763641166,216.38387221110773,1317.2440909015161,133.85093253506494,400.90360958868024,151.99262369759182]
[null,null,null,null,null,null,null,null,null,null,null,null,null,null,null,null,null,null,null,null,null,null,null,null,null,null,null,null,null,null,null,null,null,null,null,null,null,null,null,null,null,null,null,null,null,null,null,null,null,null,null,null,null,"Otra razón",15.214512928772834,7.6203411997477755,5.6727006560367617,0,0,3.749853783239752,9.8920357909422059,3.4010060648423304,0,0,4.3726550532670387,7.0920040922660412,0,0,0,0,14.712345292013817,4.2200140661888303,3.4010060648423304,6.1741893615123917]
[null,null,null,null,null,null,null,null,null,null,null,null,null,null,null,null,null,null,null,null,null,null,null,null,null,null,null,null,null,null,null,null,null,null,null,null,null,null,null,null,null,null,null,null,null,null,null,null,null,null,null,null,null,"Total",8074.455618366459,8080.4044206982371,8073.6955231699021,8072.9652885488722,8079.1210354025425,6202.1125846911727,6184.0473602745078,6220.0481023687307,6195.297490360801,6202.0518348804499,1865.4562933590996,1884.6842941363732,1877.3976921476542,1875.7017151515959,1873.8445188156229,6205.2039304058508,8845.9969480853888,8777.8281768529614,8083.9642158819079,8467.6486149599004]
[]
[]
[]
[]
[]
[]
[]
[]
[]
[]
[]
[]
[]
[]
[]
[]
[]
[]
[]
[]
[]
[]
[]
[null,null,null,null,null,null,null,null,null,null,null,null,null,null,null,null,null,null,null,null,null,null,null,null,null,null,null,null,null,null,null,null,null,null,null,null,null,null,null,null,null,null,null,null,null,null,null,null,null,null,null,null,"Raw numbers of respondents:","Menstrual health and hygiene","NATIONAL wealth index quintile",null,null,null,null,"URBAN wealth index quintile",null,null,null,null,"RURAL wealth index quintile",null,null,null,null,"SUB-REGIONS:"]
[null,null,null,null,null,null,null,null,null,null,null,null,null,null,null,null,null,null,null,null,null,null,null,null,null,null,null,null,null,null,null,null,null,null,null,null,null,null,null,null,null,null,null,null,null,null,null,null,null,null,null,null,"MHH data, raw numbers (weighted)",null,"Poorest","Poor","Middle","Rich","Richest","Poorest","Poor","Middle","Rich","Richest","Poorest","Poor","Middle","Rich","Richest","Centro","DF-Edo México","Noreste","Noroeste","Sur"]
[null,null,null,null,null,null,null,null,null,null,null,null,null,null,null,null,null,null,null,null,null,null,null,null,null,null,null,null,null,null,null,null,null,null,null,null,null,null,null,null,null,null,null,null,null,null,null,null,null,null,null,null,"Private place to wash and change","Yes","N/A","N/A","N/A","N/A","N/A","N/A","N/A","N/A","N/A","N/A","N/A","N/A","N/A","N/A","N/A","N/A","N/A","N/A","N/A","N/A"]
[null,null,null,null,null,null,null,null,null,null,null,null,null,null,null,null,null,null,null,null,null,null,null,null,null,null,null,null,null,null,null,null,null,null,null,null,null,null,null,null,null,null,null,null,null,null,null,null,null,null,null,null,null,"No","N/A","N/A","N/A","N/A","N/A","N/A","N/A","N/A","N/A","N/A","N/A","N/A","N/A","N/A","N/A","N/A","N/A","N/A","N/A","N/A"]
[null,null,null,null,null,null,null,null,null,null,null,null,null,null,null,null,null,null,null,null,null,null,null,null,null,null,null,null,null,null,null,null,null,null,null,null,null,null,null,null,null,null,null,null,null,null,null,null,null,null,null,null,null,"DK/not sure/missing","N/A","N/A","N/A","N/A","N/A","N/A","N/A","N/A","N/A","N/A","N/A","N/A","N/A","N/A","N/A","N/A","N/A","N/A","N/A","N/A"]
[null,null,null,null,null,null,null,null,null,null,null,null,null,null,null,null,null,null,null,null,null,null,null,null,null,null,null,null,null,null,null,null,null,null,null,null,null,null,null,null,null,null,null,null,null,null,null,null,null,null,null,null,"Use of menstrual materials","Materials reusable","N/A","N/A","N/A","N/A","N/A","N/A","N/A","N/A","N/A","N/A","N/A","N/A","N/A","N/A","N/A","N/A","N/A","N/A","N/A","N/A"]
[null,null,null,null,null,null,null,null,null,null,null,null,null,null,null,null,null,null,null,null,null,null,null,null,null,null,null,null,null,null,null,null,null,null,null,null,null,null,null,null,null,null,null,null,null,null,null,null,null,null,null,null,null,"Materials not reusable","N/A","N/A","N/A","N/A","N/A","N/A","N/A","N/A","N/A","N/A","N/A","N/A","N/A","N/A","N/A","N/A","N/A","N/A","N/A","N/A"]
[null,null,null,null,null,null,null,null,null,null,null,null,null,null,null,null,null,null,null,null,null,null,null,null,null,null,null,null,null,null,null,null,null,null,null,null,null,null,null,null,null,null,null,null,null,null,null,null,null,null,null,null,null,"No materials used","N/A","N/A","N/A","N/A","N/A","N/A","N/A","N/A","N/A","N/A","N/A","N/A","N/A","N/A","N/A","N/A","N/A","N/A","N/A","N/A"]
[null,null,null,null,null,null,null,null,null,null,null,null,null,null,null,null,null,null,null,null,null,null,null,null,null,null,null,null,null,null,null,null,null,null,null,null,null,null,null,null,null,null,null,null,null,null,null,null,null,null,null,null,null,"DK/not sure/missing","N/A","N/A","N/A","N/A","N/A","N/A","N/A","N/A","N/A","N/A","N/A","N/A","N/A","N/A","N/A","N/A","N/A","N/A","N/A","N/A"]
[null,null,null,null,null,null,null,null,null,null,null,null,null,null,null,null,null,null,null,null,null,null,null,null,null,null,null,null,null,null,null,null,null,null,null,null,null,null,null,null,null,null,null,null,null,null,null,null,null,null,null,null,"Use of menstrual materials with private place to wash and change","Materials reusable","N/A","N/A","N/A","N/A","N/A","N/A","N/A","N/A","N/A","N/A","N/A","N/A","N/A","N/A","N/A","N/A","N/A","N/A","N/A","N/A"]
[null,null,null,null,null,null,null,null,null,null,null,null,null,null,null,null,null,null,null,null,null,null,null,null,null,null,null,null,null,null,null,null,null,null,null,null,null,null,null,null,null,null,null,null,null,null,null,null,null,null,null,null,null,"Materials not reusable","N/A","N/A","N/A","N/A","N/A","N/A","N/A","N/A","N/A","N/A","N/A","N/A","N/A","N/A","N/A","N/A","N/A","N/A","N/A","N/A"]
[null,null,null,null,null,null,null,null,null,null,null,null,null,null,null,null,null,null,null,null,null,null,null,null,null,null,null,null,null,null,null,null,null,null,null,null,null,null,null,null,null,null,null,null,null,null,null,null,null,null,null,null,null,"No materials used","N/A","N/A","N/A","N/A","N/A","N/A","N/A","N/A","N/A","N/A","N/A","N/A","N/A","N/A","N/A","N/A","N/A","N/A","N/A","N/A"]
[null,null,null,null,null,null,null,null,null,null,null,null,null,null,null,null,null,null,null,null,null,null,null,null,null,null,null,null,null,null,null,null,null,null,null,null,null,null,null,null,null,null,null,null,null,null,null,null,null,null,null,null,"Awareness of menstruation before menarche","Yes","N/A","N/A","N/A","N/A","N/A","N/A","N/A","N/A","N/A","N/A","N/A","N/A","N/A","N/A","N/A","N/A","N/A","N/A","N/A","N/A"]
[null,null,null,null,null,null,null,null,null,null,null,null,null,null,null,null,null,null,null,null,null,null,null,null,null,null,null,null,null,null,null,null,null,null,null,null,null,null,null,null,null,null,null,null,null,null,null,null,null,null,null,null,null,"No","N/A","N/A","N/A","N/A","N/A","N/A","N/A","N/A","N/A","N/A","N/A","N/A","N/A","N/A","N/A","N/A","N/A","N/A","N/A","N/A"]
[null,null,null,null,null,null,null,null,null,null,null,null,null,null,null,null,null,null,null,null,null,null,null,null,null,null,null,null,null,null,null,null,null,null,null,null,null,null,null,null,null,null,null,null,null,null,null,null,null,null,null,null,null,"DK/not sure/missing","N/A","N/A","N/A","N/A","N/A","N/A","N/A","N/A","N/A","N/A","N/A","N/A","N/A","N/A","N/A","N/A","N/A","N/A","N/A","N/A"]
[null,null,null,null,null,null,null,null,null,null,null,null,null,null,null,null,null,null,null,null,null,null,null,null,null,null,null,null,null,null,null,null,null,null,null,null,null,null,null,null,null,null,null,null,null,null,null,null,null,null,null,null,"Participation in (all) activities during menstruation","Yes","N/A","N/A","N/A","N/A","N/A","N/A","N/A","N/A","N/A","N/A","N/A","N/A","N/A","N/A","N/A","N/A","N/A","N/A","N/A","N/A"]
[null,null,null,null,null,null,null,null,null,null,null,null,null,null,null,null,null,null,null,null,null,null,null,null,null,null,null,null,null,null,null,null,null,null,null,null,null,null,null,null,null,null,null,null,null,null,null,null,null,null,null,null,null,"No","N/A","N/A","N/A","N/A","N/A","N/A","N/A","N/A","N/A","N/A","N/A","N/A","N/A","N/A","N/A","N/A","N/A","N/A","N/A","N/A"]
[null,null,null,null,null,null,null,null,null,null,null,null,null,null,null,null,null,null,null,null,null,null,null,null,null,null,null,null,null,null,null,null,null,null,null,null,null,null,null,null,null,null,null,null,null,null,null,null,null,null,null,null,null,"DK/not sure/missing/no such activity","N/A","N/A","N/A","N/A","N/A","N/A","N/A","N/A","N/A","N/A","N/A","N/A","N/A","N/A","N/A","N/A","N/A","N/A","N/A","N/A"]
[null,null,null,null,null,null,null,null,null,null,null,null,null,null,null,null,null,null,null,null,null,null,null,null,null,null,null,null,null,null,null,null,null,null,null,null,null,null,null,null,null,null,null,null,null,null,null,null,null,null,null,null,"Participation in specific activities during menstruation","Did not go to school (amongst those usually attending school)","N/A","N/A","N/A","N/A","N/A","N/A","N/A","N/A","N/A","N/A","N/A","N/A","N/A","N/A","N/A","N/A","N/A","N/A","N/A","N/A"]
[null,null,null,null,null,null,null,null,null,null,null,null,null,null,null,null,null,null,null,null,null,null,null,null,null,null,null,null,null,null,null,null,null,null,null,null,null,null,null,null,null,null,null,null,null,null,null,null,null,null,null,null,null,"Did not go to work (amongst those who usually work)","N/A","N/A","N/A","N/A","N/A","N/A","N/A","N/A","N/A","N/A","N/A","N/A","N/A","N/A","N/A","N/A","N/A","N/A","N/A","N/A"]
[null,null,null,null,null,null,null,null,null,null,null,null,null,null,null,null,null,null,null,null,null,null,null,null,null,null,null,null,null,null,null,null,null,null,null,null,null,null,null,null,null,null,null,null,null,null,null,null,null,null,null,null,null,"Did not participate in social activities","N/A","N/A","N/A","N/A","N/A","N/A","N/A","N/A","N/A","N/A","N/A","N/A","N/A","N/A","N/A","N/A","N/A","N/A","N/A","N/A"]
[null,null,null,null,null,null,null,null,null,null,null,null,null,null,null,null,null,null,null,null,null,null,null,null,null,null,null,null,null,null,null,null,null,null,null,null,null,null,null,null,null,null,null,null,null,null,null,null,null,null,null,null,null,"Did not cook food","N/A","N/A","N/A","N/A","N/A","N/A","N/A","N/A","N/A","N/A","N/A","N/A","N/A","N/A","N/A","N/A","N/A","N/A","N/A","N/A"]
[null,null,null,null,null,null,null,null,null,null,null,null,null,null,null,null,null,null,null,null,null,null,null,null,null,null,null,null,null,null,null,null,null,null,null,null,null,null,null,null,null,null,null,null,null,null,null,null,null,null,null,null,null,"Did not eat with others","N/A","N/A","N/A","N/A","N/A","N/A","N/A","N/A","N/A","N/A","N/A","N/A","N/A","N/A","N/A","N/A","N/A","N/A","N/A","N/A"]
[null,null,null,null,null,null,null,null,null,null,null,null,null,null,null,null,null,null,null,null,null,null,null,null,null,null,null,null,null,null,null,null,null,null,null,null,null,null,null,null,null,null,null,null,null,null,null,null,null,null,null,null,null,"Did not bathe in regular place","N/A","N/A","N/A","N/A","N/A","N/A","N/A","N/A","N/A","N/A","N/A","N/A","N/A","N/A","N/A","N/A","N/A","N/A","N/A","N/A"]
[null,null,null,null,null,null,null,null,null,null,null,null,null,null,null,null,null,null,null,null,null,null,null,null,null,null,null,null,null,null,null,null,null,null,null,null,null,null,null,null,null,null,null,null,null,null,null,null,null,null,null,null,null,"Did not participate in other activities","N/A","N/A","N/A","N/A","N/A","N/A","N/A","N/A","N/A","N/A","N/A","N/A","N/A","N/A","N/A","N/A","N/A","N/A","N/A","N/A"]
[null,null,null,null,null,null,null,null,null,null,null,null,null,null,null,null,null,null,null,null,null,null,null,null,null,null,null,null,null,null,null,null,null,null,null,null,null,null,null,null,null,null,null,null,null,null,null,null,null,null,null,null,null,"DK/not sure/missing/no such activity","N/A","N/A","N/A","N/A","N/A","N/A","N/A","N/A","N/A","N/A","N/A","N/A","N/A","N/A","N/A","N/A","N/A","N/A","N/A","N/A"]
[]
[]
[]
[]
[]
[]
[]
[]
[]
[]
[]
[]
[]
[]
[]
[]
[]
[]
[]
[]
[]
[]
[]
[]
[]
[]
[]
[]
[]
[]
[]
[]
[]
[]
[]
[]
[]
[]
[]
[]
[]
[]
[]
[]
[]
[]
[]
[]
[]
[]
[]
[]
[]
[]
[null,null,null,null,null,null,null,null,null,null,null,null,null,null,null,null,null,null,null,null,null,null,null,null,null,null,null,null,null,null,null,null,null,null,null,null,null,null,null,null,null,null,null,null,null,null,null,null,null,null,null,null,"Raw numbers of respondents:","Basic water, sanitation and hygiene","NATIONAL wealth index quintile",null,null,null,null,"URBAN wealth index quintile",null,null,null,null,"RURAL wealth index quintile",null,null,null,null,"SUB-REGIONS:"]
[null,null,null,null,null,null,null,null,null,null,null,null,null,null,null,null,null,null,null,null,null,null,null,null,null,null,null,null,null,null,null,null,null,null,null,null,null,null,null,null,null,null,null,null,null,null,null,null,null,null,null,null,"WatSan data, raw numbers (weighted)",null,"Poorest","Poor","Middle","Rich","Richest","Poorest","Poor","Middle","Rich","Richest","Poorest","Poor","Middle","Rich","Richest","Centro","DF-Edo México","Noreste","Noroeste","Sur"]
[null,null,null,null,null,null,null,null,null,null,null,null,null,null,null,null,null,null,null,null,null,null,null,null,null,null,null,null,null,null,null,null,null,null,null,null,null,null,null,null,null,null,null,null,null,null,null,null,null,null,null,null,"Use of Basic Water Sanitation and Hygiene","Yes","N/A","N/A","N/A","N/A","N/A","N/A","N/A","N/A","N/A","N/A","N/A","N/A","N/A","N/A","N/A","N/A","N/A","N/A","N/A","N/A"]
[null,null,null,null,null,null,null,null,null,null,null,null,null,null,null,null,null,null,null,null,null,null,null,null,null,null,null,null,null,null,null,null,null,null,null,null,null,null,null,null,null,null,null,null,null,null,null,null,null,null,null,null,null,"No","N/A","N/A","N/A","N/A","N/A","N/A","N/A","N/A","N/A","N/A","N/A","N/A","N/A","N/A","N/A","N/A","N/A","N/A","N/A","N/A"]
[null,null,null,null,null,null,null,null,null,null,null,null,null,null,null,null,null,null,null,null,null,null,null,null,null,null,null,null,null,null,null,null,null,null,null,null,null,null,null,null,null,null,null,null,null,null,null,null,null,null,null,null,"Use of Basic Water and Sanitation","Yes","N/A","N/A","N/A","N/A","N/A","N/A","N/A","N/A","N/A","N/A","N/A","N/A","N/A","N/A","N/A","N/A","N/A","N/A","N/A","N/A"]
[null,null,null,null,null,null,null,null,null,null,null,null,null,null,null,null,null,null,null,null,null,null,null,null,null,null,null,null,null,null,null,null,null,null,null,null,null,null,null,null,null,null,null,null,null,null,null,null,null,null,null,null,null,"No","N/A","N/A","N/A","N/A","N/A","N/A","N/A","N/A","N/A","N/A","N/A","N/A","N/A","N/A","N/A","N/A","N/A","N/A","N/A","N/A"]
[null,null,null,null,null,null,null,null,null,null,null,null,null,null,null,null,null,null,null,null,null,null,null,null,null,null,null,null,null,null,null,null,null,null,null,null,null,null,null,null,null,null,null,null,null,null,null,null,null,null,null,null,"Use of Basic Water and Hygiene","Yes","N/A","N/A","N/A","N/A","N/A","N/A","N/A","N/A","N/A","N/A","N/A","N/A","N/A","N/A","N/A","N/A","N/A","N/A","N/A","N/A"]
[null,null,null,null,null,null,null,null,null,null,null,null,null,null,null,null,null,null,null,null,null,null,null,null,null,null,null,null,null,null,null,null,null,null,null,null,null,null,null,null,null,null,null,null,null,null,null,null,null,null,null,null,null,"No","N/A","N/A","N/A","N/A","N/A","N/A","N/A","N/A","N/A","N/A","N/A","N/A","N/A","N/A","N/A","N/A","N/A","N/A","N/A","N/A"]
[null,null,null,null,null,null,null,null,null,null,null,null,null,null,null,null,null,null,null,null,null,null,null,null,null,null,null,null,null,null,null,null,null,null,null,null,null,null,null,null,null,null,null,null,null,null,null,null,null,null,null,null,"Use of Basic Sanitation and Hygiene","Yes","N/A","N/A","N/A","N/A","N/A","N/A","N/A","N/A","N/A","N/A","N/A","N/A","N/A","N/A","N/A","N/A","N/A","N/A","N/A","N/A"]
[null,null,null,null,null,null,null,null,null,null,null,null,null,null,null,null,null,null,null,null,null,null,null,null,null,null,null,null,null,null,null,null,null,null,null,null,null,null,null,null,null,null,null,null,null,null,null,null,null,null,null,null,null,"No","N/A","N/A","N/A","N/A","N/A","N/A","N/A","N/A","N/A","N/A","N/A","N/A","N/A","N/A","N/A","N/A","N/A","N/A","N/A","N/A"]
[null,null,null,null,null,null,null,null,null,null,null,null,null,null,null,null,null,null,null,null,null,null,null,null,null,null,null,null,null,null,null,null,null,null,null,null,null,null,null,null,null,null,null,null,null,null,null,null,null,null,null,null,"Use of Basic Water","Yes","N/A","N/A","N/A","N/A","N/A","N/A","N/A","N/A","N/A","N/A","N/A","N/A","N/A","N/A","N/A","N/A","N/A","N/A","N/A","N/A"]
[null,null,null,null,null,null,null,null,null,null,null,null,null,null,null,null,null,null,null,null,null,null,null,null,null,null,null,null,null,null,null,null,null,null,null,null,null,null,null,null,null,null,null,null,null,null,null,null,null,null,null,null,null,"No","N/A","N/A","N/A","N/A","N/A","N/A","N/A","N/A","N/A","N/A","N/A","N/A","N/A","N/A","N/A","N/A","N/A","N/A","N/A","N/A"]
[null,null,null,null,null,null,null,null,null,null,null,null,null,null,null,null,null,null,null,null,null,null,null,null,null,null,null,null,null,null,null,null,null,null,null,null,null,null,null,null,null,null,null,null,null,null,null,null,null,null,null,null,"Use of Basic Sanitation","Yes","N/A","N/A","N/A","N/A","N/A","N/A","N/A","N/A","N/A","N/A","N/A","N/A","N/A","N/A","N/A","N/A","N/A","N/A","N/A","N/A"]
[null,null,null,null,null,null,null,null,null,null,null,null,null,null,null,null,null,null,null,null,null,null,null,null,null,null,null,null,null,null,null,null,null,null,null,null,null,null,null,null,null,null,null,null,null,null,null,null,null,null,null,null,null,"No","N/A","N/A","N/A","N/A","N/A","N/A","N/A","N/A","N/A","N/A","N/A","N/A","N/A","N/A","N/A","N/A","N/A","N/A","N/A","N/A"]
[null,null,null,null,null,null,null,null,null,null,null,null,null,null,null,null,null,null,null,null,null,null,null,null,null,null,null,null,null,null,null,null,null,null,null,null,null,null,null,null,null,null,null,null,null,null,null,null,null,null,null,null,"Access to Basic Hygiene","Yes","N/A","N/A","N/A","N/A","N/A","N/A","N/A","N/A","N/A","N/A","N/A","N/A","N/A","N/A","N/A","N/A","N/A","N/A","N/A","N/A"]
[null,null,null,null,null,null,null,null,null,null,null,null,null,null,null,null,null,null,null,null,null,null,null,null,null,null,null,null,null,null,null,null,null,null,null,null,null,null,null,null,null,null,null,null,null,null,null,null,null,null,null,null,null,"No","N/A","N/A","N/A","N/A","N/A","N/A","N/A","N/A","N/A","N/A","N/A","N/A","N/A","N/A","N/A","N/A","N/A","N/A","N/A","N/A"]
[]
[]
[]
[]
[]
[]
[]
[]
[]
[]
[]
[]
[]
[]
[]
[]
[]
[]
[]
[]
[]
[]
[]
[]
[]
[]
[]
[]
[]
[]
[]
[]
[]
[]
[]
[]
[]
[]
[]
[]
[]
[]
[]
[]
[null,null,"INITIAL (national) Wealth Index",null,null,null,null,"URBAN Wealth Index",null,null,null,null,"RURAL Wealth Index"]
[null,null,"Component Matrix",null,null,null,null,"Component Matrix",null,null,null,null,"Component Matrix"]
[null,null,null,null,"Component",null,null,null,null,"Component",null,null,null,null,"Component"]
[null,"Note:\n\nThe INITIAL (national) Wealth Index is based on the first component of the Principal Component Analysis (PCA) which has been obtained at national level.\n\nThe final national-level (NATIONAL) Wealth Index is based on the URBAN and RURAL specific wealth indexes. Regression procedures are used to establish the relationships between the two sets of scores (urban and rural) and the initial (national) wealth factors.\nThis allows best use of the available information for each area and a better precision of the FINAL (NATIONAL) Wealth Index.\n\nFor dependency reasons, all WASH variables (contained in the generic MICS and DHS scripts) have been excluded from the sets of asset variables used in the PCAs.\n\nThe PCA can extracts as many components as there are asset variables in the input. Only the first of the components is used to represent the Wealth Index. \n\nThe scores represent the weights of the asset variables on the Wealth Index (correlations between the variables and the component).\n\nThe communalities are the proportion of each variable's variance that can be explained by the component.\n\nProportion of explained variance is the part of the model's total variance that is explained by the component.\n\nFor more information on the procedure used:\n\nThe DHS Wealth Index, DHS Comparative Reports No. 6, Shea Oscar Rutstein, Kiersten Johnson, ORC Macro International Inc., 2004.\n\nThe DHS Wealth Index: Approaches for Rural and Urban Areas, Shea O. Rutstein, ORC Macro International Inc., 2008.\n\nMICS Methodological Paper No. 4, Review of options for reporting water, sanitation and hygiene coverage by wealth quintile, UNICEF, 2016.",null,null,"1",null,null,null,null,"1",null,null,null,null,"1"]
[null,null,"Otro",null,-0.71508068807491876,null,null,"Servicio de internet",null,0.63091944842594094,null,null,"Otro",null,-0.79075861374131562]
[null,null,"Madera / leña",null,-0.70897482382271149,null,null,"Calentador de agua",null,0.58885606795415923,null,null,"Madera / leña",null,-0.78718217834221715]
[null,null,"Estufa de gas",null,0.62517723333917941,null,null,"Teléfono fijo",null,0.57561310357252193,null,null,"Gas licuado (GLP)",null,0.72798571522994748]
[null,null,"Calentador de agua",null,0.59975333593149915,null,null,"Horno de microondas",null,0.57334294323823065,null,null,"Estufa de gas",null,0.71889279764514746]
[null,null,"Servicio de internet",null,0.59484698025658267,null,null,"Computadora",null,0.54234564583457323,null,null,"Lavadora de ropa",null,0.59497226601552911]
[null,null,"Horno de microondas",null,0.57863019007989069,null,null,"Automóvil/camioneta",null,0.53921212874583913,null,null,"Refrigerador",null,0.53187839849676755]
[null,null,"Lavadora de ropa",null,0.57749614905337576,null,null,"Mosaico, mármol o cerámica",null,0.52242287585214719,null,null,"Cemento o concreto",null,0.53012624074415882]
[null,null,"Cemento o concreto",null,0.5658628670913568,null,null,"Otro",null,-0.50303400055794623,null,null,"Automóvil/camioneta",null,0.51655342620871381]
[null,null,"Mosaico, mármol o cerámica",null,0.54028639386639321,null,null,"Lavadora de ropa",null,0.49992299566543436,null,null,"Horno de microondas",null,0.51392029815259721]
[null,null,"Refrigerador",null,0.53541811361668468,null,null,"Madera / leña",null,-0.48887858391721684,null,null,"Calentador de agua",null,0.512301974309609]
[null,null,"Gas licuado (GLP)",null,0.52316819660960168,null,null,"Refrigerador",null,0.48678690281754849,null,null,"Mosaico, mármol o cerámica",null,0.49450844845380965]
[null,null,"Teléfono fijo",null,0.51451742033929138,null,null,"Computadora portátil",null,0.48325912865905146,null,null,"Televisor",null,0.44019960780021106]
[null,null,"Computadora",null,0.50872206855108815,null,null,"Cemento",null,-0.48057911099573375,null,null,"Teléfono celular",null,0.4393600542227179]
[null,null,"Automóvil/camioneta",null,0.4986981632169461,null,null,"Servicio de TV de paga",null,0.4541069976744776,null,null,"Tinaco, cisterna",null,0.42462874314546611]
[null,null,"Tinaco, cisterna",null,0.46088181326914529,null,null,"Reloj de pulso",null,0.44496815233381526,null,null,"Servicio de TV de paga",null,0.41190997427107656]
[null,null,"Lámina metálica",null,-0.44985589583175167,null,null,"Cemento o concreto",null,0.44265270836915122,null,null,"Lámina metálica",null,-0.40382813914194254]
[null,null,"Servicio de TV de paga",null,0.44508320079176694,null,null,"Persons per sleeping rooms",null,-0.42564974387850313,null,null,"Persons per sleeping rooms",null,-0.36489254193831683]
[null,null,"Computadora portátil",null,0.44242454552203203,null,null,"Tinaco, cisterna",null,0.41744823088672517,null,null,"DVD",null,0.36202173193809778]
[null,null,"Teléfono celular",null,0.43614889896942888,null,null,"Estufa de gas",null,0.41735044086615514,null,null,"Servicio de internet",null,0.35010121938006816]
[null,null,"DVD",null,0.42419933771865226,null,null,"DVD",null,0.39967088004113166,null,null,"Tierra / arena",null,-0.34542444529647215]
[null,null,"Cemento",null,-0.4217619381169983,null,null,"Tiene cuenta bancaria",null,0.37421012415860427,null,null,"pollos",null,-0.33299573161098067]
[null,null,"Persons per sleeping rooms",null,-0.41401292163676245,null,null,"Lámina metálica",null,-0.30984950978095044,null,null,"Bicicleta",null,0.32948463317074006]
[null,null,"Reloj de pulso",null,0.40322320035516362,null,null,"Radio",null,0.28745242903211576,null,null,"Computadora",null,0.32380100344979967]
[null,null,"Televisor",null,0.38846703674466054,null,null,"Teléfono celular",null,0.28500837821713376,null,null,"Cemento",null,0.28735172687820859]
[null,null,"Tiene cuenta bancaria",null,0.32597342175076965,null,null,"No es propietario",null,-0.28056288517100697,null,null,"Madera reutilizada o con huecos",null,-0.28186216519641122]
[null,null,"Tierra / arena",null,-0.32214858385985456,null,null,"Propietario",null,0.28056288517100658,null,null,"Computadora portátil",null,0.27976293779327832]
[null,null,"Radio",null,0.28796835187750541,null,null,"Televisor",null,0.25234225961412032,null,null,"Teléfono fijo",null,0.26095835123732791]
[null,null,"Madera reutilizada o con huecos",null,-0.25881323024346919,null,null,"Prestada o la está cuidando",null,-0.23927547460350107,null,null,"Reloj de pulso",null,0.25329130690866242]
[null,null,"Bicicleta",null,0.22790249109833671,null,null,"Tierra / arena",null,-0.23523734486607786,null,null,"Radio",null,0.24430498498743566]
[null,null,"Cemento",null,0.21230227912522048,null,null,"Gas licuado (GLP)",null,0.22446584643477854,null,null,"Cemento",null,-0.21593438282908983]
[null,null,"Lámina de asbesto, plástico o poliuretano",null,-0.19303460223581284,null,null,"Lámina de asbesto, plástico o poliuretano",null,-0.22178965149446292,null,null,"Tejas",null,-0.16942840897777156]
[null,null,"Lámina de cartón",null,-0.17709561992316694,null,null,"Lámina de cartón",null,-0.21170383895199305,null,null,"Electricidad",null,0.1664606057929367]
[null,null,"Tejas",null,-0.16437000790645057,null,null,"pollos",null,-0.20097526458650961,null,null,"cerdos",null,-0.16566430129684528]
[null,null,"Electricidad",null,0.13458779678853131,null,null,"Madera reutilizada o con huecos",null,-0.17891097589641203,null,null,"Tiene cuenta bancaria",null,0.16481858944013003]
[null,null,"Gas natural",null,0.13303920247084158,null,null,"Bicicleta",null,0.16411241306604629,null,null,"Lámina de cartón",null,-0.1456302516161328]
[null,null,"Prestada o la está cuidando",null,-0.13082985327999402,null,null,"Cemento",null,0.13311529797641725,null,null,"Gas natural",null,0.13618651761640729]
[null,null,"Adobe cubierto",null,-0.12712286219285676,null,null,"Tejas",null,-0.10516799189050439,null,null,"Motorcicleta/motoneta",null,0.13604222227187687]
[null,null,"Suelo de linóleum, congoleum o vinil",null,9.2172294425353435E-2,null,null,"Gas natural",null,0.10516081239408728,null,null,"Lámina de asbesto, plástico o poliuretano",null,-0.1202524646625166]
[null,null,"Cerámicos",null,6.2514320589143024E-2,null,null,"Electricidad",null,8.6618766764282956E-2,null,null,"Adobe cubierto",null,-9.5594896815029043E-2]
[null,null,"Lancha con motor",null,5.2295267353407157E-2,null,null,"Suelo de linóleum, congoleum o vinil",null,8.6232320073080806E-2,null,null,"Cerámicos",null,6.857911424753052E-2]
[null,null,"Propietario",null,5.0683445646334861E-2,null,null,"cerdos",null,-7.8867977661939426E-2,null,null,"Cartón",null,-5.719602487875778E-2]
[null,null,"No es propietario",null,-5.0683445646334507E-2,null,null,"Carbón",null,-7.6251539723177816E-2,null,null,"Lancha con motor",null,5.4307027057105765E-2]
[null,null,"Cartón",null,-4.3693780216990843E-2,null,null,"Madera",null,-5.5691692327931031E-2,null,null,"Suelo de linóleum, congoleum o vinil",null,5.2202048643284163E-2]
[null,null,"Carbón",null,-4.3394127892432285E-2,null,null,"Lancha con motor",null,5.4965571096765524E-2,null,null,"Cartón",null,-4.770539284070182E-2]
[null,null,"Cartón",null,-4.2748068838649823E-2,null,null,"Cerámicos",null,4.7338375360270517E-2,null,null,"ovejas",null,-4.7031701292374543E-2]
[null,null,"Motorcicleta/motoneta",null,3.9214128787743302E-2,null,null,"Ladrillo",null,-4.6818948296747868E-2,null,null,"Animal drawn cart",null,4.4939485130866694E-2]
[null,null,"Material de desecho",null,-3.2536051607394458E-2,null,null,"Otro",null,-4.5187544151423377E-2,null,null,"Intestada o está en litigio",null,3.9171998105429262E-2]
[null,null,"Tabiques de cemento",null,3.2398122621906181E-2,null,null,"Adobe cubierto",null,-3.8052743360268496E-2,null,null,"Tabiques de cemento",null,3.8224338074094907E-2]
[null,null,"Tablones de madera",null,-2.7016123910921609E-2,null,null,"Material de desecho",null,-3.4737637007069645E-2,null,null,"Ladrillo",null,3.7049225176981913E-2]
[null,null,"Parquet o madera lustrada",null,2.2632503579273992E-2,null,null,"Cartón",null,-3.3129650677034564E-2,null,null,"Parquet o madera lustrada",null,3.5910970362072581E-2]
[null,null,"Alfombra",null,-1.5705974887795095E-2,null,null,"Motorcicleta/motoneta",null,3.2854924970875873E-2,null,null,"Madera",null,3.3543442303108552E-2]
[null,null,"Asociación ejidal",null,-1.2066349630220328E-2,null,null,"ovejas",null,-2.7456678998439517E-2,null,null,"Tablones de madera",null,-2.7130080992178927E-2]
[null,null,"Otro",null,-1.059422236934056E-2,null,null,"Intestada o está en litigio",null,-2.6900920771276753E-2,null,null,"ganado",null,2.5841095425116933E-2]
[null,null,"Animal drawn cart",null,1.0198723574996058E-2,null,null,"Electricidad",null,-2.6230344436409855E-2,null,null,"Prestada o la está cuidando",null,-2.4766906403182697E-2]
[null,null,"Intestada o está en litigio",null,7.7858140904431567E-3,null,null,"Alfombra",null,-2.590408575705894E-2,null,null,"Alfombra",null,-2.0861826386246861E-2]
[null,null,"Ladrillo",null,-6.385446645718296E-3,null,null,"Tablones de madera",null,-2.5230738997572173E-2,null,null,"Propietario",null,-2.0458403453351467E-2]
[null,null,"Madera",null,-5.2891614167884906E-3,null,null,"ganado",null,2.4853028358207078E-2,null,null,"No es propietario",null,2.0458403453350857E-2]
[null,null,"Electricidad",null,4.5583570204997797E-3,null,null,"Cartón",null,-2.3944871502392259E-2,null,null,"Material de desecho",null,-2.0099776020430699E-2]
[null,null,"Piedra con cal / cemento",null,4.0004938703708708E-3,null,null,"Tierra agrícola",null,2.2969616721463207E-2,null,null,"Piedra con cal / cemento",null,1.7110979110282285E-2]
[null,null,null,null,null,null,null,"conejos",null,-2.2834721098766584E-2,null,null,"Otro",null,1.5118231296277035E-2]
[null,null,null,null,null,null,null,"Parquet o madera lustrada",null,1.985077582372733E-2,null,null,"Asociación ejidal",null,1.5095255533604328E-2]
[null,null,null,null,null,null,null,"Asociación ejidal",null,-1.9324005699443644E-2,null,null,"conejos",null,-1.4365021377108768E-2]
[null,null,"Communalities",null,null,null,null,"Animal drawn cart",null,1.8999253355897326E-2,null,null,"Tierra agrícola",null,1.3795372185579894E-2]
[null,null,null,null,"Extraction",null,null,"Tabiques de cemento",null,7.8265476767628468E-3,null,null,"Carbón",null,-1.2919297371759036E-2]
[null,null,"Persons per sleeping rooms",null,0.171406699282208,null,null,"Piedra con cal / cemento",null,-2.7947590071063433E-3,null,null,"Electricidad",null,7.4912238386564802E-3]
[null,null,"Tierra / arena",null,0.10377971008290975]
[null,null,"Tablones de madera",null,7.2987095117027024E-4]
[null,null,"Parquet o madera lustrada",null,5.1223021826585008E-4]
[null,null,"Suelo de linóleum, congoleum o vinil",null,8.4957318596340405E-3,null,null,"Communalities",null,null,null,null,"Communalities"]
[null,null,"Mosaico, mármol o cerámica",null,0.29190938739715139,null,null,null,null,"Extraction",null,null,null,null,"Extraction"]
[null,null,"Cemento",null,0.1778831324442067,null,null,"Persons per sleeping rooms",null,0.1811777044638353,null,null,"Persons per sleeping rooms",null,0.1331465671622063]
[null,null,"Alfombra",null,2.4667764717605016E-4,null,null,"Tierra / arena",null,5.5336608419642053E-2,null,null,"Tierra / arena",null,0.11931804740837548]
[null,null,"Cartón",null,1.9091464296507005E-3,null,null,"Tablones de madera",null,6.3659019036360924E-4,null,null,"Tablones de madera",null,7.3604129464218825E-4]
[null,null,"Lámina de cartón",null,3.1362858595970801E-2,null,null,"Parquet o madera lustrada",null,3.9405330080387747E-4,null,null,"Parquet o madera lustrada",null,1.2895977923456552E-3]
[null,null,"Lámina de asbesto, plástico o poliuretano",null,3.7262357660338481E-2,null,null,"Suelo de linóleum, congoleum o vinil",null,7.436013025186255E-3,null,null,"Suelo de linóleum, congoleum o vinil",null,2.7250538825558061E-3]
[null,null,"Lámina metálica",null,0.20237032701458782,null,null,"Mosaico, mármol o cerámica",null,0.27292566121362799,null,null,"Mosaico, mármol o cerámica",null,0.24453860559219412]
[null,null,"Material de desecho",null,1.0585946541990354E-3,null,null,"Cemento",null,0.23095628192544979,null,null,"Cemento",null,4.6627657687779926E-2]
[null,null,"Madera",null,2.7975228492844033E-5,null,null,"Alfombra",null,6.7102165890906386E-4,null,null,"Alfombra",null,4.3521580016990578E-4]
[null,null,"Cerámicos",null,3.908040278722151E-3,null,null,"Cartón",null,1.0975737539823368E-3,null,null,"Cartón",null,3.271385261931479E-3]
[null,null,"Cemento o concreto",null,0.32020078435285054,null,null,"Lámina de cartón",null,4.4818515427011409E-2,null,null,"Lámina de cartón",null,2.1208170185778148E-2]
[null,null,"Tejas",null,2.7017499499166622E-2,null,null,"Lámina de asbesto, plástico o poliuretano",null,4.9190649510035316E-2,null,null,"Lámina de asbesto, plástico o poliuretano",null,1.4460655257409803E-2]
[null,null,"Cartón",null,1.827397389433944E-3,null,null,"Lámina metálica",null,9.6006718711495298E-2,null,null,"Lámina metálica",null,0.16307716596284411]
[null,null,"Madera reutilizada o con huecos",null,6.6984288149059004E-2,null,null,"Material de desecho",null,1.2067034248349345E-3,null,null,"Material de desecho",null,4.0400099607148095E-4]
[null,null,"Cemento",null,4.5072257721763029E-2,null,null,"Madera",null,3.1015645943489318E-3,null,null,"Madera",null,1.1251625215419725E-3]
[null,null,"Piedra con cal / cemento",null,1.6003951206874909E-5,null,null,"Cerámicos",null,2.240921781749867E-3,null,null,"Cerámicos",null,4.7030949109758439E-3]
[null,null,"Ladrillo",null,4.0773928865315038E-5,null,null,"Cemento o concreto",null,0.19594142022654484,null,null,"Cemento o concreto",null,0.28103383112553382]
[null,null,"Tabiques de cemento",null,1.049638349424069E-3,null,null,"Tejas",null,1.1060306518281198E-2,null,null,"Tejas",null,2.8705985768739024E-2]
[null,null,"Adobe cubierto",null,1.6160222092104052E-2,null,null,"Cartón",null,5.7335687126607688E-4,null,null,"Cartón",null,2.2758045060856844E-3]
[null,null,"Electricidad",null,2.077861872633963E-5,null,null,"Madera reutilizada o con huecos",null,3.2009137296206525E-2,null,null,"Madera reutilizada o con huecos",null,7.9446280169209002E-2]
[null,null,"Gas licuado (GLP)",null,0.27370496194374283,null,null,"Cemento",null,1.7719682555350353E-2,null,null,"Cemento",null,8.2571014939888582E-2]
[null,null,"Gas natural",null,1.7699429394077582E-2,null,null,"Piedra con cal / cemento",null,7.8106779078020335E-6,null,null,"Piedra con cal / cemento",null,2.9278560611251673E-4]
[null,null,"Otro",null,0.5113403904576993,null,null,"Ladrillo",null,2.1920139196135503E-3,null,null,"Ladrillo",null,1.3726450862147105E-3]
[null,null,"Carbón",null,1.8830503355447697E-3,null,null,"Tabiques de cemento",null,6.1254848536641918E-5,null,null,"Tabiques de cemento",null,1.4611000212027016E-3]
[null,null,"Madera / leña",null,0.50264530081444481,null,null,"Adobe cubierto",null,1.4480112772424581E-3,null,null,"Adobe cubierto",null,9.1383842970760507E-3]
[null,null,"Electricidad",null,1.8113875044390996E-2,null,null,"Electricidad",null,6.8803096925269748E-4,null,null,"Electricidad",null,5.6118434600855128E-5]
[null,null,"Radio",null,8.2925771683046781E-2,null,null,"Gas licuado (GLP)",null,5.0384916215681586E-2,null,null,"Gas licuado (GLP)",null,0.52996320157885823]
[null,null,"Televisor",null,0.15090663863717743,null,null,"Gas natural",null,1.1058796463384422E-2,null,null,"Gas natural",null,1.8546767580484014E-2]
[null,null,"Teléfono fijo",null,0.26472817583259906,null,null,"Otro",null,0.25304320571733185,null,null,"Otro",null,0.62529918520608718]
[null,null,"Refrigerador",null,0.28667255638884909,null,null,"Carbón",null,5.8142973101553645E-3,null,null,"Carbón",null,1.6690824457993994E-4]
[null,null,"DVD",null,0.17994507812094318,null,null,"Madera / leña",null,0.23900226981290323,null,null,"Madera / leña",null,0.61965578189959813]
[null,null,"Horno de microondas",null,0.33481289687189042,null,null,"Electricidad",null,7.5028107557652494E-3,null,null,"Electricidad",null,2.7709133280951471E-2]
[null,null,"Computadora",null,0.25879814303089804,null,null,"Radio",null,8.2628898956463553E-2,null,null,"Radio",null,5.9684925689711163E-2]
[null,null,"Servicio de TV de paga",null,0.19809905562704433,null,null,"Televisor",null,6.3676615987160096E-2,null,null,"Televisor",null,0.19377569470745964]
[null,null,"Servicio de internet",null,0.35384292992037525,null,null,"Teléfono fijo",null,0.33133044500439085,null,null,"Teléfono fijo",null,6.8099261080504597E-2]
[null,null,"Lavadora de ropa",null,0.33350180217147879,null,null,"Refrigerador",null,0.23696148875470141,null,null,"Refrigerador",null,0.28289463078748628]
[null,null,"Estufa de gas",null,0.39084657308563076,null,null,"DVD",null,0.15973681235285264,null,null,"DVD",null,0.13105973439545993]
[null,null,"Calentador de agua",null,0.35970406396096166,null,null,"Horno de microondas",null,0.32872213056107696,null,null,"Horno de microondas",null,0.26411407285325439]
[null,null,"Tinaco, cisterna",null,0.21241204580225531,null,null,"Computadora",null,0.29413879955572036,null,null,"Computadora",null,0.10484708983509718]
[null,null,"Reloj de pulso",null,0.16258894930466042,null,null,"Servicio de TV de paga",null,0.20621316533692799,null,null,"Servicio de TV de paga",null,0.16966982690399895]
[null,null,"Teléfono celular",null,0.19022586207224507,null,null,"Servicio de internet",null,0.39805935040209356,null,null,"Servicio de internet",null,0.12257086381141062]
[null,null,"Bicicleta",null,5.1939545448827444E-2,null,null,"Lavadora de ropa",null,0.24992300159510189,null,null,"Lavadora de ropa",null,0.35399199732765352]
[null,null,"Motorcicleta/motoneta",null,1.5377478965817181E-3,null,null,"Estufa de gas",null,0.17418139049117407,null,null,"Estufa de gas",null,0.51680685450606689]
[null,null,"Animal drawn cart",null,1.0401396255918036E-4,null,null,"Calentador de agua",null,0.34675146876643342,null,null,"Calentador de agua",null,0.26245331288152329]
[null,null,"Automóvil/camioneta",null,0.24869985799595581,null,null,"Tinaco, cisterna",null,0.17426302547045661,null,null,"Tinaco, cisterna",null,0.18030956950529822]
[null,null,"Lancha con motor",null,2.7347949875643324E-3,null,null,"Reloj de pulso",null,0.19799665659136942,null,null,"Reloj de pulso",null,6.4156486155498224E-2]
[null,null,"Computadora portátil",null,0.19573947848037659,null,null,"Teléfono celular",null,8.1229775653960765E-2,null,null,"Teléfono celular",null,0.1930372572465896]
[null,null,"Propietario",null,2.5688116625849802E-3,null,null,"Bicicleta",null,2.6932884122360602E-2,null,null,"Bicicleta",null,0.10856012349565713]
[null,null,"No es propietario",null,2.5688116625849442E-3,null,null,"Motorcicleta/motoneta",null,1.079446094841883E-3,null,null,"Motorcicleta/motoneta",null,1.8507486240670751E-2]
[null,null,"Prestada o la está cuidando",null,1.7116450509264764E-2,null,null,"Animal drawn cart",null,3.6097162808157581E-4,null,null,"Animal drawn cart",null,2.0195573238273885E-3]
[null,null,"Intestada o está en litigio",null,6.0618901050943197E-5,null,null,"Automóvil/camioneta",null,0.2907497197866194,null,null,"Automóvil/camioneta",null,0.26682744212796111]
[null,null,"Asociación ejidal",null,1.4559679339871823E-4,null,null,"Lancha con motor",null,3.0212140059935858E-3,null,null,"Lancha con motor",null,2.9492531877812179E-3]
[null,null,"Otro",null,1.1223754761103592E-4,null,null,"Computadora portátil",null,0.23353938543230565,null,null,"Computadora portátil",null,7.8267301362725722E-2]
[null,null,"Tiene cuenta bancaria",null,0.10625867168790515,null,null,"Propietario",null,7.8715532535479429E-2,null,null,"Propietario",null,4.1854627186010328E-4]
[null,null,null,null,null,null,null,"No es propietario",null,7.8715532535479638E-2,null,null,"No es propietario",null,4.1854627186007829E-4]
[null,null,null,null,null,null,null,"Prestada o la está cuidando",null,5.7252752746730688E-2,null,null,"Prestada o la está cuidando",null,6.1339965278401211E-4]
[null,null,"Total Variance Explained",null,null,null,null,"Intestada o está en litigio",null,7.23659538342509E-4,null,null,"Intestada o está en litigio",null,1.5344454355717537E-3]
[null,null,"Component",null,"Extraction Sums of Squared Loadings",null,null,"Asociación ejidal",null,3.734171962721304E-4,null,null,"Asociación ejidal",null,2.2786673962481207E-4]
[null,null,null,null,"Total","% of Variance","Cumulative %","Otro",null,2.0419141464368372E-3,null,null,"Otro",null,2.2856091752773041E-4]
[null,null,"1",null,7.2262365718335042,12.247858596327973,12.247858596327973,"Tierra agrícola",null,5.2760329233092213E-4,null,null,"Tierra agrícola",null,1.9031229373867137E-4]
[null,null,null,null,null,null,null,"ganado",null,6.1767301857384516E-4,null,null,"ganado",null,6.6776221276999923E-4]
[null,null,null,null,null,null,null,"ovejas",null,7.5386922162334967E-4,null,null,"ovejas",null,2.2119809264551453E-3]
[null,null,"Component Score Coefficient Matrix",null,null,null,null,"pollos",null,4.039105697561754E-2,null,null,"pollos",null,0.11088615727113227]
[null,null,null,null,"Component",null,null,"cerdos",null,6.2201579004841764E-3,null,null,"cerdos",null,2.7444660724171933E-2]
[null,null,null,null,"1",null,null,"conejos",null,5.2142448765845576E-4,null,null,"conejos",null,2.063538391647919E-4]
[null,null,"Persons per sleeping rooms",null,-5.7293020719873203E-2,null,null,"Tiene cuenta bancaria",null,0.14003321702279803,null,null,"Tiene cuenta bancaria",null,2.7165167425034144E-2]
[null,null,"Tierra / arena",null,-4.4580409270785361E-2]
[null,null,"Tablones de madera",null,-3.7386160337215257E-3]
[null,null,"Parquet o madera lustrada",null,3.1319904011295708E-3,null,null,"Total Variance Explained",null,null,null,null,"Total Variance Explained"]
[null,null,"Suelo de linóleum, congoleum o vinil",null,1.2755227912773229E-2,null,null,"Component",null,"Extraction Sums of Squared Loadings",null,null,"Component",null,"Extraction Sums of Squared Loadings"]
[null,null,"Mosaico, mármol o cerámica",null,7.4767327155095764E-2,null,null,null,null,"Total","% of Variance","Cumulative %",null,null,"Total","% of Variance","Cumulative %"]
[null,null,"Cemento",null,-5.8365365418694727E-2,null,null,"1",null,6.0640883600046127,9.3293667076994051,9.3293667076994051,"1",null,6.6815778508693757,10.27935053979904,10.27935053979904]
[null,null,"Alfombra",null,-2.1734653621795332E-3]
[null,null,"Cartón",null,-6.0465471594579245E-3]
[null,null,"Lámina de cartón",null,-2.4507310017146684E-2,null,null,"Component Score Coefficient Matrix",null,null,null,null,"Component Score Coefficient Matrix"]
[null,null,"Lámina de asbesto, plástico o poliuretano",null,-2.6713020023206135E-2,null,null,null,null,"Component",null,null,null,null,"Component"]
[null,null,"Lámina metálica",null,-6.2253137073480881E-2,null,null,null,null,"1",null,null,null,null,"1"]
[null,null,"Material de desecho",null,-4.5024891288798653E-3,null,null,"Persons per sleeping rooms",null,-7.0191876933366343E-2,null,null,"Persons per sleeping rooms",null,-5.4611732450417949E-2]
[null,null,"Madera",null,-7.3193859130001862E-4,null,null,"Tierra / arena",null,-3.879187289182226E-2,null,null,"Tierra / arena",null,-5.1698034956148449E-2]
[null,null,"Cerámicos",null,8.6510204817832788E-3,null,null,"Tablones de madera",null,-4.1606812928354133E-3,null,null,"Tablones de madera",null,-4.06043027526034E-3]
[null,null,"Cemento o concreto",null,7.8306717676111331E-2,null,null,"Parquet o madera lustrada",null,3.2734971268974433E-3,null,null,"Parquet o madera lustrada",null,5.3746242524735409E-3]
[null,null,"Tejas",null,-2.2746281037509013E-2,null,null,"Suelo de linóleum, congoleum o vinil",null,1.4220162199782855E-2,null,null,"Suelo de linóleum, congoleum o vinil",null,7.8128325087901043E-3]
[null,null,"Cartón",null,-5.915675250001317E-3,null,null,"Mosaico, mármol o cerámica",null,8.6150274342597102E-2,null,null,"Mosaico, mármol o cerámica",null,7.4010729125825667E-2]
[null,null,"Madera reutilizada o con huecos",null,-3.5815770445749587E-2,null,null,"Cemento",null,-7.9250017886508525E-2,null,null,"Cemento",null,-3.2317872761295975E-2]
[null,null,"Cemento",null,2.9379370162434814E-2,null,null,"Alfombra",null,-4.2717197077648183E-3,null,null,"Alfombra",null,-3.1222904008418343E-3]
[null,null,"Piedra con cal / cemento",null,5.5360682294349948E-4,null,null,"Cartón",null,-5.463253288909755E-3,null,null,"Cartón",null,-8.5602571960327768E-3]
[null,null,"Ladrillo",null,-8.8364760581013263E-4,null,null,"Lámina de cartón",null,-3.4911074242960402E-2,null,null,"Lámina de cartón",null,-2.1795787591876087E-2]
[null,null,"Tabiques de cemento",null,4.4834018786747039E-3,null,null,"Lámina de asbesto, plástico o poliuretano",null,-3.6574277670039457E-2,null,null,"Lámina de asbesto, plástico o poliuretano",null,-1.7997614836871196E-2]
[null,null,"Adobe cubierto",null,-1.7591848942277576E-2,null,null,"Lámina metálica",null,-5.1095810513670473E-2,null,null,"Lámina metálica",null,-6.0439038226486934E-2]
[null,null,"Electricidad",null,6.3080650282989472E-4,null,null,"Material de desecho",null,-5.7284186747970176E-3,null,null,"Material de desecho",null,-3.0082379445470972E-3]
[null,null,"Gas licuado (GLP)",null,7.2398431937422569E-2,null,null,"Madera",null,-9.1838523817104577E-3,null,null,"Madera",null,5.0202875805366908E-3]
[null,null,"Gas natural",null,1.8410579441780678E-2,null,null,"Cerámicos",null,7.8063465685111657E-3,null,null,"Cerámicos",null,1.0263910079055255E-2]
[null,null,"Otro",null,-9.8956169088369919E-2,null,null,"Cemento o concreto",null,7.2995755023730305E-2,null,null,"Cemento o concreto",null,7.9341474809753412E-2]
[null,null,"Carbón",null,-6.0050798864756715E-3,null,null,"Tejas",null,-1.7342753872805441E-2,null,null,"Tejas",null,-2.5357544693687339E-2]
[null,null,"Madera / leña",null,-9.8111211385766214E-2,null,null,"Cartón",null,-3.9486349935662947E-3,null,null,"Cartón",null,-7.1398394070189015E-3]
[null,null,"Electricidad",null,1.8624881077534735E-2,null,null,"Madera reutilizada o con huecos",null,-2.9503359000572993E-2,null,null,"Madera reutilizada o con huecos",null,-4.2184970599382705E-2]
[null,null,"Radio",null,3.9850390865966291E-2,null,null,"Cemento",null,2.1951411337336777E-2,null,null,"Cemento",null,4.300656720490352E-2]
[null,null,"Televisor",null,5.375786315366856E-2,null,null,"Piedra con cal / cemento",null,-4.60870429517326E-4,null,null,"Piedra con cal / cemento",null,2.5609189164885488E-3]
[null,null,"Teléfono fijo",null,7.1201297552972789E-2,null,null,"Ladrillo",null,-7.7206903193462453E-3,null,null,"Ladrillo",null,5.5449814405980841E-3]
[null,null,"Refrigerador",null,7.409363204404941E-2,null,null,"Tabiques de cemento",null,1.2906387922020472E-3,null,null,"Tabiques de cemento",null,5.7208550027028938E-3]
[null,null,"DVD",null,5.8702664035675312E-2,null,null,"Adobe cubierto",null,-6.2750971129054501E-3,null,null,"Adobe cubierto",null,-1.430723385234383E-2]
[null,null,"Horno de microondas",null,8.0073518812722122E-2,null,null,"Electricidad",null,-4.3255214764696967E-3,null,null,"Electricidad",null,1.1211758668174102E-3]
[null,null,"Computadora",null,7.0399309999618617E-2,null,null,"Gas licuado (GLP)",null,3.7015596262619063E-2,null,null,"Gas licuado (GLP)",null,0.108954161947724]
[null,null,"Servicio de TV de paga",null,6.1592669485333019E-2,null,null,"Gas natural",null,1.7341569936162225E-2,null,null,"Gas natural",null,2.0382388809356965E-2]
[null,null,"Servicio de internet",null,8.2317673154402818E-2,null,null,"Otro",null,-8.2952947037460964E-2,null,null,"Otro",null,-0.11834908331396991]
[null,null,"Lavadora de ropa",null,7.991658497652096E-2,null,null,"Carbón",null,-1.2574279132555353E-2,null,null,"Carbón",null,-1.933569833370727E-3]
[null,null,"Estufa de gas",null,8.6514913693249595E-2,null,null,"Madera / leña",null,-8.0618644533874323E-2,null,null,"Madera / leña",null,-0.11781381522626319]
[null,null,"Calentador de agua",null,8.2996637318687241E-2,null,null,"Electricidad",null,1.4283889287559304E-2,null,null,"Electricidad",null,2.4913367696715181E-2]
[null,null,"Tinaco, cisterna",null,6.3778954465118803E-2,null,null,"Radio",null,4.7402414339473294E-2,null,null,"Radio",null,3.6563965943410791E-2]
[null,null,"Reloj de pulso",null,5.5799889243434264E-2,null,null,"Televisor",null,4.1612563114751241E-2,null,null,"Televisor",null,6.5882583070245068E-2]
[null,null,"Teléfono celular",null,6.0356299525184988E-2,null,null,"Teléfono fijo",null,9.4921622080731696E-2,null,null,"Teléfono fijo",null,3.9056396118077603E-2]
[null,null,"Bicicleta",null,3.1538199563886031E-2,null,null,"Refrigerador",null,8.027371534163763E-2,null,null,"Refrigerador",null,7.9603711932737881E-2]
[null,null,"Motorcicleta/motoneta",null,5.4266322999433096E-3,null,null,"DVD",null,6.5907825927659744E-2,null,null,"DVD",null,5.4182071962387342E-2]
[null,null,"Animal drawn cart",null,1.4113464835553188E-3,null,null,"Horno de microondas",null,9.4547260725896559E-2,null,null,"Horno de microondas",null,7.6916008407464473E-2]
[null,null,"Automóvil/camioneta",null,6.9012155671844003E-2,null,null,"Computadora",null,8.9435643684149857E-2,null,null,"Computadora",null,4.8461757189234615E-2]
[null,null,"Lancha con motor",null,7.2368606858574441E-3,null,null,"Servicio de TV de paga",null,7.488462745192126E-2,null,null,"Servicio de TV de paga",null,6.1648608078027682E-2]
[null,null,"Computadora portátil",null,6.1224752486864154E-2,null,null,"Servicio de internet",null,0.10404192864126752,null,null,"Servicio de internet",null,5.2397985504952949E-2]
[null,null,"Propietario",null,7.0138093518677894E-3,null,null,"Lavadora de ropa",null,8.2439926001515923E-2,null,null,"Lavadora de ropa",null,8.904667120478349E-2]
[null,null,"No es propietario",null,-7.01380935186774E-3,null,null,"Estufa de gas",null,6.8823278304908739E-2,null,null,"Estufa de gas",null,0.10759326819062785]
[null,null,"Prestada o la está cuidando",null,-1.8104839494176527E-2,null,null,"Calentador de agua",null,9.7105456417477282E-2,null,null,"Calentador de agua",null,7.6673801569632355E-2]
[null,null,"Intestada o está en litigio",null,1.077436922116663E-3,null,null,"Tinaco, cisterna",null,6.8839404392584999E-2,null,null,"Tinaco, cisterna",null,6.3552165764291069E-2]
[null,null,"Asociación ejidal",null,-1.6697972049867097E-3,null,null,"Reloj de pulso",null,7.337758388690048E-2,null,null,"Reloj de pulso",null,3.7908906034179547E-2]
[null,null,"Otro",null,-1.4660774338104048E-3,null,null,"Teléfono celular",null,4.6999377531648789E-2,null,null,"Teléfono celular",null,6.5756931076624434E-2]
[null,null,"Tiene cuenta bancaria",null,4.5109708007810327E-2,null,null,"Bicicleta",null,2.7062998314543268E-2,null,null,"Bicicleta",null,4.9312399035786006E-2]
[null,null,null,null,null,null,null,"Motorcicleta/motoneta",null,5.4179495779726533E-3,null,null,"Motorcicleta/motoneta",null,2.0360792810963913E-2]
[null,null,null,null,null,null,null,"Animal drawn cart",null,3.1330766024462863E-3,null,null,"Animal drawn cart",null,6.725879146198886E-3]
[null,null,"Component Score Covariance Matrix",null,null,null,null,"Automóvil/camioneta",null,8.8918910268884821E-2,null,null,"Automóvil/camioneta",null,7.731009616860221E-2]
[null,null,"Component",null,"1",null,null,"Lancha con motor",null,9.064111179396421E-3,null,null,"Lancha con motor",null,8.1278746232133769E-3]
[null,null,"1",null,1,null,null,"Computadora portátil",null,7.9691966866176051E-2,null,null,"Computadora portátil",null,4.1870789211395171E-2]
[null,null,null,null,null,null,null,"Propietario",null,4.6266292394656523E-2,null,null,"Propietario",null,-3.0619120079083597E-3]
[null,null,null,null,null,null,null,"No es propietario",null,-4.6266292394656586E-2,null,null,"No es propietario",null,3.0619120079082682E-3]
[null,null,null,null,null,null,null,"Prestada o la está cuidando",null,-3.9457781681024026E-2,null,null,"Prestada o la está cuidando",null,-3.7067451664819185E-3]
[null,null,null,null,null,null,null,"Intestada o está en litigio",null,-4.4361030338377671E-3,null,null,"Intestada o está en litigio",null,5.8626867754496634E-3]
[null,null,null,null,null,null,null,"Asociación ejidal",null,-3.1866299684704699E-3,null,null,"Asociación ejidal",null,2.259235149320337E-3]
[null,null,null,null,null,null,null,"Otro",null,-7.4516632128013719E-3,null,null,"Otro",null,2.262673822517824E-3]
[null,null,null,null,null,null,null,"Tierra agrícola",null,3.7878103612338744E-3,null,null,"Tierra agrícola",null,2.064687786850363E-3]
[null,null,null,null,null,null,null,"ganado",null,4.0983948258610419E-3,null,null,"ganado",null,3.8675139318708404E-3]
[null,null,null,null,null,null,null,"ovejas",null,-4.5277504825834416E-3,null,null,"ovejas",null,-7.0390111949761996E-3]
[null,null,null,null,null,null,null,"pollos",null,-3.314187601751184E-2,null,null,"pollos",null,-4.9837888451401177E-2]
[null,null,null,null,null,null,null,"cerdos",null,-1.3005743481923708E-2,null,null,"cerdos",null,-2.4794188587548952E-2]
[null,null,null,null,null,null,null,"conejos",null,-3.7655653650055343E-3,null,null,"conejos",null,-2.1499444738550286E-3]
[null,null,null,null,null,null,null,"Tiene cuenta bancaria",null,6.1709213643173166E-2,null,null,"Tiene cuenta bancaria",null,2.4667614913546902E-2]
[]
[]
[null,null,null,null,null,null,null,"Component Score Covariance Matrix",null,null,null,null,"Component Score Covariance Matrix"]
[null,null,null,null,null,null,null,"Component",null,"1",null,null,"Component",null,"1"]
[null,null,null,null,null,null,null,"1",null,1,null,null,"1",null,1.0000000000000002]
[]
[]
[]
[]
[]
[]
[]
[]
[]
[]
[]
[]
[]
[]
[]
[]
[]
[]
[]
[]
[]
[]
[]
[]
[]
[]
[]
[]
[]
[]
[]
[]
[]
[]
[]
[]
[]
[]
[]
[]
[]
[]
[]
[]
[]
[]
[]
[]
[]
[]
[]
[]
[]
[]
[]
[]
[]
[]
[]
[]
[]
[]
[]
[]
[]
[]
[]
[]
[]
[]
[]
[]
[]
[]
[]
[]
[]
[]
[]
[]
[]
[]
[]
[]
[]
[]
[]
[]
[]
[]
[]
[]
[]
[]
[]
[]
[]
[]
[]
[]
[]
[]
[]
[]
[]
[]
[]
[]
[]
[]
[]
[]
[]
[]
[]
[]
[]
[]
[]
[]
[]
[]
[]
[]
[]
[]
[]
[]
[]
[]
[]
[]
[]
[]
[]
[]
[]
[]
[]
[]
[]
[]
[]
[]
[]
[]
[]
[]
[]
[]
[]
[]
[]
[]
[]
[]
[]
[]
[]
[]
[]
[]
[]
[]
[]
[]
[]
[]
[]
[]
[]
[]
[]
[]
[]
[]
[]
[]
[]
[]
[]
[]
[]
[]
[]
[]
[]
[]
[]
[]
[]
[]
[]
[]
[]
[]
[]
[]
[]
[]
[]
[]
[]
[]
[]
[]
[]
[]
[]
[]
[]
[]
[]
[]
[]
[]
[]
[]
[]
[]
[]
[]
[]
[]
[]
[]
[]
[]
[]
[]
[]
[]
[]
[]
[]
[]
[]
[]
[]
[]
[]
[]
[]
[]
[]
[]
[]
[]
[]
[]
[]
[]
[]
[]
[]
[]
[]
[]
[]
[]
[]
[]
[]
[]
[]
[]
[]
[]
[]
[]
[]
[]
[]
[]
[]
[]
[]
[]
[]
[]
[]
[]
[]
[]
[]
[]
[]
[]
[]
[]
[]
[]
[]
[]
[]
[]
[]
[]
[]
[]
[]
[]
[]
[]
[]
[]
[]
[]
[]
[]
[]
[]
[]
[]
[]
[]
[]
[]
[]
[]
[]
[]
[]
[]
[]
[]
[]
[]
[]
[]
[]
[]
[]
[]
[]
[]
[]
[]
[]
[]
[]
[]
[]
[]
[]
[]
[]
[]
[]
[]
[]
[]
[]
[]
[]
[]
[]
[]
[]
[]
[]
[]
[]
[]
[]
[]
[]
[]
[]
[]
[]
[]
[]
[]
[]
[]
[]
[]
[]
[]
[]
[]
[]
[]
[]
[]
[]
[]
[]
[]
[]
[]
[]
[]
[]
[]
[]
[]
[]
[]
[]
[]
[]
[]
[]
[]
["MICS15"]
["Mexico",null,"Count"]
["W_text_t","",10760]
["W_text_i","",10760]
["S_text_s","",10760]
["S_text_i","",10760]
["Urban/Rural","Urban",7240]
[null,"Rural",3520]
[null,"Missing",0]
["2015"]
[]
["Sub-national region names","Weighted population"]
[{"$f":"R15","v":"Centro"},{"$f":"BR122+BR123","v":6205.203930405849}]
[{"$f":"S15","v":"DF-Edo México"},{"$f":"BS122+BS123","v":8845.9969480853924}]
[{"$f":"T15","v":"Noreste"},{"$f":"BT122+BT123","v":8777.828176852976}]
[{"$f":"U15","v":"Noroeste"},{"$f":"BU122+BU123","v":8083.9642158819079}]
[{"$f":"V15","v":"Sur"},{"$f":"BV122+BV123","v":8467.6486149599095}]
[{"$f":"W15","v":0},{"$f":"BW122+BW123","v":0}]
[{"$f":"X15","v":0},{"$f":"BX122+XR123","v":0}]
[{"$f":"Y15","v":0},{"$f":"BY122+BY123","v":0}]
[{"$f":"Z15","v":0},{"$f":"BZ122+BZ123","v":0}]
[{"$f":"AA15","v":0},{"$f":"CA122+CA123","v":0}]
[{"$f":"AB15","v":0},{"$f":"CB122+CB123","v":0}]
[{"$f":"AC15","v":0},{"$f":"CC122+CC123","v":0}]
[{"$f":"AD15","v":0},{"$f":"CD122+CD123","v":0}]
[{"$f":"AE15","v":0},{"$f":"CE122+CE123","v":0}]
[{"$f":"AF15","v":0},{"$f":"CF122+CF123","v":0}]
[{"$f":"AG15","v":0},{"$f":"CG122+CG123","v":0}]
[{"$f":"AH15","v":0},{"$f":"CH122+CH123","v":0}]
[{"$f":"AI15","v":0},{"$f":"CI122+CI123","v":0}]
[{"$f":"AJ15","v":0},{"$f":"CJ122+CJ123","v":0}]
[{"$f":"AK15","v":0},{"$f":"CK122+CK123","v":0}]
[{"$f":"AL15","v":0},{"$f":"CL122+CL123","v":0}]
[{"$f":"AM15","v":0},{"$f":"CM122+CM123","v":0}]
[{"$f":"AN15","v":0},{"$f":"CN122+CN123","v":0}]
[{"$f":"AO15","v":0},{"$f":"CO122+CO123","v":0}]
[{"$f":"AP15","v":0},{"$f":"CP122+CP123","v":0}]
[{"$f":"AQ15","v":0},{"$f":"CQ122+CQ123","v":0}]
[{"$f":"AR15","v":0},{"$f":"CR122+CR123","v":0}]
[{"$f":"AS15","v":0},{"$f":"CS122+CS123","v":0}]
[{"$f":"AT15","v":0},{"$f":"CT122+CT123","v":0}]
[{"$f":"AU15","v":0},{"$f":"CU122+CU123","v":0}]
[{"$f":"AV15","v":0},{"$f":"CV122+CV123","v":0}]
[{"$f":"AW15","v":0},{"$f":"CW122+CW123","v":0}]
[{"$f":"AX15","v":0},{"$f":"CX122+CX123","v":0}]
[{"$f":"AY15","v":0},{"$f":"CY122+CY123","v":0}]
[]
[{"$f":"34-COUNTIF(A1037:A1071,\"0\")","v":5},"Sub-regions"]

{"sheet":"data_summary","index":7,"n_rows":155,"n_cols":52,"rows_kept":155,"cut":false,"hidden":false,"merged":[]}
["iso3","year","data_source","row","var1","var2","varname","total_q1","total_q2","total_q3","total_q4","total_q5","urban_q1","urban_q2","urban_q3","urban_q4","urban_q5","rural_q1","rural_q2","rural_q3","rural_q4","rural_q5","region_1_name","region_2_name","region_3_name","region_4_name","region_5_name","region_1","region_2","region_3","region_4","region_5","n_total_q1","n_total_q2","n_total_q3","n_total_q4","n_total_q5","n_urban_q1","n_urban_q2","n_urban_q3","n_urban_q4","n_urban_q5","n_rural_q1","n_rural_q2","n_rural_q3","n_rural_q4","n_rural_q5","n_region_1","n_region_2","n_region_3","n_region_4","n_region_5"]
["MEX",2003,"MEX_2003_WHS",16,"Water","Improved","w_imp",86.439525759120116,98.739291273705007,99.657983369799126,99.781970795279847,99.943987348567191,98.489609499682558,99.629342731992466,99.710941761132446,99.867074049347266,99.991512150349877,72.976187936748261,80.918839439497731,89.740596563832028,97.008243005519276,99.350197996793355,"","","","",""]
["MEX",2003,"MEX_2003_WHS",17,"Water","Not Improved","",13.560474240879881,1.260708726294993,0.34201663020087381,0.2180292047201533,0.056012651432809001,1.510390500317442,0.37065726800753401,0.289058238867554,0.1329259506527336,0.0084878496501232994,27.023812063251739,19.081160560502269,10.25940343616797,2.9917569944807241,0.64980200320664494,"","","","",""]
["MEX",2003,"MEX_2003_WHS",18,"Water ladder","Basic","w_bas",84.983337947491151,98.6195109796558,99.543150050491747,99.781970795279847,99.943987348567191,98.364375597189849,99.560559348777758,99.644080257768621,99.867074049347266,99.991512150349877,69.306777965593795,80.300203621068334,88.460534005575369,96.511770193906045,99.30340948687801,"","","","",""]
["MEX",2003,"MEX_2003_WHS",19,"Water ladder","Limited","w_lim",1.456187811628944,0.1197802940492092,0.11483331930735249,0,0,0.12523390249269961,0.068783383214742005,0.066861503363844998,0,0,3.6694099711544839,0.61863581842941762,1.2800625582566489,0.49647281161322598,0.046788509915334502,"","","","",""]
["MEX",2003,"MEX_2003_WHS",20,"Water ladder","Unimproved","w_unimp",3.708487744307575,0.59735119331206477,0.27042485415492479,0.21385911567702459,0.0348291576608801,1.065870728923215,0.26779418979754149,0.28374027909832478,0.1329259506527336,0,8.4848501234844065,3.7672130737019529,1.882303908289146,0.77311589487271704,0.36641380646491939,"","","","",""]
["MEX",2003,"MEX_2003_WHS",21,"Water ladder","Surface water","w_sur",9.8519864965723176,0.66335753298293354,0.071591776045981603,0.004170089043122,0.021183493771925799,0.44451977139423998,0.1028630782099704,0.0053179597692195003,0,0.0084878496501238996,18.538961939767319,15.3139474868003,8.3770995278788405,2.218641099608011,0.2833881967417336,"","","","",""]
["MEX",2003,"MEX_2003_WHS",29,"Piped water","Yes","w_pip",70.37203308699668,93.077011582739416,96.35917989146391,97.926445207677233,98.945612353245721,90.580150101922953,96.230046389043338,97.593886016788232,98.723260440345626,99.638538314753816,51.562706776788673,62.16769687669035,75.617067593941442,87.404178507715557,91.330530811586698,"","","","",""]
["MEX",2003,"MEX_2003_WHS",30,"Piped water","No","",29.627966913003331,6.9229884172605889,3.6408201085360892,2.0735547923227768,1.054387646754273,9.4198498980770502,3.769953610956664,2.4061139832117631,1.2767395596543669,0.36146168524618738,48.437293223211327,37.83230312330965,24.382932406058561,12.59582149228444,8.6694691884133093,"","","","",""]
["MEX",2003,"MEX_2003_WHS",31,"Piped water on premises","Yes","w_pop",68.638089240103682,92.222225384774973,95.502102285303707,96.625415265692666,97.318045740706566,89.212521828955275,95.510113079147629,96.794033112926442,97.104868733614254,97.844725832790118,49.112687364971258,60.062488455499299,74.656644198339222,86.762533058801594,90.829870245678009,"","","","",""]
["MEX",2003,"MEX_2003_WHS",32,"Piped water on premises","No","",31.361910759896311,7.7777746152250256,4.4978977146963013,3.3745847343073452,2.6819542592934429,10.78747817104472,4.4898869208523733,3.205966887073548,2.895131266385738,2.1552741672098841,50.887312635028742,39.937511544500701,25.343355801660771,13.237466941198409,9.1701297543219926,"","","","",""]
["MEX",2003,"MEX_2003_WHS",58,"main source of drinking water","Piped water through house connection or yard","",68.638089240103682,92.222225384774973,95.502102285303707,96.625415265692666,97.318045740706566,89.212521828955275,95.510113079147629,96.794033112926442,97.104868733614254,97.844725832790118,49.112687364971258,60.062488455499299,74.656644198339222,86.762533058801594,90.829870245678009,"","","","",""]
["MEX",2003,"MEX_2003_WHS",59,"main source of drinking water","Public standpipe","",1.7339438468929851,0.85478619796443711,0.85707760616021278,1.3010299419845679,1.6275666125391699,1.3676282729676741,0.71993330989570847,0.79985290386178476,1.618391706731372,1.793812481963696,2.4500194118174048,2.105208421191048,0.96042339560221024,0.64164544891397113,0.50066056590868357,"","","","",""]
["MEX",2003,"MEX_2003_WHS",60,"main source of drinking water","Protected tube well or bore hole","",8.7178932296903842,2.9612997371013678,1.702114626851732,0.84870805439126917,0.50499906528805694,4.1487854680838856,1.7634013356280061,0.67983795932462643,0.61293320591084755,0.13383610381746319,11.550825372833129,10.929567776764049,7.4536273953639069,5.2812500552718253,4.6744119730824432,"","","","",""]
["MEX",2003,"MEX_2003_WHS",61,"main source of drinking water","Protected dug well or protected spring","",4.4197747528924278,1.461132134572025,0.68406323183380924,0.32234249773126111,0.25946536981414542,1.7523515848305999,0.85316828773034437,0.49841667692436781,0.12091962710944509,0.1380976525162336,6.804406893066389,4.8003901815948087,3.8991051437007851,2.757485914146363,1.709494548593385,"","","","",""]
["MEX",2003,"MEX_2003_WHS",62,"main source of drinking water","Unprotected dug well or spring","",3.7084877443075608,0.59735119331207043,0.27042485415490453,0.21385911567703081,0.034829157660900799,1.065870728923215,0.26779418979755421,0.28374027909834121,0.132925950652729,0,8.4848501234844367,3.7672130737019529,1.882303908289112,0.77311589487272292,0.36641380646491462,"","","","",""]
["MEX",2003,"MEX_2003_WHS",63,"main source of drinking water","Rainwater (into tank or cistern )","",0.6791667674692119,0.082415117097678306,0.030072236518946201,0.0096455602554331998,0.019294526819137299,0.18694417667184571,0.040991697214961799,0.019576315150566601,0.012557244871246299,0.024933439722961099,1.1829538627266341,0.89692123947597902,0.36997398877720938,0.1912746478084083,0,"","","","",""]
["MEX",2003,"MEX_2003_WHS",64,"main source of drinking water","Water taken directly from pond-water or stream","",9.8519864965723176,0.66335753298293354,0.071591776045981603,0.004170089043122,0.021183493771925799,0.44451977139423998,0.1028630782099704,0.0053179597692195003,0,0.0084878496501238996,18.538961939767319,15.3139474868003,8.3770995278788405,2.218641099608011,0.2833881967417336,"","","","",""]
["MEX",2003,"MEX_2003_WHS",65,"main source of drinking water","Tanker-truck, vendor","",2.2506579220714218,1.157432702194513,0.88255338313071496,0.67482947522466052,0.21461603340010721,1.8213781681732619,0.74173502237582745,0.91922479294464177,0.39740353111009857,0.056106639539405603,1.875295031333432,2.1242633649725562,2.400822442048705,1.374053880577109,1.6357606635308319,"","","","",""]
["MEX",2003,"MEX_2003_WHS",122,"Sanitation","Improved","s_imp",78.687664968942755,96.457227049284882,99.301775477890146,99.712290388904592,99.87845050967654,94.659190432019727,99.193604930384538,99.864222238435914,99.910021899766946,99.962204093806122,64.322379991590026,74.407180077212047,81.677595160277633,90.767471946542116,97.369455765606517,"","","","","",null,null,null,null,null,3596328.1209068298,4174056.5438499451,4462077.1428909302,4388568.6731834412,4393063.9540481567,3190614.9550666809,3368393.5376243591,3445419.5166244511,3378577.0531272888,3402052.3517990112,721329.13069915771,763511.91365814209,854368.98345184326,928914.72562408447,960912.26720428467]
["MEX",2003,"MEX_2003_WHS",123,"Sanitation","Not Improved","",21.312335031057241,3.542772950715118,0.69822452210985375,0.28770961109540849,0.12154949032346,5.3408095679802727,0.80639506961546203,0.13577776156408561,0.089978100233054206,0.037795906193878202,35.677620008409967,25.59281992278795,18.32240483972237,9.2325280534578837,2.6305442343934828,"","","","","",null,null,null,null,null,803806.65816497803,130915.4943161011,33373.967231750488,14726.334022521971,4915.8716659545898,176605.96884155271,31062.85897064209,7433.2803192138672,3713.2302856445308,1286.322692871094,277813.52476501459,235950.68737030029,148906.90765380859,77060.25951385498,27905.28498840332]
["MEX",2003,"MEX_2003_WHS",124,"Sanitation ladder","Basic","s_bas",69.188659727898113,90.036965133394872,96.55446444876867,98.127293420451991,99.557796683979049,82.51064332579034,95.303176847751217,97.261291720089432,98.498711803704325,99.767801696030986,58.071086078979469,67.687461432695358,75.703499098003959,87.530284477726411,96.304520413476894,"","","","","",null,null,null,null,null,112367.46813964839,31205.449668884281,12050.307975769039,4574.2519149780273,2600.811637878418,41946.376670837402,12505.27541351318,3940.797470092773,2183.1036834716801,1286.322692871094,39083.527435302727,24761.080284118649,19817.841659545898,12374.25988006592,4899.7041473388672]
["MEX",2003,"MEX_2003_WHS",125,"Sanitation ladder","Limited","s_lim",9.4990052410446495,6.4202619158900633,2.7473110291214971,1.5849969684525529,0.32065382569750078,12.14854710622947,3.8904280826333779,2.6029305183464819,1.4113100960626499,0.1944023977751459,6.2512939126105778,6.7197186445166963,5.9740960622736976,3.2371874688157152,1.0649353521296221,"","","","","",null,null,null,null,null,691439.19002532959,99710.044647216797,21323.659255981449,10152.082107543951,2315.0600280761719,134659.5921707153,18557.58355712891,3492.4828491210942,1530.126602172852,0,238729.99732971191,211189.60708618161,129089.0659942627,64685.999633789063,23005.580841064449]
["MEX",2003,"MEX_2003_WHS",126,"Sanitation ladder","Unimproved","s_unimp",5.5982893315028832,1.2266128511085981,0.22388593553360181,0.0571531280315156,0.0689103214363911,1.341678081994417,0.26049650843025057,0.034630013469737299,0.044738736548694598,0.037795906193863998,11.78413532690519,4.4625038040188798,5.4556483334934143,2.8023483184300351,0.30396934805069981,"","","","","",null,null,null,null,null,1053155.869110107,3024090.3763122559,3846491.609085083,3986892.2779006958,4126116.355361938,2189689.0083084111,2911642.8559951782,3145701.951141357,3169813.9714126592,3287370.7541656489,40416.609359741211,83373.654373168945,240648.7602767944,413174.69986724848,554914.22286987305]
["MEX",2003,"MEX_2003_WHS",127,"Sanitation ladder","Open defecation","s_od",15.71404569955437,2.316160099606456,0.47433858657623179,0.23055648306393581,0.052639168887053001,3.9991314859857758,0.54589856118515734,0.1011477480943441,0.045239363684327599,0,23.893484681504759,21.13031611876908,12.86675650622893,6.4301797350278358,2.326574886342776,"","","","","",null,null,null,null,null,1256989.451896667,781412.68655014038,481407.64762878418,332903.38096237183,227576.45625305179,667321.5763053894,359563.2074508667,251754.22999572751,173233.73444747919,104026.5867385864,255963.7540435791,317412.52191162109,327361.05155181879,312082.47891998291,311570.48192596441]
["MEX",2003,"MEX_2003_WHS",135,"Sanitation type","Sewer connection","s_sew",23.934627505484428,70.246458037403272,85.56408500191904,90.543383338526567,93.818446624910806,65.029561700599785,85.650248637151762,91.104432657129621,93.717975271304226,96.592524828768418,4.0451290052234672,8.3418483380346444,23.986299522416459,41.072065008713309,56.118969737072227,"","","","",""]
["MEX",2003,"MEX_2003_WHS",136,"Sanitation type","Septic tank connection","s_sep",28.567067033383569,18.151399814504462,10.70877284250226,7.5603242666588928,5.1745679896587422,19.81817027707374,10.57707955339613,7.2911949857396454,5.121787899076363,3.0566040199956759,25.618339147442949,31.75831907917366,32.629215398672983,31.022886605593889,31.509400418212799,"","","","",""]
["MEX",2003,"MEX_2003_WHS",137,"Sanitation type","Improved latrines","s_lat",29.230531892283771,8.56111207506369,2.9847479794614271,1.561853434935133,0.89520970976199754,9.907409641113663,2.8589122153665549,1.389092970595823,1.0504523352531301,0.31307524504202278,42.531340742170457,36.292077062224131,28.542415317849439,20.244792350271759,9.5495435127598185,"","","","",""]
["MEX",2003,"MEX_2003_WHS",138,"Sanitation type","Unimproved facilities","",2.5537278692938572,0.72486997342212833,0.26805558954105041,0.10388247681548241,0.059136506781408797,1.2457268952270431,0.36786103290040278,0.1141316384405677,0.064545130681947199,0.037795906193882997,3.9117064236583592,2.4774394017984882,1.975313254832209,1.2300763003932109,0.49551144561237281,"","","","",""]
["MEX",2003,"MEX_2003_WHS",139,"Sanitation type","Open defecation","",15.71404569955437,2.316160099606456,0.47433858657623179,0.23055648306393581,0.052639168887053001,3.9991314859857758,0.54589856118515734,0.1011477480943441,0.045239363684327599,0,23.893484681504759,21.13031611876908,12.86675650622893,6.4301797350278358,2.326574886342776,"","","","",""]
["MEX",2003,"MEX_2003_WHS",153,"What type of toilet facilities","Flush to piped sewage system","",23.934627505484428,70.246458037403272,85.56408500191904,90.543383338526567,93.818446624910806,65.029561700599785,85.650248637151762,91.104432657129621,93.717975271304226,96.592524828768418,4.0451290052234672,8.3418483380346444,23.986299522416459,41.072065008713309,56.118969737072227,"","","","","",null,null,null,null,null,1053155.869110107,3024090.3763122559,3846491.609085083,3986892.2779006958,4126116.355361938,2189689.0083084111,2911642.8559951782,3145701.951141357,3169813.9714126592,3287370.7541656489,40416.609359741211,83373.654373168945,240648.7602767944,413174.69986724848,554914.22286987305]
["MEX",2003,"MEX_2003_WHS",154,"What type of toilet facilities","Flush to septic tank","",28.567067033383569,18.151399814504462,10.70877284250226,7.5603242666588928,5.1745679896587422,19.81817027707374,10.57707955339613,7.2911949857396454,5.121787899076363,3.0566040199956759,25.618339147442949,31.75831907917366,32.629215398672983,31.022886605593889,31.509400418212799,"","","","","",null,null,null,null,null,1256989.451896667,781412.68655014038,481407.64762878418,332903.38096237183,227576.45625305179,667321.5763053894,359563.2074508667,251754.22999572751,173233.73444747919,104026.5867385864,255963.7540435791,317412.52191162109,327361.05155181879,312082.47891998291,311570.48192596441]
["MEX",2003,"MEX_2003_WHS",155,"What type of toilet facilities","Pour flush latrine","",6.6345015738589366,2.5155852093912632,0.95511114352265292,0.43583139116266351,0.35876656858973671,2.5392938687502888,1.1105803648277439,0.41202164210561748,0.29890974840826862,0.1478007691031509,7.4158492647499514,9.5251142806980056,8.0045007361809155,4.6959865013133868,2.8985830836069182,"","","","","",null,null,null,null,null,291927.01116943359,108295.2398605347,42936.554504394531,19190.941886901859,15778.4813079834,85503.634468078613,37753.695251464836,14226.500793457029,10109.99537658691,5030.1607360839844,74094.913269042969,95199.954940795898,80307.226089477539,47240.449508666992,28661.698295593262]
["MEX",2003,"MEX_2003_WHS",156,"What type of toilet facilities","Covered dry latrine (with privacy)","",22.59603031842483,6.0455268656724268,2.0296368359387742,1.1260220437724691,0.53644314117226088,7.3681157723633737,1.748331850538811,0.97707132849020584,0.75154258684486175,0.1652744759388719,35.115491477420512,26.766962781526129,20.53791458166852,15.54880584895837,6.6509604291528994,"","","","","",null,null,null,null,null,994255.78873062134,260258.24112701419,91241.331672668457,49582.07243347168,23592.661125183109,248100.73598480219,59433.778926849373,33736.834693908691,25419.351890563961,5624.8501586914063,350853.85402679438,267525.78243255621,206051.94553375241,156417.09732818601,65765.864112854004]
["MEX",2003,"MEX_2003_WHS",157,"What type of toilet facilities","Uncovered dry latrine (without privacy)","",1.686474166259621,0.45174336032759183,0.13290159165155421,0.050857202407610498,0.0156194687797116,0.55425913193524767,0.20436498248667301,0.079501624970827994,0.019806394133229599,0,3.3209487429738851,1.5543700260208839,1.158774911580537,0.99017905845875331,0.32634779013435949,"","","","","",null,null,null,null,null,74207.136329650879,19447.425346374512,5974.5260772705078,2239.3926544189449,686.94108581542969,18663.129463195801,6947.298469543457,2745.074081420898,669.90974426269531,0,33181.01545715332,15535.347091674799,11625.709320068359,9960.9536361694336,3226.9842300415039]
["MEX",2003,"MEX_2003_WHS",158,"What type of toilet facilities","Bucket latrine (where fresh excreta are manually removed)","",0.30233130712844147,0.17367693437549109,0.0155284716681236,0.0117748921517119,0,0.34881211181207877,0.0063017394265675996,0.0122528606653023,0,0,0.21505771382194611,0.32004692116997829,0.29612654947803468,0.071175241684061002,0.058581076226322797,"","","","","",null,null,null,null,null,13302.984992980961,7476.7434616088867,698.07485198974609,518.48323822021484,0,11745.2744140625,214.2248840332031,423.0732421875,0,0,2148.7333526611328,3198.7492828369141,2970.9662780761719,716.005126953125,579.25996398925781]
["MEX",2003,"MEX_2003_WHS",159,"What type of toilet facilities","No facilities (open defecation)","",15.71404569955437,2.316160099606456,0.47433858657623179,0.23055648306393581,0.052639168887053001,3.9991314859857758,0.54589856118515734,0.1011477480943441,0.045239363684327599,0,23.893484681504759,21.13031611876908,12.86675650622893,6.4301797350278358,2.326574886342776,"","","","","",null,null,null,null,null,691439.19002532959,99710.044647216797,21323.659255981449,10152.082107543951,2315.0600280761719,134659.5921707153,18557.58355712891,3492.4828491210942,1530.126602172852,0,238729.99732971191,211189.60708618161,129089.0659942627,64685.999633789063,23005.580841064449]
["MEX",2003,"MEX_2003_WHS",160,"What type of toilet facilities","Other","",0.56492239590579474,0.099449678719045503,0.1196255262213725,0.041250382256159998,0.043517038001697199,0.34265565147971688,0.15719431098716219,0.022377152804437399,0.0447387365487176,0.037795906193882997,0.37569996686252832,0.6030224546076256,0.52041179377363733,0.16872200025039641,0.1105825792516905,"","","","","",null,null,null,null,null,24857.346817016602,4281.2808609008789,5377.7070465087891,1816.376022338867,1913.8705520629881,11537.9727935791,5343.7520599365234,772.650146484375,1513.1939392089839,1286.322692871094,3753.7786254882808,6026.9839096069336,5221.1660614013672,1697.3011169433589,1093.459953308105]
["MEX",2012,"MEX_2012_ENG",16,"Water","Improved","w_imp",95.259606909602482,98.889920304833836,99.875453673897638,99.974176795730486,99.763929996540782,98.412595403414571,99.426325737514631,100.0000000000005,99.999999999999986,99.678603486653486,89.600917970742486,94.462651086171661,98.078127437425906,99.307578103459178,99.51525367342623,"","","","",""]
["MEX",2012,"MEX_2012_ENG",17,"Water","Not Improved","",4.740393090397518,1.110079695166164,0.1245463261023616,0.025823204269514101,0.2360700034592185,1.5874045965854291,0.57367426248536901,-4.5474735088599999e-13,0,0.32139651334651381,10.39908202925751,5.5373489138283389,1.921872562574094,0.69242189654082154,0.48474632657377009,"","","","",""]
["MEX",2012,"MEX_2012_ENG",18,"Water ladder","Basic","w_bas",93.654833198685935,98.769957283225935,99.760369769177771,99.974176795730486,99.763929996540767,98.28745942775771,99.357682515775906,99.932944667673922,99.999999999999986,99.678603486653486,85.095578474091781,93.740470937883728,96.679138088973389,98.799337659266001,99.4683874313139,"","","","",""]
["MEX",2012,"MEX_2012_ENG",19,"Water ladder","Limited","w_lim",1.604773710916521,0.1199630216078965,0.1150839047198402,0,0,0.1251359756568477,0.068643221738741503,0.0670553323265351,0,0,4.5053394966507163,0.72218014828796284,1.39898934845249,0.50824044419317327,0.046866242112334901,"","","","",""]
["MEX",2012,"MEX_2012_ENG",20,"Water ladder","Unimproved","w_unimp",4.4068366715361256,1.048405385456221,0.050070831996023898,-0.1624920911504972,0.23607000345923271,1.4576133184045119,0.52248221947280626,-0.023890588663647301,0,0.32139651334651381,9.3590036145113658,5.2807489663772031,1.9218725625741231,0.5397976474589683,-0.25043804182529072,"","","","",""]
["MEX",2012,"MEX_2012_ENG",21,"Water ladder","Surface water","w_sur",0.33355641886141979,0.061674309709942997,0.074475494106362505,0.18831529542001291,0,0.12979127818093361,0.051192043012554402,0.023890588663193098,0,0,1.0400784147461299,0.25659994745111198,0,0.1526242490818471,0.73518436839905965,"","","","",""]
["MEX",2012,"MEX_2012_ENG",29,"Piped water","Yes","w_pip",78.038679627033375,91.196809491239776,95.905858401431374,97.324773356909105,98.337050716647795,89.323922145256802,95.541945560129435,98.768278368855206,97.718958548295134,99.07462194248815,65.733590787020304,74.251865945085015,82.640071272650601,85.777849227147016,87.265172131464183,"","","","",""]
["MEX",2012,"MEX_2012_ENG",30,"Piped water","No","",21.96132037296648,8.8031905087602453,4.0941415985687239,2.6752266430909368,1.6629492833521891,10.67607785474298,4.4580544398705504,1.231721631144862,2.281041451704874,0.92537805751188551,34.266409212979489,25.748134054915081,17.35992872734937,14.22215077285288,12.734827868535801,"","","","",""]
["MEX",2012,"MEX_2012_ENG",31,"Piped water on premises","Yes","w_pop",73.544398119445859,89.542096437550896,95.336510633221565,97.261966074080988,97.910304918362783,85.174119863069492,94.926133008774357,98.358834900979218,97.690037767793442,98.727622477696698,61.154057986122858,70.579505345954658,79.739334791049089,85.154332483446666,86.342636882443102,"","","","",""]
["MEX",2012,"MEX_2012_ENG",32,"Piped water on premises","No","",26.45560188055412,10.457903562449131,4.6634893667785438,2.7380339259190829,2.089695081637204,14.825880136930129,5.0738669912255476,1.641165099020794,2.3099622322065319,1.272377522303314,38.845942013876943,29.42049465404547,20.260665208950972,14.845667516553201,13.65736311755691,"","","","",""]
["MEX",2012,"MEX_2012_ENG",58,"Disponibilidad de agua","Agua entubada dentro de la vivienda","",17.910066522075191,47.888067818690388,80.518702047231343,93.929019107036353,97.123813451183565,35.855519873692053,69.834534004395337,90.703316681665385,96.061823498184367,98.391887646960868,6.6897612341539983,11.007237018580661,22.93425510467528,45.059005407552327,74.27070560525587,"","","","",""]
["MEX",2012,"MEX_2012_ENG",59,"Disponibilidad de agua","Agua entubada fuera de la vivienda, pero dentro del terreno","",55.634331597370434,41.654028618860643,14.817808585990541,3.3329469670445611,0.78649146717926222,49.318599989378079,25.09159900437939,7.6555182193142706,1.628214269609102,0.33573483073585958,54.464296751968888,59.572268327374047,56.805079686373908,40.095327075894261,12.07193127718744,"","","","",""]
["MEX",2012,"MEX_2012_ENG",60,"Disponibilidad de agua","Agua entubada de llave pública (o hidrante)","",0.84830683819865305,0.29905358727375092,0.19884508511717419,0.021829126293807899,0.017779471440858199,0.51763388183423709,0.048479286166133999,0.23013648245315049,0,0.023027703246341302,1.3783305303109259,0.89497151190176727,0.73465853616317411,0.13896328113550829,0.1174058465560492,"","","","",""]
["MEX",2012,"MEX_2012_ENG",61,"Disponibilidad de agua","Agua entubada que acarrean de otra vivienda","",3.6459746693889712,1.355659466415122,0.37050268309264539,0.040978156534338901,0.40896632684415613,3.6321684003529251,0.56733326518886673,0.17930698542278151,0.0289207805016568,0.32397176154508778,3.2012022705865268,2.7773890872286162,2.1660779454384169,0.48455346256481602,0.80512940246506237,"","","","",""]
["MEX",2012,"MEX_2012_ENG",62,"Disponibilidad de agua","Agua de pipa","",2.7729621462597018,2.512922552524933,0.65433269972773167,0.92663894275161507,0.69782073623431817,3.510209279737694,1.810130503325825,0.62385243779502209,0.9577287800051747,0.60398154416534222,0.56832932176698259,1.354873856858025,2.7088174124477491,2.0038102775611102,1.128416041509652,"","","","",""]
["MEX",2012,"MEX_2012_ENG",63,"Disponibilidad de agua","Agua de un pozo, río, lago, arroyo u otra","",19.188358226706811,6.2902679562353141,3.4398088988409921,1.7485877003393211,0.96512854711787044,7.1658685750052884,2.6479239365447209,0.60786919334983869,1.3233126716996999,0.32139651334654312,33.698079891212522,24.39326019805706,14.65111131490162,12.21834049529178,11.60641182702615,"","","","",""]
["MEX",2012,"MEX_2012_ENG",122,"Sanitation","Improved","s_imp",83.695670795688059,96.196551972425993,98.999899192148732,99.214005204048476,99.60100102309147,92.528673772885341,98.728862091046324,98.997675452522046,99.636185287660808,99.561875516157244,71.25723043216081,83.060713906741285,89.435953637555684,96.70298506592745,98.306422346910068,"","","","",""]
["MEX",2012,"MEX_2012_ENG",123,"Sanitation","Not Improved","",16.304329204311941,3.803448027574007,1.0001008078512681,0.78599479595152388,0.39899897690852981,7.471326227114659,1.2711379089536761,1.0023245474779541,0.36381471233919171,0.43812448384275632,28.74276956783919,16.939286093258719,10.564046362444319,3.2970149340725499,1.693577653089932,"","","","",""]
["MEX",2012,"MEX_2012_ENG",124,"Sanitation ladder","Basic","s_bas",73.592109889988592,89.793640775808939,96.260939957798868,97.636928828978512,99.281237932471043,80.653556873231494,94.856661479777046,96.417331212064397,98.228743355852259,99.368251660993266,64.331959773825474,75.559493899655806,82.894392547230424,93.254109772398721,97.23123933725428,"","","","",""]
["MEX",2012,"MEX_2012_ENG",125,"Sanitation ladder","Limited","s_lim",10.10356090569948,6.4029111966171186,2.7389592343498892,1.577076375069917,0.31976309062044139,11.87511689965393,3.8722006112693408,2.5803442404576411,1.40744193180857,0.19362385516398231,6.9252706583353634,7.5012200070855002,6.5415610903253034,3.4488752935287561,1.075183009655778,"","","","",""]
["MEX",2012,"MEX_2012_ENG",126,"Sanitation ladder","Unimproved","s_unimp",4.0611905749592694,0.85542658041126174,0.66237009181452322,0.68776159379498836,0.37135484923531692,0.60403782660593208,0.32450786688136191,0.84768457269980502,0.29448185703772373,0.40232022663073508,10.840986365861969,3.5573003792494831,3.30377117900521,1.2153527346320629,1.520325000921261,"","","","",""]
["MEX",2012,"MEX_2012_ENG",127,"Sanitation ladder","Open defecation","s_od",12.24313862935265,2.9480214471626831,0.33773071603671828,0.098233202156572899,0.027644127673195799,6.8672884005086434,0.94663004207226253,0.15463997477816299,0.069332855301443896,0.035804257212024203,17.901783201977189,13.3819857140092,7.2602751834390684,2.0816621994404518,0.17325265216868099,"","","","",""]
["MEX",2012,"MEX_2012_ENG",135,"Sanitation type","Sewer connection","s_sew",32.559469655284182,70.076133334569263,85.002095141335815,91.130303197388713,95.305231791200171,70.462023748382691,87.562317309878551,91.695667684609617,94.107510964447243,96.245443195230592,4.7915722972206192,9.8177333226405157,27.171077564252059,47.061025349309183,66.258047735431674,"","","","",""]
["MEX",2012,"MEX_2012_ENG",136,"Sanitation type","Septic tank connection","s_sep",32.666439332783241,21.605253451728291,12.96612835613041,7.9920891075604672,4.1992691345895929,15.024724111284799,9.5261630568163014,7.0761464558865246,5.4175006552102962,3.2737995023623712,39.266017128112132,46.427091946362687,47.85719836461837,44.856826661163907,30.81604919990815,"","","","",""]
["MEX",2012,"MEX_2012_ENG",139,"Sanitation type","Open defecation","",12.24313862935265,2.9480214471626831,0.33773071603671828,0.098233202156572899,0.027644127673195799,6.8672884005086434,0.94663004207226253,0.15463997477816299,0.069332855301443896,0.035804257212024203,17.901783201977189,13.3819857140092,7.2602751834390684,2.0816621994404518,0.17325265216868099,"","","","",""]
["MEX",2012,"MEX_2012_ENG",151,"Shared among all sanitation facilities","Yes","",16.307327706840081,11.85132835426282,5.6056122531662087,2.5441349895753769,1.63926888629913,17.411309449238651,8.5218467618797096,4.423397158015006,2.030673387361841,1.33096052326069,14.77284934938961,12.96392547990458,13.44681682499197,7.6614540391925274,2.6944285341539191,"","","","",""]
["MEX",2012,"MEX_2012_ENG",152,"Shared among all sanitation facilities","No","",83.692672293160058,88.148671645737252,94.3943877468339,97.455865010424617,98.36073111370095,82.588690550761726,91.4781532381201,95.57660284198522,97.96932661263827,98.669039476739385,85.227150650610383,87.036074520095625,86.553183175008058,92.338545960807465,97.305571465846072,"","","","",""]
["MEX",2012,"MEX_2012_ENG",153,"sanit","Sewage","",32.559469655284182,70.076133334569263,85.002095141335815,91.130303197388713,95.305231791200171,70.462023748382691,87.562317309878551,91.695667684609617,94.107510964447243,96.245443195230592,4.7915722972206192,9.8177333226405157,27.171077564252059,47.061025349309183,66.258047735431674,"","","","",""]
["MEX",2012,"MEX_2012_ENG",154,"sanit","Septic tank","",32.666439332783241,21.605253451728291,12.96612835613041,7.9920891075604672,4.1992691345895929,15.024724111284799,9.5261630568163014,7.0761464558865246,5.4175006552102962,3.2737995023623712,39.266017128112132,46.427091946362687,47.85719836461837,44.856826661163907,30.81604919990815,"","","","",""]
["MEX",2012,"MEX_2012_ENG",155,"sanit","Pour Flush","",1.894857253004665,0.99002515276632597,0.36090182129673037,0.0088383422393893008,0.0111859300840031,1.696538680033048,0.30345965461204422,0.14158652853214901,0,0.014487847929877101,1.007169156482453,2.2672304369588518,2.604589631656081,0.73073386418327924,0.33426744094260458,"","","","",""]
["MEX",2012,"MEX_2012_ENG",156,"sanit","Dry latrine","",20.58567553878299,4.1314357541491358,0.69947426842993077,0.083065906976085499,0.089427577131820202,5.8233227770753659,1.406805297859971,0.084274783493750796,0.1111736680032813,0.028144970634417201,36.954192494296237,28.054780478946679,15.01314632733345,4.7977308139678643,0.91575081417839876,"","","","",""]
["MEX",2012,"MEX_2012_ENG",157,"sanit","No facility","",12.24313862935265,2.9480214471626831,0.33773071603671828,0.098233202156572899,0.027644127673195799,6.8672884005086434,0.94663004207226253,0.15463997477816299,0.069332855301443896,0.035804257212024203,17.901783201977189,13.3819857140092,7.2602751834390684,2.0816621994404518,0.17325265216868099,"","","","",""]
["MEX",2012,"MEX_2012_ENG",158,"sanit","missing","",0.0504195907921745,0.24913085962408341,0.63366969677043561,0.68747024367877396,0.36724143932133402,0.12610228271547869,0.25462463876067382,0.84768457270005515,0.2944818570378081,0.40232022663070349,0.079265721911270598,0.051178101082280499,0.093712928701200501,0.47202111193511609,1.5026321573707919,"","","","",""]
["MEX",2012,"MEX_2012_ENG",164,"sanit","Sewage","",76213.800000000236,164021.40999999919,198940.16999999879,213536.4899999992,222885.78999999911,126700.8299999997,157535.01999999941,164938.37999999971,168621.00999999931,173785.69999999949,2596.9099999999999,5325.3299999999981,14755.02,25497.559999999979,35841.900000000052,"","","","",""]
["MEX",2012,"MEX_2012_ENG",165,"sanit","Septic tank","",76464.189999999988,50569.629999999852,30346.119999999941,18727.059999999979,9820.6299999999992,27016.610000000001,17138.69999999995,12728.280000000001,9707.029999999997,5911.3400000000011,21281.18000000004,25182.960000000028,25988.440000000021,24303.329999999991,16669.759999999998,"","","","",""]
["MEX",2012,"MEX_2012_ENG",166,"sanit","Pour Flush","",4435.3999999999996,2317.2700000000009,844.66000000000008,20.710000000000001,26.16,3050.619999999999,545.95999999999992,254.68000000000001,0,26.16,545.86000000000001,1229.79,1414.4000000000001,395.91000000000003,180.81999999999999,"","","","",""]
["MEX",2012,"MEX_2012_ENG",167,"sanit","Dry latrine","",48186.060000000027,9670.1099999999969,1637.0599999999999,194.63999999999999,209.13999999999999,10471.17,2531.0100000000002,151.59,199.19999999999999,50.82,20028.229999999989,15217.45999999999,8152.7599999999993,2599.400000000001,495.37000000000012,"","","","",""]
["MEX",2012,"MEX_2012_ENG",168,"sanit","No facility","",28658.209999999959,6900.1899999999978,790.42999999999984,230.18000000000001,64.649999999999991,12348.36999999999,1703.0999999999999,278.16000000000003,124.23,64.649999999999991,9702.3100000000031,7258.6500000000005,3942.6300000000019,1127.8399999999999,93.719999999999999,"","","","",""]
["MEX",2012,"MEX_2012_ENG",169,"sanit","missing","",118.02,583.12,1483.05,1610.8800000000001,858.85000000000014,226.75,458.09999999999991,1524.78,527.65000000000009,726.44999999999982,42.960000000000001,27.760000000000002,50.890000000000001,255.74000000000001,812.83999999999992,"","","","",""]
["MEX",2012,"MEX_2012_ENG",170,"sanit","Total","",234075.68000000049,234061.7299999996,234041.48999999859,234319.95999999909,233865.2199999989,179814.34999999969,179911.88999999969,179875.86999999921,179179.11999999921,180565.1199999995,54197.450000000077,54241.94999999991,54304.139999999898,54179.780000000072,54094.409999999887,"","","","",""]
["MEX",2015,"MEX_2015_MICS",16,"Water","Improved","w_imp",95.672572190386617,99.455421840110191,99.888342324272912,99.764507242753098,99.804503367599068,99.009825928405419,99.749560707066848,99.976120332634153,99.947530882936135,99.745335737715422,89.572678164151327,95.212336575295012,98.231983253911949,99.702577966866812,99.130630258660858,"Centro","DF-Edo México","Noreste","Noroeste","Sur",99.112383855788252,99.231691729534148,99.404496640514949,99.971579303627351,96.933880612539696]
["MEX",2015,"MEX_2015_MICS",17,"Water","Not Improved","",4.3274278096133587,0.5445781598897993,0.11165767572709059,0.2354927572469076,0.1954966324009117,0.99017407159464643,0.25043929293315392,0.023879667365853799,0.052469117063850997,0.25466426228458128,10.4273218358487,4.7876634247049763,1.768016746088046,0.29742203313318538,0.86936974133915101,"Centro","DF-Edo México","Noreste","Noroeste","Sur",0.88761614421173152,0.76830827046587513,0.59550335948516564,0.028420696372652599,3.0661193874604651]
["MEX",2015,"MEX_2015_MICS",18,"Water ladder","Basic","w_bas",93.992200166333902,99.331716051893082,99.772852243375738,99.764259102938425,99.804179902250809,98.877959324926849,99.678535517811596,99.909070098923891,99.94740405380152,99.745335737715422,84.694822869053908,94.411702872267625,96.82818935874154,99.191326520605855,99.079194067004693,"Centro","DF-Edo México","Noreste","Noroeste","Sur",98.731644915586998,98.860455612680539,99.368840346982211,99.96422812935117,95.875128897467135]
["MEX",2015,"MEX_2015_MICS",19,"Water ladder","Limited","w_lim",1.610554487221622,0.1206453169247893,0.1150983045448868,0,0,0.12588777839127319,0.068864889386442293,0.067039312412911903,0,0,4.4841217073336006,0.72735134460326833,1.401146185417534,0.51025690096025433,0.0466828669625887,"Centro","DF-Edo México","Noreste","Noroeste","Sur",0.37316627668166669,0.36626882448222808,0.035323104282333401,0.0070960094870002001,1.0451948225038901]
["MEX",2015,"MEX_2015_MICS",20,"Water ladder","Unimproved","w_unimp",4.0636889275829997,0.48596432147215712,0.037573957973021203,0.047425601641571197,0.19582009774919309,0.86636161850096216,0.20140754978942521,0,0.052595946198472,0.25466426228458128,9.7809770088664241,4.6043458356780098,1.770664455840917,0.14579232935203371,0.1389386976336551,"Centro","DF-Edo México","Noreste","Noroeste","Sur",0.7242516437198574,0.71147550247905733,0.40713615207852649,0.010137156410000301,2.8584452794336941]
["MEX",2015,"MEX_2015_MICS",21,"Water ladder","Surface water","w_sur",0.33355641886141979,0.061674309709942997,0.074475494106362505,0.18831529542001291,0,0.12979127818093361,0.051192043012554402,0.023890588663193098,0,0,1.0400784147461299,0.25659994745111198,0,0.1526242490818471,0.73518436839905965,"Centro","DF-Edo México","Noreste","Noroeste","Sur",0.17093716401146761,0.061800060358155197,0.1887003966570216,0.018538704751814301,0.22123100059545539]
["MEX",2015,"MEX_2015_MICS",22,"Improved water point at more than 30 minutes","Yes","",1.6846318843614241,0.1213096554614501,0.1152274162334216,0,0,0.12715443093832471,0.0690392823324876,0.067055332326534794,0,0,5.028229172966566,0.76451395338160522,1.4264029962695279,0.51178414970878217,0.047094531121965801,"Centro","DF-Edo México","Noreste","Noroeste","Sur",0.37653699370629329,0.36912316370392201,0.035534833809704,0.0070980449125045003,1.078406243796441]
["MEX",2015,"MEX_2015_MICS",23,"Improved water point at more than 30 minutes","No","",98.315368115638549,99.878690344538555,99.884772583766562,100,100,99.872845569061667,99.930960717667531,99.932944667673482,100,100,94.971770827033453,99.235486046618419,98.573597003730455,99.488215850291212,99.952905468878029,"Centro","DF-Edo México","Noreste","Noroeste","Sur",99.62346300629369,99.630876836296039,99.964465166190294,99.992901955087504,98.921593756203563]
["MEX",2015,"MEX_2015_MICS",24,"Manually calculated ratios","Improved wells","",75.295473253154682,82.352425955623858,96.379266123047444,98.523196505128169,75.540045503345823,77.847701503728231,78.334941779550519,100,100,0,69.140431553285268,77.299676759609341,86.882411024892619,94.332930099570845,95.82346091282713,"Centro","DF-Edo México","Noreste","Noroeste","Sur",80.575535155159088,73.733396850076744,85.561739073527676,95.591824561953089,75.83671104167891]
["MEX",2015,"MEX_2015_MICS",29,"Piped water","Yes","w_pip",77.3868971097382,93.520279068103051,97.038096772104211,98.629828933963836,98.937918503681431,93.32816569628605,96.552708657126146,98.475889149406441,99.390390085047471,98.864590446938564,58.709300819024357,71.837150401400436,80.687914148940294,91.332280150898654,93.122220016389676,"Centro","DF-Edo México","Noreste","Noroeste","Sur",92.699315557285303,97.422531754227961,95.974855550477642,98.364287298127991,80.886640365063428]
["MEX",2015,"MEX_2015_MICS",30,"Piped water","No","",22.613102890261779,6.4797209318969156,2.9619032278957769,1.3701710660361739,1.062081496318557,6.67183430371401,3.4472913428738572,1.5241108505935801,0.60960991495252881,1.1354095530614601,41.290699180975771,28.162849598599632,19.312085851059781,8.6677198491013918,6.8777799836103712,"Centro","DF-Edo México","Noreste","Noroeste","Sur",7.3006844427145694,2.577468245772065,4.0251444495223687,1.635712701872031,19.113359634936661]
["MEX",2015,"MEX_2015_MICS",31,"Piped water on premises","Yes","w_pop",74.250693629665491,91.627824881125065,95.592134926278206,96.142548270176363,96.158093981415135,91.404590154442772,94.373393877743666,97.654518603870841,96.350121746506289,95.729015268484545,53.439542038335198,68.807151283136093,78.546928868214891,89.891193985205859,91.112831279477192,"Centro","DF-Edo México","Noreste","Noroeste","Sur",91.292165821757521,95.734245771314221,91.710153564403186,95.059806621966374,80.058416651074253]
["MEX",2015,"MEX_2015_MICS",32,"Piped water on premises","No","",25.74930637033447,8.3721751188749334,4.4078650737217586,3.857451729823671,3.841906018584877,8.5954098455573273,5.6266061222562787,2.345481396129216,3.6498782534937568,4.2709847315154894,46.560457961664987,31.19284871686401,21.453071131785151,10.10880601479421,8.8871687205229097,"Centro","DF-Edo México","Noreste","Noroeste","Sur",8.707834178242372,4.2657542286857852,8.2898464355969139,4.9401933780336913,19.941583348925811]
["MEX",2015,"MEX_2015_MICS",35,"Water source on premises","Yes","",86.98618854027896,97.251856800031845,98.981071650739807,99.376107991370617,99.794156472519973,96.89829939230799,98.190433335484656,99.793320606515607,99.641597773838868,100,73.490513184461477,84.709461084417384,91.036089426029804,96.25851524144376,96.711897095986572,"Centro","DF-Edo México","Noreste","Noroeste","Sur",94.902387858235642,97.511501743227697,97.938473760085344,98.922483683708762,92.706302830911767]
["MEX",2015,"MEX_2015_MICS",36,"Water source on premises","No","",13.013811459720939,2.7481431999681418,1.018928349260187,0.6238920086294002,0.20584352748001289,3.1017006076921252,1.809566664515321,0.2066793934844055,0.35840222616110567,0,26.509486815538612,15.290538915582699,8.9639105739702281,3.7414847585562669,3.2881029040134599,"Centro","DF-Edo México","Noreste","Noroeste","Sur",5.0976121417643476,2.4884982567723122,2.061526239914834,1.0775163162912951,7.2936971690883494]
["MEX",2015,"MEX_2015_MICS",37,"Improved Water source on premises","Yes","w_premises",89.130495485223122,97.452508854107677,99.091715156721904,99.592241731467155,99.79375326710273,97.399298229815798,98.303439765771657,99.793271240375446,99.693906286233741,100,78.491430226181436,86.225750502468387,91.717363244916044,96.453805788675709,97.560054691104952,"Centro","DF-Edo México","Noreste","Noroeste","Sur",95.411031233642788,97.926939364117516,98.300606244211707,98.93222716876042,94.294060173302114]
["MEX",2015,"MEX_2015_MICS",38,"Improved Water source on premises","No","",10.869504514776819,2.5474911458923248,0.90828484327808212,0.40775826853286812,0.206246732897264,2.600701770184239,1.696560234228337,0.20672875962455339,0.30609371376625583,0,21.508569773818671,13.774249497531709,8.282636755083999,3.5461942113243281,2.4399453088950658,"Centro","DF-Edo México","Noreste","Noroeste","Sur",4.5889687663572252,2.073060635882416,1.699393755788335,1.067772831239614,5.7059398266978443]
["MEX",2015,"MEX_2015_MICS",41,"Water point at more than 30 minutes","Yes","",2.2977951607184379,0.1206453169247893,0.12261309613949101,0,0,0.12588777839127319,0.068864889386442293,0.067039312412911903,0,0,6.7133287107760342,1.5105397969839409,1.401146185417534,0.51025690096025433,0.079124496569126193,"Centro","DF-Edo México","Noreste","Noroeste","Sur",0.44970692552074892,0.39852854572083779,0.043072428001551998,0.0070960094870002001,1.602737212232578]
["MEX",2015,"MEX_2015_MICS",42,"Water point at more than 30 minutes","No","w_30min",97.702204839281549,99.879354683075221,99.877386903860526,100,100,99.87411222160874,99.931135110613567,99.93296068758707,100,100,93.286671289224017,98.489460203016051,98.598853814582455,99.489743099039757,99.920875503430864,"Centro","DF-Edo México","Noreste","Noroeste","Sur",99.550293074479228,99.601471454279192,99.956927571998477,99.992903990513,98.397262787767488]
["MEX",2015,"MEX_2015_MICS",43,"Water source available when needed","Yes","w_available",67.957401283054253,71.306902396252411,89.027562065998026,64.125128780873325,89.08913599968227,50.146131405520137,72.394001719840801,95.13601327831914,60.404523058745447,88.416669343183202,68.911874948767732,77.960953906761887,87.097839127560022,80.718388863790338,85.905115097720881,"Centro","DF-Edo México","Noreste","Noroeste","Sur",72.609223565629378,87.250953076405409,65.478550418361138,82.211257901298779,81.219987197723185]
["MEX",2015,"MEX_2015_MICS",44,"Water source available when needed","No","",32.042598716945797,28.69309760374756,10.97243793400199,35.874871219126668,10.910864000317719,49.853868594479827,27.605998280159199,4.8639867216808579,39.595476941254539,11.583330656816811,31.088125051232279,22.03904609323811,12.90216087244,19.281611136209658,14.094884902279119,"Centro","DF-Edo México","Noreste","Noroeste","Sur",27.39077643437064,12.74904692359458,34.521449581638883,17.78874209870121,18.780012802276751]
["MEX",2015,"MEX_2015_MICS",45,"Improved water source available when needed","Yes","",67.957401283054253,71.306902396252411,89.027562065998026,64.125128780873325,89.08913599968227,50.146131405520137,72.394001719840801,95.13601327831914,60.404523058745447,88.416669343183202,68.911874948767732,77.960953906761887,87.097839127560022,80.718388863790338,85.905115097720881,"Centro","DF-Edo México","Noreste","Noroeste","Sur",72.609223565629378,87.250953076405409,65.478550418361138,82.211257901298779,81.219987197723185]
["MEX",2015,"MEX_2015_MICS",46,"Improved water source available when needed","No","",32.042598716945797,28.69309760374756,10.97243793400199,35.874871219126668,10.910864000317719,49.853868594479827,27.605998280159199,4.8639867216808579,39.595476941254539,11.583330656816811,31.088125051232279,22.03904609323811,12.90216087244,19.281611136209658,14.094884902279119,"Centro","DF-Edo México","Noreste","Noroeste","Sur",27.39077643437064,12.74904692359458,34.521449581638883,17.78874209870121,18.780012802276751]
["MEX",2015,"MEX_2015_MICS",58,"Principal fuente de agua potable","Tubería dentro de la vivienda","",16.285031496493389,16.998000034243841,16.802179016681201,13.52274827236001,9.0421525821479687,14.991155681369349,16.716088155743162,14.924766952375871,11.771775467586229,9.8706444142492167,12.592040232330801,18.236365240228078,19.8952980895188,19.68328815261934,16.681660983278039,"Centro","DF-Edo México","Noreste","Noroeste","Sur",11.891658478253399,20.354472106708599,23.013288386931951,10.01615125333662,5.8927592978605414]
["MEX",2015,"MEX_2015_MICS",59,"Principal fuente de agua potable","Tubería dentro del terreno, patio o lote","",19.219944686400979,5.4012417646106403,3.145376445784636,1.8473878022637491,0.4641138554653545,7.5707983153195846,3.420982452283444,1.612460292378707,1.2113995143517671,0.26232721690359861,28.096675618311739,26.071264200284709,14.88824273650228,7.9865086078117207,5.9452518563232903,"Centro","DF-Edo México","Noreste","Noroeste","Sur",13.618542706837349,4.45724866009677,2.8751861144780291,3.029441988317306,8.1759080459779163]
["MEX",2015,"MEX_2015_MICS",60,"Principal fuente de agua potable","Tubería del vecino","",0.66319103327177664,0.012289970718805899,0,0,0,0.179718939051772,0,0,0,0,2.1617468470929868,0.1101644509578459,0.052896588795146401,0,0,"Centro","DF-Edo México","Noreste","Noroeste","Sur",0.32785232647448281,0.1135158120440842,0,0.22837710121202751,0.067252567815995201]
["MEX",2015,"MEX_2015_MICS",61,"Principal fuente de agua potable","Llave/grifo público","",1.4868657917579571,1.1640695824499061,0.84386893785521366,1.893412573244093,1.1448846480367689,1.0433141232891789,1.1937052803094781,0.31035440640920869,2.4098598691456319,1.347563501848438,1.4588244451957919,1.6524334932122411,1.9914532932199911,1.326383953448248,0.86834509760474221,"Centro","DF-Edo México","Noreste","Noroeste","Sur",0.61653059444486202,0.33093230294297948,2.7121392998468248,2.3171186067763099,0.40964388304743388]
["MEX",2015,"MEX_2015_MICS",62,"Principal fuente de agua potable","Pozo con tubería","",1.7225773413706451,0.34672890600935952,0.25606088480013423,0.1763921682085661,0.10960484096342871,0.24059521447622409,0.079248856923684996,0,0.1001371410142963,0,3.304211244132111,2.1989100715386942,2.2716370280860132,0.54624641088642267,1.5408585101305809,"Centro","DF-Edo México","Noreste","Noroeste","Sur",0.55801021151020147,0.1568918620801211,0.69199876211031552,0.15290300908567889,1.0542146884404731]
["MEX",2015,"MEX_2015_MICS",63,"Principal fuente de agua potable","Pozo protegido","",7.7800285676956076,1.575637614862736,0.68234282645295219,0.0286061064739545,0,1.722641378889876,0.57009403944581749,0.62207293592422197,0.013374244764374901,0,12.878200045360019,10.30777750436682,8.2695883213963111,1.592240151882764,0.62281806985346366,"Centro","DF-Edo México","Noreste","Noroeste","Sur",1.29266683010213,0.86540587005981462,0.8056312830036525,0.028794790520238301,6.8862258573521826]
["MEX",2015,"MEX_2015_MICS",64,"Principal fuente de agua potable","Pozo no protegido","",2.6536545090418051,0.36703865449240081,0.037442582157051499,0.0071102057652965003,0,0.39726130266967219,0.13318400919138271,0,0,0,5.9932367933399391,4.0495837942274484,1.129791332745429,0.14530644121272371,0.1381831738773138,"Centro","DF-Edo México","Noreste","Noroeste","Sur",0.21968745845493209,0.30188830723572779,0.32695181459470068,0.0040187814103990003,2.10403318885853]
["MEX",2015,"MEX_2015_MICS",65,"Principal fuente de agua potable","Manantial protegido","",2.4530626009961032,0.33271327380631283,0.058269535852785097,0.26935068388830341,0,0.98080112974633704,0.072663813240586003,0,0.064794497116711605,0,4.4485104638691304,2.8129366825550282,1.1689721512941,0.28025585664216962,1.0066971874996611,"Centro","DF-Edo México","Noreste","Noroeste","Sur",0.85778538540615024,0.44869615297725679,0.86782953520623174,0.036171618782014699,0.93751474807147672]
["MEX",2015,"MEX_2015_MICS",66,"Principal fuente de agua potable","Manantial no protegido","",1.2690133449765919,0.11620986175663391,0,0,0.035490174843219299,0.44049242887174828,0.0665010488926355,0,0,0.046231380478537101,3.214998209879623,0.44927619026987581,0.63822541334261684,0,0,"Centro","DF-Edo México","Noreste","Noroeste","Sur",0.43324563216475143,0.2221349205954864,0.072211678357881698,0.0060281721155984996,0.72468388204394585]
["MEX",2015,"MEX_2015_MICS",67,"Principal fuente de agua potable","Recogen agua de lluvia","",1.8506468157729641,0.1175165104981737,0.079308464797394396,0,0,0,0,0,0,0,6.9041316346366104,0.91117058508837379,0.61080898389239391,0.079538464591191904,0.34171052654299983,"Centro","DF-Edo México","Noreste","Noroeste","Sur",0.82968712370811459,0,0.38662125906849232,0,0.9436841900322549]
["MEX",2015,"MEX_2015_MICS",68,"Principal fuente de agua potable","Carro-tanque / camión cisterna","",0.1355591478859951,0.046845384643803202,0,0,0.040658568428648199,0.019849475575777601,0,0,0,0,0.38576828871819102,0.062186655970434102,0.13728057116878251,0.13617355512009141,0.17530029421484061,"Centro","DF-Edo México","Noreste","Noroeste","Sur",0,0.028874187092312799,0.066783686253516994,0.0152287515110704,0.098827447126420706]
["MEX",2015,"MEX_2015_MICS",69,"Principal fuente de agua potable","Carreta con tanque / tambor pequeño","",0,0,0,0,0.037337689165815598,0,0,0,0,0.048638050436203298,0,0,0,0,0,"Centro","DF-Edo México","Noreste","Noroeste","Sur",0,0.034100815512733397,0,0,0]
["MEX",2015,"MEX_2015_MICS",70,"Principal fuente de agua potable","Agua de superficie (río, arroyo, represa, lago, estanque, canal, canal de irrigación)","",0.32826035604838533,0.061329643640764597,0.074215093570039095,0.18811707558167029,0,0.1290122819518616,0.050754234849135701,0.023879667365853799,0,0,1.0022342498507051,0.252731513166987,0,0.15211559192046181,0.7311865674618373,"Centro","DF-Edo México","Noreste","Noroeste","Sur",0.169491156627469,0.061403075139536703,0.18859487620205381,0.018373742846655099,0.22025713041066231]
["MEX",2015,"MEX_2015_MICS",71,"Principal fuente de agua potable","Agua embotellada/envasada","",44.075664708741158,73.460378798266788,78.020936212048682,82.026609636314404,88.965751183391134,72.260951670687291,77.696778109120771,82.506465745546194,84.376190148957136,88.216162554277986,17.34256934450416,32.849127691092953,48.945805490038261,68.071942813865007,71.947987733213409,"Centro","DF-Edo México","Noreste","Noroeste","Sur",69.119650199051776,72.441553960019462,67.985018313615967,84.147392184086186,72.467849886815117]
["MEX",2015,"MEX_2015_MICS",72,"Principal fuente de agua potable","Otra","",0.076499599546577396,0,0,0,0.16000645755769241,0.023408058101364201,0,0,0,0.2084328818060443,0.21685258277844169,0.036071927040664899,0,0,0,"Centro","DF-Edo México","Noreste","Noroeste","Sur",0.065191896964579096,0.14613520043485759,0.0077449903305294001,0,0.017145186147328201]
["MEX",2015,"MEX_2015_MICS",73,"Principal fuente de agua potable","NR","",0,0,0,0.040265475899940797,0,0,0,0,0.052469117063850997,0,0,0,0,0,0,"Centro","DF-Edo México","Noreste","Noroeste","Sur",0,0.036746767060266597,0,0,0]
["MEX",2015,"MEX_2015_MICS",122,"Sanitation","Improved","s_imp",91.812138494226517,97.972723052938989,99.761038685329964,99.973585666736994,99.704305209426451,96.9377052543894,99.033889538645852,100,99.967977481534405,99.665632652831789,83.970875053173373,93.539719516407061,93.435059598947703,97.530053869744975,99.599321485169796,"Centro","DF-Edo México","Noreste","Noroeste","Sur",96.376022729012789,98.538336342854663,98.414876053173074,99.214234631890491,96.29864142402802,7413.3303749894676,7916.5922446481236,8054.4025142052797,8070.8328685933484,8055.2314953767254,6012.1856168933209,6124.3026317918011,6220.0481023687307,6193.3136000779514,6181.3141986901628,1566.4399732681291,1762.9284025049401,1754.1476525674291,1829.372893223082,1866.3364264274051,5980.3287503495376,8716.6982255830389,8638.6887204103441,8020.4432247031427,8154.2305767669104]
["MEX",2015,"MEX_2015_MICS",123,"Sanitation","Not Improved","",8.1878615057734727,2.0272769470609759,0.23896131467000509,0.0264143332630229,0.29569479057352582,3.0622947456106808,0.96611046135412182,0,0.032022518465594202,0.33436734716820582,16.029124946826741,6.4602804835929808,6.5649404010523078,2.46994613025509,0.40067851483021338,"Centro","DF-Edo México","Noreste","Noroeste","Sur",3.62397727098719,1.461663657145376,1.585123946827091,0.78576536810950026,3.7013585759720939,661.12524337699062,163.81217605011139,19.293008964620149,2.1324199555254602,23.889540025815219,189.92696779785661,59.74472848270544,0,1.983890282849283,20.737636190286789,299.01632009097278,121.7558916314343,123.25003958022501,46.328821928515197,7.508092388217797,224.87518005631179,129.2987225023532,139.13945644263211,63.520991178764753,313.41803819300048]
["MEX",2015,"MEX_2015_MICS",124,"Sanitation ladder","Basic","s_bas",80.725986384509511,91.451588640776919,97.000751198572729,98.384427134077796,99.383926002916184,84.496223078043471,95.148917933952433,97.393530475677537,98.555835908326955,99.471387339065998,75.805654302578546,85.087835746099273,86.600994265204321,94.051681480944666,98.509997963088992,"Centro","DF-Edo México","Noreste","Noroeste","Sur",91.171845011709323,90.882142725583989,95.595078646942639,97.356120011839465,91.554871852770958,6515.6600825496216,7389.6582113281047,7822.4434783200504,7940.0689204605796,8021.6058814138078,5239.5482319330622,5878.9388533623896,6054.0217269807044,6103.3511908849914,6161.5184005004248,1413.696384679276,1602.4635180357459,1625.8450677118681,1764.1290026669949,1845.924197316725,5651.3276323282898,8037.6893765627347,8386.005326234721,7865.5496382457104,7748.8646007007064]
["MEX",2015,"MEX_2015_MICS",125,"Sanitation ladder","Limited","s_lim",11.082980516903421,6.5211344121621408,2.7600094425701891,1.5891503099172719,0.32009382637131628,12.44089616789147,3.8841309870895628,2.6064695243224572,1.412128582153545,0.19382482003213281,8.1604023151670813,8.4471526067375127,6.8340653337434079,3.4783723888003228,1.0893235220807951,"Centro","DF-Edo México","Noreste","Noroeste","Sur",5.2002844422986882,7.6558767969220582,2.8188208482179289,1.85764666374028,4.7420116518767914,894.54383877952444,526.93403332002367,222.57578005697559,128.2516283651145,25.83583305160494,771.45076011186745,239.98768527667599,162.01921271251089,87.450089425312086,12.00601727842437,152.18299158045369,159.0856526656687,128.30258485556161,65.243890556087194,20.412229110680279,322.34195941691303,677.0918659422282,247.27890788353929,150.08211134743061,401.34626898313138]
["MEX",2015,"MEX_2015_MICS",126,"Sanitation ladder","Unimproved","s_unimp",4.5847955311510873,1.683552703609293,0.23112776242065791,0.0264225560049016,0.29598017071250893,2.005423074919837,0.87435782738754553,0,0.032035509519527897,0.33478784090186497,7.8719630506718801,3.5757682652953968,5.1370398052891693,1.7171956602954439,0.36576929691323118,"Centro","DF-Edo México","Noreste","Noroeste","Sur",2.1846671165283249,0.89256235398913053,0.98546549244970583,0.32537863746015472,2.642590899999032,370.05393884794142,136.03786708723001,18.638864498121372,2.1324199555254602,23.889540025815219,124.3548000573815,54.023695852624428,0,1.983890282849283,20.737636190286789,146.8039001502971,67.342624757599665,96.442666749205202,32.209468452670407,6.8539479217190236,135.41756933283341,78.938928324350442,86.44920832196064,26.287837106248361,223.65908732924049]
["MEX",2015,"MEX_2015_MICS",127,"Sanitation ladder","Open defecation","s_od",3.6062375674359748,0.34372424345168429,0.0081115964364114005,0,0,1.0574576791453509,0.092593251570512194,0,0,0,8.1619803315826491,2.8892433818678809,1.4279005957631401,0.75275046995964723,0.034909217916982198,"Centro","DF-Edo México","Noreste","Noroeste","Sur",1.4432034294636371,0.56941812350473353,0.60063501238963213,0.46085468696014592,1.060525595353365,291.07130452904897,27.77430896288147,0.65414446649877289,0,0,65.57216774047501,5.7210326300810106,0,0,0,152.2124199406754,54.413266873834573,26.807372831019801,14.1193534758448,0.65414446649877289,89.457610723478453,50.359794178002801,52.690248120671498,37.233154072516392,89.758950863760191]
["MEX",2015,"MEX_2015_MICS",128,"Shared among Improved Sanitation","Yes","s_shared",12.071784370261611,6.6560714135081094,2.7666283063923611,1.5895703150239959,0.32104405310776712,12.83398585048543,3.9220553435513659,2.6064695243224572,1.4125811097094181,0.19447590170452381,9.71869186654461,9.031008348312179,7.3142408888883246,3.566462080955906,1.093705766101021,"Centro","DF-Edo México","Noreste","Noroeste","Sur",5.3960460059984818,7.769464856327307,2.864250743723995,1.872367843683046,4.9243666869529781]
["MEX",2015,"MEX_2015_MICS",129,"Shared among Improved Sanitation","No","",87.928215629738403,93.343928586491955,97.233371693607666,98.410429684975952,99.678955946892245,87.166014149514652,96.077944656448693,97.393530475677537,98.587418890290607,99.805524098295479,90.281308133455425,90.968991651687844,92.685759111111707,96.433537919044113,98.906294233898976,"Centro","DF-Edo México","Noreste","Noroeste","Sur",94.603953994001472,92.230535143672569,97.135749256275744,98.127632156317006,95.075633313047064]
["MEX",2015,"MEX_2015_MICS",130,"Manually calculated ratios","Improved latrines","",80.516689983718095,85.324817887386388,95.896861923372725,99.64925427676468,95.400289210505647,91.79273479787085,95.032487564068475,100,100,100,70.878214574404012,87.502585233919163,78.618351008409675,84.506600067417551,98.067941269957743,"Centro","DF-Edo México","Noreste","Noroeste","Sur",88.663040360496609,76.752315862790894,81.959174518762808,94.827151075358856,82.713261418207367]
["MEX",2015,"MEX_2015_MICS",135,"Sanitation type","Sewer connection","s_sew",38.879667483298363,74.671856141144872,87.476287642423046,92.085562348485368,97.392586303730283,79.1134314272377,87.852636892044359,94.227749410394267,96.938560766688283,98.353586727288985,8.3831198357141083,24.26841450395337,28.180049052301779,48.630566603697432,62.815235307756801,"Centro","DF-Edo México","Noreste","Noroeste","Sur",76.373564897358605,93.026905745950941,82.543864848852294,82.80588692219149,54.682587961359552]
["MEX",2015,"MEX_2015_MICS",136,"Sanitation type","Septic tank connection","s_sep",21.501551964128591,15.262894704478519,7.89274528416483,5.2379540170972323,1.974013473068122,10.002970914926721,7.3743567684331666,3.745663476968228,2.275591179544707,1.065643798746527,19.865347254307331,32.000999745216092,32.527616533138811,33.429601789749228,24.608338867697359,"Centro","DF-Edo México","Noreste","Noroeste","Sur",7.1766190702196671,2.6473559247518721,7.6600738580726757,10.076415520361801,23.885538143136522]
["MEX",2015,"MEX_2015_MICS",137,"Sanitation type","Improved latrines","s_lat",31.430919046799509,8.037972207315681,4.3920057587420818,2.6500693011543821,0.33770543262807301,7.8213029122249296,3.806895878168274,2.0265871126375039,0.75382553530139373,0.24640212679631579,55.722407963152037,37.270305267237767,32.727394013507258,15.469885476298471,12.175747309715801,"Centro","DF-Edo México","Noreste","Noroeste","Sur",12.82583876143449,2.8640746721517161,8.2109373462479738,6.3319321893372749,17.73051531953195]
["MEX",2015,"MEX_2015_MICS",138,"Sanitation type","Unimproved facilities","",4.5830202844412549,1.683552703609293,0.23085914553789569,0.0264143332630229,0.29569479057352582,2.0050393855205,0.87359770560079175,0,0.032022518465594202,0.33436734716820582,7.8695974101837303,3.5731514804424238,5.1370398052891693,1.7171956602954439,0.36576929691323118,"Centro","DF-Edo México","Noreste","Noroeste","Sur",2.182322625518875,0.89236893012308616,0.9848587438738694,0.32518497613587621,2.641336426432471]
["MEX",2015,"MEX_2015_MICS",139,"Sanitation type","Open defecation","",3.6048412213322139,0.34372424345168429,0.0081021691321093992,0,0,1.05725536009018,0.092512755753330095,0,0,0,8.1595275366429902,2.887129003150557,1.4279005957631401,0.75275046995964723,0.034909217916982198,"Centro","DF-Edo México","Noreste","Noroeste","Sur",1.4416546454683159,0.56929472702228978,0.60026520295322161,0.46058039197362399,1.0600221495396249]
["MEX",2015,"MEX_2015_MICS",148,"Shared among improved sanitation facilities","Yes","",11.07868915329427,6.5211344121621408,2.7568017572402539,1.588655763787731,0.31978519616667272,12.438515902082431,3.8807543231043908,2.604790349624635,1.411555935148793,0.19358137593920641,8.1579499944445271,8.4409708915501529,6.8340653337434079,3.4783723888003228,1.0893235220807951,"Centro","DF-Edo México","Noreste","Noroeste","Sur",5.1947037201697608,7.6542177203528956,2.8170853074523738,1.856541015515339,4.7397605549440014]
["MEX",2015,"MEX_2015_MICS",149,"Shared among improved sanitation facilities","No","",80.694729038188754,91.451588640776919,96.888016842735667,98.353809742291361,99.28810134497671,84.480056761077961,95.066200351696935,97.330786311366296,98.515869502330304,99.346451215514449,75.782873590335029,85.02556757231585,86.600994265204321,94.051681480944666,98.509997963088992,"Centro","DF-Edo México","Noreste","Noroeste","Sur",91.074003299657306,90.862447994653635,95.536221002235237,97.298174858232343,91.511409519411217]
["MEX",2015,"MEX_2015_MICS",150,"Shared among improved sanitation facilities","DK/missing","",8.2265818085169649,2.0272769470609759,0.3551814000240785,0.057534493920893298,0.39211345885660959,3.0814273368397429,1.05304532519871,0.0644233390090755,0.072574562520934804,0.45996740854634133,16.059176415220591,6.5334615361340527,6.5649404010523078,2.46994613025509,0.40067851483021338,"Centro","DF-Edo México","Noreste","Noroeste","Sur",3.731292980172876,1.4833342849933691,1.6466936903123159,0.84528412625235838,3.7488299256449351]
["MEX",2015,"MEX_2015_MICS",151,"Shared among all sanitation facilities","Yes","",12.036616304719249,6.543626442646433,2.8325787049856488,1.588655763787731,0.31978519616667272,12.87207201352599,3.88434784033453,2.604790349624635,1.411555935148793,0.19358137593920641,9.3057985084025496,9.0796618327392977,7.4474025962861248,3.8324042441357542,1.0897039292000901,"Centro","DF-Edo México","Noreste","Noroeste","Sur",5.4345373038923874,7.871741951179767,2.978887030058559,1.907374526288258,4.8750603310685019]
["MEX",2015,"MEX_2015_MICS",152,"Shared among all sanitation facilities","No","",87.911359062896992,93.456373557353601,97.051191792549389,98.380224075554366,99.583796135550244,87.108590953426628,96.028636795509598,97.330786311366296,98.547892020795885,99.68081856268266,90.60761601200646,90.844981469647067,92.552597403713904,96.167595755864298,98.910296070799902,"Centro","DF-Edo México","Noreste","Noroeste","Sur",94.441487932865769,92.106463344871798,96.959171412842664,98.032831315400202,95.076959721185332]
["MEX",2015,"MEX_2015_MICS",153,"Tipo de instalación sanitaria","Excusado conectado al alcantarillado","",38.879667483298363,74.671856141144872,87.476287642423046,92.085562348485368,97.392586303730283,79.1134314272377,87.852636892044359,94.227749410394267,96.938560766688283,98.353586727288985,8.3831198357141083,24.26841450395337,28.180049052301779,48.630566603697432,62.815235307756801,"Centro","DF-Edo México","Noreste","Noroeste","Sur",76.373564897358605,93.026905745950941,82.543864848852294,82.80588692219149,54.682587961359552,3139.3214955073822,6033.787964646498,7062.5691192215354,7434.0354841582539,7868.464926987248,4906.704086729731,5432.8486726540177,5861.0113391059913,6005.6322223705192,6099.9404302905596,156.3834365551638,457.38299659192268,529.05159055399054,912.16437187349197,1177.0598437955371,4739.1354508019595,8229.1572431850909,7245.5586269659843,6693.998267433597,4630.3294021342917]
["MEX",2015,"MEX_2015_MICS",154,"Tipo de instalación sanitaria","Excusado conectado a tanque séptico","",21.501551964128591,15.262894704478519,7.89274528416483,5.2379540170972323,1.974013473068122,10.002970914926721,7.3743567684331666,3.745663476968228,2.275591179544707,1.065643798746527,19.865347254307331,32.000999745216092,32.527616533138811,33.429601789749228,24.608338867697359,"Centro","DF-Edo México","Noreste","Noroeste","Sur",7.1766190702196671,2.6473559247518721,7.6600738580726757,10.076415520361801,23.885538143136522,1736.1332706035651,1233.3036184272,637.2362226628195,422.85820963041078,159.4829377443269,620.39551795766806,456.03371507551577,232.9820700202809,140.97964323720501,66.09178077344869,370.57937055311521,603.11781616470842,610.6727221037869,627.03961413867501,461.12200904392148,445.32384861552657,234.1850243085083,672.38812148165107,814.57382490961879,2022.543439753018]
["MEX",2015,"MEX_2015_MICS",155,"Tipo de instalación sanitaria","Letrina (pozo negro, hoyo)","",18.49133315625442,3.4396595226488929,1.5694954852133389,0.28711009389205588,0.013087421021356399,3.9780174981936991,1.490029687845611,0.27815496779152082,0.052233760504605403,0,37.201810739978647,18.756752373905311,16.225189346198832,8.7984941581106906,2.4243327076545049,"Centro","DF-Edo México","Noreste","Noroeste","Sur",7.408549130671199,1.103308740784924,5.1781892502891331,2.8525828069274271,8.024851829797063,1493.074488946045,277.93840012508912,126.7162867260231,23.178298219825749,1.0573485847280999,246.72112387668841,92.144141578523005,17.301372795760841,3.2360368536628878,0,693.98351969247335,353.50556608104461,304.61133033212388,165.03350583119521,45.428225560238317,459.71558184245782,97.598657537793756,454.5325550626506,230.6017733404129,679.51625481839517]
["MEX",2015,"MEX_2015_MICS",156,"Tipo de instalación sanitaria","Descarga a otra parte","",1.0467395904980561,0.72709812587805622,0.1223886536302238,0.0191817759899564,0.28123760460538733,1.144927141098762,0.59424012336516074,0,0.032022518465594202,0.33436734716820582,0.5321600685950123,0.50807920996581668,0.78082088738080502,0.50472244750282447,0.17685318399359151,"Centro","DF-Edo México","Noreste","Noroeste","Sur",1.421984518354692,0.49110684222579171,0.027345821818649502,0.10574381796292209,0.41089739368394818,84.518523674636356,58.752469106264478,9.8812872490112973,1.548538117396385,22.72152647313607,71.009670303631168,36.748090662655201,0,1.983890282849283,20.737636190286789,9.9272134903497591,9.575689071997914,14.65911331949407,9.4670876045655916,3.3139536946148231,88.237039222708049,43.443296275132063,2.4003692527894178,8.5482924046299296,34.793347465185171]
["MEX",2015,"MEX_2015_MICS",157,"Tipo de instalación sanitaria","Descarga a sitio desconocido / no estáseguro dónde / NS dónde","",0.40626833214003449,0.13702234925908111,0.24969954867813329,0.30814031417057641,0.024768785068257901,0.049856138428302402,0,0.30658509695836222,0.40153133310741701,0.032265130604182402,1.454742957362074,0.1579482920321191,0.56830588653792202,0.0581244218465643,0,"Centro","DF-Edo México","Noreste","Noroeste","Sur",0.0187738792019576,0.51940896546576298,0,0.32413881362186459,0.20782550766575689,32.803956170124721,11.071959966875371,20.159981283001901,24.876060603016072,2.0011001246632669,3.0921338357027932,0,19.06974050550394,24.876060603016072,2.0011001246632669,27.13759405030909,2.9768266527860008,10.66936159820221,1.090240777497955,0,1.164957490129519,45.946901233183283,0,26.203265702975681,17.597933721392849]
["MEX",2015,"MEX_2015_MICS",158,"Tipo de instalación sanitaria","Letrina de fosa mejorada con ventilación","",1.282969403262596,0.59319517832578517,0.093164199754188395,0.1425245709718457,0.0091272060399584,0.84353254408165557,0.028459305724383099,0.1197738222707629,0,0,0.90451395010902469,0.69765634269527121,1.816904876400151,1.7761953858648909,0.657213632568453,"Centro","DF-Edo México","Noreste","Noroeste","Sur",0.28746492982128008,0.033787547887668502,0.10051675591842241,0.76095560805193141,0.94625227562078384,103.5927950636593,47.932569412805528,7.5217938247509739,11.50595914221031,0.73739802311880953,52.316838072453983,1.7599369444011641,7.4499893592870858,0,0,16.873312406619789,13.14861951782401,34.110530218054627,33.316127317111267,12.315161630793,17.837785123808491,2.988845454976047,8.8231881234657976,61.515379053664716,80.125317710629844]
["MEX",2015,"MEX_2015_MICS",159,"Tipo de instalación sanitaria","Letrina de fosa con losa","",10.946087531707869,3.8680951570819229,2.4419636928417718,1.912294322119904,0.29072202049850021,2.8098023073961431,2.288406884598281,1.322073225616857,0.3000604416893714,0.21413699619213339,15.78445034982645,17.188487270664741,14.116993904370331,4.8370715104763251,8.9318397324639491,"Centro","DF-Edo México","Noreste","Noroeste","Sur",4.9887749521078506,1.2075694180133609,2.8427628673641681,2.3942549607360539,8.4078748508713961,883.83697969529703,312.55773206966211,197.15671334640061,154.37885683963091,23.487783912641621,174.26710251195911,141.51616553934011,82.233590581906412,18.589637013547161,13.28088750149209,294.45202242297989,323.94871998984809,265.0321177612737,90.72903328511363,167.36878925617171,309.56365940729893,106.82155386347441,249.5328399726051,193.55071426288001,711.94929835737366]
["MEX",2015,"MEX_2015_MICS",160,"Tipo de instalación sanitaria","Letrina de fosa sin losa/Foso abierto","",2.9591691799423558,0.7673060400288253,0.1084704919076719,0.0072325572730664997,0.014457185968138501,0.3266477250545422,0.1211066016246075,0,0,0,6.8570073362664026,2.5545594419214872,4.3335051731308916,1.212473212792619,0.18891611291963969,"Centro","DF-Edo México","Noreste","Noroeste","Sur",0.674649982073247,0.37599744477263303,0.64787370465727268,0.17211766263863351,1.954974903950899,238.93680210682419,62.001431178773792,8.7575772491100743,0.58388183812907513,1.168013552679146,20.259059663215179,7.4892896008847032,0,0,0,127.9144748904768,48.145380586272047,81.357126109458576,22.742380848104819,3.5399942271042009,41.863407204091487,33.260722489466161,56.869240597827208,13.91393025691948,165.5404053772119]
["MEX",2015,"MEX_2015_MICS",161,"Tipo de instalación sanitaria","Excusado de compostaje","",0.30426062343462118,0,0.037682832254647199,0,0,0.14009442412513051,0,0,0,0,0.37688996587584611,0.46946098794030111,0,0,0.16236123702888891,"Centro","DF-Edo México","Noreste","Noroeste","Sur",0.12227586963220199,0,0.089468472676244901,0,0.1437108555769652,24.56738900339359,0,3.042397140747076,0,0,8.6888139091153445,0,0,0,0,7.0307175874699341,8.8478575068083085,0,0,3.042397140747076,7.5874670683553296,0,7.8533888039754167,0,12.16893027180992]
["MEX",2015,"MEX_2015_MICS",162,"Tipo de instalación sanitaria","Excusado colgante, Letrina colgante","",0.066358203172972904,0,0,0,0,0,0,0,0,0,0.26436622297991519,0,0.022713744777471599,0,0,"Centro","DF-Edo México","Noreste","Noroeste","Sur",0,0,0,0.0052749778309854004,0.058240918681743498,5.3580636643471378,0,0,0,0,0,0,0,0,0,4.9316363440945779,0,0.42642732025256008,0,0,0,0,0,0.42642732025256008,4.9316363440945779]
["MEX",2015,"MEX_2015_MICS",163,"Tipo de instalación sanitaria","No hay instalación sanitaria, va al monte, campo","",3.6048412213322139,0.34372424345168429,0.0081021691321093992,0,0,1.05725536009018,0.092512755753330095,0,0,0,8.1595275366429902,2.887129003150557,1.4279005957631401,0.75275046995964723,0.034909217916982198,"Centro","DF-Edo México","Noreste","Noroeste","Sur",1.4416546454683159,0.56929472702228978,0.60026520295322161,0.46058039197362399,1.0600221495396249,291.07130452904897,27.77430896288147,0.65414446649877289,0,0,65.57216774047501,5.7210326300810106,0,0,0,152.2124199406754,54.413266873834573,26.807372831019801,14.1193534758448,0.65414446649877289,89.457610723478453,50.359794178002801,52.690248120671498,37.233154072516392,89.758950863760191]
["MEX",2015,"MEX_2015_MICS",164,"Tipo de instalación sanitaria","Otro","",0.51075331082787034,0.18914853770241069,0,0,0,0.5334645193671953,0.15825098061102341,0,0,0,0.2160637823424007,0.51051282855512015,0,0,0,"Centro","DF-Edo México","Noreste","Noroeste","Sur",0.085688125090935902,0.0252646431246616,0.30963921739794709,0.042048517703335203,0.21722321011588169,41.240549402133666,15.28396680219166,0,0,0,33.086070090535102,9.7863155890845164,0,0,0,4.0305754253760213,9.621555099329699,0,0,0,5.3171229060338341,2.2349095597522299,27.179598471344001,3.39918712444639,18.393698142748889]
["MEX",2015,"MEX_2015_MICS",222,"Hygiene ladder","Basic","h_bas",79.603522380454422,85.588588317261411,91.017774295916539,95.494437707325304,96.5147307260156,83.189148206783941,87.448913559220671,94.144773071123396,96.595314956701415,96.13198251018045,74.624995949810597,84.557092436514893,81.891640422029852,85.441081729355446,91.114264998055987,"Centro","DF-Edo México","Noreste","Noroeste","Sur",87.600779786174954,88.675663820866731,92.35296276799248,92.176317454068396,86.241245033363938,6196.0512897049384,6727.0203051193057,6946.5386893314717,7187.598737049555,7101.6723036245694,5004.0567503616821,5165.4709941223091,5520.5987745224356,5489.0384277872035,5414.806174072065,1354.330356582675,1514.722093292309,1498.3922648160301,1561.399736363928,1636.0657529092191,5246.2530709694502,6676.171573540274,7982.9690861186637,7081.96233464532,7171.5252595561351]
["MEX",2015,"MEX_2015_MICS",223,"Hygiene ladder","Limited","h_lim",14.99105578427114,9.8760274746624575,5.7421373815629586,3.3797959602563701,2.709128664070835,13.17798420541188,8.4081615289710516,4.307278584061212,2.238616042722664,2.9706203159738682,19.591606816466889,10.32854662601893,10.662286043659551,8.532615002035616,5.9583633377974694,"Centro","DF-Edo México","Noreste","Noroeste","Sur",6.2816381047607113,6.7482561095027096,5.4208921988806003,6.9056312612961968,11.444077091871209,1166.8497542387479,776.22775024286386,438.24384620524779,254.38777125298901,199.3410110131644,792.69210276483352,496.65699348434657,252.57649572038329,127.2095803929374,167.32551236063151,355.55791337822541,185.02147265501961,195.09057152526611,155.92994078510031,106.9895498862696,376.19600280111348,508.05952465427089,468.58068811024401,530.56383505251847,951.65008233486515]
["MEX",2015,"MEX_2015_MICS",224,"Hygiene ladder","No facility","h_nfac",5.405421835274443,4.5353842080762323,3.2400883225205011,1.125766332418328,0.77614060991356337,3.6328675878042032,4.1429249118084037,1.5479483448154401,1.1660690005758809,0.89739717384571938,5.7833972337225763,5.1143609374662971,7.4460735343106421,6.0263032686089426,2.9273716641465519,"Centro","DF-Edo México","Noreste","Noroeste","Sur",6.1175821090641653,4.5760800696305539,2.2261450331268469,0.91805128463542973,2.314677874764937,420.73855442953402,356.46833601405598,247.28575339651599,84.733277281574956,57.1093783475241,218.52700704103751,244.71611586438729,90.770857017799813,66.261987514420127,50.547503865532242,104.9598775599884,91.616625901223543,136.24270962901619,110.1281508193057,52.564464256494063,366.3709844241676,344.52175898933228,192.42747008899809,70.534436595393643,192.48064937131349]
["MEX",2015,"MEX_2015_MICS",225,"Lugar usado conmayor frecuencia para el lavado de las manos","Lugar observado","",91.187584549920004,92.85733318176915,91.467191379014238,92.184051860828149,90.36890625409427,93.46410233562635,91.560230019896068,92.815604883252618,90.653403116128047,90.004595818414273,91.66059135494028,90.187177302615979,90.20373485193916,91.556651213609015,93.020273843061403,"Centro","DF-Edo México","Noreste","Noroeste","Sur",90.608610721401845,81.214487641774383,96.282925616105686,94.168231902141827,95.931889846488076]
["MEX",2015,"MEX_2015_MICS",226,"Lugar usado conmayor frecuencia para el lavado de las manos","No está en la vivienda/patio/lote","",5.0223081365180953,4.3172095931327643,2.9925955474429,1.049592984151253,0.70687613290198248,3.462967663436769,3.7972555252717441,1.404649120312834,1.0695529571827089,0.81501259923775826,5.3920975187038813,4.4848159488530976,7.2569978219777713,5.8713040527557991,2.80516679632085,"Centro","DF-Edo México","Noreste","Noroeste","Sur",5.9042537285346741,3.7283464558361818,2.1441232641020509,0.83045185181126502,2.2002148232822418]
["MEX",2015,"MEX_2015_MICS",227,"Lugar usado conmayor frecuencia para el lavado de las manos","No obtuvo permiso para ver el lugar","",3.601679589788584,2.731150791867754,5.4699515602153213,6.7663551550205829,8.9242176130037532,3.0124690897227451,4.4825539109578472,5.7250678651907414,8.2770439266892435,9.1803915823479727,2.7129097593105538,4.9517100863085108,2.5392673260830789,2.5720447336352499,4.1745593606178,"Centro","DF-Edo México","Noreste","Noroeste","Sur",3.4871355500633028,14.890849484032641,1.52487528621292,4.9592452277442973,1.7949802903850369]
["MEX",2015,"MEX_2015_MICS",228,"Lugar usado conmayor frecuencia para el lavado de las manos","Otra razón","",0.18842772377329481,0.094306433230346806,0.070261513327536801,0,0,0.060460911214279003,0.1599605438743455,0.054678131243826797,0,0,0.23440136704533901,0.37629666222245672,0,0,0,"Centro","DF-Edo México","Noreste","Noroeste","Sur",0,0.16631641835687189,0.048075833579392199,0.042071018302637299,0.072915039844761304]