{"text_format":"1","workbook":"xlsx","n_sheets":6,"sheets":["Introduction","Water","Sanitation","Hygiene","DHS17","data_summary"],"not_rendered":{"charts":99,"images":76,"macros":1,"external_links":0,"defined_names":0,"comments":0,"pivot_tables":0},"unopened":[],"bounds":{"document_bytes":16777216,"sheet_cells":100000,"rows_first":2000,"rows_last":500,"rows_between":2000,"halvings":0,"cell_chars":16384,"cell_head_chars":4096},"cells_cut":0,"cells_raw":0,"read":"whole","date_system":"1900"}

{"sheet":"Introduction","index":0,"n_rows":55,"n_cols":12,"rows_kept":55,"cut":false,"hidden":false,"merged":[[107,0,107,1],[1,0,1,1],[4,0,4,1],[5,0,5,1],[6,0,6,1],[7,0,7,1],[112,0,112,1],[113,0,113,1],[207,0,207,1],[212,0,212,1],[213,0,213,1]]}
[]
[]
[]
[null,null,"Joint Monitoring Programme for Water Supply, Sanitation and Hygiene"]
[]
[null,null,"Estimates on household water, sanitation and hygiene \nby wealth quintile and sub-national region in"]
[null,null,{"$f":"+Water!B5","v":"Maldives"}]
[]
[null,null,"Updated May 2021"]
[]
[null,null,"Follow the links below to find the following information: "]
[]
[null,null,"JMP Estimates"]
[null,null,"WASH status and trends by wealth quintile \n(customized quintiles made without water and sanitation assets)"]
[null,null,"Water"]
[null,null,"Sanitation"]
[null,null,"Hygiene"]
[]
[null,null,"Data inputs"]
[null,null," customized wealth quintiles and subnational data:"]
[null,null,{"$f":"IF(INDIRECT(CONCATENATE(\"Water\",\"!B105\"))=0,\"\",INDIRECT(CONCATENATE(\"Water\",\"!B105\")))","v":"DHS17"}]
[null,null,{"$f":"IF(INDIRECT(CONCATENATE(\"Water\",\"!B106\"))=0,\"\",INDIRECT(CONCATENATE(\"Water\",\"!B106\")))","v":""}]
[null,null,{"$f":"IF(INDIRECT(CONCATENATE(\"Water\",\"!B107\"))=0,\"\",INDIRECT(CONCATENATE(\"Water\",\"!B107\")))","v":""}]
[null,null,{"$f":"IF(INDIRECT(CONCATENATE(\"Water\",\"!B108\"))=0,\"\",INDIRECT(CONCATENATE(\"Water\",\"!B108\")))","v":""}]
[null,null,{"$f":"IF(INDIRECT(CONCATENATE(\"Water\",\"!B109\"))=0,\"\",INDIRECT(CONCATENATE(\"Water\",\"!B109\")))","v":""}]
[null,null,{"$f":"IF(INDIRECT(CONCATENATE(\"Water\",\"!B110\"))=0,\"\",INDIRECT(CONCATENATE(\"Water\",\"!B110\")))","v":""}]
[null,null,{"$f":"IF(INDIRECT(CONCATENATE(\"Water\",\"!B111\"))=0,\"\",INDIRECT(CONCATENATE(\"Water\",\"!B111\")))","v":""}]
[null,null,{"$f":"IF(INDIRECT(CONCATENATE(\"Water\",\"!B112\"))=0,\"\",INDIRECT(CONCATENATE(\"Water\",\"!B112\")))","v":""}]
[null,null,{"$f":"IF(INDIRECT(CONCATENATE(\"Water\",\"!B113\"))=0,\"\",INDIRECT(CONCATENATE(\"Water\",\"!B113\")))","v":""}]
[null,null,{"$f":"IF(INDIRECT(CONCATENATE(\"Water\",\"!B114\"))=0,\"\",INDIRECT(CONCATENATE(\"Water\",\"!B114\")))","v":""}]
[null,null,{"$f":"IF(INDIRECT(CONCATENATE(\"Water\",\"!B115\"))=0,\"\",INDIRECT(CONCATENATE(\"Water\",\"!B115\")))","v":""}]
[null,null,{"$f":"IF(INDIRECT(CONCATENATE(\"Water\",\"!B116\"))=0,\"\",INDIRECT(CONCATENATE(\"Water\",\"!B116\")))","v":""}]
[]
[]
[]
[]
[]
[]
[]
[]
[]
[]
[]
[]
[]
[]
[]
[]
[]
[]
[]
[]
[]
[]
[null,null,null,null,null,null,null,null,null,null,null,{"$f":"+IF(ISNUMBER(M48), \"\", \"Insufficient data to estimate safely managed sanitation services at national level\")","v":"Insufficient data to estimate safely managed sanitation services at national level"}]

{"sheet":"Water","index":1,"n_rows":318,"n_cols":28,"rows_kept":318,"cut":false,"hidden":false,"merged":[[3,1,3,24],[317,18,317,22],[117,18,117,22],[196,18,196,22],[296,23,296,27],[298,0,299,1],[300,0,301,1],[296,0,297,2],[296,3,296,7],[296,8,296,12],[296,13,296,17],[296,18,296,22],[196,23,196,27],[198,0,199,1],[200,0,201,1],[196,13,196,17],[96,8,96,12],[96,13,96,17],[96,18,96,22],[217,18,217,22],[98,0,99,1],[100,0,101,1],[196,0,197,2],[196,3,196,7],[196,8,196,12],[217,1,217,11],[35,3,36,3],[38,1,39,2],[38,3,39,3],[96,0,97,2],[96,3,96,7],[317,1,317,11],[6,9,6,16],[6,17,6,24],[6,1,6,8],[4,1,4,24],[117,1,117,11],[30,21,30,24],[32,1,33,2],[32,3,33,3],[30,17,30,20],[30,1,31,4],[30,5,30,8],[30,9,30,12],[30,13,30,16],[96,23,96,27],[35,1,36,2]]}
["BGD"]
[]
[]
[null,"Summary of trends in use of drinking water by wealth quintile (%)"]
[null,{"$f":"IF(ISERROR(INDIRECT(CONCATENATE($B105,\"!A2\"))),\"\",INDIRECT(CONCATENATE($B105,\"!A2\")))","v":"Maldives"}]
[]
[null,{"$f":"B118","v":"National use of drinking water sources, 2013–2020"},null,null,null,null,null,null,null,{"$f":"B218","v":"Urban use of drinking water sources,  2013–2020"},null,null,null,null,null,null,null,{"$f":"B318","v":"Rural use of drinking water sources, 2013–2020"}]
[]
[]
[]
[]
[]
[]
[]
[]
[]
[]
[]
[]
[]
[]
[]
[]
[]
[]
[]
[]
[]
[]
[]
[null,{"$f":"IF(ISERROR(INDIRECT(CONCATENATE($B105,\"!A2\"))),\"\",INDIRECT(CONCATENATE($B105,\"!A2\")))","v":"Maldives"},null,null,null,"Poorest",null,null,null,"Poor",null,null,null,"Middle",null,null,null,"Rich",null,null,null,"Richest"]
[null,null,null,null,null,"Basic","Limited","Unimproved","Surface \n water","Basic","Limited","Unimproved","Surface \nwater","Basic","Limited","Unimproved","Surface \nwater","Basic","Limited","Unimproved","Surface \nwater","Basic","Limited","Unimproved","Surface \nwater"]
[null,"NATIONAL",null,"Estimate",{"$f":"C99","v":2013},{"$f":"E99","v":98.721921330931679},{"$f":"F99","v":0.18696362225819091},1.0911150468101312,0,{"$f":"J99","v":99.656136449812863},{"$f":"K99","v":0.11537658674085058},0.2284869634462865,0,{"$f":"O99","v":100},{"$f":"P99","v":0},0,0,{"$f":"T99","v":99.901434631485756},{"$f":"U99","v":5.9310678306994317E-2},3.9254690207243925E-2,0,{"$f":"Y99","v":99.683410967757936},{"$f":"Z99","v":0},0.31658903224206369,0]
[null,null,null,null,{"$f":"C100","v":2020},{"$f":"E100","v":98.721921330931679},0.18696362225819091,1.0911150468101312,0,{"$f":"J100","v":99.656136449812863},0.11537658674085058,0.2284869634462865,0,{"$f":"O100","v":100},0,0,0,{"$f":"T100","v":99.901434631485756},5.9310678306994317E-2,3.9254690207243925E-2,0,{"$f":"Y100","v":99.683410967757936},0,0.31658903224206369,0]
[]
[null,"URBAN",null,"Estimate",{"$f":"C199","v":2013},{"$f":"E199","v":98.732733107546494},{"$f":"F199","v":0},1.267266892453506,0,{"$f":"J199","v":100},{"$f":"K199","v":0},0,0,{"$f":"O199","v":100},{"$f":"P199","v":0},0,0,{"$f":"T199","v":100},{"$f":"U199","v":0},0,0,{"$f":"Y199","v":99.231692998078984},{"$f":"Z199","v":0},0.76830700192101631,0]
[null,null,null,null,{"$f":"C200","v":2020},{"$f":"E200","v":98.732733107546494},0,1.267266892453506,0,{"$f":"J200","v":100},0,0,0,{"$f":"O200","v":100},0,0,0,{"$f":"T200","v":100},0,0,0,{"$f":"Y200","v":99.231692998078984},0,0.76830700192101631,0]
[]
[null,"RURAL",null,"Estimate",{"$f":"C299","v":2013},{"$f":"E299","v":99.008028562295465},{"$f":"F299","v":0.31849254928699006},0.67347888841754866,0,{"$f":"J299","v":99.555314660106717},{"$f":"K299","v":0.15167088623290703},0.29301445366037626,0,{"$f":"O299","v":99.565352930443055},{"$f":"P299","v":4.5048172652394955E-2},0.38959889690454474,0,{"$f":"T299","v":99.898771197486752},{"$f":"U299","v":0.10122880251324773},0,0,{"$f":"Y299","v":99.933256490527953},{"$f":"Z299","v":0},6.6743509472047435E-2,0]
[null,null,null,null,{"$f":"C300","v":2020},{"$f":"E300","v":99.008028562295465},0.31849254928699006,0.67347888841754866,0,{"$f":"J300","v":99.555314660106717},0.15167088623290703,0.29301445366037626,0,{"$f":"O300","v":99.565352930443055},4.5048172652394955E-2,0.38959889690454474,0,{"$f":"T300","v":99.898771197486752},0.10122880251324773,0,0,{"$f":"Y300","v":99.933256490527953},0,6.6743509472047435E-2,0]
[]
[]
[]
[]
[]
[]
[]
[]
[]
[]
[]
[]
[]
[]
[]
[]
[]
[]
[]
[]
[]
[]
[]
[]
[]
[]
[]
[]
[]
[]
[]
[]
[]
[]
[]
[]
[]
[]
[]
[]
[]
[]
[]
[]
[]
[]
[]
[]
[]
[]
[]
[]
[]
[]
[]
[]
["NATIONAL",null,null,"Poorest",null,null,null,null,"Poor",null,null,null,null,"Middle",null,null,null,null,"Rich",null,null,null,null,"Richest"]
[null,null,null,"Improved","Basic","Limited","Unimproved","Surface water","Improved","Basic","Limited","Unimproved","Surface water","Improved","Basic","Limited","Unimproved","Surface water","Improved","Basic","Limited","Unimproved","Surface water","Improved","Basic","Limited","Unimproved","Surface water"]
["Forecast period:",null,{"$f":"MinBase(C105:C116)","v":2013},{"$f":"IF((D101+H101)>100,D101*100/(D101+H101),D101)","v":98.908884953189869},{"$f":"D99*AVERAGEIF(E105:E116,\">0\")/100","v":98.721921330931679},{"$f":"D99*(100-AVERAGEIF(E105:E116,\">0\"))/100","v":0.18696362225819091},{"$f":"100-(E99+F99+H99)","v":1.0911150468101312},{"$f":"IF((D101+H101)>100,H101*100/(D101+H101),H101)","v":0},{"$f":"IF((I101+M101)>100,I101*100/(I101+M101),I101)","v":99.771513036553699},{"$f":"I99*AVERAGEIF(J105:J116,\">0\")/100","v":99.656136449812863},{"$f":"I99*(100-AVERAGEIF(J105:J116,\">0\"))/100","v":0.11537658674085058},{"$f":"100-(J99+K99+M99)","v":0.2284869634462865},{"$f":"IF((I101+M101)>100,M101*100/(I101+M101),M101)","v":0},{"$f":"IF((N101+R101)>100,N101*100/(N101+R101),N101)","v":100},{"$f":"N99*AVERAGEIF(O105:O116,\">0\")/100","v":100},{"$f":"N99*(100-AVERAGEIF(O105:O116,\">0\"))/100","v":0},{"$f":"100-(O99+P99+R99)","v":0},{"$f":"IF((N101+R101)>100,R101*100/(N101+R101),R101)","v":0},{"$f":"IF((S101+W101)>100,S101*100/(S101+W101),S101)","v":99.960745309792756},{"$f":"S99*AVERAGEIF(T105:T116,\">0\")/100","v":99.901434631485756},{"$f":"S99*(100-AVERAGEIF(T105:T116,\">0\"))/100","v":5.9310678306994317E-2},{"$f":"100-(T99+U99+W99)","v":3.9254690207243925E-2},{"$f":"IF((S101+W101)>100,W101*100/(S101+W101),W101)","v":0},{"$f":"IF((X101+AB101)>100,X101*100/(X101+AB101),X101)","v":99.683410967757936},{"$f":"X99*AVERAGEIF(Y105:Y116,\">0\")/100","v":99.683410967757936},{"$f":"X99*(100-AVERAGEIF(Y105:Y116,\">0\"))/100","v":0},{"$f":"100-(Y99+Z99+AB99)","v":0.31658903224206369},{"$f":"IF((X101+AB101)>100,AB101*100/(X101+AB101),AB101)","v":0}]
[null,null,{"$f":"MaxTarget(C105:C116)","v":2020},{"$f":"IF((D102+H102)>100,D102*100/(D102+H102),D102)","v":98.908884953189869},{"$f":"D100*AVERAGEIF(E105:E116,\">0\")/100","v":98.721921330931679},{"$f":"D100*(100-AVERAGEIF(E105:E116,\">0\"))/100","v":0.18696362225819091},{"$f":"100-(E100+F100+H100)","v":1.0911150468101312},{"$f":"IF((D102+H102)>100,H102*100/(D102+H102),H102)","v":0},{"$f":"IF((I102+M102)>100,I102*100/(I102+M102),I102)","v":99.771513036553699},{"$f":"I100*AVERAGEIF(J105:J116,\">0\")/100","v":99.656136449812863},{"$f":"I100*(100-AVERAGEIF(J105:J116,\">0\"))/100","v":0.11537658674085058},{"$f":"100-(J100+K100+M100)","v":0.2284869634462865},{"$f":"IF((I102+M102)>100,M102*100/(I102+M102),M102)","v":0},{"$f":"IF((N102+R102)>100,N102*100/(N102+R102),N102)","v":100},{"$f":"N100*AVERAGEIF(O105:O116,\">0\")/100","v":100},{"$f":"N100*(100-AVERAGEIF(O105:O116,\">0\"))/100","v":0},{"$f":"100-(O100+P100+R100)","v":0},{"$f":"IF((N102+R102)>100,R102*100/(N102+R102),R102)","v":0},{"$f":"IF((S102+W102)>100,S102*100/(S102+W102),S102)","v":99.960745309792756},{"$f":"S100*AVERAGEIF(T105:T116,\">0\")/100","v":99.901434631485756},{"$f":"S100*(100-AVERAGEIF(T105:T116,\">0\"))/100","v":5.9310678306994317E-2},{"$f":"100-(T100+U100+W100)","v":3.9254690207243925E-2},{"$f":"IF((S102+W102)>100,W102*100/(S102+W102),W102)","v":0},{"$f":"IF((X102+AB102)>100,X102*100/(X102+AB102),X102)","v":99.683410967757936},{"$f":"X100*AVERAGEIF(Y105:Y116,\">0\")/100","v":99.683410967757936},{"$f":"X100*(100-AVERAGEIF(Y105:Y116,\">0\"))/100","v":0},{"$f":"100-(Y100+Z100+AB100)","v":0.31658903224206369},{"$f":"IF((X102+AB102)>100,AB102*100/(X102+AB102),AB102)","v":0}]
["Regression period:",null,{"$f":"MinRegYear(C99,C105:C116)","v":2015},{"$f":"IF(MAX(C105:C116)-MIN(C105:C116)<5,AVERAGEIF(C105:C116,\">0\",D105:D116),\nIF(FORECAST($C101,D$105:D$116,$C$105:$C$116)<0,0,\nIF(FORECAST($C101,D$105:D$116,$C$105:$C$116)>100,100,\nFORECAST($C101,D$105:D$116,$C$105:$C$116))))","v":98.908884953189869},null,null,null,{"$f":"IF(MAX(C105:C116)-MIN(C105:C116)<5,AVERAGEIF(C105:C116,\">0\",H105:H116),\nIF(FORECAST($C101,H$105:H$116,$C$105:$C$116)<0,0,\nIF(FORECAST($C101,H$105:H$116,$C$105:$C$116)>100,100,\nFORECAST($C101,H$105:H$116,$C$105:$C$116))))","v":0},{"$f":"IF(MAX(C105:C116)-MIN(C105:C116)<5,AVERAGEIF(C105:C116,\">0\",I105:I116),\nIF(FORECAST($C101,I$105:I$116,$C$105:$C$116)<0,0,\nIF(FORECAST($C101,I$105:I$116,$C$105:$C$116)>100,100,\nFORECAST($C101,I$105:I$116,$C$105:$C$116))))","v":99.771513036553699},null,null,null,{"$f":"IF(MAX(C105:C116)-MIN(C105:C116)<5,AVERAGEIF(C105:C116,\">0\",M105:M116),\nIF(FORECAST($C101,M$105:M$116,$C$105:$C$116)<0,0,\nIF(FORECAST($C101,M$105:M$116,$C$105:$C$116)>100,100,\nFORECAST($C101,M$105:M$116,$C$105:$C$116))))","v":0},{"$f":"IF(MAX(C105:C116)-MIN(C105:C116)<5,AVERAGEIF(C105:C116,\">0\",N105:N116),\nIF(FORECAST($C101,N$105:N$116,$C$105:$C$116)<0,0,\nIF(FORECAST($C101,N$105:N$116,$C$105:$C$116)>100,100,\nFORECAST($C101,N$105:N$116,$C$105:$C$116))))","v":100},null,null,null,{"$f":"IF(MAX(C105:C116)-MIN(C105:C116)<5,AVERAGEIF(C105:C116,\">0\",R105:R116),\nIF(FORECAST($C101,R$105:R$116,$C$105:$C$116)<0,0,\nIF(FORECAST($C101,R$105:R$116,$C$105:$C$116)>100,100,\nFORECAST($C101,R$105:R$116,$C$105:$C$116))))","v":0},{"$f":"IF(MAX(C105:C116)-MIN(C105:C116)<5,AVERAGEIF(C105:C116,\">0\",S105:S116),\nIF(FORECAST($C101,S$105:S$116,$C$105:$C$116)<0,0,\nIF(FORECAST($C101,S$105:S$116,$C$105:$C$116)>100,100,\nFORECAST($C101,S$105:S$116,$C$105:$C$116))))","v":99.960745309792756},null,null,null,{"$f":"IF(MAX(C105:C116)-MIN(C105:C116)<5,AVERAGEIF(C105:C116,\">0\",W105:W116),\nIF(FORECAST($C101,W$105:W$116,$C$105:$C$116)<0,0,\nIF(FORECAST($C101,W$105:W$116,$C$105:$C$116)>100,100,\nFORECAST($C101,W$105:W$116,$C$105:$C$116))))","v":0},{"$f":"IF(MAX(C105:C116)-MIN(C105:C116)<5,AVERAGEIF(C105:C116,\">0\",X105:X116),\nIF(FORECAST($C101,X$105:X$116,$C$105:$C$116)<0,0,\nIF(FORECAST($C101,X$105:X$116,$C$105:$C$116)>100,100,\nFORECAST($C101,X$105:X$116,$C$105:$C$116))))","v":99.683410967757936},null,null,null,{"$f":"IF(MAX(C105:C116)-MIN(C105:C116)<5,AVERAGEIF(C105:C116,\">0\",AB105:AB116),\nIF(FORECAST($C101,AB$105:AB$116,$C$105:$C$116)<0,0,\nIF(FORECAST($C101,AB$105:AB$116,$C$105:$C$116)>100,100,\nFORECAST($C101,AB$105:AB$116,$C$105:$C$116))))","v":0}]
[null,null,{"$f":"MaxRegYear(C100,C105:C116)","v":2019},{"$f":"IF(MAX(C105:C116)-MIN(C105:C116)<5,AVERAGEIF(C105:C116,\">0\",D105:D116),\nIF(FORECAST($C102,D$105:D$116,$C$105:$C$116)<0,0,\nIF(FORECAST($C102,D$105:D$116,$C$105:$C$116)>100,100,\nFORECAST($C102,D$105:D$116,$C$105:$C$116))))","v":98.908884953189869},null,null,null,{"$f":"IF(MAX(C105:C116)-MIN(C105:C116)<5,AVERAGEIF(C105:C116,\">0\",H105:H116),\nIF(FORECAST($C102,H$105:H$116,$C$105:$C$116)<0,0,\nIF(FORECAST($C102,H$105:H$116,$C$105:$C$116)>100,100,\nFORECAST($C102,H$105:H$116,$C$105:$C$116))))","v":0},{"$f":"IF(MAX(C105:C116)-MIN(C105:C116)<5,AVERAGEIF(C105:C116,\">0\",I105:I116),\nIF(FORECAST($C102,I$105:I$116,$C$105:$C$116)<0,0,\nIF(FORECAST($C102,I$105:I$116,$C$105:$C$116)>100,100,\nFORECAST($C102,I$105:I$116,$C$105:$C$116))))","v":99.771513036553699},null,null,null,{"$f":"IF(MAX(C105:C116)-MIN(C105:C116)<5,AVERAGEIF(C105:C116,\">0\",M105:M116),\nIF(FORECAST($C102,M$105:M$116,$C$105:$C$116)<0,0,\nIF(FORECAST($C102,M$105:M$116,$C$105:$C$116)>100,100,\nFORECAST($C102,M$105:M$116,$C$105:$C$116))))","v":0},{"$f":"IF(MAX(C105:C116)-MIN(C105:C116)<5,AVERAGEIF(C105:C116,\">0\",N105:N116),\nIF(FORECAST($C102,N$105:N$116,$C$105:$C$116)<0,0,\nIF(FORECAST($C102,N$105:N$116,$C$105:$C$116)>100,100,\nFORECAST($C102,N$105:N$116,$C$105:$C$116))))","v":100},null,null,null,{"$f":"IF(MAX(C105:C116)-MIN(C105:C116)<5,AVERAGEIF(C105:C116,\">0\",R105:R116),\nIF(FORECAST($C102,R$105:R$116,$C$105:$C$116)<0,0,\nIF(FORECAST($C102,R$105:R$116,$C$105:$C$116)>100,100,\nFORECAST($C102,R$105:R$116,$C$105:$C$116))))","v":0},{"$f":"IF(MAX(C105:C116)-MIN(C105:C116)<5,AVERAGEIF(C105:C116,\">0\",S105:S116),\nIF(FORECAST($C102,S$105:S$116,$C$105:$C$116)<0,0,\nIF(FORECAST($C102,S$105:S$116,$C$105:$C$116)>100,100,\nFORECAST($C102,S$105:S$116,$C$105:$C$116))))","v":99.960745309792756},null,null,null,{"$f":"IF(MAX(C105:C116)-MIN(C105:C116)<5,AVERAGEIF(C105:C116,\">0\",W105:W116),\nIF(FORECAST($C102,W$105:W$116,$C$105:$C$116)<0,0,\nIF(FORECAST($C102,W$105:W$116,$C$105:$C$116)>100,100,\nFORECAST($C102,W$105:W$116,$C$105:$C$116))))","v":0},{"$f":"IF(MAX(C105:C116)-MIN(C105:C116)<5,AVERAGEIF(C105:C116,\">0\",X105:X116),\nIF(FORECAST($C102,X$105:X$116,$C$105:$C$116)<0,0,\nIF(FORECAST($C102,X$105:X$116,$C$105:$C$116)>100,100,\nFORECAST($C102,X$105:X$116,$C$105:$C$116))))","v":99.683410967757936},null,null,null,{"$f":"IF(MAX(C105:C116)-MIN(C105:C116)<5,AVERAGEIF(C105:C116,\">0\",AB105:AB116),\nIF(FORECAST($C102,AB$105:AB$116,$C$105:$C$116)<0,0,\nIF(FORECAST($C102,AB$105:AB$116,$C$105:$C$116)>100,100,\nFORECAST($C102,AB$105:AB$116,$C$105:$C$116))))","v":0}]
[]
[null,"Survey","Year","Improved","% Improved\n< = 30min",null,null,"Surface water","Improved","% Improved\n< = 30min",null,null,"Surface water","Improved","% Improved\n< = 30min",null,null,"Surface water","Improved","% Improved\n< = 30min",null,null,"Surface water","Improved","% Improved\n< = 30min",null,null,"Surface water"]
[null,"DHS17",2017,{"$f":"IF(ISERROR(INDIRECT(CONCATENATE($B105,\"!C16\"))),\"\",INDIRECT(CONCATENATE($B105,\"!C16\")))","v":98.908884953189869},{"$f":"IF(ISERROR(INDIRECT(CONCATENATE($B105,\"!C23\"))),\"\",INDIRECT(CONCATENATE($B105,\"!C23\")))","v":99.8109738853626},null,null,{"$f":"IF(ISERROR(INDIRECT(CONCATENATE($B105,\"!C21\"))),\"\",INDIRECT(CONCATENATE($B105,\"!C21\")))","v":0},{"$f":"IF(ISERROR(INDIRECT(CONCATENATE($B105,\"!D16\"))),\"\",INDIRECT(CONCATENATE($B105,\"!D16\")))","v":99.771513036553699},{"$f":"IF(ISERROR(INDIRECT(CONCATENATE($B105,\"!D23\"))),\"\",INDIRECT(CONCATENATE($B105,\"!D23\")))","v":99.884359189081778},null,null,{"$f":"IF(ISERROR(INDIRECT(CONCATENATE($B105,\"!D21\"))),\"\",INDIRECT(CONCATENATE($B105,\"!D21\")))","v":0},{"$f":"IF(ISERROR(INDIRECT(CONCATENATE($B105,\"!E16\"))),\"\",INDIRECT(CONCATENATE($B105,\"!E16\")))","v":100},{"$f":"IF(ISERROR(INDIRECT(CONCATENATE($B105,\"!E23\"))),\"\",INDIRECT(CONCATENATE($B105,\"!E23\")))","v":100},null,null,{"$f":"IF(ISERROR(INDIRECT(CONCATENATE($B105,\"!E21\"))),\"\",INDIRECT(CONCATENATE($B105,\"!E21\")))","v":0},{"$f":"IF(ISERROR(INDIRECT(CONCATENATE($B105,\"!F16\"))),\"\",INDIRECT(CONCATENATE($B105,\"!F16\")))","v":99.960745309792756},{"$f":"IF(ISERROR(INDIRECT(CONCATENATE($B105,\"!F23\"))),\"\",INDIRECT(CONCATENATE($B105,\"!F23\")))","v":99.940666030327023},null,null,{"$f":"IF(ISERROR(INDIRECT(CONCATENATE($B105,\"!F21\"))),\"\",INDIRECT(CONCATENATE($B105,\"!F21\")))","v":0},{"$f":"IF(ISERROR(INDIRECT(CONCATENATE($B105,\"!G16\"))),\"\",INDIRECT(CONCATENATE($B105,\"!G16\")))","v":99.683410967757936},{"$f":"IF(ISERROR(INDIRECT(CONCATENATE($B105,\"!G23\"))),\"\",INDIRECT(CONCATENATE($B105,\"!G23\")))","v":100},null,null,{"$f":"IF(ISERROR(INDIRECT(CONCATENATE($B105,\"!G221\"))),\"\",INDIRECT(CONCATENATE($B105,\"!G21\")))","v":0}]
[null,null,null,"","",null,null,"","","",null,null,"","","",null,null,"","","",null,null,"","","",null,null,""]
[null,null,null,"","",null,null,"","","",null,null,"","","",null,null,"","","",null,null,"","","",null,null,""]
[null,null,null,"","",null,null,"","","",null,null,"","","",null,null,"","","",null,null,"","","",null,null,""]
[null,null,null,"","",null,null,"","","",null,null,"","","",null,null,"","","",null,null,"","","",null,null,""]
[null,null,null,"","",null,null,"","","",null,null,"","","",null,null,"","","",null,null,"","","",null,null,""]
[null,null,null,{"$f":"IF(ISERROR(INDIRECT(CONCATENATE($B111,\"!C16\"))),\"\",INDIRECT(CONCATENATE($B111,\"!C16\")))","v":""},{"$f":"IF(ISERROR(INDIRECT(CONCATENATE($B111,\"!C23\"))),\"\",INDIRECT(CONCATENATE($B111,\"!C23\")))","v":""},null,null,{"$f":"IF(ISERROR(INDIRECT(CONCATENATE($B111,\"!C21\"))),\"\",INDIRECT(CONCATENATE($B111,\"!C21\")))","v":""},{"$f":"IF(ISERROR(INDIRECT(CONCATENATE($B111,\"!D16\"))),\"\",INDIRECT(CONCATENATE($B111,\"!D16\")))","v":""},{"$f":"IF(ISERROR(INDIRECT(CONCATENATE($B111,\"!D23\"))),\"\",INDIRECT(CONCATENATE($B111,\"!D23\")))","v":""},null,null,{"$f":"IF(ISERROR(INDIRECT(CONCATENATE($B111,\"!D21\"))),\"\",INDIRECT(CONCATENATE($B111,\"!D21\")))","v":""},{"$f":"IF(ISERROR(INDIRECT(CONCATENATE($B111,\"!E16\"))),\"\",INDIRECT(CONCATENATE($B111,\"!E16\")))","v":""},{"$f":"IF(ISERROR(INDIRECT(CONCATENATE($B111,\"!E23\"))),\"\",INDIRECT(CONCATENATE($B111,\"!E23\")))","v":""},null,null,{"$f":"IF(ISERROR(INDIRECT(CONCATENATE($B111,\"!E21\"))),\"\",INDIRECT(CONCATENATE($B111,\"!E21\")))","v":""},{"$f":"IF(ISERROR(INDIRECT(CONCATENATE($B111,\"!F16\"))),\"\",INDIRECT(CONCATENATE($B111,\"!F16\")))","v":""},{"$f":"IF(ISERROR(INDIRECT(CONCATENATE($B111,\"!F23\"))),\"\",INDIRECT(CONCATENATE($B111,\"!F23\")))","v":""},null,null,{"$f":"IF(ISERROR(INDIRECT(CONCATENATE($B111,\"!F21\"))),\"\",INDIRECT(CONCATENATE($B111,\"!F21\")))","v":""},{"$f":"IF(ISERROR(INDIRECT(CONCATENATE($B111,\"!G16\"))),\"\",INDIRECT(CONCATENATE($B111,\"!G16\")))","v":""},{"$f":"IF(ISERROR(INDIRECT(CONCATENATE($B111,\"!G23\"))),\"\",INDIRECT(CONCATENATE($B111,\"!G23\")))","v":""},null,null,{"$f":"IF(ISERROR(INDIRECT(CONCATENATE($B111,\"!G221\"))),\"\",INDIRECT(CONCATENATE($B111,\"!G21\")))","v":""}]
[null,null,null,{"$f":"IF(ISERROR(INDIRECT(CONCATENATE($B112,\"!C16\"))),\"\",INDIRECT(CONCATENATE($B112,\"!C16\")))","v":""},{"$f":"IF(ISERROR(INDIRECT(CONCATENATE($B112,\"!C23\"))),\"\",INDIRECT(CONCATENATE($B112,\"!C23\")))","v":""},null,null,{"$f":"IF(ISERROR(INDIRECT(CONCATENATE($B112,\"!C21\"))),\"\",INDIRECT(CONCATENATE($B112,\"!C21\")))","v":""},{"$f":"IF(ISERROR(INDIRECT(CONCATENATE($B112,\"!D16\"))),\"\",INDIRECT(CONCATENATE($B112,\"!D16\")))","v":""},{"$f":"IF(ISERROR(INDIRECT(CONCATENATE($B112,\"!D23\"))),\"\",INDIRECT(CONCATENATE($B112,\"!D23\")))","v":""},null,null,{"$f":"IF(ISERROR(INDIRECT(CONCATENATE($B112,\"!D21\"))),\"\",INDIRECT(CONCATENATE($B112,\"!D21\")))","v":""},{"$f":"IF(ISERROR(INDIRECT(CONCATENATE($B112,\"!E16\"))),\"\",INDIRECT(CONCATENATE($B112,\"!E16\")))","v":""},{"$f":"IF(ISERROR(INDIRECT(CONCATENATE($B112,\"!E23\"))),\"\",INDIRECT(CONCATENATE($B112,\"!E23\")))","v":""},null,null,{"$f":"IF(ISERROR(INDIRECT(CONCATENATE($B112,\"!E21\"))),\"\",INDIRECT(CONCATENATE($B112,\"!E21\")))","v":""},{"$f":"IF(ISERROR(INDIRECT(CONCATENATE($B112,\"!F16\"))),\"\",INDIRECT(CONCATENATE($B112,\"!F16\")))","v":""},{"$f":"IF(ISERROR(INDIRECT(CONCATENATE($B112,\"!F23\"))),\"\",INDIRECT(CONCATENATE($B112,\"!F23\")))","v":""},null,null,{"$f":"IF(ISERROR(INDIRECT(CONCATENATE($B112,\"!F21\"))),\"\",INDIRECT(CONCATENATE($B112,\"!F21\")))","v":""},{"$f":"IF(ISERROR(INDIRECT(CONCATENATE($B112,\"!G16\"))),\"\",INDIRECT(CONCATENATE($B112,\"!G16\")))","v":""},{"$f":"IF(ISERROR(INDIRECT(CONCATENATE($B112,\"!G23\"))),\"\",INDIRECT(CONCATENATE($B112,\"!G23\")))","v":""},null,null,{"$f":"IF(ISERROR(INDIRECT(CONCATENATE($B112,\"!G221\"))),\"\",INDIRECT(CONCATENATE($B112,\"!G21\")))","v":""}]
[null,null,null,"","",null,null,"","","",null,null,"","","",null,null,"","","",null,null,"","","",null,null,""]
[null,null,null,"","",null,null,"","","",null,null,"","","",null,null,"","","",null,null,"","","",null,null,""]
[null,null,null,"","",null,null,"","","",null,null,"","","",null,null,"","","",null,null,"","","",null,null,""]
[null,null,null,"","",null,null,"","","",null,null,"","","",null,null,"","","",null,null,"","","",null,null,""]
[]
[null,{"$f":"CONCATENATE(\"National use of drinking water sources, \",C99,\"–\",C100)","v":"National use of drinking water sources, 2013–2020"},null,null,null,null,null,null,null,null,null,null,null,null,null,null,null,null,"Data points used for regression"]
[]
[]
[]
[]
[]
[]
[]
[]
[]
[]
[]
[]
[]
[]
[]
[]
[]
[]
[]
[]
[]
[]
[]
[]
[]
[]
[]
[]
[]
[]
[]
[]
[]
[]
[null,null,null,null,{"$f":"IF(ISERROR(INDIRECT(CONCATENATE($B153,\"!M18\"))),\"\",INDIRECT(CONCATENATE($B153,\"!M18\")))","v":""},{"$f":"IF(ISERROR(INDIRECT(CONCATENATE($B153,\"!M19\"))),\"\",INDIRECT(CONCATENATE($B153,\"!M19\")))","v":""},{"$f":"IF(ISERROR(INDIRECT(CONCATENATE($B153,\"!M20\"))),\"\",INDIRECT(CONCATENATE($B153,\"!M20\")))","v":""},{"$f":"IF(ISERROR(INDIRECT(CONCATENATE($B153,\"!M21\"))),\"\",INDIRECT(CONCATENATE($B153,\"!M21\")))","v":""},null,{"$f":"IF(ISERROR(INDIRECT(CONCATENATE($B153,\"!N18\"))),\"\",INDIRECT(CONCATENATE($B153,\"!N18\")))","v":""},{"$f":"IF(ISERROR(INDIRECT(CONCATENATE($B153,\"!N19\"))),\"\",INDIRECT(CONCATENATE($B153,\"!N19\")))","v":""},{"$f":"IF(ISERROR(INDIRECT(CONCATENATE($B153,\"!N20\"))),\"\",INDIRECT(CONCATENATE($B153,\"!N20\")))","v":""},{"$f":"IF(ISERROR(INDIRECT(CONCATENATE($B153,\"!N21\"))),\"\",INDIRECT(CONCATENATE($B153,\"!N21\")))","v":""},null,{"$f":"IF(ISERROR(INDIRECT(CONCATENATE($B153,\"!O18\"))),\"\",INDIRECT(CONCATENATE($B153,\"!O18\")))","v":""},{"$f":"IF(ISERROR(INDIRECT(CONCATENATE($B153,\"!O19\"))),\"\",INDIRECT(CONCATENATE($B153,\"!O19\")))","v":""},{"$f":"IF(ISERROR(INDIRECT(CONCATENATE($B153,\"!O20\"))),\"\",INDIRECT(CONCATENATE($B153,\"!O20\")))","v":""},{"$f":"IF(ISERROR(INDIRECT(CONCATENATE($B153,\"!O21\"))),\"\",INDIRECT(CONCATENATE($B153,\"!O21\")))","v":""},null,{"$f":"IF(ISERROR(INDIRECT(CONCATENATE($B153,\"!P18\"))),\"\",INDIRECT(CONCATENATE($B153,\"!P18\")))","v":""},{"$f":"IF(ISERROR(INDIRECT(CONCATENATE($B153,\"!P19\"))),\"\",INDIRECT(CONCATENATE($B153,\"!P19\")))","v":""},{"$f":"IF(ISERROR(INDIRECT(CONCATENATE($B153,\"!P20\"))),\"\",INDIRECT(CONCATENATE($B153,\"!P20\")))","v":""},{"$f":"IF(ISERROR(INDIRECT(CONCATENATE($B153,\"!P21\"))),\"\",INDIRECT(CONCATENATE($B153,\"!P21\")))","v":""},null,{"$f":"IF(ISERROR(INDIRECT(CONCATENATE($B153,\"!Q18\"))),\"\",INDIRECT(CONCATENATE($B153,\"!Q18\")))","v":""},{"$f":"IF(ISERROR(INDIRECT(CONCATENATE($B153,\"!Q19\"))),\"\",INDIRECT(CONCATENATE($B153,\"!Q19\")))","v":""},{"$f":"IF(ISERROR(INDIRECT(CONCATENATE($B153,\"!Q20\"))),\"\",INDIRECT(CONCATENATE($B153,\"!Q20\")))","v":""},{"$f":"IF(ISERROR(INDIRECT(CONCATENATE($B153,\"!Q21\"))),\"\",INDIRECT(CONCATENATE($B153,\"!Q1\")))","v":""}]
[null,null,null,null,"","","","",null,"","","","",null,"","","","",null,"","","","",null,"","","",""]
[null,null,null,null,"","","","",null,"","","","",null,"","","","",null,"","","","",null,"","","",""]
[null,null,null,null,"","","","",null,"","","","",null,"","","","",null,"","","","",null,"","","",""]
[null,null,null,null,"","","","",null,"","","","",null,"","","","",null,"","","","",null,"","","",""]
[null,null,null,null,"","","","",null,"","","","",null,"","","","",null,"","","","",null,"","","",""]
[]
[]
[]
[]
[]
[]
[]
[]
[]
[]
[]
[]
[]
[]
[]
[]
[]
[]
[]
[]
[]
[]
[]
[]
[]
[]
[]
[]
[]
[]
[]
[]
[]
[]
[]
[]
[]
[]
["URBAN",null,null,"Poorest",null,null,null,null,"Poor",null,null,null,null,"Middle",null,null,null,null,"Rich",null,null,null,null,"Richest"]
[null,null,null,"Improved","Basic","Limited","Unimproved","Surface water","Improved","Basic","Limited","Unimproved","Surface water","Improved","Basic","Limited","Unimproved","Surface water","Improved","Basic","Limited","Unimproved","Surface water","Improved","Basic","Limited","Unimproved","Surface water"]
["Forecast period:",null,{"$f":"MinBase(C205:C216)","v":2013},{"$f":"IF((D201+H201)>100,D201*100/(D201+H201),D201)","v":98.732733107546508},{"$f":"D199*AVERAGEIF(E205:E216,\">0\")/100","v":98.732733107546494},{"$f":"D199*(100-AVERAGEIF(E205:E216,\">0\"))/100","v":0},{"$f":"100-(E199+F199+H199)","v":1.267266892453506},{"$f":"IF((D201+H201)>100,H201*100/(D201+H201),H201)","v":0},{"$f":"IF((I201+M201)>100,I201*100/(I201+M201),I201)","v":100},{"$f":"I199*AVERAGEIF(J205:J216,\">0\")/100","v":100},{"$f":"I199*(100-AVERAGEIF(J205:J216,\">0\"))/100","v":0},{"$f":"100-(J199+K199+M199)","v":0},{"$f":"IF((I201+M201)>100,M201*100/(I201+M201),M201)","v":0},{"$f":"IF((N201+R201)>100,N201*100/(N201+R201),N201)","v":100},{"$f":"N199*AVERAGEIF(O205:O216,\">0\")/100","v":100},{"$f":"N199*(100-AVERAGEIF(O205:O216,\">0\"))/100","v":0},{"$f":"100-(O199+P199+R199)","v":0},{"$f":"IF((N201+R201)>100,R201*100/(N201+R201),R201)","v":0},{"$f":"IF((S201+W201)>100,S201*100/(S201+W201),S201)","v":100},{"$f":"S199*AVERAGEIF(T205:T216,\">0\")/100","v":100},{"$f":"S199*(100-AVERAGEIF(T205:T216,\">0\"))/100","v":0},{"$f":"100-(T199+U199+W199)","v":0},{"$f":"IF((S201+W201)>100,W201*100/(S201+W201),W201)","v":0},{"$f":"IF((X201+AB201)>100,X201*100/(X201+AB201),X201)","v":99.231692998078984},{"$f":"X199*AVERAGEIF(Y205:Y216,\">0\")/100","v":99.231692998078984},{"$f":"X199*(100-AVERAGEIF(Y205:Y216,\">0\"))/100","v":0},{"$f":"100-(Y199+Z199+AB199)","v":0.76830700192101631},{"$f":"IF((X201+AB201)>100,AB201*100/(X201+AB201),AB201)","v":0}]
[null,null,{"$f":"MaxTarget(C205:C216)","v":2020},{"$f":"IF((D202+H202)>100,D202*100/(D202+H202),D202)","v":98.732733107546508},{"$f":"D200*AVERAGEIF(E205:E216,\">0\")/100","v":98.732733107546494},{"$f":"D200*(100-AVERAGEIF(E205:E216,\">0\"))/100","v":0},{"$f":"100-(E200+F200+H200)","v":1.267266892453506},{"$f":"IF((D202+H202)>100,H202*100/(D202+H202),H202)","v":0},{"$f":"IF((I202+M202)>100,I202*100/(I202+M202),I202)","v":100},{"$f":"I200*AVERAGEIF(J205:J216,\">0\")/100","v":100},{"$f":"I200*(100-AVERAGEIF(J205:J216,\">0\"))/100","v":0},{"$f":"100-(J200+K200+M200)","v":0},{"$f":"IF((I202+M202)>100,M202*100/(I202+M202),M202)","v":0},{"$f":"IF((N202+R202)>100,N202*100/(N202+R202),N202)","v":100},{"$f":"N200*AVERAGEIF(O205:O216,\">0\")/100","v":100},{"$f":"N200*(100-AVERAGEIF(O205:O216,\">0\"))/100","v":0},{"$f":"100-(O200+P200+R200)","v":0},{"$f":"IF((N202+R202)>100,R202*100/(N202+R202),R202)","v":0},{"$f":"IF((S202+W202)>100,S202*100/(S202+W202),S202)","v":100},{"$f":"S200*AVERAGEIF(T205:T216,\">0\")/100","v":100},{"$f":"S200*(100-AVERAGEIF(T205:T216,\">0\"))/100","v":0},{"$f":"100-(T200+U200+W200)","v":0},{"$f":"IF((S202+W202)>100,W202*100/(S202+W202),W202)","v":0},{"$f":"IF((X202+AB202)>100,X202*100/(X202+AB202),X202)","v":99.231692998078984},{"$f":"X200*AVERAGEIF(Y205:Y216,\">0\")/100","v":99.231692998078984},{"$f":"X200*(100-AVERAGEIF(Y205:Y216,\">0\"))/100","v":0},{"$f":"100-(Y200+Z200+AB200)","v":0.76830700192101631},{"$f":"IF((X202+AB202)>100,AB202*100/(X202+AB202),AB202)","v":0}]
["Regression period:",null,{"$f":"MinRegYear(C199,C205:C216)","v":2015},{"$f":"IF(MAX(C205:C216)-MIN(C205:C216)<5,AVERAGEIF(C205:C216,\">0\",D205:D216),\nIF(FORECAST($C201,D$205:D$216,$C$205:$C$216)<0,0,\nIF(FORECAST($C201,D$205:D$216,$C$205:$C$216)>100,100,\nFORECAST($C201,D$205:D$216,$C$205:$C$216))))","v":98.732733107546508},null,null,null,{"$f":"IF(MAX(C205:C216)-MIN(C205:C216)<5,AVERAGEIF(C205:C216,\">0\",H205:H216),\nIF(FORECAST($C201,H$205:H$216,$C$205:$C$216)<0,0,\nIF(FORECAST($C201,H$205:H$216,$C$205:$C$216)>100,100,\nFORECAST($C201,H$205:H$216,$C$205:$C$216))))","v":0},{"$f":"IF(MAX(C205:C216)-MIN(C205:C216)<5,AVERAGEIF(C205:C216,\">0\",I205:I216),\nIF(FORECAST($C201,I$205:I$216,$C$205:$C$216)<0,0,\nIF(FORECAST($C201,I$205:I$216,$C$205:$C$216)>100,100,\nFORECAST($C201,I$205:I$216,$C$205:$C$216))))","v":100},null,null,null,{"$f":"IF(MAX(C205:C216)-MIN(C205:C216)<5,AVERAGEIF(C205:C216,\">0\",M205:M216),\nIF(FORECAST($C201,M$205:M$216,$C$205:$C$216)<0,0,\nIF(FORECAST($C201,M$205:M$216,$C$205:$C$216)>100,100,\nFORECAST($C201,M$205:M$216,$C$205:$C$216))))","v":0},{"$f":"IF(MAX(C205:C216)-MIN(C205:C216)<5,AVERAGEIF(C205:C216,\">0\",N205:N216),\nIF(FORECAST($C201,N$205:N$216,$C$205:$C$216)<0,0,\nIF(FORECAST($C201,N$205:N$216,$C$205:$C$216)>100,100,\nFORECAST($C201,N$205:N$216,$C$205:$C$216))))","v":100},null,null,null,{"$f":"IF(MAX(C205:C216)-MIN(C205:C216)<5,AVERAGEIF(C205:C216,\">0\",R205:R216),\nIF(FORECAST($C201,R$205:R$216,$C$205:$C$216)<0,0,\nIF(FORECAST($C201,R$205:R$216,$C$205:$C$216)>100,100,\nFORECAST($C201,R$205:R$216,$C$205:$C$216))))","v":0},{"$f":"IF(MAX(C205:C216)-MIN(C205:C216)<5,AVERAGEIF(C205:C216,\">0\",S205:S216),\nIF(FORECAST($C201,S$205:S$216,$C$205:$C$216)<0,0,\nIF(FORECAST($C201,S$205:S$216,$C$205:$C$216)>100,100,\nFORECAST($C201,S$205:S$216,$C$205:$C$216))))","v":100},null,null,null,{"$f":"IF(MAX(C205:C216)-MIN(C205:C216)<5,AVERAGEIF(C205:C216,\">0\",W205:W216),\nIF(FORECAST($C201,W$205:W$216,$C$205:$C$216)<0,0,\nIF(FORECAST($C201,W$205:W$216,$C$205:$C$216)>100,100,\nFORECAST($C201,W$205:W$216,$C$205:$C$216))))","v":0},{"$f":"IF(MAX(C205:C216)-MIN(C205:C216)<5,AVERAGEIF(C205:C216,\">0\",X205:X216),\nIF(FORECAST($C201,X$205:X$216,$C$205:$C$216)<0,0,\nIF(FORECAST($C201,X$205:X$216,$C$205:$C$216)>100,100,\nFORECAST($C201,X$205:X$216,$C$205:$C$216))))","v":99.231692998078984},null,null,null,{"$f":"IF(MAX(C205:C216)-MIN(C205:C216)<5,AVERAGEIF(C205:C216,\">0\",AB205:AB216),\nIF(FORECAST($C201,AB$205:AB$216,$C$205:$C$216)<0,0,\nIF(FORECAST($C201,AB$205:AB$216,$C$205:$C$216)>100,100,\nFORECAST($C201,AB$205:AB$216,$C$205:$C$216))))","v":0}]
[null,null,{"$f":"MaxRegYear(C200,C205:C216)","v":2019},{"$f":"IF(MAX(C205:C216)-MIN(C205:C216)<5,AVERAGEIF(C205:C216,\">0\",D205:D216),\nIF(FORECAST($C202,D$205:D$216,$C$205:$C$216)<0,0,\nIF(FORECAST($C202,D$205:D$216,$C$205:$C$216)>100,100,\nFORECAST($C202,D$205:D$216,$C$205:$C$216))))","v":98.732733107546508},null,null,null,{"$f":"IF(MAX(C205:C216)-MIN(C205:C216)<5,AVERAGEIF(C205:C216,\">0\",H205:H216),\nIF(FORECAST($C202,H$205:H$216,$C$205:$C$216)<0,0,\nIF(FORECAST($C202,H$205:H$216,$C$205:$C$216)>100,100,\nFORECAST($C202,H$205:H$216,$C$205:$C$216))))","v":0},{"$f":"IF(MAX(C205:C216)-MIN(C205:C216)<5,AVERAGEIF(C205:C216,\">0\",I205:I216),\nIF(FORECAST($C202,I$205:I$216,$C$205:$C$216)<0,0,\nIF(FORECAST($C202,I$205:I$216,$C$205:$C$216)>100,100,\nFORECAST($C202,I$205:I$216,$C$205:$C$216))))","v":100},null,null,null,{"$f":"IF(MAX(C205:C216)-MIN(C205:C216)<5,AVERAGEIF(C205:C216,\">0\",M205:M216),\nIF(FORECAST($C202,M$205:M$216,$C$205:$C$216)<0,0,\nIF(FORECAST($C202,M$205:M$216,$C$205:$C$216)>100,100,\nFORECAST($C202,M$205:M$216,$C$205:$C$216))))","v":0},{"$f":"IF(MAX(C205:C216)-MIN(C205:C216)<5,AVERAGEIF(C205:C216,\">0\",N205:N216),\nIF(FORECAST($C202,N$205:N$216,$C$205:$C$216)<0,0,\nIF(FORECAST($C202,N$205:N$216,$C$205:$C$216)>100,100,\nFORECAST($C202,N$205:N$216,$C$205:$C$216))))","v":100},null,null,null,{"$f":"IF(MAX(C205:C216)-MIN(C205:C216)<5,AVERAGEIF(C205:C216,\">0\",R205:R216),\nIF(FORECAST($C202,R$205:R$216,$C$205:$C$216)<0,0,\nIF(FORECAST($C202,R$205:R$216,$C$205:$C$216)>100,100,\nFORECAST($C202,R$205:R$216,$C$205:$C$216))))","v":0},{"$f":"IF(MAX(C205:C216)-MIN(C205:C216)<5,AVERAGEIF(C205:C216,\">0\",S205:S216),\nIF(FORECAST($C202,S$205:S$216,$C$205:$C$216)<0,0,\nIF(FORECAST($C202,S$205:S$216,$C$205:$C$216)>100,100,\nFORECAST($C202,S$205:S$216,$C$205:$C$216))))","v":100},null,null,null,{"$f":"IF(MAX(C205:C216)-MIN(C205:C216)<5,AVERAGEIF(C205:C216,\">0\",W205:W216),\nIF(FORECAST($C202,W$205:W$216,$C$205:$C$216)<0,0,\nIF(FORECAST($C202,W$205:W$216,$C$205:$C$216)>100,100,\nFORECAST($C202,W$205:W$216,$C$205:$C$216))))","v":0},{"$f":"IF(MAX(C205:C216)-MIN(C205:C216)<5,AVERAGEIF(C205:C216,\">0\",X205:X216),\nIF(FORECAST($C202,X$205:X$216,$C$205:$C$216)<0,0,\nIF(FORECAST($C202,X$205:X$216,$C$205:$C$216)>100,100,\nFORECAST($C202,X$205:X$216,$C$205:$C$216))))","v":99.231692998078984},null,null,null,{"$f":"IF(MAX(C205:C216)-MIN(C205:C216)<5,AVERAGEIF(C205:C216,\">0\",AB205:AB216),\nIF(FORECAST($C202,AB$205:AB$216,$C$205:$C$216)<0,0,\nIF(FORECAST($C202,AB$205:AB$216,$C$205:$C$216)>100,100,\nFORECAST($C202,AB$205:AB$216,$C$205:$C$216))))","v":0}]
[]
[null,"Survey","Year","Improved","% Improved\n< = 30min",null,null,"Surface water","Improved","% Improved\n< = 30min",null,null,"Surface water","Improved","% Improved\n< = 30min",null,null,"Surface water","Improved","% Improved\n< = 30min",null,null,"Surface water","Improved","% Improved\n< = 30min",null,null,"Surface water"]
[null,"DHS17",2017,{"$f":"IF(ISERROR(INDIRECT(CONCATENATE($B205,\"!H16\"))),\"\",INDIRECT(CONCATENATE($B205,\"!H16\")))","v":98.732733107546508},{"$f":"IF(ISERROR(INDIRECT(CONCATENATE($B205,\"!H23\"))),\"\",INDIRECT(CONCATENATE($B205,\"!H23\")))","v":100},null,null,{"$f":"IF(ISERROR(INDIRECT(CONCATENATE($B205,\"!H21\"))),\"\",INDIRECT(CONCATENATE($B205,\"!H21\")))","v":0},{"$f":"IF(ISERROR(INDIRECT(CONCATENATE($B205,\"!I16\"))),\"\",INDIRECT(CONCATENATE($B205,\"!I16\")))","v":100},{"$f":"IF(ISERROR(INDIRECT(CONCATENATE($B205,\"!I23\"))),\"\",INDIRECT(CONCATENATE($B205,\"!I23\")))","v":100},null,null,{"$f":"IF(ISERROR(INDIRECT(CONCATENATE($B205,\"!I21\"))),\"\",INDIRECT(CONCATENATE($B205,\"!I21\")))","v":0},{"$f":"IF(ISERROR(INDIRECT(CONCATENATE($B205,\"!J16\"))),\"\",INDIRECT(CONCATENATE($B205,\"!J16\")))","v":100},{"$f":"IF(ISERROR(INDIRECT(CONCATENATE($B205,\"!J23\"))),\"\",INDIRECT(CONCATENATE($B205,\"!J23\")))","v":100},null,null,{"$f":"IF(ISERROR(INDIRECT(CONCATENATE($B205,\"!J21\"))),\"\",INDIRECT(CONCATENATE($B205,\"!J21\")))","v":0},{"$f":"IF(ISERROR(INDIRECT(CONCATENATE($B205,\"!K16\"))),\"\",INDIRECT(CONCATENATE($B205,\"!K16\")))","v":100},{"$f":"IF(ISERROR(INDIRECT(CONCATENATE($B205,\"!K23\"))),\"\",INDIRECT(CONCATENATE($B205,\"!K23\")))","v":100},null,null,{"$f":"IF(ISERROR(INDIRECT(CONCATENATE($B205,\"!K21\"))),\"\",INDIRECT(CONCATENATE($B205,\"!K21\")))","v":0},{"$f":"IF(ISERROR(INDIRECT(CONCATENATE($B205,\"!L16\"))),\"\",INDIRECT(CONCATENATE($B205,\"!L16\")))","v":99.231692998078984},{"$f":"IF(ISERROR(INDIRECT(CONCATENATE($B205,\"!L23\"))),\"\",INDIRECT(CONCATENATE($B205,\"!L23\")))","v":100},null,null,{"$f":"IF(ISERROR(INDIRECT(CONCATENATE($B205,\"!L221\"))),\"\",INDIRECT(CONCATENATE($B205,\"!L21\")))","v":0}]
[null,null,null,"","",null,null,"","","",null,null,"","","",null,null,"","","",null,null,"","","",null,null,""]
[null,null,null,"","",null,null,"","","",null,null,"","","",null,null,"","","",null,null,"","","",null,null,""]
[null,null,null,"","",null,null,"","","",null,null,"","","",null,null,"","","",null,null,"","","",null,null,""]
[null,null,null,"","",null,null,"","","",null,null,"","","",null,null,"","","",null,null,"","","",null,null,""]
[null,null,null,"","",null,null,"","","",null,null,"","","",null,null,"","","",null,null,"","","",null,null,""]
[null,null,null,"","",null,null,"","","",null,null,"","","",null,null,"","","",null,null,"","","",null,null,""]
[null,null,null,"","",null,null,"","","",null,null,"","","",null,null,"","","",null,null,"","","",null,null,""]
[null,null,null,"","",null,null,"","","",null,null,"","","",null,null,"","","",null,null,"","","",null,null,""]
[null,null,null,"","",null,null,"","","",null,null,"","","",null,null,"","","",null,null,"","","",null,null,""]
[null,null,null,"","",null,null,"","","",null,null,"","","",null,null,"","","",null,null,"","","",null,null,""]
[null,null,null,"","",null,null,"","","",null,null,"","","",null,null,"","","",null,null,"","","",null,null,""]
[]
[null,{"$f":"CONCATENATE(\"Urban use of drinking water sources,  \",C199,\"–\",C200)","v":"Urban use of drinking water sources,  2013–2020"},null,null,null,null,null,null,null,null,null,null,null,null,null,null,null,null,"Data points used for regression"]
[]
[]
[]
[]
[]
[]
[]
[]
[]
[]
[]
[]
[]
[]
[]
[]
[]
[]
[]
[]
[]
[]
[]
[]
[]
[]
[]
[]
[]
[]
[]
[]
[]
[]
[null,null,null,null,{"$f":"IF(ISERROR(INDIRECT(CONCATENATE($B253,\"!M18\"))),\"\",INDIRECT(CONCATENATE($B253,\"!M18\")))","v":""},{"$f":"IF(ISERROR(INDIRECT(CONCATENATE($B253,\"!M19\"))),\"\",INDIRECT(CONCATENATE($B253,\"!M19\")))","v":""},{"$f":"IF(ISERROR(INDIRECT(CONCATENATE($B253,\"!M20\"))),\"\",INDIRECT(CONCATENATE($B253,\"!M20\")))","v":""},{"$f":"IF(ISERROR(INDIRECT(CONCATENATE($B253,\"!M21\"))),\"\",INDIRECT(CONCATENATE($B253,\"!M21\")))","v":""},null,{"$f":"IF(ISERROR(INDIRECT(CONCATENATE($B253,\"!N18\"))),\"\",INDIRECT(CONCATENATE($B253,\"!N18\")))","v":""},{"$f":"IF(ISERROR(INDIRECT(CONCATENATE($B253,\"!N19\"))),\"\",INDIRECT(CONCATENATE($B253,\"!N19\")))","v":""},{"$f":"IF(ISERROR(INDIRECT(CONCATENATE($B253,\"!N20\"))),\"\",INDIRECT(CONCATENATE($B253,\"!N20\")))","v":""},{"$f":"IF(ISERROR(INDIRECT(CONCATENATE($B253,\"!N21\"))),\"\",INDIRECT(CONCATENATE($B253,\"!N21\")))","v":""},null,{"$f":"IF(ISERROR(INDIRECT(CONCATENATE($B253,\"!O18\"))),\"\",INDIRECT(CONCATENATE($B253,\"!O18\")))","v":""},{"$f":"IF(ISERROR(INDIRECT(CONCATENATE($B253,\"!O19\"))),\"\",INDIRECT(CONCATENATE($B253,\"!O19\")))","v":""},{"$f":"IF(ISERROR(INDIRECT(CONCATENATE($B253,\"!O20\"))),\"\",INDIRECT(CONCATENATE($B253,\"!O20\")))","v":""},{"$f":"IF(ISERROR(INDIRECT(CONCATENATE($B253,\"!O21\"))),\"\",INDIRECT(CONCATENATE($B253,\"!O21\")))","v":""},null,{"$f":"IF(ISERROR(INDIRECT(CONCATENATE($B253,\"!P18\"))),\"\",INDIRECT(CONCATENATE($B253,\"!P18\")))","v":""},{"$f":"IF(ISERROR(INDIRECT(CONCATENATE($B253,\"!P19\"))),\"\",INDIRECT(CONCATENATE($B253,\"!P19\")))","v":""},{"$f":"IF(ISERROR(INDIRECT(CONCATENATE($B253,\"!P20\"))),\"\",INDIRECT(CONCATENATE($B253,\"!P20\")))","v":""},{"$f":"IF(ISERROR(INDIRECT(CONCATENATE($B253,\"!P21\"))),\"\",INDIRECT(CONCATENATE($B253,\"!P21\")))","v":""},null,{"$f":"IF(ISERROR(INDIRECT(CONCATENATE($B253,\"!Q18\"))),\"\",INDIRECT(CONCATENATE($B253,\"!Q18\")))","v":""},{"$f":"IF(ISERROR(INDIRECT(CONCATENATE($B253,\"!Q19\"))),\"\",INDIRECT(CONCATENATE($B253,\"!Q19\")))","v":""},{"$f":"IF(ISERROR(INDIRECT(CONCATENATE($B253,\"!Q20\"))),\"\",INDIRECT(CONCATENATE($B253,\"!Q20\")))","v":""},{"$f":"IF(ISERROR(INDIRECT(CONCATENATE($B253,\"!Q21\"))),\"\",INDIRECT(CONCATENATE($B253,\"!Q1\")))","v":""}]
[null,null,null,null,{"$f":"IF(ISERROR(INDIRECT(CONCATENATE($B254,\"!M18\"))),\"\",INDIRECT(CONCATENATE($B254,\"!M18\")))","v":""},{"$f":"IF(ISERROR(INDIRECT(CONCATENATE($B254,\"!M19\"))),\"\",INDIRECT(CONCATENATE($B254,\"!M19\")))","v":""},{"$f":"IF(ISERROR(INDIRECT(CONCATENATE($B254,\"!M20\"))),\"\",INDIRECT(CONCATENATE($B254,\"!M20\")))","v":""},{"$f":"IF(ISERROR(INDIRECT(CONCATENATE($B254,\"!M21\"))),\"\",INDIRECT(CONCATENATE($B254,\"!M21\")))","v":""},null,{"$f":"IF(ISERROR(INDIRECT(CONCATENATE($B254,\"!N18\"))),\"\",INDIRECT(CONCATENATE($B254,\"!N18\")))","v":""},{"$f":"IF(ISERROR(INDIRECT(CONCATENATE($B254,\"!N19\"))),\"\",INDIRECT(CONCATENATE($B254,\"!N19\")))","v":""},{"$f":"IF(ISERROR(INDIRECT(CONCATENATE($B254,\"!N20\"))),\"\",INDIRECT(CONCATENATE($B254,\"!N20\")))","v":""},{"$f":"IF(ISERROR(INDIRECT(CONCATENATE($B254,\"!N21\"))),\"\",INDIRECT(CONCATENATE($B254,\"!N21\")))","v":""},null,{"$f":"IF(ISERROR(INDIRECT(CONCATENATE($B254,\"!O18\"))),\"\",INDIRECT(CONCATENATE($B254,\"!O18\")))","v":""},{"$f":"IF(ISERROR(INDIRECT(CONCATENATE($B254,\"!O19\"))),\"\",INDIRECT(CONCATENATE($B254,\"!O19\")))","v":""},{"$f":"IF(ISERROR(INDIRECT(CONCATENATE($B254,\"!O20\"))),\"\",INDIRECT(CONCATENATE($B254,\"!O20\")))","v":""},{"$f":"IF(ISERROR(INDIRECT(CONCATENATE($B254,\"!O21\"))),\"\",INDIRECT(CONCATENATE($B254,\"!O21\")))","v":""},null,{"$f":"IF(ISERROR(INDIRECT(CONCATENATE($B254,\"!P18\"))),\"\",INDIRECT(CONCATENATE($B254,\"!P18\")))","v":""},{"$f":"IF(ISERROR(INDIRECT(CONCATENATE($B254,\"!P19\"))),\"\",INDIRECT(CONCATENATE($B254,\"!P19\")))","v":""},{"$f":"IF(ISERROR(INDIRECT(CONCATENATE($B254,\"!P20\"))),\"\",INDIRECT(CONCATENATE($B254,\"!P20\")))","v":""},{"$f":"IF(ISERROR(INDIRECT(CONCATENATE($B254,\"!P21\"))),\"\",INDIRECT(CONCATENATE($B254,\"!P21\")))","v":""},null,{"$f":"IF(ISERROR(INDIRECT(CONCATENATE($B254,\"!Q18\"))),\"\",INDIRECT(CONCATENATE($B254,\"!Q18\")))","v":""},{"$f":"IF(ISERROR(INDIRECT(CONCATENATE($B254,\"!Q19\"))),\"\",INDIRECT(CONCATENATE($B254,\"!Q19\")))","v":""},{"$f":"IF(ISERROR(INDIRECT(CONCATENATE($B254,\"!Q20\"))),\"\",INDIRECT(CONCATENATE($B254,\"!Q20\")))","v":""},{"$f":"IF(ISERROR(INDIRECT(CONCATENATE($B254,\"!Q21\"))),\"\",INDIRECT(CONCATENATE($B254,\"!Q1\")))","v":""}]
[null,null,null,null,{"$f":"IF(ISERROR(INDIRECT(CONCATENATE($B255,\"!M18\"))),\"\",INDIRECT(CONCATENATE($B255,\"!M18\")))","v":""},{"$f":"IF(ISERROR(INDIRECT(CONCATENATE($B255,\"!M19\"))),\"\",INDIRECT(CONCATENATE($B255,\"!M19\")))","v":""},{"$f":"IF(ISERROR(INDIRECT(CONCATENATE($B255,\"!M20\"))),\"\",INDIRECT(CONCATENATE($B255,\"!M20\")))","v":""},{"$f":"IF(ISERROR(INDIRECT(CONCATENATE($B255,\"!M21\"))),\"\",INDIRECT(CONCATENATE($B255,\"!M21\")))","v":""},null,{"$f":"IF(ISERROR(INDIRECT(CONCATENATE($B255,\"!N18\"))),\"\",INDIRECT(CONCATENATE($B255,\"!N18\")))","v":""},{"$f":"IF(ISERROR(INDIRECT(CONCATENATE($B255,\"!N19\"))),\"\",INDIRECT(CONCATENATE($B255,\"!N19\")))","v":""},{"$f":"IF(ISERROR(INDIRECT(CONCATENATE($B255,\"!N20\"))),\"\",INDIRECT(CONCATENATE($B255,\"!N20\")))","v":""},{"$f":"IF(ISERROR(INDIRECT(CONCATENATE($B255,\"!N21\"))),\"\",INDIRECT(CONCATENATE($B255,\"!N21\")))","v":""},null,{"$f":"IF(ISERROR(INDIRECT(CONCATENATE($B255,\"!O18\"))),\"\",INDIRECT(CONCATENATE($B255,\"!O18\")))","v":""},{"$f":"IF(ISERROR(INDIRECT(CONCATENATE($B255,\"!O19\"))),\"\",INDIRECT(CONCATENATE($B255,\"!O19\")))","v":""},{"$f":"IF(ISERROR(INDIRECT(CONCATENATE($B255,\"!O20\"))),\"\",INDIRECT(CONCATENATE($B255,\"!O20\")))","v":""},{"$f":"IF(ISERROR(INDIRECT(CONCATENATE($B255,\"!O21\"))),\"\",INDIRECT(CONCATENATE($B255,\"!O21\")))","v":""},null,{"$f":"IF(ISERROR(INDIRECT(CONCATENATE($B255,\"!P18\"))),\"\",INDIRECT(CONCATENATE($B255,\"!P18\")))","v":""},{"$f":"IF(ISERROR(INDIRECT(CONCATENATE($B255,\"!P19\"))),\"\",INDIRECT(CONCATENATE($B255,\"!P19\")))","v":""},{"$f":"IF(ISERROR(INDIRECT(CONCATENATE($B255,\"!P20\"))),\"\",INDIRECT(CONCATENATE($B255,\"!P20\")))","v":""},{"$f":"IF(ISERROR(INDIRECT(CONCATENATE($B255,\"!P21\"))),\"\",INDIRECT(CONCATENATE($B255,\"!P21\")))","v":""},null,{"$f":"IF(ISERROR(INDIRECT(CONCATENATE($B255,\"!Q18\"))),\"\",INDIRECT(CONCATENATE($B255,\"!Q18\")))","v":""},{"$f":"IF(ISERROR(INDIRECT(CONCATENATE($B255,\"!Q19\"))),\"\",INDIRECT(CONCATENATE($B255,\"!Q19\")))","v":""},{"$f":"IF(ISERROR(INDIRECT(CONCATENATE($B255,\"!Q20\"))),\"\",INDIRECT(CONCATENATE($B255,\"!Q20\")))","v":""},{"$f":"IF(ISERROR(INDIRECT(CONCATENATE($B255,\"!Q21\"))),\"\",INDIRECT(CONCATENATE($B255,\"!Q1\")))","v":""}]
[null,null,null,null,{"$f":"IF(ISERROR(INDIRECT(CONCATENATE($B256,\"!M18\"))),\"\",INDIRECT(CONCATENATE($B256,\"!M18\")))","v":""},{"$f":"IF(ISERROR(INDIRECT(CONCATENATE($B256,\"!M19\"))),\"\",INDIRECT(CONCATENATE($B256,\"!M19\")))","v":""},{"$f":"IF(ISERROR(INDIRECT(CONCATENATE($B256,\"!M20\"))),\"\",INDIRECT(CONCATENATE($B256,\"!M20\")))","v":""},{"$f":"IF(ISERROR(INDIRECT(CONCATENATE($B256,\"!M21\"))),\"\",INDIRECT(CONCATENATE($B256,\"!M21\")))","v":""},null,{"$f":"IF(ISERROR(INDIRECT(CONCATENATE($B256,\"!N18\"))),\"\",INDIRECT(CONCATENATE($B256,\"!N18\")))","v":""},{"$f":"IF(ISERROR(INDIRECT(CONCATENATE($B256,\"!N19\"))),\"\",INDIRECT(CONCATENATE($B256,\"!N19\")))","v":""},{"$f":"IF(ISERROR(INDIRECT(CONCATENATE($B256,\"!N20\"))),\"\",INDIRECT(CONCATENATE($B256,\"!N20\")))","v":""},{"$f":"IF(ISERROR(INDIRECT(CONCATENATE($B256,\"!N21\"))),\"\",INDIRECT(CONCATENATE($B256,\"!N21\")))","v":""},null,{"$f":"IF(ISERROR(INDIRECT(CONCATENATE($B256,\"!O18\"))),\"\",INDIRECT(CONCATENATE($B256,\"!O18\")))","v":""},{"$f":"IF(ISERROR(INDIRECT(CONCATENATE($B256,\"!O19\"))),\"\",INDIRECT(CONCATENATE($B256,\"!O19\")))","v":""},{"$f":"IF(ISERROR(INDIRECT(CONCATENATE($B256,\"!O20\"))),\"\",INDIRECT(CONCATENATE($B256,\"!O20\")))","v":""},{"$f":"IF(ISERROR(INDIRECT(CONCATENATE($B256,\"!O21\"))),\"\",INDIRECT(CONCATENATE($B256,\"!O21\")))","v":""},null,{"$f":"IF(ISERROR(INDIRECT(CONCATENATE($B256,\"!P18\"))),\"\",INDIRECT(CONCATENATE($B256,\"!P18\")))","v":""},{"$f":"IF(ISERROR(INDIRECT(CONCATENATE($B256,\"!P19\"))),\"\",INDIRECT(CONCATENATE($B256,\"!P19\")))","v":""},{"$f":"IF(ISERROR(INDIRECT(CONCATENATE($B256,\"!P20\"))),\"\",INDIRECT(CONCATENATE($B256,\"!P20\")))","v":""},{"$f":"IF(ISERROR(INDIRECT(CONCATENATE($B256,\"!P21\"))),\"\",INDIRECT(CONCATENATE($B256,\"!P21\")))","v":""},null,{"$f":"IF(ISERROR(INDIRECT(CONCATENATE($B256,\"!Q18\"))),\"\",INDIRECT(CONCATENATE($B256,\"!Q18\")))","v":""},{"$f":"IF(ISERROR(INDIRECT(CONCATENATE($B256,\"!Q19\"))),\"\",INDIRECT(CONCATENATE($B256,\"!Q19\")))","v":""},{"$f":"IF(ISERROR(INDIRECT(CONCATENATE($B256,\"!Q20\"))),\"\",INDIRECT(CONCATENATE($B256,\"!Q20\")))","v":""},{"$f":"IF(ISERROR(INDIRECT(CONCATENATE($B256,\"!Q21\"))),\"\",INDIRECT(CONCATENATE($B256,\"!Q1\")))","v":""}]
[null,null,null,null,{"$f":"IF(ISERROR(INDIRECT(CONCATENATE($B257,\"!M18\"))),\"\",INDIRECT(CONCATENATE($B257,\"!M18\")))","v":""},{"$f":"IF(ISERROR(INDIRECT(CONCATENATE($B257,\"!M19\"))),\"\",INDIRECT(CONCATENATE($B257,\"!M19\")))","v":""},{"$f":"IF(ISERROR(INDIRECT(CONCATENATE($B257,\"!M20\"))),\"\",INDIRECT(CONCATENATE($B257,\"!M20\")))","v":""},{"$f":"IF(ISERROR(INDIRECT(CONCATENATE($B257,\"!M21\"))),\"\",INDIRECT(CONCATENATE($B257,\"!M21\")))","v":""},null,{"$f":"IF(ISERROR(INDIRECT(CONCATENATE($B257,\"!N18\"))),\"\",INDIRECT(CONCATENATE($B257,\"!N18\")))","v":""},{"$f":"IF(ISERROR(INDIRECT(CONCATENATE($B257,\"!N19\"))),\"\",INDIRECT(CONCATENATE($B257,\"!N19\")))","v":""},{"$f":"IF(ISERROR(INDIRECT(CONCATENATE($B257,\"!N20\"))),\"\",INDIRECT(CONCATENATE($B257,\"!N20\")))","v":""},{"$f":"IF(ISERROR(INDIRECT(CONCATENATE($B257,\"!N21\"))),\"\",INDIRECT(CONCATENATE($B257,\"!N21\")))","v":""},null,{"$f":"IF(ISERROR(INDIRECT(CONCATENATE($B257,\"!O18\"))),\"\",INDIRECT(CONCATENATE($B257,\"!O18\")))","v":""},{"$f":"IF(ISERROR(INDIRECT(CONCATENATE($B257,\"!O19\"))),\"\",INDIRECT(CONCATENATE($B257,\"!O19\")))","v":""},{"$f":"IF(ISERROR(INDIRECT(CONCATENATE($B257,\"!O20\"))),\"\",INDIRECT(CONCATENATE($B257,\"!O20\")))","v":""},{"$f":"IF(ISERROR(INDIRECT(CONCATENATE($B257,\"!O21\"))),\"\",INDIRECT(CONCATENATE($B257,\"!O21\")))","v":""},null,{"$f":"IF(ISERROR(INDIRECT(CONCATENATE($B257,\"!P18\"))),\"\",INDIRECT(CONCATENATE($B257,\"!P18\")))","v":""},{"$f":"IF(ISERROR(INDIRECT(CONCATENATE($B257,\"!P19\"))),\"\",INDIRECT(CONCATENATE($B257,\"!P19\")))","v":""},{"$f":"IF(ISERROR(INDIRECT(CONCATENATE($B257,\"!P20\"))),\"\",INDIRECT(CONCATENATE($B257,\"!P20\")))","v":""},{"$f":"IF(ISERROR(INDIRECT(CONCATENATE($B257,\"!P21\"))),\"\",INDIRECT(CONCATENATE($B257,\"!P21\")))","v":""},null,{"$f":"IF(ISERROR(INDIRECT(CONCATENATE($B257,\"!Q18\"))),\"\",INDIRECT(CONCATENATE($B257,\"!Q18\")))","v":""},{"$f":"IF(ISERROR(INDIRECT(CONCATENATE($B257,\"!Q19\"))),\"\",INDIRECT(CONCATENATE($B257,\"!Q19\")))","v":""},{"$f":"IF(ISERROR(INDIRECT(CONCATENATE($B257,\"!Q20\"))),\"\",INDIRECT(CONCATENATE($B257,\"!Q20\")))","v":""},{"$f":"IF(ISERROR(INDIRECT(CONCATENATE($B257,\"!Q21\"))),\"\",INDIRECT(CONCATENATE($B257,\"!Q1\")))","v":""}]
[]
[]
[]
[]
[]
[]
[]
[]
[]
[]
[]
[]
[]
[]
[]
[]
[]
[]
[]
[]
[]
[]
[]
[]
[]
[]
[]
[]
[]
[]
[]
[]
[]
[]
[]
[]
[]
[]
[]
["RURAL",null,null,"Poorest",null,null,null,null,"Poor",null,null,null,null,"Middle",null,null,null,null,"Rich",null,null,null,null,"Richest"]
[null,null,null,"Improved","Basic","Limited","Unimproved","Surface water","Improved","Basic","Limited","Unimproved","Surface water","Improved","Basic","Limited","Unimproved","Surface water","Improved","Basic","Limited","Unimproved","Surface water","Improved","Basic","Limited","Unimproved","Surface water"]
["Forecast period:",null,2013,{"$f":"IF((D301+H301)>100,D301*100/(D301+H301),D301)","v":99.326521111582451},{"$f":"D299*AVERAGEIF(E305:E316,\">0\")/100","v":99.008028562295465},{"$f":"D299*(100-AVERAGEIF(E305:E316,\">0\"))/100","v":0.31849254928699006},{"$f":"100-(E299+F299+H299)","v":0.67347888841754866},{"$f":"IF((D301+H301)>100,H301*100/(D301+H301),H301)","v":0},{"$f":"IF((I301+M301)>100,I301*100/(I301+M301),I301)","v":99.706985546339624},{"$f":"I299*AVERAGEIF(J305:J316,\">0\")/100","v":99.555314660106717},{"$f":"I299*(100-AVERAGEIF(J305:J316,\">0\"))/100","v":0.15167088623290703},{"$f":"100-(J299+K299+M299)","v":0.29301445366037626},{"$f":"IF((I301+M301)>100,M301*100/(I301+M301),M301)","v":0},{"$f":"IF((N301+R301)>100,N301*100/(N301+R301),N301)","v":99.610401103095455},{"$f":"N299*AVERAGEIF(O305:O316,\">0\")/100","v":99.565352930443055},{"$f":"N299*(100-AVERAGEIF(O305:O316,\">0\"))/100","v":4.5048172652394955E-2},{"$f":"100-(O299+P299+R299)","v":0.38959889690454474},{"$f":"IF((N301+R301)>100,R301*100/(N301+R301),R301)","v":0},{"$f":"IF((S301+W301)>100,S301*100/(S301+W301),S301)","v":100},{"$f":"S299*AVERAGEIF(T305:T316,\">0\")/100","v":99.898771197486752},{"$f":"S299*(100-AVERAGEIF(T305:T316,\">0\"))/100","v":0.10122880251324773},{"$f":"100-(T299+U299+W299)","v":0},{"$f":"IF((S301+W301)>100,W301*100/(S301+W301),W301)","v":0},{"$f":"IF((X301+AB301)>100,X301*100/(X301+AB301),X301)","v":99.933256490527938},{"$f":"X299*AVERAGEIF(Y305:Y316,\">0\")/100","v":99.933256490527953},{"$f":"X299*(100-AVERAGEIF(Y305:Y316,\">0\"))/100","v":0},{"$f":"100-(Y299+Z299+AB299)","v":6.6743509472047435E-2},{"$f":"IF((X301+AB301)>100,AB301*100/(X301+AB301),AB301)","v":0}]
[null,null,2020,{"$f":"IF((D302+H302)>100,D302*100/(D302+H302),D302)","v":99.326521111582451},{"$f":"D300*AVERAGEIF(E305:E316,\">0\")/100","v":99.008028562295465},{"$f":"D300*(100-AVERAGEIF(E305:E316,\">0\"))/100","v":0.31849254928699006},{"$f":"100-(E300+F300+H300)","v":0.67347888841754866},{"$f":"IF((D302+H302)>100,H302*100/(D302+H302),H302)","v":0},{"$f":"IF((I302+M302)>100,I302*100/(I302+M302),I302)","v":99.706985546339624},{"$f":"I300*AVERAGEIF(J305:J316,\">0\")/100","v":99.555314660106717},{"$f":"I300*(100-AVERAGEIF(J305:J316,\">0\"))/100","v":0.15167088623290703},{"$f":"100-(J300+K300+M300)","v":0.29301445366037626},{"$f":"IF((I302+M302)>100,M302*100/(I302+M302),M302)","v":0},{"$f":"IF((N302+R302)>100,N302*100/(N302+R302),N302)","v":99.610401103095455},{"$f":"N300*AVERAGEIF(O305:O316,\">0\")/100","v":99.565352930443055},{"$f":"N300*(100-AVERAGEIF(O305:O316,\">0\"))/100","v":4.5048172652394955E-2},{"$f":"100-(O300+P300+R300)","v":0.38959889690454474},{"$f":"IF((N302+R302)>100,R302*100/(N302+R302),R302)","v":0},{"$f":"IF((S302+W302)>100,S302*100/(S302+W302),S302)","v":100},{"$f":"S300*AVERAGEIF(T305:T316,\">0\")/100","v":99.898771197486752},{"$f":"S300*(100-AVERAGEIF(T305:T316,\">0\"))/100","v":0.10122880251324773},{"$f":"100-(T300+U300+W300)","v":0},{"$f":"IF((S302+W302)>100,W302*100/(S302+W302),W302)","v":0},{"$f":"IF((X302+AB302)>100,X302*100/(X302+AB302),X302)","v":99.933256490527938},{"$f":"X300*AVERAGEIF(Y305:Y316,\">0\")/100","v":99.933256490527953},{"$f":"X300*(100-AVERAGEIF(Y305:Y316,\">0\"))/100","v":0},{"$f":"100-(Y300+Z300+AB300)","v":6.6743509472047435E-2},{"$f":"IF((X302+AB302)>100,AB302*100/(X302+AB302),AB302)","v":0}]
["Regression period:",null,{"$f":"MinRegYear(C299,C305:C316)","v":2015},{"$f":"IF(MAX(C305:C316)-MIN(C305:C316)<5,AVERAGEIF(C305:C316,\">0\",D305:D316),\nIF(FORECAST($C301,D$305:D$316,$C$305:$C$316)<0,0,\nIF(FORECAST($C301,D$305:D$316,$C$305:$C$316)>100,100,\nFORECAST($C301,D$305:D$316,$C$305:$C$316))))","v":99.326521111582451},null,null,null,{"$f":"IF(MAX(C305:C316)-MIN(C305:C316)<5,AVERAGEIF(C305:C316,\">0\",H305:H316),\nIF(FORECAST($C301,H$305:H$316,$C$305:$C$316)<0,0,\nIF(FORECAST($C301,H$305:H$316,$C$305:$C$316)>100,100,\nFORECAST($C301,H$305:H$316,$C$305:$C$316))))","v":0},{"$f":"IF(MAX(C305:C316)-MIN(C305:C316)<5,AVERAGEIF(C305:C316,\">0\",I305:I316),\nIF(FORECAST($C301,I$305:I$316,$C$305:$C$316)<0,0,\nIF(FORECAST($C301,I$305:I$316,$C$305:$C$316)>100,100,\nFORECAST($C301,I$305:I$316,$C$305:$C$316))))","v":99.706985546339624},null,null,null,{"$f":"IF(MAX(C305:C316)-MIN(C305:C316)<5,AVERAGEIF(C305:C316,\">0\",M305:M316),\nIF(FORECAST($C301,M$305:M$316,$C$305:$C$316)<0,0,\nIF(FORECAST($C301,M$305:M$316,$C$305:$C$316)>100,100,\nFORECAST($C301,M$305:M$316,$C$305:$C$316))))","v":0},{"$f":"IF(MAX(C305:C316)-MIN(C305:C316)<5,AVERAGEIF(C305:C316,\">0\",N305:N316),\nIF(FORECAST($C301,N$305:N$316,$C$305:$C$316)<0,0,\nIF(FORECAST($C301,N$305:N$316,$C$305:$C$316)>100,100,\nFORECAST($C301,N$305:N$316,$C$305:$C$316))))","v":99.610401103095455},null,null,null,{"$f":"IF(MAX(C305:C316)-MIN(C305:C316)<5,AVERAGEIF(C305:C316,\">0\",R305:R316),\nIF(FORECAST($C301,R$305:R$316,$C$305:$C$316)<0,0,\nIF(FORECAST($C301,R$305:R$316,$C$305:$C$316)>100,100,\nFORECAST($C301,R$305:R$316,$C$305:$C$316))))","v":0},{"$f":"IF(MAX(C305:C316)-MIN(C305:C316)<5,AVERAGEIF(C305:C316,\">0\",S305:S316),\nIF(FORECAST($C301,S$305:S$316,$C$305:$C$316)<0,0,\nIF(FORECAST($C301,S$305:S$316,$C$305:$C$316)>100,100,\nFORECAST($C301,S$305:S$316,$C$305:$C$316))))","v":100},null,null,null,{"$f":"IF(MAX(C305:C316)-MIN(C305:C316)<5,AVERAGEIF(C305:C316,\">0\",W305:W316),\nIF(FORECAST($C301,W$305:W$316,$C$305:$C$316)<0,0,\nIF(FORECAST($C301,W$305:W$316,$C$305:$C$316)>100,100,\nFORECAST($C301,W$305:W$316,$C$305:$C$316))))","v":0},{"$f":"IF(MAX(C305:C316)-MIN(C305:C316)<5,AVERAGEIF(C305:C316,\">0\",X305:X316),\nIF(FORECAST($C301,X$305:X$316,$C$305:$C$316)<0,0,\nIF(FORECAST($C301,X$305:X$316,$C$305:$C$316)>100,100,\nFORECAST($C301,X$305:X$316,$C$305:$C$316))))","v":99.933256490527938},null,null,null,{"$f":"IF(MAX(C305:C316)-MIN(C305:C316)<5,AVERAGEIF(C305:C316,\">0\",AB305:AB316),\nIF(FORECAST($C301,AB$305:AB$316,$C$305:$C$316)<0,0,\nIF(FORECAST($C301,AB$305:AB$316,$C$305:$C$316)>100,100,\nFORECAST($C301,AB$305:AB$316,$C$305:$C$316))))","v":0}]
[null,null,{"$f":"MaxRegYear(C300,C305:C316)","v":2019},{"$f":"IF(MAX(C305:C316)-MIN(C305:C316)<5,AVERAGEIF(C305:C316,\">0\",D305:D316),\nIF(FORECAST($C302,D$305:D$316,$C$305:$C$316)<0,0,\nIF(FORECAST($C302,D$305:D$316,$C$305:$C$316)>100,100,\nFORECAST($C302,D$305:D$316,$C$305:$C$316))))","v":99.326521111582451},null,null,null,{"$f":"IF(MAX(C305:C316)-MIN(C305:C316)<5,AVERAGEIF(C305:C316,\">0\",H305:H316),\nIF(FORECAST($C302,H$305:H$316,$C$305:$C$316)<0,0,\nIF(FORECAST($C302,H$305:H$316,$C$305:$C$316)>100,100,\nFORECAST($C302,H$305:H$316,$C$305:$C$316))))","v":0},{"$f":"IF(MAX(C305:C316)-MIN(C305:C316)<5,AVERAGEIF(C305:C316,\">0\",I305:I316),\nIF(FORECAST($C302,I$305:I$316,$C$305:$C$316)<0,0,\nIF(FORECAST($C302,I$305:I$316,$C$305:$C$316)>100,100,\nFORECAST($C302,I$305:I$316,$C$305:$C$316))))","v":99.706985546339624},null,null,null,{"$f":"IF(MAX(C305:C316)-MIN(C305:C316)<5,AVERAGEIF(C305:C316,\">0\",M305:M316),\nIF(FORECAST($C302,M$305:M$316,$C$305:$C$316)<0,0,\nIF(FORECAST($C302,M$305:M$316,$C$305:$C$316)>100,100,\nFORECAST($C302,M$305:M$316,$C$305:$C$316))))","v":0},{"$f":"IF(MAX(C305:C316)-MIN(C305:C316)<5,AVERAGEIF(C305:C316,\">0\",N305:N316),\nIF(FORECAST($C302,N$305:N$316,$C$305:$C$316)<0,0,\nIF(FORECAST($C302,N$305:N$316,$C$305:$C$316)>100,100,\nFORECAST($C302,N$305:N$316,$C$305:$C$316))))","v":99.610401103095455},null,null,null,{"$f":"IF(MAX(C305:C316)-MIN(C305:C316)<5,AVERAGEIF(C305:C316,\">0\",R305:R316),\nIF(FORECAST($C302,R$305:R$316,$C$305:$C$316)<0,0,\nIF(FORECAST($C302,R$305:R$316,$C$305:$C$316)>100,100,\nFORECAST($C302,R$305:R$316,$C$305:$C$316))))","v":0},{"$f":"IF(MAX(C305:C316)-MIN(C305:C316)<5,AVERAGEIF(C305:C316,\">0\",S305:S316),\nIF(FORECAST($C302,S$305:S$316,$C$305:$C$316)<0,0,\nIF(FORECAST($C302,S$305:S$316,$C$305:$C$316)>100,100,\nFORECAST($C302,S$305:S$316,$C$305:$C$316))))","v":100},null,null,null,{"$f":"IF(MAX(C305:C316)-MIN(C305:C316)<5,AVERAGEIF(C305:C316,\">0\",W305:W316),\nIF(FORECAST($C302,W$305:W$316,$C$305:$C$316)<0,0,\nIF(FORECAST($C302,W$305:W$316,$C$305:$C$316)>100,100,\nFORECAST($C302,W$305:W$316,$C$305:$C$316))))","v":0},{"$f":"IF(MAX(C305:C316)-MIN(C305:C316)<5,AVERAGEIF(C305:C316,\">0\",X305:X316),\nIF(FORECAST($C302,X$305:X$316,$C$305:$C$316)<0,0,\nIF(FORECAST($C302,X$305:X$316,$C$305:$C$316)>100,100,\nFORECAST($C302,X$305:X$316,$C$305:$C$316))))","v":99.933256490527938},null,null,null,{"$f":"IF(MAX(C305:C316)-MIN(C305:C316)<5,AVERAGEIF(C305:C316,\">0\",AB305:AB316),\nIF(FORECAST($C302,AB$305:AB$316,$C$305:$C$316)<0,0,\nIF(FORECAST($C302,AB$305:AB$316,$C$305:$C$316)>100,100,\nFORECAST($C302,AB$305:AB$316,$C$305:$C$316))))","v":0}]
[]
[null,"Survey","Year","Improved","% Improved\n< = 30min",null,null,"Surface water","Improved","% Improved\n< = 30min",null,null,"Surface water","Improved","% Improved\n< = 30min",null,null,"Surface water","Improved","% Improved\n< = 30min",null,null,"Surface water","Improved","% Improved\n< = 30min",null,null,"Surface water"]
[null,"DHS17",2017,{"$f":"IF(ISERROR(INDIRECT(CONCATENATE($B305,\"!M16\"))),\"\",INDIRECT(CONCATENATE($B305,\"!M16\")))","v":99.326521111582451},{"$f":"IF(ISERROR(INDIRECT(CONCATENATE($B305,\"!M23\"))),\"\",INDIRECT(CONCATENATE($B305,\"!M23\")))","v":99.679347926694021},null,null,{"$f":"IF(ISERROR(INDIRECT(CONCATENATE($B305,\"!M21\"))),\"\",INDIRECT(CONCATENATE($B305,\"!M21\")))","v":0},{"$f":"IF(ISERROR(INDIRECT(CONCATENATE($B305,\"!N16\"))),\"\",INDIRECT(CONCATENATE($B305,\"!N16\")))","v":99.706985546339624},{"$f":"IF(ISERROR(INDIRECT(CONCATENATE($B305,\"!N23\"))),\"\",INDIRECT(CONCATENATE($B305,\"!N23\")))","v":99.847883390113708},null,null,{"$f":"IF(ISERROR(INDIRECT(CONCATENATE($B305,\"!N21\"))),\"\",INDIRECT(CONCATENATE($B305,\"!N21\")))","v":0},{"$f":"IF(ISERROR(INDIRECT(CONCATENATE($B305,\"!O16\"))),\"\",INDIRECT(CONCATENATE($B305,\"!O16\")))","v":99.610401103095455},{"$f":"IF(ISERROR(INDIRECT(CONCATENATE($B305,\"!O23\"))),\"\",INDIRECT(CONCATENATE($B305,\"!O23\")))","v":99.954775633715428},null,null,{"$f":"IF(ISERROR(INDIRECT(CONCATENATE($B305,\"!O21\"))),\"\",INDIRECT(CONCATENATE($B305,\"!O21\")))","v":0},{"$f":"IF(ISERROR(INDIRECT(CONCATENATE($B305,\"!P16\"))),\"\",INDIRECT(CONCATENATE($B305,\"!P16\")))","v":100},{"$f":"IF(ISERROR(INDIRECT(CONCATENATE($B305,\"!P23\"))),\"\",INDIRECT(CONCATENATE($B305,\"!P23\")))","v":99.898771197486752},null,null,{"$f":"IF(ISERROR(INDIRECT(CONCATENATE($B305,\"!P21\"))),\"\",INDIRECT(CONCATENATE($B305,\"!P21\")))","v":0},{"$f":"IF(ISERROR(INDIRECT(CONCATENATE($B305,\"!Q16\"))),\"\",INDIRECT(CONCATENATE($B305,\"!Q16\")))","v":99.933256490527938},{"$f":"IF(ISERROR(INDIRECT(CONCATENATE($B305,\"!Q23\"))),\"\",INDIRECT(CONCATENATE($B305,\"!Q23\")))","v":100},null,null,{"$f":"IF(ISERROR(INDIRECT(CONCATENATE($B305,\"!Q221\"))),\"\",INDIRECT(CONCATENATE($B305,\"!Q21\")))","v":0}]
[null,null,null,"","",null,null,"","","",null,null,"","","",null,null,"","","",null,null,"","","",null,null,""]
[null,null,null,"","",null,null,"","","",null,null,"","","",null,null,"","","",null,null,"","","",null,null,""]
[null,null,null,"","",null,null,"","","",null,null,"","","",null,null,"","","",null,null,"","","",null,null,""]
[null,null,null,"","",null,null,"","","",null,null,"","","",null,null,"","","",null,null,"","","",null,null,""]
[null,null,null,"","",null,null,"","","",null,null,"","","",null,null,"","","",null,null,"","","",null,null,""]
[null,null,null,"","",null,null,"","","",null,null,"","","",null,null,"","","",null,null,"","","",null,null,""]
[null,null,null,"","",null,null,"","","",null,null,"","","",null,null,"","","",null,null,"","","",null,null,""]
[null,null,null,"","",null,null,"","","",null,null,"","","",null,null,"","","",null,null,"","","",null,null,""]
[null,null,null,"","",null,null,"","","",null,null,"","","",null,null,"","","",null,null,"","","",null,null,""]
[null,null,null,"","",null,null,"","","",null,null,"","","",null,null,"","","",null,null,"","","",null,null,""]
[null,null,null,"","",null,null,"","","",null,null,"","","",null,null,"","","",null,null,"","","",null,null,""]
[]
[null,{"$f":"CONCATENATE(\"Rural use of drinking water sources, \",C299,\"–\",C300)","v":"Rural use of drinking water sources, 2013–2020"},null,null,null,null,null,null,null,null,null,null,null,null,null,null,null,null,"Data points used for regression"]

{"sheet":"Sanitation","index":2,"n_rows":318,"n_cols":28,"rows_kept":318,"cut":false,"hidden":false,"merged":[[30,21,30,24],[4,1,4,24],[3,1,3,24],[6,1,6,8],[6,9,6,16],[6,17,6,24],[30,1,31,4],[30,5,30,8],[30,9,30,12],[30,13,30,16],[30,17,30,20],[96,23,96,27],[32,1,33,2],[32,3,33,3],[35,1,36,2],[35,3,36,3],[38,1,39,2],[38,3,39,3],[96,0,97,2],[96,3,96,7],[96,8,96,12],[96,13,96,17],[96,18,96,22],[98,0,99,1],[100,0,101,1],[117,18,117,22],[196,0,197,2],[196,3,196,7],[196,8,196,12],[196,13,196,17],[196,18,196,22],[117,1,117,11],[298,0,299,1],[300,0,301,1],[317,18,317,22],[196,23,196,27],[198,0,199,1],[200,0,201,1],[217,18,217,22],[296,0,297,2],[296,3,296,7],[296,8,296,12],[296,13,296,17],[296,18,296,22],[296,23,296,27],[217,1,217,11],[317,1,317,11]]}
[]
[]
[]
[null,"Summary of trends in use of sanitation facilities by wealth quintile (%)"]
[null,{"$f":"IF(ISERROR(INDIRECT(CONCATENATE($B105,\"!A2\"))),\"\",INDIRECT(CONCATENATE($B105,\"!A2\")))","v":"Maldives"}]
[]
[null,{"$f":"B118","v":"National use of sanitation facilities, 2013–2020"},null,null,null,null,null,null,null,{"$f":"B218","v":"Urban use of sanitation facilities, 2013–2020"},null,null,null,null,null,null,null,{"$f":"B318","v":"Rural use of sanitation facilities, 2013–2020"}]
[]
[]
[]
[]
[]
[]
[]
[]
[]
[]
[]
[]
[]
[]
[]
[]
[]
[]
[]
[]
[]
[]
[]
[null,{"$f":"IF(ISERROR(INDIRECT(CONCATENATE($B105,\"!A2\"))),\"\",INDIRECT(CONCATENATE($B105,\"!A2\")))","v":"Maldives"},null,null,null,"Poorest",null,null,null,"Poor",null,null,null,"Middle",null,null,null,"Rich",null,null,null,"Richest"]
[null,null,null,null,null,"Basic","Limited","Unimproved","Open defecation","Basic","Limited","Unimproved","Open defecation","Basic","Limited","Unimproved","Open defecation","Basic","Limited","Unimproved","Open defecation","Basic","Limited","Unimproved","Open defecation"]
[null,"NATIONAL",null,"Estimate",{"$f":"C99","v":2013},{"$f":"E99","v":97.356520688816659},{"$f":"F99","v":0.98264296727540912},1.2268628528924239,0.4339734910155077,{"$f":"J99","v":98.191888488230035},{"$f":"K99","v":0.66313649069634661},1.1449750210736198,0,{"$f":"O99","v":98.651965844188766},{"$f":"P99","v":0.72669930810379813},0.62133484770743053,0,{"$f":"T99","v":99.041429269852216},{"$f":"U99","v":0.43933154418862275},0.51923918595916518,0,{"$f":"Y99","v":98.928749105396363},{"$f":"Z99","v":0.31087796115358413},0.76037293345005708,0]
[null,null,null,null,{"$f":"C100","v":2020},{"$f":"E100","v":97.356520688816659},0.98264296727540912,1.2268628528924239,0.4339734910155077,{"$f":"J100","v":98.191888488230035},0.66313649069634661,1.1449750210736198,0,{"$f":"O100","v":98.651965844188766},0.72669930810379813,0.62133484770743053,0,{"$f":"T100","v":99.041429269852216},0.43933154418862275,0.51923918595916518,0,{"$f":"Y100","v":98.928749105396363},0.31087796115358413,0.76037293345005708,0]
[]
[null,"URBAN",null,"Estimate",{"$f":"C199","v":2013},{"$f":"E199","v":98.306214184467606},{"$f":"F199","v":1.6937858155323937},0,0,{"$f":"J199","v":98.997810771076161},{"$f":"K199","v":1.0021892289238394},0,0,{"$f":"O199","v":100},{"$f":"P199","v":0},0,0,{"$f":"T199","v":99.009122743460154},{"$f":"U199","v":0},0.99087725653984648,0,{"$f":"Y199","v":99.421704365980162},{"$f":"Z199","v":0.57829563401983819},0,0]
[null,null,null,null,{"$f":"C200","v":2020},{"$f":"E200","v":98.306214184467606},1.6937858155323937,0,0,{"$f":"J200","v":98.997810771076161},1.0021892289238394,0,0,{"$f":"O200","v":100},0,0,0,{"$f":"T200","v":99.009122743460154},0,0.99087725653984648,0,{"$f":"Y200","v":99.421704365980162},0.57829563401983819,0,0]
[]
[null,"RURAL",null,"Estimate",{"$f":"C299","v":2013},{"$f":"E299","v":96.987688317647184},{"$f":"F299","v":0.56683962122821219},1.7061981756110782,0.73927388551352247,{"$f":"J299","v":97.7779849928652},{"$f":"K299","v":0.78960729513248074},1.4324077120023162,0,{"$f":"O299","v":97.978402491658812},{"$f":"P299","v":0.33061895848831596},1.690978549852872,0,{"$f":"T299","v":98.064892039267193},{"$f":"U299","v":1.0310238218281298},0.90408413890467898,0,{"$f":"Y299","v":98.860673186493216},{"$f":"Z299","v":0.29464085977548604},0.84468595373130029,0]
[null,null,null,null,{"$f":"C300","v":2020},{"$f":"E300","v":96.987688317647184},0.56683962122821219,1.7061981756110782,0.73927388551352247,{"$f":"J300","v":97.7779849928652},0.78960729513248074,1.4324077120023162,0,{"$f":"O300","v":97.978402491658812},0.33061895848831596,1.690978549852872,0,{"$f":"T300","v":98.064892039267193},1.0310238218281298,0.90408413890467898,0,{"$f":"Y300","v":98.860673186493216},0.29464085977548604,0.84468595373130029,0]
[]
[]
[]
[]
[]
[]
[]
[]
[]
[]
[]
[]
[]
[]
[]
[]
[]
[]
[]
[]
[]
[]
[]
[]
[]
[]
[]
[]
[]
[]
[]
[]
[]
[]
[]
[]
[]
[]
[]
[]
[]
[]
[]
[]
[]
[]
[]
[]
[]
[]
[]
[]
[]
[]
[]
[]
["NATIONAL",null,null,"Poorest",null,null,null,null,"Poor",null,null,null,null,"Middle",null,null,null,null,"Rich",null,null,null,null,"Richest"]
[null,null,null,"Improved","Basic","Limited","Unimproved","Open defecation","Improved","Basic","Limited","Unimproved","Open defecation","Improved","Basic","Limited","Unimproved","Open defecation","Improved","Basic","Limited","Unimproved","Open defecation","Improved","Basic","Limited","Unimproved","Open defecation"]
["Forecast period:",null,2013,{"$f":"IF((D101+H101)>100,D101*100/(D101+H101),D101)","v":98.339163656092069},{"$f":"D99*AVERAGEIF(E105:E116,\">0\")/100","v":97.356520688816659},{"$f":"D99*(100-AVERAGEIF(E105:E116,\">0\"))/100","v":0.98264296727540912},{"$f":"100-(E99+F99+H99)","v":1.2268628528924239},{"$f":"IF((D101+H101)>100,H101*100/(D101+H101),H101)","v":0.4339734910155077},{"$f":"IF((I101+M101)>100,I101*100/(I101+M101),I101)","v":98.85502497892638},{"$f":"I99*AVERAGEIF(J105:J116,\">0\")/100","v":98.191888488230035},{"$f":"I99*(100-AVERAGEIF(J105:J116,\">0\"))/100","v":0.66313649069634661},{"$f":"100-(J99+K99+M99)","v":1.1449750210736198},{"$f":"IF((I101+M101)>100,M101*100/(I101+M101),M101)","v":0},{"$f":"IF((N101+R101)>100,N101*100/(N101+R101),N101)","v":99.378665152292555},{"$f":"N99*AVERAGEIF(O105:O116,\">0\")/100","v":98.651965844188766},{"$f":"N99*(100-AVERAGEIF(O105:O116,\">0\"))/100","v":0.72669930810379813},{"$f":"100-(O99+P99+R99)","v":0.62133484770743053},{"$f":"IF((N101+R101)>100,R101*100/(N101+R101),R101)","v":0},{"$f":"IF((S101+W101)>100,S101*100/(S101+W101),S101)","v":99.480760814040835},{"$f":"S99*AVERAGEIF(T105:T116,\">0\")/100","v":99.041429269852216},{"$f":"S99*(100-AVERAGEIF(T105:T116,\">0\"))/100","v":0.43933154418862275},{"$f":"100-(T99+U99+W99)","v":0.51923918595916518},{"$f":"IF((S101+W101)>100,W101*100/(S101+W101),W101)","v":0},{"$f":"IF((X101+AB101)>100,X101*100/(X101+AB101),X101)","v":99.239627066549957},{"$f":"X99*AVERAGEIF(Y105:Y116,\">0\")/100","v":98.928749105396363},{"$f":"X99*(100-AVERAGEIF(Y105:Y116,\">0\"))/100","v":0.31087796115358413},{"$f":"100-(Y99+Z99+AB99)","v":0.76037293345005708},{"$f":"IF((X101+AB101)>100,AB101*100/(X101+AB101),AB101)","v":0}]
[null,null,2020,{"$f":"IF((D102+H102)>100,D102*100/(D102+H102),D102)","v":98.339163656092069},{"$f":"D100*AVERAGEIF(E105:E116,\">0\")/100","v":97.356520688816659},{"$f":"D100*(100-AVERAGEIF(E105:E116,\">0\"))/100","v":0.98264296727540912},{"$f":"100-(E100+F100+H100)","v":1.2268628528924239},{"$f":"IF((D102+H102)>100,H102*100/(D102+H102),H102)","v":0.4339734910155077},{"$f":"IF((I102+M102)>100,I102*100/(I102+M102),I102)","v":98.85502497892638},{"$f":"I100*AVERAGEIF(J105:J116,\">0\")/100","v":98.191888488230035},{"$f":"I100*(100-AVERAGEIF(J105:J116,\">0\"))/100","v":0.66313649069634661},{"$f":"100-(J100+K100+M100)","v":1.1449750210736198},{"$f":"IF((I102+M102)>100,M102*100/(I102+M102),M102)","v":0},{"$f":"IF((N102+R102)>100,N102*100/(N102+R102),N102)","v":99.378665152292555},{"$f":"N100*AVERAGEIF(O105:O116,\">0\")/100","v":98.651965844188766},{"$f":"N100*(100-AVERAGEIF(O105:O116,\">0\"))/100","v":0.72669930810379813},{"$f":"100-(O100+P100+R100)","v":0.62133484770743053},{"$f":"IF((N102+R102)>100,R102*100/(N102+R102),R102)","v":0},{"$f":"IF((S102+W102)>100,S102*100/(S102+W102),S102)","v":99.480760814040835},{"$f":"S100*AVERAGEIF(T105:T116,\">0\")/100","v":99.041429269852216},{"$f":"S100*(100-AVERAGEIF(T105:T116,\">0\"))/100","v":0.43933154418862275},{"$f":"100-(T100+U100+W100)","v":0.51923918595916518},{"$f":"IF((S102+W102)>100,W102*100/(S102+W102),W102)","v":0},{"$f":"IF((X102+AB102)>100,X102*100/(X102+AB102),X102)","v":99.239627066549957},{"$f":"X100*AVERAGEIF(Y105:Y116,\">0\")/100","v":98.928749105396363},{"$f":"X100*(100-AVERAGEIF(Y105:Y116,\">0\"))/100","v":0.31087796115358413},{"$f":"100-(Y100+Z100+AB100)","v":0.76037293345005708},{"$f":"IF((X102+AB102)>100,AB102*100/(X102+AB102),AB102)","v":0}]
["Regression period:",null,{"$f":"MinRegYear(C99,C105:C116)","v":2015},{"$f":"IF(MAX(C105:C116)-MIN(C105:C116)<5,AVERAGEIF(C105:C116,\">0\",D105:D116),\nIF(FORECAST($C101,D$105:D$116,$C$105:$C$116)<0,0,\nIF(FORECAST($C101,D$105:D$116,$C$105:$C$116)>100,100,\nFORECAST($C101,D$105:D$116,$C$105:$C$116))))","v":98.339163656092069},null,null,null,{"$f":"IF(MAX(C105:C116)-MIN(C105:C116)<5,AVERAGEIF(C105:C116,\">0\",H105:H116),\nIF(FORECAST($C101,H$105:H$116,$C$105:$C$116)<0,0,\nIF(FORECAST($C101,H$105:H$116,$C$105:$C$116)>100,100,\nFORECAST($C101,H$105:H$116,$C$105:$C$116))))","v":0.4339734910155077},{"$f":"IF(MAX(C105:C116)-MIN(C105:C116)<5,AVERAGEIF(C105:C116,\">0\",I105:I116),\nIF(FORECAST($C101,I$105:I$116,$C$105:$C$116)<0,0,\nIF(FORECAST($C101,I$105:I$116,$C$105:$C$116)>100,100,\nFORECAST($C101,I$105:I$116,$C$105:$C$116))))","v":98.85502497892638},null,null,null,{"$f":"IF(MAX(C105:C116)-MIN(C105:C116)<5,AVERAGEIF(C105:C116,\">0\",M105:M116),\nIF(FORECAST($C101,M$105:M$116,$C$105:$C$116)<0,0,\nIF(FORECAST($C101,M$105:M$116,$C$105:$C$116)>100,100,\nFORECAST($C101,M$105:M$116,$C$105:$C$116))))","v":0},{"$f":"IF(MAX(C105:C116)-MIN(C105:C116)<5,AVERAGEIF(C105:C116,\">0\",N105:N116),\nIF(FORECAST($C101,N$105:N$116,$C$105:$C$116)<0,0,\nIF(FORECAST($C101,N$105:N$116,$C$105:$C$116)>100,100,\nFORECAST($C101,N$105:N$116,$C$105:$C$116))))","v":99.378665152292555},null,null,null,{"$f":"IF(MAX(C105:C116)-MIN(C105:C116)<5,AVERAGEIF(C105:C116,\">0\",R105:R116),\nIF(FORECAST($C101,R$105:R$116,$C$105:$C$116)<0,0,\nIF(FORECAST($C101,R$105:R$116,$C$105:$C$116)>100,100,\nFORECAST($C101,R$105:R$116,$C$105:$C$116))))","v":0},{"$f":"IF(MAX(C105:C116)-MIN(C105:C116)<5,AVERAGEIF(C105:C116,\">0\",S105:S116),\nIF(FORECAST($C101,S$105:S$116,$C$105:$C$116)<0,0,\nIF(FORECAST($C101,S$105:S$116,$C$105:$C$116)>100,100,\nFORECAST($C101,S$105:S$116,$C$105:$C$116))))","v":99.480760814040835},null,null,null,{"$f":"IF(MAX(C105:C116)-MIN(C105:C116)<5,AVERAGEIF(C105:C116,\">0\",W105:W116),\nIF(FORECAST($C101,W$105:W$116,$C$105:$C$116)<0,0,\nIF(FORECAST($C101,W$105:W$116,$C$105:$C$116)>100,100,\nFORECAST($C101,W$105:W$116,$C$105:$C$116))))","v":0},{"$f":"IF(MAX(C105:C116)-MIN(C105:C116)<5,AVERAGEIF(C105:C116,\">0\",X105:X116),\nIF(FORECAST($C101,X$105:X$116,$C$105:$C$116)<0,0,\nIF(FORECAST($C101,X$105:X$116,$C$105:$C$116)>100,100,\nFORECAST($C101,X$105:X$116,$C$105:$C$116))))","v":99.239627066549957},null,null,null,{"$f":"IF(MAX(C105:C116)-MIN(C105:C116)<5,AVERAGEIF(C105:C116,\">0\",AB105:AB116),\nIF(FORECAST($C101,AB$105:AB$116,$C$105:$C$116)<0,0,\nIF(FORECAST($C101,AB$105:AB$116,$C$105:$C$116)>100,100,\nFORECAST($C101,AB$105:AB$116,$C$105:$C$116))))","v":0}]
[null,null,{"$f":"MaxRegYear(C100,C105:C116)","v":2019},{"$f":"IF(MAX(C105:C116)-MIN(C105:C116)<5,AVERAGEIF(C105:C116,\">0\",D105:D116),\nIF(FORECAST($C102,D$105:D$116,$C$105:$C$116)<0,0,\nIF(FORECAST($C102,D$105:D$116,$C$105:$C$116)>100,100,\nFORECAST($C102,D$105:D$116,$C$105:$C$116))))","v":98.339163656092069},null,null,null,{"$f":"IF(MAX(C105:C116)-MIN(C105:C116)<5,AVERAGEIF(C105:C116,\">0\",H105:H116),\nIF(FORECAST($C102,H$105:H$116,$C$105:$C$116)<0,0,\nIF(FORECAST($C102,H$105:H$116,$C$105:$C$116)>100,100,\nFORECAST($C102,H$105:H$116,$C$105:$C$116))))","v":0.4339734910155077},{"$f":"IF(MAX(C105:C116)-MIN(C105:C116)<5,AVERAGEIF(C105:C116,\">0\",I105:I116),\nIF(FORECAST($C102,I$105:I$116,$C$105:$C$116)<0,0,\nIF(FORECAST($C102,I$105:I$116,$C$105:$C$116)>100,100,\nFORECAST($C102,I$105:I$116,$C$105:$C$116))))","v":98.85502497892638},null,null,null,{"$f":"IF(MAX(C105:C116)-MIN(C105:C116)<5,AVERAGEIF(C105:C116,\">0\",M105:M116),\nIF(FORECAST($C102,M$105:M$116,$C$105:$C$116)<0,0,\nIF(FORECAST($C102,M$105:M$116,$C$105:$C$116)>100,100,\nFORECAST($C102,M$105:M$116,$C$105:$C$116))))","v":0},{"$f":"IF(MAX(C105:C116)-MIN(C105:C116)<5,AVERAGEIF(C105:C116,\">0\",N105:N116),\nIF(FORECAST($C102,N$105:N$116,$C$105:$C$116)<0,0,\nIF(FORECAST($C102,N$105:N$116,$C$105:$C$116)>100,100,\nFORECAST($C102,N$105:N$116,$C$105:$C$116))))","v":99.378665152292555},null,null,null,{"$f":"IF(MAX(C105:C116)-MIN(C105:C116)<5,AVERAGEIF(C105:C116,\">0\",R105:R116),\nIF(FORECAST($C102,R$105:R$116,$C$105:$C$116)<0,0,\nIF(FORECAST($C102,R$105:R$116,$C$105:$C$116)>100,100,\nFORECAST($C102,R$105:R$116,$C$105:$C$116))))","v":0},{"$f":"IF(MAX(C105:C116)-MIN(C105:C116)<5,AVERAGEIF(C105:C116,\">0\",S105:S116),\nIF(FORECAST($C102,S$105:S$116,$C$105:$C$116)<0,0,\nIF(FORECAST($C102,S$105:S$116,$C$105:$C$116)>100,100,\nFORECAST($C102,S$105:S$116,$C$105:$C$116))))","v":99.480760814040835},null,null,null,{"$f":"IF(MAX(C105:C116)-MIN(C105:C116)<5,AVERAGEIF(C105:C116,\">0\",W105:W116),\nIF(FORECAST($C102,W$105:W$116,$C$105:$C$116)<0,0,\nIF(FORECAST($C102,W$105:W$116,$C$105:$C$116)>100,100,\nFORECAST($C102,W$105:W$116,$C$105:$C$116))))","v":0},{"$f":"IF(MAX(C105:C116)-MIN(C105:C116)<5,AVERAGEIF(C105:C116,\">0\",X105:X116),\nIF(FORECAST($C102,X$105:X$116,$C$105:$C$116)<0,0,\nIF(FORECAST($C102,X$105:X$116,$C$105:$C$116)>100,100,\nFORECAST($C102,X$105:X$116,$C$105:$C$116))))","v":99.239627066549957},null,null,null,{"$f":"IF(MAX(C105:C116)-MIN(C105:C116)<5,AVERAGEIF(C105:C116,\">0\",AB105:AB116),\nIF(FORECAST($C102,AB$105:AB$116,$C$105:$C$116)<0,0,\nIF(FORECAST($C102,AB$105:AB$116,$C$105:$C$116)>100,100,\nFORECAST($C102,AB$105:AB$116,$C$105:$C$116))))","v":0}]
[]
[null,"Survey","Year","Improved","Not shared",null,null,"Open defecation","Improved","Not shared",null,null,"Open defecation","Improved","Not shared",null,null,"Open defecation","Improved","Not shared",null,null,"Open defecation","Improved","Not shared",null,null,"Open defecation"]
[null,"DHS17",2017,{"$f":"IF(ISERROR(INDIRECT(CONCATENATE($B105,\"!C122\"))),\"\",INDIRECT(CONCATENATE($B105,\"!C122\")))","v":98.339163656092069},{"$f":"IF(ISERROR(INDIRECT(CONCATENATE($B105,\"!C129\"))),\"\",INDIRECT(CONCATENATE($B105,\"!C129\")))","v":99.000761313456081},null,null,{"$f":"IF(ISERROR(INDIRECT(CONCATENATE($B105,\"!C127\"))),\"\",INDIRECT(CONCATENATE($B105,\"!C127\")))","v":0.4339734910155077},{"$f":"IF(ISERROR(INDIRECT(CONCATENATE($B105,\"!D122\"))),\"\",INDIRECT(CONCATENATE($B105,\"!D122\")))","v":98.85502497892638},{"$f":"IF(ISERROR(INDIRECT(CONCATENATE($B105,\"!D129\"))),\"\",INDIRECT(CONCATENATE($B105,\"!D129\")))","v":99.329182820157385},null,null,{"$f":"IF(ISERROR(INDIRECT(CONCATENATE($B105,\"!D127\"))),\"\",INDIRECT(CONCATENATE($B105,\"!D127\")))","v":0},{"$f":"IF(ISERROR(INDIRECT(CONCATENATE($B105,\"!E122\"))),\"\",INDIRECT(CONCATENATE($B105,\"!E122\")))","v":99.378665152292555},{"$f":"IF(ISERROR(INDIRECT(CONCATENATE($B105,\"!E129\"))),\"\",INDIRECT(CONCATENATE($B105,\"!E129\")))","v":99.268757225718247},null,null,{"$f":"IF(ISERROR(INDIRECT(CONCATENATE($B105,\"!E127\"))),\"\",INDIRECT(CONCATENATE($B105,\"!E127\")))","v":0},{"$f":"IF(ISERROR(INDIRECT(CONCATENATE($B105,\"!F122\"))),\"\",INDIRECT(CONCATENATE($B105,\"!F122\")))","v":99.480760814040835},{"$f":"IF(ISERROR(INDIRECT(CONCATENATE($B105,\"!F129\"))),\"\",INDIRECT(CONCATENATE($B105,\"!F129\")))","v":99.558375367665448},null,null,{"$f":"IF(ISERROR(INDIRECT(CONCATENATE($B105,\"!F127\"))),\"\",INDIRECT(CONCATENATE($B105,\"!F127\")))","v":0},{"$f":"IF(ISERROR(INDIRECT(CONCATENATE($B105,\"!G122\"))),\"\",INDIRECT(CONCATENATE($B105,\"!G122\")))","v":99.239627066549957},{"$f":"IF(ISERROR(INDIRECT(CONCATENATE($B105,\"!G129\"))),\"\",INDIRECT(CONCATENATE($B105,\"!G129\")))","v":99.686740095319877},null,null,{"$f":"IF(ISERROR(INDIRECT(CONCATENATE($B105,\"!G2127\"))),\"\",INDIRECT(CONCATENATE($B105,\"!G127\")))","v":0}]
[null,null,null,"","",null,null,"","","",null,null,"","","",null,null,"","","",null,null,"","","",null,null,""]
[null,null,null,"","",null,null,"","","",null,null,"","","",null,null,"","","",null,null,"","","",null,null,""]
[null,null,null,"","",null,null,"","","",null,null,"","","",null,null,"","","",null,null,"","","",null,null,""]
[null,null,null,"","",null,null,"","","",null,null,"","","",null,null,"","","",null,null,"","","",null,null,""]
[null,null,null,"","",null,null,"","","",null,null,"","","",null,null,"","","",null,null,"","","",null,null,""]
[null,null,null,"","",null,null,"","","",null,null,"","","",null,null,"","","",null,null,"","","",null,null,""]
[null,null,null,"","",null,null,"","","",null,null,"","","",null,null,"","","",null,null,"","","",null,null,""]
[null,null,null,"","",null,null,"","","",null,null,"","","",null,null,"","","",null,null,"","","",null,null,""]
[null,null,null,"","",null,null,"","","",null,null,"","","",null,null,"","","",null,null,"","","",null,null,""]
[null,null,null,"","",null,null,"","","",null,null,"","","",null,null,"","","",null,null,"","","",null,null,""]
[null,null,null,"","",null,null,"","","",null,null,"","","",null,null,"","","",null,null,"","","",null,null,""]
[]
[null,{"$f":"CONCATENATE(\"National use of sanitation facilities, \",C99,\"–\",C100)","v":"National use of sanitation facilities, 2013–2020"},null,null,null,null,null,null,null,null,null,null,null,null,null,null,null,null,"Data points used for regression"]
[]
[]
[]
[]
[]
[]
[]
[]
[]
[]
[]
[]
[]
[]
[]
[]
[]
[]
[]
[]
[]
[]
[]
[]
[]
[]
[]
[]
[]
[]
[]
[]
[]
[]
[]
[]
[]
[]
[]
[]
[]
[]
[]
[]
[]
[]
[]
[]
[]
[]
[]
[]
[]
[]
[]
[]
[]
[]
[]
[]
[]
[]
[]
[]
[]
[]
[]
[]
[]
[]
[]
[]
[]
[]
[]
[]
[]
[]
["URBAN",null,null,"Poorest",null,null,null,null,"Poor",null,null,null,null,"Middle",null,null,null,null,"Rich",null,null,null,null,"Richest"]
[null,null,null,"Improved","Basic","Limited","Unimproved","Open defecation","Improved","Basic","Limited","Unimproved","Open defecation","Improved","Basic","Limited","Unimproved","Open defecation","Improved","Basic","Limited","Unimproved","Open defecation","Improved","Basic","Limited","Unimproved","Open defecation"]
["Forecast period:",null,{"$f":"MinBase(C205:C216)","v":2013},{"$f":"IF((D201+H201)>100,D201*100/(D201+H201),D201)","v":100},{"$f":"D199*AVERAGEIF(E205:E216,\">0\")/100","v":98.306214184467606},{"$f":"D199*(100-AVERAGEIF(E205:E216,\">0\"))/100","v":1.6937858155323937},{"$f":"100-(E199+F199+H199)","v":0},{"$f":"IF((D201+H201)>100,H201*100/(D201+H201),H201)","v":0},{"$f":"IF((I201+M201)>100,I201*100/(I201+M201),I201)","v":100},{"$f":"I199*AVERAGEIF(J205:J216,\">0\")/100","v":98.997810771076161},{"$f":"I199*(100-AVERAGEIF(J205:J216,\">0\"))/100","v":1.0021892289238394},{"$f":"100-(J199+K199+M199)","v":0},{"$f":"IF((I201+M201)>100,M201*100/(I201+M201),M201)","v":0},{"$f":"IF((N201+R201)>100,N201*100/(N201+R201),N201)","v":100},{"$f":"N199*AVERAGEIF(O205:O216,\">0\")/100","v":100},{"$f":"N199*(100-AVERAGEIF(O205:O216,\">0\"))/100","v":0},{"$f":"100-(O199+P199+R199)","v":0},{"$f":"IF((N201+R201)>100,R201*100/(N201+R201),R201)","v":0},{"$f":"IF((S201+W201)>100,S201*100/(S201+W201),S201)","v":99.009122743460154},{"$f":"S199*AVERAGEIF(T205:T216,\">0\")/100","v":99.009122743460154},{"$f":"S199*(100-AVERAGEIF(T205:T216,\">0\"))/100","v":0},{"$f":"100-(T199+U199+W199)","v":0.99087725653984648},{"$f":"IF((S201+W201)>100,W201*100/(S201+W201),W201)","v":0},{"$f":"IF((X201+AB201)>100,X201*100/(X201+AB201),X201)","v":100},{"$f":"X199*AVERAGEIF(Y205:Y216,\">0\")/100","v":99.421704365980162},{"$f":"X199*(100-AVERAGEIF(Y205:Y216,\">0\"))/100","v":0.57829563401983819},{"$f":"100-(Y199+Z199+AB199)","v":0},{"$f":"IF((X201+AB201)>100,AB201*100/(X201+AB201),AB201)","v":0}]
[null,null,{"$f":"MaxTarget(C205:C216)","v":2020},{"$f":"IF((D202+H202)>100,D202*100/(D202+H202),D202)","v":100},{"$f":"D200*AVERAGEIF(E205:E216,\">0\")/100","v":98.306214184467606},{"$f":"D200*(100-AVERAGEIF(E205:E216,\">0\"))/100","v":1.6937858155323937},{"$f":"100-(E200+F200+H200)","v":0},{"$f":"IF((D202+H202)>100,H202*100/(D202+H202),H202)","v":0},{"$f":"IF((I202+M202)>100,I202*100/(I202+M202),I202)","v":100},{"$f":"I200*AVERAGEIF(J205:J216,\">0\")/100","v":98.997810771076161},{"$f":"I200*(100-AVERAGEIF(J205:J216,\">0\"))/100","v":1.0021892289238394},{"$f":"100-(J200+K200+M200)","v":0},{"$f":"IF((I202+M202)>100,M202*100/(I202+M202),M202)","v":0},{"$f":"IF((N202+R202)>100,N202*100/(N202+R202),N202)","v":100},{"$f":"N200*AVERAGEIF(O205:O216,\">0\")/100","v":100},{"$f":"N200*(100-AVERAGEIF(O205:O216,\">0\"))/100","v":0},{"$f":"100-(O200+P200+R200)","v":0},{"$f":"IF((N202+R202)>100,R202*100/(N202+R202),R202)","v":0},{"$f":"IF((S202+W202)>100,S202*100/(S202+W202),S202)","v":99.009122743460154},{"$f":"S200*AVERAGEIF(T205:T216,\">0\")/100","v":99.009122743460154},{"$f":"S200*(100-AVERAGEIF(T205:T216,\">0\"))/100","v":0},{"$f":"100-(T200+U200+W200)","v":0.99087725653984648},{"$f":"IF((S202+W202)>100,W202*100/(S202+W202),W202)","v":0},{"$f":"IF((X202+AB202)>100,X202*100/(X202+AB202),X202)","v":100},{"$f":"X200*AVERAGEIF(Y205:Y216,\">0\")/100","v":99.421704365980162},{"$f":"X200*(100-AVERAGEIF(Y205:Y216,\">0\"))/100","v":0.57829563401983819},{"$f":"100-(Y200+Z200+AB200)","v":0},{"$f":"IF((X202+AB202)>100,AB202*100/(X202+AB202),AB202)","v":0}]
["Regression period:",null,{"$f":"MinRegYear(C199,C205:C216)","v":2015},{"$f":"IF(MAX(C205:C216)-MIN(C205:C216)<5,AVERAGEIF(C205:C216,\">0\",D205:D216),\nIF(FORECAST($C201,D$205:D$216,$C$205:$C$216)<0,0,\nIF(FORECAST($C201,D$205:D$216,$C$205:$C$216)>100,100,\nFORECAST($C201,D$205:D$216,$C$205:$C$216))))","v":100},null,null,null,{"$f":"IF(MAX(C205:C216)-MIN(C205:C216)<5,AVERAGEIF(C205:C216,\">0\",H205:H216),\nIF(FORECAST($C201,H$205:H$216,$C$205:$C$216)<0,0,\nIF(FORECAST($C201,H$205:H$216,$C$205:$C$216)>100,100,\nFORECAST($C201,H$205:H$216,$C$205:$C$216))))","v":0},{"$f":"IF(MAX(C205:C216)-MIN(C205:C216)<5,AVERAGEIF(C205:C216,\">0\",I205:I216),\nIF(FORECAST($C201,I$205:I$216,$C$205:$C$216)<0,0,\nIF(FORECAST($C201,I$205:I$216,$C$205:$C$216)>100,100,\nFORECAST($C201,I$205:I$216,$C$205:$C$216))))","v":100},null,null,null,{"$f":"IF(MAX(C205:C216)-MIN(C205:C216)<5,AVERAGEIF(C205:C216,\">0\",M205:M216),\nIF(FORECAST($C201,M$205:M$216,$C$205:$C$216)<0,0,\nIF(FORECAST($C201,M$205:M$216,$C$205:$C$216)>100,100,\nFORECAST($C201,M$205:M$216,$C$205:$C$216))))","v":0},{"$f":"IF(MAX(C205:C216)-MIN(C205:C216)<5,AVERAGEIF(C205:C216,\">0\",N205:N216),\nIF(FORECAST($C201,N$205:N$216,$C$205:$C$216)<0,0,\nIF(FORECAST($C201,N$205:N$216,$C$205:$C$216)>100,100,\nFORECAST($C201,N$205:N$216,$C$205:$C$216))))","v":100},null,null,null,{"$f":"IF(MAX(C205:C216)-MIN(C205:C216)<5,AVERAGEIF(C205:C216,\">0\",R205:R216),\nIF(FORECAST($C201,R$205:R$216,$C$205:$C$216)<0,0,\nIF(FORECAST($C201,R$205:R$216,$C$205:$C$216)>100,100,\nFORECAST($C201,R$205:R$216,$C$205:$C$216))))","v":0},{"$f":"IF(MAX(C205:C216)-MIN(C205:C216)<5,AVERAGEIF(C205:C216,\">0\",S205:S216),\nIF(FORECAST($C201,S$205:S$216,$C$205:$C$216)<0,0,\nIF(FORECAST($C201,S$205:S$216,$C$205:$C$216)>100,100,\nFORECAST($C201,S$205:S$216,$C$205:$C$216))))","v":99.009122743460154},null,null,null,{"$f":"IF(MAX(C205:C216)-MIN(C205:C216)<5,AVERAGEIF(C205:C216,\">0\",W205:W216),\nIF(FORECAST($C201,W$205:W$216,$C$205:$C$216)<0,0,\nIF(FORECAST($C201,W$205:W$216,$C$205:$C$216)>100,100,\nFORECAST($C201,W$205:W$216,$C$205:$C$216))))","v":0},{"$f":"IF(MAX(C205:C216)-MIN(C205:C216)<5,AVERAGEIF(C205:C216,\">0\",X205:X216),\nIF(FORECAST($C201,X$205:X$216,$C$205:$C$216)<0,0,\nIF(FORECAST($C201,X$205:X$216,$C$205:$C$216)>100,100,\nFORECAST($C201,X$205:X$216,$C$205:$C$216))))","v":100},null,null,null,{"$f":"IF(MAX(C205:C216)-MIN(C205:C216)<5,AVERAGEIF(C205:C216,\">0\",AB205:AB216),\nIF(FORECAST($C201,AB$205:AB$216,$C$205:$C$216)<0,0,\nIF(FORECAST($C201,AB$205:AB$216,$C$205:$C$216)>100,100,\nFORECAST($C201,AB$205:AB$216,$C$205:$C$216))))","v":0}]
[null,null,{"$f":"MaxRegYear(C200,C205:C216)","v":2019},{"$f":"IF(MAX(C205:C216)-MIN(C205:C216)<5,AVERAGEIF(C205:C216,\">0\",D205:D216),\nIF(FORECAST($C202,D$205:D$216,$C$205:$C$216)<0,0,\nIF(FORECAST($C202,D$205:D$216,$C$205:$C$216)>100,100,\nFORECAST($C202,D$205:D$216,$C$205:$C$216))))","v":100},null,null,null,{"$f":"IF(MAX(C205:C216)-MIN(C205:C216)<5,AVERAGEIF(C205:C216,\">0\",H205:H216),\nIF(FORECAST($C202,H$205:H$216,$C$205:$C$216)<0,0,\nIF(FORECAST($C202,H$205:H$216,$C$205:$C$216)>100,100,\nFORECAST($C202,H$205:H$216,$C$205:$C$216))))","v":0},{"$f":"IF(MAX(C205:C216)-MIN(C205:C216)<5,AVERAGEIF(C205:C216,\">0\",I205:I216),\nIF(FORECAST($C202,I$205:I$216,$C$205:$C$216)<0,0,\nIF(FORECAST($C202,I$205:I$216,$C$205:$C$216)>100,100,\nFORECAST($C202,I$205:I$216,$C$205:$C$216))))","v":100},null,null,null,{"$f":"IF(MAX(C205:C216)-MIN(C205:C216)<5,AVERAGEIF(C205:C216,\">0\",M205:M216),\nIF(FORECAST($C202,M$205:M$216,$C$205:$C$216)<0,0,\nIF(FORECAST($C202,M$205:M$216,$C$205:$C$216)>100,100,\nFORECAST($C202,M$205:M$216,$C$205:$C$216))))","v":0},{"$f":"IF(MAX(C205:C216)-MIN(C205:C216)<5,AVERAGEIF(C205:C216,\">0\",N205:N216),\nIF(FORECAST($C202,N$205:N$216,$C$205:$C$216)<0,0,\nIF(FORECAST($C202,N$205:N$216,$C$205:$C$216)>100,100,\nFORECAST($C202,N$205:N$216,$C$205:$C$216))))","v":100},null,null,null,{"$f":"IF(MAX(C205:C216)-MIN(C205:C216)<5,AVERAGEIF(C205:C216,\">0\",R205:R216),\nIF(FORECAST($C202,R$205:R$216,$C$205:$C$216)<0,0,\nIF(FORECAST($C202,R$205:R$216,$C$205:$C$216)>100,100,\nFORECAST($C202,R$205:R$216,$C$205:$C$216))))","v":0},{"$f":"IF(MAX(C205:C216)-MIN(C205:C216)<5,AVERAGEIF(C205:C216,\">0\",S205:S216),\nIF(FORECAST($C202,S$205:S$216,$C$205:$C$216)<0,0,\nIF(FORECAST($C202,S$205:S$216,$C$205:$C$216)>100,100,\nFORECAST($C202,S$205:S$216,$C$205:$C$216))))","v":99.009122743460154},null,null,null,{"$f":"IF(MAX(C205:C216)-MIN(C205:C216)<5,AVERAGEIF(C205:C216,\">0\",W205:W216),\nIF(FORECAST($C202,W$205:W$216,$C$205:$C$216)<0,0,\nIF(FORECAST($C202,W$205:W$216,$C$205:$C$216)>100,100,\nFORECAST($C202,W$205:W$216,$C$205:$C$216))))","v":0},{"$f":"IF(MAX(C205:C216)-MIN(C205:C216)<5,AVERAGEIF(C205:C216,\">0\",X205:X216),\nIF(FORECAST($C202,X$205:X$216,$C$205:$C$216)<0,0,\nIF(FORECAST($C202,X$205:X$216,$C$205:$C$216)>100,100,\nFORECAST($C202,X$205:X$216,$C$205:$C$216))))","v":100},null,null,null,{"$f":"IF(MAX(C205:C216)-MIN(C205:C216)<5,AVERAGEIF(C205:C216,\">0\",AB205:AB216),\nIF(FORECAST($C202,AB$205:AB$216,$C$205:$C$216)<0,0,\nIF(FORECAST($C202,AB$205:AB$216,$C$205:$C$216)>100,100,\nFORECAST($C202,AB$205:AB$216,$C$205:$C$216))))","v":0}]
[]
[null,"Survey","Year","Improved","Not shared",null,null,"Open defecation","Improved","Not shared",null,null,"Open defecation","Improved","Not shared",null,null,"Open defecation","Improved","Not shared",null,null,"Open defecation","Improved","Not shared",null,null,"Open defecation"]
[null,"DHS17",2017,{"$f":"IF(ISERROR(INDIRECT(CONCATENATE($B205,\"!H122\"))),\"\",INDIRECT(CONCATENATE($B205,\"!H122\")))","v":100},{"$f":"IF(ISERROR(INDIRECT(CONCATENATE($B205,\"!H129\"))),\"\",INDIRECT(CONCATENATE($B205,\"!H129\")))","v":98.306214184467606},null,null,{"$f":"IF(ISERROR(INDIRECT(CONCATENATE($B205,\"!H127\"))),\"\",INDIRECT(CONCATENATE($B205,\"!H127\")))","v":0},{"$f":"IF(ISERROR(INDIRECT(CONCATENATE($B205,\"!I122\"))),\"\",INDIRECT(CONCATENATE($B205,\"!I122\")))","v":100},{"$f":"IF(ISERROR(INDIRECT(CONCATENATE($B205,\"!I129\"))),\"\",INDIRECT(CONCATENATE($B205,\"!I129\")))","v":98.997810771076161},null,null,{"$f":"IF(ISERROR(INDIRECT(CONCATENATE($B205,\"!I127\"))),\"\",INDIRECT(CONCATENATE($B205,\"!I127\")))","v":0},{"$f":"IF(ISERROR(INDIRECT(CONCATENATE($B205,\"!J122\"))),\"\",INDIRECT(CONCATENATE($B205,\"!J122\")))","v":100},{"$f":"IF(ISERROR(INDIRECT(CONCATENATE($B205,\"!J129\"))),\"\",INDIRECT(CONCATENATE($B205,\"!J129\")))","v":100},null,null,{"$f":"IF(ISERROR(INDIRECT(CONCATENATE($B205,\"!J127\"))),\"\",INDIRECT(CONCATENATE($B205,\"!J127\")))","v":0},{"$f":"IF(ISERROR(INDIRECT(CONCATENATE($B205,\"!K122\"))),\"\",INDIRECT(CONCATENATE($B205,\"!K122\")))","v":99.009122743460154},{"$f":"IF(ISERROR(INDIRECT(CONCATENATE($B205,\"!K129\"))),\"\",INDIRECT(CONCATENATE($B205,\"!K129\")))","v":100},null,null,{"$f":"IF(ISERROR(INDIRECT(CONCATENATE($B205,\"!K127\"))),\"\",INDIRECT(CONCATENATE($B205,\"!K127\")))","v":0},{"$f":"IF(ISERROR(INDIRECT(CONCATENATE($B205,\"!L122\"))),\"\",INDIRECT(CONCATENATE($B205,\"!L122\")))","v":100},{"$f":"IF(ISERROR(INDIRECT(CONCATENATE($B205,\"!L129\"))),\"\",INDIRECT(CONCATENATE($B205,\"!L129\")))","v":99.421704365980162},null,null,{"$f":"IF(ISERROR(INDIRECT(CONCATENATE($B205,\"!L2127\"))),\"\",INDIRECT(CONCATENATE($B205,\"!L127\")))","v":0}]
[null,null,null,"","",null,null,"","","",null,null,"","","",null,null,"","","",null,null,"","","",null,null,""]
[null,null,null,"","",null,null,"","","",null,null,"","","",null,null,"","","",null,null,"","","",null,null,""]
[null,null,null,"","",null,null,"","","",null,null,"","","",null,null,"","","",null,null,"","","",null,null,""]
[null,null,null,"","",null,null,"","","",null,null,"","","",null,null,"","","",null,null,"","","",null,null,""]
[null,null,null,"","",null,null,"","","",null,null,"","","",null,null,"","","",null,null,"","","",null,null,""]
[null,null,null,"","",null,null,"","","",null,null,"","","",null,null,"","","",null,null,"","","",null,null,""]
[null,null,null,"","",null,null,"","","",null,null,"","","",null,null,"","","",null,null,"","","",null,null,""]
[null,null,null,"","",null,null,"","","",null,null,"","","",null,null,"","","",null,null,"","","",null,null,""]
[null,null,null,"","",null,null,"","","",null,null,"","","",null,null,"","","",null,null,"","","",null,null,""]
[null,null,null,"","",null,null,"","","",null,null,"","","",null,null,"","","",null,null,"","","",null,null,""]
[null,null,null,"","",null,null,"","","",null,null,"","","",null,null,"","","",null,null,"","","",null,null,""]
[]
[null,{"$f":"CONCATENATE(\"Urban use of sanitation facilities, \",C199,\"–\",C200)","v":"Urban use of sanitation facilities, 2013–2020"},null,null,null,null,null,null,null,null,null,null,null,null,null,null,null,null,"Data points used for regression"]
[]
[]
[]
[]
[]
[]
[]
[]
[]
[]
[]
[]
[]
[]
[]
[]
[]
[]
[]
[]
[]
[]
[]
[]
[]
[]
[]
[]
[]
[]
[]
[]
[]
[]
[]
[]
[]
[]
[]
[]
[]
[]
[]
[]
[]
[]
[]
[]
[]
[]
[]
[]
[]
[]
[]
[]
[]
[]
[]
[]
[]
[]
[]
[]
[]
[]
[]
[]
[]
[]
[]
[]
[]
[]
[]
[]
[]
[]
["RURAL",null,null,"Poorest",null,null,null,null,"Poor",null,null,null,null,"Middle",null,null,null,null,"Rich",null,null,null,null,"Richest"]
[null,null,null,"Improved","Basic","Limited","Unimproved","Open defecation","Improved","Basic","Limited","Unimproved","Open defecation","Improved","Basic","Limited","Unimproved","Open defecation","Improved","Basic","Limited","Unimproved","Open defecation","Improved","Basic","Limited","Unimproved","Open defecation"]
["Forecast period:",null,{"$f":"MinBase(C305:C316)","v":2013},{"$f":"IF((D301+H301)>100,D301*100/(D301+H301),D301)","v":97.554527938875395},{"$f":"D299*AVERAGEIF(E305:E316,\">0\")/100","v":96.987688317647184},{"$f":"D299*(100-AVERAGEIF(E305:E316,\">0\"))/100","v":0.56683962122821219},{"$f":"100-(E299+F299+H299)","v":1.7061981756110782},{"$f":"IF((D301+H301)>100,H301*100/(D301+H301),H301)","v":0.73927388551352247},{"$f":"IF((I301+M301)>100,I301*100/(I301+M301),I301)","v":98.567592287997684},{"$f":"I299*AVERAGEIF(J305:J316,\">0\")/100","v":97.7779849928652},{"$f":"I299*(100-AVERAGEIF(J305:J316,\">0\"))/100","v":0.78960729513248074},{"$f":"100-(J299+K299+M299)","v":1.4324077120023162},{"$f":"IF((I301+M301)>100,M301*100/(I301+M301),M301)","v":0},{"$f":"IF((N301+R301)>100,N301*100/(N301+R301),N301)","v":98.309021450147128},{"$f":"N299*AVERAGEIF(O305:O316,\">0\")/100","v":97.978402491658812},{"$f":"N299*(100-AVERAGEIF(O305:O316,\">0\"))/100","v":0.33061895848831596},{"$f":"100-(O299+P299+R299)","v":1.690978549852872},{"$f":"IF((N301+R301)>100,R301*100/(N301+R301),R301)","v":0},{"$f":"IF((S301+W301)>100,S301*100/(S301+W301),S301)","v":99.095915861095335},{"$f":"S299*AVERAGEIF(T305:T316,\">0\")/100","v":98.064892039267193},{"$f":"S299*(100-AVERAGEIF(T305:T316,\">0\"))/100","v":1.0310238218281298},{"$f":"100-(T299+U299+W299)","v":0.90408413890467898},{"$f":"IF((S301+W301)>100,W301*100/(S301+W301),W301)","v":0},{"$f":"IF((X301+AB301)>100,X301*100/(X301+AB301),X301)","v":99.1553140462687},{"$f":"X299*AVERAGEIF(Y305:Y316,\">0\")/100","v":98.860673186493216},{"$f":"X299*(100-AVERAGEIF(Y305:Y316,\">0\"))/100","v":0.29464085977548604},{"$f":"100-(Y299+Z299+AB299)","v":0.84468595373130029},{"$f":"IF((X301+AB301)>100,AB301*100/(X301+AB301),AB301)","v":0}]
[null,null,{"$f":"MaxTarget(C305:C316)","v":2020},{"$f":"IF((D302+H302)>100,D302*100/(D302+H302),D302)","v":97.554527938875395},{"$f":"D300*AVERAGEIF(E305:E316,\">0\")/100","v":96.987688317647184},{"$f":"D300*(100-AVERAGEIF(E305:E316,\">0\"))/100","v":0.56683962122821219},{"$f":"100-(E300+F300+H300)","v":1.7061981756110782},{"$f":"IF((D302+H302)>100,H302*100/(D302+H302),H302)","v":0.73927388551352247},{"$f":"IF((I302+M302)>100,I302*100/(I302+M302),I302)","v":98.567592287997684},{"$f":"I300*AVERAGEIF(J305:J316,\">0\")/100","v":97.7779849928652},{"$f":"I300*(100-AVERAGEIF(J305:J316,\">0\"))/100","v":0.78960729513248074},{"$f":"100-(J300+K300+M300)","v":1.4324077120023162},{"$f":"IF((I302+M302)>100,M302*100/(I302+M302),M302)","v":0},{"$f":"IF((N302+R302)>100,N302*100/(N302+R302),N302)","v":98.309021450147128},{"$f":"N300*AVERAGEIF(O305:O316,\">0\")/100","v":97.978402491658812},{"$f":"N300*(100-AVERAGEIF(O305:O316,\">0\"))/100","v":0.33061895848831596},{"$f":"100-(O300+P300+R300)","v":1.690978549852872},{"$f":"IF((N302+R302)>100,R302*100/(N302+R302),R302)","v":0},{"$f":"IF((S302+W302)>100,S302*100/(S302+W302),S302)","v":99.095915861095335},{"$f":"S300*AVERAGEIF(T305:T316,\">0\")/100","v":98.064892039267193},{"$f":"S300*(100-AVERAGEIF(T305:T316,\">0\"))/100","v":1.0310238218281298},{"$f":"100-(T300+U300+W300)","v":0.90408413890467898},{"$f":"IF((S302+W302)>100,W302*100/(S302+W302),W302)","v":0},{"$f":"IF((X302+AB302)>100,X302*100/(X302+AB302),X302)","v":99.1553140462687},{"$f":"X300*AVERAGEIF(Y305:Y316,\">0\")/100","v":98.860673186493216},{"$f":"X300*(100-AVERAGEIF(Y305:Y316,\">0\"))/100","v":0.29464085977548604},{"$f":"100-(Y300+Z300+AB300)","v":0.84468595373130029},{"$f":"IF((X302+AB302)>100,AB302*100/(X302+AB302),AB302)","v":0}]
["Regression period:",null,{"$f":"MinRegYear(C299,C305:C316)","v":2015},{"$f":"IF(MAX(C305:C316)-MIN(C305:C316)<5,AVERAGEIF(C305:C316,\">0\",D305:D316),\nIF(FORECAST($C301,D$305:D$316,$C$305:$C$316)<0,0,\nIF(FORECAST($C301,D$305:D$316,$C$305:$C$316)>100,100,\nFORECAST($C301,D$305:D$316,$C$305:$C$316))))","v":97.554527938875395},null,null,null,{"$f":"IF(MAX(C305:C316)-MIN(C305:C316)<5,AVERAGEIF(C305:C316,\">0\",H305:H316),\nIF(FORECAST($C301,H$305:H$316,$C$305:$C$316)<0,0,\nIF(FORECAST($C301,H$305:H$316,$C$305:$C$316)>100,100,\nFORECAST($C301,H$305:H$316,$C$305:$C$316))))","v":0.73927388551352247},{"$f":"IF(MAX(C305:C316)-MIN(C305:C316)<5,AVERAGEIF(C305:C316,\">0\",I305:I316),\nIF(FORECAST($C301,I$305:I$316,$C$305:$C$316)<0,0,\nIF(FORECAST($C301,I$305:I$316,$C$305:$C$316)>100,100,\nFORECAST($C301,I$305:I$316,$C$305:$C$316))))","v":98.567592287997684},null,null,null,{"$f":"IF(MAX(C305:C316)-MIN(C305:C316)<5,AVERAGEIF(C305:C316,\">0\",M305:M316),\nIF(FORECAST($C301,M$305:M$316,$C$305:$C$316)<0,0,\nIF(FORECAST($C301,M$305:M$316,$C$305:$C$316)>100,100,\nFORECAST($C301,M$305:M$316,$C$305:$C$316))))","v":0},{"$f":"IF(MAX(C305:C316)-MIN(C305:C316)<5,AVERAGEIF(C305:C316,\">0\",N305:N316),\nIF(FORECAST($C301,N$305:N$316,$C$305:$C$316)<0,0,\nIF(FORECAST($C301,N$305:N$316,$C$305:$C$316)>100,100,\nFORECAST($C301,N$305:N$316,$C$305:$C$316))))","v":98.309021450147128},null,null,null,{"$f":"IF(MAX(C305:C316)-MIN(C305:C316)<5,AVERAGEIF(C305:C316,\">0\",R305:R316),\nIF(FORECAST($C301,R$305:R$316,$C$305:$C$316)<0,0,\nIF(FORECAST($C301,R$305:R$316,$C$305:$C$316)>100,100,\nFORECAST($C301,R$305:R$316,$C$305:$C$316))))","v":0},{"$f":"IF(MAX(C305:C316)-MIN(C305:C316)<5,AVERAGEIF(C305:C316,\">0\",S305:S316),\nIF(FORECAST($C301,S$305:S$316,$C$305:$C$316)<0,0,\nIF(FORECAST($C301,S$305:S$316,$C$305:$C$316)>100,100,\nFORECAST($C301,S$305:S$316,$C$305:$C$316))))","v":99.095915861095335},null,null,null,{"$f":"IF(MAX(C305:C316)-MIN(C305:C316)<5,AVERAGEIF(C305:C316,\">0\",W305:W316),\nIF(FORECAST($C301,W$305:W$316,$C$305:$C$316)<0,0,\nIF(FORECAST($C301,W$305:W$316,$C$305:$C$316)>100,100,\nFORECAST($C301,W$305:W$316,$C$305:$C$316))))","v":0},{"$f":"IF(MAX(C305:C316)-MIN(C305:C316)<5,AVERAGEIF(C305:C316,\">0\",X305:X316),\nIF(FORECAST($C301,X$305:X$316,$C$305:$C$316)<0,0,\nIF(FORECAST($C301,X$305:X$316,$C$305:$C$316)>100,100,\nFORECAST($C301,X$305:X$316,$C$305:$C$316))))","v":99.1553140462687},null,null,null,{"$f":"IF(MAX(C305:C316)-MIN(C305:C316)<5,AVERAGEIF(C305:C316,\">0\",AB305:AB316),\nIF(FORECAST($C301,AB$305:AB$316,$C$305:$C$316)<0,0,\nIF(FORECAST($C301,AB$305:AB$316,$C$305:$C$316)>100,100,\nFORECAST($C301,AB$305:AB$316,$C$305:$C$316))))","v":0}]
[null,null,{"$f":"MaxRegYear(C300,C305:C316)","v":2019},{"$f":"IF(MAX(C305:C316)-MIN(C305:C316)<5,AVERAGEIF(C305:C316,\">0\",D305:D316),\nIF(FORECAST($C302,D$305:D$316,$C$305:$C$316)<0,0,\nIF(FORECAST($C302,D$305:D$316,$C$305:$C$316)>100,100,\nFORECAST($C302,D$305:D$316,$C$305:$C$316))))","v":97.554527938875395},null,null,null,{"$f":"IF(MAX(C305:C316)-MIN(C305:C316)<5,AVERAGEIF(C305:C316,\">0\",H305:H316),\nIF(FORECAST($C302,H$305:H$316,$C$305:$C$316)<0,0,\nIF(FORECAST($C302,H$305:H$316,$C$305:$C$316)>100,100,\nFORECAST($C302,H$305:H$316,$C$305:$C$316))))","v":0.73927388551352247},{"$f":"IF(MAX(C305:C316)-MIN(C305:C316)<5,AVERAGEIF(C305:C316,\">0\",I305:I316),\nIF(FORECAST($C302,I$305:I$316,$C$305:$C$316)<0,0,\nIF(FORECAST($C302,I$305:I$316,$C$305:$C$316)>100,100,\nFORECAST($C302,I$305:I$316,$C$305:$C$316))))","v":98.567592287997684},null,null,null,{"$f":"IF(MAX(C305:C316)-MIN(C305:C316)<5,AVERAGEIF(C305:C316,\">0\",M305:M316),\nIF(FORECAST($C302,M$305:M$316,$C$305:$C$316)<0,0,\nIF(FORECAST($C302,M$305:M$316,$C$305:$C$316)>100,100,\nFORECAST($C302,M$305:M$316,$C$305:$C$316))))","v":0},{"$f":"IF(MAX(C305:C316)-MIN(C305:C316)<5,AVERAGEIF(C305:C316,\">0\",N305:N316),\nIF(FORECAST($C302,N$305:N$316,$C$305:$C$316)<0,0,\nIF(FORECAST($C302,N$305:N$316,$C$305:$C$316)>100,100,\nFORECAST($C302,N$305:N$316,$C$305:$C$316))))","v":98.309021450147128},null,null,null,{"$f":"IF(MAX(C305:C316)-MIN(C305:C316)<5,AVERAGEIF(C305:C316,\">0\",R305:R316),\nIF(FORECAST($C302,R$305:R$316,$C$305:$C$316)<0,0,\nIF(FORECAST($C302,R$305:R$316,$C$305:$C$316)>100,100,\nFORECAST($C302,R$305:R$316,$C$305:$C$316))))","v":0},{"$f":"IF(MAX(C305:C316)-MIN(C305:C316)<5,AVERAGEIF(C305:C316,\">0\",S305:S316),\nIF(FORECAST($C302,S$305:S$316,$C$305:$C$316)<0,0,\nIF(FORECAST($C302,S$305:S$316,$C$305:$C$316)>100,100,\nFORECAST($C302,S$305:S$316,$C$305:$C$316))))","v":99.095915861095335},null,null,null,{"$f":"IF(MAX(C305:C316)-MIN(C305:C316)<5,AVERAGEIF(C305:C316,\">0\",W305:W316),\nIF(FORECAST($C302,W$305:W$316,$C$305:$C$316)<0,0,\nIF(FORECAST($C302,W$305:W$316,$C$305:$C$316)>100,100,\nFORECAST($C302,W$305:W$316,$C$305:$C$316))))","v":0},{"$f":"IF(MAX(C305:C316)-MIN(C305:C316)<5,AVERAGEIF(C305:C316,\">0\",X305:X316),\nIF(FORECAST($C302,X$305:X$316,$C$305:$C$316)<0,0,\nIF(FORECAST($C302,X$305:X$316,$C$305:$C$316)>100,100,\nFORECAST($C302,X$305:X$316,$C$305:$C$316))))","v":99.1553140462687},null,null,null,{"$f":"IF(MAX(C305:C316)-MIN(C305:C316)<5,AVERAGEIF(C305:C316,\">0\",AB305:AB316),\nIF(FORECAST($C302,AB$305:AB$316,$C$305:$C$316)<0,0,\nIF(FORECAST($C302,AB$305:AB$316,$C$305:$C$316)>100,100,\nFORECAST($C302,AB$305:AB$316,$C$305:$C$316))))","v":0}]
[]
[null,"Survey","Year","Improved","Not shared",null,null,"Open defecation","Improved","Not shared",null,null,"Open defecation","Improved","Not shared",null,null,"Open defecation","Improved","Not shared",null,null,"Open defecation","Improved","Not shared",null,null,"Open defecation"]
[null,"DHS17",2017,{"$f":"IF(ISERROR(INDIRECT(CONCATENATE($B305,\"!M122\"))),\"\",INDIRECT(CONCATENATE($B305,\"!M122\")))","v":97.554527938875395},{"$f":"IF(ISERROR(INDIRECT(CONCATENATE($B305,\"!M129\"))),\"\",INDIRECT(CONCATENATE($B305,\"!M129\")))","v":99.418950987509902},null,null,{"$f":"IF(ISERROR(INDIRECT(CONCATENATE($B305,\"!M127\"))),\"\",INDIRECT(CONCATENATE($B305,\"!M127\")))","v":0.73927388551352247},{"$f":"IF(ISERROR(INDIRECT(CONCATENATE($B305,\"!N122\"))),\"\",INDIRECT(CONCATENATE($B305,\"!N122\")))","v":98.567592287997684},{"$f":"IF(ISERROR(INDIRECT(CONCATENATE($B305,\"!N129\"))),\"\",INDIRECT(CONCATENATE($B305,\"!N129\")))","v":99.198917943713809},null,null,{"$f":"IF(ISERROR(INDIRECT(CONCATENATE($B305,\"!N127\"))),\"\",INDIRECT(CONCATENATE($B305,\"!N127\")))","v":0},{"$f":"IF(ISERROR(INDIRECT(CONCATENATE($B305,\"!O122\"))),\"\",INDIRECT(CONCATENATE($B305,\"!O122\")))","v":98.309021450147128},{"$f":"IF(ISERROR(INDIRECT(CONCATENATE($B305,\"!O129\"))),\"\",INDIRECT(CONCATENATE($B305,\"!O129\")))","v":99.663694182271996},null,null,{"$f":"IF(ISERROR(INDIRECT(CONCATENATE($B305,\"!O127\"))),\"\",INDIRECT(CONCATENATE($B305,\"!O127\")))","v":0},{"$f":"IF(ISERROR(INDIRECT(CONCATENATE($B305,\"!P122\"))),\"\",INDIRECT(CONCATENATE($B305,\"!P122\")))","v":99.095915861095335},{"$f":"IF(ISERROR(INDIRECT(CONCATENATE($B305,\"!P129\"))),\"\",INDIRECT(CONCATENATE($B305,\"!P129\")))","v":98.959569813882808},null,null,{"$f":"IF(ISERROR(INDIRECT(CONCATENATE($B305,\"!P127\"))),\"\",INDIRECT(CONCATENATE($B305,\"!P127\")))","v":0},{"$f":"IF(ISERROR(INDIRECT(CONCATENATE($B305,\"!Q122\"))),\"\",INDIRECT(CONCATENATE($B305,\"!Q122\")))","v":99.1553140462687},{"$f":"IF(ISERROR(INDIRECT(CONCATENATE($B305,\"!Q129\"))),\"\",INDIRECT(CONCATENATE($B305,\"!Q129\")))","v":99.702849148722379},null,null,{"$f":"IF(ISERROR(INDIRECT(CONCATENATE($B305,\"!Q2127\"))),\"\",INDIRECT(CONCATENATE($B305,\"!Q127\")))","v":0}]
[null,null,null,"","",null,null,"","","",null,null,"","","",null,null,"","","",null,null,"","","",null,null,""]
[null,null,null,"","",null,null,"","","",null,null,"","","",null,null,"","","",null,null,"","","",null,null,""]
[null,null,null,"","",null,null,"","","",null,null,"","","",null,null,"","","",null,null,"","","",null,null,""]
[null,null,null,"","",null,null,"","","",null,null,"","","",null,null,"","","",null,null,"","","",null,null,""]
[null,null,null,"","",null,null,"","","",null,null,"","","",null,null,"","","",null,null,"","","",null,null,""]
[null,null,null,"","",null,null,"","","",null,null,"","","",null,null,"","","",null,null,"","","",null,null,""]
[null,null,null,"","",null,null,"","","",null,null,"","","",null,null,"","","",null,null,"","","",null,null,""]
[null,null,null,"","",null,null,"","","",null,null,"","","",null,null,"","","",null,null,"","","",null,null,""]
[null,null,null,"","",null,null,"","","",null,null,"","","",null,null,"","","",null,null,"","","",null,null,""]
[null,null,null,"","",null,null,"","","",null,null,"","","",null,null,"","","",null,null,"","","",null,null,""]
[null,null,null,"","",null,null,"","","",null,null,"","","",null,null,"","","",null,null,"","","",null,null,""]
[]
[null,{"$f":"CONCATENATE(\"Rural use of sanitation facilities, \",C299,\"–\",C300)","v":"Rural use of sanitation facilities, 2013–2020"},null,null,null,null,null,null,null,null,null,null,null,null,null,null,null,null,"Data points used for regression"]

{"sheet":"Hygiene","index":3,"n_rows":89,"n_cols":25,"rows_kept":89,"cut":false,"hidden":false,"merged":[[39,22,40,22],[39,23,40,23],[39,24,40,24],[31,4,32,5],[39,16,40,16],[39,17,40,17],[39,18,40,18],[39,19,40,19],[39,20,40,20],[39,21,40,21],[36,24,37,24],[39,6,40,7],[39,8,40,8],[39,9,40,9],[39,10,40,10],[39,11,40,11],[39,12,40,12],[39,13,40,13],[39,14,40,14],[39,15,40,15],[36,18,37,18],[36,12,37,12],[36,13,37,13],[36,14,37,14],[36,15,37,15],[36,16,37,16],[36,17,37,17],[36,19,37,19],[36,20,37,20],[36,21,37,21],[36,22,37,22],[36,23,37,23],[33,20,34,20],[33,21,34,21],[33,22,34,22],[33,23,34,23],[33,24,34,24],[33,15,34,15],[33,16,34,16],[33,17,34,17],[33,18,34,18],[36,6,37,7],[36,8,37,8],[36,9,37,9],[36,10,37,10],[36,11,37,11],[33,10,34,10],[33,11,34,11],[33,12,34,12],[33,13,34,13],[33,14,34,14],[6,1,6,7],[3,1,3,24],[4,1,4,24],[33,1,34,3],[31,6,32,9],[31,10,31,12],[31,13,31,15],[6,10,6,15],[6,18,6,23],[33,19,34,19],[31,16,31,18],[31,19,31,21],[31,22,31,24],[33,6,34,7],[33,8,34,8],[33,9,34,9]]}
[]
[]
[]
[null,"Access to hygiene facilities by wealth quintile (%)"]
[null,{"$f":"IF(ISERROR(INDIRECT(CONCATENATE($E$32,\"!A2\"))),\"\",INDIRECT(CONCATENATE($E$32,\"!A2\")))","v":"Maldives"}]
[]
[null,{"$f":"CONCATENATE(\"National \",IF(ISERROR(INDIRECT(CONCATENATE($E$32,\"!A2\"))),\"\",INDIRECT(CONCATENATE($E$32,\"!A210\"))))","v":"National Access to hygiene facilities "},null,null,null,null,null,null,null,null,{"$f":"CONCATENATE(\"Urban \",IF(ISERROR(INDIRECT(CONCATENATE($E$32,\"!A2\"))),\"\",INDIRECT(CONCATENATE($E$32,\"!A210\"))))","v":"Urban Access to hygiene facilities "},null,null,null,null,null,null,null,{"$f":"CONCATENATE(\"Rural \",IF(ISERROR(INDIRECT(CONCATENATE($E$32,\"!A2\"))),\"\",INDIRECT(CONCATENATE($E$32,\"!A210\"))))","v":"Rural Access to hygiene facilities "}]
[]
[]
[]
[]
[]
[]
[]
[]
[]
[]
[]
[]
[]
[]
[]
[]
[]
[]
[]
[]
[]
[]
[]
[]
[null,null,null,null,{"$f":"INDEX(B88:B100,A88)","v":"DHS17"},null,{"$f":"IF(ISERROR(INDIRECT(CONCATENATE($E$32,\"!A2\"))),\"\",INDIRECT(CONCATENATE($E$32,\"!A2\")))","v":"Maldives"},null,null,null,"Poorest",null,null,"Poor",null,null,"Middle",null,null,"Rich",null,null,"Richest"]
[null,null,null,null,null,null,null,null,null,null,"Basic","Limited","No facility","Basic","Limited","No facility","Basic","Limited","No facility","Basic","Limited","No facility","Basic","Limited","No facility"]
[null,">>>  Select Survey :   ",null,null,null,null,"NATIONAL",null,null,{"$f":"IF(ISERROR(INDIRECT(CONCATENATE(#REF!,\"!A2\"))),\"\",INDIRECT(CONCATENATE(#REF!,\"!A210\")))","v":""},{"$f":"IF(ISERROR(INDIRECT(CONCATENATE($E$32,\"!C222\"))),\"\",INDIRECT(CONCATENATE($E$32,\"!C222\")))","v":86.394351323620242},{"$f":"IF(ISERROR(INDIRECT(CONCATENATE($E$32,\"!C223\"))),\"\",INDIRECT(CONCATENATE($E$32,\"!C223\")))","v":7.9714826177337201},{"$f":"IF(ISERROR(INDIRECT(CONCATENATE($E$32,\"!C224\"))),\"\",INDIRECT(CONCATENATE($E$32,\"!C224\")))","v":5.6341660586459552},{"$f":"IF(ISERROR(INDIRECT(CONCATENATE($E$32,\"!D222\"))),\"\",INDIRECT(CONCATENATE($E$32,\"!D222\")))","v":93.418120084870566},{"$f":"IF(ISERROR(INDIRECT(CONCATENATE($E$32,\"!D223\"))),\"\",INDIRECT(CONCATENATE($E$32,\"!D223\")))","v":4.2465754168800984},{"$f":"IF(ISERROR(INDIRECT(CONCATENATE($E$32,\"!D224\"))),\"\",INDIRECT(CONCATENATE($E$32,\"!D224\")))","v":2.3353044982494184},{"$f":"IF(ISERROR(INDIRECT(CONCATENATE($E$32,\"!E222\"))),\"\",INDIRECT(CONCATENATE($E$32,\"!E222\")))","v":95.97560359283564},{"$f":"IF(ISERROR(INDIRECT(CONCATENATE($E$32,\"!E223\"))),\"\",INDIRECT(CONCATENATE($E$32,\"!E223\")))","v":2.6526368420573667},{"$f":"IF(ISERROR(INDIRECT(CONCATENATE($E$32,\"!E224\"))),\"\",INDIRECT(CONCATENATE($E$32,\"!E224\")))","v":1.3717595651069268},{"$f":"IF(ISERROR(INDIRECT(CONCATENATE($E$32,\"!F222\"))),\"\",INDIRECT(CONCATENATE($E$32,\"!F222\")))","v":96.651494644963009},{"$f":"IF(ISERROR(INDIRECT(CONCATENATE($E$32,\"!F223\"))),\"\",INDIRECT(CONCATENATE($E$32,\"!F223\")))","v":2.1397757640399493},{"$f":"IF(ISERROR(INDIRECT(CONCATENATE($E$32,\"!F224\"))),\"\",INDIRECT(CONCATENATE($E$32,\"!F224\")))","v":1.2087295909970612},{"$f":"IF(ISERROR(INDIRECT(CONCATENATE($E$32,\"!G222\"))),\"\",INDIRECT(CONCATENATE($E$32,\"!G222\")))","v":97.261969049955638},{"$f":"IF(ISERROR(INDIRECT(CONCATENATE($E$32,\"!G223\"))),\"\",INDIRECT(CONCATENATE($E$32,\"!G223\")))","v":1.6119538352351401},{"$f":"IF(ISERROR(INDIRECT(CONCATENATE($E$32,\"!G224\"))),\"\",INDIRECT(CONCATENATE($E$32,\"!G224\")))","v":1.1260771148092474}]
[]
[]
[null,null,null,null,null,null,"URBAN",null,null,{"$f":"IF(ISERROR(INDIRECT(CONCATENATE(#REF!,\"!A2\"))),\"\",INDIRECT(CONCATENATE(#REF!,\"!A210\")))","v":""},{"$f":"IF(ISERROR(INDIRECT(CONCATENATE($E$32,\"!H222\"))),\"\",INDIRECT(CONCATENATE($E$32,\"!H222\")))","v":95.616490947343763},{"$f":"IF(ISERROR(INDIRECT(CONCATENATE($E$32,\"!H223\"))),\"\",INDIRECT(CONCATENATE($E$32,\"!H223\")))","v":3.1698326260107512},{"$f":"IF(ISERROR(INDIRECT(CONCATENATE($E$32,\"!H224\"))),\"\",INDIRECT(CONCATENATE($E$32,\"!H224\")))","v":1.2136764266454898},{"$f":"IF(ISERROR(INDIRECT(CONCATENATE($E$32,\"!I222\"))),\"\",INDIRECT(CONCATENATE($E$32,\"!I222\")))","v":95.249404854897776},{"$f":"IF(ISERROR(INDIRECT(CONCATENATE($E$32,\"!I223\"))),\"\",INDIRECT(CONCATENATE($E$32,\"!I223\")))","v":4.1993204739283332},{"$f":"IF(ISERROR(INDIRECT(CONCATENATE($E$32,\"!I224\"))),\"\",INDIRECT(CONCATENATE($E$32,\"!I224\")))","v":0.55127467117388596},{"$f":"IF(ISERROR(INDIRECT(CONCATENATE($E$32,\"!J222\"))),\"\",INDIRECT(CONCATENATE($E$32,\"!J222\")))","v":97.324411394736074},{"$f":"IF(ISERROR(INDIRECT(CONCATENATE($E$32,\"!J223\"))),\"\",INDIRECT(CONCATENATE($E$32,\"!J223\")))","v":2.2251647537083183},{"$f":"IF(ISERROR(INDIRECT(CONCATENATE($E$32,\"!J224\"))),\"\",INDIRECT(CONCATENATE($E$32,\"!J224\")))","v":0.45042385155558279},{"$f":"IF(ISERROR(INDIRECT(CONCATENATE($E$32,\"!K222\"))),\"\",INDIRECT(CONCATENATE($E$32,\"!K222\")))","v":100},{"$f":"IF(ISERROR(INDIRECT(CONCATENATE($E$32,\"!K223\"))),\"\",INDIRECT(CONCATENATE($E$32,\"!K223\")))","v":0},{"$f":"IF(ISERROR(INDIRECT(CONCATENATE($E$32,\"!K224\"))),\"\",INDIRECT(CONCATENATE($E$32,\"!K224\")))","v":0},{"$f":"IF(ISERROR(INDIRECT(CONCATENATE($E$32,\"!L222\"))),\"\",INDIRECT(CONCATENATE($E$32,\"!L222\")))","v":97.190135733239927},{"$f":"IF(ISERROR(INDIRECT(CONCATENATE($E$32,\"!L223\"))),\"\",INDIRECT(CONCATENATE($E$32,\"!L223\")))","v":2.8098642667600915},{"$f":"IF(ISERROR(INDIRECT(CONCATENATE($E$32,\"!L224\"))),\"\",INDIRECT(CONCATENATE($E$32,\"!L224\")))","v":0}]
[]
[]
[null,null,null,null,null,null,"RURAL",null,null,{"$f":"IF(ISERROR(INDIRECT(CONCATENATE(#REF!,\"!A2\"))),\"\",INDIRECT(CONCATENATE(#REF!,\"!A210\")))","v":""},{"$f":"IF(ISERROR(INDIRECT(CONCATENATE($E$32,\"!M222\"))),\"\",INDIRECT(CONCATENATE($E$32,\"!M222\")))","v":82.19336379228568},{"$f":"IF(ISERROR(INDIRECT(CONCATENATE($E$32,\"!M223\"))),\"\",INDIRECT(CONCATENATE($E$32,\"!M223\")))","v":10.633077673615778},{"$f":"IF(ISERROR(INDIRECT(CONCATENATE($E$32,\"!M224\"))),\"\",INDIRECT(CONCATENATE($E$32,\"!M224\")))","v":7.1735585340984853},{"$f":"IF(ISERROR(INDIRECT(CONCATENATE($E$32,\"!N222\"))),\"\",INDIRECT(CONCATENATE($E$32,\"!N222\")))","v":91.560368781043849},{"$f":"IF(ISERROR(INDIRECT(CONCATENATE($E$32,\"!N223\"))),\"\",INDIRECT(CONCATENATE($E$32,\"!N223\")))","v":4.6713180244040986},{"$f":"IF(ISERROR(INDIRECT(CONCATENATE($E$32,\"!N224\"))),\"\",INDIRECT(CONCATENATE($E$32,\"!N224\")))","v":3.7683131945519808},{"$f":"IF(ISERROR(INDIRECT(CONCATENATE($E$32,\"!O222\"))),\"\",INDIRECT(CONCATENATE($E$32,\"!O222\")))","v":94.388767123962779},{"$f":"IF(ISERROR(INDIRECT(CONCATENATE($E$32,\"!O223\"))),\"\",INDIRECT(CONCATENATE($E$32,\"!O223\")))","v":3.2214141821898243},{"$f":"IF(ISERROR(INDIRECT(CONCATENATE($E$32,\"!O224\"))),\"\",INDIRECT(CONCATENATE($E$32,\"!O224\")))","v":2.3898186938473729},{"$f":"IF(ISERROR(INDIRECT(CONCATENATE($E$32,\"!P222\"))),\"\",INDIRECT(CONCATENATE($E$32,\"!P222\")))","v":94.995805015900174},{"$f":"IF(ISERROR(INDIRECT(CONCATENATE($E$32,\"!P223\"))),\"\",INDIRECT(CONCATENATE($E$32,\"!P223\")))","v":2.8330199364844435},{"$f":"IF(ISERROR(INDIRECT(CONCATENATE($E$32,\"!P224\"))),\"\",INDIRECT(CONCATENATE($E$32,\"!P224\")))","v":2.1711750476154394},{"$f":"IF(ISERROR(INDIRECT(CONCATENATE($E$32,\"!Q222\"))),\"\",INDIRECT(CONCATENATE($E$32,\"!Q222\")))","v":95.533782439817983},{"$f":"IF(ISERROR(INDIRECT(CONCATENATE($E$32,\"!Q223\"))),\"\",INDIRECT(CONCATENATE($E$32,\"!Q223\")))","v":1.6377776613210531},{"$f":"IF(ISERROR(INDIRECT(CONCATENATE($E$32,\"!Q224\"))),\"\",INDIRECT(CONCATENATE($E$32,\"!Q224\")))","v":2.8284398988610016}]
[]
[]
[]
[]
[]
[]
[]
[]
[]
[]
[]
[]
[]
[]
[]
[]
[]
[]
[]
[]
[]
[]
[]
[]
[]
[]
[]
[]
[]
[]
[]
[]
[]
[]
[]
[]
[]
[]
[]
[]
[]
[]
[]
[]
[]
[]
[]
[1,"DHS17"]
[null,"Template"]

{"sheet":"DHS17","index":4,"n_rows":1072,"n_cols":75,"rows_kept":1072,"cut":false,"hidden":false,"merged":[[340,52,341,52],[342,52,343,52],[344,52,345,52],[346,52,347,52],[348,52,349,52],[350,52,351,52],[352,52,353,52],[152,52,162,52],[230,52,235,52],[219,54,219,58],[219,59,219,63],[219,64,219,68],[221,52,223,52],[224,52,225,52],[226,52,229,52],[258,54,258,58],[258,59,258,63],[258,64,258,68],[260,52,262,52],[263,52,266,52],[267,52,269,52],[270,52,272,52],[273,52,275,52],[276,52,283,52],[338,54,338,58],[338,59,338,63],[338,64,338,68],[150,52,151,52],[13,54,13,58],[13,59,13,63],[13,64,13,68],[15,52,16,52],[17,52,20,52],[21,52,22,52],[26,54,26,58],[26,59,26,63],[26,64,26,68],[55,54,55,58],[55,59,55,63],[55,64,55,68],[119,54,119,58],[119,59,119,63],[119,64,119,68],[121,52,122,52],[123,52,126,52],[127,52,128,52],[132,54,132,58],[132,59,132,63],[132,64,132,68],[134,52,138,52],[40,52,41,52],[42,52,43,52],[44,52,45,52],[46,52,48,52],[49,0,51,0],[49,52,51,52],[52,0,54,0],[52,52,54,52],[139,0,142,0],[139,52,142,52],[143,0,146,0],[143,52,146,52],[147,0,149,0],[147,52,149,52],[13,2,13,6],[13,7,13,11],[28,52,29,52],[30,0,31,0],[30,52,31,52],[32,0,33,0],[32,52,33,52],[34,52,35,52],[36,52,37,52],[38,0,39,0],[38,52,39,52],[28,0,29,0],[34,0,35,0],[36,0,37,0],[40,0,41,0],[42,0,43,0],[44,0,45,0],[26,2,26,6],[26,7,26,11],[26,12,26,16],[13,12,13,16],[15,0,16,0],[17,0,20,0],[21,0,22,0],[23,0,25,0],[107,0,107,1],[57,0,65,0],[55,2,55,6],[55,7,55,11],[55,12,55,16],[150,0,151,0],[134,0,138,0],[152,0,161,0],[127,0,128,0],[129,0,131,0],[132,2,132,6],[132,7,132,11],[132,12,132,16],[119,2,119,6],[119,7,119,11],[119,12,119,16],[121,0,122,0],[123,0,126,0],[46,0,48,0],[1024,0,1024,2],[1025,0,1025,1],[1030,0,1032,0],[1033,0,1033,2],[224,0,228,0],[219,2,219,6],[219,7,219,11],[219,12,219,16],[221,0,223,0],[207,0,207,1],[400,2,401,3],[400,7,401,8],[400,12,401,13],[401,1,444,1],[402,2,402,3],[402,7,402,8],[402,12,402,13],[403,2,403,3],[403,7,403,8],[403,12,403,13],[398,2,398,5],[398,7,398,10],[398,12,398,15],[399,2,399,4],[399,7,399,9],[399,12,399,14],[408,2,408,3],[408,7,408,8],[408,12,408,13],[409,2,409,3],[409,7,409,8],[409,12,409,13],[406,2,406,3],[406,7,406,8],[406,12,406,13],[407,2,407,3],[407,7,407,8],[407,12,407,13],[404,2,404,3],[404,7,404,8],[404,12,404,13],[405,2,405,3],[405,7,405,8],[405,12,405,13],[414,2,414,3],[414,7,414,8],[414,12,414,13],[415,2,415,3],[415,7,415,8],[415,12,415,13],[412,2,412,3],[412,7,412,8],[412,12,412,13],[413,2,413,3],[413,7,413,8],[413,12,413,13],[410,2,410,3],[410,7,410,8],[410,12,410,13],[411,2,411,3],[411,7,411,8],[411,12,411,13],[420,2,420,3],[420,7,420,8],[420,12,420,13],[421,2,421,3],[421,7,421,8],[421,12,421,13],[418,2,418,3],[418,7,418,8],[418,12,418,13],[419,2,419,3],[419,7,419,8],[419,12,419,13],[416,2,416,3],[416,7,416,8],[416,12,416,13],[417,2,417,3],[417,7,417,8],[417,12,417,13],[426,2,426,3],[426,7,426,8],[426,12,426,13],[427,2,427,3],[427,7,427,8],[427,12,427,13],[424,2,424,3],[424,7,424,8],[424,12,424,13],[425,2,425,3],[425,7,425,8],[425,12,425,13],[422,2,422,3],[422,7,422,8],[422,12,422,13],[423,2,423,3],[423,7,423,8],[423,12,423,13],[432,2,432,3],[432,7,432,8],[432,12,432,13],[433,2,433,3],[433,7,433,8],[433,12,433,13],[430,2,430,3],[430,7,430,8],[430,12,430,13],[431,2,431,3],[431,7,431,8],[431,12,431,13],[428,2,428,3],[428,7,428,8],[428,12,428,13],[429,2,429,3],[429,7,429,8],[429,12,429,13],[438,2,438,3],[438,7,438,8],[438,12,438,13],[439,2,439,3],[439,7,439,8],[439,12,439,13],[436,2,436,3],[436,7,436,8],[436,12,436,13],[437,2,437,3],[437,7,437,8],[437,12,437,13],[434,2,434,3],[434,7,434,8],[434,12,434,13],[435,2,435,3],[435,7,435,8],[435,12,435,13],[444,2,444,3],[444,7,444,8],[444,12,444,13],[445,2,445,3],[445,7,445,8],[445,12,445,13],[442,2,442,3],[442,7,442,8],[442,12,442,13],[443,2,443,3],[443,7,443,8],[443,12,443,13],[440,2,440,3],[440,7,440,8],[440,12,440,13],[441,2,441,3],[441,7,441,8],[441,12,441,13],[450,2,450,3],[450,7,450,8],[450,12,450,13],[451,2,451,3],[451,7,451,9],[451,12,451,13],[448,2,448,3],[448,7,448,8],[448,12,448,13],[449,2,449,3],[449,7,449,8],[449,12,449,13],[446,2,446,3],[446,7,446,8],[446,12,446,13],[447,2,447,3],[447,7,447,8],[447,12,447,13],[456,2,456,3],[456,7,456,8],[456,12,456,13],[457,2,457,3],[457,7,457,8],[457,12,457,13],[454,2,454,3],[454,7,454,8],[454,12,454,13],[455,2,455,3],[455,7,455,8],[455,12,455,13],[452,2,452,3],[452,7,452,8],[452,12,452,13],[453,2,453,3],[453,7,453,8],[453,12,453,13],[462,2,462,3],[462,7,462,8],[462,12,462,13],[463,2,463,3],[463,7,463,8],[463,12,463,13],[460,2,460,4],[460,7,460,8],[460,12,460,13],[461,2,461,3],[461,7,461,8],[461,12,461,13],[458,2,458,3],[458,7,458,8],[458,12,458,13],[459,2,459,3],[459,7,459,8],[459,12,459,14],[468,2,468,3],[468,7,468,8],[468,12,468,13],[469,2,469,3],[469,7,469,8],[469,12,469,13],[466,2,466,3],[466,7,466,8],[466,12,466,13],[467,2,467,3],[467,7,467,8],[467,12,467,13],[464,2,464,3],[464,7,464,8],[464,12,464,13],[465,2,465,3],[465,7,465,8],[465,12,465,13],[474,2,474,3],[474,7,474,8],[474,12,474,13],[475,2,475,3],[475,7,475,8],[475,12,475,13],[472,2,472,3],[472,7,472,8],[472,12,472,13],[473,2,473,3],[473,7,473,8],[473,12,473,13],[470,2,470,3],[470,7,470,8],[470,12,470,13],[471,2,471,3],[471,7,471,8],[471,12,471,13],[480,2,480,3],[480,7,480,8],[480,12,480,13],[481,2,481,3],[481,7,481,8],[481,12,481,13],[478,2,478,3],[478,7,478,8],[478,12,478,13],[479,2,479,3],[479,7,479,8],[479,12,479,13],[476,2,476,3],[476,7,476,8],[476,12,476,13],[477,2,477,3],[477,7,477,8],[477,12,477,13],[486,2,486,3],[486,7,486,8],[486,12,486,13],[487,2,487,3],[487,7,487,8],[487,12,487,13],[484,2,484,3],[484,7,484,8],[484,12,484,13],[485,2,485,3],[485,7,485,8],[485,12,485,13],[482,2,482,3],[482,7,482,8],[482,12,482,13],[483,2,483,3],[483,7,483,8],[483,12,483,13],[492,2,492,3],[492,7,492,8],[492,12,492,13],[493,2,493,3],[493,7,493,8],[493,12,493,13],[490,2,490,3],[490,7,490,8],[490,12,490,13],[491,2,491,3],[491,7,491,8],[491,12,491,13],[488,2,488,3],[488,7,488,8],[488,12,488,13],[489,2,489,3],[489,7,489,8],[489,12,489,13],[498,2,498,3],[498,7,498,8],[498,12,498,13],[499,2,499,3],[499,7,499,8],[499,12,499,13],[496,2,496,3],[496,7,496,8],[496,12,496,13],[497,2,497,3],[497,7,497,8],[497,12,497,13],[494,2,494,3],[494,7,494,8],[494,12,494,13],[495,2,495,3],[495,7,495,8],[495,12,495,13],[504,2,504,3],[504,7,504,8],[504,12,504,13],[505,2,505,3],[505,7,505,8],[505,12,505,13],[502,2,502,3],[502,7,503,8],[502,9,502,11],[502,12,502,13],[503,2,503,3],[503,12,503,13],[500,2,500,3],[500,7,500,8],[500,12,500,13],[501,2,501,3],[501,7,501,11],[501,12,501,13],[511,2,511,3],[511,7,511,8],[511,12,511,13],[512,2,512,3],[512,7,512,8],[512,12,512,13],[508,2,508,3],[508,7,509,8],[508,12,508,13],[509,2,509,3],[509,12,509,13],[510,2,510,3],[510,7,510,8],[510,12,510,13],[506,2,506,3],[506,7,506,8],[506,12,506,13],[507,2,507,3],[507,7,507,9],[507,12,507,13],[517,2,517,3],[517,7,517,8],[517,12,517,16],[518,2,518,3],[518,7,518,8],[518,12,519,13],[518,14,518,16],[519,2,519,6],[519,7,519,8],[515,2,515,3],[515,7,515,8],[515,12,515,13],[516,2,516,3],[516,7,516,8],[516,12,516,13],[513,2,513,3],[513,7,513,8],[513,12,513,13],[514,2,514,3],[514,7,514,8],[514,12,514,13],[524,2,524,3],[524,7,524,8],[524,12,525,13],[525,2,525,4],[525,7,525,8],[526,2,527,3],[526,7,526,8],[526,12,526,13],[527,7,527,8],[527,12,527,13],[522,2,522,3],[522,7,522,8],[522,12,522,13],[523,2,523,3],[523,7,523,8],[523,12,523,14],[520,2,521,3],[520,4,520,6],[520,7,520,8],[520,12,520,13],[521,7,521,8],[521,12,521,13],[532,2,532,3],[532,7,532,8],[532,12,532,13],[533,2,533,3],[533,7,533,8],[533,12,533,13],[530,2,530,3],[530,7,530,8],[530,12,530,13],[531,2,531,3],[531,7,531,8],[531,12,531,13],[528,2,528,3],[528,7,528,8],[528,12,528,13],[529,2,529,3],[529,7,529,8],[529,12,529,13],[538,2,538,3],[538,7,538,8],[538,12,538,13],[539,2,539,3],[539,7,539,8],[539,12,539,13],[536,2,536,3],[536,7,536,8],[536,12,536,13],[537,2,537,3],[537,7,537,8],[537,12,537,13],[534,2,534,3],[534,7,534,8],[534,12,534,13],[535,2,535,3],[535,7,535,8],[535,12,535,13],[544,2,544,3],[544,7,544,8],[544,12,544,13],[545,2,545,3],[545,7,545,8],[545,12,545,13],[542,2,542,3],[542,7,542,8],[542,12,542,13],[543,2,543,3],[543,7,543,8],[543,12,543,13],[540,2,540,3],[540,7,540,8],[540,12,540,13],[541,2,541,3],[541,7,541,8],[541,12,541,13],[550,2,550,3],[550,7,550,8],[550,12,550,13],[551,2,551,3],[551,7,551,8],[551,12,551,13],[548,2,548,3],[548,7,548,8],[548,12,548,13],[549,2,549,3],[549,7,549,8],[549,12,549,13],[546,2,546,3],[546,7,546,8],[546,12,546,13],[547,2,547,3],[547,7,547,8],[547,12,547,13],[556,2,556,3],[556,7,556,8],[556,12,556,13],[557,2,557,3],[557,7,557,8],[557,12,557,13],[554,2,554,3],[554,7,554,8],[554,12,554,13],[555,2,555,3],[555,7,555,8],[555,12,555,13],[552,2,552,3],[552,7,552,8],[552,12,552,13],[553,2,553,3],[553,7,553,8],[553,12,553,13],[562,2,562,3],[562,7,562,8],[562,12,562,13],[563,2,563,3],[563,7,563,8],[563,12,563,13],[560,2,560,3],[560,7,560,8],[560,12,560,13],[561,2,561,3],[561,7,561,8],[561,12,561,13],[558,2,558,3],[558,7,558,9],[558,12,558,13],[559,2,559,3],[559,7,559,8],[559,12,559,13],[568,2,568,3],[568,7,568,8],[568,12,568,13],[569,2,569,3],[569,7,569,8],[569,12,569,13],[566,2,566,3],[566,7,566,8],[566,12,566,13],[567,2,567,3],[567,7,567,8],[567,12,567,13],[564,2,564,3],[564,7,564,8],[564,12,564,13],[565,2,565,3],[565,7,565,8],[565,12,565,13],[574,2,574,3],[574,7,574,8],[574,12,574,13],[575,2,575,3],[575,7,575,8],[575,12,575,13],[572,2,572,3],[572,7,572,8],[572,12,572,13],[573,2,573,3],[573,7,573,8],[573,12,573,13],[570,2,570,3],[570,7,570,8],[570,12,570,13],[571,2,571,3],[571,7,571,8],[571,12,571,13],[580,2,580,3],[580,7,580,8],[580,12,580,13],[581,2,581,3],[581,7,581,8],[581,12,581,13],[578,2,578,3],[578,7,578,8],[578,12,578,13],[579,2,579,3],[579,7,579,8],[579,12,579,13],[576,2,576,3],[576,7,576,8],[576,12,576,13],[577,2,577,3],[577,7,577,8],[577,12,577,13],[586,2,586,3],[586,7,586,8],[586,12,586,13],[587,2,587,3],[587,7,587,8],[587,12,587,13],[584,2,584,3],[584,7,584,8],[584,12,584,13],[585,2,585,4],[585,7,585,8],[585,12,585,13],[582,2,582,3],[582,7,582,8],[582,12,582,14],[583,2,583,3],[583,7,583,8],[583,12,583,13],[592,2,592,3],[592,7,592,8],[592,12,592,13],[593,2,593,3],[593,7,593,8],[593,12,593,13],[590,2,590,3],[590,7,590,8],[590,12,590,13],[591,2,591,3],[591,7,591,8],[591,12,591,13],[588,2,588,3],[588,7,588,8],[588,12,588,13],[589,2,589,3],[589,7,589,8],[589,12,589,13],[598,2,598,3],[598,7,598,8],[598,12,598,13],[599,2,599,3],[599,7,599,8],[599,12,599,13],[596,2,596,3],[596,7,596,8],[596,12,596,13],[597,2,597,3],[597,7,597,8],[597,12,597,13],[594,2,594,3],[594,7,594,8],[594,12,594,13],[595,2,595,3],[595,7,595,8],[595,12,595,13],[604,2,604,3],[604,7,604,8],[604,12,604,13],[605,2,605,3],[605,7,605,8],[605,12,605,13],[602,2,602,3],[602,7,602,8],[602,12,602,13],[603,2,603,3],[603,7,603,8],[603,12,603,13],[600,2,600,3],[600,7,600,8],[600,12,600,13],[601,2,601,3],[601,7,601,8],[601,12,601,13],[610,2,610,3],[610,7,610,8],[610,12,610,13],[611,2,611,3],[611,7,611,8],[611,12,611,13],[608,2,608,3],[608,7,608,8],[608,12,608,13],[609,2,609,3],[609,7,609,8],[609,12,609,13],[606,2,606,3],[606,7,606,8],[606,12,606,13],[607,2,607,3],[607,7,607,8],[607,12,607,13],[616,2,616,3],[616,7,616,8],[616,12,616,13],[617,2,617,3],[617,7,617,8],[617,12,617,13],[614,2,614,3],[614,7,614,8],[614,12,614,13],[615,2,615,3],[615,7,615,8],[615,12,615,13],[612,2,612,3],[612,7,612,8],[612,12,612,13],[613,2,613,3],[613,7,613,8],[613,12,613,13],[622,2,622,3],[622,7,622,8],[622,12,622,13],[623,2,623,3],[623,7,623,8],[623,12,623,13],[620,2,620,3],[620,7,620,8],[620,12,620,13],[621,2,621,3],[621,7,621,8],[621,12,621,13],[618,2,618,3],[618,7,618,8],[618,12,618,13],[619,2,619,3],[619,7,619,8],[619,12,619,13],[628,2,628,3],[628,7,628,8],[628,12,628,13],[629,2,629,3],[629,7,629,8],[629,12,629,13],[626,2,626,3],[626,7,626,8],[626,12,626,13],[627,2,627,3],[627,7,627,8],[627,12,627,13],[624,2,624,3],[624,7,624,8],[624,12,624,13],[625,2,625,3],[625,7,625,8],[625,12,625,13],[634,2,634,3],[634,7,634,8],[634,12,634,13],[635,2,635,3],[635,7,635,8],[635,12,635,13],[632,2,632,3],[632,7,632,8],[632,12,632,13],[633,2,633,3],[633,7,633,8],[633,12,633,13],[630,2,630,3],[630,7,630,8],[630,12,630,13],[631,2,631,3],[631,7,631,8],[631,12,631,13],[640,2,640,3],[640,7,640,8],[640,12,640,13],[641,2,641,3],[641,7,641,8],[641,12,641,13],[638,2,638,3],[638,7,638,8],[638,12,638,13],[639,2,639,3],[639,7,639,8],[639,12,639,13],[636,2,636,3],[636,7,636,8],[636,12,636,13],[637,2,637,3],[637,7,637,8],[637,12,637,13],[646,2,646,3],[646,7,646,8],[646,12,646,13],[647,2,647,3],[647,7,647,8],[647,12,647,13],[644,2,644,3],[644,7,644,8],[644,12,644,13],[645,2,645,3],[645,7,645,8],[645,12,645,13],[642,2,642,3],[642,7,642,8],[642,12,642,13],[643,2,643,3],[643,7,643,8],[643,12,643,13],[652,2,652,3],[652,7,652,8],[652,12,652,13],[653,2,653,3],[653,7,653,8],[653,12,653,13],[650,2,650,3],[650,7,650,8],[650,12,650,13],[651,2,651,3],[651,7,651,8],[651,12,651,13],[648,2,648,3],[648,7,648,8],[648,12,648,13],[649,2,649,3],[649,7,649,8],[649,12,649,13],[658,2,658,3],[658,7,658,8],[658,12,658,13],[659,2,659,3],[659,7,659,8],[659,12,659,13],[656,2,656,3],[656,7,656,8],[656,12,656,13],[657,2,657,3],[657,7,657,8],[657,12,657,13],[654,2,654,3],[654,7,654,8],[654,12,654,13],[655,2,655,3],[655,7,655,8],[655,12,655,13],[664,2,664,3],[664,7,664,8],[664,12,664,13],[665,2,665,3],[665,7,665,8],[665,12,665,13],[662,2,662,3],[662,7,662,8],[662,12,662,13],[663,2,663,3],[663,7,663,8],[663,12,663,13],[660,2,660,3],[660,7,660,8],[660,12,660,13],[661,2,661,3],[661,7,661,8],[661,12,661,13],[670,2,670,3],[670,7,670,8],[670,12,670,13],[671,2,671,3],[671,7,671,8],[671,12,671,13],[668,2,668,3],[668,7,668,8],[668,12,668,13],[669,2,669,3],[669,7,669,8],[669,12,669,13],[666,2,666,3],[666,7,666,8],[666,12,666,13],[667,2,667,3],[667,7,667,8],[667,12,667,13],[676,2,676,3],[676,7,676,8],[676,12,676,13],[677,2,677,3],[677,7,677,8],[677,12,677,13],[674,2,674,3],[674,7,674,8],[674,12,674,13],[675,2,675,3],[675,7,675,8],[675,12,675,13],[672,2,672,3],[672,7,672,8],[672,12,672,13],[673,2,673,3],[673,7,673,8],[673,12,673,13],[682,2,682,3],[682,7,682,8],[682,12,682,13],[683,2,683,3],[683,7,683,8],[683,12,683,13],[680,2,680,3],[680,7,680,8],[680,12,680,13],[681,2,681,3],[681,7,681,8],[681,12,681,13],[678,2,678,3],[678,7,678,8],[678,12,678,13],[679,2,679,3],[679,7,679,8],[679,12,679,13],[688,2,688,3],[688,7,688,8],[688,12,688,13],[689,2,689,3],[689,7,689,8],[689,12,689,13],[686,2,686,3],[686,7,686,8],[686,12,686,13],[687,2,687,3],[687,7,687,8],[687,12,687,13],[684,2,684,3],[684,7,684,8],[684,12,684,13],[685,2,685,3],[685,7,685,8],[685,12,685,13],[694,2,694,3],[694,7,694,8],[694,12,694,13],[695,2,695,3],[695,7,695,8],[695,12,695,13],[692,2,692,3],[692,7,692,8],[692,12,692,13],[693,2,693,3],[693,7,693,8]],"merged_total":1316,"flags":["merged_cut"]}
[]
[{"$f":"A1026","v":"Maldives"}]
[{"$f":"A1034","v":"2017"}]
["Use of drinking water sources"]
[" by wealth quintile and sub-national region"]
["Notes:"]
["WHO/UNICEF JMP customised wealth index excludes water,"]
[" sanitation and hygiene assets."]
["Survey used for analysis:",{"$f":"A1025","v":"DHS17"}]
[{"$f":"B1028","v":""}]
[{"$f":"B1027","v":""}]
[]
[]
["Use of drinking water sources",null,"NATIONAL wealth index quintile",null,null,null,null,"URBAN wealth index quintile",null,null,null,null,"RURAL wealth index quintile",null,null,null,null,"SUB-REGIONS:",null,null,null,null,null,null,null,null,null,null,null,null,null,null,null,null,null,null,null,null,null,null,null,null,null,null,null,null,null,null,null,null,null,null,"Raw numbers of respondents:","Use of drinking water sources","NATIONAL wealth index quintile",null,null,null,null,"URBAN wealth index quintile",null,null,null,null,"RURAL wealth index quintile",null,null,null,null,"SUB-REGIONS:"]
["Weighted percentage (used in graphs)",null,"Poorest","Poor","Middle","Rich","Richest","1 Poorest","2 Poor","3 Middle","4 Rich","5 Richest","1 Poorest","2 Poor","3 Middle","4 Rich","5 Richest","4 Central Region","1 Malé","3 North Central","2 North Region","5 South Central","6 South Region",null,null,null,null,null,null,null,null,null,null,null,null,null,null,null,null,null,null,null,null,null,null,null,null,null,null,null,null,null,"Water data, raw numbers (weighted)",null,"Poorest","Poor","Middle","Rich","Richest","Poorest","Poor","Middle","Rich","Richest","Poorest","Poor","Middle","Rich","Richest","4 Central Region","1 Malé","3 North Central","2 North Region","5 South Central","6 South Region"]
["Water","1 Improved",98.908884953189869,99.771513036553699,100,99.960745309792756,99.683410967757936,98.732733107546508,100,100,100,99.231692998078984,99.326521111582451,99.706985546339624,99.610401103095455,100,99.933256490527938,100,99.593273402084264,99.873071279013686,100,99.36671293716725,99.480160833581394,null,null,null,null,null,null,null,null,null,null,null,null,null,null,null,null,null,null,null,null,null,null,null,null,null,null,null,null,null,"Water","Improved","N/A","N/A","N/A","N/A","N/A","N/A","N/A","N/A","N/A","N/A","N/A","N/A","N/A","N/A","N/A","N/A","N/A","N/A","N/A","N/A","N/A"]
[null,"2 Not Improved",1.0911150468101274,0.22848696344630848,0,3.9254690207243696E-2,0.31658903224207779,1.267266892453482,0,0,0,0.76830700192101731,0.67347888841754155,0.29301445366037787,0.38959889690453775,0,6.6743509472068085E-2,0,0.40672659791573479,0.12692872098631072,0,0.63328706283275571,0.51983916641859795,null,null,null,null,null,null,null,null,null,null,null,null,null,null,null,null,null,null,null,null,null,null,null,null,null,null,null,null,null,null,"Not Improved","N/A","N/A","N/A","N/A","N/A","N/A","N/A","N/A","N/A","N/A","N/A","N/A","N/A","N/A","N/A","N/A","N/A","N/A","N/A","N/A","N/A"]
["Water ladder","1 Basic",98.721921330931679,99.656136449812848,100,99.90143463148577,99.683410967757936,98.732733107546508,100,100,100,99.231692998078984,99.008028562295465,99.555314660106717,99.565352930443069,99.898771197486752,99.933256490527938,98.988311253990844,99.593273402084264,99.873071279013686,100,99.36671293716725,99.480160833581394,null,null,null,null,null,null,null,null,null,null,null,null,null,null,null,null,null,null,null,null,null,null,null,null,null,null,null,null,null,"Water ladder","Basic","N/A","N/A","N/A","N/A","N/A","N/A","N/A","N/A","N/A","N/A","N/A","N/A","N/A","N/A","N/A","N/A","N/A","N/A","N/A","N/A","N/A"]
[null,"2 Limited",0.18696362225819363,0.1153765867408523,0,5.9310678306993207E-2,0,0,0,0,0,0,0.31849254928697529,0.15167088623290137,4.5048172652390875E-2,0.10122880251325411,0,1.0116887460091843,0,0,0,0,0,null,null,null,null,null,null,null,null,null,null,null,null,null,null,null,null,null,null,null,null,null,null,null,null,null,null,null,null,null,null,"Limited","N/A","N/A","N/A","N/A","N/A","N/A","N/A","N/A","N/A","N/A","N/A","N/A","N/A","N/A","N/A","N/A","N/A","N/A","N/A","N/A","N/A"]
[null,"3 Other unimproved",1.0911150468101274,0.22848696344630848,0,3.9254690207243696E-2,0.31658903224207779,1.267266892453482,0,0,0,0.76830700192101731,0.67347888841754155,0.29301445366037787,0.38959889690453775,0,6.6743509472068085E-2,0,0.40672659791573479,0.12692872098631072,0,0.63328706283275571,0.51983916641859795,null,null,null,null,null,null,null,null,null,null,null,null,null,null,null,null,null,null,null,null,null,null,null,null,null,null,null,null,null,null,"Unimproved","N/A","N/A","N/A","N/A","N/A","N/A","N/A","N/A","N/A","N/A","N/A","N/A","N/A","N/A","N/A","N/A","N/A","N/A","N/A","N/A","N/A"]
[null,"4 Surface water",0,0,0,0,0,0,0,0,0,0,0,0,0,0,0,0,0,0,0,0,0,null,null,null,null,null,null,null,null,null,null,null,null,null,null,null,null,null,null,null,null,null,null,null,null,null,null,null,null,null,null,"Surface water","N/A","N/A","N/A","N/A","N/A","N/A","N/A","N/A","N/A","N/A","N/A","N/A","N/A","N/A","N/A","N/A","N/A","N/A","N/A","N/A","N/A"]
["Improved water point at more than 30 minutes","1 Yes",0.18902611463740288,0.11564081091822401,0,5.9333969672975995E-2,0,0,0,0,0,0,0.32065207330596412,0.15211660988628639,4.5224366284567621E-2,0.10122880251325411,0,1.0116887460091843,0,0,0,0,0,null,null,null,null,null,null,null,null,null,null,null,null,null,null,null,null,null,null,null,null,null,null,null,null,null,null,null,null,null,"Improved water point at more than 30 minutes","Yes","N/A","N/A","N/A","N/A","N/A","N/A","N/A","N/A","N/A","N/A","N/A","N/A","N/A","N/A","N/A","N/A","N/A","N/A","N/A","N/A","N/A"]
[null,"2 No",99.8109738853626,99.884359189081778,100,99.940666030327023,100,100,100,100,100,100,99.679347926694021,99.847883390113708,99.954775633715428,99.898771197486752,100,98.988311253990844,100,100,100,100,100,null,null,null,null,null,null,null,null,null,null,null,null,null,null,null,null,null,null,null,null,null,null,null,null,null,null,null,null,null,null,"No","N/A","N/A","N/A","N/A","N/A","N/A","N/A","N/A","N/A","N/A","N/A","N/A","N/A","N/A","N/A","N/A","N/A","N/A","N/A","N/A","N/A"]
["Manually calculated ratios","Improved wells"]
[null,"Improved springs"]
[null,"Other"]
[null,null,"NATIONAL wealth index quintile",null,null,null,null,"URBAN wealth index quintile",null,null,null,null,"RURAL wealth index quintile",null,null,null,null,"SUB-REGIONS:",null,null,null,null,null,null,null,null,null,null,null,null,null,null,null,null,null,null,null,null,null,null,null,null,null,null,null,null,null,null,null,null,null,null,"Raw numbers of respondents:","Use of drinking water sources","NATIONAL wealth index quintile",null,null,null,null,"URBAN wealth index quintile",null,null,null,null,"RURAL wealth index quintile",null,null,null,null,"SUB-REGIONS:"]
["Percentage based on weighted population",null,"Poorest","Poor","Middle","Rich","Richest","1 Poorest","2 Poor","3 Middle","4 Rich","5 Richest","1 Poorest","2 Poor","3 Middle","4 Rich","5 Richest","4 Central Region","1 Malé","3 North Central","2 North Region","5 South Central","6 South Region",null,null,null,null,null,null,null,null,null,null,null,null,null,null,null,null,null,null,null,null,null,null,null,null,null,null,null,null,null,"Water data, raw numbers (weighted)",null,"Poorest","Poor","Middle","Rich","Richest","Poorest","Poor","Middle","Rich","Richest","Poorest","Poor","Middle","Rich","Richest","4 Central Region","1 Malé","3 North Central","2 North Region","5 South Central","6 South Region"]
["Piped water","1 Yes",29.694612546811644,38.826741025333753,49.239453049701012,57.315240314471247,68.221310429728192,97.193168700823406,98.193043772254924,99.755629427729403,97.69413327698679,99.231692998078984,10.892418677633298,10.901786034565058,13.256945470356593,17.514514775795035,15.572788746799016,9.5470122815725951,98.407861208213191,19.372496781483566,10.51105232105115,11.843023273764112,15.068662331012842,null,null,null,null,null,null,null,null,null,null,null,null,null,null,null,null,null,null,null,null,null,null,null,null,null,null,null,null,null,"Piped water","Yes","N/A","N/A","N/A","N/A","N/A","N/A","N/A","N/A","N/A","N/A","N/A","N/A","N/A","N/A","N/A","N/A","N/A","N/A","N/A","N/A","N/A"]
[null,"2 No",70.305387453188288,61.17325897466619,50.760546950298803,42.684759685528697,31.778689570271702,2.8068312991765794,1.8069562277450903,0.24437057227059783,2.3058667230131809,0.76830700192101731,89.10758132236657,89.098213965434937,86.743054529643445,82.485485224204993,84.427211253201051,90.452987718427465,1.5921387917868359,80.627503218516495,89.488947678948975,88.156976726235825,84.931337668987268,null,null,null,null,null,null,null,null,null,null,null,null,null,null,null,null,null,null,null,null,null,null,null,null,null,null,null,null,null,null,"No","N/A","N/A","N/A","N/A","N/A","N/A","N/A","N/A","N/A","N/A","N/A","N/A","N/A","N/A","N/A","N/A","N/A","N/A","N/A","N/A","N/A"]
["Piped water on premises","Yes",29.509636036037652,38.802521999180577,49.239453049701012,57.117333128059322,68.221310429728192,97.193168700823406,98.193043772254924,99.755629427729403,97.69413327698679,99.231692998078984,10.728255835937299,10.750762840360348,13.215648996671364,17.176735676632639,15.572788746799016,9.5470122815725951,98.407861208213191,19.323647050122219,10.41082927074733,11.652446634255453,14.794542465394661,null,null,null,null,null,null,null,null,null,null,null,null,null,null,null,null,null,null,null,null,null,null,null,null,null,null,null,null,null,"Piped water on premises","Yes","N/A","N/A","N/A","N/A","N/A","N/A","N/A","N/A","N/A","N/A","N/A","N/A","N/A","N/A","N/A","N/A","N/A","N/A","N/A","N/A","N/A"]
[null,"No",70.490363963962295,61.197478000819359,50.760546950298803,42.882666871940614,31.778689570271702,2.8068312991765794,1.8069562277450903,0.24437057227059783,2.3058667230131809,0.76830700192101731,89.271744164062568,89.249237159639648,86.78435100332868,82.823264323367383,84.427211253201051,90.452987718427465,1.5921387917868359,80.676352949877838,89.589170729252785,88.347553365744474,85.205457534605458,null,null,null,null,null,null,null,null,null,null,null,null,null,null,null,null,null,null,null,null,null,null,null,null,null,null,null,null,null,null,"No","N/A","N/A","N/A","N/A","N/A","N/A","N/A","N/A","N/A","N/A","N/A","N/A","N/A","N/A","N/A","N/A","N/A","N/A","N/A","N/A","N/A"]
["Piped water into dwelling","Yes","N/A","N/A","N/A","N/A","N/A","N/A","N/A","N/A","N/A","N/A","N/A","N/A","N/A","N/A","N/A","N/A","N/A","N/A","N/A","N/A","N/A",null,null,null,null,null,null,null,null,null,null,null,null,null,null,null,null,null,null,null,null,null,null,null,null,null,null,null,null,null,"Piped water into dwelling","Yes","N/A","N/A","N/A","N/A","N/A","N/A","N/A","N/A","N/A","N/A","N/A","N/A","N/A","N/A","N/A","N/A","N/A","N/A","N/A","N/A","N/A"]
[null,"No","N/A","N/A","N/A","N/A","N/A","N/A","N/A","N/A","N/A","N/A","N/A","N/A","N/A","N/A","N/A","N/A","N/A","N/A","N/A","N/A","N/A",null,null,null,null,null,null,null,null,null,null,null,null,null,null,null,null,null,null,null,null,null,null,null,null,null,null,null,null,null,null,"No","N/A","N/A","N/A","N/A","N/A","N/A","N/A","N/A","N/A","N/A","N/A","N/A","N/A","N/A","N/A","N/A","N/A","N/A","N/A","N/A","N/A"]
["Water source on premises","1 Yes",93.573337174585987,97.235071239059351,98.422890954532832,99.002288791234577,99.491776017207371,100,100,100,99.502522481557918,100,90.91627526644838,95.995729780375115,96.290899328226146,97.829247760930272,98.403318956088,92.378938594626987,99.899627637807981,96.650736658261778,97.564161647573158,96.068997667752214,95.337744428708902,null,null,null,null,null,null,null,null,null,null,null,null,null,null,null,null,null,null,null,null,null,null,null,null,null,null,null,null,null,"Water source on premises","Yes","N/A","N/A","N/A","N/A","N/A","N/A","N/A","N/A","N/A","N/A","N/A","N/A","N/A","N/A","N/A","N/A","N/A","N/A","N/A","N/A","N/A"]
[null,"2 No",6.4266628254140326,2.7649287609405802,1.5771090454671604,0.9977112087654495,0.50822398279261927,0,0,0,0.49747751844207383,0,9.0837247335515396,4.0042702196248596,3.7091006717738337,2.1707522390697291,1.5966810439120047,7.6210614053729895,0.10037236219202463,3.3492633417382698,2.4358383524268583,3.9310023322478118,4.662255571291098,null,null,null,null,null,null,null,null,null,null,null,null,null,null,null,null,null,null,null,null,null,null,null,null,null,null,null,null,null,null,"No","N/A","N/A","N/A","N/A","N/A","N/A","N/A","N/A","N/A","N/A","N/A","N/A","N/A","N/A","N/A","N/A","N/A","N/A","N/A","N/A","N/A"]
["Improved Water source on premises","1 Yes",94.07596709041043,97.398128363267915,98.422890954532832,99.041167094555178,99.490161925782189,100,100,100,99.502522481557918,100,91.532728871389651,96.277837760685628,96.565688977693497,97.829247760930272,98.469040649560995,92.378938594626987,99.89921772950791,96.773570113059066,97.564161647573158,96.582096511057742,95.835937165600015,null,null,null,null,null,null,null,null,null,null,null,null,null,null,null,null,null,null,null,null,null,null,null,null,null,null,null,null,null,"Improved water source on premises","Yes","N/A","N/A","N/A","N/A","N/A","N/A","N/A","N/A","N/A","N/A","N/A","N/A","N/A","N/A","N/A","N/A","N/A","N/A","N/A","N/A","N/A"]
[null,"2 No",5.9240329095895419,2.6018716367320125,1.5771090454671604,0.95883290544484345,0.50983807421778693,0,0,0,0.49747751844207383,0,8.467271128610264,3.7221622393143616,3.4343110223064741,2.1707522390697291,1.5309593504390104,7.6210614053729895,0.10078227049209935,3.2264298869409727,2.4358383524268583,3.4179034889422693,4.1640628343999921,null,null,null,null,null,null,null,null,null,null,null,null,null,null,null,null,null,null,null,null,null,null,null,null,null,null,null,null,null,null,"No","N/A","N/A","N/A","N/A","N/A","N/A","N/A","N/A","N/A","N/A","N/A","N/A","N/A","N/A","N/A","N/A","N/A","N/A","N/A","N/A","N/A"]
["Piped water on premises available when needed","Yes","N/A","N/A","N/A","N/A","N/A","N/A","N/A","N/A","N/A","N/A","N/A","N/A","N/A","N/A","N/A","N/A","N/A","N/A","N/A","N/A","N/A",null,null,null,null,null,null,null,null,null,null,null,null,null,null,null,null,null,null,null,null,null,null,null,null,null,null,null,null,null,"Piped water on premises available when needed","Yes","N/A","N/A","N/A","N/A","N/A","N/A","N/A","N/A","N/A","N/A","N/A","N/A","N/A","N/A","N/A","N/A","N/A","N/A","N/A","N/A","N/A"]
[null,"No","N/A","N/A","N/A","N/A","N/A","N/A","N/A","N/A","N/A","N/A","N/A","N/A","N/A","N/A","N/A","N/A","N/A","N/A","N/A","N/A","N/A",null,null,null,null,null,null,null,null,null,null,null,null,null,null,null,null,null,null,null,null,null,null,null,null,null,null,null,null,null,null,"No","N/A","N/A","N/A","N/A","N/A","N/A","N/A","N/A","N/A","N/A","N/A","N/A","N/A","N/A","N/A","N/A","N/A","N/A","N/A","N/A","N/A"]
["Water point at more than 30 minutes","1 Yes",0.18696362225819363,0.1153765867408523,0,5.9310678306993207E-2,0,0,0,0,0,0,0.31849254928697529,0.15167088623290137,4.5048172652390875E-2,0.10122880251325411,0,1.0116887460091843,0,0,0,0,0,null,null,null,null,null,null,null,null,null,null,null,null,null,null,null,null,null,null,null,null,null,null,null,null,null,null,null,null,null,"Water point at more than 30 minutes","Yes","N/A","N/A","N/A","N/A","N/A","N/A","N/A","N/A","N/A","N/A","N/A","N/A","N/A","N/A","N/A","N/A","N/A","N/A","N/A","N/A","N/A"]
[null,"2 No",99.81303637774181,99.884623413259149,100,99.940689321693014,100,100,100,100,100,100,99.681507450712999,99.848329113767093,99.9549518273476,99.898771197486752,100,98.988311253990844,100,100,100,100,100,null,null,null,null,null,null,null,null,null,null,null,null,null,null,null,null,null,null,null,null,null,null,null,null,null,null,null,null,null,null,"No","N/A","N/A","N/A","N/A","N/A","N/A","N/A","N/A","N/A","N/A","N/A","N/A","N/A","N/A","N/A","N/A","N/A","N/A","N/A","N/A","N/A"]
["Water source available when needed","1 Yes",81.584451542799002,85.851913388536843,85.697821713695987,83.852275274869399,76.676197171403871,80.186602157266677,87.276287396633549,84.96094868586745,73.924828482242049,78.077922363620289,90.0166376140441,94.32297923352435,86.545523218238671,87.571723008052217,89.235766651034282,93.355611905330306,80.882166472438882,96.535345562390489,92.506018163900691,73.076293222012026,88.578798206310537,null,null,null,null,null,null,null,null,null,null,null,null,null,null,null,null,null,null,null,null,null,null,null,null,null,null,null,null,null,"Water source available when needed","Yes","N/A","N/A","N/A","N/A","N/A","N/A","N/A","N/A","N/A","N/A","N/A","N/A","N/A","N/A","N/A","N/A","N/A","N/A","N/A","N/A","N/A"]
[null,"2 No",18.415548457201016,14.148086611463196,14.302178286303999,16.14772472513063,23.323802828596087,19.813397842733323,12.723712603366439,15.039051314132543,26.075171517757962,21.9220776363798,9.9833623859559104,5.677020766475648,13.454476781761318,12.428276991947762,10.764233348965709,6.6443880946696812,19.117833527561086,3.4646544376095418,7.4939818360992794,26.923706777987988,11.421201793689463,null,null,null,null,null,null,null,null,null,null,null,null,null,null,null,null,null,null,null,null,null,null,null,null,null,null,null,null,null,null,"No","N/A","N/A","N/A","N/A","N/A","N/A","N/A","N/A","N/A","N/A","N/A","N/A","N/A","N/A","N/A","N/A","N/A","N/A","N/A","N/A","N/A"]
["Improved water source available when needed","1 Yes",81.584451542799002,85.851913388536843,85.697821713695987,83.852275274869399,76.676197171403871,80.186602157266677,87.276287396633549,84.96094868586745,73.924828482242049,78.077922363620289,90.0166376140441,94.32297923352435,86.545523218238671,87.571723008052217,89.235766651034282,93.355611905330306,80.882166472438882,96.535345562390489,92.506018163900691,73.076293222012026,88.578798206310537,null,null,null,null,null,null,null,null,null,null,null,null,null,null,null,null,null,null,null,null,null,null,null,null,null,null,null,null,null,"Improved water source available when needed","Yes","N/A","N/A","N/A","N/A","N/A","N/A","N/A","N/A","N/A","N/A","N/A","N/A","N/A","N/A","N/A","N/A","N/A","N/A","N/A","N/A","N/A"]
[null,"2 No",18.415548457201016,14.148086611463196,14.302178286303999,16.14772472513063,23.323802828596087,19.813397842733323,12.723712603366439,15.039051314132543,26.075171517757962,21.9220776363798,9.9833623859559104,5.677020766475648,13.454476781761318,12.428276991947762,10.764233348965709,6.6443880946696812,19.117833527561086,3.4646544376095418,7.4939818360992794,26.923706777987988,11.421201793689463,null,null,null,null,null,null,null,null,null,null,null,null,null,null,null,null,null,null,null,null,null,null,null,null,null,null,null,null,null,null,"No","N/A","N/A","N/A","N/A","N/A","N/A","N/A","N/A","N/A","N/A","N/A","N/A","N/A","N/A","N/A","N/A","N/A","N/A","N/A","N/A","N/A"]
["Microbiological quality at point of collection","Not contaminated (No E. coli in 100 mL)","N/A","N/A","N/A","N/A","N/A","N/A","N/A","N/A","N/A","N/A","N/A","N/A","N/A","N/A","N/A","N/A","N/A","N/A","N/A","N/A","N/A",null,null,null,null,null,null,null,null,null,null,null,null,null,null,null,null,null,null,null,null,null,null,null,null,null,null,null,null,null,"Microbiological quality at point of collection","Not contaminated (No E. coli in 100 mL)","N/A","N/A","N/A","N/A","N/A","N/A","N/A","N/A","N/A","N/A","N/A","N/A","N/A","N/A","N/A","N/A","N/A","N/A","N/A","N/A","N/A"]
[null,"Contaminated (E. coli detected in 100 mL)","N/A","N/A","N/A","N/A","N/A","N/A","N/A","N/A","N/A","N/A","N/A","N/A","N/A","N/A","N/A","N/A","N/A","N/A","N/A","N/A","N/A",null,null,null,null,null,null,null,null,null,null,null,null,null,null,null,null,null,null,null,null,null,null,null,null,null,null,null,null,null,null,"Contaminated (E. coli detected in 100 mL)","N/A","N/A","N/A","N/A","N/A","N/A","N/A","N/A","N/A","N/A","N/A","N/A","N/A","N/A","N/A","N/A","N/A","N/A","N/A","N/A","N/A"]
[null,"Highly contaminated (>100 CFU/100 mL)","N/A","N/A","N/A","N/A","N/A","N/A","N/A","N/A","N/A","N/A","N/A","N/A","N/A","N/A","N/A","N/A","N/A","N/A","N/A","N/A","N/A",null,null,null,null,null,null,null,null,null,null,null,null,null,null,null,null,null,null,null,null,null,null,null,null,null,null,null,null,null,null,"Highly contaminated (>100 CFU/100 mL)","N/A","N/A","N/A","N/A","N/A","N/A","N/A","N/A","N/A","N/A","N/A","N/A","N/A","N/A","N/A","N/A","N/A","N/A","N/A","N/A","N/A"]
["Microbiological quality of improved water sources at point of collection","Not contaminated (No E. coli in 100 mL)","N/A","N/A","N/A","N/A","N/A","N/A","N/A","N/A","N/A","N/A","N/A","N/A","N/A","N/A","N/A","N/A","N/A","N/A","N/A","N/A","N/A",null,null,null,null,null,null,null,null,null,null,null,null,null,null,null,null,null,null,null,null,null,null,null,null,null,null,null,null,null,"Microbiological quality of improved water sources at point of collection","Not contaminated (No E. coli in 100 mL)","N/A","N/A","N/A","N/A","N/A","N/A","N/A","N/A","N/A","N/A","N/A","N/A","N/A","N/A","N/A","N/A","N/A","N/A","N/A","N/A","N/A"]
[null,"Contaminated (E. coli detected in 100 mL)","N/A","N/A","N/A","N/A","N/A","N/A","N/A","N/A","N/A","N/A","N/A","N/A","N/A","N/A","N/A","N/A","N/A","N/A","N/A","N/A","N/A",null,null,null,null,null,null,null,null,null,null,null,null,null,null,null,null,null,null,null,null,null,null,null,null,null,null,null,null,null,null,"Contaminated (E. coli detected in 100 mL)","N/A","N/A","N/A","N/A","N/A","N/A","N/A","N/A","N/A","N/A","N/A","N/A","N/A","N/A","N/A","N/A","N/A","N/A","N/A","N/A","N/A"]
[null,"Highly contaminated (>100 CFU/100 mL)","N/A","N/A","N/A","N/A","N/A","N/A","N/A","N/A","N/A","N/A","N/A","N/A","N/A","N/A","N/A","N/A","N/A","N/A","N/A","N/A","N/A",null,null,null,null,null,null,null,null,null,null,null,null,null,null,null,null,null,null,null,null,null,null,null,null,null,null,null,null,null,null,"Highly contaminated (>100 CFU/100 mL)","N/A","N/A","N/A","N/A","N/A","N/A","N/A","N/A","N/A","N/A","N/A","N/A","N/A","N/A","N/A","N/A","N/A","N/A","N/A","N/A","N/A"]
["Microbiological quality of piped on premises at point of collection","Not contaminated (No E. coli in 100 mL)","N/A","N/A","N/A","N/A","N/A","N/A","N/A","N/A","N/A","N/A","N/A","N/A","N/A","N/A","N/A","N/A","N/A","N/A","N/A","N/A","N/A",null,null,null,null,null,null,null,null,null,null,null,null,null,null,null,null,null,null,null,null,null,null,null,null,null,null,null,null,null,"Microbiological quality of piped on premises at point of collection","Not contaminated (No E. coli in 100 mL)","N/A","N/A","N/A","N/A","N/A","N/A","N/A","N/A","N/A","N/A","N/A","N/A","N/A","N/A","N/A","N/A","N/A","N/A","N/A","N/A","N/A"]
[null,"Contaminated (E. coli detected in 100 mL)","N/A","N/A","N/A","N/A","N/A","N/A","N/A","N/A","N/A","N/A","N/A","N/A","N/A","N/A","N/A","N/A","N/A","N/A","N/A","N/A","N/A",null,null,null,null,null,null,null,null,null,null,null,null,null,null,null,null,null,null,null,null,null,null,null,null,null,null,null,null,null,null,"Contaminated (E. coli detected in 100 mL)","N/A","N/A","N/A","N/A","N/A","N/A","N/A","N/A","N/A","N/A","N/A","N/A","N/A","N/A","N/A","N/A","N/A","N/A","N/A","N/A","N/A"]
[null,"Highly contaminated (>100 CFU/100 mL)","N/A","N/A","N/A","N/A","N/A","N/A","N/A","N/A","N/A","N/A","N/A","N/A","N/A","N/A","N/A","N/A","N/A","N/A","N/A","N/A","N/A",null,null,null,null,null,null,null,null,null,null,null,null,null,null,null,null,null,null,null,null,null,null,null,null,null,null,null,null,null,null,"Highly contaminated (>100 CFU/100 mL)","N/A","N/A","N/A","N/A","N/A","N/A","N/A","N/A","N/A","N/A","N/A","N/A","N/A","N/A","N/A","N/A","N/A","N/A","N/A","N/A","N/A"]
[null,null,"NATIONAL wealth index quintile",null,null,null,null,"URBAN wealth index quintile",null,null,null,null,"RURAL wealth index quintile",null,null,null,null,"SUB-REGIONS:",null,null,null,null,null,null,null,null,null,null,null,null,null,null,null,null,null,null,null,null,null,null,null,null,null,null,null,null,null,null,null,null,null,null,"Raw numbers of respondents:","Use of drinking water sources","NATIONAL wealth index quintile",null,null,null,null,"URBAN wealth index quintile",null,null,null,null,"RURAL wealth index quintile",null,null,null,null,"SUB-REGIONS:"]
["Percentage based on weighted population",null,"Poorest","Poor","Middle","Rich","Richest","1 Poorest","2 Poor","3 Middle","4 Rich","5 Richest","1 Poorest","2 Poor","3 Middle","4 Rich","5 Richest","4 Central Region","1 Malé","3 North Central","2 North Region","5 South Central","6 South Region",null,null,null,null,null,null,null,null,null,null,null,null,null,null,null,null,null,null,null,null,null,null,null,null,null,null,null,null,null,"Water data, raw numbers (weighted)",null,"Poorest","Poor","Middle","Rich","Richest","Poorest","Poor","Middle","Rich","Richest","Poorest","Poor","Middle","Rich","Richest","4 Central Region","1 Malé","3 North Central","2 North Region","5 South Central","6 South Region"]
["Source of drinking water","11 Piped into dwelling",13.369531629492343,14.569757131813118,13.763780734887032,17.878550894921634,19.243663627490477,35.175620771694518,20.891628014732476,30.514779868716328,26.664132559240944,22.140283077291016,6.9088876590958135,7.2725480296477132,7.8336522781550677,9.0489777465303742,7.9905720630188126,7.2006401591629299,27.060539052499195,16.651103595417077,3.1902920404723814,5.3181724946206224,6.853341451446104]
[null,"12 Piped to yard/plot",2.3848219763485936,1.8035817373846619,2.9316627530372998,2.2247253882078084,1.9766037775865348,0,0,0,0,0,2.8476184248666563,2.5070062401909099,3.9361310560724299,5.7261498901079761,4.279033009074019,0,0,0.53953464423278774,6.0057915553572494,4.8920017647406588,5.7942899216931636]
[null,"14 Public tap/standpipe",0.18497651077398689,2.4219026153173631E-2,0,0.19790718641192656,0,0,0,0,0,0,0.16416284169600168,0.15102319420470894,4.1296473685230053E-2,0.33777909916239351,0,0,0,4.8849731361351609E-2,0.10022305030381992,0.19057663950865827,0.27411986561818436]
[null,"31 Protected well",0.40467802142606785,0.72204340034628689,0.1487811533850962,0.29924585045571828,0.80574092597071933,0,0,0,0,0,0.68936905012680405,0.2698618536363383,1.0000179382720626,0.36401403842300417,1.7310494473110087,0.12709742874405228,0,0,1.2964245558247176,0.40853716422710912,1.7398697441257236]
[null,"32 Unprotected well",0,5.9484901742201876E-2,0,0,0,0,0,0,0,0,0,0,0.10142920957800097,0,0,0,0,0,0,9.8543078911631915E-2,0]
[null,"51 Rainwater (tank in compoud)",62.737267117601334,54.02449492335014,45.219351304885514,36.724131814776342,25.84160684463593,0,0,0,1.8083892045711067,0,81.418659120005174,80.043758879227354,77.775020262860323,72.375637087938529,69.780100818061015,81.895284378086814,0.36486532455535209,72.69868990787586,83.56732912191795,80.200417186215404,66.744909074827348]
[null,"52 Rainwater (public or community tank)",1.1588670326376649,0.60689533469221124,0.28600688876924674,0.22875721457262282,0.2760181260388595,0,0,0,0,0,1.2856308142272836,1.3884081992063533,0.40940097142817655,0.70102513888521145,0.57244405827610267,2.1885065366545406,0,0.65647205335427872,0.25227338490247431,0.96632846730833233,0.87152036959916956]
[null,"71 Bottled water",18.668742664909864,28.020521482814065,37.65041716503562,42.407426960446699,51.539777666035306,63.557112335852004,79.108371985267539,69.485220131283668,71.527478236187946,77.091409920788038,6.0121932015645898,8.0743791502263225,8.6148821226222001,11.446416998952568,15.580057094786978,8.588471497351712,72.167869025029674,9.2784213467724523,5.587666291221514,7.3906792205463798,17.20211040627181]
[null,"96 Other",1.0911150468101274,0.16900206170410659,0,3.9254690207243696E-2,0.31658903224207779,1.267266892453482,0,0,0,0.76830700192101731,0.67347888841754155,0.29301445366037787,0.28816968732653681,0,6.6743509472068085E-2,0,0.40672659791573479,0.12692872098631072,0,0.53474398392112388,0.51983916641859795]
[]
[]
[]
[]
[]
[]
[]
[]
[]
[]
[]
[]
[]
[]
[]
[]
[]
[]
[]
[]
[]
[]
[]
[]
[]
[]
[]
[]
[]
[]
[]
[]
[]
[]
[]
[]
[]
[]
[]
[]
[]
[{"$f":"A1026","v":"Maldives"}]
[{"$f":"A1034","v":"2017"}]
["Use of sanitation facilities"]
[" by wealth quintile and sub-national region"]
["Notes:"]
["WHO/UNICEF JMP customised wealth index excludes water,"]
[" sanitation and hygiene assets."]
["Survey used for analysis:",{"$f":"A1025","v":"DHS17"}]
[{"$f":"B1030","v":""}]
[{"$f":"B1029","v":""}]
[]
[]
["Use of sanitation facilities",null,"NATIONAL wealth index quintile",null,null,null,null,"URBAN wealth index quintile",null,null,null,null,"RURAL wealth index quintile",null,null,null,null,"SUB-REGIONS:",null,null,null,null,null,null,null,null,null,null,null,null,null,null,null,null,null,null,null,null,null,null,null,null,null,null,null,null,null,null,null,null,null,null,"Raw numbers of respondents:","Use of sanitation facilities","NATIONAL wealth index quintile",null,null,null,null,"URBAN wealth index quintile",null,null,null,null,"RURAL wealth index quintile",null,null,null,null,"SUB-REGIONS:"]
["Weighted percentage (used in graphs)",null,"Poorest","Poor","Middle","Rich","Richest","1 Poorest","2 Poor","3 Middle","4 Rich","5 Richest","1 Poorest","2 Poor","3 Middle","4 Rich","5 Richest","4 Central Region","1 Malé","3 North Central","2 North Region","5 South Central","6 South Region",null,null,null,null,null,null,null,null,null,null,null,null,null,null,null,null,null,null,null,null,null,null,null,null,null,null,null,null,null,"Sanitation data, raw numbers (weighted)",null,"Poorest","Poor","Middle","Rich","Richest","Poorest","Poor","Middle","Rich","Richest","Poorest","Poor","Middle","Rich","Richest","4 Central Region","1 Malé","3 North Central","2 North Region","5 South Central","6 South Region"]
["Sanitation","1 Improved",98.339163656092069,98.85502497892638,99.378665152292555,99.480760814040835,99.239627066549957,100,100,100,99.009122743460154,100,97.554527938875395,98.567592287997684,98.309021450147128,99.095915861095335,99.1553140462687,92.676547395641194,99.800078019218404,98.68973372837371,99.606588020798668,99.25806694259154,99.753562903457791,null,null,null,null,null,null,null,null,null,null,null,null,null,null,null,null,null,null,null,null,null,null,null,null,null,null,null,null,null,"Sanitation","Improved",6539.5586540000049,6576.1725140000017,6611.0867280000075,6617.1510509999998,6603.6711660000037,2748.8965590000003,2769.1658619999994,2711.3502000000003,2745.6480419999989,2741.9617349999985,3808.2653140000034,3845.8117690000004,3835.4076319999986,3862.0376009999991,3879.0953989999994,2203.4393339999988,13717.022398000008,3995.8167629999875,4255.0058920000001,3985.8493649999978,4790.5063609999916]
[null,"2 Not Improved",1.6608363439079319,1.1449750210735874,0.62133484770742853,0.51923918595915497,0.7603729334500231,0,0,0,0.99087725653983216,0,2.4454720611245611,1.4324077120023162,1.6909785498528829,0.90408413890470229,0.84468595373132416,7.3234526043588142,0.19992198078160275,1.3102662716262836,0.39341197920134641,0.74193305740848947,0.2464370965421831,null,null,null,null,null,null,null,null,null,null,null,null,null,null,null,null,null,null,null,null,null,null,null,null,null,null,null,null,null,null,"Not Improved",110.44568899999997,76.167632999999995,41.333807,34.538176999999997,50.597256000000002,0,0,0,27.478278,0,95.464624999999984,55.888251999999994,65.97148399999999,35.23462,33.045303000000004,174.11938599999999,27.478278,53.050947999999998,16.805819,29.793380999999997,11.83475]
["Sanitation ladder","1 Basic",97.356520688816659,98.191888488230035,98.651965844188751,99.041429269852216,98.928749105396392,98.306214184467606,98.997810771076161,100,99.009122743460154,99.421704365980162,96.987688317647198,97.777984992865214,97.978402491658812,98.064892039267207,98.860673186493216,92.137646762305849,99.144038566599718,98.071366007146878,99.09920348546936,98.72684787383227,98.989616275094278,null,null,null,null,null,null,null,null,null,null,null,null,null,null,null,null,null,null,null,null,null,null,null,null,null,null,null,null,null,"Sanitation ladder","Basic",6474.2128540000067,6532.0584190000018,6562.7436340000068,6587.9280819999994,6582.9845120000036,2702.336139,2741.4135799999995,2711.3502000000003,2745.6480419999989,2726.1050899999987,3786.1374260000034,3815.0036609999988,3822.5089329999987,3821.8557959999989,3867.5686339999997,2190.6266549999991,13626.853051000009,3970.7798719999882,4233.3313799999996,3964.5175049999975,4753.8190379999924]
[null,"2 Limited",0.98264296727542666,0.66313649069634639,0.72669930810379757,0.43933154418861248,0.31087796115357824,1.6937858155323913,1.0021892289238399,0,0,0.57829563401985284,0.56683962122821352,0.78960729513244143,0.33061895848831946,1.0310238218281242,0.29464085977549803,0.53890063333535698,0.65603945261867092,0.61836772122684136,0.50738453532930083,0.53121906875926106,0.76394662836352745,null,null,null,null,null,null,null,null,null,null,null,null,null,null,null,null,null,null,null,null,null,null,null,null,null,null,null,null,null,null,"Limited",65.345799999999997,44.114094999999999,48.343094000000008,29.222968999999999,20.686653999999997,46.560420000000001,27.752282000000001,0,0,15.856645,22.127887999999999,30.808107999999997,12.898698999999999,40.181804999999997,11.526764999999999,12.812678999999999,90.169346999999988,25.036890999999997,21.674512,21.331859999999999,36.687323000000006]
[null,"3 Other unimproved",1.2268628528924239,1.1449750210735874,0.62133484770742853,0.51923918595915497,0.7603729334500231,0,0,0,0.99087725653983216,0,1.7061981756110383,1.4324077120023162,1.6909785498528829,0.90408413890470229,0.84468595373132416,7.3234526043588142,0.19992198078160275,1.1297221165248423,0.15858831002675716,0.6189817065962675,0.10940497308626121,null,null,null,null,null,null,null,null,null,null,null,null,null,null,null,null,null,null,null,null,null,null,null,null,null,null,null,null,null,null,"Unimproved",81.586432999999957,76.167632999999995,41.333807,34.538176999999997,50.597256000000002,0,0,0,27.478278,0,66.605368999999982,55.888251999999994,65.97148399999999,35.23462,33.045303000000004,174.11938599999999,27.478278,45.740954000000002,6.7745939999999996,24.856093999999999,5.2539999999999996]
[null,"4 Open defecation",0.4339734910155077,0,0,0,0,0,0,0,0,0,0.73927388551352247,0,0,0,0,0,0,0.18054415510144145,0.23482366917458924,0.12295135081222197,0.13703212345592186,null,null,null,null,null,null,null,null,null,null,null,null,null,null,null,null,null,null,null,null,null,null,null,null,null,null,null,null,null,null,"Open defecation",28.859255999999995,0,0,0,0,0,0,0,0,0,28.859255999999995,0,0,0,0,0,0,7.3099940000000005,10.031224999999999,4.9372869999999995,6.5807500000000001]
["Shared among Improved Sanitation","1 Yes",0.99923868654393666,0.67081717984261491,0.73124277428175277,0.44162463233454152,0.31325990468011722,1.6937858155323913,1.0021892289238399,0,0,0.57829563401985284,0.58104901249009933,0.80108205628615092,0.33630581772800738,1.0404301861171861,0.29715085127763319,0.58148544424595472,0.65735364705059462,0.62657755560349437,0.5093885308302647,0.53518981894590512,0.76583392725819766,null,null,null,null,null,null,null,null,null,null,null,null,null,null,null,null,null,null,null,null,null,null,null,null,null,null,null,null,null,"Shared among improved sanitation facilities","Yes","N/A","N/A","N/A","N/A","N/A","N/A","N/A","N/A","N/A","N/A","N/A","N/A","N/A","N/A","N/A","N/A","N/A","N/A","N/A","N/A","N/A"]
[null,"2 No",99.000761313456081,99.329182820157385,99.268757225718247,99.558375367665448,99.686740095319877,98.306214184467606,98.997810771076161,100,100,99.421704365980162,99.418950987509902,99.198917943713809,99.663694182271996,98.959569813882808,99.702849148722379,99.418514555754058,99.342646352949416,99.373422444396525,99.490611469169721,99.464810181054091,99.234166072741814,null,null,null,null,null,null,null,null,null,null,null,null,null,null,null,null,null,null,null,null,null,null,null,null,null,null,null,null,null,null,"No","N/A","N/A","N/A","N/A","N/A","N/A","N/A","N/A","N/A","N/A","N/A","N/A","N/A","N/A","N/A","N/A","N/A","N/A","N/A","N/A","N/A"]
["Manually calculated ratios","Improved latrines"]
[null,"Other"]
[null,"Other"]
[null,null,"NATIONAL wealth index quintile",null,null,null,null,"URBAN wealth index quintile",null,null,null,null,"RURAL wealth index quintile",null,null,null,null,"SUB-REGIONS:",null,null,null,null,null,null,null,null,null,null,null,null,null,null,null,null,null,null,null,null,null,null,null,null,null,null,null,null,null,null,null,null,null,null,"Raw numbers of respondents:","Use of sanitation facilities","NATIONAL wealth index quintile",null,null,null,null,"URBAN wealth index quintile",null,null,null,null,"RURAL wealth index quintile",null,null,null,null,"SUB-REGIONS:"]
["Percentage based on weighted population",null,"Poorest","Poor","Middle","Rich","Richest","1 Poorest","2 Poor","3 Middle","4 Rich","5 Richest","1 Poorest","2 Poor","3 Middle","4 Rich","5 Richest","4 Central Region","1 Malé","3 North Central","2 North Region","5 South Central","6 South Region",null,null,null,null,null,null,null,null,null,null,null,null,null,null,null,null,null,null,null,null,null,null,null,null,null,null,null,null,null,"Sanitation data, raw numbers (weighted)",null,"Poorest","Poor","Middle","Rich","Richest","Poorest","Poor","Middle","Rich","Richest","Poorest","Poor","Middle","Rich","Richest","4 Central Region","1 Malé","3 North Central","2 North Region","5 South Central","6 South Region"]
["Sanitation type","1 Sewer connection",46.796534114684476,57.18148728031359,63.880651540920638,69.984665600495802,77.719265680683407,99.409811113230745,99.662681454795433,95.337669659935472,97.242648362300329,99.421704365980162,30.856241461942979,36.736412263509585,36.604261378837052,43.140465860724383,44.600526486892228,59.657466377949241,98.222575051950884,32.547632006344962,44.441704186338825,51.624312099600324,16.333303879712695,null,null,null,null,null,null,null,null,null,null,null,null,null,null,null,null,null,null,null,null,null,null,null,null,null,null,null,null,null,"Sanitation type","Sewer connection","N/A","N/A","N/A","N/A","N/A","N/A","N/A","N/A","N/A","N/A","N/A","N/A","N/A","N/A","N/A","N/A","N/A","N/A","N/A","N/A","N/A"]
[null,"2 Septic tank connection",50.612463998506549,40.718588438709872,34.971558529109124,27.274914533935579,20.609292953466603,0,0,0,0,0,65.359316163494412,61.161976578311659,61.073106359448779,54.770725085564941,54.484229258684749,29.533565505376934,0,65.858504829771661,54.761933958282604,47.349008496683616,82.817317680539176,null,null,null,null,null,null,null,null,null,null,null,null,null,null,null,null,null,null,null,null,null,null,null,null,null,null,null,null,null,null,"Septic tank connection","N/A","N/A","N/A","N/A","N/A","N/A","N/A","N/A","N/A","N/A","N/A","N/A","N/A","N/A","N/A","N/A","N/A","N/A","N/A","N/A","N/A"]
[null,"3 Improved latrines",0.93016554290090858,0.95494925990289958,0.52645508226277449,2.2211806796094651,0.91106843239994495,0.59018888676923831,0.33731854520457039,4.6623303400645177,1.7664743811598171,0.57829563401985284,1.3389703134379638,0.66920344617646854,0.63165371186141372,1.1847249148059968,7.0558300691711706E-2,3.4855155123150863,1.577502967267487,0.28359689225717044,0.40294987617725553,0.28474634630757084,0.60294134320605619,null,null,null,null,null,null,null,null,null,null,null,null,null,null,null,null,null,null,null,null,null,null,null,null,null,null,null,null,null,null,"Improved latrines","N/A","N/A","N/A","N/A","N/A","N/A","N/A","N/A","N/A","N/A","N/A","N/A","N/A","N/A","N/A","N/A","N/A","N/A","N/A","N/A","N/A"]
[null,"4 Unimproved facilities",1.2268628528924239,1.1449750210735874,0.62133484770742853,0.51923918595915497,0.7603729334500231,0,0,0,0.99087725653983216,0,1.7061981756110383,1.4324077120023162,1.6909785498528829,0.90408413890470229,0.84468595373132416,7.3234526043588142,0.19992198078160275,1.1297221165248423,0.15858831002675716,0.6189817065962675,0.10940497308626121,null,null,null,null,null,null,null,null,null,null,null,null,null,null,null,null,null,null,null,null,null,null,null,null,null,null,null,null,null,null,"Unimproved facilities","N/A","N/A","N/A","N/A","N/A","N/A","N/A","N/A","N/A","N/A","N/A","N/A","N/A","N/A","N/A","N/A","N/A","N/A","N/A","N/A","N/A"]
[null,"5 Open defecation",0.4339734910155077,0,0,0,0,0,0,0,0,0,0.73927388551352247,0,0,0,0,0,0,0.18054415510144145,0.23482366917458924,0.12295135081222197,0.13703212345592186,null,null,null,null,null,null,null,null,null,null,null,null,null,null,null,null,null,null,null,null,null,null,null,null,null,null,null,null,null,null,"Open defecation","N/A","N/A","N/A","N/A","N/A","N/A","N/A","N/A","N/A","N/A","N/A","N/A","N/A","N/A","N/A","N/A","N/A","N/A","N/A","N/A","N/A"]
["Septic tank emptying practices","Not emptied/treated and disposed in situ","N/A","N/A","N/A","N/A","N/A","N/A","N/A","N/A","N/A","N/A","N/A","N/A","N/A","N/A","N/A","N/A","N/A","N/A","N/A","N/A","N/A",null,null,null,null,null,null,null,null,null,null,null,null,null,null,null,null,null,null,null,null,null,null,null,null,null,null,null,null,null,"Septic tank emptying practices","Not emptied/treated and disposed in situ","N/A","N/A","N/A","N/A","N/A","N/A","N/A","N/A","N/A","N/A","N/A","N/A","N/A","N/A","N/A","N/A","N/A","N/A","N/A","N/A","N/A"]
[null,"Emptied and buried on site","N/A","N/A","N/A","N/A","N/A","N/A","N/A","N/A","N/A","N/A","N/A","N/A","N/A","N/A","N/A","N/A","N/A","N/A","N/A","N/A","N/A",null,null,null,null,null,null,null,null,null,null,null,null,null,null,null,null,null,null,null,null,null,null,null,null,null,null,null,null,null,null,"Emptied and buried on site","N/A","N/A","N/A","N/A","N/A","N/A","N/A","N/A","N/A","N/A","N/A","N/A","N/A","N/A","N/A","N/A","N/A","N/A","N/A","N/A","N/A"]
[null,"Emptied and discharged locally","N/A","N/A","N/A","N/A","N/A","N/A","N/A","N/A","N/A","N/A","N/A","N/A","N/A","N/A","N/A","N/A","N/A","N/A","N/A","N/A","N/A",null,null,null,null,null,null,null,null,null,null,null,null,null,null,null,null,null,null,null,null,null,null,null,null,null,null,null,null,null,null,"Emptied and discharged locally","N/A","N/A","N/A","N/A","N/A","N/A","N/A","N/A","N/A","N/A","N/A","N/A","N/A","N/A","N/A","N/A","N/A","N/A","N/A","N/A","N/A"]
[null,"Emptied and removed offsite","N/A","N/A","N/A","N/A","N/A","N/A","N/A","N/A","N/A","N/A","N/A","N/A","N/A","N/A","N/A","N/A","N/A","N/A","N/A","N/A","N/A",null,null,null,null,null,null,null,null,null,null,null,null,null,null,null,null,null,null,null,null,null,null,null,null,null,null,null,null,null,null,"Emptied and removed offsite","N/A","N/A","N/A","N/A","N/A","N/A","N/A","N/A","N/A","N/A","N/A","N/A","N/A","N/A","N/A","N/A","N/A","N/A","N/A","N/A","N/A"]
["Latrine emptying practices","Not emptied/treated and disposed in situ","N/A","N/A","N/A","N/A","N/A","N/A","N/A","N/A","N/A","N/A","N/A","N/A","N/A","N/A","N/A","N/A","N/A","N/A","N/A","N/A","N/A",null,null,null,null,null,null,null,null,null,null,null,null,null,null,null,null,null,null,null,null,null,null,null,null,null,null,null,null,null,"Latrine emptying practices","Not emptied/treated and disposed in situ","N/A","N/A","N/A","N/A","N/A","N/A","N/A","N/A","N/A","N/A","N/A","N/A","N/A","N/A","N/A","N/A","N/A","N/A","N/A","N/A","N/A"]
[null,"Emptied and buried on site","N/A","N/A","N/A","N/A","N/A","N/A","N/A","N/A","N/A","N/A","N/A","N/A","N/A","N/A","N/A","N/A","N/A","N/A","N/A","N/A","N/A",null,null,null,null,null,null,null,null,null,null,null,null,null,null,null,null,null,null,null,null,null,null,null,null,null,null,null,null,null,null,"Emptied and buried on site","N/A","N/A","N/A","N/A","N/A","N/A","N/A","N/A","N/A","N/A","N/A","N/A","N/A","N/A","N/A","N/A","N/A","N/A","N/A","N/A","N/A"]
[null,"Emptied and discharged locally","N/A","N/A","N/A","N/A","N/A","N/A","N/A","N/A","N/A","N/A","N/A","N/A","N/A","N/A","N/A","N/A","N/A","N/A","N/A","N/A","N/A",null,null,null,null,null,null,null,null,null,null,null,null,null,null,null,null,null,null,null,null,null,null,null,null,null,null,null,null,null,null,"Emptied and discharged locally","N/A","N/A","N/A","N/A","N/A","N/A","N/A","N/A","N/A","N/A","N/A","N/A","N/A","N/A","N/A","N/A","N/A","N/A","N/A","N/A","N/A"]
[null,"Emptied and removed offsite","N/A","N/A","N/A","N/A","N/A","N/A","N/A","N/A","N/A","N/A","N/A","N/A","N/A","N/A","N/A","N/A","N/A","N/A","N/A","N/A","N/A",null,null,null,null,null,null,null,null,null,null,null,null,null,null,null,null,null,null,null,null,null,null,null,null,null,null,null,null,null,null,"Emptied and removed offsite","N/A","N/A","N/A","N/A","N/A","N/A","N/A","N/A","N/A","N/A","N/A","N/A","N/A","N/A","N/A","N/A","N/A","N/A","N/A","N/A","N/A"]
["Shared among improved sanitation facilities","Yes",0.98264296727542666,0.66313649069634639,0.72669930810379757,0.43933154418861248,0.31087796115357824,1.6937858155323913,1.0021892289238399,0,0,0.57829563401985284,0.56683962122821352,0.78960729513244143,0.33061895848831946,1.0310238218281242,0.29464085977549803,0.53890063333535698,0.65603945261867092,0.61836772122684136,0.50738453532930083,0.53121906875926106,0.76394662836352745,null,null,null,null,null,null,null,null,null,null,null,null,null,null,null,null,null,null,null,null,null,null,null,null,null,null,null,null,null,"Shared among improved sanitation facilities","Yes","N/A","N/A","N/A","N/A","N/A","N/A","N/A","N/A","N/A","N/A","N/A","N/A","N/A","N/A","N/A","N/A","N/A","N/A","N/A","N/A","N/A"]
[null,"No",97.356520688816659,98.191888488230035,98.651965844188751,99.041429269852216,98.928749105396392,98.306214184467606,98.997810771076161,100,99.009122743460154,99.421704365980162,96.987688317647198,97.777984992865214,97.978402491658812,98.064892039267207,98.860673186493216,92.137646762305849,99.144038566599718,98.071366007146878,99.09920348546936,98.72684787383227,98.989616275094278,null,null,null,null,null,null,null,null,null,null,null,null,null,null,null,null,null,null,null,null,null,null,null,null,null,null,null,null,null,null,"No","N/A","N/A","N/A","N/A","N/A","N/A","N/A","N/A","N/A","N/A","N/A","N/A","N/A","N/A","N/A","N/A","N/A","N/A","N/A","N/A","N/A"]
[null,"DK/missing",1.6608363439079319,1.1449750210735874,0.62133484770742853,0.51923918595915497,0.7603729334500231,0,0,0,0.99087725653983216,0,2.4454720611245611,1.4324077120023162,1.6909785498528829,0.90408413890470229,0.84468595373132416,7.3234526043588142,0.19992198078160275,1.3102662716262836,0.39341197920134641,0.74193305740848947,0.2464370965421831,null,null,null,null,null,null,null,null,null,null,null,null,null,null,null,null,null,null,null,null,null,null,null,null,null,null,null,null,null,null,"DK/missing","N/A","N/A","N/A","N/A","N/A","N/A","N/A","N/A","N/A","N/A","N/A","N/A","N/A","N/A","N/A","N/A","N/A","N/A","N/A","N/A","N/A"]
["Shared among all sanitation facilities","Yes",0.98692596433659663,0.66313649069634639,0.72669930810379757,0.43933154418861248,0.31087796115357824,1.6937858155323913,1.0021892289238399,0,0,0.57829563401985284,0.5710613285000814,0.78960729513244143,0.33061895848831946,1.0310238218281242,0.29464085977549803,0.53890063333535698,0.65603945261867092,0.61948616729355177,0.50857879872511114,0.53187301381435137,0.76499491714281831,null,null,null,null,null,null,null,null,null,null,null,null,null,null,null,null,null,null,null,null,null,null,null,null,null,null,null,null,null,"Shared among all sanitation facilities","Yes","N/A","N/A","N/A","N/A","N/A","N/A","N/A","N/A","N/A","N/A","N/A","N/A","N/A","N/A","N/A","N/A","N/A","N/A","N/A","N/A","N/A"]
[null,"No",99.013074035663379,99.33686350930364,99.27330069189621,99.560668455811381,99.689122038846421,98.306214184467606,98.997810771076161,100,100,99.421704365980162,99.428938671499949,99.210392704867544,99.669381041511684,98.9689761781719,99.70535914022453,99.461099366664612,99.343960547381329,99.38051383270647,99.491421201274875,99.468126986185652,99.235005082857199,null,null,null,null,null,null,null,null,null,null,null,null,null,null,null,null,null,null,null,null,null,null,null,null,null,null,null,null,null,null,"No","N/A","N/A","N/A","N/A","N/A","N/A","N/A","N/A","N/A","N/A","N/A","N/A","N/A","N/A","N/A","N/A","N/A","N/A","N/A","N/A","N/A"]
["Type of toilet facility","11 Flush to piped sewer system",46.796534114684476,57.18148728031359,63.880651540920638,69.984665600495802,77.719265680683407,99.409811113230745,99.662681454795433,95.337669659935472,97.242648362300329,99.421704365980162,30.856241461942979,36.736412263509585,36.604261378837052,43.140465860724383,44.600526486892228,59.657466377949241,98.222575051950884,32.547632006344962,44.441704186338825,51.624312099600324,16.333303879712695,null,null,null,null,null,null,null,null,null,null,null,null,null,null,null,null,null,null,null,null,null,null,null,null,null,null,null,null,null,"Type of toilet facility","11 Flush to piped sewer system",3111.9715509999969,3803.9070350000015,4249.6095810000043,4655.1624630000006,5171.6485540000031,2732.6728769999995,2759.8249519999995,2584.9380969999997,2696.6614759999989,2726.1050899999987,1204.5443360000008,1433.344605,1428.0710090000018,1681.3013919999992,1744.8353500000007,1418.3912939999996,13500.202492000006,1317.8105629999986,1898.4659239999989,2073.047943999999,784.3809669999996]
[null,"12 Flush to septic tank",50.612463998506549,40.718588438709872,34.971558529109124,27.274914533935579,20.609292953466603,0,0,0,0,0,65.359316163494412,61.161976578311659,61.073106359448779,54.770725085564941,54.484229258684749,29.533565505376934,0,65.858504829771661,54.761933958282604,47.349008496683616,82.817317680539176,null,null,null,null,null,null,null,null,null,null,null,null,null,null,null,null,null,null,null,null,null,null,null,null,null,null,null,null,null,null,"12 Flush to septic tank",3365.7310539999994,2708.7390059999989,2326.4551410000022,1814.2425519999995,1371.3976730000004,0,0,0,0,0,2551.4511930000008,2386.3568530000011,2382.6934170000018,2134.5642539999999,2131.4997089999979,702.17786200000103,0,2666.5237369999923,2339.3267080000019,1901.3670249999977,3977.1700939999987]
[null,"13 Flush to pit latrine",0.63277530103110746,0.71106993861899959,0.37990849897465123,1.8769819172315669,0.91106843239994495,0,0.33731854520457039,3.9314741046730148,1.7664743811598171,0.57829563401985284,0.83236600655637616,0.66920344617646854,0.63165371186141372,0.85557533857473933,7.0558300691711706E-2,3.1272592922542004,1.3152907934710907,4.2816118572860058E-2,0.33123922488352392,0.20063956157518217,0.43850279505895001,null,null,null,null,null,null,null,null,null,null,null,null,null,null,null,null,null,null,null,null,null,null,null,null,null,null,null,null,null,null,"13 Flush to pit latrine",42.079585000000002,47.302790999999992,25.273110999999997,124.85100400000002,60.624938999999998,0,9.3409099999999992,106.59603100000001,48.986565999999996,15.856645,32.493320999999995,26.110310999999999,24.643205999999999,33.344099999999997,2.7603399999999998,74.35242599999998,180.78015199999996,1.733568,14.149915999999999,8.0569679999999995,21.058399999999999]
[null,"14 Flush to somewhere else",0.95664096921928776,1.0584821498003887,0.519498321222712,0.51923918595915497,0.34743079980911518,0,0,0,0,0,1.2458751696450263,1.4324077120023162,1.3698512349344316,0.90408413890470229,0.84468595373132416,7.0042156939871525,0,0.94647646540507357,0,0.50030337036361494,2.7185699012708096E-2,null,null,null,null,null,null,null,null,null,null,null,null,null,null,null,null,null,null,null,null,null,null,null,null,null,null,null,null,null,null,"14 Flush to somewhere else",63.616665999999981,70.413832999999983,34.559213,34.538176999999997,23.118978000000002,0,0,0,0,0,48.635601999999992,55.888251999999994,53.443089999999991,35.23462,33.045303000000004,166.52934099999996,0,38.321579999999997,0,20.090395999999998,1.30555]
[null,"15 Flush, don't know where",0,0.24387932128389994,0,0.34419876237789854,0,0.59018888676923831,0,0.73085623539150324,0,0,0,0,0,7.9002949381092299E-2,0,0.12950090250557519,0.26221217379639628,0,0,0,0,null,null,null,null,null,null,null,null,null,null,null,null,null,null,null,null,null,null,null,null,null,null,null,null,null,null,null,null,null,null,"15 Flush, don't know where",0,16.223682,0,22.895031999999997,0,16.223682,0,19.816071999999998,0,0,0,0,0,3.0789599999999999,0,3.0789599999999999,36.039754000000002,0,0,0,0]
[null,"21 Ventilated Improved Pit latrine (VIP)",0.12785158567527261,0,0.1465465832881232,0,0,0,0,0,0,0,0.21779518903343864,0,0,0.25014662685016492,0,0.22875531755531167,0,0.24078077368431039,7.1710651293731623E-2,0,0,null,null,null,null,null,null,null,null,null,null,null,null,null,null,null,null,null,null,null,null,null,null,null,null,null,null,null,null,null,null,"21 Ventilated Improved Pit latrine (VIP)",8.5021360000000001,0,9.7488949999999992,0,0,0,0,0,0,0,8.5021360000000001,0,0,9.7488949999999992,0,5.4387920000000003,0,9.7488949999999992,3.0633439999999998,0,0]
[null,"22 Pit latrine with slab",0.16953865619452863,0,0,0,0,0,0,0,0,0,0.288809117848149,0,0,0,0,0,0,0,0,8.4106784732388709E-2,0.16443854814710623,null,null,null,null,null,null,null,null,null,null,null,null,null,null,null,null,null,null,null,null,null,null,null,null,null,null,null,null,null,null,"22 Pit latrine with slab",11.274328000000001,0,0,0,0,0,0,0,0,0,11.274328000000001,0,0,0,0,0,0,0,0,3.3774280000000001,7.8968999999999996]
[null,"23 Pit latrine without slab/open pit",0.10378706003801469,0,0,0,0,0,0,0,0,0,0.1768012671944208,0,0,0,0,0.17626483689959094,0,0,0,6.7512081414624975E-2,0,null,null,null,null,null,null,null,null,null,null,null,null,null,null,null,null,null,null,null,null,null,null,null,null,null,null,null,null,null,null,"23 Pit latrine without slab/open pit",6.9018439999999988,0,0,0,0,0,0,0,0,0,6.9018439999999988,0,0,0,0,4.1907999999999994,0,0,0,2.7110439999999998,0]
[null,"31 No facility/bush/field",0.4339734910155077,0,0,0,0,0,0,0,0,0,0.73927388551352247,0,0,0,0,0,0,0.18054415510144145,0.23482366917458924,0.12295135081222197,0.13703212345592186,null,null,null,null,null,null,null,null,null,null,null,null,null,null,null,null,null,null,null,null,null,null,null,null,null,null,null,null,null,null,"31 No facility/bush/field",28.859255999999995,0,0,0,0,0,0,0,0,0,28.859255999999995,0,0,0,0,0,0,7.3099940000000005,10.031224999999999,4.9372869999999995,6.5807500000000001]
[null,"96 Other",0.16643482363512183,8.6492871273198241E-2,0.10183652648471646,0,0.41294213364090798,0,0,0,0.99087725653983216,0,0.28352173877159148,0,0.32112731491845115,0,0,0.14297207347206978,0.19992198078160275,0.18324565111976862,0.15858831002675716,5.1166254818027619E-2,8.2219274073553117E-2,null,null,null,null,null,null,null,null,null,null,null,null,null,null,null,null,null,null,null,null,null,null,null,null,null,null,null,null,null,null,"96 Other",11.067923,5.7538,6.7745939999999996,0,27.478278,0,0,0,27.478278,0,11.067923,0,12.528393999999999,0,0,3.3992450000000001,27.478278,7.4193740000000004,6.7745939999999996,2.0546540000000002,3.9484499999999998]
[null,null,null,null,null,null,null,null,null,null,null,null,null,null,null,null,null,null,null,null,null,null,null,null,null,null,null,null,null,null,null,null,null,null,null,null,null,null,null,null,null,null,null,null,null,null,null,null,null,null,null,null,null,"Total",6650.0043430000051,6652.3401470000035,6652.4205350000084,6651.6892280000002,6654.2684220000046,2748.8965590000003,2769.1658619999994,2711.3502000000003,2773.1263199999994,2741.9617349999985,3903.7299390000048,3901.7000210000001,3901.3791159999982,3897.2722209999979,3912.1407019999983,2377.5587199999986,13744.500676000009,4048.867710999988,4271.8117109999994,4015.6427459999968,4802.3411109999925]
[]
[]
[]
[]
[]
[]
[]
[]
[]
[]
[]
[]
[]
[]
[]
[]
[]
[]
[]
[]
[]
[]
[]
[]
[]
[]
[]
[]
[]
[]
[]
[]
[]
[]
[]
[]
[]
[]
[]
[]
[]
[]
[]
[]
[{"$f":"A1026","v":"Maldives"}]
[{"$f":"A1034","v":"2017"}]
["Access to hygiene facilities "]
[" by wealth quintile and sub-national region"]
["Notes:"]
["WHO/UNICEF JMP customised wealth index excludes water,"]
[" sanitation and hygiene assets."]
["Survey used for analysis:",{"$f":"A1025","v":"DHS17"}]
[]
[]
[]
[]
["Access to handwashing",null,"NATIONAL wealth index quintile",null,null,null,null,"URBAN wealth index quintile",null,null,null,null,"RURAL wealth index quintile",null,null,null,null,"SUB-REGIONS:",null,null,null,null,null,null,null,null,null,null,null,null,null,null,null,null,null,null,null,null,null,null,null,null,null,null,null,null,null,null,null,null,null,null,"Raw numbers of respondents:","Access to handwashing","NATIONAL wealth index quintile",null,null,null,null,"URBAN wealth index quintile",null,null,null,null,"RURAL wealth index quintile",null,null,null,null,"SUB-REGIONS:"]
["Weighted percentage (used in graphs)",null,"Poorest","Poor","Middle","Rich","Richest","1 Poorest","2 Poor","3 Middle","4 Rich","5 Richest","1 Poorest","2 Poor","3 Middle","4 Rich","5 Richest","4 Central Region","1 Malé","3 North Central","2 North Region","5 South Central","6 South Region",null,null,null,null,null,null,null,null,null,null,null,null,null,null,null,null,null,null,null,null,null,null,null,null,null,null,null,null,null,"Hygiene data, raw numbers (weighted)",null,"Poorest","Poor","Middle","Rich","Richest","Poorest","Poor","Middle","Rich","Richest","Poorest","Poor","Middle","Rich","Richest","4 Central Region","1 Malé","3 North Central","2 North Region","5 South Central","6 South Region"]
["Hygiene ladder","1,00 Basic",86.394351323620242,93.418120084870566,95.97560359283564,96.651494644963009,97.261969049955638,95.616490947343763,95.249404854897776,97.324411394736074,100,97.190135733239927,82.19336379228568,91.560368781043849,94.388767123962779,94.995805015900174,95.533782439817983,94.897751077940498,97.078462827987224,84.593376975363526,95.560639718770929,93.028328196716714,91.730500393323737,null,null,null,null,null,null,null,null,null,null,null,null,null,null,null,null,null,null,null,null,null,null,null,null,null,null,null,null,null,"Hygiene ladder","Basic",5723.4604379999992,6208.1012730000075,6384.700762000004,6428.9570580000018,6470.146142000006,2622.5598150000001,2637.6140029999992,2638.8056229999997,2773.1263199999994,2664.9163319999989,3200.489218000002,3560.6563189999974,3679.4290589999973,3702.24512,3735.5238639999998,2246.3621759999965,13337.022093000009,3425.0739259999918,4081.4949610000017,3729.3463849999994,4396.0661319999972]
[null,"2,00 Limited",7.9714826177337201,4.2465754168800984,2.6526368420573667,2.1397757640399493,1.6119538352351401,3.1698326260107512,4.1993204739283332,2.2251647537083183,0,2.8098642667600915,10.633077673615778,4.6713180244040986,3.2214141821898243,2.8330199364844435,1.6377776613210531,4.1720996110931869,2.4792229155856642,7.0984449607768578,3.8875602497934176,4.4353338144697103,3.457809114051587,null,null,null,null,null,null,null,null,null,null,null,null,null,null,null,null,null,null,null,null,null,null,null,null,null,null,null,null,null,null,"Limited",528.09546799999964,282.20617400000003,176.46455800000001,142.33123400000002,107.231809,86.941860999999989,116.28614899999999,60.332008999999999,0,77.045402999999993,414.03647299999972,181.66110800000004,125.57601199999996,110.410499,64.039729000000008,98.759419000000037,340.60542199999998,287.40664599999997,166.04176799999993,177.80493800000005,165.71105000000006]
[null,"3,00 No facility",5.6341660586459552,2.3353044982494184,1.3717595651069268,1.2087295909970612,1.1260771148092474,1.2136764266454898,0.55127467117388596,0.45042385155558279,0,0,7.1735585340984853,3.7683131945519808,2.3898186938473729,2.1711750476154394,2.8284398988610016,0.93014931096624021,0.44231425642712008,8.3081780638597174,0.5518000314357081,2.536337988813627,4.8116904926247717,null,null,null,null,null,null,null,null,null,null,null,null,null,null,null,null,null,null,null,null,null,null,null,null,null,null,null,null,null,null,"No facility",373.25271900000001,155.1926630000001,91.255215000000007,80.400935999999987,74.909890999999988,33.288598999999998,15.26571,12.212567999999999,0,0,279.32786400000009,146.54449700000004,93.159055000000009,84.616602,110.59652899999998,22.017932000000002,60.766877000000001,336.38713900000005,23.567957,101.677447,230.59407200000018]
["Place where household members wash their hands","1 Observed, fixed place",89.030315179149042,95.222983597083342,97.436312961534639,97.772803044129262,98.396136581338524,98.566883760284853,99.4487253288261,99.44984919321746,100,100,85.00581697129526,92.793716931422637,95.013707788556275,95.578188095986263,95.661059457467374,98.169833424766054,99.493782206861169,85.438449263278528,96.053808491467052,94.803349645387058,91.821371599357107,null,null,null,null,null,null,null,null,null,null,null,null,null,null,null,null,null,null,null,null,null,null,null,null,null,null,null,null,null,"Observed handwashing place","Fixed","N/A","N/A","N/A","N/A","N/A","N/A","N/A","N/A","N/A","N/A","N/A","N/A","N/A","N/A","N/A","N/A","N/A","N/A","N/A","N/A","N/A"]
[null,"2 Observed, mobile place",4.9779829143789689,2.3412915839885109,1.1919274733583853,1.0184673648737095,0.44835741674263313,0,0,9.9726955226956654E-2,0,0,7.5857748519319239,3.1213305314227289,2.5160363830685974,2.2506368563983368,1.4613060816236467,0.46586273166788528,1.9672937298635396E-2,6.2533726728618397,3.3779318650311181,2.4949303595245693,3.1693230756010804,null,null,null,null,null,null,null,null,null,null,null,null,null,null,null,null,null,null,null,null,null,null,null,null,null,null,null,null,null,null,"Mobile","N/A","N/A","N/A","N/A","N/A","N/A","N/A","N/A","N/A","N/A","N/A","N/A","N/A","N/A","N/A","N/A","N/A","N/A","N/A","N/A","N/A"]
[null,"3 Not observed: not in dwelling",4.3936693561344313,2.1034245078869378,1.2341119231422717,0.91557566675903646,1.0744668905092138,0.98884459333342245,0,0,0,0,5.3528528680323699,3.6380092840561309,2.3878493278939277,1.7492383937837337,2.7397927928615697,0.11434825887286608,0.19776866137788812,7.8752151900079976,7.0308833890455155E-2,2.0802775865261216,4.4000538719749533,null,null,null,null,null,null,null,null,null,null,null,null,null,null,null,null,null,null,null,null,null,null,null,null,null,null,null,null,null,"Water / Soap","Water and soap","N/A","N/A","N/A","N/A","N/A","N/A","N/A","N/A","N/A","N/A","N/A","N/A","N/A","N/A","N/A","N/A","N/A","N/A","N/A","N/A","N/A"]
[null,"4 Not observed: no permission to see",0.37888273000184985,0.10282151617103706,0,0,2.9764053302266964E-2,0.22213582319086453,0,0,0,0,0.25299864883916573,0.32903854552892087,8.2406500481200642E-2,0,5.0626502236677501E-2,0.43823073274085139,4.4427106840356168E-2,0,1.6550940159169393E-2,0.16968581198582564,0.20760409911664887,null,null,null,null,null,null,null,null,null,null,null,null,null,null,null,null,null,null,null,null,null,null,null,null,null,null,null,null,null,null,"Water only","N/A","N/A","N/A","N/A","N/A","N/A","N/A","N/A","N/A","N/A","N/A","N/A","N/A","N/A","N/A","N/A","N/A","N/A","N/A","N/A","N/A"]
[null,"5 Not observed: other reason",1.2191498203356879,0.22947879487016845,0.13764764196465504,0.29315392423802511,5.1275058107356844E-2,0.22213582319086453,0.55127467117388596,0.45042385155558279,0,0,1.8025566599011573,0.11790470756952126,0,0.42193665383170587,8.7215165810772044E-2,0.81172485195234245,0.24434908762195889,0.43296287385172244,0.48139986945225183,0.45175659657648276,0.40164735395032275,null,null,null,null,null,null,null,null,null,null,null,null,null,null,null,null,null,null,null,null,null,null,null,null,null,null,null,null,null,null,"Soap only","N/A","N/A","N/A","N/A","N/A","N/A","N/A","N/A","N/A","N/A","N/A","N/A","N/A","N/A","N/A","N/A","N/A","N/A","N/A","N/A","N/A"]
[null,null,null,null,null,null,null,null,null,null,null,null,null,null,null,null,null,null,null,null,null,null,null,null,null,null,null,null,null,null,null,null,null,null,null,null,null,null,null,null,null,null,null,null,null,null,null,null,null,null,null,null,null,"Neither","N/A","N/A","N/A","N/A","N/A","N/A","N/A","N/A","N/A","N/A","N/A","N/A","N/A","N/A","N/A","N/A","N/A","N/A","N/A","N/A","N/A"]
[null,null,null,null,null,null,null,null,null,null,null,null,null,null,null,null,null,null,null,null,null,null,null,null,null,null,null,null,null,null,null,null,null,null,null,null,null,null,null,null,null,null,null,null,null,null,null,null,null,null,null,null,"Place where household members wash their hands","1 Observed, fixed place",5920.5198260000043,6334.5567670000037,6481.8732920000048,6503.5430080000024,6547.543045000004,2709.5016760000003,2753.9001519999993,2696.4336850000004,2773.1263199999994,2741.9617349999985,3318.3975270000001,3620.5324729999979,3706.844952999998,3724.9421739999993,3742.3952429999999,2334.0454349999986,13674.923568000009,3459.2897849999913,4103.2378400000016,3806.9638329999989,4409.5754769999976]
[null,null,null,null,null,null,null,null,null,null,null,null,null,null,null,null,null,null,null,null,null,null,null,null,null,null,null,null,null,null,null,null,null,null,null,null,null,null,null,null,null,null,null,null,null,null,null,null,null,null,null,null,null,"2 Observed, mobile place",331.03607999999969,155.75068000000002,79.292027999999988,67.745283999999998,29.834906,0,0,2.7039469999999999,0,0,296.1281639999998,121.78495400000001,98.160117999999983,87.713444999999993,57.168350000000004,11.076160000000002,2.7039469999999999,253.19078699999997,144.298889,100.18749,152.20170500000006]
[null,null,null,null,null,null,null,null,null,null,null,null,null,null,null,null,null,null,null,null,null,null,null,null,null,null,null,null,null,null,null,null,null,null,null,null,null,null,null,null,null,null,null,null,null,null,null,null,null,null,null,null,null,"3 Not observed: not in dwelling",292.17920300000003,139.92695300000003,82.098314999999999,60.90124800000001,71.497910999999988,27.182314999999999,0,0,0,0,208.96092000000004,141.94420900000003,93.159055000000009,68.172582000000006,107.18454899999998,2.7186969999999997,27.182314999999999,318.85704500000014,3.0034610000000002,83.536516000000006,211.30559600000015]
[null,null,null,null,null,null,null,null,null,null,null,null,null,null,null,null,null,null,null,null,null,null,null,null,null,null,null,null,null,null,null,null,null,null,null,null,null,null,null,null,null,null,null,null,null,null,null,null,null,null,null,null,null,"4 Not observed: no permission to see",25.195717999999999,6.8400369999999997,0,0,1.98058,6.1062839999999996,0,0,0,0,9.8763839999999998,12.838097000000001,3.2149899999999998,0,1.98058,10.419193,6.1062839999999996,0,0.70702500000000001,6.8139759999999994,9.9698570000000011]
[null,null,null,null,null,null,null,null,null,null,null,null,null,null,null,null,null,null,null,null,null,null,null,null,null,null,null,null,null,null,null,null,null,null,null,null,null,null,null,null,null,null,null,null,null,null,null,null,null,null,null,null,null,"5 Not observed: other reason",81.073515999999998,15.26571,9.1569000000000003,19.499687999999999,3.4119799999999998,6.1062839999999996,15.26571,12.212567999999999,0,0,70.366943999999975,4.6002879999999999,0,16.444019999999998,3.4119799999999998,19.299234999999999,33.584561999999998,17.530093999999998,20.564496000000002,18.140931000000002,19.288475999999999]
[null,null,null,null,null,null,null,null,null,null,null,null,null,null,null,null,null,null,null,null,null,null,null,null,null,null,null,null,null,null,null,null,null,null,null,null,null,null,null,null,null,null,null,null,null,null,null,null,null,null,null,null,null,"Total",6650.0043430000051,6652.3401470000035,6652.4205350000084,6651.6892280000002,6654.2684220000046,2748.8965590000003,2769.1658619999994,2711.3502000000003,2773.1263199999994,2741.9617349999985,3903.7299390000048,3901.7000210000001,3901.3791159999982,3897.2722209999979,3912.1407019999983,2377.5587199999986,13744.500676000009,4048.867710999988,4271.8117109999994,4015.6427459999968,4802.3411109999925]
[]
[]
[]
[]
[]
[]
[]
[]
[]
[]
[]
[]
[]
[]
[]
[]
[]
[]
[]
[]
[]
[]
[null,null,null,null,null,null,null,null,null,null,null,null,null,null,null,null,null,null,null,null,null,null,null,null,null,null,null,null,null,null,null,null,null,null,null,null,null,null,null,null,null,null,null,null,null,null,null,null,null,null,null,null,"Raw numbers of respondents:","Menstrual health and hygiene","NATIONAL wealth index quintile",null,null,null,null,"URBAN wealth index quintile",null,null,null,null,"RURAL wealth index quintile",null,null,null,null,"SUB-REGIONS:"]
[null,null,null,null,null,null,null,null,null,null,null,null,null,null,null,null,null,null,null,null,null,null,null,null,null,null,null,null,null,null,null,null,null,null,null,null,null,null,null,null,null,null,null,null,null,null,null,null,null,null,null,null,"MHH data, raw numbers (weighted)",null,"Poorest","Poor","Middle","Rich","Richest","Poorest","Poor","Middle","Rich","Richest","Poorest","Poor","Middle","Rich","Richest","4 Central Region","1 Malé","3 North Central","2 North Region","5 South Central","6 South Region"]
[null,null,null,null,null,null,null,null,null,null,null,null,null,null,null,null,null,null,null,null,null,null,null,null,null,null,null,null,null,null,null,null,null,null,null,null,null,null,null,null,null,null,null,null,null,null,null,null,null,null,null,null,"Private place to wash and change","Yes","N/A","N/A","N/A","N/A","N/A","N/A","N/A","N/A","N/A","N/A","N/A","N/A","N/A","N/A","N/A","N/A","N/A","N/A","N/A","N/A","N/A"]
[null,null,null,null,null,null,null,null,null,null,null,null,null,null,null,null,null,null,null,null,null,null,null,null,null,null,null,null,null,null,null,null,null,null,null,null,null,null,null,null,null,null,null,null,null,null,null,null,null,null,null,null,null,"No","N/A","N/A","N/A","N/A","N/A","N/A","N/A","N/A","N/A","N/A","N/A","N/A","N/A","N/A","N/A","N/A","N/A","N/A","N/A","N/A","N/A"]
[null,null,null,null,null,null,null,null,null,null,null,null,null,null,null,null,null,null,null,null,null,null,null,null,null,null,null,null,null,null,null,null,null,null,null,null,null,null,null,null,null,null,null,null,null,null,null,null,null,null,null,null,null,"DK/not sure/missing","N/A","N/A","N/A","N/A","N/A","N/A","N/A","N/A","N/A","N/A","N/A","N/A","N/A","N/A","N/A","N/A","N/A","N/A","N/A","N/A","N/A"]
[null,null,null,null,null,null,null,null,null,null,null,null,null,null,null,null,null,null,null,null,null,null,null,null,null,null,null,null,null,null,null,null,null,null,null,null,null,null,null,null,null,null,null,null,null,null,null,null,null,null,null,null,"Use of menstrual materials","Materials reusable","N/A","N/A","N/A","N/A","N/A","N/A","N/A","N/A","N/A","N/A","N/A","N/A","N/A","N/A","N/A","N/A","N/A","N/A","N/A","N/A","N/A"]
[null,null,null,null,null,null,null,null,null,null,null,null,null,null,null,null,null,null,null,null,null,null,null,null,null,null,null,null,null,null,null,null,null,null,null,null,null,null,null,null,null,null,null,null,null,null,null,null,null,null,null,null,null,"Materials not reusable","N/A","N/A","N/A","N/A","N/A","N/A","N/A","N/A","N/A","N/A","N/A","N/A","N/A","N/A","N/A","N/A","N/A","N/A","N/A","N/A","N/A"]
[null,null,null,null,null,null,null,null,null,null,null,null,null,null,null,null,null,null,null,null,null,null,null,null,null,null,null,null,null,null,null,null,null,null,null,null,null,null,null,null,null,null,null,null,null,null,null,null,null,null,null,null,null,"No materials used","N/A","N/A","N/A","N/A","N/A","N/A","N/A","N/A","N/A","N/A","N/A","N/A","N/A","N/A","N/A","N/A","N/A","N/A","N/A","N/A","N/A"]
[null,null,null,null,null,null,null,null,null,null,null,null,null,null,null,null,null,null,null,null,null,null,null,null,null,null,null,null,null,null,null,null,null,null,null,null,null,null,null,null,null,null,null,null,null,null,null,null,null,null,null,null,null,"DK/not sure/missing","N/A","N/A","N/A","N/A","N/A","N/A","N/A","N/A","N/A","N/A","N/A","N/A","N/A","N/A","N/A","N/A","N/A","N/A","N/A","N/A","N/A"]
[null,null,null,null,null,null,null,null,null,null,null,null,null,null,null,null,null,null,null,null,null,null,null,null,null,null,null,null,null,null,null,null,null,null,null,null,null,null,null,null,null,null,null,null,null,null,null,null,null,null,null,null,"Use of menstrual materials with private place to wash and change","Materials reusable","N/A","N/A","N/A","N/A","N/A","N/A","N/A","N/A","N/A","N/A","N/A","N/A","N/A","N/A","N/A","N/A","N/A","N/A","N/A","N/A","N/A"]
[null,null,null,null,null,null,null,null,null,null,null,null,null,null,null,null,null,null,null,null,null,null,null,null,null,null,null,null,null,null,null,null,null,null,null,null,null,null,null,null,null,null,null,null,null,null,null,null,null,null,null,null,null,"Materials not reusable","N/A","N/A","N/A","N/A","N/A","N/A","N/A","N/A","N/A","N/A","N/A","N/A","N/A","N/A","N/A","N/A","N/A","N/A","N/A","N/A","N/A"]
[null,null,null,null,null,null,null,null,null,null,null,null,null,null,null,null,null,null,null,null,null,null,null,null,null,null,null,null,null,null,null,null,null,null,null,null,null,null,null,null,null,null,null,null,null,null,null,null,null,null,null,null,null,"No materials used","N/A","N/A","N/A","N/A","N/A","N/A","N/A","N/A","N/A","N/A","N/A","N/A","N/A","N/A","N/A","N/A","N/A","N/A","N/A","N/A","N/A"]
[null,null,null,null,null,null,null,null,null,null,null,null,null,null,null,null,null,null,null,null,null,null,null,null,null,null,null,null,null,null,null,null,null,null,null,null,null,null,null,null,null,null,null,null,null,null,null,null,null,null,null,null,"Awareness of menstruation before menarche","Yes","N/A","N/A","N/A","N/A","N/A","N/A","N/A","N/A","N/A","N/A","N/A","N/A","N/A","N/A","N/A","N/A","N/A","N/A","N/A","N/A","N/A"]
[null,null,null,null,null,null,null,null,null,null,null,null,null,null,null,null,null,null,null,null,null,null,null,null,null,null,null,null,null,null,null,null,null,null,null,null,null,null,null,null,null,null,null,null,null,null,null,null,null,null,null,null,null,"No","N/A","N/A","N/A","N/A","N/A","N/A","N/A","N/A","N/A","N/A","N/A","N/A","N/A","N/A","N/A","N/A","N/A","N/A","N/A","N/A","N/A"]
[null,null,null,null,null,null,null,null,null,null,null,null,null,null,null,null,null,null,null,null,null,null,null,null,null,null,null,null,null,null,null,null,null,null,null,null,null,null,null,null,null,null,null,null,null,null,null,null,null,null,null,null,null,"DK/not sure/missing","N/A","N/A","N/A","N/A","N/A","N/A","N/A","N/A","N/A","N/A","N/A","N/A","N/A","N/A","N/A","N/A","N/A","N/A","N/A","N/A","N/A"]
[null,null,null,null,null,null,null,null,null,null,null,null,null,null,null,null,null,null,null,null,null,null,null,null,null,null,null,null,null,null,null,null,null,null,null,null,null,null,null,null,null,null,null,null,null,null,null,null,null,null,null,null,"Participation in (all) activities during menstruation","Yes","N/A","N/A","N/A","N/A","N/A","N/A","N/A","N/A","N/A","N/A","N/A","N/A","N/A","N/A","N/A","N/A","N/A","N/A","N/A","N/A","N/A"]
[null,null,null,null,null,null,null,null,null,null,null,null,null,null,null,null,null,null,null,null,null,null,null,null,null,null,null,null,null,null,null,null,null,null,null,null,null,null,null,null,null,null,null,null,null,null,null,null,null,null,null,null,null,"No","N/A","N/A","N/A","N/A","N/A","N/A","N/A","N/A","N/A","N/A","N/A","N/A","N/A","N/A","N/A","N/A","N/A","N/A","N/A","N/A","N/A"]
[null,null,null,null,null,null,null,null,null,null,null,null,null,null,null,null,null,null,null,null,null,null,null,null,null,null,null,null,null,null,null,null,null,null,null,null,null,null,null,null,null,null,null,null,null,null,null,null,null,null,null,null,null,"DK/not sure/missing/no such activity","N/A","N/A","N/A","N/A","N/A","N/A","N/A","N/A","N/A","N/A","N/A","N/A","N/A","N/A","N/A","N/A","N/A","N/A","N/A","N/A","N/A"]
[null,null,null,null,null,null,null,null,null,null,null,null,null,null,null,null,null,null,null,null,null,null,null,null,null,null,null,null,null,null,null,null,null,null,null,null,null,null,null,null,null,null,null,null,null,null,null,null,null,null,null,null,"Participation in specific activities during menstruation","Did not go to school (amongst those usually attending school)","N/A","N/A","N/A","N/A","N/A","N/A","N/A","N/A","N/A","N/A","N/A","N/A","N/A","N/A","N/A","N/A","N/A","N/A","N/A","N/A","N/A"]
[null,null,null,null,null,null,null,null,null,null,null,null,null,null,null,null,null,null,null,null,null,null,null,null,null,null,null,null,null,null,null,null,null,null,null,null,null,null,null,null,null,null,null,null,null,null,null,null,null,null,null,null,null,"Did not go to work (amongst those who usually work)","N/A","N/A","N/A","N/A","N/A","N/A","N/A","N/A","N/A","N/A","N/A","N/A","N/A","N/A","N/A","N/A","N/A","N/A","N/A","N/A","N/A"]
[null,null,null,null,null,null,null,null,null,null,null,null,null,null,null,null,null,null,null,null,null,null,null,null,null,null,null,null,null,null,null,null,null,null,null,null,null,null,null,null,null,null,null,null,null,null,null,null,null,null,null,null,null,"Did not participate in social activities","N/A","N/A","N/A","N/A","N/A","N/A","N/A","N/A","N/A","N/A","N/A","N/A","N/A","N/A","N/A","N/A","N/A","N/A","N/A","N/A","N/A"]
[null,null,null,null,null,null,null,null,null,null,null,null,null,null,null,null,null,null,null,null,null,null,null,null,null,null,null,null,null,null,null,null,null,null,null,null,null,null,null,null,null,null,null,null,null,null,null,null,null,null,null,null,null,"Did not cook food","N/A","N/A","N/A","N/A","N/A","N/A","N/A","N/A","N/A","N/A","N/A","N/A","N/A","N/A","N/A","N/A","N/A","N/A","N/A","N/A","N/A"]
[null,null,null,null,null,null,null,null,null,null,null,null,null,null,null,null,null,null,null,null,null,null,null,null,null,null,null,null,null,null,null,null,null,null,null,null,null,null,null,null,null,null,null,null,null,null,null,null,null,null,null,null,null,"Did not eat with others","N/A","N/A","N/A","N/A","N/A","N/A","N/A","N/A","N/A","N/A","N/A","N/A","N/A","N/A","N/A","N/A","N/A","N/A","N/A","N/A","N/A"]
[null,null,null,null,null,null,null,null,null,null,null,null,null,null,null,null,null,null,null,null,null,null,null,null,null,null,null,null,null,null,null,null,null,null,null,null,null,null,null,null,null,null,null,null,null,null,null,null,null,null,null,null,null,"Did not bathe in regular place","N/A","N/A","N/A","N/A","N/A","N/A","N/A","N/A","N/A","N/A","N/A","N/A","N/A","N/A","N/A","N/A","N/A","N/A","N/A","N/A","N/A"]
[null,null,null,null,null,null,null,null,null,null,null,null,null,null,null,null,null,null,null,null,null,null,null,null,null,null,null,null,null,null,null,null,null,null,null,null,null,null,null,null,null,null,null,null,null,null,null,null,null,null,null,null,null,"Did not participate in other activities","N/A","N/A","N/A","N/A","N/A","N/A","N/A","N/A","N/A","N/A","N/A","N/A","N/A","N/A","N/A","N/A","N/A","N/A","N/A","N/A","N/A"]
[null,null,null,null,null,null,null,null,null,null,null,null,null,null,null,null,null,null,null,null,null,null,null,null,null,null,null,null,null,null,null,null,null,null,null,null,null,null,null,null,null,null,null,null,null,null,null,null,null,null,null,null,null,"DK/not sure/missing/no such activity","N/A","N/A","N/A","N/A","N/A","N/A","N/A","N/A","N/A","N/A","N/A","N/A","N/A","N/A","N/A","N/A","N/A","N/A","N/A","N/A","N/A"]
[]
[]
[]
[]
[]
[]
[]
[]
[]
[]
[]
[]
[]
[]
[]
[]
[]
[]
[]
[]
[]
[]
[]
[]
[]
[]
[]
[]
[]
[]
[]
[]
[]
[]
[]
[]
[]
[]
[]
[]
[]
[]
[]
[]
[]
[]
[]
[]
[]
[]
[]
[]
[]
[]
[null,null,null,null,null,null,null,null,null,null,null,null,null,null,null,null,null,null,null,null,null,null,null,null,null,null,null,null,null,null,null,null,null,null,null,null,null,null,null,null,null,null,null,null,null,null,null,null,null,null,null,null,"Raw numbers of respondents:","Basic water, sanitation and hygiene","NATIONAL wealth index quintile",null,null,null,null,"URBAN wealth index quintile",null,null,null,null,"RURAL wealth index quintile",null,null,null,null,"SUB-REGIONS:"]
[null,null,null,null,null,null,null,null,null,null,null,null,null,null,null,null,null,null,null,null,null,null,null,null,null,null,null,null,null,null,null,null,null,null,null,null,null,null,null,null,null,null,null,null,null,null,null,null,null,null,null,null,"WatSan data, raw numbers (weighted)",null,"Poorest","Poor","Middle","Rich","Richest","Poorest","Poor","Middle","Rich","Richest","Poorest","Poor","Middle","Rich","Richest","4 Central Region","1 Malé","3 North Central","2 North Region","5 South Central","6 South Region"]
[null,null,null,null,null,null,null,null,null,null,null,null,null,null,null,null,null,null,null,null,null,null,null,null,null,null,null,null,null,null,null,null,null,null,null,null,null,null,null,null,null,null,null,null,null,null,null,null,null,null,null,null,"Use of Basic Water Sanitation and Hygiene","Yes","N/A","N/A","N/A","N/A","N/A","N/A","N/A","N/A","N/A","N/A","N/A","N/A","N/A","N/A","N/A","N/A","N/A","N/A","N/A","N/A","N/A"]
[null,null,null,null,null,null,null,null,null,null,null,null,null,null,null,null,null,null,null,null,null,null,null,null,null,null,null,null,null,null,null,null,null,null,null,null,null,null,null,null,null,null,null,null,null,null,null,null,null,null,null,null,null,"No","N/A","N/A","N/A","N/A","N/A","N/A","N/A","N/A","N/A","N/A","N/A","N/A","N/A","N/A","N/A","N/A","N/A","N/A","N/A","N/A","N/A"]
[null,null,null,null,null,null,null,null,null,null,null,null,null,null,null,null,null,null,null,null,null,null,null,null,null,null,null,null,null,null,null,null,null,null,null,null,null,null,null,null,null,null,null,null,null,null,null,null,null,null,null,null,"Use of Basic Water and Sanitation","Yes","N/A","N/A","N/A","N/A","N/A","N/A","N/A","N/A","N/A","N/A","N/A","N/A","N/A","N/A","N/A","N/A","N/A","N/A","N/A","N/A","N/A"]
[null,null,null,null,null,null,null,null,null,null,null,null,null,null,null,null,null,null,null,null,null,null,null,null,null,null,null,null,null,null,null,null,null,null,null,null,null,null,null,null,null,null,null,null,null,null,null,null,null,null,null,null,null,"No","N/A","N/A","N/A","N/A","N/A","N/A","N/A","N/A","N/A","N/A","N/A","N/A","N/A","N/A","N/A","N/A","N/A","N/A","N/A","N/A","N/A"]
[null,null,null,null,null,null,null,null,null,null,null,null,null,null,null,null,null,null,null,null,null,null,null,null,null,null,null,null,null,null,null,null,null,null,null,null,null,null,null,null,null,null,null,null,null,null,null,null,null,null,null,null,"Use of Basic Water and Hygiene","Yes","N/A","N/A","N/A","N/A","N/A","N/A","N/A","N/A","N/A","N/A","N/A","N/A","N/A","N/A","N/A","N/A","N/A","N/A","N/A","N/A","N/A"]
[null,null,null,null,null,null,null,null,null,null,null,null,null,null,null,null,null,null,null,null,null,null,null,null,null,null,null,null,null,null,null,null,null,null,null,null,null,null,null,null,null,null,null,null,null,null,null,null,null,null,null,null,null,"No","N/A","N/A","N/A","N/A","N/A","N/A","N/A","N/A","N/A","N/A","N/A","N/A","N/A","N/A","N/A","N/A","N/A","N/A","N/A","N/A","N/A"]
[null,null,null,null,null,null,null,null,null,null,null,null,null,null,null,null,null,null,null,null,null,null,null,null,null,null,null,null,null,null,null,null,null,null,null,null,null,null,null,null,null,null,null,null,null,null,null,null,null,null,null,null,"Use of Basic Sanitation and Hygiene","Yes","N/A","N/A","N/A","N/A","N/A","N/A","N/A","N/A","N/A","N/A","N/A","N/A","N/A","N/A","N/A","N/A","N/A","N/A","N/A","N/A","N/A"]
[null,null,null,null,null,null,null,null,null,null,null,null,null,null,null,null,null,null,null,null,null,null,null,null,null,null,null,null,null,null,null,null,null,null,null,null,null,null,null,null,null,null,null,null,null,null,null,null,null,null,null,null,null,"No","N/A","N/A","N/A","N/A","N/A","N/A","N/A","N/A","N/A","N/A","N/A","N/A","N/A","N/A","N/A","N/A","N/A","N/A","N/A","N/A","N/A"]
[null,null,null,null,null,null,null,null,null,null,null,null,null,null,null,null,null,null,null,null,null,null,null,null,null,null,null,null,null,null,null,null,null,null,null,null,null,null,null,null,null,null,null,null,null,null,null,null,null,null,null,null,"Use of Basic Water","Yes","N/A","N/A","N/A","N/A","N/A","N/A","N/A","N/A","N/A","N/A","N/A","N/A","N/A","N/A","N/A","N/A","N/A","N/A","N/A","N/A","N/A"]
[null,null,null,null,null,null,null,null,null,null,null,null,null,null,null,null,null,null,null,null,null,null,null,null,null,null,null,null,null,null,null,null,null,null,null,null,null,null,null,null,null,null,null,null,null,null,null,null,null,null,null,null,null,"No","N/A","N/A","N/A","N/A","N/A","N/A","N/A","N/A","N/A","N/A","N/A","N/A","N/A","N/A","N/A","N/A","N/A","N/A","N/A","N/A","N/A"]
[null,null,null,null,null,null,null,null,null,null,null,null,null,null,null,null,null,null,null,null,null,null,null,null,null,null,null,null,null,null,null,null,null,null,null,null,null,null,null,null,null,null,null,null,null,null,null,null,null,null,null,null,"Use of Basic Sanitation","Yes","N/A","N/A","N/A","N/A","N/A","N/A","N/A","N/A","N/A","N/A","N/A","N/A","N/A","N/A","N/A","N/A","N/A","N/A","N/A","N/A","N/A"]
[null,null,null,null,null,null,null,null,null,null,null,null,null,null,null,null,null,null,null,null,null,null,null,null,null,null,null,null,null,null,null,null,null,null,null,null,null,null,null,null,null,null,null,null,null,null,null,null,null,null,null,null,null,"No","N/A","N/A","N/A","N/A","N/A","N/A","N/A","N/A","N/A","N/A","N/A","N/A","N/A","N/A","N/A","N/A","N/A","N/A","N/A","N/A","N/A"]
[null,null,null,null,null,null,null,null,null,null,null,null,null,null,null,null,null,null,null,null,null,null,null,null,null,null,null,null,null,null,null,null,null,null,null,null,null,null,null,null,null,null,null,null,null,null,null,null,null,null,null,null,"Access to Basic Hygiene","Yes","N/A","N/A","N/A","N/A","N/A","N/A","N/A","N/A","N/A","N/A","N/A","N/A","N/A","N/A","N/A","N/A","N/A","N/A","N/A","N/A","N/A"]
[null,null,null,null,null,null,null,null,null,null,null,null,null,null,null,null,null,null,null,null,null,null,null,null,null,null,null,null,null,null,null,null,null,null,null,null,null,null,null,null,null,null,null,null,null,null,null,null,null,null,null,null,null,"No","N/A","N/A","N/A","N/A","N/A","N/A","N/A","N/A","N/A","N/A","N/A","N/A","N/A","N/A","N/A","N/A","N/A","N/A","N/A","N/A","N/A"]
[]
[]
[]
[]
[]
[]
[]
[]
[]
[]
[]
[]
[]
[]
[]
[]
[]
[]
[]
[]
[]
[]
[]
[]
[]
[]
[]
[]
[]
[]
[]
[]
[]
[]
[]
[]
[]
[]
[]
[]
[]
[]
[]
[]
[null,null,"INITIAL (national) Wealth Index",null,null,null,null,"URBAN Wealth Index",null,null,null,null,"RURAL Wealth Index"]
[null,null,"Matrice des composantes",null,null,null,null,"Matrice des composantes",null,null,null,null,"Matrice des composantes"]
[null,null,null,null,"Composante",null,null,null,null,"Composante",null,null,null,null,"Composante"]
[null,"Note:\n\nThe INITIAL (national) Wealth Index is based on the first component of the Principal Component Analysis (PCA) which has been obtained at national level.\n\nThe final national-level (NATIONAL) Wealth Index is based on the URBAN and RURAL specific wealth indexes. Regression procedures are used to establish the relationships between the two sets of scores (urban and rural) and the initial (national) wealth factors.\nThis allows best use of the available information for each area and a better precision of the FINAL (NATIONAL) Wealth Index.\n\nFor dependency reasons, all WASH variables (contained in the generic MICS and DHS scripts) have been excluded from the sets of asset variables used in the PCAs.\n\nThe PCA can extracts as many components as there are asset variables in the input. Only the first of the components is used to represent the Wealth Index. \n\nThe scores represent the weights of the asset variables on the Wealth Index (correlations between the variables and the component).\n\nThe communalities are the proportion of each variable's variance that can be explained by the component.\n\nProportion of explained variance is the part of the model's total variance that is explained by the component.\n\nFor more information on the procedure used:\n\nThe DHS Wealth Index, DHS Comparative Reports No. 6, Shea Oscar Rutstein, Kiersten Johnson, ORC Macro International Inc., 2004.\n\nThe DHS Wealth Index: Approaches for Rural and Urban Areas, Shea O. Rutstein, ORC Macro International Inc., 2008.\n\nMICS Methodological Paper No. 4, Review of options for reporting water, sanitation and hygiene coverage by wealth quintile, UNICEF, 2016.",null,null,"1",null,null,null,null,"1",null,null,null,null,"1"]
[null,null,"floor33 Terrazo, ceramic tile floor",null,0.56379744604696047,null,null,"SH121F Household has internet connection",null,0.49773882442923789,null,null,"floor33 Terrazo, ceramic tile floor",null,0.55531020764586314]
[null,null,"HV208 Has television",null,0.52332846529086774,null,null,"cooknone Does not cook",null,-0.49713638907950269,null,null,"HV208 Has television",null,0.54635612006497347]
[null,null,"HV209 Has refrigerator",null,0.51032550992122372,null,null,"HV243E Has a computer",null,0.49637693366134622,null,null,"HV209 Has refrigerator",null,0.52431828049683382]
[null,null,"HV243E Has a computer",null,0.49707113860737234,null,null,"HV208 Has television",null,0.49591136614166065,null,null,"SH121D Household has satelite/cable TV",null,0.50322244983073605]
[null,null,"floor34 Concrete, cement floor",null,-0.49497225072159795,null,null,"SH121D Household has satelite/cable TV",null,0.49179562553359857,null,null,"SH121K Household has washing machine",null,0.49661202578683472]
[null,null,"SH121J Household has air conditioner",null,0.48538700805446328,null,null,"HV209 Has refrigerator",null,0.46538878958813468,null,null,"floor34 Concrete, cement floor",null,-0.48561151659943513]
[null,null,"SH121K Household has washing machine",null,0.47981517076176189,null,null,"SH121J Household has air conditioner",null,0.46344469509458325,null,null,"cooklpg LPG for cooking",null,0.48525438014632294]
[null,null,"SH121D Household has satelite/cable TV",null,0.47202817849959228,null,null,"SH121K Household has washing machine",null,0.44578856882682977,null,null,"HV243E Has a computer",null,0.47442019582610917]
[null,null,"cooknone Does not cook",null,-0.45557681382811527,null,null,"HV247 Has bank account",null,0.39891110404452224,null,null,"cooknone Does not cook",null,-0.46740964975514837]
[null,null,"cooklpg LPG for cooking",null,0.4410416375706282,null,null,"HV211 Has motorcycle/scooter",null,0.3789894090476818,null,null,"SH121J Household has air conditioner",null,0.4620024649330608]
[null,null,"SH121F Household has internet connection",null,0.43159133557614243,null,null,"HV243B Has watch",null,0.35380647914601904,null,null,"SH121F Household has internet connection",null,0.42209406804127181]
[null,null,"HV211 Has motorcycle/scooter",null,0.41489924650618082,null,null,"cooklpg LPG for cooking",null,0.35255214994210704,null,null,"HV211 Has motorcycle/scooter",null,0.3838365884548865]
[null,null,"HV243A Has mobile telephone",null,0.3404775511278994,null,null,"HV243A Has mobile telephone",null,0.3000785520154774,null,null,"HV243A Has mobile telephone",null,0.36324404968382557]
[null,null,"HV243B Has watch",null,0.31223875472359836,null,null,"persroom Number of members per sleeping room",null,-0.23448255448305816,null,null,"HV243B Has watch",null,0.2939991143174745]
[null,null,"HV247 Has bank account",null,0.24294667115107355,null,null,"cookelec Electricity for cooking",null,-0.22903926198606425,null,null,"HV210 Has bicycle",null,0.25747014483251363]
[null,null,"cookoth Other fuel for cooking",null,-0.21505547476237558,null,null,"floor33 Terrazo, ceramic tile floor",null,0.22881706043670674,null,null,"cookoth Other fuel for cooking",null,-0.22954249239140467]
[null,null,"cookelse Household cooks in other place",null,-0.2077452784164151,null,null,"roof32 Finished wood roof",null,-0.20173363658726276,null,null,"HV247 Has bank account",null,0.22442642788807432]
[null,null,"wall31 Cement walls",null,0.17923570704745528,null,null,"roof31 Metal/ corrugated iron roof",null,-0.20014077004655087,null,null,"cookelse Household cooks in other place",null,-0.22065070332412376]
[null,null,"floor32 Vinyl, asphalt strips floor",null,-0.1771807221403118,null,null,"HV210 Has bicycle",null,0.19238511145685558,null,null,"floor32 Vinyl, asphalt strips floor",null,-0.1669735160384212]
[null,null,"HV212 Has car/truck",null,0.15643048749675026,null,null,"roof37 Asbestos/slate roofing sheets",null,0.18838160724807637,null,null,"cookelec Electricity for cooking",null,-0.16038225749599319]
[null,null,"HV210 Has bicycle",null,0.153348855377794,null,null,"floor34 Concrete, cement floor",null,-0.18689385804213055,null,null,"cookwood Wood for cooking",null,-0.14775696020168688]
[null,null,"cookelec Electricity for cooking",null,-0.15161482654797895,null,null,"HV212 Has car/truck",null,0.16924377768434501,null,null,"HV212 Has car/truck",null,0.1452638607244279]
[null,null,"floor11 Earth, sand floor",null,-0.14887159379904122,null,null,"wall24 Plywood walls",null,-0.11979675317434355,null,null,"floor11 Earth, sand floor",null,-0.14515740340924152]
[null,null,"cookwood Wood for cooking",null,-0.14873797261730404,null,null,"HV243D Has boat with a motor",null,0.11600230276173304,null,null,"HV206 Has electricity",null,0.14465934200008496]
[null,null,"roof37 Asbestos/slate roofing sheets",null,0.14803771962851225,null,null,"roof36 Roofing shingles roof",null,9.5204234982739527E-2,null,null,"SH122G Household has any other boat",null,0.1326584671512607]
[null,null,"HV206 Has electricity",null,0.12719779173103912,null,null,"wall96 Other type of walls",null,-9.4232006987720676E-2,null,null,"wall31 Cement walls",null,0.11957347921553428]
[null,null,"wall32 Stone walls with lime/cement",null,-0.12066297287159007,null,null,"wall31 Cement walls",null,9.3812787989482366E-2,null,null,"SH122E Household has pickup/lorry",null,0.11462071801233495]
[null,null,"cookbio Biogas for cooking",null,-0.10602901914386048,null,null,"cookgas Natural gas for cooking",null,-8.2163122797248592E-2,null,null,"cookbio Biogas for cooking",null,-0.1044352026859818]
[null,null,"SH122E Household has pickup/lorry",null,0.10536938976979157,null,null,"floor21 Rudimentary wood plank floor",null,-7.8624766661775758E-2,null,null,"wall32 Stone walls with lime/cement",null,-8.7048282705260396E-2]
[null,null,"SH122G Household has any other boat",null,9.8873845819619333E-2,null,null,"floor35 Rug or mat floor",null,-7.6837290928585697E-2,null,null,"wall11 No walls",null,-7.7689864412993512E-2]
[null,null,"wall11 No walls",null,-9.7814706071214688E-2,null,null,"floor31 Parquet, wood tile floor",null,-7.5090914884507087E-2,null,null,"HV243D Has boat with a motor",null,7.7035342096450479E-2]
[null,null,"HV243D Has boat with a motor",null,6.2360546164829604E-2,null,null,"roof12 Thatch, palm leaf roof",null,-7.2841626951768532E-2,null,null,"cookkero Kerosene for cooking",null,-6.2679076086617325E-2]
[null,null,"cookkero Kerosene for cooking",null,-6.0636748475703064E-2,null,null,"HV206 Has electricity",null,7.1909928876414342E-2,null,null,"roof96 Other type of roof",null,-4.6888213675183261E-2]
[null,null,"roof31 Metal/ corrugated iron roof",null,-4.9555721695062491E-2,null,null,"wall26 Reused wood walls",null,-7.0919451944155304E-2,null,null,"roof31 Metal/ corrugated iron roof",null,4.6340498908747939E-2]
[null,null,"wall33 Brick walls",null,-4.5430310216927824E-2,null,null,"floor32 Vinyl, asphalt strips floor",null,-7.0211469720497799E-2,null,null,"cookothe Household cooks in other house",null,4.4170990928552305E-2]
[null,null,"roof96 Other type of roof",null,-4.1877714093293626E-2,null,null,"roof34 Tile roof",null,6.3092972512734324E-2,null,null,"cookout Household cooks outside house",null,-3.7586176932195313E-2]
[null,null,"floor35 Rug or mat floor",null,-3.3782759390403129E-2,null,null,"SH122G Household has any other boat",null,5.4406007890535193E-2,null,null,"floor35 Rug or mat floor",null,-3.5606607512918324E-2]
[null,null,"persroom Number of members per sleeping room",null,3.2244890140599967E-2,null,null,"floor96 Other type of flooring",null,-4.6950938073609824E-2,null,null,"roof36 Roofing shingles roof",null,-3.4480675573977639E-2]
[null,null,"cookothe Household cooks in other house",null,-3.1145745280294606E-2,null,null,"wall11 No walls",null,-4.0916189642236228E-2,null,null,"floor31 Parquet, wood tile floor",null,-3.2053111027821601E-2]
[null,null,"cookout Household cooks outside house",null,-3.1044454778947288E-2,null,null,"roof96 Other type of roof",null,3.7771465165431721E-2,null,null,"HV207 Has radio",null,2.8586799750495613E-2]
[null,null,"wall96 Other type of walls",null,-3.0832980874931696E-2,null,null,"cookothe Household cooks in other house",null,3.3965727988555509E-2,null,null,"cookgas Natural gas for cooking",null,-2.6958239868693255E-2]
[null,null,"floor31 Parquet, wood tile floor",null,-3.0346049500496616E-2,null,null,"cookout Household cooks outside house",null,-2.6585924433487527E-2,null,null,"roof34 Tile roof",null,-2.4560584194910199E-2]
[null,null,"HV207 Has radio",null,-2.9827510317200233E-2,null,null,"floor11 Earth, sand floor",null,-2.3122040696238539E-2,null,null,"roof37 Asbestos/slate roofing sheets",null,2.4353717197802358E-2]
[null,null,"roof34 Tile roof",null,2.5312315794955829E-2,null,null,"SH122E Household has pickup/lorry",null,2.2103243291447437E-2,null,null,"wall26 Reused wood walls",null,-1.9533645340568867E-2]
[null,null,"roof36 Roofing shingles roof",null,-2.4722080131299968E-2,null,null,"HV207 Has radio",null,1.2936750462033977E-2,null,null,"wall96 Other type of walls",null,-1.929962731422482E-2]
[null,null,"wall26 Reused wood walls",null,-2.2660384499610393E-2,null,null,"wall32 Stone walls with lime/cement",null,-8.7445024848794798E-3,null,null,"roof32 Finished wood roof",null,1.6835951578631544E-2]
[null,null,"floor22 Palm/bamboo floor",null,-1.7081801982820447E-2,null,null,null,null,null,null,null,"floor22 Palm/bamboo floor",null,-1.2376561391349716E-2]
[null,null,"floor96 Other type of flooring",null,-1.2882661059583456E-2,null,null,null,null,null,null,null,"floor96 Other type of flooring",null,-9.376127972629782E-3]
[null,null,"wall24 Plywood walls",null,-1.2550229530667291E-2,null,null,null,null,null,null,null,"persroom Number of members per sleeping room",null,8.553799918753862E-3]
[null,null,"wall25 Carton walls",null,-1.1722363141284579E-2,null,null,"Qualités de représentation",null,null,null,null,"wall33 Brick walls",null,-6.0375265925083381E-3]
[null,null,"floor21 Rudimentary wood plank floor",null,-9.9014937950082527E-3,null,null,null,null,"Extraction",null,null,"wall25 Carton walls",null,-5.8645636160968972E-3]
[null,null,"roof32 Finished wood roof",null,-6.7998545613021672E-3,null,null,"persroom Number of members per sleeping room",null,5.4982068356900338E-2,null,null,"floor21 Rudimentary wood plank floor",null,-4.9055300138180664E-3]
[null,null,"cookgas Natural gas for cooking",null,3.1549834538676554E-3,null,null,"floor11 Earth, sand floor",null,5.3462876595851124E-4,null,null,"roof11 No roof",null,3.6373221680202164E-3]
[null,null,"roof12 Thatch, palm leaf roof",null,-2.4453482638833444E-3,null,null,"floor21 Rudimentary wood plank floor",null,6.1818539326186847E-3,null,null,"wall24 Plywood walls",null,2.2858551218319836E-3]
[null,null,"roof11 No roof",null,2.0801286147087454E-3,null,null,"floor31 Parquet, wood tile floor",null,5.6386454981922881E-3]
[null,null,null,null,null,null,null,"floor32 Vinyl, asphalt strips floor",null,4.9296504803123791E-3]
[null,null,null,null,null,null,null,"floor33 Terrazo, ceramic tile floor",null,5.2357247146895505E-2]
[null,null,null,null,null,null,null,"floor34 Concrete, cement floor",null,3.4929314173872045E-2,null,null,"Qualités de représentation"]
[null,null,"Qualités de représentation",null,null,null,null,"floor35 Rug or mat floor",null,5.9039692772441177E-3,null,null,null,null,"Extraction"]
[null,null,null,null,"Extraction",null,null,"floor96 Other type of flooring",null,2.2043905859919447E-3,null,null,"persroom Number of members per sleeping room",null,7.3167493050073574E-5]
[null,null,"persroom Number of members per sleeping room",null,1.039732940179361E-3,null,null,"wall11 No walls",null,1.6741345748394392E-3,null,null,"floor11 Earth, sand floor",null,2.1070671764513282E-2]
[null,null,"floor11 Earth, sand floor",null,2.2162751440266727E-2,null,null,"wall24 Plywood walls",null,1.435126207111459E-2,null,null,"floor21 Rudimentary wood plank floor",null,2.4064224716469881E-5]
[null,null,"floor21 Rudimentary wood plank floor",null,9.8039579372586935E-5,null,null,"wall26 Reused wood walls",null,5.0295686640593534E-3,null,null,"floor22 Palm/bamboo floor",null,1.5317927187384842E-4]
[null,null,"floor22 Palm/bamboo floor",null,2.9178795898028857E-4,null,null,"wall31 Cement walls",null,8.8008391903595662E-3,null,null,"floor31 Parquet, wood tile floor",null,1.0274019265618588E-3]
[null,null,"floor31 Parquet, wood tile floor",null,9.2088272028659093E-4,null,null,"wall32 Stone walls with lime/cement",null,7.6466323708063402E-5,null,null,"floor32 Vinyl, asphalt strips floor",null,2.7880155058232901E-2]
[null,null,"floor32 Vinyl, asphalt strips floor",null,3.1393008298162377E-2,null,null,"wall96 Other type of walls",null,8.879671140933838E-3,null,null,"floor33 Terrazo, ceramic tile floor",null,0.30836942671569162]
[null,null,"floor33 Terrazo, ceramic tile floor",null,0.3178675601690753,null,null,"roof12 Thatch, palm leaf roof",null,5.3059026169806119E-3,null,null,"floor34 Concrete, cement floor",null,0.23581854505400346]
[null,null,"floor34 Concrete, cement floor",null,0.24499752898440441,null,null,"roof31 Metal/ corrugated iron roof",null,4.0056327834826357E-2,null,null,"floor35 Rug or mat floor",null,1.2678304985790116E-3]
[null,null,"floor35 Rug or mat floor",null,1.1412748320298708E-3,null,null,"roof32 Finished wood roof",null,4.0696460130721798E-2,null,null,"floor96 Other type of flooring",null,8.7911775759130672E-5]
[null,null,"floor96 Other type of flooring",null,1.6596295597610795E-4,null,null,"roof34 Tile roof",null,3.9807231804926489E-3,null,null,"wall11 No walls",null,6.0357150325093161E-3]
[null,null,"wall11 No walls",null,9.5677167237981243E-3,null,null,"roof36 Roofing shingles roof",null,9.0638463586486841E-3,null,null,"wall24 Plywood walls",null,5.2251336380055121E-6]
[null,null,"wall24 Plywood walls",null,1.5750826127243332E-4,null,null,"roof37 Asbestos/slate roofing sheets",null,3.54876299493685E-2,null,null,"wall25 Carton walls",null,3.4393106407247516E-5]
[null,null,"wall25 Carton walls",null,1.3741379761614728E-4,null,null,"roof96 Other type of roof",null,1.4266835807434219E-3,null,null,"wall26 Reused wood walls",null,3.8156330029112781E-4]
[null,null,"wall26 Reused wood walls",null,5.1349302567018295E-4,null,null,"cookelec Electricity for cooking",null,5.2458983531120974E-2,null,null,"wall31 Cement walls",null,1.429781693170781E-2]
[null,null,"wall31 Cement walls",null,3.2125438680801213E-2,null,null,"cooklpg LPG for cooking",null,0.12429301842880193,null,null,"wall32 Stone walls with lime/cement",null,7.5774035219349362E-3]
[null,null,"wall32 Stone walls with lime/cement",null,1.4559553022210082E-2,null,null,"cookgas Natural gas for cooking",null,6.7507787477957514E-3,null,null,"wall33 Brick walls",null,3.6451727355245343E-5]
[null,null,"wall33 Brick walls",null,2.0639130864062967E-3,null,null,"cooknone Does not cook",null,0.2471445893470067,null,null,"wall96 Other type of walls",null,3.7247561446797275E-4]
[null,null,"wall96 Other type of walls",null,9.5067270963390378E-4,null,null,"cookothe Household cooks in other house",null,1.1536706777925431E-3,null,null,"roof11 No roof",null,1.3230112553971287E-5]
[null,null,"roof11 No roof",null,4.3269350537301238E-6,null,null,"cookout Household cooks outside house",null,7.0681137798310912E-4,null,null,"roof31 Metal/ corrugated iron roof",null,2.147441839111669E-3]
[null,null,"roof12 Thatch, palm leaf roof",null,5.9797281316772869E-6,null,null,"HV206 Has electricity",null,5.1710378710109689E-3,null,null,"roof32 Finished wood roof",null,2.8344926555802594E-4]
[null,null,"roof31 Metal/ corrugated iron roof",null,2.4557695527184873E-3,null,null,"HV207 Has radio",null,1.6735951251693632E-4,null,null,"roof34 Tile roof",null,6.0322229599527272E-4]
[null,null,"roof32 Finished wood roof",null,4.6238022054861891E-5,null,null,"HV208 Has television",null,0.24592808306848821,null,null,"roof36 Roofing shingles roof",null,1.1889169880378982E-3]
[null,null,"roof34 Tile roof",null,6.4071333090357028E-4,null,null,"HV209 Has refrigerator",null,0.2165867254743091,null,null,"roof37 Asbestos/slate roofing sheets",null,5.9310354135053438E-4]
[null,null,"roof36 Roofing shingles roof",null,6.1118124601841661E-4,null,null,"HV210 Has bicycle",null,3.7012031110266741E-2,null,null,"roof96 Other type of roof",null,2.1985045816496425E-3]
[null,null,"roof37 Asbestos/slate roofing sheets",null,2.1915166432810003E-2,null,null,"HV211 Has motorcycle/scooter",null,0.14363297217031107,null,null,"cookelec Electricity for cooking",null,2.5722468519511064E-2]
[null,null,"roof96 Other type of roof",null,1.7537429376796435E-3,null,null,"HV212 Has car/truck",null,2.8643456284867998E-2,null,null,"cooklpg LPG for cooking",null,0.23547181345119209]
[null,null,"cookelec Electricity for cooking",null,2.2987055629173744E-2,null,null,"HV243A Has mobile telephone",null,9.0047137379705572E-2,null,null,"cookgas Natural gas for cooking",null,7.2674669681800251E-4]
[null,null,"cooklpg LPG for cooking",null,0.19451772607098136,null,null,"HV243B Has watch",null,0.12517902468570241,null,null,"cookbio Biogas for cooking",null,1.09067115600621E-2]
[null,null,"cookgas Natural gas for cooking",null,9.9539205941786804E-6,null,null,"HV243D Has boat with a motor",null,1.3456534246024776E-2,null,null,"cookkero Kerosene for cooking",null,3.9286665790719639E-3]
[null,null,"cookbio Biogas for cooking",null,1.1242152900609132E-2,null,null,"HV243E Has a computer",null,0.24639006027104052,null,null,"cookwood Wood for cooking",null,2.1832119288042882E-2]
[null,null,"cookkero Kerosene for cooking",null,3.6768152657056779E-3,null,null,"HV247 Has bank account",null,0.15913006893001966,null,null,"cooknone Does not cook",null,0.21847178068423048]
[null,null,"cookwood Wood for cooking",null,2.2122984498305884E-2,null,null,"SH121D Household has satelite/cable TV",null,0.2418629372939835,null,null,"cookoth Other fuel for cooking",null,5.268975581325807E-2]
[null,null,"cooknone Does not cook",null,0.20755023329777719,null,null,"SH121F Household has internet connection",null,0.24774393734419969,null,null,"cookothe Household cooks in other house",null,1.9510764396102501E-3]
[null,null,"cookoth Other fuel for cooking",null,4.6248857225270758E-2,null,null,"SH121J Household has air conditioner",null,0.21478098541131124,null,null,"cookout Household cooks outside house",null,1.4127206963782911E-3]
[null,null,"cookothe Household cooks in other house",null,9.7005744906499371E-4,null,null,"SH121K Household has washing machine",null,0.19872744809667314,null,null,"cookelse Household cooks in other place",null,4.8686732877430479E-2]
[null,null,"cookout Household cooks outside house",null,9.6375817252210305E-4,null,null,"SH122E Household has pickup/lorry",null,4.8855336400091618E-4,null,null,"HV206 Has electricity",null,2.0926325227897544E-2]
[null,null,"cookelse Household cooks in other place",null,4.3158100704313827E-2,null,null,"SH122G Household has any other boat",null,2.9600136945849777E-3,null,null,"HV207 Has radio",null,8.1720511997493601E-4]
[null,null,"HV206 Has electricity",null,1.6179278221252806E-2,null,null,null,null,null,null,null,"HV208 Has television",null,0.29850500993245171]
[null,null,"HV207 Has radio",null,8.8968037172268638E-4,null,null,null,null,null,null,null,"HV209 Has refrigerator",null,0.27490965926315653]
[null,null,"HV208 Has television",null,0.27387268258369496,null,null,"Variance totale expliquée",null,null,null,null,"HV210 Has bicycle",null,6.6290875480075548E-2]
[null,null,"HV209 Has refrigerator",null,0.26043212607635702,null,null,"Composante",null,"Sommes extraites du carré des chargements",null,null,"HV211 Has motorcycle/scooter",null,0.14733052663668592]
[null,null,"HV210 Has bicycle",null,2.3515871445679577E-2,null,null,null,null,"Total","% de la variance","% cumulé","HV212 Has car/truck",null,2.1101589232565988E-2]
[null,null,"HV211 Has motorcycle/scooter",null,0.17214138475139659,null,null,"1",null,2.9929075021543015,6.5063206568571772,6.5063206568571772,"HV243A Has mobile telephone",null,0.13194623963070554]
[null,null,"HV212 Has car/truck",null,2.4470497418470939E-2,null,null,null,null,null,null,null,"HV243B Has watch",null,8.6435479219459432E-2]
[null,null,"HV243A Has mobile telephone",null,0.11592496282205135,null,null,null,null,null,null,null,"HV243D Has boat with a motor",null,5.9344439319171556E-3]
[null,null,"HV243B Has watch",null,9.749303995134341E-2,null,null,"Matrice des coefficients des composantes",null,null,null,null,"HV243E Has a computer",null,0.22507452220768379]
[null,null,"HV243D Has boat with a motor",null,3.8888377179758442E-3,null,null,null,null,"Composante",null,null,"HV247 Has bank account",null,5.036722153460102E-2]
[null,null,"HV243E Has a computer",null,0.24707971683642957,null,null,null,null,"1",null,null,"SH121D Household has satelite/cable TV",null,0.25323283401364766]
[null,null,"HV247 Has bank account",null,5.9023085023387871E-2,null,null,"persroom Number of members per sleeping room",null,-7.8346074616164066E-2,null,null,"SH121F Household has internet connection",null,0.1781634022756298]
[null,null,"SH121D Household has satelite/cable TV",null,0.22281060129764294,null,null,"floor11 Earth, sand floor",null,-7.7256115264488587E-3,null,null,"SH121J Household has air conditioner",null,0.21344627760422408]
[null,null,"SH121F Household has internet connection",null,0.1862710809443984,null,null,"floor21 Rudimentary wood plank floor",null,-2.6270363051708569E-2,null,null,"SH121K Household has washing machine",null,0.24662350415610379]
[null,null,"SH121J Household has air conditioner",null,0.23560054758806359,null,null,"floor31 Parquet, wood tile floor",null,-2.5089620989107237E-2,null,null,"SH122E Household has pickup/lorry",null,1.3137908997663206E-2]
[null,null,"SH121K Household has washing machine",null,0.23022259809313872,null,null,"floor32 Vinyl, asphalt strips floor",null,-2.3459284882663235E-2,null,null,"SH122G Household has any other boat",null,1.7598268906922114E-2]
[null,null,"SH122E Household has pickup/lorry",null,1.1102708300458257E-2,null,null,"floor33 Terrazo, ceramic tile floor",null,7.6453101297652426E-2]
[null,null,"SH122G Household has any other boat",null,9.776037387161856E-3,null,null,"floor34 Concrete, cement floor",null,-6.2445584404998783E-2]
[null,null,null,null,null,null,null,"floor35 Rug or mat floor",null,-2.5673125839431397E-2,null,null,"Variance totale expliquée"]
[null,null,null,null,null,null,null,"floor96 Other type of flooring",null,-1.5687400308834944E-2,null,null,"Composante",null,"Sommes extraites du carré des chargements"]
[null,null,"Variance totale expliquée",null,null,null,null,"wall11 No walls",null,-1.3671050512849012E-2,null,null,null,null,"Total","% de la variance","% cumulé"]
[null,null,"Composante",null,"Sommes extraites du carré des chargements",null,null,"wall24 Plywood walls",null,-4.0026881247787832E-2,null,null,"1",null,3.5051831527525223,6.4910799125046719,6.4910799125046719]
[null,null,null,null,"Total","% de la variance","% cumulé","wall26 Reused wood walls",null,-2.3695838208533777E-2]
[null,null,"1",null,3.4517297893364574,6.2758723442481044,6.2758723442481044,"wall31 Cement walls",null,3.1345034192321576E-2]
[null,null,null,null,null,null,null,"wall32 Stone walls with lime/cement",null,-2.9217416437311095E-3,null,null,"Matrice des coefficients des composantes"]
[null,null,null,null,null,null,null,"wall96 Other type of walls",null,-3.1485105009056324E-2,null,null,null,null,"Composante"]
[null,null,"Matrice des coefficients des composantes",null,null,null,null,"roof12 Thatch, palm leaf roof",null,-2.433808158098336E-2,null,null,null,null,"1"]
[null,null,null,null,"Composante",null,null,"roof31 Metal/ corrugated iron roof",null,-6.6871685777956408E-2,null,null,"persroom Number of members per sleeping room",null,2.4403289488701334E-3]
[null,null,null,null,"1",null,null,"roof32 Finished wood roof",null,-6.740389953316446E-2,null,null,"floor11 Earth, sand floor",null,-4.141221644730704E-2]
[null,null,"persroom Number of members per sleeping room",null,9.3416611694852707E-3,null,null,"roof34 Tile roof",null,2.1080829416652486E-2,null,null,"floor21 Rudimentary wood plank floor",null,-1.3995074722317697E-3]
[null,null,"floor11 Earth, sand floor",null,-4.3129561954401846E-2,null,null,"roof36 Roofing shingles roof",null,3.1809948992480151E-2,null,null,"floor22 Palm/bamboo floor",null,-3.5309314383845393E-3]
[null,null,"floor21 Rudimentary wood plank floor",null,-2.868559939308477E-3,null,null,"roof37 Asbestos/slate roofing sheets",null,6.2942676014036122E-2,null,null,"floor31 Parquet, wood tile floor",null,-9.1444896403348273E-3]
[null,null,"floor22 Palm/bamboo floor",null,-4.9487656987495998E-3,null,null,"roof96 Other type of roof",null,1.2620324930938804E-2,null,null,"floor32 Vinyl, asphalt strips floor",null,-4.7636174419959085E-2]
[null,null,"floor31 Parquet, wood tile floor",null,-8.7915483982105615E-3,null,null,"cookelec Electricity for cooking",null,-7.652734400284715E-2,null,null,"floor33 Terrazo, ceramic tile floor",null,0.1584254469583975]
[null,null,"floor32 Vinyl, asphalt strips floor",null,-5.1330994299635509E-2,null,null,"cooklpg LPG for cooking",null,0.11779587230421894,null,null,"floor34 Concrete, cement floor",null,-0.1385409821504186]
[null,null,"floor33 Terrazo, ceramic tile floor",null,0.16333765400429615,null,null,"cookgas Natural gas for cooking",null,-2.7452610125139977E-2,null,null,"floor35 Rug or mat floor",null,-1.0158273037731981E-2]
[null,null,"floor34 Concrete, cement floor",null,-0.14339831937329856,null,null,"cooknone Does not cook",null,-0.16610482907395657,null,null,"floor96 Other type of flooring",null,-2.6749323969753112E-3]
[null,null,"floor35 Rug or mat floor",null,-9.7871969859197293E-3,null,null,"cookothe Household cooks in other house",null,1.1348739633318736E-2,null,null,"wall11 No walls",null,-2.2164281016809593E-2]
[null,null,"floor96 Other type of flooring",null,-3.7322333571365531E-3,null,null,"cookout Household cooks outside house",null,-8.8829756396918095E-3,null,null,"wall24 Plywood walls",null,6.5213571508723181E-4]
[null,null,"wall11 No walls",null,-2.8337880437048362E-2,null,null,"HV206 Has electricity",null,2.402677958628972E-2,null,null,"wall25 Carton walls",null,-1.6731118918826312E-3]
[null,null,"wall24 Plywood walls",null,-3.6359246802687528E-3,null,null,"HV207 Has radio",null,4.3224691884804567E-3,null,null,"wall26 Reused wood walls",null,-5.5727887785919673E-3]
[null,null,"wall25 Carton walls",null,-3.3960836614438531E-3,null,null,"HV208 Has television",null,0.16569552042109637,null,null,"wall31 Cement walls",null,3.411333274315112E-2]
[null,null,"wall26 Reused wood walls",null,-6.5649358097542455E-3,null,null,"HV209 Has refrigerator",null,0.15549721775669537,null,null,"wall32 Stone walls with lime/cement",null,-2.4834160987252215E-2]
[null,null,"wall31 Cement walls",null,5.1926343597686588E-2,null,null,"HV210 Has bicycle",null,6.4280339876316359E-2,null,null,"wall33 Brick walls",null,-1.7224568102146784E-3]
[null,null,"wall32 Stone walls with lime/cement",null,-3.495724759346984E-2,null,null,"HV211 Has motorcycle/scooter",null,0.12662917540047072,null,null,"wall96 Other type of walls",null,-5.5060253553567851E-3]
[null,null,"wall33 Brick walls",null,-1.316160678546657E-2,null,null,"HV212 Has car/truck",null,5.6548282084402185E-2,null,null,"roof11 No roof",null,1.0376981771020809E-3]
[null,null,"wall96 Other type of walls",null,-8.9326171967994226E-3,null,null,"HV243A Has mobile telephone",null,0.10026322290263903,null,null,"roof31 Metal/ corrugated iron roof",null,1.3220564201433541E-2]
[null,null,"roof11 No roof",null,6.0263367692771168E-4,null,null,"HV243B Has watch",null,0.1182149728621243,null,null,"roof32 Finished wood roof",null,4.8031588778494338E-3]
[null,null,"roof12 Thatch, palm leaf roof",null,-7.0844139406214205E-4,null,null,"HV243D Has boat with a motor",null,3.8759067120595708E-2,null,null,"roof34 Tile roof",null,-7.006933197092273E-3]
[null,null,"roof31 Metal/ corrugated iron roof",null,-1.4356778983151174E-2,null,null,"HV243E Has a computer",null,0.16585107735673518,null,null,"roof36 Roofing shingles roof",null,-9.8370538917205898E-3]
[null,null,"roof32 Finished wood roof",null,-1.9699846095453878E-3,null,null,"HV247 Has bank account",null,0.1332854770010049,null,null,"roof37 Asbestos/slate roofing sheets",null,6.9479157397747023E-3]
[null,null,"roof34 Tile roof",null,7.3332263357212936E-3,null,null,"SH121D Household has satelite/cable TV",null,0.16432035576762827,null,null,"roof96 Other type of roof",null,-1.3376822731320978E-2]
[null,null,"roof36 Roofing shingles roof",null,-7.1622292705746261E-3,null,null,"SH121F Household has internet connection",null,0.16630611673463488,null,null,"cookelec Electricity for cooking",null,-4.5755742426768629E-2]
[null,null,"roof37 Asbestos/slate roofing sheets",null,4.2887980422410245E-2,null,null,"SH121J Household has air conditioner",null,0.15484765057423078,null,null,"cooklpg LPG for cooking",null,0.1384390940499832]
[null,null,"roof96 Other type of roof",null,-1.2132384818379416E-2,null,null,"SH121K Household has washing machine",null,0.14894832817450926,null,null,"cookgas Natural gas for cooking",null,-7.6909646925364533E-3]
[null,null,"cookelec Electricity for cooking",null,-4.3924303407632773E-2,null,null,"SH122E Household has pickup/lorry",null,7.3852076201945662E-3,null,null,"cookbio Biogas for cooking",null,-2.9794506630551325E-2]
[null,null,"cooklpg LPG for cooking",null,0.12777409139416201,null,null,"SH122G Household has any other boat",null,1.8178312510952515E-2,null,null,"cookkero Kerosene for cooking",null,-1.7881826242773423E-2]
[null,null,"cookgas Natural gas for cooking",null,9.1402967393752808E-4,null,null,null,null,null,null,null,"cookwood Wood for cooking",null,-4.2153848675684037E-2]
[null,null,"cookbio Biogas for cooking",null,-3.0717647560773557E-2,null,null,null,null,null,null,null,"cooknone Does not cook",null,-0.13334813885206104]
[null,null,"cookkero Kerosene for cooking",null,-1.7567061205958287E-2,null,null,"Matrice de covariance des coefficients des composantes",null,null,null,null,"cookoth Other fuel for cooking",null,-6.5486590111889426E-2]
[null,null,"cookwood Wood for cooking",null,-4.3090850586510313E-2,null,null,"Composante",null,"1",null,null,"cookothe Household cooks in other house",null,1.260162137144419E-2]
[null,null,"cooknone Does not cook",null,-0.13198507462419093,null,null,"1",null,0.99999999999999956,null,null,"cookout Household cooks outside house",null,-1.072302795438234E-2]
[null,null,"cookoth Other fuel for cooking",null,-6.2303681889223625E-2,null,null,null,null,null,null,null,"cookelse Household cooks in other place",null,-6.2949835631514142E-2]
[null,null,"cookothe Household cooks in other house",null,-9.0232281149336124E-3,null,null,null,null,null,null,null,"HV206 Has electricity",null,4.1270123612938185E-2]
[null,null,"cookout Household cooks outside house",null,-8.9938832624888356E-3,null,null,null,null,null,null,null,"HV207 Has radio",null,8.1555794675228898E-3]
[null,null,"cookelse Household cooks in other place",null,-6.0185846255465705E-2,null,null,null,null,null,null,null,"HV208 Has television",null,0.15587091922313256]
[null,null,"HV206 Has electricity",null,3.6850448758763046E-2,null,null,null,null,null,null,null,"HV209 Has refrigerator",null,0.14958370437365062]
[null,null,"HV207 Has radio",null,-8.6413225071520182E-3,null,null,null,null,null,null,null,"HV210 Has bicycle",null,7.3454120259116726E-2]
[null,null,"HV208 Has television",null,0.15161339306095264,null,null,null,null,null,null,null,"HV211 Has motorcycle/scooter",null,0.10950543002395478]
[null,null,"HV209 Has refrigerator",null,0.14784630926145756,null,null,null,null,null,null,null,"HV212 Has car/truck",null,4.1442587846046298E-2]
[null,null,"HV210 Has bicycle",null,4.442666857977691E-2,null,null,null,null,null,null,null,"HV243A Has mobile telephone",null,0.10363054763588608]
[null,null,"HV211 Has motorcycle/scooter",null,0.12020038410536729,null,null,null,null,null,null,null,"HV243B Has watch",null,8.3875535601215384E-2]
[null,null,"HV212 Has car/truck",null,4.5319447652019597E-2,null,null,null,null,null,null,null,"HV243D Has boat with a motor",null,2.1977551169032862E-2]
[null,null,"HV243A Has mobile telephone",null,9.8639688477281107E-2,null,null,null,null,null,null,null,"HV243E Has a computer",null,0.13534819013767094]
[null,null,"HV243B Has watch",null,9.0458631984522003E-2,null,null,null,null,null,null,null,"HV247 Has bank account",null,6.4027018876842021E-2]
[null,null,"HV243D Has boat with a motor",null,1.8066462316222456E-2,null,null,null,null,null,null,null,"SH121D Household has satelite/cable TV",null,0.14356523693649778]
[null,null,"HV243E Has a computer",null,0.14400638779518329,null,null,null,null,null,null,null,"SH121F Household has internet connection",null,0.12041997511879321]
[null,null,"HV247 Has bank account",null,7.0384035245637314E-2,null,null,null,null,null,null,null,"SH121J Household has air conditioner",null,0.13180551337817062]
[null,null,"SH121D Household has satelite/cable TV",null,0.13675119644586445,null,null,null,null,null,null,null,"SH121K Household has washing machine",null,0.14167933718295414]
[null,null,"SH121F Household has internet connection",null,0.12503624614808254,null,null,null,null,null,null,null,"SH122E Household has pickup/lorry",null,3.2700350600032561E-2]
[null,null,"SH121J Household has air conditioner",null,0.14062138048985909,null,null,null,null,null,null,null,"SH122G Household has any other boat",null,3.7846372463329836E-2]
[null,null,"SH121K Household has washing machine",null,0.13900716453647982]
[null,null,"SH122E Household has pickup/lorry",null,3.0526546456594798E-2]
[null,null,"SH122G Household has any other boat",null,2.8644723618017127E-2,null,null,null,null,null,null,null,"Matrice de covariance des coefficients des composantes"]
[null,null,null,null,null,null,null,null,null,null,null,null,"Composante",null,"1"]
[null,null,null,null,null,null,null,null,null,null,null,null,"1",null,1]
[null,null,"Matrice de covariance des coefficients des composantes"]
[null,null,"Composante",null,"1"]
[null,null,"1",null,0.99999999999999978]
[]
[]
[]
[]
[]
[]
[]
[]
[]
[]
[]
[]
[]
[]
[]
[]
[]
[]
[]
[]
[]
[]
[]
[]
[]
[]
[]
[]
[]
[]
[]
[]
[]
[]
[]
[]
[]
[]
[]
[]
[]
[]
[]
[]
[]
[]
[]
[]
[]
[]
[]
[]
[]
[]
[]
[]
[]
[]
[]
[]
[]
[]
[]
[]
[]
[]
[]
[]
[]
[]
[]
[]
[]
[]
[]
[]
[]
[]
[]
[]
[]
[]
[]
[]
[]
[]
[]
[]
[]
[]
[]
[]
[]
[]
[]
[]
[]
[]
[]
[]
[]
[]
[]
[]
[]
[]
[]
[]
[]
[]
[]
[]
[]
[]
[]
[]
[]
[]
[]
[]
[]
[]
[]
[]
[]
[]
[]
[]
[]
[]
[]
[]
[]
[]
[]
[]
[]
[]
[]
[]
[]
[]
[]
[]
[]
[]
[]
[]
[]
[]
[]
[]
[]
[]
[]
[]
[]
[]
[]
[]
[]
[]
[]
[]
[]
[]
[]
[]
[]
[]
[]
[]
[]
[]
[]
[]
[]
[]
[]
[]
[]
[]
[]
[]
[]
[]
[]
[]
[]
[]
[]
[]
[]
[]
[]
[]
[]
[]
[]
[]
[]
[]
[]
[]
[]
[]
[]
[]
[]
[]
[]
[]
[]
[]
[]
[]
[]
[]
[]
[]
[]
[]
[]
[]
[]
[]
[]
[]
[]
[]
[]
[]
[]
[]
[]
[]
[]
[]
[]
[]
[]
[]
[]
[]
[]
[]
[]
[]
[]
[]
[]
[]
[]
[]
[]
[]
[]
[]
[]
[]
[]
[]
[]
[]
[]
[]
[]
[]
[]
[]
[]
[]
[]
[]
[]
[]
[]
[]
[]
[]
[]
[]
[]
[]
[]
[]
[]
[]
[]
[]
[]
[]
[]
[]
[]
[]
[]
[]
[]
[]
[]
[]
[]
[]
[]
[]
[]
[]
[]
[]
[]
[]
[]
[]
[]
[]
[]
[]
[]
[]
[]
[]
[]
[]
[]
[]
[]
[]
[]
[]
[]
[]
[]
[]
[]
[]
[]
[]
[]
[]
[]
[]
[]
[]
[]
[]
[]
[]
[]
[]
[]
[]
[]
[]
[]
[]
[]
[]
[]
[]
[]
[]
[]
[]
[]
[]
[]
[]
[]
[]
[]
[]
[]
[]
[]
[]
[]
[]
[]
[]
[]
[]
[]
[]
[]
[]
[]
[]
[]
[]
[]
[]
[]
[]
[]
[]
[]
[]
[]
[]
[]
[]
[]
[]
[]
[]
[]
[]
[]
[]
[]
[]
[]
[]
[]
[]
[]
[]
[]
[]
[]
[]
[]
[]
[]
[]
[]
[]
[]
[]
[]
[]
[]
[]
[]
[]
["DHS17"]
["Maldives",null,"Nombre"]
["W_text_t","",6050]
["W_text_i","",6050]
["S_text_s","",6050]
["S_text_i","",6050]
["Urban/Rural","1 Urban",776]
[null,"2 Rural",5274]
[null,"9 Missing",0]
["2017"]
[]
["Sub-national region names","Weighted population"]
[{"$f":"R15","v":"4 Central Region"},{"$f":"BR122+BR123","v":2377.5587199999986}]
[{"$f":"S15","v":"1 Malé"},{"$f":"BS122+BS123","v":13744.500676000009}]
[{"$f":"T15","v":"3 North Central"},{"$f":"BT122+BT123","v":4048.8677109999876}]
[{"$f":"U15","v":"2 North Region"},{"$f":"BU122+BU123","v":4271.8117110000003}]
[{"$f":"V15","v":"5 South Central"},{"$f":"BV122+BV123","v":4015.6427459999977}]
[{"$f":"W15","v":"6 South Region"},{"$f":"BW122+BW123","v":4802.3411109999915}]
[{"$f":"X15","v":0},{"$f":"BX122+XR123","v":0}]
[{"$f":"Y15","v":0},{"$f":"BY122+BY123","v":0}]
[{"$f":"Z15","v":0},{"$f":"BZ122+BZ123","v":0}]
[{"$f":"AA15","v":0},{"$f":"CA122+CA123","v":0}]
[{"$f":"AB15","v":0},{"$f":"CB122+CB123","v":0}]
[{"$f":"AC15","v":0},{"$f":"CC122+CC123","v":0}]
[{"$f":"AD15","v":0},{"$f":"CD122+CD123","v":0}]
[{"$f":"AE15","v":0},{"$f":"CE122+CE123","v":0}]
[{"$f":"AF15","v":0},{"$f":"CF122+CF123","v":0}]
[{"$f":"AG15","v":0},{"$f":"CG122+CG123","v":0}]
[{"$f":"AH15","v":0},{"$f":"CH122+CH123","v":0}]
[{"$f":"AI15","v":0},{"$f":"CI122+CI123","v":0}]
[{"$f":"AJ15","v":0},{"$f":"CJ122+CJ123","v":0}]
[{"$f":"AK15","v":0},{"$f":"CK122+CK123","v":0}]
[{"$f":"AL15","v":0},{"$f":"CL122+CL123","v":0}]
[{"$f":"AM15","v":0},{"$f":"CM122+CM123","v":0}]
[{"$f":"AN15","v":0},{"$f":"CN122+CN123","v":0}]
[{"$f":"AO15","v":0},{"$f":"CO122+CO123","v":0}]
[{"$f":"AP15","v":0},{"$f":"CP122+CP123","v":0}]
[{"$f":"AQ15","v":0},{"$f":"CQ122+CQ123","v":0}]
[{"$f":"AR15","v":0},{"$f":"CR122+CR123","v":0}]
[{"$f":"AS15","v":0},{"$f":"CS122+CS123","v":0}]
[{"$f":"AT15","v":0},{"$f":"CT122+CT123","v":0}]
[{"$f":"AU15","v":0},{"$f":"CU122+CU123","v":0}]
[{"$f":"AV15","v":0},{"$f":"CV122+CV123","v":0}]
[{"$f":"AW15","v":0},{"$f":"CW122+CW123","v":0}]
[{"$f":"AX15","v":0},{"$f":"CX122+CX123","v":0}]
[{"$f":"AY15","v":0},{"$f":"CY122+CY123","v":0}]
[]
[{"$f":"34-COUNTIF(A1037:A1071,\"0\")","v":6},"Sub-regions"]

{"sheet":"data_summary","index":5,"n_rows":68,"n_cols":55,"rows_kept":68,"cut":false,"hidden":false,"merged":[]}
["iso3","year","data_source","row","var1","var2","varname","total_q1","total_q2","total_q3","total_q4","total_q5","urban_q1","urban_q2","urban_q3","urban_q4","urban_q5","rural_q1","rural_q2","rural_q3","rural_q4","rural_q5","region_1_name","region_2_name","region_3_name","region_4_name","region_5_name","region_6_name","region_1","region_2","region_3","region_4","region_5","region_6","n_total_q1","n_total_q2","n_total_q3","n_total_q4","n_total_q5","n_urban_q1","n_urban_q2","n_urban_q3","n_urban_q4","n_urban_q5","n_rural_q1","n_rural_q2","n_rural_q3","n_rural_q4","n_rural_q5","n_region_1","n_region_2","n_region_3","n_region_4","n_region_5","n_region_6"]
["MDV",2017,"MDV_2017_DHS",16,"Water","1 Improved","w_imp",98.908884953189869,99.771513036553699,100,99.960745309792756,99.683410967757936,98.732733107546508,100,100,100,99.231692998078984,99.326521111582451,99.706985546339624,99.610401103095455,100,99.933256490527938,"4 Central Region","1 Malé","3 North Central","2 North Region","5 South Central","6 South Region",100,99.593273402084264,99.873071279013686,100,99.36671293716725,99.480160833581394]
["MDV",2017,"MDV_2017_DHS",17,"Water","2 Not Improved","",1.0911150468101269,0.22848696344630851,0,0.039254690207243703,0.31658903224207779,1.267266892453482,0,0,0,0.76830700192101731,0.67347888841754155,0.29301445366037793,0.38959889690453781,0,0.066743509472068099,"4 Central Region","1 Malé","3 North Central","2 North Region","5 South Central","6 South Region",0,0.40672659791573479,0.12692872098631069,0,0.63328706283275571,0.51983916641859795]
["MDV",2017,"MDV_2017_DHS",18,"Water ladder","1 Basic","w_bas",98.721921330931679,99.656136449812848,100,99.90143463148577,99.683410967757936,98.732733107546508,100,100,100,99.231692998078984,99.008028562295465,99.555314660106717,99.565352930443069,99.898771197486752,99.933256490527938,"4 Central Region","1 Malé","3 North Central","2 North Region","5 South Central","6 South Region",98.988311253990844,99.593273402084264,99.873071279013686,100,99.36671293716725,99.480160833581394]
["MDV",2017,"MDV_2017_DHS",19,"Water ladder","2 Limited","w_lim",0.1869636222581936,0.1153765867408523,0,0.0593106783069932,0,0,0,0,0,0,0.31849254928697529,0.1516708862329014,0.045048172652390903,0.1012288025132541,0,"4 Central Region","1 Malé","3 North Central","2 North Region","5 South Central","6 South Region",1.0116887460091839,0,0,0,0,0]
["MDV",2017,"MDV_2017_DHS",20,"Water ladder","3 Other unimproved","w_unimp",1.0911150468101269,0.22848696344630851,0,0.039254690207243703,0.31658903224207779,1.267266892453482,0,0,0,0.76830700192101731,0.67347888841754155,0.29301445366037793,0.38959889690453781,0,0.066743509472068099,"4 Central Region","1 Malé","3 North Central","2 North Region","5 South Central","6 South Region",0,0.40672659791573479,0.12692872098631069,0,0.63328706283275571,0.51983916641859795]
["MDV",2017,"MDV_2017_DHS",21,"Water ladder","4 Surface water","w_sur",0,0,0,0,0,0,0,0,0,0,0,0,0,0,0,"4 Central Region","1 Malé","3 North Central","2 North Region","5 South Central","6 South Region",0,0,0,0,0,0]
["MDV",2017,"MDV_2017_DHS",22,"Improved water point at more than 30 minutes","1 Yes","",0.1890261146374029,0.11564081091822399,0,0.059333969672976002,0,0,0,0,0,0,0.32065207330596412,0.15211660988628639,0.045224366284567601,0.1012288025132541,0,"4 Central Region","1 Malé","3 North Central","2 North Region","5 South Central","6 South Region",1.0116887460091839,0,0,0,0,0]
["MDV",2017,"MDV_2017_DHS",23,"Improved water point at more than 30 minutes","2 No","",99.8109738853626,99.884359189081778,100,99.940666030327023,100,100,100,100,100,100,99.679347926694021,99.847883390113708,99.954775633715428,99.898771197486752,100,"4 Central Region","1 Malé","3 North Central","2 North Region","5 South Central","6 South Region",98.988311253990844,100,100,100,100,100]
["MDV",2017,"MDV_2017_DHS",29,"Piped water","1 Yes","w_pip",29.694612546811641,38.826741025333753,49.239453049701012,57.315240314471247,68.221310429728192,97.193168700823406,98.193043772254924,99.755629427729403,97.69413327698679,99.231692998078984,10.8924186776333,10.90178603456506,13.256945470356589,17.514514775795039,15.57278874679902,"4 Central Region","1 Malé","3 North Central","2 North Region","5 South Central","6 South Region",9.5470122815725951,98.407861208213191,19.372496781483569,10.51105232105115,11.843023273764111,15.06866233101284]
["MDV",2017,"MDV_2017_DHS",30,"Piped water","2 No","",70.305387453188288,61.17325897466619,50.760546950298803,42.684759685528697,31.778689570271698,2.8068312991765789,1.8069562277450899,0.2443705722705978,2.3058667230131809,0.76830700192101731,89.10758132236657,89.098213965434937,86.743054529643445,82.485485224204993,84.427211253201051,"4 Central Region","1 Malé","3 North Central","2 North Region","5 South Central","6 South Region",90.452987718427465,1.5921387917868359,80.627503218516495,89.488947678948975,88.156976726235825,84.931337668987268]
["MDV",2017,"MDV_2017_DHS",31,"Piped water on premises","Yes","w_pop",29.509636036037652,38.802521999180577,49.239453049701012,57.117333128059322,68.221310429728192,97.193168700823406,98.193043772254924,99.755629427729403,97.69413327698679,99.231692998078984,10.728255835937301,10.75076284036035,13.21564899667136,17.176735676632639,15.57278874679902,"4 Central Region","1 Malé","3 North Central","2 North Region","5 South Central","6 South Region",9.5470122815725951,98.407861208213191,19.323647050122219,10.41082927074733,11.652446634255449,14.79454246539466]
["MDV",2017,"MDV_2017_DHS",32,"Piped water on premises","No","",70.490363963962295,61.197478000819359,50.760546950298803,42.882666871940607,31.778689570271698,2.8068312991765789,1.8069562277450899,0.2443705722705978,2.3058667230131809,0.76830700192101731,89.271744164062568,89.249237159639648,86.78435100332868,82.823264323367383,84.427211253201051,"4 Central Region","1 Malé","3 North Central","2 North Region","5 South Central","6 South Region",90.452987718427465,1.5921387917868359,80.676352949877838,89.589170729252785,88.347553365744474,85.205457534605458]
["MDV",2017,"MDV_2017_DHS",35,"Water source on premises","1 Yes","",93.573337174585987,97.235071239059351,98.422890954532832,99.002288791234577,99.491776017207371,100,100,100,99.502522481557918,100,90.91627526644838,95.995729780375115,96.290899328226146,97.829247760930272,98.403318956088,"4 Central Region","1 Malé","3 North Central","2 North Region","5 South Central","6 South Region",92.378938594626987,99.899627637807981,96.650736658261778,97.564161647573158,96.068997667752214,95.337744428708902]
["MDV",2017,"MDV_2017_DHS",36,"Water source on premises","2 No","",6.4266628254140334,2.7649287609405802,1.5771090454671599,0.9977112087654495,0.50822398279261927,0,0,0,0.49747751844207377,0,9.0837247335515396,4.0042702196248596,3.7091006717738342,2.1707522390697291,1.5966810439120049,"4 Central Region","1 Malé","3 North Central","2 North Region","5 South Central","6 South Region",7.6210614053729886,0.1003723621920246,3.3492633417382698,2.4358383524268579,3.9310023322478118,4.662255571291098]
["MDV",2017,"MDV_2017_DHS",37,"Improved Water source on premises","1 Yes","w_premises",94.07596709041043,97.398128363267915,98.422890954532832,99.041167094555178,99.490161925782189,100,100,100,99.502522481557918,100,91.532728871389651,96.277837760685628,96.565688977693497,97.829247760930272,98.469040649560995,"4 Central Region","1 Malé","3 North Central","2 North Region","5 South Central","6 South Region",92.378938594626987,99.89921772950791,96.773570113059066,97.564161647573158,96.582096511057742,95.835937165600015]
["MDV",2017,"MDV_2017_DHS",38,"Improved Water source on premises","2 No","",5.9240329095895419,2.601871636732012,1.5771090454671599,0.95883290544484345,0.50983807421778693,0,0,0,0.49747751844207377,0,8.467271128610264,3.7221622393143621,3.4343110223064741,2.1707522390697291,1.53095935043901,"4 Central Region","1 Malé","3 North Central","2 North Region","5 South Central","6 South Region",7.6210614053729886,0.1007822704920994,3.2264298869409731,2.4358383524268579,3.4179034889422688,4.1640628343999921]
["MDV",2017,"MDV_2017_DHS",41,"Water point at more than 30 minutes","1 Yes","",0.1869636222581936,0.1153765867408523,0,0.0593106783069932,0,0,0,0,0,0,0.31849254928697529,0.1516708862329014,0.045048172652390903,0.1012288025132541,0,"4 Central Region","1 Malé","3 North Central","2 North Region","5 South Central","6 South Region",1.0116887460091839,0,0,0,0,0]
["MDV",2017,"MDV_2017_DHS",42,"Water point at more than 30 minutes","2 No","w_30min",99.81303637774181,99.884623413259149,100,99.940689321693014,100,100,100,100,100,100,99.681507450712999,99.848329113767093,99.9549518273476,99.898771197486752,100,"4 Central Region","1 Malé","3 North Central","2 North Region","5 South Central","6 South Region",98.988311253990844,100,100,100,100,100]
["MDV",2017,"MDV_2017_DHS",43,"Water source available when needed","1 Yes","w_available",81.584451542799002,85.851913388536843,85.697821713695987,83.852275274869399,76.676197171403871,80.186602157266677,87.276287396633549,84.96094868586745,73.924828482242049,78.077922363620289,90.0166376140441,94.32297923352435,86.545523218238671,87.571723008052217,89.235766651034282,"4 Central Region","1 Malé","3 North Central","2 North Region","5 South Central","6 South Region",93.355611905330306,80.882166472438882,96.535345562390489,92.506018163900691,73.076293222012026,88.578798206310537]
["MDV",2017,"MDV_2017_DHS",44,"Water source available when needed","2 No","",18.41554845720102,14.148086611463199,14.302178286304001,16.14772472513063,23.32380282859609,19.81339784273332,12.72371260336644,15.039051314132539,26.075171517757958,21.9220776363798,9.9833623859559104,5.677020766475648,13.45447678176132,12.42827699194776,10.76423334896571,"4 Central Region","1 Malé","3 North Central","2 North Region","5 South Central","6 South Region",6.6443880946696812,19.117833527561089,3.4646544376095418,7.4939818360992794,26.923706777987992,11.421201793689461]
["MDV",2017,"MDV_2017_DHS",45,"Improved water source available when needed","1 Yes","",81.584451542799002,85.851913388536843,85.697821713695987,83.852275274869399,76.676197171403871,80.186602157266677,87.276287396633549,84.96094868586745,73.924828482242049,78.077922363620289,90.0166376140441,94.32297923352435,86.545523218238671,87.571723008052217,89.235766651034282,"4 Central Region","1 Malé","3 North Central","2 North Region","5 South Central","6 South Region",93.355611905330306,80.882166472438882,96.535345562390489,92.506018163900691,73.076293222012026,88.578798206310537]
["MDV",2017,"MDV_2017_DHS",46,"Improved water source available when needed","2 No","",18.41554845720102,14.148086611463199,14.302178286304001,16.14772472513063,23.32380282859609,19.81339784273332,12.72371260336644,15.039051314132539,26.075171517757958,21.9220776363798,9.9833623859559104,5.677020766475648,13.45447678176132,12.42827699194776,10.76423334896571,"4 Central Region","1 Malé","3 North Central","2 North Region","5 South Central","6 South Region",6.6443880946696812,19.117833527561089,3.4646544376095418,7.4939818360992794,26.923706777987992,11.421201793689461]
["MDV",2017,"MDV_2017_DHS",58,"Source of drinking water","11 Piped into dwelling","",13.369531629492339,14.56975713181312,13.76378073488703,17.878550894921631,19.243663627490481,35.175620771694518,20.891628014732479,30.514779868716332,26.66413255924094,22.14028307729102,6.9088876590958126,7.2725480296477132,7.8336522781550677,9.0489777465303742,7.9905720630188126,"4 Central Region","1 Malé","3 North Central","2 North Region","5 South Central","6 South Region",7.2006401591629299,27.060539052499191,16.65110359541708,3.1902920404723809,5.3181724946206224,6.853341451446104]
["MDV",2017,"MDV_2017_DHS",59,"Source of drinking water","12 Piped to yard/plot","",2.3848219763485941,1.8035817373846621,2.9316627530372998,2.224725388207808,1.976603777586535,0,0,0,0,0,2.8476184248666558,2.5070062401909099,3.9361310560724299,5.7261498901079761,4.279033009074019,"4 Central Region","1 Malé","3 North Central","2 North Region","5 South Central","6 South Region",0,0,0.53953464423278774,6.0057915553572494,4.8920017647406588,5.7942899216931636]
["MDV",2017,"MDV_2017_DHS",60,"Source of drinking water","14 Public tap/standpipe","",0.18497651077398691,0.0242190261531736,0,0.19790718641192659,0,0,0,0,0,0,0.1641628416960017,0.15102319420470889,0.041296473685230102,0.33777909916239351,0,"4 Central Region","1 Malé","3 North Central","2 North Region","5 South Central","6 South Region",0,0,0.048849731361351602,0.10022305030381989,0.1905766395086583,0.27411986561818441]
["MDV",2017,"MDV_2017_DHS",61,"Source of drinking water","31 Protected well","",0.40467802142606779,0.72204340034628689,0.1487811533850962,0.29924585045571828,0.80574092597071933,0,0,0,0,0,0.68936905012680405,0.2698618536363383,1.0000179382720631,0.36401403842300423,1.731049447311009,"4 Central Region","1 Malé","3 North Central","2 North Region","5 South Central","6 South Region",0.1270974287440523,0,0,1.2964245558247181,0.40853716422710912,1.739869744125724]
["MDV",2017,"MDV_2017_DHS",62,"Source of drinking water","32 Unprotected well","",0,0.059484901742201897,0,0,0,0,0,0,0,0,0,0,0.101429209578001,0,0,"4 Central Region","1 Malé","3 North Central","2 North Region","5 South Central","6 South Region",0,0,0,0,0.098543078911631901,0]
["MDV",2017,"MDV_2017_DHS",63,"Source of drinking water","51 Rainwater (tank in compoud)","",62.737267117601327,54.02449492335014,45.219351304885507,36.724131814776342,25.84160684463593,0,0,0,1.808389204571107,0,81.418659120005174,80.043758879227354,77.775020262860323,72.375637087938529,69.780100818061015,"4 Central Region","1 Malé","3 North Central","2 North Region","5 South Central","6 South Region",81.895284378086814,0.36486532455535209,72.69868990787586,83.56732912191795,80.200417186215404,66.744909074827348]
["MDV",2017,"MDV_2017_DHS",64,"Source of drinking water","52 Rainwater (public or community tank)","",1.1588670326376651,0.60689533469221124,0.28600688876924668,0.2287572145726228,0.2760181260388595,0,0,0,0,0,1.2856308142272841,1.3884081992063531,0.40940097142817661,0.70102513888521145,0.57244405827610267,"4 Central Region","1 Malé","3 North Central","2 North Region","5 South Central","6 South Region",2.1885065366545411,0,0.65647205335427872,0.25227338490247431,0.96632846730833233,0.87152036959916956]
["MDV",2017,"MDV_2017_DHS",65,"Source of drinking water","71 Bottled water","",18.66874266490986,28.020521482814061,37.65041716503562,42.407426960446699,51.539777666035313,63.557112335851997,79.108371985267539,69.485220131283668,71.527478236187946,77.091409920788038,6.0121932015645898,8.0743791502263225,8.6148821226222001,11.44641699895257,15.58005709478698,"4 Central Region","1 Malé","3 North Central","2 North Region","5 South Central","6 South Region",8.588471497351712,72.167869025029674,9.2784213467724523,5.587666291221514,7.3906792205463798,17.20211040627181]
["MDV",2017,"MDV_2017_DHS",66,"Source of drinking water","96 Other","",1.0911150468101269,0.16900206170410659,0,0.039254690207243703,0.31658903224207779,1.267266892453482,0,0,0,0.76830700192101731,0.67347888841754155,0.29301445366037793,0.28816968732653681,0,0.066743509472068099,"4 Central Region","1 Malé","3 North Central","2 North Region","5 South Central","6 South Region",0,0.40672659791573479,0.12692872098631069,0,0.53474398392112388,0.51983916641859795]
["MDV",2017,"MDV_2017_DHS",122,"Sanitation","1 Improved","s_imp",98.339163656092069,98.85502497892638,99.378665152292555,99.480760814040835,99.239627066549957,100,100,100,99.009122743460154,100,97.554527938875395,98.567592287997684,98.309021450147128,99.095915861095335,99.1553140462687,"4 Central Region","1 Malé","3 North Central","2 North Region","5 South Central","6 South Region",92.676547395641194,99.800078019218404,98.68973372837371,99.606588020798668,99.25806694259154,99.753562903457791,6539.5586540000049,6576.1725140000017,6611.0867280000066,6617.1510509999998,6603.6711660000037,2748.8965589999998,2769.1658619999989,2711.3501999999999,2745.6480419999989,2741.961734999998,3808.2653140000029,3845.8117689999999,3835.407631999999,3862.0376009999991,3879.0953989999989,2203.4393339999988,13717.02239800001,3995.816762999988,4255.0058920000001,3985.8493649999982,4790.5063609999916]
["MDV",2017,"MDV_2017_DHS",123,"Sanitation","2 Not Improved","",1.6608363439079319,1.144975021073587,0.62133484770742853,0.51923918595915497,0.7603729334500231,0,0,0,0.99087725653983216,0,2.4454720611245611,1.432407712002316,1.6909785498528831,0.90408413890470229,0.84468595373132416,"4 Central Region","1 Malé","3 North Central","2 North Region","5 South Central","6 South Region",7.3234526043588142,0.19992198078160281,1.3102662716262841,0.39341197920134641,0.74193305740848947,0.2464370965421831,110.445689,76.167632999999995,41.333807,34.538176999999997,50.597256000000002,0,0,0,27.478278,0,95.464624999999984,55.888251999999987,65.97148399999999,35.23462,33.045302999999997,174.11938599999999,27.478278,53.050947999999998,16.805819,29.793381,11.83475]
["MDV",2017,"MDV_2017_DHS",124,"Sanitation ladder","1 Basic","s_bas",97.356520688816659,98.191888488230035,98.651965844188751,99.041429269852216,98.928749105396392,98.306214184467606,98.997810771076161,100,99.009122743460154,99.421704365980162,96.987688317647198,97.777984992865214,97.978402491658812,98.064892039267207,98.860673186493216,"4 Central Region","1 Malé","3 North Central","2 North Region","5 South Central","6 South Region",92.137646762305849,99.144038566599718,98.071366007146878,99.09920348546936,98.72684787383227,98.989616275094278,6474.2128540000067,6532.0584190000018,6562.7436340000068,6587.9280819999994,6582.9845120000036,2702.336139,2741.413579999999,2711.3501999999999,2745.6480419999989,2726.1050899999991,3786.137426000003,3815.0036609999988,3822.5089329999992,3821.8557959999989,3867.5686340000002,2190.6266549999991,13626.853051000009,3970.7798719999878,4233.3313799999996,3964.517504999998,4753.8190379999924]
["MDV",2017,"MDV_2017_DHS",125,"Sanitation ladder","2 Limited","s_lim",0.98264296727542666,0.66313649069634639,0.72669930810379757,0.43933154418861248,0.31087796115357819,1.693785815532391,1.0021892289238401,0,0,0.57829563401985284,0.56683962122821352,0.78960729513244143,0.33061895848831951,1.031023821828124,0.29464085977549798,"4 Central Region","1 Malé","3 North Central","2 North Region","5 South Central","6 South Region",0.53890063333535698,0.65603945261867092,0.61836772122684136,0.50738453532930083,0.53121906875926106,0.76394662836352745,65.345799999999997,44.114094999999999,48.343094000000008,29.222968999999999,20.686654000000001,46.560420000000001,27.752282000000001,0,0,15.856645,22.127887999999999,30.808108000000001,12.898699000000001,40.181804999999997,11.526764999999999,12.812678999999999,90.169346999999988,25.036891000000001,21.674512,21.331859999999999,36.687323000000013]
["MDV",2017,"MDV_2017_DHS",126,"Sanitation ladder","3 Other unimproved","s_unimp",1.2268628528924239,1.144975021073587,0.62133484770742853,0.51923918595915497,0.7603729334500231,0,0,0,0.99087725653983216,0,1.706198175611038,1.432407712002316,1.6909785498528831,0.90408413890470229,0.84468595373132416,"4 Central Region","1 Malé","3 North Central","2 North Region","5 South Central","6 South Region",7.3234526043588142,0.19992198078160281,1.1297221165248419,0.15858831002675719,0.6189817065962675,0.1094049730862612,81.586432999999957,76.167632999999995,41.333807,34.538176999999997,50.597256000000002,0,0,0,27.478278,0,66.605368999999982,55.888251999999987,65.97148399999999,35.23462,33.045302999999997,174.11938599999999,27.478278,45.740954000000002,6.7745939999999996,24.856093999999999,5.2539999999999996]
["MDV",2017,"MDV_2017_DHS",127,"Sanitation ladder","4 Open defecation","s_od",0.4339734910155077,0,0,0,0,0,0,0,0,0,0.73927388551352247,0,0,0,0,"4 Central Region","1 Malé","3 North Central","2 North Region","5 South Central","6 South Region",0,0,0.18054415510144151,0.23482366917458919,0.122951350812222,0.13703212345592189,28.859255999999991,0,0,0,0,0,0,0,0,0,28.859255999999991,0,0,0,0,0,0,7.3099940000000014,10.031224999999999,4.9372870000000004,6.5807500000000001]
["MDV",2017,"MDV_2017_DHS",128,"Shared among Improved Sanitation","1 Yes","s_shared",0.99923868654393666,0.67081717984261491,0.73124277428175277,0.44162463233454152,0.31325990468011722,1.693785815532391,1.0021892289238401,0,0,0.57829563401985284,0.58104901249009933,0.80108205628615092,0.33630581772800738,1.0404301861171861,0.29715085127763319,"4 Central Region","1 Malé","3 North Central","2 North Region","5 South Central","6 South Region",0.58148544424595472,0.65735364705059462,0.62657755560349437,0.5093885308302647,0.53518981894590512,0.76583392725819766]
["MDV",2017,"MDV_2017_DHS",129,"Shared among Improved Sanitation","2 No","",99.000761313456081,99.329182820157385,99.268757225718247,99.558375367665448,99.686740095319877,98.306214184467606,98.997810771076161,100,100,99.421704365980162,99.418950987509902,99.198917943713809,99.663694182271996,98.959569813882808,99.702849148722379,"4 Central Region","1 Malé","3 North Central","2 North Region","5 South Central","6 South Region",99.418514555754058,99.342646352949416,99.373422444396525,99.490611469169721,99.464810181054091,99.234166072741814]
["MDV",2017,"MDV_2017_DHS",135,"Sanitation type","1 Sewer connection","s_sew",46.796534114684484,57.18148728031359,63.880651540920638,69.984665600495802,77.719265680683407,99.409811113230745,99.662681454795433,95.337669659935472,97.242648362300329,99.421704365980162,30.856241461942979,36.736412263509592,36.604261378837052,43.140465860724383,44.600526486892228,"4 Central Region","1 Malé","3 North Central","2 North Region","5 South Central","6 South Region",59.657466377949241,98.222575051950884,32.547632006344962,44.441704186338818,51.624312099600317,16.333303879712691]
["MDV",2017,"MDV_2017_DHS",136,"Sanitation type","2 Septic tank connection","s_sep",50.612463998506549,40.718588438709872,34.971558529109117,27.274914533935579,20.6092929534666,0,0,0,0,0,65.359316163494412,61.161976578311659,61.073106359448779,54.770725085564941,54.484229258684749,"4 Central Region","1 Malé","3 North Central","2 North Region","5 South Central","6 South Region",29.533565505376931,0,65.858504829771661,54.761933958282597,47.349008496683624,82.817317680539176]
["MDV",2017,"MDV_2017_DHS",137,"Sanitation type","3 Improved latrines","s_lat",0.93016554290090858,0.95494925990289958,0.52645508226277449,2.2211806796094651,0.91106843239994495,0.59018888676923831,0.33731854520457039,4.6623303400645177,1.7664743811598169,0.57829563401985284,1.338970313437964,0.66920344617646854,0.63165371186141372,1.1847249148059971,0.070558300691711706,"4 Central Region","1 Malé","3 North Central","2 North Region","5 South Central","6 South Region",3.4855155123150858,1.577502967267487,0.28359689225717039,0.40294987617725547,0.28474634630757079,0.60294134320605619]
["MDV",2017,"MDV_2017_DHS",138,"Sanitation type","4 Unimproved facilities","",1.2268628528924239,1.144975021073587,0.62133484770742853,0.51923918595915497,0.7603729334500231,0,0,0,0.99087725653983216,0,1.706198175611038,1.432407712002316,1.6909785498528831,0.90408413890470229,0.84468595373132416,"4 Central Region","1 Malé","3 North Central","2 North Region","5 South Central","6 South Region",7.3234526043588142,0.19992198078160281,1.1297221165248419,0.15858831002675719,0.6189817065962675,0.1094049730862612]
["MDV",2017,"MDV_2017_DHS",139,"Sanitation type","5 Open defecation","",0.4339734910155077,0,0,0,0,0,0,0,0,0,0.73927388551352247,0,0,0,0,"4 Central Region","1 Malé","3 North Central","2 North Region","5 South Central","6 South Region",0,0,0.18054415510144151,0.23482366917458919,0.122951350812222,0.13703212345592189]
["MDV",2017,"MDV_2017_DHS",148,"Shared among improved sanitation facilities","Yes","",0.98264296727542666,0.66313649069634639,0.72669930810379757,0.43933154418861248,0.31087796115357819,1.693785815532391,1.0021892289238401,0,0,0.57829563401985284,0.56683962122821352,0.78960729513244143,0.33061895848831951,1.031023821828124,0.29464085977549798,"4 Central Region","1 Malé","3 North Central","2 North Region","5 South Central","6 South Region",0.53890063333535698,0.65603945261867092,0.61836772122684136,0.50738453532930083,0.53121906875926106,0.76394662836352745]
["MDV",2017,"MDV_2017_DHS",149,"Shared among improved sanitation facilities","No","",97.356520688816659,98.191888488230035,98.651965844188751,99.041429269852216,98.928749105396392,98.306214184467606,98.997810771076161,100,99.009122743460154,99.421704365980162,96.987688317647198,97.777984992865214,97.978402491658812,98.064892039267207,98.860673186493216,"4 Central Region","1 Malé","3 North Central","2 North Region","5 South Central","6 South Region",92.137646762305849,99.144038566599718,98.071366007146878,99.09920348546936,98.72684787383227,98.989616275094278]
["MDV",2017,"MDV_2017_DHS",150,"Shared among improved sanitation facilities","DK/missing","",1.6608363439079319,1.144975021073587,0.62133484770742853,0.51923918595915497,0.7603729334500231,0,0,0,0.99087725653983216,0,2.4454720611245611,1.432407712002316,1.6909785498528831,0.90408413890470229,0.84468595373132416,"4 Central Region","1 Malé","3 North Central","2 North Region","5 South Central","6 South Region",7.3234526043588142,0.19992198078160281,1.3102662716262841,0.39341197920134641,0.74193305740848947,0.2464370965421831]
["MDV",2017,"MDV_2017_DHS",151,"Shared among all sanitation facilities","Yes","",0.98692596433659663,0.66313649069634639,0.72669930810379757,0.43933154418861248,0.31087796115357819,1.693785815532391,1.0021892289238401,0,0,0.57829563401985284,0.5710613285000814,0.78960729513244143,0.33061895848831951,1.031023821828124,0.29464085977549798,"4 Central Region","1 Malé","3 North Central","2 North Region","5 South Central","6 South Region",0.53890063333535698,0.65603945261867092,0.61948616729355177,0.50857879872511114,0.53187301381435137,0.76499491714281831]
["MDV",2017,"MDV_2017_DHS",152,"Shared among all sanitation facilities","No","",99.013074035663379,99.33686350930364,99.27330069189621,99.560668455811381,99.689122038846421,98.306214184467606,98.997810771076161,100,100,99.421704365980162,99.428938671499949,99.210392704867544,99.669381041511684,98.9689761781719,99.70535914022453,"4 Central Region","1 Malé","3 North Central","2 North Region","5 South Central","6 South Region",99.461099366664612,99.343960547381329,99.38051383270647,99.491421201274875,99.468126986185652,99.235005082857199]
["MDV",2017,"MDV_2017_DHS",153,"Type of toilet facility","11 Flush to piped sewer system","",46.796534114684484,57.18148728031359,63.880651540920638,69.984665600495802,77.719265680683407,99.409811113230745,99.662681454795433,95.337669659935472,97.242648362300329,99.421704365980162,30.856241461942979,36.736412263509592,36.604261378837052,43.140465860724383,44.600526486892228,"4 Central Region","1 Malé","3 North Central","2 North Region","5 South Central","6 South Region",59.657466377949241,98.222575051950884,32.547632006344962,44.441704186338818,51.624312099600317,16.333303879712691,3111.9715509999969,3803.907035000002,4249.6095810000043,4655.1624630000006,5171.6485540000031,2732.672877,2759.824951999999,2584.9380970000002,2696.6614759999989,2726.1050899999991,1204.5443360000011,1433.344605,1428.0710090000021,1681.3013919999989,1744.835350000001,1418.391294,13500.202492000009,1317.8105629999991,1898.4659239999989,2073.047943999999,784.3809669999996]
["MDV",2017,"MDV_2017_DHS",154,"Type of toilet facility","12 Flush to septic tank","",50.612463998506549,40.718588438709872,34.971558529109117,27.274914533935579,20.6092929534666,0,0,0,0,0,65.359316163494412,61.161976578311659,61.073106359448779,54.770725085564941,54.484229258684749,"4 Central Region","1 Malé","3 North Central","2 North Region","5 South Central","6 South Region",29.533565505376931,0,65.858504829771661,54.761933958282597,47.349008496683624,82.817317680539176,3365.7310539999989,2708.7390059999989,2326.4551410000022,1814.242551999999,1371.3976729999999,0,0,0,0,0,2551.4511930000008,2386.3568530000011,2382.6934170000018,2134.5642539999999,2131.4997089999979,702.17786200000103,0,2666.5237369999918,2339.3267080000019,1901.367024999998,3977.1700939999992]
["MDV",2017,"MDV_2017_DHS",155,"Type of toilet facility","13 Flush to pit latrine","",0.63277530103110746,0.71106993861899959,0.37990849897465118,1.8769819172315669,0.91106843239994495,0,0.33731854520457039,3.9314741046730148,1.7664743811598169,0.57829563401985284,0.83236600655637616,0.66920344617646854,0.63165371186141372,0.85557533857473933,0.070558300691711706,"4 Central Region","1 Malé","3 North Central","2 North Region","5 South Central","6 South Region",3.1272592922542,1.3152907934710909,0.0428161185728601,0.33123922488352392,0.2006395615751822,0.43850279505895001,42.079585000000002,47.302790999999992,25.273111,124.851004,60.624938999999998,0,9.3409099999999992,106.596031,48.986566000000003,15.856645,32.493320999999987,26.110310999999999,24.643205999999999,33.344099999999997,2.7603399999999998,74.35242599999998,180.78015199999999,1.733568,14.149915999999999,8.0569679999999995,21.058399999999999]
["MDV",2017,"MDV_2017_DHS",156,"Type of toilet facility","14 Flush to somewhere else","",0.95664096921928776,1.0584821498003889,0.519498321222712,0.51923918595915497,0.34743079980911518,0,0,0,0,0,1.2458751696450261,1.432407712002316,1.3698512349344321,0.90408413890470229,0.84468595373132416,"4 Central Region","1 Malé","3 North Central","2 North Region","5 South Central","6 South Region",7.0042156939871516,0,0.94647646540507357,0,0.50030337036361494,0.027185699012708099,63.616665999999981,70.413832999999983,34.559213,34.538176999999997,23.118977999999998,0,0,0,0,0,48.635601999999992,55.888251999999987,53.443089999999991,35.23462,33.045302999999997,166.52934099999999,0,38.321579999999997,0,20.090395999999998,1.30555]
["MDV",2017,"MDV_2017_DHS",157,"Type of toilet facility","15 Flush, don't know where","",0,0.24387932128389991,0,0.34419876237789848,0,0.59018888676923831,0,0.73085623539150324,0,0,0,0,0,0.079002949381092299,0,"4 Central Region","1 Malé","3 North Central","2 North Region","5 South Central","6 South Region",0.12950090250557519,0.26221217379639628,0,0,0,0,0,16.223682,0,22.895032,0,16.223682,0,19.816071999999998,0,0,0,0,0,3.0789599999999999,0,3.0789599999999999,36.039754000000002,0,0,0,0]
["MDV",2017,"MDV_2017_DHS",158,"Type of toilet facility","21 Ventilated Improved Pit latrine (VIP)","",0.12785158567527261,0,0.1465465832881232,0,0,0,0,0,0,0,0.21779518903343861,0,0,0.25014662685016492,0,"4 Central Region","1 Malé","3 North Central","2 North Region","5 South Central","6 South Region",0.2287553175553117,0,0.24078077368431039,0.071710651293731595,0,0,8.5021360000000001,0,9.7488949999999992,0,0,0,0,0,0,0,8.5021360000000001,0,0,9.7488949999999992,0,5.4387920000000003,0,9.7488949999999992,3.0633439999999998,0,0]
["MDV",2017,"MDV_2017_DHS",159,"Type of toilet facility","22 Pit latrine with slab","",0.1695386561945286,0,0,0,0,0,0,0,0,0,0.288809117848149,0,0,0,0,"4 Central Region","1 Malé","3 North Central","2 North Region","5 South Central","6 South Region",0,0,0,0,0.084106784732388695,0.16443854814710621,11.274328000000001,0,0,0,0,0,0,0,0,0,11.274328000000001,0,0,0,0,0,0,0,0,3.3774280000000001,7.8968999999999996]
["MDV",2017,"MDV_2017_DHS",160,"Type of toilet facility","23 Pit latrine without slab/open pit","",0.1037870600380147,0,0,0,0,0,0,0,0,0,0.1768012671944208,0,0,0,0,"4 Central Region","1 Malé","3 North Central","2 North Region","5 South Central","6 South Region",0.17626483689959091,0,0,0,0.067512081414625003,0,6.9018439999999988,0,0,0,0,0,0,0,0,0,6.9018439999999988,0,0,0,0,4.1907999999999994,0,0,0,2.7110439999999998,0]
["MDV",2017,"MDV_2017_DHS",161,"Type of toilet facility","31 No facility/bush/field","",0.4339734910155077,0,0,0,0,0,0,0,0,0,0.73927388551352247,0,0,0,0,"4 Central Region","1 Malé","3 North Central","2 North Region","5 South Central","6 South Region",0,0,0.18054415510144151,0.23482366917458919,0.122951350812222,0.13703212345592189,28.859255999999991,0,0,0,0,0,0,0,0,0,28.859255999999991,0,0,0,0,0,0,7.3099940000000014,10.031224999999999,4.9372870000000004,6.5807500000000001]
["MDV",2017,"MDV_2017_DHS",162,"Type of toilet facility","96 Other","",0.1664348236351218,0.086492871273198199,0.1018365264847165,0,0.41294213364090798,0,0,0,0.99087725653983216,0,0.28352173877159148,0,0.32112731491845109,0,0,"4 Central Region","1 Malé","3 North Central","2 North Region","5 South Central","6 South Region",0.1429720734720698,0.19992198078160281,0.18324565111976859,0.15858831002675719,0.051166254818027598,0.082219274073553103,11.067923,5.7538,6.7745939999999996,0,27.478278,0,0,0,27.478278,0,11.067923,0,12.528394,0,0,3.3992450000000001,27.478278,7.4193740000000004,6.7745939999999996,2.0546540000000002,3.9484499999999998]
["MDV",2017,"MDV_2017_DHS",222,"Hygiene ladder","1,00 Basic","h_bas",86.394351323620242,93.418120084870566,95.97560359283564,96.651494644963009,97.261969049955638,95.616490947343763,95.249404854897776,97.324411394736074,100,97.190135733239927,82.19336379228568,91.560368781043849,94.388767123962779,94.995805015900174,95.533782439817983,"4 Central Region","1 Malé","3 North Central","2 North Region","5 South Central","6 South Region",94.897751077940498,97.078462827987224,84.593376975363526,95.560639718770929,93.028328196716714,91.730500393323737,5723.4604379999992,6208.1012730000066,6384.700762000004,6428.9570580000018,6470.146142000006,2622.5598150000001,2637.6140029999988,2638.8056230000002,2773.1263199999989,2664.9163319999989,3200.489218000002,3560.656318999997,3679.4290589999969,3702.24512,3735.5238639999998,2246.362175999996,13337.02209300001,3425.0739259999918,4081.4949610000021,3729.3463849999989,4396.0661319999972]
["MDV",2017,"MDV_2017_DHS",223,"Hygiene ladder","2,00 Limited","h_lim",7.9714826177337201,4.2465754168800984,2.6526368420573672,2.1397757640399488,1.6119538352351399,3.1698326260107512,4.1993204739283332,2.2251647537083179,0,2.809864266760091,10.63307767361578,4.6713180244040986,3.2214141821898239,2.8330199364844439,1.6377776613210531,"4 Central Region","1 Malé","3 North Central","2 North Region","5 South Central","6 South Region",4.1720996110931869,2.4792229155856642,7.0984449607768578,3.8875602497934181,4.4353338144697103,3.457809114051587,528.09546799999964,282.20617399999998,176.46455800000001,142.33123399999999,107.231809,86.941860999999989,116.28614899999999,60.332008999999999,0,77.045402999999993,414.03647299999972,181.66110800000001,125.57601200000001,110.410499,64.039729000000008,98.759419000000037,340.60542199999998,287.40664600000002,166.04176799999991,177.80493799999999,165.71105000000011]
["MDV",2017,"MDV_2017_DHS",224,"Hygiene ladder","3,00 No facility","h_nfac",5.6341660586459552,2.335304498249418,1.371759565106927,1.208729590997061,1.126077114809247,1.21367642664549,0.55127467117388596,0.45042385155558279,0,0,7.1735585340984853,3.7683131945519812,2.3898186938473729,2.171175047615439,2.828439898861002,"4 Central Region","1 Malé","3 North Central","2 North Region","5 South Central","6 South Region",0.93014931096624021,0.44231425642712008,8.3081780638597174,0.5518000314357081,2.536337988813627,4.8116904926247717,373.25271900000001,155.1926630000001,91.255215000000007,80.400935999999987,74.909890999999988,33.288598999999998,15.26571,12.212567999999999,0,0,279.32786400000009,146.54449700000001,93.159055000000009,84.616602,110.596529,22.017931999999998,60.766877000000001,336.38713899999999,23.567957,101.677447,230.59407200000021]
["MDV",2017,"MDV_2017_DHS",225,"Place where household members wash their hands","1 Observed, fixed place","",89.030315179149042,95.222983597083342,97.436312961534639,97.772803044129262,98.396136581338524,98.566883760284853,99.4487253288261,99.44984919321746,100,100,85.00581697129526,92.793716931422637,95.013707788556275,95.578188095986263,95.661059457467374,"4 Central Region","1 Malé","3 North Central","2 North Region","5 South Central","6 South Region",98.169833424766054,99.493782206861169,85.438449263278528,96.053808491467052,94.803349645387058,91.821371599357107]
["MDV",2017,"MDV_2017_DHS",226,"Place where household members wash their hands","2 Observed, mobile place","",4.9779829143789689,2.3412915839885109,1.1919274733583849,1.018467364873709,0.44835741674263307,0,0,0.099726955226956696,0,0,7.5857748519319239,3.1213305314227289,2.516036383068597,2.2506368563983372,1.4613060816236469,"4 Central Region","1 Malé","3 North Central","2 North Region","5 South Central","6 South Region",0.46586273166788528,0.019672937298635399,6.2533726728618397,3.3779318650311181,2.4949303595245689,3.16932307560108]
["MDV",2017,"MDV_2017_DHS",227,"Place where household members wash their hands","3 Not observed: not in dwelling","",4.3936693561344313,2.1034245078869378,1.2341119231422719,0.91557566675903646,1.0744668905092141,0.98884459333342245,0,0,0,0,5.3528528680323699,3.6380092840561309,2.3878493278939281,1.7492383937837339,2.7397927928615702,"4 Central Region","1 Malé","3 North Central","2 North Region","5 South Central","6 South Region",0.11434825887286609,0.19776866137788809,7.8752151900079976,0.070308833890455197,2.080277586526122,4.4000538719749533]
["MDV",2017,"MDV_2017_DHS",228,"Place where household members wash their hands","4 Not observed: no permission to see","",0.37888273000184991,0.1028215161710371,0,0,0.029764053302266998,0.2221358231908645,0,0,0,0,0.25299864883916567,0.32903854552892092,0.082406500481200601,0,0.050626502236677501,"4 Central Region","1 Malé","3 North Central","2 North Region","5 South Central","6 South Region",0.43823073274085139,0.044427106840356202,0,0.0165509401591694,0.16968581198582561,0.2076040991166489]
["MDV",2017,"MDV_2017_DHS",229,"Place where household members wash their hands","5 Not observed: other reason","",1.2191498203356881,0.22947879487016851,0.13764764196465501,0.29315392423802511,0.051275058107356802,0.2221358231908645,0.55127467117388596,0.45042385155558279,0,0,1.8025566599011571,0.1179047075695213,0,0.42193665383170592,0.087215165810772002,"4 Central Region","1 Malé","3 North Central","2 North Region","5 South Central","6 South Region",0.81172485195234245,0.24434908762195889,0.43296287385172239,0.48139986945225183,0.45175659657648282,0.40164735395032269]