{"text_format":"1","workbook":"xlsx","n_sheets":8,"sheets":["Introduction","Water","Sanitation","Hygiene","MICS00","DHS05","MICS12","data_summary"],"not_rendered":{"charts":123,"images":76,"macros":1,"external_links":0,"defined_names":0,"comments":0,"pivot_tables":0},"unopened":[],"bounds":{"document_bytes":16777216,"sheet_cells":100000,"rows_first":2000,"rows_last":500,"rows_between":2000,"halvings":0,"cell_chars":16384,"cell_head_chars":4096},"cells_cut":0,"cells_raw":0,"read":"whole","date_system":"1900"}

{"sheet":"Introduction","index":0,"n_rows":55,"n_cols":12,"rows_kept":55,"cut":false,"hidden":false,"merged":[[107,0,107,1],[1,0,1,1],[4,0,4,1],[5,0,5,1],[6,0,6,1],[7,0,7,1],[112,0,112,1],[113,0,113,1],[207,0,207,1],[212,0,212,1],[213,0,213,1]]}
[]
[]
[]
[null,null,"Joint Monitoring Programme for Water Supply, Sanitation and Hygiene"]
[]
[null,null,"Estimates on household water, sanitation and hygiene \nby wealth quintile and sub-national region in"]
[null,null,{"$f":"+Water!B5","v":"Republic of Moldova"}]
[]
[null,null,"Updated May 2021"]
[]
[null,null,"Follow the links below to find the following information: "]
[]
[null,null,"JMP Estimates"]
[null,null,"WASH status and trends by wealth quintile \n(customized quintiles made without water and sanitation assets)"]
[null,null,"Water"]
[null,null,"Sanitation"]
[null,null,"Hygiene"]
[]
[null,null,"Data inputs"]
[null,null," customized wealth quintiles and subnational data:"]
[null,null,{"$f":"IF(INDIRECT(CONCATENATE(\"Water\",\"!B105\"))=0,\"\",INDIRECT(CONCATENATE(\"Water\",\"!B105\")))","v":"MICS00"}]
[null,null,{"$f":"IF(INDIRECT(CONCATENATE(\"Water\",\"!B106\"))=0,\"\",INDIRECT(CONCATENATE(\"Water\",\"!B106\")))","v":"DHS05"}]
[null,null,{"$f":"IF(INDIRECT(CONCATENATE(\"Water\",\"!B107\"))=0,\"\",INDIRECT(CONCATENATE(\"Water\",\"!B107\")))","v":"MICS12"}]
[null,null,{"$f":"IF(INDIRECT(CONCATENATE(\"Water\",\"!B108\"))=0,\"\",INDIRECT(CONCATENATE(\"Water\",\"!B108\")))","v":""}]
[null,null,{"$f":"IF(INDIRECT(CONCATENATE(\"Water\",\"!B109\"))=0,\"\",INDIRECT(CONCATENATE(\"Water\",\"!B109\")))","v":""}]
[null,null,{"$f":"IF(INDIRECT(CONCATENATE(\"Water\",\"!B110\"))=0,\"\",INDIRECT(CONCATENATE(\"Water\",\"!B110\")))","v":""}]
[null,null,{"$f":"IF(INDIRECT(CONCATENATE(\"Water\",\"!B111\"))=0,\"\",INDIRECT(CONCATENATE(\"Water\",\"!B111\")))","v":""}]
[null,null,{"$f":"IF(INDIRECT(CONCATENATE(\"Water\",\"!B112\"))=0,\"\",INDIRECT(CONCATENATE(\"Water\",\"!B112\")))","v":""}]
[null,null,{"$f":"IF(INDIRECT(CONCATENATE(\"Water\",\"!B113\"))=0,\"\",INDIRECT(CONCATENATE(\"Water\",\"!B113\")))","v":""}]
[null,null,{"$f":"IF(INDIRECT(CONCATENATE(\"Water\",\"!B114\"))=0,\"\",INDIRECT(CONCATENATE(\"Water\",\"!B114\")))","v":""}]
[null,null,{"$f":"IF(INDIRECT(CONCATENATE(\"Water\",\"!B115\"))=0,\"\",INDIRECT(CONCATENATE(\"Water\",\"!B115\")))","v":""}]
[null,null,{"$f":"IF(INDIRECT(CONCATENATE(\"Water\",\"!B116\"))=0,\"\",INDIRECT(CONCATENATE(\"Water\",\"!B116\")))","v":""}]
[]
[]
[]
[]
[]
[]
[]
[]
[]
[]
[]
[]
[]
[]
[]
[]
[]
[]
[]
[]
[]
[]
[null,null,null,null,null,null,null,null,null,null,null,{"$f":"+IF(ISNUMBER(M48), \"\", \"Insufficient data to estimate safely managed sanitation services at national level\")","v":"Insufficient data to estimate safely managed sanitation services at national level"}]

{"sheet":"Water","index":1,"n_rows":318,"n_cols":28,"rows_kept":318,"cut":false,"hidden":false,"merged":[[3,1,3,24],[317,18,317,22],[117,18,117,22],[196,18,196,22],[296,23,296,27],[298,0,299,1],[300,0,301,1],[296,0,297,2],[296,3,296,7],[296,8,296,12],[296,13,296,17],[296,18,296,22],[196,23,196,27],[198,0,199,1],[200,0,201,1],[196,13,196,17],[96,8,96,12],[96,13,96,17],[96,18,96,22],[217,18,217,22],[98,0,99,1],[100,0,101,1],[196,0,197,2],[196,3,196,7],[196,8,196,12],[217,1,217,11],[35,3,36,3],[38,1,39,2],[38,3,39,3],[96,0,97,2],[96,3,96,7],[317,1,317,11],[6,9,6,16],[6,17,6,24],[6,1,6,8],[4,1,4,24],[117,1,117,11],[30,21,30,24],[32,1,33,2],[32,3,33,3],[30,17,30,20],[30,1,31,4],[30,5,30,8],[30,9,30,12],[30,13,30,16],[96,23,96,27],[35,1,36,2]]}
["BGD"]
[]
[]
[null,"Summary of trends in use of drinking water by wealth quintile (%)"]
[null,{"$f":"IF(ISERROR(INDIRECT(CONCATENATE($B105,\"!A2\"))),\"\",INDIRECT(CONCATENATE($B105,\"!A2\")))","v":"Republic of Moldova"}]
[]
[null,{"$f":"B118","v":"National use of drinking water sources, 2000–2018"},null,null,null,null,null,null,null,{"$f":"B218","v":"Urban use of drinking water sources,  2000–2018"},null,null,null,null,null,null,null,{"$f":"B318","v":"Rural use of drinking water sources, 2000–2018"}]
[]
[]
[]
[]
[]
[]
[]
[]
[]
[]
[]
[]
[]
[]
[]
[]
[]
[]
[]
[]
[]
[]
[]
[null,{"$f":"IF(ISERROR(INDIRECT(CONCATENATE($B105,\"!A2\"))),\"\",INDIRECT(CONCATENATE($B105,\"!A2\")))","v":"Republic of Moldova"},null,null,null,"Poorest",null,null,null,"Poor",null,null,null,"Middle",null,null,null,"Rich",null,null,null,"Richest"]
[null,null,null,null,null,"Basic","Limited","Unimproved","Surface \n water","Basic","Limited","Unimproved","Surface \nwater","Basic","Limited","Unimproved","Surface \nwater","Basic","Limited","Unimproved","Surface \nwater","Basic","Limited","Unimproved","Surface \nwater"]
[null,"NATIONAL",null,"Estimate",{"$f":"C99","v":2000},{"$f":"E99","v":85.916964012002225},{"$f":"F99","v":2.2631434353114996},11.819892552686269,0,{"$f":"J99","v":90.896852409341051},{"$f":"K99","v":1.8234047514266385},7.2797428392323127,0,{"$f":"O99","v":92.907496943629866},{"$f":"P99","v":1.4464415312610577},5.6119336775238935,3.4127847585178728E-2,{"$f":"T99","v":95.641405936826644},{"$f":"U99","v":1.299649169880851},3.0589448932925052,0,{"$f":"Y99","v":98.008113515007693},{"$f":"Z99","v":0.96293689640022617},1.0289495885920843,0]
[null,null,null,null,{"$f":"C100","v":2018},{"$f":"E100","v":71.304357114002585},1.87823195997846,26.817410926018951,0,{"$f":"J100","v":79.848602354316796},1.6017751667787701,18.549622478904439,0,{"$f":"O100","v":86.401070608543776},1.3451454509579874,12.253783940498238,0,{"$f":"T100","v":91.822710191854355},1.247757787624729,6.9295320205209094,0,{"$f":"Y100","v":96.582878035126981},0.94893385338251035,2.4681881114905053,0]
[]
[null,"URBAN",null,"Estimate",{"$f":"C199","v":2000},{"$f":"E199","v":94.73393158102283},{"$f":"F199","v":1.762170675728282},3.5038977432488849,0,{"$f":"J199","v":96.451109444707001},{"$f":"K199","v":1.6182305502149013},1.9306600050780958,0,{"$f":"O199","v":98.096960126895553},{"$f":"P199","v":1.274700304517014},0.62833956858743534,0,{"$f":"T199","v":97.718560865578098},{"$f":"U199","v":1.3760736130814757},0.90536552134042836,0,{"$f":"Y199","v":98.515823716642885},{"$f":"Z199","v":0.68983160941931332},0.79434467393780039,0]
[null,null,null,null,{"$f":"C200","v":2018},{"$f":"E200","v":87.268177410372658},1.6232982268374219,11.108524362789922,0,{"$f":"J200","v":94.288281150018193},1.5819432037915708,4.1297756461902395,0,{"$f":"O200","v":95.219662048149729},1.2373118601409692,3.5430260917093079,0,{"$f":"T200","v":96.788053734048219},1.3629702036663107,1.8489760622854732,0,{"$f":"Y200","v":98.672239224626992},0.69092686861260977,0.63683390676040119,0]
[]
[null,"RURAL",null,"Estimate",{"$f":"C299","v":2000},{"$f":"E299","v":83.428041738592896},{"$f":"F299","v":2.4456349553458181},14.126323306061281,0,{"$f":"J299","v":89.173828316759227},{"$f":"K299","v":2.0821637413796399},8.7440079418611276,0,{"$f":"O299","v":91.350475466340328},{"$f":"P299","v":1.512446783136828},7.1370777505228489,0,{"$f":"T299","v":90.910375101302691},{"$f":"U299","v":1.5661222156622279},7.4662736394963218,5.7229043538757907E-2,{"$f":"Y299","v":93.496982915844086},{"$f":"Z299","v":0.86054268376378418},5.6424744003921319,0]
[null,null,null,null,{"$f":"C300","v":2018},{"$f":"E300","v":68.842340523799621},2.0180652797815979,29.139594196418784,0,{"$f":"J300","v":75.342784368921969},1.7592158680269525,22.897999763051075,0,{"$f":"O300","v":79.699780496786573},1.3195517156721517,18.980667787541279,0,{"$f":"T300","v":84.514733045557392},1.4559438438783143,14.029323110564292,0,{"$f":"Y300","v":90.306041309808748},0.83117337827653914,8.8627853119147062,0]
[]
[]
[]
[]
[]
[]
[]
[]
[]
[]
[]
[]
[]
[]
[]
[]
[]
[]
[]
[]
[]
[]
[]
[]
[]
[]
[]
[]
[]
[]
[]
[]
[]
[]
[]
[]
[]
[]
[]
[]
[]
[]
[]
[]
[]
[]
[]
[]
[]
[]
[]
[]
[]
[]
[]
[]
["NATIONAL",null,null,"Poorest",null,null,null,null,"Poor",null,null,null,null,"Middle",null,null,null,null,"Rich",null,null,null,null,"Richest"]
[null,null,null,"Improved","Basic","Limited","Unimproved","Surface water","Improved","Basic","Limited","Unimproved","Surface water","Improved","Basic","Limited","Unimproved","Surface water","Improved","Basic","Limited","Unimproved","Surface water","Improved","Basic","Limited","Unimproved","Surface water"]
["Forecast period:",null,2000,{"$f":"IF((D101+H101)>100,D101*100/(D101+H101),D101)","v":88.180107447313731},{"$f":"D99*AVERAGEIF(E105:E116,\">0\")/100","v":85.916964012002225},{"$f":"D99*(100-AVERAGEIF(E105:E116,\">0\"))/100","v":2.2631434353114996},{"$f":"100-(E99+F99+H99)","v":11.819892552686269},{"$f":"IF((D101+H101)>100,H101*100/(D101+H101),H101)","v":0},{"$f":"IF((I101+M101)>100,I101*100/(I101+M101),I101)","v":92.720257160767687},{"$f":"I99*AVERAGEIF(J105:J116,\">0\")/100","v":90.896852409341051},{"$f":"I99*(100-AVERAGEIF(J105:J116,\">0\"))/100","v":1.8234047514266385},{"$f":"100-(J99+K99+M99)","v":7.2797428392323127},{"$f":"IF((I101+M101)>100,M101*100/(I101+M101),M101)","v":0},{"$f":"IF((N101+R101)>100,N101*100/(N101+R101),N101)","v":94.353938474890924},{"$f":"N99*AVERAGEIF(O105:O116,\">0\")/100","v":92.907496943629866},{"$f":"N99*(100-AVERAGEIF(O105:O116,\">0\"))/100","v":1.4464415312610577},{"$f":"100-(O99+P99+R99)","v":5.6119336775238935},{"$f":"IF((N101+R101)>100,R101*100/(N101+R101),R101)","v":3.4127847585178728E-2},{"$f":"IF((S101+W101)>100,S101*100/(S101+W101),S101)","v":96.941055106707495},{"$f":"S99*AVERAGEIF(T105:T116,\">0\")/100","v":95.641405936826644},{"$f":"S99*(100-AVERAGEIF(T105:T116,\">0\"))/100","v":1.299649169880851},{"$f":"100-(T99+U99+W99)","v":3.0589448932925052},{"$f":"IF((S101+W101)>100,W101*100/(S101+W101),W101)","v":0},{"$f":"IF((X101+AB101)>100,X101*100/(X101+AB101),X101)","v":98.97105041140793},{"$f":"X99*AVERAGEIF(Y105:Y116,\">0\")/100","v":98.008113515007693},{"$f":"X99*(100-AVERAGEIF(Y105:Y116,\">0\"))/100","v":0.96293689640022617},{"$f":"100-(Y99+Z99+AB99)","v":1.0289495885920843},{"$f":"IF((X101+AB101)>100,AB101*100/(X101+AB101),AB101)","v":0}]
[null,null,2018,{"$f":"IF((D102+H102)>100,D102*100/(D102+H102),D102)","v":73.182589073981035},{"$f":"D100*AVERAGEIF(E105:E116,\">0\")/100","v":71.304357114002585},{"$f":"D100*(100-AVERAGEIF(E105:E116,\">0\"))/100","v":1.87823195997846},{"$f":"100-(E100+F100+H100)","v":26.817410926018951},{"$f":"IF((D102+H102)>100,H102*100/(D102+H102),H102)","v":0},{"$f":"IF((I102+M102)>100,I102*100/(I102+M102),I102)","v":81.450377521095561},{"$f":"I100*AVERAGEIF(J105:J116,\">0\")/100","v":79.848602354316796},{"$f":"I100*(100-AVERAGEIF(J105:J116,\">0\"))/100","v":1.6017751667787701},{"$f":"100-(J100+K100+M100)","v":18.549622478904439},{"$f":"IF((I102+M102)>100,M102*100/(I102+M102),M102)","v":0},{"$f":"IF((N102+R102)>100,N102*100/(N102+R102),N102)","v":87.746216059501762},{"$f":"N100*AVERAGEIF(O105:O116,\">0\")/100","v":86.401070608543776},{"$f":"N100*(100-AVERAGEIF(O105:O116,\">0\"))/100","v":1.3451454509579874},{"$f":"100-(O100+P100+R100)","v":12.253783940498238},{"$f":"IF((N102+R102)>100,R102*100/(N102+R102),R102)","v":0},{"$f":"IF((S102+W102)>100,S102*100/(S102+W102),S102)","v":93.070467979479076},{"$f":"S100*AVERAGEIF(T105:T116,\">0\")/100","v":91.822710191854355},{"$f":"S100*(100-AVERAGEIF(T105:T116,\">0\"))/100","v":1.247757787624729},{"$f":"100-(T100+U100+W100)","v":6.9295320205209094},{"$f":"IF((S102+W102)>100,W102*100/(S102+W102),W102)","v":0},{"$f":"IF((X102+AB102)>100,X102*100/(X102+AB102),X102)","v":97.53181188850948},{"$f":"X100*AVERAGEIF(Y105:Y116,\">0\")/100","v":96.582878035126981},{"$f":"X100*(100-AVERAGEIF(Y105:Y116,\">0\"))/100","v":0.94893385338251035},{"$f":"100-(Y100+Z100+AB100)","v":2.4681881114905053},{"$f":"IF((X102+AB102)>100,AB102*100/(X102+AB102),AB102)","v":0}]
["Regression period:",null,{"$f":"MinRegYear(C99,C105:C116)","v":2000},{"$f":"IF(MAX(C105:C116)-MIN(C105:C116)<5,AVERAGEIF(C105:C116,\">0\",D105:D116),\nIF(FORECAST($C101,D$105:D$116,$C$105:$C$116)<0,0,\nIF(FORECAST($C101,D$105:D$116,$C$105:$C$116)>100,100,\nFORECAST($C101,D$105:D$116,$C$105:$C$116))))","v":88.180107447313731},null,null,null,{"$f":"IF(MAX(C105:C116)-MIN(C105:C116)<5,AVERAGEIF(C105:C116,\">0\",H105:H116),\nIF(FORECAST($C101,H$105:H$116,$C$105:$C$116)<0,0,\nIF(FORECAST($C101,H$105:H$116,$C$105:$C$116)>100,100,\nFORECAST($C101,H$105:H$116,$C$105:$C$116))))","v":0},{"$f":"IF(MAX(C105:C116)-MIN(C105:C116)<5,AVERAGEIF(C105:C116,\">0\",I105:I116),\nIF(FORECAST($C101,I$105:I$116,$C$105:$C$116)<0,0,\nIF(FORECAST($C101,I$105:I$116,$C$105:$C$116)>100,100,\nFORECAST($C101,I$105:I$116,$C$105:$C$116))))","v":92.720257160767687},null,null,null,{"$f":"IF(MAX(C105:C116)-MIN(C105:C116)<5,AVERAGEIF(C105:C116,\">0\",M105:M116),\nIF(FORECAST($C101,M$105:M$116,$C$105:$C$116)<0,0,\nIF(FORECAST($C101,M$105:M$116,$C$105:$C$116)>100,100,\nFORECAST($C101,M$105:M$116,$C$105:$C$116))))","v":0},{"$f":"IF(MAX(C105:C116)-MIN(C105:C116)<5,AVERAGEIF(C105:C116,\">0\",N105:N116),\nIF(FORECAST($C101,N$105:N$116,$C$105:$C$116)<0,0,\nIF(FORECAST($C101,N$105:N$116,$C$105:$C$116)>100,100,\nFORECAST($C101,N$105:N$116,$C$105:$C$116))))","v":94.353938474890924},null,null,null,{"$f":"IF(MAX(C105:C116)-MIN(C105:C116)<5,AVERAGEIF(C105:C116,\">0\",R105:R116),\nIF(FORECAST($C101,R$105:R$116,$C$105:$C$116)<0,0,\nIF(FORECAST($C101,R$105:R$116,$C$105:$C$116)>100,100,\nFORECAST($C101,R$105:R$116,$C$105:$C$116))))","v":3.4127847585178728E-2},{"$f":"IF(MAX(C105:C116)-MIN(C105:C116)<5,AVERAGEIF(C105:C116,\">0\",S105:S116),\nIF(FORECAST($C101,S$105:S$116,$C$105:$C$116)<0,0,\nIF(FORECAST($C101,S$105:S$116,$C$105:$C$116)>100,100,\nFORECAST($C101,S$105:S$116,$C$105:$C$116))))","v":96.941055106707495},null,null,null,{"$f":"IF(MAX(C105:C116)-MIN(C105:C116)<5,AVERAGEIF(C105:C116,\">0\",W105:W116),\nIF(FORECAST($C101,W$105:W$116,$C$105:$C$116)<0,0,\nIF(FORECAST($C101,W$105:W$116,$C$105:$C$116)>100,100,\nFORECAST($C101,W$105:W$116,$C$105:$C$116))))","v":0},{"$f":"IF(MAX(C105:C116)-MIN(C105:C116)<5,AVERAGEIF(C105:C116,\">0\",X105:X116),\nIF(FORECAST($C101,X$105:X$116,$C$105:$C$116)<0,0,\nIF(FORECAST($C101,X$105:X$116,$C$105:$C$116)>100,100,\nFORECAST($C101,X$105:X$116,$C$105:$C$116))))","v":98.97105041140793},null,null,null,{"$f":"IF(MAX(C105:C116)-MIN(C105:C116)<5,AVERAGEIF(C105:C116,\">0\",AB105:AB116),\nIF(FORECAST($C101,AB$105:AB$116,$C$105:$C$116)<0,0,\nIF(FORECAST($C101,AB$105:AB$116,$C$105:$C$116)>100,100,\nFORECAST($C101,AB$105:AB$116,$C$105:$C$116))))","v":0}]
[null,null,{"$f":"MaxRegYear(C100,C105:C116)","v":2014},{"$f":"IF(MAX(C105:C116)-MIN(C105:C116)<5,AVERAGEIF(C105:C116,\">0\",D105:D116),\nIF(FORECAST($C102,D$105:D$116,$C$105:$C$116)<0,0,\nIF(FORECAST($C102,D$105:D$116,$C$105:$C$116)>100,100,\nFORECAST($C102,D$105:D$116,$C$105:$C$116))))","v":73.182589073981035},null,null,null,{"$f":"IF(MAX(C105:C116)-MIN(C105:C116)<5,AVERAGEIF(C105:C116,\">0\",H105:H116),\nIF(FORECAST($C102,H$105:H$116,$C$105:$C$116)<0,0,\nIF(FORECAST($C102,H$105:H$116,$C$105:$C$116)>100,100,\nFORECAST($C102,H$105:H$116,$C$105:$C$116))))","v":0},{"$f":"IF(MAX(C105:C116)-MIN(C105:C116)<5,AVERAGEIF(C105:C116,\">0\",I105:I116),\nIF(FORECAST($C102,I$105:I$116,$C$105:$C$116)<0,0,\nIF(FORECAST($C102,I$105:I$116,$C$105:$C$116)>100,100,\nFORECAST($C102,I$105:I$116,$C$105:$C$116))))","v":81.450377521095561},null,null,null,{"$f":"IF(MAX(C105:C116)-MIN(C105:C116)<5,AVERAGEIF(C105:C116,\">0\",M105:M116),\nIF(FORECAST($C102,M$105:M$116,$C$105:$C$116)<0,0,\nIF(FORECAST($C102,M$105:M$116,$C$105:$C$116)>100,100,\nFORECAST($C102,M$105:M$116,$C$105:$C$116))))","v":0},{"$f":"IF(MAX(C105:C116)-MIN(C105:C116)<5,AVERAGEIF(C105:C116,\">0\",N105:N116),\nIF(FORECAST($C102,N$105:N$116,$C$105:$C$116)<0,0,\nIF(FORECAST($C102,N$105:N$116,$C$105:$C$116)>100,100,\nFORECAST($C102,N$105:N$116,$C$105:$C$116))))","v":87.746216059501762},null,null,null,{"$f":"IF(MAX(C105:C116)-MIN(C105:C116)<5,AVERAGEIF(C105:C116,\">0\",R105:R116),\nIF(FORECAST($C102,R$105:R$116,$C$105:$C$116)<0,0,\nIF(FORECAST($C102,R$105:R$116,$C$105:$C$116)>100,100,\nFORECAST($C102,R$105:R$116,$C$105:$C$116))))","v":0},{"$f":"IF(MAX(C105:C116)-MIN(C105:C116)<5,AVERAGEIF(C105:C116,\">0\",S105:S116),\nIF(FORECAST($C102,S$105:S$116,$C$105:$C$116)<0,0,\nIF(FORECAST($C102,S$105:S$116,$C$105:$C$116)>100,100,\nFORECAST($C102,S$105:S$116,$C$105:$C$116))))","v":93.070467979479076},null,null,null,{"$f":"IF(MAX(C105:C116)-MIN(C105:C116)<5,AVERAGEIF(C105:C116,\">0\",W105:W116),\nIF(FORECAST($C102,W$105:W$116,$C$105:$C$116)<0,0,\nIF(FORECAST($C102,W$105:W$116,$C$105:$C$116)>100,100,\nFORECAST($C102,W$105:W$116,$C$105:$C$116))))","v":0},{"$f":"IF(MAX(C105:C116)-MIN(C105:C116)<5,AVERAGEIF(C105:C116,\">0\",X105:X116),\nIF(FORECAST($C102,X$105:X$116,$C$105:$C$116)<0,0,\nIF(FORECAST($C102,X$105:X$116,$C$105:$C$116)>100,100,\nFORECAST($C102,X$105:X$116,$C$105:$C$116))))","v":97.53181188850948},null,null,null,{"$f":"IF(MAX(C105:C116)-MIN(C105:C116)<5,AVERAGEIF(C105:C116,\">0\",AB105:AB116),\nIF(FORECAST($C102,AB$105:AB$116,$C$105:$C$116)<0,0,\nIF(FORECAST($C102,AB$105:AB$116,$C$105:$C$116)>100,100,\nFORECAST($C102,AB$105:AB$116,$C$105:$C$116))))","v":0}]
[]
[null,"Survey","Year","Improved","Basic",null,null,"Surface water","Improved","Basic",null,null,"Surface water","Improved","Basic",null,null,"Surface water","Improved","Basic",null,null,"Surface water","Improved","Basic",null,null,"Surface water"]
[null,"MICS00",2000,{"$f":"IF(ISERROR(INDIRECT(CONCATENATE($B105,\"!C16\"))),\"\",INDIRECT(CONCATENATE($B105,\"!C16\")))","v":86.044979069073761},{"$f":"IF(ISERROR(INDIRECT(CONCATENATE($B105,\"!C23\"))),\"\",INDIRECT(CONCATENATE($B105,\"!C23\")))","v":97.666997782547057},null,null,{"$f":"IF(ISERROR(INDIRECT(CONCATENATE($B105,\"!C21\"))),\"\",INDIRECT(CONCATENATE($B105,\"!C21\")))","v":0},{"$f":"IF(ISERROR(INDIRECT(CONCATENATE($B105,\"!D16\"))),\"\",INDIRECT(CONCATENATE($B105,\"!D16\")))","v":91.235752703299426},{"$f":"IF(ISERROR(INDIRECT(CONCATENATE($B105,\"!D23\"))),\"\",INDIRECT(CONCATENATE($B105,\"!D23\")))","v":97.466868649285473},null,null,{"$f":"IF(ISERROR(INDIRECT(CONCATENATE($B105,\"!D21\"))),\"\",INDIRECT(CONCATENATE($B105,\"!D21\")))","v":0},{"$f":"IF(ISERROR(INDIRECT(CONCATENATE($B105,\"!E16\"))),\"\",INDIRECT(CONCATENATE($B105,\"!E16\")))","v":93.667691508510657},{"$f":"IF(ISERROR(INDIRECT(CONCATENATE($B105,\"!E23\"))),\"\",INDIRECT(CONCATENATE($B105,\"!E23\")))","v":98.334009211187364},null,null,{"$f":"IF(ISERROR(INDIRECT(CONCATENATE($B105,\"!E21\"))),\"\",INDIRECT(CONCATENATE($B105,\"!E21\")))","v":4.4022903985614634E-2},{"$f":"IF(ISERROR(INDIRECT(CONCATENATE($B105,\"!F16\"))),\"\",INDIRECT(CONCATENATE($B105,\"!F16\")))","v":97.048282509991097},{"$f":"IF(ISERROR(INDIRECT(CONCATENATE($B105,\"!F23\"))),\"\",INDIRECT(CONCATENATE($B105,\"!F23\")))","v":98.518681608220035},null,null,{"$f":"IF(ISERROR(INDIRECT(CONCATENATE($B105,\"!F21\"))),\"\",INDIRECT(CONCATENATE($B105,\"!F21\")))","v":0},{"$f":"IF(ISERROR(INDIRECT(CONCATENATE($B105,\"!G16\"))),\"\",INDIRECT(CONCATENATE($B105,\"!G16\")))","v":98.498666062914978},{"$f":"IF(ISERROR(INDIRECT(CONCATENATE($B105,\"!G23\"))),\"\",INDIRECT(CONCATENATE($B105,\"!G23\")))","v":99.254103917463851},null,null,{"$f":"IF(ISERROR(INDIRECT(CONCATENATE($B105,\"!G221\"))),\"\",INDIRECT(CONCATENATE($B105,\"!G21\")))","v":0}]
[null,"DHS05",2005,86.484070962391868,"N/A",null,null,0,91.240164930830559,"N/A",null,null,0,93.17046098318967,"N/A",null,null,0,95.374884155639833,"N/A",null,null,0,99.266838393503534,"N/A",null,null,0]
[null,"MICS12",2012,73.8,97.2,null,null,0,82,98.6,null,null,0,88.2,98.6,null,null,0,93.7,98.8,null,null,0,97.4,98.8,null,null,0]
[null,null,null,"","",null,null,"","","",null,null,"","","",null,null,"","","",null,null,"","","",null,null,""]
[null,null,null,"","",null,null,"","","",null,null,"","","",null,null,"","","",null,null,"","","",null,null,""]
[null,null,null,"","",null,null,"","","",null,null,"","","",null,null,"","","",null,null,"","","",null,null,""]
[null,null,null,{"$f":"IF(ISERROR(INDIRECT(CONCATENATE($B111,\"!C16\"))),\"\",INDIRECT(CONCATENATE($B111,\"!C16\")))","v":""},{"$f":"IF(ISERROR(INDIRECT(CONCATENATE($B111,\"!C23\"))),\"\",INDIRECT(CONCATENATE($B111,\"!C23\")))","v":""},null,null,{"$f":"IF(ISERROR(INDIRECT(CONCATENATE($B111,\"!C21\"))),\"\",INDIRECT(CONCATENATE($B111,\"!C21\")))","v":""},{"$f":"IF(ISERROR(INDIRECT(CONCATENATE($B111,\"!D16\"))),\"\",INDIRECT(CONCATENATE($B111,\"!D16\")))","v":""},{"$f":"IF(ISERROR(INDIRECT(CONCATENATE($B111,\"!D23\"))),\"\",INDIRECT(CONCATENATE($B111,\"!D23\")))","v":""},null,null,{"$f":"IF(ISERROR(INDIRECT(CONCATENATE($B111,\"!D21\"))),\"\",INDIRECT(CONCATENATE($B111,\"!D21\")))","v":""},{"$f":"IF(ISERROR(INDIRECT(CONCATENATE($B111,\"!E16\"))),\"\",INDIRECT(CONCATENATE($B111,\"!E16\")))","v":""},{"$f":"IF(ISERROR(INDIRECT(CONCATENATE($B111,\"!E23\"))),\"\",INDIRECT(CONCATENATE($B111,\"!E23\")))","v":""},null,null,{"$f":"IF(ISERROR(INDIRECT(CONCATENATE($B111,\"!E21\"))),\"\",INDIRECT(CONCATENATE($B111,\"!E21\")))","v":""},{"$f":"IF(ISERROR(INDIRECT(CONCATENATE($B111,\"!F16\"))),\"\",INDIRECT(CONCATENATE($B111,\"!F16\")))","v":""},{"$f":"IF(ISERROR(INDIRECT(CONCATENATE($B111,\"!F23\"))),\"\",INDIRECT(CONCATENATE($B111,\"!F23\")))","v":""},null,null,{"$f":"IF(ISERROR(INDIRECT(CONCATENATE($B111,\"!F21\"))),\"\",INDIRECT(CONCATENATE($B111,\"!F21\")))","v":""},{"$f":"IF(ISERROR(INDIRECT(CONCATENATE($B111,\"!G16\"))),\"\",INDIRECT(CONCATENATE($B111,\"!G16\")))","v":""},{"$f":"IF(ISERROR(INDIRECT(CONCATENATE($B111,\"!G23\"))),\"\",INDIRECT(CONCATENATE($B111,\"!G23\")))","v":""},null,null,{"$f":"IF(ISERROR(INDIRECT(CONCATENATE($B111,\"!G221\"))),\"\",INDIRECT(CONCATENATE($B111,\"!G21\")))","v":""}]
[null,null,null,{"$f":"IF(ISERROR(INDIRECT(CONCATENATE($B112,\"!C16\"))),\"\",INDIRECT(CONCATENATE($B112,\"!C16\")))","v":""},{"$f":"IF(ISERROR(INDIRECT(CONCATENATE($B112,\"!C23\"))),\"\",INDIRECT(CONCATENATE($B112,\"!C23\")))","v":""},null,null,{"$f":"IF(ISERROR(INDIRECT(CONCATENATE($B112,\"!C21\"))),\"\",INDIRECT(CONCATENATE($B112,\"!C21\")))","v":""},{"$f":"IF(ISERROR(INDIRECT(CONCATENATE($B112,\"!D16\"))),\"\",INDIRECT(CONCATENATE($B112,\"!D16\")))","v":""},{"$f":"IF(ISERROR(INDIRECT(CONCATENATE($B112,\"!D23\"))),\"\",INDIRECT(CONCATENATE($B112,\"!D23\")))","v":""},null,null,{"$f":"IF(ISERROR(INDIRECT(CONCATENATE($B112,\"!D21\"))),\"\",INDIRECT(CONCATENATE($B112,\"!D21\")))","v":""},{"$f":"IF(ISERROR(INDIRECT(CONCATENATE($B112,\"!E16\"))),\"\",INDIRECT(CONCATENATE($B112,\"!E16\")))","v":""},{"$f":"IF(ISERROR(INDIRECT(CONCATENATE($B112,\"!E23\"))),\"\",INDIRECT(CONCATENATE($B112,\"!E23\")))","v":""},null,null,{"$f":"IF(ISERROR(INDIRECT(CONCATENATE($B112,\"!E21\"))),\"\",INDIRECT(CONCATENATE($B112,\"!E21\")))","v":""},{"$f":"IF(ISERROR(INDIRECT(CONCATENATE($B112,\"!F16\"))),\"\",INDIRECT(CONCATENATE($B112,\"!F16\")))","v":""},{"$f":"IF(ISERROR(INDIRECT(CONCATENATE($B112,\"!F23\"))),\"\",INDIRECT(CONCATENATE($B112,\"!F23\")))","v":""},null,null,{"$f":"IF(ISERROR(INDIRECT(CONCATENATE($B112,\"!F21\"))),\"\",INDIRECT(CONCATENATE($B112,\"!F21\")))","v":""},{"$f":"IF(ISERROR(INDIRECT(CONCATENATE($B112,\"!G16\"))),\"\",INDIRECT(CONCATENATE($B112,\"!G16\")))","v":""},{"$f":"IF(ISERROR(INDIRECT(CONCATENATE($B112,\"!G23\"))),\"\",INDIRECT(CONCATENATE($B112,\"!G23\")))","v":""},null,null,{"$f":"IF(ISERROR(INDIRECT(CONCATENATE($B112,\"!G221\"))),\"\",INDIRECT(CONCATENATE($B112,\"!G21\")))","v":""}]
[null,null,null,"","",null,null,"","","",null,null,"","","",null,null,"","","",null,null,"","","",null,null,""]
[null,null,null,"","",null,null,"","","",null,null,"","","",null,null,"","","",null,null,"","","",null,null,""]
[null,null,null,"","",null,null,"","","",null,null,"","","",null,null,"","","",null,null,"","","",null,null,""]
[null,null,null,"","",null,null,"","","",null,null,"","","",null,null,"","","",null,null,"","","",null,null,""]
[]
[null,{"$f":"CONCATENATE(\"National use of drinking water sources, \",C99,\"–\",C100)","v":"National use of drinking water sources, 2000–2018"},null,null,null,null,null,null,null,null,null,null,null,null,null,null,null,null,"Data points used for regression"]
[]
[]
[]
[]
[]
[]
[]
[]
[]
[]
[]
[]
[]
[]
[]
[]
[]
[]
[]
[]
[]
[]
[]
[]
[]
[]
[]
[]
[]
[]
[]
[]
[]
[]
[null,null,null,null,{"$f":"IF(ISERROR(INDIRECT(CONCATENATE($B153,\"!M18\"))),\"\",INDIRECT(CONCATENATE($B153,\"!M18\")))","v":""},{"$f":"IF(ISERROR(INDIRECT(CONCATENATE($B153,\"!M19\"))),\"\",INDIRECT(CONCATENATE($B153,\"!M19\")))","v":""},{"$f":"IF(ISERROR(INDIRECT(CONCATENATE($B153,\"!M20\"))),\"\",INDIRECT(CONCATENATE($B153,\"!M20\")))","v":""},{"$f":"IF(ISERROR(INDIRECT(CONCATENATE($B153,\"!M21\"))),\"\",INDIRECT(CONCATENATE($B153,\"!M21\")))","v":""},null,{"$f":"IF(ISERROR(INDIRECT(CONCATENATE($B153,\"!N18\"))),\"\",INDIRECT(CONCATENATE($B153,\"!N18\")))","v":""},{"$f":"IF(ISERROR(INDIRECT(CONCATENATE($B153,\"!N19\"))),\"\",INDIRECT(CONCATENATE($B153,\"!N19\")))","v":""},{"$f":"IF(ISERROR(INDIRECT(CONCATENATE($B153,\"!N20\"))),\"\",INDIRECT(CONCATENATE($B153,\"!N20\")))","v":""},{"$f":"IF(ISERROR(INDIRECT(CONCATENATE($B153,\"!N21\"))),\"\",INDIRECT(CONCATENATE($B153,\"!N21\")))","v":""},null,{"$f":"IF(ISERROR(INDIRECT(CONCATENATE($B153,\"!O18\"))),\"\",INDIRECT(CONCATENATE($B153,\"!O18\")))","v":""},{"$f":"IF(ISERROR(INDIRECT(CONCATENATE($B153,\"!O19\"))),\"\",INDIRECT(CONCATENATE($B153,\"!O19\")))","v":""},{"$f":"IF(ISERROR(INDIRECT(CONCATENATE($B153,\"!O20\"))),\"\",INDIRECT(CONCATENATE($B153,\"!O20\")))","v":""},{"$f":"IF(ISERROR(INDIRECT(CONCATENATE($B153,\"!O21\"))),\"\",INDIRECT(CONCATENATE($B153,\"!O21\")))","v":""},null,{"$f":"IF(ISERROR(INDIRECT(CONCATENATE($B153,\"!P18\"))),\"\",INDIRECT(CONCATENATE($B153,\"!P18\")))","v":""},{"$f":"IF(ISERROR(INDIRECT(CONCATENATE($B153,\"!P19\"))),\"\",INDIRECT(CONCATENATE($B153,\"!P19\")))","v":""},{"$f":"IF(ISERROR(INDIRECT(CONCATENATE($B153,\"!P20\"))),\"\",INDIRECT(CONCATENATE($B153,\"!P20\")))","v":""},{"$f":"IF(ISERROR(INDIRECT(CONCATENATE($B153,\"!P21\"))),\"\",INDIRECT(CONCATENATE($B153,\"!P21\")))","v":""},null,{"$f":"IF(ISERROR(INDIRECT(CONCATENATE($B153,\"!Q18\"))),\"\",INDIRECT(CONCATENATE($B153,\"!Q18\")))","v":""},{"$f":"IF(ISERROR(INDIRECT(CONCATENATE($B153,\"!Q19\"))),\"\",INDIRECT(CONCATENATE($B153,\"!Q19\")))","v":""},{"$f":"IF(ISERROR(INDIRECT(CONCATENATE($B153,\"!Q20\"))),\"\",INDIRECT(CONCATENATE($B153,\"!Q20\")))","v":""},{"$f":"IF(ISERROR(INDIRECT(CONCATENATE($B153,\"!Q21\"))),\"\",INDIRECT(CONCATENATE($B153,\"!Q1\")))","v":""}]
[null,null,null,null,"","","","",null,"","","","",null,"","","","",null,"","","","",null,"","","",""]
[null,null,null,null,"","","","",null,"","","","",null,"","","","",null,"","","","",null,"","","",""]
[null,null,null,null,"","","","",null,"","","","",null,"","","","",null,"","","","",null,"","","",""]
[null,null,null,null,"","","","",null,"","","","",null,"","","","",null,"","","","",null,"","","",""]
[null,null,null,null,"","","","",null,"","","","",null,"","","","",null,"","","","",null,"","","",""]
[]
[]
[]
[]
[]
[]
[]
[]
[]
[]
[]
[]
[]
[]
[]
[]
[]
[]
[]
[]
[]
[]
[]
[]
[]
[]
[]
[]
[]
[]
[]
[]
[]
[]
[]
[]
[]
[]
["URBAN",null,null,"Poorest",null,null,null,null,"Poor",null,null,null,null,"Middle",null,null,null,null,"Rich",null,null,null,null,"Richest"]
[null,null,null,"Improved","Basic","Limited","Unimproved","Surface water","Improved","Basic","Limited","Unimproved","Surface water","Improved","Basic","Limited","Unimproved","Surface water","Improved","Basic","Limited","Unimproved","Surface water","Improved","Basic","Limited","Unimproved","Surface water"]
["Forecast period:",null,2000,{"$f":"IF((D201+H201)>100,D201*100/(D201+H201),D201)","v":96.496102256751101},{"$f":"D199*AVERAGEIF(E205:E216,\">0\")/100","v":94.73393158102283},{"$f":"D199*(100-AVERAGEIF(E205:E216,\">0\"))/100","v":1.762170675728282},{"$f":"100-(E199+F199+H199)","v":3.5038977432488849},{"$f":"IF((D201+H201)>100,H201*100/(D201+H201),H201)","v":0},{"$f":"IF((I201+M201)>100,I201*100/(I201+M201),I201)","v":98.069339994921904},{"$f":"I199*AVERAGEIF(J205:J216,\">0\")/100","v":96.451109444707001},{"$f":"I199*(100-AVERAGEIF(J205:J216,\">0\"))/100","v":1.6182305502149013},{"$f":"100-(J199+K199+M199)","v":1.9306600050780958},{"$f":"IF((I201+M201)>100,M201*100/(I201+M201),M201)","v":0},{"$f":"IF((N201+R201)>100,N201*100/(N201+R201),N201)","v":99.371660431412579},{"$f":"N199*AVERAGEIF(O205:O216,\">0\")/100","v":98.096960126895553},{"$f":"N199*(100-AVERAGEIF(O205:O216,\">0\"))/100","v":1.274700304517014},{"$f":"100-(O199+P199+R199)","v":0.62833956858743534},{"$f":"IF((N201+R201)>100,R201*100/(N201+R201),R201)","v":0},{"$f":"IF((S201+W201)>100,S201*100/(S201+W201),S201)","v":99.094634478659572},{"$f":"S199*AVERAGEIF(T205:T216,\">0\")/100","v":97.718560865578098},{"$f":"S199*(100-AVERAGEIF(T205:T216,\">0\"))/100","v":1.3760736130814757},{"$f":"100-(T199+U199+W199)","v":0.90536552134042836},{"$f":"IF((S201+W201)>100,W201*100/(S201+W201),W201)","v":0},{"$f":"IF((X201+AB201)>100,X201*100/(X201+AB201),X201)","v":99.205655326062185},{"$f":"X199*AVERAGEIF(Y205:Y216,\">0\")/100","v":98.515823716642885},{"$f":"X199*(100-AVERAGEIF(Y205:Y216,\">0\"))/100","v":0.68983160941931332},{"$f":"100-(Y199+Z199+AB199)","v":0.79434467393780039},{"$f":"IF((X201+AB201)>100,AB201*100/(X201+AB201),AB201)","v":0}]
[null,null,2018,{"$f":"IF((D202+H202)>100,D202*100/(D202+H202),D202)","v":88.891475637210078},{"$f":"D200*AVERAGEIF(E205:E216,\">0\")/100","v":87.268177410372658},{"$f":"D200*(100-AVERAGEIF(E205:E216,\">0\"))/100","v":1.6232982268374219},{"$f":"100-(E200+F200+H200)","v":11.108524362789922},{"$f":"IF((D202+H202)>100,H202*100/(D202+H202),H202)","v":0},{"$f":"IF((I202+M202)>100,I202*100/(I202+M202),I202)","v":95.87022435380976},{"$f":"I200*AVERAGEIF(J205:J216,\">0\")/100","v":94.288281150018193},{"$f":"I200*(100-AVERAGEIF(J205:J216,\">0\"))/100","v":1.5819432037915708},{"$f":"100-(J200+K200+M200)","v":4.1297756461902395},{"$f":"IF((I202+M202)>100,M202*100/(I202+M202),M202)","v":0},{"$f":"IF((N202+R202)>100,N202*100/(N202+R202),N202)","v":96.456973908290706},{"$f":"N200*AVERAGEIF(O205:O216,\">0\")/100","v":95.219662048149729},{"$f":"N200*(100-AVERAGEIF(O205:O216,\">0\"))/100","v":1.2373118601409692},{"$f":"100-(O200+P200+R200)","v":3.5430260917093079},{"$f":"IF((N202+R202)>100,R202*100/(N202+R202),R202)","v":0},{"$f":"IF((S202+W202)>100,S202*100/(S202+W202),S202)","v":98.151023937714541},{"$f":"S200*AVERAGEIF(T205:T216,\">0\")/100","v":96.788053734048219},{"$f":"S200*(100-AVERAGEIF(T205:T216,\">0\"))/100","v":1.3629702036663107},{"$f":"100-(T200+U200+W200)","v":1.8489760622854732},{"$f":"IF((S202+W202)>100,W202*100/(S202+W202),W202)","v":0},{"$f":"IF((X202+AB202)>100,X202*100/(X202+AB202),X202)","v":99.363166093239599},{"$f":"X200*AVERAGEIF(Y205:Y216,\">0\")/100","v":98.672239224626992},{"$f":"X200*(100-AVERAGEIF(Y205:Y216,\">0\"))/100","v":0.69092686861260977},{"$f":"100-(Y200+Z200+AB200)","v":0.63683390676040119},{"$f":"IF((X202+AB202)>100,AB202*100/(X202+AB202),AB202)","v":0}]
["Regression period:",null,{"$f":"MinRegYear(C199,C205:C216)","v":2000},{"$f":"IF(MAX(C205:C216)-MIN(C205:C216)<5,AVERAGEIF(C205:C216,\">0\",D205:D216),\nIF(FORECAST($C201,D$205:D$216,$C$205:$C$216)<0,0,\nIF(FORECAST($C201,D$205:D$216,$C$205:$C$216)>100,100,\nFORECAST($C201,D$205:D$216,$C$205:$C$216))))","v":96.496102256751101},null,null,null,{"$f":"IF(MAX(C205:C216)-MIN(C205:C216)<5,AVERAGEIF(C205:C216,\">0\",H205:H216),\nIF(FORECAST($C201,H$205:H$216,$C$205:$C$216)<0,0,\nIF(FORECAST($C201,H$205:H$216,$C$205:$C$216)>100,100,\nFORECAST($C201,H$205:H$216,$C$205:$C$216))))","v":0},{"$f":"IF(MAX(C205:C216)-MIN(C205:C216)<5,AVERAGEIF(C205:C216,\">0\",I205:I216),\nIF(FORECAST($C201,I$205:I$216,$C$205:$C$216)<0,0,\nIF(FORECAST($C201,I$205:I$216,$C$205:$C$216)>100,100,\nFORECAST($C201,I$205:I$216,$C$205:$C$216))))","v":98.069339994921904},null,null,null,{"$f":"IF(MAX(C205:C216)-MIN(C205:C216)<5,AVERAGEIF(C205:C216,\">0\",M205:M216),\nIF(FORECAST($C201,M$205:M$216,$C$205:$C$216)<0,0,\nIF(FORECAST($C201,M$205:M$216,$C$205:$C$216)>100,100,\nFORECAST($C201,M$205:M$216,$C$205:$C$216))))","v":0},{"$f":"IF(MAX(C205:C216)-MIN(C205:C216)<5,AVERAGEIF(C205:C216,\">0\",N205:N216),\nIF(FORECAST($C201,N$205:N$216,$C$205:$C$216)<0,0,\nIF(FORECAST($C201,N$205:N$216,$C$205:$C$216)>100,100,\nFORECAST($C201,N$205:N$216,$C$205:$C$216))))","v":99.371660431412579},null,null,null,{"$f":"IF(MAX(C205:C216)-MIN(C205:C216)<5,AVERAGEIF(C205:C216,\">0\",R205:R216),\nIF(FORECAST($C201,R$205:R$216,$C$205:$C$216)<0,0,\nIF(FORECAST($C201,R$205:R$216,$C$205:$C$216)>100,100,\nFORECAST($C201,R$205:R$216,$C$205:$C$216))))","v":0},{"$f":"IF(MAX(C205:C216)-MIN(C205:C216)<5,AVERAGEIF(C205:C216,\">0\",S205:S216),\nIF(FORECAST($C201,S$205:S$216,$C$205:$C$216)<0,0,\nIF(FORECAST($C201,S$205:S$216,$C$205:$C$216)>100,100,\nFORECAST($C201,S$205:S$216,$C$205:$C$216))))","v":99.094634478659572},null,null,null,{"$f":"IF(MAX(C205:C216)-MIN(C205:C216)<5,AVERAGEIF(C205:C216,\">0\",W205:W216),\nIF(FORECAST($C201,W$205:W$216,$C$205:$C$216)<0,0,\nIF(FORECAST($C201,W$205:W$216,$C$205:$C$216)>100,100,\nFORECAST($C201,W$205:W$216,$C$205:$C$216))))","v":0},{"$f":"IF(MAX(C205:C216)-MIN(C205:C216)<5,AVERAGEIF(C205:C216,\">0\",X205:X216),\nIF(FORECAST($C201,X$205:X$216,$C$205:$C$216)<0,0,\nIF(FORECAST($C201,X$205:X$216,$C$205:$C$216)>100,100,\nFORECAST($C201,X$205:X$216,$C$205:$C$216))))","v":99.205655326062185},null,null,null,{"$f":"IF(MAX(C205:C216)-MIN(C205:C216)<5,AVERAGEIF(C205:C216,\">0\",AB205:AB216),\nIF(FORECAST($C201,AB$205:AB$216,$C$205:$C$216)<0,0,\nIF(FORECAST($C201,AB$205:AB$216,$C$205:$C$216)>100,100,\nFORECAST($C201,AB$205:AB$216,$C$205:$C$216))))","v":0}]
[null,null,{"$f":"MaxRegYear(C200,C205:C216)","v":2014},{"$f":"IF(MAX(C205:C216)-MIN(C205:C216)<5,AVERAGEIF(C205:C216,\">0\",D205:D216),\nIF(FORECAST($C202,D$205:D$216,$C$205:$C$216)<0,0,\nIF(FORECAST($C202,D$205:D$216,$C$205:$C$216)>100,100,\nFORECAST($C202,D$205:D$216,$C$205:$C$216))))","v":88.891475637210078},null,null,null,{"$f":"IF(MAX(C205:C216)-MIN(C205:C216)<5,AVERAGEIF(C205:C216,\">0\",H205:H216),\nIF(FORECAST($C202,H$205:H$216,$C$205:$C$216)<0,0,\nIF(FORECAST($C202,H$205:H$216,$C$205:$C$216)>100,100,\nFORECAST($C202,H$205:H$216,$C$205:$C$216))))","v":0},{"$f":"IF(MAX(C205:C216)-MIN(C205:C216)<5,AVERAGEIF(C205:C216,\">0\",I205:I216),\nIF(FORECAST($C202,I$205:I$216,$C$205:$C$216)<0,0,\nIF(FORECAST($C202,I$205:I$216,$C$205:$C$216)>100,100,\nFORECAST($C202,I$205:I$216,$C$205:$C$216))))","v":95.87022435380976},null,null,null,{"$f":"IF(MAX(C205:C216)-MIN(C205:C216)<5,AVERAGEIF(C205:C216,\">0\",M205:M216),\nIF(FORECAST($C202,M$205:M$216,$C$205:$C$216)<0,0,\nIF(FORECAST($C202,M$205:M$216,$C$205:$C$216)>100,100,\nFORECAST($C202,M$205:M$216,$C$205:$C$216))))","v":0},{"$f":"IF(MAX(C205:C216)-MIN(C205:C216)<5,AVERAGEIF(C205:C216,\">0\",N205:N216),\nIF(FORECAST($C202,N$205:N$216,$C$205:$C$216)<0,0,\nIF(FORECAST($C202,N$205:N$216,$C$205:$C$216)>100,100,\nFORECAST($C202,N$205:N$216,$C$205:$C$216))))","v":96.456973908290706},null,null,null,{"$f":"IF(MAX(C205:C216)-MIN(C205:C216)<5,AVERAGEIF(C205:C216,\">0\",R205:R216),\nIF(FORECAST($C202,R$205:R$216,$C$205:$C$216)<0,0,\nIF(FORECAST($C202,R$205:R$216,$C$205:$C$216)>100,100,\nFORECAST($C202,R$205:R$216,$C$205:$C$216))))","v":0},{"$f":"IF(MAX(C205:C216)-MIN(C205:C216)<5,AVERAGEIF(C205:C216,\">0\",S205:S216),\nIF(FORECAST($C202,S$205:S$216,$C$205:$C$216)<0,0,\nIF(FORECAST($C202,S$205:S$216,$C$205:$C$216)>100,100,\nFORECAST($C202,S$205:S$216,$C$205:$C$216))))","v":98.151023937714541},null,null,null,{"$f":"IF(MAX(C205:C216)-MIN(C205:C216)<5,AVERAGEIF(C205:C216,\">0\",W205:W216),\nIF(FORECAST($C202,W$205:W$216,$C$205:$C$216)<0,0,\nIF(FORECAST($C202,W$205:W$216,$C$205:$C$216)>100,100,\nFORECAST($C202,W$205:W$216,$C$205:$C$216))))","v":0},{"$f":"IF(MAX(C205:C216)-MIN(C205:C216)<5,AVERAGEIF(C205:C216,\">0\",X205:X216),\nIF(FORECAST($C202,X$205:X$216,$C$205:$C$216)<0,0,\nIF(FORECAST($C202,X$205:X$216,$C$205:$C$216)>100,100,\nFORECAST($C202,X$205:X$216,$C$205:$C$216))))","v":99.363166093239599},null,null,null,{"$f":"IF(MAX(C205:C216)-MIN(C205:C216)<5,AVERAGEIF(C205:C216,\">0\",AB205:AB216),\nIF(FORECAST($C202,AB$205:AB$216,$C$205:$C$216)<0,0,\nIF(FORECAST($C202,AB$205:AB$216,$C$205:$C$216)>100,100,\nFORECAST($C202,AB$205:AB$216,$C$205:$C$216))))","v":0}]
[]
[null,"Survey","Year","Improved","Basic",null,null,"Surface water","Improved","Basic",null,null,"Surface water","Improved","Basic",null,null,"Surface water","Improved","Basic",null,null,"Surface water","Improved","Basic",null,null,"Surface water"]
[null,"MICS00",2000,{"$f":"IF(ISERROR(INDIRECT(CONCATENATE($B205,\"!H16\"))),\"\",INDIRECT(CONCATENATE($B205,\"!H16\")))","v":95.687111040748704},{"$f":"IF(ISERROR(INDIRECT(CONCATENATE($B205,\"!H23\"))),\"\",INDIRECT(CONCATENATE($B205,\"!H23\")))","v":98.147685275329337},null,null,{"$f":"IF(ISERROR(INDIRECT(CONCATENATE($B205,\"!H21\"))),\"\",INDIRECT(CONCATENATE($B205,\"!H21\")))","v":0},{"$f":"IF(ISERROR(INDIRECT(CONCATENATE($B205,\"!I16\"))),\"\",INDIRECT(CONCATENATE($B205,\"!I16\")))","v":97.531202771365841},{"$f":"IF(ISERROR(INDIRECT(CONCATENATE($B205,\"!I23\"))),\"\",INDIRECT(CONCATENATE($B205,\"!I23\")))","v":97.999823715957106},null,null,{"$f":"IF(ISERROR(INDIRECT(CONCATENATE($B205,\"!I21\"))),\"\",INDIRECT(CONCATENATE($B205,\"!I21\")))","v":0},{"$f":"IF(ISERROR(INDIRECT(CONCATENATE($B205,\"!J16\"))),\"\",INDIRECT(CONCATENATE($B205,\"!J16\")))","v":98.568959655181189},{"$f":"IF(ISERROR(INDIRECT(CONCATENATE($B205,\"!J23\"))),\"\",INDIRECT(CONCATENATE($B205,\"!J23\")))","v":98.934479208693872},null,null,{"$f":"IF(ISERROR(INDIRECT(CONCATENATE($B205,\"!J21\"))),\"\",INDIRECT(CONCATENATE($B205,\"!J21\")))","v":0},{"$f":"IF(ISERROR(INDIRECT(CONCATENATE($B205,\"!K16\"))),\"\",INDIRECT(CONCATENATE($B205,\"!K16\")))","v":98.694478857670219},{"$f":"IF(ISERROR(INDIRECT(CONCATENATE($B205,\"!K23\"))),\"\",INDIRECT(CONCATENATE($B205,\"!K23\")))","v":98.522708130826558},null,null,{"$f":"IF(ISERROR(INDIRECT(CONCATENATE($B205,\"!K21\"))),\"\",INDIRECT(CONCATENATE($B205,\"!K21\")))","v":0},{"$f":"IF(ISERROR(INDIRECT(CONCATENATE($B205,\"!L16\"))),\"\",INDIRECT(CONCATENATE($B205,\"!L16\")))","v":99.148724948962226},{"$f":"IF(ISERROR(INDIRECT(CONCATENATE($B205,\"!L23\"))),\"\",INDIRECT(CONCATENATE($B205,\"!L23\")))","v":99.909289748347462},null,null,{"$f":"IF(ISERROR(INDIRECT(CONCATENATE($B205,\"!L221\"))),\"\",INDIRECT(CONCATENATE($B205,\"!L21\")))","v":0}]
[null,"DHS05",2005,95.167006262919372,"N/A",null,null,0,98.206462506335058,"N/A",null,null,0,99.706759432408617,"N/A",null,null,0,99.443611778589514,"N/A",null,null,0,99.359504103654047,"N/A",null,null,0]
[null,"MICS12",2012,89.4,98.2,null,null,0,95.8,98.7,null,null,0,96.3,98.5,null,null,0,98,98.7,null,null,0,99.3,98.7,null,null,0]
[null,null,null,"","",null,null,"","","",null,null,"","","",null,null,"","","",null,null,"","","",null,null,""]
[null,null,null,"","",null,null,"","","",null,null,"","","",null,null,"","","",null,null,"","","",null,null,""]
[null,null,null,"","",null,null,"","","",null,null,"","","",null,null,"","","",null,null,"","","",null,null,""]
[null,null,null,"","",null,null,"","","",null,null,"","","",null,null,"","","",null,null,"","","",null,null,""]
[null,null,null,"","",null,null,"","","",null,null,"","","",null,null,"","","",null,null,"","","",null,null,""]
[null,null,null,"","",null,null,"","","",null,null,"","","",null,null,"","","",null,null,"","","",null,null,""]
[null,null,null,"","",null,null,"","","",null,null,"","","",null,null,"","","",null,null,"","","",null,null,""]
[null,null,null,"","",null,null,"","","",null,null,"","","",null,null,"","","",null,null,"","","",null,null,""]
[null,null,null,"","",null,null,"","","",null,null,"","","",null,null,"","","",null,null,"","","",null,null,""]
[]
[null,{"$f":"CONCATENATE(\"Urban use of drinking water sources,  \",C199,\"–\",C200)","v":"Urban use of drinking water sources,  2000–2018"},null,null,null,null,null,null,null,null,null,null,null,null,null,null,null,null,"Data points used for regression"]
[]
[]
[]
[]
[]
[]
[]
[]
[]
[]
[]
[]
[]
[]
[]
[]
[]
[]
[]
[]
[]
[]
[]
[]
[]
[]
[]
[]
[]
[]
[]
[]
[]
[]
[null,null,null,null,{"$f":"IF(ISERROR(INDIRECT(CONCATENATE($B253,\"!M18\"))),\"\",INDIRECT(CONCATENATE($B253,\"!M18\")))","v":""},{"$f":"IF(ISERROR(INDIRECT(CONCATENATE($B253,\"!M19\"))),\"\",INDIRECT(CONCATENATE($B253,\"!M19\")))","v":""},{"$f":"IF(ISERROR(INDIRECT(CONCATENATE($B253,\"!M20\"))),\"\",INDIRECT(CONCATENATE($B253,\"!M20\")))","v":""},{"$f":"IF(ISERROR(INDIRECT(CONCATENATE($B253,\"!M21\"))),\"\",INDIRECT(CONCATENATE($B253,\"!M21\")))","v":""},null,{"$f":"IF(ISERROR(INDIRECT(CONCATENATE($B253,\"!N18\"))),\"\",INDIRECT(CONCATENATE($B253,\"!N18\")))","v":""},{"$f":"IF(ISERROR(INDIRECT(CONCATENATE($B253,\"!N19\"))),\"\",INDIRECT(CONCATENATE($B253,\"!N19\")))","v":""},{"$f":"IF(ISERROR(INDIRECT(CONCATENATE($B253,\"!N20\"))),\"\",INDIRECT(CONCATENATE($B253,\"!N20\")))","v":""},{"$f":"IF(ISERROR(INDIRECT(CONCATENATE($B253,\"!N21\"))),\"\",INDIRECT(CONCATENATE($B253,\"!N21\")))","v":""},null,{"$f":"IF(ISERROR(INDIRECT(CONCATENATE($B253,\"!O18\"))),\"\",INDIRECT(CONCATENATE($B253,\"!O18\")))","v":""},{"$f":"IF(ISERROR(INDIRECT(CONCATENATE($B253,\"!O19\"))),\"\",INDIRECT(CONCATENATE($B253,\"!O19\")))","v":""},{"$f":"IF(ISERROR(INDIRECT(CONCATENATE($B253,\"!O20\"))),\"\",INDIRECT(CONCATENATE($B253,\"!O20\")))","v":""},{"$f":"IF(ISERROR(INDIRECT(CONCATENATE($B253,\"!O21\"))),\"\",INDIRECT(CONCATENATE($B253,\"!O21\")))","v":""},null,{"$f":"IF(ISERROR(INDIRECT(CONCATENATE($B253,\"!P18\"))),\"\",INDIRECT(CONCATENATE($B253,\"!P18\")))","v":""},{"$f":"IF(ISERROR(INDIRECT(CONCATENATE($B253,\"!P19\"))),\"\",INDIRECT(CONCATENATE($B253,\"!P19\")))","v":""},{"$f":"IF(ISERROR(INDIRECT(CONCATENATE($B253,\"!P20\"))),\"\",INDIRECT(CONCATENATE($B253,\"!P20\")))","v":""},{"$f":"IF(ISERROR(INDIRECT(CONCATENATE($B253,\"!P21\"))),\"\",INDIRECT(CONCATENATE($B253,\"!P21\")))","v":""},null,{"$f":"IF(ISERROR(INDIRECT(CONCATENATE($B253,\"!Q18\"))),\"\",INDIRECT(CONCATENATE($B253,\"!Q18\")))","v":""},{"$f":"IF(ISERROR(INDIRECT(CONCATENATE($B253,\"!Q19\"))),\"\",INDIRECT(CONCATENATE($B253,\"!Q19\")))","v":""},{"$f":"IF(ISERROR(INDIRECT(CONCATENATE($B253,\"!Q20\"))),\"\",INDIRECT(CONCATENATE($B253,\"!Q20\")))","v":""},{"$f":"IF(ISERROR(INDIRECT(CONCATENATE($B253,\"!Q21\"))),\"\",INDIRECT(CONCATENATE($B253,\"!Q1\")))","v":""}]
[null,null,null,null,{"$f":"IF(ISERROR(INDIRECT(CONCATENATE($B254,\"!M18\"))),\"\",INDIRECT(CONCATENATE($B254,\"!M18\")))","v":""},{"$f":"IF(ISERROR(INDIRECT(CONCATENATE($B254,\"!M19\"))),\"\",INDIRECT(CONCATENATE($B254,\"!M19\")))","v":""},{"$f":"IF(ISERROR(INDIRECT(CONCATENATE($B254,\"!M20\"))),\"\",INDIRECT(CONCATENATE($B254,\"!M20\")))","v":""},{"$f":"IF(ISERROR(INDIRECT(CONCATENATE($B254,\"!M21\"))),\"\",INDIRECT(CONCATENATE($B254,\"!M21\")))","v":""},null,{"$f":"IF(ISERROR(INDIRECT(CONCATENATE($B254,\"!N18\"))),\"\",INDIRECT(CONCATENATE($B254,\"!N18\")))","v":""},{"$f":"IF(ISERROR(INDIRECT(CONCATENATE($B254,\"!N19\"))),\"\",INDIRECT(CONCATENATE($B254,\"!N19\")))","v":""},{"$f":"IF(ISERROR(INDIRECT(CONCATENATE($B254,\"!N20\"))),\"\",INDIRECT(CONCATENATE($B254,\"!N20\")))","v":""},{"$f":"IF(ISERROR(INDIRECT(CONCATENATE($B254,\"!N21\"))),\"\",INDIRECT(CONCATENATE($B254,\"!N21\")))","v":""},null,{"$f":"IF(ISERROR(INDIRECT(CONCATENATE($B254,\"!O18\"))),\"\",INDIRECT(CONCATENATE($B254,\"!O18\")))","v":""},{"$f":"IF(ISERROR(INDIRECT(CONCATENATE($B254,\"!O19\"))),\"\",INDIRECT(CONCATENATE($B254,\"!O19\")))","v":""},{"$f":"IF(ISERROR(INDIRECT(CONCATENATE($B254,\"!O20\"))),\"\",INDIRECT(CONCATENATE($B254,\"!O20\")))","v":""},{"$f":"IF(ISERROR(INDIRECT(CONCATENATE($B254,\"!O21\"))),\"\",INDIRECT(CONCATENATE($B254,\"!O21\")))","v":""},null,{"$f":"IF(ISERROR(INDIRECT(CONCATENATE($B254,\"!P18\"))),\"\",INDIRECT(CONCATENATE($B254,\"!P18\")))","v":""},{"$f":"IF(ISERROR(INDIRECT(CONCATENATE($B254,\"!P19\"))),\"\",INDIRECT(CONCATENATE($B254,\"!P19\")))","v":""},{"$f":"IF(ISERROR(INDIRECT(CONCATENATE($B254,\"!P20\"))),\"\",INDIRECT(CONCATENATE($B254,\"!P20\")))","v":""},{"$f":"IF(ISERROR(INDIRECT(CONCATENATE($B254,\"!P21\"))),\"\",INDIRECT(CONCATENATE($B254,\"!P21\")))","v":""},null,{"$f":"IF(ISERROR(INDIRECT(CONCATENATE($B254,\"!Q18\"))),\"\",INDIRECT(CONCATENATE($B254,\"!Q18\")))","v":""},{"$f":"IF(ISERROR(INDIRECT(CONCATENATE($B254,\"!Q19\"))),\"\",INDIRECT(CONCATENATE($B254,\"!Q19\")))","v":""},{"$f":"IF(ISERROR(INDIRECT(CONCATENATE($B254,\"!Q20\"))),\"\",INDIRECT(CONCATENATE($B254,\"!Q20\")))","v":""},{"$f":"IF(ISERROR(INDIRECT(CONCATENATE($B254,\"!Q21\"))),\"\",INDIRECT(CONCATENATE($B254,\"!Q1\")))","v":""}]
[null,null,null,null,{"$f":"IF(ISERROR(INDIRECT(CONCATENATE($B255,\"!M18\"))),\"\",INDIRECT(CONCATENATE($B255,\"!M18\")))","v":""},{"$f":"IF(ISERROR(INDIRECT(CONCATENATE($B255,\"!M19\"))),\"\",INDIRECT(CONCATENATE($B255,\"!M19\")))","v":""},{"$f":"IF(ISERROR(INDIRECT(CONCATENATE($B255,\"!M20\"))),\"\",INDIRECT(CONCATENATE($B255,\"!M20\")))","v":""},{"$f":"IF(ISERROR(INDIRECT(CONCATENATE($B255,\"!M21\"))),\"\",INDIRECT(CONCATENATE($B255,\"!M21\")))","v":""},null,{"$f":"IF(ISERROR(INDIRECT(CONCATENATE($B255,\"!N18\"))),\"\",INDIRECT(CONCATENATE($B255,\"!N18\")))","v":""},{"$f":"IF(ISERROR(INDIRECT(CONCATENATE($B255,\"!N19\"))),\"\",INDIRECT(CONCATENATE($B255,\"!N19\")))","v":""},{"$f":"IF(ISERROR(INDIRECT(CONCATENATE($B255,\"!N20\"))),\"\",INDIRECT(CONCATENATE($B255,\"!N20\")))","v":""},{"$f":"IF(ISERROR(INDIRECT(CONCATENATE($B255,\"!N21\"))),\"\",INDIRECT(CONCATENATE($B255,\"!N21\")))","v":""},null,{"$f":"IF(ISERROR(INDIRECT(CONCATENATE($B255,\"!O18\"))),\"\",INDIRECT(CONCATENATE($B255,\"!O18\")))","v":""},{"$f":"IF(ISERROR(INDIRECT(CONCATENATE($B255,\"!O19\"))),\"\",INDIRECT(CONCATENATE($B255,\"!O19\")))","v":""},{"$f":"IF(ISERROR(INDIRECT(CONCATENATE($B255,\"!O20\"))),\"\",INDIRECT(CONCATENATE($B255,\"!O20\")))","v":""},{"$f":"IF(ISERROR(INDIRECT(CONCATENATE($B255,\"!O21\"))),\"\",INDIRECT(CONCATENATE($B255,\"!O21\")))","v":""},null,{"$f":"IF(ISERROR(INDIRECT(CONCATENATE($B255,\"!P18\"))),\"\",INDIRECT(CONCATENATE($B255,\"!P18\")))","v":""},{"$f":"IF(ISERROR(INDIRECT(CONCATENATE($B255,\"!P19\"))),\"\",INDIRECT(CONCATENATE($B255,\"!P19\")))","v":""},{"$f":"IF(ISERROR(INDIRECT(CONCATENATE($B255,\"!P20\"))),\"\",INDIRECT(CONCATENATE($B255,\"!P20\")))","v":""},{"$f":"IF(ISERROR(INDIRECT(CONCATENATE($B255,\"!P21\"))),\"\",INDIRECT(CONCATENATE($B255,\"!P21\")))","v":""},null,{"$f":"IF(ISERROR(INDIRECT(CONCATENATE($B255,\"!Q18\"))),\"\",INDIRECT(CONCATENATE($B255,\"!Q18\")))","v":""},{"$f":"IF(ISERROR(INDIRECT(CONCATENATE($B255,\"!Q19\"))),\"\",INDIRECT(CONCATENATE($B255,\"!Q19\")))","v":""},{"$f":"IF(ISERROR(INDIRECT(CONCATENATE($B255,\"!Q20\"))),\"\",INDIRECT(CONCATENATE($B255,\"!Q20\")))","v":""},{"$f":"IF(ISERROR(INDIRECT(CONCATENATE($B255,\"!Q21\"))),\"\",INDIRECT(CONCATENATE($B255,\"!Q1\")))","v":""}]
[null,null,null,null,{"$f":"IF(ISERROR(INDIRECT(CONCATENATE($B256,\"!M18\"))),\"\",INDIRECT(CONCATENATE($B256,\"!M18\")))","v":""},{"$f":"IF(ISERROR(INDIRECT(CONCATENATE($B256,\"!M19\"))),\"\",INDIRECT(CONCATENATE($B256,\"!M19\")))","v":""},{"$f":"IF(ISERROR(INDIRECT(CONCATENATE($B256,\"!M20\"))),\"\",INDIRECT(CONCATENATE($B256,\"!M20\")))","v":""},{"$f":"IF(ISERROR(INDIRECT(CONCATENATE($B256,\"!M21\"))),\"\",INDIRECT(CONCATENATE($B256,\"!M21\")))","v":""},null,{"$f":"IF(ISERROR(INDIRECT(CONCATENATE($B256,\"!N18\"))),\"\",INDIRECT(CONCATENATE($B256,\"!N18\")))","v":""},{"$f":"IF(ISERROR(INDIRECT(CONCATENATE($B256,\"!N19\"))),\"\",INDIRECT(CONCATENATE($B256,\"!N19\")))","v":""},{"$f":"IF(ISERROR(INDIRECT(CONCATENATE($B256,\"!N20\"))),\"\",INDIRECT(CONCATENATE($B256,\"!N20\")))","v":""},{"$f":"IF(ISERROR(INDIRECT(CONCATENATE($B256,\"!N21\"))),\"\",INDIRECT(CONCATENATE($B256,\"!N21\")))","v":""},null,{"$f":"IF(ISERROR(INDIRECT(CONCATENATE($B256,\"!O18\"))),\"\",INDIRECT(CONCATENATE($B256,\"!O18\")))","v":""},{"$f":"IF(ISERROR(INDIRECT(CONCATENATE($B256,\"!O19\"))),\"\",INDIRECT(CONCATENATE($B256,\"!O19\")))","v":""},{"$f":"IF(ISERROR(INDIRECT(CONCATENATE($B256,\"!O20\"))),\"\",INDIRECT(CONCATENATE($B256,\"!O20\")))","v":""},{"$f":"IF(ISERROR(INDIRECT(CONCATENATE($B256,\"!O21\"))),\"\",INDIRECT(CONCATENATE($B256,\"!O21\")))","v":""},null,{"$f":"IF(ISERROR(INDIRECT(CONCATENATE($B256,\"!P18\"))),\"\",INDIRECT(CONCATENATE($B256,\"!P18\")))","v":""},{"$f":"IF(ISERROR(INDIRECT(CONCATENATE($B256,\"!P19\"))),\"\",INDIRECT(CONCATENATE($B256,\"!P19\")))","v":""},{"$f":"IF(ISERROR(INDIRECT(CONCATENATE($B256,\"!P20\"))),\"\",INDIRECT(CONCATENATE($B256,\"!P20\")))","v":""},{"$f":"IF(ISERROR(INDIRECT(CONCATENATE($B256,\"!P21\"))),\"\",INDIRECT(CONCATENATE($B256,\"!P21\")))","v":""},null,{"$f":"IF(ISERROR(INDIRECT(CONCATENATE($B256,\"!Q18\"))),\"\",INDIRECT(CONCATENATE($B256,\"!Q18\")))","v":""},{"$f":"IF(ISERROR(INDIRECT(CONCATENATE($B256,\"!Q19\"))),\"\",INDIRECT(CONCATENATE($B256,\"!Q19\")))","v":""},{"$f":"IF(ISERROR(INDIRECT(CONCATENATE($B256,\"!Q20\"))),\"\",INDIRECT(CONCATENATE($B256,\"!Q20\")))","v":""},{"$f":"IF(ISERROR(INDIRECT(CONCATENATE($B256,\"!Q21\"))),\"\",INDIRECT(CONCATENATE($B256,\"!Q1\")))","v":""}]
[null,null,null,null,{"$f":"IF(ISERROR(INDIRECT(CONCATENATE($B257,\"!M18\"))),\"\",INDIRECT(CONCATENATE($B257,\"!M18\")))","v":""},{"$f":"IF(ISERROR(INDIRECT(CONCATENATE($B257,\"!M19\"))),\"\",INDIRECT(CONCATENATE($B257,\"!M19\")))","v":""},{"$f":"IF(ISERROR(INDIRECT(CONCATENATE($B257,\"!M20\"))),\"\",INDIRECT(CONCATENATE($B257,\"!M20\")))","v":""},{"$f":"IF(ISERROR(INDIRECT(CONCATENATE($B257,\"!M21\"))),\"\",INDIRECT(CONCATENATE($B257,\"!M21\")))","v":""},null,{"$f":"IF(ISERROR(INDIRECT(CONCATENATE($B257,\"!N18\"))),\"\",INDIRECT(CONCATENATE($B257,\"!N18\")))","v":""},{"$f":"IF(ISERROR(INDIRECT(CONCATENATE($B257,\"!N19\"))),\"\",INDIRECT(CONCATENATE($B257,\"!N19\")))","v":""},{"$f":"IF(ISERROR(INDIRECT(CONCATENATE($B257,\"!N20\"))),\"\",INDIRECT(CONCATENATE($B257,\"!N20\")))","v":""},{"$f":"IF(ISERROR(INDIRECT(CONCATENATE($B257,\"!N21\"))),\"\",INDIRECT(CONCATENATE($B257,\"!N21\")))","v":""},null,{"$f":"IF(ISERROR(INDIRECT(CONCATENATE($B257,\"!O18\"))),\"\",INDIRECT(CONCATENATE($B257,\"!O18\")))","v":""},{"$f":"IF(ISERROR(INDIRECT(CONCATENATE($B257,\"!O19\"))),\"\",INDIRECT(CONCATENATE($B257,\"!O19\")))","v":""},{"$f":"IF(ISERROR(INDIRECT(CONCATENATE($B257,\"!O20\"))),\"\",INDIRECT(CONCATENATE($B257,\"!O20\")))","v":""},{"$f":"IF(ISERROR(INDIRECT(CONCATENATE($B257,\"!O21\"))),\"\",INDIRECT(CONCATENATE($B257,\"!O21\")))","v":""},null,{"$f":"IF(ISERROR(INDIRECT(CONCATENATE($B257,\"!P18\"))),\"\",INDIRECT(CONCATENATE($B257,\"!P18\")))","v":""},{"$f":"IF(ISERROR(INDIRECT(CONCATENATE($B257,\"!P19\"))),\"\",INDIRECT(CONCATENATE($B257,\"!P19\")))","v":""},{"$f":"IF(ISERROR(INDIRECT(CONCATENATE($B257,\"!P20\"))),\"\",INDIRECT(CONCATENATE($B257,\"!P20\")))","v":""},{"$f":"IF(ISERROR(INDIRECT(CONCATENATE($B257,\"!P21\"))),\"\",INDIRECT(CONCATENATE($B257,\"!P21\")))","v":""},null,{"$f":"IF(ISERROR(INDIRECT(CONCATENATE($B257,\"!Q18\"))),\"\",INDIRECT(CONCATENATE($B257,\"!Q18\")))","v":""},{"$f":"IF(ISERROR(INDIRECT(CONCATENATE($B257,\"!Q19\"))),\"\",INDIRECT(CONCATENATE($B257,\"!Q19\")))","v":""},{"$f":"IF(ISERROR(INDIRECT(CONCATENATE($B257,\"!Q20\"))),\"\",INDIRECT(CONCATENATE($B257,\"!Q20\")))","v":""},{"$f":"IF(ISERROR(INDIRECT(CONCATENATE($B257,\"!Q21\"))),\"\",INDIRECT(CONCATENATE($B257,\"!Q1\")))","v":""}]
[]
[]
[]
[]
[]
[]
[]
[]
[]
[]
[]
[]
[]
[]
[]
[]
[]
[]
[]
[]
[]
[]
[]
[]
[]
[]
[]
[]
[]
[]
[]
[]
[]
[]
[]
[]
[]
[]
[]
["RURAL",null,null,"Poorest",null,null,null,null,"Poor",null,null,null,null,"Middle",null,null,null,null,"Rich",null,null,null,null,"Richest"]
[null,null,null,"Improved","Basic","Limited","Unimproved","Surface water","Improved","Basic","Limited","Unimproved","Surface water","Improved","Basic","Limited","Unimproved","Surface water","Improved","Basic","Limited","Unimproved","Surface water","Improved","Basic","Limited","Unimproved","Surface water"]
["Forecast period:",null,2000,{"$f":"IF((D301+H301)>100,D301*100/(D301+H301),D301)","v":85.873676693938705},{"$f":"D299*AVERAGEIF(E305:E316,\">0\")/100","v":83.428041738592896},{"$f":"D299*(100-AVERAGEIF(E305:E316,\">0\"))/100","v":2.4456349553458181},{"$f":"100-(E299+F299+H299)","v":14.126323306061281},{"$f":"IF((D301+H301)>100,H301*100/(D301+H301),H301)","v":0},{"$f":"IF((I301+M301)>100,I301*100/(I301+M301),I301)","v":91.255992058138872},{"$f":"I299*AVERAGEIF(J305:J316,\">0\")/100","v":89.173828316759227},{"$f":"I299*(100-AVERAGEIF(J305:J316,\">0\"))/100","v":2.0821637413796399},{"$f":"100-(J299+K299+M299)","v":8.7440079418611276},{"$f":"IF((I301+M301)>100,M301*100/(I301+M301),M301)","v":0},{"$f":"IF((N301+R301)>100,N301*100/(N301+R301),N301)","v":92.862922249477151},{"$f":"N299*AVERAGEIF(O305:O316,\">0\")/100","v":91.350475466340328},{"$f":"N299*(100-AVERAGEIF(O305:O316,\">0\"))/100","v":1.512446783136828},{"$f":"100-(O299+P299+R299)","v":7.1370777505228489},{"$f":"IF((N301+R301)>100,R301*100/(N301+R301),R301)","v":0},{"$f":"IF((S301+W301)>100,S301*100/(S301+W301),S301)","v":92.476497316964924},{"$f":"S299*AVERAGEIF(T305:T316,\">0\")/100","v":90.910375101302691},{"$f":"S299*(100-AVERAGEIF(T305:T316,\">0\"))/100","v":1.5661222156622279},{"$f":"100-(T299+U299+W299)","v":7.4662736394963218},{"$f":"IF((S301+W301)>100,W301*100/(S301+W301),W301)","v":5.7229043538757907E-2},{"$f":"IF((X301+AB301)>100,X301*100/(X301+AB301),X301)","v":94.357525599607868},{"$f":"X299*AVERAGEIF(Y305:Y316,\">0\")/100","v":93.496982915844086},{"$f":"X299*(100-AVERAGEIF(Y305:Y316,\">0\"))/100","v":0.86054268376378418},{"$f":"100-(Y299+Z299+AB299)","v":5.6424744003921319},{"$f":"IF((X301+AB301)>100,AB301*100/(X301+AB301),AB301)","v":0}]
[null,null,2018,{"$f":"IF((D302+H302)>100,D302*100/(D302+H302),D302)","v":70.860405803581216},{"$f":"D300*AVERAGEIF(E305:E316,\">0\")/100","v":68.842340523799621},{"$f":"D300*(100-AVERAGEIF(E305:E316,\">0\"))/100","v":2.0180652797815979},{"$f":"100-(E300+F300+H300)","v":29.139594196418784},{"$f":"IF((D302+H302)>100,H302*100/(D302+H302),H302)","v":0},{"$f":"IF((I302+M302)>100,I302*100/(I302+M302),I302)","v":77.102000236948925},{"$f":"I300*AVERAGEIF(J305:J316,\">0\")/100","v":75.342784368921969},{"$f":"I300*(100-AVERAGEIF(J305:J316,\">0\"))/100","v":1.7592158680269525},{"$f":"100-(J300+K300+M300)","v":22.897999763051075},{"$f":"IF((I302+M302)>100,M302*100/(I302+M302),M302)","v":0},{"$f":"IF((N302+R302)>100,N302*100/(N302+R302),N302)","v":81.019332212458721},{"$f":"N300*AVERAGEIF(O305:O316,\">0\")/100","v":79.699780496786573},{"$f":"N300*(100-AVERAGEIF(O305:O316,\">0\"))/100","v":1.3195517156721517},{"$f":"100-(O300+P300+R300)","v":18.980667787541279},{"$f":"IF((N302+R302)>100,R302*100/(N302+R302),R302)","v":0},{"$f":"IF((S302+W302)>100,S302*100/(S302+W302),S302)","v":85.970676889435708},{"$f":"S300*AVERAGEIF(T305:T316,\">0\")/100","v":84.514733045557392},{"$f":"S300*(100-AVERAGEIF(T305:T316,\">0\"))/100","v":1.4559438438783143},{"$f":"100-(T300+U300+W300)","v":14.029323110564292},{"$f":"IF((S302+W302)>100,W302*100/(S302+W302),W302)","v":0},{"$f":"IF((X302+AB302)>100,X302*100/(X302+AB302),X302)","v":91.137214688085294},{"$f":"X300*AVERAGEIF(Y305:Y316,\">0\")/100","v":90.306041309808748},{"$f":"X300*(100-AVERAGEIF(Y305:Y316,\">0\"))/100","v":0.83117337827653914},{"$f":"100-(Y300+Z300+AB300)","v":8.8627853119147062},{"$f":"IF((X302+AB302)>100,AB302*100/(X302+AB302),AB302)","v":0}]
["Regression period:",null,{"$f":"MinRegYear(C299,C305:C316)","v":2000},{"$f":"IF(MAX(C305:C316)-MIN(C305:C316)<5,AVERAGEIF(C305:C316,\">0\",D305:D316),\nIF(FORECAST($C301,D$305:D$316,$C$305:$C$316)<0,0,\nIF(FORECAST($C301,D$305:D$316,$C$305:$C$316)>100,100,\nFORECAST($C301,D$305:D$316,$C$305:$C$316))))","v":85.873676693938705},null,null,null,{"$f":"IF(MAX(C305:C316)-MIN(C305:C316)<5,AVERAGEIF(C305:C316,\">0\",H305:H316),\nIF(FORECAST($C301,H$305:H$316,$C$305:$C$316)<0,0,\nIF(FORECAST($C301,H$305:H$316,$C$305:$C$316)>100,100,\nFORECAST($C301,H$305:H$316,$C$305:$C$316))))","v":0},{"$f":"IF(MAX(C305:C316)-MIN(C305:C316)<5,AVERAGEIF(C305:C316,\">0\",I305:I316),\nIF(FORECAST($C301,I$305:I$316,$C$305:$C$316)<0,0,\nIF(FORECAST($C301,I$305:I$316,$C$305:$C$316)>100,100,\nFORECAST($C301,I$305:I$316,$C$305:$C$316))))","v":91.255992058138872},null,null,null,{"$f":"IF(MAX(C305:C316)-MIN(C305:C316)<5,AVERAGEIF(C305:C316,\">0\",M305:M316),\nIF(FORECAST($C301,M$305:M$316,$C$305:$C$316)<0,0,\nIF(FORECAST($C301,M$305:M$316,$C$305:$C$316)>100,100,\nFORECAST($C301,M$305:M$316,$C$305:$C$316))))","v":0},{"$f":"IF(MAX(C305:C316)-MIN(C305:C316)<5,AVERAGEIF(C305:C316,\">0\",N305:N316),\nIF(FORECAST($C301,N$305:N$316,$C$305:$C$316)<0,0,\nIF(FORECAST($C301,N$305:N$316,$C$305:$C$316)>100,100,\nFORECAST($C301,N$305:N$316,$C$305:$C$316))))","v":92.862922249477151},null,null,null,{"$f":"IF(MAX(C305:C316)-MIN(C305:C316)<5,AVERAGEIF(C305:C316,\">0\",R305:R316),\nIF(FORECAST($C301,R$305:R$316,$C$305:$C$316)<0,0,\nIF(FORECAST($C301,R$305:R$316,$C$305:$C$316)>100,100,\nFORECAST($C301,R$305:R$316,$C$305:$C$316))))","v":0},{"$f":"IF(MAX(C305:C316)-MIN(C305:C316)<5,AVERAGEIF(C305:C316,\">0\",S305:S316),\nIF(FORECAST($C301,S$305:S$316,$C$305:$C$316)<0,0,\nIF(FORECAST($C301,S$305:S$316,$C$305:$C$316)>100,100,\nFORECAST($C301,S$305:S$316,$C$305:$C$316))))","v":92.476497316964924},null,null,null,{"$f":"IF(MAX(C305:C316)-MIN(C305:C316)<5,AVERAGEIF(C305:C316,\">0\",W305:W316),\nIF(FORECAST($C301,W$305:W$316,$C$305:$C$316)<0,0,\nIF(FORECAST($C301,W$305:W$316,$C$305:$C$316)>100,100,\nFORECAST($C301,W$305:W$316,$C$305:$C$316))))","v":5.7229043538757907E-2},{"$f":"IF(MAX(C305:C316)-MIN(C305:C316)<5,AVERAGEIF(C305:C316,\">0\",X305:X316),\nIF(FORECAST($C301,X$305:X$316,$C$305:$C$316)<0,0,\nIF(FORECAST($C301,X$305:X$316,$C$305:$C$316)>100,100,\nFORECAST($C301,X$305:X$316,$C$305:$C$316))))","v":94.357525599607868},null,null,null,{"$f":"IF(MAX(C305:C316)-MIN(C305:C316)<5,AVERAGEIF(C305:C316,\">0\",AB305:AB316),\nIF(FORECAST($C301,AB$305:AB$316,$C$305:$C$316)<0,0,\nIF(FORECAST($C301,AB$305:AB$316,$C$305:$C$316)>100,100,\nFORECAST($C301,AB$305:AB$316,$C$305:$C$316))))","v":0}]
[null,null,{"$f":"MaxRegYear(C300,C305:C316)","v":2014},{"$f":"IF(MAX(C305:C316)-MIN(C305:C316)<5,AVERAGEIF(C305:C316,\">0\",D305:D316),\nIF(FORECAST($C302,D$305:D$316,$C$305:$C$316)<0,0,\nIF(FORECAST($C302,D$305:D$316,$C$305:$C$316)>100,100,\nFORECAST($C302,D$305:D$316,$C$305:$C$316))))","v":70.860405803581216},null,null,null,{"$f":"IF(MAX(C305:C316)-MIN(C305:C316)<5,AVERAGEIF(C305:C316,\">0\",H305:H316),\nIF(FORECAST($C302,H$305:H$316,$C$305:$C$316)<0,0,\nIF(FORECAST($C302,H$305:H$316,$C$305:$C$316)>100,100,\nFORECAST($C302,H$305:H$316,$C$305:$C$316))))","v":0},{"$f":"IF(MAX(C305:C316)-MIN(C305:C316)<5,AVERAGEIF(C305:C316,\">0\",I305:I316),\nIF(FORECAST($C302,I$305:I$316,$C$305:$C$316)<0,0,\nIF(FORECAST($C302,I$305:I$316,$C$305:$C$316)>100,100,\nFORECAST($C302,I$305:I$316,$C$305:$C$316))))","v":77.102000236948925},null,null,null,{"$f":"IF(MAX(C305:C316)-MIN(C305:C316)<5,AVERAGEIF(C305:C316,\">0\",M305:M316),\nIF(FORECAST($C302,M$305:M$316,$C$305:$C$316)<0,0,\nIF(FORECAST($C302,M$305:M$316,$C$305:$C$316)>100,100,\nFORECAST($C302,M$305:M$316,$C$305:$C$316))))","v":0},{"$f":"IF(MAX(C305:C316)-MIN(C305:C316)<5,AVERAGEIF(C305:C316,\">0\",N305:N316),\nIF(FORECAST($C302,N$305:N$316,$C$305:$C$316)<0,0,\nIF(FORECAST($C302,N$305:N$316,$C$305:$C$316)>100,100,\nFORECAST($C302,N$305:N$316,$C$305:$C$316))))","v":81.019332212458721},null,null,null,{"$f":"IF(MAX(C305:C316)-MIN(C305:C316)<5,AVERAGEIF(C305:C316,\">0\",R305:R316),\nIF(FORECAST($C302,R$305:R$316,$C$305:$C$316)<0,0,\nIF(FORECAST($C302,R$305:R$316,$C$305:$C$316)>100,100,\nFORECAST($C302,R$305:R$316,$C$305:$C$316))))","v":0},{"$f":"IF(MAX(C305:C316)-MIN(C305:C316)<5,AVERAGEIF(C305:C316,\">0\",S305:S316),\nIF(FORECAST($C302,S$305:S$316,$C$305:$C$316)<0,0,\nIF(FORECAST($C302,S$305:S$316,$C$305:$C$316)>100,100,\nFORECAST($C302,S$305:S$316,$C$305:$C$316))))","v":85.970676889435708},null,null,null,{"$f":"IF(MAX(C305:C316)-MIN(C305:C316)<5,AVERAGEIF(C305:C316,\">0\",W305:W316),\nIF(FORECAST($C302,W$305:W$316,$C$305:$C$316)<0,0,\nIF(FORECAST($C302,W$305:W$316,$C$305:$C$316)>100,100,\nFORECAST($C302,W$305:W$316,$C$305:$C$316))))","v":0},{"$f":"IF(MAX(C305:C316)-MIN(C305:C316)<5,AVERAGEIF(C305:C316,\">0\",X305:X316),\nIF(FORECAST($C302,X$305:X$316,$C$305:$C$316)<0,0,\nIF(FORECAST($C302,X$305:X$316,$C$305:$C$316)>100,100,\nFORECAST($C302,X$305:X$316,$C$305:$C$316))))","v":91.137214688085294},null,null,null,{"$f":"IF(MAX(C305:C316)-MIN(C305:C316)<5,AVERAGEIF(C305:C316,\">0\",AB305:AB316),\nIF(FORECAST($C302,AB$305:AB$316,$C$305:$C$316)<0,0,\nIF(FORECAST($C302,AB$305:AB$316,$C$305:$C$316)>100,100,\nFORECAST($C302,AB$305:AB$316,$C$305:$C$316))))","v":0}]
[]
[null,"Survey","Year","Improved","Basic",null,null,"Surface water","Improved","Basic",null,null,"Surface water","Improved","Basic",null,null,"Surface water","Improved","Basic",null,null,"Surface water","Improved","Basic",null,null,"Surface water"]
[null,"MICS00",2000,{"$f":"IF(ISERROR(INDIRECT(CONCATENATE($B305,\"!M16\"))),\"\",INDIRECT(CONCATENATE($B305,\"!M16\")))","v":83.766454390853838},{"$f":"IF(ISERROR(INDIRECT(CONCATENATE($B305,\"!M23\"))),\"\",INDIRECT(CONCATENATE($B305,\"!M23\")))","v":97.404110294328561},null,null,{"$f":"IF(ISERROR(INDIRECT(CONCATENATE($B305,\"!M21\"))),\"\",INDIRECT(CONCATENATE($B305,\"!M21\")))","v":0},{"$f":"IF(ISERROR(INDIRECT(CONCATENATE($B305,\"!N16\"))),\"\",INDIRECT(CONCATENATE($B305,\"!N16\")))","v":88.982393362172559},{"$f":"IF(ISERROR(INDIRECT(CONCATENATE($B305,\"!N23\"))),\"\",INDIRECT(CONCATENATE($B305,\"!N23\")))","v":97.736653102071145},null,null,{"$f":"IF(ISERROR(INDIRECT(CONCATENATE($B305,\"!N21\"))),\"\",INDIRECT(CONCATENATE($B305,\"!N21\")))","v":0},{"$f":"IF(ISERROR(INDIRECT(CONCATENATE($B305,\"!O16\"))),\"\",INDIRECT(CONCATENATE($B305,\"!O16\")))","v":91.447139144631421},{"$f":"IF(ISERROR(INDIRECT(CONCATENATE($B305,\"!O23\"))),\"\",INDIRECT(CONCATENATE($B305,\"!O23\")))","v":97.442625050989406},null,null,{"$f":"IF(ISERROR(INDIRECT(CONCATENATE($B305,\"!O21\"))),\"\",INDIRECT(CONCATENATE($B305,\"!O21\")))","v":0},{"$f":"IF(ISERROR(INDIRECT(CONCATENATE($B305,\"!P16\"))),\"\",INDIRECT(CONCATENATE($B305,\"!P16\")))","v":91.636385586249119},{"$f":"IF(ISERROR(INDIRECT(CONCATENATE($B305,\"!P23\"))),\"\",INDIRECT(CONCATENATE($B305,\"!P23\")))","v":98.01292920666252},null,null,{"$f":"IF(ISERROR(INDIRECT(CONCATENATE($B305,\"!P21\"))),\"\",INDIRECT(CONCATENATE($B305,\"!P21\")))","v":7.3822079831058707E-2},{"$f":"IF(ISERROR(INDIRECT(CONCATENATE($B305,\"!Q16\"))),\"\",INDIRECT(CONCATENATE($B305,\"!Q16\")))","v":95.061362853983937},{"$f":"IF(ISERROR(INDIRECT(CONCATENATE($B305,\"!Q23\"))),\"\",INDIRECT(CONCATENATE($B305,\"!Q23\")))","v":99.07599565419855},null,null,{"$f":"IF(ISERROR(INDIRECT(CONCATENATE($B305,\"!Q221\"))),\"\",INDIRECT(CONCATENATE($B305,\"!Q21\")))","v":0}]
[null,"DHS05",2005,84.124175324099099,"N/A",null,null,0,90.098592743655956,"N/A",null,null,0,91.060125415992076,"N/A",null,null,0,91.593181559788675,"N/A",null,null,0,92.000836409419492,"N/A",null,null,0]
[null,"MICS12",2012,71.5,96.9,null,null,0,77.5,97.7,null,null,0,81.7,99.3,null,null,0,86.3,98.6,null,null,0,92.1,99.1,null,null,0]
[null,null,null,"","",null,null,"","","",null,null,"","","",null,null,"","","",null,null,"","","",null,null,""]
[null,null,null,"","",null,null,"","","",null,null,"","","",null,null,"","","",null,null,"","","",null,null,""]
[null,null,null,"","",null,null,"","","",null,null,"","","",null,null,"","","",null,null,"","","",null,null,""]
[null,null,null,"","",null,null,"","","",null,null,"","","",null,null,"","","",null,null,"","","",null,null,""]
[null,null,null,"","",null,null,"","","",null,null,"","","",null,null,"","","",null,null,"","","",null,null,""]
[null,null,null,"","",null,null,"","","",null,null,"","","",null,null,"","","",null,null,"","","",null,null,""]
[null,null,null,"","",null,null,"","","",null,null,"","","",null,null,"","","",null,null,"","","",null,null,""]
[null,null,null,"","",null,null,"","","",null,null,"","","",null,null,"","","",null,null,"","","",null,null,""]
[null,null,null,"","",null,null,"","","",null,null,"","","",null,null,"","","",null,null,"","","",null,null,""]
[]
[null,{"$f":"CONCATENATE(\"Rural use of drinking water sources, \",C299,\"–\",C300)","v":"Rural use of drinking water sources, 2000–2018"},null,null,null,null,null,null,null,null,null,null,null,null,null,null,null,null,"Data points used for regression"]

{"sheet":"Sanitation","index":2,"n_rows":318,"n_cols":28,"rows_kept":318,"cut":false,"hidden":false,"merged":[[30,21,30,24],[4,1,4,24],[3,1,3,24],[6,1,6,8],[6,9,6,16],[6,17,6,24],[30,1,31,4],[30,5,30,8],[30,9,30,12],[30,13,30,16],[30,17,30,20],[96,23,96,27],[32,1,33,2],[32,3,33,3],[35,1,36,2],[35,3,36,3],[38,1,39,2],[38,3,39,3],[96,0,97,2],[96,3,96,7],[96,8,96,12],[96,13,96,17],[96,18,96,22],[98,0,99,1],[100,0,101,1],[117,18,117,22],[196,0,197,2],[196,3,196,7],[196,8,196,12],[196,13,196,17],[196,18,196,22],[117,1,117,11],[298,0,299,1],[300,0,301,1],[317,18,317,22],[196,23,196,27],[198,0,199,1],[200,0,201,1],[217,18,217,22],[296,0,297,2],[296,3,296,7],[296,8,296,12],[296,13,296,17],[296,18,296,22],[296,23,296,27],[217,1,217,11],[317,1,317,11]]}
[]
[]
[]
[null,"Summary of trends in use of sanitation facilities by wealth quintile (%)"]
[null,{"$f":"IF(ISERROR(INDIRECT(CONCATENATE($B105,\"!A2\"))),\"\",INDIRECT(CONCATENATE($B105,\"!A2\")))","v":"Republic of Moldova"}]
[]
[null,{"$f":"B118","v":"National use of sanitation facilities, 2000–2018"},null,null,null,null,null,null,null,{"$f":"B218","v":"Urban use of sanitation facilities, 2000–2018"},null,null,null,null,null,null,null,{"$f":"B318","v":"Rural use of sanitation facilities, 2000–2018"}]
[]
[]
[]
[]
[]
[]
[]
[]
[]
[]
[]
[]
[]
[]
[]
[]
[]
[]
[]
[]
[]
[]
[]
[null,{"$f":"IF(ISERROR(INDIRECT(CONCATENATE($B105,\"!A2\"))),\"\",INDIRECT(CONCATENATE($B105,\"!A2\")))","v":"Republic of Moldova"},null,null,null,"Poorest",null,null,null,"Poor",null,null,null,"Middle",null,null,null,"Rich",null,null,null,"Richest"]
[null,null,null,null,null,"Basic","Limited","Unimproved","Open defecation","Basic","Limited","Unimproved","Open defecation","Basic","Limited","Unimproved","Open defecation","Basic","Limited","Unimproved","Open defecation","Basic","Limited","Unimproved","Open defecation"]
[null,"NATIONAL",null,"Estimate",{"$f":"C99","v":2000},{"$f":"E99","v":53.863188927453351},{"$f":"F99","v":6.2983364687216161},39.838474603825034,0,{"$f":"J99","v":60.557016771520338},{"$f":"K99","v":6.1936073082793079},33.24937592020035,0,{"$f":"O99","v":68.278952242960798},{"$f":"P99","v":6.3855703094905394},25.335477447548669,0,{"$f":"T99","v":75.616691754003725},{"$f":"U99","v":9.3820508685276636},15.001257377468619,0,{"$f":"Y99","v":87.159415523243382},{"$f":"Z99","v":4.891806552108525},7.9487779246480983,0]
[null,null,null,null,{"$f":"C100","v":2018},{"$f":"E100","v":59.132747229048945},6.9145170530107514,33.405965647652238,0.54677007028806202,{"$f":"J100","v":66.036903421459698},6.7540752410320408,27.209021337508261,0,{"$f":"O100","v":72.471763223315833},6.7776895267595956,20.750547249924566,0,{"$f":"T100","v":80.014448944625983},9.9276973483297475,10.057853707044274,0,{"$f":"Y100","v":94.677952713270699},5.3137831024060551,8.264184323252266E-3,0]
[]
[null,"URBAN",null,"Estimate",{"$f":"C199","v":2000},{"$f":"E199","v":60.224810868397583},{"$f":"F199","v":11.584108804485767},28.191080327116651,0,{"$f":"J199","v":73.190272060944636},{"$f":"K199","v":11.605622294696079},15.204105644359288,0,{"$f":"O199","v":87.611483705570791},{"$f":"P199","v":7.9226434306004263},4.4658728638287783,0,{"$f":"T199","v":88.182391580891121},{"$f":"U199","v":5.8646967521498379},5.9529116669590394,0,{"$f":"Y199","v":96.115403640026102},{"$f":"Z199","v":3.6282674349841675},0.25632892498973092,0]
[null,null,null,null,{"$f":"C200","v":2018},{"$f":"E200","v":73.090933326774419},14.058878924982469,12.790496489105436,5.9691259137673924E-2,{"$f":"J200","v":81.388823747292065},12.905648808548387,5.7055274441595429,0,{"$f":"O200","v":90.320686535542009},8.167634693106244,1.5116787713517397,0,{"$f":"T200","v":93.764084719580381},6.2359152804196185,0,0,{"$f":"Y200","v":96.341543480144097},3.6368040044265184,2.1652515429380514E-2,0]
[]
[null,"RURAL",null,"Estimate",{"$f":"C299","v":2000},{"$f":"E299","v":54.237785655330782},{"$f":"F299","v":5.247756517330429},40.514457827338788,0,{"$f":"J299","v":59.59420471848992},{"$f":"K299","v":6.1518900125655307},34.25390526894455,0,{"$f":"O299","v":62.577242840716956},{"$f":"P299","v":4.9076853079061022},32.515071851376945,0,{"$f":"T299","v":66.461098446294244},{"$f":"U299","v":5.5190966441639615},28.01980490954179,0,{"$f":"Y299","v":66.721363088932677},{"$f":"Z299","v":6.1383426988546601},27.140294212212666,0]
[null,null,null,null,{"$f":"C300","v":2018},{"$f":"E300","v":56.585723115643511},5.4749303217320353,37.105065712194857,0.8342808504295931,{"$f":"J300","v":62.362187804687274},6.4376279896618938,31.200184205650828,0,{"$f":"O300","v":64.441801831495255},5.0539152846415556,30.504282883863183,0,{"$f":"T300","v":69.981028559232996},5.8114004869857929,24.207570953781214,0,{"$f":"Y300","v":81.001286069318908},7.452090753582282,11.546623177098809,0]
[]
[]
[]
[]
[]
[]
[]
[]
[]
[]
[]
[]
[]
[]
[]
[]
[]
[]
[]
[]
[]
[]
[]
[]
[]
[]
[]
[]
[]
[]
[]
[]
[]
[]
[]
[]
[]
[]
[]
[]
[]
[]
[]
[]
[]
[]
[]
[]
[]
[]
[]
[]
[]
[]
[]
[]
["NATIONAL",null,null,"Poorest",null,null,null,null,"Poor",null,null,null,null,"Middle",null,null,null,null,"Rich",null,null,null,null,"Richest"]
[null,null,null,"Improved","Basic","Limited","Unimproved","Open defecation","Improved","Basic","Limited","Unimproved","Open defecation","Improved","Basic","Limited","Unimproved","Open defecation","Improved","Basic","Limited","Unimproved","Open defecation","Improved","Basic","Limited","Unimproved","Open defecation"]
["Forecast period:",null,2000,{"$f":"IF((D101+H101)>100,D101*100/(D101+H101),D101)","v":60.161525396174966},{"$f":"D99*AVERAGEIF(E105:E116,\">0\")/100","v":53.863188927453351},{"$f":"D99*(100-AVERAGEIF(E105:E116,\">0\"))/100","v":6.2983364687216161},{"$f":"100-(E99+F99+H99)","v":39.838474603825034},{"$f":"IF((D101+H101)>100,H101*100/(D101+H101),H101)","v":0},{"$f":"IF((I101+M101)>100,I101*100/(I101+M101),I101)","v":66.75062407979965},{"$f":"I99*AVERAGEIF(J105:J116,\">0\")/100","v":60.557016771520338},{"$f":"I99*(100-AVERAGEIF(J105:J116,\">0\"))/100","v":6.1936073082793079},{"$f":"100-(J99+K99+M99)","v":33.24937592020035},{"$f":"IF((I101+M101)>100,M101*100/(I101+M101),M101)","v":0},{"$f":"IF((N101+R101)>100,N101*100/(N101+R101),N101)","v":74.664522552451331},{"$f":"N99*AVERAGEIF(O105:O116,\">0\")/100","v":68.278952242960798},{"$f":"N99*(100-AVERAGEIF(O105:O116,\">0\"))/100","v":6.3855703094905394},{"$f":"100-(O99+P99+R99)","v":25.335477447548669},{"$f":"IF((N101+R101)>100,R101*100/(N101+R101),R101)","v":0},{"$f":"IF((S101+W101)>100,S101*100/(S101+W101),S101)","v":84.998742622531381},{"$f":"S99*AVERAGEIF(T105:T116,\">0\")/100","v":75.616691754003725},{"$f":"S99*(100-AVERAGEIF(T105:T116,\">0\"))/100","v":9.3820508685276636},{"$f":"100-(T99+U99+W99)","v":15.001257377468619},{"$f":"IF((S101+W101)>100,W101*100/(S101+W101),W101)","v":0},{"$f":"IF((X101+AB101)>100,X101*100/(X101+AB101),X101)","v":92.051222075351916},{"$f":"X99*AVERAGEIF(Y105:Y116,\">0\")/100","v":87.159415523243382},{"$f":"X99*(100-AVERAGEIF(Y105:Y116,\">0\"))/100","v":4.891806552108525},{"$f":"100-(Y99+Z99+AB99)","v":7.9487779246480983},{"$f":"IF((X101+AB101)>100,AB101*100/(X101+AB101),AB101)","v":0}]
[null,null,2018,{"$f":"IF((D102+H102)>100,D102*100/(D102+H102),D102)","v":66.0472642820597},{"$f":"D100*AVERAGEIF(E105:E116,\">0\")/100","v":59.132747229048945},{"$f":"D100*(100-AVERAGEIF(E105:E116,\">0\"))/100","v":6.9145170530107514},{"$f":"100-(E100+F100+H100)","v":33.405965647652238},{"$f":"IF((D102+H102)>100,H102*100/(D102+H102),H102)","v":0.54677007028806202},{"$f":"IF((I102+M102)>100,I102*100/(I102+M102),I102)","v":72.790978662491739},{"$f":"I100*AVERAGEIF(J105:J116,\">0\")/100","v":66.036903421459698},{"$f":"I100*(100-AVERAGEIF(J105:J116,\">0\"))/100","v":6.7540752410320408},{"$f":"100-(J100+K100+M100)","v":27.209021337508261},{"$f":"IF((I102+M102)>100,M102*100/(I102+M102),M102)","v":0},{"$f":"IF((N102+R102)>100,N102*100/(N102+R102),N102)","v":79.24945275007542},{"$f":"N100*AVERAGEIF(O105:O116,\">0\")/100","v":72.471763223315833},{"$f":"N100*(100-AVERAGEIF(O105:O116,\">0\"))/100","v":6.7776895267595956},{"$f":"100-(O100+P100+R100)","v":20.750547249924566},{"$f":"IF((N102+R102)>100,R102*100/(N102+R102),R102)","v":0},{"$f":"IF((S102+W102)>100,S102*100/(S102+W102),S102)","v":89.942146292955726},{"$f":"S100*AVERAGEIF(T105:T116,\">0\")/100","v":80.014448944625983},{"$f":"S100*(100-AVERAGEIF(T105:T116,\">0\"))/100","v":9.9276973483297475},{"$f":"100-(T100+U100+W100)","v":10.057853707044274},{"$f":"IF((S102+W102)>100,W102*100/(S102+W102),W102)","v":0},{"$f":"IF((X102+AB102)>100,X102*100/(X102+AB102),X102)","v":99.991735815676748},{"$f":"X100*AVERAGEIF(Y105:Y116,\">0\")/100","v":94.677952713270699},{"$f":"X100*(100-AVERAGEIF(Y105:Y116,\">0\"))/100","v":5.3137831024060551},{"$f":"100-(Y100+Z100+AB100)","v":8.264184323252266E-3},{"$f":"IF((X102+AB102)>100,AB102*100/(X102+AB102),AB102)","v":0}]
["Regression period:",null,{"$f":"MinRegYear(C99,C105:C116)","v":2000},{"$f":"IF(MAX(C105:C116)-MIN(C105:C116)<5,AVERAGEIF(C105:C116,\">0\",D105:D116),\nIF(FORECAST($C101,D$105:D$116,$C$105:$C$116)<0,0,\nIF(FORECAST($C101,D$105:D$116,$C$105:$C$116)>100,100,\nFORECAST($C101,D$105:D$116,$C$105:$C$116))))","v":60.161525396174966},null,null,null,{"$f":"IF(MAX(C105:C116)-MIN(C105:C116)<5,AVERAGEIF(C105:C116,\">0\",H105:H116),\nIF(FORECAST($C101,H$105:H$116,$C$105:$C$116)<0,0,\nIF(FORECAST($C101,H$105:H$116,$C$105:$C$116)>100,100,\nFORECAST($C101,H$105:H$116,$C$105:$C$116))))","v":0},{"$f":"IF(MAX(C105:C116)-MIN(C105:C116)<5,AVERAGEIF(C105:C116,\">0\",I105:I116),\nIF(FORECAST($C101,I$105:I$116,$C$105:$C$116)<0,0,\nIF(FORECAST($C101,I$105:I$116,$C$105:$C$116)>100,100,\nFORECAST($C101,I$105:I$116,$C$105:$C$116))))","v":66.75062407979965},null,null,null,{"$f":"IF(MAX(C105:C116)-MIN(C105:C116)<5,AVERAGEIF(C105:C116,\">0\",M105:M116),\nIF(FORECAST($C101,M$105:M$116,$C$105:$C$116)<0,0,\nIF(FORECAST($C101,M$105:M$116,$C$105:$C$116)>100,100,\nFORECAST($C101,M$105:M$116,$C$105:$C$116))))","v":0},{"$f":"IF(MAX(C105:C116)-MIN(C105:C116)<5,AVERAGEIF(C105:C116,\">0\",N105:N116),\nIF(FORECAST($C101,N$105:N$116,$C$105:$C$116)<0,0,\nIF(FORECAST($C101,N$105:N$116,$C$105:$C$116)>100,100,\nFORECAST($C101,N$105:N$116,$C$105:$C$116))))","v":74.664522552451331},null,null,null,{"$f":"IF(MAX(C105:C116)-MIN(C105:C116)<5,AVERAGEIF(C105:C116,\">0\",R105:R116),\nIF(FORECAST($C101,R$105:R$116,$C$105:$C$116)<0,0,\nIF(FORECAST($C101,R$105:R$116,$C$105:$C$116)>100,100,\nFORECAST($C101,R$105:R$116,$C$105:$C$116))))","v":0},{"$f":"IF(MAX(C105:C116)-MIN(C105:C116)<5,AVERAGEIF(C105:C116,\">0\",S105:S116),\nIF(FORECAST($C101,S$105:S$116,$C$105:$C$116)<0,0,\nIF(FORECAST($C101,S$105:S$116,$C$105:$C$116)>100,100,\nFORECAST($C101,S$105:S$116,$C$105:$C$116))))","v":84.998742622531381},null,null,null,{"$f":"IF(MAX(C105:C116)-MIN(C105:C116)<5,AVERAGEIF(C105:C116,\">0\",W105:W116),\nIF(FORECAST($C101,W$105:W$116,$C$105:$C$116)<0,0,\nIF(FORECAST($C101,W$105:W$116,$C$105:$C$116)>100,100,\nFORECAST($C101,W$105:W$116,$C$105:$C$116))))","v":0},{"$f":"IF(MAX(C105:C116)-MIN(C105:C116)<5,AVERAGEIF(C105:C116,\">0\",X105:X116),\nIF(FORECAST($C101,X$105:X$116,$C$105:$C$116)<0,0,\nIF(FORECAST($C101,X$105:X$116,$C$105:$C$116)>100,100,\nFORECAST($C101,X$105:X$116,$C$105:$C$116))))","v":92.051222075351916},null,null,null,{"$f":"IF(MAX(C105:C116)-MIN(C105:C116)<5,AVERAGEIF(C105:C116,\">0\",AB105:AB116),\nIF(FORECAST($C101,AB$105:AB$116,$C$105:$C$116)<0,0,\nIF(FORECAST($C101,AB$105:AB$116,$C$105:$C$116)>100,100,\nFORECAST($C101,AB$105:AB$116,$C$105:$C$116))))","v":0}]
[null,null,{"$f":"MaxRegYear(C100,C105:C116)","v":2014},{"$f":"IF(MAX(C105:C116)-MIN(C105:C116)<5,AVERAGEIF(C105:C116,\">0\",D105:D116),\nIF(FORECAST($C102,D$105:D$116,$C$105:$C$116)<0,0,\nIF(FORECAST($C102,D$105:D$116,$C$105:$C$116)>100,100,\nFORECAST($C102,D$105:D$116,$C$105:$C$116))))","v":66.0472642820597},null,null,null,{"$f":"IF(MAX(C105:C116)-MIN(C105:C116)<5,AVERAGEIF(C105:C116,\">0\",H105:H116),\nIF(FORECAST($C102,H$105:H$116,$C$105:$C$116)<0,0,\nIF(FORECAST($C102,H$105:H$116,$C$105:$C$116)>100,100,\nFORECAST($C102,H$105:H$116,$C$105:$C$116))))","v":0.54677007028806202},{"$f":"IF(MAX(C105:C116)-MIN(C105:C116)<5,AVERAGEIF(C105:C116,\">0\",I105:I116),\nIF(FORECAST($C102,I$105:I$116,$C$105:$C$116)<0,0,\nIF(FORECAST($C102,I$105:I$116,$C$105:$C$116)>100,100,\nFORECAST($C102,I$105:I$116,$C$105:$C$116))))","v":72.790978662491739},null,null,null,{"$f":"IF(MAX(C105:C116)-MIN(C105:C116)<5,AVERAGEIF(C105:C116,\">0\",M105:M116),\nIF(FORECAST($C102,M$105:M$116,$C$105:$C$116)<0,0,\nIF(FORECAST($C102,M$105:M$116,$C$105:$C$116)>100,100,\nFORECAST($C102,M$105:M$116,$C$105:$C$116))))","v":0},{"$f":"IF(MAX(C105:C116)-MIN(C105:C116)<5,AVERAGEIF(C105:C116,\">0\",N105:N116),\nIF(FORECAST($C102,N$105:N$116,$C$105:$C$116)<0,0,\nIF(FORECAST($C102,N$105:N$116,$C$105:$C$116)>100,100,\nFORECAST($C102,N$105:N$116,$C$105:$C$116))))","v":79.24945275007542},null,null,null,{"$f":"IF(MAX(C105:C116)-MIN(C105:C116)<5,AVERAGEIF(C105:C116,\">0\",R105:R116),\nIF(FORECAST($C102,R$105:R$116,$C$105:$C$116)<0,0,\nIF(FORECAST($C102,R$105:R$116,$C$105:$C$116)>100,100,\nFORECAST($C102,R$105:R$116,$C$105:$C$116))))","v":0},{"$f":"IF(MAX(C105:C116)-MIN(C105:C116)<5,AVERAGEIF(C105:C116,\">0\",S105:S116),\nIF(FORECAST($C102,S$105:S$116,$C$105:$C$116)<0,0,\nIF(FORECAST($C102,S$105:S$116,$C$105:$C$116)>100,100,\nFORECAST($C102,S$105:S$116,$C$105:$C$116))))","v":89.942146292955726},null,null,null,{"$f":"IF(MAX(C105:C116)-MIN(C105:C116)<5,AVERAGEIF(C105:C116,\">0\",W105:W116),\nIF(FORECAST($C102,W$105:W$116,$C$105:$C$116)<0,0,\nIF(FORECAST($C102,W$105:W$116,$C$105:$C$116)>100,100,\nFORECAST($C102,W$105:W$116,$C$105:$C$116))))","v":0},{"$f":"IF(MAX(C105:C116)-MIN(C105:C116)<5,AVERAGEIF(C105:C116,\">0\",X105:X116),\nIF(FORECAST($C102,X$105:X$116,$C$105:$C$116)<0,0,\nIF(FORECAST($C102,X$105:X$116,$C$105:$C$116)>100,100,\nFORECAST($C102,X$105:X$116,$C$105:$C$116))))","v":99.991735815676748},null,null,null,{"$f":"IF(MAX(C105:C116)-MIN(C105:C116)<5,AVERAGEIF(C105:C116,\">0\",AB105:AB116),\nIF(FORECAST($C102,AB$105:AB$116,$C$105:$C$116)<0,0,\nIF(FORECAST($C102,AB$105:AB$116,$C$105:$C$116)>100,100,\nFORECAST($C102,AB$105:AB$116,$C$105:$C$116))))","v":0}]
[]
[null,"Survey","Year","Improved","Not shared",null,null,"Open defecation","Improved","Not shared",null,null,"Open defecation","Improved","Not shared",null,null,"Open defecation","Improved","Not shared",null,null,"Open defecation","Improved","Not shared",null,null,"Open defecation"]
[null,"MICS00",2000,{"$f":"IF(ISERROR(INDIRECT(CONCATENATE($B105,\"!C122\"))),\"\",INDIRECT(CONCATENATE($B105,\"!C122\")))","v":54.003282676283774},{"$f":"IF(ISERROR(INDIRECT(CONCATENATE($B105,\"!C129\"))),\"\",INDIRECT(CONCATENATE($B105,\"!C129\")))","v":"N/A"},null,null,{"$f":"IF(ISERROR(INDIRECT(CONCATENATE($B105,\"!C127\"))),\"\",INDIRECT(CONCATENATE($B105,\"!C127\")))","v":0},{"$f":"IF(ISERROR(INDIRECT(CONCATENATE($B105,\"!D122\"))),\"\",INDIRECT(CONCATENATE($B105,\"!D122\")))","v":62.21480891904298},{"$f":"IF(ISERROR(INDIRECT(CONCATENATE($B105,\"!D129\"))),\"\",INDIRECT(CONCATENATE($B105,\"!D129\")))","v":"N/A"},null,null,{"$f":"IF(ISERROR(INDIRECT(CONCATENATE($B105,\"!D127\"))),\"\",INDIRECT(CONCATENATE($B105,\"!D127\")))","v":0},{"$f":"IF(ISERROR(INDIRECT(CONCATENATE($B105,\"!E122\"))),\"\",INDIRECT(CONCATENATE($B105,\"!E122\")))","v":72.101349946884184},{"$f":"IF(ISERROR(INDIRECT(CONCATENATE($B105,\"!E129\"))),\"\",INDIRECT(CONCATENATE($B105,\"!E129\")))","v":"N/A"},null,null,{"$f":"IF(ISERROR(INDIRECT(CONCATENATE($B105,\"!E127\"))),\"\",INDIRECT(CONCATENATE($B105,\"!E127\")))","v":0},{"$f":"IF(ISERROR(INDIRECT(CONCATENATE($B105,\"!F122\"))),\"\",INDIRECT(CONCATENATE($B105,\"!F122\")))","v":84.148845573243875},{"$f":"IF(ISERROR(INDIRECT(CONCATENATE($B105,\"!F129\"))),\"\",INDIRECT(CONCATENATE($B105,\"!F129\")))","v":"N/A"},null,null,{"$f":"IF(ISERROR(INDIRECT(CONCATENATE($B105,\"!F127\"))),\"\",INDIRECT(CONCATENATE($B105,\"!F127\")))","v":0},{"$f":"IF(ISERROR(INDIRECT(CONCATENATE($B105,\"!G122\"))),\"\",INDIRECT(CONCATENATE($B105,\"!G122\")))","v":89.646615423604089},{"$f":"IF(ISERROR(INDIRECT(CONCATENATE($B105,\"!G129\"))),\"\",INDIRECT(CONCATENATE($B105,\"!G129\")))","v":"N/A"},null,null,{"$f":"IF(ISERROR(INDIRECT(CONCATENATE($B105,\"!G2127\"))),\"\",INDIRECT(CONCATENATE($B105,\"!G127\")))","v":0}]
[null,"DHS05",2005,72.820562518090057,92.614752799016969,null,null,0,76.683576706343885,94.912968497105282,null,null,0,80.696007804003671,94.587606158313037,null,null,0,88.221210303604494,89.665920859696087,null,null,0,99.009302671321393,96.401682171487366,null,null,0]
[null,"MICS12",2012,60.807699641296708,86.447159520373603,null,null,0.51599946027185328,68.688202892995278,86.529580112253285,null,null,0,76.763625146438301,88.307696480219974,null,null,0,88.628876447689805,88.25833877272656,null,null,0,97.139800530096139,92.969873269451483,null,null,0]
[null,null,null,"","",null,null,"","","",null,null,"","","",null,null,"","","",null,null,"","","",null,null,""]
[null,null,null,"","",null,null,"","","",null,null,"","","",null,null,"","","",null,null,"","","",null,null,""]
[null,null,null,"","",null,null,"","","",null,null,"","","",null,null,"","","",null,null,"","","",null,null,""]
[null,null,null,"","",null,null,"","","",null,null,"","","",null,null,"","","",null,null,"","","",null,null,""]
[null,null,null,"","",null,null,"","","",null,null,"","","",null,null,"","","",null,null,"","","",null,null,""]
[null,null,null,"","",null,null,"","","",null,null,"","","",null,null,"","","",null,null,"","","",null,null,""]
[null,null,null,"","",null,null,"","","",null,null,"","","",null,null,"","","",null,null,"","","",null,null,""]
[null,null,null,"","",null,null,"","","",null,null,"","","",null,null,"","","",null,null,"","","",null,null,""]
[null,null,null,"","",null,null,"","","",null,null,"","","",null,null,"","","",null,null,"","","",null,null,""]
[]
[null,{"$f":"CONCATENATE(\"National use of sanitation facilities, \",C99,\"–\",C100)","v":"National use of sanitation facilities, 2000–2018"},null,null,null,null,null,null,null,null,null,null,null,null,null,null,null,null,"Data points used for regression"]
[]
[]
[]
[]
[]
[]
[]
[]
[]
[]
[]
[]
[]
[]
[]
[]
[]
[]
[]
[]
[]
[]
[]
[]
[]
[]
[]
[]
[]
[]
[]
[]
[]
[]
[]
[]
[]
[]
[]
[]
[]
[]
[]
[]
[]
[]
[]
[]
[]
[]
[]
[]
[]
[]
[]
[]
[]
[]
[]
[]
[]
[]
[]
[]
[]
[]
[]
[]
[]
[]
[]
[]
[]
[]
[]
[]
[]
[]
["URBAN",null,null,"Poorest",null,null,null,null,"Poor",null,null,null,null,"Middle",null,null,null,null,"Rich",null,null,null,null,"Richest"]
[null,null,null,"Improved","Basic","Limited","Unimproved","Open defecation","Improved","Basic","Limited","Unimproved","Open defecation","Improved","Basic","Limited","Unimproved","Open defecation","Improved","Basic","Limited","Unimproved","Open defecation","Improved","Basic","Limited","Unimproved","Open defecation"]
["Forecast period:",null,2000,{"$f":"IF((D201+H201)>100,D201*100/(D201+H201),D201)","v":71.808919672883349},{"$f":"D199*AVERAGEIF(E205:E216,\">0\")/100","v":60.224810868397583},{"$f":"D199*(100-AVERAGEIF(E205:E216,\">0\"))/100","v":11.584108804485767},{"$f":"100-(E199+F199+H199)","v":28.191080327116651},{"$f":"IF((D201+H201)>100,H201*100/(D201+H201),H201)","v":0},{"$f":"IF((I201+M201)>100,I201*100/(I201+M201),I201)","v":84.795894355640712},{"$f":"I199*AVERAGEIF(J205:J216,\">0\")/100","v":73.190272060944636},{"$f":"I199*(100-AVERAGEIF(J205:J216,\">0\"))/100","v":11.605622294696079},{"$f":"100-(J199+K199+M199)","v":15.204105644359288},{"$f":"IF((I201+M201)>100,M201*100/(I201+M201),M201)","v":0},{"$f":"IF((N201+R201)>100,N201*100/(N201+R201),N201)","v":95.534127136171207},{"$f":"N199*AVERAGEIF(O205:O216,\">0\")/100","v":87.611483705570791},{"$f":"N199*(100-AVERAGEIF(O205:O216,\">0\"))/100","v":7.9226434306004263},{"$f":"100-(O199+P199+R199)","v":4.4658728638287783},{"$f":"IF((N201+R201)>100,R201*100/(N201+R201),R201)","v":0},{"$f":"IF((S201+W201)>100,S201*100/(S201+W201),S201)","v":94.047088333040961},{"$f":"S199*AVERAGEIF(T205:T216,\">0\")/100","v":88.182391580891121},{"$f":"S199*(100-AVERAGEIF(T205:T216,\">0\"))/100","v":5.8646967521498379},{"$f":"100-(T199+U199+W199)","v":5.9529116669590394},{"$f":"IF((S201+W201)>100,W201*100/(S201+W201),W201)","v":0},{"$f":"IF((X201+AB201)>100,X201*100/(X201+AB201),X201)","v":99.743671075010269},{"$f":"X199*AVERAGEIF(Y205:Y216,\">0\")/100","v":96.115403640026102},{"$f":"X199*(100-AVERAGEIF(Y205:Y216,\">0\"))/100","v":3.6282674349841675},{"$f":"100-(Y199+Z199+AB199)","v":0.25632892498973092},{"$f":"IF((X201+AB201)>100,AB201*100/(X201+AB201),AB201)","v":0}]
[null,null,2018,{"$f":"IF((D202+H202)>100,D202*100/(D202+H202),D202)","v":87.149812251756885},{"$f":"D200*AVERAGEIF(E205:E216,\">0\")/100","v":73.090933326774419},{"$f":"D200*(100-AVERAGEIF(E205:E216,\">0\"))/100","v":14.058878924982469},{"$f":"100-(E200+F200+H200)","v":12.790496489105436},{"$f":"IF((D202+H202)>100,H202*100/(D202+H202),H202)","v":5.9691259137673924E-2},{"$f":"IF((I202+M202)>100,I202*100/(I202+M202),I202)","v":94.294472555840457},{"$f":"I200*AVERAGEIF(J205:J216,\">0\")/100","v":81.388823747292065},{"$f":"I200*(100-AVERAGEIF(J205:J216,\">0\"))/100","v":12.905648808548387},{"$f":"100-(J200+K200+M200)","v":5.7055274441595429},{"$f":"IF((I202+M202)>100,M202*100/(I202+M202),M202)","v":0},{"$f":"IF((N202+R202)>100,N202*100/(N202+R202),N202)","v":98.48832122864826},{"$f":"N200*AVERAGEIF(O205:O216,\">0\")/100","v":90.320686535542009},{"$f":"N200*(100-AVERAGEIF(O205:O216,\">0\"))/100","v":8.167634693106244},{"$f":"100-(O200+P200+R200)","v":1.5116787713517397},{"$f":"IF((N202+R202)>100,R202*100/(N202+R202),R202)","v":0},{"$f":"IF((S202+W202)>100,S202*100/(S202+W202),S202)","v":100},{"$f":"S200*AVERAGEIF(T205:T216,\">0\")/100","v":93.764084719580381},{"$f":"S200*(100-AVERAGEIF(T205:T216,\">0\"))/100","v":6.2359152804196185},{"$f":"100-(T200+U200+W200)","v":0},{"$f":"IF((S202+W202)>100,W202*100/(S202+W202),W202)","v":0},{"$f":"IF((X202+AB202)>100,X202*100/(X202+AB202),X202)","v":99.978347484570619},{"$f":"X200*AVERAGEIF(Y205:Y216,\">0\")/100","v":96.341543480144097},{"$f":"X200*(100-AVERAGEIF(Y205:Y216,\">0\"))/100","v":3.6368040044265184},{"$f":"100-(Y200+Z200+AB200)","v":2.1652515429380514E-2},{"$f":"IF((X202+AB202)>100,AB202*100/(X202+AB202),AB202)","v":0}]
["Regression period:",null,{"$f":"MinRegYear(C199,C205:C216)","v":2000},{"$f":"IF(MAX(C205:C216)-MIN(C205:C216)<5,AVERAGEIF(C205:C216,\">0\",D205:D216),\nIF(FORECAST($C201,D$205:D$216,$C$205:$C$216)<0,0,\nIF(FORECAST($C201,D$205:D$216,$C$205:$C$216)>100,100,\nFORECAST($C201,D$205:D$216,$C$205:$C$216))))","v":71.808919672883349},null,null,null,{"$f":"IF(MAX(C205:C216)-MIN(C205:C216)<5,AVERAGEIF(C205:C216,\">0\",H205:H216),\nIF(FORECAST($C201,H$205:H$216,$C$205:$C$216)<0,0,\nIF(FORECAST($C201,H$205:H$216,$C$205:$C$216)>100,100,\nFORECAST($C201,H$205:H$216,$C$205:$C$216))))","v":0},{"$f":"IF(MAX(C205:C216)-MIN(C205:C216)<5,AVERAGEIF(C205:C216,\">0\",I205:I216),\nIF(FORECAST($C201,I$205:I$216,$C$205:$C$216)<0,0,\nIF(FORECAST($C201,I$205:I$216,$C$205:$C$216)>100,100,\nFORECAST($C201,I$205:I$216,$C$205:$C$216))))","v":84.795894355640712},null,null,null,{"$f":"IF(MAX(C205:C216)-MIN(C205:C216)<5,AVERAGEIF(C205:C216,\">0\",M205:M216),\nIF(FORECAST($C201,M$205:M$216,$C$205:$C$216)<0,0,\nIF(FORECAST($C201,M$205:M$216,$C$205:$C$216)>100,100,\nFORECAST($C201,M$205:M$216,$C$205:$C$216))))","v":0},{"$f":"IF(MAX(C205:C216)-MIN(C205:C216)<5,AVERAGEIF(C205:C216,\">0\",N205:N216),\nIF(FORECAST($C201,N$205:N$216,$C$205:$C$216)<0,0,\nIF(FORECAST($C201,N$205:N$216,$C$205:$C$216)>100,100,\nFORECAST($C201,N$205:N$216,$C$205:$C$216))))","v":95.534127136171207},null,null,null,{"$f":"IF(MAX(C205:C216)-MIN(C205:C216)<5,AVERAGEIF(C205:C216,\">0\",R205:R216),\nIF(FORECAST($C201,R$205:R$216,$C$205:$C$216)<0,0,\nIF(FORECAST($C201,R$205:R$216,$C$205:$C$216)>100,100,\nFORECAST($C201,R$205:R$216,$C$205:$C$216))))","v":0},{"$f":"IF(MAX(C205:C216)-MIN(C205:C216)<5,AVERAGEIF(C205:C216,\">0\",S205:S216),\nIF(FORECAST($C201,S$205:S$216,$C$205:$C$216)<0,0,\nIF(FORECAST($C201,S$205:S$216,$C$205:$C$216)>100,100,\nFORECAST($C201,S$205:S$216,$C$205:$C$216))))","v":94.047088333040961},null,null,null,{"$f":"IF(MAX(C205:C216)-MIN(C205:C216)<5,AVERAGEIF(C205:C216,\">0\",W205:W216),\nIF(FORECAST($C201,W$205:W$216,$C$205:$C$216)<0,0,\nIF(FORECAST($C201,W$205:W$216,$C$205:$C$216)>100,100,\nFORECAST($C201,W$205:W$216,$C$205:$C$216))))","v":0},{"$f":"IF(MAX(C205:C216)-MIN(C205:C216)<5,AVERAGEIF(C205:C216,\">0\",X205:X216),\nIF(FORECAST($C201,X$205:X$216,$C$205:$C$216)<0,0,\nIF(FORECAST($C201,X$205:X$216,$C$205:$C$216)>100,100,\nFORECAST($C201,X$205:X$216,$C$205:$C$216))))","v":99.743671075010269},null,null,null,{"$f":"IF(MAX(C205:C216)-MIN(C205:C216)<5,AVERAGEIF(C205:C216,\">0\",AB205:AB216),\nIF(FORECAST($C201,AB$205:AB$216,$C$205:$C$216)<0,0,\nIF(FORECAST($C201,AB$205:AB$216,$C$205:$C$216)>100,100,\nFORECAST($C201,AB$205:AB$216,$C$205:$C$216))))","v":0}]
[null,null,{"$f":"MaxRegYear(C200,C205:C216)","v":2014},{"$f":"IF(MAX(C205:C216)-MIN(C205:C216)<5,AVERAGEIF(C205:C216,\">0\",D205:D216),\nIF(FORECAST($C202,D$205:D$216,$C$205:$C$216)<0,0,\nIF(FORECAST($C202,D$205:D$216,$C$205:$C$216)>100,100,\nFORECAST($C202,D$205:D$216,$C$205:$C$216))))","v":87.149812251756885},null,null,null,{"$f":"IF(MAX(C205:C216)-MIN(C205:C216)<5,AVERAGEIF(C205:C216,\">0\",H205:H216),\nIF(FORECAST($C202,H$205:H$216,$C$205:$C$216)<0,0,\nIF(FORECAST($C202,H$205:H$216,$C$205:$C$216)>100,100,\nFORECAST($C202,H$205:H$216,$C$205:$C$216))))","v":5.9691259137673924E-2},{"$f":"IF(MAX(C205:C216)-MIN(C205:C216)<5,AVERAGEIF(C205:C216,\">0\",I205:I216),\nIF(FORECAST($C202,I$205:I$216,$C$205:$C$216)<0,0,\nIF(FORECAST($C202,I$205:I$216,$C$205:$C$216)>100,100,\nFORECAST($C202,I$205:I$216,$C$205:$C$216))))","v":94.294472555840457},null,null,null,{"$f":"IF(MAX(C205:C216)-MIN(C205:C216)<5,AVERAGEIF(C205:C216,\">0\",M205:M216),\nIF(FORECAST($C202,M$205:M$216,$C$205:$C$216)<0,0,\nIF(FORECAST($C202,M$205:M$216,$C$205:$C$216)>100,100,\nFORECAST($C202,M$205:M$216,$C$205:$C$216))))","v":0},{"$f":"IF(MAX(C205:C216)-MIN(C205:C216)<5,AVERAGEIF(C205:C216,\">0\",N205:N216),\nIF(FORECAST($C202,N$205:N$216,$C$205:$C$216)<0,0,\nIF(FORECAST($C202,N$205:N$216,$C$205:$C$216)>100,100,\nFORECAST($C202,N$205:N$216,$C$205:$C$216))))","v":98.48832122864826},null,null,null,{"$f":"IF(MAX(C205:C216)-MIN(C205:C216)<5,AVERAGEIF(C205:C216,\">0\",R205:R216),\nIF(FORECAST($C202,R$205:R$216,$C$205:$C$216)<0,0,\nIF(FORECAST($C202,R$205:R$216,$C$205:$C$216)>100,100,\nFORECAST($C202,R$205:R$216,$C$205:$C$216))))","v":0},{"$f":"IF(MAX(C205:C216)-MIN(C205:C216)<5,AVERAGEIF(C205:C216,\">0\",S205:S216),\nIF(FORECAST($C202,S$205:S$216,$C$205:$C$216)<0,0,\nIF(FORECAST($C202,S$205:S$216,$C$205:$C$216)>100,100,\nFORECAST($C202,S$205:S$216,$C$205:$C$216))))","v":100},null,null,null,{"$f":"IF(MAX(C205:C216)-MIN(C205:C216)<5,AVERAGEIF(C205:C216,\">0\",W205:W216),\nIF(FORECAST($C202,W$205:W$216,$C$205:$C$216)<0,0,\nIF(FORECAST($C202,W$205:W$216,$C$205:$C$216)>100,100,\nFORECAST($C202,W$205:W$216,$C$205:$C$216))))","v":0},{"$f":"IF(MAX(C205:C216)-MIN(C205:C216)<5,AVERAGEIF(C205:C216,\">0\",X205:X216),\nIF(FORECAST($C202,X$205:X$216,$C$205:$C$216)<0,0,\nIF(FORECAST($C202,X$205:X$216,$C$205:$C$216)>100,100,\nFORECAST($C202,X$205:X$216,$C$205:$C$216))))","v":99.978347484570619},null,null,null,{"$f":"IF(MAX(C205:C216)-MIN(C205:C216)<5,AVERAGEIF(C205:C216,\">0\",AB205:AB216),\nIF(FORECAST($C202,AB$205:AB$216,$C$205:$C$216)<0,0,\nIF(FORECAST($C202,AB$205:AB$216,$C$205:$C$216)>100,100,\nFORECAST($C202,AB$205:AB$216,$C$205:$C$216))))","v":0}]
[]
[null,"Survey","Year","Improved","Not shared",null,null,"Open defecation","Improved","Not shared",null,null,"Open defecation","Improved","Not shared",null,null,"Open defecation","Improved","Not shared",null,null,"Open defecation","Improved","Not shared",null,null,"Open defecation"]
[null,"MICS00",2000,{"$f":"IF(ISERROR(INDIRECT(CONCATENATE($B205,\"!H122\"))),\"\",INDIRECT(CONCATENATE($B205,\"!H122\")))","v":74.752020201464092},{"$f":"IF(ISERROR(INDIRECT(CONCATENATE($B205,\"!H129\"))),\"\",INDIRECT(CONCATENATE($B205,\"!H129\")))","v":"N/A"},null,null,{"$f":"IF(ISERROR(INDIRECT(CONCATENATE($B205,\"!H127\"))),\"\",INDIRECT(CONCATENATE($B205,\"!H127\")))","v":0},{"$f":"IF(ISERROR(INDIRECT(CONCATENATE($B205,\"!I122\"))),\"\",INDIRECT(CONCATENATE($B205,\"!I122\")))","v":84.93175475003784},{"$f":"IF(ISERROR(INDIRECT(CONCATENATE($B205,\"!I129\"))),\"\",INDIRECT(CONCATENATE($B205,\"!I129\")))","v":"N/A"},null,null,{"$f":"IF(ISERROR(INDIRECT(CONCATENATE($B205,\"!I127\"))),\"\",INDIRECT(CONCATENATE($B205,\"!I127\")))","v":0},{"$f":"IF(ISERROR(INDIRECT(CONCATENATE($B205,\"!J122\"))),\"\",INDIRECT(CONCATENATE($B205,\"!J122\")))","v":94.55692989693226},{"$f":"IF(ISERROR(INDIRECT(CONCATENATE($B205,\"!J129\"))),\"\",INDIRECT(CONCATENATE($B205,\"!J129\")))","v":"N/A"},null,null,{"$f":"IF(ISERROR(INDIRECT(CONCATENATE($B205,\"!J127\"))),\"\",INDIRECT(CONCATENATE($B205,\"!J127\")))","v":0},{"$f":"IF(ISERROR(INDIRECT(CONCATENATE($B205,\"!K122\"))),\"\",INDIRECT(CONCATENATE($B205,\"!K122\")))","v":92.393423523367943},{"$f":"IF(ISERROR(INDIRECT(CONCATENATE($B205,\"!K129\"))),\"\",INDIRECT(CONCATENATE($B205,\"!K129\")))","v":"N/A"},null,null,{"$f":"IF(ISERROR(INDIRECT(CONCATENATE($B205,\"!K127\"))),\"\",INDIRECT(CONCATENATE($B205,\"!K127\")))","v":0},{"$f":"IF(ISERROR(INDIRECT(CONCATENATE($B205,\"!L122\"))),\"\",INDIRECT(CONCATENATE($B205,\"!L122\")))","v":99.678129736697585},{"$f":"IF(ISERROR(INDIRECT(CONCATENATE($B205,\"!L129\"))),\"\",INDIRECT(CONCATENATE($B205,\"!L129\")))","v":"N/A"},null,null,{"$f":"IF(ISERROR(INDIRECT(CONCATENATE($B205,\"!L2127\"))),\"\",INDIRECT(CONCATENATE($B205,\"!L127\")))","v":0}]
[null,"DHS05",2005,72.242494687771838,90.303780504842678,null,null,0,87.9553401796028,85.023553666715941,null,null,0,98.264391722179909,93.016614702087949,null,null,0,99.388070242495246,96.171470545921764,null,null,0,99.939840658389272,97.199130006418116,null,null,0]
[null,"MICS12",2012,87.060470832332754,77.432515049370522,null,null,5.6332010787933436E-2,93.034575951809927,87.603370353871256,null,null,0,97.368295473123737,90.397388925520957,null,null,0,98.88060626330946,91.356698893239013,null,null,0,99.898007041552944,95.52568672454899,null,null,0]
[null,null,null,"","",null,null,"","","",null,null,"","","",null,null,"","","",null,null,"","","",null,null,""]
[null,null,null,"","",null,null,"","","",null,null,"","","",null,null,"","","",null,null,"","","",null,null,""]
[null,null,null,"","",null,null,"","","",null,null,"","","",null,null,"","","",null,null,"","","",null,null,""]
[null,null,null,"","",null,null,"","","",null,null,"","","",null,null,"","","",null,null,"","","",null,null,""]
[null,null,null,"","",null,null,"","","",null,null,"","","",null,null,"","","",null,null,"","","",null,null,""]
[null,null,null,"","",null,null,"","","",null,null,"","","",null,null,"","","",null,null,"","","",null,null,""]
[null,null,null,"","",null,null,"","","",null,null,"","","",null,null,"","","",null,null,"","","",null,null,""]
[null,null,null,"","",null,null,"","","",null,null,"","","",null,null,"","","",null,null,"","","",null,null,""]
[null,null,null,"","",null,null,"","","",null,null,"","","",null,null,"","","",null,null,"","","",null,null,""]
[]
[null,{"$f":"CONCATENATE(\"Urban use of sanitation facilities, \",C199,\"–\",C200)","v":"Urban use of sanitation facilities, 2000–2018"},null,null,null,null,null,null,null,null,null,null,null,null,null,null,null,null,"Data points used for regression"]
[]
[]
[]
[]
[]
[]
[]
[]
[]
[]
[]
[]
[]
[]
[]
[]
[]
[]
[]
[]
[]
[]
[]
[]
[]
[]
[]
[]
[]
[]
[]
[]
[]
[]
[]
[]
[]
[]
[]
[]
[]
[]
[]
[]
[]
[]
[]
[]
[]
[]
[]
[]
[]
[]
[]
[]
[]
[]
[]
[]
[]
[]
[]
[]
[]
[]
[]
[]
[]
[]
[]
[]
[]
[]
[]
[]
[]
[]
["RURAL",null,null,"Poorest",null,null,null,null,"Poor",null,null,null,null,"Middle",null,null,null,null,"Rich",null,null,null,null,"Richest"]
[null,null,null,"Improved","Basic","Limited","Unimproved","Open defecation","Improved","Basic","Limited","Unimproved","Open defecation","Improved","Basic","Limited","Unimproved","Open defecation","Improved","Basic","Limited","Unimproved","Open defecation","Improved","Basic","Limited","Unimproved","Open defecation"]
["Forecast period:",null,2000,{"$f":"IF((D301+H301)>100,D301*100/(D301+H301),D301)","v":59.485542172661212},{"$f":"D299*AVERAGEIF(E305:E316,\">0\")/100","v":54.237785655330782},{"$f":"D299*(100-AVERAGEIF(E305:E316,\">0\"))/100","v":5.247756517330429},{"$f":"100-(E299+F299+H299)","v":40.514457827338788},{"$f":"IF((D301+H301)>100,H301*100/(D301+H301),H301)","v":0},{"$f":"IF((I301+M301)>100,I301*100/(I301+M301),I301)","v":65.74609473105545},{"$f":"I299*AVERAGEIF(J305:J316,\">0\")/100","v":59.59420471848992},{"$f":"I299*(100-AVERAGEIF(J305:J316,\">0\"))/100","v":6.1518900125655307},{"$f":"100-(J299+K299+M299)","v":34.25390526894455},{"$f":"IF((I301+M301)>100,M301*100/(I301+M301),M301)","v":0},{"$f":"IF((N301+R301)>100,N301*100/(N301+R301),N301)","v":67.484928148623055},{"$f":"N299*AVERAGEIF(O305:O316,\">0\")/100","v":62.577242840716956},{"$f":"N299*(100-AVERAGEIF(O305:O316,\">0\"))/100","v":4.9076853079061022},{"$f":"100-(O299+P299+R299)","v":32.515071851376945},{"$f":"IF((N301+R301)>100,R301*100/(N301+R301),R301)","v":0},{"$f":"IF((S301+W301)>100,S301*100/(S301+W301),S301)","v":71.98019509045821},{"$f":"S299*AVERAGEIF(T305:T316,\">0\")/100","v":66.461098446294244},{"$f":"S299*(100-AVERAGEIF(T305:T316,\">0\"))/100","v":5.5190966441639615},{"$f":"100-(T299+U299+W299)","v":28.01980490954179},{"$f":"IF((S301+W301)>100,W301*100/(S301+W301),W301)","v":0},{"$f":"IF((X301+AB301)>100,X301*100/(X301+AB301),X301)","v":72.859705787787334},{"$f":"X299*AVERAGEIF(Y305:Y316,\">0\")/100","v":66.721363088932677},{"$f":"X299*(100-AVERAGEIF(Y305:Y316,\">0\"))/100","v":6.1383426988546601},{"$f":"100-(Y299+Z299+AB299)","v":27.140294212212666},{"$f":"IF((X301+AB301)>100,AB301*100/(X301+AB301),AB301)","v":0}]
[null,null,2018,{"$f":"IF((D302+H302)>100,D302*100/(D302+H302),D302)","v":62.060653437375549},{"$f":"D300*AVERAGEIF(E305:E316,\">0\")/100","v":56.585723115643511},{"$f":"D300*(100-AVERAGEIF(E305:E316,\">0\"))/100","v":5.4749303217320353},{"$f":"100-(E300+F300+H300)","v":37.105065712194857},{"$f":"IF((D302+H302)>100,H302*100/(D302+H302),H302)","v":0.8342808504295931},{"$f":"IF((I302+M302)>100,I302*100/(I302+M302),I302)","v":68.799815794349172},{"$f":"I300*AVERAGEIF(J305:J316,\">0\")/100","v":62.362187804687274},{"$f":"I300*(100-AVERAGEIF(J305:J316,\">0\"))/100","v":6.4376279896618938},{"$f":"100-(J300+K300+M300)","v":31.200184205650828},{"$f":"IF((I302+M302)>100,M302*100/(I302+M302),M302)","v":0},{"$f":"IF((N302+R302)>100,N302*100/(N302+R302),N302)","v":69.495717116136802},{"$f":"N300*AVERAGEIF(O305:O316,\">0\")/100","v":64.441801831495255},{"$f":"N300*(100-AVERAGEIF(O305:O316,\">0\"))/100","v":5.0539152846415556},{"$f":"100-(O300+P300+R300)","v":30.504282883863183},{"$f":"IF((N302+R302)>100,R302*100/(N302+R302),R302)","v":0},{"$f":"IF((S302+W302)>100,S302*100/(S302+W302),S302)","v":75.792429046218786},{"$f":"S300*AVERAGEIF(T305:T316,\">0\")/100","v":69.981028559232996},{"$f":"S300*(100-AVERAGEIF(T305:T316,\">0\"))/100","v":5.8114004869857929},{"$f":"100-(T300+U300+W300)","v":24.207570953781214},{"$f":"IF((S302+W302)>100,W302*100/(S302+W302),W302)","v":0},{"$f":"IF((X302+AB302)>100,X302*100/(X302+AB302),X302)","v":88.453376822901191},{"$f":"X300*AVERAGEIF(Y305:Y316,\">0\")/100","v":81.001286069318908},{"$f":"X300*(100-AVERAGEIF(Y305:Y316,\">0\"))/100","v":7.452090753582282},{"$f":"100-(Y300+Z300+AB300)","v":11.546623177098809},{"$f":"IF((X302+AB302)>100,AB302*100/(X302+AB302),AB302)","v":0}]
["Regression period:",null,{"$f":"MinRegYear(C299,C305:C316)","v":2000},{"$f":"IF(MAX(C305:C316)-MIN(C305:C316)<5,AVERAGEIF(C305:C316,\">0\",D305:D316),\nIF(FORECAST($C301,D$305:D$316,$C$305:$C$316)<0,0,\nIF(FORECAST($C301,D$305:D$316,$C$305:$C$316)>100,100,\nFORECAST($C301,D$305:D$316,$C$305:$C$316))))","v":59.485542172661212},null,null,null,{"$f":"IF(MAX(C305:C316)-MIN(C305:C316)<5,AVERAGEIF(C305:C316,\">0\",H305:H316),\nIF(FORECAST($C301,H$305:H$316,$C$305:$C$316)<0,0,\nIF(FORECAST($C301,H$305:H$316,$C$305:$C$316)>100,100,\nFORECAST($C301,H$305:H$316,$C$305:$C$316))))","v":0},{"$f":"IF(MAX(C305:C316)-MIN(C305:C316)<5,AVERAGEIF(C305:C316,\">0\",I305:I316),\nIF(FORECAST($C301,I$305:I$316,$C$305:$C$316)<0,0,\nIF(FORECAST($C301,I$305:I$316,$C$305:$C$316)>100,100,\nFORECAST($C301,I$305:I$316,$C$305:$C$316))))","v":65.74609473105545},null,null,null,{"$f":"IF(MAX(C305:C316)-MIN(C305:C316)<5,AVERAGEIF(C305:C316,\">0\",M305:M316),\nIF(FORECAST($C301,M$305:M$316,$C$305:$C$316)<0,0,\nIF(FORECAST($C301,M$305:M$316,$C$305:$C$316)>100,100,\nFORECAST($C301,M$305:M$316,$C$305:$C$316))))","v":0},{"$f":"IF(MAX(C305:C316)-MIN(C305:C316)<5,AVERAGEIF(C305:C316,\">0\",N305:N316),\nIF(FORECAST($C301,N$305:N$316,$C$305:$C$316)<0,0,\nIF(FORECAST($C301,N$305:N$316,$C$305:$C$316)>100,100,\nFORECAST($C301,N$305:N$316,$C$305:$C$316))))","v":67.484928148623055},null,null,null,{"$f":"IF(MAX(C305:C316)-MIN(C305:C316)<5,AVERAGEIF(C305:C316,\">0\",R305:R316),\nIF(FORECAST($C301,R$305:R$316,$C$305:$C$316)<0,0,\nIF(FORECAST($C301,R$305:R$316,$C$305:$C$316)>100,100,\nFORECAST($C301,R$305:R$316,$C$305:$C$316))))","v":0},{"$f":"IF(MAX(C305:C316)-MIN(C305:C316)<5,AVERAGEIF(C305:C316,\">0\",S305:S316),\nIF(FORECAST($C301,S$305:S$316,$C$305:$C$316)<0,0,\nIF(FORECAST($C301,S$305:S$316,$C$305:$C$316)>100,100,\nFORECAST($C301,S$305:S$316,$C$305:$C$316))))","v":71.98019509045821},null,null,null,{"$f":"IF(MAX(C305:C316)-MIN(C305:C316)<5,AVERAGEIF(C305:C316,\">0\",W305:W316),\nIF(FORECAST($C301,W$305:W$316,$C$305:$C$316)<0,0,\nIF(FORECAST($C301,W$305:W$316,$C$305:$C$316)>100,100,\nFORECAST($C301,W$305:W$316,$C$305:$C$316))))","v":0},{"$f":"IF(MAX(C305:C316)-MIN(C305:C316)<5,AVERAGEIF(C305:C316,\">0\",X305:X316),\nIF(FORECAST($C301,X$305:X$316,$C$305:$C$316)<0,0,\nIF(FORECAST($C301,X$305:X$316,$C$305:$C$316)>100,100,\nFORECAST($C301,X$305:X$316,$C$305:$C$316))))","v":72.859705787787334},null,null,null,{"$f":"IF(MAX(C305:C316)-MIN(C305:C316)<5,AVERAGEIF(C305:C316,\">0\",AB305:AB316),\nIF(FORECAST($C301,AB$305:AB$316,$C$305:$C$316)<0,0,\nIF(FORECAST($C301,AB$305:AB$316,$C$305:$C$316)>100,100,\nFORECAST($C301,AB$305:AB$316,$C$305:$C$316))))","v":0}]
[null,null,{"$f":"MaxRegYear(C300,C305:C316)","v":2014},{"$f":"IF(MAX(C305:C316)-MIN(C305:C316)<5,AVERAGEIF(C305:C316,\">0\",D305:D316),\nIF(FORECAST($C302,D$305:D$316,$C$305:$C$316)<0,0,\nIF(FORECAST($C302,D$305:D$316,$C$305:$C$316)>100,100,\nFORECAST($C302,D$305:D$316,$C$305:$C$316))))","v":62.060653437375549},null,null,null,{"$f":"IF(MAX(C305:C316)-MIN(C305:C316)<5,AVERAGEIF(C305:C316,\">0\",H305:H316),\nIF(FORECAST($C302,H$305:H$316,$C$305:$C$316)<0,0,\nIF(FORECAST($C302,H$305:H$316,$C$305:$C$316)>100,100,\nFORECAST($C302,H$305:H$316,$C$305:$C$316))))","v":0.8342808504295931},{"$f":"IF(MAX(C305:C316)-MIN(C305:C316)<5,AVERAGEIF(C305:C316,\">0\",I305:I316),\nIF(FORECAST($C302,I$305:I$316,$C$305:$C$316)<0,0,\nIF(FORECAST($C302,I$305:I$316,$C$305:$C$316)>100,100,\nFORECAST($C302,I$305:I$316,$C$305:$C$316))))","v":68.799815794349172},null,null,null,{"$f":"IF(MAX(C305:C316)-MIN(C305:C316)<5,AVERAGEIF(C305:C316,\">0\",M305:M316),\nIF(FORECAST($C302,M$305:M$316,$C$305:$C$316)<0,0,\nIF(FORECAST($C302,M$305:M$316,$C$305:$C$316)>100,100,\nFORECAST($C302,M$305:M$316,$C$305:$C$316))))","v":0},{"$f":"IF(MAX(C305:C316)-MIN(C305:C316)<5,AVERAGEIF(C305:C316,\">0\",N305:N316),\nIF(FORECAST($C302,N$305:N$316,$C$305:$C$316)<0,0,\nIF(FORECAST($C302,N$305:N$316,$C$305:$C$316)>100,100,\nFORECAST($C302,N$305:N$316,$C$305:$C$316))))","v":69.495717116136802},null,null,null,{"$f":"IF(MAX(C305:C316)-MIN(C305:C316)<5,AVERAGEIF(C305:C316,\">0\",R305:R316),\nIF(FORECAST($C302,R$305:R$316,$C$305:$C$316)<0,0,\nIF(FORECAST($C302,R$305:R$316,$C$305:$C$316)>100,100,\nFORECAST($C302,R$305:R$316,$C$305:$C$316))))","v":0},{"$f":"IF(MAX(C305:C316)-MIN(C305:C316)<5,AVERAGEIF(C305:C316,\">0\",S305:S316),\nIF(FORECAST($C302,S$305:S$316,$C$305:$C$316)<0,0,\nIF(FORECAST($C302,S$305:S$316,$C$305:$C$316)>100,100,\nFORECAST($C302,S$305:S$316,$C$305:$C$316))))","v":75.792429046218786},null,null,null,{"$f":"IF(MAX(C305:C316)-MIN(C305:C316)<5,AVERAGEIF(C305:C316,\">0\",W305:W316),\nIF(FORECAST($C302,W$305:W$316,$C$305:$C$316)<0,0,\nIF(FORECAST($C302,W$305:W$316,$C$305:$C$316)>100,100,\nFORECAST($C302,W$305:W$316,$C$305:$C$316))))","v":0},{"$f":"IF(MAX(C305:C316)-MIN(C305:C316)<5,AVERAGEIF(C305:C316,\">0\",X305:X316),\nIF(FORECAST($C302,X$305:X$316,$C$305:$C$316)<0,0,\nIF(FORECAST($C302,X$305:X$316,$C$305:$C$316)>100,100,\nFORECAST($C302,X$305:X$316,$C$305:$C$316))))","v":88.453376822901191},null,null,null,{"$f":"IF(MAX(C305:C316)-MIN(C305:C316)<5,AVERAGEIF(C305:C316,\">0\",AB305:AB316),\nIF(FORECAST($C302,AB$305:AB$316,$C$305:$C$316)<0,0,\nIF(FORECAST($C302,AB$305:AB$316,$C$305:$C$316)>100,100,\nFORECAST($C302,AB$305:AB$316,$C$305:$C$316))))","v":0}]
[]
[null,"Survey","Year","Improved","Not shared",null,null,"Open defecation","Improved","Not shared",null,null,"Open defecation","Improved","Not shared",null,null,"Open defecation","Improved","Not shared",null,null,"Open defecation","Improved","Not shared",null,null,"Open defecation"]
[null,"MICS00",2000,{"$f":"IF(ISERROR(INDIRECT(CONCATENATE($B305,\"!M122\"))),\"\",INDIRECT(CONCATENATE($B305,\"!M122\")))","v":52.551119711098366},{"$f":"IF(ISERROR(INDIRECT(CONCATENATE($B305,\"!M129\"))),\"\",INDIRECT(CONCATENATE($B305,\"!M129\")))","v":"N/A"},null,null,{"$f":"IF(ISERROR(INDIRECT(CONCATENATE($B305,\"!M127\"))),\"\",INDIRECT(CONCATENATE($B305,\"!M127\")))","v":0},{"$f":"IF(ISERROR(INDIRECT(CONCATENATE($B305,\"!N122\"))),\"\",INDIRECT(CONCATENATE($B305,\"!N122\")))","v":59.780589893656881},{"$f":"IF(ISERROR(INDIRECT(CONCATENATE($B305,\"!N129\"))),\"\",INDIRECT(CONCATENATE($B305,\"!N129\")))","v":"N/A"},null,null,{"$f":"IF(ISERROR(INDIRECT(CONCATENATE($B305,\"!N127\"))),\"\",INDIRECT(CONCATENATE($B305,\"!N127\")))","v":0},{"$f":"IF(ISERROR(INDIRECT(CONCATENATE($B305,\"!O122\"))),\"\",INDIRECT(CONCATENATE($B305,\"!O122\")))","v":62.087704689867465},{"$f":"IF(ISERROR(INDIRECT(CONCATENATE($B305,\"!O129\"))),\"\",INDIRECT(CONCATENATE($B305,\"!O129\")))","v":"N/A"},null,null,{"$f":"IF(ISERROR(INDIRECT(CONCATENATE($B305,\"!O127\"))),\"\",INDIRECT(CONCATENATE($B305,\"!O127\")))","v":0},{"$f":"IF(ISERROR(INDIRECT(CONCATENATE($B305,\"!P122\"))),\"\",INDIRECT(CONCATENATE($B305,\"!P122\")))","v":67.260699336536049},{"$f":"IF(ISERROR(INDIRECT(CONCATENATE($B305,\"!P129\"))),\"\",INDIRECT(CONCATENATE($B305,\"!P129\")))","v":"N/A"},null,null,{"$f":"IF(ISERROR(INDIRECT(CONCATENATE($B305,\"!P127\"))),\"\",INDIRECT(CONCATENATE($B305,\"!P127\")))","v":0},{"$f":"IF(ISERROR(INDIRECT(CONCATENATE($B305,\"!Q122\"))),\"\",INDIRECT(CONCATENATE($B305,\"!Q122\")))","v":69.801124234469242},{"$f":"IF(ISERROR(INDIRECT(CONCATENATE($B305,\"!Q129\"))),\"\",INDIRECT(CONCATENATE($B305,\"!Q129\")))","v":"N/A"},null,null,{"$f":"IF(ISERROR(INDIRECT(CONCATENATE($B305,\"!Q2127\"))),\"\",INDIRECT(CONCATENATE($B305,\"!Q127\")))","v":0}]
[null,"DHS05",2005,72.29280612988137,92.915808397205694,null,null,0,77.063289117772143,93.032768165088655,null,null,0,77.455450137744819,95.215022234419664,null,null,0,81.432271367096646,96.691717003477635,null,null,0,83.672156677444391,94.255833228570111,null,null,0]
[null,"MICS12",2012,56.739621498442894,89.440386652346263,null,null,0.78732998005908894,64.102495044308256,88.253146876007591,null,null,0,65.353301935952274,90.240440362805501,null,null,0,71.876755799737126,87.97324080268541,null,null,0,84.041008422657839,88.894406996847991,null,null,0]
[null,null,null,"","",null,null,"","","",null,null,"","","",null,null,"","","",null,null,"","","",null,null,""]
[null,null,null,"","",null,null,"","","",null,null,"","","",null,null,"","","",null,null,"","","",null,null,""]
[null,null,null,"","",null,null,"","","",null,null,"","","",null,null,"","","",null,null,"","","",null,null,""]
[null,null,null,"","",null,null,"","","",null,null,"","","",null,null,"","","",null,null,"","","",null,null,""]
[null,null,null,"","",null,null,"","","",null,null,"","","",null,null,"","","",null,null,"","","",null,null,""]
[null,null,null,"","",null,null,"","","",null,null,"","","",null,null,"","","",null,null,"","","",null,null,""]
[null,null,null,"","",null,null,"","","",null,null,"","","",null,null,"","","",null,null,"","","",null,null,""]
[null,null,null,"","",null,null,"","","",null,null,"","","",null,null,"","","",null,null,"","","",null,null,""]
[null,null,null,"","",null,null,"","","",null,null,"","","",null,null,"","","",null,null,"","","",null,null,""]
[]
[null,{"$f":"CONCATENATE(\"Rural use of sanitation facilities, \",C299,\"–\",C300)","v":"Rural use of sanitation facilities, 2000–2018"},null,null,null,null,null,null,null,null,null,null,null,null,null,null,null,null,"Data points used for regression"]

{"sheet":"Hygiene","index":3,"n_rows":91,"n_cols":25,"rows_kept":91,"cut":false,"hidden":false,"merged":[[39,22,40,22],[39,23,40,23],[39,24,40,24],[31,4,32,5],[39,16,40,16],[39,17,40,17],[39,18,40,18],[39,19,40,19],[39,20,40,20],[39,21,40,21],[36,24,37,24],[39,6,40,7],[39,8,40,8],[39,9,40,9],[39,10,40,10],[39,11,40,11],[39,12,40,12],[39,13,40,13],[39,14,40,14],[39,15,40,15],[36,18,37,18],[36,12,37,12],[36,13,37,13],[36,14,37,14],[36,15,37,15],[36,16,37,16],[36,17,37,17],[36,19,37,19],[36,20,37,20],[36,21,37,21],[36,22,37,22],[36,23,37,23],[33,20,34,20],[33,21,34,21],[33,22,34,22],[33,23,34,23],[33,24,34,24],[33,15,34,15],[33,16,34,16],[33,17,34,17],[33,18,34,18],[36,6,37,7],[36,8,37,8],[36,9,37,9],[36,10,37,10],[36,11,37,11],[33,10,34,10],[33,11,34,11],[33,12,34,12],[33,13,34,13],[33,14,34,14],[6,1,6,7],[3,1,3,24],[4,1,4,24],[33,1,34,3],[31,6,32,9],[31,10,31,12],[31,13,31,15],[6,10,6,15],[6,18,6,23],[33,19,34,19],[31,16,31,18],[31,19,31,21],[31,22,31,24],[33,6,34,7],[33,8,34,8],[33,9,34,9]]}
[]
[]
[]
[null,"Access to hygiene facilities by wealth quintile (%)"]
[null,{"$f":"IF(ISERROR(INDIRECT(CONCATENATE($E$32,\"!A2\"))),\"\",INDIRECT(CONCATENATE($E$32,\"!A2\")))","v":"Republic of Moldova"}]
[]
[null,{"$f":"CONCATENATE(\"National \",IF(ISERROR(INDIRECT(CONCATENATE($E$32,\"!A2\"))),\"\",INDIRECT(CONCATENATE($E$32,\"!A210\"))))","v":"National Access to hygiene facilities "},null,null,null,null,null,null,null,null,{"$f":"CONCATENATE(\"Urban \",IF(ISERROR(INDIRECT(CONCATENATE($E$32,\"!A2\"))),\"\",INDIRECT(CONCATENATE($E$32,\"!A210\"))))","v":"Urban Access to hygiene facilities "},null,null,null,null,null,null,null,{"$f":"CONCATENATE(\"Rural \",IF(ISERROR(INDIRECT(CONCATENATE($E$32,\"!A2\"))),\"\",INDIRECT(CONCATENATE($E$32,\"!A210\"))))","v":"Rural Access to hygiene facilities "}]
[]
[]
[]
[]
[]
[]
[]
[]
[]
[]
[]
[]
[]
[]
[]
[]
[]
[]
[]
[]
[]
[]
[]
[]
[null,null,null,null,{"$f":"INDEX(B88:B100,A88)","v":"MICS12"},null,{"$f":"IF(ISERROR(INDIRECT(CONCATENATE($E$32,\"!A2\"))),\"\",INDIRECT(CONCATENATE($E$32,\"!A2\")))","v":"Republic of Moldova"},null,null,null,"Poorest",null,null,"Poor",null,null,"Middle",null,null,"Rich",null,null,"Richest"]
[null,null,null,null,null,null,null,null,null,null,"Basic","Limited","No facility","Basic","Limited","No facility","Basic","Limited","No facility","Basic","Limited","No facility","Basic","Limited","No facility"]
[null,">>>  Select Survey :   ",null,null,null,null,"NATIONAL",null,null,{"$f":"IF(ISERROR(INDIRECT(CONCATENATE(#REF!,\"!A2\"))),\"\",INDIRECT(CONCATENATE(#REF!,\"!A210\")))","v":""},{"$f":"IF(ISERROR(INDIRECT(CONCATENATE($E$32,\"!C222\"))),\"\",INDIRECT(CONCATENATE($E$32,\"!C222\")))","v":72.852498028053716},{"$f":"IF(ISERROR(INDIRECT(CONCATENATE($E$32,\"!C223\"))),\"\",INDIRECT(CONCATENATE($E$32,\"!C223\")))","v":16.007148715603872},{"$f":"IF(ISERROR(INDIRECT(CONCATENATE($E$32,\"!C224\"))),\"\",INDIRECT(CONCATENATE($E$32,\"!C224\")))","v":11.14035325634257},{"$f":"IF(ISERROR(INDIRECT(CONCATENATE($E$32,\"!D222\"))),\"\",INDIRECT(CONCATENATE($E$32,\"!D222\")))","v":81.851618821472741},{"$f":"IF(ISERROR(INDIRECT(CONCATENATE($E$32,\"!D223\"))),\"\",INDIRECT(CONCATENATE($E$32,\"!D223\")))","v":10.597601218625458},{"$f":"IF(ISERROR(INDIRECT(CONCATENATE($E$32,\"!D224\"))),\"\",INDIRECT(CONCATENATE($E$32,\"!D224\")))","v":7.5507799599019556},{"$f":"IF(ISERROR(INDIRECT(CONCATENATE($E$32,\"!E222\"))),\"\",INDIRECT(CONCATENATE($E$32,\"!E222\")))","v":88.390083738150423},{"$f":"IF(ISERROR(INDIRECT(CONCATENATE($E$32,\"!E223\"))),\"\",INDIRECT(CONCATENATE($E$32,\"!E223\")))","v":5.1307183613672427},{"$f":"IF(ISERROR(INDIRECT(CONCATENATE($E$32,\"!E224\"))),\"\",INDIRECT(CONCATENATE($E$32,\"!E224\")))","v":6.4791979004823101},{"$f":"IF(ISERROR(INDIRECT(CONCATENATE($E$32,\"!F222\"))),\"\",INDIRECT(CONCATENATE($E$32,\"!F222\")))","v":93.168101215035534},{"$f":"IF(ISERROR(INDIRECT(CONCATENATE($E$32,\"!F223\"))),\"\",INDIRECT(CONCATENATE($E$32,\"!F223\")))","v":2.0641670691412783},{"$f":"IF(ISERROR(INDIRECT(CONCATENATE($E$32,\"!F224\"))),\"\",INDIRECT(CONCATENATE($E$32,\"!F224\")))","v":4.7677317158231105},{"$f":"IF(ISERROR(INDIRECT(CONCATENATE($E$32,\"!G222\"))),\"\",INDIRECT(CONCATENATE($E$32,\"!G222\")))","v":95.651510025840594},{"$f":"IF(ISERROR(INDIRECT(CONCATENATE($E$32,\"!G223\"))),\"\",INDIRECT(CONCATENATE($E$32,\"!G223\")))","v":0.84248025588061992},{"$f":"IF(ISERROR(INDIRECT(CONCATENATE($E$32,\"!G224\"))),\"\",INDIRECT(CONCATENATE($E$32,\"!G224\")))","v":3.5060097182789698}]
[]
[]
[null,null,null,null,null,null,"URBAN",null,null,{"$f":"IF(ISERROR(INDIRECT(CONCATENATE(#REF!,\"!A2\"))),\"\",INDIRECT(CONCATENATE(#REF!,\"!A210\")))","v":""},{"$f":"IF(ISERROR(INDIRECT(CONCATENATE($E$32,\"!H222\"))),\"\",INDIRECT(CONCATENATE($E$32,\"!H222\")))","v":85.640528573677145},{"$f":"IF(ISERROR(INDIRECT(CONCATENATE($E$32,\"!H223\"))),\"\",INDIRECT(CONCATENATE($E$32,\"!H223\")))","v":8.9695580320444126},{"$f":"IF(ISERROR(INDIRECT(CONCATENATE($E$32,\"!H224\"))),\"\",INDIRECT(CONCATENATE($E$32,\"!H224\")))","v":5.3899133942783015},{"$f":"IF(ISERROR(INDIRECT(CONCATENATE($E$32,\"!I222\"))),\"\",INDIRECT(CONCATENATE($E$32,\"!I222\")))","v":93.831175763466518},{"$f":"IF(ISERROR(INDIRECT(CONCATENATE($E$32,\"!I223\"))),\"\",INDIRECT(CONCATENATE($E$32,\"!I223\")))","v":1.1721807378847198},{"$f":"IF(ISERROR(INDIRECT(CONCATENATE($E$32,\"!I224\"))),\"\",INDIRECT(CONCATENATE($E$32,\"!I224\")))","v":4.996643498648802},{"$f":"IF(ISERROR(INDIRECT(CONCATENATE($E$32,\"!J222\"))),\"\",INDIRECT(CONCATENATE($E$32,\"!J222\")))","v":95.05829983803963},{"$f":"IF(ISERROR(INDIRECT(CONCATENATE($E$32,\"!J223\"))),\"\",INDIRECT(CONCATENATE($E$32,\"!J223\")))","v":1.2153065566933596},{"$f":"IF(ISERROR(INDIRECT(CONCATENATE($E$32,\"!J224\"))),\"\",INDIRECT(CONCATENATE($E$32,\"!J224\")))","v":3.7263936052670212},{"$f":"IF(ISERROR(INDIRECT(CONCATENATE($E$32,\"!K222\"))),\"\",INDIRECT(CONCATENATE($E$32,\"!K222\")))","v":96.002782377049996},{"$f":"IF(ISERROR(INDIRECT(CONCATENATE($E$32,\"!K223\"))),\"\",INDIRECT(CONCATENATE($E$32,\"!K223\")))","v":0.33645791402789493},{"$f":"IF(ISERROR(INDIRECT(CONCATENATE($E$32,\"!K224\"))),\"\",INDIRECT(CONCATENATE($E$32,\"!K224\")))","v":3.6607597089220594},{"$f":"IF(ISERROR(INDIRECT(CONCATENATE($E$32,\"!L222\"))),\"\",INDIRECT(CONCATENATE($E$32,\"!L222\")))","v":96.539867548516369},{"$f":"IF(ISERROR(INDIRECT(CONCATENATE($E$32,\"!L223\"))),\"\",INDIRECT(CONCATENATE($E$32,\"!L223\")))","v":0.61898432812542448},{"$f":"IF(ISERROR(INDIRECT(CONCATENATE($E$32,\"!L224\"))),\"\",INDIRECT(CONCATENATE($E$32,\"!L224\")))","v":2.8411481233582756}]
[]
[]
[null,null,null,null,null,null,"RURAL",null,null,{"$f":"IF(ISERROR(INDIRECT(CONCATENATE(#REF!,\"!A2\"))),\"\",INDIRECT(CONCATENATE(#REF!,\"!A210\")))","v":""},{"$f":"IF(ISERROR(INDIRECT(CONCATENATE($E$32,\"!M222\"))),\"\",INDIRECT(CONCATENATE($E$32,\"!M222\")))","v":69.062973150833457},{"$f":"IF(ISERROR(INDIRECT(CONCATENATE($E$32,\"!M223\"))),\"\",INDIRECT(CONCATENATE($E$32,\"!M223\")))","v":18.589024904572526},{"$f":"IF(ISERROR(INDIRECT(CONCATENATE($E$32,\"!M224\"))),\"\",INDIRECT(CONCATENATE($E$32,\"!M224\")))","v":12.348001944594131},{"$f":"IF(ISERROR(INDIRECT(CONCATENATE($E$32,\"!N222\"))),\"\",INDIRECT(CONCATENATE($E$32,\"!N222\")))","v":79.19144132955492},{"$f":"IF(ISERROR(INDIRECT(CONCATENATE($E$32,\"!N223\"))),\"\",INDIRECT(CONCATENATE($E$32,\"!N223\")))","v":11.230051355278825},{"$f":"IF(ISERROR(INDIRECT(CONCATENATE($E$32,\"!N224\"))),\"\",INDIRECT(CONCATENATE($E$32,\"!N224\")))","v":9.5785073151662505},{"$f":"IF(ISERROR(INDIRECT(CONCATENATE($E$32,\"!O222\"))),\"\",INDIRECT(CONCATENATE($E$32,\"!O222\")))","v":83.311402922459237},{"$f":"IF(ISERROR(INDIRECT(CONCATENATE($E$32,\"!O223\"))),\"\",INDIRECT(CONCATENATE($E$32,\"!O223\")))","v":10.024182609075686},{"$f":"IF(ISERROR(INDIRECT(CONCATENATE($E$32,\"!O224\"))),\"\",INDIRECT(CONCATENATE($E$32,\"!O224\")))","v":6.6644144684650897},{"$f":"IF(ISERROR(INDIRECT(CONCATENATE($E$32,\"!P222\"))),\"\",INDIRECT(CONCATENATE($E$32,\"!P222\")))","v":86.890784844587856},{"$f":"IF(ISERROR(INDIRECT(CONCATENATE($E$32,\"!P223\"))),\"\",INDIRECT(CONCATENATE($E$32,\"!P223\")))","v":5.2870390558470728},{"$f":"IF(ISERROR(INDIRECT(CONCATENATE($E$32,\"!P224\"))),\"\",INDIRECT(CONCATENATE($E$32,\"!P224\")))","v":7.8221760995650218},{"$f":"IF(ISERROR(INDIRECT(CONCATENATE($E$32,\"!Q222\"))),\"\",INDIRECT(CONCATENATE($E$32,\"!Q222\")))","v":92.840205738519828},{"$f":"IF(ISERROR(INDIRECT(CONCATENATE($E$32,\"!Q223\"))),\"\",INDIRECT(CONCATENATE($E$32,\"!Q223\")))","v":2.6014407203721825},{"$f":"IF(ISERROR(INDIRECT(CONCATENATE($E$32,\"!Q224\"))),\"\",INDIRECT(CONCATENATE($E$32,\"!Q224\")))","v":4.558353541107909}]
[]
[]
[]
[]
[]
[]
[]
[]
[]
[]
[]
[]
[]
[]
[]
[]
[]
[]
[]
[]
[]
[]
[]
[]
[]
[]
[]
[]
[]
[]
[]
[]
[]
[]
[]
[]
[]
[]
[]
[]
[]
[]
[]
[]
[]
[]
[]
[3,"MICS00"]
[null,"DHS05"]
[null,"MICS12"]
[null,"Template"]

{"sheet":"MICS00","index":4,"n_rows":1072,"n_cols":71,"rows_kept":1072,"cut":false,"hidden":false,"merged":[[340,52,341,52],[342,52,343,52],[344,52,345,52],[346,52,347,52],[348,52,349,52],[350,52,351,52],[352,52,353,52],[152,52,161,52],[219,54,219,58],[219,59,219,63],[219,64,219,68],[221,52,223,52],[224,52,225,52],[226,52,229,52],[258,54,258,58],[258,59,258,63],[258,64,258,68],[260,52,262,52],[263,52,266,52],[267,52,269,52],[270,52,272,52],[273,52,275,52],[276,52,283,52],[338,54,338,58],[338,59,338,63],[338,64,338,68],[150,52,151,52],[13,54,13,58],[13,59,13,63],[13,64,13,68],[15,52,16,52],[17,52,20,52],[21,52,22,52],[26,54,26,58],[26,59,26,63],[26,64,26,68],[55,54,55,58],[55,59,55,63],[55,64,55,68],[119,54,119,58],[119,59,119,63],[119,64,119,68],[121,52,122,52],[123,52,126,52],[127,52,128,52],[132,54,132,58],[132,59,132,63],[132,64,132,68],[134,52,138,52],[40,52,41,52],[42,52,43,52],[44,52,45,52],[46,52,48,52],[49,0,51,0],[49,52,51,52],[52,0,54,0],[52,52,54,52],[139,0,142,0],[139,52,142,52],[143,0,146,0],[143,52,146,52],[147,0,149,0],[147,52,149,52],[13,2,13,6],[13,7,13,11],[28,52,29,52],[30,0,31,0],[30,52,31,52],[32,0,33,0],[32,52,33,52],[34,52,35,52],[36,52,37,52],[38,0,39,0],[38,52,39,52],[28,0,29,0],[34,0,35,0],[36,0,37,0],[40,0,41,0],[42,0,43,0],[44,0,45,0],[26,2,26,6],[26,7,26,11],[26,12,26,16],[13,12,13,16],[15,0,16,0],[17,0,20,0],[21,0,22,0],[23,0,25,0],[107,0,107,1],[119,2,119,6],[119,7,119,11],[57,0,70,0],[55,2,55,6],[55,7,55,11],[55,12,55,16],[152,0,160,0],[132,2,132,6],[132,7,132,11],[132,12,132,16],[134,0,138,0],[119,12,119,16],[121,0,122,0],[123,0,126,0],[127,0,128,0],[129,0,131,0],[150,0,151,0],[46,0,48,0],[1024,0,1024,2],[1025,0,1025,1],[1030,0,1032,0],[1033,0,1033,2],[398,2,398,5],[219,7,219,11],[219,12,219,16],[221,0,223,0],[207,0,207,1],[219,2,219,6],[405,2,405,3],[405,7,405,8],[405,12,405,13],[406,2,406,3],[406,7,406,8],[406,12,406,13],[401,1,444,1],[402,2,402,3],[402,7,402,8],[402,12,402,13],[403,2,403,3],[403,7,403,8],[403,12,403,13],[404,2,404,3],[404,7,404,8],[404,12,404,13],[398,7,398,10],[398,12,398,15],[399,2,399,4],[399,7,399,9],[399,12,399,14],[400,2,401,3],[400,7,401,8],[400,12,401,13],[411,2,411,3],[411,7,411,8],[411,12,411,13],[412,2,412,3],[412,7,412,8],[412,12,412,13],[409,2,409,3],[409,7,409,8],[409,12,409,13],[410,2,410,3],[410,7,410,8],[410,12,410,13],[407,2,407,3],[407,7,407,8],[407,12,407,13],[408,2,408,3],[408,7,408,8],[408,12,408,13],[417,2,417,3],[417,7,417,8],[417,12,417,13],[418,2,418,3],[418,7,418,8],[418,12,418,13],[415,2,415,3],[415,7,415,8],[415,12,415,13],[416,2,416,3],[416,7,416,8],[416,12,416,13],[413,2,413,3],[413,7,413,8],[413,12,413,13],[414,2,414,3],[414,7,414,8],[414,12,414,13],[423,2,423,3],[423,7,423,8],[423,12,423,13],[424,2,424,3],[424,7,424,8],[424,12,424,13],[421,2,421,3],[421,7,421,8],[421,12,421,13],[422,2,422,3],[422,7,422,8],[422,12,422,13],[419,2,419,3],[419,7,419,8],[419,12,419,13],[420,2,420,3],[420,7,420,8],[420,12,420,13],[429,2,429,3],[429,7,429,8],[429,12,429,13],[430,2,430,3],[430,7,430,8],[430,12,430,13],[427,2,427,3],[427,7,427,8],[427,12,427,13],[428,2,428,3],[428,7,428,8],[428,12,428,13],[425,2,425,3],[425,7,425,8],[425,12,425,13],[426,2,426,4],[426,7,426,9],[426,12,426,14],[435,2,435,3],[435,7,435,8],[435,12,435,13],[436,2,436,3],[436,7,436,8],[436,12,436,13],[433,2,433,3],[433,7,433,8],[433,12,433,13],[434,2,434,3],[434,7,434,8],[434,12,434,13],[431,2,431,3],[431,7,431,8],[431,12,431,13],[432,2,432,3],[432,7,432,8],[432,12,432,13],[441,2,441,3],[441,7,441,8],[441,12,441,13],[442,2,442,3],[442,7,442,8],[442,12,442,13],[439,2,439,3],[439,7,439,8],[439,12,439,13],[440,2,440,3],[440,7,440,8],[440,12,440,13],[437,2,437,3],[437,7,437,8],[437,12,437,13],[438,2,438,3],[438,7,438,8],[438,12,438,13],[447,2,447,3],[447,7,447,8],[447,12,447,13],[448,2,448,3],[448,7,448,8],[448,12,448,13],[445,2,445,3],[445,7,445,8],[445,12,445,13],[446,2,446,3],[446,7,446,8],[446,12,446,13],[443,2,443,3],[443,7,443,8],[443,12,443,13],[444,2,444,3],[444,7,444,8],[444,12,444,13],[454,2,454,3],[454,7,454,8],[454,12,454,13],[455,2,455,3],[455,7,455,8],[455,12,455,13],[451,2,451,6],[451,7,451,11],[451,12,451,16],[452,2,453,3],[452,4,452,6],[452,7,453,8],[452,9,452,11],[452,12,453,13],[452,14,452,16],[449,2,449,3],[449,7,449,8],[449,12,449,13],[450,2,450,3],[450,7,450,8],[450,12,450,13],[461,2,461,3],[461,7,461,8],[461,12,461,13],[462,2,462,3],[462,7,462,8],[462,12,462,13],[458,2,459,3],[458,7,459,8],[458,12,459,13],[460,2,460,3],[460,7,460,8],[460,12,460,13],[456,2,456,3],[456,7,456,8],[456,12,456,13],[457,2,457,4],[457,7,457,9],[457,12,457,14],[467,2,467,3],[467,7,467,8],[467,12,467,13],[468,2,468,3],[468,7,468,8],[468,12,468,13],[465,2,465,3],[465,7,465,8],[465,12,465,13],[466,2,466,3],[466,7,466,8],[466,12,466,13],[463,2,463,3],[463,7,463,8],[463,12,463,13],[464,2,464,3],[464,7,464,8],[464,12,464,13],[473,2,473,3],[473,7,473,8],[473,12,473,13],[474,2,474,3],[474,7,474,8],[474,12,474,13],[471,2,471,3],[471,7,471,8],[471,12,471,13],[472,2,472,3],[472,7,472,8],[472,12,472,13],[469,2,469,3],[469,7,469,8],[469,12,469,13],[470,2,470,3],[470,7,470,8],[470,12,470,13],[479,2,479,3],[479,7,479,8],[479,12,479,13],[480,2,480,3],[480,7,480,8],[480,12,480,13],[477,2,477,3],[477,7,477,8],[477,12,477,13],[478,2,478,3],[478,7,478,8],[478,12,478,13],[475,2,475,3],[475,7,475,8],[475,12,475,13],[476,2,476,3],[476,7,476,8],[476,12,476,13],[485,2,485,3],[485,7,485,8],[485,12,485,13],[486,2,486,3],[486,7,486,8],[486,12,486,13],[483,2,483,4],[483,7,483,9],[483,12,483,14],[484,2,484,3],[484,7,484,8],[484,12,484,13],[481,2,481,3],[481,7,481,8],[481,12,481,13],[482,2,482,3],[482,7,482,8],[482,12,482,13],[491,2,491,3],[491,7,491,8],[491,12,491,13],[492,2,492,3],[492,7,492,8],[492,12,492,13],[489,2,489,3],[489,7,489,8],[489,12,489,13],[490,2,490,3],[490,7,490,8],[490,12,490,13],[487,2,487,3],[487,7,487,8],[487,12,487,13],[488,2,488,3],[488,7,488,8],[488,12,488,13],[497,2,497,3],[497,7,497,8],[497,12,497,13],[498,2,498,3],[498,7,498,8],[498,12,498,13],[495,2,495,3],[495,7,495,8],[495,12,495,13],[496,2,496,3],[496,7,496,8],[496,12,496,13],[493,2,493,3],[493,7,493,8],[493,12,493,13],[494,2,494,3],[494,7,494,8],[494,12,494,13],[503,2,503,3],[503,7,503,8],[503,12,503,13],[504,2,504,3],[504,7,504,8],[504,12,504,13],[501,2,501,3],[501,7,501,8],[501,12,501,13],[502,2,502,3],[502,7,502,8],[502,12,502,13],[499,2,499,3],[499,7,499,8],[499,12,499,13],[500,2,500,3],[500,7,500,8],[500,12,500,13],[509,2,509,3],[509,7,509,8],[509,12,509,13],[510,2,510,3],[510,7,510,8],[510,12,510,13],[507,2,507,3],[507,7,507,8],[507,12,507,13],[508,2,508,3],[508,7,508,8],[508,12,508,13],[505,2,505,3],[505,7,505,8],[505,12,505,13],[506,2,506,3],[506,7,506,8],[506,12,506,13],[515,2,515,3],[515,7,515,8],[515,12,515,13],[516,2,516,3],[516,7,516,8],[516,12,516,13],[513,2,513,3],[513,7,513,8],[513,12,513,13],[514,2,514,3],[514,7,514,8],[514,12,514,13],[511,2,511,3],[511,7,511,8],[511,12,511,13],[512,2,512,3],[512,7,512,8],[512,12,512,13],[521,2,521,3],[521,7,521,8],[521,12,521,13],[522,2,522,3],[522,7,522,8],[522,12,522,13],[519,2,519,3],[519,7,519,8],[519,12,519,13],[520,2,520,3],[520,7,520,8],[520,12,520,13],[517,2,517,3],[517,7,517,8],[517,12,517,13],[518,2,518,3],[518,7,518,8],[518,12,518,13],[527,2,527,3],[527,7,527,8],[527,12,527,13],[528,2,528,3],[528,7,528,8],[528,12,528,13],[525,2,525,3],[525,7,525,8],[525,12,525,13],[526,2,526,3],[526,7,526,8],[526,12,526,13],[523,2,523,3],[523,7,523,8],[523,12,523,13],[524,2,524,3],[524,7,524,8],[524,12,524,13],[533,2,533,3],[533,7,533,8],[533,12,533,13],[534,2,534,3],[534,7,534,8],[534,12,534,13],[531,2,531,3],[531,7,531,8],[531,12,531,13],[532,2,532,3],[532,7,532,8],[532,12,532,13],[529,2,529,3],[529,7,529,8],[529,12,529,13],[530,2,530,3],[530,7,530,8],[530,12,530,13],[539,2,539,3],[539,7,539,8],[539,12,539,13],[540,2,540,3],[540,7,540,8],[540,12,540,13],[537,2,537,3],[537,7,537,8],[537,12,537,13],[538,2,538,3],[538,7,538,8],[538,12,538,13],[535,2,535,3],[535,7,535,8],[535,12,535,13],[536,2,536,3],[536,7,536,8],[536,12,536,13],[545,2,545,3],[545,7,545,8],[545,12,545,13],[546,2,546,3],[546,7,546,8],[546,12,546,13],[543,2,543,3],[543,7,543,8],[543,12,543,13],[544,2,544,3],[544,7,544,8],[544,12,544,13],[541,2,541,3],[541,7,541,8],[541,12,541,13],[542,2,542,3],[542,7,542,8],[542,12,542,13],[551,2,551,3],[551,7,551,8],[551,12,551,13],[552,2,552,3],[552,7,552,8],[552,12,552,13],[549,2,549,3],[549,7,549,8],[549,12,549,13],[550,2,550,3],[550,7,550,8],[550,12,550,13],[547,2,547,3],[547,7,547,8],[547,12,547,13],[548,2,548,3],[548,7,548,8],[548,12,548,13],[557,2,557,3],[557,7,557,8],[557,12,557,13],[558,2,558,3],[558,7,558,8],[558,12,558,13],[555,2,555,3],[555,7,555,8],[555,12,555,13],[556,2,556,3],[556,7,556,8],[556,12,556,13],[553,2,553,3],[553,7,553,8],[553,12,553,13],[554,2,554,3],[554,7,554,8],[554,12,554,13],[563,2,563,3],[563,7,563,8],[563,12,563,13],[564,2,564,3],[564,7,564,8],[564,12,564,13],[561,2,561,3],[561,7,561,8],[561,12,561,13],[562,2,562,3],[562,7,562,8],[562,12,562,13],[559,2,559,3],[559,7,559,8],[559,12,559,13],[560,2,560,3],[560,7,560,8],[560,12,560,13],[569,2,569,3],[569,7,569,8],[569,12,569,13],[570,2,570,3],[570,7,570,8],[570,12,570,13],[567,2,567,3],[567,7,567,8],[567,12,567,13],[568,2,568,3],[568,7,568,8],[568,12,568,13],[565,2,565,3],[565,7,565,8],[565,12,565,13],[566,2,566,3],[566,7,566,8],[566,12,566,13],[575,2,575,3],[575,7,575,8],[575,12,575,13],[576,2,576,3],[576,7,576,8],[576,12,576,13],[573,2,573,3],[573,7,573,8],[573,12,573,13],[574,2,574,3],[574,7,574,8],[574,12,574,13],[571,2,571,3],[571,7,571,8],[571,12,571,13],[572,2,572,3],[572,7,572,8],[572,12,572,13],[581,2,581,3],[581,7,581,8],[581,12,581,13],[582,2,582,3],[582,7,582,8],[582,12,582,13],[579,2,579,3],[579,7,579,8],[579,12,579,13],[580,2,580,3],[580,7,580,8],[580,12,580,13],[577,2,577,3],[577,7,577,8],[577,12,577,13],[578,2,578,3],[578,7,578,8],[578,12,578,13],[587,2,587,3],[587,7,587,8],[587,12,587,13],[588,2,588,3],[588,7,588,8],[588,12,588,13],[585,2,585,3],[585,7,585,8],[585,12,585,13],[586,2,586,3],[586,7,586,8],[586,12,586,13],[583,2,583,3],[583,7,583,8],[583,12,583,13],[584,2,584,3],[584,7,584,8],[584,12,584,13],[593,2,593,3],[593,7,593,8],[593,12,593,13],[594,2,594,3],[594,7,594,8],[594,12,594,13],[591,2,591,3],[591,7,591,8],[591,12,591,13],[592,2,592,3],[592,7,592,8],[592,12,592,13],[589,2,589,3],[589,7,589,8],[589,12,589,13],[590,2,590,3],[590,7,590,8],[590,12,590,13],[599,2,599,3],[599,7,599,8],[599,12,599,13],[600,2,600,3],[600,7,600,8],[600,12,600,13],[597,2,597,3],[597,7,597,8],[597,12,597,13],[598,2,598,3],[598,7,598,8],[598,12,598,13],[595,2,595,3],[595,7,595,8],[595,12,595,13],[596,2,596,3],[596,7,596,8],[596,12,596,13],[605,2,605,3],[605,7,605,8],[605,12,605,13],[606,2,606,3],[606,7,606,8],[606,12,606,13],[603,2,603,3],[603,7,603,8],[603,12,603,13],[604,2,604,3],[604,7,604,8],[604,12,604,13],[601,2,601,3],[601,7,601,8],[601,12,601,13],[602,2,602,3],[602,7,602,8],[602,12,602,13],[611,2,611,3],[611,7,611,8],[611,12,611,13],[612,2,612,3],[612,7,612,8],[612,12,612,13],[609,2,609,3],[609,7,609,8],[609,12,609,13],[610,2,610,3],[610,7,610,8],[610,12,610,13],[607,2,607,3],[607,7,607,8],[607,12,607,13],[608,2,608,3],[608,7,608,8],[608,12,608,13],[617,2,617,3],[617,7,617,8],[617,12,617,13],[618,2,618,3],[618,7,618,8],[618,12,618,13],[615,2,615,3],[615,7,615,8],[615,12,615,13],[616,2,616,3],[616,7,616,8],[616,12,616,13],[613,2,613,3],[613,7,613,8],[613,12,613,13],[614,2,614,3],[614,7,614,8],[614,12,614,13],[623,2,623,3],[623,7,623,8],[623,12,623,13],[624,2,624,3],[624,7,624,8],[624,12,624,13],[621,2,621,3],[621,7,621,8],[621,12,621,13],[622,2,622,3],[622,7,622,8],[622,12,622,13],[619,2,619,3],[619,7,619,8],[619,12,619,13],[620,2,620,3],[620,7,620,8],[620,12,620,13],[629,2,629,3],[629,7,629,8],[629,12,629,13],[630,2,630,3],[630,7,630,8],[630,12,630,13],[627,2,627,3],[627,7,627,8],[627,12,627,13],[628,2,628,3],[628,7,628,8],[628,12,628,13],[625,2,625,3],[625,7,625,8],[625,12,625,13],[626,2,626,3],[626,7,626,8],[626,12,626,13],[635,2,635,3],[635,7,635,8],[635,12,635,13],[636,2,636,3],[636,7,636,8],[636,12,636,13],[633,2,633,3],[633,7,633,8],[633,12,633,13],[634,2,634,3],[634,7,634,8],[634,12,634,13],[631,2,631,3],[631,7,631,8],[631,12,631,13],[632,2,632,3],[632,7,632,8],[632,12,632,13],[641,2,641,3],[641,7,641,8],[641,12,641,13],[642,2,642,3],[642,7,642,8],[642,12,642,13],[639,2,639,3],[639,7,639,8],[639,12,639,13],[640,2,640,3],[640,7,640,8],[640,12,640,13],[637,2,637,3],[637,7,637,8],[637,12,637,13],[638,2,638,3],[638,7,638,8],[638,12,638,13],[647,2,647,3],[647,7,647,8],[647,12,647,13],[648,2,648,3],[648,7,648,8],[648,12,648,13],[645,2,645,3],[645,7,645,8],[645,12,645,13],[646,2,646,3],[646,7,646,8],[646,12,646,13],[643,2,643,3],[643,7,643,8],[643,12,643,13],[644,2,644,3],[644,7,644,8],[644,12,644,13],[653,2,653,3],[653,7,653,8],[653,12,653,13],[654,2,654,3],[654,7,654,8],[654,12,654,13],[651,2,651,3],[651,7,651,8],[651,12,651,13],[652,2,652,3],[652,7,652,8],[652,12,652,13],[649,2,649,3],[649,7,649,8],[649,12,649,13],[650,2,650,3],[650,7,650,8],[650,12,650,13],[659,2,659,3],[659,7,659,8],[659,12,659,13],[660,2,660,3],[660,7,660,8],[660,12,660,13],[657,2,657,3],[657,7,657,8],[657,12,657,13],[658,2,658,3],[658,7,658,8],[658,12,658,13],[655,2,655,3],[655,7,655,8],[655,12,655,13],[656,2,656,3],[656,7,656,8],[656,12,656,13],[665,2,665,3],[665,7,665,8],[665,12,665,13],[666,2,666,3],[666,7,666,8],[666,12,666,13],[663,2,663,3],[663,7,663,8],[663,12,663,13],[664,2,664,3],[664,7,664,8],[664,12,664,13],[661,2,661,3],[661,7,661,8],[661,12,661,13],[662,2,662,3],[662,7,662,8],[662,12,662,13],[671,2,671,3],[671,7,671,8],[671,12,671,13],[672,2,672,3],[672,7,672,8],[672,12,672,13],[669,2,669,3],[669,7,669,8],[669,12,669,13],[670,2,670,3],[670,7,670,8],[670,12,670,13],[667,2,667,3],[667,7,667,8],[667,12,667,13],[668,2,668,3],[668,7,668,8],[668,12,668,13],[677,2,677,3],[677,7,677,8],[677,12,677,13],[678,2,678,3],[678,7,678,8],[678,12,678,13],[675,2,675,3],[675,7,675,8],[675,12,675,13],[676,2,676,3],[676,7,676,8],[676,12,676,13],[673,2,673,3],[673,7,673,8],[673,12,673,13],[674,2,674,3],[674,7,674,8],[674,12,674,13],[683,2,683,3],[683,7,683,8],[683,12,683,13],[684,2,684,3],[684,7,684,8],[684,12,684,13],[681,2,681,3],[681,7,681,8],[681,12,681,13],[682,2,682,3],[682,7,682,8],[682,12,682,13],[679,2,679,3],[679,7,679,8],[679,12,679,13],[680,2,680,3],[680,7,680,8],[680,12,680,13],[689,2,689,3],[689,7,689,8],[689,12,689,13],[690,2,690,3],[690,7,690,8],[690,12,690,13],[687,2,687,3],[687,7,687,8],[687,12,687,13],[688,2,688,3],[688,7,688,8],[688,12,688,13],[685,2,685,3],[685,7,685,8],[685,12,685,13],[686,2,686,3],[686,7,686,8],[686,12,686,13],[695,2,695,3],[695,7,695,8],[695,12,695,13],[696,2,696,3],[696,7,696,8],[696,12,696,13],[693,2,693,3],[693,7,693,8],[693,12,693,13],[694,2,694,3]],"merged_total":1314,"flags":["merged_cut"]}
[]
[{"$f":"A1026","v":"Republic of Moldova"}]
[{"$f":"A1034","v":"2000"}]
["Use of drinking water sources"]
[" by wealth quintile and sub-national region"]
["Notes:"]
["WHO/UNICEF JMP customised wealth index excludes water,"]
[" sanitation and hygiene assets."]
["Survey used for analysis:",{"$f":"A1025","v":"MICS00"}]
[{"$f":"B1028","v":""}]
[{"$f":"B1027","v":""}]
[]
[]
["Use of drinking water sources",null,"NATIONAL wealth index quintile",null,null,null,null,"URBAN wealth index quintile",null,null,null,null,"RURAL wealth index quintile",null,null,null,null,"SUB-REGIONS:",null,null,null,null,null,null,null,null,null,null,null,null,null,null,null,null,null,null,null,null,null,null,null,null,null,null,null,null,null,null,null,null,null,null,"Raw numbers of respondents:","Use of drinking water sources","NATIONAL wealth index quintile",null,null,null,null,"URBAN wealth index quintile",null,null,null,null,"RURAL wealth index quintile",null,null,null,null,"SUB-REGIONS:"]
["Weighted percentage (used in graphs)",null,"Poorest","Poor","Middle","Rich","Richest","Poorest","Poor","Middle","Rich","Richest","Poorest","Poor","Middle","Rich","Richest","Moldova","Transnistria",null,null,null,null,null,null,null,null,null,null,null,null,null,null,null,null,null,null,null,null,null,null,null,null,null,null,null,null,null,null,null,null,null,"Water data, raw numbers (weighted)",null,"Poorest","Poor","Middle","Rich","Richest","Poorest","Poor","Middle","Rich","Richest","Poorest","Poor","Middle","Rich","Richest","Moldova","Transnistria"]
["Water","Improved",86.044979069073761,91.235752703299426,93.667691508510657,97.048282509991097,98.498666062914978,95.687111040748704,97.531202771365841,98.568959655181189,98.694478857670219,99.148724948962226,83.766454390853838,88.982393362172559,91.447139144631421,91.636385586249119,95.061362853983937,92.650205427774267,97.100679435338435,null,null,null,null,null,null,null,null,null,null,null,null,null,null,null,null,null,null,null,null,null,null,null,null,null,null,null,null,null,null,null,null,null,"Water","Improved","N/A","N/A","N/A","N/A","N/A","N/A","N/A","N/A","N/A","N/A","N/A","N/A","N/A","N/A","N/A","N/A","N/A"]
[null,"Not Improved",13.955020930926176,8.7642472967006189,6.332308491489397,2.9517174900089054,1.5013339370850138,4.3128889592512891,2.4687972286342057,1.4310403448187818,1.3055211423297517,0.85127505103780843,16.233545609146585,11.017606637827559,8.5528608553685839,8.3636144137509394,4.9386371460160401,7.3497945722253784,2.8993205646617599,null,null,null,null,null,null,null,null,null,null,null,null,null,null,null,null,null,null,null,null,null,null,null,null,null,null,null,null,null,null,null,null,null,null,"Not Improved","N/A","N/A","N/A","N/A","N/A","N/A","N/A","N/A","N/A","N/A","N/A","N/A","N/A","N/A","N/A","N/A","N/A"]
["Water ladder","Basic",84.023643640949757,88.924631248511773,92.101082668703185,95.610688452264029,97.763968371401333,93.914684593328943,95.580406783991208,97.518686896281082,97.236473346182763,99.05878689105073,81.564933459556144,86.96841312230697,89.108492916559754,89.802009106470877,94.182991730035042,90.805640533167889,96.844017731728897,null,null,null,null,null,null,null,null,null,null,null,null,null,null,null,null,null,null,null,null,null,null,null,null,null,null,null,null,null,null,null,null,null,"Water ladder","Basic","N/A","N/A","N/A","N/A","N/A","N/A","N/A","N/A","N/A","N/A","N/A","N/A","N/A","N/A","N/A","N/A","N/A"]
[null,"Limited",2.0070991366936175,2.3111214547875756,1.5603915328642222,1.4375940577271118,0.7346976915136304,1.772426447419891,1.9507959873746803,1.0502727589001037,1.4580055114874781,8.9938057911488498E-2,2.1737642330660742,2.0139802398656115,2.3386462280716778,1.8206062294316643,0.87837112394885608,1.8411214851228843,0.25666170360949941,null,null,null,null,null,null,null,null,null,null,null,null,null,null,null,null,null,null,null,null,null,null,null,null,null,null,null,null,null,null,null,null,null,null,"Limited","N/A","N/A","N/A","N/A","N/A","N/A","N/A","N/A","N/A","N/A","N/A","N/A","N/A","N/A","N/A","N/A","N/A"]
[null,"Unimproved",13.969257222356546,8.7642472967006189,6.2945028944470156,2.9517174900089054,1.5013339370850138,4.3128889592512891,2.4687972286342057,1.4310403448187818,1.3055211423297517,0.85127505103780843,16.26130230737817,11.017606637827559,8.5528608553685839,8.3035625842664516,4.9386371460160401,7.3532379817089071,2.8386866884981492,null,null,null,null,null,null,null,null,null,null,null,null,null,null,null,null,null,null,null,null,null,null,null,null,null,null,null,null,null,null,null,null,null,null,"Unimproved","N/A","N/A","N/A","N/A","N/A","N/A","N/A","N/A","N/A","N/A","N/A","N/A","N/A","N/A","N/A","N/A","N/A"]
[null,"Surface water",0,0,4.4022903985614634E-2,0,0,0,0,0,0,0,0,0,0,7.3822079831058707E-2,0,0,6.0633876163610941E-2,null,null,null,null,null,null,null,null,null,null,null,null,null,null,null,null,null,null,null,null,null,null,null,null,null,null,null,null,null,null,null,null,null,null,"Surface water","N/A","N/A","N/A","N/A","N/A","N/A","N/A","N/A","N/A","N/A","N/A","N/A","N/A","N/A","N/A","N/A","N/A"]
["Improved water point at more than 30 minutes","Yes",2.3330022174528953,2.5331313507144406,1.6659907888126206,1.4813183917800006,0.74589608253613315,1.852314724670804,2.0001762840429298,1.0655207913061271,1.4772918691734562,9.0710251652540166E-2,2.5958897056713988,2.2633468979288858,2.5573749490106081,1.9870707933374778,0.92400434580140711,1.9872486042840891,0.26432534262586321,null,null,null,null,null,null,null,null,null,null,null,null,null,null,null,null,null,null,null,null,null,null,null,null,null,null,null,null,null,null,null,null,null,"Improved water point at more than 30 minutes","Yes","N/A","N/A","N/A","N/A","N/A","N/A","N/A","N/A","N/A","N/A","N/A","N/A","N/A","N/A","N/A","N/A","N/A"]
[null,"No",97.666997782547057,97.466868649285473,98.334009211187364,98.518681608220035,99.254103917463851,98.147685275329337,97.999823715957106,98.934479208693872,98.522708130826558,99.909289748347462,97.404110294328561,97.736653102071145,97.442625050989406,98.01292920666252,99.07599565419855,98.012751395715952,99.735674657374091,null,null,null,null,null,null,null,null,null,null,null,null,null,null,null,null,null,null,null,null,null,null,null,null,null,null,null,null,null,null,null,null,null,null,"No","N/A","N/A","N/A","N/A","N/A","N/A","N/A","N/A","N/A","N/A","N/A","N/A","N/A","N/A","N/A","N/A","N/A"]
["Manually calculated ratios","Improved wells"]
[null,"Improved springs"]
[null,"Other"]
[null,null,"NATIONAL wealth index quintile",null,null,null,null,"URBAN wealth index quintile",null,null,null,null,"RURAL wealth index quintile",null,null,null,null,"SUB-REGIONS:",null,null,null,null,null,null,null,null,null,null,null,null,null,null,null,null,null,null,null,null,null,null,null,null,null,null,null,null,null,null,null,null,null,null,"Raw numbers of respondents:","Use of drinking water sources","NATIONAL wealth index quintile",null,null,null,null,"URBAN wealth index quintile",null,null,null,null,"RURAL wealth index quintile",null,null,null,null,"SUB-REGIONS:"]
["Percentage based on weighted population",null,"Poorest","Poor","Middle","Rich","Richest","Poorest","Poor","Middle","Rich","Richest","Poorest","Poor","Middle","Rich","Richest","Moldova","Transnistria",null,null,null,null,null,null,null,null,null,null,null,null,null,null,null,null,null,null,null,null,null,null,null,null,null,null,null,null,null,null,null,null,null,"Water data, raw numbers (weighted)",null,"Poorest","Poor","Middle","Rich","Richest","Poorest","Poor","Middle","Rich","Richest","Poorest","Poor","Middle","Rich","Richest","Moldova","Transnistria"]
["Piped water","Yes",5.945820295040031,11.020028137275755,30.394221167173178,67.078628216376771,76.122545622034224,58.026024143850243,76.85688483344137,84.78142118272514,86.562303550080614,91.67470830267456,3.4631755046511561,4.8849508912062065,7.3409318045464991,15.83492257767611,19.275957882309147,32.220704060686742,72.661282177880025,null,null,null,null,null,null,null,null,null,null,null,null,null,null,null,null,null,null,null,null,null,null,null,null,null,null,null,null,null,null,null,null,null,"Piped water","Yes","N/A","N/A","N/A","N/A","N/A","N/A","N/A","N/A","N/A","N/A","N/A","N/A","N/A","N/A","N/A","N/A","N/A"]
[null,"No",94.054179704959964,88.979971862724227,69.605778832826886,32.921371783623172,23.877454377965812,41.973975856150233,23.143115166558907,15.218578817274903,13.43769644991942,8.3252916973254081,96.536824495348824,95.115049108793784,92.659068195453472,84.165077422323904,80.724042117690757,67.779295939311879,27.338717822119996,null,null,null,null,null,null,null,null,null,null,null,null,null,null,null,null,null,null,null,null,null,null,null,null,null,null,null,null,null,null,null,null,null,null,"No","N/A","N/A","N/A","N/A","N/A","N/A","N/A","N/A","N/A","N/A","N/A","N/A","N/A","N/A","N/A","N/A","N/A"]
["Piped water on premises","Yes",5.0526687411932159,9.7682553361560753,28.936064361200977,65.260518016555011,75.4753980053936,54.926526445814297,74.571089983919606,83.592137626501028,85.506382246373775,91.448463518381828,2.8870726004486627,3.6859723333390813,6.6523206044392866,14.478682875765719,18.22119915053969,31.066999316216876,71.08626145772611,null,null,null,null,null,null,null,null,null,null,null,null,null,null,null,null,null,null,null,null,null,null,null,null,null,null,null,null,null,null,null,null,null,"Piped water on premises","Yes","N/A","N/A","N/A","N/A","N/A","N/A","N/A","N/A","N/A","N/A","N/A","N/A","N/A","N/A","N/A","N/A","N/A"]
[null,"No",94.947331258806784,90.231744663843898,71.063935638799052,34.739481983444982,24.524601994606357,45.073473554186172,25.428910016080685,16.40786237349899,14.49361775362625,8.5515364816181307,97.112927399551324,96.314027666660905,93.347679395560704,85.521317124234301,81.778800849460211,68.933000683781771,28.913738542273954,null,null,null,null,null,null,null,null,null,null,null,null,null,null,null,null,null,null,null,null,null,null,null,null,null,null,null,null,null,null,null,null,null,null,"No","N/A","N/A","N/A","N/A","N/A","N/A","N/A","N/A","N/A","N/A","N/A","N/A","N/A","N/A","N/A","N/A","N/A"]
["Piped water into dwelling","Yes","N/A","N/A","N/A","N/A","N/A","N/A","N/A","N/A","N/A","N/A","N/A","N/A","N/A","N/A","N/A","N/A","N/A",null,null,null,null,null,null,null,null,null,null,null,null,null,null,null,null,null,null,null,null,null,null,null,null,null,null,null,null,null,null,null,null,null,"Piped water into dwelling","Yes","N/A","N/A","N/A","N/A","N/A","N/A","N/A","N/A","N/A","N/A","N/A","N/A","N/A","N/A","N/A","N/A","N/A"]
[null,"No","N/A","N/A","N/A","N/A","N/A","N/A","N/A","N/A","N/A","N/A","N/A","N/A","N/A","N/A","N/A","N/A","N/A",null,null,null,null,null,null,null,null,null,null,null,null,null,null,null,null,null,null,null,null,null,null,null,null,null,null,null,null,null,null,null,null,null,null,"No","N/A","N/A","N/A","N/A","N/A","N/A","N/A","N/A","N/A","N/A","N/A","N/A","N/A","N/A","N/A","N/A","N/A"]
["Water source on premises","Yes",11.903274581749654,20.038599291023171,38.674835301643412,70.001519748805066,79.853562272528634,59.21363286124631,77.147741985586777,86.014497106782855,86.988217072612485,92.542422241225609,10.127650193013567,13.294863900643076,16.59964054030787,27.10427543227874,31.029979933566171,39.139338713220774,73.132947510827023,null,null,null,null,null,null,null,null,null,null,null,null,null,null,null,null,null,null,null,null,null,null,null,null,null,null,null,null,null,null,null,null,null,"Water source on premises","Yes","N/A","N/A","N/A","N/A","N/A","N/A","N/A","N/A","N/A","N/A","N/A","N/A","N/A","N/A","N/A","N/A","N/A"]
[null,"No",88.096725418250372,79.961400708976726,61.325164698356716,29.998480251194966,20.146437727471366,40.786367138754123,22.852258014413486,13.985502893217195,13.011782927387575,7.4575777587743186,89.872349806986605,86.705136099356963,83.400359459692154,72.895724567721302,68.97002006643369,60.860661286778026,26.867052489172988,null,null,null,null,null,null,null,null,null,null,null,null,null,null,null,null,null,null,null,null,null,null,null,null,null,null,null,null,null,null,null,null,null,null,"No","N/A","N/A","N/A","N/A","N/A","N/A","N/A","N/A","N/A","N/A","N/A","N/A","N/A","N/A","N/A","N/A","N/A"]
["Improved Water source on premises","Yes",12.992915474390085,21.325024590546192,40.678724848211232,71.843303003625493,80.748168241862672,61.740260989900186,78.763039335139666,87.263269702432723,87.852096121464825,93.210259941127774,11.095950377371452,13.838141642260485,17.793086695863732,28.714762367372025,31.991982833711919,41.63106470293917,75.250083735660851,null,null,null,null,null,null,null,null,null,null,null,null,null,null,null,null,null,null,null,null,null,null,null,null,null,null,null,null,null,null,null,null,null,"Improved water source on premises","Yes","N/A","N/A","N/A","N/A","N/A","N/A","N/A","N/A","N/A","N/A","N/A","N/A","N/A","N/A","N/A","N/A","N/A"]
[null,"No",87.007084525610111,78.674975409453722,59.321275151788825,28.156696996374524,19.251831758137328,38.259739010100262,21.236960664860579,12.736730297567359,12.147903878535264,6.7897400588721331,88.904049622628506,86.161858357739533,82.206913304136336,71.285237632627883,68.008017166287857,58.368935297059664,24.749916264338996,null,null,null,null,null,null,null,null,null,null,null,null,null,null,null,null,null,null,null,null,null,null,null,null,null,null,null,null,null,null,null,null,null,null,"No","N/A","N/A","N/A","N/A","N/A","N/A","N/A","N/A","N/A","N/A","N/A","N/A","N/A","N/A","N/A","N/A","N/A"]
["Piped water on premises available when needed","Yes","N/A","N/A","N/A","N/A","N/A","N/A","N/A","N/A","N/A","N/A","N/A","N/A","N/A","N/A","N/A","N/A","N/A",null,null,null,null,null,null,null,null,null,null,null,null,null,null,null,null,null,null,null,null,null,null,null,null,null,null,null,null,null,null,null,null,null,"Piped water on premises available when needed","Yes","N/A","N/A","N/A","N/A","N/A","N/A","N/A","N/A","N/A","N/A","N/A","N/A","N/A","N/A","N/A","N/A","N/A"]
[null,"No","N/A","N/A","N/A","N/A","N/A","N/A","N/A","N/A","N/A","N/A","N/A","N/A","N/A","N/A","N/A","N/A","N/A",null,null,null,null,null,null,null,null,null,null,null,null,null,null,null,null,null,null,null,null,null,null,null,null,null,null,null,null,null,null,null,null,null,null,"No","N/A","N/A","N/A","N/A","N/A","N/A","N/A","N/A","N/A","N/A","N/A","N/A","N/A","N/A","N/A","N/A","N/A"]
["Water point at more than 30 minutes","Yes",2.7599818684729991,2.679397524738421,1.8777944516070737,1.678476850441651,0.7346976915136304,2.3931328469443645,2.1977192763460547,1.4056105736886264,1.4580055114874781,8.9938057911488498E-2,3.0503488791981623,2.3523016047869398,2.5827882939724751,2.3534485367863485,0.87837112394885608,2.1785359712412764,0.58530662385927168,null,null,null,null,null,null,null,null,null,null,null,null,null,null,null,null,null,null,null,null,null,null,null,null,null,null,null,null,null,null,null,null,null,"Water point at more than 30 minutes","Yes","N/A","N/A","N/A","N/A","N/A","N/A","N/A","N/A","N/A","N/A","N/A","N/A","N/A","N/A","N/A","N/A","N/A"]
[null,"No",97.240018131526924,97.320602475261538,98.122205548392913,98.321523149558359,99.265302308486355,97.60686715305566,97.802280723654007,98.594389426311338,98.541994488512472,99.910061942088518,96.949651120801832,97.647698395213069,97.41721170602753,97.646551463213683,99.121628876051147,97.821464028758527,99.414693376140818,null,null,null,null,null,null,null,null,null,null,null,null,null,null,null,null,null,null,null,null,null,null,null,null,null,null,null,null,null,null,null,null,null,null,"No","N/A","N/A","N/A","N/A","N/A","N/A","N/A","N/A","N/A","N/A","N/A","N/A","N/A","N/A","N/A","N/A","N/A"]
["Water source available when needed","Yes","N/A","N/A","N/A","N/A","N/A","N/A","N/A","N/A","N/A","N/A","N/A","N/A","N/A","N/A","N/A","N/A","N/A",null,null,null,null,null,null,null,null,null,null,null,null,null,null,null,null,null,null,null,null,null,null,null,null,null,null,null,null,null,null,null,null,null,"Water source available when needed","Yes","N/A","N/A","N/A","N/A","N/A","N/A","N/A","N/A","N/A","N/A","N/A","N/A","N/A","N/A","N/A","N/A","N/A"]
[null,"No","N/A","N/A","N/A","N/A","N/A","N/A","N/A","N/A","N/A","N/A","N/A","N/A","N/A","N/A","N/A","N/A","N/A",null,null,null,null,null,null,null,null,null,null,null,null,null,null,null,null,null,null,null,null,null,null,null,null,null,null,null,null,null,null,null,null,null,null,"No","N/A","N/A","N/A","N/A","N/A","N/A","N/A","N/A","N/A","N/A","N/A","N/A","N/A","N/A","N/A","N/A","N/A"]
["Improved water source available when needed","Yes","N/A","N/A","N/A","N/A","N/A","N/A","N/A","N/A","N/A","N/A","N/A","N/A","N/A","N/A","N/A","N/A","N/A",null,null,null,null,null,null,null,null,null,null,null,null,null,null,null,null,null,null,null,null,null,null,null,null,null,null,null,null,null,null,null,null,null,"Improved water source available when needed","Yes","N/A","N/A","N/A","N/A","N/A","N/A","N/A","N/A","N/A","N/A","N/A","N/A","N/A","N/A","N/A","N/A","N/A"]
[null,"No","N/A","N/A","N/A","N/A","N/A","N/A","N/A","N/A","N/A","N/A","N/A","N/A","N/A","N/A","N/A","N/A","N/A",null,null,null,null,null,null,null,null,null,null,null,null,null,null,null,null,null,null,null,null,null,null,null,null,null,null,null,null,null,null,null,null,null,null,"No","N/A","N/A","N/A","N/A","N/A","N/A","N/A","N/A","N/A","N/A","N/A","N/A","N/A","N/A","N/A","N/A","N/A"]
["Microbiological quality at point of collection","Not contaminated (No E. coli in 100 mL)","N/A","N/A","N/A","N/A","N/A","N/A","N/A","N/A","N/A","N/A","N/A","N/A","N/A","N/A","N/A","N/A","N/A",null,null,null,null,null,null,null,null,null,null,null,null,null,null,null,null,null,null,null,null,null,null,null,null,null,null,null,null,null,null,null,null,null,"Microbiological quality at point of collection","Not contaminated (No E. coli in 100 mL)","N/A","N/A","N/A","N/A","N/A","N/A","N/A","N/A","N/A","N/A","N/A","N/A","N/A","N/A","N/A","N/A","N/A"]
[null,"Contaminated (E. coli detected in 100 mL)","N/A","N/A","N/A","N/A","N/A","N/A","N/A","N/A","N/A","N/A","N/A","N/A","N/A","N/A","N/A","N/A","N/A",null,null,null,null,null,null,null,null,null,null,null,null,null,null,null,null,null,null,null,null,null,null,null,null,null,null,null,null,null,null,null,null,null,null,"Contaminated (E. coli detected in 100 mL)","N/A","N/A","N/A","N/A","N/A","N/A","N/A","N/A","N/A","N/A","N/A","N/A","N/A","N/A","N/A","N/A","N/A"]
[null,"Highly contaminated (>100 CFU/100 mL)","N/A","N/A","N/A","N/A","N/A","N/A","N/A","N/A","N/A","N/A","N/A","N/A","N/A","N/A","N/A","N/A","N/A",null,null,null,null,null,null,null,null,null,null,null,null,null,null,null,null,null,null,null,null,null,null,null,null,null,null,null,null,null,null,null,null,null,null,"Highly contaminated (>100 CFU/100 mL)","N/A","N/A","N/A","N/A","N/A","N/A","N/A","N/A","N/A","N/A","N/A","N/A","N/A","N/A","N/A","N/A","N/A"]
["Microbiological quality of improved water sources at point of collection","Not contaminated (No E. coli in 100 mL)","N/A","N/A","N/A","N/A","N/A","N/A","N/A","N/A","N/A","N/A","N/A","N/A","N/A","N/A","N/A","N/A","N/A",null,null,null,null,null,null,null,null,null,null,null,null,null,null,null,null,null,null,null,null,null,null,null,null,null,null,null,null,null,null,null,null,null,"Microbiological quality of improved water sources at point of collection","Not contaminated (No E. coli in 100 mL)","N/A","N/A","N/A","N/A","N/A","N/A","N/A","N/A","N/A","N/A","N/A","N/A","N/A","N/A","N/A","N/A","N/A"]
[null,"Contaminated (E. coli detected in 100 mL)","N/A","N/A","N/A","N/A","N/A","N/A","N/A","N/A","N/A","N/A","N/A","N/A","N/A","N/A","N/A","N/A","N/A",null,null,null,null,null,null,null,null,null,null,null,null,null,null,null,null,null,null,null,null,null,null,null,null,null,null,null,null,null,null,null,null,null,null,"Contaminated (E. coli detected in 100 mL)","N/A","N/A","N/A","N/A","N/A","N/A","N/A","N/A","N/A","N/A","N/A","N/A","N/A","N/A","N/A","N/A","N/A"]
[null,"Highly contaminated (>100 CFU/100 mL)","N/A","N/A","N/A","N/A","N/A","N/A","N/A","N/A","N/A","N/A","N/A","N/A","N/A","N/A","N/A","N/A","N/A",null,null,null,null,null,null,null,null,null,null,null,null,null,null,null,null,null,null,null,null,null,null,null,null,null,null,null,null,null,null,null,null,null,null,"Highly contaminated (>100 CFU/100 mL)","N/A","N/A","N/A","N/A","N/A","N/A","N/A","N/A","N/A","N/A","N/A","N/A","N/A","N/A","N/A","N/A","N/A"]
["Microbiological quality of piped on premises at point of collection","Not contaminated (No E. coli in 100 mL)","N/A","N/A","N/A","N/A","N/A","N/A","N/A","N/A","N/A","N/A","N/A","N/A","N/A","N/A","N/A","N/A","N/A",null,null,null,null,null,null,null,null,null,null,null,null,null,null,null,null,null,null,null,null,null,null,null,null,null,null,null,null,null,null,null,null,null,"Microbiological quality of piped on premises at point of collection","Not contaminated (No E. coli in 100 mL)","N/A","N/A","N/A","N/A","N/A","N/A","N/A","N/A","N/A","N/A","N/A","N/A","N/A","N/A","N/A","N/A","N/A"]
[null,"Contaminated (E. coli detected in 100 mL)","N/A","N/A","N/A","N/A","N/A","N/A","N/A","N/A","N/A","N/A","N/A","N/A","N/A","N/A","N/A","N/A","N/A",null,null,null,null,null,null,null,null,null,null,null,null,null,null,null,null,null,null,null,null,null,null,null,null,null,null,null,null,null,null,null,null,null,null,"Contaminated (E. coli detected in 100 mL)","N/A","N/A","N/A","N/A","N/A","N/A","N/A","N/A","N/A","N/A","N/A","N/A","N/A","N/A","N/A","N/A","N/A"]
[null,"Highly contaminated (>100 CFU/100 mL)","N/A","N/A","N/A","N/A","N/A","N/A","N/A","N/A","N/A","N/A","N/A","N/A","N/A","N/A","N/A","N/A","N/A",null,null,null,null,null,null,null,null,null,null,null,null,null,null,null,null,null,null,null,null,null,null,null,null,null,null,null,null,null,null,null,null,null,null,"Highly contaminated (>100 CFU/100 mL)","N/A","N/A","N/A","N/A","N/A","N/A","N/A","N/A","N/A","N/A","N/A","N/A","N/A","N/A","N/A","N/A","N/A"]
[null,null,"NATIONAL wealth index quintile",null,null,null,null,"URBAN wealth index quintile",null,null,null,null,"RURAL wealth index quintile",null,null,null,null,"SUB-REGIONS:",null,null,null,null,null,null,null,null,null,null,null,null,null,null,null,null,null,null,null,null,null,null,null,null,null,null,null,null,null,null,null,null,null,null,"Raw numbers of respondents:","Use of drinking water sources","NATIONAL wealth index quintile",null,null,null,null,"URBAN wealth index quintile",null,null,null,null,"RURAL wealth index quintile",null,null,null,null,"SUB-REGIONS:"]
["Percentage based on weighted population",null,"Poorest","Poor","Middle","Rich","Richest","Poorest","Poor","Middle","Rich","Richest","Poorest","Poor","Middle","Rich","Richest","Moldova","Transnistria",null,null,null,null,null,null,null,null,null,null,null,null,null,null,null,null,null,null,null,null,null,null,null,null,null,null,null,null,null,null,null,null,null,"Water data, raw numbers (weighted)",null,"Poorest","Poor","Middle","Rich","Richest","Poorest","Poor","Middle","Rich","Richest","Poorest","Poor","Middle","Rich","Richest","Moldova","Transnistria"]
["Main source of water","Piped into dwelling",1.5245058605565422,4.6385122033953845,21.056774980651767,58.010511653580657,70.178659947985054,44.642808564022793,66.140758907535556,78.542913022737849,79.662726549330415,88.355020312954707,0.22004990781518338,0.73305102466810423,2.1905453673686415,5.8174776146693929,10.294001239472735,26.83836563830468,55.907004687620045]
[null,"Piped into yard or plot",3.5281628806366685,5.1297431327606944,7.8792893805491939,7.2500063629743625,5.2967380574084819,10.283717881791533,8.4303310763840713,5.0492246037632356,5.8436556970434914,3.0934432054271626,2.6670226926334792,2.9529213086709771,4.4617752370706452,8.661205261096331,7.9271979110669344,4.2286336779122324,15.179256770106145]
[null,"Public tap",0.89315155384681422,1.2517728011196765,1.4581568059722014,1.818110199821819,0.64714761664054621,3.0994976980359441,2.285794849521793,1.18928355622409,1.0559213037068329,0.22624478429272174,0.57610290420249288,1.198978557867125,0.68861120010721277,1.3562397019103951,1.0547587317694591,1.1537047444699269,1.5750207201539506]
[null,"Tubewell/borehole with pump",0.89094403587411852,0.91226736120321239,3.5781754701121633,1.9980421773466785,0.80506458668611269,0.20842637425396793,1.1820128782113926,0.45702695621006961,0.25480643830466182,9.2568754365454184E-2,0.79117979039354669,1.5453106874601887,0.65200309659333955,4.1490193178914234,5.0929254436660081,0.71342662413915825,7.0835923023600369]
[null,"Protected dug well",75.020912042740846,75.719652222738105,56.438496423716799,25.519103364551864,19.304774136701138,34.265321106732003,17.269128108564946,12.46329060277993,10.353926368780362,6.1167302739411538,75.63495482844786,78.452903752456862,79.577222252771421,68.037090761704505,65.917204246617771,56.371543196313922,15.352450669756248]
[null,"Protected spring",2.2880296335014472,1.9935213506824467,1.3764875536721417,0.82356576373455881,0.75197316081381027,2.2930254875142513,0.91054519666622802,0.38638797286166582,0.678927797354267,0.95875420444868298,1.8619650480667791,1.9725120007584942,2.3652152386554248,1.5817874384920942,0.80085035081569123,1.6268209146241026,0.38813434534574792]
[null,"Rainwater collection",0.11208694207373827,4.9928884831918888E-2,0,0,0,4.5354903070015065E-2,0,0,0,0,9.5907315158027008E-3,0.23088621782099333,0,0,0,3.6569980515988844E-2,7.8861516602752139E-3]
[null,"Bottled water",0.10056524346540702,0,0.11135775237284086,3.8520231957041753E-2,0.1879015537310009,0.27733381128573792,3.0708091882846567E-2,0,0.13880859727536676,0.21602535562082401,0.14190959335503575,2.6491375518285801E-2,0,0,0.1171488254994429,8.3104071703356985E-2,0.11352931037062321]
[null,"Unprotected dug well",12.664540947375624,7.9370318453174047,5.4200778203168332,1.9257437537440765,1.3165413857635371,3.1420176380017804,1.4829253533897131,0.72732942546175672,0.98473120773831579,0.85127505103780843,14.662908893400939,10.591871258611468,7.6860282149521604,7.5768626842692273,3.6249358637955926,6.5394802012859161,1.8221395257762965]
[null,"Unprotected spring",1.014983926894885,0.30521582672235736,0.56748637497922461,0.2811589585944671,8.705182202550478E-2,0.61993175917118204,0.52792214375134128,0.17060882239789443,7.7719269432908175E-2,0,1.3304961800971942,0.23992210153079094,0.22257424403857415,0.42783714056360961,0.61654429241177411,0.43209097552492037,0.56564556715506364]
[null,"Pond, river or stream",0,0,4.3979722981811076E-2,0,0,0,0,0,0,0,0,0,0,7.3700735454366215E-2,0,0,6.0633876163610941E-2]
[null,"Tanker truck vendor",1.686620876378309,1.5403547465679193,1.7689531414636095,1.5904227560241151,1.3264070029487571,0.57162521404292221,1.2819236625993016,0.48083294060445053,0.70570610587501292,8.9938057911488498E-2,1.863678894423584,1.8693384369515762,1.5117667520647702,2.0335654904849387,3.8572761050757443,1.5980365797898461,1.4938044779653079]
[null,"Other",0.27549605665567201,0.52199962466085625,0.22701373166655889,0.74481477767036086,9.774072929597212E-2,0.55093956207832784,0.45794973149315132,0.53310209695913102,0.2430706651585279,0,0.2401405356484437,0.18581327768529804,0.6442583963778542,0.16162300537016613,0.69715698980867213,0.36094579444727526,0.45090159556678783]
[null,"Missing",0,0,7.3750841544967458E-2,0,0,0,0,0,0,0,0,0,0,0.12359084809357512,0,1.7277600967266608E-2,0]
[]
[]
[]
[]
[]
[]
[]
[]
[]
[]
[]
[]
[]
[]
[]
[]
[]
[]
[]
[]
[]
[]
[]
[]
[]
[]
[]
[]
[]
[]
[]
[]
[]
[]
[]
[]
[{"$f":"A1026","v":"Republic of Moldova"}]
[{"$f":"A1034","v":"2000"}]
["Use of sanitation facilities"]
[" by wealth quintile and sub-national region"]
["Notes:"]
["WHO/UNICEF JMP customised wealth index excludes water,"]
[" sanitation and hygiene assets."]
["Survey used for analysis:",{"$f":"A1025","v":"MICS00"}]
[{"$f":"B1030","v":"Ratio of Improved latrines based on:"},"DHS05"]
[{"$f":"B1029","v":"Ratio of Shared improved based on:"},"DHS05"]
[]
[]
["Use of sanitation facilities",null,"NATIONAL wealth index quintile",null,null,null,null,"URBAN wealth index quintile",null,null,null,null,"RURAL wealth index quintile",null,null,null,null,"SUB-REGIONS:",null,null,null,null,null,null,null,null,null,null,null,null,null,null,null,null,null,null,null,null,null,null,null,null,null,null,null,null,null,null,null,null,null,null,"Raw numbers of respondents:","Use of sanitation facilities","NATIONAL wealth index quintile",null,null,null,null,"URBAN wealth index quintile",null,null,null,null,"RURAL wealth index quintile",null,null,null,null,"SUB-REGIONS:"]
["Weighted percentage (used in graphs)",null,"Poorest","Poor","Middle","Rich","Richest","Poorest","Poor","Middle","Rich","Richest","Poorest","Poor","Middle","Rich","Richest","Moldova","Transnistria",null,null,null,null,null,null,null,null,null,null,null,null,null,null,null,null,null,null,null,null,null,null,null,null,null,null,null,null,null,null,null,null,null,"Sanitation data, raw numbers (weighted)",null,"Poorest","Poor","Middle","Rich","Richest","Poorest","Poor","Middle","Rich","Richest","Poorest","Poor","Middle","Rich","Richest","Moldova","Transnistria"]
["Sanitation","Improved",{"$f":"C153+C154+C155+C156*'DHS05'!C130/100","v":54.003282676283774},{"$f":"D153+D154+D155+D156*'DHS05'!D130/100","v":62.21480891904298},{"$f":"E153+E154+E155+E156*'DHS05'!E130/100","v":72.101349946884184},{"$f":"F153+F154+F155+F156*'DHS05'!F130/100","v":84.148845573243875},{"$f":"G153+G154+G155+G156*'DHS05'!G130/100","v":89.646615423604089},{"$f":"H153+H154+H155+H156*'DHS05'!H130/100","v":74.752020201464092},{"$f":"I153+I154+I155+I156*'DHS05'!I130/100","v":84.93175475003784},{"$f":"J153+J154+J155+J156*'DHS05'!J130/100","v":94.55692989693226},{"$f":"K153+K154+K155+K156*'DHS05'!K130/100","v":92.393423523367943},{"$f":"L153+L154+L155+L156*'DHS05'!L130/100","v":99.678129736697585},{"$f":"M153+M154+M155+M156*'DHS05'!M130/100","v":52.551119711098366},{"$f":"N153+N154+N155+N156*'DHS05'!N130/100","v":59.780589893656881},{"$f":"O153+O154+O155+O156*'DHS05'!O130/100","v":62.087704689867465},{"$f":"P153+P154+P155+P156*'DHS05'!P130/100","v":67.260699336536049},{"$f":"Q153+Q154+Q155+Q156*'DHS05'!Q130/100","v":69.801124234469242},{"$f":"R153+R154+R155+R156*'DHS05'!R130/100","v":68.738433584721719},{"$f":"S153+S154+S155+S156*'DHS05'!S130/100","v":80.719315643881188},null,null,null,null,null,null,null,null,null,null,null,null,null,null,null,null,null,null,null,null,null,null,null,null,null,null,null,null,null,null,null,null,null,"Sanitation","Improved","N/A","N/A","N/A","N/A","N/A","N/A","N/A","N/A","N/A","N/A","N/A","N/A","N/A","N/A","N/A","N/A","N/A"]
[null,"Not Improved",{"$f":"100-C122","v":45.996717323716226},{"$f":"100-D122","v":37.78519108095702},27.898650053115816,15.851154426756125,10.353384576395911,25.247979798535908,15.06824524996216,5.4430701030677398,7.6065764766320569,0.32187026330241508,47.448880288901634,40.219410106343119,37.912295310132535,32.739300663463951,30.198875765530758,31.261566415278281,19.280684356118812,null,null,null,null,null,null,null,null,null,null,null,null,null,null,null,null,null,null,null,null,null,null,null,null,null,null,null,null,null,null,null,null,null,null,"Not Improved","N/A","N/A","N/A","N/A","N/A","N/A","N/A","N/A","N/A","N/A","N/A","N/A","N/A","N/A","N/A","N/A","N/A"]
["Sanitation ladder","Basic",{"$f":"C122*'DHS05'!C129/100","v":50.015006753994577},{"$f":"D122*'DHS05'!D129/100","v":59.049921989865517},{"$f":"E122*'DHS05'!E129/100","v":68.198940922585862},{"$f":"F122*'DHS05'!F129/100","v":75.452837276052719},{"$f":"G122*'DHS05'!G129/100","v":86.420845278158396},{"$f":"H122*'DHS05'!H129/100","v":67.50390024566579},{"$f":"I122*'DHS05'!I129/100","v":72.211996079981986},{"$f":"J122*'DHS05'!J129/100","v":87.953655156352895},{"$f":"K122*'DHS05'!K129/100","v":88.856114090144544},{"$f":"L122*'DHS05'!L129/100","v":96.886274910738791},{"$f":"M122*'DHS05'!M129/100","v":48.828297701350351},{"$f":"N122*'DHS05'!N129/100","v":55.615537603488228},{"$f":"O122*'DHS05'!O129/100","v":59.116821825298132},{"$f":"P122*'DHS05'!P129/100","v":65.035525057043401},{"$f":"Q122*'DHS05'!Q129/100","v":65.791631250108367},"N/A","N/A",null,null,null,null,null,null,null,null,null,null,null,null,null,null,null,null,null,null,null,null,null,null,null,null,null,null,null,null,null,null,null,null,null,"Sanitation ladder","Basic","N/A","N/A","N/A","N/A","N/A","N/A","N/A","N/A","N/A","N/A","N/A","N/A","N/A","N/A","N/A","N/A","N/A"]
[null,"Limited",{"$f":"C122*'DHS05'!C128/100","v":3.9882759222891817},{"$f":"D122*'DHS05'!D128/100","v":3.1648869291774844},{"$f":"E122*'DHS05'!E128/100","v":3.9024090242983287},{"$f":"F122*'DHS05'!F128/100","v":8.6960082971911525},{"$f":"G122*'DHS05'!G128/100","v":3.2257701454456456},{"$f":"H122*'DHS05'!H128/100","v":7.2481199557982494},{"$f":"I122*'DHS05'!I128/100","v":12.719758670055935},{"$f":"J122*'DHS05'!J128/100","v":6.6032747405795122},{"$f":"K122*'DHS05'!K128/100","v":3.5373094332234229},{"$f":"L122*'DHS05'!L128/100","v":2.7918548259588607},{"$f":"M122*'DHS05'!M128/100","v":3.7228220097480547},{"$f":"N122*'DHS05'!N128/100","v":4.1650522901686813},{"$f":"O122*'DHS05'!O128/100","v":2.9708828645693113},{"$f":"P122*'DHS05'!P128/100","v":2.2251742794926437},{"$f":"Q122*'DHS05'!Q128/100","v":4.0094929843608682},"N/A","N/A",null,null,null,null,null,null,null,null,null,null,null,null,null,null,null,null,null,null,null,null,null,null,null,null,null,null,null,null,null,null,null,null,null,null,"Limited","N/A","N/A","N/A","N/A","N/A","N/A","N/A","N/A","N/A","N/A","N/A","N/A","N/A","N/A","N/A","N/A","N/A"]
[null,"Unimproved",{"$f":"100-(C124+C125+C127)","v":45.99671732371624},{"$f":"100-(D124+D125+D127)","v":37.785191080956999},27.898650053115816,15.851154426756125,10.353384576395953,25.247979798535965,15.068245249962075,5.4430701030675976,7.6065764766320285,0.32187026330234403,47.448880288901591,40.219410106343091,37.912295310132556,32.739300663463951,30.198875765530772,"N/A","N/A",null,null,null,null,null,null,null,null,null,null,null,null,null,null,null,null,null,null,null,null,null,null,null,null,null,null,null,null,null,null,null,null,null,null,"Unimproved","N/A","N/A","N/A","N/A","N/A","N/A","N/A","N/A","N/A","N/A","N/A","N/A","N/A","N/A","N/A","N/A","N/A"]
[null,"Open defecation",{"$f":"0","v":0},{"$f":"0","v":0},{"$f":"0","v":0},{"$f":"0","v":0},{"$f":"0","v":0},{"$f":"0","v":0},{"$f":"0","v":0},{"$f":"0","v":0},{"$f":"0","v":0},{"$f":"0","v":0},{"$f":"0","v":0},{"$f":"0","v":0},{"$f":"0","v":0},{"$f":"0","v":0},{"$f":"0","v":0},"N/A","N/A",null,null,null,null,null,null,null,null,null,null,null,null,null,null,null,null,null,null,null,null,null,null,null,null,null,null,null,null,null,null,null,null,null,null,"Open defecation","N/A","N/A","N/A","N/A","N/A","N/A","N/A","N/A","N/A","N/A","N/A","N/A","N/A","N/A","N/A","N/A","N/A"]
["Shared among Improved Sanitation","Yes","N/A","N/A","N/A","N/A","N/A","N/A","N/A","N/A","N/A","N/A","N/A","N/A","N/A","N/A","N/A","N/A","N/A",null,null,null,null,null,null,null,null,null,null,null,null,null,null,null,null,null,null,null,null,null,null,null,null,null,null,null,null,null,null,null,null,null,"Shared among improved sanitation facilities","Yes","N/A","N/A","N/A","N/A","N/A","N/A","N/A","N/A","N/A","N/A","N/A","N/A","N/A","N/A","N/A","N/A","N/A"]
[null,"No","N/A","N/A","N/A","N/A","N/A","N/A","N/A","N/A","N/A","N/A","N/A","N/A","N/A","N/A","N/A","N/A","N/A",null,null,null,null,null,null,null,null,null,null,null,null,null,null,null,null,null,null,null,null,null,null,null,null,null,null,null,null,null,null,null,null,null,null,"No","N/A","N/A","N/A","N/A","N/A","N/A","N/A","N/A","N/A","N/A","N/A","N/A","N/A","N/A","N/A","N/A","N/A"]
["Manually calculated ratios","Improved latrines"]
[null,"Other"]
[null,"Other"]
[null,null,"NATIONAL wealth index quintile",null,null,null,null,"URBAN wealth index quintile",null,null,null,null,"RURAL wealth index quintile",null,null,null,null,"SUB-REGIONS:",null,null,null,null,null,null,null,null,null,null,null,null,null,null,null,null,null,null,null,null,null,null,null,null,null,null,null,null,null,null,null,null,null,null,"Raw numbers of respondents:","Use of sanitation facilities","NATIONAL wealth index quintile",null,null,null,null,"URBAN wealth index quintile",null,null,null,null,"RURAL wealth index quintile",null,null,null,null,"SUB-REGIONS:"]
["Percentage based on weighted population",null,"Poorest","Poor","Middle","Rich","Richest","Poorest","Poor","Middle","Rich","Richest","Poorest","Poor","Middle","Rich","Richest","Moldova","Transnistria",null,null,null,null,null,null,null,null,null,null,null,null,null,null,null,null,null,null,null,null,null,null,null,null,null,null,null,null,null,null,null,null,null,"Sanitation data, raw numbers (weighted)",null,"Poorest","Poor","Middle","Rich","Richest","Poorest","Poor","Middle","Rich","Richest","Poorest","Poor","Middle","Rich","Richest","Moldova","Transnistria"]
["Sanitation type","Sewer connection",{"$f":"C153*'DHS05'!C131/100","v":1.9604475035254374},{"$f":"D153*'DHS05'!D131/100","v":3.2945375553930272},{"$f":"E153*'DHS05'!E131/100","v":19.552529777532147},{"$f":"F153*'DHS05'!F131/100","v":49.74054251927452},{"$f":"G153*'DHS05'!G131/100","v":66.610991320283432},{"$f":"H153*'DHS05'!H131/100","v":38.136467067603704},{"$f":"I153*'DHS05'!I131/100","v":55.388269957789724},{"$f":"J153*'DHS05'!J131/100","v":74.052942791387267},{"$f":"K153*'DHS05'!K131/100","v":73.844818222454307},{"$f":"L153*'DHS05'!L131/100","v":86.95158250551053},{"$f":"M153*'DHS05'!M131/100","v":0.61239249273489882},{"$f":"N153*'DHS05'!N131/100","v":0.93212165563240201},{"$f":"O153*'DHS05'!O131/100","v":1.5108633266654139},{"$f":"P153*'DHS05'!P131/100","v":4.6276154929516755},{"$f":"Q153*'DHS05'!Q131/100","v":6.700090974801391},"N/A","N/A",null,null,null,null,null,null,null,null,null,null,null,null,null,null,null,null,null,null,null,null,null,null,null,null,null,null,null,null,null,null,null,null,null,"Sanitation type","Sewer connection","N/A","N/A","N/A","N/A","N/A","N/A","N/A","N/A","N/A","N/A","N/A","N/A","N/A","N/A","N/A","N/A","N/A"]
[null,"Septic tank connection",{"$f":"C153*(100-'DHS05'!C131)/100","v":0},{"$f":"D153*(100-'DHS05'!D131)/100","v":0.25694263919287968},{"$f":"E153*(100-'DHS05'!E131)/100","v":0.94615436325332358},{"$f":"F153*(100-'DHS05'!F131)/100","v":2.6089982237707541},{"$f":"G153*(100-'DHS05'!G131)/100","v":0.35091614949614647},{"$f":"H153*(100-'DHS05'!H131)/100","v":4.3318718887823664},{"$f":"I153*(100-'DHS05'!I131)/100","v":3.6900344668562868},{"$f":"J153*(100-'DHS05'!J131)/100","v":0.79410525502430618},{"$f":"K153*(100-'DHS05'!K131)/100","v":0.37167997780506917},{"$f":"L153*(100-'DHS05'!L131)/100","v":0.28470926815735198},{"$f":"M153*(100-'DHS05'!M131)/100","v":0},{"$f":"N153*(100-'DHS05'!N131)/100","v":0},{"$f":"O153*(100-'DHS05'!O131)/100","v":7.6167616250621281E-2},{"$f":"P153*(100-'DHS05'!P131)/100","v":0.1142593748927619},{"$f":"Q153*(100-'DHS05'!Q131)/100","v":0.9142251521895548},"N/A","N/A",null,null,null,null,null,null,null,null,null,null,null,null,null,null,null,null,null,null,null,null,null,null,null,null,null,null,null,null,null,null,null,null,null,null,"Septic tank connection","N/A","N/A","N/A","N/A","N/A","N/A","N/A","N/A","N/A","N/A","N/A","N/A","N/A","N/A","N/A","N/A","N/A"]
[null,"Improved latrines",{"$f":"C154+C155+C156*'DHS05'!C130/100","v":52.042835172758338},{"$f":"D154+D155+D156*'DHS05'!D130/100","v":58.663328724457074},{"$f":"E154+E155+E156*'DHS05'!E130/100","v":51.602665806098713},{"$f":"F154+F155+F156*'DHS05'!F130/100","v":31.799304830198611},{"$f":"G154+G155+G156*'DHS05'!G130/100","v":22.684707953824521},{"$f":"H154+H155+H156*'DHS05'!H130/100","v":32.283681245078029},{"$f":"I154+I155+I156*'DHS05'!I130/100","v":25.853450325391833},{"$f":"J154+J155+J156*'DHS05'!J130/100","v":19.709881850520674},{"$f":"K154+K155+K156*'DHS05'!K130/100","v":18.176925323108573},{"$f":"L154+L155+L156*'DHS05'!L130/100","v":12.44183796302972},{"$f":"M154+M155+M156*'DHS05'!M130/100","v":51.938727218363468},{"$f":"N154+N155+N156*'DHS05'!N130/100","v":58.848468238024473},{"$f":"O154+O155+O156*'DHS05'!O130/100","v":60.500673746951428},{"$f":"P154+P155+P156*'DHS05'!P130/100","v":62.518824468691605},{"$f":"Q154+Q155+Q156*'DHS05'!Q130/100","v":62.186808107478299},"N/A","N/A",null,null,null,null,null,null,null,null,null,null,null,null,null,null,null,null,null,null,null,null,null,null,null,null,null,null,null,null,null,null,null,null,null,null,"Improved latrines","N/A","N/A","N/A","N/A","N/A","N/A","N/A","N/A","N/A","N/A","N/A","N/A","N/A","N/A","N/A","N/A","N/A"]
[null,"Unimproved facilities",{"$f":"100-(C135+C136+C137+C139)","v":45.996717323716226},{"$f":"100-(D135+D136+D137+D139)","v":36.78519108095702},25.898650053115816,12.851154426756111,6.3533845763959107,20.247979798535908,9.0682452499621604,-1.556929896932246,-0.39342352336795727,-8.6781297366975991,37.448880288901634,29.219410106343133,25.912295310132535,19.739300663463951,16.198875765530758,"N/A","N/A",null,null,null,null,null,null,null,null,null,null,null,null,null,null,null,null,null,null,null,null,null,null,null,null,null,null,null,null,null,null,null,null,null,null,"Unimproved facilities","N/A","N/A","N/A","N/A","N/A","N/A","N/A","N/A","N/A","N/A","N/A","N/A","N/A","N/A","N/A","N/A","N/A"]
[null,"Open defecation",0,1,2,3,4,5,6,7,8,9,10,11,12,13,14,"N/A","N/A",null,null,null,null,null,null,null,null,null,null,null,null,null,null,null,null,null,null,null,null,null,null,null,null,null,null,null,null,null,null,null,null,null,null,"Open defecation","N/A","N/A","N/A","N/A","N/A","N/A","N/A","N/A","N/A","N/A","N/A","N/A","N/A","N/A","N/A","N/A","N/A"]
["Septic tank emptying practices","Not emptied/treated and disposed in situ","N/A","N/A","N/A","N/A","N/A","N/A","N/A","N/A","N/A","N/A","N/A","N/A","N/A","N/A","N/A","N/A","N/A",null,null,null,null,null,null,null,null,null,null,null,null,null,null,null,null,null,null,null,null,null,null,null,null,null,null,null,null,null,null,null,null,null,"Septic tank emptying practices","Not emptied/treated and disposed in situ","N/A","N/A","N/A","N/A","N/A","N/A","N/A","N/A","N/A","N/A","N/A","N/A","N/A","N/A","N/A","N/A","N/A"]
[null,"Emptied and buried on site","N/A","N/A","N/A","N/A","N/A","N/A","N/A","N/A","N/A","N/A","N/A","N/A","N/A","N/A","N/A","N/A","N/A",null,null,null,null,null,null,null,null,null,null,null,null,null,null,null,null,null,null,null,null,null,null,null,null,null,null,null,null,null,null,null,null,null,null,"Emptied and buried on site","N/A","N/A","N/A","N/A","N/A","N/A","N/A","N/A","N/A","N/A","N/A","N/A","N/A","N/A","N/A","N/A","N/A"]
[null,"Emptied and discharged locally","N/A","N/A","N/A","N/A","N/A","N/A","N/A","N/A","N/A","N/A","N/A","N/A","N/A","N/A","N/A","N/A","N/A",null,null,null,null,null,null,null,null,null,null,null,null,null,null,null,null,null,null,null,null,null,null,null,null,null,null,null,null,null,null,null,null,null,null,"Emptied and discharged locally","N/A","N/A","N/A","N/A","N/A","N/A","N/A","N/A","N/A","N/A","N/A","N/A","N/A","N/A","N/A","N/A","N/A"]
[null,"Emptied and removed offsite","N/A","N/A","N/A","N/A","N/A","N/A","N/A","N/A","N/A","N/A","N/A","N/A","N/A","N/A","N/A","N/A","N/A",null,null,null,null,null,null,null,null,null,null,null,null,null,null,null,null,null,null,null,null,null,null,null,null,null,null,null,null,null,null,null,null,null,null,"Emptied and removed offsite","N/A","N/A","N/A","N/A","N/A","N/A","N/A","N/A","N/A","N/A","N/A","N/A","N/A","N/A","N/A","N/A","N/A"]
["Latrine emptying practices","Not emptied/treated and disposed in situ","N/A","N/A","N/A","N/A","N/A","N/A","N/A","N/A","N/A","N/A","N/A","N/A","N/A","N/A","N/A","N/A","N/A",null,null,null,null,null,null,null,null,null,null,null,null,null,null,null,null,null,null,null,null,null,null,null,null,null,null,null,null,null,null,null,null,null,"Latrine emptying practices","Not emptied/treated and disposed in situ","N/A","N/A","N/A","N/A","N/A","N/A","N/A","N/A","N/A","N/A","N/A","N/A","N/A","N/A","N/A","N/A","N/A"]
[null,"Emptied and buried on site","N/A","N/A","N/A","N/A","N/A","N/A","N/A","N/A","N/A","N/A","N/A","N/A","N/A","N/A","N/A","N/A","N/A",null,null,null,null,null,null,null,null,null,null,null,null,null,null,null,null,null,null,null,null,null,null,null,null,null,null,null,null,null,null,null,null,null,null,"Emptied and buried on site","N/A","N/A","N/A","N/A","N/A","N/A","N/A","N/A","N/A","N/A","N/A","N/A","N/A","N/A","N/A","N/A","N/A"]
[null,"Emptied and discharged locally","N/A","N/A","N/A","N/A","N/A","N/A","N/A","N/A","N/A","N/A","N/A","N/A","N/A","N/A","N/A","N/A","N/A",null,null,null,null,null,null,null,null,null,null,null,null,null,null,null,null,null,null,null,null,null,null,null,null,null,null,null,null,null,null,null,null,null,null,"Emptied and discharged locally","N/A","N/A","N/A","N/A","N/A","N/A","N/A","N/A","N/A","N/A","N/A","N/A","N/A","N/A","N/A","N/A","N/A"]
[null,"Emptied and removed offsite","N/A","N/A","N/A","N/A","N/A","N/A","N/A","N/A","N/A","N/A","N/A","N/A","N/A","N/A","N/A","N/A","N/A",null,null,null,null,null,null,null,null,null,null,null,null,null,null,null,null,null,null,null,null,null,null,null,null,null,null,null,null,null,null,null,null,null,null,"Emptied and removed offsite","N/A","N/A","N/A","N/A","N/A","N/A","N/A","N/A","N/A","N/A","N/A","N/A","N/A","N/A","N/A","N/A","N/A"]
["Shared among improved sanitation facilities","Yes","N/A","N/A","N/A","N/A","N/A","N/A","N/A","N/A","N/A","N/A","N/A","N/A","N/A","N/A","N/A","N/A","N/A",null,null,null,null,null,null,null,null,null,null,null,null,null,null,null,null,null,null,null,null,null,null,null,null,null,null,null,null,null,null,null,null,null,"Shared among improved sanitation facilities","Yes","N/A","N/A","N/A","N/A","N/A","N/A","N/A","N/A","N/A","N/A","N/A","N/A","N/A","N/A","N/A","N/A","N/A"]
[null,"No","N/A","N/A","N/A","N/A","N/A","N/A","N/A","N/A","N/A","N/A","N/A","N/A","N/A","N/A","N/A","N/A","N/A",null,null,null,null,null,null,null,null,null,null,null,null,null,null,null,null,null,null,null,null,null,null,null,null,null,null,null,null,null,null,null,null,null,null,"No","N/A","N/A","N/A","N/A","N/A","N/A","N/A","N/A","N/A","N/A","N/A","N/A","N/A","N/A","N/A","N/A","N/A"]
[null,"DK/missing","N/A","N/A","N/A","N/A","N/A","N/A","N/A","N/A","N/A","N/A","N/A","N/A","N/A","N/A","N/A","N/A","N/A",null,null,null,null,null,null,null,null,null,null,null,null,null,null,null,null,null,null,null,null,null,null,null,null,null,null,null,null,null,null,null,null,null,null,"DK/missing","N/A","N/A","N/A","N/A","N/A","N/A","N/A","N/A","N/A","N/A","N/A","N/A","N/A","N/A","N/A","N/A","N/A"]
["Shared among all sanitation facilities","Yes","N/A","N/A","N/A","N/A","N/A","N/A","N/A","N/A","N/A","N/A","N/A","N/A","N/A","N/A","N/A","N/A","N/A",null,null,null,null,null,null,null,null,null,null,null,null,null,null,null,null,null,null,null,null,null,null,null,null,null,null,null,null,null,null,null,null,null,"Shared among all sanitation facilities","Yes","N/A","N/A","N/A","N/A","N/A","N/A","N/A","N/A","N/A","N/A","N/A","N/A","N/A","N/A","N/A","N/A","N/A"]
[null,"No","N/A","N/A","N/A","N/A","N/A","N/A","N/A","N/A","N/A","N/A","N/A","N/A","N/A","N/A","N/A","N/A","N/A",null,null,null,null,null,null,null,null,null,null,null,null,null,null,null,null,null,null,null,null,null,null,null,null,null,null,null,null,null,null,null,null,null,null,"No","N/A","N/A","N/A","N/A","N/A","N/A","N/A","N/A","N/A","N/A","N/A","N/A","N/A","N/A","N/A","N/A","N/A"]
["Type of toilet facility","Flush to sewage system/septic tank",1.9604475035254372,3.5514801945859071,20.498684140785471,52.349540743045274,66.961907469779575,42.46833895638607,59.078304424646014,74.847048046411572,74.21649820025938,87.236291773667872,0.61239249273489882,0.93212165563240212,1.587030942916035,4.7418748678444373,7.6143161269909454,26.958643409469286,41.298696902601897,null,null,null,null,null,null,null,null,null,null,null,null,null,null,null,null,null,null,null,null,null,null,null,null,null,null,null,null,null,null,null,null,null,"Type of toilet facility","Flush to sewage system/septic tank",125.65361408740797,227.52894089244182,1315.2438435235867,3369.9566272603338,4267.1118415106394,1094.1155882250487,1534.0988901329374,1915.6768179634146,1901.7336634323935,2266.7616709423623,23.43477027385244,35.718195653682763,60.813549847009114,181.55618615133423,291.58553465237412,7383.4930245333762,1922.0018427410289]
[null,"Pour flush latrine",0.17926539503817562,0.36528787103793547,0.995028840851643,2.7037270308071122,3.4821648290909399,2.6756695655789247,2.8685481259890149,3.3248050268522116,3.9495806157161346,3.93007031364191,5.5795502625354203E-2,0.11144051704309313,0.13001452132382546,0.3595630096757777,0.98416059283514012,0.62200641126925471,6.9689552154354972,null,null,null,null,null,null,null,null,null,null,null,null,null,null,null,null,null,null,null,null,null,null,null,null,null,null,null,null,null,null,null,null,null,null,"Pour flush latrine",11.48989948817642,23.402513280186586,63.843393462249189,174.05010046782127,221.89909663209198,68.933512649169231,74.488198996734042,85.096902021299869,101.2045919100123,102.11957168221741,2.1351580919940174,4.2703161839880348,4.9820355479860403,13.766894010744929,37.687822236379418,170.35649491207062,324.3285084184547]
[null,"Improved pit latrine",1.7229130764826683,2.7392243657782789,3.5254576792692545,2.7864740231563543,2.3034937989860356,2.7611812179947699,3.6626141651035788,1.694013714579736,1.7140305727459972,1.1210819626778241,1.3457652951001942,1.8492487102427779,2.9662654294204143,3.99643009006813,4.3503598802288286,2.2363380828312374,4.8517158898162887,null,null,null,null,null,null,null,null,null,null,null,null,null,null,null,null,null,null,null,null,null,null,null,null,null,null,null,null,null,null,null,null,null,null,"Improved pit latrine",110.4289987001394,175.49100224814063,226.2016662345705,179.37686687866574,146.78891384531815,71.136556944806543,95.107880640639124,43.357525607692665,43.920552968530885,29.13037190503313,51.499162558886525,70.861809556349044,113.66453272805666,153.01470949675979,166.5943455000801,612.49323210688385,225.79421579995045]
[null,"Traditional pit latrine",92.280023994851987,91.855944358659642,74.057277079871852,41.855436729282204,27.086734240385262,50.787701598467862,34.303595009101052,19.763495682774391,20.034205986775127,7.3906856867099862,94.02539673215216,94.08115039619021,94.095224384638414,89.695696693425262,86.646083507363898,68.647274349191207,46.635755802087147,null,null,null,null,null,null,null,null,null,null,null,null,null,null,null,null,null,null,null,null,null,null,null,null,null,null,null,null,null,null,null,null,null,null,"Traditional pit latrine",5914.6284214059442,5884.8380363945016,4751.6892830024144,2694.4077138147391,1726.0876936213735,1308.4480668309743,890.76874401760585,505.83785880151476,513.35922428439096,192.04075157253953,3598.123096652148,3605.1184058102281,3605.6414930174833,3434.2552386347306,3318.058268617378,18801.267690363366,2170.3834578757619]
[null,"Open pit",2.1595283782057066,0.60433782550347737,0.32723188407924853,0.10520737199448173,0,0.96741325566887559,8.6938275160619555E-2,0.17640820519426631,0,0,2.533576416191976,1.0323808952883675,0.43900884026026227,0.37321409479865164,0.14565142016056473,0.72074049350260228,0.16119039656418888,null,null,null,null,null,null,null,null,null,null,null,null,null,null,null,null,null,null,null,null,null,null,null,null,null,null,null,null,null,null,null,null,null,null,"Open pit",138.4135739201879,38.717474924305513,20.995968228200812,6.7726340185047134,0,24.92355362355649,2.2575446728349045,4.5150893456698089,0,0,96.95380330276501,39.560053759309163,16.822410495280188,14.289564688653993,5.5776312031293678,197.39800424846263,7.5016468427363314]
[null,"Bucket",1.6107362292637373,0.78509323699911282,0.51184848088354395,0.12239034393623366,0,0.28433190465376951,0,0,0,0,1.3169774446685147,1.8913334452349015,0.70343267624651185,0.70963039609418688,0.25942847242051142,0.70325903439807169,3.538687125713659E-2,null,null,null,null,null,null,null,null,null,null,null,null,null,null,null,null,null,null,null,null,null,null,null,null,null,null,null,null,null,null,null,null,null,null,"Bucket",103.23909626988195,50.297741484957058,32.841403803063116,7.8787730476007463,0,7.3252681116370297,0,0,0,0,50.397521585902751,72.474464717184475,26.954885984977007,27.170221037588945,9.934653168212682,192.61014347236625,1.646871133136675]
[null,"Other",1.1176556803537444E-2,3.9840500083060476E-2,0,0,0,0,0,0,0,0,1.871961680101291E-2,6.6609337671244565E-2,0,0,0,9.3194051923055667E-3,1.5392541942372176E-2,null,null,null,null,null,null,null,null,null,null,null,null,null,null,null,null,null,null,null,null,null,null,null,null,null,null,null,null,null,null,null,null,null,null,"Other",0.71635417571356874,2.552419355271367,0,0,0,0,0,0,0,0,0.71635417571356874,2.552419355271367,0,0,0,2.552419355271367,0.71635417571356874]
[null,"97",5.7261511660882712E-3,4.7265292867229663E-2,7.3750841544967458E-2,7.722375777842333E-2,0.16569966175812553,0,0,0.19422932418789476,8.5684624503575973E-2,0.32187026330245572,0,9.577797749391239E-3,7.9023205194514057E-2,0.12359084809357512,0,8.2126746312651988E-2,2.5020228635514511E-2,null,null,null,null,null,null,null,null,null,null,null,null,null,null,null,null,null,null,null,null,null,null,null,null,null,null,null,null,null,null,null,null,null,null,"97",0.3670139534651819,3.0280957341241104,4.7320276575072464,4.9712129392829079,10.559122574898367,0,0,4.9712129392829079,2.1955944946004617,8.3635280802979075,0,0.3670139534651819,3.0280957341241104,4.7320276575072464,0,22.493055355823095,1.1644175034547168]
[null,"98",7.018271466260019E-2,1.1526354485340836E-2,1.0721052714021243E-2,0,0,5.5363501250263146E-2,0,0,0,0,9.1376499725981164E-2,2.6137244947631928E-2,0,0,0,2.0292067832354647E-2,7.8861516602752139E-3,null,null,null,null,null,null,null,null,null,null,null,null,null,null,null,null,null,null,null,null,null,null,null,null,null,null,null,null,null,null,null,null,null,null,"98",4.4983156794367121,0.73844681223295749,0.68788798741244295,0,0,1.4263347996454003,0,0,0,0,3.4967562550347977,1.0015594244019148,0,0,0,5.5576365256169309,0.3670139534651819]
[null,null,null,null,null,null,null,null,null,null,null,null,null,null,null,null,null,null,null,null,null,null,null,null,null,null,null,null,null,null,null,null,null,null,null,null,null,null,null,null,null,null,null,null,null,null,null,null,null,null,null,null,null,"Total",6409.4352876803569,6406.5946711261631,6416.2354738990043,6437.4139284269431,6372.4466681843251,2576.3088811848238,2596.7212584607441,2559.4554066788728,2562.4136270899226,2598.4158941824489,3826.7566228962933,3831.9242384138788,3831.9070033549169,3828.784841677319,3829.4382553775581,27388.221700873521,4653.9043284436875]
[]
[]
[]
[]
[]
[]
[]
[]
[]
[]
[]
[]
[]
[]
[]
[]
[]
[]
[]
[]
[]
[]
[]
[]
[]
[]
[]
[]
[]
[]
[]
[]
[]
[]
[]
[]
[]
[]
[]
[]
[]
[]
[]
[]
[]
[{"$f":"A1026","v":"Republic of Moldova"}]
[{"$f":"A1034","v":"2000"}]
["Access to hygiene facilities "]
[" by wealth quintile and sub-national region"]
["Notes:"]
["WHO/UNICEF JMP customised wealth index excludes water,"]
[" sanitation and hygiene assets."]
["Survey used for analysis:",{"$f":"A1025","v":"MICS00"}]
[]
[]
[]
[]
["Access to handwashing",null,"NATIONAL wealth index quintile",null,null,null,null,"URBAN wealth index quintile",null,null,null,null,"RURAL wealth index quintile",null,null,null,null,"SUB-REGIONS:",null,null,null,null,null,null,null,null,null,null,null,null,null,null,null,null,null,null,null,null,null,null,null,null,null,null,null,null,null,null,null,null,null,null,"Raw numbers of respondents:","Access to handwashing","NATIONAL wealth index quintile",null,null,null,null,"URBAN wealth index quintile",null,null,null,null,"RURAL wealth index quintile",null,null,null,null,"SUB-REGIONS:"]
["Weighted percentage (used in graphs)",null,"Poorest","Poor","Middle","Rich","Richest","Poorest","Poor","Middle","Rich","Richest","Poorest","Poor","Middle","Rich","Richest","Moldova","Transnistria",null,null,null,null,null,null,null,null,null,null,null,null,null,null,null,null,null,null,null,null,null,null,null,null,null,null,null,null,null,null,null,null,null,"Hygiene data, raw numbers (weighted)",null,"Poorest","Poor","Middle","Rich","Richest","Poorest","Poor","Middle","Rich","Richest","Poorest","Poor","Middle","Rich","Richest","Moldova","Transnistria"]
["Hygiene ladder","Basic","N/A","N/A","N/A","N/A","N/A","N/A","N/A","N/A","N/A","N/A","N/A","N/A","N/A","N/A","N/A","N/A","N/A",null,null,null,null,null,null,null,null,null,null,null,null,null,null,null,null,null,null,null,null,null,null,null,null,null,null,null,null,null,null,null,null,null,"Hygiene ladder","Basic","N/A","N/A","N/A","N/A","N/A","N/A","N/A","N/A","N/A","N/A","N/A","N/A","N/A","N/A","N/A","N/A","N/A"]
[null,"Limited","N/A","N/A","N/A","N/A","N/A","N/A","N/A","N/A","N/A","N/A","N/A","N/A","N/A","N/A","N/A","N/A","N/A",null,null,null,null,null,null,null,null,null,null,null,null,null,null,null,null,null,null,null,null,null,null,null,null,null,null,null,null,null,null,null,null,null,null,"Limited","N/A","N/A","N/A","N/A","N/A","N/A","N/A","N/A","N/A","N/A","N/A","N/A","N/A","N/A","N/A","N/A","N/A"]
[null,"No facility","N/A","N/A","N/A","N/A","N/A","N/A","N/A","N/A","N/A","N/A","N/A","N/A","N/A","N/A","N/A","N/A","N/A",null,null,null,null,null,null,null,null,null,null,null,null,null,null,null,null,null,null,null,null,null,null,null,null,null,null,null,null,null,null,null,null,null,null,"No facility","N/A","N/A","N/A","N/A","N/A","N/A","N/A","N/A","N/A","N/A","N/A","N/A","N/A","N/A","N/A","N/A","N/A"]
[null,null,null,null,null,null,null,null,null,null,null,null,null,null,null,null,null,null,null,null,null,null,null,null,null,null,null,null,null,null,null,null,null,null,null,null,null,null,null,null,null,null,null,null,null,null,null,null,null,null,null,null,"Observed handwashing place","Fixed","N/A","N/A","N/A","N/A","N/A","N/A","N/A","N/A","N/A","N/A","N/A","N/A","N/A","N/A","N/A","N/A","N/A"]
[null,null,null,null,null,null,null,null,null,null,null,null,null,null,null,null,null,null,null,null,null,null,null,null,null,null,null,null,null,null,null,null,null,null,null,null,null,null,null,null,null,null,null,null,null,null,null,null,null,null,null,null,null,"Mobile","N/A","N/A","N/A","N/A","N/A","N/A","N/A","N/A","N/A","N/A","N/A","N/A","N/A","N/A","N/A","N/A","N/A"]
[null,null,null,null,null,null,null,null,null,null,null,null,null,null,null,null,null,null,null,null,null,null,null,null,null,null,null,null,null,null,null,null,null,null,null,null,null,null,null,null,null,null,null,null,null,null,null,null,null,null,null,null,"Water / Soap","Water and soap","N/A","N/A","N/A","N/A","N/A","N/A","N/A","N/A","N/A","N/A","N/A","N/A","N/A","N/A","N/A","N/A","N/A"]
[null,null,null,null,null,null,null,null,null,null,null,null,null,null,null,null,null,null,null,null,null,null,null,null,null,null,null,null,null,null,null,null,null,null,null,null,null,null,null,null,null,null,null,null,null,null,null,null,null,null,null,null,null,"Water only","N/A","N/A","N/A","N/A","N/A","N/A","N/A","N/A","N/A","N/A","N/A","N/A","N/A","N/A","N/A","N/A","N/A"]
[null,null,null,null,null,null,null,null,null,null,null,null,null,null,null,null,null,null,null,null,null,null,null,null,null,null,null,null,null,null,null,null,null,null,null,null,null,null,null,null,null,null,null,null,null,null,null,null,null,null,null,null,null,"Soap only","N/A","N/A","N/A","N/A","N/A","N/A","N/A","N/A","N/A","N/A","N/A","N/A","N/A","N/A","N/A","N/A","N/A"]
[null,null,null,null,null,null,null,null,null,null,null,null,null,null,null,null,null,null,null,null,null,null,null,null,null,null,null,null,null,null,null,null,null,null,null,null,null,null,null,null,null,null,null,null,null,null,null,null,null,null,null,null,null,"Neither","N/A","N/A","N/A","N/A","N/A","N/A","N/A","N/A","N/A","N/A","N/A","N/A","N/A","N/A","N/A","N/A","N/A"]
[]
[]
[]
[]
[]
[]
[]
[]
[]
[]
[]
[]
[]
[]
[]
[]
[]
[]
[]
[]
[]
[]
[]
[]
[]
[]
[]
[]
[null,null,null,null,null,null,null,null,null,null,null,null,null,null,null,null,null,null,null,null,null,null,null,null,null,null,null,null,null,null,null,null,null,null,null,null,null,null,null,null,null,null,null,null,null,null,null,null,null,null,null,null,"Raw numbers of respondents:","Menstrual health and hygiene","NATIONAL wealth index quintile",null,null,null,null,"URBAN wealth index quintile",null,null,null,null,"RURAL wealth index quintile",null,null,null,null,"SUB-REGIONS:"]
[null,null,null,null,null,null,null,null,null,null,null,null,null,null,null,null,null,null,null,null,null,null,null,null,null,null,null,null,null,null,null,null,null,null,null,null,null,null,null,null,null,null,null,null,null,null,null,null,null,null,null,null,"MHH data, raw numbers (weighted)",null,"Poorest","Poor","Middle","Rich","Richest","Poorest","Poor","Middle","Rich","Richest","Poorest","Poor","Middle","Rich","Richest","Moldova","Transnistria"]
[null,null,null,null,null,null,null,null,null,null,null,null,null,null,null,null,null,null,null,null,null,null,null,null,null,null,null,null,null,null,null,null,null,null,null,null,null,null,null,null,null,null,null,null,null,null,null,null,null,null,null,null,"Private place to wash and change","Yes","N/A","N/A","N/A","N/A","N/A","N/A","N/A","N/A","N/A","N/A","N/A","N/A","N/A","N/A","N/A","N/A","N/A"]
[null,null,null,null,null,null,null,null,null,null,null,null,null,null,null,null,null,null,null,null,null,null,null,null,null,null,null,null,null,null,null,null,null,null,null,null,null,null,null,null,null,null,null,null,null,null,null,null,null,null,null,null,null,"No","N/A","N/A","N/A","N/A","N/A","N/A","N/A","N/A","N/A","N/A","N/A","N/A","N/A","N/A","N/A","N/A","N/A"]
[null,null,null,null,null,null,null,null,null,null,null,null,null,null,null,null,null,null,null,null,null,null,null,null,null,null,null,null,null,null,null,null,null,null,null,null,null,null,null,null,null,null,null,null,null,null,null,null,null,null,null,null,null,"DK/not sure/missing","N/A","N/A","N/A","N/A","N/A","N/A","N/A","N/A","N/A","N/A","N/A","N/A","N/A","N/A","N/A","N/A","N/A"]
[null,null,null,null,null,null,null,null,null,null,null,null,null,null,null,null,null,null,null,null,null,null,null,null,null,null,null,null,null,null,null,null,null,null,null,null,null,null,null,null,null,null,null,null,null,null,null,null,null,null,null,null,"Use of menstrual materials","Materials reusable","N/A","N/A","N/A","N/A","N/A","N/A","N/A","N/A","N/A","N/A","N/A","N/A","N/A","N/A","N/A","N/A","N/A"]
[null,null,null,null,null,null,null,null,null,null,null,null,null,null,null,null,null,null,null,null,null,null,null,null,null,null,null,null,null,null,null,null,null,null,null,null,null,null,null,null,null,null,null,null,null,null,null,null,null,null,null,null,null,"Materials not reusable","N/A","N/A","N/A","N/A","N/A","N/A","N/A","N/A","N/A","N/A","N/A","N/A","N/A","N/A","N/A","N/A","N/A"]
[null,null,null,null,null,null,null,null,null,null,null,null,null,null,null,null,null,null,null,null,null,null,null,null,null,null,null,null,null,null,null,null,null,null,null,null,null,null,null,null,null,null,null,null,null,null,null,null,null,null,null,null,null,"No materials used","N/A","N/A","N/A","N/A","N/A","N/A","N/A","N/A","N/A","N/A","N/A","N/A","N/A","N/A","N/A","N/A","N/A"]
[null,null,null,null,null,null,null,null,null,null,null,null,null,null,null,null,null,null,null,null,null,null,null,null,null,null,null,null,null,null,null,null,null,null,null,null,null,null,null,null,null,null,null,null,null,null,null,null,null,null,null,null,null,"DK/not sure/missing","N/A","N/A","N/A","N/A","N/A","N/A","N/A","N/A","N/A","N/A","N/A","N/A","N/A","N/A","N/A","N/A","N/A"]
[null,null,null,null,null,null,null,null,null,null,null,null,null,null,null,null,null,null,null,null,null,null,null,null,null,null,null,null,null,null,null,null,null,null,null,null,null,null,null,null,null,null,null,null,null,null,null,null,null,null,null,null,"Use of menstrual materials with private place to wash and change","Materials reusable","N/A","N/A","N/A","N/A","N/A","N/A","N/A","N/A","N/A","N/A","N/A","N/A","N/A","N/A","N/A","N/A","N/A"]
[null,null,null,null,null,null,null,null,null,null,null,null,null,null,null,null,null,null,null,null,null,null,null,null,null,null,null,null,null,null,null,null,null,null,null,null,null,null,null,null,null,null,null,null,null,null,null,null,null,null,null,null,null,"Materials not reusable","N/A","N/A","N/A","N/A","N/A","N/A","N/A","N/A","N/A","N/A","N/A","N/A","N/A","N/A","N/A","N/A","N/A"]
[null,null,null,null,null,null,null,null,null,null,null,null,null,null,null,null,null,null,null,null,null,null,null,null,null,null,null,null,null,null,null,null,null,null,null,null,null,null,null,null,null,null,null,null,null,null,null,null,null,null,null,null,null,"No materials used","N/A","N/A","N/A","N/A","N/A","N/A","N/A","N/A","N/A","N/A","N/A","N/A","N/A","N/A","N/A","N/A","N/A"]
[null,null,null,null,null,null,null,null,null,null,null,null,null,null,null,null,null,null,null,null,null,null,null,null,null,null,null,null,null,null,null,null,null,null,null,null,null,null,null,null,null,null,null,null,null,null,null,null,null,null,null,null,"Awareness of menstruation before menarche","Yes","N/A","N/A","N/A","N/A","N/A","N/A","N/A","N/A","N/A","N/A","N/A","N/A","N/A","N/A","N/A","N/A","N/A"]
[null,null,null,null,null,null,null,null,null,null,null,null,null,null,null,null,null,null,null,null,null,null,null,null,null,null,null,null,null,null,null,null,null,null,null,null,null,null,null,null,null,null,null,null,null,null,null,null,null,null,null,null,null,"No","N/A","N/A","N/A","N/A","N/A","N/A","N/A","N/A","N/A","N/A","N/A","N/A","N/A","N/A","N/A","N/A","N/A"]
[null,null,null,null,null,null,null,null,null,null,null,null,null,null,null,null,null,null,null,null,null,null,null,null,null,null,null,null,null,null,null,null,null,null,null,null,null,null,null,null,null,null,null,null,null,null,null,null,null,null,null,null,null,"DK/not sure/missing","N/A","N/A","N/A","N/A","N/A","N/A","N/A","N/A","N/A","N/A","N/A","N/A","N/A","N/A","N/A","N/A","N/A"]
[null,null,null,null,null,null,null,null,null,null,null,null,null,null,null,null,null,null,null,null,null,null,null,null,null,null,null,null,null,null,null,null,null,null,null,null,null,null,null,null,null,null,null,null,null,null,null,null,null,null,null,null,"Participation in (all) activities during menstruation","Yes","N/A","N/A","N/A","N/A","N/A","N/A","N/A","N/A","N/A","N/A","N/A","N/A","N/A","N/A","N/A","N/A","N/A"]
[null,null,null,null,null,null,null,null,null,null,null,null,null,null,null,null,null,null,null,null,null,null,null,null,null,null,null,null,null,null,null,null,null,null,null,null,null,null,null,null,null,null,null,null,null,null,null,null,null,null,null,null,null,"No","N/A","N/A","N/A","N/A","N/A","N/A","N/A","N/A","N/A","N/A","N/A","N/A","N/A","N/A","N/A","N/A","N/A"]
[null,null,null,null,null,null,null,null,null,null,null,null,null,null,null,null,null,null,null,null,null,null,null,null,null,null,null,null,null,null,null,null,null,null,null,null,null,null,null,null,null,null,null,null,null,null,null,null,null,null,null,null,null,"DK/not sure/missing/no such activity","N/A","N/A","N/A","N/A","N/A","N/A","N/A","N/A","N/A","N/A","N/A","N/A","N/A","N/A","N/A","N/A","N/A"]
[null,null,null,null,null,null,null,null,null,null,null,null,null,null,null,null,null,null,null,null,null,null,null,null,null,null,null,null,null,null,null,null,null,null,null,null,null,null,null,null,null,null,null,null,null,null,null,null,null,null,null,null,"Participation in specific activities during menstruation","Did not go to school (amongst those usually attending school)","N/A","N/A","N/A","N/A","N/A","N/A","N/A","N/A","N/A","N/A","N/A","N/A","N/A","N/A","N/A","N/A","N/A"]
[null,null,null,null,null,null,null,null,null,null,null,null,null,null,null,null,null,null,null,null,null,null,null,null,null,null,null,null,null,null,null,null,null,null,null,null,null,null,null,null,null,null,null,null,null,null,null,null,null,null,null,null,null,"Did not go to work (amongst those who usually work)","N/A","N/A","N/A","N/A","N/A","N/A","N/A","N/A","N/A","N/A","N/A","N/A","N/A","N/A","N/A","N/A","N/A"]
[null,null,null,null,null,null,null,null,null,null,null,null,null,null,null,null,null,null,null,null,null,null,null,null,null,null,null,null,null,null,null,null,null,null,null,null,null,null,null,null,null,null,null,null,null,null,null,null,null,null,null,null,null,"Did not participate in social activities","N/A","N/A","N/A","N/A","N/A","N/A","N/A","N/A","N/A","N/A","N/A","N/A","N/A","N/A","N/A","N/A","N/A"]
[null,null,null,null,null,null,null,null,null,null,null,null,null,null,null,null,null,null,null,null,null,null,null,null,null,null,null,null,null,null,null,null,null,null,null,null,null,null,null,null,null,null,null,null,null,null,null,null,null,null,null,null,null,"Did not cook food","N/A","N/A","N/A","N/A","N/A","N/A","N/A","N/A","N/A","N/A","N/A","N/A","N/A","N/A","N/A","N/A","N/A"]
[null,null,null,null,null,null,null,null,null,null,null,null,null,null,null,null,null,null,null,null,null,null,null,null,null,null,null,null,null,null,null,null,null,null,null,null,null,null,null,null,null,null,null,null,null,null,null,null,null,null,null,null,null,"Did not eat with others","N/A","N/A","N/A","N/A","N/A","N/A","N/A","N/A","N/A","N/A","N/A","N/A","N/A","N/A","N/A","N/A","N/A"]
[null,null,null,null,null,null,null,null,null,null,null,null,null,null,null,null,null,null,null,null,null,null,null,null,null,null,null,null,null,null,null,null,null,null,null,null,null,null,null,null,null,null,null,null,null,null,null,null,null,null,null,null,null,"Did not bathe in regular place","N/A","N/A","N/A","N/A","N/A","N/A","N/A","N/A","N/A","N/A","N/A","N/A","N/A","N/A","N/A","N/A","N/A"]
[null,null,null,null,null,null,null,null,null,null,null,null,null,null,null,null,null,null,null,null,null,null,null,null,null,null,null,null,null,null,null,null,null,null,null,null,null,null,null,null,null,null,null,null,null,null,null,null,null,null,null,null,null,"Did not participate in other activities","N/A","N/A","N/A","N/A","N/A","N/A","N/A","N/A","N/A","N/A","N/A","N/A","N/A","N/A","N/A","N/A","N/A"]
[null,null,null,null,null,null,null,null,null,null,null,null,null,null,null,null,null,null,null,null,null,null,null,null,null,null,null,null,null,null,null,null,null,null,null,null,null,null,null,null,null,null,null,null,null,null,null,null,null,null,null,null,null,"DK/not sure/missing/no such activity","N/A","N/A","N/A","N/A","N/A","N/A","N/A","N/A","N/A","N/A","N/A","N/A","N/A","N/A","N/A","N/A","N/A"]
[]
[]
[]
[]
[]
[]
[]
[]
[]
[]
[]
[]
[]
[]
[]
[]
[]
[]
[]
[]
[]
[]
[]
[]
[]
[]
[]
[]
[]
[]
[]
[]
[]
[]
[]
[]
[]
[]
[]
[]
[]
[]
[]
[]
[]
[]
[]
[]
[]
[]
[]
[]
[]
[]
[null,null,null,null,null,null,null,null,null,null,null,null,null,null,null,null,null,null,null,null,null,null,null,null,null,null,null,null,null,null,null,null,null,null,null,null,null,null,null,null,null,null,null,null,null,null,null,null,null,null,null,null,"Raw numbers of respondents:","Basic water, sanitation and hygiene","NATIONAL wealth index quintile",null,null,null,null,"URBAN wealth index quintile",null,null,null,null,"RURAL wealth index quintile",null,null,null,null,"SUB-REGIONS:"]
[null,null,null,null,null,null,null,null,null,null,null,null,null,null,null,null,null,null,null,null,null,null,null,null,null,null,null,null,null,null,null,null,null,null,null,null,null,null,null,null,null,null,null,null,null,null,null,null,null,null,null,null,"WatSan data, raw numbers (weighted)",null,"Poorest","Poor","Middle","Rich","Richest","Poorest","Poor","Middle","Rich","Richest","Poorest","Poor","Middle","Rich","Richest","Moldova","Transnistria"]
[null,null,null,null,null,null,null,null,null,null,null,null,null,null,null,null,null,null,null,null,null,null,null,null,null,null,null,null,null,null,null,null,null,null,null,null,null,null,null,null,null,null,null,null,null,null,null,null,null,null,null,null,"Use of Basic Water Sanitation and Hygiene","Yes","N/A","N/A","N/A","N/A","N/A","N/A","N/A","N/A","N/A","N/A","N/A","N/A","N/A","N/A","N/A","N/A","N/A"]
[null,null,null,null,null,null,null,null,null,null,null,null,null,null,null,null,null,null,null,null,null,null,null,null,null,null,null,null,null,null,null,null,null,null,null,null,null,null,null,null,null,null,null,null,null,null,null,null,null,null,null,null,null,"No","N/A","N/A","N/A","N/A","N/A","N/A","N/A","N/A","N/A","N/A","N/A","N/A","N/A","N/A","N/A","N/A","N/A"]
[null,null,null,null,null,null,null,null,null,null,null,null,null,null,null,null,null,null,null,null,null,null,null,null,null,null,null,null,null,null,null,null,null,null,null,null,null,null,null,null,null,null,null,null,null,null,null,null,null,null,null,null,"Use of Basic Water and Sanitation","Yes","N/A","N/A","N/A","N/A","N/A","N/A","N/A","N/A","N/A","N/A","N/A","N/A","N/A","N/A","N/A","N/A","N/A"]
[null,null,null,null,null,null,null,null,null,null,null,null,null,null,null,null,null,null,null,null,null,null,null,null,null,null,null,null,null,null,null,null,null,null,null,null,null,null,null,null,null,null,null,null,null,null,null,null,null,null,null,null,null,"No","N/A","N/A","N/A","N/A","N/A","N/A","N/A","N/A","N/A","N/A","N/A","N/A","N/A","N/A","N/A","N/A","N/A"]
[null,null,null,null,null,null,null,null,null,null,null,null,null,null,null,null,null,null,null,null,null,null,null,null,null,null,null,null,null,null,null,null,null,null,null,null,null,null,null,null,null,null,null,null,null,null,null,null,null,null,null,null,"Use of Basic Water and Hygiene","Yes","N/A","N/A","N/A","N/A","N/A","N/A","N/A","N/A","N/A","N/A","N/A","N/A","N/A","N/A","N/A","N/A","N/A"]
[null,null,null,null,null,null,null,null,null,null,null,null,null,null,null,null,null,null,null,null,null,null,null,null,null,null,null,null,null,null,null,null,null,null,null,null,null,null,null,null,null,null,null,null,null,null,null,null,null,null,null,null,null,"No","N/A","N/A","N/A","N/A","N/A","N/A","N/A","N/A","N/A","N/A","N/A","N/A","N/A","N/A","N/A","N/A","N/A"]
[null,null,null,null,null,null,null,null,null,null,null,null,null,null,null,null,null,null,null,null,null,null,null,null,null,null,null,null,null,null,null,null,null,null,null,null,null,null,null,null,null,null,null,null,null,null,null,null,null,null,null,null,"Use of Basic Sanitation and Hygiene","Yes","N/A","N/A","N/A","N/A","N/A","N/A","N/A","N/A","N/A","N/A","N/A","N/A","N/A","N/A","N/A","N/A","N/A"]
[null,null,null,null,null,null,null,null,null,null,null,null,null,null,null,null,null,null,null,null,null,null,null,null,null,null,null,null,null,null,null,null,null,null,null,null,null,null,null,null,null,null,null,null,null,null,null,null,null,null,null,null,null,"No","N/A","N/A","N/A","N/A","N/A","N/A","N/A","N/A","N/A","N/A","N/A","N/A","N/A","N/A","N/A","N/A","N/A"]
[null,null,null,null,null,null,null,null,null,null,null,null,null,null,null,null,null,null,null,null,null,null,null,null,null,null,null,null,null,null,null,null,null,null,null,null,null,null,null,null,null,null,null,null,null,null,null,null,null,null,null,null,"Use of Basic Water","Yes","N/A","N/A","N/A","N/A","N/A","N/A","N/A","N/A","N/A","N/A","N/A","N/A","N/A","N/A","N/A","N/A","N/A"]
[null,null,null,null,null,null,null,null,null,null,null,null,null,null,null,null,null,null,null,null,null,null,null,null,null,null,null,null,null,null,null,null,null,null,null,null,null,null,null,null,null,null,null,null,null,null,null,null,null,null,null,null,null,"No","N/A","N/A","N/A","N/A","N/A","N/A","N/A","N/A","N/A","N/A","N/A","N/A","N/A","N/A","N/A","N/A","N/A"]
[null,null,null,null,null,null,null,null,null,null,null,null,null,null,null,null,null,null,null,null,null,null,null,null,null,null,null,null,null,null,null,null,null,null,null,null,null,null,null,null,null,null,null,null,null,null,null,null,null,null,null,null,"Use of Basic Sanitation","Yes","N/A","N/A","N/A","N/A","N/A","N/A","N/A","N/A","N/A","N/A","N/A","N/A","N/A","N/A","N/A","N/A","N/A"]
[null,null,null,null,null,null,null,null,null,null,null,null,null,null,null,null,null,null,null,null,null,null,null,null,null,null,null,null,null,null,null,null,null,null,null,null,null,null,null,null,null,null,null,null,null,null,null,null,null,null,null,null,null,"No","N/A","N/A","N/A","N/A","N/A","N/A","N/A","N/A","N/A","N/A","N/A","N/A","N/A","N/A","N/A","N/A","N/A"]
[null,null,null,null,null,null,null,null,null,null,null,null,null,null,null,null,null,null,null,null,null,null,null,null,null,null,null,null,null,null,null,null,null,null,null,null,null,null,null,null,null,null,null,null,null,null,null,null,null,null,null,null,"Access to Basic Hygiene","Yes","N/A","N/A","N/A","N/A","N/A","N/A","N/A","N/A","N/A","N/A","N/A","N/A","N/A","N/A","N/A","N/A","N/A"]
[null,null,null,null,null,null,null,null,null,null,null,null,null,null,null,null,null,null,null,null,null,null,null,null,null,null,null,null,null,null,null,null,null,null,null,null,null,null,null,null,null,null,null,null,null,null,null,null,null,null,null,null,null,"No","N/A","N/A","N/A","N/A","N/A","N/A","N/A","N/A","N/A","N/A","N/A","N/A","N/A","N/A","N/A","N/A","N/A"]
[]
[]
[]
[]
[]
[]
[]
[]
[]
[]
[]
[]
[]
[]
[]
[]
[]
[]
[]
[]
[]
[]
[]
[]
[]
[]
[]
[]
[]
[]
[]
[]
[]
[]
[]
[]
[]
[]
[]
[]
[]
[]
[]
[]
[null,null,"INITIAL (national) Wealth Index",null,null,null,null,"URBAN Wealth Index",null,null,null,null,"RURAL Wealth Index"]
[null,null,"Component Matrix",null,null,null,null,"Component Matrix",null,null,null,null,"Component Matrix"]
[null,null,null,null,"Component",null,null,null,null,"Component",null,null,null,null,"Component"]
[null,"Note:\n\nThe INITIAL (national) Wealth Index is based on the first component of the Principal Component Analysis (PCA) which has been obtained at national level.\n\nThe final national-level (NATIONAL) Wealth Index is based on the URBAN and RURAL specific wealth indexes. Regression procedures are used to establish the relationships between the two sets of scores (urban and rural) and the initial (national) wealth factors.\nThis allows best use of the available information for each area and a better precision of the FINAL (NATIONAL) Wealth Index.\n\nFor dependency reasons, all WASH variables (contained in the generic MICS and DHS scripts) have been excluded from the sets of asset variables used in the PCAs.\n\nThe PCA can extracts as many components as there are asset variables in the input. Only the first of the components is used to represent the Wealth Index. \n\nThe scores represent the weights of the asset variables on the Wealth Index (correlations between the variables and the component).\n\nThe communalities are the proportion of each variable's variance that can be explained by the component.\n\nProportion of explained variance is the part of the model's total variance that is explained by the component.\n\nFor more information on the procedure used:\n\nThe DHS Wealth Index, DHS Comparative Reports No. 6, Shea Oscar Rutstein, Kiersten Johnson, ORC Macro International Inc., 2004.\n\nThe DHS Wealth Index: Approaches for Rural and Urban Areas, Shea O. Rutstein, ORC Macro International Inc., 2008.\n\nMICS Methodological Paper No. 4, Review of options for reporting water, sanitation and hygiene coverage by wealth quintile, UNICEF, 2016.",null,null,"1",null,null,null,null,"1",null,null,null,null,"1"]
[null,null,"Household fuel type: LPG",null,-0.77907984151678089,null,null,"Household fuel type: LPG",null,-0.73250685579192287,null,null,"Household fuel type: LPG",null,-0.67320130159804425]
[null,null,"Household fuel type: coal/lignite",null,0.73410766807462891,null,null,"Have Refrigerator",null,0.68671659565804766,null,null,"Have Refrigerator",null,0.64952072416140183]
[null,null,"Have Refrigerator",null,0.71288919443406018,null,null,"Have television",null,0.6343683932369214,null,null,"Household fuel type: coal/lignite",null,0.62873324725654522]
[null,null,"Have television",null,0.64461623303225135,null,null,"Household fuel type: coal/lignite",null,0.60648129053295907,null,null,"Have television",null,0.61248877809351976]
[null,null,"Has dirt floor",null,0.51231362466723274,null,null,"Have radio",null,0.37490347377838573,null,null,"Has dirt floor",null,0.5415317364709189]
[null,null,"Has bamboo floor",null,-0.42195999528842165,null,null,"Has dirt floor",null,0.36106854907308095,null,null,"Have car or truck",null,0.50244724947235309]
[null,null,"Have radio",null,0.39504994049751213,null,null,"Household fuel type: electricity",null,0.32738751061807031,null,null,"Have Bicycle",null,0.41959249974520224]
[null,null,"Have car or truck",null,0.38502790587261765,null,null,"Has bamboo floor",null,-0.29843648472844908,null,null,"Have motorcycle or scooter",null,0.36064878923038657]
[null,null,"Have Bicycle",null,0.26219985296410653,null,null,"Have car or truck",null,0.27534078753588404,null,null,"Has earth/sand floor",null,-0.34748276202600009]
[null,null,"Have Electricity",null,0.25140036937391913,null,null,"Household fuel type: charcoal",null,0.25310601900495283,null,null,"Have radio",null,0.33701060667021809]
[null,null,"Persons per sleeping rooms",null,-0.16895349084518782,null,null,"Have Bicycle",null,0.19511652839657043,null,null,"Have Electricity",null,0.28954923574781261]
[null,null,"Household fuel type: charcoal",null,0.16584542760342813,null,null,"Have Electricity",null,0.18548760190618871,null,null,"Has bamboo floor",null,-0.13787351457342203]
[null,null,"Have motorcycle or scooter",null,0.13169962616517089,null,null,"Has earth/sand floor",null,0.16461512034266748,null,null,"Household fuel type: electricity",null,-4.3822399597235329E-2]
[null,null,"Has wood floor",null,0.11249286618665616,null,null,"Has wood floor",null,0.15318176887297966,null,null,"Household fuel type: charcoal",null,4.1384990885118642E-2]
[null,null,"Household fuel type: grass, straw",null,5.0255068510215231E-2,null,null,"Household fuel type: grass, straw",null,0.13290811873266606,null,null,"Household fuel type: natural gas",null,-3.6963767041173851E-2]
[null,null,"Household fuel type: biogas",null,3.4558800182994724E-2,null,null,"Persons per sleeping rooms",null,-9.6656134842757965E-2,null,null,"Household fuel type: biogas",null,3.5040975581620941E-2]
[null,null,"Household fuel type: kerosene",null,2.4269673195942275E-2,null,null,"Household fuel type: kerosene",null,8.8109271401860353E-2,null,null,"Household fuel type: grass, straw",null,-3.2623816561894343E-2]
[null,null,"Has earth/sand floor",null,-1.5418428141116398E-2,null,null,"Have motorcycle or scooter",null,8.0390102114688028E-2,null,null,"Persons per sleeping rooms",null,2.8567967079839624E-2]
[null,null,"Household fuel type: electricity",null,-1.1553834868461864E-2,null,null,"Household fuel type: biogas",null,7.5002564014473E-2,null,null,"Has wood floor",null,1.1868138865852798E-2]
[null,null,"Household fuel type: natural gas",null,-5.3138726494022584E-3,null,null,"Household fuel type: natural gas",null,5.5942442080804018E-2,null,null,"Household fuel type: kerosene",null,-5.0274570858081236E-3]
[null,null,"Has other floor",null,4.2069663314978061E-3,null,null,"Has other floor",null,-3.2614383608171746E-2,null,null,"Has other floor",null,-4.2147814043083974E-3]
[]
[]
[]
[null,null,"Communalities",null,null,null,null,"Communalities",null,null,null,null,"Communalities"]
[null,null,null,null,"Extraction",null,null,null,null,"Extraction",null,null,null,null,"Extraction"]
[null,null,"Persons per sleeping rooms",null,2.8545282068774963E-2,null,null,"Persons per sleeping rooms",null,9.3424084027414096E-3,null,null,"Persons per sleeping rooms",null,8.1612874307480053E-4]
[null,null,"Has earth/sand floor",null,2.3772792634277007E-4,null,null,"Has earth/sand floor",null,2.7098137845430897E-2,null,null,"Has earth/sand floor",null,0.1207442699052178]
[null,null,"Has wood floor",null,1.2654644942888928E-2,null,null,"Has wood floor",null,2.3464654315054959E-2,null,null,"Has wood floor",null,1.4085272013916573E-4]
[null,null,"Has bamboo floor",null,0.17805023762380481,null,null,"Has bamboo floor",null,8.9064335417073828E-2,null,null,"Has bamboo floor",null,1.9009106020827619E-2]
[null,null,"Has dirt floor",null,0.26246525001967824,null,null,"Has dirt floor",null,0.13037049712973986,null,null,"Has dirt floor",null,0.29325662160520877]
[null,null,"Has other floor",null,1.769856571435611E-5,null,null,"Has other floor",null,1.0636980181409818E-3,null,null,"Has other floor",null,1.7764382286103867E-5]
[null,null,"Household fuel type: electricity",null,1.3349110016768517E-4,null,null,"Household fuel type: electricity",null,0.10718258210869711,null,null,"Household fuel type: electricity",null,1.9204027064597712E-3]
[null,null,"Household fuel type: LPG",null,0.60696539945781247,null,null,"Household fuel type: LPG",null,0.53656629378216891,null,null,"Household fuel type: LPG",null,0.45319999247330095]
[null,null,"Household fuel type: natural gas",null,2.8237242534065376E-5,null,null,"Household fuel type: natural gas",null,3.1295568259641121E-3,null,null,"Household fuel type: natural gas",null,1.3663200738741703E-3]
[null,null,"Household fuel type: biogas",null,1.1943106700881563E-3,null,null,"Household fuel type: biogas",null,5.6253846087451201E-3,null,null,"Household fuel type: biogas",null,1.227869969711755E-3]
[null,null,"Household fuel type: kerosene",null,5.8901703703783889E-4,null,null,"Household fuel type: kerosene",null,7.763243706966687E-3,null,null,"Household fuel type: kerosene",null,2.5275324749642309E-5]
[null,null,"Household fuel type: coal/lignite",null,0.53891406832596955,null,null,"Household fuel type: coal/lignite",null,0.36781955576652353,null,null,"Household fuel type: coal/lignite",null,0.39530549620576005]
[null,null,"Household fuel type: charcoal",null,2.7504705856963921E-2,null,null,"Household fuel type: charcoal",null,6.4062656856535546E-2,null,null,"Household fuel type: charcoal",null,1.712717470561353E-3]
[null,null,"Household fuel type: grass, straw",null,2.5255719109664263E-3,null,null,"Household fuel type: grass, straw",null,1.7664568025056459E-2,null,null,"Household fuel type: grass, straw",null,1.0643134070641316E-3]
[null,null,"Have Electricity",null,6.3202145721342973E-2,null,null,"Have Electricity",null,3.4405650460908745E-2,null,null,"Have Electricity",null,8.3838759922142361E-2]
[null,null,"Have radio",null,0.15606445548708789,null,null,"Have radio",null,0.14055261465110075,null,null,"Have radio",null,0.11357614900822845]
[null,null,"Have television",null,0.41553008788868978,null,null,"Have television",null,0.40242325833799336,null,null,"Have television",null,0.37514250329049287]
[null,null,"Have Refrigerator",null,0.50821100354084325,null,null,"Have Refrigerator",null,0.47157968275217854,null,null,"Have Refrigerator",null,0.42187717111515183]
[null,null,"Have Bicycle",null,6.8748762894399087E-2,null,null,"Have Bicycle",null,3.8070459653529676E-2,null,null,"Have Bicycle",null,0.17605786584242755]
[null,null,"Have motorcycle or scooter",null,1.7344791532045767E-2,null,null,"Have motorcycle or scooter",null,6.4625685180099684E-3,null,null,"Have motorcycle or scooter",null,0.13006754917334379]
[null,null,"Have car or truck",null,0.14824648830065332,null,null,"Have car or truck",null,7.5812549280880839E-2,null,null,"Have car or truck",null,0.25245323850233303]
[]
[]
[null,null,"Total Variance Explained",null,null,null,null,"Total Variance Explained",null,null,null,null,"Total Variance Explained"]
[null,null,"Component",null,"Extraction Sums of Squared Loadings",null,null,"Component",null,"Extraction Sums of Squared Loadings",null,null,"Component",null,"Extraction Sums of Squared Loadings"]
[null,null,null,null,"Total","% of Variance","Cumulative %",null,null,"Total","% of Variance","Cumulative %",null,null,"Total","% of Variance","Cumulative %"]
[null,null,"1",null,3.0371733781138057,14.462730371970503,14.462730371970503,"1",null,2.5595243564634416,12.188211221254482,12.188211221254482,"1",null,2.8428203678623558,13.537239846963601,13.537239846963601]
[]
[]
[null,null,"Component Score Coefficient Matrix",null,null,null,null,"Component Score Coefficient Matrix",null,null,null,null,"Component Score Coefficient Matrix"]
[null,null,null,null,"Component",null,null,null,null,"Component",null,null,null,null,"Component"]
[null,null,null,null,"1",null,null,null,null,"1",null,null,null,null,"1"]
[null,null,"Persons per sleeping rooms",null,-5.5628530153294713E-2,null,null,"Persons per sleeping rooms",null,-3.7763319031786889E-2,null,null,"Persons per sleeping rooms",null,1.0049163641430204E-2]
[null,null,"Has earth/sand floor",null,-5.0765716083985288E-3,null,null,"Has earth/sand floor",null,6.4314730948729984E-2,null,null,"Has earth/sand floor",null,-0.12223169847600605]
[null,null,"Has wood floor",null,3.7038671218868079E-2,null,null,"Has wood floor",null,5.9847748073253243E-2,null,null,"Has wood floor",null,4.1747762187228817E-3]
[null,null,"Has bamboo floor",null,-0.13893181019203915,null,null,"Has bamboo floor",null,-0.11659841562938132,null,null,"Has bamboo floor",null,-4.8498848584335744E-2]
[null,null,"Has dirt floor",null,0.16868105994837804,null,null,"Has dirt floor",null,0.14106861228387699,null,null,"Has dirt floor",null,0.19049101469542407]
[null,null,"Has other floor",null,1.385158437715032E-3,null,null,"Has other floor",null,-1.2742361105418765E-2,null,null,"Has other floor",null,-1.4826056025051208E-3]
[null,null,"Household fuel type: electricity",null,-3.8041407025756332E-3,null,null,"Household fuel type: electricity",null,0.12790951169944317,null,null,"Household fuel type: electricity",null,-1.5415113839988193E-2]
[null,null,"Household fuel type: LPG",null,-0.25651477361513603,null,null,"Household fuel type: LPG",null,-0.28618866389849318,null,null,"Household fuel type: LPG",null,-0.23680754127432066]
[null,null,"Household fuel type: natural gas",null,-1.7496112298674119E-3,null,null,"Household fuel type: natural gas",null,2.1856577351778393E-2,null,null,"Household fuel type: natural gas",null,-1.3002498314365379E-2]
[null,null,"Household fuel type: biogas",null,1.137860631600063E-2,null,null,"Household fuel type: biogas",null,2.9303321074117816E-2,null,null,"Household fuel type: biogas",null,1.2326130760055664E-2]
[null,null,"Household fuel type: kerosene",null,7.9908751244930944E-3,null,null,"Household fuel type: kerosene",null,3.4424080075410236E-2,null,null,"Household fuel type: kerosene",null,-1.7684751181055081E-3]
[null,null,"Household fuel type: coal/lignite",null,0.24170752758623748,null,null,"Household fuel type: coal/lignite",null,0.23695077915607313,null,null,"Household fuel type: coal/lignite",null,0.22116530976219154]
[null,null,"Household fuel type: charcoal",null,5.4605189416754372E-2,null,null,"Household fuel type: charcoal",null,9.8887911875421938E-2,null,null,"Household fuel type: charcoal",null,1.4557722799853819E-2]
[null,null,"Household fuel type: grass, straw",null,1.6546657781330031E-2,null,null,"Household fuel type: grass, straw",null,5.1926881804050709E-2,null,null,"Household fuel type: grass, straw",null,-1.147586281943859E-2]
[null,null,"Have Electricity",null,8.2774454427112024E-2,null,null,"Have Electricity",null,7.2469559212353651E-2,null,null,"Have Electricity",null,0.10185280752210793]
[null,null,"Have radio",null,0.13007158015551037,null,null,"Have radio",null,0.14647388403695413,null,null,"Have radio",null,0.11854797808545021]
[null,null,"Have television",null,0.2122421583428277,null,null,"Have television",null,0.2478462030005622,null,null,"Have television",null,0.21545110096213274]
[null,null,"Have Refrigerator",null,0.23472127062986112,null,null,"Have Refrigerator",null,0.26829851957607515,null,null,"Have Refrigerator",null,0.22847758215894787]
[null,null,"Have Bicycle",null,8.6330222322356209E-2,null,null,"Have Bicycle",null,7.6231557595399416E-2,null,null,"Have Bicycle",null,0.14759726097668022]
[null,null,"Have motorcycle or scooter",null,4.3362564387733796E-2,null,null,"Have motorcycle or scooter",null,3.1408219230921887E-2,null,null,"Have motorcycle or scooter",null,0.12686302423729098]
[null,null,"Have car or truck",null,0.12677179006215766,null,null,"Have car or truck",null,0.10757498237536965,null,null,"Have car or truck",null,0.17674252483640593]
[]
[]
[null,null,"Component Score Covariance Matrix",null,null,null,null,"Component Score Covariance Matrix",null,null,null,null,"Component Score Covariance Matrix"]
[null,null,"Component",null,"1",null,null,"Component",null,"1",null,null,"Component",null,"1"]
[null,null,"1",null,1,null,null,"1",null,0.99999999999999978,null,null,"1",null,1]
[]
[]
[]
[]
[]
[]
[]
[]
[]
[]
[]
[]
[]
[]
[]
[]
[]
[]
[]
[]
[]
[]
[]
[]
[]
[]
[]
[]
[]
[]
[]
[]
[]
[]
[]
[]
[]
[]
[]
[]
[]
[]
[]
[]
[]
[]
[]
[]
[]
[]
[]
[]
[]
[]
[]
[]
[]
[]
[]
[]
[]
[]
[]
[]
[]
[]
[]
[]
[]
[]
[]
[]
[]
[]
[]
[]
[]
[]
[]
[]
[]
[]
[]
[]
[]
[]
[]
[]
[]
[]
[]
[]
[]
[]
[]
[]
[]
[]
[]
[]
[]
[]
[]
[]
[]
[]
[]
[]
[]
[]
[]
[]
[]
[]
[]
[]
[]
[]
[]
[]
[]
[]
[]
[]
[]
[]
[]
[]
[]
[]
[]
[]
[]
[]
[]
[]
[]
[]
[]
[]
[]
[]
[]
[]
[]
[]
[]
[]
[]
[]
[]
[]
[]
[]
[]
[]
[]
[]
[]
[]
[]
[]
[]
[]
[]
[]
[]
[]
[]
[]
[]
[]
[]
[]
[]
[]
[]
[]
[]
[]
[]
[]
[]
[]
[]
[]
[]
[]
[]
[]
[]
[]
[]
[]
[]
[]
[]
[]
[]
[]
[]
[]
[]
[]
[]
[]
[]
[]
[]
[]
[]
[]
[]
[]
[]
[]
[]
[]
[]
[]
[]
[]
[]
[]
[]
[]
[]
[]
[]
[]
[]
[]
[]
[]
[]
[]
[]
[]
[]
[]
[]
[]
[]
[]
[]
[]
[]
[]
[]
[]
[]
[]
[]
[]
[]
[]
[]
[]
[]
[]
[]
[]
[]
[]
[]
[]
[]
[]
[]
[]
[]
[]
[]
[]
[]
[]
[]
[]
[]
[]
[]
[]
[]
[]
[]
[]
[]
[]
[]
[]
[]
[]
[]
[]
[]
[]
[]
[]
[]
[]
[]
[]
[]
[]
[]
[]
[]
[]
[]
[]
[]
[]
[]
[]
[]
[]
[]
[]
[]
[]
[]
[]
[]
[]
[]
[]
[]
[]
[]
[]
[]
[]
[]
[]
[]
[]
[]
[]
[]
[]
[]
[]
[]
[]
[]
[]
[]
[]
[]
[]
[]
[]
[]
[]
[]
[]
[]
[]
[]
[]
[]
[]
[]
[]
[]
[]
[]
[]
[]
[]
[]
[]
[]
[]
[]
[]
[]
[]
[]
[]
[]
[]
[]
[]
[]
[]
[]
[]
[]
[]
[]
[]
[]
[]
[]
[]
[]
[]
[]
[]
[]
[]
[]
[]
[]
[]
[]
[]
[]
[]
[]
[]
[]
[]
[]
[]
[]
[]
[]
[]
[]
[]
[]
[]
[]
[]
[]
[]
[]
[]
[]
[]
[]
[]
[]
[]
[]
[]
[]
[]
[]
[]
[]
[]
[]
[]
[]
[]
[]
[]
[]
[]
[]
[]
[]
[]
[]
[]
[]
[]
[]
[]
[]
[]
[]
[]
[]
[]
[]
[]
[]
[]
[]
[]
[]
[]
[]
[]
[]
[]
[]
[]
[]
[]
[]
[]
[]
[]
[]
[]
[]
[]
[]
[]
[]
[]
[]
[]
[]
[]
[]
[]
[]
[]
[]
[]
[]
[]
[]
[]
[]
[]
[]
[]
[]
[]
[]
[]
[]
[]
[]
[]
[]
[]
[]
[]
[]
[]
[]
[]
[]
[]
[]
[]
[]
[]
[]
[]
["MICS00"]
["Republic of Moldova",null,"Count"]
["W_text_t","",10380]
["W_text_i","",10380]
["S_text_s","Ratio of Shared improved based on:",10380]
["S_text_i","Ratio of Improved latrines based on:",10380]
["Urban/Rural","Urban",4462]
[null,"Rural",5918]
[null,"Missing",0]
["2000"]
[]
["Sub-national region names","Weighted population"]
[{"$f":"R15","v":"Moldova"},{"$f":"BR122+BR123","v":{"$error":"#VALUE!"}}]
[{"$f":"S15","v":"Transnistria"},{"$f":"BS122+BS123","v":{"$error":"#VALUE!"}}]
[{"$f":"T15","v":0},{"$f":"BT122+BT123","v":0}]
[{"$f":"U15","v":0},{"$f":"BU122+BU123","v":0}]
[{"$f":"V15","v":0},{"$f":"BV122+BV123","v":0}]
[{"$f":"W15","v":0},{"$f":"BW122+BW123","v":0}]
[{"$f":"X15","v":0},{"$f":"BX122+XR123","v":0}]
[{"$f":"Y15","v":0},{"$f":"BY122+BY123","v":0}]
[{"$f":"Z15","v":0},{"$f":"BZ122+BZ123","v":0}]
[{"$f":"AA15","v":0},{"$f":"CA122+CA123","v":0}]
[{"$f":"AB15","v":0},{"$f":"CB122+CB123","v":0}]
[{"$f":"AC15","v":0},{"$f":"CC122+CC123","v":0}]
[{"$f":"AD15","v":0},{"$f":"CD122+CD123","v":0}]
[{"$f":"AE15","v":0},{"$f":"CE122+CE123","v":0}]
[{"$f":"AF15","v":0},{"$f":"CF122+CF123","v":0}]
[{"$f":"AG15","v":0},{"$f":"CG122+CG123","v":0}]
[{"$f":"AH15","v":0},{"$f":"CH122+CH123","v":0}]
[{"$f":"AI15","v":0},{"$f":"CI122+CI123","v":0}]
[{"$f":"AJ15","v":0},{"$f":"CJ122+CJ123","v":0}]
[{"$f":"AK15","v":0},{"$f":"CK122+CK123","v":0}]
[{"$f":"AL15","v":0},{"$f":"CL122+CL123","v":0}]
[{"$f":"AM15","v":0},{"$f":"CM122+CM123","v":0}]
[{"$f":"AN15","v":0},{"$f":"CN122+CN123","v":0}]
[{"$f":"AO15","v":0},{"$f":"CO122+CO123","v":0}]
[{"$f":"AP15","v":0},{"$f":"CP122+CP123","v":0}]
[{"$f":"AQ15","v":0},{"$f":"CQ122+CQ123","v":0}]
[{"$f":"AR15","v":0},{"$f":"CR122+CR123","v":0}]
[{"$f":"AS15","v":0},{"$f":"CS122+CS123","v":0}]
[{"$f":"AT15","v":0},{"$f":"CT122+CT123","v":0}]
[{"$f":"AU15","v":0},{"$f":"CU122+CU123","v":0}]
[{"$f":"AV15","v":0},{"$f":"CV122+CV123","v":0}]
[{"$f":"AW15","v":0},{"$f":"CW122+CW123","v":0}]
[{"$f":"AX15","v":0},{"$f":"CX122+CX123","v":0}]
[{"$f":"AY15","v":0},{"$f":"CY122+CY123","v":0}]
[]
[{"$f":"34-COUNTIF(A1037:A1071,\"0\")","v":2},"Sub-regions"]

{"sheet":"DHS05","index":5,"n_rows":1072,"n_cols":73,"rows_kept":1072,"cut":false,"hidden":false,"merged":[[340,52,341,52],[342,52,343,52],[344,52,345,52],[346,52,347,52],[348,52,349,52],[350,52,351,52],[352,52,353,52],[152,52,163,52],[219,54,219,58],[219,59,219,63],[219,64,219,68],[221,52,223,52],[224,52,225,52],[226,52,229,52],[258,54,258,58],[258,59,258,63],[258,64,258,68],[260,52,262,52],[263,52,266,52],[267,52,269,52],[270,52,272,52],[273,52,275,52],[276,52,283,52],[338,54,338,58],[338,59,338,63],[338,64,338,68],[150,52,151,52],[13,54,13,58],[13,59,13,63],[13,64,13,68],[15,52,16,52],[17,52,20,52],[21,52,22,52],[26,54,26,58],[26,59,26,63],[26,64,26,68],[55,54,55,58],[55,59,55,63],[55,64,55,68],[119,54,119,58],[119,59,119,63],[119,64,119,68],[121,52,122,52],[123,52,126,52],[127,52,128,52],[132,54,132,58],[132,59,132,63],[132,64,132,68],[134,52,138,52],[40,52,41,52],[42,52,43,52],[44,52,45,52],[46,52,48,52],[49,0,51,0],[49,52,51,52],[52,0,54,0],[52,52,54,52],[139,0,142,0],[139,52,142,52],[143,0,146,0],[143,52,146,52],[147,0,149,0],[147,52,149,52],[13,2,13,6],[13,7,13,11],[28,52,29,52],[30,0,31,0],[30,52,31,52],[32,0,33,0],[32,52,33,52],[34,52,35,52],[36,52,37,52],[38,0,39,0],[38,52,39,52],[28,0,29,0],[34,0,35,0],[36,0,37,0],[40,0,41,0],[42,0,43,0],[44,0,45,0],[26,2,26,6],[26,7,26,11],[26,12,26,16],[13,12,13,16],[15,0,16,0],[17,0,20,0],[21,0,22,0],[23,0,25,0],[121,0,122,0],[123,0,126,0],[127,0,128,0],[129,0,131,0],[132,2,132,6],[57,0,70,0],[107,0,107,1],[119,2,119,6],[119,7,119,11],[119,12,119,16],[55,2,55,6],[55,7,55,11],[55,12,55,16],[46,0,48,0],[207,0,207,1],[132,7,132,11],[132,12,132,16],[134,0,138,0],[152,0,162,0],[150,0,151,0],[1024,0,1024,2],[1025,0,1025,1],[1030,0,1032,0],[1033,0,1033,2],[398,2,398,5],[398,7,398,10],[219,2,219,6],[219,7,219,11],[219,12,219,16],[221,0,223,0],[401,1,444,1],[402,2,402,3],[402,7,402,8],[402,12,402,13],[403,2,403,3],[403,7,403,8],[403,12,403,13],[404,2,404,3],[404,7,404,8],[404,12,404,13],[398,12,398,15],[399,2,399,4],[399,7,399,9],[399,12,399,14],[400,2,401,3],[400,7,401,8],[400,12,401,13],[409,2,409,3],[409,7,409,8],[409,12,409,13],[410,2,410,3],[410,7,410,8],[410,12,410,13],[407,2,407,3],[407,7,407,8],[407,12,407,13],[408,2,408,3],[408,7,408,8],[408,12,408,13],[405,2,405,3],[405,7,405,8],[405,12,405,13],[406,2,406,3],[406,7,406,8],[406,12,406,13],[415,2,415,3],[415,7,415,8],[415,12,415,13],[416,2,416,3],[416,7,416,8],[416,12,416,13],[413,2,413,3],[413,7,413,8],[413,12,413,13],[414,2,414,3],[414,7,414,8],[414,12,414,13],[411,2,411,3],[411,7,411,8],[411,12,411,13],[412,2,412,3],[412,7,412,8],[412,12,412,13],[421,2,421,3],[421,7,421,8],[421,12,421,13],[422,2,422,3],[422,7,422,8],[422,12,422,13],[419,2,419,3],[419,7,419,8],[419,12,419,13],[420,2,420,3],[420,7,420,8],[420,12,420,13],[417,2,417,3],[417,7,417,8],[417,12,417,13],[418,2,418,3],[418,7,418,8],[418,12,418,13],[427,2,427,3],[427,7,427,8],[427,12,427,13],[428,2,428,3],[428,7,428,8],[428,12,428,13],[425,2,425,3],[425,7,425,8],[425,12,425,13],[426,2,426,3],[426,7,426,8],[426,12,426,13],[423,2,423,3],[423,7,423,8],[423,12,423,13],[424,2,424,3],[424,7,424,8],[424,12,424,13],[433,2,433,3],[433,7,433,8],[433,12,433,13],[434,2,434,3],[434,7,434,8],[434,12,434,13],[431,2,431,3],[431,7,431,8],[431,12,431,13],[432,2,432,3],[432,7,432,8],[432,12,432,13],[429,2,429,3],[429,7,429,8],[429,12,429,13],[430,2,430,3],[430,7,430,8],[430,12,430,13],[439,2,439,3],[439,7,439,8],[439,12,439,13],[440,2,440,3],[440,7,440,8],[440,12,440,13],[437,2,437,3],[437,7,437,8],[437,12,437,13],[438,2,438,3],[438,7,438,8],[438,12,438,13],[435,2,435,3],[435,7,435,8],[435,12,435,13],[436,2,436,3],[436,7,436,8],[436,12,436,13],[445,2,445,3],[445,7,445,8],[445,12,445,13],[446,2,446,3],[446,7,446,8],[446,12,446,13],[443,2,443,3],[443,7,443,8],[443,12,443,13],[444,2,444,3],[444,7,444,8],[444,12,444,13],[441,2,441,3],[441,7,441,8],[441,12,441,13],[442,2,442,3],[442,7,442,8],[442,12,442,13],[451,2,451,3],[451,7,451,8],[451,12,451,13],[452,2,452,3],[452,7,452,8],[452,12,452,13],[449,2,449,3],[449,7,449,8],[449,12,449,13],[450,2,450,3],[450,7,450,8],[450,12,450,13],[447,2,447,3],[447,7,447,8],[447,12,447,13],[448,2,448,3],[448,7,448,8],[448,12,448,13],[457,2,457,3],[457,7,457,8],[457,12,457,13],[458,2,458,3],[458,7,458,8],[458,12,458,13],[455,2,455,3],[455,7,455,8],[455,12,455,13],[456,2,456,3],[456,7,456,8],[456,12,456,13],[453,2,453,3],[453,7,453,8],[453,12,453,13],[454,2,454,3],[454,7,454,8],[454,12,454,13],[463,2,463,3],[463,7,463,8],[463,12,463,13],[464,2,464,3],[464,7,464,8],[464,12,464,13],[461,2,461,3],[461,7,461,8],[461,12,461,13],[462,2,462,3],[462,7,462,8],[462,12,462,13],[459,2,459,3],[459,7,459,8],[459,12,459,13],[460,2,460,3],[460,7,460,8],[460,12,460,13],[469,2,469,3],[469,7,469,8],[469,12,469,13],[470,2,470,3],[470,7,470,8],[470,12,470,13],[467,2,467,3],[467,7,467,8],[467,12,467,13],[468,2,468,3],[468,7,468,8],[468,12,468,13],[465,2,465,3],[465,7,465,8],[465,12,465,13],[466,2,466,3],[466,7,466,8],[466,12,466,13],[475,2,475,3],[475,7,475,8],[475,12,475,13],[476,2,476,3],[476,7,476,8],[476,12,476,13],[473,2,473,3],[473,7,473,8],[473,12,473,13],[474,2,474,3],[474,7,474,8],[474,12,474,13],[471,2,471,3],[471,7,471,8],[471,12,471,13],[472,2,472,4],[472,7,472,8],[472,12,472,13],[481,2,481,3],[481,7,481,8],[481,12,481,13],[482,2,482,3],[482,7,482,8],[482,12,482,13],[479,2,479,3],[479,7,479,8],[479,12,479,13],[480,2,480,3],[480,7,480,8],[480,12,480,13],[477,2,477,3],[477,7,477,8],[477,12,477,13],[478,2,478,3],[478,7,478,8],[478,12,478,13],[487,2,487,3],[487,7,487,8],[487,12,487,13],[488,2,488,3],[488,7,488,8],[488,12,488,13],[485,2,485,3],[485,7,485,9],[485,12,485,13],[486,2,486,3],[486,7,486,8],[486,12,486,13],[483,2,483,3],[483,7,483,8],[483,12,483,13],[484,2,484,3],[484,7,484,8],[484,12,484,13],[493,2,493,3],[493,7,493,8],[493,12,493,13],[494,2,494,3],[494,7,494,8],[494,12,494,13],[491,2,491,3],[491,7,491,8],[491,12,491,13],[492,2,492,3],[492,7,492,8],[492,12,492,13],[489,2,489,3],[489,7,489,8],[489,12,489,14],[490,2,490,3],[490,7,490,8],[490,12,490,13],[499,2,499,3],[499,7,499,8],[499,12,499,13],[500,2,500,3],[500,7,500,8],[500,12,500,13],[497,2,497,3],[497,7,497,8],[497,12,497,13],[498,2,498,3],[498,7,498,8],[498,12,498,13],[495,2,495,3],[495,7,495,8],[495,12,495,13],[496,2,496,3],[496,7,496,8],[496,12,496,13],[505,2,505,3],[505,7,505,8],[505,12,505,13],[506,2,506,3],[506,7,506,8],[506,12,506,13],[503,2,503,3],[503,7,503,8],[503,12,503,13],[504,2,504,3],[504,7,504,8],[504,12,504,13],[501,2,501,3],[501,7,501,8],[501,12,501,13],[502,2,502,3],[502,7,502,8],[502,12,502,13],[511,2,511,3],[511,7,511,8],[511,12,511,13],[512,2,512,3],[512,7,512,8],[512,12,512,13],[509,2,509,3],[509,7,509,8],[509,12,509,13],[510,2,510,3],[510,7,510,8],[510,12,510,13],[507,2,507,3],[507,7,507,8],[507,12,507,13],[508,2,508,3],[508,7,508,8],[508,12,508,13],[517,2,517,3],[517,7,517,8],[517,12,517,13],[518,2,518,3],[518,7,518,8],[518,12,518,13],[515,2,515,3],[515,7,515,8],[515,12,515,13],[516,2,516,3],[516,7,516,8],[516,12,516,13],[513,2,513,3],[513,7,513,8],[513,12,513,13],[514,2,514,3],[514,7,514,8],[514,12,514,13],[523,2,523,3],[523,7,523,8],[523,12,523,13],[524,2,524,3],[524,7,524,8],[524,12,524,13],[521,2,521,3],[521,7,521,8],[521,12,521,13],[522,2,522,3],[522,7,522,8],[522,12,522,13],[519,2,519,3],[519,7,519,8],[519,12,519,13],[520,2,520,3],[520,7,520,8],[520,12,520,13],[529,2,529,3],[529,7,529,8],[529,12,529,13],[530,2,530,3],[530,7,530,8],[530,12,530,13],[527,2,527,3],[527,7,527,8],[527,12,527,13],[528,2,528,3],[528,7,528,8],[528,12,528,13],[525,2,525,3],[525,7,525,8],[525,12,525,13],[526,2,526,3],[526,7,526,8],[526,12,526,13],[535,2,535,3],[535,7,535,8],[535,12,535,13],[536,2,536,3],[536,7,536,8],[536,12,536,13],[533,2,533,3],[533,7,533,8],[533,12,533,13],[534,2,534,3],[534,7,534,8],[534,12,534,13],[531,2,531,3],[531,7,531,8],[531,12,531,13],[532,2,532,3],[532,7,532,8],[532,12,532,13],[541,2,541,3],[541,7,541,8],[541,12,541,13],[542,2,542,3],[542,7,542,8],[542,12,542,13],[539,2,539,3],[539,7,539,8],[539,12,539,13],[540,2,540,3],[540,7,540,8],[540,12,540,13],[537,2,537,3],[537,7,537,8],[537,12,537,13],[538,2,538,3],[538,7,538,8],[538,12,538,13],[548,2,548,3],[548,7,548,8],[548,12,548,13],[549,2,549,4],[549,7,549,8],[549,12,549,13],[546,2,546,3],[546,7,546,8],[546,12,546,13],[547,2,547,3],[547,7,547,8],[547,12,547,13],[543,2,543,6],[543,7,543,8],[543,12,543,13],[544,2,545,3],[544,4,544,6],[544,7,544,8],[544,12,544,13],[545,7,545,8],[545,12,545,13],[555,2,555,3],[555,7,555,8],[555,12,555,13],[556,2,556,3],[556,7,556,8],[556,12,556,13],[553,2,553,3],[553,7,553,8],[553,12,553,13],[554,2,554,3],[554,7,554,8],[554,12,554,13],[550,2,551,3],[550,7,550,8],[550,12,550,13],[551,7,551,8],[551,12,551,13],[552,2,552,3],[552,7,552,8],[552,12,552,13],[561,2,561,3],[561,7,561,8],[561,12,561,13],[562,2,562,3],[562,7,562,8],[562,12,562,13],[559,2,559,3],[559,7,559,8],[559,12,559,13],[560,2,560,3],[560,7,560,8],[560,12,560,13],[557,2,557,3],[557,7,557,8],[557,12,557,13],[558,2,558,3],[558,7,558,8],[558,12,558,13],[567,2,567,3],[567,7,567,8],[567,12,567,13],[568,2,568,3],[568,7,568,8],[568,12,568,13],[565,2,565,3],[565,7,565,8],[565,12,565,13],[566,2,566,3],[566,7,566,8],[566,12,566,13],[563,2,563,3],[563,7,563,8],[563,12,563,13],[564,2,564,3],[564,7,564,8],[564,12,564,13],[574,2,574,3],[574,7,574,8],[574,12,574,13],[575,2,575,3],[575,7,575,9],[575,12,575,13],[572,2,572,3],[572,7,572,8],[572,12,572,13],[573,2,573,3],[573,7,573,8],[573,12,573,13],[569,2,569,3],[569,7,569,11],[569,12,569,13],[570,2,570,3],[570,7,571,8],[570,9,570,11],[570,12,570,13],[571,2,571,3],[571,12,571,13],[579,7,579,8],[580,2,580,3],[580,7,580,8],[580,12,580,13],[581,2,581,3],[581,7,581,8],[581,12,581,13],[576,2,576,3],[576,7,577,8],[576,12,576,13],[577,2,577,3],[577,12,577,16],[578,2,578,3],[578,7,578,8],[578,12,579,13],[578,14,578,16],[579,2,579,3],[587,2,587,3],[587,7,587,8],[587,12,587,13],[588,2,588,3],[588,7,588,8],[588,12,588,13],[584,2,584,3],[584,7,584,8],[584,12,585,13],[585,2,585,3],[585,7,585,8],[586,2,586,3],[586,7,586,8],[586,12,586,13],[582,2,582,3],[582,7,582,8],[582,12,582,13],[583,2,583,3],[583,7,583,8],[583,12,583,14],[593,2,593,3],[593,7,593,8],[593,12,593,13],[594,2,594,3],[594,7,594,8],[594,12,594,13],[591,2,591,3],[591,7,591,8],[591,12,591,13],[592,2,592,3],[592,7,592,8],[592,12,592,13],[589,2,589,3],[589,7,589,8],[589,12,589,13],[590,2,590,3],[590,7,590,8],[590,12,590,13],[599,2,599,3],[599,7,599,8],[599,12,599,13],[600,2,600,3],[600,7,600,8],[600,12,600,13],[597,2,597,3],[597,7,597,8],[597,12,597,13],[598,2,598,3],[598,7,598,8],[598,12,598,13],[595,2,595,3],[595,7,595,8],[595,12,595,13],[596,2,596,3],[596,7,596,8],[596,12,596,13],[605,2,605,3],[605,7,605,8],[605,12,605,13],[606,2,606,3],[606,7,606,8],[606,12,606,13],[603,2,603,3],[603,7,603,8],[603,12,603,13],[604,2,604,3],[604,7,604,8],[604,12,604,13],[601,2,601,3],[601,7,601,8],[601,12,601,13],[602,2,602,3],[602,7,602,8],[602,12,602,13],[611,2,611,3],[611,7,611,8],[611,12,611,13],[612,2,612,3],[612,7,612,8],[612,12,612,13],[609,2,609,3],[609,7,609,8],[609,12,609,13],[610,2,610,3],[610,7,610,8],[610,12,610,13],[607,2,607,3],[607,7,607,8],[607,12,607,13],[608,2,608,3],[608,7,608,8],[608,12,608,13],[617,2,617,3],[617,7,617,8],[617,12,617,13],[618,2,618,3],[618,7,618,8],[618,12,618,13],[615,2,615,3],[615,7,615,8],[615,12,615,13],[616,2,616,3],[616,7,616,8],[616,12,616,13],[613,2,613,3],[613,7,613,8],[613,12,613,13],[614,2,614,3],[614,7,614,8],[614,12,614,13],[623,2,623,3],[623,7,623,8],[623,12,623,13],[624,2,624,3],[624,7,624,8],[624,12,624,13],[621,2,621,4],[621,7,621,8],[621,12,621,13],[622,2,622,3],[622,7,622,8],[622,12,622,13],[619,2,619,3],[619,7,619,8],[619,12,619,13],[620,2,620,3],[620,7,620,8],[620,12,620,13],[629,2,629,3],[629,7,629,8],[629,12,629,13],[630,2,630,3],[630,7,630,8],[630,12,630,13],[627,2,627,3],[627,7,627,8],[627,12,627,13],[628,2,628,3],[628,7,628,8],[628,12,628,13],[625,2,625,3],[625,7,625,8],[625,12,625,13],[626,2,626,3],[626,7,626,8],[626,12,626,13],[635,2,635,3],[635,7,635,8],[635,12,635,13],[636,2,636,3],[636,7,636,8],[636,12,636,13],[633,2,633,3],[633,7,633,8],[633,12,633,13],[634,2,634,3],[634,7,634,8],[634,12,634,13],[631,2,631,3],[631,7,631,8],[631,12,631,13],[632,2,632,3],[632,7,632,8],[632,12,632,13],[641,2,641,3],[641,7,641,8],[641,12,641,13],[642,2,642,3],[642,7,642,8],[642,12,642,13],[639,2,639,3],[639,7,639,8],[639,12,639,13],[640,2,640,3],[640,7,640,8],[640,12,640,13],[637,2,637,3],[637,7,637,8],[637,12,637,13],[638,2,638,3],[638,7,638,8],[638,12,638,13],[647,2,647,3],[647,7,647,8],[647,12,647,13],[648,2,648,3],[648,7,648,8],[648,12,648,13],[645,2,645,3],[645,7,645,8],[645,12,645,13],[646,2,646,3],[646,7,646,8],[646,12,646,13],[643,2,643,3],[643,7,643,8],[643,12,643,13],[644,2,644,3],[644,7,644,8],[644,12,644,13],[653,2,653,3],[653,7,653,8],[653,12,653,13],[654,2,654,3],[654,7,654,8],[654,12,654,13],[651,2,651,3],[651,7,651,8],[651,12,651,13],[652,2,652,3],[652,7,652,8],[652,12,652,13],[649,2,649,3],[649,7,649,8],[649,12,649,13],[650,2,650,3],[650,7,650,8],[650,12,650,13],[659,2,659,3],[659,7,659,8],[659,12,659,13],[660,2,660,3],[660,7,660,9],[660,12,660,13],[657,2,657,3],[657,7,657,8],[657,12,657,13],[658,2,658,3],[658,7,658,8],[658,12,658,13],[655,2,655,3],[655,7,655,8],[655,12,655,13],[656,2,656,3],[656,7,656,8],[656,12,656,13],[665,2,665,3],[665,7,665,8],[665,12,665,13],[666,2,666,3],[666,7,666,8],[666,12,666,13],[663,2,663,3],[663,7,663,8],[663,12,663,13],[664,2,664,3],[664,7,664,8],[664,12,664,13],[661,2,661,3],[661,7,661,8],[661,12,661,13],[662,2,662,3],[662,7,662,8],[662,12,662,13],[671,2,671,3],[671,7,671,8],[671,12,671,13],[672,2,672,3],[672,7,672,8],[672,12,672,14],[669,2,669,3],[669,7,669,8],[669,12,669,13],[670,2,670,3],[670,7,670,8],[670,12,670,13],[667,2,667,3],[667,7,667,8],[667,12,667,13],[668,2,668,3],[668,7,668,8],[668,12,668,13],[677,2,677,3],[677,7,677,8],[677,12,677,13],[678,2,678,3],[678,7,678,8],[678,12,678,13],[675,2,675,3],[675,7,675,8],[675,12,675,13],[676,2,676,3],[676,7,676,8],[676,12,676,13],[673,2,673,3],[673,7,673,8],[673,12,673,13],[674,2,674,3],[674,7,674,8],[674,12,674,13],[683,2,683,3],[683,7,683,8],[683,12,683,13],[684,2,684,3],[684,7,684,8],[684,12,684,13],[681,2,681,3],[681,7,681,8],[681,12,681,13],[682,2,682,3],[682,7,682,8],[682,12,682,13],[679,2,679,3],[679,7,679,8],[679,12,679,13],[680,2,680,3],[680,7,680,8],[680,12,680,13],[689,2,689,3],[689,7,689,8],[689,12,689,13],[690,2,690,3],[690,7,690,8],[690,12,690,13],[687,2,687,3],[687,7,687,8],[687,12,687,13],[688,2,688,3],[688,7,688,8],[688,12,688,13],[685,2,685,3],[685,7,685,8],[685,12,685,13],[686,2,686,3],[686,7,686,8],[686,12,686,13],[695,2,695,3],[695,7,695,8],[695,12,695,13],[696,2,696,3],[696,7,696,8],[696,12,696,13],[693,2,693,3],[693,7,693,8],[693,12,693,13],[694,2,694,3]],"merged_total":1314,"flags":["merged_cut"]}
[]
[{"$f":"A1026","v":"Republic of Moldova"}]
[{"$f":"A1034","v":"2005"}]
["Use of drinking water sources"]
[" by wealth quintile and sub-national region"]
["Notes:"]
["WHO/UNICEF JMP customised wealth index excludes water,"]
[" sanitation and hygiene assets."]
["Survey used for analysis:",{"$f":"A1025","v":"DHS05"}]
[{"$f":"B1028","v":""}]
[{"$f":"B1027","v":"Time to improved source based on:"},"MICS00"]
[]
[]
["Use of drinking water sources",null,"NATIONAL wealth index quintile",null,null,null,null,"URBAN wealth index quintile",null,null,null,null,"RURAL wealth index quintile",null,null,null,null,"SUB-REGIONS:",null,null,null,null,null,null,null,null,null,null,null,null,null,null,null,null,null,null,null,null,null,null,null,null,null,null,null,null,null,null,null,null,null,null,"Raw numbers of respondents:","Use of drinking water sources","NATIONAL wealth index quintile",null,null,null,null,"URBAN wealth index quintile",null,null,null,null,"RURAL wealth index quintile",null,null,null,null,"SUB-REGIONS:"]
["Weighted percentage (used in graphs)",null,"Poorest","Poor","Middle","Rich","Richest","Poorest","Poor","Middle","Rich","Richest","Poorest","Poor","Middle","Rich","Richest","Center","Chisinau","North","South",null,null,null,null,null,null,null,null,null,null,null,null,null,null,null,null,null,null,null,null,null,null,null,null,null,null,null,null,null,null,null,"Water data, raw numbers (weighted)",null,"Poorest","Poor","Middle","Rich","Richest","Poorest","Poor","Middle","Rich","Richest","Poorest","Poor","Middle","Rich","Richest","Center","Chisinau","North","South"]
["Water","Improved",86.484070962391868,91.240164930830559,93.17046098318967,95.374884155639833,99.266838393503534,95.167006262919372,98.206462506335058,99.706759432408617,99.443611778589514,99.359504103654047,84.124175324099099,90.098592743655956,91.060125415992076,91.593181559788675,92.000836409419492,86.546115198908993,98.85583985843958,95.403127597627943,92.296517390587283,null,null,null,null,null,null,null,null,null,null,null,null,null,null,null,null,null,null,null,null,null,null,null,null,null,null,null,null,null,null,null,"Water","Improved","N/A","N/A","N/A","N/A","N/A","N/A","N/A","N/A","N/A","N/A","N/A","N/A","N/A","N/A","N/A","N/A","N/A","N/A","N/A"]
[null,"Not Improved",13.515929037608126,8.7598350691695774,6.8295390168103225,4.6251158443601943,0.73316160649645401,4.8329937370806393,1.7935374936650026,0.29324056759139838,0.55638822141047795,0.64049589634598414,15.875824675900999,9.9014072563440063,8.9398745840078817,8.4068184402113548,7.9991635905804577,13.453884801091309,1.1441601415603662,4.5968724023719956,7.703482609412708,null,null,null,null,null,null,null,null,null,null,null,null,null,null,null,null,null,null,null,null,null,null,null,null,null,null,null,null,null,null,null,null,"Not Improved","N/A","N/A","N/A","N/A","N/A","N/A","N/A","N/A","N/A","N/A","N/A","N/A","N/A","N/A","N/A","N/A","N/A","N/A","N/A"]
["Water ladder","Basic",{"$f":"C16*MICS00!C23/100","v":84.466395669095689},{"$f":"D16*MICS00!D23/100","v":88.928931708524047},{"$f":"E16*MICS00!E23/100","v":91.618249685315462},{"$f":"F16*MICS00!F23/100","v":93.962078455503502},{"$f":"G16*MICS00!G23/100","v":98.526410934668888},{"$f":"H16*MICS00!H23/100","v":93.404213792883056},{"$f":"I16*MICS00!I23/100","v":96.242160133885861},{"$f":"J16*MICS00!J23/100","v":98.64436318031872},{"$f":"K16*MICS00!K23/100","v":97.974539387372005},{"$f":"L16*MICS00!L23/100","v":99.269374847440901},{"$f":"M16*MICS00!M23/100","v":81.940404516879823},{"$f":"N16*MICS00!N23/100","v":88.059349039714874},{"$f":"O16*MICS00!O23/100","v":88.731376580065856},{"$f":"P16*MICS00!P23/100","v":89.773160200325549},{"$f":"Q16*MICS00!Q23/100","v":91.150744682822776},"N/A","N/A","N/A","N/A",null,null,null,null,null,null,null,null,null,null,null,null,null,null,null,null,null,null,null,null,null,null,null,null,null,null,null,null,null,null,null,"Water ladder","Basic","N/A","N/A","N/A","N/A","N/A","N/A","N/A","N/A","N/A","N/A","N/A","N/A","N/A","N/A","N/A","N/A","N/A","N/A","N/A"]
[null,"Limited",{"$f":"C16*MICS00!C22/100","v":2.0176752932961377},{"$f":"D16*MICS00!D22/100","v":2.3112332223064316},{"$f":"E16*MICS00!E22/100","v":1.5522112978741964},{"$f":"F16*MICS00!F22/100","v":1.4128057001363628},{"$f":"G16*MICS00!G22/100","v":0.74042745883461702},{"$f":"H16*MICS00!H22/100","v":1.7627924700364417},{"$f":"I16*MICS00!I22/100","v":1.9643023724492255},{"$f":"J16*MICS00!J22/100","v":1.0623962520898969},{"$f":"K16*MICS00!K22/100","v":1.4690723912175203},{"$f":"L16*MICS00!L22/100","v":9.0129256213140552E-2},{"$f":"M16*MICS00!M22/100","v":2.1837708072192474},{"$f":"N16*MICS00!N22/100","v":2.0392437039411173},{"$f":"O16*MICS00!O22/100","v":2.3287488359262234},{"$f":"P16*MICS00!P22/100","v":1.8200213594631294},{"$f":"Q16*MICS00!Q22/100","v":0.85009172659667942},"N/A","N/A","N/A","N/A",null,null,null,null,null,null,null,null,null,null,null,null,null,null,null,null,null,null,null,null,null,null,null,null,null,null,null,null,null,null,null,null,"Limited","N/A","N/A","N/A","N/A","N/A","N/A","N/A","N/A","N/A","N/A","N/A","N/A","N/A","N/A","N/A","N/A","N/A","N/A","N/A"]
[null,"Unimproved",{"$f":"100-(C18+C19+C21)","v":13.515929037608174},{"$f":"100-(D18+D19+D21)","v":8.7598350691695259},6.8295390168103438,4.6251158443601383,0.73316160649649476,4.8329937370804998,1.793537493664914,0.29324056759138273,0.55638822141047228,0.6404958963459535,15.87582467590093,9.9014072563440152,8.9398745840079243,8.4068184402113246,7.9991635905805509,"N/A","N/A","N/A","N/A",null,null,null,null,null,null,null,null,null,null,null,null,null,null,null,null,null,null,null,null,null,null,null,null,null,null,null,null,null,null,null,null,"Unimproved","N/A","N/A","N/A","N/A","N/A","N/A","N/A","N/A","N/A","N/A","N/A","N/A","N/A","N/A","N/A","N/A","N/A","N/A","N/A"]
[null,"Surface water",{"$f":"0","v":0},{"$f":"0","v":0},{"$f":"0","v":0},{"$f":"0","v":0},{"$f":"0","v":0},{"$f":"0","v":0},{"$f":"0","v":0},{"$f":"0","v":0},{"$f":"0","v":0},{"$f":"0","v":0},{"$f":"0","v":0},{"$f":"0","v":0},{"$f":"0","v":0},{"$f":"0","v":0},{"$f":"0","v":0},"N/A","N/A","N/A","N/A",null,null,null,null,null,null,null,null,null,null,null,null,null,null,null,null,null,null,null,null,null,null,null,null,null,null,null,null,null,null,null,null,"Surface water","N/A","N/A","N/A","N/A","N/A","N/A","N/A","N/A","N/A","N/A","N/A","N/A","N/A","N/A","N/A","N/A","N/A","N/A","N/A"]
["Improved water point at more than 30 minutes","Yes","N/A","N/A","N/A","N/A","N/A","N/A","N/A","N/A","N/A","N/A","N/A","N/A","N/A","N/A","N/A","N/A","N/A","N/A","N/A",null,null,null,null,null,null,null,null,null,null,null,null,null,null,null,null,null,null,null,null,null,null,null,null,null,null,null,null,null,null,null,"Improved water point at more than 30 minutes","Yes","N/A","N/A","N/A","N/A","N/A","N/A","N/A","N/A","N/A","N/A","N/A","N/A","N/A","N/A","N/A","N/A","N/A","N/A","N/A"]
[null,"No","N/A","N/A","N/A","N/A","N/A","N/A","N/A","N/A","N/A","N/A","N/A","N/A","N/A","N/A","N/A","N/A","N/A","N/A","N/A",null,null,null,null,null,null,null,null,null,null,null,null,null,null,null,null,null,null,null,null,null,null,null,null,null,null,null,null,null,null,null,null,"No","N/A","N/A","N/A","N/A","N/A","N/A","N/A","N/A","N/A","N/A","N/A","N/A","N/A","N/A","N/A","N/A","N/A","N/A","N/A"]
["Manually calculated ratios","Improved wells"]
[null,"Improved springs"]
[null,"Other"]
[null,null,"NATIONAL wealth index quintile",null,null,null,null,"URBAN wealth index quintile",null,null,null,null,"RURAL wealth index quintile",null,null,null,null,"SUB-REGIONS:",null,null,null,null,null,null,null,null,null,null,null,null,null,null,null,null,null,null,null,null,null,null,null,null,null,null,null,null,null,null,null,null,null,null,"Raw numbers of respondents:","Use of drinking water sources","NATIONAL wealth index quintile",null,null,null,null,"URBAN wealth index quintile",null,null,null,null,"RURAL wealth index quintile",null,null,null,null,"SUB-REGIONS:"]
["Percentage based on weighted population",null,"Poorest","Poor","Middle","Rich","Richest","Poorest","Poor","Middle","Rich","Richest","Poorest","Poor","Middle","Rich","Richest","Center","Chisinau","North","South",null,null,null,null,null,null,null,null,null,null,null,null,null,null,null,null,null,null,null,null,null,null,null,null,null,null,null,null,null,null,null,"Water data, raw numbers (weighted)",null,"Poorest","Poor","Middle","Rich","Richest","Poorest","Poor","Middle","Rich","Richest","Poorest","Poor","Middle","Rich","Richest","Center","Chisinau","North","South"]
["Piped water","Yes",7.3365042637860354,13.623339952964914,23.19284115957786,51.10680476494084,84.325069671277845,39.576950568183591,67.539445753568216,85.221913352649324,87.509342520178663,86.472237807358809,5.8326947050475235,8.5507797492695587,12.519175953494052,16.794757659601323,17.848160874457221,19.625624377434853,87.739658317697049,19.952609019149637,26.562659511026936,null,null,null,null,null,null,null,null,null,null,null,null,null,null,null,null,null,null,null,null,null,null,null,null,null,null,null,null,null,null,null,"Piped water","Yes","N/A","N/A","N/A","N/A","N/A","N/A","N/A","N/A","N/A","N/A","N/A","N/A","N/A","N/A","N/A","N/A","N/A","N/A","N/A"]
[null,"No",92.663495736213861,86.376660047035188,76.807158840422076,48.893195235059352,15.674930328721931,60.423049431816409,32.460554246431919,14.778086647350827,12.490657479821333,13.527762192641291,94.167305294952527,91.449220250730406,87.480824046505873,83.205242340398627,82.151839125542637,80.374375622565708,12.260341682302752,80.04739098084967,73.437340488972907,null,null,null,null,null,null,null,null,null,null,null,null,null,null,null,null,null,null,null,null,null,null,null,null,null,null,null,null,null,null,null,null,"No","N/A","N/A","N/A","N/A","N/A","N/A","N/A","N/A","N/A","N/A","N/A","N/A","N/A","N/A","N/A","N/A","N/A","N/A","N/A"]
["Piped water on premises","Yes",6.3635248343643553,12.669924399141768,22.108861329667047,50.280610259783664,84.101116300685064,38.013195768582612,66.082994757719689,84.963646415598674,87.335450626086057,86.182281915742891,4.4422842872199153,8.0603979939126482,11.4798780827205,16.023158752191964,17.276866053953253,18.747389957194848,87.434242887425427,19.610183213884628,24.55044008166989,null,null,null,null,null,null,null,null,null,null,null,null,null,null,null,null,null,null,null,null,null,null,null,null,null,null,null,null,null,null,null,"Piped water on premises","Yes","N/A","N/A","N/A","N/A","N/A","N/A","N/A","N/A","N/A","N/A","N/A","N/A","N/A","N/A","N/A","N/A","N/A","N/A","N/A"]
[null,"No",93.636475165635545,87.330075600858308,77.891138670332893,49.719389740216535,15.8988836993147,61.986804231417366,33.917005242280425,15.036353584401446,12.664549373913939,13.817718084257208,95.557715712780123,91.939602006087341,88.52012191727944,83.976841247807982,82.72313394604663,81.252610042805713,12.565757112574365,80.389816786114679,75.449559918329939,null,null,null,null,null,null,null,null,null,null,null,null,null,null,null,null,null,null,null,null,null,null,null,null,null,null,null,null,null,null,null,null,"No","N/A","N/A","N/A","N/A","N/A","N/A","N/A","N/A","N/A","N/A","N/A","N/A","N/A","N/A","N/A","N/A","N/A","N/A","N/A"]
["Piped water into dwelling","Yes","N/A","N/A","N/A","N/A","N/A","N/A","N/A","N/A","N/A","N/A","N/A","N/A","N/A","N/A","N/A","N/A","N/A","N/A","N/A",null,null,null,null,null,null,null,null,null,null,null,null,null,null,null,null,null,null,null,null,null,null,null,null,null,null,null,null,null,null,null,"Piped water into dwelling","Yes","N/A","N/A","N/A","N/A","N/A","N/A","N/A","N/A","N/A","N/A","N/A","N/A","N/A","N/A","N/A","N/A","N/A","N/A","N/A"]
[null,"No","N/A","N/A","N/A","N/A","N/A","N/A","N/A","N/A","N/A","N/A","N/A","N/A","N/A","N/A","N/A","N/A","N/A","N/A","N/A",null,null,null,null,null,null,null,null,null,null,null,null,null,null,null,null,null,null,null,null,null,null,null,null,null,null,null,null,null,null,null,null,"No","N/A","N/A","N/A","N/A","N/A","N/A","N/A","N/A","N/A","N/A","N/A","N/A","N/A","N/A","N/A","N/A","N/A","N/A","N/A"]
["Water source on premises","Yes","N/A","N/A","N/A","N/A","N/A","N/A","N/A","N/A","N/A","N/A","N/A","N/A","N/A","N/A","N/A","N/A","N/A","N/A","N/A",null,null,null,null,null,null,null,null,null,null,null,null,null,null,null,null,null,null,null,null,null,null,null,null,null,null,null,null,null,null,null,"Water source on premises","Yes","N/A","N/A","N/A","N/A","N/A","N/A","N/A","N/A","N/A","N/A","N/A","N/A","N/A","N/A","N/A","N/A","N/A","N/A","N/A"]
[null,"No","N/A","N/A","N/A","N/A","N/A","N/A","N/A","N/A","N/A","N/A","N/A","N/A","N/A","N/A","N/A","N/A","N/A","N/A","N/A",null,null,null,null,null,null,null,null,null,null,null,null,null,null,null,null,null,null,null,null,null,null,null,null,null,null,null,null,null,null,null,null,"No","N/A","N/A","N/A","N/A","N/A","N/A","N/A","N/A","N/A","N/A","N/A","N/A","N/A","N/A","N/A","N/A","N/A","N/A","N/A"]
["Improved Water source on premises","Yes","N/A","N/A","N/A","N/A","N/A","N/A","N/A","N/A","N/A","N/A","N/A","N/A","N/A","N/A","N/A","N/A","N/A","N/A","N/A",null,null,null,null,null,null,null,null,null,null,null,null,null,null,null,null,null,null,null,null,null,null,null,null,null,null,null,null,null,null,null,"Improved water source on premises","Yes","N/A","N/A","N/A","N/A","N/A","N/A","N/A","N/A","N/A","N/A","N/A","N/A","N/A","N/A","N/A","N/A","N/A","N/A","N/A"]
[null,"No","N/A","N/A","N/A","N/A","N/A","N/A","N/A","N/A","N/A","N/A","N/A","N/A","N/A","N/A","N/A","N/A","N/A","N/A","N/A",null,null,null,null,null,null,null,null,null,null,null,null,null,null,null,null,null,null,null,null,null,null,null,null,null,null,null,null,null,null,null,null,"No","N/A","N/A","N/A","N/A","N/A","N/A","N/A","N/A","N/A","N/A","N/A","N/A","N/A","N/A","N/A","N/A","N/A","N/A","N/A"]
["Piped water on premises available when needed","Yes","N/A","N/A","N/A","N/A","N/A","N/A","N/A","N/A","N/A","N/A","N/A","N/A","N/A","N/A","N/A","N/A","N/A","N/A","N/A",null,null,null,null,null,null,null,null,null,null,null,null,null,null,null,null,null,null,null,null,null,null,null,null,null,null,null,null,null,null,null,"Piped water on premises available when needed","Yes","N/A","N/A","N/A","N/A","N/A","N/A","N/A","N/A","N/A","N/A","N/A","N/A","N/A","N/A","N/A","N/A","N/A","N/A","N/A"]
[null,"No","N/A","N/A","N/A","N/A","N/A","N/A","N/A","N/A","N/A","N/A","N/A","N/A","N/A","N/A","N/A","N/A","N/A","N/A","N/A",null,null,null,null,null,null,null,null,null,null,null,null,null,null,null,null,null,null,null,null,null,null,null,null,null,null,null,null,null,null,null,null,"No","N/A","N/A","N/A","N/A","N/A","N/A","N/A","N/A","N/A","N/A","N/A","N/A","N/A","N/A","N/A","N/A","N/A","N/A","N/A"]
["Water point at more than 30 minutes","Yes","N/A","N/A","N/A","N/A","N/A","N/A","N/A","N/A","N/A","N/A","N/A","N/A","N/A","N/A","N/A","N/A","N/A","N/A","N/A",null,null,null,null,null,null,null,null,null,null,null,null,null,null,null,null,null,null,null,null,null,null,null,null,null,null,null,null,null,null,null,"Water point at more than 30 minutes","Yes","N/A","N/A","N/A","N/A","N/A","N/A","N/A","N/A","N/A","N/A","N/A","N/A","N/A","N/A","N/A","N/A","N/A","N/A","N/A"]
[null,"No","N/A","N/A","N/A","N/A","N/A","N/A","N/A","N/A","N/A","N/A","N/A","N/A","N/A","N/A","N/A","N/A","N/A","N/A","N/A",null,null,null,null,null,null,null,null,null,null,null,null,null,null,null,null,null,null,null,null,null,null,null,null,null,null,null,null,null,null,null,null,"No","N/A","N/A","N/A","N/A","N/A","N/A","N/A","N/A","N/A","N/A","N/A","N/A","N/A","N/A","N/A","N/A","N/A","N/A","N/A"]
["Water source available when needed","Yes","N/A","N/A","N/A","N/A","N/A","N/A","N/A","N/A","N/A","N/A","N/A","N/A","N/A","N/A","N/A","N/A","N/A","N/A","N/A",null,null,null,null,null,null,null,null,null,null,null,null,null,null,null,null,null,null,null,null,null,null,null,null,null,null,null,null,null,null,null,"Water source available when needed","Yes","N/A","N/A","N/A","N/A","N/A","N/A","N/A","N/A","N/A","N/A","N/A","N/A","N/A","N/A","N/A","N/A","N/A","N/A","N/A"]
[null,"No","N/A","N/A","N/A","N/A","N/A","N/A","N/A","N/A","N/A","N/A","N/A","N/A","N/A","N/A","N/A","N/A","N/A","N/A","N/A",null,null,null,null,null,null,null,null,null,null,null,null,null,null,null,null,null,null,null,null,null,null,null,null,null,null,null,null,null,null,null,null,"No","N/A","N/A","N/A","N/A","N/A","N/A","N/A","N/A","N/A","N/A","N/A","N/A","N/A","N/A","N/A","N/A","N/A","N/A","N/A"]
["Improved water source available when needed","Yes","N/A","N/A","N/A","N/A","N/A","N/A","N/A","N/A","N/A","N/A","N/A","N/A","N/A","N/A","N/A","N/A","N/A","N/A","N/A",null,null,null,null,null,null,null,null,null,null,null,null,null,null,null,null,null,null,null,null,null,null,null,null,null,null,null,null,null,null,null,"Improved water source available when needed","Yes","N/A","N/A","N/A","N/A","N/A","N/A","N/A","N/A","N/A","N/A","N/A","N/A","N/A","N/A","N/A","N/A","N/A","N/A","N/A"]
[null,"No","N/A","N/A","N/A","N/A","N/A","N/A","N/A","N/A","N/A","N/A","N/A","N/A","N/A","N/A","N/A","N/A","N/A","N/A","N/A",null,null,null,null,null,null,null,null,null,null,null,null,null,null,null,null,null,null,null,null,null,null,null,null,null,null,null,null,null,null,null,null,"No","N/A","N/A","N/A","N/A","N/A","N/A","N/A","N/A","N/A","N/A","N/A","N/A","N/A","N/A","N/A","N/A","N/A","N/A","N/A"]
["Microbiological quality at point of collection","Not contaminated (No E. coli in 100 mL)","N/A","N/A","N/A","N/A","N/A","N/A","N/A","N/A","N/A","N/A","N/A","N/A","N/A","N/A","N/A","N/A","N/A","N/A","N/A",null,null,null,null,null,null,null,null,null,null,null,null,null,null,null,null,null,null,null,null,null,null,null,null,null,null,null,null,null,null,null,"Microbiological quality at point of collection","Not contaminated (No E. coli in 100 mL)","N/A","N/A","N/A","N/A","N/A","N/A","N/A","N/A","N/A","N/A","N/A","N/A","N/A","N/A","N/A","N/A","N/A","N/A","N/A"]
[null,"Contaminated (E. coli detected in 100 mL)","N/A","N/A","N/A","N/A","N/A","N/A","N/A","N/A","N/A","N/A","N/A","N/A","N/A","N/A","N/A","N/A","N/A","N/A","N/A",null,null,null,null,null,null,null,null,null,null,null,null,null,null,null,null,null,null,null,null,null,null,null,null,null,null,null,null,null,null,null,null,"Contaminated (E. coli detected in 100 mL)","N/A","N/A","N/A","N/A","N/A","N/A","N/A","N/A","N/A","N/A","N/A","N/A","N/A","N/A","N/A","N/A","N/A","N/A","N/A"]
[null,"Highly contaminated (>100 CFU/100 mL)","N/A","N/A","N/A","N/A","N/A","N/A","N/A","N/A","N/A","N/A","N/A","N/A","N/A","N/A","N/A","N/A","N/A","N/A","N/A",null,null,null,null,null,null,null,null,null,null,null,null,null,null,null,null,null,null,null,null,null,null,null,null,null,null,null,null,null,null,null,null,"Highly contaminated (>100 CFU/100 mL)","N/A","N/A","N/A","N/A","N/A","N/A","N/A","N/A","N/A","N/A","N/A","N/A","N/A","N/A","N/A","N/A","N/A","N/A","N/A"]
["Microbiological quality of improved water sources at point of collection","Not contaminated (No E. coli in 100 mL)","N/A","N/A","N/A","N/A","N/A","N/A","N/A","N/A","N/A","N/A","N/A","N/A","N/A","N/A","N/A","N/A","N/A","N/A","N/A",null,null,null,null,null,null,null,null,null,null,null,null,null,null,null,null,null,null,null,null,null,null,null,null,null,null,null,null,null,null,null,"Microbiological quality of improved water sources at point of collection","Not contaminated (No E. coli in 100 mL)","N/A","N/A","N/A","N/A","N/A","N/A","N/A","N/A","N/A","N/A","N/A","N/A","N/A","N/A","N/A","N/A","N/A","N/A","N/A"]
[null,"Contaminated (E. coli detected in 100 mL)","N/A","N/A","N/A","N/A","N/A","N/A","N/A","N/A","N/A","N/A","N/A","N/A","N/A","N/A","N/A","N/A","N/A","N/A","N/A",null,null,null,null,null,null,null,null,null,null,null,null,null,null,null,null,null,null,null,null,null,null,null,null,null,null,null,null,null,null,null,null,"Contaminated (E. coli detected in 100 mL)","N/A","N/A","N/A","N/A","N/A","N/A","N/A","N/A","N/A","N/A","N/A","N/A","N/A","N/A","N/A","N/A","N/A","N/A","N/A"]
[null,"Highly contaminated (>100 CFU/100 mL)","N/A","N/A","N/A","N/A","N/A","N/A","N/A","N/A","N/A","N/A","N/A","N/A","N/A","N/A","N/A","N/A","N/A","N/A","N/A",null,null,null,null,null,null,null,null,null,null,null,null,null,null,null,null,null,null,null,null,null,null,null,null,null,null,null,null,null,null,null,null,"Highly contaminated (>100 CFU/100 mL)","N/A","N/A","N/A","N/A","N/A","N/A","N/A","N/A","N/A","N/A","N/A","N/A","N/A","N/A","N/A","N/A","N/A","N/A","N/A"]
["Microbiological quality of piped on premises at point of collection","Not contaminated (No E. coli in 100 mL)","N/A","N/A","N/A","N/A","N/A","N/A","N/A","N/A","N/A","N/A","N/A","N/A","N/A","N/A","N/A","N/A","N/A","N/A","N/A",null,null,null,null,null,null,null,null,null,null,null,null,null,null,null,null,null,null,null,null,null,null,null,null,null,null,null,null,null,null,null,"Microbiological quality of piped on premises at point of collection","Not contaminated (No E. coli in 100 mL)","N/A","N/A","N/A","N/A","N/A","N/A","N/A","N/A","N/A","N/A","N/A","N/A","N/A","N/A","N/A","N/A","N/A","N/A","N/A"]
[null,"Contaminated (E. coli detected in 100 mL)","N/A","N/A","N/A","N/A","N/A","N/A","N/A","N/A","N/A","N/A","N/A","N/A","N/A","N/A","N/A","N/A","N/A","N/A","N/A",null,null,null,null,null,null,null,null,null,null,null,null,null,null,null,null,null,null,null,null,null,null,null,null,null,null,null,null,null,null,null,null,"Contaminated (E. coli detected in 100 mL)","N/A","N/A","N/A","N/A","N/A","N/A","N/A","N/A","N/A","N/A","N/A","N/A","N/A","N/A","N/A","N/A","N/A","N/A","N/A"]
[null,"Highly contaminated (>100 CFU/100 mL)","N/A","N/A","N/A","N/A","N/A","N/A","N/A","N/A","N/A","N/A","N/A","N/A","N/A","N/A","N/A","N/A","N/A","N/A","N/A",null,null,null,null,null,null,null,null,null,null,null,null,null,null,null,null,null,null,null,null,null,null,null,null,null,null,null,null,null,null,null,null,"Highly contaminated (>100 CFU/100 mL)","N/A","N/A","N/A","N/A","N/A","N/A","N/A","N/A","N/A","N/A","N/A","N/A","N/A","N/A","N/A","N/A","N/A","N/A","N/A"]
[null,null,"NATIONAL wealth index quintile",null,null,null,null,"URBAN wealth index quintile",null,null,null,null,"RURAL wealth index quintile",null,null,null,null,"SUB-REGIONS:",null,null,null,null,null,null,null,null,null,null,null,null,null,null,null,null,null,null,null,null,null,null,null,null,null,null,null,null,null,null,null,null,null,null,"Raw numbers of respondents:","Use of drinking water sources","NATIONAL wealth index quintile",null,null,null,null,"URBAN wealth index quintile",null,null,null,null,"RURAL wealth index quintile",null,null,null,null,"SUB-REGIONS:"]
["Percentage based on weighted population",null,"Poorest","Poor","Middle","Rich","Richest","Poorest","Poor","Middle","Rich","Richest","Poorest","Poor","Middle","Rich","Richest","Center","Chisinau","North","South",null,null,null,null,null,null,null,null,null,null,null,null,null,null,null,null,null,null,null,null,null,null,null,null,null,null,null,null,null,null,null,"Water data, raw numbers (weighted)",null,"Poorest","Poor","Middle","Rich","Richest","Poorest","Poor","Middle","Rich","Richest","Poorest","Poor","Middle","Rich","Richest","Center","Chisinau","North","South"]
["Source of drinking water","Piped into dwelling",1.1785377765617115,4.143505358545001,11.442916694797784,42.996131343221165,83.694478438642818,18.863152941821792,55.690905087212592,83.39082449669381,87.23702201851988,86.404457252094588,0.25280542816447715,1.7625355047227114,4.4422217812181524,7.7000727416525558,10.387043192608557,12.239544548266752,84.20343942617852,14.262860113804681,13.12396779325214]
[null,"Piped to yard/plot",5.195523272456418,8.5264190405967586,10.67437459983679,7.2844789165625281,0.54901113588275752,19.187485253508115,10.392089670507044,1.5728219189047992,0.22201713944217813,3.2930948253405166E-2,4.2015079112475844,6.2978624891899369,7.0376563015023512,8.3230860105394218,6.8898228613446886,6.5078454089280449,3.366881088536982,5.3580471908528544,11.455962464572046]
[null,"Public tap/standpipe",0.97459041081782893,0.95341555382314847,1.0843931443667332,0.82619450515716908,0.22433249724365506,1.5652950745857783,1.4564509958485106,0.25826693705061876,0.17413796878211507,0.29081418369829315,1.3941754446478589,0.49038175535691242,1.0392978707735507,0.77159890740935855,0.57129482050397284,0.87823442024000353,0.30589076128285903,0.34261306539300435,2.01463652270589]
[null,"Artesian/tube well or borehole",1.5041037083574671,1.854267043375039,1.7822334619905944,1.9374811033761798,0.26904009395751188,1.2284701168415366,0.72904873475223042,0.1879815993243675,0.30817219946864283,5.10997096785814E-2,0.999726998953409,1.6910408275934294,2.5302407495884167,2.069469997078107,3.1150049372620723,2.4572248107459442,0.52679820636584018,0.66016112526848725,2.4023120165471004]
[null,"Protected well",71.575053864968368,69.707410025803796,59.421864052010555,36.513468106786625,5.4111578843354016,47.497758706862975,23.612173517590026,7.41141889139762,2.8664827479722481,2.0984625556456091,70.910214262264347,73.867277395781969,70.58152725790525,63.646264362036305,64.1960166763063,58.873827927732862,4.1472449653518906,70.760925312847874,48.10112214265493]
[null,"Ubprotected well",10.606000504905973,6.6180539043241478,4.7221011897260317,2.2559385193115933,0.18189486372764768,3.2531731761095957,0.99514908379118672,0.10525896826703084,0.10749321240622425,0,13.080537463113426,7.6407163247739343,6.0300511503831995,6.0061617463383961,4.2298679298172468,10.314599235300694,0.33382683364713317,3.6649476807761463,4.2131269380285881]
[null,"Rainwater",4.579288362554864E-2,6.7977063737760801E-2,0,4.8104229203377855E-2,0,0,0.12429709519485961,0,0,0,7.4892130764343007E-2,0.1107599741742195,0,0,0,0,0,0,0.16360458330679187]
[null,"Tanker truck",0.16298537681446942,0.47948069125611015,1.1821529231303141,0.15741948435324518,0,0.54457841500890725,0.10046797641862883,0.1737618590512951,0,0,9.4581564605392701E-2,0.24820315504598525,0.65454834378376636,1.2958013315922183,0.42398059119390141,0.24975877102172508,3.8800371765013032E-2,0,1.6145324666652288]
[null,"Cistern",2.2679486354300495,3.3432588961983511,4.339752860627744,2.3172098984576492,0.23046330984674046,3.8020374658536062,1.7521515635709539,0.44524830913935692,0.14925813271182006,0,2.3177306906599453,2.8478760759065351,2.8641944948672022,4.9327674501203758,3.5492290178434396,1.4106935080267571,6.2172618667960027E-2,3.9483156174089276E-2,10.545567831263705]
[null,"Cart with small tank",0.12348232361103954,2.2006016846755343E-2,0.2123103670799128,0.16983597773057965,0,0,0,0,0,0,0.11177125714938964,8.9758067072150921E-2,3.5912320795788419E-2,0.29895924316851807,0.32473198159322259,0,0,0.15623586882665222,0.28869091514424572]
[null,"Bottled water",6.6080555170073108E-2,0.37428560603715627,0.66561982385184049,2.38311821236679,8.3866616434515766,1.1015788975200884,2.7758341377698432,4.8726641962918285,8.2066985511597537,10.310406170760702,0.10807167373963786,0,0.35108691504481421,0.19481435934967942,1.4970377455654402,1.605123587318219,6.2107355983968109,1.2679626792314238,0.96011153142675443]
[null,"Protected spring",5.0372692596007802,3.6224066779855928,4.1826018080213796,2.6789234818008696,0.93878053730892064,2.6988575792018095,2.3020924622226189,1.5817528238793308,0.72871802953714093,0.51654488451659264,4.8862208492251487,4.3839383264055298,4.0536801301011804,4.4298171539201849,4.1616795224599041,4.7810870273750421,0.67452857221956564,3.2671726858489452,4.1391884212909051]
[null,"Unprotected spring",1.253586544600835,0.28751412147038768,0.28967907456032688,0.43169622167242061,0.11417959560273024,0.23427798227603169,6.9339675121585162E-2,0,0,0.29528429535233758,1.567764325465149,0.56965010397664384,0.37958268403626627,0.33118669679485069,0.65429072350114015,0.68206075504467911,0.12968155758706881,0.21375883795454281,0.97717637314180905]
[null,"Other",9.0448830793081799E-3,0,0,0,0,2.3334390409685282E-2,0,0,0,0,0,0,0,0,0,0,0,5.8322830205738184E-3,0]
[]
[]
[]
[]
[]
[]
[]
[]
[]
[]
[]
[]
[]
[]
[]
[]
[]
[]
[]
[]
[]
[]
[]
[]
[]
[]
[]
[]
[]
[]
[]
[]
[]
[]
[]
[]
[{"$f":"A1026","v":"Republic of Moldova"}]
[{"$f":"A1034","v":"2005"}]
["Use of sanitation facilities"]
[" by wealth quintile and sub-national region"]
["Notes:"]
["WHO/UNICEF JMP customised wealth index excludes water,"]
[" sanitation and hygiene assets."]
["Survey used for analysis:",{"$f":"A1025","v":"DHS05"}]
[{"$f":"B1030","v":""}]
[{"$f":"B1029","v":""}]
[]
[]
["Use of sanitation facilities",null,"NATIONAL wealth index quintile",null,null,null,null,"URBAN wealth index quintile",null,null,null,null,"RURAL wealth index quintile",null,null,null,null,"SUB-REGIONS:",null,null,null,null,null,null,null,null,null,null,null,null,null,null,null,null,null,null,null,null,null,null,null,null,null,null,null,null,null,null,null,null,null,null,"Raw numbers of respondents:","Use of sanitation facilities","NATIONAL wealth index quintile",null,null,null,null,"URBAN wealth index quintile",null,null,null,null,"RURAL wealth index quintile",null,null,null,null,"SUB-REGIONS:"]
["Weighted percentage (used in graphs)",null,"Poorest","Poor","Middle","Rich","Richest","Poorest","Poor","Middle","Rich","Richest","Poorest","Poor","Middle","Rich","Richest","Center","Chisinau","North","South",null,null,null,null,null,null,null,null,null,null,null,null,null,null,null,null,null,null,null,null,null,null,null,null,null,null,null,null,null,null,null,"Sanitation data, raw numbers (weighted)",null,"Poorest","Poor","Middle","Rich","Richest","Poorest","Poor","Middle","Rich","Richest","Poorest","Poor","Middle","Rich","Richest","Center","Chisinau","North","South"]
["Sanitation","Improved",72.820562518090057,76.683576706343885,80.696007804003671,88.221210303604494,99.009302671321393,72.242494687771838,87.9553401796028,98.264391722179909,99.388070242495246,99.939840658389272,72.29280612988137,77.063289117772143,77.455450137744819,81.432271367096646,83.672156677444391,78.204151021270945,97.295639404051414,81.186052512654911,79.239241340474308,null,null,null,null,null,null,null,null,null,null,null,null,null,null,null,null,null,null,null,null,null,null,null,null,null,null,null,null,null,null,null,"Sanitation","Improved",4671.1879579999841,4915.5054989999971,5176.6542539999909,5656.9674239999958,6349.0856440000216,1795.0710090000034,2182.7055849999983,2442.1013170000006,2468.7124180000019,2481.2529819999963,2838.4819849999963,3031.7467569999967,3042.3962459999984,3199.0098880000023,3287.9225920000013,6885.4835389999926,6785.6412440000313,8067.4831060000079,5030.7928899999797]
[null,"Not Improved",27.179437481909734,23.316423293656165,19.303992195996226,11.778789696395553,0.99069732867858895,27.757505312228233,12.04465982039719,1.735608277820085,0.61192975750476319,6.015934161071089E-2,27.707193870118825,22.936710882227825,22.54454986225516,18.567728632903361,16.327843322555495,21.795848978729477,2.7043605959485371,18.813947487344468,20.760758659525454,null,null,null,null,null,null,null,null,null,null,null,null,null,null,null,null,null,null,null,null,null,null,null,null,null,null,null,null,null,null,null,null,"Not Improved",1743.4671839999965,1494.6095610000004,1238.3523799999996,755.28582500000027,63.529607999999996,689.71445800000072,298.90108100000015,43.133949000000015,15.199797999999999,1.4936039999999999,1087.8865389999996,902.35311300000023,885.53424900000084,729.42024699999945,641.60752000000036,1919.0152619999974,188.60887200000008,1869.5477709999984,1318.0726529999988]
["Sanitation ladder","Basic",67.392172256678307,72.755886309078434,76.302541393228239,79.10340704868392,95.445057822450281,65.223906209098942,74.780366425401425,91.401073309188703,95.582356951400271,97.140508503381923,67.142628581831872,71.655728044664556,73.706812360699729,78.696669378429021,78.86588845663988,73.386870586175576,89.083628889682828,76.93724202383774,74.892072088027589,null,null,null,null,null,null,null,null,null,null,null,null,null,null,null,null,null,null,null,null,null,null,null,null,null,null,null,null,null,null,null,"Sanitation ladder","Basic",4314.335225999981,4658.1007719999989,4887.8849809999911,5071.852869999997,6110.4444800000174,1619.7825330000021,1855.3216650000011,2269.9325670000044,2371.7164400000029,2405.6988959999981,2633.3194599999983,2813.9462979999976,2889.4434529999971,3084.3981820000017,3099.0588350000007,6455.6801600000008,6206.9062650000187,7632.8257909999975,4747.2061129999829]
[null,"Limited",5.3739586457340316,3.8994827739119566,4.3661048409509604,9.1167397922326447,3.56261058385883,7.003309356478808,13.172163433010823,6.8620956976888969,3.8050771897464433,2.7991807684950505,5.1191638300728606,5.366303501800826,3.704094690535642,2.6925869273604275,4.8062682208045047,4.7981507911402481,8.2093924576355199,4.2181186157093506,4.313972520944942,null,null,null,null,null,null,null,null,null,null,null,null,null,null,null,null,null,null,null,null,null,null,null,null,null,null,null,null,null,null,null,null,"Limited",344.03192999999987,249.65930099999986,279.68948199999988,584.53566799999942,228.08026599999988,173.92147799999992,326.80503399999998,170.41916399999991,94.416631000000052,69.322120999999996,200.77250500000008,210.73667499999996,145.20736699999998,105.531915,188.86375699999994,422.08267799999987,571.9898269999992,418.47307899999959,273.45106300000003]
[null,"Unimproved",27.233869097587398,23.344630917009642,19.331353765820712,11.779853159083478,0.99233159369080493,27.772784434422281,12.047470141587867,1.7368309931225376,0.6125658588533367,6.0310728123094813E-2,27.738207588095516,22.977968453534622,22.589092948764581,18.610743694210541,16.327843322555495,21.814978622684677,2.7069786526814332,18.844639360452202,20.793955391027286,null,null,null,null,null,null,null,null,null,null,null,null,null,null,null,null,null,null,null,null,null,null,null,null,null,null,null,null,null,null,null,null,"Unimproved",1743.4671839999965,1494.6095610000004,1238.3523799999996,755.28582500000027,63.529607999999996,689.71445800000072,298.90108100000015,43.133949000000015,15.199797999999999,1.4936039999999999,1087.8865389999996,902.35311300000023,885.53424900000084,729.42024699999945,641.60752000000036,1919.0152619999974,188.60887200000008,1869.5477709999984,1318.0726529999988]
[null,"Open defecation",0,0,0,0,0,0,0,0,0,0,0,0,0,0,0,0,0,0,0,null,null,null,null,null,null,null,null,null,null,null,null,null,null,null,null,null,null,null,null,null,null,null,null,null,null,null,null,null,null,null,null,"Open defecation",28.052937,144.02071599999999,390.59492099999989,2358.4707820000049,6031.5904630000214,183.78336200000001,1111.9025440000012,2146.0332730000055,2419.2096750000019,2467.9995529999969,11.220483999999999,20.403690999999998,115.50829299999999,210.02004699999998,266.64889700000003,950.45632900000066,5966.1591860000271,1403.4896109999986,632.62469299999975]
["Shared among Improved Sanitation","Yes",7.3852472009829944,5.0870315028947424,5.412393841686967,10.334079140303919,3.5983178285125703,9.6962194951572531,14.976446333284157,6.9833852979121991,3.8285294540782702,2.8008699935819612,7.084191602794383,6.9672318349113871,4.7849777655802939,3.3082829965223506,5.7441667714298754,6.1369181802543613,8.4378019553216159,5.1975847097078285,5.4465193183706262,null,null,null,null,null,null,null,null,null,null,null,null,null,null,null,null,null,null,null,null,null,null,null,null,null,null,null,null,null,null,null,"Shared among improved sanitation facilities","Yes","N/A","N/A","N/A","N/A","N/A","N/A","N/A","N/A","N/A","N/A","N/A","N/A","N/A","N/A","N/A","N/A","N/A","N/A","N/A"]
[null,"No",92.614752799016969,94.912968497105282,94.587606158313037,89.665920859696087,96.401682171487366,90.303780504842678,85.023553666715941,93.016614702087949,96.171470545921764,97.199130006418116,92.915808397205694,93.032768165088655,95.215022234419664,96.691717003477635,94.255833228570111,93.863081819745759,91.562198044678183,94.802415290292046,94.553480681629438,null,null,null,null,null,null,null,null,null,null,null,null,null,null,null,null,null,null,null,null,null,null,null,null,null,null,null,null,null,null,null,null,"No","N/A","N/A","N/A","N/A","N/A","N/A","N/A","N/A","N/A","N/A","N/A","N/A","N/A","N/A","N/A","N/A","N/A","N/A","N/A"]
["Manually calculated ratios","Improved latrines",{"$f":"C159/(C159+C160)*100","v":54.335331234888585},{"$f":"D159/(D159+D160)*100","v":60.484726247771789},63.575358347565228,62.857076241732791,62.388655552841534,52.860888791065577,56.327297559258326,74.334335103952625,62.459745811272313,100,53.748421359605537,60.466712801847564,61.00670270103398,64.844617426569428,65.614376707035532,56.697729152607657,59.181945615197442,64.274971827385968,57.734942250802114]
[null,"Sewer among flush",{"$f":"C135/(C135+C136)*100","v":100},{"$f":"D135/(D135+D136)*100","v":92.765195774297752},95.384316589518079,95.016196538233501,99.475946604934279,89.799761433497338,93.753993952952897,98.93902929273591,99.499194940723072,99.67363437582145,100,100,95.200621853618699,97.590417755061893,87.993338640763241,97.454047321098116,99.199574222977546,96.345842920522145,91.414612572762607]
[null,"Other"]
[null,null,"NATIONAL wealth index quintile",null,null,null,null,"URBAN wealth index quintile",null,null,null,null,"RURAL wealth index quintile",null,null,null,null,"SUB-REGIONS:",null,null,null,null,null,null,null,null,null,null,null,null,null,null,null,null,null,null,null,null,null,null,null,null,null,null,null,null,null,null,null,null,null,null,"Raw numbers of respondents:","Use of sanitation facilities","NATIONAL wealth index quintile",null,null,null,null,"URBAN wealth index quintile",null,null,null,null,"RURAL wealth index quintile",null,null,null,null,"SUB-REGIONS:"]
["Percentage based on weighted population",null,"Poorest","Poor","Middle","Rich","Richest","Poorest","Poor","Middle","Rich","Richest","Poorest","Poor","Middle","Rich","Richest","Center","Chisinau","North","South",null,null,null,null,null,null,null,null,null,null,null,null,null,null,null,null,null,null,null,null,null,null,null,null,null,null,null,null,null,null,null,"Sanitation data, raw numbers (weighted)",null,"Poorest","Poor","Middle","Rich","Richest","Poorest","Poor","Middle","Rich","Richest","Poorest","Poor","Middle","Rich","Richest","Center","Chisinau","North","South"]
["Sanitation type","Sewer connection",0.43732572334751446,2.2467727123762442,6.0887687774135522,36.78068676354625,94.058199751167606,7.3963472678343631,44.805752629292854,86.351312584343674,97.395135762720543,99.406019402739005,0.28577256392044242,0.51863683369075242,2.9406908586349614,5.3461571106698544,6.785770547621131,10.795121340604357,85.545529437103397,14.123832645508532,9.9643737722167796,null,null,null,null,null,null,null,null,null,null,null,null,null,null,null,null,null,null,null,null,null,null,null,null,null,null,null,null,null,null,null,"Sanitation type","Sewer connection","N/A","N/A","N/A","N/A","N/A","N/A","N/A","N/A","N/A","N/A","N/A","N/A","N/A","N/A","N/A","N/A","N/A","N/A","N/A"]
[null,"Septic tank connection",0,0.17522693266601069,0.29463784027631623,1.9292259709064425,0.4955119362586059,0.84014150425647094,2.9850141851609635,0.92598657820591201,0.49021478784820277,0.32548936107972204,0,0,0.14824995013054579,0.13200071839892852,0.92591610098342325,0.28201874474876348,0.69025343512644044,0.53568168056321963,0.93582422871606952,null,null,null,null,null,null,null,null,null,null,null,null,null,null,null,null,null,null,null,null,null,null,null,null,null,null,null,null,null,null,null,null,"Septic tank connection","N/A","N/A","N/A","N/A","N/A","N/A","N/A","N/A","N/A","N/A","N/A","N/A","N/A","N/A","N/A","N/A","N/A","N/A","N/A"]
[null,"Improved latrines",72.383236794742501,74.26157706130158,74.312601186313799,49.511297569151999,4.4555909838951768,64.006005915680959,40.164573365149067,10.987092559630526,1.5027196919265029,0.2083318945705725,72.007033565960938,76.544652284081394,74.366509328979276,75.954113538027812,75.960470028839822,67.127010935917994,11.059856531821515,66.526538186582982,68.339043339541675,null,null,null,null,null,null,null,null,null,null,null,null,null,null,null,null,null,null,null,null,null,null,null,null,null,null,null,null,null,null,null,null,"Improved latrines","N/A","N/A","N/A","N/A","N/A","N/A","N/A","N/A","N/A","N/A","N/A","N/A","N/A","N/A","N/A","N/A","N/A","N/A","N/A"]
[null,"Unimproved facilities",27.179437481909734,23.316423293656165,19.303992195996226,11.778789696395553,0.99069732867858895,27.757505312228233,12.04465982039719,1.735608277820085,0.61192975750476319,6.015934161071089E-2,27.707193870118825,22.936710882227825,22.54454986225516,18.567728632903361,16.327843322555495,21.795848978729477,2.7043605959485371,18.813947487344468,20.760758659525454,null,null,null,null,null,null,null,null,null,null,null,null,null,null,null,null,null,null,null,null,null,null,null,null,null,null,null,null,null,null,null,null,"Unimproved facilities","N/A","N/A","N/A","N/A","N/A","N/A","N/A","N/A","N/A","N/A","N/A","N/A","N/A","N/A","N/A","N/A","N/A","N/A","N/A"]
[null,"Open defecation",0,0,0,0,0,0,0,0,0,0,0,0,0,0,0,0,0,0,0,null,null,null,null,null,null,null,null,null,null,null,null,null,null,null,null,null,null,null,null,null,null,null,null,null,null,null,null,null,null,null,null,"Open defecation","N/A","N/A","N/A","N/A","N/A","N/A","N/A","N/A","N/A","N/A","N/A","N/A","N/A","N/A","N/A","N/A","N/A","N/A","N/A"]
["Septic tank emptying practices","Not emptied/treated and disposed in situ","N/A","N/A","N/A","N/A","N/A","N/A","N/A","N/A","N/A","N/A","N/A","N/A","N/A","N/A","N/A","N/A","N/A","N/A","N/A",null,null,null,null,null,null,null,null,null,null,null,null,null,null,null,null,null,null,null,null,null,null,null,null,null,null,null,null,null,null,null,"Septic tank emptying practices","Not emptied/treated and disposed in situ","N/A","N/A","N/A","N/A","N/A","N/A","N/A","N/A","N/A","N/A","N/A","N/A","N/A","N/A","N/A","N/A","N/A","N/A","N/A"]
[null,"Emptied and buried on site","N/A","N/A","N/A","N/A","N/A","N/A","N/A","N/A","N/A","N/A","N/A","N/A","N/A","N/A","N/A","N/A","N/A","N/A","N/A",null,null,null,null,null,null,null,null,null,null,null,null,null,null,null,null,null,null,null,null,null,null,null,null,null,null,null,null,null,null,null,null,"Emptied and buried on site","N/A","N/A","N/A","N/A","N/A","N/A","N/A","N/A","N/A","N/A","N/A","N/A","N/A","N/A","N/A","N/A","N/A","N/A","N/A"]
[null,"Emptied and discharged locally","N/A","N/A","N/A","N/A","N/A","N/A","N/A","N/A","N/A","N/A","N/A","N/A","N/A","N/A","N/A","N/A","N/A","N/A","N/A",null,null,null,null,null,null,null,null,null,null,null,null,null,null,null,null,null,null,null,null,null,null,null,null,null,null,null,null,null,null,null,null,"Emptied and discharged locally","N/A","N/A","N/A","N/A","N/A","N/A","N/A","N/A","N/A","N/A","N/A","N/A","N/A","N/A","N/A","N/A","N/A","N/A","N/A"]
[null,"Emptied and removed offsite","N/A","N/A","N/A","N/A","N/A","N/A","N/A","N/A","N/A","N/A","N/A","N/A","N/A","N/A","N/A","N/A","N/A","N/A","N/A",null,null,null,null,null,null,null,null,null,null,null,null,null,null,null,null,null,null,null,null,null,null,null,null,null,null,null,null,null,null,null,null,"Emptied and removed offsite","N/A","N/A","N/A","N/A","N/A","N/A","N/A","N/A","N/A","N/A","N/A","N/A","N/A","N/A","N/A","N/A","N/A","N/A","N/A"]
["Latrine emptying practices","Not emptied/treated and disposed in situ","N/A","N/A","N/A","N/A","N/A","N/A","N/A","N/A","N/A","N/A","N/A","N/A","N/A","N/A","N/A","N/A","N/A","N/A","N/A",null,null,null,null,null,null,null,null,null,null,null,null,null,null,null,null,null,null,null,null,null,null,null,null,null,null,null,null,null,null,null,"Latrine emptying practices","Not emptied/treated and disposed in situ","N/A","N/A","N/A","N/A","N/A","N/A","N/A","N/A","N/A","N/A","N/A","N/A","N/A","N/A","N/A","N/A","N/A","N/A","N/A"]
[null,"Emptied and buried on site","N/A","N/A","N/A","N/A","N/A","N/A","N/A","N/A","N/A","N/A","N/A","N/A","N/A","N/A","N/A","N/A","N/A","N/A","N/A",null,null,null,null,null,null,null,null,null,null,null,null,null,null,null,null,null,null,null,null,null,null,null,null,null,null,null,null,null,null,null,null,"Emptied and buried on site","N/A","N/A","N/A","N/A","N/A","N/A","N/A","N/A","N/A","N/A","N/A","N/A","N/A","N/A","N/A","N/A","N/A","N/A","N/A"]
[null,"Emptied and discharged locally","N/A","N/A","N/A","N/A","N/A","N/A","N/A","N/A","N/A","N/A","N/A","N/A","N/A","N/A","N/A","N/A","N/A","N/A","N/A",null,null,null,null,null,null,null,null,null,null,null,null,null,null,null,null,null,null,null,null,null,null,null,null,null,null,null,null,null,null,null,null,"Emptied and discharged locally","N/A","N/A","N/A","N/A","N/A","N/A","N/A","N/A","N/A","N/A","N/A","N/A","N/A","N/A","N/A","N/A","N/A","N/A","N/A"]
[null,"Emptied and removed offsite","N/A","N/A","N/A","N/A","N/A","N/A","N/A","N/A","N/A","N/A","N/A","N/A","N/A","N/A","N/A","N/A","N/A","N/A","N/A",null,null,null,null,null,null,null,null,null,null,null,null,null,null,null,null,null,null,null,null,null,null,null,null,null,null,null,null,null,null,null,null,"Emptied and removed offsite","N/A","N/A","N/A","N/A","N/A","N/A","N/A","N/A","N/A","N/A","N/A","N/A","N/A","N/A","N/A","N/A","N/A","N/A","N/A"]
["Shared among improved sanitation facilities","Yes",5.3632178563653206,3.8947709777927151,4.3599250625498263,9.1159167503429348,3.556743341632171,6.9994565047896655,13.169090753885012,6.8572648365114519,3.8011259170843417,2.7921545191483386,5.1134401616347285,5.3566681569779284,3.6967906429311701,2.6863635440470919,4.8062682208045047,4.7939432730919638,8.2014527366571492,4.2112486534441977,4.3070854335779138,null,null,null,null,null,null,null,null,null,null,null,null,null,null,null,null,null,null,null,null,null,null,null,null,null,null,null,null,null,null,null,"Shared among improved sanitation facilities","Yes","N/A","N/A","N/A","N/A","N/A","N/A","N/A","N/A","N/A","N/A","N/A","N/A","N/A","N/A","N/A","N/A","N/A","N/A","N/A"]
[null,"No",67.257477299938458,72.66797441854348,76.194542887825705,79.096265743885979,95.287869923183649,65.188023453615955,74.76292236071879,91.336727675423376,95.483102209599238,96.896675221125506,67.067557309095989,71.527068223613739,73.561471025978449,78.514777557575172,78.86588845663988,73.322517339281262,88.997471581358866,76.811935934170137,74.772509842078222,null,null,null,null,null,null,null,null,null,null,null,null,null,null,null,null,null,null,null,null,null,null,null,null,null,null,null,null,null,null,null,null,"No","N/A","N/A","N/A","N/A","N/A","N/A","N/A","N/A","N/A","N/A","N/A","N/A","N/A","N/A","N/A","N/A","N/A","N/A","N/A"]
[null,"DK/missing",27.379304843695962,23.437254603663877,19.445532049624379,11.787817505771146,1.1553867351840887,27.812520041594404,12.067986885396298,1.8060074880653172,0.71577187331647574,0.31117025972621803,27.819002529269532,23.116263619408336,22.741738331090321,18.798858898377713,16.327843322555495,21.883539387627291,2.801075681983745,18.97681541238493,20.920404724343676,null,null,null,null,null,null,null,null,null,null,null,null,null,null,null,null,null,null,null,null,null,null,null,null,null,null,null,null,null,null,null,null,"DK/missing","N/A","N/A","N/A","N/A","N/A","N/A","N/A","N/A","N/A","N/A","N/A","N/A","N/A","N/A","N/A","N/A","N/A","N/A","N/A"]
["Shared among all sanitation facilities","Yes",6.2571927985451827,4.2491054766447789,4.8308548488663154,9.920795361993493,3.6370673248680827,8.8302195071073317,13.887833613425782,6.8572648365114519,4.0084950812126445,2.7921545191483386,5.9075826282962209,5.6874595572135798,3.9059643854098205,2.9868132292436447,5.6763594974035003,5.52859058279551,8.3091191506100035,4.8247465681058168,4.8210339436869161,null,null,null,null,null,null,null,null,null,null,null,null,null,null,null,null,null,null,null,null,null,null,null,null,null,null,null,null,null,null,null,"Shared among all sanitation facilities","Yes","N/A","N/A","N/A","N/A","N/A","N/A","N/A","N/A","N/A","N/A","N/A","N/A","N/A","N/A","N/A","N/A","N/A","N/A","N/A"]
[null,"No",93.483903234239932,95.511276729650618,94.897473799462944,90.0701670631247,96.131064405858027,90.994545554876112,86.088833572161704,92.959094440920595,95.887662802975655,96.896675221125506,93.918310472490134,94.100130233401487,95.702926419784532,96.645745504743914,94.323640502596476,94.308835291891242,91.5567941756333,94.874812261421255,94.99989927887458,null,null,null,null,null,null,null,null,null,null,null,null,null,null,null,null,null,null,null,null,null,null,null,null,null,null,null,null,null,null,null,null,"No","N/A","N/A","N/A","N/A","N/A","N/A","N/A","N/A","N/A","N/A","N/A","N/A","N/A","N/A","N/A","N/A","N/A","N/A","N/A"]
["Type of toilet facility","Flush - to piped sewer system",0.43740782999522859,2.2467727123762442,6.0979110737315025,36.797925233473769,94.186208971136722,7.4076320897964187,44.860054263104296,86.351312584343674,97.679132225354522,99.465857407682932,0.28577256392044242,0.51879562107784272,2.9406908586349614,5.3461571106698544,6.7958572346137283,10.797227427507611,85.641766110674126,14.135903876125825,9.9714430955491125,null,null,null,null,null,null,null,null,null,null,null,null,null,null,null,null,null,null,null,null,null,null,null,null,null,null,null,null,null,null,null,"Type of toilet facility","Flush - to piped sewer system",28.052937,144.02071599999999,390.59492099999989,2358.4707820000049,6031.5904630000214,183.78336200000001,1111.9025440000012,2146.0332730000055,2419.2096750000019,2467.9995529999969,11.220483999999999,20.403690999999998,115.50829299999999,210.02004699999998,266.64889700000003,950.45632900000066,5966.1591860000271,1403.4896109999986,632.62469299999975]
[null,"Flush - to septic tank",0,0.17522693266601069,0.29508023947733025,1.9301301656567107,0.49618630698453581,0.84142333256376234,2.9886318265952156,0.92598657820591201,0.49164421514546458,0.32568529120663486,0,0,0.14824995013054579,0.13200071839892852,0.92729242601924411,0.28207376552769198,0.69102995372366505,0.53613951217775602,0.93648815845277544,null,null,null,null,null,null,null,null,null,null,null,null,null,null,null,null,null,null,null,null,null,null,null,null,null,null,null,null,null,null,null,null,"Flush - to septic tank",0,11.232248,18.901037000000002,123.70685500000002,31.775274,20.875713999999995,74.076311000000018,23.012944999999998,12.176504999999999,8.0810759999999995,0,0,5.8231549999999999,5.1855560000000001,36.384152,24.830337,48.140000999999998,53.230854000000001,59.414221999999995]
[null,"Flush - to pit latrine",1.6352833977783709E-2,0.29294929691948485,0.63055975880279325,1.3280777267060764,0.31747515707856494,0.91673014029620692,2.1900063145334316,0.67375898890048957,0.35617835224735922,0,0,2.66668903322267E-2,0.27812045080497283,0.51650919840018972,0.78528350067527419,0.55898312927459826,0.85168542865393748,0.31105489538295572,0.41369569986043181,null,null,null,null,null,null,null,null,null,null,null,null,null,null,null,null,null,null,null,null,null,null,null,null,null,null,null,null,null,null,null,null,"Flush - to pit latrine",1.048781,18.778386999999999,40.389805000000003,85.119813000000008,20.330791000000001,22.744076,54.281557000000006,16.744495999999998,8.8214349999999992,0,0,1.048781,10.924378000000001,20.290703000000001,30.812151000000004,49.206063000000007,59.331925000000005,30.883226000000001,26.246363000000002]
[null,"Flush - to somewhere else",0,3.252921328997177E-2,0,0.38660248129260477,0,0,0.30633601787296016,3.7339402538479824E-2,0,0,0,0,5.3085460719182104E-2,0,0.41434108997973756,4.993104786185304E-2,5.9219916472515136E-2,0.10426981750982101,0.12594131431955069,null,null,null,null,null,null,null,null,null,null,null,null,null,null,null,null,null,null,null,null,null,null,null,null,null,null,null,null,null,null,null,null,"Flush - to somewhere else",0,2.0851600000000001,0,24.778316999999994,0,0,7.5928529999999999,0.92797200000000002,0,0,0,0,2.0851600000000001,0,16.257491999999999,4.395321,4.1255039999999994,10.352475999999999,7.9901759999999999]
[null,"Flush - don't know where",0,2.1501205315337994E-2,1.0721737700720158E-2,6.047706667901534E-2,2.8981465252828579E-2,2.7681135154538072E-2,0.15638351007372928,0,7.4936456005556124E-2,0,0,0,3.5088502756207757E-2,0,0,0,2.6641314287336928E-2,2.0845702472977366E-2,6.1022219289204586E-2,null,null,null,null,null,null,null,null,null,null,null,null,null,null,null,null,null,null,null,null,null,null,null,null,null,null,null,null,null,null,null,null,"Flush - don't know where",0,1.378252,0.68676899999999996,3.8761260000000002,1.855944,0.68676899999999996,3.8761260000000002,0,1.855944,0,0,0,1.378252,0,0,0,1.855944,2.0696750000000002,3.8714719999999998]
[null,"Pit latrine - ventilated improved pit (VIP)",30.727187862595116,31.346351870320412,32.738138062527263,24.493035369651398,2.2943895161023153,31.04571236232173,22.263474666458087,5.5610569305352842,0.65347865460117971,0.13473785318356565,30.41912323561619,31.525881582333692,31.846118982815668,31.691159654542261,35.26927353454159,30.690915297716025,6.3078072992613103,29.847140172726728,26.626727574081716,null,null,null,null,null,null,null,null,null,null,null,null,null,null,null,null,null,null,null,null,null,null,null,null,null,null,null,null,null,null,null,null,"Pit latrine - ventilated improved pit (VIP)",1970.6731479999992,2009.3372219999985,2097.0050719999999,1569.819708999999,146.930406,770.24416500000029,551.82309800000007,138.20534800000004,16.184643000000001,3.3431870000000004,1194.3668800000009,1239.8800609999985,1250.8934190000004,1244.9650660000007,1383.8596899999995,2701.6541869999965,439.42791199999999,2963.3868139999936,1689.2966439999987]
[null,"Pit latrine - with slab",30.490440799007423,34.442493813831845,32.484177449476419,18.624827304171632,1.301754421449864,29.858865428766968,14.50167596480715,4.1906117470972646,0.42250804006836218,7.3719447926894333E-2,30.273182935693388,33.424871143730854,34.025915853177551,33.519512877883969,29.256105207272011,28.039993434747974,3.676480873298666,30.839893840531772,27.342921027463813,null,null,null,null,null,null,null,null,null,null,null,null,null,null,null,null,null,null,null,null,null,null,null,null,null,null,null,null,null,null,null,null,"Pit latrine - with slab",1955.4894910000021,2207.8034830000015,2080.737907000002,1193.7116220000003,83.363049000000004,740.79849100000013,359.438941,104.14656099999996,10.464215999999999,1.8291660000000001,1188.6367260000009,1314.5653409999998,1336.5143250000006,1316.790645,1147.9211400000002,2468.2993300000016,256.11884400000008,3061.9528109999951,1734.7345670000002]
[null,"Pit latrine - without slab / open pit",25.624871477638067,22.501624066011718,18.611370092522581,11.005611172707479,0.78476981907862842,26.626876887797412,11.24370255180084,1.4469065561698813,0.25394050223760212,0,26.050672109554711,21.853263874565609,21.748145596960221,18.172538379634421,15.331844378683609,21.415238465766951,2.5356854133645692,17.141292247505781,20.016476871793525,null,null,null,null,null,null,null,null,null,null,null,null,null,null,null,null,null,null,null,null,null,null,null,null,null,null,null,null,null,null,null,null,"Pit latrine - without slab / open pit",1643.4385849999967,1442.3799930000002,1192.1306399999992,705.37706200000025,50.255873000000001,660.61285100000066,278.68672199999997,35.959032000000001,6.28932,0,1022.84539,859.46608900000001,854.25204300000041,713.89547399999958,601.57523200000048,1885.1366309999971,176.64632000000006,1701.8809549999976,1269.9182469999992]
[null,"Composting toilet",11.162845043846213,8.1582808749146007,8.5605846705203703,5.0280851883443187,0.51905429433719741,2.2546726723613584,1.1017097381899881,0.56166489309748902,0,0,11.314727394651491,11.590667804841091,8.1812655394249791,10.226931807201407,10.762718984808718,7.850215297382908,0.20968369026377021,5.5644618804892474,13.943160627727478,null,null,null,null,null,null,null,null,null,null,null,null,null,null,null,null,null,null,null,null,null,null,null,null,null,null,null,null,null,null,null,null,"Composting toilet",715.92360100000042,522.95519100000024,548.33874300000025,322.26251699999995,33.239716999999999,55.938432000000006,27.307008,13.958693999999999,0,0,444.25789500000008,455.84888300000011,321.35442400000005,401.75787100000031,422.29656199999999,691.03729299999941,14.607432000000001,552.47011499999962,884.60492900000168]
[null,"Bucket toilet",1.4344248595327447,0.72573505412241424,0.51528134123300429,0.10810514035321879,0,0.61586627089471357,2.4670754401426763E-2,0,0,0,1.4826115440813419,1.0598530831186952,0.7433188045757414,0.39519025326894336,0.45728364340594269,0.25738102469651691,0,1.4066704302210453,0.25428064660757449,null,null,null,null,null,null,null,null,null,null,null,null,null,null,null,null,null,null,null,null,null,null,null,null,null,null,null,null,null,null,null,null,"Bucket toilet",91.996136000000021,46.520451999999992,33.005774000000002,6.9287279999999996,0,15.279642999999998,0.61148999999999998,0,0,0,58.212793000000012,41.682917000000003,29.197046,15.524773,17.942428000000003,22.656689,0,139.66190999999998,16.132491000000002]
[null,"OTHER",0.10646929340749238,5.6534960232055537E-2,5.6175574008064014E-2,0.2371231509639451,7.1180048579323113E-2,0.40453968004684471,0.36335439216298288,0.25136231911172302,6.8181554339979175E-2,0,0.17391021648277713,0,0,0,0,5.8041109518351709E-2,0,9.2327624855237753E-2,0.30784276485492634,null,null,null,null,null,null,null,null,null,null,null,null,null,null,null,null,null,null,null,null,null,null,null,null,null,null,null,null,null,null,null,null,"OTHER",6.8283560000000003,3.6239559999999997,3.5982639999999999,15.197813999999997,4.5582989999999999,10.036630000000001,9.0061119999999999,6.2469450000000002,1.6886459999999999,0,6.8283560000000003,0,0,0,0,5.1092319999999996,0,9.1667900000000007,19.530666999999998]
[null,null,null,null,null,null,null,null,null,null,null,null,null,null,null,null,null,null,null,null,null,null,null,null,null,null,null,null,null,null,null,null,null,null,null,null,null,null,null,null,null,null,null,null,null,null,null,null,null,null,null,null,null,"Total",6413.4510349999937,6410.1150599999946,6405.388931999998,6409.2493449999938,6403.8998160000228,2481.0001330000023,2478.6027619999986,2485.2352660000006,2476.6903840000014,2481.2529819999963,3926.3685239999882,3932.8957629999977,3927.9304950000001,3928.4301350000019,3923.697744000006,8802.781411999953,6966.4130680000344,9928.5452370000694,6344.3644709999926]
[]
[]
[]
[]
[]
[]
[]
[]
[]
[]
[]
[]
[]
[]
[]
[]
[]
[]
[]
[]
[]
[]
[]
[]
[]
[]
[]
[]
[]
[]
[]
[]
[]
[]
[]
[]
[]
[]
[]
[]
[]
[]
[]
[{"$f":"A1026","v":"Republic of Moldova"}]
[{"$f":"A1034","v":"2005"}]
["Access to hygiene facilities "]
[" by wealth quintile and sub-national region"]
["Notes:"]
["WHO/UNICEF JMP customised wealth index excludes water,"]
[" sanitation and hygiene assets."]
["Survey used for analysis:",{"$f":"A1025","v":"DHS05"}]
[]
[]
[]
[]
["Access to handwashing",null,"NATIONAL wealth index quintile",null,null,null,null,"URBAN wealth index quintile",null,null,null,null,"RURAL wealth index quintile",null,null,null,null,"SUB-REGIONS:",null,null,null,null,null,null,null,null,null,null,null,null,null,null,null,null,null,null,null,null,null,null,null,null,null,null,null,null,null,null,null,null,null,null,"Raw numbers of respondents:","Access to handwashing","NATIONAL wealth index quintile",null,null,null,null,"URBAN wealth index quintile",null,null,null,null,"RURAL wealth index quintile",null,null,null,null,"SUB-REGIONS:"]
["Weighted percentage (used in graphs)",null,"Poorest","Poor","Middle","Rich","Richest","Poorest","Poor","Middle","Rich","Richest","Poorest","Poor","Middle","Rich","Richest","Center","Chisinau","North","South",null,null,null,null,null,null,null,null,null,null,null,null,null,null,null,null,null,null,null,null,null,null,null,null,null,null,null,null,null,null,null,"Hygiene data, raw numbers (weighted)",null,"Poorest","Poor","Middle","Rich","Richest","Poorest","Poor","Middle","Rich","Richest","Poorest","Poor","Middle","Rich","Richest","Center","Chisinau","North","South"]
["Hygiene ladder","Basic","N/A","N/A","N/A","N/A","N/A","N/A","N/A","N/A","N/A","N/A","N/A","N/A","N/A","N/A","N/A","N/A","N/A","N/A","N/A",null,null,null,null,null,null,null,null,null,null,null,null,null,null,null,null,null,null,null,null,null,null,null,null,null,null,null,null,null,null,null,"Hygiene ladder","Basic","N/A","N/A","N/A","N/A","N/A","N/A","N/A","N/A","N/A","N/A","N/A","N/A","N/A","N/A","N/A","N/A","N/A","N/A","N/A"]
[null,"Limited","N/A","N/A","N/A","N/A","N/A","N/A","N/A","N/A","N/A","N/A","N/A","N/A","N/A","N/A","N/A","N/A","N/A","N/A","N/A",null,null,null,null,null,null,null,null,null,null,null,null,null,null,null,null,null,null,null,null,null,null,null,null,null,null,null,null,null,null,null,null,"Limited","N/A","N/A","N/A","N/A","N/A","N/A","N/A","N/A","N/A","N/A","N/A","N/A","N/A","N/A","N/A","N/A","N/A","N/A","N/A"]
[null,"No facility","N/A","N/A","N/A","N/A","N/A","N/A","N/A","N/A","N/A","N/A","N/A","N/A","N/A","N/A","N/A","N/A","N/A","N/A","N/A",null,null,null,null,null,null,null,null,null,null,null,null,null,null,null,null,null,null,null,null,null,null,null,null,null,null,null,null,null,null,null,null,"No facility","N/A","N/A","N/A","N/A","N/A","N/A","N/A","N/A","N/A","N/A","N/A","N/A","N/A","N/A","N/A","N/A","N/A","N/A","N/A"]
[null,null,null,null,null,null,null,null,null,null,null,null,null,null,null,null,null,null,null,null,null,null,null,null,null,null,null,null,null,null,null,null,null,null,null,null,null,null,null,null,null,null,null,null,null,null,null,null,null,null,null,null,"Observed handwashing place","Fixed","N/A","N/A","N/A","N/A","N/A","N/A","N/A","N/A","N/A","N/A","N/A","N/A","N/A","N/A","N/A","N/A","N/A","N/A","N/A"]
[null,null,null,null,null,null,null,null,null,null,null,null,null,null,null,null,null,null,null,null,null,null,null,null,null,null,null,null,null,null,null,null,null,null,null,null,null,null,null,null,null,null,null,null,null,null,null,null,null,null,null,null,null,"Mobile","N/A","N/A","N/A","N/A","N/A","N/A","N/A","N/A","N/A","N/A","N/A","N/A","N/A","N/A","N/A","N/A","N/A","N/A","N/A"]
[null,null,null,null,null,null,null,null,null,null,null,null,null,null,null,null,null,null,null,null,null,null,null,null,null,null,null,null,null,null,null,null,null,null,null,null,null,null,null,null,null,null,null,null,null,null,null,null,null,null,null,null,"Water / Soap","Water and soap","N/A","N/A","N/A","N/A","N/A","N/A","N/A","N/A","N/A","N/A","N/A","N/A","N/A","N/A","N/A","N/A","N/A","N/A","N/A"]
[null,null,null,null,null,null,null,null,null,null,null,null,null,null,null,null,null,null,null,null,null,null,null,null,null,null,null,null,null,null,null,null,null,null,null,null,null,null,null,null,null,null,null,null,null,null,null,null,null,null,null,null,null,"Water only","N/A","N/A","N/A","N/A","N/A","N/A","N/A","N/A","N/A","N/A","N/A","N/A","N/A","N/A","N/A","N/A","N/A","N/A","N/A"]
[null,null,null,null,null,null,null,null,null,null,null,null,null,null,null,null,null,null,null,null,null,null,null,null,null,null,null,null,null,null,null,null,null,null,null,null,null,null,null,null,null,null,null,null,null,null,null,null,null,null,null,null,null,"Soap only","N/A","N/A","N/A","N/A","N/A","N/A","N/A","N/A","N/A","N/A","N/A","N/A","N/A","N/A","N/A","N/A","N/A","N/A","N/A"]
[null,null,null,null,null,null,null,null,null,null,null,null,null,null,null,null,null,null,null,null,null,null,null,null,null,null,null,null,null,null,null,null,null,null,null,null,null,null,null,null,null,null,null,null,null,null,null,null,null,null,null,null,null,"Neither","N/A","N/A","N/A","N/A","N/A","N/A","N/A","N/A","N/A","N/A","N/A","N/A","N/A","N/A","N/A","N/A","N/A","N/A","N/A"]
[]
[]
[]
[]
[]
[]
[]
[]
[]
[]
[]
[]
[]
[]
[]
[]
[]
[]
[]
[]
[]
[]
[]
[]
[]
[]
[]
[]
[null,null,null,null,null,null,null,null,null,null,null,null,null,null,null,null,null,null,null,null,null,null,null,null,null,null,null,null,null,null,null,null,null,null,null,null,null,null,null,null,null,null,null,null,null,null,null,null,null,null,null,null,"Raw numbers of respondents:","Menstrual health and hygiene","NATIONAL wealth index quintile",null,null,null,null,"URBAN wealth index quintile",null,null,null,null,"RURAL wealth index quintile",null,null,null,null,"SUB-REGIONS:"]
[null,null,null,null,null,null,null,null,null,null,null,null,null,null,null,null,null,null,null,null,null,null,null,null,null,null,null,null,null,null,null,null,null,null,null,null,null,null,null,null,null,null,null,null,null,null,null,null,null,null,null,null,"MHH data, raw numbers (weighted)",null,"Poorest","Poor","Middle","Rich","Richest","Poorest","Poor","Middle","Rich","Richest","Poorest","Poor","Middle","Rich","Richest","Center","Chisinau","North","South"]
[null,null,null,null,null,null,null,null,null,null,null,null,null,null,null,null,null,null,null,null,null,null,null,null,null,null,null,null,null,null,null,null,null,null,null,null,null,null,null,null,null,null,null,null,null,null,null,null,null,null,null,null,"Private place to wash and change","Yes","N/A","N/A","N/A","N/A","N/A","N/A","N/A","N/A","N/A","N/A","N/A","N/A","N/A","N/A","N/A","N/A","N/A","N/A","N/A"]
[null,null,null,null,null,null,null,null,null,null,null,null,null,null,null,null,null,null,null,null,null,null,null,null,null,null,null,null,null,null,null,null,null,null,null,null,null,null,null,null,null,null,null,null,null,null,null,null,null,null,null,null,null,"No","N/A","N/A","N/A","N/A","N/A","N/A","N/A","N/A","N/A","N/A","N/A","N/A","N/A","N/A","N/A","N/A","N/A","N/A","N/A"]
[null,null,null,null,null,null,null,null,null,null,null,null,null,null,null,null,null,null,null,null,null,null,null,null,null,null,null,null,null,null,null,null,null,null,null,null,null,null,null,null,null,null,null,null,null,null,null,null,null,null,null,null,null,"DK/not sure/missing","N/A","N/A","N/A","N/A","N/A","N/A","N/A","N/A","N/A","N/A","N/A","N/A","N/A","N/A","N/A","N/A","N/A","N/A","N/A"]
[null,null,null,null,null,null,null,null,null,null,null,null,null,null,null,null,null,null,null,null,null,null,null,null,null,null,null,null,null,null,null,null,null,null,null,null,null,null,null,null,null,null,null,null,null,null,null,null,null,null,null,null,"Use of menstrual materials","Materials reusable","N/A","N/A","N/A","N/A","N/A","N/A","N/A","N/A","N/A","N/A","N/A","N/A","N/A","N/A","N/A","N/A","N/A","N/A","N/A"]
[null,null,null,null,null,null,null,null,null,null,null,null,null,null,null,null,null,null,null,null,null,null,null,null,null,null,null,null,null,null,null,null,null,null,null,null,null,null,null,null,null,null,null,null,null,null,null,null,null,null,null,null,null,"Materials not reusable","N/A","N/A","N/A","N/A","N/A","N/A","N/A","N/A","N/A","N/A","N/A","N/A","N/A","N/A","N/A","N/A","N/A","N/A","N/A"]
[null,null,null,null,null,null,null,null,null,null,null,null,null,null,null,null,null,null,null,null,null,null,null,null,null,null,null,null,null,null,null,null,null,null,null,null,null,null,null,null,null,null,null,null,null,null,null,null,null,null,null,null,null,"No materials used","N/A","N/A","N/A","N/A","N/A","N/A","N/A","N/A","N/A","N/A","N/A","N/A","N/A","N/A","N/A","N/A","N/A","N/A","N/A"]
[null,null,null,null,null,null,null,null,null,null,null,null,null,null,null,null,null,null,null,null,null,null,null,null,null,null,null,null,null,null,null,null,null,null,null,null,null,null,null,null,null,null,null,null,null,null,null,null,null,null,null,null,null,"DK/not sure/missing","N/A","N/A","N/A","N/A","N/A","N/A","N/A","N/A","N/A","N/A","N/A","N/A","N/A","N/A","N/A","N/A","N/A","N/A","N/A"]
[null,null,null,null,null,null,null,null,null,null,null,null,null,null,null,null,null,null,null,null,null,null,null,null,null,null,null,null,null,null,null,null,null,null,null,null,null,null,null,null,null,null,null,null,null,null,null,null,null,null,null,null,"Use of menstrual materials with private place to wash and change","Materials reusable","N/A","N/A","N/A","N/A","N/A","N/A","N/A","N/A","N/A","N/A","N/A","N/A","N/A","N/A","N/A","N/A","N/A","N/A","N/A"]
[null,null,null,null,null,null,null,null,null,null,null,null,null,null,null,null,null,null,null,null,null,null,null,null,null,null,null,null,null,null,null,null,null,null,null,null,null,null,null,null,null,null,null,null,null,null,null,null,null,null,null,null,null,"Materials not reusable","N/A","N/A","N/A","N/A","N/A","N/A","N/A","N/A","N/A","N/A","N/A","N/A","N/A","N/A","N/A","N/A","N/A","N/A","N/A"]
[null,null,null,null,null,null,null,null,null,null,null,null,null,null,null,null,null,null,null,null,null,null,null,null,null,null,null,null,null,null,null,null,null,null,null,null,null,null,null,null,null,null,null,null,null,null,null,null,null,null,null,null,null,"No materials used","N/A","N/A","N/A","N/A","N/A","N/A","N/A","N/A","N/A","N/A","N/A","N/A","N/A","N/A","N/A","N/A","N/A","N/A","N/A"]
[null,null,null,null,null,null,null,null,null,null,null,null,null,null,null,null,null,null,null,null,null,null,null,null,null,null,null,null,null,null,null,null,null,null,null,null,null,null,null,null,null,null,null,null,null,null,null,null,null,null,null,null,"Awareness of menstruation before menarche","Yes","N/A","N/A","N/A","N/A","N/A","N/A","N/A","N/A","N/A","N/A","N/A","N/A","N/A","N/A","N/A","N/A","N/A","N/A","N/A"]
[null,null,null,null,null,null,null,null,null,null,null,null,null,null,null,null,null,null,null,null,null,null,null,null,null,null,null,null,null,null,null,null,null,null,null,null,null,null,null,null,null,null,null,null,null,null,null,null,null,null,null,null,null,"No","N/A","N/A","N/A","N/A","N/A","N/A","N/A","N/A","N/A","N/A","N/A","N/A","N/A","N/A","N/A","N/A","N/A","N/A","N/A"]
[null,null,null,null,null,null,null,null,null,null,null,null,null,null,null,null,null,null,null,null,null,null,null,null,null,null,null,null,null,null,null,null,null,null,null,null,null,null,null,null,null,null,null,null,null,null,null,null,null,null,null,null,null,"DK/not sure/missing","N/A","N/A","N/A","N/A","N/A","N/A","N/A","N/A","N/A","N/A","N/A","N/A","N/A","N/A","N/A","N/A","N/A","N/A","N/A"]
[null,null,null,null,null,null,null,null,null,null,null,null,null,null,null,null,null,null,null,null,null,null,null,null,null,null,null,null,null,null,null,null,null,null,null,null,null,null,null,null,null,null,null,null,null,null,null,null,null,null,null,null,"Participation in (all) activities during menstruation","Yes","N/A","N/A","N/A","N/A","N/A","N/A","N/A","N/A","N/A","N/A","N/A","N/A","N/A","N/A","N/A","N/A","N/A","N/A","N/A"]
[null,null,null,null,null,null,null,null,null,null,null,null,null,null,null,null,null,null,null,null,null,null,null,null,null,null,null,null,null,null,null,null,null,null,null,null,null,null,null,null,null,null,null,null,null,null,null,null,null,null,null,null,null,"No","N/A","N/A","N/A","N/A","N/A","N/A","N/A","N/A","N/A","N/A","N/A","N/A","N/A","N/A","N/A","N/A","N/A","N/A","N/A"]
[null,null,null,null,null,null,null,null,null,null,null,null,null,null,null,null,null,null,null,null,null,null,null,null,null,null,null,null,null,null,null,null,null,null,null,null,null,null,null,null,null,null,null,null,null,null,null,null,null,null,null,null,null,"DK/not sure/missing/no such activity","N/A","N/A","N/A","N/A","N/A","N/A","N/A","N/A","N/A","N/A","N/A","N/A","N/A","N/A","N/A","N/A","N/A","N/A","N/A"]
[null,null,null,null,null,null,null,null,null,null,null,null,null,null,null,null,null,null,null,null,null,null,null,null,null,null,null,null,null,null,null,null,null,null,null,null,null,null,null,null,null,null,null,null,null,null,null,null,null,null,null,null,"Participation in specific activities during menstruation","Did not go to school (amongst those usually attending school)","N/A","N/A","N/A","N/A","N/A","N/A","N/A","N/A","N/A","N/A","N/A","N/A","N/A","N/A","N/A","N/A","N/A","N/A","N/A"]
[null,null,null,null,null,null,null,null,null,null,null,null,null,null,null,null,null,null,null,null,null,null,null,null,null,null,null,null,null,null,null,null,null,null,null,null,null,null,null,null,null,null,null,null,null,null,null,null,null,null,null,null,null,"Did not go to work (amongst those who usually work)","N/A","N/A","N/A","N/A","N/A","N/A","N/A","N/A","N/A","N/A","N/A","N/A","N/A","N/A","N/A","N/A","N/A","N/A","N/A"]
[null,null,null,null,null,null,null,null,null,null,null,null,null,null,null,null,null,null,null,null,null,null,null,null,null,null,null,null,null,null,null,null,null,null,null,null,null,null,null,null,null,null,null,null,null,null,null,null,null,null,null,null,null,"Did not participate in social activities","N/A","N/A","N/A","N/A","N/A","N/A","N/A","N/A","N/A","N/A","N/A","N/A","N/A","N/A","N/A","N/A","N/A","N/A","N/A"]
[null,null,null,null,null,null,null,null,null,null,null,null,null,null,null,null,null,null,null,null,null,null,null,null,null,null,null,null,null,null,null,null,null,null,null,null,null,null,null,null,null,null,null,null,null,null,null,null,null,null,null,null,null,"Did not cook food","N/A","N/A","N/A","N/A","N/A","N/A","N/A","N/A","N/A","N/A","N/A","N/A","N/A","N/A","N/A","N/A","N/A","N/A","N/A"]
[null,null,null,null,null,null,null,null,null,null,null,null,null,null,null,null,null,null,null,null,null,null,null,null,null,null,null,null,null,null,null,null,null,null,null,null,null,null,null,null,null,null,null,null,null,null,null,null,null,null,null,null,null,"Did not eat with others","N/A","N/A","N/A","N/A","N/A","N/A","N/A","N/A","N/A","N/A","N/A","N/A","N/A","N/A","N/A","N/A","N/A","N/A","N/A"]
[null,null,null,null,null,null,null,null,null,null,null,null,null,null,null,null,null,null,null,null,null,null,null,null,null,null,null,null,null,null,null,null,null,null,null,null,null,null,null,null,null,null,null,null,null,null,null,null,null,null,null,null,null,"Did not bathe in regular place","N/A","N/A","N/A","N/A","N/A","N/A","N/A","N/A","N/A","N/A","N/A","N/A","N/A","N/A","N/A","N/A","N/A","N/A","N/A"]
[null,null,null,null,null,null,null,null,null,null,null,null,null,null,null,null,null,null,null,null,null,null,null,null,null,null,null,null,null,null,null,null,null,null,null,null,null,null,null,null,null,null,null,null,null,null,null,null,null,null,null,null,null,"Did not participate in other activities","N/A","N/A","N/A","N/A","N/A","N/A","N/A","N/A","N/A","N/A","N/A","N/A","N/A","N/A","N/A","N/A","N/A","N/A","N/A"]
[null,null,null,null,null,null,null,null,null,null,null,null,null,null,null,null,null,null,null,null,null,null,null,null,null,null,null,null,null,null,null,null,null,null,null,null,null,null,null,null,null,null,null,null,null,null,null,null,null,null,null,null,null,"DK/not sure/missing/no such activity","N/A","N/A","N/A","N/A","N/A","N/A","N/A","N/A","N/A","N/A","N/A","N/A","N/A","N/A","N/A","N/A","N/A","N/A","N/A"]
[]
[]
[]
[]
[]
[]
[]
[]
[]
[]
[]
[]
[]
[]
[]
[]
[]
[]
[]
[]
[]
[]
[]
[]
[]
[]
[]
[]
[]
[]
[]
[]
[]
[]
[]
[]
[]
[]
[]
[]
[]
[]
[]
[]
[]
[]
[]
[]
[]
[]
[]
[]
[]
[]
[null,null,null,null,null,null,null,null,null,null,null,null,null,null,null,null,null,null,null,null,null,null,null,null,null,null,null,null,null,null,null,null,null,null,null,null,null,null,null,null,null,null,null,null,null,null,null,null,null,null,null,null,"Raw numbers of respondents:","Basic water, sanitation and hygiene","NATIONAL wealth index quintile",null,null,null,null,"URBAN wealth index quintile",null,null,null,null,"RURAL wealth index quintile",null,null,null,null,"SUB-REGIONS:"]
[null,null,null,null,null,null,null,null,null,null,null,null,null,null,null,null,null,null,null,null,null,null,null,null,null,null,null,null,null,null,null,null,null,null,null,null,null,null,null,null,null,null,null,null,null,null,null,null,null,null,null,null,"WatSan data, raw numbers (weighted)",null,"Poorest","Poor","Middle","Rich","Richest","Poorest","Poor","Middle","Rich","Richest","Poorest","Poor","Middle","Rich","Richest","Center","Chisinau","North","South"]
[null,null,null,null,null,null,null,null,null,null,null,null,null,null,null,null,null,null,null,null,null,null,null,null,null,null,null,null,null,null,null,null,null,null,null,null,null,null,null,null,null,null,null,null,null,null,null,null,null,null,null,null,"Use of Basic Water Sanitation and Hygiene","Yes","N/A","N/A","N/A","N/A","N/A","N/A","N/A","N/A","N/A","N/A","N/A","N/A","N/A","N/A","N/A","N/A","N/A","N/A","N/A"]
[null,null,null,null,null,null,null,null,null,null,null,null,null,null,null,null,null,null,null,null,null,null,null,null,null,null,null,null,null,null,null,null,null,null,null,null,null,null,null,null,null,null,null,null,null,null,null,null,null,null,null,null,null,"No","N/A","N/A","N/A","N/A","N/A","N/A","N/A","N/A","N/A","N/A","N/A","N/A","N/A","N/A","N/A","N/A","N/A","N/A","N/A"]
[null,null,null,null,null,null,null,null,null,null,null,null,null,null,null,null,null,null,null,null,null,null,null,null,null,null,null,null,null,null,null,null,null,null,null,null,null,null,null,null,null,null,null,null,null,null,null,null,null,null,null,null,"Use of Basic Water and Sanitation","Yes","N/A","N/A","N/A","N/A","N/A","N/A","N/A","N/A","N/A","N/A","N/A","N/A","N/A","N/A","N/A","N/A","N/A","N/A","N/A"]
[null,null,null,null,null,null,null,null,null,null,null,null,null,null,null,null,null,null,null,null,null,null,null,null,null,null,null,null,null,null,null,null,null,null,null,null,null,null,null,null,null,null,null,null,null,null,null,null,null,null,null,null,null,"No","N/A","N/A","N/A","N/A","N/A","N/A","N/A","N/A","N/A","N/A","N/A","N/A","N/A","N/A","N/A","N/A","N/A","N/A","N/A"]
[null,null,null,null,null,null,null,null,null,null,null,null,null,null,null,null,null,null,null,null,null,null,null,null,null,null,null,null,null,null,null,null,null,null,null,null,null,null,null,null,null,null,null,null,null,null,null,null,null,null,null,null,"Use of Basic Water and Hygiene","Yes","N/A","N/A","N/A","N/A","N/A","N/A","N/A","N/A","N/A","N/A","N/A","N/A","N/A","N/A","N/A","N/A","N/A","N/A","N/A"]
[null,null,null,null,null,null,null,null,null,null,null,null,null,null,null,null,null,null,null,null,null,null,null,null,null,null,null,null,null,null,null,null,null,null,null,null,null,null,null,null,null,null,null,null,null,null,null,null,null,null,null,null,null,"No","N/A","N/A","N/A","N/A","N/A","N/A","N/A","N/A","N/A","N/A","N/A","N/A","N/A","N/A","N/A","N/A","N/A","N/A","N/A"]
[null,null,null,null,null,null,null,null,null,null,null,null,null,null,null,null,null,null,null,null,null,null,null,null,null,null,null,null,null,null,null,null,null,null,null,null,null,null,null,null,null,null,null,null,null,null,null,null,null,null,null,null,"Use of Basic Sanitation and Hygiene","Yes","N/A","N/A","N/A","N/A","N/A","N/A","N/A","N/A","N/A","N/A","N/A","N/A","N/A","N/A","N/A","N/A","N/A","N/A","N/A"]
[null,null,null,null,null,null,null,null,null,null,null,null,null,null,null,null,null,null,null,null,null,null,null,null,null,null,null,null,null,null,null,null,null,null,null,null,null,null,null,null,null,null,null,null,null,null,null,null,null,null,null,null,null,"No","N/A","N/A","N/A","N/A","N/A","N/A","N/A","N/A","N/A","N/A","N/A","N/A","N/A","N/A","N/A","N/A","N/A","N/A","N/A"]
[null,null,null,null,null,null,null,null,null,null,null,null,null,null,null,null,null,null,null,null,null,null,null,null,null,null,null,null,null,null,null,null,null,null,null,null,null,null,null,null,null,null,null,null,null,null,null,null,null,null,null,null,"Use of Basic Water","Yes","N/A","N/A","N/A","N/A","N/A","N/A","N/A","N/A","N/A","N/A","N/A","N/A","N/A","N/A","N/A","N/A","N/A","N/A","N/A"]
[null,null,null,null,null,null,null,null,null,null,null,null,null,null,null,null,null,null,null,null,null,null,null,null,null,null,null,null,null,null,null,null,null,null,null,null,null,null,null,null,null,null,null,null,null,null,null,null,null,null,null,null,null,"No","N/A","N/A","N/A","N/A","N/A","N/A","N/A","N/A","N/A","N/A","N/A","N/A","N/A","N/A","N/A","N/A","N/A","N/A","N/A"]
[null,null,null,null,null,null,null,null,null,null,null,null,null,null,null,null,null,null,null,null,null,null,null,null,null,null,null,null,null,null,null,null,null,null,null,null,null,null,null,null,null,null,null,null,null,null,null,null,null,null,null,null,"Use of Basic Sanitation","Yes","N/A","N/A","N/A","N/A","N/A","N/A","N/A","N/A","N/A","N/A","N/A","N/A","N/A","N/A","N/A","N/A","N/A","N/A","N/A"]
[null,null,null,null,null,null,null,null,null,null,null,null,null,null,null,null,null,null,null,null,null,null,null,null,null,null,null,null,null,null,null,null,null,null,null,null,null,null,null,null,null,null,null,null,null,null,null,null,null,null,null,null,null,"No","N/A","N/A","N/A","N/A","N/A","N/A","N/A","N/A","N/A","N/A","N/A","N/A","N/A","N/A","N/A","N/A","N/A","N/A","N/A"]
[null,null,null,null,null,null,null,null,null,null,null,null,null,null,null,null,null,null,null,null,null,null,null,null,null,null,null,null,null,null,null,null,null,null,null,null,null,null,null,null,null,null,null,null,null,null,null,null,null,null,null,null,"Access to Basic Hygiene","Yes","N/A","N/A","N/A","N/A","N/A","N/A","N/A","N/A","N/A","N/A","N/A","N/A","N/A","N/A","N/A","N/A","N/A","N/A","N/A"]
[null,null,null,null,null,null,null,null,null,null,null,null,null,null,null,null,null,null,null,null,null,null,null,null,null,null,null,null,null,null,null,null,null,null,null,null,null,null,null,null,null,null,null,null,null,null,null,null,null,null,null,null,null,"No","N/A","N/A","N/A","N/A","N/A","N/A","N/A","N/A","N/A","N/A","N/A","N/A","N/A","N/A","N/A","N/A","N/A","N/A","N/A"]
[]
[]
[]
[]
[]
[]
[]
[]
[]
[]
[]
[]
[]
[]
[]
[]
[]
[]
[]
[]
[]
[]
[]
[]
[]
[]
[]
[]
[]
[]
[]
[]
[]
[]
[]
[]
[]
[]
[]
[]
[]
[]
[]
[]
[null,null,"INITIAL (national) Wealth Index",null,null,null,null,"URBAN Wealth Index",null,null,null,null,"RURAL Wealth Index"]
[null,null,"Component Matrix",null,null,null,null,"Component Matrix",null,null,null,null,"Component Matrix"]
[null,null,null,null,"Component",null,null,null,null,"Component",null,null,null,null,"Component"]
[null,"Note:\n\nThe INITIAL (national) Wealth Index is based on the first component of the Principal Component Analysis (PCA) which has been obtained at national level.\n\nThe final national-level (NATIONAL) Wealth Index is based on the URBAN and RURAL specific wealth indexes. Regression procedures are used to establish the relationships between the two sets of scores (urban and rural) and the initial (national) wealth factors.\nThis allows best use of the available information for each area and a better precision of the FINAL (NATIONAL) Wealth Index.\n\nFor dependency reasons, all WASH variables (contained in the generic MICS and DHS scripts) have been excluded from the sets of asset variables used in the PCAs.\n\nThe PCA can extracts as many components as there are asset variables in the input. Only the first of the components is used to represent the Wealth Index. \n\nThe scores represent the weights of the asset variables on the Wealth Index (correlations between the variables and the component).\n\nThe communalities are the proportion of each variable's variance that can be explained by the component.\n\nProportion of explained variance is the part of the model's total variance that is explained by the component.\n\nFor more information on the procedure used:\n\nThe DHS Wealth Index, DHS Comparative Reports No. 6, Shea Oscar Rutstein, Kiersten Johnson, ORC Macro International Inc., 2004.\n\nThe DHS Wealth Index: Approaches for Rural and Urban Areas, Shea O. Rutstein, ORC Macro International Inc., 2008.\n\nMICS Methodological Paper No. 4, Review of options for reporting water, sanitation and hygiene coverage by wealth quintile, UNICEF, 2016.",null,null,"1",null,null,null,null,"1",null,null,null,null,"1"]
[null,null,"Bathtub/shower",null,0.76054183588202251,null,null,"Bathtub/shower",null,-0.69939425856406812,null,null,"Has television",null,0.66829100914593642]
[null,null,"Vacuum cleaner",null,0.71769147425181645,null,null,"Has clay tiles roof",null,-0.64879150524328133,null,null,"Washing machine",null,0.64343366009528824]
[null,null,"Household fuel type: natural gas",null,0.65884162582715666,null,null,"Has calamine cement fiber roof",null,0.62034410843390964,null,null,"Has telephone",null,0.62678170185082838]
[null,null,"Has clay tiles roof",null,0.6371374785662588,null,null,"Vacuum cleaner",null,-0.57418550720333739,null,null,"Vacuum cleaner",null,0.62322124766172293]
[null,null,"Has telephone",null,0.62554784406378905,null,null,"Household cooks in owm house",null,-0.52222055099214715,null,null,"Has refrigerator",null,0.60933034337039593]
[null,null,"Has television",null,0.60862836921645747,null,null,"Has planks wall",null,0.51184217808981902,null,null,"Household cooks at open sky",null,-0.58841946735637229]
[null,null,"Household cooks in owm house",null,0.60470276748034713,null,null,"Has cement wall",null,-0.49455317948762906,null,null,"Bathtub/shower",null,0.55942906982891227]
[null,null,"Mobile telephone",null,0.60326952693385505,null,null,"Mobile telephone",null,-0.47707566366989013,null,null,"VCR/DVD",null,0.55057576947615527]
[null,null,"Has refrigerator",null,0.5807326062503998,null,null,"Has telephone",null,-0.47081804279470568,null,null,"Has car/truck",null,0.53175233838262492]
[null,null,"Washing machine",null,0.56786241478915866,null,null,"10+ chickens",null,0.46343006432056844,null,null,"Mobile telephone",null,0.52658893520297712]
[null,null,"Household cooks at open sky",null,-0.56157616308727754,null,null,"Household fuel type: natural gas",null,-0.46208866162431311,null,null,"Fowl (Chickens)",null,0.47738270873809668]
[null,null,"Has calamine cement fiber roof",null,-0.54899869486325281,null,null,"Has television",null,-0.45551687914714839,null,null,"Has bicycle",null,0.45828990727834101]
[null,null,"Has planks wall",null,-0.51876836381836011,null,null,"Has refrigerator",null,-0.44199756726815853,null,null,"Household fuel type: wood, straw",null,-0.45551656068281643]
[null,null,"Has cement wall",null,0.50530005345006879,null,null,"Household cooks in other house",null,0.4388283971102579,null,null,"Watch",null,0.45111543840509838]
[null,null,"Water heat",null,0.50004215517769246,null,null,"Household fuel type: LPG, natural gas",null,0.43121627985554389,null,null,"Household cooks outside house",null,-0.45022364991702202]
[null,null,"VCR/DVD",null,0.48315495110985646,null,null,"Washing machine",null,-0.4149968505159814,null,null,"Water heat",null,0.40882076387767524]
[null,null,"Household fuel type: wood, straw",null,-0.44450077466854415,null,null,"Fowl (Chickens)",null,0.40153189328918104,null,null,"10+ chickens",null,0.40410123828344002]
[null,null,"Household cooks outside house",null,-0.4417784213164565,null,null,"Water heat",null,-0.40064362903907275,null,null,"Microwave",null,0.37741304315373964]
[null,null,"Household cooks in other house",null,-0.39557581914089451,null,null,"VCR/DVD",null,-0.38030915987589542,null,null,"Pigs",null,0.37565412206643262]
[null,null,"Watch",null,0.39039187078200338,null,null,"Household cooks at open sky",null,0.34634689018344006,null,null,"Household fuel type: LPG, natural gas",null,0.35369695557504677]
[null,null,"Computer",null,0.38652322029610103,null,null,"Medium land",null,0.34423549507104351,null,null,"Has earth/sand floor",null,-0.33969232764049301]
[null,null,"Has ceramic tile floor",null,0.37321919712288909,null,null,"Computer",null,-0.32925635836481332,null,null,"Has radio",null,0.33843609290908905]
[null,null,"Has car/truck",null,0.36510534592190769,null,null,"Has ceramic tile floor",null,-0.32550742876249472,null,null,"Armoire",null,0.29054367737518211]
[null,null,"Bank account",null,0.34791898102977287,null,null,"Household fuel type: wood, straw",null,0.31785797319703446,null,null,"Sofa",null,0.2849834945018766]
[null,null,"Household fuel type: LPG, natural gas",null,-0.32854885048229704,null,null,"Has wood floor",null,0.31747079451930854,null,null,"2-3 pigs",null,0.27585721321718865]
[null,null,"Has earth/sand floor",null,-0.32103635936375541,null,null,"Household cooks outside house",null,0.31640222190220563,null,null,"Household cooks in owm house",null,0.27271670499867529]
[null,null,"Cattle",null,-0.3198342162591733,null,null,"Watch",null,-0.29184659913660566,null,null,"Has stone wall",null,0.27063994708014588]
[null,null,"Microwave",null,0.3188994558588979,null,null,"1-2 cattle",null,0.28460476907780924,null,null,"Household fuel type: natural gas",null,0.26914004596666047]
[null,null,"Black-white TV",null,-0.30759462218150202,null,null,"Cattle",null,0.28455794050842326,null,null,"Computer",null,0.26309245466230746]
[null,null,"Animal-drawn cart",null,-0.28263079569641958,null,null,"Microwave",null,-0.26854603733675997,null,null,"Has motorcycle/scooter",null,0.2611558497138195]
[null,null,"Cows / bulls",null,-0.28109083451401401,null,null,"Bank account",null,-0.26595123317853669,null,null,"Has planks wall",null,-0.25290771485403613]
[null,null,"Fowl (Chickens)",null,-0.27672056591043959,null,null,"Has earth/sand floor",null,0.23306663419182605,null,null,"Bank account",null,0.25248573215036407]
[null,null,"Has cement blocks wall",null,-0.24694549694161363,null,null,"Has cement blocks wall",null,0.23137515949252821,null,null,"4-9 chickens",null,-0.25089137502621328]
[null,null,"Household fuel type: agricultural crop",null,-0.24637830550939099,null,null,"Has car/truck",null,-0.22935634315248626,null,null,"Household has separate room used as kitchen",null,0.24475482499459308]
[null,null,"Household fuel type: grass, straw",null,-0.24036020443249767,null,null,"4-9 chickens",null,0.22511313290631957,null,null,"Household fuel type: agricultural crop",null,-0.24163166102368847]
[null,null,"Has wood floor",null,-0.24028813957004005,null,null,"Black-white TV",null,0.22379709929452959,null,null,"Household fuel type: grass, straw",null,-0.2397974529826446]
[null,null,"Sofa",null,0.22159551355707696,null,null,"Pigs",null,0.21436097342611704,null,null,"Has electricity",null,0.23432396713726389]
[null,null,"Armoire",null,0.21382564238187671,null,null,"1-2 milk cows or bulls",null,0.20207217092086807,null,null,"Cattle",null,0.22902597927304152]
[null,null,"Pigs",null,-0.18964177227414666,null,null,"Cows / bulls",null,0.19476068686510756,null,null,"Tractor",null,0.22057728837817628]
[null,null,"Household has separate room used as kitchen",null,0.18747951328351983,null,null,"1-4 goats",null,0.18932572091393812,null,null,"4+ pigs",null,0.20827861994343796]
[null,null,"Has stone wall",null,0.18518259937130374,null,null,"Has carpet floor",null,0.18508139252855721,null,null,"Other",null,0.20156717093693854]
[null,null,"Has electricity",null,0.17089093169014291,null,null,"1 pig",null,0.18501401181208854,null,null,"Black-white TV",null,-0.201456580766806]
[null,null,"Has bicycle",null,0.16152968567080259,null,null,"Armoire",null,-0.18305978792839211,null,null,"Small land",null,0.18049870110844374]
[null,null,"Has carpet floor",null,-0.14978726065216932,null,null,"Animal-drawn cart",null,0.17631299473920817,null,null,"1-2 cattle",null,0.17715339190036208]
[null,null,"Has radio",null,0.13570587198874881,null,null,"Sofa",null,-0.17311349503766699,null,null,"Has ceramic tile floor",null,0.1629904614288343]
[null,null,"Household cooks on open owen",null,-0.12884210049931488,null,null,"Household fuel type: grass, straw",null,0.16865612760096871,null,null,"Has parquet/polished wood floor",null,0.16191165047688796]
[null,null,"Goats",null,-0.11365118175905868,null,null,"Big land",null,0.16424759788513205,null,null,"Goats",null,0.14981875532075889]
[null,null,"Has ceramic tiles roof",null,-9.030106388363536E-2,null,null,"Household cooks on open owen",null,0.16353355845289547,null,null,"10+ more goats",null,0.14032756907891905]
[null,null,"Household fuel type: electricity",null,8.794606710138661E-2,null,null,"2-3 pigs",null,0.16273567350750587,null,null,"Household cooks on open owen",null,-0.13998313140082017]
[null,null,"Has parquet/polished wood floor",null,8.5012361928315974E-2,null,null,"Has electricity",null,-0.15891632820980603,null,null,"Has cement floor",null,-0.13310720413725263]
[null,null,"Has covered adobe wall",null,-6.7579416237319653E-2,null,null,"Household has separate room used as kitchen",null,-0.13623673635041428,null,null,"1-3 chickens",null,-0.12028534836846182]
[null,null,"Has thatch roof",null,-6.311232066417391E-2,null,null,"Goats",null,0.12653117531852648,null,null,"Has bricks wall",null,0.11657837129134536]
[null,null,"Has cement floor",null,-6.2355431144746717E-2,null,null,"Has radio",null,-0.11835271842067145,null,null,"1 pig",null,0.11280743489608416]
[null,null,"Other",null,-5.1544282066788953E-2,null,null,"Household fuel type: agricultural crop",null,0.11285355210553537,null,null,"5-5 cattle",null,0.10565039312361585]
[null,null,"Household fuel type: charcoal",null,-4.9065125708581125E-2,null,null,"Other",null,9.7019258705267467E-2,null,null,"Has ceramic tiles roof",null,-0.10460291627024727]
[null,null,"Has bricks wall",null,4.1008722563559925E-2,null,null,"5-9 goats",null,9.6911533247714662E-2,null,null,"Has cement blocks wall",null,-9.9407914146836834E-2]
[null,null,"Household fuel type: animal dung",null,-3.3790077056010087E-2,null,null,"1-3 chickens",null,8.8105718425295881E-2,null,null,"Has cement wall",null,8.4216479449047282E-2]
[null,null,"Tractor",null,-2.9582116036175922E-2,null,null,"5-5 cattle",null,7.9794671776207138E-2,null,null,"Has calamine cement fiber roof",null,8.2111957957815743E-2]
[null,null,"Has cement roof",null,-2.6340202452299219E-2,null,null,"Has ceramic tiles roof",null,7.7834758112068053E-2,null,null,"Has thatch roof",null,-7.4380316664572094E-2]
[null,null,"Household fuel type: biogas",null,2.1209135336251333E-2,null,null,"Small land",null,7.6431241437569492E-2,null,null,"5-9 goats",null,7.4355242914771802E-2]
[null,null,"Household fuel type: coal/lignite",null,-2.0131612845877462E-2,null,null,"10+ more goats",null,6.9521648643787279E-2,null,null,"Big land",null,-7.2912058363780508E-2]
[null,null,"Has metal roof",null,-1.8924196636604627E-2,null,null,"Has motorcycle/scooter",null,6.8429771549067472E-2,null,null,"Medium land",null,-6.8806513290065707E-2]
[null,null,"Has motorcycle/scooter",null,-1.8916342972666207E-2,null,null,"Has bicycle",null,-6.5833409275170354E-2,null,null,"Household fuel type: electricity",null,-5.9593296751676031E-2]
[null,null,"Has vynil floor",null,1.8680641823420188E-2,null,null,"4+ pigs",null,6.5505016285734921E-2,null,null,"Has cement roof",null,-5.7363591934024974E-2]
[null,null,"Number of members per sleeping room",null,1.053086427657582E-2,null,null,"Household fuel type: electricity",null,-6.3764842371238376E-2,null,null,"Has clay tiles roof",null,5.2417182956010076E-2]
[null,null,"Has wood roof",null,-7.0036415385568516E-3,null,null,"Household fuel type: animal dung",null,6.0789850377452014E-2,null,null,"Has covered adobe wall",null,-4.63839819504284E-2]
[null,null,"Stove has chimney or hood",null,3.4695636253090985E-3,null,null,"Number of members per sleeping room",null,-5.4382175326086316E-2,null,null,"Has vynil floor",null,4.3480416149794809E-2]
[null,null,null,null,null,null,null,"Has thatch roof",null,5.2183115368301773E-2,null,null,"Has wood floor",null,-4.1345540715783398E-2]
[null,null,null,null,null,null,null,"Has covered adobe wall",null,5.1567288314437867E-2,null,null,"Household fuel type: charcoal",null,-3.8670831141796695E-2]
[null,null,null,null,null,null,null,"Has wood roof",null,4.913614782516218E-2,null,null,"Household cooks in other house",null,3.801085000289265E-2]
[null,null,"Communalities",null,null,null,null,"Has cement floor",null,-4.459482507171314E-2,null,null,"Household fuel type: biogas",null,3.4343516048826461E-2]
[null,null,null,null,"Extraction",null,null,"Has stone wall",null,3.7675558933113432E-2,null,null,"Number of members per sleeping room",null,-3.2639965754406329E-2]
[null,null,"Number of members per sleeping room",null,1.1089910241166077E-4,null,null,"Tractor",null,3.1427411209192124E-2,null,null,"Household fuel type: animal dung",null,-2.7118289559734141E-2]
[null,null,"Has electricity",null,2.9203710533925089E-2,null,null,"Has cement roof",null,3.1398894537138636E-2,null,null,"6+ milk cows or bulls",null,2.0806880636490967E-2]
[null,null,"Has radio",null,1.8416083692226679E-2,null,null,"Has vynil floor",null,-1.259024547752248E-2,null,null,"Household fuel type: coal/lignite",null,-1.9320331453344997E-2]
[null,null,"Has television",null,0.37042849181508447,null,null,"Has metal roof",null,-1.1143078083103828E-2,null,null,"Stove has chimney or hood",null,1.7692386906170109E-2]
[null,null,"Has refrigerator",null,0.3372503599623819,null,null,"Has bricks wall",null,1.0809495072421568E-2,null,null,"Has metal roof",null,1.1089015981537007E-2]
[null,null,"Has bicycle",null,2.6091839352908288E-2,null,null,"Has parquet/polished wood floor",null,-7.0060153228881763E-3,null,null,"Has carpet floor",null,-8.7343688860518093E-3]
[null,null,"Has motorcycle/scooter",null,3.5782803145953818E-4,null,null,"Stove has chimney or hood",null,-2.0799813964247761E-3,null,null,"Cows / bulls",null,6.5322402122583315E-3]
[null,null,"Has car/truck",null,0.13330191362075589,null,null,"Household fuel type: biogas",null,-1.8599684344938019E-3,null,null,"Animal-drawn cart",null,-4.9041196866383731E-3]
[null,null,"Has telephone",null,0.39131010521285453,null,null,null,null,null,null,null,"1-4 goats",null,-3.2910545716000853E-3]
[null,null,"Black-white TV",null,9.4614451594980969E-2,null,null,null,null,null,null,null,"3-5 milk cows or bulls",null,-3.0058943057572336E-3]
[null,null,"VCR/DVD",null,0.23343870678196779,null,null,null,null,null,null,null,"1-2 milk cows or bulls",null,-2.8932438795728267E-3]
[null,null,"Mobile telephone",null,0.36393412212699727,null,null,"Communalities",null,null,null,null,"Has wood roof",null,-2.2683478251347743E-3]
[null,null,"Sofa",null,4.910457162862468E-2,null,null,null,null,"Extraction"]
[null,null,"Armoire",null,4.5721405340022225E-2,null,null,"Number of members per sleeping room",null,2.9574209931971913E-3]
[null,null,"Washing machine",null,0.32246772213017449,null,null,"Has electricity",null,2.5254399371686793E-2]
[null,null,"Water heat",null,0.25004215695475146,null,null,"Has radio",null,1.4007365957562743E-2,null,null,"Communalities"]
[null,null,"Bathtub/shower",null,0.57842388412679724,null,null,"Has television",null,0.2074956271879578,null,null,null,null,"Extraction"]
[null,null,"Vacuum cleaner",null,0.51508105221374567,null,null,"Has refrigerator",null,0.19536184947097032,null,null,"Number of members per sleeping room",null,1.0653673644488179E-3]
[null,null,"Microwave",null,0.10169686294710117,null,null,"Has bicycle",null,4.3340377767920862E-3,null,null,"Has electricity",null,5.4907721574945528E-2]
[null,null,"Computer",null,0.14940019982806824,null,null,"Has motorcycle/scooter",null,4.6826336342575643E-3,null,null,"Has radio",null,0.11453898898356955]
[null,null,"Stove has chimney or hood",null,1.2037871750068015E-5,null,null,"Has car/truck",null,5.2604332144281035E-2,null,null,"Has television",null,0.44661287290529406]
[null,null,"Household has separate room used as kitchen",null,3.5148567901025489E-2,null,null,"Has telephone",null,0.22166962942103732,null,null,"Has refrigerator",null,0.37128346735188461]
[null,null,"Watch",null,0.15240581277267243,null,null,"Black-white TV",null,5.0085141652645541E-2,null,null,"Has bicycle",null,0.21002963911319039]
[null,null,"Animal-drawn cart",null,7.9880166675991265E-2,null,null,"VCR/DVD",null,0.14463505708550939,null,null,"Has motorcycle/scooter",null,6.8202377839747072E-2]
[null,null,"Tractor",null,8.7510158917777664E-4,null,null,"Mobile telephone",null,0.22760118886606612,null,null,"Has car/truck",null,0.28276054937538964]
[null,null,"Cattle",null,0.10229392589011964,null,null,"Sofa",null,2.9968282164156354E-2,null,null,"Has telephone",null,0.3928553017750207]
[null,null,"Cows / bulls",null,7.9012057247784803E-2,null,null,"Armoire",null,3.3510885956387897E-2,null,null,"Black-white TV",null,4.0584753934252628E-2]
[null,null,"Goats",null,1.2916591115230592E-2,null,null,"Washing machine",null,0.17222238593818381,null,null,"VCR/DVD",null,0.30313367793426049]
[null,null,"Fowl (Chickens)",null,7.6574271597793939E-2,null,null,"Water heat",null,0.16051531748959813,null,null,"Mobile telephone",null,0.27729590667820525]
[null,null,"Pigs",null,3.5964001791279301E-2,null,null,"Bathtub/shower",null,0.48915232891238258,null,null,"Sofa",null,8.121559213850113E-2]
[null,null,"Other",null,2.6568130137807015E-3,null,null,"Vacuum cleaner",null,0.3296889966823538,null,null,"Armoire",null,8.4415628462693904E-2]
[null,null,"Bank account",null,0.12104761736079545,null,null,"Microwave",null,7.2116974169276482E-2,null,null,"Washing machine",null,0.41400687494361893]
[null,null,"Has earth/sand floor",null,0.1030643440335343,null,null,"Computer",null,0.10840974952365837,null,null,"Water heat",null,0.1671344169775259]
[null,null,"Has wood floor",null,5.7738390018031049E-2,null,null,"Stove has chimney or hood",null,4.3263226094731616E-6,null,null,"Bathtub/shower",null,0.31296088416964202]
[null,null,"Has parquet/polished wood floor",null,7.227101680630987E-3,null,null,"Household has separate room used as kitchen",null,1.856044833141229E-2,null,null,"Vacuum cleaner",null,0.38840472353703459]
[null,null,"Has ceramic tile floor",null,0.13929256910105395,null,null,"Watch",null,8.5174437427602598E-2,null,null,"Microwave",null,0.14244060514256654]
[null,null,"Has cement floor",null,3.8881997932472489E-3,null,null,"Animal-drawn cart",null,3.1086272113908048E-2,null,null,"Computer",null,6.9217639700238309E-2]
[null,null,"Has carpet floor",null,2.2436223453680914E-2,null,null,"Tractor",null,9.8768217531165488E-4,null,null,"Stove has chimney or hood",null,3.1302055443761952E-4]
[null,null,"Has vynil floor",null,3.4896637893491549E-4,null,null,"Cattle",null,8.0973221506395354E-2,null,null,"Household has separate room used as kitchen",null,5.9904924358133889E-2]
[null,null,"Has cement wall",null,0.25532814401664239,null,null,"Cows / bulls",null,3.7931725148168477E-2,null,null,"Watch",null,0.2035051387674241]
[null,null,"Has stone wall",null,3.4292595109912782E-2,null,null,"Goats",null,1.6010138327487683E-2,null,null,"Animal-drawn cart",null,2.4050389900874054E-5]
[null,null,"Has bricks wall",null,1.6817153262950288E-3,null,null,"Fowl (Chickens)",null,0.16122786132839428,null,null,"Tractor",null,4.8654340148269137E-2]
[null,null,"Has cement blocks wall",null,6.0982078459740512E-2,null,null,"Pigs",null,4.5950626928192455E-2,null,null,"Cattle",null,5.2452899181975647E-2]
[null,null,"Has covered adobe wall",null,4.566977498976903E-3,null,null,"Other",null,9.4127365597196175E-3,null,null,"Cows / bulls",null,4.2670162190644775E-5]
[null,null,"Has planks wall",null,0.26912061529877845,null,null,"Bank account",null,7.0730058429184395E-2,null,null,"Goats",null,2.244565944586142E-2]
[null,null,"Has metal roof",null,3.5812521834087787E-4,null,null,"Has earth/sand floor",null,5.4320055973506462E-2,null,null,"Fowl (Chickens)",null,0.22789425060212246]
[null,null,"Has wood roof",null,4.9050994800598986E-5,null,null,"Has wood floor",null,0.10078770537272103,null,null,"Pigs",null,0.14111601942550225]
[null,null,"Has calamine cement fiber roof",null,0.30139956696155495,null,null,"Has parquet/polished wood floor",null,4.9084250704543916E-5,null,null,"Other",null,4.0629324399521001E-2]
[null,null,"Has ceramic tiles roof",null,8.1542821385163951E-3,null,null,"Has ceramic tile floor",null,0.10595508617957057,null,null,"Bank account",null,6.3749044939505395E-2]
[null,null,"Has clay tiles roof",null,0.40594416659376986,null,null,"Has cement floor",null,1.9886984231766948E-3,null,null,"Has earth/sand floor",null,0.11539087745781605]
[null,null,"Has cement roof",null,6.9380626522810981E-4,null,null,"Has carpet floor",null,3.4255121860309871E-2,null,null,"Has wood floor",null,1.7094537370805026E-3]
[null,null,"Has thatch roof",null,3.9831650196175128E-3,null,null,"Has vynil floor",null,1.5851428118427525E-4,null,null,"Has parquet/polished wood floor",null,2.6215382560149936E-2]
[null,null,"Household fuel type: electricity",null,7.7345107186015966E-3,null,null,"Has cement wall",null,0.24458284734132305,null,null,"Has ceramic tile floor",null,2.6565890516784322E-2]
[null,null,"Household fuel type: LPG, natural gas",null,0.10794434715323878,null,null,"Has stone wall",null,1.4194477409225034E-3,null,null,"Has cement floor",null,1.7717527793236244E-2]
[null,null,"Household fuel type: natural gas",null,0.43407228792257113,null,null,"Has bricks wall",null,1.1684518372070615E-4,null,null,"Has carpet floor",null,7.6289199837629925E-5]
[null,null,"Household fuel type: biogas",null,4.4982742171142492E-4,null,null,"Has cement blocks wall",null,5.3534464430192864E-2,null,null,"Has vynil floor",null,1.8905465885593372E-3]
[null,null,"Household fuel type: coal/lignite",null,4.0528183577629844E-4,null,null,"Has covered adobe wall",null,2.6591852241043602E-3,null,null,"Has cement wall",null,7.0924154107918028E-3]
[null,null,"Household fuel type: charcoal",null,2.4073865607988684E-3,null,null,"Has planks wall",null,0.26198241527173,null,null,"Has stone wall",null,7.324598095554416E-2]
[null,null,"Household fuel type: wood, straw",null,0.19758093868093587,null,null,"Has metal roof",null,1.2416818916614889E-4,null,null,"Has bricks wall",null,1.3590516652942777E-2]
[null,null,"Household fuel type: grass, straw",null,5.7773027874832072E-2,null,null,"Has wood roof",null,2.4143610230961902E-3,null,null,"Has cement blocks wall",null,9.8819333950248833E-3]
[null,null,"Household fuel type: agricultural crop",null,6.0702269425678808E-2,null,null,"Has calamine cement fiber roof",null,0.38482681286866222,null,null,"Has covered adobe wall",null,2.1514737815776677E-3]
[null,null,"Household fuel type: animal dung",null,1.1417693074510992E-3,null,null,"Has ceramic tiles roof",null,6.0582495703641439E-3,null,null,"Has planks wall",null,6.3962312232690444E-2]
[null,null,"Household cooks at open sky",null,0.31536778694782852,null,null,"Has clay tiles roof",null,0.42093041727584274,null,null,"Has metal roof",null,1.2296627543878315E-4]
[null,null,"Household cooks on open owen",null,1.6600286861075557E-2,null,null,"Has cement roof",null,9.8589057815435437E-4,null,null,"Has wood roof",null,5.1454018557936609E-6]
[null,null,"Household cooks in owm house",null,0.36566543699839077,null,null,"Has thatch roof",null,2.7230775295414926E-3,null,null,"Has calamine cement fiber roof",null,6.7423736396660999E-3]
[null,null,"Household cooks in other house",null,0.1564802286889897,null,null,"Household fuel type: electricity",null,4.0659551226288771E-3,null,null,"Has ceramic tiles roof",null,1.0941770092240361E-2]
[null,null,"Household cooks outside house",null,0.19516817354086055,null,null,"Household fuel type: LPG, natural gas",null,0.18594748001245476,null,null,"Has clay tiles roof",null,2.7475610690438331E-3]
[null,null,null,null,null,null,null,"Household fuel type: natural gas",null,0.21352593120174895,null,null,"Has cement roof",null,3.290581679573335E-3]
[null,null,null,null,null,null,null,"Household fuel type: biogas",null,3.4594825773133241E-6,null,null,"Has thatch roof",null,5.5324315071220214E-3]
[null,null,"Total Variance Explained",null,null,null,null,"Household fuel type: wood, straw",null,0.10103369112492668,null,null,"Household fuel type: electricity",null,3.5513610177333212E-3]
[null,null,"Component",null,"Extraction Sums of Squared Loadings",null,null,"Household fuel type: grass, straw",null,2.8444889377354239E-2,null,null,"Household fuel type: LPG, natural gas",null,0.1251015363830566]
[null,null,null,null,"Total","% of Variance","Cumulative %","Household fuel type: agricultural crop",null,1.2735924222836786E-2,null,null,"Household fuel type: natural gas",null,7.2436364342936113E-2]
[null,null,"1",null,8.3092269751246697,12.401831306156224,12.401831306156224,"Household fuel type: animal dung",null,3.6954059089130027E-3,null,null,"Household fuel type: biogas",null,1.1794770945960007E-3]
[null,null,null,null,null,null,null,"Household cooks at open sky",null,0.11995616833973989,null,null,"Household fuel type: coal/lignite",null,3.7327520746711196E-4]
[null,null,null,null,null,null,null,"Household cooks on open owen",null,2.6743224740266577E-2,null,null,"Household fuel type: charcoal",null,1.4954331811973531E-3]
[null,null,"Component Score Coefficient Matrix",null,null,null,null,"Household cooks in owm house",null,0.27271430387854179,null,null,"Household fuel type: wood, straw",null,0.20749533705630199]
[null,null,null,null,"Component",null,null,"Household cooks in other house",null,0.19257036211035819,null,null,"Household fuel type: grass, straw",null,5.7502818456963645E-2]
[null,null,null,null,"1",null,null,"Household cooks outside house",null,0.10011036602465256,null,null,"Household fuel type: agricultural crop",null,5.8385859609066684E-2]
[null,null,"Number of members per sleeping room",null,1.2673699139645678E-3,null,null,"Small land",null,5.8417346676880397E-3,null,null,"Household fuel type: animal dung",null,7.3540162864558568E-4]
[null,null,"Has electricity",null,2.0566405539497117E-2,null,null,"Medium land",null,0.11849807606680642,null,null,"Household cooks at open sky",null,0.3462374695639569]
[null,null,"Has radio",null,1.6331949096469674E-2,null,null,"Big land",null,2.6977273411036035E-2,null,null,"Household cooks on open owen",null,1.9595277076779286E-2]
[null,null,"Has television",null,7.3247291359173114E-2,null,null,"1-2 cattle",null,8.0999874581833123E-2,null,null,"Household cooks in owm house",null,7.4374401185334477E-2]
[null,null,"Has refrigerator",null,6.9890088210243714E-2,null,null,"5-5 cattle",null,6.3671896438726276E-3,null,null,"Household cooks in other house",null,1.4448247179424042E-3]
[null,null,"Has bicycle",null,1.943979700571111E-2,null,null,"1-2 milk cows or bulls",null,4.0833162260672518E-2,null,null,"Household cooks outside house",null,0.20270133494460521]
[null,null,"Has motorcycle/scooter",null,-2.2765466666509475E-3,null,null,"1-4 goats",null,3.5844228599582389E-2,null,null,"Small land",null,3.2579781101835306E-2]
[null,null,"Has car/truck",null,4.393974878949912E-2,null,null,"5-9 goats",null,9.3918452764229048E-3,null,null,"Medium land",null,4.7343362711359891E-3]
[null,null,"Has telephone",null,7.528351866382893E-2,null,null,"10+ more goats",null,4.8332596301502093E-3,null,null,"Big land",null,5.3161682548433353E-3]
[null,null,"Black-white TV",null,-3.7018440235457264E-2,null,null,"1-3 chickens",null,7.7626176192375218E-3,null,null,"1-2 cattle",null,3.1383324261803278E-2]
[null,null,"VCR/DVD",null,5.8146799041147536E-2,null,null,"4-9 chickens",null,5.0675922606898301E-2,null,null,"5-5 cattle",null,1.1162005567174576E-2]
[null,null,"Mobile telephone",null,7.2602364665192404E-2,null,null,"10+ chickens",null,0.21476742451616621,null,null,"1-2 milk cows or bulls",null,8.3708601466856205E-6]
[null,null,"Sofa",null,2.6668607587741595E-2,null,null,"1 pig",null,3.4230184566803636E-2,null,null,"3-5 milk cows or bulls",null,9.0354005773837608E-6]
[null,null,"Armoire",null,2.5733518054327609E-2,null,null,"2-3 pigs",null,2.6482899431941546E-2,null,null,"6+ milk cows or bulls",null,4.3292628182118275E-4]
[null,null,"Washing machine",null,6.8341184623932905E-2,null,null,"4+ pigs",null,4.2909071585943972E-3,null,null,"1-4 goats",null,1.0831040193249821E-5]
[null,null,"Water heat",null,6.0179142617558579E-2,null,null,null,null,null,null,null,"5-9 goats",null,5.5287021489147225E-3]
[null,null,"Bathtub/shower",null,9.15297943068418E-2,null,null,null,null,null,null,null,"10+ more goats",null,1.9691826643598798E-2]
[null,null,"Vacuum cleaner",null,8.6372833044562281E-2,null,null,"Total Variance Explained",null,null,null,null,"1-3 chickens",null,1.4468565032122219E-2]
[null,null,"Microwave",null,3.8378955926175448E-2,null,null,"Component",null,"Extraction Sums of Squared Loadings",null,null,"4-9 chickens",null,6.2946482062543996E-2]
[null,null,"Computer",null,4.651735010407531E-2,null,null,null,null,"Total","% of Variance","Cumulative %","10+ chickens",null,0.16329781078220956]
[null,null,"Stove has chimney or hood",null,4.1755552420170126E-4,null,null,"1",null,6.7135393491490474,8.3919241864363094,8.3919241864363094,"1 pig",null,1.2725517367834267E-2]
[null,null,"Household has separate room used as kitchen",null,2.2562810456950709E-2,null,null,null,null,null,null,null,"2-3 pigs",null,7.6097202083953472E-2]
[null,null,"Watch",null,4.6982934989105406E-2,null,null,null,null,null,null,null,"4+ pigs",null,4.3379983525543071E-2]
[null,null,"Animal-drawn cart",null,-3.4014090184626228E-2,null,null,"Component Score Coefficient Matrix"]
[null,null,"Tractor",null,-3.5601526020092949E-3,null,null,null,null,"Component"]
[null,null,"Cattle",null,-3.8491452600423699E-2,null,null,null,null,"1",null,null,"Total Variance Explained"]
[null,null,"Cows / bulls",null,-3.382875872274467E-2,null,null,"Number of members per sleeping room",null,-8.1003733646067555E-3,null,null,"Component",null,"Extraction Sums of Squared Loadings"]
[null,null,"Goats",null,-1.3677708179027503E-2,null,null,"Has electricity",null,-2.367102059660214E-2,null,null,null,null,"Total","% of Variance","Cumulative %"]
[null,null,"Fowl (Chickens)",null,-3.3302805030944252E-2,null,null,"Has radio",null,-1.7628960264554471E-2,null,null,"1",null,7.1290548023766851,8.4869700028293877,8.4869700028293877]
[null,null,"Pigs",null,-2.2823034301731934E-2,null,null,"Has television",null,-6.7850481758907982E-2]
[null,null,"Other",null,-6.2032584043133065E-3,null,null,"Has refrigerator",null,-6.5836743375039947E-2]
[null,null,"Bank account",null,4.187140176472947E-2,null,null,"Has bicycle",null,-9.8060658992808088E-3,null,null,"Component Score Coefficient Matrix"]
[null,null,"Has earth/sand floor",null,-3.8636128285440004E-2,null,null,"Has motorcycle/scooter",null,1.019280114262547E-2,null,null,null,null,"Component"]
[null,null,"Has wood floor",null,-2.8918230334709898E-2,null,null,"Has car/truck",null,-3.416325297647322E-2,null,null,null,null,"1"]
[null,null,"Has parquet/polished wood floor",null,1.0231079519529005E-2,null,null,"Has telephone",null,-7.0129631824438876E-2,null,null,"Number of members per sleeping room",null,-4.5784422562616311E-3]
[null,null,"Has ceramic tile floor",null,4.4916235678745475E-2,null,null,"Black-white TV",null,3.3335188438702791E-2,null,null,"Has electricity",null,3.2868868823836918E-2]
[null,null,"Has cement floor",null,-7.5043600724134917E-3,null,null,"VCR/DVD",null,-5.6648086813418354E-2,null,null,"Has radio",null,4.7472785985073526E-2]
[null,null,"Has carpet floor",null,-1.8026618011589692E-2,null,null,"Mobile telephone",null,-7.1061721524036392E-2,null,null,"Has television",null,9.3741881311270245E-2]
[null,null,"Has vynil floor",null,2.248180472063697E-3,null,null,"Sofa",null,-2.5785727324233142E-2,null,null,"Has refrigerator",null,8.5471406836044705E-2]
[null,null,"Has cement wall",null,6.0811920887801636E-2,null,null,"Armoire",null,-2.7267254782917933E-2,null,null,"Has bicycle",null,6.4284806328821636E-2]
[null,null,"Has stone wall",null,2.2286381142997393E-2,null,null,"Washing machine",null,-6.1814912959225143E-2,null,null,"Has motorcycle/scooter",null,3.6632605156402404E-2]
[null,null,"Has bricks wall",null,4.9353234285605292E-3,null,null,"Water heat",null,-5.967696146591514E-2,null,null,"Has car/truck",null,7.4589458648199658E-2]
[null,null,"Has cement blocks wall",null,-2.9719430902645245E-2,null,null,"Bathtub/shower",null,-0.10417668269907698,null,null,"Has telephone",null,8.7919327207566386E-2]
[null,null,"Has covered adobe wall",null,-8.1330569545918184E-3,null,null,"Vacuum cleaner",null,-8.5526497625446465E-2,null,null,"Black-white TV",null,-2.8258526039054207E-2]
[null,null,"Has planks wall",null,-6.2432806971261794E-2,null,null,"Microwave",null,-4.0000664831256055E-2,null,null,"VCR/DVD",null,7.722984108532932E-2]
[null,null,"Has metal roof",null,-2.2774918404874465E-3,null,null,"Computer",null,-4.9043632760795111E-2,null,null,"Mobile telephone",null,7.3865182664526977E-2]
[null,null,"Has wood roof",null,-8.4287522287255481E-4,null,null,"Stove has chimney or hood",null,-3.0981890300358739E-4,null,null,"Sofa",null,3.9974933901036749E-2]
[null,null,"Has calamine cement fiber roof",null,-6.6070971043009172E-2,null,null,"Household has separate room used as kitchen",null,-2.0292833521215976E-2,null,null,"Armoire",null,4.0754866588810709E-2]
[null,null,"Has ceramic tiles roof",null,-1.0867564955677539E-2,null,null,"Watch",null,-4.3471347073224156E-2,null,null,"Washing machine",null,9.0255114868913647E-2]
[null,null,"Has clay tiles roof",null,7.6678309603728109E-2,null,null,"Animal-drawn cart",null,2.6262301532731187E-2,null,null,"Water heat",null,5.7345717659707501E-2]
[null,null,"Has cement roof",null,-3.1699943365554786E-3,null,null,"Tractor",null,4.6811986308199121E-3,null,null,"Bathtub/shower",null,7.8471702818501229E-2]
[null,null,"Has thatch roof",null,-7.5954503172332676E-3,null,null,"Cattle",null,4.238568148773738E-2,null,null,"Vacuum cleaner",null,8.7419898561300627E-2]
[null,null,"Household fuel type: electricity",null,1.0584145476428879E-2,null,null,"Cows / bulls",null,2.9010135598563788E-2,null,null,"Microwave",null,5.294012370727149E-2]
[null,null,"Household fuel type: LPG, natural gas",null,-3.954024260811187E-2,null,null,"Goats",null,1.8847163729600321E-2,null,null,"Computer",null,3.6904254765245691E-2]
[null,null,"Household fuel type: natural gas",null,7.9290363327362529E-2,null,null,"Fowl (Chickens)",null,5.980927084907544E-2,null,null,"Stove has chimney or hood",null,2.4817296817906094E-3]
[null,null,"Household fuel type: biogas",null,2.5524799598982085E-3,null,null,"Pigs",null,3.1929651749682181E-2,null,null,"Household has separate room used as kitchen",null,3.4332016204027031E-2]
[null,null,"Household fuel type: coal/lignite",null,-2.4228021338381371E-3,null,null,"Other",null,1.4451283244145255E-2,null,null,"Watch",null,6.3278436049433284E-2]
[null,null,"Household fuel type: charcoal",null,-5.9048965512035435E-3,null,null,"Bank account",null,-3.9614161673491417E-2,null,null,"Animal-drawn cart",null,-6.8790601595648229E-4]
[null,null,"Household fuel type: wood, straw",null,-5.3494840855743367E-2,null,null,"Has earth/sand floor",null,3.471591094813016E-2,null,null,"Tractor",null,3.0940607765371671E-2]
[null,null,"Household fuel type: grass, straw",null,-2.8926903206768079E-2,null,null,"Has wood floor",null,4.7288140876026667E-2,null,null,"Cattle",null,3.212571450519483E-2]
[null,null,"Household fuel type: agricultural crop",null,-2.9651170469524254E-2,null,null,"Has parquet/polished wood floor",null,-1.0435650941371484E-3,null,null,"Cows / bulls",null,9.1628419100953074E-4]
[null,null,"Household fuel type: animal dung",null,-4.0665728782192882E-3,null,null,"Has ceramic tile floor",null,-4.8485219469779878E-2,null,null,"Goats",null,2.101523406312044E-2]
[null,null,"Household cooks at open sky",null,-6.7584645932584078E-2,null,null,"Has cement floor",null,-6.642520845188106E-3,null,null,"Fowl (Chickens)",null,6.6962973629960981E-2]
[null,null,"Household cooks on open owen",null,-1.5505906973660655E-2,null,null,"Has carpet floor",null,2.7568378302871881E-2,null,null,"Pigs",null,5.2693398000138392E-2]
[null,null,"Household cooks in owm house",null,7.2774852497187223E-2,null,null,"Has vynil floor",null,-1.8753514089581249E-3,null,null,"Other",null,2.8274038638297472E-2]
[null,null,"Household cooks in other house",null,-4.7606813524907872E-2,null,null,"Has cement wall",null,-7.3665045182212938E-2,null,null,"Bank account",null,3.5416438665360005E-2]
[null,null,"Household cooks outside house",null,-5.3167210697097136E-2,null,null,"Has stone wall",null,5.6118772786948618E-3,null,null,"Has earth/sand floor",null,-4.7648999349429372E-2]
[null,null,null,null,null,null,null,"Has bricks wall",null,1.6101037783880256E-3,null,null,"Has wood floor",null,-5.7995823937276531E-3]
[null,null,null,null,null,null,null,"Has cement blocks wall",null,3.4463961177475695E-2,null,null,"Has parquet/polished wood floor",null,2.2711517159737616E-2]
[null,null,"Component Score Covariance Matrix",null,null,null,null,"Has covered adobe wall",null,7.6810882654577885E-3,null,null,"Has ceramic tile floor",null,2.2862843104319595E-2]
[null,null,"Component",null,"1",null,null,"Has planks wall",null,7.6240288686875116E-2,null,null,"Has cement floor",null,-1.8671087237662604E-2]
[null,null,"1",null,0.99999999999999989,null,null,"Has metal roof",null,-1.6597918778142311E-3,null,null,"Has carpet floor",null,-1.2251790915031183E-3]
[null,null,null,null,null,null,null,"Has wood roof",null,7.3189632576429698E-3,null,null,"Has vynil floor",null,6.0990436116859842E-3]
[null,null,null,null,null,null,null,"Has calamine cement fiber roof",null,9.2401947195340312E-2,null,null,"Has cement wall",null,1.1813133968470993E-2]
[null,null,null,null,null,null,null,"Has ceramic tiles roof",null,1.1593699547159686E-2,null,null,"Has stone wall",null,3.7962949448771231E-2]
[null,null,null,null,null,null,null,"Has clay tiles roof",null,-9.6639264552090057E-2,null,null,"Has bricks wall",null,1.6352570505206446E-2]
[null,null,null,null,null,null,null,"Has cement roof",null,4.6769509947265746E-3,null,null,"Has cement blocks wall",null,-1.3944052458917304E-2]
[null,null,null,null,null,null,null,"Has thatch roof",null,7.7728173850527991E-3,null,null,"Has covered adobe wall",null,-6.5063298342109676E-3]
[null,null,null,null,null,null,null,"Household fuel type: electricity",null,-9.4979472160717539E-3,null,null,"Has planks wall",null,-3.5475630622129835E-2]
[null,null,null,null,null,null,null,"Household fuel type: LPG, natural gas",null,6.4230841204528169E-2,null,null,"Has metal roof",null,1.5554679110953318E-3]
[null,null,null,null,null,null,null,"Household fuel type: natural gas",null,-6.8829366686125645E-2,null,null,"Has wood roof",null,-3.181835303578466E-4]
[null,null,null,null,null,null,null,"Household fuel type: biogas",null,-2.7704737214797974E-4,null,null,"Has calamine cement fiber roof",null,1.1517930529926806E-2]
[null,null,null,null,null,null,null,"Household fuel type: wood, straw",null,4.7345812196263284E-2,null,null,"Has ceramic tiles roof",null,-1.4672760859598769E-2]
[null,null,null,null,null,null,null,"Household fuel type: grass, straw",null,2.5121790285231017E-2,null,null,"Has clay tiles roof",null,7.3526132718933828E-3]
[null,null,null,null,null,null,null,"Household fuel type: agricultural crop",null,1.6809844440673419E-2,null,null,"Has cement roof",null,-8.0464512511393641E-3]
[null,null,null,null,null,null,null,"Household fuel type: animal dung",null,9.0548140430810505E-3,null,null,"Has thatch roof",null,-1.0433405090359969E-2]
[null,null,null,null,null,null,null,"Household cooks at open sky",null,5.1589314096645626E-2,null,null,"Household fuel type: electricity",null,-8.3592142862766051E-3]
[null,null,null,null,null,null,null,"Household cooks on open owen",null,2.435876963670789E-2,null,null,"Household fuel type: LPG, natural gas",null,4.9613443209488475E-2]
[null,null,null,null,null,null,null,"Household cooks in owm house",null,-7.7786175641964397E-2,null,null,"Household fuel type: natural gas",null,3.775255674524125E-2]
[null,null,null,null,null,null,null,"Household cooks in other house",null,6.5364686834803482E-2,null,null,"Household fuel type: biogas",null,4.8174010441576374E-3]
[null,null,null,null,null,null,null,"Household cooks outside house",null,4.7128974069737171E-2,null,null,"Household fuel type: coal/lignite",null,-2.7100831721624556E-3]
[null,null,null,null,null,null,null,"Small land",null,1.1384641909823211E-2,null,null,"Household fuel type: charcoal",null,-5.424398074328817E-3]
[null,null,null,null,null,null,null,"Medium land",null,5.1274816034954193E-2,null,null,"Household fuel type: wood, straw",null,-6.3895786090879286E-2]
[null,null,null,null,null,null,null,"Big land",null,2.446512775797623E-2,null,null,"Household fuel type: grass, straw",null,-3.3636640428504054E-2]
[null,null,null,null,null,null,null,"1-2 cattle",null,4.239265673089164E-2,null,null,"Household fuel type: agricultural crop",null,-3.3893926715661278E-2]
[null,null,null,null,null,null,null,"5-5 cattle",null,1.1885634033905119E-2,null,null,"Household fuel type: animal dung",null,-3.8039109407173363E-3]
[null,null,null,null,null,null,null,"1-2 milk cows or bulls",null,3.009920109375408E-2,null,null,"Household cooks at open sky",null,-8.2538216308872384E-2]
[null,null,null,null,null,null,null,"1-4 goats",null,2.8200582594028509E-2,null,null,"Household cooks on open owen",null,-1.9635580772103558E-2]
[null,null,null,null,null,null,null,"5-9 goats",null,1.44352372433772E-2,null,null,"Household cooks in owm house",null,3.8254258461831003E-2]
[null,null,null,null,null,null,null,"10+ more goats",null,1.0355439214428566E-2,null,null,"Household cooks in other house",null,5.3318218272386669E-3]
[null,null,null,null,null,null,null,"1-3 chickens",null,1.3123587104090397E-2,null,null,"Household cooks outside house",null,-6.3153343942162765E-2]
[null,null,null,null,null,null,null,"4-9 chickens",null,3.3531215235202728E-2,null,null,"Small land",null,2.5318742261354065E-2]
[null,null,null,null,null,null,null,"10+ chickens",null,6.9029172276961329E-2,null,null,"Medium land",null,-9.6515618405860724E-3]
[null,null,null,null,null,null,null,"1 pig",null,2.7558341761345209E-2,null,null,"Big land",null,-1.0227450957379801E-2]
[null,null,null,null,null,null,null,"2-3 pigs",null,2.4239922497532228E-2,null,null,"1-2 cattle",null,2.4849492227399159E-2]
[null,null,null,null,null,null,null,"4+ pigs",null,9.75715086767724E-3,null,null,"5-5 cattle",null,1.4819691537284031E-2]
[null,null,null,null,null,null,null,null,null,null,null,null,"1-2 milk cows or bulls",null,-4.0583835582359059E-4]
[null,null,null,null,null,null,null,null,null,null,null,null,"3-5 milk cows or bulls",null,-4.216399493457573E-4]
[null,null,null,null,null,null,null,"Component Score Covariance Matrix",null,null,null,null,"6+ milk cows or bulls",null,2.9186029864091334E-3]
[null,null,null,null,null,null,null,"Component",null,"1",null,null,"1-4 goats",null,-4.6163967914833714E-4]
[null,null,null,null,null,null,null,"1",null,1,null,null,"5-9 goats",null,1.0429887969157319E-2]
[null,null,null,null,null,null,null,null,null,null,null,null,"10+ more goats",null,1.9683895406742646E-2]
[null,null,null,null,null,null,null,null,null,null,null,null,"1-3 chickens",null,-1.6872552070768352E-2]
[null,null,null,null,null,null,null,null,null,null,null,null,"4-9 chickens",null,-3.519279651807012E-2]
[null,null,null,null,null,null,null,null,null,null,null,null,"10+ chickens",null,5.6683704850847928E-2]
[null,null,null,null,null,null,null,null,null,null,null,null,"1 pig",null,1.5823617298954751E-2]
[null,null,null,null,null,null,null,null,null,null,null,null,"2-3 pigs",null,3.8694780846013882E-2]
[null,null,null,null,null,null,null,null,null,null,null,null,"4+ pigs",null,2.9215460634978145E-2]
[]
[]
[null,null,null,null,null,null,null,null,null,null,null,null,"Component Score Covariance Matrix"]
[null,null,null,null,null,null,null,null,null,null,null,null,"Component",null,"1"]
[null,null,null,null,null,null,null,null,null,null,null,null,"1",null,1]
[]
[]
[]
[]
[]
[]
[]
[]
[]
[]
[]
[]
[]
[]
[]
[]
[]
[]
[]
[]
[]
[]
[]
[]
[]
[]
[]
[]
[]
[]
[]
[]
[]
[]
[]
[]
[]
[]
[]
[]
[]
[]
[]
[]
[]
[]
[]
[]
[]
[]
[]
[]
[]
[]
[]
[]
[]
[]
[]
[]
[]
[]
[]
[]
[]
[]
[]
[]
[]
[]
[]
[]
[]
[]
[]
[]
[]
[]
[]
[]
[]
[]
[]
[]
[]
[]
[]
[]
[]
[]
[]
[]
[]
[]
[]
[]
[]
[]
[]
[]
[]
[]
[]
[]
[]
[]
[]
[]
[]
[]
[]
[]
[]
[]
[]
[]
[]
[]
[]
[]
[]
[]
[]
[]
[]
[]
[]
[]
[]
[]
[]
[]
[]
[]
[]
[]
[]
[]
[]
[]
[]
[]
[]
[]
[]
[]
[]
[]
[]
[]
[]
[]
[]
[]
[]
[]
[]
[]
[]
[]
[]
[]
[]
[]
[]
[]
[]
[]
[]
[]
[]
[]
[]
[]
[]
[]
[]
[]
[]
[]
[]
[]
[]
[]
[]
[]
[]
[]
[]
[]
[]
[]
[]
[]
[]
[]
[]
[]
[]
[]
[]
[]
[]
[]
[]
[]
[]
[]
[]
[]
[]
[]
[]
[]
[]
[]
[]
[]
[]
[]
[]
[]
[]
[]
[]
[]
[]
[]
[]
[]
[]
[]
[]
[]
[]
[]
[]
[]
[]
[]
[]
[]
[]
[]
[]
[]
[]
[]
[]
[]
[]
[]
[]
[]
[]
[]
[]
[]
[]
[]
[]
[]
[]
[]
[]
[]
[]
[]
[]
[]
[]
[]
[]
[]
[]
[]
[]
[]
[]
[]
[]
[]
[]
[]
[]
[]
[]
[]
[]
[]
[]
[]
[]
[]
[]
[]
[]
[]
[]
[]
[]
[]
[]
[]
[]
[]
[]
[]
[]
[]
[]
[]
[]
[]
[]
[]
[]
[]
[]
[]
[]
[]
[]
[]
[]
[]
[]
[]
[]
[]
[]
[]
[]
[]
[]
[]
[]
[]
[]
[]
[]
[]
[]
[]
[]
[]
[]
[]
[]
["DHS05"]
["Republic of Moldova",null,"Count"]
["W_text_t","Time to improved source based on:",11095]
["W_text_i","",11095]
["S_text_s","",11095]
["S_text_i","",11095]
["Urban/Rural","Urban",6227]
[null,"Rural",4868]
[null,"Missing",0]
["2005"]
[]
["Sub-national region names","Weighted population"]
[{"$f":"R15","v":"Center"},{"$f":"BR122+BR123","v":8804.4988009999906}]
[{"$f":"S15","v":"Chisinau"},{"$f":"BS122+BS123","v":6974.2501160000311}]
[{"$f":"T15","v":"North"},{"$f":"BT122+BT123","v":9937.0308770000065}]
[{"$f":"U15","v":"South"},{"$f":"BU122+BU123","v":6348.8655429999781}]
[{"$f":"V15","v":0},{"$f":"BV122+BV123","v":0}]
[{"$f":"W15","v":0},{"$f":"BW122+BW123","v":0}]
[{"$f":"X15","v":0},{"$f":"BX122+XR123","v":0}]
[{"$f":"Y15","v":0},{"$f":"BY122+BY123","v":0}]
[{"$f":"Z15","v":0},{"$f":"BZ122+BZ123","v":0}]
[{"$f":"AA15","v":0},{"$f":"CA122+CA123","v":0}]
[{"$f":"AB15","v":0},{"$f":"CB122+CB123","v":0}]
[{"$f":"AC15","v":0},{"$f":"CC122+CC123","v":0}]
[{"$f":"AD15","v":0},{"$f":"CD122+CD123","v":0}]
[{"$f":"AE15","v":0},{"$f":"CE122+CE123","v":0}]
[{"$f":"AF15","v":0},{"$f":"CF122+CF123","v":0}]
[{"$f":"AG15","v":0},{"$f":"CG122+CG123","v":0}]
[{"$f":"AH15","v":0},{"$f":"CH122+CH123","v":0}]
[{"$f":"AI15","v":0},{"$f":"CI122+CI123","v":0}]
[{"$f":"AJ15","v":0},{"$f":"CJ122+CJ123","v":0}]
[{"$f":"AK15","v":0},{"$f":"CK122+CK123","v":0}]
[{"$f":"AL15","v":0},{"$f":"CL122+CL123","v":0}]
[{"$f":"AM15","v":0},{"$f":"CM122+CM123","v":0}]
[{"$f":"AN15","v":0},{"$f":"CN122+CN123","v":0}]
[{"$f":"AO15","v":0},{"$f":"CO122+CO123","v":0}]
[{"$f":"AP15","v":0},{"$f":"CP122+CP123","v":0}]
[{"$f":"AQ15","v":0},{"$f":"CQ122+CQ123","v":0}]
[{"$f":"AR15","v":0},{"$f":"CR122+CR123","v":0}]
[{"$f":"AS15","v":0},{"$f":"CS122+CS123","v":0}]
[{"$f":"AT15","v":0},{"$f":"CT122+CT123","v":0}]
[{"$f":"AU15","v":0},{"$f":"CU122+CU123","v":0}]
[{"$f":"AV15","v":0},{"$f":"CV122+CV123","v":0}]
[{"$f":"AW15","v":0},{"$f":"CW122+CW123","v":0}]
[{"$f":"AX15","v":0},{"$f":"CX122+CX123","v":0}]
[{"$f":"AY15","v":0},{"$f":"CY122+CY123","v":0}]
[]
[{"$f":"34-COUNTIF(A1037:A1071,\"0\")","v":4},"Sub-regions"]

{"sheet":"MICS12","index":6,"n_rows":1072,"n_cols":73,"rows_kept":1072,"cut":false,"hidden":false,"merged":[[346,52,347,52],[348,52,349,52],[350,52,351,52],[352,52,353,52],[152,52,165,52],[230,52,235,52],[270,52,272,52],[273,52,275,52],[276,52,283,52],[338,54,338,58],[338,59,338,63],[338,64,338,68],[340,52,341,52],[342,52,343,52],[344,52,345,52],[221,52,223,52],[224,52,225,52],[226,52,229,52],[258,54,258,58],[258,59,258,63],[258,64,258,68],[260,52,262,52],[263,52,266,52],[267,52,269,52],[119,64,119,68],[121,52,122,52],[123,52,126,52],[127,52,128,52],[132,54,132,58],[132,59,132,63],[132,64,132,68],[134,52,138,52],[219,54,219,58],[219,59,219,63],[219,64,219,68],[13,64,13,68],[15,52,16,52],[17,52,20,52],[21,52,22,52],[26,54,26,58],[26,59,26,63],[26,64,26,68],[40,52,41,52],[55,54,55,58],[55,59,55,63],[55,64,55,68],[139,52,142,52],[143,0,146,0],[143,52,146,52],[147,0,149,0],[147,52,149,52],[150,0,151,0],[150,52,151,52],[13,54,13,58],[13,59,13,63],[119,54,119,58],[119,59,119,63],[42,52,43,52],[44,52,45,52],[46,0,48,0],[46,52,48,52],[49,0,51,0],[49,52,51,52],[52,0,54,0],[52,52,54,52],[32,52,33,52],[34,52,35,52],[36,52,37,52],[38,0,39,0],[38,52,39,52],[13,2,13,6],[13,7,13,11],[28,52,29,52],[30,0,31,0],[30,52,31,52],[26,2,26,6],[26,7,26,11],[26,12,26,16],[13,12,13,16],[15,0,16,0],[17,0,20,0],[21,0,22,0],[23,0,25,0],[32,0,33,0],[55,2,55,6],[55,7,55,11],[55,12,55,16],[28,0,29,0],[34,0,35,0],[36,0,37,0],[40,0,41,0],[42,0,43,0],[44,0,45,0],[139,0,142,0],[107,0,107,1],[119,2,119,6],[119,7,119,11],[57,0,70,0],[132,12,132,16],[134,0,138,0],[119,12,119,16],[121,0,122,0],[123,0,126,0],[127,0,128,0],[129,0,131,0],[152,0,164,0],[132,2,132,6],[132,7,132,11],[219,2,219,6],[219,7,219,11],[219,12,219,16],[207,0,207,1],[1024,0,1024,2],[1025,0,1025,1],[1030,0,1032,0],[1033,0,1033,2],[221,0,223,0],[224,0,228,0],[401,1,444,1],[402,2,402,3],[402,7,402,8],[402,12,402,13],[403,2,403,3],[403,7,403,8],[403,12,403,13],[398,2,398,5],[398,7,398,10],[398,12,398,15],[399,2,399,4],[399,7,399,9],[399,12,399,14],[404,2,404,3],[404,7,404,8],[404,12,404,13],[405,2,405,3],[405,7,405,8],[405,12,405,13],[400,2,401,3],[400,7,401,8],[400,12,401,13],[408,2,408,3],[408,7,408,8],[408,12,408,13],[409,2,409,3],[409,7,409,8],[409,12,409,13],[406,2,406,3],[406,7,406,8],[406,12,406,13],[407,2,407,3],[407,7,407,8],[407,12,407,13],[412,2,412,3],[412,7,412,8],[412,12,412,13],[413,2,413,3],[413,7,413,8],[413,12,413,13],[410,2,410,3],[410,7,410,8],[410,12,410,13],[411,2,411,3],[411,7,411,8],[411,12,411,13],[416,2,416,3],[416,7,416,8],[416,12,416,13],[417,2,417,3],[417,7,417,8],[417,12,417,13],[414,2,414,3],[414,7,414,8],[414,12,414,13],[415,2,415,3],[415,7,415,8],[415,12,415,13],[420,2,420,3],[420,7,420,8],[420,12,420,13],[421,2,421,3],[421,7,421,8],[421,12,421,13],[418,2,418,3],[418,7,418,8],[418,12,418,13],[419,2,419,3],[419,7,419,8],[419,12,419,13],[424,2,424,3],[424,7,424,8],[424,12,424,13],[425,2,425,3],[425,7,425,8],[425,12,425,13],[422,2,422,3],[422,7,422,8],[422,12,422,13],[423,2,423,3],[423,7,423,8],[423,12,423,13],[428,2,428,3],[428,7,428,8],[428,12,428,13],[429,2,429,3],[429,7,429,8],[429,12,429,13],[426,2,426,3],[426,7,426,8],[426,12,426,13],[427,2,427,3],[427,7,427,8],[427,12,427,13],[432,2,432,3],[432,7,432,8],[432,12,432,13],[433,2,433,3],[433,7,433,8],[433,12,433,13],[430,2,430,3],[430,7,430,8],[430,12,430,13],[431,2,431,3],[431,7,431,8],[431,12,431,13],[436,2,436,3],[436,7,436,8],[436,12,436,13],[437,2,437,3],[437,7,437,8],[437,12,437,13],[434,2,434,3],[434,7,434,8],[434,12,434,13],[435,2,435,3],[435,7,435,8],[435,12,435,13],[440,2,440,3],[440,7,440,8],[440,12,440,13],[441,2,441,3],[441,7,441,8],[441,12,441,13],[438,2,438,3],[438,7,438,8],[438,12,438,13],[439,2,439,3],[439,7,439,8],[439,12,439,13],[444,2,444,3],[444,7,444,8],[444,12,444,13],[445,2,445,3],[445,7,445,8],[445,12,445,13],[442,2,442,3],[442,7,442,8],[442,12,442,13],[443,2,443,3],[443,7,443,8],[443,12,443,13],[448,2,448,3],[448,7,448,8],[448,12,448,13],[449,2,449,3],[449,7,449,8],[449,12,449,13],[446,2,446,3],[446,7,446,8],[446,12,446,13],[447,2,447,3],[447,7,447,8],[447,12,447,13],[452,2,452,3],[452,7,452,8],[452,12,452,13],[453,2,453,3],[453,7,453,8],[453,12,453,13],[450,2,450,3],[450,7,450,8],[450,12,450,13],[451,2,451,3],[451,7,451,8],[451,12,451,13],[456,2,456,3],[456,7,456,8],[456,12,456,13],[457,2,457,3],[457,7,457,8],[457,12,457,13],[454,2,454,3],[454,7,454,8],[454,12,454,13],[455,2,455,3],[455,7,455,8],[455,12,455,13],[460,2,460,3],[460,7,460,8],[460,12,460,13],[461,2,461,4],[461,7,461,8],[461,12,461,13],[458,2,458,3],[458,7,458,8],[458,12,458,13],[459,2,459,3],[459,7,459,8],[459,12,459,13],[464,2,464,3],[464,7,464,8],[464,12,464,13],[465,2,465,3],[465,7,465,8],[465,12,465,13],[462,2,462,3],[462,7,462,8],[462,12,462,13],[463,2,463,3],[463,7,463,8],[463,12,463,13],[468,2,468,3],[468,7,468,8],[468,12,468,13],[469,2,469,3],[469,7,469,8],[469,12,469,13],[466,2,466,3],[466,7,466,8],[466,12,466,13],[467,2,467,3],[467,7,467,8],[467,12,467,13],[472,2,472,3],[472,7,472,8],[472,12,472,14],[473,2,473,3],[473,7,473,8],[473,12,473,13],[470,2,470,3],[470,7,470,9],[470,12,470,13],[471,2,471,3],[471,7,471,8],[471,12,471,13],[476,2,476,3],[476,7,476,8],[476,12,476,13],[477,2,477,3],[477,7,477,8],[477,12,477,13],[474,2,474,3],[474,7,474,8],[474,12,474,13],[475,2,475,3],[475,7,475,8],[475,12,475,13],[480,2,480,3],[480,7,480,8],[480,12,480,13],[481,2,481,3],[481,7,481,8],[481,12,481,13],[478,2,478,3],[478,7,478,8],[478,12,478,13],[479,2,479,3],[479,7,479,8],[479,12,479,13],[484,2,484,3],[484,7,484,8],[484,12,484,13],[485,2,485,3],[485,7,485,8],[485,12,485,13],[482,2,482,3],[482,7,482,8],[482,12,482,13],[483,2,483,3],[483,7,483,8],[483,12,483,13],[488,2,488,3],[488,7,488,8],[488,12,488,13],[489,2,489,3],[489,7,489,8],[489,12,489,13],[486,2,486,3],[486,7,486,8],[486,12,486,13],[487,2,487,3],[487,7,487,8],[487,12,487,13],[492,2,492,3],[492,7,492,8],[492,12,492,13],[493,2,493,3],[493,7,493,8],[493,12,493,13],[490,2,490,3],[490,7,490,8],[490,12,490,13],[491,2,491,3],[491,7,491,8],[491,12,491,13],[496,2,496,3],[496,7,496,8],[496,12,496,13],[497,2,497,3],[497,7,497,8],[497,12,497,13],[494,2,494,3],[494,7,494,8],[494,12,494,13],[495,2,495,3],[495,7,495,8],[495,12,495,13],[500,2,500,3],[500,7,500,8],[500,12,500,13],[501,2,501,3],[501,7,501,8],[501,12,501,13],[498,2,498,3],[498,7,498,8],[498,12,498,13],[499,2,499,3],[499,7,499,8],[499,12,499,13],[504,2,504,3],[504,7,504,8],[504,12,504,13],[505,2,505,3],[505,7,505,8],[505,12,505,13],[502,2,502,3],[502,7,502,8],[502,12,502,13],[503,2,503,3],[503,7,503,8],[503,12,503,13],[508,2,508,3],[508,7,508,8],[508,12,508,13],[509,2,509,3],[509,7,509,8],[509,12,509,13],[506,2,506,3],[506,7,506,8],[506,12,506,13],[507,2,507,3],[507,7,507,8],[507,12,507,13],[512,2,512,3],[512,7,512,8],[512,12,512,13],[513,2,513,3],[513,7,513,8],[513,12,513,13],[510,2,510,3],[510,7,510,8],[510,12,510,13],[511,2,511,3],[511,7,511,8],[511,12,511,13],[516,2,516,3],[516,7,516,8],[516,12,516,13],[517,2,517,3],[517,7,517,8],[517,12,517,13],[514,2,514,3],[514,7,514,8],[514,12,514,13],[515,2,515,3],[515,7,515,8],[515,12,515,13],[520,2,520,3],[520,7,520,8],[520,12,520,13],[521,2,521,6],[521,7,521,8],[521,12,521,13],[518,2,518,3],[518,7,518,8],[518,12,518,13],[519,2,519,3],[519,7,519,8],[519,12,519,13],[524,2,524,3],[524,7,524,8],[524,12,524,13],[525,2,525,3],[525,7,525,8],[525,12,525,13],[522,2,523,3],[522,4,522,6],[522,7,522,8],[522,12,522,13],[523,7,523,8],[523,12,523,13],[528,2,529,3],[528,7,528,8],[528,12,528,13],[529,7,529,8],[529,12,529,13],[530,2,530,3],[530,7,530,8],[530,12,530,13],[526,2,526,3],[526,7,526,8],[526,12,526,13],[527,2,527,4],[527,7,527,8],[527,12,527,13],[533,2,533,3],[533,7,533,8],[533,12,533,13],[534,2,534,3],[534,7,534,8],[534,12,534,13],[531,2,531,3],[531,7,531,8],[531,12,531,13],[532,2,532,3],[532,7,532,8],[532,12,532,13],[537,2,537,3],[537,7,537,8],[537,12,537,13],[538,2,538,3],[538,7,538,8],[538,12,538,13],[535,2,535,3],[535,7,535,8],[535,12,535,13],[536,2,536,3],[536,7,536,8],[536,12,536,13],[539,2,539,3],[539,7,539,11],[539,12,539,13],[540,2,540,3],[540,7,541,8],[540,9,540,11],[540,12,540,13],[541,2,541,3],[541,12,541,13],[544,14,544,16],[545,2,545,3],[545,7,545,9],[542,2,542,3],[542,7,542,8],[542,12,542,13],[543,2,543,3],[543,7,543,8],[543,12,543,16],[546,2,546,3],[546,7,547,8],[546,12,546,13],[547,2,547,3],[547,12,547,13],[548,2,548,3],[548,7,548,8],[548,12,548,13],[544,2,544,3],[544,7,544,8],[544,12,545,13],[552,2,552,3],[552,7,552,8],[552,12,552,13],[553,2,553,3],[553,7,553,8],[553,12,553,13],[549,2,549,3],[549,7,549,8],[549,12,549,14],[550,2,550,3],[550,7,550,8],[550,12,551,13],[551,2,551,3],[551,7,551,8],[556,2,556,3],[556,7,556,8],[556,12,556,13],[557,2,557,3],[557,7,557,8],[557,12,557,13],[554,2,554,3],[554,7,554,8],[554,12,554,13],[555,2,555,3],[555,7,555,8],[555,12,555,13],[560,2,560,3],[560,7,560,8],[560,12,560,13],[561,2,561,3],[561,7,561,8],[561,12,561,13],[558,2,558,3],[558,7,558,8],[558,12,558,13],[559,2,559,3],[559,7,559,8],[559,12,559,13],[564,2,564,3],[564,7,564,8],[564,12,564,13],[565,2,565,3],[565,7,565,8],[565,12,565,13],[562,2,562,3],[562,7,562,8],[562,12,562,13],[563,2,563,3],[563,7,563,8],[563,12,563,13],[568,2,568,3],[568,7,568,8],[568,12,568,13],[569,2,569,3],[569,7,569,8],[569,12,569,13],[566,2,566,3],[566,7,566,8],[566,12,566,13],[567,2,567,3],[567,7,567,8],[567,12,567,13],[572,2,572,3],[572,7,572,8],[572,12,572,13],[573,2,573,3],[573,7,573,8],[573,12,573,13],[570,2,570,3],[570,7,570,8],[570,12,570,13],[571,2,571,3],[571,7,571,8],[571,12,571,13],[576,2,576,3],[576,7,576,8],[576,12,576,13],[577,2,577,3],[577,7,577,8],[577,12,577,13],[574,2,574,3],[574,7,574,8],[574,12,574,13],[575,2,575,3],[575,7,575,8],[575,12,575,13],[580,2,580,3],[580,7,580,8],[580,12,580,13],[581,2,581,3],[581,7,581,8],[581,12,581,13],[578,2,578,3],[578,7,578,8],[578,12,578,13],[579,2,579,3],[579,7,579,8],[579,12,579,13],[584,2,584,3],[584,7,584,8],[584,12,584,13],[585,2,585,3],[585,7,585,8],[585,12,585,13],[582,2,582,3],[582,7,582,8],[582,12,582,13],[583,2,583,3],[583,7,583,8],[583,12,583,13],[588,2,588,4],[588,7,588,8],[588,12,588,13],[589,2,589,3],[589,7,589,8],[589,12,589,13],[586,2,586,3],[586,7,586,8],[586,12,586,13],[587,2,587,3],[587,7,587,8],[587,12,587,13],[592,2,592,3],[592,7,592,8],[592,12,592,13],[593,2,593,3],[593,7,593,8],[593,12,593,13],[590,2,590,3],[590,7,590,8],[590,12,590,13],[591,2,591,3],[591,7,591,8],[591,12,591,13],[596,2,596,3],[596,7,596,8],[596,12,596,13],[597,2,597,3],[597,7,597,8],[597,12,597,13],[594,2,594,3],[594,7,594,8],[594,12,594,13],[595,2,595,3],[595,7,595,8],[595,12,595,13],[600,2,600,3],[600,7,600,8],[600,12,600,13],[601,2,601,3],[601,7,601,8],[601,12,601,13],[598,2,598,3],[598,7,598,8],[598,12,598,13],[599,2,599,3],[599,7,599,8],[599,12,599,13],[604,2,604,3],[604,7,604,8],[604,12,604,13],[605,2,605,3],[605,7,605,8],[605,12,605,13],[602,2,602,3],[602,7,602,8],[602,12,602,13],[603,2,603,3],[603,7,603,8],[603,12,603,13],[608,2,608,3],[608,7,608,8],[608,12,608,13],[609,2,609,3],[609,7,609,8],[609,12,609,13],[606,2,606,3],[606,7,606,8],[606,12,606,13],[607,2,607,3],[607,7,607,8],[607,12,607,13],[612,2,612,3],[612,7,612,8],[612,12,612,13],[613,2,613,3],[613,7,613,8],[613,12,613,13],[610,2,610,3],[610,7,610,8],[610,12,610,13],[611,2,611,3],[611,7,611,8],[611,12,611,13],[616,2,616,3],[616,7,616,8],[616,12,616,13],[617,2,617,3],[617,7,617,8],[617,12,617,13],[614,2,614,3],[614,7,614,8],[614,12,614,13],[615,2,615,3],[615,7,615,9],[615,12,615,13],[620,2,620,3],[620,7,620,8],[620,12,620,13],[621,2,621,3],[621,7,621,8],[621,12,621,14],[618,2,618,3],[618,7,618,8],[618,12,618,13],[619,2,619,3],[619,7,619,8],[619,12,619,13],[624,2,624,3],[624,7,624,8],[624,12,624,13],[625,2,625,3],[625,7,625,8],[625,12,625,13],[622,2,622,3],[622,7,622,8],[622,12,622,13],[623,2,623,3],[623,7,623,8],[623,12,623,13],[628,2,628,3],[628,7,628,8],[628,12,628,13],[629,2,629,3],[629,7,629,8],[629,12,629,13],[626,2,626,3],[626,7,626,8],[626,12,626,13],[627,2,627,3],[627,7,627,8],[627,12,627,13],[632,2,632,3],[632,7,632,8],[632,12,632,13],[633,2,633,3],[633,7,633,8],[633,12,633,13],[630,2,630,3],[630,7,630,8],[630,12,630,13],[631,2,631,3],[631,7,631,8],[631,12,631,13],[636,2,636,3],[636,7,636,8],[636,12,636,13],[637,2,637,3],[637,7,637,8],[637,12,637,13],[634,2,634,3],[634,7,634,8],[634,12,634,13],[635,2,635,3],[635,7,635,8],[635,12,635,13],[640,2,640,3],[640,7,640,8],[640,12,640,13],[641,2,641,3],[641,7,641,8],[641,12,641,13],[638,2,638,3],[638,7,638,8],[638,12,638,13],[639,2,639,3],[639,7,639,8],[639,12,639,13],[644,2,644,3],[644,7,644,8],[644,12,644,13],[645,2,645,3],[645,7,645,8],[645,12,645,13],[642,2,642,3],[642,7,642,8],[642,12,642,13],[643,2,643,3],[643,7,643,8],[643,12,643,13],[648,2,648,3],[648,7,648,8],[648,12,648,13],[649,2,649,3],[649,7,649,8],[649,12,649,13],[646,2,646,3],[646,7,646,8],[646,12,646,13],[647,2,647,3],[647,7,647,8],[647,12,647,13],[652,2,652,3],[652,7,652,8],[652,12,652,13],[653,2,653,3],[653,7,653,8],[653,12,653,13],[650,2,650,3],[650,7,650,8],[650,12,650,13],[651,2,651,3],[651,7,651,8],[651,12,651,13],[656,2,656,3],[656,7,656,8],[656,12,656,13],[657,2,657,3],[657,7,657,8],[657,12,657,13],[654,2,654,3],[654,7,654,8],[654,12,654,13],[655,2,655,3],[655,7,655,8],[655,12,655,13],[660,2,660,3],[660,7,660,8],[660,12,660,13],[661,2,661,3],[661,7,661,8],[661,12,661,13],[658,2,658,3],[658,7,658,8],[658,12,658,13],[659,2,659,3],[659,7,659,8],[659,12,659,13],[664,2,664,3],[664,7,664,8],[664,12,664,13],[665,2,665,3],[665,7,665,8],[665,12,665,13],[662,2,662,3],[662,7,662,8],[662,12,662,13],[663,2,663,3],[663,7,663,8],[663,12,663,13],[668,2,668,3],[668,7,668,8],[668,12,668,13],[669,2,669,3],[669,7,669,8],[669,12,669,13],[666,2,666,3],[666,7,666,8],[666,12,666,13],[667,2,667,3],[667,7,667,8],[667,12,667,13],[672,2,672,3],[672,7,672,8],[672,12,672,13],[673,2,673,3],[673,7,673,8],[673,12,673,13],[670,2,670,3],[670,7,670,8],[670,12,670,13],[671,2,671,3],[671,7,671,8],[671,12,671,13],[676,2,676,3],[676,7,676,8],[676,12,676,13],[677,2,677,3],[677,7,677,8],[677,12,677,13],[674,2,674,3],[674,7,674,8],[674,12,674,13],[675,2,675,3],[675,7,675,8],[675,12,675,13],[680,2,680,3],[680,7,680,8],[680,12,680,13],[681,2,681,3],[681,7,681,8],[681,12,681,13],[678,2,678,3],[678,7,678,8],[678,12,678,13],[679,2,679,3],[679,7,679,8],[679,12,679,13],[682,2,682,3],[682,7,682,8],[682,12,682,13],[683,2,683,3],[683,7,683,8],[683,12,683,13],[688,2,688,3],[688,7,688,8],[688,12,688,13],[689,2,689,3],[689,7,689,8],[689,12,689,13],[686,2,686,3],[686,7,686,8],[686,12,686,13],[687,2,687,3],[687,7,687,8],[687,12,687,13],[692,2,692,3],[692,7,692,8],[692,12,692,13],[693,2,693,3],[693,7,693,8],[693,12,693,13],[690,2,690,3],[690,7,690,8],[690,12,690,13],[691,2,691,3],[691,7,691,8],[691,12,691,13],[684,2,684,3],[684,7,684,8],[684,12,684,13],[685,2,685,3],[685,7,685,8]],"merged_total":1001,"flags":["merged_cut"]}
[]
[{"$f":"A1026","v":"Republic of Moldova"}]
[{"$f":"A1034","v":"2012"}]
["Use of drinking water sources"]
[" by wealth quintile and sub-national region"]
["Notes:"]
["WHO/UNICEF JMP customised wealth index excludes water,"]
[" sanitation and hygiene assets."]
["Survey used for analysis:",{"$f":"A1025","v":"MICS12"}]
[{"$f":"B1028","v":""}]
[{"$f":"B1027","v":""}]
[]
[]
["Use of drinking water sources",null,"NATIONAL wealth index quintile",null,null,null,null,"URBAN wealth index quintile",null,null,null,null,"RURAL wealth index quintile",null,null,null,null,"SUB-REGIONS:",null,null,null,null,null,null,null,null,null,null,null,null,null,null,null,null,null,null,null,null,null,null,null,null,null,null,null,null,null,null,null,null,null,null,"Raw numbers of respondents:","Use of drinking water sources","NATIONAL wealth index quintile",null,null,null,null,"URBAN wealth index quintile",null,null,null,null,"RURAL wealth index quintile",null,null,null,null,"SUB-REGIONS:"]
["Weighted percentage (used in graphs)",null,"Poorest","Poor","Middle","Rich","Richest","Poorest","Poor","Middle","Rich","Richest","Poorest","Poor","Middle","Rich","Richest","Center","Chisinau","North","South",null,null,null,null,null,null,null,null,null,null,null,null,null,null,null,null,null,null,null,null,null,null,null,null,null,null,null,null,null,null,null,"Water data, raw numbers (weighted)",null,"Poorest","Poor","Middle","Rich","Richest","Poorest","Poor","Middle","Rich","Richest","Poorest","Poor","Middle","Rich","Richest","Center","Chisinau","North","South"]
["Water","Improved",73.8,82,88.2,93.7,97.4,89.4,95.8,96.3,98,99.3,71.5,77.5,81.7,86.3,92.1,78.8,98.6,87.5,87.5,null,null,null,null,null,null,null,null,null,null,null,null,null,null,null,null,null,null,null,null,null,null,null,null,null,null,null,null,null,null,null,"Water","Improved","N/A","N/A","N/A","N/A","N/A","N/A","N/A","N/A","N/A","N/A","N/A","N/A","N/A","N/A","N/A","N/A","N/A","N/A","N/A"]
[null,"Not Improved",26.2,18,11.8,6.3,2.6,10.6,4.2,3.7,2,0.7,28.5,22.5,18.3,13.7,7.9,21.2,1.4,12.5,12.5,null,null,null,null,null,null,null,null,null,null,null,null,null,null,null,null,null,null,null,null,null,null,null,null,null,null,null,null,null,null,null,null,"Not Improved","N/A","N/A","N/A","N/A","N/A","N/A","N/A","N/A","N/A","N/A","N/A","N/A","N/A","N/A","N/A","N/A","N/A","N/A","N/A"]
["Water ladder","Basic",71.400000000000006,80.7,86.9,92.6,96.2,87.6,94.5,94.9,96.7,98,68.8,75.599999999999994,81.099999999999994,85,91.3,77,98.3,85.9,86,null,null,null,null,null,null,null,null,null,null,null,null,null,null,null,null,null,null,null,null,null,null,null,null,null,null,null,null,null,null,null,"Water ladder","Basic","N/A","N/A","N/A","N/A","N/A","N/A","N/A","N/A","N/A","N/A","N/A","N/A","N/A","N/A","N/A","N/A","N/A","N/A","N/A"]
[null,"Limited",2.1,1.2,1.2,1.1000000000000001,1.1000000000000001,1.6,1.2,1.4,1.3,1.3,2.2000000000000002,1.8,0.6,1.2,0.8,1.6,0.2,1.7,1.4,null,null,null,null,null,null,null,null,null,null,null,null,null,null,null,null,null,null,null,null,null,null,null,null,null,null,null,null,null,null,null,null,"Limited","N/A","N/A","N/A","N/A","N/A","N/A","N/A","N/A","N/A","N/A","N/A","N/A","N/A","N/A","N/A","N/A","N/A","N/A","N/A"]
[null,"Unimproved",26.5,18.100000000000001,11.9,6.3,2.6,10.7,4.2,3.7,2,0.7,28.9,22.6,18.3,13.7,7.9,21.4,1.4,12.5,12.6,null,null,null,null,null,null,null,null,null,null,null,null,null,null,null,null,null,null,null,null,null,null,null,null,null,null,null,null,null,null,null,null,"Unimproved","N/A","N/A","N/A","N/A","N/A","N/A","N/A","N/A","N/A","N/A","N/A","N/A","N/A","N/A","N/A","N/A","N/A","N/A","N/A"]
[null,"Surface water",0,0,0,0,0,0,0,0,0,0,0,0,0,0,0,0,0,0,0,null,null,null,null,null,null,null,null,null,null,null,null,null,null,null,null,null,null,null,null,null,null,null,null,null,null,null,null,null,null,null,null,"Surface water","N/A","N/A","N/A","N/A","N/A","N/A","N/A","N/A","N/A","N/A","N/A","N/A","N/A","N/A","N/A","N/A","N/A","N/A","N/A"]
["Improved water point at more than 30 minutes","Yes",2.8,1.4,1.4,1.2,1.2,1.8,1.3,1.5,1.3,1.3,3.1,2.2999999999999998,0.7,1.4,0.9,2.1,0.3,1.9,1.6,null,null,null,null,null,null,null,null,null,null,null,null,null,null,null,null,null,null,null,null,null,null,null,null,null,null,null,null,null,null,null,"Improved water point at more than 30 minutes","Yes","N/A","N/A","N/A","N/A","N/A","N/A","N/A","N/A","N/A","N/A","N/A","N/A","N/A","N/A","N/A","N/A","N/A","N/A","N/A"]
[null,"No",97.2,98.6,98.6,98.8,98.8,98.2,98.7,98.5,98.7,98.7,96.9,97.7,99.3,98.6,99.1,97.9,99.7,98.1,98.4,null,null,null,null,null,null,null,null,null,null,null,null,null,null,null,null,null,null,null,null,null,null,null,null,null,null,null,null,null,null,null,null,"No","N/A","N/A","N/A","N/A","N/A","N/A","N/A","N/A","N/A","N/A","N/A","N/A","N/A","N/A","N/A","N/A","N/A","N/A","N/A"]
["Manually calculated ratios","Improved wells"]
[null,"Improved springs"]
[null,"Other"]
[null,null,"NATIONAL wealth index quintile",null,null,null,null,"URBAN wealth index quintile",null,null,null,null,"RURAL wealth index quintile",null,null,null,null,"SUB-REGIONS:",null,null,null,null,null,null,null,null,null,null,null,null,null,null,null,null,null,null,null,null,null,null,null,null,null,null,null,null,null,null,null,null,null,null,"Raw numbers of respondents:","Use of drinking water sources","NATIONAL wealth index quintile",null,null,null,null,"URBAN wealth index quintile",null,null,null,null,"RURAL wealth index quintile",null,null,null,null,"SUB-REGIONS:"]
["Percentage based on weighted population",null,"Poorest","Poor","Middle","Rich","Richest","Poorest","Poor","Middle","Rich","Richest","Poorest","Poor","Middle","Rich","Richest","Center","Chisinau","North","South",null,null,null,null,null,null,null,null,null,null,null,null,null,null,null,null,null,null,null,null,null,null,null,null,null,null,null,null,null,null,null,"Water data, raw numbers (weighted)",null,"Poorest","Poor","Middle","Rich","Richest","Poorest","Poor","Middle","Rich","Richest","Poorest","Poor","Middle","Rich","Richest","Center","Chisinau","North","South"]
["Piped water","Yes",22.2,36.799999999999997,48.2,65,84.4,62.2,78.7,84.9,88.2,93.9,17.899999999999999,25.6,33.5,38.4,51.6,41.5,95.2,31.3,56,null,null,null,null,null,null,null,null,null,null,null,null,null,null,null,null,null,null,null,null,null,null,null,null,null,null,null,null,null,null,null,"Piped water","Yes","N/A","N/A","N/A","N/A","N/A","N/A","N/A","N/A","N/A","N/A","N/A","N/A","N/A","N/A","N/A","N/A","N/A","N/A","N/A"]
[null,"No",77.8,63.2,51.8,35,15.6,37.799999999999997,21.3,15.1,11.8,6.1,82.1,74.400000000000006,66.5,61.6,48.4,58.5,4.8,68.7,44,null,null,null,null,null,null,null,null,null,null,null,null,null,null,null,null,null,null,null,null,null,null,null,null,null,null,null,null,null,null,null,null,"No","N/A","N/A","N/A","N/A","N/A","N/A","N/A","N/A","N/A","N/A","N/A","N/A","N/A","N/A","N/A","N/A","N/A","N/A","N/A"]
["Piped water on premises","Yes",20.8,36.299999999999997,47.7,64.8,84,60.7,78.599999999999994,84.5,88,93.5,16.2,25.2,32.9,38.1,51.4,40.799999999999997,95.2,30.8,54.9,null,null,null,null,null,null,null,null,null,null,null,null,null,null,null,null,null,null,null,null,null,null,null,null,null,null,null,null,null,null,null,"Piped water on premises","Yes","N/A","N/A","N/A","N/A","N/A","N/A","N/A","N/A","N/A","N/A","N/A","N/A","N/A","N/A","N/A","N/A","N/A","N/A","N/A"]
[null,"No",79.2,63.7,52.3,35.200000000000003,16,39.299999999999997,21.4,15.5,12,6.5,83.8,74.8,67.099999999999994,61.9,48.6,59.2,4.8,69.2,45.1,null,null,null,null,null,null,null,null,null,null,null,null,null,null,null,null,null,null,null,null,null,null,null,null,null,null,null,null,null,null,null,null,"No","N/A","N/A","N/A","N/A","N/A","N/A","N/A","N/A","N/A","N/A","N/A","N/A","N/A","N/A","N/A","N/A","N/A","N/A","N/A"]
["Piped water into dwelling","Yes","N/A","N/A","N/A","N/A","N/A","N/A","N/A","N/A","N/A","N/A","N/A","N/A","N/A","N/A","N/A","N/A","N/A","N/A","N/A",null,null,null,null,null,null,null,null,null,null,null,null,null,null,null,null,null,null,null,null,null,null,null,null,null,null,null,null,null,null,null,"Piped water into dwelling","Yes","N/A","N/A","N/A","N/A","N/A","N/A","N/A","N/A","N/A","N/A","N/A","N/A","N/A","N/A","N/A","N/A","N/A","N/A","N/A"]
[null,"No","N/A","N/A","N/A","N/A","N/A","N/A","N/A","N/A","N/A","N/A","N/A","N/A","N/A","N/A","N/A","N/A","N/A","N/A","N/A",null,null,null,null,null,null,null,null,null,null,null,null,null,null,null,null,null,null,null,null,null,null,null,null,null,null,null,null,null,null,null,null,"No","N/A","N/A","N/A","N/A","N/A","N/A","N/A","N/A","N/A","N/A","N/A","N/A","N/A","N/A","N/A","N/A","N/A","N/A","N/A"]
["Water source on premises","Yes",40.1,58.6,70.900000000000006,82.9,90.8,69.7,85.9,89.3,91.7,94.2,34.799999999999997,49.1,60.1,67.900000000000006,79.5,60.3,96,58.2,71.8,null,null,null,null,null,null,null,null,null,null,null,null,null,null,null,null,null,null,null,null,null,null,null,null,null,null,null,null,null,null,null,"Water source on premises","Yes","N/A","N/A","N/A","N/A","N/A","N/A","N/A","N/A","N/A","N/A","N/A","N/A","N/A","N/A","N/A","N/A","N/A","N/A","N/A"]
[null,"No",59.9,41.4,29.1,17.100000000000001,9.1999999999999993,30.3,14.1,10.7,8.3000000000000007,5.8,65.2,50.9,39.9,32.1,20.5,39.700000000000003,4,41.8,28.2,null,null,null,null,null,null,null,null,null,null,null,null,null,null,null,null,null,null,null,null,null,null,null,null,null,null,null,null,null,null,null,null,"No","N/A","N/A","N/A","N/A","N/A","N/A","N/A","N/A","N/A","N/A","N/A","N/A","N/A","N/A","N/A","N/A","N/A","N/A","N/A"]
["Improved Water source on premises","Yes",34.1,52.7,65,80,89.3,65.8,83.7,87.6,90.7,94.1,28.8,42.5,53.2,61.5,75.3,54.7,95.8,53.4,65.5,null,null,null,null,null,null,null,null,null,null,null,null,null,null,null,null,null,null,null,null,null,null,null,null,null,null,null,null,null,null,null,"Improved water source on premises","Yes","N/A","N/A","N/A","N/A","N/A","N/A","N/A","N/A","N/A","N/A","N/A","N/A","N/A","N/A","N/A","N/A","N/A","N/A","N/A"]
[null,"No",65.900000000000006,47.3,35,20,10.7,34.200000000000003,16.3,12.4,9.3000000000000007,5.9,71.2,57.5,46.8,38.5,24.7,45.3,4.2,46.6,34.5,null,null,null,null,null,null,null,null,null,null,null,null,null,null,null,null,null,null,null,null,null,null,null,null,null,null,null,null,null,null,null,null,"No","N/A","N/A","N/A","N/A","N/A","N/A","N/A","N/A","N/A","N/A","N/A","N/A","N/A","N/A","N/A","N/A","N/A","N/A","N/A"]
["Piped water on premises available when needed","Yes","N/A","N/A","N/A","N/A","N/A","N/A","N/A","N/A","N/A","N/A","N/A","N/A","N/A","N/A","N/A","N/A","N/A","N/A","N/A",null,null,null,null,null,null,null,null,null,null,null,null,null,null,null,null,null,null,null,null,null,null,null,null,null,null,null,null,null,null,null,"Piped water on premises available when needed","Yes","N/A","N/A","N/A","N/A","N/A","N/A","N/A","N/A","N/A","N/A","N/A","N/A","N/A","N/A","N/A","N/A","N/A","N/A","N/A"]
[null,"No","N/A","N/A","N/A","N/A","N/A","N/A","N/A","N/A","N/A","N/A","N/A","N/A","N/A","N/A","N/A","N/A","N/A","N/A","N/A",null,null,null,null,null,null,null,null,null,null,null,null,null,null,null,null,null,null,null,null,null,null,null,null,null,null,null,null,null,null,null,null,"No","N/A","N/A","N/A","N/A","N/A","N/A","N/A","N/A","N/A","N/A","N/A","N/A","N/A","N/A","N/A","N/A","N/A","N/A","N/A"]
["Water point at more than 30 minutes","Yes",3,1.6,1.3,1.3,1.1000000000000001,2,1.2,1.5,1.3,1.3,3.4,2.2000000000000002,1,1.2,1,2.2999999999999998,0.3,1.9,1.5,null,null,null,null,null,null,null,null,null,null,null,null,null,null,null,null,null,null,null,null,null,null,null,null,null,null,null,null,null,null,null,"Water point at more than 30 minutes","Yes","N/A","N/A","N/A","N/A","N/A","N/A","N/A","N/A","N/A","N/A","N/A","N/A","N/A","N/A","N/A","N/A","N/A","N/A","N/A"]
[null,"No",97,98.4,98.7,98.7,98.9,98,98.8,98.5,98.7,98.7,96.6,97.8,99,98.8,99,97.7,99.7,98.1,98.5,null,null,null,null,null,null,null,null,null,null,null,null,null,null,null,null,null,null,null,null,null,null,null,null,null,null,null,null,null,null,null,null,"No","N/A","N/A","N/A","N/A","N/A","N/A","N/A","N/A","N/A","N/A","N/A","N/A","N/A","N/A","N/A","N/A","N/A","N/A","N/A"]
["Water source available when needed","Yes","N/A","N/A","N/A","N/A","N/A","N/A","N/A","N/A","N/A","N/A","N/A","N/A","N/A","N/A","N/A","N/A","N/A","N/A","N/A",null,null,null,null,null,null,null,null,null,null,null,null,null,null,null,null,null,null,null,null,null,null,null,null,null,null,null,null,null,null,null,"Water source available when needed","Yes","N/A","N/A","N/A","N/A","N/A","N/A","N/A","N/A","N/A","N/A","N/A","N/A","N/A","N/A","N/A","N/A","N/A","N/A","N/A"]
[null,"No","N/A","N/A","N/A","N/A","N/A","N/A","N/A","N/A","N/A","N/A","N/A","N/A","N/A","N/A","N/A","N/A","N/A","N/A","N/A",null,null,null,null,null,null,null,null,null,null,null,null,null,null,null,null,null,null,null,null,null,null,null,null,null,null,null,null,null,null,null,null,"No","N/A","N/A","N/A","N/A","N/A","N/A","N/A","N/A","N/A","N/A","N/A","N/A","N/A","N/A","N/A","N/A","N/A","N/A","N/A"]
["Improved water source available when needed","Yes","N/A","N/A","N/A","N/A","N/A","N/A","N/A","N/A","N/A","N/A","N/A","N/A","N/A","N/A","N/A","N/A","N/A","N/A","N/A",null,null,null,null,null,null,null,null,null,null,null,null,null,null,null,null,null,null,null,null,null,null,null,null,null,null,null,null,null,null,null,"Improved water source available when needed","Yes","N/A","N/A","N/A","N/A","N/A","N/A","N/A","N/A","N/A","N/A","N/A","N/A","N/A","N/A","N/A","N/A","N/A","N/A","N/A"]
[null,"No","N/A","N/A","N/A","N/A","N/A","N/A","N/A","N/A","N/A","N/A","N/A","N/A","N/A","N/A","N/A","N/A","N/A","N/A","N/A",null,null,null,null,null,null,null,null,null,null,null,null,null,null,null,null,null,null,null,null,null,null,null,null,null,null,null,null,null,null,null,null,"No","N/A","N/A","N/A","N/A","N/A","N/A","N/A","N/A","N/A","N/A","N/A","N/A","N/A","N/A","N/A","N/A","N/A","N/A","N/A"]
["Microbiological quality at point of collection","Not contaminated (No E. coli in 100 mL)","N/A","N/A","N/A","N/A","N/A","N/A","N/A","N/A","N/A","N/A","N/A","N/A","N/A","N/A","N/A","N/A","N/A","N/A","N/A",null,null,null,null,null,null,null,null,null,null,null,null,null,null,null,null,null,null,null,null,null,null,null,null,null,null,null,null,null,null,null,"Microbiological quality at point of collection","Not contaminated (No E. coli in 100 mL)","N/A","N/A","N/A","N/A","N/A","N/A","N/A","N/A","N/A","N/A","N/A","N/A","N/A","N/A","N/A","N/A","N/A","N/A","N/A"]
[null,"Contaminated (E. coli detected in 100 mL)","N/A","N/A","N/A","N/A","N/A","N/A","N/A","N/A","N/A","N/A","N/A","N/A","N/A","N/A","N/A","N/A","N/A","N/A","N/A",null,null,null,null,null,null,null,null,null,null,null,null,null,null,null,null,null,null,null,null,null,null,null,null,null,null,null,null,null,null,null,null,"Contaminated (E. coli detected in 100 mL)","N/A","N/A","N/A","N/A","N/A","N/A","N/A","N/A","N/A","N/A","N/A","N/A","N/A","N/A","N/A","N/A","N/A","N/A","N/A"]
[null,"Highly contaminated (>100 CFU/100 mL)","N/A","N/A","N/A","N/A","N/A","N/A","N/A","N/A","N/A","N/A","N/A","N/A","N/A","N/A","N/A","N/A","N/A","N/A","N/A",null,null,null,null,null,null,null,null,null,null,null,null,null,null,null,null,null,null,null,null,null,null,null,null,null,null,null,null,null,null,null,null,"Highly contaminated (>100 CFU/100 mL)","N/A","N/A","N/A","N/A","N/A","N/A","N/A","N/A","N/A","N/A","N/A","N/A","N/A","N/A","N/A","N/A","N/A","N/A","N/A"]
["Microbiological quality of improved water sources at point of collection","Not contaminated (No E. coli in 100 mL)","N/A","N/A","N/A","N/A","N/A","N/A","N/A","N/A","N/A","N/A","N/A","N/A","N/A","N/A","N/A","N/A","N/A","N/A","N/A",null,null,null,null,null,null,null,null,null,null,null,null,null,null,null,null,null,null,null,null,null,null,null,null,null,null,null,null,null,null,null,"Microbiological quality of improved water sources at point of collection","Not contaminated (No E. coli in 100 mL)","N/A","N/A","N/A","N/A","N/A","N/A","N/A","N/A","N/A","N/A","N/A","N/A","N/A","N/A","N/A","N/A","N/A","N/A","N/A"]
[null,"Contaminated (E. coli detected in 100 mL)","N/A","N/A","N/A","N/A","N/A","N/A","N/A","N/A","N/A","N/A","N/A","N/A","N/A","N/A","N/A","N/A","N/A","N/A","N/A",null,null,null,null,null,null,null,null,null,null,null,null,null,null,null,null,null,null,null,null,null,null,null,null,null,null,null,null,null,null,null,null,"Contaminated (E. coli detected in 100 mL)","N/A","N/A","N/A","N/A","N/A","N/A","N/A","N/A","N/A","N/A","N/A","N/A","N/A","N/A","N/A","N/A","N/A","N/A","N/A"]
[null,"Highly contaminated (>100 CFU/100 mL)","N/A","N/A","N/A","N/A","N/A","N/A","N/A","N/A","N/A","N/A","N/A","N/A","N/A","N/A","N/A","N/A","N/A","N/A","N/A",null,null,null,null,null,null,null,null,null,null,null,null,null,null,null,null,null,null,null,null,null,null,null,null,null,null,null,null,null,null,null,null,"Highly contaminated (>100 CFU/100 mL)","N/A","N/A","N/A","N/A","N/A","N/A","N/A","N/A","N/A","N/A","N/A","N/A","N/A","N/A","N/A","N/A","N/A","N/A","N/A"]
["Microbiological quality of piped on premises at point of collection","Not contaminated (No E. coli in 100 mL)","N/A","N/A","N/A","N/A","N/A","N/A","N/A","N/A","N/A","N/A","N/A","N/A","N/A","N/A","N/A","N/A","N/A","N/A","N/A",null,null,null,null,null,null,null,null,null,null,null,null,null,null,null,null,null,null,null,null,null,null,null,null,null,null,null,null,null,null,null,"Microbiological quality of piped on premises at point of collection","Not contaminated (No E. coli in 100 mL)","N/A","N/A","N/A","N/A","N/A","N/A","N/A","N/A","N/A","N/A","N/A","N/A","N/A","N/A","N/A","N/A","N/A","N/A","N/A"]
[null,"Contaminated (E. coli detected in 100 mL)","N/A","N/A","N/A","N/A","N/A","N/A","N/A","N/A","N/A","N/A","N/A","N/A","N/A","N/A","N/A","N/A","N/A","N/A","N/A",null,null,null,null,null,null,null,null,null,null,null,null,null,null,null,null,null,null,null,null,null,null,null,null,null,null,null,null,null,null,null,null,"Contaminated (E. coli detected in 100 mL)","N/A","N/A","N/A","N/A","N/A","N/A","N/A","N/A","N/A","N/A","N/A","N/A","N/A","N/A","N/A","N/A","N/A","N/A","N/A"]
[null,"Highly contaminated (>100 CFU/100 mL)","N/A","N/A","N/A","N/A","N/A","N/A","N/A","N/A","N/A","N/A","N/A","N/A","N/A","N/A","N/A","N/A","N/A","N/A","N/A",null,null,null,null,null,null,null,null,null,null,null,null,null,null,null,null,null,null,null,null,null,null,null,null,null,null,null,null,null,null,null,null,"Highly contaminated (>100 CFU/100 mL)","N/A","N/A","N/A","N/A","N/A","N/A","N/A","N/A","N/A","N/A","N/A","N/A","N/A","N/A","N/A","N/A","N/A","N/A","N/A"]
[null,null,"NATIONAL wealth index quintile",null,null,null,null,"URBAN wealth index quintile",null,null,null,null,"RURAL wealth index quintile",null,null,null,null,"SUB-REGIONS:",null,null,null,null,null,null,null,null,null,null,null,null,null,null,null,null,null,null,null,null,null,null,null,null,null,null,null,null,null,null,null,null,null,null,"Raw numbers of respondents:","Use of drinking water sources","NATIONAL wealth index quintile",null,null,null,null,"URBAN wealth index quintile",null,null,null,null,"RURAL wealth index quintile",null,null,null,null,"SUB-REGIONS:"]
["Percentage based on weighted population",null,"Poorest","Poor","Middle","Rich","Richest","Poorest","Poor","Middle","Rich","Richest","Poorest","Poor","Middle","Rich","Richest","Center","Chisinau","North","South",null,null,null,null,null,null,null,null,null,null,null,null,null,null,null,null,null,null,null,null,null,null,null,null,null,null,null,null,null,null,null,"Water data, raw numbers (weighted)",null,"Poorest","Poor","Middle","Rich","Richest","Poorest","Poor","Middle","Rich","Richest","Poorest","Poor","Middle","Rich","Richest","Center","Chisinau","North","South"]
["Main source of drinking water","Piped into dwelling",5.8,18.2,35.299999999999997,53.9,67.2,44.1,68.7,71.2,73.2,69.400000000000006,2.5,8.1,15.2,26.8,41.2,24.3,78.5,21.4,36.5]
[null,"Piped into compound, yard or plot",14.8,17.2,10.9,6.1,1.5,13.2,5,1.9,1,0.2,13.5,17,17.7,11,8.5,15,1.4,6.8,16.3]
[null,"Piped to neighbour",1.1000000000000001,0.2,0.4,0.2,0,0.9,0,0.3,0,0,1.5,0.1,0.4,0.1,0.1,0.5,0.1,0.1,0.8]
[null,"Public tap / standpipe",0.3,0.2,0.1,0,0.4,0.5,0.1,0.2,0.2,0.4,0.3,0.2,0.2,0.1,0.1,0.2,0,0.3,0.3]
[null,"Tube well, Borehole",0.6,0.7,1.1000000000000001,0.8,0.5,0.2,0.4,0.2,0.4,0.4,0.6,0.4,1.7,1.1000000000000001,1,0.4,0.1,1.2,1.1000000000000001]
[null,"Protected well",46.6,40.6,35.700000000000003,24.2,8.4,23.9,12.8,7.4,5.3,1.1000000000000001,48.6,46.3,43.7,43.7,35.4,33.799999999999997,2,50.7,23.6]
[null,"Unprotected well",24,16.600000000000001,10.7,5.5,1.8,8.5,2.7,2.4,1.1000000000000001,0.2,26.3,21.2,16.7,13.1,7.3,19.899999999999999,0.7,11.9,9.5]
[null,"Protected spring",3,3.7,2.2999999999999998,2.4,3.5,2.6,3.3,2.7,3.7,3.5,2.9,4.4000000000000004,2.5,2.1,2.5,2.1,1,3.8,4.9000000000000004]
[null,"Unprotected spring",1.4,0.7,0.5,0.1,0.4,0.4,0.4,0.3,0.4,0,1.5,0.9,1,0.2,0.3,1,0.2,0.5,0.5]
[null,"Rainwater collection",0,0,0,0,0,0,0,0,0,0,0,0,0,0,0,0,0,0,0]
[null,"Tanker-truck",1,0.1,0.6,0.4,0.1,0,0,0,0,0,1.1000000000000001,0.6,0.2,1,0.7,0.4,0,0,1.7]
[null,"Cart with small tank / drum",0.1,0,0,0,0,0,0,0,0.1,0,0,0.1,0,0,0,0,0,0,0]
[null,"Bottled water",0.4,1.1000000000000001,1.8,5.7,15.8,3.8,5.4,12.3,14.1,24.3,0.5,0.3,0.2,0.4,2.5,2,15.5,3.1,2.1]
[null,"Other",0.8,0.8,0.6,0.7,0.5,1.8,1.2,0.9,0.5,0.5,0.7,0.5,0.6,0.3,0.4,0.3,0.5,0,2.5]
[]
[]
[]
[]
[]
[]
[]
[]
[]
[]
[]
[]
[]
[]
[]
[]
[]
[]
[]
[]
[]
[]
[]
[]
[]
[]
[]
[]
[]
[]
[]
[]
[]
[]
[]
[]
[{"$f":"A1026","v":"Republic of Moldova"}]
[{"$f":"A1034","v":"2012"}]
["Use of sanitation facilities"]
[" by wealth quintile and sub-national region"]
["Notes:"]
["WHO/UNICEF JMP customised wealth index excludes water,"]
[" sanitation and hygiene assets."]
["Survey used for analysis:",{"$f":"A1025","v":"MICS12"}]
[{"$f":"B1030","v":""}]
[{"$f":"B1029","v":""}]
[]
[]
["Use of sanitation facilities",null,"NATIONAL wealth index quintile",null,null,null,null,"URBAN wealth index quintile",null,null,null,null,"RURAL wealth index quintile",null,null,null,null,"SUB-REGIONS:",null,null,null,null,null,null,null,null,null,null,null,null,null,null,null,null,null,null,null,null,null,null,null,null,null,null,null,null,null,null,null,null,null,null,"Raw numbers of respondents:","Use of sanitation facilities","NATIONAL wealth index quintile",null,null,null,null,"URBAN wealth index quintile",null,null,null,null,"RURAL wealth index quintile",null,null,null,null,"SUB-REGIONS:"]
["Weighted percentage (used in graphs)",null,"Poorest","Poor","Middle","Rich","Richest","Poorest","Poor","Middle","Rich","Richest","Poorest","Poor","Middle","Rich","Richest","Center","Chisinau","North","South",null,null,null,null,null,null,null,null,null,null,null,null,null,null,null,null,null,null,null,null,null,null,null,null,null,null,null,null,null,null,null,"Sanitation data, raw numbers (weighted)",null,"Poorest","Poor","Middle","Rich","Richest","Poorest","Poor","Middle","Rich","Richest","Poorest","Poor","Middle","Rich","Richest","Center","Chisinau","North","South"]
["Sanitation","Improved",60.807699641296708,68.688202892995278,76.763625146438301,88.628876447689805,97.139800530096139,87.060470832332754,93.034575951809927,97.368295473123737,98.88060626330946,99.898007041552944,56.739621498442894,64.102495044308256,65.353301935952274,71.876755799737126,84.041008422657839,70.826837725539079,98.99194871166884,78.493203536092125,69.662952654745951,null,null,null,null,null,null,null,null,null,null,null,null,null,null,null,null,null,null,null,null,null,null,null,null,null,null,null,null,null,null,null,"Sanitation","Improved",3502.5170093478582,3953.9264873802254,4419.667569613749,5105.5791415954018,5589.7622086872243,1865.2546382198766,1993.8212634648805,2087.3715380716412,2118.2210291962192,2140.4317776829466,2054.9302916594706,2313.1225040771069,2362.8787462130458,2598.9028721759869,3036.5177558632945,6151.2185691689119,5446.1151677513808,7126.2442617938323,3847.8744179104174]
[null,"Not Improved",39.19230035870337,31.311797107004956,23.236374853561799,11.37112355231012,2.8601994699038515,12.939529167667487,6.965424048190215,2.63170452687624,1.119393736690568,0.1019929584470491,43.260378501557327,35.897504955691915,34.646698064047612,28.123244200262793,15.958991577342132,29.173162274461067,1.0080512883311374,21.506796463908049,30.337047345254479,null,null,null,null,null,null,null,null,null,null,null,null,null,null,null,null,null,null,null,null,null,null,null,null,null,null,null,null,null,null,null,null,"Not Improved",2257.4723176767329,1802.4134965611076,1337.8348427365856,655.04803346395181,164.58583216075664,277.22704191268451,149.27579810246988,56.41821189662366,23.979660346078639,2.1853185646551871,1566.7545863686084,1295.35248972502,1252.6673336601918,1016.8736653976381,576.62041662516719,2533.6511309375564,55.458686112362486,1952.5599413205321,1675.6847642286828]
["Sanitation ladder","Basic",{"$f":"C122*C129/100","v":52.566529109581417},{"$f":"D122*D129/100","v":59.435613549961424},{"$f":"E122*E129/100","v":67.788189101530548},78.222374025663328,90.310749447028343,67.413112179298892,81.501424128217693,88.018396748990085,90.334057727780859,95.428257250581751,50.748136853285104,56.572469102638848,58.975107458637218,63.232311460860892,74.707756071492753,64.758019423300581,86.446230653345296,68.251119218238586,62.975788393766145,null,null,null,null,null,null,null,null,null,null,null,null,null,null,null,null,null,null,null,null,null,null,null,null,null,null,null,null,null,null,null,"Sanitation ladder","Basic",3027.8264662991619,3421.3159874772741,3902.9066228092242,4506.0993350989347,5196.7948414802049,1444.3135784486876,1746.6546256273746,1886.9293675912504,1935.1368075360585,2044.6621545021067,1837.9375982964173,2041.4034009451539,2132.2721858217901,2286.3390819672882,2699.2944524286718,5624.1496072832851,4755.9032232751915,6196.385480258029,3478.5049423483447]
[null,"Limited",{"$f":"C122*C128/100","v":8.2411705317152908},{"$f":"D122*D128/100","v":9.2525893430338222},{"$f":"E122*E128/100","v":8.9754360449078003},10.40650242202641,6.8290510830679185,19.64735865303355,11.533151823592229,9.34989872413367,8.5465485355286894,4.469749790971183,5.991484645157783,7.5300259416693782,6.378194477315053,8.6444443388761734,9.3332523511650347,6.0688183022384328,12.545718058323532,10.242084317853321,6.6871642609797286,null,null,null,null,null,null,null,null,null,null,null,null,null,null,null,null,null,null,null,null,null,null,null,null,null,null,null,null,null,null,null,null,"Limited",474.6905430486961,532.6104999029493,516.76094680452752,599.47980649646354,392.9673672070266,420.94105977118238,247.16663783750599,200.44217048039124,183.08422166016268,95.76962318084,216.99269336305326,271.71910313195218,230.60656039125601,312.56379020869645,337.22330343462085,527.06896188562075,690.21194447618961,929.8587815357829,369.36947556206849]
[null,"Unimproved",{"$f":"100-C124-C125-C127","v":38.676300898431442},{"$f":"100-D124-D125-D127","v":31.311797107004754},{"$f":"100-E124-E125-E127","v":23.236374853561649},11.371123552310262,2.8601994699037387,12.883197156879625,6.9654240481900782,2.6317045268762449,1.1193937366904514,0.1019929584470658,42.473048521498022,35.897504955691772,34.646698064047726,28.123244200262935,15.958991577342212,29.109268276744245,1.0080512883311723,21.253839137521261,30.31519724876047,null,null,null,null,null,null,null,null,null,null,null,null,null,null,null,null,null,null,null,null,null,null,null,null,null,null,null,null,null,null,null,null,"Unimproved",2227.7508038375704,1802.4134965611076,1337.8348427365856,655.04803346395181,164.58583216075664,276.02013890150272,149.27579810246988,56.41821189662366,23.979660346078639,2.1853185646551871,1538.2399755406261,1295.35248972502,1252.6673336601918,1016.8736653976381,576.62041662516719,2528.1020204896686,55.458686112362486,1929.5944409404387,1674.477861217501]
[null,"Open defecation",0.51599946027185328,0,0,0,0,5.6332010787933436E-2,0,0,0,0,0.78732998005908894,0,0,0,0,6.3893997716739787E-2,0,0.25295732638683444,2.1850096493659342E-2,null,null,null,null,null,null,null,null,null,null,null,null,null,null,null,null,null,null,null,null,null,null,null,null,null,null,null,null,null,null,null,null,"Open defecation",29.721513839163226,0,0,0,0,1.2069030111817689,0,0,0,0,28.514610827981453,0,0,0,0,5.5491104478878448,0,22.965500380093609,1.2069030111817689]
["Shared among Improved Sanitation","Yes",13.552840479626388,13.470419887746674,11.69230351978009,11.741661227273365,7.0301267305486403,22.567484950629122,12.396629646128741,9.6026110744790572,8.6433011067610774,4.4743132754510047,10.559613347653734,11.74685312399237,9.7595596371945046,12.026759197314508,11.105593003151956,8.5685292427648641,12.673473167868535,13.04837088620531,9.5993121252292344,null,null,null,null,null,null,null,null,null,null,null,null,null,null,null,null,null,null,null,null,null,null,null,null,null,null,null,null,null,null,null,"Shared among improved sanitation facilities","Yes","N/A","N/A","N/A","N/A","N/A","N/A","N/A","N/A","N/A","N/A","N/A","N/A","N/A","N/A","N/A","N/A","N/A","N/A","N/A"]
[null,"No",86.447159520373603,86.529580112253285,88.307696480219974,88.25833877272656,92.969873269451483,77.432515049370522,87.603370353871256,90.397388925520957,91.356698893239013,95.52568672454899,89.440386652346263,88.253146876007591,90.240440362805501,87.97324080268541,88.894406996847991,91.431470757235033,87.326526832131464,86.951629113794411,90.400687874770654,null,null,null,null,null,null,null,null,null,null,null,null,null,null,null,null,null,null,null,null,null,null,null,null,null,null,null,null,null,null,null,null,"No","N/A","N/A","N/A","N/A","N/A","N/A","N/A","N/A","N/A","N/A","N/A","N/A","N/A","N/A","N/A","N/A","N/A","N/A","N/A"]
["Manually calculated ratios","Improved latrines"]
[null,"Other"]
[null,"Other"]
[null,null,"NATIONAL wealth index quintile",null,null,null,null,"URBAN wealth index quintile",null,null,null,null,"RURAL wealth index quintile",null,null,null,null,"SUB-REGIONS:",null,null,null,null,null,null,null,null,null,null,null,null,null,null,null,null,null,null,null,null,null,null,null,null,null,null,null,null,null,null,null,null,null,null,"Raw numbers of respondents:","Use of sanitation facilities","NATIONAL wealth index quintile",null,null,null,null,"URBAN wealth index quintile",null,null,null,null,"RURAL wealth index quintile",null,null,null,null,"SUB-REGIONS:"]
["Percentage based on weighted population",null,"Poorest","Poor","Middle","Rich","Richest","Poorest","Poor","Middle","Rich","Richest","Poorest","Poor","Middle","Rich","Richest","Center","Chisinau","North","South",null,null,null,null,null,null,null,null,null,null,null,null,null,null,null,null,null,null,null,null,null,null,null,null,null,null,null,null,null,null,null,"Sanitation data, raw numbers (weighted)",null,"Poorest","Poor","Middle","Rich","Richest","Poorest","Poor","Middle","Rich","Richest","Poorest","Poor","Middle","Rich","Richest","Center","Chisinau","North","South"]
["Sanitation type","Sewer connection",2.4382083631962943,7.5368967806120306,17.732087728570882,36.112004728496473,71.898953784249159,33.35220284329688,55.334299256577857,71.340378442254831,78.58884958670572,93.580194010868595,0.69781865282712385,1.3423851629638124,1.7082001272847793,4.9417005450815656,10.523784393546737,10.201147717562954,87.7247650805934,16.267681683982719,11.29161839698803,null,null,null,null,null,null,null,null,null,null,null,null,null,null,null,null,null,null,null,null,null,null,null,null,null,null,null,null,null,null,null,"Sanitation type","Sewer connection","N/A","N/A","N/A","N/A","N/A","N/A","N/A","N/A","N/A","N/A","N/A","N/A","N/A","N/A","N/A","N/A","N/A","N/A","N/A"]
[null,"Septic tank connection",0.36252138671254314,1.3436487249778819,5.0579903444304168,10.049159964692169,8.5489266634062666,4.0953385765582624,7.1200823034818077,8.4917105882090027,9.1215985212433637,3.8957473540092935,0.20680242075643904,0.55584485983496712,1.5053814385769668,5.2159204611296799,13.518669812765097,6.4270841870618014,3.4456520977920158,4.5120855902582067,5.4833726509742009,null,null,null,null,null,null,null,null,null,null,null,null,null,null,null,null,null,null,null,null,null,null,null,null,null,null,null,null,null,null,null,null,"Septic tank connection","N/A","N/A","N/A","N/A","N/A","N/A","N/A","N/A","N/A","N/A","N/A","N/A","N/A","N/A","N/A","N/A","N/A","N/A","N/A"]
[null,"Improved latrines",58.006969891387861,59.807657387405357,53.973547073436954,42.467711754501202,16.691920082440756,49.6129294124773,30.580194391750421,17.536206442659907,11.170158155360385,2.422065676675047,55.835000424859295,62.204265021509443,62.139720370090544,61.719134793525868,59.998554216345923,54.198605820914089,7.8215315332835464,57.713436261850894,52.887961606783662,null,null,null,null,null,null,null,null,null,null,null,null,null,null,null,null,null,null,null,null,null,null,null,null,null,null,null,null,null,null,null,null,"Improved latrines","N/A","N/A","N/A","N/A","N/A","N/A","N/A","N/A","N/A","N/A","N/A","N/A","N/A","N/A","N/A","N/A","N/A","N/A","N/A"]
[null,"Unimproved facilities",38.676300898431535,31.311797107004956,23.236374853561799,11.37112355231012,2.8601994699038515,12.883197156879552,6.965424048190215,2.63170452687624,1.119393736690568,0.1019929584470491,42.473048521498214,35.897504955691915,34.646698064047612,28.123244200262793,15.958991577342132,29.109268276744327,1.0080512883311374,21.253839137521219,30.315197248760821,null,null,null,null,null,null,null,null,null,null,null,null,null,null,null,null,null,null,null,null,null,null,null,null,null,null,null,null,null,null,null,null,"Unimproved facilities","N/A","N/A","N/A","N/A","N/A","N/A","N/A","N/A","N/A","N/A","N/A","N/A","N/A","N/A","N/A","N/A","N/A","N/A","N/A"]
[null,"Open defecation",0.51599946027185328,0,0,0,0,5.6332010787933436E-2,0,0,0,0,0.78732998005908894,0,0,0,0,6.3893997716739787E-2,0,0.25295732638683444,2.1850096493659342E-2,null,null,null,null,null,null,null,null,null,null,null,null,null,null,null,null,null,null,null,null,null,null,null,null,null,null,null,null,null,null,null,null,"Open defecation","N/A","N/A","N/A","N/A","N/A","N/A","N/A","N/A","N/A","N/A","N/A","N/A","N/A","N/A","N/A","N/A","N/A","N/A","N/A"]
["Septic tank emptying practices","Not emptied/treated and disposed in situ","N/A","N/A","N/A","N/A","N/A","N/A","N/A","N/A","N/A","N/A","N/A","N/A","N/A","N/A","N/A","N/A","N/A","N/A","N/A",null,null,null,null,null,null,null,null,null,null,null,null,null,null,null,null,null,null,null,null,null,null,null,null,null,null,null,null,null,null,null,"Septic tank emptying practices","Not emptied/treated and disposed in situ","N/A","N/A","N/A","N/A","N/A","N/A","N/A","N/A","N/A","N/A","N/A","N/A","N/A","N/A","N/A","N/A","N/A","N/A","N/A"]
[null,"Emptied and buried on site","N/A","N/A","N/A","N/A","N/A","N/A","N/A","N/A","N/A","N/A","N/A","N/A","N/A","N/A","N/A","N/A","N/A","N/A","N/A",null,null,null,null,null,null,null,null,null,null,null,null,null,null,null,null,null,null,null,null,null,null,null,null,null,null,null,null,null,null,null,null,"Emptied and buried on site","N/A","N/A","N/A","N/A","N/A","N/A","N/A","N/A","N/A","N/A","N/A","N/A","N/A","N/A","N/A","N/A","N/A","N/A","N/A"]
[null,"Emptied and discharged locally","N/A","N/A","N/A","N/A","N/A","N/A","N/A","N/A","N/A","N/A","N/A","N/A","N/A","N/A","N/A","N/A","N/A","N/A","N/A",null,null,null,null,null,null,null,null,null,null,null,null,null,null,null,null,null,null,null,null,null,null,null,null,null,null,null,null,null,null,null,null,"Emptied and discharged locally","N/A","N/A","N/A","N/A","N/A","N/A","N/A","N/A","N/A","N/A","N/A","N/A","N/A","N/A","N/A","N/A","N/A","N/A","N/A"]
[null,"Emptied and removed offsite","N/A","N/A","N/A","N/A","N/A","N/A","N/A","N/A","N/A","N/A","N/A","N/A","N/A","N/A","N/A","N/A","N/A","N/A","N/A",null,null,null,null,null,null,null,null,null,null,null,null,null,null,null,null,null,null,null,null,null,null,null,null,null,null,null,null,null,null,null,null,"Emptied and removed offsite","N/A","N/A","N/A","N/A","N/A","N/A","N/A","N/A","N/A","N/A","N/A","N/A","N/A","N/A","N/A","N/A","N/A","N/A","N/A"]
["Latrine emptying practices","Not emptied/treated and disposed in situ","N/A","N/A","N/A","N/A","N/A","N/A","N/A","N/A","N/A","N/A","N/A","N/A","N/A","N/A","N/A","N/A","N/A","N/A","N/A",null,null,null,null,null,null,null,null,null,null,null,null,null,null,null,null,null,null,null,null,null,null,null,null,null,null,null,null,null,null,null,"Latrine emptying practices","Not emptied/treated and disposed in situ","N/A","N/A","N/A","N/A","N/A","N/A","N/A","N/A","N/A","N/A","N/A","N/A","N/A","N/A","N/A","N/A","N/A","N/A","N/A"]
[null,"Emptied and buried on site","N/A","N/A","N/A","N/A","N/A","N/A","N/A","N/A","N/A","N/A","N/A","N/A","N/A","N/A","N/A","N/A","N/A","N/A","N/A",null,null,null,null,null,null,null,null,null,null,null,null,null,null,null,null,null,null,null,null,null,null,null,null,null,null,null,null,null,null,null,null,"Emptied and buried on site","N/A","N/A","N/A","N/A","N/A","N/A","N/A","N/A","N/A","N/A","N/A","N/A","N/A","N/A","N/A","N/A","N/A","N/A","N/A"]
[null,"Emptied and discharged locally","N/A","N/A","N/A","N/A","N/A","N/A","N/A","N/A","N/A","N/A","N/A","N/A","N/A","N/A","N/A","N/A","N/A","N/A","N/A",null,null,null,null,null,null,null,null,null,null,null,null,null,null,null,null,null,null,null,null,null,null,null,null,null,null,null,null,null,null,null,null,"Emptied and discharged locally","N/A","N/A","N/A","N/A","N/A","N/A","N/A","N/A","N/A","N/A","N/A","N/A","N/A","N/A","N/A","N/A","N/A","N/A","N/A"]
[null,"Emptied and removed offsite","N/A","N/A","N/A","N/A","N/A","N/A","N/A","N/A","N/A","N/A","N/A","N/A","N/A","N/A","N/A","N/A","N/A","N/A","N/A",null,null,null,null,null,null,null,null,null,null,null,null,null,null,null,null,null,null,null,null,null,null,null,null,null,null,null,null,null,null,null,null,"Emptied and removed offsite","N/A","N/A","N/A","N/A","N/A","N/A","N/A","N/A","N/A","N/A","N/A","N/A","N/A","N/A","N/A","N/A","N/A","N/A","N/A"]
["Shared among improved sanitation facilities","Yes",8.2411705317152908,9.2525893430338204,8.9754360449078003,10.40650242202641,6.8290510830679176,19.647358653033553,11.533151823592229,9.34989872413367,8.5465485355286894,4.4697497909711812,5.991484645157783,7.5300259416693782,6.3781944773150538,8.6444443388761734,9.3332523511650365,6.0688183022384337,12.545718058323532,10.242084317853321,6.6871642609797277,null,null,null,null,null,null,null,null,null,null,null,null,null,null,null,null,null,null,null,null,null,null,null,null,null,null,null,null,null,null,null,"Shared among improved sanitation facilities","Yes","N/A","N/A","N/A","N/A","N/A","N/A","N/A","N/A","N/A","N/A","N/A","N/A","N/A","N/A","N/A","N/A","N/A","N/A","N/A"]
[null,"No",52.566529109581417,59.435613549961417,67.788189101530548,78.222374025663328,90.310749447028343,67.413112179298892,81.501424128217707,88.018396748990085,90.334057727780859,95.428257250581765,50.748136853285111,56.572469102638848,58.975107458637233,63.232311460860892,74.707756071492753,64.758019423300567,86.446230653345324,68.251119218238571,62.975788393766152,null,null,null,null,null,null,null,null,null,null,null,null,null,null,null,null,null,null,null,null,null,null,null,null,null,null,null,null,null,null,null,null,"No","N/A","N/A","N/A","N/A","N/A","N/A","N/A","N/A","N/A","N/A","N/A","N/A","N/A","N/A","N/A","N/A","N/A","N/A","N/A"]
[null,"DK/missing",39.19230035870337,31.311797107004956,23.236374853561799,11.37112355231012,2.8601994699038515,12.939529167667487,6.965424048190215,2.63170452687624,1.119393736690568,0.1019929584470491,43.260378501557327,35.897504955691915,34.646698064047612,28.123244200262793,15.958991577342132,29.173162274461067,1.0080512883311374,21.506796463908049,30.337047345254479,null,null,null,null,null,null,null,null,null,null,null,null,null,null,null,null,null,null,null,null,null,null,null,null,null,null,null,null,null,null,null,null,"DK/missing","N/A","N/A","N/A","N/A","N/A","N/A","N/A","N/A","N/A","N/A","N/A","N/A","N/A","N/A","N/A","N/A","N/A","N/A","N/A"]
["Shared among all sanitation facilities","Yes",12.076478891613304,12.515823395284942,11.067611422937627,11.602228425032584,7.0649278401787825,21.014444399350943,12.455498107656426,9.7388261422710141,8.7511750017269261,4.4697497909711812,10.435896144648844,11.241486957622463,9.4053459863003823,11.485950028235628,10.508128286554491,9.6529007481784888,12.724408082913955,12.240506099729647,8.6604070340914969,null,null,null,null,null,null,null,null,null,null,null,null,null,null,null,null,null,null,null,null,null,null,null,null,null,null,null,null,null,null,null,"Shared among all sanitation facilities","Yes","N/A","N/A","N/A","N/A","N/A","N/A","N/A","N/A","N/A","N/A","N/A","N/A","N/A","N/A","N/A","N/A","N/A","N/A","N/A"]
[null,"No",87.923521108386694,87.484176604715174,88.932388577062312,88.397771574967365,92.935072159821246,78.985555600649008,87.544501892343703,90.261173857728977,91.248824998273179,95.530250209028793,89.564103855351192,88.758513042377501,90.594654013699596,88.514049971764436,89.491871713445491,90.347099251821604,87.275591917086075,87.759493900270314,91.339592965908722,null,null,null,null,null,null,null,null,null,null,null,null,null,null,null,null,null,null,null,null,null,null,null,null,null,null,null,null,null,null,null,null,"No","N/A","N/A","N/A","N/A","N/A","N/A","N/A","N/A","N/A","N/A","N/A","N/A","N/A","N/A","N/A","N/A","N/A","N/A","N/A"]
["Type of toilet facility","Flush to piped sewer system",2.4382083631962943,7.5368967806120306,17.732087728570882,36.112004728496473,71.898953784249159,33.35220284329688,55.334299256577857,71.340378442254831,78.58884958670572,93.580194010868595,0.69781865282712385,1.3423851629638124,1.7082001272847793,4.9417005450815656,10.523784393546737,10.201147717562954,87.7247650805934,16.267681683982719,11.29161839698803,null,null,null,null,null,null,null,null,null,null,null,null,null,null,null,null,null,null,null,null,null,null,null,null,null,null,null,null,null,null,null,"Type of toilet facility","Flush to piped sewer system",140.44054149072741,433.84940293075636,1020.9253787325451,2080.2779578484879,4137.3160384741377,714.56483583828515,1185.8677414066026,1529.387720633629,1683.5308777497689,2005.0652355785451,25.27279262549915,48.439632926059019,61.760762738434558,178.68084886620733,380.23887111362063,885.95638718572616,4826.2427390373186,1476.9109684746861,623.69922477893749]
[null,"Flush to septic tank",0.36252138671254314,1.3436487249778819,5.0579903444304168,10.049159964692169,8.5489266634062666,4.0953385765582624,7.1200823034818077,8.4917105882090027,9.1215985212433637,3.8957473540092935,0.20680242075643904,0.55584485983496712,1.5053814385769668,5.2159204611296799,13.518669812765097,6.4270841870618014,3.4456520977920158,4.5120855902582067,5.4833726509742009,null,null,null,null,null,null,null,null,null,null,null,null,null,null,null,null,null,null,null,null,null,null,null,null,null,null,null,null,null,null,null,null,"Flush to septic tank",20.881193182824013,77.344988799619557,291.21391609702795,578.89463979124253,491.93499396924921,87.741878742162157,152.59027462709531,182.0444211869945,195.40294641935535,83.470948833616717,7.4897319999319381,20.057522771479235,54.427759589608932,188.59602825202916,488.44821941769027,558.18388716246375,189.56509490723317,409.6434162164789,302.87733355378833]
[null,"Flush to pit (latrine)",0.34646746261693029,0.48565288985257182,1.3616666581386667,2.1266120813319045,2.5963204981588399,0.90551957726095533,1.6568743119313958,2.4036536647616851,2.8843542402228648,1.2302213879162776,0.29559601607776081,0.16955979870587687,0.75873518034239906,1.305217766446306,3.1048266921887038,1.0633711873365155,0.36589940314546182,1.1420898030683562,3.2958295771800672,null,null,null,null,null,null,null,null,null,null,null,null,null,null,null,null,null,null,null,null,null,null,null,null,null,null,null,null,null,null,null,null,"Flush to pit (latrine)",19.956488868348082,27.955831481750085,78.397990690503846,122.50619346530111,149.40131771993777,19.400591052829732,35.508424692865951,51.529280889897571,61.788656422896707,26.358933779188693,10.705556214341691,6.1185229358427788,27.432420069488778,47.193757763408087,112.18167840508092,92.352402048651285,20.130225894894224,103.68809704431031,182.0470972379851]
[null,"Flush to somewhere else",1.0544904062096225E-2,2.1244592182193444E-2,9.6480484554637591E-2,4.9693833944603416E-2,3.7976822902306591E-2,2.834961690240196E-2,7.8322662961558931E-2,0,0,0.1019929584470491,0,3.3889966157707396E-2,0,0.15362858207515628,3.2773333250515492E-2,1.4080936115758686E-2,3.9721698239503632E-2,7.9673454260305587E-2,3.2434361677268354E-2,null,null,null,null,null,null,null,null,null,null,null,null,null,null,null,null,null,null,null,null,null,null,null,null,null,null,null,null,null,null,null,null,"Flush to somewhere else",0.60738534852172466,1.222910954208873,5.5548662256805459,2.8626765025416958,2.1853185646551871,0.60738534852172466,1.6785306884704665,0,0,2.1853185646551871,0,1.222910954208873,0,5.5548662256805459,1.1841458140712291,1.222910954208873,2.1853185646551871,7.2333969141510126,1.7915311625929538]
[null,"Flush to unknown place / Not sure / DK where",0,9.6880546649771207E-2,0,2.3141447583271326E-2,0.1615234718707273,0,0,6.2183920704153885E-2,0,0,0,5.1515516970837734E-2,0.10282953151495944,0,0.25724515076325988,0.18658298236241769,0,0,0,null,null,null,null,null,null,null,null,null,null,null,null,null,null,null,null,null,null,null,null,null,null,null,null,null,null,null,null,null,null,null,null,"Flush to unknown place / Not sure / DK where",0,5.5767736434617028,0,1.333092518184045,9.294622739102838,0,0,1.333092518184045,0,0,0,1.8589245478205676,3.7178490956411352,0,9.294622739102838,16.204488900748586,0,0,0]
[null,"Ventilated Improved Pit latrine (VIP)",0.23127299147342159,1.0952237294012335,1.3936711346607473,3.4213004231798085,0.95280888109733564,0.94249073088614321,1.9535932070760824,1.272382648006634,0.43733501984853174,3.4750952347410873E-2,7.6773650833198911E-2,0.59233812202483671,1.5548184700927443,0.92433503838030473,5.4047376363124346,1.7660840675205243,0.47150784437761017,1.3648410542425278,1.9061867277815128,null,null,null,null,null,null,null,null,null,null,null,null,null,null,null,null,null,null,null,null,null,null,null,null,null,null,null,null,null,null,null,null,"Ventilated Improved Pit latrine (VIP)",13.321299625159565,63.044801449136479,80.240649198322728,197.08836191811685,54.827939182450109,20.192691246183049,41.867398615826822,27.277208788341014,9.3685938108051907,0.74457984610448269,2.7804997025360372,21.374373012023327,56.215178244583328,33.421889446327249,195.28063866045522,153.38210005849766,25.940352285195157,123.9112469984008,105.28935203109215]
[null,"Pit latrine with slab",57.277916959056618,58.129900221501799,51.082248384174754,36.789374453984841,12.98126723131386,47.561909708128326,26.96972687274295,13.673565841858936,7.8484688952889874,1.1570933364113589,55.46263075794834,61.16944746105397,59.723337188140448,59.373292087491606,51.134519486506768,51.120912652666753,6.878663927301119,55.206505404539961,47.476531445606859,null,null,null,null,null,null,null,null,null,null,null,null,null,null,null,null,null,null,null,null,null,null,null,null,null,null,null,null,null,null,null,null,"Pit latrine with slab",3299.201903583667,3346.1546890755017,2941.0616830016488,2119.2987023305959,746.98729660235006,1019.005202217837,577.98742412249339,293.13250297293382,168.12995479339341,24.792079645491558,2008.6817111171608,2207.2842154790587,2159.3247764752896,2146.8055648845807,1847.5608428855276,4439.7846533893417,378.43477611955535,5012.0905330599244,2622.3943120249637]
[null,"Pit latrine without slab / Open pit",35.538743393340823,29.776308942510177,21.776843878327202,11.062029575249268,2.6041843975059629,11.68792223031924,6.5152584941605935,2.5853094442547699,1.119393736690568,0,38.958938174256879,34.115451695692002,32.421144920314674,26.768045181086087,15.233766114596541,28.655242277703678,0.90389854656384927,17.644368790961053,30.083049366443955,null,null,null,null,null,null,null,null,null,null,null,null,null,null,null,null,null,null,null,null,null,null,null,null,null,null,null,null,null,null,null,null,"Pit latrine without slab / Open pit",2047.0278264150866,1714.025577399608,1253.8023116284535,637.24228182491254,149.85383385795319,250.41159257273014,139.62831334187268,55.423598870895283,23.979660346078639,0,1410.9699724973668,1231.0475434616874,1172.2014342164598,967.87269722481881,550.41701859410023,2488.6704540683818,49.728646103211133,1601.8976954067682,1661.6550355476463]
[null,"Composting toilet",0.15131247824088354,0,0.13596089646278137,0.10728334842137326,0,0.2030093962018798,0,0.12442036732850062,0,0,0,0.22140412275392637,0,0.1162899012076479,9.7225250574753619E-2,6.1654931027880187E-2,0.10546035845935403,0,0.20941385621529771,null,null,null,null,null,null,null,null,null,null,null,null,null,null,null,null,null,null,null,null,null,null,null,null,null,null,null,null,null,null,null,null,"Composting toilet",8.7155825971312915,0,7.8279518936977697,6.1801937234752415,0,4.349439122572992,0,2.6673110816612606,0,0,0,7.9893124048223854,0,4.2047829634336837,3.5128826418139814,5.3546504234618997,5.8019795071908034,0,11.5670982836516]
[null,"Bucket",2.9913144553587765,1.5142435723126026,1.2817955390882019,0.24213443583294242,0.21803824949558218,1.0047794288085288,0.15354872782434517,0,0,0,3.4426983867591701,1.6995018303597176,2.2255531437329434,1.2015704371015581,0.69245212949506585,0.37695768567686061,6.4431043527784213E-2,3.4578273244711237,0.17283375540359652,null,null,null,null,null,null,null,null,null,null,null,null,null,null,null,null,null,null,null,null,null,null,null,null,null,null,null,null,null,null,null,null,"Bucket",172.29939336640916,87.165008207291734,73.799409084402129,13.948462110769144,12.546679738148267,21.527215187963264,3.290698274077585,0,0,0,124.68368686937322,61.326098567739749,80.465899443732127,43.446101947139027,25.019252216995465,32.738283825572196,3.5447214444961448,313.92937247052078,9.5465747664311476]
[null,"Hanging toilet, Hanging latrine",0.10116290717348947,0,0,0,0,6.92990635392048E-2,0,0,0,0,7.1411960482174575E-2,4.8661463482484506E-2,0,0,0,0,0,4.7828467473506671E-2,2.6879765236006829E-2,null,null,null,null,null,null,null,null,null,null,null,null,null,null,null,null,null,null,null,null,null,null,null,null,null,null,null,null,null,null,null,null,"Hanging toilet, Hanging latrine",5.826972656100784,0,0,0,0,1.4847197408308825,0,0,0,0,2.5863161738862983,1.755936741383604,0,0,0,0,0,4.3422529152699028,1.4847197408308825]
[null,"No facility, Bush, Field",0.51599946027185328,0,0,0,0,5.6332010787933436E-2,0,0,0,0,0.78732998005908894,0,0,0,0,6.3893997716739787E-2,0,0.25295732638683444,2.1850096493659342E-2,null,null,null,null,null,null,null,null,null,null,null,null,null,null,null,null,null,null,null,null,null,null,null,null,null,null,null,null,null,null,null,null,"No facility, Bush, Field",29.721513839163226,0,0,0,0,1.2069030111817689,0,0,0,0,28.514610827981453,0,0,0,0,5.5491104478878448,0,22.965500380093609,1.2069030111817689]
[null,"Other",3.4535238496428262E-2,0,8.1254951591750918E-2,1.7265707283306848E-2,0,9.2846817310180227E-2,0.21829416324371811,4.6395082621469776E-2,0,0,0,0,0,0,0,6.2987377248031953E-2,0,2.4141100355224876E-2,0,null,null,null,null,null,null,null,null,null,null,null,null,null,null,null,null,null,null,null,null,null,null,null,null,null,null,null,null,null,null,null,null,"Other",1.9892260514567541,0,4.6782557980491513,0.99461302572837706,0,1.9892260514567541,4.6782557980491513,0.99461302572837706,0,0,0,0,0,0,0,5.4703716415060741,0,2.1917232337282089,0]
[null,null,null,null,null,null,null,null,null,null,null,null,null,null,null,null,null,null,null,null,null,null,null,null,null,null,null,null,null,null,null,null,null,null,null,null,null,null,null,null,null,null,null,null,null,null,null,null,null,null,null,null,null,"Total",5759.9893270245866,5756.3399839413196,5757.502412350329,5760.6271750593578,5754.3480408479818,2142.481680132556,2143.0970615673473,2143.7897499682654,2142.2006895422974,2142.6170962476021,3621.6848780280711,3608.4749938021209,3615.5460798732415,3615.776537573628,3613.1381724884627,8684.8697001064556,5501.5738538637443,9078.8042031143486,5523.5591821390763]
[]
[]
[]
[]
[]
[]
[]
[]
[]
[]
[]
[]
[]
[]
[]
[]
[]
[]
[]
[]
[]
[]
[]
[]
[]
[]
[]
[]
[]
[]
[]
[]
[]
[]
[]
[]
[]
[]
[]
[]
[]
[{"$f":"A1026","v":"Republic of Moldova"}]
[{"$f":"A1034","v":"2012"}]
["Access to hygiene facilities "]
[" by wealth quintile and sub-national region"]
["Notes:"]
["WHO/UNICEF JMP customised wealth index excludes water,"]
[" sanitation and hygiene assets."]
["Survey used for analysis:",{"$f":"A1025","v":"MICS12"}]
[]
[]
[]
[]
["Access to handwashing",null,"NATIONAL wealth index quintile",null,null,null,null,"URBAN wealth index quintile",null,null,null,null,"RURAL wealth index quintile",null,null,null,null,"SUB-REGIONS:",null,null,null,null,null,null,null,null,null,null,null,null,null,null,null,null,null,null,null,null,null,null,null,null,null,null,null,null,null,null,null,null,null,null,"Raw numbers of respondents:","Access to handwashing","NATIONAL wealth index quintile",null,null,null,null,"URBAN wealth index quintile",null,null,null,null,"RURAL wealth index quintile",null,null,null,null,"SUB-REGIONS:"]
["Weighted percentage (used in graphs)",null,"Poorest","Poor","Middle","Rich","Richest","Poorest","Poor","Middle","Rich","Richest","Poorest","Poor","Middle","Rich","Richest","Center","Chisinau","North","South",null,null,null,null,null,null,null,null,null,null,null,null,null,null,null,null,null,null,null,null,null,null,null,null,null,null,null,null,null,null,null,"Hygiene data, raw numbers (weighted)",null,"Poorest","Poor","Middle","Rich","Richest","Poorest","Poor","Middle","Rich","Richest","Poorest","Poor","Middle","Rich","Richest","Center","Chisinau","North","South"]
["Hygiene ladder","Basic",72.852498028053716,81.851618821472741,88.390083738150423,93.168101215035534,95.651510025840594,85.640528573677145,93.831175763466518,95.05829983803963,96.002782377049996,96.539867548516369,69.062973150833457,79.19144132955492,83.311402922459237,86.890784844587856,92.840205738519828,82.551795697515345,94.622440019290195,87.466239620317438,82.527947315591646,null,null,null,null,null,null,null,null,null,null,null,null,null,null,null,null,null,null,null,null,null,null,null,null,null,null,null,null,null,null,null,"Hygiene ladder","Basic",4070.9441793792653,4615.5487821848783,4928.7550036092771,5128.3506076743315,5221.9241346265635,1753.7800034134459,1879.0324594051758,1899.1609498574517,1938.1447377836798,1965.4567752746782,2432.9472444262065,2782.2776515975497,2987.6359126032689,3069.6531970127248,3257.4337761001416,6996.1102545446138,4740.8133023950231,7832.8250142359275,4395.7741362988072]
[null,"Limited",16.007148715603872,10.597601218625458,5.1307183613672427,2.0641670691412783,0.84248025588061992,8.9695580320444126,1.1721807378847198,1.2153065566933596,0.33645791402789493,0.61898432812542448,18.589024904572526,11.230051355278825,10.024182609075686,5.2870390558470728,2.6014407203721825,11.032771533345793,2.5885940189973939,4.9407299319284608,8.0844657626278185,null,null,null,null,null,null,null,null,null,null,null,null,null,null,null,null,null,null,null,null,null,null,null,null,null,null,null,null,null,null,null,null,"Limited",894.46773489019859,597.59044601663777,286.09604976292269,113.6201372070431,45.993711755735667,183.68209279001331,23.473708358160369,24.280496900430876,6.792554542822578,12.601912271026901,654.85331509513878,394.55173927266435,359.47789746431039,186.77902805849706,91.275334879473689,935.00674828823344,129.69482669503347,442.45497654164456,430.6115281076261]
[null,"No facility",11.14035325634257,7.5507799599019556,6.4791979004823101,4.7677317158231105,3.5060097182789698,5.3899133942783015,4.996643498648802,3.7263936052670212,3.6607597089220594,2.8411481233582756,12.348001944594131,9.5785073151662505,6.6644144684650897,7.8221760995650218,4.558353541107909,6.4154327691392146,2.788965961712222,7.593030447754165,9.387586921780839,null,null,null,null,null,null,null,null,null,null,null,null,null,null,null,null,null,null,null,null,null,null,null,null,null,null,null,null,null,null,null,null,"No facility",622.51477262554226,425.78257767247408,361.28915960731888,262.43531340878906,191.40436736618406,110.37673971014009,100.06114967273514,74.449271983398418,73.904963902732931,57.842982079990207,434.99484506202697,336.52710938479498,238.99302261169251,276.33963618320206,159.93647008959462,543.69592574310661,139.73394607575895,679.97525769026527,500.02106117117734]
["Place where household members most often wash their hands","Observed",86.205227689795421,90.5634351470692,90.574882646786236,90.996528426218859,91.546736641358891,90.430742730252462,88.773681877569459,89.721552535007447,90.791553836258814,92.319747238548061,85.258675547790432,88.03800487260412,92.575609219864447,90.061766573009933,92.681457257231685,91.321082257982724,88.529360115188112,91.149448822113271,87.378183255698289,null,null,null,null,null,null,null,null,null,null,null,null,null,null,null,null,null,null,null,null,null,null,null,null,null,null,null,null,null,null,null,"Observed handwashing place","Fixed","N/A","N/A","N/A","N/A","N/A","N/A","N/A","N/A","N/A","N/A","N/A","N/A","N/A","N/A","N/A","N/A","N/A","N/A","N/A"]
[null,"Not in dwelling/plot/yard",4.7000207548598665,2.6885032725224036,2.2469936914479063,1.059214850787308,0.8387662343856237,3.4866060026090828,1.3705729955656156,1.0407268839811681,0.98840349465639143,0.92776728122750862,5.295609566132458,3.1841467419169822,2.4521574787916247,2.4123134066277898,0.39095882221764816,1.9661196538849506,1.2122832319131289,3.5416530872716145,1.9035626372892245,null,null,null,null,null,null,null,null,null,null,null,null,null,null,null,null,null,null,null,null,null,null,null,null,null,null,null,null,null,null,null,null,"Mobile","N/A","N/A","N/A","N/A","N/A","N/A","N/A","N/A","N/A","N/A","N/A","N/A","N/A","N/A","N/A","N/A","N/A","N/A","N/A"]
[null,"No permission to see",2.9302468145793048,2.0398061684143811,3.1500151694556382,4.4477989806127489,5.1270070041858551,4.2643122091464534,6.5573205549777249,6.8056595209089545,5.7584909721703443,4.9806111791415866,2.7304825454208572,2.6359748567050438,0.81424068573901476,2.2956251708769289,2.8920175877825178,2.4186519635169996,8.8711167987106467,1.360850524831545,3.5693010622389192,null,null,null,null,null,null,null,null,null,null,null,null,null,null,null,null,null,null,null,null,null,null,null,null,null,null,null,null,null,null,null,"Water / Soap","Water and soap","N/A","N/A","N/A","N/A","N/A","N/A","N/A","N/A","N/A","N/A","N/A","N/A","N/A","N/A","N/A","N/A","N/A","N/A","N/A"]
[null,"Other reason",6.1075474068525386,4.7082554119940738,4.0281084923101593,3.4964577423810721,2.4874901200697455,1.6652111976813346,3.2984245718873364,2.4320610601024581,2.4615516969145466,1.7718743010828104,6.7152323406562946,6.141873528773834,4.1579926156049458,5.230294849485297,4.0355663327681137,4.2941461246153532,1.327607166497577,3.9480475657836624,7.1489530447738909,null,null,null,null,null,null,null,null,null,null,null,null,null,null,null,null,null,null,null,null,null,null,null,null,null,null,null,null,null,null,null,null,"Water only","N/A","N/A","N/A","N/A","N/A","N/A","N/A","N/A","N/A","N/A","N/A","N/A","N/A","N/A","N/A","N/A","N/A","N/A","N/A"]
[null,"Missing",5.6957333912871867E-2,0,0,0,0,0.15312786031086131,0,0,0,0,0,0,0,0,0,0,5.9632687690543681E-2,0,0,null,null,null,null,null,null,null,null,null,null,null,null,null,null,null,null,null,null,null,null,null,null,null,null,null,null,null,null,null,null,null,null,"Soap only","N/A","N/A","N/A","N/A","N/A","N/A","N/A","N/A","N/A","N/A","N/A","N/A","N/A","N/A","N/A","N/A","N/A","N/A","N/A"]
[null,null,null,null,null,null,null,null,null,null,null,null,null,null,null,null,null,null,null,null,null,null,null,null,null,null,null,null,null,null,null,null,null,null,null,null,null,null,null,null,null,null,null,null,null,null,null,null,null,null,null,null,null,"Neither","N/A","N/A","N/A","N/A","N/A","N/A","N/A","N/A","N/A","N/A","N/A","N/A","N/A","N/A","N/A","N/A","N/A","N/A","N/A"]
[null,null,null,null,null,null,null,null,null,null,null,null,null,null,null,null,null,null,null,null,null,null,null,null,null,null,null,null,null,null,null,null,null,null,null,null,null,null,null,null,null,null,null,null,null,null,null,null,null,null,null,null,"Place where household members most often wash their hands","Observed",4965.4119142694599,5213.1392282015104,5214.8510533721974,5241.970744881377,5267.9178463822973,1937.4620962034624,1902.5061677633357,1923.441446757882,1944.9372923265023,1978.0586875457045,3087.8005595213426,3176.8293908702121,3347.1138100675798,3256.4322250712216,3348.7091109796165,7931.1170028328334,4870.5081290900671,8275.2799907775825,4826.3856644064317]
[null,null,null,null,null,null,null,null,null,null,null,null,null,null,null,null,null,null,null,null,null,null,null,null,null,null,null,null,null,null,null,null,null,null,null,null,null,null,null,null,null,null,null,null,null,null,null,null,null,null,null,null,null,"Not in dwelling/plot/yard",270.72069384786874,154.75938884577798,129.37071599047292,61.01741853671809,48.265528375663536,74.699894864301626,29.372709594602277,22.310996263952404,21.173586477989382,19.87850038097217,191.79029085602718,114.89913894803925,88.658883596769101,87.223862169590731,14.125882444257149,170.75493008809198,66.694657321707083,321.5397493469444,105.14440883975772]
[null,null,null,null,null,null,null,null,null,null,null,null,null,null,null,null,null,null,null,null,null,null,null,null,null,null,null,null,null,null,null,null,null,null,null,null,null,null,null,null,null,null,null,null,null,null,null,null,null,null,null,null,null,"No permission to see",168.78190377524589,117.41817806733843,181.36219937080969,256.22111676919116,295.02582709950758,91.36210786461865,140.5297441312793,145.89903122698553,123.35843331306405,106.71542662190691,98.889473444703142,95.118493547112791,29.439247193969951,83.004676319202488,104.49259141925019,210.05677153051775,488.0510423435793,123.54895464650998,197.15245656148539]
[null,null,null,null,null,null,null,null,null,null,null,null,null,null,null,null,null,null,null,null,null,null,null,null,null,null,null,null,null,null,null,null,null,null,null,null,null,null,null,null,null,null,null,null,null,null,null,null,null,null,null,null,null,"Other reason",351.79407877767312,271.02318882669596,231.91844361684588,201.41789487207095,143.13883899052053,35.676844845838517,70.688440078132871,52.138275719446028,52.731377424743542,37.964481699018009,243.20455420599953,221.6279704367557,150.33413901492347,189.11577401361126,145.81058764533751,372.94099565501438,73.039288754051995,358.43550834332086,394.87665233141934]
[null,null,null,null,null,null,null,null,null,null,null,null,null,null,null,null,null,null,null,null,null,null,null,null,null,null,null,null,null,null,null,null,null,null,null,null,null,null,null,null,null,null,null,null,null,null,null,null,null,null,null,null,null,"Missing",3.280736354339175,0,0,0,0,3.280736354339175,0,0,0,0,0,0,0,0,0,0,3.280736354339175,0,0]
[null,null,null,null,null,null,null,null,null,null,null,null,null,null,null,null,null,null,null,null,null,null,null,null,null,null,null,null,null,null,null,null,null,null,null,null,null,null,null,null,null,null,null,null,null,null,null,null,null,null,null,null,null,"Total",5759.9893270245866,5756.3399839413196,5757.502412350329,5760.6271750593578,5754.3480408479818,2142.481680132556,2143.0970615673473,2143.7897499682654,2142.2006895422974,2142.6170962476021,3621.6848780280711,3608.4749938021209,3615.5460798732415,3615.776537573628,3613.1381724884627,8684.8697001064556,5501.5738538637443,9078.8042031143486,5523.5591821390763]
[]
[]
[]
[]
[]
[]
[]
[]
[]
[]
[]
[]
[]
[]
[]
[]
[]
[]
[]
[]
[]
[]
[null,null,null,null,null,null,null,null,null,null,null,null,null,null,null,null,null,null,null,null,null,null,null,null,null,null,null,null,null,null,null,null,null,null,null,null,null,null,null,null,null,null,null,null,null,null,null,null,null,null,null,null,"Raw numbers of respondents:","Menstrual health and hygiene","NATIONAL wealth index quintile",null,null,null,null,"URBAN wealth index quintile",null,null,null,null,"RURAL wealth index quintile",null,null,null,null,"SUB-REGIONS:"]
[null,null,null,null,null,null,null,null,null,null,null,null,null,null,null,null,null,null,null,null,null,null,null,null,null,null,null,null,null,null,null,null,null,null,null,null,null,null,null,null,null,null,null,null,null,null,null,null,null,null,null,null,"MHH data, raw numbers (weighted)",null,"Poorest","Poor","Middle","Rich","Richest","Poorest","Poor","Middle","Rich","Richest","Poorest","Poor","Middle","Rich","Richest","Center","Chisinau","North","South"]
[null,null,null,null,null,null,null,null,null,null,null,null,null,null,null,null,null,null,null,null,null,null,null,null,null,null,null,null,null,null,null,null,null,null,null,null,null,null,null,null,null,null,null,null,null,null,null,null,null,null,null,null,"Private place to wash and change","Yes","N/A","N/A","N/A","N/A","N/A","N/A","N/A","N/A","N/A","N/A","N/A","N/A","N/A","N/A","N/A","N/A","N/A","N/A","N/A"]
[null,null,null,null,null,null,null,null,null,null,null,null,null,null,null,null,null,null,null,null,null,null,null,null,null,null,null,null,null,null,null,null,null,null,null,null,null,null,null,null,null,null,null,null,null,null,null,null,null,null,null,null,null,"No","N/A","N/A","N/A","N/A","N/A","N/A","N/A","N/A","N/A","N/A","N/A","N/A","N/A","N/A","N/A","N/A","N/A","N/A","N/A"]
[null,null,null,null,null,null,null,null,null,null,null,null,null,null,null,null,null,null,null,null,null,null,null,null,null,null,null,null,null,null,null,null,null,null,null,null,null,null,null,null,null,null,null,null,null,null,null,null,null,null,null,null,null,"DK/not sure/missing","N/A","N/A","N/A","N/A","N/A","N/A","N/A","N/A","N/A","N/A","N/A","N/A","N/A","N/A","N/A","N/A","N/A","N/A","N/A"]
[null,null,null,null,null,null,null,null,null,null,null,null,null,null,null,null,null,null,null,null,null,null,null,null,null,null,null,null,null,null,null,null,null,null,null,null,null,null,null,null,null,null,null,null,null,null,null,null,null,null,null,null,"Use of menstrual materials","Materials reusable","N/A","N/A","N/A","N/A","N/A","N/A","N/A","N/A","N/A","N/A","N/A","N/A","N/A","N/A","N/A","N/A","N/A","N/A","N/A"]
[null,null,null,null,null,null,null,null,null,null,null,null,null,null,null,null,null,null,null,null,null,null,null,null,null,null,null,null,null,null,null,null,null,null,null,null,null,null,null,null,null,null,null,null,null,null,null,null,null,null,null,null,null,"Materials not reusable","N/A","N/A","N/A","N/A","N/A","N/A","N/A","N/A","N/A","N/A","N/A","N/A","N/A","N/A","N/A","N/A","N/A","N/A","N/A"]
[null,null,null,null,null,null,null,null,null,null,null,null,null,null,null,null,null,null,null,null,null,null,null,null,null,null,null,null,null,null,null,null,null,null,null,null,null,null,null,null,null,null,null,null,null,null,null,null,null,null,null,null,null,"No materials used","N/A","N/A","N/A","N/A","N/A","N/A","N/A","N/A","N/A","N/A","N/A","N/A","N/A","N/A","N/A","N/A","N/A","N/A","N/A"]
[null,null,null,null,null,null,null,null,null,null,null,null,null,null,null,null,null,null,null,null,null,null,null,null,null,null,null,null,null,null,null,null,null,null,null,null,null,null,null,null,null,null,null,null,null,null,null,null,null,null,null,null,null,"DK/not sure/missing","N/A","N/A","N/A","N/A","N/A","N/A","N/A","N/A","N/A","N/A","N/A","N/A","N/A","N/A","N/A","N/A","N/A","N/A","N/A"]
[null,null,null,null,null,null,null,null,null,null,null,null,null,null,null,null,null,null,null,null,null,null,null,null,null,null,null,null,null,null,null,null,null,null,null,null,null,null,null,null,null,null,null,null,null,null,null,null,null,null,null,null,"Use of menstrual materials with private place to wash and change","Materials reusable","N/A","N/A","N/A","N/A","N/A","N/A","N/A","N/A","N/A","N/A","N/A","N/A","N/A","N/A","N/A","N/A","N/A","N/A","N/A"]
[null,null,null,null,null,null,null,null,null,null,null,null,null,null,null,null,null,null,null,null,null,null,null,null,null,null,null,null,null,null,null,null,null,null,null,null,null,null,null,null,null,null,null,null,null,null,null,null,null,null,null,null,null,"Materials not reusable","N/A","N/A","N/A","N/A","N/A","N/A","N/A","N/A","N/A","N/A","N/A","N/A","N/A","N/A","N/A","N/A","N/A","N/A","N/A"]
[null,null,null,null,null,null,null,null,null,null,null,null,null,null,null,null,null,null,null,null,null,null,null,null,null,null,null,null,null,null,null,null,null,null,null,null,null,null,null,null,null,null,null,null,null,null,null,null,null,null,null,null,null,"No materials used","N/A","N/A","N/A","N/A","N/A","N/A","N/A","N/A","N/A","N/A","N/A","N/A","N/A","N/A","N/A","N/A","N/A","N/A","N/A"]
[null,null,null,null,null,null,null,null,null,null,null,null,null,null,null,null,null,null,null,null,null,null,null,null,null,null,null,null,null,null,null,null,null,null,null,null,null,null,null,null,null,null,null,null,null,null,null,null,null,null,null,null,"Awareness of menstruation before menarche","Yes","N/A","N/A","N/A","N/A","N/A","N/A","N/A","N/A","N/A","N/A","N/A","N/A","N/A","N/A","N/A","N/A","N/A","N/A","N/A"]
[null,null,null,null,null,null,null,null,null,null,null,null,null,null,null,null,null,null,null,null,null,null,null,null,null,null,null,null,null,null,null,null,null,null,null,null,null,null,null,null,null,null,null,null,null,null,null,null,null,null,null,null,null,"No","N/A","N/A","N/A","N/A","N/A","N/A","N/A","N/A","N/A","N/A","N/A","N/A","N/A","N/A","N/A","N/A","N/A","N/A","N/A"]
[null,null,null,null,null,null,null,null,null,null,null,null,null,null,null,null,null,null,null,null,null,null,null,null,null,null,null,null,null,null,null,null,null,null,null,null,null,null,null,null,null,null,null,null,null,null,null,null,null,null,null,null,null,"DK/not sure/missing","N/A","N/A","N/A","N/A","N/A","N/A","N/A","N/A","N/A","N/A","N/A","N/A","N/A","N/A","N/A","N/A","N/A","N/A","N/A"]
[null,null,null,null,null,null,null,null,null,null,null,null,null,null,null,null,null,null,null,null,null,null,null,null,null,null,null,null,null,null,null,null,null,null,null,null,null,null,null,null,null,null,null,null,null,null,null,null,null,null,null,null,"Participation in (all) activities during menstruation","Yes","N/A","N/A","N/A","N/A","N/A","N/A","N/A","N/A","N/A","N/A","N/A","N/A","N/A","N/A","N/A","N/A","N/A","N/A","N/A"]
[null,null,null,null,null,null,null,null,null,null,null,null,null,null,null,null,null,null,null,null,null,null,null,null,null,null,null,null,null,null,null,null,null,null,null,null,null,null,null,null,null,null,null,null,null,null,null,null,null,null,null,null,null,"No","N/A","N/A","N/A","N/A","N/A","N/A","N/A","N/A","N/A","N/A","N/A","N/A","N/A","N/A","N/A","N/A","N/A","N/A","N/A"]
[null,null,null,null,null,null,null,null,null,null,null,null,null,null,null,null,null,null,null,null,null,null,null,null,null,null,null,null,null,null,null,null,null,null,null,null,null,null,null,null,null,null,null,null,null,null,null,null,null,null,null,null,null,"DK/not sure/missing/no such activity","N/A","N/A","N/A","N/A","N/A","N/A","N/A","N/A","N/A","N/A","N/A","N/A","N/A","N/A","N/A","N/A","N/A","N/A","N/A"]
[null,null,null,null,null,null,null,null,null,null,null,null,null,null,null,null,null,null,null,null,null,null,null,null,null,null,null,null,null,null,null,null,null,null,null,null,null,null,null,null,null,null,null,null,null,null,null,null,null,null,null,null,"Participation in specific activities during menstruation","Did not go to school (amongst those usually attending school)","N/A","N/A","N/A","N/A","N/A","N/A","N/A","N/A","N/A","N/A","N/A","N/A","N/A","N/A","N/A","N/A","N/A","N/A","N/A"]
[null,null,null,null,null,null,null,null,null,null,null,null,null,null,null,null,null,null,null,null,null,null,null,null,null,null,null,null,null,null,null,null,null,null,null,null,null,null,null,null,null,null,null,null,null,null,null,null,null,null,null,null,null,"Did not go to work (amongst those who usually work)","N/A","N/A","N/A","N/A","N/A","N/A","N/A","N/A","N/A","N/A","N/A","N/A","N/A","N/A","N/A","N/A","N/A","N/A","N/A"]
[null,null,null,null,null,null,null,null,null,null,null,null,null,null,null,null,null,null,null,null,null,null,null,null,null,null,null,null,null,null,null,null,null,null,null,null,null,null,null,null,null,null,null,null,null,null,null,null,null,null,null,null,null,"Did not participate in social activities","N/A","N/A","N/A","N/A","N/A","N/A","N/A","N/A","N/A","N/A","N/A","N/A","N/A","N/A","N/A","N/A","N/A","N/A","N/A"]
[null,null,null,null,null,null,null,null,null,null,null,null,null,null,null,null,null,null,null,null,null,null,null,null,null,null,null,null,null,null,null,null,null,null,null,null,null,null,null,null,null,null,null,null,null,null,null,null,null,null,null,null,null,"Did not cook food","N/A","N/A","N/A","N/A","N/A","N/A","N/A","N/A","N/A","N/A","N/A","N/A","N/A","N/A","N/A","N/A","N/A","N/A","N/A"]
[null,null,null,null,null,null,null,null,null,null,null,null,null,null,null,null,null,null,null,null,null,null,null,null,null,null,null,null,null,null,null,null,null,null,null,null,null,null,null,null,null,null,null,null,null,null,null,null,null,null,null,null,null,"Did not eat with others","N/A","N/A","N/A","N/A","N/A","N/A","N/A","N/A","N/A","N/A","N/A","N/A","N/A","N/A","N/A","N/A","N/A","N/A","N/A"]
[null,null,null,null,null,null,null,null,null,null,null,null,null,null,null,null,null,null,null,null,null,null,null,null,null,null,null,null,null,null,null,null,null,null,null,null,null,null,null,null,null,null,null,null,null,null,null,null,null,null,null,null,null,"Did not bathe in regular place","N/A","N/A","N/A","N/A","N/A","N/A","N/A","N/A","N/A","N/A","N/A","N/A","N/A","N/A","N/A","N/A","N/A","N/A","N/A"]
[null,null,null,null,null,null,null,null,null,null,null,null,null,null,null,null,null,null,null,null,null,null,null,null,null,null,null,null,null,null,null,null,null,null,null,null,null,null,null,null,null,null,null,null,null,null,null,null,null,null,null,null,null,"Did not participate in other activities","N/A","N/A","N/A","N/A","N/A","N/A","N/A","N/A","N/A","N/A","N/A","N/A","N/A","N/A","N/A","N/A","N/A","N/A","N/A"]
[null,null,null,null,null,null,null,null,null,null,null,null,null,null,null,null,null,null,null,null,null,null,null,null,null,null,null,null,null,null,null,null,null,null,null,null,null,null,null,null,null,null,null,null,null,null,null,null,null,null,null,null,null,"DK/not sure/missing/no such activity","N/A","N/A","N/A","N/A","N/A","N/A","N/A","N/A","N/A","N/A","N/A","N/A","N/A","N/A","N/A","N/A","N/A","N/A","N/A"]
[]
[]
[]
[]
[]
[]
[]
[]
[]
[]
[]
[]
[]
[]
[]
[]
[]
[]
[]
[]
[]
[]
[]
[]
[]
[]
[]
[]
[]
[]
[]
[]
[]
[]
[]
[]
[]
[]
[]
[]
[]
[]
[]
[]
[]
[]
[]
[]
[]
[]
[]
[]
[]
[]
[null,null,null,null,null,null,null,null,null,null,null,null,null,null,null,null,null,null,null,null,null,null,null,null,null,null,null,null,null,null,null,null,null,null,null,null,null,null,null,null,null,null,null,null,null,null,null,null,null,null,null,null,"Raw numbers of respondents:","Basic water, sanitation and hygiene","NATIONAL wealth index quintile",null,null,null,null,"URBAN wealth index quintile",null,null,null,null,"RURAL wealth index quintile",null,null,null,null,"SUB-REGIONS:"]
[null,null,null,null,null,null,null,null,null,null,null,null,null,null,null,null,null,null,null,null,null,null,null,null,null,null,null,null,null,null,null,null,null,null,null,null,null,null,null,null,null,null,null,null,null,null,null,null,null,null,null,null,"WatSan data, raw numbers (weighted)",null,"Poorest","Poor","Middle","Rich","Richest","Poorest","Poor","Middle","Rich","Richest","Poorest","Poor","Middle","Rich","Richest","Center","Chisinau","North","South"]
[null,null,null,null,null,null,null,null,null,null,null,null,null,null,null,null,null,null,null,null,null,null,null,null,null,null,null,null,null,null,null,null,null,null,null,null,null,null,null,null,null,null,null,null,null,null,null,null,null,null,null,null,"Use of Basic Water Sanitation and Hygiene","Yes","N/A","N/A","N/A","N/A","N/A","N/A","N/A","N/A","N/A","N/A","N/A","N/A","N/A","N/A","N/A","N/A","N/A","N/A","N/A"]
[null,null,null,null,null,null,null,null,null,null,null,null,null,null,null,null,null,null,null,null,null,null,null,null,null,null,null,null,null,null,null,null,null,null,null,null,null,null,null,null,null,null,null,null,null,null,null,null,null,null,null,null,null,"No","N/A","N/A","N/A","N/A","N/A","N/A","N/A","N/A","N/A","N/A","N/A","N/A","N/A","N/A","N/A","N/A","N/A","N/A","N/A"]
[null,null,null,null,null,null,null,null,null,null,null,null,null,null,null,null,null,null,null,null,null,null,null,null,null,null,null,null,null,null,null,null,null,null,null,null,null,null,null,null,null,null,null,null,null,null,null,null,null,null,null,null,"Use of Basic Water and Sanitation","Yes","N/A","N/A","N/A","N/A","N/A","N/A","N/A","N/A","N/A","N/A","N/A","N/A","N/A","N/A","N/A","N/A","N/A","N/A","N/A"]
[null,null,null,null,null,null,null,null,null,null,null,null,null,null,null,null,null,null,null,null,null,null,null,null,null,null,null,null,null,null,null,null,null,null,null,null,null,null,null,null,null,null,null,null,null,null,null,null,null,null,null,null,null,"No","N/A","N/A","N/A","N/A","N/A","N/A","N/A","N/A","N/A","N/A","N/A","N/A","N/A","N/A","N/A","N/A","N/A","N/A","N/A"]
[null,null,null,null,null,null,null,null,null,null,null,null,null,null,null,null,null,null,null,null,null,null,null,null,null,null,null,null,null,null,null,null,null,null,null,null,null,null,null,null,null,null,null,null,null,null,null,null,null,null,null,null,"Use of Basic Water and Hygiene","Yes","N/A","N/A","N/A","N/A","N/A","N/A","N/A","N/A","N/A","N/A","N/A","N/A","N/A","N/A","N/A","N/A","N/A","N/A","N/A"]
[null,null,null,null,null,null,null,null,null,null,null,null,null,null,null,null,null,null,null,null,null,null,null,null,null,null,null,null,null,null,null,null,null,null,null,null,null,null,null,null,null,null,null,null,null,null,null,null,null,null,null,null,null,"No","N/A","N/A","N/A","N/A","N/A","N/A","N/A","N/A","N/A","N/A","N/A","N/A","N/A","N/A","N/A","N/A","N/A","N/A","N/A"]
[null,null,null,null,null,null,null,null,null,null,null,null,null,null,null,null,null,null,null,null,null,null,null,null,null,null,null,null,null,null,null,null,null,null,null,null,null,null,null,null,null,null,null,null,null,null,null,null,null,null,null,null,"Use of Basic Sanitation and Hygiene","Yes","N/A","N/A","N/A","N/A","N/A","N/A","N/A","N/A","N/A","N/A","N/A","N/A","N/A","N/A","N/A","N/A","N/A","N/A","N/A"]
[null,null,null,null,null,null,null,null,null,null,null,null,null,null,null,null,null,null,null,null,null,null,null,null,null,null,null,null,null,null,null,null,null,null,null,null,null,null,null,null,null,null,null,null,null,null,null,null,null,null,null,null,null,"No","N/A","N/A","N/A","N/A","N/A","N/A","N/A","N/A","N/A","N/A","N/A","N/A","N/A","N/A","N/A","N/A","N/A","N/A","N/A"]
[null,null,null,null,null,null,null,null,null,null,null,null,null,null,null,null,null,null,null,null,null,null,null,null,null,null,null,null,null,null,null,null,null,null,null,null,null,null,null,null,null,null,null,null,null,null,null,null,null,null,null,null,"Use of Basic Water","Yes","N/A","N/A","N/A","N/A","N/A","N/A","N/A","N/A","N/A","N/A","N/A","N/A","N/A","N/A","N/A","N/A","N/A","N/A","N/A"]
[null,null,null,null,null,null,null,null,null,null,null,null,null,null,null,null,null,null,null,null,null,null,null,null,null,null,null,null,null,null,null,null,null,null,null,null,null,null,null,null,null,null,null,null,null,null,null,null,null,null,null,null,null,"No","N/A","N/A","N/A","N/A","N/A","N/A","N/A","N/A","N/A","N/A","N/A","N/A","N/A","N/A","N/A","N/A","N/A","N/A","N/A"]
[null,null,null,null,null,null,null,null,null,null,null,null,null,null,null,null,null,null,null,null,null,null,null,null,null,null,null,null,null,null,null,null,null,null,null,null,null,null,null,null,null,null,null,null,null,null,null,null,null,null,null,null,"Use of Basic Sanitation","Yes","N/A","N/A","N/A","N/A","N/A","N/A","N/A","N/A","N/A","N/A","N/A","N/A","N/A","N/A","N/A","N/A","N/A","N/A","N/A"]
[null,null,null,null,null,null,null,null,null,null,null,null,null,null,null,null,null,null,null,null,null,null,null,null,null,null,null,null,null,null,null,null,null,null,null,null,null,null,null,null,null,null,null,null,null,null,null,null,null,null,null,null,null,"No","N/A","N/A","N/A","N/A","N/A","N/A","N/A","N/A","N/A","N/A","N/A","N/A","N/A","N/A","N/A","N/A","N/A","N/A","N/A"]
[null,null,null,null,null,null,null,null,null,null,null,null,null,null,null,null,null,null,null,null,null,null,null,null,null,null,null,null,null,null,null,null,null,null,null,null,null,null,null,null,null,null,null,null,null,null,null,null,null,null,null,null,"Access to Basic Hygiene","Yes","N/A","N/A","N/A","N/A","N/A","N/A","N/A","N/A","N/A","N/A","N/A","N/A","N/A","N/A","N/A","N/A","N/A","N/A","N/A"]
[null,null,null,null,null,null,null,null,null,null,null,null,null,null,null,null,null,null,null,null,null,null,null,null,null,null,null,null,null,null,null,null,null,null,null,null,null,null,null,null,null,null,null,null,null,null,null,null,null,null,null,null,null,"No","N/A","N/A","N/A","N/A","N/A","N/A","N/A","N/A","N/A","N/A","N/A","N/A","N/A","N/A","N/A","N/A","N/A","N/A","N/A"]
[]
[]
[]
[]
[]
[]
[]
[]
[]
[]
[]
[]
[]
[]
[]
[]
[]
[]
[]
[]
[]
[]
[]
[]
[]
[]
[]
[]
[]
[]
[]
[]
[]
[]
[]
[]
[]
[]
[]
[]
[]
[]
[]
[]
[null,null,"INITIAL (national) Wealth Index",null,null,null,null,"URBAN Wealth Index",null,null,null,null,"RURAL Wealth Index"]
[null,null,"Component Matrix",null,null,null,null,"Component Matrix",null,null,null,null,"Component Matrix"]
[null,null,null,null,"Component",null,null,null,null,"Component",null,null,null,null,"Component"]
[null,"Note:\n\nThe INITIAL (national) Wealth Index is based on the first component of the Principal Component Analysis (PCA) which has been obtained at national level.\n\nThe final national-level (NATIONAL) Wealth Index is based on the URBAN and RURAL specific wealth indexes. Regression procedures are used to establish the relationships between the two sets of scores (urban and rural) and the initial (national) wealth factors.\nThis allows best use of the available information for each area and a better precision of the FINAL (NATIONAL) Wealth Index.\n\nFor dependency reasons, all WASH variables (contained in the generic MICS and DHS scripts) have been excluded from the sets of asset variables used in the PCAs.\n\nThe PCA can extracts as many components as there are asset variables in the input. Only the first of the components is used to represent the Wealth Index. \n\nThe scores represent the weights of the asset variables on the Wealth Index (correlations between the variables and the component).\n\nThe communalities are the proportion of each variable's variance that can be explained by the component.\n\nProportion of explained variance is the part of the model's total variance that is explained by the component.\n\nFor more information on the procedure used:\n\nThe DHS Wealth Index, DHS Comparative Reports No. 6, Shea Oscar Rutstein, Kiersten Johnson, ORC Macro International Inc., 2004.\n\nThe DHS Wealth Index: Approaches for Rural and Urban Areas, Shea O. Rutstein, ORC Macro International Inc., 2008.\n\nMICS Methodological Paper No. 4, Review of options for reporting water, sanitation and hygiene coverage by wealth quintile, UNICEF, 2016.",null,null,"1",null,null,null,null,"1",null,null,null,null,"1"]
[null,null,"Household has: Vacuum cleaner",null,0.73725806786756931,null,null,"Household has: Vacuum cleaner",null,0.68719056569897041,null,null,"Household has: Vacuum cleaner",null,0.73847120461452509]
[null,null,"Household has: Computer",null,0.68272240164405684,null,null,"Household has: Washing machine",null,0.633823284424892,null,null,"Household has: Washing machine",null,0.68236385369267205]
[null,null,"Household has: Washing machine",null,0.6336448355744505,null,null,"Household has: Computer",null,0.63290021568404231,null,null,"Household has: Computer",null,0.65838086350679426]
[null,null,"Household has: Camera",null,0.6315011094140861,null,null,"Household has: Camera",null,0.60138069818488882,null,null,"Household member owns: mobile phone",null,0.6399878390718684]
[null,null,"Household has: Waterheater",null,0.61350523066390317,null,null,"Household has: Microwave",null,0.58033253901684512,null,null,"Household has: Camera",null,0.63832558608047463]
[null,null,"Household member owns: mobile phone",null,0.61195260161141185,null,null,"Household member owns: mobile phone",null,0.54637887630016002,null,null,"Household has: Microwave",null,0.61022030522183612]
[null,null,"Household has: Microwave",null,0.59766605250272575,null,null,"Household has: Waterheater",null,0.52459067356290601,null,null,"Household has: DVD player",null,0.6026576610948613]
[null,null,"Household fuel type: natural gas",null,0.59653511479732013,null,null,"Household has: refrigerator",null,0.5107727431314758,null,null,"Household has: refrigerator",null,0.59766016484328199]
[null,null,"Household has: refrigerator",null,0.55774444784105304,null,null,"Household has: DVD player",null,0.51047776740261852,null,null,"Household has: Water  heater",null,0.58773804465989721]
[null,null,"Household has: DVD player",null,0.52532923479314131,null,null,"Household has: non-mobile telephone",null,0.46270396462159696,null,null,"Household member owns: car/truck",null,0.57842595217418025]
[null,null,"Has cement roof",null,0.51258988477529777,null,null,"Household member owns: car/truck",null,0.45678776390014164,null,null,"Household has: non-mobile telephone",null,0.52857493102441711]
[null,null,"Household owns bank account",null,0.50764112092130242,null,null,"Household owns bank account",null,0.41655161698295912,null,null,"Household has: television",null,0.46953700836413842]
[null,null,"Has calamine/cement fibre roof",null,-0.46763171616778376,null,null,"Household fuel type: natural gas",null,0.40738696272968178,null,null,"Household owns bank account",null,0.42983162456130858]
[null,null,"Household member owns: car/truck",null,0.46593875896321368,null,null,"Has wood floor",null,-0.40061848983238207,null,null,"Household member owns: bicycle",null,0.42246104953067903]
[null,null,"Household has: non-mobile telephone",null,0.45767849243808878,null,null,"Household has: television",null,0.3982191854848241,null,null,"Household fuel type: natural gas",null,0.38688280440564099]
[null,null,"Household fuel type: LPG",null,-0.4479424087872026,null,null,"Has calamine/cement fibre roof",null,-0.37650486961773766,null,null,"Household member owns: watch",null,0.34710829773761137]
[null,null,"Has wood floor",null,-0.40165748548595637,null,null,"Has cement roof",null,0.37451002179996568,null,null,"Household member owns: motorcycle/scooter",null,0.27459189514738019]
[null,null,"Has cement block wall",null,0.39825800207011186,null,null,"Household fuel type: LPG",null,-0.37235492555443656,null,null,"Has parquet/polished wood floor",null,0.27004953226792078]
[null,null,"Household member owns: watch",null,0.39481356013414076,null,null,"Household member owns: watch",null,0.35358690274902238,null,null,"Household fuel type: wood",null,-0.26694508973344538]
[null,null,"Household has: television",null,0.37762625158038748,null,null,"Has cement block wall",null,0.33211182000132144,null,null,"Household owns rabbits",null,0.26334896883152531]
[null,null,"Has parquet/polished wood floor",null,0.36226609105641894,null,null,"Has parquet/polished wood floor",null,0.32900004739507477,null,null,"Household owns chickens",null,0.25881002986805773]
[null,null,"Has: Plastered",null,-0.28028022115319928,null,null,"Household member owns: bicycle",null,0.20287336205464127,null,null,"Household owns pigs",null,0.24716338567654353]
[null,null,"Household fuel type: wood",null,-0.27050940455712991,null,null,"Persons per sleeping rooms",null,0.19692384579108449,null,null,"Household has: Armoire",null,0.23048293902399702]
[null,null,"Household fuel type: agrciultural crop residue",null,-0.21093273606336979,null,null,"Household fuel type: wood",null,-0.18651204274767733,null,null,"Household member owns: tractor",null,0.22446716602787031]
[null,null,"Has earth/sand floor",null,-0.19966081104031988,null,null,"Has: Plastered",null,-0.18591581525543516,null,null,"Household has: electricity",null,0.22037945714202198]
[null,null,"Household member owns: bicycle",null,0.19795910615326734,null,null,"Household has: radio",null,0.17190885812340836,null,null,"Household has: radio",null,0.21817052369878415]
[null,null,"Household has: Armoire",null,0.18960939645841721,null,null,"Household has: electricity",null,0.1679614719386974,null,null,"Has wood floor",null,-0.21332624935168912]
[null,null,"Has vinyl/asphalt strip floor",null,0.18954602048295111,null,null,"Household has: Armoire",null,0.16246755517399331,null,null,"Household fuel type: agrciultural crop residue",null,-0.2123863713673888]
[null,null,"Household has: electricity",null,0.17942441114084567,null,null,"Household owns chickens",null,-0.15812324257428581,null,null,"Household owns: other poultry",null,0.21229251015014608]
[null,null,"Household member owns: animal drawn cart",null,-0.17336030520748724,null,null,"Has cement floor",null,-0.15648392856651261,null,null,"Has earth/sand floor",null,-0.20686470787455558]
[null,null,"Has cement floor",null,-0.15562404662318621,null,null,"Has earth/sand floor",null,-0.14214752357878424,null,null,"Has vinyl/asphalt strip floor",null,0.19445525668513466]
[null,null,"Has: Clay blocs",null,-0.15505433438091509,null,null,"Household owns agricultural land",null,-0.13590687884199446,null,null,"Has: Clay blocs",null,-0.15620326352320943]
[null,null,"Has: Limestone bloc",null,0.13167231605757268,null,null,"Household has: Sofa",null,0.13133573520236105,null,null,"Household owns cattle milk cows or bulls",null,0.14871854160494363]
[null,null,"Persons per sleeping rooms",null,0.12343700907082145,null,null,"Has: Clay blocs",null,-0.12984912404221483,null,null,"Household owns sheep",null,0.14696303640258748]
[null,null,"Has dung floor",null,-0.12020348113405352,null,null,"Household owns goats",null,-0.10583146249043089,null,null,"Has dung floor",null,-0.13576842438826101]
[null,null,"Household has: Sofa",null,0.1152313683444561,null,null,"Household has: Table",null,9.874316511256763E-2,null,null,"Household has: Sofa",null,0.13538229344991526]
[null,null,"Household has: radio",null,0.10186836302532487,null,null,"Household rents dwelling",null,-9.1619596019665128E-2,null,null,"Household fuel type: straw/shrub/grass",null,-0.11514337917745789]
[null,null,"Household fuel type: straw/shrub/grass",null,-0.10113986135082063,null,null,"Has cement wall",null,-9.1063979874195136E-2,null,null,"Persons per sleeping rooms",null,0.11129953129398357]
[null,null,"Has ceramic tile floor",null,8.8386338068939627E-2,null,null,"Household owns: other poultry",null,-8.7015036959121536E-2,null,null,"Has cement roof",null,0.10903630658373438]
[null,null,"Has ceramic tile roof",null,-8.2803066191064451E-2,null,null,"Household owns dwelling",null,8.2492240052530044E-2,null,null,"Has: Plastered",null,0.1042211141977922]
[null,null,"Household member owns: motorcycle/scooter",null,8.1701939560601927E-2,null,null,"Household fuel type: electricity",null,-8.0855370298488285E-2,null,null,"Household fuel type: electricity",null,-0.10305999881887093]
[null,null,"Household fuel type: no food cooked",null,-7.6260128073116371E-2,null,null,"Household member owns: motorcycle/scooter",null,7.7990035933512392E-2,null,null,"Household fuel type: no food cooked",null,-9.7961106198175898E-2]
[null,null,"Household has: Table",null,6.6675432836780832E-2,null,null,"Household owns cattle milk cows or bulls",null,-7.3572023106466169E-2,null,null,"Has metal roof",null,9.1818917194573121E-2]
[null,null,"Has stone with clay",null,-6.3103200874047097E-2,null,null,"Has ceramic tile floor",null,7.0163084736809683E-2,null,null,"Has ceramic tile roof",null,-8.8597696964763772E-2]
[null,null,"Has carpet floor",null,6.1075259003062161E-2,null,null,"Household fuel type: agrciultural crop residue",null,-6.5776922064588988E-2,null,null,"Has cement block wall",null,7.3888623721058588E-2]
[null,null,"Has stone with lime/cement wall",null,5.8804468200603234E-2,null,null,"Has dung floor",null,-6.5590508039553949E-2,null,null,"Household fuel type: LPG",null,-7.3861976508266577E-2]
[null,null,"Has metal roof",null,5.0834697705059335E-2,null,null,"Has carpet floor",null,6.3576686257660955E-2,null,null,"Household has: Table",null,7.3454983924320275E-2]
[null,null,"Has shingle roof",null,4.3289081072980115E-2,null,null,"Household fuel type: no food cooked",null,-6.1967680290599361E-2,null,null,"Has stone with lime/cement wall",null,-7.3154613350440129E-2]
[null,null,"Has cement wall",null,-2.9197423686208448E-2,null,null,"Household fuel type: straw/shrub/grass",null,-5.2559228827651079E-2,null,null,"Has stone with clay",null,-7.2451030675542386E-2]
[null,null,"Household member owns: tractor",null,2.8169348797025182E-2,null,null,"Household member owns: animal drawn cart",null,-4.8046874565159145E-2,null,null,"Has cement floor",null,-6.4955264910576974E-2]
[null,null,"Household fuel type: charcoal",null,-2.2568746947165125E-2,null,null,"Has vinyl/asphalt strip floor",null,4.36217374176621E-2,null,null,"Household rents dwelling",null,-6.3049961791767778E-2]
[null,null,"Household fuel type: animal dung",null,-2.0233556413256488E-2,null,null,"Has stone with clay",null,-4.2734316112677855E-2,null,null,"Has carpet floor",null,5.1249469790362094E-2]
[null,null,"Has wood plank/shingle wall",null,-1.1758288098072115E-2,null,null,"Household owns horses donkeys mules",null,-3.1609022841095569E-2,null,null,"Household owns agricultural land",null,4.95175444441701E-2]
[null,null,"Has brick wall",null,-8.6937302465431437E-3,null,null,"Has brick wall",null,-2.8940658301459986E-2,null,null,"Has ceramic tile floor",null,4.8456244172306484E-2]
[null,null,"Household fuel type: electricity",null,3.129134780016053E-3,null,null,"Has shingle roof",null,2.8751110520402034E-2,null,null,"Has wood roof",null,2.1031289945341512E-2]
[null,null,"Has wood roof",null,-7.3746748667233362E-4,null,null,"Household owns pigs",null,-2.5035449329568086E-2,null,null,"Household fuel type: charcoal",null,-2.0958434394003238E-2]
[null,null,null,null,null,null,null,"Household owns sheep",null,-2.367733528345748E-2,null,null,"Household owns goats",null,1.7405302025756016E-2]
[null,null,null,null,null,null,null,"Has ceramic tile roof",null,-2.3129369286537048E-2,null,null,"Has: Limestone bloc",null,1.7358492550365773E-2]
[null,null,null,null,null,null,null,"Household owns rabbits",null,-2.1279437336286171E-2,null,null,"Has calamine/cement fibre roof",null,-1.5768568582050519E-2]
[null,null,"Communalities",null,null,null,null,"Has wood roof",null,-1.9238169288233811E-2,null,null,"Household fuel type: animal dung",null,-1.4630224696126924E-2]
[null,null,null,null,"Extraction",null,null,"Has wood plank/shingle wall",null,-1.8900278238408241E-2,null,null,"Has wood plank/shingle wall",null,-1.2002128081188335E-2]
[null,null,"Persons per sleeping rooms",null,1.5236695208350056E-2,null,null,"Has metal roof",null,1.5944969533933272E-2,null,null,"Household owns dwelling",null,5.1623426608850163E-3]
[null,null,"Has earth/sand floor",null,3.9864439465278317E-2,null,null,"Has stone with lime/cement wall",null,1.4272389017170753E-2,null,null,"Has brick wall",null,4.675996303808834E-3]
[null,null,"Has dung floor",null,1.444887687674476E-2,null,null,"Household member owns: tractor",null,1.6968538980406931E-3,null,null,"Has shingle roof",null,3.43877859132903E-3]
[null,null,"Has wood floor",null,0.16132873564690126,null,null,"Has: Limestone bloc",null,-6.9531640522709133E-4,null,null,"Household owns horses donkeys mules",null,3.152405421298432E-3]
[null,null,"Has parquet/polished wood floor",null,0.13123672072929762,null,null,null,null,null,null,null,"Household member owns: animal drawn cart",null,-2.8006012892123253E-3]
[null,null,"Has vinyl/asphalt strip floor",null,3.5927693880923317E-2,null,null,null,null,null,null,null,"Has cement wall",null,-7.1571171495854761E-4]
[null,null,"Has ceramic tile floor",null,7.8121447572368861E-3]
[null,null,"Has cement floor",null,2.4218843887375635E-2,null,null,"Communalities"]
[null,null,"Has carpet floor",null,3.7301872622911257E-3,null,null,null,null,"Extraction"]
[null,null,"Has metal roof",null,2.5841664907647649E-3,null,null,"Persons per sleeping rooms",null,3.8779001041150826E-2,null,null,"Communalities"]
[null,null,"Has wood roof",null,5.4385829389880858E-7,null,null,"Has earth/sand floor",null,2.0205918459581022E-2,null,null,null,null,"Extraction"]
[null,null,"Has calamine/cement fibre roof",null,0.21867942196602666,null,null,"Has dung floor",null,4.3021147448867912E-3,null,null,"Persons per sleeping rooms",null,1.2387585666260427E-2]
[null,null,"Has ceramic tile roof",null,6.8563477706418009E-3,null,null,"Has wood floor",null,0.16049517439557842,null,null,"Has earth/sand floor",null,4.2793007364025214E-2]
[null,null,"Has cement roof",null,0.26274838997395306,null,null,"Has parquet/polished wood floor",null,0.10824103118596144,null,null,"Has dung floor",null,1.8433065060870946E-2]
[null,null,"Has shingle roof",null,1.8739445401430453E-3,null,null,"Has vinyl/asphalt strip floor",null,1.9028559753354617E-3,null,null,"Has wood floor",null,4.5508088662459041E-2]
[null,null,"Has stone with clay",null,3.9820139605503384E-3,null,null,"Has ceramic tile floor",null,4.9228584597847359E-3,null,null,"Has parquet/polished wood floor",null,7.2926749878122782E-2]
[null,null,"Has cement wall",null,8.5248954991196612E-4,null,null,"Has cement floor",null,2.4487219899609419E-2,null,null,"Has vinyl/asphalt strip floor",null,3.781284685248161E-2]
[null,null,"Has stone with lime/cement wall",null,3.4579654803557568E-3,null,null,"Has carpet floor",null,4.0419950355050551E-3,null,null,"Has ceramic tile floor",null,2.3480075992861863E-3]
[null,null,"Has brick wall",null,7.5580945599659113E-5,null,null,"Has metal roof",null,2.5424205343806025E-4,null,null,"Has cement floor",null,4.2191864396032321E-3]
[null,null,"Has cement block wall",null,0.15860943621287724,null,null,"Has wood roof",null,3.7010715756274264E-4,null,null,"Has carpet floor",null,2.6265081537932369E-3]
[null,null,"Has wood plank/shingle wall",null,1.3825733899726437E-4,null,null,"Has calamine/cement fibre roof",null,0.14175591684586963,null,null,"Has metal roof",null,8.4307135547838762E-3]
[null,null,"Has: Clay blocs",null,2.4041846610308629E-2,null,null,"Has ceramic tile roof",null,5.3496772359300335E-4,null,null,"Has wood roof",null,4.4231515676502298E-4]
[null,null,"Has: Limestone bloc",null,1.7337598815965312E-2,null,null,"Has cement roof",null,0.14025775642861077,null,null,"Has calamine/cement fibre roof",null,2.486477551268307E-4]
[null,null,"Has: Plastered",null,7.8557002369686296E-2,null,null,"Has shingle roof",null,8.2662635615637252E-4,null,null,"Has ceramic tile roof",null,7.849551907460112E-3]
[null,null,"Household fuel type: electricity",null,9.7914844715061135E-6,null,null,"Has stone with clay",null,1.826221773618278E-3,null,null,"Has cement roof",null,1.1888916153422116E-2]
[null,null,"Household fuel type: LPG",null,0.20065240159008133,null,null,"Has cement wall",null,8.2926484305278162E-3,null,null,"Has shingle roof",null,1.1825198200182869E-5]
[null,null,"Household fuel type: natural gas",null,0.35585414318625191,null,null,"Has stone with lime/cement wall",null,2.0370108825745631E-4,null,null,"Has stone with clay",null,5.2491518459483839E-3]
[null,null,"Household fuel type: charcoal",null,5.0934833876517516E-4,null,null,"Has brick wall",null,8.3756170292186482E-4,null,null,"Has cement wall",null,5.122432589289053E-7]
[null,null,"Household fuel type: wood",null,7.3175337953852976E-2,null,null,"Has cement block wall",null,0.11029826098459014,null,null,"Has stone with lime/cement wall",null,5.3515974544523929E-3]
[null,null,"Household fuel type: straw/shrub/grass",null,1.0229271554063222E-2,null,null,"Has wood plank/shingle wall",null,3.5722051748924812E-4,null,null,"Has brick wall",null,2.1864941433233876E-5]
[null,null,"Household fuel type: animal dung",null,4.0939680512843275E-4,null,null,"Has: Clay blocs",null,1.6860795014530493E-2,null,null,"Has cement block wall",null,5.4595287153921821E-3]
[null,null,"Household fuel type: agrciultural crop residue",null,4.4492619143179223E-2,null,null,"Has: Limestone bloc",null,4.8346490337792467E-7,null,null,"Has wood plank/shingle wall",null,1.4405107847724957E-4]
[null,null,"Household fuel type: no food cooked",null,5.8156071337281115E-3,null,null,"Has: Plastered",null,3.4564690362093094E-2,null,null,"Has: Clay blocs",null,2.4399459535301208E-2]
[null,null,"Household has: electricity",null,3.2193119313239225E-2,null,null,"Household fuel type: electricity",null,6.5375909061056612E-3,null,null,"Has: Limestone bloc",null,3.0131726362110406E-4]
[null,null,"Household has: radio",null,1.0377163385459375E-2,null,null,"Household fuel type: LPG",null,0.13864819058465,null,null,"Has: Plastered",null,1.0862040644629244E-2]
[null,null,"Household has: television",null,0.14260158588265409,null,null,"Household fuel type: natural gas",null,0.16596413740211513,null,null,"Household fuel type: electricity",null,1.0621363356545677E-2]
[null,null,"Household has: non-mobile telephone",null,0.20946960244040169,null,null,"Household fuel type: wood",null,3.4786742089911414E-2,null,null,"Household fuel type: LPG",null,5.4555915737077238E-3]
[null,null,"Household has: refrigerator",null,0.31107886909752114,null,null,"Household fuel type: straw/shrub/grass",null,2.762472534957388E-3,null,null,"Household fuel type: natural gas",null,0.14967830434477347]
[null,null,"Household has: Table",null,4.4456133439720715E-3,null,null,"Household fuel type: agrciultural crop residue",null,4.3266034762910136E-3,null,null,"Household fuel type: charcoal",null,4.3925597224773788E-4]
[null,null,"Household has: Sofa",null,1.327826825053572E-2,null,null,"Household fuel type: no food cooked",null,3.8399934005979366E-3,null,null,"Household fuel type: wood",null,7.1259680932797206E-2]
[null,null,"Household has: Armoire",null,3.5951723225325236E-2,null,null,"Household has: electricity",null,2.8211056055813834E-2,null,null,"Household fuel type: straw/shrub/grass",null,1.3257997768403843E-2]
[null,null,"Household has: Washing machine",null,0.40150577765017242,null,null,"Household has: radio",null,2.9552655501294146E-2,null,null,"Household fuel type: animal dung",null,2.1404347465916215E-4]
[null,null,"Household has: Waterheater",null,0.37638866805196902,null,null,"Household has: television",null,0.15857851968819675,null,null,"Household fuel type: agrciultural crop residue",null,4.510797074260639E-2]
[null,null,"Household has: Vacuum cleaner",null,0.54354945863582138,null,null,"Household has: non-mobile telephone",null,0.21409495887654406,null,null,"Household fuel type: no food cooked",null,9.5963783275702964E-3]
[null,null,"Household has: Camera",null,0.39879365119122157,null,null,"Household has: refrigerator",null,0.26088879512605256,null,null,"Household has: electricity",null,4.8567105130212299E-2]
[null,null,"Household has: DVD player",null,0.27597080492834741,null,null,"Household has: Table",null,9.7502126564477931E-3,null,null,"Household has: radio",null,4.7598377411001737E-2]
[null,null,"Household has: Microwave",null,0.35720471031419093,null,null,"Household has: Sofa",null,1.7249075341144702E-2,null,null,"Household has: television",null,0.22046500222354498]
[null,null,"Household has: Computer",null,0.46610987770662887,null,null,"Household has: Armoire",null,2.6395706484214559E-2,null,null,"Household has: non-mobile telephone",null,0.27939145770746732]
[null,null,"Household member owns: watch",null,0.15587774726579479,null,null,"Household has: Washing machine",null,0.40173195587915755,null,null,"Household has: refrigerator",null,0.35719767264049901]
[null,null,"Household member owns: mobile phone",null,0.37448598661897536,null,null,"Household has: Waterheater",null,0.27519537478918343,null,null,"Household has: Table",null,5.3956346633221497E-3]
[null,null,"Household member owns: bicycle",null,3.9187807709000565E-2,null,null,"Household has: Vacuum cleaner",null,0.47223087358567095,null,null,"Household has: Sofa",null,1.8328365379758967E-2]
[null,null,"Household member owns: motorcycle/scooter",null,6.6752069279642501E-3,null,null,"Household has: Camera",null,0.36165874414934435,null,null,"Household has: Armoire",null,5.3122385181139528E-2]
[null,null,"Household member owns: animal drawn cart",null,3.0053795421633129E-2,null,null,"Household has: DVD player",null,0.26058755101236192,null,null,"Household has: Washing machine",null,0.46562042882631433]
[null,null,"Household member owns: car/truck",null,0.21709892710417975,null,null,"Household has: Microwave",null,0.33678585584173804,null,null,"Household has: Water  heater",null,0.34543600914063932]
[null,null,"Household member owns: tractor",null,7.9351221164846407E-4,null,null,"Household has: Computer",null,0.40056268301290726,null,null,"Household has: Vacuum cleaner",null,0.54533972004482778]
[null,null,"Household owns bank account",null,0.25769950765023641,null,null,"Household member owns: watch",null,0.12502369779564662,null,null,"Household has: Camera",null,0.40745955384498145]
[null,null,null,null,null,null,null,"Household member owns: mobile phone",null,0.29852987646702556,null,null,"Household has: DVD player",null,0.36319625647632869]
[null,null,null,null,null,null,null,"Household member owns: bicycle",null,4.1157601031353561E-2,null,null,"Household has: Microwave",null,0.37236882090503082]
[null,null,"Total Variance Explained",null,null,null,null,"Household member owns: motorcycle/scooter",null,6.0824457049105541E-3,null,null,"Household has: Computer",null,0.43346536143195202]
[null,null,"Component",null,"Extraction Sums of Squared Loadings",null,null,"Household member owns: animal drawn cart",null,2.3085021554801366E-3,null,null,"Household member owns: watch",null,0.12048417035830226]
[null,null,null,null,"Total","% of Variance","Cumulative %","Household member owns: car/truck",null,0.20865506124889155,null,null,"Household member owns: mobile phone",null,0.40958443415987972]
[null,null,"1",null,6.5655386451148896,11.724176151990875,11.724176151990875,"Household member owns: tractor",null,2.8793131512958949E-6,null,null,"Household member owns: bicycle",null,0.17847333837056284]
[null,null,null,null,null,null,null,"Household owns dwelling",null,6.8049696688842424E-3,null,null,"Household member owns: motorcycle/scooter",null,7.5400708880629844E-2]
[null,null,null,null,null,null,null,"Household rents dwelling",null,8.3941503748066384E-3,null,null,"Household member owns: animal drawn cart",null,7.8433675811377379E-6]
[null,null,"Component Score Coefficient Matrix",null,null,null,null,"Household owns agricultural land",null,1.8470679716572558E-2,null,null,"Household member owns: car/truck",null,0.33457658214860703]
[null,null,null,null,"Component",null,null,"Household owns bank account",null,0.17351524961111786,null,null,"Household member owns: tractor",null,5.0385508624583498E-2]
[null,null,null,null,"1",null,null,"Household owns cattle milk cows or bulls",null,5.4128425839783919E-3,null,null,"Household owns dwelling",null,2.6649781748393391E-5]
[null,null,"Persons per sleeping rooms",null,1.8800743662161695E-2,null,null,"Household owns horses donkeys mules",null,9.9913032496890138E-4,null,null,"Household rents dwelling",null,3.9752976819433768E-3]
[null,null,"Has earth/sand floor",null,-3.0410423551292042E-2,null,null,"Household owns goats",null,1.120029845286348E-2,null,null,"Household owns agricultural land",null,2.4519872077803611E-3]
[null,null,"Has dung floor",null,-1.830824363869845E-2,null,null,"Household owns sheep",null,5.6061620612526052E-4,null,null,"Household owns bank account",null,0.18475522547301373]
[null,null,"Has wood floor",null,-6.1176623457210311E-2,null,null,"Household owns chickens",null,2.5002959842206431E-2,null,null,"Household owns cattle milk cows or bulls",null,2.2117204617101351E-2]
[null,null,"Has parquet/polished wood floor",null,5.517690331865828E-2,null,null,"Household owns pigs",null,6.2677372313337117E-4,null,null,"Household owns horses donkeys mules",null,9.9376599402317445E-6]
[null,null,"Has vinyl/asphalt strip floor",null,2.8869835474044987E-2,null,null,"Household owns: other poultry",null,7.5716166569972871E-3,null,null,"Household owns goats",null,3.029445386077865E-4]
[null,null,"Has ceramic tile floor",null,1.3462160965986207E-2,null,null,"Household owns rabbits",null,4.5281445334892991E-4,null,null,"Household owns sheep",null,2.1598134068668253E-2]
[null,null,"Has cement floor",null,-2.3703165122480666E-2,null,null,null,null,null,null,null,"Household owns chickens",null,6.6982631560304942E-2]
[null,null,"Has carpet floor",null,9.3023988288463439E-3,null,null,null,null,null,null,null,"Household owns pigs",null,6.1089739219091804E-2]
[null,null,"Has metal roof",null,7.7426545562842824E-3,null,null,"Total Variance Explained",null,null,null,null,"Household owns: other poultry",null,4.5068109865849873E-2]
[null,null,"Has wood roof",null,-1.1232398840894017E-4,null,null,"Component",null,"Extraction Sums of Squared Loadings",null,null,"Household owns rabbits",null,6.9352679384627691E-2]
[null,null,"Has calamine/cement fibre roof",null,-7.1225186758397452E-2,null,null,null,null,"Total","% of Variance","Cumulative %"]
[null,null,"Has ceramic tile roof",null,-1.261177043755189E-2,null,null,"1",null,5.3757312828277195,8.270355819734954,8.270355819734954]
[null,null,"Has cement roof",null,7.8072784653653957E-2,null,null,null,null,null,null,null,"Total Variance Explained"]
[null,null,"Has shingle roof",null,6.5933784587787776E-3,null,null,null,null,null,null,null,"Component",null,"Extraction Sums of Squared Loadings"]
[null,null,"Has stone with clay",null,-9.6112755228391269E-3,null,null,"Component Score Coefficient Matrix",null,null,null,null,null,null,"Total","% of Variance","Cumulative %"]
[null,null,"Has cement wall",null,-4.4470720933053815E-3,null,null,null,null,"Component",null,null,"1",null,6.2349424035943324,9.3058841844691536,9.3058841844691536]
[null,null,"Has stone with lime/cement wall",null,8.9565337102016588E-3,null,null,null,null,"1"]
[null,null,"Has brick wall",null,-1.3241457733268757E-3,null,null,"Persons per sleeping rooms",null,3.663201068478622E-2]
[null,null,"Has cement block wall",null,6.0658846683727473E-2,null,null,"Has earth/sand floor",null,-2.6442453333346758E-2,null,null,"Component Score Coefficient Matrix"]
[null,null,"Has wood plank/shingle wall",null,-1.7909098908161798E-3,null,null,"Has dung floor",null,-1.2201225208015294E-2,null,null,null,null,"Component"]
[null,null,"Has: Clay blocs",null,-2.3616392007117921E-2,null,null,"Has wood floor",null,-7.4523533405049691E-2,null,null,null,null,"1"]
[null,null,"Has: Limestone bloc",null,2.0055066792660479E-2,null,null,"Has parquet/polished wood floor",null,6.1200984589024253E-2,null,null,"Persons per sleeping rooms",null,1.7850931747151567E-2]
[null,null,"Has: Plastered",null,-4.2689600397332626E-2,null,null,"Has vinyl/asphalt strip floor",null,8.114568069465776E-3,null,null,"Has earth/sand floor",null,-3.3178286900501563E-2]
[null,null,"Household fuel type: electricity",null,4.7659985709539555E-4,null,null,"Has ceramic tile floor",null,1.3051821425847538E-2,null,null,"Has dung floor",null,-2.1775409554704618E-2]
[null,null,"Household fuel type: LPG",null,-6.8226299927500331E-2,null,null,"Has cement floor",null,-2.9109328635228887E-2,null,null,"Has wood floor",null,-3.4214630311373902E-2]
[null,null,"Household fuel type: natural gas",null,9.0858518552955903E-2,null,null,"Has carpet floor",null,1.1826611657608494E-2,null,null,"Has parquet/polished wood floor",null,4.3312273760899869E-2]
[null,null,"Household fuel type: charcoal",null,-3.4374555032065002E-3,null,null,"Has metal roof",null,2.9661024137995922E-3,null,null,"Has vinyl/asphalt strip floor",null,3.1187979631220761E-2]
[null,null,"Household fuel type: wood",null,-4.1201403141294939E-2,null,null,"Has wood roof",null,-3.5787073936690964E-3,null,null,"Has ceramic tile floor",null,7.7717228220700683E-3]
[null,null,"Household fuel type: straw/shrub/grass",null,-1.5404655553444054E-2,null,null,"Has calamine/cement fibre roof",null,-7.0037888765096576E-2,null,null,"Has cement floor",null,-1.0417941450931676E-2]
[null,null,"Household fuel type: animal dung",null,-3.0817816339122964E-3,null,null,"Has ceramic tile roof",null,-4.3025530982959848E-3,null,null,"Has carpet floor",null,8.2197182384263386E-3]
[null,null,"Household fuel type: agrciultural crop residue",null,-3.2127255274068789E-2,null,null,"Has cement roof",null,6.9666804774320412E-2,null,null,"Has metal roof",null,1.4726506076726733E-2]
[null,null,"Household fuel type: no food cooked",null,-1.1615212733513947E-2,null,null,"Has shingle roof",null,5.3483161653270928E-3,null,null,"Has wood roof",null,3.3731329952971737E-3]
[null,null,"Household has: electricity",null,2.7328208824777385E-2,null,null,"Has stone with clay",null,-7.9494888907837933E-3,null,null,"Has calamine/cement fibre roof",null,-2.5290640332074634E-3]
[null,null,"Household has: radio",null,1.5515613955165789E-2,null,null,"Has cement wall",null,-1.6939831082161919E-2,null,null,"Has ceramic tile roof",null,-1.4209866143059923E-2]
[null,null,"Household has: television",null,5.7516415939667269E-2,null,null,"Has stone with lime/cement wall",null,2.6549669740306018E-3,null,null,"Has cement roof",null,1.7487941271258078E-2]
[null,null,"Household has: non-mobile telephone",null,6.9709206993797221E-2,null,null,"Has brick wall",null,-5.3835760715771402E-3,null,null,"Has shingle roof",null,5.5153333723606426E-4]
[null,null,"Household has: refrigerator",null,8.4950295472869489E-2,null,null,"Has cement block wall",null,6.1779840272563898E-2,null,null,"Has stone with clay",null,-1.1620160377708648E-2]
[null,null,"Household has: Table",null,1.015536370140642E-2,null,null,"Has wood plank/shingle wall",null,-3.5158524941124661E-3,null,null,"Has cement wall",null,-1.1479042926618738E-4]
[null,null,"Household has: Sofa",null,1.7550939012474533E-2,null,null,"Has: Clay blocs",null,-2.4154690257120175E-2,null,null,"Has stone with lime/cement wall",null,-1.1733005473838508E-2]
[null,null,"Household has: Armoire",null,2.8879488295982646E-2,null,null,"Has: Limestone bloc",null,-1.2934359413540924E-4,null,null,"Has brick wall",null,7.4996623884018647E-4]
[null,null,"Household has: Washing machine",null,9.6510716001331598E-2,null,null,"Has: Plastered",null,-3.4584283602367961E-2,null,null,"Has cement block wall",null,1.1850730758709675E-2]
[null,null,"Household has: Waterheater",null,9.3443244160992603E-2,null,null,"Household fuel type: electricity",null,-1.5040813248380433E-2,null,null,"Has wood plank/shingle wall",null,-1.9249781801142737E-3]
[null,null,"Household has: Vacuum cleaner",null,0.11229209174118998,null,null,"Household fuel type: LPG",null,-6.9265911178241046E-2,null,null,"Has: Clay blocs",null,-2.5052879948523829E-2]
[null,null,"Household has: Camera",null,9.6184204152686942E-2,null,null,"Household fuel type: natural gas",null,7.5782612875580704E-2,null,null,"Has: Limestone bloc",null,2.7840662233477751E-3]
[null,null,"Household has: DVD player",null,8.0013120505202456E-2,null,null,"Household fuel type: wood",null,-3.4695194557710314E-2,null,null,"Has: Plastered",null,1.6715649873158506E-2]
[null,null,"Household has: Microwave",null,9.1030772158720158E-2,null,null,"Household fuel type: straw/shrub/grass",null,-9.7771309729611528E-3,null,null,"Household fuel type: electricity",null,-1.6529422751276529E-2]
[null,null,"Household has: Computer",null,0.10398574108645886,null,null,"Household fuel type: agrciultural crop residue",null,-1.2235902169200188E-2,null,null,"Household fuel type: LPG",null,-1.1846456908035987E-2]
[null,null,"Household member owns: watch",null,6.013422225880935E-2,null,null,"Household fuel type: no food cooked",null,-1.1527302432052258E-2,null,null,"Household fuel type: natural gas",null,6.2050742310403695E-2]
[null,null,"Household member owns: mobile phone",null,9.3206762565739704E-2,null,null,"Household has: electricity",null,3.1244395060302764E-2,null,null,"Household fuel type: charcoal",null,-3.3614479553044588E-3]
[null,null,"Household member owns: bicycle",null,3.0151236151897371E-2,null,null,"Household has: radio",null,3.1978692586914728E-2,null,null,"Household fuel type: wood",null,-4.2814363382018786E-2]
[null,null,"Household member owns: motorcycle/scooter",null,1.2444057369366416E-2,null,null,"Household has: television",null,7.4077211924059305E-2,null,null,"Household fuel type: straw/shrub/grass",null,-1.8467432692093482E-2]
[null,null,"Household member owns: animal drawn cart",null,-2.6404582255635117E-2,null,null,"Household has: non-mobile telephone",null,8.6072748111436004E-2,null,null,"Household fuel type: animal dung",null,-2.3464891492330163E-3]
[null,null,"Household member owns: car/truck",null,7.0967331722264243E-2,null,null,"Household has: refrigerator",null,9.5014560114470861E-2,null,null,"Household fuel type: agrciultural crop residue",null,-3.4063886659955647E-2]
[null,null,"Household member owns: tractor",null,4.2904855670881899E-3,null,null,"Household has: Table",null,1.8368322357926192E-2,null,null,"Household fuel type: no food cooked",null,-1.5711629692313288E-2]
[null,null,"Household owns bank account",null,7.7319036313801076E-2,null,null,"Household has: Sofa",null,2.4431231453458442E-2,null,null,"Household has: electricity",null,3.5345868955417643E-2]
[null,null,null,null,null,null,null,"Household has: Armoire",null,3.0222410054792183E-2,null,null,"Household has: radio",null,3.4991586060684816E-2]
[null,null,null,null,null,null,null,"Household has: Washing machine",null,0.11790456983026337,null,null,"Household has: television",null,7.5307352974657585E-2]
[null,null,"Component Score Covariance Matrix",null,null,null,null,"Household has: Waterheater",null,9.7584988155688307E-2,null,null,"Household has: non-mobile telephone",null,8.4776233172531495E-2]
[null,null,"Component",null,"1",null,null,"Household has: Vacuum cleaner",null,0.12783201569136052,null,null,"Household has: refrigerator",null,9.585656549108483E-2]
[null,null,"1",null,1,null,null,"Household has: Camera",null,0.11186956091089308,null,null,"Household has: Table",null,1.1781180830471631E-2]
[null,null,null,null,null,null,null,"Household has: DVD player",null,9.4959688374546006E-2,null,null,"Household has: Sofa",null,2.1713479401488902E-2]
[null,null,null,null,null,null,null,"Household has: Microwave",null,0.1079541570224435,null,null,"Household has: Armoire",null,3.6966330096510229E-2]
[null,null,null,null,null,null,null,"Household has: Computer",null,0.1177328594726794,null,null,"Household has: Washing machine",null,0.10944188566991436]
[null,null,null,null,null,null,null,"Household member owns: watch",null,6.5774660998871609E-2,null,null,"Household has: Water  heater",null,9.42651923009067E-2]
[null,null,null,null,null,null,null,"Household member owns: mobile phone",null,0.10163805583912228,null,null,"Household has: Vacuum cleaner",null,0.11844074200088996]
[null,null,null,null,null,null,null,"Household member owns: bicycle",null,3.7738746857139543E-2,null,null,"Household has: Camera",null,0.10237874622746977]
[null,null,null,null,null,null,null,"Household member owns: motorcycle/scooter",null,1.4507800302936351E-2,null,null,"Household has: DVD player",null,9.6658095950884801E-2]
[null,null,null,null,null,null,null,"Household member owns: animal drawn cart",null,-8.9377374048886134E-3,null,null,"Household has: Microwave",null,9.7871041257743624E-2]
[null,null,null,null,null,null,null,"Household member owns: car/truck",null,8.4972209336301535E-2,null,null,"Household has: Computer",null,0.10559534008321383]
[null,null,null,null,null,null,null,"Household member owns: tractor",null,3.1565080335416645E-4,null,null,"Household member owns: watch",null,5.5671452159286934E-2]
[null,null,null,null,null,null,null,"Household owns dwelling",null,1.534530572910963E-2,null,null,"Household member owns: mobile phone",null,0.10264534900962788]
[null,null,null,null,null,null,null,"Household rents dwelling",null,-1.704318746592404E-2,null,null,"Household member owns: bicycle",null,6.7757009156514073E-2]
[null,null,null,null,null,null,null,"Household owns agricultural land",null,-2.5281561092187876E-2,null,null,"Household member owns: motorcycle/scooter",null,4.4040807015167112E-2]
[null,null,null,null,null,null,null,"Household owns bank account",null,7.7487432884451493E-2,null,null,"Household member owns: animal drawn cart",null,-4.4917837374052226E-4]
[null,null,null,null,null,null,null,"Household owns cattle milk cows or bulls",null,-1.3685956242174021E-2,null,null,"Household member owns: car/truck",null,9.2771659260353079E-2]
[null,null,null,null,null,null,null,"Household owns horses donkeys mules",null,-5.879948453165377E-3,null,null,"Household member owns: tractor",null,3.6001481889948013E-2]
[null,null,null,null,null,null,null,"Household owns goats",null,-1.9686895963066425E-2,null,null,"Household owns dwelling",null,8.2796958283191491E-4]
[null,null,null,null,null,null,null,"Household owns sheep",null,-4.4044863922221263E-3,null,null,"Household rents dwelling",null,-1.0112356732504955E-2]
[null,null,null,null,null,null,null,"Household owns chickens",null,-2.9414275798977534E-2,null,null,"Household owns agricultural land",null,7.9419409577262696E-3]
[null,null,null,null,null,null,null,"Household owns pigs",null,-4.6571244008311091E-3,null,null,"Household owns bank account",null,6.8939149191421287E-2]
[null,null,null,null,null,null,null,"Household owns: other poultry",null,-1.6186641850399613E-2,null,null,"Household owns cattle milk cows or bulls",null,2.3852432304620818E-2]
[null,null,null,null,null,null,null,"Household owns rabbits",null,-3.9584265315235128E-3,null,null,"Household owns horses donkeys mules",null,5.0560297389132681E-4]
[null,null,null,null,null,null,null,null,null,null,null,null,"Household owns goats",null,2.791573826844362E-3]
[null,null,null,null,null,null,null,null,null,null,null,null,"Household owns sheep",null,2.3570873135550688E-2]
[null,null,null,null,null,null,null,"Component Score Covariance Matrix",null,null,null,null,"Household owns chickens",null,4.1509610372480486E-2]
[null,null,null,null,null,null,null,"Component",null,"1",null,null,"Household owns pigs",null,3.9641646975609311E-2]
[null,null,null,null,null,null,null,"1",null,1,null,null,"Household owns: other poultry",null,3.4048832596715449E-2]
[null,null,null,null,null,null,null,null,null,null,null,null,"Household owns rabbits",null,4.2237594477169405E-2]
[]
[]
[null,null,null,null,null,null,null,null,null,null,null,null,"Component Score Covariance Matrix"]
[null,null,null,null,null,null,null,null,null,null,null,null,"Component",null,"1"]
[null,null,null,null,null,null,null,null,null,null,null,null,"1",null,0.99999999999999978]
[]
[]
[]
[]
[]
[]
[]
[]
[]
[]
[]
[]
[]
[]
[]
[]
[]
[]
[]
[]
[]
[]
[]
[]
[]
[]
[]
[]
[]
[]
[]
[]
[]
[]
[]
[]
[]
[]
[]
[]
[]
[]
[]
[]
[]
[]
[]
[]
[]
[]
[]
[]
[]
[]
[]
[]
[]
[]
[]
[]
[]
[]
[]
[]
[]
[]
[]
[]
[]
[]
[]
[]
[]
[]
[]
[]
[]
[]
[]
[]
[]
[]
[]
[]
[]
[]
[]
[]
[]
[]
[]
[]
[]
[]
[]
[]
[]
[]
[]
[]
[]
[]
[]
[]
[]
[]
[]
[]
[]
[]
[]
[]
[]
[]
[]
[]
[]
[]
[]
[]
[]
[]
[]
[]
[]
[]
[]
[]
[]
[]
[]
[]
[]
[]
[]
[]
[]
[]
[]
[]
[]
[]
[]
[]
[]
[]
[]
[]
[]
[]
[]
[]
[]
[]
[]
[]
[]
[]
[]
[]
[]
[]
[]
[]
[]
[]
[]
[]
[]
[]
[]
[]
[]
[]
[]
[]
[]
[]
[]
[]
[]
[]
[]
[]
[]
[]
[]
[]
[]
[]
[]
[]
[]
[]
[]
[]
[]
[]
[]
[]
[]
[]
[]
[]
[]
[]
[]
[]
[]
[]
[]
[]
[]
[]
[]
[]
[]
[]
[]
[]
[]
[]
[]
[]
[]
[]
[]
[]
[]
[]
[]
[]
[]
[]
[]
[]
[]
[]
[]
[]
[]
[]
[]
[]
[]
[]
[]
[]
[]
[]
[]
[]
[]
[]
[]
[]
[]
[]
[]
[]
[]
[]
[]
[]
[]
[]
[]
[]
[]
[]
[]
[]
[]
[]
[]
[]
[]
[]
[]
[]
[]
[]
[]
[]
[]
[]
[]
[]
[]
[]
[]
[]
[]
[]
[]
[]
[]
[]
[]
[]
[]
[]
[]
[]
[]
[]
[]
[]
[]
[]
[]
[]
[]
[]
[]
[]
[]
[]
[]
[]
[]
[]
[]
[]
[]
[]
[]
[]
[]
[]
[]
[]
[]
[]
[]
[]
[]
[]
[]
[]
[]
[]
[]
[]
[]
[]
[]
[]
[]
[]
[]
[]
[]
[]
[]
[]
[]
[]
[]
[]
[]
[]
[]
[]
[]
[]
[]
[]
[]
[]
[]
[]
[]
[]
[]
[]
[]
[]
[]
[]
[]
[]
[]
[]
[]
[]
[]
[]
[]
[]
[]
[]
[]
[]
[]
[]
[]
[]
[]
[]
["MICS12"]
["Republic of Moldova",null,"Count"]
["W_text_t","",11354]
["W_text_i","",11354]
["S_text_s","",11354]
["S_text_i","",11354]
["Urban/Rural","Urban",6415]
[null,"Rural",4939]
[null,"Missing",0]
["2012"]
[]
["Sub-national region names","Weighted population"]
[{"$f":"R15","v":"Center"},{"$f":"BR122+BR123","v":8684.8697001064684}]
[{"$f":"S15","v":"Chisinau"},{"$f":"BS122+BS123","v":5501.5738538637434}]
[{"$f":"T15","v":"North"},{"$f":"BT122+BT123","v":9078.804203114365}]
[{"$f":"U15","v":"South"},{"$f":"BU122+BU123","v":5523.5591821390999}]
[{"$f":"V15","v":0},{"$f":"BV122+BV123","v":0}]
[{"$f":"W15","v":0},{"$f":"BW122+BW123","v":0}]
[{"$f":"X15","v":0},{"$f":"BX122+XR123","v":0}]
[{"$f":"Y15","v":0},{"$f":"BY122+BY123","v":0}]
[{"$f":"Z15","v":0},{"$f":"BZ122+BZ123","v":0}]
[{"$f":"AA15","v":0},{"$f":"CA122+CA123","v":0}]
[{"$f":"AB15","v":0},{"$f":"CB122+CB123","v":0}]
[{"$f":"AC15","v":0},{"$f":"CC122+CC123","v":0}]
[{"$f":"AD15","v":0},{"$f":"CD122+CD123","v":0}]
[{"$f":"AE15","v":0},{"$f":"CE122+CE123","v":0}]
[{"$f":"AF15","v":0},{"$f":"CF122+CF123","v":0}]
[{"$f":"AG15","v":0},{"$f":"CG122+CG123","v":0}]
[{"$f":"AH15","v":0},{"$f":"CH122+CH123","v":0}]
[{"$f":"AI15","v":0},{"$f":"CI122+CI123","v":0}]
[{"$f":"AJ15","v":0},{"$f":"CJ122+CJ123","v":0}]
[{"$f":"AK15","v":0},{"$f":"CK122+CK123","v":0}]
[{"$f":"AL15","v":0},{"$f":"CL122+CL123","v":0}]
[{"$f":"AM15","v":0},{"$f":"CM122+CM123","v":0}]
[{"$f":"AN15","v":0},{"$f":"CN122+CN123","v":0}]
[{"$f":"AO15","v":0},{"$f":"CO122+CO123","v":0}]
[{"$f":"AP15","v":0},{"$f":"CP122+CP123","v":0}]
[{"$f":"AQ15","v":0},{"$f":"CQ122+CQ123","v":0}]
[{"$f":"AR15","v":0},{"$f":"CR122+CR123","v":0}]
[{"$f":"AS15","v":0},{"$f":"CS122+CS123","v":0}]
[{"$f":"AT15","v":0},{"$f":"CT122+CT123","v":0}]
[{"$f":"AU15","v":0},{"$f":"CU122+CU123","v":0}]
[{"$f":"AV15","v":0},{"$f":"CV122+CV123","v":0}]
[{"$f":"AW15","v":0},{"$f":"CW122+CW123","v":0}]
[{"$f":"AX15","v":0},{"$f":"CX122+CX123","v":0}]
[{"$f":"AY15","v":0},{"$f":"CY122+CY123","v":0}]
[]
[{"$f":"34-COUNTIF(A1037:A1071,\"0\")","v":4},"Sub-regions"]

{"sheet":"data_summary","index":7,"n_rows":179,"n_cols":49,"rows_kept":179,"cut":false,"hidden":false,"merged":[]}
["iso3","year","data_source","row","var1","var2","varname","total_q1","total_q2","total_q3","total_q4","total_q5","urban_q1","urban_q2","urban_q3","urban_q4","urban_q5","rural_q1","rural_q2","rural_q3","rural_q4","rural_q5","region_1_name","region_2_name","region_3_name","region_4_name","region_1","region_2","region_3","region_4","n_total_q1","n_total_q2","n_total_q3","n_total_q4","n_total_q5","n_urban_q1","n_urban_q2","n_urban_q3","n_urban_q4","n_urban_q5","n_rural_q1","n_rural_q2","n_rural_q3","n_rural_q4","n_rural_q5","n_region_1","n_region_2","n_region_3","n_region_4"]
["MDA",2000,"MDA_2000_MICS",16,"Water","Improved","w_imp",86.044979069073761,91.235752703299426,93.667691508510657,97.048282509991097,98.498666062914978,95.687111040748704,97.531202771365841,98.568959655181189,98.694478857670219,99.148724948962226,83.766454390853838,88.982393362172559,91.447139144631421,91.636385586249119,95.061362853983937,"Moldova","Transnistria","","",92.650205427774267,97.100679435338435]
["MDA",2000,"MDA_2000_MICS",17,"Water","Not Improved","",13.95502093092618,8.7642472967006189,6.332308491489397,2.9517174900089049,1.5013339370850141,4.3128889592512891,2.4687972286342061,1.4310403448187821,1.3055211423297519,0.85127505103780843,16.233545609146589,11.01760663782756,8.5528608553685839,8.3636144137509394,4.9386371460160401,"Moldova","Transnistria","","",7.3497945722253784,2.8993205646617599]
["MDA",2000,"MDA_2000_MICS",18,"Water ladder","Basic","w_bas",84.023643640949757,88.924631248511773,92.101082668703185,95.610688452264029,97.763968371401333,93.914684593328943,95.580406783991208,97.518686896281082,97.236473346182763,99.05878689105073,81.564933459556144,86.96841312230697,89.108492916559754,89.802009106470877,94.182991730035042,"Moldova","Transnistria","","",90.805640533167889,96.844017731728897]
["MDA",2000,"MDA_2000_MICS",19,"Water ladder","Limited","w_lim",2.0070991366936179,2.311121454787576,1.5603915328642219,1.437594057727112,0.7346976915136304,1.772426447419891,1.9507959873746801,1.050272758900104,1.4580055114874779,0.089938057911488498,2.1737642330660738,2.013980239865611,2.3386462280716782,1.8206062294316641,0.87837112394885608,"Moldova","Transnistria","","",1.8411214851228841,0.25666170360949941]
["MDA",2000,"MDA_2000_MICS",20,"Water ladder","Unimproved","w_unimp",13.96925722235655,8.7642472967006189,6.2945028944470156,2.9517174900089049,1.5013339370850141,4.3128889592512891,2.4687972286342061,1.4310403448187821,1.3055211423297519,0.85127505103780843,16.26130230737817,11.01760663782756,8.5528608553685839,8.3035625842664516,4.9386371460160401,"Moldova","Transnistria","","",7.3532379817089071,2.8386866884981492]
["MDA",2000,"MDA_2000_MICS",21,"Water ladder","Surface water","w_sur",0,0,0.044022903985614599,0,0,0,0,0,0,0,0,0,0,0.073822079831058707,0,"Moldova","Transnistria","","",0,0.060633876163610899]
["MDA",2000,"MDA_2000_MICS",22,"Improved water point at more than 30 minutes","Yes","",2.3330022174528948,2.5331313507144411,1.6659907888126211,1.481318391780001,0.74589608253613315,1.852314724670804,2.0001762840429298,1.0655207913061271,1.477291869173456,0.090710251652540194,2.5958897056713992,2.2633468979288862,2.5573749490106081,1.987070793337478,0.92400434580140711,"Moldova","Transnistria","","",1.9872486042840889,0.26432534262586321]
["MDA",2000,"MDA_2000_MICS",23,"Improved water point at more than 30 minutes","No","",97.666997782547057,97.466868649285473,98.334009211187364,98.518681608220035,99.254103917463851,98.147685275329337,97.999823715957106,98.934479208693872,98.522708130826558,99.909289748347462,97.404110294328561,97.736653102071145,97.442625050989406,98.01292920666252,99.07599565419855,"Moldova","Transnistria","","",98.012751395715952,99.735674657374091]
["MDA",2000,"MDA_2000_MICS",29,"Piped water","Yes","w_pip",5.945820295040031,11.02002813727576,30.394221167173178,67.078628216376771,76.122545622034224,58.026024143850243,76.85688483344137,84.78142118272514,86.562303550080614,91.67470830267456,3.4631755046511561,4.8849508912062074,7.3409318045464991,15.83492257767611,19.27595788230915,"Moldova","Transnistria","","",32.220704060686742,72.661282177880025]
["MDA",2000,"MDA_2000_MICS",30,"Piped water","No","",94.054179704959964,88.979971862724227,69.605778832826886,32.921371783623172,23.877454377965812,41.973975856150233,23.143115166558911,15.218578817274899,13.43769644991942,8.3252916973254081,96.536824495348824,95.115049108793784,92.659068195453472,84.165077422323904,80.724042117690757,"Moldova","Transnistria","","",67.779295939311879,27.33871782212]
["MDA",2000,"MDA_2000_MICS",31,"Piped water on premises","Yes","w_pop",5.0526687411932159,9.7682553361560753,28.93606436120098,65.260518016555011,75.4753980053936,54.926526445814297,74.571089983919606,83.592137626501028,85.506382246373775,91.448463518381828,2.8870726004486631,3.6859723333390808,6.6523206044392866,14.47868287576572,18.22119915053969,"Moldova","Transnistria","","",31.066999316216879,71.08626145772611]
["MDA",2000,"MDA_2000_MICS",32,"Piped water on premises","No","",94.947331258806784,90.231744663843898,71.063935638799052,34.739481983444982,24.52460199460636,45.073473554186172,25.428910016080689,16.40786237349899,14.49361775362625,8.5515364816181307,97.112927399551324,96.314027666660905,93.347679395560704,85.521317124234301,81.778800849460211,"Moldova","Transnistria","","",68.933000683781771,28.913738542273951]
["MDA",2000,"MDA_2000_MICS",35,"Water source on premises","Yes","",11.903274581749651,20.038599291023171,38.674835301643412,70.001519748805066,79.853562272528634,59.21363286124631,77.147741985586777,86.014497106782855,86.988217072612485,92.542422241225609,10.127650193013571,13.29486390064308,16.59964054030787,27.10427543227874,31.029979933566171,"Moldova","Transnistria","","",39.139338713220774,73.132947510827023]
["MDA",2000,"MDA_2000_MICS",36,"Water source on premises","No","",88.096725418250372,79.961400708976726,61.325164698356723,29.99848025119497,20.146437727471369,40.786367138754123,22.85225801441349,13.985502893217189,13.01178292738757,7.4575777587743186,89.872349806986605,86.705136099356963,83.400359459692154,72.895724567721302,68.97002006643369,"Moldova","Transnistria","","",60.860661286778033,26.867052489172991]
["MDA",2000,"MDA_2000_MICS",37,"Improved Water source on premises","Yes","w_premises",12.992915474390079,21.325024590546189,40.678724848211232,71.843303003625493,80.748168241862672,61.740260989900193,78.763039335139666,87.263269702432723,87.852096121464825,93.210259941127774,11.09595037737145,13.83814164226049,17.793086695863732,28.714762367372021,31.991982833711919,"Moldova","Transnistria","","",41.63106470293917,75.250083735660851]
["MDA",2000,"MDA_2000_MICS",38,"Improved Water source on premises","No","",87.007084525610111,78.674975409453722,59.321275151788832,28.156696996374521,19.251831758137332,38.259739010100262,21.236960664860579,12.736730297567361,12.14790387853526,6.7897400588721331,88.904049622628506,86.161858357739533,82.206913304136336,71.285237632627883,68.008017166287857,"Moldova","Transnistria","","",58.368935297059657,24.749916264338999]
["MDA",2000,"MDA_2000_MICS",41,"Water point at more than 30 minutes","Yes","",2.7599818684729991,2.679397524738421,1.8777944516070739,1.678476850441651,0.7346976915136304,2.393132846944364,2.1977192763460551,1.405610573688626,1.4580055114874779,0.089938057911488498,3.0503488791981619,2.3523016047869398,2.5827882939724751,2.353448536786348,0.87837112394885608,"Moldova","Transnistria","","",2.178535971241276,0.58530662385927168]
["MDA",2000,"MDA_2000_MICS",42,"Water point at more than 30 minutes","No","w_30min",97.240018131526924,97.320602475261538,98.122205548392913,98.321523149558359,99.265302308486355,97.60686715305566,97.802280723654007,98.594389426311338,98.541994488512472,99.910061942088518,96.949651120801832,97.647698395213069,97.41721170602753,97.646551463213683,99.121628876051147,"Moldova","Transnistria","","",97.821464028758527,99.414693376140818]
["MDA",2000,"MDA_2000_MICS",58,"Main source of water","Piped into dwelling","",1.524505860556542,4.6385122033953854,21.05677498065177,58.010511653580657,70.178659947985054,44.642808564022793,66.140758907535556,78.542913022737849,79.662726549330415,88.355020312954707,0.22004990781518341,0.73305102466810423,2.190545367368641,5.8174776146693929,10.294001239472729,"Moldova","Transnistria","","",26.83836563830468,55.907004687620052]
["MDA",2000,"MDA_2000_MICS",59,"Main source of water","Piped into yard or plot","",3.5281628806366681,5.1297431327606944,7.8792893805491939,7.2500063629743634,5.2967380574084819,10.28371788179153,8.4303310763840713,5.0492246037632356,5.8436556970434914,3.093443205427163,2.6670226926334788,2.9529213086709771,4.4617752370706452,8.661205261096331,7.9271979110669344,"Moldova","Transnistria","","",4.2286336779122324,15.179256770106139]
["MDA",2000,"MDA_2000_MICS",60,"Main source of water","Public tap","",0.89315155384681422,1.251772801119676,1.458156805972201,1.818110199821819,0.64714761664054621,3.0994976980359441,2.285794849521793,1.18928355622409,1.0559213037068329,0.22624478429272171,0.57610290420249288,1.198978557867125,0.68861120010721277,1.3562397019103949,1.0547587317694589,"Moldova","Transnistria","","",1.1537047444699271,1.575020720153951]
["MDA",2000,"MDA_2000_MICS",61,"Main source of water","Tubewell/borehole with pump","",0.89094403587411852,0.91226736120321239,3.5781754701121629,1.998042177346679,0.80506458668611269,0.2084263742539679,1.182012878211393,0.45702695621006961,0.25480643830466182,0.092568754365454198,0.79117979039354669,1.545310687460189,0.65200309659333955,4.1490193178914234,5.0929254436660081,"Moldova","Transnistria","","",0.71342662413915825,7.0835923023600369]
["MDA",2000,"MDA_2000_MICS",62,"Main source of water","Protected dug well","",75.020912042740846,75.719652222738105,56.438496423716799,25.51910336455186,19.304774136701141,34.265321106732003,17.269128108564949,12.46329060277993,10.35392636878036,6.1167302739411538,75.63495482844786,78.452903752456862,79.577222252771421,68.037090761704505,65.917204246617771,"Moldova","Transnistria","","",56.371543196313922,15.35245066975625]
["MDA",2000,"MDA_2000_MICS",63,"Main source of water","Protected spring","",2.2880296335014472,1.993521350682447,1.3764875536721419,0.82356576373455881,0.75197316081381027,2.2930254875142508,0.91054519666622802,0.38638797286166582,0.678927797354267,0.95875420444868298,1.8619650480667791,1.972512000758494,2.3652152386554248,1.581787438492094,0.80085035081569123,"Moldova","Transnistria","","",1.6268209146241031,0.38813434534574792]
["MDA",2000,"MDA_2000_MICS",64,"Main source of water","Rainwater collection","",0.1120869420737383,0.049928884831918902,0,0,0,0.0453549030700151,0,0,0,0,0.0095907315158027008,0.23088621782099331,0,0,0,"Moldova","Transnistria","","",0.036569980515988802,0.0078861516602752001]
["MDA",2000,"MDA_2000_MICS",65,"Main source of water","Bottled water","",0.100565243465407,0,0.1113577523728409,0.038520231957041802,0.1879015537310009,0.27733381128573792,0.030708091882846601,0,0.13880859727536679,0.21602535562082401,0.14190959335503581,0.026491375518285801,0,0,0.1171488254994429,"Moldova","Transnistria","","",0.083104071703356999,0.11352931037062319]
["MDA",2000,"MDA_2000_MICS",66,"Main source of water","Unprotected dug well","",12.66454094737562,7.9370318453174047,5.4200778203168332,1.925743753744076,1.3165413857635371,3.1420176380017799,1.4829253533897131,0.72732942546175672,0.98473120773831579,0.85127505103780843,14.662908893400941,10.591871258611469,7.6860282149521604,7.5768626842692273,3.6249358637955931,"Moldova","Transnistria","","",6.5394802012859161,1.822139525776296]
["MDA",2000,"MDA_2000_MICS",67,"Main source of water","Unprotected spring","",1.014983926894885,0.30521582672235742,0.56748637497922461,0.2811589585944671,0.087051822025504794,0.61993175917118204,0.52792214375134128,0.17060882239789441,0.077719269432908203,0,1.3304961800971939,0.23992210153079091,0.22257424403857409,0.42783714056360961,0.61654429241177411,"Moldova","Transnistria","","",0.43209097552492037,0.56564556715506364]
["MDA",2000,"MDA_2000_MICS",68,"Main source of water","Pond, river or stream","",0,0,0.043979722981811097,0,0,0,0,0,0,0,0,0,0,0.073700735454366201,0,"Moldova","Transnistria","","",0,0.060633876163610899]
["MDA",2000,"MDA_2000_MICS",69,"Main source of water","Tanker truck vendor","",1.686620876378309,1.540354746567919,1.768953141463609,1.5904227560241151,1.3264070029487569,0.57162521404292221,1.281923662599302,0.48083294060445048,0.70570610587501292,0.089938057911488498,1.863678894423584,1.869338436951576,1.51176675206477,2.0335654904849392,3.8572761050757438,"Moldova","Transnistria","","",1.5980365797898459,1.4938044779653079]
["MDA",2000,"MDA_2000_MICS",70,"Main source of water","Other","",0.27549605665567201,0.52199962466085625,0.22701373166655889,0.74481477767036086,0.097740729295972106,0.55093956207832784,0.45794973149315132,0.53310209695913102,0.2430706651585279,0,0.2401405356484437,0.18581327768529801,0.6442583963778542,0.16162300537016611,0.69715698980867213,"Moldova","Transnistria","","",0.36094579444727531,0.45090159556678783]
["MDA",2000,"MDA_2000_MICS",71,"Main source of water","Missing","",0,0,0.073750841544967499,0,0,0,0,0,0,0,0,0,0,0.1235908480935751,0,"Moldova","Transnistria","","",0.017277600967266601,0]
["MDA",2000,"MDA_2000_MICS",122,"Sanitation","Improved","s_imp",54.003282676283767,62.21480891904298,72.101349946884184,84.148845573243875,89.646615423604089,74.752020201464092,84.93175475003784,94.55692989693226,92.393423523367943,99.678129736697585,52.551119711098373,59.780589893656881,62.087704689867458,67.260699336536049,69.801124234469242,"Moldova","Transnistria","","",68.738433584721719,80.719315643881188]
["MDA",2000,"MDA_2000_MICS",123,"Sanitation","Not Improved","",45.996717323716233,37.78519108095702,27.898650053115819,15.85115442675612,10.353384576395911,25.247979798535908,15.06824524996216,5.4430701030677398,7.6065764766320569,0.32187026330241508,47.448880288901627,40.219410106343119,37.912295310132542,32.739300663463951,30.198875765530762,"Moldova","Transnistria","","",31.261566415278281,19.280684356118812]
["MDA",2000,"MDA_2000_MICS",124,"Sanitation ladder","Basic","s_bas",50.015006753994577,59.049921989865517,68.198940922585862,75.452837276052719,86.420845278158396,67.50390024566579,72.211996079981986,87.953655156352895,88.856114090144544,96.886274910738791,48.828297701350351,55.615537603488228,59.116821825298132,65.035525057043401,65.791631250108367,"Moldova","Transnistria","",""]
["MDA",2000,"MDA_2000_MICS",125,"Sanitation ladder","Limited","s_lim",3.9882759222891822,3.1648869291774839,3.9024090242983291,8.6960082971911525,3.225770145445646,7.2481199557982494,12.71975867005593,6.6032747405795122,3.5373094332234229,2.7918548259588611,3.7228220097480551,4.1650522901686813,2.9708828645693108,2.2251742794926441,4.0094929843608682,"Moldova","Transnistria","",""]
["MDA",2000,"MDA_2000_MICS",126,"Sanitation ladder","Unimproved","s_unimp",45.99671732371624,37.785191080956999,27.898650053115819,15.85115442675612,10.35338457639595,25.247979798535969,15.06824524996208,5.4430701030675976,7.6065764766320294,0.32187026330234397,47.448880288901591,40.219410106343091,37.912295310132563,32.739300663463951,30.198875765530769,"Moldova","Transnistria","",""]
["MDA",2000,"MDA_2000_MICS",127,"Sanitation ladder","Open defecation","s_od",0,0,0,0,0,0,0,0,0,0,0,0,0,0,0,"Moldova","Transnistria","",""]
["MDA",2000,"MDA_2000_MICS",135,"Sanitation type","Sewer connection","s_sew",1.960447503525437,3.2945375553930272,19.55252977753215,49.74054251927452,66.610991320283432,38.136467067603697,55.388269957789717,74.052942791387267,73.844818222454307,86.95158250551053,0.61239249273489882,0.93212165563240201,1.5108633266654139,4.6276154929516764,6.700090974801391,"Moldova","Transnistria","",""]
["MDA",2000,"MDA_2000_MICS",136,"Sanitation type","Septic tank connection","s_sep",0,0.25694263919287968,0.94615436325332358,2.6089982237707541,0.35091614949614652,4.3318718887823664,3.6900344668562872,0.79410525502430618,0.37167997780506917,0.28470926815735198,0,0,0.076167616250621295,0.1142593748927619,0.9142251521895548,"Moldova","Transnistria","",""]
["MDA",2000,"MDA_2000_MICS",137,"Sanitation type","Improved latrines","s_lat",52.042835172758338,58.663328724457067,51.602665806098713,31.799304830198611,22.684707953824521,32.283681245078029,25.85345032539183,19.70988185052067,18.17692532310857,12.44183796302972,51.938727218363468,58.848468238024473,60.500673746951428,62.518824468691612,62.186808107478299,"Moldova","Transnistria","",""]
["MDA",2000,"MDA_2000_MICS",138,"Sanitation type","Unimproved facilities","",45.996717323716233,36.78519108095702,25.898650053115819,12.851154426756111,6.3533845763959107,20.247979798535908,9.0682452499621604,-1.556929896932246,-0.39342352336795727,-8.6781297366975991,37.448880288901627,29.21941010634313,25.912295310132539,19.739300663463951,16.198875765530762,"Moldova","Transnistria","",""]
["MDA",2000,"MDA_2000_MICS",139,"Sanitation type","Open defecation","",0,1,2,3,4,5,6,7,8,9,10,11,12,13,14,"Moldova","Transnistria","",""]
["MDA",2000,"MDA_2000_MICS",153,"Type of toilet facility","Flush to sewage system/septic tank","",1.960447503525437,3.5514801945859071,20.498684140785471,52.349540743045267,66.961907469779575,42.46833895638607,59.078304424646007,74.847048046411572,74.21649820025938,87.236291773667872,0.61239249273489882,0.93212165563240212,1.587030942916035,4.7418748678444373,7.6143161269909454,"Moldova","Transnistria","","",26.958643409469289,41.298696902601897,null,null,125.653614087408,227.5289408924418,1315.243843523587,3369.9566272603338,4267.1118415106394,1094.1155882250489,1534.098890132937,1915.676817963415,1901.733663432394,2266.7616709423619,23.43477027385244,35.718195653682763,60.813549847009106,181.5561861513342,291.58553465237412,7383.4930245333762,1922.0018427410289]
["MDA",2000,"MDA_2000_MICS",154,"Type of toilet facility","Pour flush latrine","",0.1792653950381756,0.36528787103793547,0.995028840851643,2.7037270308071122,3.4821648290909399,2.6756695655789251,2.8685481259890149,3.324805026852212,3.9495806157161351,3.93007031364191,0.055795502625354203,0.1114405170430931,0.13001452132382549,0.3595630096757777,0.98416059283514012,"Moldova","Transnistria","","",0.62200641126925471,6.9689552154354972,null,null,11.48989948817642,23.402513280186589,63.843393462249189,174.0501004678213,221.89909663209201,68.933512649169231,74.488198996734042,85.096902021299869,101.2045919100123,102.1195716822174,2.135158091994017,4.2703161839880348,4.9820355479860403,13.766894010744929,37.687822236379418,170.35649491207059,324.3285084184547]
["MDA",2000,"MDA_2000_MICS",155,"Type of toilet facility","Improved pit latrine","",1.7229130764826679,2.7392243657782789,3.525457679269254,2.7864740231563538,2.303493798986036,2.7611812179947699,3.6626141651035788,1.694013714579736,1.714030572745997,1.1210819626778239,1.3457652951001939,1.8492487102427779,2.9662654294204138,3.99643009006813,4.3503598802288286,"Moldova","Transnistria","","",2.2363380828312369,4.8517158898162887,null,null,110.4289987001394,175.4910022481406,226.2016662345705,179.37686687866571,146.78891384531809,71.136556944806543,95.107880640639124,43.357525607692658,43.920552968530878,29.13037190503313,51.499162558886518,70.861809556349044,113.6645327280567,153.01470949675979,166.5943455000801,612.49323210688385,225.79421579995051]
["MDA",2000,"MDA_2000_MICS",156,"Type of toilet facility","Traditional pit latrine","",92.280023994851987,91.855944358659642,74.057277079871852,41.855436729282196,27.086734240385258,50.787701598467862,34.303595009101052,19.763495682774391,20.034205986775131,7.3906856867099862,94.02539673215216,94.08115039619021,94.095224384638414,89.695696693425262,86.646083507363898,"Moldova","Transnistria","","",68.647274349191207,46.635755802087147,null,null,5914.6284214059442,5884.8380363945016,4751.6892830024144,2694.4077138147391,1726.087693621374,1308.4480668309741,890.76874401760585,505.83785880151481,513.35922428439096,192.04075157253951,3598.123096652148,3605.1184058102281,3605.6414930174828,3434.2552386347311,3318.058268617378,18801.267690363369,2170.3834578757619]
["MDA",2000,"MDA_2000_MICS",157,"Type of toilet facility","Open pit","",2.1595283782057071,0.60433782550347737,0.32723188407924853,0.1052073719944817,0,0.96741325566887559,0.086938275160619596,0.17640820519426631,0,0,2.533576416191976,1.032380895288368,0.43900884026026232,0.37321409479865159,0.1456514201605647,"Moldova","Transnistria","","",0.72074049350260228,0.1611903965641889,null,null,138.4135739201879,38.717474924305513,20.995968228200809,6.7726340185047134,0,24.92355362355649,2.257544672834904,4.5150893456698089,0,0,96.95380330276501,39.560053759309163,16.822410495280192,14.289564688653989,5.5776312031293678,197.3980042484626,7.5016468427363314]
["MDA",2000,"MDA_2000_MICS",158,"Type of toilet facility","Bucket","",1.6107362292637371,0.78509323699911282,0.51184848088354395,0.1223903439362337,0,0.28433190465376951,0,0,0,0,1.316977444668515,1.891333445234902,0.70343267624651185,0.70963039609418688,0.25942847242051142,"Moldova","Transnistria","","",0.70325903439807169,0.035386871257136597,null,null,103.239096269882,50.297741484957058,32.841403803063123,7.8787730476007463,0,7.3252681116370297,0,0,0,0,50.397521585902751,72.474464717184475,26.954885984977011,27.170221037588949,9.934653168212682,192.61014347236619,1.646871133136675]
["MDA",2000,"MDA_2000_MICS",159,"Type of toilet facility","Other","",0.0111765568035374,0.039840500083060497,0,0,0,0,0,0,0,0,0.0187196168010129,0.066609337671244606,0,0,0,"Moldova","Transnistria","","",0.0093194051923055996,0.0153925419423722,null,null,0.71635417571356874,2.552419355271367,0,0,0,0,0,0,0,0,0.71635417571356874,2.552419355271367,0,0,0,2.552419355271367,0.71635417571356874]
["MDA",2000,"MDA_2000_MICS",160,"Type of toilet facility","97","",0.0057261511660882999,0.047265292867229698,0.073750841544967499,0.077223757778423302,0.1656996617581255,0,0,0.19422932418789479,0.085684624503576001,0.32187026330245572,0,0.0095777977493911991,0.079023205194514098,0.1235908480935751,0,"Moldova","Transnistria","","",0.082126746312652002,0.025020228635514501,null,null,0.3670139534651819,3.0280957341241099,4.7320276575072464,4.9712129392829079,10.559122574898369,0,0,4.9712129392829079,2.1955944946004622,8.3635280802979075,0,0.3670139534651819,3.0280957341241099,4.7320276575072464,0,22.493055355823099,1.1644175034547171]
["MDA",2000,"MDA_2000_MICS",161,"Type of toilet facility","98","",0.070182714662600204,0.0115263544853408,0.0107210527140212,0,0,0.055363501250263097,0,0,0,0,0.091376499725981206,0.0261372449476319,0,0,0,"Moldova","Transnistria","","",0.020292067832354599,0.0078861516602752001,null,null,4.4983156794367121,0.73844681223295749,0.68788798741244295,0,0,1.4263347996454001,0,0,0,0,3.4967562550347981,1.001559424401915,0,0,0,5.5576365256169309,0.3670139534651819]
["MDA",2005,"MDA_2005_DHS",16,"Water","Improved","w_imp",86.484070962391868,91.240164930830559,93.17046098318967,95.374884155639833,99.266838393503534,95.167006262919372,98.206462506335058,99.706759432408617,99.443611778589514,99.359504103654047,84.124175324099099,90.098592743655956,91.060125415992076,91.593181559788675,92.000836409419492,"Center","Chisinau","North","South",86.546115198908993,98.85583985843958,95.403127597627943,92.296517390587283]
["MDA",2005,"MDA_2005_DHS",17,"Water","Not Improved","",13.51592903760813,8.7598350691695774,6.8295390168103216,4.6251158443601943,0.73316160649645401,4.8329937370806393,1.793537493665003,0.29324056759139838,0.55638822141047795,0.64049589634598414,15.875824675901001,9.9014072563440063,8.9398745840078817,8.4068184402113548,7.9991635905804577,"Center","Chisinau","North","South",13.453884801091309,1.1441601415603659,4.5968724023719956,7.703482609412708]
["MDA",2005,"MDA_2005_DHS",18,"Water ladder","Basic","w_bas",84.466395669095689,88.928931708524047,91.618249685315462,93.962078455503502,98.526410934668888,93.404213792883056,96.242160133885861,98.64436318031872,97.974539387372005,99.269374847440901,81.940404516879823,88.059349039714874,88.731376580065856,89.773160200325549,91.150744682822776,"Center","Chisinau","North","South"]
["MDA",2005,"MDA_2005_DHS",19,"Water ladder","Limited","w_lim",2.0176752932961382,2.311233222306432,1.552211297874196,1.412805700136363,0.74042745883461702,1.7627924700364419,1.964302372449225,1.0623962520898971,1.4690723912175201,0.090129256213140593,2.183770807219247,2.0392437039411169,2.3287488359262229,1.8200213594631289,0.85009172659667942,"Center","Chisinau","North","South"]
["MDA",2005,"MDA_2005_DHS",20,"Water ladder","Unimproved","w_unimp",13.515929037608171,8.7598350691695259,6.8295390168103438,4.6251158443601383,0.73316160649649476,4.8329937370804998,1.793537493664914,0.29324056759138267,0.55638822141047228,0.6404958963459535,15.87582467590093,9.9014072563440152,8.9398745840079243,8.4068184402113246,7.9991635905805509,"Center","Chisinau","North","South"]
["MDA",2005,"MDA_2005_DHS",21,"Water ladder","Surface water","w_sur",0,0,0,0,0,0,0,0,0,0,0,0,0,0,0,"Center","Chisinau","North","South"]
["MDA",2005,"MDA_2005_DHS",29,"Piped water","Yes","w_pip",7.3365042637860354,13.62333995296491,23.19284115957786,51.10680476494084,84.325069671277845,39.576950568183591,67.539445753568216,85.221913352649324,87.509342520178663,86.472237807358809,5.8326947050475244,8.5507797492695587,12.519175953494051,16.79475765960132,17.848160874457221,"Center","Chisinau","North","South",19.62562437743485,87.739658317697049,19.952609019149641,26.56265951102694]
["MDA",2005,"MDA_2005_DHS",30,"Piped water","No","",92.663495736213861,86.376660047035188,76.807158840422076,48.893195235059352,15.674930328721929,60.423049431816409,32.460554246431919,14.778086647350831,12.49065747982133,13.527762192641291,94.167305294952527,91.449220250730406,87.480824046505873,83.205242340398627,82.151839125542637,"Center","Chisinau","North","South",80.374375622565708,12.26034168230275,80.04739098084967,73.437340488972907]
["MDA",2005,"MDA_2005_DHS",31,"Piped water on premises","Yes","w_pop",6.3635248343643553,12.66992439914177,22.10886132966705,50.280610259783657,84.101116300685064,38.013195768582612,66.082994757719689,84.963646415598674,87.335450626086057,86.182281915742891,4.4422842872199153,8.0603979939126482,11.4798780827205,16.023158752191961,17.276866053953249,"Center","Chisinau","North","South",18.747389957194851,87.434242887425427,19.610183213884628,24.55044008166989]
["MDA",2005,"MDA_2005_DHS",32,"Piped water on premises","No","",93.636475165635545,87.330075600858308,77.891138670332893,49.719389740216528,15.8988836993147,61.986804231417374,33.917005242280418,15.03635358440145,12.664549373913941,13.81771808425721,95.557715712780123,91.939602006087341,88.52012191727944,83.976841247807982,82.72313394604663,"Center","Chisinau","North","South",81.252610042805713,12.565757112574371,80.389816786114679,75.449559918329939]
["MDA",2005,"MDA_2005_DHS",58,"Source of drinking water","Piped into dwelling","",1.178537776561712,4.143505358545001,11.442916694797781,42.996131343221172,83.694478438642818,18.863152941821792,55.690905087212592,83.39082449669381,87.23702201851988,86.404457252094588,0.25280542816447721,1.7625355047227109,4.4422217812181524,7.7000727416525558,10.38704319260856,"Center","Chisinau","North","South",12.23954454826675,84.20343942617852,14.262860113804679,13.12396779325214]
["MDA",2005,"MDA_2005_DHS",59,"Source of drinking water","Piped to yard/plot","",5.195523272456418,8.5264190405967586,10.67437459983679,7.2844789165625281,0.54901113588275752,19.187485253508111,10.39208967050704,1.5728219189047989,0.2220171394421781,0.032930948253405201,4.2015079112475844,6.2978624891899369,7.0376563015023512,8.3230860105394218,6.8898228613446886,"Center","Chisinau","North","South",6.5078454089280449,3.366881088536982,5.3580471908528544,11.45596246457205]
["MDA",2005,"MDA_2005_DHS",60,"Source of drinking water","Public tap/standpipe","",0.97459041081782893,0.95341555382314847,1.084393144366733,0.82619450515716908,0.22433249724365509,1.5652950745857781,1.456450995848511,0.25826693705061882,0.1741379687821151,0.29081418369829309,1.3941754446478589,0.49038175535691242,1.039297870773551,0.77159890740935855,0.57129482050397284,"Center","Chisinau","North","South",0.87823442024000353,0.30589076128285903,0.34261306539300429,2.01463652270589]
["MDA",2005,"MDA_2005_DHS",61,"Source of drinking water","Artesian/tube well or borehole","",1.5041037083574671,1.854267043375039,1.782233461990594,1.9374811033761801,0.26904009395751188,1.2284701168415371,0.72904873475223042,0.1879815993243675,0.30817219946864283,0.0510997096785814,0.999726998953409,1.691040827593429,2.5302407495884172,2.069469997078107,3.1150049372620718,"Center","Chisinau","North","South",2.4572248107459438,0.52679820636584018,0.66016112526848725,2.4023120165470999]
["MDA",2005,"MDA_2005_DHS",62,"Source of drinking water","Protected well","",71.575053864968368,69.707410025803796,59.421864052010562,36.513468106786632,5.4111578843354016,47.497758706862967,23.61217351759003,7.41141889139762,2.8664827479722481,2.0984625556456091,70.910214262264347,73.867277395781969,70.58152725790525,63.646264362036312,64.1960166763063,"Center","Chisinau","North","South",58.873827927732862,4.1472449653518906,70.760925312847874,48.10112214265493]
["MDA",2005,"MDA_2005_DHS",63,"Source of drinking water","Ubprotected well","",10.606000504905969,6.6180539043241478,4.7221011897260317,2.2559385193115928,0.18189486372764771,3.2531731761095961,0.99514908379118672,0.10525896826703079,0.10749321240622429,0,13.08053746311343,7.6407163247739343,6.0300511503831986,6.0061617463383961,4.2298679298172468,"Center","Chisinau","North","South",10.31459923530069,0.33382683364713323,3.6649476807761459,4.2131269380285881]
["MDA",2005,"MDA_2005_DHS",64,"Source of drinking water","Rainwater","",0.045792883625548599,0.067977063737760801,0,0.048104229203377903,0,0,0.1242970951948596,0,0,0,0.074892130764343007,0.1107599741742195,0,0,0,"Center","Chisinau","North","South",0,0,0,0.1636045833067919]
["MDA",2005,"MDA_2005_DHS",65,"Source of drinking water","Tanker truck","",0.1629853768144694,0.47948069125611009,1.1821529231303141,0.15741948435324521,0,0.54457841500890725,0.1004679764186288,0.1737618590512951,0,0,0.094581564605392701,0.24820315504598531,0.65454834378376636,1.2958013315922181,0.42398059119390141,"Center","Chisinau","North","South",0.24975877102172511,0.038800371765012998,0,1.614532466665229]
["MDA",2005,"MDA_2005_DHS",66,"Source of drinking water","Cistern","",2.26794863543005,3.3432588961983511,4.339752860627744,2.3172098984576488,0.23046330984674049,3.8020374658536058,1.7521515635709539,0.44524830913935692,0.14925813271182009,0,2.3177306906599449,2.8478760759065351,2.8641944948672018,4.9327674501203758,3.54922901784344,"Center","Chisinau","North","South",1.4106935080267571,0.062172618667959999,0.039483156174089297,10.54556783126371]
["MDA",2005,"MDA_2005_DHS",67,"Source of drinking water","Cart with small tank","",0.1234823236110395,0.022006016846755301,0.2123103670799128,0.16983597773057971,0,0,0,0,0,0,0.1117712571493896,0.089758067072150893,0.035912320795788398,0.29895924316851807,0.32473198159322259,"Center","Chisinau","North","South",0,0,0.15623586882665219,0.28869091514424572]
["MDA",2005,"MDA_2005_DHS",68,"Source of drinking water","Bottled water","",0.066080555170073094,0.37428560603715633,0.66561982385184049,2.38311821236679,8.3866616434515766,1.101578897520088,2.7758341377698428,4.8726641962918276,8.2066985511597537,10.3104061707607,0.1080716737396379,0,0.35108691504481421,0.19481435934967939,1.49703774556544,"Center","Chisinau","North","South",1.605123587318219,6.2107355983968109,1.267962679231424,0.96011153142675443]
["MDA",2005,"MDA_2005_DHS",69,"Source of drinking water","Protected spring","",5.0372692596007802,3.6224066779855928,4.1826018080213796,2.67892348180087,0.93878053730892064,2.698857579201809,2.3020924622226189,1.581752823879331,0.72871802953714093,0.51654488451659264,4.8862208492251487,4.3839383264055298,4.0536801301011796,4.4298171539201849,4.1616795224599041,"Center","Chisinau","North","South",4.7810870273750421,0.67452857221956564,3.2671726858489452,4.1391884212909051]
["MDA",2005,"MDA_2005_DHS",70,"Source of drinking water","Unprotected spring","",1.253586544600835,0.28751412147038768,0.28967907456032688,0.43169622167242061,0.11417959560273019,0.23427798227603169,0.069339675121585204,0,0,0.29528429535233758,1.567764325465149,0.56965010397664384,0.37958268403626633,0.33118669679485069,0.65429072350114015,"Center","Chisinau","North","South",0.68206075504467911,0.12968155758706881,0.21375883795454281,0.97717637314180905]
["MDA",2005,"MDA_2005_DHS",71,"Source of drinking water","Other","",0.0090448830793082007,0,0,0,0,0.0233343904096853,0,0,0,0,0,0,0,0,0,"Center","Chisinau","North","South",0,0,0.0058322830205738002,0]
["MDA",2005,"MDA_2005_DHS",122,"Sanitation","Improved","s_imp",72.820562518090057,76.683576706343885,80.696007804003671,88.221210303604494,99.009302671321393,72.242494687771838,87.9553401796028,98.264391722179909,99.388070242495246,99.939840658389272,72.29280612988137,77.063289117772143,77.455450137744819,81.432271367096646,83.672156677444391,"Center","Chisinau","North","South",78.204151021270945,97.295639404051414,81.186052512654911,79.239241340474308,4671.1879579999841,4915.5054989999971,5176.6542539999909,5656.9674239999958,6349.0856440000216,1795.071009000003,2182.7055849999979,2442.101317000001,2468.7124180000019,2481.2529819999959,2838.4819849999958,3031.7467569999972,3042.396245999998,3199.0098880000019,3287.9225920000008,6885.4835389999926,6785.6412440000313,8067.4831060000079,5030.7928899999797]
["MDA",2005,"MDA_2005_DHS",123,"Sanitation","Not Improved","",27.17943748190973,23.316423293656161,19.30399219599623,11.778789696395551,0.99069732867858895,27.757505312228229,12.04465982039719,1.735608277820085,0.61192975750476319,0.060159341610710897,27.707193870118829,22.936710882227821,22.54454986225516,18.567728632903361,16.327843322555491,"Center","Chisinau","North","South",21.795848978729481,2.7043605959485371,18.813947487344471,20.76075865952545,1743.467183999996,1494.609561,1238.35238,755.28582500000027,63.529608000000003,689.71445800000072,298.90108100000009,43.133949000000023,15.199797999999999,1.4936039999999999,1087.8865390000001,902.35311300000023,885.53424900000084,729.42024699999945,641.60752000000036,1919.0152619999969,188.6088720000001,1869.547770999998,1318.072652999999]
["MDA",2005,"MDA_2005_DHS",124,"Sanitation ladder","Basic","s_bas",67.392172256678307,72.755886309078434,76.302541393228239,79.10340704868392,95.445057822450281,65.223906209098942,74.780366425401425,91.401073309188703,95.582356951400271,97.140508503381923,67.142628581831872,71.655728044664556,73.706812360699729,78.696669378429021,78.86588845663988,"Center","Chisinau","North","South",73.386870586175576,89.083628889682828,76.93724202383774,74.892072088027589,4314.335225999981,4658.1007719999989,4887.8849809999911,5071.852869999997,6110.4444800000174,1619.7825330000021,1855.3216650000011,2269.9325670000039,2371.7164400000029,2405.6988959999981,2633.3194599999979,2813.946297999998,2889.4434529999971,3084.3981820000022,3099.0588350000012,6455.6801600000008,6206.9062650000187,7632.8257909999966,4747.2061129999829]
["MDA",2005,"MDA_2005_DHS",125,"Sanitation ladder","Limited","s_lim",5.3739586457340316,3.8994827739119571,4.3661048409509604,9.1167397922326447,3.56261058385883,7.003309356478808,13.172163433010819,6.8620956976888969,3.8050771897464428,2.79918076849505,5.1191638300728606,5.366303501800826,3.704094690535642,2.692586927360427,4.8062682208045047,"Center","Chisinau","North","South",4.7981507911402481,8.2093924576355199,4.2181186157093506,4.313972520944942,344.03192999999987,249.65930099999991,279.68948199999988,584.53566799999942,228.08026599999991,173.92147799999989,326.80503399999998,170.41916399999991,94.416631000000052,69.322120999999996,200.77250500000011,210.73667499999999,145.207367,105.531915,188.86375699999991,422.08267799999987,571.9898269999992,418.47307899999959,273.45106299999998]
["MDA",2005,"MDA_2005_DHS",126,"Sanitation ladder","Unimproved","s_unimp",27.233869097587402,23.344630917009638,19.331353765820712,11.77985315908348,0.99233159369080493,27.772784434422281,12.047470141587871,1.7368309931225381,0.6125658588533367,0.060310728123094799,27.73820758809552,22.977968453534618,22.589092948764581,18.610743694210541,16.327843322555491,"Center","Chisinau","North","South",21.814978622684681,2.7069786526814328,18.844639360452199,20.793955391027289,1743.467183999996,1494.609561,1238.35238,755.28582500000027,63.529608000000003,689.71445800000072,298.90108100000009,43.133949000000023,15.199797999999999,1.4936039999999999,1087.8865390000001,902.35311300000023,885.53424900000084,729.42024699999945,641.60752000000036,1919.0152619999969,188.6088720000001,1869.547770999998,1318.072652999999]
["MDA",2005,"MDA_2005_DHS",127,"Sanitation ladder","Open defecation","s_od",0,0,0,0,0,0,0,0,0,0,0,0,0,0,0,"Center","Chisinau","North","South",0,0,0,0,28.052937,144.02071599999999,390.59492099999989,2358.4707820000049,6031.5904630000214,183.78336200000001,1111.9025440000009,2146.033273000005,2419.2096750000019,2467.9995529999969,11.220484000000001,20.403690999999998,115.50829299999999,210.02004700000001,266.64889699999998,950.45632900000066,5966.1591860000271,1403.4896109999991,632.62469299999975]
["MDA",2005,"MDA_2005_DHS",128,"Shared among Improved Sanitation","Yes","s_shared",7.3852472009829944,5.0870315028947424,5.412393841686967,10.33407914030392,3.5983178285125699,9.6962194951572531,14.97644633328416,6.9833852979121991,3.8285294540782702,2.8008699935819612,7.084191602794383,6.9672318349113871,4.7849777655802939,3.308282996522351,5.7441667714298754,"Center","Chisinau","North","South",6.1369181802543613,8.4378019553216159,5.1975847097078276,5.4465193183706262]
["MDA",2005,"MDA_2005_DHS",129,"Shared among Improved Sanitation","No","",92.614752799016969,94.912968497105282,94.587606158313037,89.665920859696087,96.401682171487366,90.303780504842678,85.023553666715941,93.016614702087949,96.171470545921764,97.199130006418116,92.915808397205694,93.032768165088655,95.215022234419664,96.691717003477635,94.255833228570111,"Center","Chisinau","North","South",93.863081819745759,91.562198044678183,94.802415290292046,94.553480681629438]
["MDA",2005,"MDA_2005_DHS",130,"Manually calculated ratios","Improved latrines","",54.335331234888592,60.484726247771789,63.575358347565228,62.857076241732791,62.388655552841527,52.860888791065577,56.327297559258326,74.334335103952625,62.459745811272313,100,53.748421359605537,60.466712801847557,61.00670270103398,64.844617426569428,65.614376707035532,"Center","Chisinau","North","South",56.697729152607657,59.181945615197442,64.274971827385968,57.734942250802114]
["MDA",2005,"MDA_2005_DHS",131,"Manually calculated ratios","Sewer among flush","",100,92.765195774297752,95.384316589518079,95.016196538233501,99.475946604934279,89.799761433497338,93.753993952952897,98.93902929273591,99.499194940723072,99.67363437582145,100,100,95.200621853618699,97.590417755061893,87.993338640763241,"Center","Chisinau","North","South",97.454047321098116,99.199574222977546,96.345842920522145,91.414612572762607]
["MDA",2005,"MDA_2005_DHS",135,"Sanitation type","Sewer connection","s_sew",0.43732572334751452,2.2467727123762442,6.0887687774135522,36.78068676354625,94.058199751167606,7.3963472678343631,44.805752629292847,86.351312584343674,97.395135762720543,99.406019402739005,0.28577256392044242,0.51863683369075242,2.9406908586349609,5.3461571106698544,6.785770547621131,"Center","Chisinau","North","South",10.795121340604361,85.545529437103397,14.12383264550853,9.9643737722167796]
["MDA",2005,"MDA_2005_DHS",136,"Sanitation type","Septic tank connection","s_sep",0,0.17522693266601069,0.29463784027631618,1.929225970906443,0.4955119362586059,0.84014150425647094,2.985014185160964,0.92598657820591201,0.49021478784820283,0.32548936107972198,0,0,0.14824995013054579,0.13200071839892849,0.92591610098342325,"Center","Chisinau","North","South",0.28201874474876348,0.69025343512644044,0.53568168056321963,0.93582422871606952]
["MDA",2005,"MDA_2005_DHS",137,"Sanitation type","Improved latrines","s_lat",72.383236794742501,74.26157706130158,74.312601186313799,49.511297569151999,4.4555909838951768,64.006005915680959,40.164573365149067,10.987092559630531,1.5027196919265029,0.2083318945705725,72.007033565960938,76.544652284081394,74.366509328979276,75.954113538027812,75.960470028839822,"Center","Chisinau","North","South",67.127010935917994,11.059856531821509,66.526538186582982,68.339043339541675]
["MDA",2005,"MDA_2005_DHS",138,"Sanitation type","Unimproved facilities","",27.17943748190973,23.316423293656161,19.30399219599623,11.778789696395551,0.99069732867858895,27.757505312228229,12.04465982039719,1.735608277820085,0.61192975750476319,0.060159341610710897,27.707193870118829,22.936710882227821,22.54454986225516,18.567728632903361,16.327843322555491,"Center","Chisinau","North","South",21.795848978729481,2.7043605959485371,18.813947487344471,20.76075865952545]
["MDA",2005,"MDA_2005_DHS",139,"Sanitation type","Open defecation","",0,0,0,0,0,0,0,0,0,0,0,0,0,0,0,"Center","Chisinau","North","South",0,0,0,0]
["MDA",2005,"MDA_2005_DHS",148,"Shared among improved sanitation facilities","Yes","",5.3632178563653206,3.8947709777927151,4.3599250625498263,9.1159167503429348,3.556743341632171,6.9994565047896664,13.16909075388501,6.8572648365114519,3.8011259170843421,2.792154519148339,5.1134401616347276,5.3566681569779284,3.6967906429311701,2.6863635440470919,4.8062682208045047,"Center","Chisinau","North","South",4.7939432730919638,8.2014527366571492,4.2112486534441977,4.3070854335779138]
["MDA",2005,"MDA_2005_DHS",149,"Shared among improved sanitation facilities","No","",67.257477299938458,72.66797441854348,76.194542887825705,79.096265743885979,95.287869923183649,65.188023453615955,74.76292236071879,91.336727675423376,95.483102209599238,96.896675221125506,67.067557309095989,71.527068223613739,73.561471025978449,78.514777557575172,78.86588845663988,"Center","Chisinau","North","South",73.322517339281262,88.997471581358866,76.811935934170137,74.772509842078222]
["MDA",2005,"MDA_2005_DHS",150,"Shared among improved sanitation facilities","DK/missing","",27.379304843695959,23.437254603663881,19.445532049624379,11.78781750577115,1.155386735184089,27.8125200415944,12.0679868853963,1.806007488065317,0.71577187331647574,0.31117025972621798,27.819002529269529,23.11626361940834,22.741738331090321,18.798858898377709,16.327843322555491,"Center","Chisinau","North","South",21.883539387627291,2.801075681983745,18.97681541238493,20.92040472434368]
["MDA",2005,"MDA_2005_DHS",151,"Shared among all sanitation facilities","Yes","",6.2571927985451827,4.2491054766447789,4.8308548488663154,9.920795361993493,3.6370673248680832,8.8302195071073317,13.88783361342578,6.8572648365114519,4.0084950812126454,2.792154519148339,5.9075826282962209,5.6874595572135798,3.90596438540982,2.9868132292436451,5.6763594974035003,"Center","Chisinau","North","South",5.52859058279551,8.3091191506100035,4.8247465681058168,4.8210339436869161]
["MDA",2005,"MDA_2005_DHS",152,"Shared among all sanitation facilities","No","",93.483903234239932,95.511276729650618,94.897473799462944,90.0701670631247,96.131064405858027,90.994545554876112,86.088833572161704,92.959094440920595,95.887662802975655,96.896675221125506,93.918310472490134,94.100130233401487,95.702926419784532,96.645745504743914,94.323640502596476,"Center","Chisinau","North","South",94.308835291891242,91.5567941756333,94.874812261421255,94.99989927887458]
["MDA",2005,"MDA_2005_DHS",153,"Type of toilet facility","Flush - to piped sewer system","",0.43740782999522859,2.2467727123762442,6.0979110737315034,36.797925233473769,94.186208971136722,7.4076320897964187,44.860054263104303,86.351312584343674,97.679132225354522,99.465857407682932,0.28577256392044242,0.51879562107784272,2.9406908586349609,5.3461571106698544,6.7958572346137283,"Center","Chisinau","North","South",10.797227427507609,85.641766110674126,14.13590387612583,9.9714430955491125,28.052937,144.02071599999999,390.59492099999989,2358.4707820000049,6031.5904630000214,183.78336200000001,1111.9025440000009,2146.033273000005,2419.2096750000019,2467.9995529999969,11.220484000000001,20.403690999999998,115.50829299999999,210.02004700000001,266.64889699999998,950.45632900000066,5966.1591860000271,1403.4896109999991,632.62469299999975]
["MDA",2005,"MDA_2005_DHS",154,"Type of toilet facility","Flush - to septic tank","",0,0.17522693266601069,0.29508023947733031,1.9301301656567109,0.49618630698453581,0.84142333256376234,2.9886318265952161,0.92598657820591201,0.49164421514546458,0.32568529120663492,0,0,0.14824995013054579,0.13200071839892849,0.92729242601924411,"Center","Chisinau","North","South",0.28207376552769198,0.69102995372366505,0.53613951217775602,0.93648815845277544,0,11.232248,18.901036999999999,123.706855,31.775274,20.875713999999999,74.076311000000018,23.012944999999998,12.176505000000001,8.0810759999999995,0,0,5.8231549999999999,5.1855560000000001,36.384152,24.830337,48.140000999999998,53.230854000000001,59.414222000000002]
["MDA",2005,"MDA_2005_DHS",155,"Type of toilet facility","Flush - to pit latrine","",0.016352833977783698,0.29294929691948479,0.63055975880279325,1.3280777267060759,0.31747515707856488,0.91673014029620692,2.1900063145334321,0.67375898890048957,0.35617835224735922,0,0,0.0266668903322267,0.27812045080497277,0.51650919840018972,0.78528350067527419,"Center","Chisinau","North","South",0.55898312927459826,0.85168542865393748,0.31105489538295572,0.41369569986043181,1.048781,18.778386999999999,40.389805000000003,85.119813000000008,20.330791000000001,22.744076,54.281557000000006,16.744496000000002,8.8214349999999992,0,0,1.048781,10.924378000000001,20.290703000000001,30.812151,49.206063000000007,59.331925000000012,30.883226000000001,26.246362999999999]
["MDA",2005,"MDA_2005_DHS",156,"Type of toilet facility","Flush - to somewhere else","",0,0.032529213289971798,0,0.38660248129260483,0,0,0.30633601787296022,0.037339402538479803,0,0,0,0,0.053085460719182097,0,0.41434108997973762,"Center","Chisinau","North","South",0.049931047861852998,0.059219916472515101,0.10426981750982101,0.12594131431955069,0,2.0851600000000001,0,24.778316999999991,0,0,7.5928529999999999,0.92797200000000002,0,0,0,0,2.0851600000000001,0,16.257491999999999,4.395321,4.1255039999999994,10.352475999999999,7.9901759999999999]
["MDA",2005,"MDA_2005_DHS",157,"Type of toilet facility","Flush - don't know where","",0,0.021501205315338001,0.010721737700720199,0.060477066679015298,0.0289814652528286,0.0276811351545381,0.1563835100737293,0,0.074936456005556096,0,0,0,0.035088502756207798,0,0,"Center","Chisinau","North","South",0,0.0266413142873369,0.020845702472977401,0.0610222192892046,0,1.378252,0.68676899999999996,3.8761260000000002,1.855944,0.68676899999999996,3.8761260000000002,0,1.855944,0,0,0,1.378252,0,0,0,1.855944,2.0696750000000002,3.8714719999999998]
["MDA",2005,"MDA_2005_DHS",158,"Type of toilet facility","Pit latrine - ventilated improved pit (VIP)","",30.72718786259512,31.346351870320412,32.738138062527263,24.493035369651398,2.2943895161023149,31.04571236232173,22.263474666458091,5.5610569305352842,0.65347865460117971,0.13473785318356571,30.41912323561619,31.525881582333689,31.846118982815671,31.691159654542261,35.26927353454159,"Center","Chisinau","North","South",30.690915297716021,6.3078072992613103,29.847140172726728,26.62672757408172,1970.6731479999989,2009.337221999999,2097.0050719999999,1569.819708999999,146.930406,770.24416500000029,551.82309800000007,138.20534799999999,16.184643000000001,3.3431869999999999,1194.3668800000009,1239.880060999998,1250.893419,1244.9650660000009,1383.85969,2701.654186999996,439.42791199999999,2963.386813999994,1689.2966439999991]
["MDA",2005,"MDA_2005_DHS",159,"Type of toilet facility","Pit latrine - with slab","",30.49044079900742,34.442493813831852,32.484177449476419,18.624827304171632,1.301754421449864,29.858865428766968,14.50167596480715,4.1906117470972646,0.42250804006836218,0.073719447926894305,30.273182935693391,33.424871143730847,34.025915853177551,33.519512877883969,29.256105207272011,"Center","Chisinau","North","South",28.03999343474797,3.676480873298666,30.839893840531769,27.342921027463809,1955.4894910000021,2207.803483000002,2080.737907000002,1193.711622,83.363049000000004,740.79849100000013,359.438941,104.14656100000001,10.464216,1.8291660000000001,1188.6367260000011,1314.565341,1336.514325000001,1316.790645,1147.9211399999999,2468.2993300000021,256.11884400000008,3061.9528109999951,1734.734567]
["MDA",2005,"MDA_2005_DHS",160,"Type of toilet facility","Pit latrine - without slab / open pit","",25.62487147763807,22.501624066011718,18.611370092522581,11.00561117270748,0.78476981907862842,26.626876887797408,11.24370255180084,1.4469065561698811,0.25394050223760212,0,26.050672109554711,21.853263874565609,21.748145596960221,18.172538379634421,15.331844378683609,"Center","Chisinau","North","South",21.415238465766951,2.5356854133645692,17.141292247505781,20.016476871793529,1643.4385849999969,1442.379993,1192.1306399999989,705.37706200000025,50.255873000000001,660.61285100000066,278.68672199999997,35.959032000000001,6.28932,0,1022.84539,859.46608900000001,854.25204300000041,713.89547399999958,601.57523200000048,1885.1366309999969,176.64632000000009,1701.880954999998,1269.9182469999989]
["MDA",2005,"MDA_2005_DHS",161,"Type of toilet facility","Composting toilet","",11.162845043846209,8.1582808749146007,8.5605846705203703,5.0280851883443187,0.51905429433719741,2.2546726723613579,1.1017097381899881,0.56166489309748902,0,0,11.31472739465149,11.59066780484109,8.1812655394249791,10.22693180720141,10.762718984808719,"Center","Chisinau","North","South",7.850215297382908,0.20968369026377021,5.5644618804892474,13.94316062772748,715.92360100000042,522.95519100000024,548.33874300000025,322.26251699999989,33.239716999999999,55.938432000000013,27.307008,13.958693999999999,0,0,444.25789500000008,455.84888300000011,321.35442400000011,401.75787100000031,422.29656199999999,691.03729299999941,14.607431999999999,552.47011499999962,884.60492900000168]
["MDA",2005,"MDA_2005_DHS",162,"Type of toilet facility","Bucket toilet","",1.4344248595327449,0.72573505412241424,0.51528134123300429,0.1081051403532188,0,0.61586627089471357,0.024670754401426801,0,0,0,1.4826115440813421,1.059853083118695,0.7433188045757414,0.39519025326894341,0.45728364340594269,"Center","Chisinau","North","South",0.25738102469651691,0,1.4066704302210451,0.25428064660757449,91.996136000000021,46.520451999999992,33.005774000000002,6.9287280000000004,0,15.279643,0.61148999999999998,0,0,0,58.212793000000012,41.682917000000003,29.197046,15.524773,17.942428,22.656689,0,139.66191000000001,16.132491000000002]
["MDA",2005,"MDA_2005_DHS",163,"Type of toilet facility","OTHER","",0.10646929340749239,0.056534960232055502,0.056175574008064,0.2371231509639451,0.071180048579323099,0.40453968004684471,0.36335439216298288,0.25136231911172302,0.068181554339979203,0,0.1739102164827771,0,0,0,0,"Center","Chisinau","North","South",0.058041109518351702,0,0.092327624855237794,0.30784276485492629,6.8283560000000003,3.6239560000000002,3.5982639999999999,15.197813999999999,4.5582989999999999,10.036630000000001,9.0061119999999999,6.2469450000000002,1.6886460000000001,0,6.8283560000000003,0,0,0,0,5.1092320000000004,0,9.1667900000000007,19.530667000000001]
["MDA",2012,"MDA_2012_MICS",16,"Water","Improved","w_imp",73.799999999999997,82,88.200000000000003,93.700000000000003,97.400000000000006,89.400000000000006,95.799999999999997,96.299999999999997,98,99.299999999999997,71.5,77.5,81.700000000000003,86.299999999999997,92.099999999999994,"Center","Chisinau","North","South",78.799999999999997,98.599999999999994,87.5,87.5]
["MDA",2012,"MDA_2012_MICS",17,"Water","Not Improved","",26.199999999999999,18,11.800000000000001,6.2999999999999998,2.6000000000000001,10.6,4.2000000000000002,3.7000000000000002,2,0.69999999999999996,28.5,22.5,18.300000000000001,13.699999999999999,7.9000000000000004,"Center","Chisinau","North","South",21.199999999999999,1.3999999999999999,12.5,12.5]
["MDA",2012,"MDA_2012_MICS",18,"Water ladder","Basic","w_bas",71.400000000000006,80.700000000000003,86.900000000000006,92.599999999999994,96.200000000000003,87.599999999999994,94.5,94.900000000000006,96.700000000000003,98,68.799999999999997,75.599999999999994,81.099999999999994,85,91.299999999999997,"Center","Chisinau","North","South",77,98.299999999999997,85.900000000000006,86]
["MDA",2012,"MDA_2012_MICS",19,"Water ladder","Limited","w_lim",2.1000000000000001,1.2,1.2,1.1000000000000001,1.1000000000000001,1.6000000000000001,1.2,1.3999999999999999,1.3,1.3,2.2000000000000002,1.8,0.59999999999999998,1.2,0.80000000000000004,"Center","Chisinau","North","South",1.6000000000000001,0.20000000000000001,1.7,1.3999999999999999]
["MDA",2012,"MDA_2012_MICS",20,"Water ladder","Unimproved","w_unimp",26.5,18.100000000000001,11.9,6.2999999999999998,2.6000000000000001,10.699999999999999,4.2000000000000002,3.7000000000000002,2,0.69999999999999996,28.899999999999999,22.600000000000001,18.300000000000001,13.699999999999999,7.9000000000000004,"Center","Chisinau","North","South",21.399999999999999,1.3999999999999999,12.5,12.6]
["MDA",2012,"MDA_2012_MICS",21,"Water ladder","Surface water","w_sur",0,0,0,0,0,0,0,0,0,0,0,0,0,0,0,"Center","Chisinau","North","South",0,0,0,0]
["MDA",2012,"MDA_2012_MICS",22,"Improved water point at more than 30 minutes","Yes","",2.7999999999999998,1.3999999999999999,1.3999999999999999,1.2,1.2,1.8,1.3,1.5,1.3,1.3,3.1000000000000001,2.2999999999999998,0.69999999999999996,1.3999999999999999,0.90000000000000002,"Center","Chisinau","North","South",2.1000000000000001,0.29999999999999999,1.8999999999999999,1.6000000000000001]
["MDA",2012,"MDA_2012_MICS",23,"Improved water point at more than 30 minutes","No","",97.200000000000003,98.599999999999994,98.599999999999994,98.799999999999997,98.799999999999997,98.200000000000003,98.700000000000003,98.5,98.700000000000003,98.700000000000003,96.900000000000006,97.700000000000003,99.299999999999997,98.599999999999994,99.099999999999994,"Center","Chisinau","North","South",97.900000000000006,99.700000000000003,98.099999999999994,98.400000000000006]
["MDA",2012,"MDA_2012_MICS",29,"Piped water","Yes","w_pip",22.199999999999999,36.799999999999997,48.200000000000003,65,84.400000000000006,62.200000000000003,78.700000000000003,84.900000000000006,88.200000000000003,93.900000000000006,17.899999999999999,25.600000000000001,33.5,38.399999999999999,51.600000000000001,"Center","Chisinau","North","South",41.5,95.200000000000003,31.300000000000001,56]
["MDA",2012,"MDA_2012_MICS",30,"Piped water","No","",77.799999999999997,63.200000000000003,51.799999999999997,35,15.6,37.799999999999997,21.300000000000001,15.1,11.800000000000001,6.0999999999999996,82.099999999999994,74.400000000000006,66.5,61.600000000000001,48.399999999999999,"Center","Chisinau","North","South",58.5,4.7999999999999998,68.700000000000003,44]
["MDA",2012,"MDA_2012_MICS",31,"Piped water on premises","Yes","w_pop",20.800000000000001,36.299999999999997,47.700000000000003,64.799999999999997,84,60.700000000000003,78.599999999999994,84.5,88,93.5,16.199999999999999,25.199999999999999,32.899999999999999,38.100000000000001,51.399999999999999,"Center","Chisinau","North","South",40.799999999999997,95.200000000000003,30.800000000000001,54.899999999999999]
["MDA",2012,"MDA_2012_MICS",32,"Piped water on premises","No","",79.200000000000003,63.700000000000003,52.299999999999997,35.200000000000003,16,39.299999999999997,21.399999999999999,15.5,12,6.5,83.799999999999997,74.799999999999997,67.099999999999994,61.899999999999999,48.600000000000001,"Center","Chisinau","North","South",59.200000000000003,4.7999999999999998,69.200000000000003,45.100000000000001]
["MDA",2012,"MDA_2012_MICS",35,"Water source on premises","Yes","",40.100000000000001,58.600000000000001,70.900000000000006,82.900000000000006,90.799999999999997,69.700000000000003,85.900000000000006,89.299999999999997,91.700000000000003,94.200000000000003,34.799999999999997,49.100000000000001,60.100000000000001,67.900000000000006,79.5,"Center","Chisinau","North","South",60.299999999999997,96,58.200000000000003,71.799999999999997]
["MDA",2012,"MDA_2012_MICS",36,"Water source on premises","No","",59.899999999999999,41.399999999999999,29.100000000000001,17.100000000000001,9.1999999999999993,30.300000000000001,14.1,10.699999999999999,8.3000000000000007,5.7999999999999998,65.200000000000003,50.899999999999999,39.899999999999999,32.100000000000001,20.5,"Center","Chisinau","North","South",39.700000000000003,4,41.799999999999997,28.199999999999999]
["MDA",2012,"MDA_2012_MICS",37,"Improved Water source on premises","Yes","w_premises",34.100000000000001,52.700000000000003,65,80,89.299999999999997,65.799999999999997,83.700000000000003,87.599999999999994,90.700000000000003,94.099999999999994,28.800000000000001,42.5,53.200000000000003,61.5,75.299999999999997,"Center","Chisinau","North","South",54.700000000000003,95.799999999999997,53.399999999999999,65.5]
["MDA",2012,"MDA_2012_MICS",38,"Improved Water source on premises","No","",65.900000000000006,47.299999999999997,35,20,10.699999999999999,34.200000000000003,16.300000000000001,12.4,9.3000000000000007,5.9000000000000004,71.200000000000003,57.5,46.799999999999997,38.5,24.699999999999999,"Center","Chisinau","North","South",45.299999999999997,4.2000000000000002,46.600000000000001,34.5]
["MDA",2012,"MDA_2012_MICS",41,"Water point at more than 30 minutes","Yes","",3,1.6000000000000001,1.3,1.3,1.1000000000000001,2,1.2,1.5,1.3,1.3,3.3999999999999999,2.2000000000000002,1,1.2,1,"Center","Chisinau","North","South",2.2999999999999998,0.29999999999999999,1.8999999999999999,1.5]
["MDA",2012,"MDA_2012_MICS",42,"Water point at more than 30 minutes","No","w_30min",97,98.400000000000006,98.700000000000003,98.700000000000003,98.900000000000006,98,98.799999999999997,98.5,98.700000000000003,98.700000000000003,96.599999999999994,97.799999999999997,99,98.799999999999997,99,"Center","Chisinau","North","South",97.700000000000003,99.700000000000003,98.099999999999994,98.5]
["MDA",2012,"MDA_2012_MICS",58,"Main source of drinking water","Piped into dwelling","",5.7999999999999998,18.199999999999999,35.299999999999997,53.899999999999999,67.200000000000003,44.100000000000001,68.700000000000003,71.200000000000003,73.200000000000003,69.400000000000006,2.5,8.0999999999999996,15.199999999999999,26.800000000000001,41.200000000000003,"Center","Chisinau","North","South",24.300000000000001,78.5,21.399999999999999,36.5]
["MDA",2012,"MDA_2012_MICS",59,"Main source of drinking water","Piped into compound, yard or plot","",14.800000000000001,17.199999999999999,10.9,6.0999999999999996,1.5,13.199999999999999,5,1.8999999999999999,1,0.20000000000000001,13.5,17,17.699999999999999,11,8.5,"Center","Chisinau","North","South",15,1.3999999999999999,6.7999999999999998,16.300000000000001]
["MDA",2012,"MDA_2012_MICS",60,"Main source of drinking water","Piped to neighbour","",1.1000000000000001,0.20000000000000001,0.40000000000000002,0.20000000000000001,0,0.90000000000000002,0,0.29999999999999999,0,0,1.5,0.10000000000000001,0.40000000000000002,0.10000000000000001,0.10000000000000001,"Center","Chisinau","North","South",0.5,0.10000000000000001,0.10000000000000001,0.80000000000000004]
["MDA",2012,"MDA_2012_MICS",61,"Main source of drinking water","Public tap / standpipe","",0.29999999999999999,0.20000000000000001,0.10000000000000001,0,0.40000000000000002,0.5,0.10000000000000001,0.20000000000000001,0.20000000000000001,0.40000000000000002,0.29999999999999999,0.20000000000000001,0.20000000000000001,0.10000000000000001,0.10000000000000001,"Center","Chisinau","North","South",0.20000000000000001,0,0.29999999999999999,0.29999999999999999]
["MDA",2012,"MDA_2012_MICS",62,"Main source of drinking water","Tube well, Borehole","",0.59999999999999998,0.69999999999999996,1.1000000000000001,0.80000000000000004,0.5,0.20000000000000001,0.40000000000000002,0.20000000000000001,0.40000000000000002,0.40000000000000002,0.59999999999999998,0.40000000000000002,1.7,1.1000000000000001,1,"Center","Chisinau","North","South",0.40000000000000002,0.10000000000000001,1.2,1.1000000000000001]
["MDA",2012,"MDA_2012_MICS",63,"Main source of drinking water","Protected well","",46.600000000000001,40.600000000000001,35.700000000000003,24.199999999999999,8.4000000000000004,23.899999999999999,12.800000000000001,7.4000000000000004,5.2999999999999998,1.1000000000000001,48.600000000000001,46.299999999999997,43.700000000000003,43.700000000000003,35.399999999999999,"Center","Chisinau","North","South",33.799999999999997,2,50.700000000000003,23.600000000000001]
["MDA",2012,"MDA_2012_MICS",64,"Main source of drinking water","Unprotected well","",24,16.600000000000001,10.699999999999999,5.5,1.8,8.5,2.7000000000000002,2.3999999999999999,1.1000000000000001,0.20000000000000001,26.300000000000001,21.199999999999999,16.699999999999999,13.1,7.2999999999999998,"Center","Chisinau","North","South",19.899999999999999,0.69999999999999996,11.9,9.5]
["MDA",2012,"MDA_2012_MICS",65,"Main source of drinking water","Protected spring","",3,3.7000000000000002,2.2999999999999998,2.3999999999999999,3.5,2.6000000000000001,3.2999999999999998,2.7000000000000002,3.7000000000000002,3.5,2.8999999999999999,4.4000000000000004,2.5,2.1000000000000001,2.5,"Center","Chisinau","North","South",2.1000000000000001,1,3.7999999999999998,4.9000000000000004]
["MDA",2012,"MDA_2012_MICS",66,"Main source of drinking water","Unprotected spring","",1.3999999999999999,0.69999999999999996,0.5,0.10000000000000001,0.40000000000000002,0.40000000000000002,0.40000000000000002,0.29999999999999999,0.40000000000000002,0,1.5,0.90000000000000002,1,0.20000000000000001,0.29999999999999999,"Center","Chisinau","North","South",1,0.20000000000000001,0.5,0.5]
["MDA",2012,"MDA_2012_MICS",67,"Main source of drinking water","Rainwater collection","",0,0,0,0,0,0,0,0,0,0,0,0,0,0,0,"Center","Chisinau","North","South",0,0,0,0]
["MDA",2012,"MDA_2012_MICS",68,"Main source of drinking water","Tanker-truck","",1,0.10000000000000001,0.59999999999999998,0.40000000000000002,0.10000000000000001,0,0,0,0,0,1.1000000000000001,0.59999999999999998,0.20000000000000001,1,0.69999999999999996,"Center","Chisinau","North","South",0.40000000000000002,0,0,1.7]
["MDA",2012,"MDA_2012_MICS",69,"Main source of drinking water","Cart with small tank / drum","",0.10000000000000001,0,0,0,0,0,0,0,0.10000000000000001,0,0,0.10000000000000001,0,0,0,"Center","Chisinau","North","South",0,0,0,0]
["MDA",2012,"MDA_2012_MICS",70,"Main source of drinking water","Bottled water","",0.40000000000000002,1.1000000000000001,1.8,5.7000000000000002,15.800000000000001,3.7999999999999998,5.4000000000000004,12.300000000000001,14.1,24.300000000000001,0.5,0.29999999999999999,0.20000000000000001,0.40000000000000002,2.5,"Center","Chisinau","North","South",2,15.5,3.1000000000000001,2.1000000000000001]
["MDA",2012,"MDA_2012_MICS",71,"Main source of drinking water","Other","",0.80000000000000004,0.80000000000000004,0.59999999999999998,0.69999999999999996,0.5,1.8,1.2,0.90000000000000002,0.5,0.5,0.69999999999999996,0.5,0.59999999999999998,0.29999999999999999,0.40000000000000002,"Center","Chisinau","North","South",0.29999999999999999,0.5,0,2.5]
["MDA",2012,"MDA_2012_MICS",122,"Sanitation","Improved","s_imp",60.807699641296708,68.688202892995278,76.763625146438301,88.628876447689805,97.139800530096139,87.060470832332754,93.034575951809927,97.368295473123737,98.88060626330946,99.898007041552944,56.739621498442887,64.102495044308256,65.353301935952274,71.876755799737126,84.041008422657839,"Center","Chisinau","North","South",70.826837725539079,98.99194871166884,78.493203536092125,69.662952654745951,3502.5170093478582,3953.9264873802249,4419.667569613749,5105.5791415954018,5589.7622086872243,1865.2546382198771,1993.821263464881,2087.3715380716412,2118.2210291962192,2140.4317776829471,2054.9302916594711,2313.1225040771069,2362.8787462130458,2598.9028721759869,3036.517755863294,6151.2185691689119,5446.1151677513808,7126.2442617938323,3847.8744179104169]
["MDA",2012,"MDA_2012_MICS",123,"Sanitation","Not Improved","",39.19230035870337,31.31179710700496,23.236374853561799,11.37112355231012,2.860199469903852,12.939529167667491,6.965424048190215,2.63170452687624,1.119393736690568,0.1019929584470491,43.260378501557327,35.897504955691907,34.646698064047612,28.123244200262789,15.958991577342131,"Center","Chisinau","North","South",29.17316227446107,1.008051288331137,21.506796463908049,30.337047345254479,2257.4723176767329,1802.4134965611081,1337.8348427365861,655.04803346395181,164.58583216075661,277.22704191268451,149.27579810246991,56.41821189662366,23.979660346078639,2.1853185646551871,1566.754586368608,1295.35248972502,1252.6673336601921,1016.873665397638,576.62041662516719,2533.651130937556,55.458686112362493,1952.5599413205321,1675.684764228683]
["MDA",2012,"MDA_2012_MICS",124,"Sanitation ladder","Basic","s_bas",52.566529109581417,59.435613549961417,67.788189101530548,78.222374025663328,90.310749447028343,67.413112179298892,81.501424128217693,88.018396748990085,90.334057727780859,95.428257250581751,50.748136853285096,56.572469102638848,58.975107458637218,63.232311460860892,74.707756071492753,"Center","Chisinau","North","South",64.758019423300581,86.446230653345296,68.251119218238586,62.975788393766138,3027.8264662991619,3421.3159874772741,3902.9066228092238,4506.0993350989347,5196.7948414802049,1444.3135784486881,1746.654625627375,1886.92936759125,1935.136807536059,2044.6621545021069,1837.937598296417,2041.4034009451541,2132.2721858217901,2286.3390819672882,2699.2944524286718,5624.1496072832851,4755.9032232751924,6196.385480258029,3478.5049423483451]
["MDA",2012,"MDA_2012_MICS",125,"Sanitation ladder","Limited","s_lim",8.2411705317152908,9.2525893430338222,8.9754360449078003,10.40650242202641,6.8290510830679194,19.64735865303355,11.533151823592229,9.34989872413367,8.5465485355286894,4.469749790971183,5.991484645157783,7.5300259416693782,6.378194477315053,8.6444443388761734,9.3332523511650347,"Center","Chisinau","North","South",6.0688183022384328,12.54571805832353,10.242084317853321,6.6871642609797286,474.6905430486961,532.6104999029493,516.76094680452752,599.47980649646354,392.9673672070266,420.94105977118238,247.16663783750599,200.44217048039121,183.08422166016271,95.76962318084,216.99269336305329,271.71910313195218,230.60656039125601,312.56379020869639,337.22330343462079,527.06896188562075,690.21194447618961,929.8587815357829,369.36947556206849]
["MDA",2012,"MDA_2012_MICS",126,"Sanitation ladder","Unimproved","s_unimp",38.676300898431442,31.31179710700475,23.236374853561649,11.371123552310261,2.8601994699037392,12.88319715687962,6.9654240481900782,2.6317045268762449,1.1193937366904509,0.1019929584470658,42.473048521498022,35.897504955691772,34.646698064047733,28.123244200262931,15.958991577342211,"Center","Chisinau","North","South",29.109268276744249,1.0080512883311721,21.253839137521261,30.31519724876047,2227.7508038375699,1802.4134965611081,1337.8348427365861,655.04803346395181,164.58583216075661,276.02013890150272,149.27579810246991,56.41821189662366,23.979660346078639,2.1853185646551871,1538.2399755406259,1295.35248972502,1252.6673336601921,1016.873665397638,576.62041662516719,2528.102020489669,55.458686112362493,1929.594440940439,1674.477861217501]
["MDA",2012,"MDA_2012_MICS",127,"Sanitation ladder","Open defecation","s_od",0.51599946027185328,0,0,0,0,0.056332010787933401,0,0,0,0,0.78732998005908894,0,0,0,0,"Center","Chisinau","North","South",0.0638939977167398,0,0.25295732638683438,0.0218500964936593,29.721513839163229,0,0,0,0,1.2069030111817689,0,0,0,0,28.51461082798145,0,0,0,0,5.5491104478878448,0,22.965500380093609,1.2069030111817689]
["MDA",2012,"MDA_2012_MICS",128,"Shared among Improved Sanitation","Yes","s_shared",13.55284047962639,13.470419887746671,11.69230351978009,11.74166122727337,7.0301267305486403,22.567484950629119,12.396629646128741,9.6026110744790572,8.6433011067610774,4.4743132754510047,10.55961334765373,11.74685312399237,9.7595596371945046,12.02675919731451,11.105593003151959,"Center","Chisinau","North","South",8.5685292427648641,12.673473167868529,13.04837088620531,9.5993121252292344]
["MDA",2012,"MDA_2012_MICS",129,"Shared among Improved Sanitation","No","",86.447159520373603,86.529580112253285,88.307696480219974,88.25833877272656,92.969873269451483,77.432515049370522,87.603370353871256,90.397388925520957,91.356698893239013,95.52568672454899,89.440386652346263,88.253146876007591,90.240440362805501,87.97324080268541,88.894406996847991,"Center","Chisinau","North","South",91.431470757235033,87.326526832131464,86.951629113794411,90.400687874770654]
["MDA",2012,"MDA_2012_MICS",135,"Sanitation type","Sewer connection","s_sew",2.4382083631962939,7.5368967806120306,17.732087728570878,36.112004728496473,71.898953784249159,33.35220284329688,55.334299256577857,71.340378442254831,78.58884958670572,93.580194010868595,0.69781865282712385,1.3423851629638119,1.7082001272847791,4.9417005450815656,10.523784393546739,"Center","Chisinau","North","South",10.20114771756295,87.7247650805934,16.267681683982719,11.29161839698803]
["MDA",2012,"MDA_2012_MICS",136,"Sanitation type","Septic tank connection","s_sep",0.36252138671254308,1.3436487249778819,5.0579903444304168,10.049159964692169,8.5489266634062666,4.0953385765582624,7.1200823034818077,8.4917105882090027,9.1215985212433637,3.895747354009294,0.20680242075643901,0.55584485983496712,1.505381438576967,5.2159204611296799,13.518669812765101,"Center","Chisinau","North","South",6.4270841870618014,3.4456520977920162,4.5120855902582067,5.4833726509742009]
["MDA",2012,"MDA_2012_MICS",137,"Sanitation type","Improved latrines","s_lat",58.006969891387861,59.807657387405357,53.973547073436947,42.467711754501202,16.69192008244076,49.6129294124773,30.580194391750421,17.53620644265991,11.170158155360379,2.422065676675047,55.835000424859302,62.204265021509443,62.139720370090537,61.719134793525868,59.998554216345923,"Center","Chisinau","North","South",54.198605820914089,7.8215315332835456,57.713436261850887,52.887961606783662]
["MDA",2012,"MDA_2012_MICS",138,"Sanitation type","Unimproved facilities","",38.676300898431528,31.31179710700496,23.236374853561799,11.37112355231012,2.860199469903852,12.88319715687955,6.965424048190215,2.63170452687624,1.119393736690568,0.1019929584470491,42.473048521498207,35.897504955691907,34.646698064047612,28.123244200262789,15.958991577342131,"Center","Chisinau","North","South",29.109268276744331,1.008051288331137,21.253839137521219,30.315197248760821]
["MDA",2012,"MDA_2012_MICS",139,"Sanitation type","Open defecation","",0.51599946027185328,0,0,0,0,0.056332010787933401,0,0,0,0,0.78732998005908894,0,0,0,0,"Center","Chisinau","North","South",0.0638939977167398,0,0.25295732638683438,0.0218500964936593]
["MDA",2012,"MDA_2012_MICS",148,"Shared among improved sanitation facilities","Yes","",8.2411705317152908,9.2525893430338204,8.9754360449078003,10.40650242202641,6.8290510830679176,19.64735865303355,11.533151823592229,9.34989872413367,8.5465485355286894,4.4697497909711812,5.991484645157783,7.5300259416693782,6.3781944773150538,8.6444443388761734,9.3332523511650365,"Center","Chisinau","North","South",6.0688183022384337,12.54571805832353,10.242084317853321,6.6871642609797277]
["MDA",2012,"MDA_2012_MICS",149,"Shared among improved sanitation facilities","No","",52.566529109581417,59.435613549961417,67.788189101530548,78.222374025663328,90.310749447028343,67.413112179298892,81.501424128217707,88.018396748990085,90.334057727780859,95.428257250581765,50.748136853285111,56.572469102638848,58.975107458637233,63.232311460860892,74.707756071492753,"Center","Chisinau","North","South",64.758019423300567,86.446230653345324,68.251119218238571,62.975788393766152]
["MDA",2012,"MDA_2012_MICS",150,"Shared among improved sanitation facilities","DK/missing","",39.19230035870337,31.31179710700496,23.236374853561799,11.37112355231012,2.860199469903852,12.939529167667491,6.965424048190215,2.63170452687624,1.119393736690568,0.1019929584470491,43.260378501557327,35.897504955691907,34.646698064047612,28.123244200262789,15.958991577342131,"Center","Chisinau","North","South",29.17316227446107,1.008051288331137,21.506796463908049,30.337047345254479]
["MDA",2012,"MDA_2012_MICS",151,"Shared among all sanitation facilities","Yes","",12.0764788916133,12.51582339528494,11.067611422937629,11.60222842503258,7.0649278401787834,21.014444399350939,12.45549810765643,9.7388261422710141,8.7511750017269261,4.4697497909711812,10.43589614464884,11.24148695762246,9.4053459863003823,11.48595002823563,10.50812828655449,"Center","Chisinau","North","South",9.6529007481784888,12.724408082913961,12.24050609972965,8.6604070340914969]
["MDA",2012,"MDA_2012_MICS",152,"Shared among all sanitation facilities","No","",87.923521108386694,87.484176604715174,88.932388577062312,88.397771574967365,92.935072159821246,78.985555600649008,87.544501892343703,90.261173857728977,91.248824998273179,95.530250209028793,89.564103855351192,88.758513042377501,90.594654013699596,88.514049971764436,89.491871713445491,"Center","Chisinau","North","South",90.347099251821604,87.275591917086075,87.759493900270314,91.339592965908722]
["MDA",2012,"MDA_2012_MICS",153,"Type of toilet facility","Flush to piped sewer system","",2.4382083631962939,7.5368967806120306,17.732087728570878,36.112004728496473,71.898953784249159,33.35220284329688,55.334299256577857,71.340378442254831,78.58884958670572,93.580194010868595,0.69781865282712385,1.3423851629638119,1.7082001272847791,4.9417005450815656,10.523784393546739,"Center","Chisinau","North","South",10.20114771756295,87.7247650805934,16.267681683982719,11.29161839698803,140.44054149072741,433.84940293075641,1020.925378732545,2080.2779578484879,4137.3160384741377,714.56483583828515,1185.867741406603,1529.387720633629,1683.5308777497689,2005.0652355785451,25.27279262549915,48.439632926059019,61.760762738434558,178.6808488662073,380.23887111362058,885.95638718572616,4826.2427390373186,1476.9109684746859,623.69922477893749]
["MDA",2012,"MDA_2012_MICS",154,"Type of toilet facility","Flush to septic tank","",0.36252138671254308,1.3436487249778819,5.0579903444304168,10.049159964692169,8.5489266634062666,4.0953385765582624,7.1200823034818077,8.4917105882090027,9.1215985212433637,3.895747354009294,0.20680242075643901,0.55584485983496712,1.505381438576967,5.2159204611296799,13.518669812765101,"Center","Chisinau","North","South",6.4270841870618014,3.4456520977920162,4.5120855902582067,5.4833726509742009,20.88119318282401,77.344988799619557,291.21391609702789,578.89463979124253,491.93499396924921,87.741878742162157,152.59027462709531,182.0444211869945,195.40294641935529,83.470948833616717,7.4897319999319381,20.057522771479231,54.427759589608932,188.59602825202921,488.44821941769032,558.18388716246375,189.5650949072332,409.6434162164789,302.87733355378828]
["MDA",2012,"MDA_2012_MICS",155,"Type of toilet facility","Flush to pit (latrine)","",0.34646746261693029,0.48565288985257182,1.3616666581386669,2.126612081331904,2.5963204981588399,0.90551957726095533,1.656874311931396,2.4036536647616851,2.8843542402228648,1.230221387916278,0.29559601607776081,0.1695597987058769,0.75873518034239906,1.305217766446306,3.1048266921887042,"Center","Chisinau","North","South",1.063371187336515,0.36589940314546182,1.1420898030683559,3.2958295771800672,19.956488868348082,27.955831481750089,78.397990690503846,122.5061934653011,149.40131771993779,19.400591052829729,35.508424692865951,51.529280889897571,61.788656422896707,26.358933779188689,10.705556214341691,6.1185229358427788,27.432420069488781,47.193757763408087,112.1816784050809,92.352402048651285,20.13022589489422,103.6880970443103,182.0470972379851]
["MDA",2012,"MDA_2012_MICS",156,"Type of toilet facility","Flush to somewhere else","",0.0105449040620962,0.021244592182193399,0.096480484554637605,0.049693833944603402,0.037976822902306598,0.028349616902402001,0.078322662961558903,0,0,0.1019929584470491,0,0.033889966157707403,0,0.15362858207515631,0.032773333250515499,"Center","Chisinau","North","South",0.0140809361157587,0.039721698239503597,0.079673454260305601,0.032434361677268403,0.60738534852172466,1.222910954208873,5.5548662256805459,2.8626765025416958,2.1853185646551871,0.60738534852172466,1.678530688470466,0,0,2.1853185646551871,0,1.222910954208873,0,5.5548662256805459,1.1841458140712291,1.222910954208873,2.1853185646551871,7.2333969141510126,1.791531162592954]
["MDA",2012,"MDA_2012_MICS",157,"Type of toilet facility","Flush to unknown place / Not sure / DK where","",0,0.096880546649771193,0,0.023141447583271298,0.1615234718707273,0,0,0.062183920704153899,0,0,0,0.051515516970837699,0.1028295315149594,0,0.25724515076325988,"Center","Chisinau","North","South",0.18658298236241769,0,0,0,0,5.5767736434617028,0,1.333092518184045,9.294622739102838,0,0,1.333092518184045,0,0,0,1.858924547820568,3.7178490956411352,0,9.294622739102838,16.20448890074859,0,0,0]
["MDA",2012,"MDA_2012_MICS",158,"Type of toilet facility","Ventilated Improved Pit latrine (VIP)","",0.23127299147342159,1.095223729401233,1.3936711346607471,3.421300423179809,0.95280888109733564,0.94249073088614321,1.953593207076082,1.272382648006634,0.43733501984853168,0.0347509523474109,0.076773650833198898,0.59233812202483671,1.5548184700927441,0.92433503838030473,5.4047376363124346,"Center","Chisinau","North","South",1.766084067520524,0.47150784437761017,1.364841054242528,1.906186727781513,13.321299625159559,63.044801449136479,80.240649198322728,197.08836191811679,54.827939182450109,20.192691246183049,41.867398615826822,27.27720878834101,9.3685938108051907,0.74457984610448269,2.7804997025360372,21.37437301202333,56.215178244583328,33.421889446327249,195.2806386604552,153.38210005849771,25.940352285195161,123.9112469984008,105.28935203109221]
["MDA",2012,"MDA_2012_MICS",159,"Type of toilet facility","Pit latrine with slab","",57.277916959056618,58.129900221501799,51.082248384174747,36.789374453984841,12.98126723131386,47.561909708128333,26.96972687274295,13.67356584185894,7.8484688952889874,1.1570933364113589,55.46263075794834,61.16944746105397,59.723337188140448,59.373292087491613,51.134519486506768,"Center","Chisinau","North","South",51.120912652666753,6.878663927301119,55.206505404539961,47.476531445606859,3299.201903583667,3346.1546890755021,2941.0616830016488,2119.2987023305959,746.98729660235006,1019.005202217837,577.98742412249339,293.13250297293382,168.12995479339341,24.792079645491562,2008.6817111171611,2207.2842154790592,2159.32477647529,2146.8055648845811,1847.560842885528,4439.7846533893417,378.43477611955541,5012.0905330599244,2622.3943120249642]
["MDA",2012,"MDA_2012_MICS",160,"Type of toilet facility","Pit latrine without slab / Open pit","",35.538743393340823,29.77630894251018,21.776843878327199,11.062029575249269,2.6041843975059629,11.68792223031924,6.5152584941605944,2.5853094442547699,1.119393736690568,0,38.958938174256879,34.115451695692002,32.421144920314667,26.768045181086091,15.23376611459654,"Center","Chisinau","North","South",28.655242277703682,0.90389854656384927,17.64436879096105,30.083049366443959,2047.027826415087,1714.025577399608,1253.802311628453,637.24228182491254,149.85383385795319,250.41159257273009,139.62831334187271,55.423598870895283,23.979660346078639,0,1410.9699724973671,1231.0475434616869,1172.20143421646,967.87269722481881,550.41701859410023,2488.6704540683818,49.728646103211133,1601.897695406768,1661.6550355476461]
["MDA",2012,"MDA_2012_MICS",161,"Type of toilet facility","Composting toilet","",0.15131247824088351,0,0.13596089646278139,0.1072833484213733,0,0.2030093962018798,0,0.12442036732850061,0,0,0,0.2214041227539264,0,0.1162899012076479,0.097225250574753605,"Center","Chisinau","North","South",0.061654931027880201,0.105460358459354,0,0.20941385621529771,8.7155825971312915,0,7.8279518936977697,6.1801937234752424,0,4.349439122572992,0,2.6673110816612611,0,0,0,7.9893124048223854,0,4.2047829634336837,3.5128826418139809,5.3546504234618997,5.8019795071908034,0,11.5670982836516]
["MDA",2012,"MDA_2012_MICS",162,"Type of toilet facility","Bucket","",2.991314455358776,1.5142435723126031,1.2817955390882021,0.24213443583294239,0.2180382494955822,1.004779428808529,0.1535487278243452,0,0,0,3.4426983867591701,1.699501830359718,2.225553143732943,1.2015704371015581,0.69245212949506585,"Center","Chisinau","North","South",0.37695768567686061,0.064431043527784199,3.4578273244711242,0.1728337554035965,172.29939336640919,87.165008207291734,73.799409084402129,13.948462110769141,12.546679738148271,21.527215187963261,3.290698274077585,0,0,0,124.6836868693732,61.326098567739749,80.465899443732127,43.446101947139027,25.019252216995461,32.738283825572204,3.5447214444961448,313.92937247052078,9.5465747664311476]
["MDA",2012,"MDA_2012_MICS",163,"Type of toilet facility","Hanging toilet, Hanging latrine","",0.1011629071734895,0,0,0,0,0.0692990635392048,0,0,0,0,0.071411960482174602,0.048661463482484499,0,0,0,"Center","Chisinau","North","South",0,0,0.047828467473506699,0.026879765236006801,5.826972656100784,0,0,0,0,1.484719740830883,0,0,0,0,2.5863161738862979,1.755936741383604,0,0,0,0,0,4.3422529152699028,1.484719740830883]
["MDA",2012,"MDA_2012_MICS",164,"Type of toilet facility","No facility, Bush, Field","",0.51599946027185328,0,0,0,0,0.056332010787933401,0,0,0,0,0.78732998005908894,0,0,0,0,"Center","Chisinau","North","South",0.0638939977167398,0,0.25295732638683438,0.0218500964936593,29.721513839163229,0,0,0,0,1.2069030111817689,0,0,0,0,28.51461082798145,0,0,0,0,5.5491104478878448,0,22.965500380093609,1.2069030111817689]
["MDA",2012,"MDA_2012_MICS",165,"Type of toilet facility","Other","",0.034535238496428297,0,0.081254951591750904,0.0172657072833068,0,0.092846817310180199,0.21829416324371809,0.046395082621469803,0,0,0,0,0,0,0,"Center","Chisinau","North","South",0.062987377248031995,0,0.0241411003552249,0,1.9892260514567539,0,4.6782557980491513,0.99461302572837706,0,1.9892260514567539,4.6782557980491513,0.99461302572837706,0,0,0,0,0,0,0,5.4703716415060741,0,2.1917232337282089,0]
["MDA",2012,"MDA_2012_MICS",222,"Hygiene ladder","Basic","h_bas",72.852498028053716,81.851618821472741,88.390083738150423,93.168101215035534,95.651510025840594,85.640528573677145,93.831175763466518,95.05829983803963,96.002782377049996,96.539867548516369,69.062973150833457,79.19144132955492,83.311402922459237,86.890784844587856,92.840205738519828,"Center","Chisinau","North","South",82.551795697515345,94.622440019290195,87.466239620317438,82.527947315591646,4070.9441793792648,4615.5487821848783,4928.7550036092771,5128.3506076743324,5221.9241346265644,1753.7800034134459,1879.032459405176,1899.1609498574519,1938.1447377836801,1965.456775274678,2432.947244426206,2782.2776515975502,2987.6359126032689,3069.6531970127248,3257.433776100142,6996.1102545446138,4740.8133023950231,7832.8250142359266,4395.7741362988072]
["MDA",2012,"MDA_2012_MICS",223,"Hygiene ladder","Limited","h_lim",16.007148715603869,10.59760121862546,5.1307183613672427,2.0641670691412779,0.84248025588061992,8.9695580320444126,1.17218073788472,1.2153065566933601,0.33645791402789488,0.61898432812542448,18.589024904572529,11.230051355278819,10.024182609075689,5.2870390558470728,2.601440720372183,"Center","Chisinau","North","South",11.032771533345789,2.5885940189973939,4.9407299319284608,8.0844657626278185,894.46773489019859,597.59044601663777,286.09604976292269,113.6201372070431,45.993711755735667,183.68209279001329,23.473708358160369,24.280496900430879,6.792554542822578,12.601912271026899,654.85331509513878,394.55173927266429,359.47789746431039,186.77902805849709,91.275334879473689,935.00674828823344,129.6948266950335,442.45497654164461,430.6115281076261]
["MDA",2012,"MDA_2012_MICS",224,"Hygiene ladder","No facility","h_nfac",11.14035325634257,7.5507799599019556,6.4791979004823101,4.7677317158231114,3.5060097182789698,5.3899133942783024,4.996643498648802,3.7263936052670208,3.6607597089220589,2.841148123358276,12.348001944594129,9.5785073151662505,6.6644144684650897,7.8221760995650218,4.558353541107909,"Center","Chisinau","North","South",6.4154327691392146,2.788965961712222,7.593030447754165,9.387586921780839,622.51477262554226,425.78257767247408,361.28915960731888,262.43531340878911,191.40436736618409,110.3767397101401,100.0611496727351,74.449271983398418,73.904963902732931,57.842982079990207,434.99484506202703,336.52710938479498,238.99302261169251,276.33963618320212,159.93647008959459,543.69592574310661,139.73394607575901,679.97525769026527,500.02106117117728]
["MDA",2012,"MDA_2012_MICS",225,"Place where household members most often wash their hands","Observed","",86.205227689795421,90.5634351470692,90.574882646786236,90.996528426218859,91.546736641358891,90.430742730252462,88.773681877569459,89.721552535007447,90.791553836258814,92.319747238548061,85.258675547790432,88.03800487260412,92.575609219864447,90.061766573009933,92.681457257231685,"Center","Chisinau","North","South",91.321082257982724,88.529360115188112,91.149448822113271,87.378183255698289]
["MDA",2012,"MDA_2012_MICS",226,"Place where household members most often wash their hands","Not in dwelling/plot/yard","",4.7000207548598656,2.6885032725224041,2.2469936914479058,1.059214850787308,0.8387662343856237,3.4866060026090828,1.3705729955656161,1.0407268839811681,0.98840349465639143,0.92776728122750862,5.295609566132458,3.1841467419169822,2.4521574787916252,2.4123134066277898,0.39095882221764822,"Center","Chisinau","North","South",1.966119653884951,1.2122832319131289,3.541653087271615,1.903562637289224]
["MDA",2012,"MDA_2012_MICS",227,"Place where household members most often wash their hands","No permission to see","",2.9302468145793048,2.0398061684143811,3.1500151694556382,4.4477989806127489,5.1270070041858551,4.2643122091464534,6.5573205549777249,6.8056595209089554,5.7584909721703443,4.9806111791415866,2.7304825454208572,2.6359748567050438,0.81424068573901476,2.2956251708769289,2.8920175877825178,"Center","Chisinau","North","South",2.4186519635170001,8.8711167987106467,1.360850524831545,3.5693010622389192]
["MDA",2012,"MDA_2012_MICS",228,"Place where household members most often wash their hands","Other reason","",6.1075474068525386,4.7082554119940738,4.0281084923101593,3.4964577423810721,2.487490120069745,1.6652111976813351,3.298424571887336,2.4320610601024581,2.461551696914547,1.77187430108281,6.7152323406562946,6.141873528773834,4.1579926156049458,5.230294849485297,4.0355663327681137,"Center","Chisinau","North","South",4.2941461246153532,1.327607166497577,3.948047565783662,7.1489530447738909]
["MDA",2012,"MDA_2012_MICS",229,"Place where household members most often wash their hands","Missing","",0.056957333912871902,0,0,0,0,0.15312786031086131,0,0,0,0,0,0,0,0,0,"Center","Chisinau","North","South",0,0.059632687690543702,0,0]