{"text_format":"1","workbook":"xlsx","n_sheets":7,"sheets":["Introduction","Water","Sanitation","Hygiene","SLC05","MICS12","data_summary"],"not_rendered":{"charts":105,"images":76,"macros":1,"external_links":0,"defined_names":0,"comments":0,"pivot_tables":0},"unopened":[],"bounds":{"document_bytes":16777216,"sheet_cells":100000,"rows_first":2000,"rows_last":500,"rows_between":2000,"halvings":0,"cell_chars":16384,"cell_head_chars":4096},"cells_cut":0,"cells_raw":0,"read":"whole","date_system":"1900"}

{"sheet":"Introduction","index":0,"n_rows":55,"n_cols":12,"rows_kept":55,"cut":false,"hidden":false,"merged":[[107,0,107,1],[1,0,1,1],[4,0,4,1],[5,0,5,1],[6,0,6,1],[7,0,7,1],[112,0,112,1],[113,0,113,1],[207,0,207,1],[212,0,212,1],[213,0,213,1]]}
[]
[]
[]
[null,null,"Joint Monitoring Programme for Water Supply, Sanitation and Hygiene"]
[]
[null,null,"Estimates on household water, sanitation and hygiene \nby wealth quintile and sub-national region in"]
[null,null,{"$f":"+Water!B5","v":"Saint Lucia"}]
[]
[null,null,"Updated May 2021"]
[]
[null,null,"Follow the links below to find the following information: "]
[]
[null,null,"JMP Estimates"]
[null,null,"WASH status and trends by wealth quintile \n(customized quintiles made without water and sanitation assets)"]
[null,null,"Water"]
[null,null,"Sanitation"]
[null,null,"Hygiene"]
[]
[null,null,"Data inputs"]
[null,null," customized wealth quintiles and subnational data:"]
[null,null,{"$f":"IF(INDIRECT(CONCATENATE(\"Water\",\"!B105\"))=0,\"\",INDIRECT(CONCATENATE(\"Water\",\"!B105\")))","v":"SLC05"}]
[null,null,{"$f":"IF(INDIRECT(CONCATENATE(\"Water\",\"!B106\"))=0,\"\",INDIRECT(CONCATENATE(\"Water\",\"!B106\")))","v":"MICS12"}]
[null,null,{"$f":"IF(INDIRECT(CONCATENATE(\"Water\",\"!B107\"))=0,\"\",INDIRECT(CONCATENATE(\"Water\",\"!B107\")))","v":""}]
[null,null,{"$f":"IF(INDIRECT(CONCATENATE(\"Water\",\"!B108\"))=0,\"\",INDIRECT(CONCATENATE(\"Water\",\"!B108\")))","v":""}]
[null,null,{"$f":"IF(INDIRECT(CONCATENATE(\"Water\",\"!B109\"))=0,\"\",INDIRECT(CONCATENATE(\"Water\",\"!B109\")))","v":""}]
[null,null,{"$f":"IF(INDIRECT(CONCATENATE(\"Water\",\"!B110\"))=0,\"\",INDIRECT(CONCATENATE(\"Water\",\"!B110\")))","v":""}]
[null,null,{"$f":"IF(INDIRECT(CONCATENATE(\"Water\",\"!B111\"))=0,\"\",INDIRECT(CONCATENATE(\"Water\",\"!B111\")))","v":""}]
[null,null,{"$f":"IF(INDIRECT(CONCATENATE(\"Water\",\"!B112\"))=0,\"\",INDIRECT(CONCATENATE(\"Water\",\"!B112\")))","v":""}]
[null,null,{"$f":"IF(INDIRECT(CONCATENATE(\"Water\",\"!B113\"))=0,\"\",INDIRECT(CONCATENATE(\"Water\",\"!B113\")))","v":""}]
[null,null,{"$f":"IF(INDIRECT(CONCATENATE(\"Water\",\"!B114\"))=0,\"\",INDIRECT(CONCATENATE(\"Water\",\"!B114\")))","v":""}]
[null,null,{"$f":"IF(INDIRECT(CONCATENATE(\"Water\",\"!B115\"))=0,\"\",INDIRECT(CONCATENATE(\"Water\",\"!B115\")))","v":""}]
[null,null,{"$f":"IF(INDIRECT(CONCATENATE(\"Water\",\"!B116\"))=0,\"\",INDIRECT(CONCATENATE(\"Water\",\"!B116\")))","v":""}]
[]
[]
[]
[]
[]
[]
[]
[]
[]
[]
[]
[]
[]
[]
[]
[]
[]
[]
[]
[]
[]
[]
[null,null,null,null,null,null,null,null,null,null,null,{"$f":"+IF(ISNUMBER(M48), \"\", \"Insufficient data to estimate safely managed sanitation services at national level\")","v":"Insufficient data to estimate safely managed sanitation services at national level"}]

{"sheet":"Water","index":1,"n_rows":318,"n_cols":28,"rows_kept":318,"cut":false,"hidden":false,"merged":[[3,1,3,24],[317,18,317,22],[117,18,117,22],[196,18,196,22],[296,23,296,27],[298,0,299,1],[300,0,301,1],[296,0,297,2],[296,3,296,7],[296,8,296,12],[296,13,296,17],[296,18,296,22],[196,23,196,27],[198,0,199,1],[200,0,201,1],[196,13,196,17],[96,8,96,12],[96,13,96,17],[96,18,96,22],[217,18,217,22],[98,0,99,1],[100,0,101,1],[196,0,197,2],[196,3,196,7],[196,8,196,12],[217,1,217,11],[35,3,36,3],[38,1,39,2],[38,3,39,3],[96,0,97,2],[96,3,96,7],[317,1,317,11],[6,9,6,16],[6,17,6,24],[6,1,6,8],[4,1,4,24],[117,1,117,11],[30,21,30,24],[32,1,33,2],[32,3,33,3],[30,17,30,20],[30,1,31,4],[30,5,30,8],[30,9,30,12],[30,13,30,16],[96,23,96,27],[35,1,36,2]]}
["BGD"]
[]
[]
[null,"Summary of trends in use of drinking water by wealth quintile (%)"]
[null,{"$f":"IF(ISERROR(INDIRECT(CONCATENATE($B105,\"!A2\"))),\"\",INDIRECT(CONCATENATE($B105,\"!A2\")))","v":"Saint Lucia"}]
[]
[null,{"$f":"B118","v":"National use of drinking water sources, 2000–2018"},null,null,null,null,null,null,null,{"$f":"B218","v":"Urban use of drinking water sources,  2000–2018"},null,null,null,null,null,null,null,{"$f":"B318","v":"Rural use of drinking water sources, 2000–2018"}]
[]
[]
[]
[]
[]
[]
[]
[]
[]
[]
[]
[]
[]
[]
[]
[]
[]
[]
[]
[]
[]
[]
[]
[null,{"$f":"IF(ISERROR(INDIRECT(CONCATENATE($B105,\"!A2\"))),\"\",INDIRECT(CONCATENATE($B105,\"!A2\")))","v":"Saint Lucia"},null,null,null,"Poorest",null,null,null,"Poor",null,null,null,"Middle",null,null,null,"Rich",null,null,null,"Richest"]
[null,null,null,null,null,"Basic","Limited","Unimproved","Surface \n water","Basic","Limited","Unimproved","Surface \nwater","Basic","Limited","Unimproved","Surface \nwater","Basic","Limited","Unimproved","Surface \nwater","Basic","Limited","Unimproved","Surface \nwater"]
[null,"NATIONAL",null,"Estimate",{"$f":"C99","v":2000},{"$f":"E99","v":84.11188600655089},{"$f":"F99","v":0.28754177812641674},15.6005722153227,0,{"$f":"J99","v":95.823877341338843},{"$f":"K99","v":0},4.1761226586611571,0,{"$f":"O99","v":95.200806542097567},{"$f":"P99","v":0},4.7991934579024331,0,{"$f":"T99","v":98.854596153589085},{"$f":"U99","v":0},1.1454038464109146,0,{"$f":"Y99","v":99.854325464002287},{"$f":"Z99","v":0.14567453599771341},0,0]
[null,null,null,null,{"$f":"C100","v":2018},{"$f":"E100","v":99.659308379601811},0.34069162039818934,0,0,{"$f":"J100","v":100},0,0,0,{"$f":"O100","v":100},0,0,0,{"$f":"T100","v":100},0,0,0,{"$f":"Y100","v":99.156158237113601},0.14465600038242366,0.6991857625039728,0]
[]
[null,"URBAN",null,"Estimate",{"$f":"C199","v":2000},{"$f":"E199","v":90.666579596855442},{"$f":"F199","v":0.30339420152649837},9.0300262016180568,0,{"$f":"J199","v":94.019933554817271},{"$f":"K199","v":0},5.9800664451827288,0,{"$f":"O199","v":99.999999999999986},{"$f":"P199","v":0},0,0,{"$f":"T199","v":100},{"$f":"U199","v":0},0,0,{"$f":"Y199","v":99.238230271170707},{"$f":"Z199","v":0.76176972882929306},0,0]
[null,null,null,null,{"$f":"C200","v":2018},{"$f":"E200","v":99.666489734075427},0.33351026592457345,0,0,{"$f":"J200","v":100},0,0,0,{"$f":"O200","v":100.00000000000001},0,0,0,{"$f":"T200","v":99.674505922729736},0,0.32549407727026392,0,{"$f":"Y200","v":99.238230271170707},0.76176972882929306,0,0]
[]
[null,"RURAL",null,"Estimate",{"$f":"C299","v":2000},{"$f":"E299","v":81.869298895454406},{"$f":"F299","v":0.28291550149927924},17.847785603046319,0,{"$f":"J299","v":93.455695152073531},{"$f":"K299","v":0},6.5443048479264689,0,{"$f":"O299","v":95.888033534940519},{"$f":"P299","v":0},4.1119664650594814,0,{"$f":"T299","v":96.660482374768094},{"$f":"U299","v":0},3.3395176252319061,0,{"$f":"Y299","v":100},{"$f":"Z299","v":0},0,0]
[null,null,null,null,{"$f":"C300","v":2018},{"$f":"E300","v":99.655620358409038},0.34437964159097589,0,0,{"$f":"J300","v":100},0,0,0,{"$f":"O300","v":100},0,0,0,{"$f":"T300","v":100},0,0,0,{"$f":"Y300","v":99.145696066445623},0,0.85430393355437673,0]
[]
[]
[]
[]
[]
[]
[]
[]
[]
[]
[]
[]
[]
[]
[]
[]
[]
[]
[]
[]
[]
[]
[]
[]
[]
[]
[]
[]
[]
[]
[]
[]
[]
[]
[]
[]
[]
[]
[]
[]
[]
[]
[]
[]
[]
[]
[]
[]
[]
[]
[]
[]
[]
[]
[]
[]
["NATIONAL",null,null,"Poorest",null,null,null,null,"Poor",null,null,null,null,"Middle",null,null,null,null,"Rich",null,null,null,null,"Richest"]
[null,null,null,"Improved","Basic","Limited","Unimproved","Surface water","Improved","Basic","Limited","Unimproved","Surface water","Improved","Basic","Limited","Unimproved","Surface water","Improved","Basic","Limited","Unimproved","Surface water","Improved","Basic","Limited","Unimproved","Surface water"]
["Forecast period:",null,{"$f":"MinBase(C105:C116)","v":2000},{"$f":"IF((D101+H101)>100,D101*100/(D101+H101),D101)","v":84.3994277846773},{"$f":"D99*AVERAGEIF(E105:E116,\">0\")/100","v":84.11188600655089},{"$f":"D99*(100-AVERAGEIF(E105:E116,\">0\"))/100","v":0.28754177812641674},{"$f":"100-(E99+F99+H99)","v":15.6005722153227},{"$f":"IF((D101+H101)>100,H101*100/(D101+H101),H101)","v":0},{"$f":"IF((I101+M101)>100,I101*100/(I101+M101),I101)","v":95.823877341338857},{"$f":"I99*AVERAGEIF(J105:J116,\">0\")/100","v":95.823877341338843},{"$f":"I99*(100-AVERAGEIF(J105:J116,\">0\"))/100","v":0},{"$f":"100-(J99+K99+M99)","v":4.1761226586611571},{"$f":"IF((I101+M101)>100,M101*100/(I101+M101),M101)","v":0},{"$f":"IF((N101+R101)>100,N101*100/(N101+R101),N101)","v":95.200806542097553},{"$f":"N99*AVERAGEIF(O105:O116,\">0\")/100","v":95.200806542097567},{"$f":"N99*(100-AVERAGEIF(O105:O116,\">0\"))/100","v":0},{"$f":"100-(O99+P99+R99)","v":4.7991934579024331},{"$f":"IF((N101+R101)>100,R101*100/(N101+R101),R101)","v":0},{"$f":"IF((S101+W101)>100,S101*100/(S101+W101),S101)","v":98.854596153589085},{"$f":"S99*AVERAGEIF(T105:T116,\">0\")/100","v":98.854596153589085},{"$f":"S99*(100-AVERAGEIF(T105:T116,\">0\"))/100","v":0},{"$f":"100-(T99+U99+W99)","v":1.1454038464109146},{"$f":"IF((S101+W101)>100,W101*100/(S101+W101),W101)","v":0},{"$f":"IF((X101+AB101)>100,X101*100/(X101+AB101),X101)","v":100},{"$f":"X99*AVERAGEIF(Y105:Y116,\">0\")/100","v":99.854325464002287},{"$f":"X99*(100-AVERAGEIF(Y105:Y116,\">0\"))/100","v":0.14567453599771341},{"$f":"100-(Y99+Z99+AB99)","v":0},{"$f":"IF((X101+AB101)>100,AB101*100/(X101+AB101),AB101)","v":0}]
[null,null,{"$f":"MaxTarget(C105:C116)","v":2018},{"$f":"IF((D102+H102)>100,D102*100/(D102+H102),D102)","v":100},{"$f":"D100*AVERAGEIF(E105:E116,\">0\")/100","v":99.659308379601811},{"$f":"D100*(100-AVERAGEIF(E105:E116,\">0\"))/100","v":0.34069162039818934},{"$f":"100-(E100+F100+H100)","v":0},{"$f":"IF((D102+H102)>100,H102*100/(D102+H102),H102)","v":0},{"$f":"IF((I102+M102)>100,I102*100/(I102+M102),I102)","v":100},{"$f":"I100*AVERAGEIF(J105:J116,\">0\")/100","v":100},{"$f":"I100*(100-AVERAGEIF(J105:J116,\">0\"))/100","v":0},{"$f":"100-(J100+K100+M100)","v":0},{"$f":"IF((I102+M102)>100,M102*100/(I102+M102),M102)","v":0},{"$f":"IF((N102+R102)>100,N102*100/(N102+R102),N102)","v":100},{"$f":"N100*AVERAGEIF(O105:O116,\">0\")/100","v":100},{"$f":"N100*(100-AVERAGEIF(O105:O116,\">0\"))/100","v":0},{"$f":"100-(O100+P100+R100)","v":0},{"$f":"IF((N102+R102)>100,R102*100/(N102+R102),R102)","v":0},{"$f":"IF((S102+W102)>100,S102*100/(S102+W102),S102)","v":100},{"$f":"S100*AVERAGEIF(T105:T116,\">0\")/100","v":100},{"$f":"S100*(100-AVERAGEIF(T105:T116,\">0\"))/100","v":0},{"$f":"100-(T100+U100+W100)","v":0},{"$f":"IF((S102+W102)>100,W102*100/(S102+W102),W102)","v":0},{"$f":"IF((X102+AB102)>100,X102*100/(X102+AB102),X102)","v":99.300814237496013},{"$f":"X100*AVERAGEIF(Y105:Y116,\">0\")/100","v":99.156158237113601},{"$f":"X100*(100-AVERAGEIF(Y105:Y116,\">0\"))/100","v":0.14465600038242366},{"$f":"100-(Y100+Z100+AB100)","v":0.6991857625039728},{"$f":"IF((X102+AB102)>100,AB102*100/(X102+AB102),AB102)","v":0}]
["Regression period:",null,{"$f":"MinRegYear(C99,C105:C116)","v":2003},{"$f":"IF(MAX(C105:C116)-MIN(C105:C116)<5,AVERAGEIF(C105:C116,\">0\",D105:D116),\nIF(FORECAST($C101,D$105:D$116,$C$105:$C$116)<0,0,\nIF(FORECAST($C101,D$105:D$116,$C$105:$C$116)>100,100,\nFORECAST($C101,D$105:D$116,$C$105:$C$116))))","v":84.3994277846773},null,null,null,{"$f":"IF(MAX(C105:C116)-MIN(C105:C116)<5,AVERAGEIF(C105:C116,\">0\",H105:H116),\nIF(FORECAST($C101,H$105:H$116,$C$105:$C$116)<0,0,\nIF(FORECAST($C101,H$105:H$116,$C$105:$C$116)>100,100,\nFORECAST($C101,H$105:H$116,$C$105:$C$116))))","v":0},{"$f":"IF(MAX(C105:C116)-MIN(C105:C116)<5,AVERAGEIF(C105:C116,\">0\",I105:I116),\nIF(FORECAST($C101,I$105:I$116,$C$105:$C$116)<0,0,\nIF(FORECAST($C101,I$105:I$116,$C$105:$C$116)>100,100,\nFORECAST($C101,I$105:I$116,$C$105:$C$116))))","v":95.823877341338857},null,null,null,{"$f":"IF(MAX(C105:C116)-MIN(C105:C116)<5,AVERAGEIF(C105:C116,\">0\",M105:M116),\nIF(FORECAST($C101,M$105:M$116,$C$105:$C$116)<0,0,\nIF(FORECAST($C101,M$105:M$116,$C$105:$C$116)>100,100,\nFORECAST($C101,M$105:M$116,$C$105:$C$116))))","v":0},{"$f":"IF(MAX(C105:C116)-MIN(C105:C116)<5,AVERAGEIF(C105:C116,\">0\",N105:N116),\nIF(FORECAST($C101,N$105:N$116,$C$105:$C$116)<0,0,\nIF(FORECAST($C101,N$105:N$116,$C$105:$C$116)>100,100,\nFORECAST($C101,N$105:N$116,$C$105:$C$116))))","v":95.200806542097553},null,null,null,{"$f":"IF(MAX(C105:C116)-MIN(C105:C116)<5,AVERAGEIF(C105:C116,\">0\",R105:R116),\nIF(FORECAST($C101,R$105:R$116,$C$105:$C$116)<0,0,\nIF(FORECAST($C101,R$105:R$116,$C$105:$C$116)>100,100,\nFORECAST($C101,R$105:R$116,$C$105:$C$116))))","v":0},{"$f":"IF(MAX(C105:C116)-MIN(C105:C116)<5,AVERAGEIF(C105:C116,\">0\",S105:S116),\nIF(FORECAST($C101,S$105:S$116,$C$105:$C$116)<0,0,\nIF(FORECAST($C101,S$105:S$116,$C$105:$C$116)>100,100,\nFORECAST($C101,S$105:S$116,$C$105:$C$116))))","v":98.854596153589085},null,null,null,{"$f":"IF(MAX(C105:C116)-MIN(C105:C116)<5,AVERAGEIF(C105:C116,\">0\",W105:W116),\nIF(FORECAST($C101,W$105:W$116,$C$105:$C$116)<0,0,\nIF(FORECAST($C101,W$105:W$116,$C$105:$C$116)>100,100,\nFORECAST($C101,W$105:W$116,$C$105:$C$116))))","v":0},{"$f":"IF(MAX(C105:C116)-MIN(C105:C116)<5,AVERAGEIF(C105:C116,\">0\",X105:X116),\nIF(FORECAST($C101,X$105:X$116,$C$105:$C$116)<0,0,\nIF(FORECAST($C101,X$105:X$116,$C$105:$C$116)>100,100,\nFORECAST($C101,X$105:X$116,$C$105:$C$116))))","v":100},null,null,null,{"$f":"IF(MAX(C105:C116)-MIN(C105:C116)<5,AVERAGEIF(C105:C116,\">0\",AB105:AB116),\nIF(FORECAST($C101,AB$105:AB$116,$C$105:$C$116)<0,0,\nIF(FORECAST($C101,AB$105:AB$116,$C$105:$C$116)>100,100,\nFORECAST($C101,AB$105:AB$116,$C$105:$C$116))))","v":0}]
[null,null,{"$f":"MaxRegYear(C100,C105:C116)","v":2014},{"$f":"IF(MAX(C105:C116)-MIN(C105:C116)<5,AVERAGEIF(C105:C116,\">0\",D105:D116),\nIF(FORECAST($C102,D$105:D$116,$C$105:$C$116)<0,0,\nIF(FORECAST($C102,D$105:D$116,$C$105:$C$116)>100,100,\nFORECAST($C102,D$105:D$116,$C$105:$C$116))))","v":100},null,null,null,{"$f":"IF(MAX(C105:C116)-MIN(C105:C116)<5,AVERAGEIF(C105:C116,\">0\",H105:H116),\nIF(FORECAST($C102,H$105:H$116,$C$105:$C$116)<0,0,\nIF(FORECAST($C102,H$105:H$116,$C$105:$C$116)>100,100,\nFORECAST($C102,H$105:H$116,$C$105:$C$116))))","v":0},{"$f":"IF(MAX(C105:C116)-MIN(C105:C116)<5,AVERAGEIF(C105:C116,\">0\",I105:I116),\nIF(FORECAST($C102,I$105:I$116,$C$105:$C$116)<0,0,\nIF(FORECAST($C102,I$105:I$116,$C$105:$C$116)>100,100,\nFORECAST($C102,I$105:I$116,$C$105:$C$116))))","v":100},null,null,null,{"$f":"IF(MAX(C105:C116)-MIN(C105:C116)<5,AVERAGEIF(C105:C116,\">0\",M105:M116),\nIF(FORECAST($C102,M$105:M$116,$C$105:$C$116)<0,0,\nIF(FORECAST($C102,M$105:M$116,$C$105:$C$116)>100,100,\nFORECAST($C102,M$105:M$116,$C$105:$C$116))))","v":0},{"$f":"IF(MAX(C105:C116)-MIN(C105:C116)<5,AVERAGEIF(C105:C116,\">0\",N105:N116),\nIF(FORECAST($C102,N$105:N$116,$C$105:$C$116)<0,0,\nIF(FORECAST($C102,N$105:N$116,$C$105:$C$116)>100,100,\nFORECAST($C102,N$105:N$116,$C$105:$C$116))))","v":100},null,null,null,{"$f":"IF(MAX(C105:C116)-MIN(C105:C116)<5,AVERAGEIF(C105:C116,\">0\",R105:R116),\nIF(FORECAST($C102,R$105:R$116,$C$105:$C$116)<0,0,\nIF(FORECAST($C102,R$105:R$116,$C$105:$C$116)>100,100,\nFORECAST($C102,R$105:R$116,$C$105:$C$116))))","v":0},{"$f":"IF(MAX(C105:C116)-MIN(C105:C116)<5,AVERAGEIF(C105:C116,\">0\",S105:S116),\nIF(FORECAST($C102,S$105:S$116,$C$105:$C$116)<0,0,\nIF(FORECAST($C102,S$105:S$116,$C$105:$C$116)>100,100,\nFORECAST($C102,S$105:S$116,$C$105:$C$116))))","v":100},null,null,null,{"$f":"IF(MAX(C105:C116)-MIN(C105:C116)<5,AVERAGEIF(C105:C116,\">0\",W105:W116),\nIF(FORECAST($C102,W$105:W$116,$C$105:$C$116)<0,0,\nIF(FORECAST($C102,W$105:W$116,$C$105:$C$116)>100,100,\nFORECAST($C102,W$105:W$116,$C$105:$C$116))))","v":0},{"$f":"IF(MAX(C105:C116)-MIN(C105:C116)<5,AVERAGEIF(C105:C116,\">0\",X105:X116),\nIF(FORECAST($C102,X$105:X$116,$C$105:$C$116)<0,0,\nIF(FORECAST($C102,X$105:X$116,$C$105:$C$116)>100,100,\nFORECAST($C102,X$105:X$116,$C$105:$C$116))))","v":99.300814237496013},null,null,null,{"$f":"IF(MAX(C105:C116)-MIN(C105:C116)<5,AVERAGEIF(C105:C116,\">0\",AB105:AB116),\nIF(FORECAST($C102,AB$105:AB$116,$C$105:$C$116)<0,0,\nIF(FORECAST($C102,AB$105:AB$116,$C$105:$C$116)>100,100,\nFORECAST($C102,AB$105:AB$116,$C$105:$C$116))))","v":0}]
[]
[null,"Survey","Year","Improved","% Improved\n< = 30min",null,null,"Surface water","Improved","% Improved\n< = 30min",null,null,"Surface water","Improved","% Improved\n< = 30min",null,null,"Surface water","Improved","% Improved\n< = 30min",null,null,"Surface water","Improved","% Improved\n< = 30min",null,null,"Surface water"]
[null,"SLC05",2005,{"$f":"IF(ISERROR(INDIRECT(CONCATENATE($B105,\"!C16\"))),\"\",INDIRECT(CONCATENATE($B105,\"!C16\")))","v":87.343199124750683},{"$f":"IF(ISERROR(INDIRECT(CONCATENATE($B105,\"!C23\"))),\"\",INDIRECT(CONCATENATE($B105,\"!C23\")))","v":"N/A"},null,null,{"$f":"IF(ISERROR(INDIRECT(CONCATENATE($B105,\"!C21\"))),\"\",INDIRECT(CONCATENATE($B105,\"!C21\")))","v":0},{"$f":"IF(ISERROR(INDIRECT(CONCATENATE($B105,\"!D16\"))),\"\",INDIRECT(CONCATENATE($B105,\"!D16\")))","v":96.666666666666671},{"$f":"IF(ISERROR(INDIRECT(CONCATENATE($B105,\"!D23\"))),\"\",INDIRECT(CONCATENATE($B105,\"!D23\")))","v":"N/A"},null,null,{"$f":"IF(ISERROR(INDIRECT(CONCATENATE($B105,\"!D21\"))),\"\",INDIRECT(CONCATENATE($B105,\"!D21\")))","v":0},{"$f":"IF(ISERROR(INDIRECT(CONCATENATE($B105,\"!E16\"))),\"\",INDIRECT(CONCATENATE($B105,\"!E16\")))","v":96.202519091540239},{"$f":"IF(ISERROR(INDIRECT(CONCATENATE($B105,\"!E23\"))),\"\",INDIRECT(CONCATENATE($B105,\"!E23\")))","v":"N/A"},null,null,{"$f":"IF(ISERROR(INDIRECT(CONCATENATE($B105,\"!E21\"))),\"\",INDIRECT(CONCATENATE($B105,\"!E21\")))","v":0},{"$f":"IF(ISERROR(INDIRECT(CONCATENATE($B105,\"!F16\"))),\"\",INDIRECT(CONCATENATE($B105,\"!F16\")))","v":99.098470377030424},{"$f":"IF(ISERROR(INDIRECT(CONCATENATE($B105,\"!F23\"))),\"\",INDIRECT(CONCATENATE($B105,\"!F23\")))","v":"N/A"},null,null,{"$f":"IF(ISERROR(INDIRECT(CONCATENATE($B105,\"!F21\"))),\"\",INDIRECT(CONCATENATE($B105,\"!F21\")))","v":0},{"$f":"IF(ISERROR(INDIRECT(CONCATENATE($B105,\"!G16\"))),\"\",INDIRECT(CONCATENATE($B105,\"!G16\")))","v":100},{"$f":"IF(ISERROR(INDIRECT(CONCATENATE($B105,\"!G23\"))),\"\",INDIRECT(CONCATENATE($B105,\"!G23\")))","v":"N/A"},null,null,{"$f":"IF(ISERROR(INDIRECT(CONCATENATE($B105,\"!G221\"))),\"\",INDIRECT(CONCATENATE($B105,\"!G21\")))","v":0}]
[null,"MICS12",2012,97.646398815005796,99.659308379601811,null,null,0,99.616429305313815,100,null,null,0,99.708513014589613,100,null,null,0,99.952030159075051,100,null,null,0,99.456188851385804,99.854325464002287,null,null,0]
[null,null,null,"","",null,null,"","","",null,null,"","","",null,null,"","","",null,null,"","","",null,null,""]
[null,null,null,"","",null,null,"","","",null,null,"","","",null,null,"","","",null,null,"","","",null,null,""]
[null,null,null,"","",null,null,"","","",null,null,"","","",null,null,"","","",null,null,"","","",null,null,""]
[null,null,null,"","",null,null,"","","",null,null,"","","",null,null,"","","",null,null,"","","",null,null,""]
[null,null,null,{"$f":"IF(ISERROR(INDIRECT(CONCATENATE($B111,\"!C16\"))),\"\",INDIRECT(CONCATENATE($B111,\"!C16\")))","v":""},{"$f":"IF(ISERROR(INDIRECT(CONCATENATE($B111,\"!C23\"))),\"\",INDIRECT(CONCATENATE($B111,\"!C23\")))","v":""},null,null,{"$f":"IF(ISERROR(INDIRECT(CONCATENATE($B111,\"!C21\"))),\"\",INDIRECT(CONCATENATE($B111,\"!C21\")))","v":""},{"$f":"IF(ISERROR(INDIRECT(CONCATENATE($B111,\"!D16\"))),\"\",INDIRECT(CONCATENATE($B111,\"!D16\")))","v":""},{"$f":"IF(ISERROR(INDIRECT(CONCATENATE($B111,\"!D23\"))),\"\",INDIRECT(CONCATENATE($B111,\"!D23\")))","v":""},null,null,{"$f":"IF(ISERROR(INDIRECT(CONCATENATE($B111,\"!D21\"))),\"\",INDIRECT(CONCATENATE($B111,\"!D21\")))","v":""},{"$f":"IF(ISERROR(INDIRECT(CONCATENATE($B111,\"!E16\"))),\"\",INDIRECT(CONCATENATE($B111,\"!E16\")))","v":""},{"$f":"IF(ISERROR(INDIRECT(CONCATENATE($B111,\"!E23\"))),\"\",INDIRECT(CONCATENATE($B111,\"!E23\")))","v":""},null,null,{"$f":"IF(ISERROR(INDIRECT(CONCATENATE($B111,\"!E21\"))),\"\",INDIRECT(CONCATENATE($B111,\"!E21\")))","v":""},{"$f":"IF(ISERROR(INDIRECT(CONCATENATE($B111,\"!F16\"))),\"\",INDIRECT(CONCATENATE($B111,\"!F16\")))","v":""},{"$f":"IF(ISERROR(INDIRECT(CONCATENATE($B111,\"!F23\"))),\"\",INDIRECT(CONCATENATE($B111,\"!F23\")))","v":""},null,null,{"$f":"IF(ISERROR(INDIRECT(CONCATENATE($B111,\"!F21\"))),\"\",INDIRECT(CONCATENATE($B111,\"!F21\")))","v":""},{"$f":"IF(ISERROR(INDIRECT(CONCATENATE($B111,\"!G16\"))),\"\",INDIRECT(CONCATENATE($B111,\"!G16\")))","v":""},{"$f":"IF(ISERROR(INDIRECT(CONCATENATE($B111,\"!G23\"))),\"\",INDIRECT(CONCATENATE($B111,\"!G23\")))","v":""},null,null,{"$f":"IF(ISERROR(INDIRECT(CONCATENATE($B111,\"!G221\"))),\"\",INDIRECT(CONCATENATE($B111,\"!G21\")))","v":""}]
[null,null,null,{"$f":"IF(ISERROR(INDIRECT(CONCATENATE($B112,\"!C16\"))),\"\",INDIRECT(CONCATENATE($B112,\"!C16\")))","v":""},{"$f":"IF(ISERROR(INDIRECT(CONCATENATE($B112,\"!C23\"))),\"\",INDIRECT(CONCATENATE($B112,\"!C23\")))","v":""},null,null,{"$f":"IF(ISERROR(INDIRECT(CONCATENATE($B112,\"!C21\"))),\"\",INDIRECT(CONCATENATE($B112,\"!C21\")))","v":""},{"$f":"IF(ISERROR(INDIRECT(CONCATENATE($B112,\"!D16\"))),\"\",INDIRECT(CONCATENATE($B112,\"!D16\")))","v":""},{"$f":"IF(ISERROR(INDIRECT(CONCATENATE($B112,\"!D23\"))),\"\",INDIRECT(CONCATENATE($B112,\"!D23\")))","v":""},null,null,{"$f":"IF(ISERROR(INDIRECT(CONCATENATE($B112,\"!D21\"))),\"\",INDIRECT(CONCATENATE($B112,\"!D21\")))","v":""},{"$f":"IF(ISERROR(INDIRECT(CONCATENATE($B112,\"!E16\"))),\"\",INDIRECT(CONCATENATE($B112,\"!E16\")))","v":""},{"$f":"IF(ISERROR(INDIRECT(CONCATENATE($B112,\"!E23\"))),\"\",INDIRECT(CONCATENATE($B112,\"!E23\")))","v":""},null,null,{"$f":"IF(ISERROR(INDIRECT(CONCATENATE($B112,\"!E21\"))),\"\",INDIRECT(CONCATENATE($B112,\"!E21\")))","v":""},{"$f":"IF(ISERROR(INDIRECT(CONCATENATE($B112,\"!F16\"))),\"\",INDIRECT(CONCATENATE($B112,\"!F16\")))","v":""},{"$f":"IF(ISERROR(INDIRECT(CONCATENATE($B112,\"!F23\"))),\"\",INDIRECT(CONCATENATE($B112,\"!F23\")))","v":""},null,null,{"$f":"IF(ISERROR(INDIRECT(CONCATENATE($B112,\"!F21\"))),\"\",INDIRECT(CONCATENATE($B112,\"!F21\")))","v":""},{"$f":"IF(ISERROR(INDIRECT(CONCATENATE($B112,\"!G16\"))),\"\",INDIRECT(CONCATENATE($B112,\"!G16\")))","v":""},{"$f":"IF(ISERROR(INDIRECT(CONCATENATE($B112,\"!G23\"))),\"\",INDIRECT(CONCATENATE($B112,\"!G23\")))","v":""},null,null,{"$f":"IF(ISERROR(INDIRECT(CONCATENATE($B112,\"!G221\"))),\"\",INDIRECT(CONCATENATE($B112,\"!G21\")))","v":""}]
[null,null,null,"","",null,null,"","","",null,null,"","","",null,null,"","","",null,null,"","","",null,null,""]
[null,null,null,"","",null,null,"","","",null,null,"","","",null,null,"","","",null,null,"","","",null,null,""]
[null,null,null,"","",null,null,"","","",null,null,"","","",null,null,"","","",null,null,"","","",null,null,""]
[null,null,null,"","",null,null,"","","",null,null,"","","",null,null,"","","",null,null,"","","",null,null,""]
[]
[null,{"$f":"CONCATENATE(\"National use of drinking water sources, \",C99,\"–\",C100)","v":"National use of drinking water sources, 2000–2018"},null,null,null,null,null,null,null,null,null,null,null,null,null,null,null,null,"Data points used for regression"]
[]
[]
[]
[]
[]
[]
[]
[]
[]
[]
[]
[]
[]
[]
[]
[]
[]
[]
[]
[]
[]
[]
[]
[]
[]
[]
[]
[]
[]
[]
[]
[]
[]
[]
[null,null,null,null,{"$f":"IF(ISERROR(INDIRECT(CONCATENATE($B153,\"!M18\"))),\"\",INDIRECT(CONCATENATE($B153,\"!M18\")))","v":""},{"$f":"IF(ISERROR(INDIRECT(CONCATENATE($B153,\"!M19\"))),\"\",INDIRECT(CONCATENATE($B153,\"!M19\")))","v":""},{"$f":"IF(ISERROR(INDIRECT(CONCATENATE($B153,\"!M20\"))),\"\",INDIRECT(CONCATENATE($B153,\"!M20\")))","v":""},{"$f":"IF(ISERROR(INDIRECT(CONCATENATE($B153,\"!M21\"))),\"\",INDIRECT(CONCATENATE($B153,\"!M21\")))","v":""},null,{"$f":"IF(ISERROR(INDIRECT(CONCATENATE($B153,\"!N18\"))),\"\",INDIRECT(CONCATENATE($B153,\"!N18\")))","v":""},{"$f":"IF(ISERROR(INDIRECT(CONCATENATE($B153,\"!N19\"))),\"\",INDIRECT(CONCATENATE($B153,\"!N19\")))","v":""},{"$f":"IF(ISERROR(INDIRECT(CONCATENATE($B153,\"!N20\"))),\"\",INDIRECT(CONCATENATE($B153,\"!N20\")))","v":""},{"$f":"IF(ISERROR(INDIRECT(CONCATENATE($B153,\"!N21\"))),\"\",INDIRECT(CONCATENATE($B153,\"!N21\")))","v":""},null,{"$f":"IF(ISERROR(INDIRECT(CONCATENATE($B153,\"!O18\"))),\"\",INDIRECT(CONCATENATE($B153,\"!O18\")))","v":""},{"$f":"IF(ISERROR(INDIRECT(CONCATENATE($B153,\"!O19\"))),\"\",INDIRECT(CONCATENATE($B153,\"!O19\")))","v":""},{"$f":"IF(ISERROR(INDIRECT(CONCATENATE($B153,\"!O20\"))),\"\",INDIRECT(CONCATENATE($B153,\"!O20\")))","v":""},{"$f":"IF(ISERROR(INDIRECT(CONCATENATE($B153,\"!O21\"))),\"\",INDIRECT(CONCATENATE($B153,\"!O21\")))","v":""},null,{"$f":"IF(ISERROR(INDIRECT(CONCATENATE($B153,\"!P18\"))),\"\",INDIRECT(CONCATENATE($B153,\"!P18\")))","v":""},{"$f":"IF(ISERROR(INDIRECT(CONCATENATE($B153,\"!P19\"))),\"\",INDIRECT(CONCATENATE($B153,\"!P19\")))","v":""},{"$f":"IF(ISERROR(INDIRECT(CONCATENATE($B153,\"!P20\"))),\"\",INDIRECT(CONCATENATE($B153,\"!P20\")))","v":""},{"$f":"IF(ISERROR(INDIRECT(CONCATENATE($B153,\"!P21\"))),\"\",INDIRECT(CONCATENATE($B153,\"!P21\")))","v":""},null,{"$f":"IF(ISERROR(INDIRECT(CONCATENATE($B153,\"!Q18\"))),\"\",INDIRECT(CONCATENATE($B153,\"!Q18\")))","v":""},{"$f":"IF(ISERROR(INDIRECT(CONCATENATE($B153,\"!Q19\"))),\"\",INDIRECT(CONCATENATE($B153,\"!Q19\")))","v":""},{"$f":"IF(ISERROR(INDIRECT(CONCATENATE($B153,\"!Q20\"))),\"\",INDIRECT(CONCATENATE($B153,\"!Q20\")))","v":""},{"$f":"IF(ISERROR(INDIRECT(CONCATENATE($B153,\"!Q21\"))),\"\",INDIRECT(CONCATENATE($B153,\"!Q1\")))","v":""}]
[null,null,null,null,"","","","",null,"","","","",null,"","","","",null,"","","","",null,"","","",""]
[null,null,null,null,"","","","",null,"","","","",null,"","","","",null,"","","","",null,"","","",""]
[null,null,null,null,"","","","",null,"","","","",null,"","","","",null,"","","","",null,"","","",""]
[null,null,null,null,"","","","",null,"","","","",null,"","","","",null,"","","","",null,"","","",""]
[null,null,null,null,"","","","",null,"","","","",null,"","","","",null,"","","","",null,"","","",""]
[]
[]
[]
[]
[]
[]
[]
[]
[]
[]
[]
[]
[]
[]
[]
[]
[]
[]
[]
[]
[]
[]
[]
[]
[]
[]
[]
[]
[]
[]
[]
[]
[]
[]
[]
[]
[]
[]
["URBAN",null,null,"Poorest",null,null,null,null,"Poor",null,null,null,null,"Middle",null,null,null,null,"Rich",null,null,null,null,"Richest"]
[null,null,null,"Improved","Basic","Limited","Unimproved","Surface water","Improved","Basic","Limited","Unimproved","Surface water","Improved","Basic","Limited","Unimproved","Surface water","Improved","Basic","Limited","Unimproved","Surface water","Improved","Basic","Limited","Unimproved","Surface water"]
["Forecast period:",null,{"$f":"MinBase(C205:C216)","v":2000},{"$f":"IF((D201+H201)>100,D201*100/(D201+H201),D201)","v":90.969973798381943},{"$f":"D199*AVERAGEIF(E205:E216,\">0\")/100","v":90.666579596855442},{"$f":"D199*(100-AVERAGEIF(E205:E216,\">0\"))/100","v":0.30339420152649837},{"$f":"100-(E199+F199+H199)","v":9.0300262016180568},{"$f":"IF((D201+H201)>100,H201*100/(D201+H201),H201)","v":0},{"$f":"IF((I201+M201)>100,I201*100/(I201+M201),I201)","v":94.019933554817271},{"$f":"I199*AVERAGEIF(J205:J216,\">0\")/100","v":94.019933554817271},{"$f":"I199*(100-AVERAGEIF(J205:J216,\">0\"))/100","v":0},{"$f":"100-(J199+K199+M199)","v":5.9800664451827288},{"$f":"IF((I201+M201)>100,M201*100/(I201+M201),M201)","v":0},{"$f":"IF((N201+R201)>100,N201*100/(N201+R201),N201)","v":99.999999999999986},{"$f":"N199*AVERAGEIF(O205:O216,\">0\")/100","v":99.999999999999986},{"$f":"N199*(100-AVERAGEIF(O205:O216,\">0\"))/100","v":0},{"$f":"100-(O199+P199+R199)","v":0},{"$f":"IF((N201+R201)>100,R201*100/(N201+R201),R201)","v":0},{"$f":"IF((S201+W201)>100,S201*100/(S201+W201),S201)","v":100},{"$f":"S199*AVERAGEIF(T205:T216,\">0\")/100","v":100},{"$f":"S199*(100-AVERAGEIF(T205:T216,\">0\"))/100","v":0},{"$f":"100-(T199+U199+W199)","v":0},{"$f":"IF((S201+W201)>100,W201*100/(S201+W201),W201)","v":0},{"$f":"IF((X201+AB201)>100,X201*100/(X201+AB201),X201)","v":100},{"$f":"X199*AVERAGEIF(Y205:Y216,\">0\")/100","v":99.238230271170707},{"$f":"X199*(100-AVERAGEIF(Y205:Y216,\">0\"))/100","v":0.76176972882929306},{"$f":"100-(Y199+Z199+AB199)","v":0},{"$f":"IF((X201+AB201)>100,AB201*100/(X201+AB201),AB201)","v":0}]
[null,null,{"$f":"MaxTarget(C205:C216)","v":2018},{"$f":"IF((D202+H202)>100,D202*100/(D202+H202),D202)","v":100},{"$f":"D200*AVERAGEIF(E205:E216,\">0\")/100","v":99.666489734075427},{"$f":"D200*(100-AVERAGEIF(E205:E216,\">0\"))/100","v":0.33351026592457345},{"$f":"100-(E200+F200+H200)","v":0},{"$f":"IF((D202+H202)>100,H202*100/(D202+H202),H202)","v":0},{"$f":"IF((I202+M202)>100,I202*100/(I202+M202),I202)","v":100},{"$f":"I200*AVERAGEIF(J205:J216,\">0\")/100","v":100},{"$f":"I200*(100-AVERAGEIF(J205:J216,\">0\"))/100","v":0},{"$f":"100-(J200+K200+M200)","v":0},{"$f":"IF((I202+M202)>100,M202*100/(I202+M202),M202)","v":0},{"$f":"IF((N202+R202)>100,N202*100/(N202+R202),N202)","v":100.00000000000001},{"$f":"N200*AVERAGEIF(O205:O216,\">0\")/100","v":100.00000000000001},{"$f":"N200*(100-AVERAGEIF(O205:O216,\">0\"))/100","v":0},{"$f":"100-(O200+P200+R200)","v":0},{"$f":"IF((N202+R202)>100,R202*100/(N202+R202),R202)","v":0},{"$f":"IF((S202+W202)>100,S202*100/(S202+W202),S202)","v":99.674505922729736},{"$f":"S200*AVERAGEIF(T205:T216,\">0\")/100","v":99.674505922729736},{"$f":"S200*(100-AVERAGEIF(T205:T216,\">0\"))/100","v":0},{"$f":"100-(T200+U200+W200)","v":0.32549407727026392},{"$f":"IF((S202+W202)>100,W202*100/(S202+W202),W202)","v":0},{"$f":"IF((X202+AB202)>100,X202*100/(X202+AB202),X202)","v":100},{"$f":"X200*AVERAGEIF(Y205:Y216,\">0\")/100","v":99.238230271170707},{"$f":"X200*(100-AVERAGEIF(Y205:Y216,\">0\"))/100","v":0.76176972882929306},{"$f":"100-(Y200+Z200+AB200)","v":0},{"$f":"IF((X202+AB202)>100,AB202*100/(X202+AB202),AB202)","v":0}]
["Regression period:",null,{"$f":"MinRegYear(C199,C205:C216)","v":2003},{"$f":"IF(MAX(C205:C216)-MIN(C205:C216)<5,AVERAGEIF(C205:C216,\">0\",D205:D216),\nIF(FORECAST($C201,D$205:D$216,$C$205:$C$216)<0,0,\nIF(FORECAST($C201,D$205:D$216,$C$205:$C$216)>100,100,\nFORECAST($C201,D$205:D$216,$C$205:$C$216))))","v":90.969973798381943},null,null,null,{"$f":"IF(MAX(C205:C216)-MIN(C205:C216)<5,AVERAGEIF(C205:C216,\">0\",H205:H216),\nIF(FORECAST($C201,H$205:H$216,$C$205:$C$216)<0,0,\nIF(FORECAST($C201,H$205:H$216,$C$205:$C$216)>100,100,\nFORECAST($C201,H$205:H$216,$C$205:$C$216))))","v":0},{"$f":"IF(MAX(C205:C216)-MIN(C205:C216)<5,AVERAGEIF(C205:C216,\">0\",I205:I216),\nIF(FORECAST($C201,I$205:I$216,$C$205:$C$216)<0,0,\nIF(FORECAST($C201,I$205:I$216,$C$205:$C$216)>100,100,\nFORECAST($C201,I$205:I$216,$C$205:$C$216))))","v":94.019933554817271},null,null,null,{"$f":"IF(MAX(C205:C216)-MIN(C205:C216)<5,AVERAGEIF(C205:C216,\">0\",M205:M216),\nIF(FORECAST($C201,M$205:M$216,$C$205:$C$216)<0,0,\nIF(FORECAST($C201,M$205:M$216,$C$205:$C$216)>100,100,\nFORECAST($C201,M$205:M$216,$C$205:$C$216))))","v":0},{"$f":"IF(MAX(C205:C216)-MIN(C205:C216)<5,AVERAGEIF(C205:C216,\">0\",N205:N216),\nIF(FORECAST($C201,N$205:N$216,$C$205:$C$216)<0,0,\nIF(FORECAST($C201,N$205:N$216,$C$205:$C$216)>100,100,\nFORECAST($C201,N$205:N$216,$C$205:$C$216))))","v":99.999999999999986},null,null,null,{"$f":"IF(MAX(C205:C216)-MIN(C205:C216)<5,AVERAGEIF(C205:C216,\">0\",R205:R216),\nIF(FORECAST($C201,R$205:R$216,$C$205:$C$216)<0,0,\nIF(FORECAST($C201,R$205:R$216,$C$205:$C$216)>100,100,\nFORECAST($C201,R$205:R$216,$C$205:$C$216))))","v":0},{"$f":"IF(MAX(C205:C216)-MIN(C205:C216)<5,AVERAGEIF(C205:C216,\">0\",S205:S216),\nIF(FORECAST($C201,S$205:S$216,$C$205:$C$216)<0,0,\nIF(FORECAST($C201,S$205:S$216,$C$205:$C$216)>100,100,\nFORECAST($C201,S$205:S$216,$C$205:$C$216))))","v":100},null,null,null,{"$f":"IF(MAX(C205:C216)-MIN(C205:C216)<5,AVERAGEIF(C205:C216,\">0\",W205:W216),\nIF(FORECAST($C201,W$205:W$216,$C$205:$C$216)<0,0,\nIF(FORECAST($C201,W$205:W$216,$C$205:$C$216)>100,100,\nFORECAST($C201,W$205:W$216,$C$205:$C$216))))","v":0},{"$f":"IF(MAX(C205:C216)-MIN(C205:C216)<5,AVERAGEIF(C205:C216,\">0\",X205:X216),\nIF(FORECAST($C201,X$205:X$216,$C$205:$C$216)<0,0,\nIF(FORECAST($C201,X$205:X$216,$C$205:$C$216)>100,100,\nFORECAST($C201,X$205:X$216,$C$205:$C$216))))","v":100},null,null,null,{"$f":"IF(MAX(C205:C216)-MIN(C205:C216)<5,AVERAGEIF(C205:C216,\">0\",AB205:AB216),\nIF(FORECAST($C201,AB$205:AB$216,$C$205:$C$216)<0,0,\nIF(FORECAST($C201,AB$205:AB$216,$C$205:$C$216)>100,100,\nFORECAST($C201,AB$205:AB$216,$C$205:$C$216))))","v":0}]
[null,null,{"$f":"MaxRegYear(C200,C205:C216)","v":2014},{"$f":"IF(MAX(C205:C216)-MIN(C205:C216)<5,AVERAGEIF(C205:C216,\">0\",D205:D216),\nIF(FORECAST($C202,D$205:D$216,$C$205:$C$216)<0,0,\nIF(FORECAST($C202,D$205:D$216,$C$205:$C$216)>100,100,\nFORECAST($C202,D$205:D$216,$C$205:$C$216))))","v":100},null,null,null,{"$f":"IF(MAX(C205:C216)-MIN(C205:C216)<5,AVERAGEIF(C205:C216,\">0\",H205:H216),\nIF(FORECAST($C202,H$205:H$216,$C$205:$C$216)<0,0,\nIF(FORECAST($C202,H$205:H$216,$C$205:$C$216)>100,100,\nFORECAST($C202,H$205:H$216,$C$205:$C$216))))","v":0},{"$f":"IF(MAX(C205:C216)-MIN(C205:C216)<5,AVERAGEIF(C205:C216,\">0\",I205:I216),\nIF(FORECAST($C202,I$205:I$216,$C$205:$C$216)<0,0,\nIF(FORECAST($C202,I$205:I$216,$C$205:$C$216)>100,100,\nFORECAST($C202,I$205:I$216,$C$205:$C$216))))","v":100},null,null,null,{"$f":"IF(MAX(C205:C216)-MIN(C205:C216)<5,AVERAGEIF(C205:C216,\">0\",M205:M216),\nIF(FORECAST($C202,M$205:M$216,$C$205:$C$216)<0,0,\nIF(FORECAST($C202,M$205:M$216,$C$205:$C$216)>100,100,\nFORECAST($C202,M$205:M$216,$C$205:$C$216))))","v":0},{"$f":"IF(MAX(C205:C216)-MIN(C205:C216)<5,AVERAGEIF(C205:C216,\">0\",N205:N216),\nIF(FORECAST($C202,N$205:N$216,$C$205:$C$216)<0,0,\nIF(FORECAST($C202,N$205:N$216,$C$205:$C$216)>100,100,\nFORECAST($C202,N$205:N$216,$C$205:$C$216))))","v":100.00000000000001},null,null,null,{"$f":"IF(MAX(C205:C216)-MIN(C205:C216)<5,AVERAGEIF(C205:C216,\">0\",R205:R216),\nIF(FORECAST($C202,R$205:R$216,$C$205:$C$216)<0,0,\nIF(FORECAST($C202,R$205:R$216,$C$205:$C$216)>100,100,\nFORECAST($C202,R$205:R$216,$C$205:$C$216))))","v":0},{"$f":"IF(MAX(C205:C216)-MIN(C205:C216)<5,AVERAGEIF(C205:C216,\">0\",S205:S216),\nIF(FORECAST($C202,S$205:S$216,$C$205:$C$216)<0,0,\nIF(FORECAST($C202,S$205:S$216,$C$205:$C$216)>100,100,\nFORECAST($C202,S$205:S$216,$C$205:$C$216))))","v":99.674505922729736},null,null,null,{"$f":"IF(MAX(C205:C216)-MIN(C205:C216)<5,AVERAGEIF(C205:C216,\">0\",W205:W216),\nIF(FORECAST($C202,W$205:W$216,$C$205:$C$216)<0,0,\nIF(FORECAST($C202,W$205:W$216,$C$205:$C$216)>100,100,\nFORECAST($C202,W$205:W$216,$C$205:$C$216))))","v":0},{"$f":"IF(MAX(C205:C216)-MIN(C205:C216)<5,AVERAGEIF(C205:C216,\">0\",X205:X216),\nIF(FORECAST($C202,X$205:X$216,$C$205:$C$216)<0,0,\nIF(FORECAST($C202,X$205:X$216,$C$205:$C$216)>100,100,\nFORECAST($C202,X$205:X$216,$C$205:$C$216))))","v":100},null,null,null,{"$f":"IF(MAX(C205:C216)-MIN(C205:C216)<5,AVERAGEIF(C205:C216,\">0\",AB205:AB216),\nIF(FORECAST($C202,AB$205:AB$216,$C$205:$C$216)<0,0,\nIF(FORECAST($C202,AB$205:AB$216,$C$205:$C$216)>100,100,\nFORECAST($C202,AB$205:AB$216,$C$205:$C$216))))","v":0}]
[]
[null,"Survey","Year","Improved","% Improved\n< = 30min",null,null,"Surface water","Improved","% Improved\n< = 30min",null,null,"Surface water","Improved","% Improved\n< = 30min",null,null,"Surface water","Improved","% Improved\n< = 30min",null,null,"Surface water","Improved","% Improved\n< = 30min",null,null,"Surface water"]
[null,"SLC05",2005,{"$f":"IF(ISERROR(INDIRECT(CONCATENATE($B205,\"!H16\"))),\"\",INDIRECT(CONCATENATE($B205,\"!H16\")))","v":92.857142857142847},{"$f":"IF(ISERROR(INDIRECT(CONCATENATE($B205,\"!H23\"))),\"\",INDIRECT(CONCATENATE($B205,\"!H23\")))","v":"N/A"},null,null,{"$f":"IF(ISERROR(INDIRECT(CONCATENATE($B205,\"!H21\"))),\"\",INDIRECT(CONCATENATE($B205,\"!H21\")))","v":0},{"$f":"IF(ISERROR(INDIRECT(CONCATENATE($B205,\"!I16\"))),\"\",INDIRECT(CONCATENATE($B205,\"!I16\")))","v":95.348837209302332},{"$f":"IF(ISERROR(INDIRECT(CONCATENATE($B205,\"!I23\"))),\"\",INDIRECT(CONCATENATE($B205,\"!I23\")))","v":"N/A"},null,null,{"$f":"IF(ISERROR(INDIRECT(CONCATENATE($B205,\"!I21\"))),\"\",INDIRECT(CONCATENATE($B205,\"!I21\")))","v":0},{"$f":"IF(ISERROR(INDIRECT(CONCATENATE($B205,\"!J16\"))),\"\",INDIRECT(CONCATENATE($B205,\"!J16\")))","v":99.999999999999986},{"$f":"IF(ISERROR(INDIRECT(CONCATENATE($B205,\"!J23\"))),\"\",INDIRECT(CONCATENATE($B205,\"!J23\")))","v":"N/A"},null,null,{"$f":"IF(ISERROR(INDIRECT(CONCATENATE($B205,\"!J21\"))),\"\",INDIRECT(CONCATENATE($B205,\"!J21\")))","v":0},{"$f":"IF(ISERROR(INDIRECT(CONCATENATE($B205,\"!K16\"))),\"\",INDIRECT(CONCATENATE($B205,\"!K16\")))","v":100},{"$f":"IF(ISERROR(INDIRECT(CONCATENATE($B205,\"!K23\"))),\"\",INDIRECT(CONCATENATE($B205,\"!K23\")))","v":"N/A"},null,null,{"$f":"IF(ISERROR(INDIRECT(CONCATENATE($B205,\"!K21\"))),\"\",INDIRECT(CONCATENATE($B205,\"!K21\")))","v":0},{"$f":"IF(ISERROR(INDIRECT(CONCATENATE($B205,\"!L16\"))),\"\",INDIRECT(CONCATENATE($B205,\"!L16\")))","v":100},{"$f":"IF(ISERROR(INDIRECT(CONCATENATE($B205,\"!L23\"))),\"\",INDIRECT(CONCATENATE($B205,\"!L23\")))","v":"N/A"},null,null,{"$f":"IF(ISERROR(INDIRECT(CONCATENATE($B205,\"!L221\"))),\"\",INDIRECT(CONCATENATE($B205,\"!L21\")))","v":0}]
[null,"MICS12",2012,99.462234562805321,99.666489734075427,null,null,0,100,100,null,null,0,100,100,null,null,0,99.746837939900914,100,null,null,0,100,99.238230271170707,null,null,0]
[null,null,null,"","",null,null,"","","",null,null,"","","",null,null,"","","",null,null,"","","",null,null,""]
[null,null,null,"","",null,null,"","","",null,null,"","","",null,null,"","","",null,null,"","","",null,null,""]
[null,null,null,"","",null,null,"","","",null,null,"","","",null,null,"","","",null,null,"","","",null,null,""]
[null,null,null,"","",null,null,"","","",null,null,"","","",null,null,"","","",null,null,"","","",null,null,""]
[null,null,null,"","",null,null,"","","",null,null,"","","",null,null,"","","",null,null,"","","",null,null,""]
[null,null,null,"","",null,null,"","","",null,null,"","","",null,null,"","","",null,null,"","","",null,null,""]
[null,null,null,"","",null,null,"","","",null,null,"","","",null,null,"","","",null,null,"","","",null,null,""]
[null,null,null,"","",null,null,"","","",null,null,"","","",null,null,"","","",null,null,"","","",null,null,""]
[null,null,null,"","",null,null,"","","",null,null,"","","",null,null,"","","",null,null,"","","",null,null,""]
[null,null,null,"","",null,null,"","","",null,null,"","","",null,null,"","","",null,null,"","","",null,null,""]
[]
[null,{"$f":"CONCATENATE(\"Urban use of drinking water sources,  \",C199,\"–\",C200)","v":"Urban use of drinking water sources,  2000–2018"},null,null,null,null,null,null,null,null,null,null,null,null,null,null,null,null,"Data points used for regression"]
[]
[]
[]
[]
[]
[]
[]
[]
[]
[]
[]
[]
[]
[]
[]
[]
[]
[]
[]
[]
[]
[]
[]
[]
[]
[]
[]
[]
[]
[]
[]
[]
[]
[]
[null,null,null,null,{"$f":"IF(ISERROR(INDIRECT(CONCATENATE($B253,\"!M18\"))),\"\",INDIRECT(CONCATENATE($B253,\"!M18\")))","v":""},{"$f":"IF(ISERROR(INDIRECT(CONCATENATE($B253,\"!M19\"))),\"\",INDIRECT(CONCATENATE($B253,\"!M19\")))","v":""},{"$f":"IF(ISERROR(INDIRECT(CONCATENATE($B253,\"!M20\"))),\"\",INDIRECT(CONCATENATE($B253,\"!M20\")))","v":""},{"$f":"IF(ISERROR(INDIRECT(CONCATENATE($B253,\"!M21\"))),\"\",INDIRECT(CONCATENATE($B253,\"!M21\")))","v":""},null,{"$f":"IF(ISERROR(INDIRECT(CONCATENATE($B253,\"!N18\"))),\"\",INDIRECT(CONCATENATE($B253,\"!N18\")))","v":""},{"$f":"IF(ISERROR(INDIRECT(CONCATENATE($B253,\"!N19\"))),\"\",INDIRECT(CONCATENATE($B253,\"!N19\")))","v":""},{"$f":"IF(ISERROR(INDIRECT(CONCATENATE($B253,\"!N20\"))),\"\",INDIRECT(CONCATENATE($B253,\"!N20\")))","v":""},{"$f":"IF(ISERROR(INDIRECT(CONCATENATE($B253,\"!N21\"))),\"\",INDIRECT(CONCATENATE($B253,\"!N21\")))","v":""},null,{"$f":"IF(ISERROR(INDIRECT(CONCATENATE($B253,\"!O18\"))),\"\",INDIRECT(CONCATENATE($B253,\"!O18\")))","v":""},{"$f":"IF(ISERROR(INDIRECT(CONCATENATE($B253,\"!O19\"))),\"\",INDIRECT(CONCATENATE($B253,\"!O19\")))","v":""},{"$f":"IF(ISERROR(INDIRECT(CONCATENATE($B253,\"!O20\"))),\"\",INDIRECT(CONCATENATE($B253,\"!O20\")))","v":""},{"$f":"IF(ISERROR(INDIRECT(CONCATENATE($B253,\"!O21\"))),\"\",INDIRECT(CONCATENATE($B253,\"!O21\")))","v":""},null,{"$f":"IF(ISERROR(INDIRECT(CONCATENATE($B253,\"!P18\"))),\"\",INDIRECT(CONCATENATE($B253,\"!P18\")))","v":""},{"$f":"IF(ISERROR(INDIRECT(CONCATENATE($B253,\"!P19\"))),\"\",INDIRECT(CONCATENATE($B253,\"!P19\")))","v":""},{"$f":"IF(ISERROR(INDIRECT(CONCATENATE($B253,\"!P20\"))),\"\",INDIRECT(CONCATENATE($B253,\"!P20\")))","v":""},{"$f":"IF(ISERROR(INDIRECT(CONCATENATE($B253,\"!P21\"))),\"\",INDIRECT(CONCATENATE($B253,\"!P21\")))","v":""},null,{"$f":"IF(ISERROR(INDIRECT(CONCATENATE($B253,\"!Q18\"))),\"\",INDIRECT(CONCATENATE($B253,\"!Q18\")))","v":""},{"$f":"IF(ISERROR(INDIRECT(CONCATENATE($B253,\"!Q19\"))),\"\",INDIRECT(CONCATENATE($B253,\"!Q19\")))","v":""},{"$f":"IF(ISERROR(INDIRECT(CONCATENATE($B253,\"!Q20\"))),\"\",INDIRECT(CONCATENATE($B253,\"!Q20\")))","v":""},{"$f":"IF(ISERROR(INDIRECT(CONCATENATE($B253,\"!Q21\"))),\"\",INDIRECT(CONCATENATE($B253,\"!Q1\")))","v":""}]
[null,null,null,null,{"$f":"IF(ISERROR(INDIRECT(CONCATENATE($B254,\"!M18\"))),\"\",INDIRECT(CONCATENATE($B254,\"!M18\")))","v":""},{"$f":"IF(ISERROR(INDIRECT(CONCATENATE($B254,\"!M19\"))),\"\",INDIRECT(CONCATENATE($B254,\"!M19\")))","v":""},{"$f":"IF(ISERROR(INDIRECT(CONCATENATE($B254,\"!M20\"))),\"\",INDIRECT(CONCATENATE($B254,\"!M20\")))","v":""},{"$f":"IF(ISERROR(INDIRECT(CONCATENATE($B254,\"!M21\"))),\"\",INDIRECT(CONCATENATE($B254,\"!M21\")))","v":""},null,{"$f":"IF(ISERROR(INDIRECT(CONCATENATE($B254,\"!N18\"))),\"\",INDIRECT(CONCATENATE($B254,\"!N18\")))","v":""},{"$f":"IF(ISERROR(INDIRECT(CONCATENATE($B254,\"!N19\"))),\"\",INDIRECT(CONCATENATE($B254,\"!N19\")))","v":""},{"$f":"IF(ISERROR(INDIRECT(CONCATENATE($B254,\"!N20\"))),\"\",INDIRECT(CONCATENATE($B254,\"!N20\")))","v":""},{"$f":"IF(ISERROR(INDIRECT(CONCATENATE($B254,\"!N21\"))),\"\",INDIRECT(CONCATENATE($B254,\"!N21\")))","v":""},null,{"$f":"IF(ISERROR(INDIRECT(CONCATENATE($B254,\"!O18\"))),\"\",INDIRECT(CONCATENATE($B254,\"!O18\")))","v":""},{"$f":"IF(ISERROR(INDIRECT(CONCATENATE($B254,\"!O19\"))),\"\",INDIRECT(CONCATENATE($B254,\"!O19\")))","v":""},{"$f":"IF(ISERROR(INDIRECT(CONCATENATE($B254,\"!O20\"))),\"\",INDIRECT(CONCATENATE($B254,\"!O20\")))","v":""},{"$f":"IF(ISERROR(INDIRECT(CONCATENATE($B254,\"!O21\"))),\"\",INDIRECT(CONCATENATE($B254,\"!O21\")))","v":""},null,{"$f":"IF(ISERROR(INDIRECT(CONCATENATE($B254,\"!P18\"))),\"\",INDIRECT(CONCATENATE($B254,\"!P18\")))","v":""},{"$f":"IF(ISERROR(INDIRECT(CONCATENATE($B254,\"!P19\"))),\"\",INDIRECT(CONCATENATE($B254,\"!P19\")))","v":""},{"$f":"IF(ISERROR(INDIRECT(CONCATENATE($B254,\"!P20\"))),\"\",INDIRECT(CONCATENATE($B254,\"!P20\")))","v":""},{"$f":"IF(ISERROR(INDIRECT(CONCATENATE($B254,\"!P21\"))),\"\",INDIRECT(CONCATENATE($B254,\"!P21\")))","v":""},null,{"$f":"IF(ISERROR(INDIRECT(CONCATENATE($B254,\"!Q18\"))),\"\",INDIRECT(CONCATENATE($B254,\"!Q18\")))","v":""},{"$f":"IF(ISERROR(INDIRECT(CONCATENATE($B254,\"!Q19\"))),\"\",INDIRECT(CONCATENATE($B254,\"!Q19\")))","v":""},{"$f":"IF(ISERROR(INDIRECT(CONCATENATE($B254,\"!Q20\"))),\"\",INDIRECT(CONCATENATE($B254,\"!Q20\")))","v":""},{"$f":"IF(ISERROR(INDIRECT(CONCATENATE($B254,\"!Q21\"))),\"\",INDIRECT(CONCATENATE($B254,\"!Q1\")))","v":""}]
[null,null,null,null,{"$f":"IF(ISERROR(INDIRECT(CONCATENATE($B255,\"!M18\"))),\"\",INDIRECT(CONCATENATE($B255,\"!M18\")))","v":""},{"$f":"IF(ISERROR(INDIRECT(CONCATENATE($B255,\"!M19\"))),\"\",INDIRECT(CONCATENATE($B255,\"!M19\")))","v":""},{"$f":"IF(ISERROR(INDIRECT(CONCATENATE($B255,\"!M20\"))),\"\",INDIRECT(CONCATENATE($B255,\"!M20\")))","v":""},{"$f":"IF(ISERROR(INDIRECT(CONCATENATE($B255,\"!M21\"))),\"\",INDIRECT(CONCATENATE($B255,\"!M21\")))","v":""},null,{"$f":"IF(ISERROR(INDIRECT(CONCATENATE($B255,\"!N18\"))),\"\",INDIRECT(CONCATENATE($B255,\"!N18\")))","v":""},{"$f":"IF(ISERROR(INDIRECT(CONCATENATE($B255,\"!N19\"))),\"\",INDIRECT(CONCATENATE($B255,\"!N19\")))","v":""},{"$f":"IF(ISERROR(INDIRECT(CONCATENATE($B255,\"!N20\"))),\"\",INDIRECT(CONCATENATE($B255,\"!N20\")))","v":""},{"$f":"IF(ISERROR(INDIRECT(CONCATENATE($B255,\"!N21\"))),\"\",INDIRECT(CONCATENATE($B255,\"!N21\")))","v":""},null,{"$f":"IF(ISERROR(INDIRECT(CONCATENATE($B255,\"!O18\"))),\"\",INDIRECT(CONCATENATE($B255,\"!O18\")))","v":""},{"$f":"IF(ISERROR(INDIRECT(CONCATENATE($B255,\"!O19\"))),\"\",INDIRECT(CONCATENATE($B255,\"!O19\")))","v":""},{"$f":"IF(ISERROR(INDIRECT(CONCATENATE($B255,\"!O20\"))),\"\",INDIRECT(CONCATENATE($B255,\"!O20\")))","v":""},{"$f":"IF(ISERROR(INDIRECT(CONCATENATE($B255,\"!O21\"))),\"\",INDIRECT(CONCATENATE($B255,\"!O21\")))","v":""},null,{"$f":"IF(ISERROR(INDIRECT(CONCATENATE($B255,\"!P18\"))),\"\",INDIRECT(CONCATENATE($B255,\"!P18\")))","v":""},{"$f":"IF(ISERROR(INDIRECT(CONCATENATE($B255,\"!P19\"))),\"\",INDIRECT(CONCATENATE($B255,\"!P19\")))","v":""},{"$f":"IF(ISERROR(INDIRECT(CONCATENATE($B255,\"!P20\"))),\"\",INDIRECT(CONCATENATE($B255,\"!P20\")))","v":""},{"$f":"IF(ISERROR(INDIRECT(CONCATENATE($B255,\"!P21\"))),\"\",INDIRECT(CONCATENATE($B255,\"!P21\")))","v":""},null,{"$f":"IF(ISERROR(INDIRECT(CONCATENATE($B255,\"!Q18\"))),\"\",INDIRECT(CONCATENATE($B255,\"!Q18\")))","v":""},{"$f":"IF(ISERROR(INDIRECT(CONCATENATE($B255,\"!Q19\"))),\"\",INDIRECT(CONCATENATE($B255,\"!Q19\")))","v":""},{"$f":"IF(ISERROR(INDIRECT(CONCATENATE($B255,\"!Q20\"))),\"\",INDIRECT(CONCATENATE($B255,\"!Q20\")))","v":""},{"$f":"IF(ISERROR(INDIRECT(CONCATENATE($B255,\"!Q21\"))),\"\",INDIRECT(CONCATENATE($B255,\"!Q1\")))","v":""}]
[null,null,null,null,{"$f":"IF(ISERROR(INDIRECT(CONCATENATE($B256,\"!M18\"))),\"\",INDIRECT(CONCATENATE($B256,\"!M18\")))","v":""},{"$f":"IF(ISERROR(INDIRECT(CONCATENATE($B256,\"!M19\"))),\"\",INDIRECT(CONCATENATE($B256,\"!M19\")))","v":""},{"$f":"IF(ISERROR(INDIRECT(CONCATENATE($B256,\"!M20\"))),\"\",INDIRECT(CONCATENATE($B256,\"!M20\")))","v":""},{"$f":"IF(ISERROR(INDIRECT(CONCATENATE($B256,\"!M21\"))),\"\",INDIRECT(CONCATENATE($B256,\"!M21\")))","v":""},null,{"$f":"IF(ISERROR(INDIRECT(CONCATENATE($B256,\"!N18\"))),\"\",INDIRECT(CONCATENATE($B256,\"!N18\")))","v":""},{"$f":"IF(ISERROR(INDIRECT(CONCATENATE($B256,\"!N19\"))),\"\",INDIRECT(CONCATENATE($B256,\"!N19\")))","v":""},{"$f":"IF(ISERROR(INDIRECT(CONCATENATE($B256,\"!N20\"))),\"\",INDIRECT(CONCATENATE($B256,\"!N20\")))","v":""},{"$f":"IF(ISERROR(INDIRECT(CONCATENATE($B256,\"!N21\"))),\"\",INDIRECT(CONCATENATE($B256,\"!N21\")))","v":""},null,{"$f":"IF(ISERROR(INDIRECT(CONCATENATE($B256,\"!O18\"))),\"\",INDIRECT(CONCATENATE($B256,\"!O18\")))","v":""},{"$f":"IF(ISERROR(INDIRECT(CONCATENATE($B256,\"!O19\"))),\"\",INDIRECT(CONCATENATE($B256,\"!O19\")))","v":""},{"$f":"IF(ISERROR(INDIRECT(CONCATENATE($B256,\"!O20\"))),\"\",INDIRECT(CONCATENATE($B256,\"!O20\")))","v":""},{"$f":"IF(ISERROR(INDIRECT(CONCATENATE($B256,\"!O21\"))),\"\",INDIRECT(CONCATENATE($B256,\"!O21\")))","v":""},null,{"$f":"IF(ISERROR(INDIRECT(CONCATENATE($B256,\"!P18\"))),\"\",INDIRECT(CONCATENATE($B256,\"!P18\")))","v":""},{"$f":"IF(ISERROR(INDIRECT(CONCATENATE($B256,\"!P19\"))),\"\",INDIRECT(CONCATENATE($B256,\"!P19\")))","v":""},{"$f":"IF(ISERROR(INDIRECT(CONCATENATE($B256,\"!P20\"))),\"\",INDIRECT(CONCATENATE($B256,\"!P20\")))","v":""},{"$f":"IF(ISERROR(INDIRECT(CONCATENATE($B256,\"!P21\"))),\"\",INDIRECT(CONCATENATE($B256,\"!P21\")))","v":""},null,{"$f":"IF(ISERROR(INDIRECT(CONCATENATE($B256,\"!Q18\"))),\"\",INDIRECT(CONCATENATE($B256,\"!Q18\")))","v":""},{"$f":"IF(ISERROR(INDIRECT(CONCATENATE($B256,\"!Q19\"))),\"\",INDIRECT(CONCATENATE($B256,\"!Q19\")))","v":""},{"$f":"IF(ISERROR(INDIRECT(CONCATENATE($B256,\"!Q20\"))),\"\",INDIRECT(CONCATENATE($B256,\"!Q20\")))","v":""},{"$f":"IF(ISERROR(INDIRECT(CONCATENATE($B256,\"!Q21\"))),\"\",INDIRECT(CONCATENATE($B256,\"!Q1\")))","v":""}]
[null,null,null,null,{"$f":"IF(ISERROR(INDIRECT(CONCATENATE($B257,\"!M18\"))),\"\",INDIRECT(CONCATENATE($B257,\"!M18\")))","v":""},{"$f":"IF(ISERROR(INDIRECT(CONCATENATE($B257,\"!M19\"))),\"\",INDIRECT(CONCATENATE($B257,\"!M19\")))","v":""},{"$f":"IF(ISERROR(INDIRECT(CONCATENATE($B257,\"!M20\"))),\"\",INDIRECT(CONCATENATE($B257,\"!M20\")))","v":""},{"$f":"IF(ISERROR(INDIRECT(CONCATENATE($B257,\"!M21\"))),\"\",INDIRECT(CONCATENATE($B257,\"!M21\")))","v":""},null,{"$f":"IF(ISERROR(INDIRECT(CONCATENATE($B257,\"!N18\"))),\"\",INDIRECT(CONCATENATE($B257,\"!N18\")))","v":""},{"$f":"IF(ISERROR(INDIRECT(CONCATENATE($B257,\"!N19\"))),\"\",INDIRECT(CONCATENATE($B257,\"!N19\")))","v":""},{"$f":"IF(ISERROR(INDIRECT(CONCATENATE($B257,\"!N20\"))),\"\",INDIRECT(CONCATENATE($B257,\"!N20\")))","v":""},{"$f":"IF(ISERROR(INDIRECT(CONCATENATE($B257,\"!N21\"))),\"\",INDIRECT(CONCATENATE($B257,\"!N21\")))","v":""},null,{"$f":"IF(ISERROR(INDIRECT(CONCATENATE($B257,\"!O18\"))),\"\",INDIRECT(CONCATENATE($B257,\"!O18\")))","v":""},{"$f":"IF(ISERROR(INDIRECT(CONCATENATE($B257,\"!O19\"))),\"\",INDIRECT(CONCATENATE($B257,\"!O19\")))","v":""},{"$f":"IF(ISERROR(INDIRECT(CONCATENATE($B257,\"!O20\"))),\"\",INDIRECT(CONCATENATE($B257,\"!O20\")))","v":""},{"$f":"IF(ISERROR(INDIRECT(CONCATENATE($B257,\"!O21\"))),\"\",INDIRECT(CONCATENATE($B257,\"!O21\")))","v":""},null,{"$f":"IF(ISERROR(INDIRECT(CONCATENATE($B257,\"!P18\"))),\"\",INDIRECT(CONCATENATE($B257,\"!P18\")))","v":""},{"$f":"IF(ISERROR(INDIRECT(CONCATENATE($B257,\"!P19\"))),\"\",INDIRECT(CONCATENATE($B257,\"!P19\")))","v":""},{"$f":"IF(ISERROR(INDIRECT(CONCATENATE($B257,\"!P20\"))),\"\",INDIRECT(CONCATENATE($B257,\"!P20\")))","v":""},{"$f":"IF(ISERROR(INDIRECT(CONCATENATE($B257,\"!P21\"))),\"\",INDIRECT(CONCATENATE($B257,\"!P21\")))","v":""},null,{"$f":"IF(ISERROR(INDIRECT(CONCATENATE($B257,\"!Q18\"))),\"\",INDIRECT(CONCATENATE($B257,\"!Q18\")))","v":""},{"$f":"IF(ISERROR(INDIRECT(CONCATENATE($B257,\"!Q19\"))),\"\",INDIRECT(CONCATENATE($B257,\"!Q19\")))","v":""},{"$f":"IF(ISERROR(INDIRECT(CONCATENATE($B257,\"!Q20\"))),\"\",INDIRECT(CONCATENATE($B257,\"!Q20\")))","v":""},{"$f":"IF(ISERROR(INDIRECT(CONCATENATE($B257,\"!Q21\"))),\"\",INDIRECT(CONCATENATE($B257,\"!Q1\")))","v":""}]
[]
[]
[]
[]
[]
[]
[]
[]
[]
[]
[]
[]
[]
[]
[]
[]
[]
[]
[]
[]
[]
[]
[]
[]
[]
[]
[]
[]
[]
[]
[]
[]
[]
[]
[]
[]
[]
[]
[]
["RURAL",null,null,"Poorest",null,null,null,null,"Poor",null,null,null,null,"Middle",null,null,null,null,"Rich",null,null,null,null,"Richest"]
[null,null,null,"Improved","Basic","Limited","Unimproved","Surface water","Improved","Basic","Limited","Unimproved","Surface water","Improved","Basic","Limited","Unimproved","Surface water","Improved","Basic","Limited","Unimproved","Surface water","Improved","Basic","Limited","Unimproved","Surface water"]
["Forecast period:",null,2000,{"$f":"IF((D301+H301)>100,D301*100/(D301+H301),D301)","v":82.152214396953696},{"$f":"D299*AVERAGEIF(E305:E316,\">0\")/100","v":81.869298895454406},{"$f":"D299*(100-AVERAGEIF(E305:E316,\">0\"))/100","v":0.28291550149927924},{"$f":"100-(E299+F299+H299)","v":17.847785603046319},{"$f":"IF((D301+H301)>100,H301*100/(D301+H301),H301)","v":0},{"$f":"IF((I301+M301)>100,I301*100/(I301+M301),I301)","v":93.455695152073531},{"$f":"I299*AVERAGEIF(J305:J316,\">0\")/100","v":93.455695152073531},{"$f":"I299*(100-AVERAGEIF(J305:J316,\">0\"))/100","v":0},{"$f":"100-(J299+K299+M299)","v":6.5443048479264689},{"$f":"IF((I301+M301)>100,M301*100/(I301+M301),M301)","v":0},{"$f":"IF((N301+R301)>100,N301*100/(N301+R301),N301)","v":95.888033534940519},{"$f":"N299*AVERAGEIF(O305:O316,\">0\")/100","v":95.888033534940519},{"$f":"N299*(100-AVERAGEIF(O305:O316,\">0\"))/100","v":0},{"$f":"100-(O299+P299+R299)","v":4.1119664650594814},{"$f":"IF((N301+R301)>100,R301*100/(N301+R301),R301)","v":0},{"$f":"IF((S301+W301)>100,S301*100/(S301+W301),S301)","v":96.660482374768094},{"$f":"S299*AVERAGEIF(T305:T316,\">0\")/100","v":96.660482374768094},{"$f":"S299*(100-AVERAGEIF(T305:T316,\">0\"))/100","v":0},{"$f":"100-(T299+U299+W299)","v":3.3395176252319061},{"$f":"IF((S301+W301)>100,W301*100/(S301+W301),W301)","v":0},{"$f":"IF((X301+AB301)>100,X301*100/(X301+AB301),X301)","v":100},{"$f":"X299*AVERAGEIF(Y305:Y316,\">0\")/100","v":100},{"$f":"X299*(100-AVERAGEIF(Y305:Y316,\">0\"))/100","v":0},{"$f":"100-(Y299+Z299+AB299)","v":0},{"$f":"IF((X301+AB301)>100,AB301*100/(X301+AB301),AB301)","v":0}]
[null,null,2018,{"$f":"IF((D302+H302)>100,D302*100/(D302+H302),D302)","v":100},{"$f":"D300*AVERAGEIF(E305:E316,\">0\")/100","v":99.655620358409038},{"$f":"D300*(100-AVERAGEIF(E305:E316,\">0\"))/100","v":0.34437964159097589},{"$f":"100-(E300+F300+H300)","v":0},{"$f":"IF((D302+H302)>100,H302*100/(D302+H302),H302)","v":0},{"$f":"IF((I302+M302)>100,I302*100/(I302+M302),I302)","v":100},{"$f":"I300*AVERAGEIF(J305:J316,\">0\")/100","v":100},{"$f":"I300*(100-AVERAGEIF(J305:J316,\">0\"))/100","v":0},{"$f":"100-(J300+K300+M300)","v":0},{"$f":"IF((I302+M302)>100,M302*100/(I302+M302),M302)","v":0},{"$f":"IF((N302+R302)>100,N302*100/(N302+R302),N302)","v":100},{"$f":"N300*AVERAGEIF(O305:O316,\">0\")/100","v":100},{"$f":"N300*(100-AVERAGEIF(O305:O316,\">0\"))/100","v":0},{"$f":"100-(O300+P300+R300)","v":0},{"$f":"IF((N302+R302)>100,R302*100/(N302+R302),R302)","v":0},{"$f":"IF((S302+W302)>100,S302*100/(S302+W302),S302)","v":100},{"$f":"S300*AVERAGEIF(T305:T316,\">0\")/100","v":100},{"$f":"S300*(100-AVERAGEIF(T305:T316,\">0\"))/100","v":0},{"$f":"100-(T300+U300+W300)","v":0},{"$f":"IF((S302+W302)>100,W302*100/(S302+W302),W302)","v":0},{"$f":"IF((X302+AB302)>100,X302*100/(X302+AB302),X302)","v":99.145696066445623},{"$f":"X300*AVERAGEIF(Y305:Y316,\">0\")/100","v":99.145696066445623},{"$f":"X300*(100-AVERAGEIF(Y305:Y316,\">0\"))/100","v":0},{"$f":"100-(Y300+Z300+AB300)","v":0.85430393355437673},{"$f":"IF((X302+AB302)>100,AB302*100/(X302+AB302),AB302)","v":0}]
["Regression period:",null,{"$f":"MinRegYear(C299,C305:C316)","v":2003},{"$f":"IF(MAX(C305:C316)-MIN(C305:C316)<5,AVERAGEIF(C305:C316,\">0\",D305:D316),\nIF(FORECAST($C301,D$305:D$316,$C$305:$C$316)<0,0,\nIF(FORECAST($C301,D$305:D$316,$C$305:$C$316)>100,100,\nFORECAST($C301,D$305:D$316,$C$305:$C$316))))","v":82.152214396953696},null,null,null,{"$f":"IF(MAX(C305:C316)-MIN(C305:C316)<5,AVERAGEIF(C305:C316,\">0\",H305:H316),\nIF(FORECAST($C301,H$305:H$316,$C$305:$C$316)<0,0,\nIF(FORECAST($C301,H$305:H$316,$C$305:$C$316)>100,100,\nFORECAST($C301,H$305:H$316,$C$305:$C$316))))","v":0},{"$f":"IF(MAX(C305:C316)-MIN(C305:C316)<5,AVERAGEIF(C305:C316,\">0\",I305:I316),\nIF(FORECAST($C301,I$305:I$316,$C$305:$C$316)<0,0,\nIF(FORECAST($C301,I$305:I$316,$C$305:$C$316)>100,100,\nFORECAST($C301,I$305:I$316,$C$305:$C$316))))","v":93.455695152073531},null,null,null,{"$f":"IF(MAX(C305:C316)-MIN(C305:C316)<5,AVERAGEIF(C305:C316,\">0\",M305:M316),\nIF(FORECAST($C301,M$305:M$316,$C$305:$C$316)<0,0,\nIF(FORECAST($C301,M$305:M$316,$C$305:$C$316)>100,100,\nFORECAST($C301,M$305:M$316,$C$305:$C$316))))","v":0},{"$f":"IF(MAX(C305:C316)-MIN(C305:C316)<5,AVERAGEIF(C305:C316,\">0\",N305:N316),\nIF(FORECAST($C301,N$305:N$316,$C$305:$C$316)<0,0,\nIF(FORECAST($C301,N$305:N$316,$C$305:$C$316)>100,100,\nFORECAST($C301,N$305:N$316,$C$305:$C$316))))","v":95.888033534940519},null,null,null,{"$f":"IF(MAX(C305:C316)-MIN(C305:C316)<5,AVERAGEIF(C305:C316,\">0\",R305:R316),\nIF(FORECAST($C301,R$305:R$316,$C$305:$C$316)<0,0,\nIF(FORECAST($C301,R$305:R$316,$C$305:$C$316)>100,100,\nFORECAST($C301,R$305:R$316,$C$305:$C$316))))","v":0},{"$f":"IF(MAX(C305:C316)-MIN(C305:C316)<5,AVERAGEIF(C305:C316,\">0\",S305:S316),\nIF(FORECAST($C301,S$305:S$316,$C$305:$C$316)<0,0,\nIF(FORECAST($C301,S$305:S$316,$C$305:$C$316)>100,100,\nFORECAST($C301,S$305:S$316,$C$305:$C$316))))","v":96.660482374768094},null,null,null,{"$f":"IF(MAX(C305:C316)-MIN(C305:C316)<5,AVERAGEIF(C305:C316,\">0\",W305:W316),\nIF(FORECAST($C301,W$305:W$316,$C$305:$C$316)<0,0,\nIF(FORECAST($C301,W$305:W$316,$C$305:$C$316)>100,100,\nFORECAST($C301,W$305:W$316,$C$305:$C$316))))","v":0},{"$f":"IF(MAX(C305:C316)-MIN(C305:C316)<5,AVERAGEIF(C305:C316,\">0\",X305:X316),\nIF(FORECAST($C301,X$305:X$316,$C$305:$C$316)<0,0,\nIF(FORECAST($C301,X$305:X$316,$C$305:$C$316)>100,100,\nFORECAST($C301,X$305:X$316,$C$305:$C$316))))","v":100},null,null,null,{"$f":"IF(MAX(C305:C316)-MIN(C305:C316)<5,AVERAGEIF(C305:C316,\">0\",AB305:AB316),\nIF(FORECAST($C301,AB$305:AB$316,$C$305:$C$316)<0,0,\nIF(FORECAST($C301,AB$305:AB$316,$C$305:$C$316)>100,100,\nFORECAST($C301,AB$305:AB$316,$C$305:$C$316))))","v":0}]
[null,null,{"$f":"MaxRegYear(C300,C305:C316)","v":2014},{"$f":"IF(MAX(C305:C316)-MIN(C305:C316)<5,AVERAGEIF(C305:C316,\">0\",D305:D316),\nIF(FORECAST($C302,D$305:D$316,$C$305:$C$316)<0,0,\nIF(FORECAST($C302,D$305:D$316,$C$305:$C$316)>100,100,\nFORECAST($C302,D$305:D$316,$C$305:$C$316))))","v":100},null,null,null,{"$f":"IF(MAX(C305:C316)-MIN(C305:C316)<5,AVERAGEIF(C305:C316,\">0\",H305:H316),\nIF(FORECAST($C302,H$305:H$316,$C$305:$C$316)<0,0,\nIF(FORECAST($C302,H$305:H$316,$C$305:$C$316)>100,100,\nFORECAST($C302,H$305:H$316,$C$305:$C$316))))","v":0},{"$f":"IF(MAX(C305:C316)-MIN(C305:C316)<5,AVERAGEIF(C305:C316,\">0\",I305:I316),\nIF(FORECAST($C302,I$305:I$316,$C$305:$C$316)<0,0,\nIF(FORECAST($C302,I$305:I$316,$C$305:$C$316)>100,100,\nFORECAST($C302,I$305:I$316,$C$305:$C$316))))","v":100},null,null,null,{"$f":"IF(MAX(C305:C316)-MIN(C305:C316)<5,AVERAGEIF(C305:C316,\">0\",M305:M316),\nIF(FORECAST($C302,M$305:M$316,$C$305:$C$316)<0,0,\nIF(FORECAST($C302,M$305:M$316,$C$305:$C$316)>100,100,\nFORECAST($C302,M$305:M$316,$C$305:$C$316))))","v":0},{"$f":"IF(MAX(C305:C316)-MIN(C305:C316)<5,AVERAGEIF(C305:C316,\">0\",N305:N316),\nIF(FORECAST($C302,N$305:N$316,$C$305:$C$316)<0,0,\nIF(FORECAST($C302,N$305:N$316,$C$305:$C$316)>100,100,\nFORECAST($C302,N$305:N$316,$C$305:$C$316))))","v":100},null,null,null,{"$f":"IF(MAX(C305:C316)-MIN(C305:C316)<5,AVERAGEIF(C305:C316,\">0\",R305:R316),\nIF(FORECAST($C302,R$305:R$316,$C$305:$C$316)<0,0,\nIF(FORECAST($C302,R$305:R$316,$C$305:$C$316)>100,100,\nFORECAST($C302,R$305:R$316,$C$305:$C$316))))","v":0},{"$f":"IF(MAX(C305:C316)-MIN(C305:C316)<5,AVERAGEIF(C305:C316,\">0\",S305:S316),\nIF(FORECAST($C302,S$305:S$316,$C$305:$C$316)<0,0,\nIF(FORECAST($C302,S$305:S$316,$C$305:$C$316)>100,100,\nFORECAST($C302,S$305:S$316,$C$305:$C$316))))","v":100},null,null,null,{"$f":"IF(MAX(C305:C316)-MIN(C305:C316)<5,AVERAGEIF(C305:C316,\">0\",W305:W316),\nIF(FORECAST($C302,W$305:W$316,$C$305:$C$316)<0,0,\nIF(FORECAST($C302,W$305:W$316,$C$305:$C$316)>100,100,\nFORECAST($C302,W$305:W$316,$C$305:$C$316))))","v":0},{"$f":"IF(MAX(C305:C316)-MIN(C305:C316)<5,AVERAGEIF(C305:C316,\">0\",X305:X316),\nIF(FORECAST($C302,X$305:X$316,$C$305:$C$316)<0,0,\nIF(FORECAST($C302,X$305:X$316,$C$305:$C$316)>100,100,\nFORECAST($C302,X$305:X$316,$C$305:$C$316))))","v":99.145696066445623},null,null,null,{"$f":"IF(MAX(C305:C316)-MIN(C305:C316)<5,AVERAGEIF(C305:C316,\">0\",AB305:AB316),\nIF(FORECAST($C302,AB$305:AB$316,$C$305:$C$316)<0,0,\nIF(FORECAST($C302,AB$305:AB$316,$C$305:$C$316)>100,100,\nFORECAST($C302,AB$305:AB$316,$C$305:$C$316))))","v":0}]
[]
[null,"Survey","Year","Improved","% Improved\n< = 30min",null,null,"Surface water","Improved","% Improved\n< = 30min",null,null,"Surface water","Improved","% Improved\n< = 30min",null,null,"Surface water","Improved","% Improved\n< = 30min",null,null,"Surface water","Improved","% Improved\n< = 30min",null,null,"Surface water"]
[null,"SLC05",2005,{"$f":"IF(ISERROR(INDIRECT(CONCATENATE($B305,\"!M16\"))),\"\",INDIRECT(CONCATENATE($B305,\"!M16\")))","v":85.497736267269318},{"$f":"IF(ISERROR(INDIRECT(CONCATENATE($B305,\"!M23\"))),\"\",INDIRECT(CONCATENATE($B305,\"!M23\")))","v":"N/A"},null,null,{"$f":"IF(ISERROR(INDIRECT(CONCATENATE($B305,\"!M21\"))),\"\",INDIRECT(CONCATENATE($B305,\"!M21\")))","v":0},{"$f":"IF(ISERROR(INDIRECT(CONCATENATE($B305,\"!N16\"))),\"\",INDIRECT(CONCATENATE($B305,\"!N16\")))","v":94.805194805194802},{"$f":"IF(ISERROR(INDIRECT(CONCATENATE($B305,\"!N23\"))),\"\",INDIRECT(CONCATENATE($B305,\"!N23\")))","v":"N/A"},null,null,{"$f":"IF(ISERROR(INDIRECT(CONCATENATE($B305,\"!N21\"))),\"\",INDIRECT(CONCATENATE($B305,\"!N21\")))","v":0},{"$f":"IF(ISERROR(INDIRECT(CONCATENATE($B305,\"!O16\"))),\"\",INDIRECT(CONCATENATE($B305,\"!O16\")))","v":96.72182424339519},{"$f":"IF(ISERROR(INDIRECT(CONCATENATE($B305,\"!O23\"))),\"\",INDIRECT(CONCATENATE($B305,\"!O23\")))","v":"N/A"},null,null,{"$f":"IF(ISERROR(INDIRECT(CONCATENATE($B305,\"!O21\"))),\"\",INDIRECT(CONCATENATE($B305,\"!O21\")))","v":0},{"$f":"IF(ISERROR(INDIRECT(CONCATENATE($B305,\"!P16\"))),\"\",INDIRECT(CONCATENATE($B305,\"!P16\")))","v":97.402597402597394},{"$f":"IF(ISERROR(INDIRECT(CONCATENATE($B305,\"!P23\"))),\"\",INDIRECT(CONCATENATE($B305,\"!P23\")))","v":"N/A"},null,null,{"$f":"IF(ISERROR(INDIRECT(CONCATENATE($B305,\"!P21\"))),\"\",INDIRECT(CONCATENATE($B305,\"!P21\")))","v":0},{"$f":"IF(ISERROR(INDIRECT(CONCATENATE($B305,\"!Q16\"))),\"\",INDIRECT(CONCATENATE($B305,\"!Q16\")))","v":100},{"$f":"IF(ISERROR(INDIRECT(CONCATENATE($B305,\"!Q23\"))),\"\",INDIRECT(CONCATENATE($B305,\"!Q23\")))","v":"N/A"},null,null,{"$f":"IF(ISERROR(INDIRECT(CONCATENATE($B305,\"!Q221\"))),\"\",INDIRECT(CONCATENATE($B305,\"!Q21\")))","v":0}]
[null,"MICS12",2012,97.207062813375572,99.655620358409024,null,null,0,99.528443591119327,100,null,null,0,99.64009172298654,100,null,null,0,100,100,null,null,0,99.335541385013286,100,null,null,0]
[null,null,null,"","",null,null,"","","",null,null,"","","",null,null,"","","",null,null,"","","",null,null,""]
[null,null,null,"","",null,null,"","","",null,null,"","","",null,null,"","","",null,null,"","","",null,null,""]
[null,null,null,"","",null,null,"","","",null,null,"","","",null,null,"","","",null,null,"","","",null,null,""]
[null,null,null,"","",null,null,"","","",null,null,"","","",null,null,"","","",null,null,"","","",null,null,""]
[null,null,null,"","",null,null,"","","",null,null,"","","",null,null,"","","",null,null,"","","",null,null,""]
[null,null,null,"","",null,null,"","","",null,null,"","","",null,null,"","","",null,null,"","","",null,null,""]
[null,null,null,"","",null,null,"","","",null,null,"","","",null,null,"","","",null,null,"","","",null,null,""]
[null,null,null,"","",null,null,"","","",null,null,"","","",null,null,"","","",null,null,"","","",null,null,""]
[null,null,null,"","",null,null,"","","",null,null,"","","",null,null,"","","",null,null,"","","",null,null,""]
[null,null,null,"","",null,null,"","","",null,null,"","","",null,null,"","","",null,null,"","","",null,null,""]
[]
[null,{"$f":"CONCATENATE(\"Rural use of drinking water sources, \",C299,\"–\",C300)","v":"Rural use of drinking water sources, 2000–2018"},null,null,null,null,null,null,null,null,null,null,null,null,null,null,null,null,"Data points used for regression"]

{"sheet":"Sanitation","index":2,"n_rows":318,"n_cols":28,"rows_kept":318,"cut":false,"hidden":false,"merged":[[30,21,30,24],[4,1,4,24],[3,1,3,24],[6,1,6,8],[6,9,6,16],[6,17,6,24],[30,1,31,4],[30,5,30,8],[30,9,30,12],[30,13,30,16],[30,17,30,20],[96,23,96,27],[32,1,33,2],[32,3,33,3],[35,1,36,2],[35,3,36,3],[38,1,39,2],[38,3,39,3],[96,0,97,2],[96,3,96,7],[96,8,96,12],[96,13,96,17],[96,18,96,22],[98,0,99,1],[100,0,101,1],[117,18,117,22],[196,0,197,2],[196,3,196,7],[196,8,196,12],[196,13,196,17],[196,18,196,22],[117,1,117,11],[298,0,299,1],[300,0,301,1],[317,18,317,22],[196,23,196,27],[198,0,199,1],[200,0,201,1],[217,18,217,22],[296,0,297,2],[296,3,296,7],[296,8,296,12],[296,13,296,17],[296,18,296,22],[296,23,296,27],[217,1,217,11],[317,1,317,11]]}
[]
[]
[]
[null,"Summary of trends in use of sanitation facilities by wealth quintile (%)"]
[null,{"$f":"IF(ISERROR(INDIRECT(CONCATENATE($B105,\"!A2\"))),\"\",INDIRECT(CONCATENATE($B105,\"!A2\")))","v":"Saint Lucia"}]
[]
[null,{"$f":"B118","v":"National use of sanitation facilities, 2000–2018"},null,null,null,null,null,null,null,{"$f":"B218","v":"Urban use of sanitation facilities, 2000–2018"},null,null,null,null,null,null,null,{"$f":"B318","v":"Rural use of sanitation facilities, 2000–2018"}]
[]
[]
[]
[]
[]
[]
[]
[]
[]
[]
[]
[]
[]
[]
[]
[]
[]
[]
[]
[]
[]
[]
[]
[null,{"$f":"IF(ISERROR(INDIRECT(CONCATENATE($B105,\"!A2\"))),\"\",INDIRECT(CONCATENATE($B105,\"!A2\")))","v":"Saint Lucia"},null,null,null,"Poorest",null,null,null,"Poor",null,null,null,"Middle",null,null,null,"Rich",null,null,null,"Richest"]
[null,null,null,null,null,"Basic","Limited","Unimproved","Open defecation","Basic","Limited","Unimproved","Open defecation","Basic","Limited","Unimproved","Open defecation","Basic","Limited","Unimproved","Open defecation","Basic","Limited","Unimproved","Open defecation"]
[null,"NATIONAL",null,"Estimate",{"$f":"C99","v":2000},{"$f":"E99","v":50.621845108630666},{"$f":"F99","v":14.185310813123538},1.853157515222847,33.339686563022951,{"$f":"J99","v":75.672003650433837},{"$f":"K99","v":10.163824892140907},3.7373520325304526,10.426819424894802,{"$f":"O99","v":88.613307698059472},{"$f":"P99","v":4.0844838361889151},1.0714285714286689,6.23077989432295,{"$f":"T99","v":92.34338569137303},{"$f":"U99","v":2.3437453593944295},1.0625737898464962,4.2502951593860416,{"$f":"Y99","v":98.963702085218088},{"$f":"Z99","v":1.0362979147818974},0,0]
[null,null,null,null,{"$f":"C100","v":2018},{"$f":"E100","v":76.511103532796284},21.440028152643293,0.82745784816142987,1.2214104663989929,{"$f":"J100","v":88.158994833841874},11.841005166158126,0,0,{"$f":"O100","v":95.593763596104822},4.4062364038951785,0,0,{"$f":"T100","v":97.524747731412603},2.4752522685873828,0,0,{"$f":"Y100","v":98.963702085218117},1.0362979147818978,0,0]
[]
[null,"URBAN",null,"Estimate",{"$f":"C199","v":2000},{"$f":"E199","v":42.596227143983626},{"$f":"F199","v":16.898620762430561},5.218761317980352,35.286390775605469,{"$f":"J199","v":80.111040043803897},{"$f":"K199","v":8.0875250256902298},5.3878492655751984,6.4135856649306788,{"$f":"O199","v":88.400420142167661},{"$f":"P199","v":6.0783330146821388},0,5.5212468431502195,{"$f":"T199","v":95.443082918216575},{"$f":"U199","v":4.5569170817834541},0,0,{"$f":"Y199","v":97.90955350601061},{"$f":"Z199","v":2.0904464939893899},0,0]
[null,null,null,null,{"$f":"C200","v":2018},{"$f":"E200","v":61.461735978728413},24.382877013835763,2.7060502595650178,11.449336747870802,{"$f":"J200","v":80.977928032612141},8.1750407825712212,1.3360736537490823,9.5109575310675609,{"$f":"O200","v":90.948296475876433},6.2535226892515938,2.1829207216433701,0.61526011322860086,{"$f":"T200","v":95.443082918216533},4.5569170817834523,0,0,{"$f":"Y200","v":97.90955350601061},2.0904464939893899,0,0]
[]
[null,"RURAL",null,"Estimate",{"$f":"C299","v":2000},{"$f":"E299","v":50.127403148324014},{"$f":"F299","v":12.763651972160444},1.5242721042695848,35.584672775245963,{"$f":"J299","v":80.572324820611968},{"$f":"K299","v":12.006722565838189},0.92997854996110618,6.4909740635887374,{"$f":"O299","v":89.024407935555899},{"$f":"P299","v":2.7338338226859586},1.6483516483515501,6.5934065934065984,{"$f":"T299","v":89.209659638091509},{"$f":"U299","v":2.4415462988286767},1.6697588126159957,6.6790352504638122,{"$f":"Y299","v":97.56157794184665},{"$f":"Z299","v":0.76866324553739351},0,1.669758812615953]
[null,null,null,null,{"$f":"C300","v":2018},{"$f":"E300","v":79.705139391113264},20.294860608886736,0,0,{"$f":"J300","v":87.030842393831449},12.969157606168551,0,0,{"$f":"O300","v":97.020612241144647},2.9793877588553528,0,0,{"$f":"T300","v":97.336045637512839},2.6639543624871607,0,0,{"$f":"Y300","v":99.218283982368575},0.78171601763142462,0,0]
[]
[]
[]
[]
[]
[]
[]
[]
[]
[]
[]
[]
[]
[]
[]
[]
[]
[]
[]
[]
[]
[]
[]
[]
[]
[]
[]
[]
[]
[]
[]
[]
[]
[]
[]
[]
[]
[]
[]
[]
[]
[]
[]
[]
[]
[]
[]
[]
[]
[]
[]
[]
[]
[]
[]
[]
["NATIONAL",null,null,"Poorest",null,null,null,null,"Poor",null,null,null,null,"Middle",null,null,null,null,"Rich",null,null,null,null,"Richest"]
[null,null,null,"Improved","Basic","Limited","Unimproved","Open defecation","Improved","Basic","Limited","Unimproved","Open defecation","Improved","Basic","Limited","Unimproved","Open defecation","Improved","Basic","Limited","Unimproved","Open defecation","Improved","Basic","Limited","Unimproved","Open defecation"]
["Forecast period:",null,2000,{"$f":"IF((D101+H101)>100,D101*100/(D101+H101),D101)","v":64.807155921754202},{"$f":"D99*AVERAGEIF(E105:E116,\">0\")/100","v":50.621845108630666},{"$f":"D99*(100-AVERAGEIF(E105:E116,\">0\"))/100","v":14.185310813123538},{"$f":"100-(E99+F99+H99)","v":1.853157515222847},{"$f":"IF((D101+H101)>100,H101*100/(D101+H101),H101)","v":33.339686563022951},{"$f":"IF((I101+M101)>100,I101*100/(I101+M101),I101)","v":85.835828542574745},{"$f":"I99*AVERAGEIF(J105:J116,\">0\")/100","v":75.672003650433837},{"$f":"I99*(100-AVERAGEIF(J105:J116,\">0\"))/100","v":10.163824892140907},{"$f":"100-(J99+K99+M99)","v":3.7373520325304526},{"$f":"IF((I101+M101)>100,M101*100/(I101+M101),M101)","v":10.426819424894802},{"$f":"IF((N101+R101)>100,N101*100/(N101+R101),N101)","v":92.697791534248381},{"$f":"N99*AVERAGEIF(O105:O116,\">0\")/100","v":88.613307698059472},{"$f":"N99*(100-AVERAGEIF(O105:O116,\">0\"))/100","v":4.0844838361889151},{"$f":"100-(O99+P99+R99)","v":1.0714285714286689},{"$f":"IF((N101+R101)>100,R101*100/(N101+R101),R101)","v":6.23077989432295},{"$f":"IF((S101+W101)>100,S101*100/(S101+W101),S101)","v":94.687131050767448},{"$f":"S99*AVERAGEIF(T105:T116,\">0\")/100","v":92.34338569137303},{"$f":"S99*(100-AVERAGEIF(T105:T116,\">0\"))/100","v":2.3437453593944295},{"$f":"100-(T99+U99+W99)","v":1.0625737898464962},{"$f":"IF((S101+W101)>100,W101*100/(S101+W101),W101)","v":4.2502951593860416},{"$f":"IF((X101+AB101)>100,X101*100/(X101+AB101),X101)","v":99.999999999999986},{"$f":"X99*AVERAGEIF(Y105:Y116,\">0\")/100","v":98.963702085218088},{"$f":"X99*(100-AVERAGEIF(Y105:Y116,\">0\"))/100","v":1.0362979147818974},{"$f":"100-(Y99+Z99+AB99)","v":0},{"$f":"IF((X101+AB101)>100,AB101*100/(X101+AB101),AB101)","v":0}]
[null,null,2018,{"$f":"IF((D102+H102)>100,D102*100/(D102+H102),D102)","v":97.951131685439577},{"$f":"D100*AVERAGEIF(E105:E116,\">0\")/100","v":76.511103532796284},{"$f":"D100*(100-AVERAGEIF(E105:E116,\">0\"))/100","v":21.440028152643293},{"$f":"100-(E100+F100+H100)","v":0.82745784816142987},{"$f":"IF((D102+H102)>100,H102*100/(D102+H102),H102)","v":1.2214104663989929},{"$f":"IF((I102+M102)>100,I102*100/(I102+M102),I102)","v":100},{"$f":"I100*AVERAGEIF(J105:J116,\">0\")/100","v":88.158994833841874},{"$f":"I100*(100-AVERAGEIF(J105:J116,\">0\"))/100","v":11.841005166158126},{"$f":"100-(J100+K100+M100)","v":0},{"$f":"IF((I102+M102)>100,M102*100/(I102+M102),M102)","v":0},{"$f":"IF((N102+R102)>100,N102*100/(N102+R102),N102)","v":100},{"$f":"N100*AVERAGEIF(O105:O116,\">0\")/100","v":95.593763596104822},{"$f":"N100*(100-AVERAGEIF(O105:O116,\">0\"))/100","v":4.4062364038951785},{"$f":"100-(O100+P100+R100)","v":0},{"$f":"IF((N102+R102)>100,R102*100/(N102+R102),R102)","v":0},{"$f":"IF((S102+W102)>100,S102*100/(S102+W102),S102)","v":100},{"$f":"S100*AVERAGEIF(T105:T116,\">0\")/100","v":97.524747731412603},{"$f":"S100*(100-AVERAGEIF(T105:T116,\">0\"))/100","v":2.4752522685873828},{"$f":"100-(T100+U100+W100)","v":0},{"$f":"IF((S102+W102)>100,W102*100/(S102+W102),W102)","v":0},{"$f":"IF((X102+AB102)>100,X102*100/(X102+AB102),X102)","v":100.00000000000001},{"$f":"X100*AVERAGEIF(Y105:Y116,\">0\")/100","v":98.963702085218117},{"$f":"X100*(100-AVERAGEIF(Y105:Y116,\">0\"))/100","v":1.0362979147818978},{"$f":"100-(Y100+Z100+AB100)","v":0},{"$f":"IF((X102+AB102)>100,AB102*100/(X102+AB102),AB102)","v":0}]
["Regression period:",null,{"$f":"MinRegYear(C99,C105:C116)","v":2003},{"$f":"IF(MAX(C105:C116)-MIN(C105:C116)<5,AVERAGEIF(C105:C116,\">0\",D105:D116),\nIF(FORECAST($C101,D$105:D$116,$C$105:$C$116)<0,0,\nIF(FORECAST($C101,D$105:D$116,$C$105:$C$116)>100,100,\nFORECAST($C101,D$105:D$116,$C$105:$C$116))))","v":64.807155921754202},null,null,null,{"$f":"IF(MAX(C105:C116)-MIN(C105:C116)<5,AVERAGEIF(C105:C116,\">0\",H105:H116),\nIF(FORECAST($C101,H$105:H$116,$C$105:$C$116)<0,0,\nIF(FORECAST($C101,H$105:H$116,$C$105:$C$116)>100,100,\nFORECAST($C101,H$105:H$116,$C$105:$C$116))))","v":33.339686563022951},{"$f":"IF(MAX(C105:C116)-MIN(C105:C116)<5,AVERAGEIF(C105:C116,\">0\",I105:I116),\nIF(FORECAST($C101,I$105:I$116,$C$105:$C$116)<0,0,\nIF(FORECAST($C101,I$105:I$116,$C$105:$C$116)>100,100,\nFORECAST($C101,I$105:I$116,$C$105:$C$116))))","v":85.835828542574745},null,null,null,{"$f":"IF(MAX(C105:C116)-MIN(C105:C116)<5,AVERAGEIF(C105:C116,\">0\",M105:M116),\nIF(FORECAST($C101,M$105:M$116,$C$105:$C$116)<0,0,\nIF(FORECAST($C101,M$105:M$116,$C$105:$C$116)>100,100,\nFORECAST($C101,M$105:M$116,$C$105:$C$116))))","v":10.426819424894802},{"$f":"IF(MAX(C105:C116)-MIN(C105:C116)<5,AVERAGEIF(C105:C116,\">0\",N105:N116),\nIF(FORECAST($C101,N$105:N$116,$C$105:$C$116)<0,0,\nIF(FORECAST($C101,N$105:N$116,$C$105:$C$116)>100,100,\nFORECAST($C101,N$105:N$116,$C$105:$C$116))))","v":92.697791534248381},null,null,null,{"$f":"IF(MAX(C105:C116)-MIN(C105:C116)<5,AVERAGEIF(C105:C116,\">0\",R105:R116),\nIF(FORECAST($C101,R$105:R$116,$C$105:$C$116)<0,0,\nIF(FORECAST($C101,R$105:R$116,$C$105:$C$116)>100,100,\nFORECAST($C101,R$105:R$116,$C$105:$C$116))))","v":6.23077989432295},{"$f":"IF(MAX(C105:C116)-MIN(C105:C116)<5,AVERAGEIF(C105:C116,\">0\",S105:S116),\nIF(FORECAST($C101,S$105:S$116,$C$105:$C$116)<0,0,\nIF(FORECAST($C101,S$105:S$116,$C$105:$C$116)>100,100,\nFORECAST($C101,S$105:S$116,$C$105:$C$116))))","v":94.687131050767448},null,null,null,{"$f":"IF(MAX(C105:C116)-MIN(C105:C116)<5,AVERAGEIF(C105:C116,\">0\",W105:W116),\nIF(FORECAST($C101,W$105:W$116,$C$105:$C$116)<0,0,\nIF(FORECAST($C101,W$105:W$116,$C$105:$C$116)>100,100,\nFORECAST($C101,W$105:W$116,$C$105:$C$116))))","v":4.2502951593860416},{"$f":"IF(MAX(C105:C116)-MIN(C105:C116)<5,AVERAGEIF(C105:C116,\">0\",X105:X116),\nIF(FORECAST($C101,X$105:X$116,$C$105:$C$116)<0,0,\nIF(FORECAST($C101,X$105:X$116,$C$105:$C$116)>100,100,\nFORECAST($C101,X$105:X$116,$C$105:$C$116))))","v":99.999999999999986},null,null,null,{"$f":"IF(MAX(C105:C116)-MIN(C105:C116)<5,AVERAGEIF(C105:C116,\">0\",AB105:AB116),\nIF(FORECAST($C101,AB$105:AB$116,$C$105:$C$116)<0,0,\nIF(FORECAST($C101,AB$105:AB$116,$C$105:$C$116)>100,100,\nFORECAST($C101,AB$105:AB$116,$C$105:$C$116))))","v":0}]
[null,null,{"$f":"MaxRegYear(C100,C105:C116)","v":2014},{"$f":"IF(MAX(C105:C116)-MIN(C105:C116)<5,AVERAGEIF(C105:C116,\">0\",D105:D116),\nIF(FORECAST($C102,D$105:D$116,$C$105:$C$116)<0,0,\nIF(FORECAST($C102,D$105:D$116,$C$105:$C$116)>100,100,\nFORECAST($C102,D$105:D$116,$C$105:$C$116))))","v":97.951131685439577},null,null,null,{"$f":"IF(MAX(C105:C116)-MIN(C105:C116)<5,AVERAGEIF(C105:C116,\">0\",H105:H116),\nIF(FORECAST($C102,H$105:H$116,$C$105:$C$116)<0,0,\nIF(FORECAST($C102,H$105:H$116,$C$105:$C$116)>100,100,\nFORECAST($C102,H$105:H$116,$C$105:$C$116))))","v":1.2214104663989929},{"$f":"IF(MAX(C105:C116)-MIN(C105:C116)<5,AVERAGEIF(C105:C116,\">0\",I105:I116),\nIF(FORECAST($C102,I$105:I$116,$C$105:$C$116)<0,0,\nIF(FORECAST($C102,I$105:I$116,$C$105:$C$116)>100,100,\nFORECAST($C102,I$105:I$116,$C$105:$C$116))))","v":100},null,null,null,{"$f":"IF(MAX(C105:C116)-MIN(C105:C116)<5,AVERAGEIF(C105:C116,\">0\",M105:M116),\nIF(FORECAST($C102,M$105:M$116,$C$105:$C$116)<0,0,\nIF(FORECAST($C102,M$105:M$116,$C$105:$C$116)>100,100,\nFORECAST($C102,M$105:M$116,$C$105:$C$116))))","v":0},{"$f":"IF(MAX(C105:C116)-MIN(C105:C116)<5,AVERAGEIF(C105:C116,\">0\",N105:N116),\nIF(FORECAST($C102,N$105:N$116,$C$105:$C$116)<0,0,\nIF(FORECAST($C102,N$105:N$116,$C$105:$C$116)>100,100,\nFORECAST($C102,N$105:N$116,$C$105:$C$116))))","v":100},null,null,null,{"$f":"IF(MAX(C105:C116)-MIN(C105:C116)<5,AVERAGEIF(C105:C116,\">0\",R105:R116),\nIF(FORECAST($C102,R$105:R$116,$C$105:$C$116)<0,0,\nIF(FORECAST($C102,R$105:R$116,$C$105:$C$116)>100,100,\nFORECAST($C102,R$105:R$116,$C$105:$C$116))))","v":0},{"$f":"IF(MAX(C105:C116)-MIN(C105:C116)<5,AVERAGEIF(C105:C116,\">0\",S105:S116),\nIF(FORECAST($C102,S$105:S$116,$C$105:$C$116)<0,0,\nIF(FORECAST($C102,S$105:S$116,$C$105:$C$116)>100,100,\nFORECAST($C102,S$105:S$116,$C$105:$C$116))))","v":100},null,null,null,{"$f":"IF(MAX(C105:C116)-MIN(C105:C116)<5,AVERAGEIF(C105:C116,\">0\",W105:W116),\nIF(FORECAST($C102,W$105:W$116,$C$105:$C$116)<0,0,\nIF(FORECAST($C102,W$105:W$116,$C$105:$C$116)>100,100,\nFORECAST($C102,W$105:W$116,$C$105:$C$116))))","v":0},{"$f":"IF(MAX(C105:C116)-MIN(C105:C116)<5,AVERAGEIF(C105:C116,\">0\",X105:X116),\nIF(FORECAST($C102,X$105:X$116,$C$105:$C$116)<0,0,\nIF(FORECAST($C102,X$105:X$116,$C$105:$C$116)>100,100,\nFORECAST($C102,X$105:X$116,$C$105:$C$116))))","v":100.00000000000001},null,null,null,{"$f":"IF(MAX(C105:C116)-MIN(C105:C116)<5,AVERAGEIF(C105:C116,\">0\",AB105:AB116),\nIF(FORECAST($C102,AB$105:AB$116,$C$105:$C$116)<0,0,\nIF(FORECAST($C102,AB$105:AB$116,$C$105:$C$116)>100,100,\nFORECAST($C102,AB$105:AB$116,$C$105:$C$116))))","v":0}]
[]
[null,"Survey","Year","Improved","Not shared",null,null,"Open defecation","Improved","Not shared",null,null,"Open defecation","Improved","Not shared",null,null,"Open defecation","Improved","Not shared",null,null,"Open defecation","Improved","Not shared",null,null,"Open defecation"]
[null,"SLC05",2005,{"$f":"IF(ISERROR(INDIRECT(CONCATENATE($B105,\"!C122\"))),\"\",INDIRECT(CONCATENATE($B105,\"!C122\")))","v":70.833333333333329},{"$f":"IF(ISERROR(INDIRECT(CONCATENATE($B105,\"!C129\"))),\"\",INDIRECT(CONCATENATE($B105,\"!C129\")))","v":"N/A"},null,null,{"$f":"IF(ISERROR(INDIRECT(CONCATENATE($B105,\"!C127\"))),\"\",INDIRECT(CONCATENATE($B105,\"!C127\")))","v":27.500000000000004},{"$f":"IF(ISERROR(INDIRECT(CONCATENATE($B105,\"!D122\"))),\"\",INDIRECT(CONCATENATE($B105,\"!D122\")))","v":88.539795719085447},{"$f":"IF(ISERROR(INDIRECT(CONCATENATE($B105,\"!D129\"))),\"\",INDIRECT(CONCATENATE($B105,\"!D129\")))","v":"N/A"},null,null,{"$f":"IF(ISERROR(INDIRECT(CONCATENATE($B105,\"!D127\"))),\"\",INDIRECT(CONCATENATE($B105,\"!D127\")))","v":8.3333333333333321},{"$f":"IF(ISERROR(INDIRECT(CONCATENATE($B105,\"!E122\"))),\"\",INDIRECT(CONCATENATE($B105,\"!E122\")))","v":94.166666666666657},{"$f":"IF(ISERROR(INDIRECT(CONCATENATE($B105,\"!E129\"))),\"\",INDIRECT(CONCATENATE($B105,\"!E129\")))","v":"N/A"},null,null,{"$f":"IF(ISERROR(INDIRECT(CONCATENATE($B105,\"!E127\"))),\"\",INDIRECT(CONCATENATE($B105,\"!E127\")))","v":5},{"$f":"IF(ISERROR(INDIRECT(CONCATENATE($B105,\"!F122\"))),\"\",INDIRECT(CONCATENATE($B105,\"!F122\")))","v":95.867768595041326},{"$f":"IF(ISERROR(INDIRECT(CONCATENATE($B105,\"!F129\"))),\"\",INDIRECT(CONCATENATE($B105,\"!F129\")))","v":"N/A"},null,null,{"$f":"IF(ISERROR(INDIRECT(CONCATENATE($B105,\"!F127\"))),\"\",INDIRECT(CONCATENATE($B105,\"!F127\")))","v":3.3057851239669422},{"$f":"IF(ISERROR(INDIRECT(CONCATENATE($B105,\"!G122\"))),\"\",INDIRECT(CONCATENATE($B105,\"!G122\")))","v":99.999999999999986},{"$f":"IF(ISERROR(INDIRECT(CONCATENATE($B105,\"!G129\"))),\"\",INDIRECT(CONCATENATE($B105,\"!G129\")))","v":"N/A"},null,null,{"$f":"IF(ISERROR(INDIRECT(CONCATENATE($B105,\"!G2127\"))),\"\",INDIRECT(CONCATENATE($B105,\"!G127\")))","v":0}]
[null,"MICS12",2012,91.924954273860692,78.111505417317858,null,null,7.061097029421175,98.003680836872448,88.158994833841874,null,null,1.0061320128676297,99.307729630130623,95.593763596104822,null,null,0.69227036986935642,100,97.524747731412617,null,null,0,100,98.963702085218102,null,null,0]
[null,null,null,"","",null,null,"","","",null,null,"","","",null,null,"","","",null,null,"","","",null,null,""]
[null,null,null,"","",null,null,"","","",null,null,"","","",null,null,"","","",null,null,"","","",null,null,""]
[null,null,null,"","",null,null,"","","",null,null,"","","",null,null,"","","",null,null,"","","",null,null,""]
[null,null,null,"","",null,null,"","","",null,null,"","","",null,null,"","","",null,null,"","","",null,null,""]
[null,null,null,"","",null,null,"","","",null,null,"","","",null,null,"","","",null,null,"","","",null,null,""]
[null,null,null,"","",null,null,"","","",null,null,"","","",null,null,"","","",null,null,"","","",null,null,""]
[null,null,null,"","",null,null,"","","",null,null,"","","",null,null,"","","",null,null,"","","",null,null,""]
[null,null,null,"","",null,null,"","","",null,null,"","","",null,null,"","","",null,null,"","","",null,null,""]
[null,null,null,"","",null,null,"","","",null,null,"","","",null,null,"","","",null,null,"","","",null,null,""]
[null,null,null,"","",null,null,"","","",null,null,"","","",null,null,"","","",null,null,"","","",null,null,""]
[]
[null,{"$f":"CONCATENATE(\"National use of sanitation facilities, \",C99,\"–\",C100)","v":"National use of sanitation facilities, 2000–2018"},null,null,null,null,null,null,null,null,null,null,null,null,null,null,null,null,"Data points used for regression"]
[]
[]
[]
[]
[]
[]
[]
[]
[]
[]
[]
[]
[]
[]
[]
[]
[]
[]
[]
[]
[]
[]
[]
[]
[]
[]
[]
[]
[]
[]
[]
[]
[]
[]
[]
[]
[]
[]
[]
[]
[]
[]
[]
[]
[]
[]
[]
[]
[]
[]
[]
[]
[]
[]
[]
[]
[]
[]
[]
[]
[]
[]
[]
[]
[]
[]
[]
[]
[]
[]
[]
[]
[]
[]
[]
[]
[]
[]
["URBAN",null,null,"Poorest",null,null,null,null,"Poor",null,null,null,null,"Middle",null,null,null,null,"Rich",null,null,null,null,"Richest"]
[null,null,null,"Improved","Basic","Limited","Unimproved","Open defecation","Improved","Basic","Limited","Unimproved","Open defecation","Improved","Basic","Limited","Unimproved","Open defecation","Improved","Basic","Limited","Unimproved","Open defecation","Improved","Basic","Limited","Unimproved","Open defecation"]
["Forecast period:",null,{"$f":"MinBase(C205:C216)","v":2000},{"$f":"IF((D201+H201)>100,D201*100/(D201+H201),D201)","v":59.494847906414179},{"$f":"D199*AVERAGEIF(E205:E216,\">0\")/100","v":42.596227143983626},{"$f":"D199*(100-AVERAGEIF(E205:E216,\">0\"))/100","v":16.898620762430561},{"$f":"100-(E199+F199+H199)","v":5.218761317980352},{"$f":"IF((D201+H201)>100,H201*100/(D201+H201),H201)","v":35.286390775605469},{"$f":"IF((I201+M201)>100,I201*100/(I201+M201),I201)","v":88.198565069494123},{"$f":"I199*AVERAGEIF(J205:J216,\">0\")/100","v":80.111040043803897},{"$f":"I199*(100-AVERAGEIF(J205:J216,\">0\"))/100","v":8.0875250256902298},{"$f":"100-(J199+K199+M199)","v":5.3878492655751984},{"$f":"IF((I201+M201)>100,M201*100/(I201+M201),M201)","v":6.4135856649306788},{"$f":"IF((N201+R201)>100,N201*100/(N201+R201),N201)","v":94.478753156849791},{"$f":"N199*AVERAGEIF(O205:O216,\">0\")/100","v":88.400420142167661},{"$f":"N199*(100-AVERAGEIF(O205:O216,\">0\"))/100","v":6.0783330146821388},{"$f":"100-(O199+P199+R199)","v":0},{"$f":"IF((N201+R201)>100,R201*100/(N201+R201),R201)","v":5.5212468431502195},{"$f":"IF((S201+W201)>100,S201*100/(S201+W201),S201)","v":100.00000000000001},{"$f":"S199*AVERAGEIF(T205:T216,\">0\")/100","v":95.443082918216575},{"$f":"S199*(100-AVERAGEIF(T205:T216,\">0\"))/100","v":4.5569170817834541},{"$f":"100-(T199+U199+W199)","v":0},{"$f":"IF((S201+W201)>100,W201*100/(S201+W201),W201)","v":0},{"$f":"IF((X201+AB201)>100,X201*100/(X201+AB201),X201)","v":100},{"$f":"X199*AVERAGEIF(Y205:Y216,\">0\")/100","v":97.90955350601061},{"$f":"X199*(100-AVERAGEIF(Y205:Y216,\">0\"))/100","v":2.0904464939893899},{"$f":"100-(Y199+Z199+AB199)","v":0},{"$f":"IF((X201+AB201)>100,AB201*100/(X201+AB201),AB201)","v":0}]
[null,null,{"$f":"MaxTarget(C205:C216)","v":2018},{"$f":"IF((D202+H202)>100,D202*100/(D202+H202),D202)","v":85.84461299256418},{"$f":"D200*AVERAGEIF(E205:E216,\">0\")/100","v":61.461735978728413},{"$f":"D200*(100-AVERAGEIF(E205:E216,\">0\"))/100","v":24.382877013835763},{"$f":"100-(E200+F200+H200)","v":2.7060502595650178},{"$f":"IF((D202+H202)>100,H202*100/(D202+H202),H202)","v":11.449336747870802},{"$f":"IF((I202+M202)>100,I202*100/(I202+M202),I202)","v":89.152968815183357},{"$f":"I200*AVERAGEIF(J205:J216,\">0\")/100","v":80.977928032612141},{"$f":"I200*(100-AVERAGEIF(J205:J216,\">0\"))/100","v":8.1750407825712212},{"$f":"100-(J200+K200+M200)","v":1.3360736537490823},{"$f":"IF((I202+M202)>100,M202*100/(I202+M202),M202)","v":9.5109575310675609},{"$f":"IF((N202+R202)>100,N202*100/(N202+R202),N202)","v":97.201819165128029},{"$f":"N200*AVERAGEIF(O205:O216,\">0\")/100","v":90.948296475876433},{"$f":"N200*(100-AVERAGEIF(O205:O216,\">0\"))/100","v":6.2535226892515938},{"$f":"100-(O200+P200+R200)","v":2.1829207216433701},{"$f":"IF((N202+R202)>100,R202*100/(N202+R202),R202)","v":0.61526011322860086},{"$f":"IF((S202+W202)>100,S202*100/(S202+W202),S202)","v":99.999999999999986},{"$f":"S200*AVERAGEIF(T205:T216,\">0\")/100","v":95.443082918216533},{"$f":"S200*(100-AVERAGEIF(T205:T216,\">0\"))/100","v":4.5569170817834523},{"$f":"100-(T200+U200+W200)","v":0},{"$f":"IF((S202+W202)>100,W202*100/(S202+W202),W202)","v":0},{"$f":"IF((X202+AB202)>100,X202*100/(X202+AB202),X202)","v":100},{"$f":"X200*AVERAGEIF(Y205:Y216,\">0\")/100","v":97.90955350601061},{"$f":"X200*(100-AVERAGEIF(Y205:Y216,\">0\"))/100","v":2.0904464939893899},{"$f":"100-(Y200+Z200+AB200)","v":0},{"$f":"IF((X202+AB202)>100,AB202*100/(X202+AB202),AB202)","v":0}]
["Regression period:",null,{"$f":"MinRegYear(C199,C205:C216)","v":2003},{"$f":"IF(MAX(C205:C216)-MIN(C205:C216)<5,AVERAGEIF(C205:C216,\">0\",D205:D216),\nIF(FORECAST($C201,D$205:D$216,$C$205:$C$216)<0,0,\nIF(FORECAST($C201,D$205:D$216,$C$205:$C$216)>100,100,\nFORECAST($C201,D$205:D$216,$C$205:$C$216))))","v":59.494847906414179},null,null,null,{"$f":"IF(MAX(C205:C216)-MIN(C205:C216)<5,AVERAGEIF(C205:C216,\">0\",H205:H216),\nIF(FORECAST($C201,H$205:H$216,$C$205:$C$216)<0,0,\nIF(FORECAST($C201,H$205:H$216,$C$205:$C$216)>100,100,\nFORECAST($C201,H$205:H$216,$C$205:$C$216))))","v":35.286390775605469},{"$f":"IF(MAX(C205:C216)-MIN(C205:C216)<5,AVERAGEIF(C205:C216,\">0\",I205:I216),\nIF(FORECAST($C201,I$205:I$216,$C$205:$C$216)<0,0,\nIF(FORECAST($C201,I$205:I$216,$C$205:$C$216)>100,100,\nFORECAST($C201,I$205:I$216,$C$205:$C$216))))","v":88.198565069494123},null,null,null,{"$f":"IF(MAX(C205:C216)-MIN(C205:C216)<5,AVERAGEIF(C205:C216,\">0\",M205:M216),\nIF(FORECAST($C201,M$205:M$216,$C$205:$C$216)<0,0,\nIF(FORECAST($C201,M$205:M$216,$C$205:$C$216)>100,100,\nFORECAST($C201,M$205:M$216,$C$205:$C$216))))","v":6.4135856649306788},{"$f":"IF(MAX(C205:C216)-MIN(C205:C216)<5,AVERAGEIF(C205:C216,\">0\",N205:N216),\nIF(FORECAST($C201,N$205:N$216,$C$205:$C$216)<0,0,\nIF(FORECAST($C201,N$205:N$216,$C$205:$C$216)>100,100,\nFORECAST($C201,N$205:N$216,$C$205:$C$216))))","v":94.937063441341138},null,null,null,{"$f":"IF(MAX(C205:C216)-MIN(C205:C216)<5,AVERAGEIF(C205:C216,\">0\",R205:R216),\nIF(FORECAST($C201,R$205:R$216,$C$205:$C$216)<0,0,\nIF(FORECAST($C201,R$205:R$216,$C$205:$C$216)>100,100,\nFORECAST($C201,R$205:R$216,$C$205:$C$216))))","v":5.548030052357376},{"$f":"IF(MAX(C205:C216)-MIN(C205:C216)<5,AVERAGEIF(C205:C216,\">0\",S205:S216),\nIF(FORECAST($C201,S$205:S$216,$C$205:$C$216)<0,0,\nIF(FORECAST($C201,S$205:S$216,$C$205:$C$216)>100,100,\nFORECAST($C201,S$205:S$216,$C$205:$C$216))))","v":100.00000000000001},null,null,null,{"$f":"IF(MAX(C205:C216)-MIN(C205:C216)<5,AVERAGEIF(C205:C216,\">0\",W205:W216),\nIF(FORECAST($C201,W$205:W$216,$C$205:$C$216)<0,0,\nIF(FORECAST($C201,W$205:W$216,$C$205:$C$216)>100,100,\nFORECAST($C201,W$205:W$216,$C$205:$C$216))))","v":0},{"$f":"IF(MAX(C205:C216)-MIN(C205:C216)<5,AVERAGEIF(C205:C216,\">0\",X205:X216),\nIF(FORECAST($C201,X$205:X$216,$C$205:$C$216)<0,0,\nIF(FORECAST($C201,X$205:X$216,$C$205:$C$216)>100,100,\nFORECAST($C201,X$205:X$216,$C$205:$C$216))))","v":100},null,null,null,{"$f":"IF(MAX(C205:C216)-MIN(C205:C216)<5,AVERAGEIF(C205:C216,\">0\",AB205:AB216),\nIF(FORECAST($C201,AB$205:AB$216,$C$205:$C$216)<0,0,\nIF(FORECAST($C201,AB$205:AB$216,$C$205:$C$216)>100,100,\nFORECAST($C201,AB$205:AB$216,$C$205:$C$216))))","v":0}]
[null,null,{"$f":"MaxRegYear(C200,C205:C216)","v":2014},{"$f":"IF(MAX(C205:C216)-MIN(C205:C216)<5,AVERAGEIF(C205:C216,\">0\",D205:D216),\nIF(FORECAST($C202,D$205:D$216,$C$205:$C$216)<0,0,\nIF(FORECAST($C202,D$205:D$216,$C$205:$C$216)>100,100,\nFORECAST($C202,D$205:D$216,$C$205:$C$216))))","v":85.84461299256418},null,null,null,{"$f":"IF(MAX(C205:C216)-MIN(C205:C216)<5,AVERAGEIF(C205:C216,\">0\",H205:H216),\nIF(FORECAST($C202,H$205:H$216,$C$205:$C$216)<0,0,\nIF(FORECAST($C202,H$205:H$216,$C$205:$C$216)>100,100,\nFORECAST($C202,H$205:H$216,$C$205:$C$216))))","v":11.449336747870802},{"$f":"IF(MAX(C205:C216)-MIN(C205:C216)<5,AVERAGEIF(C205:C216,\">0\",I205:I216),\nIF(FORECAST($C202,I$205:I$216,$C$205:$C$216)<0,0,\nIF(FORECAST($C202,I$205:I$216,$C$205:$C$216)>100,100,\nFORECAST($C202,I$205:I$216,$C$205:$C$216))))","v":89.152968815183357},null,null,null,{"$f":"IF(MAX(C205:C216)-MIN(C205:C216)<5,AVERAGEIF(C205:C216,\">0\",M205:M216),\nIF(FORECAST($C202,M$205:M$216,$C$205:$C$216)<0,0,\nIF(FORECAST($C202,M$205:M$216,$C$205:$C$216)>100,100,\nFORECAST($C202,M$205:M$216,$C$205:$C$216))))","v":9.5109575310675609},{"$f":"IF(MAX(C205:C216)-MIN(C205:C216)<5,AVERAGEIF(C205:C216,\">0\",N205:N216),\nIF(FORECAST($C202,N$205:N$216,$C$205:$C$216)<0,0,\nIF(FORECAST($C202,N$205:N$216,$C$205:$C$216)>100,100,\nFORECAST($C202,N$205:N$216,$C$205:$C$216))))","v":97.201819165128029},null,null,null,{"$f":"IF(MAX(C205:C216)-MIN(C205:C216)<5,AVERAGEIF(C205:C216,\">0\",R205:R216),\nIF(FORECAST($C202,R$205:R$216,$C$205:$C$216)<0,0,\nIF(FORECAST($C202,R$205:R$216,$C$205:$C$216)>100,100,\nFORECAST($C202,R$205:R$216,$C$205:$C$216))))","v":0.61526011322860086},{"$f":"IF(MAX(C205:C216)-MIN(C205:C216)<5,AVERAGEIF(C205:C216,\">0\",S205:S216),\nIF(FORECAST($C202,S$205:S$216,$C$205:$C$216)<0,0,\nIF(FORECAST($C202,S$205:S$216,$C$205:$C$216)>100,100,\nFORECAST($C202,S$205:S$216,$C$205:$C$216))))","v":99.999999999999986},null,null,null,{"$f":"IF(MAX(C205:C216)-MIN(C205:C216)<5,AVERAGEIF(C205:C216,\">0\",W205:W216),\nIF(FORECAST($C202,W$205:W$216,$C$205:$C$216)<0,0,\nIF(FORECAST($C202,W$205:W$216,$C$205:$C$216)>100,100,\nFORECAST($C202,W$205:W$216,$C$205:$C$216))))","v":0},{"$f":"IF(MAX(C205:C216)-MIN(C205:C216)<5,AVERAGEIF(C205:C216,\">0\",X205:X216),\nIF(FORECAST($C202,X$205:X$216,$C$205:$C$216)<0,0,\nIF(FORECAST($C202,X$205:X$216,$C$205:$C$216)>100,100,\nFORECAST($C202,X$205:X$216,$C$205:$C$216))))","v":100},null,null,null,{"$f":"IF(MAX(C205:C216)-MIN(C205:C216)<5,AVERAGEIF(C205:C216,\">0\",AB205:AB216),\nIF(FORECAST($C202,AB$205:AB$216,$C$205:$C$216)<0,0,\nIF(FORECAST($C202,AB$205:AB$216,$C$205:$C$216)>100,100,\nFORECAST($C202,AB$205:AB$216,$C$205:$C$216))))","v":0}]
[]
[null,"Survey","Year","Improved","Not shared",null,null,"Open defecation","Improved","Not shared",null,null,"Open defecation","Improved","Not shared",null,null,"Open defecation","Improved","Not shared",null,null,"Open defecation","Improved","Not shared",null,null,"Open defecation"]
[null,"SLC05",2005,{"$f":"IF(ISERROR(INDIRECT(CONCATENATE($B205,\"!H122\"))),\"\",INDIRECT(CONCATENATE($B205,\"!H122\")))","v":64.285714285714278},{"$f":"IF(ISERROR(INDIRECT(CONCATENATE($B205,\"!H129\"))),\"\",INDIRECT(CONCATENATE($B205,\"!H129\")))","v":"N/A"},null,null,{"$f":"IF(ISERROR(INDIRECT(CONCATENATE($B205,\"!H127\"))),\"\",INDIRECT(CONCATENATE($B205,\"!H127\")))","v":30.952380952380953},{"$f":"IF(ISERROR(INDIRECT(CONCATENATE($B205,\"!I122\"))),\"\",INDIRECT(CONCATENATE($B205,\"!I122\")))","v":88.372093023255815},{"$f":"IF(ISERROR(INDIRECT(CONCATENATE($B205,\"!I129\"))),\"\",INDIRECT(CONCATENATE($B205,\"!I129\")))","v":"N/A"},null,null,{"$f":"IF(ISERROR(INDIRECT(CONCATENATE($B205,\"!I127\"))),\"\",INDIRECT(CONCATENATE($B205,\"!I127\")))","v":6.9767441860465116},{"$f":"IF(ISERROR(INDIRECT(CONCATENATE($B205,\"!J122\"))),\"\",INDIRECT(CONCATENATE($B205,\"!J122\")))","v":95.348837209302332},{"$f":"IF(ISERROR(INDIRECT(CONCATENATE($B205,\"!J129\"))),\"\",INDIRECT(CONCATENATE($B205,\"!J129\")))","v":"N/A"},null,null,{"$f":"IF(ISERROR(INDIRECT(CONCATENATE($B205,\"!J127\"))),\"\",INDIRECT(CONCATENATE($B205,\"!J127\")))","v":4.6511627906976747},{"$f":"IF(ISERROR(INDIRECT(CONCATENATE($B205,\"!K122\"))),\"\",INDIRECT(CONCATENATE($B205,\"!K122\")))","v":100.00000000000001},{"$f":"IF(ISERROR(INDIRECT(CONCATENATE($B205,\"!K129\"))),\"\",INDIRECT(CONCATENATE($B205,\"!K129\")))","v":"N/A"},null,null,{"$f":"IF(ISERROR(INDIRECT(CONCATENATE($B205,\"!K127\"))),\"\",INDIRECT(CONCATENATE($B205,\"!K127\")))","v":0},{"$f":"IF(ISERROR(INDIRECT(CONCATENATE($B205,\"!L122\"))),\"\",INDIRECT(CONCATENATE($B205,\"!L122\")))","v":100},{"$f":"IF(ISERROR(INDIRECT(CONCATENATE($B205,\"!L129\"))),\"\",INDIRECT(CONCATENATE($B205,\"!L129\")))","v":"N/A"},null,null,{"$f":"IF(ISERROR(INDIRECT(CONCATENATE($B205,\"!L2127\"))),\"\",INDIRECT(CONCATENATE($B205,\"!L127\")))","v":0}]
[null,"MICS12",2012,81.05374661326411,71.596497247942864,null,null,15.783346571095194,88.979440861421693,90.83032131042286,null,null,8.9477990099517868,96.790045397166736,93.566455090076033,null,null,1.512127374888399,100,95.443082918216547,null,null,0,100,97.90955350601061,null,null,0]
[null,null,null,"","",null,null,"","","",null,null,"","","",null,null,"","","",null,null,"","","",null,null,""]
[null,null,null,"","",null,null,"","","",null,null,"","","",null,null,"","","",null,null,"","","",null,null,""]
[null,null,null,"","",null,null,"","","",null,null,"","","",null,null,"","","",null,null,"","","",null,null,""]
[null,null,null,"","",null,null,"","","",null,null,"","","",null,null,"","","",null,null,"","","",null,null,""]
[null,null,null,"","",null,null,"","","",null,null,"","","",null,null,"","","",null,null,"","","",null,null,""]
[null,null,null,"","",null,null,"","","",null,null,"","","",null,null,"","","",null,null,"","","",null,null,""]
[null,null,null,"","",null,null,"","","",null,null,"","","",null,null,"","","",null,null,"","","",null,null,""]
[null,null,null,"","",null,null,"","","",null,null,"","","",null,null,"","","",null,null,"","","",null,null,""]
[null,null,null,"","",null,null,"","","",null,null,"","","",null,null,"","","",null,null,"","","",null,null,""]
[null,null,null,"","",null,null,"","","",null,null,"","","",null,null,"","","",null,null,"","","",null,null,""]
[]
[null,{"$f":"CONCATENATE(\"Urban use of sanitation facilities, \",C199,\"–\",C200)","v":"Urban use of sanitation facilities, 2000–2018"},null,null,null,null,null,null,null,null,null,null,null,null,null,null,null,null,"Data points used for regression"]
[]
[]
[]
[]
[]
[]
[]
[]
[]
[]
[]
[]
[]
[]
[]
[]
[]
[]
[]
[]
[]
[]
[]
[]
[]
[]
[]
[]
[]
[]
[]
[]
[]
[]
[]
[]
[]
[]
[]
[]
[]
[]
[]
[]
[]
[]
[]
[]
[]
[]
[]
[]
[]
[]
[]
[]
[]
[]
[]
[]
[]
[]
[]
[]
[]
[]
[]
[]
[]
[]
[]
[]
[]
[]
[]
[]
[]
[]
["RURAL",null,null,"Poorest",null,null,null,null,"Poor",null,null,null,null,"Middle",null,null,null,null,"Rich",null,null,null,null,"Richest"]
[null,null,null,"Improved","Basic","Limited","Unimproved","Open defecation","Improved","Basic","Limited","Unimproved","Open defecation","Improved","Basic","Limited","Unimproved","Open defecation","Improved","Basic","Limited","Unimproved","Open defecation","Improved","Basic","Limited","Unimproved","Open defecation"]
["Forecast period:",null,{"$f":"MinBase(C305:C316)","v":2000},{"$f":"IF((D301+H301)>100,D301*100/(D301+H301),D301)","v":62.891055120484452},{"$f":"D299*AVERAGEIF(E305:E316,\">0\")/100","v":50.127403148324014},{"$f":"D299*(100-AVERAGEIF(E305:E316,\">0\"))/100","v":12.763651972160444},{"$f":"100-(E299+F299+H299)","v":1.5242721042695848},{"$f":"IF((D301+H301)>100,H301*100/(D301+H301),H301)","v":35.584672775245963},{"$f":"IF((I301+M301)>100,I301*100/(I301+M301),I301)","v":92.579047386450156},{"$f":"I299*AVERAGEIF(J305:J316,\">0\")/100","v":80.572324820611968},{"$f":"I299*(100-AVERAGEIF(J305:J316,\">0\"))/100","v":12.006722565838189},{"$f":"100-(J299+K299+M299)","v":0.92997854996110618},{"$f":"IF((I301+M301)>100,M301*100/(I301+M301),M301)","v":6.4909740635887374},{"$f":"IF((N301+R301)>100,N301*100/(N301+R301),N301)","v":91.758241758241866},{"$f":"N299*AVERAGEIF(O305:O316,\">0\")/100","v":89.024407935555899},{"$f":"N299*(100-AVERAGEIF(O305:O316,\">0\"))/100","v":2.7338338226859586},{"$f":"100-(O299+P299+R299)","v":1.6483516483515501},{"$f":"IF((N301+R301)>100,R301*100/(N301+R301),R301)","v":6.5934065934065984},{"$f":"IF((S301+W301)>100,S301*100/(S301+W301),S301)","v":91.651205936920178},{"$f":"S299*AVERAGEIF(T305:T316,\">0\")/100","v":89.209659638091509},{"$f":"S299*(100-AVERAGEIF(T305:T316,\">0\"))/100","v":2.4415462988286767},{"$f":"100-(T299+U299+W299)","v":1.6697588126159957},{"$f":"IF((S301+W301)>100,W301*100/(S301+W301),W301)","v":6.6790352504638122},{"$f":"IF((X301+AB301)>100,X301*100/(X301+AB301),X301)","v":98.330241187384047},{"$f":"X299*AVERAGEIF(Y305:Y316,\">0\")/100","v":97.56157794184665},{"$f":"X299*(100-AVERAGEIF(Y305:Y316,\">0\"))/100","v":0.76866324553739351},{"$f":"100-(Y299+Z299+AB299)","v":0},{"$f":"IF((X301+AB301)>100,AB301*100/(X301+AB301),AB301)","v":1.669758812615953}]
[null,null,{"$f":"MaxTarget(C305:C316)","v":2018},{"$f":"IF((D302+H302)>100,D302*100/(D302+H302),D302)","v":100},{"$f":"D300*AVERAGEIF(E305:E316,\">0\")/100","v":79.705139391113264},{"$f":"D300*(100-AVERAGEIF(E305:E316,\">0\"))/100","v":20.294860608886736},{"$f":"100-(E300+F300+H300)","v":0},{"$f":"IF((D302+H302)>100,H302*100/(D302+H302),H302)","v":0},{"$f":"IF((I302+M302)>100,I302*100/(I302+M302),I302)","v":100},{"$f":"I300*AVERAGEIF(J305:J316,\">0\")/100","v":87.030842393831449},{"$f":"I300*(100-AVERAGEIF(J305:J316,\">0\"))/100","v":12.969157606168551},{"$f":"100-(J300+K300+M300)","v":0},{"$f":"IF((I302+M302)>100,M302*100/(I302+M302),M302)","v":0},{"$f":"IF((N302+R302)>100,N302*100/(N302+R302),N302)","v":100},{"$f":"N300*AVERAGEIF(O305:O316,\">0\")/100","v":97.020612241144647},{"$f":"N300*(100-AVERAGEIF(O305:O316,\">0\"))/100","v":2.9793877588553528},{"$f":"100-(O300+P300+R300)","v":0},{"$f":"IF((N302+R302)>100,R302*100/(N302+R302),R302)","v":0},{"$f":"IF((S302+W302)>100,S302*100/(S302+W302),S302)","v":100},{"$f":"S300*AVERAGEIF(T305:T316,\">0\")/100","v":97.336045637512839},{"$f":"S300*(100-AVERAGEIF(T305:T316,\">0\"))/100","v":2.6639543624871607},{"$f":"100-(T300+U300+W300)","v":0},{"$f":"IF((S302+W302)>100,W302*100/(S302+W302),W302)","v":0},{"$f":"IF((X302+AB302)>100,X302*100/(X302+AB302),X302)","v":100},{"$f":"X300*AVERAGEIF(Y305:Y316,\">0\")/100","v":99.218283982368575},{"$f":"X300*(100-AVERAGEIF(Y305:Y316,\">0\"))/100","v":0.78171601763142462},{"$f":"100-(Y300+Z300+AB300)","v":0},{"$f":"IF((X302+AB302)>100,AB302*100/(X302+AB302),AB302)","v":0}]
["Regression period:",null,{"$f":"MinRegYear(C299,C305:C316)","v":2003},{"$f":"IF(MAX(C305:C316)-MIN(C305:C316)<5,AVERAGEIF(C305:C316,\">0\",D305:D316),\nIF(FORECAST($C301,D$305:D$316,$C$305:$C$316)<0,0,\nIF(FORECAST($C301,D$305:D$316,$C$305:$C$316)>100,100,\nFORECAST($C301,D$305:D$316,$C$305:$C$316))))","v":62.891055120484452},null,null,null,{"$f":"IF(MAX(C305:C316)-MIN(C305:C316)<5,AVERAGEIF(C305:C316,\">0\",H305:H316),\nIF(FORECAST($C301,H$305:H$316,$C$305:$C$316)<0,0,\nIF(FORECAST($C301,H$305:H$316,$C$305:$C$316)>100,100,\nFORECAST($C301,H$305:H$316,$C$305:$C$316))))","v":35.584672775245963},{"$f":"IF(MAX(C305:C316)-MIN(C305:C316)<5,AVERAGEIF(C305:C316,\">0\",I305:I316),\nIF(FORECAST($C301,I$305:I$316,$C$305:$C$316)<0,0,\nIF(FORECAST($C301,I$305:I$316,$C$305:$C$316)>100,100,\nFORECAST($C301,I$305:I$316,$C$305:$C$316))))","v":92.579047386450156},null,null,null,{"$f":"IF(MAX(C305:C316)-MIN(C305:C316)<5,AVERAGEIF(C305:C316,\">0\",M305:M316),\nIF(FORECAST($C301,M$305:M$316,$C$305:$C$316)<0,0,\nIF(FORECAST($C301,M$305:M$316,$C$305:$C$316)>100,100,\nFORECAST($C301,M$305:M$316,$C$305:$C$316))))","v":6.4909740635887374},{"$f":"IF(MAX(C305:C316)-MIN(C305:C316)<5,AVERAGEIF(C305:C316,\">0\",N305:N316),\nIF(FORECAST($C301,N$305:N$316,$C$305:$C$316)<0,0,\nIF(FORECAST($C301,N$305:N$316,$C$305:$C$316)>100,100,\nFORECAST($C301,N$305:N$316,$C$305:$C$316))))","v":91.758241758241866},null,null,null,{"$f":"IF(MAX(C305:C316)-MIN(C305:C316)<5,AVERAGEIF(C305:C316,\">0\",R305:R316),\nIF(FORECAST($C301,R$305:R$316,$C$305:$C$316)<0,0,\nIF(FORECAST($C301,R$305:R$316,$C$305:$C$316)>100,100,\nFORECAST($C301,R$305:R$316,$C$305:$C$316))))","v":6.5934065934065984},{"$f":"IF(MAX(C305:C316)-MIN(C305:C316)<5,AVERAGEIF(C305:C316,\">0\",S305:S316),\nIF(FORECAST($C301,S$305:S$316,$C$305:$C$316)<0,0,\nIF(FORECAST($C301,S$305:S$316,$C$305:$C$316)>100,100,\nFORECAST($C301,S$305:S$316,$C$305:$C$316))))","v":91.651205936920178},null,null,null,{"$f":"IF(MAX(C305:C316)-MIN(C305:C316)<5,AVERAGEIF(C305:C316,\">0\",W305:W316),\nIF(FORECAST($C301,W$305:W$316,$C$305:$C$316)<0,0,\nIF(FORECAST($C301,W$305:W$316,$C$305:$C$316)>100,100,\nFORECAST($C301,W$305:W$316,$C$305:$C$316))))","v":6.6790352504638122},{"$f":"IF(MAX(C305:C316)-MIN(C305:C316)<5,AVERAGEIF(C305:C316,\">0\",X305:X316),\nIF(FORECAST($C301,X$305:X$316,$C$305:$C$316)<0,0,\nIF(FORECAST($C301,X$305:X$316,$C$305:$C$316)>100,100,\nFORECAST($C301,X$305:X$316,$C$305:$C$316))))","v":98.330241187384047},null,null,null,{"$f":"IF(MAX(C305:C316)-MIN(C305:C316)<5,AVERAGEIF(C305:C316,\">0\",AB305:AB316),\nIF(FORECAST($C301,AB$305:AB$316,$C$305:$C$316)<0,0,\nIF(FORECAST($C301,AB$305:AB$316,$C$305:$C$316)>100,100,\nFORECAST($C301,AB$305:AB$316,$C$305:$C$316))))","v":1.669758812615953}]
[null,null,{"$f":"MaxRegYear(C300,C305:C316)","v":2014},{"$f":"IF(MAX(C305:C316)-MIN(C305:C316)<5,AVERAGEIF(C305:C316,\">0\",D305:D316),\nIF(FORECAST($C302,D$305:D$316,$C$305:$C$316)<0,0,\nIF(FORECAST($C302,D$305:D$316,$C$305:$C$316)>100,100,\nFORECAST($C302,D$305:D$316,$C$305:$C$316))))","v":100},null,null,null,{"$f":"IF(MAX(C305:C316)-MIN(C305:C316)<5,AVERAGEIF(C305:C316,\">0\",H305:H316),\nIF(FORECAST($C302,H$305:H$316,$C$305:$C$316)<0,0,\nIF(FORECAST($C302,H$305:H$316,$C$305:$C$316)>100,100,\nFORECAST($C302,H$305:H$316,$C$305:$C$316))))","v":0},{"$f":"IF(MAX(C305:C316)-MIN(C305:C316)<5,AVERAGEIF(C305:C316,\">0\",I305:I316),\nIF(FORECAST($C302,I$305:I$316,$C$305:$C$316)<0,0,\nIF(FORECAST($C302,I$305:I$316,$C$305:$C$316)>100,100,\nFORECAST($C302,I$305:I$316,$C$305:$C$316))))","v":100},null,null,null,{"$f":"IF(MAX(C305:C316)-MIN(C305:C316)<5,AVERAGEIF(C305:C316,\">0\",M305:M316),\nIF(FORECAST($C302,M$305:M$316,$C$305:$C$316)<0,0,\nIF(FORECAST($C302,M$305:M$316,$C$305:$C$316)>100,100,\nFORECAST($C302,M$305:M$316,$C$305:$C$316))))","v":0},{"$f":"IF(MAX(C305:C316)-MIN(C305:C316)<5,AVERAGEIF(C305:C316,\">0\",N305:N316),\nIF(FORECAST($C302,N$305:N$316,$C$305:$C$316)<0,0,\nIF(FORECAST($C302,N$305:N$316,$C$305:$C$316)>100,100,\nFORECAST($C302,N$305:N$316,$C$305:$C$316))))","v":100},null,null,null,{"$f":"IF(MAX(C305:C316)-MIN(C305:C316)<5,AVERAGEIF(C305:C316,\">0\",R305:R316),\nIF(FORECAST($C302,R$305:R$316,$C$305:$C$316)<0,0,\nIF(FORECAST($C302,R$305:R$316,$C$305:$C$316)>100,100,\nFORECAST($C302,R$305:R$316,$C$305:$C$316))))","v":0},{"$f":"IF(MAX(C305:C316)-MIN(C305:C316)<5,AVERAGEIF(C305:C316,\">0\",S305:S316),\nIF(FORECAST($C302,S$305:S$316,$C$305:$C$316)<0,0,\nIF(FORECAST($C302,S$305:S$316,$C$305:$C$316)>100,100,\nFORECAST($C302,S$305:S$316,$C$305:$C$316))))","v":100},null,null,null,{"$f":"IF(MAX(C305:C316)-MIN(C305:C316)<5,AVERAGEIF(C305:C316,\">0\",W305:W316),\nIF(FORECAST($C302,W$305:W$316,$C$305:$C$316)<0,0,\nIF(FORECAST($C302,W$305:W$316,$C$305:$C$316)>100,100,\nFORECAST($C302,W$305:W$316,$C$305:$C$316))))","v":0},{"$f":"IF(MAX(C305:C316)-MIN(C305:C316)<5,AVERAGEIF(C305:C316,\">0\",X305:X316),\nIF(FORECAST($C302,X$305:X$316,$C$305:$C$316)<0,0,\nIF(FORECAST($C302,X$305:X$316,$C$305:$C$316)>100,100,\nFORECAST($C302,X$305:X$316,$C$305:$C$316))))","v":100},null,null,null,{"$f":"IF(MAX(C305:C316)-MIN(C305:C316)<5,AVERAGEIF(C305:C316,\">0\",AB305:AB316),\nIF(FORECAST($C302,AB$305:AB$316,$C$305:$C$316)<0,0,\nIF(FORECAST($C302,AB$305:AB$316,$C$305:$C$316)>100,100,\nFORECAST($C302,AB$305:AB$316,$C$305:$C$316))))","v":0}]
[]
[null,"Survey","Year","Improved","Not shared",null,null,"Open defecation","Improved","Not shared",null,null,"Open defecation","Improved","Not shared",null,null,"Open defecation","Improved","Not shared",null,null,"Open defecation","Improved","Not shared",null,null,"Open defecation"]
[null,"SLC05",2005,{"$f":"IF(ISERROR(INDIRECT(CONCATENATE($B305,\"!M122\"))),\"\",INDIRECT(CONCATENATE($B305,\"!M122\")))","v":70.129870129870127},{"$f":"IF(ISERROR(INDIRECT(CONCATENATE($B305,\"!M129\"))),\"\",INDIRECT(CONCATENATE($B305,\"!M129\")))","v":"N/A"},null,null,{"$f":"IF(ISERROR(INDIRECT(CONCATENATE($B305,\"!M127\"))),\"\",INDIRECT(CONCATENATE($B305,\"!M127\")))","v":28.571428571428569},{"$f":"IF(ISERROR(INDIRECT(CONCATENATE($B305,\"!N122\"))),\"\",INDIRECT(CONCATENATE($B305,\"!N122\")))","v":94.007651683456757},{"$f":"IF(ISERROR(INDIRECT(CONCATENATE($B305,\"!N129\"))),\"\",INDIRECT(CONCATENATE($B305,\"!N129\")))","v":"N/A"},null,null,{"$f":"IF(ISERROR(INDIRECT(CONCATENATE($B305,\"!N127\"))),\"\",INDIRECT(CONCATENATE($B305,\"!N127\")))","v":5.1948051948051948},{"$f":"IF(ISERROR(INDIRECT(CONCATENATE($B305,\"!O122\"))),\"\",INDIRECT(CONCATENATE($B305,\"!O122\")))","v":93.589743589743591},{"$f":"IF(ISERROR(INDIRECT(CONCATENATE($B305,\"!O129\"))),\"\",INDIRECT(CONCATENATE($B305,\"!O129\")))","v":"N/A"},null,null,{"$f":"IF(ISERROR(INDIRECT(CONCATENATE($B305,\"!O127\"))),\"\",INDIRECT(CONCATENATE($B305,\"!O127\")))","v":5.1282051282051277},{"$f":"IF(ISERROR(INDIRECT(CONCATENATE($B305,\"!P122\"))),\"\",INDIRECT(CONCATENATE($B305,\"!P122\")))","v":93.506493506493513},{"$f":"IF(ISERROR(INDIRECT(CONCATENATE($B305,\"!P129\"))),\"\",INDIRECT(CONCATENATE($B305,\"!P129\")))","v":"N/A"},null,null,{"$f":"IF(ISERROR(INDIRECT(CONCATENATE($B305,\"!P127\"))),\"\",INDIRECT(CONCATENATE($B305,\"!P127\")))","v":5.1948051948051948},{"$f":"IF(ISERROR(INDIRECT(CONCATENATE($B305,\"!Q122\"))),\"\",INDIRECT(CONCATENATE($B305,\"!Q122\")))","v":98.701298701298711},{"$f":"IF(ISERROR(INDIRECT(CONCATENATE($B305,\"!Q129\"))),\"\",INDIRECT(CONCATENATE($B305,\"!Q129\")))","v":"N/A"},null,null,{"$f":"IF(ISERROR(INDIRECT(CONCATENATE($B305,\"!Q2127\"))),\"\",INDIRECT(CONCATENATE($B305,\"!Q127\")))","v":1.2987012987012987}]
[null,"MICS12",2012,95.465722662718775,79.705139391113264,null,null,4.0250738580695655,99.007766722980222,87.030842393831449,null,null,0.65821415406262485,100,97.020612241144647,null,null,0,100,97.336045637512839,null,null,0,100,99.218283982368575,null,null,0]
[null,null,null,"","",null,null,"","","",null,null,"","","",null,null,"","","",null,null,"","","",null,null,""]
[null,null,null,"","",null,null,"","","",null,null,"","","",null,null,"","","",null,null,"","","",null,null,""]
[null,null,null,"","",null,null,"","","",null,null,"","","",null,null,"","","",null,null,"","","",null,null,""]
[null,null,null,"","",null,null,"","","",null,null,"","","",null,null,"","","",null,null,"","","",null,null,""]
[null,null,null,"","",null,null,"","","",null,null,"","","",null,null,"","","",null,null,"","","",null,null,""]
[null,null,null,"","",null,null,"","","",null,null,"","","",null,null,"","","",null,null,"","","",null,null,""]
[null,null,null,"","",null,null,"","","",null,null,"","","",null,null,"","","",null,null,"","","",null,null,""]
[null,null,null,"","",null,null,"","","",null,null,"","","",null,null,"","","",null,null,"","","",null,null,""]
[null,null,null,"","",null,null,"","","",null,null,"","","",null,null,"","","",null,null,"","","",null,null,""]
[null,null,null,"","",null,null,"","","",null,null,"","","",null,null,"","","",null,null,"","","",null,null,""]
[]
[null,{"$f":"CONCATENATE(\"Rural use of sanitation facilities, \",C299,\"–\",C300)","v":"Rural use of sanitation facilities, 2000–2018"},null,null,null,null,null,null,null,null,null,null,null,null,null,null,null,null,"Data points used for regression"]

{"sheet":"Hygiene","index":3,"n_rows":90,"n_cols":25,"rows_kept":90,"cut":false,"hidden":false,"merged":[[39,22,40,22],[39,23,40,23],[39,24,40,24],[31,4,32,5],[39,16,40,16],[39,17,40,17],[39,18,40,18],[39,19,40,19],[39,20,40,20],[39,21,40,21],[36,24,37,24],[39,6,40,7],[39,8,40,8],[39,9,40,9],[39,10,40,10],[39,11,40,11],[39,12,40,12],[39,13,40,13],[39,14,40,14],[39,15,40,15],[36,18,37,18],[36,12,37,12],[36,13,37,13],[36,14,37,14],[36,15,37,15],[36,16,37,16],[36,17,37,17],[36,19,37,19],[36,20,37,20],[36,21,37,21],[36,22,37,22],[36,23,37,23],[33,20,34,20],[33,21,34,21],[33,22,34,22],[33,23,34,23],[33,24,34,24],[33,15,34,15],[33,16,34,16],[33,17,34,17],[33,18,34,18],[36,6,37,7],[36,8,37,8],[36,9,37,9],[36,10,37,10],[36,11,37,11],[33,10,34,10],[33,11,34,11],[33,12,34,12],[33,13,34,13],[33,14,34,14],[6,1,6,7],[3,1,3,24],[4,1,4,24],[33,1,34,3],[31,6,32,9],[31,10,31,12],[31,13,31,15],[6,10,6,15],[6,18,6,23],[33,19,34,19],[31,16,31,18],[31,19,31,21],[31,22,31,24],[33,6,34,7],[33,8,34,8],[33,9,34,9]]}
[]
[]
[]
[null,"Access to hygiene facilities by wealth quintile (%)"]
[null,{"$f":"IF(ISERROR(INDIRECT(CONCATENATE($E$32,\"!A2\"))),\"\",INDIRECT(CONCATENATE($E$32,\"!A2\")))","v":"Saint Lucia"}]
[]
[null,{"$f":"CONCATENATE(\"National \",IF(ISERROR(INDIRECT(CONCATENATE($E$32,\"!A2\"))),\"\",INDIRECT(CONCATENATE($E$32,\"!A210\"))))","v":"National Access to hygiene facilities "},null,null,null,null,null,null,null,null,{"$f":"CONCATENATE(\"Urban \",IF(ISERROR(INDIRECT(CONCATENATE($E$32,\"!A2\"))),\"\",INDIRECT(CONCATENATE($E$32,\"!A210\"))))","v":"Urban Access to hygiene facilities "},null,null,null,null,null,null,null,{"$f":"CONCATENATE(\"Rural \",IF(ISERROR(INDIRECT(CONCATENATE($E$32,\"!A2\"))),\"\",INDIRECT(CONCATENATE($E$32,\"!A210\"))))","v":"Rural Access to hygiene facilities "}]
[]
[]
[]
[]
[]
[]
[]
[]
[]
[]
[]
[]
[]
[]
[]
[]
[]
[]
[]
[]
[]
[]
[]
[]
[null,null,null,null,{"$f":"INDEX(B88:B100,A88)","v":"MICS12"},null,{"$f":"IF(ISERROR(INDIRECT(CONCATENATE($E$32,\"!A2\"))),\"\",INDIRECT(CONCATENATE($E$32,\"!A2\")))","v":"Saint Lucia"},null,null,null,"Poorest",null,null,"Poor",null,null,"Middle",null,null,"Rich",null,null,"Richest"]
[null,null,null,null,null,null,null,null,null,null,"Basic","Limited","No facility","Basic","Limited","No facility","Basic","Limited","No facility","Basic","Limited","No facility","Basic","Limited","No facility"]
[null,">>>  Select Survey :   ",null,null,null,null,"NATIONAL",null,null,{"$f":"IF(ISERROR(INDIRECT(CONCATENATE(#REF!,\"!A2\"))),\"\",INDIRECT(CONCATENATE(#REF!,\"!A210\")))","v":""},{"$f":"IF(ISERROR(INDIRECT(CONCATENATE($E$32,\"!C222\"))),\"\",INDIRECT(CONCATENATE($E$32,\"!C222\")))","v":69.68906407180117},{"$f":"IF(ISERROR(INDIRECT(CONCATENATE($E$32,\"!C223\"))),\"\",INDIRECT(CONCATENATE($E$32,\"!C223\")))","v":15.631942978206547},{"$f":"IF(ISERROR(INDIRECT(CONCATENATE($E$32,\"!C224\"))),\"\",INDIRECT(CONCATENATE($E$32,\"!C224\")))","v":14.678992949992239},{"$f":"IF(ISERROR(INDIRECT(CONCATENATE($E$32,\"!D222\"))),\"\",INDIRECT(CONCATENATE($E$32,\"!D222\")))","v":85.20066099366403},{"$f":"IF(ISERROR(INDIRECT(CONCATENATE($E$32,\"!D223\"))),\"\",INDIRECT(CONCATENATE($E$32,\"!D223\")))","v":11.064551592355405},{"$f":"IF(ISERROR(INDIRECT(CONCATENATE($E$32,\"!D224\"))),\"\",INDIRECT(CONCATENATE($E$32,\"!D224\")))","v":3.7347874139805755},{"$f":"IF(ISERROR(INDIRECT(CONCATENATE($E$32,\"!E222\"))),\"\",INDIRECT(CONCATENATE($E$32,\"!E222\")))","v":90.754167823200532},{"$f":"IF(ISERROR(INDIRECT(CONCATENATE($E$32,\"!E223\"))),\"\",INDIRECT(CONCATENATE($E$32,\"!E223\")))","v":5.4361424477327649},{"$f":"IF(ISERROR(INDIRECT(CONCATENATE($E$32,\"!E224\"))),\"\",INDIRECT(CONCATENATE($E$32,\"!E224\")))","v":3.8096897290666796},{"$f":"IF(ISERROR(INDIRECT(CONCATENATE($E$32,\"!F222\"))),\"\",INDIRECT(CONCATENATE($E$32,\"!F222\")))","v":95.119565143757754},{"$f":"IF(ISERROR(INDIRECT(CONCATENATE($E$32,\"!F223\"))),\"\",INDIRECT(CONCATENATE($E$32,\"!F223\")))","v":3.1558410652814026},{"$f":"IF(ISERROR(INDIRECT(CONCATENATE($E$32,\"!F224\"))),\"\",INDIRECT(CONCATENATE($E$32,\"!F224\")))","v":1.7245937909608302},{"$f":"IF(ISERROR(INDIRECT(CONCATENATE($E$32,\"!G222\"))),\"\",INDIRECT(CONCATENATE($E$32,\"!G222\")))","v":95.69936992837799},{"$f":"IF(ISERROR(INDIRECT(CONCATENATE($E$32,\"!G223\"))),\"\",INDIRECT(CONCATENATE($E$32,\"!G223\")))","v":2.3168659443196207},{"$f":"IF(ISERROR(INDIRECT(CONCATENATE($E$32,\"!G224\"))),\"\",INDIRECT(CONCATENATE($E$32,\"!G224\")))","v":1.9837641273023872}]
[]
[]
[null,null,null,null,null,null,"URBAN",null,null,{"$f":"IF(ISERROR(INDIRECT(CONCATENATE(#REF!,\"!A2\"))),\"\",INDIRECT(CONCATENATE(#REF!,\"!A210\")))","v":""},{"$f":"IF(ISERROR(INDIRECT(CONCATENATE($E$32,\"!H222\"))),\"\",INDIRECT(CONCATENATE($E$32,\"!H222\")))","v":66.778105622320055},{"$f":"IF(ISERROR(INDIRECT(CONCATENATE($E$32,\"!H223\"))),\"\",INDIRECT(CONCATENATE($E$32,\"!H223\")))","v":17.998257071504611},{"$f":"IF(ISERROR(INDIRECT(CONCATENATE($E$32,\"!H224\"))),\"\",INDIRECT(CONCATENATE($E$32,\"!H224\")))","v":15.223637306175233},{"$f":"IF(ISERROR(INDIRECT(CONCATENATE($E$32,\"!I222\"))),\"\",INDIRECT(CONCATENATE($E$32,\"!I222\")))","v":88.284016506201056},{"$f":"IF(ISERROR(INDIRECT(CONCATENATE($E$32,\"!I223\"))),\"\",INDIRECT(CONCATENATE($E$32,\"!I223\")))","v":8.9902887199153358},{"$f":"IF(ISERROR(INDIRECT(CONCATENATE($E$32,\"!I224\"))),\"\",INDIRECT(CONCATENATE($E$32,\"!I224\")))","v":2.7256947738836024},{"$f":"IF(ISERROR(INDIRECT(CONCATENATE($E$32,\"!J222\"))),\"\",INDIRECT(CONCATENATE($E$32,\"!J222\")))","v":88.835415293280732},{"$f":"IF(ISERROR(INDIRECT(CONCATENATE($E$32,\"!J223\"))),\"\",INDIRECT(CONCATENATE($E$32,\"!J223\")))","v":8.7285239686104497},{"$f":"IF(ISERROR(INDIRECT(CONCATENATE($E$32,\"!J224\"))),\"\",INDIRECT(CONCATENATE($E$32,\"!J224\")))","v":2.4360607381088051},{"$f":"IF(ISERROR(INDIRECT(CONCATENATE($E$32,\"!K222\"))),\"\",INDIRECT(CONCATENATE($E$32,\"!K222\")))","v":98.374545140238837},{"$f":"IF(ISERROR(INDIRECT(CONCATENATE($E$32,\"!K223\"))),\"\",INDIRECT(CONCATENATE($E$32,\"!K223\")))","v":0},{"$f":"IF(ISERROR(INDIRECT(CONCATENATE($E$32,\"!K224\"))),\"\",INDIRECT(CONCATENATE($E$32,\"!K224\")))","v":1.6254548597611644},{"$f":"IF(ISERROR(INDIRECT(CONCATENATE($E$32,\"!L222\"))),\"\",INDIRECT(CONCATENATE($E$32,\"!L222\")))","v":96.510124337500315},{"$f":"IF(ISERROR(INDIRECT(CONCATENATE($E$32,\"!L223\"))),\"\",INDIRECT(CONCATENATE($E$32,\"!L223\")))","v":1.2944389963395584},{"$f":"IF(ISERROR(INDIRECT(CONCATENATE($E$32,\"!L224\"))),\"\",INDIRECT(CONCATENATE($E$32,\"!L224\")))","v":2.1954366661601195}]
[]
[]
[null,null,null,null,null,null,"RURAL",null,null,{"$f":"IF(ISERROR(INDIRECT(CONCATENATE(#REF!,\"!A2\"))),\"\",INDIRECT(CONCATENATE(#REF!,\"!A210\")))","v":""},{"$f":"IF(ISERROR(INDIRECT(CONCATENATE($E$32,\"!M222\"))),\"\",INDIRECT(CONCATENATE($E$32,\"!M222\")))","v":70.538578533693823},{"$f":"IF(ISERROR(INDIRECT(CONCATENATE($E$32,\"!M223\"))),\"\",INDIRECT(CONCATENATE($E$32,\"!M223\")))","v":15.023521702004297},{"$f":"IF(ISERROR(INDIRECT(CONCATENATE($E$32,\"!M224\"))),\"\",INDIRECT(CONCATENATE($E$32,\"!M224\")))","v":14.437899764301834},{"$f":"IF(ISERROR(INDIRECT(CONCATENATE($E$32,\"!N222\"))),\"\",INDIRECT(CONCATENATE($E$32,\"!N222\")))","v":84.583114215989013},{"$f":"IF(ISERROR(INDIRECT(CONCATENATE($E$32,\"!N223\"))),\"\",INDIRECT(CONCATENATE($E$32,\"!N223\")))","v":11.409375318183953},{"$f":"IF(ISERROR(INDIRECT(CONCATENATE($E$32,\"!N224\"))),\"\",INDIRECT(CONCATENATE($E$32,\"!N224\")))","v":4.0075104658270435},{"$f":"IF(ISERROR(INDIRECT(CONCATENATE($E$32,\"!O222\"))),\"\",INDIRECT(CONCATENATE($E$32,\"!O222\")))","v":90.881410765461482},{"$f":"IF(ISERROR(INDIRECT(CONCATENATE($E$32,\"!O223\"))),\"\",INDIRECT(CONCATENATE($E$32,\"!O223\")))","v":4.8846030177295585},{"$f":"IF(ISERROR(INDIRECT(CONCATENATE($E$32,\"!O224\"))),\"\",INDIRECT(CONCATENATE($E$32,\"!O224\")))","v":4.2339862168089528},{"$f":"IF(ISERROR(INDIRECT(CONCATENATE($E$32,\"!P222\"))),\"\",INDIRECT(CONCATENATE($E$32,\"!P222\")))","v":94.434304438102274},{"$f":"IF(ISERROR(INDIRECT(CONCATENATE($E$32,\"!P223\"))),\"\",INDIRECT(CONCATENATE($E$32,\"!P223\")))","v":3.9218468034474361},{"$f":"IF(ISERROR(INDIRECT(CONCATENATE($E$32,\"!P224\"))),\"\",INDIRECT(CONCATENATE($E$32,\"!P224\")))","v":1.6438487584502961},{"$f":"IF(ISERROR(INDIRECT(CONCATENATE($E$32,\"!Q222\"))),\"\",INDIRECT(CONCATENATE($E$32,\"!Q222\")))","v":95.409063635960763},{"$f":"IF(ISERROR(INDIRECT(CONCATENATE($E$32,\"!Q223\"))),\"\",INDIRECT(CONCATENATE($E$32,\"!Q223\")))","v":2.545076703771036},{"$f":"IF(ISERROR(INDIRECT(CONCATENATE($E$32,\"!Q224\"))),\"\",INDIRECT(CONCATENATE($E$32,\"!Q224\")))","v":2.0458596602681891}]
[]
[]
[]
[]
[]
[]
[]
[]
[]
[]
[]
[]
[]
[]
[]
[]
[]
[]
[]
[]
[]
[]
[]
[]
[]
[]
[]
[]
[]
[]
[]
[]
[]
[]
[]
[]
[]
[]
[]
[]
[]
[]
[]
[]
[]
[]
[]
[2,"SLC05"]
[null,"MICS12"]
[null,"Template"]

{"sheet":"SLC05","index":4,"n_rows":1072,"n_cols":69,"rows_kept":1072,"cut":false,"hidden":false,"merged":[[276,52,283,52],[338,54,338,58],[338,59,338,63],[338,64,338,68],[340,52,341,52],[342,52,343,52],[344,52,345,52],[346,52,347,52],[348,52,349,52],[350,52,351,52],[352,52,353,52],[152,52,158,52],[132,59,132,63],[132,64,132,68],[134,52,138,52],[219,54,219,58],[219,59,219,63],[219,64,219,68],[221,52,223,52],[224,52,225,52],[226,52,229,52],[258,54,258,58],[258,59,258,63],[258,64,258,68],[260,52,262,52],[263,52,266,52],[267,52,269,52],[270,52,272,52],[273,52,275,52],[46,52,48,52],[49,0,51,0],[49,52,51,52],[52,0,54,0],[52,52,54,52],[139,0,142,0],[139,52,142,52],[143,0,146,0],[143,52,146,52],[147,0,149,0],[147,52,149,52],[150,0,151,0],[150,52,151,52],[13,54,13,58],[13,59,13,63],[13,64,13,68],[15,52,16,52],[17,52,20,52],[21,52,22,52],[26,54,26,58],[26,59,26,63],[26,64,26,68],[55,54,55,58],[55,59,55,63],[55,64,55,68],[119,54,119,58],[119,59,119,63],[119,64,119,68],[121,52,122,52],[123,52,126,52],[127,52,128,52],[132,54,132,58],[28,52,29,52],[30,0,31,0],[30,52,31,52],[32,0,33,0],[32,52,33,52],[34,52,35,52],[36,52,37,52],[38,0,39,0],[38,52,39,52],[40,52,41,52],[42,52,43,52],[44,52,45,52],[28,0,29,0],[34,0,35,0],[36,0,37,0],[40,0,41,0],[42,0,43,0],[13,12,13,16],[15,0,16,0],[17,0,20,0],[21,0,22,0],[23,0,25,0],[26,2,26,6],[26,7,26,11],[26,12,26,16],[13,2,13,6],[13,7,13,11],[46,0,48,0],[121,0,122,0],[123,0,126,0],[127,0,128,0],[129,0,131,0],[132,2,132,6],[55,12,55,16],[57,0,63,0],[107,0,107,1],[119,2,119,6],[119,7,119,11],[119,12,119,16],[44,0,45,0],[55,2,55,6],[55,7,55,11],[219,7,219,11],[219,12,219,16],[221,0,223,0],[207,0,207,1],[219,2,219,6],[132,7,132,11],[132,12,132,16],[134,0,138,0],[152,0,157,0],[201,0,202,0],[404,2,404,3],[404,7,404,8],[404,12,404,13],[405,2,405,3],[405,7,405,8],[405,12,405,13],[400,2,401,3],[400,7,401,8],[400,12,401,13],[401,1,444,1],[402,2,402,3],[402,7,402,8],[402,12,402,13],[403,2,403,3],[403,7,403,8],[403,12,403,13],[398,2,398,5],[398,7,398,10],[398,12,398,15],[399,2,399,4],[399,7,399,9],[399,12,399,14],[410,2,410,3],[410,7,410,8],[410,12,410,13],[411,2,411,3],[411,7,411,8],[411,12,411,13],[408,2,408,3],[408,7,408,8],[408,12,408,13],[409,2,409,3],[409,7,409,8],[409,12,409,13],[406,2,406,3],[406,7,406,8],[406,12,406,13],[407,2,407,3],[407,7,407,8],[407,12,407,13],[416,2,416,3],[416,7,416,8],[416,12,416,13],[417,2,417,3],[417,7,417,8],[417,12,417,13],[414,2,414,3],[414,7,414,8],[414,12,414,13],[415,2,415,3],[415,7,415,8],[415,12,415,13],[412,2,412,3],[412,7,412,8],[412,12,412,13],[413,2,413,3],[413,7,413,8],[413,12,413,13],[422,2,422,3],[422,7,422,8],[422,12,422,13],[423,2,423,3],[423,7,423,8],[423,12,423,13],[420,2,420,3],[420,7,420,8],[420,12,420,13],[421,2,421,3],[421,7,421,8],[421,12,421,13],[418,2,418,3],[418,7,418,8],[418,12,418,13],[419,2,419,3],[419,7,419,8],[419,12,419,13],[428,2,428,3],[428,7,428,8],[428,12,428,13],[429,2,429,3],[429,7,429,8],[429,12,429,13],[426,2,426,3],[426,7,426,8],[426,12,426,13],[427,2,427,3],[427,7,427,8],[427,12,427,13],[424,2,424,3],[424,7,424,8],[424,12,424,13],[425,2,425,3],[425,7,425,8],[425,12,425,13],[434,2,434,3],[434,7,434,8],[434,12,434,13],[435,2,435,3],[435,7,435,8],[435,12,435,13],[432,2,432,3],[432,7,432,8],[432,12,432,13],[433,2,433,3],[433,7,433,8],[433,12,433,13],[430,2,430,3],[430,7,430,8],[430,12,430,13],[431,2,431,3],[431,7,431,8],[431,12,431,13],[440,2,440,3],[440,7,440,8],[440,12,440,13],[441,2,441,3],[441,7,441,9],[441,12,441,13],[438,2,438,3],[438,7,438,8],[438,12,438,13],[439,2,439,3],[439,7,439,8],[439,12,439,13],[436,2,436,3],[436,7,436,8],[436,12,436,13],[437,2,437,3],[437,7,437,8],[437,12,437,13],[446,2,446,3],[446,7,446,8],[446,12,446,13],[447,2,447,3],[447,7,447,8],[447,12,447,13],[444,2,444,4],[444,7,444,8],[444,12,444,13],[445,2,445,3],[445,7,445,8],[445,12,445,13],[442,2,442,3],[442,7,442,8],[442,12,442,13],[443,2,443,3],[443,7,443,8],[443,12,443,14],[452,2,452,3],[452,7,452,8],[452,12,452,13],[453,2,453,3],[453,7,453,8],[453,12,453,13],[450,2,450,3],[450,7,450,8],[450,12,450,13],[451,2,451,3],[451,7,451,8],[451,12,451,13],[448,2,448,3],[448,7,448,8],[448,12,448,13],[449,2,449,3],[449,7,449,8],[449,12,449,13],[458,2,458,3],[458,7,458,8],[458,12,458,13],[459,2,459,3],[459,7,459,8],[459,12,459,13],[456,2,456,3],[456,7,456,8],[456,12,456,13],[457,2,457,3],[457,7,457,8],[457,12,457,13],[454,2,454,3],[454,7,454,8],[454,12,454,13],[455,2,455,3],[455,7,455,8],[455,12,455,13],[464,2,464,3],[464,7,464,8],[464,12,464,13],[465,2,465,3],[465,7,465,8],[465,12,465,13],[462,2,462,3],[462,7,462,8],[462,12,462,13],[463,2,463,3],[463,7,463,8],[463,12,463,13],[460,2,460,3],[460,7,460,8],[460,12,460,13],[461,2,461,3],[461,7,461,8],[461,12,461,13],[470,2,470,3],[470,7,470,8],[470,12,470,13],[471,2,471,3],[471,7,471,8],[471,12,471,13],[468,2,468,3],[468,7,468,8],[468,12,468,13],[469,2,469,3],[469,7,469,8],[469,12,469,13],[466,2,466,3],[466,7,466,8],[466,12,466,13],[467,2,467,3],[467,7,467,8],[467,12,467,13],[476,2,476,3],[476,7,476,8],[476,12,476,13],[477,2,477,3],[477,7,477,8],[477,12,477,13],[474,2,474,3],[474,7,474,8],[474,12,474,13],[475,2,475,3],[475,7,475,8],[475,12,475,13],[472,2,472,3],[472,7,472,8],[472,12,472,13],[473,2,473,3],[473,7,473,8],[473,12,473,13],[482,2,482,3],[482,7,483,8],[482,9,482,11],[482,12,482,13],[483,2,483,3],[483,12,483,13],[480,2,480,3],[480,7,480,8],[480,12,480,13],[481,2,481,3],[481,7,481,11],[481,12,481,13],[478,2,478,3],[478,7,478,8],[478,12,478,13],[479,2,479,3],[479,7,479,8],[479,12,479,13],[488,2,489,3],[488,4,488,6],[488,7,489,8],[488,12,488,13],[489,12,489,13],[490,2,490,3],[490,7,490,8],[490,12,490,13],[486,2,486,3],[486,7,486,8],[486,12,487,13],[486,14,486,16],[487,2,487,6],[487,7,487,9],[484,2,484,3],[484,7,484,8],[484,12,484,13],[485,2,485,3],[485,7,485,8],[485,12,485,16],[497,2,497,3],[497,7,497,8],[497,12,497,13],[498,2,498,3],[498,7,498,8],[498,12,498,13],[494,2,495,3],[494,7,494,8],[494,12,494,13],[495,7,495,8],[495,12,495,13],[496,2,496,3],[496,7,496,8],[496,12,496,13],[491,2,491,3],[491,7,491,8],[491,12,491,14],[492,2,492,3],[492,7,492,8],[492,12,493,13],[493,2,493,4],[493,7,493,8],[503,2,503,3],[503,7,503,8],[503,12,503,13],[504,2,504,3],[504,7,504,8],[504,12,504,13],[501,2,501,3],[501,7,501,8],[501,12,501,13],[502,2,502,3],[502,7,502,8],[502,12,502,13],[499,2,499,3],[499,7,499,8],[499,12,499,13],[500,2,500,3],[500,7,500,8],[500,12,500,13],[509,2,509,3],[509,7,509,8],[509,12,509,13],[510,2,510,3],[510,7,510,8],[510,12,510,13],[507,2,507,3],[507,7,507,8],[507,12,507,13],[508,2,508,3],[508,7,508,8],[508,12,508,13],[505,2,505,3],[505,7,505,8],[505,12,505,13],[506,2,506,3],[506,7,506,8],[506,12,506,13],[515,2,515,3],[515,7,515,8],[515,12,515,13],[516,2,516,3],[516,7,516,8],[516,12,516,13],[513,2,513,3],[513,7,513,8],[513,12,513,13],[514,2,514,3],[514,7,514,8],[514,12,514,13],[511,2,511,3],[511,7,511,8],[511,12,511,13],[512,2,512,3],[512,7,512,8],[512,12,512,13],[521,2,521,3],[521,7,521,8],[521,12,521,13],[522,2,522,3],[522,7,522,8],[522,12,522,13],[519,2,519,3],[519,7,519,8],[519,12,519,13],[520,2,520,3],[520,7,520,8],[520,12,520,13],[517,2,517,3],[517,7,517,8],[517,12,517,13],[518,2,518,3],[518,7,518,8],[518,12,518,13],[527,2,527,3],[527,7,527,8],[527,12,527,13],[528,2,528,3],[528,7,528,9],[528,12,528,13],[525,2,525,3],[525,7,525,8],[525,12,525,13],[526,2,526,3],[526,7,526,8],[526,12,526,13],[523,2,523,3],[523,7,523,8],[523,12,523,13],[524,2,524,3],[524,7,524,8],[524,12,524,13],[533,2,533,3],[533,7,533,8],[533,12,533,13],[534,2,534,3],[534,7,534,8],[534,12,534,14],[531,2,531,3],[531,7,531,8],[531,12,531,13],[532,2,532,3],[532,7,532,8],[532,12,532,13],[529,2,529,3],[529,7,529,8],[529,12,529,13],[530,2,530,3],[530,7,530,8],[530,12,530,13],[539,2,539,3],[539,7,539,8],[539,12,539,13],[540,2,540,3],[540,7,540,8],[540,12,540,13],[537,2,537,4],[537,7,537,8],[537,12,537,13],[538,2,538,3],[538,7,538,8],[538,12,538,13],[535,2,535,3],[535,7,535,8],[535,12,535,13],[536,2,536,3],[536,7,536,8],[536,12,536,13],[545,2,545,3],[545,7,545,8],[545,12,545,13],[546,2,546,3],[546,7,546,8],[546,12,546,13],[543,2,543,3],[543,7,543,8],[543,12,543,13],[544,2,544,3],[544,7,544,8],[544,12,544,13],[541,2,541,3],[541,7,541,8],[541,12,541,13],[542,2,542,3],[542,7,542,8],[542,12,542,13],[551,2,551,3],[551,7,551,8],[551,12,551,13],[552,2,552,3],[552,7,552,8],[552,12,552,13],[549,2,549,3],[549,7,549,8],[549,12,549,13],[550,2,550,3],[550,7,550,8],[550,12,550,13],[547,2,547,3],[547,7,547,8],[547,12,547,13],[548,2,548,3],[548,7,548,8],[548,12,548,13],[557,2,557,3],[557,7,557,8],[557,12,557,13],[558,2,558,3],[558,7,558,8],[558,12,558,13],[555,2,555,3],[555,7,555,8],[555,12,555,13],[556,2,556,3],[556,7,556,8],[556,12,556,13],[553,2,553,3],[553,7,553,8],[553,12,553,13],[554,2,554,3],[554,7,554,8],[554,12,554,13],[563,2,563,3],[563,7,563,8],[563,12,563,13],[564,2,564,3],[564,7,564,8],[564,12,564,13],[561,2,561,3],[561,7,561,8],[561,12,561,13],[562,2,562,3],[562,7,562,8],[562,12,562,13],[559,2,559,3],[559,7,559,8],[559,12,559,13],[560,2,560,3],[560,7,560,8],[560,12,560,13],[569,2,569,3],[569,7,569,8],[569,12,569,13],[570,2,570,3],[570,7,570,8],[570,12,570,13],[567,2,567,3],[567,7,567,8],[567,12,567,13],[568,2,568,3],[568,7,568,8],[568,12,568,13],[565,2,565,3],[565,7,565,8],[565,12,565,13],[566,2,566,3],[566,7,566,8],[566,12,566,13],[575,2,575,3],[575,7,575,8],[575,12,575,13],[576,2,576,3],[576,7,576,8],[576,12,576,13],[573,2,573,3],[573,7,573,8],[573,12,573,13],[574,2,574,3],[574,7,574,8],[574,12,574,13],[571,2,571,3],[571,7,571,8],[571,12,571,13],[572,2,572,3],[572,7,572,8],[572,12,572,13],[581,2,581,3],[581,7,581,8],[581,12,581,13],[582,2,582,3],[582,7,582,8],[582,12,582,13],[579,2,579,3],[579,7,579,8],[579,12,579,13],[580,2,580,3],[580,7,580,8],[580,12,580,13],[577,2,577,3],[577,7,577,8],[577,12,577,13],[578,2,578,3],[578,7,578,8],[578,12,578,13],[587,2,587,3],[587,7,587,8],[587,12,587,13],[588,2,588,3],[588,7,588,8],[588,12,588,13],[585,2,585,3],[585,7,585,8],[585,12,585,13],[586,2,586,3],[586,7,586,8],[586,12,586,13],[583,2,583,3],[583,7,583,8],[583,12,583,13],[584,2,584,3],[584,7,584,8],[584,12,584,13],[593,2,593,3],[593,7,593,8],[593,12,593,13],[594,2,594,3],[594,7,594,8],[594,12,594,13],[591,2,591,3],[591,7,591,8],[591,12,591,13],[592,2,592,3],[592,7,592,8],[592,12,592,13],[589,2,589,3],[589,7,589,8],[589,12,589,13],[590,2,590,3],[590,7,590,8],[590,12,590,13],[599,2,599,3],[599,7,599,8],[599,12,599,13],[600,2,600,3],[600,7,600,8],[600,12,600,13],[597,2,597,3],[597,7,597,8],[597,12,597,13],[598,2,598,3],[598,7,598,8],[598,12,598,13],[595,2,595,3],[595,7,595,8],[595,12,595,13],[596,2,596,3],[596,7,596,8],[596,12,596,13],[605,2,605,3],[605,7,605,8],[605,12,605,13],[606,2,606,3],[606,7,606,8],[606,12,606,13],[603,2,603,3],[603,7,603,8],[603,12,603,13],[604,2,604,3],[604,7,604,8],[604,12,604,13],[601,2,601,3],[601,7,601,8],[601,12,601,13],[602,2,602,3],[602,7,602,8],[602,12,602,13],[611,2,611,3],[611,7,611,8],[611,12,611,13],[612,2,612,3],[612,7,612,8],[612,12,612,13],[609,2,609,3],[609,7,609,8],[609,12,609,13],[610,2,610,3],[610,7,610,8],[610,12,610,13],[607,2,607,3],[607,7,607,8],[607,12,607,13],[608,2,608,3],[608,7,608,8],[608,12,608,13],[617,2,617,3],[617,7,617,8],[617,12,617,13],[618,2,618,3],[618,7,618,8],[618,12,618,13],[615,2,615,3],[615,7,615,8],[615,12,615,13],[616,2,616,3],[616,7,616,8],[616,12,616,13],[613,2,613,3],[613,7,613,8],[613,12,613,13],[614,2,614,3],[614,7,614,8],[614,12,614,13],[623,2,623,3],[623,7,623,8],[623,12,623,13],[624,2,624,3],[624,7,624,8],[624,12,624,13],[621,2,621,3],[621,7,621,8],[621,12,621,13],[622,2,622,3],[622,7,622,8],[622,12,622,13],[619,2,619,3],[619,7,619,8],[619,12,619,13],[620,2,620,3],[620,7,620,8],[620,12,620,13],[629,2,629,3],[629,7,629,8],[629,12,629,13],[630,2,630,3],[630,7,630,8],[630,12,630,13],[627,2,627,3],[627,7,627,8],[627,12,627,13],[628,2,628,3],[628,7,628,8],[628,12,628,13],[625,2,625,3],[625,7,625,8],[625,12,625,13],[626,2,626,3],[626,7,626,8],[626,12,626,13],[635,2,635,3],[635,7,635,8],[635,12,635,13],[636,2,636,3],[636,7,636,8],[636,12,636,13],[633,2,633,3],[633,7,633,8],[633,12,633,13],[634,2,634,3],[634,7,634,8],[634,12,634,13],[631,2,631,3],[631,7,631,8],[631,12,631,13],[632,2,632,3],[632,7,632,8],[632,12,632,13],[641,2,641,3],[641,7,641,8],[641,12,641,13],[642,2,642,3],[642,7,642,8],[642,12,642,13],[639,2,639,3],[639,7,639,8],[639,12,639,13],[640,2,640,3],[640,7,640,8],[640,12,640,13],[637,2,637,3],[637,7,637,8],[637,12,637,13],[638,2,638,3],[638,7,638,8],[638,12,638,13],[647,2,647,3],[647,7,647,8],[647,12,647,13],[648,2,648,3],[648,7,648,8],[648,12,648,13],[645,2,645,3],[645,7,645,8],[645,12,645,13],[646,2,646,3],[646,7,646,8],[646,12,646,13],[643,2,643,3],[643,7,643,8],[643,12,643,13],[644,2,644,3],[644,7,644,8],[644,12,644,13],[653,2,653,3],[653,7,653,8],[653,12,653,13],[654,2,654,3],[654,7,654,8],[654,12,654,13],[651,2,651,3],[651,7,651,8],[651,12,651,13],[652,2,652,3],[652,7,652,8],[652,12,652,13],[649,2,649,3],[649,7,649,8],[649,12,649,13],[650,2,650,3],[650,7,650,8],[650,12,650,13],[659,2,659,3],[659,7,659,8],[659,12,659,13],[660,2,660,3],[660,7,660,8],[660,12,660,13],[657,2,657,3],[657,7,657,8],[657,12,657,13],[658,2,658,3],[658,7,658,8],[658,12,658,13],[655,2,655,3],[655,7,655,8],[655,12,655,13],[656,2,656,3],[656,7,656,8],[656,12,656,13],[665,2,665,3],[665,7,665,8],[665,12,665,13],[666,2,666,3],[666,7,666,8],[666,12,666,13],[663,2,663,3],[663,7,663,8],[663,12,663,13],[664,2,664,3],[664,7,664,8],[664,12,664,13],[661,2,661,3],[661,7,661,8],[661,12,661,13],[662,2,662,3],[662,7,662,8],[662,12,662,13],[671,2,671,3],[671,7,671,8],[671,12,671,13],[672,2,672,3],[672,7,672,8],[672,12,672,13],[669,2,669,3],[669,7,669,8],[669,12,669,13],[670,2,670,3],[670,7,670,8],[670,12,670,13],[667,2,667,3],[667,7,667,8],[667,12,667,13],[668,2,668,3],[668,7,668,8],[668,12,668,13],[677,2,677,3],[677,7,677,8],[677,12,677,13],[678,2,678,3],[678,7,678,8],[678,12,678,13],[675,2,675,3],[675,7,675,8],[675,12,675,13],[676,2,676,3],[676,7,676,8],[676,12,676,13],[673,2,673,3],[673,7,673,8],[673,12,673,13],[674,2,674,3],[674,7,674,8],[674,12,674,13],[683,2,683,3],[683,7,683,8],[683,12,683,13],[684,2,684,3],[684,7,684,8],[684,12,684,13],[681,2,681,3],[681,7,681,8],[681,12,681,13],[682,2,682,3],[682,7,682,8],[682,12,682,13],[679,2,679,3],[679,7,679,8],[679,12,679,13],[680,2,680,3],[680,7,680,8],[680,12,680,13],[689,2,689,3],[689,7,689,8],[689,12,689,13],[690,2,690,3],[690,7,690,8],[690,12,690,13],[687,2,687,3],[687,7,687,8],[687,12,687,13],[688,2,688,3],[688,7,688,8],[688,12,688,13],[685,2,685,3],[685,7,685,8],[685,12,685,13],[686,2,686,3],[686,7,686,8],[686,12,686,13],[695,2,695,3],[695,7,695,8],[695,12,695,13],[696,2,696,3],[696,7,696,8],[696,12,696,13],[693,2,693,3],[693,7,693,8],[693,12,693,13],[694,2,694,3],[694,7,694,8],[694,12,694,13],[691,2,691,3]],"merged_total":1311,"flags":["merged_cut"]}
[]
[{"$f":"A1026","v":"Saint Lucia"}]
[{"$f":"A1034","v":2005}]
["Use of drinking water sources"]
[" by wealth quintile and sub-national region"]
["Notes:"]
["WHO/UNICEF JMP customised wealth index excludes water,"]
[" sanitation and hygiene assets."]
["Survey used for analysis:",{"$f":"A1025","v":0}]
[{"$f":"B1028","v":0}]
[{"$f":"B1027","v":0}]
[]
[]
["Use of drinking water sources",null,"NATIONAL wealth index quintile",null,null,null,null,"URBAN wealth index quintile",null,null,null,null,"RURAL wealth index quintile",null,null,null,null,null,null,null,null,null,null,null,null,null,null,null,null,null,null,null,null,null,null,null,null,null,null,null,null,null,null,null,null,null,null,null,null,null,null,null,"Raw numbers of respondents:","Use of drinking water sources","NATIONAL wealth index quintile",null,null,null,null,"URBAN wealth index quintile",null,null,null,null,"RURAL wealth index quintile"]
["Weighted percentage (used in graphs)",null,"Poorest","Poor","Middle","Rich","Richest","Poorest","Poor","Middle","Rich","Richest","Poorest","Poor","Middle","Rich","Richest",null,null,null,null,null,null,null,null,null,null,null,null,null,null,null,null,null,null,null,null,null,null,null,null,null,null,null,null,null,null,null,null,null,null,null,"Water data, raw numbers (weighted)",null,"Poorest","Poor","Middle","Rich","Richest","Poorest","Poor","Middle","Rich","Richest","Poorest","Poor","Middle","Rich","Richest"]
["Water","Improved",{"$f":"C58+C59+C60+C61+C62+C63*MICS12!C24/100","v":87.343199124750683},{"$f":"D58+D59+D60+D61+D62+D63*MICS12!D24/100","v":96.666666666666671},{"$f":"E58+E59+E60+E61+E62+E63*MICS12!E24/100","v":96.202519091540239},{"$f":"F58+F59+F60+F61+F62+F63*MICS12!F24/100","v":99.098470377030424},{"$f":"G58+G59+G60+G61+G62+G63*MICS12!G24/100","v":100},{"$f":"H58+H59+H60+H61+H62+H63*MICS12!H24/100","v":92.857142857142847},{"$f":"I58+I59+I60+I61+I62+I63*MICS12!I24/100","v":95.348837209302332},{"$f":"J58+J59+J60+J61+J62+J63*MICS12!J24/100","v":99.999999999999986},{"$f":"K58+K59+K60+K61+K62+K63*MICS12!K24/100","v":100},{"$f":"L58+L59+L60+L61+L62+L63*MICS12!L24/100","v":100},{"$f":"M58+M59+M60+M61+M62+M63*MICS12!M24/100","v":85.497736267269318},{"$f":"N58+N59+N60+N61+N62+N63*MICS12!N24/100","v":94.805194805194802},{"$f":"O58+O59+O60+O61+O62+O63*MICS12!O24/100","v":96.72182424339519},{"$f":"P58+P59+P60+P61+P62+P63*MICS12!P24/100","v":97.402597402597394},{"$f":"Q58+Q59+Q60+Q61+Q62+Q63*MICS12!Q24/100","v":100},null,null,null,null,null,null,null,null,null,null,null,null,null,null,null,null,null,null,null,null,null,null,null,null,null,null,null,null,null,null,null,null,null,null,null,"Water","Improved","N/A","N/A","N/A","N/A","N/A","N/A","N/A","N/A","N/A","N/A","N/A","N/A","N/A","N/A","N/A"]
[null,"Not Improved",{"$f":"100-C16","v":12.656800875249317},{"$f":"100-D16","v":3.3333333333333286},3.7974809084597609,0.90152962296957639,0,7.142857142857153,4.6511627906976685,0,0,0,14.502263732730682,5.1948051948051983,3.27817575660481,2.5974025974026063,0,null,null,null,null,null,null,null,null,null,null,null,null,null,null,null,null,null,null,null,null,null,null,null,null,null,null,null,null,null,null,null,null,null,null,null,null,"Not Improved","N/A","N/A","N/A","N/A","N/A","N/A","N/A","N/A","N/A","N/A","N/A","N/A","N/A","N/A","N/A"]
["Water ladder","Basic",{"$f":"C16*MICS12!C23/100","v":87.045628164344947},{"$f":"D16*MICS12!D23/100","v":96.666666666666686},{"$f":"E16*MICS12!E23/100","v":96.202519091540239},{"$f":"F16*MICS12!F23/100","v":99.098470377030424},{"$f":"G16*MICS12!G23/100","v":99.854325464002287},{"$f":"H16*MICS12!H23/100","v":92.547454753070028},{"$f":"I16*MICS12!I23/100","v":95.348837209302332},{"$f":"J16*MICS12!J23/100","v":99.999999999999986},{"$f":"K16*MICS12!K23/100","v":100},{"$f":"L16*MICS12!L23/100","v":99.238230271170707},{"$f":"M16*MICS12!M23/100","v":85.203299469543694},{"$f":"N16*MICS12!N23/100","v":94.805194805194802},{"$f":"O16*MICS12!O23/100","v":96.72182424339519},{"$f":"P16*MICS12!P23/100","v":97.40259740259738},{"$f":"Q16*MICS12!Q23/100","v":100},null,null,null,null,null,null,null,null,null,null,null,null,null,null,null,null,null,null,null,null,null,null,null,null,null,null,null,null,null,null,null,null,null,null,null,"Water ladder","Basic","N/A","N/A","N/A","N/A","N/A","N/A","N/A","N/A","N/A","N/A","N/A","N/A","N/A","N/A","N/A"]
[null,"Limited",{"$f":"C16*MICS12!C22/100","v":0.29757096040574177},{"$f":"D16*MICS12!D22/100","v":0},{"$f":"E16*MICS12!E22/100","v":0},{"$f":"F16*MICS12!F22/100","v":0},{"$f":"G16*MICS12!G22/100","v":0.14567453599772218},{"$f":"H16*MICS12!H22/100","v":0.30968810407282044},{"$f":"I16*MICS12!I22/100","v":0},{"$f":"J16*MICS12!J22/100","v":0},{"$f":"K16*MICS12!K22/100","v":0},{"$f":"L16*MICS12!L22/100","v":0.7617697288292804},{"$f":"M16*MICS12!M22/100","v":0.29443679772561299},{"$f":"N16*MICS12!N22/100","v":0},{"$f":"O16*MICS12!O22/100","v":0},{"$f":"P16*MICS12!P22/100","v":0},{"$f":"Q16*MICS12!Q22/100","v":0},null,null,null,null,null,null,null,null,null,null,null,null,null,null,null,null,null,null,null,null,null,null,null,null,null,null,null,null,null,null,null,null,null,null,null,null,"Limited","N/A","N/A","N/A","N/A","N/A","N/A","N/A","N/A","N/A","N/A","N/A","N/A","N/A","N/A","N/A"]
[null,"Unimproved",{"$f":"100-(C18+C19+C21)","v":12.656800875249317},{"$f":"100-(D18+D19+D21)","v":3.3333333333333144},3.7974809084597609,0.90152962296957639,0,7.142857142857153,4.6511627906976685,0,0,0,14.502263732730697,5.1948051948051983,3.27817575660481,2.5974025974026205,0,null,null,null,null,null,null,null,null,null,null,null,null,null,null,null,null,null,null,null,null,null,null,null,null,null,null,null,null,null,null,null,null,null,null,null,null,"Unimproved","N/A","N/A","N/A","N/A","N/A","N/A","N/A","N/A","N/A","N/A","N/A","N/A","N/A","N/A","N/A"]
[null,"Surface water",0,0,0,0,0,0,0,0,0,0,0,0,0,0,0,null,null,null,null,null,null,null,null,null,null,null,null,null,null,null,null,null,null,null,null,null,null,null,null,null,null,null,null,null,null,null,null,null,null,null,null,"Surface water","N/A","N/A","N/A","N/A","N/A","N/A","N/A","N/A","N/A","N/A","N/A","N/A","N/A","N/A","N/A"]
["Improved water point at more than 30 minutes","Yes","N/A","N/A","N/A","N/A","N/A","N/A","N/A","N/A","N/A","N/A","N/A","N/A","N/A","N/A","N/A",null,null,null,null,null,null,null,null,null,null,null,null,null,null,null,null,null,null,null,null,null,null,null,null,null,null,null,null,null,null,null,null,null,null,null,"Improved water point at more than 30 minutes","Yes","N/A","N/A","N/A","N/A","N/A","N/A","N/A","N/A","N/A","N/A","N/A","N/A","N/A","N/A","N/A"]
[null,"No","N/A","N/A","N/A","N/A","N/A","N/A","N/A","N/A","N/A","N/A","N/A","N/A","N/A","N/A","N/A",null,null,null,null,null,null,null,null,null,null,null,null,null,null,null,null,null,null,null,null,null,null,null,null,null,null,null,null,null,null,null,null,null,null,null,null,"No","N/A","N/A","N/A","N/A","N/A","N/A","N/A","N/A","N/A","N/A","N/A","N/A","N/A","N/A","N/A"]
["Manually calculated ratios","Improved wells"]
[null,"Improved springs"]
[null,"Other"]
[null,null,"NATIONAL wealth index quintile",null,null,null,null,"URBAN wealth index quintile",null,null,null,null,"RURAL wealth index quintile",null,null,null,null,null,null,null,null,null,null,null,null,null,null,null,null,null,null,null,null,null,null,null,null,null,null,null,null,null,null,null,null,null,null,null,null,null,null,null,"Raw numbers of respondents:","Use of drinking water sources","NATIONAL wealth index quintile",null,null,null,null,"URBAN wealth index quintile",null,null,null,null,"RURAL wealth index quintile"]
["Percentage based on weighted population",null,"Poorest","Poor","Middle","Rich","Richest","Poorest","Poor","Middle","Rich","Richest","Poorest","Poor","Middle","Rich","Richest",null,null,null,null,null,null,null,null,null,null,null,null,null,null,null,null,null,null,null,null,null,null,null,null,null,null,null,null,null,null,null,null,null,null,null,"Water data, raw numbers (weighted)",null,"Poorest","Poor","Middle","Rich","Richest","Poorest","Poor","Middle","Rich","Richest","Poorest","Poor","Middle","Rich","Richest"]
["Piped water","Yes","N/A","N/A","N/A","N/A","N/A","N/A","N/A","N/A","N/A","N/A","N/A","N/A","N/A","N/A","N/A",null,null,null,null,null,null,null,null,null,null,null,null,null,null,null,null,null,null,null,null,null,null,null,null,null,null,null,null,null,null,null,null,null,null,null,"Piped water","Yes","N/A","N/A","N/A","N/A","N/A","N/A","N/A","N/A","N/A","N/A","N/A","N/A","N/A","N/A","N/A"]
[null,"No","N/A","N/A","N/A","N/A","N/A","N/A","N/A","N/A","N/A","N/A","N/A","N/A","N/A","N/A","N/A",null,null,null,null,null,null,null,null,null,null,null,null,null,null,null,null,null,null,null,null,null,null,null,null,null,null,null,null,null,null,null,null,null,null,null,null,"No","N/A","N/A","N/A","N/A","N/A","N/A","N/A","N/A","N/A","N/A","N/A","N/A","N/A","N/A","N/A"]
["Piped water on premises","Yes","N/A","N/A","N/A","N/A","N/A","N/A","N/A","N/A","N/A","N/A","N/A","N/A","N/A","N/A","N/A",null,null,null,null,null,null,null,null,null,null,null,null,null,null,null,null,null,null,null,null,null,null,null,null,null,null,null,null,null,null,null,null,null,null,null,"Piped water on premises","Yes","N/A","N/A","N/A","N/A","N/A","N/A","N/A","N/A","N/A","N/A","N/A","N/A","N/A","N/A","N/A"]
[null,"No","N/A","N/A","N/A","N/A","N/A","N/A","N/A","N/A","N/A","N/A","N/A","N/A","N/A","N/A","N/A",null,null,null,null,null,null,null,null,null,null,null,null,null,null,null,null,null,null,null,null,null,null,null,null,null,null,null,null,null,null,null,null,null,null,null,null,"No","N/A","N/A","N/A","N/A","N/A","N/A","N/A","N/A","N/A","N/A","N/A","N/A","N/A","N/A","N/A"]
["Piped water into dwelling","Yes","N/A","N/A","N/A","N/A","N/A","N/A","N/A","N/A","N/A","N/A","N/A","N/A","N/A","N/A","N/A",null,null,null,null,null,null,null,null,null,null,null,null,null,null,null,null,null,null,null,null,null,null,null,null,null,null,null,null,null,null,null,null,null,null,null,"Piped water into dwelling","Yes","N/A","N/A","N/A","N/A","N/A","N/A","N/A","N/A","N/A","N/A","N/A","N/A","N/A","N/A","N/A"]
[null,"No","N/A","N/A","N/A","N/A","N/A","N/A","N/A","N/A","N/A","N/A","N/A","N/A","N/A","N/A","N/A",null,null,null,null,null,null,null,null,null,null,null,null,null,null,null,null,null,null,null,null,null,null,null,null,null,null,null,null,null,null,null,null,null,null,null,null,"No","N/A","N/A","N/A","N/A","N/A","N/A","N/A","N/A","N/A","N/A","N/A","N/A","N/A","N/A","N/A"]
["Water source on premises","Yes","N/A","N/A","N/A","N/A","N/A","N/A","N/A","N/A","N/A","N/A","N/A","N/A","N/A","N/A","N/A",null,null,null,null,null,null,null,null,null,null,null,null,null,null,null,null,null,null,null,null,null,null,null,null,null,null,null,null,null,null,null,null,null,null,null,"Water source on premises","Yes","N/A","N/A","N/A","N/A","N/A","N/A","N/A","N/A","N/A","N/A","N/A","N/A","N/A","N/A","N/A"]
[null,"No","N/A","N/A","N/A","N/A","N/A","N/A","N/A","N/A","N/A","N/A","N/A","N/A","N/A","N/A","N/A",null,null,null,null,null,null,null,null,null,null,null,null,null,null,null,null,null,null,null,null,null,null,null,null,null,null,null,null,null,null,null,null,null,null,null,null,"No","N/A","N/A","N/A","N/A","N/A","N/A","N/A","N/A","N/A","N/A","N/A","N/A","N/A","N/A","N/A"]
["Improved Water source on premises","Yes","N/A","N/A","N/A","N/A","N/A","N/A","N/A","N/A","N/A","N/A","N/A","N/A","N/A","N/A","N/A",null,null,null,null,null,null,null,null,null,null,null,null,null,null,null,null,null,null,null,null,null,null,null,null,null,null,null,null,null,null,null,null,null,null,null,"Improved water source on premises","Yes","N/A","N/A","N/A","N/A","N/A","N/A","N/A","N/A","N/A","N/A","N/A","N/A","N/A","N/A","N/A"]
[null,"No","N/A","N/A","N/A","N/A","N/A","N/A","N/A","N/A","N/A","N/A","N/A","N/A","N/A","N/A","N/A",null,null,null,null,null,null,null,null,null,null,null,null,null,null,null,null,null,null,null,null,null,null,null,null,null,null,null,null,null,null,null,null,null,null,null,null,"No","N/A","N/A","N/A","N/A","N/A","N/A","N/A","N/A","N/A","N/A","N/A","N/A","N/A","N/A","N/A"]
["Piped water on premises available when needed","Yes","N/A","N/A","N/A","N/A","N/A","N/A","N/A","N/A","N/A","N/A","N/A","N/A","N/A","N/A","N/A",null,null,null,null,null,null,null,null,null,null,null,null,null,null,null,null,null,null,null,null,null,null,null,null,null,null,null,null,null,null,null,null,null,null,null,"Piped water on premises available when needed","Yes","N/A","N/A","N/A","N/A","N/A","N/A","N/A","N/A","N/A","N/A","N/A","N/A","N/A","N/A","N/A"]
[null,"No","N/A","N/A","N/A","N/A","N/A","N/A","N/A","N/A","N/A","N/A","N/A","N/A","N/A","N/A","N/A",null,null,null,null,null,null,null,null,null,null,null,null,null,null,null,null,null,null,null,null,null,null,null,null,null,null,null,null,null,null,null,null,null,null,null,null,"No","N/A","N/A","N/A","N/A","N/A","N/A","N/A","N/A","N/A","N/A","N/A","N/A","N/A","N/A","N/A"]
["Water point at more than 30 minutes","Yes","N/A","N/A","N/A","N/A","N/A","N/A","N/A","N/A","N/A","N/A","N/A","N/A","N/A","N/A","N/A",null,null,null,null,null,null,null,null,null,null,null,null,null,null,null,null,null,null,null,null,null,null,null,null,null,null,null,null,null,null,null,null,null,null,null,"Water point at more than 30 minutes","Yes","N/A","N/A","N/A","N/A","N/A","N/A","N/A","N/A","N/A","N/A","N/A","N/A","N/A","N/A","N/A"]
[null,"No","N/A","N/A","N/A","N/A","N/A","N/A","N/A","N/A","N/A","N/A","N/A","N/A","N/A","N/A","N/A",null,null,null,null,null,null,null,null,null,null,null,null,null,null,null,null,null,null,null,null,null,null,null,null,null,null,null,null,null,null,null,null,null,null,null,null,"No","N/A","N/A","N/A","N/A","N/A","N/A","N/A","N/A","N/A","N/A","N/A","N/A","N/A","N/A","N/A"]
["Water source available when needed","Yes","N/A","N/A","N/A","N/A","N/A","N/A","N/A","N/A","N/A","N/A","N/A","N/A","N/A","N/A","N/A",null,null,null,null,null,null,null,null,null,null,null,null,null,null,null,null,null,null,null,null,null,null,null,null,null,null,null,null,null,null,null,null,null,null,null,"Water source available when needed","Yes","N/A","N/A","N/A","N/A","N/A","N/A","N/A","N/A","N/A","N/A","N/A","N/A","N/A","N/A","N/A"]
[null,"No","N/A","N/A","N/A","N/A","N/A","N/A","N/A","N/A","N/A","N/A","N/A","N/A","N/A","N/A","N/A",null,null,null,null,null,null,null,null,null,null,null,null,null,null,null,null,null,null,null,null,null,null,null,null,null,null,null,null,null,null,null,null,null,null,null,null,"No","N/A","N/A","N/A","N/A","N/A","N/A","N/A","N/A","N/A","N/A","N/A","N/A","N/A","N/A","N/A"]
["Improved water source available when needed","Yes","N/A","N/A","N/A","N/A","N/A","N/A","N/A","N/A","N/A","N/A","N/A","N/A","N/A","N/A","N/A",null,null,null,null,null,null,null,null,null,null,null,null,null,null,null,null,null,null,null,null,null,null,null,null,null,null,null,null,null,null,null,null,null,null,null,"Improved water source available when needed","Yes","N/A","N/A","N/A","N/A","N/A","N/A","N/A","N/A","N/A","N/A","N/A","N/A","N/A","N/A","N/A"]
[null,"No","N/A","N/A","N/A","N/A","N/A","N/A","N/A","N/A","N/A","N/A","N/A","N/A","N/A","N/A","N/A",null,null,null,null,null,null,null,null,null,null,null,null,null,null,null,null,null,null,null,null,null,null,null,null,null,null,null,null,null,null,null,null,null,null,null,null,"No","N/A","N/A","N/A","N/A","N/A","N/A","N/A","N/A","N/A","N/A","N/A","N/A","N/A","N/A","N/A"]
["Microbiological quality at point of collection","Not contaminated (No E. coli in 100 mL)","N/A","N/A","N/A","N/A","N/A","N/A","N/A","N/A","N/A","N/A","N/A","N/A","N/A","N/A","N/A",null,null,null,null,null,null,null,null,null,null,null,null,null,null,null,null,null,null,null,null,null,null,null,null,null,null,null,null,null,null,null,null,null,null,null,"Microbiological quality at point of collection","Not contaminated (No E. coli in 100 mL)","N/A","N/A","N/A","N/A","N/A","N/A","N/A","N/A","N/A","N/A","N/A","N/A","N/A","N/A","N/A"]
[null,"Contaminated (E. coli detected in 100 mL)","N/A","N/A","N/A","N/A","N/A","N/A","N/A","N/A","N/A","N/A","N/A","N/A","N/A","N/A","N/A",null,null,null,null,null,null,null,null,null,null,null,null,null,null,null,null,null,null,null,null,null,null,null,null,null,null,null,null,null,null,null,null,null,null,null,null,"Contaminated (E. coli detected in 100 mL)","N/A","N/A","N/A","N/A","N/A","N/A","N/A","N/A","N/A","N/A","N/A","N/A","N/A","N/A","N/A"]
[null,"Highly contaminated (>100 CFU/100 mL)","N/A","N/A","N/A","N/A","N/A","N/A","N/A","N/A","N/A","N/A","N/A","N/A","N/A","N/A","N/A",null,null,null,null,null,null,null,null,null,null,null,null,null,null,null,null,null,null,null,null,null,null,null,null,null,null,null,null,null,null,null,null,null,null,null,null,"Highly contaminated (>100 CFU/100 mL)","N/A","N/A","N/A","N/A","N/A","N/A","N/A","N/A","N/A","N/A","N/A","N/A","N/A","N/A","N/A"]
["Microbiological quality of improved water sources at point of collection","Not contaminated (No E. coli in 100 mL)","N/A","N/A","N/A","N/A","N/A","N/A","N/A","N/A","N/A","N/A","N/A","N/A","N/A","N/A","N/A",null,null,null,null,null,null,null,null,null,null,null,null,null,null,null,null,null,null,null,null,null,null,null,null,null,null,null,null,null,null,null,null,null,null,null,"Microbiological quality of improved water sources at point of collection","Not contaminated (No E. coli in 100 mL)","N/A","N/A","N/A","N/A","N/A","N/A","N/A","N/A","N/A","N/A","N/A","N/A","N/A","N/A","N/A"]
[null,"Contaminated (E. coli detected in 100 mL)","N/A","N/A","N/A","N/A","N/A","N/A","N/A","N/A","N/A","N/A","N/A","N/A","N/A","N/A","N/A",null,null,null,null,null,null,null,null,null,null,null,null,null,null,null,null,null,null,null,null,null,null,null,null,null,null,null,null,null,null,null,null,null,null,null,null,"Contaminated (E. coli detected in 100 mL)","N/A","N/A","N/A","N/A","N/A","N/A","N/A","N/A","N/A","N/A","N/A","N/A","N/A","N/A","N/A"]
[null,"Highly contaminated (>100 CFU/100 mL)","N/A","N/A","N/A","N/A","N/A","N/A","N/A","N/A","N/A","N/A","N/A","N/A","N/A","N/A","N/A",null,null,null,null,null,null,null,null,null,null,null,null,null,null,null,null,null,null,null,null,null,null,null,null,null,null,null,null,null,null,null,null,null,null,null,null,"Highly contaminated (>100 CFU/100 mL)","N/A","N/A","N/A","N/A","N/A","N/A","N/A","N/A","N/A","N/A","N/A","N/A","N/A","N/A","N/A"]
["Microbiological quality of piped on premises at point of collection","Not contaminated (No E. coli in 100 mL)","N/A","N/A","N/A","N/A","N/A","N/A","N/A","N/A","N/A","N/A","N/A","N/A","N/A","N/A","N/A",null,null,null,null,null,null,null,null,null,null,null,null,null,null,null,null,null,null,null,null,null,null,null,null,null,null,null,null,null,null,null,null,null,null,null,"Microbiological quality of piped on premises at point of collection","Not contaminated (No E. coli in 100 mL)","N/A","N/A","N/A","N/A","N/A","N/A","N/A","N/A","N/A","N/A","N/A","N/A","N/A","N/A","N/A"]
[null,"Contaminated (E. coli detected in 100 mL)","N/A","N/A","N/A","N/A","N/A","N/A","N/A","N/A","N/A","N/A","N/A","N/A","N/A","N/A","N/A",null,null,null,null,null,null,null,null,null,null,null,null,null,null,null,null,null,null,null,null,null,null,null,null,null,null,null,null,null,null,null,null,null,null,null,null,"Contaminated (E. coli detected in 100 mL)","N/A","N/A","N/A","N/A","N/A","N/A","N/A","N/A","N/A","N/A","N/A","N/A","N/A","N/A","N/A"]
[null,"Highly contaminated (>100 CFU/100 mL)","N/A","N/A","N/A","N/A","N/A","N/A","N/A","N/A","N/A","N/A","N/A","N/A","N/A","N/A","N/A",null,null,null,null,null,null,null,null,null,null,null,null,null,null,null,null,null,null,null,null,null,null,null,null,null,null,null,null,null,null,null,null,null,null,null,null,"Highly contaminated (>100 CFU/100 mL)","N/A","N/A","N/A","N/A","N/A","N/A","N/A","N/A","N/A","N/A","N/A","N/A","N/A","N/A","N/A"]
[null,null,"NATIONAL wealth index quintile",null,null,null,null,"URBAN wealth index quintile",null,null,null,null,"RURAL wealth index quintile",null,null,null,null,null,null,null,null,null,null,null,null,null,null,null,null,null,null,null,null,null,null,null,null,null,null,null,null,null,null,null,null,null,null,null,null,null,null,null,"Raw numbers of respondents:","Use of drinking water sources","NATIONAL wealth index quintile",null,null,null,null,"URBAN wealth index quintile",null,null,null,null,"RURAL wealth index quintile"]
["Percentage based on weighted population",null,"Poorest","Poor","Middle","Rich","Richest","Poorest","Poor","Middle","Rich","Richest","Poorest","Poor","Middle","Rich","Richest",null,null,null,null,null,null,null,null,null,null,null,null,null,null,null,null,null,null,null,null,null,null,null,null,null,null,null,null,null,null,null,null,null,null,null,"Water data, raw numbers (weighted)",null,"Poorest","Poor","Middle","Rich","Richest","Poorest","Poor","Middle","Rich","Richest","Poorest","Poor","Middle","Rich","Richest"]
["Main source of Water","Private piped",9.1666666666666661,20,25,24.793388429752067,22.689075630252102,16.666666666666664,25.581395348837212,32.558139534883722,30.232558139534881,32.558139534883722,6.4935064935064926,16.883116883116884,25.641025641025639,14.285714285714285,18.181818181818183]
[null,"Private Not Piped",3.3333333333333335,2.5,3.3333333333333335,4.1322314049586781,0,2.3809523809523809,0,2.3255813953488373,0,0,3.8961038961038961,2.5974025974025974,5.1282051282051277,6.4935064935064926,0]
[null,"Public Piped",9.1666666666666661,40.833333333333336,55.000000000000007,55.371900826446286,74.789915966386559,21.428571428571427,44.186046511627907,60.465116279069761,62.790697674418603,65.116279069767444,6.4935064935064926,35.064935064935064,48.717948717948715,58.441558441558442,75.324675324675326]
[null,"Public Yard",10.833333333333334,9.1666666666666661,4.1666666666666661,5.785123966942149,1.680672268907563,14.285714285714285,9.3023255813953494,2.3255813953488373,0,2.3255813953488373,7.7922077922077921,10.38961038961039,5.1282051282051277,6.4935064935064926,3.8961038961038961]
[null,"Public Standpipe",54.166666666666664,24.166666666666668,6.666666666666667,7.4380165289256199,0.84033613445378152,38.095238095238095,16.279069767441861,2.3255813953488373,6.9767441860465116,0,59.740259740259738,29.870129870129869,8.9743589743589745,9.0909090909090917,2.5974025974025974]
[null,"Public Well-Tank",1.6666666666666667,0,2.5,1.6528925619834711,0,0,0,0,0,0,2.5974025974025974,0,3.8461538461538463,2.5974025974025974,0]
[null,"Other",11.666666666666666,3.3333333333333335,3.3333333333333335,0.82644628099173556,0,7.1428571428571423,4.6511627906976747,0,0,0,12.987012987012985,5.1948051948051948,2.5641025641025639,2.5974025974025974,0]
[]
[]
[]
[]
[]
[]
[]
[]
[]
[]
[]
[]
[]
[]
[]
[]
[]
[]
[]
[]
[]
[]
[]
[]
[]
[]
[]
[]
[]
[]
[]
[]
[]
[]
[]
[]
[]
[]
[]
[]
[]
[]
[]
[{"$f":"A1026","v":"Saint Lucia"}]
[{"$f":"A1034","v":2005}]
["Use of sanitation facilities"]
[" by wealth quintile and sub-national region"]
["Notes:"]
["WHO/UNICEF JMP customised wealth index excludes water,"]
[" sanitation and hygiene assets."]
["Survey used for analysis:",{"$f":"A1025","v":0}]
[{"$f":"B1030","v":0}]
[{"$f":"B1029","v":0}]
[]
[]
["Use of sanitation facilities",null,"NATIONAL wealth index quintile",null,null,null,null,"URBAN wealth index quintile",null,null,null,null,"RURAL wealth index quintile",null,null,null,null,null,null,null,null,null,null,null,null,null,null,null,null,null,null,null,null,null,null,null,null,null,null,null,null,null,null,null,null,null,null,null,null,null,null,null,"Raw numbers of respondents:","Use of sanitation facilities","NATIONAL wealth index quintile",null,null,null,null,"URBAN wealth index quintile",null,null,null,null,"RURAL wealth index quintile"]
["Weighted percentage (used in graphs)",null,"Poorest","Poor","Middle","Rich","Richest","Poorest","Poor","Middle","Rich","Richest","Poorest","Poor","Middle","Rich","Richest",null,null,null,null,null,null,null,null,null,null,null,null,null,null,null,null,null,null,null,null,null,null,null,null,null,null,null,null,null,null,null,null,null,null,null,"Sanitation data, raw numbers (weighted)",null,"Poorest","Poor","Middle","Rich","Richest","Poorest","Poor","Middle","Rich","Richest","Poorest","Poor","Middle","Rich","Richest"]
["Sanitation","Improved",{"$f":"C153+C154+C156+C155*MICS12!C130/100","v":70.833333333333329},{"$f":"D153+D154+D156+D155*MICS12!D130/100","v":88.539795719085447},{"$f":"E153+E154+E156+E155*MICS12!E130/100","v":94.166666666666657},{"$f":"F153+F154+F156+F155*MICS12!F130/100","v":95.867768595041326},{"$f":"G153+G154+G156+G155*MICS12!G130/100","v":99.999999999999986},{"$f":"H153+H154+H156+H155*MICS12!H130/100","v":64.285714285714278},{"$f":"I153+I154+I156+I155*MICS12!I130/100","v":88.372093023255815},{"$f":"J153+J154+J156+J155*MICS12!J130/100","v":95.348837209302332},{"$f":"K153+K154+K156+K155*MICS12!K130/100","v":100.00000000000001},{"$f":"L153+L154+L156+L155*MICS12!L130/100","v":100},{"$f":"M153+M154+M156+M155*MICS12!M130/100","v":70.129870129870127},{"$f":"N153+N154+N156+N155*MICS12!N130/100","v":94.007651683456757},{"$f":"O153+O154+O156+O155*MICS12!O130/100","v":93.589743589743591},{"$f":"P153+P154+P156+P155*MICS12!P130/100","v":93.506493506493513},{"$f":"Q153+Q154+Q156+Q155*MICS12!Q130/100","v":98.701298701298711},null,null,null,null,null,null,null,null,null,null,null,null,null,null,null,null,null,null,null,null,null,null,null,null,null,null,null,null,null,null,null,null,null,null,null,"Sanitation","Improved","N/A","N/A","N/A","N/A","N/A","N/A","N/A","N/A","N/A","N/A","N/A","N/A","N/A","N/A","N/A"]
[null,"Not Improved",{"$f":"100-C122","v":29.166666666666671},{"$f":"100-D122","v":11.460204280914553},5.8333333333333428,4.1322314049586737,0,35.714285714285722,11.627906976744185,4.6511627906976685,0,0,29.870129870129873,5.992348316543243,6.4102564102564088,6.4935064935064872,1.2987012987012889,null,null,null,null,null,null,null,null,null,null,null,null,null,null,null,null,null,null,null,null,null,null,null,null,null,null,null,null,null,null,null,null,null,null,null,null,"Not Improved","N/A","N/A","N/A","N/A","N/A","N/A","N/A","N/A","N/A","N/A","N/A","N/A","N/A","N/A","N/A"]
["Sanitation ladder","Basic",{"$f":"C122*MICS12!C129/100","v":55.32898300393348},{"$f":"D122*MICS12!D129/100","v":78.055793933882683},{"$f":"E122*MICS12!E129/100","v":90.017460719665365},{"$f":"F122*MICS12!F129/100","v":93.494799478048463},{"$f":"G122*MICS12!G129/100","v":98.963702085218088},{"$f":"H122*MICS12!H129/100","v":46.026319659391838},{"$f":"I122*MICS12!I129/100","v":80.268656041769034},{"$f":"J122*MICS12!J129/100","v":89.214526946351583},{"$f":"K122*MICS12!K129/100","v":95.443082918216575},{"$f":"L122*MICS12!L129/100","v":97.90955350601061},{"$f":"M122*MICS12!M129/100","v":55.897110741819688},{"$f":"N122*MICS12!N129/100","v":81.81565117477129},{"$f":"O122*MICS12!O129/100","v":90.801342225686653},{"$f":"P122*MICS12!P129/100","v":91.015523193518504},{"$f":"Q122*MICS12!Q129/100","v":97.929734839740419},null,null,null,null,null,null,null,null,null,null,null,null,null,null,null,null,null,null,null,null,null,null,null,null,null,null,null,null,null,null,null,null,null,null,null,"Sanitation ladder","Basic","N/A","N/A","N/A","N/A","N/A","N/A","N/A","N/A","N/A","N/A","N/A","N/A","N/A","N/A","N/A"]
[null,"Limited",{"$f":"C122*MICS12!C128/100","v":15.504350329399859},{"$f":"D122*MICS12!D128/100","v":10.484001785202782},{"$f":"E122*MICS12!E128/100","v":4.149205947001283},{"$f":"F122*MICS12!F128/100","v":2.3729691169928544},{"$f":"G122*MICS12!G128/100","v":1.0362979147818978},{"$f":"H122*MICS12!H128/100","v":18.259394626322404},{"$f":"I122*MICS12!I128/100","v":8.1034369814867855},{"$f":"J122*MICS12!J128/100","v":6.1343102629507484},{"$f":"K122*MICS12!K128/100","v":4.5569170817834284},{"$f":"L122*MICS12!L128/100","v":2.0904464939893743},{"$f":"M122*MICS12!M128/100","v":14.232759388050354},{"$f":"N122*MICS12!N128/100","v":12.192000508685483},{"$f":"O122*MICS12!O128/100","v":2.7884013640569298},{"$f":"P122*MICS12!P128/100","v":2.4909703129750214},{"$f":"Q122*MICS12!Q128/100","v":0.77156386155828893},null,null,null,null,null,null,null,null,null,null,null,null,null,null,null,null,null,null,null,null,null,null,null,null,null,null,null,null,null,null,null,null,null,null,null,null,"Limited","N/A","N/A","N/A","N/A","N/A","N/A","N/A","N/A","N/A","N/A","N/A","N/A","N/A","N/A","N/A"]
[null,"Unimproved",{"$f":"100-(C124+C125+C127)","v":1.6666666666666572},{"$f":"100-(D124+D125+D127)","v":3.1268709475812102},0.83333333333335702,0.82644628099174611,0,4.7619047619048018,4.6511627906976685,0,0,0,1.2987012987013884,0.79754312173803044,1.2820512820512988,1.2987012987012747,0,null,null,null,null,null,null,null,null,null,null,null,null,null,null,null,null,null,null,null,null,null,null,null,null,null,null,null,null,null,null,null,null,null,null,null,null,"Unimproved","N/A","N/A","N/A","N/A","N/A","N/A","N/A","N/A","N/A","N/A","N/A","N/A","N/A","N/A","N/A"]
[null,"Open defecation",{"$f":"C157","v":27.500000000000004},{"$f":"D157","v":8.3333333333333321},5,3.3057851239669422,0,30.952380952380953,6.9767441860465116,4.6511627906976747,0,0,28.571428571428569,5.1948051948051948,5.1282051282051277,5.1948051948051948,1.2987012987012987,null,null,null,null,null,null,null,null,null,null,null,null,null,null,null,null,null,null,null,null,null,null,null,null,null,null,null,null,null,null,null,null,null,null,null,null,"Open defecation","N/A","N/A","N/A","N/A","N/A","N/A","N/A","N/A","N/A","N/A","N/A","N/A","N/A","N/A","N/A"]
["Shared among Improved Sanitation","Yes","N/A","N/A","N/A","N/A","N/A","N/A","N/A","N/A","N/A","N/A","N/A","N/A","N/A","N/A","N/A",null,null,null,null,null,null,null,null,null,null,null,null,null,null,null,null,null,null,null,null,null,null,null,null,null,null,null,null,null,null,null,null,null,null,null,"Shared among improved sanitation facilities","Yes","N/A","N/A","N/A","N/A","N/A","N/A","N/A","N/A","N/A","N/A","N/A","N/A","N/A","N/A","N/A"]
[null,"No","N/A","N/A","N/A","N/A","N/A","N/A","N/A","N/A","N/A","N/A","N/A","N/A","N/A","N/A","N/A",null,null,null,null,null,null,null,null,null,null,null,null,null,null,null,null,null,null,null,null,null,null,null,null,null,null,null,null,null,null,null,null,null,null,null,null,"No","N/A","N/A","N/A","N/A","N/A","N/A","N/A","N/A","N/A","N/A","N/A","N/A","N/A","N/A","N/A"]
["Manually calculated ratios","Improved latrines"]
[null,"Other"]
[null,"Other"]
[null,null,"NATIONAL wealth index quintile",null,null,null,null,"URBAN wealth index quintile",null,null,null,null,"RURAL wealth index quintile",null,null,null,null,null,null,null,null,null,null,null,null,null,null,null,null,null,null,null,null,null,null,null,null,null,null,null,null,null,null,null,null,null,null,null,null,null,null,null,"Raw numbers of respondents:","Use of sanitation facilities","NATIONAL wealth index quintile",null,null,null,null,"URBAN wealth index quintile",null,null,null,null,"RURAL wealth index quintile"]
["Percentage based on weighted population",null,"Poorest","Poor","Middle","Rich","Richest","Poorest","Poor","Middle","Rich","Richest","Poorest","Poor","Middle","Rich","Richest",null,null,null,null,null,null,null,null,null,null,null,null,null,null,null,null,null,null,null,null,null,null,null,null,null,null,null,null,null,null,null,null,null,null,null,"Sanitation data, raw numbers (weighted)",null,"Poorest","Poor","Middle","Rich","Richest","Poorest","Poor","Middle","Rich","Richest","Poorest","Poor","Middle","Rich","Richest"]
["Sanitation type","Sewer connection",0.83333333333333337,4.1666666666666661,9.1666666666666661,7.4380165289256199,12.605042016806722,2.3809523809523809,4.6511627906976747,18.604651162790699,16.279069767441861,16.279069767441861,1.2987012987012987,1.2987012987012987,3.8461538461538463,5.1948051948051948,9.0909090909090917,null,null,null,null,null,null,null,null,null,null,null,null,null,null,null,null,null,null,null,null,null,null,null,null,null,null,null,null,null,null,null,null,null,null,null,"Sanitation type","Sewer connection","N/A","N/A","N/A","N/A","N/A","N/A","N/A","N/A","N/A","N/A","N/A","N/A","N/A","N/A","N/A"]
[null,"Septic tank connection",5.833333333333333,10.833333333333334,33.333333333333329,57.851239669421481,82.35294117647058,11.904761904761903,13.953488372093023,39.534883720930232,74.418604651162795,83.720930232558146,5.1948051948051948,6.4935064935064926,29.487179487179489,48.051948051948052,81.818181818181827,null,null,null,null,null,null,null,null,null,null,null,null,null,null,null,null,null,null,null,null,null,null,null,null,null,null,null,null,null,null,null,null,null,null,null,null,"Septic tank connection","N/A","N/A","N/A","N/A","N/A","N/A","N/A","N/A","N/A","N/A","N/A","N/A","N/A","N/A","N/A"]
[null,"Improved latrines","N/A","N/A","N/A","N/A","N/A","N/A","N/A","N/A","N/A","N/A","N/A","N/A","N/A","N/A","N/A",null,null,null,null,null,null,null,null,null,null,null,null,null,null,null,null,null,null,null,null,null,null,null,null,null,null,null,null,null,null,null,null,null,null,null,null,"Improved latrines","N/A","N/A","N/A","N/A","N/A","N/A","N/A","N/A","N/A","N/A","N/A","N/A","N/A","N/A","N/A"]
[null,"Unimproved facilities","N/A","N/A","N/A","N/A","N/A","N/A","N/A","N/A","N/A","N/A","N/A","N/A","N/A","N/A","N/A",null,null,null,null,null,null,null,null,null,null,null,null,null,null,null,null,null,null,null,null,null,null,null,null,null,null,null,null,null,null,null,null,null,null,null,null,"Unimproved facilities","N/A","N/A","N/A","N/A","N/A","N/A","N/A","N/A","N/A","N/A","N/A","N/A","N/A","N/A","N/A"]
[null,"Open defecation",27.500000000000004,8.3333333333333321,5,3.3057851239669422,0,30.952380952380953,6.9767441860465116,4.6511627906976747,0,0,28.571428571428569,5.1948051948051948,5.1282051282051277,5.1948051948051948,1.2987012987012987,null,null,null,null,null,null,null,null,null,null,null,null,null,null,null,null,null,null,null,null,null,null,null,null,null,null,null,null,null,null,null,null,null,null,null,null,"Open defecation","N/A","N/A","N/A","N/A","N/A","N/A","N/A","N/A","N/A","N/A","N/A","N/A","N/A","N/A","N/A"]
["Septic tank emptying practices","Not emptied/treated and disposed in situ","N/A","N/A","N/A","N/A","N/A","N/A","N/A","N/A","N/A","N/A","N/A","N/A","N/A","N/A","N/A",null,null,null,null,null,null,null,null,null,null,null,null,null,null,null,null,null,null,null,null,null,null,null,null,null,null,null,null,null,null,null,null,null,null,null,"Septic tank emptying practices","Not emptied/treated and disposed in situ","N/A","N/A","N/A","N/A","N/A","N/A","N/A","N/A","N/A","N/A","N/A","N/A","N/A","N/A","N/A"]
[null,"Emptied and buried on site","N/A","N/A","N/A","N/A","N/A","N/A","N/A","N/A","N/A","N/A","N/A","N/A","N/A","N/A","N/A",null,null,null,null,null,null,null,null,null,null,null,null,null,null,null,null,null,null,null,null,null,null,null,null,null,null,null,null,null,null,null,null,null,null,null,null,"Emptied and buried on site","N/A","N/A","N/A","N/A","N/A","N/A","N/A","N/A","N/A","N/A","N/A","N/A","N/A","N/A","N/A"]
[null,"Emptied and discharged locally","N/A","N/A","N/A","N/A","N/A","N/A","N/A","N/A","N/A","N/A","N/A","N/A","N/A","N/A","N/A",null,null,null,null,null,null,null,null,null,null,null,null,null,null,null,null,null,null,null,null,null,null,null,null,null,null,null,null,null,null,null,null,null,null,null,null,"Emptied and discharged locally","N/A","N/A","N/A","N/A","N/A","N/A","N/A","N/A","N/A","N/A","N/A","N/A","N/A","N/A","N/A"]
[null,"Emptied and removed offsite","N/A","N/A","N/A","N/A","N/A","N/A","N/A","N/A","N/A","N/A","N/A","N/A","N/A","N/A","N/A",null,null,null,null,null,null,null,null,null,null,null,null,null,null,null,null,null,null,null,null,null,null,null,null,null,null,null,null,null,null,null,null,null,null,null,null,"Emptied and removed offsite","N/A","N/A","N/A","N/A","N/A","N/A","N/A","N/A","N/A","N/A","N/A","N/A","N/A","N/A","N/A"]
["Latrine emptying practices","Not emptied/treated and disposed in situ","N/A","N/A","N/A","N/A","N/A","N/A","N/A","N/A","N/A","N/A","N/A","N/A","N/A","N/A","N/A",null,null,null,null,null,null,null,null,null,null,null,null,null,null,null,null,null,null,null,null,null,null,null,null,null,null,null,null,null,null,null,null,null,null,null,"Latrine emptying practices","Not emptied/treated and disposed in situ","N/A","N/A","N/A","N/A","N/A","N/A","N/A","N/A","N/A","N/A","N/A","N/A","N/A","N/A","N/A"]
[null,"Emptied and buried on site","N/A","N/A","N/A","N/A","N/A","N/A","N/A","N/A","N/A","N/A","N/A","N/A","N/A","N/A","N/A",null,null,null,null,null,null,null,null,null,null,null,null,null,null,null,null,null,null,null,null,null,null,null,null,null,null,null,null,null,null,null,null,null,null,null,null,"Emptied and buried on site","N/A","N/A","N/A","N/A","N/A","N/A","N/A","N/A","N/A","N/A","N/A","N/A","N/A","N/A","N/A"]
[null,"Emptied and discharged locally","N/A","N/A","N/A","N/A","N/A","N/A","N/A","N/A","N/A","N/A","N/A","N/A","N/A","N/A","N/A",null,null,null,null,null,null,null,null,null,null,null,null,null,null,null,null,null,null,null,null,null,null,null,null,null,null,null,null,null,null,null,null,null,null,null,null,"Emptied and discharged locally","N/A","N/A","N/A","N/A","N/A","N/A","N/A","N/A","N/A","N/A","N/A","N/A","N/A","N/A","N/A"]
[null,"Emptied and removed offsite","N/A","N/A","N/A","N/A","N/A","N/A","N/A","N/A","N/A","N/A","N/A","N/A","N/A","N/A","N/A",null,null,null,null,null,null,null,null,null,null,null,null,null,null,null,null,null,null,null,null,null,null,null,null,null,null,null,null,null,null,null,null,null,null,null,null,"Emptied and removed offsite","N/A","N/A","N/A","N/A","N/A","N/A","N/A","N/A","N/A","N/A","N/A","N/A","N/A","N/A","N/A"]
["Shared among improved sanitation facilities","Yes","N/A","N/A","N/A","N/A","N/A","N/A","N/A","N/A","N/A","N/A","N/A","N/A","N/A","N/A","N/A",null,null,null,null,null,null,null,null,null,null,null,null,null,null,null,null,null,null,null,null,null,null,null,null,null,null,null,null,null,null,null,null,null,null,null,"Shared among improved sanitation facilities","Yes","N/A","N/A","N/A","N/A","N/A","N/A","N/A","N/A","N/A","N/A","N/A","N/A","N/A","N/A","N/A"]
[null,"No","N/A","N/A","N/A","N/A","N/A","N/A","N/A","N/A","N/A","N/A","N/A","N/A","N/A","N/A","N/A",null,null,null,null,null,null,null,null,null,null,null,null,null,null,null,null,null,null,null,null,null,null,null,null,null,null,null,null,null,null,null,null,null,null,null,null,"No","N/A","N/A","N/A","N/A","N/A","N/A","N/A","N/A","N/A","N/A","N/A","N/A","N/A","N/A","N/A"]
[null,"DK/missing","N/A","N/A","N/A","N/A","N/A","N/A","N/A","N/A","N/A","N/A","N/A","N/A","N/A","N/A","N/A",null,null,null,null,null,null,null,null,null,null,null,null,null,null,null,null,null,null,null,null,null,null,null,null,null,null,null,null,null,null,null,null,null,null,null,null,"DK/missing","N/A","N/A","N/A","N/A","N/A","N/A","N/A","N/A","N/A","N/A","N/A","N/A","N/A","N/A","N/A"]
["Shared among all sanitation facilities","Yes",65.882352941176464,81.481481481481481,92.920353982300881,92.241379310344826,97.41379310344827,64.285714285714292,87.179487179487182,90.243902439024396,95.348837209302332,95.348837209302332,64.15094339622641,79.452054794520549,91.780821917808225,94.444444444444443,97.260273972602747,null,null,null,null,null,null,null,null,null,null,null,null,null,null,null,null,null,null,null,null,null,null,null,null,null,null,null,null,null,null,null,null,null,null,null,"Shared among all sanitation facilities","Yes","N/A","N/A","N/A","N/A","N/A","N/A","N/A","N/A","N/A","N/A","N/A","N/A","N/A","N/A","N/A"]
[null,"No",34.117647058823529,18.518518518518519,7.0796460176991154,7.7586206896551726,2.5862068965517242,35.714285714285715,12.820512820512819,9.7560975609756095,4.6511627906976747,4.6511627906976747,35.849056603773583,20.547945205479451,8.2191780821917799,5.5555555555555554,2.7397260273972601,null,null,null,null,null,null,null,null,null,null,null,null,null,null,null,null,null,null,null,null,null,null,null,null,null,null,null,null,null,null,null,null,null,null,null,null,"No","N/A","N/A","N/A","N/A","N/A","N/A","N/A","N/A","N/A","N/A","N/A","N/A","N/A","N/A","N/A"]
["Type of toilet","WC Sewer",0.83333333333333337,4.1666666666666661,9.1666666666666661,7.4380165289256199,12.605042016806722,2.3809523809523809,4.6511627906976747,18.604651162790699,16.279069767441861,16.279069767441861,1.2987012987012987,1.2987012987012987,3.8461538461538463,5.1948051948051948,9.0909090909090917,null,null,null,null,null,null,null,null,null,null,null,null,null,null,null,null,null,null,null,null,null,null,null,null,null,null,null,null,null,null,null,null,null,null,null,"Type of toilet","WC Sewer",1,5,11,9,15,1,2,8,7,7,1,1,3,4,7]
[null,"WC Cesspit",5.833333333333333,10.833333333333334,33.333333333333329,57.851239669421481,82.35294117647058,11.904761904761903,13.953488372093023,39.534883720930232,74.418604651162795,83.720930232558146,5.1948051948051948,6.4935064935064926,29.487179487179489,48.051948051948052,81.818181818181827,null,null,null,null,null,null,null,null,null,null,null,null,null,null,null,null,null,null,null,null,null,null,null,null,null,null,null,null,null,null,null,null,null,null,null,null,"WC Cesspit",7,13,40,70,98,5,6,17,32,36,4,5,23,37,63]
[null,"Pit Latrine",62.5,73.333333333333329,50.833333333333329,30.578512396694212,5.0420168067226889,50,67.441860465116278,37.209302325581397,9.3023255813953494,0,61.038961038961034,87.012987012987011,58.974358974358978,40.259740259740262,7.7922077922077921,null,null,null,null,null,null,null,null,null,null,null,null,null,null,null,null,null,null,null,null,null,null,null,null,null,null,null,null,null,null,null,null,null,null,null,null,"Pit Latrine",75,88,61,37,6,21,29,16,4,0,47,67,46,31,6]
[null,"Ven. Pit Latrine",1.6666666666666667,0.83333333333333337,0.83333333333333337,0,0,0,2.3255813953488373,0,0,0,2.5974025974025974,0,1.2820512820512819,0,0,null,null,null,null,null,null,null,null,null,null,null,null,null,null,null,null,null,null,null,null,null,null,null,null,null,null,null,null,null,null,null,null,null,null,null,null,"Ven. Pit Latrine",2,1,1,0,0,0,1,0,0,0,2,0,1,0,0]
[null,"None",27.500000000000004,8.3333333333333321,5,3.3057851239669422,0,30.952380952380953,6.9767441860465116,4.6511627906976747,0,0,28.571428571428569,5.1948051948051948,5.1282051282051277,5.1948051948051948,1.2987012987012987,null,null,null,null,null,null,null,null,null,null,null,null,null,null,null,null,null,null,null,null,null,null,null,null,null,null,null,null,null,null,null,null,null,null,null,null,"None",33,10,6,4,0,13,3,2,0,0,22,4,4,4,1]
[null,"Other",1.6666666666666667,2.5,0.83333333333333337,0.82644628099173556,0,4.7619047619047619,4.6511627906976747,0,0,0,1.2987012987012987,0,1.2820512820512819,1.2987012987012987,0,null,null,null,null,null,null,null,null,null,null,null,null,null,null,null,null,null,null,null,null,null,null,null,null,null,null,null,null,null,null,null,null,null,null,null,null,"Other",2,3,1,1,0,2,2,0,0,0,1,0,1,1,0]
[null,null,null,null,null,null,null,null,null,null,null,null,null,null,null,null,null,null,null,null,null,null,null,null,null,null,null,null,null,null,null,null,null,null,null,null,null,null,null,null,null,null,null,null,null,null,null,null,null,null,null,null,null,"Total",120,120,120,121,119,42,43,43,43,43,77,77,78,77,77]
[]
[]
[]
[]
[]
[]
[]
[]
[]
[]
[]
[]
[]
[]
[]
[]
[]
[]
[]
[]
[]
[]
[]
[]
[]
[]
[]
[]
[]
[]
[]
[]
[]
[]
[]
[]
[]
[]
[]
[]
[]
[]
[]
[]
[]
[]
[]
[]
[{"$f":"A1026","v":"Saint Lucia"}]
[{"$f":"A1034","v":2005}]
["Access to hygiene facilities "]
[" by wealth quintile and sub-national region"]
["Notes:"]
["WHO/UNICEF JMP customised wealth index excludes water,"]
[" sanitation and hygiene assets."]
["Survey used for analysis:",{"$f":"A1025","v":0}]
[]
[]
[]
[]
["Access to handwashing",null,"NATIONAL wealth index quintile",null,null,null,null,"URBAN wealth index quintile",null,null,null,null,"RURAL wealth index quintile",null,null,null,null,null,null,null,null,null,null,null,null,null,null,null,null,null,null,null,null,null,null,null,null,null,null,null,null,null,null,null,null,null,null,null,null,null,null,null,"Raw numbers of respondents:","Access to handwashing","NATIONAL wealth index quintile",null,null,null,null,"URBAN wealth index quintile",null,null,null,null,"RURAL wealth index quintile"]
["Weighted percentage (used in graphs)",null,"Poorest","Poor","Middle","Rich","Richest","Poorest","Poor","Middle","Rich","Richest","Poorest","Poor","Middle","Rich","Richest",null,null,null,null,null,null,null,null,null,null,null,null,null,null,null,null,null,null,null,null,null,null,null,null,null,null,null,null,null,null,null,null,null,null,null,"Hygiene data, raw numbers (weighted)",null,"Poorest","Poor","Middle","Rich","Richest","Poorest","Poor","Middle","Rich","Richest","Poorest","Poor","Middle","Rich","Richest"]
["Hygiene ladder","Basic","N/A","N/A","N/A","N/A","N/A","N/A","N/A","N/A","N/A","N/A","N/A","N/A","N/A","N/A","N/A",null,null,null,null,null,null,null,null,null,null,null,null,null,null,null,null,null,null,null,null,null,null,null,null,null,null,null,null,null,null,null,null,null,null,null,"Hygiene ladder","Basic","N/A","N/A","N/A","N/A","N/A","N/A","N/A","N/A","N/A","N/A","N/A","N/A","N/A","N/A","N/A"]
[null,"Limited","N/A","N/A","N/A","N/A","N/A","N/A","N/A","N/A","N/A","N/A","N/A","N/A","N/A","N/A","N/A",null,null,null,null,null,null,null,null,null,null,null,null,null,null,null,null,null,null,null,null,null,null,null,null,null,null,null,null,null,null,null,null,null,null,null,null,"Limited","N/A","N/A","N/A","N/A","N/A","N/A","N/A","N/A","N/A","N/A","N/A","N/A","N/A","N/A","N/A"]
[null,"No facility","N/A","N/A","N/A","N/A","N/A","N/A","N/A","N/A","N/A","N/A","N/A","N/A","N/A","N/A","N/A",null,null,null,null,null,null,null,null,null,null,null,null,null,null,null,null,null,null,null,null,null,null,null,null,null,null,null,null,null,null,null,null,null,null,null,null,"No facility","N/A","N/A","N/A","N/A","N/A","N/A","N/A","N/A","N/A","N/A","N/A","N/A","N/A","N/A","N/A"]
[null,null,null,null,null,null,null,null,null,null,null,null,null,null,null,null,null,null,null,null,null,null,null,null,null,null,null,null,null,null,null,null,null,null,null,null,null,null,null,null,null,null,null,null,null,null,null,null,null,null,null,null,"Observed handwashing place","Fixed","N/A","N/A","N/A","N/A","N/A","N/A","N/A","N/A","N/A","N/A","N/A","N/A","N/A","N/A","N/A"]
[null,null,null,null,null,null,null,null,null,null,null,null,null,null,null,null,null,null,null,null,null,null,null,null,null,null,null,null,null,null,null,null,null,null,null,null,null,null,null,null,null,null,null,null,null,null,null,null,null,null,null,null,null,"Mobile","N/A","N/A","N/A","N/A","N/A","N/A","N/A","N/A","N/A","N/A","N/A","N/A","N/A","N/A","N/A"]
[null,null,null,null,null,null,null,null,null,null,null,null,null,null,null,null,null,null,null,null,null,null,null,null,null,null,null,null,null,null,null,null,null,null,null,null,null,null,null,null,null,null,null,null,null,null,null,null,null,null,null,null,"Water / Soap","Water and soap","N/A","N/A","N/A","N/A","N/A","N/A","N/A","N/A","N/A","N/A","N/A","N/A","N/A","N/A","N/A"]
[null,null,null,null,null,null,null,null,null,null,null,null,null,null,null,null,null,null,null,null,null,null,null,null,null,null,null,null,null,null,null,null,null,null,null,null,null,null,null,null,null,null,null,null,null,null,null,null,null,null,null,null,null,"Water only","N/A","N/A","N/A","N/A","N/A","N/A","N/A","N/A","N/A","N/A","N/A","N/A","N/A","N/A","N/A"]
[null,null,null,null,null,null,null,null,null,null,null,null,null,null,null,null,null,null,null,null,null,null,null,null,null,null,null,null,null,null,null,null,null,null,null,null,null,null,null,null,null,null,null,null,null,null,null,null,null,null,null,null,null,"Soap only","N/A","N/A","N/A","N/A","N/A","N/A","N/A","N/A","N/A","N/A","N/A","N/A","N/A","N/A","N/A"]
[null,null,null,null,null,null,null,null,null,null,null,null,null,null,null,null,null,null,null,null,null,null,null,null,null,null,null,null,null,null,null,null,null,null,null,null,null,null,null,null,null,null,null,null,null,null,null,null,null,null,null,null,null,"Neither","N/A","N/A","N/A","N/A","N/A","N/A","N/A","N/A","N/A","N/A","N/A","N/A","N/A","N/A","N/A"]
[]
[]
[]
[]
[]
[]
[]
[]
[]
[]
[]
[]
[]
[]
[]
[]
[]
[]
[]
[]
[]
[]
[]
[]
[]
[]
[]
[]
[null,null,null,null,null,null,null,null,null,null,null,null,null,null,null,null,null,null,null,null,null,null,null,null,null,null,null,null,null,null,null,null,null,null,null,null,null,null,null,null,null,null,null,null,null,null,null,null,null,null,null,null,"Raw numbers of respondents:","Menstrual health and hygiene","NATIONAL wealth index quintile",null,null,null,null,"URBAN wealth index quintile",null,null,null,null,"RURAL wealth index quintile"]
[null,null,null,null,null,null,null,null,null,null,null,null,null,null,null,null,null,null,null,null,null,null,null,null,null,null,null,null,null,null,null,null,null,null,null,null,null,null,null,null,null,null,null,null,null,null,null,null,null,null,null,null,"MHH data, raw numbers (weighted)",null,"Poorest","Poor","Middle","Rich","Richest","Poorest","Poor","Middle","Rich","Richest","Poorest","Poor","Middle","Rich","Richest"]
[null,null,null,null,null,null,null,null,null,null,null,null,null,null,null,null,null,null,null,null,null,null,null,null,null,null,null,null,null,null,null,null,null,null,null,null,null,null,null,null,null,null,null,null,null,null,null,null,null,null,null,null,"Private place to wash and change","Yes","N/A","N/A","N/A","N/A","N/A","N/A","N/A","N/A","N/A","N/A","N/A","N/A","N/A","N/A","N/A"]
[null,null,null,null,null,null,null,null,null,null,null,null,null,null,null,null,null,null,null,null,null,null,null,null,null,null,null,null,null,null,null,null,null,null,null,null,null,null,null,null,null,null,null,null,null,null,null,null,null,null,null,null,null,"No","N/A","N/A","N/A","N/A","N/A","N/A","N/A","N/A","N/A","N/A","N/A","N/A","N/A","N/A","N/A"]
[null,null,null,null,null,null,null,null,null,null,null,null,null,null,null,null,null,null,null,null,null,null,null,null,null,null,null,null,null,null,null,null,null,null,null,null,null,null,null,null,null,null,null,null,null,null,null,null,null,null,null,null,null,"DK/not sure/missing","N/A","N/A","N/A","N/A","N/A","N/A","N/A","N/A","N/A","N/A","N/A","N/A","N/A","N/A","N/A"]
[null,null,null,null,null,null,null,null,null,null,null,null,null,null,null,null,null,null,null,null,null,null,null,null,null,null,null,null,null,null,null,null,null,null,null,null,null,null,null,null,null,null,null,null,null,null,null,null,null,null,null,null,"Use of menstrual materials","Materials reusable","N/A","N/A","N/A","N/A","N/A","N/A","N/A","N/A","N/A","N/A","N/A","N/A","N/A","N/A","N/A"]
[null,null,null,null,null,null,null,null,null,null,null,null,null,null,null,null,null,null,null,null,null,null,null,null,null,null,null,null,null,null,null,null,null,null,null,null,null,null,null,null,null,null,null,null,null,null,null,null,null,null,null,null,null,"Materials not reusable","N/A","N/A","N/A","N/A","N/A","N/A","N/A","N/A","N/A","N/A","N/A","N/A","N/A","N/A","N/A"]
[null,null,null,null,null,null,null,null,null,null,null,null,null,null,null,null,null,null,null,null,null,null,null,null,null,null,null,null,null,null,null,null,null,null,null,null,null,null,null,null,null,null,null,null,null,null,null,null,null,null,null,null,null,"No materials used","N/A","N/A","N/A","N/A","N/A","N/A","N/A","N/A","N/A","N/A","N/A","N/A","N/A","N/A","N/A"]
[null,null,null,null,null,null,null,null,null,null,null,null,null,null,null,null,null,null,null,null,null,null,null,null,null,null,null,null,null,null,null,null,null,null,null,null,null,null,null,null,null,null,null,null,null,null,null,null,null,null,null,null,null,"DK/not sure/missing","N/A","N/A","N/A","N/A","N/A","N/A","N/A","N/A","N/A","N/A","N/A","N/A","N/A","N/A","N/A"]
[null,null,null,null,null,null,null,null,null,null,null,null,null,null,null,null,null,null,null,null,null,null,null,null,null,null,null,null,null,null,null,null,null,null,null,null,null,null,null,null,null,null,null,null,null,null,null,null,null,null,null,null,"Use of menstrual materials with private place to wash and change","Materials reusable","N/A","N/A","N/A","N/A","N/A","N/A","N/A","N/A","N/A","N/A","N/A","N/A","N/A","N/A","N/A"]
[null,null,null,null,null,null,null,null,null,null,null,null,null,null,null,null,null,null,null,null,null,null,null,null,null,null,null,null,null,null,null,null,null,null,null,null,null,null,null,null,null,null,null,null,null,null,null,null,null,null,null,null,null,"Materials not reusable","N/A","N/A","N/A","N/A","N/A","N/A","N/A","N/A","N/A","N/A","N/A","N/A","N/A","N/A","N/A"]
[null,null,null,null,null,null,null,null,null,null,null,null,null,null,null,null,null,null,null,null,null,null,null,null,null,null,null,null,null,null,null,null,null,null,null,null,null,null,null,null,null,null,null,null,null,null,null,null,null,null,null,null,null,"No materials used","N/A","N/A","N/A","N/A","N/A","N/A","N/A","N/A","N/A","N/A","N/A","N/A","N/A","N/A","N/A"]
[null,null,null,null,null,null,null,null,null,null,null,null,null,null,null,null,null,null,null,null,null,null,null,null,null,null,null,null,null,null,null,null,null,null,null,null,null,null,null,null,null,null,null,null,null,null,null,null,null,null,null,null,"Awareness of menstruation before menarche","Yes","N/A","N/A","N/A","N/A","N/A","N/A","N/A","N/A","N/A","N/A","N/A","N/A","N/A","N/A","N/A"]
[null,null,null,null,null,null,null,null,null,null,null,null,null,null,null,null,null,null,null,null,null,null,null,null,null,null,null,null,null,null,null,null,null,null,null,null,null,null,null,null,null,null,null,null,null,null,null,null,null,null,null,null,null,"No","N/A","N/A","N/A","N/A","N/A","N/A","N/A","N/A","N/A","N/A","N/A","N/A","N/A","N/A","N/A"]
[null,null,null,null,null,null,null,null,null,null,null,null,null,null,null,null,null,null,null,null,null,null,null,null,null,null,null,null,null,null,null,null,null,null,null,null,null,null,null,null,null,null,null,null,null,null,null,null,null,null,null,null,null,"DK/not sure/missing","N/A","N/A","N/A","N/A","N/A","N/A","N/A","N/A","N/A","N/A","N/A","N/A","N/A","N/A","N/A"]
[null,null,null,null,null,null,null,null,null,null,null,null,null,null,null,null,null,null,null,null,null,null,null,null,null,null,null,null,null,null,null,null,null,null,null,null,null,null,null,null,null,null,null,null,null,null,null,null,null,null,null,null,"Participation in (all) activities during menstruation","Yes","N/A","N/A","N/A","N/A","N/A","N/A","N/A","N/A","N/A","N/A","N/A","N/A","N/A","N/A","N/A"]
[null,null,null,null,null,null,null,null,null,null,null,null,null,null,null,null,null,null,null,null,null,null,null,null,null,null,null,null,null,null,null,null,null,null,null,null,null,null,null,null,null,null,null,null,null,null,null,null,null,null,null,null,null,"No","N/A","N/A","N/A","N/A","N/A","N/A","N/A","N/A","N/A","N/A","N/A","N/A","N/A","N/A","N/A"]
[null,null,null,null,null,null,null,null,null,null,null,null,null,null,null,null,null,null,null,null,null,null,null,null,null,null,null,null,null,null,null,null,null,null,null,null,null,null,null,null,null,null,null,null,null,null,null,null,null,null,null,null,null,"DK/not sure/missing/no such activity","N/A","N/A","N/A","N/A","N/A","N/A","N/A","N/A","N/A","N/A","N/A","N/A","N/A","N/A","N/A"]
[null,null,null,null,null,null,null,null,null,null,null,null,null,null,null,null,null,null,null,null,null,null,null,null,null,null,null,null,null,null,null,null,null,null,null,null,null,null,null,null,null,null,null,null,null,null,null,null,null,null,null,null,"Participation in specific activities during menstruation","Did not go to school (amongst those usually attending school)","N/A","N/A","N/A","N/A","N/A","N/A","N/A","N/A","N/A","N/A","N/A","N/A","N/A","N/A","N/A"]
[null,null,null,null,null,null,null,null,null,null,null,null,null,null,null,null,null,null,null,null,null,null,null,null,null,null,null,null,null,null,null,null,null,null,null,null,null,null,null,null,null,null,null,null,null,null,null,null,null,null,null,null,null,"Did not go to work (amongst those who usually work)","N/A","N/A","N/A","N/A","N/A","N/A","N/A","N/A","N/A","N/A","N/A","N/A","N/A","N/A","N/A"]
[null,null,null,null,null,null,null,null,null,null,null,null,null,null,null,null,null,null,null,null,null,null,null,null,null,null,null,null,null,null,null,null,null,null,null,null,null,null,null,null,null,null,null,null,null,null,null,null,null,null,null,null,null,"Did not participate in social activities","N/A","N/A","N/A","N/A","N/A","N/A","N/A","N/A","N/A","N/A","N/A","N/A","N/A","N/A","N/A"]
[null,null,null,null,null,null,null,null,null,null,null,null,null,null,null,null,null,null,null,null,null,null,null,null,null,null,null,null,null,null,null,null,null,null,null,null,null,null,null,null,null,null,null,null,null,null,null,null,null,null,null,null,null,"Did not cook food","N/A","N/A","N/A","N/A","N/A","N/A","N/A","N/A","N/A","N/A","N/A","N/A","N/A","N/A","N/A"]
[null,null,null,null,null,null,null,null,null,null,null,null,null,null,null,null,null,null,null,null,null,null,null,null,null,null,null,null,null,null,null,null,null,null,null,null,null,null,null,null,null,null,null,null,null,null,null,null,null,null,null,null,null,"Did not eat with others","N/A","N/A","N/A","N/A","N/A","N/A","N/A","N/A","N/A","N/A","N/A","N/A","N/A","N/A","N/A"]
[null,null,null,null,null,null,null,null,null,null,null,null,null,null,null,null,null,null,null,null,null,null,null,null,null,null,null,null,null,null,null,null,null,null,null,null,null,null,null,null,null,null,null,null,null,null,null,null,null,null,null,null,null,"Did not bathe in regular place","N/A","N/A","N/A","N/A","N/A","N/A","N/A","N/A","N/A","N/A","N/A","N/A","N/A","N/A","N/A"]
[null,null,null,null,null,null,null,null,null,null,null,null,null,null,null,null,null,null,null,null,null,null,null,null,null,null,null,null,null,null,null,null,null,null,null,null,null,null,null,null,null,null,null,null,null,null,null,null,null,null,null,null,null,"Did not participate in other activities","N/A","N/A","N/A","N/A","N/A","N/A","N/A","N/A","N/A","N/A","N/A","N/A","N/A","N/A","N/A"]
[null,null,null,null,null,null,null,null,null,null,null,null,null,null,null,null,null,null,null,null,null,null,null,null,null,null,null,null,null,null,null,null,null,null,null,null,null,null,null,null,null,null,null,null,null,null,null,null,null,null,null,null,null,"DK/not sure/missing/no such activity","N/A","N/A","N/A","N/A","N/A","N/A","N/A","N/A","N/A","N/A","N/A","N/A","N/A","N/A","N/A"]
[]
[]
[]
[]
[]
[]
[]
[]
[]
[]
[]
[]
[]
[]
[]
[]
[]
[]
[]
[]
[]
[]
[]
[]
[]
[]
[]
[]
[]
[]
[]
[]
[]
[]
[]
[]
[]
[]
[]
[]
[]
[]
[]
[]
[]
[]
[]
[]
[]
[]
[]
[]
[]
[]
[null,null,null,null,null,null,null,null,null,null,null,null,null,null,null,null,null,null,null,null,null,null,null,null,null,null,null,null,null,null,null,null,null,null,null,null,null,null,null,null,null,null,null,null,null,null,null,null,null,null,null,null,"Raw numbers of respondents:","Basic water, sanitation and hygiene","NATIONAL wealth index quintile",null,null,null,null,"URBAN wealth index quintile",null,null,null,null,"RURAL wealth index quintile"]
[null,null,null,null,null,null,null,null,null,null,null,null,null,null,null,null,null,null,null,null,null,null,null,null,null,null,null,null,null,null,null,null,null,null,null,null,null,null,null,null,null,null,null,null,null,null,null,null,null,null,null,null,"WatSan data, raw numbers (weighted)",null,"Poorest","Poor","Middle","Rich","Richest","Poorest","Poor","Middle","Rich","Richest","Poorest","Poor","Middle","Rich","Richest"]
[null,null,null,null,null,null,null,null,null,null,null,null,null,null,null,null,null,null,null,null,null,null,null,null,null,null,null,null,null,null,null,null,null,null,null,null,null,null,null,null,null,null,null,null,null,null,null,null,null,null,null,null,"Use of Basic Water Sanitation and Hygiene","Yes","N/A","N/A","N/A","N/A","N/A","N/A","N/A","N/A","N/A","N/A","N/A","N/A","N/A","N/A","N/A"]
[null,null,null,null,null,null,null,null,null,null,null,null,null,null,null,null,null,null,null,null,null,null,null,null,null,null,null,null,null,null,null,null,null,null,null,null,null,null,null,null,null,null,null,null,null,null,null,null,null,null,null,null,null,"No","N/A","N/A","N/A","N/A","N/A","N/A","N/A","N/A","N/A","N/A","N/A","N/A","N/A","N/A","N/A"]
[null,null,null,null,null,null,null,null,null,null,null,null,null,null,null,null,null,null,null,null,null,null,null,null,null,null,null,null,null,null,null,null,null,null,null,null,null,null,null,null,null,null,null,null,null,null,null,null,null,null,null,null,"Use of Basic Water and Sanitation","Yes","N/A","N/A","N/A","N/A","N/A","N/A","N/A","N/A","N/A","N/A","N/A","N/A","N/A","N/A","N/A"]
[null,null,null,null,null,null,null,null,null,null,null,null,null,null,null,null,null,null,null,null,null,null,null,null,null,null,null,null,null,null,null,null,null,null,null,null,null,null,null,null,null,null,null,null,null,null,null,null,null,null,null,null,null,"No","N/A","N/A","N/A","N/A","N/A","N/A","N/A","N/A","N/A","N/A","N/A","N/A","N/A","N/A","N/A"]
[null,null,null,null,null,null,null,null,null,null,null,null,null,null,null,null,null,null,null,null,null,null,null,null,null,null,null,null,null,null,null,null,null,null,null,null,null,null,null,null,null,null,null,null,null,null,null,null,null,null,null,null,"Use of Basic Water and Hygiene","Yes","N/A","N/A","N/A","N/A","N/A","N/A","N/A","N/A","N/A","N/A","N/A","N/A","N/A","N/A","N/A"]
[null,null,null,null,null,null,null,null,null,null,null,null,null,null,null,null,null,null,null,null,null,null,null,null,null,null,null,null,null,null,null,null,null,null,null,null,null,null,null,null,null,null,null,null,null,null,null,null,null,null,null,null,null,"No","N/A","N/A","N/A","N/A","N/A","N/A","N/A","N/A","N/A","N/A","N/A","N/A","N/A","N/A","N/A"]
[null,null,null,null,null,null,null,null,null,null,null,null,null,null,null,null,null,null,null,null,null,null,null,null,null,null,null,null,null,null,null,null,null,null,null,null,null,null,null,null,null,null,null,null,null,null,null,null,null,null,null,null,"Use of Basic Sanitation and Hygiene","Yes","N/A","N/A","N/A","N/A","N/A","N/A","N/A","N/A","N/A","N/A","N/A","N/A","N/A","N/A","N/A"]
[null,null,null,null,null,null,null,null,null,null,null,null,null,null,null,null,null,null,null,null,null,null,null,null,null,null,null,null,null,null,null,null,null,null,null,null,null,null,null,null,null,null,null,null,null,null,null,null,null,null,null,null,null,"No","N/A","N/A","N/A","N/A","N/A","N/A","N/A","N/A","N/A","N/A","N/A","N/A","N/A","N/A","N/A"]
[null,null,null,null,null,null,null,null,null,null,null,null,null,null,null,null,null,null,null,null,null,null,null,null,null,null,null,null,null,null,null,null,null,null,null,null,null,null,null,null,null,null,null,null,null,null,null,null,null,null,null,null,"Use of Basic Water","Yes","N/A","N/A","N/A","N/A","N/A","N/A","N/A","N/A","N/A","N/A","N/A","N/A","N/A","N/A","N/A"]
[null,null,null,null,null,null,null,null,null,null,null,null,null,null,null,null,null,null,null,null,null,null,null,null,null,null,null,null,null,null,null,null,null,null,null,null,null,null,null,null,null,null,null,null,null,null,null,null,null,null,null,null,null,"No","N/A","N/A","N/A","N/A","N/A","N/A","N/A","N/A","N/A","N/A","N/A","N/A","N/A","N/A","N/A"]
[null,null,null,null,null,null,null,null,null,null,null,null,null,null,null,null,null,null,null,null,null,null,null,null,null,null,null,null,null,null,null,null,null,null,null,null,null,null,null,null,null,null,null,null,null,null,null,null,null,null,null,null,"Use of Basic Sanitation","Yes","N/A","N/A","N/A","N/A","N/A","N/A","N/A","N/A","N/A","N/A","N/A","N/A","N/A","N/A","N/A"]
[null,null,null,null,null,null,null,null,null,null,null,null,null,null,null,null,null,null,null,null,null,null,null,null,null,null,null,null,null,null,null,null,null,null,null,null,null,null,null,null,null,null,null,null,null,null,null,null,null,null,null,null,null,"No","N/A","N/A","N/A","N/A","N/A","N/A","N/A","N/A","N/A","N/A","N/A","N/A","N/A","N/A","N/A"]
[null,null,null,null,null,null,null,null,null,null,null,null,null,null,null,null,null,null,null,null,null,null,null,null,null,null,null,null,null,null,null,null,null,null,null,null,null,null,null,null,null,null,null,null,null,null,null,null,null,null,null,null,"Access to Basic Hygiene","Yes","N/A","N/A","N/A","N/A","N/A","N/A","N/A","N/A","N/A","N/A","N/A","N/A","N/A","N/A","N/A"]
[null,null,null,null,null,null,null,null,null,null,null,null,null,null,null,null,null,null,null,null,null,null,null,null,null,null,null,null,null,null,null,null,null,null,null,null,null,null,null,null,null,null,null,null,null,null,null,null,null,null,null,null,null,"No","N/A","N/A","N/A","N/A","N/A","N/A","N/A","N/A","N/A","N/A","N/A","N/A","N/A","N/A","N/A"]
[]
[]
[]
[]
[]
[]
[]
[]
[]
[]
[]
[]
[]
[]
[]
[]
[]
[]
[]
[]
[]
[]
[]
[]
[]
[]
[]
[]
[]
[]
[]
[]
[]
[]
[]
[]
[]
[]
[]
[]
[]
[]
[]
[]
[null,null,"INITIAL (national) Wealth Index",null,null,null,null,"URBAN Wealth Index",null,null,null,null,"RURAL Wealth Index"]
[null,null,"Component Matrix",null,null,null,null,"Component Matrix",null,null,null,null,"Component Matrix"]
[null,null,null,null,"Component",null,null,null,null,"Component",null,null,null,null,"Component"]
[null,"Note:\n\nThe INITIAL (national) Wealth Index is based on the first component of the Principal Component Analysis (PCA) which has been obtained at national level.\n\nThe final national-level (NATIONAL) Wealth Index is based on the URBAN and RURAL specific wealth indexes. Regression procedures are used to establish the relationships between the two sets of scores (urban and rural) and the initial (national) wealth factors.\nThis allows best use of the available information for each area and a better precision of the FINAL (NATIONAL) Wealth Index.\n\nFor dependency reasons, all WASH variables (contained in the generic MICS and DHS scripts) have been excluded from the sets of asset variables used in the PCAs.\n\nThe PCA can extracts as many components as there are asset variables in the input. Only the first of the components is used to represent the Wealth Index. \n\nThe scores represent the weights of the asset variables on the Wealth Index (correlations between the variables and the component).\n\nThe communalities are the proportion of each variable's variance that can be explained by the component.\n\nProportion of explained variance is the part of the model's total variance that is explained by the component.\n\nFor more information on the procedure used:\n\nThe DHS Wealth Index, DHS Comparative Reports No. 6, Shea Oscar Rutstein, Kiersten Johnson, ORC Macro International Inc., 2004.\n\nThe DHS Wealth Index: Approaches for Rural and Urban Areas, Shea O. Rutstein, ORC Macro International Inc., 2008.\n\nMICS Methodological Paper No. 4, Review of options for reporting water, sanitation and hygiene coverage by wealth quintile, UNICEF, 2016.",null,null,"1",null,null,null,null,"1",null,null,null,null,"1"]
[null,null,"Has wood floor",null,0.76970988512522509,null,null,"Has wood floor",null,0.75485096207627866,null,null,"Has wood floor",null,0.78378980804977738]
[null,null,"Has concrete floor",null,-0.74132760662673536,null,null,"Has brick concrete wall",null,-0.74222398693009861,null,null,"Has concrete floor",null,-0.78268604254593566]
[null,null,"Has wood and concrete floor",null,-0.74132760662673525,null,null,"Has concrete floor",null,-0.70279744042989423,null,null,"Has wood and concrete floor",null,-0.78268604254593566]
[null,null,"Has mud floor",null,-0.74132760662673503,null,null,"Has mud floor",null,-0.702797440429894,null,null,"Has mud floor",null,-0.7826860425459351]
[null,null,"Has brick concrete wall",null,-0.73191271535023161,null,null,"Has wood and concrete floor",null,-0.70279744042989389,null,null,"Has no wall",null,0.75205866510720498]
[null,null,"Has no wall",null,0.7306374411407548,null,null,"Has no wall",null,0.6971914096576115,null,null,"Has brick concrete wall",null,-0.74523377145700942]
[null,null,"Owns Refrigerator",null,0.66812150978773088,null,null,"Owns Refrigerator",null,0.67456215616016091,null,null,"Number of Rooms",null,-0.65615970537346902]
[null,null,"Number of Rooms",null,-0.63059537608295158,null,null,"Owns telephone",null,0.60777136737496085,null,null,"Owns Television",null,0.65315260975206413]
[null,null,"Owns Television",null,0.61441822311116689,null,null,"Number of Rooms",null,-0.58881589175282067,null,null,"Owns Refrigerator",null,0.65135342351704506]
[null,null,"Owns telephone",null,0.58923440743853761,null,null,"Owns Washing machine",null,0.58414503316953259,null,null,":electric light",null,-0.57109072522486248]
[null,null,"Owns stove",null,0.55497757439833506,null,null,"Owns sewing machine",null,0.56624532666696314,null,null,"Owns Video",null,0.56879293134539033]
[null,null,"Owns Washing machine",null,0.55100867454699864,null,null,"Owns stove",null,0.53907767483590163,null,null,"Owns telephone",null,0.56634716654687012]
[null,null,":electric light",null,-0.5487895013427444,null,null,"Owns Motor vehicle",null,0.53728397711942,null,null,"kerozene light",null,0.56010962073516379]
[null,null,"Owns Video",null,0.54300387471784339,null,null,"Household fuel type: natural gas",null,-0.52762617258474964,null,null,"Owns stove",null,0.55932159525227065]
[null,null,"kerozene light",null,0.53943225248851023,null,null,"Household fuel type: coal",null,0.50497267469656948,null,null,"Owns Washing machine",null,0.5204533629254493]
[null,null,"Household fuel type: natural gas",null,-0.52514002821736894,null,null,"Owns Radio",null,0.49141506876597063,null,null,"Household fuel type: natural gas",null,-0.50927833857528326]
[null,null,"Household fuel type: coal",null,0.49590757626502285,null,null,"Owns Television",null,0.49002846807171219,null,null,"Household fuel type: coal",null,0.48406077973012568]
[null,null,"Owns sewing machine",null,0.46178737764775973,null,null,"Land purchased",null,-0.48395500189318319,null,null,"Has galvanized roof",null,0.40035846442315598]
[null,null,"Owns Motor vehicle",null,0.45068978593047726,null,null,"Owns Video",null,0.47111423881772352,null,null,"Owns Motor vehicle",null,0.39790202127930918]
[null,null,"Owns Radio",null,0.42765579994105102,null,null,":electric light",null,-0.44206980332916829,null,null,"Owns Radio",null,0.38958990252069464]
[null,null,"Has galvanized roof",null,0.38370567709708753,null,null,"kerozene light",null,0.43847783175217603,null,null,"Owns sewing machine",null,0.37951354826617839]
[null,null,"Land purchased",null,-0.37934583340065547,null,null,"Has galvanized roof",null,0.36576413539359193,null,null,"Land purchased",null,-0.31548928646972452]
[null,null,"Number of members per sleeping room",null,0.30876750521135476,null,null,"Number of members per sleeping room",null,0.34261680398801131,null,null,"Has shingle asphalt roof",null,-0.28991833821131263]
[null,null,"Has shingle asphalt roof",null,-0.25859585632324777,null,null,"Kitchen shared",null,-0.27759405930803621,null,null,"Number of members per sleeping room",null,0.28128695427945916]
[null,null,"Bath shared",null,-0.24434311628925728,null,null,"Bath shared",null,-0.25066217064674562,null,null,"Bath shared",null,-0.23397345371090386]
[null,null,"Has shingle wood roof",null,-0.19547316772551412,null,null,"Has shingle asphalt roof",null,-0.22832285197145533,null,null,"Has shingle wood roof",null,-0.21975916239204851]
[null,null,"Household fuel type: wood",null,0.16225380121654173,null,null,"Has shingle other roof",null,-0.19507144644112906,null,null,"Has ply wood wall",null,0.1427425098712238]
[null,null,"Has shingle other roof",null,-0.1519946871855441,null,null,"Household fuel type: wood",null,0.19475545303846739,null,null,"Household fuel type: wood",null,0.13368494256150798]
[null,null,"Has ply wood wall",null,0.12507579836349983,null,null,"Has shingle wood roof",null,-0.15279425456545553,null,null,"Has wood concrete wall",null,-0.1147700238066762]
[null,null,"Has wood concrete wall",null,-9.8248211909258615E-2,null,null,"Has tile roof",null,-0.12550480507195885,null,null,"Has shingle other roof",null,-0.11207301180087315]
[null,null,"Has concrete roof",null,-9.8213280324792693E-2,null,null,"Has ply wood wall",null,0.10495772792287748,null,null,"Has concrete roof",null,-0.10819777709233268]
[null,null,"gas light",null,9.269711269491554E-2,null,null,"gas light",null,8.4230494364961495E-2,null,null,"gas light",null,9.1146468496244221E-2]
[null,null,"Kitchen shared",null,-9.1432093787391977E-2,null,null,"Has concrete roof",null,-8.3608599849491039E-2,null,null,"Has mud wall",null,-7.8914863275980879E-2]
[null,null,"Land inherited",null,8.8635012086165865E-2,null,null,"Land inherited",null,5.1025902900502511E-2,null,null,"Land inherited",null,7.5933364222970604E-2]
[null,null,"Has tile roof",null,-7.9680003807500024E-2,null,null,"Has wood concrete wall",null,-3.7482402917663513E-2,null,null,"Household fuel type: kerosene",null,7.4420185769730432E-2]
[null,null,"Household fuel type: kerosene",null,7.2347349192440374E-2,null,null,"Household fuel type: electricity",null,1.451211726134684E-2,null,null,"Land:other",null,-5.0345436231096059E-2]
[null,null,"Has mud wall",null,-5.8366621642736996E-2,null,null,null,null,null,null,null,"Kitchen shared",null,1.9137437467928699E-2]
[null,null,"Land:other",null,-3.6213428619733666E-2,null,null,null,null,null,null,null,"Household fuel type: electricity",null,-1.1412969503649969E-2]
[null,null,"Household fuel type: electricity",null,-1.3438802822691203E-2]
[null,null,null,null,null,null,null,"Communalities"]
[null,null,null,null,null,null,null,null,null,"Extraction"]
[null,null,null,null,null,null,null,"Number of members per sleeping room",null,0.11738627437495937,null,null,"Communalities"]
[null,null,"Communalities",null,null,null,null,"Has galvanized roof",null,0.13378340274022185,null,null,null,null,"Extraction"]
[null,null,null,null,"Extraction",null,null,"Has shingle asphalt roof",null,5.2131324732379102E-2,null,null,"Number of members per sleeping room",null,7.9122350647814546E-2]
[null,null,"Number of members per sleeping room",null,9.5337372274443985E-2,null,null,"Has shingle wood roof",null,2.3346084228213229E-2,null,null,"Has galvanized roof",null,0.16028690003526747]
[null,null,"Has galvanized roof",null,0.14723004663653441,null,null,"Has shingle other roof",null,3.8052869216634283E-2,null,null,"Has shingle asphalt roof",null,8.4052642831209057E-2]
[null,null,"Has shingle asphalt roof",null,6.687181690755381E-2,null,null,"Has tile roof",null,1.575145609615039E-2,null,null,"Has shingle wood roof",null,4.8294089455254749E-2]
[null,null,"Has shingle wood roof",null,3.8209759300646975E-2,null,null,"Has concrete roof",null,6.9903979687923126E-3,null,null,"Has shingle other roof",null,1.2560359974118652E-2]
[null,null,"Has shingle other roof",null,2.3102384932631403E-2,null,null,"Has no wall",null,0.48607586170036748,null,null,"Has concrete roof",null,1.170675896772211E-2]
[null,null,"Has tile roof",null,6.3489030067632188E-3,null,null,"Has brick concrete wall",null,0.55089644677441119,null,null,"Has no wall",null,0.56559223576283113]
[null,null,"Has concrete roof",null,9.645848432156311E-3,null,null,"Has wood concrete wall",null,1.4049305284820702E-3,null,null,"Has brick concrete wall",null,0.55537337412003818]
[null,null,"Has no wall",null,0.53383107039670996,null,null,"Has ply wood wall",null,1.1016124650732775E-2,null,null,"Has wood concrete wall",null,1.3172158364585022E-2]
[null,null,"Has brick concrete wall",null,0.53569622289134922,null,null,"Has wood floor",null,0.56979997494748347,null,null,"Has ply wood wall",null,2.0375424124336426E-2]
[null,null,"Has wood concrete wall",null,9.6527111433665855E-3,null,null,"Has concrete floor",null,0.49392424227481074,null,null,"Has mud wall",null,6.227555645866756E-3]
[null,null,"Has ply wood wall",null,1.5643955336266866E-2,null,null,"Has wood and concrete floor",null,0.49392424227481024,null,null,"Has wood floor",null,0.6143264632027069]
[null,null,"Has mud wall",null,3.4066625219864146E-3,null,null,"Has mud floor",null,0.49392424227481041,null,null,"Has concrete floor",null,0.61259744119621817]
[null,null,"Has wood floor",null,0.59245330725948719,null,null,"Household fuel type: coal",null,0.25499740219020739,null,null,"Has wood and concrete floor",null,0.61259744119621817]
[null,null,"Has concrete floor",null,0.54956662034692372,null,null,"Household fuel type: wood",null,3.7929686488218678E-2,null,null,"Has mud floor",null,0.61259744119621728]
[null,null,"Has wood and concrete floor",null,0.5495666203469235,null,null,"Household fuel type: natural gas",null,0.27838937799643204,null,null,"Household fuel type: coal",null,0.23431483847293724]
[null,null,"Has mud floor",null,0.54956662034692316,null,null,"Household fuel type: electricity",null,2.1060154740708091E-4,null,null,"Household fuel type: wood",null,1.7871663867673689E-2]
[null,null,"Household fuel type: coal",null,0.24592432419704946,null,null,"Land purchased",null,0.23421244385743095,null,null,"Household fuel type: natural gas",null,0.25936442614200084]
[null,null,"Household fuel type: wood",null,2.6326296009217039E-2,null,null,"Land inherited",null,2.6036427668115108E-3,null,null,"Household fuel type: kerosene",null,5.5383640500011877E-3]
[null,null,"Household fuel type: natural gas",null,0.27577204923613902,null,null,"gas light",null,7.0947761809658097E-3,null,null,"Household fuel type: electricity",null,1.3025587289124422E-4]
[null,null,"Household fuel type: kerosene",null,5.2341389351729028E-3,null,null,"kerozene light",null,0.19226280893808959,null,null,"Land purchased",null,9.9533489877175904E-2]
[null,null,"Household fuel type: electricity",null,1.8060142130717306E-4,null,null,":electric light",null,0.19542571101548953,null,null,"Land inherited",null,5.7658758022183119E-3]
[null,null,"Land purchased",null,0.14390326131843786,null,null,"Number of Rooms",null,0.34670415438066943,null,null,"Land:other",null,2.5346629492993596E-3]
[null,null,"Land inherited",null,7.8561653675147686E-3,null,null,"Kitchen shared",null,7.7058461763113525E-2,null,null,"gas light",null,8.3076787193368407E-3]
[null,null,"Land:other",null,1.3114124123965454E-3,null,null,"Bath shared",null,6.2831523793338215E-2,null,null,"kerozene light",null,0.31372278724008901]
[null,null,"gas light",null,8.5927547019738724E-3,null,null,"Owns telephone",null,0.36938603500082962,null,null,":electric light",null,0.32614461643785936]
[null,null,"kerozene light",null,0.29098715502482786,null,null,"Owns Television",null,0.24012789952070904,null,null,"Number of Rooms",null,0.43054555895579766]
[null,null,":electric light",null,0.30116991678401805,null,null,"Owns Video",null,0.22194862601680304,null,null,"Kitchen shared",null,3.6624151283888123E-4]
[null,null,"Number of Rooms",null,0.39765052833719916,null,null,"Owns Radio",null,0.24148876981026365,null,null,"Bath shared",null,5.4743577041408469E-2]
[null,null,"Kitchen shared",null,8.3598277743464431E-3,null,null,"Owns stove",null,0.29060473950648208,null,null,"Owns telephone",null,0.32074911305566822]
[null,null,"Bath shared",null,5.9703558477945506E-2,null,null,"Owns Refrigerator",null,0.45503410252344534,null,null,"Owns Television",null,0.4266083316259322]
[null,null,"Owns telephone",null,0.34719718690944457,null,null,"Owns Washing machine",null,0.34122541977663434,null,null,"Owns Video",null,0.32352539874848191]
[null,null,"Owns Television",null,0.37750975289108368,null,null,"Owns sewing machine",null,0.3206337699721758,null,null,"Owns Radio",null,0.15178029214608435]
[null,null,"Owns Video",null,0.29485320795859138,null,null,"Owns Motor vehicle",null,0.28867407206926143,null,null,"Owns stove",null,0.31284064691554486]
[null,null,"Owns Radio",null,0.18288948322322024,null,null,null,null,null,null,null,"Owns Refrigerator",null,0.42426128232737509]
[null,null,"Owns stove",null,0.30800010808505951,null,null,null,null,null,null,null,"Owns Washing machine",null,0.27087170298040947]
[null,null,"Owns Refrigerator",null,0.44638635184103698,null,null,"Total Variance Explained",null,null,null,null,"Owns sewing machine",null,0.14403053331758492]
[null,null,"Owns Washing machine",null,0.30361055942604026,null,null,"Component",null,"Extraction Sums of Squared Loadings",null,null,"Owns Motor vehicle",null,0.15832601853815981]
[null,null,"Owns sewing machine",null,0.21324758215479467,null,null,null,null,"Total","% of Variance","Cumulative %"]
[null,null,"Owns Motor vehicle",null,0.20312128314205941,null,null,"1",null,7.9472518998980366,22.075699721938989,22.075699721938989]
[null,null,null,null,null,null,null,null,null,null,null,null,"Total Variance Explained"]
[null,null,null,null,null,null,null,null,null,null,null,null,"Component",null,"Extraction Sums of Squared Loadings"]
[null,null,"Total Variance Explained",null,null,null,null,"Component Score Coefficient Matrix",null,null,null,null,null,null,"Total","% of Variance","Cumulative %"]
[null,null,"Component",null,"Extraction Sums of Squared Loadings",null,null,null,null,"Component",null,null,"1",null,8.3007599933171736,21.844105245571509,21.844105245571509]
[null,null,null,null,"Total","% of Variance","Cumulative %",null,null,"1"]
[null,null,"1",null,8.1759174277095426,20.963890840280879,20.963890840280879,"Number of members per sleeping room",null,4.3111355762160637E-2]
[null,null,null,null,null,null,null,"Has galvanized roof",null,4.6023976589729669E-2,null,null,"Component Score Coefficient Matrix"]
[null,null,null,null,null,null,null,"Has shingle asphalt roof",null,-2.8729786704556916E-2,null,null,null,null,"Component"]
[null,null,"Component Score Coefficient Matrix",null,null,null,null,"Has shingle wood roof",null,-1.9226049015435873E-2,null,null,null,null,"1"]
[null,null,null,null,"Component",null,null,"Has shingle other roof",null,-2.4545773670975726E-2,null,null,"Number of members per sleeping room",null,3.3886891622685072E-2]
[null,null,null,null,"1",null,null,"Has tile roof",null,-1.5792226879529143E-2,null,null,"Has galvanized roof",null,4.8231543225617776E-2]
[null,null,"Number of members per sleeping room",null,3.7765487230202496E-2,null,null,"Has concrete roof",null,-1.0520441644811048E-2,null,null,"Has shingle asphalt roof",null,-3.4926722185043522E-2]
[null,null,"Has galvanized roof",null,4.6931207474851112E-2,null,null,"Has no wall",null,8.7727357637494341E-2,null,null,"Has shingle wood roof",null,-2.6474583359713273E-2]
[null,null,"Has shingle asphalt roof",null,-3.162897113500969E-2,null,null,"Has brick concrete wall",null,-9.3393791499124537E-2,null,null,"Has shingle other roof",null,-1.3501536231754872E-2]
[null,null,"Has shingle wood roof",null,-2.390840776632884E-2,null,null,"Has wood concrete wall",null,-4.716397993895778E-3,null,null,"Has concrete roof",null,-1.3034683231347636E-2]
[null,null,"Has shingle other roof",null,-1.8590535989320155E-2,null,null,"Has ply wood wall",null,1.3206795159497093E-2,null,null,"Has no wall",null,9.0601181784881982E-2]
[null,null,"Has tile roof",null,-9.7456957597750749E-3,null,null,"Has wood floor",null,9.4982639481449346E-2,null,null,"Has brick concrete wall",null,-8.9778980726702942E-2]
[null,null,"Has concrete roof",null,-1.2012508833801522E-2,null,null,"Has concrete floor",null,-8.8432762580346935E-2,null,null,"Has wood concrete wall",null,-1.382644768660652E-2]
[null,null,"Has no wall",null,8.9364581724431708E-2,null,null,"Has wood and concrete floor",null,-8.8432762580346894E-2,null,null,"Has ply wood wall",null,1.7196318166787596E-2]
[null,null,"Has brick concrete wall",null,-8.9520561065068727E-2,null,null,"Has mud floor",null,-8.8432762580346908E-2,null,null,"Has mud wall",null,-9.5069443447966372E-3]
[null,null,"Has wood concrete wall",null,-1.2016781331019698E-2,null,null,"Household fuel type: coal",null,6.3540539680521299E-2,null,null,"Has wood floor",null,9.4423861029688319E-2]
[null,null,"Has ply wood wall",null,1.5298075044104185E-2,null,null,"Household fuel type: wood",null,2.4506012328735432E-2,null,null,"Has concrete floor",null,-9.4290889409652287E-2]
[null,null,"Has mud wall",null,-7.1388467604776469E-3,null,null,"Household fuel type: natural gas",null,-6.6391021604778763E-2,null,null,"Has wood and concrete floor",null,-9.4290889409652287E-2]
[null,null,"Has wood floor",null,9.4143549262930476E-2,null,null,"Household fuel type: electricity",null,1.8260547726608525E-3,null,null,"Has mud floor",null,-9.4290889409652218E-2]
[null,null,"Has concrete floor",null,-9.067210049287594E-2,null,null,"Land purchased",null,-6.0895893069576955E-2,null,null,"Household fuel type: coal",null,5.8315236209676734E-2]
[null,null,"Has wood and concrete floor",null,-9.0672100492875926E-2,null,null,"Land inherited",null,6.4205719842801469E-3,null,null,"Household fuel type: wood",null,1.6105144910723339E-2]
[null,null,"Has mud floor",null,-9.0672100492875898E-2,null,null,"gas light",null,1.0598694419896538E-2,null,null,"Household fuel type: natural gas",null,-6.1353218137290583E-2]
[null,null,"Household fuel type: coal",null,6.0654670335136912E-2,null,null,"kerozene light",null,5.5173516238714124E-2,null,null,"Household fuel type: kerosene",null,8.965466515071522E-3]
[null,null,"Household fuel type: wood",null,1.9845332667699975E-2,null,null,":electric light",null,-5.5625492798943493E-2,null,null,"Household fuel type: electricity",null,-1.3749306705456358E-3]
[null,null,"Household fuel type: natural gas",null,-6.423010418837917E-2,null,null,"Number of Rooms",null,-7.409050312855632E-2,null,null,"Land purchased",null,-3.8007277252169749E-2]
[null,null,"Household fuel type: kerosene",null,8.8488355994451699E-3,null,null,"Kitchen shared",null,-3.492956594361854E-2,null,null,"Land inherited",null,9.1477604802576509E-3]
[null,null,"Household fuel type: electricity",null,-1.6437057910033276E-3,null,null,"Bath shared",null,-3.1540735565455225E-2,null,null,"Land:other",null,-6.065159849414809E-3]
[null,null,"Land purchased",null,-4.6397953104931007E-2,null,null,"Owns telephone",null,7.6475664170498794E-2,null,null,"gas light",null,1.098049679422426E-2]
[null,null,"Land inherited",null,1.0840986699029897E-2,null,null,"Owns Television",null,6.1660115250404886E-2,null,null,"kerozene light",null,6.7476908281422457E-2]
[null,null,"Land:other",null,-4.429280131548338E-3,null,null,"Owns Video",null,5.9280144224919798E-2,null,null,":electric light",null,-6.8799811786467699E-2]
[null,null,"gas light",null,1.1337823983000322E-2,null,null,"Owns Radio",null,6.1834590743534305E-2,null,null,"Number of Rooms",null,-7.9048148109538655E-2]
[null,null,"kerozene light",null,6.5978192326195076E-2,null,null,"Owns stove",null,6.7831960233048355E-2,null,null,"Kitchen shared",null,2.3055042530245404E-3]
[null,null,":electric light",null,-6.7122681484380664E-2,null,null,"Owns Refrigerator",null,8.4879926376665554E-2,null,null,"Bath shared",null,-2.8186991781387803E-2]
[null,null,"Number of Rooms",null,-7.7128393438240836E-2,null,null,"Owns Washing machine",null,7.3502770583757024E-2,null,null,"Owns telephone",null,6.8228351018801689E-2]
[null,null,"Kitchen shared",null,-1.1183098972784807E-2,null,null,"Owns sewing machine",null,7.1250456610571014E-2,null,null,"Owns Television",null,7.868588060345176E-2]
[null,null,"Bath shared",null,-2.9885712331332737E-2,null,null,"Owns Motor vehicle",null,6.7606259860256007E-2,null,null,"Owns Video",null,6.8522994497289116E-2]
[null,null,"Owns telephone",null,7.2069515457864622E-2,null,null,null,null,null,null,null,"Owns Radio",null,4.6934244916651977E-2]
[null,null,"Owns Television",null,7.5149758855049278E-2,null,null,null,null,null,null,null,"Owns stove",null,6.7381974144846091E-2]
[null,null,"Owns Video",null,6.6415038987247238E-2,null,null,"Component Score Covariance Matrix",null,null,null,null,"Owns Refrigerator",null,7.8469131024320737E-2]
[null,null,"Owns Radio",null,5.230676602623878E-2,null,null,"Component",null,"1",null,null,"Owns Washing machine",null,6.2699483341821599E-2]
[null,null,"Owns stove",null,6.7879547378673855E-2,null,null,"1",null,0.99999999999999989,null,null,"Owns sewing machine",null,4.572033748376287E-2]
[null,null,"Owns Refrigerator",null,8.171823109702113E-2,null,null,null,null,null,null,null,"Owns Motor vehicle",null,4.793561331729318E-2]
[null,null,"Owns Washing machine",null,6.7394109519689951E-2]
[null,null,"Owns sewing machine",null,5.6481414071365942E-2]
[null,null,"Owns Motor vehicle",null,5.512406282419325E-2,null,null,null,null,null,null,null,"Component Score Covariance Matrix"]
[null,null,null,null,null,null,null,null,null,null,null,null,"Component",null,"1"]
[null,null,null,null,null,null,null,null,null,null,null,null,"1",null,1]
[null,null,"Component Score Covariance Matrix"]
[null,null,"Component",null,"1"]
[null,null,"1",null,1.0000000000000002]
[]
[]
[]
[]
[]
[]
[]
[]
[]
[]
[]
[]
[]
[]
[]
[]
[]
[]
[]
[]
[]
[]
[]
[]
[]
[]
[]
[]
[]
[]
[]
[]
[]
[]
[]
[]
[]
[]
[]
[]
[]
[]
[]
[]
[]
[]
[]
[]
[]
[]
[]
[]
[]
[]
[]
[]
[]
[]
[]
[]
[]
[]
[]
[]
[]
[]
[]
[]
[]
[]
[]
[]
[]
[]
[]
[]
[]
[]
[]
[]
[]
[]
[]
[]
[]
[]
[]
[]
[]
[]
[]
[]
[]
[]
[]
[]
[]
[]
[]
[]
[]
[]
[]
[]
[]
[]
[]
[]
[]
[]
[]
[]
[]
[]
[]
[]
[]
[]
[]
[]
[]
[]
[]
[]
[]
[]
[]
[]
[]
[]
[]
[]
[]
[]
[]
[]
[]
[]
[]
[]
[]
[]
[]
[]
[]
[]
[]
[]
[]
[]
[]
[]
[]
[]
[]
[]
[]
[]
[]
[]
[]
[]
[]
[]
[]
[]
[]
[]
[]
[]
[]
[]
[]
[]
[]
[]
[]
[]
[]
[]
[]
[]
[]
[]
[]
[]
[]
[]
[]
[]
[]
[]
[]
[]
[]
[]
[]
[]
[]
[]
[]
[]
[]
[]
[]
[]
[]
[]
[]
[]
[]
[]
[]
[]
[]
[]
[]
[]
[]
[]
[]
[]
[]
[]
[]
[]
[]
[]
[]
[]
[]
[]
[]
[]
[]
[]
[]
[]
[]
[]
[]
[]
[]
[]
[]
[]
[]
[]
[]
[]
[]
[]
[]
[]
[]
[]
[]
[]
[]
[]
[]
[]
[]
[]
[]
[]
[]
[]
[]
[]
[]
[]
[]
[]
[]
[]
[]
[]
[]
[]
[]
[]
[]
[]
[]
[]
[]
[]
[]
[]
[]
[]
[]
[]
[]
[]
[]
[]
[]
[]
[]
[]
[]
[]
[]
[]
[]
[]
[]
[]
[]
[]
[]
[]
[]
[]
[]
[]
[]
[]
[]
[]
[]
[]
[]
[]
[]
[]
[]
[]
[]
[]
[]
[]
[]
[]
[]
[]
[]
[]
[]
[]
[]
[]
[]
[]
[]
[]
[]
[]
[]
[]
[]
[]
[]
[]
[]
[]
[]
[]
[]
[]
[]
[]
[]
[]
[]
[]
[]
[]
[]
[]
[]
[]
[]
[]
[]
[]
[]
[]
[]
[]
[]
[]
[]
[]
[]
[]
[]
[]
[]
[]
[]
[]
[]
[]
[]
[]
[]
[]
[]
[]
[]
[]
[]
[]
[]
[]
[]
[]
[]
[]
[]
[]
[]
[]
[]
[]
[]
[]
[]
[]
[]
[]
[]
[]
[]
[]
[]
[]
[]
[]
[]
[]
[]
[]
[]
[]
[]
[]
[]
[]
[]
[]
[]
[]
[]
[]
[]
[]
[]
[]
[]
[]
[]
[]
[]
[]
[]
[]
[]
[]
[]
[]
[]
[]
[]
[]
[]
[]
[]
[]
[]
[]
[]
[]
[]
[]
[]
[]
[]
[]
[]
[]
[]
["Saint Lucia"]
[]
[]
[]
[]
[]
[]
[]
[2005]
[]
["Sub-national region names","Weighted population"]
[{"$f":"R15","v":0},{"$f":"#REF!+#REF!","v":{"$error":"#REF!"}}]
[{"$f":"S15","v":0},{"$f":"#REF!+#REF!","v":{"$error":"#REF!"}}]
[{"$f":"T15","v":0},{"$f":"#REF!+#REF!","v":{"$error":"#REF!"}}]
[{"$f":"U15","v":0},{"$f":"#REF!+#REF!","v":{"$error":"#REF!"}}]
[{"$f":"V15","v":0},{"$f":"#REF!+#REF!","v":{"$error":"#REF!"}}]
[{"$f":"W15","v":0},{"$f":"#REF!+#REF!","v":{"$error":"#REF!"}}]
[{"$f":"X15","v":0},{"$f":"#REF!+WG123","v":{"$error":"#REF!"}}]
[{"$f":"Y15","v":0},{"$f":"#REF!+#REF!","v":{"$error":"#REF!"}}]
[{"$f":"Z15","v":0},{"$f":"#REF!+#REF!","v":{"$error":"#REF!"}}]
[{"$f":"AA15","v":0},{"$f":"#REF!+#REF!","v":{"$error":"#REF!"}}]
[{"$f":"AB15","v":0},{"$f":"#REF!+#REF!","v":{"$error":"#REF!"}}]
[{"$f":"AC15","v":0},{"$f":"#REF!+#REF!","v":{"$error":"#REF!"}}]
[{"$f":"AD15","v":0},{"$f":"#REF!+#REF!","v":{"$error":"#REF!"}}]
[{"$f":"AE15","v":0},{"$f":"#REF!+#REF!","v":{"$error":"#REF!"}}]
[{"$f":"AF15","v":0},{"$f":"#REF!+#REF!","v":{"$error":"#REF!"}}]
[{"$f":"AG15","v":0},{"$f":"#REF!+#REF!","v":{"$error":"#REF!"}}]
[{"$f":"AH15","v":0},{"$f":"#REF!+#REF!","v":{"$error":"#REF!"}}]
[{"$f":"AI15","v":0},{"$f":"#REF!+#REF!","v":{"$error":"#REF!"}}]
[{"$f":"AJ15","v":0},{"$f":"#REF!+#REF!","v":{"$error":"#REF!"}}]
[{"$f":"AK15","v":0},{"$f":"#REF!+#REF!","v":{"$error":"#REF!"}}]
[{"$f":"AL15","v":0},{"$f":"#REF!+#REF!","v":{"$error":"#REF!"}}]
[{"$f":"AM15","v":0},{"$f":"#REF!+#REF!","v":{"$error":"#REF!"}}]
[{"$f":"AN15","v":0},{"$f":"#REF!+#REF!","v":{"$error":"#REF!"}}]
[{"$f":"AO15","v":0},{"$f":"#REF!+#REF!","v":{"$error":"#REF!"}}]
[{"$f":"AP15","v":0},{"$f":"#REF!+#REF!","v":{"$error":"#REF!"}}]
[{"$f":"AQ15","v":0},{"$f":"#REF!+#REF!","v":{"$error":"#REF!"}}]
[{"$f":"AR15","v":0},{"$f":"#REF!+#REF!","v":{"$error":"#REF!"}}]
[{"$f":"AS15","v":0},{"$f":"#REF!+#REF!","v":{"$error":"#REF!"}}]
[{"$f":"AT15","v":0},{"$f":"#REF!+#REF!","v":{"$error":"#REF!"}}]
[{"$f":"AU15","v":0},{"$f":"#REF!+#REF!","v":{"$error":"#REF!"}}]
[{"$f":"AV15","v":0},{"$f":"#REF!+#REF!","v":{"$error":"#REF!"}}]
[{"$f":"AW15","v":0},{"$f":"#REF!+#REF!","v":{"$error":"#REF!"}}]
[{"$f":"AX15","v":0},{"$f":"#REF!+#REF!","v":{"$error":"#REF!"}}]
[{"$f":"AY15","v":0},{"$f":"#REF!+#REF!","v":{"$error":"#REF!"}}]
[]
[{"$f":"34-COUNTIF(A1037:A1071,\"0\")","v":0},"Sub-regions"]

{"sheet":"MICS12","index":5,"n_rows":1072,"n_cols":69,"rows_kept":1072,"cut":false,"hidden":false,"merged":[[346,52,347,52],[348,52,349,52],[350,52,351,52],[352,52,353,52],[152,52,162,52],[230,52,234,52],[270,52,272,52],[273,52,275,52],[276,52,283,52],[338,54,338,58],[338,59,338,63],[338,64,338,68],[340,52,341,52],[342,52,343,52],[344,52,345,52],[221,52,223,52],[224,52,225,52],[226,52,229,52],[258,54,258,58],[258,59,258,63],[258,64,258,68],[260,52,262,52],[263,52,266,52],[267,52,269,52],[119,64,119,68],[121,52,122,52],[123,52,126,52],[127,52,128,52],[132,54,132,58],[132,59,132,63],[132,64,132,68],[134,52,138,52],[219,54,219,58],[219,59,219,63],[219,64,219,68],[139,52,142,52],[13,64,13,68],[15,52,16,52],[17,52,20,52],[21,52,22,52],[26,54,26,58],[26,59,26,63],[26,64,26,68],[40,52,41,52],[55,54,55,58],[55,59,55,63],[55,64,55,68],[143,52,146,52],[147,0,149,0],[147,52,149,52],[150,0,151,0],[150,52,151,52],[13,54,13,58],[13,59,13,63],[119,54,119,58],[119,59,119,63],[42,52,43,52],[44,52,45,52],[46,0,48,0],[46,52,48,52],[49,0,51,0],[49,52,51,52],[52,0,54,0],[52,52,54,52],[32,0,33,0],[32,52,33,52],[34,52,35,52],[36,52,37,52],[38,0,39,0],[38,52,39,52],[13,2,13,6],[13,7,13,11],[28,52,29,52],[30,0,31,0],[30,52,31,52],[13,12,13,16],[15,0,16,0],[17,0,20,0],[21,0,22,0],[23,0,25,0],[26,2,26,6],[26,7,26,11],[26,12,26,16],[44,0,45,0],[55,2,55,6],[55,7,55,11],[28,0,29,0],[34,0,35,0],[36,0,37,0],[40,0,41,0],[42,0,43,0],[107,0,107,1],[119,2,119,6],[119,7,119,11],[55,12,55,16],[57,0,66,0],[134,0,138,0],[152,0,161,0],[119,12,119,16],[121,0,122,0],[123,0,126,0],[127,0,128,0],[129,0,131,0],[132,2,132,6],[132,7,132,11],[132,12,132,16],[139,0,142,0],[143,0,146,0],[219,2,219,6],[219,7,219,11],[219,12,219,16],[207,0,207,1],[1025,0,1025,1],[1030,0,1032,0],[1033,0,1033,2],[221,0,223,0],[224,0,227,0],[398,2,398,5],[398,7,398,10],[398,12,398,15],[399,2,399,4],[399,7,399,9],[399,12,399,14],[1024,0,1024,2],[400,2,401,3],[400,7,401,8],[400,12,401,13],[401,1,444,1],[402,2,402,3],[402,7,402,8],[402,12,402,13],[403,2,403,3],[403,7,403,8],[403,12,403,13],[406,2,406,3],[406,7,406,8],[406,12,406,13],[407,2,407,3],[407,7,407,8],[407,12,407,13],[404,2,404,3],[404,7,404,8],[404,12,404,13],[405,2,405,3],[405,7,405,8],[405,12,405,13],[410,2,410,3],[410,7,410,8],[410,12,410,13],[411,2,411,3],[411,7,411,8],[411,12,411,13],[408,2,408,3],[408,7,408,8],[408,12,408,13],[409,2,409,3],[409,7,409,8],[409,12,409,13],[414,2,414,3],[414,7,414,8],[414,12,414,13],[415,2,415,3],[415,7,415,8],[415,12,415,13],[412,2,412,3],[412,7,412,8],[412,12,412,13],[413,2,413,3],[413,7,413,8],[413,12,413,13],[418,2,418,3],[418,7,418,8],[418,12,418,13],[419,2,419,3],[419,7,419,8],[419,12,419,13],[416,2,416,3],[416,7,416,8],[416,12,416,13],[417,2,417,3],[417,7,417,8],[417,12,417,13],[422,2,422,3],[422,7,422,8],[422,12,422,13],[423,2,423,3],[423,7,423,8],[423,12,423,13],[420,2,420,3],[420,7,420,8],[420,12,420,13],[421,2,421,3],[421,7,421,8],[421,12,421,13],[426,2,426,3],[426,7,426,8],[426,12,426,13],[427,2,427,3],[427,7,427,8],[427,12,427,13],[424,2,424,3],[424,7,424,8],[424,12,424,13],[425,2,425,3],[425,7,425,8],[425,12,425,13],[430,2,430,3],[430,7,430,8],[430,12,430,13],[431,2,431,3],[431,7,431,8],[431,12,431,13],[428,2,428,3],[428,7,428,8],[428,12,428,13],[429,2,429,3],[429,7,429,8],[429,12,429,13],[434,2,434,3],[434,7,434,8],[434,12,434,13],[435,2,435,3],[435,7,435,8],[435,12,435,13],[432,2,432,3],[432,7,432,8],[432,12,432,13],[433,2,433,3],[433,7,433,8],[433,12,433,13],[438,2,438,3],[438,7,438,8],[438,12,438,13],[439,2,439,3],[439,7,439,8],[439,12,439,13],[436,2,436,3],[436,7,436,8],[436,12,436,13],[437,2,437,3],[437,7,437,8],[437,12,437,13],[442,2,442,3],[442,7,442,8],[442,12,442,13],[443,2,443,3],[443,7,443,8],[443,12,443,13],[440,2,440,3],[440,7,440,8],[440,12,440,13],[441,2,441,3],[441,7,441,8],[441,12,441,13],[446,2,446,3],[446,7,446,8],[446,12,446,13],[447,2,447,3],[447,7,447,8],[447,12,447,13],[444,2,444,3],[444,7,444,8],[444,12,444,13],[445,2,445,3],[445,7,445,8],[445,12,445,13],[450,2,450,3],[450,7,450,8],[450,12,450,13],[451,2,451,3],[451,7,451,8],[451,12,451,13],[448,2,448,4],[448,7,448,9],[448,12,448,14],[449,2,449,3],[449,7,449,8],[449,12,449,13],[454,2,454,3],[454,7,454,8],[454,12,454,13],[455,2,455,3],[455,7,455,8],[455,12,455,13],[452,2,452,3],[452,7,452,8],[452,12,452,13],[453,2,453,3],[453,7,453,8],[453,12,453,13],[458,2,458,3],[458,7,458,8],[458,12,458,13],[459,2,459,3],[459,7,459,8],[459,12,459,13],[456,2,456,3],[456,7,456,8],[456,12,456,13],[457,2,457,3],[457,7,457,8],[457,12,457,13],[462,2,462,3],[462,7,462,8],[462,12,462,13],[463,2,463,3],[463,7,463,8],[463,12,463,13],[460,2,460,3],[460,7,460,8],[460,12,460,13],[461,2,461,3],[461,7,461,8],[461,12,461,13],[466,2,466,3],[466,7,466,8],[466,12,466,13],[467,2,467,3],[467,7,467,8],[467,12,467,13],[464,2,464,3],[464,7,464,8],[464,12,464,13],[465,2,465,3],[465,7,465,8],[465,12,465,13],[470,2,470,3],[470,7,470,8],[470,12,470,13],[471,2,471,3],[471,7,471,8],[471,12,471,13],[468,2,468,3],[468,7,468,8],[468,12,468,13],[469,2,469,3],[469,7,469,8],[469,12,469,13],[474,2,474,3],[474,7,474,8],[474,12,474,13],[475,2,475,3],[475,7,475,8],[475,12,475,13],[472,2,472,3],[472,7,472,8],[472,12,472,13],[473,2,473,3],[473,7,473,8],[473,12,473,13],[478,2,478,3],[478,7,478,8],[478,12,478,13],[479,2,479,3],[479,7,479,8],[479,12,479,13],[476,2,476,3],[476,7,476,8],[476,12,476,13],[477,2,477,3],[477,7,477,8],[477,12,477,13],[482,2,482,3],[482,7,482,8],[482,12,482,13],[483,2,483,3],[483,7,483,8],[483,12,483,13],[480,2,480,3],[480,7,480,8],[480,12,480,13],[481,2,481,3],[481,7,481,8],[481,12,481,13],[486,2,486,3],[486,7,486,8],[486,12,486,13],[487,2,487,3],[487,7,487,8],[487,12,487,13],[484,2,484,3],[484,7,484,8],[484,12,484,13],[485,2,485,3],[485,7,485,8],[485,12,485,13],[490,2,490,3],[490,7,490,8],[490,12,490,13],[491,2,491,3],[491,7,491,8],[491,12,491,13],[488,2,488,3],[488,7,488,8],[488,12,488,13],[489,2,489,3],[489,7,489,8],[489,12,489,13],[496,14,496,16],[494,2,494,3],[494,7,494,8],[494,12,494,13],[495,2,495,6],[495,7,495,11],[495,12,495,16],[492,2,492,3],[492,7,492,8],[492,12,492,13],[493,2,493,3],[493,7,493,8],[493,12,493,13],[498,2,498,3],[498,7,498,8],[498,12,498,13],[499,2,499,3],[499,7,499,8],[499,12,499,13],[496,2,497,3],[496,4,496,6],[496,7,497,8],[496,9,496,11],[496,12,497,13],[502,2,503,3],[502,7,503,8],[502,12,503,13],[504,2,504,3],[504,7,504,8],[504,12,504,13],[500,2,500,3],[500,7,500,8],[500,12,500,13],[501,2,501,4],[501,7,501,9],[501,12,501,14],[507,2,507,3],[507,7,507,8],[507,12,507,13],[508,2,508,3],[508,7,508,8],[508,12,508,13],[505,2,505,3],[505,7,505,8],[505,12,505,13],[506,2,506,3],[506,7,506,8],[506,12,506,13],[511,2,511,3],[511,7,511,8],[511,12,511,13],[512,2,512,3],[512,7,512,8],[512,12,512,13],[509,2,509,3],[509,7,509,8],[509,12,509,13],[510,2,510,3],[510,7,510,8],[510,12,510,13],[515,2,515,3],[515,7,515,8],[515,12,515,13],[516,2,516,3],[516,7,516,8],[516,12,516,13],[513,2,513,3],[513,7,513,8],[513,12,513,13],[514,2,514,3],[514,7,514,8],[514,12,514,13],[519,2,519,3],[519,7,519,8],[519,12,519,13],[520,2,520,3],[520,7,520,8],[520,12,520,13],[517,2,517,3],[517,7,517,8],[517,12,517,13],[518,2,518,3],[518,7,518,8],[518,12,518,13],[523,2,523,3],[523,7,523,8],[523,12,523,13],[524,2,524,3],[524,7,524,8],[524,12,524,13],[521,2,521,3],[521,7,521,8],[521,12,521,13],[522,2,522,3],[522,7,522,8],[522,12,522,13],[527,2,527,3],[527,7,527,8],[527,12,527,13],[528,2,528,3],[528,7,528,8],[528,12,528,13],[525,2,525,3],[525,7,525,8],[525,12,525,13],[526,2,526,3],[526,7,526,8],[526,12,526,13],[531,2,531,3],[531,7,531,8],[531,12,531,13],[532,2,532,3],[532,7,532,8],[532,12,532,13],[529,2,529,3],[529,7,529,8],[529,12,529,13],[530,2,530,3],[530,7,530,8],[530,12,530,13],[535,2,535,3],[535,7,535,8],[535,12,535,13],[536,2,536,3],[536,7,536,8],[536,12,536,13],[533,2,533,3],[533,7,533,8],[533,12,533,13],[534,2,534,3],[534,7,534,8],[534,12,534,13],[539,2,539,3],[539,7,539,8],[539,12,539,13],[540,2,540,3],[540,7,540,8],[540,12,540,13],[537,2,537,3],[537,7,537,8],[537,12,537,13],[538,2,538,3],[538,7,538,8],[538,12,538,13],[543,2,543,3],[543,7,543,8],[543,12,543,13],[544,2,544,3],[544,7,544,8],[544,12,544,13],[541,2,541,3],[541,7,541,8],[541,12,541,13],[542,2,542,3],[542,7,542,8],[542,12,542,13],[547,2,547,3],[547,7,547,8],[547,12,547,13],[548,2,548,3],[548,7,548,8],[548,12,548,13],[545,2,545,3],[545,7,545,8],[545,12,545,13],[546,2,546,3],[546,7,546,8],[546,12,546,13],[551,2,551,3],[551,7,551,8],[551,12,551,13],[552,2,552,3],[552,7,552,8],[552,12,552,13],[549,2,549,4],[549,7,549,9],[549,12,549,14],[550,2,550,3],[550,7,550,8],[550,12,550,13],[555,2,555,3],[555,7,555,8],[555,12,555,13],[556,2,556,3],[556,7,556,8],[556,12,556,13],[553,2,553,3],[553,7,553,8],[553,12,553,13],[554,2,554,3],[554,7,554,8],[554,12,554,13],[559,2,559,3],[559,7,559,8],[559,12,559,13],[560,2,560,3],[560,7,560,8],[560,12,560,13],[557,2,557,3],[557,7,557,8],[557,12,557,13],[558,2,558,3],[558,7,558,8],[558,12,558,13],[563,2,563,3],[563,7,563,8],[563,12,563,13],[564,2,564,3],[564,7,564,8],[564,12,564,13],[561,2,561,3],[561,7,561,8],[561,12,561,13],[562,2,562,3],[562,7,562,8],[562,12,562,13],[567,2,567,3],[567,7,567,8],[567,12,567,13],[568,2,568,3],[568,7,568,8],[568,12,568,13],[565,2,565,3],[565,7,565,8],[565,12,565,13],[566,2,566,3],[566,7,566,8],[566,12,566,13],[571,2,571,3],[571,7,571,8],[571,12,571,13],[572,2,572,3],[572,7,572,8],[572,12,572,13],[569,2,569,3],[569,7,569,8],[569,12,569,13],[570,2,570,3],[570,7,570,8],[570,12,570,13],[575,2,575,3],[575,7,575,8],[575,12,575,13],[576,2,576,3],[576,7,576,8],[576,12,576,13],[573,2,573,3],[573,7,573,8],[573,12,573,13],[574,2,574,3],[574,7,574,8],[574,12,574,13],[579,2,579,3],[579,7,579,8],[579,12,579,13],[580,2,580,3],[580,7,580,8],[580,12,580,13],[577,2,577,3],[577,7,577,8],[577,12,577,13],[578,2,578,3],[578,7,578,8],[578,12,578,13],[583,2,583,3],[583,7,583,8],[583,12,583,13],[584,2,584,3],[584,7,584,8],[584,12,584,13],[581,2,581,3],[581,7,581,8],[581,12,581,13],[582,2,582,3],[582,7,582,8],[582,12,582,13],[587,2,587,3],[587,7,587,8],[587,12,587,13],[588,2,588,3],[588,7,588,8],[588,12,588,13],[585,2,585,3],[585,7,585,8],[585,12,585,13],[586,2,586,3],[586,7,586,8],[586,12,586,13],[591,2,591,3],[591,7,591,8],[591,12,591,13],[592,2,592,3],[592,7,592,8],[592,12,592,13],[589,2,589,3],[589,7,589,8],[589,12,589,13],[590,2,590,3],[590,7,590,8],[590,12,590,13],[595,2,595,3],[595,7,595,8],[595,12,595,13],[596,2,596,3],[596,7,596,8],[596,12,596,13],[593,2,593,3],[593,7,593,8],[593,12,593,13],[594,2,594,3],[594,7,594,8],[594,12,594,13],[599,2,599,3],[599,7,599,8],[599,12,599,13],[600,2,600,3],[600,7,600,8],[600,12,600,13],[597,2,597,3],[597,7,597,8],[597,12,597,13],[598,2,598,3],[598,7,598,8],[598,12,598,13],[603,2,603,3],[603,7,603,8],[603,12,603,13],[604,2,604,3],[604,7,604,8],[604,12,604,13],[601,2,601,3],[601,7,601,8],[601,12,601,13],[602,2,602,3],[602,7,602,8],[602,12,602,13],[607,2,607,3],[607,7,607,8],[607,12,607,13],[608,2,608,3],[608,7,608,8],[608,12,608,13],[605,2,605,3],[605,7,605,8],[605,12,605,13],[606,2,606,3],[606,7,606,8],[606,12,606,13],[611,2,611,3],[611,7,611,8],[611,12,611,13],[612,2,612,3],[612,7,612,8],[612,12,612,13],[609,2,609,3],[609,7,609,8],[609,12,609,13],[610,2,610,3],[610,7,610,8],[610,12,610,13],[615,2,615,3],[615,7,615,8],[615,12,615,13],[616,2,616,3],[616,7,616,8],[616,12,616,13],[613,2,613,3],[613,7,613,8],[613,12,613,13],[614,2,614,3],[614,7,614,8],[614,12,614,13],[619,2,619,3],[619,7,619,8],[619,12,619,13],[620,2,620,3],[620,7,620,8],[620,12,620,13],[617,2,617,3],[617,7,617,8],[617,12,617,13],[618,2,618,3],[618,7,618,8],[618,12,618,13],[623,2,623,3],[623,7,623,8],[623,12,623,13],[624,2,624,3],[624,7,624,8],[624,12,624,13],[621,2,621,3],[621,7,621,8],[621,12,621,13],[622,2,622,3],[622,7,622,8],[622,12,622,13],[627,2,627,3],[627,7,627,8],[627,12,627,13],[628,2,628,3],[628,7,628,8],[628,12,628,13],[625,2,625,3],[625,7,625,8],[625,12,625,13],[626,2,626,3],[626,7,626,8],[626,12,626,13],[631,2,631,3],[631,7,631,8],[631,12,631,13],[632,2,632,3],[632,7,632,8],[632,12,632,13],[629,2,629,3],[629,7,629,8],[629,12,629,13],[630,2,630,3],[630,7,630,8],[630,12,630,13],[635,2,635,3],[635,7,635,8],[635,12,635,13],[636,2,636,3],[636,7,636,8],[636,12,636,13],[633,2,633,3],[633,7,633,8],[633,12,633,13],[634,2,634,3],[634,7,634,8],[634,12,634,13],[639,2,639,3],[639,7,639,8],[639,12,639,13],[640,2,640,3],[640,7,640,8],[640,12,640,13],[637,2,637,3],[637,7,637,8],[637,12,637,13],[638,2,638,3],[638,7,638,8],[638,12,638,13],[643,2,643,3],[643,7,643,8],[643,12,643,13],[644,2,644,3],[644,7,644,8],[644,12,644,13],[641,2,641,3],[641,7,641,8],[641,12,641,13],[642,2,642,3],[642,7,642,8],[642,12,642,13],[647,2,647,3],[647,7,647,8],[647,12,647,13],[648,2,648,3],[648,7,648,8],[648,12,648,13],[645,2,645,3],[645,7,645,8],[645,12,645,13],[646,2,646,3],[646,7,646,8],[646,12,646,13],[651,2,651,3],[651,7,651,8],[651,12,651,13],[652,2,652,3],[652,7,652,8],[652,12,652,13],[649,2,649,3],[649,7,649,8],[649,12,649,13],[650,2,650,3],[650,7,650,8],[650,12,650,13],[655,2,655,3],[655,7,655,8],[655,12,655,13],[656,2,656,3],[656,7,656,8],[656,12,656,13],[653,2,653,3],[653,7,653,8],[653,12,653,13],[654,2,654,3],[654,7,654,8],[654,12,654,13],[659,2,659,3],[659,7,659,8],[659,12,659,13],[660,2,660,3],[660,7,660,8],[660,12,660,13],[657,2,657,3],[657,7,657,8],[657,12,657,13],[658,2,658,3],[658,7,658,8],[658,12,658,13],[663,2,663,3],[663,7,663,8],[663,12,663,13],[664,2,664,3],[664,7,664,8],[664,12,664,13],[661,2,661,3],[661,7,661,8],[661,12,661,13],[662,2,662,3],[662,7,662,8],[662,12,662,13],[667,2,667,3],[667,7,667,8],[667,12,667,13],[668,2,668,3],[668,7,668,8],[668,12,668,13],[665,2,665,3],[665,7,665,8],[665,12,665,13],[666,2,666,3],[666,7,666,8],[666,12,666,13],[671,2,671,3],[671,7,671,8],[671,12,671,13],[672,2,672,3],[672,7,672,8],[672,12,672,13],[669,2,669,3],[669,7,669,8],[669,12,669,13],[670,2,670,3],[670,7,670,8],[670,12,670,13],[675,2,675,3],[675,7,675,8],[675,12,675,13],[676,2,676,3],[676,7,676,8],[676,12,676,13],[673,2,673,3],[673,7,673,8],[673,12,673,13],[674,2,674,3],[674,7,674,8],[674,12,674,13],[679,2,679,3],[679,7,679,8],[679,12,679,13],[680,2,680,3],[680,7,680,8],[680,12,680,13],[677,2,677,3],[677,7,677,8],[677,12,677,13],[678,2,678,3],[678,7,678,8],[678,12,678,13],[683,2,683,3],[683,7,683,8],[683,12,683,13],[684,2,684,3],[684,7,684,8],[684,12,684,13],[681,2,681,3],[681,7,681,8],[681,12,681,13],[682,2,682,3],[682,7,682,8],[682,12,682,13],[687,2,687,3],[687,7,687,8],[687,12,687,13],[688,2,688,3],[688,7,688,8],[688,12,688,13],[685,2,685,3],[685,7,685,8],[685,12,685,13],[686,2,686,3],[686,7,686,8],[686,12,686,13],[691,2,691,3],[691,7,691,8],[691,12,691,13],[689,2,689,3],[689,7,689,8],[689,12,689,13],[690,2,690,3],[690,7,690,8],[690,12,690,13]]}
[]
[{"$f":"A1026","v":"Saint Lucia"}]
[{"$f":"A1034","v":"2012"}]
["Use of drinking water sources"]
[" by wealth quintile and sub-national region"]
["Notes:"]
["WHO/UNICEF JMP customised wealth index excludes water,"]
[" sanitation and hygiene assets."]
["Survey used for analysis:",{"$f":"A1025","v":"MICS12"}]
[{"$f":"B1028","v":""}]
[{"$f":"B1027","v":""}]
[]
[]
["Use of drinking water sources",null,"NATIONAL wealth index quintile",null,null,null,null,"URBAN wealth index quintile",null,null,null,null,"RURAL wealth index quintile",null,null,null,null,null,null,null,null,null,null,null,null,null,null,null,null,null,null,null,null,null,null,null,null,null,null,null,null,null,null,null,null,null,null,null,null,null,null,null,"Raw numbers of respondents:","Use of drinking water sources","NATIONAL wealth index quintile",null,null,null,null,"URBAN wealth index quintile",null,null,null,null,"RURAL wealth index quintile"]
["Weighted percentage (used in graphs)",null,"Poorest","Poor","Middle","Rich","Richest","Poorest","Poor","Middle","Rich","Richest","Poorest","Poor","Middle","Rich","Richest",null,null,null,null,null,null,null,null,null,null,null,null,null,null,null,null,null,null,null,null,null,null,null,null,null,null,null,null,null,null,null,null,null,null,null,"Water data, raw numbers (weighted)",null,"Poorest","Poor","Middle","Rich","Richest","Poorest","Poor","Middle","Rich","Richest","Poorest","Poor","Middle","Rich","Richest"]
["Water","Improved",97.646398815005796,99.616429305313815,99.708513014589613,99.952030159075051,99.456188851385804,99.462234562805321,100,100,99.746837939900914,100,97.207062813375572,99.528443591119327,99.64009172298654,100,99.335541385013286,null,null,null,null,null,null,null,null,null,null,null,null,null,null,null,null,null,null,null,null,null,null,null,null,null,null,null,null,null,null,null,null,null,null,null,"Water","Improved","N/A","N/A","N/A","N/A","N/A","N/A","N/A","N/A","N/A","N/A","N/A","N/A","N/A","N/A","N/A"]
[null,"Not Improved",2.353601184994182,0.38357069468616334,0.29148698541038376,4.7969840924939104E-2,0.54381114861418522,0.53776543719468417,0,0,0.25316206009907927,0,2.7929371866244299,0.47155640888068651,0.35990827701346628,0,0.66445861498671077,null,null,null,null,null,null,null,null,null,null,null,null,null,null,null,null,null,null,null,null,null,null,null,null,null,null,null,null,null,null,null,null,null,null,null,null,"Not Improved","N/A","N/A","N/A","N/A","N/A","N/A","N/A","N/A","N/A","N/A","N/A","N/A","N/A","N/A","N/A"]
["Water ladder","Basic",{"$f":"C16*C23/100","v":97.313725716622471},{"$f":"D16*D23/100","v":99.616429305313815},{"$f":"E16*E23/100","v":99.708513014589613},99.952030159075051,99.311306509755539,99.130517799820396,100,100,99.7468379399009,99.238230271170707,96.87230147885775,99.528443591119327,99.64009172298654,100,99.3355413850133,null,null,null,null,null,null,null,null,null,null,null,null,null,null,null,null,null,null,null,null,null,null,null,null,null,null,null,null,null,null,null,null,null,null,null,"Water ladder","Basic","N/A","N/A","N/A","N/A","N/A","N/A","N/A","N/A","N/A","N/A","N/A","N/A","N/A","N/A","N/A"]
[null,"Limited",{"$f":"C16*C22/100","v":0.33267309838333453},{"$f":"D16*D22/100","v":0},{"$f":"E16*E22/100","v":0},0,0.14488234163027458,0.33171676298493741,0,0,0,0.7617697288292804,0.33476133451780976,0,0,0,0,null,null,null,null,null,null,null,null,null,null,null,null,null,null,null,null,null,null,null,null,null,null,null,null,null,null,null,null,null,null,null,null,null,null,null,null,"Limited","N/A","N/A","N/A","N/A","N/A","N/A","N/A","N/A","N/A","N/A","N/A","N/A","N/A","N/A","N/A"]
[null,"Unimproved",{"$f":"100-C18-C19-C21","v":2.353601184994194},{"$f":"100-D18-D19-D21","v":0.38357069468618477},{"$f":"100-E18-E19-E21","v":0.29148698541038698},4.7969840924949381E-2,0.54381114861418622,0.53776543719466674,0,0,0.25316206009910047,1.2656542480726785E-14,2.7929371866244401,0.47155640888067296,0.35990827701346007,0,0.66445861498669956,null,null,null,null,null,null,null,null,null,null,null,null,null,null,null,null,null,null,null,null,null,null,null,null,null,null,null,null,null,null,null,null,null,null,null,null,"Unimproved","N/A","N/A","N/A","N/A","N/A","N/A","N/A","N/A","N/A","N/A","N/A","N/A","N/A","N/A","N/A"]
[null,"Surface water",0,0,0,0,0,0,0,0,0,0,0,0,0,0,0,null,null,null,null,null,null,null,null,null,null,null,null,null,null,null,null,null,null,null,null,null,null,null,null,null,null,null,null,null,null,null,null,null,null,null,null,"Surface water","N/A","N/A","N/A","N/A","N/A","N/A","N/A","N/A","N/A","N/A","N/A","N/A","N/A","N/A","N/A"]
["Improved water point at more than 30 minutes","Yes",0.34069162039820255,0,0,0,0.14567453599772218,0.33351026592457589,0,0,0,0.7617697288292804,0.34437964159096779,0,0,0,0,null,null,null,null,null,null,null,null,null,null,null,null,null,null,null,null,null,null,null,null,null,null,null,null,null,null,null,null,null,null,null,null,null,null,null,"Improved water point at more than 30 minutes","Yes","N/A","N/A","N/A","N/A","N/A","N/A","N/A","N/A","N/A","N/A","N/A","N/A","N/A","N/A","N/A"]
[null,"No",99.659308379601811,100,100,100,99.854325464002287,99.666489734075427,100,100,100,99.238230271170707,99.655620358409024,100,100,100,100,null,null,null,null,null,null,null,null,null,null,null,null,null,null,null,null,null,null,null,null,null,null,null,null,null,null,null,null,null,null,null,null,null,null,null,null,"No","N/A","N/A","N/A","N/A","N/A","N/A","N/A","N/A","N/A","N/A","N/A","N/A","N/A","N/A","N/A"]
["Manually calculated ratios","Improved wells",{"$f":"C63/(C62+C63+C64)*100","v":40.591947485041601},64.189489697942079,81.434096994941982,95.457457810340969,21.03727473579675,0,50,{"$f":"J63/(J62+J63+J64)*100","v":100},66.666666666666657,100,41.662846289868369,62.5,81.434096994941982,100,0]
[null,"Improved springs"]
[null,"Other"]
[null,null,"NATIONAL wealth index quintile",null,null,null,null,"URBAN wealth index quintile",null,null,null,null,"RURAL wealth index quintile",null,null,null,null,null,null,null,null,null,null,null,null,null,null,null,null,null,null,null,null,null,null,null,null,null,null,null,null,null,null,null,null,null,null,null,null,null,null,null,"Raw numbers of respondents:","Use of drinking water sources","NATIONAL wealth index quintile",null,null,null,null,"URBAN wealth index quintile",null,null,null,null,"RURAL wealth index quintile"]
["Percentage based on weighted population",null,"Poorest","Poor","Middle","Rich","Richest","Poorest","Poor","Middle","Rich","Richest","Poorest","Poor","Middle","Rich","Richest",null,null,null,null,null,null,null,null,null,null,null,null,null,null,null,null,null,null,null,null,null,null,null,null,null,null,null,null,null,null,null,null,null,null,null,"Water data, raw numbers (weighted)",null,"Poorest","Poor","Middle","Rich","Richest","Poorest","Poor","Middle","Rich","Richest","Poorest","Poor","Middle","Rich","Richest"]
["Piped water","Yes",89.520499358988232,92.231618015106179,95.126327585278929,97.717515568174349,97.043229710752883,95.755097068637824,98.218546700261513,98.941091965729129,97.278507853934897,97.987658299675985,87.637757002644108,90.501580003689796,95.13558359281862,97.619473349405808,96.854895889062931,null,null,null,null,null,null,null,null,null,null,null,null,null,null,null,null,null,null,null,null,null,null,null,null,null,null,null,null,null,null,null,null,null,null,null,"Piped water","Yes","N/A","N/A","N/A","N/A","N/A","N/A","N/A","N/A","N/A","N/A","N/A","N/A","N/A","N/A","N/A"]
[null,"No",10.479500641011757,7.7683819848938045,4.8736724147210451,2.282484431825639,2.9567702892471184,4.2449029313621445,1.7814532997384951,1.058908034270879,2.7214921460651018,2.0123417003240158,12.362242997355892,9.4984199963102114,4.8644164071813778,2.380526650594184,3.1451041109370967,null,null,null,null,null,null,null,null,null,null,null,null,null,null,null,null,null,null,null,null,null,null,null,null,null,null,null,null,null,null,null,null,null,null,null,null,"No","N/A","N/A","N/A","N/A","N/A","N/A","N/A","N/A","N/A","N/A","N/A","N/A","N/A","N/A","N/A"]
["Piped water on premises","Yes",78.477957230782565,87.203974943002237,93.945686682392051,97.717515568174349,96.636782623899393,76.485115396755717,90.716216476520046,97.158373376387019,97.278507853934897,97.987658299675985,78.964376032669733,85.090816944437492,94.595721177298415,97.619473349405808,96.358276301391186,null,null,null,null,null,null,null,null,null,null,null,null,null,null,null,null,null,null,null,null,null,null,null,null,null,null,null,null,null,null,null,null,null,null,null,"Piped water on premises","Yes","N/A","N/A","N/A","N/A","N/A","N/A","N/A","N/A","N/A","N/A","N/A","N/A","N/A","N/A","N/A"]
[null,"No",21.522042769217407,12.796025056997735,6.0543133176079431,2.282484431825639,3.3632173761006268,23.514884603244163,9.2837835234799719,2.8416266236129912,2.7214921460651018,2.0123417003240158,21.035623967330231,14.909183055562503,5.4042788227015777,2.380526650594184,3.6417236986088253,null,null,null,null,null,null,null,null,null,null,null,null,null,null,null,null,null,null,null,null,null,null,null,null,null,null,null,null,null,null,null,null,null,null,null,null,"No","N/A","N/A","N/A","N/A","N/A","N/A","N/A","N/A","N/A","N/A","N/A","N/A","N/A","N/A","N/A"]
["Piped water into dwelling","Yes","N/A","N/A","N/A","N/A","N/A","N/A","N/A","N/A","N/A","N/A","N/A","N/A","N/A","N/A","N/A",null,null,null,null,null,null,null,null,null,null,null,null,null,null,null,null,null,null,null,null,null,null,null,null,null,null,null,null,null,null,null,null,null,null,null,"Piped water into dwelling","Yes","N/A","N/A","N/A","N/A","N/A","N/A","N/A","N/A","N/A","N/A","N/A","N/A","N/A","N/A","N/A"]
[null,"No","N/A","N/A","N/A","N/A","N/A","N/A","N/A","N/A","N/A","N/A","N/A","N/A","N/A","N/A","N/A",null,null,null,null,null,null,null,null,null,null,null,null,null,null,null,null,null,null,null,null,null,null,null,null,null,null,null,null,null,null,null,null,null,null,null,null,"No","N/A","N/A","N/A","N/A","N/A","N/A","N/A","N/A","N/A","N/A","N/A","N/A","N/A","N/A","N/A"]
["Water source on premises","Yes",84.504178497311926,92.878389681805814,98.400346555585671,98.943986892754879,98.580705326473193,80.446197680709602,92.497669776258533,97.962607326466184,99.240513819702755,99.238230271170707,85.869742379668949,92.074269426717379,98.942769436272954,98.863627859358616,98.442852348408309,null,null,null,null,null,null,null,null,null,null,null,null,null,null,null,null,null,null,null,null,null,null,null,null,null,null,null,null,null,null,null,null,null,null,null,"Water source on premises","Yes","N/A","N/A","N/A","N/A","N/A","N/A","N/A","N/A","N/A","N/A","N/A","N/A","N/A","N/A","N/A"]
[null,"No",15.495821502688029,7.1216103181941772,1.5996534444143249,1.0560131072451284,1.4192946735268157,19.553802319290316,7.5023302237414766,2.037392673533843,0.7594861802972378,0.7617697288292804,14.130257620331029,7.9257305732826158,1.0572305637270574,1.1363721406413825,1.5571476515916938,null,null,null,null,null,null,null,null,null,null,null,null,null,null,null,null,null,null,null,null,null,null,null,null,null,null,null,null,null,null,null,null,null,null,null,null,"No","N/A","N/A","N/A","N/A","N/A","N/A","N/A","N/A","N/A","N/A","N/A","N/A","N/A","N/A","N/A"]
["Improved Water source on premises","Yes",84.504178497311926,92.878389681805814,98.400346555585671,98.943986892754879,98.580705326473193,80.446197680709602,92.497669776258533,97.962607326466184,99.240513819702755,99.238230271170707,85.869742379668949,92.074269426717379,98.942769436272954,98.863627859358616,98.442852348408309,null,null,null,null,null,null,null,null,null,null,null,null,null,null,null,null,null,null,null,null,null,null,null,null,null,null,null,null,null,null,null,null,null,null,null,"Improved water source on premises","Yes","N/A","N/A","N/A","N/A","N/A","N/A","N/A","N/A","N/A","N/A","N/A","N/A","N/A","N/A","N/A"]
[null,"No",15.495821502688029,7.1216103181941772,1.5996534444143249,1.0560131072451284,1.4192946735268157,19.553802319290316,7.5023302237414766,2.037392673533843,0.7594861802972378,0.7617697288292804,14.130257620331029,7.9257305732826158,1.0572305637270574,1.1363721406413825,1.5571476515916938,null,null,null,null,null,null,null,null,null,null,null,null,null,null,null,null,null,null,null,null,null,null,null,null,null,null,null,null,null,null,null,null,null,null,null,null,"No","N/A","N/A","N/A","N/A","N/A","N/A","N/A","N/A","N/A","N/A","N/A","N/A","N/A","N/A","N/A"]
["Piped water on premises available when needed","Yes","N/A","N/A","N/A","N/A","N/A","N/A","N/A","N/A","N/A","N/A","N/A","N/A","N/A","N/A","N/A",null,null,null,null,null,null,null,null,null,null,null,null,null,null,null,null,null,null,null,null,null,null,null,null,null,null,null,null,null,null,null,null,null,null,null,"Piped water on premises available when needed","Yes","N/A","N/A","N/A","N/A","N/A","N/A","N/A","N/A","N/A","N/A","N/A","N/A","N/A","N/A","N/A"]
[null,"No","N/A","N/A","N/A","N/A","N/A","N/A","N/A","N/A","N/A","N/A","N/A","N/A","N/A","N/A","N/A",null,null,null,null,null,null,null,null,null,null,null,null,null,null,null,null,null,null,null,null,null,null,null,null,null,null,null,null,null,null,null,null,null,null,null,null,"No","N/A","N/A","N/A","N/A","N/A","N/A","N/A","N/A","N/A","N/A","N/A","N/A","N/A","N/A","N/A"]
["Water point at more than 30 minutes","Yes",0.47776348109043848,0,0.29305192154842391,0,0.14488234163027458,0.33153846489065059,0,0,0,0.7617697288292804,0.51368883545650745,0,0.36047588187274632,0,0,null,null,null,null,null,null,null,null,null,null,null,null,null,null,null,null,null,null,null,null,null,null,null,null,null,null,null,null,null,null,null,null,null,null,null,"Water point at more than 30 minutes","Yes","N/A","N/A","N/A","N/A","N/A","N/A","N/A","N/A","N/A","N/A","N/A","N/A","N/A","N/A","N/A"]
[null,"No",99.522236518909565,100,99.706948078451575,100,99.855117658369736,99.668461535109358,100,100,100,99.238230271170707,99.48631116454348,100,99.639524118127255,100,100,null,null,null,null,null,null,null,null,null,null,null,null,null,null,null,null,null,null,null,null,null,null,null,null,null,null,null,null,null,null,null,null,null,null,null,null,"No","N/A","N/A","N/A","N/A","N/A","N/A","N/A","N/A","N/A","N/A","N/A","N/A","N/A","N/A","N/A"]
["Water source available when needed","Yes","N/A","N/A","N/A","N/A","N/A","N/A","N/A","N/A","N/A","N/A","N/A","N/A","N/A","N/A","N/A",null,null,null,null,null,null,null,null,null,null,null,null,null,null,null,null,null,null,null,null,null,null,null,null,null,null,null,null,null,null,null,null,null,null,null,"Water source available when needed","Yes","N/A","N/A","N/A","N/A","N/A","N/A","N/A","N/A","N/A","N/A","N/A","N/A","N/A","N/A","N/A"]
[null,"No","N/A","N/A","N/A","N/A","N/A","N/A","N/A","N/A","N/A","N/A","N/A","N/A","N/A","N/A","N/A",null,null,null,null,null,null,null,null,null,null,null,null,null,null,null,null,null,null,null,null,null,null,null,null,null,null,null,null,null,null,null,null,null,null,null,null,"No","N/A","N/A","N/A","N/A","N/A","N/A","N/A","N/A","N/A","N/A","N/A","N/A","N/A","N/A","N/A"]
["Improved water source available when needed","Yes","N/A","N/A","N/A","N/A","N/A","N/A","N/A","N/A","N/A","N/A","N/A","N/A","N/A","N/A","N/A",null,null,null,null,null,null,null,null,null,null,null,null,null,null,null,null,null,null,null,null,null,null,null,null,null,null,null,null,null,null,null,null,null,null,null,"Improved water source available when needed","Yes","N/A","N/A","N/A","N/A","N/A","N/A","N/A","N/A","N/A","N/A","N/A","N/A","N/A","N/A","N/A"]
[null,"No","N/A","N/A","N/A","N/A","N/A","N/A","N/A","N/A","N/A","N/A","N/A","N/A","N/A","N/A","N/A",null,null,null,null,null,null,null,null,null,null,null,null,null,null,null,null,null,null,null,null,null,null,null,null,null,null,null,null,null,null,null,null,null,null,null,null,"No","N/A","N/A","N/A","N/A","N/A","N/A","N/A","N/A","N/A","N/A","N/A","N/A","N/A","N/A","N/A"]
["Microbiological quality at point of collection","Not contaminated (No E. coli in 100 mL)","N/A","N/A","N/A","N/A","N/A","N/A","N/A","N/A","N/A","N/A","N/A","N/A","N/A","N/A","N/A",null,null,null,null,null,null,null,null,null,null,null,null,null,null,null,null,null,null,null,null,null,null,null,null,null,null,null,null,null,null,null,null,null,null,null,"Microbiological quality at point of collection","Not contaminated (No E. coli in 100 mL)","N/A","N/A","N/A","N/A","N/A","N/A","N/A","N/A","N/A","N/A","N/A","N/A","N/A","N/A","N/A"]
[null,"Contaminated (E. coli detected in 100 mL)","N/A","N/A","N/A","N/A","N/A","N/A","N/A","N/A","N/A","N/A","N/A","N/A","N/A","N/A","N/A",null,null,null,null,null,null,null,null,null,null,null,null,null,null,null,null,null,null,null,null,null,null,null,null,null,null,null,null,null,null,null,null,null,null,null,null,"Contaminated (E. coli detected in 100 mL)","N/A","N/A","N/A","N/A","N/A","N/A","N/A","N/A","N/A","N/A","N/A","N/A","N/A","N/A","N/A"]
[null,"Highly contaminated (>100 CFU/100 mL)","N/A","N/A","N/A","N/A","N/A","N/A","N/A","N/A","N/A","N/A","N/A","N/A","N/A","N/A","N/A",null,null,null,null,null,null,null,null,null,null,null,null,null,null,null,null,null,null,null,null,null,null,null,null,null,null,null,null,null,null,null,null,null,null,null,null,"Highly contaminated (>100 CFU/100 mL)","N/A","N/A","N/A","N/A","N/A","N/A","N/A","N/A","N/A","N/A","N/A","N/A","N/A","N/A","N/A"]
["Microbiological quality of improved water sources at point of collection","Not contaminated (No E. coli in 100 mL)","N/A","N/A","N/A","N/A","N/A","N/A","N/A","N/A","N/A","N/A","N/A","N/A","N/A","N/A","N/A",null,null,null,null,null,null,null,null,null,null,null,null,null,null,null,null,null,null,null,null,null,null,null,null,null,null,null,null,null,null,null,null,null,null,null,"Microbiological quality of improved water sources at point of collection","Not contaminated (No E. coli in 100 mL)","N/A","N/A","N/A","N/A","N/A","N/A","N/A","N/A","N/A","N/A","N/A","N/A","N/A","N/A","N/A"]
[null,"Contaminated (E. coli detected in 100 mL)","N/A","N/A","N/A","N/A","N/A","N/A","N/A","N/A","N/A","N/A","N/A","N/A","N/A","N/A","N/A",null,null,null,null,null,null,null,null,null,null,null,null,null,null,null,null,null,null,null,null,null,null,null,null,null,null,null,null,null,null,null,null,null,null,null,null,"Contaminated (E. coli detected in 100 mL)","N/A","N/A","N/A","N/A","N/A","N/A","N/A","N/A","N/A","N/A","N/A","N/A","N/A","N/A","N/A"]
[null,"Highly contaminated (>100 CFU/100 mL)","N/A","N/A","N/A","N/A","N/A","N/A","N/A","N/A","N/A","N/A","N/A","N/A","N/A","N/A","N/A",null,null,null,null,null,null,null,null,null,null,null,null,null,null,null,null,null,null,null,null,null,null,null,null,null,null,null,null,null,null,null,null,null,null,null,null,"Highly contaminated (>100 CFU/100 mL)","N/A","N/A","N/A","N/A","N/A","N/A","N/A","N/A","N/A","N/A","N/A","N/A","N/A","N/A","N/A"]
["Microbiological quality of piped on premises at point of collection","Not contaminated (No E. coli in 100 mL)","N/A","N/A","N/A","N/A","N/A","N/A","N/A","N/A","N/A","N/A","N/A","N/A","N/A","N/A","N/A",null,null,null,null,null,null,null,null,null,null,null,null,null,null,null,null,null,null,null,null,null,null,null,null,null,null,null,null,null,null,null,null,null,null,null,"Microbiological quality of piped on premises at point of collection","Not contaminated (No E. coli in 100 mL)","N/A","N/A","N/A","N/A","N/A","N/A","N/A","N/A","N/A","N/A","N/A","N/A","N/A","N/A","N/A"]
[null,"Contaminated (E. coli detected in 100 mL)","N/A","N/A","N/A","N/A","N/A","N/A","N/A","N/A","N/A","N/A","N/A","N/A","N/A","N/A","N/A",null,null,null,null,null,null,null,null,null,null,null,null,null,null,null,null,null,null,null,null,null,null,null,null,null,null,null,null,null,null,null,null,null,null,null,null,"Contaminated (E. coli detected in 100 mL)","N/A","N/A","N/A","N/A","N/A","N/A","N/A","N/A","N/A","N/A","N/A","N/A","N/A","N/A","N/A"]
[null,"Highly contaminated (>100 CFU/100 mL)","N/A","N/A","N/A","N/A","N/A","N/A","N/A","N/A","N/A","N/A","N/A","N/A","N/A","N/A","N/A",null,null,null,null,null,null,null,null,null,null,null,null,null,null,null,null,null,null,null,null,null,null,null,null,null,null,null,null,null,null,null,null,null,null,null,null,"Highly contaminated (>100 CFU/100 mL)","N/A","N/A","N/A","N/A","N/A","N/A","N/A","N/A","N/A","N/A","N/A","N/A","N/A","N/A","N/A"]
[null,null,"NATIONAL wealth index quintile",null,null,null,null,"URBAN wealth index quintile",null,null,null,null,"RURAL wealth index quintile",null,null,null,null,null,null,null,null,null,null,null,null,null,null,null,null,null,null,null,null,null,null,null,null,null,null,null,null,null,null,null,null,null,null,null,null,null,null,null,"Raw numbers of respondents:","Use of drinking water sources","NATIONAL wealth index quintile",null,null,null,null,"URBAN wealth index quintile",null,null,null,null,"RURAL wealth index quintile"]
["Percentage based on weighted population",null,"Poorest","Poor","Middle","Rich","Richest","Poorest","Poor","Middle","Rich","Richest","Poorest","Poor","Middle","Rich","Richest",null,null,null,null,null,null,null,null,null,null,null,null,null,null,null,null,null,null,null,null,null,null,null,null,null,null,null,null,null,null,null,null,null,null,null,"Water data, raw numbers (weighted)",null,"Poorest","Poor","Middle","Rich","Richest","Poorest","Poor","Middle","Rich","Richest","Poorest","Poor","Middle","Rich","Richest"]
["Main source of drinking water","Piped into dwelling",42.262375034887846,56.735082450117226,64.239241791349201,61.610198216452808,57.68685382853932,39.15250468936852,64.335798674478923,70.333951577231574,69.636569185557335,64.297114564585627,42.04311982436451,55.306994267966772,63.188908917130874,58.364359799502253,57.665507602812646]
[null,"Piped into compound, yard or plot",25.139052309085507,13.154744267292523,3.648276303873569,0.27007985236877052,0,24.385177289792555,10.047165330663049,7.0829357062264791,1.2658103004953962,0,26.176171478631439,12.456006489721169,3.5231646179521356,0,0]
[null,"Piped to neighbour",5.340042710197852,2.6759273134359929,0.40648771012307422,0,0,8.0096890376382319,1.2884725123894776,0,0,0,4.7421646530961912,3.4875526073467435,0,0,0]
[null,"Public tap / standpipe",5.2367342240592407,2.3034588842372274,0.77415319276382388,0,0,10.230405431221246,5.9617652632757974,1.7827185893421125,0,0,3.5954054017083599,1.9232104519055448,0.53986241552019942,0,0]
[null,"Unprotected well",0,0,0,4.7969840924939104E-2,0,0,0,0,0.25316206009907927,0,0,0,0,0,0]
[null,"Protected spring",1.6081533000591144,0.68754136557431489,1.2785254472247125,1.0080432663201893,0.14488234163027458,0,0,0.25467408419173038,0.50632412019815853,0.7617697288292804,1.9946415843627632,0.78592734813447751,1.5786361445286179,1.1363721406413825,0]
[null,"Unprotected spring",2.353601184994182,0.38357069468616334,0.29148698541038376,0,0.54381114861418522,0.53776543719468417,0,0,0,0,2.7929371866244299,0.47155640888068651,0.35990827701346628,0,0.66445861498671077]
[null,"Rainwater collection",5.9599324088139447,5.6378841964524948,2.8994123041985906,1.226471324580511,1.3821806357861939,3.7071374941674597,1.7814532997384951,0.80423395007914855,1.9620059657678646,0.53958689125407377,6.5215824439480166,7.2978234215336748,2.4267344854510928,1.2441545099528015,1.5634320352628486]
[null,"Tanker-truck",0.28479550238088647,0,0,0,0,0,0,0,0,0,0.35324054744502204,0,0,0,0]
[null,"Bottled water",11.815313325521389,18.421790828204085,26.462416265056639,35.837237499352753,40.242272045430042,13.977320620617197,16.585344919454258,19.741486092928969,26.376128367882167,34.401528815331019,11.780736879819234,18.270929004510979,28.382785142403595,39.255113549903442,40.10660174693777]
[]
[]
[]
[]
[]
[]
[]
[]
[]
[]
[]
[]
[]
[]
[]
[]
[]
[]
[]
[]
[]
[]
[]
[]
[]
[]
[]
[]
[]
[]
[]
[]
[]
[]
[]
[]
[]
[]
[]
[]
[{"$f":"A1026","v":"Saint Lucia"}]
[{"$f":"A1034","v":"2012"}]
["Use of sanitation facilities"]
[" by wealth quintile and sub-national region"]
["Notes:"]
["WHO/UNICEF JMP customised wealth index excludes water,"]
[" sanitation and hygiene assets."]
["Survey used for analysis:",{"$f":"A1025","v":"MICS12"}]
[{"$f":"B1030","v":""}]
[{"$f":"B1029","v":""}]
[]
[]
["Use of sanitation facilities",null,"NATIONAL wealth index quintile",null,null,null,null,"URBAN wealth index quintile",null,null,null,null,"RURAL wealth index quintile",null,null,null,null,null,null,null,null,null,null,null,null,null,null,null,null,null,null,null,null,null,null,null,null,null,null,null,null,null,null,null,null,null,null,null,null,null,null,null,"Raw numbers of respondents:","Use of sanitation facilities","NATIONAL wealth index quintile",null,null,null,null,"URBAN wealth index quintile",null,null,null,null,"RURAL wealth index quintile"]
["Weighted percentage (used in graphs)",null,"Poorest","Poor","Middle","Rich","Richest","Poorest","Poor","Middle","Rich","Richest","Poorest","Poor","Middle","Rich","Richest",null,null,null,null,null,null,null,null,null,null,null,null,null,null,null,null,null,null,null,null,null,null,null,null,null,null,null,null,null,null,null,null,null,null,null,"Sanitation data, raw numbers (weighted)",null,"Poorest","Poor","Middle","Rich","Richest","Poorest","Poor","Middle","Rich","Richest","Poorest","Poor","Middle","Rich","Richest"]
["Sanitation","Improved",91.924954273860692,98.003680836872448,99.307729630130623,100,100,81.05374661326411,88.979440861421693,96.790045397166736,100,100,95.465722662718775,99.007766722980222,100,100,100,null,null,null,null,null,null,null,null,null,null,null,null,null,null,null,null,null,null,null,null,null,null,null,null,null,null,null,null,null,null,null,null,null,null,null,"Sanitation","Improved",913.19954249386615,970.172447911419,985.63596247109501,995.85810146185179,989.17136843724199,152.4753105830805,168.61475494096339,181.55644881658509,188.69792216195762,188.1322645270518,764.61410358397347,797.23724811713453,803.82372827729466,799.3206727634871,809.56496900394689]
[null,"Not Improved",8.0750457261392476,1.9963191631275552,0.69227036986935642,0,0,18.946253386735833,11.020559138578335,3.2099546028332675,0,0,4.5342773372812495,0.99223327701977782,0,0,0,null,null,null,null,null,null,null,null,null,null,null,null,null,null,null,null,null,null,null,null,null,null,null,null,null,null,null,null,null,null,null,null,null,null,null,null,"Not Improved",80.219001695215184,19.762256200639076,6.8708304463077923,0,0,35.640991197013228,20.883800352913237,6.0211559583576708,0,0,36.316410801134062,7.9897300327438687,0,0,0]
["Sanitation ladder","Basic",{"$f":"C122*C129/100","v":71.803965637493661},{"$f":"D122*D129/100","v":86.399059925953267},{"$f":"E122*E129/100","v":94.931996295286012},97.524747731412603,98.963702085218102,58.031643463320222,80.820312034647017,90.563014358204214,95.443082918216547,97.90955350601061,76.091087319053599,86.167293414329208,97.020612241144647,97.336045637512839,99.218283982368575,null,null,null,null,null,null,null,null,null,null,null,null,null,null,null,null,null,null,null,null,null,null,null,null,null,null,null,null,null,null,null,null,null,null,null,"Sanitation ladder","Basic",712.91588591295215,855.29427823358515,942.20651188281101,970.71633162223713,978.92060617250729,108.80215516174968,153.15332368965915,169.87593314510698,180.09911431398893,183.70575022064946,609.43673706571724,693.84229291374231,779.87470251422621,778.02713483114246,803.2364699681101]
[null,"Limited",{"$f":"C122*C128/100","v":20.120988636367045},{"$f":"D122*D128/100","v":11.604620910919214},{"$f":"E122*E128/100","v":4.3757333348446039},2.4752522685873739,1.036297914781898,23.022103149943842,8.1591288267746886,6.2270310389625054,4.5569170817834275,2.0904464939893743,19.374635343665055,12.840473308651017,2.9793877588553501,2.6639543624871762,0.78171601763142429,null,null,null,null,null,null,null,null,null,null,null,null,null,null,null,null,null,null,null,null,null,null,null,null,null,null,null,null,null,null,null,null,null,null,null,null,"Limited",199.77409759733089,114.87816967783412,43.429450588283913,24.637518762110339,10.250762264734705,43.163596437747394,15.461431251304257,11.680515671478101,8.5988078479686418,3.9222632288979771,155.17736651825535,103.3949552033923,23.949025763068406,21.293537932344755,6.3284990358367281]
[null,"Unimproved",{"$f":"100-C124-C125-C127","v":1.0139486967181188},{"$f":"100-D124-D125-D127","v":0.99018715025988868},{"$f":"100-E124-E125-E127","v":2.7311486405778851E-14},2.3092638912203256E-14,-4.4408920985006262E-16,3.1629068156407421,2.0727601286265074,1.6978272279448818,2.5757174171303632E-14,1.5543122344752192E-14,0.50920347921177989,0.33401912295714997,2.6645352591003757E-15,-1.5543122344752192E-14,3.3306690738754696E-16,null,null,null,null,null,null,null,null,null,null,null,null,null,null,null,null,null,null,null,null,null,null,null,null,null,null,null,null,null,null,null,null,null,null,null,null,"Unimproved",10.108734836013793,9.802206236081215,0,0,0,6.0303687906967909,3.9278504984548119,3.1847436473957931,0,0,4.0783660453170025,2.68961209023061,0,0,0]
[null,"Open defecation",7.061097029421175,1.0061320128676297,0.69227036986935642,0,0,15.783346571095194,8.9477990099517868,1.512127374888399,0,0,4.0250738580695655,0.65821415406262485,0,0,0,null,null,null,null,null,null,null,null,null,null,null,null,null,null,null,null,null,null,null,null,null,null,null,null,null,null,null,null,null,null,null,null,null,null,null,null,"Open defecation",70.110266859201403,9.9600499645578626,6.8708304463077923,0,0,29.61062240631642,16.955949854458428,2.8364123109618782,0,0,32.238044755817057,5.3001179425132587,0,0,0]
["Shared among Improved Sanitation","Yes",21.888494582682153,11.841005166158151,4.4062364038951687,2.4752522685873739,1.036297914781898,28.403502752057076,9.169678689577152,6.4335449099239552,4.5569170817834275,2.0904464939893743,20.294860608886616,12.969157606168563,2.9793877588553497,2.6639543624871758,0.78171601763142429,null,null,null,null,null,null,null,null,null,null,null,null,null,null,null,null,null,null,null,null,null,null,null,null,null,null,null,null,null,null,null,null,null,null,null,"Shared among improved sanitation facilities","Yes","N/A","N/A","N/A","N/A","N/A","N/A","N/A","N/A","N/A","N/A","N/A","N/A","N/A","N/A","N/A"]
[null,"No",78.111505417317858,88.158994833841874,95.593763596104822,97.524747731412617,98.963702085218102,71.596497247942864,90.83032131042286,93.566455090076033,95.443082918216547,97.90955350601061,79.705139391113264,87.030842393831449,97.020612241144647,97.336045637512839,99.218283982368575,null,null,null,null,null,null,null,null,null,null,null,null,null,null,null,null,null,null,null,null,null,null,null,null,null,null,null,null,null,null,null,null,null,null,null,null,"No","N/A","N/A","N/A","N/A","N/A","N/A","N/A","N/A","N/A","N/A","N/A","N/A","N/A","N/A","N/A"]
["Manually calculated ratios","Improved latrines",{"$f":"C158/(C158+C159)*100","v":100},{"$f":"D158/(D158+D159)*100","v":99.145175980571082},100,100,100,100,100,100,100,100,100,99.083420591435384,100,100,100]
[null,"Other"]
[null,"Other"]
[null,null,"NATIONAL wealth index quintile",null,null,null,null,"URBAN wealth index quintile",null,null,null,null,"RURAL wealth index quintile",null,null,null,null,null,null,null,null,null,null,null,null,null,null,null,null,null,null,null,null,null,null,null,null,null,null,null,null,null,null,null,null,null,null,null,null,null,null,null,"Raw numbers of respondents:","Use of sanitation facilities","NATIONAL wealth index quintile",null,null,null,null,"URBAN wealth index quintile",null,null,null,null,"RURAL wealth index quintile"]
["Percentage based on weighted population",null,"Poorest","Poor","Middle","Rich","Richest","Poorest","Poor","Middle","Rich","Richest","Poorest","Poor","Middle","Rich","Richest",null,null,null,null,null,null,null,null,null,null,null,null,null,null,null,null,null,null,null,null,null,null,null,null,null,null,null,null,null,null,null,null,null,null,null,"Sanitation data, raw numbers (weighted)",null,"Poorest","Poor","Middle","Rich","Richest","Poorest","Poor","Middle","Rich","Richest","Poorest","Poor","Middle","Rich","Richest"]
["Sanitation type","Sewer connection",1.6932328628554343,2.521046837667114,5.7926994758466233,4.8419216157278226,10.931015215195,7.5213345126289344,5.5588411859961075,16.127236381441325,11.51722778922573,14.380748949531243,0.3336160725869653,1.4321342788228255,2.8898517536669504,3.3283905321518095,10.85230132869272,null,null,null,null,null,null,null,null,null,null,null,null,null,null,null,null,null,null,null,null,null,null,null,null,null,null,null,null,null,null,null,null,null,null,null,"Sanitation type","Sewer connection","N/A","N/A","N/A","N/A","N/A","N/A","N/A","N/A","N/A","N/A","N/A","N/A","N/A","N/A","N/A"]
[null,"Septic tank connection",36.596003252662605,56.041410517180438,81.848865819449429,94.483813285711378,88.49507496260712,49.687377431591443,69.739369296911065,77.16029131666501,87.470123970377927,84.857481321639455,33.150314961187547,52.23755551786072,84.882519984404823,95.831555677404751,88.623489106542692,null,null,null,null,null,null,null,null,null,null,null,null,null,null,null,null,null,null,null,null,null,null,null,null,null,null,null,null,null,null,null,null,null,null,null,null,"Septic tank connection","N/A","N/A","N/A","N/A","N/A","N/A","N/A","N/A","N/A","N/A","N/A","N/A","N/A","N/A","N/A"]
[null,"Improved latrines",53.635718158342648,39.441223482024881,11.666164334834562,0.67426509856078853,0.57390982219786701,23.845034669043663,13.681230378514488,3.5025176990603861,1.0126482403963171,0.76176972882928051,61.981791628944258,45.338076926296658,12.227628261928224,0.84005379044339923,0.52420956476460234,null,null,null,null,null,null,null,null,null,null,null,null,null,null,null,null,null,null,null,null,null,null,null,null,null,null,null,null,null,null,null,null,null,null,null,null,"Improved latrines","N/A","N/A","N/A","N/A","N/A","N/A","N/A","N/A","N/A","N/A","N/A","N/A","N/A","N/A","N/A"]
[null,"Unimproved facilities",1.0175705794042185,0.99018715025992565,0,0,0,3.2056598676632686,2.0727601286265509,1.6978272279448692,0,0,0.50920347921168374,0.33401912295715303,0,0,0,null,null,null,null,null,null,null,null,null,null,null,null,null,null,null,null,null,null,null,null,null,null,null,null,null,null,null,null,null,null,null,null,null,null,null,null,"Unimproved facilities","N/A","N/A","N/A","N/A","N/A","N/A","N/A","N/A","N/A","N/A","N/A","N/A","N/A","N/A","N/A"]
[null,"Open defecation",7.0574751467350305,1.0061320128676297,0.69227036986935642,0,0,15.740593519072554,8.9477990099517868,1.512127374888399,0,0,4.0250738580695655,0.65821415406262485,0,0,0,null,null,null,null,null,null,null,null,null,null,null,null,null,null,null,null,null,null,null,null,null,null,null,null,null,null,null,null,null,null,null,null,null,null,null,null,"Open defecation","N/A","N/A","N/A","N/A","N/A","N/A","N/A","N/A","N/A","N/A","N/A","N/A","N/A","N/A","N/A"]
["Septic tank emptying practices","Not emptied/treated and disposed in situ","N/A","N/A","N/A","N/A","N/A","N/A","N/A","N/A","N/A","N/A","N/A","N/A","N/A","N/A","N/A",null,null,null,null,null,null,null,null,null,null,null,null,null,null,null,null,null,null,null,null,null,null,null,null,null,null,null,null,null,null,null,null,null,null,null,"Septic tank emptying practices","Not emptied/treated and disposed in situ","N/A","N/A","N/A","N/A","N/A","N/A","N/A","N/A","N/A","N/A","N/A","N/A","N/A","N/A","N/A"]
[null,"Emptied and buried on site","N/A","N/A","N/A","N/A","N/A","N/A","N/A","N/A","N/A","N/A","N/A","N/A","N/A","N/A","N/A",null,null,null,null,null,null,null,null,null,null,null,null,null,null,null,null,null,null,null,null,null,null,null,null,null,null,null,null,null,null,null,null,null,null,null,null,"Emptied and buried on site","N/A","N/A","N/A","N/A","N/A","N/A","N/A","N/A","N/A","N/A","N/A","N/A","N/A","N/A","N/A"]
[null,"Emptied and discharged locally","N/A","N/A","N/A","N/A","N/A","N/A","N/A","N/A","N/A","N/A","N/A","N/A","N/A","N/A","N/A",null,null,null,null,null,null,null,null,null,null,null,null,null,null,null,null,null,null,null,null,null,null,null,null,null,null,null,null,null,null,null,null,null,null,null,null,"Emptied and discharged locally","N/A","N/A","N/A","N/A","N/A","N/A","N/A","N/A","N/A","N/A","N/A","N/A","N/A","N/A","N/A"]
[null,"Emptied and removed offsite","N/A","N/A","N/A","N/A","N/A","N/A","N/A","N/A","N/A","N/A","N/A","N/A","N/A","N/A","N/A",null,null,null,null,null,null,null,null,null,null,null,null,null,null,null,null,null,null,null,null,null,null,null,null,null,null,null,null,null,null,null,null,null,null,null,null,"Emptied and removed offsite","N/A","N/A","N/A","N/A","N/A","N/A","N/A","N/A","N/A","N/A","N/A","N/A","N/A","N/A","N/A"]
["Latrine emptying practices","Not emptied/treated and disposed in situ","N/A","N/A","N/A","N/A","N/A","N/A","N/A","N/A","N/A","N/A","N/A","N/A","N/A","N/A","N/A",null,null,null,null,null,null,null,null,null,null,null,null,null,null,null,null,null,null,null,null,null,null,null,null,null,null,null,null,null,null,null,null,null,null,null,"Latrine emptying practices","Not emptied/treated and disposed in situ","N/A","N/A","N/A","N/A","N/A","N/A","N/A","N/A","N/A","N/A","N/A","N/A","N/A","N/A","N/A"]
[null,"Emptied and buried on site","N/A","N/A","N/A","N/A","N/A","N/A","N/A","N/A","N/A","N/A","N/A","N/A","N/A","N/A","N/A",null,null,null,null,null,null,null,null,null,null,null,null,null,null,null,null,null,null,null,null,null,null,null,null,null,null,null,null,null,null,null,null,null,null,null,null,"Emptied and buried on site","N/A","N/A","N/A","N/A","N/A","N/A","N/A","N/A","N/A","N/A","N/A","N/A","N/A","N/A","N/A"]
[null,"Emptied and discharged locally","N/A","N/A","N/A","N/A","N/A","N/A","N/A","N/A","N/A","N/A","N/A","N/A","N/A","N/A","N/A",null,null,null,null,null,null,null,null,null,null,null,null,null,null,null,null,null,null,null,null,null,null,null,null,null,null,null,null,null,null,null,null,null,null,null,null,"Emptied and discharged locally","N/A","N/A","N/A","N/A","N/A","N/A","N/A","N/A","N/A","N/A","N/A","N/A","N/A","N/A","N/A"]
[null,"Emptied and removed offsite","N/A","N/A","N/A","N/A","N/A","N/A","N/A","N/A","N/A","N/A","N/A","N/A","N/A","N/A","N/A",null,null,null,null,null,null,null,null,null,null,null,null,null,null,null,null,null,null,null,null,null,null,null,null,null,null,null,null,null,null,null,null,null,null,null,null,"Emptied and removed offsite","N/A","N/A","N/A","N/A","N/A","N/A","N/A","N/A","N/A","N/A","N/A","N/A","N/A","N/A","N/A"]
["Shared among improved sanitation facilities","Yes",20.109761264865917,11.604620910919213,4.3757333348446048,2.4739989287574349,1.036297914781898,22.945165320231112,8.1591288267746886,6.2270310389625063,4.5569170817834275,2.0848434683748729,19.374635343665055,12.840473308651019,2.9793877588553497,2.6639543624871758,0.78171601763142429,null,null,null,null,null,null,null,null,null,null,null,null,null,null,null,null,null,null,null,null,null,null,null,null,null,null,null,null,null,null,null,null,null,null,null,"Shared among improved sanitation facilities","Yes","N/A","N/A","N/A","N/A","N/A","N/A","N/A","N/A","N/A","N/A","N/A","N/A","N/A","N/A","N/A"]
[null,"No",71.7638995248371,86.399059925953253,94.931996295286012,97.475366239155136,98.963702085218102,57.837706850594138,80.820312034647003,90.563014358204228,95.443082918216547,97.647126441851853,76.091087319053614,86.167293414329222,97.020612241144647,97.336045637512839,99.218283982368575,null,null,null,null,null,null,null,null,null,null,null,null,null,null,null,null,null,null,null,null,null,null,null,null,null,null,null,null,null,null,null,null,null,null,null,null,"No","N/A","N/A","N/A","N/A","N/A","N/A","N/A","N/A","N/A","N/A","N/A","N/A","N/A","N/A","N/A"]
[null,"DK/missing",8.1263392102969529,1.9963191631275552,0.69227036986935642,5.0634832087435723E-2,0,19.217127829174636,11.020559138578335,3.2099546028332675,0,0.26803008977326537,4.5342773372812495,0.99223327701977782,0,0,0,null,null,null,null,null,null,null,null,null,null,null,null,null,null,null,null,null,null,null,null,null,null,null,null,null,null,null,null,null,null,null,null,null,null,null,null,"DK/missing","N/A","N/A","N/A","N/A","N/A","N/A","N/A","N/A","N/A","N/A","N/A","N/A","N/A","N/A","N/A"]
["Shared among all sanitation facilities","Yes",21.84082469689228,11.928387483607002,4.4062364038951687,2.4739989287574349,1.036297914781898,27.53296169403799,10.129924442029179,6.3226373694407423,4.5569170817834275,2.0848434683748729,20.370135759602821,12.925551115584394,2.9793877588553497,2.6639543624871758,0.78171601763142429,null,null,null,null,null,null,null,null,null,null,null,null,null,null,null,null,null,null,null,null,null,null,null,null,null,null,null,null,null,null,null,null,null,null,null,"Shared among all sanitation facilities","Yes","N/A","N/A","N/A","N/A","N/A","N/A","N/A","N/A","N/A","N/A","N/A","N/A","N/A","N/A","N/A"]
[null,"No",78.103986911960988,88.071612516393003,95.593763596104822,97.475366239155136,98.963702085218102,72.14556150740404,89.870075557970821,93.67736263055923,95.443082918216547,97.647126441851853,79.629864240397069,87.074448884415617,97.020612241144647,97.336045637512839,99.218283982368575,null,null,null,null,null,null,null,null,null,null,null,null,null,null,null,null,null,null,null,null,null,null,null,null,null,null,null,null,null,null,null,null,null,null,null,null,"No","N/A","N/A","N/A","N/A","N/A","N/A","N/A","N/A","N/A","N/A","N/A","N/A","N/A","N/A","N/A"]
["Type of toilet facility","Flush to piped sewer system",1.6932328628554343,2.521046837667114,5.7926994758466233,4.8419216157278226,10.931015215195,7.5213345126289344,5.5588411859961075,16.127236381441325,11.51722778922573,14.380748949531243,0.3336160725869653,1.4321342788228255,2.8898517536669504,3.3283905321518095,10.85230132869272,null,null,null,null,null,null,null,null,null,null,null,null,null,null,null,null,null,null,null,null,null,null,null,null,null,null,null,null,null,null,null,null,null,null,null,"Type of toilet facility","Flush to piped sewer system",16.82088925590957,24.956717552986341,57.49293579106854,48.218668676658112,108.12647278822752,14.148856329667396,10.533923738543619,30.251083720700787,21.732769528928522,27.054828654703343,2.6720329262421743,11.531931576413593,23.22931410801246,26.604513593792049,87.856429887846133]
[null,"Flush to septic tank",36.596003252662605,56.041410517180438,81.848865819449429,94.483813285711378,88.49507496260712,49.687377431591443,69.739369296911065,77.16029131666501,87.470123970377927,84.857481321639455,33.150314961187547,52.23755551786072,84.882519984404823,95.831555677404751,88.623489106542692,null,null,null,null,null,null,null,null,null,null,null,null,null,null,null,null,null,null,null,null,null,null,null,null,null,null,null,null,null,null,null,null,null,null,null,null,"Flush to septic tank",363.55148274398994,554.77337138347389,812.35555318388595,940.92470917584626,875.36794400718395,93.470056875826799,132.15509728870779,144.73542628916837,165.05430644459156,159.64430123102031,265.51098813892258,420.63088975583497,682.30583679436256,766.00143556034743,717.46472211559853]
[null,"Flush to pit (latrine)",1.074072511446337,0.54151156896870123,0.12752555611704292,0,0,0,0,0,0,0,1.3322048935714403,0.66572669489038094,0.1574598711933915,0,0,null,null,null,null,null,null,null,null,null,null,null,null,null,null,null,null,null,null,null,null,null,null,null,null,null,null,null,null,null,null,null,null,null,null,null,null,"Flush to pit (latrine)",10.670035506745309,5.3606109480028756,1.2656998071673455,0,0,0,0,0,0,0,10.670035506745309,5.3606109480028756,1.2656998071673455,0,0]
[null,"Flush to unknown place / Not sure / DK where",0,5.0796709927062374E-2,0.38257666835112869,0,0.57390982219786701,0,0.26536047165916016,0,0,0.76176972882928051,0,0,0.47237961358017455,0,0.52420956476460234,null,null,null,null,null,null,null,null,null,null,null,null,null,null,null,null,null,null,null,null,null,null,null,null,null,null,null,null,null,null,null,null,null,null,null,null,"Flush to unknown place / Not sure / DK where",0,0.50285426011512535,3.7970994215020366,0,5.6769516418303843,0,0.50285426011512535,0,0,1.4331346413281072,0,0,3.7970994215020366,0,4.2438170005022773]
[null,"Ventilated Improved Pit latrine (VIP)",4.2455166842382717,7.3367699280925374,3.5002213772990851,0.40511977855315567,0,1.2997035421705632,0.59871956418097994,0,1.0126482403963171,0,6.0667802734053504,8.5644506470434756,3.2968160531116348,0.50473086369676168,0,null,null,null,null,null,null,null,null,null,null,null,null,null,null,null,null,null,null,null,null,null,null,null,null,null,null,null,null,null,null,null,null,null,null,null,null,"Ventilated Improved Pit latrine (VIP)",42.175750037864418,72.629231679045319,34.739934936840498,4.0344181353459145,0,2.4449542376361455,1.1345649243847513,0,1.9108461884374759,0,48.590694450399695,68.963267140325883,26.500589712566299,4.0344181353459145,0]
[null,"Pit latrine with slab",48.316128962658055,31.51214527503658,7.6558407330673015,0.2691453200076328,0,22.545331126873101,12.817150342674349,3.5025176990603861,0,0,54.582806461967451,36.107899584362812,8.3009727240430244,0.33532292674663744,0,null,null,null,null,null,null,null,null,null,null,null,null,null,null,null,null,null,null,null,null,null,null,null,null,null,null,null,null,null,null,null,null,null,null,null,null,"Pit latrine with slab",479.98138494935699,311.94966208779522,75.984739330630461,2.6803054740014374,0,42.41144313995003,24.288314729212043,6.5699388067159097,0,0,437.17035256166349,290.75054869655719,66.72518843368394,2.6803054740014374,0]
[null,"Pit latrine without slab / Open pit",0,0.27169590873603244,0,0,0,0,0,0,0,0,0,0.33401912295715303,0,0,0,null,null,null,null,null,null,null,null,null,null,null,null,null,null,null,null,null,null,null,null,null,null,null,null,null,null,null,null,null,null,null,null,null,null,null,null,"Pit latrine without slab / Open pit",0,2.68961209023061,0,0,0,0,0,0,0,0,0,2.68961209023061,0,0,0]
[null,"Bucket",0.82791792220300586,0.5147399939275652,0,0,0,2.9517150778768899,1.0083697923048083,1.6978272279448692,0,0,0.3336160725869653,0,0,0,0,null,null,null,null,null,null,null,null,null,null,null,null,null,null,null,null,null,null,null,null,null,null,null,null,null,null,null,null,null,null,null,null,null,null,null,null,"Bucket",8.2246901698295964,5.0955898358332687,0,0,0,5.5526572435874222,1.9108461884374759,3.1847436473957931,0,0,2.6720329262421743,0,0,0,0]
[null,"No facility, Bush, Field",7.0574751467350305,1.0061320128676297,0.69227036986935642,0,0,15.740593519072554,8.9477990099517868,1.512127374888399,0,0,4.0250738580695655,0.65821415406262485,0,0,0,null,null,null,null,null,null,null,null,null,null,null,null,null,null,null,null,null,null,null,null,null,null,null,null,null,null,null,null,null,null,null,null,null,null,null,null,"No facility, Bush, Field",70.110266859201403,9.9600499645578626,6.8708304463077923,0,0,29.61062240631642,16.955949854458428,2.8364123109618782,0,0,32.238044755817057,5.3001179425132587,0,0,0]
[null,"Other",0.18965265720121272,0.20375124759632793,0,0,0,0.25394478978637863,1.0643903363217422,0,0,0,0.17558740662471856,0,0,0,0,null,null,null,null,null,null,null,null,null,null,null,null,null,null,null,null,null,null,null,null,null,null,null,null,null,null,null,null,null,null,null,null,null,null,null,null,"Other",1.8840446661841974,2.0170043100173358,0,0,0,0.47771154710936897,2.0170043100173358,0,0,0,1.4063331190748285,0,0,0,0]
[null,null,null,null,null,null,null,null,null,null,null,null,null,null,null,null,null,null,null,null,null,null,null,null,null,null,null,null,null,null,null,null,null,null,null,null,null,null,null,null,null,null,null,null,null,null,null,null,null,null,null,null,null,"Total",993.4185441890819,989.93470411205806,992.506792917403,995.85810146185179,989.17136843724199,188.11630178009383,189.49855529387659,187.57760477494276,188.69792216195762,188.1322645270518,800.93051438510736,805.22697814987839,803.82372827729466,799.3206727634871,809.56496900394689]
[]
[]
[]
[]
[]
[]
[]
[]
[]
[]
[]
[]
[]
[]
[]
[]
[]
[]
[]
[]
[]
[]
[]
[]
[]
[]
[]
[]
[]
[]
[]
[]
[]
[]
[]
[]
[]
[]
[]
[]
[]
[]
[]
[]
[{"$f":"A1026","v":"Saint Lucia"}]
[{"$f":"A1034","v":"2012"}]
["Access to hygiene facilities "]
[" by wealth quintile and sub-national region"]
["Notes:"]
["WHO/UNICEF JMP customised wealth index excludes water,"]
[" sanitation and hygiene assets."]
["Survey used for analysis:",{"$f":"A1025","v":"MICS12"}]
[]
[]
[]
[]
["Access to handwashing",null,"NATIONAL wealth index quintile",null,null,null,null,"URBAN wealth index quintile",null,null,null,null,"RURAL wealth index quintile",null,null,null,null,null,null,null,null,null,null,null,null,null,null,null,null,null,null,null,null,null,null,null,null,null,null,null,null,null,null,null,null,null,null,null,null,null,null,null,"Raw numbers of respondents:","Access to handwashing","NATIONAL wealth index quintile",null,null,null,null,"URBAN wealth index quintile",null,null,null,null,"RURAL wealth index quintile"]
["Weighted percentage (used in graphs)",null,"Poorest","Poor","Middle","Rich","Richest","Poorest","Poor","Middle","Rich","Richest","Poorest","Poor","Middle","Rich","Richest",null,null,null,null,null,null,null,null,null,null,null,null,null,null,null,null,null,null,null,null,null,null,null,null,null,null,null,null,null,null,null,null,null,null,null,"Hygiene data, raw numbers (weighted)",null,"Poorest","Poor","Middle","Rich","Richest","Poorest","Poor","Middle","Rich","Richest","Poorest","Poor","Middle","Rich","Richest"]
["Hygiene ladder","Basic",69.68906407180117,85.20066099366403,90.754167823200532,95.119565143757754,95.69936992837799,66.778105622320055,88.284016506201056,88.835415293280732,98.374545140238837,96.510124337500315,70.538578533693823,84.583114215989013,90.881410765461482,94.434304438102274,95.409063635960763,null,null,null,null,null,null,null,null,null,null,null,null,null,null,null,null,null,null,null,null,null,null,null,null,null,null,null,null,null,null,null,null,null,null,null,"Hygiene ladder","Basic",677.33563318131473,817.17567809890454,840.06129198050382,935.43461675997935,887.47958596738761,119.60013695700708,159.88622178625846,156.7856363865624,178.28878967813725,178.0848728266017,557.521354952097,658.94654446619472,685.15912715097272,747.30496059017639,715.90916119408223]
[null,"Limited",15.631942978206547,11.064551592355405,5.4361424477327649,3.1558410652814026,2.3168659443196207,17.998257071504611,8.9902887199153358,8.7285239686104497,0,1.2944389963395584,15.023521702004297,11.409375318183953,4.8846030177295585,3.9218468034474361,2.545076703771036,null,null,null,null,null,null,null,null,null,null,null,null,null,null,null,null,null,null,null,null,null,null,null,null,null,null,null,null,null,null,null,null,null,null,null,null,"Limited",151.93304912358656,106.12221014360122,50.319373286843238,31.035496987347667,21.48573423780709,32.235026595601497,16.281806753705148,15.404973124918374,0,2.3885577355468453,118.74259943376626,88.884980295677309,36.825246350362349,31.035496987347667,19.097176502260243]
[null,"No facility",14.678992949992239,3.7347874139805755,3.8096897290666796,1.7245937909608302,1.9837641273023872,15.223637306175233,2.7256947738836024,2.4360607381088051,1.6254548597611644,2.1954366661601195,14.437899764301834,4.0075104658270435,4.2339862168089528,1.6438487584502961,2.0458596602681891,null,null,null,null,null,null,null,null,null,null,null,null,null,null,null,null,null,null,null,null,null,null,null,null,null,null,null,null,null,null,null,null,null,null,null,null,"No facility",142.67095012214696,35.821053522129269,35.264197255153078,16.960177745513523,18.39667458284088,27.265659752315422,4.9363526534634801,4.2994039239843209,2.9458878738411087,4.0511196330524779,114.11397290081744,31.220595243461187,31.920216425387494,13.008581351442164,15.351263470018651]
["Place where household members most often wash their hands","Observed",83.476263570439485,93.268564523220363,89.71028426416477,97.048978396481871,91.891592216345501,80.713453388054873,92.965367607557809,91.796997684279319,94.483705827514981,95.929016224751834,84.434784571174248,92.872139788475522,89.818743600496532,97.375244266681108,90.790284391957073,null,null,null,null,null,null,null,null,null,null,null,null,null,null,null,null,null,null,null,null,null,null,null,null,null,null,null,null,null,null,null,null,null,null,null,"Observed handwashing place","Fixed","N/A","N/A","N/A","N/A","N/A","N/A","N/A","N/A","N/A","N/A","N/A","N/A","N/A","N/A","N/A"]
[null,"Not in dwelling/plot/yard",8.6679307727006183,1.2208995167171972,0.73263550318546633,0.48227834213349197,0,10.592921009444504,0.25209244807620207,1.5280445051503824,0,0.53457524830124947,8.2631163691941065,1.3229777026930372,0.66688886623083454,0.47504081289106975,0,null,null,null,null,null,null,null,null,null,null,null,null,null,null,null,null,null,null,null,null,null,null,null,null,null,null,null,null,null,null,null,null,null,null,null,null,"Mobile","N/A","N/A","N/A","N/A","N/A","N/A","N/A","N/A","N/A","N/A","N/A","N/A","N/A","N/A","N/A"]
[null,"No permission to see",2.1621210805528488,3.1129085806789738,6.7366723202333461,1.2479498786793122,6.2486011647159501,4.7925025050240464,4.4296770956547862,5.9109355579951224,3.9551281352073504,1.9176478531846726,1.3175408988540971,3.2506186273944389,6.2102096012462251,0.99730109656243404,7.3134794740972895,null,null,null,null,null,null,null,null,null,null,null,null,null,null,null,null,null,null,null,null,null,null,null,null,null,null,null,null,null,null,null,null,null,null,null,"Water / Soap","Water and soap","N/A","N/A","N/A","N/A","N/A","N/A","N/A","N/A","N/A","N/A","N/A","N/A","N/A","N/A","N/A"]
[null,"Other reason",5.6936845763069739,2.3976273793834593,2.8204079124164037,1.2207933827053319,1.8598066189385525,3.901123097476499,2.35286284871122,0.76402225257519119,1.5611660372776555,1.6187606737622213,5.9845581607774889,2.554263881437052,3.3041579320264058,1.1524138238653732,1.8962361339456386,null,null,null,null,null,null,null,null,null,null,null,null,null,null,null,null,null,null,null,null,null,null,null,null,null,null,null,null,null,null,null,null,null,null,null,null,"Water only","N/A","N/A","N/A","N/A","N/A","N/A","N/A","N/A","N/A","N/A","N/A","N/A","N/A","N/A","N/A"]
[null,null,null,null,null,null,null,null,null,null,null,null,null,null,null,null,null,null,null,null,null,null,null,null,null,null,null,null,null,null,null,null,null,null,null,null,null,null,null,null,null,null,null,null,null,null,null,null,null,null,null,null,null,"Soap only","N/A","N/A","N/A","N/A","N/A","N/A","N/A","N/A","N/A","N/A","N/A","N/A","N/A","N/A","N/A"]
[null,null,null,null,null,null,null,null,null,null,null,null,null,null,null,null,null,null,null,null,null,null,null,null,null,null,null,null,null,null,null,null,null,null,null,null,null,null,null,null,null,null,null,null,null,null,null,null,null,null,null,null,null,"Neither","N/A","N/A","N/A","N/A","N/A","N/A","N/A","N/A","N/A","N/A","N/A","N/A","N/A","N/A","N/A"]
[null,null,null,null,null,null,null,null,null,null,null,null,null,null,null,null,null,null,null,null,null,null,null,null,null,null,null,null,null,null,null,null,null,null,null,null,null,null,null,null,null,null,null,null,null,null,null,null,null,null,null,null,"Place where household members most often wash their hands","Observed",829.26868230490095,923.29788824250545,890.38066526734735,966.47011374732699,908.96532020519487,151.83516355260866,176.16802853996359,172.1906095114808,178.28878967813725,180.47343056214856,676.26395438586314,747.83152476187229,721.9843735013352,778.34045757752426,735.00633769634248]
[null,null,null,null,null,null,null,null,null,null,null,null,null,null,null,null,null,null,null,null,null,null,null,null,null,null,null,null,null,null,null,null,null,null,null,null,null,null,null,null,null,null,null,null,null,null,null,null,null,null,null,null,null,"Not in dwelling/plot/yard",86.108831693479928,12.086108018319933,7.2714571364403504,4.8028079417322873,0,19.927011253453585,0.47771154710936897,2.8662692826562139,0,1.0057085202302505,66.181820440026371,10.652973376991826,5.3606109480028747,3.7970994215020366,0]
[null,null,null,null,null,null,null,null,null,null,null,null,null,null,null,null,null,null,null,null,null,null,null,null,null,null,null,null,null,null,null,null,null,null,null,null,null,null,null,null,null,null,null,null,null,null,null,null,null,null,null,null,null,"No permission to see",21.478911762033356,30.815762347423266,66.861930394902387,12.427809969011282,61.809373649206208,9.0154784751695907,8.3941741004495718,11.087591339477649,7.4632446099792515,3.6077143318507181,10.552587098426287,26.174858144545293,49.91913835057192,7.9716338345204809,59.207367837585736]
[null,null,null,null,null,null,null,null,null,null,null,null,null,null,null,null,null,null,null,null,null,null,null,null,null,null,null,null,null,null,null,null,null,null,null,null,null,null,null,null,null,null,null,null,null,null,null,null,null,null,null,null,null,"Other reason",56.562118428667034,23.734945503809342,27.992740118712724,12.157369803781236,18.39667458284088,7.3386484988618355,4.4586411063541114,1.433134641328107,2.9458878738411087,3.0454111128222281,47.932152460791059,20.567621866469366,26.559605477384618,9.2114819299401276,15.351263470018651]
[null,null,null,null,null,null,null,null,null,null,null,null,null,null,null,null,null,null,null,null,null,null,null,null,null,null,null,null,null,null,null,null,null,null,null,null,null,null,null,null,null,null,null,null,null,null,null,null,null,null,null,null,null,"Total",993.4185441890819,989.93470411205806,992.506792917403,995.85810146185179,989.17136843724199,188.11630178009383,189.49855529387659,187.57760477494276,188.69792216195762,188.1322645270518,800.93051438510736,805.22697814987839,803.82372827729466,799.3206727634871,809.56496900394689]
[]
[]
[]
[]
[]
[]
[]
[]
[]
[]
[]
[]
[]
[]
[]
[]
[]
[]
[]
[]
[]
[]
[]
[null,null,null,null,null,null,null,null,null,null,null,null,null,null,null,null,null,null,null,null,null,null,null,null,null,null,null,null,null,null,null,null,null,null,null,null,null,null,null,null,null,null,null,null,null,null,null,null,null,null,null,null,"Raw numbers of respondents:","Menstrual health and hygiene","NATIONAL wealth index quintile",null,null,null,null,"URBAN wealth index quintile",null,null,null,null,"RURAL wealth index quintile"]
[null,null,null,null,null,null,null,null,null,null,null,null,null,null,null,null,null,null,null,null,null,null,null,null,null,null,null,null,null,null,null,null,null,null,null,null,null,null,null,null,null,null,null,null,null,null,null,null,null,null,null,null,"MHH data, raw numbers (weighted)",null,"Poorest","Poor","Middle","Rich","Richest","Poorest","Poor","Middle","Rich","Richest","Poorest","Poor","Middle","Rich","Richest"]
[null,null,null,null,null,null,null,null,null,null,null,null,null,null,null,null,null,null,null,null,null,null,null,null,null,null,null,null,null,null,null,null,null,null,null,null,null,null,null,null,null,null,null,null,null,null,null,null,null,null,null,null,"Private place to wash and change","Yes","N/A","N/A","N/A","N/A","N/A","N/A","N/A","N/A","N/A","N/A","N/A","N/A","N/A","N/A","N/A"]
[null,null,null,null,null,null,null,null,null,null,null,null,null,null,null,null,null,null,null,null,null,null,null,null,null,null,null,null,null,null,null,null,null,null,null,null,null,null,null,null,null,null,null,null,null,null,null,null,null,null,null,null,null,"No","N/A","N/A","N/A","N/A","N/A","N/A","N/A","N/A","N/A","N/A","N/A","N/A","N/A","N/A","N/A"]
[null,null,null,null,null,null,null,null,null,null,null,null,null,null,null,null,null,null,null,null,null,null,null,null,null,null,null,null,null,null,null,null,null,null,null,null,null,null,null,null,null,null,null,null,null,null,null,null,null,null,null,null,null,"DK/not sure/missing","N/A","N/A","N/A","N/A","N/A","N/A","N/A","N/A","N/A","N/A","N/A","N/A","N/A","N/A","N/A"]
[null,null,null,null,null,null,null,null,null,null,null,null,null,null,null,null,null,null,null,null,null,null,null,null,null,null,null,null,null,null,null,null,null,null,null,null,null,null,null,null,null,null,null,null,null,null,null,null,null,null,null,null,"Use of menstrual materials","Materials reusable","N/A","N/A","N/A","N/A","N/A","N/A","N/A","N/A","N/A","N/A","N/A","N/A","N/A","N/A","N/A"]
[null,null,null,null,null,null,null,null,null,null,null,null,null,null,null,null,null,null,null,null,null,null,null,null,null,null,null,null,null,null,null,null,null,null,null,null,null,null,null,null,null,null,null,null,null,null,null,null,null,null,null,null,null,"Materials not reusable","N/A","N/A","N/A","N/A","N/A","N/A","N/A","N/A","N/A","N/A","N/A","N/A","N/A","N/A","N/A"]
[null,null,null,null,null,null,null,null,null,null,null,null,null,null,null,null,null,null,null,null,null,null,null,null,null,null,null,null,null,null,null,null,null,null,null,null,null,null,null,null,null,null,null,null,null,null,null,null,null,null,null,null,null,"No materials used","N/A","N/A","N/A","N/A","N/A","N/A","N/A","N/A","N/A","N/A","N/A","N/A","N/A","N/A","N/A"]
[null,null,null,null,null,null,null,null,null,null,null,null,null,null,null,null,null,null,null,null,null,null,null,null,null,null,null,null,null,null,null,null,null,null,null,null,null,null,null,null,null,null,null,null,null,null,null,null,null,null,null,null,null,"DK/not sure/missing","N/A","N/A","N/A","N/A","N/A","N/A","N/A","N/A","N/A","N/A","N/A","N/A","N/A","N/A","N/A"]
[null,null,null,null,null,null,null,null,null,null,null,null,null,null,null,null,null,null,null,null,null,null,null,null,null,null,null,null,null,null,null,null,null,null,null,null,null,null,null,null,null,null,null,null,null,null,null,null,null,null,null,null,"Use of menstrual materials with private place to wash and change","Materials reusable","N/A","N/A","N/A","N/A","N/A","N/A","N/A","N/A","N/A","N/A","N/A","N/A","N/A","N/A","N/A"]
[null,null,null,null,null,null,null,null,null,null,null,null,null,null,null,null,null,null,null,null,null,null,null,null,null,null,null,null,null,null,null,null,null,null,null,null,null,null,null,null,null,null,null,null,null,null,null,null,null,null,null,null,null,"Materials not reusable","N/A","N/A","N/A","N/A","N/A","N/A","N/A","N/A","N/A","N/A","N/A","N/A","N/A","N/A","N/A"]
[null,null,null,null,null,null,null,null,null,null,null,null,null,null,null,null,null,null,null,null,null,null,null,null,null,null,null,null,null,null,null,null,null,null,null,null,null,null,null,null,null,null,null,null,null,null,null,null,null,null,null,null,null,"No materials used","N/A","N/A","N/A","N/A","N/A","N/A","N/A","N/A","N/A","N/A","N/A","N/A","N/A","N/A","N/A"]
[null,null,null,null,null,null,null,null,null,null,null,null,null,null,null,null,null,null,null,null,null,null,null,null,null,null,null,null,null,null,null,null,null,null,null,null,null,null,null,null,null,null,null,null,null,null,null,null,null,null,null,null,"Awareness of menstruation before menarche","Yes","N/A","N/A","N/A","N/A","N/A","N/A","N/A","N/A","N/A","N/A","N/A","N/A","N/A","N/A","N/A"]
[null,null,null,null,null,null,null,null,null,null,null,null,null,null,null,null,null,null,null,null,null,null,null,null,null,null,null,null,null,null,null,null,null,null,null,null,null,null,null,null,null,null,null,null,null,null,null,null,null,null,null,null,null,"No","N/A","N/A","N/A","N/A","N/A","N/A","N/A","N/A","N/A","N/A","N/A","N/A","N/A","N/A","N/A"]
[null,null,null,null,null,null,null,null,null,null,null,null,null,null,null,null,null,null,null,null,null,null,null,null,null,null,null,null,null,null,null,null,null,null,null,null,null,null,null,null,null,null,null,null,null,null,null,null,null,null,null,null,null,"DK/not sure/missing","N/A","N/A","N/A","N/A","N/A","N/A","N/A","N/A","N/A","N/A","N/A","N/A","N/A","N/A","N/A"]
[null,null,null,null,null,null,null,null,null,null,null,null,null,null,null,null,null,null,null,null,null,null,null,null,null,null,null,null,null,null,null,null,null,null,null,null,null,null,null,null,null,null,null,null,null,null,null,null,null,null,null,null,"Participation in (all) activities during menstruation","Yes","N/A","N/A","N/A","N/A","N/A","N/A","N/A","N/A","N/A","N/A","N/A","N/A","N/A","N/A","N/A"]
[null,null,null,null,null,null,null,null,null,null,null,null,null,null,null,null,null,null,null,null,null,null,null,null,null,null,null,null,null,null,null,null,null,null,null,null,null,null,null,null,null,null,null,null,null,null,null,null,null,null,null,null,null,"No","N/A","N/A","N/A","N/A","N/A","N/A","N/A","N/A","N/A","N/A","N/A","N/A","N/A","N/A","N/A"]
[null,null,null,null,null,null,null,null,null,null,null,null,null,null,null,null,null,null,null,null,null,null,null,null,null,null,null,null,null,null,null,null,null,null,null,null,null,null,null,null,null,null,null,null,null,null,null,null,null,null,null,null,null,"DK/not sure/missing/no such activity","N/A","N/A","N/A","N/A","N/A","N/A","N/A","N/A","N/A","N/A","N/A","N/A","N/A","N/A","N/A"]
[null,null,null,null,null,null,null,null,null,null,null,null,null,null,null,null,null,null,null,null,null,null,null,null,null,null,null,null,null,null,null,null,null,null,null,null,null,null,null,null,null,null,null,null,null,null,null,null,null,null,null,null,"Participation in specific activities during menstruation","Did not go to school (amongst those usually attending school)","N/A","N/A","N/A","N/A","N/A","N/A","N/A","N/A","N/A","N/A","N/A","N/A","N/A","N/A","N/A"]
[null,null,null,null,null,null,null,null,null,null,null,null,null,null,null,null,null,null,null,null,null,null,null,null,null,null,null,null,null,null,null,null,null,null,null,null,null,null,null,null,null,null,null,null,null,null,null,null,null,null,null,null,null,"Did not go to work (amongst those who usually work)","N/A","N/A","N/A","N/A","N/A","N/A","N/A","N/A","N/A","N/A","N/A","N/A","N/A","N/A","N/A"]
[null,null,null,null,null,null,null,null,null,null,null,null,null,null,null,null,null,null,null,null,null,null,null,null,null,null,null,null,null,null,null,null,null,null,null,null,null,null,null,null,null,null,null,null,null,null,null,null,null,null,null,null,null,"Did not participate in social activities","N/A","N/A","N/A","N/A","N/A","N/A","N/A","N/A","N/A","N/A","N/A","N/A","N/A","N/A","N/A"]
[null,null,null,null,null,null,null,null,null,null,null,null,null,null,null,null,null,null,null,null,null,null,null,null,null,null,null,null,null,null,null,null,null,null,null,null,null,null,null,null,null,null,null,null,null,null,null,null,null,null,null,null,null,"Did not cook food","N/A","N/A","N/A","N/A","N/A","N/A","N/A","N/A","N/A","N/A","N/A","N/A","N/A","N/A","N/A"]
[null,null,null,null,null,null,null,null,null,null,null,null,null,null,null,null,null,null,null,null,null,null,null,null,null,null,null,null,null,null,null,null,null,null,null,null,null,null,null,null,null,null,null,null,null,null,null,null,null,null,null,null,null,"Did not eat with others","N/A","N/A","N/A","N/A","N/A","N/A","N/A","N/A","N/A","N/A","N/A","N/A","N/A","N/A","N/A"]
[null,null,null,null,null,null,null,null,null,null,null,null,null,null,null,null,null,null,null,null,null,null,null,null,null,null,null,null,null,null,null,null,null,null,null,null,null,null,null,null,null,null,null,null,null,null,null,null,null,null,null,null,null,"Did not bathe in regular place","N/A","N/A","N/A","N/A","N/A","N/A","N/A","N/A","N/A","N/A","N/A","N/A","N/A","N/A","N/A"]
[null,null,null,null,null,null,null,null,null,null,null,null,null,null,null,null,null,null,null,null,null,null,null,null,null,null,null,null,null,null,null,null,null,null,null,null,null,null,null,null,null,null,null,null,null,null,null,null,null,null,null,null,null,"Did not participate in other activities","N/A","N/A","N/A","N/A","N/A","N/A","N/A","N/A","N/A","N/A","N/A","N/A","N/A","N/A","N/A"]
[null,null,null,null,null,null,null,null,null,null,null,null,null,null,null,null,null,null,null,null,null,null,null,null,null,null,null,null,null,null,null,null,null,null,null,null,null,null,null,null,null,null,null,null,null,null,null,null,null,null,null,null,null,"DK/not sure/missing/no such activity","N/A","N/A","N/A","N/A","N/A","N/A","N/A","N/A","N/A","N/A","N/A","N/A","N/A","N/A","N/A"]
[]
[]
[]
[]
[]
[]
[]
[]
[]
[]
[]
[]
[]
[]
[]
[]
[]
[]
[]
[]
[]
[]
[]
[]
[]
[]
[]
[]
[]
[]
[]
[]
[]
[]
[]
[]
[]
[]
[]
[]
[]
[]
[]
[]
[]
[]
[]
[]
[]
[]
[]
[]
[]
[]
[null,null,null,null,null,null,null,null,null,null,null,null,null,null,null,null,null,null,null,null,null,null,null,null,null,null,null,null,null,null,null,null,null,null,null,null,null,null,null,null,null,null,null,null,null,null,null,null,null,null,null,null,"Raw numbers of respondents:","Basic water, sanitation and hygiene","NATIONAL wealth index quintile",null,null,null,null,"URBAN wealth index quintile",null,null,null,null,"RURAL wealth index quintile"]
[null,null,null,null,null,null,null,null,null,null,null,null,null,null,null,null,null,null,null,null,null,null,null,null,null,null,null,null,null,null,null,null,null,null,null,null,null,null,null,null,null,null,null,null,null,null,null,null,null,null,null,null,"WatSan data, raw numbers (weighted)",null,"Poorest","Poor","Middle","Rich","Richest","Poorest","Poor","Middle","Rich","Richest","Poorest","Poor","Middle","Rich","Richest"]
[null,null,null,null,null,null,null,null,null,null,null,null,null,null,null,null,null,null,null,null,null,null,null,null,null,null,null,null,null,null,null,null,null,null,null,null,null,null,null,null,null,null,null,null,null,null,null,null,null,null,null,null,"Use of Basic Water Sanitation and Hygiene","Yes","N/A","N/A","N/A","N/A","N/A","N/A","N/A","N/A","N/A","N/A","N/A","N/A","N/A","N/A","N/A"]
[null,null,null,null,null,null,null,null,null,null,null,null,null,null,null,null,null,null,null,null,null,null,null,null,null,null,null,null,null,null,null,null,null,null,null,null,null,null,null,null,null,null,null,null,null,null,null,null,null,null,null,null,null,"No","N/A","N/A","N/A","N/A","N/A","N/A","N/A","N/A","N/A","N/A","N/A","N/A","N/A","N/A","N/A"]
[null,null,null,null,null,null,null,null,null,null,null,null,null,null,null,null,null,null,null,null,null,null,null,null,null,null,null,null,null,null,null,null,null,null,null,null,null,null,null,null,null,null,null,null,null,null,null,null,null,null,null,null,"Use of Basic Water and Sanitation","Yes","N/A","N/A","N/A","N/A","N/A","N/A","N/A","N/A","N/A","N/A","N/A","N/A","N/A","N/A","N/A"]
[null,null,null,null,null,null,null,null,null,null,null,null,null,null,null,null,null,null,null,null,null,null,null,null,null,null,null,null,null,null,null,null,null,null,null,null,null,null,null,null,null,null,null,null,null,null,null,null,null,null,null,null,null,"No","N/A","N/A","N/A","N/A","N/A","N/A","N/A","N/A","N/A","N/A","N/A","N/A","N/A","N/A","N/A"]
[null,null,null,null,null,null,null,null,null,null,null,null,null,null,null,null,null,null,null,null,null,null,null,null,null,null,null,null,null,null,null,null,null,null,null,null,null,null,null,null,null,null,null,null,null,null,null,null,null,null,null,null,"Use of Basic Water and Hygiene","Yes","N/A","N/A","N/A","N/A","N/A","N/A","N/A","N/A","N/A","N/A","N/A","N/A","N/A","N/A","N/A"]
[null,null,null,null,null,null,null,null,null,null,null,null,null,null,null,null,null,null,null,null,null,null,null,null,null,null,null,null,null,null,null,null,null,null,null,null,null,null,null,null,null,null,null,null,null,null,null,null,null,null,null,null,null,"No","N/A","N/A","N/A","N/A","N/A","N/A","N/A","N/A","N/A","N/A","N/A","N/A","N/A","N/A","N/A"]
[null,null,null,null,null,null,null,null,null,null,null,null,null,null,null,null,null,null,null,null,null,null,null,null,null,null,null,null,null,null,null,null,null,null,null,null,null,null,null,null,null,null,null,null,null,null,null,null,null,null,null,null,"Use of Basic Sanitation and Hygiene","Yes","N/A","N/A","N/A","N/A","N/A","N/A","N/A","N/A","N/A","N/A","N/A","N/A","N/A","N/A","N/A"]
[null,null,null,null,null,null,null,null,null,null,null,null,null,null,null,null,null,null,null,null,null,null,null,null,null,null,null,null,null,null,null,null,null,null,null,null,null,null,null,null,null,null,null,null,null,null,null,null,null,null,null,null,null,"No","N/A","N/A","N/A","N/A","N/A","N/A","N/A","N/A","N/A","N/A","N/A","N/A","N/A","N/A","N/A"]
[null,null,null,null,null,null,null,null,null,null,null,null,null,null,null,null,null,null,null,null,null,null,null,null,null,null,null,null,null,null,null,null,null,null,null,null,null,null,null,null,null,null,null,null,null,null,null,null,null,null,null,null,"Use of Basic Water","Yes","N/A","N/A","N/A","N/A","N/A","N/A","N/A","N/A","N/A","N/A","N/A","N/A","N/A","N/A","N/A"]
[null,null,null,null,null,null,null,null,null,null,null,null,null,null,null,null,null,null,null,null,null,null,null,null,null,null,null,null,null,null,null,null,null,null,null,null,null,null,null,null,null,null,null,null,null,null,null,null,null,null,null,null,null,"No","N/A","N/A","N/A","N/A","N/A","N/A","N/A","N/A","N/A","N/A","N/A","N/A","N/A","N/A","N/A"]
[null,null,null,null,null,null,null,null,null,null,null,null,null,null,null,null,null,null,null,null,null,null,null,null,null,null,null,null,null,null,null,null,null,null,null,null,null,null,null,null,null,null,null,null,null,null,null,null,null,null,null,null,"Use of Basic Sanitation","Yes","N/A","N/A","N/A","N/A","N/A","N/A","N/A","N/A","N/A","N/A","N/A","N/A","N/A","N/A","N/A"]
[null,null,null,null,null,null,null,null,null,null,null,null,null,null,null,null,null,null,null,null,null,null,null,null,null,null,null,null,null,null,null,null,null,null,null,null,null,null,null,null,null,null,null,null,null,null,null,null,null,null,null,null,null,"No","N/A","N/A","N/A","N/A","N/A","N/A","N/A","N/A","N/A","N/A","N/A","N/A","N/A","N/A","N/A"]
[null,null,null,null,null,null,null,null,null,null,null,null,null,null,null,null,null,null,null,null,null,null,null,null,null,null,null,null,null,null,null,null,null,null,null,null,null,null,null,null,null,null,null,null,null,null,null,null,null,null,null,null,"Access to Basic Hygiene","Yes","N/A","N/A","N/A","N/A","N/A","N/A","N/A","N/A","N/A","N/A","N/A","N/A","N/A","N/A","N/A"]
[null,null,null,null,null,null,null,null,null,null,null,null,null,null,null,null,null,null,null,null,null,null,null,null,null,null,null,null,null,null,null,null,null,null,null,null,null,null,null,null,null,null,null,null,null,null,null,null,null,null,null,null,null,"No","N/A","N/A","N/A","N/A","N/A","N/A","N/A","N/A","N/A","N/A","N/A","N/A","N/A","N/A","N/A"]
[]
[]
[]
[]
[]
[]
[]
[]
[]
[]
[]
[]
[]
[]
[]
[]
[]
[]
[]
[]
[]
[]
[]
[]
[]
[]
[]
[]
[]
[]
[]
[]
[]
[]
[]
[]
[]
[]
[]
[]
[]
[]
[]
[]
[null,null,"INITIAL (national) Wealth Index",null,null,null,null,"URBAN Wealth Index",null,null,null,null,"RURAL Wealth Index"]
[null,null,"Component Matrix",null,null,null,null,"Component Matrix",null,null,null,null,"Component Matrix"]
[null,null,null,null,"Component",null,null,null,null,"Component",null,null,null,null,"Component"]
[null,"Note:\n\nThe INITIAL (national) Wealth Index is based on the first component of the Principal Component Analysis (PCA) which has been obtained at national level.\n\nThe final national-level (NATIONAL) Wealth Index is based on the URBAN and RURAL specific wealth indexes. Regression procedures are used to establish the relationships between the two sets of scores (urban and rural) and the initial (national) wealth factors.\nThis allows best use of the available information for each area and a better precision of the FINAL (NATIONAL) Wealth Index.\n\nFor dependency reasons, all WASH variables (contained in the generic MICS and DHS scripts) have been excluded from the sets of asset variables used in the PCAs.\n\nThe PCA can extracts as many components as there are asset variables in the input. Only the first of the components is used to represent the Wealth Index. \n\nThe scores represent the weights of the asset variables on the Wealth Index (correlations between the variables and the component).\n\nThe communalities are the proportion of each variable's variance that can be explained by the component.\n\nProportion of explained variance is the part of the model's total variance that is explained by the component.\n\nFor more information on the procedure used:\n\nThe DHS Wealth Index, DHS Comparative Reports No. 6, Shea Oscar Rutstein, Kiersten Johnson, ORC Macro International Inc., 2004.\n\nThe DHS Wealth Index: Approaches for Rural and Urban Areas, Shea O. Rutstein, ORC Macro International Inc., 2008.\n\nMICS Methodological Paper No. 4, Review of options for reporting water, sanitation and hygiene coverage by wealth quintile, UNICEF, 2016.",null,null,"1",null,null,null,null,"1",null,null,null,null,"1"]
[null,null,"tv",null,0.67582328774147427,null,null,"tv",null,0.68207905115034384,null,null,"tv",null,0.67345657927766533]
[null,null,"fridge",null,0.66144327380492773,null,null,"fridge",null,0.67845402798416365,null,null,"wash",null,0.66201695176191022]
[null,null,"cable",null,0.65990477607452525,null,null,"cable",null,0.67787540327301554,null,null,"cable",null,0.65149885901405513]
[null,null,"wash",null,0.65607911737865598,null,null,"wash",null,0.64257031268654852,null,null,"fridge",null,0.64662717614589948]
[null,null,"computer",null,0.63945543775922919,null,null,"computer",null,0.62594877423462492,null,null,"computer",null,0.64474592946409948]
[null,null,"internet",null,0.61998168381989915,null,null,"elec",null,0.61661848142370546,null,null,"internet",null,0.62345816947551413]
[null,null,"elec",null,0.59221330089112834,null,null,"internet",null,0.60970823906977512,null,null,"sofa",null,0.58940356587774423]
[null,null,"sofa",null,0.59062607712251181,null,null,"hc6_2",null,0.60363778520114586,null,null,"elec",null,0.57478157450577017]
[null,null,"stove",null,0.58481116510919096,null,null,"stove",null,0.60317639254934197,null,null,"stove",null,0.570239424705134]
[null,null,"hc6_2",null,0.55906328890621482,null,null,"sofa",null,0.59083617395729671,null,null,"hc3_33",null,0.55255994316807433]
[null,null,"stereo",null,0.54488167766063822,null,null,"stereo",null,0.56504872402213613,null,null,"phone",null,0.53310849722770437]
[null,null,"hc3_33",null,0.53625769228015685,null,null,"mobile",null,0.51929494263238485,null,null,"stereo",null,0.53040150096998506]
[null,null,"phone",null,0.51333479116417235,null,null,"hc3_33",null,0.51142476424470806,null,null,"hc6_2",null,0.52202655393894348]
[null,null,"car",null,0.49655083925965104,null,null,"hc6_7",null,-0.50465474786363695,null,null,"car",null,0.50935212736138935]
[null,null,"mobile",null,0.43704313667983818,null,null,"phone",null,0.49052938256028361,null,null,"hc5_24",null,-0.44945954034368002]
[null,null,"bank",null,0.43679130311241493,null,null,"car",null,0.47027426829389052,null,null,"bank",null,0.44876295978583264]
[null,null,"hc6_7",null,-0.42191126585123667,null,null,"bank",null,0.42073821549235496,null,null,"radio",null,0.44312055188839095]
[null,null,"hc5_38",null,0.42046384544181492,null,null,"hc5_38",null,0.41103675590638389,null,null,"hc5_38",null,0.42274937745227853]
[null,null,"radio",null,0.40382078662216653,null,null,"radio",null,0.3517939651335234,null,null,"hc6_8",null,-0.38568922576086301]
[null,null,"hc5_24",null,-0.40151029232916902,null,null,"table",null,0.34571945693870709,null,null,"table",null,0.38419484694202566]
[null,null,"table",null,0.36878743362104804,null,null,"ipod",null,0.33117784328070043,null,null,"ipod",null,0.37989192367378066]
[null,null,"ipod",null,0.3629419436356226,null,null,"hc5_24",null,-0.32960503427645338,null,null,"hc3_23",null,-0.37561409179984201]
[null,null,"hc3_23",null,-0.34150495492559169,null,null,"hc6_95",null,-0.32891574831721904,null,null,"mobile",null,0.36842682270696747]
[null,null,"hc6_8",null,-0.31288325034708953,null,null,"ac",null,0.29722821187140908,null,null,"hc6_7",null,-0.34522997702151426]
[null,null,"ac",null,0.26855936524065033,null,null,"hc3_23",null,-0.29454025377586485,null,null,"ac",null,0.25259704021737434]
[null,null,"hc6_95",null,-0.25573443576025334,null,null,"bed",null,0.2705015976641158,null,null,"hc3_36",null,-0.23767583560069633]
[null,null,"bed",null,0.25003447321088429,null,null,"hc5_36",null,-0.24665307584993049,null,null,"bed",null,0.23244454969707065]
[null,null,"hc5_36",null,-0.24139227882035316,null,null,"hc3_36",null,-0.23028850410854065,null,null,"hc5_36",null,-0.23206050968329689]
[null,null,"hc3_36",null,-0.23646462825487061,null,null,"hc3_21",null,-0.20694229660009439,null,null,"hc3_21",null,-0.19662660742004029]
[null,null,"hc3_21",null,-0.19822105963603118,null,null,"hc6_8",null,-0.19054952189257068,null,null,"hc6_95",null,-0.17573697577089512]
[null,null,"hc5_31",null,9.2697182732574171E-2,null,null,"hc3_34",null,-8.4497727781699533E-2,null,null,"hc5_31",null,0.10151802489743741]
[null,null,"hc5_34",null,7.6121832539219197E-2,null,null,"hc5_31",null,7.4877608307538965E-2,null,null,"hc4_35",null,9.168424122225062E-2]
[null,null,"hc4_23",null,-6.4185335795447579E-2,null,null,"hc6_1",null,7.028057923185918E-2,null,null,"hc5_34",null,9.0494179458779148E-2]
[null,null,"hc3_34",null,-5.705247653930192E-2,null,null,"hc4_23",null,-6.8923053564478962E-2,null,null,"hc4_31",null,-8.2266756546042957E-2]
[null,null,"hc4_35",null,5.6121412339710679E-2,null,null,"boatp",null,6.6835601050908439E-2,null,null,"hc4_23",null,-5.828664188339662E-2]
[null,null,"hc3_32",null,5.3363168669498591E-2,null,null,"hc5_34",null,5.9415465812452488E-2,null,null,"hc3_32",null,5.1329931642662203E-2]
[null,null,"boatp",null,3.2194052755885091E-2,null,null,"hc4_31",null,5.1731143635531336E-2,null,null,"hc3_34",null,-4.2350006094145562E-2]
[null,null,"hc4_31",null,-3.1855605482629772E-2,null,null,"hc3_32",null,4.9562862876125213E-2,null,null,"hc3_31",null,3.2227939046390867E-2]
[null,null,"hc3_31",null,3.1766713118037901E-2,null,null,"hc3_31",null,4.3032379368671325E-2,null,null,"Persons per sleeping rooms",null,2.3469465605104513E-2]
[null,null,"hc6_1",null,2.8442597068874604E-2,null,null,"hc3_35",null,3.0591357491610127E-2,null,null,"boatl",null,1.2482658929581829E-2]
[null,null,"Persons per sleeping rooms",null,2.0651738135951284E-2,null,null,"boatl",null,2.2946732463146078E-2,null,null,"hc3_35",null,-1.0778615368523602E-2]
[null,null,"boatl",null,1.44009264592117E-2,null,null,"Persons per sleeping rooms",null,1.3464618541190255E-2,null,null,"boatp",null,7.9661393213724396E-3]
[null,null,"hc3_35",null,4.5612116848577208E-3,null,null,"hc4_35",null,-5.5950305456013713E-3,null,null,"hc6_1",null,3.4144806638544281E-3]
[]
[]
[]
[null,null,"Communalities",null,null,null,null,"Communalities",null,null,null,null,"Communalities"]
[null,null,null,null,"Extraction",null,null,null,null,"Extraction",null,null,null,null,"Extraction"]
[null,null,"Persons per sleeping rooms",null,4.2649428803590462E-4,null,null,"Persons per sleeping rooms",null,1.812959524597644E-4,null,null,"Persons per sleeping rooms",null,5.5081581578918378E-4]
[null,null,"hc3_21",null,3.9291588483231027E-2,null,null,"hc3_21",null,4.2825114122121435E-2,null,null,"hc3_21",null,3.866202274551464E-2]
[null,null,"hc3_23",null,0.1166256342387304,null,null,"hc3_23",null,8.6753961094350865E-2,null,null,"hc3_23",null,0.14108594595862015]
[null,null,"hc3_31",null,1.0091240623237212E-3,null,null,"hc3_31",null,1.8517856741292495E-3,null,null,"hc3_31",null,1.038640055177885E-3]
[null,null,"hc3_32",null,2.8476277704493559E-3,null,null,"hc3_32",null,2.4564773764775907E-3,null,null,"hc3_32",null,2.6347618824403745E-3]
[null,null,"hc3_33",null,0.28757231252963938,null,null,"hc3_33",null,0.26155528948275525,null,null,"hc3_33",null,0.30532249079390555]
[null,null,"hc3_34",null,3.2549850792675961E-3,null,null,"hc3_34",null,7.139866000270197E-3,null,null,"hc3_34",null,1.7935230161741662E-3]
[null,null,"hc3_35",null,2.0804652034082606E-5,null,null,"hc3_35",null,9.3583115317949104E-4,null,null,"hc3_35",null,1.1617854926257319E-4]
[null,null,"hc3_36",null,5.5915520415714154E-2,null,null,"hc3_36",null,5.3032795124549344E-2,null,null,"hc3_36",null,5.6489802828489227E-2]
[null,null,"hc4_23",null,4.1197573311743639E-3,null,null,"hc4_23",null,4.7503873126520362E-3,null,null,"hc4_23",null,3.3973326220433251E-3]
[null,null,"hc4_31",null,1.014779600664952E-3,null,null,"hc4_31",null,2.6761112218399745E-3,null,null,"hc4_31",null,6.767819232605902E-3]
[null,null,"hc4_35",null,3.14961292300383E-3,null,null,"hc4_35",null,3.1304366806212381E-5,null,null,"hc4_35",null,8.4060000884998397E-3]
[null,null,"hc5_24",null,0.16121051484625476,null,null,"hc5_24",null,0.10863947862038201,null,null,"hc5_24",null,0.20201387840595214]
[null,null,"hc5_31",null,8.592767686556247E-3,null,null,"hc5_31",null,5.6066562258572285E-3,null,null,"hc5_31",null,1.0305909379076723E-2]
[null,null,"hc5_34",null,5.7945333891289306E-3,null,null,"hc5_34",null,3.5301975777107105E-3,null,null,"hc5_34",null,8.1891965159177262E-3]
[null,null,"hc5_36",null,5.8270232274083122E-2,null,null,"hc5_36",null,6.0837739826231564E-2,null,null,"hc5_36",null,5.3852080154471529E-2]
[null,null,"hc5_38",null,0.17678984532371841,null,null,"hc5_38",null,0.16895121470604421,null,null,"hc5_38",null,0.17871703613628906]
[null,null,"hc6_1",null,8.0898132802235425E-4,null,null,"hc6_1",null,4.9393598171656363E-3,null,null,"hc6_1",null,1.1658678203835776E-5]
[null,null,"hc6_2",null,0.31255176100263382,null,null,"hc6_2",null,0.36437857572254473,null,null,"hc6_2",null,0.27251172301736865]
[null,null,"hc6_7",null,0.1780091162521929,null,null,"hc6_7",null,0.25467641454131101,null,null,"hc6_7",null,0.11918373703427526]
[null,null,"hc6_8",null,9.7895928347759495E-2,null,null,"hc6_8",null,3.6309120293487276E-2,null,null,"hc6_8",null,0.14875617886801396]
[null,null,"hc6_95",null,6.5400101633615149E-2,null,null,"hc6_95",null,0.10818556949107618,null,null,"hc6_95",null,3.0883484653100177E-2]
[null,null,"elec",null,0.35071659375236608,null,null,"elec",null,0.38021835163327661,null,null,"elec",null,0.33037385839133221]
[null,null,"radio",null,0.16307122770814536,null,null,"radio",null,0.12375899390436668,null,null,"radio",null,0.19635582350587216]
[null,null,"tv",null,0.45673711625369551,null,null,"tv",null,0.46523183201815338,null,null,"tv",null,0.45354376417237435]
[null,null,"phone",null,0.26351260781956443,null,null,"phone",null,0.24061907515497308,null,null,"phone",null,0.28420466981638126]
[null,null,"fridge",null,0.4375072044617806,null,null,"fridge",null,0.46029986808793633,null,null,"fridge",null,0.41812670493042015]
[null,null,"table",null,0.13600417119679892,null,null,"table",null,0.11952194290599455,null,null,"table",null,0.14760568041680652]
[null,null,"bed",null,6.251723779384441E-2,null,null,"bed",null,7.3171114338839174E-2,null,null,"bed",null,5.4030468683873949E-2]
[null,null,"sofa",null,0.34883916297712725,null,null,"sofa",null,0.34908738445649695,null,null,"sofa",null,0.3473965634694004]
[null,null,"stove",null,0.3420040988363694,null,null,"stove",null,0.36382176052883786,null,null,"stove",null,0.32517300148804218]
[null,null,"wash",null,0.43043980826035627,null,null,"wash",null,0.41289660674608875,null,null,"wash",null,0.43826644442013135]
[null,null,"internet",null,0.38437728827215739,null,null,"internet",null,0.37174413678956603,null,null,"internet",null,0.38870008908575893]
[null,null,"ac",null,7.2124132658461029E-2,null,null,"ac",null,8.8344609932275248E-2,null,null,"ac",null,6.3805264726577826E-2]
[null,null,"cable",null,0.43547431348596932,null,null,"cable",null,0.45951506236255346,null,null,"cable",null,0.42445076329661569]
[null,null,"mobile",null,0.19100670331895173,null,null,"mobile",null,0.26966723744357185,null,null,"mobile",null,0.13573832368995123]
[null,null,"car",null,0.24656273596946382,null,null,"car",null,0.22115788741935413,null,null,"car",null,0.25943958964757302]
[null,null,"boatl",null,2.0738668288362361E-4,null,null,"boatl",null,5.2655253073520211E-4,null,null,"boatl",null,1.5581677395226897E-4]
[null,null,"computer",null,0.40890325687984747,null,null,"computer",null,0.39181186796582945,null,null,"computer",null,0.41569731356052553]
[null,null,"stereo",null,0.29689604265027164,null,null,"stereo",null,0.31928006051904417,null,null,"stereo",null,0.28132575223121309]
[null,null,"boatp",null,1.0364570328487124E-3,null,null,"boatp",null,4.4669975678361933E-3,null,null,"boatp",null,6.3459375687516148E-5]
[null,null,"ipod",null,0.13172685445000346,null,null,"ipod",null,0.10967876388005618,null,null,"ipod",null,0.1443178736725656]
[null,null,"bank",null,0.19078664247464153,null,null,"bank",null,0.17702064597569131,null,null,"bank",null,0.20138819407574085]
[]
[]
[null,null,"Total Variance Explained",null,null,null,null,"Total Variance Explained",null,null,null,null,"Total Variance Explained"]
[null,null,"Component",null,"Extraction Sums of Squared Loadings",null,null,"Component",null,"Extraction Sums of Squared Loadings",null,null,"Component",null,"Extraction Sums of Squared Loadings"]
[null,null,null,null,"Total","% of Variance","Cumulative %",null,null,"Total","% of Variance","Cumulative %",null,null,"Total","% of Variance","Cumulative %"]
[null,null,"1",null,6.9310230663937817,16.118658293939028,16.118658293939028,"1",null,6.9820852978648782,16.237407669453205,16.237407669453205,"1",null,6.9008496358619889,16.048487525260438,16.048487525260438]
[]
[]
[null,null,"Component Score Coefficient Matrix",null,null,null,null,"Component Score Coefficient Matrix",null,null,null,null,"Component Score Coefficient Matrix"]
[null,null,null,null,"Component",null,null,null,null,"Component",null,null,null,null,"Component"]
[null,null,null,null,"1",null,null,null,null,"1",null,null,null,null,"1"]
[null,null,"Persons per sleeping rooms",null,2.9796089174893496E-3,null,null,"Persons per sleeping rooms",null,1.9284523128509669E-3,null,null,"Persons per sleeping rooms",null,3.4009530483231471E-3]
[null,null,"hc3_21",null,-2.8599105462098227E-2,null,null,"hc3_21",null,-2.9639038735802523E-2,null,null,"hc3_21",null,-2.8493101254984748E-2]
[null,null,"hc3_23",null,-4.9271940326015555E-2,null,null,"hc3_23",null,-4.218514114485758E-2,null,null,"hc3_23",null,-5.4430122610970903E-2]
[null,null,"hc3_31",null,4.5832646657986325E-3,null,null,"hc3_31",null,6.1632560378244924E-3,null,null,"hc3_31",null,4.6701407430920286E-3]
[null,null,"hc3_32",null,7.6991763204827292E-3,null,null,"hc3_32",null,7.0985759643013161E-3,null,null,"hc3_32",null,7.4382046198939603E-3]
[null,null,"hc3_33",null,7.7370640256601023E-2,null,null,"hc3_33",null,7.3248140408869233E-2,null,null,"hc3_33",null,8.0071291554674448E-2]
[null,null,"hc3_34",null,-8.2314653973567554E-3,null,null,"hc3_34",null,-1.2102076124383493E-2,null,null,"hc3_34",null,-6.1369263683218331E-3]
[null,null,"hc3_35",null,6.5808635192306816E-4,null,null,"hc3_35",null,4.3814070133123368E-3,null,null,"hc3_35",null,-1.5619258406254549E-3]
[null,null,"hc3_36",null,-3.4116843356272859E-2,null,null,"hc3_36",null,-3.2982768654940799E-2,null,null,"hc3_36",null,-3.4441532295611033E-2]
[null,null,"hc4_23",null,-9.2605860896150909E-3,null,null,"hc4_23",null,-9.8714138576272686E-3,null,null,"hc4_23",null,-8.4462993629792361E-3]
[null,null,"hc4_31",null,-4.5960899534567964E-3,null,null,"hc4_31",null,7.4091251293293033E-3,null,null,"hc4_31",null,-1.1921250409300791E-2]
[null,null,"hc4_35",null,8.0971325303799222E-3,null,null,"hc4_35",null,-8.0134090417261622E-4,null,null,"hc4_35",null,1.3285935219598258E-2]
[null,null,"hc5_24",null,-5.7929441077170629E-2,null,null,"hc5_24",null,-4.7207248295469358E-2,null,null,"hc5_24",null,-6.5131043865664193E-2]
[null,null,"hc5_31",null,1.3374242423464423E-2,null,null,"hc5_31",null,1.0724247142961222E-2,null,null,"hc5_31",null,1.4710945789902976E-2]
[null,null,"hc5_34",null,1.0982770048524089E-2,null,null,"hc5_34",null,8.5097020843646447E-3,null,null,"hc5_34",null,1.3113483735177119E-2]
[null,null,"hc5_36",null,-3.4827799086513477E-2,null,null,"hc5_36",null,-3.5326562957538922E-2,null,null,"hc5_36",null,-3.362781714259306E-2]
[null,null,"hc5_38",null,6.0664037821559692E-2,null,null,"hc5_38",null,5.8870199714128241E-2,null,null,"hc5_38",null,6.1260482369497771E-2]
[null,null,"hc6_1",null,4.1036650428683862E-3,null,null,"hc6_1",null,1.0065843689041008E-2,null,null,"hc6_1",null,4.9479134367893282E-4]
[null,null,"hc6_2",null,8.0661005388501197E-2,null,null,"hc6_2",null,8.6455229268788569E-2,null,null,"hc6_2",null,7.564670750484144E-2]
[null,null,"hc6_7",null,-6.0872869965899218E-2,null,null,"hc6_7",null,-7.2278513701051525E-2,null,null,"hc6_7",null,-5.0027169875929541E-2]
[null,null,"hc6_8",null,-4.5142433858596731E-2,null,null,"hc6_8",null,-2.7291205100407577E-2,null,null,"hc6_8",null,-5.5890107177025361E-2]
[null,null,"hc6_95",null,-3.6897068919049529E-2,null,null,"hc6_95",null,-4.7108526218922232E-2,null,null,"hc6_95",null,-2.5465991152398684E-2]
[null,null,"elec",null,8.5443850816566053E-2,null,null,"elec",null,8.831437244289575E-2,null,null,"elec",null,8.3291421322785247E-2]
[null,null,"radio",null,5.8262796524247457E-2,null,null,"radio",null,5.0385228785603926E-2,null,null,"radio",null,6.4212462996672798E-2]
[null,null,"tv",null,9.7507003117377575E-2,null,null,"tv",null,9.7689876598746755E-2,null,null,"tv",null,9.7590385939997873E-2]
[null,null,"phone",null,7.4063350568426403E-2,null,null,"phone",null,7.0255426800684834E-2,null,null,"phone",null,7.7252588501171338E-2]
[null,null,"fridge",null,9.5432271321104906E-2,null,null,"fridge",null,9.7170687415067097E-2,null,null,"fridge",null,9.3702545377244539E-2]
[null,null,"table",null,5.3208224830353736E-2,null,null,"table",null,4.9515215324629186E-2,null,null,"table",null,5.5673557201632265E-2]
[null,null,"bed",null,3.6074684908093596E-2,null,null,"bed",null,3.8742236183627723E-2,null,null,"bed",null,3.3683468262967864E-2]
[null,null,"sofa",null,8.5214848005088994E-2,null,null,"sofa",null,8.4621735305636339E-2,null,null,"sofa",null,8.5410289598944644E-2]
[null,null,"stove",null,8.4375879218285293E-2,null,null,"stove",null,8.6389146911996825E-2,null,null,"stove",null,8.2633219791044613E-2]
[null,null,"wash",null,9.4658337029603148E-2,null,null,"wash",null,9.2031289403331495E-2,null,null,"wash",null,9.5932673032255875E-2]
[null,null,"internet",null,8.9450241022279026E-2,null,null,"internet",null,8.73246620542181E-2,null,null,"internet",null,9.0345131740816084E-2]
[null,null,"ac",null,3.8747434926714515E-2,null,null,"ac",null,4.257012041406906E-2,null,null,"ac",null,3.6603759471107833E-2]
[null,null,"cable",null,9.5210298646123889E-2,null,null,"cable",null,9.7087814650489865E-2,null,null,"cable",null,9.4408499444529045E-2]
[null,null,"mobile",null,6.305607880587133E-2,null,null,"mobile",null,7.4375336375679238E-2,null,null,"mobile",null,5.3388617655476138E-2]
[null,null,"car",null,7.1641781379614855E-2,null,null,"car",null,6.7354414652840242E-2,null,null,"car",null,7.3810060244526091E-2]
[null,null,"boatl",null,2.0777490308807353E-3,null,null,"boatl",null,3.286515630246338E-3,null,null,"boatl",null,1.8088582693807111E-3]
[null,null,"computer",null,9.2259891740908401E-2,null,null,"computer",null,8.9650691380989023E-2,null,null,"computer",null,9.3429934498719711E-2]
[null,null,"stereo",null,7.8614898903249616E-2,null,null,"stereo",null,8.0928361645041511E-2,null,null,"stereo",null,7.6860318505365066E-2]
[null,null,"boatp",null,4.6449207350042331E-3,null,null,"boatp",null,9.5724412119896005E-3,null,null,"boatp",null,1.1543708009481043E-3]
[null,null,"ipod",null,5.2364844289064197E-2,null,null,"ipod",null,4.7432511800160143E-2,null,null,"ipod",null,5.5050021913182597E-2]
[null,null,"bank",null,6.3019744549728932E-2,null,null,"bank",null,6.0259678526273057E-2,null,null,"bank",null,6.5030102591095998E-2]
[]
[]
[null,null,"Component Score Covariance Matrix",null,null,null,null,"Component Score Covariance Matrix",null,null,null,null,"Component Score Covariance Matrix"]
[null,null,"Component",null,"1",null,null,"Component",null,"1",null,null,"Component",null,"1"]
[null,null,"1",null,1.0000000000000002,null,null,"1",null,1,null,null,"1",null,0.99999999999999989]
[]
[]
[]
[]
[]
[]
[]
[]
[]
[]
[]
[]
[]
[]
[]
[]
[]
[]
[]
[]
[]
[]
[]
[]
[]
[]
[]
[]
[]
[]
[]
[]
[]
[]
[]
[]
[]
[]
[]
[]
[]
[]
[]
[]
[]
[]
[]
[]
[]
[]
[]
[]
[]
[]
[]
[]
[]
[]
[]
[]
[]
[]
[]
[]
[]
[]
[]
[]
[]
[]
[]
[]
[]
[]
[]
[]
[]
[]
[]
[]
[]
[]
[]
[]
[]
[]
[]
[]
[]
[]
[]
[]
[]
[]
[]
[]
[]
[]
[]
[]
[]
[]
[]
[]
[]
[]
[]
[]
[]
[]
[]
[]
[]
[]
[]
[]
[]
[]
[]
[]
[]
[]
[]
[]
[]
[]
[]
[]
[]
[]
[]
[]
[]
[]
[]
[]
[]
[]
[]
[]
[]
[]
[]
[]
[]
[]
[]
[]
[]
[]
[]
[]
[]
[]
[]
[]
[]
[]
[]
[]
[]
[]
[]
[]
[]
[]
[]
[]
[]
[]
[]
[]
[]
[]
[]
[]
[]
[]
[]
[]
[]
[]
[]
[]
[]
[]
[]
[]
[]
[]
[]
[]
[]
[]
[]
[]
[]
[]
[]
[]
[]
[]
[]
[]
[]
[]
[]
[]
[]
[]
[]
[]
[]
[]
[]
[]
[]
[]
[]
[]
[]
[]
[]
[]
[]
[]
[]
[]
[]
[]
[]
[]
[]
[]
[]
[]
[]
[]
[]
[]
[]
[]
[]
[]
[]
[]
[]
[]
[]
[]
[]
[]
[]
[]
[]
[]
[]
[]
[]
[]
[]
[]
[]
[]
[]
[]
[]
[]
[]
[]
[]
[]
[]
[]
[]
[]
[]
[]
[]
[]
[]
[]
[]
[]
[]
[]
[]
[]
[]
[]
[]
[]
[]
[]
[]
[]
[]
[]
[]
[]
[]
[]
[]
[]
[]
[]
[]
[]
[]
[]
[]
[]
[]
[]
[]
[]
[]
[]
[]
[]
[]
[]
[]
[]
[]
[]
[]
[]
[]
[]
[]
[]
[]
[]
[]
[]
[]
[]
[]
[]
[]
[]
[]
[]
[]
[]
[]
[]
[]
[]
[]
[]
[]
[]
[]
[]
[]
[]
[]
[]
[]
[]
[]
[]
[]
[]
[]
[]
[]
[]
[]
[]
[]
[]
[]
[]
[]
[]
[]
[]
[]
[]
[]
[]
[]
[]
[]
[]
[]
[]
[]
[]
[]
[]
[]
[]
[]
[]
[]
[]
[]
[]
[]
[]
[]
[]
[]
[]
[]
[]
[]
[]
[]
[]
[]
[]
[]
[]
[]
[]
[]
[]
[]
[]
[]
[]
[]
[]
[]
[]
[]
[]
[]
[]
[]
[]
[]
[]
[]
[]
[]
[]
[]
[]
[]
[]
[]
[]
[]
[]
[]
[]
[]
[]
[]
[]
[]
[]
[]
[]
[]
[]
[]
[]
[]
[]
[]
[]
[]
[]
[]
[]
["MICS12"]
["Saint Lucia",null,"Count"]
["W_text_t","",1718]
["W_text_i","",1718]
["S_text_s","",1718]
["S_text_i","",1718]
["Urban/Rural","Urban",678]
[null,"Rural",1040]
[null,"Missing",0]
["2012"]
[]
["Sub-national region names","Weighted population"]
[{"$f":"R15","v":0},{"$f":"#REF!+#REF!","v":{"$error":"#REF!"}}]
[{"$f":"S15","v":0},{"$f":"#REF!+#REF!","v":{"$error":"#REF!"}}]
[{"$f":"T15","v":0},{"$f":"#REF!+#REF!","v":{"$error":"#REF!"}}]
[{"$f":"U15","v":0},{"$f":"#REF!+#REF!","v":{"$error":"#REF!"}}]
[{"$f":"V15","v":0},{"$f":"#REF!+#REF!","v":{"$error":"#REF!"}}]
[{"$f":"W15","v":0},{"$f":"#REF!+#REF!","v":{"$error":"#REF!"}}]
[{"$f":"X15","v":0},{"$f":"#REF!+WH123","v":{"$error":"#REF!"}}]
[{"$f":"Y15","v":0},{"$f":"#REF!+#REF!","v":{"$error":"#REF!"}}]
[{"$f":"Z15","v":0},{"$f":"#REF!+#REF!","v":{"$error":"#REF!"}}]
[{"$f":"AA15","v":0},{"$f":"#REF!+#REF!","v":{"$error":"#REF!"}}]
[{"$f":"AB15","v":0},{"$f":"#REF!+#REF!","v":{"$error":"#REF!"}}]
[{"$f":"AC15","v":0},{"$f":"#REF!+#REF!","v":{"$error":"#REF!"}}]
[{"$f":"AD15","v":0},{"$f":"#REF!+#REF!","v":{"$error":"#REF!"}}]
[{"$f":"AE15","v":0},{"$f":"#REF!+#REF!","v":{"$error":"#REF!"}}]
[{"$f":"AF15","v":0},{"$f":"#REF!+#REF!","v":{"$error":"#REF!"}}]
[{"$f":"AG15","v":0},{"$f":"#REF!+#REF!","v":{"$error":"#REF!"}}]
[{"$f":"AH15","v":0},{"$f":"#REF!+#REF!","v":{"$error":"#REF!"}}]
[{"$f":"AI15","v":0},{"$f":"#REF!+#REF!","v":{"$error":"#REF!"}}]
[{"$f":"AJ15","v":0},{"$f":"#REF!+#REF!","v":{"$error":"#REF!"}}]
[{"$f":"AK15","v":0},{"$f":"#REF!+#REF!","v":{"$error":"#REF!"}}]
[{"$f":"AL15","v":0},{"$f":"#REF!+#REF!","v":{"$error":"#REF!"}}]
[{"$f":"AM15","v":0},{"$f":"#REF!+#REF!","v":{"$error":"#REF!"}}]
[{"$f":"AN15","v":0},{"$f":"#REF!+#REF!","v":{"$error":"#REF!"}}]
[{"$f":"AO15","v":0},{"$f":"#REF!+#REF!","v":{"$error":"#REF!"}}]
[{"$f":"AP15","v":0},{"$f":"#REF!+#REF!","v":{"$error":"#REF!"}}]
[{"$f":"AQ15","v":0},{"$f":"#REF!+#REF!","v":{"$error":"#REF!"}}]
[{"$f":"AR15","v":0},{"$f":"#REF!+#REF!","v":{"$error":"#REF!"}}]
[{"$f":"AS15","v":0},{"$f":"#REF!+#REF!","v":{"$error":"#REF!"}}]
[{"$f":"AT15","v":0},{"$f":"#REF!+#REF!","v":{"$error":"#REF!"}}]
[{"$f":"AU15","v":0},{"$f":"#REF!+#REF!","v":{"$error":"#REF!"}}]
[{"$f":"AV15","v":0},{"$f":"#REF!+#REF!","v":{"$error":"#REF!"}}]
[{"$f":"AW15","v":0},{"$f":"#REF!+#REF!","v":{"$error":"#REF!"}}]
[{"$f":"AX15","v":0},{"$f":"#REF!+#REF!","v":{"$error":"#REF!"}}]
[{"$f":"AY15","v":0},{"$f":"#REF!+#REF!","v":{"$error":"#REF!"}}]
[]
[{"$f":"34-COUNTIF(A1037:A1071,\"0\")","v":0},"Sub-regions"]

{"sheet":"data_summary","index":6,"n_rows":96,"n_cols":37,"rows_kept":96,"cut":false,"hidden":false,"merged":[]}
["iso3","year","data_source","row","var1","var2","varname","total_q1","total_q2","total_q3","total_q4","total_q5","urban_q1","urban_q2","urban_q3","urban_q4","urban_q5","rural_q1","rural_q2","rural_q3","rural_q4","rural_q5","n_total_q1","n_total_q2","n_total_q3","n_total_q4","n_total_q5","n_urban_q1","n_urban_q2","n_urban_q3","n_urban_q4","n_urban_q5","n_rural_q1","n_rural_q2","n_rural_q3","n_rural_q4","n_rural_q5"]
["LCA",2005,"LCA_2005_SLC",16,"Water","Improved","w_imp",87.343199124750683,96.666666666666671,96.202519091540239,99.098470377030424,100,92.857142857142847,95.348837209302332,99.999999999999986,100,100,85.497736267269318,94.805194805194802,96.72182424339519,97.402597402597394,100]
["LCA",2005,"LCA_2005_SLC",17,"Water","Not Improved","",12.656800875249321,3.333333333333329,3.7974809084597609,0.90152962296957639,0,7.142857142857153,4.6511627906976676,0,0,0,14.502263732730681,5.1948051948051983,3.27817575660481,2.5974025974026058,0]
["LCA",2005,"LCA_2005_SLC",18,"Water ladder","Basic","w_bas",87.045628164344947,96.666666666666686,96.202519091540239,99.098470377030424,99.854325464002287,92.547454753070028,95.348837209302332,99.999999999999986,100,99.238230271170707,85.203299469543694,94.805194805194802,96.72182424339519,97.40259740259738,100]
["LCA",2005,"LCA_2005_SLC",19,"Water ladder","Limited","w_lim",0.29757096040574182,0,0,0,0.1456745359977222,0.30968810407282038,0,0,0,0.7617697288292804,0.29443679772561299,0,0,0,0]
["LCA",2005,"LCA_2005_SLC",20,"Water ladder","Unimproved","w_unimp",12.656800875249321,3.3333333333333139,3.7974809084597609,0.90152962296957639,0,7.142857142857153,4.6511627906976676,0,0,0,14.5022637327307,5.1948051948051983,3.27817575660481,2.59740259740262,0]
["LCA",2005,"LCA_2005_SLC",21,"Water ladder","Surface water","w_sur",0,0,0,0,0,0,0,0,0,0,0,0,0,0,0]
["LCA",2005,"LCA_2005_SLC",58,"Main source of Water","Private piped","",9.1666666666666661,20,25,24.793388429752071,22.689075630252098,16.666666666666661,25.581395348837209,32.558139534883722,30.232558139534881,32.558139534883722,6.4935064935064926,16.88311688311688,25.641025641025639,14.285714285714279,18.18181818181818]
["LCA",2005,"LCA_2005_SLC",59,"Main source of Water","Private Not Piped","",3.333333333333333,2.5,3.333333333333333,4.1322314049586781,0,2.3809523809523809,0,2.3255813953488369,0,0,3.8961038961038961,2.5974025974025969,5.1282051282051277,6.4935064935064926,0]
["LCA",2005,"LCA_2005_SLC",60,"Main source of Water","Public Piped","",9.1666666666666661,40.833333333333343,55.000000000000007,55.371900826446293,74.789915966386559,21.428571428571431,44.186046511627907,60.465116279069761,62.790697674418603,65.116279069767444,6.4935064935064926,35.064935064935057,48.717948717948723,58.441558441558442,75.324675324675326]
["LCA",2005,"LCA_2005_SLC",61,"Main source of Water","Public Yard","",10.83333333333333,9.1666666666666661,4.1666666666666661,5.785123966942149,1.680672268907563,14.285714285714279,9.3023255813953494,2.3255813953488369,0,2.3255813953488369,7.7922077922077921,10.38961038961039,5.1282051282051277,6.4935064935064926,3.8961038961038961]
["LCA",2005,"LCA_2005_SLC",62,"Main source of Water","Public Standpipe","",54.166666666666657,24.166666666666671,6.666666666666667,7.4380165289256199,0.84033613445378152,38.095238095238088,16.279069767441861,2.3255813953488369,6.9767441860465116,0,59.740259740259738,29.870129870129869,8.9743589743589745,9.0909090909090917,2.5974025974025969]
["LCA",2005,"LCA_2005_SLC",63,"Main source of Water","Public Well-Tank","",1.666666666666667,0,2.5,1.6528925619834709,0,0,0,0,0,0,2.5974025974025969,0,3.8461538461538458,2.5974025974025969,0]
["LCA",2005,"LCA_2005_SLC",64,"Main source of Water","Other","",11.66666666666667,3.333333333333333,3.333333333333333,0.82644628099173556,0,7.1428571428571423,4.6511627906976747,0,0,0,12.98701298701299,5.1948051948051948,2.5641025641025639,2.5974025974025969,0]
["LCA",2005,"LCA_2005_SLC",122,"Sanitation","Improved","s_imp",70.833333333333329,88.539795719085447,94.166666666666657,95.867768595041326,99.999999999999986,64.285714285714278,88.372093023255815,95.348837209302332,100,100,70.129870129870127,94.007651683456757,93.589743589743591,93.506493506493513,98.701298701298711]
["LCA",2005,"LCA_2005_SLC",123,"Sanitation","Not Improved","",29.166666666666671,11.460204280914549,5.8333333333333428,4.1322314049586737,0,35.714285714285722,11.627906976744191,4.6511627906976676,0,0,29.870129870129869,5.992348316543243,6.4102564102564088,6.4935064935064872,1.2987012987012889]
["LCA",2005,"LCA_2005_SLC",124,"Sanitation ladder","Basic","s_bas",55.32898300393348,78.055793933882683,90.017460719665365,93.494799478048463,98.963702085218088,46.026319659391838,80.268656041769034,89.214526946351583,95.443082918216575,97.90955350601061,55.897110741819688,81.81565117477129,90.801342225686653,91.015523193518504,97.929734839740419]
["LCA",2005,"LCA_2005_SLC",125,"Sanitation ladder","Limited","s_lim",15.504350329399861,10.48400178520278,4.149205947001283,2.372969116992854,1.036297914781898,18.259394626322401,8.1034369814867855,6.1343102629507484,4.5569170817834284,2.0904464939893739,14.232759388050351,12.19200050868548,2.7884013640569298,2.4909703129750209,0.77156386155828893]
["LCA",2005,"LCA_2005_SLC",126,"Sanitation ladder","Unimproved","s_unimp",1.666666666666657,3.1268709475812102,0.83333333333335702,0.82644628099174611,0,4.7619047619048018,4.6511627906976676,0,0,0,1.298701298701388,0.79754312173803044,1.282051282051299,1.2987012987012749,0]
["LCA",2005,"LCA_2005_SLC",127,"Sanitation ladder","Open defecation","s_od",27.5,8.3333333333333321,5,3.3057851239669418,0,30.952380952380949,6.9767441860465116,4.6511627906976747,0,0,28.571428571428569,5.1948051948051948,5.1282051282051277,5.1948051948051948,1.2987012987012989]
["LCA",2005,"LCA_2005_SLC",135,"Sanitation type","Sewer connection","s_sew",0.83333333333333337,4.1666666666666661,9.1666666666666661,7.4380165289256199,12.605042016806721,2.3809523809523809,4.6511627906976747,18.604651162790699,16.279069767441861,16.279069767441861,1.2987012987012989,1.2987012987012989,3.8461538461538458,5.1948051948051948,9.0909090909090917]
["LCA",2005,"LCA_2005_SLC",136,"Sanitation type","Septic tank connection","s_sep",5.833333333333333,10.83333333333333,33.333333333333329,57.851239669421481,82.35294117647058,11.9047619047619,13.95348837209302,39.534883720930232,74.418604651162795,83.720930232558146,5.1948051948051948,6.4935064935064926,29.487179487179489,48.051948051948052,81.818181818181827]
["LCA",2005,"LCA_2005_SLC",139,"Sanitation type","Open defecation","",27.5,8.3333333333333321,5,3.3057851239669418,0,30.952380952380949,6.9767441860465116,4.6511627906976747,0,0,28.571428571428569,5.1948051948051948,5.1282051282051277,5.1948051948051948,1.2987012987012989]
["LCA",2005,"LCA_2005_SLC",151,"Shared among all sanitation facilities","Yes","",65.882352941176464,81.481481481481481,92.920353982300881,92.241379310344826,97.41379310344827,64.285714285714292,87.179487179487182,90.243902439024396,95.348837209302332,95.348837209302332,64.15094339622641,79.452054794520549,91.780821917808225,94.444444444444443,97.260273972602747]
["LCA",2005,"LCA_2005_SLC",152,"Shared among all sanitation facilities","No","",34.117647058823529,18.518518518518519,7.0796460176991154,7.7586206896551726,2.5862068965517242,35.714285714285722,12.820512820512819,9.7560975609756095,4.6511627906976747,4.6511627906976747,35.849056603773583,20.547945205479451,8.2191780821917799,5.5555555555555554,2.7397260273972601]
["LCA",2005,"LCA_2005_SLC",153,"Type of toilet","WC Sewer","",0.83333333333333337,4.1666666666666661,9.1666666666666661,7.4380165289256199,12.605042016806721,2.3809523809523809,4.6511627906976747,18.604651162790699,16.279069767441861,16.279069767441861,1.2987012987012989,1.2987012987012989,3.8461538461538458,5.1948051948051948,9.0909090909090917,1,5,11,9,15,1,2,8,7,7,1,1,3,4,7]
["LCA",2005,"LCA_2005_SLC",154,"Type of toilet","WC Cesspit","",5.833333333333333,10.83333333333333,33.333333333333329,57.851239669421481,82.35294117647058,11.9047619047619,13.95348837209302,39.534883720930232,74.418604651162795,83.720930232558146,5.1948051948051948,6.4935064935064926,29.487179487179489,48.051948051948052,81.818181818181827,7,13,40,70,98,5,6,17,32,36,4,5,23,37,63]
["LCA",2005,"LCA_2005_SLC",155,"Type of toilet","Pit Latrine","",62.5,73.333333333333329,50.833333333333329,30.578512396694212,5.0420168067226889,50,67.441860465116278,37.209302325581397,9.3023255813953494,0,61.038961038961027,87.012987012987011,58.974358974358978,40.259740259740262,7.7922077922077921,75,88,61,37,6,21,29,16,4,0,47,67,46,31,6]
["LCA",2005,"LCA_2005_SLC",156,"Type of toilet","Ven. Pit Latrine","",1.666666666666667,0.83333333333333337,0.83333333333333337,0,0,0,2.3255813953488369,0,0,0,2.5974025974025969,0,1.2820512820512819,0,0,2,1,1,0,0,0,1,0,0,0,2,0,1,0,0]
["LCA",2005,"LCA_2005_SLC",157,"Type of toilet","None","",27.5,8.3333333333333321,5,3.3057851239669418,0,30.952380952380949,6.9767441860465116,4.6511627906976747,0,0,28.571428571428569,5.1948051948051948,5.1282051282051277,5.1948051948051948,1.2987012987012989,33,10,6,4,0,13,3,2,0,0,22,4,4,4,1]
["LCA",2005,"LCA_2005_SLC",158,"Type of toilet","Other","",1.666666666666667,2.5,0.83333333333333337,0.82644628099173556,0,4.7619047619047619,4.6511627906976747,0,0,0,1.2987012987012989,0,1.2820512820512819,1.2987012987012989,0,2,3,1,1,0,2,2,0,0,0,1,0,1,1,0]
["LCA",2012,"LCA_2012_MICS",16,"Water","Improved","w_imp",97.646398815005796,99.616429305313815,99.708513014589613,99.952030159075051,99.456188851385804,99.462234562805321,100,100,99.746837939900914,100,97.207062813375572,99.528443591119327,99.64009172298654,100,99.335541385013286]
["LCA",2012,"LCA_2012_MICS",17,"Water","Not Improved","",2.353601184994182,0.38357069468616328,0.29148698541038381,0.047969840924939097,0.54381114861418522,0.53776543719468417,0,0,0.25316206009907932,0,2.7929371866244299,0.47155640888068651,0.35990827701346628,0,0.66445861498671077]
["LCA",2012,"LCA_2012_MICS",18,"Water ladder","Basic","w_bas",97.313725716622471,99.616429305313815,99.708513014589613,99.952030159075051,99.311306509755539,99.130517799820396,100,100,99.7468379399009,99.238230271170707,96.87230147885775,99.528443591119327,99.64009172298654,100,99.3355413850133]
["LCA",2012,"LCA_2012_MICS",19,"Water ladder","Limited","w_lim",0.33267309838333448,0,0,0,0.14488234163027461,0.33171676298493741,0,0,0,0.7617697288292804,0.33476133451780982,0,0,0,0]
["LCA",2012,"LCA_2012_MICS",20,"Water ladder","Unimproved","w_unimp",2.353601184994194,0.38357069468618482,0.29148698541038698,0.047969840924949401,0.54381114861418622,0.53776543719466674,0,0,0.25316206009910053,1.26565424807e-14,2.7929371866244401,0.47155640888067302,0.35990827701346012,0,0.66445861498669956]
["LCA",2012,"LCA_2012_MICS",21,"Water ladder","Surface water","w_sur",0,0,0,0,0,0,0,0,0,0,0,0,0,0,0]
["LCA",2012,"LCA_2012_MICS",22,"Improved water point at more than 30 minutes","Yes","",0.34069162039820261,0,0,0,0.1456745359977222,0.33351026592457589,0,0,0,0.7617697288292804,0.34437964159096779,0,0,0,0]
["LCA",2012,"LCA_2012_MICS",23,"Improved water point at more than 30 minutes","No","",99.659308379601811,100,100,100,99.854325464002287,99.666489734075427,100,100,100,99.238230271170707,99.655620358409024,100,100,100,100]
["LCA",2012,"LCA_2012_MICS",24,"Manually calculated ratios","Improved wells","",40.591947485041601,64.189489697942079,81.434096994941982,95.457457810340969,21.03727473579675,0,50,100,66.666666666666657,100,41.662846289868369,62.5,81.434096994941982,100,0]
["LCA",2012,"LCA_2012_MICS",29,"Piped water","Yes","w_pip",89.520499358988232,92.231618015106179,95.126327585278929,97.717515568174349,97.043229710752883,95.755097068637824,98.218546700261513,98.941091965729129,97.278507853934897,97.987658299675985,87.637757002644108,90.501580003689796,95.13558359281862,97.619473349405808,96.854895889062931]
["LCA",2012,"LCA_2012_MICS",30,"Piped water","No","",10.479500641011761,7.7683819848938036,4.8736724147210451,2.282484431825639,2.9567702892471179,4.2449029313621436,1.7814532997384951,1.058908034270879,2.7214921460651018,2.0123417003240158,12.36224299735589,9.4984199963102114,4.8644164071813778,2.380526650594184,3.1451041109370972]
["LCA",2012,"LCA_2012_MICS",31,"Piped water on premises","Yes","w_pop",78.477957230782565,87.203974943002237,93.945686682392051,97.717515568174349,96.636782623899393,76.485115396755717,90.716216476520046,97.158373376387019,97.278507853934897,97.987658299675985,78.964376032669733,85.090816944437492,94.595721177298415,97.619473349405808,96.358276301391186]
["LCA",2012,"LCA_2012_MICS",32,"Piped water on premises","No","",21.522042769217411,12.796025056997729,6.0543133176079431,2.282484431825639,3.3632173761006272,23.514884603244159,9.2837835234799719,2.8416266236129908,2.7214921460651018,2.0123417003240158,21.035623967330231,14.909183055562499,5.4042788227015777,2.380526650594184,3.6417236986088248]
["LCA",2012,"LCA_2012_MICS",35,"Water source on premises","Yes","",84.504178497311926,92.878389681805814,98.400346555585671,98.943986892754879,98.580705326473193,80.446197680709602,92.497669776258533,97.962607326466184,99.240513819702755,99.238230271170707,85.869742379668949,92.074269426717379,98.942769436272954,98.863627859358616,98.442852348408309]
["LCA",2012,"LCA_2012_MICS",36,"Water source on premises","No","",15.495821502688029,7.1216103181941772,1.5996534444143251,1.056013107245128,1.4192946735268159,19.55380231929032,7.5023302237414766,2.037392673533843,0.7594861802972378,0.7617697288292804,14.130257620331029,7.9257305732826158,1.0572305637270569,1.136372140641382,1.557147651591694]
["LCA",2012,"LCA_2012_MICS",37,"Improved Water source on premises","Yes","w_premises",84.504178497311926,92.878389681805814,98.400346555585671,98.943986892754879,98.580705326473193,80.446197680709602,92.497669776258533,97.962607326466184,99.240513819702755,99.238230271170707,85.869742379668949,92.074269426717379,98.942769436272954,98.863627859358616,98.442852348408309]
["LCA",2012,"LCA_2012_MICS",38,"Improved Water source on premises","No","",15.495821502688029,7.1216103181941772,1.5996534444143251,1.056013107245128,1.4192946735268159,19.55380231929032,7.5023302237414766,2.037392673533843,0.7594861802972378,0.7617697288292804,14.130257620331029,7.9257305732826158,1.0572305637270569,1.136372140641382,1.557147651591694]
["LCA",2012,"LCA_2012_MICS",41,"Water point at more than 30 minutes","Yes","",0.47776348109043848,0,0.29305192154842391,0,0.14488234163027461,0.33153846489065059,0,0,0,0.7617697288292804,0.51368883545650745,0,0.36047588187274632,0,0]
["LCA",2012,"LCA_2012_MICS",42,"Water point at more than 30 minutes","No","w_30min",99.522236518909565,100,99.706948078451575,100,99.855117658369736,99.668461535109358,100,100,100,99.238230271170707,99.48631116454348,100,99.639524118127255,100,100]
["LCA",2012,"LCA_2012_MICS",58,"Main source of drinking water","Piped into dwelling","",42.262375034887853,56.735082450117233,64.239241791349201,61.610198216452808,57.68685382853932,39.15250468936852,64.335798674478923,70.333951577231574,69.636569185557335,64.297114564585627,42.04311982436451,55.306994267966772,63.188908917130867,58.364359799502253,57.665507602812653]
["LCA",2012,"LCA_2012_MICS",59,"Main source of drinking water","Piped into compound, yard or plot","",25.13905230908551,13.15474426729252,3.648276303873569,0.27007985236877052,0,24.385177289792551,10.04716533066305,7.0829357062264791,1.265810300495396,0,26.176171478631439,12.456006489721171,3.5231646179521361,0,0]
["LCA",2012,"LCA_2012_MICS",60,"Main source of drinking water","Piped to neighbour","",5.340042710197852,2.6759273134359929,0.40648771012307422,0,0,8.0096890376382319,1.288472512389478,0,0,0,4.7421646530961912,3.487552607346744,0,0,0]
["LCA",2012,"LCA_2012_MICS",61,"Main source of drinking water","Public tap / standpipe","",5.2367342240592407,2.303458884237227,0.77415319276382388,0,0,10.23040543122125,5.9617652632757974,1.782718589342112,0,0,3.5954054017083599,1.9232104519055451,0.53986241552019942,0,0]
["LCA",2012,"LCA_2012_MICS",62,"Main source of drinking water","Unprotected well","",0,0,0,0.047969840924939097,0,0,0,0,0.25316206009907932,0,0,0,0,0,0]
["LCA",2012,"LCA_2012_MICS",63,"Main source of drinking water","Protected spring","",1.6081533000591139,0.68754136557431489,1.278525447224713,1.008043266320189,0.14488234163027461,0,0,0.25467408419173038,0.50632412019815853,0.7617697288292804,1.994641584362763,0.78592734813447751,1.5786361445286179,1.136372140641382,0]
["LCA",2012,"LCA_2012_MICS",64,"Main source of drinking water","Unprotected spring","",2.353601184994182,0.38357069468616328,0.29148698541038381,0,0.54381114861418522,0.53776543719468417,0,0,0,0,2.7929371866244299,0.47155640888068651,0.35990827701346628,0,0.66445861498671077]
["LCA",2012,"LCA_2012_MICS",65,"Main source of drinking water","Rainwater collection","",5.9599324088139447,5.6378841964524948,2.8994123041985911,1.226471324580511,1.3821806357861941,3.7071374941674602,1.7814532997384951,0.80423395007914855,1.962005965767865,0.53958689125407377,6.5215824439480166,7.2978234215336748,2.4267344854510928,1.244154509952802,1.563432035262849]
["LCA",2012,"LCA_2012_MICS",66,"Main source of drinking water","Tanker-truck","",0.28479550238088652,0,0,0,0,0,0,0,0,0,0.35324054744502198,0,0,0,0]
["LCA",2012,"LCA_2012_MICS",67,"Main source of drinking water","Bottled water","",11.815313325521389,18.421790828204081,26.462416265056639,35.837237499352753,40.242272045430042,13.977320620617199,16.585344919454261,19.741486092928969,26.376128367882171,34.401528815331019,11.78073687981923,18.270929004510979,28.382785142403591,39.255113549903442,40.10660174693777]
["LCA",2012,"LCA_2012_MICS",122,"Sanitation","Improved","s_imp",91.924954273860692,98.003680836872448,99.307729630130623,100,100,81.05374661326411,88.979440861421693,96.790045397166736,100,100,95.465722662718775,99.007766722980222,100,100,100,913.19954249386615,970.172447911419,985.63596247109501,995.85810146185179,989.17136843724199,152.4753105830805,168.61475494096339,181.55644881658509,188.69792216195759,188.1322645270518,764.61410358397347,797.23724811713453,803.82372827729466,799.3206727634871,809.56496900394689]
["LCA",2012,"LCA_2012_MICS",123,"Sanitation","Not Improved","",8.0750457261392476,1.996319163127555,0.69227036986935642,0,0,18.94625338673583,11.02055913857834,3.2099546028332679,0,0,4.5342773372812486,0.99223327701977782,0,0,0,80.219001695215184,19.762256200639079,6.8708304463077923,0,0,35.640991197013228,20.883800352913241,6.0211559583576708,0,0,36.316410801134062,7.9897300327438687,0,0,0]
["LCA",2012,"LCA_2012_MICS",124,"Sanitation ladder","Basic","s_bas",71.803965637493661,86.399059925953267,94.931996295286012,97.524747731412603,98.963702085218102,58.031643463320222,80.820312034647017,90.563014358204214,95.443082918216547,97.90955350601061,76.091087319053599,86.167293414329208,97.020612241144647,97.336045637512839,99.218283982368575,712.91588591295215,855.29427823358515,942.20651188281101,970.71633162223713,978.92060617250729,108.8021551617497,153.15332368965909,169.87593314510701,180.09911431398891,183.70575022064949,609.43673706571724,693.84229291374231,779.87470251422621,778.02713483114246,803.2364699681101]
["LCA",2012,"LCA_2012_MICS",125,"Sanitation ladder","Limited","s_lim",20.120988636367041,11.604620910919211,4.3757333348446039,2.4752522685873739,1.036297914781898,23.022103149943842,8.1591288267746886,6.2270310389625054,4.5569170817834266,2.0904464939893739,19.374635343665059,12.840473308651021,2.9793877588553501,2.6639543624871762,0.78171601763142429,199.77409759733089,114.87816967783409,43.429450588283913,24.637518762110339,10.250762264734711,43.163596437747387,15.46143125130426,11.6805156714781,8.5988078479686418,3.9222632288979771,155.17736651825541,103.3949552033923,23.949025763068409,21.293537932344751,6.3284990358367281]
["LCA",2012,"LCA_2012_MICS",126,"Sanitation ladder","Unimproved","s_unimp",1.013948696718119,0.99018715025988868,2.7311486405799999e-14,2.30926389122e-14,-4.4408920985e-16,3.1629068156407421,2.0727601286265069,1.6978272279448821,2.57571741713e-14,1.55431223448e-14,0.50920347921177989,0.33401912295715003,2.6645352590999998e-15,-1.55431223448e-14,3.3306690738800001e-16,10.10873483601379,9.802206236081215,0,0,0,6.0303687906967909,3.9278504984548119,3.1847436473957931,0,0,4.0783660453170034,2.68961209023061,0,0,0]
["LCA",2012,"LCA_2012_MICS",127,"Sanitation ladder","Open defecation","s_od",7.061097029421175,1.0061320128676301,0.69227036986935642,0,0,15.783346571095191,8.9477990099517868,1.512127374888399,0,0,4.0250738580695664,0.65821415406262485,0,0,0,70.110266859201403,9.9600499645578626,6.8708304463077923,0,0,29.61062240631642,16.955949854458432,2.8364123109618782,0,0,32.238044755817057,5.3001179425132587,0,0,0]
["LCA",2012,"LCA_2012_MICS",128,"Shared among Improved Sanitation","Yes","s_shared",21.888494582682149,11.841005166158149,4.4062364038951687,2.4752522685873739,1.036297914781898,28.403502752057079,9.169678689577152,6.4335449099239552,4.5569170817834266,2.0904464939893739,20.294860608886619,12.96915760616856,2.9793877588553501,2.6639543624871762,0.78171601763142429]
["LCA",2012,"LCA_2012_MICS",129,"Shared among Improved Sanitation","No","",78.111505417317858,88.158994833841874,95.593763596104822,97.524747731412617,98.963702085218102,71.596497247942864,90.83032131042286,93.566455090076033,95.443082918216547,97.90955350601061,79.705139391113264,87.030842393831449,97.020612241144647,97.336045637512839,99.218283982368575]
["LCA",2012,"LCA_2012_MICS",130,"Manually calculated ratios","Improved latrines","",100,99.145175980571082,100,100,100,100,100,100,100,100,100,99.083420591435384,100,100,100]
["LCA",2012,"LCA_2012_MICS",135,"Sanitation type","Sewer connection","s_sew",1.6932328628554341,2.521046837667114,5.7926994758466233,4.8419216157278226,10.931015215195,7.5213345126289344,5.5588411859961084,16.127236381441321,11.51722778922573,14.38074894953124,0.3336160725869653,1.432134278822826,2.8898517536669499,3.328390532151809,10.85230132869272]
["LCA",2012,"LCA_2012_MICS",136,"Sanitation type","Septic tank connection","s_sep",36.596003252662612,56.041410517180438,81.848865819449429,94.483813285711378,88.49507496260712,49.687377431591443,69.739369296911065,77.16029131666501,87.470123970377927,84.857481321639455,33.150314961187547,52.23755551786072,84.882519984404823,95.831555677404751,88.623489106542692]
["LCA",2012,"LCA_2012_MICS",137,"Sanitation type","Improved latrines","s_lat",53.635718158342648,39.441223482024881,11.66616433483456,0.67426509856078853,0.57390982219786701,23.84503466904366,13.68123037851449,3.5025176990603861,1.0126482403963171,0.76176972882928051,61.981791628944258,45.338076926296658,12.227628261928221,0.84005379044339923,0.52420956476460234]
["LCA",2012,"LCA_2012_MICS",138,"Sanitation type","Unimproved facilities","",1.017570579404218,0.99018715025992565,0,0,0,3.205659867663269,2.0727601286265509,1.697827227944869,0,0,0.50920347921168374,0.33401912295715303,0,0,0]
["LCA",2012,"LCA_2012_MICS",139,"Sanitation type","Open defecation","",7.0574751467350314,1.0061320128676301,0.69227036986935642,0,0,15.740593519072551,8.9477990099517868,1.512127374888399,0,0,4.0250738580695664,0.65821415406262485,0,0,0]
["LCA",2012,"LCA_2012_MICS",148,"Shared among improved sanitation facilities","Yes","",20.10976126486592,11.604620910919211,4.3757333348446048,2.4739989287574349,1.036297914781898,22.945165320231109,8.1591288267746886,6.2270310389625063,4.5569170817834266,2.0848434683748729,19.374635343665059,12.840473308651021,2.9793877588553501,2.6639543624871762,0.78171601763142429]
["LCA",2012,"LCA_2012_MICS",149,"Shared among improved sanitation facilities","No","",71.7638995248371,86.399059925953253,94.931996295286012,97.475366239155136,98.963702085218102,57.837706850594138,80.820312034647003,90.563014358204228,95.443082918216547,97.647126441851853,76.091087319053614,86.167293414329222,97.020612241144647,97.336045637512839,99.218283982368575]
["LCA",2012,"LCA_2012_MICS",150,"Shared among improved sanitation facilities","DK/missing","",8.1263392102969529,1.996319163127555,0.69227036986935642,0.050634832087435702,0,19.21712782917464,11.02055913857834,3.2099546028332679,0,0.26803008977326542,4.5342773372812486,0.99223327701977782,0,0,0]
["LCA",2012,"LCA_2012_MICS",151,"Shared among all sanitation facilities","Yes","",21.84082469689228,11.928387483607001,4.4062364038951687,2.4739989287574349,1.036297914781898,27.53296169403799,10.12992444202918,6.3226373694407423,4.5569170817834266,2.0848434683748729,20.370135759602821,12.925551115584391,2.9793877588553501,2.6639543624871762,0.78171601763142429]
["LCA",2012,"LCA_2012_MICS",152,"Shared among all sanitation facilities","No","",78.103986911960988,88.071612516393003,95.593763596104822,97.475366239155136,98.963702085218102,72.14556150740404,89.870075557970821,93.67736263055923,95.443082918216547,97.647126441851853,79.629864240397069,87.074448884415617,97.020612241144647,97.336045637512839,99.218283982368575]
["LCA",2012,"LCA_2012_MICS",153,"Type of toilet facility","Flush to piped sewer system","",1.6932328628554341,2.521046837667114,5.7926994758466233,4.8419216157278226,10.931015215195,7.5213345126289344,5.5588411859961084,16.127236381441321,11.51722778922573,14.38074894953124,0.3336160725869653,1.432134278822826,2.8898517536669499,3.328390532151809,10.85230132869272,16.82088925590957,24.956717552986341,57.49293579106854,48.218668676658112,108.1264727882275,14.148856329667399,10.533923738543621,30.251083720700791,21.732769528928522,27.054828654703339,2.6720329262421738,11.531931576413591,23.22931410801246,26.604513593792049,87.856429887846133]
["LCA",2012,"LCA_2012_MICS",154,"Type of toilet facility","Flush to septic tank","",36.596003252662612,56.041410517180438,81.848865819449429,94.483813285711378,88.49507496260712,49.687377431591443,69.739369296911065,77.16029131666501,87.470123970377927,84.857481321639455,33.150314961187547,52.23755551786072,84.882519984404823,95.831555677404751,88.623489106542692,363.55148274398988,554.77337138347389,812.35555318388595,940.92470917584626,875.36794400718395,93.470056875826799,132.15509728870779,144.7354262891684,165.05430644459159,159.64430123102031,265.51098813892258,420.63088975583503,682.30583679436256,766.00143556034743,717.46472211559853]
["LCA",2012,"LCA_2012_MICS",155,"Type of toilet facility","Flush to pit (latrine)","",1.074072511446337,0.54151156896870123,0.12752555611704289,0,0,0,0,0,0,0,1.3322048935714399,0.66572669489038094,0.1574598711933915,0,0,10.670035506745309,5.3606109480028756,1.265699807167346,0,0,0,0,0,0,0,10.670035506745309,5.3606109480028756,1.265699807167346,0,0]
["LCA",2012,"LCA_2012_MICS",156,"Type of toilet facility","Flush to unknown place / Not sure / DK where","",0,0.050796709927062401,0.38257666835112869,0,0.57390982219786701,0,0.26536047165916021,0,0,0.76176972882928051,0,0,0.47237961358017461,0,0.52420956476460234,0,0.50285426011512535,3.7970994215020371,0,5.6769516418303843,0,0.50285426011512535,0,0,1.433134641328107,0,0,3.7970994215020371,0,4.2438170005022773]
["LCA",2012,"LCA_2012_MICS",157,"Type of toilet facility","Ventilated Improved Pit latrine (VIP)","",4.2455166842382717,7.3367699280925374,3.5002213772990851,0.40511977855315567,0,1.2997035421705629,0.59871956418097994,0,1.0126482403963171,0,6.0667802734053504,8.5644506470434756,3.2968160531116348,0.50473086369676168,0,42.175750037864418,72.629231679045319,34.739934936840498,4.0344181353459154,0,2.4449542376361459,1.1345649243847511,0,1.9108461884374759,0,48.590694450399702,68.963267140325883,26.500589712566299,4.0344181353459154,0]
["LCA",2012,"LCA_2012_MICS",158,"Type of toilet facility","Pit latrine with slab","",48.316128962658063,31.51214527503658,7.6558407330673024,0.2691453200076328,0,22.545331126873101,12.817150342674349,3.5025176990603861,0,0,54.582806461967451,36.107899584362812,8.3009727240430244,0.33532292674663738,0,479.98138494935699,311.94966208779522,75.984739330630461,2.6803054740014369,0,42.41144313995003,24.28831472921204,6.5699388067159097,0,0,437.17035256166349,290.75054869655719,66.72518843368394,2.6803054740014369,0]
["LCA",2012,"LCA_2012_MICS",159,"Type of toilet facility","Pit latrine without slab / Open pit","",0,0.27169590873603239,0,0,0,0,0,0,0,0,0,0.33401912295715303,0,0,0,0,2.68961209023061,0,0,0,0,0,0,0,0,0,2.68961209023061,0,0,0]
["LCA",2012,"LCA_2012_MICS",160,"Type of toilet facility","Bucket","",0.82791792220300586,0.5147399939275652,0,0,0,2.9517150778768899,1.0083697923048081,1.697827227944869,0,0,0.3336160725869653,0,0,0,0,8.2246901698295964,5.0955898358332687,0,0,0,5.5526572435874222,1.9108461884374759,3.1847436473957931,0,0,2.6720329262421738,0,0,0,0]
["LCA",2012,"LCA_2012_MICS",161,"Type of toilet facility","No facility, Bush, Field","",7.0574751467350314,1.0061320128676301,0.69227036986935642,0,0,15.740593519072551,8.9477990099517868,1.512127374888399,0,0,4.0250738580695664,0.65821415406262485,0,0,0,70.110266859201403,9.9600499645578626,6.8708304463077923,0,0,29.61062240631642,16.955949854458432,2.8364123109618782,0,0,32.238044755817057,5.3001179425132587,0,0,0]
["LCA",2012,"LCA_2012_MICS",162,"Type of toilet facility","Other","",0.18965265720121269,0.2037512475963279,0,0,0,0.25394478978637858,1.064390336321742,0,0,0,0.17558740662471861,0,0,0,0,1.884044666184197,2.0170043100173358,0,0,0,0.47771154710936897,2.0170043100173358,0,0,0,1.4063331190748281,0,0,0,0]
["LCA",2012,"LCA_2012_MICS",222,"Hygiene ladder","Basic","h_bas",69.68906407180117,85.20066099366403,90.754167823200532,95.119565143757754,95.69936992837799,66.778105622320055,88.284016506201056,88.835415293280732,98.374545140238837,96.510124337500315,70.538578533693823,84.583114215989013,90.881410765461482,94.434304438102274,95.409063635960763,677.33563318131473,817.17567809890454,840.06129198050382,935.43461675997935,887.47958596738761,119.60013695700709,159.88622178625849,156.7856363865624,178.28878967813719,178.0848728266017,557.521354952097,658.94654446619472,685.15912715097272,747.30496059017639,715.90916119408223]
["LCA",2012,"LCA_2012_MICS",223,"Hygiene ladder","Limited","h_lim",15.631942978206551,11.064551592355411,5.4361424477327649,3.1558410652814031,2.3168659443196211,17.998257071504611,8.9902887199153358,8.7285239686104497,0,1.2944389963395579,15.023521702004301,11.409375318183949,4.8846030177295594,3.9218468034474361,2.545076703771036,151.93304912358661,106.12221014360119,50.319373286843238,31.03549698734767,21.48573423780709,32.235026595601497,16.281806753705151,15.404973124918371,0,2.3885577355468448,118.7425994337663,88.884980295677309,36.825246350362349,31.03549698734767,19.09717650226024]
["LCA",2012,"LCA_2012_MICS",224,"Hygiene ladder","No facility","h_nfac",14.67899294999224,3.734787413980575,3.80968972906668,1.72459379096083,1.9837641273023869,15.223637306175229,2.7256947738836019,2.4360607381088051,1.625454859761164,2.195436666160119,14.437899764301831,4.0075104658270444,4.2339862168089528,1.6438487584502961,2.0458596602681891,142.67095012214699,35.821053522129269,35.264197255153078,16.960177745513519,18.39667458284088,27.265659752315418,4.9363526534634801,4.2994039239843209,2.9458878738411092,4.0511196330524779,114.1139729008174,31.22059524346119,31.92021642538749,13.00858135144216,15.351263470018649]
["LCA",2012,"LCA_2012_MICS",225,"Place where household members most often wash their hands","Observed","",83.476263570439485,93.268564523220363,89.71028426416477,97.048978396481871,91.891592216345501,80.713453388054873,92.965367607557809,91.796997684279319,94.483705827514981,95.929016224751834,84.434784571174248,92.872139788475522,89.818743600496532,97.375244266681108,90.790284391957073]
["LCA",2012,"LCA_2012_MICS",226,"Place where household members most often wash their hands","Not in dwelling/plot/yard","",8.6679307727006183,1.220899516717197,0.73263550318546633,0.48227834213349202,0,10.592921009444501,0.25209244807620212,1.5280445051503819,0,0.53457524830124947,8.2631163691941065,1.3229777026930369,0.66688886623083454,0.47504081289106981,0]
["LCA",2012,"LCA_2012_MICS",227,"Place where household members most often wash their hands","No permission to see","",2.1621210805528488,3.1129085806789738,6.7366723202333461,1.247949878679312,6.2486011647159501,4.7925025050240464,4.4296770956547862,5.9109355579951224,3.95512813520735,1.917647853184673,1.3175408988540971,3.2506186273944389,6.2102096012462251,0.99730109656243404,7.3134794740972886]
["LCA",2012,"LCA_2012_MICS",228,"Place where household members most often wash their hands","Other reason","",5.6936845763069739,2.3976273793834588,2.8204079124164041,1.2207933827053321,1.859806618938552,3.901123097476499,2.35286284871122,0.76402225257519119,1.561166037277655,1.6187606737622211,5.9845581607774889,2.554263881437052,3.3041579320264058,1.1524138238653729,1.8962361339456391]