{"text_format":"1","workbook":"xlsx","n_sheets":8,"sheets":["Introduction","Water","Sanitation","Hygiene","SLC97","SLC07","MICS11","data_summary"],"not_rendered":{"charts":117,"images":76,"macros":1,"external_links":0,"defined_names":0,"comments":0,"pivot_tables":0},"unopened":[],"bounds":{"document_bytes":16777216,"sheet_cells":100000,"rows_first":2000,"rows_last":500,"rows_between":2000,"halvings":0,"cell_chars":16384,"cell_head_chars":4096},"cells_cut":0,"cells_raw":0,"read":"whole","date_system":"1900"}

{"sheet":"Introduction","index":0,"n_rows":55,"n_cols":12,"rows_kept":55,"cut":false,"hidden":false,"merged":[[107,0,107,1],[1,0,1,1],[4,0,4,1],[5,0,5,1],[6,0,6,1],[7,0,7,1],[112,0,112,1],[113,0,113,1],[207,0,207,1],[212,0,212,1],[213,0,213,1]]}
[]
[]
[]
[null,null,"Joint Monitoring Programme for Water Supply, Sanitation and Hygiene"]
[]
[null,null,"Estimates on household water, sanitation and hygiene \nby wealth quintile and sub-national region in"]
[null,null,{"$f":"+Water!B5","v":"Jamaica"}]
[]
[null,null,"Updated May 2021"]
[]
[null,null,"Follow the links below to find the following information: "]
[]
[null,null,"JMP Estimates"]
[null,null,"WASH status and trends by wealth quintile \n(customized quintiles made without water and sanitation assets)"]
[null,null,"Water"]
[null,null,"Sanitation"]
[null,null,"Hygiene"]
[]
[null,null,"Data inputs"]
[null,null," customized wealth quintiles and subnational data:"]
[null,null,{"$f":"IF(INDIRECT(CONCATENATE(\"Water\",\"!B105\"))=0,\"\",INDIRECT(CONCATENATE(\"Water\",\"!B105\")))","v":"SLC97"}]
[null,null,{"$f":"IF(INDIRECT(CONCATENATE(\"Water\",\"!B106\"))=0,\"\",INDIRECT(CONCATENATE(\"Water\",\"!B106\")))","v":"SLC07"}]
[null,null,{"$f":"IF(INDIRECT(CONCATENATE(\"Water\",\"!B107\"))=0,\"\",INDIRECT(CONCATENATE(\"Water\",\"!B107\")))","v":"MICS11"}]
[null,null,{"$f":"IF(INDIRECT(CONCATENATE(\"Water\",\"!B108\"))=0,\"\",INDIRECT(CONCATENATE(\"Water\",\"!B108\")))","v":""}]
[null,null,{"$f":"IF(INDIRECT(CONCATENATE(\"Water\",\"!B109\"))=0,\"\",INDIRECT(CONCATENATE(\"Water\",\"!B109\")))","v":""}]
[null,null,{"$f":"IF(INDIRECT(CONCATENATE(\"Water\",\"!B110\"))=0,\"\",INDIRECT(CONCATENATE(\"Water\",\"!B110\")))","v":""}]
[null,null,{"$f":"IF(INDIRECT(CONCATENATE(\"Water\",\"!B111\"))=0,\"\",INDIRECT(CONCATENATE(\"Water\",\"!B111\")))","v":""}]
[null,null,{"$f":"IF(INDIRECT(CONCATENATE(\"Water\",\"!B112\"))=0,\"\",INDIRECT(CONCATENATE(\"Water\",\"!B112\")))","v":""}]
[null,null,{"$f":"IF(INDIRECT(CONCATENATE(\"Water\",\"!B113\"))=0,\"\",INDIRECT(CONCATENATE(\"Water\",\"!B113\")))","v":""}]
[null,null,{"$f":"IF(INDIRECT(CONCATENATE(\"Water\",\"!B114\"))=0,\"\",INDIRECT(CONCATENATE(\"Water\",\"!B114\")))","v":""}]
[null,null,{"$f":"IF(INDIRECT(CONCATENATE(\"Water\",\"!B115\"))=0,\"\",INDIRECT(CONCATENATE(\"Water\",\"!B115\")))","v":""}]
[null,null,{"$f":"IF(INDIRECT(CONCATENATE(\"Water\",\"!B116\"))=0,\"\",INDIRECT(CONCATENATE(\"Water\",\"!B116\")))","v":""}]
[]
[]
[]
[]
[]
[]
[]
[]
[]
[]
[]
[]
[]
[]
[]
[]
[]
[]
[]
[]
[]
[]
[null,null,null,null,null,null,null,null,null,null,null,{"$f":"+IF(ISNUMBER(M48), \"\", \"Insufficient data to estimate safely managed sanitation services at national level\")","v":"Insufficient data to estimate safely managed sanitation services at national level"}]

{"sheet":"Water","index":1,"n_rows":318,"n_cols":28,"rows_kept":318,"cut":false,"hidden":false,"merged":[[3,1,3,24],[317,18,317,22],[117,18,117,22],[196,18,196,22],[296,23,296,27],[298,0,299,1],[300,0,301,1],[296,0,297,2],[296,3,296,7],[296,8,296,12],[296,13,296,17],[296,18,296,22],[196,23,196,27],[198,0,199,1],[200,0,201,1],[196,13,196,17],[96,8,96,12],[96,13,96,17],[96,18,96,22],[217,18,217,22],[98,0,99,1],[100,0,101,1],[196,0,197,2],[196,3,196,7],[196,8,196,12],[217,1,217,11],[35,3,36,3],[38,1,39,2],[38,3,39,3],[96,0,97,2],[96,3,96,7],[317,1,317,11],[6,9,6,16],[6,17,6,24],[6,1,6,8],[4,1,4,24],[117,1,117,11],[30,21,30,24],[32,1,33,2],[32,3,33,3],[30,17,30,20],[30,1,31,4],[30,5,30,8],[30,9,30,12],[30,13,30,16],[96,23,96,27],[35,1,36,2]]}
["BGD"]
[]
[]
[null,"Summary of trends in use of drinking water by wealth quintile (%)"]
[null,{"$f":"IF(ISERROR(INDIRECT(CONCATENATE($B105,\"!A2\"))),\"\",INDIRECT(CONCATENATE($B105,\"!A2\")))","v":"Jamaica"}]
[]
[null,{"$f":"B118","v":"National use of drinking water sources, 2000–2017"},null,null,null,null,null,null,null,{"$f":"B218","v":"Urban use of drinking water sources,  2000–2017"},null,null,null,null,null,null,null,{"$f":"B318","v":"Rural use of drinking water sources, 2000–2017"}]
[]
[]
[]
[]
[]
[]
[]
[]
[]
[]
[]
[]
[]
[]
[]
[]
[]
[]
[]
[]
[]
[]
[]
[null,{"$f":"IF(ISERROR(INDIRECT(CONCATENATE($B105,\"!A2\"))),\"\",INDIRECT(CONCATENATE($B105,\"!A2\")))","v":"Jamaica"},null,null,null,"Poorest",null,null,null,"Poor",null,null,null,"Middle",null,null,null,"Rich",null,null,null,"Richest"]
[null,null,null,null,null,"Basic","Limited","Unimproved","Surface \n water","Basic","Limited","Unimproved","Surface \nwater","Basic","Limited","Unimproved","Surface \nwater","Basic","Limited","Unimproved","Surface \nwater","Basic","Limited","Unimproved","Surface \nwater"]
[null,"NATIONAL",null,"Estimate",{"$f":"C99","v":2000},{"$f":"E99","v":87.405271270399481},{"$f":"F99","v":3.45259907305112},5.991198297194174,3.1509313593552264,{"$f":"J99","v":90.05410707541516},{"$f":"K99","v":2.9769952752203386},2.5063266257744061,4.462571023590101,{"$f":"O99","v":92.678271611684181},{"$f":"P99","v":0},3.6308730381945225,3.6908553501212964,{"$f":"T99","v":90.347148508644821},{"$f":"U99","v":1.282819552861088},3.7489385361509449,4.6210934023431491,{"$f":"Y99","v":94.884741584033975},{"$f":"Z99","v":0.95843173317206043},1.4135661789749747,2.7432605038189877]
[null,null,null,null,{"$f":"C100","v":2017},{"$f":"E100","v":85.981343882061879},3.3963524610377851,6.9646403348204302,3.6576633220799124,{"$f":"J100","v":91.397846787817755},3.0214164227377802,3.4474410866662737,2.1332957027781845,{"$f":"O100","v":98.409086045100935},0,0.67450780129473742,0.91640615360432776,{"$f":"T100","v":94.956544680047898},1.3482673686822273,2.7558942540116504,0.93929369725822198,{"$f":"Y100","v":97.975881505694105},0.98965536874438498,1.0344631255615155,0]
[]
[null,"URBAN",null,"Estimate",{"$f":"C199","v":2000},{"$f":"E199","v":94.220884401986453},{"$f":"F199","v":0.95172610507057032},4.6939141286188857,0.13347536432408447,{"$f":"J199","v":98.057661078219496},{"$f":"K199","v":0.19650833883411001},1.213854003218529,0.53197657972786772,{"$f":"O199","v":97.513828608966435},{"$f":"P199","v":0.88559481077770286},1.6005765802558614,0,{"$f":"T199","v":96.61301332958017},{"$f":"U199","v":0.97588902353111284},2.309673241198297,0.10142440569042321,{"$f":"Y199","v":98.605157426231003},{"$f":"Z199","v":0},1.3948425737689973,0]
[null,null,null,null,{"$f":"C200","v":2017},{"$f":"E200","v":94.708191326742394},0.95664839723982231,4.0609946628115665,0.27416561320622534,{"$f":"J200","v":99.264044301093818},0.19892594048315676,0.53702975842303147,0,{"$f":"O200","v":97.582442956627588},0.8862179481429403,1.5313390952294696,0,{"$f":"T200","v":98.794180885882781},0.99792101904932096,0,0.20789809506790291,{"$f":"Y200","v":97.823029975869289},0,2.1769700241307106,0]
[]
[null,"RURAL",null,"Estimate",{"$f":"C299","v":2000},{"$f":"E299","v":78.859426941578889},{"$f":"F299","v":4.32562257485454},7.7678158458248845,9.0471346377416921,{"$f":"J299","v":85.640670028816672},{"$f":"K299","v":2.4670151860152929},5.2397653718916928,6.652549413276347,{"$f":"O299","v":79.610078249035212},{"$f":"P299","v":4.1018862609913045},5.7355738305616342,10.552461659411847,{"$f":"T299","v":87.079205273124174},{"$f":"U299","v":1.4159220369613634},4.0984923868861642,7.4063803030282997,{"$f":"Y299","v":91.839262747321698},{"$f":"Z299","v":1.3040057590897658},1.5683192223100377,5.2884122712785029]
[null,null,null,null,{"$f":"C300","v":2017},{"$f":"E300","v":83.098910178310291},4.5581680688524662,7.6926770014115391,4.6502447514257028,{"$f":"J300","v":88.119398579825742},2.5384188891307802,4.684635596560895,4.6575469344825819,{"$f":"O300","v":87.557254941808637},4.5113622420069701,5.4280826491756216,2.5033001670087742,{"$f":"T300","v":93.726875723358177},1.5240142394041922,2.1433494860337845,2.6057605512038435,{"$f":"Y300","v":96.861306153143801},1.3753126634320676,1.6672662806406464,9.6114902783483558E-2]
[]
[]
[]
[]
[]
[]
[]
[]
[]
[]
[]
[]
[]
[]
[]
[]
[]
[]
[]
[]
[]
[]
[]
[]
[]
[]
[]
[]
[]
[]
[]
[]
[]
[]
[]
[]
[]
[]
[]
[]
[]
[]
[]
[]
[]
[]
[]
[]
[]
[]
[]
[]
[]
[]
[]
[]
["NATIONAL",null,null,"Poorest",null,null,null,null,"Poor",null,null,null,null,"Middle",null,null,null,null,"Rich",null,null,null,null,"Richest"]
[null,null,null,"Improved","Basic","Limited","Unimproved","Surface water","Improved","Basic","Limited","Unimproved","Surface water","Improved","Basic","Limited","Unimproved","Surface water","Improved","Basic","Limited","Unimproved","Surface water","Improved","Basic","Limited","Unimproved","Surface water"]
["Forecast period:",null,2000,{"$f":"IF((D101+H101)>100,D101*100/(D101+H101),D101)","v":90.8578703434506},{"$f":"D99*AVERAGEIF(E105:E116,\">0\")/100","v":87.405271270399481},{"$f":"D99*(100-AVERAGEIF(E105:E116,\">0\"))/100","v":3.45259907305112},{"$f":"100-(E99+F99+H99)","v":5.991198297194174},{"$f":"IF((D101+H101)>100,H101*100/(D101+H101),H101)","v":3.1509313593552264},{"$f":"IF((I101+M101)>100,I101*100/(I101+M101),I101)","v":93.031102350635493},{"$f":"I99*AVERAGEIF(J105:J116,\">0\")/100","v":90.05410707541516},{"$f":"I99*(100-AVERAGEIF(J105:J116,\">0\"))/100","v":2.9769952752203386},{"$f":"100-(J99+K99+M99)","v":2.5063266257744061},{"$f":"IF((I101+M101)>100,M101*100/(I101+M101),M101)","v":4.462571023590101},{"$f":"IF((N101+R101)>100,N101*100/(N101+R101),N101)","v":92.678271611684181},{"$f":"N99*AVERAGEIF(O105:O116,\">0\")/100","v":92.678271611684181},{"$f":"N99*(100-AVERAGEIF(O105:O116,\">0\"))/100","v":0},{"$f":"100-(O99+P99+R99)","v":3.6308730381945225},{"$f":"IF((N101+R101)>100,R101*100/(N101+R101),R101)","v":3.6908553501212964},{"$f":"IF((S101+W101)>100,S101*100/(S101+W101),S101)","v":91.629968061505906},{"$f":"S99*AVERAGEIF(T105:T116,\">0\")/100","v":90.347148508644821},{"$f":"S99*(100-AVERAGEIF(T105:T116,\">0\"))/100","v":1.282819552861088},{"$f":"100-(T99+U99+W99)","v":3.7489385361509449},{"$f":"IF((S101+W101)>100,W101*100/(S101+W101),W101)","v":4.6210934023431491},{"$f":"IF((X101+AB101)>100,X101*100/(X101+AB101),X101)","v":95.843173317206038},{"$f":"X99*AVERAGEIF(Y105:Y116,\">0\")/100","v":94.884741584033975},{"$f":"X99*(100-AVERAGEIF(Y105:Y116,\">0\"))/100","v":0.95843173317206043},{"$f":"100-(Y99+Z99+AB99)","v":1.4135661789749747},{"$f":"IF((X101+AB101)>100,AB101*100/(X101+AB101),AB101)","v":2.7432605038189877}]
[null,null,2017,{"$f":"IF((D102+H102)>100,D102*100/(D102+H102),D102)","v":89.377696343099672},{"$f":"D100*AVERAGEIF(E105:E116,\">0\")/100","v":85.981343882061879},{"$f":"D100*(100-AVERAGEIF(E105:E116,\">0\"))/100","v":3.3963524610377851},{"$f":"100-(E100+F100+H100)","v":6.9646403348204302},{"$f":"IF((D102+H102)>100,H102*100/(D102+H102),H102)","v":3.6576633220799124},{"$f":"IF((I102+M102)>100,I102*100/(I102+M102),I102)","v":94.419263210555542},{"$f":"I100*AVERAGEIF(J105:J116,\">0\")/100","v":91.397846787817755},{"$f":"I100*(100-AVERAGEIF(J105:J116,\">0\"))/100","v":3.0214164227377802},{"$f":"100-(J100+K100+M100)","v":3.4474410866662737},{"$f":"IF((I102+M102)>100,M102*100/(I102+M102),M102)","v":2.1332957027781845},{"$f":"IF((N102+R102)>100,N102*100/(N102+R102),N102)","v":98.409086045100935},{"$f":"N100*AVERAGEIF(O105:O116,\">0\")/100","v":98.409086045100935},{"$f":"N100*(100-AVERAGEIF(O105:O116,\">0\"))/100","v":0},{"$f":"100-(O100+P100+R100)","v":0.67450780129473742},{"$f":"IF((N102+R102)>100,R102*100/(N102+R102),R102)","v":0.91640615360432776},{"$f":"IF((S102+W102)>100,S102*100/(S102+W102),S102)","v":96.304812048730128},{"$f":"S100*AVERAGEIF(T105:T116,\">0\")/100","v":94.956544680047898},{"$f":"S100*(100-AVERAGEIF(T105:T116,\">0\"))/100","v":1.3482673686822273},{"$f":"100-(T100+U100+W100)","v":2.7558942540116504},{"$f":"IF((S102+W102)>100,W102*100/(S102+W102),W102)","v":0.93929369725822198},{"$f":"IF((X102+AB102)>100,X102*100/(X102+AB102),X102)","v":98.965536874438499},{"$f":"X100*AVERAGEIF(Y105:Y116,\">0\")/100","v":97.975881505694105},{"$f":"X100*(100-AVERAGEIF(Y105:Y116,\">0\"))/100","v":0.98965536874438498},{"$f":"100-(Y100+Z100+AB100)","v":1.0344631255615155},{"$f":"IF((X102+AB102)>100,AB102*100/(X102+AB102),AB102)","v":0}]
["Regression period:",null,{"$f":"MinRegYear(C99,C105:C116)","v":2000},{"$f":"IF(MAX(C105:C116)-MIN(C105:C116)<5,AVERAGEIF(C105:C116,\">0\",D105:D116),\nIF(FORECAST($C101,D$105:D$116,$C$105:$C$116)<0,0,\nIF(FORECAST($C101,D$105:D$116,$C$105:$C$116)>100,100,\nFORECAST($C101,D$105:D$116,$C$105:$C$116))))","v":90.8578703434506},null,null,null,{"$f":"IF(MAX(C105:C116)-MIN(C105:C116)<5,AVERAGEIF(C105:C116,\">0\",H105:H116),\nIF(FORECAST($C101,H$105:H$116,$C$105:$C$116)<0,0,\nIF(FORECAST($C101,H$105:H$116,$C$105:$C$116)>100,100,\nFORECAST($C101,H$105:H$116,$C$105:$C$116))))","v":3.1509313593552264},{"$f":"IF(MAX(C105:C116)-MIN(C105:C116)<5,AVERAGEIF(C105:C116,\">0\",I105:I116),\nIF(FORECAST($C101,I$105:I$116,$C$105:$C$116)<0,0,\nIF(FORECAST($C101,I$105:I$116,$C$105:$C$116)>100,100,\nFORECAST($C101,I$105:I$116,$C$105:$C$116))))","v":93.031102350635493},null,null,null,{"$f":"IF(MAX(C105:C116)-MIN(C105:C116)<5,AVERAGEIF(C105:C116,\">0\",M105:M116),\nIF(FORECAST($C101,M$105:M$116,$C$105:$C$116)<0,0,\nIF(FORECAST($C101,M$105:M$116,$C$105:$C$116)>100,100,\nFORECAST($C101,M$105:M$116,$C$105:$C$116))))","v":4.462571023590101},{"$f":"IF(MAX(C105:C116)-MIN(C105:C116)<5,AVERAGEIF(C105:C116,\">0\",N105:N116),\nIF(FORECAST($C101,N$105:N$116,$C$105:$C$116)<0,0,\nIF(FORECAST($C101,N$105:N$116,$C$105:$C$116)>100,100,\nFORECAST($C101,N$105:N$116,$C$105:$C$116))))","v":92.678271611684181},null,null,null,{"$f":"IF(MAX(C105:C116)-MIN(C105:C116)<5,AVERAGEIF(C105:C116,\">0\",R105:R116),\nIF(FORECAST($C101,R$105:R$116,$C$105:$C$116)<0,0,\nIF(FORECAST($C101,R$105:R$116,$C$105:$C$116)>100,100,\nFORECAST($C101,R$105:R$116,$C$105:$C$116))))","v":3.6908553501212964},{"$f":"IF(MAX(C105:C116)-MIN(C105:C116)<5,AVERAGEIF(C105:C116,\">0\",S105:S116),\nIF(FORECAST($C101,S$105:S$116,$C$105:$C$116)<0,0,\nIF(FORECAST($C101,S$105:S$116,$C$105:$C$116)>100,100,\nFORECAST($C101,S$105:S$116,$C$105:$C$116))))","v":91.629968061505906},null,null,null,{"$f":"IF(MAX(C105:C116)-MIN(C105:C116)<5,AVERAGEIF(C105:C116,\">0\",W105:W116),\nIF(FORECAST($C101,W$105:W$116,$C$105:$C$116)<0,0,\nIF(FORECAST($C101,W$105:W$116,$C$105:$C$116)>100,100,\nFORECAST($C101,W$105:W$116,$C$105:$C$116))))","v":4.6210934023431491},{"$f":"IF(MAX(C105:C116)-MIN(C105:C116)<5,AVERAGEIF(C105:C116,\">0\",X105:X116),\nIF(FORECAST($C101,X$105:X$116,$C$105:$C$116)<0,0,\nIF(FORECAST($C101,X$105:X$116,$C$105:$C$116)>100,100,\nFORECAST($C101,X$105:X$116,$C$105:$C$116))))","v":95.843173317206038},null,null,null,{"$f":"IF(MAX(C105:C116)-MIN(C105:C116)<5,AVERAGEIF(C105:C116,\">0\",AB105:AB116),\nIF(FORECAST($C101,AB$105:AB$116,$C$105:$C$116)<0,0,\nIF(FORECAST($C101,AB$105:AB$116,$C$105:$C$116)>100,100,\nFORECAST($C101,AB$105:AB$116,$C$105:$C$116))))","v":2.7432605038189877}]
[null,null,{"$f":"MaxRegYear(C100,C105:C116)","v":2013},{"$f":"IF(MAX(C105:C116)-MIN(C105:C116)<5,AVERAGEIF(C105:C116,\">0\",D105:D116),\nIF(FORECAST($C102,D$105:D$116,$C$105:$C$116)<0,0,\nIF(FORECAST($C102,D$105:D$116,$C$105:$C$116)>100,100,\nFORECAST($C102,D$105:D$116,$C$105:$C$116))))","v":89.377696343099672},null,null,null,{"$f":"IF(MAX(C105:C116)-MIN(C105:C116)<5,AVERAGEIF(C105:C116,\">0\",H105:H116),\nIF(FORECAST($C102,H$105:H$116,$C$105:$C$116)<0,0,\nIF(FORECAST($C102,H$105:H$116,$C$105:$C$116)>100,100,\nFORECAST($C102,H$105:H$116,$C$105:$C$116))))","v":3.6576633220799124},{"$f":"IF(MAX(C105:C116)-MIN(C105:C116)<5,AVERAGEIF(C105:C116,\">0\",I105:I116),\nIF(FORECAST($C102,I$105:I$116,$C$105:$C$116)<0,0,\nIF(FORECAST($C102,I$105:I$116,$C$105:$C$116)>100,100,\nFORECAST($C102,I$105:I$116,$C$105:$C$116))))","v":94.419263210555542},null,null,null,{"$f":"IF(MAX(C105:C116)-MIN(C105:C116)<5,AVERAGEIF(C105:C116,\">0\",M105:M116),\nIF(FORECAST($C102,M$105:M$116,$C$105:$C$116)<0,0,\nIF(FORECAST($C102,M$105:M$116,$C$105:$C$116)>100,100,\nFORECAST($C102,M$105:M$116,$C$105:$C$116))))","v":2.1332957027781845},{"$f":"IF(MAX(C105:C116)-MIN(C105:C116)<5,AVERAGEIF(C105:C116,\">0\",N105:N116),\nIF(FORECAST($C102,N$105:N$116,$C$105:$C$116)<0,0,\nIF(FORECAST($C102,N$105:N$116,$C$105:$C$116)>100,100,\nFORECAST($C102,N$105:N$116,$C$105:$C$116))))","v":98.409086045100935},null,null,null,{"$f":"IF(MAX(C105:C116)-MIN(C105:C116)<5,AVERAGEIF(C105:C116,\">0\",R105:R116),\nIF(FORECAST($C102,R$105:R$116,$C$105:$C$116)<0,0,\nIF(FORECAST($C102,R$105:R$116,$C$105:$C$116)>100,100,\nFORECAST($C102,R$105:R$116,$C$105:$C$116))))","v":0.91640615360432776},{"$f":"IF(MAX(C105:C116)-MIN(C105:C116)<5,AVERAGEIF(C105:C116,\">0\",S105:S116),\nIF(FORECAST($C102,S$105:S$116,$C$105:$C$116)<0,0,\nIF(FORECAST($C102,S$105:S$116,$C$105:$C$116)>100,100,\nFORECAST($C102,S$105:S$116,$C$105:$C$116))))","v":96.304812048730128},null,null,null,{"$f":"IF(MAX(C105:C116)-MIN(C105:C116)<5,AVERAGEIF(C105:C116,\">0\",W105:W116),\nIF(FORECAST($C102,W$105:W$116,$C$105:$C$116)<0,0,\nIF(FORECAST($C102,W$105:W$116,$C$105:$C$116)>100,100,\nFORECAST($C102,W$105:W$116,$C$105:$C$116))))","v":0.93929369725822198},{"$f":"IF(MAX(C105:C116)-MIN(C105:C116)<5,AVERAGEIF(C105:C116,\">0\",X105:X116),\nIF(FORECAST($C102,X$105:X$116,$C$105:$C$116)<0,0,\nIF(FORECAST($C102,X$105:X$116,$C$105:$C$116)>100,100,\nFORECAST($C102,X$105:X$116,$C$105:$C$116))))","v":98.965536874438499},null,null,null,{"$f":"IF(MAX(C105:C116)-MIN(C105:C116)<5,AVERAGEIF(C105:C116,\">0\",AB105:AB116),\nIF(FORECAST($C102,AB$105:AB$116,$C$105:$C$116)<0,0,\nIF(FORECAST($C102,AB$105:AB$116,$C$105:$C$116)>100,100,\nFORECAST($C102,AB$105:AB$116,$C$105:$C$116))))","v":0}]
[]
[null,"Survey","Year","Improved","Basic",null,null,"Surface water","Improved","Basic",null,null,"Surface water","Improved","Basic",null,null,"Surface water","Improved","Basic",null,null,"Surface water","Improved","Basic",null,null,"Surface water"]
[null,"SLC97",1997,{"$f":"IF(ISERROR(INDIRECT(CONCATENATE($B105,\"!C16\"))),\"\",INDIRECT(CONCATENATE($B105,\"!C16\")))","v":92.157282790885517},{"$f":"IF(ISERROR(INDIRECT(CONCATENATE($B105,\"!C23\"))),\"\",INDIRECT(CONCATENATE($B105,\"!C23\")))","v":"N/A"},null,null,{"$f":"IF(ISERROR(INDIRECT(CONCATENATE($B105,\"!C21\"))),\"\",INDIRECT(CONCATENATE($B105,\"!C21\")))","v":2.6421113906775435},{"$f":"IF(ISERROR(INDIRECT(CONCATENATE($B105,\"!D16\"))),\"\",INDIRECT(CONCATENATE($B105,\"!D16\")))","v":93.468477536272971},{"$f":"IF(ISERROR(INDIRECT(CONCATENATE($B105,\"!D23\"))),\"\",INDIRECT(CONCATENATE($B105,\"!D23\")))","v":"N/A"},null,null,{"$f":"IF(ISERROR(INDIRECT(CONCATENATE($B105,\"!D21\"))),\"\",INDIRECT(CONCATENATE($B105,\"!D21\")))","v":4.2434377967700589},{"$f":"IF(ISERROR(INDIRECT(CONCATENATE($B105,\"!E16\"))),\"\",INDIRECT(CONCATENATE($B105,\"!E16\")))","v":92.304807058757831},{"$f":"IF(ISERROR(INDIRECT(CONCATENATE($B105,\"!E23\"))),\"\",INDIRECT(CONCATENATE($B105,\"!E23\")))","v":"N/A"},null,null,{"$f":"IF(ISERROR(INDIRECT(CONCATENATE($B105,\"!E21\"))),\"\",INDIRECT(CONCATENATE($B105,\"!E21\")))","v":3.7938150603978413},{"$f":"IF(ISERROR(INDIRECT(CONCATENATE($B105,\"!F16\"))),\"\",INDIRECT(CONCATENATE($B105,\"!F16\")))","v":91.036915798022065},{"$f":"IF(ISERROR(INDIRECT(CONCATENATE($B105,\"!F23\"))),\"\",INDIRECT(CONCATENATE($B105,\"!F23\")))","v":"N/A"},null,null,{"$f":"IF(ISERROR(INDIRECT(CONCATENATE($B105,\"!F21\"))),\"\",INDIRECT(CONCATENATE($B105,\"!F21\")))","v":4.9884497196849908},{"$f":"IF(ISERROR(INDIRECT(CONCATENATE($B105,\"!G16\"))),\"\",INDIRECT(CONCATENATE($B105,\"!G16\")))","v":95.368558580822054},{"$f":"IF(ISERROR(INDIRECT(CONCATENATE($B105,\"!G23\"))),\"\",INDIRECT(CONCATENATE($B105,\"!G23\")))","v":"N/A"},null,null,{"$f":"IF(ISERROR(INDIRECT(CONCATENATE($B105,\"!G221\"))),\"\",INDIRECT(CONCATENATE($B105,\"!G21\")))","v":3.5621601690541875}]
[null,"SLC07",2007,86.708435162138358,"N/A",null,null,4.7953734136089201,91.12655358477204,"N/A",null,null,5.8566499038326238,92.442485968698549,"N/A",null,null,4.0774634555233593,92.447039140985041,"N/A",null,null,4.3266000584004107,96.663688552218218,"N/A",null,null,0.74558647734314776]
[null,"MICS11",2011,92,96.2,null,null,2.6,96.1,96.8,null,null,0.6,99.9,100,null,null,0,96.8,98.6,null,null,0.3,99.1,99,null,null,0.2]
[null,null,null,"","",null,null,"","","",null,null,"","","",null,null,"","","",null,null,"","","",null,null,""]
[null,null,null,"","",null,null,"","","",null,null,"","","",null,null,"","","",null,null,"","","",null,null,""]
[null,null,null,"","",null,null,"","","",null,null,"","","",null,null,"","","",null,null,"","","",null,null,""]
[null,null,null,{"$f":"IF(ISERROR(INDIRECT(CONCATENATE($B111,\"!C16\"))),\"\",INDIRECT(CONCATENATE($B111,\"!C16\")))","v":""},{"$f":"IF(ISERROR(INDIRECT(CONCATENATE($B111,\"!C23\"))),\"\",INDIRECT(CONCATENATE($B111,\"!C23\")))","v":""},null,null,{"$f":"IF(ISERROR(INDIRECT(CONCATENATE($B111,\"!C21\"))),\"\",INDIRECT(CONCATENATE($B111,\"!C21\")))","v":""},{"$f":"IF(ISERROR(INDIRECT(CONCATENATE($B111,\"!D16\"))),\"\",INDIRECT(CONCATENATE($B111,\"!D16\")))","v":""},{"$f":"IF(ISERROR(INDIRECT(CONCATENATE($B111,\"!D23\"))),\"\",INDIRECT(CONCATENATE($B111,\"!D23\")))","v":""},null,null,{"$f":"IF(ISERROR(INDIRECT(CONCATENATE($B111,\"!D21\"))),\"\",INDIRECT(CONCATENATE($B111,\"!D21\")))","v":""},{"$f":"IF(ISERROR(INDIRECT(CONCATENATE($B111,\"!E16\"))),\"\",INDIRECT(CONCATENATE($B111,\"!E16\")))","v":""},{"$f":"IF(ISERROR(INDIRECT(CONCATENATE($B111,\"!E23\"))),\"\",INDIRECT(CONCATENATE($B111,\"!E23\")))","v":""},null,null,{"$f":"IF(ISERROR(INDIRECT(CONCATENATE($B111,\"!E21\"))),\"\",INDIRECT(CONCATENATE($B111,\"!E21\")))","v":""},{"$f":"IF(ISERROR(INDIRECT(CONCATENATE($B111,\"!F16\"))),\"\",INDIRECT(CONCATENATE($B111,\"!F16\")))","v":""},{"$f":"IF(ISERROR(INDIRECT(CONCATENATE($B111,\"!F23\"))),\"\",INDIRECT(CONCATENATE($B111,\"!F23\")))","v":""},null,null,{"$f":"IF(ISERROR(INDIRECT(CONCATENATE($B111,\"!F21\"))),\"\",INDIRECT(CONCATENATE($B111,\"!F21\")))","v":""},{"$f":"IF(ISERROR(INDIRECT(CONCATENATE($B111,\"!G16\"))),\"\",INDIRECT(CONCATENATE($B111,\"!G16\")))","v":""},{"$f":"IF(ISERROR(INDIRECT(CONCATENATE($B111,\"!G23\"))),\"\",INDIRECT(CONCATENATE($B111,\"!G23\")))","v":""},null,null,{"$f":"IF(ISERROR(INDIRECT(CONCATENATE($B111,\"!G221\"))),\"\",INDIRECT(CONCATENATE($B111,\"!G21\")))","v":""}]
[null,null,null,{"$f":"IF(ISERROR(INDIRECT(CONCATENATE($B112,\"!C16\"))),\"\",INDIRECT(CONCATENATE($B112,\"!C16\")))","v":""},{"$f":"IF(ISERROR(INDIRECT(CONCATENATE($B112,\"!C23\"))),\"\",INDIRECT(CONCATENATE($B112,\"!C23\")))","v":""},null,null,{"$f":"IF(ISERROR(INDIRECT(CONCATENATE($B112,\"!C21\"))),\"\",INDIRECT(CONCATENATE($B112,\"!C21\")))","v":""},{"$f":"IF(ISERROR(INDIRECT(CONCATENATE($B112,\"!D16\"))),\"\",INDIRECT(CONCATENATE($B112,\"!D16\")))","v":""},{"$f":"IF(ISERROR(INDIRECT(CONCATENATE($B112,\"!D23\"))),\"\",INDIRECT(CONCATENATE($B112,\"!D23\")))","v":""},null,null,{"$f":"IF(ISERROR(INDIRECT(CONCATENATE($B112,\"!D21\"))),\"\",INDIRECT(CONCATENATE($B112,\"!D21\")))","v":""},{"$f":"IF(ISERROR(INDIRECT(CONCATENATE($B112,\"!E16\"))),\"\",INDIRECT(CONCATENATE($B112,\"!E16\")))","v":""},{"$f":"IF(ISERROR(INDIRECT(CONCATENATE($B112,\"!E23\"))),\"\",INDIRECT(CONCATENATE($B112,\"!E23\")))","v":""},null,null,{"$f":"IF(ISERROR(INDIRECT(CONCATENATE($B112,\"!E21\"))),\"\",INDIRECT(CONCATENATE($B112,\"!E21\")))","v":""},{"$f":"IF(ISERROR(INDIRECT(CONCATENATE($B112,\"!F16\"))),\"\",INDIRECT(CONCATENATE($B112,\"!F16\")))","v":""},{"$f":"IF(ISERROR(INDIRECT(CONCATENATE($B112,\"!F23\"))),\"\",INDIRECT(CONCATENATE($B112,\"!F23\")))","v":""},null,null,{"$f":"IF(ISERROR(INDIRECT(CONCATENATE($B112,\"!F21\"))),\"\",INDIRECT(CONCATENATE($B112,\"!F21\")))","v":""},{"$f":"IF(ISERROR(INDIRECT(CONCATENATE($B112,\"!G16\"))),\"\",INDIRECT(CONCATENATE($B112,\"!G16\")))","v":""},{"$f":"IF(ISERROR(INDIRECT(CONCATENATE($B112,\"!G23\"))),\"\",INDIRECT(CONCATENATE($B112,\"!G23\")))","v":""},null,null,{"$f":"IF(ISERROR(INDIRECT(CONCATENATE($B112,\"!G221\"))),\"\",INDIRECT(CONCATENATE($B112,\"!G21\")))","v":""}]
[null,null,null,"","",null,null,"","","",null,null,"","","",null,null,"","","",null,null,"","","",null,null,""]
[null,null,null,"","",null,null,"","","",null,null,"","","",null,null,"","","",null,null,"","","",null,null,""]
[null,null,null,"","",null,null,"","","",null,null,"","","",null,null,"","","",null,null,"","","",null,null,""]
[null,null,null,"","",null,null,"","","",null,null,"","","",null,null,"","","",null,null,"","","",null,null,""]
[]
[null,{"$f":"CONCATENATE(\"National use of drinking water sources, \",C99,\"–\",C100)","v":"National use of drinking water sources, 2000–2017"},null,null,null,null,null,null,null,null,null,null,null,null,null,null,null,null,"Data points used for regression"]
[]
[]
[]
[]
[]
[]
[]
[]
[]
[]
[]
[]
[]
[]
[]
[]
[]
[]
[]
[]
[]
[]
[]
[]
[]
[]
[]
[]
[]
[]
[]
[]
[]
[]
[null,null,null,null,{"$f":"IF(ISERROR(INDIRECT(CONCATENATE($B153,\"!M18\"))),\"\",INDIRECT(CONCATENATE($B153,\"!M18\")))","v":""},{"$f":"IF(ISERROR(INDIRECT(CONCATENATE($B153,\"!M19\"))),\"\",INDIRECT(CONCATENATE($B153,\"!M19\")))","v":""},{"$f":"IF(ISERROR(INDIRECT(CONCATENATE($B153,\"!M20\"))),\"\",INDIRECT(CONCATENATE($B153,\"!M20\")))","v":""},{"$f":"IF(ISERROR(INDIRECT(CONCATENATE($B153,\"!M21\"))),\"\",INDIRECT(CONCATENATE($B153,\"!M21\")))","v":""},null,{"$f":"IF(ISERROR(INDIRECT(CONCATENATE($B153,\"!N18\"))),\"\",INDIRECT(CONCATENATE($B153,\"!N18\")))","v":""},{"$f":"IF(ISERROR(INDIRECT(CONCATENATE($B153,\"!N19\"))),\"\",INDIRECT(CONCATENATE($B153,\"!N19\")))","v":""},{"$f":"IF(ISERROR(INDIRECT(CONCATENATE($B153,\"!N20\"))),\"\",INDIRECT(CONCATENATE($B153,\"!N20\")))","v":""},{"$f":"IF(ISERROR(INDIRECT(CONCATENATE($B153,\"!N21\"))),\"\",INDIRECT(CONCATENATE($B153,\"!N21\")))","v":""},null,{"$f":"IF(ISERROR(INDIRECT(CONCATENATE($B153,\"!O18\"))),\"\",INDIRECT(CONCATENATE($B153,\"!O18\")))","v":""},{"$f":"IF(ISERROR(INDIRECT(CONCATENATE($B153,\"!O19\"))),\"\",INDIRECT(CONCATENATE($B153,\"!O19\")))","v":""},{"$f":"IF(ISERROR(INDIRECT(CONCATENATE($B153,\"!O20\"))),\"\",INDIRECT(CONCATENATE($B153,\"!O20\")))","v":""},{"$f":"IF(ISERROR(INDIRECT(CONCATENATE($B153,\"!O21\"))),\"\",INDIRECT(CONCATENATE($B153,\"!O21\")))","v":""},null,{"$f":"IF(ISERROR(INDIRECT(CONCATENATE($B153,\"!P18\"))),\"\",INDIRECT(CONCATENATE($B153,\"!P18\")))","v":""},{"$f":"IF(ISERROR(INDIRECT(CONCATENATE($B153,\"!P19\"))),\"\",INDIRECT(CONCATENATE($B153,\"!P19\")))","v":""},{"$f":"IF(ISERROR(INDIRECT(CONCATENATE($B153,\"!P20\"))),\"\",INDIRECT(CONCATENATE($B153,\"!P20\")))","v":""},{"$f":"IF(ISERROR(INDIRECT(CONCATENATE($B153,\"!P21\"))),\"\",INDIRECT(CONCATENATE($B153,\"!P21\")))","v":""},null,{"$f":"IF(ISERROR(INDIRECT(CONCATENATE($B153,\"!Q18\"))),\"\",INDIRECT(CONCATENATE($B153,\"!Q18\")))","v":""},{"$f":"IF(ISERROR(INDIRECT(CONCATENATE($B153,\"!Q19\"))),\"\",INDIRECT(CONCATENATE($B153,\"!Q19\")))","v":""},{"$f":"IF(ISERROR(INDIRECT(CONCATENATE($B153,\"!Q20\"))),\"\",INDIRECT(CONCATENATE($B153,\"!Q20\")))","v":""},{"$f":"IF(ISERROR(INDIRECT(CONCATENATE($B153,\"!Q21\"))),\"\",INDIRECT(CONCATENATE($B153,\"!Q1\")))","v":""}]
[null,null,null,null,"","","","",null,"","","","",null,"","","","",null,"","","","",null,"","","",""]
[null,null,null,null,"","","","",null,"","","","",null,"","","","",null,"","","","",null,"","","",""]
[null,null,null,null,"","","","",null,"","","","",null,"","","","",null,"","","","",null,"","","",""]
[null,null,null,null,"","","","",null,"","","","",null,"","","","",null,"","","","",null,"","","",""]
[null,null,null,null,"","","","",null,"","","","",null,"","","","",null,"","","","",null,"","","",""]
[]
[]
[]
[]
[]
[]
[]
[]
[]
[]
[]
[]
[]
[]
[]
[]
[]
[]
[]
[]
[]
[]
[]
[]
[]
[]
[]
[]
[]
[]
[]
[]
[]
[]
[]
[]
[]
[]
["URBAN",null,null,"Poorest",null,null,null,null,"Poor",null,null,null,null,"Middle",null,null,null,null,"Rich",null,null,null,null,"Richest"]
[null,null,null,"Improved","Basic","Limited","Unimproved","Surface water","Improved","Basic","Limited","Unimproved","Surface water","Improved","Basic","Limited","Unimproved","Surface water","Improved","Basic","Limited","Unimproved","Surface water","Improved","Basic","Limited","Unimproved","Surface water"]
["Forecast period:",null,2000,{"$f":"IF((D201+H201)>100,D201*100/(D201+H201),D201)","v":95.17261050705703},{"$f":"D199*AVERAGEIF(E205:E216,\">0\")/100","v":94.220884401986453},{"$f":"D199*(100-AVERAGEIF(E205:E216,\">0\"))/100","v":0.95172610507057032},{"$f":"100-(E199+F199+H199)","v":4.6939141286188857},{"$f":"IF((D201+H201)>100,H201*100/(D201+H201),H201)","v":0.13347536432408447},{"$f":"IF((I201+M201)>100,I201*100/(I201+M201),I201)","v":98.254169417053603},{"$f":"I199*AVERAGEIF(J205:J216,\">0\")/100","v":98.057661078219496},{"$f":"I199*(100-AVERAGEIF(J205:J216,\">0\"))/100","v":0.19650833883411001},{"$f":"100-(J199+K199+M199)","v":1.213854003218529},{"$f":"IF((I201+M201)>100,M201*100/(I201+M201),M201)","v":0.53197657972786772},{"$f":"IF((N201+R201)>100,N201*100/(N201+R201),N201)","v":98.399423419744139},{"$f":"N199*AVERAGEIF(O205:O216,\">0\")/100","v":97.513828608966435},{"$f":"N199*(100-AVERAGEIF(O205:O216,\">0\"))/100","v":0.88559481077770286},{"$f":"100-(O199+P199+R199)","v":1.6005765802558614},{"$f":"IF((N201+R201)>100,R201*100/(N201+R201),R201)","v":0},{"$f":"IF((S201+W201)>100,S201*100/(S201+W201),S201)","v":97.58890235311128},{"$f":"S199*AVERAGEIF(T205:T216,\">0\")/100","v":96.61301332958017},{"$f":"S199*(100-AVERAGEIF(T205:T216,\">0\"))/100","v":0.97588902353111284},{"$f":"100-(T199+U199+W199)","v":2.309673241198297},{"$f":"IF((S201+W201)>100,W201*100/(S201+W201),W201)","v":0.10142440569042321},{"$f":"IF((X201+AB201)>100,X201*100/(X201+AB201),X201)","v":98.605157426231003},{"$f":"X199*AVERAGEIF(Y205:Y216,\">0\")/100","v":98.605157426231003},{"$f":"X199*(100-AVERAGEIF(Y205:Y216,\">0\"))/100","v":0},{"$f":"100-(Y199+Z199+AB199)","v":1.3948425737689973},{"$f":"IF((X201+AB201)>100,AB201*100/(X201+AB201),AB201)","v":0}]
[null,null,2017,{"$f":"IF((D202+H202)>100,D202*100/(D202+H202),D202)","v":95.664839723982226},{"$f":"D200*AVERAGEIF(E205:E216,\">0\")/100","v":94.708191326742394},{"$f":"D200*(100-AVERAGEIF(E205:E216,\">0\"))/100","v":0.95664839723982231},{"$f":"100-(E200+F200+H200)","v":4.0609946628115665},{"$f":"IF((D202+H202)>100,H202*100/(D202+H202),H202)","v":0.27416561320622534},{"$f":"IF((I202+M202)>100,I202*100/(I202+M202),I202)","v":99.462970241576969},{"$f":"I200*AVERAGEIF(J205:J216,\">0\")/100","v":99.264044301093818},{"$f":"I200*(100-AVERAGEIF(J205:J216,\">0\"))/100","v":0.19892594048315676},{"$f":"100-(J200+K200+M200)","v":0.53702975842303147},{"$f":"IF((I202+M202)>100,M202*100/(I202+M202),M202)","v":0},{"$f":"IF((N202+R202)>100,N202*100/(N202+R202),N202)","v":98.46866090477053},{"$f":"N200*AVERAGEIF(O205:O216,\">0\")/100","v":97.582442956627588},{"$f":"N200*(100-AVERAGEIF(O205:O216,\">0\"))/100","v":0.8862179481429403},{"$f":"100-(O200+P200+R200)","v":1.5313390952294696},{"$f":"IF((N202+R202)>100,R202*100/(N202+R202),R202)","v":0},{"$f":"IF((S202+W202)>100,S202*100/(S202+W202),S202)","v":99.792101904932096},{"$f":"S200*AVERAGEIF(T205:T216,\">0\")/100","v":98.794180885882781},{"$f":"S200*(100-AVERAGEIF(T205:T216,\">0\"))/100","v":0.99792101904932096},{"$f":"100-(T200+U200+W200)","v":0},{"$f":"IF((S202+W202)>100,W202*100/(S202+W202),W202)","v":0.20789809506790291},{"$f":"IF((X202+AB202)>100,X202*100/(X202+AB202),X202)","v":97.823029975869289},{"$f":"X200*AVERAGEIF(Y205:Y216,\">0\")/100","v":97.823029975869289},{"$f":"X200*(100-AVERAGEIF(Y205:Y216,\">0\"))/100","v":0},{"$f":"100-(Y200+Z200+AB200)","v":2.1769700241307106},{"$f":"IF((X202+AB202)>100,AB202*100/(X202+AB202),AB202)","v":0}]
["Regression period:",null,{"$f":"MinRegYear(C199,C205:C216)","v":2000},{"$f":"IF(MAX(C205:C216)-MIN(C205:C216)<5,AVERAGEIF(C205:C216,\">0\",D205:D216),\nIF(FORECAST($C201,D$205:D$216,$C$205:$C$216)<0,0,\nIF(FORECAST($C201,D$205:D$216,$C$205:$C$216)>100,100,\nFORECAST($C201,D$205:D$216,$C$205:$C$216))))","v":95.17261050705703},null,null,null,{"$f":"IF(MAX(C205:C216)-MIN(C205:C216)<5,AVERAGEIF(C205:C216,\">0\",H205:H216),\nIF(FORECAST($C201,H$205:H$216,$C$205:$C$216)<0,0,\nIF(FORECAST($C201,H$205:H$216,$C$205:$C$216)>100,100,\nFORECAST($C201,H$205:H$216,$C$205:$C$216))))","v":0.13347536432408447},{"$f":"IF(MAX(C205:C216)-MIN(C205:C216)<5,AVERAGEIF(C205:C216,\">0\",I205:I216),\nIF(FORECAST($C201,I$205:I$216,$C$205:$C$216)<0,0,\nIF(FORECAST($C201,I$205:I$216,$C$205:$C$216)>100,100,\nFORECAST($C201,I$205:I$216,$C$205:$C$216))))","v":98.254169417053603},null,null,null,{"$f":"IF(MAX(C205:C216)-MIN(C205:C216)<5,AVERAGEIF(C205:C216,\">0\",M205:M216),\nIF(FORECAST($C201,M$205:M$216,$C$205:$C$216)<0,0,\nIF(FORECAST($C201,M$205:M$216,$C$205:$C$216)>100,100,\nFORECAST($C201,M$205:M$216,$C$205:$C$216))))","v":0.53197657972786772},{"$f":"IF(MAX(C205:C216)-MIN(C205:C216)<5,AVERAGEIF(C205:C216,\">0\",N205:N216),\nIF(FORECAST($C201,N$205:N$216,$C$205:$C$216)<0,0,\nIF(FORECAST($C201,N$205:N$216,$C$205:$C$216)>100,100,\nFORECAST($C201,N$205:N$216,$C$205:$C$216))))","v":98.399423419744139},null,null,null,{"$f":"IF(MAX(C205:C216)-MIN(C205:C216)<5,AVERAGEIF(C205:C216,\">0\",R205:R216),\nIF(FORECAST($C201,R$205:R$216,$C$205:$C$216)<0,0,\nIF(FORECAST($C201,R$205:R$216,$C$205:$C$216)>100,100,\nFORECAST($C201,R$205:R$216,$C$205:$C$216))))","v":0},{"$f":"IF(MAX(C205:C216)-MIN(C205:C216)<5,AVERAGEIF(C205:C216,\">0\",S205:S216),\nIF(FORECAST($C201,S$205:S$216,$C$205:$C$216)<0,0,\nIF(FORECAST($C201,S$205:S$216,$C$205:$C$216)>100,100,\nFORECAST($C201,S$205:S$216,$C$205:$C$216))))","v":97.58890235311128},null,null,null,{"$f":"IF(MAX(C205:C216)-MIN(C205:C216)<5,AVERAGEIF(C205:C216,\">0\",W205:W216),\nIF(FORECAST($C201,W$205:W$216,$C$205:$C$216)<0,0,\nIF(FORECAST($C201,W$205:W$216,$C$205:$C$216)>100,100,\nFORECAST($C201,W$205:W$216,$C$205:$C$216))))","v":0.10142440569042321},{"$f":"IF(MAX(C205:C216)-MIN(C205:C216)<5,AVERAGEIF(C205:C216,\">0\",X205:X216),\nIF(FORECAST($C201,X$205:X$216,$C$205:$C$216)<0,0,\nIF(FORECAST($C201,X$205:X$216,$C$205:$C$216)>100,100,\nFORECAST($C201,X$205:X$216,$C$205:$C$216))))","v":98.605157426231003},null,null,null,{"$f":"IF(MAX(C205:C216)-MIN(C205:C216)<5,AVERAGEIF(C205:C216,\">0\",AB205:AB216),\nIF(FORECAST($C201,AB$205:AB$216,$C$205:$C$216)<0,0,\nIF(FORECAST($C201,AB$205:AB$216,$C$205:$C$216)>100,100,\nFORECAST($C201,AB$205:AB$216,$C$205:$C$216))))","v":0}]
[null,null,{"$f":"MaxRegYear(C200,C205:C216)","v":2013},{"$f":"IF(MAX(C205:C216)-MIN(C205:C216)<5,AVERAGEIF(C205:C216,\">0\",D205:D216),\nIF(FORECAST($C202,D$205:D$216,$C$205:$C$216)<0,0,\nIF(FORECAST($C202,D$205:D$216,$C$205:$C$216)>100,100,\nFORECAST($C202,D$205:D$216,$C$205:$C$216))))","v":95.664839723982226},null,null,null,{"$f":"IF(MAX(C205:C216)-MIN(C205:C216)<5,AVERAGEIF(C205:C216,\">0\",H205:H216),\nIF(FORECAST($C202,H$205:H$216,$C$205:$C$216)<0,0,\nIF(FORECAST($C202,H$205:H$216,$C$205:$C$216)>100,100,\nFORECAST($C202,H$205:H$216,$C$205:$C$216))))","v":0.27416561320622534},{"$f":"IF(MAX(C205:C216)-MIN(C205:C216)<5,AVERAGEIF(C205:C216,\">0\",I205:I216),\nIF(FORECAST($C202,I$205:I$216,$C$205:$C$216)<0,0,\nIF(FORECAST($C202,I$205:I$216,$C$205:$C$216)>100,100,\nFORECAST($C202,I$205:I$216,$C$205:$C$216))))","v":99.462970241576969},null,null,null,{"$f":"IF(MAX(C205:C216)-MIN(C205:C216)<5,AVERAGEIF(C205:C216,\">0\",M205:M216),\nIF(FORECAST($C202,M$205:M$216,$C$205:$C$216)<0,0,\nIF(FORECAST($C202,M$205:M$216,$C$205:$C$216)>100,100,\nFORECAST($C202,M$205:M$216,$C$205:$C$216))))","v":0},{"$f":"IF(MAX(C205:C216)-MIN(C205:C216)<5,AVERAGEIF(C205:C216,\">0\",N205:N216),\nIF(FORECAST($C202,N$205:N$216,$C$205:$C$216)<0,0,\nIF(FORECAST($C202,N$205:N$216,$C$205:$C$216)>100,100,\nFORECAST($C202,N$205:N$216,$C$205:$C$216))))","v":98.46866090477053},null,null,null,{"$f":"IF(MAX(C205:C216)-MIN(C205:C216)<5,AVERAGEIF(C205:C216,\">0\",R205:R216),\nIF(FORECAST($C202,R$205:R$216,$C$205:$C$216)<0,0,\nIF(FORECAST($C202,R$205:R$216,$C$205:$C$216)>100,100,\nFORECAST($C202,R$205:R$216,$C$205:$C$216))))","v":0},{"$f":"IF(MAX(C205:C216)-MIN(C205:C216)<5,AVERAGEIF(C205:C216,\">0\",S205:S216),\nIF(FORECAST($C202,S$205:S$216,$C$205:$C$216)<0,0,\nIF(FORECAST($C202,S$205:S$216,$C$205:$C$216)>100,100,\nFORECAST($C202,S$205:S$216,$C$205:$C$216))))","v":100},null,null,null,{"$f":"IF(MAX(C205:C216)-MIN(C205:C216)<5,AVERAGEIF(C205:C216,\">0\",W205:W216),\nIF(FORECAST($C202,W$205:W$216,$C$205:$C$216)<0,0,\nIF(FORECAST($C202,W$205:W$216,$C$205:$C$216)>100,100,\nFORECAST($C202,W$205:W$216,$C$205:$C$216))))","v":0.20833121168843505},{"$f":"IF(MAX(C205:C216)-MIN(C205:C216)<5,AVERAGEIF(C205:C216,\">0\",X205:X216),\nIF(FORECAST($C202,X$205:X$216,$C$205:$C$216)<0,0,\nIF(FORECAST($C202,X$205:X$216,$C$205:$C$216)>100,100,\nFORECAST($C202,X$205:X$216,$C$205:$C$216))))","v":97.823029975869289},null,null,null,{"$f":"IF(MAX(C205:C216)-MIN(C205:C216)<5,AVERAGEIF(C205:C216,\">0\",AB205:AB216),\nIF(FORECAST($C202,AB$205:AB$216,$C$205:$C$216)<0,0,\nIF(FORECAST($C202,AB$205:AB$216,$C$205:$C$216)>100,100,\nFORECAST($C202,AB$205:AB$216,$C$205:$C$216))))","v":0}]
[]
[null,"Survey","Year","Improved","Basic",null,null,"Surface water","Improved","Basic",null,null,"Surface water","Improved","Basic",null,null,"Surface water","Improved","Basic",null,null,"Surface water","Improved","Basic",null,null,"Surface water"]
[null,"SLC97",1997,{"$f":"IF(ISERROR(INDIRECT(CONCATENATE($B205,\"!H16\"))),\"\",INDIRECT(CONCATENATE($B205,\"!H16\")))","v":96.303374288446037},{"$f":"IF(ISERROR(INDIRECT(CONCATENATE($B205,\"!H23\"))),\"\",INDIRECT(CONCATENATE($B205,\"!H23\")))","v":"N/A"},null,null,{"$f":"IF(ISERROR(INDIRECT(CONCATENATE($B205,\"!H21\"))),\"\",INDIRECT(CONCATENATE($B205,\"!H21\")))","v":0},{"$f":"IF(ISERROR(INDIRECT(CONCATENATE($B205,\"!I16\"))),\"\",INDIRECT(CONCATENATE($B205,\"!I16\")))","v":98.144415027041944},{"$f":"IF(ISERROR(INDIRECT(CONCATENATE($B205,\"!I23\"))),\"\",INDIRECT(CONCATENATE($B205,\"!I23\")))","v":"N/A"},null,null,{"$f":"IF(ISERROR(INDIRECT(CONCATENATE($B205,\"!I21\"))),\"\",INDIRECT(CONCATENATE($B205,\"!I21\")))","v":0.74096737890667297},{"$f":"IF(ISERROR(INDIRECT(CONCATENATE($B205,\"!J16\"))),\"\",INDIRECT(CONCATENATE($B205,\"!J16\")))","v":99.000241944985305},{"$f":"IF(ISERROR(INDIRECT(CONCATENATE($B205,\"!J23\"))),\"\",INDIRECT(CONCATENATE($B205,\"!J23\")))","v":"N/A"},null,null,{"$f":"IF(ISERROR(INDIRECT(CONCATENATE($B205,\"!J21\"))),\"\",INDIRECT(CONCATENATE($B205,\"!J21\")))","v":0},{"$f":"IF(ISERROR(INDIRECT(CONCATENATE($B205,\"!K16\"))),\"\",INDIRECT(CONCATENATE($B205,\"!K16\")))","v":96.782955128330897},{"$f":"IF(ISERROR(INDIRECT(CONCATENATE($B205,\"!K23\"))),\"\",INDIRECT(CONCATENATE($B205,\"!K23\")))","v":"N/A"},null,null,{"$f":"IF(ISERROR(INDIRECT(CONCATENATE($B205,\"!K21\"))),\"\",INDIRECT(CONCATENATE($B205,\"!K21\")))","v":0},{"$f":"IF(ISERROR(INDIRECT(CONCATENATE($B205,\"!L16\"))),\"\",INDIRECT(CONCATENATE($B205,\"!L16\")))","v":99.328305465944496},{"$f":"IF(ISERROR(INDIRECT(CONCATENATE($B205,\"!L23\"))),\"\",INDIRECT(CONCATENATE($B205,\"!L23\")))","v":"N/A"},null,null,{"$f":"IF(ISERROR(INDIRECT(CONCATENATE($B205,\"!L221\"))),\"\",INDIRECT(CONCATENATE($B205,\"!L21\")))","v":0}]
[null,"SLC07",2007,91.08241402148488,"N/A",null,null,0.5627609955285634,98.312863406261201,"N/A",null,null,0,96.277917720046773,"N/A",null,null,0,99.572372776007953,"N/A",null,null,0.42762722399205144,96.284712062331153,"N/A",null,null,0]
[null,"MICS11",2011,98.7,99,null,null,0,99.7,99.8,null,null,0,100,99.1,null,null,0,100,99,null,null,0,99.3,100,null,null,0]
[null,null,null,"","",null,null,"","","",null,null,"","","",null,null,"","","",null,null,"","","",null,null,""]
[null,null,null,"","",null,null,"","","",null,null,"","","",null,null,"","","",null,null,"","","",null,null,""]
[null,null,null,"","",null,null,"","","",null,null,"","","",null,null,"","","",null,null,"","","",null,null,""]
[null,null,null,"","",null,null,"","","",null,null,"","","",null,null,"","","",null,null,"","","",null,null,""]
[null,null,null,"","",null,null,"","","",null,null,"","","",null,null,"","","",null,null,"","","",null,null,""]
[null,null,null,"","",null,null,"","","",null,null,"","","",null,null,"","","",null,null,"","","",null,null,""]
[null,null,null,"","",null,null,"","","",null,null,"","","",null,null,"","","",null,null,"","","",null,null,""]
[null,null,null,"","",null,null,"","","",null,null,"","","",null,null,"","","",null,null,"","","",null,null,""]
[null,null,null,"","",null,null,"","","",null,null,"","","",null,null,"","","",null,null,"","","",null,null,""]
[]
[null,{"$f":"CONCATENATE(\"Urban use of drinking water sources,  \",C199,\"–\",C200)","v":"Urban use of drinking water sources,  2000–2017"},null,null,null,null,null,null,null,null,null,null,null,null,null,null,null,null,"Data points used for regression"]
[]
[]
[]
[]
[]
[]
[]
[]
[]
[]
[]
[]
[]
[]
[]
[]
[]
[]
[]
[]
[]
[]
[]
[]
[]
[]
[]
[]
[]
[]
[]
[]
[]
[]
[null,null,null,null,{"$f":"IF(ISERROR(INDIRECT(CONCATENATE($B253,\"!M18\"))),\"\",INDIRECT(CONCATENATE($B253,\"!M18\")))","v":""},{"$f":"IF(ISERROR(INDIRECT(CONCATENATE($B253,\"!M19\"))),\"\",INDIRECT(CONCATENATE($B253,\"!M19\")))","v":""},{"$f":"IF(ISERROR(INDIRECT(CONCATENATE($B253,\"!M20\"))),\"\",INDIRECT(CONCATENATE($B253,\"!M20\")))","v":""},{"$f":"IF(ISERROR(INDIRECT(CONCATENATE($B253,\"!M21\"))),\"\",INDIRECT(CONCATENATE($B253,\"!M21\")))","v":""},null,{"$f":"IF(ISERROR(INDIRECT(CONCATENATE($B253,\"!N18\"))),\"\",INDIRECT(CONCATENATE($B253,\"!N18\")))","v":""},{"$f":"IF(ISERROR(INDIRECT(CONCATENATE($B253,\"!N19\"))),\"\",INDIRECT(CONCATENATE($B253,\"!N19\")))","v":""},{"$f":"IF(ISERROR(INDIRECT(CONCATENATE($B253,\"!N20\"))),\"\",INDIRECT(CONCATENATE($B253,\"!N20\")))","v":""},{"$f":"IF(ISERROR(INDIRECT(CONCATENATE($B253,\"!N21\"))),\"\",INDIRECT(CONCATENATE($B253,\"!N21\")))","v":""},null,{"$f":"IF(ISERROR(INDIRECT(CONCATENATE($B253,\"!O18\"))),\"\",INDIRECT(CONCATENATE($B253,\"!O18\")))","v":""},{"$f":"IF(ISERROR(INDIRECT(CONCATENATE($B253,\"!O19\"))),\"\",INDIRECT(CONCATENATE($B253,\"!O19\")))","v":""},{"$f":"IF(ISERROR(INDIRECT(CONCATENATE($B253,\"!O20\"))),\"\",INDIRECT(CONCATENATE($B253,\"!O20\")))","v":""},{"$f":"IF(ISERROR(INDIRECT(CONCATENATE($B253,\"!O21\"))),\"\",INDIRECT(CONCATENATE($B253,\"!O21\")))","v":""},null,{"$f":"IF(ISERROR(INDIRECT(CONCATENATE($B253,\"!P18\"))),\"\",INDIRECT(CONCATENATE($B253,\"!P18\")))","v":""},{"$f":"IF(ISERROR(INDIRECT(CONCATENATE($B253,\"!P19\"))),\"\",INDIRECT(CONCATENATE($B253,\"!P19\")))","v":""},{"$f":"IF(ISERROR(INDIRECT(CONCATENATE($B253,\"!P20\"))),\"\",INDIRECT(CONCATENATE($B253,\"!P20\")))","v":""},{"$f":"IF(ISERROR(INDIRECT(CONCATENATE($B253,\"!P21\"))),\"\",INDIRECT(CONCATENATE($B253,\"!P21\")))","v":""},null,{"$f":"IF(ISERROR(INDIRECT(CONCATENATE($B253,\"!Q18\"))),\"\",INDIRECT(CONCATENATE($B253,\"!Q18\")))","v":""},{"$f":"IF(ISERROR(INDIRECT(CONCATENATE($B253,\"!Q19\"))),\"\",INDIRECT(CONCATENATE($B253,\"!Q19\")))","v":""},{"$f":"IF(ISERROR(INDIRECT(CONCATENATE($B253,\"!Q20\"))),\"\",INDIRECT(CONCATENATE($B253,\"!Q20\")))","v":""},{"$f":"IF(ISERROR(INDIRECT(CONCATENATE($B253,\"!Q21\"))),\"\",INDIRECT(CONCATENATE($B253,\"!Q1\")))","v":""}]
[null,null,null,null,{"$f":"IF(ISERROR(INDIRECT(CONCATENATE($B254,\"!M18\"))),\"\",INDIRECT(CONCATENATE($B254,\"!M18\")))","v":""},{"$f":"IF(ISERROR(INDIRECT(CONCATENATE($B254,\"!M19\"))),\"\",INDIRECT(CONCATENATE($B254,\"!M19\")))","v":""},{"$f":"IF(ISERROR(INDIRECT(CONCATENATE($B254,\"!M20\"))),\"\",INDIRECT(CONCATENATE($B254,\"!M20\")))","v":""},{"$f":"IF(ISERROR(INDIRECT(CONCATENATE($B254,\"!M21\"))),\"\",INDIRECT(CONCATENATE($B254,\"!M21\")))","v":""},null,{"$f":"IF(ISERROR(INDIRECT(CONCATENATE($B254,\"!N18\"))),\"\",INDIRECT(CONCATENATE($B254,\"!N18\")))","v":""},{"$f":"IF(ISERROR(INDIRECT(CONCATENATE($B254,\"!N19\"))),\"\",INDIRECT(CONCATENATE($B254,\"!N19\")))","v":""},{"$f":"IF(ISERROR(INDIRECT(CONCATENATE($B254,\"!N20\"))),\"\",INDIRECT(CONCATENATE($B254,\"!N20\")))","v":""},{"$f":"IF(ISERROR(INDIRECT(CONCATENATE($B254,\"!N21\"))),\"\",INDIRECT(CONCATENATE($B254,\"!N21\")))","v":""},null,{"$f":"IF(ISERROR(INDIRECT(CONCATENATE($B254,\"!O18\"))),\"\",INDIRECT(CONCATENATE($B254,\"!O18\")))","v":""},{"$f":"IF(ISERROR(INDIRECT(CONCATENATE($B254,\"!O19\"))),\"\",INDIRECT(CONCATENATE($B254,\"!O19\")))","v":""},{"$f":"IF(ISERROR(INDIRECT(CONCATENATE($B254,\"!O20\"))),\"\",INDIRECT(CONCATENATE($B254,\"!O20\")))","v":""},{"$f":"IF(ISERROR(INDIRECT(CONCATENATE($B254,\"!O21\"))),\"\",INDIRECT(CONCATENATE($B254,\"!O21\")))","v":""},null,{"$f":"IF(ISERROR(INDIRECT(CONCATENATE($B254,\"!P18\"))),\"\",INDIRECT(CONCATENATE($B254,\"!P18\")))","v":""},{"$f":"IF(ISERROR(INDIRECT(CONCATENATE($B254,\"!P19\"))),\"\",INDIRECT(CONCATENATE($B254,\"!P19\")))","v":""},{"$f":"IF(ISERROR(INDIRECT(CONCATENATE($B254,\"!P20\"))),\"\",INDIRECT(CONCATENATE($B254,\"!P20\")))","v":""},{"$f":"IF(ISERROR(INDIRECT(CONCATENATE($B254,\"!P21\"))),\"\",INDIRECT(CONCATENATE($B254,\"!P21\")))","v":""},null,{"$f":"IF(ISERROR(INDIRECT(CONCATENATE($B254,\"!Q18\"))),\"\",INDIRECT(CONCATENATE($B254,\"!Q18\")))","v":""},{"$f":"IF(ISERROR(INDIRECT(CONCATENATE($B254,\"!Q19\"))),\"\",INDIRECT(CONCATENATE($B254,\"!Q19\")))","v":""},{"$f":"IF(ISERROR(INDIRECT(CONCATENATE($B254,\"!Q20\"))),\"\",INDIRECT(CONCATENATE($B254,\"!Q20\")))","v":""},{"$f":"IF(ISERROR(INDIRECT(CONCATENATE($B254,\"!Q21\"))),\"\",INDIRECT(CONCATENATE($B254,\"!Q1\")))","v":""}]
[null,null,null,null,{"$f":"IF(ISERROR(INDIRECT(CONCATENATE($B255,\"!M18\"))),\"\",INDIRECT(CONCATENATE($B255,\"!M18\")))","v":""},{"$f":"IF(ISERROR(INDIRECT(CONCATENATE($B255,\"!M19\"))),\"\",INDIRECT(CONCATENATE($B255,\"!M19\")))","v":""},{"$f":"IF(ISERROR(INDIRECT(CONCATENATE($B255,\"!M20\"))),\"\",INDIRECT(CONCATENATE($B255,\"!M20\")))","v":""},{"$f":"IF(ISERROR(INDIRECT(CONCATENATE($B255,\"!M21\"))),\"\",INDIRECT(CONCATENATE($B255,\"!M21\")))","v":""},null,{"$f":"IF(ISERROR(INDIRECT(CONCATENATE($B255,\"!N18\"))),\"\",INDIRECT(CONCATENATE($B255,\"!N18\")))","v":""},{"$f":"IF(ISERROR(INDIRECT(CONCATENATE($B255,\"!N19\"))),\"\",INDIRECT(CONCATENATE($B255,\"!N19\")))","v":""},{"$f":"IF(ISERROR(INDIRECT(CONCATENATE($B255,\"!N20\"))),\"\",INDIRECT(CONCATENATE($B255,\"!N20\")))","v":""},{"$f":"IF(ISERROR(INDIRECT(CONCATENATE($B255,\"!N21\"))),\"\",INDIRECT(CONCATENATE($B255,\"!N21\")))","v":""},null,{"$f":"IF(ISERROR(INDIRECT(CONCATENATE($B255,\"!O18\"))),\"\",INDIRECT(CONCATENATE($B255,\"!O18\")))","v":""},{"$f":"IF(ISERROR(INDIRECT(CONCATENATE($B255,\"!O19\"))),\"\",INDIRECT(CONCATENATE($B255,\"!O19\")))","v":""},{"$f":"IF(ISERROR(INDIRECT(CONCATENATE($B255,\"!O20\"))),\"\",INDIRECT(CONCATENATE($B255,\"!O20\")))","v":""},{"$f":"IF(ISERROR(INDIRECT(CONCATENATE($B255,\"!O21\"))),\"\",INDIRECT(CONCATENATE($B255,\"!O21\")))","v":""},null,{"$f":"IF(ISERROR(INDIRECT(CONCATENATE($B255,\"!P18\"))),\"\",INDIRECT(CONCATENATE($B255,\"!P18\")))","v":""},{"$f":"IF(ISERROR(INDIRECT(CONCATENATE($B255,\"!P19\"))),\"\",INDIRECT(CONCATENATE($B255,\"!P19\")))","v":""},{"$f":"IF(ISERROR(INDIRECT(CONCATENATE($B255,\"!P20\"))),\"\",INDIRECT(CONCATENATE($B255,\"!P20\")))","v":""},{"$f":"IF(ISERROR(INDIRECT(CONCATENATE($B255,\"!P21\"))),\"\",INDIRECT(CONCATENATE($B255,\"!P21\")))","v":""},null,{"$f":"IF(ISERROR(INDIRECT(CONCATENATE($B255,\"!Q18\"))),\"\",INDIRECT(CONCATENATE($B255,\"!Q18\")))","v":""},{"$f":"IF(ISERROR(INDIRECT(CONCATENATE($B255,\"!Q19\"))),\"\",INDIRECT(CONCATENATE($B255,\"!Q19\")))","v":""},{"$f":"IF(ISERROR(INDIRECT(CONCATENATE($B255,\"!Q20\"))),\"\",INDIRECT(CONCATENATE($B255,\"!Q20\")))","v":""},{"$f":"IF(ISERROR(INDIRECT(CONCATENATE($B255,\"!Q21\"))),\"\",INDIRECT(CONCATENATE($B255,\"!Q1\")))","v":""}]
[null,null,null,null,{"$f":"IF(ISERROR(INDIRECT(CONCATENATE($B256,\"!M18\"))),\"\",INDIRECT(CONCATENATE($B256,\"!M18\")))","v":""},{"$f":"IF(ISERROR(INDIRECT(CONCATENATE($B256,\"!M19\"))),\"\",INDIRECT(CONCATENATE($B256,\"!M19\")))","v":""},{"$f":"IF(ISERROR(INDIRECT(CONCATENATE($B256,\"!M20\"))),\"\",INDIRECT(CONCATENATE($B256,\"!M20\")))","v":""},{"$f":"IF(ISERROR(INDIRECT(CONCATENATE($B256,\"!M21\"))),\"\",INDIRECT(CONCATENATE($B256,\"!M21\")))","v":""},null,{"$f":"IF(ISERROR(INDIRECT(CONCATENATE($B256,\"!N18\"))),\"\",INDIRECT(CONCATENATE($B256,\"!N18\")))","v":""},{"$f":"IF(ISERROR(INDIRECT(CONCATENATE($B256,\"!N19\"))),\"\",INDIRECT(CONCATENATE($B256,\"!N19\")))","v":""},{"$f":"IF(ISERROR(INDIRECT(CONCATENATE($B256,\"!N20\"))),\"\",INDIRECT(CONCATENATE($B256,\"!N20\")))","v":""},{"$f":"IF(ISERROR(INDIRECT(CONCATENATE($B256,\"!N21\"))),\"\",INDIRECT(CONCATENATE($B256,\"!N21\")))","v":""},null,{"$f":"IF(ISERROR(INDIRECT(CONCATENATE($B256,\"!O18\"))),\"\",INDIRECT(CONCATENATE($B256,\"!O18\")))","v":""},{"$f":"IF(ISERROR(INDIRECT(CONCATENATE($B256,\"!O19\"))),\"\",INDIRECT(CONCATENATE($B256,\"!O19\")))","v":""},{"$f":"IF(ISERROR(INDIRECT(CONCATENATE($B256,\"!O20\"))),\"\",INDIRECT(CONCATENATE($B256,\"!O20\")))","v":""},{"$f":"IF(ISERROR(INDIRECT(CONCATENATE($B256,\"!O21\"))),\"\",INDIRECT(CONCATENATE($B256,\"!O21\")))","v":""},null,{"$f":"IF(ISERROR(INDIRECT(CONCATENATE($B256,\"!P18\"))),\"\",INDIRECT(CONCATENATE($B256,\"!P18\")))","v":""},{"$f":"IF(ISERROR(INDIRECT(CONCATENATE($B256,\"!P19\"))),\"\",INDIRECT(CONCATENATE($B256,\"!P19\")))","v":""},{"$f":"IF(ISERROR(INDIRECT(CONCATENATE($B256,\"!P20\"))),\"\",INDIRECT(CONCATENATE($B256,\"!P20\")))","v":""},{"$f":"IF(ISERROR(INDIRECT(CONCATENATE($B256,\"!P21\"))),\"\",INDIRECT(CONCATENATE($B256,\"!P21\")))","v":""},null,{"$f":"IF(ISERROR(INDIRECT(CONCATENATE($B256,\"!Q18\"))),\"\",INDIRECT(CONCATENATE($B256,\"!Q18\")))","v":""},{"$f":"IF(ISERROR(INDIRECT(CONCATENATE($B256,\"!Q19\"))),\"\",INDIRECT(CONCATENATE($B256,\"!Q19\")))","v":""},{"$f":"IF(ISERROR(INDIRECT(CONCATENATE($B256,\"!Q20\"))),\"\",INDIRECT(CONCATENATE($B256,\"!Q20\")))","v":""},{"$f":"IF(ISERROR(INDIRECT(CONCATENATE($B256,\"!Q21\"))),\"\",INDIRECT(CONCATENATE($B256,\"!Q1\")))","v":""}]
[null,null,null,null,{"$f":"IF(ISERROR(INDIRECT(CONCATENATE($B257,\"!M18\"))),\"\",INDIRECT(CONCATENATE($B257,\"!M18\")))","v":""},{"$f":"IF(ISERROR(INDIRECT(CONCATENATE($B257,\"!M19\"))),\"\",INDIRECT(CONCATENATE($B257,\"!M19\")))","v":""},{"$f":"IF(ISERROR(INDIRECT(CONCATENATE($B257,\"!M20\"))),\"\",INDIRECT(CONCATENATE($B257,\"!M20\")))","v":""},{"$f":"IF(ISERROR(INDIRECT(CONCATENATE($B257,\"!M21\"))),\"\",INDIRECT(CONCATENATE($B257,\"!M21\")))","v":""},null,{"$f":"IF(ISERROR(INDIRECT(CONCATENATE($B257,\"!N18\"))),\"\",INDIRECT(CONCATENATE($B257,\"!N18\")))","v":""},{"$f":"IF(ISERROR(INDIRECT(CONCATENATE($B257,\"!N19\"))),\"\",INDIRECT(CONCATENATE($B257,\"!N19\")))","v":""},{"$f":"IF(ISERROR(INDIRECT(CONCATENATE($B257,\"!N20\"))),\"\",INDIRECT(CONCATENATE($B257,\"!N20\")))","v":""},{"$f":"IF(ISERROR(INDIRECT(CONCATENATE($B257,\"!N21\"))),\"\",INDIRECT(CONCATENATE($B257,\"!N21\")))","v":""},null,{"$f":"IF(ISERROR(INDIRECT(CONCATENATE($B257,\"!O18\"))),\"\",INDIRECT(CONCATENATE($B257,\"!O18\")))","v":""},{"$f":"IF(ISERROR(INDIRECT(CONCATENATE($B257,\"!O19\"))),\"\",INDIRECT(CONCATENATE($B257,\"!O19\")))","v":""},{"$f":"IF(ISERROR(INDIRECT(CONCATENATE($B257,\"!O20\"))),\"\",INDIRECT(CONCATENATE($B257,\"!O20\")))","v":""},{"$f":"IF(ISERROR(INDIRECT(CONCATENATE($B257,\"!O21\"))),\"\",INDIRECT(CONCATENATE($B257,\"!O21\")))","v":""},null,{"$f":"IF(ISERROR(INDIRECT(CONCATENATE($B257,\"!P18\"))),\"\",INDIRECT(CONCATENATE($B257,\"!P18\")))","v":""},{"$f":"IF(ISERROR(INDIRECT(CONCATENATE($B257,\"!P19\"))),\"\",INDIRECT(CONCATENATE($B257,\"!P19\")))","v":""},{"$f":"IF(ISERROR(INDIRECT(CONCATENATE($B257,\"!P20\"))),\"\",INDIRECT(CONCATENATE($B257,\"!P20\")))","v":""},{"$f":"IF(ISERROR(INDIRECT(CONCATENATE($B257,\"!P21\"))),\"\",INDIRECT(CONCATENATE($B257,\"!P21\")))","v":""},null,{"$f":"IF(ISERROR(INDIRECT(CONCATENATE($B257,\"!Q18\"))),\"\",INDIRECT(CONCATENATE($B257,\"!Q18\")))","v":""},{"$f":"IF(ISERROR(INDIRECT(CONCATENATE($B257,\"!Q19\"))),\"\",INDIRECT(CONCATENATE($B257,\"!Q19\")))","v":""},{"$f":"IF(ISERROR(INDIRECT(CONCATENATE($B257,\"!Q20\"))),\"\",INDIRECT(CONCATENATE($B257,\"!Q20\")))","v":""},{"$f":"IF(ISERROR(INDIRECT(CONCATENATE($B257,\"!Q21\"))),\"\",INDIRECT(CONCATENATE($B257,\"!Q1\")))","v":""}]
[]
[]
[]
[]
[]
[]
[]
[]
[]
[]
[]
[]
[]
[]
[]
[]
[]
[]
[]
[]
[]
[]
[]
[]
[]
[]
[]
[]
[]
[]
[]
[]
[]
[]
[]
[]
[]
[]
[]
["RURAL",null,null,"Poorest",null,null,null,null,"Poor",null,null,null,null,"Middle",null,null,null,null,"Rich",null,null,null,null,"Richest"]
[null,null,null,"Improved","Basic","Limited","Unimproved","Surface water","Improved","Basic","Limited","Unimproved","Surface water","Improved","Basic","Limited","Unimproved","Surface water","Improved","Basic","Limited","Unimproved","Surface water","Improved","Basic","Limited","Unimproved","Surface water"]
["Forecast period:",null,2000,{"$f":"IF((D301+H301)>100,D301*100/(D301+H301),D301)","v":83.185049516433423},{"$f":"D299*AVERAGEIF(E305:E316,\">0\")/100","v":78.859426941578889},{"$f":"D299*(100-AVERAGEIF(E305:E316,\">0\"))/100","v":4.32562257485454},{"$f":"100-(E299+F299+H299)","v":7.7678158458248845},{"$f":"IF((D301+H301)>100,H301*100/(D301+H301),H301)","v":9.0471346377416921},{"$f":"IF((I301+M301)>100,I301*100/(I301+M301),I301)","v":88.107685214831974},{"$f":"I299*AVERAGEIF(J305:J316,\">0\")/100","v":85.640670028816672},{"$f":"I299*(100-AVERAGEIF(J305:J316,\">0\"))/100","v":2.4670151860152929},{"$f":"100-(J299+K299+M299)","v":5.2397653718916928},{"$f":"IF((I301+M301)>100,M301*100/(I301+M301),M301)","v":6.652549413276347},{"$f":"IF((N301+R301)>100,N301*100/(N301+R301),N301)","v":83.711964510026519},{"$f":"N299*AVERAGEIF(O305:O316,\">0\")/100","v":79.610078249035212},{"$f":"N299*(100-AVERAGEIF(O305:O316,\">0\"))/100","v":4.1018862609913045},{"$f":"100-(O299+P299+R299)","v":5.7355738305616342},{"$f":"IF((N301+R301)>100,R301*100/(N301+R301),R301)","v":10.552461659411847},{"$f":"IF((S301+W301)>100,S301*100/(S301+W301),S301)","v":88.495127310085536},{"$f":"S299*AVERAGEIF(T305:T316,\">0\")/100","v":87.079205273124174},{"$f":"S299*(100-AVERAGEIF(T305:T316,\">0\"))/100","v":1.4159220369613634},{"$f":"100-(T299+U299+W299)","v":4.0984923868861642},{"$f":"IF((S301+W301)>100,W301*100/(S301+W301),W301)","v":7.4063803030282997},{"$f":"IF((X301+AB301)>100,X301*100/(X301+AB301),X301)","v":93.143268506411459},{"$f":"X299*AVERAGEIF(Y305:Y316,\">0\")/100","v":91.839262747321698},{"$f":"X299*(100-AVERAGEIF(Y305:Y316,\">0\"))/100","v":1.3040057590897658},{"$f":"100-(Y299+Z299+AB299)","v":1.5683192223100377},{"$f":"IF((X301+AB301)>100,AB301*100/(X301+AB301),AB301)","v":5.2884122712785029}]
[null,null,2017,{"$f":"IF((D302+H302)>100,D302*100/(D302+H302),D302)","v":87.657078247162758},{"$f":"D300*AVERAGEIF(E305:E316,\">0\")/100","v":83.098910178310291},{"$f":"D300*(100-AVERAGEIF(E305:E316,\">0\"))/100","v":4.5581680688524662},{"$f":"100-(E300+F300+H300)","v":7.6926770014115391},{"$f":"IF((D302+H302)>100,H302*100/(D302+H302),H302)","v":4.6502447514257028},{"$f":"IF((I302+M302)>100,I302*100/(I302+M302),I302)","v":90.657817468956523},{"$f":"I300*AVERAGEIF(J305:J316,\">0\")/100","v":88.119398579825742},{"$f":"I300*(100-AVERAGEIF(J305:J316,\">0\"))/100","v":2.5384188891307802},{"$f":"100-(J300+K300+M300)","v":4.684635596560895},{"$f":"IF((I302+M302)>100,M302*100/(I302+M302),M302)","v":4.6575469344825819},{"$f":"IF((N302+R302)>100,N302*100/(N302+R302),N302)","v":92.068617183815604},{"$f":"N300*AVERAGEIF(O305:O316,\">0\")/100","v":87.557254941808637},{"$f":"N300*(100-AVERAGEIF(O305:O316,\">0\"))/100","v":4.5113622420069701},{"$f":"100-(O300+P300+R300)","v":5.4280826491756216},{"$f":"IF((N302+R302)>100,R302*100/(N302+R302),R302)","v":2.5033001670087742},{"$f":"IF((S302+W302)>100,S302*100/(S302+W302),S302)","v":95.250889962762358},{"$f":"S300*AVERAGEIF(T305:T316,\">0\")/100","v":93.726875723358177},{"$f":"S300*(100-AVERAGEIF(T305:T316,\">0\"))/100","v":1.5240142394041922},{"$f":"100-(T300+U300+W300)","v":2.1433494860337845},{"$f":"IF((S302+W302)>100,W302*100/(S302+W302),W302)","v":2.6057605512038435},{"$f":"IF((X302+AB302)>100,X302*100/(X302+AB302),X302)","v":98.236618816575856},{"$f":"X300*AVERAGEIF(Y305:Y316,\">0\")/100","v":96.861306153143801},{"$f":"X300*(100-AVERAGEIF(Y305:Y316,\">0\"))/100","v":1.3753126634320676},{"$f":"100-(Y300+Z300+AB300)","v":1.6672662806406464},{"$f":"IF((X302+AB302)>100,AB302*100/(X302+AB302),AB302)","v":9.6114902783483558E-2}]
["Regression period:",null,{"$f":"MinRegYear(C299,C305:C316)","v":2000},{"$f":"IF(MAX(C305:C316)-MIN(C305:C316)<5,AVERAGEIF(C305:C316,\">0\",D305:D316),\nIF(FORECAST($C301,D$305:D$316,$C$305:$C$316)<0,0,\nIF(FORECAST($C301,D$305:D$316,$C$305:$C$316)>100,100,\nFORECAST($C301,D$305:D$316,$C$305:$C$316))))","v":83.185049516433423},null,null,null,{"$f":"IF(MAX(C305:C316)-MIN(C305:C316)<5,AVERAGEIF(C305:C316,\">0\",H305:H316),\nIF(FORECAST($C301,H$305:H$316,$C$305:$C$316)<0,0,\nIF(FORECAST($C301,H$305:H$316,$C$305:$C$316)>100,100,\nFORECAST($C301,H$305:H$316,$C$305:$C$316))))","v":9.0471346377416921},{"$f":"IF(MAX(C305:C316)-MIN(C305:C316)<5,AVERAGEIF(C305:C316,\">0\",I305:I316),\nIF(FORECAST($C301,I$305:I$316,$C$305:$C$316)<0,0,\nIF(FORECAST($C301,I$305:I$316,$C$305:$C$316)>100,100,\nFORECAST($C301,I$305:I$316,$C$305:$C$316))))","v":88.107685214831974},null,null,null,{"$f":"IF(MAX(C305:C316)-MIN(C305:C316)<5,AVERAGEIF(C305:C316,\">0\",M305:M316),\nIF(FORECAST($C301,M$305:M$316,$C$305:$C$316)<0,0,\nIF(FORECAST($C301,M$305:M$316,$C$305:$C$316)>100,100,\nFORECAST($C301,M$305:M$316,$C$305:$C$316))))","v":6.652549413276347},{"$f":"IF(MAX(C305:C316)-MIN(C305:C316)<5,AVERAGEIF(C305:C316,\">0\",N305:N316),\nIF(FORECAST($C301,N$305:N$316,$C$305:$C$316)<0,0,\nIF(FORECAST($C301,N$305:N$316,$C$305:$C$316)>100,100,\nFORECAST($C301,N$305:N$316,$C$305:$C$316))))","v":83.711964510026519},null,null,null,{"$f":"IF(MAX(C305:C316)-MIN(C305:C316)<5,AVERAGEIF(C305:C316,\">0\",R305:R316),\nIF(FORECAST($C301,R$305:R$316,$C$305:$C$316)<0,0,\nIF(FORECAST($C301,R$305:R$316,$C$305:$C$316)>100,100,\nFORECAST($C301,R$305:R$316,$C$305:$C$316))))","v":10.552461659411847},{"$f":"IF(MAX(C305:C316)-MIN(C305:C316)<5,AVERAGEIF(C305:C316,\">0\",S305:S316),\nIF(FORECAST($C301,S$305:S$316,$C$305:$C$316)<0,0,\nIF(FORECAST($C301,S$305:S$316,$C$305:$C$316)>100,100,\nFORECAST($C301,S$305:S$316,$C$305:$C$316))))","v":88.495127310085536},null,null,null,{"$f":"IF(MAX(C305:C316)-MIN(C305:C316)<5,AVERAGEIF(C305:C316,\">0\",W305:W316),\nIF(FORECAST($C301,W$305:W$316,$C$305:$C$316)<0,0,\nIF(FORECAST($C301,W$305:W$316,$C$305:$C$316)>100,100,\nFORECAST($C301,W$305:W$316,$C$305:$C$316))))","v":7.4063803030282997},{"$f":"IF(MAX(C305:C316)-MIN(C305:C316)<5,AVERAGEIF(C305:C316,\">0\",X305:X316),\nIF(FORECAST($C301,X$305:X$316,$C$305:$C$316)<0,0,\nIF(FORECAST($C301,X$305:X$316,$C$305:$C$316)>100,100,\nFORECAST($C301,X$305:X$316,$C$305:$C$316))))","v":93.143268506411459},null,null,null,{"$f":"IF(MAX(C305:C316)-MIN(C305:C316)<5,AVERAGEIF(C305:C316,\">0\",AB305:AB316),\nIF(FORECAST($C301,AB$305:AB$316,$C$305:$C$316)<0,0,\nIF(FORECAST($C301,AB$305:AB$316,$C$305:$C$316)>100,100,\nFORECAST($C301,AB$305:AB$316,$C$305:$C$316))))","v":5.2884122712785029}]
[null,null,{"$f":"MaxRegYear(C300,C305:C316)","v":2013},{"$f":"IF(MAX(C305:C316)-MIN(C305:C316)<5,AVERAGEIF(C305:C316,\">0\",D305:D316),\nIF(FORECAST($C302,D$305:D$316,$C$305:$C$316)<0,0,\nIF(FORECAST($C302,D$305:D$316,$C$305:$C$316)>100,100,\nFORECAST($C302,D$305:D$316,$C$305:$C$316))))","v":87.657078247162758},null,null,null,{"$f":"IF(MAX(C305:C316)-MIN(C305:C316)<5,AVERAGEIF(C305:C316,\">0\",H305:H316),\nIF(FORECAST($C302,H$305:H$316,$C$305:$C$316)<0,0,\nIF(FORECAST($C302,H$305:H$316,$C$305:$C$316)>100,100,\nFORECAST($C302,H$305:H$316,$C$305:$C$316))))","v":4.6502447514257028},{"$f":"IF(MAX(C305:C316)-MIN(C305:C316)<5,AVERAGEIF(C305:C316,\">0\",I305:I316),\nIF(FORECAST($C302,I$305:I$316,$C$305:$C$316)<0,0,\nIF(FORECAST($C302,I$305:I$316,$C$305:$C$316)>100,100,\nFORECAST($C302,I$305:I$316,$C$305:$C$316))))","v":90.657817468956523},null,null,null,{"$f":"IF(MAX(C305:C316)-MIN(C305:C316)<5,AVERAGEIF(C305:C316,\">0\",M305:M316),\nIF(FORECAST($C302,M$305:M$316,$C$305:$C$316)<0,0,\nIF(FORECAST($C302,M$305:M$316,$C$305:$C$316)>100,100,\nFORECAST($C302,M$305:M$316,$C$305:$C$316))))","v":4.6575469344825819},{"$f":"IF(MAX(C305:C316)-MIN(C305:C316)<5,AVERAGEIF(C305:C316,\">0\",N305:N316),\nIF(FORECAST($C302,N$305:N$316,$C$305:$C$316)<0,0,\nIF(FORECAST($C302,N$305:N$316,$C$305:$C$316)>100,100,\nFORECAST($C302,N$305:N$316,$C$305:$C$316))))","v":92.068617183815604},null,null,null,{"$f":"IF(MAX(C305:C316)-MIN(C305:C316)<5,AVERAGEIF(C305:C316,\">0\",R305:R316),\nIF(FORECAST($C302,R$305:R$316,$C$305:$C$316)<0,0,\nIF(FORECAST($C302,R$305:R$316,$C$305:$C$316)>100,100,\nFORECAST($C302,R$305:R$316,$C$305:$C$316))))","v":2.5033001670087742},{"$f":"IF(MAX(C305:C316)-MIN(C305:C316)<5,AVERAGEIF(C305:C316,\">0\",S305:S316),\nIF(FORECAST($C302,S$305:S$316,$C$305:$C$316)<0,0,\nIF(FORECAST($C302,S$305:S$316,$C$305:$C$316)>100,100,\nFORECAST($C302,S$305:S$316,$C$305:$C$316))))","v":95.250889962762358},null,null,null,{"$f":"IF(MAX(C305:C316)-MIN(C305:C316)<5,AVERAGEIF(C305:C316,\">0\",W305:W316),\nIF(FORECAST($C302,W$305:W$316,$C$305:$C$316)<0,0,\nIF(FORECAST($C302,W$305:W$316,$C$305:$C$316)>100,100,\nFORECAST($C302,W$305:W$316,$C$305:$C$316))))","v":2.6057605512038435},{"$f":"IF(MAX(C305:C316)-MIN(C305:C316)<5,AVERAGEIF(C305:C316,\">0\",X305:X316),\nIF(FORECAST($C302,X$305:X$316,$C$305:$C$316)<0,0,\nIF(FORECAST($C302,X$305:X$316,$C$305:$C$316)>100,100,\nFORECAST($C302,X$305:X$316,$C$305:$C$316))))","v":98.236618816575856},null,null,null,{"$f":"IF(MAX(C305:C316)-MIN(C305:C316)<5,AVERAGEIF(C305:C316,\">0\",AB305:AB316),\nIF(FORECAST($C302,AB$305:AB$316,$C$305:$C$316)<0,0,\nIF(FORECAST($C302,AB$305:AB$316,$C$305:$C$316)>100,100,\nFORECAST($C302,AB$305:AB$316,$C$305:$C$316))))","v":9.6114902783483558E-2}]
[]
[null,"Survey","Year","Improved","Basic",null,null,"Surface water","Improved","Basic",null,null,"Surface water","Improved","Basic",null,null,"Surface water","Improved","Basic",null,null,"Surface water","Improved","Basic",null,null,"Surface water"]
[null,"SLC97",1997,{"$f":"IF(ISERROR(INDIRECT(CONCATENATE($B305,\"!M16\"))),\"\",INDIRECT(CONCATENATE($B305,\"!M16\")))","v":82.205413355444819},{"$f":"IF(ISERROR(INDIRECT(CONCATENATE($B305,\"!M23\"))),\"\",INDIRECT(CONCATENATE($B305,\"!M23\")))","v":"N/A"},null,null,{"$f":"IF(ISERROR(INDIRECT(CONCATENATE($B305,\"!M21\"))),\"\",INDIRECT(CONCATENATE($B305,\"!M21\")))","v":9.651125794855627},{"$f":"IF(ISERROR(INDIRECT(CONCATENATE($B305,\"!N16\"))),\"\",INDIRECT(CONCATENATE($B305,\"!N16\")))","v":89.412997384243667},{"$f":"IF(ISERROR(INDIRECT(CONCATENATE($B305,\"!N23\"))),\"\",INDIRECT(CONCATENATE($B305,\"!N23\")))","v":"N/A"},null,null,{"$f":"IF(ISERROR(INDIRECT(CONCATENATE($B305,\"!N21\"))),\"\",INDIRECT(CONCATENATE($B305,\"!N21\")))","v":5.6871464435868688},{"$f":"IF(ISERROR(INDIRECT(CONCATENATE($B305,\"!O16\"))),\"\",INDIRECT(CONCATENATE($B305,\"!O16\")))","v":82.830314876320756},{"$f":"IF(ISERROR(INDIRECT(CONCATENATE($B305,\"!O23\"))),\"\",INDIRECT(CONCATENATE($B305,\"!O23\")))","v":"N/A"},null,null,{"$f":"IF(ISERROR(INDIRECT(CONCATENATE($B305,\"!O21\"))),\"\",INDIRECT(CONCATENATE($B305,\"!O21\")))","v":11.233307383630372},{"$f":"IF(ISERROR(INDIRECT(CONCATENATE($B305,\"!P16\"))),\"\",INDIRECT(CONCATENATE($B305,\"!P16\")))","v":88.051488414527654},{"$f":"IF(ISERROR(INDIRECT(CONCATENATE($B305,\"!P23\"))),\"\",INDIRECT(CONCATENATE($B305,\"!P23\")))","v":"N/A"},null,null,{"$f":"IF(ISERROR(INDIRECT(CONCATENATE($B305,\"!P21\"))),\"\",INDIRECT(CONCATENATE($B305,\"!P21\")))","v":7.4164886559325058},{"$f":"IF(ISERROR(INDIRECT(CONCATENATE($B305,\"!Q16\"))),\"\",INDIRECT(CONCATENATE($B305,\"!Q16\")))","v":92.426669388830177},{"$f":"IF(ISERROR(INDIRECT(CONCATENATE($B305,\"!Q23\"))),\"\",INDIRECT(CONCATENATE($B305,\"!Q23\")))","v":"N/A"},null,null,{"$f":"IF(ISERROR(INDIRECT(CONCATENATE($B305,\"!Q221\"))),\"\",INDIRECT(CONCATENATE($B305,\"!Q21\")))","v":6.2086627879104332}]
[null,"SLC07",2007,85.409768344696971,"N/A",null,null,8.1169436341588685,82.852518553472876,"N/A",null,null,10.568575859172457,84.547870200438652,"N/A",null,null,10.336583564909226,88.229004268817675,"N/A",null,null,8.6634756164318958,94.280078795978355,"N/A",null,null,3.4654616776616085]
[null,"MICS11",2011,87.1,94.8,null,null,4.3,95,97.2,null,null,1.4,93.4,95.1,null,null,0.8,97,98.4,null,null,0.6,98.6,98.6,null,null,0.2]
[null,null,null,"","",null,null,"","","",null,null,"","","",null,null,"","","",null,null,"","","",null,null,""]
[null,null,null,"","",null,null,"","","",null,null,"","","",null,null,"","","",null,null,"","","",null,null,""]
[null,null,null,"","",null,null,"","","",null,null,"","","",null,null,"","","",null,null,"","","",null,null,""]
[null,null,null,"","",null,null,"","","",null,null,"","","",null,null,"","","",null,null,"","","",null,null,""]
[null,null,null,"","",null,null,"","","",null,null,"","","",null,null,"","","",null,null,"","","",null,null,""]
[null,null,null,"","",null,null,"","","",null,null,"","","",null,null,"","","",null,null,"","","",null,null,""]
[null,null,null,"","",null,null,"","","",null,null,"","","",null,null,"","","",null,null,"","","",null,null,""]
[null,null,null,"","",null,null,"","","",null,null,"","","",null,null,"","","",null,null,"","","",null,null,""]
[null,null,null,"","",null,null,"","","",null,null,"","","",null,null,"","","",null,null,"","","",null,null,""]
[]
[null,{"$f":"CONCATENATE(\"Rural use of drinking water sources, \",C299,\"–\",C300)","v":"Rural use of drinking water sources, 2000–2017"},null,null,null,null,null,null,null,null,null,null,null,null,null,null,null,null,"Data points used for regression"]

{"sheet":"Sanitation","index":2,"n_rows":318,"n_cols":28,"rows_kept":318,"cut":false,"hidden":false,"merged":[[30,21,30,24],[4,1,4,24],[3,1,3,24],[6,1,6,8],[6,9,6,16],[6,17,6,24],[30,1,31,4],[30,5,30,8],[30,9,30,12],[30,13,30,16],[30,17,30,20],[96,23,96,27],[32,1,33,2],[32,3,33,3],[35,1,36,2],[35,3,36,3],[38,1,39,2],[38,3,39,3],[96,0,97,2],[96,3,96,7],[96,8,96,12],[96,13,96,17],[96,18,96,22],[98,0,99,1],[100,0,101,1],[117,18,117,22],[196,0,197,2],[196,3,196,7],[196,8,196,12],[196,13,196,17],[196,18,196,22],[117,1,117,11],[298,0,299,1],[300,0,301,1],[317,18,317,22],[196,23,196,27],[198,0,199,1],[200,0,201,1],[217,18,217,22],[296,0,297,2],[296,3,296,7],[296,8,296,12],[296,13,296,17],[296,18,296,22],[296,23,296,27],[217,1,217,11],[317,1,317,11]]}
[]
[]
[]
[null,"Summary of trends in use of sanitation facilities by wealth quintile (%)"]
[null,{"$f":"IF(ISERROR(INDIRECT(CONCATENATE($B105,\"!A2\"))),\"\",INDIRECT(CONCATENATE($B105,\"!A2\")))","v":"Jamaica"}]
[]
[null,{"$f":"B118","v":"National use of sanitation facilities, 2000–2017"},null,null,null,null,null,null,null,{"$f":"B218","v":"Urban use of sanitation facilities, 2000–2017"},null,null,null,null,null,null,null,{"$f":"B318","v":"Rural use of sanitation facilities, 2000–2017"}]
[]
[]
[]
[]
[]
[]
[]
[]
[]
[]
[]
[]
[]
[]
[]
[]
[]
[]
[]
[]
[]
[]
[]
[null,{"$f":"IF(ISERROR(INDIRECT(CONCATENATE($B105,\"!A2\"))),\"\",INDIRECT(CONCATENATE($B105,\"!A2\")))","v":"Jamaica"},null,null,null,"Poorest",null,null,null,"Poor",null,null,null,"Middle",null,null,null,"Rich",null,null,null,"Richest"]
[null,null,null,null,null,"Basic","Limited","Unimproved","Open defecation","Basic","Limited","Unimproved","Open defecation","Basic","Limited","Unimproved","Open defecation","Basic","Limited","Unimproved","Open defecation","Basic","Limited","Unimproved","Open defecation"]
[null,"NATIONAL",null,"Estimate",{"$f":"C99","v":2000},{"$f":"E99","v":74.311544528022736},{"$f":"F99","v":20.953938019679061},1.2267902653404121,3.5077271869577942,{"$f":"J99","v":79.772069266122358},{"$f":"K99","v":15.179388690248835},1.2791233636955894,3.7694186799332101,{"$f":"O99","v":83.183332282448305},{"$f":"P99","v":15.306138192037745},0.94304957979410631,0.56747994571983895,{"$f":"T99","v":94.048331459528981},{"$f":"U99","v":5.0895048275587236},0.41739614644149015,0.44476756647080151,{"$f":"Y99","v":99.16338142136145},{"$f":"Z99","v":0.82315100847985168},1.3467570158695708E-2,0]
[null,null,null,null,{"$f":"C100","v":2017},{"$f":"E100","v":74.2564258318382},20.938395969639437,2.1424517160491519,2.6627264824732038,{"$f":"J100","v":83.244691178366381},15.84017483087629,0.91513399075732593,0,{"$f":"O100","v":84.142008963907287},15.482539369596623,0.25280205681178813,0.12264960968430216,{"$f":"T100","v":94.814861755300157},5.1309862614156989,5.4151983284143057E-2,0,{"$f":"Y100","v":98.94013377506127},0.82129783927002142,0.23856838566871374,0]
[]
[null,"URBAN",null,"Estimate",{"$f":"C199","v":2000},{"$f":"E199","v":65.398331298050181},{"$f":"F199","v":30.248444709884012},1.3324160489715382,3.0208079430942654,{"$f":"J199","v":80.747915951247975},{"$f":"K199","v":15.670208965662875},1.2107006787987444,2.3711744042904002,{"$f":"O199","v":91.658327120584829},{"$f":"P199","v":7.2303853332723929},0.33707467834825877,0.77421286779451748,{"$f":"T199","v":98.122375474530855},{"$f":"U199","v":0.72233601194341157},0.58614864557249291,0.56913986795323979,{"$f":"Y199","v":99.772656178099169},{"$f":"Z199","v":0.22734382190083124},0,0]
[null,null,null,null,{"$f":"C200","v":2017},{"$f":"E200","v":64.280550023670955},29.731441532513763,3.0383251614822342,2.9496832823330585,{"$f":"J200","v":82.123439465580816},15.937147630925672,1.939412903493519,0,{"$f":"O200","v":92.668113072907943},7.3100413969251399,2.1845530166913818E-2,0,{"$f":"T200","v":99.269221386677557},0.73077861332242833,0,0,{"$f":"Y200","v":99.772656178099169},0.22734382190083124,0,0]
[]
[null,"RURAL",null,"Estimate",{"$f":"C299","v":2000},{"$f":"E299","v":70.672537605490973},{"$f":"F299","v":20.218266951856581},1.6947224205489562,7.4144730221034933,{"$f":"J299","v":79.061910026234685},{"$f":"K299","v":18.22846271119386},1.2387416724564986,1.4708855901149605,{"$f":"O299","v":86.736885474852897},{"$f":"P299","v":10.873456357003425},1.3266984517124172,1.0629597164312656,{"$f":"T299","v":97.291402456584152},{"$f":"U299","v":2.6836023901597512},2.4995153256099911E-2,0,{"$f":"Y299","v":98.994245501898163},{"$f":"Z299","v":0.98629973127952497},1.9454766822306624E-2,0]
[null,null,null,null,{"$f":"C300","v":2017},{"$f":"E300","v":74.804178266646204},21.400262344503854,1.7189676310074447,2.0765917578424933,{"$f":"J300","v":80.221807754401866},18.495887979311952,0.81010882562398479,0.47219544066220465,{"$f":"O300","v":88.238729558215624},11.061729615906675,0.69954082587770472,0,{"$f":"T300","v":96.884840576899791},2.6723881368493867,0.4427712862508173,0,{"$f":"Y300","v":98.672280770596643},0.98309193140838902,0.34462729799496117,0]
[]
[]
[]
[]
[]
[]
[]
[]
[]
[]
[]
[]
[]
[]
[]
[]
[]
[]
[]
[]
[]
[]
[]
[]
[]
[]
[]
[]
[]
[]
[]
[]
[]
[]
[]
[]
[]
[]
[]
[]
[]
[]
[]
[]
[]
[]
[]
[]
[]
[]
[]
[]
[]
[]
[]
[]
["NATIONAL",null,null,"Poorest",null,null,null,null,"Poor",null,null,null,null,"Middle",null,null,null,null,"Rich",null,null,null,null,"Richest"]
[null,null,null,"Improved","Basic","Limited","Unimproved","Open defecation","Improved","Basic","Limited","Unimproved","Open defecation","Improved","Basic","Limited","Unimproved","Open defecation","Improved","Basic","Limited","Unimproved","Open defecation","Improved","Basic","Limited","Unimproved","Open defecation"]
["Forecast period:",null,2000,{"$f":"IF((D101+H101)>100,D101*100/(D101+H101),D101)","v":95.265482547701808},{"$f":"D99*AVERAGEIF(E105:E116,\">0\")/100","v":74.311544528022736},{"$f":"D99*(100-AVERAGEIF(E105:E116,\">0\"))/100","v":20.953938019679061},{"$f":"100-(E99+F99+H99)","v":1.2267902653404121},{"$f":"IF((D101+H101)>100,H101*100/(D101+H101),H101)","v":3.5077271869577942},{"$f":"IF((I101+M101)>100,I101*100/(I101+M101),I101)","v":94.9514579563712},{"$f":"I99*AVERAGEIF(J105:J116,\">0\")/100","v":79.772069266122358},{"$f":"I99*(100-AVERAGEIF(J105:J116,\">0\"))/100","v":15.179388690248835},{"$f":"100-(J99+K99+M99)","v":1.2791233636955894},{"$f":"IF((I101+M101)>100,M101*100/(I101+M101),M101)","v":3.7694186799332101},{"$f":"IF((N101+R101)>100,N101*100/(N101+R101),N101)","v":98.489470474486055},{"$f":"N99*AVERAGEIF(O105:O116,\">0\")/100","v":83.183332282448305},{"$f":"N99*(100-AVERAGEIF(O105:O116,\">0\"))/100","v":15.306138192037745},{"$f":"100-(O99+P99+R99)","v":0.94304957979410631},{"$f":"IF((N101+R101)>100,R101*100/(N101+R101),R101)","v":0.56747994571983895},{"$f":"IF((S101+W101)>100,S101*100/(S101+W101),S101)","v":99.137836287087708},{"$f":"S99*AVERAGEIF(T105:T116,\">0\")/100","v":94.048331459528981},{"$f":"S99*(100-AVERAGEIF(T105:T116,\">0\"))/100","v":5.0895048275587236},{"$f":"100-(T99+U99+W99)","v":0.41739614644149015},{"$f":"IF((S101+W101)>100,W101*100/(S101+W101),W101)","v":0.44476756647080151},{"$f":"IF((X101+AB101)>100,X101*100/(X101+AB101),X101)","v":99.98653242984129},{"$f":"X99*AVERAGEIF(Y105:Y116,\">0\")/100","v":99.16338142136145},{"$f":"X99*(100-AVERAGEIF(Y105:Y116,\">0\"))/100","v":0.82315100847985168},{"$f":"100-(Y99+Z99+AB99)","v":1.3467570158695708E-2},{"$f":"IF((X101+AB101)>100,AB101*100/(X101+AB101),AB101)","v":0}]
[null,null,2017,{"$f":"IF((D102+H102)>100,D102*100/(D102+H102),D102)","v":95.194821801477644},{"$f":"D100*AVERAGEIF(E105:E116,\">0\")/100","v":74.2564258318382},{"$f":"D100*(100-AVERAGEIF(E105:E116,\">0\"))/100","v":20.938395969639437},{"$f":"100-(E100+F100+H100)","v":2.1424517160491519},{"$f":"IF((D102+H102)>100,H102*100/(D102+H102),H102)","v":2.6627264824732038},{"$f":"IF((I102+M102)>100,I102*100/(I102+M102),I102)","v":99.08486600924266},{"$f":"I100*AVERAGEIF(J105:J116,\">0\")/100","v":83.244691178366381},{"$f":"I100*(100-AVERAGEIF(J105:J116,\">0\"))/100","v":15.84017483087629},{"$f":"100-(J100+K100+M100)","v":0.91513399075732593},{"$f":"IF((I102+M102)>100,M102*100/(I102+M102),M102)","v":0},{"$f":"IF((N102+R102)>100,N102*100/(N102+R102),N102)","v":99.62454833350391},{"$f":"N100*AVERAGEIF(O105:O116,\">0\")/100","v":84.142008963907287},{"$f":"N100*(100-AVERAGEIF(O105:O116,\">0\"))/100","v":15.482539369596623},{"$f":"100-(O100+P100+R100)","v":0.25280205681178813},{"$f":"IF((N102+R102)>100,R102*100/(N102+R102),R102)","v":0.12264960968430216},{"$f":"IF((S102+W102)>100,S102*100/(S102+W102),S102)","v":99.945848016715857},{"$f":"S100*AVERAGEIF(T105:T116,\">0\")/100","v":94.814861755300157},{"$f":"S100*(100-AVERAGEIF(T105:T116,\">0\"))/100","v":5.1309862614156989},{"$f":"100-(T100+U100+W100)","v":5.4151983284143057E-2},{"$f":"IF((S102+W102)>100,W102*100/(S102+W102),W102)","v":0},{"$f":"IF((X102+AB102)>100,X102*100/(X102+AB102),X102)","v":99.7614316143313},{"$f":"X100*AVERAGEIF(Y105:Y116,\">0\")/100","v":98.94013377506127},{"$f":"X100*(100-AVERAGEIF(Y105:Y116,\">0\"))/100","v":0.82129783927002142},{"$f":"100-(Y100+Z100+AB100)","v":0.23856838566871374},{"$f":"IF((X102+AB102)>100,AB102*100/(X102+AB102),AB102)","v":0}]
["Regression period:",null,{"$f":"MinRegYear(C99,C105:C116)","v":2000},{"$f":"IF(MAX(C105:C116)-MIN(C105:C116)<5,AVERAGEIF(C105:C116,\">0\",D105:D116),\nIF(FORECAST($C101,D$105:D$116,$C$105:$C$116)<0,0,\nIF(FORECAST($C101,D$105:D$116,$C$105:$C$116)>100,100,\nFORECAST($C101,D$105:D$116,$C$105:$C$116))))","v":95.265482547701808},null,null,null,{"$f":"IF(MAX(C105:C116)-MIN(C105:C116)<5,AVERAGEIF(C105:C116,\">0\",H105:H116),\nIF(FORECAST($C101,H$105:H$116,$C$105:$C$116)<0,0,\nIF(FORECAST($C101,H$105:H$116,$C$105:$C$116)>100,100,\nFORECAST($C101,H$105:H$116,$C$105:$C$116))))","v":3.5077271869577942},{"$f":"IF(MAX(C105:C116)-MIN(C105:C116)<5,AVERAGEIF(C105:C116,\">0\",I105:I116),\nIF(FORECAST($C101,I$105:I$116,$C$105:$C$116)<0,0,\nIF(FORECAST($C101,I$105:I$116,$C$105:$C$116)>100,100,\nFORECAST($C101,I$105:I$116,$C$105:$C$116))))","v":94.9514579563712},null,null,null,{"$f":"IF(MAX(C105:C116)-MIN(C105:C116)<5,AVERAGEIF(C105:C116,\">0\",M105:M116),\nIF(FORECAST($C101,M$105:M$116,$C$105:$C$116)<0,0,\nIF(FORECAST($C101,M$105:M$116,$C$105:$C$116)>100,100,\nFORECAST($C101,M$105:M$116,$C$105:$C$116))))","v":3.7694186799332101},{"$f":"IF(MAX(C105:C116)-MIN(C105:C116)<5,AVERAGEIF(C105:C116,\">0\",N105:N116),\nIF(FORECAST($C101,N$105:N$116,$C$105:$C$116)<0,0,\nIF(FORECAST($C101,N$105:N$116,$C$105:$C$116)>100,100,\nFORECAST($C101,N$105:N$116,$C$105:$C$116))))","v":98.489470474486055},null,null,null,{"$f":"IF(MAX(C105:C116)-MIN(C105:C116)<5,AVERAGEIF(C105:C116,\">0\",R105:R116),\nIF(FORECAST($C101,R$105:R$116,$C$105:$C$116)<0,0,\nIF(FORECAST($C101,R$105:R$116,$C$105:$C$116)>100,100,\nFORECAST($C101,R$105:R$116,$C$105:$C$116))))","v":0.56747994571983895},{"$f":"IF(MAX(C105:C116)-MIN(C105:C116)<5,AVERAGEIF(C105:C116,\">0\",S105:S116),\nIF(FORECAST($C101,S$105:S$116,$C$105:$C$116)<0,0,\nIF(FORECAST($C101,S$105:S$116,$C$105:$C$116)>100,100,\nFORECAST($C101,S$105:S$116,$C$105:$C$116))))","v":99.137836287087708},null,null,null,{"$f":"IF(MAX(C105:C116)-MIN(C105:C116)<5,AVERAGEIF(C105:C116,\">0\",W105:W116),\nIF(FORECAST($C101,W$105:W$116,$C$105:$C$116)<0,0,\nIF(FORECAST($C101,W$105:W$116,$C$105:$C$116)>100,100,\nFORECAST($C101,W$105:W$116,$C$105:$C$116))))","v":0.44476756647080151},{"$f":"IF(MAX(C105:C116)-MIN(C105:C116)<5,AVERAGEIF(C105:C116,\">0\",X105:X116),\nIF(FORECAST($C101,X$105:X$116,$C$105:$C$116)<0,0,\nIF(FORECAST($C101,X$105:X$116,$C$105:$C$116)>100,100,\nFORECAST($C101,X$105:X$116,$C$105:$C$116))))","v":99.98653242984129},null,null,null,{"$f":"IF(MAX(C105:C116)-MIN(C105:C116)<5,AVERAGEIF(C105:C116,\">0\",AB105:AB116),\nIF(FORECAST($C101,AB$105:AB$116,$C$105:$C$116)<0,0,\nIF(FORECAST($C101,AB$105:AB$116,$C$105:$C$116)>100,100,\nFORECAST($C101,AB$105:AB$116,$C$105:$C$116))))","v":0}]
[null,null,{"$f":"MaxRegYear(C100,C105:C116)","v":2013},{"$f":"IF(MAX(C105:C116)-MIN(C105:C116)<5,AVERAGEIF(C105:C116,\">0\",D105:D116),\nIF(FORECAST($C102,D$105:D$116,$C$105:$C$116)<0,0,\nIF(FORECAST($C102,D$105:D$116,$C$105:$C$116)>100,100,\nFORECAST($C102,D$105:D$116,$C$105:$C$116))))","v":95.194821801477644},null,null,null,{"$f":"IF(MAX(C105:C116)-MIN(C105:C116)<5,AVERAGEIF(C105:C116,\">0\",H105:H116),\nIF(FORECAST($C102,H$105:H$116,$C$105:$C$116)<0,0,\nIF(FORECAST($C102,H$105:H$116,$C$105:$C$116)>100,100,\nFORECAST($C102,H$105:H$116,$C$105:$C$116))))","v":2.6627264824732038},{"$f":"IF(MAX(C105:C116)-MIN(C105:C116)<5,AVERAGEIF(C105:C116,\">0\",I105:I116),\nIF(FORECAST($C102,I$105:I$116,$C$105:$C$116)<0,0,\nIF(FORECAST($C102,I$105:I$116,$C$105:$C$116)>100,100,\nFORECAST($C102,I$105:I$116,$C$105:$C$116))))","v":99.08486600924266},null,null,null,{"$f":"IF(MAX(C105:C116)-MIN(C105:C116)<5,AVERAGEIF(C105:C116,\">0\",M105:M116),\nIF(FORECAST($C102,M$105:M$116,$C$105:$C$116)<0,0,\nIF(FORECAST($C102,M$105:M$116,$C$105:$C$116)>100,100,\nFORECAST($C102,M$105:M$116,$C$105:$C$116))))","v":0},{"$f":"IF(MAX(C105:C116)-MIN(C105:C116)<5,AVERAGEIF(C105:C116,\">0\",N105:N116),\nIF(FORECAST($C102,N$105:N$116,$C$105:$C$116)<0,0,\nIF(FORECAST($C102,N$105:N$116,$C$105:$C$116)>100,100,\nFORECAST($C102,N$105:N$116,$C$105:$C$116))))","v":99.62454833350391},null,null,null,{"$f":"IF(MAX(C105:C116)-MIN(C105:C116)<5,AVERAGEIF(C105:C116,\">0\",R105:R116),\nIF(FORECAST($C102,R$105:R$116,$C$105:$C$116)<0,0,\nIF(FORECAST($C102,R$105:R$116,$C$105:$C$116)>100,100,\nFORECAST($C102,R$105:R$116,$C$105:$C$116))))","v":0.12264960968430216},{"$f":"IF(MAX(C105:C116)-MIN(C105:C116)<5,AVERAGEIF(C105:C116,\">0\",S105:S116),\nIF(FORECAST($C102,S$105:S$116,$C$105:$C$116)<0,0,\nIF(FORECAST($C102,S$105:S$116,$C$105:$C$116)>100,100,\nFORECAST($C102,S$105:S$116,$C$105:$C$116))))","v":99.945848016715857},null,null,null,{"$f":"IF(MAX(C105:C116)-MIN(C105:C116)<5,AVERAGEIF(C105:C116,\">0\",W105:W116),\nIF(FORECAST($C102,W$105:W$116,$C$105:$C$116)<0,0,\nIF(FORECAST($C102,W$105:W$116,$C$105:$C$116)>100,100,\nFORECAST($C102,W$105:W$116,$C$105:$C$116))))","v":0},{"$f":"IF(MAX(C105:C116)-MIN(C105:C116)<5,AVERAGEIF(C105:C116,\">0\",X105:X116),\nIF(FORECAST($C102,X$105:X$116,$C$105:$C$116)<0,0,\nIF(FORECAST($C102,X$105:X$116,$C$105:$C$116)>100,100,\nFORECAST($C102,X$105:X$116,$C$105:$C$116))))","v":99.7614316143313},null,null,null,{"$f":"IF(MAX(C105:C116)-MIN(C105:C116)<5,AVERAGEIF(C105:C116,\">0\",AB105:AB116),\nIF(FORECAST($C102,AB$105:AB$116,$C$105:$C$116)<0,0,\nIF(FORECAST($C102,AB$105:AB$116,$C$105:$C$116)>100,100,\nFORECAST($C102,AB$105:AB$116,$C$105:$C$116))))","v":0}]
[]
[null,"Survey","Year","Improved","Not shared",null,null,"Open defecation","Improved","Not shared",null,null,"Open defecation","Improved","Not shared",null,null,"Open defecation","Improved","Not shared",null,null,"Open defecation","Improved","Not shared",null,null,"Open defecation"]
[null,"SLC97",1997,{"$f":"IF(ISERROR(INDIRECT(CONCATENATE($B105,\"!C122\"))),\"\",INDIRECT(CONCATENATE($B105,\"!C122\")))","v":96.050147554150058},{"$f":"IF(ISERROR(INDIRECT(CONCATENATE($B105,\"!C129\"))),\"\",INDIRECT(CONCATENATE($B105,\"!C129\")))","v":"N/A"},null,null,{"$f":"IF(ISERROR(INDIRECT(CONCATENATE($B105,\"!C127\"))),\"\",INDIRECT(CONCATENATE($B105,\"!C127\")))","v":2.9829232254563891},{"$f":"IF(ISERROR(INDIRECT(CONCATENATE($B105,\"!D122\"))),\"\",INDIRECT(CONCATENATE($B105,\"!D122\")))","v":94.098477589788303},{"$f":"IF(ISERROR(INDIRECT(CONCATENATE($B105,\"!D129\"))),\"\",INDIRECT(CONCATENATE($B105,\"!D129\")))","v":"N/A"},null,null,{"$f":"IF(ISERROR(INDIRECT(CONCATENATE($B105,\"!D127\"))),\"\",INDIRECT(CONCATENATE($B105,\"!D127\")))","v":4.7109980812382624},{"$f":"IF(ISERROR(INDIRECT(CONCATENATE($B105,\"!E122\"))),\"\",INDIRECT(CONCATENATE($B105,\"!E122\")))","v":98.182857518798386},{"$f":"IF(ISERROR(INDIRECT(CONCATENATE($B105,\"!E129\"))),\"\",INDIRECT(CONCATENATE($B105,\"!E129\")))","v":"N/A"},null,null,{"$f":"IF(ISERROR(INDIRECT(CONCATENATE($B105,\"!E127\"))),\"\",INDIRECT(CONCATENATE($B105,\"!E127\")))","v":0.64921262771167287},{"$f":"IF(ISERROR(INDIRECT(CONCATENATE($B105,\"!F122\"))),\"\",INDIRECT(CONCATENATE($B105,\"!F122\")))","v":98.8814209829589},{"$f":"IF(ISERROR(INDIRECT(CONCATENATE($B105,\"!F129\"))),\"\",INDIRECT(CONCATENATE($B105,\"!F129\")))","v":"N/A"},null,null,{"$f":"IF(ISERROR(INDIRECT(CONCATENATE($B105,\"!F127\"))),\"\",INDIRECT(CONCATENATE($B105,\"!F127\")))","v":0.55928950852055337},{"$f":"IF(ISERROR(INDIRECT(CONCATENATE($B105,\"!G122\"))),\"\",INDIRECT(CONCATENATE($B105,\"!G122\")))","v":100},{"$f":"IF(ISERROR(INDIRECT(CONCATENATE($B105,\"!G129\"))),\"\",INDIRECT(CONCATENATE($B105,\"!G129\")))","v":"N/A"},null,null,{"$f":"IF(ISERROR(INDIRECT(CONCATENATE($B105,\"!G2127\"))),\"\",INDIRECT(CONCATENATE($B105,\"!G127\")))","v":0}]
[null,"SLC07",2007,92.538179072193174,"N/A",null,null,5.5720412418817107,96.824048609791873,"N/A",null,null,1.6000427546186673,99.257017934272724,"N/A",null,null,0.40117757229648288,99.817748232023206,"N/A",null,null,0.18225176797680742,99.999999999999986,"N/A",null,null,0]
[null,"MICS11",2011,97.126589386503468,78.004690199110783,null,null,0.99321628066849599,98.701164653615791,84.013527525587293,null,null,0.17084957857340693,99.338241192330742,84.459112107823913,null,null,0.13878386480268454,99.646660872775001,94.866233702316933,null,null,0,99.699865579320019,99.17673811814862,null,null,0]
[null,null,null,"","",null,null,"","","",null,null,"","","",null,null,"","","",null,null,"","","",null,null,""]
[null,null,null,"","",null,null,"","","",null,null,"","","",null,null,"","","",null,null,"","","",null,null,""]
[null,null,null,"","",null,null,"","","",null,null,"","","",null,null,"","","",null,null,"","","",null,null,""]
[null,null,null,"","",null,null,"","","",null,null,"","","",null,null,"","","",null,null,"","","",null,null,""]
[null,null,null,"","",null,null,"","","",null,null,"","","",null,null,"","","",null,null,"","","",null,null,""]
[null,null,null,"","",null,null,"","","",null,null,"","","",null,null,"","","",null,null,"","","",null,null,""]
[null,null,null,"","",null,null,"","","",null,null,"","","",null,null,"","","",null,null,"","","",null,null,""]
[null,null,null,"","",null,null,"","","",null,null,"","","",null,null,"","","",null,null,"","","",null,null,""]
[null,null,null,"","",null,null,"","","",null,null,"","","",null,null,"","","",null,null,"","","",null,null,""]
[]
[null,{"$f":"CONCATENATE(\"National use of sanitation facilities, \",C99,\"–\",C100)","v":"National use of sanitation facilities, 2000–2017"},null,null,null,null,null,null,null,null,null,null,null,null,null,null,null,null,"Data points used for regression"]
[]
[]
[]
[]
[]
[]
[]
[]
[]
[]
[]
[]
[]
[]
[]
[]
[]
[]
[]
[]
[]
[]
[]
[]
[]
[]
[]
[]
[]
[]
[]
[]
[]
[]
[]
[]
[]
[]
[]
[]
[]
[]
[]
[]
[]
[]
[]
[]
[]
[]
[]
[]
[]
[]
[]
[]
[]
[]
[]
[]
[]
[]
[]
[]
[]
[]
[]
[]
[]
[]
[]
[]
[]
[]
[]
[]
[]
[]
["URBAN",null,null,"Poorest",null,null,null,null,"Poor",null,null,null,null,"Middle",null,null,null,null,"Rich",null,null,null,null,"Richest"]
[null,null,null,"Improved","Basic","Limited","Unimproved","Open defecation","Improved","Basic","Limited","Unimproved","Open defecation","Improved","Basic","Limited","Unimproved","Open defecation","Improved","Basic","Limited","Unimproved","Open defecation","Improved","Basic","Limited","Unimproved","Open defecation"]
["Forecast period:",null,2000,{"$f":"IF((D201+H201)>100,D201*100/(D201+H201),D201)","v":95.646776007934193},{"$f":"D199*AVERAGEIF(E205:E216,\">0\")/100","v":65.398331298050181},{"$f":"D199*(100-AVERAGEIF(E205:E216,\">0\"))/100","v":30.248444709884012},{"$f":"100-(E199+F199+H199)","v":1.3324160489715382},{"$f":"IF((D201+H201)>100,H201*100/(D201+H201),H201)","v":3.0208079430942654},{"$f":"IF((I201+M201)>100,I201*100/(I201+M201),I201)","v":96.418124916910841},{"$f":"I199*AVERAGEIF(J205:J216,\">0\")/100","v":80.747915951247975},{"$f":"I199*(100-AVERAGEIF(J205:J216,\">0\"))/100","v":15.670208965662875},{"$f":"100-(J199+K199+M199)","v":1.2107006787987444},{"$f":"IF((I201+M201)>100,M201*100/(I201+M201),M201)","v":2.3711744042904002},{"$f":"IF((N201+R201)>100,N201*100/(N201+R201),N201)","v":98.888712453857224},{"$f":"N199*AVERAGEIF(O205:O216,\">0\")/100","v":91.658327120584829},{"$f":"N199*(100-AVERAGEIF(O205:O216,\">0\"))/100","v":7.2303853332723929},{"$f":"100-(O199+P199+R199)","v":0.33707467834825877},{"$f":"IF((N201+R201)>100,R201*100/(N201+R201),R201)","v":0.77421286779451748},{"$f":"IF((S201+W201)>100,S201*100/(S201+W201),S201)","v":98.844711486474267},{"$f":"S199*AVERAGEIF(T205:T216,\">0\")/100","v":98.122375474530855},{"$f":"S199*(100-AVERAGEIF(T205:T216,\">0\"))/100","v":0.72233601194341157},{"$f":"100-(T199+U199+W199)","v":0.58614864557249291},{"$f":"IF((S201+W201)>100,W201*100/(S201+W201),W201)","v":0.56913986795323979},{"$f":"IF((X201+AB201)>100,X201*100/(X201+AB201),X201)","v":100},{"$f":"X199*AVERAGEIF(Y205:Y216,\">0\")/100","v":99.772656178099169},{"$f":"X199*(100-AVERAGEIF(Y205:Y216,\">0\"))/100","v":0.22734382190083124},{"$f":"100-(Y199+Z199+AB199)","v":0},{"$f":"IF((X201+AB201)>100,AB201*100/(X201+AB201),AB201)","v":0}]
[null,null,2017,{"$f":"IF((D202+H202)>100,D202*100/(D202+H202),D202)","v":94.011991556184711},{"$f":"D200*AVERAGEIF(E205:E216,\">0\")/100","v":64.280550023670955},{"$f":"D200*(100-AVERAGEIF(E205:E216,\">0\"))/100","v":29.731441532513763},{"$f":"100-(E200+F200+H200)","v":3.0383251614822342},{"$f":"IF((D202+H202)>100,H202*100/(D202+H202),H202)","v":2.9496832823330585},{"$f":"IF((I202+M202)>100,I202*100/(I202+M202),I202)","v":98.060587096506481},{"$f":"I200*AVERAGEIF(J205:J216,\">0\")/100","v":82.123439465580816},{"$f":"I200*(100-AVERAGEIF(J205:J216,\">0\"))/100","v":15.937147630925672},{"$f":"100-(J200+K200+M200)","v":1.939412903493519},{"$f":"IF((I202+M202)>100,M202*100/(I202+M202),M202)","v":0},{"$f":"IF((N202+R202)>100,N202*100/(N202+R202),N202)","v":99.978154469833086},{"$f":"N200*AVERAGEIF(O205:O216,\">0\")/100","v":92.668113072907943},{"$f":"N200*(100-AVERAGEIF(O205:O216,\">0\"))/100","v":7.3100413969251399},{"$f":"100-(O200+P200+R200)","v":2.1845530166913818E-2},{"$f":"IF((N202+R202)>100,R202*100/(N202+R202),R202)","v":0},{"$f":"IF((S202+W202)>100,S202*100/(S202+W202),S202)","v":100},{"$f":"S200*AVERAGEIF(T205:T216,\">0\")/100","v":99.269221386677557},{"$f":"S200*(100-AVERAGEIF(T205:T216,\">0\"))/100","v":0.73077861332242833},{"$f":"100-(T200+U200+W200)","v":0},{"$f":"IF((S202+W202)>100,W202*100/(S202+W202),W202)","v":0},{"$f":"IF((X202+AB202)>100,X202*100/(X202+AB202),X202)","v":100},{"$f":"X200*AVERAGEIF(Y205:Y216,\">0\")/100","v":99.772656178099169},{"$f":"X200*(100-AVERAGEIF(Y205:Y216,\">0\"))/100","v":0.22734382190083124},{"$f":"100-(Y200+Z200+AB200)","v":0},{"$f":"IF((X202+AB202)>100,AB202*100/(X202+AB202),AB202)","v":0}]
["Regression period:",null,{"$f":"MinRegYear(C199,C205:C216)","v":2000},{"$f":"IF(MAX(C205:C216)-MIN(C205:C216)<5,AVERAGEIF(C205:C216,\">0\",D205:D216),\nIF(FORECAST($C201,D$205:D$216,$C$205:$C$216)<0,0,\nIF(FORECAST($C201,D$205:D$216,$C$205:$C$216)>100,100,\nFORECAST($C201,D$205:D$216,$C$205:$C$216))))","v":95.646776007934193},null,null,null,{"$f":"IF(MAX(C205:C216)-MIN(C205:C216)<5,AVERAGEIF(C205:C216,\">0\",H205:H216),\nIF(FORECAST($C201,H$205:H$216,$C$205:$C$216)<0,0,\nIF(FORECAST($C201,H$205:H$216,$C$205:$C$216)>100,100,\nFORECAST($C201,H$205:H$216,$C$205:$C$216))))","v":3.0208079430942654},{"$f":"IF(MAX(C205:C216)-MIN(C205:C216)<5,AVERAGEIF(C205:C216,\">0\",I205:I216),\nIF(FORECAST($C201,I$205:I$216,$C$205:$C$216)<0,0,\nIF(FORECAST($C201,I$205:I$216,$C$205:$C$216)>100,100,\nFORECAST($C201,I$205:I$216,$C$205:$C$216))))","v":96.418124916910841},null,null,null,{"$f":"IF(MAX(C205:C216)-MIN(C205:C216)<5,AVERAGEIF(C205:C216,\">0\",M205:M216),\nIF(FORECAST($C201,M$205:M$216,$C$205:$C$216)<0,0,\nIF(FORECAST($C201,M$205:M$216,$C$205:$C$216)>100,100,\nFORECAST($C201,M$205:M$216,$C$205:$C$216))))","v":2.3711744042904002},{"$f":"IF(MAX(C205:C216)-MIN(C205:C216)<5,AVERAGEIF(C205:C216,\">0\",N205:N216),\nIF(FORECAST($C201,N$205:N$216,$C$205:$C$216)<0,0,\nIF(FORECAST($C201,N$205:N$216,$C$205:$C$216)>100,100,\nFORECAST($C201,N$205:N$216,$C$205:$C$216))))","v":98.888712453857224},null,null,null,{"$f":"IF(MAX(C205:C216)-MIN(C205:C216)<5,AVERAGEIF(C205:C216,\">0\",R205:R216),\nIF(FORECAST($C201,R$205:R$216,$C$205:$C$216)<0,0,\nIF(FORECAST($C201,R$205:R$216,$C$205:$C$216)>100,100,\nFORECAST($C201,R$205:R$216,$C$205:$C$216))))","v":0.77421286779451748},{"$f":"IF(MAX(C205:C216)-MIN(C205:C216)<5,AVERAGEIF(C205:C216,\">0\",S205:S216),\nIF(FORECAST($C201,S$205:S$216,$C$205:$C$216)<0,0,\nIF(FORECAST($C201,S$205:S$216,$C$205:$C$216)>100,100,\nFORECAST($C201,S$205:S$216,$C$205:$C$216))))","v":98.844711486474267},null,null,null,{"$f":"IF(MAX(C205:C216)-MIN(C205:C216)<5,AVERAGEIF(C205:C216,\">0\",W205:W216),\nIF(FORECAST($C201,W$205:W$216,$C$205:$C$216)<0,0,\nIF(FORECAST($C201,W$205:W$216,$C$205:$C$216)>100,100,\nFORECAST($C201,W$205:W$216,$C$205:$C$216))))","v":0.56913986795323979},{"$f":"IF(MAX(C205:C216)-MIN(C205:C216)<5,AVERAGEIF(C205:C216,\">0\",X205:X216),\nIF(FORECAST($C201,X$205:X$216,$C$205:$C$216)<0,0,\nIF(FORECAST($C201,X$205:X$216,$C$205:$C$216)>100,100,\nFORECAST($C201,X$205:X$216,$C$205:$C$216))))","v":100},null,null,null,{"$f":"IF(MAX(C205:C216)-MIN(C205:C216)<5,AVERAGEIF(C205:C216,\">0\",AB205:AB216),\nIF(FORECAST($C201,AB$205:AB$216,$C$205:$C$216)<0,0,\nIF(FORECAST($C201,AB$205:AB$216,$C$205:$C$216)>100,100,\nFORECAST($C201,AB$205:AB$216,$C$205:$C$216))))","v":0}]
[null,null,{"$f":"MaxRegYear(C200,C205:C216)","v":2013},{"$f":"IF(MAX(C205:C216)-MIN(C205:C216)<5,AVERAGEIF(C205:C216,\">0\",D205:D216),\nIF(FORECAST($C202,D$205:D$216,$C$205:$C$216)<0,0,\nIF(FORECAST($C202,D$205:D$216,$C$205:$C$216)>100,100,\nFORECAST($C202,D$205:D$216,$C$205:$C$216))))","v":94.011991556184711},null,null,null,{"$f":"IF(MAX(C205:C216)-MIN(C205:C216)<5,AVERAGEIF(C205:C216,\">0\",H205:H216),\nIF(FORECAST($C202,H$205:H$216,$C$205:$C$216)<0,0,\nIF(FORECAST($C202,H$205:H$216,$C$205:$C$216)>100,100,\nFORECAST($C202,H$205:H$216,$C$205:$C$216))))","v":2.9496832823330585},{"$f":"IF(MAX(C205:C216)-MIN(C205:C216)<5,AVERAGEIF(C205:C216,\">0\",I205:I216),\nIF(FORECAST($C202,I$205:I$216,$C$205:$C$216)<0,0,\nIF(FORECAST($C202,I$205:I$216,$C$205:$C$216)>100,100,\nFORECAST($C202,I$205:I$216,$C$205:$C$216))))","v":98.060587096506481},null,null,null,{"$f":"IF(MAX(C205:C216)-MIN(C205:C216)<5,AVERAGEIF(C205:C216,\">0\",M205:M216),\nIF(FORECAST($C202,M$205:M$216,$C$205:$C$216)<0,0,\nIF(FORECAST($C202,M$205:M$216,$C$205:$C$216)>100,100,\nFORECAST($C202,M$205:M$216,$C$205:$C$216))))","v":0},{"$f":"IF(MAX(C205:C216)-MIN(C205:C216)<5,AVERAGEIF(C205:C216,\">0\",N205:N216),\nIF(FORECAST($C202,N$205:N$216,$C$205:$C$216)<0,0,\nIF(FORECAST($C202,N$205:N$216,$C$205:$C$216)>100,100,\nFORECAST($C202,N$205:N$216,$C$205:$C$216))))","v":99.978154469833086},null,null,null,{"$f":"IF(MAX(C205:C216)-MIN(C205:C216)<5,AVERAGEIF(C205:C216,\">0\",R205:R216),\nIF(FORECAST($C202,R$205:R$216,$C$205:$C$216)<0,0,\nIF(FORECAST($C202,R$205:R$216,$C$205:$C$216)>100,100,\nFORECAST($C202,R$205:R$216,$C$205:$C$216))))","v":0},{"$f":"IF(MAX(C205:C216)-MIN(C205:C216)<5,AVERAGEIF(C205:C216,\">0\",S205:S216),\nIF(FORECAST($C202,S$205:S$216,$C$205:$C$216)<0,0,\nIF(FORECAST($C202,S$205:S$216,$C$205:$C$216)>100,100,\nFORECAST($C202,S$205:S$216,$C$205:$C$216))))","v":100},null,null,null,{"$f":"IF(MAX(C205:C216)-MIN(C205:C216)<5,AVERAGEIF(C205:C216,\">0\",W205:W216),\nIF(FORECAST($C202,W$205:W$216,$C$205:$C$216)<0,0,\nIF(FORECAST($C202,W$205:W$216,$C$205:$C$216)>100,100,\nFORECAST($C202,W$205:W$216,$C$205:$C$216))))","v":0},{"$f":"IF(MAX(C205:C216)-MIN(C205:C216)<5,AVERAGEIF(C205:C216,\">0\",X205:X216),\nIF(FORECAST($C202,X$205:X$216,$C$205:$C$216)<0,0,\nIF(FORECAST($C202,X$205:X$216,$C$205:$C$216)>100,100,\nFORECAST($C202,X$205:X$216,$C$205:$C$216))))","v":100},null,null,null,{"$f":"IF(MAX(C205:C216)-MIN(C205:C216)<5,AVERAGEIF(C205:C216,\">0\",AB205:AB216),\nIF(FORECAST($C202,AB$205:AB$216,$C$205:$C$216)<0,0,\nIF(FORECAST($C202,AB$205:AB$216,$C$205:$C$216)>100,100,\nFORECAST($C202,AB$205:AB$216,$C$205:$C$216))))","v":0}]
[]
[null,"Survey","Year","Improved","Not shared",null,null,"Open defecation","Improved","Not shared",null,null,"Open defecation","Improved","Not shared",null,null,"Open defecation","Improved","Not shared",null,null,"Open defecation","Improved","Not shared",null,null,"Open defecation"]
[null,"SLC97",1997,{"$f":"IF(ISERROR(INDIRECT(CONCATENATE($B205,\"!H122\"))),\"\",INDIRECT(CONCATENATE($B205,\"!H122\")))","v":96.876204327799528},{"$f":"IF(ISERROR(INDIRECT(CONCATENATE($B205,\"!H129\"))),\"\",INDIRECT(CONCATENATE($B205,\"!H129\")))","v":"N/A"},null,null,{"$f":"IF(ISERROR(INDIRECT(CONCATENATE($B205,\"!H127\"))),\"\",INDIRECT(CONCATENATE($B205,\"!H127\")))","v":2.2721315826003217},{"$f":"IF(ISERROR(INDIRECT(CONCATENATE($B205,\"!I122\"))),\"\",INDIRECT(CONCATENATE($B205,\"!I122\")))","v":96.169870289434641},{"$f":"IF(ISERROR(INDIRECT(CONCATENATE($B205,\"!I129\"))),\"\",INDIRECT(CONCATENATE($B205,\"!I129\")))","v":"N/A"},null,null,{"$f":"IF(ISERROR(INDIRECT(CONCATENATE($B205,\"!I127\"))),\"\",INDIRECT(CONCATENATE($B205,\"!I127\")))","v":2.8861122639435215},{"$f":"IF(ISERROR(INDIRECT(CONCATENATE($B205,\"!J122\"))),\"\",INDIRECT(CONCATENATE($B205,\"!J122\")))","v":98.579403618544958},{"$f":"IF(ISERROR(INDIRECT(CONCATENATE($B205,\"!J129\"))),\"\",INDIRECT(CONCATENATE($B205,\"!J129\")))","v":"N/A"},null,null,{"$f":"IF(ISERROR(INDIRECT(CONCATENATE($B205,\"!J127\"))),\"\",INDIRECT(CONCATENATE($B205,\"!J127\")))","v":0.97198699819498535},{"$f":"IF(ISERROR(INDIRECT(CONCATENATE($B205,\"!K122\"))),\"\",INDIRECT(CONCATENATE($B205,\"!K122\")))","v":98.390848141874841},{"$f":"IF(ISERROR(INDIRECT(CONCATENATE($B205,\"!K129\"))),\"\",INDIRECT(CONCATENATE($B205,\"!K129\")))","v":"N/A"},null,null,{"$f":"IF(ISERROR(INDIRECT(CONCATENATE($B205,\"!K127\"))),\"\",INDIRECT(CONCATENATE($B205,\"!K127\")))","v":0.79273053036344343},{"$f":"IF(ISERROR(INDIRECT(CONCATENATE($B205,\"!L122\"))),\"\",INDIRECT(CONCATENATE($B205,\"!L122\")))","v":100},{"$f":"IF(ISERROR(INDIRECT(CONCATENATE($B205,\"!L129\"))),\"\",INDIRECT(CONCATENATE($B205,\"!L129\")))","v":"N/A"},null,null,{"$f":"IF(ISERROR(INDIRECT(CONCATENATE($B205,\"!L2127\"))),\"\",INDIRECT(CONCATENATE($B205,\"!L127\")))","v":0}]
[null,"SLC07",2007,91.783911163876525,"N/A",null,null,5.660324151951091,96.844814757032481,"N/A",null,null,1.2610441488548616,99.677982065456689,"N/A",null,null,0.32201793454331057,100,"N/A",null,null,0,100,"N/A",null,null,0]
[null,"MICS11",2011,96.393922780107857,68.374841293788293,null,null,1.0479011784684558,98.134838373029567,83.747652239486285,null,null,0,99.665800157542208,92.688361336845006,null,null,0,100,99.269221386677572,null,null,0,100,99.772656178099169,null,null,0]
[null,null,null,"","",null,null,"","","",null,null,"","","",null,null,"","","",null,null,"","","",null,null,""]
[null,null,null,"","",null,null,"","","",null,null,"","","",null,null,"","","",null,null,"","","",null,null,""]
[null,null,null,"","",null,null,"","","",null,null,"","","",null,null,"","","",null,null,"","","",null,null,""]
[null,null,null,"","",null,null,"","","",null,null,"","","",null,null,"","","",null,null,"","","",null,null,""]
[null,null,null,"","",null,null,"","","",null,null,"","","",null,null,"","","",null,null,"","","",null,null,""]
[null,null,null,"","",null,null,"","","",null,null,"","","",null,null,"","","",null,null,"","","",null,null,""]
[null,null,null,"","",null,null,"","","",null,null,"","","",null,null,"","","",null,null,"","","",null,null,""]
[null,null,null,"","",null,null,"","","",null,null,"","","",null,null,"","","",null,null,"","","",null,null,""]
[null,null,null,"","",null,null,"","","",null,null,"","","",null,null,"","","",null,null,"","","",null,null,""]
[]
[null,{"$f":"CONCATENATE(\"Urban use of sanitation facilities, \",C199,\"–\",C200)","v":"Urban use of sanitation facilities, 2000–2017"},null,null,null,null,null,null,null,null,null,null,null,null,null,null,null,null,"Data points used for regression"]
[]
[]
[]
[]
[]
[]
[]
[]
[]
[]
[]
[]
[]
[]
[]
[]
[]
[]
[]
[]
[]
[]
[]
[]
[]
[]
[]
[]
[]
[]
[]
[]
[]
[]
[]
[]
[]
[]
[]
[]
[]
[]
[]
[]
[]
[]
[]
[]
[]
[]
[]
[]
[]
[]
[]
[]
[]
[]
[]
[]
[]
[]
[]
[]
[]
[]
[]
[]
[]
[]
[]
[]
[]
[]
[]
[]
[]
[]
["RURAL",null,null,"Poorest",null,null,null,null,"Poor",null,null,null,null,"Middle",null,null,null,null,"Rich",null,null,null,null,"Richest"]
[null,null,null,"Improved","Basic","Limited","Unimproved","Open defecation","Improved","Basic","Limited","Unimproved","Open defecation","Improved","Basic","Limited","Unimproved","Open defecation","Improved","Basic","Limited","Unimproved","Open defecation","Improved","Basic","Limited","Unimproved","Open defecation"]
["Forecast period:",null,2000,{"$f":"IF((D301+H301)>100,D301*100/(D301+H301),D301)","v":90.890804557347565},{"$f":"D299*AVERAGEIF(E305:E316,\">0\")/100","v":70.672537605490973},{"$f":"D299*(100-AVERAGEIF(E305:E316,\">0\"))/100","v":20.218266951856581},{"$f":"100-(E299+F299+H299)","v":1.6947224205489562},{"$f":"IF((D301+H301)>100,H301*100/(D301+H301),H301)","v":7.4144730221034933},{"$f":"IF((I301+M301)>100,I301*100/(I301+M301),I301)","v":97.290372737428541},{"$f":"I299*AVERAGEIF(J305:J316,\">0\")/100","v":79.061910026234685},{"$f":"I299*(100-AVERAGEIF(J305:J316,\">0\"))/100","v":18.22846271119386},{"$f":"100-(J299+K299+M299)","v":1.2387416724564986},{"$f":"IF((I301+M301)>100,M301*100/(I301+M301),M301)","v":1.4708855901149605},{"$f":"IF((N301+R301)>100,N301*100/(N301+R301),N301)","v":97.610341831856317},{"$f":"N299*AVERAGEIF(O305:O316,\">0\")/100","v":86.736885474852897},{"$f":"N299*(100-AVERAGEIF(O305:O316,\">0\"))/100","v":10.873456357003425},{"$f":"100-(O299+P299+R299)","v":1.3266984517124172},{"$f":"IF((N301+R301)>100,R301*100/(N301+R301),R301)","v":1.0629597164312656},{"$f":"IF((S301+W301)>100,S301*100/(S301+W301),S301)","v":99.9750048467439},{"$f":"S299*AVERAGEIF(T305:T316,\">0\")/100","v":97.291402456584152},{"$f":"S299*(100-AVERAGEIF(T305:T316,\">0\"))/100","v":2.6836023901597512},{"$f":"100-(T299+U299+W299)","v":2.4995153256099911E-2},{"$f":"IF((S301+W301)>100,W301*100/(S301+W301),W301)","v":0},{"$f":"IF((X301+AB301)>100,X301*100/(X301+AB301),X301)","v":99.980545233177693},{"$f":"X299*AVERAGEIF(Y305:Y316,\">0\")/100","v":98.994245501898163},{"$f":"X299*(100-AVERAGEIF(Y305:Y316,\">0\"))/100","v":0.98629973127952497},{"$f":"100-(Y299+Z299+AB299)","v":1.9454766822306624E-2},{"$f":"IF((X301+AB301)>100,AB301*100/(X301+AB301),AB301)","v":0}]
[null,null,2017,{"$f":"IF((D302+H302)>100,D302*100/(D302+H302),D302)","v":96.204440611150062},{"$f":"D300*AVERAGEIF(E305:E316,\">0\")/100","v":74.804178266646204},{"$f":"D300*(100-AVERAGEIF(E305:E316,\">0\"))/100","v":21.400262344503854},{"$f":"100-(E300+F300+H300)","v":1.7189676310074447},{"$f":"IF((D302+H302)>100,H302*100/(D302+H302),H302)","v":2.0765917578424933},{"$f":"IF((I302+M302)>100,I302*100/(I302+M302),I302)","v":98.717695733713825},{"$f":"I300*AVERAGEIF(J305:J316,\">0\")/100","v":80.221807754401866},{"$f":"I300*(100-AVERAGEIF(J305:J316,\">0\"))/100","v":18.495887979311952},{"$f":"100-(J300+K300+M300)","v":0.81010882562398479},{"$f":"IF((I302+M302)>100,M302*100/(I302+M302),M302)","v":0.47219544066220465},{"$f":"IF((N302+R302)>100,N302*100/(N302+R302),N302)","v":99.300459174122295},{"$f":"N300*AVERAGEIF(O305:O316,\">0\")/100","v":88.238729558215624},{"$f":"N300*(100-AVERAGEIF(O305:O316,\">0\"))/100","v":11.061729615906675},{"$f":"100-(O300+P300+R300)","v":0.69954082587770472},{"$f":"IF((N302+R302)>100,R302*100/(N302+R302),R302)","v":0},{"$f":"IF((S302+W302)>100,S302*100/(S302+W302),S302)","v":99.557228713749183},{"$f":"S300*AVERAGEIF(T305:T316,\">0\")/100","v":96.884840576899791},{"$f":"S300*(100-AVERAGEIF(T305:T316,\">0\"))/100","v":2.6723881368493867},{"$f":"100-(T300+U300+W300)","v":0.4427712862508173},{"$f":"IF((S302+W302)>100,W302*100/(S302+W302),W302)","v":0},{"$f":"IF((X302+AB302)>100,X302*100/(X302+AB302),X302)","v":99.655372702005025},{"$f":"X300*AVERAGEIF(Y305:Y316,\">0\")/100","v":98.672280770596643},{"$f":"X300*(100-AVERAGEIF(Y305:Y316,\">0\"))/100","v":0.98309193140838902},{"$f":"100-(Y300+Z300+AB300)","v":0.34462729799496117},{"$f":"IF((X302+AB302)>100,AB302*100/(X302+AB302),AB302)","v":0}]
["Regression period:",null,{"$f":"MinRegYear(C299,C305:C316)","v":2000},{"$f":"IF(MAX(C305:C316)-MIN(C305:C316)<5,AVERAGEIF(C305:C316,\">0\",D305:D316),\nIF(FORECAST($C301,D$305:D$316,$C$305:$C$316)<0,0,\nIF(FORECAST($C301,D$305:D$316,$C$305:$C$316)>100,100,\nFORECAST($C301,D$305:D$316,$C$305:$C$316))))","v":90.890804557347565},null,null,null,{"$f":"IF(MAX(C305:C316)-MIN(C305:C316)<5,AVERAGEIF(C305:C316,\">0\",H305:H316),\nIF(FORECAST($C301,H$305:H$316,$C$305:$C$316)<0,0,\nIF(FORECAST($C301,H$305:H$316,$C$305:$C$316)>100,100,\nFORECAST($C301,H$305:H$316,$C$305:$C$316))))","v":7.4144730221034933},{"$f":"IF(MAX(C305:C316)-MIN(C305:C316)<5,AVERAGEIF(C305:C316,\">0\",I305:I316),\nIF(FORECAST($C301,I$305:I$316,$C$305:$C$316)<0,0,\nIF(FORECAST($C301,I$305:I$316,$C$305:$C$316)>100,100,\nFORECAST($C301,I$305:I$316,$C$305:$C$316))))","v":97.290372737428541},null,null,null,{"$f":"IF(MAX(C305:C316)-MIN(C305:C316)<5,AVERAGEIF(C305:C316,\">0\",M305:M316),\nIF(FORECAST($C301,M$305:M$316,$C$305:$C$316)<0,0,\nIF(FORECAST($C301,M$305:M$316,$C$305:$C$316)>100,100,\nFORECAST($C301,M$305:M$316,$C$305:$C$316))))","v":1.4708855901149605},{"$f":"IF(MAX(C305:C316)-MIN(C305:C316)<5,AVERAGEIF(C305:C316,\">0\",N305:N316),\nIF(FORECAST($C301,N$305:N$316,$C$305:$C$316)<0,0,\nIF(FORECAST($C301,N$305:N$316,$C$305:$C$316)>100,100,\nFORECAST($C301,N$305:N$316,$C$305:$C$316))))","v":97.610341831856317},null,null,null,{"$f":"IF(MAX(C305:C316)-MIN(C305:C316)<5,AVERAGEIF(C305:C316,\">0\",R305:R316),\nIF(FORECAST($C301,R$305:R$316,$C$305:$C$316)<0,0,\nIF(FORECAST($C301,R$305:R$316,$C$305:$C$316)>100,100,\nFORECAST($C301,R$305:R$316,$C$305:$C$316))))","v":1.0629597164312656},{"$f":"IF(MAX(C305:C316)-MIN(C305:C316)<5,AVERAGEIF(C305:C316,\">0\",S305:S316),\nIF(FORECAST($C301,S$305:S$316,$C$305:$C$316)<0,0,\nIF(FORECAST($C301,S$305:S$316,$C$305:$C$316)>100,100,\nFORECAST($C301,S$305:S$316,$C$305:$C$316))))","v":99.9750048467439},null,null,null,{"$f":"IF(MAX(C305:C316)-MIN(C305:C316)<5,AVERAGEIF(C305:C316,\">0\",W305:W316),\nIF(FORECAST($C301,W$305:W$316,$C$305:$C$316)<0,0,\nIF(FORECAST($C301,W$305:W$316,$C$305:$C$316)>100,100,\nFORECAST($C301,W$305:W$316,$C$305:$C$316))))","v":0},{"$f":"IF(MAX(C305:C316)-MIN(C305:C316)<5,AVERAGEIF(C305:C316,\">0\",X305:X316),\nIF(FORECAST($C301,X$305:X$316,$C$305:$C$316)<0,0,\nIF(FORECAST($C301,X$305:X$316,$C$305:$C$316)>100,100,\nFORECAST($C301,X$305:X$316,$C$305:$C$316))))","v":99.980545233177693},null,null,null,{"$f":"IF(MAX(C305:C316)-MIN(C305:C316)<5,AVERAGEIF(C305:C316,\">0\",AB305:AB316),\nIF(FORECAST($C301,AB$305:AB$316,$C$305:$C$316)<0,0,\nIF(FORECAST($C301,AB$305:AB$316,$C$305:$C$316)>100,100,\nFORECAST($C301,AB$305:AB$316,$C$305:$C$316))))","v":0}]
[null,null,{"$f":"MaxRegYear(C300,C305:C316)","v":2013},{"$f":"IF(MAX(C305:C316)-MIN(C305:C316)<5,AVERAGEIF(C305:C316,\">0\",D305:D316),\nIF(FORECAST($C302,D$305:D$316,$C$305:$C$316)<0,0,\nIF(FORECAST($C302,D$305:D$316,$C$305:$C$316)>100,100,\nFORECAST($C302,D$305:D$316,$C$305:$C$316))))","v":96.204440611150062},null,null,null,{"$f":"IF(MAX(C305:C316)-MIN(C305:C316)<5,AVERAGEIF(C305:C316,\">0\",H305:H316),\nIF(FORECAST($C302,H$305:H$316,$C$305:$C$316)<0,0,\nIF(FORECAST($C302,H$305:H$316,$C$305:$C$316)>100,100,\nFORECAST($C302,H$305:H$316,$C$305:$C$316))))","v":2.0765917578424933},{"$f":"IF(MAX(C305:C316)-MIN(C305:C316)<5,AVERAGEIF(C305:C316,\">0\",I305:I316),\nIF(FORECAST($C302,I$305:I$316,$C$305:$C$316)<0,0,\nIF(FORECAST($C302,I$305:I$316,$C$305:$C$316)>100,100,\nFORECAST($C302,I$305:I$316,$C$305:$C$316))))","v":98.717695733713825},null,null,null,{"$f":"IF(MAX(C305:C316)-MIN(C305:C316)<5,AVERAGEIF(C305:C316,\">0\",M305:M316),\nIF(FORECAST($C302,M$305:M$316,$C$305:$C$316)<0,0,\nIF(FORECAST($C302,M$305:M$316,$C$305:$C$316)>100,100,\nFORECAST($C302,M$305:M$316,$C$305:$C$316))))","v":0.47219544066220465},{"$f":"IF(MAX(C305:C316)-MIN(C305:C316)<5,AVERAGEIF(C305:C316,\">0\",N305:N316),\nIF(FORECAST($C302,N$305:N$316,$C$305:$C$316)<0,0,\nIF(FORECAST($C302,N$305:N$316,$C$305:$C$316)>100,100,\nFORECAST($C302,N$305:N$316,$C$305:$C$316))))","v":99.300459174122295},null,null,null,{"$f":"IF(MAX(C305:C316)-MIN(C305:C316)<5,AVERAGEIF(C305:C316,\">0\",R305:R316),\nIF(FORECAST($C302,R$305:R$316,$C$305:$C$316)<0,0,\nIF(FORECAST($C302,R$305:R$316,$C$305:$C$316)>100,100,\nFORECAST($C302,R$305:R$316,$C$305:$C$316))))","v":0},{"$f":"IF(MAX(C305:C316)-MIN(C305:C316)<5,AVERAGEIF(C305:C316,\">0\",S305:S316),\nIF(FORECAST($C302,S$305:S$316,$C$305:$C$316)<0,0,\nIF(FORECAST($C302,S$305:S$316,$C$305:$C$316)>100,100,\nFORECAST($C302,S$305:S$316,$C$305:$C$316))))","v":99.557228713749183},null,null,null,{"$f":"IF(MAX(C305:C316)-MIN(C305:C316)<5,AVERAGEIF(C305:C316,\">0\",W305:W316),\nIF(FORECAST($C302,W$305:W$316,$C$305:$C$316)<0,0,\nIF(FORECAST($C302,W$305:W$316,$C$305:$C$316)>100,100,\nFORECAST($C302,W$305:W$316,$C$305:$C$316))))","v":0},{"$f":"IF(MAX(C305:C316)-MIN(C305:C316)<5,AVERAGEIF(C305:C316,\">0\",X305:X316),\nIF(FORECAST($C302,X$305:X$316,$C$305:$C$316)<0,0,\nIF(FORECAST($C302,X$305:X$316,$C$305:$C$316)>100,100,\nFORECAST($C302,X$305:X$316,$C$305:$C$316))))","v":99.655372702005025},null,null,null,{"$f":"IF(MAX(C305:C316)-MIN(C305:C316)<5,AVERAGEIF(C305:C316,\">0\",AB305:AB316),\nIF(FORECAST($C302,AB$305:AB$316,$C$305:$C$316)<0,0,\nIF(FORECAST($C302,AB$305:AB$316,$C$305:$C$316)>100,100,\nFORECAST($C302,AB$305:AB$316,$C$305:$C$316))))","v":0}]
[]
[null,"Survey","Year","Improved","Not shared",null,null,"Open defecation","Improved","Not shared",null,null,"Open defecation","Improved","Not shared",null,null,"Open defecation","Improved","Not shared",null,null,"Open defecation","Improved","Not shared",null,null,"Open defecation"]
[null,"SLC97",1997,{"$f":"IF(ISERROR(INDIRECT(CONCATENATE($B305,\"!M122\"))),\"\",INDIRECT(CONCATENATE($B305,\"!M122\")))","v":90.127138658416797},{"$f":"IF(ISERROR(INDIRECT(CONCATENATE($B305,\"!M129\"))),\"\",INDIRECT(CONCATENATE($B305,\"!M129\")))","v":"N/A"},null,null,{"$f":"IF(ISERROR(INDIRECT(CONCATENATE($B305,\"!M127\"))),\"\",INDIRECT(CONCATENATE($B305,\"!M127\")))","v":8.0963781438039444},{"$f":"IF(ISERROR(INDIRECT(CONCATENATE($B305,\"!N122\"))),\"\",INDIRECT(CONCATENATE($B305,\"!N122\")))","v":96.985372180712062},{"$f":"IF(ISERROR(INDIRECT(CONCATENATE($B305,\"!N129\"))),\"\",INDIRECT(CONCATENATE($B305,\"!N129\")))","v":"N/A"},null,null,{"$f":"IF(ISERROR(INDIRECT(CONCATENATE($B305,\"!N127\"))),\"\",INDIRECT(CONCATENATE($B305,\"!N127\")))","v":1.5313842604768531},{"$f":"IF(ISERROR(INDIRECT(CONCATENATE($B305,\"!O122\"))),\"\",INDIRECT(CONCATENATE($B305,\"!O122\")))","v":97.239970959281749},{"$f":"IF(ISERROR(INDIRECT(CONCATENATE($B305,\"!O129\"))),\"\",INDIRECT(CONCATENATE($B305,\"!O129\")))","v":"N/A"},null,null,{"$f":"IF(ISERROR(INDIRECT(CONCATENATE($B305,\"!O127\"))),\"\",INDIRECT(CONCATENATE($B305,\"!O127\")))","v":1.3645305267010148},{"$f":"IF(ISERROR(INDIRECT(CONCATENATE($B305,\"!P122\"))),\"\",INDIRECT(CONCATENATE($B305,\"!P122\")))","v":100},{"$f":"IF(ISERROR(INDIRECT(CONCATENATE($B305,\"!P129\"))),\"\",INDIRECT(CONCATENATE($B305,\"!P129\")))","v":"N/A"},null,null,{"$f":"IF(ISERROR(INDIRECT(CONCATENATE($B305,\"!P127\"))),\"\",INDIRECT(CONCATENATE($B305,\"!P127\")))","v":0},{"$f":"IF(ISERROR(INDIRECT(CONCATENATE($B305,\"!Q122\"))),\"\",INDIRECT(CONCATENATE($B305,\"!Q122\")))","v":100},{"$f":"IF(ISERROR(INDIRECT(CONCATENATE($B305,\"!Q129\"))),\"\",INDIRECT(CONCATENATE($B305,\"!Q129\")))","v":"N/A"},null,null,{"$f":"IF(ISERROR(INDIRECT(CONCATENATE($B305,\"!Q2127\"))),\"\",INDIRECT(CONCATENATE($B305,\"!Q127\")))","v":0}]
[null,"SLC07",2007,92.133040881427718,"N/A",null,null,6.4649269749909646,97.97359541770561,"N/A",null,null,1.5280183610088076,98.451608293718749,"N/A",null,null,0.30354372388802575,100,"N/A",null,null,0,99.999999999999986,"N/A",null,null,0]
[null,"MICS11",2011,96.543352655816562,77.755431860986704,null,null,1.5230201810603123,98.559061763427934,81.263857668230315,null,null,0.20091936102918728,99.089581637490724,88.860343942105999,null,null,0.25188271270089391,99.442965156007048,97.315726671608004,null,null,0,99.566436625103123,99.013508349070065,null,null,0]
[null,null,null,"","",null,null,"","","",null,null,"","","",null,null,"","","",null,null,"","","",null,null,""]
[null,null,null,"","",null,null,"","","",null,null,"","","",null,null,"","","",null,null,"","","",null,null,""]
[null,null,null,"","",null,null,"","","",null,null,"","","",null,null,"","","",null,null,"","","",null,null,""]
[null,null,null,"","",null,null,"","","",null,null,"","","",null,null,"","","",null,null,"","","",null,null,""]
[null,null,null,"","",null,null,"","","",null,null,"","","",null,null,"","","",null,null,"","","",null,null,""]
[null,null,null,"","",null,null,"","","",null,null,"","","",null,null,"","","",null,null,"","","",null,null,""]
[null,null,null,"","",null,null,"","","",null,null,"","","",null,null,"","","",null,null,"","","",null,null,""]
[null,null,null,"","",null,null,"","","",null,null,"","","",null,null,"","","",null,null,"","","",null,null,""]
[null,null,null,"","",null,null,"","","",null,null,"","","",null,null,"","","",null,null,"","","",null,null,""]
[]
[null,{"$f":"CONCATENATE(\"Rural use of sanitation facilities, \",C299,\"–\",C300)","v":"Rural use of sanitation facilities, 2000–2017"},null,null,null,null,null,null,null,null,null,null,null,null,null,null,null,null,"Data points used for regression"]

{"sheet":"Hygiene","index":3,"n_rows":91,"n_cols":25,"rows_kept":91,"cut":false,"hidden":false,"merged":[[39,22,40,22],[39,23,40,23],[39,24,40,24],[31,4,32,5],[39,16,40,16],[39,17,40,17],[39,18,40,18],[39,19,40,19],[39,20,40,20],[39,21,40,21],[36,24,37,24],[39,6,40,7],[39,8,40,8],[39,9,40,9],[39,10,40,10],[39,11,40,11],[39,12,40,12],[39,13,40,13],[39,14,40,14],[39,15,40,15],[36,18,37,18],[36,12,37,12],[36,13,37,13],[36,14,37,14],[36,15,37,15],[36,16,37,16],[36,17,37,17],[36,19,37,19],[36,20,37,20],[36,21,37,21],[36,22,37,22],[36,23,37,23],[33,20,34,20],[33,21,34,21],[33,22,34,22],[33,23,34,23],[33,24,34,24],[33,15,34,15],[33,16,34,16],[33,17,34,17],[33,18,34,18],[36,6,37,7],[36,8,37,8],[36,9,37,9],[36,10,37,10],[36,11,37,11],[33,10,34,10],[33,11,34,11],[33,12,34,12],[33,13,34,13],[33,14,34,14],[6,1,6,7],[3,1,3,24],[4,1,4,24],[33,1,34,3],[31,6,32,9],[31,10,31,12],[31,13,31,15],[6,10,6,15],[6,18,6,23],[33,19,34,19],[31,16,31,18],[31,19,31,21],[31,22,31,24],[33,6,34,7],[33,8,34,8],[33,9,34,9]]}
[]
[]
[]
[null,"Access to hygiene facilities by wealth quintile (%)"]
[null,{"$f":"IF(ISERROR(INDIRECT(CONCATENATE($E$32,\"!A2\"))),\"\",INDIRECT(CONCATENATE($E$32,\"!A2\")))","v":"Jamaica"}]
[]
[null,{"$f":"CONCATENATE(\"National \",IF(ISERROR(INDIRECT(CONCATENATE($E$32,\"!A2\"))),\"\",INDIRECT(CONCATENATE($E$32,\"!A210\"))))","v":"National Access to hygiene facilities "},null,null,null,null,null,null,null,null,{"$f":"CONCATENATE(\"Urban \",IF(ISERROR(INDIRECT(CONCATENATE($E$32,\"!A2\"))),\"\",INDIRECT(CONCATENATE($E$32,\"!A210\"))))","v":"Urban Access to hygiene facilities "},null,null,null,null,null,null,null,{"$f":"CONCATENATE(\"Rural \",IF(ISERROR(INDIRECT(CONCATENATE($E$32,\"!A2\"))),\"\",INDIRECT(CONCATENATE($E$32,\"!A210\"))))","v":"Rural Access to hygiene facilities "}]
[]
[]
[]
[]
[]
[]
[]
[]
[]
[]
[]
[]
[]
[]
[]
[]
[]
[]
[]
[]
[]
[]
[]
[]
[null,null,null,null,{"$f":"INDEX(B88:B100,A88)","v":"MICS11"},null,{"$f":"IF(ISERROR(INDIRECT(CONCATENATE($E$32,\"!A2\"))),\"\",INDIRECT(CONCATENATE($E$32,\"!A2\")))","v":"Jamaica"},null,null,null,"Poorest",null,null,"Poor",null,null,"Middle",null,null,"Rich",null,null,"Richest"]
[null,null,null,null,null,null,null,null,null,null,"Basic","Limited","No facility","Basic","Limited","No facility","Basic","Limited","No facility","Basic","Limited","No facility","Basic","Limited","No facility"]
[null,">>>  Select Survey :   ",null,null,null,null,"NATIONAL",null,null,{"$f":"IF(ISERROR(INDIRECT(CONCATENATE(#REF!,\"!A2\"))),\"\",INDIRECT(CONCATENATE(#REF!,\"!A210\")))","v":""},{"$f":"IF(ISERROR(INDIRECT(CONCATENATE($E$32,\"!C222\"))),\"\",INDIRECT(CONCATENATE($E$32,\"!C222\")))","v":52.80439641344865},{"$f":"IF(ISERROR(INDIRECT(CONCATENATE($E$32,\"!C223\"))),\"\",INDIRECT(CONCATENATE($E$32,\"!C223\")))","v":24.30003276990448},{"$f":"IF(ISERROR(INDIRECT(CONCATENATE($E$32,\"!C224\"))),\"\",INDIRECT(CONCATENATE($E$32,\"!C224\")))","v":22.895570816647037},{"$f":"IF(ISERROR(INDIRECT(CONCATENATE($E$32,\"!D222\"))),\"\",INDIRECT(CONCATENATE($E$32,\"!D222\")))","v":60.324840068374108},{"$f":"IF(ISERROR(INDIRECT(CONCATENATE($E$32,\"!D223\"))),\"\",INDIRECT(CONCATENATE($E$32,\"!D223\")))","v":18.86547069825734},{"$f":"IF(ISERROR(INDIRECT(CONCATENATE($E$32,\"!D224\"))),\"\",INDIRECT(CONCATENATE($E$32,\"!D224\")))","v":20.809689233368495},{"$f":"IF(ISERROR(INDIRECT(CONCATENATE($E$32,\"!E222\"))),\"\",INDIRECT(CONCATENATE($E$32,\"!E222\")))","v":66.780010809459867},{"$f":"IF(ISERROR(INDIRECT(CONCATENATE($E$32,\"!E223\"))),\"\",INDIRECT(CONCATENATE($E$32,\"!E223\")))","v":16.735562568305497},{"$f":"IF(ISERROR(INDIRECT(CONCATENATE($E$32,\"!E224\"))),\"\",INDIRECT(CONCATENATE($E$32,\"!E224\")))","v":16.484426622234448},{"$f":"IF(ISERROR(INDIRECT(CONCATENATE($E$32,\"!F222\"))),\"\",INDIRECT(CONCATENATE($E$32,\"!F222\")))","v":71.391637916409294},{"$f":"IF(ISERROR(INDIRECT(CONCATENATE($E$32,\"!F223\"))),\"\",INDIRECT(CONCATENATE($E$32,\"!F223\")))","v":13.76899609836142},{"$f":"IF(ISERROR(INDIRECT(CONCATENATE($E$32,\"!F224\"))),\"\",INDIRECT(CONCATENATE($E$32,\"!F224\")))","v":14.839365985229341},{"$f":"IF(ISERROR(INDIRECT(CONCATENATE($E$32,\"!G222\"))),\"\",INDIRECT(CONCATENATE($E$32,\"!G222\")))","v":81.91020626061777},{"$f":"IF(ISERROR(INDIRECT(CONCATENATE($E$32,\"!G223\"))),\"\",INDIRECT(CONCATENATE($E$32,\"!G223\")))","v":6.9005675993806301},{"$f":"IF(ISERROR(INDIRECT(CONCATENATE($E$32,\"!G224\"))),\"\",INDIRECT(CONCATENATE($E$32,\"!G224\")))","v":11.189226140001542}]
[]
[]
[null,null,null,null,null,null,"URBAN",null,null,{"$f":"IF(ISERROR(INDIRECT(CONCATENATE(#REF!,\"!A2\"))),\"\",INDIRECT(CONCATENATE(#REF!,\"!A210\")))","v":""},{"$f":"IF(ISERROR(INDIRECT(CONCATENATE($E$32,\"!H222\"))),\"\",INDIRECT(CONCATENATE($E$32,\"!H222\")))","v":66.586003435913483},{"$f":"IF(ISERROR(INDIRECT(CONCATENATE($E$32,\"!H223\"))),\"\",INDIRECT(CONCATENATE($E$32,\"!H223\")))","v":13.666963468587037},{"$f":"IF(ISERROR(INDIRECT(CONCATENATE($E$32,\"!H224\"))),\"\",INDIRECT(CONCATENATE($E$32,\"!H224\")))","v":19.747033095499493},{"$f":"IF(ISERROR(INDIRECT(CONCATENATE($E$32,\"!I222\"))),\"\",INDIRECT(CONCATENATE($E$32,\"!I222\")))","v":59.121738389811021},{"$f":"IF(ISERROR(INDIRECT(CONCATENATE($E$32,\"!I223\"))),\"\",INDIRECT(CONCATENATE($E$32,\"!I223\")))","v":19.872910797447766},{"$f":"IF(ISERROR(INDIRECT(CONCATENATE($E$32,\"!I224\"))),\"\",INDIRECT(CONCATENATE($E$32,\"!I224\")))","v":21.005350812741259},{"$f":"IF(ISERROR(INDIRECT(CONCATENATE($E$32,\"!J222\"))),\"\",INDIRECT(CONCATENATE($E$32,\"!J222\")))","v":79.27732753235118},{"$f":"IF(ISERROR(INDIRECT(CONCATENATE($E$32,\"!J223\"))),\"\",INDIRECT(CONCATENATE($E$32,\"!J223\")))","v":8.8280855246297119},{"$f":"IF(ISERROR(INDIRECT(CONCATENATE($E$32,\"!J224\"))),\"\",INDIRECT(CONCATENATE($E$32,\"!J224\")))","v":11.894586943019112},{"$f":"IF(ISERROR(INDIRECT(CONCATENATE($E$32,\"!K222\"))),\"\",INDIRECT(CONCATENATE($E$32,\"!K222\")))","v":79.089724937656584},{"$f":"IF(ISERROR(INDIRECT(CONCATENATE($E$32,\"!K223\"))),\"\",INDIRECT(CONCATENATE($E$32,\"!K223\")))","v":5.2733972601089061},{"$f":"IF(ISERROR(INDIRECT(CONCATENATE($E$32,\"!K224\"))),\"\",INDIRECT(CONCATENATE($E$32,\"!K224\")))","v":15.636877802234489},{"$f":"IF(ISERROR(INDIRECT(CONCATENATE($E$32,\"!L222\"))),\"\",INDIRECT(CONCATENATE($E$32,\"!L222\")))","v":87.200101292975134},{"$f":"IF(ISERROR(INDIRECT(CONCATENATE($E$32,\"!L223\"))),\"\",INDIRECT(CONCATENATE($E$32,\"!L223\")))","v":2.9761140233918},{"$f":"IF(ISERROR(INDIRECT(CONCATENATE($E$32,\"!L224\"))),\"\",INDIRECT(CONCATENATE($E$32,\"!L224\")))","v":9.8237846836330451}]
[]
[]
[null,null,null,null,null,null,"RURAL",null,null,{"$f":"IF(ISERROR(INDIRECT(CONCATENATE(#REF!,\"!A2\"))),\"\",INDIRECT(CONCATENATE(#REF!,\"!A210\")))","v":""},{"$f":"IF(ISERROR(INDIRECT(CONCATENATE($E$32,\"!M222\"))),\"\",INDIRECT(CONCATENATE($E$32,\"!M222\")))","v":44.372457475879287},{"$f":"IF(ISERROR(INDIRECT(CONCATENATE($E$32,\"!M223\"))),\"\",INDIRECT(CONCATENATE($E$32,\"!M223\")))","v":30.235636763412799},{"$f":"IF(ISERROR(INDIRECT(CONCATENATE($E$32,\"!M224\"))),\"\",INDIRECT(CONCATENATE($E$32,\"!M224\")))","v":25.391905760707857},{"$f":"IF(ISERROR(INDIRECT(CONCATENATE($E$32,\"!N222\"))),\"\",INDIRECT(CONCATENATE($E$32,\"!N222\")))","v":56.828210602514929},{"$f":"IF(ISERROR(INDIRECT(CONCATENATE($E$32,\"!N223\"))),\"\",INDIRECT(CONCATENATE($E$32,\"!N223\")))","v":20.429644931766042},{"$f":"IF(ISERROR(INDIRECT(CONCATENATE($E$32,\"!N224\"))),\"\",INDIRECT(CONCATENATE($E$32,\"!N224\")))","v":22.742144465719001},{"$f":"IF(ISERROR(INDIRECT(CONCATENATE($E$32,\"!O222\"))),\"\",INDIRECT(CONCATENATE($E$32,\"!O222\")))","v":64.525321574247258},{"$f":"IF(ISERROR(INDIRECT(CONCATENATE($E$32,\"!O223\"))),\"\",INDIRECT(CONCATENATE($E$32,\"!O223\")))","v":17.750846526918618},{"$f":"IF(ISERROR(INDIRECT(CONCATENATE($E$32,\"!O224\"))),\"\",INDIRECT(CONCATENATE($E$32,\"!O224\")))","v":17.723831898834145},{"$f":"IF(ISERROR(INDIRECT(CONCATENATE($E$32,\"!P222\"))),\"\",INDIRECT(CONCATENATE($E$32,\"!P222\")))","v":69.196133666332599},{"$f":"IF(ISERROR(INDIRECT(CONCATENATE($E$32,\"!P223\"))),\"\",INDIRECT(CONCATENATE($E$32,\"!P223\")))","v":14.466713721673733},{"$f":"IF(ISERROR(INDIRECT(CONCATENATE($E$32,\"!P224\"))),\"\",INDIRECT(CONCATENATE($E$32,\"!P224\")))","v":16.337152611993734},{"$f":"IF(ISERROR(INDIRECT(CONCATENATE($E$32,\"!Q222\"))),\"\",INDIRECT(CONCATENATE($E$32,\"!Q222\")))","v":82.780552105592022},{"$f":"IF(ISERROR(INDIRECT(CONCATENATE($E$32,\"!Q223\"))),\"\",INDIRECT(CONCATENATE($E$32,\"!Q223\")))","v":8.6738925769372859},{"$f":"IF(ISERROR(INDIRECT(CONCATENATE($E$32,\"!Q224\"))),\"\",INDIRECT(CONCATENATE($E$32,\"!Q224\")))","v":8.5455553174706687}]
[]
[]
[]
[]
[]
[]
[]
[]
[]
[]
[]
[]
[]
[]
[]
[]
[]
[]
[]
[]
[]
[]
[]
[]
[]
[]
[]
[]
[]
[]
[]
[]
[]
[]
[]
[]
[]
[]
[]
[]
[]
[]
[]
[]
[]
[]
[]
[3,"SLC97"]
[null,"SLC07"]
[null,"MICS11"]
[null,"Template"]

{"sheet":"SLC97","index":4,"n_rows":1072,"n_cols":70,"rows_kept":1072,"cut":false,"hidden":false,"merged":[[340,52,341,52],[342,52,343,52],[344,52,345,52],[346,52,347,52],[348,52,349,52],[350,52,351,52],[352,52,353,52],[152,52,157,52],[219,54,219,58],[219,59,219,63],[219,64,219,68],[221,52,223,52],[224,52,225,52],[226,52,229,52],[258,54,258,58],[258,59,258,63],[258,64,258,68],[260,52,262,52],[263,52,266,52],[267,52,269,52],[270,52,272,52],[273,52,275,52],[276,52,283,52],[338,54,338,58],[338,59,338,63],[338,64,338,68],[150,52,151,52],[13,54,13,58],[13,59,13,63],[13,64,13,68],[15,52,16,52],[17,52,20,52],[21,52,22,52],[26,54,26,58],[26,59,26,63],[26,64,26,68],[55,54,55,58],[55,59,55,63],[55,64,55,68],[119,54,119,58],[119,59,119,63],[119,64,119,68],[121,52,122,52],[123,52,126,52],[127,52,128,52],[132,54,132,58],[132,59,132,63],[132,64,132,68],[134,52,138,52],[40,52,41,52],[42,52,43,52],[44,52,45,52],[46,52,48,52],[49,0,51,0],[49,52,51,52],[52,0,54,0],[52,52,54,52],[139,0,142,0],[139,52,142,52],[143,0,146,0],[143,52,146,52],[147,0,149,0],[147,52,149,52],[13,2,13,6],[13,7,13,11],[28,52,29,52],[30,0,31,0],[30,52,31,52],[32,0,33,0],[32,52,33,52],[34,52,35,52],[36,52,37,52],[38,0,39,0],[38,52,39,52],[44,0,45,0],[55,2,55,6],[55,7,55,11],[28,0,29,0],[34,0,35,0],[36,0,37,0],[40,0,41,0],[42,0,43,0],[13,12,13,16],[15,0,16,0],[17,0,20,0],[21,0,22,0],[23,0,25,0],[26,2,26,6],[26,7,26,11],[26,12,26,16],[132,7,132,11],[132,12,132,16],[134,0,138,0],[152,0,156,0],[201,0,202,0],[121,0,122,0],[123,0,126,0],[127,0,128,0],[129,0,131,0],[132,2,132,6],[55,12,55,16],[57,0,63,0],[107,0,107,1],[119,2,119,6],[119,7,119,11],[119,12,119,16],[150,0,151,0],[46,0,48,0],[1024,0,1024,2],[1025,0,1025,1],[1030,0,1032,0],[1033,0,1033,2],[398,2,398,5],[219,7,219,11],[219,12,219,16],[221,0,223,0],[207,0,207,1],[219,2,219,6],[401,1,444,1],[402,2,402,3],[402,7,402,8],[402,12,402,13],[403,2,403,3],[403,7,403,8],[403,12,403,13],[404,2,404,3],[404,7,404,8],[404,12,404,13],[398,7,398,10],[398,12,398,15],[399,2,399,4],[399,7,399,9],[399,12,399,14],[400,2,401,3],[400,7,401,8],[400,12,401,13],[409,2,409,3],[409,7,409,8],[409,12,409,13],[410,2,410,3],[410,7,410,8],[410,12,410,13],[407,2,407,3],[407,7,407,8],[407,12,407,13],[408,2,408,3],[408,7,408,8],[408,12,408,13],[405,2,405,3],[405,7,405,8],[405,12,405,13],[406,2,406,3],[406,7,406,8],[406,12,406,13],[415,2,415,3],[415,7,415,8],[415,12,415,13],[416,2,416,3],[416,7,416,8],[416,12,416,13],[413,2,413,3],[413,7,413,8],[413,12,413,13],[414,2,414,3],[414,7,414,8],[414,12,414,13],[411,2,411,3],[411,7,411,8],[411,12,411,13],[412,2,412,3],[412,7,412,8],[412,12,412,13],[421,2,421,3],[421,7,421,8],[421,12,421,13],[422,2,422,3],[422,7,422,8],[422,12,422,13],[419,2,419,3],[419,7,419,8],[419,12,419,13],[420,2,420,3],[420,7,420,8],[420,12,420,13],[417,2,417,3],[417,7,417,8],[417,12,417,13],[418,2,418,3],[418,7,418,8],[418,12,418,13],[427,2,427,3],[427,7,427,8],[427,12,427,13],[428,2,428,3],[428,7,428,8],[428,12,428,13],[425,2,425,3],[425,7,425,8],[425,12,425,13],[426,2,426,3],[426,7,426,8],[426,12,426,13],[423,2,423,3],[423,7,423,8],[423,12,423,13],[424,2,424,3],[424,7,424,8],[424,12,424,13],[433,2,433,3],[433,7,433,8],[433,12,433,13],[434,2,434,3],[434,7,434,8],[434,12,434,13],[431,2,431,3],[431,7,431,8],[431,12,431,13],[432,2,432,3],[432,7,432,8],[432,12,432,13],[429,2,429,3],[429,7,429,8],[429,12,429,13],[430,2,430,3],[430,7,430,8],[430,12,430,13],[439,2,439,3],[439,7,439,8],[439,12,439,13],[440,2,440,3],[440,7,440,8],[440,12,440,13],[437,2,437,3],[437,7,437,8],[437,12,437,13],[438,2,438,3],[438,7,438,8],[438,12,438,14],[435,2,435,3],[435,7,435,8],[435,12,435,13],[436,2,436,3],[436,7,436,8],[436,12,436,13],[445,2,445,3],[445,7,445,8],[445,12,445,13],[446,2,446,3],[446,7,446,8],[446,12,446,13],[443,2,443,3],[443,7,443,8],[443,12,443,13],[444,2,444,3],[444,7,444,8],[444,12,444,13],[441,2,441,3],[441,7,441,8],[441,12,441,13],[442,2,442,4],[442,7,442,9],[442,12,442,13],[451,2,451,3],[451,7,451,8],[451,12,451,13],[452,2,452,3],[452,7,452,8],[452,12,452,13],[449,2,449,3],[449,7,449,8],[449,12,449,13],[450,2,450,3],[450,7,450,8],[450,12,450,13],[447,2,447,3],[447,7,447,8],[447,12,447,13],[448,2,448,3],[448,7,448,8],[448,12,448,13],[457,2,457,3],[457,7,457,8],[457,12,457,13],[458,2,458,3],[458,7,458,8],[458,12,458,13],[455,2,455,3],[455,7,455,8],[455,12,455,13],[456,2,456,3],[456,7,456,8],[456,12,456,13],[453,2,453,3],[453,7,453,8],[453,12,453,13],[454,2,454,3],[454,7,454,8],[454,12,454,13],[463,2,463,3],[463,7,463,8],[463,12,463,13],[464,2,464,3],[464,7,464,8],[464,12,464,13],[461,2,461,3],[461,7,461,8],[461,12,461,13],[462,2,462,3],[462,7,462,8],[462,12,462,13],[459,2,459,3],[459,7,459,8],[459,12,459,13],[460,2,460,3],[460,7,460,8],[460,12,460,13],[469,2,469,3],[469,7,469,8],[469,12,469,13],[470,2,470,3],[470,7,470,8],[470,12,470,13],[467,2,467,3],[467,7,467,8],[467,12,467,13],[468,2,468,3],[468,7,468,8],[468,12,468,13],[465,2,465,3],[465,7,465,8],[465,12,465,13],[466,2,466,3],[466,7,466,8],[466,12,466,13],[475,2,475,3],[475,7,475,8],[475,12,475,16],[476,2,476,3],[476,7,476,8],[476,12,477,13],[476,14,476,16],[477,2,477,3],[477,7,477,8],[473,2,473,3],[473,7,473,8],[473,12,473,13],[474,2,474,3],[474,7,474,8],[474,12,474,13],[471,2,471,3],[471,7,471,8],[471,12,471,13],[472,2,472,3],[472,7,472,8],[472,12,472,13],[482,2,482,3],[482,7,482,8],[482,12,483,13],[483,2,483,6],[483,7,483,11],[484,2,485,3],[484,4,484,6],[484,7,485,8],[484,9,484,11],[484,12,484,13],[480,2,480,3],[480,7,480,8],[480,12,480,13],[481,2,481,3],[481,7,481,8],[481,12,481,14],[478,2,478,3],[478,7,478,8],[478,12,478,13],[479,2,479,3],[479,7,479,8],[479,12,479,13],[490,2,491,3],[490,7,491,8],[490,12,490,13],[491,12,491,13],[492,2,492,3],[492,7,492,8],[492,12,492,13],[488,2,488,3],[488,7,488,8],[488,12,488,13],[489,2,489,4],[489,7,489,9],[489,12,489,13],[485,12,485,13],[486,2,486,3],[486,7,486,8],[486,12,486,13],[487,2,487,3],[487,7,487,8],[487,12,487,13],[497,2,497,3],[497,7,497,8],[497,12,497,13],[498,2,498,3],[498,7,498,8],[498,12,498,13],[495,2,495,3],[495,7,495,8],[495,12,495,13],[496,2,496,3],[496,7,496,8],[496,12,496,13],[493,2,493,3],[493,7,493,8],[493,12,493,13],[494,2,494,3],[494,7,494,8],[494,12,494,13],[503,2,503,3],[503,7,503,8],[503,12,503,13],[504,2,504,3],[504,7,504,8],[504,12,504,13],[501,2,501,3],[501,7,501,8],[501,12,501,13],[502,2,502,3],[502,7,502,8],[502,12,502,13],[499,2,499,3],[499,7,499,8],[499,12,499,13],[500,2,500,3],[500,7,500,8],[500,12,500,13],[509,2,509,3],[509,7,509,8],[509,12,509,13],[510,2,510,3],[510,7,510,8],[510,12,510,13],[507,2,507,3],[507,7,507,8],[507,12,507,13],[508,2,508,3],[508,7,508,8],[508,12,508,13],[505,2,505,3],[505,7,505,8],[505,12,505,13],[506,2,506,3],[506,7,506,8],[506,12,506,13],[515,2,515,3],[515,7,515,8],[515,12,515,13],[516,2,516,3],[516,7,516,8],[516,12,516,13],[513,2,513,3],[513,7,513,8],[513,12,513,13],[514,2,514,3],[514,7,514,8],[514,12,514,13],[511,2,511,3],[511,7,511,8],[511,12,511,13],[512,2,512,3],[512,7,512,8],[512,12,512,13],[521,2,521,3],[521,7,521,8],[521,12,521,13],[522,2,522,3],[522,7,522,8],[522,12,522,13],[519,2,519,3],[519,7,519,8],[519,12,519,14],[520,2,520,3],[520,7,520,8],[520,12,520,13],[517,2,517,3],[517,7,517,8],[517,12,517,13],[518,2,518,3],[518,7,518,8],[518,12,518,13],[527,2,527,3],[527,7,527,8],[527,12,527,13],[528,2,528,3],[528,7,528,8],[528,12,528,13],[525,2,525,3],[525,7,525,8],[525,12,525,13],[526,2,526,3],[526,7,526,8],[526,12,526,13],[523,2,523,3],[523,7,523,8],[523,12,523,13],[524,2,524,3],[524,7,524,8],[524,12,524,13],[533,2,533,3],[533,7,533,8],[533,12,533,13],[534,2,534,3],[534,7,534,8],[534,12,534,13],[531,2,531,4],[531,7,531,9],[531,12,531,13],[532,2,532,3],[532,7,532,8],[532,12,532,13],[529,2,529,3],[529,7,529,8],[529,12,529,13],[530,2,530,3],[530,7,530,8],[530,12,530,13],[539,2,539,3],[539,7,539,8],[539,12,539,13],[540,2,540,3],[540,7,540,8],[540,12,540,13],[537,2,537,3],[537,7,537,8],[537,12,537,13],[538,2,538,3],[538,7,538,8],[538,12,538,13],[535,2,535,3],[535,7,535,8],[535,12,535,13],[536,2,536,3],[536,7,536,8],[536,12,536,13],[545,2,545,3],[545,7,545,8],[545,12,545,13],[546,2,546,3],[546,7,546,8],[546,12,546,13],[543,2,543,3],[543,7,543,8],[543,12,543,13],[544,2,544,3],[544,7,544,8],[544,12,544,13],[541,2,541,3],[541,7,541,8],[541,12,541,13],[542,2,542,3],[542,7,542,8],[542,12,542,13],[551,2,551,3],[551,7,551,8],[551,12,551,13],[552,2,552,3],[552,7,552,8],[552,12,552,13],[549,2,549,3],[549,7,549,8],[549,12,549,13],[550,2,550,3],[550,7,550,8],[550,12,550,13],[547,2,547,3],[547,7,547,8],[547,12,547,13],[548,2,548,3],[548,7,548,8],[548,12,548,13],[557,2,557,3],[557,7,557,8],[557,12,557,13],[558,2,558,3],[558,7,558,8],[558,12,558,13],[555,2,555,3],[555,7,555,8],[555,12,555,13],[556,2,556,3],[556,7,556,8],[556,12,556,13],[553,2,553,3],[553,7,553,8],[553,12,553,13],[554,2,554,3],[554,7,554,8],[554,12,554,13],[563,2,563,3],[563,7,563,8],[563,12,563,13],[564,2,564,3],[564,7,564,8],[564,12,564,13],[561,2,561,3],[561,7,561,8],[561,12,561,13],[562,2,562,3],[562,7,562,8],[562,12,562,13],[559,2,559,3],[559,7,559,8],[559,12,559,13],[560,2,560,3],[560,7,560,8],[560,12,560,13],[569,2,569,3],[569,7,569,8],[569,12,569,13],[570,2,570,3],[570,7,570,8],[570,12,570,13],[567,2,567,3],[567,7,567,8],[567,12,567,13],[568,2,568,3],[568,7,568,8],[568,12,568,13],[565,2,565,3],[565,7,565,8],[565,12,565,13],[566,2,566,3],[566,7,566,8],[566,12,566,13],[575,2,575,3],[575,7,575,8],[575,12,575,13],[576,2,576,3],[576,7,576,8],[576,12,576,13],[573,2,573,3],[573,7,573,8],[573,12,573,13],[574,2,574,3],[574,7,574,8],[574,12,574,13],[571,2,571,3],[571,7,571,8],[571,12,571,13],[572,2,572,3],[572,7,572,8],[572,12,572,13],[581,2,581,3],[581,7,581,8],[581,12,581,13],[582,2,582,3],[582,7,582,8],[582,12,582,13],[579,2,579,3],[579,7,579,8],[579,12,579,13],[580,2,580,3],[580,7,580,8],[580,12,580,13],[577,2,577,3],[577,7,577,8],[577,12,577,13],[578,2,578,3],[578,7,578,8],[578,12,578,13],[587,2,587,3],[587,7,587,8],[587,12,587,13],[588,2,588,3],[588,7,588,8],[588,12,588,13],[585,2,585,3],[585,7,585,8],[585,12,585,13],[586,2,586,3],[586,7,586,8],[586,12,586,13],[583,2,583,3],[583,7,583,8],[583,12,583,13],[584,2,584,3],[584,7,584,8],[584,12,584,13],[593,2,593,3],[593,7,593,8],[593,12,593,13],[594,2,594,3],[594,7,594,8],[594,12,594,13],[591,2,591,3],[591,7,591,8],[591,12,591,13],[592,2,592,3],[592,7,592,8],[592,12,592,13],[589,2,589,3],[589,7,589,8],[589,12,589,13],[590,2,590,3],[590,7,590,8],[590,12,590,13],[599,2,599,3],[599,7,599,8],[599,12,599,13],[600,2,600,3],[600,7,600,8],[600,12,600,13],[597,2,597,3],[597,7,597,8],[597,12,597,13],[598,2,598,3],[598,7,598,8],[598,12,598,13],[595,2,595,3],[595,7,595,8],[595,12,595,13],[596,2,596,3],[596,7,596,8],[596,12,596,13],[605,2,605,3],[605,7,605,8],[605,12,605,13],[606,2,606,3],[606,7,606,8],[606,12,606,13],[603,2,603,3],[603,7,603,8],[603,12,603,13],[604,2,604,3],[604,7,604,8],[604,12,604,13],[601,2,601,3],[601,7,601,8],[601,12,601,13],[602,2,602,3],[602,7,602,8],[602,12,602,13],[611,2,611,3],[611,7,611,8],[611,12,611,13],[612,2,612,3],[612,7,612,8],[612,12,612,13],[609,2,609,3],[609,7,609,8],[609,12,609,13],[610,2,610,3],[610,7,610,8],[610,12,610,13],[607,2,607,3],[607,7,607,8],[607,12,607,13],[608,2,608,3],[608,7,608,8],[608,12,608,13],[617,2,617,3],[617,7,617,8],[617,12,617,13],[618,2,618,3],[618,7,618,8],[618,12,618,13],[615,2,615,3],[615,7,615,8],[615,12,615,13],[616,2,616,3],[616,7,616,8],[616,12,616,13],[613,2,613,3],[613,7,613,8],[613,12,613,13],[614,2,614,3],[614,7,614,8],[614,12,614,13],[623,2,623,3],[623,7,623,8],[623,12,623,13],[624,2,624,3],[624,7,624,8],[624,12,624,13],[621,2,621,3],[621,7,621,8],[621,12,621,13],[622,2,622,3],[622,7,622,8],[622,12,622,13],[619,2,619,3],[619,7,619,8],[619,12,619,13],[620,2,620,3],[620,7,620,8],[620,12,620,13],[629,2,629,3],[629,7,629,8],[629,12,629,13],[630,2,630,3],[630,7,630,8],[630,12,630,13],[627,2,627,3],[627,7,627,8],[627,12,627,13],[628,2,628,3],[628,7,628,8],[628,12,628,13],[625,2,625,3],[625,7,625,8],[625,12,625,13],[626,2,626,3],[626,7,626,8],[626,12,626,13],[635,2,635,3],[635,7,635,8],[635,12,635,13],[636,2,636,3],[636,7,636,8],[636,12,636,13],[633,2,633,3],[633,7,633,8],[633,12,633,13],[634,2,634,3],[634,7,634,8],[634,12,634,13],[631,2,631,3],[631,7,631,8],[631,12,631,13],[632,2,632,3],[632,7,632,8],[632,12,632,13],[641,2,641,3],[641,7,641,8],[641,12,641,13],[642,2,642,3],[642,7,642,8],[642,12,642,13],[639,2,639,3],[639,7,639,8],[639,12,639,13],[640,2,640,3],[640,7,640,8],[640,12,640,13],[637,2,637,3],[637,7,637,8],[637,12,637,13],[638,2,638,3],[638,7,638,8],[638,12,638,13],[647,2,647,3],[647,7,647,8],[647,12,647,13],[648,2,648,3],[648,7,648,8],[648,12,648,13],[645,2,645,3],[645,7,645,8],[645,12,645,13],[646,2,646,3],[646,7,646,8],[646,12,646,13],[643,2,643,3],[643,7,643,8],[643,12,643,13],[644,2,644,3],[644,7,644,8],[644,12,644,13],[653,2,653,3],[653,7,653,8],[653,12,653,13],[654,2,654,3],[654,7,654,8],[654,12,654,13],[651,2,651,3],[651,7,651,8],[651,12,651,13],[652,2,652,3],[652,7,652,8],[652,12,652,13],[649,2,649,3],[649,7,649,8],[649,12,649,13],[650,2,650,3],[650,7,650,8],[650,12,650,13],[659,2,659,3],[659,7,659,8],[659,12,659,13],[660,2,660,3],[660,7,660,8],[660,12,660,13],[657,2,657,3],[657,7,657,8],[657,12,657,13],[658,2,658,3],[658,7,658,8],[658,12,658,13],[655,2,655,3],[655,7,655,8],[655,12,655,13],[656,2,656,3],[656,7,656,8],[656,12,656,13],[665,2,665,3],[665,7,665,8],[665,12,665,13],[666,2,666,3],[666,7,666,8],[666,12,666,13],[663,2,663,3],[663,7,663,8],[663,12,663,13],[664,2,664,3],[664,7,664,8],[664,12,664,13],[661,2,661,3],[661,7,661,8],[661,12,661,13],[662,2,662,3],[662,7,662,8],[662,12,662,13],[671,2,671,3],[671,7,671,8],[671,12,671,13],[672,2,672,3],[672,7,672,8],[672,12,672,13],[669,2,669,3],[669,7,669,8],[669,12,669,13],[670,2,670,3],[670,7,670,8],[670,12,670,13],[667,2,667,3],[667,7,667,8],[667,12,667,13],[668,2,668,3],[668,7,668,8],[668,12,668,13],[677,2,677,3],[677,7,677,8],[677,12,677,13],[678,2,678,3],[678,7,678,8],[678,12,678,13],[675,2,675,3],[675,7,675,8],[675,12,675,13],[676,2,676,3],[676,7,676,8],[676,12,676,13],[673,2,673,3],[673,7,673,8],[673,12,673,13],[674,2,674,3],[674,7,674,8],[674,12,674,13],[683,2,683,3],[683,7,683,8],[683,12,683,13],[684,2,684,3],[684,7,684,8],[684,12,684,13],[681,2,681,3],[681,7,681,8],[681,12,681,13],[682,2,682,3],[682,7,682,8],[682,12,682,13],[679,2,679,3],[679,7,679,8],[679,12,679,13],[680,2,680,3],[680,7,680,8],[680,12,680,13],[689,2,689,3],[689,7,689,8],[689,12,689,13],[690,2,690,3],[690,7,690,8],[690,12,690,13],[687,2,687,3],[687,7,687,8],[687,12,687,13],[688,2,688,3],[688,7,688,8],[688,12,688,13],[685,2,685,3],[685,7,685,8],[685,12,685,13],[686,2,686,3],[686,7,686,8],[686,12,686,13],[695,2,695,3],[695,7,695,8],[695,12,695,13],[696,2,696,3],[696,7,696,8],[696,12,696,13],[693,2,693,3],[693,7,693,8],[693,12,693,13]],"merged_total":1315,"flags":["merged_cut"]}
[]
[{"$f":"A1026","v":"Jamaica"}]
[{"$f":"A1034","v":"1997"}]
["Use of drinking water sources"]
[" by wealth quintile and sub-national region"]
["Notes:"]
["WHO/UNICEF JMP customised wealth index excludes water,"]
[" sanitation and hygiene assets."]
["Survey used for analysis:",{"$f":"A1025","v":"SLC97"}]
[{"$f":"B1028","v":"Ratio of Improved wells based on:"},"MICS11"]
[{"$f":"B1027","v":"Time to improved source based on:"},"MICS11"]
[]
[]
["Use of drinking water sources",null,"NATIONAL wealth index quintile",null,null,null,null,"URBAN wealth index quintile",null,null,null,null,"RURAL wealth index quintile",null,null,null,null,"SUB-REGIONS:",null,null,null,null,null,null,null,null,null,null,null,null,null,null,null,null,null,null,null,null,null,null,null,null,null,null,null,null,null,null,null,null,null,null,"Raw numbers of respondents:","Use of drinking water sources","NATIONAL wealth index quintile",null,null,null,null,"URBAN wealth index quintile",null,null,null,null,"RURAL wealth index quintile",null,null,null,null,"SUB-REGIONS:"]
["Weighted percentage (used in graphs)",null,"Poorest","Poor","Middle","Rich","Richest","Poorest","Poor","Middle","Rich","Richest","Poorest","Poor","Middle","Rich","Richest","None valid",null,null,null,null,null,null,null,null,null,null,null,null,null,null,null,null,null,null,null,null,null,null,null,null,null,null,null,null,null,null,null,null,null,null,"Water data, raw numbers (weighted)",null,"Poorest","Poor","Middle","Rich","Richest","Poorest","Poor","Middle","Rich","Richest","Poorest","Poor","Middle","Rich","Richest","None valid"]
["Water","Improved",{"$f":"C58+C59+C60+C63+C61*MICS11!C24/100","v":92.157282790885517},{"$f":"D58+D59+D60+D63+D61*MICS11!D24/100","v":93.468477536272971},{"$f":"E58+E59+E60+E63+E61*MICS11!E24/100","v":92.304807058757831},{"$f":"F58+F59+F60+F63+F61*MICS11!F24/100","v":91.036915798022065},{"$f":"G58+G59+G60+G63+G61*MICS11!G24/100","v":95.368558580822054},{"$f":"H58+H59+H60+H63+H61*MICS11!H24/100","v":96.303374288446037},{"$f":"I58+I59+I60+I63+I61*MICS11!I24/100","v":98.144415027041944},{"$f":"J58+J59+J60+J63+J61*MICS11!J24/100","v":99.000241944985305},{"$f":"K58+K59+K60+K63+K61*MICS11!K24/100","v":96.782955128330897},{"$f":"L58+L59+L60+L63+L61*MICS11!L24/100","v":99.328305465944496},{"$f":"M58+M59+M60+M63+M61*MICS11!M24/100","v":82.205413355444819},{"$f":"N58+N59+N60+N63+N61*MICS11!N24/100","v":89.412997384243667},{"$f":"O58+O59+O60+O63+O61*MICS11!O24/100","v":82.830314876320756},{"$f":"P58+P59+P60+P63+P61*MICS11!P24/100","v":88.051488414527654},{"$f":"Q58+Q59+Q60+Q63+Q61*MICS11!Q24/100","v":92.426669388830177},"N/A",null,null,null,null,null,null,null,null,null,null,null,null,null,null,null,null,null,null,null,null,null,null,null,null,null,null,null,null,null,null,null,null,null,null,"Water","Improved","N/A","N/A","N/A","N/A","N/A","N/A","N/A","N/A","N/A","N/A","N/A","N/A","N/A","N/A","N/A","N/A"]
[null,"Not Improved",{"$f":"100-C16","v":7.8427172091144826},{"$f":"100-D16","v":6.531522463727029},7.6951929412421691,8.9630842019779351,4.6314414191779463,3.6966257115539634,1.8555849729580558,0.99975805501469495,3.2170448716691027,0.67169453405550428,17.794586644555181,10.587002615756333,17.169685123679244,11.948511585472346,7.5733306111698226,"N/A",null,null,null,null,null,null,null,null,null,null,null,null,null,null,null,null,null,null,null,null,null,null,null,null,null,null,null,null,null,null,null,null,null,null,null,"Not Improved","N/A","N/A","N/A","N/A","N/A","N/A","N/A","N/A","N/A","N/A","N/A","N/A","N/A","N/A","N/A","N/A"]
["Water ladder","Basic",{"$f":"C16*MICS11!C23/100","v":88.655306044831875},{"$f":"D16*MICS11!D23/100","v":90.47748625511224},{"$f":"E16*MICS11!E23/100","v":92.304807058757831},{"$f":"F16*MICS11!F23/100","v":89.762398976849738},{"$f":"G16*MICS11!G23/100","v":94.414872995013823},{"$f":"H16*MICS11!H23/100","v":95.340340545561574},{"$f":"I16*MICS11!I23/100","v":97.948126196987857},{"$f":"J16*MICS11!J23/100","v":98.109239767480432},{"$f":"K16*MICS11!K23/100","v":95.815125577047581},{"$f":"L16*MICS11!L23/100","v":99.32830546594451},{"$f":"M16*MICS11!M23/100","v":77.930731860961686},{"$f":"N16*MICS11!N23/100","v":86.909433457484852},{"$f":"O16*MICS11!O23/100","v":78.771629447381031},{"$f":"P16*MICS11!P23/100","v":86.642664599895213},{"$f":"Q16*MICS11!Q23/100","v":91.13269601738655},"N/A",null,null,null,null,null,null,null,null,null,null,null,null,null,null,null,null,null,null,null,null,null,null,null,null,null,null,null,null,null,null,null,null,null,null,"Water ladder","Basic","N/A","N/A","N/A","N/A","N/A","N/A","N/A","N/A","N/A","N/A","N/A","N/A","N/A","N/A","N/A","N/A"]
[null,"Limited",{"$f":"C16*MICS11!C22/100","v":3.5019767460536495},{"$f":"D16*MICS11!D22/100","v":2.9909912811607353},{"$f":"E16*MICS11!E22/100","v":0},{"$f":"F16*MICS11!F22/100","v":1.2745168211723088},{"$f":"G16*MICS11!G22/100","v":0.95368558580822049},{"$f":"H16*MICS11!H22/100","v":0.96303374288446042},{"$f":"I16*MICS11!I22/100","v":0.1962888300540839},{"$f":"J16*MICS11!J22/100","v":0.89100217750486777},{"$f":"K16*MICS11!K22/100","v":0.96782955128330894},{"$f":"L16*MICS11!L22/100","v":0},{"$f":"M16*MICS11!M22/100","v":4.2746814944831302},{"$f":"N16*MICS11!N22/100","v":2.5035639267588228},{"$f":"O16*MICS11!O22/100","v":4.0586854289397172},{"$f":"P16*MICS11!P22/100","v":1.4088238146324426},{"$f":"Q16*MICS11!Q22/100","v":1.2939733714436223},"N/A",null,null,null,null,null,null,null,null,null,null,null,null,null,null,null,null,null,null,null,null,null,null,null,null,null,null,null,null,null,null,null,null,null,null,null,"Limited","N/A","N/A","N/A","N/A","N/A","N/A","N/A","N/A","N/A","N/A","N/A","N/A","N/A","N/A","N/A","N/A"]
[null,"Unimproved",{"$f":"100-(C18+C19+C21)","v":5.2006058184369408},{"$f":"100-(D18+D19+D21)","v":2.2880846669569763},3.901377880844322,3.9746344822929558,1.0692812501237796,3.6966257115539634,1.1146175940513814,0.99975805501469495,3.2170448716691027,0.67169453405549007,8.1434608496995509,4.89985617216945,5.9363777400488829,4.5320229295398349,1.3646678232593956,"N/A",null,null,null,null,null,null,null,null,null,null,null,null,null,null,null,null,null,null,null,null,null,null,null,null,null,null,null,null,null,null,null,null,null,null,null,"Unimproved","N/A","N/A","N/A","N/A","N/A","N/A","N/A","N/A","N/A","N/A","N/A","N/A","N/A","N/A","N/A","N/A"]
[null,"Surface water",{"$f":"C62","v":2.6421113906775435},4.2434377967700589,3.7938150603978413,4.9884497196849908,3.5621601690541875,0,0.74096737890667297,0,0,0,9.651125794855627,5.6871464435868688,11.233307383630372,7.4164886559325058,6.2086627879104332,"N/A",null,null,null,null,null,null,null,null,null,null,null,null,null,null,null,null,null,null,null,null,null,null,null,null,null,null,null,null,null,null,null,null,null,null,null,"Surface water","N/A","N/A","N/A","N/A","N/A","N/A","N/A","N/A","N/A","N/A","N/A","N/A","N/A","N/A","N/A","N/A"]
["Improved water point at more than 30 minutes","Yes","N/A","N/A","N/A","N/A","N/A","N/A","N/A","N/A","N/A","N/A","N/A","N/A","N/A","N/A","N/A","N/A",null,null,null,null,null,null,null,null,null,null,null,null,null,null,null,null,null,null,null,null,null,null,null,null,null,null,null,null,null,null,null,null,null,null,"Improved water point at more than 30 minutes","Yes","N/A","N/A","N/A","N/A","N/A","N/A","N/A","N/A","N/A","N/A","N/A","N/A","N/A","N/A","N/A","N/A"]
[null,"No","N/A","N/A","N/A","N/A","N/A","N/A","N/A","N/A","N/A","N/A","N/A","N/A","N/A","N/A","N/A","N/A",null,null,null,null,null,null,null,null,null,null,null,null,null,null,null,null,null,null,null,null,null,null,null,null,null,null,null,null,null,null,null,null,null,null,null,"No","N/A","N/A","N/A","N/A","N/A","N/A","N/A","N/A","N/A","N/A","N/A","N/A","N/A","N/A","N/A","N/A"]
["Manually calculated ratios","Improved wells"]
[null,"Improved springs"]
[null,"Other"]
[null,null,"NATIONAL wealth index quintile",null,null,null,null,"URBAN wealth index quintile",null,null,null,null,"RURAL wealth index quintile",null,null,null,null,"SUB-REGIONS:",null,null,null,null,null,null,null,null,null,null,null,null,null,null,null,null,null,null,null,null,null,null,null,null,null,null,null,null,null,null,null,null,null,null,"Raw numbers of respondents:","Use of drinking water sources","NATIONAL wealth index quintile",null,null,null,null,"URBAN wealth index quintile",null,null,null,null,"RURAL wealth index quintile",null,null,null,null,"SUB-REGIONS:"]
["Percentage based on weighted population",null,"Poorest","Poor","Middle","Rich","Richest","Poorest","Poor","Middle","Rich","Richest","Poorest","Poor","Middle","Rich","Richest","None valid",null,null,null,null,null,null,null,null,null,null,null,null,null,null,null,null,null,null,null,null,null,null,null,null,null,null,null,null,null,null,null,null,null,null,"Water data, raw numbers (weighted)",null,"Poorest","Poor","Middle","Rich","Richest","Poorest","Poor","Middle","Rich","Richest","Poorest","Poor","Middle","Rich","Richest","None valid"]
["Piped water","Yes",{"$f":"C58+C59+C60","v":88.173999564911412},82.564250758555687,79.445001501288772,75.031455921947554,80.137779350427948,95.769054431524296,96.145703023549231,96.145454959368749,94.477959060553815,97.933247589145594,63.348329158546065,67.415813455790101,56.505427373387008,69.511281836750513,66.916657597768477,"N/A",null,null,null,null,null,null,null,null,null,null,null,null,null,null,null,null,null,null,null,null,null,null,null,null,null,null,null,null,null,null,null,null,null,null,"Piped water","Yes","N/A","N/A","N/A","N/A","N/A","N/A","N/A","N/A","N/A","N/A","N/A","N/A","N/A","N/A","N/A","N/A"]
[null,"No",{"$f":"100-C29","v":11.826000435088588},{"$f":"100-D29","v":17.435749241444313},20.554998498711228,24.968544078052446,19.862220649572052,4.230945568475704,3.8542969764507689,3.8545450406312511,5.5220409394461853,2.0667524108544058,36.651670841453935,32.584186544209899,43.494572626612992,30.488718163249487,33.083342402231523,"N/A",null,null,null,null,null,null,null,null,null,null,null,null,null,null,null,null,null,null,null,null,null,null,null,null,null,null,null,null,null,null,null,null,null,null,null,"No","N/A","N/A","N/A","N/A","N/A","N/A","N/A","N/A","N/A","N/A","N/A","N/A","N/A","N/A","N/A","N/A"]
["Piped water on premises","Yes",{"$f":"C58+C59","v":76.325475151455123},63.301068602660578,58.767397625718594,58.034557175765499,71.499518685391209,93.224013600368863,84.859854439396145,87.749565269374912,90.080059724052262,96.162852709817813,31.667230993350646,36.092341879829746,27.723698775588492,35.920592889319686,53.17592429668013,"N/A",null,null,null,null,null,null,null,null,null,null,null,null,null,null,null,null,null,null,null,null,null,null,null,null,null,null,null,null,null,null,null,null,null,null,"Piped water on premises","Yes","N/A","N/A","N/A","N/A","N/A","N/A","N/A","N/A","N/A","N/A","N/A","N/A","N/A","N/A","N/A","N/A"]
[null,"No",{"$f":"100-C31","v":23.674524848544877},{"$f":"100-D31","v":36.698931397339422},41.232602374281406,41.965442824234501,28.500481314608791,6.7759863996311367,15.140145560603855,12.250434730625088,9.919940275947738,3.8371472901821875,68.332769006649357,63.907658120170254,72.276301224411512,64.079407110680307,46.82407570331987,"N/A",null,null,null,null,null,null,null,null,null,null,null,null,null,null,null,null,null,null,null,null,null,null,null,null,null,null,null,null,null,null,null,null,null,null,null,"No","N/A","N/A","N/A","N/A","N/A","N/A","N/A","N/A","N/A","N/A","N/A","N/A","N/A","N/A","N/A","N/A"]
["Piped water into dwelling","Yes","N/A","N/A","N/A","N/A","N/A","N/A","N/A","N/A","N/A","N/A","N/A","N/A","N/A","N/A","N/A","N/A",null,null,null,null,null,null,null,null,null,null,null,null,null,null,null,null,null,null,null,null,null,null,null,null,null,null,null,null,null,null,null,null,null,null,"Piped water into dwelling","Yes","N/A","N/A","N/A","N/A","N/A","N/A","N/A","N/A","N/A","N/A","N/A","N/A","N/A","N/A","N/A","N/A"]
[null,"No","N/A","N/A","N/A","N/A","N/A","N/A","N/A","N/A","N/A","N/A","N/A","N/A","N/A","N/A","N/A","N/A",null,null,null,null,null,null,null,null,null,null,null,null,null,null,null,null,null,null,null,null,null,null,null,null,null,null,null,null,null,null,null,null,null,null,null,"No","N/A","N/A","N/A","N/A","N/A","N/A","N/A","N/A","N/A","N/A","N/A","N/A","N/A","N/A","N/A","N/A"]
["Water source on premises","Yes","N/A","N/A","N/A","N/A","N/A","N/A","N/A","N/A","N/A","N/A","N/A","N/A","N/A","N/A","N/A","N/A",null,null,null,null,null,null,null,null,null,null,null,null,null,null,null,null,null,null,null,null,null,null,null,null,null,null,null,null,null,null,null,null,null,null,"Water source on premises","Yes","N/A","N/A","N/A","N/A","N/A","N/A","N/A","N/A","N/A","N/A","N/A","N/A","N/A","N/A","N/A","N/A"]
[null,"No","N/A","N/A","N/A","N/A","N/A","N/A","N/A","N/A","N/A","N/A","N/A","N/A","N/A","N/A","N/A","N/A",null,null,null,null,null,null,null,null,null,null,null,null,null,null,null,null,null,null,null,null,null,null,null,null,null,null,null,null,null,null,null,null,null,null,null,"No","N/A","N/A","N/A","N/A","N/A","N/A","N/A","N/A","N/A","N/A","N/A","N/A","N/A","N/A","N/A","N/A"]
["Improved Water source on premises","Yes","N/A","N/A","N/A","N/A","N/A","N/A","N/A","N/A","N/A","N/A","N/A","N/A","N/A","N/A","N/A","N/A",null,null,null,null,null,null,null,null,null,null,null,null,null,null,null,null,null,null,null,null,null,null,null,null,null,null,null,null,null,null,null,null,null,null,"Improved water source on premises","Yes","N/A","N/A","N/A","N/A","N/A","N/A","N/A","N/A","N/A","N/A","N/A","N/A","N/A","N/A","N/A","N/A"]
[null,"No","N/A","N/A","N/A","N/A","N/A","N/A","N/A","N/A","N/A","N/A","N/A","N/A","N/A","N/A","N/A","N/A",null,null,null,null,null,null,null,null,null,null,null,null,null,null,null,null,null,null,null,null,null,null,null,null,null,null,null,null,null,null,null,null,null,null,null,"No","N/A","N/A","N/A","N/A","N/A","N/A","N/A","N/A","N/A","N/A","N/A","N/A","N/A","N/A","N/A","N/A"]
["Piped water on premises available when needed","Yes","N/A","N/A","N/A","N/A","N/A","N/A","N/A","N/A","N/A","N/A","N/A","N/A","N/A","N/A","N/A","N/A",null,null,null,null,null,null,null,null,null,null,null,null,null,null,null,null,null,null,null,null,null,null,null,null,null,null,null,null,null,null,null,null,null,null,"Piped water on premises available when needed","Yes","N/A","N/A","N/A","N/A","N/A","N/A","N/A","N/A","N/A","N/A","N/A","N/A","N/A","N/A","N/A","N/A"]
[null,"No","N/A","N/A","N/A","N/A","N/A","N/A","N/A","N/A","N/A","N/A","N/A","N/A","N/A","N/A","N/A","N/A",null,null,null,null,null,null,null,null,null,null,null,null,null,null,null,null,null,null,null,null,null,null,null,null,null,null,null,null,null,null,null,null,null,null,null,"No","N/A","N/A","N/A","N/A","N/A","N/A","N/A","N/A","N/A","N/A","N/A","N/A","N/A","N/A","N/A","N/A"]
["Water point at more than 30 minutes","Yes","N/A","N/A","N/A","N/A","N/A","N/A","N/A","N/A","N/A","N/A","N/A","N/A","N/A","N/A","N/A","N/A",null,null,null,null,null,null,null,null,null,null,null,null,null,null,null,null,null,null,null,null,null,null,null,null,null,null,null,null,null,null,null,null,null,null,"Water point at more than 30 minutes","Yes","N/A","N/A","N/A","N/A","N/A","N/A","N/A","N/A","N/A","N/A","N/A","N/A","N/A","N/A","N/A","N/A"]
[null,"No","N/A","N/A","N/A","N/A","N/A","N/A","N/A","N/A","N/A","N/A","N/A","N/A","N/A","N/A","N/A","N/A",null,null,null,null,null,null,null,null,null,null,null,null,null,null,null,null,null,null,null,null,null,null,null,null,null,null,null,null,null,null,null,null,null,null,null,"No","N/A","N/A","N/A","N/A","N/A","N/A","N/A","N/A","N/A","N/A","N/A","N/A","N/A","N/A","N/A","N/A"]
["Water source available when needed","Yes","N/A","N/A","N/A","N/A","N/A","N/A","N/A","N/A","N/A","N/A","N/A","N/A","N/A","N/A","N/A","N/A",null,null,null,null,null,null,null,null,null,null,null,null,null,null,null,null,null,null,null,null,null,null,null,null,null,null,null,null,null,null,null,null,null,null,"Water source available when needed","Yes","N/A","N/A","N/A","N/A","N/A","N/A","N/A","N/A","N/A","N/A","N/A","N/A","N/A","N/A","N/A","N/A"]
[null,"No","N/A","N/A","N/A","N/A","N/A","N/A","N/A","N/A","N/A","N/A","N/A","N/A","N/A","N/A","N/A","N/A",null,null,null,null,null,null,null,null,null,null,null,null,null,null,null,null,null,null,null,null,null,null,null,null,null,null,null,null,null,null,null,null,null,null,null,"No","N/A","N/A","N/A","N/A","N/A","N/A","N/A","N/A","N/A","N/A","N/A","N/A","N/A","N/A","N/A","N/A"]
["Improved water source available when needed","Yes","N/A","N/A","N/A","N/A","N/A","N/A","N/A","N/A","N/A","N/A","N/A","N/A","N/A","N/A","N/A","N/A",null,null,null,null,null,null,null,null,null,null,null,null,null,null,null,null,null,null,null,null,null,null,null,null,null,null,null,null,null,null,null,null,null,null,"Improved water source available when needed","Yes","N/A","N/A","N/A","N/A","N/A","N/A","N/A","N/A","N/A","N/A","N/A","N/A","N/A","N/A","N/A","N/A"]
[null,"No","N/A","N/A","N/A","N/A","N/A","N/A","N/A","N/A","N/A","N/A","N/A","N/A","N/A","N/A","N/A","N/A",null,null,null,null,null,null,null,null,null,null,null,null,null,null,null,null,null,null,null,null,null,null,null,null,null,null,null,null,null,null,null,null,null,null,null,"No","N/A","N/A","N/A","N/A","N/A","N/A","N/A","N/A","N/A","N/A","N/A","N/A","N/A","N/A","N/A","N/A"]
["Microbiological quality at point of collection","Not contaminated (No E. coli in 100 mL)","N/A","N/A","N/A","N/A","N/A","N/A","N/A","N/A","N/A","N/A","N/A","N/A","N/A","N/A","N/A","N/A",null,null,null,null,null,null,null,null,null,null,null,null,null,null,null,null,null,null,null,null,null,null,null,null,null,null,null,null,null,null,null,null,null,null,"Microbiological quality at point of collection","Not contaminated (No E. coli in 100 mL)","N/A","N/A","N/A","N/A","N/A","N/A","N/A","N/A","N/A","N/A","N/A","N/A","N/A","N/A","N/A","N/A"]
[null,"Contaminated (E. coli detected in 100 mL)","N/A","N/A","N/A","N/A","N/A","N/A","N/A","N/A","N/A","N/A","N/A","N/A","N/A","N/A","N/A","N/A",null,null,null,null,null,null,null,null,null,null,null,null,null,null,null,null,null,null,null,null,null,null,null,null,null,null,null,null,null,null,null,null,null,null,null,"Contaminated (E. coli detected in 100 mL)","N/A","N/A","N/A","N/A","N/A","N/A","N/A","N/A","N/A","N/A","N/A","N/A","N/A","N/A","N/A","N/A"]
[null,"Highly contaminated (>100 CFU/100 mL)","N/A","N/A","N/A","N/A","N/A","N/A","N/A","N/A","N/A","N/A","N/A","N/A","N/A","N/A","N/A","N/A",null,null,null,null,null,null,null,null,null,null,null,null,null,null,null,null,null,null,null,null,null,null,null,null,null,null,null,null,null,null,null,null,null,null,null,"Highly contaminated (>100 CFU/100 mL)","N/A","N/A","N/A","N/A","N/A","N/A","N/A","N/A","N/A","N/A","N/A","N/A","N/A","N/A","N/A","N/A"]
["Microbiological quality of improved water sources at point of collection","Not contaminated (No E. coli in 100 mL)","N/A","N/A","N/A","N/A","N/A","N/A","N/A","N/A","N/A","N/A","N/A","N/A","N/A","N/A","N/A","N/A",null,null,null,null,null,null,null,null,null,null,null,null,null,null,null,null,null,null,null,null,null,null,null,null,null,null,null,null,null,null,null,null,null,null,"Microbiological quality of improved water sources at point of collection","Not contaminated (No E. coli in 100 mL)","N/A","N/A","N/A","N/A","N/A","N/A","N/A","N/A","N/A","N/A","N/A","N/A","N/A","N/A","N/A","N/A"]
[null,"Contaminated (E. coli detected in 100 mL)","N/A","N/A","N/A","N/A","N/A","N/A","N/A","N/A","N/A","N/A","N/A","N/A","N/A","N/A","N/A","N/A",null,null,null,null,null,null,null,null,null,null,null,null,null,null,null,null,null,null,null,null,null,null,null,null,null,null,null,null,null,null,null,null,null,null,null,"Contaminated (E. coli detected in 100 mL)","N/A","N/A","N/A","N/A","N/A","N/A","N/A","N/A","N/A","N/A","N/A","N/A","N/A","N/A","N/A","N/A"]
[null,"Highly contaminated (>100 CFU/100 mL)","N/A","N/A","N/A","N/A","N/A","N/A","N/A","N/A","N/A","N/A","N/A","N/A","N/A","N/A","N/A","N/A",null,null,null,null,null,null,null,null,null,null,null,null,null,null,null,null,null,null,null,null,null,null,null,null,null,null,null,null,null,null,null,null,null,null,null,"Highly contaminated (>100 CFU/100 mL)","N/A","N/A","N/A","N/A","N/A","N/A","N/A","N/A","N/A","N/A","N/A","N/A","N/A","N/A","N/A","N/A"]
["Microbiological quality of piped on premises at point of collection","Not contaminated (No E. coli in 100 mL)","N/A","N/A","N/A","N/A","N/A","N/A","N/A","N/A","N/A","N/A","N/A","N/A","N/A","N/A","N/A","N/A",null,null,null,null,null,null,null,null,null,null,null,null,null,null,null,null,null,null,null,null,null,null,null,null,null,null,null,null,null,null,null,null,null,null,"Microbiological quality of piped on premises at point of collection","Not contaminated (No E. coli in 100 mL)","N/A","N/A","N/A","N/A","N/A","N/A","N/A","N/A","N/A","N/A","N/A","N/A","N/A","N/A","N/A","N/A"]
[null,"Contaminated (E. coli detected in 100 mL)","N/A","N/A","N/A","N/A","N/A","N/A","N/A","N/A","N/A","N/A","N/A","N/A","N/A","N/A","N/A","N/A",null,null,null,null,null,null,null,null,null,null,null,null,null,null,null,null,null,null,null,null,null,null,null,null,null,null,null,null,null,null,null,null,null,null,null,"Contaminated (E. coli detected in 100 mL)","N/A","N/A","N/A","N/A","N/A","N/A","N/A","N/A","N/A","N/A","N/A","N/A","N/A","N/A","N/A","N/A"]
[null,"Highly contaminated (>100 CFU/100 mL)","N/A","N/A","N/A","N/A","N/A","N/A","N/A","N/A","N/A","N/A","N/A","N/A","N/A","N/A","N/A","N/A",null,null,null,null,null,null,null,null,null,null,null,null,null,null,null,null,null,null,null,null,null,null,null,null,null,null,null,null,null,null,null,null,null,null,null,"Highly contaminated (>100 CFU/100 mL)","N/A","N/A","N/A","N/A","N/A","N/A","N/A","N/A","N/A","N/A","N/A","N/A","N/A","N/A","N/A","N/A"]
[null,null,"NATIONAL wealth index quintile",null,null,null,null,"URBAN wealth index quintile",null,null,null,null,"RURAL wealth index quintile",null,null,null,null,"SUB-REGIONS:",null,null,null,null,null,null,null,null,null,null,null,null,null,null,null,null,null,null,null,null,null,null,null,null,null,null,null,null,null,null,null,null,null,null,"Raw numbers of respondents:","Use of drinking water sources","NATIONAL wealth index quintile",null,null,null,null,"URBAN wealth index quintile",null,null,null,null,"RURAL wealth index quintile",null,null,null,null,"SUB-REGIONS:"]
["Percentage based on weighted population",null,"Poorest","Poor","Middle","Rich","Richest","Poorest","Poor","Middle","Rich","Richest","Poorest","Poor","Middle","Rich","Richest","None valid",null,null,null,null,null,null,null,null,null,null,null,null,null,null,null,null,null,null,null,null,null,null,null,null,null,null,null,null,null,null,null,null,null,null,"Water data, raw numbers (weighted)",null,"Poorest","Poor","Middle","Rich","Richest","Poorest","Poor","Middle","Rich","Richest","Poorest","Poor","Middle","Rich","Richest","None valid"]
["Water","Indoor tap/pipe",37.315993918738734,46.706765559892261,40.489887378991362,42.112846050286819,60.464395884153234,43.655979238735476,66.119013720081753,68.654099020161752,72.183861773142326,92.819142557313668,9.8700796352814635,19.504189733278903,11.519169395614579,16.978647624988387,36.426475706721995,"N/A"]
[null,"Outside private pipe/tap",39.009481232716396,16.59430304276832,18.277510246727232,15.92171112547868,11.035122801237971,49.568034361633394,18.740840719314384,19.095466249213157,17.89619795090994,3.3437101525041486,21.797151358069183,16.588152146550847,16.204529379973913,18.941945264331299,16.749448589958135,"N/A"]
[null,"Public standpipe",11.848524413456289,19.263182155895112,20.677603875570185,16.996898746182062,8.6382606650367375,2.5450408311554331,11.285848584153086,8.3958896899938384,4.397899336501558,1.7703948793277813,31.681098165195415,31.323471575960355,28.781728597798516,33.590688947430827,13.740733301088346,"N/A"]
[null,"Well",0.49449131257573053,0.65810619626632283,0.2246565249409011,0.27905409554224486,0.36812095425757785,0,0,0,0,0,1.9818995141837332,0.50821308598343784,0.92712004425841399,0,0.64161597504919354,"N/A"]
[null,"River, lake, spring, pond",2.6421113906775435,4.2434377967700589,3.7938150603978413,4.9884497196849908,3.5621601690541875,0,0.74096737890667297,0,0,0,9.651125794855627,5.6871464435868688,11.233307383630372,7.4164886559325058,6.2086627879104332,"N/A"]
[null,"Rainwater (tank)",3.6300751455628659,10.355804947495342,12.635149032528167,15.726405780532257,14.862658276136532,0.53431985692174289,1.9987120034927075,2.8547869856165513,2.3049960677770804,1.3950578767988968,17.535817854109599,21.997183928453566,25.397767458675336,18.540206577777138,24.868395816012516,"N/A"]
[null,"Other",5.0593225862724456,2.1784003009125823,3.9013778808443145,3.9746344822929482,1.0692812501237599,3.6966257115539505,1.1146175940513954,0.99975805501470072,3.2170448716690969,0.67169453405549817,7.4828276783049761,4.3916430861860283,5.9363777400488678,4.532022929539842,1.3646678232593776,"N/A"]
[]
[]
[]
[]
[]
[]
[]
[]
[]
[]
[]
[]
[]
[]
[]
[]
[]
[]
[]
[]
[]
[]
[]
[]
[]
[]
[]
[]
[]
[]
[]
[]
[]
[]
[]
[]
[]
[]
[]
[]
[]
[]
[]
[{"$f":"A1026","v":"Jamaica"}]
[{"$f":"A1034","v":"1997"}]
["Use of sanitation facilities"]
[" by wealth quintile and sub-national region"]
["Notes:"]
["WHO/UNICEF JMP customised wealth index excludes water,"]
[" sanitation and hygiene assets."]
["Survey used for analysis:",{"$f":"A1025","v":"SLC97"}]
[{"$f":"B1030","v":"Ratio of Improved latrines based on:"}]
[{"$f":"B1029","v":"Ratio of Shared improved based on:"}]
[]
[]
["Use of sanitation facilities",null,"NATIONAL wealth index quintile",null,null,null,null,"URBAN wealth index quintile",null,null,null,null,"RURAL wealth index quintile",null,null,null,null,"SUB-REGIONS:",null,null,null,null,null,null,null,null,null,null,null,null,null,null,null,null,null,null,null,null,null,null,null,null,null,null,null,null,null,null,null,null,null,null,"Raw numbers of respondents:","Use of sanitation facilities","NATIONAL wealth index quintile",null,null,null,null,"URBAN wealth index quintile",null,null,null,null,"RURAL wealth index quintile",null,null,null,null,"SUB-REGIONS:"]
["Weighted percentage (used in graphs)",null,"Poorest","Poor","Middle","Rich","Richest","Poorest","Poor","Middle","Rich","Richest","Poorest","Poor","Middle","Rich","Richest","None valid",null,null,null,null,null,null,null,null,null,null,null,null,null,null,null,null,null,null,null,null,null,null,null,null,null,null,null,null,null,null,null,null,null,null,"Sanitation data, raw numbers (weighted)",null,"Poorest","Poor","Middle","Rich","Richest","Poorest","Poor","Middle","Rich","Richest","Poorest","Poor","Middle","Rich","Richest","None valid"]
["Sanitation","Improved",{"$f":"C153+C154+C155*MICS11!C130/100","v":96.050147554150058},{"$f":"D153+D154+D155*MICS11!D130/100","v":94.098477589788303},{"$f":"E153+E154+E155*MICS11!E130/100","v":98.182857518798386},{"$f":"F153+F154+F155*MICS11!F130/100","v":98.8814209829589},{"$f":"G153+G154+G155*MICS11!G130/100","v":100},{"$f":"H153+H154+H155*MICS11!H130/100","v":96.876204327799528},{"$f":"I153+I154+I155*MICS11!I130/100","v":96.169870289434641},{"$f":"J153+J154+J155*MICS11!J130/100","v":98.579403618544958},{"$f":"K153+K154+K155*MICS11!K130/100","v":98.390848141874841},{"$f":"L153+L154+L155*MICS11!L130/100","v":100},{"$f":"M153+M154+M155*MICS11!M130/100","v":90.127138658416797},{"$f":"N153+N154+N155*MICS11!N130/100","v":96.985372180712062},{"$f":"O153+O154+O155*MICS11!O130/100","v":97.239970959281749},{"$f":"P153+P154+P155*MICS11!P130/100","v":100},{"$f":"Q153+Q154+Q155*MICS11!Q130/100","v":100},"N/A",null,null,null,null,null,null,null,null,null,null,null,null,null,null,null,null,null,null,null,null,null,null,null,null,null,null,null,null,null,null,null,null,null,null,"Sanitation","Improved","N/A","N/A","N/A","N/A","N/A","N/A","N/A","N/A","N/A","N/A","N/A","N/A","N/A","N/A","N/A","N/A"]
[null,"Not Improved",{"$f":"100-C122","v":3.9498524458499418},{"$f":"100-D122","v":5.9015224102116974},1.8171424812016141,1.1185790170410996,0,3.1237956722004725,3.8301297105653589,1.4205963814550415,1.6091518581251592,0,9.8728613415832029,3.0146278192879379,2.7600290407182513,0,0,"N/A",null,null,null,null,null,null,null,null,null,null,null,null,null,null,null,null,null,null,null,null,null,null,null,null,null,null,null,null,null,null,null,null,null,null,null,"Not Improved","N/A","N/A","N/A","N/A","N/A","N/A","N/A","N/A","N/A","N/A","N/A","N/A","N/A","N/A","N/A","N/A"]
["Sanitation ladder","Basic",{"$f":"C122*MICS11!C129/100","v":74.92362003540353},{"$f":"D122*MICS11!D129/100","v":79.055450371055386},{"$f":"E122*MICS11!E129/100","v":82.924369702466961},{"$f":"F122*MICS11!F129/100","v":93.80507991786564},{"$f":"G122*MICS11!G129/100","v":99.17673811814862},{"$f":"H122*MICS11!H129/100","v":66.23895096057899},{"$f":"I122*MICS11!I129/100","v":80.540008529160772},{"$f":"J122*MICS11!J129/100","v":91.371633829663807},{"$f":"K122*MICS11!K129/100","v":97.671828866187482},{"$f":"L122*MICS11!L129/100","v":99.772656178099169},{"$f":"M122*MICS11!M129/100","v":70.078745887802285},{"$f":"N122*MICS11!N129/100","v":78.814054807937296},{"$f":"O122*MICS11!O129/100","v":86.407772643621755},{"$f":"P122*MICS11!P129/100","v":97.315726671608004},{"$f":"Q122*MICS11!Q129/100","v":99.013508349070065},"N/A",null,null,null,null,null,null,null,null,null,null,null,null,null,null,null,null,null,null,null,null,null,null,null,null,null,null,null,null,null,null,null,null,null,null,"Sanitation ladder","Basic","N/A","N/A","N/A","N/A","N/A","N/A","N/A","N/A","N/A","N/A","N/A","N/A","N/A","N/A","N/A","N/A"]
[null,"Limited",{"$f":"C122*MICS11!C128/100","v":21.126527518746574},{"$f":"D122*MICS11!D128/100","v":15.043027218732856},{"$f":"E122*MICS11!E128/100","v":15.258487816331513},{"$f":"F122*MICS11!F128/100","v":5.0763410650933061},{"$f":"G122*MICS11!G128/100","v":0.82326188185136084},{"$f":"H122*MICS11!H128/100","v":30.637253367220534},{"$f":"I122*MICS11!I128/100","v":15.629861760273849},{"$f":"J122*MICS11!J128/100","v":7.2077697888811318},{"$f":"K122*MICS11!K128/100","v":0.71901927568734048},{"$f":"L122*MICS11!L128/100","v":0.22734382190085115},{"$f":"M122*MICS11!M128/100","v":20.048392770614431},{"$f":"N122*MICS11!N128/100","v":18.171317372774787},{"$f":"O122*MICS11!O128/100","v":10.83219831566001},{"$f":"P122*MICS11!P128/100","v":2.6842733283920173},{"$f":"Q122*MICS11!Q128/100","v":0.98649165092992963},"N/A",null,null,null,null,null,null,null,null,null,null,null,null,null,null,null,null,null,null,null,null,null,null,null,null,null,null,null,null,null,null,null,null,null,null,null,"Limited","N/A","N/A","N/A","N/A","N/A","N/A","N/A","N/A","N/A","N/A","N/A","N/A","N/A","N/A","N/A","N/A"]
[null,"Unimproved",{"$f":"100-(C124+C125+C127)","v":0.96692922039351004},{"$f":"100-(D124+D125+D127)","v":1.1905243289734955},1.1679298534898521,0.55928950852050718,0,0.85166408960014905,0.94401744662185649,0.44860938326007727,0.81642132776173071,0,1.776483197779342,1.4832435588110542,1.3954985140172198,0,0,"N/A",null,null,null,null,null,null,null,null,null,null,null,null,null,null,null,null,null,null,null,null,null,null,null,null,null,null,null,null,null,null,null,null,null,null,null,"Unimproved","N/A","N/A","N/A","N/A","N/A","N/A","N/A","N/A","N/A","N/A","N/A","N/A","N/A","N/A","N/A","N/A"]
[null,"Open defecation",{"$f":"C157","v":2.9829232254563891},{"$f":"D157","v":4.7109980812382624},0.64921262771167287,0.55928950852055337,0,2.2721315826003217,2.8861122639435215,0.97198699819498535,0.79273053036344343,0,8.0963781438039444,1.5313842604768531,1.3645305267010148,0,0,"N/A",null,null,null,null,null,null,null,null,null,null,null,null,null,null,null,null,null,null,null,null,null,null,null,null,null,null,null,null,null,null,null,null,null,null,null,"Open defecation","N/A","N/A","N/A","N/A","N/A","N/A","N/A","N/A","N/A","N/A","N/A","N/A","N/A","N/A","N/A","N/A"]
["Shared among Improved Sanitation","Yes","N/A","N/A","N/A","N/A","N/A","N/A","N/A","N/A","N/A","N/A","N/A","N/A","N/A","N/A","N/A","N/A",null,null,null,null,null,null,null,null,null,null,null,null,null,null,null,null,null,null,null,null,null,null,null,null,null,null,null,null,null,null,null,null,null,null,"Shared among improved sanitation facilities","Yes","N/A","N/A","N/A","N/A","N/A","N/A","N/A","N/A","N/A","N/A","N/A","N/A","N/A","N/A","N/A","N/A"]
[null,"No","N/A","N/A","N/A","N/A","N/A","N/A","N/A","N/A","N/A","N/A","N/A","N/A","N/A","N/A","N/A","N/A",null,null,null,null,null,null,null,null,null,null,null,null,null,null,null,null,null,null,null,null,null,null,null,null,null,null,null,null,null,null,null,null,null,null,null,"No","N/A","N/A","N/A","N/A","N/A","N/A","N/A","N/A","N/A","N/A","N/A","N/A","N/A","N/A","N/A","N/A"]
["Manually calculated ratios","Improved latrines"]
[null,"Other"]
[null,"Other"]
[null,null,"NATIONAL wealth index quintile",null,null,null,null,"URBAN wealth index quintile",null,null,null,null,"RURAL wealth index quintile",null,null,null,null,"SUB-REGIONS:",null,null,null,null,null,null,null,null,null,null,null,null,null,null,null,null,null,null,null,null,null,null,null,null,null,null,null,null,null,null,null,null,null,null,"Raw numbers of respondents:","Use of sanitation facilities","NATIONAL wealth index quintile",null,null,null,null,"URBAN wealth index quintile",null,null,null,null,"RURAL wealth index quintile",null,null,null,null,"SUB-REGIONS:"]
["Percentage based on weighted population",null,"Poorest","Poor","Middle","Rich","Richest","Poorest","Poor","Middle","Rich","Richest","Poorest","Poor","Middle","Rich","Richest","None valid",null,null,null,null,null,null,null,null,null,null,null,null,null,null,null,null,null,null,null,null,null,null,null,null,null,null,null,null,null,null,null,null,null,null,"Sanitation data, raw numbers (weighted)",null,"Poorest","Poor","Middle","Rich","Richest","Poorest","Poor","Middle","Rich","Richest","Poorest","Poor","Middle","Rich","Richest","None valid"]
["Sanitation type","Sewer connection",{"$f":"C153","v":29.293872954384938},{"$f":"D153","v":28.914076009712357},24.687925952004584,22.005503181770202,29.337264306351134,36.379125054368558,43.751022403338233,40.732340252218123,41.123177315431256,53.391361211869125,8.1267744201736303,9.1360440441522215,6.7765937848328512,8.4855662465227439,11.346430142523795,"N/A",null,null,null,null,null,null,null,null,null,null,null,null,null,null,null,null,null,null,null,null,null,null,null,null,null,null,null,null,null,null,null,null,null,null,"Sanitation type","Sewer connection","N/A","N/A","N/A","N/A","N/A","N/A","N/A","N/A","N/A","N/A","N/A","N/A","N/A","N/A","N/A","N/A"]
[null,"Septic tank connection","N/A","N/A","N/A","N/A","N/A","N/A","N/A","N/A","N/A","N/A","N/A","N/A","N/A","N/A","N/A","N/A",null,null,null,null,null,null,null,null,null,null,null,null,null,null,null,null,null,null,null,null,null,null,null,null,null,null,null,null,null,null,null,null,null,null,null,"Septic tank connection","N/A","N/A","N/A","N/A","N/A","N/A","N/A","N/A","N/A","N/A","N/A","N/A","N/A","N/A","N/A","N/A"]
[null,"Improved latrines","N/A","N/A","N/A","N/A","N/A","N/A","N/A","N/A","N/A","N/A","N/A","N/A","N/A","N/A","N/A","N/A",null,null,null,null,null,null,null,null,null,null,null,null,null,null,null,null,null,null,null,null,null,null,null,null,null,null,null,null,null,null,null,null,null,null,null,"Improved latrines","N/A","N/A","N/A","N/A","N/A","N/A","N/A","N/A","N/A","N/A","N/A","N/A","N/A","N/A","N/A","N/A"]
[null,"Unimproved facilities",68.054792789318611,69.054792789318597,70.054792789318597,71.054792789318597,72.054792789318597,73.054792789318597,74.054792789318597,75.054792789318597,76.054792789318597,77.054792789318597,78.054792789318597,79.054792789318597,80.054792789318597,81.054792789318597,82.054792789318597,"N/A",null,null,null,null,null,null,null,null,null,null,null,null,null,null,null,null,null,null,null,null,null,null,null,null,null,null,null,null,null,null,null,null,null,null,null,"Unimproved facilities","N/A","N/A","N/A","N/A","N/A","N/A","N/A","N/A","N/A","N/A","N/A","N/A","N/A","N/A","N/A","N/A"]
[null,"Open defecation",{"$f":"C157","v":2.9829232254563891},{"$f":"D157","v":4.7109980812382624},0.64921262771167287,0.55928950852055337,0,2.2721315826003217,2.8861122639435215,0.97198699819498535,0.79273053036344343,0,8.0963781438039444,1.5313842604768531,1.3645305267010148,0,0,"N/A",null,null,null,null,null,null,null,null,null,null,null,null,null,null,null,null,null,null,null,null,null,null,null,null,null,null,null,null,null,null,null,null,null,null,null,"Open defecation","N/A","N/A","N/A","N/A","N/A","N/A","N/A","N/A","N/A","N/A","N/A","N/A","N/A","N/A","N/A","N/A"]
["Septic tank emptying practices","Not emptied/treated and disposed in situ","N/A","N/A","N/A","N/A","N/A","N/A","N/A","N/A","N/A","N/A","N/A","N/A","N/A","N/A","N/A","N/A",null,null,null,null,null,null,null,null,null,null,null,null,null,null,null,null,null,null,null,null,null,null,null,null,null,null,null,null,null,null,null,null,null,null,"Septic tank emptying practices","Not emptied/treated and disposed in situ","N/A","N/A","N/A","N/A","N/A","N/A","N/A","N/A","N/A","N/A","N/A","N/A","N/A","N/A","N/A","N/A"]
[null,"Emptied and buried on site","N/A","N/A","N/A","N/A","N/A","N/A","N/A","N/A","N/A","N/A","N/A","N/A","N/A","N/A","N/A","N/A",null,null,null,null,null,null,null,null,null,null,null,null,null,null,null,null,null,null,null,null,null,null,null,null,null,null,null,null,null,null,null,null,null,null,null,"Emptied and buried on site","N/A","N/A","N/A","N/A","N/A","N/A","N/A","N/A","N/A","N/A","N/A","N/A","N/A","N/A","N/A","N/A"]
[null,"Emptied and discharged locally","N/A","N/A","N/A","N/A","N/A","N/A","N/A","N/A","N/A","N/A","N/A","N/A","N/A","N/A","N/A","N/A",null,null,null,null,null,null,null,null,null,null,null,null,null,null,null,null,null,null,null,null,null,null,null,null,null,null,null,null,null,null,null,null,null,null,null,"Emptied and discharged locally","N/A","N/A","N/A","N/A","N/A","N/A","N/A","N/A","N/A","N/A","N/A","N/A","N/A","N/A","N/A","N/A"]
[null,"Emptied and removed offsite","N/A","N/A","N/A","N/A","N/A","N/A","N/A","N/A","N/A","N/A","N/A","N/A","N/A","N/A","N/A","N/A",null,null,null,null,null,null,null,null,null,null,null,null,null,null,null,null,null,null,null,null,null,null,null,null,null,null,null,null,null,null,null,null,null,null,null,"Emptied and removed offsite","N/A","N/A","N/A","N/A","N/A","N/A","N/A","N/A","N/A","N/A","N/A","N/A","N/A","N/A","N/A","N/A"]
["Latrine emptying practices","Not emptied/treated and disposed in situ","N/A","N/A","N/A","N/A","N/A","N/A","N/A","N/A","N/A","N/A","N/A","N/A","N/A","N/A","N/A","N/A",null,null,null,null,null,null,null,null,null,null,null,null,null,null,null,null,null,null,null,null,null,null,null,null,null,null,null,null,null,null,null,null,null,null,"Latrine emptying practices","Not emptied/treated and disposed in situ","N/A","N/A","N/A","N/A","N/A","N/A","N/A","N/A","N/A","N/A","N/A","N/A","N/A","N/A","N/A","N/A"]
[null,"Emptied and buried on site","N/A","N/A","N/A","N/A","N/A","N/A","N/A","N/A","N/A","N/A","N/A","N/A","N/A","N/A","N/A","N/A",null,null,null,null,null,null,null,null,null,null,null,null,null,null,null,null,null,null,null,null,null,null,null,null,null,null,null,null,null,null,null,null,null,null,null,"Emptied and buried on site","N/A","N/A","N/A","N/A","N/A","N/A","N/A","N/A","N/A","N/A","N/A","N/A","N/A","N/A","N/A","N/A"]
[null,"Emptied and discharged locally","N/A","N/A","N/A","N/A","N/A","N/A","N/A","N/A","N/A","N/A","N/A","N/A","N/A","N/A","N/A","N/A",null,null,null,null,null,null,null,null,null,null,null,null,null,null,null,null,null,null,null,null,null,null,null,null,null,null,null,null,null,null,null,null,null,null,null,"Emptied and discharged locally","N/A","N/A","N/A","N/A","N/A","N/A","N/A","N/A","N/A","N/A","N/A","N/A","N/A","N/A","N/A","N/A"]
[null,"Emptied and removed offsite","N/A","N/A","N/A","N/A","N/A","N/A","N/A","N/A","N/A","N/A","N/A","N/A","N/A","N/A","N/A","N/A",null,null,null,null,null,null,null,null,null,null,null,null,null,null,null,null,null,null,null,null,null,null,null,null,null,null,null,null,null,null,null,null,null,null,null,"Emptied and removed offsite","N/A","N/A","N/A","N/A","N/A","N/A","N/A","N/A","N/A","N/A","N/A","N/A","N/A","N/A","N/A","N/A"]
["Shared among improved sanitation facilities","Yes","N/A","N/A","N/A","N/A","N/A","N/A","N/A","N/A","N/A","N/A","N/A","N/A","N/A","N/A","N/A","N/A",null,null,null,null,null,null,null,null,null,null,null,null,null,null,null,null,null,null,null,null,null,null,null,null,null,null,null,null,null,null,null,null,null,null,"Shared among improved sanitation facilities","Yes","N/A","N/A","N/A","N/A","N/A","N/A","N/A","N/A","N/A","N/A","N/A","N/A","N/A","N/A","N/A","N/A"]
[null,"No","N/A","N/A","N/A","N/A","N/A","N/A","N/A","N/A","N/A","N/A","N/A","N/A","N/A","N/A","N/A","N/A",null,null,null,null,null,null,null,null,null,null,null,null,null,null,null,null,null,null,null,null,null,null,null,null,null,null,null,null,null,null,null,null,null,null,null,"No","N/A","N/A","N/A","N/A","N/A","N/A","N/A","N/A","N/A","N/A","N/A","N/A","N/A","N/A","N/A","N/A"]
[null,"DK/missing","N/A","N/A","N/A","N/A","N/A","N/A","N/A","N/A","N/A","N/A","N/A","N/A","N/A","N/A","N/A","N/A",null,null,null,null,null,null,null,null,null,null,null,null,null,null,null,null,null,null,null,null,null,null,null,null,null,null,null,null,null,null,null,null,null,null,null,"DK/missing","N/A","N/A","N/A","N/A","N/A","N/A","N/A","N/A","N/A","N/A","N/A","N/A","N/A","N/A","N/A","N/A"]
["Shared among all sanitation facilities","Yes",81.776666027899978,18.990882690670897,8.6435428496141906,2.9926330157126797,0.62829642759712079,88.030912484060792,33.619294269570787,9.7387011506271097,4.212053678611956,0,62.670206095229538,18.319328201345133,4.5341708133000127,1.031381223763518,1.0983363435316651,"N/A",null,null,null,null,null,null,null,null,null,null,null,null,null,null,null,null,null,null,null,null,null,null,null,null,null,null,null,null,null,null,null,null,null,null,"Shared among all sanitation facilities","Yes","N/A","N/A","N/A","N/A","N/A","N/A","N/A","N/A","N/A","N/A","N/A","N/A","N/A","N/A","N/A","N/A"]
[null,"No",18.223333972100026,81.009117309329099,91.356457150385808,97.00736698428733,99.371703572402879,11.969087515939203,66.380705730429213,90.261298849372892,95.787946321388034,100,37.329793904770455,81.68067179865487,95.465829186699992,98.968618776236482,98.90166365646833,"N/A",null,null,null,null,null,null,null,null,null,null,null,null,null,null,null,null,null,null,null,null,null,null,null,null,null,null,null,null,null,null,null,null,null,null,null,"No","N/A","N/A","N/A","N/A","N/A","N/A","N/A","N/A","N/A","N/A","N/A","N/A","N/A","N/A","N/A","N/A"]
["sanitation","WC linked to sewer",29.293872954384938,28.914076009712357,24.687925952004584,22.005503181770202,29.337264306351134,36.379125054368558,43.751022403338233,40.732340252218123,41.123177315431256,53.391361211869125,8.1267744201736303,9.1360440441522215,6.7765937848328512,8.4855662465227439,11.346430142523795,"N/A",null,null,null,null,null,null,null,null,null,null,null,null,null,null,null,null,null,null,null,null,null,null,null,null,null,null,null,null,null,null,null,null,null,null,"sanitation","WC linked to sewer",149.35766442120075,147.85021629557014,125.39320666715503,90.393672898411751,181.46280366554856,99.03261174634099,118.63010311499238,111.75002763047814,115.72194460406899,141.31122197210789,18.999267376959324,22.027838800102472,16.706959690898657,10.126007318496704,40.151581693440676,0]
[null,"WC not linked",36.044066022815223,22.243185925050589,20.813289246750511,24.660458392902768,43.030128188803864,46.77866779404242,32.349124394645159,34.108271517733947,32.1802917780728,42.348176315823366,9.5616098700928696,17.484961001408578,9.6735467700530062,14.225693897725394,43.54018196894345,"N/A",null,null,null,null,null,null,null,null,null,null,null,null,null,null,null,null,null,null,null,null,null,null,null,null,null,null,null,null,null,null,null,null,null,null,null,"WC not linked",183.77418123558164,113.73906083032489,105.71341979131103,101.29963359981775,266.15868547558784,127.34263506159186,87.714063622057438,93.576756477355957,90.556376855820417,112.08316116407514,22.353712935000658,42.157842114567757,23.849084228277206,16.975824162364006,154.07552431151271,0]
[null,"Pit",31.169703066131639,43.891046693816762,53.157232557555425,52.215459408285923,27.632607504845002,14.035755712066955,21.013740938073088,23.738791848592896,25.087379048370789,4.2604624723075055,73.726390180314169,70.863149383104002,81.721768896283919,77.288739855751871,45.113387888532749,"N/A",null,null,null,null,null,null,null,null,null,null,null,null,null,null,null,null,null,null,null,null,null,null,null,null,null,null,null,null,null,null,null,null,null,null,null,"Pit",158.92176694795489,224.43396582826972,269.99254051968455,214.48939926549792,170.91881431266665,38.208657957613468,56.978377129882574,65.127872068434954,70.596692133694887,11.276190463453531,172.36203779652715,170.85754227265716,201.47619027644396,92.230302926152945,159.64262384921312,0]
[null,"Other",0.50943473121181371,0.24069329018203281,0.69233961597781024,0.55928950852055337,0,0.53431985692174289,0,0.44860938326005095,0.81642132776171528,0,0.48884738561538638,0.98446131085835697,0.46356002212920699,0,0,"N/A",null,null,null,null,null,null,null,null,null,null,null,null,null,null,null,null,null,null,null,null,null,null,null,null,null,null,null,null,null,null,null,null,null,null,null,"Other",2.5974025949835777,1.2307692281901836,3.516483511775732,2.2974358946084976,0,1.4545454531908035,0,1.2307692281901836,2.2974358946084976,0,1.1428571417927742,2.3736263699829578,1.1428571417927742,0,0,0]
[null,"None",2.9829232254563891,4.7109980812382624,0.64921262771167287,0.55928950852055337,0,2.2721315826003217,2.8861122639435215,0.97198699819498535,0.79273053036344343,0,8.0963781438039444,1.5313842604768531,1.3645305267010148,0,0,"N/A",null,null,null,null,null,null,null,null,null,null,null,null,null,null,null,null,null,null,null,null,null,null,null,null,null,null,null,null,null,null,null,null,null,null,null,"None",15.208724595606327,24.089377265423536,3.2974358946084976,2.2974358946084976,0,6.1852813810110092,7.8256410174071789,2.6666666641831398,2.2307692281901836,0,18.928205113857985,3.6923076845705509,3.3641025610268116,0,0,0]
[null,null,null,null,null,null,null,null,null,null,null,null,null,null,null,null,null,null,null,null,null,null,null,null,null,null,null,null,null,null,null,null,null,null,null,null,null,null,null,null,null,null,null,null,null,null,null,null,null,null,null,null,null,"Total",509.85973979532719,511.34338944777846,507.91308638453484,410.77757755294442,618.54030345380306,272.22373159974813,271.14818488433957,274.35209206864238,281.40321871638298,264.67057359963655,233.78608036413789,241.10915724188089,246.53919389843941,119.33213440701365,353.86972985416651,0]
[]
[]
[]
[]
[]
[]
[]
[]
[]
[]
[]
[]
[]
[]
[]
[]
[]
[]
[]
[]
[]
[]
[]
[]
[]
[]
[]
[]
[]
[]
[]
[]
[]
[]
[]
[]
[]
[]
[]
[]
[]
[]
[]
[]
[]
[]
[]
[]
[]
[{"$f":"A1026","v":"Jamaica"}]
[{"$f":"A1034","v":"1997"}]
["Access to hygiene facilities "]
[" by wealth quintile and sub-national region"]
["Notes:"]
["WHO/UNICEF JMP customised wealth index excludes water,"]
[" sanitation and hygiene assets."]
["Survey used for analysis:",{"$f":"A1025","v":"SLC97"}]
[]
[]
[]
[]
["Access to handwashing",null,"NATIONAL wealth index quintile",null,null,null,null,"URBAN wealth index quintile",null,null,null,null,"RURAL wealth index quintile",null,null,null,null,"SUB-REGIONS:",null,null,null,null,null,null,null,null,null,null,null,null,null,null,null,null,null,null,null,null,null,null,null,null,null,null,null,null,null,null,null,null,null,null,"Raw numbers of respondents:","Access to handwashing","NATIONAL wealth index quintile",null,null,null,null,"URBAN wealth index quintile",null,null,null,null,"RURAL wealth index quintile",null,null,null,null,"SUB-REGIONS:"]
["Weighted percentage (used in graphs)",null,"Poorest","Poor","Middle","Rich","Richest","Poorest","Poor","Middle","Rich","Richest","Poorest","Poor","Middle","Rich","Richest","None valid",null,null,null,null,null,null,null,null,null,null,null,null,null,null,null,null,null,null,null,null,null,null,null,null,null,null,null,null,null,null,null,null,null,null,"Hygiene data, raw numbers (weighted)",null,"Poorest","Poor","Middle","Rich","Richest","Poorest","Poor","Middle","Rich","Richest","Poorest","Poor","Middle","Rich","Richest","None valid"]
["Hygiene ladder","Basic","N/A","N/A","N/A","N/A","N/A","N/A","N/A","N/A","N/A","N/A","N/A","N/A","N/A","N/A","N/A","N/A",null,null,null,null,null,null,null,null,null,null,null,null,null,null,null,null,null,null,null,null,null,null,null,null,null,null,null,null,null,null,null,null,null,null,"Hygiene ladder","Basic","N/A","N/A","N/A","N/A","N/A","N/A","N/A","N/A","N/A","N/A","N/A","N/A","N/A","N/A","N/A","N/A"]
[null,"Limited","N/A","N/A","N/A","N/A","N/A","N/A","N/A","N/A","N/A","N/A","N/A","N/A","N/A","N/A","N/A","N/A",null,null,null,null,null,null,null,null,null,null,null,null,null,null,null,null,null,null,null,null,null,null,null,null,null,null,null,null,null,null,null,null,null,null,null,"Limited","N/A","N/A","N/A","N/A","N/A","N/A","N/A","N/A","N/A","N/A","N/A","N/A","N/A","N/A","N/A","N/A"]
[null,"No facility","N/A","N/A","N/A","N/A","N/A","N/A","N/A","N/A","N/A","N/A","N/A","N/A","N/A","N/A","N/A","N/A",null,null,null,null,null,null,null,null,null,null,null,null,null,null,null,null,null,null,null,null,null,null,null,null,null,null,null,null,null,null,null,null,null,null,null,"No facility","N/A","N/A","N/A","N/A","N/A","N/A","N/A","N/A","N/A","N/A","N/A","N/A","N/A","N/A","N/A","N/A"]
[null,null,null,null,null,null,null,null,null,null,null,null,null,null,null,null,null,null,null,null,null,null,null,null,null,null,null,null,null,null,null,null,null,null,null,null,null,null,null,null,null,null,null,null,null,null,null,null,null,null,null,null,"Observed handwashing place","Fixed","N/A","N/A","N/A","N/A","N/A","N/A","N/A","N/A","N/A","N/A","N/A","N/A","N/A","N/A","N/A","N/A"]
[null,null,null,null,null,null,null,null,null,null,null,null,null,null,null,null,null,null,null,null,null,null,null,null,null,null,null,null,null,null,null,null,null,null,null,null,null,null,null,null,null,null,null,null,null,null,null,null,null,null,null,null,null,"Mobile","N/A","N/A","N/A","N/A","N/A","N/A","N/A","N/A","N/A","N/A","N/A","N/A","N/A","N/A","N/A","N/A"]
[null,null,null,null,null,null,null,null,null,null,null,null,null,null,null,null,null,null,null,null,null,null,null,null,null,null,null,null,null,null,null,null,null,null,null,null,null,null,null,null,null,null,null,null,null,null,null,null,null,null,null,null,"Water / Soap","Water and soap","N/A","N/A","N/A","N/A","N/A","N/A","N/A","N/A","N/A","N/A","N/A","N/A","N/A","N/A","N/A","N/A"]
[null,null,null,null,null,null,null,null,null,null,null,null,null,null,null,null,null,null,null,null,null,null,null,null,null,null,null,null,null,null,null,null,null,null,null,null,null,null,null,null,null,null,null,null,null,null,null,null,null,null,null,null,null,"Water only","N/A","N/A","N/A","N/A","N/A","N/A","N/A","N/A","N/A","N/A","N/A","N/A","N/A","N/A","N/A","N/A"]
[null,null,null,null,null,null,null,null,null,null,null,null,null,null,null,null,null,null,null,null,null,null,null,null,null,null,null,null,null,null,null,null,null,null,null,null,null,null,null,null,null,null,null,null,null,null,null,null,null,null,null,null,null,"Soap only","N/A","N/A","N/A","N/A","N/A","N/A","N/A","N/A","N/A","N/A","N/A","N/A","N/A","N/A","N/A","N/A"]
[null,null,null,null,null,null,null,null,null,null,null,null,null,null,null,null,null,null,null,null,null,null,null,null,null,null,null,null,null,null,null,null,null,null,null,null,null,null,null,null,null,null,null,null,null,null,null,null,null,null,null,null,null,"Neither","N/A","N/A","N/A","N/A","N/A","N/A","N/A","N/A","N/A","N/A","N/A","N/A","N/A","N/A","N/A","N/A"]
[]
[]
[]
[]
[]
[]
[]
[]
[]
[]
[]
[]
[]
[]
[]
[]
[]
[]
[]
[]
[]
[]
[]
[]
[]
[]
[]
[]
[null,null,null,null,null,null,null,null,null,null,null,null,null,null,null,null,null,null,null,null,null,null,null,null,null,null,null,null,null,null,null,null,null,null,null,null,null,null,null,null,null,null,null,null,null,null,null,null,null,null,null,null,"Raw numbers of respondents:","Menstrual health and hygiene","NATIONAL wealth index quintile",null,null,null,null,"URBAN wealth index quintile",null,null,null,null,"RURAL wealth index quintile",null,null,null,null,"SUB-REGIONS:"]
[null,null,null,null,null,null,null,null,null,null,null,null,null,null,null,null,null,null,null,null,null,null,null,null,null,null,null,null,null,null,null,null,null,null,null,null,null,null,null,null,null,null,null,null,null,null,null,null,null,null,null,null,"MHH data, raw numbers (weighted)",null,"Poorest","Poor","Middle","Rich","Richest","Poorest","Poor","Middle","Rich","Richest","Poorest","Poor","Middle","Rich","Richest","None valid"]
[null,null,null,null,null,null,null,null,null,null,null,null,null,null,null,null,null,null,null,null,null,null,null,null,null,null,null,null,null,null,null,null,null,null,null,null,null,null,null,null,null,null,null,null,null,null,null,null,null,null,null,null,"Private place to wash and change","Yes","N/A","N/A","N/A","N/A","N/A","N/A","N/A","N/A","N/A","N/A","N/A","N/A","N/A","N/A","N/A","N/A"]
[null,null,null,null,null,null,null,null,null,null,null,null,null,null,null,null,null,null,null,null,null,null,null,null,null,null,null,null,null,null,null,null,null,null,null,null,null,null,null,null,null,null,null,null,null,null,null,null,null,null,null,null,null,"No","N/A","N/A","N/A","N/A","N/A","N/A","N/A","N/A","N/A","N/A","N/A","N/A","N/A","N/A","N/A","N/A"]
[null,null,null,null,null,null,null,null,null,null,null,null,null,null,null,null,null,null,null,null,null,null,null,null,null,null,null,null,null,null,null,null,null,null,null,null,null,null,null,null,null,null,null,null,null,null,null,null,null,null,null,null,null,"DK/not sure/missing","N/A","N/A","N/A","N/A","N/A","N/A","N/A","N/A","N/A","N/A","N/A","N/A","N/A","N/A","N/A","N/A"]
[null,null,null,null,null,null,null,null,null,null,null,null,null,null,null,null,null,null,null,null,null,null,null,null,null,null,null,null,null,null,null,null,null,null,null,null,null,null,null,null,null,null,null,null,null,null,null,null,null,null,null,null,"Use of menstrual materials","Materials reusable","N/A","N/A","N/A","N/A","N/A","N/A","N/A","N/A","N/A","N/A","N/A","N/A","N/A","N/A","N/A","N/A"]
[null,null,null,null,null,null,null,null,null,null,null,null,null,null,null,null,null,null,null,null,null,null,null,null,null,null,null,null,null,null,null,null,null,null,null,null,null,null,null,null,null,null,null,null,null,null,null,null,null,null,null,null,null,"Materials not reusable","N/A","N/A","N/A","N/A","N/A","N/A","N/A","N/A","N/A","N/A","N/A","N/A","N/A","N/A","N/A","N/A"]
[null,null,null,null,null,null,null,null,null,null,null,null,null,null,null,null,null,null,null,null,null,null,null,null,null,null,null,null,null,null,null,null,null,null,null,null,null,null,null,null,null,null,null,null,null,null,null,null,null,null,null,null,null,"No materials used","N/A","N/A","N/A","N/A","N/A","N/A","N/A","N/A","N/A","N/A","N/A","N/A","N/A","N/A","N/A","N/A"]
[null,null,null,null,null,null,null,null,null,null,null,null,null,null,null,null,null,null,null,null,null,null,null,null,null,null,null,null,null,null,null,null,null,null,null,null,null,null,null,null,null,null,null,null,null,null,null,null,null,null,null,null,null,"DK/not sure/missing","N/A","N/A","N/A","N/A","N/A","N/A","N/A","N/A","N/A","N/A","N/A","N/A","N/A","N/A","N/A","N/A"]
[null,null,null,null,null,null,null,null,null,null,null,null,null,null,null,null,null,null,null,null,null,null,null,null,null,null,null,null,null,null,null,null,null,null,null,null,null,null,null,null,null,null,null,null,null,null,null,null,null,null,null,null,"Use of menstrual materials with private place to wash and change","Materials reusable","N/A","N/A","N/A","N/A","N/A","N/A","N/A","N/A","N/A","N/A","N/A","N/A","N/A","N/A","N/A","N/A"]
[null,null,null,null,null,null,null,null,null,null,null,null,null,null,null,null,null,null,null,null,null,null,null,null,null,null,null,null,null,null,null,null,null,null,null,null,null,null,null,null,null,null,null,null,null,null,null,null,null,null,null,null,null,"Materials not reusable","N/A","N/A","N/A","N/A","N/A","N/A","N/A","N/A","N/A","N/A","N/A","N/A","N/A","N/A","N/A","N/A"]
[null,null,null,null,null,null,null,null,null,null,null,null,null,null,null,null,null,null,null,null,null,null,null,null,null,null,null,null,null,null,null,null,null,null,null,null,null,null,null,null,null,null,null,null,null,null,null,null,null,null,null,null,null,"No materials used","N/A","N/A","N/A","N/A","N/A","N/A","N/A","N/A","N/A","N/A","N/A","N/A","N/A","N/A","N/A","N/A"]
[null,null,null,null,null,null,null,null,null,null,null,null,null,null,null,null,null,null,null,null,null,null,null,null,null,null,null,null,null,null,null,null,null,null,null,null,null,null,null,null,null,null,null,null,null,null,null,null,null,null,null,null,"Awareness of menstruation before menarche","Yes","N/A","N/A","N/A","N/A","N/A","N/A","N/A","N/A","N/A","N/A","N/A","N/A","N/A","N/A","N/A","N/A"]
[null,null,null,null,null,null,null,null,null,null,null,null,null,null,null,null,null,null,null,null,null,null,null,null,null,null,null,null,null,null,null,null,null,null,null,null,null,null,null,null,null,null,null,null,null,null,null,null,null,null,null,null,null,"No","N/A","N/A","N/A","N/A","N/A","N/A","N/A","N/A","N/A","N/A","N/A","N/A","N/A","N/A","N/A","N/A"]
[null,null,null,null,null,null,null,null,null,null,null,null,null,null,null,null,null,null,null,null,null,null,null,null,null,null,null,null,null,null,null,null,null,null,null,null,null,null,null,null,null,null,null,null,null,null,null,null,null,null,null,null,null,"DK/not sure/missing","N/A","N/A","N/A","N/A","N/A","N/A","N/A","N/A","N/A","N/A","N/A","N/A","N/A","N/A","N/A","N/A"]
[null,null,null,null,null,null,null,null,null,null,null,null,null,null,null,null,null,null,null,null,null,null,null,null,null,null,null,null,null,null,null,null,null,null,null,null,null,null,null,null,null,null,null,null,null,null,null,null,null,null,null,null,"Participation in (all) activities during menstruation","Yes","N/A","N/A","N/A","N/A","N/A","N/A","N/A","N/A","N/A","N/A","N/A","N/A","N/A","N/A","N/A","N/A"]
[null,null,null,null,null,null,null,null,null,null,null,null,null,null,null,null,null,null,null,null,null,null,null,null,null,null,null,null,null,null,null,null,null,null,null,null,null,null,null,null,null,null,null,null,null,null,null,null,null,null,null,null,null,"No","N/A","N/A","N/A","N/A","N/A","N/A","N/A","N/A","N/A","N/A","N/A","N/A","N/A","N/A","N/A","N/A"]
[null,null,null,null,null,null,null,null,null,null,null,null,null,null,null,null,null,null,null,null,null,null,null,null,null,null,null,null,null,null,null,null,null,null,null,null,null,null,null,null,null,null,null,null,null,null,null,null,null,null,null,null,null,"DK/not sure/missing/no such activity","N/A","N/A","N/A","N/A","N/A","N/A","N/A","N/A","N/A","N/A","N/A","N/A","N/A","N/A","N/A","N/A"]
[null,null,null,null,null,null,null,null,null,null,null,null,null,null,null,null,null,null,null,null,null,null,null,null,null,null,null,null,null,null,null,null,null,null,null,null,null,null,null,null,null,null,null,null,null,null,null,null,null,null,null,null,"Participation in specific activities during menstruation","Did not go to school (amongst those usually attending school)","N/A","N/A","N/A","N/A","N/A","N/A","N/A","N/A","N/A","N/A","N/A","N/A","N/A","N/A","N/A","N/A"]
[null,null,null,null,null,null,null,null,null,null,null,null,null,null,null,null,null,null,null,null,null,null,null,null,null,null,null,null,null,null,null,null,null,null,null,null,null,null,null,null,null,null,null,null,null,null,null,null,null,null,null,null,null,"Did not go to work (amongst those who usually work)","N/A","N/A","N/A","N/A","N/A","N/A","N/A","N/A","N/A","N/A","N/A","N/A","N/A","N/A","N/A","N/A"]
[null,null,null,null,null,null,null,null,null,null,null,null,null,null,null,null,null,null,null,null,null,null,null,null,null,null,null,null,null,null,null,null,null,null,null,null,null,null,null,null,null,null,null,null,null,null,null,null,null,null,null,null,null,"Did not participate in social activities","N/A","N/A","N/A","N/A","N/A","N/A","N/A","N/A","N/A","N/A","N/A","N/A","N/A","N/A","N/A","N/A"]
[null,null,null,null,null,null,null,null,null,null,null,null,null,null,null,null,null,null,null,null,null,null,null,null,null,null,null,null,null,null,null,null,null,null,null,null,null,null,null,null,null,null,null,null,null,null,null,null,null,null,null,null,null,"Did not cook food","N/A","N/A","N/A","N/A","N/A","N/A","N/A","N/A","N/A","N/A","N/A","N/A","N/A","N/A","N/A","N/A"]
[null,null,null,null,null,null,null,null,null,null,null,null,null,null,null,null,null,null,null,null,null,null,null,null,null,null,null,null,null,null,null,null,null,null,null,null,null,null,null,null,null,null,null,null,null,null,null,null,null,null,null,null,null,"Did not eat with others","N/A","N/A","N/A","N/A","N/A","N/A","N/A","N/A","N/A","N/A","N/A","N/A","N/A","N/A","N/A","N/A"]
[null,null,null,null,null,null,null,null,null,null,null,null,null,null,null,null,null,null,null,null,null,null,null,null,null,null,null,null,null,null,null,null,null,null,null,null,null,null,null,null,null,null,null,null,null,null,null,null,null,null,null,null,null,"Did not bathe in regular place","N/A","N/A","N/A","N/A","N/A","N/A","N/A","N/A","N/A","N/A","N/A","N/A","N/A","N/A","N/A","N/A"]
[null,null,null,null,null,null,null,null,null,null,null,null,null,null,null,null,null,null,null,null,null,null,null,null,null,null,null,null,null,null,null,null,null,null,null,null,null,null,null,null,null,null,null,null,null,null,null,null,null,null,null,null,null,"Did not participate in other activities","N/A","N/A","N/A","N/A","N/A","N/A","N/A","N/A","N/A","N/A","N/A","N/A","N/A","N/A","N/A","N/A"]
[null,null,null,null,null,null,null,null,null,null,null,null,null,null,null,null,null,null,null,null,null,null,null,null,null,null,null,null,null,null,null,null,null,null,null,null,null,null,null,null,null,null,null,null,null,null,null,null,null,null,null,null,null,"DK/not sure/missing/no such activity","N/A","N/A","N/A","N/A","N/A","N/A","N/A","N/A","N/A","N/A","N/A","N/A","N/A","N/A","N/A","N/A"]
[]
[]
[]
[]
[]
[]
[]
[]
[]
[]
[]
[]
[]
[]
[]
[]
[]
[]
[]
[]
[]
[]
[]
[]
[]
[]
[]
[]
[]
[]
[]
[]
[]
[]
[]
[]
[]
[]
[]
[]
[]
[]
[]
[]
[]
[]
[]
[]
[]
[]
[]
[]
[]
[]
[null,null,null,null,null,null,null,null,null,null,null,null,null,null,null,null,null,null,null,null,null,null,null,null,null,null,null,null,null,null,null,null,null,null,null,null,null,null,null,null,null,null,null,null,null,null,null,null,null,null,null,null,"Raw numbers of respondents:","Basic water, sanitation and hygiene","NATIONAL wealth index quintile",null,null,null,null,"URBAN wealth index quintile",null,null,null,null,"RURAL wealth index quintile",null,null,null,null,"SUB-REGIONS:"]
[null,null,null,null,null,null,null,null,null,null,null,null,null,null,null,null,null,null,null,null,null,null,null,null,null,null,null,null,null,null,null,null,null,null,null,null,null,null,null,null,null,null,null,null,null,null,null,null,null,null,null,null,"WatSan data, raw numbers (weighted)",null,"Poorest","Poor","Middle","Rich","Richest","Poorest","Poor","Middle","Rich","Richest","Poorest","Poor","Middle","Rich","Richest","None valid"]
[null,null,null,null,null,null,null,null,null,null,null,null,null,null,null,null,null,null,null,null,null,null,null,null,null,null,null,null,null,null,null,null,null,null,null,null,null,null,null,null,null,null,null,null,null,null,null,null,null,null,null,null,"Use of Basic Water Sanitation and Hygiene","Yes","N/A","N/A","N/A","N/A","N/A","N/A","N/A","N/A","N/A","N/A","N/A","N/A","N/A","N/A","N/A","N/A"]
[null,null,null,null,null,null,null,null,null,null,null,null,null,null,null,null,null,null,null,null,null,null,null,null,null,null,null,null,null,null,null,null,null,null,null,null,null,null,null,null,null,null,null,null,null,null,null,null,null,null,null,null,null,"No","N/A","N/A","N/A","N/A","N/A","N/A","N/A","N/A","N/A","N/A","N/A","N/A","N/A","N/A","N/A","N/A"]
[null,null,null,null,null,null,null,null,null,null,null,null,null,null,null,null,null,null,null,null,null,null,null,null,null,null,null,null,null,null,null,null,null,null,null,null,null,null,null,null,null,null,null,null,null,null,null,null,null,null,null,null,"Use of Basic Water and Sanitation","Yes","N/A","N/A","N/A","N/A","N/A","N/A","N/A","N/A","N/A","N/A","N/A","N/A","N/A","N/A","N/A","N/A"]
[null,null,null,null,null,null,null,null,null,null,null,null,null,null,null,null,null,null,null,null,null,null,null,null,null,null,null,null,null,null,null,null,null,null,null,null,null,null,null,null,null,null,null,null,null,null,null,null,null,null,null,null,null,"No","N/A","N/A","N/A","N/A","N/A","N/A","N/A","N/A","N/A","N/A","N/A","N/A","N/A","N/A","N/A","N/A"]
[null,null,null,null,null,null,null,null,null,null,null,null,null,null,null,null,null,null,null,null,null,null,null,null,null,null,null,null,null,null,null,null,null,null,null,null,null,null,null,null,null,null,null,null,null,null,null,null,null,null,null,null,"Use of Basic Water and Hygiene","Yes","N/A","N/A","N/A","N/A","N/A","N/A","N/A","N/A","N/A","N/A","N/A","N/A","N/A","N/A","N/A","N/A"]
[null,null,null,null,null,null,null,null,null,null,null,null,null,null,null,null,null,null,null,null,null,null,null,null,null,null,null,null,null,null,null,null,null,null,null,null,null,null,null,null,null,null,null,null,null,null,null,null,null,null,null,null,null,"No","N/A","N/A","N/A","N/A","N/A","N/A","N/A","N/A","N/A","N/A","N/A","N/A","N/A","N/A","N/A","N/A"]
[null,null,null,null,null,null,null,null,null,null,null,null,null,null,null,null,null,null,null,null,null,null,null,null,null,null,null,null,null,null,null,null,null,null,null,null,null,null,null,null,null,null,null,null,null,null,null,null,null,null,null,null,"Use of Basic Sanitation and Hygiene","Yes","N/A","N/A","N/A","N/A","N/A","N/A","N/A","N/A","N/A","N/A","N/A","N/A","N/A","N/A","N/A","N/A"]
[null,null,null,null,null,null,null,null,null,null,null,null,null,null,null,null,null,null,null,null,null,null,null,null,null,null,null,null,null,null,null,null,null,null,null,null,null,null,null,null,null,null,null,null,null,null,null,null,null,null,null,null,null,"No","N/A","N/A","N/A","N/A","N/A","N/A","N/A","N/A","N/A","N/A","N/A","N/A","N/A","N/A","N/A","N/A"]
[null,null,null,null,null,null,null,null,null,null,null,null,null,null,null,null,null,null,null,null,null,null,null,null,null,null,null,null,null,null,null,null,null,null,null,null,null,null,null,null,null,null,null,null,null,null,null,null,null,null,null,null,"Use of Basic Water","Yes","N/A","N/A","N/A","N/A","N/A","N/A","N/A","N/A","N/A","N/A","N/A","N/A","N/A","N/A","N/A","N/A"]
[null,null,null,null,null,null,null,null,null,null,null,null,null,null,null,null,null,null,null,null,null,null,null,null,null,null,null,null,null,null,null,null,null,null,null,null,null,null,null,null,null,null,null,null,null,null,null,null,null,null,null,null,null,"No","N/A","N/A","N/A","N/A","N/A","N/A","N/A","N/A","N/A","N/A","N/A","N/A","N/A","N/A","N/A","N/A"]
[null,null,null,null,null,null,null,null,null,null,null,null,null,null,null,null,null,null,null,null,null,null,null,null,null,null,null,null,null,null,null,null,null,null,null,null,null,null,null,null,null,null,null,null,null,null,null,null,null,null,null,null,"Use of Basic Sanitation","Yes","N/A","N/A","N/A","N/A","N/A","N/A","N/A","N/A","N/A","N/A","N/A","N/A","N/A","N/A","N/A","N/A"]
[null,null,null,null,null,null,null,null,null,null,null,null,null,null,null,null,null,null,null,null,null,null,null,null,null,null,null,null,null,null,null,null,null,null,null,null,null,null,null,null,null,null,null,null,null,null,null,null,null,null,null,null,null,"No","N/A","N/A","N/A","N/A","N/A","N/A","N/A","N/A","N/A","N/A","N/A","N/A","N/A","N/A","N/A","N/A"]
[null,null,null,null,null,null,null,null,null,null,null,null,null,null,null,null,null,null,null,null,null,null,null,null,null,null,null,null,null,null,null,null,null,null,null,null,null,null,null,null,null,null,null,null,null,null,null,null,null,null,null,null,"Access to Basic Hygiene","Yes","N/A","N/A","N/A","N/A","N/A","N/A","N/A","N/A","N/A","N/A","N/A","N/A","N/A","N/A","N/A","N/A"]
[null,null,null,null,null,null,null,null,null,null,null,null,null,null,null,null,null,null,null,null,null,null,null,null,null,null,null,null,null,null,null,null,null,null,null,null,null,null,null,null,null,null,null,null,null,null,null,null,null,null,null,null,null,"No","N/A","N/A","N/A","N/A","N/A","N/A","N/A","N/A","N/A","N/A","N/A","N/A","N/A","N/A","N/A","N/A"]
[]
[]
[]
[]
[]
[]
[]
[]
[]
[]
[]
[]
[]
[]
[]
[]
[]
[]
[]
[]
[]
[]
[]
[]
[]
[]
[]
[]
[]
[]
[]
[]
[]
[]
[]
[]
[]
[]
[]
[]
[]
[]
[]
[]
[null,null,"INITIAL (national) Wealth Index",null,null,null,null,"URBAN Wealth Index",null,null,null,null,"RURAL Wealth Index"]
[null,null,"Component Matrix",null,null,null,null,"Component Matrix",null,null,null,null,"Component Matrix"]
[null,null,null,null,"Component",null,null,null,null,"Component",null,null,null,null,"Component"]
[null,"Note:\n\nThe INITIAL (national) Wealth Index is based on the first component of the Principal Component Analysis (PCA) which has been obtained at national level.\n\nThe final national-level (NATIONAL) Wealth Index is based on the URBAN and RURAL specific wealth indexes. Regression procedures are used to establish the relationships between the two sets of scores (urban and rural) and the initial (national) wealth factors.\nThis allows best use of the available information for each area and a better precision of the FINAL (NATIONAL) Wealth Index.\n\nFor dependency reasons, all WASH variables (contained in the generic MICS and DHS scripts) have been excluded from the sets of asset variables used in the PCAs.\n\nThe PCA can extracts as many components as there are asset variables in the input. Only the first of the components is used to represent the Wealth Index. \n\nThe scores represent the weights of the asset variables on the Wealth Index (correlations between the variables and the component).\n\nThe communalities are the proportion of each variable's variance that can be explained by the component.\n\nProportion of explained variance is the part of the model's total variance that is explained by the component.\n\nFor more information on the procedure used:\n\nThe DHS Wealth Index, DHS Comparative Reports No. 6, Shea Oscar Rutstein, Kiersten Johnson, ORC Macro International Inc., 2004.\n\nThe DHS Wealth Index: Approaches for Rural and Urban Areas, Shea O. Rutstein, ORC Macro International Inc., 2008.\n\nMICS Methodological Paper No. 4, Review of options for reporting water, sanitation and hygiene coverage by wealth quintile, UNICEF, 2016.",null,null,"1",null,null,null,null,"1",null,null,null,null,"1"]
[null,null,"owner1",null,-0.81406761878325018,null,null,"owner1",null,0.77112153530244731,null,null,"owner1",null,-0.77431481564773619]
[null,null,"land1",null,-0.74887028658758392,null,null,"land1",null,0.73276058898747531,null,null,"land1",null,-0.74910634564477108]
[null,null,"Household cooks in owm house",null,-0.7037635571869546,null,null,"Household cooks in owm house",null,0.73061424919210627,null,null,"Household cooks in owm house",null,-0.6497992991978615]
[null,null,"house1",null,-0.67822598581969418,null,null,"house3",null,-0.61621209334255911,null,null,"house1",null,-0.61483411160000012]
[null,null,"house3",null,0.65121473794167428,null,null,"house1",null,0.58764216855765661,null,null,"house3",null,0.59933444438505079]
[null,null,"owner3",null,0.61346414755411338,null,null,"owner3",null,-0.54774959106261578,null,null,"owner3",null,0.56047605172269144]
[null,null,"Household cooks in other house",null,0.54512330511833151,null,null,"Household cooks in other house",null,-0.50913640065719223,null,null,"Household cooks in other house",null,0.5145855365792007]
[null,null,"Household cooks outside house",null,0.38564067555169157,null,null,"Household member owns: asset2a",null,0.4959131178036974,null,null,"light1",null,-0.45132463771219888]
[null,null,"owner5",null,0.30639488636696732,null,null,"Household cooks outside house",null,-0.45042079038670552,null,null,"light2",null,0.43678216966372607]
[null,null,"light4",null,0.28302764884129689,null,null,"light4",null,-0.39025777513489779,null,null,"owner5",null,0.39357562504454757]
[null,null,"light1",null,-0.23835585840834772,null,null,"light1",null,0.36521448677072582,null,null,"Household cooks outside house",null,0.359159880503372]
[null,null,"Household member owns: asset2a",null,-0.21738302397748105,null,null,"wall4",null,-0.27180106644585356,null,null,"wall5",null,-0.33071374394746489]
[null,null,"wall4",null,0.19409543066224944,null,null,"owner5",null,-0.25800871524011154,null,null,"wall1",null,0.20648741513032959]
[null,null,"wall5",null,-0.16626376023374112,null,null,"wall5",null,0.20517289209400219,null,null,"Household member owns: asset2a",null,-0.18420966393498475]
[null,null,"house2",null,0.16018657484169874,null,null,"light2",null,-0.14509130531127584,null,null,"wall4",null,0.15142813075946404]
[null,null,"light2",null,0.12466735656420498,null,null,"wall7",null,0.14291939127446651,null,null,"owner6",null,0.14096196659067495]
[null,null,"owner4",null,0.10084522654971409,null,null,"owner7",null,-0.12881727500596726,null,null,"house4",null,0.1143422070754886]
[null,null,"house6",null,9.0378074665079688E-2,null,null,"house6",null,-0.11011846645056322,null,null,"wall7",null,0.10177630855628558]
[null,null,"owner2",null,8.861394997807466E-2,null,null,"wall3",null,-0.11010189366216715,null,null,"house2",null,7.8673517109865129E-2]
[null,null,"owner6",null,8.1002152996368329E-2,null,null,"house2",null,-0.10952506115387796,null,null,"owner2",null,7.836598133092984E-2]
[null,null,"wall2",null,7.7605530298096498E-2,null,null,"owner4",null,-0.10417645274974065,null,null,"wall2",null,6.2554911316566764E-2]
[null,null,"owner7",null,7.2196396048045508E-2,null,null,"wall1",null,-0.10294493551976545,null,null,"light4",null,4.8434161917763355E-2]
[null,null,"house4",null,6.1221415550872536E-2,null,null,"wall2",null,-9.4500441873489133E-2,null,null,"house7",null,4.8055275656107836E-2]
[null,null,"land2",null,-5.9717225359863763E-2,null,null,"owner2",null,-7.2344748417321719E-2,null,null,"land6",null,3.4127387849101458E-2]
[null,null,"house5",null,5.5134899792073429E-2,null,null,"owner6",null,-7.1935611559517804E-2,null,null,"wall6",null,3.2476551615351915E-2]
[null,null,"wall3",null,5.336522802743212E-2,null,null,"land2",null,6.2949076766085493E-2,null,null,"land3",null,2.4614969589009685E-2]
[null,null,"land5",null,-5.082225300207957E-2,null,null,"land5",null,4.9650937394029641E-2,null,null,"owner7",null,2.2610627252999924E-2]
[null,null,"house7",null,2.8563839003687672E-2,null,null,"house7",null,-2.892652172825674E-2,null,null,"light3",null,1.9916070486227375E-2]
[null,null,"wall1",null,2.6964110024693514E-2,null,null,"house5",null,2.8541250401152185E-2,null,null,"wall3",null,-1.9696209312781324E-2]
[null,null,"land6",null,-2.3141488203552118E-2,null,null,"land3",null,2.6583273922516575E-2,null,null,"land5",null,1.2451535638264209E-2]
[null,null,"land3",null,-1.6611368780103501E-2,null,null,"light3",null,-1.8057542376224485E-2,null,null,"owner4",null,1.024630343639008E-2]
[null,null,"house8",null,7.4718760292285464E-3,null,null,"land6",null,1.5834549328673876E-2,null,null,"land7",null,8.2326034201917787E-3]
[null,null,"land4",null,4.3680361953322526E-3,null,null,"house8",null,9.637905497237257E-3,null,null,"land2",null,-1.3475543546087685E-3]
[null,null,"light3",null,3.5499172999180154E-3,null,null,"land7",null,-6.757096541354278E-3]
[null,null,"wall7",null,2.358192886633578E-3,null,null,"land4",null,6.3740696242986575E-3]
[null,null,"wall6",null,2.3231420424789056E-3,null,null,"wall6",null,1.0631572164571713E-3]
[null,null,"land7",null,-1.8578817853488877E-3,null,null,"house4",null,3.2106185461336422E-4,null,null,"Communalities"]
[null,null,null,null,null,null,null,null,null,null,null,null,null,null,"Extraction"]
[null,null,null,null,null,null,null,null,null,null,null,null,"wall1",null,4.2637052607205066E-2]
[null,null,null,null,null,null,null,null,null,null,null,null,"wall2",null,3.9131169298235327E-3]
[null,null,"Communalities",null,null,null,null,"Communalities",null,null,null,null,"wall3",null,3.8794066129289379E-4]
[null,null,null,null,"Extraction",null,null,null,null,"Extraction",null,null,"wall4",null,2.2930478785305339E-2]
[null,null,"wall1",null,7.270632294237773E-4,null,null,"wall1",null,1.0597659749168667E-2,null,null,"wall5",null,0.10937158043574936]
[null,null,"wall2",null,6.0226183328487733E-3,null,null,"wall2",null,8.9303335142846985E-3,null,null,"wall6",null,1.0547264048246172E-3]
[null,null,"wall3",null,2.8478475624198266E-3,null,null,"wall3",null,1.2122426987995162E-2,null,null,"wall7",null,1.035841698334425E-2]
[null,null,"wall4",null,3.7673036203964075E-2,null,null,"wall4",null,7.3875819721103297E-2,null,null,"light1",null,0.20369392860604757]
[null,null,"wall5",null,2.7643637967062956E-2,null,null,"wall5",null,4.2095915650217065E-2,null,null,"light2",null,0.19077866373615199]
[null,null,"wall6",null,5.3969889495330613E-6,null,null,"wall6",null,1.1303032669049607E-6,null,null,"light3",null,3.9664986361237714E-4]
[null,null,"wall7",null,5.5610736905692071E-6,null,null,"wall7",null,2.0425952402264056E-2,null,null,"light4",null,2.3458680406761179E-3]
[null,null,"light1",null,5.6813515237580305E-2,null,null,"light1",null,0.13338162134720466,null,null,"house1",null,0.37802098478696139]
[null,null,"light2",null,1.5541949792706624E-2,null,null,"light2",null,2.105148687692986E-2,null,null,"house2",null,6.1895222944362413E-3]
[null,null,"light3",null,1.2601912836257213E-5,null,null,"light3",null,3.2607483666914302E-4,null,null,"house3",null,0.35920177622633753]
[null,null,"light4",null,8.0104650008632469E-2,null,null,"light4",null,0.15230113105324045,null,null,"house4",null,1.3074140318893916E-2]
[null,null,"house1",null,0.45999048784109603,null,null,"house1",null,0.3453233182671453,null,null,"house7",null,2.3093095183845105E-3]
[null,null,"house2",null,2.565973875951515E-2,null,null,"house2",null,1.1995739020760707E-2,null,null,"owner1",null,0.59956343373158771]
[null,null,"house3",null,0.42408063491244352,null,null,"house3",null,0.37971734398161877,null,null,"owner2",null,6.1412270299596441E-3]
[null,null,"house4",null,3.7480617220526178E-3,null,null,"house4",null,1.0308071448777302E-7,null,null,"owner3",null,0.3141334045546571]
[null,null,"house5",null,3.0398571750819784E-3,null,null,"house5",null,8.146029744612698E-4,null,null,"owner4",null,1.0498673411057917E-4]
[null,null,"house6",null,8.1681963801667184E-3,null,null,"house6",null,1.2126076653423818E-2,null,null,"owner5",null,0.15490177262920629]
[null,null,"house7",null,8.158928986285891E-4,null,null,"house7",null,8.3674365929530925E-4,null,null,"owner6",null,1.9870276025110559E-2]
[null,null,"house8",null,5.582893139616015E-5,null,null,"house8",null,9.2889222373676139E-5,null,null,"owner7",null,5.1124046477410293E-4]
[null,null,"owner1",null,0.66270608795143116,null,null,"owner1",null,0.59462842220720347,null,null,"land1",null,0.56116031708526326]
[null,null,"owner2",null,7.8524321307167182E-3,null,null,"owner2",null,5.2337626235655736E-3,null,null,"land2",null,1.8159027386250547E-6]
[null,null,"owner3",null,0.37633826033429502,null,null,"owner3",null,0.3000296145092628,null,null,"land3",null,6.0589672786787163E-4]
[null,null,"owner4",null,1.016975971786316E-2,null,null,"owner4",null,1.0852733307518946E-2,null,null,"land5",null,1.5504073975096367E-4]
[null,null,"owner5",null,9.3877826391826819E-2,null,null,"owner5",null,6.6568497139852967E-2,null,null,"land6",null,1.1646786014029979E-3]
[null,null,"owner6",null,6.5613487900470623E-3,null,null,"owner6",null,5.1747322104418311E-3,null,null,"land7",null,6.7775759074153368E-5]
[null,null,"owner7",null,5.2123196023262409E-3,null,null,"owner7",null,1.6593890339962999E-2,null,null,"Household cooks in owm house",null,0.42223912923803192]
[null,null,"land1",null,0.56080670613377004,null,null,"land1",null,0.53693808077327176,null,null,"Household cooks in other house",null,0.26479827445650389]
[null,null,"land2",null,3.5661470046807558E-3,null,null,"land2",null,3.9625862657025248E-3,null,null,"Household cooks outside house",null,0.12899581976319646]
[null,null,"land3",null,2.7593757274859727E-4,null,null,"land3",null,7.0667045243954976E-4,null,null,"Household member owns: asset2a",null,3.393320028704002E-2]
[null,null,"land4",null,1.907974020373266E-5,null,null,"land4",null,4.0628763575406827E-5]
[null,null,"land5",null,2.5829014002073858E-3,null,null,"land5",null,2.4652155841058511E-3]
[null,null,"land6",null,5.3552847627514179E-4,null,null,"land6",null,2.507329524422063E-4,null,null,"Total Variance Explained"]
[null,null,"land7",null,3.4517247283311707E-6,null,null,"land7",null,4.5658353669181949E-5,null,null,"Component",null,"Extraction Sums of Squared Loadings"]
[null,null,"Household cooks in owm house",null,0.49528314442443594,null,null,"Household cooks in owm house",null,0.53379718112254515,null,null,null,null,"Total","% of Variance","Cumulative %"]
[null,null,"Household cooks in other house",null,0.29715941778313354,null,null,"Household cooks in other house",null,0.25921987447416095,null,null,"1",null,3.8550124459293227,11.681855896755524,11.681855896755524]
[null,null,"Household cooks outside house",null,0.14871873063996505,null,null,"Household cooks outside house",null,0.2028788884125845]
[null,null,"Household member owns: asset2a",null,4.72553791135941E-2,null,null,"Household member owns: asset2a",null,0.24592982040978387]
[null,null,null,null,null,null,null,null,null,null,null,null,"Component Score Coefficient Matrix"]
[null,null,null,null,null,null,null,null,null,null,null,null,null,null,"Component"]
[null,null,"Total Variance Explained",null,null,null,null,"Total Variance Explained",null,null,null,null,null,null,"1"]
[null,null,"Component",null,"Extraction Sums of Squared Loadings",null,null,"Component",null,"Extraction Sums of Squared Loadings",null,null,"wall1",null,5.3563358880557903E-2]
[null,null,null,null,"Total","% of Variance","Cumulative %",null,null,"Total","% of Variance","Cumulative %","wall2",null,1.622690255711658E-2]
[null,null,"1",null,3.8718810358627453,10.464543340169582,10.464543340169582,"1",null,4.0113333592042268,10.841441511362774,10.841441511362774,"wall3",null,-5.109246620871334E-3]
[null,null,null,null,null,null,null,null,null,null,null,null,"wall4",null,3.9280840952761048E-2]
[null,null,null,null,null,null,null,null,null,null,null,null,"wall5",null,-8.5787983459477579E-2]
[null,null,"Component Score Coefficient Matrix",null,null,null,null,"Component Score Coefficient Matrix",null,null,null,null,"wall6",null,8.4244998092406521E-3]
[null,null,null,null,"Component",null,null,null,null,"Component",null,null,"wall7",null,2.6401032417873432E-2]
[null,null,null,null,"1",null,null,null,null,"1",null,null,"light1",null,-0.11707475502154928]
[null,null,"wall1",null,6.964085356688984E-3,null,null,"wall1",null,-2.5663520406139426E-2,null,null,"light2",null,0.11330240194812954]
[null,null,"wall2",null,2.0043366410095343E-2,null,null,"wall2",null,-2.3558361624733248E-2,null,null,"light3",null,5.1662791665582387E-3]
[null,null,"wall3",null,1.3782765413798699E-2,null,null,"wall3",null,-2.7447704741250755E-2,null,null,"light4",null,1.256394437037606E-2]
[null,null,"wall4",null,5.01294923228447E-2,null,null,"wall4",null,-6.7758284367513619E-2,null,null,"house1",null,-0.15948952700508934]
[null,null,"wall5",null,-4.2941340060230884E-2,null,null,"wall5",null,5.114830250226441E-2,null,null,"house2",null,2.0408109756672763E-2]
[null,null,"wall6",null,6.0000346626384816E-4,null,null,"wall6",null,2.650383603790242E-4,null,null,"house3",null,0.15546887404161677]
[null,null,"wall7",null,6.0905613183647779E-4,null,null,"wall7",null,3.5628899040896236E-2,null,null,"house4",null,2.9660658345273979E-2]
[null,null,"light1",null,-6.1560739134444126E-2,null,null,"light1",null,9.1045658405009153E-2,null,null,"house7",null,1.2465660313717411E-2]
[null,null,"light2",null,3.2198137135281642E-2,null,null,"light2",null,-3.6170343454092597E-2,null,null,"owner1",null,-0.2008592258801575]
[null,null,"light3",null,9.1684565384044956E-4,null,null,"light3",null,-4.5016309439330085E-3,null,null,"owner2",null,2.032833419608799E-2]
[null,null,"light4",null,7.3098229573634557E-2,null,null,"light4",null,-9.7288791578348827E-2,null,null,"owner3",null,0.14538890848835595]
[null,null,"house1",null,-0.17516705176055847,null,null,"house1",null,0.14649547069162908,null,null,"owner4",null,2.6579170833052963E-3]
[null,null,"house2",null,4.1371770815785268E-2,null,null,"house2",null,-2.7303904050399268E-2,null,null,"owner5",null,0.10209451475575428]
[null,null,"house3",null,0.16819079199745313,null,null,"house3",null,-0.15361777198811624,null,null,"owner6",null,3.6565891438177567E-2]
[null,null,"house4",null,1.5811801804812165E-2,null,null,"house4",null,8.0038686856246963E-5,null,null,"owner7",null,5.8652540219099646E-3]
[null,null,"house5",null,1.4239822784169839E-2,null,null,"house5",null,7.1151529542322163E-3,null,null,"land1",null,-0.19432008486400235]
[null,null,"house6",null,2.3342162072637482E-2,null,null,"house6",null,-2.7451836232431377E-2,null,null,"land2",null,-3.4955901531049809E-4]
[null,null,"house7",null,7.3772511962839757E-3,null,null,"house7",null,-7.2111986558991018E-3,null,null,"land3",null,6.3851855043948608E-3]
[null,null,"house8",null,1.9297793398147728E-3,null,null,"house8",null,2.4026687971775147E-3,null,null,"land5",null,3.2299599062027245E-3]
[null,null,"owner1",null,-0.21025119605769527,null,null,"owner1",null,0.19223571472390008,null,null,"land6",null,8.8527309127466175E-3]
[null,null,"owner2",null,2.2886537359309497E-2,null,null,"owner2",null,-1.8035087572894608E-2,null,null,"land7",null,2.1355581948600318E-3]
[null,null,"owner3",null,0.15844085649119624,null,null,"owner3",null,-0.13655050378841593,null,null,"Household cooks in owm house",null,-0.1685595852962844]
[null,null,"owner4",null,2.604553849037447E-2,null,null,"owner4",null,-2.5970529851552234E-2,null,null,"Household cooks in other house",null,0.13348479253875672]
[null,null,"owner5",null,7.9133342044610477E-2,null,null,"owner5",null,-6.4319938568081436E-2,null,null,"Household cooks outside house",null,9.3166983386169036E-2]
[null,null,"owner6",null,2.0920620299564336E-2,null,null,"owner6",null,-1.7933092345580697E-2,null,null,"Household member owns: asset2a",null,-4.7784453751764114E-2]
[null,null,"owner7",null,1.8646336336095224E-2,null,null,"owner7",null,-3.2113330773267425E-2]
[null,null,"land1",null,-0.19341252472668449,null,null,"land1",null,0.18267257377303628]
[null,null,"land2",null,-1.5423310997094564E-2,null,null,"land2",null,1.569280613929664E-2,null,null,"Component Score Covariance Matrix"]
[null,null,"land3",null,-4.2902580493158421E-3,null,null,"land3",null,6.6270418192793138E-3,null,null,"Component",null,"1"]
[null,null,"land4",null,1.1281431828286928E-3,null,null,"land4",null,1.5890151861033945E-3,null,null,"1",null,1.0000000000000002]
[null,null,"land5",null,-1.3125985155883075E-2,null,null,"land5",null,1.2377664219829256E-2]
[null,null,"land6",null,-5.9768076521998972E-3,null,null,"land6",null,3.9474528568762875E-3]
[null,null,"land7",null,-4.798395839491253E-4,null,null,"land7",null,-1.6845013705604265E-3]
[null,null,"Household cooks in owm house",null,-0.18176270155731677,null,null,"Household cooks in owm house",null,0.18213750485625224]
[null,null,"Household cooks in other house",null,0.1407903032322545,null,null,"Household cooks in other house",null,-0.12692447998343262]
[null,null,"Household cooks outside house",null,9.9600342050737076E-2,null,null,"Household cooks outside house",null,-0.11228705022812181]
[null,null,"Household member owns: asset2a",null,-5.614403489260178E-2,null,null,"Household member owns: asset2a",null,0.12362799931992623]
[]
[]
[null,null,"Component Score Covariance Matrix",null,null,null,null,"Component Score Covariance Matrix"]
[null,null,"Component",null,"1",null,null,"Component",null,"1"]
[null,null,"1",null,1,null,null,"1",null,1.0000000000000002]
[]
[]
[]
[]
[]
[]
[]
[]
[]
[]
[]
[]
[]
[]
[]
[]
[]
[]
[]
[]
[]
[]
[]
[]
[]
[]
[]
[]
[]
[]
[]
[]
[]
[]
[]
[]
[]
[]
[]
[]
[]
[]
[]
[]
[]
[]
[]
[]
[]
[]
[]
[]
[]
[]
[]
[]
[]
[]
[]
[]
[]
[]
[]
[]
[]
[]
[]
[]
[]
[]
[]
[]
[]
[]
[]
[]
[]
[]
[]
[]
[]
[]
[]
[]
[]
[]
[]
[]
[]
[]
[]
[]
[]
[]
[]
[]
[]
[]
[]
[]
[]
[]
[]
[]
[]
[]
[]
[]
[]
[]
[]
[]
[]
[]
[]
[]
[]
[]
[]
[]
[]
[]
[]
[]
[]
[]
[]
[]
[]
[]
[]
[]
[]
[]
[]
[]
[]
[]
[]
[]
[]
[]
[]
[]
[]
[]
[]
[]
[]
[]
[]
[]
[]
[]
[]
[]
[]
[]
[]
[]
[]
[]
[]
[]
[]
[]
[]
[]
[]
[]
[]
[]
[]
[]
[]
[]
[]
[]
[]
[]
[]
[]
[]
[]
[]
[]
[]
[]
[]
[]
[]
[]
[]
[]
[]
[]
[]
[]
[]
[]
[]
[]
[]
[]
[]
[]
[]
[]
[]
[]
[]
[]
[]
[]
[]
[]
[]
[]
[]
[]
[]
[]
[]
[]
[]
[]
[]
[]
[]
[]
[]
[]
[]
[]
[]
[]
[]
[]
[]
[]
[]
[]
[]
[]
[]
[]
[]
[]
[]
[]
[]
[]
[]
[]
[]
[]
[]
[]
[]
[]
[]
[]
[]
[]
[]
[]
[]
[]
[]
[]
[]
[]
[]
[]
[]
[]
[]
[]
[]
[]
[]
[]
[]
[]
[]
[]
[]
[]
[]
[]
[]
[]
[]
[]
[]
[]
[]
[]
[]
[]
[]
[]
[]
[]
[]
[]
[]
[]
[]
[]
[]
[]
[]
[]
[]
[]
[]
[]
[]
[]
[]
[]
[]
[]
[]
[]
[]
[]
[]
[]
[]
[]
[]
[]
[]
[]
[]
[]
[]
[]
[]
[]
[]
[]
[]
[]
[]
[]
[]
[]
[]
[]
[]
[]
[]
[]
[]
[]
[]
[]
[]
[]
[]
[]
[]
[]
[]
[]
[]
[]
[]
[]
[]
[]
[]
[]
[]
[]
[]
[]
[]
[]
[]
[]
[]
[]
[]
[]
[]
[]
[]
[]
[]
[]
[]
[]
[]
[]
[]
[]
[]
[]
[]
[]
[]
[]
[]
[]
[]
[]
[]
[]
[]
[]
[]
[]
[]
[]
[]
[]
[]
[]
[]
[]
[]
[]
[]
[]
[]
[]
[]
[]
[]
[]
[]
[]
[]
[]
[]
[]
[]
[]
[]
[]
[]
[]
[]
[]
[]
[]
[]
[]
[]
[]
[]
[]
[]
[]
[]
[]
[]
[]
[]
[]
[]
[]
[]
[]
[]
[]
[]
[]
[]
[]
[]
[]
[]
[]
[]
[]
[]
[]
[]
[]
[]
[]
[]
[]
[]
[]
["SLC97"]
["Jamaica",null,"Count"]
["W_text_t","Time to improved source based on:",2020]
["W_text_i","Ratio of Improved wells based on:",2020]
["S_text_s","Ratio of Shared improved based on:",2020]
["S_text_i","Ratio of Improved latrines based on:",2020]
["Urban/Rural","Urban",1014]
[null,"Rural",1006]
[null,"Missing",0]
["1997"]
[]
["Sub-national region names","Weighted population"]
[{"$f":"R15","v":"None valid"},{"$f":"BR122+BR123","v":{"$error":"#VALUE!"}}]
[{"$f":"S15","v":0},{"$f":"BS122+BS123","v":0}]
[{"$f":"T15","v":0},{"$f":"BT122+BT123","v":0}]
[{"$f":"U15","v":0},{"$f":"BU122+BU123","v":0}]
[{"$f":"V15","v":0},{"$f":"BV122+BV123","v":0}]
[{"$f":"W15","v":0},{"$f":"BW122+BW123","v":0}]
[{"$f":"X15","v":0},{"$f":"BX122+XR123","v":0}]
[{"$f":"Y15","v":0},{"$f":"BY122+BY123","v":0}]
[{"$f":"Z15","v":0},{"$f":"BZ122+BZ123","v":0}]
[{"$f":"AA15","v":0},{"$f":"CA122+CA123","v":0}]
[{"$f":"AB15","v":0},{"$f":"CB122+CB123","v":0}]
[{"$f":"AC15","v":0},{"$f":"CC122+CC123","v":0}]
[{"$f":"AD15","v":0},{"$f":"CD122+CD123","v":0}]
[{"$f":"AE15","v":0},{"$f":"CE122+CE123","v":0}]
[{"$f":"AF15","v":0},{"$f":"CF122+CF123","v":0}]
[{"$f":"AG15","v":0},{"$f":"CG122+CG123","v":0}]
[{"$f":"AH15","v":0},{"$f":"CH122+CH123","v":0}]
[{"$f":"AI15","v":0},{"$f":"CI122+CI123","v":0}]
[{"$f":"AJ15","v":0},{"$f":"CJ122+CJ123","v":0}]
[{"$f":"AK15","v":0},{"$f":"CK122+CK123","v":0}]
[{"$f":"AL15","v":0},{"$f":"CL122+CL123","v":0}]
[{"$f":"AM15","v":0},{"$f":"CM122+CM123","v":0}]
[{"$f":"AN15","v":0},{"$f":"CN122+CN123","v":0}]
[{"$f":"AO15","v":0},{"$f":"CO122+CO123","v":0}]
[{"$f":"AP15","v":0},{"$f":"CP122+CP123","v":0}]
[{"$f":"AQ15","v":0},{"$f":"CQ122+CQ123","v":0}]
[{"$f":"AR15","v":0},{"$f":"CR122+CR123","v":0}]
[{"$f":"AS15","v":0},{"$f":"CS122+CS123","v":0}]
[{"$f":"AT15","v":0},{"$f":"CT122+CT123","v":0}]
[{"$f":"AU15","v":0},{"$f":"CU122+CU123","v":0}]
[{"$f":"AV15","v":0},{"$f":"CV122+CV123","v":0}]
[{"$f":"AW15","v":0},{"$f":"CW122+CW123","v":0}]
[{"$f":"AX15","v":0},{"$f":"CX122+CX123","v":0}]
[{"$f":"AY15","v":0},{"$f":"CY122+CY123","v":0}]
[]
[{"$f":"34-COUNTIF(A1037:A1071,\"0\")","v":1},"Sub-regions"]

{"sheet":"SLC07","index":5,"n_rows":1072,"n_cols":70,"rows_kept":1072,"cut":false,"hidden":false,"merged":[[340,52,341,52],[342,52,343,52],[344,52,345,52],[346,52,347,52],[348,52,349,52],[350,52,351,52],[352,52,353,52],[152,52,157,52],[219,54,219,58],[219,59,219,63],[219,64,219,68],[221,52,223,52],[224,52,225,52],[226,52,229,52],[258,54,258,58],[258,59,258,63],[258,64,258,68],[260,52,262,52],[263,52,266,52],[267,52,269,52],[270,52,272,52],[273,52,275,52],[276,52,283,52],[338,54,338,58],[338,59,338,63],[338,64,338,68],[150,52,151,52],[13,54,13,58],[13,59,13,63],[13,64,13,68],[15,52,16,52],[17,52,20,52],[21,52,22,52],[26,54,26,58],[26,59,26,63],[26,64,26,68],[55,54,55,58],[55,59,55,63],[55,64,55,68],[119,54,119,58],[119,59,119,63],[119,64,119,68],[121,52,122,52],[123,52,126,52],[127,52,128,52],[132,54,132,58],[132,59,132,63],[132,64,132,68],[134,52,138,52],[40,52,41,52],[42,52,43,52],[44,52,45,52],[46,52,48,52],[49,0,51,0],[49,52,51,52],[52,0,54,0],[52,52,54,52],[139,0,142,0],[139,52,142,52],[143,0,146,0],[143,52,146,52],[147,0,149,0],[147,52,149,52],[13,2,13,6],[13,7,13,11],[28,52,29,52],[30,0,31,0],[30,52,31,52],[32,0,33,0],[32,52,33,52],[34,52,35,52],[36,52,37,52],[38,0,39,0],[38,52,39,52],[44,0,45,0],[55,2,55,6],[55,7,55,11],[28,0,29,0],[34,0,35,0],[36,0,37,0],[40,0,41,0],[42,0,43,0],[13,12,13,16],[15,0,16,0],[17,0,20,0],[21,0,22,0],[23,0,25,0],[26,2,26,6],[26,7,26,11],[26,12,26,16],[132,7,132,11],[132,12,132,16],[134,0,138,0],[152,0,156,0],[201,0,202,0],[121,0,122,0],[123,0,126,0],[127,0,128,0],[129,0,131,0],[132,2,132,6],[55,12,55,16],[57,0,69,0],[107,0,107,1],[119,2,119,6],[119,7,119,11],[119,12,119,16],[150,0,151,0],[46,0,48,0],[1024,0,1024,2],[1025,0,1025,1],[1030,0,1032,0],[1033,0,1033,2],[398,2,398,5],[219,7,219,11],[219,12,219,16],[221,0,223,0],[207,0,207,1],[219,2,219,6],[401,1,444,1],[402,2,402,3],[402,7,402,8],[402,12,402,13],[403,2,403,3],[403,7,403,8],[403,12,403,13],[404,2,404,3],[404,7,404,8],[404,12,404,13],[398,7,398,10],[398,12,398,15],[399,2,399,4],[399,7,399,9],[399,12,399,14],[400,2,401,3],[400,7,401,8],[400,12,401,13],[409,2,409,3],[409,7,409,8],[409,12,409,13],[410,2,410,3],[410,7,410,8],[410,12,410,13],[407,2,407,3],[407,7,407,8],[407,12,407,13],[408,2,408,3],[408,7,408,8],[408,12,408,13],[405,2,405,3],[405,7,405,8],[405,12,405,13],[406,2,406,3],[406,7,406,8],[406,12,406,13],[415,2,415,3],[415,7,415,8],[415,12,415,13],[416,2,416,3],[416,7,416,8],[416,12,416,13],[413,2,413,3],[413,7,413,8],[413,12,413,13],[414,2,414,3],[414,7,414,8],[414,12,414,13],[411,2,411,3],[411,7,411,8],[411,12,411,13],[412,2,412,3],[412,7,412,8],[412,12,412,13],[421,2,421,3],[421,7,421,8],[421,12,421,13],[422,2,422,3],[422,7,422,8],[422,12,422,13],[419,2,419,3],[419,7,419,8],[419,12,419,13],[420,2,420,3],[420,7,420,8],[420,12,420,13],[417,2,417,3],[417,7,417,8],[417,12,417,13],[418,2,418,3],[418,7,418,8],[418,12,418,13],[427,2,427,3],[427,7,427,8],[427,12,427,13],[428,2,428,3],[428,7,428,8],[428,12,428,13],[425,2,425,3],[425,7,425,8],[425,12,425,13],[426,2,426,3],[426,7,426,8],[426,12,426,13],[423,2,423,3],[423,7,423,8],[423,12,423,13],[424,2,424,3],[424,7,424,8],[424,12,424,13],[433,2,433,3],[433,7,433,8],[433,12,433,13],[434,2,434,3],[434,7,434,8],[434,12,434,13],[431,2,431,3],[431,7,431,8],[431,12,431,13],[432,2,432,3],[432,7,432,8],[432,12,432,13],[429,2,429,3],[429,7,429,8],[429,12,429,13],[430,2,430,3],[430,7,430,8],[430,12,430,13],[439,2,439,3],[439,7,439,8],[439,12,439,13],[440,2,440,3],[440,7,440,8],[440,12,440,13],[437,2,437,3],[437,7,437,8],[437,12,437,13],[438,2,438,4],[438,7,438,8],[438,12,438,13],[435,2,435,3],[435,7,435,9],[435,12,435,13],[436,2,436,3],[436,7,436,8],[436,12,436,14],[445,2,445,3],[445,7,445,8],[445,12,445,13],[446,2,446,3],[446,7,446,8],[446,12,446,13],[443,2,443,3],[443,7,443,8],[443,12,443,13],[444,2,444,3],[444,7,444,8],[444,12,444,13],[441,2,441,3],[441,7,441,8],[441,12,441,13],[442,2,442,3],[442,7,442,8],[442,12,442,13],[451,2,451,3],[451,7,451,8],[451,12,451,13],[452,2,452,3],[452,7,452,8],[452,12,452,13],[449,2,449,3],[449,7,449,8],[449,12,449,13],[450,2,450,3],[450,7,450,8],[450,12,450,13],[447,2,447,3],[447,7,447,8],[447,12,447,13],[448,2,448,3],[448,7,448,8],[448,12,448,13],[457,2,457,3],[457,7,457,8],[457,12,457,13],[458,2,458,3],[458,7,458,8],[458,12,458,13],[455,2,455,3],[455,7,455,8],[455,12,455,13],[456,2,456,3],[456,7,456,8],[456,12,456,13],[453,2,453,3],[453,7,453,8],[453,12,453,13],[454,2,454,3],[454,7,454,8],[454,12,454,13],[463,2,463,3],[463,7,463,8],[463,12,463,13],[464,2,464,3],[464,7,464,8],[464,12,464,13],[461,2,461,3],[461,7,461,8],[461,12,461,13],[462,2,462,3],[462,7,462,8],[462,12,462,13],[459,2,459,3],[459,7,459,8],[459,12,459,13],[460,2,460,3],[460,7,460,8],[460,12,460,13],[469,2,469,3],[469,7,469,11],[469,12,469,13],[470,2,470,3],[470,7,471,8],[470,9,470,11],[470,12,470,13],[471,2,471,3],[471,12,471,16],[467,2,467,3],[467,7,467,8],[467,12,467,13],[468,2,468,3],[468,7,468,8],[468,12,468,13],[465,2,465,3],[465,7,465,8],[465,12,465,13],[466,2,466,3],[466,7,466,8],[466,12,466,13],[476,2,477,3],[476,4,476,6],[476,7,477,8],[476,12,476,13],[477,12,477,14],[478,2,478,3],[478,7,478,8],[478,12,479,13],[479,2,479,3],[479,7,479,8],[474,2,474,3],[474,7,474,8],[474,12,474,13],[475,2,475,6],[475,7,475,9],[475,12,475,13],[472,2,472,3],[472,7,472,8],[472,12,473,13],[472,14,472,16],[473,2,473,3],[473,7,473,8],[485,2,485,3],[485,7,485,8],[485,12,485,13],[486,2,486,3],[486,7,486,8],[486,12,486,13],[482,2,483,3],[482,7,482,8],[482,12,482,13],[483,7,483,8],[483,12,483,13],[484,2,484,3],[484,7,484,8],[484,12,484,13],[480,2,480,3],[480,7,480,8],[480,12,480,13],[481,2,481,4],[481,7,481,8],[481,12,481,13],[491,2,491,3],[491,7,491,8],[491,12,491,13],[492,2,492,3],[492,7,492,8],[492,12,492,13],[489,2,489,3],[489,7,489,8],[489,12,489,13],[490,2,490,3],[490,7,490,8],[490,12,490,13],[487,2,487,3],[487,7,487,8],[487,12,487,13],[488,2,488,3],[488,7,488,8],[488,12,488,13],[497,2,497,3],[497,7,497,8],[497,12,497,13],[498,2,498,3],[498,7,498,8],[498,12,498,13],[495,2,495,3],[495,7,495,8],[495,12,495,13],[496,2,496,3],[496,7,496,8],[496,12,496,13],[493,2,493,3],[493,7,493,8],[493,12,493,13],[494,2,494,3],[494,7,494,8],[494,12,494,13],[503,2,503,3],[503,7,503,8],[503,12,503,13],[504,2,504,3],[504,7,504,8],[504,12,504,13],[501,2,501,3],[501,7,501,8],[501,12,501,13],[502,2,502,3],[502,7,502,8],[502,12,502,13],[499,2,499,3],[499,7,499,8],[499,12,499,13],[500,2,500,3],[500,7,500,8],[500,12,500,13],[509,2,509,3],[509,7,509,8],[509,12,509,13],[510,2,510,3],[510,7,510,9],[510,12,510,13],[507,2,507,3],[507,7,507,8],[507,12,507,13],[508,2,508,3],[508,7,508,8],[508,12,508,13],[505,2,505,3],[505,7,505,8],[505,12,505,13],[506,2,506,3],[506,7,506,8],[506,12,506,13],[515,2,515,3],[515,7,515,8],[515,12,515,13],[516,2,516,3],[516,7,516,8],[516,12,516,13],[513,2,513,3],[513,7,513,8],[513,12,513,14],[514,2,514,3],[514,7,514,8],[514,12,514,13],[511,2,511,3],[511,7,511,8],[511,12,511,13],[512,2,512,3],[512,7,512,8],[512,12,512,13],[521,2,521,3],[521,7,521,8],[521,12,521,13],[522,2,522,3],[522,7,522,8],[522,12,522,13],[519,2,519,4],[519,7,519,8],[519,12,519,13],[520,2,520,3],[520,7,520,8],[520,12,520,13],[517,2,517,3],[517,7,517,8],[517,12,517,13],[518,2,518,3],[518,7,518,8],[518,12,518,13],[527,2,527,3],[527,7,527,8],[527,12,527,13],[528,2,528,3],[528,7,528,8],[528,12,528,13],[525,2,525,3],[525,7,525,8],[525,12,525,13],[526,2,526,3],[526,7,526,8],[526,12,526,13],[523,2,523,3],[523,7,523,8],[523,12,523,13],[524,2,524,3],[524,7,524,8],[524,12,524,13],[533,2,533,3],[533,7,533,8],[533,12,533,13],[534,2,534,3],[534,7,534,8],[534,12,534,13],[531,2,531,3],[531,7,531,8],[531,12,531,13],[532,2,532,3],[532,7,532,8],[532,12,532,13],[529,2,529,3],[529,7,529,8],[529,12,529,13],[530,2,530,3],[530,7,530,8],[530,12,530,13],[539,2,539,3],[539,7,539,8],[539,12,539,13],[540,2,540,3],[540,7,540,8],[540,12,540,13],[537,2,537,3],[537,7,537,8],[537,12,537,13],[538,2,538,3],[538,7,538,8],[538,12,538,13],[535,2,535,3],[535,7,535,8],[535,12,535,13],[536,2,536,3],[536,7,536,8],[536,12,536,13],[545,2,545,3],[545,7,545,8],[545,12,545,13],[546,2,546,3],[546,7,546,8],[546,12,546,13],[543,2,543,3],[543,7,543,8],[543,12,543,13],[544,2,544,3],[544,7,544,8],[544,12,544,13],[541,2,541,3],[541,7,541,8],[541,12,541,13],[542,2,542,3],[542,7,542,8],[542,12,542,13],[551,2,551,3],[551,7,551,8],[551,12,551,13],[552,2,552,3],[552,7,552,8],[552,12,552,13],[549,2,549,3],[549,7,549,8],[549,12,549,13],[550,2,550,3],[550,7,550,8],[550,12,550,13],[547,2,547,3],[547,7,547,8],[547,12,547,13],[548,2,548,3],[548,7,548,8],[548,12,548,13],[557,2,557,3],[557,7,557,8],[557,12,557,13],[558,2,558,3],[558,7,558,8],[558,12,558,13],[555,2,555,3],[555,7,555,8],[555,12,555,13],[556,2,556,3],[556,7,556,8],[556,12,556,13],[553,2,553,3],[553,7,553,8],[553,12,553,13],[554,2,554,3],[554,7,554,8],[554,12,554,13],[563,2,563,3],[563,7,563,8],[563,12,563,13],[564,2,564,3],[564,7,564,8],[564,12,564,13],[561,2,561,3],[561,7,561,8],[561,12,561,13],[562,2,562,3],[562,7,562,8],[562,12,562,13],[559,2,559,3],[559,7,559,8],[559,12,559,13],[560,2,560,3],[560,7,560,8],[560,12,560,13],[569,2,569,3],[569,7,569,8],[569,12,569,13],[570,2,570,3],[570,7,570,8],[570,12,570,13],[567,2,567,3],[567,7,567,8],[567,12,567,13],[568,2,568,3],[568,7,568,8],[568,12,568,13],[565,2,565,3],[565,7,565,8],[565,12,565,13],[566,2,566,3],[566,7,566,8],[566,12,566,13],[575,2,575,3],[575,7,575,8],[575,12,575,13],[576,2,576,3],[576,7,576,8],[576,12,576,13],[573,2,573,3],[573,7,573,8],[573,12,573,13],[574,2,574,3],[574,7,574,8],[574,12,574,13],[571,2,571,3],[571,7,571,8],[571,12,571,13],[572,2,572,3],[572,7,572,8],[572,12,572,13],[581,2,581,3],[581,7,581,8],[581,12,581,13],[582,2,582,3],[582,7,582,8],[582,12,582,13],[579,2,579,3],[579,7,579,8],[579,12,579,13],[580,2,580,3],[580,7,580,8],[580,12,580,13],[577,2,577,3],[577,7,577,8],[577,12,577,13],[578,2,578,3],[578,7,578,8],[578,12,578,13],[587,2,587,3],[587,7,587,8],[587,12,587,13],[588,2,588,3],[588,7,588,8],[588,12,588,13],[585,2,585,3],[585,7,585,8],[585,12,585,13],[586,2,586,3],[586,7,586,8],[586,12,586,13],[583,2,583,3],[583,7,583,8],[583,12,583,13],[584,2,584,3],[584,7,584,8],[584,12,584,13],[593,2,593,3],[593,7,593,8],[593,12,593,13],[594,2,594,3],[594,7,594,8],[594,12,594,13],[591,2,591,3],[591,7,591,8],[591,12,591,13],[592,2,592,3],[592,7,592,8],[592,12,592,13],[589,2,589,3],[589,7,589,8],[589,12,589,13],[590,2,590,3],[590,7,590,8],[590,12,590,13],[599,2,599,3],[599,7,599,8],[599,12,599,13],[600,2,600,3],[600,7,600,8],[600,12,600,13],[597,2,597,3],[597,7,597,8],[597,12,597,13],[598,2,598,3],[598,7,598,8],[598,12,598,13],[595,2,595,3],[595,7,595,8],[595,12,595,13],[596,2,596,3],[596,7,596,8],[596,12,596,13],[605,2,605,3],[605,7,605,8],[605,12,605,13],[606,2,606,3],[606,7,606,8],[606,12,606,13],[603,2,603,3],[603,7,603,8],[603,12,603,13],[604,2,604,3],[604,7,604,8],[604,12,604,13],[601,2,601,3],[601,7,601,8],[601,12,601,13],[602,2,602,3],[602,7,602,8],[602,12,602,13],[611,2,611,3],[611,7,611,8],[611,12,611,13],[612,2,612,3],[612,7,612,8],[612,12,612,13],[609,2,609,3],[609,7,609,8],[609,12,609,13],[610,2,610,3],[610,7,610,8],[610,12,610,13],[607,2,607,3],[607,7,607,8],[607,12,607,13],[608,2,608,3],[608,7,608,8],[608,12,608,13],[617,2,617,3],[617,7,617,8],[617,12,617,13],[618,2,618,3],[618,7,618,8],[618,12,618,13],[615,2,615,3],[615,7,615,8],[615,12,615,13],[616,2,616,3],[616,7,616,8],[616,12,616,13],[613,2,613,3],[613,7,613,8],[613,12,613,13],[614,2,614,3],[614,7,614,8],[614,12,614,13],[623,2,623,3],[623,7,623,8],[623,12,623,13],[624,2,624,3],[624,7,624,8],[624,12,624,13],[621,2,621,3],[621,7,621,8],[621,12,621,13],[622,2,622,3],[622,7,622,8],[622,12,622,13],[619,2,619,3],[619,7,619,8],[619,12,619,13],[620,2,620,3],[620,7,620,8],[620,12,620,13],[629,2,629,3],[629,7,629,8],[629,12,629,13],[630,2,630,3],[630,7,630,8],[630,12,630,13],[627,2,627,3],[627,7,627,8],[627,12,627,13],[628,2,628,3],[628,7,628,8],[628,12,628,13],[625,2,625,3],[625,7,625,8],[625,12,625,13],[626,2,626,3],[626,7,626,8],[626,12,626,13],[635,2,635,3],[635,7,635,8],[635,12,635,13],[636,2,636,3],[636,7,636,8],[636,12,636,13],[633,2,633,3],[633,7,633,8],[633,12,633,13],[634,2,634,3],[634,7,634,8],[634,12,634,13],[631,2,631,3],[631,7,631,8],[631,12,631,13],[632,2,632,3],[632,7,632,8],[632,12,632,13],[641,2,641,3],[641,7,641,8],[641,12,641,13],[642,2,642,3],[642,7,642,8],[642,12,642,13],[639,2,639,3],[639,7,639,8],[639,12,639,13],[640,2,640,3],[640,7,640,8],[640,12,640,13],[637,2,637,3],[637,7,637,8],[637,12,637,13],[638,2,638,3],[638,7,638,8],[638,12,638,13],[647,2,647,3],[647,7,647,8],[647,12,647,13],[648,2,648,3],[648,7,648,8],[648,12,648,13],[645,2,645,3],[645,7,645,8],[645,12,645,13],[646,2,646,3],[646,7,646,8],[646,12,646,13],[643,2,643,3],[643,7,643,8],[643,12,643,13],[644,2,644,3],[644,7,644,8],[644,12,644,13],[653,2,653,3],[653,7,653,8],[653,12,653,13],[654,2,654,3],[654,7,654,8],[654,12,654,13],[651,2,651,3],[651,7,651,8],[651,12,651,13],[652,2,652,3],[652,7,652,8],[652,12,652,13],[649,2,649,3],[649,7,649,8],[649,12,649,13],[650,2,650,3],[650,7,650,8],[650,12,650,13],[659,2,659,3],[659,7,659,8],[659,12,659,13],[660,2,660,3],[660,7,660,8],[660,12,660,13],[657,2,657,3],[657,7,657,8],[657,12,657,13],[658,2,658,3],[658,7,658,8],[658,12,658,13],[655,2,655,3],[655,7,655,8],[655,12,655,13],[656,2,656,3],[656,7,656,8],[656,12,656,13],[665,2,665,3],[665,7,665,8],[665,12,665,13],[666,2,666,3],[666,7,666,8],[666,12,666,13],[663,2,663,3],[663,7,663,8],[663,12,663,13],[664,2,664,3],[664,7,664,8],[664,12,664,13],[661,2,661,3],[661,7,661,8],[661,12,661,13],[662,2,662,3],[662,7,662,8],[662,12,662,13],[671,2,671,3],[671,7,671,8],[671,12,671,13],[672,2,672,3],[672,7,672,8],[672,12,672,13],[669,2,669,3],[669,7,669,8],[669,12,669,13],[670,2,670,3],[670,7,670,8],[670,12,670,13],[667,2,667,3],[667,7,667,8],[667,12,667,13],[668,2,668,3],[668,7,668,8],[668,12,668,13],[677,2,677,3],[677,7,677,8],[677,12,677,13],[678,2,678,3],[678,7,678,8],[678,12,678,13],[675,2,675,3],[675,7,675,8],[675,12,675,13],[676,2,676,3],[676,7,676,8],[676,12,676,13],[673,2,673,3],[673,7,673,8],[673,12,673,13],[674,2,674,3],[674,7,674,8],[674,12,674,13],[683,2,683,3],[683,7,683,8],[683,12,683,13],[684,2,684,3],[684,7,684,8],[684,12,684,13],[681,2,681,3],[681,7,681,8],[681,12,681,13],[682,2,682,3],[682,7,682,8],[682,12,682,13],[679,2,679,3],[679,7,679,8],[679,12,679,13],[680,2,680,3],[680,7,680,8],[680,12,680,13],[689,2,689,3],[689,7,689,8],[689,12,689,13],[690,2,690,3],[690,7,690,8],[690,12,690,13],[687,2,687,3],[687,7,687,8],[687,12,687,13],[688,2,688,3],[688,7,688,8],[688,12,688,13],[685,2,685,3],[685,7,685,8],[685,12,685,13],[686,2,686,3],[686,7,686,8],[686,12,686,13],[695,2,695,3],[695,7,695,8],[695,12,695,13],[696,2,696,3],[696,7,696,8],[696,12,696,13],[693,2,693,3],[693,7,693,8],[693,12,693,13]],"merged_total":1315,"flags":["merged_cut"]}
[]
[{"$f":"A1026","v":"Jamaica"}]
[{"$f":"A1034","v":"2007"}]
["Use of drinking water sources"]
[" by wealth quintile and sub-national region"]
["Notes:"]
["WHO/UNICEF JMP customised wealth index excludes water,"]
[" sanitation and hygiene assets."]
["Survey used for analysis:",{"$f":"A1025","v":"SLC07"}]
[{"$f":"B1028","v":"Ratio of Improved wells based on:"},"MICS11"]
[{"$f":"B1027","v":"Time to improved source based on:"},"MICS11"]
[]
[]
["Use of drinking water sources",null,"NATIONAL wealth index quintile",null,null,null,null,"URBAN wealth index quintile",null,null,null,null,"RURAL wealth index quintile",null,null,null,null,"SUB-REGIONS:",null,null,null,null,null,null,null,null,null,null,null,null,null,null,null,null,null,null,null,null,null,null,null,null,null,null,null,null,null,null,null,null,null,null,"Raw numbers of respondents:","Use of drinking water sources","NATIONAL wealth index quintile",null,null,null,null,"URBAN wealth index quintile",null,null,null,null,"RURAL wealth index quintile",null,null,null,null,"SUB-REGIONS:"]
["Weighted percentage (used in graphs)",null,"Poorest","Poor","Middle","Rich","Richest","Poorest","Poor","Middle","Rich","Richest","Poorest","Poor","Middle","Rich","Richest","None valid",null,null,null,null,null,null,null,null,null,null,null,null,null,null,null,null,null,null,null,null,null,null,null,null,null,null,null,null,null,null,null,null,null,null,"Water data, raw numbers (weighted)",null,"Poorest","Poor","Middle","Rich","Richest","Poorest","Poor","Middle","Rich","Richest","Poorest","Poor","Middle","Rich","Richest","None valid"]
["Water","Improved",{"$f":"C58+C59+C60+C63+C64+C65+C66+C67+C61*MICS11!C24/100","v":86.708435162138358},{"$f":"D58+D59+D60+D63+D64+D65+D66+D67+D61*MICS11!D24/100","v":91.12655358477204},{"$f":"E58+E59+E60+E63+E64+E65+E66+E67+E61*MICS11!E24/100","v":92.442485968698549},{"$f":"F58+F59+F60+F63+F64+F65+F66+F67+F61*MICS11!F24/100","v":92.447039140985041},{"$f":"G58+G59+G60+G63+G64+G65+G66+G67+G61*MICS11!G24/100","v":96.663688552218218},{"$f":"H58+H59+H60+H63+H64+H65+H66+H67+H61*MICS11!H24/100","v":91.08241402148488},{"$f":"I58+I59+I60+I63+I64+I65+I66+I67+I61*MICS11!I24/100","v":98.312863406261201},{"$f":"J58+J59+J60+J63+J64+J65+J66+J67+J61*MICS11!J24/100","v":96.277917720046773},{"$f":"K58+K59+K60+K63+K64+K65+K66+K67+K61*MICS11!K24/100","v":99.572372776007953},{"$f":"L58+L59+L60+L63+L64+L65+L66+L67+L61*MICS11!L24/100","v":96.284712062331153},{"$f":"M58+M59+M60+M63+M64+M65+M66+M67+M61*MICS11!M24/100","v":85.409768344696971},{"$f":"N58+N59+N60+N63+N64+N65+N66+N67+N61*MICS11!N24/100","v":82.852518553472876},{"$f":"O58+O59+O60+O63+O64+O65+O66+O67+O61*MICS11!O24/100","v":84.547870200438652},{"$f":"P58+P59+P60+P63+P64+P65+P66+P67+P61*MICS11!P24/100","v":88.229004268817675},{"$f":"Q58+Q59+Q60+Q63+Q64+Q65+Q66+Q67+Q61*MICS11!Q24/100","v":94.280078795978355},"N/A",null,null,null,null,null,null,null,null,null,null,null,null,null,null,null,null,null,null,null,null,null,null,null,null,null,null,null,null,null,null,null,null,null,null,"Water","Improved","N/A","N/A","N/A","N/A","N/A","N/A","N/A","N/A","N/A","N/A","N/A","N/A","N/A","N/A","N/A","N/A"]
[null,"Not Improved",{"$f":"100-C16","v":13.291564837861642},{"$f":"100-D16","v":8.87344641522796},7.5575140313014515,7.5529608590149593,3.3363114477817817,8.9175859785151204,1.6871365937387992,3.7220822799532272,0.42762722399204733,3.7152879376688475,14.590231655303029,17.147481446527124,15.452129799561348,11.770995731182325,5.7199212040216452,"N/A",null,null,null,null,null,null,null,null,null,null,null,null,null,null,null,null,null,null,null,null,null,null,null,null,null,null,null,null,null,null,null,null,null,null,null,"Not Improved","N/A","N/A","N/A","N/A","N/A","N/A","N/A","N/A","N/A","N/A","N/A","N/A","N/A","N/A","N/A","N/A"]
["Water ladder","Basic",{"$f":"C16*MICS11!C23/100","v":83.413514625977101},{"$f":"D16*MICS11!D23/100","v":88.210503870059327},{"$f":"E16*MICS11!E23/100","v":92.442485968698549},{"$f":"F16*MICS11!F23/100","v":91.152780593011244},{"$f":"G16*MICS11!G23/100","v":95.697051666696041},{"$f":"H16*MICS11!H23/100","v":90.171589881270023},{"$f":"I16*MICS11!I23/100","v":98.116237679448673},{"$f":"J16*MICS11!J23/100","v":95.411416460566343},{"$f":"K16*MICS11!K23/100","v":98.576649048247873},{"$f":"L16*MICS11!L23/100","v":96.284712062331153},{"$f":"M16*MICS11!M23/100","v":80.968460390772719},{"$f":"N16*MICS11!N23/100","v":80.532648033975633},{"$f":"O16*MICS11!O23/100","v":80.405024560617164},{"$f":"P16*MICS11!P23/100","v":86.817340200516597},{"$f":"Q16*MICS11!Q23/100","v":92.960157692834656},"N/A",null,null,null,null,null,null,null,null,null,null,null,null,null,null,null,null,null,null,null,null,null,null,null,null,null,null,null,null,null,null,null,null,null,null,"Water ladder","Basic","N/A","N/A","N/A","N/A","N/A","N/A","N/A","N/A","N/A","N/A","N/A","N/A","N/A","N/A","N/A","N/A"]
[null,"Limited",{"$f":"C16*MICS11!C22/100","v":3.2949205361612575},{"$f":"D16*MICS11!D22/100","v":2.9160497147127051},{"$f":"E16*MICS11!E22/100","v":0},{"$f":"F16*MICS11!F22/100","v":1.2942585479737907},{"$f":"G16*MICS11!G22/100","v":0.96663688552218219},{"$f":"H16*MICS11!H22/100","v":0.91082414021484881},{"$f":"I16*MICS11!I22/100","v":0.19662572681252244},{"$f":"J16*MICS11!J22/100","v":0.866501259480421},{"$f":"K16*MICS11!K22/100","v":0.99572372776007956},{"$f":"L16*MICS11!L22/100","v":0},{"$f":"M16*MICS11!M22/100","v":4.4413079539242428},{"$f":"N16*MICS11!N22/100","v":2.3198705194972407},{"$f":"O16*MICS11!O22/100","v":4.1428456398214948},{"$f":"P16*MICS11!P22/100","v":1.4116640683010828},{"$f":"Q16*MICS11!Q22/100","v":1.3199211031436968},"N/A",null,null,null,null,null,null,null,null,null,null,null,null,null,null,null,null,null,null,null,null,null,null,null,null,null,null,null,null,null,null,null,null,null,null,null,"Limited","N/A","N/A","N/A","N/A","N/A","N/A","N/A","N/A","N/A","N/A","N/A","N/A","N/A","N/A","N/A","N/A"]
[null,"Unimproved",{"$f":"100-(C18+C19+C21)","v":8.4961914242527286},{"$f":"100-(D18+D19+D21)","v":3.0167965113953557},3.480050575778094,3.2263608006145432,2.5907249704386288,8.3548249829865711,1.6871365937387992,3.7220822799532414,0,3.7152879376688475,6.473288021144171,6.5789055873546687,5.1155462346521006,3.1075201147504288,2.2544595263600371,"N/A",null,null,null,null,null,null,null,null,null,null,null,null,null,null,null,null,null,null,null,null,null,null,null,null,null,null,null,null,null,null,null,null,null,null,null,"Unimproved","N/A","N/A","N/A","N/A","N/A","N/A","N/A","N/A","N/A","N/A","N/A","N/A","N/A","N/A","N/A","N/A"]
[null,"Surface water",{"$f":"C62","v":4.7953734136089201},5.8566499038326238,4.0774634555233593,4.3266000584004107,0.74558647734314776,0.5627609955285634,0,0,0.42762722399205144,0,8.1169436341588685,10.568575859172457,10.336583564909226,8.6634756164318958,3.4654616776616085,"N/A",null,null,null,null,null,null,null,null,null,null,null,null,null,null,null,null,null,null,null,null,null,null,null,null,null,null,null,null,null,null,null,null,null,null,null,"Surface water","N/A","N/A","N/A","N/A","N/A","N/A","N/A","N/A","N/A","N/A","N/A","N/A","N/A","N/A","N/A","N/A"]
["Improved water point at more than 30 minutes","Yes","N/A","N/A","N/A","N/A","N/A","N/A","N/A","N/A","N/A","N/A","N/A","N/A","N/A","N/A","N/A","N/A",null,null,null,null,null,null,null,null,null,null,null,null,null,null,null,null,null,null,null,null,null,null,null,null,null,null,null,null,null,null,null,null,null,null,"Improved water point at more than 30 minutes","Yes","N/A","N/A","N/A","N/A","N/A","N/A","N/A","N/A","N/A","N/A","N/A","N/A","N/A","N/A","N/A","N/A"]
[null,"No","N/A","N/A","N/A","N/A","N/A","N/A","N/A","N/A","N/A","N/A","N/A","N/A","N/A","N/A","N/A","N/A",null,null,null,null,null,null,null,null,null,null,null,null,null,null,null,null,null,null,null,null,null,null,null,null,null,null,null,null,null,null,null,null,null,null,null,"No","N/A","N/A","N/A","N/A","N/A","N/A","N/A","N/A","N/A","N/A","N/A","N/A","N/A","N/A","N/A","N/A"]
["Manually calculated ratios","Improved wells"]
[null,"Improved springs"]
[null,"Other"]
[null,null,"NATIONAL wealth index quintile",null,null,null,null,"URBAN wealth index quintile",null,null,null,null,"RURAL wealth index quintile",null,null,null,null,"SUB-REGIONS:",null,null,null,null,null,null,null,null,null,null,null,null,null,null,null,null,null,null,null,null,null,null,null,null,null,null,null,null,null,null,null,null,null,null,"Raw numbers of respondents:","Use of drinking water sources","NATIONAL wealth index quintile",null,null,null,null,"URBAN wealth index quintile",null,null,null,null,"RURAL wealth index quintile",null,null,null,null,"SUB-REGIONS:"]
["Percentage based on weighted population",null,"Poorest","Poor","Middle","Rich","Richest","Poorest","Poor","Middle","Rich","Richest","Poorest","Poor","Middle","Rich","Richest","None valid",null,null,null,null,null,null,null,null,null,null,null,null,null,null,null,null,null,null,null,null,null,null,null,null,null,null,null,null,null,null,null,null,null,null,"Water data, raw numbers (weighted)",null,"Poorest","Poor","Middle","Rich","Richest","Poorest","Poor","Middle","Rich","Richest","Poorest","Poor","Middle","Rich","Richest","None valid"]
["Piped water","Yes",{"$f":"C58+C59+C60","v":74.078691728882603},75.242750796430613,78.336373148885244,67.042986336180533,90.321093399715394,89.307494637656703,95.495964531065312,93.294361821280759,94.918350421243886,95.503958350838218,64.996517906289455,57.470507957018953,50.598091221789318,46.613968677560187,65.193069926960689,"N/A",null,null,null,null,null,null,null,null,null,null,null,null,null,null,null,null,null,null,null,null,null,null,null,null,null,null,null,null,null,null,null,null,null,null,"Piped water","Yes","N/A","N/A","N/A","N/A","N/A","N/A","N/A","N/A","N/A","N/A","N/A","N/A","N/A","N/A","N/A","N/A"]
[null,"No",{"$f":"100-C29","v":25.921308271117397},{"$f":"100-D29","v":24.757249203569387},21.663626851114756,32.957013663819467,9.6789066002846056,10.692505362343297,4.5040354689346884,6.7056381787192407,5.0816495787561138,4.4960416491617821,35.003482093710545,42.529492042981047,49.401908778210682,53.386031322439813,34.806930073039311,"N/A",null,null,null,null,null,null,null,null,null,null,null,null,null,null,null,null,null,null,null,null,null,null,null,null,null,null,null,null,null,null,null,null,null,null,null,"No","N/A","N/A","N/A","N/A","N/A","N/A","N/A","N/A","N/A","N/A","N/A","N/A","N/A","N/A","N/A","N/A"]
["Piped water on premises","Yes",{"$f":"C58+C59","v":62.321987394365308},67.461511453908358,73.876105952794518,60.333668790540372,89.670718212506245,86.619692070001236,91.621610472266809,88.533354111206876,94.918350421243886,95.503958350838218,46.582338622995223,43.155103375646362,39.948535535535882,39.596932027232043,60.201131192070093,"N/A",null,null,null,null,null,null,null,null,null,null,null,null,null,null,null,null,null,null,null,null,null,null,null,null,null,null,null,null,null,null,null,null,null,null,"Piped water on premises","Yes","N/A","N/A","N/A","N/A","N/A","N/A","N/A","N/A","N/A","N/A","N/A","N/A","N/A","N/A","N/A","N/A"]
[null,"No",{"$f":"100-C31","v":37.678012605634692},{"$f":"100-D31","v":32.538488546091642},26.123894047205482,39.666331209459628,10.329281787493755,13.380307929998764,8.3783895277331908,11.466645888793124,5.0816495787561138,4.4960416491617821,53.417661377004777,56.844896624353638,60.051464464464118,60.403067972767957,39.798868807929907,"N/A",null,null,null,null,null,null,null,null,null,null,null,null,null,null,null,null,null,null,null,null,null,null,null,null,null,null,null,null,null,null,null,null,null,null,null,"No","N/A","N/A","N/A","N/A","N/A","N/A","N/A","N/A","N/A","N/A","N/A","N/A","N/A","N/A","N/A","N/A"]
["Piped water into dwelling","Yes","N/A","N/A","N/A","N/A","N/A","N/A","N/A","N/A","N/A","N/A","N/A","N/A","N/A","N/A","N/A","N/A",null,null,null,null,null,null,null,null,null,null,null,null,null,null,null,null,null,null,null,null,null,null,null,null,null,null,null,null,null,null,null,null,null,null,"Piped water into dwelling","Yes","N/A","N/A","N/A","N/A","N/A","N/A","N/A","N/A","N/A","N/A","N/A","N/A","N/A","N/A","N/A","N/A"]
[null,"No","N/A","N/A","N/A","N/A","N/A","N/A","N/A","N/A","N/A","N/A","N/A","N/A","N/A","N/A","N/A","N/A",null,null,null,null,null,null,null,null,null,null,null,null,null,null,null,null,null,null,null,null,null,null,null,null,null,null,null,null,null,null,null,null,null,null,null,"No","N/A","N/A","N/A","N/A","N/A","N/A","N/A","N/A","N/A","N/A","N/A","N/A","N/A","N/A","N/A","N/A"]
["Water source on premises","Yes","N/A","N/A","N/A","N/A","N/A","N/A","N/A","N/A","N/A","N/A","N/A","N/A","N/A","N/A","N/A","N/A",null,null,null,null,null,null,null,null,null,null,null,null,null,null,null,null,null,null,null,null,null,null,null,null,null,null,null,null,null,null,null,null,null,null,"Water source on premises","Yes","N/A","N/A","N/A","N/A","N/A","N/A","N/A","N/A","N/A","N/A","N/A","N/A","N/A","N/A","N/A","N/A"]
[null,"No","N/A","N/A","N/A","N/A","N/A","N/A","N/A","N/A","N/A","N/A","N/A","N/A","N/A","N/A","N/A","N/A",null,null,null,null,null,null,null,null,null,null,null,null,null,null,null,null,null,null,null,null,null,null,null,null,null,null,null,null,null,null,null,null,null,null,null,"No","N/A","N/A","N/A","N/A","N/A","N/A","N/A","N/A","N/A","N/A","N/A","N/A","N/A","N/A","N/A","N/A"]
["Improved Water source on premises","Yes","N/A","N/A","N/A","N/A","N/A","N/A","N/A","N/A","N/A","N/A","N/A","N/A","N/A","N/A","N/A","N/A",null,null,null,null,null,null,null,null,null,null,null,null,null,null,null,null,null,null,null,null,null,null,null,null,null,null,null,null,null,null,null,null,null,null,"Improved water source on premises","Yes","N/A","N/A","N/A","N/A","N/A","N/A","N/A","N/A","N/A","N/A","N/A","N/A","N/A","N/A","N/A","N/A"]
[null,"No","N/A","N/A","N/A","N/A","N/A","N/A","N/A","N/A","N/A","N/A","N/A","N/A","N/A","N/A","N/A","N/A",null,null,null,null,null,null,null,null,null,null,null,null,null,null,null,null,null,null,null,null,null,null,null,null,null,null,null,null,null,null,null,null,null,null,null,"No","N/A","N/A","N/A","N/A","N/A","N/A","N/A","N/A","N/A","N/A","N/A","N/A","N/A","N/A","N/A","N/A"]
["Piped water on premises available when needed","Yes","N/A","N/A","N/A","N/A","N/A","N/A","N/A","N/A","N/A","N/A","N/A","N/A","N/A","N/A","N/A","N/A",null,null,null,null,null,null,null,null,null,null,null,null,null,null,null,null,null,null,null,null,null,null,null,null,null,null,null,null,null,null,null,null,null,null,"Piped water on premises available when needed","Yes","N/A","N/A","N/A","N/A","N/A","N/A","N/A","N/A","N/A","N/A","N/A","N/A","N/A","N/A","N/A","N/A"]
[null,"No","N/A","N/A","N/A","N/A","N/A","N/A","N/A","N/A","N/A","N/A","N/A","N/A","N/A","N/A","N/A","N/A",null,null,null,null,null,null,null,null,null,null,null,null,null,null,null,null,null,null,null,null,null,null,null,null,null,null,null,null,null,null,null,null,null,null,null,"No","N/A","N/A","N/A","N/A","N/A","N/A","N/A","N/A","N/A","N/A","N/A","N/A","N/A","N/A","N/A","N/A"]
["Water point at more than 30 minutes","Yes","N/A","N/A","N/A","N/A","N/A","N/A","N/A","N/A","N/A","N/A","N/A","N/A","N/A","N/A","N/A","N/A",null,null,null,null,null,null,null,null,null,null,null,null,null,null,null,null,null,null,null,null,null,null,null,null,null,null,null,null,null,null,null,null,null,null,"Water point at more than 30 minutes","Yes","N/A","N/A","N/A","N/A","N/A","N/A","N/A","N/A","N/A","N/A","N/A","N/A","N/A","N/A","N/A","N/A"]
[null,"No","N/A","N/A","N/A","N/A","N/A","N/A","N/A","N/A","N/A","N/A","N/A","N/A","N/A","N/A","N/A","N/A",null,null,null,null,null,null,null,null,null,null,null,null,null,null,null,null,null,null,null,null,null,null,null,null,null,null,null,null,null,null,null,null,null,null,null,"No","N/A","N/A","N/A","N/A","N/A","N/A","N/A","N/A","N/A","N/A","N/A","N/A","N/A","N/A","N/A","N/A"]
["Water source available when needed","Yes","N/A","N/A","N/A","N/A","N/A","N/A","N/A","N/A","N/A","N/A","N/A","N/A","N/A","N/A","N/A","N/A",null,null,null,null,null,null,null,null,null,null,null,null,null,null,null,null,null,null,null,null,null,null,null,null,null,null,null,null,null,null,null,null,null,null,"Water source available when needed","Yes","N/A","N/A","N/A","N/A","N/A","N/A","N/A","N/A","N/A","N/A","N/A","N/A","N/A","N/A","N/A","N/A"]
[null,"No","N/A","N/A","N/A","N/A","N/A","N/A","N/A","N/A","N/A","N/A","N/A","N/A","N/A","N/A","N/A","N/A",null,null,null,null,null,null,null,null,null,null,null,null,null,null,null,null,null,null,null,null,null,null,null,null,null,null,null,null,null,null,null,null,null,null,null,"No","N/A","N/A","N/A","N/A","N/A","N/A","N/A","N/A","N/A","N/A","N/A","N/A","N/A","N/A","N/A","N/A"]
["Improved water source available when needed","Yes","N/A","N/A","N/A","N/A","N/A","N/A","N/A","N/A","N/A","N/A","N/A","N/A","N/A","N/A","N/A","N/A",null,null,null,null,null,null,null,null,null,null,null,null,null,null,null,null,null,null,null,null,null,null,null,null,null,null,null,null,null,null,null,null,null,null,"Improved water source available when needed","Yes","N/A","N/A","N/A","N/A","N/A","N/A","N/A","N/A","N/A","N/A","N/A","N/A","N/A","N/A","N/A","N/A"]
[null,"No","N/A","N/A","N/A","N/A","N/A","N/A","N/A","N/A","N/A","N/A","N/A","N/A","N/A","N/A","N/A","N/A",null,null,null,null,null,null,null,null,null,null,null,null,null,null,null,null,null,null,null,null,null,null,null,null,null,null,null,null,null,null,null,null,null,null,null,"No","N/A","N/A","N/A","N/A","N/A","N/A","N/A","N/A","N/A","N/A","N/A","N/A","N/A","N/A","N/A","N/A"]
["Microbiological quality at point of collection","Not contaminated (No E. coli in 100 mL)","N/A","N/A","N/A","N/A","N/A","N/A","N/A","N/A","N/A","N/A","N/A","N/A","N/A","N/A","N/A","N/A",null,null,null,null,null,null,null,null,null,null,null,null,null,null,null,null,null,null,null,null,null,null,null,null,null,null,null,null,null,null,null,null,null,null,"Microbiological quality at point of collection","Not contaminated (No E. coli in 100 mL)","N/A","N/A","N/A","N/A","N/A","N/A","N/A","N/A","N/A","N/A","N/A","N/A","N/A","N/A","N/A","N/A"]
[null,"Contaminated (E. coli detected in 100 mL)","N/A","N/A","N/A","N/A","N/A","N/A","N/A","N/A","N/A","N/A","N/A","N/A","N/A","N/A","N/A","N/A",null,null,null,null,null,null,null,null,null,null,null,null,null,null,null,null,null,null,null,null,null,null,null,null,null,null,null,null,null,null,null,null,null,null,null,"Contaminated (E. coli detected in 100 mL)","N/A","N/A","N/A","N/A","N/A","N/A","N/A","N/A","N/A","N/A","N/A","N/A","N/A","N/A","N/A","N/A"]
[null,"Highly contaminated (>100 CFU/100 mL)","N/A","N/A","N/A","N/A","N/A","N/A","N/A","N/A","N/A","N/A","N/A","N/A","N/A","N/A","N/A","N/A",null,null,null,null,null,null,null,null,null,null,null,null,null,null,null,null,null,null,null,null,null,null,null,null,null,null,null,null,null,null,null,null,null,null,null,"Highly contaminated (>100 CFU/100 mL)","N/A","N/A","N/A","N/A","N/A","N/A","N/A","N/A","N/A","N/A","N/A","N/A","N/A","N/A","N/A","N/A"]
["Microbiological quality of improved water sources at point of collection","Not contaminated (No E. coli in 100 mL)","N/A","N/A","N/A","N/A","N/A","N/A","N/A","N/A","N/A","N/A","N/A","N/A","N/A","N/A","N/A","N/A",null,null,null,null,null,null,null,null,null,null,null,null,null,null,null,null,null,null,null,null,null,null,null,null,null,null,null,null,null,null,null,null,null,null,"Microbiological quality of improved water sources at point of collection","Not contaminated (No E. coli in 100 mL)","N/A","N/A","N/A","N/A","N/A","N/A","N/A","N/A","N/A","N/A","N/A","N/A","N/A","N/A","N/A","N/A"]
[null,"Contaminated (E. coli detected in 100 mL)","N/A","N/A","N/A","N/A","N/A","N/A","N/A","N/A","N/A","N/A","N/A","N/A","N/A","N/A","N/A","N/A",null,null,null,null,null,null,null,null,null,null,null,null,null,null,null,null,null,null,null,null,null,null,null,null,null,null,null,null,null,null,null,null,null,null,null,"Contaminated (E. coli detected in 100 mL)","N/A","N/A","N/A","N/A","N/A","N/A","N/A","N/A","N/A","N/A","N/A","N/A","N/A","N/A","N/A","N/A"]
[null,"Highly contaminated (>100 CFU/100 mL)","N/A","N/A","N/A","N/A","N/A","N/A","N/A","N/A","N/A","N/A","N/A","N/A","N/A","N/A","N/A","N/A",null,null,null,null,null,null,null,null,null,null,null,null,null,null,null,null,null,null,null,null,null,null,null,null,null,null,null,null,null,null,null,null,null,null,null,"Highly contaminated (>100 CFU/100 mL)","N/A","N/A","N/A","N/A","N/A","N/A","N/A","N/A","N/A","N/A","N/A","N/A","N/A","N/A","N/A","N/A"]
["Microbiological quality of piped on premises at point of collection","Not contaminated (No E. coli in 100 mL)","N/A","N/A","N/A","N/A","N/A","N/A","N/A","N/A","N/A","N/A","N/A","N/A","N/A","N/A","N/A","N/A",null,null,null,null,null,null,null,null,null,null,null,null,null,null,null,null,null,null,null,null,null,null,null,null,null,null,null,null,null,null,null,null,null,null,"Microbiological quality of piped on premises at point of collection","Not contaminated (No E. coli in 100 mL)","N/A","N/A","N/A","N/A","N/A","N/A","N/A","N/A","N/A","N/A","N/A","N/A","N/A","N/A","N/A","N/A"]
[null,"Contaminated (E. coli detected in 100 mL)","N/A","N/A","N/A","N/A","N/A","N/A","N/A","N/A","N/A","N/A","N/A","N/A","N/A","N/A","N/A","N/A",null,null,null,null,null,null,null,null,null,null,null,null,null,null,null,null,null,null,null,null,null,null,null,null,null,null,null,null,null,null,null,null,null,null,null,"Contaminated (E. coli detected in 100 mL)","N/A","N/A","N/A","N/A","N/A","N/A","N/A","N/A","N/A","N/A","N/A","N/A","N/A","N/A","N/A","N/A"]
[null,"Highly contaminated (>100 CFU/100 mL)","N/A","N/A","N/A","N/A","N/A","N/A","N/A","N/A","N/A","N/A","N/A","N/A","N/A","N/A","N/A","N/A",null,null,null,null,null,null,null,null,null,null,null,null,null,null,null,null,null,null,null,null,null,null,null,null,null,null,null,null,null,null,null,null,null,null,null,"Highly contaminated (>100 CFU/100 mL)","N/A","N/A","N/A","N/A","N/A","N/A","N/A","N/A","N/A","N/A","N/A","N/A","N/A","N/A","N/A","N/A"]
[null,null,"NATIONAL wealth index quintile",null,null,null,null,"URBAN wealth index quintile",null,null,null,null,"RURAL wealth index quintile",null,null,null,null,"SUB-REGIONS:",null,null,null,null,null,null,null,null,null,null,null,null,null,null,null,null,null,null,null,null,null,null,null,null,null,null,null,null,null,null,null,null,null,null,"Raw numbers of respondents:","Use of drinking water sources","NATIONAL wealth index quintile",null,null,null,null,"URBAN wealth index quintile",null,null,null,null,"RURAL wealth index quintile",null,null,null,null,"SUB-REGIONS:"]
["Percentage based on weighted population",null,"Poorest","Poor","Middle","Rich","Richest","Poorest","Poor","Middle","Rich","Richest","Poorest","Poor","Middle","Rich","Richest","None valid",null,null,null,null,null,null,null,null,null,null,null,null,null,null,null,null,null,null,null,null,null,null,null,null,null,null,null,null,null,null,null,null,null,null,"Water data, raw numbers (weighted)",null,"Poorest","Poor","Middle","Rich","Richest","Poorest","Poor","Middle","Rich","Richest","Poorest","Poor","Middle","Rich","Richest","None valid"]
["Water","Indoor tap/pipe",20.564351731727552,42.808205887382783,55.532235801669025,49.594825972622012,86.338584111459028,38.79118185635604,64.377147186986662,78.718886370191768,89.070436416596777,93.976343647327923,9.6201932067813605,21.493678399117879,17.79073880862304,26.335889260083956,54.105013300827466,"N/A"]
[null,"Outside private pipe/tap",41.75763566263776,24.653305566525574,18.3438701511255,10.738842817918362,3.332134101047219,47.828510213645188,27.244463285280148,9.8144677410151111,5.8479140046471043,1.5276147035102956,36.962145416213865,21.661424976528483,22.157796726912839,13.261042767148085,6.0961178912426304,"N/A"]
[null,"Public standpipe",11.756704334517289,7.7812393425222535,4.4602671960907276,6.7093175456401646,0.65037518720914544,2.6878025676554644,3.8743540587985068,4.7610077100738781,0,0,18.414179283294231,14.31540458137259,10.649555686253438,7.0170366503281425,4.9919387348905939,"N/A"]
[null,"Well",0,0.23000376727962671,0.24559450723879889,0,0,0,0,0,0,0,0,0,0.95697050568974462,0,0,"N/A"]
[null,"River, lake, spring, pond",4.7953734136089201,5.8566499038326238,4.0774634555233593,4.3266000584004107,0.74558647734314776,0.5627609955285634,0,0,0.42762722399205144,0,8.1169436341588685,10.568575859172457,10.336583564909226,8.6634756164318958,3.4654616776616085,"N/A"]
[null,"Rainwater (tank) PID",2.0476640256713616,6.5026330157933767,4.0468870857395327,7.4761936249009873,3.8399225900239355,0.55155776515825883,2.1262305139529425,1.607609236098716,3.8501696765401325,0.78075371149293293,2.8658679981824102,8.1124562311023674,9.8410094173924012,11.999502988132667,11.993994235590696,"N/A"]
[null,"Rainwater (tank) NPID",9.8990888794463849,8.5578459398661018,8.4279449103942206,15.840714071041292,1.7339277540470914,1.2233616186699101,0.69066836124294184,1.3759466626672963,0,0,16.523290484944646,15.27083634352169,21.257617755605104,26.65887912195145,11.523451361490997,"N/A"]
[null,"Trucked water PID",0,0.41437750929947165,0.21061317192912604,0.38131574004793722,0.58630836486546944,0,0,0,0.47444131180625004,0,0,0.97546498223973921,0.38528471565290018,0,3.867473379111972,"N/A"]
[null,"Trucked water NPID",0.68299052813801264,0.21727651731612549,0.82482767372656896,1.3845543296243115,0,0,0,0,0,0,1.0240919552804599,1.0232530395901134,1.5088965843091988,2.1743807963499417,0.85104494641200756,"N/A"]
[null,"Bottled water",0,0,0.35024547078506779,0.3212750391899899,0.18243644356633551,0,0,0,0.32941136641768942,0,0,0,0,0.78227268482342593,0.85104494641200756,"N/A"]
[null,"Other",0.50053691876912476,0.37540799066919678,0.74555755616553143,0.13001044090488964,0.3634516345476817,0,0,0,0,0.64074243099312744,0.65592218273434255,1.356562263288621,1.3638839793304656,0.22895830746700505,0,"N/A"]
[null,"12",0,0,0.33313297979744744,0.17996621883350591,1.9868753682490587,0,0,0.41785278251554514,0,3.0745455066757228,0,0,0,0.31693424450040819,1.1330307619643079,"N/A"]
[null,"13",7.9956545054835964,2.6030545595128656,2.4013600398150916,2.916384140876136,0.24039796764188476,8.3548249829865799,1.6871365937388016,3.3042294974376913,0,0,5.8173658384098141,5.2223433240660571,3.7516622553216465,2.5616275627830243,1.1214287643957104,"N/A"]
[]
[]
[]
[]
[]
[]
[]
[]
[]
[]
[]
[]
[]
[]
[]
[]
[]
[]
[]
[]
[]
[]
[]
[]
[]
[]
[]
[]
[]
[]
[]
[]
[]
[]
[]
[]
[]
[{"$f":"A1026","v":"Jamaica"}]
[{"$f":"A1034","v":"2007"}]
["Use of sanitation facilities"]
[" by wealth quintile and sub-national region"]
["Notes:"]
["WHO/UNICEF JMP customised wealth index excludes water,"]
[" sanitation and hygiene assets."]
["Survey used for analysis:",{"$f":"A1025","v":"SLC07"}]
[{"$f":"B1030","v":"Ratio of Improved latrines based on:"}]
[{"$f":"B1029","v":"Ratio of Shared improved based on:"}]
[]
[]
["Use of sanitation facilities",null,"NATIONAL wealth index quintile",null,null,null,null,"URBAN wealth index quintile",null,null,null,null,"RURAL wealth index quintile",null,null,null,null,"SUB-REGIONS:",null,null,null,null,null,null,null,null,null,null,null,null,null,null,null,null,null,null,null,null,null,null,null,null,null,null,null,null,null,null,null,null,null,null,"Raw numbers of respondents:","Use of sanitation facilities","NATIONAL wealth index quintile",null,null,null,null,"URBAN wealth index quintile",null,null,null,null,"RURAL wealth index quintile",null,null,null,null,"SUB-REGIONS:"]
["Weighted percentage (used in graphs)",null,"Poorest","Poor","Middle","Rich","Richest","Poorest","Poor","Middle","Rich","Richest","Poorest","Poor","Middle","Rich","Richest","None valid",null,null,null,null,null,null,null,null,null,null,null,null,null,null,null,null,null,null,null,null,null,null,null,null,null,null,null,null,null,null,null,null,null,null,"Sanitation data, raw numbers (weighted)",null,"Poorest","Poor","Middle","Rich","Richest","Poorest","Poor","Middle","Rich","Richest","Poorest","Poor","Middle","Rich","Richest","None valid"]
["Sanitation","Improved",{"$f":"C153+C154+C155*MICS11!C130/100","v":92.538179072193174},{"$f":"D153+D154+D155*MICS11!D130/100","v":96.824048609791873},{"$f":"E153+E154+E155*MICS11!E130/100","v":99.257017934272724},{"$f":"F153+F154+F155*MICS11!F130/100","v":99.817748232023206},{"$f":"G153+G154+G155*MICS11!G130/100","v":99.999999999999986},{"$f":"H153+H154+H155*MICS11!H130/100","v":91.783911163876525},{"$f":"I153+I154+I155*MICS11!I130/100","v":96.844814757032481},{"$f":"J153+J154+J155*MICS11!J130/100","v":99.677982065456689},{"$f":"K153+K154+K155*MICS11!K130/100","v":100},{"$f":"L153+L154+L155*MICS11!L130/100","v":100},{"$f":"M153+M154+M155*MICS11!M130/100","v":92.133040881427718},{"$f":"N153+N154+N155*MICS11!N130/100","v":97.97359541770561},{"$f":"O153+O154+O155*MICS11!O130/100","v":98.451608293718749},{"$f":"P153+P154+P155*MICS11!P130/100","v":100},{"$f":"Q153+Q154+Q155*MICS11!Q130/100","v":99.999999999999986},"N/A",null,null,null,null,null,null,null,null,null,null,null,null,null,null,null,null,null,null,null,null,null,null,null,null,null,null,null,null,null,null,null,null,null,null,"Sanitation","Improved","N/A","N/A","N/A","N/A","N/A","N/A","N/A","N/A","N/A","N/A","N/A","N/A","N/A","N/A","N/A","N/A"]
[null,"Not Improved",{"$f":"100-C122","v":7.4618209278068264},{"$f":"100-D122","v":3.1759513902081267},0.74298206572727565,0.1822517679767941,0,8.2160888361234754,3.1551852429675193,0.32201793454331096,0,0,7.8669591185722823,2.0264045822943899,1.5483917062812509,0,0,"N/A",null,null,null,null,null,null,null,null,null,null,null,null,null,null,null,null,null,null,null,null,null,null,null,null,null,null,null,null,null,null,null,null,null,null,null,"Not Improved","N/A","N/A","N/A","N/A","N/A","N/A","N/A","N/A","N/A","N/A","N/A","N/A","N/A","N/A","N/A","N/A"]
["Sanitation ladder","Basic",{"$f":"C122*MICS11!C129/100","v":72.18411990116266},{"$f":"D122*MICS11!D129/100","v":81.345298730175514},{"$f":"E122*MICS11!E129/100","v":83.831596051990289},{"$f":"F122*MICS11!F129/100","v":94.69333831418146},{"$f":"G122*MICS11!G129/100","v":99.176738118148606},{"$f":"H122*MICS11!H129/100","v":62.757103591532214},{"$f":"I122*MICS11!I129/100","v":81.105258674694255},{"$f":"J122*MICS11!J129/100","v":92.389888190106049},{"$f":"K122*MICS11!K129/100","v":99.269221386677557},{"$f":"L122*MICS11!L129/100","v":99.772656178099169},{"$f":"M122*MICS11!M129/100","v":71.638443824013564},{"$f":"N122*MICS11!N129/100","v":79.6171231326921},{"$f":"O122*MICS11!O129/100","v":87.484437746333441},{"$f":"P122*MICS11!P129/100","v":97.315726671608004},{"$f":"Q122*MICS11!Q129/100","v":99.013508349070051},"N/A",null,null,null,null,null,null,null,null,null,null,null,null,null,null,null,null,null,null,null,null,null,null,null,null,null,null,null,null,null,null,null,null,null,null,"Sanitation ladder","Basic","N/A","N/A","N/A","N/A","N/A","N/A","N/A","N/A","N/A","N/A","N/A","N/A","N/A","N/A","N/A","N/A"]
[null,"Limited",{"$f":"C122*MICS11!C128/100","v":20.35405917103057},{"$f":"D122*MICS11!D128/100","v":15.478749879616295},{"$f":"E122*MICS11!E128/100","v":15.425421882282512},{"$f":"F122*MICS11!F128/100","v":5.1244099178417919},{"$f":"G122*MICS11!G128/100","v":0.82326188185136084},{"$f":"H122*MICS11!H128/100","v":29.026807572344314},{"$f":"I122*MICS11!I128/100","v":15.739556082338199},{"$f":"J122*MICS11!J128/100","v":7.2880938753506177},{"$f":"K122*MICS11!K128/100","v":0.73077861332239924},{"$f":"L122*MICS11!L128/100","v":0.22734382190085115},{"$f":"M122*MICS11!M128/100","v":20.494597057414076},{"$f":"N122*MICS11!N128/100","v":18.35647228501352},{"$f":"O122*MICS11!O128/100","v":10.967170547385326},{"$f":"P122*MICS11!P128/100","v":2.6842733283920173},{"$f":"Q122*MICS11!Q128/100","v":0.98649165092992941},"N/A",null,null,null,null,null,null,null,null,null,null,null,null,null,null,null,null,null,null,null,null,null,null,null,null,null,null,null,null,null,null,null,null,null,null,null,"Limited","N/A","N/A","N/A","N/A","N/A","N/A","N/A","N/A","N/A","N/A","N/A","N/A","N/A","N/A","N/A","N/A"]
[null,"Unimproved",{"$f":"100-(C124+C125+C127)","v":1.8897796859250633},{"$f":"100-(D124+D125+D127)","v":1.5759086355895136},0.34180449343071473,0,0,2.555764684172388,1.8941410941126833,0,0,0,1.4020321435814083,0.4983862212855712,1.2448479823932104,0,0,"N/A",null,null,null,null,null,null,null,null,null,null,null,null,null,null,null,null,null,null,null,null,null,null,null,null,null,null,null,null,null,null,null,null,null,null,null,"Unimproved","N/A","N/A","N/A","N/A","N/A","N/A","N/A","N/A","N/A","N/A","N/A","N/A","N/A","N/A","N/A","N/A"]
[null,"Open defecation",{"$f":"C157","v":5.5720412418817107},{"$f":"D157","v":1.6000427546186673},0.40117757229648288,0.18225176797680742,0,5.660324151951091,1.2610441488548616,0.32201793454331057,0,0,6.4649269749909646,1.5280183610088076,0.30354372388802575,0,0,"N/A",null,null,null,null,null,null,null,null,null,null,null,null,null,null,null,null,null,null,null,null,null,null,null,null,null,null,null,null,null,null,null,null,null,null,null,"Open defecation","N/A","N/A","N/A","N/A","N/A","N/A","N/A","N/A","N/A","N/A","N/A","N/A","N/A","N/A","N/A","N/A"]
["Shared among Improved Sanitation","Yes","N/A","N/A","N/A","N/A","N/A","N/A","N/A","N/A","N/A","N/A","N/A","N/A","N/A","N/A","N/A","N/A",null,null,null,null,null,null,null,null,null,null,null,null,null,null,null,null,null,null,null,null,null,null,null,null,null,null,null,null,null,null,null,null,null,null,"Shared among improved sanitation facilities","Yes","N/A","N/A","N/A","N/A","N/A","N/A","N/A","N/A","N/A","N/A","N/A","N/A","N/A","N/A","N/A","N/A"]
[null,"No","N/A","N/A","N/A","N/A","N/A","N/A","N/A","N/A","N/A","N/A","N/A","N/A","N/A","N/A","N/A","N/A",null,null,null,null,null,null,null,null,null,null,null,null,null,null,null,null,null,null,null,null,null,null,null,null,null,null,null,null,null,null,null,null,null,null,null,"No","N/A","N/A","N/A","N/A","N/A","N/A","N/A","N/A","N/A","N/A","N/A","N/A","N/A","N/A","N/A","N/A"]
["Manually calculated ratios","Improved latrines"]
[null,"Other"]
[null,"Other"]
[null,null,"NATIONAL wealth index quintile",null,null,null,null,"URBAN wealth index quintile",null,null,null,null,"RURAL wealth index quintile",null,null,null,null,"SUB-REGIONS:",null,null,null,null,null,null,null,null,null,null,null,null,null,null,null,null,null,null,null,null,null,null,null,null,null,null,null,null,null,null,null,null,null,null,"Raw numbers of respondents:","Use of sanitation facilities","NATIONAL wealth index quintile",null,null,null,null,"URBAN wealth index quintile",null,null,null,null,"RURAL wealth index quintile",null,null,null,null,"SUB-REGIONS:"]
["Percentage based on weighted population",null,"Poorest","Poor","Middle","Rich","Richest","Poorest","Poor","Middle","Rich","Richest","Poorest","Poor","Middle","Rich","Richest","None valid",null,null,null,null,null,null,null,null,null,null,null,null,null,null,null,null,null,null,null,null,null,null,null,null,null,null,null,null,null,null,null,null,null,null,"Sanitation data, raw numbers (weighted)",null,"Poorest","Poor","Middle","Rich","Richest","Poorest","Poor","Middle","Rich","Richest","Poorest","Poor","Middle","Rich","Richest","None valid"]
["Sanitation type","Sewer connection",{"$f":"C153","v":12.102619740463153},{"$f":"D153","v":19.891603518276096},18.880876289601915,19.747861840300985,38.583850462799305,23.601857383461088,32.399781032066223,34.709395628070929,38.525311189980997,50.650178416101625,4.2525722569244433,2.9620972572799951,2.7585628526078647,5.8593772599789107,4.4589752880074833,"N/A",null,null,null,null,null,null,null,null,null,null,null,null,null,null,null,null,null,null,null,null,null,null,null,null,null,null,null,null,null,null,null,null,null,null,"Sanitation type","Sewer connection","N/A","N/A","N/A","N/A","N/A","N/A","N/A","N/A","N/A","N/A","N/A","N/A","N/A","N/A","N/A","N/A"]
[null,"Septic tank connection","N/A","N/A","N/A","N/A","N/A","N/A","N/A","N/A","N/A","N/A","N/A","N/A","N/A","N/A","N/A","N/A",null,null,null,null,null,null,null,null,null,null,null,null,null,null,null,null,null,null,null,null,null,null,null,null,null,null,null,null,null,null,null,null,null,null,null,"Septic tank connection","N/A","N/A","N/A","N/A","N/A","N/A","N/A","N/A","N/A","N/A","N/A","N/A","N/A","N/A","N/A","N/A"]
[null,"Improved latrines","N/A","N/A","N/A","N/A","N/A","N/A","N/A","N/A","N/A","N/A","N/A","N/A","N/A","N/A","N/A","N/A",null,null,null,null,null,null,null,null,null,null,null,null,null,null,null,null,null,null,null,null,null,null,null,null,null,null,null,null,null,null,null,null,null,null,null,"Improved latrines","N/A","N/A","N/A","N/A","N/A","N/A","N/A","N/A","N/A","N/A","N/A","N/A","N/A","N/A","N/A","N/A"]
[null,"Unimproved facilities","N/A","N/A","N/A","N/A","N/A","N/A","N/A","N/A","N/A","N/A","N/A","N/A","N/A","N/A","N/A","N/A",null,null,null,null,null,null,null,null,null,null,null,null,null,null,null,null,null,null,null,null,null,null,null,null,null,null,null,null,null,null,null,null,null,null,null,"Unimproved facilities","N/A","N/A","N/A","N/A","N/A","N/A","N/A","N/A","N/A","N/A","N/A","N/A","N/A","N/A","N/A","N/A"]
[null,"Open defecation",{"$f":"C157","v":5.5720412418817107},{"$f":"D157","v":1.6000427546186673},0.40117757229648288,0.18225176797680742,0,5.660324151951091,1.2610441488548616,0.32201793454331057,0,0,6.4649269749909646,1.5280183610088076,0.30354372388802575,0,0,"N/A",null,null,null,null,null,null,null,null,null,null,null,null,null,null,null,null,null,null,null,null,null,null,null,null,null,null,null,null,null,null,null,null,null,null,null,"Open defecation","N/A","N/A","N/A","N/A","N/A","N/A","N/A","N/A","N/A","N/A","N/A","N/A","N/A","N/A","N/A","N/A"]
["Septic tank emptying practices","Not emptied/treated and disposed in situ","N/A","N/A","N/A","N/A","N/A","N/A","N/A","N/A","N/A","N/A","N/A","N/A","N/A","N/A","N/A","N/A",null,null,null,null,null,null,null,null,null,null,null,null,null,null,null,null,null,null,null,null,null,null,null,null,null,null,null,null,null,null,null,null,null,null,"Septic tank emptying practices","Not emptied/treated and disposed in situ","N/A","N/A","N/A","N/A","N/A","N/A","N/A","N/A","N/A","N/A","N/A","N/A","N/A","N/A","N/A","N/A"]
[null,"Emptied and buried on site","N/A","N/A","N/A","N/A","N/A","N/A","N/A","N/A","N/A","N/A","N/A","N/A","N/A","N/A","N/A","N/A",null,null,null,null,null,null,null,null,null,null,null,null,null,null,null,null,null,null,null,null,null,null,null,null,null,null,null,null,null,null,null,null,null,null,null,"Emptied and buried on site","N/A","N/A","N/A","N/A","N/A","N/A","N/A","N/A","N/A","N/A","N/A","N/A","N/A","N/A","N/A","N/A"]
[null,"Emptied and discharged locally","N/A","N/A","N/A","N/A","N/A","N/A","N/A","N/A","N/A","N/A","N/A","N/A","N/A","N/A","N/A","N/A",null,null,null,null,null,null,null,null,null,null,null,null,null,null,null,null,null,null,null,null,null,null,null,null,null,null,null,null,null,null,null,null,null,null,null,"Emptied and discharged locally","N/A","N/A","N/A","N/A","N/A","N/A","N/A","N/A","N/A","N/A","N/A","N/A","N/A","N/A","N/A","N/A"]
[null,"Emptied and removed offsite","N/A","N/A","N/A","N/A","N/A","N/A","N/A","N/A","N/A","N/A","N/A","N/A","N/A","N/A","N/A","N/A",null,null,null,null,null,null,null,null,null,null,null,null,null,null,null,null,null,null,null,null,null,null,null,null,null,null,null,null,null,null,null,null,null,null,null,"Emptied and removed offsite","N/A","N/A","N/A","N/A","N/A","N/A","N/A","N/A","N/A","N/A","N/A","N/A","N/A","N/A","N/A","N/A"]
["Latrine emptying practices","Not emptied/treated and disposed in situ","N/A","N/A","N/A","N/A","N/A","N/A","N/A","N/A","N/A","N/A","N/A","N/A","N/A","N/A","N/A","N/A",null,null,null,null,null,null,null,null,null,null,null,null,null,null,null,null,null,null,null,null,null,null,null,null,null,null,null,null,null,null,null,null,null,null,"Latrine emptying practices","Not emptied/treated and disposed in situ","N/A","N/A","N/A","N/A","N/A","N/A","N/A","N/A","N/A","N/A","N/A","N/A","N/A","N/A","N/A","N/A"]
[null,"Emptied and buried on site","N/A","N/A","N/A","N/A","N/A","N/A","N/A","N/A","N/A","N/A","N/A","N/A","N/A","N/A","N/A","N/A",null,null,null,null,null,null,null,null,null,null,null,null,null,null,null,null,null,null,null,null,null,null,null,null,null,null,null,null,null,null,null,null,null,null,null,"Emptied and buried on site","N/A","N/A","N/A","N/A","N/A","N/A","N/A","N/A","N/A","N/A","N/A","N/A","N/A","N/A","N/A","N/A"]
[null,"Emptied and discharged locally","N/A","N/A","N/A","N/A","N/A","N/A","N/A","N/A","N/A","N/A","N/A","N/A","N/A","N/A","N/A","N/A",null,null,null,null,null,null,null,null,null,null,null,null,null,null,null,null,null,null,null,null,null,null,null,null,null,null,null,null,null,null,null,null,null,null,null,"Emptied and discharged locally","N/A","N/A","N/A","N/A","N/A","N/A","N/A","N/A","N/A","N/A","N/A","N/A","N/A","N/A","N/A","N/A"]
[null,"Emptied and removed offsite","N/A","N/A","N/A","N/A","N/A","N/A","N/A","N/A","N/A","N/A","N/A","N/A","N/A","N/A","N/A","N/A",null,null,null,null,null,null,null,null,null,null,null,null,null,null,null,null,null,null,null,null,null,null,null,null,null,null,null,null,null,null,null,null,null,null,null,"Emptied and removed offsite","N/A","N/A","N/A","N/A","N/A","N/A","N/A","N/A","N/A","N/A","N/A","N/A","N/A","N/A","N/A","N/A"]
["Shared among improved sanitation facilities","Yes","N/A","N/A","N/A","N/A","N/A","N/A","N/A","N/A","N/A","N/A","N/A","N/A","N/A","N/A","N/A","N/A",null,null,null,null,null,null,null,null,null,null,null,null,null,null,null,null,null,null,null,null,null,null,null,null,null,null,null,null,null,null,null,null,null,null,"Shared among improved sanitation facilities","Yes","N/A","N/A","N/A","N/A","N/A","N/A","N/A","N/A","N/A","N/A","N/A","N/A","N/A","N/A","N/A","N/A"]
[null,"No","N/A","N/A","N/A","N/A","N/A","N/A","N/A","N/A","N/A","N/A","N/A","N/A","N/A","N/A","N/A","N/A",null,null,null,null,null,null,null,null,null,null,null,null,null,null,null,null,null,null,null,null,null,null,null,null,null,null,null,null,null,null,null,null,null,null,null,"No","N/A","N/A","N/A","N/A","N/A","N/A","N/A","N/A","N/A","N/A","N/A","N/A","N/A","N/A","N/A","N/A"]
[null,"DK/missing","N/A","N/A","N/A","N/A","N/A","N/A","N/A","N/A","N/A","N/A","N/A","N/A","N/A","N/A","N/A","N/A",null,null,null,null,null,null,null,null,null,null,null,null,null,null,null,null,null,null,null,null,null,null,null,null,null,null,null,null,null,null,null,null,null,null,null,"DK/missing","N/A","N/A","N/A","N/A","N/A","N/A","N/A","N/A","N/A","N/A","N/A","N/A","N/A","N/A","N/A","N/A"]
["Shared among all sanitation facilities","Yes",52.867889399639822,21.165668496325775,8.5563477497872373,2.5506696781224005,1.0333286592927224,60.945745562346943,22.881355127257642,5.5360568982480283,1.8581427404614153,0.30582203359567134,47.717562361255055,16.441847244774628,7.4722381045868174,3.1856087389560459,0.76655068459660891,"N/A",null,null,null,null,null,null,null,null,null,null,null,null,null,null,null,null,null,null,null,null,null,null,null,null,null,null,null,null,null,null,null,null,null,null,"Shared among all sanitation facilities","Yes","N/A","N/A","N/A","N/A","N/A","N/A","N/A","N/A","N/A","N/A","N/A","N/A","N/A","N/A","N/A","N/A"]
[null,"No",47.132110600360178,78.834331503674221,91.443652250212764,97.449330321877596,98.966671340707279,39.05425443765305,77.118644872742365,94.463943101751966,98.141857259538597,99.694177966404325,52.282437638744938,83.558152755225365,92.527761895413192,96.814391261043951,99.233449315403391,"N/A",null,null,null,null,null,null,null,null,null,null,null,null,null,null,null,null,null,null,null,null,null,null,null,null,null,null,null,null,null,null,null,null,null,null,null,"No","N/A","N/A","N/A","N/A","N/A","N/A","N/A","N/A","N/A","N/A","N/A","N/A","N/A","N/A","N/A","N/A"]
["sanitation","WC linked to sewer",12.102619740463153,19.891603518276096,18.880876289601915,19.747861840300985,38.583850462799305,23.601857383461088,32.399781032066223,34.709395628070929,38.525311189980997,50.650178416101625,4.2525722569244433,2.9620972572799951,2.7585628526078647,5.8593772599789107,4.4589752880074833,"N/A",null,null,null,null,null,null,null,null,null,null,null,null,null,null,null,null,null,null,null,null,null,null,null,null,null,null,null,null,null,null,null,null,null,null,"sanitation","WC linked to sewer",66.334586620330811,110.88130110502243,87.813646733760834,128.82772314548492,207.27852004766464,71.21386581659317,100.54173094034195,128.15276849269867,96.543859958648682,153.18347960710526,10.478677868843079,7.049747109413147,6.9656176567077637,21.765908718109131,5.2401214838027954,0]
[null,"WC not linked",20.049798918126321,38.652960119629256,42.514090143150547,50.925906367821995,56.706584609392749,35.461132751738887,43.20136794832684,51.713366811219871,56.065676554700815,44.849893437796226,9.0060997185428615,24.702999424600435,31.985160984431172,51.020375499098392,85.548157721289414,"N/A",null,null,null,null,null,null,null,null,null,null,null,null,null,null,null,null,null,null,null,null,null,null,null,null,null,null,null,null,null,null,null,null,null,null,null,"WC not linked",109.89315962791443,215.46229320764542,197.7300860285759,332.22171694040298,304.63670146465302,106.99684810638428,134.0607922077179,190.9342126250267,140.49975609779358,135.6414321064949,22.191749393939972,58.792768657207489,80.765389084815979,189.52608555555344,100.53492343425751,0]
[null,"Pit",61.285277377519051,39.126201638395045,38.203855994951056,29.14398002390022,4.7095649278079366,33.477845078664203,22.242901821515339,13.255219626165877,5.4090122553181832,4.4999281461021559,80.276401049541732,70.806884957110753,64.442776824503085,43.120247240922701,9.9928669907030923,"N/A",null,null,null,null,null,null,null,null,null,null,null,null,null,null,null,null,null,null,null,null,null,null,null,null,null,null,null,null,null,null,null,null,null,null,null,"Pit",335.90525257587433,218.10027235746384,177.68348580598831,190.12451171875,25.300524353981018,101.01267576217651,69.023301362991333,48.940439939498901,13.554904699325562,13.609323263168335,197.8074671626091,168.51932573318481,162.72376888990402,160.17937123775482,11.743468761444092,0]
[null,"Other",0.99026272200976106,0.72919196908094353,0,0,0,1.7988406341847272,0.89490504923673486,0,0,0,0,0,0.50995561456985572,0,0,"N/A",null,null,null,null,null,null,null,null,null,null,null,null,null,null,null,null,null,null,null,null,null,null,null,null,null,null,null,null,null,null,null,null,null,null,null,"Other",5.427640438079834,4.0647177696228027,0,0,0,5.427640438079834,2.7770342826843262,0,0,0,0,0,1.2876834869384766,0,0,0]
[null,"None",5.5720412418817107,1.6000427546186673,0.40117757229648288,0.18225176797680742,0,5.660324151951091,1.2610441488548616,0.32201793454331057,0,0,6.4649269749909646,1.5280183610088076,0.30354372388802575,0,0,"N/A",null,null,null,null,null,null,null,null,null,null,null,null,null,null,null,null,null,null,null,null,null,null,null,null,null,null,null,null,null,null,null,null,null,null,null,"None",30.540416896343231,8.9190809726715088,1.8658490777015686,1.1889429092407227,0,17.078891634941101,3.9132227897644043,1.1889429092407227,0,0,15.930096685886383,3.6366608142852783,0.76647502183914185,0,0,0]
[null,null,null,null,null,null,null,null,null,null,null,null,null,null,null,null,null,null,null,null,null,null,null,null,null,null,null,null,null,null,null,null,null,null,null,null,null,null,null,null,null,null,null,null,null,null,null,null,null,null,null,null,null,"Total",548.10105615854263,557.42766541242599,465.09306764602661,652.36289471387863,537.21574586629868,301.7299217581749,310.31608158349991,369.216363966465,250.59852075576782,302.43423497676849,246.40799111127853,237.99850231409073,252.50893414020538,371.47136551141739,117.51851367950439,0]
[]
[]
[]
[]
[]
[]
[]
[]
[]
[]
[]
[]
[]
[]
[]
[]
[]
[]
[]
[]
[]
[]
[]
[]
[]
[]
[]
[]
[]
[]
[]
[]
[]
[]
[]
[]
[]
[]
[]
[]
[]
[]
[]
[]
[]
[]
[]
[]
[]
[{"$f":"A1026","v":"Jamaica"}]
[{"$f":"A1034","v":"2007"}]
["Access to hygiene facilities "]
[" by wealth quintile and sub-national region"]
["Notes:"]
["WHO/UNICEF JMP customised wealth index excludes water,"]
[" sanitation and hygiene assets."]
["Survey used for analysis:",{"$f":"A1025","v":"SLC07"}]
[]
[]
[]
[]
["Access to handwashing",null,"NATIONAL wealth index quintile",null,null,null,null,"URBAN wealth index quintile",null,null,null,null,"RURAL wealth index quintile",null,null,null,null,"SUB-REGIONS:",null,null,null,null,null,null,null,null,null,null,null,null,null,null,null,null,null,null,null,null,null,null,null,null,null,null,null,null,null,null,null,null,null,null,"Raw numbers of respondents:","Access to handwashing","NATIONAL wealth index quintile",null,null,null,null,"URBAN wealth index quintile",null,null,null,null,"RURAL wealth index quintile",null,null,null,null,"SUB-REGIONS:"]
["Weighted percentage (used in graphs)",null,"Poorest","Poor","Middle","Rich","Richest","Poorest","Poor","Middle","Rich","Richest","Poorest","Poor","Middle","Rich","Richest","None valid",null,null,null,null,null,null,null,null,null,null,null,null,null,null,null,null,null,null,null,null,null,null,null,null,null,null,null,null,null,null,null,null,null,null,"Hygiene data, raw numbers (weighted)",null,"Poorest","Poor","Middle","Rich","Richest","Poorest","Poor","Middle","Rich","Richest","Poorest","Poor","Middle","Rich","Richest","None valid"]
["Hygiene ladder","Basic","N/A","N/A","N/A","N/A","N/A","N/A","N/A","N/A","N/A","N/A","N/A","N/A","N/A","N/A","N/A","N/A",null,null,null,null,null,null,null,null,null,null,null,null,null,null,null,null,null,null,null,null,null,null,null,null,null,null,null,null,null,null,null,null,null,null,"Hygiene ladder","Basic","N/A","N/A","N/A","N/A","N/A","N/A","N/A","N/A","N/A","N/A","N/A","N/A","N/A","N/A","N/A","N/A"]
[null,"Limited","N/A","N/A","N/A","N/A","N/A","N/A","N/A","N/A","N/A","N/A","N/A","N/A","N/A","N/A","N/A","N/A",null,null,null,null,null,null,null,null,null,null,null,null,null,null,null,null,null,null,null,null,null,null,null,null,null,null,null,null,null,null,null,null,null,null,null,"Limited","N/A","N/A","N/A","N/A","N/A","N/A","N/A","N/A","N/A","N/A","N/A","N/A","N/A","N/A","N/A","N/A"]
[null,"No facility","N/A","N/A","N/A","N/A","N/A","N/A","N/A","N/A","N/A","N/A","N/A","N/A","N/A","N/A","N/A","N/A",null,null,null,null,null,null,null,null,null,null,null,null,null,null,null,null,null,null,null,null,null,null,null,null,null,null,null,null,null,null,null,null,null,null,null,"No facility","N/A","N/A","N/A","N/A","N/A","N/A","N/A","N/A","N/A","N/A","N/A","N/A","N/A","N/A","N/A","N/A"]
[null,null,null,null,null,null,null,null,null,null,null,null,null,null,null,null,null,null,null,null,null,null,null,null,null,null,null,null,null,null,null,null,null,null,null,null,null,null,null,null,null,null,null,null,null,null,null,null,null,null,null,null,"Observed handwashing place","Fixed","N/A","N/A","N/A","N/A","N/A","N/A","N/A","N/A","N/A","N/A","N/A","N/A","N/A","N/A","N/A","N/A"]
[null,null,null,null,null,null,null,null,null,null,null,null,null,null,null,null,null,null,null,null,null,null,null,null,null,null,null,null,null,null,null,null,null,null,null,null,null,null,null,null,null,null,null,null,null,null,null,null,null,null,null,null,null,"Mobile","N/A","N/A","N/A","N/A","N/A","N/A","N/A","N/A","N/A","N/A","N/A","N/A","N/A","N/A","N/A","N/A"]
[null,null,null,null,null,null,null,null,null,null,null,null,null,null,null,null,null,null,null,null,null,null,null,null,null,null,null,null,null,null,null,null,null,null,null,null,null,null,null,null,null,null,null,null,null,null,null,null,null,null,null,null,"Water / Soap","Water and soap","N/A","N/A","N/A","N/A","N/A","N/A","N/A","N/A","N/A","N/A","N/A","N/A","N/A","N/A","N/A","N/A"]
[null,null,null,null,null,null,null,null,null,null,null,null,null,null,null,null,null,null,null,null,null,null,null,null,null,null,null,null,null,null,null,null,null,null,null,null,null,null,null,null,null,null,null,null,null,null,null,null,null,null,null,null,null,"Water only","N/A","N/A","N/A","N/A","N/A","N/A","N/A","N/A","N/A","N/A","N/A","N/A","N/A","N/A","N/A","N/A"]
[null,null,null,null,null,null,null,null,null,null,null,null,null,null,null,null,null,null,null,null,null,null,null,null,null,null,null,null,null,null,null,null,null,null,null,null,null,null,null,null,null,null,null,null,null,null,null,null,null,null,null,null,null,"Soap only","N/A","N/A","N/A","N/A","N/A","N/A","N/A","N/A","N/A","N/A","N/A","N/A","N/A","N/A","N/A","N/A"]
[null,null,null,null,null,null,null,null,null,null,null,null,null,null,null,null,null,null,null,null,null,null,null,null,null,null,null,null,null,null,null,null,null,null,null,null,null,null,null,null,null,null,null,null,null,null,null,null,null,null,null,null,null,"Neither","N/A","N/A","N/A","N/A","N/A","N/A","N/A","N/A","N/A","N/A","N/A","N/A","N/A","N/A","N/A","N/A"]
[]
[]
[]
[]
[]
[]
[]
[]
[]
[]
[]
[]
[]
[]
[]
[]
[]
[]
[]
[]
[]
[]
[]
[]
[]
[]
[]
[]
[null,null,null,null,null,null,null,null,null,null,null,null,null,null,null,null,null,null,null,null,null,null,null,null,null,null,null,null,null,null,null,null,null,null,null,null,null,null,null,null,null,null,null,null,null,null,null,null,null,null,null,null,"Raw numbers of respondents:","Menstrual health and hygiene","NATIONAL wealth index quintile",null,null,null,null,"URBAN wealth index quintile",null,null,null,null,"RURAL wealth index quintile",null,null,null,null,"SUB-REGIONS:"]
[null,null,null,null,null,null,null,null,null,null,null,null,null,null,null,null,null,null,null,null,null,null,null,null,null,null,null,null,null,null,null,null,null,null,null,null,null,null,null,null,null,null,null,null,null,null,null,null,null,null,null,null,"MHH data, raw numbers (weighted)",null,"Poorest","Poor","Middle","Rich","Richest","Poorest","Poor","Middle","Rich","Richest","Poorest","Poor","Middle","Rich","Richest","None valid"]
[null,null,null,null,null,null,null,null,null,null,null,null,null,null,null,null,null,null,null,null,null,null,null,null,null,null,null,null,null,null,null,null,null,null,null,null,null,null,null,null,null,null,null,null,null,null,null,null,null,null,null,null,"Private place to wash and change","Yes","N/A","N/A","N/A","N/A","N/A","N/A","N/A","N/A","N/A","N/A","N/A","N/A","N/A","N/A","N/A","N/A"]
[null,null,null,null,null,null,null,null,null,null,null,null,null,null,null,null,null,null,null,null,null,null,null,null,null,null,null,null,null,null,null,null,null,null,null,null,null,null,null,null,null,null,null,null,null,null,null,null,null,null,null,null,null,"No","N/A","N/A","N/A","N/A","N/A","N/A","N/A","N/A","N/A","N/A","N/A","N/A","N/A","N/A","N/A","N/A"]
[null,null,null,null,null,null,null,null,null,null,null,null,null,null,null,null,null,null,null,null,null,null,null,null,null,null,null,null,null,null,null,null,null,null,null,null,null,null,null,null,null,null,null,null,null,null,null,null,null,null,null,null,null,"DK/not sure/missing","N/A","N/A","N/A","N/A","N/A","N/A","N/A","N/A","N/A","N/A","N/A","N/A","N/A","N/A","N/A","N/A"]
[null,null,null,null,null,null,null,null,null,null,null,null,null,null,null,null,null,null,null,null,null,null,null,null,null,null,null,null,null,null,null,null,null,null,null,null,null,null,null,null,null,null,null,null,null,null,null,null,null,null,null,null,"Use of menstrual materials","Materials reusable","N/A","N/A","N/A","N/A","N/A","N/A","N/A","N/A","N/A","N/A","N/A","N/A","N/A","N/A","N/A","N/A"]
[null,null,null,null,null,null,null,null,null,null,null,null,null,null,null,null,null,null,null,null,null,null,null,null,null,null,null,null,null,null,null,null,null,null,null,null,null,null,null,null,null,null,null,null,null,null,null,null,null,null,null,null,null,"Materials not reusable","N/A","N/A","N/A","N/A","N/A","N/A","N/A","N/A","N/A","N/A","N/A","N/A","N/A","N/A","N/A","N/A"]
[null,null,null,null,null,null,null,null,null,null,null,null,null,null,null,null,null,null,null,null,null,null,null,null,null,null,null,null,null,null,null,null,null,null,null,null,null,null,null,null,null,null,null,null,null,null,null,null,null,null,null,null,null,"No materials used","N/A","N/A","N/A","N/A","N/A","N/A","N/A","N/A","N/A","N/A","N/A","N/A","N/A","N/A","N/A","N/A"]
[null,null,null,null,null,null,null,null,null,null,null,null,null,null,null,null,null,null,null,null,null,null,null,null,null,null,null,null,null,null,null,null,null,null,null,null,null,null,null,null,null,null,null,null,null,null,null,null,null,null,null,null,null,"DK/not sure/missing","N/A","N/A","N/A","N/A","N/A","N/A","N/A","N/A","N/A","N/A","N/A","N/A","N/A","N/A","N/A","N/A"]
[null,null,null,null,null,null,null,null,null,null,null,null,null,null,null,null,null,null,null,null,null,null,null,null,null,null,null,null,null,null,null,null,null,null,null,null,null,null,null,null,null,null,null,null,null,null,null,null,null,null,null,null,"Use of menstrual materials with private place to wash and change","Materials reusable","N/A","N/A","N/A","N/A","N/A","N/A","N/A","N/A","N/A","N/A","N/A","N/A","N/A","N/A","N/A","N/A"]
[null,null,null,null,null,null,null,null,null,null,null,null,null,null,null,null,null,null,null,null,null,null,null,null,null,null,null,null,null,null,null,null,null,null,null,null,null,null,null,null,null,null,null,null,null,null,null,null,null,null,null,null,null,"Materials not reusable","N/A","N/A","N/A","N/A","N/A","N/A","N/A","N/A","N/A","N/A","N/A","N/A","N/A","N/A","N/A","N/A"]
[null,null,null,null,null,null,null,null,null,null,null,null,null,null,null,null,null,null,null,null,null,null,null,null,null,null,null,null,null,null,null,null,null,null,null,null,null,null,null,null,null,null,null,null,null,null,null,null,null,null,null,null,null,"No materials used","N/A","N/A","N/A","N/A","N/A","N/A","N/A","N/A","N/A","N/A","N/A","N/A","N/A","N/A","N/A","N/A"]
[null,null,null,null,null,null,null,null,null,null,null,null,null,null,null,null,null,null,null,null,null,null,null,null,null,null,null,null,null,null,null,null,null,null,null,null,null,null,null,null,null,null,null,null,null,null,null,null,null,null,null,null,"Awareness of menstruation before menarche","Yes","N/A","N/A","N/A","N/A","N/A","N/A","N/A","N/A","N/A","N/A","N/A","N/A","N/A","N/A","N/A","N/A"]
[null,null,null,null,null,null,null,null,null,null,null,null,null,null,null,null,null,null,null,null,null,null,null,null,null,null,null,null,null,null,null,null,null,null,null,null,null,null,null,null,null,null,null,null,null,null,null,null,null,null,null,null,null,"No","N/A","N/A","N/A","N/A","N/A","N/A","N/A","N/A","N/A","N/A","N/A","N/A","N/A","N/A","N/A","N/A"]
[null,null,null,null,null,null,null,null,null,null,null,null,null,null,null,null,null,null,null,null,null,null,null,null,null,null,null,null,null,null,null,null,null,null,null,null,null,null,null,null,null,null,null,null,null,null,null,null,null,null,null,null,null,"DK/not sure/missing","N/A","N/A","N/A","N/A","N/A","N/A","N/A","N/A","N/A","N/A","N/A","N/A","N/A","N/A","N/A","N/A"]
[null,null,null,null,null,null,null,null,null,null,null,null,null,null,null,null,null,null,null,null,null,null,null,null,null,null,null,null,null,null,null,null,null,null,null,null,null,null,null,null,null,null,null,null,null,null,null,null,null,null,null,null,"Participation in (all) activities during menstruation","Yes","N/A","N/A","N/A","N/A","N/A","N/A","N/A","N/A","N/A","N/A","N/A","N/A","N/A","N/A","N/A","N/A"]
[null,null,null,null,null,null,null,null,null,null,null,null,null,null,null,null,null,null,null,null,null,null,null,null,null,null,null,null,null,null,null,null,null,null,null,null,null,null,null,null,null,null,null,null,null,null,null,null,null,null,null,null,null,"No","N/A","N/A","N/A","N/A","N/A","N/A","N/A","N/A","N/A","N/A","N/A","N/A","N/A","N/A","N/A","N/A"]
[null,null,null,null,null,null,null,null,null,null,null,null,null,null,null,null,null,null,null,null,null,null,null,null,null,null,null,null,null,null,null,null,null,null,null,null,null,null,null,null,null,null,null,null,null,null,null,null,null,null,null,null,null,"DK/not sure/missing/no such activity","N/A","N/A","N/A","N/A","N/A","N/A","N/A","N/A","N/A","N/A","N/A","N/A","N/A","N/A","N/A","N/A"]
[null,null,null,null,null,null,null,null,null,null,null,null,null,null,null,null,null,null,null,null,null,null,null,null,null,null,null,null,null,null,null,null,null,null,null,null,null,null,null,null,null,null,null,null,null,null,null,null,null,null,null,null,"Participation in specific activities during menstruation","Did not go to school (amongst those usually attending school)","N/A","N/A","N/A","N/A","N/A","N/A","N/A","N/A","N/A","N/A","N/A","N/A","N/A","N/A","N/A","N/A"]
[null,null,null,null,null,null,null,null,null,null,null,null,null,null,null,null,null,null,null,null,null,null,null,null,null,null,null,null,null,null,null,null,null,null,null,null,null,null,null,null,null,null,null,null,null,null,null,null,null,null,null,null,null,"Did not go to work (amongst those who usually work)","N/A","N/A","N/A","N/A","N/A","N/A","N/A","N/A","N/A","N/A","N/A","N/A","N/A","N/A","N/A","N/A"]
[null,null,null,null,null,null,null,null,null,null,null,null,null,null,null,null,null,null,null,null,null,null,null,null,null,null,null,null,null,null,null,null,null,null,null,null,null,null,null,null,null,null,null,null,null,null,null,null,null,null,null,null,null,"Did not participate in social activities","N/A","N/A","N/A","N/A","N/A","N/A","N/A","N/A","N/A","N/A","N/A","N/A","N/A","N/A","N/A","N/A"]
[null,null,null,null,null,null,null,null,null,null,null,null,null,null,null,null,null,null,null,null,null,null,null,null,null,null,null,null,null,null,null,null,null,null,null,null,null,null,null,null,null,null,null,null,null,null,null,null,null,null,null,null,null,"Did not cook food","N/A","N/A","N/A","N/A","N/A","N/A","N/A","N/A","N/A","N/A","N/A","N/A","N/A","N/A","N/A","N/A"]
[null,null,null,null,null,null,null,null,null,null,null,null,null,null,null,null,null,null,null,null,null,null,null,null,null,null,null,null,null,null,null,null,null,null,null,null,null,null,null,null,null,null,null,null,null,null,null,null,null,null,null,null,null,"Did not eat with others","N/A","N/A","N/A","N/A","N/A","N/A","N/A","N/A","N/A","N/A","N/A","N/A","N/A","N/A","N/A","N/A"]
[null,null,null,null,null,null,null,null,null,null,null,null,null,null,null,null,null,null,null,null,null,null,null,null,null,null,null,null,null,null,null,null,null,null,null,null,null,null,null,null,null,null,null,null,null,null,null,null,null,null,null,null,null,"Did not bathe in regular place","N/A","N/A","N/A","N/A","N/A","N/A","N/A","N/A","N/A","N/A","N/A","N/A","N/A","N/A","N/A","N/A"]
[null,null,null,null,null,null,null,null,null,null,null,null,null,null,null,null,null,null,null,null,null,null,null,null,null,null,null,null,null,null,null,null,null,null,null,null,null,null,null,null,null,null,null,null,null,null,null,null,null,null,null,null,null,"Did not participate in other activities","N/A","N/A","N/A","N/A","N/A","N/A","N/A","N/A","N/A","N/A","N/A","N/A","N/A","N/A","N/A","N/A"]
[null,null,null,null,null,null,null,null,null,null,null,null,null,null,null,null,null,null,null,null,null,null,null,null,null,null,null,null,null,null,null,null,null,null,null,null,null,null,null,null,null,null,null,null,null,null,null,null,null,null,null,null,null,"DK/not sure/missing/no such activity","N/A","N/A","N/A","N/A","N/A","N/A","N/A","N/A","N/A","N/A","N/A","N/A","N/A","N/A","N/A","N/A"]
[]
[]
[]
[]
[]
[]
[]
[]
[]
[]
[]
[]
[]
[]
[]
[]
[]
[]
[]
[]
[]
[]
[]
[]
[]
[]
[]
[]
[]
[]
[]
[]
[]
[]
[]
[]
[]
[]
[]
[]
[]
[]
[]
[]
[]
[]
[]
[]
[]
[]
[]
[]
[]
[]
[null,null,null,null,null,null,null,null,null,null,null,null,null,null,null,null,null,null,null,null,null,null,null,null,null,null,null,null,null,null,null,null,null,null,null,null,null,null,null,null,null,null,null,null,null,null,null,null,null,null,null,null,"Raw numbers of respondents:","Basic water, sanitation and hygiene","NATIONAL wealth index quintile",null,null,null,null,"URBAN wealth index quintile",null,null,null,null,"RURAL wealth index quintile",null,null,null,null,"SUB-REGIONS:"]
[null,null,null,null,null,null,null,null,null,null,null,null,null,null,null,null,null,null,null,null,null,null,null,null,null,null,null,null,null,null,null,null,null,null,null,null,null,null,null,null,null,null,null,null,null,null,null,null,null,null,null,null,"WatSan data, raw numbers (weighted)",null,"Poorest","Poor","Middle","Rich","Richest","Poorest","Poor","Middle","Rich","Richest","Poorest","Poor","Middle","Rich","Richest","None valid"]
[null,null,null,null,null,null,null,null,null,null,null,null,null,null,null,null,null,null,null,null,null,null,null,null,null,null,null,null,null,null,null,null,null,null,null,null,null,null,null,null,null,null,null,null,null,null,null,null,null,null,null,null,"Use of Basic Water Sanitation and Hygiene","Yes","N/A","N/A","N/A","N/A","N/A","N/A","N/A","N/A","N/A","N/A","N/A","N/A","N/A","N/A","N/A","N/A"]
[null,null,null,null,null,null,null,null,null,null,null,null,null,null,null,null,null,null,null,null,null,null,null,null,null,null,null,null,null,null,null,null,null,null,null,null,null,null,null,null,null,null,null,null,null,null,null,null,null,null,null,null,null,"No","N/A","N/A","N/A","N/A","N/A","N/A","N/A","N/A","N/A","N/A","N/A","N/A","N/A","N/A","N/A","N/A"]
[null,null,null,null,null,null,null,null,null,null,null,null,null,null,null,null,null,null,null,null,null,null,null,null,null,null,null,null,null,null,null,null,null,null,null,null,null,null,null,null,null,null,null,null,null,null,null,null,null,null,null,null,"Use of Basic Water and Sanitation","Yes","N/A","N/A","N/A","N/A","N/A","N/A","N/A","N/A","N/A","N/A","N/A","N/A","N/A","N/A","N/A","N/A"]
[null,null,null,null,null,null,null,null,null,null,null,null,null,null,null,null,null,null,null,null,null,null,null,null,null,null,null,null,null,null,null,null,null,null,null,null,null,null,null,null,null,null,null,null,null,null,null,null,null,null,null,null,null,"No","N/A","N/A","N/A","N/A","N/A","N/A","N/A","N/A","N/A","N/A","N/A","N/A","N/A","N/A","N/A","N/A"]
[null,null,null,null,null,null,null,null,null,null,null,null,null,null,null,null,null,null,null,null,null,null,null,null,null,null,null,null,null,null,null,null,null,null,null,null,null,null,null,null,null,null,null,null,null,null,null,null,null,null,null,null,"Use of Basic Water and Hygiene","Yes","N/A","N/A","N/A","N/A","N/A","N/A","N/A","N/A","N/A","N/A","N/A","N/A","N/A","N/A","N/A","N/A"]
[null,null,null,null,null,null,null,null,null,null,null,null,null,null,null,null,null,null,null,null,null,null,null,null,null,null,null,null,null,null,null,null,null,null,null,null,null,null,null,null,null,null,null,null,null,null,null,null,null,null,null,null,null,"No","N/A","N/A","N/A","N/A","N/A","N/A","N/A","N/A","N/A","N/A","N/A","N/A","N/A","N/A","N/A","N/A"]
[null,null,null,null,null,null,null,null,null,null,null,null,null,null,null,null,null,null,null,null,null,null,null,null,null,null,null,null,null,null,null,null,null,null,null,null,null,null,null,null,null,null,null,null,null,null,null,null,null,null,null,null,"Use of Basic Sanitation and Hygiene","Yes","N/A","N/A","N/A","N/A","N/A","N/A","N/A","N/A","N/A","N/A","N/A","N/A","N/A","N/A","N/A","N/A"]
[null,null,null,null,null,null,null,null,null,null,null,null,null,null,null,null,null,null,null,null,null,null,null,null,null,null,null,null,null,null,null,null,null,null,null,null,null,null,null,null,null,null,null,null,null,null,null,null,null,null,null,null,null,"No","N/A","N/A","N/A","N/A","N/A","N/A","N/A","N/A","N/A","N/A","N/A","N/A","N/A","N/A","N/A","N/A"]
[null,null,null,null,null,null,null,null,null,null,null,null,null,null,null,null,null,null,null,null,null,null,null,null,null,null,null,null,null,null,null,null,null,null,null,null,null,null,null,null,null,null,null,null,null,null,null,null,null,null,null,null,"Use of Basic Water","Yes","N/A","N/A","N/A","N/A","N/A","N/A","N/A","N/A","N/A","N/A","N/A","N/A","N/A","N/A","N/A","N/A"]
[null,null,null,null,null,null,null,null,null,null,null,null,null,null,null,null,null,null,null,null,null,null,null,null,null,null,null,null,null,null,null,null,null,null,null,null,null,null,null,null,null,null,null,null,null,null,null,null,null,null,null,null,null,"No","N/A","N/A","N/A","N/A","N/A","N/A","N/A","N/A","N/A","N/A","N/A","N/A","N/A","N/A","N/A","N/A"]
[null,null,null,null,null,null,null,null,null,null,null,null,null,null,null,null,null,null,null,null,null,null,null,null,null,null,null,null,null,null,null,null,null,null,null,null,null,null,null,null,null,null,null,null,null,null,null,null,null,null,null,null,"Use of Basic Sanitation","Yes","N/A","N/A","N/A","N/A","N/A","N/A","N/A","N/A","N/A","N/A","N/A","N/A","N/A","N/A","N/A","N/A"]
[null,null,null,null,null,null,null,null,null,null,null,null,null,null,null,null,null,null,null,null,null,null,null,null,null,null,null,null,null,null,null,null,null,null,null,null,null,null,null,null,null,null,null,null,null,null,null,null,null,null,null,null,null,"No","N/A","N/A","N/A","N/A","N/A","N/A","N/A","N/A","N/A","N/A","N/A","N/A","N/A","N/A","N/A","N/A"]
[null,null,null,null,null,null,null,null,null,null,null,null,null,null,null,null,null,null,null,null,null,null,null,null,null,null,null,null,null,null,null,null,null,null,null,null,null,null,null,null,null,null,null,null,null,null,null,null,null,null,null,null,"Access to Basic Hygiene","Yes","N/A","N/A","N/A","N/A","N/A","N/A","N/A","N/A","N/A","N/A","N/A","N/A","N/A","N/A","N/A","N/A"]
[null,null,null,null,null,null,null,null,null,null,null,null,null,null,null,null,null,null,null,null,null,null,null,null,null,null,null,null,null,null,null,null,null,null,null,null,null,null,null,null,null,null,null,null,null,null,null,null,null,null,null,null,null,"No","N/A","N/A","N/A","N/A","N/A","N/A","N/A","N/A","N/A","N/A","N/A","N/A","N/A","N/A","N/A","N/A"]
[]
[]
[]
[]
[]
[]
[]
[]
[]
[]
[]
[]
[]
[]
[]
[]
[]
[]
[]
[]
[]
[]
[]
[]
[]
[]
[]
[]
[]
[]
[]
[]
[]
[]
[]
[]
[]
[]
[]
[]
[]
[]
[]
[]
[null,null,"INITIAL (national) Wealth Index",null,null,null,null,"URBAN Wealth Index",null,null,null,null,"RURAL Wealth Index"]
[null,null,"Component Matrix",null,null,null,null,"Component Matrix",null,null,null,null,"Component Matrix"]
[null,null,null,null,"Component",null,null,null,null,"Component",null,null,null,null,"Component"]
[null,"Note:\n\nThe INITIAL (national) Wealth Index is based on the first component of the Principal Component Analysis (PCA) which has been obtained at national level.\n\nThe final national-level (NATIONAL) Wealth Index is based on the URBAN and RURAL specific wealth indexes. Regression procedures are used to establish the relationships between the two sets of scores (urban and rural) and the initial (national) wealth factors.\nThis allows best use of the available information for each area and a better precision of the FINAL (NATIONAL) Wealth Index.\n\nFor dependency reasons, all WASH variables (contained in the generic MICS and DHS scripts) have been excluded from the sets of asset variables used in the PCAs.\n\nThe PCA can extracts as many components as there are asset variables in the input. Only the first of the components is used to represent the Wealth Index. \n\nThe scores represent the weights of the asset variables on the Wealth Index (correlations between the variables and the component).\n\nThe communalities are the proportion of each variable's variance that can be explained by the component.\n\nProportion of explained variance is the part of the model's total variance that is explained by the component.\n\nFor more information on the procedure used:\n\nThe DHS Wealth Index, DHS Comparative Reports No. 6, Shea Oscar Rutstein, Kiersten Johnson, ORC Macro International Inc., 2004.\n\nThe DHS Wealth Index: Approaches for Rural and Urban Areas, Shea O. Rutstein, ORC Macro International Inc., 2008.\n\nMICS Methodological Paper No. 4, Review of options for reporting water, sanitation and hygiene coverage by wealth quintile, UNICEF, 2016.",null,null,"1",null,null,null,null,"1",null,null,null,null,"1"]
[null,null,"Household cooks in owm house",null,0.64051429183634911,null,null,"Household cooks in owm house",null,0.66996744194499613,null,null,"Household cooks in owm house",null,0.70573913431071678]
[null,null,"wall5",null,0.62838084504196423,null,null,"wall5",null,0.6275605725426141,null,null,"light1",null,0.60846686380380466]
[null,null,"light1",null,0.61290524665850832,null,null,"Household member owns: asset2a",null,0.57740644502643101,null,null,"Household cooks outside house",null,-0.6010155927194033]
[null,null,"wall1",null,-0.55181390509847184,null,null,"wall1",null,-0.54099535092629225,null,null,"house1",null,0.52321314914593942]
[null,null,"Household cooks outside house",null,-0.54225439693650235,null,null,"Household member owns: asset2c",null,0.52426806357733324,null,null,"house3",null,-0.51648258891134369]
[null,null,"Household member owns: asset2a",null,0.51088335664656637,null,null,"light1",null,0.50265945043501203,null,null,"light2",null,-0.47967737965293838]
[null,null,"Household member owns: asset2c",null,0.50913802845538692,null,null,"Household cooks outside house",null,-0.48461444658524272,null,null,"owner1",null,0.47038456871209372]
[null,null,"light2",null,-0.46826991113455169,null,null,"Household member owns: asset2d",null,0.48296476332624433,null,null,"wall5",null,0.45462828198992344]
[null,null,"Household member owns: asset2d",null,0.44288836641686902,null,null,"Household cooks in other house",null,-0.42239018985568932,null,null,"Household member owns: asset2b",null,0.44368451058617825]
[null,null,"Household member owns: asset2b",null,0.33702802451364483,null,null,"owner1",null,0.4169643242468159,null,null,"wall1",null,-0.35503007144965382]
[null,null,"light4",null,-0.30042496614306669,null,null,"light4",null,-0.32388215426892419,null,null,"Household member owns: asset2c",null,0.32577204950923083]
[null,null,"Household cooks in other house",null,-0.29974821214860742,null,null,"house3",null,-0.3219578940456716,null,null,"owner5",null,-0.30816765201285834]
[null,null,"owner1",null,0.26829757808464932,null,null,"light2",null,-0.30571535767185304,null,null,"Household cooks in other house",null,-0.29618261490810233]
[null,null,"house3",null,-0.24069405387522971,null,null,"owner5",null,-0.25845129573046643,null,null,"Household member owns: asset2a",null,0.29029811664340271]
[null,null,"owner5",null,-0.23135771565028854,null,null,"owner6",null,-0.24727970948577038,null,null,"light4",null,-0.28524709516785435]
[null,null,"light3",null,-0.21036059514433517,null,null,"wall4",null,-0.23975430354482263,null,null,"owner3",null,-0.2836953013508256]
[null,null,"wall4",null,-0.19400603489722684,null,null,"light3",null,-0.17904387854233497,null,null,"light3",null,-0.20806269151968487]
[null,null,"house2",null,0.17494518037332082,null,null,"owner3",null,-0.15444279667934174,null,null,"Household member owns: asset2d",null,0.20012693644753582]
[null,null,"owner6",null,-0.16805812395195821,null,null,"house5",null,0.13499371580133104,null,null,"wall4",null,-0.1824675340405888]
[null,null,"house5",null,0.13346132669669877,null,null,"house2",null,0.13285840974463675,null,null,"house6",null,-0.11855761027822476]
[null,null,"house6",null,-8.3917795825879632E-2,null,null,"owner2",null,-0.10090478156372948,null,null,"owner6",null,-0.105554772407907]
[null,null,"owner2",null,-7.995210953284447E-2,null,null,"house1",null,9.0500992081296638E-2,null,null,"wall7",null,-8.3381078281269227E-2]
[null,null,"house4",null,7.5140602669106271E-2,null,null,"Household member owns: asset2b",null,8.631259111420754E-2,null,null,"owner2",null,-7.3442289251450063E-2]
[null,null,"wall7",null,-5.8877458018877754E-2,null,null,"house4",null,4.1031564330488039E-2,null,null,"house7",null,-6.1841325762163814E-2]
[null,null,"owner3",null,-3.8509530226863736E-2,null,null,"wall3",null,-3.5461495918622229E-2,null,null,"wall3",null,5.852219988809397E-2]
[null,null,"owner4",null,2.369007749636997E-2,null,null,"wall2",null,-2.7639306961668268E-2,null,null,"house2",null,-5.3501719196720907E-2]
[null,null,"house1",null,2.3459825477166497E-2,null,null,"wall7",null,-1.3082268548709131E-2,null,null,"wall6",null,-4.1989637339896087E-2]
[null,null,"owner7",null,-1.4014952305437294E-2,null,null,"house7",null,8.1560534421001446E-3,null,null,"owner4",null,3.7459959339160638E-2]
[null,null,"wall6",null,-1.3037807393322045E-2,null,null,"wall6",null,-8.0535591484208763E-3,null,null,"house4",null,-3.3697321076011054E-2]
[null,null,"house8",null,7.8589630556320476E-3,null,null,"house8",null,2.3031259426878697E-3,null,null,"wall2",null,3.1822423769361105E-2]
[null,null,"house7",null,-3.7391712648384219E-3,null,null,null,null,null,null,null,"owner7",null,-1.3407954748952307E-3]
[null,null,"wall3",null,1.3006925492477291E-3]
[null,null,"wall2",null,-1.2362343771501532E-3]
[null,null,null,null,null,null,null,"Communalities"]
[null,null,null,null,null,null,null,null,null,"Extraction",null,null,"Communalities"]
[null,null,null,null,null,null,null,"wall1",null,0.29267596972386212,null,null,null,null,"Extraction"]
[null,null,"Communalities",null,null,null,null,"wall2",null,7.6393128932132398E-4,null,null,"wall1",null,0.1260463516335463]
[null,null,null,null,"Extraction",null,null,"wall3",null,1.2575176927864611E-3,null,null,"wall2",null,1.0126666545567987E-3]
[null,null,"wall1",null,0.30449858586002526,null,null,"wall4",null,5.7482126068262952E-2,null,null,"wall3",null,3.4248478797420257E-3]
[null,null,"wall2",null,1.5282754352478274E-6,null,null,"wall5",null,0.3938322722100136,null,null,"wall4",null,3.3294400978853431E-2]
[null,null,"wall3",null,1.6918011076685563E-6,null,null,"wall6",null,6.485981495711359E-5,null,null,"wall5",null,0.20668687478510936]
[null,null,"wall4",null,3.7638341576543999E-2,null,null,"wall7",null,1.7114575038054412E-4,null,null,"wall6",null,1.7631296439359957E-3]
[null,null,"wall5",null,0.39486248641565308,null,null,"light1",null,0.25266652311162829,null,null,"wall7",null,6.9524042153471469E-3]
[null,null,"wall6",null,1.6998442162536299E-4,null,null,"light2",null,9.3461879916429028E-2,null,null,"light1",null,0.37023192434723778]
[null,null,"wall7",null,3.4665550627647123E-3,null,null,"light3",null,3.2056710443482399E-2,null,null,"light2",null,0.23009038855070918]
[null,null,"light1",null,0.37565284138152694,null,null,"light4",null,0.10489964985387921,null,null,"light3",null,4.3290083602415548E-2]
[null,null,"light2",null,0.21927670967396093,null,null,"house1",null,8.1904295676989165E-3,null,null,"light4",null,8.136590530169896E-2]
[null,null,"light3",null,4.4251579989478887E-2,null,null,"house2",null,1.7651357039873791E-2,null,null,"house1",null,0.27375199943921102]
[null,null,"light4",null,9.0255160282062763E-2,null,null,"house3",null,0.1036568855383239,null,null,"house2",null,2.8624339570047742E-3]
[null,null,"house1",null,5.5036341141911026E-4,null,null,"house4",null,1.6835892714069784E-3,null,null,"house3",null,0.26675426464856405]
[null,null,"house2",null,3.0605816135853756E-2,null,null,"house5",null,1.8223303305850536E-2,null,null,"house4",null,1.1355094476997788E-3]
[null,null,"house3",null,5.7933627570891981E-2,null,null,"house7",null,6.6521207750393612E-5,null,null,"house6",null,1.4055906954883424E-2]
[null,null,"house4",null,5.6461101694765007E-3,null,null,"house8",null,5.3043891078818883E-6,null,null,"house7",null,3.8243495720220659E-3]
[null,null,"house5",null,1.7811925723642961E-2,null,null,"owner1",null,0.17385924769460381,null,null,"owner1",null,0.22126164248246241]
[null,null,"house6",null,7.0421964562740209E-3,null,null,"owner2",null,1.0181774942423961E-2,null,null,"owner2",null,5.3937698504936578E-3]
[null,null,"house7",null,1.3981401747793363E-5,null,null,"owner3",null,2.3852577446136492E-2,null,null,"owner3",null,8.0483024008535756E-2]
[null,null,"house8",null,6.1763300309789417E-5,null,null,"owner5",null,6.6797072264757021E-2,null,null,"owner4",null,1.4032485536915682E-3]
[null,null,"owner1",null,7.1983590406088496E-2,null,null,"owner6",null,6.1147254723366996E-2,null,null,"owner5",null,9.4967301747118149E-2]
[null,null,"owner2",null,6.3923398187519598E-3,null,null,"Household cooks in owm house",null,0.44885637326632177,null,null,"owner6",null,1.1141809978085046E-2]
[null,null,"owner3",null,1.4829839182937319E-3,null,null,"Household cooks in other house",null,0.17841347248632528,null,null,"owner7",null,1.7977325054995271E-6]
[null,null,"owner4",null,5.6121977178401491E-4,null,null,"Household cooks outside house",null,0.23485116183912108,null,null,"Household cooks in owm house",null,0.49806772569763991]
[null,null,"owner5",null,5.3526392590919764E-2,null,null,"Household member owns: asset2a",null,0.33339820275806092,null,null,"Household cooks in other house",null,8.7724141373801232E-2]
[null,null,"owner6",null,2.8243533026251749E-2,null,null,"Household member owns: asset2b",null,7.4498633848483781E-3,null,null,"Household cooks outside house",null,0.36121974269185569]
[null,null,"owner7",null,1.9641888812368212E-4,null,null,"Household member owns: asset2c",null,0.27485700248712674,null,null,"Household member owns: asset2a",null,8.4272996526706653E-2]
[null,null,"Household cooks in owm house",null,0.41025855804661981,null,null,"Household member owns: asset2d",null,0.23325496261477519,null,null,"Household member owns: asset2b",null,0.19685594493409653]
[null,null,"Household cooks in other house",null,8.9848990686286559E-2,null,null,null,null,null,null,null,"Household member owns: asset2c",null,0.10612742824144475]
[null,null,"Household cooks outside house",null,0.29403983099696984,null,null,null,null,null,null,null,"Household member owns: asset2d",null,4.0050790691876038E-2]
[null,null,"Household member owns: asset2a",null,0.26100180409846274,null,null,"Total Variance Explained"]
[null,null,"Household member owns: asset2b",null,0.11358788930756998,null,null,"Component",null,"Extraction Sums of Squared Loadings"]
[null,null,"Household member owns: asset2c",null,0.25922153201943837,null,null,null,null,"Total","% of Variance","Cumulative %","Total Variance Explained"]
[null,null,"Household member owns: asset2d",null,0.19615010510740283,null,null,"1",null,3.4257289421028831,11.419096473676277,11.419096473676277,"Component",null,"Extraction Sums of Squared Loadings"]
[null,null,null,null,null,null,null,null,null,null,null,null,null,null,"Total","% of Variance","Cumulative %"]
[null,null,null,null,null,null,null,null,null,null,null,null,"1",null,3.4555148061228511,11.146821955235003,11.146821955235003]
[null,null,"Total Variance Explained",null,null,null,null,"Component Score Coefficient Matrix"]
[null,null,"Component",null,"Extraction Sums of Squared Loadings",null,null,null,null,"Component"]
[null,null,null,null,"Total","% of Variance","Cumulative %",null,null,"1",null,null,"Component Score Coefficient Matrix"]
[null,null,"1",null,3.3762364375927643,10.231019507856862,10.231019507856862,"wall1",null,-0.15792123663882246,null,null,null,null,"Component"]
[null,null,null,null,null,null,null,"wall2",null,-8.0681535021570883E-3,null,null,null,null,"1"]
[null,null,null,null,null,null,null,"wall3",null,-1.0351518324404908E-2,null,null,"wall1",null,-0.1027430329109207]
[null,null,"Component Score Coefficient Matrix",null,null,null,null,"wall4",null,-6.9986361325379567E-2,null,null,"wall2",null,9.2091701395620503E-3]
[null,null,null,null,"Component",null,null,"wall5",null,0.18319037587293358,null,null,"wall3",null,1.6935884570483704E-2]
[null,null,null,null,"1",null,null,"wall6",null,-2.3509037885166718E-3,null,null,"wall4",null,-5.2804732226084894E-2]
[null,null,"wall1",null,-0.16344053957663929,null,null,"wall7",null,-3.8188276918017295E-3,null,null,"wall5",null,0.13156600607943117]
[null,null,"wall2",null,-3.6615752480640264E-4,null,null,"light1",null,0.14673065468117705,null,null,"wall6",null,-1.2151485291133569E-2]
[null,null,"wall3",null,3.8524924817620734E-4,null,null,"light2",null,-8.9240965306551595E-2,null,null,"wall7",null,-2.4129857042871215E-2]
[null,null,"wall4",null,-5.7462218207547079E-2,null,null,"light3",null,-5.2264461540389398E-2,null,null,"light1",null,0.17608573481602741]
[null,null,"wall5",null,0.1861187321021853,null,null,"light4",null,-9.4544010849296575E-2,null,null,"light2",null,-0.13881502657809328]
[null,null,"wall6",null,-3.8616393236422506E-3,null,null,"house1",null,2.6418024779783843E-2,null,null,"light3",null,-6.021177832924262E-2]
[null,null,"wall7",null,-1.7438784015036877E-2,null,null,"house2",null,3.8782522490842977E-2,null,null,"light4",null,-8.2548364331249E-2]
[null,null,"light1",null,0.18153504885916874,null,null,"house3",null,-9.3982302595148656E-2,null,null,"house1",null,0.15141395088768086]
[null,null,"light2",null,-0.13869582885860482,null,null,"house4",null,1.197746962002803E-2,null,null,"house2",null,-1.5482995211573349E-2]
[null,null,"light3",null,-6.2306239220118409E-2,null,null,"house5",null,3.9405836854817008E-2,null,null,"house3",null,-0.14946617736847331]
[null,null,"light4",null,-8.8982205984740756E-2,null,null,"house7",null,2.3808227620874039E-3,null,null,"house4",null,-9.7517513211931653E-3]
[null,null,"house1",null,6.9485137995528553E-3,null,null,"house8",null,6.7230244470950365E-4,null,null,"house6",null,-3.4309680881167606E-2]
[null,null,"house2",null,5.1816625881229941E-2,null,null,"owner1",null,0.12171550385152846,null,null,"house7",null,-1.7896414639169463E-2]
[null,null,"house3",null,-7.1290639244105503E-2,null,null,"owner2",null,-2.9454981193517638E-2,null,null,"owner1",null,0.13612575697219298]
[null,null,"house4",null,2.2255728844239667E-2,null,null,"owner3",null,-4.5083192304332484E-2,null,null,"owner2",null,-2.1253646235668607E-2]
[null,null,"house5",null,3.9529615050258704E-2,null,null,"owner5",null,-7.5444175560433049E-2,null,null,"owner3",null,-8.2099286869830201E-2]
[null,null,"house6",null,-2.4855426264433215E-2,null,null,"owner6",null,-7.2183092610350497E-2,null,null,"owner4",null,1.0840630540139801E-2]
[null,null,"house7",null,-1.1074968634318832E-3,null,null,"Household cooks in owm house",null,0.19556930897566485,null,null,"owner5",null,-8.9181401123448786E-2]
[null,null,"house8",null,2.327728878264059E-3,null,null,"Household cooks in other house",null,-0.12329936109784718,null,null,"owner6",null,-3.0546757380658235E-2]
[null,null,"owner1",null,7.9466466002583586E-2,null,null,"Household cooks outside house",null,-0.14146316149804961,null,null,"owner7",null,-3.8801612787752083E-4]
[null,null,"owner2",null,-2.368083841599963E-2,null,null,"Household member owns: asset2a",null,0.16854995091117461,null,null,"Household cooks in owm house",null,0.20423559842956329]
[null,null,"owner3",null,-1.1406052549542647E-2,null,null,"Household member owns: asset2b",null,2.5195394198708723E-2,null,null,"Household cooks in other house",null,-8.5713021510801887E-2]
[null,null,"owner4",null,7.0167116356521664E-3,null,null,"Household member owns: asset2c",null,0.15303839633485755,null,null,"Household cooks outside house",null,-0.17392939299651086]
[null,null,"owner5",null,-6.8525329883367153E-2,null,null,"Household member owns: asset2d",null,0.14098160464201134,null,null,"Household member owns: asset2a",null,8.4010091963438116E-2]
[null,null,"owner6",null,-4.9776763878474871E-2,null,null,null,null,null,null,null,"Household member owns: asset2b",null,0.12839896093051334]
[null,null,"owner7",null,-4.1510577130758853E-3,null,null,null,null,null,null,null,"Household member owns: asset2c",null,9.4275981376781559E-2]
[null,null,"Household cooks in owm house",null,0.18971251086106747,null,null,"Component Score Covariance Matrix",null,null,null,null,"Household member owns: asset2d",null,5.7915230486910232E-2]
[null,null,"Household cooks in other house",null,-8.8781759716545811E-2,null,null,"Component",null,"1"]
[null,null,"Household cooks outside house",null,-0.16060913000605087,null,null,"1",null,1.0000000000000002]
[null,null,"Household member owns: asset2a",null,0.1513174109959026,null,null,null,null,null,null,null,"Component Score Covariance Matrix"]
[null,null,"Household member owns: asset2b",null,9.9823584853537012E-2,null,null,null,null,null,null,null,"Component",null,"1"]
[null,null,"Household member owns: asset2c",null,0.15080046610076844,null,null,null,null,null,null,null,"1",null,0.99999999999999989]
[null,null,"Household member owns: asset2d",null,0.13117812528930753]
[]
[]
[null,null,"Component Score Covariance Matrix"]
[null,null,"Component",null,"1"]
[null,null,"1",null,0.99999999999999989]
[]
[]
[]
[]
[]
[]
[]
[]
[]
[]
[]
[]
[]
[]
[]
[]
[]
[]
[]
[]
[]
[]
[]
[]
[]
[]
[]
[]
[]
[]
[]
[]
[]
[]
[]
[]
[]
[]
[]
[]
[]
[]
[]
[]
[]
[]
[]
[]
[]
[]
[]
[]
[]
[]
[]
[]
[]
[]
[]
[]
[]
[]
[]
[]
[]
[]
[]
[]
[]
[]
[]
[]
[]
[]
[]
[]
[]
[]
[]
[]
[]
[]
[]
[]
[]
[]
[]
[]
[]
[]
[]
[]
[]
[]
[]
[]
[]
[]
[]
[]
[]
[]
[]
[]
[]
[]
[]
[]
[]
[]
[]
[]
[]
[]
[]
[]
[]
[]
[]
[]
[]
[]
[]
[]
[]
[]
[]
[]
[]
[]
[]
[]
[]
[]
[]
[]
[]
[]
[]
[]
[]
[]
[]
[]
[]
[]
[]
[]
[]
[]
[]
[]
[]
[]
[]
[]
[]
[]
[]
[]
[]
[]
[]
[]
[]
[]
[]
[]
[]
[]
[]
[]
[]
[]
[]
[]
[]
[]
[]
[]
[]
[]
[]
[]
[]
[]
[]
[]
[]
[]
[]
[]
[]
[]
[]
[]
[]
[]
[]
[]
[]
[]
[]
[]
[]
[]
[]
[]
[]
[]
[]
[]
[]
[]
[]
[]
[]
[]
[]
[]
[]
[]
[]
[]
[]
[]
[]
[]
[]
[]
[]
[]
[]
[]
[]
[]
[]
[]
[]
[]
[]
[]
[]
[]
[]
[]
[]
[]
[]
[]
[]
[]
[]
[]
[]
[]
[]
[]
[]
[]
[]
[]
[]
[]
[]
[]
[]
[]
[]
[]
[]
[]
[]
[]
[]
[]
[]
[]
[]
[]
[]
[]
[]
[]
[]
[]
[]
[]
[]
[]
[]
[]
[]
[]
[]
[]
[]
[]
[]
[]
[]
[]
[]
[]
[]
[]
[]
[]
[]
[]
[]
[]
[]
[]
[]
[]
[]
[]
[]
[]
[]
[]
[]
[]
[]
[]
[]
[]
[]
[]
[]
[]
[]
[]
[]
[]
[]
[]
[]
[]
[]
[]
[]
[]
[]
[]
[]
[]
[]
[]
[]
[]
[]
[]
[]
[]
[]
[]
[]
[]
[]
[]
[]
[]
[]
[]
[]
[]
[]
[]
[]
[]
[]
[]
[]
[]
[]
[]
[]
[]
[]
[]
[]
[]
[]
[]
[]
[]
[]
[]
[]
[]
[]
[]
[]
[]
[]
[]
[]
[]
[]
[]
[]
[]
[]
[]
[]
[]
[]
[]
[]
[]
[]
[]
[]
[]
[]
[]
[]
[]
[]
[]
[]
[]
[]
[]
[]
[]
[]
[]
[]
[]
[]
[]
[]
[]
[]
[]
[]
[]
[]
[]
[]
[]
[]
[]
[]
[]
[]
[]
[]
[]
[]
[]
[]
[]
[]
[]
[]
[]
[]
[]
[]
[]
[]
[]
[]
[]
[]
[]
[]
[]
[]
[]
[]
[]
[]
[]
[]
[]
[]
[]
[]
[]
[]
[]
[]
[]
[]
[]
[]
[]
[]
[]
[]
[]
[]
[]
[]
[]
[]
[]
["SLC07"]
["Jamaica",null,"Count"]
["W_text_t","Time to improved source based on:",1994]
["W_text_i","Ratio of Improved wells based on:",1994]
["S_text_s","Ratio of Shared improved based on:",1994]
["S_text_i","Ratio of Improved latrines based on:",1994]
["Urban/Rural","Urban",1059]
[null,"Rural",935]
[null,"Missing",0]
["2007"]
[]
["Sub-national region names","Weighted population"]
[{"$f":"R15","v":"None valid"},{"$f":"BR122+BR123","v":{"$error":"#VALUE!"}}]
[{"$f":"S15","v":0},{"$f":"BS122+BS123","v":0}]
[{"$f":"T15","v":0},{"$f":"BT122+BT123","v":0}]
[{"$f":"U15","v":0},{"$f":"BU122+BU123","v":0}]
[{"$f":"V15","v":0},{"$f":"BV122+BV123","v":0}]
[{"$f":"W15","v":0},{"$f":"BW122+BW123","v":0}]
[{"$f":"X15","v":0},{"$f":"BX122+XR123","v":0}]
[{"$f":"Y15","v":0},{"$f":"BY122+BY123","v":0}]
[{"$f":"Z15","v":0},{"$f":"BZ122+BZ123","v":0}]
[{"$f":"AA15","v":0},{"$f":"CA122+CA123","v":0}]
[{"$f":"AB15","v":0},{"$f":"CB122+CB123","v":0}]
[{"$f":"AC15","v":0},{"$f":"CC122+CC123","v":0}]
[{"$f":"AD15","v":0},{"$f":"CD122+CD123","v":0}]
[{"$f":"AE15","v":0},{"$f":"CE122+CE123","v":0}]
[{"$f":"AF15","v":0},{"$f":"CF122+CF123","v":0}]
[{"$f":"AG15","v":0},{"$f":"CG122+CG123","v":0}]
[{"$f":"AH15","v":0},{"$f":"CH122+CH123","v":0}]
[{"$f":"AI15","v":0},{"$f":"CI122+CI123","v":0}]
[{"$f":"AJ15","v":0},{"$f":"CJ122+CJ123","v":0}]
[{"$f":"AK15","v":0},{"$f":"CK122+CK123","v":0}]
[{"$f":"AL15","v":0},{"$f":"CL122+CL123","v":0}]
[{"$f":"AM15","v":0},{"$f":"CM122+CM123","v":0}]
[{"$f":"AN15","v":0},{"$f":"CN122+CN123","v":0}]
[{"$f":"AO15","v":0},{"$f":"CO122+CO123","v":0}]
[{"$f":"AP15","v":0},{"$f":"CP122+CP123","v":0}]
[{"$f":"AQ15","v":0},{"$f":"CQ122+CQ123","v":0}]
[{"$f":"AR15","v":0},{"$f":"CR122+CR123","v":0}]
[{"$f":"AS15","v":0},{"$f":"CS122+CS123","v":0}]
[{"$f":"AT15","v":0},{"$f":"CT122+CT123","v":0}]
[{"$f":"AU15","v":0},{"$f":"CU122+CU123","v":0}]
[{"$f":"AV15","v":0},{"$f":"CV122+CV123","v":0}]
[{"$f":"AW15","v":0},{"$f":"CW122+CW123","v":0}]
[{"$f":"AX15","v":0},{"$f":"CX122+CX123","v":0}]
[{"$f":"AY15","v":0},{"$f":"CY122+CY123","v":0}]
[]
[{"$f":"34-COUNTIF(A1037:A1071,\"0\")","v":1},"Sub-regions"]

{"sheet":"MICS11","index":6,"n_rows":1072,"n_cols":72,"rows_kept":1072,"cut":false,"hidden":false,"merged":[[346,52,347,52],[348,52,349,52],[350,52,351,52],[352,52,353,52],[152,52,164,52],[230,52,235,52],[270,52,272,52],[273,52,275,52],[276,52,283,52],[338,54,338,58],[338,59,338,63],[338,64,338,68],[340,52,341,52],[342,52,343,52],[344,52,345,52],[221,52,223,52],[224,52,225,52],[226,52,229,52],[258,54,258,58],[258,59,258,63],[258,64,258,68],[260,52,262,52],[263,52,266,52],[267,52,269,52],[119,64,119,68],[121,52,122,52],[123,52,126,52],[127,52,128,52],[132,54,132,58],[132,59,132,63],[132,64,132,68],[134,52,138,52],[219,54,219,58],[219,59,219,63],[219,64,219,68],[139,52,142,52],[13,64,13,68],[15,52,16,52],[17,52,20,52],[21,52,22,52],[26,54,26,58],[26,59,26,63],[26,64,26,68],[40,52,41,52],[55,54,55,58],[55,59,55,63],[55,64,55,68],[143,0,146,0],[143,52,146,52],[147,0,149,0],[147,52,149,52],[150,0,151,0],[150,52,151,52],[13,54,13,58],[13,59,13,63],[119,54,119,58],[119,59,119,63],[42,52,43,52],[44,52,45,52],[46,0,48,0],[46,52,48,52],[49,0,51,0],[49,52,51,52],[52,0,54,0],[52,52,54,52],[32,52,33,52],[34,52,35,52],[36,52,37,52],[38,0,39,0],[38,52,39,52],[13,2,13,6],[13,7,13,11],[28,52,29,52],[30,0,31,0],[30,52,31,52],[26,2,26,6],[26,7,26,11],[26,12,26,16],[13,12,13,16],[15,0,16,0],[17,0,20,0],[21,0,22,0],[23,0,25,0],[32,0,33,0],[55,2,55,6],[55,7,55,11],[55,12,55,16],[28,0,29,0],[34,0,35,0],[36,0,37,0],[40,0,41,0],[42,0,43,0],[44,0,45,0],[139,0,142,0],[107,0,107,1],[119,2,119,6],[119,7,119,11],[57,0,72,0],[132,12,132,16],[134,0,138,0],[119,12,119,16],[121,0,122,0],[123,0,126,0],[127,0,128,0],[129,0,131,0],[152,0,163,0],[132,2,132,6],[132,7,132,11],[219,2,219,6],[219,7,219,11],[219,12,219,16],[207,0,207,1],[1024,0,1024,2],[1025,0,1025,1],[403,12,403,13],[404,2,404,3],[404,7,404,8],[404,12,404,13],[409,2,409,3],[409,7,409,8],[409,12,409,13],[410,2,410,3],[410,7,410,8],[410,12,410,13],[407,2,407,3],[407,7,407,8],[407,12,407,13],[408,2,408,3],[408,7,408,8],[1034,0,1034,2],[398,2,398,5],[221,0,223,0],[224,0,228,0],[398,7,398,10],[398,12,398,15],[399,2,399,4],[399,7,399,9],[399,12,399,14],[400,2,401,3],[400,7,401,8],[400,12,401,13],[405,2,405,3],[405,7,405,8],[405,12,405,13],[406,2,406,3],[406,7,406,8],[406,12,406,13],[401,1,444,1],[402,2,402,3],[402,7,402,8],[402,12,402,13],[403,2,403,3],[403,7,403,8],[408,12,408,13],[413,2,413,3],[413,7,413,8],[413,12,413,13],[414,2,414,3],[414,7,414,8],[414,12,414,13],[411,2,411,3],[411,7,411,8],[411,12,411,13],[412,2,412,3],[412,7,412,8],[412,12,412,13],[417,2,417,3],[417,7,417,8],[417,12,417,13],[418,2,418,3],[418,7,418,8],[418,12,418,13],[415,2,415,3],[415,7,415,8],[415,12,415,13],[416,2,416,3],[416,7,416,8],[416,12,416,13],[421,2,421,3],[421,7,421,8],[421,12,421,13],[422,2,422,3],[422,7,422,8],[422,12,422,13],[419,2,419,3],[419,7,419,8],[419,12,419,13],[420,2,420,3],[420,7,420,8],[420,12,420,13],[425,2,425,3],[425,7,425,8],[425,12,425,13],[426,2,426,3],[426,7,426,8],[426,12,426,13],[423,2,423,3],[423,7,423,8],[423,12,423,13],[424,2,424,3],[424,7,424,8],[424,12,424,13],[429,2,429,3],[429,7,429,8],[429,12,429,13],[430,2,430,3],[430,7,430,8],[430,12,430,13],[427,2,427,3],[427,7,427,8],[427,12,427,13],[428,2,428,3],[428,7,428,8],[428,12,428,13],[433,2,433,3],[433,7,433,8],[433,12,433,13],[434,2,434,3],[434,7,434,8],[434,12,434,13],[431,2,431,3],[431,7,431,8],[431,12,431,13],[432,2,432,3],[432,7,432,8],[432,12,432,13],[437,2,437,3],[437,7,437,8],[437,12,437,13],[438,2,438,3],[438,7,438,8],[438,12,438,13],[435,2,435,3],[435,7,435,8],[435,12,435,13],[436,2,436,3],[436,7,436,8],[436,12,436,13],[441,2,441,3],[441,7,441,8],[441,12,441,13],[442,2,442,3],[442,7,442,8],[442,12,442,13],[439,2,439,3],[439,7,439,8],[439,12,439,13],[440,2,440,3],[440,7,440,8],[440,12,440,13],[445,2,445,3],[445,7,445,8],[445,12,445,13],[446,2,446,3],[446,7,446,8],[446,12,446,13],[443,2,443,3],[443,7,443,8],[443,12,443,13],[444,2,444,3],[444,7,444,8],[444,12,444,13],[449,2,449,3],[449,7,449,8],[449,12,449,13],[450,2,450,3],[450,7,450,8],[450,12,450,13],[447,2,447,3],[447,7,447,8],[447,12,447,13],[448,2,448,3],[448,7,448,8],[448,12,448,13],[453,2,453,3],[453,7,453,8],[453,12,453,13],[454,2,454,4],[454,7,454,8],[454,12,454,13],[451,2,451,3],[451,7,451,8],[451,12,451,13],[452,2,452,3],[452,7,452,8],[452,12,452,13],[457,2,457,3],[457,7,457,8],[457,12,457,13],[458,2,458,3],[458,7,458,8],[458,12,458,13],[455,2,455,3],[455,7,455,8],[455,12,455,13],[456,2,456,3],[456,7,456,9],[456,12,456,14],[461,2,461,3],[461,7,461,8],[461,12,461,13],[462,2,462,3],[462,7,462,8],[462,12,462,13],[459,2,459,3],[459,7,459,8],[459,12,459,13],[460,2,460,3],[460,7,460,8],[460,12,460,13],[465,2,465,3],[465,7,465,8],[465,12,465,13],[466,2,466,3],[466,7,466,8],[466,12,466,13],[463,2,463,3],[463,7,463,8],[463,12,463,13],[464,2,464,3],[464,7,464,8],[464,12,464,13],[469,2,469,3],[469,7,469,8],[469,12,469,13],[470,2,470,3],[470,7,470,8],[470,12,470,13],[467,2,467,3],[467,7,467,8],[467,12,467,13],[468,2,468,3],[468,7,468,8],[468,12,468,13],[473,2,473,3],[473,7,473,8],[473,12,473,13],[474,2,474,3],[474,7,474,8],[474,12,474,13],[471,2,471,3],[471,7,471,8],[471,12,471,13],[472,2,472,3],[472,7,472,8],[472,12,472,13],[477,2,477,3],[477,7,477,8],[477,12,477,13],[478,2,478,3],[478,7,478,8],[478,12,478,13],[475,2,475,3],[475,7,475,8],[475,12,475,13],[476,2,476,3],[476,7,476,8],[476,12,476,13],[481,2,481,3],[481,7,481,8],[481,12,481,13],[482,2,482,3],[482,7,482,8],[482,12,482,13],[479,2,479,3],[479,7,479,8],[479,12,479,13],[480,2,480,3],[480,7,480,8],[480,12,480,13],[485,2,485,3],[485,7,485,8],[485,12,485,13],[486,2,486,3],[486,7,486,8],[486,12,486,13],[483,2,483,3],[483,7,483,8],[483,12,483,13],[484,2,484,3],[484,7,484,8],[484,12,484,13],[489,2,489,3],[489,7,489,8],[489,12,489,13],[490,2,490,3],[490,7,490,8],[490,12,490,13],[487,2,487,3],[487,7,487,8],[487,12,487,13],[488,2,488,3],[488,7,488,8],[488,12,488,13],[493,2,493,3],[493,7,493,8],[493,12,493,13],[494,2,494,3],[494,7,494,8],[494,12,494,13],[491,2,491,3],[491,7,491,8],[491,12,491,13],[492,2,492,3],[492,7,492,8],[492,12,492,13],[497,2,497,3],[497,7,497,8],[497,12,497,13],[498,2,498,3],[498,7,498,8],[498,12,498,13],[495,2,495,3],[495,7,495,8],[495,12,495,13],[496,2,496,3],[496,7,496,8],[496,12,496,13],[501,2,501,3],[501,7,501,8],[501,12,501,13],[502,2,502,3],[502,7,502,8],[502,12,502,13],[499,2,499,3],[499,7,499,8],[499,12,499,13],[500,2,500,3],[500,7,500,8],[500,12,500,13],[505,2,505,3],[505,7,505,8],[505,12,505,13],[506,2,506,3],[506,7,506,8],[506,12,506,13],[503,2,503,3],[503,7,503,8],[503,12,503,13],[504,2,504,3],[504,7,504,8],[504,12,504,13],[512,14,512,16],[513,2,513,4],[510,2,510,3],[510,7,510,8],[510,12,510,13],[511,2,511,3],[511,7,511,11],[511,12,511,16],[507,2,507,6],[507,7,507,8],[507,12,507,13],[508,2,509,3],[508,4,508,6],[508,7,508,8],[508,12,508,13],[509,7,509,8],[509,12,509,13],[514,2,515,3],[514,7,514,8],[514,12,514,13],[515,7,515,8],[515,12,515,13],[516,2,516,3],[516,7,516,8],[516,12,516,13],[512,2,512,3],[512,7,513,8],[512,9,512,11],[512,12,513,13],[520,2,520,3],[520,7,520,8],[520,12,520,13],[521,2,521,3],[521,7,521,8],[521,12,521,13],[517,2,517,3],[517,7,517,9],[517,12,517,14],[518,2,518,3],[518,7,519,8],[518,12,519,13],[519,2,519,3],[524,2,524,3],[524,7,524,8],[524,12,524,13],[525,2,525,3],[525,7,525,8],[525,12,525,13],[522,2,522,3],[522,7,522,8],[522,12,522,13],[523,2,523,3],[523,7,523,8],[523,12,523,13],[528,2,528,3],[528,7,528,8],[528,12,528,13],[529,2,529,3],[529,7,529,8],[529,12,529,13],[526,2,526,3],[526,7,526,8],[526,12,526,13],[527,2,527,3],[527,7,527,8],[527,12,527,13],[532,2,532,3],[532,7,532,8],[532,12,532,13],[533,2,533,3],[533,7,533,8],[533,12,533,13],[530,2,530,3],[530,7,530,8],[530,12,530,13],[531,2,531,3],[531,7,531,8],[531,12,531,13],[536,2,536,3],[536,7,536,8],[536,12,536,13],[537,2,537,3],[537,7,537,8],[537,12,537,13],[534,2,534,3],[534,7,534,8],[534,12,534,13],[535,2,535,3],[535,7,535,8],[535,12,535,13],[540,2,540,3],[540,7,540,8],[540,12,540,13],[541,2,541,3],[541,7,541,8],[541,12,541,13],[538,2,538,3],[538,7,538,8],[538,12,538,13],[539,2,539,3],[539,7,539,8],[539,12,539,13],[544,2,544,3],[544,7,544,8],[544,12,544,13],[545,2,545,3],[545,7,545,8],[545,12,545,13],[542,2,542,3],[542,7,542,8],[542,12,542,13],[543,2,543,3],[543,7,543,8],[543,12,543,13],[548,2,548,3],[548,7,548,8],[548,12,548,13],[549,2,549,3],[549,7,549,8],[549,12,549,13],[546,2,546,3],[546,7,546,8],[546,12,546,13],[547,2,547,3],[547,7,547,8],[547,12,547,13],[552,2,552,3],[552,7,552,8],[552,12,552,13],[553,2,553,3],[553,7,553,8],[553,12,553,13],[550,2,550,3],[550,7,550,8],[550,12,550,13],[551,2,551,3],[551,7,551,8],[551,12,551,13],[556,2,556,3],[556,7,556,8],[556,12,556,13],[557,2,557,3],[557,7,557,8],[557,12,557,13],[554,2,554,3],[554,7,554,8],[554,12,554,13],[555,2,555,3],[555,7,555,8],[555,12,555,13],[560,2,560,3],[560,7,560,8],[560,12,560,13],[561,2,561,3],[561,7,561,8],[561,12,561,13],[558,2,558,3],[558,7,558,8],[558,12,558,13],[559,2,559,3],[559,7,559,8],[559,12,559,13],[564,2,564,3],[564,7,564,8],[564,12,564,13],[565,2,565,3],[565,7,565,8],[565,12,565,13],[562,2,562,3],[562,7,562,8],[562,12,562,13],[563,2,563,3],[563,7,563,8],[563,12,563,13],[568,2,568,3],[568,7,568,8],[568,12,568,13],[569,2,569,3],[569,7,569,8],[569,12,569,13],[566,2,566,3],[566,7,566,8],[566,12,566,13],[567,2,567,4],[567,7,567,8],[567,12,567,13],[572,2,572,3],[572,7,572,8],[572,12,572,13],[573,2,573,3],[573,7,573,9],[573,12,573,14],[570,2,570,3],[570,7,570,8],[570,12,570,13],[571,2,571,3],[571,7,571,8],[571,12,571,13],[576,2,576,3],[576,7,576,8],[576,12,576,13],[577,2,577,3],[577,7,577,8],[577,12,577,13],[574,2,574,3],[574,7,574,8],[574,12,574,13],[575,2,575,3],[575,7,575,8],[575,12,575,13],[580,2,580,3],[580,7,580,8],[580,12,580,13],[581,2,581,3],[581,7,581,8],[581,12,581,13],[578,2,578,3],[578,7,578,8],[578,12,578,13],[579,2,579,3],[579,7,579,8],[579,12,579,13],[584,2,584,3],[584,7,584,8],[584,12,584,13],[585,2,585,3],[585,7,585,8],[585,12,585,13],[582,2,582,3],[582,7,582,8],[582,12,582,13],[583,2,583,3],[583,7,583,8],[583,12,583,13],[588,2,588,3],[588,7,588,8],[588,12,588,13],[589,2,589,3],[589,7,589,8],[589,12,589,13],[586,2,586,3],[586,7,586,8],[586,12,586,13],[587,2,587,3],[587,7,587,8],[587,12,587,13],[592,2,592,3],[592,7,592,8],[592,12,592,13],[593,2,593,3],[593,7,593,8],[593,12,593,13],[590,2,590,3],[590,7,590,8],[590,12,590,13],[591,2,591,3],[591,7,591,8],[591,12,591,13],[596,2,596,3],[596,7,596,8],[596,12,596,13],[597,2,597,3],[597,7,597,8],[597,12,597,13],[594,2,594,3],[594,7,594,8],[594,12,594,13],[595,2,595,3],[595,7,595,8],[595,12,595,13],[600,2,600,3],[600,7,600,8],[600,12,600,13],[601,2,601,3],[601,7,601,8],[601,12,601,13],[598,2,598,3],[598,7,598,8],[598,12,598,13],[599,2,599,3],[599,7,599,8],[599,12,599,13],[604,2,604,3],[604,7,604,8],[604,12,604,13],[605,2,605,3],[605,7,605,8],[605,12,605,13],[602,2,602,3],[602,7,602,8],[602,12,602,13],[603,2,603,3],[603,7,603,8],[603,12,603,13],[608,2,608,3],[608,7,608,8],[608,12,608,13],[609,2,609,3],[609,7,609,8],[609,12,609,13],[606,2,606,3],[606,7,606,8],[606,12,606,13],[607,2,607,3],[607,7,607,8],[607,12,607,13],[612,2,612,3],[612,7,612,8],[612,12,612,13],[613,2,613,3],[613,7,613,8],[613,12,613,13],[610,2,610,3],[610,7,610,8],[610,12,610,13],[611,2,611,3],[611,7,611,8],[611,12,611,13],[616,2,616,3],[616,7,616,8],[616,12,616,13],[617,2,617,3],[617,7,617,8],[617,12,617,13],[614,2,614,3],[614,7,614,8],[614,12,614,13],[615,2,615,3],[615,7,615,8],[615,12,615,13],[620,2,620,3],[620,7,620,8],[620,12,620,13],[621,2,621,3],[621,7,621,8],[621,12,621,13],[618,2,618,3],[618,7,618,8],[618,12,618,13],[619,2,619,3],[619,7,619,8],[619,12,619,13],[624,2,624,3],[624,7,624,8],[624,12,624,13],[625,2,625,3],[625,7,625,8],[625,12,625,13],[622,2,622,3],[622,7,622,8],[622,12,622,13],[623,2,623,3],[623,7,623,8],[623,12,623,13],[628,2,628,3],[628,7,628,8],[628,12,628,13],[629,2,629,3],[629,7,629,8],[629,12,629,13],[626,2,626,3],[626,7,626,8],[626,12,626,13],[627,2,627,3],[627,7,627,8],[627,12,627,13],[632,2,632,3],[632,7,632,8],[632,12,632,13],[633,2,633,3],[633,7,633,8],[633,12,633,13],[630,2,630,3],[630,7,630,8],[630,12,630,13],[631,2,631,3],[631,7,631,8],[631,12,631,13],[636,2,636,3],[636,7,636,8],[636,12,636,13],[637,2,637,3],[637,7,637,8],[637,12,637,13],[634,2,634,3],[634,7,634,8],[634,12,634,13],[635,2,635,3],[635,7,635,8],[635,12,635,13],[640,2,640,3],[640,7,640,8],[640,12,640,13],[641,2,641,3],[641,7,641,8],[641,12,641,13],[638,2,638,3],[638,7,638,8],[638,12,638,13],[639,2,639,3],[639,7,639,8],[639,12,639,13],[644,2,644,3],[644,7,644,8],[644,12,644,13],[645,2,645,3],[645,7,645,8],[645,12,645,13],[642,2,642,3],[642,7,642,8],[642,12,642,13],[643,2,643,3],[643,7,643,8],[643,12,643,13],[648,2,648,3],[648,7,648,8],[648,12,648,13],[649,2,649,3],[649,7,649,8],[649,12,649,13],[646,2,646,3],[646,7,646,8],[646,12,646,13],[647,2,647,3],[647,7,647,8],[647,12,647,13],[652,2,652,3],[652,7,652,8],[652,12,652,13],[653,2,653,3],[653,7,653,8],[653,12,653,13],[650,2,650,3],[650,7,650,8],[650,12,650,13],[651,2,651,3],[651,7,651,8],[651,12,651,13],[656,2,656,3],[656,7,656,8],[656,12,656,13],[657,2,657,3],[657,7,657,8],[657,12,657,13],[654,2,654,3],[654,7,654,8],[654,12,654,13],[655,2,655,3],[655,7,655,8],[655,12,655,13],[660,2,660,3],[660,7,660,8],[660,12,660,13],[661,2,661,3],[661,7,661,8],[661,12,661,13],[658,2,658,3],[658,7,658,8],[658,12,658,13],[659,2,659,3],[659,7,659,8],[659,12,659,13],[664,2,664,3],[664,7,664,8],[664,12,664,13],[665,2,665,3],[665,7,665,8],[665,12,665,13],[662,2,662,3],[662,7,662,8],[662,12,662,13],[663,2,663,3],[663,7,663,8],[663,12,663,13],[668,2,668,3],[668,7,668,8],[668,12,668,13],[669,2,669,3],[669,7,669,8],[669,12,669,13],[666,2,666,3],[666,7,666,8],[666,12,666,13],[667,2,667,3],[667,7,667,8],[667,12,667,13],[672,2,672,3],[672,7,672,8],[672,12,672,13],[673,2,673,3],[673,7,673,8],[673,12,673,13],[670,2,670,3],[670,7,670,8],[670,12,670,13],[671,2,671,3],[671,7,671,8],[671,12,671,13],[676,2,676,3],[676,7,676,8],[676,12,676,13],[677,2,677,3],[677,7,677,8],[677,12,677,13],[674,2,674,3],[674,7,674,8],[674,12,674,13],[675,2,675,3],[675,7,675,8],[675,12,675,13],[680,2,680,3],[680,7,680,8],[680,12,680,13],[681,2,681,3],[681,7,681,8],[681,12,681,13],[678,2,678,3],[678,7,678,8],[678,12,678,13],[679,2,679,3],[679,7,679,8],[679,12,679,13],[684,2,684,3],[684,7,684,8],[684,12,684,13],[685,2,685,3],[685,7,685,8],[685,12,685,13],[682,2,682,3],[682,7,682,8],[682,12,682,13],[683,2,683,3],[683,7,683,8],[683,12,683,13],[688,2,688,3],[688,7,688,8],[688,12,688,13],[689,2,689,3],[689,7,689,8],[689,12,689,13],[686,2,686,3],[686,7,686,8],[686,12,686,13],[687,2,687,3],[687,7,687,8],[687,12,687,13]]}
[]
[{"$f":"A1026","v":"Jamaica"}]
[{"$f":"A1034","v":2011}]
["Use of drinking water sources"]
[" by wealth quintile and sub-national region"]
["Notes:"]
["WHO/UNICEF JMP customised wealth index excludes water,"]
[" sanitation and hygiene assets."]
["Survey used for analysis:",{"$f":"A1025","v":"MICS11"}]
[{"$f":"B1028","v":""}]
[{"$f":"B1027","v":""}]
[]
[]
["Use of drinking water sources",null,"NATIONAL wealth index quintile",null,null,null,null,"URBAN wealth index quintile",null,null,null,null,"RURAL wealth index quintile",null,null,null,null,"SUB-REGIONS:",null,null,null,null,null,null,null,null,null,null,null,null,null,null,null,null,null,null,null,null,null,null,null,null,null,null,null,null,null,null,null,null,null,null,"Raw numbers of respondents:","Use of drinking water sources","NATIONAL wealth index quintile",null,null,null,null,"URBAN wealth index quintile",null,null,null,null,"RURAL wealth index quintile",null,null,null,null,"SUB-REGIONS:"]
["Weighted percentage (used in graphs)",null,"Poorest","Poor","Middle","Rich","Richest","Poorest","Poor","Middle","Rich","Richest","Poorest","Poor","Middle","Rich","Richest","  KMA","  Other towns","Rural",null,null,null,null,null,null,null,null,null,null,null,null,null,null,null,null,null,null,null,null,null,null,null,null,null,null,null,null,null,null,null,null,"Water data, raw numbers (weighted)",null,"Poorest","Poor","Middle","Rich","Richest","Poorest","Poor","Middle","Rich","Richest","Poorest","Poor","Middle","Rich","Richest","  KMA","  Other towns","Rural"]
["Water","Improved",92,96.1,99.9,96.8,99.1,98.7,99.7,100,100,99.3,87.1,95,93.4,97,98.6,99.9,99.6,94.2,null,null,null,null,null,null,null,null,null,null,null,null,null,null,null,null,null,null,null,null,null,null,null,null,null,null,null,null,null,null,null,null,"Water","Improved","N/A","N/A","N/A","N/A","N/A","N/A","N/A","N/A","N/A","N/A","N/A","N/A","N/A","N/A","N/A","N/A","N/A","N/A"]
[null,"Not Improved",8,3.9,0.1,3.2,0.9,1.3,0.3,0,0,0.7,12.9,5,6.6,3,1.4,0.1,0.4,5.8,null,null,null,null,null,null,null,null,null,null,null,null,null,null,null,null,null,null,null,null,null,null,null,null,null,null,null,null,null,null,null,null,null,"Not Improved","N/A","N/A","N/A","N/A","N/A","N/A","N/A","N/A","N/A","N/A","N/A","N/A","N/A","N/A","N/A","N/A","N/A","N/A"]
["Water ladder","Basic",87.9,92.8,99.9,95.4,98.1,97.6,99.5,99.1,99,99.3,81.3,92,88.6,95.4,97.2,99.9,98.9,91.1,null,null,null,null,null,null,null,null,null,null,null,null,null,null,null,null,null,null,null,null,null,null,null,null,null,null,null,null,null,null,null,null,"Water ladder","Basic","N/A","N/A","N/A","N/A","N/A","N/A","N/A","N/A","N/A","N/A","N/A","N/A","N/A","N/A","N/A","N/A","N/A","N/A"]
[null,"Limited",3.4,3.1,0,1.4,1,1,0.2,0.9,1,0,4.5,2.7,4.5999999999999996,1.5,1.4,0,0.6,2.9,null,null,null,null,null,null,null,null,null,null,null,null,null,null,null,null,null,null,null,null,null,null,null,null,null,null,null,null,null,null,null,null,null,"Limited","N/A","N/A","N/A","N/A","N/A","N/A","N/A","N/A","N/A","N/A","N/A","N/A","N/A","N/A","N/A","N/A","N/A","N/A"]
[null,"Unimproved",6.1,3.6,0.1,3,0.8,1.4,0.3,0,0,0.7,9.9,3.9,6,2.5,1.1000000000000001,0.1,0.5,4.5999999999999996,null,null,null,null,null,null,null,null,null,null,null,null,null,null,null,null,null,null,null,null,null,null,null,null,null,null,null,null,null,null,null,null,null,"Unimproved","N/A","N/A","N/A","N/A","N/A","N/A","N/A","N/A","N/A","N/A","N/A","N/A","N/A","N/A","N/A","N/A","N/A","N/A"]
[null,"Surface water",2.6,0.6,0,0.3,0.2,0,0,0,0,0,4.3,1.4,0.8,0.6,0.2,0,0,1.4,null,null,null,null,null,null,null,null,null,null,null,null,null,null,null,null,null,null,null,null,null,null,null,null,null,null,null,null,null,null,null,null,null,"Surface water","N/A","N/A","N/A","N/A","N/A","N/A","N/A","N/A","N/A","N/A","N/A","N/A","N/A","N/A","N/A","N/A","N/A","N/A"]
["Improved water point at more than 30 minutes","Yes",3.8,3.2,0,1.4,1,1,0.2,0.9,1,0,5.2,2.8,4.9000000000000004,1.6,1.4,0,0.6,3.1,null,null,null,null,null,null,null,null,null,null,null,null,null,null,null,null,null,null,null,null,null,null,null,null,null,null,null,null,null,null,null,null,"Improved water point at more than 30 minutes","Yes","N/A","N/A","N/A","N/A","N/A","N/A","N/A","N/A","N/A","N/A","N/A","N/A","N/A","N/A","N/A","N/A","N/A","N/A"]
[null,"No",96.2,96.8,100,98.6,99,99,99.8,99.1,99,100,94.8,97.2,95.1,98.4,98.6,100,99.4,96.9,null,null,null,null,null,null,null,null,null,null,null,null,null,null,null,null,null,null,null,null,null,null,null,null,null,null,null,null,null,null,null,null,null,"No","N/A","N/A","N/A","N/A","N/A","N/A","N/A","N/A","N/A","N/A","N/A","N/A","N/A","N/A","N/A","N/A","N/A","N/A"]
["Manually calculated ratios","Improved wells",{"$f":"C63/(C63+C64)*100","v":71.428571428571431},83.333333333333343,100,100,100,100,100,100,100,{"$f":"L63/(L63+L64)*100","v":100},66.666666666666671,0,100,100,100,100,100,80]
[null,"Improved springs"]
[null,"Other"]
[null,null,"NATIONAL wealth index quintile",null,null,null,null,"URBAN wealth index quintile",null,null,null,null,"RURAL wealth index quintile",null,null,null,null,"SUB-REGIONS:",null,null,null,null,null,null,null,null,null,null,null,null,null,null,null,null,null,null,null,null,null,null,null,null,null,null,null,null,null,null,null,null,null,null,"Raw numbers of respondents:","Use of drinking water sources","NATIONAL wealth index quintile",null,null,null,null,"URBAN wealth index quintile",null,null,null,null,"RURAL wealth index quintile",null,null,null,null,"SUB-REGIONS:"]
["Percentage based on weighted population",null,"Poorest","Poor","Middle","Rich","Richest","Poorest","Poor","Middle","Rich","Richest","Poorest","Poor","Middle","Rich","Richest","  KMA","  Other towns","Rural",null,null,null,null,null,null,null,null,null,null,null,null,null,null,null,null,null,null,null,null,null,null,null,null,null,null,null,null,null,null,null,null,"Water data, raw numbers (weighted)",null,"Poorest","Poor","Middle","Rich","Richest","Poorest","Poor","Middle","Rich","Richest","Poorest","Poor","Middle","Rich","Richest","  KMA","  Other towns","Rural"]
["Piped water","Yes",63.1,73.8,99.7,73.8,83.9,91,95.4,90.6,93.8,93.4,50.8,64.599999999999994,64.099999999999994,65.7,79.5,99.7,92.8,65,null,null,null,null,null,null,null,null,null,null,null,null,null,null,null,null,null,null,null,null,null,null,null,null,null,null,null,null,null,null,null,null,"Piped water","Yes","N/A","N/A","N/A","N/A","N/A","N/A","N/A","N/A","N/A","N/A","N/A","N/A","N/A","N/A","N/A","N/A","N/A","N/A"]
[null,"No",36.9,26.2,0.3,26.2,16.100000000000001,9,4.5999999999999996,9.4,6.2,6.6,49.2,35.4,35.9,34.299999999999997,20.5,0.3,7.2,35,null,null,null,null,null,null,null,null,null,null,null,null,null,null,null,null,null,null,null,null,null,null,null,null,null,null,null,null,null,null,null,null,null,"No","N/A","N/A","N/A","N/A","N/A","N/A","N/A","N/A","N/A","N/A","N/A","N/A","N/A","N/A","N/A","N/A","N/A","N/A"]
["Piped water on premises","Yes",38.5,57.3,97,67.3,81.3,69.099999999999994,81.099999999999994,89,92.9,93.4,21.7,42.9,50.5,58.6,75.099999999999994,97,85.1,49.8,null,null,null,null,null,null,null,null,null,null,null,null,null,null,null,null,null,null,null,null,null,null,null,null,null,null,null,null,null,null,null,null,"Piped water on premises","Yes","N/A","N/A","N/A","N/A","N/A","N/A","N/A","N/A","N/A","N/A","N/A","N/A","N/A","N/A","N/A","N/A","N/A","N/A"]
[null,"No",61.5,42.7,3,32.700000000000003,18.7,30.9,18.899999999999999,11,7.1,6.6,78.3,57.1,49.5,41.4,24.9,3,14.9,50.2,null,null,null,null,null,null,null,null,null,null,null,null,null,null,null,null,null,null,null,null,null,null,null,null,null,null,null,null,null,null,null,null,null,"No","N/A","N/A","N/A","N/A","N/A","N/A","N/A","N/A","N/A","N/A","N/A","N/A","N/A","N/A","N/A","N/A","N/A","N/A"]
["Piped water into dwelling","Yes","N/A","N/A","N/A","N/A","N/A","N/A","N/A","N/A","N/A","N/A","N/A","N/A","N/A","N/A","N/A","N/A","N/A","N/A",null,null,null,null,null,null,null,null,null,null,null,null,null,null,null,null,null,null,null,null,null,null,null,null,null,null,null,null,null,null,null,null,"Piped water into dwelling","Yes","N/A","N/A","N/A","N/A","N/A","N/A","N/A","N/A","N/A","N/A","N/A","N/A","N/A","N/A","N/A","N/A","N/A","N/A"]
[null,"No","N/A","N/A","N/A","N/A","N/A","N/A","N/A","N/A","N/A","N/A","N/A","N/A","N/A","N/A","N/A","N/A","N/A","N/A",null,null,null,null,null,null,null,null,null,null,null,null,null,null,null,null,null,null,null,null,null,null,null,null,null,null,null,null,null,null,null,null,null,"No","N/A","N/A","N/A","N/A","N/A","N/A","N/A","N/A","N/A","N/A","N/A","N/A","N/A","N/A","N/A","N/A","N/A","N/A"]
["Water source on premises","Yes",60.8,75,97.1,86.9,93.9,77.900000000000006,83.5,95.7,97.8,98.3,47.6,67,75.099999999999994,85.4,91.2,97.1,90.7,73.3,null,null,null,null,null,null,null,null,null,null,null,null,null,null,null,null,null,null,null,null,null,null,null,null,null,null,null,null,null,null,null,null,"Water source on premises","Yes","N/A","N/A","N/A","N/A","N/A","N/A","N/A","N/A","N/A","N/A","N/A","N/A","N/A","N/A","N/A","N/A","N/A","N/A"]
[null,"No",39.200000000000003,25,2.9,13.1,6.1,22.1,16.5,4.3,2.2000000000000002,1.7,52.4,33,24.9,14.6,8.8000000000000007,2.9,9.3000000000000007,26.7,null,null,null,null,null,null,null,null,null,null,null,null,null,null,null,null,null,null,null,null,null,null,null,null,null,null,null,null,null,null,null,null,null,"No","N/A","N/A","N/A","N/A","N/A","N/A","N/A","N/A","N/A","N/A","N/A","N/A","N/A","N/A","N/A","N/A","N/A","N/A"]
["Improved Water source on premises","Yes",59.8,74.599999999999994,97.1,86.1,93.5,77.5,83.5,95.7,97.8,97.6,46.8,65.8,74.400000000000006,84.1,90.7,97.1,90.4,72.400000000000006,null,null,null,null,null,null,null,null,null,null,null,null,null,null,null,null,null,null,null,null,null,null,null,null,null,null,null,null,null,null,null,null,"Improved water source on premises","Yes","N/A","N/A","N/A","N/A","N/A","N/A","N/A","N/A","N/A","N/A","N/A","N/A","N/A","N/A","N/A","N/A","N/A","N/A"]
[null,"No",40.200000000000003,25.4,2.9,13.9,6.5,22.5,16.5,4.3,2.2000000000000002,2.4,53.2,34.200000000000003,25.6,15.9,9.3000000000000007,2.9,9.6,27.6,null,null,null,null,null,null,null,null,null,null,null,null,null,null,null,null,null,null,null,null,null,null,null,null,null,null,null,null,null,null,null,null,null,"No","N/A","N/A","N/A","N/A","N/A","N/A","N/A","N/A","N/A","N/A","N/A","N/A","N/A","N/A","N/A","N/A","N/A","N/A"]
["Piped water on premises available when needed","Yes","N/A","N/A","N/A","N/A","N/A","N/A","N/A","N/A","N/A","N/A","N/A","N/A","N/A","N/A","N/A","N/A","N/A","N/A",null,null,null,null,null,null,null,null,null,null,null,null,null,null,null,null,null,null,null,null,null,null,null,null,null,null,null,null,null,null,null,null,"Piped water on premises available when needed","Yes","N/A","N/A","N/A","N/A","N/A","N/A","N/A","N/A","N/A","N/A","N/A","N/A","N/A","N/A","N/A","N/A","N/A","N/A"]
[null,"No","N/A","N/A","N/A","N/A","N/A","N/A","N/A","N/A","N/A","N/A","N/A","N/A","N/A","N/A","N/A","N/A","N/A","N/A",null,null,null,null,null,null,null,null,null,null,null,null,null,null,null,null,null,null,null,null,null,null,null,null,null,null,null,null,null,null,null,null,null,"No","N/A","N/A","N/A","N/A","N/A","N/A","N/A","N/A","N/A","N/A","N/A","N/A","N/A","N/A","N/A","N/A","N/A","N/A"]
["Water point at more than 30 minutes","Yes",4.8,3.5,0,1.9,1.2,1,0.2,0.9,1,0,7.5,2.7,5.7,1.9,1.6,0,0.6,3.8,null,null,null,null,null,null,null,null,null,null,null,null,null,null,null,null,null,null,null,null,null,null,null,null,null,null,null,null,null,null,null,null,"Water point at more than 30 minutes","Yes","N/A","N/A","N/A","N/A","N/A","N/A","N/A","N/A","N/A","N/A","N/A","N/A","N/A","N/A","N/A","N/A","N/A","N/A"]
[null,"No",95.2,96.5,100,98.1,98.8,99,99.8,99.1,99,100,92.5,97.3,94.3,98.1,98.4,100,99.4,96.2,null,null,null,null,null,null,null,null,null,null,null,null,null,null,null,null,null,null,null,null,null,null,null,null,null,null,null,null,null,null,null,null,null,"No","N/A","N/A","N/A","N/A","N/A","N/A","N/A","N/A","N/A","N/A","N/A","N/A","N/A","N/A","N/A","N/A","N/A","N/A"]
["Water source available when needed","Yes","N/A","N/A","N/A","N/A","N/A","N/A","N/A","N/A","N/A","N/A","N/A","N/A","N/A","N/A","N/A","N/A","N/A","N/A",null,null,null,null,null,null,null,null,null,null,null,null,null,null,null,null,null,null,null,null,null,null,null,null,null,null,null,null,null,null,null,null,"Water source available when needed","Yes","N/A","N/A","N/A","N/A","N/A","N/A","N/A","N/A","N/A","N/A","N/A","N/A","N/A","N/A","N/A","N/A","N/A","N/A"]
[null,"No","N/A","N/A","N/A","N/A","N/A","N/A","N/A","N/A","N/A","N/A","N/A","N/A","N/A","N/A","N/A","N/A","N/A","N/A",null,null,null,null,null,null,null,null,null,null,null,null,null,null,null,null,null,null,null,null,null,null,null,null,null,null,null,null,null,null,null,null,null,"No","N/A","N/A","N/A","N/A","N/A","N/A","N/A","N/A","N/A","N/A","N/A","N/A","N/A","N/A","N/A","N/A","N/A","N/A"]
["Improved water source available when needed","Yes","N/A","N/A","N/A","N/A","N/A","N/A","N/A","N/A","N/A","N/A","N/A","N/A","N/A","N/A","N/A","N/A","N/A","N/A",null,null,null,null,null,null,null,null,null,null,null,null,null,null,null,null,null,null,null,null,null,null,null,null,null,null,null,null,null,null,null,null,"Improved water source available when needed","Yes","N/A","N/A","N/A","N/A","N/A","N/A","N/A","N/A","N/A","N/A","N/A","N/A","N/A","N/A","N/A","N/A","N/A","N/A"]
[null,"No","N/A","N/A","N/A","N/A","N/A","N/A","N/A","N/A","N/A","N/A","N/A","N/A","N/A","N/A","N/A","N/A","N/A","N/A",null,null,null,null,null,null,null,null,null,null,null,null,null,null,null,null,null,null,null,null,null,null,null,null,null,null,null,null,null,null,null,null,null,"No","N/A","N/A","N/A","N/A","N/A","N/A","N/A","N/A","N/A","N/A","N/A","N/A","N/A","N/A","N/A","N/A","N/A","N/A"]
["Microbiological quality at point of collection","Not contaminated (No E. coli in 100 mL)","N/A","N/A","N/A","N/A","N/A","N/A","N/A","N/A","N/A","N/A","N/A","N/A","N/A","N/A","N/A","N/A","N/A","N/A",null,null,null,null,null,null,null,null,null,null,null,null,null,null,null,null,null,null,null,null,null,null,null,null,null,null,null,null,null,null,null,null,"Microbiological quality at point of collection","Not contaminated (No E. coli in 100 mL)","N/A","N/A","N/A","N/A","N/A","N/A","N/A","N/A","N/A","N/A","N/A","N/A","N/A","N/A","N/A","N/A","N/A","N/A"]
[null,"Contaminated (E. coli detected in 100 mL)","N/A","N/A","N/A","N/A","N/A","N/A","N/A","N/A","N/A","N/A","N/A","N/A","N/A","N/A","N/A","N/A","N/A","N/A",null,null,null,null,null,null,null,null,null,null,null,null,null,null,null,null,null,null,null,null,null,null,null,null,null,null,null,null,null,null,null,null,null,"Contaminated (E. coli detected in 100 mL)","N/A","N/A","N/A","N/A","N/A","N/A","N/A","N/A","N/A","N/A","N/A","N/A","N/A","N/A","N/A","N/A","N/A","N/A"]
[null,"Highly contaminated (>100 CFU/100 mL)","N/A","N/A","N/A","N/A","N/A","N/A","N/A","N/A","N/A","N/A","N/A","N/A","N/A","N/A","N/A","N/A","N/A","N/A",null,null,null,null,null,null,null,null,null,null,null,null,null,null,null,null,null,null,null,null,null,null,null,null,null,null,null,null,null,null,null,null,null,"Highly contaminated (>100 CFU/100 mL)","N/A","N/A","N/A","N/A","N/A","N/A","N/A","N/A","N/A","N/A","N/A","N/A","N/A","N/A","N/A","N/A","N/A","N/A"]
["Microbiological quality of improved water sources at point of collection","Not contaminated (No E. coli in 100 mL)","N/A","N/A","N/A","N/A","N/A","N/A","N/A","N/A","N/A","N/A","N/A","N/A","N/A","N/A","N/A","N/A","N/A","N/A",null,null,null,null,null,null,null,null,null,null,null,null,null,null,null,null,null,null,null,null,null,null,null,null,null,null,null,null,null,null,null,null,"Microbiological quality of improved water sources at point of collection","Not contaminated (No E. coli in 100 mL)","N/A","N/A","N/A","N/A","N/A","N/A","N/A","N/A","N/A","N/A","N/A","N/A","N/A","N/A","N/A","N/A","N/A","N/A"]
[null,"Contaminated (E. coli detected in 100 mL)","N/A","N/A","N/A","N/A","N/A","N/A","N/A","N/A","N/A","N/A","N/A","N/A","N/A","N/A","N/A","N/A","N/A","N/A",null,null,null,null,null,null,null,null,null,null,null,null,null,null,null,null,null,null,null,null,null,null,null,null,null,null,null,null,null,null,null,null,null,"Contaminated (E. coli detected in 100 mL)","N/A","N/A","N/A","N/A","N/A","N/A","N/A","N/A","N/A","N/A","N/A","N/A","N/A","N/A","N/A","N/A","N/A","N/A"]
[null,"Highly contaminated (>100 CFU/100 mL)","N/A","N/A","N/A","N/A","N/A","N/A","N/A","N/A","N/A","N/A","N/A","N/A","N/A","N/A","N/A","N/A","N/A","N/A",null,null,null,null,null,null,null,null,null,null,null,null,null,null,null,null,null,null,null,null,null,null,null,null,null,null,null,null,null,null,null,null,null,"Highly contaminated (>100 CFU/100 mL)","N/A","N/A","N/A","N/A","N/A","N/A","N/A","N/A","N/A","N/A","N/A","N/A","N/A","N/A","N/A","N/A","N/A","N/A"]
["Microbiological quality of piped on premises at point of collection","Not contaminated (No E. coli in 100 mL)","N/A","N/A","N/A","N/A","N/A","N/A","N/A","N/A","N/A","N/A","N/A","N/A","N/A","N/A","N/A","N/A","N/A","N/A",null,null,null,null,null,null,null,null,null,null,null,null,null,null,null,null,null,null,null,null,null,null,null,null,null,null,null,null,null,null,null,null,"Microbiological quality of piped on premises at point of collection","Not contaminated (No E. coli in 100 mL)","N/A","N/A","N/A","N/A","N/A","N/A","N/A","N/A","N/A","N/A","N/A","N/A","N/A","N/A","N/A","N/A","N/A","N/A"]
[null,"Contaminated (E. coli detected in 100 mL)","N/A","N/A","N/A","N/A","N/A","N/A","N/A","N/A","N/A","N/A","N/A","N/A","N/A","N/A","N/A","N/A","N/A","N/A",null,null,null,null,null,null,null,null,null,null,null,null,null,null,null,null,null,null,null,null,null,null,null,null,null,null,null,null,null,null,null,null,null,"Contaminated (E. coli detected in 100 mL)","N/A","N/A","N/A","N/A","N/A","N/A","N/A","N/A","N/A","N/A","N/A","N/A","N/A","N/A","N/A","N/A","N/A","N/A"]
[null,"Highly contaminated (>100 CFU/100 mL)","N/A","N/A","N/A","N/A","N/A","N/A","N/A","N/A","N/A","N/A","N/A","N/A","N/A","N/A","N/A","N/A","N/A","N/A",null,null,null,null,null,null,null,null,null,null,null,null,null,null,null,null,null,null,null,null,null,null,null,null,null,null,null,null,null,null,null,null,null,"Highly contaminated (>100 CFU/100 mL)","N/A","N/A","N/A","N/A","N/A","N/A","N/A","N/A","N/A","N/A","N/A","N/A","N/A","N/A","N/A","N/A","N/A","N/A"]
[null,null,"NATIONAL wealth index quintile",null,null,null,null,"URBAN wealth index quintile",null,null,null,null,"RURAL wealth index quintile",null,null,null,null,"SUB-REGIONS:",null,null,null,null,null,null,null,null,null,null,null,null,null,null,null,null,null,null,null,null,null,null,null,null,null,null,null,null,null,null,null,null,null,null,"Raw numbers of respondents:","Use of drinking water sources","NATIONAL wealth index quintile",null,null,null,null,"URBAN wealth index quintile",null,null,null,null,"RURAL wealth index quintile",null,null,null,null,"SUB-REGIONS:"]
["Percentage based on weighted population",null,"Poorest","Poor","Middle","Rich","Richest","Poorest","Poor","Middle","Rich","Richest","Poorest","Poor","Middle","Rich","Richest","  KMA","  Other towns","Rural",null,null,null,null,null,null,null,null,null,null,null,null,null,null,null,null,null,null,null,null,null,null,null,null,null,null,null,null,null,null,null,null,"Water data, raw numbers (weighted)",null,"Poorest","Poor","Middle","Rich","Richest","Poorest","Poor","Middle","Rich","Richest","Poorest","Poor","Middle","Rich","Richest","  KMA","  Other towns","Rural"]
["Main source of drinking water","Piped into dwelling",14,30.9,70.900000000000006,52,67.599999999999994,21.7,44.3,67.8,81.599999999999994,78.099999999999994,7.1,18.899999999999999,30.1,46.4,61.6,70.900000000000006,58.7,32.799999999999997]
[null,"Piped into compound, yard or plot",24.4,26.2,17.7,14.4,7.1,47.3,36.1,19.8,4.5,1.6,14.4,23.9,20.100000000000001,11.1,9,17.7,21.8,15.7]
[null,"Piped to neighbour",7.8,4.5999999999999996,1.4,1.4,0.3,9,4.9000000000000004,1,0.5,0,9,6.2,2.9,1.1000000000000001,0.4,1.4,3.1,3.9]
[null,"Public tap / standpipe",16.8,10.9,1.2,5,2.2999999999999998,12.7,8.6999999999999993,0.7,0.4,0,20,15.5,9.6,5.7,4,1.2,4.5,11]
[null,"Tube well, Borehole",0,0,0,0,0,0,0,0,0,0,0.1,0,0,0,0,0,0,0]
[null,"Protected well",0.5,0.5,0.1,0.7,0.3,0.8,1,0,0,0.6,0.6,0,0.4,0.9,0.2,0.1,0.5,0.4]
[null,"Unprotected well",0.2,0.1,0,0,0,0,0,0,0,0,0.3,0.1,0,0,0,0,0,0.1]
[null,"Protected spring",3.3,1.6,0,0.9,0.7,0,0.2,0,0,0,5.0999999999999996,3.6,1,2.1,0.7,0,0,2.5]
[null,"Unprotected spring",3.4,1.5,0,2.2000000000000002,0.3,0.8,0,0,0,0,6.6,1,3.7,1.4,0.3,0,0.2,2.6]
[null,"Rainwater collection",21.5,15.6,0,16.2,10.1,6.4,2,6.6,4.5,3.1,25.8,23.2,21.2,22.6,11.9,0,4.5,20.9]
[null,"Tanker-truck",1.5,1.9,0,4.3,1.6,0.5,0.5,2.2999999999999998,1.1000000000000001,0.3,1.8,1.4,3.4,4.2,2.7,0,0.9,2.7]
[null,"Cart with small tank / drum",1.7,2.5,0,0.4,0.2,0,0.3,0,0,0,2.2999999999999998,1.9,3.3,0.6,0.2,0,0.1,1.7]
[null,"Surface water (river, stream, dam, lake, pond, canal, irrigation channel)",2.4,0.5,0,0.3,0.2,0,0,0,0,0,3.9,1.3,0.8,0.5,0.2,0,0,1.4]
[null,"Bottled water",0.5,1.5,8.5,1.5,8.8000000000000007,0.3,1.8,1.9,7.6,15.6,0.9,0.3,1.5,2.2999999999999998,7.8,8.5,5.4,2.6]
[null,"Other",2,1.7,0.1,0.8,0.5,0.2,0.3,0,0,0.7,2,2.4,2.2000000000000002,1.1000000000000001,0.8,0.1,0.2,1.7]
[null,"Missing",0.1,0.1,0,0,0,0.2,0,0,0,0,0,0.1,0,0,0,0,0,0]
[]
[]
[]
[]
[]
[]
[]
[]
[]
[]
[]
[]
[]
[]
[]
[]
[]
[]
[]
[]
[]
[]
[]
[]
[]
[]
[]
[]
[]
[]
[]
[]
[]
[]
[{"$f":"A1026","v":"Jamaica"}]
[{"$f":"A1034","v":2011}]
["Use of sanitation facilities"]
[" by wealth quintile and sub-national region"]
["Notes:"]
["WHO/UNICEF JMP customised wealth index excludes water,"]
[" sanitation and hygiene assets."]
["Survey used for analysis:",{"$f":"A1025","v":"MICS11"}]
[{"$f":"B1030","v":""}]
[{"$f":"B1029","v":""}]
[]
[]
["Use of sanitation facilities",null,"NATIONAL wealth index quintile",null,null,null,null,"URBAN wealth index quintile",null,null,null,null,"RURAL wealth index quintile",null,null,null,null,"SUB-REGIONS:",null,null,null,null,null,null,null,null,null,null,null,null,null,null,null,null,null,null,null,null,null,null,null,null,null,null,null,null,null,null,null,null,null,null,"Raw numbers of respondents:","Use of sanitation facilities","NATIONAL wealth index quintile",null,null,null,null,"URBAN wealth index quintile",null,null,null,null,"RURAL wealth index quintile",null,null,null,null,"SUB-REGIONS:"]
["Weighted percentage (used in graphs)",null,"Poorest","Poor","Middle","Rich","Richest","Poorest","Poor","Middle","Rich","Richest","Poorest","Poor","Middle","Rich","Richest","  KMA","  Other towns","Rural",null,null,null,null,null,null,null,null,null,null,null,null,null,null,null,null,null,null,null,null,null,null,null,null,null,null,null,null,null,null,null,null,"Sanitation data, raw numbers (weighted)",null,"Poorest","Poor","Middle","Rich","Richest","Poorest","Poor","Middle","Rich","Richest","Poorest","Poor","Middle","Rich","Richest","  KMA","  Other towns","Rural"]
["Sanitation","Improved",97.126589386503468,98.701164653615791,99.338241192330742,99.646660872775001,99.699865579320019,96.393922780107857,98.134838373029567,99.665800157542208,100,100,96.543352655816562,98.559061763427934,99.089581637490724,99.442965156007048,99.566436625103123,99.338241192330742,98.840227953534651,98.640349843805126,null,null,null,null,null,null,null,null,null,null,null,null,null,null,null,null,null,null,null,null,null,null,null,null,null,null,null,null,null,null,null,null,"Sanitation","Improved",3680.3287632351467,2493.3035689941889,6474.0962106225616,2316.0905658718357,3778.3242397208292,744.19692313213068,754.90156937684753,775.38822540550234,769.92919558307415,772.59247448044982,1654.1912831644422,1689.2847992546035,1695.4297873195576,1706.9640793588524,1705.168800746548,6474.0962106225616,3817.0083879780013,8451.0387498440032]
[null,"Not Improved",2.8734106134965196,1.2988353463842648,0.66175880766921646,0.35333912722500566,0.30013442067996216,3.6060772198921405,1.8651616269704487,0.33419984245779133,0,0,3.4566473441834265,1.4409382365720578,0.9104183625092912,0.5570348439929651,0.43356337489688257,0.66175880766921646,1.1597720464653438,1.3596501561948386,null,null,null,null,null,null,null,null,null,null,null,null,null,null,null,null,null,null,null,null,null,null,null,null,null,null,null,null,null,null,null,null,null,"Not Improved",108.87951277022692,32.810056659823381,43.128307262683251,8.212672777506123,11.374189425836974,27.840256877422167,14.347742990000489,2.6000355424280941,0,0,59.226821406406245,24.697425240802634,15.577322915418812,9.5616463985719804,7.425180262343023,43.128307262683251,44.788035409850742,116.48839622354264]
["Sanitation ladder","Basic",{"$f":"C122*C129/100","v":75.763295151904444},{"$f":"D122*D129/100","v":82.92233013434074},{"$f":"E122*E129/100","v":83.900196494571134},94.531034180121935,98.879074589748413,65.90919171775559,82.185623166426737,92.378596979280559,99.269221386677557,99.772656178099169,75.067700790605542,80.092895670575274,88.051343053868166,96.773644165362199,98.584222040668024,83.900196494571134,87.914409161650696,87.706635829259596,null,null,null,null,null,null,null,null,null,null,null,null,null,null,null,null,null,null,null,null,null,null,null,null,null,null,null,null,null,null,null,null,"Sanitation ladder","Basic",2870.2953173173696,2091.7011807971103,5466.3006053306999,2197.1878889772902,3739.1574157314685,508.84346510485,629.21077077894915,718.69464012720221,764.3027176840277,770.8360332212477,1286.2235760313094,1372.2219618700697,1506.5647403090752,1661.1444978513907,1680.2993998451229,5466.3006053306999,3391.887626916272,7506.4541759069671]
[null,"Limited",{"$f":"C122*C128/100","v":21.363294234599081},{"$f":"D122*D128/100","v":15.778834519274989},{"$f":"E122*E128/100","v":15.438044697759683},5.1156266926531124,0.82079098957158725,30.484731062352267,15.949215206602801,7.287203178261632,0.73077861332239924,0.22734382190085115,21.475651865210924,18.466166092852664,11.038238583622569,2.6693209906448647,0.98221458443508203,15.438044697759683,10.925818791883893,10.93371401454551,null,null,null,null,null,null,null,null,null,null,null,null,null,null,null,null,null,null,null,null,null,null,null,null,null,null,null,null,null,null,null,null,null,"Limited",809.34921430092436,398.01832319593075,1005.8259289291016,118.90267689454649,31.038586557932508,235.35345802728065,122.10673359675155,56.693585278299985,5.626477899046292,1.7564412592022127,367.96770713313117,316.3786057676798,188.8650470104827,45.819581507462019,16.741163469997915,1005.8259289291016,421.5366960605806,935.7721048887538]
[null,"Unimproved",{"$f":"100-C124-C125-C127","v":1.8801943328279789},{"$f":"100-D124-D125-D127","v":1.127985767810864},{"$f":"100-E124-E125-E127","v":0.52297494286649926},0.35333912722495242,0.30013442067999985,2.5581760414236872,1.8651616269704618,0.3341998424578092,4.3298697960381105E-14,-1.9900747716405931E-14,1.9336271631232211,1.2400188755428752,0.65853564980837132,0.55703484399293579,0.43356337489689389,0.52297494286649926,0.95008460689384722,0.96417275918548973,null,null,null,null,null,null,null,null,null,null,null,null,null,null,null,null,null,null,null,null,null,null,null,null,null,null,null,null,null,null,null,null,null,"Unimproved",71.251275164319608,28.500325536058348,34.086184791874338,8.212672777506123,11.374189425836974,19.750070169887426,14.347742990000489,2.6000355424280941,0,0,33.131117887851126,21.25507786098516,11.267591791653782,9.5616463985719804,7.425180262343023,34.086184791874338,36.697848702316001,82.640614201405057]
[null,"Open defecation",0.99321628066849599,0.17084957857340693,0.13878386480268454,0,0,1.0479011784684558,0,0,0,0,1.5230201810603123,0.20091936102918728,0.25188271270089391,0,0,0.13878386480268454,0.20968743957156408,0.39547739700940399,null,null,null,null,null,null,null,null,null,null,null,null,null,null,null,null,null,null,null,null,null,null,null,null,null,null,null,null,null,null,null,null,null,"Open defecation",37.62823760590733,4.3097311237650322,9.0421224708089198,0,0,8.0901867075347393,0,0,0,0,26.095703518555112,3.4423473798174773,4.3097311237650322,0,0,9.0421224708089198,8.0901867075347393,33.847782022137622]
["Shared among Improved Sanitation","Yes",21.995309800889274,15.986472474412643,15.540887892176164,5.1337662976831169,0.82326188185136095,31.625158706211703,16.25234776051369,7.3116386631549792,0.73077861332239924,0.22734382190085115,22.2445681390132,18.736142331769699,11.139656057894014,2.6842733283920173,0.98649165092992963,15.540887892176164,11.054020228504717,11.084423394542711,null,null,null,null,null,null,null,null,null,null,null,null,null,null,null,null,null,null,null,null,null,null,null,null,null,null,null,null,null,null,null,null,"Shared among improved sanitation facilities","Yes","N/A","N/A","N/A","N/A","N/A","N/A","N/A","N/A","N/A","N/A","N/A","N/A","N/A","N/A","N/A","N/A","N/A","N/A"]
[null,"No",78.004690199110783,84.013527525587293,84.459112107823913,94.866233702316933,99.17673811814862,68.374841293788293,83.747652239486285,92.688361336845006,99.269221386677572,99.772656178099169,77.755431860986704,81.263857668230315,88.860343942105999,97.315726671608004,99.013508349070065,84.459112107823913,88.945979771495217,88.915576605457275,null,null,null,null,null,null,null,null,null,null,null,null,null,null,null,null,null,null,null,null,null,null,null,null,null,null,null,null,null,null,null,null,null,"No","N/A","N/A","N/A","N/A","N/A","N/A","N/A","N/A","N/A","N/A","N/A","N/A","N/A","N/A","N/A","N/A","N/A","N/A"]
["Manually calculated ratios","Improved latrines",{"$f":"C159/(C159+C160)*100","v":98.532246238563459},{"$f":"D159/(D159+D160)*100","v":97.835934409545061},99.105314150812518,100,100,97.739029951870933,95.5076183274371,100,100,100,98.253494021591635,99.296133106847662,98.85962026461911,100,100,99.105314150812518,97.191895384656377,98.810665171318419]
[null,"Other"]
[null,"Other"]
[null,null,"NATIONAL wealth index quintile",null,null,null,null,"URBAN wealth index quintile",null,null,null,null,"RURAL wealth index quintile",null,null,null,null,"SUB-REGIONS:",null,null,null,null,null,null,null,null,null,null,null,null,null,null,null,null,null,null,null,null,null,null,null,null,null,null,null,null,null,null,null,null,null,null,"Raw numbers of respondents:","Use of sanitation facilities","NATIONAL wealth index quintile",null,null,null,null,"URBAN wealth index quintile",null,null,null,null,"RURAL wealth index quintile",null,null,null,null,"SUB-REGIONS:"]
["Percentage based on weighted population",null,"Poorest","Poor","Middle","Rich","Richest","Poorest","Poor","Middle","Rich","Richest","Poorest","Poor","Middle","Rich","Richest","  KMA","  Other towns","Rural",null,null,null,null,null,null,null,null,null,null,null,null,null,null,null,null,null,null,null,null,null,null,null,null,null,null,null,null,null,null,null,null,"Sanitation data, raw numbers (weighted)",null,"Poorest","Poor","Middle","Rich","Richest","Poorest","Poor","Middle","Rich","Richest","Poorest","Poor","Middle","Rich","Richest","  KMA","  Other towns","Rural"]
["Sanitation type","Sewer connection",2.7329840003225492,6.0756862103928677,46.191594784351622,10.280295809229303,18.170021386166514,3.6442289225103099,7.6300893464376918,13.131073135142273,17.657221328571421,30.393641265892736,1.3588733657250422,3.7091715351060754,7.2124725884918428,9.654834950134477,14.529163652870999,46.191594784351622,14.494666354058896,7.2928505404548956,null,null,null,null,null,null,null,null,null,null,null,null,null,null,null,null,null,null,null,null,null,null,null,null,null,null,null,null,null,null,null,null,"Sanitation type","Sewer connection","N/A","N/A","N/A","N/A","N/A","N/A","N/A","N/A","N/A","N/A","N/A","N/A","N/A","N/A","N/A","N/A","N/A","N/A"]
[null,"Septic tank connection",11.679116914740122,24.136293563836951,31.791814126116314,31.021166583777536,34.874953897209046,20.483987448830327,22.953288090005284,40.269376824656597,37.505443027066917,38.283471297097464,7.7915515997478817,12.682317090702849,26.590826895940367,29.202793937256981,32.423055132078076,31.791814126116314,31.916327873965667,21.737826850827112,null,null,null,null,null,null,null,null,null,null,null,null,null,null,null,null,null,null,null,null,null,null,null,null,null,null,null,null,null,null,null,null,null,"Septic tank connection","N/A","N/A","N/A","N/A","N/A","N/A","N/A","N/A","N/A","N/A","N/A","N/A","N/A","N/A","N/A","N/A","N/A","N/A"]
[null,"Improved latrines",82.714488471440788,68.489184879385974,21.354832281862709,58.345198479768221,46.654890295944398,72.265706408767159,67.551460936586551,46.265350197743324,44.837335644361623,31.322887437009751,87.392927690343527,82.16757313761903,65.286282153058565,60.585336268615563,52.614217840154076,21.354832281862709,52.42923372551013,69.6096724525231,null,null,null,null,null,null,null,null,null,null,null,null,null,null,null,null,null,null,null,null,null,null,null,null,null,null,null,null,null,null,null,null,null,"Improved latrines","N/A","N/A","N/A","N/A","N/A","N/A","N/A","N/A","N/A","N/A","N/A","N/A","N/A","N/A","N/A","N/A","N/A","N/A"]
[null,"Unimproved facilities",1.8803736816344521,1.128228170206699,0.52301688699432514,0.35333912722500566,0.30013442067996216,2.5581760414236845,1.8651616269704487,0.33419984245779133,0,0,1.9336271631231134,1.2400990837138131,0.65853564980839741,0.5570348439929651,0.43356337489688257,0.52301688699432514,0.95027921410010385,0.96457954311048411,null,null,null,null,null,null,null,null,null,null,null,null,null,null,null,null,null,null,null,null,null,null,null,null,null,null,null,null,null,null,null,null,null,"Unimproved facilities","N/A","N/A","N/A","N/A","N/A","N/A","N/A","N/A","N/A","N/A","N/A","N/A","N/A","N/A","N/A","N/A","N/A","N/A"]
[null,"Open defecation",0.99303693186206798,0.17060717617756574,0.13874192067489136,0,0,1.0479011784684558,0,0,0,0,1.5230201810603123,0.20083915285824505,0.25188271270089391,0,0,0.13874192067489136,0.2094928323652398,0.3950706130843552,null,null,null,null,null,null,null,null,null,null,null,null,null,null,null,null,null,null,null,null,null,null,null,null,null,null,null,null,null,null,null,null,null,"Open defecation","N/A","N/A","N/A","N/A","N/A","N/A","N/A","N/A","N/A","N/A","N/A","N/A","N/A","N/A","N/A","N/A","N/A","N/A"]
["Septic tank emptying practices","Not emptied/treated and disposed in situ","N/A","N/A","N/A","N/A","N/A","N/A","N/A","N/A","N/A","N/A","N/A","N/A","N/A","N/A","N/A","N/A","N/A","N/A",null,null,null,null,null,null,null,null,null,null,null,null,null,null,null,null,null,null,null,null,null,null,null,null,null,null,null,null,null,null,null,null,"Septic tank emptying practices","Not emptied/treated and disposed in situ","N/A","N/A","N/A","N/A","N/A","N/A","N/A","N/A","N/A","N/A","N/A","N/A","N/A","N/A","N/A","N/A","N/A","N/A"]
[null,"Emptied and buried on site","N/A","N/A","N/A","N/A","N/A","N/A","N/A","N/A","N/A","N/A","N/A","N/A","N/A","N/A","N/A","N/A","N/A","N/A",null,null,null,null,null,null,null,null,null,null,null,null,null,null,null,null,null,null,null,null,null,null,null,null,null,null,null,null,null,null,null,null,null,"Emptied and buried on site","N/A","N/A","N/A","N/A","N/A","N/A","N/A","N/A","N/A","N/A","N/A","N/A","N/A","N/A","N/A","N/A","N/A","N/A"]
[null,"Emptied and discharged locally","N/A","N/A","N/A","N/A","N/A","N/A","N/A","N/A","N/A","N/A","N/A","N/A","N/A","N/A","N/A","N/A","N/A","N/A",null,null,null,null,null,null,null,null,null,null,null,null,null,null,null,null,null,null,null,null,null,null,null,null,null,null,null,null,null,null,null,null,null,"Emptied and discharged locally","N/A","N/A","N/A","N/A","N/A","N/A","N/A","N/A","N/A","N/A","N/A","N/A","N/A","N/A","N/A","N/A","N/A","N/A"]
[null,"Emptied and removed offsite","N/A","N/A","N/A","N/A","N/A","N/A","N/A","N/A","N/A","N/A","N/A","N/A","N/A","N/A","N/A","N/A","N/A","N/A",null,null,null,null,null,null,null,null,null,null,null,null,null,null,null,null,null,null,null,null,null,null,null,null,null,null,null,null,null,null,null,null,null,"Emptied and removed offsite","N/A","N/A","N/A","N/A","N/A","N/A","N/A","N/A","N/A","N/A","N/A","N/A","N/A","N/A","N/A","N/A","N/A","N/A"]
["Latrine emptying practices","Not emptied/treated and disposed in situ","N/A","N/A","N/A","N/A","N/A","N/A","N/A","N/A","N/A","N/A","N/A","N/A","N/A","N/A","N/A","N/A","N/A","N/A",null,null,null,null,null,null,null,null,null,null,null,null,null,null,null,null,null,null,null,null,null,null,null,null,null,null,null,null,null,null,null,null,"Latrine emptying practices","Not emptied/treated and disposed in situ","N/A","N/A","N/A","N/A","N/A","N/A","N/A","N/A","N/A","N/A","N/A","N/A","N/A","N/A","N/A","N/A","N/A","N/A"]
[null,"Emptied and buried on site","N/A","N/A","N/A","N/A","N/A","N/A","N/A","N/A","N/A","N/A","N/A","N/A","N/A","N/A","N/A","N/A","N/A","N/A",null,null,null,null,null,null,null,null,null,null,null,null,null,null,null,null,null,null,null,null,null,null,null,null,null,null,null,null,null,null,null,null,null,"Emptied and buried on site","N/A","N/A","N/A","N/A","N/A","N/A","N/A","N/A","N/A","N/A","N/A","N/A","N/A","N/A","N/A","N/A","N/A","N/A"]
[null,"Emptied and discharged locally","N/A","N/A","N/A","N/A","N/A","N/A","N/A","N/A","N/A","N/A","N/A","N/A","N/A","N/A","N/A","N/A","N/A","N/A",null,null,null,null,null,null,null,null,null,null,null,null,null,null,null,null,null,null,null,null,null,null,null,null,null,null,null,null,null,null,null,null,null,"Emptied and discharged locally","N/A","N/A","N/A","N/A","N/A","N/A","N/A","N/A","N/A","N/A","N/A","N/A","N/A","N/A","N/A","N/A","N/A","N/A"]
[null,"Emptied and removed offsite","N/A","N/A","N/A","N/A","N/A","N/A","N/A","N/A","N/A","N/A","N/A","N/A","N/A","N/A","N/A","N/A","N/A","N/A",null,null,null,null,null,null,null,null,null,null,null,null,null,null,null,null,null,null,null,null,null,null,null,null,null,null,null,null,null,null,null,null,null,"Emptied and removed offsite","N/A","N/A","N/A","N/A","N/A","N/A","N/A","N/A","N/A","N/A","N/A","N/A","N/A","N/A","N/A","N/A","N/A","N/A"]
["Shared among improved sanitation facilities","Yes",21.359322458625826,15.756152817270197,15.433347833403763,5.1156266926531124,0.81902523744934297,30.484731062352267,15.873492719941487,7.2872031782616311,0.73077861332239924,0.22734382190085115,21.475651865210928,18.458686516473133,11.03823858362257,2.6693209906448643,0.97753254160893843,15.433347833403763,10.915559751095776,10.922312692271637,null,null,null,null,null,null,null,null,null,null,null,null,null,null,null,null,null,null,null,null,null,null,null,null,null,null,null,null,null,null,null,null,"Shared among improved sanitation facilities","Yes","N/A","N/A","N/A","N/A","N/A","N/A","N/A","N/A","N/A","N/A","N/A","N/A","N/A","N/A","N/A","N/A","N/A","N/A"]
[null,"No",75.749209551058698,82.803131242980768,83.874670733369825,94.531034180121935,98.666357907888241,65.909191717755576,81.795428434375296,92.378596979280545,99.269221386677572,99.772656178099169,75.067700790605542,80.060454668603683,88.051343053868166,96.773644165362199,98.114288528286011,83.874670733369825,87.83185996999444,87.615178194706871,null,null,null,null,null,null,null,null,null,null,null,null,null,null,null,null,null,null,null,null,null,null,null,null,null,null,null,null,null,null,null,null,null,"No","N/A","N/A","N/A","N/A","N/A","N/A","N/A","N/A","N/A","N/A","N/A","N/A","N/A","N/A","N/A","N/A","N/A","N/A"]
[null,"DK/missing",2.8914679903155021,1.4407159397490517,0.69198143322644434,0.35333912722500566,0.51461685466238249,3.6060772198921405,2.3310788456832077,0.33419984245779133,0,0,3.4566473441834265,1.4808588149232003,0.9104183625092912,0.5570348439929651,0.90817893010506823,0.69198143322644434,1.252580278909726,1.4625091130214483,null,null,null,null,null,null,null,null,null,null,null,null,null,null,null,null,null,null,null,null,null,null,null,null,null,null,null,null,null,null,null,null,null,"DK/missing","N/A","N/A","N/A","N/A","N/A","N/A","N/A","N/A","N/A","N/A","N/A","N/A","N/A","N/A","N/A","N/A","N/A","N/A"]
["Shared among all sanitation facilities","Yes",22.313432342707422,16.139573823481928,15.48505334707759,5.1156266926531124,0.81902523744934297,33.014694815624075,16.667134936147352,7.2872031782616311,0.73077861332239924,0.22734382190085115,22.044698400710519,19.067776357891393,11.066112207240693,2.6693209906448643,0.97753254160893843,15.48505334707759,11.534431179134721,11.127121187950987,null,null,null,null,null,null,null,null,null,null,null,null,null,null,null,null,null,null,null,null,null,null,null,null,null,null,null,null,null,null,null,null,"Shared among all sanitation facilities","Yes","N/A","N/A","N/A","N/A","N/A","N/A","N/A","N/A","N/A","N/A","N/A","N/A","N/A","N/A","N/A","N/A","N/A","N/A"]
[null,"No",77.482875462026755,83.718303111004502,84.484682037656711,94.884373307346948,98.966492328568208,66.736205159143836,82.866947845139876,92.712796821738351,99.269221386677572,99.772656178099169,77.655746993465897,80.892222726256918,88.933887792759322,97.330679009355165,98.54785190318286,84.484682037656711,88.323184922943923,88.710382420701535,null,null,null,null,null,null,null,null,null,null,null,null,null,null,null,null,null,null,null,null,null,null,null,null,null,null,null,null,null,null,null,null,null,"No","N/A","N/A","N/A","N/A","N/A","N/A","N/A","N/A","N/A","N/A","N/A","N/A","N/A","N/A","N/A","N/A","N/A","N/A"]
["Type of toilet facility","Flush to piped sewer system",2.7329840003225492,6.0756862103928677,46.191594784351622,10.280295809229303,18.170021386166514,3.6442289225103099,7.6300893464376918,13.131073135142273,17.657221328571421,30.393641265892736,1.3588733657250422,3.7091715351060754,7.2124725884918428,9.654834950134477,14.529163652870999,46.191594784351622,14.494666354058896,7.2928505404548956,null,null,null,null,null,null,null,null,null,null,null,null,null,null,null,null,null,null,null,null,null,null,null,null,null,null,null,null,null,null,null,null,"Type of toilet facility","Flush to piped sewer system",103.55845592212476,153.47873721271603,3010.4099404879671,238.94524843664919,688.58901504716584,28.134802206441112,58.694409830448066,102.15820752789426,135.94810213739294,234.8189851408718,23.283182266524118,63.574540787761521,123.40591881284406,165.72772569847726,248.82558221000028,3010.4099404879671,559.75450684304883,624.8169497756071]
[null,"Flush to septic tank",11.679116914740122,24.136293563836951,31.791814126116314,31.021166583777536,34.874953897209046,20.483987448830327,22.953288090005284,40.269376824656597,37.505443027066917,38.283471297097464,7.7915515997478817,12.682317090702849,26.590826895940367,29.202793937256981,32.423055132078076,31.791814126116314,31.916327873965667,21.737826850827112,null,null,null,null,null,null,null,null,null,null,null,null,null,null,null,null,null,null,null,null,null,null,null,null,null,null,null,null,null,null,null,null,null,"Flush to septic tank",442.54606469767617,609.7102004439372,2071.9439049077578,721.02597957354863,1321.6555800081553,158.14399905346042,176.56801079794724,313.29102445271479,288.76535579816448,295.77521821125805,133.5018557370598,217.37266058878978,454.97093885981411,501.27347057294548,555.27529065116346,2071.9439049077578,1232.5436083135462,1862.3942164097732]
[null,"Flush to pit (latrine)",16.221576852096817,29.400753814154818,19.925880157333236,44.790024962193783,45.153461096533157,19.045633616318245,32.780516789579281,37.216799064550663,42.451537023308575,31.322887437009751,9.7170951739905735,22.674214179332814,32.978500321036073,50.485160260103555,50.568285911510443,19.925880157333236,32.564913094113159,33.288615135028778,null,null,null,null,null,null,null,null,null,null,null,null,null,null,null,null,null,null,null,null,null,null,null,null,null,null,null,null,null,null,null,null,null,"Flush to pit (latrine)",614.66933257822461,742.69644814435605,1298.614347018153,1041.0560007881186,1711.1800058806682,147.0393726863748,252.16389999413772,289.54232782278336,326.84677751621058,241.99827112831957,166.49446794953471,388.63200057778135,564.26448534179167,866.59076355454124,866.02942081989488,1298.614347018153,1257.5906491478243,2852.0111382435412]
[null,"Flush to somewhere else",0.33403871592761253,0.21361133488452727,5.3189679170937101E-2,0.21586325895478595,9.5900540760932546E-2,0,0,0.33419984245779133,0,0,0.20766866411713078,0.53088007859396669,0.31537361850696288,0.14082405758558467,0.21221266260781935,5.3189679170937101E-2,6.7327100068810763E-2,0.28135434831726203,null,null,null,null,null,null,null,null,null,null,null,null,null,null,null,null,null,null,null,null,null,null,null,null,null,null,null,null,null,null,null,null,null,"Flush to somewhere else",12.657422668991176,5.3960650364594631,3.4664908119128155,5.017316718940104,3.6343412867602196,0,0,2.6000355424280941,0,0,3.5582324885033447,9.099190180487831,5.3960650364594631,2.4172811765120099,3.6343412867602196,3.4664908119128155,2.6000355424280941,24.10511016872287]
[null,"Flush to unknown place / Not sure / DK where",0,0,0.24409523822988138,0.32928726670097724,0.21889150540181793,0,0,0.98377250513590386,0.33135664284880739,0,0,0,0,0,0.33540444907831668,0.24409523822988138,0.26425127118003722,6.7045208133221998E-2,null,null,null,null,null,null,null,null,null,null,null,null,null,null,null,null,null,null,null,null,null,null,null,null,null,null,null,null,null,null,null,null,null,"Flush to unknown place / Not sure / DK where",0,0,15.908234712908232,7.6536346043907084,8.2953279417481856,0,0,7.6536346043907084,2.5512115347969027,0,0,0,0,0,5.7441164069512824,15.908234712908232,10.204846139187611,5.7441164069512824]
[null,"Ventilated Improved Pit latrine (VIP)",3.740568021557948,2.5426421125163459,6.8976640231434988E-2,0.74734779443824595,0.30969839207780969,1.6935071932855266,2.5354830122599026,0.2745130563393508,0,0,4.7189672487625707,2.8441568031675502,2.5590349443340461,0.88754566321984851,0.68531334512522191,6.8976640231434988E-2,0.8989176632444954,2.3386075398866,null,null,null,null,null,null,null,null,null,null,null,null,null,null,null,null,null,null,null,null,null,null,null,null,null,null,null,null,null,null,null,null,null,"Ventilated Improved Pit latrine (VIP)",141.73791304248425,64.2300288558924,4.4953625087765801,17.370628990102574,11.736635099665239,13.074505178300507,19.504185636987543,2.1356793530895279,0,0,80.855639189066764,48.748342043068604,43.785269850953192,15.234949637013047,11.736635099665239,4.4953625087765801,34.714370168377577,200.36083581976692]
[null,"Pit latrine with slab",62.752343597785988,36.545788952714908,1.1158802460681623,12.478538456435285,0.97283930193161239,51.526565599163455,32.235461134747425,7.7902655717173959,2.0544419782042667,0,72.956865267590402,56.649202155118736,29.748746887688444,9.2126303452921778,1.0252141344400811,1.1158802460681623,18.70115169697247,33.915404569474461,null,null,null,null,null,null,null,null,null,null,null,null,null,null,null,null,null,null,null,null,null,null,null,null,null,null,null,null,null,null,null,null,null,"Pit latrine with slab",2377.8169969946352,923.18815433728946,72.724420986992499,290.03907347902884,36.86767574342371,397.80424400755396,247.97106311732708,60.607351644629524,15.817748596509103,0,1250.0561380222553,970.95725525720377,509.00317445415544,158.13716989587525,17.557755558873229,72.724420986992499,722.20040736601948,2905.7114931883584]
[null,"Pit latrine without slab / Open pit",0.93477000546203448,0.80836846733159506,1.0073751080853092E-2,0,0,1.1919498439879526,1.5162559526076202,0,0,0,1.2968454977059543,0.40156143721706528,0.34316203130143447,0,0,1.0073751080853092E-2,0.5403206737009485,0.40822285543130149,null,null,null,null,null,null,null,null,null,null,null,null,null,null,null,null,null,null,null,null,null,null,null,null,null,null,null,null,null,null,null,null,null,"Pit latrine without slab / Open pit",35.420382408583301,20.420305998753914,0.65652897531208787,0,0,9.2022959626528547,11.663788489155518,0,0,0,22.220385546005751,6.8826916543287791,5.871526755194318,0,0,0.65652897531208787,20.866084451808373,34.974603955528842]
[null,"Bucket",1.8837520197974637E-2,0,1.2438379653508658E-2,0,0,0,0,0,0,0,4.1659001526344851E-2,0,0,0,0,1.2438379653508658E-2,0,8.331375695301603E-3,null,null,null,null,null,null,null,null,null,null,null,null,null,null,null,null,null,null,null,null,null,null,null,null,null,null,null,null,null,null,null,null,null,"Bucket",0.71379287433583882,0,0.81063712840611635,0,0,0,0,0,0,0,0.71379287433583882,0,0,0,0,0.81063712840611635,0,0.71379287433583882]
[null,"No facility, Bush, Field",0.99303693186206798,0.17060717617756574,0.13874192067489136,0,0,1.0479011784684558,0,0,0,0,1.5230201810603123,0.20083915285824505,0.25188271270089391,0,0,0.13874192067489136,0.2094928323652398,0.3950706130843552,null,null,null,null,null,null,null,null,null,null,null,null,null,null,null,null,null,null,null,null,null,null,null,null,null,null,null,null,null,null,null,null,null,"No facility, Bush, Field",37.62823760590733,4.3097311237650322,9.0421224708089198,0,0,8.0901867075347393,0,0,0,0,26.095703518555112,3.4423473798174773,4.3097311237650322,0,0,9.0421224708089198,8.0901867075347393,33.847782022137622]
[null,"Other",0.40911536032622287,0.10624836799057663,3.0221253242559282E-2,0,0,1.1197364943036141,0.34890567436282838,0,0,0,9.246167105017529E-2,0.30765756790278093,0,0,0,3.0221253242559282E-2,0.29335405891401234,8.0040026962488589E-2,null,null,null,null,null,null,null,null,null,null,null,null,null,null,null,null,null,null,null,null,null,null,null,null,null,null,null,null,null,null,null,null,null,"Other",15.502233091890444,2.6839545008449708,1.9695869259362637,0,0,8.6447820541594496,2.6839545008449708,0,0,0,1.5842550115624465,5.2731960261685487,0,0,0,1.9695869259362637,11.32873655500442,6.8574510377309954]
[null,"Missing",0.18361207972060792,0,0.41709382384646709,0.13747586827021971,0.20423387991902958,0.24648970313211802,0,0,0,0,0.29499232872350795,0,0,0.41621078640738046,0.22135071228906317,0.41709382384646709,4.9277381416332602E-2,0.18663093670413033,null,null,null,null,null,null,null,null,null,null,null,null,null,null,null,null,null,null,null,null,null,null,null,null,null,null,null,null,null,null,null,null,null,"Missing",6.9574441205188604,0,27.182940950307056,3.195356058566019,7.739848139076754,1.9029921530751226,0,0,0,0,5.0544519674437378,0,0,7.14436522205997,3.7908389755828034,27.182940950307056,1.9029921530751226,15.989656165086512]
[null,null,null,null,null,null,null,null,null,null,null,null,null,null,null,null,null,null,null,null,null,null,null,null,null,null,null,null,null,null,null,null,null,null,null,null,null,null,null,null,null,null,null,null,null,null,null,null,null,null,null,null,null,"Total",3789.208276005374,2526.1136256540108,6517.2245178852472,2324.3032386493414,3789.6984291466665,772.03718000955291,769.2493123668479,777.98826094793048,769.92919558307415,772.59247448044982,1713.4181045708488,1713.9822244954062,1711.0071102349762,1716.5257257574242,1712.593981008891,6517.2245178852472,3861.796423387852,8567.5271460675485]
[]
[]
[]
[]
[]
[]
[]
[]
[]
[]
[]
[]
[]
[]
[]
[]
[]
[]
[]
[]
[]
[]
[]
[]
[]
[]
[]
[]
[]
[]
[]
[]
[]
[]
[]
[]
[]
[]
[]
[]
[]
[]
[{"$f":"A1026","v":"Jamaica"}]
[{"$f":"A1034","v":2011}]
["Access to hygiene facilities "]
[" by wealth quintile and sub-national region"]
["Notes:"]
["WHO/UNICEF JMP customised wealth index excludes water,"]
[" sanitation and hygiene assets."]
["Survey used for analysis:",{"$f":"A1025","v":"MICS11"}]
[]
[]
[]
[]
["Access to handwashing",null,"NATIONAL wealth index quintile",null,null,null,null,"URBAN wealth index quintile",null,null,null,null,"RURAL wealth index quintile",null,null,null,null,"SUB-REGIONS:",null,null,null,null,null,null,null,null,null,null,null,null,null,null,null,null,null,null,null,null,null,null,null,null,null,null,null,null,null,null,null,null,null,null,"Raw numbers of respondents:","Access to handwashing","NATIONAL wealth index quintile",null,null,null,null,"URBAN wealth index quintile",null,null,null,null,"RURAL wealth index quintile",null,null,null,null,"SUB-REGIONS:"]
["Weighted percentage (used in graphs)",null,"Poorest","Poor","Middle","Rich","Richest","Poorest","Poor","Middle","Rich","Richest","Poorest","Poor","Middle","Rich","Richest","  KMA","  Other towns","Rural",null,null,null,null,null,null,null,null,null,null,null,null,null,null,null,null,null,null,null,null,null,null,null,null,null,null,null,null,null,null,null,null,"Hygiene data, raw numbers (weighted)",null,"Poorest","Poor","Middle","Rich","Richest","Poorest","Poor","Middle","Rich","Richest","Poorest","Poor","Middle","Rich","Richest","  KMA","  Other towns","Rural"]
["Hygiene ladder","Basic",52.80439641344865,60.324840068374108,66.780010809459867,71.391637916409294,81.91020626061777,66.586003435913483,59.121738389811021,79.27732753235118,79.089724937656584,87.200101292975134,44.372457475879287,56.828210602514929,64.525321574247258,69.196133666332599,82.780552105592022,66.780010809459867,74.121637426018808,63.077553489143945,null,null,null,null,null,null,null,null,null,null,null,null,null,null,null,null,null,null,null,null,null,null,null,null,null,null,null,null,null,null,null,null,"Hygiene ladder","Basic",1733.2347859567219,1232.5494014790463,3516.5290225765402,1306.9396180810263,2383.2543191238542,399.36961376032195,327.92558697845726,419.9874347939674,408.17237193185196,503.01253079670789,675.60708495967447,861.1997260044385,928.80725278700072,994.42473697259902,1137.4717856556313,3516.5290225765402,2058.4675382613027,4597.5105863793488]
[null,"Limited",24.30003276990448,18.86547069825734,16.735562568305497,13.76899609836142,6.9005675993806301,13.666963468587037,19.872910797447766,8.8280855246297119,5.2733972601089061,2.9761140233918,30.235636763412799,20.429644931766042,17.750846526918618,14.466713721673733,8.6738925769372859,16.735562568305497,10.202938822811577,18.5571063599543,null,null,null,null,null,null,null,null,null,null,null,null,null,null,null,null,null,null,null,null,null,null,null,null,null,null,null,null,null,null,null,null,null,"Limited",797.616580386853,385.45687964364765,881.26807359329121,252.06378544251646,200.77849008588223,81.97173039495182,110.22740730754097,46.768541637809001,27.215356602823945,17.167670961942822,460.36238643607146,309.59983485431547,255.51387571683392,207.90262728989484,119.1863043567148,881.26807359329121,283.35070690506859,1352.5650286538296]
[null,"No facility",22.895570816647037,20.809689233368495,16.484426622234448,14.839365985229341,11.189226140001542,19.747033095499493,21.005350812741259,11.894586943019112,15.636877802234489,9.8237846836330451,25.391905760707857,22.742144465719001,17.723831898834145,16.337152611993734,8.5455553174706687,16.484426622234448,15.675423751169593,18.365340150901805,null,null,null,null,null,null,null,null,null,null,null,null,null,null,null,null,null,null,null,null,null,null,null,null,null,null,null,null,null,null,null,null,null,"No facility",751.51696599340937,425.18090359596357,868.04365460523741,271.65864069414329,325.56103498220011,118.43877952297071,116.5086173471465,63.013943754522245,80.700008846631974,56.668360729464908,386.61260629722773,344.64447102903858,255.12501469477252,234.78289650405145,117.42284653989043,868.04365460523741,435.32971020073643,1338.5878350649814]
["Place where household members most often wash their hands","Observed",66.791033429590868,64.05120754232874,67.479600926758721,67.074010722864273,68.185710750382569,62.346912379183337,56.958516210807751,59.995246697304061,56.549060749015112,67.329183099856039,66.29843984753893,68.308734135410091,69.217779483171739,70.044237975633095,73.377467394346894,67.479600926758721,60.640644622896957,69.44915975859189,null,null,null,null,null,null,null,null,null,null,null,null,null,null,null,null,null,null,null,null,null,null,null,null,null,null,null,null,null,null,null,null,"Observed handwashing place","Fixed","N/A","N/A","N/A","N/A","N/A","N/A","N/A","N/A","N/A","N/A","N/A","N/A","N/A","N/A","N/A","N/A","N/A","N/A"]
[null,"Not in dwelling/plot/yard",5.6109389872953619,3.3540336770460573,6.3534074500210034,3.9848955319659396,1.8722660898233472,6.6921380554278613,5.5607597611527222,4.4730440646665892,3.0720226243920079,1.4842228618120175,5.3476598886016653,4.7217528196157463,2.9971433547874771,2.7529057689837932,1.4864387900280502,6.3534074500210034,4.2560775627692244,3.4613267579237412,null,null,null,null,null,null,null,null,null,null,null,null,null,null,null,null,null,null,null,null,null,null,null,null,null,null,null,null,null,null,null,null,null,"Mobile","N/A","N/A","N/A","N/A","N/A","N/A","N/A","N/A","N/A","N/A","N/A","N/A","N/A","N/A","N/A","N/A","N/A","N/A"]
[null,"No permission to see",13.320291326812935,19.117368119588249,19.122794129651872,21.062940204433257,23.108981524993176,22.124465295713577,27.855010294587302,31.421678900580226,32.969454809351589,24.773738187234812,11.137738440418248,11.545031554290846,15.871410785608944,16.277965473985883,19.766100325614548,19.122794129651872,27.831141872886917,14.919185783979636,null,null,null,null,null,null,null,null,null,null,null,null,null,null,null,null,null,null,null,null,null,null,null,null,null,null,null,null,null,null,null,null,"Water / Soap","Water and soap","N/A","N/A","N/A","N/A","N/A","N/A","N/A","N/A","N/A","N/A","N/A","N/A","N/A","N/A","N/A","N/A","N/A","N/A"]
[null,"Other reason",14.222147801633206,13.477390661037084,6.9658153605951121,7.7028496889203391,6.7184183952085457,8.6489339278547579,9.5849953892379229,3.6265567799198912,7.4094618172412403,5.8506092264209206,17.216161823441041,15.386067792730525,11.913666376431914,10.924890781397211,5.3699934900104722,6.9658153605951121,7.0166479378368702,12.162642822136311,null,null,null,null,null,null,null,null,null,null,null,null,null,null,null,null,null,null,null,null,null,null,null,null,null,null,null,null,null,null,null,null,null,"Water only","N/A","N/A","N/A","N/A","N/A","N/A","N/A","N/A","N/A","N/A","N/A","N/A","N/A","N/A","N/A","N/A","N/A","N/A"]
[null,"Missing",5.5588454667713658E-2,0,7.8382132973277327E-2,0.17530385181617711,0.11462323959234839,0.18755034182051947,4.0718344214310913E-2,0.48347355752922294,0,0.56224662467614639,0,3.8413697952843072E-2,0,0,0,7.8382132973277327E-2,0.25548800361005447,7.6848773684398547E-3,null,null,null,null,null,null,null,null,null,null,null,null,null,null,null,null,null,null,null,null,null,null,null,null,null,null,null,null,null,null,null,null,null,"Soap only","N/A","N/A","N/A","N/A","N/A","N/A","N/A","N/A","N/A","N/A","N/A","N/A","N/A","N/A","N/A","N/A","N/A","N/A"]
[null,null,null,null,null,null,null,null,null,null,null,null,null,null,null,null,null,null,null,null,null,null,null,null,null,null,null,null,null,null,null,null,null,null,null,null,null,null,null,null,null,null,null,null,null,null,null,null,null,null,null,null,null,"Neither","N/A","N/A","N/A","N/A","N/A","N/A","N/A","N/A","N/A","N/A","N/A","N/A","N/A","N/A","N/A","N/A","N/A","N/A"]
[null,null,null,null,null,null,null,null,null,null,null,null,null,null,null,null,null,null,null,null,null,null,null,null,null,null,null,null,null,null,null,null,null,null,null,null,null,null,null,null,null,null,null,null,null,null,null,null,null,null,null,null,"Place where household members most often wash their hands","Observed",2530.8513663435733,1618.0062811226958,4397.7970961698402,1559.003403523541,2584.0328092097379,481.34134415527387,438.15299428599826,466.75597643177656,435.387728534676,520.18020175865058,1135.9694713957458,1170.7995608587546,1184.3211285038349,1202.3273642624933,1256.6580900123465,4397.7970961698402,2341.8182451663724,5950.0756150331808]
[null,null,null,null,null,null,null,null,null,null,null,null,null,null,null,null,null,null,null,null,null,null,null,null,null,null,null,null,null,null,null,null,null,null,null,null,null,null,null,null,null,null,null,null,null,null,null,null,null,null,null,null,null,"Not in dwelling/plot/yard",212.61016446820796,84.726701724884691,414.06582805391673,92.621055906277235,70.95323859548111,51.665793925471391,42.77610622503969,34.799757730134218,23.652399080111429,11.466994134878014,91.627772702174212,80.930004012824526,51.281335904348829,47.254335730467055,25.456661249401776,414.06582805391673,164.36105109563479,296.55010959921628]
[null,null,null,null,null,null,null,null,null,null,null,null,null,null,null,null,null,null,null,null,null,null,null,null,null,null,null,null,null,null,null,null,null,null,null,null,null,null,null,null,null,null,null,null,null,null,null,null,null,null,null,null,null,"No permission to see",504.73358134362184,482.92644093535472,1246.2754275223926,489.56660132641639,875.76070984445983,170.80909796121929,214.2744751508275,244.45697323926689,253.84145820176585,191.40003688206556,190.83602687787317,197.87978865293078,271.5609670363699,279.41546499087912,338.51304445665357,1246.2754275223926,1074.7820414351459,1278.2052920147059]
[null,null,null,null,null,null,null,null,null,null,null,null,null,null,null,null,null,null,null,null,null,null,null,null,null,null,null,null,null,null,null,null,null,null,null,null,null,null,null,null,null,null,null,null,null,null,null,null,null,null,null,null,null,"Other reason",538.90680152520179,340.45420187107891,453.9778265513213,179.03758478786617,254.60779638671897,66.772985597499343,73.7325111221068,28.214186024388027,57.047609766520509,45.201366594586894,294.9848335950536,263.71446701621392,203.8436787904237,187.52856077358442,91.966185290488625,453.9778265513213,270.96865910510172,1042.0377254657647]
[null,null,null,null,null,null,null,null,null,null,null,null,null,null,null,null,null,null,null,null,null,null,null,null,null,null,null,null,null,null,null,null,null,null,null,null,null,null,null,null,null,null,null,null,null,null,null,null,null,null,null,null,null,"Missing",2.1063623247725016,0,5.1083395877758466,4.0745931052404467,4.3438751102682467,1.4479583700894156,0.31322558287575292,3.7613675223646941,0,4.3438751102682467,0,0.65840395468308599,0,0,0,5.1083395877758466,9.8664265855981093,0.65840395468308599]
[null,null,null,null,null,null,null,null,null,null,null,null,null,null,null,null,null,null,null,null,null,null,null,null,null,null,null,null,null,null,null,null,null,null,null,null,null,null,null,null,null,null,null,null,null,null,null,null,null,null,null,null,null,"Total",3789.208276005374,2526.1136256540108,6517.2245178852472,2324.3032386493414,3789.6984291466665,772.03718000955291,769.2493123668479,777.98826094793048,769.92919558307415,772.59247448044982,1713.4181045708488,1713.9822244954062,1711.0071102349762,1716.5257257574242,1712.593981008891,6517.2245178852472,3861.796423387852,8567.5271460675485]
[]
[]
[]
[]
[]
[]
[]
[]
[]
[]
[]
[]
[]
[]
[]
[]
[]
[]
[]
[]
[]
[]
[null,null,null,null,null,null,null,null,null,null,null,null,null,null,null,null,null,null,null,null,null,null,null,null,null,null,null,null,null,null,null,null,null,null,null,null,null,null,null,null,null,null,null,null,null,null,null,null,null,null,null,null,"Raw numbers of respondents:","Menstrual health and hygiene","NATIONAL wealth index quintile",null,null,null,null,"URBAN wealth index quintile",null,null,null,null,"RURAL wealth index quintile",null,null,null,null,"SUB-REGIONS:"]
[null,null,null,null,null,null,null,null,null,null,null,null,null,null,null,null,null,null,null,null,null,null,null,null,null,null,null,null,null,null,null,null,null,null,null,null,null,null,null,null,null,null,null,null,null,null,null,null,null,null,null,null,"MHH data, raw numbers (weighted)",null,"Poorest","Poor","Middle","Rich","Richest","Poorest","Poor","Middle","Rich","Richest","Poorest","Poor","Middle","Rich","Richest","  KMA","  Other towns","Rural"]
[null,null,null,null,null,null,null,null,null,null,null,null,null,null,null,null,null,null,null,null,null,null,null,null,null,null,null,null,null,null,null,null,null,null,null,null,null,null,null,null,null,null,null,null,null,null,null,null,null,null,null,null,"Private place to wash and change","Yes","N/A","N/A","N/A","N/A","N/A","N/A","N/A","N/A","N/A","N/A","N/A","N/A","N/A","N/A","N/A","N/A","N/A","N/A"]
[null,null,null,null,null,null,null,null,null,null,null,null,null,null,null,null,null,null,null,null,null,null,null,null,null,null,null,null,null,null,null,null,null,null,null,null,null,null,null,null,null,null,null,null,null,null,null,null,null,null,null,null,null,"No","N/A","N/A","N/A","N/A","N/A","N/A","N/A","N/A","N/A","N/A","N/A","N/A","N/A","N/A","N/A","N/A","N/A","N/A"]
[null,null,null,null,null,null,null,null,null,null,null,null,null,null,null,null,null,null,null,null,null,null,null,null,null,null,null,null,null,null,null,null,null,null,null,null,null,null,null,null,null,null,null,null,null,null,null,null,null,null,null,null,null,"DK/not sure/missing","N/A","N/A","N/A","N/A","N/A","N/A","N/A","N/A","N/A","N/A","N/A","N/A","N/A","N/A","N/A","N/A","N/A","N/A"]
[null,null,null,null,null,null,null,null,null,null,null,null,null,null,null,null,null,null,null,null,null,null,null,null,null,null,null,null,null,null,null,null,null,null,null,null,null,null,null,null,null,null,null,null,null,null,null,null,null,null,null,null,"Use of menstrual materials","Materials reusable","N/A","N/A","N/A","N/A","N/A","N/A","N/A","N/A","N/A","N/A","N/A","N/A","N/A","N/A","N/A","N/A","N/A","N/A"]
[null,null,null,null,null,null,null,null,null,null,null,null,null,null,null,null,null,null,null,null,null,null,null,null,null,null,null,null,null,null,null,null,null,null,null,null,null,null,null,null,null,null,null,null,null,null,null,null,null,null,null,null,null,"Materials not reusable","N/A","N/A","N/A","N/A","N/A","N/A","N/A","N/A","N/A","N/A","N/A","N/A","N/A","N/A","N/A","N/A","N/A","N/A"]
[null,null,null,null,null,null,null,null,null,null,null,null,null,null,null,null,null,null,null,null,null,null,null,null,null,null,null,null,null,null,null,null,null,null,null,null,null,null,null,null,null,null,null,null,null,null,null,null,null,null,null,null,null,"No materials used","N/A","N/A","N/A","N/A","N/A","N/A","N/A","N/A","N/A","N/A","N/A","N/A","N/A","N/A","N/A","N/A","N/A","N/A"]
[null,null,null,null,null,null,null,null,null,null,null,null,null,null,null,null,null,null,null,null,null,null,null,null,null,null,null,null,null,null,null,null,null,null,null,null,null,null,null,null,null,null,null,null,null,null,null,null,null,null,null,null,null,"DK/not sure/missing","N/A","N/A","N/A","N/A","N/A","N/A","N/A","N/A","N/A","N/A","N/A","N/A","N/A","N/A","N/A","N/A","N/A","N/A"]
[null,null,null,null,null,null,null,null,null,null,null,null,null,null,null,null,null,null,null,null,null,null,null,null,null,null,null,null,null,null,null,null,null,null,null,null,null,null,null,null,null,null,null,null,null,null,null,null,null,null,null,null,"Use of menstrual materials with private place to wash and change","Materials reusable","N/A","N/A","N/A","N/A","N/A","N/A","N/A","N/A","N/A","N/A","N/A","N/A","N/A","N/A","N/A","N/A","N/A","N/A"]
[null,null,null,null,null,null,null,null,null,null,null,null,null,null,null,null,null,null,null,null,null,null,null,null,null,null,null,null,null,null,null,null,null,null,null,null,null,null,null,null,null,null,null,null,null,null,null,null,null,null,null,null,null,"Materials not reusable","N/A","N/A","N/A","N/A","N/A","N/A","N/A","N/A","N/A","N/A","N/A","N/A","N/A","N/A","N/A","N/A","N/A","N/A"]
[null,null,null,null,null,null,null,null,null,null,null,null,null,null,null,null,null,null,null,null,null,null,null,null,null,null,null,null,null,null,null,null,null,null,null,null,null,null,null,null,null,null,null,null,null,null,null,null,null,null,null,null,null,"No materials used","N/A","N/A","N/A","N/A","N/A","N/A","N/A","N/A","N/A","N/A","N/A","N/A","N/A","N/A","N/A","N/A","N/A","N/A"]
[null,null,null,null,null,null,null,null,null,null,null,null,null,null,null,null,null,null,null,null,null,null,null,null,null,null,null,null,null,null,null,null,null,null,null,null,null,null,null,null,null,null,null,null,null,null,null,null,null,null,null,null,"Awareness of menstruation before menarche","Yes","N/A","N/A","N/A","N/A","N/A","N/A","N/A","N/A","N/A","N/A","N/A","N/A","N/A","N/A","N/A","N/A","N/A","N/A"]
[null,null,null,null,null,null,null,null,null,null,null,null,null,null,null,null,null,null,null,null,null,null,null,null,null,null,null,null,null,null,null,null,null,null,null,null,null,null,null,null,null,null,null,null,null,null,null,null,null,null,null,null,null,"No","N/A","N/A","N/A","N/A","N/A","N/A","N/A","N/A","N/A","N/A","N/A","N/A","N/A","N/A","N/A","N/A","N/A","N/A"]
[null,null,null,null,null,null,null,null,null,null,null,null,null,null,null,null,null,null,null,null,null,null,null,null,null,null,null,null,null,null,null,null,null,null,null,null,null,null,null,null,null,null,null,null,null,null,null,null,null,null,null,null,null,"DK/not sure/missing","N/A","N/A","N/A","N/A","N/A","N/A","N/A","N/A","N/A","N/A","N/A","N/A","N/A","N/A","N/A","N/A","N/A","N/A"]
[null,null,null,null,null,null,null,null,null,null,null,null,null,null,null,null,null,null,null,null,null,null,null,null,null,null,null,null,null,null,null,null,null,null,null,null,null,null,null,null,null,null,null,null,null,null,null,null,null,null,null,null,"Participation in (all) activities during menstruation","Yes","N/A","N/A","N/A","N/A","N/A","N/A","N/A","N/A","N/A","N/A","N/A","N/A","N/A","N/A","N/A","N/A","N/A","N/A"]
[null,null,null,null,null,null,null,null,null,null,null,null,null,null,null,null,null,null,null,null,null,null,null,null,null,null,null,null,null,null,null,null,null,null,null,null,null,null,null,null,null,null,null,null,null,null,null,null,null,null,null,null,null,"No","N/A","N/A","N/A","N/A","N/A","N/A","N/A","N/A","N/A","N/A","N/A","N/A","N/A","N/A","N/A","N/A","N/A","N/A"]
[null,null,null,null,null,null,null,null,null,null,null,null,null,null,null,null,null,null,null,null,null,null,null,null,null,null,null,null,null,null,null,null,null,null,null,null,null,null,null,null,null,null,null,null,null,null,null,null,null,null,null,null,null,"DK/not sure/missing/no such activity","N/A","N/A","N/A","N/A","N/A","N/A","N/A","N/A","N/A","N/A","N/A","N/A","N/A","N/A","N/A","N/A","N/A","N/A"]
[null,null,null,null,null,null,null,null,null,null,null,null,null,null,null,null,null,null,null,null,null,null,null,null,null,null,null,null,null,null,null,null,null,null,null,null,null,null,null,null,null,null,null,null,null,null,null,null,null,null,null,null,"Participation in specific activities during menstruation","Did not go to school (amongst those usually attending school)","N/A","N/A","N/A","N/A","N/A","N/A","N/A","N/A","N/A","N/A","N/A","N/A","N/A","N/A","N/A","N/A","N/A","N/A"]
[null,null,null,null,null,null,null,null,null,null,null,null,null,null,null,null,null,null,null,null,null,null,null,null,null,null,null,null,null,null,null,null,null,null,null,null,null,null,null,null,null,null,null,null,null,null,null,null,null,null,null,null,null,"Did not go to work (amongst those who usually work)","N/A","N/A","N/A","N/A","N/A","N/A","N/A","N/A","N/A","N/A","N/A","N/A","N/A","N/A","N/A","N/A","N/A","N/A"]
[null,null,null,null,null,null,null,null,null,null,null,null,null,null,null,null,null,null,null,null,null,null,null,null,null,null,null,null,null,null,null,null,null,null,null,null,null,null,null,null,null,null,null,null,null,null,null,null,null,null,null,null,null,"Did not participate in social activities","N/A","N/A","N/A","N/A","N/A","N/A","N/A","N/A","N/A","N/A","N/A","N/A","N/A","N/A","N/A","N/A","N/A","N/A"]
[null,null,null,null,null,null,null,null,null,null,null,null,null,null,null,null,null,null,null,null,null,null,null,null,null,null,null,null,null,null,null,null,null,null,null,null,null,null,null,null,null,null,null,null,null,null,null,null,null,null,null,null,null,"Did not cook food","N/A","N/A","N/A","N/A","N/A","N/A","N/A","N/A","N/A","N/A","N/A","N/A","N/A","N/A","N/A","N/A","N/A","N/A"]
[null,null,null,null,null,null,null,null,null,null,null,null,null,null,null,null,null,null,null,null,null,null,null,null,null,null,null,null,null,null,null,null,null,null,null,null,null,null,null,null,null,null,null,null,null,null,null,null,null,null,null,null,null,"Did not eat with others","N/A","N/A","N/A","N/A","N/A","N/A","N/A","N/A","N/A","N/A","N/A","N/A","N/A","N/A","N/A","N/A","N/A","N/A"]
[null,null,null,null,null,null,null,null,null,null,null,null,null,null,null,null,null,null,null,null,null,null,null,null,null,null,null,null,null,null,null,null,null,null,null,null,null,null,null,null,null,null,null,null,null,null,null,null,null,null,null,null,null,"Did not bathe in regular place","N/A","N/A","N/A","N/A","N/A","N/A","N/A","N/A","N/A","N/A","N/A","N/A","N/A","N/A","N/A","N/A","N/A","N/A"]
[null,null,null,null,null,null,null,null,null,null,null,null,null,null,null,null,null,null,null,null,null,null,null,null,null,null,null,null,null,null,null,null,null,null,null,null,null,null,null,null,null,null,null,null,null,null,null,null,null,null,null,null,null,"Did not participate in other activities","N/A","N/A","N/A","N/A","N/A","N/A","N/A","N/A","N/A","N/A","N/A","N/A","N/A","N/A","N/A","N/A","N/A","N/A"]
[null,null,null,null,null,null,null,null,null,null,null,null,null,null,null,null,null,null,null,null,null,null,null,null,null,null,null,null,null,null,null,null,null,null,null,null,null,null,null,null,null,null,null,null,null,null,null,null,null,null,null,null,null,"DK/not sure/missing/no such activity","N/A","N/A","N/A","N/A","N/A","N/A","N/A","N/A","N/A","N/A","N/A","N/A","N/A","N/A","N/A","N/A","N/A","N/A"]
[]
[]
[]
[]
[]
[]
[]
[]
[]
[]
[]
[]
[]
[]
[]
[]
[]
[]
[]
[]
[]
[]
[]
[]
[]
[]
[]
[]
[]
[]
[]
[]
[]
[]
[]
[]
[]
[]
[]
[]
[]
[]
[]
[]
[]
[]
[]
[]
[]
[]
[]
[]
[]
[]
[null,null,null,null,null,null,null,null,null,null,null,null,null,null,null,null,null,null,null,null,null,null,null,null,null,null,null,null,null,null,null,null,null,null,null,null,null,null,null,null,null,null,null,null,null,null,null,null,null,null,null,null,"Raw numbers of respondents:","Basic water, sanitation and hygiene","NATIONAL wealth index quintile",null,null,null,null,"URBAN wealth index quintile",null,null,null,null,"RURAL wealth index quintile",null,null,null,null,"SUB-REGIONS:"]
[null,null,null,null,null,null,null,null,null,null,null,null,null,null,null,null,null,null,null,null,null,null,null,null,null,null,null,null,null,null,null,null,null,null,null,null,null,null,null,null,null,null,null,null,null,null,null,null,null,null,null,null,"WatSan data, raw numbers (weighted)",null,"Poorest","Poor","Middle","Rich","Richest","Poorest","Poor","Middle","Rich","Richest","Poorest","Poor","Middle","Rich","Richest","  KMA","  Other towns","Rural"]
[null,null,null,null,null,null,null,null,null,null,null,null,null,null,null,null,null,null,null,null,null,null,null,null,null,null,null,null,null,null,null,null,null,null,null,null,null,null,null,null,null,null,null,null,null,null,null,null,null,null,null,null,"Use of Basic Water Sanitation and Hygiene","Yes","N/A","N/A","N/A","N/A","N/A","N/A","N/A","N/A","N/A","N/A","N/A","N/A","N/A","N/A","N/A","N/A","N/A","N/A"]
[null,null,null,null,null,null,null,null,null,null,null,null,null,null,null,null,null,null,null,null,null,null,null,null,null,null,null,null,null,null,null,null,null,null,null,null,null,null,null,null,null,null,null,null,null,null,null,null,null,null,null,null,null,"No","N/A","N/A","N/A","N/A","N/A","N/A","N/A","N/A","N/A","N/A","N/A","N/A","N/A","N/A","N/A","N/A","N/A","N/A"]
[null,null,null,null,null,null,null,null,null,null,null,null,null,null,null,null,null,null,null,null,null,null,null,null,null,null,null,null,null,null,null,null,null,null,null,null,null,null,null,null,null,null,null,null,null,null,null,null,null,null,null,null,"Use of Basic Water and Sanitation","Yes","N/A","N/A","N/A","N/A","N/A","N/A","N/A","N/A","N/A","N/A","N/A","N/A","N/A","N/A","N/A","N/A","N/A","N/A"]
[null,null,null,null,null,null,null,null,null,null,null,null,null,null,null,null,null,null,null,null,null,null,null,null,null,null,null,null,null,null,null,null,null,null,null,null,null,null,null,null,null,null,null,null,null,null,null,null,null,null,null,null,null,"No","N/A","N/A","N/A","N/A","N/A","N/A","N/A","N/A","N/A","N/A","N/A","N/A","N/A","N/A","N/A","N/A","N/A","N/A"]
[null,null,null,null,null,null,null,null,null,null,null,null,null,null,null,null,null,null,null,null,null,null,null,null,null,null,null,null,null,null,null,null,null,null,null,null,null,null,null,null,null,null,null,null,null,null,null,null,null,null,null,null,"Use of Basic Water and Hygiene","Yes","N/A","N/A","N/A","N/A","N/A","N/A","N/A","N/A","N/A","N/A","N/A","N/A","N/A","N/A","N/A","N/A","N/A","N/A"]
[null,null,null,null,null,null,null,null,null,null,null,null,null,null,null,null,null,null,null,null,null,null,null,null,null,null,null,null,null,null,null,null,null,null,null,null,null,null,null,null,null,null,null,null,null,null,null,null,null,null,null,null,null,"No","N/A","N/A","N/A","N/A","N/A","N/A","N/A","N/A","N/A","N/A","N/A","N/A","N/A","N/A","N/A","N/A","N/A","N/A"]
[null,null,null,null,null,null,null,null,null,null,null,null,null,null,null,null,null,null,null,null,null,null,null,null,null,null,null,null,null,null,null,null,null,null,null,null,null,null,null,null,null,null,null,null,null,null,null,null,null,null,null,null,"Use of Basic Sanitation and Hygiene","Yes","N/A","N/A","N/A","N/A","N/A","N/A","N/A","N/A","N/A","N/A","N/A","N/A","N/A","N/A","N/A","N/A","N/A","N/A"]
[null,null,null,null,null,null,null,null,null,null,null,null,null,null,null,null,null,null,null,null,null,null,null,null,null,null,null,null,null,null,null,null,null,null,null,null,null,null,null,null,null,null,null,null,null,null,null,null,null,null,null,null,null,"No","N/A","N/A","N/A","N/A","N/A","N/A","N/A","N/A","N/A","N/A","N/A","N/A","N/A","N/A","N/A","N/A","N/A","N/A"]
[null,null,null,null,null,null,null,null,null,null,null,null,null,null,null,null,null,null,null,null,null,null,null,null,null,null,null,null,null,null,null,null,null,null,null,null,null,null,null,null,null,null,null,null,null,null,null,null,null,null,null,null,"Use of Basic Water","Yes","N/A","N/A","N/A","N/A","N/A","N/A","N/A","N/A","N/A","N/A","N/A","N/A","N/A","N/A","N/A","N/A","N/A","N/A"]
[null,null,null,null,null,null,null,null,null,null,null,null,null,null,null,null,null,null,null,null,null,null,null,null,null,null,null,null,null,null,null,null,null,null,null,null,null,null,null,null,null,null,null,null,null,null,null,null,null,null,null,null,null,"No","N/A","N/A","N/A","N/A","N/A","N/A","N/A","N/A","N/A","N/A","N/A","N/A","N/A","N/A","N/A","N/A","N/A","N/A"]
[null,null,null,null,null,null,null,null,null,null,null,null,null,null,null,null,null,null,null,null,null,null,null,null,null,null,null,null,null,null,null,null,null,null,null,null,null,null,null,null,null,null,null,null,null,null,null,null,null,null,null,null,"Use of Basic Sanitation","Yes","N/A","N/A","N/A","N/A","N/A","N/A","N/A","N/A","N/A","N/A","N/A","N/A","N/A","N/A","N/A","N/A","N/A","N/A"]
[null,null,null,null,null,null,null,null,null,null,null,null,null,null,null,null,null,null,null,null,null,null,null,null,null,null,null,null,null,null,null,null,null,null,null,null,null,null,null,null,null,null,null,null,null,null,null,null,null,null,null,null,null,"No","N/A","N/A","N/A","N/A","N/A","N/A","N/A","N/A","N/A","N/A","N/A","N/A","N/A","N/A","N/A","N/A","N/A","N/A"]
[null,null,null,null,null,null,null,null,null,null,null,null,null,null,null,null,null,null,null,null,null,null,null,null,null,null,null,null,null,null,null,null,null,null,null,null,null,null,null,null,null,null,null,null,null,null,null,null,null,null,null,null,"Access to Basic Hygiene","Yes","N/A","N/A","N/A","N/A","N/A","N/A","N/A","N/A","N/A","N/A","N/A","N/A","N/A","N/A","N/A","N/A","N/A","N/A"]
[null,null,null,null,null,null,null,null,null,null,null,null,null,null,null,null,null,null,null,null,null,null,null,null,null,null,null,null,null,null,null,null,null,null,null,null,null,null,null,null,null,null,null,null,null,null,null,null,null,null,null,null,null,"No","N/A","N/A","N/A","N/A","N/A","N/A","N/A","N/A","N/A","N/A","N/A","N/A","N/A","N/A","N/A","N/A","N/A","N/A"]
[]
[]
[]
[]
[]
[]
[]
[]
[]
[]
[]
[]
[]
[]
[]
[]
[]
[]
[]
[]
[]
[]
[]
[]
[]
[]
[]
[]
[]
[]
[]
[]
[]
[]
[]
[]
[]
[]
[]
[]
[]
[]
[]
[]
[null,null,"INITIAL (national) Wealth Index",null,null,null,null,"URBAN Wealth Index",null,null,null,null,"RURAL Wealth Index"]
[null,null,"Component Matrix",null,null,null,null,"Component Matrix",null,null,null,null,"Component Matrix"]
[null,null,null,null,"Component",null,null,null,null,"Component",null,null,null,null,"Component"]
[null,"Note:\n\nThe INITIAL (national) Wealth Index is based on the first component of the Principal Component Analysis (PCA) which has been obtained at national level.\n\nThe final national-level (NATIONAL) Wealth Index is based on the URBAN and RURAL specific wealth indexes. Regression procedures are used to establish the relationships between the two sets of scores (urban and rural) and the initial (national) wealth factors.\nThis allows best use of the available information for each area and a better precision of the FINAL (NATIONAL) Wealth Index.\n\nFor dependency reasons, all WASH variables (contained in the generic MICS and DHS scripts) have been excluded from the sets of asset variables used in the PCAs.\n\nThe PCA can extracts as many components as there are asset variables in the input. Only the first of the components is used to represent the Wealth Index. \n\nThe scores represent the weights of the asset variables on the Wealth Index (correlations between the variables and the component).\n\nThe communalities are the proportion of each variable's variance that can be explained by the component.\n\nProportion of explained variance is the part of the model's total variance that is explained by the component.\n\nFor more information on the procedure used:\n\nThe DHS Wealth Index, DHS Comparative Reports No. 6, Shea Oscar Rutstein, Kiersten Johnson, ORC Macro International Inc., 2004.\n\nThe DHS Wealth Index: Approaches for Rural and Urban Areas, Shea O. Rutstein, ORC Macro International Inc., 2008.\n\nMICS Methodological Paper No. 4, Review of options for reporting water, sanitation and hygiene coverage by wealth quintile, UNICEF, 2016.",null,null,"1",null,null,null,null,"1",null,null,null,null,"1"]
[null,null,"cabinet",null,0.69811672144335135,null,null,"sofa",null,0.66940927174434084,null,null,"fridge",null,0.69679890822262103]
[null,null,"sofa",null,0.66966254855848883,null,null,"washingm",null,0.66390647247342094,null,null,"cabinet",null,0.67201103170051235]
[null,null,"fridge",null,0.66272594783411443,null,null,"cabinet",null,0.65099386080732791,null,null,"sofa",null,0.66501814886622546]
[null,null,"ceramic tiles",null,0.63833081584738682,null,null,"fridge",null,0.63264350925691293,null,null,"LPG",null,0.63243868718654273]
[null,null,"microwave",null,0.63336508891487908,null,null,"ceramic tiles",null,0.63005353392913699,null,null,"stove",null,0.63205827214549293]
[null,null,"washingm",null,0.62264762415498609,null,null,"microwave",null,0.61916468251032197,null,null,"tv",null,0.62811549615219564]
[null,null,"stove",null,0.56916554633572503,null,null,"LPG",null,0.55572959773643926,null,null,"microwave",null,0.61024186306158335]
[null,null,"tv",null,0.56413469867678512,null,null,"tv",null,0.54397509320339066,null,null,"ceramic tiles",null,0.59420558004116153]
[null,null,"fan",null,0.55609691196645739,null,null,"stove",null,0.50772341797665621,null,null,"fan",null,0.58962468187699868]
[null,null,"LPG",null,0.54278484441976305,null,null,"fan",null,0.50686558798384318,null,null,"washingm",null,0.5646731182518806]
[null,null,"watch",null,0.50806099415426886,null,null,"car",null,0.49758438381856779,null,null,"elec",null,0.53164560680296846]
[null,null,"car",null,0.48556454082641182,null,null,"table",null,0.49499385114280464,null,null,"Wood",null,-0.5231765762255195]
[null,null,"phone",null,0.48339067253547074,null,null,"watch",null,0.49236767622340871,null,null,"watch",null,0.52129439889966367]
[null,null,"elec",null,0.47583328492303967,null,null,"phone",null,0.49080142528913079,null,null,"Household owns bank account",null,0.48324439585912821]
[null,null,"Has metal roof",null,-0.47343798018894612,null,null,"elec",null,0.48669245159218427,null,null,"radio",null,0.43250512971534916]
[null,null,"table",null,0.46619612840481983,null,null,"Household owns bank account",null,0.44213649069230054,null,null,"car",null,0.43012606572317202]
[null,null,"Has cement block wall",null,0.45383914553238075,null,null,"Has cement block wall",null,0.43893037808302771,null,null,"table",null,0.42795689816565424]
[null,null,"Household owns bank account",null,0.44684029876263393,null,null,"chair",null,0.43457269099643064,null,null,"chair",null,0.41469416781177987]
[null,null,"Wood",null,-0.43477007164891124,null,null,"radio",null,0.43392680317597532,null,null,"Has cement block wall",null,0.41280891946123793]
[null,null,"chair",null,0.42877441348584494,null,null,"Has metal roof",null,-0.42687487545106967,null,null,"Has metal roof",null,-0.37387779440014707]
[null,null,"Cement",null,-0.42660253078085753,null,null,"Charcoal",null,-0.40886754879165427,null,null,"Cement",null,-0.36794162090541394]
[null,null,"radio",null,0.41293467853016297,null,null,"Cement",null,-0.38384835455129374,null,null,"phone",null,0.35783038671129475]
[null,null,"Has cement roof",null,0.39668468898120657,null,null,"kettle",null,0.37691099565940367,null,null,"Has cement roof",null,0.32625892989982691]
[null,null,"kettle",null,0.34953906042145827,null,null,"Wood",null,-0.3448465080906119,null,null,"mobile",null,0.32462557843249146]
[null,null,"Charcoal",null,-0.33770542076923193,null,null,"Wood planks",null,-0.32305875158362091,null,null,"Charcoal",null,-0.28254345373641088]
[null,null,"Wood planks",null,-0.32614313674733042,null,null,"Has cement roof",null,0.31748982091444916,null,null,"kettle",null,0.27065697340671441]
[null,null,"ac",null,0.3031000875795995,null,null,"ac",null,0.29099782534129337,null,null,"Wood planks",null,-0.26345757094784011]
[null,null,"mobile",null,0.29083257980692917,null,null,"Has shingle roof",null,0.26486338181412522,null,null,"Has plywood wall",null,-0.22540899059524566]
[null,null,"Has plywood wall",null,-0.25782872637022691,null,null,"dryer",null,0.25630806888905106,null,null,"Has reused wood wall",null,-0.21027988967563727]
[null,null,"Has wood plank/shingle wall",null,-0.25528804206162331,null,null,"Has wood plank/shingle wall",null,-0.25014262788958469,null,null,"ac",null,0.19984182769294451]
[null,null,"dryer",null,0.24620199801228773,null,null,"mobile",null,0.24911376769724969,null,null,"dryer",null,0.19677938895342717]
[null,null,"Persons per sleeping rooms",null,-0.21427467893452998,null,null,"Has plywood wall",null,-0.24605732366820218,null,null,"Has wood plank/shingle wall",null,-0.18818082616427614]
[null,null,"Has reused wood wall",null,-0.2137110982410689,null,null,"Persons per sleeping rooms",null,-0.2171806312410603,null,null,"Persons per sleeping rooms",null,-0.16047381653067044]
[null,null,"Has shingle roof",null,0.20051813302029137,null,null,"Has reused wood wall",null,-0.21191625587653068,null,null,"Has shingle roof",null,0.15378028722680123]
[null,null,"No cooking in HH",null,-0.16078130573590677,null,null,"Parquet or polished wood",null,-0.16967971412043029,null,null,"hc10_1",null,0.14231621232506989]
[null,null,"dishw",null,0.14962030789111944,null,null,"No cooking in HH",null,-0.16291299230601439,null,null,"No cooking in HH",null,-0.13598135655777244]
[null,null,"Coal / Lignite",null,-0.13028486540968437,null,null,"dishw",null,0.14373023879166572,null,null,"bike",null,0.12950312923050403]
[null,null,"bed",null,0.1142531115791465,null,null,"bed",null,0.137514946841127,null,null,"dishw",null,0.12624526156577273]
[null,null,"bike",null,0.1083960565243739,null,null,"hc10_1",null,0.11337861714929874,null,null,"bed",null,0.11060899048564063]
[null,null,"Parquet or polished wood",null,-9.506466671581365E-2,null,null,"Coal / Lignite",null,-0.10363526543389766,null,null,"Coal / Lignite",null,-0.10422199764734086]
[null,null,"Has covered adobe wall",null,-8.4432591483917976E-2,null,null,"motorcycle",null,0.10321587018520817,null,null,"Has covered adobe wall",null,-9.981492224552109E-2]
[null,null,"electricity",null,6.7327521580512556E-2,null,null,"bike",null,0.10095657055385497,null,null,"Has ceramic tile roof",null,7.4297539317580041E-2]
[null,null,"boat",null,5.3878459460142782E-2,null,null,"cart",null,5.5449867203699023E-2,null,null,"Parquet or polished wood",null,-5.9555992254271661E-2]
[null,null,"motorcycle",null,5.256830969972405E-2,null,null,"boat",null,4.9809776948560182E-2,null,null,"motorcycle",null,5.4216312943383332E-2]
[null,null,"Has ceramic tile roof",null,4.5709149736129662E-2,null,null,"Vinyl or asphalt strips",null,-4.1023969803039878E-2,null,null,"electricity",null,5.1271648547412139E-2]
[null,null,"Has cement wall",null,4.0743794547198495E-2,null,null,"Has cement wall",null,3.7439875784973937E-2,null,null,"Has cement wall",null,4.7415505428442133E-2]
[null,null,"Has brick wall",null,-2.960747241023114E-2,null,null,"Has ceramic tile roof",null,2.8885683336969743E-2,null,null,"Has brick wall",null,4.2025953393281114E-2]
[null,null,"Vinyl or asphalt strips",null,-2.6065296715210018E-2,null,null,"Has covered adobe wall",null,-8.1090566775201284E-3,null,null,"boat",null,2.7804193860259487E-2]
[null,null,"cart",null,2.4230185722055101E-2,null,null,"electricity",null,-7.7910845712203273E-3,null,null,"cart",null,2.1756871331822459E-2]
[null,null,null,null,null,null,null,"Has brick wall",null,-6.5004910275322228E-3,null,null,"hc10_2",null,-2.8081460637450852E-3]
[null,null,null,null,null,null,null,"hc10_2",null,3.9190989334351488E-3,null,null,"Vinyl or asphalt strips",null,1.8465520159135259E-3]
[]
[null,null,"Communalities"]
[null,null,null,null,"Extraction"]
[null,null,"Persons per sleeping rooms",null,4.5913638032495901E-2,null,null,"Communalities",null,null,null,null,"Communalities"]
[null,null,"Wood planks",null,0.10636934564738787,null,null,null,null,"Extraction",null,null,null,null,"Extraction"]
[null,null,"Parquet or polished wood",null,9.0372908577887271E-3,null,null,"Persons per sleeping rooms",null,4.7167426586265417E-2,null,null,"Persons per sleeping rooms",null,2.5751845791919279E-2]
[null,null,"Vinyl or asphalt strips",null,6.7939969285193817E-4,null,null,"Wood planks",null,0.10436695697476768,null,null,"Wood planks",null,6.9409891689736214E-2]
[null,null,"ceramic tiles",null,0.40746623046039049,null,null,"Parquet or polished wood",null,2.879120538399095E-2,null,null,"Parquet or polished wood",null,3.546916213390866E-3]
[null,null,"Cement",null,0.1819897192686325,null,null,"Vinyl or asphalt strips",null,1.6829660984007278E-3,null,null,"Vinyl or asphalt strips",null,3.4097543474743063E-6]
[null,null,"Has metal roof",null,0.22414352108538893,null,null,"ceramic tiles",null,0.39696745561659419,null,null,"ceramic tiles",null,0.35308027135205322]
[null,null,"Has ceramic tile roof",null,2.0893263695999221E-3,null,null,"Cement",null,0.1473395592917357,null,null,"Cement",null,0.13538103639450333]
[null,null,"Has cement roof",null,0.15735874247211659,null,null,"Has metal roof",null,0.18222215929136623,null,null,"Has metal roof",null,0.13978460514551863]
[null,null,"Has shingle roof",null,4.0207521669943264E-2,null,null,"Has ceramic tile roof",null,8.3438270184369139E-4,null,null,"Has ceramic tile roof",null,5.5201243486473518E-3]
[null,null,"Has plywood wall",null,6.6475652141693348E-2,null,null,"Has cement roof",null,0.10079978638428901,null,null,"Has cement roof",null,0.10644488933938016]
[null,null,"Has reused wood wall",null,4.5672433511403807E-2,null,null,"Has shingle roof",null,7.0152611026015083E-2,null,null,"Has shingle roof",null,2.3648376739557487E-2]
[null,null,"Has cement wall",null,1.6600567941043218E-3,null,null,"Has plywood wall",null,6.0544206530758413E-2,null,null,"Has plywood wall",null,5.0809213041167547E-2]
[null,null,"Has brick wall",null,8.7660242252259816E-4,null,null,"Has reused wood wall",null,4.4908499504727223E-2,null,null,"Has reused wood wall",null,4.4217632001998179E-2]
[null,null,"Has cement block wall",null,0.20596997001756148,null,null,"Has cement wall",null,1.4017442987942779E-3,null,null,"Has cement wall",null,2.2482301550346253E-3]
[null,null,"Has covered adobe wall",null,7.1288625046901782E-3,null,null,"Has brick wall",null,4.2256383599026936E-5,null,null,"Has brick wall",null,1.7661807586142363E-3]
[null,null,"Has wood plank/shingle wall",null,6.5171984419657158E-2,null,null,"Has cement block wall",null,0.19265987680410965,null,null,"Has cement block wall",null,0.17041120398675483]
[null,null,"electricity",null,4.5329951621743839E-3,null,null,"Has covered adobe wall",null,6.5756800199233791E-5,null,null,"Has covered adobe wall",null,9.9630187028794202E-3]
[null,null,"LPG",null,0.29461538733178638,null,null,"Has wood plank/shingle wall",null,6.2571334287507233E-2,null,null,"Has wood plank/shingle wall",null,3.5412023335869514E-2]
[null,null,"Coal / Lignite",null,1.6974146154819569E-2,null,null,"electricity",null,6.0700998795907429E-5,null,null,"electricity",null,2.6287819447693493E-3]
[null,null,"Charcoal",null,0.11404495121692398,null,null,"LPG",null,0.30883538580030462,null,null,"LPG",null,0.39997869305023764]
[null,null,"Wood",null,0.18902501520159942,null,null,"Coal / Lignite",null,1.0740268241554423E-2,null,null,"Coal / Lignite",null,1.0862224793602323E-2]
[null,null,"No cooking in HH",null,2.5850628274143125E-2,null,null,"Charcoal",null,0.16717267245489578,null,null,"Charcoal",null,7.9830803249299351E-2]
[null,null,"elec",null,0.22641731504065066,null,null,"Wood",null,0.11891911414228847,null,null,"Wood",null,0.2737137299110568]
[null,null,"radio",null,0.17051504873280904,null,null,"No cooking in HH",null,2.6540643062099502E-2,null,null,"No cooking in HH",null,1.8490929331292042E-2]
[null,null,"tv",null,0.31824795825114716,null,null,"elec",null,0.23686954243681063,null,null,"elec",null,0.28264705123289657]
[null,null,"phone",null,0.2336665422942947,null,null,"radio",null,0.18829247051452161,null,null,"radio",null,0.18706068723009101]
[null,null,"fridge",null,0.43920568193262538,null,null,"tv",null,0.29590890202563758,null,null,"tv",null,0.39452907650651892]
[null,null,"chair",null,0.18384749766013034,null,null,"phone",null,0.24088603906584224,null,null,"phone",null,0.12804258565395474]
[null,null,"table",null,0.21733883013964325,null,null,"fridge",null,0.4002378098049017,null,null,"fridge",null,0.48552871850023666]
[null,null,"sofa",null,0.44844792894185043,null,null,"chair",null,0.18885342375987918,null,null,"chair",null,0.17197125281710465]
[null,null,"cabinet",null,0.48736695675881381,null,null,"table",null,0.24501891266918505,null,null,"table",null,0.18314710668756815]
[null,null,"bed",null,1.30537735055169E-2,null,null,"sofa",null,0.44810877309728875,null,null,"sofa",null,0.44224913832146118]
[null,null,"stove",null,0.32394941913564435,null,null,"cabinet",null,0.42379300680883064,null,null,"cabinet",null,0.45159882672718704]
[null,null,"microwave",null,0.4011513358561527,null,null,"bed",null,1.8910360604717985E-2,null,null,"bed",null,1.2234348776252539E-2]
[null,null,"ac",null,9.1869663090760889E-2,null,null,"stove",null,0.25778306916189836,null,null,"stove",null,0.399497659387546]
[null,null,"fan",null,0.30924377549862986,null,null,"microwave",null,0.3833649040681078,null,null,"microwave",null,0.37239513143287223]
[null,null,"washingm",null,0.38769006386584881,null,null,"ac",null,8.4679734353361888E-2,null,null,"ac",null,3.9936756095656521E-2]
[null,null,"dryer",null,6.0615423825242529E-2,null,null,"fan",null,0.25691272428220707,null,null,"fan",null,0.34765726547855191]
[null,null,"dishw",null,2.2386236533433378E-2,null,null,"washingm",null,0.44077180419210121,null,null,"washingm",null,0.31885573047630233]
[null,null,"kettle",null,0.12217755476031586,null,null,"dryer",null,6.5693826177634543E-2,null,null,"dryer",null,3.8722127916884175E-2]
[null,null,"watch",null,0.25812597378102403,null,null,"dishw",null,2.0658381543109249E-2,null,null,"dishw",null,1.5937866067810374E-2]
[null,null,"mobile",null,8.4583589477153831E-2,null,null,"kettle",null,0.14206189864896301,null,null,"kettle",null,7.3255197253682916E-2]
[null,null,"bike",null,1.1749705070035261E-2,null,null,"watch",null,0.24242592858963943,null,null,"watch",null,0.27174785032416165]
[null,null,"motorcycle",null,2.7634271846861016E-3,null,null,"mobile",null,6.2057669256319281E-2,null,null,"mobile",null,0.10538176617262966]
[null,null,"cart",null,5.8710190012528282E-4,null,null,"bike",null,1.0192229137995496E-2,null,null,"bike",null,1.6771060480492626E-2]
[null,null,"car",null,0.23577292330796415,null,null,"motorcycle",null,1.0653515858089744E-2,null,null,"motorcycle",null,2.9394085891748752E-3]
[null,null,"boat",null,2.9028883937982494E-3,null,null,"cart",null,3.0746877729078566E-3,null,null,"cart",null,4.7336145014947797E-4]
[null,null,"Household owns bank account",null,0.19966625259827994,null,null,"car",null,0.24759021902010378,null,null,"car",null,0.18500843241449449]
[null,null,null,null,null,null,null,"boat",null,2.4810138796653174E-3,null,null,"boat",null,7.7307319621889128E-4]
[null,null,null,null,null,null,null,"hc10_1",null,1.2854710826687259E-2,null,null,"hc10_1",null,2.0253904290554372E-2]
[null,null,"Total Variance Explained",null,null,null,null,"hc10_2",null,1.5359336450052521E-5,null,null,"hc10_2",null,7.8856843153270162E-6]
[null,null,"Component",null,"Extraction Sums of Squared Loadings",null,null,"Household owns bank account",null,0.19548467640170278,null,null,"Household owns bank account",null,0.23352514612925382]
[null,null,null,null,"Total","% of Variance","Cumulative %"]
[null,null,"1",null,7.4665962882462518,15.237951608665821,15.237951608665821]
[null,null,null,null,null,null,null,"Total Variance Explained",null,null,null,null,"Total Variance Explained"]
[null,null,null,null,null,null,null,"Component",null,"Extraction Sums of Squared Loadings",null,null,"Component",null,"Extraction Sums of Squared Loadings"]
[null,null,"Component Score Coefficient Matrix",null,null,null,null,null,null,"Total","% of Variance","Cumulative %",null,null,"Total","% of Variance","Cumulative %"]
[null,null,null,null,"Component",null,null,"1",null,7.2004225619594617,14.118475611685218,14.118475611685218,"1",null,7.1450524463256535,14.00990675750128,14.00990675750128]
[null,null,null,null,"1"]
[null,null,"Persons per sleeping rooms",null,-2.8697772139071775E-2]
[null,null,"Wood planks",null,-4.3680296102353584E-2,null,null,"Component Score Coefficient Matrix",null,null,null,null,"Component Score Coefficient Matrix"]
[null,null,"Parquet or polished wood",null,-1.2731995014309576E-2,null,null,null,null,"Component",null,null,null,null,"Component"]
[null,null,"Vinyl or asphalt strips",null,-3.4909208572373768E-3,null,null,null,null,"1",null,null,null,null,"1"]
[null,null,"ceramic tiles",null,8.5491540081286163E-2,null,null,"Persons per sleeping rooms",null,-3.0162206366671714E-2,null,null,"Persons per sleeping rooms",null,-2.245943157676809E-2]
[null,null,"Cement",null,-5.7134806049766708E-2,null,null,"Wood planks",null,-4.4866637867945702E-2,null,null,"Wood planks",null,-3.6872727377015031E-2]
[null,null,"Has metal roof",null,-6.3407470005338529E-2,null,null,"Parquet or polished wood",null,-2.3565243936774612E-2,null,null,"Parquet or polished wood",null,-8.3352771308065569E-3]
[null,null,"Has ceramic tile roof",null,6.1218188276877892E-3,null,null,"Vinyl or asphalt strips",null,-5.6974392058284943E-3,null,null,"Vinyl or asphalt strips",null,2.5843785329569081E-4]
[null,null,"Has cement roof",null,5.3127914469630395E-2,null,null,"ceramic tiles",null,8.7502299831369854E-2,null,null,"ceramic tiles",null,8.3163221614521818E-2]
[null,null,"Has shingle roof",null,2.6855360230998767E-2,null,null,"Cement",null,-5.3309142796591172E-2,null,null,"Cement",null,-5.1496000018114371E-2]
[null,null,"Has plywood wall",null,-3.4530958473822287E-2,null,null,"Has metal roof",null,-5.9284697776807095E-2,null,null,"Has metal roof",null,-5.2326808964490379E-2]
[null,null,"Has reused wood wall",null,-2.8622291870458852E-2,null,null,"Has ceramic tile roof",null,4.0116650222135081E-3,null,null,"Has ceramic tile roof",null,1.0398459616036491E-2]
[null,null,"Has cement wall",null,5.4568096324340539E-3,null,null,"Has cement roof",null,4.409322066621188E-2,null,null,"Has cement roof",null,4.5662216246936824E-2]
[null,null,"Has brick wall",null,-3.965323859392072E-3,null,null,"Has shingle roof",null,3.6784421960653318E-2,null,null,"Has shingle roof",null,2.1522625394566956E-2]
[null,null,"Has cement block wall",null,6.0782601336944415E-2,null,null,"Has plywood wall",null,-3.4172622724692188E-2,null,null,"Has plywood wall",null,-3.1547562776976165E-2]
[null,null,"Has covered adobe wall",null,-1.1308042945462296E-2,null,null,"Has reused wood wall",null,-2.9431086030437308E-2,null,null,"Has reused wood wall",null,-2.9430139422387841E-2]
[null,null,"Has wood plank/shingle wall",null,-3.4190685046611137E-2,null,null,"Has cement wall",null,5.1996775831980304E-3,null,null,"Has cement wall",null,6.6361311949257396E-3]
[null,null,"electricity",null,9.0171637760163952E-3,null,null,"Has brick wall",null,-9.0279299188285918E-4,null,null,"Has brick wall",null,5.8818257401165733E-3]
[null,null,"LPG",null,7.2695084006912603E-2,null,null,"Has cement block wall",null,6.095897488043827E-2,null,null,"Has cement block wall",null,5.7775491861298392E-2]
[null,null,"Coal / Lignite",null,-1.7449030372082109E-2,null,null,"Has covered adobe wall",null,-1.1261917766272596E-3,null,null,"Has covered adobe wall",null,-1.3969795602669225E-2]
[null,null,"Charcoal",null,-4.5228830879853549E-2,null,null,"Has wood plank/shingle wall",null,-3.4739992790299941E-2,null,null,"Has wood plank/shingle wall",null,-2.63372211159973E-2]
[null,null,"Wood",null,-5.8228683440849291E-2,null,null,"electricity",null,-1.0820315758107576E-3,null,null,"electricity",null,7.1758253606351921E-3]
[null,null,"No cooking in HH",null,-2.1533413556723981E-2,null,null,"LPG",null,7.718013671481079E-2,null,null,"LPG",null,8.8514212028181077E-2]
[null,null,"elec",null,6.3728272770296399E-2,null,null,"Coal / Lignite",null,-1.4392942156119136E-2,null,null,"Coal / Lignite",null,-1.45865965897755E-2]
[null,null,"radio",null,5.530427286931202E-2,null,null,"Charcoal",null,-5.6783826959231766E-2,null,null,"Charcoal",null,-3.9543929993363314E-2]
[null,null,"tv",null,7.5554466439391316E-2,null,null,"Wood",null,-4.7892537573068265E-2,null,null,"Wood",null,-7.3222216373591956E-2]
[null,null,"phone",null,6.4740432437255718E-2,null,null,"No cooking in HH",null,-2.2625476616705765E-2,null,null,"No cooking in HH",null,-1.9031540717059526E-2]
[null,null,"fridge",null,8.8758776054005062E-2,null,null,"elec",null,6.7592206902332141E-2,null,null,"elec",null,7.4407516361390397E-2]
[null,null,"chair",null,5.7425685939497234E-2,null,null,"radio",null,6.0264074704233783E-2,null,null,"radio",null,6.0532114069752584E-2]
[null,null,"table",null,6.2437569999424687E-2,null,null,"tv",null,7.5547662449321304E-2,null,null,"tv",null,8.7909151244257758E-2]
[null,null,"sofa",null,8.9687793836216473E-2,null,null,"phone",null,6.8162864202176543E-2,null,null,"phone",null,5.0080862162923553E-2]
[null,null,"cabinet",null,9.3498656481844494E-2,null,null,"fridge",null,8.786199751653892E-2,null,null,"fridge",null,9.7521874535847569E-2]
[null,null,"bed",null,1.5301900245899353E-2,null,null,"chair",null,6.0353776081465117E-2,null,null,"chair",null,5.8039345536929764E-2]
[null,null,"stove",null,7.6228247030269036E-2,null,null,"table",null,6.8745111399142841E-2,null,null,"table",null,5.9895557293737058E-2]
[null,null,"microwave",null,8.4826481098477E-2,null,null,"sofa",null,9.2968053747414181E-2,null,null,"sofa",null,9.3073935266662938E-2]
[null,null,"ac",null,4.0594144356878234E-2,null,null,"cabinet",null,9.041050788416119E-2,null,null,"cabinet",null,9.4052638066511943E-2]
[null,null,"fan",null,7.4477967001088941E-2,null,null,"bed",null,1.9098177316374733E-2,null,null,"bed",null,1.5480500852379519E-2]
[null,null,"washingm",null,8.3391092824336044E-2,null,null,"stove",null,7.0513003036656335E-2,null,null,"stove",null,8.8460970285883525E-2]
[null,null,"dryer",null,3.2973792677106893E-2,null,null,"microwave",null,8.5990048109319275E-2,null,null,"microwave",null,8.5407611441032955E-2]
[null,null,"dishw",null,2.0038622970234562E-2,null,null,"ac",null,4.0413992767405552E-2,null,null,"ac",null,2.7969259735205063E-2]
[null,null,"kettle",null,4.6813708271825925E-2,null,null,"fan",null,7.0393866974094527E-2,null,null,"fan",null,8.2522092917626313E-2]
[null,null,"watch",null,6.8044524511663651E-2,null,null,"washingm",null,9.2203820923080826E-2,null,null,"washingm",null,7.9029947294825542E-2]
[null,null,"mobile",null,3.8951159079639988E-2,null,null,"dryer",null,3.5596253786986304E-2,null,null,"dryer",null,2.7540650041641204E-2]
[null,null,"bike",null,1.451746583580641E-2,null,null,"dishw",null,1.9961361649940754E-2,null,null,"dishw",null,1.7668906213654797E-2]
[null,null,"motorcycle",null,7.0404649816779184E-3,null,null,"kettle",null,5.2345677273256362E-2,null,null,"kettle",null,3.7880334040920852E-2]
[null,null,"cart",null,3.2451447469039833E-3,null,null,"watch",null,6.8380386287970857E-2,null,null,"watch",null,7.2958792509317361E-2]
[null,null,"car",null,6.503157825618304E-2,null,null,"mobile",null,3.4597103927392014E-2,null,null,"mobile",null,4.5433617299678514E-2]
[null,null,"boat",null,7.2159331213550474E-3,null,null,"bike",null,1.4020923034047814E-2,null,null,"bike",null,1.8124867550426603E-2]
[null,null,"Household owns bank account",null,5.984524695222105E-2,null,null,"motorcycle",null,1.433469623442765E-2,null,null,"motorcycle",null,7.5879517121339116E-3]
[null,null,null,null,null,null,null,"cart",null,7.7009184845131338E-3,null,null,"cart",null,3.0450261205585611E-3]
[null,null,null,null,null,null,null,"car",null,6.9104886489211759E-2,null,null,"car",null,6.019914744563766E-2]
[null,null,"Component Score Covariance Matrix",null,null,null,null,"boat",null,6.9176185869576773E-3,null,null,"boat",null,3.8913911506076922E-3]
[null,null,"Component",null,"1",null,null,"hc10_1",null,1.5746106033872109E-2,null,null,"hc10_1",null,1.9918148032385133E-2]
[null,null,"1",null,1.0000000000000002,null,null,"hc10_2",null,5.4428735254235399E-4,null,null,"hc10_2",null,-3.9301965728595541E-4]
[null,null,null,null,null,null,null,"Household owns bank account",null,6.1404242166029403E-2,null,null,"Household owns bank account",null,6.7633428794163286E-2]
[]
[]
[null,null,null,null,null,null,null,"Component Score Covariance Matrix",null,null,null,null,"Component Score Covariance Matrix"]
[null,null,null,null,null,null,null,"Component",null,"1",null,null,"Component",null,"1"]
[null,null,null,null,null,null,null,"1",null,1.0000000000000002,null,null,"1",null,1]
[]
[]
[]
[]
[]
[]
[]
[]
[]
[]
[]
[]
[]
[]
[]
[]
[]
[]
[]
[]
[]
[]
[]
[]
[]
[]
[]
[]
[]
[]
[]
[]
[]
[]
[]
[]
[]
[]
[]
[]
[]
[]
[]
[]
[]
[]
[]
[]
[]
[]
[]
[]
[]
[]
[]
[]
[]
[]
[]
[]
[]
[]
[]
[]
[]
[]
[]
[]
[]
[]
[]
[]
[]
[]
[]
[]
[]
[]
[]
[]
[]
[]
[]
[]
[]
[]
[]
[]
[]
[]
[]
[]
[]
[]
[]
[]
[]
[]
[]
[]
[]
[]
[]
[]
[]
[]
[]
[]
[]
[]
[]
[]
[]
[]
[]
[]
[]
[]
[]
[]
[]
[]
[]
[]
[]
[]
[]
[]
[]
[]
[]
[]
[]
[]
[]
[]
[]
[]
[]
[]
[]
[]
[]
[]
[]
[]
[]
[]
[]
[]
[]
[]
[]
[]
[]
[]
[]
[]
[]
[]
[]
[]
[]
[]
[]
[]
[]
[]
[]
[]
[]
[]
[]
[]
[]
[]
[]
[]
[]
[]
[]
[]
[]
[]
[]
[]
[]
[]
[]
[]
[]
[]
[]
[]
[]
[]
[]
[]
[]
[]
[]
[]
[]
[]
[]
[]
[]
[]
[]
[]
[]
[]
[]
[]
[]
[]
[]
[]
[]
[]
[]
[]
[]
[]
[]
[]
[]
[]
[]
[]
[]
[]
[]
[]
[]
[]
[]
[]
[]
[]
[]
[]
[]
[]
[]
[]
[]
[]
[]
[]
[]
[]
[]
[]
[]
[]
[]
[]
[]
[]
[]
[]
[]
[]
[]
[]
[]
[]
[]
[]
[]
[]
[]
[]
[]
[]
[]
[]
[]
[]
[]
[]
[]
[]
[]
[]
[]
[]
[]
[]
[]
[]
[]
[]
[]
[]
[]
[]
[]
[]
[]
[]
[]
[]
[]
[]
[]
[]
[]
[]
[]
[]
[]
[]
[]
[]
[]
[]
[]
[]
[]
[]
[]
[]
[]
[]
[]
[]
[]
[]
[]
[]
[]
[]
[]
[]
[]
[]
[]
[]
[]
[]
[]
[]
[]
[]
[]
[]
[]
[]
[]
[]
[]
[]
[]
[]
[]
[]
[]
[]
[]
[]
[]
[]
[]
[]
[]
[]
[]
[]
[]
[]
[]
[]
[]
[]
[]
[]
[]
[]
[]
[]
[]
[]
[]
[]
[]
[]
[]
[]
[]
[]
[]
[]
[]
[]
[]
[]
[]
[]
[]
[]
[]
[]
[]
[]
[]
[]
[]
[]
[]
[]
[]
[]
[]
[]
[]
[]
[]
[]
[]
[]
[]
[]
[]
[]
[]
[]
[]
[]
[]
[]
[]
[]
[]
[]
[]
[]
[]
[]
[]
[]
[]
[]
[]
[]
[]
[]
["MICS11"]
["Jamaica",null,"Count"]
["W_text_t","",5960]
["W_text_i","",5960]
["S_text_s","",5960]
["S_text_i","",5960]
["Urban/Rural","Urban",1657]
[null,"Rural",2340]
[null,"3",1963]
[2011,"Missing",0]
[2011]
["Sub-national region names","Weighted population"]
[{"$f":"R15","v":"  KMA"},{"$f":"BR122+BR123","v":6517.2245178852445}]
[{"$f":"S15","v":"  Other towns"},{"$f":"BS122+BS123","v":3861.796423387852}]
[{"$f":"T15","v":"Rural"},{"$f":"BT122+BT123","v":8567.5271460675467}]
[{"$f":"U15","v":0},{"$f":"BU122+BU123","v":0}]
[{"$f":"V15","v":0},{"$f":"BV122+BV123","v":0}]
[{"$f":"W15","v":0},{"$f":"BW122+BW123","v":0}]
[{"$f":"X15","v":0},{"$f":"BX122+XR123","v":0}]
[{"$f":"Y15","v":0},{"$f":"BY122+BY123","v":0}]
[{"$f":"Z15","v":0},{"$f":"BZ122+BZ123","v":0}]
[{"$f":"AA15","v":0},{"$f":"CA122+CA123","v":0}]
[{"$f":"AB15","v":0},{"$f":"CB122+CB123","v":0}]
[{"$f":"AC15","v":0},{"$f":"CC122+CC123","v":0}]
[{"$f":"AD15","v":0},{"$f":"CD122+CD123","v":0}]
[{"$f":"AE15","v":0},{"$f":"CE122+CE123","v":0}]
[{"$f":"AF15","v":0},{"$f":"CF122+CF123","v":0}]
[{"$f":"AG15","v":0},{"$f":"CG122+CG123","v":0}]
[{"$f":"AH15","v":0},{"$f":"CH122+CH123","v":0}]
[{"$f":"AI15","v":0},{"$f":"CI122+CI123","v":0}]
[{"$f":"AJ15","v":0},{"$f":"CJ122+CJ123","v":0}]
[{"$f":"AK15","v":0},{"$f":"CK122+CK123","v":0}]
[{"$f":"AL15","v":0},{"$f":"CL122+CL123","v":0}]
[{"$f":"AM15","v":0},{"$f":"CM122+CM123","v":0}]
[{"$f":"AN15","v":0},{"$f":"CN122+CN123","v":0}]
[{"$f":"AO15","v":0},{"$f":"CO122+CO123","v":0}]
[{"$f":"AP15","v":0},{"$f":"CP122+CP123","v":0}]
[{"$f":"AQ15","v":0},{"$f":"CQ122+CQ123","v":0}]
[{"$f":"AR15","v":0},{"$f":"CR122+CR123","v":0}]
[{"$f":"AS15","v":0},{"$f":"CS122+CS123","v":0}]
[{"$f":"AT15","v":0},{"$f":"CT122+CT123","v":0}]
[{"$f":"AU15","v":0},{"$f":"CU122+CU123","v":0}]
[{"$f":"AV15","v":0},{"$f":"CV122+CV123","v":0}]
[{"$f":"AW15","v":0},{"$f":"CW122+CW123","v":0}]
[{"$f":"AX15","v":0},{"$f":"CX122+CX123","v":0}]
[{"$f":"AY15","v":0},{"$f":"CY122+CY123","v":0}]
[]
[{"$f":"34-COUNTIF(A1037:A1071,\"0\")","v":3},"Sub-regions"]

{"sheet":"data_summary","index":7,"n_rows":146,"n_cols":46,"rows_kept":146,"cut":false,"hidden":false,"merged":[]}
["iso3","year","data_source","row","var1","var2","varname","total_q1","total_q2","total_q3","total_q4","total_q5","urban_q1","urban_q2","urban_q3","urban_q4","urban_q5","rural_q1","rural_q2","rural_q3","rural_q4","rural_q5","region_1_name","region_2_name","region_3_name","region_1","region_2","region_3","n_total_q1","n_total_q2","n_total_q3","n_total_q4","n_total_q5","n_urban_q1","n_urban_q2","n_urban_q3","n_urban_q4","n_urban_q5","n_rural_q1","n_rural_q2","n_rural_q3","n_rural_q4","n_rural_q5","n_region_1","n_region_2","n_region_3"]
["JAM",1997,"JAM_1997_SLC",16,"Water","Improved","w_imp",92.157282790885517,93.468477536272971,92.304807058757831,91.036915798022065,95.368558580822054,96.303374288446037,98.144415027041944,99.000241944985305,96.782955128330897,99.328305465944496,82.205413355444819,89.412997384243667,82.830314876320756,88.051488414527654,92.426669388830177,"None valid","",""]
["JAM",1997,"JAM_1997_SLC",17,"Water","Not Improved","",7.8427172091144826,6.531522463727029,7.6951929412421691,8.9630842019779351,4.6314414191779463,3.6966257115539629,1.855584972958056,0.99975805501469495,3.2170448716691031,0.67169453405550428,17.794586644555181,10.58700261575633,17.16968512367924,11.94851158547235,7.5733306111698226,"None valid","",""]
["JAM",1997,"JAM_1997_SLC",18,"Water ladder","Basic","w_bas",88.655306044831875,90.47748625511224,92.304807058757831,89.762398976849738,94.414872995013823,95.340340545561574,97.948126196987857,98.109239767480432,95.815125577047581,99.32830546594451,77.930731860961686,86.909433457484852,78.771629447381031,86.642664599895213,91.13269601738655,"None valid","",""]
["JAM",1997,"JAM_1997_SLC",19,"Water ladder","Limited","w_lim",3.5019767460536499,2.9909912811607349,0,1.274516821172309,0.95368558580822049,0.96303374288446042,0.1962888300540839,0.89100217750486777,0.96782955128330894,0,4.2746814944831302,2.5035639267588232,4.0586854289397172,1.408823814632443,1.2939733714436219,"None valid","",""]
["JAM",1997,"JAM_1997_SLC",20,"Water ladder","Unimproved","w_unimp",5.2006058184369408,2.2880846669569759,3.901377880844322,3.9746344822929558,1.0692812501237801,3.6966257115539629,1.1146175940513809,0.99975805501469495,3.2170448716691031,0.67169453405549007,8.1434608496995509,4.89985617216945,5.9363777400488829,4.5320229295398349,1.3646678232593961,"None valid","",""]
["JAM",1997,"JAM_1997_SLC",21,"Water ladder","Surface water","w_sur",2.642111390677544,4.2434377967700589,3.7938150603978409,4.9884497196849908,3.562160169054188,0,0.74096737890667297,0,0,0,9.651125794855627,5.6871464435868688,11.23330738363037,7.4164886559325058,6.2086627879104332,"None valid","",""]
["JAM",1997,"JAM_1997_SLC",29,"Piped water","Yes","w_pip",88.173999564911412,82.564250758555687,79.445001501288772,75.031455921947554,80.137779350427948,95.769054431524296,96.145703023549231,96.145454959368749,94.477959060553815,97.933247589145594,63.348329158546058,67.415813455790101,56.505427373387008,69.511281836750513,66.916657597768477,"None valid","",""]
["JAM",1997,"JAM_1997_SLC",30,"Piped water","No","",11.82600043508859,17.435749241444309,20.554998498711232,24.968544078052449,19.862220649572048,4.230945568475704,3.8542969764507689,3.8545450406312511,5.5220409394461853,2.0667524108544062,36.651670841453942,32.584186544209899,43.494572626612992,30.488718163249491,33.083342402231523,"None valid","",""]
["JAM",1997,"JAM_1997_SLC",31,"Piped water on premises","Yes","w_pop",76.325475151455123,63.301068602660578,58.767397625718587,58.034557175765499,71.499518685391209,93.224013600368863,84.859854439396145,87.749565269374912,90.080059724052262,96.162852709817813,31.66723099335065,36.092341879829753,27.723698775588488,35.920592889319693,53.17592429668013,"None valid","",""]
["JAM",1997,"JAM_1997_SLC",32,"Piped water on premises","No","",23.67452484854488,36.698931397339422,41.232602374281413,41.965442824234501,28.500481314608791,6.7759863996311367,15.140145560603861,12.25043473062509,9.919940275947738,3.837147290182187,68.332769006649357,63.907658120170247,72.276301224411512,64.079407110680307,46.82407570331987,"None valid","",""]
["JAM",1997,"JAM_1997_SLC",58,"Water","Indoor tap/pipe","",37.315993918738727,46.706765559892261,40.489887378991362,42.112846050286819,60.464395884153227,43.655979238735483,66.119013720081753,68.654099020161752,72.183861773142326,92.819142557313668,9.8700796352814635,19.504189733278899,11.519169395614581,16.97864762498839,36.426475706721988,"None valid","",""]
["JAM",1997,"JAM_1997_SLC",59,"Water","Outside private pipe/tap","",39.009481232716396,16.59430304276832,18.277510246727228,15.92171112547868,11.03512280123797,49.568034361633387,18.740840719314381,19.09546624921316,17.89619795090994,3.343710152504149,21.797151358069179,16.588152146550851,16.204529379973909,18.941945264331299,16.749448589958131,"None valid","",""]
["JAM",1997,"JAM_1997_SLC",60,"Water","Public standpipe","",11.848524413456291,19.263182155895109,20.677603875570181,16.996898746182062,8.6382606650367375,2.5450408311554331,11.28584858415309,8.3958896899938384,4.397899336501558,1.7703948793277811,31.681098165195419,31.323471575960351,28.781728597798519,33.590688947430827,13.740733301088349,"None valid","",""]
["JAM",1997,"JAM_1997_SLC",61,"Water","Well","",0.49449131257573048,0.65810619626632283,0.2246565249409011,0.27905409554224492,0.36812095425757779,0,0,0,0,0,1.981899514183733,0.50821308598343784,0.92712004425841399,0,0.64161597504919354,"None valid","",""]
["JAM",1997,"JAM_1997_SLC",62,"Water","River, lake, spring, pond","",2.642111390677544,4.2434377967700589,3.7938150603978409,4.9884497196849908,3.562160169054188,0,0.74096737890667297,0,0,0,9.651125794855627,5.6871464435868688,11.23330738363037,7.4164886559325058,6.2086627879104332,"None valid","",""]
["JAM",1997,"JAM_1997_SLC",63,"Water","Rainwater (tank)","",3.6300751455628659,10.35580494749534,12.635149032528171,15.726405780532261,14.86265827613653,0.53431985692174289,1.9987120034927079,2.8547869856165509,2.30499606777708,1.395057876798897,17.535817854109599,21.99718392845357,25.397767458675339,18.540206577777141,24.868395816012519,"None valid","",""]
["JAM",1997,"JAM_1997_SLC",64,"Water","Other","",5.0593225862724456,2.1784003009125819,3.901377880844314,3.9746344822929478,1.0692812501237601,3.69662571155395,1.1146175940513949,0.99975805501470072,3.2170448716690969,0.67169453405549817,7.4828276783049761,4.3916430861860283,5.9363777400488678,4.532022929539842,1.3646678232593781,"None valid","",""]
["JAM",1997,"JAM_1997_SLC",122,"Sanitation","Improved","s_imp",96.050147554150058,94.098477589788303,98.182857518798386,98.8814209829589,100,96.876204327799528,96.169870289434641,98.579403618544958,98.390848141874841,100,90.127138658416797,96.985372180712062,97.239970959281749,100,100,"None valid","",""]
["JAM",1997,"JAM_1997_SLC",123,"Sanitation","Not Improved","",3.9498524458499422,5.9015224102116974,1.8171424812016139,1.1185790170411001,0,3.1237956722004721,3.8301297105653589,1.420596381455042,1.6091518581251589,0,9.8728613415832029,3.0146278192879379,2.7600290407182508,0,0,"None valid","",""]
["JAM",1997,"JAM_1997_SLC",124,"Sanitation ladder","Basic","s_bas",74.92362003540353,79.055450371055386,82.924369702466961,93.80507991786564,99.17673811814862,66.23895096057899,80.540008529160772,91.371633829663807,97.671828866187482,99.772656178099169,70.078745887802285,78.814054807937296,86.407772643621755,97.315726671608004,99.013508349070065,"None valid","",""]
["JAM",1997,"JAM_1997_SLC",125,"Sanitation ladder","Limited","s_lim",21.12652751874657,15.04302721873286,15.25848781633151,5.0763410650933061,0.82326188185136084,30.637253367220531,15.629861760273849,7.2077697888811318,0.71901927568734048,0.22734382190085109,20.048392770614431,18.171317372774791,10.83219831566001,2.6842733283920168,0.98649165092992963,"None valid","",""]
["JAM",1997,"JAM_1997_SLC",126,"Sanitation ladder","Unimproved","s_unimp",0.96692922039351004,1.190524328973495,1.1679298534898519,0.55928950852050718,0,0.85166408960014905,0.94401744662185649,0.44860938326007732,0.81642132776173071,0,1.776483197779342,1.483243558811054,1.39549851401722,0,0,"None valid","",""]
["JAM",1997,"JAM_1997_SLC",127,"Sanitation ladder","Open defecation","s_od",2.9829232254563891,4.7109980812382624,0.64921262771167287,0.55928950852055337,0,2.2721315826003221,2.8861122639435211,0.97198699819498535,0.79273053036344343,0,8.0963781438039444,1.5313842604768531,1.364530526701015,0,0,"None valid","",""]
["JAM",1997,"JAM_1997_SLC",135,"Sanitation type","Sewer connection","s_sew",29.293872954384941,28.91407600971236,24.68792595200458,22.005503181770202,29.33726430635113,36.379125054368558,43.751022403338233,40.732340252218123,41.123177315431263,53.391361211869118,8.1267744201736303,9.1360440441522215,6.7765937848328512,8.4855662465227439,11.346430142523801,"None valid","",""]
["JAM",1997,"JAM_1997_SLC",138,"Sanitation type","Unimproved facilities","",68.054792789318611,69.054792789318597,70.054792789318597,71.054792789318597,72.054792789318597,73.054792789318597,74.054792789318597,75.054792789318597,76.054792789318597,77.054792789318597,78.054792789318597,79.054792789318597,80.054792789318597,81.054792789318597,82.054792789318597,"None valid","",""]
["JAM",1997,"JAM_1997_SLC",139,"Sanitation type","Open defecation","",2.9829232254563891,4.7109980812382624,0.64921262771167287,0.55928950852055337,0,2.2721315826003221,2.8861122639435211,0.97198699819498535,0.79273053036344343,0,8.0963781438039444,1.5313842604768531,1.364530526701015,0,0,"None valid","",""]
["JAM",1997,"JAM_1997_SLC",151,"Shared among all sanitation facilities","Yes","",81.776666027899978,18.990882690670901,8.6435428496141906,2.9926330157126801,0.62829642759712079,88.030912484060792,33.619294269570787,9.7387011506271097,4.212053678611956,0,62.670206095229538,18.31932820134513,4.5341708133000127,1.031381223763518,1.0983363435316651,"None valid","",""]
["JAM",1997,"JAM_1997_SLC",152,"Shared among all sanitation facilities","No","",18.223333972100029,81.009117309329099,91.356457150385808,97.00736698428733,99.371703572402879,11.969087515939201,66.380705730429213,90.261298849372892,95.787946321388034,100,37.329793904770447,81.68067179865487,95.465829186699992,98.968618776236482,98.90166365646833,"None valid","",""]
["JAM",1997,"JAM_1997_SLC",153,"sanitation","WC linked to sewer","",29.293872954384941,28.91407600971236,24.68792595200458,22.005503181770202,29.33726430635113,36.379125054368558,43.751022403338233,40.732340252218123,41.123177315431263,53.391361211869118,8.1267744201736303,9.1360440441522215,6.7765937848328512,8.4855662465227439,11.346430142523801,"None valid","","",null,null,null,149.35766442120081,147.85021629557011,125.393206667155,90.393672898411751,181.46280366554859,99.03261174634099,118.63010311499239,111.7500276304781,115.72194460406899,141.31122197210789,18.99926737695932,22.027838800102469,16.70695969089866,10.126007318496701,40.151581693440683,0]
["JAM",1997,"JAM_1997_SLC",154,"sanitation","WC not linked","",36.044066022815223,22.243185925050589,20.813289246750511,24.660458392902768,43.030128188803857,46.77866779404242,32.349124394645159,34.108271517733947,32.1802917780728,42.348176315823373,9.5616098700928696,17.484961001408578,9.6735467700530062,14.225693897725391,43.54018196894345,"None valid","","",null,null,null,183.77418123558161,113.7390608303249,105.713419791311,101.2996335998178,266.15868547558779,127.34263506159191,87.714063622057438,93.576756477355957,90.556376855820417,112.08316116407509,22.353712935000662,42.157842114567757,23.84908422827721,16.97582416236401,154.07552431151271,0]
["JAM",1997,"JAM_1997_SLC",155,"sanitation","Pit","",31.169703066131639,43.891046693816762,53.157232557555417,52.215459408285923,27.632607504845002,14.035755712066949,21.013740938073092,23.7387918485929,25.087379048370789,4.2604624723075064,73.726390180314169,70.863149383104002,81.721768896283919,77.288739855751871,45.113387888532749,"None valid","","",null,null,null,158.92176694795489,224.43396582826969,269.99254051968461,214.48939926549789,170.91881431266671,38.208657957613468,56.978377129882567,65.127872068434954,70.596692133694887,11.276190463453529,172.36203779652709,170.85754227265721,201.47619027644399,92.230302926152945,159.64262384921309,0]
["JAM",1997,"JAM_1997_SLC",156,"sanitation","Other","",0.50943473121181371,0.24069329018203281,0.69233961597781024,0.55928950852055337,0,0.53431985692174289,0,0.44860938326005101,0.81642132776171528,0,0.48884738561538638,0.98446131085835697,0.46356002212920699,0,0,"None valid","","",null,null,null,2.5974025949835782,1.2307692281901841,3.516483511775732,2.2974358946084981,0,1.454545453190804,0,1.2307692281901841,2.2974358946084981,0,1.142857141792774,2.3736263699829578,1.142857141792774,0,0,0]
["JAM",1997,"JAM_1997_SLC",157,"sanitation","None","",2.9829232254563891,4.7109980812382624,0.64921262771167287,0.55928950852055337,0,2.2721315826003221,2.8861122639435211,0.97198699819498535,0.79273053036344343,0,8.0963781438039444,1.5313842604768531,1.364530526701015,0,0,"None valid","","",null,null,null,15.208724595606331,24.08937726542354,3.2974358946084981,2.2974358946084981,0,6.1852813810110092,7.8256410174071789,2.6666666641831398,2.2307692281901841,0,18.928205113857981,3.6923076845705509,3.364102561026812,0,0,0]
["JAM",2007,"JAM_2007_SLC",16,"Water","Improved","w_imp",86.708435162138358,91.12655358477204,92.442485968698549,92.447039140985041,96.663688552218218,91.08241402148488,98.312863406261201,96.277917720046773,99.572372776007953,96.284712062331153,85.409768344696971,82.852518553472876,84.547870200438652,88.229004268817675,94.280078795978355,"None valid","",""]
["JAM",2007,"JAM_2007_SLC",17,"Water","Not Improved","",13.291564837861641,8.87344641522796,7.5575140313014506,7.5529608590149593,3.3363114477817821,8.9175859785151204,1.687136593738799,3.7220822799532272,0.42762722399204728,3.715287937668847,14.590231655303031,17.14748144652712,15.45212979956135,11.770995731182319,5.7199212040216452,"None valid","",""]
["JAM",2007,"JAM_2007_SLC",18,"Water ladder","Basic","w_bas",83.413514625977101,88.210503870059327,92.442485968698549,91.152780593011244,95.697051666696041,90.171589881270023,98.116237679448673,95.411416460566343,98.576649048247873,96.284712062331153,80.968460390772719,80.532648033975633,80.405024560617164,86.817340200516597,92.960157692834656,"None valid","",""]
["JAM",2007,"JAM_2007_SLC",19,"Water ladder","Limited","w_lim",3.294920536161257,2.9160497147127051,0,1.2942585479737909,0.96663688552218219,0.91082414021484881,0.19662572681252241,0.866501259480421,0.99572372776007956,0,4.4413079539242428,2.3198705194972411,4.1428456398214948,1.411664068301083,1.319921103143697,"None valid","",""]
["JAM",2007,"JAM_2007_SLC",20,"Water ladder","Unimproved","w_unimp",8.4961914242527286,3.0167965113953561,3.480050575778094,3.2263608006145428,2.5907249704386288,8.3548249829865711,1.687136593738799,3.7220822799532409,0,3.715287937668847,6.473288021144171,6.5789055873546687,5.1155462346521006,3.1075201147504292,2.2544595263600371,"None valid","",""]
["JAM",2007,"JAM_2007_SLC",21,"Water ladder","Surface water","w_sur",4.7953734136089201,5.8566499038326238,4.0774634555233593,4.3266000584004107,0.74558647734314776,0.5627609955285634,0,0,0.42762722399205139,0,8.1169436341588685,10.56857585917246,10.33658356490923,8.6634756164318958,3.465461677661609,"None valid","",""]
["JAM",2007,"JAM_2007_SLC",29,"Piped water","Yes","w_pip",74.078691728882603,75.242750796430613,78.336373148885244,67.042986336180533,90.321093399715394,89.307494637656703,95.495964531065312,93.294361821280759,94.918350421243886,95.503958350838218,64.996517906289455,57.470507957018953,50.598091221789318,46.613968677560187,65.193069926960689,"None valid","",""]
["JAM",2007,"JAM_2007_SLC",30,"Piped water","No","",25.9213082711174,24.757249203569391,21.66362685111476,32.957013663819467,9.6789066002846056,10.692505362343301,4.5040354689346884,6.7056381787192407,5.0816495787561138,4.4960416491617821,35.003482093710552,42.529492042981047,49.401908778210682,53.386031322439813,34.806930073039311,"None valid","",""]
["JAM",2007,"JAM_2007_SLC",31,"Piped water on premises","Yes","w_pop",62.321987394365308,67.461511453908358,73.876105952794518,60.333668790540372,89.670718212506245,86.619692070001236,91.621610472266809,88.533354111206876,94.918350421243886,95.503958350838218,46.582338622995223,43.155103375646362,39.948535535535882,39.596932027232043,60.201131192070093,"None valid","",""]
["JAM",2007,"JAM_2007_SLC",32,"Piped water on premises","No","",37.678012605634692,32.538488546091642,26.123894047205479,39.666331209459628,10.329281787493761,13.380307929998761,8.3783895277331908,11.466645888793121,5.0816495787561138,4.4960416491617821,53.417661377004777,56.844896624353638,60.051464464464118,60.403067972767957,39.798868807929907,"None valid","",""]
["JAM",2007,"JAM_2007_SLC",58,"Water","Indoor tap/pipe","",20.564351731727552,42.808205887382783,55.532235801669017,49.594825972622012,86.338584111459028,38.79118185635604,64.377147186986662,78.718886370191768,89.070436416596777,93.976343647327923,9.6201932067813605,21.493678399117879,17.79073880862304,26.33588926008396,54.105013300827473,"None valid","",""]
["JAM",2007,"JAM_2007_SLC",59,"Water","Outside private pipe/tap","",41.75763566263776,24.653305566525571,18.3438701511255,10.738842817918361,3.332134101047219,47.828510213645188,27.244463285280151,9.8144677410151111,5.8479140046471043,1.527614703510296,36.962145416213858,21.66142497652848,22.157796726912839,13.261042767148091,6.0961178912426304,"None valid","",""]
["JAM",2007,"JAM_2007_SLC",60,"Water","Public standpipe","",11.756704334517289,7.7812393425222526,4.4602671960907276,6.7093175456401646,0.65037518720914544,2.687802567655464,3.8743540587985068,4.7610077100738781,0,0,18.414179283294231,14.31540458137259,10.649555686253439,7.0170366503281434,4.9919387348905939,"None valid","",""]
["JAM",2007,"JAM_2007_SLC",61,"Water","Well","",0,0.23000376727962671,0.24559450723879889,0,0,0,0,0,0,0,0,0,0.95697050568974462,0,0,"None valid","",""]
["JAM",2007,"JAM_2007_SLC",62,"Water","River, lake, spring, pond","",4.7953734136089201,5.8566499038326238,4.0774634555233593,4.3266000584004107,0.74558647734314776,0.5627609955285634,0,0,0.42762722399205139,0,8.1169436341588685,10.56857585917246,10.33658356490923,8.6634756164318958,3.465461677661609,"None valid","",""]
["JAM",2007,"JAM_2007_SLC",63,"Water","Rainwater (tank) PID","",2.0476640256713621,6.5026330157933767,4.0468870857395327,7.4761936249009873,3.839922590023936,0.55155776515825883,2.126230513952942,1.607609236098716,3.850169676540133,0.78075371149293293,2.8658679981824098,8.1124562311023674,9.8410094173924012,11.99950298813267,11.9939942355907,"None valid","",""]
["JAM",2007,"JAM_2007_SLC",64,"Water","Rainwater (tank) NPID","",9.8990888794463849,8.5578459398661018,8.4279449103942206,15.84071407104129,1.733927754047091,1.2233616186699099,0.69066836124294184,1.375946662667296,0,0,16.523290484944649,15.27083634352169,21.2576177556051,26.65887912195145,11.523451361491,"None valid","",""]
["JAM",2007,"JAM_2007_SLC",65,"Water","Trucked water PID","",0,0.41437750929947159,0.21061317192912599,0.38131574004793722,0.58630836486546944,0,0,0,0.47444131180624999,0,0,0.97546498223973921,0.38528471565290018,0,3.867473379111972,"None valid","",""]
["JAM",2007,"JAM_2007_SLC",66,"Water","Trucked water NPID","",0.68299052813801264,0.21727651731612549,0.82482767372656896,1.384554329624311,0,0,0,0,0,0,1.0240919552804599,1.0232530395901129,1.508896584309199,2.1743807963499422,0.85104494641200756,"None valid","",""]
["JAM",2007,"JAM_2007_SLC",67,"Water","Bottled water","",0,0,0.35024547078506779,0.3212750391899899,0.18243644356633551,0,0,0,0.32941136641768942,0,0,0,0,0.78227268482342593,0.85104494641200756,"None valid","",""]
["JAM",2007,"JAM_2007_SLC",68,"Water","Other","",0.50053691876912476,0.37540799066919678,0.74555755616553143,0.13001044090488961,0.3634516345476817,0,0,0,0,0.64074243099312744,0.65592218273434255,1.356562263288621,1.363883979330466,0.22895830746700499,0,"None valid","",""]
["JAM",2007,"JAM_2007_SLC",69,"Water","12","",0,0,0.33313297979744738,0.17996621883350589,1.986875368249059,0,0,0.41785278251554508,0,3.0745455066757228,0,0,0,0.31693424450040819,1.1330307619643081,"None valid","",""]
["JAM",2007,"JAM_2007_SLC",70,"Water","13","",7.9956545054835964,2.603054559512866,2.4013600398150921,2.916384140876136,0.24039796764188481,8.3548249829865799,1.6871365937388021,3.3042294974376909,0,0,5.8173658384098141,5.2223433240660571,3.751662255321647,2.5616275627830238,1.1214287643957099,"None valid","",""]
["JAM",2007,"JAM_2007_SLC",122,"Sanitation","Improved","s_imp",92.538179072193174,96.824048609791873,99.257017934272724,99.817748232023206,99.999999999999986,91.783911163876525,96.844814757032481,99.677982065456689,100,100,92.133040881427718,97.97359541770561,98.451608293718749,100,99.999999999999986,"None valid","",""]
["JAM",2007,"JAM_2007_SLC",123,"Sanitation","Not Improved","",7.4618209278068264,3.1759513902081271,0.74298206572727565,0.1822517679767941,0,8.2160888361234754,3.1551852429675189,0.32201793454331101,0,0,7.8669591185722823,2.0264045822943899,1.5483917062812509,0,0,"None valid","",""]
["JAM",2007,"JAM_2007_SLC",124,"Sanitation ladder","Basic","s_bas",72.18411990116266,81.345298730175514,83.831596051990289,94.69333831418146,99.176738118148606,62.757103591532207,81.105258674694255,92.389888190106049,99.269221386677557,99.772656178099169,71.638443824013564,79.6171231326921,87.484437746333441,97.315726671608004,99.013508349070051,"None valid","",""]
["JAM",2007,"JAM_2007_SLC",125,"Sanitation ladder","Limited","s_lim",20.35405917103057,15.4787498796163,15.42542188228251,5.1244099178417919,0.82326188185136084,29.02680757234431,15.739556082338201,7.2880938753506177,0.73077861332239924,0.22734382190085109,20.494597057414079,18.35647228501352,10.967170547385329,2.6842733283920168,0.98649165092992941,"None valid","",""]
["JAM",2007,"JAM_2007_SLC",126,"Sanitation ladder","Unimproved","s_unimp",1.8897796859250631,1.575908635589514,0.34180449343071467,0,0,2.555764684172388,1.8941410941126831,0,0,0,1.402032143581408,0.4983862212855712,1.2448479823932099,0,0,"None valid","",""]
["JAM",2007,"JAM_2007_SLC",127,"Sanitation ladder","Open defecation","s_od",5.5720412418817107,1.6000427546186671,0.40117757229648288,0.18225176797680739,0,5.660324151951091,1.261044148854862,0.32201793454331062,0,0,6.4649269749909646,1.5280183610088081,0.30354372388802581,0,0,"None valid","",""]
["JAM",2007,"JAM_2007_SLC",135,"Sanitation type","Sewer connection","s_sew",12.102619740463149,19.891603518276099,18.880876289601911,19.747861840300981,38.583850462799298,23.601857383461091,32.399781032066223,34.709395628070929,38.525311189980997,50.650178416101618,4.2525722569244433,2.9620972572799951,2.7585628526078652,5.8593772599789107,4.4589752880074833,"None valid","",""]
["JAM",2007,"JAM_2007_SLC",139,"Sanitation type","Open defecation","",5.5720412418817107,1.6000427546186671,0.40117757229648288,0.18225176797680739,0,5.660324151951091,1.261044148854862,0.32201793454331062,0,0,6.4649269749909646,1.5280183610088081,0.30354372388802581,0,0,"None valid","",""]
["JAM",2007,"JAM_2007_SLC",151,"Shared among all sanitation facilities","Yes","",52.867889399639822,21.165668496325779,8.5563477497872373,2.550669678122401,1.033328659292722,60.945745562346943,22.881355127257638,5.5360568982480283,1.858142740461415,0.30582203359567128,47.717562361255062,16.441847244774632,7.4722381045868174,3.1856087389560459,0.76655068459660891,"None valid","",""]
["JAM",2007,"JAM_2007_SLC",152,"Shared among all sanitation facilities","No","",47.132110600360178,78.834331503674221,91.443652250212764,97.449330321877596,98.966671340707279,39.05425443765305,77.118644872742365,94.463943101751966,98.141857259538597,99.694177966404325,52.282437638744938,83.558152755225365,92.527761895413192,96.814391261043951,99.233449315403391,"None valid","",""]
["JAM",2007,"JAM_2007_SLC",153,"sanitation","WC linked to sewer","",12.102619740463149,19.891603518276099,18.880876289601911,19.747861840300981,38.583850462799298,23.601857383461091,32.399781032066223,34.709395628070929,38.525311189980997,50.650178416101618,4.2525722569244433,2.9620972572799951,2.7585628526078652,5.8593772599789107,4.4589752880074833,"None valid","","",null,null,null,66.334586620330811,110.8813011050224,87.813646733760834,128.8277231454849,207.27852004766461,71.21386581659317,100.54173094034191,128.1527684926987,96.543859958648682,153.18347960710531,10.47867786884308,7.049747109413147,6.9656176567077637,21.765908718109131,5.2401214838027954,0]
["JAM",2007,"JAM_2007_SLC",154,"sanitation","WC not linked","",20.049798918126321,38.652960119629263,42.514090143150547,50.925906367821987,56.706584609392749,35.461132751738887,43.20136794832684,51.713366811219871,56.065676554700808,44.849893437796233,9.0060997185428615,24.702999424600431,31.985160984431172,51.020375499098392,85.548157721289414,"None valid","","",null,null,null,109.8931596279144,215.46229320764539,197.7300860285759,332.22171694040298,304.63670146465302,106.99684810638431,134.0607922077179,190.9342126250267,140.49975609779361,135.6414321064949,22.191749393939968,58.792768657207489,80.765389084815979,189.52608555555341,100.53492343425749,0]
["JAM",2007,"JAM_2007_SLC",155,"sanitation","Pit","",61.285277377519051,39.126201638395052,38.203855994951063,29.14398002390022,4.7095649278079366,33.477845078664203,22.242901821515339,13.25521962616588,5.4090122553181832,4.4999281461021559,80.276401049541732,70.806884957110753,64.442776824503085,43.120247240922701,9.9928669907030923,"None valid","","",null,null,null,335.90525257587427,218.10027235746381,177.68348580598831,190.12451171875,25.300524353981022,101.0126757621765,69.023301362991333,48.940439939498901,13.55490469932556,13.60932326316833,197.8074671626091,168.51932573318479,162.72376888990399,160.17937123775479,11.74346876144409,0]
["JAM",2007,"JAM_2007_SLC",156,"sanitation","Other","",0.99026272200976106,0.72919196908094353,0,0,0,1.7988406341847269,0.89490504923673486,0,0,0,0,0,0.50995561456985572,0,0,"None valid","","",null,null,null,5.427640438079834,4.0647177696228027,0,0,0,5.427640438079834,2.7770342826843262,0,0,0,0,0,1.287683486938477,0,0,0]
["JAM",2007,"JAM_2007_SLC",157,"sanitation","None","",5.5720412418817107,1.6000427546186671,0.40117757229648288,0.18225176797680739,0,5.660324151951091,1.261044148854862,0.32201793454331062,0,0,6.4649269749909646,1.5280183610088081,0.30354372388802581,0,0,"None valid","","",null,null,null,30.540416896343231,8.9190809726715088,1.865849077701569,1.1889429092407231,0,17.078891634941101,3.9132227897644039,1.1889429092407231,0,0,15.93009668588638,3.6366608142852779,0.76647502183914185,0,0,0]
["JAM",2011,"JAM_2011_MICS",16,"Water","Improved","w_imp",92,96.099999999999994,99.900000000000006,96.799999999999997,99.099999999999994,98.700000000000003,99.700000000000003,100,100,99.299999999999997,87.099999999999994,95,93.400000000000006,97,98.599999999999994,"  KMA","  Other towns","Rural",99.900000000000006,99.599999999999994,94.200000000000003]
["JAM",2011,"JAM_2011_MICS",17,"Water","Not Improved","",8,3.8999999999999999,0.10000000000000001,3.2000000000000002,0.90000000000000002,1.3,0.29999999999999999,0,0,0.69999999999999996,12.9,5,6.5999999999999996,3,1.3999999999999999,"  KMA","  Other towns","Rural",0.10000000000000001,0.40000000000000002,5.7999999999999998]
["JAM",2011,"JAM_2011_MICS",18,"Water ladder","Basic","w_bas",87.900000000000006,92.799999999999997,99.900000000000006,95.400000000000006,98.099999999999994,97.599999999999994,99.5,99.099999999999994,99,99.299999999999997,81.299999999999997,92,88.599999999999994,95.400000000000006,97.200000000000003,"  KMA","  Other towns","Rural",99.900000000000006,98.900000000000006,91.099999999999994]
["JAM",2011,"JAM_2011_MICS",19,"Water ladder","Limited","w_lim",3.3999999999999999,3.1000000000000001,0,1.3999999999999999,1,1,0.20000000000000001,0.90000000000000002,1,0,4.5,2.7000000000000002,4.5999999999999996,1.5,1.3999999999999999,"  KMA","  Other towns","Rural",0,0.59999999999999998,2.8999999999999999]
["JAM",2011,"JAM_2011_MICS",20,"Water ladder","Unimproved","w_unimp",6.0999999999999996,3.6000000000000001,0.10000000000000001,3,0.80000000000000004,1.3999999999999999,0.29999999999999999,0,0,0.69999999999999996,9.9000000000000004,3.8999999999999999,6,2.5,1.1000000000000001,"  KMA","  Other towns","Rural",0.10000000000000001,0.5,4.5999999999999996]
["JAM",2011,"JAM_2011_MICS",21,"Water ladder","Surface water","w_sur",2.6000000000000001,0.59999999999999998,0,0.29999999999999999,0.20000000000000001,0,0,0,0,0,4.2999999999999998,1.3999999999999999,0.80000000000000004,0.59999999999999998,0.20000000000000001,"  KMA","  Other towns","Rural",0,0,1.3999999999999999]
["JAM",2011,"JAM_2011_MICS",22,"Improved water point at more than 30 minutes","Yes","",3.7999999999999998,3.2000000000000002,0,1.3999999999999999,1,1,0.20000000000000001,0.90000000000000002,1,0,5.2000000000000002,2.7999999999999998,4.9000000000000004,1.6000000000000001,1.3999999999999999,"  KMA","  Other towns","Rural",0,0.59999999999999998,3.1000000000000001]
["JAM",2011,"JAM_2011_MICS",23,"Improved water point at more than 30 minutes","No","",96.200000000000003,96.799999999999997,100,98.599999999999994,99,99,99.799999999999997,99.099999999999994,99,100,94.799999999999997,97.200000000000003,95.099999999999994,98.400000000000006,98.599999999999994,"  KMA","  Other towns","Rural",100,99.400000000000006,96.900000000000006]
["JAM",2011,"JAM_2011_MICS",24,"Manually calculated ratios","Improved wells","",71.428571428571431,83.333333333333343,100,100,100,100,100,100,100,100,66.666666666666671,0,100,100,100,"  KMA","  Other towns","Rural",100,100,80]
["JAM",2011,"JAM_2011_MICS",29,"Piped water","Yes","w_pip",63.100000000000001,73.799999999999997,99.700000000000003,73.799999999999997,83.900000000000006,91,95.400000000000006,90.599999999999994,93.799999999999997,93.400000000000006,50.799999999999997,64.599999999999994,64.099999999999994,65.700000000000003,79.5,"  KMA","  Other towns","Rural",99.700000000000003,92.799999999999997,65]
["JAM",2011,"JAM_2011_MICS",30,"Piped water","No","",36.899999999999999,26.199999999999999,0.29999999999999999,26.199999999999999,16.100000000000001,9,4.5999999999999996,9.4000000000000004,6.2000000000000002,6.5999999999999996,49.200000000000003,35.399999999999999,35.899999999999999,34.299999999999997,20.5,"  KMA","  Other towns","Rural",0.29999999999999999,7.2000000000000002,35]
["JAM",2011,"JAM_2011_MICS",31,"Piped water on premises","Yes","w_pop",38.5,57.299999999999997,97,67.299999999999997,81.299999999999997,69.099999999999994,81.099999999999994,89,92.900000000000006,93.400000000000006,21.699999999999999,42.899999999999999,50.5,58.600000000000001,75.099999999999994,"  KMA","  Other towns","Rural",97,85.099999999999994,49.799999999999997]
["JAM",2011,"JAM_2011_MICS",32,"Piped water on premises","No","",61.5,42.700000000000003,3,32.700000000000003,18.699999999999999,30.899999999999999,18.899999999999999,11,7.0999999999999996,6.5999999999999996,78.299999999999997,57.100000000000001,49.5,41.399999999999999,24.899999999999999,"  KMA","  Other towns","Rural",3,14.9,50.200000000000003]
["JAM",2011,"JAM_2011_MICS",35,"Water source on premises","Yes","",60.799999999999997,75,97.099999999999994,86.900000000000006,93.900000000000006,77.900000000000006,83.5,95.700000000000003,97.799999999999997,98.299999999999997,47.600000000000001,67,75.099999999999994,85.400000000000006,91.200000000000003,"  KMA","  Other towns","Rural",97.099999999999994,90.700000000000003,73.299999999999997]
["JAM",2011,"JAM_2011_MICS",36,"Water source on premises","No","",39.200000000000003,25,2.8999999999999999,13.1,6.0999999999999996,22.100000000000001,16.5,4.2999999999999998,2.2000000000000002,1.7,52.399999999999999,33,24.899999999999999,14.6,8.8000000000000007,"  KMA","  Other towns","Rural",2.8999999999999999,9.3000000000000007,26.699999999999999]
["JAM",2011,"JAM_2011_MICS",37,"Improved Water source on premises","Yes","w_premises",59.799999999999997,74.599999999999994,97.099999999999994,86.099999999999994,93.5,77.5,83.5,95.700000000000003,97.799999999999997,97.599999999999994,46.799999999999997,65.799999999999997,74.400000000000006,84.099999999999994,90.700000000000003,"  KMA","  Other towns","Rural",97.099999999999994,90.400000000000006,72.400000000000006]
["JAM",2011,"JAM_2011_MICS",38,"Improved Water source on premises","No","",40.200000000000003,25.399999999999999,2.8999999999999999,13.9,6.5,22.5,16.5,4.2999999999999998,2.2000000000000002,2.3999999999999999,53.200000000000003,34.200000000000003,25.600000000000001,15.9,9.3000000000000007,"  KMA","  Other towns","Rural",2.8999999999999999,9.5999999999999996,27.600000000000001]
["JAM",2011,"JAM_2011_MICS",41,"Water point at more than 30 minutes","Yes","",4.7999999999999998,3.5,0,1.8999999999999999,1.2,1,0.20000000000000001,0.90000000000000002,1,0,7.5,2.7000000000000002,5.7000000000000002,1.8999999999999999,1.6000000000000001,"  KMA","  Other towns","Rural",0,0.59999999999999998,3.7999999999999998]
["JAM",2011,"JAM_2011_MICS",42,"Water point at more than 30 minutes","No","w_30min",95.200000000000003,96.5,100,98.099999999999994,98.799999999999997,99,99.799999999999997,99.099999999999994,99,100,92.5,97.299999999999997,94.299999999999997,98.099999999999994,98.400000000000006,"  KMA","  Other towns","Rural",100,99.400000000000006,96.200000000000003]
["JAM",2011,"JAM_2011_MICS",58,"Main source of drinking water","Piped into dwelling","",14,30.899999999999999,70.900000000000006,52,67.599999999999994,21.699999999999999,44.299999999999997,67.799999999999997,81.599999999999994,78.099999999999994,7.0999999999999996,18.899999999999999,30.100000000000001,46.399999999999999,61.600000000000001,"  KMA","  Other towns","Rural",70.900000000000006,58.700000000000003,32.799999999999997]
["JAM",2011,"JAM_2011_MICS",59,"Main source of drinking water","Piped into compound, yard or plot","",24.399999999999999,26.199999999999999,17.699999999999999,14.4,7.0999999999999996,47.299999999999997,36.100000000000001,19.800000000000001,4.5,1.6000000000000001,14.4,23.899999999999999,20.100000000000001,11.1,9,"  KMA","  Other towns","Rural",17.699999999999999,21.800000000000001,15.699999999999999]
["JAM",2011,"JAM_2011_MICS",60,"Main source of drinking water","Piped to neighbour","",7.7999999999999998,4.5999999999999996,1.3999999999999999,1.3999999999999999,0.29999999999999999,9,4.9000000000000004,1,0.5,0,9,6.2000000000000002,2.8999999999999999,1.1000000000000001,0.40000000000000002,"  KMA","  Other towns","Rural",1.3999999999999999,3.1000000000000001,3.8999999999999999]
["JAM",2011,"JAM_2011_MICS",61,"Main source of drinking water","Public tap / standpipe","",16.800000000000001,10.9,1.2,5,2.2999999999999998,12.699999999999999,8.6999999999999993,0.69999999999999996,0.40000000000000002,0,20,15.5,9.5999999999999996,5.7000000000000002,4,"  KMA","  Other towns","Rural",1.2,4.5,11]
["JAM",2011,"JAM_2011_MICS",62,"Main source of drinking water","Tube well, Borehole","",0,0,0,0,0,0,0,0,0,0,0.10000000000000001,0,0,0,0,"  KMA","  Other towns","Rural",0,0,0]
["JAM",2011,"JAM_2011_MICS",63,"Main source of drinking water","Protected well","",0.5,0.5,0.10000000000000001,0.69999999999999996,0.29999999999999999,0.80000000000000004,1,0,0,0.59999999999999998,0.59999999999999998,0,0.40000000000000002,0.90000000000000002,0.20000000000000001,"  KMA","  Other towns","Rural",0.10000000000000001,0.5,0.40000000000000002]
["JAM",2011,"JAM_2011_MICS",64,"Main source of drinking water","Unprotected well","",0.20000000000000001,0.10000000000000001,0,0,0,0,0,0,0,0,0.29999999999999999,0.10000000000000001,0,0,0,"  KMA","  Other towns","Rural",0,0,0.10000000000000001]
["JAM",2011,"JAM_2011_MICS",65,"Main source of drinking water","Protected spring","",3.2999999999999998,1.6000000000000001,0,0.90000000000000002,0.69999999999999996,0,0.20000000000000001,0,0,0,5.0999999999999996,3.6000000000000001,1,2.1000000000000001,0.69999999999999996,"  KMA","  Other towns","Rural",0,0,2.5]
["JAM",2011,"JAM_2011_MICS",66,"Main source of drinking water","Unprotected spring","",3.3999999999999999,1.5,0,2.2000000000000002,0.29999999999999999,0.80000000000000004,0,0,0,0,6.5999999999999996,1,3.7000000000000002,1.3999999999999999,0.29999999999999999,"  KMA","  Other towns","Rural",0,0.20000000000000001,2.6000000000000001]
["JAM",2011,"JAM_2011_MICS",67,"Main source of drinking water","Rainwater collection","",21.5,15.6,0,16.199999999999999,10.1,6.4000000000000004,2,6.5999999999999996,4.5,3.1000000000000001,25.800000000000001,23.199999999999999,21.199999999999999,22.600000000000001,11.9,"  KMA","  Other towns","Rural",0,4.5,20.899999999999999]
["JAM",2011,"JAM_2011_MICS",68,"Main source of drinking water","Tanker-truck","",1.5,1.8999999999999999,0,4.2999999999999998,1.6000000000000001,0.5,0.5,2.2999999999999998,1.1000000000000001,0.29999999999999999,1.8,1.3999999999999999,3.3999999999999999,4.2000000000000002,2.7000000000000002,"  KMA","  Other towns","Rural",0,0.90000000000000002,2.7000000000000002]
["JAM",2011,"JAM_2011_MICS",69,"Main source of drinking water","Cart with small tank / drum","",1.7,2.5,0,0.40000000000000002,0.20000000000000001,0,0.29999999999999999,0,0,0,2.2999999999999998,1.8999999999999999,3.2999999999999998,0.59999999999999998,0.20000000000000001,"  KMA","  Other towns","Rural",0,0.10000000000000001,1.7]
["JAM",2011,"JAM_2011_MICS",70,"Main source of drinking water","Surface water (river, stream, dam, lake, pond, canal, irrigation channel)","",2.3999999999999999,0.5,0,0.29999999999999999,0.20000000000000001,0,0,0,0,0,3.8999999999999999,1.3,0.80000000000000004,0.5,0.20000000000000001,"  KMA","  Other towns","Rural",0,0,1.3999999999999999]
["JAM",2011,"JAM_2011_MICS",71,"Main source of drinking water","Bottled water","",0.5,1.5,8.5,1.5,8.8000000000000007,0.29999999999999999,1.8,1.8999999999999999,7.5999999999999996,15.6,0.90000000000000002,0.29999999999999999,1.5,2.2999999999999998,7.7999999999999998,"  KMA","  Other towns","Rural",8.5,5.4000000000000004,2.6000000000000001]
["JAM",2011,"JAM_2011_MICS",72,"Main source of drinking water","Other","",2,1.7,0.10000000000000001,0.80000000000000004,0.5,0.20000000000000001,0.29999999999999999,0,0,0.69999999999999996,2,2.3999999999999999,2.2000000000000002,1.1000000000000001,0.80000000000000004,"  KMA","  Other towns","Rural",0.10000000000000001,0.20000000000000001,1.7]
["JAM",2011,"JAM_2011_MICS",73,"Main source of drinking water","Missing","",0.10000000000000001,0.10000000000000001,0,0,0,0.20000000000000001,0,0,0,0,0,0.10000000000000001,0,0,0,"  KMA","  Other towns","Rural",0,0,0]
["JAM",2011,"JAM_2011_MICS",122,"Sanitation","Improved","s_imp",97.126589386503468,98.701164653615791,99.338241192330742,99.646660872775001,99.699865579320019,96.393922780107857,98.134838373029567,99.665800157542208,100,100,96.543352655816562,98.559061763427934,99.089581637490724,99.442965156007048,99.566436625103123,"  KMA","  Other towns","Rural",99.338241192330742,98.840227953534651,98.640349843805126,3680.3287632351471,2493.3035689941889,6474.0962106225616,2316.0905658718361,3778.3242397208292,744.19692313213068,754.90156937684753,775.38822540550234,769.92919558307415,772.59247448044982,1654.191283164442,1689.284799254604,1695.429787319558,1706.9640793588519,1705.168800746548,6474.0962106225616,3817.0083879780009,8451.0387498440032]
["JAM",2011,"JAM_2011_MICS",123,"Sanitation","Not Improved","",2.87341061349652,1.298835346384265,0.66175880766921646,0.35333912722500571,0.30013442067996221,3.60607721989214,1.865161626970449,0.33419984245779127,0,0,3.456647344183426,1.440938236572058,0.9104183625092912,0.5570348439929651,0.43356337489688263,"  KMA","  Other towns","Rural",0.66175880766921646,1.159772046465344,1.3596501561948391,108.8795127702269,32.810056659823381,43.128307262683251,8.212672777506123,11.37418942583697,27.840256877422171,14.347742990000491,2.6000355424280941,0,0,59.226821406406238,24.69742524080263,15.57732291541881,9.5616463985719804,7.425180262343023,43.128307262683251,44.788035409850742,116.48839622354259]
["JAM",2011,"JAM_2011_MICS",124,"Sanitation ladder","Basic","s_bas",75.763295151904444,82.92233013434074,83.900196494571134,94.531034180121935,98.879074589748413,65.90919171775559,82.185623166426737,92.378596979280559,99.269221386677557,99.772656178099169,75.067700790605542,80.092895670575274,88.051343053868166,96.773644165362199,98.584222040668024,"  KMA","  Other towns","Rural",83.900196494571134,87.914409161650696,87.706635829259596,2870.2953173173701,2091.7011807971098,5466.3006053306999,2197.1878889772902,3739.157415731469,508.84346510485,629.21077077894915,718.69464012720221,764.3027176840277,770.8360332212477,1286.223576031309,1372.2219618700699,1506.564740309075,1661.144497851391,1680.2993998451229,5466.3006053306999,3391.887626916272,7506.4541759069671]
["JAM",2011,"JAM_2011_MICS",125,"Sanitation ladder","Limited","s_lim",21.363294234599081,15.778834519274991,15.438044697759681,5.1156266926531124,0.82079098957158725,30.484731062352271,15.949215206602799,7.287203178261632,0.73077861332239924,0.22734382190085109,21.475651865210921,18.46616609285266,11.03823858362257,2.6693209906448652,0.98221458443508203,"  KMA","  Other towns","Rural",15.438044697759681,10.92581879188389,10.93371401454551,809.34921430092436,398.01832319593069,1005.825928929102,118.9026768945465,31.038586557932511,235.35345802728071,122.1067335967516,56.693585278299977,5.626477899046292,1.7564412592022129,367.96770713313123,316.3786057676798,188.8650470104827,45.819581507462019,16.741163469997911,1005.825928929102,421.5366960605806,935.7721048887538]
["JAM",2011,"JAM_2011_MICS",126,"Sanitation ladder","Unimproved","s_unimp",1.8801943328279791,1.127985767810864,0.52297494286649926,0.35333912722495242,0.30013442067999979,2.5581760414236872,1.8651616269704621,0.3341998424578092,4.32986979604e-14,-1.9900747716399999e-14,1.9336271631232209,1.2400188755428749,0.65853564980837132,0.55703484399293579,0.43356337489689389,"  KMA","  Other towns","Rural",0.52297494286649926,0.95008460689384722,0.96417275918548973,71.251275164319608,28.500325536058352,34.086184791874338,8.212672777506123,11.37418942583697,19.750070169887429,14.347742990000491,2.6000355424280941,0,0,33.131117887851133,21.25507786098516,11.26759179165378,9.5616463985719804,7.425180262343023,34.086184791874338,36.697848702316001,82.640614201405057]
["JAM",2011,"JAM_2011_MICS",127,"Sanitation ladder","Open defecation","s_od",0.99321628066849599,0.17084957857340691,0.13878386480268451,0,0,1.047901178468456,0,0,0,0,1.5230201810603119,0.20091936102918731,0.25188271270089391,0,0,"  KMA","  Other towns","Rural",0.13878386480268451,0.2096874395715641,0.39547739700940399,37.62823760590733,4.3097311237650322,9.0421224708089198,0,0,8.0901867075347393,0,0,0,0,26.095703518555109,3.4423473798174768,4.3097311237650322,0,0,9.0421224708089198,8.0901867075347393,33.847782022137622]
["JAM",2011,"JAM_2011_MICS",128,"Shared among Improved Sanitation","Yes","s_shared",21.99530980088927,15.98647247441264,15.54088789217616,5.1337662976831169,0.82326188185136095,31.6251587062117,16.25234776051369,7.3116386631549792,0.73077861332239924,0.22734382190085109,22.2445681390132,18.736142331769699,11.13965605789401,2.6842733283920168,0.98649165092992963,"  KMA","  Other towns","Rural",15.54088789217616,11.05402022850472,11.084423394542711]
["JAM",2011,"JAM_2011_MICS",129,"Shared among Improved Sanitation","No","",78.004690199110783,84.013527525587293,84.459112107823913,94.866233702316933,99.17673811814862,68.374841293788293,83.747652239486285,92.688361336845006,99.269221386677572,99.772656178099169,77.755431860986704,81.263857668230315,88.860343942105999,97.315726671608004,99.013508349070065,"  KMA","  Other towns","Rural",84.459112107823913,88.945979771495217,88.915576605457275]
["JAM",2011,"JAM_2011_MICS",130,"Manually calculated ratios","Improved latrines","",98.532246238563459,97.835934409545061,99.105314150812518,100,100,97.739029951870933,95.5076183274371,100,100,100,98.253494021591635,99.296133106847662,98.85962026461911,100,100,"  KMA","  Other towns","Rural",99.105314150812518,97.191895384656377,98.810665171318419]
["JAM",2011,"JAM_2011_MICS",135,"Sanitation type","Sewer connection","s_sew",2.7329840003225492,6.0756862103928677,46.191594784351622,10.280295809229299,18.170021386166511,3.6442289225103099,7.6300893464376918,13.13107313514227,17.657221328571421,30.39364126589274,1.358873365725042,3.709171535106075,7.2124725884918428,9.654834950134477,14.529163652871,"  KMA","  Other towns","Rural",46.191594784351622,14.4946663540589,7.2928505404548956]
["JAM",2011,"JAM_2011_MICS",136,"Sanitation type","Septic tank connection","s_sep",11.679116914740121,24.136293563836951,31.791814126116311,31.021166583777539,34.874953897209053,20.48398744883033,22.95328809000528,40.269376824656597,37.505443027066917,38.283471297097464,7.7915515997478817,12.682317090702851,26.590826895940371,29.202793937256981,32.423055132078083,"  KMA","  Other towns","Rural",31.791814126116311,31.91632787396567,21.737826850827108]
["JAM",2011,"JAM_2011_MICS",137,"Sanitation type","Improved latrines","s_lat",82.714488471440788,68.489184879385974,21.354832281862709,58.345198479768221,46.654890295944398,72.265706408767159,67.551460936586551,46.265350197743317,44.837335644361623,31.322887437009751,87.392927690343527,82.16757313761903,65.286282153058565,60.585336268615563,52.614217840154083,"  KMA","  Other towns","Rural",21.354832281862709,52.42923372551013,69.6096724525231]
["JAM",2011,"JAM_2011_MICS",138,"Sanitation type","Unimproved facilities","",1.8803736816344521,1.128228170206699,0.52301688699432514,0.35333912722500571,0.30013442067996221,2.558176041423684,1.865161626970449,0.33419984245779127,0,0,1.933627163123113,1.2400990837138131,0.65853564980839741,0.5570348439929651,0.43356337489688263,"  KMA","  Other towns","Rural",0.52301688699432514,0.95027921410010385,0.96457954311048411]
["JAM",2011,"JAM_2011_MICS",139,"Sanitation type","Open defecation","",0.99303693186206798,0.17060717617756571,0.13874192067489141,0,0,1.047901178468456,0,0,0,0,1.5230201810603119,0.20083915285824511,0.25188271270089391,0,0,"  KMA","  Other towns","Rural",0.13874192067489141,0.2094928323652398,0.3950706130843552]
["JAM",2011,"JAM_2011_MICS",148,"Shared among improved sanitation facilities","Yes","",21.359322458625829,15.7561528172702,15.43334783340376,5.1156266926531124,0.81902523744934297,30.484731062352271,15.87349271994149,7.2872031782616311,0.73077861332239924,0.22734382190085109,21.475651865210931,18.458686516473129,11.03823858362257,2.6693209906448638,0.97753254160893843,"  KMA","  Other towns","Rural",15.43334783340376,10.915559751095779,10.922312692271641]
["JAM",2011,"JAM_2011_MICS",149,"Shared among improved sanitation facilities","No","",75.749209551058698,82.803131242980768,83.874670733369825,94.531034180121935,98.666357907888241,65.909191717755576,81.795428434375296,92.378596979280545,99.269221386677572,99.772656178099169,75.067700790605542,80.060454668603683,88.051343053868166,96.773644165362199,98.114288528286011,"  KMA","  Other towns","Rural",83.874670733369825,87.83185996999444,87.615178194706871]
["JAM",2011,"JAM_2011_MICS",150,"Shared among improved sanitation facilities","DK/missing","",2.8914679903155021,1.4407159397490521,0.69198143322644434,0.35333912722500571,0.51461685466238249,3.60607721989214,2.3310788456832081,0.33419984245779127,0,0,3.456647344183426,1.4808588149232,0.9104183625092912,0.5570348439929651,0.90817893010506823,"  KMA","  Other towns","Rural",0.69198143322644434,1.252580278909726,1.462509113021448]
["JAM",2011,"JAM_2011_MICS",151,"Shared among all sanitation facilities","Yes","",22.313432342707419,16.139573823481928,15.48505334707759,5.1156266926531124,0.81902523744934297,33.014694815624082,16.667134936147349,7.2872031782616311,0.73077861332239924,0.22734382190085109,22.044698400710519,19.06777635789139,11.066112207240691,2.6693209906448638,0.97753254160893843,"  KMA","  Other towns","Rural",15.48505334707759,11.534431179134719,11.127121187950991]
["JAM",2011,"JAM_2011_MICS",152,"Shared among all sanitation facilities","No","",77.482875462026755,83.718303111004502,84.484682037656711,94.884373307346948,98.966492328568208,66.736205159143836,82.866947845139876,92.712796821738351,99.269221386677572,99.772656178099169,77.655746993465897,80.892222726256918,88.933887792759322,97.330679009355165,98.54785190318286,"  KMA","  Other towns","Rural",84.484682037656711,88.323184922943923,88.710382420701535]
["JAM",2011,"JAM_2011_MICS",153,"Type of toilet facility","Flush to piped sewer system","",2.7329840003225492,6.0756862103928677,46.191594784351622,10.280295809229299,18.170021386166511,3.6442289225103099,7.6300893464376918,13.13107313514227,17.657221328571421,30.39364126589274,1.358873365725042,3.709171535106075,7.2124725884918428,9.654834950134477,14.529163652871,"  KMA","  Other towns","Rural",46.191594784351622,14.4946663540589,7.2928505404548956,103.55845592212481,153.478737212716,3010.4099404879671,238.94524843664919,688.58901504716584,28.134802206441108,58.694409830448073,102.15820752789431,135.94810213739291,234.8189851408718,23.283182266524118,63.574540787761521,123.40591881284411,165.72772569847729,248.82558221000031,3010.4099404879671,559.75450684304883,624.8169497756071]
["JAM",2011,"JAM_2011_MICS",154,"Type of toilet facility","Flush to septic tank","",11.679116914740121,24.136293563836951,31.791814126116311,31.021166583777539,34.874953897209053,20.48398744883033,22.95328809000528,40.269376824656597,37.505443027066917,38.283471297097464,7.7915515997478817,12.682317090702851,26.590826895940371,29.202793937256981,32.423055132078083,"  KMA","  Other towns","Rural",31.791814126116311,31.91632787396567,21.737826850827108,442.54606469767617,609.7102004439372,2071.9439049077582,721.02597957354863,1321.6555800081551,158.14399905346039,176.56801079794721,313.29102445271479,288.76535579816448,295.77521821125799,133.5018557370598,217.37266058878981,454.97093885981411,501.27347057294548,555.27529065116346,2071.9439049077582,1232.543608313546,1862.394216409773]
["JAM",2011,"JAM_2011_MICS",155,"Type of toilet facility","Flush to pit (latrine)","",16.22157685209682,29.400753814154822,19.925880157333239,44.790024962193783,45.153461096533157,19.045633616318241,32.780516789579281,37.216799064550663,42.451537023308568,31.322887437009751,9.7170951739905735,22.674214179332811,32.978500321036073,50.485160260103562,50.568285911510443,"  KMA","  Other towns","Rural",19.925880157333239,32.564913094113159,33.288615135028778,614.66933257822461,742.69644814435605,1298.614347018153,1041.056000788119,1711.180005880668,147.0393726863748,252.16389999413769,289.54232782278342,326.84677751621058,241.9982711283196,166.49446794953471,388.63200057778141,564.26448534179167,866.59076355454124,866.02942081989488,1298.614347018153,1257.590649147824,2852.0111382435412]
["JAM",2011,"JAM_2011_MICS",156,"Type of toilet facility","Flush to somewhere else","",0.33403871592761247,0.2136113348845273,0.053189679170937101,0.21586325895478589,0.095900540760932504,0,0,0.33419984245779127,0,0,0.20766866411713081,0.53088007859396669,0.31537361850696288,0.14082405758558469,0.21221266260781929,"  KMA","  Other towns","Rural",0.053189679170937101,0.067327100068810805,0.28135434831726203,12.657422668991179,5.3960650364594631,3.4664908119128151,5.017316718940104,3.6343412867602201,0,0,2.6000355424280941,0,0,3.5582324885033452,9.099190180487831,5.3960650364594631,2.4172811765120099,3.6343412867602201,3.4664908119128151,2.6000355424280941,24.10511016872287]
["JAM",2011,"JAM_2011_MICS",157,"Type of toilet facility","Flush to unknown place / Not sure / DK where","",0,0,0.24409523822988141,0.32928726670097719,0.2188915054018179,0,0,0.98377250513590386,0.33135664284880739,0,0,0,0,0,0.33540444907831668,"  KMA","  Other towns","Rural",0.24409523822988141,0.26425127118003722,0.067045208133221998,0,0,15.90823471290823,7.6536346043907084,8.2953279417481856,0,0,7.6536346043907084,2.5512115347969031,0,0,0,0,0,5.7441164069512816,15.90823471290823,10.204846139187611,5.7441164069512816]
["JAM",2011,"JAM_2011_MICS",158,"Type of toilet facility","Ventilated Improved Pit latrine (VIP)","",3.740568021557948,2.5426421125163459,0.068976640231435002,0.74734779443824595,0.30969839207780969,1.693507193285527,2.535483012259903,0.2745130563393508,0,0,4.7189672487625707,2.8441568031675502,2.5590349443340461,0.88754566321984851,0.68531334512522191,"  KMA","  Other towns","Rural",0.068976640231435002,0.8989176632444954,2.3386075398866,141.73791304248431,64.2300288558924,4.4953625087765801,17.370628990102571,11.736635099665239,13.074505178300511,19.50418563698754,2.1356793530895279,0,0,80.855639189066764,48.748342043068597,43.785269850953192,15.234949637013051,11.736635099665239,4.4953625087765801,34.714370168377577,200.36083581976689]
["JAM",2011,"JAM_2011_MICS",159,"Type of toilet facility","Pit latrine with slab","",62.752343597785988,36.545788952714908,1.1158802460681621,12.478538456435279,0.97283930193161239,51.526565599163447,32.235461134747418,7.7902655717173959,2.0544419782042671,0,72.956865267590402,56.649202155118743,29.748746887688441,9.2126303452921778,1.0252141344400809,"  KMA","  Other towns","Rural",1.1158802460681621,18.70115169697247,33.915404569474461,2377.8169969946348,923.18815433728946,72.724420986992499,290.03907347902879,36.86767574342371,397.80424400755402,247.97106311732711,60.607351644629517,15.8177485965091,0,1250.056138022255,970.95725525720377,509.00317445415538,158.13716989587519,17.557755558873229,72.724420986992499,722.20040736601948,2905.711493188358]
["JAM",2011,"JAM_2011_MICS",160,"Type of toilet facility","Pit latrine without slab / Open pit","",0.93477000546203448,0.80836846733159506,0.010073751080853101,0,0,1.191949843987953,1.51625595260762,0,0,0,1.296845497705954,0.40156143721706528,0.34316203130143452,0,0,"  KMA","  Other towns","Rural",0.010073751080853101,0.5403206737009485,0.40822285543130149,35.420382408583301,20.420305998753911,0.65652897531208787,0,0,9.2022959626528547,11.66378848915552,0,0,0,22.220385546005751,6.8826916543287791,5.871526755194318,0,0,0.65652897531208787,20.866084451808369,34.974603955528842]
["JAM",2011,"JAM_2011_MICS",161,"Type of toilet facility","Bucket","",0.018837520197974598,0,0.0124383796535087,0,0,0,0,0,0,0,0.041659001526344899,0,0,0,0,"  KMA","  Other towns","Rural",0.0124383796535087,0,0.0083313756953015995,0.71379287433583882,0,0.81063712840611635,0,0,0,0,0,0,0,0.71379287433583882,0,0,0,0,0.81063712840611635,0,0.71379287433583882]
["JAM",2011,"JAM_2011_MICS",162,"Type of toilet facility","No facility, Bush, Field","",0.99303693186206798,0.17060717617756571,0.13874192067489141,0,0,1.047901178468456,0,0,0,0,1.5230201810603119,0.20083915285824511,0.25188271270089391,0,0,"  KMA","  Other towns","Rural",0.13874192067489141,0.2094928323652398,0.3950706130843552,37.62823760590733,4.3097311237650322,9.0421224708089198,0,0,8.0901867075347393,0,0,0,0,26.095703518555109,3.4423473798174768,4.3097311237650322,0,0,9.0421224708089198,8.0901867075347393,33.847782022137622]
["JAM",2011,"JAM_2011_MICS",163,"Type of toilet facility","Other","",0.40911536032622292,0.1062483679905766,0.030221253242559299,0,0,1.1197364943036141,0.34890567436282838,0,0,0,0.092461671050175304,0.30765756790278093,0,0,0,"  KMA","  Other towns","Rural",0.030221253242559299,0.29335405891401228,0.080040026962488603,15.502233091890441,2.6839545008449708,1.9695869259362639,0,0,8.6447820541594496,2.6839545008449708,0,0,0,1.584255011562447,5.2731960261685487,0,0,0,1.9695869259362639,11.32873655500442,6.8574510377309954]
["JAM",2011,"JAM_2011_MICS",164,"Type of toilet facility","Missing","",0.18361207972060789,0,0.41709382384646709,0.13747586827021971,0.20423387991902961,0.24648970313211799,0,0,0,0,0.29499232872350789,0,0,0.41621078640738052,0.2213507122890632,"  KMA","  Other towns","Rural",0.41709382384646709,0.049277381416332602,0.18663093670413031,6.9574441205188604,0,27.18294095030706,3.195356058566019,7.739848139076754,1.902992153075123,0,0,0,0,5.0544519674437378,0,0,7.14436522205997,3.7908389755828029,27.18294095030706,1.902992153075123,15.98965616508651]
["JAM",2011,"JAM_2011_MICS",222,"Hygiene ladder","Basic","h_bas",52.80439641344865,60.324840068374108,66.780010809459867,71.391637916409294,81.91020626061777,66.586003435913483,59.121738389811021,79.27732753235118,79.089724937656584,87.200101292975134,44.372457475879287,56.828210602514929,64.525321574247258,69.196133666332599,82.780552105592022,"  KMA","  Other towns","Rural",66.780010809459867,74.121637426018808,63.077553489143938,1733.2347859567219,1232.5494014790461,3516.5290225765398,1306.9396180810261,2383.2543191238542,399.36961376032201,327.92558697845732,419.9874347939674,408.17237193185201,503.01253079670789,675.60708495967447,861.1997260044385,928.80725278700072,994.42473697259902,1137.471785655631,3516.5290225765398,2058.4675382613032,4597.5105863793488]
["JAM",2011,"JAM_2011_MICS",223,"Hygiene ladder","Limited","h_lim",24.30003276990448,18.86547069825734,16.7355625683055,13.76899609836142,6.9005675993806301,13.66696346858704,19.872910797447769,8.8280855246297119,5.2733972601089061,2.9761140233918,30.235636763412799,20.429644931766038,17.750846526918622,14.466713721673729,8.6738925769372859,"  KMA","  Other towns","Rural",16.7355625683055,10.20293882281158,18.5571063599543,797.616580386853,385.45687964364771,881.26807359329121,252.06378544251649,200.7784900858822,81.97173039495182,110.227407307541,46.768541637809001,27.215356602823949,17.167670961942822,460.36238643607152,309.59983485431547,255.51387571683389,207.90262728989481,119.1863043567148,881.26807359329121,283.35070690506859,1352.56502865383]
["JAM",2011,"JAM_2011_MICS",224,"Hygiene ladder","No facility","h_nfac",22.895570816647041,20.809689233368491,16.484426622234452,14.839365985229341,11.189226140001541,19.747033095499489,21.005350812741259,11.89458694301911,15.636877802234491,9.8237846836330451,25.391905760707861,22.742144465719001,17.723831898834149,16.33715261199373,8.5455553174706687,"  KMA","  Other towns","Rural",16.484426622234452,15.675423751169591,18.365340150901801,751.51696599340937,425.18090359596363,868.04365460523741,271.65864069414329,325.56103498220011,118.43877952297071,116.5086173471465,63.013943754522238,80.700008846631974,56.668360729464908,386.61260629722773,344.64447102903858,255.12501469477249,234.78289650405151,117.4228465398904,868.04365460523741,435.32971020073637,1338.5878350649809]
["JAM",2011,"JAM_2011_MICS",225,"Place where household members most often wash their hands","Observed","",66.791033429590868,64.05120754232874,67.479600926758721,67.074010722864273,68.185710750382569,62.346912379183337,56.958516210807751,59.995246697304061,56.549060749015112,67.329183099856039,66.29843984753893,68.308734135410091,69.217779483171739,70.044237975633095,73.377467394346894,"  KMA","  Other towns","Rural",67.479600926758721,60.640644622896957,69.44915975859189]
["JAM",2011,"JAM_2011_MICS",226,"Place where household members most often wash their hands","Not in dwelling/plot/yard","",5.6109389872953619,3.3540336770460568,6.3534074500210034,3.98489553196594,1.872266089823347,6.6921380554278613,5.5607597611527222,4.4730440646665892,3.0720226243920079,1.484222861812017,5.3476598886016653,4.7217528196157463,2.9971433547874771,2.7529057689837928,1.48643879002805,"  KMA","  Other towns","Rural",6.3534074500210034,4.2560775627692244,3.4613267579237408]
["JAM",2011,"JAM_2011_MICS",227,"Place where household members most often wash their hands","No permission to see","",13.32029132681294,19.117368119588249,19.122794129651869,21.062940204433261,23.10898152499318,22.124465295713581,27.855010294587299,31.421678900580229,32.969454809351589,24.773738187234809,11.13773844041825,11.545031554290849,15.871410785608941,16.27796547398588,19.766100325614548,"  KMA","  Other towns","Rural",19.122794129651869,27.831141872886921,14.919185783979639]
["JAM",2011,"JAM_2011_MICS",228,"Place where household members most often wash their hands","Other reason","",14.222147801633209,13.477390661037081,6.9658153605951121,7.7028496889203391,6.7184183952085457,8.6489339278547579,9.5849953892379229,3.6265567799198908,7.4094618172412403,5.8506092264209206,17.216161823441041,15.386067792730531,11.913666376431911,10.92489078139721,5.3699934900104722,"  KMA","  Other towns","Rural",6.9658153605951121,7.0166479378368702,12.162642822136309]
["JAM",2011,"JAM_2011_MICS",229,"Place where household members most often wash their hands","Missing","",0.055588454667713699,0,0.078382132973277299,0.17530385181617711,0.11462323959234839,0.18755034182051949,0.040718344214310899,0.48347355752922289,0,0.56224662467614639,0,0.0384136979528431,0,0,0,"  KMA","  Other towns","Rural",0.078382132973277299,0.25548800361005453,0.0076848773684398998]