{"text_format":"1","workbook":"xlsx","n_sheets":8,"sheets":["Introduction","Water","Sanitation","Hygiene","WHS03","ENCOVI11","DHS15","data_summary"],"not_rendered":{"charts":120,"images":76,"macros":1,"external_links":0,"defined_names":0,"comments":0,"pivot_tables":0},"unopened":[],"bounds":{"document_bytes":16777216,"sheet_cells":100000,"rows_first":2000,"rows_last":500,"rows_between":2000,"halvings":0,"cell_chars":16384,"cell_head_chars":4096},"cells_cut":0,"cells_raw":0,"read":"whole","date_system":"1900"}

{"sheet":"Introduction","index":0,"n_rows":55,"n_cols":12,"rows_kept":55,"cut":false,"hidden":false,"merged":[[107,0,107,1],[1,0,1,1],[4,0,4,1],[5,0,5,1],[6,0,6,1],[7,0,7,1],[112,0,112,1],[113,0,113,1],[207,0,207,1],[212,0,212,1],[213,0,213,1]]}
[]
[]
[]
[null,null,"Joint Monitoring Programme for Water Supply, Sanitation and Hygiene"]
[]
[null,null,"Estimates on household water, sanitation and hygiene \nby wealth quintile and sub-national region in"]
[null,null,{"$f":"+Water!B5","v":"Guatemala"}]
[]
[null,null,"Updated May 2021"]
[]
[null,null,"Follow the links below to find the following information: "]
[]
[null,null,"JMP Estimates"]
[null,null,"WASH status and trends by wealth quintile \n(customized quintiles made without water and sanitation assets)"]
[null,null,"Water"]
[null,null,"Sanitation"]
[null,null,"Hygiene"]
[]
[null,null,"Data inputs"]
[null,null," customized wealth quintiles and subnational data:"]
[null,null,{"$f":"IF(INDIRECT(CONCATENATE(\"Water\",\"!B105\"))=0,\"\",INDIRECT(CONCATENATE(\"Water\",\"!B105\")))","v":"WHS03"}]
[null,null,{"$f":"IF(INDIRECT(CONCATENATE(\"Water\",\"!B106\"))=0,\"\",INDIRECT(CONCATENATE(\"Water\",\"!B106\")))","v":"ENCOVI11"}]
[null,null,{"$f":"IF(INDIRECT(CONCATENATE(\"Water\",\"!B107\"))=0,\"\",INDIRECT(CONCATENATE(\"Water\",\"!B107\")))","v":"DHS15"}]
[null,null,{"$f":"IF(INDIRECT(CONCATENATE(\"Water\",\"!B108\"))=0,\"\",INDIRECT(CONCATENATE(\"Water\",\"!B108\")))","v":""}]
[null,null,{"$f":"IF(INDIRECT(CONCATENATE(\"Water\",\"!B109\"))=0,\"\",INDIRECT(CONCATENATE(\"Water\",\"!B109\")))","v":""}]
[null,null,{"$f":"IF(INDIRECT(CONCATENATE(\"Water\",\"!B110\"))=0,\"\",INDIRECT(CONCATENATE(\"Water\",\"!B110\")))","v":""}]
[null,null,{"$f":"IF(INDIRECT(CONCATENATE(\"Water\",\"!B111\"))=0,\"\",INDIRECT(CONCATENATE(\"Water\",\"!B111\")))","v":""}]
[null,null,{"$f":"IF(INDIRECT(CONCATENATE(\"Water\",\"!B112\"))=0,\"\",INDIRECT(CONCATENATE(\"Water\",\"!B112\")))","v":""}]
[null,null,{"$f":"IF(INDIRECT(CONCATENATE(\"Water\",\"!B113\"))=0,\"\",INDIRECT(CONCATENATE(\"Water\",\"!B113\")))","v":""}]
[null,null,{"$f":"IF(INDIRECT(CONCATENATE(\"Water\",\"!B114\"))=0,\"\",INDIRECT(CONCATENATE(\"Water\",\"!B114\")))","v":""}]
[null,null,{"$f":"IF(INDIRECT(CONCATENATE(\"Water\",\"!B115\"))=0,\"\",INDIRECT(CONCATENATE(\"Water\",\"!B115\")))","v":""}]
[null,null,{"$f":"IF(INDIRECT(CONCATENATE(\"Water\",\"!B116\"))=0,\"\",INDIRECT(CONCATENATE(\"Water\",\"!B116\")))","v":""}]
[]
[]
[]
[]
[]
[]
[]
[]
[]
[]
[]
[]
[]
[]
[]
[]
[]
[]
[]
[]
[]
[]
[null,null,null,null,null,null,null,null,null,null,null,{"$f":"+IF(ISNUMBER(M48), \"\", \"Insufficient data to estimate safely managed sanitation services at national level\")","v":"Insufficient data to estimate safely managed sanitation services at national level"}]

{"sheet":"Water","index":1,"n_rows":318,"n_cols":28,"rows_kept":318,"cut":false,"hidden":false,"merged":[[3,1,3,24],[317,18,317,22],[117,18,117,22],[196,18,196,22],[296,23,296,27],[298,0,299,1],[300,0,301,1],[296,0,297,2],[296,3,296,7],[296,8,296,12],[296,13,296,17],[296,18,296,22],[196,23,196,27],[198,0,199,1],[200,0,201,1],[196,13,196,17],[96,8,96,12],[96,13,96,17],[96,18,96,22],[217,18,217,22],[98,0,99,1],[100,0,101,1],[196,0,197,2],[196,3,196,7],[196,8,196,12],[217,1,217,11],[35,3,36,3],[38,1,39,2],[38,3,39,3],[96,0,97,2],[96,3,96,7],[317,1,317,11],[6,9,6,16],[6,17,6,24],[6,1,6,8],[4,1,4,24],[117,1,117,11],[30,21,30,24],[32,1,33,2],[32,3,33,3],[30,17,30,20],[30,1,31,4],[30,5,30,8],[30,9,30,12],[30,13,30,16],[96,23,96,27],[35,1,36,2]]}
["BGD"]
[]
[]
[null,"Summary of trends in use of drinking water by wealth quintile (%)"]
[null,{"$f":"IF(ISERROR(INDIRECT(CONCATENATE($B105,\"!A2\"))),\"\",INDIRECT(CONCATENATE($B105,\"!A2\")))","v":"Guatemala"}]
[]
[null,{"$f":"B118","v":"National use of drinking water sources, 2000–2020"},null,null,null,null,null,null,null,{"$f":"B218","v":"Urban use of drinking water sources,  2000–2020"},null,null,null,null,null,null,null,{"$f":"B318","v":"Rural use of drinking water sources, 2000–2020"}]
[]
[]
[]
[]
[]
[]
[]
[]
[]
[]
[]
[]
[]
[]
[]
[]
[]
[]
[]
[]
[]
[]
[]
[null,{"$f":"IF(ISERROR(INDIRECT(CONCATENATE($B105,\"!A2\"))),\"\",INDIRECT(CONCATENATE($B105,\"!A2\")))","v":"Guatemala"},null,null,null,"Poorest",null,null,null,"Poor",null,null,null,"Middle",null,null,null,"Rich",null,null,null,"Richest"]
[null,null,null,null,null,"Basic","Limited","Unimproved","Surface \n water","Basic","Limited","Unimproved","Surface \nwater","Basic","Limited","Unimproved","Surface \nwater","Basic","Limited","Unimproved","Surface \nwater","Basic","Limited","Unimproved","Surface \nwater"]
[null,"NATIONAL",null,"Estimate",{"$f":"C99","v":2000},{"$f":"E99","v":80.424230952380981},{"$f":"F99","v":2.4019595238095293},1.8066578483244484,15.367151675485047,{"$f":"J99","v":85.007382097069637},{"$f":"K99","v":1.0760428113553118},6.3475077952350034,7.5690672963400516,{"$f":"O99","v":81.527433503226533},{"$f":"P99","v":0.61607632370196375},14.87399798171856,2.9824921913529505,{"$f":"T99","v":94.156442444493152},{"$f":"U99","v":0.1414468339176215},4.2204304847276433,1.4816802368615782,{"$f":"Y99","v":97.864911904761925},{"$f":"Z99","v":9.7962874779535886E-2},1.858553791887104,0.1785714285714306]
[null,null,null,null,{"$f":"C100","v":2020},{"$f":"E100","v":77.409507142857152},2.3119214285714333,8.094841269841254,12.183730158730157,{"$f":"J100","v":92.342372939560505},1.1688907967032975,2.2604009626736001,4.2283353010626001,{"$f":"O100","v":96.31036981026466},0.72778616985086642,0,2.9618440198844835,{"$f":"T100","v":97.483200580631049},0.14644446757231061,3.9229859272595036E-2,2.3311250925240472,{"$f":"Y100","v":99.382264285714285},9.948174603174037E-2,5.3968253968264435E-2,0.4642857142857153]
[]
[null,"URBAN",null,"Estimate",{"$f":"C199","v":2000},{"$f":"E199","v":95.404162486640601},{"$f":"F199","v":0.2870737085856761},3.0870398520347351,1.2217239527389907,{"$f":"J199","v":96.685058241758213},{"$f":"K199","v":0.38829340659341205},2.2913288972334556,0.63531945441492965,{"$f":"O199","v":96.991483516483513},{"$f":"P199","v":0},2.6513736263736263,0.3571428571428612,{"$f":"T199","v":97.649839624773946},{"$f":"U199","v":4.8849344484626502E-2},2.1941681735985696,0.1071428571428541,{"$f":"Y199","v":99.160924369747875},{"$f":"Z199","v":0},0.83907563025212539,0]
[null,null,null,null,{"$f":"C200","v":2020},{"$f":"E200","v":92.662430245814065},0.27882376202351011,5.9682787526350296,1.090467239527392,{"$f":"J200","v":97.079150833037929},0.38987610776321013,1.6831625782225501,0.84781048097630674,{"$f":"O200","v":98.370214462956412},0,0.7012141084721577,0.9285714285714306,{"$f":"T200","v":99.637633657323676},4.9843738698008011E-2,3.395117540689796E-2,0.27857142857142847,{"$f":"Y200","v":100},0,0,0]
[]
[null,"RURAL",null,"Estimate",{"$f":"C299","v":2000},{"$f":"E299","v":76.684891696750995},{"$f":"F299","v":2.9877230531201691},1.7215063286873402,18.605878921441501,{"$f":"J299","v":81.690896431812277},{"$f":"K299","v":1.6246532181747491},3.5741055224268621,13.110344827586118,{"$f":"O299","v":84.041384121970111},{"$f":"P299","v":1.2365297511603948},7.0559333816184449,7.6661527452510541,{"$f":"T299","v":89.73884112328237},{"$f":"U299","v":0.76931936414311142},5.8970462106383508,3.5947933019361642,{"$f":"Y299","v":91.576442457452245},{"$f":"Z299","v":0.2755559953584294},5.3278716770594485,2.8201298701298705]
[null,null,null,null,{"$f":"C300","v":2020},{"$f":"E300","v":72.024386281588491},2.8061449200618891,9.0744013884455654,16.095067409904061,{"$f":"J300","v":87.010204261731985},1.7304426140783031,4.355904848327782,6.9034482758619333,{"$f":"O300","v":93.097920738782747},1.3697816851469835,0.58376127630451435,4.9485362997657489,{"$f":"T300","v":95.327513190138518},0.81723031983476757,0,3.8552564900267168,{"$f":"Y300","v":96.932040536435579},0.29167113501434705,0,2.7762883285500752]
[]
[]
[]
[]
[]
[]
[]
[]
[]
[]
[]
[]
[]
[]
[]
[]
[]
[]
[]
[]
[]
[]
[]
[]
[]
[]
[]
[]
[]
[]
[]
[]
[]
[]
[]
[]
[]
[]
[]
[]
[]
[]
[]
[]
[]
[]
[]
[]
[]
[]
[]
[]
[]
[]
[]
[]
["NATIONAL",null,null,"Poorest",null,null,null,null,"Poor",null,null,null,null,"Middle",null,null,null,null,"Rich",null,null,null,null,"Richest"]
[null,null,null,"Improved","Basic","Limited","Unimproved","Surface water","Improved","Basic","Limited","Unimproved","Surface water","Improved","Basic","Limited","Unimproved","Surface water","Improved","Basic","Limited","Unimproved","Surface water","Improved","Basic","Limited","Unimproved","Surface water"]
["Forecast period:",null,2000,{"$f":"IF((D101+H101)>100,D101*100/(D101+H101),D101)","v":82.826190476190504},{"$f":"D99*AVERAGEIF(E105:E116,\">0\")/100","v":80.424230952380981},{"$f":"D99*(100-AVERAGEIF(E105:E116,\">0\"))/100","v":2.4019595238095293},{"$f":"100-(E99+F99+H99)","v":1.8066578483244484},{"$f":"IF((D101+H101)>100,H101*100/(D101+H101),H101)","v":15.367151675485047},{"$f":"IF((I101+M101)>100,I101*100/(I101+M101),I101)","v":86.083424908424945},{"$f":"I99*AVERAGEIF(J105:J116,\">0\")/100","v":85.007382097069637},{"$f":"I99*(100-AVERAGEIF(J105:J116,\">0\"))/100","v":1.0760428113553118},{"$f":"100-(J99+K99+M99)","v":6.3475077952350034},{"$f":"IF((I101+M101)>100,M101*100/(I101+M101),M101)","v":7.5690672963400516},{"$f":"IF((N101+R101)>100,N101*100/(N101+R101),N101)","v":82.143509826928494},{"$f":"N99*AVERAGEIF(O105:O116,\">0\")/100","v":81.527433503226533},{"$f":"N99*(100-AVERAGEIF(O105:O116,\">0\"))/100","v":0.61607632370196375},{"$f":"100-(O99+P99+R99)","v":14.87399798171856},{"$f":"IF((N101+R101)>100,R101*100/(N101+R101),R101)","v":2.9824921913529505},{"$f":"IF((S101+W101)>100,S101*100/(S101+W101),S101)","v":94.297889278410764},{"$f":"S99*AVERAGEIF(T105:T116,\">0\")/100","v":94.156442444493152},{"$f":"S99*(100-AVERAGEIF(T105:T116,\">0\"))/100","v":0.1414468339176215},{"$f":"100-(T99+U99+W99)","v":4.2204304847276433},{"$f":"IF((S101+W101)>100,W101*100/(S101+W101),W101)","v":1.4816802368615782},{"$f":"IF((X101+AB101)>100,X101*100/(X101+AB101),X101)","v":97.962874779541451},{"$f":"X99*AVERAGEIF(Y105:Y116,\">0\")/100","v":97.864911904761925},{"$f":"X99*(100-AVERAGEIF(Y105:Y116,\">0\"))/100","v":9.7962874779535886E-2},{"$f":"100-(Y99+Z99+AB99)","v":1.858553791887104},{"$f":"IF((X101+AB101)>100,AB101*100/(X101+AB101),AB101)","v":0.1785714285714306}]
[null,null,2020,{"$f":"IF((D102+H102)>100,D102*100/(D102+H102),D102)","v":79.721428571428589},{"$f":"D100*AVERAGEIF(E105:E116,\">0\")/100","v":77.409507142857152},{"$f":"D100*(100-AVERAGEIF(E105:E116,\">0\"))/100","v":2.3119214285714333},{"$f":"100-(E100+F100+H100)","v":8.094841269841254},{"$f":"IF((D102+H102)>100,H102*100/(D102+H102),H102)","v":12.183730158730157},{"$f":"IF((I102+M102)>100,I102*100/(I102+M102),I102)","v":93.5112637362638},{"$f":"I100*AVERAGEIF(J105:J116,\">0\")/100","v":92.342372939560505},{"$f":"I100*(100-AVERAGEIF(J105:J116,\">0\"))/100","v":1.1688907967032975},{"$f":"100-(J100+K100+M100)","v":2.2604009626736001},{"$f":"IF((I102+M102)>100,M102*100/(I102+M102),M102)","v":4.2283353010626001},{"$f":"IF((N102+R102)>100,N102*100/(N102+R102),N102)","v":97.038155980115519},{"$f":"N100*AVERAGEIF(O105:O116,\">0\")/100","v":96.31036981026466},{"$f":"N100*(100-AVERAGEIF(O105:O116,\">0\"))/100","v":0.72778616985086642},{"$f":"100-(O100+P100+R100)","v":0},{"$f":"IF((N102+R102)>100,R102*100/(N102+R102),R102)","v":2.9618440198844835},{"$f":"IF((S102+W102)>100,S102*100/(S102+W102),S102)","v":97.629645048203372},{"$f":"S100*AVERAGEIF(T105:T116,\">0\")/100","v":97.483200580631049},{"$f":"S100*(100-AVERAGEIF(T105:T116,\">0\"))/100","v":0.14644446757231061},{"$f":"100-(T100+U100+W100)","v":3.9229859272595036E-2},{"$f":"IF((S102+W102)>100,W102*100/(S102+W102),W102)","v":2.3311250925240472},{"$f":"IF((X102+AB102)>100,X102*100/(X102+AB102),X102)","v":99.481746031746027},{"$f":"X100*AVERAGEIF(Y105:Y116,\">0\")/100","v":99.382264285714285},{"$f":"X100*(100-AVERAGEIF(Y105:Y116,\">0\"))/100","v":9.948174603174037E-2},{"$f":"100-(Y100+Z100+AB100)","v":5.3968253968264435E-2},{"$f":"IF((X102+AB102)>100,AB102*100/(X102+AB102),AB102)","v":0.4642857142857153}]
["Regression period:",null,{"$f":"MinRegYear(C99,C105:C116)","v":2001},{"$f":"IF(MAX(C105:C116)-MIN(C105:C116)<5,AVERAGEIF(C105:C116,\">0\",D105:D116),\nIF(FORECAST($C101,D$105:D$116,$C$105:$C$116)<0,0,\nIF(FORECAST($C101,D$105:D$116,$C$105:$C$116)>100,100,\nFORECAST($C101,D$105:D$116,$C$105:$C$116))))","v":82.826190476190504},null,null,null,{"$f":"IF(MAX(C105:C116)-MIN(C105:C116)<5,AVERAGEIF(C105:C116,\">0\",H105:H116),\nIF(FORECAST($C101,H$105:H$116,$C$105:$C$116)<0,0,\nIF(FORECAST($C101,H$105:H$116,$C$105:$C$116)>100,100,\nFORECAST($C101,H$105:H$116,$C$105:$C$116))))","v":15.367151675485047},{"$f":"IF(MAX(C105:C116)-MIN(C105:C116)<5,AVERAGEIF(C105:C116,\">0\",I105:I116),\nIF(FORECAST($C101,I$105:I$116,$C$105:$C$116)<0,0,\nIF(FORECAST($C101,I$105:I$116,$C$105:$C$116)>100,100,\nFORECAST($C101,I$105:I$116,$C$105:$C$116))))","v":86.083424908424945},null,null,null,{"$f":"IF(MAX(C105:C116)-MIN(C105:C116)<5,AVERAGEIF(C105:C116,\">0\",M105:M116),\nIF(FORECAST($C101,M$105:M$116,$C$105:$C$116)<0,0,\nIF(FORECAST($C101,M$105:M$116,$C$105:$C$116)>100,100,\nFORECAST($C101,M$105:M$116,$C$105:$C$116))))","v":7.5690672963400516},{"$f":"IF(MAX(C105:C116)-MIN(C105:C116)<5,AVERAGEIF(C105:C116,\">0\",N105:N116),\nIF(FORECAST($C101,N$105:N$116,$C$105:$C$116)<0,0,\nIF(FORECAST($C101,N$105:N$116,$C$105:$C$116)>100,100,\nFORECAST($C101,N$105:N$116,$C$105:$C$116))))","v":82.143509826928494},null,null,null,{"$f":"IF(MAX(C105:C116)-MIN(C105:C116)<5,AVERAGEIF(C105:C116,\">0\",R105:R116),\nIF(FORECAST($C101,R$105:R$116,$C$105:$C$116)<0,0,\nIF(FORECAST($C101,R$105:R$116,$C$105:$C$116)>100,100,\nFORECAST($C101,R$105:R$116,$C$105:$C$116))))","v":2.9824921913529505},{"$f":"IF(MAX(C105:C116)-MIN(C105:C116)<5,AVERAGEIF(C105:C116,\">0\",S105:S116),\nIF(FORECAST($C101,S$105:S$116,$C$105:$C$116)<0,0,\nIF(FORECAST($C101,S$105:S$116,$C$105:$C$116)>100,100,\nFORECAST($C101,S$105:S$116,$C$105:$C$116))))","v":94.297889278410764},null,null,null,{"$f":"IF(MAX(C105:C116)-MIN(C105:C116)<5,AVERAGEIF(C105:C116,\">0\",W105:W116),\nIF(FORECAST($C101,W$105:W$116,$C$105:$C$116)<0,0,\nIF(FORECAST($C101,W$105:W$116,$C$105:$C$116)>100,100,\nFORECAST($C101,W$105:W$116,$C$105:$C$116))))","v":1.4816802368615782},{"$f":"IF(MAX(C105:C116)-MIN(C105:C116)<5,AVERAGEIF(C105:C116,\">0\",X105:X116),\nIF(FORECAST($C101,X$105:X$116,$C$105:$C$116)<0,0,\nIF(FORECAST($C101,X$105:X$116,$C$105:$C$116)>100,100,\nFORECAST($C101,X$105:X$116,$C$105:$C$116))))","v":97.962874779541451},null,null,null,{"$f":"IF(MAX(C105:C116)-MIN(C105:C116)<5,AVERAGEIF(C105:C116,\">0\",AB105:AB116),\nIF(FORECAST($C101,AB$105:AB$116,$C$105:$C$116)<0,0,\nIF(FORECAST($C101,AB$105:AB$116,$C$105:$C$116)>100,100,\nFORECAST($C101,AB$105:AB$116,$C$105:$C$116))))","v":0.1785714285714306}]
[null,null,{"$f":"MaxRegYear(C100,C105:C116)","v":2017},{"$f":"IF(MAX(C105:C116)-MIN(C105:C116)<5,AVERAGEIF(C105:C116,\">0\",D105:D116),\nIF(FORECAST($C102,D$105:D$116,$C$105:$C$116)<0,0,\nIF(FORECAST($C102,D$105:D$116,$C$105:$C$116)>100,100,\nFORECAST($C102,D$105:D$116,$C$105:$C$116))))","v":79.721428571428589},null,null,null,{"$f":"IF(MAX(C105:C116)-MIN(C105:C116)<5,AVERAGEIF(C105:C116,\">0\",H105:H116),\nIF(FORECAST($C102,H$105:H$116,$C$105:$C$116)<0,0,\nIF(FORECAST($C102,H$105:H$116,$C$105:$C$116)>100,100,\nFORECAST($C102,H$105:H$116,$C$105:$C$116))))","v":12.183730158730157},{"$f":"IF(MAX(C105:C116)-MIN(C105:C116)<5,AVERAGEIF(C105:C116,\">0\",I105:I116),\nIF(FORECAST($C102,I$105:I$116,$C$105:$C$116)<0,0,\nIF(FORECAST($C102,I$105:I$116,$C$105:$C$116)>100,100,\nFORECAST($C102,I$105:I$116,$C$105:$C$116))))","v":93.5112637362638},null,null,null,{"$f":"IF(MAX(C105:C116)-MIN(C105:C116)<5,AVERAGEIF(C105:C116,\">0\",M105:M116),\nIF(FORECAST($C102,M$105:M$116,$C$105:$C$116)<0,0,\nIF(FORECAST($C102,M$105:M$116,$C$105:$C$116)>100,100,\nFORECAST($C102,M$105:M$116,$C$105:$C$116))))","v":4.2283353010626001},{"$f":"IF(MAX(C105:C116)-MIN(C105:C116)<5,AVERAGEIF(C105:C116,\">0\",N105:N116),\nIF(FORECAST($C102,N$105:N$116,$C$105:$C$116)<0,0,\nIF(FORECAST($C102,N$105:N$116,$C$105:$C$116)>100,100,\nFORECAST($C102,N$105:N$116,$C$105:$C$116))))","v":99.300271340568997},null,null,null,{"$f":"IF(MAX(C105:C116)-MIN(C105:C116)<5,AVERAGEIF(C105:C116,\">0\",R105:R116),\nIF(FORECAST($C102,R$105:R$116,$C$105:$C$116)<0,0,\nIF(FORECAST($C102,R$105:R$116,$C$105:$C$116)>100,100,\nFORECAST($C102,R$105:R$116,$C$105:$C$116))))","v":3.0308893638007564},{"$f":"IF(MAX(C105:C116)-MIN(C105:C116)<5,AVERAGEIF(C105:C116,\">0\",S105:S116),\nIF(FORECAST($C102,S$105:S$116,$C$105:$C$116)<0,0,\nIF(FORECAST($C102,S$105:S$116,$C$105:$C$116)>100,100,\nFORECAST($C102,S$105:S$116,$C$105:$C$116))))","v":97.629645048203372},null,null,null,{"$f":"IF(MAX(C105:C116)-MIN(C105:C116)<5,AVERAGEIF(C105:C116,\">0\",W105:W116),\nIF(FORECAST($C102,W$105:W$116,$C$105:$C$116)<0,0,\nIF(FORECAST($C102,W$105:W$116,$C$105:$C$116)>100,100,\nFORECAST($C102,W$105:W$116,$C$105:$C$116))))","v":2.3311250925240472},{"$f":"IF(MAX(C105:C116)-MIN(C105:C116)<5,AVERAGEIF(C105:C116,\">0\",X105:X116),\nIF(FORECAST($C102,X$105:X$116,$C$105:$C$116)<0,0,\nIF(FORECAST($C102,X$105:X$116,$C$105:$C$116)>100,100,\nFORECAST($C102,X$105:X$116,$C$105:$C$116))))","v":99.481746031746027},null,null,null,{"$f":"IF(MAX(C105:C116)-MIN(C105:C116)<5,AVERAGEIF(C105:C116,\">0\",AB105:AB116),\nIF(FORECAST($C102,AB$105:AB$116,$C$105:$C$116)<0,0,\nIF(FORECAST($C102,AB$105:AB$116,$C$105:$C$116)>100,100,\nFORECAST($C102,AB$105:AB$116,$C$105:$C$116))))","v":0.4642857142857153}]
[]
[null,"Survey","Year","Improved","% Improved\n< = 30min",null,null,"Surface water","Improved","% Improved\n< = 30min",null,null,"Surface water","Improved","% Improved\n< = 30min",null,null,"Surface water","Improved","% Improved\n< = 30min",null,null,"Surface water","Improved","% Improved\n< = 30min",null,null,"Surface water"]
[null,"WHS03",2003,{"$f":"IF(ISERROR(INDIRECT(CONCATENATE($B105,\"!C16\"))),\"\",INDIRECT(CONCATENATE($B105,\"!C16\")))","v":85.333333333333343},{"$f":"IF(ISERROR(INDIRECT(CONCATENATE($B105,\"!C23\"))),\"\",INDIRECT(CONCATENATE($B105,\"!C23\")))","v":"N/A"},null,null,{"$f":"IF(ISERROR(INDIRECT(CONCATENATE($B105,\"!C21\"))),\"\",INDIRECT(CONCATENATE($B105,\"!C21\")))","v":11.728395061728394},{"$f":"IF(ISERROR(INDIRECT(CONCATENATE($B105,\"!D16\"))),\"\",INDIRECT(CONCATENATE($B105,\"!D16\")))","v":88.820512820512818},{"$f":"IF(ISERROR(INDIRECT(CONCATENATE($B105,\"!D23\"))),\"\",INDIRECT(CONCATENATE($B105,\"!D23\")))","v":"N/A"},null,null,{"$f":"IF(ISERROR(INDIRECT(CONCATENATE($B105,\"!D21\"))),\"\",INDIRECT(CONCATENATE($B105,\"!D21\")))","v":5.5785123966942152},{"$f":"IF(ISERROR(INDIRECT(CONCATENATE($B105,\"!E16\"))),\"\",INDIRECT(CONCATENATE($B105,\"!E16\")))","v":85.010266940451757},{"$f":"IF(ISERROR(INDIRECT(CONCATENATE($B105,\"!E23\"))),\"\",INDIRECT(CONCATENATE($B105,\"!E23\")))","v":"N/A"},null,null,{"$f":"IF(ISERROR(INDIRECT(CONCATENATE($B105,\"!E21\"))),\"\",INDIRECT(CONCATENATE($B105,\"!E21\")))","v":1.7261219792865361},{"$f":"IF(ISERROR(INDIRECT(CONCATENATE($B105,\"!F16\"))),\"\",INDIRECT(CONCATENATE($B105,\"!F16\")))","v":95.807770961145195},{"$f":"IF(ISERROR(INDIRECT(CONCATENATE($B105,\"!F23\"))),\"\",INDIRECT(CONCATENATE($B105,\"!F23\")))","v":"N/A"},null,null,{"$f":"IF(ISERROR(INDIRECT(CONCATENATE($B105,\"!F21\"))),\"\",INDIRECT(CONCATENATE($B105,\"!F21\")))","v":0.72538860103626945},{"$f":"IF(ISERROR(INDIRECT(CONCATENATE($B105,\"!G16\"))),\"\",INDIRECT(CONCATENATE($B105,\"!G16\")))","v":98.456790123456798},{"$f":"IF(ISERROR(INDIRECT(CONCATENATE($B105,\"!G23\"))),\"\",INDIRECT(CONCATENATE($B105,\"!G23\")))","v":"N/A"},null,null,{"$f":"IF(ISERROR(INDIRECT(CONCATENATE($B105,\"!G221\"))),\"\",INDIRECT(CONCATENATE($B105,\"!G21\")))","v":0}]
[null,"ENCOVI11",2011,72.2,96,null,null,23.1,85.3,98.3,null,null,10.199999999999999,90.7,98.8,null,null,6.8,93.1,99.8,null,null,4.5999999999999996,98,99.9,null,null,1]
[null,"DHS15",2015,85.9,98.2,null,null,6.1,96.2,99.2,null,null,1.5,98.6,99.7,null,null,0.5,99.4,99.9,null,null,0.5,99.9,99.9,null,null,0]
[null,null,null,"","",null,null,"","","",null,null,"","","",null,null,"","","",null,null,"","","",null,null,""]
[null,null,null,"","",null,null,"","","",null,null,"","","",null,null,"","","",null,null,"","","",null,null,""]
[null,null,null,"","",null,null,"","","",null,null,"","","",null,null,"","","",null,null,"","","",null,null,""]
[null,null,null,{"$f":"IF(ISERROR(INDIRECT(CONCATENATE($B111,\"!C16\"))),\"\",INDIRECT(CONCATENATE($B111,\"!C16\")))","v":""},{"$f":"IF(ISERROR(INDIRECT(CONCATENATE($B111,\"!C23\"))),\"\",INDIRECT(CONCATENATE($B111,\"!C23\")))","v":""},null,null,{"$f":"IF(ISERROR(INDIRECT(CONCATENATE($B111,\"!C21\"))),\"\",INDIRECT(CONCATENATE($B111,\"!C21\")))","v":""},{"$f":"IF(ISERROR(INDIRECT(CONCATENATE($B111,\"!D16\"))),\"\",INDIRECT(CONCATENATE($B111,\"!D16\")))","v":""},{"$f":"IF(ISERROR(INDIRECT(CONCATENATE($B111,\"!D23\"))),\"\",INDIRECT(CONCATENATE($B111,\"!D23\")))","v":""},null,null,{"$f":"IF(ISERROR(INDIRECT(CONCATENATE($B111,\"!D21\"))),\"\",INDIRECT(CONCATENATE($B111,\"!D21\")))","v":""},{"$f":"IF(ISERROR(INDIRECT(CONCATENATE($B111,\"!E16\"))),\"\",INDIRECT(CONCATENATE($B111,\"!E16\")))","v":""},{"$f":"IF(ISERROR(INDIRECT(CONCATENATE($B111,\"!E23\"))),\"\",INDIRECT(CONCATENATE($B111,\"!E23\")))","v":""},null,null,{"$f":"IF(ISERROR(INDIRECT(CONCATENATE($B111,\"!E21\"))),\"\",INDIRECT(CONCATENATE($B111,\"!E21\")))","v":""},{"$f":"IF(ISERROR(INDIRECT(CONCATENATE($B111,\"!F16\"))),\"\",INDIRECT(CONCATENATE($B111,\"!F16\")))","v":""},{"$f":"IF(ISERROR(INDIRECT(CONCATENATE($B111,\"!F23\"))),\"\",INDIRECT(CONCATENATE($B111,\"!F23\")))","v":""},null,null,{"$f":"IF(ISERROR(INDIRECT(CONCATENATE($B111,\"!F21\"))),\"\",INDIRECT(CONCATENATE($B111,\"!F21\")))","v":""},{"$f":"IF(ISERROR(INDIRECT(CONCATENATE($B111,\"!G16\"))),\"\",INDIRECT(CONCATENATE($B111,\"!G16\")))","v":""},{"$f":"IF(ISERROR(INDIRECT(CONCATENATE($B111,\"!G23\"))),\"\",INDIRECT(CONCATENATE($B111,\"!G23\")))","v":""},null,null,{"$f":"IF(ISERROR(INDIRECT(CONCATENATE($B111,\"!G221\"))),\"\",INDIRECT(CONCATENATE($B111,\"!G21\")))","v":""}]
[null,null,null,{"$f":"IF(ISERROR(INDIRECT(CONCATENATE($B112,\"!C16\"))),\"\",INDIRECT(CONCATENATE($B112,\"!C16\")))","v":""},{"$f":"IF(ISERROR(INDIRECT(CONCATENATE($B112,\"!C23\"))),\"\",INDIRECT(CONCATENATE($B112,\"!C23\")))","v":""},null,null,{"$f":"IF(ISERROR(INDIRECT(CONCATENATE($B112,\"!C21\"))),\"\",INDIRECT(CONCATENATE($B112,\"!C21\")))","v":""},{"$f":"IF(ISERROR(INDIRECT(CONCATENATE($B112,\"!D16\"))),\"\",INDIRECT(CONCATENATE($B112,\"!D16\")))","v":""},{"$f":"IF(ISERROR(INDIRECT(CONCATENATE($B112,\"!D23\"))),\"\",INDIRECT(CONCATENATE($B112,\"!D23\")))","v":""},null,null,{"$f":"IF(ISERROR(INDIRECT(CONCATENATE($B112,\"!D21\"))),\"\",INDIRECT(CONCATENATE($B112,\"!D21\")))","v":""},{"$f":"IF(ISERROR(INDIRECT(CONCATENATE($B112,\"!E16\"))),\"\",INDIRECT(CONCATENATE($B112,\"!E16\")))","v":""},{"$f":"IF(ISERROR(INDIRECT(CONCATENATE($B112,\"!E23\"))),\"\",INDIRECT(CONCATENATE($B112,\"!E23\")))","v":""},null,null,{"$f":"IF(ISERROR(INDIRECT(CONCATENATE($B112,\"!E21\"))),\"\",INDIRECT(CONCATENATE($B112,\"!E21\")))","v":""},{"$f":"IF(ISERROR(INDIRECT(CONCATENATE($B112,\"!F16\"))),\"\",INDIRECT(CONCATENATE($B112,\"!F16\")))","v":""},{"$f":"IF(ISERROR(INDIRECT(CONCATENATE($B112,\"!F23\"))),\"\",INDIRECT(CONCATENATE($B112,\"!F23\")))","v":""},null,null,{"$f":"IF(ISERROR(INDIRECT(CONCATENATE($B112,\"!F21\"))),\"\",INDIRECT(CONCATENATE($B112,\"!F21\")))","v":""},{"$f":"IF(ISERROR(INDIRECT(CONCATENATE($B112,\"!G16\"))),\"\",INDIRECT(CONCATENATE($B112,\"!G16\")))","v":""},{"$f":"IF(ISERROR(INDIRECT(CONCATENATE($B112,\"!G23\"))),\"\",INDIRECT(CONCATENATE($B112,\"!G23\")))","v":""},null,null,{"$f":"IF(ISERROR(INDIRECT(CONCATENATE($B112,\"!G221\"))),\"\",INDIRECT(CONCATENATE($B112,\"!G21\")))","v":""}]
[null,null,null,"","",null,null,"","","",null,null,"","","",null,null,"","","",null,null,"","","",null,null,""]
[null,null,null,"","",null,null,"","","",null,null,"","","",null,null,"","","",null,null,"","","",null,null,""]
[null,null,null,"","",null,null,"","","",null,null,"","","",null,null,"","","",null,null,"","","",null,null,""]
[null,null,null,"","",null,null,"","","",null,null,"","","",null,null,"","","",null,null,"","","",null,null,""]
[]
[null,{"$f":"CONCATENATE(\"National use of drinking water sources, \",C99,\"–\",C100)","v":"National use of drinking water sources, 2000–2020"},null,null,null,null,null,null,null,null,null,null,null,null,null,null,null,null,"Data points used for regression"]
[]
[]
[]
[]
[]
[]
[]
[]
[]
[]
[]
[]
[]
[]
[]
[]
[]
[]
[]
[]
[]
[]
[]
[]
[]
[]
[]
[]
[]
[]
[]
[]
[]
[]
[null,null,null,null,{"$f":"IF(ISERROR(INDIRECT(CONCATENATE($B153,\"!M18\"))),\"\",INDIRECT(CONCATENATE($B153,\"!M18\")))","v":""},{"$f":"IF(ISERROR(INDIRECT(CONCATENATE($B153,\"!M19\"))),\"\",INDIRECT(CONCATENATE($B153,\"!M19\")))","v":""},{"$f":"IF(ISERROR(INDIRECT(CONCATENATE($B153,\"!M20\"))),\"\",INDIRECT(CONCATENATE($B153,\"!M20\")))","v":""},{"$f":"IF(ISERROR(INDIRECT(CONCATENATE($B153,\"!M21\"))),\"\",INDIRECT(CONCATENATE($B153,\"!M21\")))","v":""},null,{"$f":"IF(ISERROR(INDIRECT(CONCATENATE($B153,\"!N18\"))),\"\",INDIRECT(CONCATENATE($B153,\"!N18\")))","v":""},{"$f":"IF(ISERROR(INDIRECT(CONCATENATE($B153,\"!N19\"))),\"\",INDIRECT(CONCATENATE($B153,\"!N19\")))","v":""},{"$f":"IF(ISERROR(INDIRECT(CONCATENATE($B153,\"!N20\"))),\"\",INDIRECT(CONCATENATE($B153,\"!N20\")))","v":""},{"$f":"IF(ISERROR(INDIRECT(CONCATENATE($B153,\"!N21\"))),\"\",INDIRECT(CONCATENATE($B153,\"!N21\")))","v":""},null,{"$f":"IF(ISERROR(INDIRECT(CONCATENATE($B153,\"!O18\"))),\"\",INDIRECT(CONCATENATE($B153,\"!O18\")))","v":""},{"$f":"IF(ISERROR(INDIRECT(CONCATENATE($B153,\"!O19\"))),\"\",INDIRECT(CONCATENATE($B153,\"!O19\")))","v":""},{"$f":"IF(ISERROR(INDIRECT(CONCATENATE($B153,\"!O20\"))),\"\",INDIRECT(CONCATENATE($B153,\"!O20\")))","v":""},{"$f":"IF(ISERROR(INDIRECT(CONCATENATE($B153,\"!O21\"))),\"\",INDIRECT(CONCATENATE($B153,\"!O21\")))","v":""},null,{"$f":"IF(ISERROR(INDIRECT(CONCATENATE($B153,\"!P18\"))),\"\",INDIRECT(CONCATENATE($B153,\"!P18\")))","v":""},{"$f":"IF(ISERROR(INDIRECT(CONCATENATE($B153,\"!P19\"))),\"\",INDIRECT(CONCATENATE($B153,\"!P19\")))","v":""},{"$f":"IF(ISERROR(INDIRECT(CONCATENATE($B153,\"!P20\"))),\"\",INDIRECT(CONCATENATE($B153,\"!P20\")))","v":""},{"$f":"IF(ISERROR(INDIRECT(CONCATENATE($B153,\"!P21\"))),\"\",INDIRECT(CONCATENATE($B153,\"!P21\")))","v":""},null,{"$f":"IF(ISERROR(INDIRECT(CONCATENATE($B153,\"!Q18\"))),\"\",INDIRECT(CONCATENATE($B153,\"!Q18\")))","v":""},{"$f":"IF(ISERROR(INDIRECT(CONCATENATE($B153,\"!Q19\"))),\"\",INDIRECT(CONCATENATE($B153,\"!Q19\")))","v":""},{"$f":"IF(ISERROR(INDIRECT(CONCATENATE($B153,\"!Q20\"))),\"\",INDIRECT(CONCATENATE($B153,\"!Q20\")))","v":""},{"$f":"IF(ISERROR(INDIRECT(CONCATENATE($B153,\"!Q21\"))),\"\",INDIRECT(CONCATENATE($B153,\"!Q1\")))","v":""}]
[null,null,null,null,"","","","",null,"","","","",null,"","","","",null,"","","","",null,"","","",""]
[null,null,null,null,"","","","",null,"","","","",null,"","","","",null,"","","","",null,"","","",""]
[null,null,null,null,"","","","",null,"","","","",null,"","","","",null,"","","","",null,"","","",""]
[null,null,null,null,"","","","",null,"","","","",null,"","","","",null,"","","","",null,"","","",""]
[null,null,null,null,"","","","",null,"","","","",null,"","","","",null,"","","","",null,"","","",""]
[]
[]
[]
[]
[]
[]
[]
[]
[]
[]
[]
[]
[]
[]
[]
[]
[]
[]
[]
[]
[]
[]
[]
[]
[]
[]
[]
[]
[]
[]
[]
[]
[]
[]
[]
[]
[]
[]
["URBAN",null,null,"Poorest",null,null,null,null,"Poor",null,null,null,null,"Middle",null,null,null,null,"Rich",null,null,null,null,"Richest"]
[null,null,null,"Improved","Basic","Limited","Unimproved","Surface water","Improved","Basic","Limited","Unimproved","Surface water","Improved","Basic","Limited","Unimproved","Surface water","Improved","Basic","Limited","Unimproved","Surface water","Improved","Basic","Limited","Unimproved","Surface water"]
["Forecast period:",null,2000,{"$f":"IF((D201+H201)>100,D201*100/(D201+H201),D201)","v":95.691236195226281},{"$f":"D199*AVERAGEIF(E205:E216,\">0\")/100","v":95.404162486640601},{"$f":"D199*(100-AVERAGEIF(E205:E216,\">0\"))/100","v":0.2870737085856761},{"$f":"100-(E199+F199+H199)","v":3.0870398520347351},{"$f":"IF((D201+H201)>100,H201*100/(D201+H201),H201)","v":1.2217239527389907},{"$f":"IF((I201+M201)>100,I201*100/(I201+M201),I201)","v":97.073351648351633},{"$f":"I199*AVERAGEIF(J205:J216,\">0\")/100","v":96.685058241758213},{"$f":"I199*(100-AVERAGEIF(J205:J216,\">0\"))/100","v":0.38829340659341205},{"$f":"100-(J199+K199+M199)","v":2.2913288972334556},{"$f":"IF((I201+M201)>100,M201*100/(I201+M201),M201)","v":0.63531945441492965},{"$f":"IF((N201+R201)>100,N201*100/(N201+R201),N201)","v":96.991483516483513},{"$f":"N199*AVERAGEIF(O205:O216,\">0\")/100","v":96.991483516483513},{"$f":"N199*(100-AVERAGEIF(O205:O216,\">0\"))/100","v":0},{"$f":"100-(O199+P199+R199)","v":2.6513736263736263},{"$f":"IF((N201+R201)>100,R201*100/(N201+R201),R201)","v":0.3571428571428612},{"$f":"IF((S201+W201)>100,S201*100/(S201+W201),S201)","v":97.698688969258569},{"$f":"S199*AVERAGEIF(T205:T216,\">0\")/100","v":97.649839624773946},{"$f":"S199*(100-AVERAGEIF(T205:T216,\">0\"))/100","v":4.8849344484626502E-2},{"$f":"100-(T199+U199+W199)","v":2.1941681735985696},{"$f":"IF((S201+W201)>100,W201*100/(S201+W201),W201)","v":0.1071428571428541},{"$f":"IF((X201+AB201)>100,X201*100/(X201+AB201),X201)","v":99.160924369747889},{"$f":"X199*AVERAGEIF(Y205:Y216,\">0\")/100","v":99.160924369747875},{"$f":"X199*(100-AVERAGEIF(Y205:Y216,\">0\"))/100","v":0},{"$f":"100-(Y199+Z199+AB199)","v":0.83907563025212539},{"$f":"IF((X201+AB201)>100,AB201*100/(X201+AB201),AB201)","v":0}]
[null,null,2020,{"$f":"IF((D202+H202)>100,D202*100/(D202+H202),D202)","v":92.941254007837586},{"$f":"D200*AVERAGEIF(E205:E216,\">0\")/100","v":92.662430245814065},{"$f":"D200*(100-AVERAGEIF(E205:E216,\">0\"))/100","v":0.27882376202351011},{"$f":"100-(E200+F200+H200)","v":5.9682787526350296},{"$f":"IF((D202+H202)>100,H202*100/(D202+H202),H202)","v":1.090467239527392},{"$f":"IF((I202+M202)>100,I202*100/(I202+M202),I202)","v":97.469026940801143},{"$f":"I200*AVERAGEIF(J205:J216,\">0\")/100","v":97.079150833037929},{"$f":"I200*(100-AVERAGEIF(J205:J216,\">0\"))/100","v":0.38987610776321013},{"$f":"100-(J200+K200+M200)","v":1.6831625782225501},{"$f":"IF((I202+M202)>100,M202*100/(I202+M202),M202)","v":0.84781048097630674},{"$f":"IF((N202+R202)>100,N202*100/(N202+R202),N202)","v":98.370214462956412},{"$f":"N200*AVERAGEIF(O205:O216,\">0\")/100","v":98.370214462956412},{"$f":"N200*(100-AVERAGEIF(O205:O216,\">0\"))/100","v":0},{"$f":"100-(O200+P200+R200)","v":0.7012141084721577},{"$f":"IF((N202+R202)>100,R202*100/(N202+R202),R202)","v":0.9285714285714306},{"$f":"IF((S202+W202)>100,S202*100/(S202+W202),S202)","v":99.687477396021677},{"$f":"S200*AVERAGEIF(T205:T216,\">0\")/100","v":99.637633657323676},{"$f":"S200*(100-AVERAGEIF(T205:T216,\">0\"))/100","v":4.9843738698008011E-2},{"$f":"100-(T200+U200+W200)","v":3.395117540689796E-2},{"$f":"IF((S202+W202)>100,W202*100/(S202+W202),W202)","v":0.27857142857142847},{"$f":"IF((X202+AB202)>100,X202*100/(X202+AB202),X202)","v":100},{"$f":"X200*AVERAGEIF(Y205:Y216,\">0\")/100","v":100},{"$f":"X200*(100-AVERAGEIF(Y205:Y216,\">0\"))/100","v":0},{"$f":"100-(Y200+Z200+AB200)","v":0},{"$f":"IF((X202+AB202)>100,AB202*100/(X202+AB202),AB202)","v":0}]
["Regression period:",null,{"$f":"MinRegYear(C199,C205:C216)","v":2001},{"$f":"IF(MAX(C205:C216)-MIN(C205:C216)<5,AVERAGEIF(C205:C216,\">0\",D205:D216),\nIF(FORECAST($C201,D$205:D$216,$C$205:$C$216)<0,0,\nIF(FORECAST($C201,D$205:D$216,$C$205:$C$216)>100,100,\nFORECAST($C201,D$205:D$216,$C$205:$C$216))))","v":95.691236195226281},null,null,null,{"$f":"IF(MAX(C205:C216)-MIN(C205:C216)<5,AVERAGEIF(C205:C216,\">0\",H205:H216),\nIF(FORECAST($C201,H$205:H$216,$C$205:$C$216)<0,0,\nIF(FORECAST($C201,H$205:H$216,$C$205:$C$216)>100,100,\nFORECAST($C201,H$205:H$216,$C$205:$C$216))))","v":1.2217239527389907},{"$f":"IF(MAX(C205:C216)-MIN(C205:C216)<5,AVERAGEIF(C205:C216,\">0\",I205:I216),\nIF(FORECAST($C201,I$205:I$216,$C$205:$C$216)<0,0,\nIF(FORECAST($C201,I$205:I$216,$C$205:$C$216)>100,100,\nFORECAST($C201,I$205:I$216,$C$205:$C$216))))","v":97.073351648351633},null,null,null,{"$f":"IF(MAX(C205:C216)-MIN(C205:C216)<5,AVERAGEIF(C205:C216,\">0\",M205:M216),\nIF(FORECAST($C201,M$205:M$216,$C$205:$C$216)<0,0,\nIF(FORECAST($C201,M$205:M$216,$C$205:$C$216)>100,100,\nFORECAST($C201,M$205:M$216,$C$205:$C$216))))","v":0.63531945441492965},{"$f":"IF(MAX(C205:C216)-MIN(C205:C216)<5,AVERAGEIF(C205:C216,\">0\",N205:N216),\nIF(FORECAST($C201,N$205:N$216,$C$205:$C$216)<0,0,\nIF(FORECAST($C201,N$205:N$216,$C$205:$C$216)>100,100,\nFORECAST($C201,N$205:N$216,$C$205:$C$216))))","v":96.991483516483513},null,null,null,{"$f":"IF(MAX(C205:C216)-MIN(C205:C216)<5,AVERAGEIF(C205:C216,\">0\",R205:R216),\nIF(FORECAST($C201,R$205:R$216,$C$205:$C$216)<0,0,\nIF(FORECAST($C201,R$205:R$216,$C$205:$C$216)>100,100,\nFORECAST($C201,R$205:R$216,$C$205:$C$216))))","v":0.3571428571428612},{"$f":"IF(MAX(C205:C216)-MIN(C205:C216)<5,AVERAGEIF(C205:C216,\">0\",S205:S216),\nIF(FORECAST($C201,S$205:S$216,$C$205:$C$216)<0,0,\nIF(FORECAST($C201,S$205:S$216,$C$205:$C$216)>100,100,\nFORECAST($C201,S$205:S$216,$C$205:$C$216))))","v":97.698688969258569},null,null,null,{"$f":"IF(MAX(C205:C216)-MIN(C205:C216)<5,AVERAGEIF(C205:C216,\">0\",W205:W216),\nIF(FORECAST($C201,W$205:W$216,$C$205:$C$216)<0,0,\nIF(FORECAST($C201,W$205:W$216,$C$205:$C$216)>100,100,\nFORECAST($C201,W$205:W$216,$C$205:$C$216))))","v":0.1071428571428541},{"$f":"IF(MAX(C205:C216)-MIN(C205:C216)<5,AVERAGEIF(C205:C216,\">0\",X205:X216),\nIF(FORECAST($C201,X$205:X$216,$C$205:$C$216)<0,0,\nIF(FORECAST($C201,X$205:X$216,$C$205:$C$216)>100,100,\nFORECAST($C201,X$205:X$216,$C$205:$C$216))))","v":99.160924369747889},null,null,null,{"$f":"IF(MAX(C205:C216)-MIN(C205:C216)<5,AVERAGEIF(C205:C216,\">0\",AB205:AB216),\nIF(FORECAST($C201,AB$205:AB$216,$C$205:$C$216)<0,0,\nIF(FORECAST($C201,AB$205:AB$216,$C$205:$C$216)>100,100,\nFORECAST($C201,AB$205:AB$216,$C$205:$C$216))))","v":0}]
[null,null,{"$f":"MaxRegYear(C200,C205:C216)","v":2017},{"$f":"IF(MAX(C205:C216)-MIN(C205:C216)<5,AVERAGEIF(C205:C216,\">0\",D205:D216),\nIF(FORECAST($C202,D$205:D$216,$C$205:$C$216)<0,0,\nIF(FORECAST($C202,D$205:D$216,$C$205:$C$216)>100,100,\nFORECAST($C202,D$205:D$216,$C$205:$C$216))))","v":92.941254007837586},null,null,null,{"$f":"IF(MAX(C205:C216)-MIN(C205:C216)<5,AVERAGEIF(C205:C216,\">0\",H205:H216),\nIF(FORECAST($C202,H$205:H$216,$C$205:$C$216)<0,0,\nIF(FORECAST($C202,H$205:H$216,$C$205:$C$216)>100,100,\nFORECAST($C202,H$205:H$216,$C$205:$C$216))))","v":1.090467239527392},{"$f":"IF(MAX(C205:C216)-MIN(C205:C216)<5,AVERAGEIF(C205:C216,\">0\",I205:I216),\nIF(FORECAST($C202,I$205:I$216,$C$205:$C$216)<0,0,\nIF(FORECAST($C202,I$205:I$216,$C$205:$C$216)>100,100,\nFORECAST($C202,I$205:I$216,$C$205:$C$216))))","v":97.469026940801143},null,null,null,{"$f":"IF(MAX(C205:C216)-MIN(C205:C216)<5,AVERAGEIF(C205:C216,\">0\",M205:M216),\nIF(FORECAST($C202,M$205:M$216,$C$205:$C$216)<0,0,\nIF(FORECAST($C202,M$205:M$216,$C$205:$C$216)>100,100,\nFORECAST($C202,M$205:M$216,$C$205:$C$216))))","v":0.84781048097630674},{"$f":"IF(MAX(C205:C216)-MIN(C205:C216)<5,AVERAGEIF(C205:C216,\">0\",N205:N216),\nIF(FORECAST($C202,N$205:N$216,$C$205:$C$216)<0,0,\nIF(FORECAST($C202,N$205:N$216,$C$205:$C$216)>100,100,\nFORECAST($C202,N$205:N$216,$C$205:$C$216))))","v":98.370214462956412},null,null,null,{"$f":"IF(MAX(C205:C216)-MIN(C205:C216)<5,AVERAGEIF(C205:C216,\">0\",R205:R216),\nIF(FORECAST($C202,R$205:R$216,$C$205:$C$216)<0,0,\nIF(FORECAST($C202,R$205:R$216,$C$205:$C$216)>100,100,\nFORECAST($C202,R$205:R$216,$C$205:$C$216))))","v":0.9285714285714306},{"$f":"IF(MAX(C205:C216)-MIN(C205:C216)<5,AVERAGEIF(C205:C216,\">0\",S205:S216),\nIF(FORECAST($C202,S$205:S$216,$C$205:$C$216)<0,0,\nIF(FORECAST($C202,S$205:S$216,$C$205:$C$216)>100,100,\nFORECAST($C202,S$205:S$216,$C$205:$C$216))))","v":99.687477396021677},null,null,null,{"$f":"IF(MAX(C205:C216)-MIN(C205:C216)<5,AVERAGEIF(C205:C216,\">0\",W205:W216),\nIF(FORECAST($C202,W$205:W$216,$C$205:$C$216)<0,0,\nIF(FORECAST($C202,W$205:W$216,$C$205:$C$216)>100,100,\nFORECAST($C202,W$205:W$216,$C$205:$C$216))))","v":0.27857142857142847},{"$f":"IF(MAX(C205:C216)-MIN(C205:C216)<5,AVERAGEIF(C205:C216,\">0\",X205:X216),\nIF(FORECAST($C202,X$205:X$216,$C$205:$C$216)<0,0,\nIF(FORECAST($C202,X$205:X$216,$C$205:$C$216)>100,100,\nFORECAST($C202,X$205:X$216,$C$205:$C$216))))","v":100},null,null,null,{"$f":"IF(MAX(C205:C216)-MIN(C205:C216)<5,AVERAGEIF(C205:C216,\">0\",AB205:AB216),\nIF(FORECAST($C202,AB$205:AB$216,$C$205:$C$216)<0,0,\nIF(FORECAST($C202,AB$205:AB$216,$C$205:$C$216)>100,100,\nFORECAST($C202,AB$205:AB$216,$C$205:$C$216))))","v":0}]
[]
[null,"Survey","Year","Improved","% Improved\n< = 30min",null,null,"Surface water","Improved","% Improved\n< = 30min",null,null,"Surface water","Improved","% Improved\n< = 30min",null,null,"Surface water","Improved","% Improved\n< = 30min",null,null,"Surface water","Improved","% Improved\n< = 30min",null,null,"Surface water"]
[null,"WHS03",2003,{"$f":"IF(ISERROR(INDIRECT(CONCATENATE($B205,\"!H16\"))),\"\",INDIRECT(CONCATENATE($B205,\"!H16\")))","v":98.004987531172077},{"$f":"IF(ISERROR(INDIRECT(CONCATENATE($B205,\"!H23\"))),\"\",INDIRECT(CONCATENATE($B205,\"!H23\")))","v":"N/A"},null,null,{"$f":"IF(ISERROR(INDIRECT(CONCATENATE($B205,\"!H21\"))),\"\",INDIRECT(CONCATENATE($B205,\"!H21\")))","v":0.75187969924812026},{"$f":"IF(ISERROR(INDIRECT(CONCATENATE($B205,\"!I16\"))),\"\",INDIRECT(CONCATENATE($B205,\"!I16\")))","v":98.263027295285355},{"$f":"IF(ISERROR(INDIRECT(CONCATENATE($B205,\"!I23\"))),\"\",INDIRECT(CONCATENATE($B205,\"!I23\")))","v":"N/A"},null,null,{"$f":"IF(ISERROR(INDIRECT(CONCATENATE($B205,\"!I21\"))),\"\",INDIRECT(CONCATENATE($B205,\"!I21\")))","v":0.25125628140703515},{"$f":"IF(ISERROR(INDIRECT(CONCATENATE($B205,\"!J16\"))),\"\",INDIRECT(CONCATENATE($B205,\"!J16\")))","v":98.014888337468989},{"$f":"IF(ISERROR(INDIRECT(CONCATENATE($B205,\"!J23\"))),\"\",INDIRECT(CONCATENATE($B205,\"!J23\")))","v":"N/A"},null,null,{"$f":"IF(ISERROR(INDIRECT(CONCATENATE($B205,\"!J21\"))),\"\",INDIRECT(CONCATENATE($B205,\"!J21\")))","v":0},{"$f":"IF(ISERROR(INDIRECT(CONCATENATE($B205,\"!K16\"))),\"\",INDIRECT(CONCATENATE($B205,\"!K16\")))","v":98.22784810126582},{"$f":"IF(ISERROR(INDIRECT(CONCATENATE($B205,\"!K23\"))),\"\",INDIRECT(CONCATENATE($B205,\"!K23\")))","v":"N/A"},null,null,{"$f":"IF(ISERROR(INDIRECT(CONCATENATE($B205,\"!K21\"))),\"\",INDIRECT(CONCATENATE($B205,\"!K21\")))","v":0},{"$f":"IF(ISERROR(INDIRECT(CONCATENATE($B205,\"!L16\"))),\"\",INDIRECT(CONCATENATE($B205,\"!L16\")))","v":99.264705882352942},{"$f":"IF(ISERROR(INDIRECT(CONCATENATE($B205,\"!L23\"))),\"\",INDIRECT(CONCATENATE($B205,\"!L23\")))","v":"N/A"},null,null,{"$f":"IF(ISERROR(INDIRECT(CONCATENATE($B205,\"!L221\"))),\"\",INDIRECT(CONCATENATE($B205,\"!L21\")))","v":0}]
[null,"ENCOVI11",2011,86,99.7,null,null,2.5,93.9,99.3,null,null,2,95.3,100,null,null,2,98.1,100,null,null,0.6,99.7,100,null,null,0]
[null,"DHS15",2015,98.6,99.7,null,null,0.2,99.7,99.9,null,null,0,99.9,100,null,null,0,100,99.9,null,null,0,99.9,100,null,null,0]
[null,null,null,"","",null,null,"","","",null,null,"","","",null,null,"","","",null,null,"","","",null,null,""]
[null,null,null,"","",null,null,"","","",null,null,"","","",null,null,"","","",null,null,"","","",null,null,""]
[null,null,null,"","",null,null,"","","",null,null,"","","",null,null,"","","",null,null,"","","",null,null,""]
[null,null,null,"","",null,null,"","","",null,null,"","","",null,null,"","","",null,null,"","","",null,null,""]
[null,null,null,"","",null,null,"","","",null,null,"","","",null,null,"","","",null,null,"","","",null,null,""]
[null,null,null,"","",null,null,"","","",null,null,"","","",null,null,"","","",null,null,"","","",null,null,""]
[null,null,null,"","",null,null,"","","",null,null,"","","",null,null,"","","",null,null,"","","",null,null,""]
[null,null,null,"","",null,null,"","","",null,null,"","","",null,null,"","","",null,null,"","","",null,null,""]
[null,null,null,"","",null,null,"","","",null,null,"","","",null,null,"","","",null,null,"","","",null,null,""]
[]
[null,{"$f":"CONCATENATE(\"Urban use of drinking water sources,  \",C199,\"–\",C200)","v":"Urban use of drinking water sources,  2000–2020"},null,null,null,null,null,null,null,null,null,null,null,null,null,null,null,null,"Data points used for regression"]
[]
[]
[]
[]
[]
[]
[]
[]
[]
[]
[]
[]
[]
[]
[]
[]
[]
[]
[]
[]
[]
[]
[]
[]
[]
[]
[]
[]
[]
[]
[]
[]
[]
[]
[null,null,null,null,{"$f":"IF(ISERROR(INDIRECT(CONCATENATE($B253,\"!M18\"))),\"\",INDIRECT(CONCATENATE($B253,\"!M18\")))","v":""},{"$f":"IF(ISERROR(INDIRECT(CONCATENATE($B253,\"!M19\"))),\"\",INDIRECT(CONCATENATE($B253,\"!M19\")))","v":""},{"$f":"IF(ISERROR(INDIRECT(CONCATENATE($B253,\"!M20\"))),\"\",INDIRECT(CONCATENATE($B253,\"!M20\")))","v":""},{"$f":"IF(ISERROR(INDIRECT(CONCATENATE($B253,\"!M21\"))),\"\",INDIRECT(CONCATENATE($B253,\"!M21\")))","v":""},null,{"$f":"IF(ISERROR(INDIRECT(CONCATENATE($B253,\"!N18\"))),\"\",INDIRECT(CONCATENATE($B253,\"!N18\")))","v":""},{"$f":"IF(ISERROR(INDIRECT(CONCATENATE($B253,\"!N19\"))),\"\",INDIRECT(CONCATENATE($B253,\"!N19\")))","v":""},{"$f":"IF(ISERROR(INDIRECT(CONCATENATE($B253,\"!N20\"))),\"\",INDIRECT(CONCATENATE($B253,\"!N20\")))","v":""},{"$f":"IF(ISERROR(INDIRECT(CONCATENATE($B253,\"!N21\"))),\"\",INDIRECT(CONCATENATE($B253,\"!N21\")))","v":""},null,{"$f":"IF(ISERROR(INDIRECT(CONCATENATE($B253,\"!O18\"))),\"\",INDIRECT(CONCATENATE($B253,\"!O18\")))","v":""},{"$f":"IF(ISERROR(INDIRECT(CONCATENATE($B253,\"!O19\"))),\"\",INDIRECT(CONCATENATE($B253,\"!O19\")))","v":""},{"$f":"IF(ISERROR(INDIRECT(CONCATENATE($B253,\"!O20\"))),\"\",INDIRECT(CONCATENATE($B253,\"!O20\")))","v":""},{"$f":"IF(ISERROR(INDIRECT(CONCATENATE($B253,\"!O21\"))),\"\",INDIRECT(CONCATENATE($B253,\"!O21\")))","v":""},null,{"$f":"IF(ISERROR(INDIRECT(CONCATENATE($B253,\"!P18\"))),\"\",INDIRECT(CONCATENATE($B253,\"!P18\")))","v":""},{"$f":"IF(ISERROR(INDIRECT(CONCATENATE($B253,\"!P19\"))),\"\",INDIRECT(CONCATENATE($B253,\"!P19\")))","v":""},{"$f":"IF(ISERROR(INDIRECT(CONCATENATE($B253,\"!P20\"))),\"\",INDIRECT(CONCATENATE($B253,\"!P20\")))","v":""},{"$f":"IF(ISERROR(INDIRECT(CONCATENATE($B253,\"!P21\"))),\"\",INDIRECT(CONCATENATE($B253,\"!P21\")))","v":""},null,{"$f":"IF(ISERROR(INDIRECT(CONCATENATE($B253,\"!Q18\"))),\"\",INDIRECT(CONCATENATE($B253,\"!Q18\")))","v":""},{"$f":"IF(ISERROR(INDIRECT(CONCATENATE($B253,\"!Q19\"))),\"\",INDIRECT(CONCATENATE($B253,\"!Q19\")))","v":""},{"$f":"IF(ISERROR(INDIRECT(CONCATENATE($B253,\"!Q20\"))),\"\",INDIRECT(CONCATENATE($B253,\"!Q20\")))","v":""},{"$f":"IF(ISERROR(INDIRECT(CONCATENATE($B253,\"!Q21\"))),\"\",INDIRECT(CONCATENATE($B253,\"!Q1\")))","v":""}]
[null,null,null,null,{"$f":"IF(ISERROR(INDIRECT(CONCATENATE($B254,\"!M18\"))),\"\",INDIRECT(CONCATENATE($B254,\"!M18\")))","v":""},{"$f":"IF(ISERROR(INDIRECT(CONCATENATE($B254,\"!M19\"))),\"\",INDIRECT(CONCATENATE($B254,\"!M19\")))","v":""},{"$f":"IF(ISERROR(INDIRECT(CONCATENATE($B254,\"!M20\"))),\"\",INDIRECT(CONCATENATE($B254,\"!M20\")))","v":""},{"$f":"IF(ISERROR(INDIRECT(CONCATENATE($B254,\"!M21\"))),\"\",INDIRECT(CONCATENATE($B254,\"!M21\")))","v":""},null,{"$f":"IF(ISERROR(INDIRECT(CONCATENATE($B254,\"!N18\"))),\"\",INDIRECT(CONCATENATE($B254,\"!N18\")))","v":""},{"$f":"IF(ISERROR(INDIRECT(CONCATENATE($B254,\"!N19\"))),\"\",INDIRECT(CONCATENATE($B254,\"!N19\")))","v":""},{"$f":"IF(ISERROR(INDIRECT(CONCATENATE($B254,\"!N20\"))),\"\",INDIRECT(CONCATENATE($B254,\"!N20\")))","v":""},{"$f":"IF(ISERROR(INDIRECT(CONCATENATE($B254,\"!N21\"))),\"\",INDIRECT(CONCATENATE($B254,\"!N21\")))","v":""},null,{"$f":"IF(ISERROR(INDIRECT(CONCATENATE($B254,\"!O18\"))),\"\",INDIRECT(CONCATENATE($B254,\"!O18\")))","v":""},{"$f":"IF(ISERROR(INDIRECT(CONCATENATE($B254,\"!O19\"))),\"\",INDIRECT(CONCATENATE($B254,\"!O19\")))","v":""},{"$f":"IF(ISERROR(INDIRECT(CONCATENATE($B254,\"!O20\"))),\"\",INDIRECT(CONCATENATE($B254,\"!O20\")))","v":""},{"$f":"IF(ISERROR(INDIRECT(CONCATENATE($B254,\"!O21\"))),\"\",INDIRECT(CONCATENATE($B254,\"!O21\")))","v":""},null,{"$f":"IF(ISERROR(INDIRECT(CONCATENATE($B254,\"!P18\"))),\"\",INDIRECT(CONCATENATE($B254,\"!P18\")))","v":""},{"$f":"IF(ISERROR(INDIRECT(CONCATENATE($B254,\"!P19\"))),\"\",INDIRECT(CONCATENATE($B254,\"!P19\")))","v":""},{"$f":"IF(ISERROR(INDIRECT(CONCATENATE($B254,\"!P20\"))),\"\",INDIRECT(CONCATENATE($B254,\"!P20\")))","v":""},{"$f":"IF(ISERROR(INDIRECT(CONCATENATE($B254,\"!P21\"))),\"\",INDIRECT(CONCATENATE($B254,\"!P21\")))","v":""},null,{"$f":"IF(ISERROR(INDIRECT(CONCATENATE($B254,\"!Q18\"))),\"\",INDIRECT(CONCATENATE($B254,\"!Q18\")))","v":""},{"$f":"IF(ISERROR(INDIRECT(CONCATENATE($B254,\"!Q19\"))),\"\",INDIRECT(CONCATENATE($B254,\"!Q19\")))","v":""},{"$f":"IF(ISERROR(INDIRECT(CONCATENATE($B254,\"!Q20\"))),\"\",INDIRECT(CONCATENATE($B254,\"!Q20\")))","v":""},{"$f":"IF(ISERROR(INDIRECT(CONCATENATE($B254,\"!Q21\"))),\"\",INDIRECT(CONCATENATE($B254,\"!Q1\")))","v":""}]
[null,null,null,null,{"$f":"IF(ISERROR(INDIRECT(CONCATENATE($B255,\"!M18\"))),\"\",INDIRECT(CONCATENATE($B255,\"!M18\")))","v":""},{"$f":"IF(ISERROR(INDIRECT(CONCATENATE($B255,\"!M19\"))),\"\",INDIRECT(CONCATENATE($B255,\"!M19\")))","v":""},{"$f":"IF(ISERROR(INDIRECT(CONCATENATE($B255,\"!M20\"))),\"\",INDIRECT(CONCATENATE($B255,\"!M20\")))","v":""},{"$f":"IF(ISERROR(INDIRECT(CONCATENATE($B255,\"!M21\"))),\"\",INDIRECT(CONCATENATE($B255,\"!M21\")))","v":""},null,{"$f":"IF(ISERROR(INDIRECT(CONCATENATE($B255,\"!N18\"))),\"\",INDIRECT(CONCATENATE($B255,\"!N18\")))","v":""},{"$f":"IF(ISERROR(INDIRECT(CONCATENATE($B255,\"!N19\"))),\"\",INDIRECT(CONCATENATE($B255,\"!N19\")))","v":""},{"$f":"IF(ISERROR(INDIRECT(CONCATENATE($B255,\"!N20\"))),\"\",INDIRECT(CONCATENATE($B255,\"!N20\")))","v":""},{"$f":"IF(ISERROR(INDIRECT(CONCATENATE($B255,\"!N21\"))),\"\",INDIRECT(CONCATENATE($B255,\"!N21\")))","v":""},null,{"$f":"IF(ISERROR(INDIRECT(CONCATENATE($B255,\"!O18\"))),\"\",INDIRECT(CONCATENATE($B255,\"!O18\")))","v":""},{"$f":"IF(ISERROR(INDIRECT(CONCATENATE($B255,\"!O19\"))),\"\",INDIRECT(CONCATENATE($B255,\"!O19\")))","v":""},{"$f":"IF(ISERROR(INDIRECT(CONCATENATE($B255,\"!O20\"))),\"\",INDIRECT(CONCATENATE($B255,\"!O20\")))","v":""},{"$f":"IF(ISERROR(INDIRECT(CONCATENATE($B255,\"!O21\"))),\"\",INDIRECT(CONCATENATE($B255,\"!O21\")))","v":""},null,{"$f":"IF(ISERROR(INDIRECT(CONCATENATE($B255,\"!P18\"))),\"\",INDIRECT(CONCATENATE($B255,\"!P18\")))","v":""},{"$f":"IF(ISERROR(INDIRECT(CONCATENATE($B255,\"!P19\"))),\"\",INDIRECT(CONCATENATE($B255,\"!P19\")))","v":""},{"$f":"IF(ISERROR(INDIRECT(CONCATENATE($B255,\"!P20\"))),\"\",INDIRECT(CONCATENATE($B255,\"!P20\")))","v":""},{"$f":"IF(ISERROR(INDIRECT(CONCATENATE($B255,\"!P21\"))),\"\",INDIRECT(CONCATENATE($B255,\"!P21\")))","v":""},null,{"$f":"IF(ISERROR(INDIRECT(CONCATENATE($B255,\"!Q18\"))),\"\",INDIRECT(CONCATENATE($B255,\"!Q18\")))","v":""},{"$f":"IF(ISERROR(INDIRECT(CONCATENATE($B255,\"!Q19\"))),\"\",INDIRECT(CONCATENATE($B255,\"!Q19\")))","v":""},{"$f":"IF(ISERROR(INDIRECT(CONCATENATE($B255,\"!Q20\"))),\"\",INDIRECT(CONCATENATE($B255,\"!Q20\")))","v":""},{"$f":"IF(ISERROR(INDIRECT(CONCATENATE($B255,\"!Q21\"))),\"\",INDIRECT(CONCATENATE($B255,\"!Q1\")))","v":""}]
[null,null,null,null,{"$f":"IF(ISERROR(INDIRECT(CONCATENATE($B256,\"!M18\"))),\"\",INDIRECT(CONCATENATE($B256,\"!M18\")))","v":""},{"$f":"IF(ISERROR(INDIRECT(CONCATENATE($B256,\"!M19\"))),\"\",INDIRECT(CONCATENATE($B256,\"!M19\")))","v":""},{"$f":"IF(ISERROR(INDIRECT(CONCATENATE($B256,\"!M20\"))),\"\",INDIRECT(CONCATENATE($B256,\"!M20\")))","v":""},{"$f":"IF(ISERROR(INDIRECT(CONCATENATE($B256,\"!M21\"))),\"\",INDIRECT(CONCATENATE($B256,\"!M21\")))","v":""},null,{"$f":"IF(ISERROR(INDIRECT(CONCATENATE($B256,\"!N18\"))),\"\",INDIRECT(CONCATENATE($B256,\"!N18\")))","v":""},{"$f":"IF(ISERROR(INDIRECT(CONCATENATE($B256,\"!N19\"))),\"\",INDIRECT(CONCATENATE($B256,\"!N19\")))","v":""},{"$f":"IF(ISERROR(INDIRECT(CONCATENATE($B256,\"!N20\"))),\"\",INDIRECT(CONCATENATE($B256,\"!N20\")))","v":""},{"$f":"IF(ISERROR(INDIRECT(CONCATENATE($B256,\"!N21\"))),\"\",INDIRECT(CONCATENATE($B256,\"!N21\")))","v":""},null,{"$f":"IF(ISERROR(INDIRECT(CONCATENATE($B256,\"!O18\"))),\"\",INDIRECT(CONCATENATE($B256,\"!O18\")))","v":""},{"$f":"IF(ISERROR(INDIRECT(CONCATENATE($B256,\"!O19\"))),\"\",INDIRECT(CONCATENATE($B256,\"!O19\")))","v":""},{"$f":"IF(ISERROR(INDIRECT(CONCATENATE($B256,\"!O20\"))),\"\",INDIRECT(CONCATENATE($B256,\"!O20\")))","v":""},{"$f":"IF(ISERROR(INDIRECT(CONCATENATE($B256,\"!O21\"))),\"\",INDIRECT(CONCATENATE($B256,\"!O21\")))","v":""},null,{"$f":"IF(ISERROR(INDIRECT(CONCATENATE($B256,\"!P18\"))),\"\",INDIRECT(CONCATENATE($B256,\"!P18\")))","v":""},{"$f":"IF(ISERROR(INDIRECT(CONCATENATE($B256,\"!P19\"))),\"\",INDIRECT(CONCATENATE($B256,\"!P19\")))","v":""},{"$f":"IF(ISERROR(INDIRECT(CONCATENATE($B256,\"!P20\"))),\"\",INDIRECT(CONCATENATE($B256,\"!P20\")))","v":""},{"$f":"IF(ISERROR(INDIRECT(CONCATENATE($B256,\"!P21\"))),\"\",INDIRECT(CONCATENATE($B256,\"!P21\")))","v":""},null,{"$f":"IF(ISERROR(INDIRECT(CONCATENATE($B256,\"!Q18\"))),\"\",INDIRECT(CONCATENATE($B256,\"!Q18\")))","v":""},{"$f":"IF(ISERROR(INDIRECT(CONCATENATE($B256,\"!Q19\"))),\"\",INDIRECT(CONCATENATE($B256,\"!Q19\")))","v":""},{"$f":"IF(ISERROR(INDIRECT(CONCATENATE($B256,\"!Q20\"))),\"\",INDIRECT(CONCATENATE($B256,\"!Q20\")))","v":""},{"$f":"IF(ISERROR(INDIRECT(CONCATENATE($B256,\"!Q21\"))),\"\",INDIRECT(CONCATENATE($B256,\"!Q1\")))","v":""}]
[null,null,null,null,{"$f":"IF(ISERROR(INDIRECT(CONCATENATE($B257,\"!M18\"))),\"\",INDIRECT(CONCATENATE($B257,\"!M18\")))","v":""},{"$f":"IF(ISERROR(INDIRECT(CONCATENATE($B257,\"!M19\"))),\"\",INDIRECT(CONCATENATE($B257,\"!M19\")))","v":""},{"$f":"IF(ISERROR(INDIRECT(CONCATENATE($B257,\"!M20\"))),\"\",INDIRECT(CONCATENATE($B257,\"!M20\")))","v":""},{"$f":"IF(ISERROR(INDIRECT(CONCATENATE($B257,\"!M21\"))),\"\",INDIRECT(CONCATENATE($B257,\"!M21\")))","v":""},null,{"$f":"IF(ISERROR(INDIRECT(CONCATENATE($B257,\"!N18\"))),\"\",INDIRECT(CONCATENATE($B257,\"!N18\")))","v":""},{"$f":"IF(ISERROR(INDIRECT(CONCATENATE($B257,\"!N19\"))),\"\",INDIRECT(CONCATENATE($B257,\"!N19\")))","v":""},{"$f":"IF(ISERROR(INDIRECT(CONCATENATE($B257,\"!N20\"))),\"\",INDIRECT(CONCATENATE($B257,\"!N20\")))","v":""},{"$f":"IF(ISERROR(INDIRECT(CONCATENATE($B257,\"!N21\"))),\"\",INDIRECT(CONCATENATE($B257,\"!N21\")))","v":""},null,{"$f":"IF(ISERROR(INDIRECT(CONCATENATE($B257,\"!O18\"))),\"\",INDIRECT(CONCATENATE($B257,\"!O18\")))","v":""},{"$f":"IF(ISERROR(INDIRECT(CONCATENATE($B257,\"!O19\"))),\"\",INDIRECT(CONCATENATE($B257,\"!O19\")))","v":""},{"$f":"IF(ISERROR(INDIRECT(CONCATENATE($B257,\"!O20\"))),\"\",INDIRECT(CONCATENATE($B257,\"!O20\")))","v":""},{"$f":"IF(ISERROR(INDIRECT(CONCATENATE($B257,\"!O21\"))),\"\",INDIRECT(CONCATENATE($B257,\"!O21\")))","v":""},null,{"$f":"IF(ISERROR(INDIRECT(CONCATENATE($B257,\"!P18\"))),\"\",INDIRECT(CONCATENATE($B257,\"!P18\")))","v":""},{"$f":"IF(ISERROR(INDIRECT(CONCATENATE($B257,\"!P19\"))),\"\",INDIRECT(CONCATENATE($B257,\"!P19\")))","v":""},{"$f":"IF(ISERROR(INDIRECT(CONCATENATE($B257,\"!P20\"))),\"\",INDIRECT(CONCATENATE($B257,\"!P20\")))","v":""},{"$f":"IF(ISERROR(INDIRECT(CONCATENATE($B257,\"!P21\"))),\"\",INDIRECT(CONCATENATE($B257,\"!P21\")))","v":""},null,{"$f":"IF(ISERROR(INDIRECT(CONCATENATE($B257,\"!Q18\"))),\"\",INDIRECT(CONCATENATE($B257,\"!Q18\")))","v":""},{"$f":"IF(ISERROR(INDIRECT(CONCATENATE($B257,\"!Q19\"))),\"\",INDIRECT(CONCATENATE($B257,\"!Q19\")))","v":""},{"$f":"IF(ISERROR(INDIRECT(CONCATENATE($B257,\"!Q20\"))),\"\",INDIRECT(CONCATENATE($B257,\"!Q20\")))","v":""},{"$f":"IF(ISERROR(INDIRECT(CONCATENATE($B257,\"!Q21\"))),\"\",INDIRECT(CONCATENATE($B257,\"!Q1\")))","v":""}]
[]
[]
[]
[]
[]
[]
[]
[]
[]
[]
[]
[]
[]
[]
[]
[]
[]
[]
[]
[]
[]
[]
[]
[]
[]
[]
[]
[]
[]
[]
[]
[]
[]
[]
[]
[]
[]
[]
[]
["RURAL",null,null,"Poorest",null,null,null,null,"Poor",null,null,null,null,"Middle",null,null,null,null,"Rich",null,null,null,null,"Richest"]
[null,null,null,"Improved","Basic","Limited","Unimproved","Surface water","Improved","Basic","Limited","Unimproved","Surface water","Improved","Basic","Limited","Unimproved","Surface water","Improved","Basic","Limited","Unimproved","Surface water","Improved","Basic","Limited","Unimproved","Surface water"]
["Forecast period:",null,2000,{"$f":"IF((D301+H301)>100,D301*100/(D301+H301),D301)","v":79.672614749871173},{"$f":"D299*AVERAGEIF(E305:E316,\">0\")/100","v":76.684891696750995},{"$f":"D299*(100-AVERAGEIF(E305:E316,\">0\"))/100","v":2.9877230531201691},{"$f":"100-(E299+F299+H299)","v":1.7215063286873402},{"$f":"IF((D301+H301)>100,H301*100/(D301+H301),H301)","v":18.605878921441501},{"$f":"IF((I301+M301)>100,I301*100/(I301+M301),I301)","v":83.31554964998702},{"$f":"I299*AVERAGEIF(J305:J316,\">0\")/100","v":81.690896431812277},{"$f":"I299*(100-AVERAGEIF(J305:J316,\">0\"))/100","v":1.6246532181747491},{"$f":"100-(J299+K299+M299)","v":3.5741055224268621},{"$f":"IF((I301+M301)>100,M301*100/(I301+M301),M301)","v":13.110344827586118},{"$f":"IF((N301+R301)>100,N301*100/(N301+R301),N301)","v":85.277913873130501},{"$f":"N299*AVERAGEIF(O305:O316,\">0\")/100","v":84.041384121970111},{"$f":"N299*(100-AVERAGEIF(O305:O316,\">0\"))/100","v":1.2365297511603948},{"$f":"100-(O299+P299+R299)","v":7.0559333816184449},{"$f":"IF((N301+R301)>100,R301*100/(N301+R301),R301)","v":7.6661527452510541},{"$f":"IF((S301+W301)>100,S301*100/(S301+W301),S301)","v":90.508160487425471},{"$f":"S299*AVERAGEIF(T305:T316,\">0\")/100","v":89.73884112328237},{"$f":"S299*(100-AVERAGEIF(T305:T316,\">0\"))/100","v":0.76931936414311142},{"$f":"100-(T299+U299+W299)","v":5.8970462106383508},{"$f":"IF((S301+W301)>100,W301*100/(S301+W301),W301)","v":3.5947933019361642},{"$f":"IF((X301+AB301)>100,X301*100/(X301+AB301),X301)","v":91.851998452810676},{"$f":"X299*AVERAGEIF(Y305:Y316,\">0\")/100","v":91.576442457452245},{"$f":"X299*(100-AVERAGEIF(Y305:Y316,\">0\"))/100","v":0.2755559953584294},{"$f":"100-(Y299+Z299+AB299)","v":5.3278716770594485},{"$f":"IF((X301+AB301)>100,AB301*100/(X301+AB301),AB301)","v":2.8201298701298705}]
[null,null,2020,{"$f":"IF((D302+H302)>100,D302*100/(D302+H302),D302)","v":74.830531201650388},{"$f":"D300*AVERAGEIF(E305:E316,\">0\")/100","v":72.024386281588491},{"$f":"D300*(100-AVERAGEIF(E305:E316,\">0\"))/100","v":2.8061449200618891},{"$f":"100-(E300+F300+H300)","v":9.0744013884455654},{"$f":"IF((D302+H302)>100,H302*100/(D302+H302),H302)","v":16.095067409904061},{"$f":"IF((I302+M302)>100,I302*100/(I302+M302),I302)","v":88.740646875810285},{"$f":"I300*AVERAGEIF(J305:J316,\">0\")/100","v":87.010204261731985},{"$f":"I300*(100-AVERAGEIF(J305:J316,\">0\"))/100","v":1.7304426140783031},{"$f":"100-(J300+K300+M300)","v":4.355904848327782},{"$f":"IF((I302+M302)>100,M302*100/(I302+M302),M302)","v":6.9034482758619333},{"$f":"IF((N302+R302)>100,N302*100/(N302+R302),N302)","v":94.467702423929722},{"$f":"N300*AVERAGEIF(O305:O316,\">0\")/100","v":93.097920738782747},{"$f":"N300*(100-AVERAGEIF(O305:O316,\">0\"))/100","v":1.3697816851469835},{"$f":"100-(O300+P300+R300)","v":0.58376127630451435},{"$f":"IF((N302+R302)>100,R302*100/(N302+R302),R302)","v":4.9485362997657489},{"$f":"IF((S302+W302)>100,S302*100/(S302+W302),S302)","v":96.144743509973296},{"$f":"S300*AVERAGEIF(T305:T316,\">0\")/100","v":95.327513190138518},{"$f":"S300*(100-AVERAGEIF(T305:T316,\">0\"))/100","v":0.81723031983476757},{"$f":"100-(T300+U300+W300)","v":0},{"$f":"IF((S302+W302)>100,W302*100/(S302+W302),W302)","v":3.8552564900267168},{"$f":"IF((X302+AB302)>100,X302*100/(X302+AB302),X302)","v":97.223711671449934},{"$f":"X300*AVERAGEIF(Y305:Y316,\">0\")/100","v":96.932040536435579},{"$f":"X300*(100-AVERAGEIF(Y305:Y316,\">0\"))/100","v":0.29167113501434705},{"$f":"100-(Y300+Z300+AB300)","v":0},{"$f":"IF((X302+AB302)>100,AB302*100/(X302+AB302),AB302)","v":2.7762883285500752}]
["Regression period:",null,{"$f":"MinRegYear(C299,C305:C316)","v":2001},{"$f":"IF(MAX(C305:C316)-MIN(C305:C316)<5,AVERAGEIF(C305:C316,\">0\",D305:D316),\nIF(FORECAST($C301,D$305:D$316,$C$305:$C$316)<0,0,\nIF(FORECAST($C301,D$305:D$316,$C$305:$C$316)>100,100,\nFORECAST($C301,D$305:D$316,$C$305:$C$316))))","v":79.672614749871173},null,null,null,{"$f":"IF(MAX(C305:C316)-MIN(C305:C316)<5,AVERAGEIF(C305:C316,\">0\",H305:H316),\nIF(FORECAST($C301,H$305:H$316,$C$305:$C$316)<0,0,\nIF(FORECAST($C301,H$305:H$316,$C$305:$C$316)>100,100,\nFORECAST($C301,H$305:H$316,$C$305:$C$316))))","v":18.605878921441501},{"$f":"IF(MAX(C305:C316)-MIN(C305:C316)<5,AVERAGEIF(C305:C316,\">0\",I305:I316),\nIF(FORECAST($C301,I$305:I$316,$C$305:$C$316)<0,0,\nIF(FORECAST($C301,I$305:I$316,$C$305:$C$316)>100,100,\nFORECAST($C301,I$305:I$316,$C$305:$C$316))))","v":83.31554964998702},null,null,null,{"$f":"IF(MAX(C305:C316)-MIN(C305:C316)<5,AVERAGEIF(C305:C316,\">0\",M305:M316),\nIF(FORECAST($C301,M$305:M$316,$C$305:$C$316)<0,0,\nIF(FORECAST($C301,M$305:M$316,$C$305:$C$316)>100,100,\nFORECAST($C301,M$305:M$316,$C$305:$C$316))))","v":13.110344827586118},{"$f":"IF(MAX(C305:C316)-MIN(C305:C316)<5,AVERAGEIF(C305:C316,\">0\",N305:N316),\nIF(FORECAST($C301,N$305:N$316,$C$305:$C$316)<0,0,\nIF(FORECAST($C301,N$305:N$316,$C$305:$C$316)>100,100,\nFORECAST($C301,N$305:N$316,$C$305:$C$316))))","v":85.277913873130501},null,null,null,{"$f":"IF(MAX(C305:C316)-MIN(C305:C316)<5,AVERAGEIF(C305:C316,\">0\",R305:R316),\nIF(FORECAST($C301,R$305:R$316,$C$305:$C$316)<0,0,\nIF(FORECAST($C301,R$305:R$316,$C$305:$C$316)>100,100,\nFORECAST($C301,R$305:R$316,$C$305:$C$316))))","v":7.6661527452510541},{"$f":"IF(MAX(C305:C316)-MIN(C305:C316)<5,AVERAGEIF(C305:C316,\">0\",S305:S316),\nIF(FORECAST($C301,S$305:S$316,$C$305:$C$316)<0,0,\nIF(FORECAST($C301,S$305:S$316,$C$305:$C$316)>100,100,\nFORECAST($C301,S$305:S$316,$C$305:$C$316))))","v":90.508160487425471},null,null,null,{"$f":"IF(MAX(C305:C316)-MIN(C305:C316)<5,AVERAGEIF(C305:C316,\">0\",W305:W316),\nIF(FORECAST($C301,W$305:W$316,$C$305:$C$316)<0,0,\nIF(FORECAST($C301,W$305:W$316,$C$305:$C$316)>100,100,\nFORECAST($C301,W$305:W$316,$C$305:$C$316))))","v":3.5947933019361642},{"$f":"IF(MAX(C305:C316)-MIN(C305:C316)<5,AVERAGEIF(C305:C316,\">0\",X305:X316),\nIF(FORECAST($C301,X$305:X$316,$C$305:$C$316)<0,0,\nIF(FORECAST($C301,X$305:X$316,$C$305:$C$316)>100,100,\nFORECAST($C301,X$305:X$316,$C$305:$C$316))))","v":91.851998452810676},null,null,null,{"$f":"IF(MAX(C305:C316)-MIN(C305:C316)<5,AVERAGEIF(C305:C316,\">0\",AB305:AB316),\nIF(FORECAST($C301,AB$305:AB$316,$C$305:$C$316)<0,0,\nIF(FORECAST($C301,AB$305:AB$316,$C$305:$C$316)>100,100,\nFORECAST($C301,AB$305:AB$316,$C$305:$C$316))))","v":2.8201298701298705}]
[null,null,{"$f":"MaxRegYear(C300,C305:C316)","v":2017},{"$f":"IF(MAX(C305:C316)-MIN(C305:C316)<5,AVERAGEIF(C305:C316,\">0\",D305:D316),\nIF(FORECAST($C302,D$305:D$316,$C$305:$C$316)<0,0,\nIF(FORECAST($C302,D$305:D$316,$C$305:$C$316)>100,100,\nFORECAST($C302,D$305:D$316,$C$305:$C$316))))","v":74.830531201650388},null,null,null,{"$f":"IF(MAX(C305:C316)-MIN(C305:C316)<5,AVERAGEIF(C305:C316,\">0\",H305:H316),\nIF(FORECAST($C302,H$305:H$316,$C$305:$C$316)<0,0,\nIF(FORECAST($C302,H$305:H$316,$C$305:$C$316)>100,100,\nFORECAST($C302,H$305:H$316,$C$305:$C$316))))","v":16.095067409904061},{"$f":"IF(MAX(C305:C316)-MIN(C305:C316)<5,AVERAGEIF(C305:C316,\">0\",I305:I316),\nIF(FORECAST($C302,I$305:I$316,$C$305:$C$316)<0,0,\nIF(FORECAST($C302,I$305:I$316,$C$305:$C$316)>100,100,\nFORECAST($C302,I$305:I$316,$C$305:$C$316))))","v":88.740646875810285},null,null,null,{"$f":"IF(MAX(C305:C316)-MIN(C305:C316)<5,AVERAGEIF(C305:C316,\">0\",M305:M316),\nIF(FORECAST($C302,M$305:M$316,$C$305:$C$316)<0,0,\nIF(FORECAST($C302,M$305:M$316,$C$305:$C$316)>100,100,\nFORECAST($C302,M$305:M$316,$C$305:$C$316))))","v":6.9034482758619333},{"$f":"IF(MAX(C305:C316)-MIN(C305:C316)<5,AVERAGEIF(C305:C316,\">0\",N305:N316),\nIF(FORECAST($C302,N$305:N$316,$C$305:$C$316)<0,0,\nIF(FORECAST($C302,N$305:N$316,$C$305:$C$316)>100,100,\nFORECAST($C302,N$305:N$316,$C$305:$C$316))))","v":94.467702423929722},null,null,null,{"$f":"IF(MAX(C305:C316)-MIN(C305:C316)<5,AVERAGEIF(C305:C316,\">0\",R305:R316),\nIF(FORECAST($C302,R$305:R$316,$C$305:$C$316)<0,0,\nIF(FORECAST($C302,R$305:R$316,$C$305:$C$316)>100,100,\nFORECAST($C302,R$305:R$316,$C$305:$C$316))))","v":4.9485362997657489},{"$f":"IF(MAX(C305:C316)-MIN(C305:C316)<5,AVERAGEIF(C305:C316,\">0\",S305:S316),\nIF(FORECAST($C302,S$305:S$316,$C$305:$C$316)<0,0,\nIF(FORECAST($C302,S$305:S$316,$C$305:$C$316)>100,100,\nFORECAST($C302,S$305:S$316,$C$305:$C$316))))","v":96.252469535908745},null,null,null,{"$f":"IF(MAX(C305:C316)-MIN(C305:C316)<5,AVERAGEIF(C305:C316,\">0\",W305:W316),\nIF(FORECAST($C302,W$305:W$316,$C$305:$C$316)<0,0,\nIF(FORECAST($C302,W$305:W$316,$C$305:$C$316)>100,100,\nFORECAST($C302,W$305:W$316,$C$305:$C$316))))","v":3.8595761381475668},{"$f":"IF(MAX(C305:C316)-MIN(C305:C316)<5,AVERAGEIF(C305:C316,\">0\",X305:X316),\nIF(FORECAST($C302,X$305:X$316,$C$305:$C$316)<0,0,\nIF(FORECAST($C302,X$305:X$316,$C$305:$C$316)>100,100,\nFORECAST($C302,X$305:X$316,$C$305:$C$316))))","v":97.849419804022659},null,null,null,{"$f":"IF(MAX(C305:C316)-MIN(C305:C316)<5,AVERAGEIF(C305:C316,\">0\",AB305:AB316),\nIF(FORECAST($C302,AB$305:AB$316,$C$305:$C$316)<0,0,\nIF(FORECAST($C302,AB$305:AB$316,$C$305:$C$316)>100,100,\nFORECAST($C302,AB$305:AB$316,$C$305:$C$316))))","v":2.7941558441558452}]
[]
[null,"Survey","Year","Improved","% Improved\n< = 30min",null,null,"Surface water","Improved","% Improved\n< = 30min",null,null,"Surface water","Improved","% Improved\n< = 30min",null,null,"Surface water","Improved","% Improved\n< = 30min",null,null,"Surface water","Improved","% Improved\n< = 30min",null,null,"Surface water"]
[null,"WHS03",2003,{"$f":"IF(ISERROR(INDIRECT(CONCATENATE($B305,\"!M16\"))),\"\",INDIRECT(CONCATENATE($B305,\"!M16\")))","v":81.949458483754512},{"$f":"IF(ISERROR(INDIRECT(CONCATENATE($B305,\"!M23\"))),\"\",INDIRECT(CONCATENATE($B305,\"!M23\")))","v":"N/A"},null,null,{"$f":"IF(ISERROR(INDIRECT(CONCATENATE($B305,\"!M21\"))),\"\",INDIRECT(CONCATENATE($B305,\"!M21\")))","v":14.337568058076226},{"$f":"IF(ISERROR(INDIRECT(CONCATENATE($B305,\"!N16\"))),\"\",INDIRECT(CONCATENATE($B305,\"!N16\")))","v":85.662431941923785},{"$f":"IF(ISERROR(INDIRECT(CONCATENATE($B305,\"!N23\"))),\"\",INDIRECT(CONCATENATE($B305,\"!N23\")))","v":"N/A"},null,null,{"$f":"IF(ISERROR(INDIRECT(CONCATENATE($B305,\"!N21\"))),\"\",INDIRECT(CONCATENATE($B305,\"!N21\")))","v":10.344827586206897},{"$f":"IF(ISERROR(INDIRECT(CONCATENATE($B305,\"!O16\"))),\"\",INDIRECT(CONCATENATE($B305,\"!O16\")))","v":88.267148014440437},{"$f":"IF(ISERROR(INDIRECT(CONCATENATE($B305,\"!O23\"))),\"\",INDIRECT(CONCATENATE($B305,\"!O23\")))","v":"N/A"},null,null,{"$f":"IF(ISERROR(INDIRECT(CONCATENATE($B305,\"!O21\"))),\"\",INDIRECT(CONCATENATE($B305,\"!O21\")))","v":5.2823315118397085},{"$f":"IF(ISERROR(INDIRECT(CONCATENATE($B305,\"!P16\"))),\"\",INDIRECT(CONCATENATE($B305,\"!P16\")))","v":92.558983666061707},{"$f":"IF(ISERROR(INDIRECT(CONCATENATE($B305,\"!P23\"))),\"\",INDIRECT(CONCATENATE($B305,\"!P23\")))","v":"N/A"},null,null,{"$f":"IF(ISERROR(INDIRECT(CONCATENATE($B305,\"!P21\"))),\"\",INDIRECT(CONCATENATE($B305,\"!P21\")))","v":2.0146520146520146},{"$f":"IF(ISERROR(INDIRECT(CONCATENATE($B305,\"!Q16\"))),\"\",INDIRECT(CONCATENATE($B305,\"!Q16\")))","v":93.501805054151617},{"$f":"IF(ISERROR(INDIRECT(CONCATENATE($B305,\"!Q23\"))),\"\",INDIRECT(CONCATENATE($B305,\"!Q23\")))","v":"N/A"},null,null,{"$f":"IF(ISERROR(INDIRECT(CONCATENATE($B305,\"!Q221\"))),\"\",INDIRECT(CONCATENATE($B305,\"!Q21\")))","v":1.8181818181818181}]
[null,"ENCOVI11",2011,68,95,null,null,28.9,81.7,97.1,null,null,15.2,85.5,98.1,null,null,12.1,90.1,98.8,null,null,8.6,92.9,99.5,null,null,5.8]
[null,"DHS15",2015,81.2,97.5,null,null,8.5,91.4,99,null,null,3.7,97,99,null,null,1.2,98.2,99.5,null,null,0.6,98.9,99.9,null,null,0.8]
[null,null,null,"","",null,null,"","","",null,null,"","","",null,null,"","","",null,null,"","","",null,null,""]
[null,null,null,"","",null,null,"","","",null,null,"","","",null,null,"","","",null,null,"","","",null,null,""]
[null,null,null,"","",null,null,"","","",null,null,"","","",null,null,"","","",null,null,"","","",null,null,""]
[null,null,null,"","",null,null,"","","",null,null,"","","",null,null,"","","",null,null,"","","",null,null,""]
[null,null,null,"","",null,null,"","","",null,null,"","","",null,null,"","","",null,null,"","","",null,null,""]
[null,null,null,"","",null,null,"","","",null,null,"","","",null,null,"","","",null,null,"","","",null,null,""]
[null,null,null,"","",null,null,"","","",null,null,"","","",null,null,"","","",null,null,"","","",null,null,""]
[null,null,null,"","",null,null,"","","",null,null,"","","",null,null,"","","",null,null,"","","",null,null,""]
[null,null,null,"","",null,null,"","","",null,null,"","","",null,null,"","","",null,null,"","","",null,null,""]
[]
[null,{"$f":"CONCATENATE(\"Rural use of drinking water sources, \",C299,\"–\",C300)","v":"Rural use of drinking water sources, 2000–2020"},null,null,null,null,null,null,null,null,null,null,null,null,null,null,null,null,"Data points used for regression"]

{"sheet":"Sanitation","index":2,"n_rows":318,"n_cols":28,"rows_kept":318,"cut":false,"hidden":false,"merged":[[30,21,30,24],[4,1,4,24],[3,1,3,24],[6,1,6,8],[6,9,6,16],[6,17,6,24],[30,1,31,4],[30,5,30,8],[30,9,30,12],[30,13,30,16],[30,17,30,20],[96,23,96,27],[32,1,33,2],[32,3,33,3],[35,1,36,2],[35,3,36,3],[38,1,39,2],[38,3,39,3],[96,0,97,2],[96,3,96,7],[96,8,96,12],[96,13,96,17],[96,18,96,22],[98,0,99,1],[100,0,101,1],[117,18,117,22],[196,0,197,2],[196,3,196,7],[196,8,196,12],[196,13,196,17],[196,18,196,22],[117,1,117,11],[298,0,299,1],[300,0,301,1],[317,18,317,22],[196,23,196,27],[198,0,199,1],[200,0,201,1],[217,18,217,22],[296,0,297,2],[296,3,296,7],[296,8,296,12],[296,13,296,17],[296,18,296,22],[296,23,296,27],[217,1,217,11],[317,1,317,11]]}
[]
[]
[]
[null,"Summary of trends in use of sanitation facilities by wealth quintile (%)"]
[null,{"$f":"IF(ISERROR(INDIRECT(CONCATENATE($B105,\"!A2\"))),\"\",INDIRECT(CONCATENATE($B105,\"!A2\")))","v":"Guatemala"}]
[]
[null,{"$f":"B118","v":"National use of sanitation facilities, 2000–2020"},null,null,null,null,null,null,null,{"$f":"B218","v":"Urban use of sanitation facilities, 2000–2020"},null,null,null,null,null,null,null,{"$f":"B318","v":"Rural use of sanitation facilities, 2000–2020"}]
[]
[]
[]
[]
[]
[]
[]
[]
[]
[]
[]
[]
[]
[]
[]
[]
[]
[]
[]
[]
[]
[]
[]
[null,{"$f":"IF(ISERROR(INDIRECT(CONCATENATE($B105,\"!A2\"))),\"\",INDIRECT(CONCATENATE($B105,\"!A2\")))","v":"Guatemala"},null,null,null,"Poorest",null,null,null,"Poor",null,null,null,"Middle",null,null,null,"Rich",null,null,null,"Richest"]
[null,null,null,null,null,"Basic","Limited","Unimproved","Open defecation","Basic","Limited","Unimproved","Open defecation","Basic","Limited","Unimproved","Open defecation","Basic","Limited","Unimproved","Open defecation","Basic","Limited","Unimproved","Open defecation"]
[null,"NATIONAL",null,"Estimate",{"$f":"C99","v":2000},{"$f":"E99","v":36.033280336632693},{"$f":"F99","v":2.4646566577724154},37.091957770017416,24.410105235577475,{"$f":"J99","v":43.722338763526068},{"$f":"K99","v":3.5480050182636633},36.85061037633011,15.879045841880156,{"$f":"O99","v":59.38496363379727},{"$f":"P99","v":5.9384963633797279},28.569473910367662,6.1070660924553408,{"$f":"T99","v":78.274477946350203},{"$f":"U99","v":8.4744196146805226},11.401234330042314,1.8498681089269553,{"$f":"Y99","v":94.455855532445952},{"$f":"Z99","v":3.7285206131228654},1.6557111944201353,0.15991266001105142]
[null,null,null,null,{"$f":"C100","v":2020},{"$f":"E100","v":44.893043950787899},3.0706596409567664,31.892963950143439,20.1433324581119,{"$f":"J100","v":54.651170508748912},4.4348640238060906,30.566069888073343,10.347895579371652,{"$f":"O100","v":66.344172857229964},6.6344172857229982,23.319284917927675,3.7021249391193578,{"$f":"T100","v":76.907887548846062},8.3264651246131347,13.319544991122541,1.4461023354182672,{"$f":"Y100","v":92.602584386106003},3.6553651731357628,3.5352818756768443,0.2067685650813873]
[]
[null,"URBAN",null,"Estimate",{"$f":"C199","v":2000},{"$f":"E199","v":64.271783221732974},{"$f":"F199","v":7.0775475571551167},23.1514110173365,5.4992582037754119,{"$f":"J199","v":81.14378567476038},{"$f":"K199","v":10.58397204453397},7.6402173845352763,0.63202489617037827,{"$f":"O199","v":89.24573226237321},{"$f":"P199","v":8.7008374071951593},1.8903328594198712,0.16309747101176697,{"$f":"T199","v":95.115893791958314},{"$f":"U199","v":4.1242663974832956},0.67008284558417586,8.975696497420671E-2,{"$f":"Y199","v":97.221458310235576},{"$f":"Z199","v":2.7634006238051461},4.2790569220869656E-3,1.0862009037191367E-2]
[null,null,null,null,{"$f":"C200","v":2020},{"$f":"E200","v":62.027230417899226},6.8303795400662821,23.291390678651624,7.8509993633828685,{"$f":"J200","v":75.119552722741048},9.7982025290531887,13.357390161199021,1.724854587006746,{"$f":"O200","v":84.619807068845077},8.2498419147899114,6.6117821111177193,0.51856890524728527,{"$f":"T200","v":92.457942644757111},4.0090164832415089,3.2335528800664122,0.29948799193497067,{"$f":"Y200","v":95.922870713933492},2.7264898652539244,1.3223981973158914,2.8241223496697554E-2]
[]
[null,"RURAL",null,"Estimate",{"$f":"C299","v":2000},{"$f":"E299","v":32.646008119725003},{"$f":"F299","v":1.5584777745597378},35.632975934221008,30.162538171494248,{"$f":"J299","v":36.835803262018281},{"$f":"K299","v":2.4278143059057498},40.034571826217416,20.701810605858554,{"$f":"O299","v":40.371112149758218},{"$f":"P299","v":3.2901567170507775},40.116514361521467,16.222216771669537,{"$f":"T299","v":49.621896899280003},{"$f":"U299","v":5.1779370677509631},37.015644130673763,8.1845219022952733,{"$f":"Y299","v":70.104385388917407},{"$f":"Z299","v":5.8066258604961964},20.410449164166209,3.678539586420186]
[null,null,null,null,{"$f":"C300","v":2020},{"$f":"E300","v":42.319374492684034},2.0202716466356718,32.932101383205008,22.72825247747528,{"$f":"J300","v":46.166741608510257},3.0428079696518116,34.902434083498179,15.888016338339753,{"$f":"O300","v":54.840569267078784},4.4693856010614832,30.850756713477608,9.8392884183821252,{"$f":"T300","v":63.773369254484379},6.6546124439462053,26.379300065697635,3.1927182358717801,{"$f":"Y300","v":77.206953146624883},6.3949193515386353,15.343481198299514,1.0546463035369698]
[]
[]
[]
[]
[]
[]
[]
[]
[]
[]
[]
[]
[]
[]
[]
[]
[]
[]
[]
[]
[]
[]
[]
[]
[]
[]
[]
[]
[]
[]
[]
[]
[]
[]
[]
[]
[]
[]
[]
[]
[]
[]
[]
[]
[]
[]
[]
[]
[]
[]
[]
[]
[]
[]
[]
[]
["NATIONAL",null,null,"Poorest",null,null,null,null,"Poor",null,null,null,null,"Middle",null,null,null,null,"Rich",null,null,null,null,"Richest"]
[null,null,null,"Improved","Basic","Limited","Unimproved","Open defecation","Improved","Basic","Limited","Unimproved","Open defecation","Improved","Basic","Limited","Unimproved","Open defecation","Improved","Basic","Limited","Unimproved","Open defecation","Improved","Basic","Limited","Unimproved","Open defecation"]
["Forecast period:",null,2000,{"$f":"IF((D101+H101)>100,D101*100/(D101+H101),D101)","v":38.497936994405109},{"$f":"D99*AVERAGEIF(E105:E116,\">0\")/100","v":36.033280336632693},{"$f":"D99*(100-AVERAGEIF(E105:E116,\">0\"))/100","v":2.4646566577724154},{"$f":"100-(E99+F99+H99)","v":37.091957770017416},{"$f":"IF((D101+H101)>100,H101*100/(D101+H101),H101)","v":24.410105235577475},{"$f":"IF((I101+M101)>100,I101*100/(I101+M101),I101)","v":47.270343781789734},{"$f":"I99*AVERAGEIF(J105:J116,\">0\")/100","v":43.722338763526068},{"$f":"I99*(100-AVERAGEIF(J105:J116,\">0\"))/100","v":3.5480050182636633},{"$f":"100-(J99+K99+M99)","v":36.85061037633011},{"$f":"IF((I101+M101)>100,M101*100/(I101+M101),M101)","v":15.879045841880156},{"$f":"IF((N101+R101)>100,N101*100/(N101+R101),N101)","v":65.323459997176997},{"$f":"N99*AVERAGEIF(O105:O116,\">0\")/100","v":59.38496363379727},{"$f":"N99*(100-AVERAGEIF(O105:O116,\">0\"))/100","v":5.9384963633797279},{"$f":"100-(O99+P99+R99)","v":28.569473910367662},{"$f":"IF((N101+R101)>100,R101*100/(N101+R101),R101)","v":6.1070660924553408},{"$f":"IF((S101+W101)>100,S101*100/(S101+W101),S101)","v":86.748897561030731},{"$f":"S99*AVERAGEIF(T105:T116,\">0\")/100","v":78.274477946350203},{"$f":"S99*(100-AVERAGEIF(T105:T116,\">0\"))/100","v":8.4744196146805226},{"$f":"100-(T99+U99+W99)","v":11.401234330042314},{"$f":"IF((S101+W101)>100,W101*100/(S101+W101),W101)","v":1.8498681089269553},{"$f":"IF((X101+AB101)>100,X101*100/(X101+AB101),X101)","v":98.18437614556882},{"$f":"X99*AVERAGEIF(Y105:Y116,\">0\")/100","v":94.455855532445952},{"$f":"X99*(100-AVERAGEIF(Y105:Y116,\">0\"))/100","v":3.7285206131228654},{"$f":"100-(Y99+Z99+AB99)","v":1.6557111944201353},{"$f":"IF((X101+AB101)>100,AB101*100/(X101+AB101),AB101)","v":0.15991266001105142}]
[null,null,2020,{"$f":"IF((D102+H102)>100,D102*100/(D102+H102),D102)","v":47.963703591744661},{"$f":"D100*AVERAGEIF(E105:E116,\">0\")/100","v":44.893043950787899},{"$f":"D100*(100-AVERAGEIF(E105:E116,\">0\"))/100","v":3.0706596409567664},{"$f":"100-(E100+F100+H100)","v":31.892963950143439},{"$f":"IF((D102+H102)>100,H102*100/(D102+H102),H102)","v":20.1433324581119},{"$f":"IF((I102+M102)>100,I102*100/(I102+M102),I102)","v":59.086034532555004},{"$f":"I100*AVERAGEIF(J105:J116,\">0\")/100","v":54.651170508748912},{"$f":"I100*(100-AVERAGEIF(J105:J116,\">0\"))/100","v":4.4348640238060906},{"$f":"100-(J100+K100+M100)","v":30.566069888073343},{"$f":"IF((I102+M102)>100,M102*100/(I102+M102),M102)","v":10.347895579371652},{"$f":"IF((N102+R102)>100,N102*100/(N102+R102),N102)","v":72.978590142952953},{"$f":"N100*AVERAGEIF(O105:O116,\">0\")/100","v":66.344172857229964},{"$f":"N100*(100-AVERAGEIF(O105:O116,\">0\"))/100","v":6.6344172857229982},{"$f":"100-(O100+P100+R100)","v":23.319284917927675},{"$f":"IF((N102+R102)>100,R102*100/(N102+R102),R102)","v":3.7021249391193578},{"$f":"IF((S102+W102)>100,S102*100/(S102+W102),S102)","v":85.234352673459199},{"$f":"S100*AVERAGEIF(T105:T116,\">0\")/100","v":76.907887548846062},{"$f":"S100*(100-AVERAGEIF(T105:T116,\">0\"))/100","v":8.3264651246131347},{"$f":"100-(T100+U100+W100)","v":13.319544991122541},{"$f":"IF((S102+W102)>100,W102*100/(S102+W102),W102)","v":1.4461023354182672},{"$f":"IF((X102+AB102)>100,X102*100/(X102+AB102),X102)","v":96.25794955924178},{"$f":"X100*AVERAGEIF(Y105:Y116,\">0\")/100","v":92.602584386106003},{"$f":"X100*(100-AVERAGEIF(Y105:Y116,\">0\"))/100","v":3.6553651731357628},{"$f":"100-(Y100+Z100+AB100)","v":3.5352818756768443},{"$f":"IF((X102+AB102)>100,AB102*100/(X102+AB102),AB102)","v":0.2067685650813873}]
["Regression period:",null,{"$f":"MinRegYear(C99,C105:C116)","v":2001},{"$f":"IF(MAX(C105:C116)-MIN(C105:C116)<5,AVERAGEIF(C105:C116,\">0\",D105:D116),\nIF(FORECAST($C101,D$105:D$116,$C$105:$C$116)<0,0,\nIF(FORECAST($C101,D$105:D$116,$C$105:$C$116)>100,100,\nFORECAST($C101,D$105:D$116,$C$105:$C$116))))","v":38.497936994405109},null,null,null,{"$f":"IF(MAX(C105:C116)-MIN(C105:C116)<5,AVERAGEIF(C105:C116,\">0\",H105:H116),\nIF(FORECAST($C101,H$105:H$116,$C$105:$C$116)<0,0,\nIF(FORECAST($C101,H$105:H$116,$C$105:$C$116)>100,100,\nFORECAST($C101,H$105:H$116,$C$105:$C$116))))","v":24.410105235577475},{"$f":"IF(MAX(C105:C116)-MIN(C105:C116)<5,AVERAGEIF(C105:C116,\">0\",I105:I116),\nIF(FORECAST($C101,I$105:I$116,$C$105:$C$116)<0,0,\nIF(FORECAST($C101,I$105:I$116,$C$105:$C$116)>100,100,\nFORECAST($C101,I$105:I$116,$C$105:$C$116))))","v":47.270343781789734},null,null,null,{"$f":"IF(MAX(C105:C116)-MIN(C105:C116)<5,AVERAGEIF(C105:C116,\">0\",M105:M116),\nIF(FORECAST($C101,M$105:M$116,$C$105:$C$116)<0,0,\nIF(FORECAST($C101,M$105:M$116,$C$105:$C$116)>100,100,\nFORECAST($C101,M$105:M$116,$C$105:$C$116))))","v":15.879045841880156},{"$f":"IF(MAX(C105:C116)-MIN(C105:C116)<5,AVERAGEIF(C105:C116,\">0\",N105:N116),\nIF(FORECAST($C101,N$105:N$116,$C$105:$C$116)<0,0,\nIF(FORECAST($C101,N$105:N$116,$C$105:$C$116)>100,100,\nFORECAST($C101,N$105:N$116,$C$105:$C$116))))","v":65.323459997176997},null,null,null,{"$f":"IF(MAX(C105:C116)-MIN(C105:C116)<5,AVERAGEIF(C105:C116,\">0\",R105:R116),\nIF(FORECAST($C101,R$105:R$116,$C$105:$C$116)<0,0,\nIF(FORECAST($C101,R$105:R$116,$C$105:$C$116)>100,100,\nFORECAST($C101,R$105:R$116,$C$105:$C$116))))","v":6.1070660924553408},{"$f":"IF(MAX(C105:C116)-MIN(C105:C116)<5,AVERAGEIF(C105:C116,\">0\",S105:S116),\nIF(FORECAST($C101,S$105:S$116,$C$105:$C$116)<0,0,\nIF(FORECAST($C101,S$105:S$116,$C$105:$C$116)>100,100,\nFORECAST($C101,S$105:S$116,$C$105:$C$116))))","v":86.748897561030731},null,null,null,{"$f":"IF(MAX(C105:C116)-MIN(C105:C116)<5,AVERAGEIF(C105:C116,\">0\",W105:W116),\nIF(FORECAST($C101,W$105:W$116,$C$105:$C$116)<0,0,\nIF(FORECAST($C101,W$105:W$116,$C$105:$C$116)>100,100,\nFORECAST($C101,W$105:W$116,$C$105:$C$116))))","v":1.8498681089269553},{"$f":"IF(MAX(C105:C116)-MIN(C105:C116)<5,AVERAGEIF(C105:C116,\">0\",X105:X116),\nIF(FORECAST($C101,X$105:X$116,$C$105:$C$116)<0,0,\nIF(FORECAST($C101,X$105:X$116,$C$105:$C$116)>100,100,\nFORECAST($C101,X$105:X$116,$C$105:$C$116))))","v":98.18437614556882},null,null,null,{"$f":"IF(MAX(C105:C116)-MIN(C105:C116)<5,AVERAGEIF(C105:C116,\">0\",AB105:AB116),\nIF(FORECAST($C101,AB$105:AB$116,$C$105:$C$116)<0,0,\nIF(FORECAST($C101,AB$105:AB$116,$C$105:$C$116)>100,100,\nFORECAST($C101,AB$105:AB$116,$C$105:$C$116))))","v":0.15991266001105142}]
[null,null,{"$f":"MaxRegYear(C100,C105:C116)","v":2017},{"$f":"IF(MAX(C105:C116)-MIN(C105:C116)<5,AVERAGEIF(C105:C116,\">0\",D105:D116),\nIF(FORECAST($C102,D$105:D$116,$C$105:$C$116)<0,0,\nIF(FORECAST($C102,D$105:D$116,$C$105:$C$116)>100,100,\nFORECAST($C102,D$105:D$116,$C$105:$C$116))))","v":47.963703591744661},null,null,null,{"$f":"IF(MAX(C105:C116)-MIN(C105:C116)<5,AVERAGEIF(C105:C116,\">0\",H105:H116),\nIF(FORECAST($C102,H$105:H$116,$C$105:$C$116)<0,0,\nIF(FORECAST($C102,H$105:H$116,$C$105:$C$116)>100,100,\nFORECAST($C102,H$105:H$116,$C$105:$C$116))))","v":20.1433324581119},{"$f":"IF(MAX(C105:C116)-MIN(C105:C116)<5,AVERAGEIF(C105:C116,\">0\",I105:I116),\nIF(FORECAST($C102,I$105:I$116,$C$105:$C$116)<0,0,\nIF(FORECAST($C102,I$105:I$116,$C$105:$C$116)>100,100,\nFORECAST($C102,I$105:I$116,$C$105:$C$116))))","v":59.086034532555004},null,null,null,{"$f":"IF(MAX(C105:C116)-MIN(C105:C116)<5,AVERAGEIF(C105:C116,\">0\",M105:M116),\nIF(FORECAST($C102,M$105:M$116,$C$105:$C$116)<0,0,\nIF(FORECAST($C102,M$105:M$116,$C$105:$C$116)>100,100,\nFORECAST($C102,M$105:M$116,$C$105:$C$116))))","v":10.347895579371652},{"$f":"IF(MAX(C105:C116)-MIN(C105:C116)<5,AVERAGEIF(C105:C116,\">0\",N105:N116),\nIF(FORECAST($C102,N$105:N$116,$C$105:$C$116)<0,0,\nIF(FORECAST($C102,N$105:N$116,$C$105:$C$116)>100,100,\nFORECAST($C102,N$105:N$116,$C$105:$C$116))))","v":72.978590142952953},null,null,null,{"$f":"IF(MAX(C105:C116)-MIN(C105:C116)<5,AVERAGEIF(C105:C116,\">0\",R105:R116),\nIF(FORECAST($C102,R$105:R$116,$C$105:$C$116)<0,0,\nIF(FORECAST($C102,R$105:R$116,$C$105:$C$116)>100,100,\nFORECAST($C102,R$105:R$116,$C$105:$C$116))))","v":3.7021249391193578},{"$f":"IF(MAX(C105:C116)-MIN(C105:C116)<5,AVERAGEIF(C105:C116,\">0\",S105:S116),\nIF(FORECAST($C102,S$105:S$116,$C$105:$C$116)<0,0,\nIF(FORECAST($C102,S$105:S$116,$C$105:$C$116)>100,100,\nFORECAST($C102,S$105:S$116,$C$105:$C$116))))","v":85.234352673459199},null,null,null,{"$f":"IF(MAX(C105:C116)-MIN(C105:C116)<5,AVERAGEIF(C105:C116,\">0\",W105:W116),\nIF(FORECAST($C102,W$105:W$116,$C$105:$C$116)<0,0,\nIF(FORECAST($C102,W$105:W$116,$C$105:$C$116)>100,100,\nFORECAST($C102,W$105:W$116,$C$105:$C$116))))","v":1.4461023354182672},{"$f":"IF(MAX(C105:C116)-MIN(C105:C116)<5,AVERAGEIF(C105:C116,\">0\",X105:X116),\nIF(FORECAST($C102,X$105:X$116,$C$105:$C$116)<0,0,\nIF(FORECAST($C102,X$105:X$116,$C$105:$C$116)>100,100,\nFORECAST($C102,X$105:X$116,$C$105:$C$116))))","v":96.25794955924178},null,null,null,{"$f":"IF(MAX(C105:C116)-MIN(C105:C116)<5,AVERAGEIF(C105:C116,\">0\",AB105:AB116),\nIF(FORECAST($C102,AB$105:AB$116,$C$105:$C$116)<0,0,\nIF(FORECAST($C102,AB$105:AB$116,$C$105:$C$116)>100,100,\nFORECAST($C102,AB$105:AB$116,$C$105:$C$116))))","v":0.2067685650813873}]
[]
[null,"Survey","Year","Improved","Not shared",null,null,"Open defecation","Improved","Not shared",null,null,"Open defecation","Improved","Not shared",null,null,"Open defecation","Improved","Not shared",null,null,"Open defecation","Improved","Not shared",null,null,"Open defecation"]
[null,"WHS03",2003,{"$f":"IF(ISERROR(INDIRECT(CONCATENATE($B105,\"!C122\"))),\"\",INDIRECT(CONCATENATE($B105,\"!C122\")))","v":39.733059548254623},{"$f":"IF(ISERROR(INDIRECT(CONCATENATE($B105,\"!C129\"))),\"\",INDIRECT(CONCATENATE($B105,\"!C129\")))","v":93.597951344430214},null,null,{"$f":"IF(ISERROR(INDIRECT(CONCATENATE($B105,\"!C127\"))),\"\",INDIRECT(CONCATENATE($B105,\"!C127\")))","v":22.689938398357292},{"$f":"IF(ISERROR(INDIRECT(CONCATENATE($B105,\"!D122\"))),\"\",INDIRECT(CONCATENATE($B105,\"!D122\")))","v":49.535603715170282},{"$f":"IF(ISERROR(INDIRECT(CONCATENATE($B105,\"!D129\"))),\"\",INDIRECT(CONCATENATE($B105,\"!D129\")))","v":92.494226327944574},null,null,{"$f":"IF(ISERROR(INDIRECT(CONCATENATE($B105,\"!D127\"))),\"\",INDIRECT(CONCATENATE($B105,\"!D127\")))","v":14.241486068111456},{"$f":"IF(ISERROR(INDIRECT(CONCATENATE($B105,\"!E122\"))),\"\",INDIRECT(CONCATENATE($B105,\"!E122\")))","v":67.031070195627166},{"$f":"IF(ISERROR(INDIRECT(CONCATENATE($B105,\"!E129\"))),\"\",INDIRECT(CONCATENATE($B105,\"!E129\")))","v":90.909090909090907},null,null,{"$f":"IF(ISERROR(INDIRECT(CONCATENATE($B105,\"!E127\"))),\"\",INDIRECT(CONCATENATE($B105,\"!E127\")))","v":5.2934407364787113},{"$f":"IF(ISERROR(INDIRECT(CONCATENATE($B105,\"!F122\"))),\"\",INDIRECT(CONCATENATE($B105,\"!F122\")))","v":88.107549120992772},{"$f":"IF(ISERROR(INDIRECT(CONCATENATE($B105,\"!F129\"))),\"\",INDIRECT(CONCATENATE($B105,\"!F129\")))","v":90.231092436974791},null,null,{"$f":"IF(ISERROR(INDIRECT(CONCATENATE($B105,\"!F127\"))),\"\",INDIRECT(CONCATENATE($B105,\"!F127\")))","v":1.344364012409514},{"$f":"IF(ISERROR(INDIRECT(CONCATENATE($B105,\"!G122\"))),\"\",INDIRECT(CONCATENATE($B105,\"!G122\")))","v":98.229166666666657},{"$f":"IF(ISERROR(INDIRECT(CONCATENATE($B105,\"!G129\"))),\"\",INDIRECT(CONCATENATE($B105,\"!G129\")))","v":96.202531645569621},null,null,{"$f":"IF(ISERROR(INDIRECT(CONCATENATE($B105,\"!G2127\"))),\"\",INDIRECT(CONCATENATE($B105,\"!G127\")))","v":0.10416666666666667}]
[null,"ENCOVI11",2011,44.258335930196324,"N/A",null,null,25.303832969772515,52.290254732414112,"N/A",null,null,15.260574900677728,67.855759547602446,"N/A",null,null,6.143001007049345,81.158397993573161,"N/A",null,null,2.9626146249706089,96.123577995948253,"N/A",null,null,0.37400654511453951]
[null,"DHS15",2015,46.884286225441315,"N/A",null,null,18.303038575221116,59.185670367778833,"N/A",null,null,9.1469573802749728,73.523136735187308,"N/A",null,null,2.9767271596670848,88.519610126222574,"N/A",null,null,0.5865063074491399,97.069940571310113,"N/A",null,null,7.7705613991242831E-2]
[null,null,null,"","",null,null,"","","",null,null,"","","",null,null,"","","",null,null,"","","",null,null,""]
[null,null,null,"","",null,null,"","","",null,null,"","","",null,null,"","","",null,null,"","","",null,null,""]
[null,null,null,"","",null,null,"","","",null,null,"","","",null,null,"","","",null,null,"","","",null,null,""]
[null,null,null,"","",null,null,"","","",null,null,"","","",null,null,"","","",null,null,"","","",null,null,""]
[null,null,null,"","",null,null,"","","",null,null,"","","",null,null,"","","",null,null,"","","",null,null,""]
[null,null,null,"","",null,null,"","","",null,null,"","","",null,null,"","","",null,null,"","","",null,null,""]
[null,null,null,"","",null,null,"","","",null,null,"","","",null,null,"","","",null,null,"","","",null,null,""]
[null,null,null,"","",null,null,"","","",null,null,"","","",null,null,"","","",null,null,"","","",null,null,""]
[null,null,null,"","",null,null,"","","",null,null,"","","",null,null,"","","",null,null,"","","",null,null,""]
[]
[null,{"$f":"CONCATENATE(\"National use of sanitation facilities, \",C99,\"–\",C100)","v":"National use of sanitation facilities, 2000–2020"},null,null,null,null,null,null,null,null,null,null,null,null,null,null,null,null,"Data points used for regression"]
[]
[]
[]
[]
[]
[]
[]
[]
[]
[]
[]
[]
[]
[]
[]
[]
[]
[]
[]
[]
[]
[]
[]
[]
[]
[]
[]
[]
[]
[]
[]
[]
[]
[]
[]
[]
[]
[]
[]
[]
[]
[]
[]
[]
[]
[]
[]
[]
[]
[]
[]
[]
[]
[]
[]
[]
[]
[]
[]
[]
[]
[]
[]
[]
[]
[]
[]
[]
[]
[]
[]
[]
[]
[]
[]
[]
[]
[]
["URBAN",null,null,"Poorest",null,null,null,null,"Poor",null,null,null,null,"Middle",null,null,null,null,"Rich",null,null,null,null,"Richest"]
[null,null,null,"Improved","Basic","Limited","Unimproved","Open defecation","Improved","Basic","Limited","Unimproved","Open defecation","Improved","Basic","Limited","Unimproved","Open defecation","Improved","Basic","Limited","Unimproved","Open defecation","Improved","Basic","Limited","Unimproved","Open defecation"]
["Forecast period:",null,2000,{"$f":"IF((D201+H201)>100,D201*100/(D201+H201),D201)","v":71.349330778888088},{"$f":"D199*AVERAGEIF(E205:E216,\">0\")/100","v":64.271783221732974},{"$f":"D199*(100-AVERAGEIF(E205:E216,\">0\"))/100","v":7.0775475571551167},{"$f":"100-(E199+F199+H199)","v":23.1514110173365},{"$f":"IF((D201+H201)>100,H201*100/(D201+H201),H201)","v":5.4992582037754119},{"$f":"IF((I201+M201)>100,I201*100/(I201+M201),I201)","v":91.727757719294345},{"$f":"I199*AVERAGEIF(J205:J216,\">0\")/100","v":81.14378567476038},{"$f":"I199*(100-AVERAGEIF(J205:J216,\">0\"))/100","v":10.58397204453397},{"$f":"100-(J199+K199+M199)","v":7.6402173845352763},{"$f":"IF((I201+M201)>100,M201*100/(I201+M201),M201)","v":0.63202489617037827},{"$f":"IF((N201+R201)>100,N201*100/(N201+R201),N201)","v":97.946569669568362},{"$f":"N199*AVERAGEIF(O205:O216,\">0\")/100","v":89.24573226237321},{"$f":"N199*(100-AVERAGEIF(O205:O216,\">0\"))/100","v":8.7008374071951593},{"$f":"100-(O199+P199+R199)","v":1.8903328594198712},{"$f":"IF((N201+R201)>100,R201*100/(N201+R201),R201)","v":0.16309747101176697},{"$f":"IF((S201+W201)>100,S201*100/(S201+W201),S201)","v":99.24016018944161},{"$f":"S199*AVERAGEIF(T205:T216,\">0\")/100","v":95.115893791958314},{"$f":"S199*(100-AVERAGEIF(T205:T216,\">0\"))/100","v":4.1242663974832956},{"$f":"100-(T199+U199+W199)","v":0.67008284558417586},{"$f":"IF((S201+W201)>100,W201*100/(S201+W201),W201)","v":8.975696497420671E-2},{"$f":"IF((X201+AB201)>100,X201*100/(X201+AB201),X201)","v":99.984858934040716},{"$f":"X199*AVERAGEIF(Y205:Y216,\">0\")/100","v":97.221458310235576},{"$f":"X199*(100-AVERAGEIF(Y205:Y216,\">0\"))/100","v":2.7634006238051461},{"$f":"100-(Y199+Z199+AB199)","v":4.2790569220869656E-3},{"$f":"IF((X201+AB201)>100,AB201*100/(X201+AB201),AB201)","v":1.0862009037191367E-2}]
[null,null,2020,{"$f":"IF((D202+H202)>100,D202*100/(D202+H202),D202)","v":68.857609957965508},{"$f":"D200*AVERAGEIF(E205:E216,\">0\")/100","v":62.027230417899226},{"$f":"D200*(100-AVERAGEIF(E205:E216,\">0\"))/100","v":6.8303795400662821},{"$f":"100-(E200+F200+H200)","v":23.291390678651624},{"$f":"IF((D202+H202)>100,H202*100/(D202+H202),H202)","v":7.8509993633828685},{"$f":"IF((I202+M202)>100,I202*100/(I202+M202),I202)","v":84.917755251794233},{"$f":"I200*AVERAGEIF(J205:J216,\">0\")/100","v":75.119552722741048},{"$f":"I200*(100-AVERAGEIF(J205:J216,\">0\"))/100","v":9.7982025290531887},{"$f":"100-(J200+K200+M200)","v":13.357390161199021},{"$f":"IF((I202+M202)>100,M202*100/(I202+M202),M202)","v":1.724854587006746},{"$f":"IF((N202+R202)>100,N202*100/(N202+R202),N202)","v":92.869648983634988},{"$f":"N200*AVERAGEIF(O205:O216,\">0\")/100","v":84.619807068845077},{"$f":"N200*(100-AVERAGEIF(O205:O216,\">0\"))/100","v":8.2498419147899114},{"$f":"100-(O200+P200+R200)","v":6.6117821111177193},{"$f":"IF((N202+R202)>100,R202*100/(N202+R202),R202)","v":0.51856890524728527},{"$f":"IF((S202+W202)>100,S202*100/(S202+W202),S202)","v":96.466959127998621},{"$f":"S200*AVERAGEIF(T205:T216,\">0\")/100","v":92.457942644757111},{"$f":"S200*(100-AVERAGEIF(T205:T216,\">0\"))/100","v":4.0090164832415089},{"$f":"100-(T200+U200+W200)","v":3.2335528800664122},{"$f":"IF((S202+W202)>100,W202*100/(S202+W202),W202)","v":0.29948799193497067},{"$f":"IF((X202+AB202)>100,X202*100/(X202+AB202),X202)","v":98.64936057918743},{"$f":"X200*AVERAGEIF(Y205:Y216,\">0\")/100","v":95.922870713933492},{"$f":"X200*(100-AVERAGEIF(Y205:Y216,\">0\"))/100","v":2.7264898652539244},{"$f":"100-(Y200+Z200+AB200)","v":1.3223981973158914},{"$f":"IF((X202+AB202)>100,AB202*100/(X202+AB202),AB202)","v":2.8241223496697554E-2}]
["Regression period:",null,{"$f":"MinRegYear(C199,C205:C216)","v":2001},{"$f":"IF(MAX(C205:C216)-MIN(C205:C216)<5,AVERAGEIF(C205:C216,\">0\",D205:D216),\nIF(FORECAST($C201,D$205:D$216,$C$205:$C$216)<0,0,\nIF(FORECAST($C201,D$205:D$216,$C$205:$C$216)>100,100,\nFORECAST($C201,D$205:D$216,$C$205:$C$216))))","v":71.349330778888088},null,null,null,{"$f":"IF(MAX(C205:C216)-MIN(C205:C216)<5,AVERAGEIF(C205:C216,\">0\",H205:H216),\nIF(FORECAST($C201,H$205:H$216,$C$205:$C$216)<0,0,\nIF(FORECAST($C201,H$205:H$216,$C$205:$C$216)>100,100,\nFORECAST($C201,H$205:H$216,$C$205:$C$216))))","v":5.4992582037754119},{"$f":"IF(MAX(C205:C216)-MIN(C205:C216)<5,AVERAGEIF(C205:C216,\">0\",I205:I216),\nIF(FORECAST($C201,I$205:I$216,$C$205:$C$216)<0,0,\nIF(FORECAST($C201,I$205:I$216,$C$205:$C$216)>100,100,\nFORECAST($C201,I$205:I$216,$C$205:$C$216))))","v":91.727757719294345},null,null,null,{"$f":"IF(MAX(C205:C216)-MIN(C205:C216)<5,AVERAGEIF(C205:C216,\">0\",M205:M216),\nIF(FORECAST($C201,M$205:M$216,$C$205:$C$216)<0,0,\nIF(FORECAST($C201,M$205:M$216,$C$205:$C$216)>100,100,\nFORECAST($C201,M$205:M$216,$C$205:$C$216))))","v":0.63202489617037827},{"$f":"IF(MAX(C205:C216)-MIN(C205:C216)<5,AVERAGEIF(C205:C216,\">0\",N205:N216),\nIF(FORECAST($C201,N$205:N$216,$C$205:$C$216)<0,0,\nIF(FORECAST($C201,N$205:N$216,$C$205:$C$216)>100,100,\nFORECAST($C201,N$205:N$216,$C$205:$C$216))))","v":97.946569669568362},null,null,null,{"$f":"IF(MAX(C205:C216)-MIN(C205:C216)<5,AVERAGEIF(C205:C216,\">0\",R205:R216),\nIF(FORECAST($C201,R$205:R$216,$C$205:$C$216)<0,0,\nIF(FORECAST($C201,R$205:R$216,$C$205:$C$216)>100,100,\nFORECAST($C201,R$205:R$216,$C$205:$C$216))))","v":0.16309747101176697},{"$f":"IF(MAX(C205:C216)-MIN(C205:C216)<5,AVERAGEIF(C205:C216,\">0\",S205:S216),\nIF(FORECAST($C201,S$205:S$216,$C$205:$C$216)<0,0,\nIF(FORECAST($C201,S$205:S$216,$C$205:$C$216)>100,100,\nFORECAST($C201,S$205:S$216,$C$205:$C$216))))","v":99.24016018944161},null,null,null,{"$f":"IF(MAX(C205:C216)-MIN(C205:C216)<5,AVERAGEIF(C205:C216,\">0\",W205:W216),\nIF(FORECAST($C201,W$205:W$216,$C$205:$C$216)<0,0,\nIF(FORECAST($C201,W$205:W$216,$C$205:$C$216)>100,100,\nFORECAST($C201,W$205:W$216,$C$205:$C$216))))","v":8.975696497420671E-2},{"$f":"IF(MAX(C205:C216)-MIN(C205:C216)<5,AVERAGEIF(C205:C216,\">0\",X205:X216),\nIF(FORECAST($C201,X$205:X$216,$C$205:$C$216)<0,0,\nIF(FORECAST($C201,X$205:X$216,$C$205:$C$216)>100,100,\nFORECAST($C201,X$205:X$216,$C$205:$C$216))))","v":99.984858934040716},null,null,null,{"$f":"IF(MAX(C205:C216)-MIN(C205:C216)<5,AVERAGEIF(C205:C216,\">0\",AB205:AB216),\nIF(FORECAST($C201,AB$205:AB$216,$C$205:$C$216)<0,0,\nIF(FORECAST($C201,AB$205:AB$216,$C$205:$C$216)>100,100,\nFORECAST($C201,AB$205:AB$216,$C$205:$C$216))))","v":1.0862009037191367E-2}]
[null,null,{"$f":"MaxRegYear(C200,C205:C216)","v":2017},{"$f":"IF(MAX(C205:C216)-MIN(C205:C216)<5,AVERAGEIF(C205:C216,\">0\",D205:D216),\nIF(FORECAST($C202,D$205:D$216,$C$205:$C$216)<0,0,\nIF(FORECAST($C202,D$205:D$216,$C$205:$C$216)>100,100,\nFORECAST($C202,D$205:D$216,$C$205:$C$216))))","v":68.857609957965508},null,null,null,{"$f":"IF(MAX(C205:C216)-MIN(C205:C216)<5,AVERAGEIF(C205:C216,\">0\",H205:H216),\nIF(FORECAST($C202,H$205:H$216,$C$205:$C$216)<0,0,\nIF(FORECAST($C202,H$205:H$216,$C$205:$C$216)>100,100,\nFORECAST($C202,H$205:H$216,$C$205:$C$216))))","v":7.8509993633828685},{"$f":"IF(MAX(C205:C216)-MIN(C205:C216)<5,AVERAGEIF(C205:C216,\">0\",I205:I216),\nIF(FORECAST($C202,I$205:I$216,$C$205:$C$216)<0,0,\nIF(FORECAST($C202,I$205:I$216,$C$205:$C$216)>100,100,\nFORECAST($C202,I$205:I$216,$C$205:$C$216))))","v":84.917755251794233},null,null,null,{"$f":"IF(MAX(C205:C216)-MIN(C205:C216)<5,AVERAGEIF(C205:C216,\">0\",M205:M216),\nIF(FORECAST($C202,M$205:M$216,$C$205:$C$216)<0,0,\nIF(FORECAST($C202,M$205:M$216,$C$205:$C$216)>100,100,\nFORECAST($C202,M$205:M$216,$C$205:$C$216))))","v":1.724854587006746},{"$f":"IF(MAX(C205:C216)-MIN(C205:C216)<5,AVERAGEIF(C205:C216,\">0\",N205:N216),\nIF(FORECAST($C202,N$205:N$216,$C$205:$C$216)<0,0,\nIF(FORECAST($C202,N$205:N$216,$C$205:$C$216)>100,100,\nFORECAST($C202,N$205:N$216,$C$205:$C$216))))","v":92.869648983634988},null,null,null,{"$f":"IF(MAX(C205:C216)-MIN(C205:C216)<5,AVERAGEIF(C205:C216,\">0\",R205:R216),\nIF(FORECAST($C202,R$205:R$216,$C$205:$C$216)<0,0,\nIF(FORECAST($C202,R$205:R$216,$C$205:$C$216)>100,100,\nFORECAST($C202,R$205:R$216,$C$205:$C$216))))","v":0.51856890524728527},{"$f":"IF(MAX(C205:C216)-MIN(C205:C216)<5,AVERAGEIF(C205:C216,\">0\",S205:S216),\nIF(FORECAST($C202,S$205:S$216,$C$205:$C$216)<0,0,\nIF(FORECAST($C202,S$205:S$216,$C$205:$C$216)>100,100,\nFORECAST($C202,S$205:S$216,$C$205:$C$216))))","v":96.466959127998621},null,null,null,{"$f":"IF(MAX(C205:C216)-MIN(C205:C216)<5,AVERAGEIF(C205:C216,\">0\",W205:W216),\nIF(FORECAST($C202,W$205:W$216,$C$205:$C$216)<0,0,\nIF(FORECAST($C202,W$205:W$216,$C$205:$C$216)>100,100,\nFORECAST($C202,W$205:W$216,$C$205:$C$216))))","v":0.29948799193497067},{"$f":"IF(MAX(C205:C216)-MIN(C205:C216)<5,AVERAGEIF(C205:C216,\">0\",X205:X216),\nIF(FORECAST($C202,X$205:X$216,$C$205:$C$216)<0,0,\nIF(FORECAST($C202,X$205:X$216,$C$205:$C$216)>100,100,\nFORECAST($C202,X$205:X$216,$C$205:$C$216))))","v":98.64936057918743},null,null,null,{"$f":"IF(MAX(C205:C216)-MIN(C205:C216)<5,AVERAGEIF(C205:C216,\">0\",AB205:AB216),\nIF(FORECAST($C202,AB$205:AB$216,$C$205:$C$216)<0,0,\nIF(FORECAST($C202,AB$205:AB$216,$C$205:$C$216)>100,100,\nFORECAST($C202,AB$205:AB$216,$C$205:$C$216))))","v":2.8241223496697554E-2}]
[]
[null,"Survey","Year","Improved","Not shared",null,null,"Open defecation","Improved","Not shared",null,null,"Open defecation","Improved","Not shared",null,null,"Open defecation","Improved","Not shared",null,null,"Open defecation","Improved","Not shared",null,null,"Open defecation"]
[null,"WHS03",2003,{"$f":"IF(ISERROR(INDIRECT(CONCATENATE($B205,\"!H122\"))),\"\",INDIRECT(CONCATENATE($B205,\"!H122\")))","v":71.072319201995015},{"$f":"IF(ISERROR(INDIRECT(CONCATENATE($B205,\"!H129\"))),\"\",INDIRECT(CONCATENATE($B205,\"!H129\")))","v":90.080428954423596},null,null,{"$f":"IF(ISERROR(INDIRECT(CONCATENATE($B205,\"!H127\"))),\"\",INDIRECT(CONCATENATE($B205,\"!H127\")))","v":4.7381546134663344},{"$f":"IF(ISERROR(INDIRECT(CONCATENATE($B205,\"!I122\"))),\"\",INDIRECT(CONCATENATE($B205,\"!I122\")))","v":92.085427135678387},{"$f":"IF(ISERROR(INDIRECT(CONCATENATE($B205,\"!I129\"))),\"\",INDIRECT(CONCATENATE($B205,\"!I129\")))","v":88.461538461538453},null,null,{"$f":"IF(ISERROR(INDIRECT(CONCATENATE($B205,\"!I127\"))),\"\",INDIRECT(CONCATENATE($B205,\"!I127\")))","v":0.50251256281407031},{"$f":"IF(ISERROR(INDIRECT(CONCATENATE($B205,\"!J122\"))),\"\",INDIRECT(CONCATENATE($B205,\"!J122\")))","v":98.375},{"$f":"IF(ISERROR(INDIRECT(CONCATENATE($B205,\"!J129\"))),\"\",INDIRECT(CONCATENATE($B205,\"!J129\")))","v":91.116751269035532},null,null,{"$f":"IF(ISERROR(INDIRECT(CONCATENATE($B205,\"!J127\"))),\"\",INDIRECT(CONCATENATE($B205,\"!J127\")))","v":0},{"$f":"IF(ISERROR(INDIRECT(CONCATENATE($B205,\"!K122\"))),\"\",INDIRECT(CONCATENATE($B205,\"!K122\")))","v":99.348958333333329},{"$f":"IF(ISERROR(INDIRECT(CONCATENATE($B205,\"!K129\"))),\"\",INDIRECT(CONCATENATE($B205,\"!K129\")))","v":95.844155844155836},null,null,{"$f":"IF(ISERROR(INDIRECT(CONCATENATE($B205,\"!K127\"))),\"\",INDIRECT(CONCATENATE($B205,\"!K127\")))","v":0},{"$f":"IF(ISERROR(INDIRECT(CONCATENATE($B205,\"!L122\"))),\"\",INDIRECT(CONCATENATE($B205,\"!L122\")))","v":99.754299754299765},{"$f":"IF(ISERROR(INDIRECT(CONCATENATE($B205,\"!L129\"))),\"\",INDIRECT(CONCATENATE($B205,\"!L129\")))","v":97.236180904522612},null,null,{"$f":"IF(ISERROR(INDIRECT(CONCATENATE($B205,\"!L2127\"))),\"\",INDIRECT(CONCATENATE($B205,\"!L127\")))","v":0}]
[null,"ENCOVI11",2011,69.688644688644686,"N/A",null,null,10.134310134310134,83.844747002641739,"N/A",null,null,2.1133915870757978,91.584357992340244,"N/A",null,null,1.0078613182826042,96.140564696323381,"N/A",null,null,0.56875888685760712,99.341038118410395,"N/A",null,null,6.0827250608272508E-2]
[null,"DHS15",2015,69.237982112025321,"N/A",null,null,5.4468892479119289,88.186845009874972,"N/A",null,null,1.0560187862304666,95.630354901723237,"N/A",null,null,5.9072175385427146E-2,97.724505813823214,"N/A",null,null,4.1324926876266523E-2,98.689054102775486,"N/A",null,null,0]
[null,null,null,"","",null,null,"","","",null,null,"","","",null,null,"","","",null,null,"","","",null,null,""]
[null,null,null,"","",null,null,"","","",null,null,"","","",null,null,"","","",null,null,"","","",null,null,""]
[null,null,null,"","",null,null,"","","",null,null,"","","",null,null,"","","",null,null,"","","",null,null,""]
[null,null,null,"","",null,null,"","","",null,null,"","","",null,null,"","","",null,null,"","","",null,null,""]
[null,null,null,"","",null,null,"","","",null,null,"","","",null,null,"","","",null,null,"","","",null,null,""]
[null,null,null,"","",null,null,"","","",null,null,"","","",null,null,"","","",null,null,"","","",null,null,""]
[null,null,null,"","",null,null,"","","",null,null,"","","",null,null,"","","",null,null,"","","",null,null,""]
[null,null,null,"","",null,null,"","","",null,null,"","","",null,null,"","","",null,null,"","","",null,null,""]
[null,null,null,"","",null,null,"","","",null,null,"","","",null,null,"","","",null,null,"","","",null,null,""]
[]
[null,{"$f":"CONCATENATE(\"Urban use of sanitation facilities, \",C199,\"–\",C200)","v":"Urban use of sanitation facilities, 2000–2020"},null,null,null,null,null,null,null,null,null,null,null,null,null,null,null,null,"Data points used for regression"]
[]
[]
[]
[]
[]
[]
[]
[]
[]
[]
[]
[]
[]
[]
[]
[]
[]
[]
[]
[]
[]
[]
[]
[]
[]
[]
[]
[]
[]
[]
[]
[]
[]
[]
[]
[]
[]
[]
[]
[]
[]
[]
[]
[]
[]
[]
[]
[]
[]
[]
[]
[]
[]
[]
[]
[]
[]
[]
[]
[]
[]
[]
[]
[]
[]
[]
[]
[]
[]
[]
[]
[]
[]
[]
[]
[]
[]
[]
["RURAL",null,null,"Poorest",null,null,null,null,"Poor",null,null,null,null,"Middle",null,null,null,null,"Rich",null,null,null,null,"Richest"]
[null,null,null,"Improved","Basic","Limited","Unimproved","Open defecation","Improved","Basic","Limited","Unimproved","Open defecation","Improved","Basic","Limited","Unimproved","Open defecation","Improved","Basic","Limited","Unimproved","Open defecation","Improved","Basic","Limited","Unimproved","Open defecation"]
["Forecast period:",null,2000,{"$f":"IF((D301+H301)>100,D301*100/(D301+H301),D301)","v":34.204485894284744},{"$f":"D299*AVERAGEIF(E305:E316,\">0\")/100","v":32.646008119725003},{"$f":"D299*(100-AVERAGEIF(E305:E316,\">0\"))/100","v":1.5584777745597378},{"$f":"100-(E299+F299+H299)","v":35.632975934221008},{"$f":"IF((D301+H301)>100,H301*100/(D301+H301),H301)","v":30.162538171494248},{"$f":"IF((I301+M301)>100,I301*100/(I301+M301),I301)","v":39.26361756792403},{"$f":"I299*AVERAGEIF(J305:J316,\">0\")/100","v":36.835803262018281},{"$f":"I299*(100-AVERAGEIF(J305:J316,\">0\"))/100","v":2.4278143059057498},{"$f":"100-(J299+K299+M299)","v":40.034571826217416},{"$f":"IF((I301+M301)>100,M301*100/(I301+M301),M301)","v":20.701810605858554},{"$f":"IF((N301+R301)>100,N301*100/(N301+R301),N301)","v":43.661268866808996},{"$f":"N299*AVERAGEIF(O305:O316,\">0\")/100","v":40.371112149758218},{"$f":"N299*(100-AVERAGEIF(O305:O316,\">0\"))/100","v":3.2901567170507775},{"$f":"100-(O299+P299+R299)","v":40.116514361521467},{"$f":"IF((N301+R301)>100,R301*100/(N301+R301),R301)","v":16.222216771669537},{"$f":"IF((S301+W301)>100,S301*100/(S301+W301),S301)","v":54.799833967030963},{"$f":"S299*AVERAGEIF(T305:T316,\">0\")/100","v":49.621896899280003},{"$f":"S299*(100-AVERAGEIF(T305:T316,\">0\"))/100","v":5.1779370677509631},{"$f":"100-(T299+U299+W299)","v":37.015644130673763},{"$f":"IF((S301+W301)>100,W301*100/(S301+W301),W301)","v":8.1845219022952733},{"$f":"IF((X301+AB301)>100,X301*100/(X301+AB301),X301)","v":75.911011249413605},{"$f":"X299*AVERAGEIF(Y305:Y316,\">0\")/100","v":70.104385388917407},{"$f":"X299*(100-AVERAGEIF(Y305:Y316,\">0\"))/100","v":5.8066258604961964},{"$f":"100-(Y299+Z299+AB299)","v":20.410449164166209},{"$f":"IF((X301+AB301)>100,AB301*100/(X301+AB301),AB301)","v":3.678539586420186}]
[null,null,2020,{"$f":"IF((D302+H302)>100,D302*100/(D302+H302),D302)","v":44.339646139319711},{"$f":"D300*AVERAGEIF(E305:E316,\">0\")/100","v":42.319374492684034},{"$f":"D300*(100-AVERAGEIF(E305:E316,\">0\"))/100","v":2.0202716466356718},{"$f":"100-(E300+F300+H300)","v":32.932101383205008},{"$f":"IF((D302+H302)>100,H302*100/(D302+H302),H302)","v":22.72825247747528},{"$f":"IF((I302+M302)>100,I302*100/(I302+M302),I302)","v":49.209549578162068},{"$f":"I300*AVERAGEIF(J305:J316,\">0\")/100","v":46.166741608510257},{"$f":"I300*(100-AVERAGEIF(J305:J316,\">0\"))/100","v":3.0428079696518116},{"$f":"100-(J300+K300+M300)","v":34.902434083498179},{"$f":"IF((I302+M302)>100,M302*100/(I302+M302),M302)","v":15.888016338339753},{"$f":"IF((N302+R302)>100,N302*100/(N302+R302),N302)","v":59.309954868140267},{"$f":"N300*AVERAGEIF(O305:O316,\">0\")/100","v":54.840569267078784},{"$f":"N300*(100-AVERAGEIF(O305:O316,\">0\"))/100","v":4.4693856010614832},{"$f":"100-(O300+P300+R300)","v":30.850756713477608},{"$f":"IF((N302+R302)>100,R302*100/(N302+R302),R302)","v":9.8392884183821252},{"$f":"IF((S302+W302)>100,S302*100/(S302+W302),S302)","v":70.427981698430585},{"$f":"S300*AVERAGEIF(T305:T316,\">0\")/100","v":63.773369254484379},{"$f":"S300*(100-AVERAGEIF(T305:T316,\">0\"))/100","v":6.6546124439462053},{"$f":"100-(T300+U300+W300)","v":26.379300065697635},{"$f":"IF((S302+W302)>100,W302*100/(S302+W302),W302)","v":3.1927182358717801},{"$f":"IF((X302+AB302)>100,X302*100/(X302+AB302),X302)","v":83.601872498163516},{"$f":"X300*AVERAGEIF(Y305:Y316,\">0\")/100","v":77.206953146624883},{"$f":"X300*(100-AVERAGEIF(Y305:Y316,\">0\"))/100","v":6.3949193515386353},{"$f":"100-(Y300+Z300+AB300)","v":15.343481198299514},{"$f":"IF((X302+AB302)>100,AB302*100/(X302+AB302),AB302)","v":1.0546463035369698}]
["Regression period:",null,{"$f":"MinRegYear(C299,C305:C316)","v":2001},{"$f":"IF(MAX(C305:C316)-MIN(C305:C316)<5,AVERAGEIF(C305:C316,\">0\",D305:D316),\nIF(FORECAST($C301,D$305:D$316,$C$305:$C$316)<0,0,\nIF(FORECAST($C301,D$305:D$316,$C$305:$C$316)>100,100,\nFORECAST($C301,D$305:D$316,$C$305:$C$316))))","v":34.204485894284744},null,null,null,{"$f":"IF(MAX(C305:C316)-MIN(C305:C316)<5,AVERAGEIF(C305:C316,\">0\",H305:H316),\nIF(FORECAST($C301,H$305:H$316,$C$305:$C$316)<0,0,\nIF(FORECAST($C301,H$305:H$316,$C$305:$C$316)>100,100,\nFORECAST($C301,H$305:H$316,$C$305:$C$316))))","v":30.162538171494248},{"$f":"IF(MAX(C305:C316)-MIN(C305:C316)<5,AVERAGEIF(C305:C316,\">0\",I305:I316),\nIF(FORECAST($C301,I$305:I$316,$C$305:$C$316)<0,0,\nIF(FORECAST($C301,I$305:I$316,$C$305:$C$316)>100,100,\nFORECAST($C301,I$305:I$316,$C$305:$C$316))))","v":39.26361756792403},null,null,null,{"$f":"IF(MAX(C305:C316)-MIN(C305:C316)<5,AVERAGEIF(C305:C316,\">0\",M305:M316),\nIF(FORECAST($C301,M$305:M$316,$C$305:$C$316)<0,0,\nIF(FORECAST($C301,M$305:M$316,$C$305:$C$316)>100,100,\nFORECAST($C301,M$305:M$316,$C$305:$C$316))))","v":20.701810605858554},{"$f":"IF(MAX(C305:C316)-MIN(C305:C316)<5,AVERAGEIF(C305:C316,\">0\",N305:N316),\nIF(FORECAST($C301,N$305:N$316,$C$305:$C$316)<0,0,\nIF(FORECAST($C301,N$305:N$316,$C$305:$C$316)>100,100,\nFORECAST($C301,N$305:N$316,$C$305:$C$316))))","v":43.661268866808996},null,null,null,{"$f":"IF(MAX(C305:C316)-MIN(C305:C316)<5,AVERAGEIF(C305:C316,\">0\",R305:R316),\nIF(FORECAST($C301,R$305:R$316,$C$305:$C$316)<0,0,\nIF(FORECAST($C301,R$305:R$316,$C$305:$C$316)>100,100,\nFORECAST($C301,R$305:R$316,$C$305:$C$316))))","v":16.222216771669537},{"$f":"IF(MAX(C305:C316)-MIN(C305:C316)<5,AVERAGEIF(C305:C316,\">0\",S305:S316),\nIF(FORECAST($C301,S$305:S$316,$C$305:$C$316)<0,0,\nIF(FORECAST($C301,S$305:S$316,$C$305:$C$316)>100,100,\nFORECAST($C301,S$305:S$316,$C$305:$C$316))))","v":54.799833967030963},null,null,null,{"$f":"IF(MAX(C305:C316)-MIN(C305:C316)<5,AVERAGEIF(C305:C316,\">0\",W305:W316),\nIF(FORECAST($C301,W$305:W$316,$C$305:$C$316)<0,0,\nIF(FORECAST($C301,W$305:W$316,$C$305:$C$316)>100,100,\nFORECAST($C301,W$305:W$316,$C$305:$C$316))))","v":8.1845219022952733},{"$f":"IF(MAX(C305:C316)-MIN(C305:C316)<5,AVERAGEIF(C305:C316,\">0\",X305:X316),\nIF(FORECAST($C301,X$305:X$316,$C$305:$C$316)<0,0,\nIF(FORECAST($C301,X$305:X$316,$C$305:$C$316)>100,100,\nFORECAST($C301,X$305:X$316,$C$305:$C$316))))","v":75.911011249413605},null,null,null,{"$f":"IF(MAX(C305:C316)-MIN(C305:C316)<5,AVERAGEIF(C305:C316,\">0\",AB305:AB316),\nIF(FORECAST($C301,AB$305:AB$316,$C$305:$C$316)<0,0,\nIF(FORECAST($C301,AB$305:AB$316,$C$305:$C$316)>100,100,\nFORECAST($C301,AB$305:AB$316,$C$305:$C$316))))","v":3.678539586420186}]
[null,null,{"$f":"MaxRegYear(C300,C305:C316)","v":2017},{"$f":"IF(MAX(C305:C316)-MIN(C305:C316)<5,AVERAGEIF(C305:C316,\">0\",D305:D316),\nIF(FORECAST($C302,D$305:D$316,$C$305:$C$316)<0,0,\nIF(FORECAST($C302,D$305:D$316,$C$305:$C$316)>100,100,\nFORECAST($C302,D$305:D$316,$C$305:$C$316))))","v":44.339646139319711},null,null,null,{"$f":"IF(MAX(C305:C316)-MIN(C305:C316)<5,AVERAGEIF(C305:C316,\">0\",H305:H316),\nIF(FORECAST($C302,H$305:H$316,$C$305:$C$316)<0,0,\nIF(FORECAST($C302,H$305:H$316,$C$305:$C$316)>100,100,\nFORECAST($C302,H$305:H$316,$C$305:$C$316))))","v":22.72825247747528},{"$f":"IF(MAX(C305:C316)-MIN(C305:C316)<5,AVERAGEIF(C305:C316,\">0\",I305:I316),\nIF(FORECAST($C302,I$305:I$316,$C$305:$C$316)<0,0,\nIF(FORECAST($C302,I$305:I$316,$C$305:$C$316)>100,100,\nFORECAST($C302,I$305:I$316,$C$305:$C$316))))","v":49.209549578162068},null,null,null,{"$f":"IF(MAX(C305:C316)-MIN(C305:C316)<5,AVERAGEIF(C305:C316,\">0\",M305:M316),\nIF(FORECAST($C302,M$305:M$316,$C$305:$C$316)<0,0,\nIF(FORECAST($C302,M$305:M$316,$C$305:$C$316)>100,100,\nFORECAST($C302,M$305:M$316,$C$305:$C$316))))","v":15.888016338339753},{"$f":"IF(MAX(C305:C316)-MIN(C305:C316)<5,AVERAGEIF(C305:C316,\">0\",N305:N316),\nIF(FORECAST($C302,N$305:N$316,$C$305:$C$316)<0,0,\nIF(FORECAST($C302,N$305:N$316,$C$305:$C$316)>100,100,\nFORECAST($C302,N$305:N$316,$C$305:$C$316))))","v":59.309954868140267},null,null,null,{"$f":"IF(MAX(C305:C316)-MIN(C305:C316)<5,AVERAGEIF(C305:C316,\">0\",R305:R316),\nIF(FORECAST($C302,R$305:R$316,$C$305:$C$316)<0,0,\nIF(FORECAST($C302,R$305:R$316,$C$305:$C$316)>100,100,\nFORECAST($C302,R$305:R$316,$C$305:$C$316))))","v":9.8392884183821252},{"$f":"IF(MAX(C305:C316)-MIN(C305:C316)<5,AVERAGEIF(C305:C316,\">0\",S305:S316),\nIF(FORECAST($C302,S$305:S$316,$C$305:$C$316)<0,0,\nIF(FORECAST($C302,S$305:S$316,$C$305:$C$316)>100,100,\nFORECAST($C302,S$305:S$316,$C$305:$C$316))))","v":70.427981698430585},null,null,null,{"$f":"IF(MAX(C305:C316)-MIN(C305:C316)<5,AVERAGEIF(C305:C316,\">0\",W305:W316),\nIF(FORECAST($C302,W$305:W$316,$C$305:$C$316)<0,0,\nIF(FORECAST($C302,W$305:W$316,$C$305:$C$316)>100,100,\nFORECAST($C302,W$305:W$316,$C$305:$C$316))))","v":3.1927182358717801},{"$f":"IF(MAX(C305:C316)-MIN(C305:C316)<5,AVERAGEIF(C305:C316,\">0\",X305:X316),\nIF(FORECAST($C302,X$305:X$316,$C$305:$C$316)<0,0,\nIF(FORECAST($C302,X$305:X$316,$C$305:$C$316)>100,100,\nFORECAST($C302,X$305:X$316,$C$305:$C$316))))","v":83.601872498163516},null,null,null,{"$f":"IF(MAX(C305:C316)-MIN(C305:C316)<5,AVERAGEIF(C305:C316,\">0\",AB305:AB316),\nIF(FORECAST($C302,AB$305:AB$316,$C$305:$C$316)<0,0,\nIF(FORECAST($C302,AB$305:AB$316,$C$305:$C$316)>100,100,\nFORECAST($C302,AB$305:AB$316,$C$305:$C$316))))","v":1.0546463035369698}]
[]
[null,"Survey","Year","Improved","Not shared",null,null,"Open defecation","Improved","Not shared",null,null,"Open defecation","Improved","Not shared",null,null,"Open defecation","Improved","Not shared",null,null,"Open defecation","Improved","Not shared",null,null,"Open defecation"]
[null,"WHS03",2003,{"$f":"IF(ISERROR(INDIRECT(CONCATENATE($B305,\"!M122\"))),\"\",INDIRECT(CONCATENATE($B305,\"!M122\")))","v":35.714285714285715},{"$f":"IF(ISERROR(INDIRECT(CONCATENATE($B305,\"!M129\"))),\"\",INDIRECT(CONCATENATE($B305,\"!M129\")))","v":95.44364508393285},null,null,{"$f":"IF(ISERROR(INDIRECT(CONCATENATE($B305,\"!M127\"))),\"\",INDIRECT(CONCATENATE($B305,\"!M127\")))","v":28.571428571428569},{"$f":"IF(ISERROR(INDIRECT(CONCATENATE($B305,\"!N122\"))),\"\",INDIRECT(CONCATENATE($B305,\"!N122\")))","v":41.470054446460978},{"$f":"IF(ISERROR(INDIRECT(CONCATENATE($B305,\"!N129\"))),\"\",INDIRECT(CONCATENATE($B305,\"!N129\")))","v":93.816631130063968},null,null,{"$f":"IF(ISERROR(INDIRECT(CONCATENATE($B305,\"!N127\"))),\"\",INDIRECT(CONCATENATE($B305,\"!N127\")))","v":18.511796733212339},{"$f":"IF(ISERROR(INDIRECT(CONCATENATE($B305,\"!O122\"))),\"\",INDIRECT(CONCATENATE($B305,\"!O122\")))","v":45.894160583941598},{"$f":"IF(ISERROR(INDIRECT(CONCATENATE($B305,\"!O129\"))),\"\",INDIRECT(CONCATENATE($B305,\"!O129\")))","v":92.464358452138498},null,null,{"$f":"IF(ISERROR(INDIRECT(CONCATENATE($B305,\"!O127\"))),\"\",INDIRECT(CONCATENATE($B305,\"!O127\")))","v":14.78102189781022},{"$f":"IF(ISERROR(INDIRECT(CONCATENATE($B305,\"!P122\"))),\"\",INDIRECT(CONCATENATE($B305,\"!P122\")))","v":56.959706959706963},{"$f":"IF(ISERROR(INDIRECT(CONCATENATE($B305,\"!P129\"))),\"\",INDIRECT(CONCATENATE($B305,\"!P129\")))","v":90.551181102362193},null,null,{"$f":"IF(ISERROR(INDIRECT(CONCATENATE($B305,\"!P127\"))),\"\",INDIRECT(CONCATENATE($B305,\"!P127\")))","v":7.3260073260073266},{"$f":"IF(ISERROR(INDIRECT(CONCATENATE($B305,\"!Q122\"))),\"\",INDIRECT(CONCATENATE($B305,\"!Q122\")))","v":76.860254083484591},{"$f":"IF(ISERROR(INDIRECT(CONCATENATE($B305,\"!Q129\"))),\"\",INDIRECT(CONCATENATE($B305,\"!Q129\")))","v":92.350746268656707},null,null,{"$f":"IF(ISERROR(INDIRECT(CONCATENATE($B305,\"!Q2127\"))),\"\",INDIRECT(CONCATENATE($B305,\"!Q127\")))","v":3.0852994555353903}]
[null,"ENCOVI11",2011,39.81024667931689,"N/A",null,null,27.501581277672361,42.590238942552112,"N/A",null,null,22.458057956278594,52.61127971674253,"N/A",null,null,14.162873039959534,63.948362720403018,"N/A",null,null,5.7682619647355171,80.754143995950912,"N/A",null,null,2.8343666961913199]
[null,"DHS15",2015,43.558560687433364,"N/A",null,null,22.333890412600979,49.892698831396423,"N/A",null,null,13.313161443366806,57.907481051906288,"N/A",null,null,9.350496803146445,68.887172284507599,"N/A",null,null,3.3476154582047037,82.616285198024187,"N/A",null,null,0.85212602284859829]
[null,null,null,"","",null,null,"","","",null,null,"","","",null,null,"","","",null,null,"","","",null,null,""]
[null,null,null,"","",null,null,"","","",null,null,"","","",null,null,"","","",null,null,"","","",null,null,""]
[null,null,null,"","",null,null,"","","",null,null,"","","",null,null,"","","",null,null,"","","",null,null,""]
[null,null,null,"","",null,null,"","","",null,null,"","","",null,null,"","","",null,null,"","","",null,null,""]
[null,null,null,"","",null,null,"","","",null,null,"","","",null,null,"","","",null,null,"","","",null,null,""]
[null,null,null,"","",null,null,"","","",null,null,"","","",null,null,"","","",null,null,"","","",null,null,""]
[null,null,null,"","",null,null,"","","",null,null,"","","",null,null,"","","",null,null,"","","",null,null,""]
[null,null,null,"","",null,null,"","","",null,null,"","","",null,null,"","","",null,null,"","","",null,null,""]
[null,null,null,"","",null,null,"","","",null,null,"","","",null,null,"","","",null,null,"","","",null,null,""]
[]
[null,{"$f":"CONCATENATE(\"Rural use of sanitation facilities, \",C299,\"–\",C300)","v":"Rural use of sanitation facilities, 2000–2020"},null,null,null,null,null,null,null,null,null,null,null,null,null,null,null,null,"Data points used for regression"]

{"sheet":"Hygiene","index":3,"n_rows":91,"n_cols":25,"rows_kept":91,"cut":false,"hidden":false,"merged":[[39,22,40,22],[39,23,40,23],[39,24,40,24],[31,4,32,5],[39,16,40,16],[39,17,40,17],[39,18,40,18],[39,19,40,19],[39,20,40,20],[39,21,40,21],[36,24,37,24],[39,6,40,7],[39,8,40,8],[39,9,40,9],[39,10,40,10],[39,11,40,11],[39,12,40,12],[39,13,40,13],[39,14,40,14],[39,15,40,15],[36,18,37,18],[36,12,37,12],[36,13,37,13],[36,14,37,14],[36,15,37,15],[36,16,37,16],[36,17,37,17],[36,19,37,19],[36,20,37,20],[36,21,37,21],[36,22,37,22],[36,23,37,23],[33,20,34,20],[33,21,34,21],[33,22,34,22],[33,23,34,23],[33,24,34,24],[33,15,34,15],[33,16,34,16],[33,17,34,17],[33,18,34,18],[36,6,37,7],[36,8,37,8],[36,9,37,9],[36,10,37,10],[36,11,37,11],[33,10,34,10],[33,11,34,11],[33,12,34,12],[33,13,34,13],[33,14,34,14],[6,1,6,7],[3,1,3,24],[4,1,4,24],[33,1,34,3],[31,6,32,9],[31,10,31,12],[31,13,31,15],[6,10,6,15],[6,18,6,23],[33,19,34,19],[31,16,31,18],[31,19,31,21],[31,22,31,24],[33,6,34,7],[33,8,34,8],[33,9,34,9]]}
[]
[]
[]
[null,"Access to hygiene facilities by wealth quintile (%)"]
[null,{"$f":"IF(ISERROR(INDIRECT(CONCATENATE($E$32,\"!A2\"))),\"\",INDIRECT(CONCATENATE($E$32,\"!A2\")))","v":"Guatemala"}]
[]
[null,{"$f":"CONCATENATE(\"National \",IF(ISERROR(INDIRECT(CONCATENATE($E$32,\"!A2\"))),\"\",INDIRECT(CONCATENATE($E$32,\"!A210\"))))","v":"National Access to hygiene facilities "},null,null,null,null,null,null,null,null,{"$f":"CONCATENATE(\"Urban \",IF(ISERROR(INDIRECT(CONCATENATE($E$32,\"!A2\"))),\"\",INDIRECT(CONCATENATE($E$32,\"!A210\"))))","v":"Urban Access to hygiene facilities "},null,null,null,null,null,null,null,{"$f":"CONCATENATE(\"Rural \",IF(ISERROR(INDIRECT(CONCATENATE($E$32,\"!A2\"))),\"\",INDIRECT(CONCATENATE($E$32,\"!A210\"))))","v":"Rural Access to hygiene facilities "}]
[]
[]
[]
[]
[]
[]
[]
[]
[]
[]
[]
[]
[]
[]
[]
[]
[]
[]
[]
[]
[]
[]
[]
[]
[null,null,null,null,{"$f":"INDEX(B88:B100,A88)","v":"DHS15"},null,{"$f":"IF(ISERROR(INDIRECT(CONCATENATE($E$32,\"!A2\"))),\"\",INDIRECT(CONCATENATE($E$32,\"!A2\")))","v":"Guatemala"},null,null,null,"Poorest",null,null,"Poor",null,null,"Middle",null,null,"Rich",null,null,"Richest"]
[null,null,null,null,null,null,null,null,null,null,"Basic","Limited","No facility","Basic","Limited","No facility","Basic","Limited","No facility","Basic","Limited","No facility","Basic","Limited","No facility"]
[null,">>>  Select Survey :   ",null,null,null,null,"NATIONAL",null,null,{"$f":"IF(ISERROR(INDIRECT(CONCATENATE(#REF!,\"!A2\"))),\"\",INDIRECT(CONCATENATE(#REF!,\"!A210\")))","v":""},{"$f":"IF(ISERROR(INDIRECT(CONCATENATE($E$32,\"!C222\"))),\"\",INDIRECT(CONCATENATE($E$32,\"!C222\")))","v":50.716444667500106},{"$f":"IF(ISERROR(INDIRECT(CONCATENATE($E$32,\"!C223\"))),\"\",INDIRECT(CONCATENATE($E$32,\"!C223\")))","v":43.212341850258646},{"$f":"IF(ISERROR(INDIRECT(CONCATENATE($E$32,\"!C224\"))),\"\",INDIRECT(CONCATENATE($E$32,\"!C224\")))","v":6.0712134822420163},{"$f":"IF(ISERROR(INDIRECT(CONCATENATE($E$32,\"!D222\"))),\"\",INDIRECT(CONCATENATE($E$32,\"!D222\")))","v":72.682347714196766},{"$f":"IF(ISERROR(INDIRECT(CONCATENATE($E$32,\"!D223\"))),\"\",INDIRECT(CONCATENATE($E$32,\"!D223\")))","v":25.611907744109047},{"$f":"IF(ISERROR(INDIRECT(CONCATENATE($E$32,\"!D224\"))),\"\",INDIRECT(CONCATENATE($E$32,\"!D224\")))","v":1.7057445416940991},{"$f":"IF(ISERROR(INDIRECT(CONCATENATE($E$32,\"!E222\"))),\"\",INDIRECT(CONCATENATE($E$32,\"!E222\")))","v":83.769135448151886},{"$f":"IF(ISERROR(INDIRECT(CONCATENATE($E$32,\"!E223\"))),\"\",INDIRECT(CONCATENATE($E$32,\"!E223\")))","v":15.30670054716462},{"$f":"IF(ISERROR(INDIRECT(CONCATENATE($E$32,\"!E224\"))),\"\",INDIRECT(CONCATENATE($E$32,\"!E224\")))","v":0.92416400468355731},{"$f":"IF(ISERROR(INDIRECT(CONCATENATE($E$32,\"!F222\"))),\"\",INDIRECT(CONCATENATE($E$32,\"!F222\")))","v":88.446716395905398},{"$f":"IF(ISERROR(INDIRECT(CONCATENATE($E$32,\"!F223\"))),\"\",INDIRECT(CONCATENATE($E$32,\"!F223\")))","v":9.7665510185496824},{"$f":"IF(ISERROR(INDIRECT(CONCATENATE($E$32,\"!F224\"))),\"\",INDIRECT(CONCATENATE($E$32,\"!F224\")))","v":1.7867325855450842},{"$f":"IF(ISERROR(INDIRECT(CONCATENATE($E$32,\"!G222\"))),\"\",INDIRECT(CONCATENATE($E$32,\"!G222\")))","v":92.312294966677428},{"$f":"IF(ISERROR(INDIRECT(CONCATENATE($E$32,\"!G223\"))),\"\",INDIRECT(CONCATENATE($E$32,\"!G223\")))","v":5.1008067215923614},{"$f":"IF(ISERROR(INDIRECT(CONCATENATE($E$32,\"!G224\"))),\"\",INDIRECT(CONCATENATE($E$32,\"!G224\")))","v":2.5868983117304887}]
[]
[]
[null,null,null,null,null,null,"URBAN",null,null,{"$f":"IF(ISERROR(INDIRECT(CONCATENATE(#REF!,\"!A2\"))),\"\",INDIRECT(CONCATENATE(#REF!,\"!A210\")))","v":""},{"$f":"IF(ISERROR(INDIRECT(CONCATENATE($E$32,\"!H222\"))),\"\",INDIRECT(CONCATENATE($E$32,\"!H222\")))","v":72.647084882716186},{"$f":"IF(ISERROR(INDIRECT(CONCATENATE($E$32,\"!H223\"))),\"\",INDIRECT(CONCATENATE($E$32,\"!H223\")))","v":25.201409253591194},{"$f":"IF(ISERROR(INDIRECT(CONCATENATE($E$32,\"!H224\"))),\"\",INDIRECT(CONCATENATE($E$32,\"!H224\")))","v":2.151505863692813},{"$f":"IF(ISERROR(INDIRECT(CONCATENATE($E$32,\"!I222\"))),\"\",INDIRECT(CONCATENATE($E$32,\"!I222\")))","v":84.952629163254144},{"$f":"IF(ISERROR(INDIRECT(CONCATENATE($E$32,\"!I223\"))),\"\",INDIRECT(CONCATENATE($E$32,\"!I223\")))","v":13.748886257293783},{"$f":"IF(ISERROR(INDIRECT(CONCATENATE($E$32,\"!I224\"))),\"\",INDIRECT(CONCATENATE($E$32,\"!I224\")))","v":1.2984845794522397},{"$f":"IF(ISERROR(INDIRECT(CONCATENATE($E$32,\"!J222\"))),\"\",INDIRECT(CONCATENATE($E$32,\"!J222\")))","v":86.382195018587154},{"$f":"IF(ISERROR(INDIRECT(CONCATENATE($E$32,\"!J223\"))),\"\",INDIRECT(CONCATENATE($E$32,\"!J223\")))","v":10.768588472595717},{"$f":"IF(ISERROR(INDIRECT(CONCATENATE($E$32,\"!J224\"))),\"\",INDIRECT(CONCATENATE($E$32,\"!J224\")))","v":2.8492165088171602},{"$f":"IF(ISERROR(INDIRECT(CONCATENATE($E$32,\"!K222\"))),\"\",INDIRECT(CONCATENATE($E$32,\"!K222\")))","v":90.611315502987239},{"$f":"IF(ISERROR(INDIRECT(CONCATENATE($E$32,\"!K223\"))),\"\",INDIRECT(CONCATENATE($E$32,\"!K223\")))","v":6.8272623533410375},{"$f":"IF(ISERROR(INDIRECT(CONCATENATE($E$32,\"!K224\"))),\"\",INDIRECT(CONCATENATE($E$32,\"!K224\")))","v":2.5614221436716997},{"$f":"IF(ISERROR(INDIRECT(CONCATENATE($E$32,\"!L222\"))),\"\",INDIRECT(CONCATENATE($E$32,\"!L222\")))","v":93.172434636086933},{"$f":"IF(ISERROR(INDIRECT(CONCATENATE($E$32,\"!L223\"))),\"\",INDIRECT(CONCATENATE($E$32,\"!L223\")))","v":3.6102120868692253},{"$f":"IF(ISERROR(INDIRECT(CONCATENATE($E$32,\"!L224\"))),\"\",INDIRECT(CONCATENATE($E$32,\"!L224\")))","v":3.2173532770438427}]
[]
[]
[null,null,null,null,null,null,"RURAL",null,null,{"$f":"IF(ISERROR(INDIRECT(CONCATENATE(#REF!,\"!A2\"))),\"\",INDIRECT(CONCATENATE(#REF!,\"!A210\")))","v":""},{"$f":"IF(ISERROR(INDIRECT(CONCATENATE($E$32,\"!M222\"))),\"\",INDIRECT(CONCATENATE($E$32,\"!M222\")))","v":44.334473984996606},{"$f":"IF(ISERROR(INDIRECT(CONCATENATE($E$32,\"!M223\"))),\"\",INDIRECT(CONCATENATE($E$32,\"!M223\")))","v":47.292842557004874},{"$f":"IF(ISERROR(INDIRECT(CONCATENATE($E$32,\"!M224\"))),\"\",INDIRECT(CONCATENATE($E$32,\"!M224\")))","v":8.3726834579983151},{"$f":"IF(ISERROR(INDIRECT(CONCATENATE($E$32,\"!N222\"))),\"\",INDIRECT(CONCATENATE($E$32,\"!N222\")))","v":61.60003960359964},{"$f":"IF(ISERROR(INDIRECT(CONCATENATE($E$32,\"!N223\"))),\"\",INDIRECT(CONCATENATE($E$32,\"!N223\")))","v":35.754463219791702},{"$f":"IF(ISERROR(INDIRECT(CONCATENATE($E$32,\"!N224\"))),\"\",INDIRECT(CONCATENATE($E$32,\"!N224\")))","v":2.6454971766087252},{"$f":"IF(ISERROR(INDIRECT(CONCATENATE($E$32,\"!O222\"))),\"\",INDIRECT(CONCATENATE($E$32,\"!O222\")))","v":76.310862055290642},{"$f":"IF(ISERROR(INDIRECT(CONCATENATE($E$32,\"!O223\"))),\"\",INDIRECT(CONCATENATE($E$32,\"!O223\")))","v":22.621425584973871},{"$f":"IF(ISERROR(INDIRECT(CONCATENATE($E$32,\"!O224\"))),\"\",INDIRECT(CONCATENATE($E$32,\"!O224\")))","v":1.0677123597355738},{"$f":"IF(ISERROR(INDIRECT(CONCATENATE($E$32,\"!P222\"))),\"\",INDIRECT(CONCATENATE($E$32,\"!P222\")))","v":84.508056778238824},{"$f":"IF(ISERROR(INDIRECT(CONCATENATE($E$32,\"!P223\"))),\"\",INDIRECT(CONCATENATE($E$32,\"!P223\")))","v":14.567975398597186},{"$f":"IF(ISERROR(INDIRECT(CONCATENATE($E$32,\"!P224\"))),\"\",INDIRECT(CONCATENATE($E$32,\"!P224\")))","v":0.92396782316393822},{"$f":"IF(ISERROR(INDIRECT(CONCATENATE($E$32,\"!Q222\"))),\"\",INDIRECT(CONCATENATE($E$32,\"!Q222\")))","v":91.57556802825097},{"$f":"IF(ISERROR(INDIRECT(CONCATENATE($E$32,\"!Q223\"))),\"\",INDIRECT(CONCATENATE($E$32,\"!Q223\")))","v":7.5367202466416359},{"$f":"IF(ISERROR(INDIRECT(CONCATENATE($E$32,\"!Q224\"))),\"\",INDIRECT(CONCATENATE($E$32,\"!Q224\")))","v":0.88771172510737295}]
[]
[]
[]
[]
[]
[]
[]
[]
[]
[]
[]
[]
[]
[]
[]
[]
[]
[]
[]
[]
[]
[]
[]
[]
[]
[]
[]
[]
[]
[]
[]
[]
[]
[]
[]
[]
[]
[]
[]
[]
[]
[]
[]
[]
[]
[]
[]
[3,"WHS03"]
[null,"ENCOVI11"]
[null,"DHS15"]
[null,"Template"]

{"sheet":"WHS03","index":4,"n_rows":1072,"n_cols":69,"rows_kept":1072,"cut":false,"hidden":false,"merged":[[346,52,347,52],[348,52,349,52],[350,52,351,52],[352,52,353,52],[270,52,272,52],[273,52,275,52],[276,52,283,52],[338,54,338,58],[338,59,338,63],[338,64,338,68],[340,52,341,52],[342,52,343,52],[344,52,345,52],[221,52,223,52],[224,52,225,52],[226,52,229,52],[258,54,258,58],[258,59,258,63],[258,64,258,68],[260,52,262,52],[263,52,266,52],[267,52,269,52],[134,52,138,52],[219,54,219,58],[219,59,219,63],[219,64,219,68],[13,64,13,68],[15,52,16,52],[17,52,20,52],[21,52,22,52],[26,54,26,58],[26,59,26,63],[26,64,26,68],[40,52,41,52],[55,54,55,58],[55,59,55,63],[55,64,55,68],[139,52,142,52],[152,52,160,52],[147,52,149,52],[121,0,122,0],[55,12,55,16],[57,0,64,0],[107,0,107,1],[44,0,45,0],[55,2,55,6],[55,7,55,11],[123,0,126,0],[127,0,128,0],[129,0,131,0],[132,2,132,6],[119,64,119,68],[121,52,122,52],[123,52,126,52],[127,52,128,52],[132,54,132,58],[132,59,132,63],[132,64,132,68],[13,54,13,58],[13,59,13,63],[119,54,119,58],[119,59,119,63],[42,52,43,52],[44,52,45,52],[46,0,48,0],[46,52,48,52],[49,0,51,0],[49,52,51,52],[52,0,54,0],[52,52,54,52],[32,52,33,52],[34,52,35,52],[36,52,37,52],[38,0,39,0],[38,52,39,52],[119,12,119,16],[132,7,132,11],[119,2,119,6],[119,7,119,11],[207,0,207,1],[13,2,13,6],[13,7,13,11],[28,52,29,52],[30,0,31,0],[30,52,31,52],[28,0,29,0],[34,0,35,0],[36,0,37,0],[40,0,41,0],[42,0,43,0],[13,12,13,16],[15,0,16,0],[17,0,20,0],[21,0,22,0],[23,0,25,0],[26,2,26,6],[26,7,26,11],[26,12,26,16],[32,0,33,0],[143,0,146,0],[143,52,146,52],[147,0,149,0],[132,12,132,16],[134,0,138,0],[152,0,159,0],[150,0,151,0],[150,52,151,52],[139,0,142,0],[1024,0,1024,2],[1025,0,1025,1],[1030,0,1032,0],[1033,0,1033,2],[398,2,398,5],[219,2,219,6],[219,7,219,11],[219,12,219,16],[221,0,223,0],[398,7,398,10],[398,12,398,15],[399,2,399,4],[399,7,399,9],[399,12,399,14],[400,2,401,3],[400,7,401,8],[400,12,401,13],[401,1,444,1],[402,2,402,3],[402,7,402,8],[402,12,402,13],[403,2,403,3],[403,7,403,8],[403,12,403,13],[404,2,404,3],[404,7,404,8],[404,12,404,13],[407,2,407,3],[407,7,407,8],[407,12,407,13],[408,2,408,3],[408,7,408,8],[408,12,408,13],[405,2,405,3],[405,7,405,8],[405,12,405,13],[406,2,406,3],[406,7,406,8],[406,12,406,13],[411,2,411,3],[411,7,411,8],[411,12,411,13],[412,2,412,3],[412,7,412,8],[412,12,412,13],[409,2,409,3],[409,7,409,8],[409,12,409,13],[410,2,410,3],[410,7,410,8],[410,12,410,13],[415,2,415,3],[415,7,415,8],[415,12,415,13],[416,2,416,3],[416,7,416,8],[416,12,416,13],[413,2,413,3],[413,7,413,8],[413,12,413,13],[414,2,414,3],[414,7,414,8],[414,12,414,13],[419,2,419,3],[419,7,419,8],[419,12,419,13],[420,2,420,3],[420,7,420,8],[420,12,420,13],[417,2,417,3],[417,7,417,8],[417,12,417,13],[418,2,418,3],[418,7,418,8],[418,12,418,13],[423,2,423,3],[423,7,423,8],[423,12,423,13],[424,2,424,3],[424,7,424,8],[424,12,424,13],[421,2,421,3],[421,7,421,8],[421,12,421,13],[422,2,422,3],[422,7,422,8],[422,12,422,13],[427,2,427,3],[427,7,427,8],[427,12,427,13],[428,2,428,3],[428,7,428,8],[428,12,428,13],[425,2,425,3],[425,7,425,8],[425,12,425,13],[426,2,426,3],[426,7,426,8],[426,12,426,13],[431,2,431,3],[431,7,431,8],[431,12,431,13],[432,2,432,3],[432,7,432,8],[432,12,432,13],[429,2,429,3],[429,7,429,8],[429,12,429,13],[430,2,430,3],[430,7,430,8],[430,12,430,13],[435,2,435,3],[435,7,435,8],[435,12,435,13],[436,2,436,3],[436,7,436,8],[436,12,436,13],[433,2,433,3],[433,7,433,8],[433,12,433,13],[434,2,434,3],[434,7,434,8],[434,12,434,13],[439,2,439,3],[439,7,439,8],[439,12,439,13],[440,2,440,3],[440,7,440,8],[440,12,440,13],[437,2,437,3],[437,7,437,8],[437,12,437,13],[438,2,438,3],[438,7,438,8],[438,12,438,13],[443,2,443,3],[443,7,443,8],[443,12,443,13],[444,2,444,3],[444,7,444,8],[444,12,444,13],[441,2,441,3],[441,7,441,8],[441,12,441,13],[442,2,442,3],[442,7,442,8],[442,12,442,13],[447,2,447,3],[447,7,447,8],[447,12,447,13],[448,2,448,3],[448,7,448,8],[448,12,448,13],[445,2,445,3],[445,7,445,8],[445,12,445,13],[446,2,446,3],[446,7,446,8],[446,12,446,13],[451,2,451,3],[451,7,451,9],[451,12,451,14],[452,2,452,3],[452,7,452,8],[452,12,452,13],[449,2,449,3],[449,7,449,8],[449,12,449,13],[450,2,450,3],[450,7,450,8],[450,12,450,13],[455,2,455,3],[455,7,455,8],[455,12,455,13],[456,2,456,3],[456,7,456,8],[456,12,456,13],[453,2,453,4],[453,7,453,8],[453,12,453,13],[454,2,454,3],[454,7,454,8],[454,12,454,13],[459,2,459,3],[459,7,459,8],[459,12,459,13],[460,2,460,3],[460,7,460,8],[460,12,460,13],[457,2,457,3],[457,7,457,8],[457,12,457,13],[458,2,458,3],[458,7,458,8],[458,12,458,13],[463,2,463,3],[463,7,463,8],[463,12,463,13],[464,2,464,3],[464,7,464,8],[464,12,464,13],[461,2,461,3],[461,7,461,8],[461,12,461,13],[462,2,462,3],[462,7,462,8],[462,12,462,13],[467,2,467,3],[467,7,467,8],[467,12,467,13],[468,2,468,3],[468,7,468,8],[468,12,468,13],[465,2,465,3],[465,7,465,8],[465,12,465,13],[466,2,466,3],[466,7,466,8],[466,12,466,13],[471,2,471,3],[471,7,471,8],[471,12,471,13],[472,2,472,3],[472,7,472,8],[472,12,472,13],[469,2,469,3],[469,7,469,8],[469,12,469,13],[470,2,470,3],[470,7,470,8],[470,12,470,13],[475,2,475,3],[475,7,475,8],[475,12,475,13],[476,2,476,3],[476,7,476,8],[476,12,476,13],[473,2,473,3],[473,7,473,8],[473,12,473,13],[474,2,474,3],[474,7,474,8],[474,12,474,13],[479,2,479,3],[479,7,479,8],[479,12,479,13],[480,2,480,3],[480,7,480,8],[480,12,480,13],[477,2,477,3],[477,7,477,8],[477,12,477,13],[478,2,478,3],[478,7,478,8],[478,12,478,13],[483,2,483,3],[483,7,483,8],[483,12,483,13],[484,2,484,3],[484,7,484,8],[484,12,484,13],[481,2,481,3],[481,7,481,8],[481,12,481,13],[482,2,482,3],[482,7,482,8],[482,12,482,13],[487,2,487,3],[487,7,487,8],[487,12,487,13],[488,2,488,3],[488,7,488,8],[488,12,488,13],[485,2,485,3],[485,7,485,8],[485,12,485,13],[486,2,486,3],[486,7,486,8],[486,12,486,13],[491,2,491,3],[491,7,491,8],[491,12,491,13],[492,2,492,3],[492,7,492,8],[492,12,492,13],[489,2,489,3],[489,7,489,8],[489,12,489,13],[490,2,490,3],[490,7,490,8],[490,12,490,13],[495,2,495,3],[495,7,495,8],[495,12,495,13],[496,2,496,3],[496,7,496,8],[496,12,496,13],[493,2,493,3],[493,7,493,8],[493,12,493,13],[494,2,494,3],[494,7,494,8],[494,12,494,13],[499,2,499,3],[499,7,499,8],[499,12,499,13],[500,2,500,3],[500,7,500,8],[500,12,500,13],[497,2,497,3],[497,7,497,8],[497,12,497,13],[498,2,498,3],[498,7,498,8],[498,12,498,13],[504,2,504,3],[504,7,504,8],[504,12,504,13],[505,2,505,6],[505,7,505,8],[505,12,505,13],[501,2,501,3],[501,7,501,11],[501,12,501,16],[502,2,502,3],[502,7,503,8],[502,9,502,11],[502,12,503,13],[502,14,502,16],[503,2,503,3],[508,2,508,3],[508,7,509,8],[508,12,509,13],[509,2,509,3],[510,2,510,3],[510,7,510,8],[510,12,510,13],[506,2,507,3],[506,4,506,6],[506,7,506,8],[506,12,506,13],[507,7,507,9],[507,12,507,14],[514,2,514,3],[514,7,514,8],[514,12,514,13],[515,2,515,3],[515,7,515,8],[515,12,515,13],[511,2,511,4],[511,7,511,8],[511,12,511,13],[512,2,513,3],[512,7,512,8],[512,12,512,13],[513,7,513,8],[513,12,513,13],[518,2,518,3],[518,7,518,8],[518,12,518,13],[519,2,519,3],[519,7,519,8],[519,12,519,13],[516,2,516,3],[516,7,516,8],[516,12,516,13],[517,2,517,3],[517,7,517,8],[517,12,517,13],[522,2,522,3],[522,7,522,8],[522,12,522,13],[523,2,523,3],[523,7,523,8],[523,12,523,13],[520,2,520,3],[520,7,520,8],[520,12,520,13],[521,2,521,3],[521,7,521,8],[521,12,521,13],[526,2,526,3],[526,7,526,8],[526,12,526,13],[527,2,527,3],[527,7,527,8],[527,12,527,13],[524,2,524,3],[524,7,524,8],[524,12,524,13],[525,2,525,3],[525,7,525,8],[525,12,525,13],[530,2,530,3],[530,7,530,8],[530,12,530,13],[531,2,531,3],[531,7,531,8],[531,12,531,13],[528,2,528,3],[528,7,528,8],[528,12,528,13],[529,2,529,3],[529,7,529,8],[529,12,529,13],[534,2,534,3],[534,7,534,8],[534,12,534,13],[535,2,535,3],[535,7,535,8],[535,12,535,13],[532,2,532,3],[532,7,532,8],[532,12,532,13],[533,2,533,3],[533,7,533,8],[533,12,533,13],[538,2,538,3],[538,7,538,8],[538,12,538,13],[539,2,539,3],[539,7,539,8],[539,12,539,13],[536,2,536,3],[536,7,536,8],[536,12,536,13],[537,2,537,3],[537,7,537,8],[537,12,537,13],[542,2,542,3],[542,7,542,8],[542,12,542,13],[543,2,543,3],[543,7,543,8],[543,12,543,13],[540,2,540,3],[540,7,540,8],[540,12,540,13],[541,2,541,3],[541,7,541,8],[541,12,541,13],[546,2,546,3],[546,7,546,8],[546,12,546,13],[547,2,547,3],[547,7,547,8],[547,12,547,13],[544,2,544,3],[544,7,544,8],[544,12,544,13],[545,2,545,3],[545,7,545,8],[545,12,545,13],[550,2,550,3],[550,7,550,8],[550,12,550,13],[551,2,551,3],[551,7,551,8],[551,12,551,13],[548,2,548,3],[548,7,548,8],[548,12,548,13],[549,2,549,3],[549,7,549,8],[549,12,549,13],[554,2,554,3],[554,7,554,8],[554,12,554,13],[555,2,555,3],[555,7,555,8],[555,12,555,13],[552,2,552,3],[552,7,552,8],[552,12,552,13],[553,2,553,3],[553,7,553,8],[553,12,553,13],[558,2,558,3],[558,7,558,9],[558,12,558,14],[559,2,559,3],[559,7,559,8],[559,12,559,13],[556,2,556,3],[556,7,556,8],[556,12,556,13],[557,2,557,3],[557,7,557,8],[557,12,557,13],[562,2,562,3],[562,7,562,8],[562,12,562,13],[563,2,563,3],[563,7,563,8],[563,12,563,13],[560,2,560,3],[560,7,560,8],[560,12,560,13],[561,2,561,3],[561,7,561,8],[561,12,561,13],[566,2,566,3],[566,7,566,8],[566,12,566,13],[567,2,567,3],[567,7,567,8],[567,12,567,13],[564,2,564,4],[564,7,564,8],[564,12,564,13],[565,2,565,3],[565,7,565,8],[565,12,565,13],[570,2,570,3],[570,7,570,8],[570,12,570,13],[571,2,571,3],[571,7,571,8],[571,12,571,13],[568,2,568,3],[568,7,568,8],[568,12,568,13],[569,2,569,3],[569,7,569,8],[569,12,569,13],[574,2,574,3],[574,7,574,8],[574,12,574,13],[575,2,575,3],[575,7,575,8],[575,12,575,13],[572,2,572,3],[572,7,572,8],[572,12,572,13],[573,2,573,3],[573,7,573,8],[573,12,573,13],[578,2,578,3],[578,7,578,8],[578,12,578,13],[579,2,579,3],[579,7,579,8],[579,12,579,13],[576,2,576,3],[576,7,576,8],[576,12,576,13],[577,2,577,3],[577,7,577,8],[577,12,577,13],[582,2,582,3],[582,7,582,8],[582,12,582,13],[583,2,583,3],[583,7,583,8],[583,12,583,13],[580,2,580,3],[580,7,580,8],[580,12,580,13],[581,2,581,3],[581,7,581,8],[581,12,581,13],[586,2,586,3],[586,7,586,8],[586,12,586,13],[587,2,587,3],[587,7,587,8],[587,12,587,13],[584,2,584,3],[584,7,584,8],[584,12,584,13],[585,2,585,3],[585,7,585,8],[585,12,585,13],[590,2,590,3],[590,7,590,8],[590,12,590,13],[591,2,591,3],[591,7,591,8],[591,12,591,13],[588,2,588,3],[588,7,588,8],[588,12,588,13],[589,2,589,3],[589,7,589,8],[589,12,589,13],[594,2,594,3],[594,7,594,8],[594,12,594,13],[595,2,595,3],[595,7,595,8],[595,12,595,13],[592,2,592,3],[592,7,592,8],[592,12,592,13],[593,2,593,3],[593,7,593,8],[593,12,593,13],[598,2,598,3],[598,7,598,8],[598,12,598,13],[599,2,599,3],[599,7,599,8],[599,12,599,13],[596,2,596,3],[596,7,596,8],[596,12,596,13],[597,2,597,3],[597,7,597,8],[597,12,597,13],[602,2,602,3],[602,7,602,8],[602,12,602,13],[603,2,603,3],[603,7,603,8],[603,12,603,13],[600,2,600,3],[600,7,600,8],[600,12,600,13],[601,2,601,3],[601,7,601,8],[601,12,601,13],[606,2,606,3],[606,7,606,8],[606,12,606,13],[607,2,607,3],[607,7,607,8],[607,12,607,13],[604,2,604,3],[604,7,604,8],[604,12,604,13],[605,2,605,3],[605,7,605,8],[605,12,605,13],[610,2,610,3],[610,7,610,8],[610,12,610,13],[611,2,611,3],[611,7,611,8],[611,12,611,13],[608,2,608,3],[608,7,608,8],[608,12,608,13],[609,2,609,3],[609,7,609,8],[609,12,609,13],[614,2,614,3],[614,7,614,8],[614,12,614,13],[615,2,615,3],[615,7,615,8],[615,12,615,13],[612,2,612,3],[612,7,612,8],[612,12,612,13],[613,2,613,3],[613,7,613,8],[613,12,613,13],[618,2,618,3],[618,7,618,8],[618,12,618,13],[619,2,619,3],[619,7,619,8],[619,12,619,13],[616,2,616,3],[616,7,616,8],[616,12,616,13],[617,2,617,3],[617,7,617,8],[617,12,617,13],[622,2,622,3],[622,7,622,8],[622,12,622,13],[623,2,623,3],[623,7,623,8],[623,12,623,13],[620,2,620,3],[620,7,620,8],[620,12,620,13],[621,2,621,3],[621,7,621,8],[621,12,621,13],[626,2,626,3],[626,7,626,8],[626,12,626,13],[627,2,627,3],[627,7,627,8],[627,12,627,13],[624,2,624,3],[624,7,624,8],[624,12,624,13],[625,2,625,3],[625,7,625,8],[625,12,625,13],[630,2,630,3],[630,7,630,8],[630,12,630,13],[631,2,631,3],[631,7,631,8],[631,12,631,13],[628,2,628,3],[628,7,628,8],[628,12,628,13],[629,2,629,3],[629,7,629,8],[629,12,629,13],[634,2,634,3],[634,7,634,8],[634,12,634,13],[635,2,635,3],[635,7,635,8],[635,12,635,13],[632,2,632,3],[632,7,632,8],[632,12,632,13],[633,2,633,3],[633,7,633,8],[633,12,633,13],[638,2,638,3],[638,7,638,8],[638,12,638,13],[639,2,639,3],[639,7,639,8],[639,12,639,13],[636,2,636,3],[636,7,636,8],[636,12,636,13],[637,2,637,3],[637,7,637,8],[637,12,637,13],[642,2,642,3],[642,7,642,8],[642,12,642,13],[643,2,643,3],[643,7,643,8],[643,12,643,13],[640,2,640,3],[640,7,640,8],[640,12,640,13],[641,2,641,3],[641,7,641,8],[641,12,641,13],[646,2,646,3],[646,7,646,8],[646,12,646,13],[647,2,647,3],[647,7,647,8],[647,12,647,13],[644,2,644,3],[644,7,644,8],[644,12,644,13],[645,2,645,3],[645,7,645,8],[645,12,645,13],[650,2,650,3],[650,7,650,8],[650,12,650,13],[651,2,651,3],[651,7,651,8],[651,12,651,13],[648,2,648,3],[648,7,648,8],[648,12,648,13],[649,2,649,3],[649,7,649,8],[649,12,649,13],[654,2,654,3],[654,7,654,8],[654,12,654,13],[655,2,655,3],[655,7,655,8],[655,12,655,13],[652,2,652,3],[652,7,652,8],[652,12,652,13],[653,2,653,3],[653,7,653,8],[653,12,653,13],[658,2,658,3],[658,7,658,8],[658,12,658,13],[659,2,659,3],[659,7,659,8],[659,12,659,13],[656,2,656,3],[656,7,656,8],[656,12,656,13],[657,2,657,3],[657,7,657,8],[657,12,657,13],[662,2,662,3],[662,7,662,8],[662,12,662,13],[663,2,663,3],[663,7,663,8],[663,12,663,13],[660,2,660,3],[660,7,660,8],[660,12,660,13],[661,2,661,3],[661,7,661,8],[661,12,661,13],[666,2,666,3],[666,7,666,8],[666,12,666,13],[667,2,667,3],[667,7,667,8],[667,12,667,13],[664,2,664,3],[664,7,664,8],[664,12,664,13],[665,2,665,3],[665,7,665,8],[665,12,665,13],[670,2,670,3],[670,7,670,8],[670,12,670,13],[671,2,671,3],[671,7,671,8],[671,12,671,13],[668,2,668,3],[668,7,668,8],[668,12,668,13],[669,2,669,3],[669,7,669,8],[669,12,669,13],[674,2,674,3],[674,7,674,8],[674,12,674,13],[675,2,675,3],[675,7,675,8],[675,12,675,13],[672,2,672,3],[672,7,672,8],[672,12,672,13],[673,2,673,3],[673,7,673,8],[673,12,673,13],[678,2,678,3],[678,7,678,8],[678,12,678,13],[679,2,679,3],[679,7,679,8],[679,12,679,13],[676,2,676,3],[676,7,676,8],[676,12,676,13],[677,2,677,3],[677,7,677,8],[677,12,677,13],[682,2,682,3],[682,7,682,8],[682,12,682,13],[683,2,683,3],[683,7,683,8],[683,12,683,13],[680,2,680,3],[680,7,680,8],[680,12,680,13],[681,2,681,3],[681,7,681,8],[681,12,681,13],[686,2,686,3],[686,7,686,8],[686,12,686,13],[687,2,687,3],[687,7,687,8],[687,12,687,13],[684,2,684,3],[684,7,684,8],[684,12,684,13],[685,2,685,3],[685,7,685,8],[685,12,685,13],[690,2,690,3],[690,7,690,8],[690,12,690,13],[691,2,691,3],[691,7,691,8],[691,12,691,13],[688,2,688,3],[688,7,688,8],[688,12,688,13],[689,2,689,3],[689,7,689,8],[689,12,689,13],[694,2,694,3],[694,7,694,8],[694,12,694,13],[695,2,695,3],[695,7,695,8],[695,12,695,13],[692,2,692,3]],"merged_total":1014,"flags":["merged_cut"]}
[]
[{"$f":"A1026","v":"Guatemala"}]
[{"$f":"A1034","v":"2003"}]
["Use of drinking water sources"]
[" by wealth quintile and sub-national region"]
["Notes:"]
["WHO/UNICEF JMP customised wealth index excludes water,"]
[" sanitation and hygiene assets."]
["Survey used for analysis:",{"$f":"A1025","v":"WHS03"}]
["Time to source based on:","ENCOVI11"]
[{"$f":"B1027","v":""}]
[]
[]
["Use of drinking water sources",null,"NATIONAL wealth index quintile",null,null,null,null,"URBAN wealth index quintile",null,null,null,null,"RURAL wealth index quintile",null,null,null,null,null,null,null,null,null,null,null,null,null,null,null,null,null,null,null,null,null,null,null,null,null,null,null,null,null,null,null,null,null,null,null,null,null,null,null,"Raw numbers of respondents:","Use of drinking water sources","NATIONAL wealth index quintile",null,null,null,null,"URBAN wealth index quintile",null,null,null,null,"RURAL wealth index quintile"]
["Weighted percentage (used in graphs)",null,"Poorest","Poor","Middle","Rich","Richest","Poorest","Poor","Middle","Rich","Richest","Poorest","Poor","Middle","Rich","Richest",null,null,null,null,null,null,null,null,null,null,null,null,null,null,null,null,null,null,null,null,null,null,null,null,null,null,null,null,null,null,null,null,null,null,null,"Water data, raw numbers (weighted)",null,"Poorest","Poor","Middle","Rich","Richest","Poorest","Poor","Middle","Rich","Richest","Poorest","Poor","Middle","Rich","Richest"]
["Water","Improved",85.333333333333343,88.820512820512818,85.010266940451757,95.807770961145195,98.456790123456798,98.004987531172077,98.263027295285355,98.014888337468989,98.22784810126582,99.264705882352942,81.949458483754512,85.662431941923785,88.267148014440437,92.558983666061707,93.501805054151617,null,null,null,null,null,null,null,null,null,null,null,null,null,null,null,null,null,null,null,null,null,null,null,null,null,null,null,null,null,null,null,null,null,null,null,"Water","Improved","N/A","N/A","N/A","N/A","N/A","N/A","N/A","N/A","N/A","N/A","N/A","N/A","N/A","N/A","N/A"]
[null,"Not Improved",14.666666666666666,11.179487179487179,14.989733059548255,4.1922290388548058,1.5432098765432098,1.99501246882793,1.7369727047146404,1.9851116625310175,1.7721518987341773,0.73529411764705876,18.050541516245488,14.337568058076226,11.732851985559567,7.4410163339382942,6.4981949458483745,null,null,null,null,null,null,null,null,null,null,null,null,null,null,null,null,null,null,null,null,null,null,null,null,null,null,null,null,null,null,null,null,null,null,null,null,"Not Improved","N/A","N/A","N/A","N/A","N/A","N/A","N/A","N/A","N/A","N/A","N/A","N/A","N/A","N/A","N/A"]
["Water ladder","Basic",{"$f":"C16*ENCOVI11!C23/100","v":81.92},{"$f":"D16*ENCOVI11!D23/100","v":87.310564102564101},{"$f":"E16*ENCOVI11!E23/100","v":83.990143737166321},{"$f":"F16*ENCOVI11!F23/100","v":95.616155419222906},{"$f":"G16*ENCOVI11!G23/100","v":98.358333333333334},{"$f":"H16*ENCOVI11!H23/100","v":97.710972568578569},{"$f":"I16*ENCOVI11!I23/100","v":97.575186104218361},{"$f":"J16*ENCOVI11!J23/100","v":98.014888337468989},{"$f":"K16*ENCOVI11!K23/100","v":98.22784810126582},{"$f":"L16*ENCOVI11!L23/100","v":99.264705882352942},{"$f":"M16*ENCOVI11!M23/100","v":77.851985559566785},{"$f":"N16*ENCOVI11!N23/100","v":83.178221415607993},{"$f":"O16*ENCOVI11!O23/100","v":86.59007220216607},{"$f":"P16*ENCOVI11!P23/100","v":91.448275862068968},{"$f":"Q16*ENCOVI11!Q23/100","v":93.03429602888086},null,null,null,null,null,null,null,null,null,null,null,null,null,null,null,null,null,null,null,null,null,null,null,null,null,null,null,null,null,null,null,null,null,null,null,"Water ladder","Basic","N/A","N/A","N/A","N/A","N/A","N/A","N/A","N/A","N/A","N/A","N/A","N/A","N/A","N/A","N/A"]
[null,"Limited",{"$f":"C16*ENCOVI11!C22/100","v":3.4133333333333336},{"$f":"D16*ENCOVI11!D22/100","v":1.5099487179487179},{"$f":"E16*ENCOVI11!E22/100","v":1.0201232032854211},{"$f":"F16*ENCOVI11!F22/100","v":0.19161554192229041},{"$f":"G16*ENCOVI11!G22/100","v":9.8456790123456803E-2},{"$f":"H16*ENCOVI11!H22/100","v":0.29401496259351623},{"$f":"I16*ENCOVI11!I22/100","v":0.68784119106699748},{"$f":"J16*ENCOVI11!J22/100","v":0},{"$f":"K16*ENCOVI11!K22/100","v":0},{"$f":"L16*ENCOVI11!L22/100","v":0},{"$f":"M16*ENCOVI11!M22/100","v":4.0974729241877252},{"$f":"N16*ENCOVI11!N22/100","v":2.4842105263157896},{"$f":"O16*ENCOVI11!O22/100","v":1.6770758122743683},{"$f":"P16*ENCOVI11!P22/100","v":1.1107078039927405},{"$f":"Q16*ENCOVI11!Q22/100","v":0.46750902527075811},null,null,null,null,null,null,null,null,null,null,null,null,null,null,null,null,null,null,null,null,null,null,null,null,null,null,null,null,null,null,null,null,null,null,null,null,"Limited","N/A","N/A","N/A","N/A","N/A","N/A","N/A","N/A","N/A","N/A","N/A","N/A","N/A","N/A","N/A"]
[null,"Unimproved",{"$f":"100-(C18+C19+C21)","v":2.9382716049382793},{"$f":"100-(D18+D19+D21)","v":5.6009747827929743},13.263611080261725,3.4668404378185329,1.5432098765432158,1.2431327695797876,1.4857164233076077,1.9851116625310112,1.7721518987341796,0.73529411764705799,3.7129734581692588,3.9927404718693253,6.4505204737198483,5.4263643192862787,4.6800131276665695,null,null,null,null,null,null,null,null,null,null,null,null,null,null,null,null,null,null,null,null,null,null,null,null,null,null,null,null,null,null,null,null,null,null,null,null,"Unimproved","N/A","N/A","N/A","N/A","N/A","N/A","N/A","N/A","N/A","N/A","N/A","N/A","N/A","N/A","N/A"]
[null,"Surface water",{"$f":"C64","v":11.728395061728394},5.5785123966942152,1.7261219792865361,0.72538860103626945,0,0.75187969924812026,0.25125628140703515,0,0,0,14.337568058076226,10.344827586206897,5.2823315118397085,2.0146520146520146,1.8181818181818181,null,null,null,null,null,null,null,null,null,null,null,null,null,null,null,null,null,null,null,null,null,null,null,null,null,null,null,null,null,null,null,null,null,null,null,null,"Surface water","N/A","N/A","N/A","N/A","N/A","N/A","N/A","N/A","N/A","N/A","N/A","N/A","N/A","N/A","N/A"]
["Improved water point at more than 30 minutes","Yes","N/A","N/A","N/A","N/A","N/A","N/A","N/A","N/A","N/A","N/A","N/A","N/A","N/A","N/A","N/A",null,null,null,null,null,null,null,null,null,null,null,null,null,null,null,null,null,null,null,null,null,null,null,null,null,null,null,null,null,null,null,null,null,null,null,"Improved water point at more than 30 minutes","Yes","N/A","N/A","N/A","N/A","N/A","N/A","N/A","N/A","N/A","N/A","N/A","N/A","N/A","N/A","N/A"]
[null,"No","N/A","N/A","N/A","N/A","N/A","N/A","N/A","N/A","N/A","N/A","N/A","N/A","N/A","N/A","N/A",null,null,null,null,null,null,null,null,null,null,null,null,null,null,null,null,null,null,null,null,null,null,null,null,null,null,null,null,null,null,null,null,null,null,null,null,"No","N/A","N/A","N/A","N/A","N/A","N/A","N/A","N/A","N/A","N/A","N/A","N/A","N/A","N/A","N/A"]
["Manually calculated ratios","Improved wells"]
[null,"Improved springs"]
[null,"Other"]
[null,null,"NATIONAL wealth index quintile",null,null,null,null,"URBAN wealth index quintile",null,null,null,null,"RURAL wealth index quintile",null,null,null,null,null,null,null,null,null,null,null,null,null,null,null,null,null,null,null,null,null,null,null,null,null,null,null,null,null,null,null,null,null,null,null,null,null,null,null,"Raw numbers of respondents:","Use of drinking water sources","NATIONAL wealth index quintile",null,null,null,null,"URBAN wealth index quintile",null,null,null,null,"RURAL wealth index quintile"]
["Percentage based on weighted population",null,"Poorest","Poor","Middle","Rich","Richest","Poorest","Poor","Middle","Rich","Richest","Poorest","Poor","Middle","Rich","Richest",null,null,null,null,null,null,null,null,null,null,null,null,null,null,null,null,null,null,null,null,null,null,null,null,null,null,null,null,null,null,null,null,null,null,null,"Water data, raw numbers (weighted)",null,"Poorest","Poor","Middle","Rich","Richest","Poorest","Poor","Middle","Rich","Richest","Poorest","Poor","Middle","Rich","Richest"]
["Piped water","Yes",73.743589743589737,72.717948717948715,66.016427104722794,81.799591002044991,94.753086419753089,89.775561097256855,94.789081885856078,96.277915632754343,96.455696202531655,98.774509803921575,68.953068592057761,74.410163339382933,68.592057761732846,64.791288566243196,62.996389891696744,null,null,null,null,null,null,null,null,null,null,null,null,null,null,null,null,null,null,null,null,null,null,null,null,null,null,null,null,null,null,null,null,null,null,null,"Piped water","Yes","N/A","N/A","N/A","N/A","N/A","N/A","N/A","N/A","N/A","N/A","N/A","N/A","N/A","N/A","N/A"]
[null,"No",26.256410256410255,27.282051282051285,33.983572895277206,18.200408997955012,5.2469135802469129,10.224438902743142,5.2109181141439205,3.7220843672456572,3.5443037974683547,1.2254901960784315,31.046931407942242,25.58983666061706,31.40794223826715,35.208711433756804,37.003610108303249,null,null,null,null,null,null,null,null,null,null,null,null,null,null,null,null,null,null,null,null,null,null,null,null,null,null,null,null,null,null,null,null,null,null,null,null,"No","N/A","N/A","N/A","N/A","N/A","N/A","N/A","N/A","N/A","N/A","N/A","N/A","N/A","N/A","N/A"]
["Piped water on premises","Yes",67.282051282051285,69.128205128205138,63.552361396303901,80.572597137014313,94.135802469135797,81.795511221945134,91.811414392059561,95.285359801488838,95.949367088607602,98.284313725490193,63.718411552346566,69.147005444646098,65.70397111913357,62.976406533575314,62.274368231046928,null,null,null,null,null,null,null,null,null,null,null,null,null,null,null,null,null,null,null,null,null,null,null,null,null,null,null,null,null,null,null,null,null,null,null,"Piped water on premises","Yes","N/A","N/A","N/A","N/A","N/A","N/A","N/A","N/A","N/A","N/A","N/A","N/A","N/A","N/A","N/A"]
[null,"No",32.717948717948723,30.871794871794872,36.447638603696099,19.427402862985684,5.8641975308641969,18.204488778054863,8.1885856079404462,4.7146401985111659,4.0506329113924053,1.715686274509804,36.281588447653426,30.852994555353902,34.296028880866423,37.023593466424678,37.725631768953065,null,null,null,null,null,null,null,null,null,null,null,null,null,null,null,null,null,null,null,null,null,null,null,null,null,null,null,null,null,null,null,null,null,null,null,null,"No","N/A","N/A","N/A","N/A","N/A","N/A","N/A","N/A","N/A","N/A","N/A","N/A","N/A","N/A","N/A"]
["Piped water into dwelling","Yes","N/A","N/A","N/A","N/A","N/A","N/A","N/A","N/A","N/A","N/A","N/A","N/A","N/A","N/A","N/A",null,null,null,null,null,null,null,null,null,null,null,null,null,null,null,null,null,null,null,null,null,null,null,null,null,null,null,null,null,null,null,null,null,null,null,"Piped water into dwelling","Yes","N/A","N/A","N/A","N/A","N/A","N/A","N/A","N/A","N/A","N/A","N/A","N/A","N/A","N/A","N/A"]
[null,"No","N/A","N/A","N/A","N/A","N/A","N/A","N/A","N/A","N/A","N/A","N/A","N/A","N/A","N/A","N/A",null,null,null,null,null,null,null,null,null,null,null,null,null,null,null,null,null,null,null,null,null,null,null,null,null,null,null,null,null,null,null,null,null,null,null,null,"No","N/A","N/A","N/A","N/A","N/A","N/A","N/A","N/A","N/A","N/A","N/A","N/A","N/A","N/A","N/A"]
["Water source on premises","Yes","N/A","N/A","N/A","N/A","N/A","N/A","N/A","N/A","N/A","N/A","N/A","N/A","N/A","N/A","N/A",null,null,null,null,null,null,null,null,null,null,null,null,null,null,null,null,null,null,null,null,null,null,null,null,null,null,null,null,null,null,null,null,null,null,null,"Water source on premises","Yes","N/A","N/A","N/A","N/A","N/A","N/A","N/A","N/A","N/A","N/A","N/A","N/A","N/A","N/A","N/A"]
[null,"No","N/A","N/A","N/A","N/A","N/A","N/A","N/A","N/A","N/A","N/A","N/A","N/A","N/A","N/A","N/A",null,null,null,null,null,null,null,null,null,null,null,null,null,null,null,null,null,null,null,null,null,null,null,null,null,null,null,null,null,null,null,null,null,null,null,null,"No","N/A","N/A","N/A","N/A","N/A","N/A","N/A","N/A","N/A","N/A","N/A","N/A","N/A","N/A","N/A"]
["Improved Water source on premises","Yes","N/A","N/A","N/A","N/A","N/A","N/A","N/A","N/A","N/A","N/A","N/A","N/A","N/A","N/A","N/A",null,null,null,null,null,null,null,null,null,null,null,null,null,null,null,null,null,null,null,null,null,null,null,null,null,null,null,null,null,null,null,null,null,null,null,"Improved water source on premises","Yes","N/A","N/A","N/A","N/A","N/A","N/A","N/A","N/A","N/A","N/A","N/A","N/A","N/A","N/A","N/A"]
[null,"No","N/A","N/A","N/A","N/A","N/A","N/A","N/A","N/A","N/A","N/A","N/A","N/A","N/A","N/A","N/A",null,null,null,null,null,null,null,null,null,null,null,null,null,null,null,null,null,null,null,null,null,null,null,null,null,null,null,null,null,null,null,null,null,null,null,null,"No","N/A","N/A","N/A","N/A","N/A","N/A","N/A","N/A","N/A","N/A","N/A","N/A","N/A","N/A","N/A"]
["Piped water on premises available when needed","Yes","N/A","N/A","N/A","N/A","N/A","N/A","N/A","N/A","N/A","N/A","N/A","N/A","N/A","N/A","N/A",null,null,null,null,null,null,null,null,null,null,null,null,null,null,null,null,null,null,null,null,null,null,null,null,null,null,null,null,null,null,null,null,null,null,null,"Piped water on premises available when needed","Yes","N/A","N/A","N/A","N/A","N/A","N/A","N/A","N/A","N/A","N/A","N/A","N/A","N/A","N/A","N/A"]
[null,"No","N/A","N/A","N/A","N/A","N/A","N/A","N/A","N/A","N/A","N/A","N/A","N/A","N/A","N/A","N/A",null,null,null,null,null,null,null,null,null,null,null,null,null,null,null,null,null,null,null,null,null,null,null,null,null,null,null,null,null,null,null,null,null,null,null,null,"No","N/A","N/A","N/A","N/A","N/A","N/A","N/A","N/A","N/A","N/A","N/A","N/A","N/A","N/A","N/A"]
["Water point at more than 30 minutes","Yes",8.1168831168831161,4.3321299638989164,5.0847457627118651,5.8823529411764701,2.5641025641025639,5.9701492537313428,16.666666666666664,0,12.5,0,6.666666666666667,9.316770186335404,3.4285714285714288,4.7872340425531918,4.0201005025125625,null,null,null,null,null,null,null,null,null,null,null,null,null,null,null,null,null,null,null,null,null,null,null,null,null,null,null,null,null,null,null,null,null,null,null,"Water point at more than 30 minutes","Yes","N/A","N/A","N/A","N/A","N/A","N/A","N/A","N/A","N/A","N/A","N/A","N/A","N/A","N/A","N/A"]
[null,"No",91.883116883116884,92.883116883116898,93.883116883116898,94.883116883116898,95.883116883116898,96.883116883116898,97.883116883116898,98.883116883116898,99.883116883116898,100.883116883117,101.883116883117,102.883116883117,103.883116883117,104.883116883117,105.883116883117,null,null,null,null,null,null,null,null,null,null,null,null,null,null,null,null,null,null,null,null,null,null,null,null,null,null,null,null,null,null,null,null,null,null,null,null,"No","N/A","N/A","N/A","N/A","N/A","N/A","N/A","N/A","N/A","N/A","N/A","N/A","N/A","N/A","N/A"]
["Water source available when needed","Yes","N/A","N/A","N/A","N/A","N/A","N/A","N/A","N/A","N/A","N/A","N/A","N/A","N/A","N/A","N/A",null,null,null,null,null,null,null,null,null,null,null,null,null,null,null,null,null,null,null,null,null,null,null,null,null,null,null,null,null,null,null,null,null,null,null,"Water source available when needed","Yes","N/A","N/A","N/A","N/A","N/A","N/A","N/A","N/A","N/A","N/A","N/A","N/A","N/A","N/A","N/A"]
[null,"No","N/A","N/A","N/A","N/A","N/A","N/A","N/A","N/A","N/A","N/A","N/A","N/A","N/A","N/A","N/A",null,null,null,null,null,null,null,null,null,null,null,null,null,null,null,null,null,null,null,null,null,null,null,null,null,null,null,null,null,null,null,null,null,null,null,null,"No","N/A","N/A","N/A","N/A","N/A","N/A","N/A","N/A","N/A","N/A","N/A","N/A","N/A","N/A","N/A"]
["Improved water source available when needed","Yes","N/A","N/A","N/A","N/A","N/A","N/A","N/A","N/A","N/A","N/A","N/A","N/A","N/A","N/A","N/A",null,null,null,null,null,null,null,null,null,null,null,null,null,null,null,null,null,null,null,null,null,null,null,null,null,null,null,null,null,null,null,null,null,null,null,"Improved water source available when needed","Yes","N/A","N/A","N/A","N/A","N/A","N/A","N/A","N/A","N/A","N/A","N/A","N/A","N/A","N/A","N/A"]
[null,"No","N/A","N/A","N/A","N/A","N/A","N/A","N/A","N/A","N/A","N/A","N/A","N/A","N/A","N/A","N/A",null,null,null,null,null,null,null,null,null,null,null,null,null,null,null,null,null,null,null,null,null,null,null,null,null,null,null,null,null,null,null,null,null,null,null,null,"No","N/A","N/A","N/A","N/A","N/A","N/A","N/A","N/A","N/A","N/A","N/A","N/A","N/A","N/A","N/A"]
["Microbiological quality at point of collection","Not contaminated (No E. coli in 100 mL)","N/A","N/A","N/A","N/A","N/A","N/A","N/A","N/A","N/A","N/A","N/A","N/A","N/A","N/A","N/A",null,null,null,null,null,null,null,null,null,null,null,null,null,null,null,null,null,null,null,null,null,null,null,null,null,null,null,null,null,null,null,null,null,null,null,"Microbiological quality at point of collection","Not contaminated (No E. coli in 100 mL)","N/A","N/A","N/A","N/A","N/A","N/A","N/A","N/A","N/A","N/A","N/A","N/A","N/A","N/A","N/A"]
[null,"Contaminated (E. coli detected in 100 mL)","N/A","N/A","N/A","N/A","N/A","N/A","N/A","N/A","N/A","N/A","N/A","N/A","N/A","N/A","N/A",null,null,null,null,null,null,null,null,null,null,null,null,null,null,null,null,null,null,null,null,null,null,null,null,null,null,null,null,null,null,null,null,null,null,null,null,"Contaminated (E. coli detected in 100 mL)","N/A","N/A","N/A","N/A","N/A","N/A","N/A","N/A","N/A","N/A","N/A","N/A","N/A","N/A","N/A"]
[null,"Highly contaminated (>100 CFU/100 mL)","N/A","N/A","N/A","N/A","N/A","N/A","N/A","N/A","N/A","N/A","N/A","N/A","N/A","N/A","N/A",null,null,null,null,null,null,null,null,null,null,null,null,null,null,null,null,null,null,null,null,null,null,null,null,null,null,null,null,null,null,null,null,null,null,null,null,"Highly contaminated (>100 CFU/100 mL)","N/A","N/A","N/A","N/A","N/A","N/A","N/A","N/A","N/A","N/A","N/A","N/A","N/A","N/A","N/A"]
["Microbiological quality of improved water sources at point of collection","Not contaminated (No E. coli in 100 mL)","N/A","N/A","N/A","N/A","N/A","N/A","N/A","N/A","N/A","N/A","N/A","N/A","N/A","N/A","N/A",null,null,null,null,null,null,null,null,null,null,null,null,null,null,null,null,null,null,null,null,null,null,null,null,null,null,null,null,null,null,null,null,null,null,null,"Microbiological quality of improved water sources at point of collection","Not contaminated (No E. coli in 100 mL)","N/A","N/A","N/A","N/A","N/A","N/A","N/A","N/A","N/A","N/A","N/A","N/A","N/A","N/A","N/A"]
[null,"Contaminated (E. coli detected in 100 mL)","N/A","N/A","N/A","N/A","N/A","N/A","N/A","N/A","N/A","N/A","N/A","N/A","N/A","N/A","N/A",null,null,null,null,null,null,null,null,null,null,null,null,null,null,null,null,null,null,null,null,null,null,null,null,null,null,null,null,null,null,null,null,null,null,null,null,"Contaminated (E. coli detected in 100 mL)","N/A","N/A","N/A","N/A","N/A","N/A","N/A","N/A","N/A","N/A","N/A","N/A","N/A","N/A","N/A"]
[null,"Highly contaminated (>100 CFU/100 mL)","N/A","N/A","N/A","N/A","N/A","N/A","N/A","N/A","N/A","N/A","N/A","N/A","N/A","N/A","N/A",null,null,null,null,null,null,null,null,null,null,null,null,null,null,null,null,null,null,null,null,null,null,null,null,null,null,null,null,null,null,null,null,null,null,null,null,"Highly contaminated (>100 CFU/100 mL)","N/A","N/A","N/A","N/A","N/A","N/A","N/A","N/A","N/A","N/A","N/A","N/A","N/A","N/A","N/A"]
["Microbiological quality of piped on premises at point of collection","Not contaminated (No E. coli in 100 mL)","N/A","N/A","N/A","N/A","N/A","N/A","N/A","N/A","N/A","N/A","N/A","N/A","N/A","N/A","N/A",null,null,null,null,null,null,null,null,null,null,null,null,null,null,null,null,null,null,null,null,null,null,null,null,null,null,null,null,null,null,null,null,null,null,null,"Microbiological quality of piped on premises at point of collection","Not contaminated (No E. coli in 100 mL)","N/A","N/A","N/A","N/A","N/A","N/A","N/A","N/A","N/A","N/A","N/A","N/A","N/A","N/A","N/A"]
[null,"Contaminated (E. coli detected in 100 mL)","N/A","N/A","N/A","N/A","N/A","N/A","N/A","N/A","N/A","N/A","N/A","N/A","N/A","N/A","N/A",null,null,null,null,null,null,null,null,null,null,null,null,null,null,null,null,null,null,null,null,null,null,null,null,null,null,null,null,null,null,null,null,null,null,null,null,"Contaminated (E. coli detected in 100 mL)","N/A","N/A","N/A","N/A","N/A","N/A","N/A","N/A","N/A","N/A","N/A","N/A","N/A","N/A","N/A"]
[null,"Highly contaminated (>100 CFU/100 mL)","N/A","N/A","N/A","N/A","N/A","N/A","N/A","N/A","N/A","N/A","N/A","N/A","N/A","N/A","N/A",null,null,null,null,null,null,null,null,null,null,null,null,null,null,null,null,null,null,null,null,null,null,null,null,null,null,null,null,null,null,null,null,null,null,null,null,"Highly contaminated (>100 CFU/100 mL)","N/A","N/A","N/A","N/A","N/A","N/A","N/A","N/A","N/A","N/A","N/A","N/A","N/A","N/A","N/A"]
[null,null,"NATIONAL wealth index quintile",null,null,null,null,"URBAN wealth index quintile",null,null,null,null,"RURAL wealth index quintile",null,null,null,null,null,null,null,null,null,null,null,null,null,null,null,null,null,null,null,null,null,null,null,null,null,null,null,null,null,null,null,null,null,null,null,null,null,null,null,"Raw numbers of respondents:","Use of drinking water sources","NATIONAL wealth index quintile",null,null,null,null,"URBAN wealth index quintile",null,null,null,null,"RURAL wealth index quintile"]
["Percentage based on weighted population",null,"Poorest","Poor","Middle","Rich","Richest","Poorest","Poor","Middle","Rich","Richest","Poorest","Poor","Middle","Rich","Richest",null,null,null,null,null,null,null,null,null,null,null,null,null,null,null,null,null,null,null,null,null,null,null,null,null,null,null,null,null,null,null,null,null,null,null,"Water data, raw numbers (weighted)",null,"Poorest","Poor","Middle","Rich","Richest","Poorest","Poor","Middle","Rich","Richest","Poorest","Poor","Middle","Rich","Richest"]
["main source of drinking water","Piped water through house connection or yard",67.489711934156389,69.628099173553721,71.231300345224398,81.658031088082907,95.21331945889699,82.205513784461147,92.964824120603012,96.725440806045341,97.680412371134011,98.768472906403943,64.065335753176043,69.147005444646098,66.302367941712205,63.553113553113548,62.727272727272734]
[null,"Public standpipe",6.481481481481481,3.6157024793388426,2.7617951668584579,1.2435233160621761,0.62434963579604574,8.0200501253132828,3.0150753768844218,1.0075566750629723,0.51546391752577314,0.49261083743842365,5.2631578947368416,5.2631578947368416,2.9143897996357011,1.8315018315018317,0.72727272727272729]
[null,"Protected tube well or bore hole",6.2757201646090541,11.053719008264464,16.800920598388952,11.295336787564766,2.2892819979188346,6.5162907268170418,1.7587939698492463,1.0075566750629723,1.5463917525773196,0.24630541871921183,5.9891107078039925,6.7150635208711433,13.661202185792352,22.710622710622712,24]
[null,"Protected dug well or protected spring",4.423868312757202,4.5454545454545459,3.79746835443038,2.1761658031088085,1.3527575442247659,1.0025062656641603,0.75376884422110546,0,0.25773195876288657,0.24630541871921183,5.9891107078039925,3.9927404718693285,5.4644808743169397,4.5787545787545785,6.3636363636363633]
[null,"Unprotected dug well or spring",2.6748971193415638,4.9586776859504136,2.991944764096663,2.1761658031088085,0.41623309053069724,0.75187969924812026,0.25125628140703515,0.50377833753148615,0,0.24630541871921183,3.2667876588021776,3.9927404718693285,5.6466302367941719,4.5787545787545785,4]
[null,"Rainwater (into tank or cistern )",0.72016460905349799,0.30991735537190085,0.34522439585730724,0.10362694300518134,0,0.25062656641604009,0,0,0,0,1.0889292196007259,0.36297640653357532,0.36429872495446264,0.36630036630036628,0.18181818181818182]
[null,"Water taken directly from pond-water or stream",11.728395061728394,5.5785123966942152,1.7261219792865361,0.72538860103626945,0,0.75187969924812026,0.25125628140703515,0,0,0,14.337568058076226,10.344827586206897,5.2823315118397085,2.0146520146520146,1.8181818181818181]
[null,"Tanker-truck, vendor",0.20576131687242799,0.30991735537190085,0.34522439585730724,0.62176165803108807,0.10405827263267431,0.50125313283208017,1.0050251256281406,0.75566750629722923,0,0,0,0.18148820326678766,0.36429872495446264,0.36630036630036628,0.18181818181818182]
[]
[]
[]
[]
[]
[]
[]
[]
[]
[]
[]
[]
[]
[]
[]
[]
[]
[]
[]
[]
[]
[]
[]
[]
[]
[]
[]
[]
[]
[]
[]
[]
[]
[]
[]
[]
[]
[]
[]
[]
[]
[]
[{"$f":"A1026","v":"Guatemala"}]
[{"$f":"A1034","v":"2003"}]
["Use of sanitation facilities"]
[" by wealth quintile and sub-national region"]
["Notes:"]
["WHO/UNICEF JMP customised wealth index excludes water,"]
[" sanitation and hygiene assets."]
["Survey used for analysis:",{"$f":"A1025","v":"WHS03"}]
["Improved latrines based on:","50% Rule"]
[{"$f":"B1029","v":""}]
[]
[]
["Use of sanitation facilities",null,"NATIONAL wealth index quintile",null,null,null,null,"URBAN wealth index quintile",null,null,null,null,"RURAL wealth index quintile",null,null,null,null,null,null,null,null,null,null,null,null,null,null,null,null,null,null,null,null,null,null,null,null,null,null,null,null,null,null,null,null,null,null,null,null,null,null,null,"Raw numbers of respondents:","Use of sanitation facilities","NATIONAL wealth index quintile",null,null,null,null,"URBAN wealth index quintile",null,null,null,null,"RURAL wealth index quintile"]
["Weighted percentage (used in graphs)",null,"Poorest","Poor","Middle","Rich","Richest","Poorest","Poor","Middle","Rich","Richest","Poorest","Poor","Middle","Rich","Richest",null,null,null,null,null,null,null,null,null,null,null,null,null,null,null,null,null,null,null,null,null,null,null,null,null,null,null,null,null,null,null,null,null,null,null,"Sanitation data, raw numbers (weighted)",null,"Poorest","Poor","Middle","Rich","Richest","Poorest","Poor","Middle","Rich","Richest","Poorest","Poor","Middle","Rich","Richest"]
["Sanitation","Improved",{"$f":"C153+C154+C155+(C156+C157)*0.5","v":39.733059548254623},{"$f":"D153+D154+D155+(D156+D157)*0.5","v":49.535603715170282},67.031070195627166,88.107549120992772,98.229166666666657,71.072319201995015,92.085427135678387,98.375,99.348958333333329,99.754299754299765,35.714285714285715,41.470054446460978,45.894160583941598,56.959706959706963,76.860254083484591,null,null,null,null,null,null,null,null,null,null,null,null,null,null,null,null,null,null,null,null,null,null,null,null,null,null,null,null,null,null,null,null,null,null,null,"Sanitation","Improved",694,789,792,949,957,366,394,400,384,406,367,413,444,480,527]
[null,"Not Improved",{"$f":"100-C122","v":60.266940451745377},{"$f":"100-D122","v":50.464396284829718},32.968929804372834,11.892450879007228,1.7708333333333428,28.927680798004985,7.9145728643216131,1.625,0.6510416666666714,0.24570024570023463,64.285714285714278,58.529945553539022,54.105839416058402,43.040293040293037,23.139745916515409,null,null,null,null,null,null,null,null,null,null,null,null,null,null,null,null,null,null,null,null,null,null,null,null,null,null,null,null,null,null,null,null,null,null,null,null,"Not Improved",281,186,182,29,15,35,9,3,11,2,187,138,110,71,27]
["Sanitation ladder","Basic",{"$f":"C122*C129/100","v":37.189329743628846},{"$f":"D122*D129/100","v":45.817573413223315},60.937336541479247,79.500404091315957,94.498945147679308,64.022250005014271,81.46018554310011,89.636104060913709,95.220170454545439,96.997271369130672,34.087016101404593,38.905808009472985,42.435741150935819,51.577687404459056,70.981018230083706,null,null,null,null,null,null,null,null,null,null,null,null,null,null,null,null,null,null,null,null,null,null,null,null,null,null,null,null,null,null,null,null,null,null,null,"Sanitation ladder","Basic",644,715,710,849,906,326,342,359,365,386,348,380,402,433,483]
[null,"Limited",{"$f":"C122*C128/100","v":2.5437298046257761},{"$f":"D122*D128/100","v":3.7180303019469609},6.0937336541479246,8.6071450296768166,3.7302215189873418,7.0500691969807399,10.625241592578275,8.7388959390862961,4.128787878787878,2.7570283851690891,1.6272696128811237,2.5642464369879923,3.4584194330057825,5.3820195552479015,5.879235853400874,null,null,null,null,null,null,null,null,null,null,null,null,null,null,null,null,null,null,null,null,null,null,null,null,null,null,null,null,null,null,null,null,null,null,null,null,"Limited",42,62,67,90,34,33,44,35,14,11,14,27,36,43,38]
[null,"Unimproved",{"$f":"100-(C124+C125+C127)","v":37.577002053388085},{"$f":"100-(D124+D125+D127)","v":36.222910216718269},27.675489067894119,10.548086866597714,1.6666666666666856,24.18952618453865,7.4120603015075375,1.625,0.65104166666668561,0.24570024570023463,35.714285714285722,40.018148820326687,39.324817518248182,35.714285714285722,20.054446460980031,null,null,null,null,null,null,null,null,null,null,null,null,null,null,null,null,null,null,null,null,null,null,null,null,null,null,null,null,null,null,null,null,null,null,null,null,"Unimproved",60,48,136,16,14,16,7,3,11,2,29,36,29,31,10]
[null,"Open defecation",{"$f":"C159","v":22.689938398357292},{"$f":"D159","v":14.241486068111456},5.2934407364787113,1.344364012409514,0.10416666666666667,4.7381546134663344,0.50251256281407031,0,0,0,28.571428571428569,18.511796733212339,14.78102189781022,7.3260073260073266,3.0852994555353903,null,null,null,null,null,null,null,null,null,null,null,null,null,null,null,null,null,null,null,null,null,null,null,null,null,null,null,null,null,null,null,null,null,null,null,null,"Open defecation",221,138,46,13,1,19,2,0,0,0,158,102,81,40,17]
["Shared among Improved Sanitation","Yes",6.4020486555697822,7.5057736720554269,9.0909090909090917,9.7689075630252109,3.79746835443038,9.9195710455764079,11.538461538461538,8.8832487309644677,4.1558441558441555,2.7638190954773871,4.5563549160671464,6.1833688699360341,7.5356415478615073,9.4488188976377945,7.6492537313432836,null,null,null,null,null,null,null,null,null,null,null,null,null,null,null,null,null,null,null,null,null,null,null,null,null,null,null,null,null,null,null,null,null,null,null,"Shared among improved sanitation facilities","Yes","N/A","N/A","N/A","N/A","N/A","N/A","N/A","N/A","N/A","N/A","N/A","N/A","N/A","N/A","N/A"]
[null,"No",93.597951344430214,92.494226327944574,90.909090909090907,90.231092436974791,96.202531645569621,90.080428954423596,88.461538461538453,91.116751269035532,95.844155844155836,97.236180904522612,95.44364508393285,93.816631130063968,92.464358452138498,90.551181102362193,92.350746268656707,null,null,null,null,null,null,null,null,null,null,null,null,null,null,null,null,null,null,null,null,null,null,null,null,null,null,null,null,null,null,null,null,null,null,null,null,"No","N/A","N/A","N/A","N/A","N/A","N/A","N/A","N/A","N/A","N/A","N/A","N/A","N/A","N/A","N/A"]
["Manually calculated ratios","Improved latrines"]
[null,"Other"]
[null,"Other"]
[null,null,"NATIONAL wealth index quintile",null,null,null,null,"URBAN wealth index quintile",null,null,null,null,"RURAL wealth index quintile",null,null,null,null,null,null,null,null,null,null,null,null,null,null,null,null,null,null,null,null,null,null,null,null,null,null,null,null,null,null,null,null,null,null,null,null,null,null,null,"Raw numbers of respondents:","Use of sanitation facilities","NATIONAL wealth index quintile",null,null,null,null,"URBAN wealth index quintile",null,null,null,null,"RURAL wealth index quintile"]
["Percentage based on weighted population",null,"Poorest","Poor","Middle","Rich","Richest","Poorest","Poor","Middle","Rich","Richest","Poorest","Poor","Middle","Rich","Richest",null,null,null,null,null,null,null,null,null,null,null,null,null,null,null,null,null,null,null,null,null,null,null,null,null,null,null,null,null,null,null,null,null,null,null,"Sanitation data, raw numbers (weighted)",null,"Poorest","Poor","Middle","Rich","Richest","Poorest","Poor","Middle","Rich","Richest","Poorest","Poor","Middle","Rich","Richest"]
["Sanitation type","Sewer connection",2.666666666666667,9.4358974358974361,25.051334702258725,58.793456032719838,90.226337448559661,43.640897755610972,78.660049627791565,95.037220843672458,93.670886075949369,99.019607843137265,0.54151624548736454,0.90744101633393837,2.8880866425992782,5.9891107078039925,19.494584837545126,null,null,null,null,null,null,null,null,null,null,null,null,null,null,null,null,null,null,null,null,null,null,null,null,null,null,null,null,null,null,null,null,null,null,null,"Sanitation type","Sewer connection","N/A","N/A","N/A","N/A","N/A","N/A","N/A","N/A","N/A","N/A","N/A","N/A","N/A","N/A","N/A"]
[null,"Septic tank connection",0.61538461538461542,3.7948717948717952,8.6242299794661186,15.439672801635993,4.8353909465020575,2.2443890274314215,2.481389578163772,0.74441687344913154,1.2658227848101267,0.49019607843137253,0.18050541516245489,2.5408348457350272,3.790613718411552,13.06715063520871,33.935018050541515,null,null,null,null,null,null,null,null,null,null,null,null,null,null,null,null,null,null,null,null,null,null,null,null,null,null,null,null,null,null,null,null,null,null,null,null,"Septic tank connection","N/A","N/A","N/A","N/A","N/A","N/A","N/A","N/A","N/A","N/A","N/A","N/A","N/A","N/A","N/A"]
[null,"Improved latrines",67.897435897435898,67.692307692307693,47.638603696098563,22.801635991820042,3.3950617283950617,45.386533665835408,16.625310173697269,3.4739454094292808,2.278481012658228,0,65.523465703971112,71.506352087114337,73.46570397111914,68.058076225045369,41.696750902527072,null,null,null,null,null,null,null,null,null,null,null,null,null,null,null,null,null,null,null,null,null,null,null,null,null,null,null,null,null,null,null,null,null,null,null,null,"Improved latrines","N/A","N/A","N/A","N/A","N/A","N/A","N/A","N/A","N/A","N/A","N/A","N/A","N/A","N/A","N/A"]
[null,"Unimproved facilities",6.1538461538461542,4.9230769230769234,13.963039014373715,1.6359918200409,1.440329218106996,3.9900249376558601,1.7369727047146404,0.74441687344913154,2.7848101265822782,0.49019607843137253,5.2346570397111911,6.5335753176043552,5.2346570397111911,5.6261343012704179,1.8050541516245486,null,null,null,null,null,null,null,null,null,null,null,null,null,null,null,null,null,null,null,null,null,null,null,null,null,null,null,null,null,null,null,null,null,null,null,null,"Unimproved facilities","N/A","N/A","N/A","N/A","N/A","N/A","N/A","N/A","N/A","N/A","N/A","N/A","N/A","N/A","N/A"]
[null,"Open defecation",22.666666666666664,14.153846153846153,4.7227926078028748,1.3292433537832311,0.102880658436214,4.7381546134663344,0.49627791563275436,0,0,0,28.51985559566787,18.511796733212339,14.620938628158845,7.2595281306715069,3.0685920577617329,null,null,null,null,null,null,null,null,null,null,null,null,null,null,null,null,null,null,null,null,null,null,null,null,null,null,null,null,null,null,null,null,null,null,null,null,"Open defecation","N/A","N/A","N/A","N/A","N/A","N/A","N/A","N/A","N/A","N/A","N/A","N/A","N/A","N/A","N/A"]
["Septic tank emptying practices","Not emptied/treated and disposed in situ","N/A","N/A","N/A","N/A","N/A","N/A","N/A","N/A","N/A","N/A","N/A","N/A","N/A","N/A","N/A",null,null,null,null,null,null,null,null,null,null,null,null,null,null,null,null,null,null,null,null,null,null,null,null,null,null,null,null,null,null,null,null,null,null,null,"Septic tank emptying practices","Not emptied/treated and disposed in situ","N/A","N/A","N/A","N/A","N/A","N/A","N/A","N/A","N/A","N/A","N/A","N/A","N/A","N/A","N/A"]
[null,"Emptied and buried on site","N/A","N/A","N/A","N/A","N/A","N/A","N/A","N/A","N/A","N/A","N/A","N/A","N/A","N/A","N/A",null,null,null,null,null,null,null,null,null,null,null,null,null,null,null,null,null,null,null,null,null,null,null,null,null,null,null,null,null,null,null,null,null,null,null,null,"Emptied and buried on site","N/A","N/A","N/A","N/A","N/A","N/A","N/A","N/A","N/A","N/A","N/A","N/A","N/A","N/A","N/A"]
[null,"Emptied and discharged locally","N/A","N/A","N/A","N/A","N/A","N/A","N/A","N/A","N/A","N/A","N/A","N/A","N/A","N/A","N/A",null,null,null,null,null,null,null,null,null,null,null,null,null,null,null,null,null,null,null,null,null,null,null,null,null,null,null,null,null,null,null,null,null,null,null,null,"Emptied and discharged locally","N/A","N/A","N/A","N/A","N/A","N/A","N/A","N/A","N/A","N/A","N/A","N/A","N/A","N/A","N/A"]
[null,"Emptied and removed offsite","N/A","N/A","N/A","N/A","N/A","N/A","N/A","N/A","N/A","N/A","N/A","N/A","N/A","N/A","N/A",null,null,null,null,null,null,null,null,null,null,null,null,null,null,null,null,null,null,null,null,null,null,null,null,null,null,null,null,null,null,null,null,null,null,null,null,"Emptied and removed offsite","N/A","N/A","N/A","N/A","N/A","N/A","N/A","N/A","N/A","N/A","N/A","N/A","N/A","N/A","N/A"]
["Latrine emptying practices","Not emptied/treated and disposed in situ","N/A","N/A","N/A","N/A","N/A","N/A","N/A","N/A","N/A","N/A","N/A","N/A","N/A","N/A","N/A",null,null,null,null,null,null,null,null,null,null,null,null,null,null,null,null,null,null,null,null,null,null,null,null,null,null,null,null,null,null,null,null,null,null,null,"Latrine emptying practices","Not emptied/treated and disposed in situ","N/A","N/A","N/A","N/A","N/A","N/A","N/A","N/A","N/A","N/A","N/A","N/A","N/A","N/A","N/A"]
[null,"Emptied and buried on site","N/A","N/A","N/A","N/A","N/A","N/A","N/A","N/A","N/A","N/A","N/A","N/A","N/A","N/A","N/A",null,null,null,null,null,null,null,null,null,null,null,null,null,null,null,null,null,null,null,null,null,null,null,null,null,null,null,null,null,null,null,null,null,null,null,null,"Emptied and buried on site","N/A","N/A","N/A","N/A","N/A","N/A","N/A","N/A","N/A","N/A","N/A","N/A","N/A","N/A","N/A"]
[null,"Emptied and discharged locally","N/A","N/A","N/A","N/A","N/A","N/A","N/A","N/A","N/A","N/A","N/A","N/A","N/A","N/A","N/A",null,null,null,null,null,null,null,null,null,null,null,null,null,null,null,null,null,null,null,null,null,null,null,null,null,null,null,null,null,null,null,null,null,null,null,null,"Emptied and discharged locally","N/A","N/A","N/A","N/A","N/A","N/A","N/A","N/A","N/A","N/A","N/A","N/A","N/A","N/A","N/A"]
[null,"Emptied and removed offsite","N/A","N/A","N/A","N/A","N/A","N/A","N/A","N/A","N/A","N/A","N/A","N/A","N/A","N/A","N/A",null,null,null,null,null,null,null,null,null,null,null,null,null,null,null,null,null,null,null,null,null,null,null,null,null,null,null,null,null,null,null,null,null,null,null,null,"Emptied and removed offsite","N/A","N/A","N/A","N/A","N/A","N/A","N/A","N/A","N/A","N/A","N/A","N/A","N/A","N/A","N/A"]
["Shared among improved sanitation facilities","Yes",5.1282051282051277,6.666666666666667,7.5975359342915816,9.5092024539877311,3.7037037037037033,9.2269326683291766,11.166253101736972,8.6848635235732008,4.0506329113924053,2.6960784313725492,3.4296028880866429,5.2631578947368416,6.6787003610108311,8.7114337568058069,7.4007220216606493,null,null,null,null,null,null,null,null,null,null,null,null,null,null,null,null,null,null,null,null,null,null,null,null,null,null,null,null,null,null,null,null,null,null,null,"Shared among improved sanitation facilities","Yes","N/A","N/A","N/A","N/A","N/A","N/A","N/A","N/A","N/A","N/A","N/A","N/A","N/A","N/A","N/A"]
[null,"No",74.974358974358978,82.15384615384616,75.975359342915823,87.832310838445807,93.827160493827151,83.790523690773071,85.607940446650119,89.081885856079396,93.417721518987335,94.85294117647058,71.841155234657037,79.854809437386564,81.949458483754512,83.484573502722327,89.350180505415167,null,null,null,null,null,null,null,null,null,null,null,null,null,null,null,null,null,null,null,null,null,null,null,null,null,null,null,null,null,null,null,null,null,null,null,null,"No","N/A","N/A","N/A","N/A","N/A","N/A","N/A","N/A","N/A","N/A","N/A","N/A","N/A","N/A","N/A"]
[null,"DK/missing",19.897435897435898,11.179487179487179,16.427104722792606,2.6584867075664622,2.4691358024691357,6.982543640897755,3.225806451612903,2.2332506203473943,2.5316455696202533,2.4509803921568629,24.729241877256317,14.882032667876588,11.371841155234657,7.8039927404718696,3.2490974729241873,null,null,null,null,null,null,null,null,null,null,null,null,null,null,null,null,null,null,null,null,null,null,null,null,null,null,null,null,null,null,null,null,null,null,null,null,"DK/missing","N/A","N/A","N/A","N/A","N/A","N/A","N/A","N/A","N/A","N/A","N/A","N/A","N/A","N/A","N/A"]
["Shared among all sanitation facilities","Yes",94.34850863422291,92.034139402560456,90.748898678414093,90.069284064665126,96.141479099678463,89.225589225589232,88.365650969529085,90.979381443298962,95.800524934383205,97.208121827411162,95.415472779369622,95.026178010471213,92.191435768261968,90.384615384615387,92.307692307692307,null,null,null,null,null,null,null,null,null,null,null,null,null,null,null,null,null,null,null,null,null,null,null,null,null,null,null,null,null,null,null,null,null,null,null,"Shared among all sanitation facilities","Yes","N/A","N/A","N/A","N/A","N/A","N/A","N/A","N/A","N/A","N/A","N/A","N/A","N/A","N/A","N/A"]
[null,"No",5.6514913657770807,7.9658605974395442,9.251101321585903,9.9307159353348737,3.8585209003215439,10.774410774410773,11.634349030470915,9.0206185567010309,4.1994750656167978,2.7918781725888326,4.5845272206303722,4.9738219895287958,7.8085642317380355,9.6153846153846168,7.6923076923076925,null,null,null,null,null,null,null,null,null,null,null,null,null,null,null,null,null,null,null,null,null,null,null,null,null,null,null,null,null,null,null,null,null,null,null,null,"No","N/A","N/A","N/A","N/A","N/A","N/A","N/A","N/A","N/A","N/A","N/A","N/A","N/A","N/A","N/A"]
["What type of toilet facilities","Flush to piped sewage system",2.6694045174537986,9.4943240454076374,28.078250863060987,59.462254395036197,91.354166666666671,43.640897755610972,79.64824120603015,95.75,96.354166666666657,99.262899262899268,0.54249547920433994,0.90744101633393837,2.9197080291970803,6.0439560439560438,19.600725952813068,null,null,null,null,null,null,null,null,null,null,null,null,null,null,null,null,null,null,null,null,null,null,null,null,null,null,null,null,null,null,null,null,null,null,null,"What type of toilet facilities","Flush to piped sewage system",26,92,244,575,877,175,317,383,370,404,3,5,16,33,108]
[null,"Flush to septic tank",0.61601642710472282,3.8183694530443755,9.6662830840046023,15.615305067218202,4.895833333333333,2.2443890274314215,2.512562814070352,0.75,1.3020833333333335,0.49140049140049141,0.18083182640144665,2.5408348457350272,3.832116788321168,13.186813186813188,34.119782214156082,null,null,null,null,null,null,null,null,null,null,null,null,null,null,null,null,null,null,null,null,null,null,null,null,null,null,null,null,null,null,null,null,null,null,null,null,"Flush to septic tank",6,37,84,151,47,9,10,3,5,2,1,14,21,72,188]
[null,"Pour flush latrine",0.51334702258726894,2.1671826625386998,3.5673187571921749,2.792140641158221,0.52083333333333326,2.9925187032418954,3.0150753768844218,0.25,1.0416666666666665,0,0.36166365280289331,0.54446460980036293,1.6423357664233578,4.5787545787545785,3.8112522686025407,null,null,null,null,null,null,null,null,null,null,null,null,null,null,null,null,null,null,null,null,null,null,null,null,null,null,null,null,null,null,null,null,null,null,null,null,"Pour flush latrine",5,21,31,27,5,12,12,1,4,0,2,3,9,25,21]
[null,"Covered dry latrine (with privacy)",67.453798767967143,65.944272445820431,49.82738780207135,20.268872802481901,2.9166666666666665,42.394014962593516,13.819095477386934,3.25,1.3020833333333335,0,65.280289330922244,70.961887477313979,72.627737226277361,64.102564102564102,38.112522686025407,null,null,null,null,null,null,null,null,null,null,null,null,null,null,null,null,null,null,null,null,null,null,null,null,null,null,null,null,null,null,null,null,null,null,null,null,"Covered dry latrine (with privacy)",657,639,433,196,28,170,55,13,5,0,361,391,398,350,210]
[null,"Uncovered dry latrine (without privacy)",4.4147843942505132,2.1671826625386998,1.611047180667434,0.20682523267838679,0,1.99501246882793,0,0,0,0,3.9783001808318263,3.9927404718693285,2.3722627737226274,2.197802197802198,0.54446460980036293,null,null,null,null,null,null,null,null,null,null,null,null,null,null,null,null,null,null,null,null,null,null,null,null,null,null,null,null,null,null,null,null,null,null,null,null,"Uncovered dry latrine (without privacy)",43,21,14,2,0,8,0,0,0,0,22,22,13,12,3]
[null,"Bucket latrine (where fresh excreta are manually removed)",1.5400410677618068,1.9607843137254901,1.4959723820483315,0.20682523267838679,0.10416666666666667,1.7456359102244388,0,0,0,0,0.9041591320072333,2.5408348457350272,1.6423357664233578,2.197802197802198,0.54446460980036293,null,null,null,null,null,null,null,null,null,null,null,null,null,null,null,null,null,null,null,null,null,null,null,null,null,null,null,null,null,null,null,null,null,null,null,null,"Bucket latrine (where fresh excreta are manually removed)",15,19,13,2,1,7,0,0,0,0,5,14,9,12,3]
[null,"No facilities (open defecation)",22.689938398357292,14.241486068111456,5.2934407364787113,1.344364012409514,0.10416666666666667,4.7381546134663344,0.50251256281407031,0,0,0,28.571428571428569,18.511796733212339,14.78102189781022,7.3260073260073266,3.0852994555353903,null,null,null,null,null,null,null,null,null,null,null,null,null,null,null,null,null,null,null,null,null,null,null,null,null,null,null,null,null,null,null,null,null,null,null,null,"No facilities (open defecation)",221,138,46,13,1,19,2,0,0,0,158,102,81,40,17]
[null,"Other",0.10266940451745381,0.20639834881320948,0.46029919447640966,0.10341261633919339,0.10416666666666667,0.24937655860349126,0.50251256281407031,0,0,0.24570024570024571,0.18083182640144665,0,0.18248175182481752,0.36630036630036628,0.18148820326678766,null,null,null,null,null,null,null,null,null,null,null,null,null,null,null,null,null,null,null,null,null,null,null,null,null,null,null,null,null,null,null,null,null,null,null,null,"Other",1,2,4,1,1,1,2,0,0,1,1,0,1,2,1]
[null,null,null,null,null,null,null,null,null,null,null,null,null,null,null,null,null,null,null,null,null,null,null,null,null,null,null,null,null,null,null,null,null,null,null,null,null,null,null,null,null,null,null,null,null,null,null,null,null,null,null,null,null,"Total",974,969,869,967,960,401,398,400,384,407,553,551,548,546,551]
[]
[]
[]
[]
[]
[]
[]
[]
[]
[]
[]
[]
[]
[]
[]
[]
[]
[]
[]
[]
[]
[]
[]
[]
[]
[]
[]
[]
[]
[]
[]
[]
[]
[]
[]
[]
[]
[]
[]
[]
[]
[]
[]
[]
[]
[]
[{"$f":"A1026","v":"Guatemala"}]
[{"$f":"A1034","v":"2003"}]
["Access to hygiene facilities "]
[" by wealth quintile and sub-national region"]
["Notes:"]
["WHO/UNICEF JMP customised wealth index excludes water,"]
[" sanitation and hygiene assets."]
["Survey used for analysis:",{"$f":"A1025","v":"WHS03"}]
[]
[]
[]
[]
["Access to handwashing",null,"NATIONAL wealth index quintile",null,null,null,null,"URBAN wealth index quintile",null,null,null,null,"RURAL wealth index quintile",null,null,null,null,null,null,null,null,null,null,null,null,null,null,null,null,null,null,null,null,null,null,null,null,null,null,null,null,null,null,null,null,null,null,null,null,null,null,null,"Raw numbers of respondents:","Access to handwashing","NATIONAL wealth index quintile",null,null,null,null,"URBAN wealth index quintile",null,null,null,null,"RURAL wealth index quintile"]
["Weighted percentage (used in graphs)",null,"Poorest","Poor","Middle","Rich","Richest","Poorest","Poor","Middle","Rich","Richest","Poorest","Poor","Middle","Rich","Richest",null,null,null,null,null,null,null,null,null,null,null,null,null,null,null,null,null,null,null,null,null,null,null,null,null,null,null,null,null,null,null,null,null,null,null,"Hygiene data, raw numbers (weighted)",null,"Poorest","Poor","Middle","Rich","Richest","Poorest","Poor","Middle","Rich","Richest","Poorest","Poor","Middle","Rich","Richest"]
["Hygiene ladder","Basic","N/A","N/A","N/A","N/A","N/A","N/A","N/A","N/A","N/A","N/A","N/A","N/A","N/A","N/A","N/A",null,null,null,null,null,null,null,null,null,null,null,null,null,null,null,null,null,null,null,null,null,null,null,null,null,null,null,null,null,null,null,null,null,null,null,"Hygiene ladder","Basic","N/A","N/A","N/A","N/A","N/A","N/A","N/A","N/A","N/A","N/A","N/A","N/A","N/A","N/A","N/A"]
[null,"Limited","N/A","N/A","N/A","N/A","N/A","N/A","N/A","N/A","N/A","N/A","N/A","N/A","N/A","N/A","N/A",null,null,null,null,null,null,null,null,null,null,null,null,null,null,null,null,null,null,null,null,null,null,null,null,null,null,null,null,null,null,null,null,null,null,null,null,"Limited","N/A","N/A","N/A","N/A","N/A","N/A","N/A","N/A","N/A","N/A","N/A","N/A","N/A","N/A","N/A"]
[null,"No facility","N/A","N/A","N/A","N/A","N/A","N/A","N/A","N/A","N/A","N/A","N/A","N/A","N/A","N/A","N/A",null,null,null,null,null,null,null,null,null,null,null,null,null,null,null,null,null,null,null,null,null,null,null,null,null,null,null,null,null,null,null,null,null,null,null,null,"No facility","N/A","N/A","N/A","N/A","N/A","N/A","N/A","N/A","N/A","N/A","N/A","N/A","N/A","N/A","N/A"]
[null,null,null,null,null,null,null,null,null,null,null,null,null,null,null,null,null,null,null,null,null,null,null,null,null,null,null,null,null,null,null,null,null,null,null,null,null,null,null,null,null,null,null,null,null,null,null,null,null,null,null,null,"Observed handwashing place","Fixed","N/A","N/A","N/A","N/A","N/A","N/A","N/A","N/A","N/A","N/A","N/A","N/A","N/A","N/A","N/A"]
[null,null,null,null,null,null,null,null,null,null,null,null,null,null,null,null,null,null,null,null,null,null,null,null,null,null,null,null,null,null,null,null,null,null,null,null,null,null,null,null,null,null,null,null,null,null,null,null,null,null,null,null,null,"Mobile","N/A","N/A","N/A","N/A","N/A","N/A","N/A","N/A","N/A","N/A","N/A","N/A","N/A","N/A","N/A"]
[null,null,null,null,null,null,null,null,null,null,null,null,null,null,null,null,null,null,null,null,null,null,null,null,null,null,null,null,null,null,null,null,null,null,null,null,null,null,null,null,null,null,null,null,null,null,null,null,null,null,null,null,"Water / Soap","Water and soap","N/A","N/A","N/A","N/A","N/A","N/A","N/A","N/A","N/A","N/A","N/A","N/A","N/A","N/A","N/A"]
[null,null,null,null,null,null,null,null,null,null,null,null,null,null,null,null,null,null,null,null,null,null,null,null,null,null,null,null,null,null,null,null,null,null,null,null,null,null,null,null,null,null,null,null,null,null,null,null,null,null,null,null,null,"Water only","N/A","N/A","N/A","N/A","N/A","N/A","N/A","N/A","N/A","N/A","N/A","N/A","N/A","N/A","N/A"]
[null,null,null,null,null,null,null,null,null,null,null,null,null,null,null,null,null,null,null,null,null,null,null,null,null,null,null,null,null,null,null,null,null,null,null,null,null,null,null,null,null,null,null,null,null,null,null,null,null,null,null,null,null,"Soap only","N/A","N/A","N/A","N/A","N/A","N/A","N/A","N/A","N/A","N/A","N/A","N/A","N/A","N/A","N/A"]
[null,null,null,null,null,null,null,null,null,null,null,null,null,null,null,null,null,null,null,null,null,null,null,null,null,null,null,null,null,null,null,null,null,null,null,null,null,null,null,null,null,null,null,null,null,null,null,null,null,null,null,null,null,"Neither","N/A","N/A","N/A","N/A","N/A","N/A","N/A","N/A","N/A","N/A","N/A","N/A","N/A","N/A","N/A"]
[]
[]
[]
[]
[]
[]
[]
[]
[]
[]
[]
[]
[]
[]
[]
[]
[]
[]
[]
[]
[]
[]
[]
[]
[]
[]
[]
[]
[null,null,null,null,null,null,null,null,null,null,null,null,null,null,null,null,null,null,null,null,null,null,null,null,null,null,null,null,null,null,null,null,null,null,null,null,null,null,null,null,null,null,null,null,null,null,null,null,null,null,null,null,"Raw numbers of respondents:","Menstrual health and hygiene","NATIONAL wealth index quintile",null,null,null,null,"URBAN wealth index quintile",null,null,null,null,"RURAL wealth index quintile"]
[null,null,null,null,null,null,null,null,null,null,null,null,null,null,null,null,null,null,null,null,null,null,null,null,null,null,null,null,null,null,null,null,null,null,null,null,null,null,null,null,null,null,null,null,null,null,null,null,null,null,null,null,"MHH data, raw numbers (weighted)",null,"Poorest","Poor","Middle","Rich","Richest","Poorest","Poor","Middle","Rich","Richest","Poorest","Poor","Middle","Rich","Richest"]
[null,null,null,null,null,null,null,null,null,null,null,null,null,null,null,null,null,null,null,null,null,null,null,null,null,null,null,null,null,null,null,null,null,null,null,null,null,null,null,null,null,null,null,null,null,null,null,null,null,null,null,null,"Private place to wash and change","Yes","N/A","N/A","N/A","N/A","N/A","N/A","N/A","N/A","N/A","N/A","N/A","N/A","N/A","N/A","N/A"]
[null,null,null,null,null,null,null,null,null,null,null,null,null,null,null,null,null,null,null,null,null,null,null,null,null,null,null,null,null,null,null,null,null,null,null,null,null,null,null,null,null,null,null,null,null,null,null,null,null,null,null,null,null,"No","N/A","N/A","N/A","N/A","N/A","N/A","N/A","N/A","N/A","N/A","N/A","N/A","N/A","N/A","N/A"]
[null,null,null,null,null,null,null,null,null,null,null,null,null,null,null,null,null,null,null,null,null,null,null,null,null,null,null,null,null,null,null,null,null,null,null,null,null,null,null,null,null,null,null,null,null,null,null,null,null,null,null,null,null,"DK/not sure/missing","N/A","N/A","N/A","N/A","N/A","N/A","N/A","N/A","N/A","N/A","N/A","N/A","N/A","N/A","N/A"]
[null,null,null,null,null,null,null,null,null,null,null,null,null,null,null,null,null,null,null,null,null,null,null,null,null,null,null,null,null,null,null,null,null,null,null,null,null,null,null,null,null,null,null,null,null,null,null,null,null,null,null,null,"Use of menstrual materials","Materials reusable","N/A","N/A","N/A","N/A","N/A","N/A","N/A","N/A","N/A","N/A","N/A","N/A","N/A","N/A","N/A"]
[null,null,null,null,null,null,null,null,null,null,null,null,null,null,null,null,null,null,null,null,null,null,null,null,null,null,null,null,null,null,null,null,null,null,null,null,null,null,null,null,null,null,null,null,null,null,null,null,null,null,null,null,null,"Materials not reusable","N/A","N/A","N/A","N/A","N/A","N/A","N/A","N/A","N/A","N/A","N/A","N/A","N/A","N/A","N/A"]
[null,null,null,null,null,null,null,null,null,null,null,null,null,null,null,null,null,null,null,null,null,null,null,null,null,null,null,null,null,null,null,null,null,null,null,null,null,null,null,null,null,null,null,null,null,null,null,null,null,null,null,null,null,"No materials used","N/A","N/A","N/A","N/A","N/A","N/A","N/A","N/A","N/A","N/A","N/A","N/A","N/A","N/A","N/A"]
[null,null,null,null,null,null,null,null,null,null,null,null,null,null,null,null,null,null,null,null,null,null,null,null,null,null,null,null,null,null,null,null,null,null,null,null,null,null,null,null,null,null,null,null,null,null,null,null,null,null,null,null,null,"DK/not sure/missing","N/A","N/A","N/A","N/A","N/A","N/A","N/A","N/A","N/A","N/A","N/A","N/A","N/A","N/A","N/A"]
[null,null,null,null,null,null,null,null,null,null,null,null,null,null,null,null,null,null,null,null,null,null,null,null,null,null,null,null,null,null,null,null,null,null,null,null,null,null,null,null,null,null,null,null,null,null,null,null,null,null,null,null,"Use of menstrual materials with private place to wash and change","Materials reusable","N/A","N/A","N/A","N/A","N/A","N/A","N/A","N/A","N/A","N/A","N/A","N/A","N/A","N/A","N/A"]
[null,null,null,null,null,null,null,null,null,null,null,null,null,null,null,null,null,null,null,null,null,null,null,null,null,null,null,null,null,null,null,null,null,null,null,null,null,null,null,null,null,null,null,null,null,null,null,null,null,null,null,null,null,"Materials not reusable","N/A","N/A","N/A","N/A","N/A","N/A","N/A","N/A","N/A","N/A","N/A","N/A","N/A","N/A","N/A"]
[null,null,null,null,null,null,null,null,null,null,null,null,null,null,null,null,null,null,null,null,null,null,null,null,null,null,null,null,null,null,null,null,null,null,null,null,null,null,null,null,null,null,null,null,null,null,null,null,null,null,null,null,null,"No materials used","N/A","N/A","N/A","N/A","N/A","N/A","N/A","N/A","N/A","N/A","N/A","N/A","N/A","N/A","N/A"]
[null,null,null,null,null,null,null,null,null,null,null,null,null,null,null,null,null,null,null,null,null,null,null,null,null,null,null,null,null,null,null,null,null,null,null,null,null,null,null,null,null,null,null,null,null,null,null,null,null,null,null,null,"Awareness of menstruation before menarche","Yes","N/A","N/A","N/A","N/A","N/A","N/A","N/A","N/A","N/A","N/A","N/A","N/A","N/A","N/A","N/A"]
[null,null,null,null,null,null,null,null,null,null,null,null,null,null,null,null,null,null,null,null,null,null,null,null,null,null,null,null,null,null,null,null,null,null,null,null,null,null,null,null,null,null,null,null,null,null,null,null,null,null,null,null,null,"No","N/A","N/A","N/A","N/A","N/A","N/A","N/A","N/A","N/A","N/A","N/A","N/A","N/A","N/A","N/A"]
[null,null,null,null,null,null,null,null,null,null,null,null,null,null,null,null,null,null,null,null,null,null,null,null,null,null,null,null,null,null,null,null,null,null,null,null,null,null,null,null,null,null,null,null,null,null,null,null,null,null,null,null,null,"DK/not sure/missing","N/A","N/A","N/A","N/A","N/A","N/A","N/A","N/A","N/A","N/A","N/A","N/A","N/A","N/A","N/A"]
[null,null,null,null,null,null,null,null,null,null,null,null,null,null,null,null,null,null,null,null,null,null,null,null,null,null,null,null,null,null,null,null,null,null,null,null,null,null,null,null,null,null,null,null,null,null,null,null,null,null,null,null,"Participation in (all) activities during menstruation","Yes","N/A","N/A","N/A","N/A","N/A","N/A","N/A","N/A","N/A","N/A","N/A","N/A","N/A","N/A","N/A"]
[null,null,null,null,null,null,null,null,null,null,null,null,null,null,null,null,null,null,null,null,null,null,null,null,null,null,null,null,null,null,null,null,null,null,null,null,null,null,null,null,null,null,null,null,null,null,null,null,null,null,null,null,null,"No","N/A","N/A","N/A","N/A","N/A","N/A","N/A","N/A","N/A","N/A","N/A","N/A","N/A","N/A","N/A"]
[null,null,null,null,null,null,null,null,null,null,null,null,null,null,null,null,null,null,null,null,null,null,null,null,null,null,null,null,null,null,null,null,null,null,null,null,null,null,null,null,null,null,null,null,null,null,null,null,null,null,null,null,null,"DK/not sure/missing/no such activity","N/A","N/A","N/A","N/A","N/A","N/A","N/A","N/A","N/A","N/A","N/A","N/A","N/A","N/A","N/A"]
[null,null,null,null,null,null,null,null,null,null,null,null,null,null,null,null,null,null,null,null,null,null,null,null,null,null,null,null,null,null,null,null,null,null,null,null,null,null,null,null,null,null,null,null,null,null,null,null,null,null,null,null,"Participation in specific activities during menstruation","Did not go to school (amongst those usually attending school)","N/A","N/A","N/A","N/A","N/A","N/A","N/A","N/A","N/A","N/A","N/A","N/A","N/A","N/A","N/A"]
[null,null,null,null,null,null,null,null,null,null,null,null,null,null,null,null,null,null,null,null,null,null,null,null,null,null,null,null,null,null,null,null,null,null,null,null,null,null,null,null,null,null,null,null,null,null,null,null,null,null,null,null,null,"Did not go to work (amongst those who usually work)","N/A","N/A","N/A","N/A","N/A","N/A","N/A","N/A","N/A","N/A","N/A","N/A","N/A","N/A","N/A"]
[null,null,null,null,null,null,null,null,null,null,null,null,null,null,null,null,null,null,null,null,null,null,null,null,null,null,null,null,null,null,null,null,null,null,null,null,null,null,null,null,null,null,null,null,null,null,null,null,null,null,null,null,null,"Did not participate in social activities","N/A","N/A","N/A","N/A","N/A","N/A","N/A","N/A","N/A","N/A","N/A","N/A","N/A","N/A","N/A"]
[null,null,null,null,null,null,null,null,null,null,null,null,null,null,null,null,null,null,null,null,null,null,null,null,null,null,null,null,null,null,null,null,null,null,null,null,null,null,null,null,null,null,null,null,null,null,null,null,null,null,null,null,null,"Did not cook food","N/A","N/A","N/A","N/A","N/A","N/A","N/A","N/A","N/A","N/A","N/A","N/A","N/A","N/A","N/A"]
[null,null,null,null,null,null,null,null,null,null,null,null,null,null,null,null,null,null,null,null,null,null,null,null,null,null,null,null,null,null,null,null,null,null,null,null,null,null,null,null,null,null,null,null,null,null,null,null,null,null,null,null,null,"Did not eat with others","N/A","N/A","N/A","N/A","N/A","N/A","N/A","N/A","N/A","N/A","N/A","N/A","N/A","N/A","N/A"]
[null,null,null,null,null,null,null,null,null,null,null,null,null,null,null,null,null,null,null,null,null,null,null,null,null,null,null,null,null,null,null,null,null,null,null,null,null,null,null,null,null,null,null,null,null,null,null,null,null,null,null,null,null,"Did not bathe in regular place","N/A","N/A","N/A","N/A","N/A","N/A","N/A","N/A","N/A","N/A","N/A","N/A","N/A","N/A","N/A"]
[null,null,null,null,null,null,null,null,null,null,null,null,null,null,null,null,null,null,null,null,null,null,null,null,null,null,null,null,null,null,null,null,null,null,null,null,null,null,null,null,null,null,null,null,null,null,null,null,null,null,null,null,null,"Did not participate in other activities","N/A","N/A","N/A","N/A","N/A","N/A","N/A","N/A","N/A","N/A","N/A","N/A","N/A","N/A","N/A"]
[null,null,null,null,null,null,null,null,null,null,null,null,null,null,null,null,null,null,null,null,null,null,null,null,null,null,null,null,null,null,null,null,null,null,null,null,null,null,null,null,null,null,null,null,null,null,null,null,null,null,null,null,null,"DK/not sure/missing/no such activity","N/A","N/A","N/A","N/A","N/A","N/A","N/A","N/A","N/A","N/A","N/A","N/A","N/A","N/A","N/A"]
[]
[]
[]
[]
[]
[]
[]
[]
[]
[]
[]
[]
[]
[]
[]
[]
[]
[]
[]
[]
[]
[]
[]
[]
[]
[]
[]
[]
[]
[]
[]
[]
[]
[]
[]
[]
[]
[]
[]
[]
[]
[]
[]
[]
[]
[]
[]
[]
[]
[]
[]
[]
[]
[]
[null,null,null,null,null,null,null,null,null,null,null,null,null,null,null,null,null,null,null,null,null,null,null,null,null,null,null,null,null,null,null,null,null,null,null,null,null,null,null,null,null,null,null,null,null,null,null,null,null,null,null,null,"Raw numbers of respondents:","Basic water, sanitation and hygiene","NATIONAL wealth index quintile",null,null,null,null,"URBAN wealth index quintile",null,null,null,null,"RURAL wealth index quintile"]
[null,null,null,null,null,null,null,null,null,null,null,null,null,null,null,null,null,null,null,null,null,null,null,null,null,null,null,null,null,null,null,null,null,null,null,null,null,null,null,null,null,null,null,null,null,null,null,null,null,null,null,null,"WatSan data, raw numbers (weighted)",null,"Poorest","Poor","Middle","Rich","Richest","Poorest","Poor","Middle","Rich","Richest","Poorest","Poor","Middle","Rich","Richest"]
[null,null,null,null,null,null,null,null,null,null,null,null,null,null,null,null,null,null,null,null,null,null,null,null,null,null,null,null,null,null,null,null,null,null,null,null,null,null,null,null,null,null,null,null,null,null,null,null,null,null,null,null,"Use of Basic Water Sanitation and Hygiene","Yes","N/A","N/A","N/A","N/A","N/A","N/A","N/A","N/A","N/A","N/A","N/A","N/A","N/A","N/A","N/A"]
[null,null,null,null,null,null,null,null,null,null,null,null,null,null,null,null,null,null,null,null,null,null,null,null,null,null,null,null,null,null,null,null,null,null,null,null,null,null,null,null,null,null,null,null,null,null,null,null,null,null,null,null,null,"No","N/A","N/A","N/A","N/A","N/A","N/A","N/A","N/A","N/A","N/A","N/A","N/A","N/A","N/A","N/A"]
[null,null,null,null,null,null,null,null,null,null,null,null,null,null,null,null,null,null,null,null,null,null,null,null,null,null,null,null,null,null,null,null,null,null,null,null,null,null,null,null,null,null,null,null,null,null,null,null,null,null,null,null,"Use of Basic Water and Sanitation","Yes","N/A","N/A","N/A","N/A","N/A","N/A","N/A","N/A","N/A","N/A","N/A","N/A","N/A","N/A","N/A"]
[null,null,null,null,null,null,null,null,null,null,null,null,null,null,null,null,null,null,null,null,null,null,null,null,null,null,null,null,null,null,null,null,null,null,null,null,null,null,null,null,null,null,null,null,null,null,null,null,null,null,null,null,null,"No","N/A","N/A","N/A","N/A","N/A","N/A","N/A","N/A","N/A","N/A","N/A","N/A","N/A","N/A","N/A"]
[null,null,null,null,null,null,null,null,null,null,null,null,null,null,null,null,null,null,null,null,null,null,null,null,null,null,null,null,null,null,null,null,null,null,null,null,null,null,null,null,null,null,null,null,null,null,null,null,null,null,null,null,"Use of Basic Water and Hygiene","Yes","N/A","N/A","N/A","N/A","N/A","N/A","N/A","N/A","N/A","N/A","N/A","N/A","N/A","N/A","N/A"]
[null,null,null,null,null,null,null,null,null,null,null,null,null,null,null,null,null,null,null,null,null,null,null,null,null,null,null,null,null,null,null,null,null,null,null,null,null,null,null,null,null,null,null,null,null,null,null,null,null,null,null,null,null,"No","N/A","N/A","N/A","N/A","N/A","N/A","N/A","N/A","N/A","N/A","N/A","N/A","N/A","N/A","N/A"]
[null,null,null,null,null,null,null,null,null,null,null,null,null,null,null,null,null,null,null,null,null,null,null,null,null,null,null,null,null,null,null,null,null,null,null,null,null,null,null,null,null,null,null,null,null,null,null,null,null,null,null,null,"Use of Basic Sanitation and Hygiene","Yes","N/A","N/A","N/A","N/A","N/A","N/A","N/A","N/A","N/A","N/A","N/A","N/A","N/A","N/A","N/A"]
[null,null,null,null,null,null,null,null,null,null,null,null,null,null,null,null,null,null,null,null,null,null,null,null,null,null,null,null,null,null,null,null,null,null,null,null,null,null,null,null,null,null,null,null,null,null,null,null,null,null,null,null,null,"No","N/A","N/A","N/A","N/A","N/A","N/A","N/A","N/A","N/A","N/A","N/A","N/A","N/A","N/A","N/A"]
[null,null,null,null,null,null,null,null,null,null,null,null,null,null,null,null,null,null,null,null,null,null,null,null,null,null,null,null,null,null,null,null,null,null,null,null,null,null,null,null,null,null,null,null,null,null,null,null,null,null,null,null,"Use of Basic Water","Yes","N/A","N/A","N/A","N/A","N/A","N/A","N/A","N/A","N/A","N/A","N/A","N/A","N/A","N/A","N/A"]
[null,null,null,null,null,null,null,null,null,null,null,null,null,null,null,null,null,null,null,null,null,null,null,null,null,null,null,null,null,null,null,null,null,null,null,null,null,null,null,null,null,null,null,null,null,null,null,null,null,null,null,null,null,"No","N/A","N/A","N/A","N/A","N/A","N/A","N/A","N/A","N/A","N/A","N/A","N/A","N/A","N/A","N/A"]
[null,null,null,null,null,null,null,null,null,null,null,null,null,null,null,null,null,null,null,null,null,null,null,null,null,null,null,null,null,null,null,null,null,null,null,null,null,null,null,null,null,null,null,null,null,null,null,null,null,null,null,null,"Use of Basic Sanitation","Yes","N/A","N/A","N/A","N/A","N/A","N/A","N/A","N/A","N/A","N/A","N/A","N/A","N/A","N/A","N/A"]
[null,null,null,null,null,null,null,null,null,null,null,null,null,null,null,null,null,null,null,null,null,null,null,null,null,null,null,null,null,null,null,null,null,null,null,null,null,null,null,null,null,null,null,null,null,null,null,null,null,null,null,null,null,"No","N/A","N/A","N/A","N/A","N/A","N/A","N/A","N/A","N/A","N/A","N/A","N/A","N/A","N/A","N/A"]
[null,null,null,null,null,null,null,null,null,null,null,null,null,null,null,null,null,null,null,null,null,null,null,null,null,null,null,null,null,null,null,null,null,null,null,null,null,null,null,null,null,null,null,null,null,null,null,null,null,null,null,null,"Access to Basic Hygiene","Yes","N/A","N/A","N/A","N/A","N/A","N/A","N/A","N/A","N/A","N/A","N/A","N/A","N/A","N/A","N/A"]
[null,null,null,null,null,null,null,null,null,null,null,null,null,null,null,null,null,null,null,null,null,null,null,null,null,null,null,null,null,null,null,null,null,null,null,null,null,null,null,null,null,null,null,null,null,null,null,null,null,null,null,null,null,"No","N/A","N/A","N/A","N/A","N/A","N/A","N/A","N/A","N/A","N/A","N/A","N/A","N/A","N/A","N/A"]
[]
[]
[]
[]
[]
[]
[]
[]
[]
[]
[]
[]
[]
[]
[]
[]
[]
[]
[]
[]
[]
[]
[]
[]
[]
[]
[]
[]
[]
[]
[]
[]
[]
[]
[]
[]
[]
[]
[]
[]
[]
[]
[]
[]
[null,null,"INITIAL (national) Wealth Index",null,null,null,null,"URBAN Wealth Index",null,null,null,null,"RURAL Wealth Index"]
[null,null,"Component Matrix",null,null,null,null,"Component Matrix",null,null,null,null,"Component Matrix"]
[null,null,null,null,"Component",null,null,null,null,"Component",null,null,null,null,"Component"]
[null,"Note:\n\nThe INITIAL (national) Wealth Index is based on the first component of the Principal Component Analysis (PCA) which has been obtained at national level.\n\nThe final national-level (NATIONAL) Wealth Index is based on the URBAN and RURAL specific wealth indexes. Regression procedures are used to establish the relationships between the two sets of scores (urban and rural) and the initial (national) wealth factors.\nThis allows best use of the available information for each area and a better precision of the FINAL (NATIONAL) Wealth Index.\n\nFor dependency reasons, all WASH variables (contained in the generic MICS and DHS scripts) have been excluded from the sets of asset variables used in the PCAs.\n\nThe PCA can extracts as many components as there are asset variables in the input. Only the first of the components is used to represent the Wealth Index. \n\nThe scores represent the weights of the asset variables on the Wealth Index (correlations between the variables and the component).\n\nThe communalities are the proportion of each variable's variance that can be explained by the component.\n\nProportion of explained variance is the part of the model's total variance that is explained by the component.\n\nFor more information on the procedure used:\n\nThe DHS Wealth Index, DHS Comparative Reports No. 6, Shea Oscar Rutstein, Kiersten Johnson, ORC Macro International Inc., 2004.\n\nThe DHS Wealth Index: Approaches for Rural and Urban Areas, Shea O. Rutstein, ORC Macro International Inc., 2008.\n\nMICS Methodological Paper No. 4, Review of options for reporting water, sanitation and hygiene coverage by wealth quintile, UNICEF, 2016.",null,null,"1",null,null,null,null,"1",null,null,null,null,"1"]
[null,null,"Uses wood fuel",null,0.83328934928148779,null,null,"Uses wood fuel",null,0.83786311902944755,null,null,"Permanent Income question 20",null,0.77036861086738417]
[null,null,"Permanent Income question 17",null,0.80943659865292139,null,null,"Uses gaz fuel",null,-0.80897923387008697,null,null,"Permanent Income question 19",null,0.76183192000318745]
[null,null,"Uses gaz fuel",null,-0.80096962037072927,null,null,"Permanent Income question 17",null,0.750601072469127,null,null,"Permanent Income question 17",null,0.75665902052145018]
[null,null,"Permanent Income question 19",null,0.7912405366211902,null,null,"Permanent Income question 20",null,0.74337336409838584,null,null,"Uses gaz fuel",null,-0.71233300697544555]
[null,null,"Permanent Income question 20",null,0.79062119967611921,null,null,"Permanent Income question 19",null,0.71253714394592627,null,null,"Has hard floor",null,-0.70083753722108255]
[null,null,"Permanent Income question 11",null,0.73879216196323638,null,null,"Permanent Income question 11",null,0.6687975372022199,null,null,"Has hearth floor",null,0.69936645121002361]
[null,null,"Has hearth floor",null,0.72684918643178675,null,null,"Uses open fire without chimney",null,0.66781177812785919,null,null,"Uses wood fuel",null,0.68892906022567579]
[null,null,"Permanent Income question 14",null,0.71379804086514986,null,null,"Has hearth floor",null,0.63611831618743619,null,null,"Permanent Income question 14",null,0.68192859276019446]
[null,null,"Has hard floor",null,-0.6808740364715179,null,null,"Uses separate room as kitchen",null,0.63044179676785095,null,null,"Permanent Income question 11",null,0.66698750061184731]
[null,null,"Uses open fire without chimney",null,0.6651529599782865,null,null,"Has hard floor",null,-0.62464097350908754,null,null,"Permanent Income question 6",null,0.53325262573134413]
[null,null,"Permanent Income question 12",null,0.6464463743944262,null,null,"Permanent Income question 12",null,0.60075350962736718,null,null,"Uses open fire without chimney",null,0.51724511445617138]
[null,null,"Permanent Income question 13",null,0.63903744040709642,null,null,"Permanent Income question 13",null,0.58227756231334349,null,null,"Permanent Income question 5",null,0.50795105662842521]
[null,null,"Permanent Income question 16",null,0.55905742148359616,null,null,"Permanent Income question 14",null,0.57542076555331501,null,null,"Permanent Income question 13",null,0.48820066673553403]
[null,null,"Permanent Income question 5",null,0.51384960075280239,null,null,"Has mud brick wall",null,0.52671292193554886,null,null,"Has cement, brick, stone or wood wall",null,-0.469783498290886]
[null,null,"Permanent Income question 9",null,0.48319906016201819,null,null,"Permanent Income question 16",null,0.52378921365078346,null,null,"Permanent Income question 7",null,0.38201232420358838]
[null,null,"Permanent Income question 15",null,0.47238397928760484,null,null,"Has Car",null,0.50577619070616153,null,null,"Permanent Income question 12",null,0.36609914345896644]
[null,null,"Has mud brick wall",null,0.47074769672699396,null,null,"Permanent Income question 9",null,0.45949076379301995,null,null,"Uses living or sleeping room as kitchen",null,0.36260956165571739]
[null,null,"Has Car",null,0.46737534083059729,null,null,"Permanent Income question 15",null,0.4369044012466527,null,null,"Has mud brick wall",null,0.35777781998654973]
[null,null,"Has cement, brick, stone or wood wall",null,-0.45217465533604639,null,null,"Has cement, brick, stone or wood wall",null,-0.4005124571180444,null,null,"Permanent Income question 16",null,0.35505174305428094]
[null,null,"Permanent Income question 6",null,0.41322670029510972,null,null,"Uses open fire with chimney",null,0.36034689235745049,null,null,"Has Car",null,0.33816371913888998]
[null,null,"Uses separate room as kitchen",null,0.40412317046638507,null,null,"Permanent Income question 7",null,0.33609510698750866,null,null,"Uses wood heating",null,0.28335769405109512]
[null,null,"Permanent Income question 7",null,0.37835893260128245,null,null,"Permanent Income question 18",null,0.33043493440930638,null,null,"Heats house",null,0.27968276977699735]
[null,null,"Uses living or sleeping room as kitchen",null,0.36509044874742708,null,null,"Uses wood heating",null,0.31965971818043348,null,null,"Uses open fire without chimney",null,0.24932535440265674]
[null,null,"Permanent Income question 18",null,0.31030507294949056,null,null,"Heats house",null,0.29606332749732583,null,null,"Permanent Income question 18",null,0.24315644487945604]
[null,null,"Uses wood heating",null,0.26037462889932655,null,null,"Permanent Income question 5",null,0.29343843944396392,null,null,"Has table",null,0.19599181667782878]
[null,null,"Heats house",null,0.24811097856447367,null,null,"Uses open fire without chimney",null,0.28865570663882578,null,null,"Permanent Income question 8",null,0.19505572148841335]
[null,null,"Permanent Income question 10",null,0.24402185759751344,null,null,"Uses separate building as kitchen",null,0.24127554012269994,null,null,"Permanent Income question 15",null,0.18927807370680558]
[null,null,"Uses open fire without chimney",null,0.23768256332025073,null,null,"Uses living or sleeping room as kitchen",null,0.22806103860134569,null,null,"Permanent Income question 9",null,0.1721809124084854]
[null,null,"Uses separate building as kitchen",null,0.21391795594611859,null,null,"Permanent Income question 6",null,0.20615513603623181,null,null,"Uses separate room as kitchen",null,0.17055908233176115]
[null,null,"Has table",null,0.19048407664408107,null,null,"Permanent Income question 10",null,0.20428285988517264,null,null,"Permanent Income question 10",null,0.13837192205077051]
[null,null,"Uses open fire with chimney",null,0.18599662479355142,null,null,"Has table",null,0.17968464606555307,null,null,"Has chair",null,0.11778534052977652]
[null,null,"Permanent Income question 8",null,0.15329734842599846,null,null,"Kooks outdoor",null,0.17922054711993848,null,null,"Has thatch wall",null,0.10742904079532638]
[null,null,"Has thatch wall",null,0.1463424131726371,null,null,"Has plastic sheet wall",null,0.14803001874488331,null,null,"Uses open fire with chimney",null,8.435698200563356E-2]
[null,null,"Uses electricity fuel",null,-9.4611533422943789E-2,null,null,"Has thatch wall",null,0.14487438135357553,null,null,"Uses separate building as kitchen",null,5.6979007500387757E-2]
[null,null,"Has plastic sheet wall",null,8.3442828063808927E-2,null,null,"Uses open fire with chimney",null,0.14375708322741226,null,null,"Has plastic sheet wall",null,5.6474953855064104E-2]
[null,null,"Kooks outdoor",null,8.2152671010864736E-2,null,null,"Permanent Income question 8",null,0.13469876294714611,null,null,"Uses electricity fuel",null,-3.6021871534147883E-2]
[null,null,"Has chair",null,8.0763204973036476E-2,null,null,"Has chair",null,7.999965283496685E-2,null,null,"Has metal sheet wall",null,3.0679510196507533E-2]
[null,null,"Uses open fire with chimney",null,7.1705160837143969E-2,null,null,"Uses electricity fuel",null,-7.4711954120586038E-2,null,null,"Uses kerozene fuel",null,2.1336080672675478E-2]
[null,null,"Uses gaz heating",null,-6.2390433372635432E-2,null,null,"Uses gaz heating",null,-5.6155960552820627E-2,null,null,"Kooks outdoor",null,1.576429497614356E-2]
[null,null,"Has metal sheet wall",null,5.5172771508381228E-2,null,null,"Uses coal fuel",null,3.8597498129382506E-2,null,null,"Uses closed stove with chimney",null,-1.5554227016914514E-2]
[null,null,"Uses charcoal fuel",null,3.291210400710827E-2,null,null,"Uses coal heating",null,3.7452895678690326E-2,null,null,"Uses coal heating",null,-1.2876836159389428E-2]
[null,null,"Uses electricity heating",null,-2.5146022792637931E-2,null,null,"Uses charcoal fuel",null,2.5157285283028259E-2,null,null,"Uses coal fuel",null,1.1776649771598294E-2]
[null,null,"Uses kerozene fuel",null,2.1379577109970481E-2,null,null,"Has metal sheet wall",null,1.8913866167711176E-2,null,null,"Uses charcoal fuel",null,1.1410894132801101E-2]
[null,null,"Uses coal fuel",null,1.7966299592745701E-2,null,null,"Uses closed stove with chimney",null,1.5557661421199513E-2,null,null,"Uses open fire with chimney",null,8.5355702152963668E-3]
[null,null,"Uses charcoal heating",null,1.6369949474414603E-2,null,null,"Uses electricity heating",null,-9.6495519959281864E-3,null,null,"Uses agriculture crop fuel",null,-7.9880193482943316E-3]
[null,null,"Uses closed stove with chimney",null,1.0849824393657087E-2,null,null,"Uses charcoal heating",null,1.2937713558824979E-4,null,null,"Uses charcoal heating",null,3.346029988541731E-3]
[null,null,"Uses coal heating",null,7.5934485709276767E-3]
[null,null,"Uses agriculture crop fuel",null,7.4279460304765193E-3]
[]
[null,null,null,null,null,null,null,"Communalities",null,null,null,null,"Communalities"]
[null,null,null,null,null,null,null,null,null,"Extraction",null,null,null,null,"Extraction"]
[null,null,"Communalities",null,null,null,null,"Has hard floor",null,0.39017634578638061,null,null,"Has hard floor",null,0.49117325357811226]
[null,null,null,null,"Extraction",null,null,"Has hearth floor",null,0.40464651218913905,null,null,"Has hearth floor",null,0.48911343307810234]
[null,null,"Has hard floor",null,0.46358945354101788,null,null,"Has cement, brick, stone or wood wall",null,0.16041022830673335,null,null,"Has cement, brick, stone or wood wall",null,0.22069653526642288]
[null,null,"Has hearth floor",null,0.52830973981655027,null,null,"Has mud brick wall",null,0.27742650213388359,null,null,"Has mud brick wall",null,0.12800496847432799]
[null,null,"Has cement, brick, stone or wood wall",null,0.20446191892827234,null,null,"Has thatch wall",null,2.0988586372581233E-2,null,null,"Has thatch wall",null,1.1540998806203899E-2]
[null,null,"Has mud brick wall",null,0.22160339397376988,null,null,"Has plastic sheet wall",null,2.1912886449610505E-2,null,null,"Has plastic sheet wall",null,3.18942041293162E-3]
[null,null,"Has thatch wall",null,2.141610189319083E-2,null,null,"Has metal sheet wall",null,3.5773433341008948E-4,null,null,"Has metal sheet wall",null,9.4123234589760967E-4]
[null,null,"Has plastic sheet wall",null,6.962705555286379E-3,null,null,"Uses gaz fuel",null,0.65444740083303288,null,null,"Uses gaz fuel",null,0.50741831282668015]
[null,null,"Has metal sheet wall",null,3.0440347159160436E-3,null,null,"Uses electricity fuel",null,5.581876088516553E-3,null,null,"Uses electricity fuel",null,1.2975752288226536E-3]
[null,null,"Uses gaz fuel",null,0.64155233275683021,null,null,"Uses coal fuel",null,1.4897668618476861E-3,null,null,"Uses kerozene fuel",null,4.5522833847091608E-4]
[null,null,"Uses electricity fuel",null,8.9513422566408103E-3,null,null,"Uses charcoal fuel",null,6.3288900281167025E-4,null,null,"Uses coal fuel",null,1.3868947984288616E-4]
[null,null,"Uses kerozene fuel",null,4.5708631740117375E-4,null,null,"Uses wood fuel",null,0.7020146062297542,null,null,"Uses charcoal fuel",null,1.302085049099946E-4]
[null,null,"Uses coal fuel",null,3.2278792105629433E-4,null,null,"Uses open fire without chimney",null,0.44597257100629301,null,null,"Uses wood fuel",null,0.47462325002343281]
[null,null,"Uses charcoal fuel",null,1.0832065901747122E-3,null,null,"Uses open fire with chimney",null,0.12984988283167201,null,null,"Uses agriculture crop fuel",null,6.3808453108724596E-5]
[null,null,"Uses wood fuel",null,0.69437113962596531,null,null,"Uses closed stove with chimney",null,2.4204082889667965E-4,null,null,"Uses open fire without chimney",null,0.26754250842877786]
[null,null,"Uses agriculture crop fuel",null,5.5174382231671882E-5,null,null,"Uses living or sleeping room as kitchen",null,5.2011837327924491E-2,null,null,"Uses open fire with chimney",null,7.2855958900254467E-5]
[null,null,"Uses open fire without chimney",null,0.44242846016787601,null,null,"Uses separate room as kitchen",null,0.39745685911187628,null,null,"Uses closed stove with chimney",null,2.4193397809371337E-4]
[null,null,"Uses open fire with chimney",null,3.4594744434593143E-2,null,null,"Uses separate building as kitchen",null,5.8213886261500591E-2,null,null,"Uses living or sleeping room as kitchen",null,0.13148569420415152]
[null,null,"Uses closed stove with chimney",null,1.1771868937319637E-4,null,null,"Kooks outdoor",null,3.2120004509970088E-2,null,null,"Uses separate room as kitchen",null,2.9090400565852478E-2]
[null,null,"Uses living or sleeping room as kitchen",null,0.13329103576659768,null,null,"Heats house",null,8.7653493888788805E-2,null,null,"Uses separate building as kitchen",null,3.2466072957292444E-3]
[null,null,"Uses separate room as kitchen",null,0.16331553690780293,null,null,"Uses gaz heating",null,3.1534919056099464E-3,null,null,"Kooks outdoor",null,2.4851299609486506E-4]
[null,null,"Uses separate building as kitchen",null,4.5760891876165534E-2,null,null,"Uses electricity heating",null,9.3113853722121643E-5,null,null,"Heats house",null,7.8222451710132909E-2]
[null,null,"Kooks outdoor",null,6.749061354219375E-3,null,null,"Uses coal heating",null,1.4027193947188604E-3,null,null,"Uses coal heating",null,1.6581290947575907E-4]
[null,null,"Heats house",null,6.1559057684220715E-2,null,null,"Uses charcoal heating",null,1.6738443213020372E-8,null,null,"Uses charcoal heating",null,1.1195916684220576E-5]
[null,null,"Uses gaz heating",null,3.8925661764252612E-3,null,null,"Uses wood heating",null,0.10218233542719415,null,null,"Uses wood heating",null,8.0291582777954021E-2]
[null,null,"Uses electricity heating",null,6.3232246228786635E-4,null,null,"Uses open fire without chimney",null,8.3322116975159857E-2,null,null,"Uses open fire without chimney",null,6.2163132348010387E-2]
[null,null,"Uses coal heating",null,5.7660461199323578E-5,null,null,"Uses open fire with chimney",null,2.0666098978053136E-2,null,null,"Uses open fire with chimney",null,7.1161004130987845E-3]
[null,null,"Uses charcoal heating",null,2.6797524579488693E-4,null,null,"Has Car",null,0.25580955508523551,null,null,"Has Car",null,0.11435470094184606]
[null,null,"Uses wood heating",null,6.7794947374462025E-2,null,null,"Has table",null,3.2286572031703077E-2,null,null,"Has table",null,3.8412792204675646E-2]
[null,null,"Uses open fire without chimney",null,5.6493000906485E-2,null,null,"Has chair",null,6.3999444537152193E-3,null,null,"Has chair",null,1.3873386443715415E-2]
[null,null,"Uses open fire with chimney",null,5.1416300906806855E-3,null,null,"Permanent Income question 5",null,8.6106117743308883E-2,null,null,"Permanent Income question 5",null,0.25801427592993365]
[null,null,"Has Car",null,0.21843970921651698,null,null,"Permanent Income question 6",null,4.2499940114117243E-2,null,null,"Permanent Income question 6",null,0.28435836284937299]
[null,null,"Has table",null,3.6284183454948153E-2,null,null,"Permanent Income question 7",null,0.1129599209409449,null,null,"Permanent Income question 7",null,0.14593341584342751]
[null,null,"Has chair",null,6.5226952775167034E-3,null,null,"Permanent Income question 8",null,1.8143756739491462E-2,null,null,"Permanent Income question 8",null,3.8046734485365476E-2]
[null,null,"Permanent Income question 5",null,0.26404141219381444,null,null,"Permanent Income question 9",null,0.21113176201109285,null,null,"Permanent Income question 9",null,2.9646266597818521E-2]
[null,null,"Permanent Income question 6",null,0.17075630583678442,null,null,"Permanent Income question 10",null,4.1731486842865075E-2,null,null,"Permanent Income question 10",null,1.9146788812024508E-2]
[null,null,"Permanent Income question 7",null,0.14315548187918178,null,null,"Permanent Income question 11",null,0.44729014576775472,null,null,"Permanent Income question 11",null,0.44487232597243903]
[null,null,"Permanent Income question 8",null,2.3500077034441971E-2,null,null,"Permanent Income question 12",null,0.36090477932959913,null,null,"Permanent Income question 12",null,0.13402858284138888]
[null,null,"Permanent Income question 9",null,0.23348133174145769,null,null,"Permanent Income question 13",null,0.33904715957356962,null,null,"Permanent Income question 13",null,0.23833989100101996]
[null,null,"Permanent Income question 10",null,5.9546666985341126E-2,null,null,"Permanent Income question 14",null,0.33110905742996311,null,null,"Permanent Income question 14",null,0.46502660562389914]
[null,null,"Permanent Income question 11",null,0.54581385857831288,null,null,"Permanent Income question 15",null,0.19088545582869609,null,null,"Permanent Income question 15",null,3.5826189186158923E-2]
[null,null,"Permanent Income question 12",null,0.41789291496769865,null,null,"Permanent Income question 16",null,0.27435514033690606,null,null,"Permanent Income question 16",null,0.12606174024588312]
[null,null,"Permanent Income question 13",null,0.40836885024205333,null,null,"Permanent Income question 17",null,0.56340196999180359,null,null,"Permanent Income question 17",null,0.5725328733364804]
[null,null,"Permanent Income question 14",null,0.50950764314292618,null,null,"Permanent Income question 18",null,0.10918724587808261,null,null,"Permanent Income question 18",null,5.912505668641594E-2]
[null,null,"Permanent Income question 15",null,0.22314662388759227,null,null,"Permanent Income question 19",null,0.50770918150261768,null,null,"Permanent Income question 19",null,0.58038787433574301]
[null,null,"Permanent Income question 16",null,0.3125452005158873,null,null,"Permanent Income question 20",null,0.55260395845095134,null,null,"Permanent Income question 20",null,0.59346779660974314]
[null,null,"Permanent Income question 17",null,0.65518760723881053]
[null,null,"Permanent Income question 18",null,9.6289238298188654E-2]
[null,null,"Permanent Income question 19",null,0.62606158679258905,null,null,"Total Variance Explained",null,null,null,null,"Total Variance Explained"]
[null,null,"Permanent Income question 20",null,0.62508188137730591,null,null,"Component",null,"Extraction Sums of Squared Loadings",null,null,"Component",null,"Extraction Sums of Squared Loadings"]
[null,null,null,null,null,null,null,null,null,"Total","% of Variance","Cumulative %",null,null,"Total","% of Variance","Cumulative %"]
[null,null,null,null,null,null,null,"1",null,8.5379889536799443,18.560845551478138,18.560845551478138,"1",null,7.1801413642675742,15.609002965799073,15.609002965799073]
[null,null,"Total Variance Explained"]
[null,null,"Component",null,"Extraction Sums of Squared Loadings"]
[null,null,null,null,"Total","% of Variance","Cumulative %","Component Score Coefficient Matrix",null,null,null,null,"Component Score Coefficient Matrix"]
[null,null,"1",null,9.3939002965338556,19.570625617778866,19.570625617778866,null,null,"Component",null,null,null,null,"Component"]
[null,null,null,null,null,null,null,null,null,"1",null,null,null,null,"1"]
[null,null,null,null,null,null,null,"Has hard floor",null,-7.3160199304294279E-2,null,null,"Has hard floor",null,-9.760776308790306E-2]
[null,null,"Component Score Coefficient Matrix",null,null,null,null,"Has hearth floor",null,7.4504466993162835E-2,null,null,"Has hearth floor",null,9.7402880490691277E-2]
[null,null,null,null,"Component",null,null,"Has cement, brick, stone or wood wall",null,-4.6909460681068257E-2,null,null,"Has cement, brick, stone or wood wall",null,-6.5428168396348449E-2]
[null,null,null,null,"1",null,null,"Has mud brick wall",null,6.1690513397599477E-2,null,null,"Has mud brick wall",null,4.9828798882296875E-2]
[null,null,"Has hard floor",null,-7.2480441028605097E-2,null,null,"Has thatch wall",null,1.6968209040740617E-2,null,null,"Has thatch wall",null,1.4961967368769889E-2]
[null,null,"Has hearth floor",null,7.7374590264703835E-2,null,null,"Has plastic sheet wall",null,1.7337808651190768E-2,null,null,"Has plastic sheet wall",null,7.8654375993368678E-3]
[null,null,"Has cement, brick, stone or wood wall",null,-4.813492171115432E-2,null,null,"Has metal sheet wall",null,2.2152600888010222E-3,null,null,"Has metal sheet wall",null,4.2728281575605239E-3]
[null,null,"Has mud brick wall",null,5.0112060152553428E-2,null,null,"Uses gaz fuel",null,-9.4750559910411966E-2,null,null,"Uses gaz fuel",null,-9.920877192201473E-2]
[null,null,"Has thatch wall",null,1.5578450755607263E-2,null,null,"Uses electricity fuel",null,-8.7505330032530172E-3,null,null,"Uses electricity fuel",null,-5.0168749759458764E-3]
[null,null,"Has plastic sheet wall",null,8.8826606020714887E-3,null,null,"Uses coal fuel",null,4.5206779182756698E-3,null,null,"Uses kerozene fuel",null,2.971540473960001E-3]
[null,null,"Has metal sheet wall",null,5.8732549597890447E-3,null,null,"Uses charcoal fuel",null,2.9465118096908831E-3,null,null,"Uses coal fuel",null,1.6401696253789003E-3]
[null,null,"Uses gaz fuel",null,-8.5264862845762776E-2,null,null,"Uses wood fuel",null,9.8133544512062382E-2,null,null,"Uses charcoal fuel",null,1.589229731546531E-3]
[null,null,"Uses electricity fuel",null,-1.0071592249904272E-2,null,null,"Uses open fire without chimney",null,7.8216519340895477E-2,null,null,"Uses wood fuel",null,9.5949233486428906E-2]
[null,null,"Uses kerozene fuel",null,2.2758999387995512E-3,null,null,"Uses open fire with chimney",null,4.2205125154459004E-2,null,null,"Uses agriculture crop fuel",null,-1.1125156097966556E-3]
[null,null,"Uses coal fuel",null,1.9125495295468358E-3,null,null,"Uses closed stove with chimney",null,1.8221693077377472E-3,null,null,"Uses open fire without chimney",null,7.2038291199985865E-2]
[null,null,"Uses charcoal fuel",null,3.5035611373533662E-3,null,null,"Uses living or sleeping room as kitchen",null,2.671132978018782E-2,null,null,"Uses open fire with chimney",null,1.1887746747959822E-3]
[null,null,"Uses wood fuel",null,8.870536443621331E-2,null,null,"Uses separate room as kitchen",null,7.3839612605275787E-2,null,null,"Uses closed stove with chimney",null,-2.166284231438827E-3]
[null,null,"Uses agriculture crop fuel",null,7.907201264651777E-4,null,null,"Uses separate building as kitchen",null,2.8259059765907549E-2,null,null,"Uses living or sleeping room as kitchen",null,5.0501730155379204E-2]
[null,null,"Uses open fire without chimney",null,7.0806900114078669E-2,null,null,"Kooks outdoor",null,2.0990955609364308E-2,null,null,"Uses separate room as kitchen",null,2.3754279153967515E-2]
[null,null,"Uses open fire with chimney",null,1.9799723109918482E-2,null,null,"Heats house",null,3.4676002639909734E-2,null,null,"Uses separate building as kitchen",null,7.9356386747407737E-3]
[null,null,"Uses closed stove with chimney",null,1.154986113452837E-3,null,null,"Uses gaz heating",null,-6.577188241572619E-3,null,null,"Kooks outdoor",null,2.1955410313501018E-3]
[null,null,"Uses living or sleeping room as kitchen",null,3.8864628878607282E-2,null,null,"Uses electricity heating",null,-1.130190264742513E-3,null,null,"Heats house",null,3.8952265086152238E-2]
[null,null,"Uses separate room as kitchen",null,4.301974235510013E-2,null,null,"Uses coal heating",null,4.3866179590860005E-3,null,null,"Uses coal heating",null,-1.7933959104860821E-3]
[null,null,"Uses separate building as kitchen",null,2.2772006216102772E-2,null,null,"Uses charcoal heating",null,1.5153115832093832E-5,null,null,"Uses charcoal heating",null,4.6601171464303746E-4]
[null,null,"Kooks outdoor",null,8.7453207312810522E-3,null,null,"Uses wood heating",null,3.7439696855388595E-2,null,null,"Uses wood heating",null,3.9464082902495833E-2]
[null,null,"Heats house",null,2.6411923773134071E-2,null,null,"Uses open fire without chimney",null,3.3808395420143147E-2,null,null,"Uses open fire without chimney",null,3.4724296048465011E-2]
[null,null,"Uses gaz heating",null,-6.6415899044251258E-3,null,null,"Uses open fire with chimney",null,1.6837347062325699E-2,null,null,"Uses open fire with chimney",null,1.17486519729878E-2]
[null,null,"Uses electricity heating",null,-2.6768458253614074E-3,null,null,"Has Car",null,5.9238328071175107E-2,null,null,"Has Car",null,4.7097083745702137E-2]
[null,null,"Uses coal heating",null,8.0833821216193833E-4,null,null,"Has table",null,2.1045312548466994E-2,null,null,"Has table",null,2.72963729729883E-2]
[null,null,"Uses charcoal heating",null,1.7426147774268759E-3,null,null,"Has chair",null,9.3698473105292956E-3,null,null,"Has chair",null,1.640432054944526E-2]
[null,null,"Uses wood heating",null,2.7717414564789364E-2,null,null,"Permanent Income question 5",null,3.4368566302429987E-2,null,null,"Permanent Income question 5",null,7.0743879661795461E-2]
[null,null,"Uses open fire without chimney",null,2.530179753003664E-2,null,null,"Permanent Income question 6",null,2.4145631618248613E-2,null,null,"Permanent Income question 6",null,7.4267705700769251E-2]
[null,null,"Uses open fire with chimney",null,7.6331617936802702E-3,null,null,"Permanent Income question 7",null,3.9364668754068716E-2,null,null,"Permanent Income question 7",null,5.3204011567891507E-2]
[null,null,"Has Car",null,4.9753065933970865E-2,null,null,"Permanent Income question 8",null,1.5776403984346904E-2,null,null,"Permanent Income question 8",null,2.7166000165278138E-2]
[null,null,"Has table",null,2.0277421585405329E-2,null,null,"Permanent Income question 9",null,5.381721225991698E-2,null,null,"Permanent Income question 9",null,2.3980156333043044E-2]
[null,null,"Has chair",null,8.5974092148749289E-3,null,null,"Permanent Income question 10",null,2.3926343895903621E-2,null,null,"Permanent Income question 10",null,1.9271476010122458E-2]
[null,null,"Permanent Income question 5",null,5.4700346451665216E-2,null,null,"Permanent Income question 11",null,7.8331974992069148E-2,null,null,"Permanent Income question 11",null,9.2893366129412513E-2]
[null,null,"Permanent Income question 6",null,4.3988831821813297E-2,null,null,"Permanent Income question 12",null,7.0362413548033173E-2,null,null,"Permanent Income question 12",null,5.0987734765346245E-2]
[null,null,"Permanent Income question 7",null,4.0277086264252637E-2,null,null,"Permanent Income question 13",null,6.8198444091729246E-2,null,null,"Permanent Income question 13",null,6.799318313774369E-2]
[null,null,"Permanent Income question 8",null,1.6318817912359777E-2,null,null,"Permanent Income question 14",null,6.739535137314788E-2,null,null,"Permanent Income question 14",null,9.4974257213633007E-2]
[null,null,"Permanent Income question 9",null,5.1437533389651603E-2,null,null,"Permanent Income question 15",null,5.1171816175557751E-2,null,null,"Permanent Income question 15",null,2.6361329687568522E-2]
[null,null,"Permanent Income question 10",null,2.5976628439153462E-2,null,null,"Permanent Income question 16",null,6.1348078158970448E-2,null,null,"Permanent Income question 16",null,4.9449129904491608E-2]
[null,null,"Permanent Income question 11",null,7.8645944564243966E-2,null,null,"Permanent Income question 17",null,8.7913099506366998E-2,null,null,"Permanent Income question 17",null,0.10538218986704236]
[null,null,"Permanent Income question 12",null,6.8815545618783183E-2,null,null,"Permanent Income question 18",null,3.8701728967087297E-2,null,null,"Permanent Income question 18",null,3.3865133364858156E-2]
[null,null,"Permanent Income question 13",null,6.8026849363398867E-2,null,null,"Permanent Income question 19",null,8.3454915181029488E-2,null,null,"Permanent Income question 19",null,0.10610263522031639]
[null,null,"Permanent Income question 14",null,7.598526898657057E-2,null,null,"Permanent Income question 20",null,8.706656428478815E-2,null,null,"Permanent Income question 20",null,0.10729156597127348]
[null,null,"Permanent Income question 15",null,5.028624579525337E-2]
[null,null,"Permanent Income question 16",null,5.9512811913692155E-2]
[null,null,"Permanent Income question 17",null,8.6166190091626377E-2,null,null,"Component Score Covariance Matrix",null,null,null,null,"Component Score Covariance Matrix"]
[null,null,"Permanent Income question 18",null,3.3032612988663126E-2,null,null,"Component",null,"1",null,null,"Component",null,"1"]
[null,null,"Permanent Income question 19",null,8.4229181878068354E-2,null,null,"1",null,1,null,null,"1",null,0.99999999999999978]
[null,null,"Permanent Income question 20",null,8.4163252186936821E-2]
[]
[]
[null,null,"Component Score Covariance Matrix"]
[null,null,"Component",null,"1"]
[null,null,"1",null,1.0000000000000002]
[]
[]
[]
[]
[]
[]
[]
[]
[]
[]
[]
[]
[]
[]
[]
[]
[]
[]
[]
[]
[]
[]
[]
[]
[]
[]
[]
[]
[]
[]
[]
[]
[]
[]
[]
[]
[]
[]
[]
[]
[]
[]
[]
[]
[]
[]
[]
[]
[]
[]
[]
[]
[]
[]
[]
[]
[]
[]
[]
[]
[]
[]
[]
[]
[]
[]
[]
[]
[]
[]
[]
[]
[]
[]
[]
[]
[]
[]
[]
[]
[]
[]
[]
[]
[]
[]
[]
[]
[]
[]
[]
[]
[]
[]
[]
[]
[]
[]
[]
[]
[]
[]
[]
[]
[]
[]
[]
[]
[]
[]
[]
[]
[]
[]
[]
[]
[]
[]
[]
[]
[]
[]
[]
[]
[]
[]
[]
[]
[]
[]
[]
[]
[]
[]
[]
[]
[]
[]
[]
[]
[]
[]
[]
[]
[]
[]
[]
[]
[]
[]
[]
[]
[]
[]
[]
[]
[]
[]
[]
[]
[]
[]
[]
[]
[]
[]
[]
[]
[]
[]
[]
[]
[]
[]
[]
[]
[]
[]
[]
[]
[]
[]
[]
[]
[]
[]
[]
[]
[]
[]
[]
[]
[]
[]
[]
[]
[]
[]
[]
[]
[]
[]
[]
[]
[]
[]
[]
[]
[]
[]
[]
[]
[]
[]
[]
[]
[]
[]
[]
[]
[]
[]
[]
[]
[]
[]
[]
[]
[]
[]
[]
[]
[]
[]
[]
[]
[]
[]
[]
[]
[]
[]
[]
[]
[]
[]
[]
[]
[]
[]
[]
[]
[]
[]
[]
[]
[]
[]
[]
[]
[]
[]
[]
[]
[]
[]
[]
[]
[]
[]
[]
[]
[]
[]
[]
[]
[]
[]
[]
[]
[]
[]
[]
[]
[]
[]
[]
[]
[]
[]
[]
[]
[]
[]
[]
[]
[]
[]
[]
[]
[]
[]
[]
[]
[]
[]
[]
[]
[]
[]
[]
[]
[]
[]
[]
[]
[]
[]
[]
[]
[]
[]
[]
[]
[]
[]
[]
[]
[]
[]
[]
[]
[]
[]
[]
[]
[]
[]
[]
[]
[]
[]
[]
[]
[]
[]
[]
[]
[]
[]
[]
[]
[]
[]
[]
[]
[]
[]
[]
[]
[]
[]
[]
[]
[]
[]
[]
[]
[]
[]
[]
[]
[]
[]
[]
[]
[]
[]
[]
[]
[]
[]
[]
[]
[]
[]
[]
[]
[]
[]
[]
[]
[]
[]
[]
[]
[]
[]
[]
[]
[]
[]
[]
[]
[]
[]
[]
[]
[]
[]
[]
[]
[]
[]
[]
[]
[]
[]
[]
[]
[]
[]
[]
[]
[]
[]
[]
[]
[]
[]
[]
[]
[]
[]
[]
[]
[]
[]
[]
[]
[]
[]
[]
[]
[]
[]
[]
[]
[]
[]
[]
[]
[]
[]
[]
[]
[]
["WHS03"]
["Guatemala",null,"Count"]
["W_text_t","",4874]
["W_text_i","",4874]
["S_text_s","",4874]
["S_text_i","",4874]
["Urban/Rural","Urban",2010]
[null,"Rural",2764]
[null,"Missing",0]
["2003"]
[]
["Sub-national region names","Weighted population"]
[{"$f":"R15","v":0},{"$f":"#REF!+#REF!","v":{"$error":"#REF!"}}]
[{"$f":"S15","v":0},{"$f":"#REF!+#REF!","v":{"$error":"#REF!"}}]
[{"$f":"T15","v":0},{"$f":"#REF!+#REF!","v":{"$error":"#REF!"}}]
[{"$f":"U15","v":0},{"$f":"#REF!+#REF!","v":{"$error":"#REF!"}}]
[{"$f":"V15","v":0},{"$f":"#REF!+#REF!","v":{"$error":"#REF!"}}]
[{"$f":"W15","v":0},{"$f":"#REF!+#REF!","v":{"$error":"#REF!"}}]
[{"$f":"X15","v":0},{"$f":"#REF!+WI123","v":{"$error":"#REF!"}}]
[{"$f":"Y15","v":0},{"$f":"#REF!+#REF!","v":{"$error":"#REF!"}}]
[{"$f":"Z15","v":0},{"$f":"#REF!+#REF!","v":{"$error":"#REF!"}}]
[{"$f":"AA15","v":0},{"$f":"#REF!+#REF!","v":{"$error":"#REF!"}}]
[{"$f":"AB15","v":0},{"$f":"#REF!+#REF!","v":{"$error":"#REF!"}}]
[{"$f":"AC15","v":0},{"$f":"#REF!+#REF!","v":{"$error":"#REF!"}}]
[{"$f":"AD15","v":0},{"$f":"#REF!+#REF!","v":{"$error":"#REF!"}}]
[{"$f":"AE15","v":0},{"$f":"#REF!+#REF!","v":{"$error":"#REF!"}}]
[{"$f":"AF15","v":0},{"$f":"#REF!+#REF!","v":{"$error":"#REF!"}}]
[{"$f":"AG15","v":0},{"$f":"#REF!+#REF!","v":{"$error":"#REF!"}}]
[{"$f":"AH15","v":0},{"$f":"#REF!+#REF!","v":{"$error":"#REF!"}}]
[{"$f":"AI15","v":0},{"$f":"#REF!+#REF!","v":{"$error":"#REF!"}}]
[{"$f":"AJ15","v":0},{"$f":"#REF!+#REF!","v":{"$error":"#REF!"}}]
[{"$f":"AK15","v":0},{"$f":"#REF!+#REF!","v":{"$error":"#REF!"}}]
[{"$f":"AL15","v":0},{"$f":"#REF!+#REF!","v":{"$error":"#REF!"}}]
[{"$f":"AM15","v":0},{"$f":"#REF!+#REF!","v":{"$error":"#REF!"}}]
[{"$f":"AN15","v":0},{"$f":"#REF!+#REF!","v":{"$error":"#REF!"}}]
[{"$f":"AO15","v":0},{"$f":"#REF!+#REF!","v":{"$error":"#REF!"}}]
[{"$f":"AP15","v":0},{"$f":"#REF!+#REF!","v":{"$error":"#REF!"}}]
[{"$f":"AQ15","v":0},{"$f":"#REF!+#REF!","v":{"$error":"#REF!"}}]
[{"$f":"AR15","v":0},{"$f":"#REF!+#REF!","v":{"$error":"#REF!"}}]
[{"$f":"AS15","v":0},{"$f":"#REF!+#REF!","v":{"$error":"#REF!"}}]
[{"$f":"AT15","v":0},{"$f":"#REF!+#REF!","v":{"$error":"#REF!"}}]
[{"$f":"AU15","v":0},{"$f":"#REF!+#REF!","v":{"$error":"#REF!"}}]
[{"$f":"AV15","v":0},{"$f":"#REF!+#REF!","v":{"$error":"#REF!"}}]
[{"$f":"AW15","v":0},{"$f":"#REF!+#REF!","v":{"$error":"#REF!"}}]
[{"$f":"AX15","v":0},{"$f":"#REF!+#REF!","v":{"$error":"#REF!"}}]
[{"$f":"AY15","v":0},{"$f":"#REF!+#REF!","v":{"$error":"#REF!"}}]
[]
[{"$f":"34-COUNTIF(A1037:A1071,\"0\")","v":0},"Sub-regions"]

{"sheet":"ENCOVI11","index":5,"n_rows":1072,"n_cols":77,"rows_kept":1072,"cut":false,"hidden":false,"merged":[[346,52,347,52],[348,52,349,52],[350,52,351,52],[352,52,353,52],[270,52,272,52],[273,52,275,52],[276,52,283,52],[338,54,338,58],[338,59,338,63],[338,64,338,68],[340,52,341,52],[342,52,343,52],[344,52,345,52],[221,52,223,52],[224,52,225,52],[226,52,229,52],[258,54,258,58],[258,59,258,63],[258,64,258,68],[260,52,262,52],[263,52,266,52],[267,52,269,52],[13,64,13,68],[15,52,16,52],[17,52,20,52],[21,52,22,52],[26,54,26,58],[26,59,26,63],[26,64,26,68],[40,52,41,52],[55,54,55,58],[55,59,55,63],[55,64,55,68],[139,52,142,52],[152,52,157,52],[150,52,151,52],[13,54,13,58],[13,59,13,63],[119,54,119,58],[119,59,119,63],[42,52,43,52],[44,52,45,52],[32,0,33,0],[55,2,55,6],[55,7,55,11],[55,12,55,16],[34,0,35,0],[36,0,37,0],[40,0,41,0],[42,0,43,0],[119,64,119,68],[121,52,122,52],[123,52,126,52],[127,52,128,52],[132,54,132,58],[132,59,132,63],[132,64,132,68],[134,52,138,52],[219,54,219,58],[219,59,219,63],[219,64,219,68],[13,2,13,6],[13,7,13,11],[28,52,29,52],[30,0,31,0],[30,52,31,52],[26,2,26,6],[26,7,26,11],[26,12,26,16],[13,12,13,16],[15,0,16,0],[17,0,20,0],[21,0,22,0],[23,0,25,0],[28,0,29,0],[143,0,146,0],[143,52,146,52],[147,0,149,0],[147,52,149,52],[132,7,132,11],[132,12,132,16],[134,0,138,0],[46,0,48,0],[46,52,48,52],[49,0,51,0],[49,52,51,52],[52,0,54,0],[52,52,54,52],[32,52,33,52],[34,52,35,52],[36,52,37,52],[38,0,39,0],[38,52,39,52],[152,0,156,0],[201,0,202,0],[207,0,207,1],[219,2,219,6],[219,7,219,11],[44,0,45,0],[139,0,142,0],[121,0,122,0],[123,0,126,0],[127,0,128,0],[129,0,131,0],[132,2,132,6],[107,0,107,1],[119,2,119,6],[119,7,119,11],[119,12,119,16],[150,0,151,0],[1024,0,1024,2],[1025,0,1025,1],[1030,0,1032,0],[1033,0,1033,2],[398,2,398,5],[219,12,219,16],[221,0,223,0],[398,7,398,10],[398,12,398,15],[399,2,399,4],[399,7,399,9],[399,12,399,14],[400,2,401,3],[400,7,401,8],[400,12,401,13],[405,2,405,3],[405,7,405,8],[405,12,405,13],[406,2,406,3],[406,7,406,8],[406,12,406,13],[401,1,444,1],[402,2,402,3],[402,7,402,8],[402,12,402,13],[403,2,403,3],[403,7,403,8],[403,12,403,13],[404,2,404,3],[404,7,404,8],[404,12,404,13],[409,2,409,3],[409,7,409,8],[409,12,409,13],[410,2,410,3],[410,7,410,8],[410,12,410,13],[407,2,407,3],[407,7,407,8],[407,12,407,13],[408,2,408,3],[408,7,408,8],[408,12,408,13],[413,2,413,3],[413,7,413,8],[413,12,413,13],[414,2,414,3],[414,7,414,8],[414,12,414,13],[411,2,411,3],[411,7,411,8],[411,12,411,13],[412,2,412,3],[412,7,412,8],[412,12,412,13],[417,2,417,3],[417,7,417,8],[417,12,417,13],[418,2,418,3],[418,7,418,8],[418,12,418,13],[415,2,415,3],[415,7,415,8],[415,12,415,13],[416,2,416,3],[416,7,416,8],[416,12,416,13],[421,2,421,3],[421,7,421,8],[421,12,421,13],[422,2,422,3],[422,7,422,8],[422,12,422,13],[419,2,419,3],[419,7,419,8],[419,12,419,13],[420,2,420,3],[420,7,420,8],[420,12,420,13],[425,2,425,3],[425,7,425,8],[425,12,425,13],[426,2,426,3],[426,7,426,8],[426,12,426,13],[423,2,423,3],[423,7,423,8],[423,12,423,13],[424,2,424,3],[424,7,424,8],[424,12,424,13],[429,2,429,3],[429,7,429,8],[429,12,429,13],[430,2,430,3],[430,7,430,8],[430,12,430,13],[427,2,427,3],[427,7,427,8],[427,12,427,13],[428,2,428,3],[428,7,428,8],[428,12,428,13],[433,2,433,3],[433,7,433,8],[433,12,433,13],[434,2,434,3],[434,7,434,8],[434,12,434,13],[431,2,431,3],[431,7,431,8],[431,12,431,13],[432,2,432,3],[432,7,432,8],[432,12,432,13],[437,2,437,3],[437,7,437,8],[437,12,437,13],[438,2,438,3],[438,7,438,8],[438,12,438,13],[435,2,435,3],[435,7,435,8],[435,12,435,13],[436,2,436,3],[436,7,436,8],[436,12,436,13],[441,2,441,3],[441,7,441,8],[441,12,441,13],[442,2,442,3],[442,7,442,8],[442,12,442,13],[439,2,439,3],[439,7,439,8],[439,12,439,13],[440,2,440,3],[440,7,440,8],[440,12,440,13],[445,2,445,3],[445,7,445,8],[445,12,445,13],[446,2,446,3],[446,7,446,8],[446,12,446,13],[443,2,443,3],[443,7,443,8],[443,12,443,13],[444,2,444,4],[444,7,444,9],[444,12,444,14],[449,2,449,3],[449,7,449,8],[449,12,449,13],[450,2,450,3],[450,7,450,8],[450,12,450,13],[447,2,447,3],[447,7,447,8],[447,12,447,13],[448,2,448,3],[448,7,448,8],[448,12,448,13],[453,2,453,3],[453,7,453,8],[453,12,453,13],[454,2,454,3],[454,7,454,8],[454,12,454,13],[451,2,451,3],[451,7,451,8],[451,12,451,13],[452,2,452,3],[452,7,452,8],[452,12,452,13],[457,2,457,3],[457,7,457,8],[457,12,457,13],[458,2,458,3],[458,7,458,8],[458,12,458,13],[455,2,455,3],[455,7,455,8],[455,12,455,13],[456,2,456,3],[456,7,456,8],[456,12,456,13],[461,2,461,3],[461,7,461,8],[461,12,461,13],[462,2,462,3],[462,7,462,8],[462,12,462,13],[459,2,459,3],[459,7,459,8],[459,12,459,13],[460,2,460,3],[460,7,460,8],[460,12,460,13],[465,2,465,3],[465,7,465,8],[465,12,465,13],[466,2,466,3],[466,7,466,8],[466,12,466,13],[463,2,463,3],[463,7,463,8],[463,12,463,13],[464,2,464,3],[464,7,464,8],[464,12,464,13],[469,2,469,3],[469,7,469,8],[469,12,469,13],[470,2,470,3],[470,7,470,8],[470,12,470,13],[467,2,467,3],[467,7,467,8],[467,12,467,13],[468,2,468,3],[468,7,468,8],[468,12,468,13],[473,2,473,3],[473,7,473,8],[473,12,473,13],[474,2,474,3],[474,7,474,8],[474,12,474,13],[471,2,471,3],[471,7,471,8],[471,12,471,13],[472,2,472,3],[472,7,472,8],[472,12,472,13],[477,2,477,3],[477,7,477,8],[477,12,477,13],[478,2,478,3],[478,7,478,8],[478,12,478,13],[475,2,475,3],[475,7,475,8],[475,12,475,13],[476,2,476,3],[476,7,476,8],[476,12,476,13],[481,2,481,3],[481,7,481,8],[481,12,481,13],[482,2,482,3],[482,7,482,8],[482,12,482,13],[479,2,479,3],[479,7,479,8],[479,12,479,13],[480,2,480,3],[480,7,480,8],[480,12,480,13],[485,2,485,3],[485,7,485,8],[485,12,485,13],[486,2,486,3],[486,7,486,8],[486,12,486,13],[483,2,483,3],[483,7,483,8],[483,12,483,13],[484,2,484,3],[484,7,484,8],[484,12,484,13],[487,2,487,6],[487,7,487,11],[487,12,487,16],[488,2,489,3],[488,4,488,6],[488,7,489,8],[488,9,488,11],[488,12,489,13],[488,14,488,16],[492,2,492,3],[492,7,492,8],[492,12,492,13],[493,2,493,4],[493,7,493,9],[493,12,493,14],[490,2,490,3],[490,7,490,8],[490,12,490,13],[491,2,491,3],[491,7,491,8],[491,12,491,13],[497,2,497,3],[497,7,497,8],[497,12,497,13],[498,2,498,3],[498,7,498,8],[498,12,498,13],[494,2,495,3],[494,7,495,8],[494,12,495,13],[496,2,496,3],[496,7,496,8],[496,12,496,13],[501,2,501,3],[501,7,501,8],[501,12,501,13],[502,2,502,3],[502,7,502,8],[502,12,502,13],[499,2,499,3],[499,7,499,8],[499,12,499,13],[500,2,500,3],[500,7,500,8],[500,12,500,13],[505,2,505,3],[505,7,505,8],[505,12,505,13],[506,2,506,3],[506,7,506,8],[506,12,506,13],[503,2,503,3],[503,7,503,8],[503,12,503,13],[504,2,504,3],[504,7,504,8],[504,12,504,13],[509,2,509,3],[509,7,509,8],[509,12,509,13],[510,2,510,3],[510,7,510,8],[510,12,510,13],[507,2,507,3],[507,7,507,8],[507,12,507,13],[508,2,508,3],[508,7,508,8],[508,12,508,13],[513,2,513,3],[513,7,513,8],[513,12,513,13],[514,2,514,3],[514,7,514,8],[514,12,514,13],[511,2,511,3],[511,7,511,8],[511,12,511,13],[512,2,512,3],[512,7,512,8],[512,12,512,13],[517,2,517,3],[517,7,517,8],[517,12,517,13],[518,2,518,3],[518,7,518,8],[518,12,518,13],[515,2,515,3],[515,7,515,8],[515,12,515,13],[516,2,516,3],[516,7,516,8],[516,12,516,13],[521,2,521,3],[521,7,521,8],[521,12,521,13],[522,2,522,3],[522,7,522,8],[522,12,522,13],[519,2,519,3],[519,7,519,8],[519,12,519,13],[520,2,520,3],[520,7,520,8],[520,12,520,13],[525,2,525,3],[525,7,525,8],[525,12,525,13],[526,2,526,3],[526,7,526,8],[526,12,526,13],[523,2,523,3],[523,7,523,8],[523,12,523,13],[524,2,524,3],[524,7,524,8],[524,12,524,13],[529,2,529,3],[529,7,529,8],[529,12,529,13],[530,2,530,3],[530,7,530,8],[530,12,530,13],[527,2,527,3],[527,7,527,8],[527,12,527,13],[528,2,528,3],[528,7,528,8],[528,12,528,13],[533,2,533,3],[533,7,533,8],[533,12,533,13],[534,2,534,3],[534,7,534,8],[534,12,534,13],[531,2,531,3],[531,7,531,8],[531,12,531,13],[532,2,532,3],[532,7,532,8],[532,12,532,13],[537,2,537,4],[537,7,537,9],[537,12,537,14],[538,2,538,3],[538,7,538,8],[538,12,538,13],[535,2,535,3],[535,7,535,8],[535,12,535,13],[536,2,536,3],[536,7,536,8],[536,12,536,13],[541,2,541,3],[541,7,541,8],[541,12,541,13],[542,2,542,3],[542,7,542,8],[542,12,542,13],[539,2,539,3],[539,7,539,8],[539,12,539,13],[540,2,540,3],[540,7,540,8],[540,12,540,13],[545,2,545,3],[545,7,545,8],[545,12,545,13],[546,2,546,3],[546,7,546,8],[546,12,546,13],[543,2,543,3],[543,7,543,8],[543,12,543,13],[544,2,544,3],[544,7,544,8],[544,12,544,13],[549,2,549,3],[549,7,549,8],[549,12,549,13],[550,2,550,3],[550,7,550,8],[550,12,550,13],[547,2,547,3],[547,7,547,8],[547,12,547,13],[548,2,548,3],[548,7,548,8],[548,12,548,13],[553,2,553,3],[553,7,553,8],[553,12,553,13],[554,2,554,3],[554,7,554,8],[554,12,554,13],[551,2,551,3],[551,7,551,8],[551,12,551,13],[552,2,552,3],[552,7,552,8],[552,12,552,13],[557,2,557,3],[557,7,557,8],[557,12,557,13],[558,2,558,3],[558,7,558,8],[558,12,558,13],[555,2,555,3],[555,7,555,8],[555,12,555,13],[556,2,556,3],[556,7,556,8],[556,12,556,13],[561,2,561,3],[561,7,561,8],[561,12,561,13],[562,2,562,3],[562,7,562,8],[562,12,562,13],[559,2,559,3],[559,7,559,8],[559,12,559,13],[560,2,560,3],[560,7,560,8],[560,12,560,13],[565,2,565,3],[565,7,565,8],[565,12,565,13],[566,2,566,3],[566,7,566,8],[566,12,566,13],[563,2,563,3],[563,7,563,8],[563,12,563,13],[564,2,564,3],[564,7,564,8],[564,12,564,13],[569,2,569,3],[569,7,569,8],[569,12,569,13],[570,2,570,3],[570,7,570,8],[570,12,570,13],[567,2,567,3],[567,7,567,8],[567,12,567,13],[568,2,568,3],[568,7,568,8],[568,12,568,13],[573,2,573,3],[573,7,573,8],[573,12,573,13],[574,2,574,3],[574,7,574,8],[574,12,574,13],[571,2,571,3],[571,7,571,8],[571,12,571,13],[572,2,572,3],[572,7,572,8],[572,12,572,13],[577,2,577,3],[577,7,577,8],[577,12,577,13],[578,2,578,3],[578,7,578,8],[578,12,578,13],[575,2,575,3],[575,7,575,8],[575,12,575,13],[576,2,576,3],[576,7,576,8],[576,12,576,13],[581,2,581,3],[581,7,581,8],[581,12,581,13],[582,2,582,3],[582,7,582,8],[582,12,582,13],[579,2,579,3],[579,7,579,8],[579,12,579,13],[580,2,580,3],[580,7,580,8],[580,12,580,13],[585,2,585,3],[585,7,585,8],[585,12,585,13],[586,2,586,3],[586,7,586,8],[586,12,586,13],[583,2,583,3],[583,7,583,8],[583,12,583,13],[584,2,584,3],[584,7,584,8],[584,12,584,13],[589,2,589,3],[589,7,589,8],[589,12,589,13],[590,2,590,3],[590,7,590,8],[590,12,590,13],[587,2,587,3],[587,7,587,8],[587,12,587,13],[588,2,588,3],[588,7,588,8],[588,12,588,13],[593,2,593,3],[593,7,593,8],[593,12,593,13],[594,2,594,3],[594,7,594,8],[594,12,594,13],[591,2,591,3],[591,7,591,8],[591,12,591,13],[592,2,592,3],[592,7,592,8],[592,12,592,13],[597,2,597,3],[597,7,597,8],[597,12,597,13],[598,2,598,3],[598,7,598,8],[598,12,598,13],[595,2,595,3],[595,7,595,8],[595,12,595,13],[596,2,596,3],[596,7,596,8],[596,12,596,13],[601,2,601,3],[601,7,601,8],[601,12,601,13],[602,2,602,3],[602,7,602,8],[602,12,602,13],[599,2,599,3],[599,7,599,8],[599,12,599,13],[600,2,600,3],[600,7,600,8],[600,12,600,13],[605,2,605,3],[605,7,605,8],[605,12,605,13],[606,2,606,3],[606,7,606,8],[606,12,606,13],[603,2,603,3],[603,7,603,8],[603,12,603,13],[604,2,604,3],[604,7,604,8],[604,12,604,13],[609,2,609,3],[609,7,609,8],[609,12,609,13],[610,2,610,3],[610,7,610,8],[610,12,610,13],[607,2,607,3],[607,7,607,8],[607,12,607,13],[608,2,608,3],[608,7,608,8],[608,12,608,13],[613,2,613,3],[613,7,613,8],[613,12,613,13],[614,2,614,3],[614,7,614,8],[614,12,614,13],[611,2,611,3],[611,7,611,8],[611,12,611,13],[612,2,612,3],[612,7,612,8],[612,12,612,13],[617,2,617,3],[617,7,617,8],[617,12,617,13],[618,2,618,3],[618,7,618,8],[618,12,618,13],[615,2,615,3],[615,7,615,8],[615,12,615,13],[616,2,616,3],[616,7,616,8],[616,12,616,13],[621,2,621,3],[621,7,621,8],[621,12,621,13],[622,2,622,3],[622,7,622,8],[622,12,622,13],[619,2,619,3],[619,7,619,8],[619,12,619,13],[620,2,620,3],[620,7,620,8],[620,12,620,13],[625,2,625,3],[625,7,625,8],[625,12,625,13],[626,2,626,3],[626,7,626,8],[626,12,626,13],[623,2,623,3],[623,7,623,8],[623,12,623,13],[624,2,624,3],[624,7,624,8],[624,12,624,13],[629,2,629,3],[629,7,629,8],[629,12,629,13],[630,2,630,3],[630,7,630,8],[630,12,630,13],[627,2,627,3],[627,7,627,8],[627,12,627,13],[628,2,628,3],[628,7,628,8],[628,12,628,13],[633,2,633,3],[633,7,633,8],[633,12,633,13],[634,2,634,3],[634,7,634,8],[634,12,634,13],[631,2,631,3],[631,7,631,8],[631,12,631,13],[632,2,632,3],[632,7,632,8],[632,12,632,13],[637,2,637,3],[637,7,637,8],[637,12,637,13],[638,2,638,3],[638,7,638,8],[638,12,638,13],[635,2,635,3],[635,7,635,8],[635,12,635,13],[636,2,636,3],[636,7,636,8],[636,12,636,13],[641,2,641,3],[641,7,641,8],[641,12,641,13],[642,2,642,3],[642,7,642,8],[642,12,642,13],[639,2,639,3],[639,7,639,8],[639,12,639,13],[640,2,640,3],[640,7,640,8],[640,12,640,13],[645,2,645,3],[645,7,645,8],[645,12,645,13],[646,2,646,3],[646,7,646,8],[646,12,646,13],[643,2,643,3],[643,7,643,8],[643,12,643,13],[644,2,644,3],[644,7,644,8],[644,12,644,13],[649,2,649,3],[649,7,649,8],[649,12,649,13],[650,2,650,3],[650,7,650,8],[650,12,650,13],[647,2,647,3],[647,7,647,8],[647,12,647,13],[648,2,648,3],[648,7,648,8],[648,12,648,13],[653,2,653,3],[653,7,653,8],[653,12,653,13],[654,2,654,3],[654,7,654,8],[654,12,654,13],[651,2,651,3],[651,7,651,8],[651,12,651,13],[652,2,652,3],[652,7,652,8],[652,12,652,13],[657,2,657,3],[657,7,657,8],[657,12,657,13],[658,2,658,3],[658,7,658,8],[658,12,658,13],[655,2,655,3],[655,7,655,8],[655,12,655,13],[656,2,656,3],[656,7,656,8],[656,12,656,13],[661,2,661,3],[661,7,661,8],[661,12,661,13],[662,2,662,3],[662,7,662,8],[662,12,662,13],[659,2,659,3],[659,7,659,8],[659,12,659,13],[660,2,660,3],[660,7,660,8],[660,12,660,13],[665,2,665,3],[665,7,665,8],[665,12,665,13],[666,2,666,3],[666,7,666,8],[666,12,666,13],[663,2,663,3],[663,7,663,8],[663,12,663,13],[664,2,664,3],[664,7,664,8],[664,12,664,13],[669,2,669,3],[669,7,669,8],[669,12,669,13],[670,2,670,3],[670,7,670,8],[670,12,670,13],[667,2,667,3],[667,7,667,8],[667,12,667,13],[668,2,668,3],[668,7,668,8],[668,12,668,13],[673,2,673,3],[673,7,673,8],[673,12,673,13],[674,2,674,3],[674,7,674,8],[674,12,674,13],[671,2,671,3],[671,7,671,8],[671,12,671,13],[672,2,672,3],[672,7,672,8],[672,12,672,13],[677,2,677,3],[677,7,677,8],[677,12,677,13],[678,2,678,3],[678,7,678,8],[678,12,678,13],[675,2,675,3],[675,7,675,8],[675,12,675,13],[676,2,676,3],[676,7,676,8],[676,12,676,13],[681,2,681,3],[681,7,681,8],[681,12,681,13],[682,2,682,3],[682,7,682,8],[682,12,682,13],[679,2,679,3],[679,7,679,8],[679,12,679,13],[680,2,680,3],[680,7,680,8],[680,12,680,13],[685,2,685,3],[685,7,685,8],[685,12,685,13],[686,2,686,3],[686,7,686,8],[686,12,686,13],[683,2,683,3],[683,7,683,8],[683,12,683,13],[684,2,684,3],[684,7,684,8],[684,12,684,13],[687,2,687,3],[687,7,687,8],[687,12,687,13],[688,2,688,3],[688,7,688,8],[688,12,688,13],[693,2,693,3],[693,7,693,8],[693,12,693,13],[694,2,694,3],[694,7,694,8],[694,12,694,13],[691,2,691,3],[691,7,691,8],[691,12,691,13],[692,2,692,3],[692,7,692,8],[692,12,692,13],[697,2,697,3],[697,7,697,8],[697,12,697,13],[698,2,698,3]],"merged_total":1014,"flags":["merged_cut"]}
[]
[{"$f":"A1026","v":"Guatemala"}]
[{"$f":"A1034","v":"2011"}]
["Use of drinking water sources"]
[" by wealth quintile and sub-national region"]
["Notes:"]
["WHO/UNICEF JMP customised wealth index excludes water,"]
[" sanitation and hygiene assets."]
["Survey used for analysis:",{"$f":"A1025","v":"ENCOVI11"}]
[{"$f":"B1028","v":""}]
[{"$f":"B1027","v":""}]
[]
[]
["Use of drinking water sources",null,"NATIONAL wealth index quintile",null,null,null,null,"URBAN wealth index quintile",null,null,null,null,"RURAL wealth index quintile",null,null,null,null,"SUB-REGIONS:",null,null,null,null,null,null,null,null,null,null,null,null,null,null,null,null,null,null,null,null,null,null,null,null,null,null,null,null,null,null,null,null,null,null,"Raw numbers of respondents:","Use of drinking water sources","NATIONAL wealth index quintile",null,null,null,null,"URBAN wealth index quintile",null,null,null,null,"RURAL wealth index quintile",null,null,null,null,"SUB-REGIONS:"]
["Weighted percentage (used in graphs)",null,"Poorest","Poor","Middle","Rich","Richest","Poorest","Poor","Middle","Rich","Richest","Poorest","Poor","Middle","Rich","Richest","Central","Metropolitana","Nor-Oriente","Nor-Occidente","Norte","Peten","Sur-Occidente","Sur-Oriente",null,null,null,null,null,null,null,null,null,null,null,null,null,null,null,null,null,null,null,null,null,null,null,null,null,null,null,"Water data, raw numbers (weighted)",null,"Poorest","Poor","Middle","Rich","Richest","Poorest","Poor","Middle","Rich","Richest","Poorest","Poor","Middle","Rich","Richest","Central","Metropolitana","Nor-Oriente","Nor-Occidente","Norte","Peten","Sur-Occidente","Sur-Oriente"]
["Water","Improved",72.2,85.3,90.7,93.1,98,86,93.9,95.3,98.1,99.7,68,81.7,85.5,90.1,92.9,94.3,96.5,86.9,81.2,75.7,78.400000000000006,90.8,83.4,null,null,null,null,null,null,null,null,null,null,null,null,null,null,null,null,null,null,null,null,null,null,null,null,null,null,null,"Water","Improved","N/A","N/A","N/A","N/A","N/A","N/A","N/A","N/A","N/A","N/A","N/A","N/A","N/A","N/A","N/A","N/A","N/A","N/A","N/A","N/A","N/A","N/A","N/A"]
[null,"Not Improved",27.8,14.7,9.3000000000000007,6.9,2,14,6.1,4.7,1.9,0.3,32,18.3,14.5,9.9,7.1,5.7,3.5,13.1,18.8,24.3,21.6,9.1999999999999993,16.600000000000001,null,null,null,null,null,null,null,null,null,null,null,null,null,null,null,null,null,null,null,null,null,null,null,null,null,null,null,null,"Not Improved","N/A","N/A","N/A","N/A","N/A","N/A","N/A","N/A","N/A","N/A","N/A","N/A","N/A","N/A","N/A","N/A","N/A","N/A","N/A","N/A","N/A","N/A","N/A"]
["Water ladder","Basic",66,82.5,88.5,92.1,97.8,85.1,93,95.1,98,99.7,60.6,77.2,82.2,87.2,91.5,93,95.7,84.5,77.7,72.3,77.2,88.5,81.2,null,null,null,null,null,null,null,null,null,null,null,null,null,null,null,null,null,null,null,null,null,null,null,null,null,null,null,"Water ladder","Basic","N/A","N/A","N/A","N/A","N/A","N/A","N/A","N/A","N/A","N/A","N/A","N/A","N/A","N/A","N/A","N/A","N/A","N/A","N/A","N/A","N/A","N/A","N/A"]
[null,"Limited",2.8,1.4,1.1000000000000001,0.2,0.1,0.3,0.6,0,0,0,3.2,2.2999999999999998,1.6,1.1000000000000001,0.5,0.5,0.6,1.5,2.8,0.6,0.4,0.7,1.7,null,null,null,null,null,null,null,null,null,null,null,null,null,null,null,null,null,null,null,null,null,null,null,null,null,null,null,null,"Limited","N/A","N/A","N/A","N/A","N/A","N/A","N/A","N/A","N/A","N/A","N/A","N/A","N/A","N/A","N/A","N/A","N/A","N/A","N/A","N/A","N/A","N/A","N/A"]
[null,"Unimproved",8.1999999999999993,5.9,3.6,3.1,1.1000000000000001,12,4.4000000000000004,2.9,1.4,0.3,7.2,5.2,4.0999999999999996,3.1,2.2999999999999998,5.2,3,4,4,6.2,5.7,3.7,4.4000000000000004,null,null,null,null,null,null,null,null,null,null,null,null,null,null,null,null,null,null,null,null,null,null,null,null,null,null,null,null,"Unimproved","N/A","N/A","N/A","N/A","N/A","N/A","N/A","N/A","N/A","N/A","N/A","N/A","N/A","N/A","N/A","N/A","N/A","N/A","N/A","N/A","N/A","N/A","N/A"]
[null,"Surface water",23.1,10.199999999999999,6.8,4.5999999999999996,1,2.5,2,2,0.6,0,28.9,15.2,12.1,8.6,5.8,1.3,0.6,9.9,15.5,20.9,16.8,7,12.7,null,null,null,null,null,null,null,null,null,null,null,null,null,null,null,null,null,null,null,null,null,null,null,null,null,null,null,null,"Surface water","N/A","N/A","N/A","N/A","N/A","N/A","N/A","N/A","N/A","N/A","N/A","N/A","N/A","N/A","N/A","N/A","N/A","N/A","N/A","N/A","N/A","N/A","N/A"]
["Improved water point at more than 30 minutes","Yes",4,1.7,1.2,0.2,0.1,0.3,0.7,0,0,0,5,2.9,1.9,1.2,0.5,0.5,0.7,1.8,3.4,0.8,0.5,0.8,2.1,null,null,null,null,null,null,null,null,null,null,null,null,null,null,null,null,null,null,null,null,null,null,null,null,null,null,null,"Improved water point at more than 30 minutes","Yes","N/A","N/A","N/A","N/A","N/A","N/A","N/A","N/A","N/A","N/A","N/A","N/A","N/A","N/A","N/A","N/A","N/A","N/A","N/A","N/A","N/A","N/A","N/A"]
[null,"No",96,98.3,98.8,99.8,99.9,99.7,99.3,100,100,100,95,97.1,98.1,98.8,99.5,99.5,99.3,98.2,96.6,99.2,99.5,99.2,97.9,null,null,null,null,null,null,null,null,null,null,null,null,null,null,null,null,null,null,null,null,null,null,null,null,null,null,null,null,"No","N/A","N/A","N/A","N/A","N/A","N/A","N/A","N/A","N/A","N/A","N/A","N/A","N/A","N/A","N/A","N/A","N/A","N/A","N/A","N/A","N/A","N/A","N/A"]
["Manually calculated ratios","Improved wells"]
[null,"Improved springs"]
[null,"Other"]
[null,null,"NATIONAL wealth index quintile",null,null,null,null,"URBAN wealth index quintile",null,null,null,null,"RURAL wealth index quintile",null,null,null,null,"SUB-REGIONS:",null,null,null,null,null,null,null,null,null,null,null,null,null,null,null,null,null,null,null,null,null,null,null,null,null,null,null,null,null,null,null,null,null,null,"Raw numbers of respondents:","Use of drinking water sources","NATIONAL wealth index quintile",null,null,null,null,"URBAN wealth index quintile",null,null,null,null,"RURAL wealth index quintile",null,null,null,null,"SUB-REGIONS:"]
["Percentage based on weighted population",null,"Poorest","Poor","Middle","Rich","Richest","Poorest","Poor","Middle","Rich","Richest","Poorest","Poor","Middle","Rich","Richest","Central","Metropolitana","Nor-Oriente","Nor-Occidente","Norte","Peten","Sur-Occidente","Sur-Oriente",null,null,null,null,null,null,null,null,null,null,null,null,null,null,null,null,null,null,null,null,null,null,null,null,null,null,null,"Water data, raw numbers (weighted)",null,"Poorest","Poor","Middle","Rich","Richest","Poorest","Poor","Middle","Rich","Richest","Poorest","Poor","Middle","Rich","Richest","Central","Metropolitana","Nor-Oriente","Nor-Occidente","Norte","Peten","Sur-Occidente","Sur-Oriente"]
["Piped water","Yes",49.1,69.8,74.7,80.3,93.7,78.8,86.7,89.7,93.9,97.7,42.5,60.6,68.099999999999994,68.5,78.599999999999994,80.099999999999994,88.2,76,70.3,56.4,67,70.8,73.599999999999994,null,null,null,null,null,null,null,null,null,null,null,null,null,null,null,null,null,null,null,null,null,null,null,null,null,null,null,"Piped water","Yes","N/A","N/A","N/A","N/A","N/A","N/A","N/A","N/A","N/A","N/A","N/A","N/A","N/A","N/A","N/A","N/A","N/A","N/A","N/A","N/A","N/A","N/A","N/A"]
[null,"No",50.9,30.2,25.3,19.7,6.3,21.2,13.3,10.3,6.1,2.2999999999999998,57.5,39.4,31.9,31.5,21.4,19.899999999999999,11.8,24,29.7,43.6,33,29.2,26.4,null,null,null,null,null,null,null,null,null,null,null,null,null,null,null,null,null,null,null,null,null,null,null,null,null,null,null,null,"No","N/A","N/A","N/A","N/A","N/A","N/A","N/A","N/A","N/A","N/A","N/A","N/A","N/A","N/A","N/A","N/A","N/A","N/A","N/A","N/A","N/A","N/A","N/A"]
["Piped water on premises","Yes",46.5,67,72,78.8,93.5,76.2,84.6,89.3,93.9,97.4,40.1,58,64.400000000000006,66,76.900000000000006,76.8,87.8,73.3,66.8,55.1,67,69.8,71.400000000000006,null,null,null,null,null,null,null,null,null,null,null,null,null,null,null,null,null,null,null,null,null,null,null,null,null,null,null,"Piped water on premises","Yes","N/A","N/A","N/A","N/A","N/A","N/A","N/A","N/A","N/A","N/A","N/A","N/A","N/A","N/A","N/A","N/A","N/A","N/A","N/A","N/A","N/A","N/A","N/A"]
[null,"No",53.5,33,28,21.2,6.5,23.8,15.4,10.7,6.1,2.6,59.9,42,35.6,34,23.1,23.2,12.2,26.7,33.200000000000003,44.9,33,30.2,28.6,null,null,null,null,null,null,null,null,null,null,null,null,null,null,null,null,null,null,null,null,null,null,null,null,null,null,null,null,"No","N/A","N/A","N/A","N/A","N/A","N/A","N/A","N/A","N/A","N/A","N/A","N/A","N/A","N/A","N/A","N/A","N/A","N/A","N/A","N/A","N/A","N/A","N/A"]
["Piped water into dwelling","Yes","N/A","N/A","N/A","N/A","N/A","N/A","N/A","N/A","N/A","N/A","N/A","N/A","N/A","N/A","N/A","N/A","N/A","N/A","N/A","N/A","N/A","N/A","N/A",null,null,null,null,null,null,null,null,null,null,null,null,null,null,null,null,null,null,null,null,null,null,null,null,null,null,null,"Piped water into dwelling","Yes","N/A","N/A","N/A","N/A","N/A","N/A","N/A","N/A","N/A","N/A","N/A","N/A","N/A","N/A","N/A","N/A","N/A","N/A","N/A","N/A","N/A","N/A","N/A"]
[null,"No","N/A","N/A","N/A","N/A","N/A","N/A","N/A","N/A","N/A","N/A","N/A","N/A","N/A","N/A","N/A","N/A","N/A","N/A","N/A","N/A","N/A","N/A","N/A",null,null,null,null,null,null,null,null,null,null,null,null,null,null,null,null,null,null,null,null,null,null,null,null,null,null,null,null,"No","N/A","N/A","N/A","N/A","N/A","N/A","N/A","N/A","N/A","N/A","N/A","N/A","N/A","N/A","N/A","N/A","N/A","N/A","N/A","N/A","N/A","N/A","N/A"]
["Water source on premises","Yes",48.4,67.900000000000006,73,79.400000000000006,93.7,77.099999999999994,84.8,89.5,93.9,97.6,42.5,59.2,65.7,66.8,78,77.3,88.4,74.2,68.099999999999994,57.8,67.5,70.5,72.7,null,null,null,null,null,null,null,null,null,null,null,null,null,null,null,null,null,null,null,null,null,null,null,null,null,null,null,"Water source on premises","Yes","N/A","N/A","N/A","N/A","N/A","N/A","N/A","N/A","N/A","N/A","N/A","N/A","N/A","N/A","N/A","N/A","N/A","N/A","N/A","N/A","N/A","N/A","N/A"]
[null,"No",51.6,32.1,27,20.6,6.3,22.9,15.2,10.5,6.1,2.4,57.5,40.799999999999997,34.299999999999997,33.200000000000003,22,22.7,11.6,25.8,31.9,42.2,32.5,29.5,27.3,null,null,null,null,null,null,null,null,null,null,null,null,null,null,null,null,null,null,null,null,null,null,null,null,null,null,null,null,"No","N/A","N/A","N/A","N/A","N/A","N/A","N/A","N/A","N/A","N/A","N/A","N/A","N/A","N/A","N/A","N/A","N/A","N/A","N/A","N/A","N/A","N/A","N/A"]
["Improved Water source on premises","Yes",64.8,78.7,79.8,84.9,95.4,88.8,90.2,93.9,95.8,97.8,59.4,71.099999999999994,75.900000000000006,73.599999999999994,83,81.900000000000006,91.4,84.7,82.3,73.099999999999994,85.4,77,85.9,null,null,null,null,null,null,null,null,null,null,null,null,null,null,null,null,null,null,null,null,null,null,null,null,null,null,null,"Improved water source on premises","Yes","N/A","N/A","N/A","N/A","N/A","N/A","N/A","N/A","N/A","N/A","N/A","N/A","N/A","N/A","N/A","N/A","N/A","N/A","N/A","N/A","N/A","N/A","N/A"]
[null,"No",35.200000000000003,21.3,20.2,15.1,4.5999999999999996,11.2,9.8000000000000007,6.1,4.2,2.2000000000000002,40.6,28.9,24.1,26.4,17,18.100000000000001,8.6,15.3,17.7,26.9,14.6,23,14.1,null,null,null,null,null,null,null,null,null,null,null,null,null,null,null,null,null,null,null,null,null,null,null,null,null,null,null,null,"No","N/A","N/A","N/A","N/A","N/A","N/A","N/A","N/A","N/A","N/A","N/A","N/A","N/A","N/A","N/A","N/A","N/A","N/A","N/A","N/A","N/A","N/A","N/A"]
["Piped water on premises available when needed","Yes","N/A","N/A","N/A","N/A","N/A","N/A","N/A","N/A","N/A","N/A","N/A","N/A","N/A","N/A","N/A","N/A","N/A","N/A","N/A","N/A","N/A","N/A","N/A",null,null,null,null,null,null,null,null,null,null,null,null,null,null,null,null,null,null,null,null,null,null,null,null,null,null,null,"Piped water on premises available when needed","Yes","N/A","N/A","N/A","N/A","N/A","N/A","N/A","N/A","N/A","N/A","N/A","N/A","N/A","N/A","N/A","N/A","N/A","N/A","N/A","N/A","N/A","N/A","N/A"]
[null,"No","N/A","N/A","N/A","N/A","N/A","N/A","N/A","N/A","N/A","N/A","N/A","N/A","N/A","N/A","N/A","N/A","N/A","N/A","N/A","N/A","N/A","N/A","N/A",null,null,null,null,null,null,null,null,null,null,null,null,null,null,null,null,null,null,null,null,null,null,null,null,null,null,null,null,"No","N/A","N/A","N/A","N/A","N/A","N/A","N/A","N/A","N/A","N/A","N/A","N/A","N/A","N/A","N/A","N/A","N/A","N/A","N/A","N/A","N/A","N/A","N/A"]
["Water point at more than 30 minutes","Yes",9.8000000000000007,3.6,2,0.8,0.3,2.1,0.8,0.3,0,0,10.9,7.1,3.3,2.5,1.3,0.7,0.7,4.3,6.3,5,5.3,1.6,5.6,null,null,null,null,null,null,null,null,null,null,null,null,null,null,null,null,null,null,null,null,null,null,null,null,null,null,null,"Water point at more than 30 minutes","Yes","N/A","N/A","N/A","N/A","N/A","N/A","N/A","N/A","N/A","N/A","N/A","N/A","N/A","N/A","N/A","N/A","N/A","N/A","N/A","N/A","N/A","N/A","N/A"]
[null,"No",90.2,96.4,98,99.2,99.7,97.9,99.2,99.7,100,100,89.1,92.9,96.7,97.5,98.7,99.3,99.3,95.7,93.7,95,94.7,98.4,94.4,null,null,null,null,null,null,null,null,null,null,null,null,null,null,null,null,null,null,null,null,null,null,null,null,null,null,null,null,"No","N/A","N/A","N/A","N/A","N/A","N/A","N/A","N/A","N/A","N/A","N/A","N/A","N/A","N/A","N/A","N/A","N/A","N/A","N/A","N/A","N/A","N/A","N/A"]
["Water source available when needed","Yes","N/A","N/A","N/A","N/A","N/A","N/A","N/A","N/A","N/A","N/A","N/A","N/A","N/A","N/A","N/A","N/A","N/A","N/A","N/A","N/A","N/A","N/A","N/A",null,null,null,null,null,null,null,null,null,null,null,null,null,null,null,null,null,null,null,null,null,null,null,null,null,null,null,"Water source available when needed","Yes","N/A","N/A","N/A","N/A","N/A","N/A","N/A","N/A","N/A","N/A","N/A","N/A","N/A","N/A","N/A","N/A","N/A","N/A","N/A","N/A","N/A","N/A","N/A"]
[null,"No","N/A","N/A","N/A","N/A","N/A","N/A","N/A","N/A","N/A","N/A","N/A","N/A","N/A","N/A","N/A","N/A","N/A","N/A","N/A","N/A","N/A","N/A","N/A",null,null,null,null,null,null,null,null,null,null,null,null,null,null,null,null,null,null,null,null,null,null,null,null,null,null,null,null,"No","N/A","N/A","N/A","N/A","N/A","N/A","N/A","N/A","N/A","N/A","N/A","N/A","N/A","N/A","N/A","N/A","N/A","N/A","N/A","N/A","N/A","N/A","N/A"]
["Improved water source available when needed","Yes","N/A","N/A","N/A","N/A","N/A","N/A","N/A","N/A","N/A","N/A","N/A","N/A","N/A","N/A","N/A","N/A","N/A","N/A","N/A","N/A","N/A","N/A","N/A",null,null,null,null,null,null,null,null,null,null,null,null,null,null,null,null,null,null,null,null,null,null,null,null,null,null,null,"Improved water source available when needed","Yes","N/A","N/A","N/A","N/A","N/A","N/A","N/A","N/A","N/A","N/A","N/A","N/A","N/A","N/A","N/A","N/A","N/A","N/A","N/A","N/A","N/A","N/A","N/A"]
[null,"No","N/A","N/A","N/A","N/A","N/A","N/A","N/A","N/A","N/A","N/A","N/A","N/A","N/A","N/A","N/A","N/A","N/A","N/A","N/A","N/A","N/A","N/A","N/A",null,null,null,null,null,null,null,null,null,null,null,null,null,null,null,null,null,null,null,null,null,null,null,null,null,null,null,null,"No","N/A","N/A","N/A","N/A","N/A","N/A","N/A","N/A","N/A","N/A","N/A","N/A","N/A","N/A","N/A","N/A","N/A","N/A","N/A","N/A","N/A","N/A","N/A"]
["Microbiological quality at point of collection","Not contaminated (No E. coli in 100 mL)","N/A","N/A","N/A","N/A","N/A","N/A","N/A","N/A","N/A","N/A","N/A","N/A","N/A","N/A","N/A","N/A","N/A","N/A","N/A","N/A","N/A","N/A","N/A",null,null,null,null,null,null,null,null,null,null,null,null,null,null,null,null,null,null,null,null,null,null,null,null,null,null,null,"Microbiological quality at point of collection","Not contaminated (No E. coli in 100 mL)","N/A","N/A","N/A","N/A","N/A","N/A","N/A","N/A","N/A","N/A","N/A","N/A","N/A","N/A","N/A","N/A","N/A","N/A","N/A","N/A","N/A","N/A","N/A"]
[null,"Contaminated (E. coli detected in 100 mL)","N/A","N/A","N/A","N/A","N/A","N/A","N/A","N/A","N/A","N/A","N/A","N/A","N/A","N/A","N/A","N/A","N/A","N/A","N/A","N/A","N/A","N/A","N/A",null,null,null,null,null,null,null,null,null,null,null,null,null,null,null,null,null,null,null,null,null,null,null,null,null,null,null,null,"Contaminated (E. coli detected in 100 mL)","N/A","N/A","N/A","N/A","N/A","N/A","N/A","N/A","N/A","N/A","N/A","N/A","N/A","N/A","N/A","N/A","N/A","N/A","N/A","N/A","N/A","N/A","N/A"]
[null,"Highly contaminated (>100 CFU/100 mL)","N/A","N/A","N/A","N/A","N/A","N/A","N/A","N/A","N/A","N/A","N/A","N/A","N/A","N/A","N/A","N/A","N/A","N/A","N/A","N/A","N/A","N/A","N/A",null,null,null,null,null,null,null,null,null,null,null,null,null,null,null,null,null,null,null,null,null,null,null,null,null,null,null,null,"Highly contaminated (>100 CFU/100 mL)","N/A","N/A","N/A","N/A","N/A","N/A","N/A","N/A","N/A","N/A","N/A","N/A","N/A","N/A","N/A","N/A","N/A","N/A","N/A","N/A","N/A","N/A","N/A"]
["Microbiological quality of improved water sources at point of collection","Not contaminated (No E. coli in 100 mL)","N/A","N/A","N/A","N/A","N/A","N/A","N/A","N/A","N/A","N/A","N/A","N/A","N/A","N/A","N/A","N/A","N/A","N/A","N/A","N/A","N/A","N/A","N/A",null,null,null,null,null,null,null,null,null,null,null,null,null,null,null,null,null,null,null,null,null,null,null,null,null,null,null,"Microbiological quality of improved water sources at point of collection","Not contaminated (No E. coli in 100 mL)","N/A","N/A","N/A","N/A","N/A","N/A","N/A","N/A","N/A","N/A","N/A","N/A","N/A","N/A","N/A","N/A","N/A","N/A","N/A","N/A","N/A","N/A","N/A"]
[null,"Contaminated (E. coli detected in 100 mL)","N/A","N/A","N/A","N/A","N/A","N/A","N/A","N/A","N/A","N/A","N/A","N/A","N/A","N/A","N/A","N/A","N/A","N/A","N/A","N/A","N/A","N/A","N/A",null,null,null,null,null,null,null,null,null,null,null,null,null,null,null,null,null,null,null,null,null,null,null,null,null,null,null,null,"Contaminated (E. coli detected in 100 mL)","N/A","N/A","N/A","N/A","N/A","N/A","N/A","N/A","N/A","N/A","N/A","N/A","N/A","N/A","N/A","N/A","N/A","N/A","N/A","N/A","N/A","N/A","N/A"]
[null,"Highly contaminated (>100 CFU/100 mL)","N/A","N/A","N/A","N/A","N/A","N/A","N/A","N/A","N/A","N/A","N/A","N/A","N/A","N/A","N/A","N/A","N/A","N/A","N/A","N/A","N/A","N/A","N/A",null,null,null,null,null,null,null,null,null,null,null,null,null,null,null,null,null,null,null,null,null,null,null,null,null,null,null,null,"Highly contaminated (>100 CFU/100 mL)","N/A","N/A","N/A","N/A","N/A","N/A","N/A","N/A","N/A","N/A","N/A","N/A","N/A","N/A","N/A","N/A","N/A","N/A","N/A","N/A","N/A","N/A","N/A"]
["Microbiological quality of piped on premises at point of collection","Not contaminated (No E. coli in 100 mL)","N/A","N/A","N/A","N/A","N/A","N/A","N/A","N/A","N/A","N/A","N/A","N/A","N/A","N/A","N/A","N/A","N/A","N/A","N/A","N/A","N/A","N/A","N/A",null,null,null,null,null,null,null,null,null,null,null,null,null,null,null,null,null,null,null,null,null,null,null,null,null,null,null,"Microbiological quality of piped on premises at point of collection","Not contaminated (No E. coli in 100 mL)","N/A","N/A","N/A","N/A","N/A","N/A","N/A","N/A","N/A","N/A","N/A","N/A","N/A","N/A","N/A","N/A","N/A","N/A","N/A","N/A","N/A","N/A","N/A"]
[null,"Contaminated (E. coli detected in 100 mL)","N/A","N/A","N/A","N/A","N/A","N/A","N/A","N/A","N/A","N/A","N/A","N/A","N/A","N/A","N/A","N/A","N/A","N/A","N/A","N/A","N/A","N/A","N/A",null,null,null,null,null,null,null,null,null,null,null,null,null,null,null,null,null,null,null,null,null,null,null,null,null,null,null,null,"Contaminated (E. coli detected in 100 mL)","N/A","N/A","N/A","N/A","N/A","N/A","N/A","N/A","N/A","N/A","N/A","N/A","N/A","N/A","N/A","N/A","N/A","N/A","N/A","N/A","N/A","N/A","N/A"]
[null,"Highly contaminated (>100 CFU/100 mL)","N/A","N/A","N/A","N/A","N/A","N/A","N/A","N/A","N/A","N/A","N/A","N/A","N/A","N/A","N/A","N/A","N/A","N/A","N/A","N/A","N/A","N/A","N/A",null,null,null,null,null,null,null,null,null,null,null,null,null,null,null,null,null,null,null,null,null,null,null,null,null,null,null,null,"Highly contaminated (>100 CFU/100 mL)","N/A","N/A","N/A","N/A","N/A","N/A","N/A","N/A","N/A","N/A","N/A","N/A","N/A","N/A","N/A","N/A","N/A","N/A","N/A","N/A","N/A","N/A","N/A"]
[null,null,"NATIONAL wealth index quintile",null,null,null,null,"URBAN wealth index quintile",null,null,null,null,"RURAL wealth index quintile",null,null,null,null,"SUB-REGIONS:",null,null,null,null,null,null,null,null,null,null,null,null,null,null,null,null,null,null,null,null,null,null,null,null,null,null,null,null,null,null,null,null,null,null,"Raw numbers of respondents:","Use of drinking water sources","NATIONAL wealth index quintile",null,null,null,null,"URBAN wealth index quintile",null,null,null,null,"RURAL wealth index quintile",null,null,null,null,"SUB-REGIONS:"]
["Percentage based on weighted population",null,"Poorest","Poor","Middle","Rich","Richest","Poorest","Poor","Middle","Rich","Richest","Poorest","Poor","Middle","Rich","Richest","Central","Metropolitana","Nor-Oriente","Nor-Occidente","Norte","Peten","Sur-Occidente","Sur-Oriente",null,null,null,null,null,null,null,null,null,null,null,null,null,null,null,null,null,null,null,null,null,null,null,null,null,null,null,"Water data, raw numbers (weighted)",null,"Poorest","Poor","Middle","Rich","Richest","Poorest","Poor","Middle","Rich","Richest","Poorest","Poor","Middle","Rich","Richest","Central","Metropolitana","Nor-Oriente","Nor-Occidente","Norte","Peten","Sur-Occidente","Sur-Oriente"]
["¿De dónde obtienen principalmente el agua para consumo de los miembros del hogar?","Tuberia dentro de la vivienda",23.5,43.9,51,61.1,86.4,54.1,70.400000000000006,74.900000000000006,84.9,93.9,18,33.9,40.700000000000003,42.5,60.6,61.5,86.1,49.1,52.9,35.200000000000003,49.1,53.5,41.4]
[null,"Tuberia fuera de la vivienda, pero dentro del terreno",23,23.1,21,17.8,7,22.1,14.3,14.4,9,3.6,22.1,24.1,23.6,23.5,16.3,15.3,1.7,24.2,14,19.899999999999999,17.899999999999999,16.3,30]
[null,"Chorro Público",2.6,2.9,2.8,1.5,0.2,2.6,2.1,0.4,0,0.2,2.4,2.5,3.7,2.6,1.7,3.2,0.4,2.7,3.5,1.3,0,1,2.2000000000000002]
[null,"Pozo perforado público o privado",19.7,14.1,14.9,12.2,3.6,6.2,6.5,5.4,3.6,1.6,21.6,19,15.8,20.6,13.2,13.8,3.8,9.6999999999999993,10,9.5,11.3,19.899999999999999,9.8000000000000007]
[null,"Río, lago, manantial",20.5,9.4,6.1,4.2,1,2.4,1.9,2,0.6,0,25.6,13.7,10.9,7.2,5.0999999999999996,1.2,0.6,9.3000000000000007,14.9,18.8,16.100000000000001,6,12.3]
[null,"Camión cisterna",1,0.2,0.4,0.5,0.6,0.9,0.5,0.2,0.6,0.3,1,0.1,0.3,0.5,0.9,0.4,4.4000000000000004,0.8,0,0,0,0,0]
[null,"Agua de Lluvia",2.2999999999999998,1.2,0.7,0.2,0.1,0.1,0.2,0.1,0,0.2,2.9,2,1.4,0.5,0.2,0,0.1,0.4,0.9,9.6999999999999993,0.2,0.1,0]
[null,"Otro, Cuál",7.3,5.4,3.2,2.7,1,11.6,4.2,2.7,1.3,0.3,6.4,4.7,3.6,2.6,2,4.5999999999999996,2.9,3.8,3.9,5.6,5.4,3.2,4.3]
[]
[]
[]
[]
[]
[]
[]
[]
[]
[]
[]
[]
[]
[]
[]
[]
[]
[]
[]
[]
[]
[]
[]
[]
[]
[]
[]
[]
[]
[]
[]
[]
[]
[]
[]
[]
[]
[]
[]
[]
[]
[]
[{"$f":"A1026","v":"Guatemala"}]
[{"$f":"A1034","v":"2011"}]
["Use of sanitation facilities"]
[" by wealth quintile and sub-national region"]
["Notes:"]
["WHO/UNICEF JMP customised wealth index excludes water,"]
[" sanitation and hygiene assets."]
["Survey used for analysis:",{"$f":"A1025","v":"ENCOVI11"}]
[{"$f":"B1030","v":"Ratio of Improved latrines based on:"},"50%Rule"]
[{"$f":"B1029","v":"Ratio of Shared improved based on:"},"Shared sanitation"]
[]
[]
["Use of sanitation facilities",null,"NATIONAL wealth index quintile",null,null,null,null,"URBAN wealth index quintile",null,null,null,null,"RURAL wealth index quintile",null,null,null,null,"SUB-REGIONS:",null,null,null,null,null,null,null,null,null,null,null,null,null,null,null,null,null,null,null,null,null,null,null,null,null,null,null,null,null,null,null,null,null,null,"Raw numbers of respondents:","Use of sanitation facilities","NATIONAL wealth index quintile",null,null,null,null,"URBAN wealth index quintile",null,null,null,null,"RURAL wealth index quintile",null,null,null,null,"SUB-REGIONS:"]
["Weighted percentage (used in graphs)",null,"Poorest","Poor","Middle","Rich","Richest","Poorest","Poor","Middle","Rich","Richest","Poorest","Poor","Middle","Rich","Richest","Central","Metropolitana","Nor-Oriente","Nor-Occidente","Norte","Peten","Sur-Occidente","Sur-Oriente",null,null,null,null,null,null,null,null,null,null,null,null,null,null,null,null,null,null,null,null,null,null,null,null,null,null,null,"Sanitation data, raw numbers (weighted)",null,"Poorest","Poor","Middle","Rich","Richest","Poorest","Poor","Middle","Rich","Richest","Poorest","Poor","Middle","Rich","Richest","Central","Metropolitana","Nor-Oriente","Nor-Occidente","Norte","Peten","Sur-Occidente","Sur-Oriente"]
["Sanitation","Improved",{"$f":"C153+C154+C155+C156*0.5","v":44.258335930196324},{"$f":"D153+D154+D155+D156*0.5","v":52.290254732414112},67.855759547602446,81.158397993573161,96.123577995948253,69.688644688644686,83.844747002641739,91.584357992340244,96.140564696323381,99.341038118410395,39.81024667931689,42.590238942552112,52.61127971674253,63.948362720403018,80.754143995950912,84.294774992449419,91.61057692307692,68.057596238612987,56.261075014766689,57.457059069962291,52.233009708737868,65.163369882638165,60.759987515605495,null,null,null,null,null,null,null,null,null,null,null,null,null,null,null,null,null,null,null,null,null,null,null,null,null,null,null,"Sanitation","Improved","N/A","N/A","N/A","N/A","N/A","N/A","N/A","N/A","N/A","N/A","N/A","N/A","N/A","N/A","N/A","N/A","N/A","N/A","N/A","N/A","N/A","N/A","N/A"]
[null,"Not Improved",{"$f":"C157+C156*0.5","v":55.741664069803676},{"$f":"D157+D156*0.5","v":47.709745267585888},32.144240452397554,18.841602006426836,3.8764220040517379,30.31135531135531,16.155252997358261,8.4156420076597449,3.8594353036766198,0.65896188158961888,60.18975332068311,57.409761057447888,47.388720283257456,36.051637279596974,19.245856004049099,15.705225007550588,8.3894230769230766,31.942403761387013,43.738924985233311,42.542940930037702,47.76699029126214,34.836630117361835,39.240012484394512,null,null,null,null,null,null,null,null,null,null,null,null,null,null,null,null,null,null,null,null,null,null,null,null,null,null,null,null,"Not Improved","N/A","N/A","N/A","N/A","N/A","N/A","N/A","N/A","N/A","N/A","N/A","N/A","N/A","N/A","N/A","N/A","N/A","N/A","N/A","N/A","N/A","N/A","N/A"]
["Sanitation ladder","Basic",{"$f":"C122*C152/100","v":37.489848503358459},{"$f":"D122*D152/100","v":44.895429312561348},58.60142826941874,71.27208015984985,89.077278864140212,54.095198234849107,67.953972009622362,78.335365987327137,85.882683433414428,95.345603312916751,34.541039525662967,37.21627626466767,46.474202256789233,56.455682145146717,74.722364110121205,70.216149439962862,76.787940997566906,60.352628502741553,52.335883734666687,53.499457592763257,46.844128591813323,56.631309571114635,54.404492821473156,null,null,null,null,null,null,null,null,null,null,null,null,null,null,null,null,null,null,null,null,null,null,null,null,null,null,null,"Sanitation ladder","Basic","N/A","N/A","N/A","N/A","N/A","N/A","N/A","N/A","N/A","N/A","N/A","N/A","N/A","N/A","N/A","N/A","N/A","N/A","N/A","N/A","N/A","N/A","N/A"]
[null,"Limited",{"$f":"C122*C151/100","v":6.7684874268378685},{"$f":"D122*D151/100","v":7.3948254198527623},9.2543312781837059,9.886317833723302,7.0462991318080448,15.593446453795583,15.890774993019384,13.248992005013106,10.257881262908965,3.9954348054936544,5.2692071536539258,5.3739626778844487,6.1370774599533009,7.4926805752563048,6.0317798858297111,14.078625552486564,14.822635925510012,7.7049677358714277,3.9251912801000013,3.9576014771990398,5.3888811169245407,8.5320603115235301,6.355494694132334,null,null,null,null,null,null,null,null,null,null,null,null,null,null,null,null,null,null,null,null,null,null,null,null,null,null,null,null,"Limited","N/A","N/A","N/A","N/A","N/A","N/A","N/A","N/A","N/A","N/A","N/A","N/A","N/A","N/A","N/A","N/A","N/A","N/A","N/A","N/A","N/A","N/A","N/A"]
[null,"Unimproved",{"$f":"100-(C124+C125+C127)","v":30.437831100031161},{"$f":"100-(D124+D125+D127)","v":32.449170366908163},26.001239445348205,15.878987381456241,3.5024154589372074,20.177045177045187,14.041861410282451,7.4077806893771481,3.2906764168189966,0.59813463098132047,32.688172043010752,34.951703101169286,33.225847243297935,30.283375314861459,16.411489307857764,11.607772072888338,7.1875,16.691154863355877,31.66962000393778,34.645999162128192,31.990291262135912,28.153066284643785,17.938514357053691,null,null,null,null,null,null,null,null,null,null,null,null,null,null,null,null,null,null,null,null,null,null,null,null,null,null,null,null,"Unimproved","N/A","N/A","N/A","N/A","N/A","N/A","N/A","N/A","N/A","N/A","N/A","N/A","N/A","N/A","N/A","N/A","N/A","N/A","N/A","N/A","N/A","N/A","N/A"]
[null,"Open defecation",{"$f":"C157","v":25.303832969772515},{"$f":"D157","v":15.260574900677728},6.143001007049345,2.9626146249706089,0.37400654511453951,10.134310134310134,2.1133915870757978,1.0078613182826042,0.56875888685760712,6.0827250608272508E-2,27.501581277672361,22.458057956278594,14.162873039959534,5.7682619647355171,2.8343666961913199,4.097452934662237,1.2019230769230771,15.25124889803115,12.069304981295531,7.8969417679095102,15.776699029126215,6.6835638327180567,21.301498127340825,null,null,null,null,null,null,null,null,null,null,null,null,null,null,null,null,null,null,null,null,null,null,null,null,null,null,null,null,"Open defecation","N/A","N/A","N/A","N/A","N/A","N/A","N/A","N/A","N/A","N/A","N/A","N/A","N/A","N/A","N/A","N/A","N/A","N/A","N/A","N/A","N/A","N/A","N/A"]
["Shared among Improved Sanitation","Yes","N/A","N/A","N/A","N/A","N/A","N/A","N/A","N/A","N/A","N/A","N/A","N/A","N/A","N/A","N/A","N/A","N/A","N/A","N/A","N/A","N/A","N/A","N/A",null,null,null,null,null,null,null,null,null,null,null,null,null,null,null,null,null,null,null,null,null,null,null,null,null,null,null,"Shared among improved sanitation facilities","Yes","N/A","N/A","N/A","N/A","N/A","N/A","N/A","N/A","N/A","N/A","N/A","N/A","N/A","N/A","N/A","N/A","N/A","N/A","N/A","N/A","N/A","N/A","N/A"]
[null,"No","N/A","N/A","N/A","N/A","N/A","N/A","N/A","N/A","N/A","N/A","N/A","N/A","N/A","N/A","N/A","N/A","N/A","N/A","N/A","N/A","N/A","N/A","N/A",null,null,null,null,null,null,null,null,null,null,null,null,null,null,null,null,null,null,null,null,null,null,null,null,null,null,null,null,"No","N/A","N/A","N/A","N/A","N/A","N/A","N/A","N/A","N/A","N/A","N/A","N/A","N/A","N/A","N/A","N/A","N/A","N/A","N/A","N/A","N/A","N/A","N/A"]
["Manually calculated ratios","Improved latrines"]
[null,"Other"]
[null,"Other"]
[null,null,"NATIONAL wealth index quintile",null,null,null,null,"URBAN wealth index quintile",null,null,null,null,"RURAL wealth index quintile",null,null,null,null,"SUB-REGIONS:",null,null,null,null,null,null,null,null,null,null,null,null,null,null,null,null,null,null,null,null,null,null,null,null,null,null,null,null,null,null,null,null,null,null,"Raw numbers of respondents:","Use of sanitation facilities","NATIONAL wealth index quintile",null,null,null,null,"URBAN wealth index quintile",null,null,null,null,"RURAL wealth index quintile",null,null,null,null,"SUB-REGIONS:"]
["Percentage based on weighted population",null,"Poorest","Poor","Middle","Rich","Richest","Poorest","Poor","Middle","Rich","Richest","Poorest","Poor","Middle","Rich","Richest","Central","Metropolitana","Nor-Oriente","Nor-Occidente","Norte","Peten","Sur-Occidente","Sur-Oriente",null,null,null,null,null,null,null,null,null,null,null,null,null,null,null,null,null,null,null,null,null,null,null,null,null,null,null,"Sanitation data, raw numbers (weighted)",null,"Poorest","Poor","Middle","Rich","Richest","Poorest","Poor","Middle","Rich","Richest","Poorest","Poor","Middle","Rich","Richest","Central","Metropolitana","Nor-Oriente","Nor-Occidente","Norte","Peten","Sur-Occidente","Sur-Oriente"]
["Sanitation type","Sewer connection",6.7388594577750078,9.9322271558775412,23.386784413974745,40.191237557802332,77.824528595917101,34.961334961334963,57.427352164194268,69.340858697843174,80.560633759902501,94.079480940794809,2.1252371916508537,1.3599389933909507,5.3363682346990391,9.8992443324937014,27.862836897380745,60.404711567502268,73.725961538461533,26.425213047311196,15.554242961212839,11.981566820276496,3.6407766990291259,27.103421676125407,19.584893882646693,null,null,null,null,null,null,null,null,null,null,null,null,null,null,null,null,null,null,null,null,null,null,null,null,null,null,null,"Sanitation type","Sewer connection","N/A","N/A","N/A","N/A","N/A","N/A","N/A","N/A","N/A","N/A","N/A","N/A","N/A","N/A","N/A","N/A","N/A","N/A","N/A","N/A","N/A","N/A","N/A"]
[null,"Septic tank connection",2.679962605172951,4.9777985510633327,9.9697885196374632,13.668782819970218,7.4333800841514721,4.4363044363044359,5.1209103840682788,8.0628905462608333,5.0375787121673774,2.1695052716950527,2.7071473750790642,3.1392984239959327,8.1183611532625175,12.707808564231737,20.637732506643047,6.6445182724252501,4.0625,14.781075521598588,4.4300059066745421,5.6346878927524084,6.3592233009708732,4.1600088159127226,11.657303370786517,null,null,null,null,null,null,null,null,null,null,null,null,null,null,null,null,null,null,null,null,null,null,null,null,null,null,null,null,"Septic tank connection","N/A","N/A","N/A","N/A","N/A","N/A","N/A","N/A","N/A","N/A","N/A","N/A","N/A","N/A","N/A","N/A","N/A","N/A","N/A","N/A","N/A","N/A","N/A"]
[null,"Improved latrines","N/A","N/A","N/A","N/A","N/A","N/A","N/A","N/A","N/A","N/A","N/A","N/A","N/A","N/A","N/A","N/A","N/A","N/A","N/A","N/A","N/A","N/A","N/A",null,null,null,null,null,null,null,null,null,null,null,null,null,null,null,null,null,null,null,null,null,null,null,null,null,null,null,null,"Improved latrines","N/A","N/A","N/A","N/A","N/A","N/A","N/A","N/A","N/A","N/A","N/A","N/A","N/A","N/A","N/A","N/A","N/A","N/A","N/A","N/A","N/A","N/A","N/A"]
[null,"Unimproved facilities","N/A","N/A","N/A","N/A","N/A","N/A","N/A","N/A","N/A","N/A","N/A","N/A","N/A","N/A","N/A","N/A","N/A","N/A","N/A","N/A","N/A","N/A","N/A",null,null,null,null,null,null,null,null,null,null,null,null,null,null,null,null,null,null,null,null,null,null,null,null,null,null,null,null,"Unimproved facilities","N/A","N/A","N/A","N/A","N/A","N/A","N/A","N/A","N/A","N/A","N/A","N/A","N/A","N/A","N/A","N/A","N/A","N/A","N/A","N/A","N/A","N/A","N/A"]
[null,"Open defecation",25.303832969772515,15.260574900677728,6.143001007049345,2.9626146249706089,0.37400654511453951,10.134310134310134,2.1133915870757978,1.0078613182826042,0.56875888685760712,6.0827250608272508E-2,27.501581277672361,22.458057956278594,14.162873039959534,5.7682619647355171,2.8343666961913199,4.097452934662237,1.2019230769230771,15.25124889803115,12.069304981295531,7.8969417679095102,15.776699029126215,6.6835638327180567,21.301498127340825,null,null,null,null,null,null,null,null,null,null,null,null,null,null,null,null,null,null,null,null,null,null,null,null,null,null,null,null,"Open defecation","N/A","N/A","N/A","N/A","N/A","N/A","N/A","N/A","N/A","N/A","N/A","N/A","N/A","N/A","N/A","N/A","N/A","N/A","N/A","N/A","N/A","N/A","N/A"]
["Septic tank emptying practices","Not emptied/treated and disposed in situ","N/A","N/A","N/A","N/A","N/A","N/A","N/A","N/A","N/A","N/A","N/A","N/A","N/A","N/A","N/A","N/A","N/A","N/A","N/A","N/A","N/A","N/A","N/A",null,null,null,null,null,null,null,null,null,null,null,null,null,null,null,null,null,null,null,null,null,null,null,null,null,null,null,"Septic tank emptying practices","Not emptied/treated and disposed in situ","N/A","N/A","N/A","N/A","N/A","N/A","N/A","N/A","N/A","N/A","N/A","N/A","N/A","N/A","N/A","N/A","N/A","N/A","N/A","N/A","N/A","N/A","N/A"]
[null,"Emptied and buried on site","N/A","N/A","N/A","N/A","N/A","N/A","N/A","N/A","N/A","N/A","N/A","N/A","N/A","N/A","N/A","N/A","N/A","N/A","N/A","N/A","N/A","N/A","N/A",null,null,null,null,null,null,null,null,null,null,null,null,null,null,null,null,null,null,null,null,null,null,null,null,null,null,null,null,"Emptied and buried on site","N/A","N/A","N/A","N/A","N/A","N/A","N/A","N/A","N/A","N/A","N/A","N/A","N/A","N/A","N/A","N/A","N/A","N/A","N/A","N/A","N/A","N/A","N/A"]
[null,"Emptied and discharged locally","N/A","N/A","N/A","N/A","N/A","N/A","N/A","N/A","N/A","N/A","N/A","N/A","N/A","N/A","N/A","N/A","N/A","N/A","N/A","N/A","N/A","N/A","N/A",null,null,null,null,null,null,null,null,null,null,null,null,null,null,null,null,null,null,null,null,null,null,null,null,null,null,null,null,"Emptied and discharged locally","N/A","N/A","N/A","N/A","N/A","N/A","N/A","N/A","N/A","N/A","N/A","N/A","N/A","N/A","N/A","N/A","N/A","N/A","N/A","N/A","N/A","N/A","N/A"]
[null,"Emptied and removed offsite","N/A","N/A","N/A","N/A","N/A","N/A","N/A","N/A","N/A","N/A","N/A","N/A","N/A","N/A","N/A","N/A","N/A","N/A","N/A","N/A","N/A","N/A","N/A",null,null,null,null,null,null,null,null,null,null,null,null,null,null,null,null,null,null,null,null,null,null,null,null,null,null,null,null,"Emptied and removed offsite","N/A","N/A","N/A","N/A","N/A","N/A","N/A","N/A","N/A","N/A","N/A","N/A","N/A","N/A","N/A","N/A","N/A","N/A","N/A","N/A","N/A","N/A","N/A"]
["Latrine emptying practices","Not emptied/treated and disposed in situ","N/A","N/A","N/A","N/A","N/A","N/A","N/A","N/A","N/A","N/A","N/A","N/A","N/A","N/A","N/A","N/A","N/A","N/A","N/A","N/A","N/A","N/A","N/A",null,null,null,null,null,null,null,null,null,null,null,null,null,null,null,null,null,null,null,null,null,null,null,null,null,null,null,"Latrine emptying practices","Not emptied/treated and disposed in situ","N/A","N/A","N/A","N/A","N/A","N/A","N/A","N/A","N/A","N/A","N/A","N/A","N/A","N/A","N/A","N/A","N/A","N/A","N/A","N/A","N/A","N/A","N/A"]
[null,"Emptied and buried on site","N/A","N/A","N/A","N/A","N/A","N/A","N/A","N/A","N/A","N/A","N/A","N/A","N/A","N/A","N/A","N/A","N/A","N/A","N/A","N/A","N/A","N/A","N/A",null,null,null,null,null,null,null,null,null,null,null,null,null,null,null,null,null,null,null,null,null,null,null,null,null,null,null,null,"Emptied and buried on site","N/A","N/A","N/A","N/A","N/A","N/A","N/A","N/A","N/A","N/A","N/A","N/A","N/A","N/A","N/A","N/A","N/A","N/A","N/A","N/A","N/A","N/A","N/A"]
[null,"Emptied and discharged locally","N/A","N/A","N/A","N/A","N/A","N/A","N/A","N/A","N/A","N/A","N/A","N/A","N/A","N/A","N/A","N/A","N/A","N/A","N/A","N/A","N/A","N/A","N/A",null,null,null,null,null,null,null,null,null,null,null,null,null,null,null,null,null,null,null,null,null,null,null,null,null,null,null,null,"Emptied and discharged locally","N/A","N/A","N/A","N/A","N/A","N/A","N/A","N/A","N/A","N/A","N/A","N/A","N/A","N/A","N/A","N/A","N/A","N/A","N/A","N/A","N/A","N/A","N/A"]
[null,"Emptied and removed offsite","N/A","N/A","N/A","N/A","N/A","N/A","N/A","N/A","N/A","N/A","N/A","N/A","N/A","N/A","N/A","N/A","N/A","N/A","N/A","N/A","N/A","N/A","N/A",null,null,null,null,null,null,null,null,null,null,null,null,null,null,null,null,null,null,null,null,null,null,null,null,null,null,null,null,"Emptied and removed offsite","N/A","N/A","N/A","N/A","N/A","N/A","N/A","N/A","N/A","N/A","N/A","N/A","N/A","N/A","N/A","N/A","N/A","N/A","N/A","N/A","N/A","N/A","N/A"]
["Shared among improved sanitation facilities","Yes","N/A","N/A","N/A","N/A","N/A","N/A","N/A","N/A","N/A","N/A","N/A","N/A","N/A","N/A","N/A","N/A","N/A","N/A","N/A","N/A","N/A","N/A","N/A",null,null,null,null,null,null,null,null,null,null,null,null,null,null,null,null,null,null,null,null,null,null,null,null,null,null,null,"Shared among improved sanitation facilities","Yes","N/A","N/A","N/A","N/A","N/A","N/A","N/A","N/A","N/A","N/A","N/A","N/A","N/A","N/A","N/A","N/A","N/A","N/A","N/A","N/A","N/A","N/A","N/A"]
[null,"No","N/A","N/A","N/A","N/A","N/A","N/A","N/A","N/A","N/A","N/A","N/A","N/A","N/A","N/A","N/A","N/A","N/A","N/A","N/A","N/A","N/A","N/A","N/A",null,null,null,null,null,null,null,null,null,null,null,null,null,null,null,null,null,null,null,null,null,null,null,null,null,null,null,null,"No","N/A","N/A","N/A","N/A","N/A","N/A","N/A","N/A","N/A","N/A","N/A","N/A","N/A","N/A","N/A","N/A","N/A","N/A","N/A","N/A","N/A","N/A","N/A"]
[null,"DK/missing","N/A","N/A","N/A","N/A","N/A","N/A","N/A","N/A","N/A","N/A","N/A","N/A","N/A","N/A","N/A","N/A","N/A","N/A","N/A","N/A","N/A","N/A","N/A",null,null,null,null,null,null,null,null,null,null,null,null,null,null,null,null,null,null,null,null,null,null,null,null,null,null,null,null,"DK/missing","N/A","N/A","N/A","N/A","N/A","N/A","N/A","N/A","N/A","N/A","N/A","N/A","N/A","N/A","N/A","N/A","N/A","N/A","N/A","N/A","N/A","N/A","N/A"]
["Shared among all sanitation facilities","Yes",15.293135823075318,14.141880657675966,13.638239907537356,12.181509342392623,7.3304586436691492,22.375878485604172,18.952618453865338,14.466435421342583,10.669670284661068,4.0219378427787937,13.235806339254616,12.617827021663636,11.664946173130806,11.716766867067468,7.4693131365891885,16.70165861851774,16.180048661800488,11.321245770798994,6.9767441860465116,6.8879290747897253,10.317002881844381,13.093338062304191,10.459999999999999,null,null,null,null,null,null,null,null,null,null,null,null,null,null,null,null,null,null,null,null,null,null,null,null,null,null,null,"Shared among all sanitation facilities","Yes","N/A","N/A","N/A","N/A","N/A","N/A","N/A","N/A","N/A","N/A","N/A","N/A","N/A","N/A","N/A","N/A","N/A","N/A","N/A","N/A","N/A","N/A","N/A"]
[null,"No",84.706864176924682,85.858119342324031,86.361760092462646,87.81849065760737,92.669541356330853,77.624121514395824,81.047381546134673,85.533564578657419,89.330329715338934,95.978062157221217,86.764193660745377,87.382172978336371,88.335053826869199,88.283233132932537,92.530686863410821,83.29834138148226,83.819951338199516,88.678754229201004,93.023255813953483,93.112070925210276,89.682997118155612,86.906661937695802,89.539999999999992,null,null,null,null,null,null,null,null,null,null,null,null,null,null,null,null,null,null,null,null,null,null,null,null,null,null,null,null,"No","N/A","N/A","N/A","N/A","N/A","N/A","N/A","N/A","N/A","N/A","N/A","N/A","N/A","N/A","N/A","N/A","N/A","N/A","N/A","N/A","N/A","N/A","N/A"]
["¿Qué tipo de servicio sanitario tiene este hogar?","Inodoro conectado a la red de drenaje",6.7388594577750078,9.9322271558775412,23.386784413974745,40.191237557802332,77.824528595917101,34.961334961334963,57.427352164194268,69.340858697843174,80.560633759902501,94.079480940794809,2.1252371916508537,1.3599389933909507,5.3363682346990391,9.8992443324937014,27.862836897380745,60.404711567502268,73.725961538461533,26.425213047311196,15.554242961212839,11.981566820276496,3.6407766990291259,27.103421676125407,19.584893882646693,null,null,null,null,null,null,null,null,null,null,null,null,null,null,null,null,null,null,null,null,null,null,null,null,null,null,null,"¿Qué tipo de servicio sanitario tiene este hogar?","Inodoro conectado a la red de drenaje",865,1275,3019,5128,9988,1718,2826,3440,3966,4640,168,107,422,786,2202,6000,3067,3597,790,572,75,4919,1255]
[null,"Inodoro conectado a fosa séptica",2.679962605172951,4.9777985510633327,9.9697885196374632,13.668782819970218,7.4333800841514721,4.4363044363044359,5.1209103840682788,8.0628905462608333,5.0375787121673774,2.1695052716950527,2.7071473750790642,3.1392984239959327,8.1183611532625175,12.707808564231737,20.637732506643047,6.6445182724252501,4.0625,14.781075521598588,4.4300059066745421,5.6346878927524084,6.3592233009708732,4.1600088159127226,11.657303370786517,null,null,null,null,null,null,null,null,null,null,null,null,null,null,null,null,null,null,null,null,null,null,null,null,null,null,null,null,"Inodoro conectado a fosa séptica",344,639,1287,1744,954,218,252,400,248,107,214,247,642,1009,1631,660,169,2012,225,269,131,755,747]
[null,"Excusado lavable",4.401682767217201,4.9310586585650853,8.4979471686420318,11.419390234344384,7.3632538569424959,10.113960113960115,7.2546230440967276,6.7728280588591012,7.2516758074344905,2.4939172749391729,2.2896900695762175,3.1392984239959327,5.9307030854830547,11.057934508816121,15.842085284069341,5.6377730796335452,6.634615384615385,10.160152806347341,4.6072061429415241,5.1948051948051948,10.242718446601943,5.7468731059562508,11.579275905118603,null,null,null,null,null,null,null,null,null,null,null,null,null,null,null,null,null,null,null,null,null,null,null,null,null,null,null,null,"Excusado lavable",565,633,1097,1457,945,497,357,336,357,123,181,247,469,878,1252,560,276,1383,234,248,211,1043,742]
[null,"Letrina o pozo ciego",60.875662200062322,64.898340733816312,52.002478890696416,31.757974762912454,7.004830917874397,40.354090354090353,28.083722820564926,14.815561378754282,6.5813528336380251,1.1962692619626927,65.376344086021504,69.903406202338587,66.451694486595841,60.566750629722918,32.822978615715556,23.215544145776704,14.374999999999998,33.382309726711725,63.33924000787556,69.291998324256383,63.980582524271846,56.306132569287556,35.877028714107368,null,null,null,null,null,null,null,null,null,null,null,null,null,null,null,null,null,null,null,null,null,null,null,null,null,null,null,null,"Letrina o pozo ciego",7814,8331,6713,4052,899,1983,1382,735,324,59,5168,5500,5255,4809,2594,2306,598,4544,3217,3308,1318,10219,2299]
[null,"No tiene",25.303832969772515,15.260574900677728,6.143001007049345,2.9626146249706089,0.37400654511453951,10.134310134310134,2.1133915870757978,1.0078613182826042,0.56875888685760712,6.0827250608272508E-2,27.501581277672361,22.458057956278594,14.162873039959534,5.7682619647355171,2.8343666961913199,4.097452934662237,1.2019230769230771,15.25124889803115,12.069304981295531,7.8969417679095102,15.776699029126215,6.6835638327180567,21.301498127340825,null,null,null,null,null,null,null,null,null,null,null,null,null,null,null,null,null,null,null,null,null,null,null,null,null,null,null,null,"No tiene",3248,1959,793,378,48,498,104,50,28,3,2174,1767,1120,458,224,407,50,2076,613,377,325,1213,1365]
[null,null,null,null,null,null,null,null,null,null,null,null,null,null,null,null,null,null,null,null,null,null,null,null,null,null,null,null,null,null,null,null,null,null,null,null,null,null,null,null,null,null,null,null,null,null,null,null,null,null,null,null,null,"Total",12836,12837,12909,12759,12834,4914,4921,4961,4923,4932,7905,7868,7908,7940,7903,9933,4160,13612,5079,4774,2060,18149,6408]
[]
[]
[]
[]
[]
[]
[]
[]
[]
[]
[]
[]
[]
[]
[]
[]
[]
[]
[]
[]
[]
[]
[]
[]
[]
[]
[]
[]
[]
[]
[]
[]
[]
[]
[]
[]
[]
[]
[]
[]
[]
[]
[]
[]
[]
[]
[]
[]
[]
[{"$f":"A1026","v":"Guatemala"}]
[{"$f":"A1034","v":"2011"}]
["Access to hygiene facilities "]
[" by wealth quintile and sub-national region"]
["Notes:"]
["WHO/UNICEF JMP customised wealth index excludes water,"]
[" sanitation and hygiene assets."]
["Survey used for analysis:",{"$f":"A1025","v":"ENCOVI11"}]
[]
[]
[]
[]
["Access to handwashing",null,"NATIONAL wealth index quintile",null,null,null,null,"URBAN wealth index quintile",null,null,null,null,"RURAL wealth index quintile",null,null,null,null,"SUB-REGIONS:",null,null,null,null,null,null,null,null,null,null,null,null,null,null,null,null,null,null,null,null,null,null,null,null,null,null,null,null,null,null,null,null,null,null,"Raw numbers of respondents:","Access to handwashing","NATIONAL wealth index quintile",null,null,null,null,"URBAN wealth index quintile",null,null,null,null,"RURAL wealth index quintile",null,null,null,null,"SUB-REGIONS:"]
["Weighted percentage (used in graphs)",null,"Poorest","Poor","Middle","Rich","Richest","Poorest","Poor","Middle","Rich","Richest","Poorest","Poor","Middle","Rich","Richest","Central","Metropolitana","Nor-Oriente","Nor-Occidente","Norte","Peten","Sur-Occidente","Sur-Oriente",null,null,null,null,null,null,null,null,null,null,null,null,null,null,null,null,null,null,null,null,null,null,null,null,null,null,null,"Hygiene data, raw numbers (weighted)",null,"Poorest","Poor","Middle","Rich","Richest","Poorest","Poor","Middle","Rich","Richest","Poorest","Poor","Middle","Rich","Richest","Central","Metropolitana","Nor-Oriente","Nor-Occidente","Norte","Peten","Sur-Occidente","Sur-Oriente"]
["Hygiene ladder","Basic","N/A","N/A","N/A","N/A","N/A","N/A","N/A","N/A","N/A","N/A","N/A","N/A","N/A","N/A","N/A","N/A","N/A","N/A","N/A","N/A","N/A","N/A","N/A",null,null,null,null,null,null,null,null,null,null,null,null,null,null,null,null,null,null,null,null,null,null,null,null,null,null,null,"Hygiene ladder","Basic","N/A","N/A","N/A","N/A","N/A","N/A","N/A","N/A","N/A","N/A","N/A","N/A","N/A","N/A","N/A","N/A","N/A","N/A","N/A","N/A","N/A","N/A","N/A"]
[null,"Limited","N/A","N/A","N/A","N/A","N/A","N/A","N/A","N/A","N/A","N/A","N/A","N/A","N/A","N/A","N/A","N/A","N/A","N/A","N/A","N/A","N/A","N/A","N/A",null,null,null,null,null,null,null,null,null,null,null,null,null,null,null,null,null,null,null,null,null,null,null,null,null,null,null,null,"Limited","N/A","N/A","N/A","N/A","N/A","N/A","N/A","N/A","N/A","N/A","N/A","N/A","N/A","N/A","N/A","N/A","N/A","N/A","N/A","N/A","N/A","N/A","N/A"]
[null,"No facility","N/A","N/A","N/A","N/A","N/A","N/A","N/A","N/A","N/A","N/A","N/A","N/A","N/A","N/A","N/A","N/A","N/A","N/A","N/A","N/A","N/A","N/A","N/A",null,null,null,null,null,null,null,null,null,null,null,null,null,null,null,null,null,null,null,null,null,null,null,null,null,null,null,null,"No facility","N/A","N/A","N/A","N/A","N/A","N/A","N/A","N/A","N/A","N/A","N/A","N/A","N/A","N/A","N/A","N/A","N/A","N/A","N/A","N/A","N/A","N/A","N/A"]
[null,null,null,null,null,null,null,null,null,null,null,null,null,null,null,null,null,null,null,null,null,null,null,null,null,null,null,null,null,null,null,null,null,null,null,null,null,null,null,null,null,null,null,null,null,null,null,null,null,null,null,null,"Observed handwashing place","Fixed","N/A","N/A","N/A","N/A","N/A","N/A","N/A","N/A","N/A","N/A","N/A","N/A","N/A","N/A","N/A","N/A","N/A","N/A","N/A","N/A","N/A","N/A","N/A"]
[null,null,null,null,null,null,null,null,null,null,null,null,null,null,null,null,null,null,null,null,null,null,null,null,null,null,null,null,null,null,null,null,null,null,null,null,null,null,null,null,null,null,null,null,null,null,null,null,null,null,null,null,null,"Mobile","N/A","N/A","N/A","N/A","N/A","N/A","N/A","N/A","N/A","N/A","N/A","N/A","N/A","N/A","N/A","N/A","N/A","N/A","N/A","N/A","N/A","N/A","N/A"]
[null,null,null,null,null,null,null,null,null,null,null,null,null,null,null,null,null,null,null,null,null,null,null,null,null,null,null,null,null,null,null,null,null,null,null,null,null,null,null,null,null,null,null,null,null,null,null,null,null,null,null,null,"Water / Soap","Water and soap","N/A","N/A","N/A","N/A","N/A","N/A","N/A","N/A","N/A","N/A","N/A","N/A","N/A","N/A","N/A","N/A","N/A","N/A","N/A","N/A","N/A","N/A","N/A"]
[null,null,null,null,null,null,null,null,null,null,null,null,null,null,null,null,null,null,null,null,null,null,null,null,null,null,null,null,null,null,null,null,null,null,null,null,null,null,null,null,null,null,null,null,null,null,null,null,null,null,null,null,null,"Water only","N/A","N/A","N/A","N/A","N/A","N/A","N/A","N/A","N/A","N/A","N/A","N/A","N/A","N/A","N/A","N/A","N/A","N/A","N/A","N/A","N/A","N/A","N/A"]
[null,null,null,null,null,null,null,null,null,null,null,null,null,null,null,null,null,null,null,null,null,null,null,null,null,null,null,null,null,null,null,null,null,null,null,null,null,null,null,null,null,null,null,null,null,null,null,null,null,null,null,null,null,"Soap only","N/A","N/A","N/A","N/A","N/A","N/A","N/A","N/A","N/A","N/A","N/A","N/A","N/A","N/A","N/A","N/A","N/A","N/A","N/A","N/A","N/A","N/A","N/A"]
[null,null,null,null,null,null,null,null,null,null,null,null,null,null,null,null,null,null,null,null,null,null,null,null,null,null,null,null,null,null,null,null,null,null,null,null,null,null,null,null,null,null,null,null,null,null,null,null,null,null,null,null,null,"Neither","N/A","N/A","N/A","N/A","N/A","N/A","N/A","N/A","N/A","N/A","N/A","N/A","N/A","N/A","N/A","N/A","N/A","N/A","N/A","N/A","N/A","N/A","N/A"]
[]
[]
[]
[]
[]
[]
[]
[]
[]
[]
[]
[]
[]
[]
[]
[]
[]
[]
[]
[]
[]
[]
[]
[]
[]
[]
[]
[]
[null,null,null,null,null,null,null,null,null,null,null,null,null,null,null,null,null,null,null,null,null,null,null,null,null,null,null,null,null,null,null,null,null,null,null,null,null,null,null,null,null,null,null,null,null,null,null,null,null,null,null,null,"Raw numbers of respondents:","Menstrual health and hygiene","NATIONAL wealth index quintile",null,null,null,null,"URBAN wealth index quintile",null,null,null,null,"RURAL wealth index quintile",null,null,null,null,"SUB-REGIONS:"]
[null,null,null,null,null,null,null,null,null,null,null,null,null,null,null,null,null,null,null,null,null,null,null,null,null,null,null,null,null,null,null,null,null,null,null,null,null,null,null,null,null,null,null,null,null,null,null,null,null,null,null,null,"MHH data, raw numbers (weighted)",null,"Poorest","Poor","Middle","Rich","Richest","Poorest","Poor","Middle","Rich","Richest","Poorest","Poor","Middle","Rich","Richest","Central","Metropolitana","Nor-Oriente","Nor-Occidente","Norte","Peten","Sur-Occidente","Sur-Oriente"]
[null,null,null,null,null,null,null,null,null,null,null,null,null,null,null,null,null,null,null,null,null,null,null,null,null,null,null,null,null,null,null,null,null,null,null,null,null,null,null,null,null,null,null,null,null,null,null,null,null,null,null,null,"Private place to wash and change","Yes","N/A","N/A","N/A","N/A","N/A","N/A","N/A","N/A","N/A","N/A","N/A","N/A","N/A","N/A","N/A","N/A","N/A","N/A","N/A","N/A","N/A","N/A","N/A"]
[null,null,null,null,null,null,null,null,null,null,null,null,null,null,null,null,null,null,null,null,null,null,null,null,null,null,null,null,null,null,null,null,null,null,null,null,null,null,null,null,null,null,null,null,null,null,null,null,null,null,null,null,null,"No","N/A","N/A","N/A","N/A","N/A","N/A","N/A","N/A","N/A","N/A","N/A","N/A","N/A","N/A","N/A","N/A","N/A","N/A","N/A","N/A","N/A","N/A","N/A"]
[null,null,null,null,null,null,null,null,null,null,null,null,null,null,null,null,null,null,null,null,null,null,null,null,null,null,null,null,null,null,null,null,null,null,null,null,null,null,null,null,null,null,null,null,null,null,null,null,null,null,null,null,null,"DK/not sure/missing","N/A","N/A","N/A","N/A","N/A","N/A","N/A","N/A","N/A","N/A","N/A","N/A","N/A","N/A","N/A","N/A","N/A","N/A","N/A","N/A","N/A","N/A","N/A"]
[null,null,null,null,null,null,null,null,null,null,null,null,null,null,null,null,null,null,null,null,null,null,null,null,null,null,null,null,null,null,null,null,null,null,null,null,null,null,null,null,null,null,null,null,null,null,null,null,null,null,null,null,"Use of menstrual materials","Materials reusable","N/A","N/A","N/A","N/A","N/A","N/A","N/A","N/A","N/A","N/A","N/A","N/A","N/A","N/A","N/A","N/A","N/A","N/A","N/A","N/A","N/A","N/A","N/A"]
[null,null,null,null,null,null,null,null,null,null,null,null,null,null,null,null,null,null,null,null,null,null,null,null,null,null,null,null,null,null,null,null,null,null,null,null,null,null,null,null,null,null,null,null,null,null,null,null,null,null,null,null,null,"Materials not reusable","N/A","N/A","N/A","N/A","N/A","N/A","N/A","N/A","N/A","N/A","N/A","N/A","N/A","N/A","N/A","N/A","N/A","N/A","N/A","N/A","N/A","N/A","N/A"]
[null,null,null,null,null,null,null,null,null,null,null,null,null,null,null,null,null,null,null,null,null,null,null,null,null,null,null,null,null,null,null,null,null,null,null,null,null,null,null,null,null,null,null,null,null,null,null,null,null,null,null,null,null,"No materials used","N/A","N/A","N/A","N/A","N/A","N/A","N/A","N/A","N/A","N/A","N/A","N/A","N/A","N/A","N/A","N/A","N/A","N/A","N/A","N/A","N/A","N/A","N/A"]
[null,null,null,null,null,null,null,null,null,null,null,null,null,null,null,null,null,null,null,null,null,null,null,null,null,null,null,null,null,null,null,null,null,null,null,null,null,null,null,null,null,null,null,null,null,null,null,null,null,null,null,null,null,"DK/not sure/missing","N/A","N/A","N/A","N/A","N/A","N/A","N/A","N/A","N/A","N/A","N/A","N/A","N/A","N/A","N/A","N/A","N/A","N/A","N/A","N/A","N/A","N/A","N/A"]
[null,null,null,null,null,null,null,null,null,null,null,null,null,null,null,null,null,null,null,null,null,null,null,null,null,null,null,null,null,null,null,null,null,null,null,null,null,null,null,null,null,null,null,null,null,null,null,null,null,null,null,null,"Use of menstrual materials with private place to wash and change","Materials reusable","N/A","N/A","N/A","N/A","N/A","N/A","N/A","N/A","N/A","N/A","N/A","N/A","N/A","N/A","N/A","N/A","N/A","N/A","N/A","N/A","N/A","N/A","N/A"]
[null,null,null,null,null,null,null,null,null,null,null,null,null,null,null,null,null,null,null,null,null,null,null,null,null,null,null,null,null,null,null,null,null,null,null,null,null,null,null,null,null,null,null,null,null,null,null,null,null,null,null,null,null,"Materials not reusable","N/A","N/A","N/A","N/A","N/A","N/A","N/A","N/A","N/A","N/A","N/A","N/A","N/A","N/A","N/A","N/A","N/A","N/A","N/A","N/A","N/A","N/A","N/A"]
[null,null,null,null,null,null,null,null,null,null,null,null,null,null,null,null,null,null,null,null,null,null,null,null,null,null,null,null,null,null,null,null,null,null,null,null,null,null,null,null,null,null,null,null,null,null,null,null,null,null,null,null,null,"No materials used","N/A","N/A","N/A","N/A","N/A","N/A","N/A","N/A","N/A","N/A","N/A","N/A","N/A","N/A","N/A","N/A","N/A","N/A","N/A","N/A","N/A","N/A","N/A"]
[null,null,null,null,null,null,null,null,null,null,null,null,null,null,null,null,null,null,null,null,null,null,null,null,null,null,null,null,null,null,null,null,null,null,null,null,null,null,null,null,null,null,null,null,null,null,null,null,null,null,null,null,"Awareness of menstruation before menarche","Yes","N/A","N/A","N/A","N/A","N/A","N/A","N/A","N/A","N/A","N/A","N/A","N/A","N/A","N/A","N/A","N/A","N/A","N/A","N/A","N/A","N/A","N/A","N/A"]
[null,null,null,null,null,null,null,null,null,null,null,null,null,null,null,null,null,null,null,null,null,null,null,null,null,null,null,null,null,null,null,null,null,null,null,null,null,null,null,null,null,null,null,null,null,null,null,null,null,null,null,null,null,"No","N/A","N/A","N/A","N/A","N/A","N/A","N/A","N/A","N/A","N/A","N/A","N/A","N/A","N/A","N/A","N/A","N/A","N/A","N/A","N/A","N/A","N/A","N/A"]
[null,null,null,null,null,null,null,null,null,null,null,null,null,null,null,null,null,null,null,null,null,null,null,null,null,null,null,null,null,null,null,null,null,null,null,null,null,null,null,null,null,null,null,null,null,null,null,null,null,null,null,null,null,"DK/not sure/missing","N/A","N/A","N/A","N/A","N/A","N/A","N/A","N/A","N/A","N/A","N/A","N/A","N/A","N/A","N/A","N/A","N/A","N/A","N/A","N/A","N/A","N/A","N/A"]
[null,null,null,null,null,null,null,null,null,null,null,null,null,null,null,null,null,null,null,null,null,null,null,null,null,null,null,null,null,null,null,null,null,null,null,null,null,null,null,null,null,null,null,null,null,null,null,null,null,null,null,null,"Participation in (all) activities during menstruation","Yes","N/A","N/A","N/A","N/A","N/A","N/A","N/A","N/A","N/A","N/A","N/A","N/A","N/A","N/A","N/A","N/A","N/A","N/A","N/A","N/A","N/A","N/A","N/A"]
[null,null,null,null,null,null,null,null,null,null,null,null,null,null,null,null,null,null,null,null,null,null,null,null,null,null,null,null,null,null,null,null,null,null,null,null,null,null,null,null,null,null,null,null,null,null,null,null,null,null,null,null,null,"No","N/A","N/A","N/A","N/A","N/A","N/A","N/A","N/A","N/A","N/A","N/A","N/A","N/A","N/A","N/A","N/A","N/A","N/A","N/A","N/A","N/A","N/A","N/A"]
[null,null,null,null,null,null,null,null,null,null,null,null,null,null,null,null,null,null,null,null,null,null,null,null,null,null,null,null,null,null,null,null,null,null,null,null,null,null,null,null,null,null,null,null,null,null,null,null,null,null,null,null,null,"DK/not sure/missing/no such activity","N/A","N/A","N/A","N/A","N/A","N/A","N/A","N/A","N/A","N/A","N/A","N/A","N/A","N/A","N/A","N/A","N/A","N/A","N/A","N/A","N/A","N/A","N/A"]
[null,null,null,null,null,null,null,null,null,null,null,null,null,null,null,null,null,null,null,null,null,null,null,null,null,null,null,null,null,null,null,null,null,null,null,null,null,null,null,null,null,null,null,null,null,null,null,null,null,null,null,null,"Participation in specific activities during menstruation","Did not go to school (amongst those usually attending school)","N/A","N/A","N/A","N/A","N/A","N/A","N/A","N/A","N/A","N/A","N/A","N/A","N/A","N/A","N/A","N/A","N/A","N/A","N/A","N/A","N/A","N/A","N/A"]
[null,null,null,null,null,null,null,null,null,null,null,null,null,null,null,null,null,null,null,null,null,null,null,null,null,null,null,null,null,null,null,null,null,null,null,null,null,null,null,null,null,null,null,null,null,null,null,null,null,null,null,null,null,"Did not go to work (amongst those who usually work)","N/A","N/A","N/A","N/A","N/A","N/A","N/A","N/A","N/A","N/A","N/A","N/A","N/A","N/A","N/A","N/A","N/A","N/A","N/A","N/A","N/A","N/A","N/A"]
[null,null,null,null,null,null,null,null,null,null,null,null,null,null,null,null,null,null,null,null,null,null,null,null,null,null,null,null,null,null,null,null,null,null,null,null,null,null,null,null,null,null,null,null,null,null,null,null,null,null,null,null,null,"Did not participate in social activities","N/A","N/A","N/A","N/A","N/A","N/A","N/A","N/A","N/A","N/A","N/A","N/A","N/A","N/A","N/A","N/A","N/A","N/A","N/A","N/A","N/A","N/A","N/A"]
[null,null,null,null,null,null,null,null,null,null,null,null,null,null,null,null,null,null,null,null,null,null,null,null,null,null,null,null,null,null,null,null,null,null,null,null,null,null,null,null,null,null,null,null,null,null,null,null,null,null,null,null,null,"Did not cook food","N/A","N/A","N/A","N/A","N/A","N/A","N/A","N/A","N/A","N/A","N/A","N/A","N/A","N/A","N/A","N/A","N/A","N/A","N/A","N/A","N/A","N/A","N/A"]
[null,null,null,null,null,null,null,null,null,null,null,null,null,null,null,null,null,null,null,null,null,null,null,null,null,null,null,null,null,null,null,null,null,null,null,null,null,null,null,null,null,null,null,null,null,null,null,null,null,null,null,null,null,"Did not eat with others","N/A","N/A","N/A","N/A","N/A","N/A","N/A","N/A","N/A","N/A","N/A","N/A","N/A","N/A","N/A","N/A","N/A","N/A","N/A","N/A","N/A","N/A","N/A"]
[null,null,null,null,null,null,null,null,null,null,null,null,null,null,null,null,null,null,null,null,null,null,null,null,null,null,null,null,null,null,null,null,null,null,null,null,null,null,null,null,null,null,null,null,null,null,null,null,null,null,null,null,null,"Did not bathe in regular place","N/A","N/A","N/A","N/A","N/A","N/A","N/A","N/A","N/A","N/A","N/A","N/A","N/A","N/A","N/A","N/A","N/A","N/A","N/A","N/A","N/A","N/A","N/A"]
[null,null,null,null,null,null,null,null,null,null,null,null,null,null,null,null,null,null,null,null,null,null,null,null,null,null,null,null,null,null,null,null,null,null,null,null,null,null,null,null,null,null,null,null,null,null,null,null,null,null,null,null,null,"Did not participate in other activities","N/A","N/A","N/A","N/A","N/A","N/A","N/A","N/A","N/A","N/A","N/A","N/A","N/A","N/A","N/A","N/A","N/A","N/A","N/A","N/A","N/A","N/A","N/A"]
[null,null,null,null,null,null,null,null,null,null,null,null,null,null,null,null,null,null,null,null,null,null,null,null,null,null,null,null,null,null,null,null,null,null,null,null,null,null,null,null,null,null,null,null,null,null,null,null,null,null,null,null,null,"DK/not sure/missing/no such activity","N/A","N/A","N/A","N/A","N/A","N/A","N/A","N/A","N/A","N/A","N/A","N/A","N/A","N/A","N/A","N/A","N/A","N/A","N/A","N/A","N/A","N/A","N/A"]
[]
[]
[]
[]
[]
[]
[]
[]
[]
[]
[]
[]
[]
[]
[]
[]
[]
[]
[]
[]
[]
[]
[]
[]
[]
[]
[]
[]
[]
[]
[]
[]
[]
[]
[]
[]
[]
[]
[]
[]
[]
[]
[]
[]
[]
[]
[]
[]
[]
[]
[]
[]
[]
[]
[null,null,null,null,null,null,null,null,null,null,null,null,null,null,null,null,null,null,null,null,null,null,null,null,null,null,null,null,null,null,null,null,null,null,null,null,null,null,null,null,null,null,null,null,null,null,null,null,null,null,null,null,"Raw numbers of respondents:","Basic water, sanitation and hygiene","NATIONAL wealth index quintile",null,null,null,null,"URBAN wealth index quintile",null,null,null,null,"RURAL wealth index quintile",null,null,null,null,"SUB-REGIONS:"]
[null,null,null,null,null,null,null,null,null,null,null,null,null,null,null,null,null,null,null,null,null,null,null,null,null,null,null,null,null,null,null,null,null,null,null,null,null,null,null,null,null,null,null,null,null,null,null,null,null,null,null,null,"WatSan data, raw numbers (weighted)",null,"Poorest","Poor","Middle","Rich","Richest","Poorest","Poor","Middle","Rich","Richest","Poorest","Poor","Middle","Rich","Richest","Central","Metropolitana","Nor-Oriente","Nor-Occidente","Norte","Peten","Sur-Occidente","Sur-Oriente"]
[null,null,null,null,null,null,null,null,null,null,null,null,null,null,null,null,null,null,null,null,null,null,null,null,null,null,null,null,null,null,null,null,null,null,null,null,null,null,null,null,null,null,null,null,null,null,null,null,null,null,null,null,"Use of Basic Water Sanitation and Hygiene","Yes","N/A","N/A","N/A","N/A","N/A","N/A","N/A","N/A","N/A","N/A","N/A","N/A","N/A","N/A","N/A","N/A","N/A","N/A","N/A","N/A","N/A","N/A","N/A"]
[null,null,null,null,null,null,null,null,null,null,null,null,null,null,null,null,null,null,null,null,null,null,null,null,null,null,null,null,null,null,null,null,null,null,null,null,null,null,null,null,null,null,null,null,null,null,null,null,null,null,null,null,null,"No","N/A","N/A","N/A","N/A","N/A","N/A","N/A","N/A","N/A","N/A","N/A","N/A","N/A","N/A","N/A","N/A","N/A","N/A","N/A","N/A","N/A","N/A","N/A"]
[null,null,null,null,null,null,null,null,null,null,null,null,null,null,null,null,null,null,null,null,null,null,null,null,null,null,null,null,null,null,null,null,null,null,null,null,null,null,null,null,null,null,null,null,null,null,null,null,null,null,null,null,"Use of Basic Water and Sanitation","Yes","N/A","N/A","N/A","N/A","N/A","N/A","N/A","N/A","N/A","N/A","N/A","N/A","N/A","N/A","N/A","N/A","N/A","N/A","N/A","N/A","N/A","N/A","N/A"]
[null,null,null,null,null,null,null,null,null,null,null,null,null,null,null,null,null,null,null,null,null,null,null,null,null,null,null,null,null,null,null,null,null,null,null,null,null,null,null,null,null,null,null,null,null,null,null,null,null,null,null,null,null,"No","N/A","N/A","N/A","N/A","N/A","N/A","N/A","N/A","N/A","N/A","N/A","N/A","N/A","N/A","N/A","N/A","N/A","N/A","N/A","N/A","N/A","N/A","N/A"]
[null,null,null,null,null,null,null,null,null,null,null,null,null,null,null,null,null,null,null,null,null,null,null,null,null,null,null,null,null,null,null,null,null,null,null,null,null,null,null,null,null,null,null,null,null,null,null,null,null,null,null,null,"Use of Basic Water and Hygiene","Yes","N/A","N/A","N/A","N/A","N/A","N/A","N/A","N/A","N/A","N/A","N/A","N/A","N/A","N/A","N/A","N/A","N/A","N/A","N/A","N/A","N/A","N/A","N/A"]
[null,null,null,null,null,null,null,null,null,null,null,null,null,null,null,null,null,null,null,null,null,null,null,null,null,null,null,null,null,null,null,null,null,null,null,null,null,null,null,null,null,null,null,null,null,null,null,null,null,null,null,null,null,"No","N/A","N/A","N/A","N/A","N/A","N/A","N/A","N/A","N/A","N/A","N/A","N/A","N/A","N/A","N/A","N/A","N/A","N/A","N/A","N/A","N/A","N/A","N/A"]
[null,null,null,null,null,null,null,null,null,null,null,null,null,null,null,null,null,null,null,null,null,null,null,null,null,null,null,null,null,null,null,null,null,null,null,null,null,null,null,null,null,null,null,null,null,null,null,null,null,null,null,null,"Use of Basic Sanitation and Hygiene","Yes","N/A","N/A","N/A","N/A","N/A","N/A","N/A","N/A","N/A","N/A","N/A","N/A","N/A","N/A","N/A","N/A","N/A","N/A","N/A","N/A","N/A","N/A","N/A"]
[null,null,null,null,null,null,null,null,null,null,null,null,null,null,null,null,null,null,null,null,null,null,null,null,null,null,null,null,null,null,null,null,null,null,null,null,null,null,null,null,null,null,null,null,null,null,null,null,null,null,null,null,null,"No","N/A","N/A","N/A","N/A","N/A","N/A","N/A","N/A","N/A","N/A","N/A","N/A","N/A","N/A","N/A","N/A","N/A","N/A","N/A","N/A","N/A","N/A","N/A"]
[null,null,null,null,null,null,null,null,null,null,null,null,null,null,null,null,null,null,null,null,null,null,null,null,null,null,null,null,null,null,null,null,null,null,null,null,null,null,null,null,null,null,null,null,null,null,null,null,null,null,null,null,"Use of Basic Water","Yes","N/A","N/A","N/A","N/A","N/A","N/A","N/A","N/A","N/A","N/A","N/A","N/A","N/A","N/A","N/A","N/A","N/A","N/A","N/A","N/A","N/A","N/A","N/A"]
[null,null,null,null,null,null,null,null,null,null,null,null,null,null,null,null,null,null,null,null,null,null,null,null,null,null,null,null,null,null,null,null,null,null,null,null,null,null,null,null,null,null,null,null,null,null,null,null,null,null,null,null,null,"No","N/A","N/A","N/A","N/A","N/A","N/A","N/A","N/A","N/A","N/A","N/A","N/A","N/A","N/A","N/A","N/A","N/A","N/A","N/A","N/A","N/A","N/A","N/A"]
[null,null,null,null,null,null,null,null,null,null,null,null,null,null,null,null,null,null,null,null,null,null,null,null,null,null,null,null,null,null,null,null,null,null,null,null,null,null,null,null,null,null,null,null,null,null,null,null,null,null,null,null,"Use of Basic Sanitation","Yes","N/A","N/A","N/A","N/A","N/A","N/A","N/A","N/A","N/A","N/A","N/A","N/A","N/A","N/A","N/A","N/A","N/A","N/A","N/A","N/A","N/A","N/A","N/A"]
[null,null,null,null,null,null,null,null,null,null,null,null,null,null,null,null,null,null,null,null,null,null,null,null,null,null,null,null,null,null,null,null,null,null,null,null,null,null,null,null,null,null,null,null,null,null,null,null,null,null,null,null,null,"No","N/A","N/A","N/A","N/A","N/A","N/A","N/A","N/A","N/A","N/A","N/A","N/A","N/A","N/A","N/A","N/A","N/A","N/A","N/A","N/A","N/A","N/A","N/A"]
[null,null,null,null,null,null,null,null,null,null,null,null,null,null,null,null,null,null,null,null,null,null,null,null,null,null,null,null,null,null,null,null,null,null,null,null,null,null,null,null,null,null,null,null,null,null,null,null,null,null,null,null,"Access to Basic Hygiene","Yes","N/A","N/A","N/A","N/A","N/A","N/A","N/A","N/A","N/A","N/A","N/A","N/A","N/A","N/A","N/A","N/A","N/A","N/A","N/A","N/A","N/A","N/A","N/A"]
[null,null,null,null,null,null,null,null,null,null,null,null,null,null,null,null,null,null,null,null,null,null,null,null,null,null,null,null,null,null,null,null,null,null,null,null,null,null,null,null,null,null,null,null,null,null,null,null,null,null,null,null,null,"No","N/A","N/A","N/A","N/A","N/A","N/A","N/A","N/A","N/A","N/A","N/A","N/A","N/A","N/A","N/A","N/A","N/A","N/A","N/A","N/A","N/A","N/A","N/A"]
[]
[]
[]
[]
[]
[]
[]
[]
[]
[]
[]
[]
[]
[]
[]
[]
[]
[]
[]
[]
[]
[]
[]
[]
[]
[]
[]
[]
[]
[]
[]
[]
[]
[]
[]
[]
[]
[]
[]
[]
[]
[]
[]
[]
[null,null,"INITIAL (national) Wealth Index",null,null,null,null,"URBAN Wealth Index",null,null,null,null,"RURAL Wealth Index"]
[null,null,"Component Matrix",null,null,null,null,"Component Matrix",null,null,null,null,"Component Matrix"]
[null,null,null,null,"Component",null,null,null,null,"Component",null,null,null,null,"Component"]
[null,"Note:\n\nThe INITIAL (national) Wealth Index is based on the first component of the Principal Component Analysis (PCA) which has been obtained at national level.\n\nThe final national-level (NATIONAL) Wealth Index is based on the URBAN and RURAL specific wealth indexes. Regression procedures are used to establish the relationships between the two sets of scores (urban and rural) and the initial (national) wealth factors.\nThis allows best use of the available information for each area and a better precision of the FINAL (NATIONAL) Wealth Index.\n\nFor dependency reasons, all WASH variables (contained in the generic MICS and DHS scripts) have been excluded from the sets of asset variables used in the PCAs.\n\nThe PCA can extracts as many components as there are asset variables in the input. Only the first of the components is used to represent the Wealth Index. \n\nThe scores represent the weights of the asset variables on the Wealth Index (correlations between the variables and the component).\n\nThe communalities are the proportion of each variable's variance that can be explained by the component.\n\nProportion of explained variance is the part of the model's total variance that is explained by the component.\n\nFor more information on the procedure used:\n\nThe DHS Wealth Index, DHS Comparative Reports No. 6, Shea Oscar Rutstein, Kiersten Johnson, ORC Macro International Inc., 2004.\n\nThe DHS Wealth Index: Approaches for Rural and Urban Areas, Shea O. Rutstein, ORC Macro International Inc., 2008.\n\nMICS Methodological Paper No. 4, Review of options for reporting water, sanitation and hygiene coverage by wealth quintile, UNICEF, 2016.",null,null,"1",null,null,null,null,"1",null,null,null,null,"1"]
[null,null,"roof3",null,0.7271597302185786,null,null,"floor1",null,-0.64729121051624006,null,null,"roof3",null,0.73797564419091488]
[null,null,"floor1",null,-0.7052185683326857,null,null,"roof3",null,0.6226346121459615,null,null,"dwelling1",null,-0.70778800182275392]
[null,null,"¿Tiene el hogar servicio de TV por cable?",null,0.58413412181937385,null,null,"wall2",null,-0.61413578795138168,null,null,"floor1",null,-0.66613508609982419]
[null,null,"Number of members per sleeping room",null,0.57560915479076324,null,null,"Number of members per sleeping room",null,0.56431071284011536,null,null,"El mes pasado, ¿Utilizaron energía eléctrica?",null,0.55737409100022584]
[null,null,"El mes pasado, ¿Utilizaron leña para cocinar en este hogar?",null,-0.54900097432703698,null,null,"dwelling5",null,0.54318999801946455,null,null,"dwelling4",null,0.5332680516702043]
[null,null,"wall2",null,-0.53601382857497515,null,null,"wall1",null,0.52512936820224521,null,null,"wall4",null,0.53295291749786922]
[null,null,"El mes pasado, ¿Utilizaron energía eléctrica?",null,0.52916106107069083,null,null,"El mes pasado, ¿Utilizaron leña para cocinar en este hogar?",null,-0.51749890909908569,null,null,"Number of members per sleeping room",null,0.50669576129212757]
[null,null,"dwelling1",null,-0.49436031979942535,null,null,"¿Tiene el hogar servicio de TV por cable?",null,0.49155226382001921,null,null,"¿Tiene el hogar servicio de TV por cable?",null,0.46116650061941]
[null,null,"¿Tiene el hogar servicio de teléfono fijo?",null,0.43839057294126699,null,null,"¿Tiene el hogar servicio de teléfono fijo?",null,0.4735321931188754,null,null,"dwelling5",null,0.46098821423212982]
[null,null,"dwelling5",null,0.42945018802193424,null,null,"dwelling1",null,-0.46143060674338465,null,null,"floor6",null,0.45200439252250679]
[null,null,"¿Tiene el hogar servicio de Internet?",null,0.41775120663145243,null,null,"floor4",null,0.45638497301886727,null,null,"roof2",null,-0.44925613388804148]
[null,null,"floor2",null,0.39482574651641889,null,null,"¿Tiene el hogar servicio de Internet?",null,0.45539084280068981,null,null,"floor2",null,0.36841890372532915]
[null,null,"roof6",null,-0.38478241319711914,null,null,"roof6",null,-0.42631168191564894,null,null,"¿En esta vivienda existe en la cocina una chimenea o una salida de escape para el humo?",null,0.30139413331122855]
[null,null,"dwelling4",null,0.38196013872925744,null,null,"floor6",null,0.33333868352706919,null,null,"El mes pasado, ¿Utilizaron leña para cocinar en este hogar?",null,-0.29800767448802751]
[null,null,"wall4",null,0.37914893208424683,null,null,"El mes pasado, ¿Utilizaron energía eléctrica?",null,0.32501373602765232,null,null,"wall2",null,-0.29517460298745274]
[null,null,"floor6",null,0.36995908377543069,null,null,"floor2",null,0.31071836163676847,null,null,"roof6",null,-0.27096060374597492]
[null,null,"roof5",null,-0.2805586406113707,null,null,"roof5",null,-0.28225484986628879,null,null,"floor4",null,0.24270365888784648]
[null,null,"floor4",null,0.26945373167889913,null,null,"dwelling4",null,0.23660096451922788,null,null,"¿Tiene el hogar servicio de teléfono fijo?",null,0.21660715755940024]
[null,null,"wall1",null,0.25817185589047925,null,null,"wall4",null,0.22417517930455533,null,null,"¿Tiene el hogar servicio de Internet?",null,0.21213309912439868]
[null,null,"sit3",null,-0.24545991457604172,null,null,"¿En esta vivienda existe en la cocina una chimenea o una salida de escape para el humo?",null,0.19234244802755412,null,null,"roof5",null,-0.1980910499946478]
[null,null,"¿En esta vivienda existe en la cocina una chimenea o una salida de escape para el humo?",null,0.23530323405363343,null,null,"roof1",null,-0.19139365893665064,null,null,"roof1",null,-0.15237377878034883]
[null,null,"roof1",null,-0.2086593780820844,null,null,"sit4",null,0.17776815544224323,null,null,"roof4",null,-0.13861360063424727]
[null,null,"roof2",null,-0.18520925587047762,null,null,"roof2",null,0.1314274340909683,null,null,"floor5",null,0.11414028475638355]
[null,null,"floor5",null,0.1563750751325918,null,null,"sit3",null,-0.11546255670776956,null,null,"wall1",null,-0.11316804775595234]
[null,null,"roof4",null,-0.13896183344541171,null,null,"roof8",null,0.10182232067816928,null,null,"sit3",null,-8.9244329221124033E-2]
[null,null,"¿Tiene el hogar servicio de celular domiciliar?",null,0.1085998215741709,null,null,"dwelling2",null,-9.2406044002111498E-2,null,null,"¿Tiene el hogar servicio de celular domiciliar?",null,7.914864575591124E-2]
[null,null,"sit4",null,0.10049855976653553,null,null,"wall5",null,-8.7223437384942634E-2,null,null,"roof7",null,7.4587765926448849E-2]
[null,null,"sit1",null,9.4222324596630699E-2,null,null,"roof4",null,-7.8134914497254737E-2,null,null,"sit4",null,6.7455014218161927E-2]
[null,null,"dwelling2",null,-8.8299799373031063E-2,null,null,"sit5",null,6.8392477976560354E-2,null,null,"Cambiaron piso?",null,6.4491467449126469E-2]
[null,null,"wall5",null,-8.3320895695471062E-2,null,null,"¿Tiene el hogar servicio de celular domiciliar?",null,6.7617628980346234E-2,null,null,"floor7",null,-3.4347775382131136E-2]
[null,null,"floor7",null,-5.7254121311991528E-2,null,null,"floor5",null,6.6029267917915191E-2,null,null,"wall5",null,-2.7087800357113764E-2]
[null,null,"dwelling3",null,-5.5305553959665375E-2,null,null,"wall3",null,5.8265704187115852E-2,null,null,"sit2",null,-2.5103130362495438E-2]
[null,null,"roof7",null,5.0432396363731313E-2,null,null,"floor7",null,-5.2888557729923083E-2,null,null,"sit1",null,-1.752605562854433E-2]
[null,null,"wall3",null,4.9031238272536685E-2,null,null,"dwelling3",null,4.738034268876426E-2,null,null,"wall6",null,1.5702343932220513E-2]
[null,null,"Cambiaron piso?",null,4.7849282544931947E-2,null,null,"wall6",null,-3.9051105115214813E-2,null,null,"sit5",null,1.4723616814644442E-2]
[null,null,"sit2",null,-4.3271950056907309E-2,null,null,"sit1",null,-3.3969586106474776E-2,null,null,"dwelling3",null,8.100261374784444E-3]
[null,null,"roof8",null,3.6579087738887239E-2,null,null,"roof7",null,3.1472805954268601E-2,null,null,"dwelling2",null,5.1184450123653979E-3]
[null,null,"sit5",null,2.6286560971169388E-2,null,null,"Cambiaron piso?",null,3.030987790317138E-2,null,null,"roof8",null,-4.4866987454743497E-3]
[null,null,"wall6",null,-1.2284187813459368E-2,null,null,"sit2",null,-9.2746702977319385E-3,null,null,"wall3",null,2.2112410895664685E-3]
[]
[]
[]
[null,null,"Communalities",null,null,null,null,"Communalities",null,null,null,null,"Communalities"]
[null,null,null,null,"Extraction",null,null,null,null,"Extraction",null,null,null,null,"Extraction"]
[null,null,"Number of members per sleeping room",null,0.33132589907893684,null,null,"Number of members per sleeping room",null,0.31844658062611914,null,null,"Number of members per sleeping room",null,0.25674059451140874]
[null,null,"floor1",null,0.49733322912120287,null,null,"floor1",null,0.41898591121157941,null,null,"floor1",null,0.44373595293322021]
[null,null,"floor2",null,0.15588737011224746,null,null,"floor2",null,9.654590025823763E-2,null,null,"floor2",null,0.13573248862217335]
[null,null,"floor4",null,7.2605313515684167E-2,null,null,"floor4",null,0.2082872435974322,null,null,"floor4",null,5.8905066037548144E-2]
[null,null,"floor5",null,2.445316412272373E-2,null,null,"floor5",null,4.359864221775824E-3,null,null,"floor5",null,1.3028004604268322E-2]
[null,null,"floor6",null,0.13686972366795613,null,null,"floor6",null,0.11111467793555958,null,null,"floor6",null,0.20430797085964039]
[null,null,"floor7",null,3.2780344072082424E-3,null,null,"floor7",null,2.7971995387514065E-3,null,null,"floor7",null,1.1797696737013337E-3]
[null,null,"wall1",null,6.6652707173934386E-2,null,null,"wall1",null,0.27576085334848921,null,null,"wall1",null,1.2807007032893508E-2]
[null,null,"wall2",null,0.28731082442360284,null,null,"wall2",null,0.37716276604266447,null,null,"wall2",null,8.7128046248800342E-2]
[null,null,"wall3",null,2.4040623265382663E-3,null,null,"wall3",null,3.3948922844204898E-3,null,null,"wall3",null,4.889587156187103E-6]
[null,null,"wall4",null,0.14375391270062482,null,null,"wall4",null,5.0254511016229533E-2,null,null,"wall4",null,0.28403881226949057]
[null,null,"wall5",null,6.9423716594955677E-3,null,null,"wall5",null,7.6079280292450082E-3,null,null,"wall5",null,7.3374892818685257E-4]
[null,null,"wall6",null,1.5090127023634364E-4,null,null,"wall6",null,1.5249888107195565E-3,null,null,"wall6",null,2.4656360496574237E-4]
[null,null,"roof1",null,4.3538736061602246E-2,null,null,"roof1",null,3.663153268115895E-2,null,null,"roof1",null,2.3217768459802682E-2]
[null,null,"roof2",null,3.4302468460096047E-2,null,null,"roof2",null,1.7273170431735815E-2,null,null,"roof2",null,0.20183107383602986]
[null,null,"roof3",null,0.52876127325155597,null,null,"roof3",null,0.38767386024215189,null,null,"roof3",null,0.54460805141899582]
[null,null,"roof4",null,1.9310391154510345E-2,null,null,"roof4",null,6.1050648634933084E-3,null,null,"roof4",null,1.9213730280790594E-2]
[null,null,"roof5",null,7.8713150821700259E-2,null,null,"roof5",null,7.9667800273041225E-2,null,null,"roof5",null,3.9240064087982057E-2]
[null,null,"roof6",null,0.14805750550579852,null,null,"roof6",null,0.18174165013774946,null,null,"roof6",null,7.3419648782383232E-2]
[null,null,"roof7",null,2.5434266029884995E-3,null,null,"roof7",null,9.9053751463504518E-4,null,null,"roof7",null,5.5633348258987241E-3]
[null,null,"roof8",null,1.3380296598092109E-3,null,null,"roof8",null,1.0367784988287939E-2,null,null,"roof8",null,2.0130465632641103E-5]
[null,null,"dwelling1",null,0.24439212579219011,null,null,"dwelling1",null,0.21291820483956811,null,null,"dwelling1",null,0.50096385552424672]
[null,null,"dwelling2",null,7.7968545693175365E-3,null,null,"dwelling2",null,8.5388769681201664E-3,null,null,"dwelling2",null,2.6198479344608218E-5]
[null,null,"dwelling3",null,3.0587042987854584E-3,null,null,"dwelling3",null,2.2448968733047368E-3,null,null,"dwelling3",null,6.5614234339824766E-5]
[null,null,"dwelling4",null,0.14589354757807357,null,null,"dwelling4",null,5.5980016411428933E-2,null,null,"dwelling4",null,0.28437481493213568]
[null,null,"dwelling5",null,0.18442746399207469,null,null,"dwelling5",null,0.29505537394838588,null,null,"dwelling5",null,0.21251013366092802]
[null,null,"sit1",null,8.8778464523928385E-3,null,null,"sit1",null,1.1539327802452043E-3,null,null,"sit1",null,3.0716262589483036E-4]
[null,null,"sit2",null,1.8724616617274805E-3,null,null,"sit2",null,8.6019509131631051E-5,null,null,"sit2",null,6.3016715399644033E-4]
[null,null,"sit3",null,6.0250569663677693E-2,null,null,"sit3",null,1.3331602001494901E-2,null,null,"sit3",null,7.9645502981283735E-3]
[null,null,"sit4",null,1.0099960515147914E-2,null,null,"sit4",null,3.1601517089337547E-2,null,null,"sit4",null,4.5501789431724275E-3]
[null,null,"sit5",null,6.9098328769100572E-4,null,null,"sit5",null,4.6775310437742927E-3,null,null,"sit5",null,2.1678489210448054E-4]
[null,null,"¿Tiene el hogar servicio de teléfono fijo?",null,0.19218629444377233,null,null,"¿Tiene el hogar servicio de teléfono fijo?",null,0.22423273791997192,null,null,"¿Tiene el hogar servicio de teléfono fijo?",null,4.6918660705962845E-2]
[null,null,"¿Tiene el hogar servicio de celular domiciliar?",null,1.1793921245941755E-2,null,null,"¿Tiene el hogar servicio de celular domiciliar?",null,4.5721437489237588E-3,null,null,"¿Tiene el hogar servicio de celular domiciliar?",null,6.2645081249947266E-3]
[null,null,"¿Tiene el hogar servicio de Internet?",null,0.17451607064203448,null,null,"¿Tiene el hogar servicio de Internet?",null,0.20738081970672259,null,null,"¿Tiene el hogar servicio de Internet?",null,4.5000451744121955E-2]
[null,null,"¿Tiene el hogar servicio de TV por cable?",null,0.34121267227369106,null,null,"¿Tiene el hogar servicio de TV por cable?",null,0.24162362806658577,null,null,"¿Tiene el hogar servicio de TV por cable?",null,0.21267454129355229]
[null,null,"¿En esta vivienda existe en la cocina una chimenea o una salida de escape para el humo?",null,5.5367611956098996E-2,null,null,"¿En esta vivienda existe en la cocina una chimenea o una salida de escape para el humo?",null,3.6995617313232358E-2,null,null,"¿En esta vivienda existe en la cocina una chimenea o una salida de escape para el humo?",null,9.0838423594426607E-2]
[null,null,"Cambiaron piso?",null,2.2895538400647289E-3,null,null,"Cambiaron piso?",null,9.1868869850515668E-4,null,null,"Cambiaron piso?",null,4.159149373741739E-3]
[null,null,"El mes pasado, ¿Utilizaron energía eléctrica?",null,0.2800114285534594,null,null,"El mes pasado, ¿Utilizaron energía eléctrica?",null,0.10563392860665247,null,null,"El mes pasado, ¿Utilizaron energía eléctrica?",null,0.31066587731832801]
[null,null,"El mes pasado, ¿Utilizaron leña para cocinar en este hogar?",null,0.30140206981203593,null,null,"El mes pasado, ¿Utilizaron leña para cocinar en este hogar?",null,0.26780512091874376,null,null,"El mes pasado, ¿Utilizaron leña para cocinar en este hogar?",null,8.8808574053762163E-2]
[]
[]
[null,null,"Total Variance Explained",null,null,null,null,"Total Variance Explained",null,null,null,null,"Total Variance Explained"]
[null,null,"Component",null,"Extraction Sums of Squared Loadings",null,null,"Component",null,"Extraction Sums of Squared Loadings",null,null,"Component",null,"Extraction Sums of Squared Loadings"]
[null,null,null,null,"Total","% of Variance","Cumulative %",null,null,"Total","% of Variance","Cumulative %",null,null,"Total","% of Variance","Cumulative %"]
[null,null,"1",null,4.6116726356766291,11.824801629940076,11.824801629940076,"1",null,4.3114453744976053,11.05498813973745,11.05498813973745,"1",null,4.2226423640241508,10.827288112882439,10.827288112882439]
[]
[]
[null,null,"Component Score Coefficient Matrix",null,null,null,null,"Component Score Coefficient Matrix",null,null,null,null,"Component Score Coefficient Matrix"]
[null,null,null,null,"Component",null,null,null,null,"Component",null,null,null,null,"Component"]
[null,null,null,null,"1",null,null,null,null,"1",null,null,null,null,"1"]
[null,null,"Number of members per sleeping room",null,0.12481570143070427,null,null,"Number of members per sleeping room",null,0.13088666649426631,null,null,"Number of members per sleeping room",null,0.11999495046254635]
[null,null,"floor1",null,-0.15292034453551692,null,null,"floor1",null,-0.15013322779061442,null,null,"floor1",null,-0.15775313859755857]
[null,null,"floor2",null,8.5614434871630812E-2,null,null,"floor2",null,7.2068258935780921E-2,null,null,"floor2",null,8.7248426924374511E-2]
[null,null,"floor4",null,5.8428633809425756E-2,null,null,"floor4",null,0.10585428629535815,null,null,"floor4",null,5.7476726174023295E-2]
[null,null,"floor5",null,3.3908537636182033E-2,null,null,"floor5",null,1.5314879856412257E-2,null,null,"floor5",null,2.7030535602264125E-2]
[null,null,"floor6",null,8.0222321270891739E-2,null,null,"floor6",null,7.7314834022664994E-2,null,null,"floor6",null,0.10704302035461738]
[null,null,"floor7",null,-1.2415044569526591E-2,null,null,"floor7",null,-1.226701329506835E-2,null,null,"floor7",null,-8.1341900215764259E-3]
[null,null,"wall1",null,5.598225986233734E-2,null,null,"wall1",null,0.1217989148855762,null,null,"wall1",null,-2.6800291855193704E-2]
[null,null,"wall2",null,-0.11622980877443193,null,null,"wall2",null,-0.14244313324344141,null,null,"wall2",null,-6.990281855320403E-2]
[null,null,"wall3",null,1.0631985864135989E-2,null,null,"wall3",null,1.351419283467213E-2,null,null,"wall3",null,5.2366288663365987E-4]
[null,null,"wall4",null,8.2215057753902698E-2,null,null,"wall4",null,5.1995365783957651E-2,null,null,"wall4",null,0.12621313186228933]
[null,null,"wall5",null,-1.8067391655445665E-2,null,null,"wall5",null,-2.0230672038865017E-2,null,null,"wall5",null,-6.414893335011035E-3]
[null,null,"wall6",null,-2.6637163528102463E-3,null,null,"wall6",null,-9.0575437523118946E-3,null,null,"wall6",null,3.7186061661296558E-3]
[null,null,"roof1",null,-4.5245921505325942E-2,null,null,"roof1",null,-4.4391994403721949E-2,null,null,"roof1",null,-3.6084935839827463E-2]
[null,null,"roof2",null,-4.0160972059826945E-2,null,null,"roof2",null,3.0483381482313908E-2,null,null,"roof2",null,-0.10639218175699429]
[null,null,"roof3",null,0.1576780894188273,null,null,"roof3",null,0.14441435715012726,null,null,"roof3",null,0.17476631468444534]
[null,null,"roof4",null,-3.0132631785348543E-2,null,null,"roof4",null,-1.8122672957757106E-2,null,null,"roof4",null,-3.2826270539792868E-2]
[null,null,"roof5",null,-6.0836634075221344E-2,null,null,"roof5",null,-6.5466409834585626E-2,null,null,"roof5",null,-4.6911633266016953E-2]
[null,null,"roof6",null,-8.3436627791049489E-2,null,null,"roof6",null,-9.8879063721252672E-2,null,null,"roof6",null,-6.4168494602927076E-2]
[null,null,"roof7",null,1.0935814475116535E-2,null,null,"roof7",null,7.2998271392771584E-3,null,null,"roof7",null,1.7663765835799362E-2]
[null,null,"roof8",null,7.9318482964089044E-3,null,null,"roof8",null,2.3616748406567526E-2,null,null,"roof8",null,-1.0625334467583361E-3]
[null,null,"dwelling1",null,-0.10719761762250329,null,null,"dwelling1",null,-0.10702457451340273,null,null,"dwelling1",null,-0.16761732128984672]
[null,null,"dwelling2",null,-1.914702242521072E-2,null,null,"dwelling2",null,-2.1432729856371929E-2,null,null,"dwelling2",null,1.2121426753952122E-3]
[null,null,"dwelling3",null,-1.1992515152054127E-2,null,null,"dwelling3",null,1.0989433605959876E-2,null,null,"dwelling3",null,1.9182920731806773E-3]
[null,null,"dwelling4",null,8.282464279323587E-2,null,null,"dwelling4",null,5.4877412089860453E-2,null,null,"dwelling4",null,0.12628776147691639]
[null,null,"dwelling5",null,9.312243559953487E-2,null,null,"dwelling5",null,0.12598791143973614,null,null,"dwelling5",null,0.10917055589638217]
[null,null,"sit1",null,2.0431269094799111E-2,null,null,"sit1",null,-7.878932273479888E-3,null,null,"sit1",null,-4.1504949076109094E-3]
[null,null,"sit2",null,-9.3831356809996984E-3,null,null,"sit2",null,-2.1511742564551627E-3,null,null,"sit2",null,-5.9448866843111762E-3]
[null,null,"sit3",null,-5.3225788985350984E-2,null,null,"sit3",null,-2.6780475380886369E-2,null,null,"sit3",null,-2.1134711758083811E-2]
[null,null,"sit4",null,2.1792214605404286E-2,null,null,"sit4",null,4.1231684505096566E-2,null,null,"sit4",null,1.5974597989368379E-2]
[null,null,"sit5",null,5.7000058433923492E-3,null,null,"sit5",null,1.5863004639025451E-2,null,null,"sit5",null,3.4868254389919329E-3]
[null,null,"¿Tiene el hogar servicio de teléfono fijo?",null,9.5061078175802866E-2,null,null,"¿Tiene el hogar servicio de teléfono fijo?",null,0.10983142588790284,null,null,"¿Tiene el hogar servicio de teléfono fijo?",null,5.1296590827780889E-2]
[null,null,"¿Tiene el hogar servicio de celular domiciliar?",null,2.3548900833512222E-2,null,null,"¿Tiene el hogar servicio de celular domiciliar?",null,1.568328555901637E-2,null,null,"¿Tiene el hogar servicio de celular domiciliar?",null,1.874386673857056E-2]
[null,null,"¿Tiene el hogar servicio de Internet?",null,9.0585616029998081E-2,null,null,"¿Tiene el hogar servicio de Internet?",null,0.10562370695784461,null,null,"¿Tiene el hogar servicio de Internet?",null,5.0237050840895088E-2]
[null,null,"¿Tiene el hogar servicio de TV por cable?",null,0.12666426434964612,null,null,"¿Tiene el hogar servicio de TV por cable?",null,0.11401101512907318,null,null,"¿Tiene el hogar servicio de TV por cable?",null,0.10921277741833703]
[null,null,"¿En esta vivienda existe en la cocina una chimenea o una salida de escape para el humo?",null,5.1023403576674183E-2,null,null,"¿En esta vivienda existe en la cocina una chimenea o una salida de escape para el humo?",null,4.4612057284841959E-2,null,null,"¿En esta vivienda existe en la cocina una chimenea o una salida de escape para el humo?",null,7.1375718644569722E-2]
[null,null,"Cambiaron piso?",null,1.0375689326853411E-2,null,null,"Cambiaron piso?",null,7.0300967008548156E-3,null,null,"Cambiaron piso?",null,1.5272775170016181E-2]
[null,null,"El mes pasado, ¿Utilizaron energía eléctrica?",null,0.11474384737915198,null,null,"El mes pasado, ¿Utilizaron energía eléctrica?",null,7.5383939212154513E-2,null,null,"El mes pasado, ¿Utilizaron energía eléctrica?",null,0.13199651851857327]
[null,null,"El mes pasado, ¿Utilizaron leña para cocinar en este hogar?",null,-0.11904595527442223,null,null,"El mes pasado, ¿Utilizaron leña para cocinar en este hogar?",null,-0.12002910025489712,null,null,"El mes pasado, ¿Utilizaron leña para cocinar en este hogar?",null,-7.0573742409960602E-2]
[]
[]
[null,null,"Component Score Covariance Matrix",null,null,null,null,"Component Score Covariance Matrix",null,null,null,null,"Component Score Covariance Matrix"]
[null,null,"Component",null,"1",null,null,"Component",null,"1",null,null,"Component",null,"1"]
[null,null,"1",null,1,null,null,"1",null,0.99999999999999989,null,null,"1",null,0.99999999999999989]
[]
[]
[]
[]
[]
[]
[]
[]
[]
[]
[]
[]
[]
[]
[]
[]
[]
[]
[]
[]
[]
[]
[]
[]
[]
[]
[]
[]
[]
[]
[]
[]
[]
[]
[]
[]
[]
[]
[]
[]
[]
[]
[]
[]
[]
[]
[]
[]
[]
[]
[]
[]
[]
[]
[]
[]
[]
[]
[]
[]
[]
[]
[]
[]
[]
[]
[]
[]
[]
[]
[]
[]
[]
[]
[]
[]
[]
[]
[]
[]
[]
[]
[]
[]
[]
[]
[]
[]
[]
[]
[]
[]
[]
[]
[]
[]
[]
[]
[]
[]
[]
[]
[]
[]
[]
[]
[]
[]
[]
[]
[]
[]
[]
[]
[]
[]
[]
[]
[]
[]
[]
[]
[]
[]
[]
[]
[]
[]
[]
[]
[]
[]
[]
[]
[]
[]
[]
[]
[]
[]
[]
[]
[]
[]
[]
[]
[]
[]
[]
[]
[]
[]
[]
[]
[]
[]
[]
[]
[]
[]
[]
[]
[]
[]
[]
[]
[]
[]
[]
[]
[]
[]
[]
[]
[]
[]
[]
[]
[]
[]
[]
[]
[]
[]
[]
[]
[]
[]
[]
[]
[]
[]
[]
[]
[]
[]
[]
[]
[]
[]
[]
[]
[]
[]
[]
[]
[]
[]
[]
[]
[]
[]
[]
[]
[]
[]
[]
[]
[]
[]
[]
[]
[]
[]
[]
[]
[]
[]
[]
[]
[]
[]
[]
[]
[]
[]
[]
[]
[]
[]
[]
[]
[]
[]
[]
[]
[]
[]
[]
[]
[]
[]
[]
[]
[]
[]
[]
[]
[]
[]
[]
[]
[]
[]
[]
[]
[]
[]
[]
[]
[]
[]
[]
[]
[]
[]
[]
[]
[]
[]
[]
[]
[]
[]
[]
[]
[]
[]
[]
[]
[]
[]
[]
[]
[]
[]
[]
[]
[]
[]
[]
[]
[]
[]
[]
[]
[]
[]
[]
[]
[]
[]
[]
[]
[]
[]
[]
[]
[]
[]
[]
[]
[]
[]
[]
[]
[]
[]
[]
[]
[]
[]
[]
[]
[]
[]
[]
[]
[]
[]
[]
[]
[]
[]
[]
[]
[]
[]
[]
[]
[]
[]
[]
[]
[]
[]
[]
[]
[]
[]
[]
[]
[]
[]
[]
[]
[]
[]
[]
[]
[]
[]
[]
[]
[]
[]
[]
[]
[]
[]
[]
[]
[]
[]
[]
[]
[]
[]
[]
[]
[]
[]
[]
[]
[]
[]
[]
[]
[]
[]
[]
[]
[]
[]
[]
[]
[]
[]
[]
[]
[]
[]
[]
[]
[]
[]
[]
[]
[]
[]
[]
[]
[]
[]
[]
[]
[]
[]
[]
[]
[]
[]
[]
[]
[]
[]
[]
[]
[]
[]
[]
[]
[]
[]
[]
[]
[]
[]
[]
[]
[]
[]
[]
[]
[]
[]
[]
[]
[]
[]
[]
[]
[]
[]
[]
[]
[]
[]
[]
[]
[]
[]
[]
[]
[]
[]
[]
[]
[]
[]
[]
[]
[]
[]
["ENCOVI11"]
["Guatemala",null,"Count"]
["W_text_t","",13110]
["W_text_i","",13110]
["S_text_s","Ratio of Shared improved based on:",13110]
["S_text_i","Ratio of Improved latrines based on:",13110]
["Urban/Rural","Urban",5432]
[null,"Rural",7678]
[null,"Missing",0]
["2011"]
[]
["Sub-national region names","Weighted population"]
[{"$f":"R15","v":"Central"},{"$f":"BR122+BR123","v":{"$error":"#VALUE!"}}]
[{"$f":"S15","v":"Metropolitana"},{"$f":"BS122+BS123","v":{"$error":"#VALUE!"}}]
[{"$f":"T15","v":"Nor-Oriente"},{"$f":"BT122+BT123","v":{"$error":"#VALUE!"}}]
[{"$f":"U15","v":"Nor-Occidente"},{"$f":"BU122+BU123","v":{"$error":"#VALUE!"}}]
[{"$f":"V15","v":"Norte"},{"$f":"BV122+BV123","v":{"$error":"#VALUE!"}}]
[{"$f":"W15","v":"Peten"},{"$f":"BW122+BW123","v":{"$error":"#VALUE!"}}]
[{"$f":"X15","v":"Sur-Occidente"},{"$f":"BX122+XR123","v":{"$error":"#VALUE!"}}]
[{"$f":"Y15","v":"Sur-Oriente"},{"$f":"BY122+BY123","v":{"$error":"#VALUE!"}}]
[{"$f":"Z15","v":0},{"$f":"BZ122+BZ123","v":0}]
[{"$f":"AA15","v":0},{"$f":"CA122+CA123","v":0}]
[{"$f":"AB15","v":0},{"$f":"CB122+CB123","v":0}]
[{"$f":"AC15","v":0},{"$f":"CC122+CC123","v":0}]
[{"$f":"AD15","v":0},{"$f":"CD122+CD123","v":0}]
[{"$f":"AE15","v":0},{"$f":"CE122+CE123","v":0}]
[{"$f":"AF15","v":0},{"$f":"CF122+CF123","v":0}]
[{"$f":"AG15","v":0},{"$f":"CG122+CG123","v":0}]
[{"$f":"AH15","v":0},{"$f":"CH122+CH123","v":0}]
[{"$f":"AI15","v":0},{"$f":"CI122+CI123","v":0}]
[{"$f":"AJ15","v":0},{"$f":"CJ122+CJ123","v":0}]
[{"$f":"AK15","v":0},{"$f":"CK122+CK123","v":0}]
[{"$f":"AL15","v":0},{"$f":"CL122+CL123","v":0}]
[{"$f":"AM15","v":0},{"$f":"CM122+CM123","v":0}]
[{"$f":"AN15","v":0},{"$f":"CN122+CN123","v":0}]
[{"$f":"AO15","v":0},{"$f":"CO122+CO123","v":0}]
[{"$f":"AP15","v":0},{"$f":"CP122+CP123","v":0}]
[{"$f":"AQ15","v":0},{"$f":"CQ122+CQ123","v":0}]
[{"$f":"AR15","v":0},{"$f":"CR122+CR123","v":0}]
[{"$f":"AS15","v":0},{"$f":"CS122+CS123","v":0}]
[{"$f":"AT15","v":0},{"$f":"CT122+CT123","v":0}]
[{"$f":"AU15","v":0},{"$f":"CU122+CU123","v":0}]
[{"$f":"AV15","v":0},{"$f":"CV122+CV123","v":0}]
[{"$f":"AW15","v":0},{"$f":"CW122+CW123","v":0}]
[{"$f":"AX15","v":0},{"$f":"CX122+CX123","v":0}]
[{"$f":"AY15","v":0},{"$f":"CY122+CY123","v":0}]
[]
[{"$f":"34-COUNTIF(A1037:A1071,\"0\")","v":8},"Sub-regions"]

{"sheet":"DHS15","index":6,"n_rows":1072,"n_cols":77,"rows_kept":1072,"cut":false,"hidden":false,"merged":[[346,52,347,52],[348,52,349,52],[350,52,351,52],[352,52,353,52],[270,52,272,52],[273,52,275,52],[276,52,283,52],[338,54,338,58],[338,59,338,63],[338,64,338,68],[340,52,341,52],[342,52,343,52],[344,52,345,52],[221,52,223,52],[224,52,225,52],[226,52,229,52],[258,54,258,58],[258,59,258,63],[258,64,258,68],[260,52,262,52],[263,52,266,52],[267,52,269,52],[13,64,13,68],[15,52,16,52],[17,52,20,52],[21,52,22,52],[26,54,26,58],[26,59,26,63],[26,64,26,68],[40,52,41,52],[55,54,55,58],[55,59,55,63],[55,64,55,68],[139,52,142,52],[150,52,151,52],[13,54,13,58],[13,59,13,63],[119,54,119,58],[119,59,119,63],[42,52,43,52],[44,52,45,52],[32,0,33,0],[55,2,55,6],[55,7,55,11],[55,12,55,16],[34,0,35,0],[36,0,37,0],[40,0,41,0],[42,0,43,0],[119,64,119,68],[121,52,122,52],[123,52,126,52],[127,52,128,52],[132,54,132,58],[132,59,132,63],[132,64,132,68],[134,52,138,52],[219,54,219,58],[219,59,219,63],[219,64,219,68],[13,2,13,6],[13,7,13,11],[28,52,29,52],[30,0,31,0],[30,52,31,52],[26,2,26,6],[26,7,26,11],[26,12,26,16],[13,12,13,16],[15,0,16,0],[17,0,20,0],[21,0,22,0],[23,0,25,0],[28,0,29,0],[143,0,146,0],[143,52,146,52],[147,0,149,0],[147,52,149,52],[132,7,132,11],[132,12,132,16],[134,0,138,0],[46,0,48,0],[46,52,48,52],[49,0,51,0],[49,52,51,52],[52,0,54,0],[52,52,54,52],[32,52,33,52],[34,52,35,52],[36,52,37,52],[38,0,39,0],[38,52,39,52],[152,0,159,0],[201,0,203,0],[207,0,207,1],[219,2,219,6],[219,7,219,11],[44,0,45,0],[139,0,142,0],[119,7,119,11],[119,12,119,16],[107,0,107,1],[121,0,122,0],[123,0,126,0],[127,0,128,0],[129,0,131,0],[132,2,132,6],[119,2,119,6],[150,0,151,0],[1024,0,1024,2],[1025,0,1025,1],[1030,0,1032,0],[1033,0,1033,2],[219,12,219,16],[221,0,223,0],[224,0,228,0],[401,1,444,1],[402,2,402,3],[402,7,402,8],[402,12,402,13],[403,2,403,3],[403,7,403,8],[403,12,403,13],[398,2,398,5],[398,7,398,10],[398,12,398,15],[399,2,399,4],[399,7,399,9],[399,12,399,14],[404,2,404,3],[404,7,404,8],[404,12,404,13],[405,2,405,3],[405,7,405,8],[405,12,405,13],[400,2,401,3],[400,7,401,8],[400,12,401,13],[408,2,408,3],[408,7,408,8],[408,12,408,13],[409,2,409,3],[409,7,409,8],[409,12,409,13],[406,2,406,3],[406,7,406,8],[406,12,406,13],[407,2,407,3],[407,7,407,8],[407,12,407,13],[412,2,412,3],[412,7,412,8],[412,12,412,13],[413,2,413,3],[413,7,413,8],[413,12,413,13],[410,2,410,3],[410,7,410,8],[410,12,410,13],[411,2,411,3],[411,7,411,8],[411,12,411,13],[416,2,416,3],[416,7,416,8],[416,12,416,13],[417,2,417,3],[417,7,417,8],[417,12,417,13],[414,2,414,3],[414,7,414,8],[414,12,414,13],[415,2,415,3],[415,7,415,8],[415,12,415,13],[420,2,420,3],[420,7,420,8],[420,12,420,13],[421,2,421,3],[421,7,421,8],[421,12,421,13],[418,2,418,3],[418,7,418,8],[418,12,418,13],[419,2,419,3],[419,7,419,8],[419,12,419,13],[424,2,424,3],[424,7,424,8],[424,12,424,13],[425,2,425,3],[425,7,425,8],[425,12,425,13],[422,2,422,3],[422,7,422,8],[422,12,422,13],[423,2,423,3],[423,7,423,8],[423,12,423,13],[428,2,428,3],[428,7,428,8],[428,12,428,13],[429,2,429,3],[429,7,429,8],[429,12,429,13],[426,2,426,3],[426,7,426,8],[426,12,426,13],[427,2,427,3],[427,7,427,8],[427,12,427,13],[432,2,432,3],[432,7,432,8],[432,12,432,13],[433,2,433,3],[433,7,433,8],[433,12,433,13],[430,2,430,3],[430,7,430,8],[430,12,430,13],[431,2,431,3],[431,7,431,8],[431,12,431,13],[436,2,436,3],[436,7,436,8],[436,12,436,13],[437,2,437,3],[437,7,437,8],[437,12,437,13],[434,2,434,3],[434,7,434,8],[434,12,434,13],[435,2,435,3],[435,7,435,8],[435,12,435,13],[440,2,440,3],[440,7,440,8],[440,12,440,13],[441,2,441,3],[441,7,441,8],[441,12,441,13],[438,2,438,3],[438,7,438,8],[438,12,438,13],[439,2,439,3],[439,7,439,8],[439,12,439,13],[444,2,444,3],[444,7,444,8],[444,12,444,13],[445,2,445,3],[445,7,445,8],[445,12,445,13],[442,2,442,3],[442,7,442,8],[442,12,442,13],[443,2,443,3],[443,7,443,8],[443,12,443,13],[448,2,448,3],[448,7,448,8],[448,12,448,13],[449,2,449,3],[449,7,449,8],[449,12,449,13],[446,2,446,3],[446,7,446,8],[446,12,446,13],[447,2,447,3],[447,7,447,8],[447,12,447,13],[452,2,452,3],[452,7,452,8],[452,12,452,13],[453,2,453,3],[453,7,453,8],[453,12,453,13],[450,2,450,3],[450,7,450,8],[450,12,450,13],[451,2,451,3],[451,7,451,8],[451,12,451,13],[456,2,456,3],[456,7,456,8],[456,12,456,13],[457,2,457,3],[457,7,457,8],[457,12,457,13],[454,2,454,3],[454,7,454,8],[454,12,454,13],[455,2,455,3],[455,7,455,8],[455,12,455,13],[460,2,460,3],[460,7,460,8],[460,12,460,13],[461,2,461,3],[461,7,461,8],[461,12,461,13],[458,2,458,3],[458,7,458,8],[458,12,458,13],[459,2,459,3],[459,7,459,8],[459,12,459,13],[464,2,464,3],[464,7,464,8],[464,12,464,13],[465,2,465,3],[465,7,465,8],[465,12,465,13],[462,2,462,3],[462,7,462,8],[462,12,462,13],[463,2,463,4],[463,7,463,8],[463,12,463,13],[468,2,468,3],[468,7,468,8],[468,12,468,13],[469,2,469,3],[469,7,469,8],[469,12,469,13],[466,2,466,3],[466,7,466,8],[466,12,466,13],[467,2,467,3],[467,7,467,8],[467,12,467,13],[472,2,472,3],[472,7,472,8],[472,12,472,13],[473,2,473,3],[473,7,473,8],[473,12,473,13],[470,2,470,3],[470,7,470,8],[470,12,470,13],[471,2,471,3],[471,7,471,8],[471,12,471,13],[476,2,476,3],[476,7,476,8],[476,12,476,13],[477,2,477,3],[477,7,477,8],[477,12,477,13],[474,2,474,3],[474,7,474,8],[474,12,474,13],[475,2,475,3],[475,7,475,8],[475,12,475,13],[480,2,480,3],[480,7,480,8],[480,12,480,13],[481,2,481,3],[481,7,481,8],[481,12,481,13],[478,2,478,3],[478,7,478,9],[478,12,478,13],[479,2,479,3],[479,7,479,8],[479,12,479,14],[484,2,484,3],[484,7,484,8],[484,12,484,13],[485,2,485,3],[485,7,485,8],[485,12,485,13],[482,2,482,3],[482,7,482,8],[482,12,482,13],[483,2,483,3],[483,7,483,8],[483,12,483,13],[488,2,488,3],[488,7,488,8],[488,12,488,13],[489,2,489,3],[489,7,489,8],[489,12,489,13],[486,2,486,3],[486,7,486,8],[486,12,486,13],[487,2,487,3],[487,7,487,8],[487,12,487,13],[492,2,492,3],[492,7,492,8],[492,12,492,13],[493,2,493,3],[493,7,493,8],[493,12,493,13],[490,2,490,3],[490,7,490,8],[490,12,490,13],[491,2,491,3],[491,7,491,8],[491,12,491,13],[496,2,496,3],[496,7,496,8],[496,12,496,13],[497,2,497,3],[497,7,497,8],[497,12,497,13],[494,2,494,3],[494,7,494,8],[494,12,494,13],[495,2,495,3],[495,7,495,8],[495,12,495,13],[500,2,500,3],[500,7,500,8],[500,12,500,13],[501,2,501,3],[501,7,501,8],[501,12,501,13],[498,2,498,3],[498,7,498,8],[498,12,498,13],[499,2,499,3],[499,7,499,8],[499,12,499,13],[504,2,504,3],[504,7,504,8],[504,12,504,13],[505,2,505,3],[505,7,505,8],[505,12,505,13],[502,2,502,3],[502,7,502,8],[502,12,502,13],[503,2,503,3],[503,7,503,8],[503,12,503,13],[508,2,508,3],[508,7,508,8],[508,12,508,13],[509,2,509,3],[509,7,509,8],[509,12,509,13],[506,2,506,3],[506,7,506,8],[506,12,506,13],[507,2,507,3],[507,7,507,8],[507,12,507,13],[512,2,512,3],[512,7,512,8],[512,12,512,13],[513,2,513,3],[513,7,513,8],[513,12,513,13],[510,2,510,3],[510,7,510,8],[510,12,510,13],[511,2,511,3],[511,7,511,8],[511,12,511,13],[516,2,516,3],[516,7,516,8],[516,12,516,13],[517,2,517,3],[517,7,517,8],[517,12,517,13],[514,2,514,3],[514,7,514,8],[514,12,514,13],[515,2,515,3],[515,7,515,8],[515,12,515,13],[520,2,520,3],[520,7,520,8],[520,12,520,13],[521,2,521,3],[521,7,521,8],[521,12,521,13],[518,2,518,3],[518,7,518,8],[518,12,518,13],[519,2,519,3],[519,7,519,8],[519,12,519,13],[524,2,524,3],[524,7,524,8],[524,12,524,13],[525,2,525,6],[525,7,525,8],[525,12,525,13],[522,2,522,3],[522,7,522,8],[522,12,522,13],[523,2,523,3],[523,7,523,8],[523,12,523,13],[528,2,528,3],[528,7,528,8],[528,12,528,13],[529,2,529,3],[529,7,529,8],[529,12,529,13],[526,2,527,3],[526,4,526,6],[526,7,526,8],[526,12,526,13],[527,7,527,8],[527,12,527,13],[532,2,533,3],[532,7,532,8],[532,12,532,13],[533,7,533,8],[533,12,533,13],[534,2,534,3],[534,7,534,8],[534,12,534,13],[530,2,530,3],[530,7,530,8],[530,12,530,13],[531,2,531,4],[531,7,531,8],[531,12,531,13],[537,2,537,3],[537,7,537,8],[537,12,537,13],[538,2,538,3],[538,7,538,8],[538,12,538,13],[535,2,535,3],[535,7,535,8],[535,12,535,13],[536,2,536,3],[536,7,536,8],[536,12,536,13],[541,2,541,3],[541,7,541,8],[541,12,541,13],[542,2,542,3],[542,7,542,8],[542,12,542,13],[539,2,539,3],[539,7,539,8],[539,12,539,13],[540,2,540,3],[540,7,540,8],[540,12,540,13],[545,2,545,3],[545,7,545,8],[545,12,545,13],[546,2,546,3],[546,7,546,8],[546,12,546,13],[543,2,543,3],[543,7,543,8],[543,12,543,13],[544,2,544,3],[544,7,544,8],[544,12,544,13],[549,2,549,3],[549,7,549,8],[549,12,549,13],[550,2,550,3],[550,7,550,8],[550,12,550,13],[547,2,547,3],[547,7,547,8],[547,12,547,13],[548,2,548,3],[548,7,548,8],[548,12,548,13],[553,2,553,3],[553,7,553,8],[553,12,553,13],[554,2,554,3],[554,7,554,8],[554,12,554,13],[551,2,551,3],[551,7,551,8],[551,12,551,13],[552,2,552,3],[552,7,552,8],[552,12,552,13],[558,14,558,16],[559,2,559,3],[559,7,559,8],[555,2,555,3],[555,7,555,11],[555,12,555,13],[556,2,556,3],[556,7,557,8],[556,9,556,11],[556,12,556,13],[557,2,557,3],[557,12,557,16],[560,2,560,3],[560,7,560,8],[560,12,560,13],[561,2,561,3],[561,7,561,9],[561,12,561,13],[558,2,558,3],[558,7,558,8],[558,12,559,13],[566,2,566,3],[566,7,566,8],[566,12,566,13],[567,2,567,3],[567,7,567,8],[567,12,567,13],[562,2,562,3],[562,7,563,8],[562,12,562,13],[563,2,563,3],[563,12,563,14],[564,2,564,3],[564,7,564,8],[564,12,565,13],[565,2,565,3],[565,7,565,8],[570,2,570,3],[570,7,570,8],[570,12,570,13],[571,2,571,3],[571,7,571,8],[571,12,571,13],[568,2,568,3],[568,7,568,8],[568,12,568,13],[569,2,569,3],[569,7,569,8],[569,12,569,13],[574,2,574,3],[574,7,574,8],[574,12,574,13],[575,2,575,3],[575,7,575,8],[575,12,575,13],[572,2,572,3],[572,7,572,8],[572,12,572,13],[573,2,573,3],[573,7,573,8],[573,12,573,13],[578,2,578,3],[578,7,578,8],[578,12,578,13],[579,2,579,3],[579,7,579,8],[579,12,579,13],[576,2,576,3],[576,7,576,8],[576,12,576,13],[577,2,577,3],[577,7,577,8],[577,12,577,13],[582,2,582,3],[582,7,582,8],[582,12,582,13],[583,2,583,3],[583,7,583,8],[583,12,583,13],[580,2,580,3],[580,7,580,8],[580,12,580,13],[581,2,581,3],[581,7,581,8],[581,12,581,13],[586,2,586,3],[586,7,586,8],[586,12,586,13],[587,2,587,3],[587,7,587,8],[587,12,587,13],[584,2,584,3],[584,7,584,8],[584,12,584,13],[585,2,585,3],[585,7,585,8],[585,12,585,13],[590,2,590,3],[590,7,590,8],[590,12,590,13],[591,2,591,3],[591,7,591,8],[591,12,591,13],[588,2,588,3],[588,7,588,8],[588,12,588,13],[589,2,589,3],[589,7,589,8],[589,12,589,13],[594,2,594,4],[594,7,594,8],[594,12,594,13],[595,2,595,3],[595,7,595,8],[595,12,595,13],[592,2,592,3],[592,7,592,8],[592,12,592,13],[593,2,593,3],[593,7,593,8],[593,12,593,13],[598,2,598,3],[598,7,598,8],[598,12,598,13],[599,2,599,3],[599,7,599,8],[599,12,599,13],[596,2,596,3],[596,7,596,8],[596,12,596,13],[597,2,597,3],[597,7,597,8],[597,12,597,13],[602,2,602,3],[602,7,602,8],[602,12,602,13],[603,2,603,3],[603,7,603,8],[603,12,603,13],[600,2,600,3],[600,7,600,8],[600,12,600,13],[601,2,601,3],[601,7,601,8],[601,12,601,13],[606,2,606,3],[606,7,606,8],[606,12,606,13],[607,2,607,3],[607,7,607,8],[607,12,607,13],[604,2,604,3],[604,7,604,8],[604,12,604,13],[605,2,605,3],[605,7,605,8],[605,12,605,13],[610,2,610,3],[610,7,610,8],[610,12,610,13],[611,2,611,3],[611,7,611,8],[611,12,611,13],[608,2,608,3],[608,7,608,8],[608,12,608,13],[609,2,609,3],[609,7,609,8],[609,12,609,13],[614,2,614,3],[614,7,614,8],[614,12,614,13],[615,2,615,3],[615,7,615,8],[615,12,615,13],[612,2,612,3],[612,7,612,8],[612,12,612,13],[613,2,613,3],[613,7,613,8],[613,12,613,13],[618,2,618,3],[618,7,618,8],[618,12,618,13],[619,2,619,3],[619,7,619,8],[619,12,619,13],[616,2,616,3],[616,7,616,8],[616,12,616,13],[617,2,617,3],[617,7,617,8],[617,12,617,13],[622,2,622,3],[622,7,622,8],[622,12,622,13],[623,2,623,3],[623,7,623,8],[623,12,623,13],[620,2,620,3],[620,7,620,8],[620,12,620,13],[621,2,621,3],[621,7,621,8],[621,12,621,13],[626,2,626,3],[626,7,626,8],[626,12,626,13],[627,2,627,3],[627,7,627,8],[627,12,627,13],[624,2,624,3],[624,7,624,8],[624,12,624,13],[625,2,625,3],[625,7,625,8],[625,12,625,13],[630,2,630,3],[630,7,630,8],[630,12,630,13],[631,2,631,3],[631,7,631,8],[631,12,631,13],[628,2,628,3],[628,7,628,8],[628,12,628,13],[629,2,629,3],[629,7,629,8],[629,12,629,13],[634,2,634,3],[634,7,634,8],[634,12,634,13],[635,2,635,3],[635,7,635,8],[635,12,635,13],[632,2,632,3],[632,7,632,8],[632,12,632,13],[633,2,633,3],[633,7,633,8],[633,12,633,13],[638,2,638,3],[638,7,638,8],[638,12,638,13],[639,2,639,3],[639,7,639,9],[639,12,639,13],[636,2,636,3],[636,7,636,8],[636,12,636,13],[637,2,637,3],[637,7,637,8],[637,12,637,13],[642,2,642,3],[642,7,642,8],[642,12,642,14],[643,2,643,3],[643,7,643,8],[643,12,643,13],[640,2,640,3],[640,7,640,8],[640,12,640,13],[641,2,641,3],[641,7,641,8],[641,12,641,13],[646,2,646,3],[646,7,646,8],[646,12,646,13],[647,2,647,3],[647,7,647,8],[647,12,647,13],[644,2,644,3],[644,7,644,8],[644,12,644,13],[645,2,645,3],[645,7,645,8],[645,12,645,13],[650,2,650,3],[650,7,650,8],[650,12,650,13],[651,2,651,3],[651,7,651,8],[651,12,651,13],[648,2,648,3],[648,7,648,8],[648,12,648,13],[649,2,649,3],[649,7,649,8],[649,12,649,13],[654,2,654,3],[654,7,654,8],[654,12,654,13],[655,2,655,3],[655,7,655,8],[655,12,655,13],[652,2,652,3],[652,7,652,8],[652,12,652,13],[653,2,653,3],[653,7,653,8],[653,12,653,13],[658,2,658,3],[658,7,658,8],[658,12,658,13],[659,2,659,3],[659,7,659,8],[659,12,659,13],[656,2,656,3],[656,7,656,8],[656,12,656,13],[657,2,657,3],[657,7,657,8],[657,12,657,13],[662,2,662,3],[662,7,662,8],[662,12,662,13],[663,2,663,3],[663,7,663,8],[663,12,663,13],[660,2,660,3],[660,7,660,8],[660,12,660,13],[661,2,661,3],[661,7,661,8],[661,12,661,13],[666,2,666,3],[666,7,666,8],[666,12,666,13],[667,2,667,3],[667,7,667,8],[667,12,667,13],[664,2,664,3],[664,7,664,8],[664,12,664,13],[665,2,665,3],[665,7,665,8],[665,12,665,13],[670,2,670,3],[670,7,670,8],[670,12,670,13],[671,2,671,3],[671,7,671,8],[671,12,671,13],[668,2,668,3],[668,7,668,8],[668,12,668,13],[669,2,669,3],[669,7,669,8],[669,12,669,13],[674,2,674,3],[674,7,674,8],[674,12,674,13],[675,2,675,3],[675,7,675,8],[675,12,675,13],[672,2,672,3],[672,7,672,8],[672,12,672,13],[673,2,673,3],[673,7,673,8],[673,12,673,13],[678,2,678,3],[678,7,678,8],[678,12,678,13],[679,2,679,3],[679,7,679,8],[679,12,679,13],[676,2,676,3],[676,7,676,8],[676,12,676,13],[677,2,677,3],[677,7,677,8],[677,12,677,13],[693,2,693,3],[693,7,693,8],[693,12,693,13],[682,2,682,3],[682,7,682,8],[682,12,682,13],[683,2,683,3],[683,7,683,8],[683,12,683,13],[680,2,680,3],[680,7,680,8],[680,12,680,13],[681,2,681,3],[681,7,681,8],[681,12,681,13],[686,2,686,3],[686,7,686,8],[686,12,686,13],[687,2,687,3],[687,7,687,8],[687,12,687,13],[684,2,684,3],[684,7,684,8],[684,12,684,13],[685,2,685,3],[685,7,685,8],[685,12,685,13],[698,2,698,3],[698,7,698,8],[698,12,698,13],[696,2,696,3],[696,7,696,8],[696,12,696,13],[697,2,697,3],[697,7,697,8],[697,12,697,13],[152,52,160,52],[230,52,235,52],[690,2,690,3],[690,7,690,8],[690,12,690,13],[691,2,691,3],[691,7,691,8]],"merged_total":1016,"flags":["merged_cut"]}
[]
[{"$f":"A1026","v":"Guatemala"}]
[{"$f":"A1034","v":"2015"}]
["Use of drinking water sources"]
[" by wealth quintile and sub-national region"]
["Notes:"]
["WHO/UNICEF JMP customised wealth index excludes water,"]
[" sanitation and hygiene assets."]
["Survey used for analysis:",{"$f":"A1025","v":"DHS15"}]
[{"$f":"B1028","v":""}]
[{"$f":"B1027","v":""}]
[]
[]
["Use of drinking water sources",null,"NATIONAL wealth index quintile",null,null,null,null,"URBAN wealth index quintile",null,null,null,null,"RURAL wealth index quintile",null,null,null,null,"SUB-REGIONS:",null,null,null,null,null,null,null,null,null,null,null,null,null,null,null,null,null,null,null,null,null,null,null,null,null,null,null,null,null,null,null,null,null,null,"Raw numbers of respondents:","Use of drinking water sources","NATIONAL wealth index quintile",null,null,null,null,"URBAN wealth index quintile",null,null,null,null,"RURAL wealth index quintile",null,null,null,null,"SUB-REGIONS:"]
["Weighted percentage (used in graphs)",null,"Poorest","Poor","Middle","Rich","Richest","Poorest","Poor","Middle","Rich","Richest","Poorest","Poor","Middle","Rich","Richest","Central","Metropolitana","Noroccidente","Nororiente","Norte","Petén","Suroccidente","Suroriente",null,null,null,null,null,null,null,null,null,null,null,null,null,null,null,null,null,null,null,null,null,null,null,null,null,null,null,"Water data, raw numbers (weighted)",null,"Poorest","Poor","Middle","Rich","Richest","Poorest","Poor","Middle","Rich","Richest","Poorest","Poor","Middle","Rich","Richest","Central","Metropolitana","Noroccidente","Nororiente","Norte","Petén","Suroccidente","Suroriente"]
["Water","Improved",85.9,96.2,98.6,99.4,99.9,98.6,99.7,99.9,100,99.9,81.2,91.4,97,98.2,98.9,99.4,99.9,95.3,94.3,82.1,95.6,98.3,94.4,null,null,null,null,null,null,null,null,null,null,null,null,null,null,null,null,null,null,null,null,null,null,null,null,null,null,null,"Water","Improved","N/A","N/A","N/A","N/A","N/A","N/A","N/A","N/A","N/A","N/A","N/A","N/A","N/A","N/A","N/A","N/A","N/A","N/A","N/A","N/A","N/A","N/A","N/A"]
[null,"Not Improved",14.1,3.8,1.4,0.6,0.1,1.4,0.3,0.1,0,0.1,18.8,8.6,3,1.8,1.1000000000000001,0.6,0.1,4.7,5.7,17.899999999999999,4.4000000000000004,1.7,5.6,null,null,null,null,null,null,null,null,null,null,null,null,null,null,null,null,null,null,null,null,null,null,null,null,null,null,null,null,"Not Improved","N/A","N/A","N/A","N/A","N/A","N/A","N/A","N/A","N/A","N/A","N/A","N/A","N/A","N/A","N/A","N/A","N/A","N/A","N/A","N/A","N/A","N/A","N/A"]
["Water ladder","Basic",84.4,95.4,98.3,99.3,99.9,98.2,99.6,99.9,99.9,99.9,79.2,90.5,96,97.7,98.8,99.3,99.9,94,93.6,80.8,95,98,93.4,null,null,null,null,null,null,null,null,null,null,null,null,null,null,null,null,null,null,null,null,null,null,null,null,null,null,null,"Water ladder","Basic","N/A","N/A","N/A","N/A","N/A","N/A","N/A","N/A","N/A","N/A","N/A","N/A","N/A","N/A","N/A","N/A","N/A","N/A","N/A","N/A","N/A","N/A","N/A"]
[null,"Limited",1.6,0.8,0.3,0.1,0.1,0.3,0.1,0,0.1,0,2,0.9,1,0.5,0.1,0.1,0,1.3,0.7,1.3,0.6,0.3,1,null,null,null,null,null,null,null,null,null,null,null,null,null,null,null,null,null,null,null,null,null,null,null,null,null,null,null,null,"Limited","N/A","N/A","N/A","N/A","N/A","N/A","N/A","N/A","N/A","N/A","N/A","N/A","N/A","N/A","N/A","N/A","N/A","N/A","N/A","N/A","N/A","N/A","N/A"]
[null,"Unimproved",8,2.2999999999999998,0.9,0.2,0.1,1.2,0.3,0.1,0,0.1,10.3,4.9000000000000004,1.9,1.2,0.3,0.5,0.1,2.2999999999999998,3.4,9,2,1.1000000000000001,4.7,null,null,null,null,null,null,null,null,null,null,null,null,null,null,null,null,null,null,null,null,null,null,null,null,null,null,null,null,"Unimproved","N/A","N/A","N/A","N/A","N/A","N/A","N/A","N/A","N/A","N/A","N/A","N/A","N/A","N/A","N/A","N/A","N/A","N/A","N/A","N/A","N/A","N/A","N/A"]
[null,"Surface water",6.1,1.5,0.5,0.5,0,0.2,0,0,0,0,8.5,3.7,1.2,0.6,0.8,0.1,0,2.4,2.2999999999999998,8.9,2.4,0.6,0.9,null,null,null,null,null,null,null,null,null,null,null,null,null,null,null,null,null,null,null,null,null,null,null,null,null,null,null,null,"Surface water","N/A","N/A","N/A","N/A","N/A","N/A","N/A","N/A","N/A","N/A","N/A","N/A","N/A","N/A","N/A","N/A","N/A","N/A","N/A","N/A","N/A","N/A","N/A"]
["Improved water point at more than 30 minutes","Yes",1.8,0.8,0.3,0.1,0.1,0.3,0.1,0,0.1,0,2.5,1,1,0.5,0.1,0.1,0,1.4,0.7,1.5,0.7,0.3,1.1000000000000001,null,null,null,null,null,null,null,null,null,null,null,null,null,null,null,null,null,null,null,null,null,null,null,null,null,null,null,"Improved water point at more than 30 minutes","Yes","N/A","N/A","N/A","N/A","N/A","N/A","N/A","N/A","N/A","N/A","N/A","N/A","N/A","N/A","N/A","N/A","N/A","N/A","N/A","N/A","N/A","N/A","N/A"]
[null,"No",98.2,99.2,99.7,99.9,99.9,99.7,99.9,100,99.9,100,97.5,99,99,99.5,99.9,99.9,100,98.6,99.3,98.5,99.3,99.7,98.9,null,null,null,null,null,null,null,null,null,null,null,null,null,null,null,null,null,null,null,null,null,null,null,null,null,null,null,null,"No","N/A","N/A","N/A","N/A","N/A","N/A","N/A","N/A","N/A","N/A","N/A","N/A","N/A","N/A","N/A","N/A","N/A","N/A","N/A","N/A","N/A","N/A","N/A"]
["Manually calculated ratios","Improved wells"]
[null,"Improved springs"]
[null,"Other"]
[null,null,"NATIONAL wealth index quintile",null,null,null,null,"URBAN wealth index quintile",null,null,null,null,"RURAL wealth index quintile",null,null,null,null,"SUB-REGIONS:",null,null,null,null,null,null,null,null,null,null,null,null,null,null,null,null,null,null,null,null,null,null,null,null,null,null,null,null,null,null,null,null,null,null,"Raw numbers of respondents:","Use of drinking water sources","NATIONAL wealth index quintile",null,null,null,null,"URBAN wealth index quintile",null,null,null,null,"RURAL wealth index quintile",null,null,null,null,"SUB-REGIONS:"]
["Percentage based on weighted population",null,"Poorest","Poor","Middle","Rich","Richest","Poorest","Poor","Middle","Rich","Richest","Poorest","Poor","Middle","Rich","Richest","Central","Metropolitana","Noroccidente","Nororiente","Norte","Petén","Suroccidente","Suroriente",null,null,null,null,null,null,null,null,null,null,null,null,null,null,null,null,null,null,null,null,null,null,null,null,null,null,null,"Water data, raw numbers (weighted)",null,"Poorest","Poor","Middle","Rich","Richest","Poorest","Poor","Middle","Rich","Richest","Poorest","Poor","Middle","Rich","Richest","Central","Metropolitana","Noroccidente","Nororiente","Norte","Petén","Suroccidente","Suroriente"]
["Piped water","Yes",63.1,74,70.400000000000006,53.7,28.7,78.900000000000006,66.099999999999994,47.4,33.299999999999997,21.6,57,68.3,74,70.5,51.5,57.9,40.4,77.400000000000006,64.400000000000006,51.3,37.200000000000003,62,64.5,null,null,null,null,null,null,null,null,null,null,null,null,null,null,null,null,null,null,null,null,null,null,null,null,null,null,null,"Piped water","Yes","N/A","N/A","N/A","N/A","N/A","N/A","N/A","N/A","N/A","N/A","N/A","N/A","N/A","N/A","N/A","N/A","N/A","N/A","N/A","N/A","N/A","N/A","N/A"]
[null,"No",36.9,26,29.6,46.3,71.3,21.1,33.9,52.6,66.7,78.400000000000006,43,31.7,26,29.5,48.5,42.1,59.6,22.6,35.6,48.7,62.8,38,35.5,null,null,null,null,null,null,null,null,null,null,null,null,null,null,null,null,null,null,null,null,null,null,null,null,null,null,null,null,"No","N/A","N/A","N/A","N/A","N/A","N/A","N/A","N/A","N/A","N/A","N/A","N/A","N/A","N/A","N/A","N/A","N/A","N/A","N/A","N/A","N/A","N/A","N/A"]
["Piped water on premises","Yes",52.6,67.7,65.8,52.6,28.4,71.8,64.2,46.8,33.1,21.5,45.7,59.3,69.099999999999994,65,50,55,38.799999999999997,69.5,56.8,45.9,34.6,58.8,56.2,null,null,null,null,null,null,null,null,null,null,null,null,null,null,null,null,null,null,null,null,null,null,null,null,null,null,null,"Piped water on premises","Yes","N/A","N/A","N/A","N/A","N/A","N/A","N/A","N/A","N/A","N/A","N/A","N/A","N/A","N/A","N/A","N/A","N/A","N/A","N/A","N/A","N/A","N/A","N/A"]
[null,"No",47.4,32.299999999999997,34.200000000000003,47.4,71.599999999999994,28.2,35.799999999999997,53.2,66.900000000000006,78.5,54.3,40.700000000000003,30.9,35,50,45,61.2,30.5,43.2,54.1,65.400000000000006,41.2,43.8,null,null,null,null,null,null,null,null,null,null,null,null,null,null,null,null,null,null,null,null,null,null,null,null,null,null,null,null,"No","N/A","N/A","N/A","N/A","N/A","N/A","N/A","N/A","N/A","N/A","N/A","N/A","N/A","N/A","N/A","N/A","N/A","N/A","N/A","N/A","N/A","N/A","N/A"]
["Piped water into dwelling","Yes","N/A","N/A","N/A","N/A","N/A","N/A","N/A","N/A","N/A","N/A","N/A","N/A","N/A","N/A","N/A","N/A","N/A","N/A","N/A","N/A","N/A","N/A","N/A",null,null,null,null,null,null,null,null,null,null,null,null,null,null,null,null,null,null,null,null,null,null,null,null,null,null,null,"Piped water into dwelling","Yes","N/A","N/A","N/A","N/A","N/A","N/A","N/A","N/A","N/A","N/A","N/A","N/A","N/A","N/A","N/A","N/A","N/A","N/A","N/A","N/A","N/A","N/A","N/A"]
[null,"No","N/A","N/A","N/A","N/A","N/A","N/A","N/A","N/A","N/A","N/A","N/A","N/A","N/A","N/A","N/A","N/A","N/A","N/A","N/A","N/A","N/A","N/A","N/A",null,null,null,null,null,null,null,null,null,null,null,null,null,null,null,null,null,null,null,null,null,null,null,null,null,null,null,null,"No","N/A","N/A","N/A","N/A","N/A","N/A","N/A","N/A","N/A","N/A","N/A","N/A","N/A","N/A","N/A","N/A","N/A","N/A","N/A","N/A","N/A","N/A","N/A"]
["Water source on premises","Yes",69.5,84.4,92.2,97.3,99.5,89.4,96.3,98.5,99.8,99.8,63.3,75.400000000000006,86.6,91.1,96.3,93.4,97.6,85.3,86.5,69.8,81.2,93,80.5,null,null,null,null,null,null,null,null,null,null,null,null,null,null,null,null,null,null,null,null,null,null,null,null,null,null,null,"Water source on premises","Yes","N/A","N/A","N/A","N/A","N/A","N/A","N/A","N/A","N/A","N/A","N/A","N/A","N/A","N/A","N/A","N/A","N/A","N/A","N/A","N/A","N/A","N/A","N/A"]
[null,"No",30.5,15.6,7.8,2.7,0.5,10.6,3.7,1.5,0.2,0.2,36.700000000000003,24.6,13.4,8.9,3.7,6.6,2.4,14.7,13.5,30.2,18.8,7,19.5,null,null,null,null,null,null,null,null,null,null,null,null,null,null,null,null,null,null,null,null,null,null,null,null,null,null,null,null,"No","N/A","N/A","N/A","N/A","N/A","N/A","N/A","N/A","N/A","N/A","N/A","N/A","N/A","N/A","N/A","N/A","N/A","N/A","N/A","N/A","N/A","N/A","N/A"]
["Improved Water source on premises","Yes",79.5,87.6,93.4,97.9,99.6,90.3,96.6,98.7,99.8,99.9,76.2,82,89,92.6,97.4,93.9,97.7,89.2,91.3,83.5,84.7,94.5,84.9,null,null,null,null,null,null,null,null,null,null,null,null,null,null,null,null,null,null,null,null,null,null,null,null,null,null,null,"Improved water source on premises","Yes","N/A","N/A","N/A","N/A","N/A","N/A","N/A","N/A","N/A","N/A","N/A","N/A","N/A","N/A","N/A","N/A","N/A","N/A","N/A","N/A","N/A","N/A","N/A"]
[null,"No",20.5,12.4,6.6,2.1,0.4,9.6999999999999993,3.4,1.3,0.2,0.1,23.8,18,11,7.4,2.6,6.1,2.2999999999999998,10.8,8.6999999999999993,16.5,15.3,5.5,15.1,null,null,null,null,null,null,null,null,null,null,null,null,null,null,null,null,null,null,null,null,null,null,null,null,null,null,null,null,"No","N/A","N/A","N/A","N/A","N/A","N/A","N/A","N/A","N/A","N/A","N/A","N/A","N/A","N/A","N/A","N/A","N/A","N/A","N/A","N/A","N/A","N/A","N/A"]
["Piped water on premises available when needed","Yes","N/A","N/A","N/A","N/A","N/A","N/A","N/A","N/A","N/A","N/A","N/A","N/A","N/A","N/A","N/A","N/A","N/A","N/A","N/A","N/A","N/A","N/A","N/A",null,null,null,null,null,null,null,null,null,null,null,null,null,null,null,null,null,null,null,null,null,null,null,null,null,null,null,"Piped water on premises available when needed","Yes","N/A","N/A","N/A","N/A","N/A","N/A","N/A","N/A","N/A","N/A","N/A","N/A","N/A","N/A","N/A","N/A","N/A","N/A","N/A","N/A","N/A","N/A","N/A"]
[null,"No","N/A","N/A","N/A","N/A","N/A","N/A","N/A","N/A","N/A","N/A","N/A","N/A","N/A","N/A","N/A","N/A","N/A","N/A","N/A","N/A","N/A","N/A","N/A",null,null,null,null,null,null,null,null,null,null,null,null,null,null,null,null,null,null,null,null,null,null,null,null,null,null,null,null,"No","N/A","N/A","N/A","N/A","N/A","N/A","N/A","N/A","N/A","N/A","N/A","N/A","N/A","N/A","N/A","N/A","N/A","N/A","N/A","N/A","N/A","N/A","N/A"]
["Water point at more than 30 minutes","Yes",4.3,1.6,0.6,0.3,0.1,0.6,0.1,0,0.1,0.1,5.9,2.6,1.4,0.8,0.5,0.1,0,2.7,1.7,4.9000000000000004,1.2,0.6,1.8,null,null,null,null,null,null,null,null,null,null,null,null,null,null,null,null,null,null,null,null,null,null,null,null,null,null,null,"Water point at more than 30 minutes","Yes","N/A","N/A","N/A","N/A","N/A","N/A","N/A","N/A","N/A","N/A","N/A","N/A","N/A","N/A","N/A","N/A","N/A","N/A","N/A","N/A","N/A","N/A","N/A"]
[null,"No",95.7,98.4,99.4,99.7,99.9,99.4,99.9,100,99.9,99.9,94.1,97.4,98.6,99.2,99.5,99.9,100,97.3,98.3,95.1,98.8,99.4,98.2,null,null,null,null,null,null,null,null,null,null,null,null,null,null,null,null,null,null,null,null,null,null,null,null,null,null,null,null,"No","N/A","N/A","N/A","N/A","N/A","N/A","N/A","N/A","N/A","N/A","N/A","N/A","N/A","N/A","N/A","N/A","N/A","N/A","N/A","N/A","N/A","N/A","N/A"]
["Water source available when needed","Yes","N/A","N/A","N/A","N/A","N/A","N/A","N/A","N/A","N/A","N/A","N/A","N/A","N/A","N/A","N/A","N/A","N/A","N/A","N/A","N/A","N/A","N/A","N/A",null,null,null,null,null,null,null,null,null,null,null,null,null,null,null,null,null,null,null,null,null,null,null,null,null,null,null,"Water source available when needed","Yes","N/A","N/A","N/A","N/A","N/A","N/A","N/A","N/A","N/A","N/A","N/A","N/A","N/A","N/A","N/A","N/A","N/A","N/A","N/A","N/A","N/A","N/A","N/A"]
[null,"No","N/A","N/A","N/A","N/A","N/A","N/A","N/A","N/A","N/A","N/A","N/A","N/A","N/A","N/A","N/A","N/A","N/A","N/A","N/A","N/A","N/A","N/A","N/A",null,null,null,null,null,null,null,null,null,null,null,null,null,null,null,null,null,null,null,null,null,null,null,null,null,null,null,null,"No","N/A","N/A","N/A","N/A","N/A","N/A","N/A","N/A","N/A","N/A","N/A","N/A","N/A","N/A","N/A","N/A","N/A","N/A","N/A","N/A","N/A","N/A","N/A"]
["Improved water source available when needed","Yes","N/A","N/A","N/A","N/A","N/A","N/A","N/A","N/A","N/A","N/A","N/A","N/A","N/A","N/A","N/A","N/A","N/A","N/A","N/A","N/A","N/A","N/A","N/A",null,null,null,null,null,null,null,null,null,null,null,null,null,null,null,null,null,null,null,null,null,null,null,null,null,null,null,"Improved water source available when needed","Yes","N/A","N/A","N/A","N/A","N/A","N/A","N/A","N/A","N/A","N/A","N/A","N/A","N/A","N/A","N/A","N/A","N/A","N/A","N/A","N/A","N/A","N/A","N/A"]
[null,"No","N/A","N/A","N/A","N/A","N/A","N/A","N/A","N/A","N/A","N/A","N/A","N/A","N/A","N/A","N/A","N/A","N/A","N/A","N/A","N/A","N/A","N/A","N/A",null,null,null,null,null,null,null,null,null,null,null,null,null,null,null,null,null,null,null,null,null,null,null,null,null,null,null,null,"No","N/A","N/A","N/A","N/A","N/A","N/A","N/A","N/A","N/A","N/A","N/A","N/A","N/A","N/A","N/A","N/A","N/A","N/A","N/A","N/A","N/A","N/A","N/A"]
["Microbiological quality at point of collection","Not contaminated (No E. coli in 100 mL)","N/A","N/A","N/A","N/A","N/A","N/A","N/A","N/A","N/A","N/A","N/A","N/A","N/A","N/A","N/A","N/A","N/A","N/A","N/A","N/A","N/A","N/A","N/A",null,null,null,null,null,null,null,null,null,null,null,null,null,null,null,null,null,null,null,null,null,null,null,null,null,null,null,"Microbiological quality at point of collection","Not contaminated (No E. coli in 100 mL)","N/A","N/A","N/A","N/A","N/A","N/A","N/A","N/A","N/A","N/A","N/A","N/A","N/A","N/A","N/A","N/A","N/A","N/A","N/A","N/A","N/A","N/A","N/A"]
[null,"Contaminated (E. coli detected in 100 mL)","N/A","N/A","N/A","N/A","N/A","N/A","N/A","N/A","N/A","N/A","N/A","N/A","N/A","N/A","N/A","N/A","N/A","N/A","N/A","N/A","N/A","N/A","N/A",null,null,null,null,null,null,null,null,null,null,null,null,null,null,null,null,null,null,null,null,null,null,null,null,null,null,null,null,"Contaminated (E. coli detected in 100 mL)","N/A","N/A","N/A","N/A","N/A","N/A","N/A","N/A","N/A","N/A","N/A","N/A","N/A","N/A","N/A","N/A","N/A","N/A","N/A","N/A","N/A","N/A","N/A"]
[null,"Highly contaminated (>100 CFU/100 mL)","N/A","N/A","N/A","N/A","N/A","N/A","N/A","N/A","N/A","N/A","N/A","N/A","N/A","N/A","N/A","N/A","N/A","N/A","N/A","N/A","N/A","N/A","N/A",null,null,null,null,null,null,null,null,null,null,null,null,null,null,null,null,null,null,null,null,null,null,null,null,null,null,null,null,"Highly contaminated (>100 CFU/100 mL)","N/A","N/A","N/A","N/A","N/A","N/A","N/A","N/A","N/A","N/A","N/A","N/A","N/A","N/A","N/A","N/A","N/A","N/A","N/A","N/A","N/A","N/A","N/A"]
["Microbiological quality of improved water sources at point of collection","Not contaminated (No E. coli in 100 mL)","N/A","N/A","N/A","N/A","N/A","N/A","N/A","N/A","N/A","N/A","N/A","N/A","N/A","N/A","N/A","N/A","N/A","N/A","N/A","N/A","N/A","N/A","N/A",null,null,null,null,null,null,null,null,null,null,null,null,null,null,null,null,null,null,null,null,null,null,null,null,null,null,null,"Microbiological quality of improved water sources at point of collection","Not contaminated (No E. coli in 100 mL)","N/A","N/A","N/A","N/A","N/A","N/A","N/A","N/A","N/A","N/A","N/A","N/A","N/A","N/A","N/A","N/A","N/A","N/A","N/A","N/A","N/A","N/A","N/A"]
[null,"Contaminated (E. coli detected in 100 mL)","N/A","N/A","N/A","N/A","N/A","N/A","N/A","N/A","N/A","N/A","N/A","N/A","N/A","N/A","N/A","N/A","N/A","N/A","N/A","N/A","N/A","N/A","N/A",null,null,null,null,null,null,null,null,null,null,null,null,null,null,null,null,null,null,null,null,null,null,null,null,null,null,null,null,"Contaminated (E. coli detected in 100 mL)","N/A","N/A","N/A","N/A","N/A","N/A","N/A","N/A","N/A","N/A","N/A","N/A","N/A","N/A","N/A","N/A","N/A","N/A","N/A","N/A","N/A","N/A","N/A"]
[null,"Highly contaminated (>100 CFU/100 mL)","N/A","N/A","N/A","N/A","N/A","N/A","N/A","N/A","N/A","N/A","N/A","N/A","N/A","N/A","N/A","N/A","N/A","N/A","N/A","N/A","N/A","N/A","N/A",null,null,null,null,null,null,null,null,null,null,null,null,null,null,null,null,null,null,null,null,null,null,null,null,null,null,null,null,"Highly contaminated (>100 CFU/100 mL)","N/A","N/A","N/A","N/A","N/A","N/A","N/A","N/A","N/A","N/A","N/A","N/A","N/A","N/A","N/A","N/A","N/A","N/A","N/A","N/A","N/A","N/A","N/A"]
["Microbiological quality of piped on premises at point of collection","Not contaminated (No E. coli in 100 mL)","N/A","N/A","N/A","N/A","N/A","N/A","N/A","N/A","N/A","N/A","N/A","N/A","N/A","N/A","N/A","N/A","N/A","N/A","N/A","N/A","N/A","N/A","N/A",null,null,null,null,null,null,null,null,null,null,null,null,null,null,null,null,null,null,null,null,null,null,null,null,null,null,null,"Microbiological quality of piped on premises at point of collection","Not contaminated (No E. coli in 100 mL)","N/A","N/A","N/A","N/A","N/A","N/A","N/A","N/A","N/A","N/A","N/A","N/A","N/A","N/A","N/A","N/A","N/A","N/A","N/A","N/A","N/A","N/A","N/A"]
[null,"Contaminated (E. coli detected in 100 mL)","N/A","N/A","N/A","N/A","N/A","N/A","N/A","N/A","N/A","N/A","N/A","N/A","N/A","N/A","N/A","N/A","N/A","N/A","N/A","N/A","N/A","N/A","N/A",null,null,null,null,null,null,null,null,null,null,null,null,null,null,null,null,null,null,null,null,null,null,null,null,null,null,null,null,"Contaminated (E. coli detected in 100 mL)","N/A","N/A","N/A","N/A","N/A","N/A","N/A","N/A","N/A","N/A","N/A","N/A","N/A","N/A","N/A","N/A","N/A","N/A","N/A","N/A","N/A","N/A","N/A"]
[null,"Highly contaminated (>100 CFU/100 mL)","N/A","N/A","N/A","N/A","N/A","N/A","N/A","N/A","N/A","N/A","N/A","N/A","N/A","N/A","N/A","N/A","N/A","N/A","N/A","N/A","N/A","N/A","N/A",null,null,null,null,null,null,null,null,null,null,null,null,null,null,null,null,null,null,null,null,null,null,null,null,null,null,null,null,"Highly contaminated (>100 CFU/100 mL)","N/A","N/A","N/A","N/A","N/A","N/A","N/A","N/A","N/A","N/A","N/A","N/A","N/A","N/A","N/A","N/A","N/A","N/A","N/A","N/A","N/A","N/A","N/A"]
[null,null,"NATIONAL wealth index quintile",null,null,null,null,"URBAN wealth index quintile",null,null,null,null,"RURAL wealth index quintile",null,null,null,null,"SUB-REGIONS:",null,null,null,null,null,null,null,null,null,null,null,null,null,null,null,null,null,null,null,null,null,null,null,null,null,null,null,null,null,null,null,null,null,null,"Raw numbers of respondents:","Use of drinking water sources","NATIONAL wealth index quintile",null,null,null,null,"URBAN wealth index quintile",null,null,null,null,"RURAL wealth index quintile",null,null,null,null,"SUB-REGIONS:"]
["Percentage based on weighted population",null,"Poorest","Poor","Middle","Rich","Richest","Poorest","Poor","Middle","Rich","Richest","Poorest","Poor","Middle","Rich","Richest","Central","Metropolitana","Noroccidente","Nororiente","Norte","Petén","Suroccidente","Suroriente",null,null,null,null,null,null,null,null,null,null,null,null,null,null,null,null,null,null,null,null,null,null,null,null,null,null,null,"Water data, raw numbers (weighted)",null,"Poorest","Poor","Middle","Rich","Richest","Poorest","Poor","Middle","Rich","Richest","Poorest","Poor","Middle","Rich","Richest","Central","Metropolitana","Noroccidente","Nororiente","Norte","Petén","Suroccidente","Suroriente"]
["Source of drinking water","Piped into dwelling",11.3,18,25.3,27,19.100000000000001,20.9,29.4,27.8,22,17.899999999999999,9.5,13.4,19,24.1,21.9,24.1,21.4,13.4,27.2,12.6,11.3,21.1,25.7]
[null,"Piped to yard/plot",41.3,49.7,40.5,25.6,9.3000000000000007,50.9,34.799999999999997,18.899999999999999,11.1,3.6,36.200000000000003,45.9,50.1,40.9,28.1,31,17.399999999999999,56.1,29.6,33.299999999999997,23.3,37.700000000000003,30.4]
[null,"Public tap/standpipe",2.5,2.4,1.6,0.2,0.1,2,0.4,0.1,0,0,2.5,3.1,2,1.9,0.5,0.8,0.2,3.4,2.1,1.3,0.7,0.5,3.5]
[null,"Other piped",8,3.9,3,0.8,0.2,5.2,1.6,0.6,0.1,0.1,8.6999999999999993,5.9,2.8,3.6,1,2.1,1.5,4.5,5.5,4.2,1.9,2.7,4.8]
[null,"Public fountain/tank",1.5,1.2,0.8,0.1,0,0.9,0.2,0,0,0,1.5,1.3,1.4,1,0.3,2.2000000000000002,0,0.6,0.8,1.1000000000000001,0.3,0.4,1.6]
[null,"Mechanical or manual well",14,14.5,14.1,7.9,1.9,9.4,7.3,4.0999999999999996,1.1000000000000001,1.1000000000000001,14.9,15.2,16.2,17,10.9,12.8,3.8,5.2,4.5999999999999996,9.6999999999999993,25.1,18.7,8.5]
[null,"River/irrigation channel",4.7,0.9,0.2,0.5,0,0.2,0,0,0,0,6.6,2.4,0.6,0.3,0.8,0.1,0,1.7,1.8,6.8,1.7,0.3,0.8]
[null,"Lake or stream",1.4,0.6,0.2,0,0,0,0,0,0,0,1.8,1.2,0.6,0.3,0,0,0,0.7,0.5,2.1,0.7,0.3,0.1]
[null,"Protected spring",2.4,1.1000000000000001,0.4,0.3,0.1,0.3,0.2,0,0,0.1,3.1,2,1,0.4,0.5,0.1,0,1.2,1.4,2.5,0.9,0.4,2.1]
[null,"Unprotected spring",7.4,2.1,0.7,0.2,0,1.1000000000000001,0.2,0.1,0,0.1,9.8000000000000007,4.4000000000000004,1.8,1,0.2,0.3,0.1,1.9,2.9,8.8000000000000007,2,1,4.3]
[null,"Rainwater",3.7,1.3,1.1000000000000001,0.5,0,0.2,0.1,0,0,0,4.5,3.1,1,1.7,0.8,0.1,0,2.2000000000000002,0.4,5.9,10.6,0,0]
[null,"Tanker truck",0.2,0.1,0,0.3,0,0.2,0,0.1,0,0,0.1,0.3,0.1,0,0.3,0.1,0.1,0.3,0.1,0.2,0.1,0,0.3]
[null,"Bottled water",1,4,11.8,36.700000000000003,69.099999999999994,8.6999999999999993,25.7,48.1,65.5,77.2,0.2,1.2,3.2,7.6,34.5,26.4,55.5,8.5,22.7,11.3,21.5,16.8,17.399999999999999]
[null,"Other",0.6,0.1,0.2,0,0,0.1,0.1,0,0,0,0.5,0.6,0.1,0.2,0,0.2,0,0.4,0.5,0.2,0,0.1,0.3]
[]
[]
[]
[]
[]
[]
[]
[]
[]
[]
[]
[]
[]
[]
[]
[]
[]
[]
[]
[]
[]
[]
[]
[]
[]
[]
[]
[]
[]
[]
[]
[]
[]
[]
[]
[]
[{"$f":"A1026","v":"Guatemala"}]
[{"$f":"A1034","v":"2015"}]
["Use of sanitation facilities"]
[" by wealth quintile and sub-national region"]
["Notes:"]
["WHO/UNICEF JMP customised wealth index excludes water,"]
[" sanitation and hygiene assets."]
["Survey used for analysis:",{"$f":"A1025","v":"DHS15"}]
[{"$f":"B1030","v":"Ratio of Improved latrines based on:"},"50% Rule"]
[{"$f":"B1029","v":"Ratio of Shared improved based on:"},"Shared sanitation"]
[]
[]
["Use of sanitation facilities",null,"NATIONAL wealth index quintile",null,null,null,null,"URBAN wealth index quintile",null,null,null,null,"RURAL wealth index quintile",null,null,null,null,"SUB-REGIONS:",null,null,null,null,null,null,null,null,null,null,null,null,null,null,null,null,null,null,null,null,null,null,null,null,null,null,null,null,null,null,null,null,null,null,"Raw numbers of respondents:","Use of sanitation facilities","NATIONAL wealth index quintile",null,null,null,null,"URBAN wealth index quintile",null,null,null,null,"RURAL wealth index quintile",null,null,null,null,"SUB-REGIONS:"]
["Weighted percentage (used in graphs)",null,"Poorest","Poor","Middle","Rich","Richest","Poorest","Poor","Middle","Rich","Richest","Poorest","Poor","Middle","Rich","Richest","Central","Metropolitana","Noroccidente","Nororiente","Norte","Petén","Suroccidente","Suroriente",null,null,null,null,null,null,null,null,null,null,null,null,null,null,null,null,null,null,null,null,null,null,null,null,null,null,null,"Sanitation data, raw numbers (weighted)",null,"Poorest","Poor","Middle","Rich","Richest","Poorest","Poor","Middle","Rich","Richest","Poorest","Poor","Middle","Rich","Richest","Central","Metropolitana","Noroccidente","Nororiente","Norte","Petén","Suroccidente","Suroriente"]
["Sanitation","Improved",{"$f":"C153+C154+C156+C157+C158*0.5","v":46.884286225441315},{"$f":"D153+D154+D156+D157+D158*0.5","v":59.185670367778833},73.523136735187308,88.519610126222574,97.069940571310113,69.237982112025321,88.186845009874972,95.630354901723237,97.724505813823214,98.689054102775486,43.558560687433364,49.892698831396423,57.907481051906288,68.887172284507599,82.616285198024187,82.150924189059168,92.31221786727717,60.474026133555327,69.060605953727105,61.192847473891291,58.478390429381847,70.6056514696797,68.559453237467167,null,null,null,null,null,null,null,null,null,null,null,null,null,null,null,null,null,null,null,null,null,null,null,null,null,null,null,"Sanitation","Improved","N/A","N/A","N/A","N/A","N/A","N/A","N/A","N/A","N/A","N/A","N/A","N/A","N/A","N/A","N/A","N/A","N/A","N/A","N/A","N/A","N/A","N/A","N/A"]
[null,"Not Improved",{"$f":"C159+C155+C158*0.5+C160","v":53.11571377455941},{"$f":"D159+D155+D158*0.5+D160","v":40.814329632221039},26.476863264812547,11.480389873777453,2.9300594286904023,30.762017887975034,11.813154990125259,4.3696450982769637,2.2754941861767275,1.3109458972244858,56.441439312566331,50.107301168603556,42.092518948093883,31.112827715492038,17.383714801975877,17.849075810940793,7.6877821327223703,39.525973866444865,30.939394046273058,38.807152526108908,41.521609570618125,29.394348530319654,31.440546762533167,null,null,null,null,null,null,null,null,null,null,null,null,null,null,null,null,null,null,null,null,null,null,null,null,null,null,null,null,"Not Improved","N/A","N/A","N/A","N/A","N/A","N/A","N/A","N/A","N/A","N/A","N/A","N/A","N/A","N/A","N/A","N/A","N/A","N/A","N/A","N/A","N/A","N/A","N/A"]
["Sanitation ladder","Basic",{"$f":"C122*C152/100","v":39.129938133161296},{"$f":"D122*D152/100","v":48.980078560382715},61.978716232956415,75.64290274043293,91.897823532965049,55.527330962793869,72.256011148718983,79.997600835289759,90.319310728692912,96.501419449324331,37.595565651963398,40.601673714056219,48.648929938953614,58.790887517032452,74.4019903496674,66.362979381342299,78.056803663078185,54.725152087538689,61.494318173565723,54.287672734072942,51.285975077475172,60.530294179755401,59.579509123061314,null,null,null,null,null,null,null,null,null,null,null,null,null,null,null,null,null,null,null,null,null,null,null,null,null,null,null,"Sanitation ladder","Basic","N/A","N/A","N/A","N/A","N/A","N/A","N/A","N/A","N/A","N/A","N/A","N/A","N/A","N/A","N/A","N/A","N/A","N/A","N/A","N/A","N/A","N/A","N/A"]
[null,"Limited",{"$f":"C122*C151/100","v":7.7272360665661299},{"$f":"D122*D151/100","v":10.191484739586771},11.544420502230945,12.83101939374817,5.1721170383450552,13.710651149231417,15.930833861156225,15.632754066433726,7.4051950851303454,2.1876346534510471,5.9629950354698851,9.2436769488383863,9.2345147682027822,10.096284767475135,8.1398616085335647,15.787944807716945,14.255414204198473,5.7488740460166978,7.5662877801614101,6.9051747398184311,7.1924153519066207,10.00301805822798,8.979944114405976,null,null,null,null,null,null,null,null,null,null,null,null,null,null,null,null,null,null,null,null,null,null,null,null,null,null,null,null,"Limited","N/A","N/A","N/A","N/A","N/A","N/A","N/A","N/A","N/A","N/A","N/A","N/A","N/A","N/A","N/A","N/A","N/A","N/A","N/A","N/A","N/A","N/A","N/A"]
[null,"Unimproved",{"$f":"100-C124-C125-C127","v":34.83978722505146},{"$f":"100-D124-D125-D127","v":31.681479319755542},23.500136105145554,10.93957155836976,2.8523538146986533,25.315128640062785,10.757136203894325,4.3105729228910867,2.2341692593004763,1.310945897224622,34.107548899965735,36.841487893738588,32.766058489697159,27.765212257287711,16.606022018950437,13.931033219160078,6.944300191659968,30.860694243108522,17.209873652147994,34.305928731484322,29.901852160899828,25.228340796433727,16.565825490256913,null,null,null,null,null,null,null,null,null,null,null,null,null,null,null,null,null,null,null,null,null,null,null,null,null,null,null,null,"Unimproved","N/A","N/A","N/A","N/A","N/A","N/A","N/A","N/A","N/A","N/A","N/A","N/A","N/A","N/A","N/A","N/A","N/A","N/A","N/A","N/A","N/A","N/A","N/A"]
[null,"Open defecation",{"$f":"C160","v":18.303038575221116},{"$f":"D160","v":9.1469573802749728},2.9767271596670848,0.5865063074491399,7.7705613991242831E-2,5.4468892479119289,1.0560187862304666,5.9072175385427146E-2,4.1324926876266523E-2,0,22.333890412600979,13.313161443366806,9.350496803146445,3.3476154582047037,0.85212602284859829,3.9180425917806758,0.74348194106337373,8.6652796233360938,13.729520394124872,4.5012237946243001,11.619757409718382,4.2383469655828936,14.874721272275798,null,null,null,null,null,null,null,null,null,null,null,null,null,null,null,null,null,null,null,null,null,null,null,null,null,null,null,null,"Open defecation","N/A","N/A","N/A","N/A","N/A","N/A","N/A","N/A","N/A","N/A","N/A","N/A","N/A","N/A","N/A","N/A","N/A","N/A","N/A","N/A","N/A","N/A","N/A"]
["Shared among Improved Sanitation","Yes","N/A","N/A","N/A","N/A","N/A","N/A","N/A","N/A","N/A","N/A","N/A","N/A","N/A","N/A","N/A","N/A","N/A","N/A","N/A","N/A","N/A","N/A","N/A",null,null,null,null,null,null,null,null,null,null,null,null,null,null,null,null,null,null,null,null,null,null,null,null,null,null,null,"Shared among improved sanitation facilities","Yes","N/A","N/A","N/A","N/A","N/A","N/A","N/A","N/A","N/A","N/A","N/A","N/A","N/A","N/A","N/A","N/A","N/A","N/A","N/A","N/A","N/A","N/A","N/A"]
[null,"No","N/A","N/A","N/A","N/A","N/A","N/A","N/A","N/A","N/A","N/A","N/A","N/A","N/A","N/A","N/A","N/A","N/A","N/A","N/A","N/A","N/A","N/A","N/A",null,null,null,null,null,null,null,null,null,null,null,null,null,null,null,null,null,null,null,null,null,null,null,null,null,null,null,null,"No","N/A","N/A","N/A","N/A","N/A","N/A","N/A","N/A","N/A","N/A","N/A","N/A","N/A","N/A","N/A","N/A","N/A","N/A","N/A","N/A","N/A","N/A","N/A"]
["Manually calculated ratios","Improved latrines"]
[null,"Other"]
[null,"Other"]
[null,null,"NATIONAL wealth index quintile",null,null,null,null,"URBAN wealth index quintile",null,null,null,null,"RURAL wealth index quintile",null,null,null,null,"SUB-REGIONS:",null,null,null,null,null,null,null,null,null,null,null,null,null,null,null,null,null,null,null,null,null,null,null,null,null,null,null,null,null,null,null,null,null,null,"Raw numbers of respondents:","Use of sanitation facilities","NATIONAL wealth index quintile",null,null,null,null,"URBAN wealth index quintile",null,null,null,null,"RURAL wealth index quintile",null,null,null,null,"SUB-REGIONS:"]
["Percentage based on weighted population",null,"Poorest","Poor","Middle","Rich","Richest","Poorest","Poor","Middle","Rich","Richest","Poorest","Poor","Middle","Rich","Richest","Central","Metropolitana","Noroccidente","Nororiente","Norte","Petén","Suroccidente","Suroriente",null,null,null,null,null,null,null,null,null,null,null,null,null,null,null,null,null,null,null,null,null,null,null,null,null,null,null,"Sanitation data, raw numbers (weighted)",null,"Poorest","Poor","Middle","Rich","Richest","Poorest","Poor","Middle","Rich","Richest","Poorest","Poor","Middle","Rich","Richest","Central","Metropolitana","Noroccidente","Nororiente","Norte","Petén","Suroccidente","Suroriente"]
["Sanitation type","Sewer connection",4.6502205167961952,15.15248068112019,31.42351978113825,58.403031377991802,82.267271424189232,36.482949767389677,66.749689158426122,83.293995080067148,87.552616263787897,92.870531674392893,1.3751126350249179,4.6199301723893722,10.185141676542049,16.579860275911507,29.703755967589316,51.703709454010024,75.834190981859976,22.000846621455516,32.134062195533815,18.056473774565081,8.0970229644647187,31.396765896262043,24.899269961444318,null,null,null,null,null,null,null,null,null,null,null,null,null,null,null,null,null,null,null,null,null,null,null,null,null,null,null,"Sanitation type","Sewer connection","N/A","N/A","N/A","N/A","N/A","N/A","N/A","N/A","N/A","N/A","N/A","N/A","N/A","N/A","N/A","N/A","N/A","N/A","N/A","N/A","N/A","N/A","N/A"]
[null,"Septic tank connection",8.2906014669967139,13.209993149508506,21.788858306828264,21.729148476715189,13.514304698777943,10.710258233655177,13.586577933527252,9.8294690471565431,9.4378699426762243,5.6826626390505934,7.9684550843406647,9.794830432864094,15.458437308864138,27.330002109232566,39.637915029788388,18.380507650083157,10.859206993556709,9.2608412074590714,22.398718937677362,10.147688793770621,19.258242309745068,16.076613249498756,30.361800592586953,null,null,null,null,null,null,null,null,null,null,null,null,null,null,null,null,null,null,null,null,null,null,null,null,null,null,null,null,"Septic tank connection","N/A","N/A","N/A","N/A","N/A","N/A","N/A","N/A","N/A","N/A","N/A","N/A","N/A","N/A","N/A","N/A","N/A","N/A","N/A","N/A","N/A","N/A","N/A"]
[null,"Improved latrines","N/A","N/A","N/A","N/A","N/A","N/A","N/A","N/A","N/A","N/A","N/A","N/A","N/A","N/A","N/A","N/A","N/A","N/A","N/A","N/A","N/A","N/A","N/A",null,null,null,null,null,null,null,null,null,null,null,null,null,null,null,null,null,null,null,null,null,null,null,null,null,null,null,null,"Improved latrines","N/A","N/A","N/A","N/A","N/A","N/A","N/A","N/A","N/A","N/A","N/A","N/A","N/A","N/A","N/A","N/A","N/A","N/A","N/A","N/A","N/A","N/A","N/A"]
[null,"Unimproved facilities","N/A","N/A","N/A","N/A","N/A","N/A","N/A","N/A","N/A","N/A","N/A","N/A","N/A","N/A","N/A","N/A","N/A","N/A","N/A","N/A","N/A","N/A","N/A",null,null,null,null,null,null,null,null,null,null,null,null,null,null,null,null,null,null,null,null,null,null,null,null,null,null,null,null,"Unimproved facilities","N/A","N/A","N/A","N/A","N/A","N/A","N/A","N/A","N/A","N/A","N/A","N/A","N/A","N/A","N/A","N/A","N/A","N/A","N/A","N/A","N/A","N/A","N/A"]
[null,"Open defecation",18.303038575221116,9.1424811220415592,2.9764796347475482,0.5865063074491399,7.7705613991242831E-2,5.4441177233901099,1.0560187862304666,5.9072175385427146E-2,4.1324926876266523E-2,0,22.333890412600979,13.30992232761767,9.3469783585131925,3.3476154582047037,0.85212602284859829,3.9174445990701532,0.74348194106337373,8.6652796233360938,13.729520394124872,4.5012237946243001,11.619757409718382,4.2371378678764886,14.869971285806541,null,null,null,null,null,null,null,null,null,null,null,null,null,null,null,null,null,null,null,null,null,null,null,null,null,null,null,null,"Open defecation","N/A","N/A","N/A","N/A","N/A","N/A","N/A","N/A","N/A","N/A","N/A","N/A","N/A","N/A","N/A","N/A","N/A","N/A","N/A","N/A","N/A","N/A","N/A"]
["Septic tank emptying practices","Not emptied/treated and disposed in situ","N/A","N/A","N/A","N/A","N/A","N/A","N/A","N/A","N/A","N/A","N/A","N/A","N/A","N/A","N/A","N/A","N/A","N/A","N/A","N/A","N/A","N/A","N/A",null,null,null,null,null,null,null,null,null,null,null,null,null,null,null,null,null,null,null,null,null,null,null,null,null,null,null,"Septic tank emptying practices","Not emptied/treated and disposed in situ","N/A","N/A","N/A","N/A","N/A","N/A","N/A","N/A","N/A","N/A","N/A","N/A","N/A","N/A","N/A","N/A","N/A","N/A","N/A","N/A","N/A","N/A","N/A"]
[null,"Emptied and buried on site","N/A","N/A","N/A","N/A","N/A","N/A","N/A","N/A","N/A","N/A","N/A","N/A","N/A","N/A","N/A","N/A","N/A","N/A","N/A","N/A","N/A","N/A","N/A",null,null,null,null,null,null,null,null,null,null,null,null,null,null,null,null,null,null,null,null,null,null,null,null,null,null,null,null,"Emptied and buried on site","N/A","N/A","N/A","N/A","N/A","N/A","N/A","N/A","N/A","N/A","N/A","N/A","N/A","N/A","N/A","N/A","N/A","N/A","N/A","N/A","N/A","N/A","N/A"]
[null,"Emptied and discharged locally","N/A","N/A","N/A","N/A","N/A","N/A","N/A","N/A","N/A","N/A","N/A","N/A","N/A","N/A","N/A","N/A","N/A","N/A","N/A","N/A","N/A","N/A","N/A",null,null,null,null,null,null,null,null,null,null,null,null,null,null,null,null,null,null,null,null,null,null,null,null,null,null,null,null,"Emptied and discharged locally","N/A","N/A","N/A","N/A","N/A","N/A","N/A","N/A","N/A","N/A","N/A","N/A","N/A","N/A","N/A","N/A","N/A","N/A","N/A","N/A","N/A","N/A","N/A"]
[null,"Emptied and removed offsite","N/A","N/A","N/A","N/A","N/A","N/A","N/A","N/A","N/A","N/A","N/A","N/A","N/A","N/A","N/A","N/A","N/A","N/A","N/A","N/A","N/A","N/A","N/A",null,null,null,null,null,null,null,null,null,null,null,null,null,null,null,null,null,null,null,null,null,null,null,null,null,null,null,null,"Emptied and removed offsite","N/A","N/A","N/A","N/A","N/A","N/A","N/A","N/A","N/A","N/A","N/A","N/A","N/A","N/A","N/A","N/A","N/A","N/A","N/A","N/A","N/A","N/A","N/A"]
["Latrine emptying practices","Not emptied/treated and disposed in situ","N/A","N/A","N/A","N/A","N/A","N/A","N/A","N/A","N/A","N/A","N/A","N/A","N/A","N/A","N/A","N/A","N/A","N/A","N/A","N/A","N/A","N/A","N/A",null,null,null,null,null,null,null,null,null,null,null,null,null,null,null,null,null,null,null,null,null,null,null,null,null,null,null,"Latrine emptying practices","Not emptied/treated and disposed in situ","N/A","N/A","N/A","N/A","N/A","N/A","N/A","N/A","N/A","N/A","N/A","N/A","N/A","N/A","N/A","N/A","N/A","N/A","N/A","N/A","N/A","N/A","N/A"]
[null,"Emptied and buried on site","N/A","N/A","N/A","N/A","N/A","N/A","N/A","N/A","N/A","N/A","N/A","N/A","N/A","N/A","N/A","N/A","N/A","N/A","N/A","N/A","N/A","N/A","N/A",null,null,null,null,null,null,null,null,null,null,null,null,null,null,null,null,null,null,null,null,null,null,null,null,null,null,null,null,"Emptied and buried on site","N/A","N/A","N/A","N/A","N/A","N/A","N/A","N/A","N/A","N/A","N/A","N/A","N/A","N/A","N/A","N/A","N/A","N/A","N/A","N/A","N/A","N/A","N/A"]
[null,"Emptied and discharged locally","N/A","N/A","N/A","N/A","N/A","N/A","N/A","N/A","N/A","N/A","N/A","N/A","N/A","N/A","N/A","N/A","N/A","N/A","N/A","N/A","N/A","N/A","N/A",null,null,null,null,null,null,null,null,null,null,null,null,null,null,null,null,null,null,null,null,null,null,null,null,null,null,null,null,"Emptied and discharged locally","N/A","N/A","N/A","N/A","N/A","N/A","N/A","N/A","N/A","N/A","N/A","N/A","N/A","N/A","N/A","N/A","N/A","N/A","N/A","N/A","N/A","N/A","N/A"]
[null,"Emptied and removed offsite","N/A","N/A","N/A","N/A","N/A","N/A","N/A","N/A","N/A","N/A","N/A","N/A","N/A","N/A","N/A","N/A","N/A","N/A","N/A","N/A","N/A","N/A","N/A",null,null,null,null,null,null,null,null,null,null,null,null,null,null,null,null,null,null,null,null,null,null,null,null,null,null,null,null,"Emptied and removed offsite","N/A","N/A","N/A","N/A","N/A","N/A","N/A","N/A","N/A","N/A","N/A","N/A","N/A","N/A","N/A","N/A","N/A","N/A","N/A","N/A","N/A","N/A","N/A"]
["Shared among improved sanitation facilities","Yes","N/A","N/A","N/A","N/A","N/A","N/A","N/A","N/A","N/A","N/A","N/A","N/A","N/A","N/A","N/A","N/A","N/A","N/A","N/A","N/A","N/A","N/A","N/A",null,null,null,null,null,null,null,null,null,null,null,null,null,null,null,null,null,null,null,null,null,null,null,null,null,null,null,"Shared among improved sanitation facilities","Yes","N/A","N/A","N/A","N/A","N/A","N/A","N/A","N/A","N/A","N/A","N/A","N/A","N/A","N/A","N/A","N/A","N/A","N/A","N/A","N/A","N/A","N/A","N/A"]
[null,"No","N/A","N/A","N/A","N/A","N/A","N/A","N/A","N/A","N/A","N/A","N/A","N/A","N/A","N/A","N/A","N/A","N/A","N/A","N/A","N/A","N/A","N/A","N/A",null,null,null,null,null,null,null,null,null,null,null,null,null,null,null,null,null,null,null,null,null,null,null,null,null,null,null,null,"No","N/A","N/A","N/A","N/A","N/A","N/A","N/A","N/A","N/A","N/A","N/A","N/A","N/A","N/A","N/A","N/A","N/A","N/A","N/A","N/A","N/A","N/A","N/A"]
[null,"DK/missing","N/A","N/A","N/A","N/A","N/A","N/A","N/A","N/A","N/A","N/A","N/A","N/A","N/A","N/A","N/A","N/A","N/A","N/A","N/A","N/A","N/A","N/A","N/A",null,null,null,null,null,null,null,null,null,null,null,null,null,null,null,null,null,null,null,null,null,null,null,null,null,null,null,null,"DK/missing","N/A","N/A","N/A","N/A","N/A","N/A","N/A","N/A","N/A","N/A","N/A","N/A","N/A","N/A","N/A","N/A","N/A","N/A","N/A","N/A","N/A","N/A","N/A"]
["Shared among all sanitation facilities","Yes",16.481505187921616,17.219513906418637,15.701751876842767,14.495115122459376,5.3282375655164671,19.802210767852717,18.064864276947798,16.347062689978607,7.5776234665623399,2.2166943166491682,13.689605306885651,18.527113516299774,15.947015135963657,14.656262454462428,9.8526114906074636,19.218219348796538,15.442608284739014,9.5063524186738579,10.956011282656677,11.284284070560062,12.299270378503557,14.167446727013902,13.098039278846688,null,null,null,null,null,null,null,null,null,null,null,null,null,null,null,null,null,null,null,null,null,null,null,null,null,null,null,"Shared among all sanitation facilities","Yes","N/A","N/A","N/A","N/A","N/A","N/A","N/A","N/A","N/A","N/A","N/A","N/A","N/A","N/A","N/A","N/A","N/A","N/A","N/A","N/A","N/A","N/A","N/A"]
[null,"No",83.460667279878109,82.756650817708532,84.298248123157308,85.453271464449074,94.671762434483526,80.19778923214723,81.935135723052483,83.652937310021656,92.422376533437699,97.783305683350719,86.310394693114162,81.377986489090148,84.011476678369718,85.34373754553755,90.057293391166368,80.781780651203562,84.557391715260422,90.493647581326243,89.043988717343368,88.715715929440066,87.70072962149635,85.730097973458996,86.9019607211535,null,null,null,null,null,null,null,null,null,null,null,null,null,null,null,null,null,null,null,null,null,null,null,null,null,null,null,null,"No","N/A","N/A","N/A","N/A","N/A","N/A","N/A","N/A","N/A","N/A","N/A","N/A","N/A","N/A","N/A","N/A","N/A","N/A","N/A","N/A","N/A","N/A","N/A"]
["Type of toilet facility","Flush to piped sewer system",4.6502205167961952,15.159899500530383,31.426132970260923,58.403031377991802,82.267271424189232,36.501522729078985,66.749689158426122,83.293995080067148,87.552616263787897,92.870531674392893,1.3751126350249179,4.6210544831263505,10.188975627546986,16.579860275911507,29.703755967589316,51.711601956527574,75.834190981859976,22.000846621455516,32.134062195533815,18.056473774565081,8.0970229644647187,31.405725188788608,24.90722365504184,null,null,null,null,null,null,null,null,null,null,null,null,null,null,null,null,null,null,null,null,null,null,null,null,null,null,null,"Type of toilet facility","Flush to piped sewer system",965.7114200000002,3146.6697279999958,6521.0431909999925,12138.772533000005,17082.77377200004,3218.9458990000012,5896.490455999995,7353.0068540000002,7726.2645789999979,8202.6356370000194,164.21619899999996,550.95257099999981,1217.3053150000005,1978.865137999999,3546.2879960000032,5845.7079009999943,15502.849531999971,3248.5575900000008,2935.8805540000044,1746.5433360000004,321.63476700000007,7991.408646000008,2262.3883179999971]
[null,"Flush to septic tank",8.2906014669967139,13.216460905887711,21.790670274676533,21.729148476715189,13.514304698777943,10.715710676978004,13.586577933527252,9.8294690471565431,9.4378699426762243,5.6826626390505934,7.9684550843406647,9.7972141124028802,15.46425626486271,27.330002109232566,39.637915029788388,18.383313410142428,10.859206993556709,9.2608412074590714,22.398718937677362,10.147688793770621,19.258242309745068,16.081200826493617,30.371499208624954,null,null,null,null,null,null,null,null,null,null,null,null,null,null,null,null,null,null,null,null,null,null,null,null,null,null,null,null,"Flush to septic tank",1721.7094299999999,2743.2792309999995,4521.6477050000067,4516.2928100000081,2806.2412410000015,944.98230100000046,1200.2022499999991,867.72345600000051,832.86466300000029,501.9117500000001,951.59434399999998,1168.0884360000002,1847.5577949999986,3261.9326999999998,4732.3127220000115,2078.1309489999967,2219.9571179999998,1367.4190140000001,2046.4254710000007,981.55257000000029,764.98736699999984,4091.9751590000001,2758.7227689999968]
[null,"Flush to somewhere else",1.22296315333642,2.253951358033516,3.867558848245134,2.8015157062587761,1.6034016901877655,3.2204311986623595,2.9794969264904569,1.8703000186505916,1.5480486191290868,1.1750861078924839,0.38337223098571871,2.1455265365945984,2.1998380516393414,3.9731968311639312,3.7545378791958859,1.7801297325827758,1.4697862365781633,2.90475098374925,3.5549920812112119,1.1922654020010246,0.202614152549868,3.0874674906633417,3.0294271785294806,null,null,null,null,null,null,null,null,null,null,null,null,null,null,null,null,null,null,null,null,null,null,null,null,null,null,null,null,"Flush to somewhere else",253.97279100000003,467.84218500000014,802.53330300000027,582.2807670000002,332.94587099999995,283.998941,263.20085399999999,165.105886,136.61080299999998,103.78753100000003,45.782381000000001,255.80381400000002,262.82078300000006,474.21513599999992,448.24878800000005,201.23372800000001,300.46967699999999,428.90398799999991,324.79653700000006,115.32391200000001,8.0483600000000006,785.62791500000014,275.17080000000004]
[null,"Flush, don't know where",1.7436820581942878E-2,6.5565440038250433E-2,9.4813860945155478E-3,1.7322392351761487E-2,2.0356133977497873E-2,0,0,0,4.7898967187716475E-2,0,3.0322387612027889E-2,5.0848069792914154E-2,6.3166443077688858E-2,1.6484001055495346E-2,3.0156755936746379E-2,0,0,0,5.3204033676332405E-2,0,0,3.7389785233869446E-2,0.13926666824242276,null,null,null,null,null,null,null,null,null,null,null,null,null,null,null,null,null,null,null,null,null,null,null,null,null,null,null,null,"Flush, don't know where",3.621105,13.609113000000001,1.9674240000000001,3.600371,4.2269449999999997,0,0,0,4.2269449999999997,0,3.621105,6.0624419999999999,7.5466709999999999,1.9674240000000001,3.600371,0,0,0,4.8609069999999992,0,0,9.5140949999999993,12.649956]
[null,"Ventilated Improved Pit latrine (VIP)",1.3171906222125798,1.8219414086044927,0.88495366234806383,0.33402120133621288,1.9056189854035677E-2,0.24491052160591353,7.2938640517271544E-2,6.6617870258615833E-2,0,0,1.670264516977642,1.490251219177277,2.1941845131482411,1.4077247871781098,0.56538711479637238,9.5336994745286119E-2,0.1443059367796469,1.5427284650885449,1.0571500287403719,0.84634694414598444,1.6740647574473775,1.356106164395122,0.55747005229562729,null,null,null,null,null,null,null,null,null,null,null,null,null,null,null,null,null,null,null,null,null,null,null,null,null,null,null,null,"Ventilated Improved Pit latrine (VIP)",273.54101200000002,378.17189199999996,183.63128100000003,69.424605,3.9570120000000002,21.597830999999999,6.443206,5.8808759999999998,0,0,199.46328999999997,177.67757200000003,262.14533900000004,168.01694700000002,67.500741000000005,10.777315,29.500587999999997,227.79315500000004,96.584931999999981,81.864357000000012,66.498197000000005,345.07079400000003,50.636464000000004]
[null,"Latrine",65.217673597707773,57.843606225435998,38.82379688361457,16.07217335565521,2.4979042490227883,43.551676368724841,15.555278554808671,4.8805458084818882,1.3722412803427486,0.27171957866400392,65.028812126956225,67.866661893794003,59.993796406541321,47.106202222259846,25.358140659826734,23.921343655287785,10.949027910161666,55.339219679104382,26.834941516198459,64.284675922819204,58.898120795449358,43.450459009536964,25.167987306524651,null,null,null,null,null,null,null,null,null,null,null,null,null,null,null,null,null,null,null,null,null,null,null,null,null,null,null,null,"Latrine",13543.756033000011,12006.327921999984,8056.0868420000043,3340.5193510000031,518.68905399999994,3840.6751160000008,1374.1120399999988,430.84362499999997,121.09631500000003,23.999181000000004,7765.7524779999922,8091.5107129999951,7167.626060000006,5622.2923359999986,3027.4713380000012,2704.1743500000039,2238.3192859999995,8171.1692830000129,2451.7343149999988,6218.0453250000028,2339.5862209999982,11056.276259000027,2286.0741630000002]
[null,"Open latrine",0.98087524714798524,0.49161778119454969,0.22067881509304235,5.6281182241931293E-2,0,0.31885925703832368,0,0,0,0,1.2097706055015205,0.71528224174515664,0.54528589003742944,0.2389143149934817,9.7980570018024959E-2,0.19023165893344846,0,0.28633341980732979,0.23741081283774498,0.9713253680739784,0.25017761062519989,0.34330456930493841,0.95240465846556277,null,null,null,null,null,null,null,null,null,null,null,null,null,null,null,null,null,null,null,null,null,null,null,null,null,null,null,null,"Open latrine",203.69838899999991,102.042813,45.791701000000003,11.697757000000001,0,28.119119999999995,0,0,0,0,144.471024,85.280663000000004,65.146825000000007,28.515270999999998,11.697757000000001,21.504626999999999,0,42.278855,21.690684000000001,93.953109000000012,9.9377040000000001,87.356272999999987,86.509408000000008]
[null,"No facility",18.303038575221116,9.1469573802749728,2.9767271596670848,0.5865063074491399,7.7705613991242831E-2,5.4468892479119289,1.0560187862304666,5.9072175385427146E-2,4.1324926876266523E-2,0,22.333890412600979,13.313161443366806,9.350496803146445,3.3476154582047037,0.85212602284859829,3.9180425917806758,0.74348194106337373,8.6652796233360938,13.729520394124872,4.5012237946243001,11.619757409718382,4.2383469655828936,14.874721272275798,null,null,null,null,null,null,null,null,null,null,null,null,null,null,null,null,null,null,null,null,null,null,null,null,null,null,null,null,"No facility",3800.9925140000037,1898.5913389999996,617.68230899999992,121.902348,16.135546999999999,480.34275000000002,93.285898000000003,5.2147589999999999,3.6468050000000001,0,2667.1172230000016,1587.2828489999988,1117.1299129999998,399.54977999999994,101.73407999999999,442.91284100000013,151.99065899999999,1279.4807570000009,1254.3771059999992,435.38857699999983,461.56692200000003,1078.4773279999999,1351.1098669999994]
[null,null,null,null,null,null,null,null,null,null,null,null,null,null,null,null,null,null,null,null,null,null,null,null,null,null,null,null,null,null,null,null,null,null,null,null,null,null,null,null,null,null,null,null,null,null,null,null,null,null,null,null,null,"Total",20767.002693999864,20756.534223000006,20750.383756000032,20784.490542000014,20764.969441999936,8818.6619579999715,8833.7347039999713,8827.7754559999812,8824.7101100000036,8832.3340990000215,11942.018044000029,11922.659059999996,11947.278700999985,11935.35473200004,11938.853793000007,11304.441710999998,20443.086860000065,14765.602641999987,9136.3505059999879,9672.671185999985,3972.2595379999989,25445.706469000201,9083.2617449999634]
[]
[]
[]
[]
[]
[]
[]
[]
[]
[]
[]
[]
[]
[]
[]
[]
[]
[]
[]
[]
[]
[]
[]
[]
[]
[]
[]
[]
[]
[]
[]
[]
[]
[]
[]
[]
[]
[]
[]
[]
[]
[]
[]
[]
[]
[]
[{"$f":"A1026","v":"Guatemala"}]
[{"$f":"A1034","v":"2015"}]
["Access to hygiene facilities "]
[" by wealth quintile and sub-national region"]
["Notes:"]
["WHO/UNICEF JMP customised wealth index excludes water,"]
[" sanitation and hygiene assets."]
["Survey used for analysis:",{"$f":"A1025","v":"DHS15"}]
[]
[]
[]
[]
["Access to handwashing",null,"NATIONAL wealth index quintile",null,null,null,null,"URBAN wealth index quintile",null,null,null,null,"RURAL wealth index quintile",null,null,null,null,"SUB-REGIONS:",null,null,null,null,null,null,null,null,null,null,null,null,null,null,null,null,null,null,null,null,null,null,null,null,null,null,null,null,null,null,null,null,null,null,"Raw numbers of respondents:","Access to handwashing","NATIONAL wealth index quintile",null,null,null,null,"URBAN wealth index quintile",null,null,null,null,"RURAL wealth index quintile",null,null,null,null,"SUB-REGIONS:"]
["Weighted percentage (used in graphs)",null,"Poorest","Poor","Middle","Rich","Richest","Poorest","Poor","Middle","Rich","Richest","Poorest","Poor","Middle","Rich","Richest","Central","Metropolitana","Noroccidente","Nororiente","Norte","Petén","Suroccidente","Suroriente",null,null,null,null,null,null,null,null,null,null,null,null,null,null,null,null,null,null,null,null,null,null,null,null,null,null,null,"Hygiene data, raw numbers (weighted)",null,"Poorest","Poor","Middle","Rich","Richest","Poorest","Poor","Middle","Rich","Richest","Poorest","Poor","Middle","Rich","Richest","Central","Metropolitana","Noroccidente","Nororiente","Norte","Petén","Suroccidente","Suroriente"]
["Hygiene ladder","Basic",50.716444667500106,72.682347714196766,83.769135448151886,88.446716395905398,92.312294966677428,72.647084882716186,84.952629163254144,86.382195018587154,90.611315502987239,93.172434636086933,44.334473984996606,61.60003960359964,76.310862055290642,84.508056778238824,91.57556802825097,83.747452363088129,87.955636724381193,68.801134031700855,76.041309169088208,58.592826184520462,66.738327598608535,81.973237399929957,73.232013547619488,null,null,null,null,null,null,null,null,null,null,null,null,null,null,null,null,null,null,null,null,null,null,null,null,null,null,null,"Hygiene ladder","Basic",10517.813145000013,15017.41485999999,17192.896526000037,17729.686755000039,17437.197512000053,6341.6905589999888,7302.6482889999943,7221.1482110000034,7303.5913709999995,7236.5116630000111,5284.4773600000053,7334.1060510000007,9090.4897849999979,10040.80886000003,10739.536649000009,9177.7677019999956,16392.307565999963,10026.665928999982,6855.598073000021,5644.7188769999957,2617.4414300000003,20581.871488000077,6598.6377330000078]
[null,"Limited",43.212341850258646,25.611907744109047,15.30670054716462,9.7665510185496824,5.1008067215923614,25.201409253591194,13.748886257293783,10.768588472595717,6.8272623533410375,3.6102120868692253,47.292842557004874,35.754463219791702,22.621425584973871,14.567975398597186,7.5367202466416359,14.026279171958977,9.5648485219210535,29.165167279016561,21.621077264488019,36.159540643976435,29.022422104041091,15.991641394317394,23.971260949260813,null,null,null,null,null,null,null,null,null,null,null,null,null,null,null,null,null,null,null,null,null,null,null,null,null,null,null,null,"Limited",8961.5772580000048,5291.8577350000041,3141.5689950000005,1957.7650510000019,963.50951200000043,2199.9442839999992,1181.8737300000003,900.20372100000009,550.30140699999959,280.39775900000001,5637.1020859999981,4256.9294880000016,2694.7649739999961,1730.8912550000005,883.86984699999948,1537.1205730000013,1782.6025099999993,4250.3571080000011,1949.2749039999985,3483.5397940000025,1138.2438360000012,4015.1873769999984,2159.9524490000013]
[null,"No facility",6.0712134822420163,1.7057445416940991,0.92416400468355731,1.7867325855450842,2.5868983117304887,2.151505863692813,1.2984845794522397,2.8492165088171602,2.5614221436716997,3.2173532770438427,8.3726834579983151,2.6454971766087252,1.0677123597355738,0.92396782316393822,0.88771172510737295,2.226268464953018,2.4795147536974085,2.033698689282549,2.337613566424154,5.2476331715032476,4.2392502973504449,2.0351212057523447,2.7967255031202392,null,null,null,null,null,null,null,null,null,null,null,null,null,null,null,null,null,null,null,null,null,null,null,null,null,null,null,null,"No facility",1259.0766049999997,352.43596600000006,189.67673500000004,358.16150499999998,488.64841700000017,187.814617,111.619573,238.18119799999991,206.45965199999998,249.885222,997.98761999999942,314.9731230000001,127.190652,109.78106299999999,104.10650799999999,243.9736879999999,462.10760299999998,296.37908799999997,210.75043599999998,505.54676999999992,166.261124,510.97900299999998,252.0015159999999]
["Place where household members wash their hands","Observed",93.799720113812754,97.797318194857553,97.987463174589323,94.721839663169959,88.614178197547005,96.809342153082852,96.046828474010425,91.997717573119132,88.998875658250896,85.106715141709358,91.455057309072615,97.194890512387971,98.606724159876208,98.628824859631308,97.357809196181378,94.770296358462986,88.904920281691574,96.691096077512881,96.371882528124146,94.371642491187174,94.547831783694505,96.637293014359088,96.394814138742873,null,null,null,null,null,null,null,null,null,null,null,null,null,null,null,null,null,null,null,null,null,null,null,null,null,null,null,"Observed handwashing place","Fixed","N/A","N/A","N/A","N/A","N/A","N/A","N/A","N/A","N/A","N/A","N/A","N/A","N/A","N/A","N/A","N/A","N/A","N/A","N/A","N/A","N/A","N/A","N/A"]
[null,"Not observed: not in dwelling",5.0343995973095836,1.3734961852032328,0.83497581841290325,1.7232152227943685,2.3532344623230852,1.950128563904955,1.2635603936515996,2.6980885409598301,2.3395629933049427,2.8292093482773879,6.7650632918437248,2.3149866237273247,0.75860852192951922,0.78645634845132562,0.87199751169613737,1.8992911739341998,2.1937952622875003,1.8486095733308179,1.9297299384936735,3.5791467149331098,4.1107043091704458,1.9491886805052401,2.5611873292276752,null,null,null,null,null,null,null,null,null,null,null,null,null,null,null,null,null,null,null,null,null,null,null,null,null,null,null,null,"Mobile","N/A","N/A","N/A","N/A","N/A","N/A","N/A","N/A","N/A","N/A","N/A","N/A","N/A","N/A","N/A","N/A","N/A","N/A","N/A","N/A","N/A","N/A","N/A"]
[null,"Not observed: no permission to see",9.8421853654911143E-2,0.48450404865273539,1.0985249932976389,3.5136886301073909,8.9477999868467428,1.0620009969462851,2.6896111323381304,5.2070578628909026,8.6615613484441134,11.953390566594745,0.12020213792267792,0.15936616051248656,0.29706342472450625,0.45137790379668308,1.7046090732706896,2.8926934191959837,8.8267575897781771,1.3016774300379423,1.3213929667071835,0.31810579940456218,1.2666128061041113,1.3210088563950346,0.83172132041997204,null,null,null,null,null,null,null,null,null,null,null,null,null,null,null,null,null,null,null,null,null,null,null,null,null,null,null,"Water / Soap","Water and soap","N/A","N/A","N/A","N/A","N/A","N/A","N/A","N/A","N/A","N/A","N/A","N/A","N/A","N/A","N/A","N/A","N/A","N/A","N/A","N/A","N/A","N/A","N/A"]
[null,"Not observed: other reason",1.0284715042759141,0.32362478005967754,7.9036013700144334E-2,0,0,0.17852828606608201,0,0,0,0,1.5918795324171551,0.32617327103140126,0.30559024118173506,0.13334088812065939,0,0.25859028241044912,6.6663768017664021E-2,0.15861691911836306,0.37699456667495818,1.6474009499117099,7.4851101030951842E-2,5.8353274332288096E-2,0.21227721160949004,null,null,null,null,null,null,null,null,null,null,null,null,null,null,null,null,null,null,null,null,null,null,null,null,null,null,null,null,"Water only","N/A","N/A","N/A","N/A","N/A","N/A","N/A","N/A","N/A","N/A","N/A","N/A","N/A","N/A","N/A","N/A","N/A","N/A","N/A","N/A","N/A","N/A","N/A"]
[null,"missing",3.8986930946656395E-2,2.1056791226868297E-2,0,4.1256483928111064E-2,8.4787353283503356E-2,0,0,9.7136023030262475E-2,0,0.11068494341837484,6.7797728743743152E-2,4.5834323409083997E-3,3.2013652288033566E-2,0,6.5584218851820517E-2,0.17912876599628538,7.8630982248832203E-3,0,0,8.3704044563394031E-2,0,3.4156174407988953E-2,0,null,null,null,null,null,null,null,null,null,null,null,null,null,null,null,null,null,null,null,null,null,null,null,null,null,null,null,null,"Soap only","N/A","N/A","N/A","N/A","N/A","N/A","N/A","N/A","N/A","N/A","N/A","N/A","N/A","N/A","N/A","N/A","N/A","N/A","N/A","N/A","N/A","N/A","N/A"]
[null,null,null,null,null,null,null,null,null,null,null,null,null,null,null,null,null,null,null,null,null,null,null,null,null,null,null,null,null,null,null,null,null,null,null,null,null,null,null,null,null,null,null,null,null,null,null,null,null,null,null,null,null,"Neither","N/A","N/A","N/A","N/A","N/A","N/A","N/A","N/A","N/A","N/A","N/A","N/A","N/A","N/A","N/A","N/A","N/A","N/A","N/A","N/A","N/A","N/A","N/A"]
[null,null,null,null,null,null,null,null,null,null,null,null,null,null,null,null,null,null,null,null,null,null,null,null,null,null,null,null,null,null,null,null,null,null,null,null,null,null,null,null,null,null,null,null,null,null,null,null,null,null,null,null,"Place where household members wash their hands","Observed",19479.390402999827,20309.272595000017,20334.465521000035,19687.451805999979,18400.707024000007,8541.6348429999889,8484.5220189999854,8121.3519319999923,7853.8927779999995,7516.9094220000097,10921.57944600002,11591.035539000006,11785.254758999985,11771.700115000038,11623.406496000011,10714.888274999987,18174.910076000022,14277.023036999988,8804.8729769999845,9128.2586709999796,3755.6852659999995,24597.058865000112,8758.5901819999635]
[null,null,null,null,null,null,null,null,null,null,null,null,null,null,null,null,null,null,null,null,null,null,null,null,null,null,null,null,null,null,null,null,null,null,null,null,null,null,null,null,null,null,null,null,null,null,null,null,null,null,null,null,null,"Not observed: not in dwelling",1045.4938999999995,285.22978900000004,173.27509499999999,358.16150499999998,488.64841700000017,172.06279599999996,111.619573,238.18119799999991,206.45965199999998,249.885222,807.88507899999991,276.075132,90.667191000000003,93.866354999999999,104.10650799999999,214.73703799999993,448.47947099999999,272.95834399999995,176.30689100000001,346.19909299999995,163.28784400000001,496.12636299999997,232.71366199999994]
[null,null,null,null,null,null,null,null,null,null,null,null,null,null,null,null,null,null,null,null,null,null,null,null,null,null,null,null,null,null,null,null,null,null,null,null,null,null,null,null,null,null,null,null,null,null,null,null,null,null,null,null,null,"Not observed: no permission to see",20.439268999999999,100.615487,227.96710800000002,730.30228100000045,1858.0079330000003,93.701955999999996,237.59311200000002,459.66737600000022,764.3576800000003,1055.7633909999995,14.354561,19.005307999999999,35.504354999999997,53.873554000000006,203.510785,327.05275799999993,1804.4617210000008,192.20051699999996,120.72709300000002,30.769327999999998,50.313147999999998,336.23595599999993,75.571556999999999]
[null,null,null,null,null,null,null,null,null,null,null,null,null,null,null,null,null,null,null,null,null,null,null,null,null,null,null,null,null,null,null,null,null,null,null,null,null,null,null,null,null,null,null,null,null,null,null,null,null,null,null,null,null,"Not observed: other reason",213.58270499999998,67.206176999999997,16.40164,0,0,15.751821,0,0,0,0,190.10254099999995,38.897991000000005,36.523460999999998,15.914708000000001,0,29.236650000000001,13.628132000000001,23.420743999999999,34.443545000000007,159.347677,2.9732799999999999,14.852640000000001,19.287853999999999]
[null,null,null,null,null,null,null,null,null,null,null,null,null,null,null,null,null,null,null,null,null,null,null,null,null,null,null,null,null,null,null,null,null,null,null,null,null,null,null,null,null,null,null,null,null,null,null,null,null,null,null,null,null,"missing",8.0964170000000006,4.3727999999999998,0,8.5749499999999994,17.606068,0,0,8.5749499999999994,0,9.7760640000000016,8.0964170000000006,0.54659999999999997,3.8262,0,7.8300039999999997,20.252597999999999,1.6074600000000001,0,0,8.0964170000000006,0,8.693760000000001,0]
[null,null,null,null,null,null,null,null,null,null,null,null,null,null,null,null,null,null,null,null,null,null,null,null,null,null,null,null,null,null,null,null,null,null,null,null,null,null,null,null,null,null,null,null,null,null,null,null,null,null,null,null,null,"Total",20767.002693999864,20766.696848000003,20752.109364000033,20784.490542000014,20764.969441999936,8823.1514159999733,8833.7347039999713,8827.7754559999812,8824.7101100000036,8832.3340990000215,11942.018044000029,11925.560569999996,11951.775965999985,11935.35473200004,11938.853793000007,11306.167318999998,20443.086860000065,14765.602641999987,9136.3505059999879,9672.671185999985,3972.2595379999989,25452.967584000202,9086.1632549999631]
[]
[]
[]
[]
[]
[]
[]
[]
[]
[]
[]
[]
[]
[]
[]
[]
[]
[]
[]
[]
[]
[]
[null,null,null,null,null,null,null,null,null,null,null,null,null,null,null,null,null,null,null,null,null,null,null,null,null,null,null,null,null,null,null,null,null,null,null,null,null,null,null,null,null,null,null,null,null,null,null,null,null,null,null,null,"Raw numbers of respondents:","Menstrual health and hygiene","NATIONAL wealth index quintile",null,null,null,null,"URBAN wealth index quintile",null,null,null,null,"RURAL wealth index quintile",null,null,null,null,"SUB-REGIONS:"]
[null,null,null,null,null,null,null,null,null,null,null,null,null,null,null,null,null,null,null,null,null,null,null,null,null,null,null,null,null,null,null,null,null,null,null,null,null,null,null,null,null,null,null,null,null,null,null,null,null,null,null,null,"MHH data, raw numbers (weighted)",null,"Poorest","Poor","Middle","Rich","Richest","Poorest","Poor","Middle","Rich","Richest","Poorest","Poor","Middle","Rich","Richest","Central","Metropolitana","Noroccidente","Nororiente","Norte","Petén","Suroccidente","Suroriente"]
[null,null,null,null,null,null,null,null,null,null,null,null,null,null,null,null,null,null,null,null,null,null,null,null,null,null,null,null,null,null,null,null,null,null,null,null,null,null,null,null,null,null,null,null,null,null,null,null,null,null,null,null,"Private place to wash and change","Yes","N/A","N/A","N/A","N/A","N/A","N/A","N/A","N/A","N/A","N/A","N/A","N/A","N/A","N/A","N/A","N/A","N/A","N/A","N/A","N/A","N/A","N/A","N/A"]
[null,null,null,null,null,null,null,null,null,null,null,null,null,null,null,null,null,null,null,null,null,null,null,null,null,null,null,null,null,null,null,null,null,null,null,null,null,null,null,null,null,null,null,null,null,null,null,null,null,null,null,null,null,"No","N/A","N/A","N/A","N/A","N/A","N/A","N/A","N/A","N/A","N/A","N/A","N/A","N/A","N/A","N/A","N/A","N/A","N/A","N/A","N/A","N/A","N/A","N/A"]
[null,null,null,null,null,null,null,null,null,null,null,null,null,null,null,null,null,null,null,null,null,null,null,null,null,null,null,null,null,null,null,null,null,null,null,null,null,null,null,null,null,null,null,null,null,null,null,null,null,null,null,null,null,"DK/not sure/missing","N/A","N/A","N/A","N/A","N/A","N/A","N/A","N/A","N/A","N/A","N/A","N/A","N/A","N/A","N/A","N/A","N/A","N/A","N/A","N/A","N/A","N/A","N/A"]
[null,null,null,null,null,null,null,null,null,null,null,null,null,null,null,null,null,null,null,null,null,null,null,null,null,null,null,null,null,null,null,null,null,null,null,null,null,null,null,null,null,null,null,null,null,null,null,null,null,null,null,null,"Use of menstrual materials","Materials reusable","N/A","N/A","N/A","N/A","N/A","N/A","N/A","N/A","N/A","N/A","N/A","N/A","N/A","N/A","N/A","N/A","N/A","N/A","N/A","N/A","N/A","N/A","N/A"]
[null,null,null,null,null,null,null,null,null,null,null,null,null,null,null,null,null,null,null,null,null,null,null,null,null,null,null,null,null,null,null,null,null,null,null,null,null,null,null,null,null,null,null,null,null,null,null,null,null,null,null,null,null,"Materials not reusable","N/A","N/A","N/A","N/A","N/A","N/A","N/A","N/A","N/A","N/A","N/A","N/A","N/A","N/A","N/A","N/A","N/A","N/A","N/A","N/A","N/A","N/A","N/A"]
[null,null,null,null,null,null,null,null,null,null,null,null,null,null,null,null,null,null,null,null,null,null,null,null,null,null,null,null,null,null,null,null,null,null,null,null,null,null,null,null,null,null,null,null,null,null,null,null,null,null,null,null,null,"No materials used","N/A","N/A","N/A","N/A","N/A","N/A","N/A","N/A","N/A","N/A","N/A","N/A","N/A","N/A","N/A","N/A","N/A","N/A","N/A","N/A","N/A","N/A","N/A"]
[null,null,null,null,null,null,null,null,null,null,null,null,null,null,null,null,null,null,null,null,null,null,null,null,null,null,null,null,null,null,null,null,null,null,null,null,null,null,null,null,null,null,null,null,null,null,null,null,null,null,null,null,null,"DK/not sure/missing","N/A","N/A","N/A","N/A","N/A","N/A","N/A","N/A","N/A","N/A","N/A","N/A","N/A","N/A","N/A","N/A","N/A","N/A","N/A","N/A","N/A","N/A","N/A"]
[null,null,null,null,null,null,null,null,null,null,null,null,null,null,null,null,null,null,null,null,null,null,null,null,null,null,null,null,null,null,null,null,null,null,null,null,null,null,null,null,null,null,null,null,null,null,null,null,null,null,null,null,"Use of menstrual materials with private place to wash and change","Materials reusable","N/A","N/A","N/A","N/A","N/A","N/A","N/A","N/A","N/A","N/A","N/A","N/A","N/A","N/A","N/A","N/A","N/A","N/A","N/A","N/A","N/A","N/A","N/A"]
[null,null,null,null,null,null,null,null,null,null,null,null,null,null,null,null,null,null,null,null,null,null,null,null,null,null,null,null,null,null,null,null,null,null,null,null,null,null,null,null,null,null,null,null,null,null,null,null,null,null,null,null,null,"Materials not reusable","N/A","N/A","N/A","N/A","N/A","N/A","N/A","N/A","N/A","N/A","N/A","N/A","N/A","N/A","N/A","N/A","N/A","N/A","N/A","N/A","N/A","N/A","N/A"]
[null,null,null,null,null,null,null,null,null,null,null,null,null,null,null,null,null,null,null,null,null,null,null,null,null,null,null,null,null,null,null,null,null,null,null,null,null,null,null,null,null,null,null,null,null,null,null,null,null,null,null,null,null,"No materials used","N/A","N/A","N/A","N/A","N/A","N/A","N/A","N/A","N/A","N/A","N/A","N/A","N/A","N/A","N/A","N/A","N/A","N/A","N/A","N/A","N/A","N/A","N/A"]
[null,null,null,null,null,null,null,null,null,null,null,null,null,null,null,null,null,null,null,null,null,null,null,null,null,null,null,null,null,null,null,null,null,null,null,null,null,null,null,null,null,null,null,null,null,null,null,null,null,null,null,null,"Awareness of menstruation before menarche","Yes","N/A","N/A","N/A","N/A","N/A","N/A","N/A","N/A","N/A","N/A","N/A","N/A","N/A","N/A","N/A","N/A","N/A","N/A","N/A","N/A","N/A","N/A","N/A"]
[null,null,null,null,null,null,null,null,null,null,null,null,null,null,null,null,null,null,null,null,null,null,null,null,null,null,null,null,null,null,null,null,null,null,null,null,null,null,null,null,null,null,null,null,null,null,null,null,null,null,null,null,null,"No","N/A","N/A","N/A","N/A","N/A","N/A","N/A","N/A","N/A","N/A","N/A","N/A","N/A","N/A","N/A","N/A","N/A","N/A","N/A","N/A","N/A","N/A","N/A"]
[null,null,null,null,null,null,null,null,null,null,null,null,null,null,null,null,null,null,null,null,null,null,null,null,null,null,null,null,null,null,null,null,null,null,null,null,null,null,null,null,null,null,null,null,null,null,null,null,null,null,null,null,null,"DK/not sure/missing","N/A","N/A","N/A","N/A","N/A","N/A","N/A","N/A","N/A","N/A","N/A","N/A","N/A","N/A","N/A","N/A","N/A","N/A","N/A","N/A","N/A","N/A","N/A"]
[null,null,null,null,null,null,null,null,null,null,null,null,null,null,null,null,null,null,null,null,null,null,null,null,null,null,null,null,null,null,null,null,null,null,null,null,null,null,null,null,null,null,null,null,null,null,null,null,null,null,null,null,"Participation in (all) activities during menstruation","Yes","N/A","N/A","N/A","N/A","N/A","N/A","N/A","N/A","N/A","N/A","N/A","N/A","N/A","N/A","N/A","N/A","N/A","N/A","N/A","N/A","N/A","N/A","N/A"]
[null,null,null,null,null,null,null,null,null,null,null,null,null,null,null,null,null,null,null,null,null,null,null,null,null,null,null,null,null,null,null,null,null,null,null,null,null,null,null,null,null,null,null,null,null,null,null,null,null,null,null,null,null,"No","N/A","N/A","N/A","N/A","N/A","N/A","N/A","N/A","N/A","N/A","N/A","N/A","N/A","N/A","N/A","N/A","N/A","N/A","N/A","N/A","N/A","N/A","N/A"]
[null,null,null,null,null,null,null,null,null,null,null,null,null,null,null,null,null,null,null,null,null,null,null,null,null,null,null,null,null,null,null,null,null,null,null,null,null,null,null,null,null,null,null,null,null,null,null,null,null,null,null,null,null,"DK/not sure/missing/no such activity","N/A","N/A","N/A","N/A","N/A","N/A","N/A","N/A","N/A","N/A","N/A","N/A","N/A","N/A","N/A","N/A","N/A","N/A","N/A","N/A","N/A","N/A","N/A"]
[null,null,null,null,null,null,null,null,null,null,null,null,null,null,null,null,null,null,null,null,null,null,null,null,null,null,null,null,null,null,null,null,null,null,null,null,null,null,null,null,null,null,null,null,null,null,null,null,null,null,null,null,"Participation in specific activities during menstruation","Did not go to school (amongst those usually attending school)","N/A","N/A","N/A","N/A","N/A","N/A","N/A","N/A","N/A","N/A","N/A","N/A","N/A","N/A","N/A","N/A","N/A","N/A","N/A","N/A","N/A","N/A","N/A"]
[null,null,null,null,null,null,null,null,null,null,null,null,null,null,null,null,null,null,null,null,null,null,null,null,null,null,null,null,null,null,null,null,null,null,null,null,null,null,null,null,null,null,null,null,null,null,null,null,null,null,null,null,null,"Did not go to work (amongst those who usually work)","N/A","N/A","N/A","N/A","N/A","N/A","N/A","N/A","N/A","N/A","N/A","N/A","N/A","N/A","N/A","N/A","N/A","N/A","N/A","N/A","N/A","N/A","N/A"]
[null,null,null,null,null,null,null,null,null,null,null,null,null,null,null,null,null,null,null,null,null,null,null,null,null,null,null,null,null,null,null,null,null,null,null,null,null,null,null,null,null,null,null,null,null,null,null,null,null,null,null,null,null,"Did not participate in social activities","N/A","N/A","N/A","N/A","N/A","N/A","N/A","N/A","N/A","N/A","N/A","N/A","N/A","N/A","N/A","N/A","N/A","N/A","N/A","N/A","N/A","N/A","N/A"]
[null,null,null,null,null,null,null,null,null,null,null,null,null,null,null,null,null,null,null,null,null,null,null,null,null,null,null,null,null,null,null,null,null,null,null,null,null,null,null,null,null,null,null,null,null,null,null,null,null,null,null,null,null,"Did not cook food","N/A","N/A","N/A","N/A","N/A","N/A","N/A","N/A","N/A","N/A","N/A","N/A","N/A","N/A","N/A","N/A","N/A","N/A","N/A","N/A","N/A","N/A","N/A"]
[null,null,null,null,null,null,null,null,null,null,null,null,null,null,null,null,null,null,null,null,null,null,null,null,null,null,null,null,null,null,null,null,null,null,null,null,null,null,null,null,null,null,null,null,null,null,null,null,null,null,null,null,null,"Did not eat with others","N/A","N/A","N/A","N/A","N/A","N/A","N/A","N/A","N/A","N/A","N/A","N/A","N/A","N/A","N/A","N/A","N/A","N/A","N/A","N/A","N/A","N/A","N/A"]
[null,null,null,null,null,null,null,null,null,null,null,null,null,null,null,null,null,null,null,null,null,null,null,null,null,null,null,null,null,null,null,null,null,null,null,null,null,null,null,null,null,null,null,null,null,null,null,null,null,null,null,null,null,"Did not bathe in regular place","N/A","N/A","N/A","N/A","N/A","N/A","N/A","N/A","N/A","N/A","N/A","N/A","N/A","N/A","N/A","N/A","N/A","N/A","N/A","N/A","N/A","N/A","N/A"]
[null,null,null,null,null,null,null,null,null,null,null,null,null,null,null,null,null,null,null,null,null,null,null,null,null,null,null,null,null,null,null,null,null,null,null,null,null,null,null,null,null,null,null,null,null,null,null,null,null,null,null,null,null,"Did not participate in other activities","N/A","N/A","N/A","N/A","N/A","N/A","N/A","N/A","N/A","N/A","N/A","N/A","N/A","N/A","N/A","N/A","N/A","N/A","N/A","N/A","N/A","N/A","N/A"]
[null,null,null,null,null,null,null,null,null,null,null,null,null,null,null,null,null,null,null,null,null,null,null,null,null,null,null,null,null,null,null,null,null,null,null,null,null,null,null,null,null,null,null,null,null,null,null,null,null,null,null,null,null,"DK/not sure/missing/no such activity","N/A","N/A","N/A","N/A","N/A","N/A","N/A","N/A","N/A","N/A","N/A","N/A","N/A","N/A","N/A","N/A","N/A","N/A","N/A","N/A","N/A","N/A","N/A"]
[]
[]
[]
[]
[]
[]
[]
[]
[]
[]
[]
[]
[]
[]
[]
[]
[]
[]
[]
[]
[]
[]
[]
[]
[]
[]
[]
[]
[]
[]
[]
[]
[]
[]
[]
[]
[]
[]
[]
[]
[]
[]
[]
[]
[]
[]
[]
[]
[]
[]
[]
[]
[]
[]
[null,null,null,null,null,null,null,null,null,null,null,null,null,null,null,null,null,null,null,null,null,null,null,null,null,null,null,null,null,null,null,null,null,null,null,null,null,null,null,null,null,null,null,null,null,null,null,null,null,null,null,null,"Raw numbers of respondents:","Basic water, sanitation and hygiene","NATIONAL wealth index quintile",null,null,null,null,"URBAN wealth index quintile",null,null,null,null,"RURAL wealth index quintile",null,null,null,null,"SUB-REGIONS:"]
[null,null,null,null,null,null,null,null,null,null,null,null,null,null,null,null,null,null,null,null,null,null,null,null,null,null,null,null,null,null,null,null,null,null,null,null,null,null,null,null,null,null,null,null,null,null,null,null,null,null,null,null,"WatSan data, raw numbers (weighted)",null,"Poorest","Poor","Middle","Rich","Richest","Poorest","Poor","Middle","Rich","Richest","Poorest","Poor","Middle","Rich","Richest","Central","Metropolitana","Noroccidente","Nororiente","Norte","Petén","Suroccidente","Suroriente"]
[null,null,null,null,null,null,null,null,null,null,null,null,null,null,null,null,null,null,null,null,null,null,null,null,null,null,null,null,null,null,null,null,null,null,null,null,null,null,null,null,null,null,null,null,null,null,null,null,null,null,null,null,"Use of Basic Water Sanitation and Hygiene","Yes","N/A","N/A","N/A","N/A","N/A","N/A","N/A","N/A","N/A","N/A","N/A","N/A","N/A","N/A","N/A","N/A","N/A","N/A","N/A","N/A","N/A","N/A","N/A"]
[null,null,null,null,null,null,null,null,null,null,null,null,null,null,null,null,null,null,null,null,null,null,null,null,null,null,null,null,null,null,null,null,null,null,null,null,null,null,null,null,null,null,null,null,null,null,null,null,null,null,null,null,null,"No","N/A","N/A","N/A","N/A","N/A","N/A","N/A","N/A","N/A","N/A","N/A","N/A","N/A","N/A","N/A","N/A","N/A","N/A","N/A","N/A","N/A","N/A","N/A"]
[null,null,null,null,null,null,null,null,null,null,null,null,null,null,null,null,null,null,null,null,null,null,null,null,null,null,null,null,null,null,null,null,null,null,null,null,null,null,null,null,null,null,null,null,null,null,null,null,null,null,null,null,"Use of Basic Water and Sanitation","Yes","N/A","N/A","N/A","N/A","N/A","N/A","N/A","N/A","N/A","N/A","N/A","N/A","N/A","N/A","N/A","N/A","N/A","N/A","N/A","N/A","N/A","N/A","N/A"]
[null,null,null,null,null,null,null,null,null,null,null,null,null,null,null,null,null,null,null,null,null,null,null,null,null,null,null,null,null,null,null,null,null,null,null,null,null,null,null,null,null,null,null,null,null,null,null,null,null,null,null,null,null,"No","N/A","N/A","N/A","N/A","N/A","N/A","N/A","N/A","N/A","N/A","N/A","N/A","N/A","N/A","N/A","N/A","N/A","N/A","N/A","N/A","N/A","N/A","N/A"]
[null,null,null,null,null,null,null,null,null,null,null,null,null,null,null,null,null,null,null,null,null,null,null,null,null,null,null,null,null,null,null,null,null,null,null,null,null,null,null,null,null,null,null,null,null,null,null,null,null,null,null,null,"Use of Basic Water and Hygiene","Yes","N/A","N/A","N/A","N/A","N/A","N/A","N/A","N/A","N/A","N/A","N/A","N/A","N/A","N/A","N/A","N/A","N/A","N/A","N/A","N/A","N/A","N/A","N/A"]
[null,null,null,null,null,null,null,null,null,null,null,null,null,null,null,null,null,null,null,null,null,null,null,null,null,null,null,null,null,null,null,null,null,null,null,null,null,null,null,null,null,null,null,null,null,null,null,null,null,null,null,null,null,"No","N/A","N/A","N/A","N/A","N/A","N/A","N/A","N/A","N/A","N/A","N/A","N/A","N/A","N/A","N/A","N/A","N/A","N/A","N/A","N/A","N/A","N/A","N/A"]
[null,null,null,null,null,null,null,null,null,null,null,null,null,null,null,null,null,null,null,null,null,null,null,null,null,null,null,null,null,null,null,null,null,null,null,null,null,null,null,null,null,null,null,null,null,null,null,null,null,null,null,null,"Use of Basic Sanitation and Hygiene","Yes","N/A","N/A","N/A","N/A","N/A","N/A","N/A","N/A","N/A","N/A","N/A","N/A","N/A","N/A","N/A","N/A","N/A","N/A","N/A","N/A","N/A","N/A","N/A"]
[null,null,null,null,null,null,null,null,null,null,null,null,null,null,null,null,null,null,null,null,null,null,null,null,null,null,null,null,null,null,null,null,null,null,null,null,null,null,null,null,null,null,null,null,null,null,null,null,null,null,null,null,null,"No","N/A","N/A","N/A","N/A","N/A","N/A","N/A","N/A","N/A","N/A","N/A","N/A","N/A","N/A","N/A","N/A","N/A","N/A","N/A","N/A","N/A","N/A","N/A"]
[null,null,null,null,null,null,null,null,null,null,null,null,null,null,null,null,null,null,null,null,null,null,null,null,null,null,null,null,null,null,null,null,null,null,null,null,null,null,null,null,null,null,null,null,null,null,null,null,null,null,null,null,"Use of Basic Water","Yes","N/A","N/A","N/A","N/A","N/A","N/A","N/A","N/A","N/A","N/A","N/A","N/A","N/A","N/A","N/A","N/A","N/A","N/A","N/A","N/A","N/A","N/A","N/A"]
[null,null,null,null,null,null,null,null,null,null,null,null,null,null,null,null,null,null,null,null,null,null,null,null,null,null,null,null,null,null,null,null,null,null,null,null,null,null,null,null,null,null,null,null,null,null,null,null,null,null,null,null,null,"No","N/A","N/A","N/A","N/A","N/A","N/A","N/A","N/A","N/A","N/A","N/A","N/A","N/A","N/A","N/A","N/A","N/A","N/A","N/A","N/A","N/A","N/A","N/A"]
[null,null,null,null,null,null,null,null,null,null,null,null,null,null,null,null,null,null,null,null,null,null,null,null,null,null,null,null,null,null,null,null,null,null,null,null,null,null,null,null,null,null,null,null,null,null,null,null,null,null,null,null,"Use of Basic Sanitation","Yes","N/A","N/A","N/A","N/A","N/A","N/A","N/A","N/A","N/A","N/A","N/A","N/A","N/A","N/A","N/A","N/A","N/A","N/A","N/A","N/A","N/A","N/A","N/A"]
[null,null,null,null,null,null,null,null,null,null,null,null,null,null,null,null,null,null,null,null,null,null,null,null,null,null,null,null,null,null,null,null,null,null,null,null,null,null,null,null,null,null,null,null,null,null,null,null,null,null,null,null,null,"No","N/A","N/A","N/A","N/A","N/A","N/A","N/A","N/A","N/A","N/A","N/A","N/A","N/A","N/A","N/A","N/A","N/A","N/A","N/A","N/A","N/A","N/A","N/A"]
[null,null,null,null,null,null,null,null,null,null,null,null,null,null,null,null,null,null,null,null,null,null,null,null,null,null,null,null,null,null,null,null,null,null,null,null,null,null,null,null,null,null,null,null,null,null,null,null,null,null,null,null,"Access to Basic Hygiene","Yes","N/A","N/A","N/A","N/A","N/A","N/A","N/A","N/A","N/A","N/A","N/A","N/A","N/A","N/A","N/A","N/A","N/A","N/A","N/A","N/A","N/A","N/A","N/A"]
[null,null,null,null,null,null,null,null,null,null,null,null,null,null,null,null,null,null,null,null,null,null,null,null,null,null,null,null,null,null,null,null,null,null,null,null,null,null,null,null,null,null,null,null,null,null,null,null,null,null,null,null,null,"No","N/A","N/A","N/A","N/A","N/A","N/A","N/A","N/A","N/A","N/A","N/A","N/A","N/A","N/A","N/A","N/A","N/A","N/A","N/A","N/A","N/A","N/A","N/A"]
[]
[]
[]
[]
[]
[]
[]
[]
[]
[]
[]
[]
[]
[]
[]
[]
[]
[]
[]
[]
[]
[]
[]
[]
[]
[]
[]
[]
[]
[]
[]
[]
[]
[]
[]
[]
[]
[]
[]
[]
[]
[]
[]
[]
[null,null,"INITIAL (national) Wealth Index",null,null,null,null,"URBAN Wealth Index",null,null,null,null,"RURAL Wealth Index"]
[null,null,"Component Matrix",null,null,null,null,"Component Matrix",null,null,null,null,"Component Matrix"]
[null,null,null,null,"Component",null,null,null,null,"Component",null,null,null,null,"Component"]
[null,"Note:\n\nThe INITIAL (national) Wealth Index is based on the first component of the Principal Component Analysis (PCA) which has been obtained at national level.\n\nThe final national-level (NATIONAL) Wealth Index is based on the URBAN and RURAL specific wealth indexes. Regression procedures are used to establish the relationships between the two sets of scores (urban and rural) and the initial (national) wealth factors.\nThis allows best use of the available information for each area and a better precision of the FINAL (NATIONAL) Wealth Index.\n\nFor dependency reasons, all WASH variables (contained in the generic MICS and DHS scripts) have been excluded from the sets of asset variables used in the PCAs.\n\nThe PCA can extracts as many components as there are asset variables in the input. Only the first of the components is used to represent the Wealth Index. \n\nThe scores represent the weights of the asset variables on the Wealth Index (correlations between the variables and the component).\n\nThe communalities are the proportion of each variable's variance that can be explained by the component.\n\nProportion of explained variance is the part of the model's total variance that is explained by the component.\n\nFor more information on the procedure used:\n\nThe DHS Wealth Index, DHS Comparative Reports No. 6, Shea Oscar Rutstein, Kiersten Johnson, ORC Macro International Inc., 2004.\n\nThe DHS Wealth Index: Approaches for Rural and Urban Areas, Shea O. Rutstein, ORC Macro International Inc., 2008.\n\nMICS Methodological Paper No. 4, Review of options for reporting water, sanitation and hygiene coverage by wealth quintile, UNICEF, 2016.",null,null,"1",null,null,null,null,"1",null,null,null,null,"1"]
[null,null,"Wood for cooking",null,-0.74729470780332019,null,null,"Wood for cooking",null,-0.71944249886268574,null,null,"Has refrigerator",null,0.68989688373947655]
[null,null,"LPG for cooking",null,0.74166780803039234,null,null,"LPG for cooking",null,0.69548078296023164,null,null,"Earth, sand floor",null,-0.689052910146701]
[null,null,"Has refrigerator",null,0.70695290425376889,null,null,"Has refrigerator",null,0.67840051348103192,null,null,"LPG for cooking",null,0.63754806093400085]
[null,null,"Computer",null,0.64942610406887069,null,null,"Washing machine",null,0.63338059471231534,null,null,"Cement block walls",null,0.63054238052929468]
[null,null,"Earth, sand floor",null,-0.64760744576723073,null,null,"Microwave oven",null,0.63286515222039708,null,null,"Has television",null,0.62464032573178219]
[null,null,"Microwave oven",null,0.64747347838560987,null,null,"Computer",null,0.63179942025509306,null,null,"Wood for cooking",null,-0.62122645207954974]
[null,null,"Washing machine",null,0.62817738844838067,null,null,"Internet",null,0.59363189517563208,null,null,"Microwave oven",null,0.56726617917157274]
[null,null,"Cement block walls",null,0.60896980449877047,null,null,"Has car/truck",null,0.57337009197382915,null,null,"Computer",null,0.5385976677070462]
[null,null,"Has television",null,0.60873452895388525,null,null,"Finished wood roof",null,0.55087094286530103,null,null,"Has car/truck",null,0.52913694667663624]
[null,null,"Internet",null,0.58440155310761099,null,null,"Earth, sand floor",null,-0.5383794112516902,null,null,"Has electricity",null,0.49535807144626126]
[null,null,"Has car/truck",null,0.57264860903719783,null,null,"Calamine, cement fiber roof",null,-0.51986360446628932,null,null,"Washing machine",null,0.49345491329246732]
[null,null,"Finished wood roof",null,0.56603674698586715,null,null,"Has television",null,0.50588387859476303,null,null,"Number of members per sleeping room",null,-0.45196463686141164]
[null,null,"Number of members per sleeping room",null,-0.50874457213217361,null,null,"Number of members per sleeping room",null,-0.49639634766227486,null,null,"Has motorcycle/scooter",null,0.44355931962428802]
[null,null,"Concrete, cement floor",null,0.50721223091445866,null,null,"Concrete, cement floor",null,0.49381637427894504,null,null,"Concrete, cement floor",null,0.42463262014740993]
[null,null,"Has watch",null,0.48803963744605661,null,null,"Has watch",null,0.49114149588378431,null,null,"Internet",null,0.4155868795155358]
[null,null,"Has electricity",null,0.4591383322803268,null,null,"Cement block walls",null,0.46326842267234553,null,null,"Has mobile telephone",null,0.37360266588617919]
[null,null,"Calamine, cement fiber roof",null,-0.40512807226823216,null,null,"Household cooks in other house",null,-0.36071021291347699,null,null,"Finished wood roof",null,0.37345738197947459]
[null,null,"Has motorcycle/scooter",null,0.36425658239933256,null,null,"Has radio",null,0.34786405612298937,null,null,"Has watch",null,0.33856536814481625]
[null,null,"Has radio",null,0.36142131374726977,null,null,"Has electricity",null,0.33053966437315746,null,null,"Rug or mat floor",null,0.32685039742892746]
[null,null,"Has mobile telephone",null,0.3517862115189358,null,null,"Has motorcycle/scooter",null,0.32931937071891454,null,null,"Plywood walls",null,-0.31882906012302575]
[null,null,"Plywood walls",null,-0.33860455813068252,null,null,"Has mobile telephone",null,0.31962347414473619,null,null,"Has radio",null,0.3157316147524194]
[null,null,"Terrazo, ceramic tile floor",null,0.316525986894726,null,null,"Plywood walls",null,-0.30145145611336693,null,null,"Terrazo, ceramic tile floor",null,0.25132134910332232]
[null,null,"Household cooks in other house",null,-0.31482871508712262,null,null,"Dryer",null,0.2928707741431828,null,null,"6+ milk cows or bulls",null,0.21053955122692522]
[null,null,"Dryer",null,0.28134053266373776,null,null,"Rug or mat floor",null,-0.28960104496570199,null,null,"Has bicycle",null,0.20238672211898515]
[null,null,"Has bicycle",null,0.17887851288322307,null,null,"Terrazo, ceramic tile floor",null,0.27288656153999458,null,null,"Dryer",null,0.18438996870767971]
[null,null,"Cane/palm/trunks walls",null,-0.16646603983471747,null,null,"Uncovered adobe walls",null,-0.2439795933107341,null,null,"Thatch, palm leaf roof",null,-0.18099285134654106]
[null,null,"Thatch, palm leaf roof",null,-0.16196349241483116,null,null,"Household cooks outside house",null,-0.24007395125486647,null,null,"Cane/palm/trunks walls",null,-0.17672879174664663]
[null,null,"Uncovered adobe walls",null,-0.14485794368608568,null,null,"4-9 chickens",null,-0.23650224974280656,null,null,"Household cooks in other house",null,-0.16063204212407128]
[null,null,"Household cooks outside house",null,-0.1372895305123962,null,null,"1 pig",null,-0.17495801931992983,null,null,"4-9 chickens",null,-0.14191260341878695]
[null,null,"Electricity for cooking",null,0.10939455497472801,null,null,"Cane/palm/trunks walls",null,-0.16771228550749179,null,null,"1-3 chickens",null,-0.13080095128789873]
[null,null,"Covered adobe walls",null,-0.10391008769545883,null,null,"1-3 chickens",null,-0.15719705197235442,null,null,"4+ horses, donkeys, mules",null,0.11946299983596891]
[null,null,"Brick walls",null,9.1002335169595577E-2,null,null,"Covered adobe walls",null,-0.14551947991868075,null,null,"Calamine, cement fiber roof",null,-0.11585838170415204]
[null,null,"Bamboo with mud walls",null,-8.7541004117943522E-2,null,null,"10+ chickens",null,-0.12462037511046106,null,null,"1 pig",null,-0.10895883696977665]
[null,null,"Tile roof",null,8.2021859416114937E-2,null,null,"2-3 pigs",null,-0.12300598780482594,null,null,"Uncovered adobe walls",null,-0.10611579122921963]
[null,null,"Cement walls",null,7.0886530651707136E-2,null,null,"Medium land",null,-0.11743229472064462,null,null,"Tile roof",null,8.9805513893264202E-2]
[null,null,"Metal/ corrugated iron roof",null,-6.2679899842256748E-2,null,null,"Has bicycle",null,0.10694027931988427,null,null,"Bamboo with mud walls",null,-8.8713597865778385E-2]
[null,null,"Natural gas for cooking",null,4.6502252245531832E-2,null,null,"Small land",null,-0.10657001637965133,null,null,"Has boat with a motor",null,6.8111265035402865E-2]
[null,null,"Solar energy",null,-4.3618064999100786E-2,null,null,"Brick walls",null,0.10330745012293929,null,null,"Medium land",null,-6.4640640937325078E-2]
[null,null,"Has boat with a motor",null,3.6849405515924645E-2,null,null,"Electricity for cooking",null,9.8315706879878118E-2,null,null,"Solar energy",null,-6.3382007623699096E-2]
[null,null,"Charcoal for cooking",null,-3.3299073000405695E-2,null,null,"6+ milk cows or bulls",null,9.7640467573848602E-2,null,null,"Electricity for cooking",null,6.2946963360538885E-2]
[null,null,"Other type of walls",null,-3.1545052770311617E-2,null,null,"1-2 cmilk cows or bulls",null,-9.3925454277804174E-2,null,null,"Cement walls",null,6.1821452440932984E-2]
[null,null,"Has animal-drawn cart",null,2.5462116258028727E-2,null,null,"Bamboo with mud walls",null,-8.6803343394306134E-2,null,null,"5-5 milk cows or bulls",null,5.8951810970988373E-2]
[null,null,"Parquet, wood tile floor",null,2.4206864103136945E-2,null,null,"1 horse, donkey, mule",null,-7.2009973557011012E-2,null,null,"Metal/ corrugated iron roof",null,-5.3025527180800384E-2]
[null,null,"Other type of roof",null,-2.2069885472475452E-2,null,null,"Tile roof",null,6.8747743998740646E-2,null,null,"Household cooks outside house",null,-5.1344813740318983E-2]
[null,null,"Vinyl, asphalt strips floor",null,2.1186773424652288E-2,null,null,"Solar energy",null,6.7352947432805926E-2,null,null,"Natural gas for cooking",null,4.9504577110186861E-2]
[null,null,"Rug or mat floor",null,1.841589584624484E-2,null,null,"1-4 goats",null,-6.5598124017287304E-2,null,null,"10+ chickens",null,4.5301744471436312E-2]
[null,null,"No walls",null,-1.7737298740412806E-2,null,null,"4+ horses, donkeys, mules",null,5.9715449558693234E-2,null,null,"Brick walls",null,4.1335265193509448E-2]
[null,null,"No roof",null,-1.6791069600856384E-2,null,null,"Thatch, palm leaf roof",null,-5.5741472441670735E-2,null,null,"5-9 goats",null,-3.9818729301824098E-2]
[null,null,"Agricultural crop for cooking",null,-1.5910132124868033E-2,null,null,"Cement walls",null,5.3306680923530608E-2,null,null,"Parquet, wood tile floor",null,3.7857851348407905E-2]
[null,null,"Other type of flooring",null,1.3857569244134347E-2,null,null,"Charcoal for cooking",null,-5.2701844895597962E-2,null,null,"Small land",null,-3.761834675687363E-2]
[null,null,"Rudimentary wood plank floor",null,-1.2329221371779648E-2,null,null,"Other type of walls",null,-4.9172908388954356E-2,null,null,"Has animal-drawn cart",null,3.5243048581920469E-2]
[null,null,"Stone walls with lime/cement",null,-1.137545108673599E-2,null,null,"Has boat with a motor",null,4.356733718942233E-2,null,null,"4+ pigs",null,3.4048772979809933E-2]
[null,null,"Household cooks in other place",null,-1.0259690679302512E-2,null,null,"Metal/ corrugated iron roof",null,-3.8905028193336619E-2,null,null,"1 horse, donkey, mule",null,-3.2269026321220022E-2]
[null,null,"Other fuel for cooking",null,-8.5483221526871794E-3,null,null,"Does not cook",null,-3.7762077309063717E-2,null,null,"Other type of walls",null,-3.1893313750830085E-2]
[null,null,"Kerosene for cooking",null,7.8434059240603468E-3,null,null,"2-3 horses, donkeys, mules",null,-3.3458221961049514E-2,null,null,"Other type of roof",null,-2.7586260530273254E-2]
[null,null,"Wood planks roof",null,6.0129845901811529E-3,null,null,"Has animal-drawn cart",null,2.8787990506487102E-2,null,null,"Covered adobe walls",null,-2.6032711136387707E-2]
[null,null,"Does not cook",null,-5.9858950746333956E-3,null,null,"Natural gas for cooking",null,2.5633313421012945E-2,null,null,"2-3 horses, donkeys, mules",null,2.4611457388281681E-2]
[null,null,"Rustic mat roof",null,3.8006565255893094E-3,null,null,"Stone walls with lime/cement",null,-2.4514435728842154E-2,null,null,"10+ more goats",null,-2.365109671761324E-2]
[null,null,null,null,null,null,null,"Other type of roof",null,-2.1380796104929361E-2,null,null,"No walls",null,-2.0127093406621263E-2]
[null,null,null,null,null,null,null,"Parquet, wood tile floor",null,2.1120068793417709E-2,null,null,"No roof",null,-1.885427260969386E-2]
[null,null,null,null,null,null,null,"Rudimentary wood plank floor",null,-1.839212202863141E-2,null,null,"1-4 goats",null,-1.8512605978424763E-2]
[null,null,"Communalities",null,null,null,null,"10+ more goats",null,1.8345741638834526E-2,null,null,"2-3 pigs",null,-1.2703504149995005E-2]
[null,null,null,null,"Extraction",null,null,"Agricultural crop for cooking",null,-1.8128125570608344E-2,null,null,"1-2 cmilk cows or bulls",null,1.2087520907302928E-2]
[null,null,"Number of members per sleeping room",null,0.25882103967394837,null,null,"5-9 goats",null,-1.7928104176741354E-2,null,null,"Agricultural crop for cooking",null,-1.1882633073395543E-2]
[null,null,"Earth, sand floor",null,0.41939540381315671,null,null,"Wood planks roof",null,1.7599446798999017E-2,null,null,"Kerosene for cooking",null,9.664172524033841E-3]
[null,null,"Rudimentary wood plank floor",null,1.5200969963434803E-4,null,null,"Vinyl, asphalt strips floor",null,1.6227428658803243E-2,null,null,"Household cooks in other place",null,-8.953332934083881E-3]
[null,null,"Parquet, wood tile floor",null,5.8597226970774001E-4,null,null,"Other type of flooring",null,1.521415774949959E-2,null,null,"Other fuel for cooking",null,-8.5051772381240301E-3]
[null,null,"Vinyl, asphalt strips floor",null,4.4887936814755244E-4,null,null,"4+ pigs",null,-1.3735062471150776E-2,null,null,"Wood planks roof",null,-8.4898264804154373E-3]
[null,null,"Terrazo, ceramic tile floor",null,0.10018870037968025,null,null,"Big land",null,1.3427681611929233E-2,null,null,"Rudimentary wood plank floor",null,7.4811300446062977E-3]
[null,null,"Concrete, cement floor",null,0.25726424718922214,null,null,"Household cooks in other place",null,-4.3828474616453778E-3,null,null,"Stone walls with lime/cement",null,-6.8536978461571771E-3]
[null,null,"Rug or mat floor",null,3.3914521981973794E-4,null,null,"Kerosene for cooking",null,4.2432529763825211E-3,null,null,"Does not cook",null,4.7721027851160081E-3]
[null,null,"Other type of flooring",null,1.9203222535597818E-4,null,null,"Rustic mat roof",null,-1.7437878160636107E-3,null,null,"Charcoal for cooking",null,4.2773389392598291E-3]
[null,null,"No walls",null,3.146117666066497E-4,null,null,"5-5 milk cows or bulls",null,6.5702941593132698E-4,null,null,"Other type of flooring",null,1.9192887107570098E-3]
[null,null,"Cane/palm/trunks walls",null,2.7710942418253743E-2,null,null,null,null,null,null,null,"Big land",null,-1.0459347037406834E-3]
[null,null,"Bamboo with mud walls",null,7.6634274019778048E-3]
[null,null,"Uncovered adobe walls",null,2.0983823848961171E-2]
[null,null,"Plywood walls",null,0.11465304678687475,null,null,"Communalities"]
[null,null,"Cement walls",null,5.0249002278354151E-3,null,null,null,null,"Extraction",null,null,"Communalities"]
[null,null,"Stone walls with lime/cement",null,1.2940088742672301E-4,null,null,"Number of members per sleeping room",null,0.24640933397244605,null,null,null,null,"Extraction"]
[null,null,"Brick walls",null,8.2814250063194123E-3,null,null,"Earth, sand floor",null,0.28985239045971656,null,null,"Number of members per sleeping room",null,0.20427203297326768]
[null,null,"Cement block walls",null,0.37084422279127072,null,null,"Rudimentary wood plank floor",null,3.3827015271606879E-4,null,null,"Earth, sand floor",null,0.47479391298163759]
[null,null,"Covered adobe walls",null,1.0797306324877944E-2,null,null,"Parquet, wood tile floor",null,4.4605730583869657E-4,null,null,"Rudimentary wood plank floor",null,5.5967306744311024E-5]
[null,null,"Other type of walls",null,9.9509035428174469E-4,null,null,"Vinyl, asphalt strips floor",null,2.6332944087654884E-4,null,null,"Parquet, wood tile floor",null,1.4332169087181502E-3]
[null,null,"No roof",null,2.8194001834080338E-4,null,null,"Terrazo, ceramic tile floor",null,7.4467075469121249E-2,null,null,"Terrazo, ceramic tile floor",null,6.3162420515114018E-2]
[null,null,"Thatch, palm leaf roof",null,2.623217287520907E-2,null,null,"Concrete, cement floor",null,0.24385461150600313,null,null,"Concrete, cement floor",null,0.18031286209325453]
[null,null,"Rustic mat roof",null,1.4444990025504602E-5,null,null,"Rug or mat floor",null,8.3868765245226545E-2,null,null,"Rug or mat floor",null,0.10683118229944784]
[null,null,"Wood planks roof",null,3.6155983681756007E-5,null,null,"Other type of flooring",null,2.3147059602665843E-4,null,null,"Other type of flooring",null,3.6836691552393046E-6]
[null,null,"Metal/ corrugated iron roof",null,3.9287698442353374E-3,null,null,"Cane/palm/trunks walls",null,2.812741071014644E-2,null,null,"No walls",null,4.0509988899885713E-4]
[null,null,"Finished wood roof",null,0.32039759893834258,null,null,"Bamboo with mud walls",null,7.5348204244298301E-3,null,null,"Cane/palm/trunks walls",null,3.1233065832229595E-2]
[null,null,"Calamine, cement fiber roof",null,0.16412875493977394,null,null,"Uncovered adobe walls",null,5.9526041952071208E-2,null,null,"Bamboo with mud walls",null,7.8701024462910392E-3]
[null,null,"Tile roof",null,6.7275854220769224E-3,null,null,"Plywood walls",null,9.0872980392869188E-2,null,null,"Uncovered adobe walls",null,1.1260561148203325E-2]
[null,null,"Other type of roof",null,4.8707984476818299E-4,null,null,"Cement walls",null,2.8416022310831022E-3,null,null,"Plywood walls",null,0.10165196957893197]
[null,null,"Electricity for cooking",null,1.1967168658118789E-2,null,null,"Stone walls with lime/cement",null,6.0095755910353273E-4,null,null,"Cement walls",null,3.8218919819065387E-3]
[null,null,"LPG for cooking",null,0.55007113746860692,null,null,"Brick walls",null,1.067242925090359E-2,null,null,"Stone walls with lime/cement",null,4.6973174166419526E-5]
[null,null,"Natural gas for cooking",null,2.1624594639070701E-3,null,null,"Cement block walls",null,0.21461763144532298,null,null,"Brick walls",null,1.7086041486177536E-3]
[null,null,"Kerosene for cooking",null,6.1519016489584944E-5,null,null,"Covered adobe walls",null,2.117591903580333E-2,null,null,"Cement block walls",null,0.39758369364354984]
[null,null,"Charcoal for cooking",null,1.1088282626863476E-3,null,null,"Other type of walls",null,2.4179749194284976E-3,null,null,"Covered adobe walls",null,6.7770204911060455E-4]
[null,null,"Wood for cooking",null,0.55844938031084967,null,null,"Thatch, palm leaf roof",null,3.1071117499655381E-3,null,null,"Other type of walls",null,1.0171834620088874E-3]
[null,null,"Agricultural crop for cooking",null,2.5313230423075782E-4,null,null,"Rustic mat roof",null,3.0407959474518967E-6,null,null,"No roof",null,3.5548359564065212E-4]
[null,null,"Does not cook",null,3.5830939844520345E-5,null,null,"Wood planks roof",null,3.0974052763079677E-4,null,null,"Thatch, palm leaf roof",null,3.275841223855111E-2]
[null,null,"Other fuel for cooking",null,7.3073811626122372E-5,null,null,"Metal/ corrugated iron roof",null,1.5136012187243171E-3,null,null,"Wood planks roof",null,7.2077153667563166E-5]
[null,null,"Household cooks in other house",null,9.9117119843408638E-2,null,null,"Finished wood roof",null,0.30345879569330575,null,null,"Metal/ corrugated iron roof",null,2.8117065328018003E-3]
[null,null,"Household cooks outside house",null,1.8848415188314167E-2,null,null,"Calamine, cement fiber roof",null,0.27025816724868251,null,null,"Finished wood roof",null,0.13947041615496319]
[null,null,"Household cooks in other place",null,1.0526125283496684E-4,null,null,"Tile roof",null,4.7262523049163806E-3,null,null,"Calamine, cement fiber roof",null,1.3423164611104993E-2]
[null,null,"Has electricity",null,0.21080800816915979,null,null,"Other type of roof",null,4.5713844208056253E-4,null,null,"Tile roof",null,8.0650303256332694E-3]
[null,null,"Has radio",null,0.13062536603080241,null,null,"Electricity for cooking",null,9.6659782192901143E-3,null,null,"Other type of roof",null,7.61001770044112E-4]
[null,null,"Has television",null,0.37055772674070858,null,null,"LPG for cooking",null,0.48369351946697681,null,null,"Electricity for cooking",null,3.9623201963130249E-3]
[null,null,"Has refrigerator",null,0.49978240883283853,null,null,"Natural gas for cooking",null,6.570667569398824E-4,null,null,"LPG for cooking",null,0.40646753000070446]
[null,null,"Has bicycle",null,3.1997522371313404E-2,null,null,"Kerosene for cooking",null,1.8005195821579124E-5,null,null,"Natural gas for cooking",null,2.4507031548584367E-3]
[null,null,"Has motorcycle/scooter",null,0.13268285782124176,null,null,"Charcoal for cooking",null,2.7774844553996648E-3,null,null,"Kerosene for cooking",null,9.3396230574290616E-5]
[null,null,"Has car/truck",null,0.32792642943223743,null,null,"Wood for cooking",null,0.51759750916978553,null,null,"Charcoal for cooking",null,1.8295628401308399E-5]
[null,null,"Has mobile telephone",null,0.12375353861484543,null,null,"Agricultural crop for cooking",null,3.2862893670374411E-4,null,null,"Wood for cooking",null,0.3859223047633451]
[null,null,"Has watch",null,0.23818268771847836,null,null,"Does not cook",null,1.4259744826957048E-3,null,null,"Agricultural crop for cooking",null,1.4119696875695363E-4]
[null,null,"Has animal-drawn cart",null,6.4831936433737078E-4,null,null,"Household cooks in other house",null,0.1301118577000859,null,null,"Does not cook",null,2.277296499171196E-5]
[null,null,"Has boat with a motor",null,1.3578786868770577E-3,null,null,"Household cooks outside house",null,5.7635502071124001E-2,null,null,"Other fuel for cooking",null,7.2338039851903106E-5]
[null,null,"Solar energy",null,1.902535594265781E-3,null,null,"Household cooks in other place",null,1.9209351872051331E-5,null,null,"Household cooks in other house",null,2.5802652956949411E-2]
[null,null,"Washing machine",null,0.39460683135782776,null,null,"Has electricity",null,0.10925646972391959,null,null,"Household cooks outside house",null,2.6362898980280491E-3]
[null,null,"Dryer",null,7.9152495319515695E-2,null,null,"Has radio",null,0.1210094015423383,null,null,"Household cooks in other place",null,8.0162170628551079E-5]
[null,null,"Microwave oven",null,0.41922190521276081,null,null,"Has television",null,0.25591849862208094,null,null,"Has electricity",null,0.24537961894695928]
[null,null,"Computer",null,0.42175426464607169,null,null,"Has refrigerator",null,0.46022725669132775,null,null,"Has radio",null,9.9686452554170177E-2]
[null,null,"Internet",null,0.34152517527458787,null,null,"Has bicycle",null,1.1436223341014868E-2,null,null,"Has television",null,0.39017553653030695]
[null,null,null,null,null,null,null,"Has motorcycle/scooter",null,0.10845124793070186,null,null,"Has refrigerator",null,0.47595771019344085]
[null,null,null,null,null,null,null,"Has car/truck",null,0.32875326237007729,null,null,"Has bicycle",null,4.0960385290067312E-2]
[null,null,"Total Variance Explained",null,null,null,null,"Has mobile telephone",null,0.10215916522435084,null,null,"Has motorcycle/scooter",null,0.19674487002556129]
[null,null,"Component",null,"Extraction Sums of Squared Loadings",null,null,"Has watch",null,0.24121996897896131,null,null,"Has car/truck",null,0.27998590833827341]
[null,null,null,null,"Total","% of Variance","Cumulative %","Has animal-drawn cart",null,8.2874839740159148E-4,null,null,"Has mobile telephone",null,0.13957895195726003]
[null,null,"1",null,7.0957594082186004,12.234067945204483,12.234067945204483,"Has boat with a motor",null,1.8981128697768219E-3,null,null,"Has watch",null,0.11462650850703496]
[null,null,null,null,null,null,null,"Solar energy",null,4.5364195278863187E-3,null,null,"Has animal-drawn cart",null,1.2420724733476064E-3]
[null,null,null,null,null,null,null,"Washing machine",null,0.40117097775812627,null,null,"Has boat with a motor",null,4.6391444247228927E-3]
[null,null,"Component Score Coefficient Matrix",null,null,null,null,"Dryer",null,8.5773290347227193E-2,null,null,"Solar energy",null,4.0172788904106506E-3]
[null,null,null,null,"Component",null,null,"Microwave oven",null,0.40051830089494639,null,null,"Washing machine",null,0.24349775145247646]
[null,null,null,null,"1",null,null,"Computer",null,0.3991705074346717,null,null,"Dryer",null,3.3999660560019102E-2]
[null,null,"Number of members per sleeping room",null,-7.1696987293977985E-2,null,null,"Internet",null,0.35239882696981262,null,null,"Microwave oven",null,0.32179091803191484]
[null,null,"Earth, sand floor",null,-9.1266826918785515E-2,null,null,"Small land",null,1.1357168391159153E-2,null,null,"Computer",null,0.29008744765946975]
[null,null,"Rudimentary wood plank floor",null,-1.7375478313849592E-3,null,null,"Medium land",null,1.3790343843356338E-2,null,null,"Internet",null,0.17271245442546046]
[null,null,"Parquet, wood tile floor",null,3.411455026941805E-3,null,null,"Big land",null,1.8030263347134246E-4,null,null,"Small land",null,1.4151400127203847E-3]
[null,null,"Vinyl, asphalt strips floor",null,2.9858359346446981E-3,null,null,"1-2 cmilk cows or bulls",null,8.8219909612918829E-3,null,null,"Medium land",null,4.1784124607881865E-3]
[null,null,"Terrazo, ceramic tile floor",null,4.4607767637684086E-2,null,null,"5-5 milk cows or bulls",null,4.3168765339906065E-7,null,null,"Big land",null,1.0939794044891112E-6]
[null,null,"Concrete, cement floor",null,7.1481035606560273E-2,null,null,"6+ milk cows or bulls",null,9.5336609080397799E-3,null,null,"1-2 cmilk cows or bulls",null,1.461081616844854E-4]
[null,null,"Rug or mat floor",null,2.59533825582006E-3,null,null,"1 horse, donkey, mule",null,5.1854362916814254E-3,null,null,"5-5 milk cows or bulls",null,3.4753160167591453E-3]
[null,null,"Other type of flooring",null,1.9529367396650939E-3,null,null,"2-3 horses, donkeys, mules",null,1.119452616794856E-3,null,null,"6+ milk cows or bulls",null,4.4326902630835066E-2]
[null,null,"No walls",null,-2.4997040795758578E-3,null,null,"4+ horses, donkeys, mules",null,3.5659349159968359E-3,null,null,"1 horse, donkey, mule",null,1.0412900597195907E-3]
[null,null,"Cane/palm/trunks walls",null,-2.3459932934297306E-2,null,null,"1-4 goats",null,4.3031138745874059E-3,null,null,"2-3 horses, donkeys, mules",null,6.0572383477520498E-4]
[null,null,"Bamboo with mud walls",null,-1.2337087418233198E-2,null,null,"5-9 goats",null,3.2141691937209081E-4,null,null,"4+ horses, donkeys, mules",null,1.4271408329808707E-2]
[null,null,"Uncovered adobe walls",null,-2.0414720307216912E-2,null,null,"10+ more goats",null,3.3656623627886692E-4,null,null,"1-4 goats",null,3.4271658011240827E-4]
[null,null,"Plywood walls",null,-4.7719283962544851E-2,null,null,"1-3 chickens",null,2.4710913148799099E-2,null,null,"5-9 goats",null,1.5855312032119449E-3]
[null,null,"Cement walls",null,9.9899850845567642E-3,null,null,"4-9 chickens",null,5.5933314133408844E-2,null,null,"10+ more goats",null,5.5937437594589579E-4]
[null,null,"Stone walls with lime/cement",null,-1.6031337073746437E-3,null,null,"10+ chickens",null,1.5530237892672024E-2,null,null,"1-3 chickens",null,1.7108888857819256E-2]
[null,null,"Brick walls",null,1.2824890182183031E-2,null,null,"1 pig",null,3.0610308524352939E-2,null,null,"4-9 chickens",null,2.0139187009097902E-2]
[null,null,"Cement block walls",null,8.5821653393918174E-2,null,null,"2-3 pigs",null,1.5130473035840988E-2,null,null,"10+ chickens",null,2.0522480521553105E-3]
[null,null,"Covered adobe walls",null,-1.4643969971009151E-2,null,null,"4+ pigs",null,1.8865194108641446E-4,null,null,"1 pig",null,1.1872028153806367E-2]
[null,null,"Other type of walls",null,-4.4456203988222668E-3,null,null,null,null,null,null,null,"2-3 pigs",null,1.6137901768894031E-4]
[null,null,"No roof",null,-2.3663527234883811E-3,null,null,null,null,null,null,null,"4+ pigs",null,1.1593189414306349E-3]
[null,null,"Thatch, palm leaf roof",null,-2.2825392336053334E-2,null,null,"Total Variance Explained"]
[null,null,"Rustic mat roof",null,5.356236460310694E-4,null,null,"Component",null,"Extraction Sums of Squared Loadings"]
[null,null,"Wood planks roof",null,8.4740536484603302E-4,null,null,null,null,"Total","% of Variance","Cumulative %","Total Variance Explained"]
[null,null,"Metal/ corrugated iron roof",null,-8.8334308192098976E-3,null,null,"1",null,6.7512300524375464,9.2482603458048587,9.2482603458048587,"Component",null,"Extraction Sums of Squared Loadings"]
[null,null,"Finished wood roof",null,7.9771130110508015E-2,null,null,null,null,null,null,null,null,null,"Total","% of Variance","Cumulative %"]
[null,null,"Calamine, cement fiber roof",null,-5.7094392433739545E-2,null,null,null,null,null,null,null,"1",null,5.7930541193958236,7.8284515126970584,7.8284515126970584]
[null,null,"Tile roof",null,1.1559278534882943E-2,null,null,"Component Score Coefficient Matrix"]
[null,null,"Other type of roof",null,-3.1102922467908379E-3,null,null,null,null,"Component"]
[null,null,"Electricity for cooking",null,1.5416891791458257E-2,null,null,null,null,"1",null,null,"Component Score Coefficient Matrix"]
[null,null,"LPG for cooking",null,0.10452268254351499,null,null,"Number of members per sleeping room",null,-7.3526800865428926E-2,null,null,null,null,"Component"]
[null,null,"Natural gas for cooking",null,6.5535271942381559E-3,null,null,"Earth, sand floor",null,-7.9745380778026828E-2,null,null,null,null,"1"]
[null,null,"Kerosene for cooking",null,1.105365257307878E-3,null,null,"Rudimentary wood plank floor",null,-2.7242623767487961E-3,null,null,"Number of members per sleeping room",null,-7.8018369507058663E-2]
[null,null,"Charcoal for cooking",null,-4.6928131415838797E-3,null,null,"Parquet, wood tile floor",null,3.1283290051406648E-3,null,null,"Earth, sand floor",null,-0.11894466993492625]
[null,null,"Wood for cooking",null,-0.10531567726743567,null,null,"Vinyl, asphalt strips floor",null,2.4036254923566545E-3,null,null,"Rudimentary wood plank floor",null,1.2913965397904016E-3]
[null,null,"Agricultural crop for cooking",null,-2.2422028721041849E-3,null,null,"Terrazo, ceramic tile floor",null,4.0420272960698216E-2,null,null,"Parquet, wood tile floor",null,6.5350418912289094E-3]
[null,null,"Does not cook",null,-8.4358765993394411E-4,null,null,"Concrete, cement floor",null,7.3144652225360249E-2,null,null,"Terrazo, ceramic tile floor",null,4.3383221341203954E-2]
[null,null,"Other fuel for cooking",null,-1.2047085675968893E-3,null,null,"Rug or mat floor",null,-4.289604156817925E-2,null,null,"Concrete, cement floor",null,7.3300302637548345E-2]
[null,null,"Household cooks in other house",null,-4.4368572407130255E-2,null,null,"Other type of flooring",null,2.2535386338977566E-3,null,null,"Rug or mat floor",null,5.6421084749509604E-2]
[null,null,"Household cooks outside house",null,-1.9348109569975253E-2,null,null,"Cane/palm/trunks walls",null,-2.4841737610013584E-2,null,null,"Other type of flooring",null,3.3130861048423607E-4]
[null,null,"Household cooks in other place",null,-1.4458904380860657E-3,null,null,"Bamboo with mud walls",null,-1.2857411570942629E-2,null,null,"No walls",null,-3.4743492796370399E-3]
[null,null,"Has electricity",null,6.4706017476936162E-2,null,null,"Uncovered adobe walls",null,-3.613853940922139E-2,null,null,"Cane/palm/trunks walls",null,-3.0507015488589681E-2]
[null,null,"Has radio",null,5.0934832053163591E-2,null,null,"Plywood walls",null,-4.4651338166817052E-2,null,null,"Bamboo with mud walls",null,-1.531378717294473E-2]
[null,null,"Has television",null,8.5788496189544428E-2,null,null,"Cement walls",null,7.8958472025826027E-3,null,null,"Uncovered adobe walls",null,-1.8317762796990201E-2]
[null,null,"Has refrigerator",null,9.9630337442803821E-2,null,null,"Stone walls with lime/cement",null,-3.6311065596100018E-3,null,null,"Plywood walls",null,-5.5036437352716724E-2]
[null,null,"Has bicycle",null,2.5209213361439321E-2,null,null,"Brick walls",null,1.5302018938850987E-2,null,null,"Cement walls",null,1.0671651113002299E-2]
[null,null,"Has motorcycle/scooter",null,5.1334404317237098E-2,null,null,"Cement block walls",null,6.8619854319003901E-2,null,null,"Stone walls with lime/cement",null,-1.1830888689974767E-3]
[null,null,"Has car/truck",null,8.0702934822442368E-2,null,null,"Covered adobe walls",null,-2.1554513590621993E-2,null,null,"Brick walls",null,7.1353148687346357E-3]
[null,null,"Has mobile telephone",null,4.9576964392490902E-2,null,null,"Other type of walls",null,-7.2835480359909176E-3,null,null,"Cement block walls",null,0.10884455203312619]
[null,null,"Has watch",null,6.8779056527873417E-2,null,null,"Thatch, palm leaf roof",null,-8.2564913369446141E-3,null,null,"Covered adobe walls",null,-4.4937800683109699E-3]
[null,null,"Has animal-drawn cart",null,3.5883567625668738E-3,null,null,"Rustic mat roof",null,-2.5829186718855952E-4,null,null,"Other type of walls",null,-5.5054403244823033E-3]
[null,null,"Has boat with a motor",null,5.1931588144384037E-3,null,null,"Wood planks roof",null,2.6068504053783055E-3,null,null,"No roof",null,-3.2546342949857053E-3]
[null,null,"Solar energy",null,-6.1470608697048778E-3,null,null,"Metal/ corrugated iron roof",null,-5.7626577514255893E-3,null,null,"Thatch, palm leaf roof",null,-3.124307966337753E-2]
[null,null,"Washing machine",null,8.852856365462447E-2,null,null,"Finished wood roof",null,8.1595640881235831E-2,null,null,"Wood planks roof",null,-1.4655182405409444E-3]
[null,null,"Dryer",null,3.964910821777267E-2,null,null,"Calamine, cement fiber roof",null,-7.7002798072121889E-2,null,null,"Metal/ corrugated iron roof",null,-9.1532939427002268E-3]
[null,null,"Microwave oven",null,9.1247946997143059E-2,null,null,"Tile roof",null,1.0182995315634239E-2,null,null,"Finished wood roof",null,6.4466406541774851E-2]
[null,null,"Computer",null,9.1523129056021654E-2,null,null,"Other type of roof",null,-3.1669482359306918E-3,null,null,"Calamine, cement fiber roof",null,-1.999953380657098E-2]
[null,null,"Internet",null,8.2359268330142815E-2,null,null,"Electricity for cooking",null,1.456263615907756E-2,null,null,"Tile roof",null,1.5502274282676703E-2]
[null,null,null,null,null,null,null,"LPG for cooking",null,0.10301541756959189,null,null,"Other type of roof",null,-4.7619545686464803E-3]
[null,null,null,null,null,null,null,"Natural gas for cooking",null,3.7968360168319222E-3,null,null,"Electricity for cooking",null,1.0865937390397422E-2]
[null,null,"Component Score Covariance Matrix",null,null,null,null,"Kerosene for cooking",null,6.2851553619484271E-4,null,null,"LPG for cooking",null,0.11005387621003149]
[null,null,"Component",null,"1",null,null,"Charcoal for cooking",null,-7.8062581909158673E-3,null,null,"Natural gas for cooking",null,8.5455057194165924E-3]
[null,null,"1",null,1.0000000000000002,null,null,"Wood for cooking",null,-0.10656465462955589,null,null,"Kerosene for cooking",null,1.6682344623153201E-3]
[null,null,null,null,null,null,null,"Agricultural crop for cooking",null,-2.6851589161982626E-3,null,null,"Charcoal for cooking",null,7.3835646122117141E-4]
[null,null,null,null,null,null,null,"Does not cook",null,-5.593362545160142E-3,null,null,"Wood for cooking",null,-0.10723643164313119]
[null,null,null,null,null,null,null,"Household cooks in other house",null,-5.3428813729024346E-2,null,null,"Agricultural crop for cooking",null,-2.0511862704011511E-3]
[null,null,null,null,null,null,null,"Household cooks outside house",null,-3.5560031192861989E-2,null,null,"Does not cook",null,8.2376285233352984E-4]
[null,null,null,null,null,null,null,"Household cooks in other place",null,-6.4919243272756509E-4,null,null,"Other fuel for cooking",null,-1.4681680962806306E-3]
[null,null,null,null,null,null,null,"Has electricity",null,4.8959917201135128E-2,null,null,"Household cooks in other house",null,-2.7728386238660609E-2]
[null,null,null,null,null,null,null,"Has radio",null,5.1526026134658565E-2,null,null,"Household cooks outside house",null,-8.8631683188338493E-3]
[null,null,null,null,null,null,null,"Has television",null,7.4932104915031369E-2,null,null,"Household cooks in other place",null,-1.545528964438132E-3]
[null,null,null,null,null,null,null,"Has refrigerator",null,0.10048546830900747,null,null,"Has electricity",null,8.5508966641230658E-2]
[null,null,null,null,null,null,null,"Has bicycle",null,1.5840117799166574E-2,null,null,"Has radio",null,5.4501754729912331E-2]
[null,null,null,null,null,null,null,"Has motorcycle/scooter",null,4.8779165894371063E-2,null,null,"Has television",null,0.10782573627966176]
[null,null,null,null,null,null,null,"Has car/truck",null,8.49282408569106E-2,null,null,"Has refrigerator",null,0.11909035709326814]
[null,null,null,null,null,null,null,"Has mobile telephone",null,4.734299848504428E-2,null,null,"Has bicycle",null,3.493610070746115E-2]
[null,null,null,null,null,null,null,"Has watch",null,7.274844614522602E-2,null,null,"Has motorcycle/scooter",null,7.6567439295828349E-2]
[null,null,null,null,null,null,null,"Has animal-drawn cart",null,4.2641104336376646E-3,null,null,"Has car/truck",null,9.1339893564091501E-2]
[null,null,null,null,null,null,null,"Has boat with a motor",null,6.4532443497007244E-3,null,null,"Has mobile telephone",null,6.4491485524934722E-2]
[null,null,null,null,null,null,null,"Solar energy",null,9.9763964358595639E-3,null,null,"Has watch",null,5.8443329056992545E-2]
[null,null,null,null,null,null,null,"Washing machine",null,9.3817065896551963E-2,null,null,"Has animal-drawn cart",null,6.0836732845154368E-3]
[null,null,null,null,null,null,null,"Dryer",null,4.3380357633856829E-2,null,null,"Has boat with a motor",null,1.1757401818042469E-2]
[null,null,null,null,null,null,null,"Microwave oven",null,9.3740717958781403E-2,null,null,"Solar energy",null,-1.0941034956239874E-2]
[null,null,null,null,null,null,null,"Computer",null,9.3582860508061111E-2,null,null,"Washing machine",null,8.5180442495836964E-2]
[null,null,null,null,null,null,null,"Internet",null,8.7929442570439428E-2,null,null,"Dryer",null,3.1829491820268091E-2]
[null,null,null,null,null,null,null,"Small land",null,-1.5785274024423739E-2,null,null,"Microwave oven",null,9.7921781409274114E-2]
[null,null,null,null,null,null,null,"Medium land",null,-1.7394207249424927E-2,null,null,"Computer",null,9.2973008124291157E-2]
[null,null,null,null,null,null,null,"Big land",null,1.9889237231785839E-3,null,null,"Internet",null,7.1738822208496603E-2]
[null,null,null,null,null,null,null,"1-2 cmilk cows or bulls",null,-1.3912346868389143E-2,null,null,"Small land",null,-6.4936984846944556E-3]
[null,null,null,null,null,null,null,"5-5 milk cows or bulls",null,9.7319956634288449E-5,null,null,"Medium land",null,-1.1158300890181683E-2]
[null,null,null,null,null,null,null,"6+ milk cows or bulls",null,1.4462618932470726E-2,null,null,"Big land",null,-1.8054978983171791E-4]
[null,null,null,null,null,null,null,"1 horse, donkey, mule",null,-1.0666200529044576E-2,null,null,"1-2 cmilk cows or bulls",null,2.0865541143198531E-3]
[null,null,null,null,null,null,null,"2-3 horses, donkeys, mules",null,-4.9558705156209784E-3,null,null,"5-5 milk cows or bulls",null,1.0176292117418826E-2]
[null,null,null,null,null,null,null,"4+ horses, donkeys, mules",null,8.8451214215597394E-3,null,null,"6+ milk cows or bulls",null,3.6343446287169005E-2]
[null,null,null,null,null,null,null,"1-4 goats",null,-9.7164699629222317E-3,null,null,"1 horse, donkey, mule",null,-5.5702960228145538E-3]
[null,null,null,null,null,null,null,"5-9 goats",null,-2.6555315161077013E-3,null,null,"2-3 horses, donkeys, mules",null,4.2484425108130167E-3]
[null,null,null,null,null,null,null,"10+ more goats",null,2.7173924597949013E-3,null,null,"4+ horses, donkeys, mules",null,2.062176485387782E-2]
[null,null,null,null,null,null,null,"1-3 chickens",null,-2.3284209062850416E-2,null,null,"1-4 goats",null,-3.1956556242832934E-3]
[null,null,null,null,null,null,null,"4-9 chickens",null,-3.5030986635897099E-2,null,null,"5-9 goats",null,-6.8735296583034384E-3]
[null,null,null,null,null,null,null,"10+ chickens",null,-1.8458914026410134E-2,null,null,"10+ more goats",null,-4.0826645548548562E-3]
[null,null,null,null,null,null,null,"1 pig",null,-2.5914984078606658E-2,null,null,"1-3 chickens",null,-2.2578927900908409E-2]
[null,null,null,null,null,null,null,"2-3 pigs",null,-1.8219789112417277E-2,null,null,"4-9 chickens",null,-2.4497027042030724E-2]
[null,null,null,null,null,null,null,"4+ pigs",null,-2.0344533313883593E-3,null,null,"10+ chickens",null,7.8200105743464008E-3]
[null,null,null,null,null,null,null,null,null,null,null,null,"1 pig",null,-1.8808530824003477E-2]
[null,null,null,null,null,null,null,null,null,null,null,null,"2-3 pigs",null,-2.1928854604451541E-3]
[null,null,null,null,null,null,null,"Component Score Covariance Matrix",null,null,null,null,"4+ pigs",null,5.8775168120405877E-3]
[null,null,null,null,null,null,null,"Component",null,"1"]
[null,null,null,null,null,null,null,"1",null,1]
[null,null,null,null,null,null,null,null,null,null,null,null,"Component Score Covariance Matrix"]
[null,null,null,null,null,null,null,null,null,null,null,null,"Component",null,"1"]
[null,null,null,null,null,null,null,null,null,null,null,null,"1",null,1.0000000000000002]
[]
[]
[]
[]
[]
[]
[]
[]
[]
[]
[]
[]
[]
[]
[]
[]
[]
[]
[]
[]
[]
[]
[]
[]
[]
[]
[]
[]
[]
[]
[]
[]
[]
[]
[]
[]
[]
[]
[]
[]
[]
[]
[]
[]
[]
[]
[]
[]
[]
[]
[]
[]
[]
[]
[]
[]
[]
[]
[]
[]
[]
[]
[]
[]
[]
[]
[]
[]
[]
[]
[]
[]
[]
[]
[]
[]
[]
[]
[]
[]
[]
[]
[]
[]
[]
[]
[]
[]
[]
[]
[]
[]
[]
[]
[]
[]
[]
[]
[]
[]
[]
[]
[]
[]
[]
[]
[]
[]
[]
[]
[]
[]
[]
[]
[]
[]
[]
[]
[]
[]
[]
[]
[]
[]
[]
[]
[]
[]
[]
[]
[]
[]
[]
[]
[]
[]
[]
[]
[]
[]
[]
[]
[]
[]
[]
[]
[]
[]
[]
[]
[]
[]
[]
[]
[]
[]
[]
[]
[]
[]
[]
[]
[]
[]
[]
[]
[]
[]
[]
[]
[]
[]
[]
[]
[]
[]
[]
[]
[]
[]
[]
[]
[]
[]
[]
[]
[]
[]
[]
[]
[]
[]
[]
[]
[]
[]
[]
[]
[]
[]
[]
[]
[]
[]
[]
[]
[]
[]
[]
[]
[]
[]
[]
[]
[]
[]
[]
[]
[]
[]
[]
[]
[]
[]
[]
[]
[]
[]
[]
[]
[]
[]
[]
[]
[]
[]
[]
[]
[]
[]
[]
[]
[]
[]
[]
[]
[]
[]
[]
[]
[]
[]
[]
[]
[]
[]
[]
[]
[]
[]
[]
[]
[]
[]
[]
[]
[]
[]
[]
[]
[]
[]
[]
[]
[]
[]
[]
[]
[]
[]
[]
[]
[]
[]
[]
[]
[]
[]
[]
[]
[]
[]
[]
[]
[]
[]
[]
[]
[]
[]
[]
[]
[]
[]
[]
[]
[]
[]
[]
[]
[]
[]
[]
[]
[]
[]
[]
[]
[]
[]
[]
[]
[]
[]
[]
[]
[]
[]
[]
[]
[]
[]
[]
[]
[]
[]
[]
[]
[]
[]
[]
[]
[]
[]
[]
[]
[]
[]
[]
[]
[]
[]
[]
[]
[]
[]
[]
[]
[]
[]
[]
[]
[]
[]
[]
[]
[]
[]
[]
[]
[]
[]
[]
[]
[]
[]
[]
[]
[]
["DHS15"]
["Guatemala",null,"Count"]
["W_text_t","",21383]
["W_text_i","",21383]
["S_text_s","Ratio of Shared improved based on:",21383]
["S_text_i","Ratio of Improved latrines based on:",21383]
["Urban/Rural","Urban",9462]
[null,"Rural",11921]
[null,"Missing",0]
["2015"]
[]
["Sub-national region names","Weighted population"]
[{"$f":"R15","v":"Central"},{"$f":"BR122+BR123","v":{"$error":"#VALUE!"}}]
[{"$f":"S15","v":"Metropolitana"},{"$f":"BS122+BS123","v":{"$error":"#VALUE!"}}]
[{"$f":"T15","v":"Noroccidente"},{"$f":"BT122+BT123","v":{"$error":"#VALUE!"}}]
[{"$f":"U15","v":"Nororiente"},{"$f":"BU122+BU123","v":{"$error":"#VALUE!"}}]
[{"$f":"V15","v":"Norte"},{"$f":"BV122+BV123","v":{"$error":"#VALUE!"}}]
[{"$f":"W15","v":"Petén"},{"$f":"BW122+BW123","v":{"$error":"#VALUE!"}}]
[{"$f":"X15","v":"Suroccidente"},{"$f":"BX122+XR123","v":{"$error":"#VALUE!"}}]
[{"$f":"Y15","v":"Suroriente"},{"$f":"BY122+BY123","v":{"$error":"#VALUE!"}}]
[{"$f":"Z15","v":0},{"$f":"BZ122+BZ123","v":0}]
[{"$f":"AA15","v":0},{"$f":"CA122+CA123","v":0}]
[{"$f":"AB15","v":0},{"$f":"CB122+CB123","v":0}]
[{"$f":"AC15","v":0},{"$f":"CC122+CC123","v":0}]
[{"$f":"AD15","v":0},{"$f":"CD122+CD123","v":0}]
[{"$f":"AE15","v":0},{"$f":"CE122+CE123","v":0}]
[{"$f":"AF15","v":0},{"$f":"CF122+CF123","v":0}]
[{"$f":"AG15","v":0},{"$f":"CG122+CG123","v":0}]
[{"$f":"AH15","v":0},{"$f":"CH122+CH123","v":0}]
[{"$f":"AI15","v":0},{"$f":"CI122+CI123","v":0}]
[{"$f":"AJ15","v":0},{"$f":"CJ122+CJ123","v":0}]
[{"$f":"AK15","v":0},{"$f":"CK122+CK123","v":0}]
[{"$f":"AL15","v":0},{"$f":"CL122+CL123","v":0}]
[{"$f":"AM15","v":0},{"$f":"CM122+CM123","v":0}]
[{"$f":"AN15","v":0},{"$f":"CN122+CN123","v":0}]
[{"$f":"AO15","v":0},{"$f":"CO122+CO123","v":0}]
[{"$f":"AP15","v":0},{"$f":"CP122+CP123","v":0}]
[{"$f":"AQ15","v":0},{"$f":"CQ122+CQ123","v":0}]
[{"$f":"AR15","v":0},{"$f":"CR122+CR123","v":0}]
[{"$f":"AS15","v":0},{"$f":"CS122+CS123","v":0}]
[{"$f":"AT15","v":0},{"$f":"CT122+CT123","v":0}]
[{"$f":"AU15","v":0},{"$f":"CU122+CU123","v":0}]
[{"$f":"AV15","v":0},{"$f":"CV122+CV123","v":0}]
[{"$f":"AW15","v":0},{"$f":"CW122+CW123","v":0}]
[{"$f":"AX15","v":0},{"$f":"CX122+CX123","v":0}]
[{"$f":"AY15","v":0},{"$f":"CY122+CY123","v":0}]
[]
[{"$f":"34-COUNTIF(A1037:A1071,\"0\")","v":8},"Sub-regions"]

{"sheet":"data_summary","index":7,"n_rows":148,"n_cols":61,"rows_kept":148,"cut":false,"hidden":false,"merged":[]}
["iso3","year","data_source","row","var1","var2","varname","total_q1","total_q2","total_q3","total_q4","total_q5","urban_q1","urban_q2","urban_q3","urban_q4","urban_q5","rural_q1","rural_q2","rural_q3","rural_q4","rural_q5","region_1_name","region_2_name","region_3_name","region_4_name","region_5_name","region_6_name","region_7_name","region_8_name","region_1","region_2","region_3","region_4","region_5","region_6","region_7","region_8","n_total_q1","n_total_q2","n_total_q3","n_total_q4","n_total_q5","n_urban_q1","n_urban_q2","n_urban_q3","n_urban_q4","n_urban_q5","n_rural_q1","n_rural_q2","n_rural_q3","n_rural_q4","n_rural_q5","n_region_1","n_region_2","n_region_3","n_region_4","n_region_5","n_region_6","n_region_7","n_region_8"]
["GTM",2003,"GTM_2003_WHS",16,"Water","Improved","w_imp",85.333333333333343,88.820512820512818,85.010266940451757,95.807770961145195,98.456790123456798,98.004987531172077,98.263027295285355,98.014888337468989,98.22784810126582,99.264705882352942,81.949458483754512,85.662431941923785,88.267148014440437,92.558983666061707,93.501805054151617,"","","","","","","",""]
["GTM",2003,"GTM_2003_WHS",17,"Water","Not Improved","",14.66666666666667,11.179487179487181,14.989733059548261,4.1922290388548058,1.5432098765432101,1.99501246882793,1.7369727047146399,1.985111662531017,1.7721518987341769,0.73529411764705876,18.050541516245492,14.337568058076229,11.73285198555957,7.4410163339382942,6.4981949458483754,"","","","","","","",""]
["GTM",2003,"GTM_2003_WHS",18,"Water ladder","Basic","w_bas",81.920000000000002,87.310564102564101,83.990143737166321,95.616155419222906,98.358333333333334,97.710972568578569,97.575186104218361,98.014888337468989,98.22784810126582,99.264705882352942,77.851985559566785,83.178221415607993,86.59007220216607,91.448275862068968,93.03429602888086,"","","","","","","",""]
["GTM",2003,"GTM_2003_WHS",19,"Water ladder","Limited","w_lim",3.413333333333334,1.5099487179487181,1.0201232032854211,0.19161554192229041,0.098456790123456803,0.29401496259351623,0.68784119106699748,0,0,0,4.0974729241877252,2.4842105263157901,1.6770758122743681,1.1107078039927401,0.46750902527075811,"","","","","","","",""]
["GTM",2003,"GTM_2003_WHS",20,"Water ladder","Unimproved","w_unimp",2.9382716049382789,5.6009747827929743,13.263611080261731,3.4668404378185329,1.5432098765432161,1.243132769579788,1.4857164233076079,1.985111662531011,1.77215189873418,0.73529411764705799,3.7129734581692588,3.9927404718693249,6.4505204737198483,5.4263643192862787,4.6800131276665704,"","","","","","","",""]
["GTM",2003,"GTM_2003_WHS",21,"Water ladder","Surface water","w_sur",11.72839506172839,5.5785123966942152,1.7261219792865361,0.72538860103626945,0,0.75187969924812026,0.25125628140703521,0,0,0,14.337568058076229,10.3448275862069,5.2823315118397094,2.014652014652015,1.8181818181818179,"","","","","","","",""]
["GTM",2003,"GTM_2003_WHS",29,"Piped water","Yes","w_pip",73.743589743589737,72.717948717948715,66.016427104722794,81.799591002044991,94.753086419753089,89.775561097256855,94.789081885856078,96.277915632754343,96.455696202531655,98.774509803921575,68.953068592057761,74.410163339382933,68.592057761732846,64.791288566243196,62.996389891696737,"","","","","","","",""]
["GTM",2003,"GTM_2003_WHS",30,"Piped water","No","",26.256410256410259,27.282051282051281,33.983572895277213,18.200408997955009,5.2469135802469129,10.22443890274314,5.2109181141439196,3.7220843672456572,3.5443037974683551,1.225490196078431,31.046931407942239,25.58983666061706,31.40794223826715,35.208711433756797,37.003610108303249,"","","","","","","",""]
["GTM",2003,"GTM_2003_WHS",31,"Piped water on premises","Yes","w_pop",67.282051282051285,69.128205128205138,63.552361396303901,80.572597137014313,94.135802469135797,81.795511221945134,91.811414392059561,95.285359801488838,95.949367088607602,98.284313725490193,63.718411552346574,69.147005444646098,65.70397111913357,62.976406533575307,62.274368231046928,"","","","","","","",""]
["GTM",2003,"GTM_2003_WHS",32,"Piped water on premises","No","",32.717948717948723,30.871794871794869,36.447638603696099,19.42740286298568,5.8641975308641969,18.204488778054859,8.1885856079404462,4.7146401985111659,4.0506329113924053,1.715686274509804,36.281588447653426,30.852994555353899,34.296028880866423,37.023593466424678,37.725631768953058,"","","","","","","",""]
["GTM",2003,"GTM_2003_WHS",41,"Water point at more than 30 minutes","Yes","",8.1168831168831161,4.3321299638989164,5.0847457627118651,5.8823529411764701,2.5641025641025639,5.9701492537313428,16.666666666666661,0,12.5,0,6.666666666666667,9.316770186335404,3.4285714285714288,4.7872340425531918,4.0201005025125616,"","","","","","","",""]
["GTM",2003,"GTM_2003_WHS",42,"Water point at more than 30 minutes","No","w_30min",91.883116883116884,92.883116883116898,93.883116883116898,94.883116883116898,95.883116883116898,96.883116883116898,97.883116883116898,98.883116883116898,99.883116883116898,100.883116883117,101.883116883117,102.883116883117,103.883116883117,104.883116883117,105.883116883117,"","","","","","","",""]
["GTM",2003,"GTM_2003_WHS",58,"main source of drinking water","Piped water through house connection or yard","",67.489711934156389,69.628099173553721,71.231300345224398,81.658031088082907,95.21331945889699,82.205513784461147,92.964824120603012,96.725440806045341,97.680412371134011,98.768472906403943,64.065335753176043,69.147005444646098,66.302367941712205,63.553113553113548,62.727272727272727,"","","","","","","",""]
["GTM",2003,"GTM_2003_WHS",59,"main source of drinking water","Public standpipe","",6.481481481481481,3.615702479338843,2.7617951668584579,1.2435233160621759,0.62434963579604574,8.0200501253132828,3.0150753768844218,1.0075566750629721,0.51546391752577314,0.49261083743842371,5.2631578947368416,5.2631578947368416,2.9143897996357011,1.8315018315018321,0.72727272727272729,"","","","","","","",""]
["GTM",2003,"GTM_2003_WHS",60,"main source of drinking water","Protected tube well or bore hole","",6.2757201646090541,11.05371900826446,16.800920598388949,11.29533678756477,2.289281997918835,6.5162907268170418,1.7587939698492461,1.0075566750629721,1.5463917525773201,0.2463054187192118,5.9891107078039916,6.7150635208711433,13.66120218579235,22.710622710622712,24,"","","","","","","",""]
["GTM",2003,"GTM_2003_WHS",61,"main source of drinking water","Protected dug well or protected spring","",4.423868312757202,4.5454545454545459,3.79746835443038,2.176165803108808,1.3527575442247659,1.0025062656641599,0.75376884422110546,0,0.25773195876288663,0.2463054187192118,5.9891107078039916,3.992740471869328,5.4644808743169397,4.5787545787545776,6.3636363636363633,"","","","","","","",""]
["GTM",2003,"GTM_2003_WHS",62,"main source of drinking water","Unprotected dug well or spring","",2.6748971193415638,4.9586776859504136,2.991944764096663,2.176165803108808,0.41623309053069718,0.75187969924812026,0.25125628140703521,0.50377833753148615,0,0.2463054187192118,3.266787658802178,3.992740471869328,5.6466302367941719,4.5787545787545776,4,"","","","","","","",""]
["GTM",2003,"GTM_2003_WHS",63,"main source of drinking water","Rainwater (into tank or cistern )","",0.72016460905349799,0.30991735537190079,0.34522439585730719,0.1036269430051813,0,0.25062656641604009,0,0,0,0,1.0889292196007261,0.36297640653357532,0.36429872495446258,0.36630036630036628,0.1818181818181818,"","","","","","","",""]
["GTM",2003,"GTM_2003_WHS",64,"main source of drinking water","Water taken directly from pond-water or stream","",11.72839506172839,5.5785123966942152,1.7261219792865361,0.72538860103626945,0,0.75187969924812026,0.25125628140703521,0,0,0,14.337568058076229,10.3448275862069,5.2823315118397094,2.014652014652015,1.8181818181818179,"","","","","","","",""]
["GTM",2003,"GTM_2003_WHS",65,"main source of drinking water","Tanker-truck, vendor","",0.20576131687242799,0.30991735537190079,0.34522439585730719,0.62176165803108807,0.1040582726326743,0.50125313283208017,1.0050251256281411,0.75566750629722923,0,0,0,0.18148820326678769,0.36429872495446258,0.36630036630036628,0.1818181818181818,"","","","","","","",""]
["GTM",2003,"GTM_2003_WHS",122,"Sanitation","Improved","s_imp",39.733059548254623,49.535603715170282,67.031070195627166,88.107549120992772,98.229166666666657,71.072319201995015,92.085427135678387,98.375,99.348958333333329,99.754299754299765,35.714285714285722,41.470054446460978,45.894160583941598,56.959706959706963,76.860254083484591,"","","","","","","","",null,null,null,null,null,null,null,null,694,789,792,949,957,366,394,400,384,406,367,413,444,480,527]
["GTM",2003,"GTM_2003_WHS",123,"Sanitation","Not Improved","",60.266940451745377,50.464396284829718,32.968929804372827,11.89245087900723,1.770833333333343,28.927680798004989,7.9145728643216131,1.625,0.6510416666666714,0.2457002457002346,64.285714285714278,58.529945553539022,54.105839416058402,43.040293040293037,23.139745916515409,"","","","","","","","",null,null,null,null,null,null,null,null,281,186,182,29,15,35,9,3,11,2,187,138,110,71,27]
["GTM",2003,"GTM_2003_WHS",124,"Sanitation ladder","Basic","s_bas",37.189329743628853,45.817573413223307,60.937336541479247,79.500404091315957,94.498945147679308,64.022250005014271,81.46018554310011,89.636104060913709,95.220170454545439,96.997271369130672,34.087016101404593,38.905808009472977,42.435741150935819,51.577687404459063,70.981018230083706,"","","","","","","","",null,null,null,null,null,null,null,null,644,715,710,849,906,326,342,359,365,386,348,380,402,433,483]
["GTM",2003,"GTM_2003_WHS",125,"Sanitation ladder","Limited","s_lim",2.5437298046257761,3.7180303019469609,6.0937336541479246,8.6071450296768166,3.7302215189873422,7.0500691969807399,10.625241592578281,8.7388959390862961,4.128787878787878,2.7570283851690891,1.6272696128811239,2.5642464369879918,3.458419433005782,5.3820195552479024,5.879235853400874,"","","","","","","","",null,null,null,null,null,null,null,null,42,62,67,90,34,33,44,35,14,11,14,27,36,43,38]
["GTM",2003,"GTM_2003_WHS",126,"Sanitation ladder","Unimproved","s_unimp",37.577002053388092,36.222910216718269,27.675489067894119,10.548086866597711,1.6666666666666861,24.18952618453865,7.4120603015075366,1.625,0.65104166666668561,0.2457002457002346,35.714285714285722,40.018148820326687,39.324817518248182,35.714285714285722,20.054446460980031,"","","","","","","","",null,null,null,null,null,null,null,null,60,48,136,16,14,16,7,3,11,2,29,36,29,31,10]
["GTM",2003,"GTM_2003_WHS",127,"Sanitation ladder","Open defecation","s_od",22.689938398357292,14.24148606811146,5.2934407364787113,1.344364012409514,0.1041666666666667,4.7381546134663344,0.50251256281407031,0,0,0,28.571428571428569,18.511796733212339,14.78102189781022,7.3260073260073266,3.0852994555353899,"","","","","","","","",null,null,null,null,null,null,null,null,221,138,46,13,1,19,2,0,0,0,158,102,81,40,17]
["GTM",2003,"GTM_2003_WHS",128,"Shared among Improved Sanitation","Yes","s_shared",6.4020486555697822,7.5057736720554269,9.0909090909090917,9.7689075630252109,3.79746835443038,9.9195710455764079,11.53846153846154,8.8832487309644677,4.1558441558441546,2.7638190954773871,4.5563549160671464,6.1833688699360341,7.5356415478615073,9.4488188976377945,7.6492537313432836,"","","","","","","",""]
["GTM",2003,"GTM_2003_WHS",129,"Shared among Improved Sanitation","No","",93.597951344430214,92.494226327944574,90.909090909090907,90.231092436974791,96.202531645569621,90.080428954423596,88.461538461538453,91.116751269035532,95.844155844155836,97.236180904522612,95.44364508393285,93.816631130063968,92.464358452138498,90.551181102362193,92.350746268656707,"","","","","","","",""]
["GTM",2003,"GTM_2003_WHS",135,"Sanitation type","Sewer connection","s_sew",2.666666666666667,9.4358974358974361,25.051334702258721,58.793456032719838,90.226337448559661,43.640897755610972,78.660049627791565,95.037220843672458,93.670886075949369,99.019607843137265,0.54151624548736454,0.90744101633393837,2.8880866425992782,5.9891107078039916,19.49458483754513,"","","","","","","",""]
["GTM",2003,"GTM_2003_WHS",136,"Sanitation type","Septic tank connection","s_sep",0.61538461538461542,3.7948717948717952,8.6242299794661186,15.439672801635989,4.8353909465020566,2.244389027431422,2.481389578163772,0.74441687344913154,1.2658227848101271,0.49019607843137247,0.18050541516245491,2.5408348457350272,3.790613718411552,13.06715063520871,33.935018050541522,"","","","","","","",""]
["GTM",2003,"GTM_2003_WHS",137,"Sanitation type","Improved latrines","s_lat",67.897435897435898,67.692307692307693,47.638603696098563,22.801635991820039,3.3950617283950622,45.386533665835408,16.625310173697269,3.4739454094292812,2.278481012658228,0,65.523465703971112,71.506352087114337,73.46570397111914,68.058076225045369,41.696750902527072,"","","","","","","",""]
["GTM",2003,"GTM_2003_WHS",138,"Sanitation type","Unimproved facilities","",6.1538461538461542,4.9230769230769234,13.96303901437371,1.6359918200409,1.440329218106996,3.9900249376558601,1.7369727047146399,0.74441687344913154,2.7848101265822778,0.49019607843137247,5.2346570397111911,6.5335753176043552,5.2346570397111911,5.6261343012704179,1.8050541516245491,"","","","","","","",""]
["GTM",2003,"GTM_2003_WHS",139,"Sanitation type","Open defecation","",22.666666666666661,14.15384615384615,4.7227926078028748,1.3292433537832311,0.102880658436214,4.7381546134663344,0.49627791563275442,0,0,0,28.51985559566787,18.511796733212339,14.620938628158839,7.2595281306715069,3.0685920577617329,"","","","","","","",""]
["GTM",2003,"GTM_2003_WHS",148,"Shared among improved sanitation facilities","Yes","",5.1282051282051277,6.666666666666667,7.5975359342915816,9.5092024539877311,3.7037037037037028,9.2269326683291766,11.16625310173697,8.6848635235732008,4.0506329113924053,2.6960784313725492,3.4296028880866429,5.2631578947368416,6.6787003610108311,8.7114337568058069,7.4007220216606493,"","","","","","","",""]
["GTM",2003,"GTM_2003_WHS",149,"Shared among improved sanitation facilities","No","",74.974358974358978,82.15384615384616,75.975359342915823,87.832310838445807,93.827160493827151,83.790523690773071,85.607940446650119,89.081885856079396,93.417721518987335,94.85294117647058,71.841155234657037,79.854809437386564,81.949458483754512,83.484573502722327,89.350180505415167,"","","","","","","",""]
["GTM",2003,"GTM_2003_WHS",150,"Shared among improved sanitation facilities","DK/missing","",19.897435897435901,11.179487179487181,16.42710472279261,2.6584867075664622,2.4691358024691361,6.982543640897755,3.225806451612903,2.2332506203473939,2.5316455696202529,2.4509803921568629,24.729241877256321,14.88203266787659,11.371841155234661,7.8039927404718696,3.2490974729241868,"","","","","","","",""]
["GTM",2003,"GTM_2003_WHS",151,"Shared among all sanitation facilities","Yes","",94.34850863422291,92.034139402560456,90.748898678414093,90.069284064665126,96.141479099678463,89.225589225589232,88.365650969529085,90.979381443298962,95.800524934383205,97.208121827411162,95.415472779369622,95.026178010471213,92.191435768261968,90.384615384615387,92.307692307692307,"","","","","","","",""]
["GTM",2003,"GTM_2003_WHS",152,"Shared among all sanitation facilities","No","",5.6514913657770807,7.9658605974395442,9.251101321585903,9.9307159353348737,3.8585209003215439,10.77441077441077,11.63434903047091,9.0206185567010309,4.1994750656167978,2.7918781725888331,4.5845272206303722,4.9738219895287958,7.8085642317380346,9.6153846153846168,7.6923076923076934,"","","","","","","",""]
["GTM",2003,"GTM_2003_WHS",153,"What type of toilet facilities","Flush to piped sewage system","",2.669404517453799,9.4943240454076374,28.07825086306099,59.462254395036197,91.354166666666671,43.640897755610972,79.64824120603015,95.75,96.354166666666657,99.262899262899268,0.54249547920433994,0.90744101633393837,2.9197080291970798,6.0439560439560438,19.600725952813072,"","","","","","","","",null,null,null,null,null,null,null,null,26,92,244,575,877,175,317,383,370,404,3,5,16,33,108]
["GTM",2003,"GTM_2003_WHS",154,"What type of toilet facilities","Flush to septic tank","",0.61601642710472282,3.818369453044375,9.6662830840046023,15.6153050672182,4.895833333333333,2.244389027431422,2.512562814070352,0.75,1.302083333333333,0.49140049140049141,0.18083182640144671,2.5408348457350272,3.832116788321168,13.18681318681319,34.119782214156082,"","","","","","","","",null,null,null,null,null,null,null,null,6,37,84,151,47,9,10,3,5,2,1,14,21,72,188]
["GTM",2003,"GTM_2003_WHS",155,"What type of toilet facilities","Pour flush latrine","",0.51334702258726894,2.1671826625386998,3.5673187571921749,2.792140641158221,0.52083333333333326,2.992518703241895,3.0150753768844218,0.25,1.041666666666667,0,0.36166365280289331,0.54446460980036293,1.642335766423358,4.5787545787545776,3.8112522686025412,"","","","","","","","",null,null,null,null,null,null,null,null,5,21,31,27,5,12,12,1,4,0,2,3,9,25,21]
["GTM",2003,"GTM_2003_WHS",156,"What type of toilet facilities","Covered dry latrine (with privacy)","",67.453798767967143,65.944272445820431,49.82738780207135,20.268872802481901,2.916666666666667,42.394014962593523,13.819095477386931,3.25,1.302083333333333,0,65.280289330922244,70.961887477313979,72.627737226277361,64.102564102564102,38.112522686025407,"","","","","","","","",null,null,null,null,null,null,null,null,657,639,433,196,28,170,55,13,5,0,361,391,398,350,210]
["GTM",2003,"GTM_2003_WHS",157,"What type of toilet facilities","Uncovered dry latrine (without privacy)","",4.4147843942505132,2.1671826625386998,1.611047180667434,0.20682523267838679,0,1.99501246882793,0,0,0,0,3.9783001808318259,3.992740471869328,2.3722627737226269,2.197802197802198,0.54446460980036293,"","","","","","","","",null,null,null,null,null,null,null,null,43,21,14,2,0,8,0,0,0,0,22,22,13,12,3]
["GTM",2003,"GTM_2003_WHS",158,"What type of toilet facilities","Bucket latrine (where fresh excreta are manually removed)","",1.540041067761807,1.9607843137254899,1.4959723820483311,0.20682523267838679,0.1041666666666667,1.745635910224439,0,0,0,0,0.9041591320072333,2.5408348457350272,1.642335766423358,2.197802197802198,0.54446460980036293,"","","","","","","","",null,null,null,null,null,null,null,null,15,19,13,2,1,7,0,0,0,0,5,14,9,12,3]
["GTM",2003,"GTM_2003_WHS",159,"What type of toilet facilities","No facilities (open defecation)","",22.689938398357292,14.24148606811146,5.2934407364787113,1.344364012409514,0.1041666666666667,4.7381546134663344,0.50251256281407031,0,0,0,28.571428571428569,18.511796733212339,14.78102189781022,7.3260073260073266,3.0852994555353899,"","","","","","","","",null,null,null,null,null,null,null,null,221,138,46,13,1,19,2,0,0,0,158,102,81,40,17]
["GTM",2003,"GTM_2003_WHS",160,"What type of toilet facilities","Other","",0.10266940451745379,0.20639834881320951,0.46029919447640971,0.10341261633919339,0.1041666666666667,0.24937655860349131,0.50251256281407031,0,0,0.24570024570024571,0.18083182640144671,0,0.18248175182481749,0.36630036630036628,0.18148820326678769,"","","","","","","","",null,null,null,null,null,null,null,null,1,2,4,1,1,1,2,0,0,1,1,0,1,2,1]
["GTM",2011,"GTM_2011_ENCOVI",16,"Water","Improved","w_imp",72.200000000000003,85.299999999999997,90.700000000000003,93.099999999999994,98,86,93.900000000000006,95.299999999999997,98.099999999999994,99.700000000000003,68,81.700000000000003,85.5,90.099999999999994,92.900000000000006,"Central","Metropolitana","Nor-Oriente","Nor-Occidente","Norte","Peten","Sur-Occidente","Sur-Oriente",94.299999999999997,96.5,86.900000000000006,81.200000000000003,75.700000000000003,78.400000000000006,90.799999999999997,83.400000000000006]
["GTM",2011,"GTM_2011_ENCOVI",17,"Water","Not Improved","",27.800000000000001,14.699999999999999,9.3000000000000007,6.9000000000000004,2,14,6.0999999999999996,4.7000000000000002,1.8999999999999999,0.29999999999999999,32,18.300000000000001,14.5,9.9000000000000004,7.0999999999999996,"Central","Metropolitana","Nor-Oriente","Nor-Occidente","Norte","Peten","Sur-Occidente","Sur-Oriente",5.7000000000000002,3.5,13.1,18.800000000000001,24.300000000000001,21.600000000000001,9.1999999999999993,16.600000000000001]
["GTM",2011,"GTM_2011_ENCOVI",18,"Water ladder","Basic","w_bas",66,82.5,88.5,92.099999999999994,97.799999999999997,85.099999999999994,93,95.099999999999994,98,99.700000000000003,60.600000000000001,77.200000000000003,82.200000000000003,87.200000000000003,91.5,"Central","Metropolitana","Nor-Oriente","Nor-Occidente","Norte","Peten","Sur-Occidente","Sur-Oriente",93,95.700000000000003,84.5,77.700000000000003,72.299999999999997,77.200000000000003,88.5,81.200000000000003]
["GTM",2011,"GTM_2011_ENCOVI",19,"Water ladder","Limited","w_lim",2.7999999999999998,1.3999999999999999,1.1000000000000001,0.20000000000000001,0.10000000000000001,0.29999999999999999,0.59999999999999998,0,0,0,3.2000000000000002,2.2999999999999998,1.6000000000000001,1.1000000000000001,0.5,"Central","Metropolitana","Nor-Oriente","Nor-Occidente","Norte","Peten","Sur-Occidente","Sur-Oriente",0.5,0.59999999999999998,1.5,2.7999999999999998,0.59999999999999998,0.40000000000000002,0.69999999999999996,1.7]
["GTM",2011,"GTM_2011_ENCOVI",20,"Water ladder","Unimproved","w_unimp",8.1999999999999993,5.9000000000000004,3.6000000000000001,3.1000000000000001,1.1000000000000001,12,4.4000000000000004,2.8999999999999999,1.3999999999999999,0.29999999999999999,7.2000000000000002,5.2000000000000002,4.0999999999999996,3.1000000000000001,2.2999999999999998,"Central","Metropolitana","Nor-Oriente","Nor-Occidente","Norte","Peten","Sur-Occidente","Sur-Oriente",5.2000000000000002,3,4,4,6.2000000000000002,5.7000000000000002,3.7000000000000002,4.4000000000000004]
["GTM",2011,"GTM_2011_ENCOVI",21,"Water ladder","Surface water","w_sur",23.100000000000001,10.199999999999999,6.7999999999999998,4.5999999999999996,1,2.5,2,2,0.59999999999999998,0,28.899999999999999,15.199999999999999,12.1,8.5999999999999996,5.7999999999999998,"Central","Metropolitana","Nor-Oriente","Nor-Occidente","Norte","Peten","Sur-Occidente","Sur-Oriente",1.3,0.59999999999999998,9.9000000000000004,15.5,20.899999999999999,16.800000000000001,7,12.699999999999999]
["GTM",2011,"GTM_2011_ENCOVI",22,"Improved water point at more than 30 minutes","Yes","",4,1.7,1.2,0.20000000000000001,0.10000000000000001,0.29999999999999999,0.69999999999999996,0,0,0,5,2.8999999999999999,1.8999999999999999,1.2,0.5,"Central","Metropolitana","Nor-Oriente","Nor-Occidente","Norte","Peten","Sur-Occidente","Sur-Oriente",0.5,0.69999999999999996,1.8,3.3999999999999999,0.80000000000000004,0.5,0.80000000000000004,2.1000000000000001]
["GTM",2011,"GTM_2011_ENCOVI",23,"Improved water point at more than 30 minutes","No","",96,98.299999999999997,98.799999999999997,99.799999999999997,99.900000000000006,99.700000000000003,99.299999999999997,100,100,100,95,97.099999999999994,98.099999999999994,98.799999999999997,99.5,"Central","Metropolitana","Nor-Oriente","Nor-Occidente","Norte","Peten","Sur-Occidente","Sur-Oriente",99.5,99.299999999999997,98.200000000000003,96.599999999999994,99.200000000000003,99.5,99.200000000000003,97.900000000000006]
["GTM",2011,"GTM_2011_ENCOVI",29,"Piped water","Yes","w_pip",49.100000000000001,69.799999999999997,74.700000000000003,80.299999999999997,93.700000000000003,78.799999999999997,86.700000000000003,89.700000000000003,93.900000000000006,97.700000000000003,42.5,60.600000000000001,68.099999999999994,68.5,78.599999999999994,"Central","Metropolitana","Nor-Oriente","Nor-Occidente","Norte","Peten","Sur-Occidente","Sur-Oriente",80.099999999999994,88.200000000000003,76,70.299999999999997,56.399999999999999,67,70.799999999999997,73.599999999999994]
["GTM",2011,"GTM_2011_ENCOVI",30,"Piped water","No","",50.899999999999999,30.199999999999999,25.300000000000001,19.699999999999999,6.2999999999999998,21.199999999999999,13.300000000000001,10.300000000000001,6.0999999999999996,2.2999999999999998,57.5,39.399999999999999,31.899999999999999,31.5,21.399999999999999,"Central","Metropolitana","Nor-Oriente","Nor-Occidente","Norte","Peten","Sur-Occidente","Sur-Oriente",19.899999999999999,11.800000000000001,24,29.699999999999999,43.600000000000001,33,29.199999999999999,26.399999999999999]
["GTM",2011,"GTM_2011_ENCOVI",31,"Piped water on premises","Yes","w_pop",46.5,67,72,78.799999999999997,93.5,76.200000000000003,84.599999999999994,89.299999999999997,93.900000000000006,97.400000000000006,40.100000000000001,58,64.400000000000006,66,76.900000000000006,"Central","Metropolitana","Nor-Oriente","Nor-Occidente","Norte","Peten","Sur-Occidente","Sur-Oriente",76.799999999999997,87.799999999999997,73.299999999999997,66.799999999999997,55.100000000000001,67,69.799999999999997,71.400000000000006]
["GTM",2011,"GTM_2011_ENCOVI",32,"Piped water on premises","No","",53.5,33,28,21.199999999999999,6.5,23.800000000000001,15.4,10.699999999999999,6.0999999999999996,2.6000000000000001,59.899999999999999,42,35.600000000000001,34,23.100000000000001,"Central","Metropolitana","Nor-Oriente","Nor-Occidente","Norte","Peten","Sur-Occidente","Sur-Oriente",23.199999999999999,12.199999999999999,26.699999999999999,33.200000000000003,44.899999999999999,33,30.199999999999999,28.600000000000001]
["GTM",2011,"GTM_2011_ENCOVI",35,"Water source on premises","Yes","",48.399999999999999,67.900000000000006,73,79.400000000000006,93.700000000000003,77.099999999999994,84.799999999999997,89.5,93.900000000000006,97.599999999999994,42.5,59.200000000000003,65.700000000000003,66.799999999999997,78,"Central","Metropolitana","Nor-Oriente","Nor-Occidente","Norte","Peten","Sur-Occidente","Sur-Oriente",77.299999999999997,88.400000000000006,74.200000000000003,68.099999999999994,57.799999999999997,67.5,70.5,72.700000000000003]
["GTM",2011,"GTM_2011_ENCOVI",36,"Water source on premises","No","",51.600000000000001,32.100000000000001,27,20.600000000000001,6.2999999999999998,22.899999999999999,15.199999999999999,10.5,6.0999999999999996,2.3999999999999999,57.5,40.799999999999997,34.299999999999997,33.200000000000003,22,"Central","Metropolitana","Nor-Oriente","Nor-Occidente","Norte","Peten","Sur-Occidente","Sur-Oriente",22.699999999999999,11.6,25.800000000000001,31.899999999999999,42.200000000000003,32.5,29.5,27.300000000000001]
["GTM",2011,"GTM_2011_ENCOVI",37,"Improved Water source on premises","Yes","w_premises",64.799999999999997,78.700000000000003,79.799999999999997,84.900000000000006,95.400000000000006,88.799999999999997,90.200000000000003,93.900000000000006,95.799999999999997,97.799999999999997,59.399999999999999,71.099999999999994,75.900000000000006,73.599999999999994,83,"Central","Metropolitana","Nor-Oriente","Nor-Occidente","Norte","Peten","Sur-Occidente","Sur-Oriente",81.900000000000006,91.400000000000006,84.700000000000003,82.299999999999997,73.099999999999994,85.400000000000006,77,85.900000000000006]
["GTM",2011,"GTM_2011_ENCOVI",38,"Improved Water source on premises","No","",35.200000000000003,21.300000000000001,20.199999999999999,15.1,4.5999999999999996,11.199999999999999,9.8000000000000007,6.0999999999999996,4.2000000000000002,2.2000000000000002,40.600000000000001,28.899999999999999,24.100000000000001,26.399999999999999,17,"Central","Metropolitana","Nor-Oriente","Nor-Occidente","Norte","Peten","Sur-Occidente","Sur-Oriente",18.100000000000001,8.5999999999999996,15.300000000000001,17.699999999999999,26.899999999999999,14.6,23,14.1]
["GTM",2011,"GTM_2011_ENCOVI",41,"Water point at more than 30 minutes","Yes","",9.8000000000000007,3.6000000000000001,2,0.80000000000000004,0.29999999999999999,2.1000000000000001,0.80000000000000004,0.29999999999999999,0,0,10.9,7.0999999999999996,3.2999999999999998,2.5,1.3,"Central","Metropolitana","Nor-Oriente","Nor-Occidente","Norte","Peten","Sur-Occidente","Sur-Oriente",0.69999999999999996,0.69999999999999996,4.2999999999999998,6.2999999999999998,5,5.2999999999999998,1.6000000000000001,5.5999999999999996]
["GTM",2011,"GTM_2011_ENCOVI",42,"Water point at more than 30 minutes","No","w_30min",90.200000000000003,96.400000000000006,98,99.200000000000003,99.700000000000003,97.900000000000006,99.200000000000003,99.700000000000003,100,100,89.099999999999994,92.900000000000006,96.700000000000003,97.5,98.700000000000003,"Central","Metropolitana","Nor-Oriente","Nor-Occidente","Norte","Peten","Sur-Occidente","Sur-Oriente",99.299999999999997,99.299999999999997,95.700000000000003,93.700000000000003,95,94.700000000000003,98.400000000000006,94.400000000000006]
["GTM",2011,"GTM_2011_ENCOVI",58,"¿De dónde obtienen principalmente el agua para consumo de los miembros del hogar?","Tuberia dentro de la vivienda","",23.5,43.899999999999999,51,61.100000000000001,86.400000000000006,54.100000000000001,70.400000000000006,74.900000000000006,84.900000000000006,93.900000000000006,18,33.899999999999999,40.700000000000003,42.5,60.600000000000001,"Central","Metropolitana","Nor-Oriente","Nor-Occidente","Norte","Peten","Sur-Occidente","Sur-Oriente",61.5,86.099999999999994,49.100000000000001,52.899999999999999,35.200000000000003,49.100000000000001,53.5,41.399999999999999]
["GTM",2011,"GTM_2011_ENCOVI",59,"¿De dónde obtienen principalmente el agua para consumo de los miembros del hogar?","Tuberia fuera de la vivienda, pero dentro del terreno","",23,23.100000000000001,21,17.800000000000001,7,22.100000000000001,14.300000000000001,14.4,9,3.6000000000000001,22.100000000000001,24.100000000000001,23.600000000000001,23.5,16.300000000000001,"Central","Metropolitana","Nor-Oriente","Nor-Occidente","Norte","Peten","Sur-Occidente","Sur-Oriente",15.300000000000001,1.7,24.199999999999999,14,19.899999999999999,17.899999999999999,16.300000000000001,30]
["GTM",2011,"GTM_2011_ENCOVI",60,"¿De dónde obtienen principalmente el agua para consumo de los miembros del hogar?","Chorro Público","",2.6000000000000001,2.8999999999999999,2.7999999999999998,1.5,0.20000000000000001,2.6000000000000001,2.1000000000000001,0.40000000000000002,0,0.20000000000000001,2.3999999999999999,2.5,3.7000000000000002,2.6000000000000001,1.7,"Central","Metropolitana","Nor-Oriente","Nor-Occidente","Norte","Peten","Sur-Occidente","Sur-Oriente",3.2000000000000002,0.40000000000000002,2.7000000000000002,3.5,1.3,0,1,2.2000000000000002]
["GTM",2011,"GTM_2011_ENCOVI",61,"¿De dónde obtienen principalmente el agua para consumo de los miembros del hogar?","Pozo perforado público o privado","",19.699999999999999,14.1,14.9,12.199999999999999,3.6000000000000001,6.2000000000000002,6.5,5.4000000000000004,3.6000000000000001,1.6000000000000001,21.600000000000001,19,15.800000000000001,20.600000000000001,13.199999999999999,"Central","Metropolitana","Nor-Oriente","Nor-Occidente","Norte","Peten","Sur-Occidente","Sur-Oriente",13.800000000000001,3.7999999999999998,9.6999999999999993,10,9.5,11.300000000000001,19.899999999999999,9.8000000000000007]
["GTM",2011,"GTM_2011_ENCOVI",62,"¿De dónde obtienen principalmente el agua para consumo de los miembros del hogar?","Río, lago, manantial","",20.5,9.4000000000000004,6.0999999999999996,4.2000000000000002,1,2.3999999999999999,1.8999999999999999,2,0.59999999999999998,0,25.600000000000001,13.699999999999999,10.9,7.2000000000000002,5.0999999999999996,"Central","Metropolitana","Nor-Oriente","Nor-Occidente","Norte","Peten","Sur-Occidente","Sur-Oriente",1.2,0.59999999999999998,9.3000000000000007,14.9,18.800000000000001,16.100000000000001,6,12.300000000000001]
["GTM",2011,"GTM_2011_ENCOVI",63,"¿De dónde obtienen principalmente el agua para consumo de los miembros del hogar?","Camión cisterna","",1,0.20000000000000001,0.40000000000000002,0.5,0.59999999999999998,0.90000000000000002,0.5,0.20000000000000001,0.59999999999999998,0.29999999999999999,1,0.10000000000000001,0.29999999999999999,0.5,0.90000000000000002,"Central","Metropolitana","Nor-Oriente","Nor-Occidente","Norte","Peten","Sur-Occidente","Sur-Oriente",0.40000000000000002,4.4000000000000004,0.80000000000000004,0,0,0,0,0]
["GTM",2011,"GTM_2011_ENCOVI",64,"¿De dónde obtienen principalmente el agua para consumo de los miembros del hogar?","Agua de Lluvia","",2.2999999999999998,1.2,0.69999999999999996,0.20000000000000001,0.10000000000000001,0.10000000000000001,0.20000000000000001,0.10000000000000001,0,0.20000000000000001,2.8999999999999999,2,1.3999999999999999,0.5,0.20000000000000001,"Central","Metropolitana","Nor-Oriente","Nor-Occidente","Norte","Peten","Sur-Occidente","Sur-Oriente",0,0.10000000000000001,0.40000000000000002,0.90000000000000002,9.6999999999999993,0.20000000000000001,0.10000000000000001,0]
["GTM",2011,"GTM_2011_ENCOVI",65,"¿De dónde obtienen principalmente el agua para consumo de los miembros del hogar?","Otro, Cuál","",7.2999999999999998,5.4000000000000004,3.2000000000000002,2.7000000000000002,1,11.6,4.2000000000000002,2.7000000000000002,1.3,0.29999999999999999,6.4000000000000004,4.7000000000000002,3.6000000000000001,2.6000000000000001,2,"Central","Metropolitana","Nor-Oriente","Nor-Occidente","Norte","Peten","Sur-Occidente","Sur-Oriente",4.5999999999999996,2.8999999999999999,3.7999999999999998,3.8999999999999999,5.5999999999999996,5.4000000000000004,3.2000000000000002,4.2999999999999998]
["GTM",2011,"GTM_2011_ENCOVI",122,"Sanitation","Improved","s_imp",44.258335930196317,52.290254732414112,67.855759547602446,81.158397993573161,96.123577995948253,69.688644688644686,83.844747002641739,91.584357992340244,96.140564696323381,99.341038118410395,39.81024667931689,42.590238942552112,52.61127971674253,63.948362720403018,80.754143995950912,"Central","Metropolitana","Nor-Oriente","Nor-Occidente","Norte","Peten","Sur-Occidente","Sur-Oriente",84.294774992449419,91.61057692307692,68.057596238612987,56.261075014766689,57.457059069962291,52.233009708737868,65.163369882638165,60.759987515605488]
["GTM",2011,"GTM_2011_ENCOVI",123,"Sanitation","Not Improved","",55.741664069803683,47.709745267585888,32.144240452397547,18.841602006426839,3.8764220040517379,30.31135531135531,16.155252997358261,8.4156420076597449,3.8594353036766198,0.65896188158961888,60.18975332068311,57.409761057447888,47.388720283257463,36.051637279596967,19.245856004049099,"Central","Metropolitana","Nor-Oriente","Nor-Occidente","Norte","Peten","Sur-Occidente","Sur-Oriente",15.70522500755059,8.3894230769230766,31.942403761387009,43.738924985233311,42.542940930037702,47.76699029126214,34.836630117361842,39.240012484394512]
["GTM",2011,"GTM_2011_ENCOVI",124,"Sanitation ladder","Basic","s_bas",37.489848503358459,44.895429312561348,58.60142826941874,71.27208015984985,89.077278864140212,54.095198234849107,67.953972009622362,78.335365987327137,85.882683433414428,95.345603312916751,34.541039525662967,37.21627626466767,46.474202256789233,56.455682145146717,74.722364110121205,"Central","Metropolitana","Nor-Oriente","Nor-Occidente","Norte","Peten","Sur-Occidente","Sur-Oriente",70.216149439962862,76.787940997566906,60.352628502741553,52.335883734666687,53.499457592763257,46.844128591813323,56.631309571114627,54.404492821473163]
["GTM",2011,"GTM_2011_ENCOVI",125,"Sanitation ladder","Limited","s_lim",6.7684874268378694,7.3948254198527623,9.2543312781837059,9.886317833723302,7.0462991318080448,15.593446453795581,15.890774993019379,13.248992005013109,10.25788126290897,3.9954348054936539,5.2692071536539258,5.3739626778844487,6.1370774599533009,7.4926805752563048,6.0317798858297111,"Central","Metropolitana","Nor-Oriente","Nor-Occidente","Norte","Peten","Sur-Occidente","Sur-Oriente",14.07862555248656,14.82263592551001,7.7049677358714277,3.9251912801000008,3.9576014771990402,5.3888811169245407,8.5320603115235301,6.355494694132334]
["GTM",2011,"GTM_2011_ENCOVI",126,"Sanitation ladder","Unimproved","s_unimp",30.437831100031161,32.449170366908163,26.001239445348201,15.878987381456239,3.502415458937207,20.177045177045191,14.041861410282451,7.4077806893771481,3.290676416818997,0.59813463098132047,32.688172043010752,34.951703101169286,33.225847243297927,30.283375314861459,16.41148930785776,"Central","Metropolitana","Nor-Oriente","Nor-Occidente","Norte","Peten","Sur-Occidente","Sur-Oriente",11.60777207288834,7.1875,16.69115486335588,31.66962000393778,34.645999162128192,31.990291262135909,28.153066284643781,17.938514357053691]
["GTM",2011,"GTM_2011_ENCOVI",127,"Sanitation ladder","Open defecation","s_od",25.303832969772511,15.26057490067773,6.143001007049345,2.9626146249706089,0.37400654511453951,10.13431013431013,2.1133915870757982,1.0078613182826039,0.56875888685760712,0.060827250608272501,27.501581277672361,22.458057956278591,14.16287303995953,5.7682619647355171,2.8343666961913199,"Central","Metropolitana","Nor-Oriente","Nor-Occidente","Norte","Peten","Sur-Occidente","Sur-Oriente",4.097452934662237,1.2019230769230771,15.25124889803115,12.069304981295531,7.8969417679095102,15.77669902912622,6.6835638327180567,21.301498127340821]
["GTM",2011,"GTM_2011_ENCOVI",135,"Sanitation type","Sewer connection","s_sew",6.7388594577750078,9.9322271558775412,23.386784413974741,40.191237557802332,77.824528595917101,34.961334961334963,57.427352164194268,69.340858697843174,80.560633759902501,94.079480940794809,2.1252371916508541,1.3599389933909509,5.3363682346990391,9.8992443324937014,27.862836897380749,"Central","Metropolitana","Nor-Oriente","Nor-Occidente","Norte","Peten","Sur-Occidente","Sur-Oriente",60.404711567502268,73.725961538461533,26.4252130473112,15.554242961212839,11.9815668202765,3.6407766990291259,27.103421676125411,19.584893882646689]
["GTM",2011,"GTM_2011_ENCOVI",136,"Sanitation type","Septic tank connection","s_sep",2.679962605172951,4.9777985510633327,9.9697885196374632,13.66878281997022,7.4333800841514721,4.4363044363044359,5.1209103840682788,8.0628905462608333,5.0375787121673774,2.1695052716950531,2.7071473750790638,3.1392984239959332,8.1183611532625175,12.70780856423174,20.637732506643051,"Central","Metropolitana","Nor-Oriente","Nor-Occidente","Norte","Peten","Sur-Occidente","Sur-Oriente",6.6445182724252501,4.0625,14.78107552159859,4.4300059066745421,5.6346878927524076,6.3592233009708732,4.1600088159127226,11.65730337078652]
["GTM",2011,"GTM_2011_ENCOVI",139,"Sanitation type","Open defecation","",25.303832969772511,15.26057490067773,6.143001007049345,2.9626146249706089,0.37400654511453951,10.13431013431013,2.1133915870757982,1.0078613182826039,0.56875888685760712,0.060827250608272501,27.501581277672361,22.458057956278591,14.16287303995953,5.7682619647355171,2.8343666961913199,"Central","Metropolitana","Nor-Oriente","Nor-Occidente","Norte","Peten","Sur-Occidente","Sur-Oriente",4.097452934662237,1.2019230769230771,15.25124889803115,12.069304981295531,7.8969417679095102,15.77669902912622,6.6835638327180567,21.301498127340821]
["GTM",2011,"GTM_2011_ENCOVI",151,"Shared among all sanitation facilities","Yes","",15.293135823075319,14.141880657675969,13.638239907537359,12.181509342392619,7.3304586436691492,22.375878485604169,18.952618453865341,14.466435421342579,10.66967028466107,4.0219378427787937,13.235806339254619,12.61782702166364,11.66494617313081,11.71676686706747,7.4693131365891876,"Central","Metropolitana","Nor-Oriente","Nor-Occidente","Norte","Peten","Sur-Occidente","Sur-Oriente",16.70165861851774,16.180048661800491,11.32124577079899,6.9767441860465116,6.8879290747897253,10.317002881844379,13.09333806230419,10.460000000000001]
["GTM",2011,"GTM_2011_ENCOVI",152,"Shared among all sanitation facilities","No","",84.706864176924682,85.858119342324031,86.361760092462646,87.81849065760737,92.669541356330853,77.624121514395824,81.047381546134673,85.533564578657419,89.330329715338934,95.978062157221217,86.764193660745377,87.382172978336371,88.335053826869199,88.283233132932537,92.530686863410821,"Central","Metropolitana","Nor-Oriente","Nor-Occidente","Norte","Peten","Sur-Occidente","Sur-Oriente",83.29834138148226,83.819951338199516,88.678754229201004,93.023255813953483,93.112070925210276,89.682997118155612,86.906661937695802,89.539999999999992]
["GTM",2011,"GTM_2011_ENCOVI",153,"¿Qué tipo de servicio sanitario tiene este hogar?","Inodoro conectado a la red de drenaje","",6.7388594577750078,9.9322271558775412,23.386784413974741,40.191237557802332,77.824528595917101,34.961334961334963,57.427352164194268,69.340858697843174,80.560633759902501,94.079480940794809,2.1252371916508541,1.3599389933909509,5.3363682346990391,9.8992443324937014,27.862836897380749,"Central","Metropolitana","Nor-Oriente","Nor-Occidente","Norte","Peten","Sur-Occidente","Sur-Oriente",60.404711567502268,73.725961538461533,26.4252130473112,15.554242961212839,11.9815668202765,3.6407766990291259,27.103421676125411,19.584893882646689,865,1275,3019,5128,9988,1718,2826,3440,3966,4640,168,107,422,786,2202,6000,3067,3597,790,572,75,4919,1255]
["GTM",2011,"GTM_2011_ENCOVI",154,"¿Qué tipo de servicio sanitario tiene este hogar?","Inodoro conectado a fosa séptica","",2.679962605172951,4.9777985510633327,9.9697885196374632,13.66878281997022,7.4333800841514721,4.4363044363044359,5.1209103840682788,8.0628905462608333,5.0375787121673774,2.1695052716950531,2.7071473750790638,3.1392984239959332,8.1183611532625175,12.70780856423174,20.637732506643051,"Central","Metropolitana","Nor-Oriente","Nor-Occidente","Norte","Peten","Sur-Occidente","Sur-Oriente",6.6445182724252501,4.0625,14.78107552159859,4.4300059066745421,5.6346878927524076,6.3592233009708732,4.1600088159127226,11.65730337078652,344,639,1287,1744,954,218,252,400,248,107,214,247,642,1009,1631,660,169,2012,225,269,131,755,747]
["GTM",2011,"GTM_2011_ENCOVI",155,"¿Qué tipo de servicio sanitario tiene este hogar?","Excusado lavable","",4.401682767217201,4.9310586585650853,8.4979471686420318,11.41939023434438,7.3632538569424959,10.113960113960109,7.2546230440967276,6.7728280588591012,7.2516758074344896,2.4939172749391729,2.289690069576217,3.1392984239959332,5.9307030854830547,11.057934508816119,15.84208528406934,"Central","Metropolitana","Nor-Oriente","Nor-Occidente","Norte","Peten","Sur-Occidente","Sur-Oriente",5.6377730796335452,6.634615384615385,10.160152806347339,4.6072061429415241,5.1948051948051948,10.242718446601939,5.7468731059562508,11.5792759051186,565,633,1097,1457,945,497,357,336,357,123,181,247,469,878,1252,560,276,1383,234,248,211,1043,742]
["GTM",2011,"GTM_2011_ENCOVI",156,"¿Qué tipo de servicio sanitario tiene este hogar?","Letrina o pozo ciego","",60.875662200062322,64.898340733816312,52.002478890696423,31.75797476291245,7.004830917874397,40.354090354090353,28.08372282056493,14.81556137875428,6.5813528336380251,1.1962692619626929,65.376344086021504,69.903406202338587,66.451694486595841,60.566750629722918,32.822978615715563,"Central","Metropolitana","Nor-Oriente","Nor-Occidente","Norte","Peten","Sur-Occidente","Sur-Oriente",23.2155441457767,14.375,33.382309726711718,63.33924000787556,69.291998324256383,63.980582524271853,56.306132569287563,35.877028714107368,7814,8331,6713,4052,899,1983,1382,735,324,59,5168,5500,5255,4809,2594,2306,598,4544,3217,3308,1318,10219,2299]
["GTM",2011,"GTM_2011_ENCOVI",157,"¿Qué tipo de servicio sanitario tiene este hogar?","No tiene","",25.303832969772511,15.26057490067773,6.143001007049345,2.9626146249706089,0.37400654511453951,10.13431013431013,2.1133915870757982,1.0078613182826039,0.56875888685760712,0.060827250608272501,27.501581277672361,22.458057956278591,14.16287303995953,5.7682619647355171,2.8343666961913199,"Central","Metropolitana","Nor-Oriente","Nor-Occidente","Norte","Peten","Sur-Occidente","Sur-Oriente",4.097452934662237,1.2019230769230771,15.25124889803115,12.069304981295531,7.8969417679095102,15.77669902912622,6.6835638327180567,21.301498127340821,3248,1959,793,378,48,498,104,50,28,3,2174,1767,1120,458,224,407,50,2076,613,377,325,1213,1365]
["GTM",2015,"GTM_2015_DHS",16,"Water","Improved","w_imp",85.900000000000006,96.200000000000003,98.599999999999994,99.400000000000006,99.900000000000006,98.599999999999994,99.700000000000003,99.900000000000006,100,99.900000000000006,81.200000000000003,91.400000000000006,97,98.200000000000003,98.900000000000006,"Central","Metropolitana","Noroccidente","Nororiente","Norte","Petén","Suroccidente","Suroriente",99.400000000000006,99.900000000000006,95.299999999999997,94.299999999999997,82.099999999999994,95.599999999999994,98.299999999999997,94.400000000000006]
["GTM",2015,"GTM_2015_DHS",17,"Water","Not Improved","",14.1,3.7999999999999998,1.3999999999999999,0.59999999999999998,0.10000000000000001,1.3999999999999999,0.29999999999999999,0.10000000000000001,0,0.10000000000000001,18.800000000000001,8.5999999999999996,3,1.8,1.1000000000000001,"Central","Metropolitana","Noroccidente","Nororiente","Norte","Petén","Suroccidente","Suroriente",0.59999999999999998,0.10000000000000001,4.7000000000000002,5.7000000000000002,17.899999999999999,4.4000000000000004,1.7,5.5999999999999996]
["GTM",2015,"GTM_2015_DHS",18,"Water ladder","Basic","w_bas",84.400000000000006,95.400000000000006,98.299999999999997,99.299999999999997,99.900000000000006,98.200000000000003,99.599999999999994,99.900000000000006,99.900000000000006,99.900000000000006,79.200000000000003,90.5,96,97.700000000000003,98.799999999999997,"Central","Metropolitana","Noroccidente","Nororiente","Norte","Petén","Suroccidente","Suroriente",99.299999999999997,99.900000000000006,94,93.599999999999994,80.799999999999997,95,98,93.400000000000006]
["GTM",2015,"GTM_2015_DHS",19,"Water ladder","Limited","w_lim",1.6000000000000001,0.80000000000000004,0.29999999999999999,0.10000000000000001,0.10000000000000001,0.29999999999999999,0.10000000000000001,0,0.10000000000000001,0,2,0.90000000000000002,1,0.5,0.10000000000000001,"Central","Metropolitana","Noroccidente","Nororiente","Norte","Petén","Suroccidente","Suroriente",0.10000000000000001,0,1.3,0.69999999999999996,1.3,0.59999999999999998,0.29999999999999999,1]
["GTM",2015,"GTM_2015_DHS",20,"Water ladder","Unimproved","w_unimp",8,2.2999999999999998,0.90000000000000002,0.20000000000000001,0.10000000000000001,1.2,0.29999999999999999,0.10000000000000001,0,0.10000000000000001,10.300000000000001,4.9000000000000004,1.8999999999999999,1.2,0.29999999999999999,"Central","Metropolitana","Noroccidente","Nororiente","Norte","Petén","Suroccidente","Suroriente",0.5,0.10000000000000001,2.2999999999999998,3.3999999999999999,9,2,1.1000000000000001,4.7000000000000002]
["GTM",2015,"GTM_2015_DHS",21,"Water ladder","Surface water","w_sur",6.0999999999999996,1.5,0.5,0.5,0,0.20000000000000001,0,0,0,0,8.5,3.7000000000000002,1.2,0.59999999999999998,0.80000000000000004,"Central","Metropolitana","Noroccidente","Nororiente","Norte","Petén","Suroccidente","Suroriente",0.10000000000000001,0,2.3999999999999999,2.2999999999999998,8.9000000000000004,2.3999999999999999,0.59999999999999998,0.90000000000000002]
["GTM",2015,"GTM_2015_DHS",22,"Improved water point at more than 30 minutes","Yes","",1.8,0.80000000000000004,0.29999999999999999,0.10000000000000001,0.10000000000000001,0.29999999999999999,0.10000000000000001,0,0.10000000000000001,0,2.5,1,1,0.5,0.10000000000000001,"Central","Metropolitana","Noroccidente","Nororiente","Norte","Petén","Suroccidente","Suroriente",0.10000000000000001,0,1.3999999999999999,0.69999999999999996,1.5,0.69999999999999996,0.29999999999999999,1.1000000000000001]
["GTM",2015,"GTM_2015_DHS",23,"Improved water point at more than 30 minutes","No","",98.200000000000003,99.200000000000003,99.700000000000003,99.900000000000006,99.900000000000006,99.700000000000003,99.900000000000006,100,99.900000000000006,100,97.5,99,99,99.5,99.900000000000006,"Central","Metropolitana","Noroccidente","Nororiente","Norte","Petén","Suroccidente","Suroriente",99.900000000000006,100,98.599999999999994,99.299999999999997,98.5,99.299999999999997,99.700000000000003,98.900000000000006]
["GTM",2015,"GTM_2015_DHS",29,"Piped water","Yes","w_pip",63.100000000000001,74,70.400000000000006,53.700000000000003,28.699999999999999,78.900000000000006,66.099999999999994,47.399999999999999,33.299999999999997,21.600000000000001,57,68.299999999999997,74,70.5,51.5,"Central","Metropolitana","Noroccidente","Nororiente","Norte","Petén","Suroccidente","Suroriente",57.899999999999999,40.399999999999999,77.400000000000006,64.400000000000006,51.299999999999997,37.200000000000003,62,64.5]
["GTM",2015,"GTM_2015_DHS",30,"Piped water","No","",36.899999999999999,26,29.600000000000001,46.299999999999997,71.299999999999997,21.100000000000001,33.899999999999999,52.600000000000001,66.700000000000003,78.400000000000006,43,31.699999999999999,26,29.5,48.5,"Central","Metropolitana","Noroccidente","Nororiente","Norte","Petén","Suroccidente","Suroriente",42.100000000000001,59.600000000000001,22.600000000000001,35.600000000000001,48.700000000000003,62.799999999999997,38,35.5]
["GTM",2015,"GTM_2015_DHS",31,"Piped water on premises","Yes","w_pop",52.600000000000001,67.700000000000003,65.799999999999997,52.600000000000001,28.399999999999999,71.799999999999997,64.200000000000003,46.799999999999997,33.100000000000001,21.5,45.700000000000003,59.299999999999997,69.099999999999994,65,50,"Central","Metropolitana","Noroccidente","Nororiente","Norte","Petén","Suroccidente","Suroriente",55,38.799999999999997,69.5,56.799999999999997,45.899999999999999,34.600000000000001,58.799999999999997,56.200000000000003]
["GTM",2015,"GTM_2015_DHS",32,"Piped water on premises","No","",47.399999999999999,32.299999999999997,34.200000000000003,47.399999999999999,71.599999999999994,28.199999999999999,35.799999999999997,53.200000000000003,66.900000000000006,78.5,54.299999999999997,40.700000000000003,30.899999999999999,35,50,"Central","Metropolitana","Noroccidente","Nororiente","Norte","Petén","Suroccidente","Suroriente",45,61.200000000000003,30.5,43.200000000000003,54.100000000000001,65.400000000000006,41.200000000000003,43.799999999999997]
["GTM",2015,"GTM_2015_DHS",35,"Water source on premises","Yes","",69.5,84.400000000000006,92.200000000000003,97.299999999999997,99.5,89.400000000000006,96.299999999999997,98.5,99.799999999999997,99.799999999999997,63.299999999999997,75.400000000000006,86.599999999999994,91.099999999999994,96.299999999999997,"Central","Metropolitana","Noroccidente","Nororiente","Norte","Petén","Suroccidente","Suroriente",93.400000000000006,97.599999999999994,85.299999999999997,86.5,69.799999999999997,81.200000000000003,93,80.5]
["GTM",2015,"GTM_2015_DHS",36,"Water source on premises","No","",30.5,15.6,7.7999999999999998,2.7000000000000002,0.5,10.6,3.7000000000000002,1.5,0.20000000000000001,0.20000000000000001,36.700000000000003,24.600000000000001,13.4,8.9000000000000004,3.7000000000000002,"Central","Metropolitana","Noroccidente","Nororiente","Norte","Petén","Suroccidente","Suroriente",6.5999999999999996,2.3999999999999999,14.699999999999999,13.5,30.199999999999999,18.800000000000001,7,19.5]
["GTM",2015,"GTM_2015_DHS",37,"Improved Water source on premises","Yes","w_premises",79.5,87.599999999999994,93.400000000000006,97.900000000000006,99.599999999999994,90.299999999999997,96.599999999999994,98.700000000000003,99.799999999999997,99.900000000000006,76.200000000000003,82,89,92.599999999999994,97.400000000000006,"Central","Metropolitana","Noroccidente","Nororiente","Norte","Petén","Suroccidente","Suroriente",93.900000000000006,97.700000000000003,89.200000000000003,91.299999999999997,83.5,84.700000000000003,94.5,84.900000000000006]
["GTM",2015,"GTM_2015_DHS",38,"Improved Water source on premises","No","",20.5,12.4,6.5999999999999996,2.1000000000000001,0.40000000000000002,9.6999999999999993,3.3999999999999999,1.3,0.20000000000000001,0.10000000000000001,23.800000000000001,18,11,7.4000000000000004,2.6000000000000001,"Central","Metropolitana","Noroccidente","Nororiente","Norte","Petén","Suroccidente","Suroriente",6.0999999999999996,2.2999999999999998,10.800000000000001,8.6999999999999993,16.5,15.300000000000001,5.5,15.1]
["GTM",2015,"GTM_2015_DHS",41,"Water point at more than 30 minutes","Yes","",4.2999999999999998,1.6000000000000001,0.59999999999999998,0.29999999999999999,0.10000000000000001,0.59999999999999998,0.10000000000000001,0,0.10000000000000001,0.10000000000000001,5.9000000000000004,2.6000000000000001,1.3999999999999999,0.80000000000000004,0.5,"Central","Metropolitana","Noroccidente","Nororiente","Norte","Petén","Suroccidente","Suroriente",0.10000000000000001,0,2.7000000000000002,1.7,4.9000000000000004,1.2,0.59999999999999998,1.8]
["GTM",2015,"GTM_2015_DHS",42,"Water point at more than 30 minutes","No","w_30min",95.700000000000003,98.400000000000006,99.400000000000006,99.700000000000003,99.900000000000006,99.400000000000006,99.900000000000006,100,99.900000000000006,99.900000000000006,94.099999999999994,97.400000000000006,98.599999999999994,99.200000000000003,99.5,"Central","Metropolitana","Noroccidente","Nororiente","Norte","Petén","Suroccidente","Suroriente",99.900000000000006,100,97.299999999999997,98.299999999999997,95.099999999999994,98.799999999999997,99.400000000000006,98.200000000000003]
["GTM",2015,"GTM_2015_DHS",58,"Source of drinking water","Piped into dwelling","",11.300000000000001,18,25.300000000000001,27,19.100000000000001,20.899999999999999,29.399999999999999,27.800000000000001,22,17.899999999999999,9.5,13.4,19,24.100000000000001,21.899999999999999,"Central","Metropolitana","Noroccidente","Nororiente","Norte","Petén","Suroccidente","Suroriente",24.100000000000001,21.399999999999999,13.4,27.199999999999999,12.6,11.300000000000001,21.100000000000001,25.699999999999999]
["GTM",2015,"GTM_2015_DHS",59,"Source of drinking water","Piped to yard/plot","",41.299999999999997,49.700000000000003,40.5,25.600000000000001,9.3000000000000007,50.899999999999999,34.799999999999997,18.899999999999999,11.1,3.6000000000000001,36.200000000000003,45.899999999999999,50.100000000000001,40.899999999999999,28.100000000000001,"Central","Metropolitana","Noroccidente","Nororiente","Norte","Petén","Suroccidente","Suroriente",31,17.399999999999999,56.100000000000001,29.600000000000001,33.299999999999997,23.300000000000001,37.700000000000003,30.399999999999999]
["GTM",2015,"GTM_2015_DHS",60,"Source of drinking water","Public tap/standpipe","",2.5,2.3999999999999999,1.6000000000000001,0.20000000000000001,0.10000000000000001,2,0.40000000000000002,0.10000000000000001,0,0,2.5,3.1000000000000001,2,1.8999999999999999,0.5,"Central","Metropolitana","Noroccidente","Nororiente","Norte","Petén","Suroccidente","Suroriente",0.80000000000000004,0.20000000000000001,3.3999999999999999,2.1000000000000001,1.3,0.69999999999999996,0.5,3.5]
["GTM",2015,"GTM_2015_DHS",61,"Source of drinking water","Other piped","",8,3.8999999999999999,3,0.80000000000000004,0.20000000000000001,5.2000000000000002,1.6000000000000001,0.59999999999999998,0.10000000000000001,0.10000000000000001,8.6999999999999993,5.9000000000000004,2.7999999999999998,3.6000000000000001,1,"Central","Metropolitana","Noroccidente","Nororiente","Norte","Petén","Suroccidente","Suroriente",2.1000000000000001,1.5,4.5,5.5,4.2000000000000002,1.8999999999999999,2.7000000000000002,4.7999999999999998]
["GTM",2015,"GTM_2015_DHS",62,"Source of drinking water","Public fountain/tank","",1.5,1.2,0.80000000000000004,0.10000000000000001,0,0.90000000000000002,0.20000000000000001,0,0,0,1.5,1.3,1.3999999999999999,1,0.29999999999999999,"Central","Metropolitana","Noroccidente","Nororiente","Norte","Petén","Suroccidente","Suroriente",2.2000000000000002,0,0.59999999999999998,0.80000000000000004,1.1000000000000001,0.29999999999999999,0.40000000000000002,1.6000000000000001]
["GTM",2015,"GTM_2015_DHS",63,"Source of drinking water","Mechanical or manual well","",14,14.5,14.1,7.9000000000000004,1.8999999999999999,9.4000000000000004,7.2999999999999998,4.0999999999999996,1.1000000000000001,1.1000000000000001,14.9,15.199999999999999,16.199999999999999,17,10.9,"Central","Metropolitana","Noroccidente","Nororiente","Norte","Petén","Suroccidente","Suroriente",12.800000000000001,3.7999999999999998,5.2000000000000002,4.5999999999999996,9.6999999999999993,25.100000000000001,18.699999999999999,8.5]
["GTM",2015,"GTM_2015_DHS",64,"Source of drinking water","River/irrigation channel","",4.7000000000000002,0.90000000000000002,0.20000000000000001,0.5,0,0.20000000000000001,0,0,0,0,6.5999999999999996,2.3999999999999999,0.59999999999999998,0.29999999999999999,0.80000000000000004,"Central","Metropolitana","Noroccidente","Nororiente","Norte","Petén","Suroccidente","Suroriente",0.10000000000000001,0,1.7,1.8,6.7999999999999998,1.7,0.29999999999999999,0.80000000000000004]
["GTM",2015,"GTM_2015_DHS",65,"Source of drinking water","Lake or stream","",1.3999999999999999,0.59999999999999998,0.20000000000000001,0,0,0,0,0,0,0,1.8,1.2,0.59999999999999998,0.29999999999999999,0,"Central","Metropolitana","Noroccidente","Nororiente","Norte","Petén","Suroccidente","Suroriente",0,0,0.69999999999999996,0.5,2.1000000000000001,0.69999999999999996,0.29999999999999999,0.10000000000000001]
["GTM",2015,"GTM_2015_DHS",66,"Source of drinking water","Protected spring","",2.3999999999999999,1.1000000000000001,0.40000000000000002,0.29999999999999999,0.10000000000000001,0.29999999999999999,0.20000000000000001,0,0,0.10000000000000001,3.1000000000000001,2,1,0.40000000000000002,0.5,"Central","Metropolitana","Noroccidente","Nororiente","Norte","Petén","Suroccidente","Suroriente",0.10000000000000001,0,1.2,1.3999999999999999,2.5,0.90000000000000002,0.40000000000000002,2.1000000000000001]
["GTM",2015,"GTM_2015_DHS",67,"Source of drinking water","Unprotected spring","",7.4000000000000004,2.1000000000000001,0.69999999999999996,0.20000000000000001,0,1.1000000000000001,0.20000000000000001,0.10000000000000001,0,0.10000000000000001,9.8000000000000007,4.4000000000000004,1.8,1,0.20000000000000001,"Central","Metropolitana","Noroccidente","Nororiente","Norte","Petén","Suroccidente","Suroriente",0.29999999999999999,0.10000000000000001,1.8999999999999999,2.8999999999999999,8.8000000000000007,2,1,4.2999999999999998]
["GTM",2015,"GTM_2015_DHS",68,"Source of drinking water","Rainwater","",3.7000000000000002,1.3,1.1000000000000001,0.5,0,0.20000000000000001,0.10000000000000001,0,0,0,4.5,3.1000000000000001,1,1.7,0.80000000000000004,"Central","Metropolitana","Noroccidente","Nororiente","Norte","Petén","Suroccidente","Suroriente",0.10000000000000001,0,2.2000000000000002,0.40000000000000002,5.9000000000000004,10.6,0,0]
["GTM",2015,"GTM_2015_DHS",69,"Source of drinking water","Tanker truck","",0.20000000000000001,0.10000000000000001,0,0.29999999999999999,0,0.20000000000000001,0,0.10000000000000001,0,0,0.10000000000000001,0.29999999999999999,0.10000000000000001,0,0.29999999999999999,"Central","Metropolitana","Noroccidente","Nororiente","Norte","Petén","Suroccidente","Suroriente",0.10000000000000001,0.10000000000000001,0.29999999999999999,0.10000000000000001,0.20000000000000001,0.10000000000000001,0,0.29999999999999999]
["GTM",2015,"GTM_2015_DHS",70,"Source of drinking water","Bottled water","",1,4,11.800000000000001,36.700000000000003,69.099999999999994,8.6999999999999993,25.699999999999999,48.100000000000001,65.5,77.200000000000003,0.20000000000000001,1.2,3.2000000000000002,7.5999999999999996,34.5,"Central","Metropolitana","Noroccidente","Nororiente","Norte","Petén","Suroccidente","Suroriente",26.399999999999999,55.5,8.5,22.699999999999999,11.300000000000001,21.5,16.800000000000001,17.399999999999999]
["GTM",2015,"GTM_2015_DHS",71,"Source of drinking water","Other","",0.59999999999999998,0.10000000000000001,0.20000000000000001,0,0,0.10000000000000001,0.10000000000000001,0,0,0,0.5,0.59999999999999998,0.10000000000000001,0.20000000000000001,0,"Central","Metropolitana","Noroccidente","Nororiente","Norte","Petén","Suroccidente","Suroriente",0.20000000000000001,0,0.40000000000000002,0.5,0.20000000000000001,0,0.10000000000000001,0.29999999999999999]
["GTM",2015,"GTM_2015_DHS",122,"Sanitation","Improved","s_imp",46.884286225441308,59.185670367778833,73.523136735187308,88.519610126222574,97.069940571310113,69.237982112025321,88.186845009874972,95.630354901723237,97.724505813823214,98.689054102775486,43.558560687433364,49.892698831396423,57.907481051906288,68.887172284507599,82.616285198024187,"Central","Metropolitana","Noroccidente","Nororiente","Norte","Petén","Suroccidente","Suroriente",82.150924189059168,92.31221786727717,60.474026133555327,69.060605953727105,61.192847473891291,58.478390429381847,70.6056514696797,68.559453237467167]
["GTM",2015,"GTM_2015_DHS",123,"Sanitation","Not Improved","",53.11571377455941,40.814329632221039,26.47686326481255,11.480389873777449,2.9300594286904018,30.762017887975031,11.813154990125261,4.3696450982769637,2.2754941861767271,1.3109458972244861,56.441439312566331,50.107301168603563,42.092518948093883,31.112827715492038,17.383714801975881,"Central","Metropolitana","Noroccidente","Nororiente","Norte","Petén","Suroccidente","Suroriente",17.849075810940789,7.6877821327223703,39.525973866444858,30.939394046273058,38.807152526108908,41.521609570618118,29.39434853031965,31.44054676253317]
["GTM",2015,"GTM_2015_DHS",124,"Sanitation ladder","Basic","s_bas",39.129938133161303,48.980078560382722,61.978716232956423,75.64290274043293,91.897823532965049,55.527330962793869,72.256011148718983,79.997600835289759,90.319310728692912,96.501419449324331,37.595565651963398,40.601673714056219,48.648929938953607,58.790887517032452,74.4019903496674,"Central","Metropolitana","Noroccidente","Nororiente","Norte","Petén","Suroccidente","Suroriente",66.362979381342299,78.056803663078185,54.725152087538689,61.494318173565723,54.287672734072942,51.285975077475172,60.530294179755401,59.579509123061307]
["GTM",2015,"GTM_2015_DHS",125,"Sanitation ladder","Limited","s_lim",7.7272360665661299,10.19148473958677,11.544420502230951,12.83101939374817,5.1721170383450552,13.71065114923142,15.930833861156231,15.63275406643373,7.4051950851303454,2.1876346534510471,5.9629950354698851,9.2436769488383863,9.2345147682027822,10.096284767475129,8.1398616085335647,"Central","Metropolitana","Noroccidente","Nororiente","Norte","Petén","Suroccidente","Suroriente",15.787944807716951,14.25541420419847,5.7488740460166978,7.5662877801614101,6.9051747398184311,7.1924153519066207,10.00301805822798,8.979944114405976]
["GTM",2015,"GTM_2015_DHS",126,"Sanitation ladder","Unimproved","s_unimp",34.83978722505146,31.681479319755539,23.50013610514555,10.93957155836976,2.8523538146986529,25.315128640062781,10.757136203894319,4.3105729228910867,2.2341692593004758,1.310945897224622,34.107548899965742,36.841487893738588,32.766058489697159,27.765212257287711,16.606022018950441,"Central","Metropolitana","Noroccidente","Nororiente","Norte","Petén","Suroccidente","Suroriente",13.93103321916008,6.944300191659968,30.860694243108519,17.209873652147991,34.305928731484322,29.901852160899828,25.228340796433731,16.565825490256909]
["GTM",2015,"GTM_2015_DHS",127,"Sanitation ladder","Open defecation","s_od",18.30303857522112,9.1469573802749728,2.9767271596670848,0.5865063074491399,0.077705613991242803,5.4468892479119289,1.0560187862304671,0.059072175385427098,0.041324926876266502,0,22.333890412600979,13.313161443366811,9.350496803146445,3.3476154582047042,0.85212602284859829,"Central","Metropolitana","Noroccidente","Nororiente","Norte","Petén","Suroccidente","Suroriente",3.9180425917806758,0.74348194106337373,8.6652796233360938,13.72952039412487,4.5012237946243001,11.61975740971838,4.2383469655828936,14.874721272275799]
["GTM",2015,"GTM_2015_DHS",135,"Sanitation type","Sewer connection","s_sew",4.6502205167961952,15.15248068112019,31.42351978113825,58.403031377991802,82.267271424189232,36.482949767389677,66.749689158426122,83.293995080067148,87.552616263787897,92.870531674392893,1.3751126350249181,4.6199301723893722,10.185141676542051,16.579860275911511,29.70375596758932,"Central","Metropolitana","Noroccidente","Nororiente","Norte","Petén","Suroccidente","Suroriente",51.703709454010017,75.834190981859976,22.000846621455519,32.134062195533822,18.056473774565081,8.0970229644647187,31.396765896262039,24.899269961444318]
["GTM",2015,"GTM_2015_DHS",136,"Sanitation type","Septic tank connection","s_sep",8.2906014669967139,13.209993149508509,21.78885830682826,21.729148476715189,13.51430469877794,10.71025823365518,13.58657793352725,9.8294690471565431,9.4378699426762243,5.6826626390505934,7.9684550843406647,9.794830432864094,15.45843730886414,27.33000210923257,39.637915029788388,"Central","Metropolitana","Noroccidente","Nororiente","Norte","Petén","Suroccidente","Suroriente",18.38050765008316,10.859206993556709,9.2608412074590714,22.398718937677359,10.147688793770619,19.258242309745071,16.076613249498759,30.361800592586949]
["GTM",2015,"GTM_2015_DHS",139,"Sanitation type","Open defecation","",18.30303857522112,9.1424811220415592,2.9764796347475482,0.5865063074491399,0.077705613991242803,5.4441177233901099,1.0560187862304671,0.059072175385427098,0.041324926876266502,0,22.333890412600979,13.30992232761767,9.3469783585131925,3.3476154582047042,0.85212602284859829,"Central","Metropolitana","Noroccidente","Nororiente","Norte","Petén","Suroccidente","Suroriente",3.9174445990701532,0.74348194106337373,8.6652796233360938,13.72952039412487,4.5012237946243001,11.61975740971838,4.2371378678764886,14.869971285806541]
["GTM",2015,"GTM_2015_DHS",151,"Shared among all sanitation facilities","Yes","",16.48150518792162,17.219513906418641,15.701751876842771,14.49511512245938,5.3282375655164671,19.802210767852721,18.064864276947802,16.34706268997861,7.5776234665623399,2.2166943166491682,13.68960530688565,18.527113516299771,15.94701513596366,14.65626245446243,9.8526114906074636,"Central","Metropolitana","Noroccidente","Nororiente","Norte","Petén","Suroccidente","Suroriente",19.218219348796541,15.442608284739009,9.5063524186738579,10.95601128265668,11.28428407056006,12.299270378503561,14.1674467270139,13.09803927884669]
["GTM",2015,"GTM_2015_DHS",152,"Shared among all sanitation facilities","No","",83.460667279878109,82.756650817708532,84.298248123157308,85.453271464449074,94.671762434483526,80.19778923214723,81.935135723052483,83.652937310021656,92.422376533437699,97.783305683350719,86.310394693114162,81.377986489090148,84.011476678369718,85.34373754553755,90.057293391166368,"Central","Metropolitana","Noroccidente","Nororiente","Norte","Petén","Suroccidente","Suroriente",80.781780651203562,84.557391715260422,90.493647581326243,89.043988717343368,88.715715929440066,87.70072962149635,85.730097973458996,86.9019607211535]
["GTM",2015,"GTM_2015_DHS",153,"Type of toilet facility","Flush to piped sewer system","",4.6502205167961952,15.159899500530379,31.42613297026092,58.403031377991802,82.267271424189232,36.501522729078992,66.749689158426122,83.293995080067148,87.552616263787897,92.870531674392893,1.3751126350249181,4.6210544831263496,10.18897562754699,16.579860275911511,29.70375596758932,"Central","Metropolitana","Noroccidente","Nororiente","Norte","Petén","Suroccidente","Suroriente",51.711601956527574,75.834190981859976,22.000846621455519,32.134062195533822,18.056473774565081,8.0970229644647187,31.405725188788612,24.90722365504184,965.7114200000002,3146.6697279999962,6521.0431909999916,12138.772532999999,17082.77377200004,3218.9458990000012,5896.490455999995,7353.0068540000002,7726.2645789999979,8202.6356370000194,164.21619899999999,550.95257099999981,1217.305315000001,1978.865137999999,3546.2879960000032,5845.7079009999943,15502.849531999969,3248.5575900000008,2935.8805540000039,1746.543336,321.63476700000012,7991.408646000008,2262.3883179999971]
["GTM",2015,"GTM_2015_DHS",154,"Type of toilet facility","Flush to septic tank","",8.2906014669967139,13.216460905887709,21.790670274676529,21.729148476715189,13.51430469877794,10.715710676978,13.58657793352725,9.8294690471565431,9.4378699426762243,5.6826626390505934,7.9684550843406647,9.7972141124028802,15.46425626486271,27.33000210923257,39.637915029788388,"Central","Metropolitana","Noroccidente","Nororiente","Norte","Petén","Suroccidente","Suroriente",18.383313410142431,10.859206993556709,9.2608412074590714,22.398718937677359,10.147688793770619,19.258242309745071,16.081200826493621,30.37149920862495,1721.7094300000001,2743.279231,4521.6477050000067,4516.2928100000081,2806.241241000002,944.98230100000046,1200.2022499999989,867.72345600000051,832.86466300000029,501.9117500000001,951.59434399999998,1168.088436,1847.557794999999,3261.9326999999998,4732.3127220000106,2078.1309489999971,2219.9571179999998,1367.4190140000001,2046.4254710000009,981.55257000000029,764.98736699999984,4091.9751590000001,2758.7227689999968]
["GTM",2015,"GTM_2015_DHS",155,"Type of toilet facility","Flush to somewhere else","",1.22296315333642,2.253951358033516,3.867558848245134,2.8015157062587761,1.603401690187765,3.2204311986623591,2.9794969264904569,1.870300018650592,1.548048619129087,1.1750861078924839,0.38337223098571871,2.1455265365945979,2.199838051639341,3.9731968311639312,3.7545378791958859,"Central","Metropolitana","Noroccidente","Nororiente","Norte","Petén","Suroccidente","Suroriente",1.7801297325827761,1.4697862365781631,2.90475098374925,3.5549920812112119,1.192265402001025,0.202614152549868,3.0874674906633421,3.0294271785294811,253.972791,467.84218500000009,802.53330300000027,582.2807670000002,332.94587100000001,283.998941,263.20085399999999,165.105886,136.610803,103.787531,45.782381000000001,255.80381399999999,262.82078300000012,474.21513599999992,448.24878799999999,201.23372800000001,300.46967699999999,428.90398799999991,324.79653700000011,115.32391200000001,8.0483600000000006,785.62791500000014,275.17079999999999]
["GTM",2015,"GTM_2015_DHS",156,"Type of toilet facility","Flush, don't know where","",0.017436820581942899,0.065565440038250405,0.0094813860945154992,0.017322392351761501,0.020356133977497901,0,0,0,0.047898967187716503,0,0.0303223876120279,0.050848069792914202,0.0631664430776889,0.016484001055495301,0.0301567559367464,"Central","Metropolitana","Noroccidente","Nororiente","Norte","Petén","Suroccidente","Suroriente",0,0,0,0.053204033676332398,0,0,0.037389785233869398,0.13926666824242279,3.621105,13.609113000000001,1.9674240000000001,3.600371,4.2269449999999997,0,0,0,4.2269449999999997,0,3.621105,6.0624419999999999,7.5466709999999999,1.9674240000000001,3.600371,0,0,0,4.8609069999999992,0,0,9.5140949999999993,12.649956]
["GTM",2015,"GTM_2015_DHS",157,"Type of toilet facility","Ventilated Improved Pit latrine (VIP)","",1.31719062221258,1.8219414086044929,0.88495366234806383,0.33402120133621288,0.019056189854035701,0.24491052160591351,0.072938640517271502,0.066617870258615805,0,0,1.670264516977642,1.490251219177277,2.1941845131482411,1.40772478717811,0.56538711479637238,"Central","Metropolitana","Noroccidente","Nororiente","Norte","Petén","Suroccidente","Suroriente",0.095336994745286105,0.1443059367796469,1.5427284650885451,1.0571500287403719,0.84634694414598444,1.674064757447377,1.356106164395122,0.55747005229562729,273.54101200000002,378.17189200000001,183.631281,69.424605,3.9570120000000002,21.597830999999999,6.443206,5.8808759999999998,0,0,199.46329,177.677572,262.14533899999998,168.01694699999999,67.500741000000005,10.777315,29.500588,227.79315500000001,96.584931999999981,81.864357000000012,66.498197000000005,345.07079399999998,50.636463999999997]
["GTM",2015,"GTM_2015_DHS",158,"Type of toilet facility","Latrine","",65.217673597707773,57.843606225435998,38.82379688361457,16.07217335565521,2.4979042490227878,43.551676368724841,15.55527855480867,4.8805458084818882,1.3722412803427491,0.27171957866400392,65.028812126956225,67.866661893794003,59.993796406541321,47.106202222259853,25.358140659826731,"Central","Metropolitana","Noroccidente","Nororiente","Norte","Petén","Suroccidente","Suroriente",23.921343655287789,10.94902791016167,55.339219679104382,26.834941516198459,64.284675922819204,58.898120795449358,43.450459009536957,25.167987306524651,13543.756033000011,12006.32792199998,8056.0868420000043,3340.5193510000031,518.68905399999994,3840.6751160000008,1374.1120399999991,430.84362499999997,121.096315,23.999181,7765.7524779999922,8091.5107129999951,7167.626060000006,5622.2923359999986,3027.4713380000012,2704.1743500000039,2238.319285999999,8171.1692830000129,2451.7343149999988,6218.0453250000028,2339.5862209999982,11056.276259000029,2286.0741630000002]
["GTM",2015,"GTM_2015_DHS",159,"Type of toilet facility","Open latrine","",0.98087524714798524,0.49161778119454969,0.22067881509304241,0.0562811822419313,0,0.31885925703832368,0,0,0,0,1.20977060550152,0.71528224174515664,0.54528589003742944,0.2389143149934817,0.097980570018025001,"Central","Metropolitana","Noroccidente","Nororiente","Norte","Petén","Suroccidente","Suroriente",0.19023165893344851,0,0.28633341980732979,0.23741081283774501,0.9713253680739784,0.25017761062519989,0.34330456930493841,0.95240465846556277,203.69838899999991,102.042813,45.791701000000003,11.697756999999999,0,28.119119999999999,0,0,0,0,144.471024,85.280663000000004,65.146825000000007,28.515270999999998,11.697756999999999,21.504626999999999,0,42.278855,21.690684000000001,93.953109000000012,9.9377040000000001,87.356272999999987,86.509408000000008]
["GTM",2015,"GTM_2015_DHS",160,"Type of toilet facility","No facility","",18.30303857522112,9.1469573802749728,2.9767271596670848,0.5865063074491399,0.077705613991242803,5.4468892479119289,1.0560187862304671,0.059072175385427098,0.041324926876266502,0,22.333890412600979,13.313161443366811,9.350496803146445,3.3476154582047042,0.85212602284859829,"Central","Metropolitana","Noroccidente","Nororiente","Norte","Petén","Suroccidente","Suroriente",3.9180425917806758,0.74348194106337373,8.6652796233360938,13.72952039412487,4.5012237946243001,11.61975740971838,4.2383469655828936,14.874721272275799,3800.9925140000041,1898.5913390000001,617.68230899999992,121.902348,16.135546999999999,480.34275000000002,93.285898000000003,5.2147589999999999,3.6468050000000001,0,2667.117223000002,1587.282848999999,1117.129913,399.54977999999988,101.73408000000001,442.91284100000013,151.99065899999999,1279.4807570000009,1254.377105999999,435.38857699999983,461.56692199999998,1078.4773279999999,1351.109866999999]
["GTM",2015,"GTM_2015_DHS",222,"Hygiene ladder","Basic","h_bas",50.716444667500113,72.682347714196766,83.769135448151886,88.446716395905398,92.312294966677428,72.647084882716186,84.952629163254144,86.382195018587154,90.611315502987239,93.172434636086933,44.334473984996613,61.60003960359964,76.310862055290642,84.508056778238824,91.57556802825097,"Central","Metropolitana","Noroccidente","Nororiente","Norte","Petén","Suroccidente","Suroriente",83.747452363088129,87.955636724381193,68.801134031700855,76.041309169088208,58.592826184520462,66.738327598608535,81.973237399929957,73.232013547619488,10517.813145000009,15017.41485999999,17192.89652600004,17729.686755000039,17437.19751200005,6341.6905589999888,7302.6482889999943,7221.1482110000034,7303.5913710000004,7236.5116630000111,5284.4773600000053,7334.1060510000007,9090.4897849999979,10040.80886000003,10739.536649000011,9177.7677019999956,16392.307565999959,10026.665928999981,6855.598073000021,5644.7188769999957,2617.4414299999999,20581.871488000081,6598.6377330000078]
["GTM",2015,"GTM_2015_DHS",223,"Hygiene ladder","Limited","h_lim",43.212341850258653,25.61190774410905,15.30670054716462,9.7665510185496824,5.1008067215923614,25.201409253591191,13.74888625729378,10.76858847259572,6.8272623533410366,3.6102120868692249,47.292842557004867,35.754463219791702,22.621425584973871,14.56797539859719,7.5367202466416359,"Central","Metropolitana","Noroccidente","Nororiente","Norte","Petén","Suroccidente","Suroriente",14.026279171958979,9.5648485219210535,29.165167279016561,21.621077264488019,36.159540643976428,29.022422104041091,15.991641394317391,23.97126094926081,8961.5772580000048,5291.8577350000041,3141.568995000001,1957.7650510000019,963.50951200000043,2199.9442839999988,1181.87373,900.20372100000009,550.30140699999959,280.39775900000001,5637.1020859999981,4256.9294880000016,2694.7649739999961,1730.891255,883.86984699999948,1537.1205730000011,1782.602509999999,4250.3571080000011,1949.274903999999,3483.539794000003,1138.243836000001,4015.1873769999979,2159.9524490000008]
["GTM",2015,"GTM_2015_DHS",224,"Hygiene ladder","No facility","h_nfac",6.0712134822420163,1.7057445416940991,0.92416400468355731,1.786732585545084,2.5868983117304891,2.151505863692813,1.2984845794522399,2.8492165088171602,2.5614221436717002,3.2173532770438431,8.3726834579983151,2.6454971766087252,1.067712359735574,0.92396782316393822,0.88771172510737295,"Central","Metropolitana","Noroccidente","Nororiente","Norte","Petén","Suroccidente","Suroriente",2.226268464953018,2.479514753697408,2.033698689282549,2.337613566424154,5.2476331715032476,4.2392502973504449,2.0351212057523451,2.7967255031202392,1259.076605,352.43596600000012,189.67673500000001,358.16150499999998,488.64841700000022,187.814617,111.619573,238.18119799999991,206.45965200000001,249.885222,997.98761999999942,314.9731230000001,127.190652,109.781063,104.10650800000001,243.9736879999999,462.10760299999998,296.37908800000002,210.75043600000001,505.54676999999992,166.261124,510.97900299999998,252.0015159999999]
["GTM",2015,"GTM_2015_DHS",225,"Place where household members wash their hands","Observed","",93.799720113812754,97.797318194857553,97.987463174589323,94.721839663169959,88.614178197547005,96.809342153082852,96.046828474010425,91.997717573119132,88.998875658250896,85.106715141709358,91.455057309072615,97.194890512387971,98.606724159876208,98.628824859631308,97.357809196181378,"Central","Metropolitana","Noroccidente","Nororiente","Norte","Petén","Suroccidente","Suroriente",94.770296358462986,88.904920281691574,96.691096077512881,96.371882528124146,94.371642491187174,94.547831783694505,96.637293014359088,96.394814138742873]
["GTM",2015,"GTM_2015_DHS",226,"Place where household members wash their hands","Not observed: not in dwelling","",5.0343995973095836,1.373496185203233,0.83497581841290325,1.723215222794368,2.3532344623230852,1.950128563904955,1.2635603936516,2.6980885409598301,2.3395629933049431,2.8292093482773879,6.7650632918437248,2.3149866237273251,0.75860852192951922,0.78645634845132562,0.87199751169613737,"Central","Metropolitana","Noroccidente","Nororiente","Norte","Petén","Suroccidente","Suroriente",1.8992911739342,2.1937952622874999,1.8486095733308181,1.929729938493673,3.5791467149331102,4.1107043091704458,1.9491886805052401,2.5611873292276748]
["GTM",2015,"GTM_2015_DHS",227,"Place where household members wash their hands","Not observed: no permission to see","",0.098421853654911101,0.48450404865273539,1.0985249932976391,3.5136886301073909,8.9477999868467428,1.0620009969462849,2.68961113233813,5.2070578628909034,8.6615613484441134,11.95339056659475,0.12020213792267791,0.15936616051248659,0.29706342472450631,0.45137790379668308,1.70460907327069,"Central","Metropolitana","Noroccidente","Nororiente","Norte","Petén","Suroccidente","Suroriente",2.8926934191959841,8.8267575897781771,1.3016774300379419,1.321392966707184,0.31810579940456218,1.2666128061041111,1.3210088563950351,0.83172132041997204]
["GTM",2015,"GTM_2015_DHS",228,"Place where household members wash their hands","Not observed: other reason","",1.0284715042759141,0.32362478005967749,0.079036013700144306,0,0,0.17852828606608201,0,0,0,0,1.5918795324171551,0.32617327103140131,0.30559024118173511,0.13334088812065939,0,"Central","Metropolitana","Noroccidente","Nororiente","Norte","Petén","Suroccidente","Suroriente",0.25859028241044912,0.066663768017663994,0.15861691911836309,0.37699456667495818,1.6474009499117099,0.0748511010309518,0.058353274332288103,0.21227721160949001]
["GTM",2015,"GTM_2015_DHS",229,"Place where household members wash their hands","missing","",0.038986930946656402,0.0210567912268683,0,0.041256483928111098,0.084787353283503397,0,0,0.097136023030262503,0,0.1106849434183748,0.067797728743743194,0.0045834323409083997,0.032013652288033601,0,0.065584218851820503,"Central","Metropolitana","Noroccidente","Nororiente","Norte","Petén","Suroccidente","Suroriente",0.17912876599628541,0.0078630982248831995,0,0,0.083704044563394003,0,0.034156174407989001,0]