{"text_format":"1","workbook":"xlsx","n_sheets":7,"sheets":["Introduction","Water","Sanitation","Hygiene","DHS00","DHS12","data_summary"],"not_rendered":{"charts":111,"images":76,"macros":1,"external_links":0,"defined_names":0,"comments":0,"pivot_tables":0},"unopened":[],"bounds":{"document_bytes":16777216,"sheet_cells":100000,"rows_first":2000,"rows_last":500,"rows_between":2000,"halvings":0,"cell_chars":16384,"cell_head_chars":4096},"cells_cut":0,"cells_raw":0,"read":"whole","date_system":"1900"}

{"sheet":"Introduction","index":0,"n_rows":55,"n_cols":12,"rows_kept":55,"cut":false,"hidden":false,"merged":[[107,0,107,1],[1,0,1,1],[4,0,4,1],[5,0,5,1],[6,0,6,1],[7,0,7,1],[112,0,112,1],[113,0,113,1],[207,0,207,1],[212,0,212,1],[213,0,213,1]]}
[]
[]
[]
[null,null,"Joint Monitoring Programme for Water Supply, Sanitation and Hygiene"]
[]
[null,null,"Estimates on household water, sanitation and hygiene \nby wealth quintile and sub-national region in"]
[null,null,{"$f":"+Water!B5","v":"Gabon"}]
[]
[null,null,"Updated May 2021"]
[]
[null,null,"Follow the links below to find the following information: "]
[]
[null,null,"JMP Estimates"]
[null,null,"WASH status and trends by wealth quintile \n(customized quintiles made without water and sanitation assets)"]
[null,null,"Water"]
[null,null,"Sanitation"]
[null,null,"Hygiene"]
[]
[null,null,"Data inputs"]
[null,null," customized wealth quintiles and subnational data:"]
[null,null,{"$f":"IF(INDIRECT(CONCATENATE(\"Water\",\"!B105\"))=0,\"\",INDIRECT(CONCATENATE(\"Water\",\"!B105\")))","v":"DHS00"}]
[null,null,{"$f":"IF(INDIRECT(CONCATENATE(\"Water\",\"!B106\"))=0,\"\",INDIRECT(CONCATENATE(\"Water\",\"!B106\")))","v":"DHS12"}]
[null,null,{"$f":"IF(INDIRECT(CONCATENATE(\"Water\",\"!B107\"))=0,\"\",INDIRECT(CONCATENATE(\"Water\",\"!B107\")))","v":""}]
[null,null,{"$f":"IF(INDIRECT(CONCATENATE(\"Water\",\"!B108\"))=0,\"\",INDIRECT(CONCATENATE(\"Water\",\"!B108\")))","v":""}]
[null,null,{"$f":"IF(INDIRECT(CONCATENATE(\"Water\",\"!B109\"))=0,\"\",INDIRECT(CONCATENATE(\"Water\",\"!B109\")))","v":""}]
[null,null,{"$f":"IF(INDIRECT(CONCATENATE(\"Water\",\"!B110\"))=0,\"\",INDIRECT(CONCATENATE(\"Water\",\"!B110\")))","v":""}]
[null,null,{"$f":"IF(INDIRECT(CONCATENATE(\"Water\",\"!B111\"))=0,\"\",INDIRECT(CONCATENATE(\"Water\",\"!B111\")))","v":""}]
[null,null,{"$f":"IF(INDIRECT(CONCATENATE(\"Water\",\"!B112\"))=0,\"\",INDIRECT(CONCATENATE(\"Water\",\"!B112\")))","v":""}]
[null,null,{"$f":"IF(INDIRECT(CONCATENATE(\"Water\",\"!B113\"))=0,\"\",INDIRECT(CONCATENATE(\"Water\",\"!B113\")))","v":""}]
[null,null,{"$f":"IF(INDIRECT(CONCATENATE(\"Water\",\"!B114\"))=0,\"\",INDIRECT(CONCATENATE(\"Water\",\"!B114\")))","v":""}]
[null,null,{"$f":"IF(INDIRECT(CONCATENATE(\"Water\",\"!B115\"))=0,\"\",INDIRECT(CONCATENATE(\"Water\",\"!B115\")))","v":""}]
[null,null,{"$f":"IF(INDIRECT(CONCATENATE(\"Water\",\"!B116\"))=0,\"\",INDIRECT(CONCATENATE(\"Water\",\"!B116\")))","v":""}]
[]
[]
[]
[]
[]
[]
[]
[]
[]
[]
[]
[]
[]
[]
[]
[]
[]
[]
[]
[]
[]
[]
[null,null,null,null,null,null,null,null,null,null,null,{"$f":"+IF(ISNUMBER(M48), \"\", \"Insufficient data to estimate safely managed sanitation services at national level\")","v":"Insufficient data to estimate safely managed sanitation services at national level"}]

{"sheet":"Water","index":1,"n_rows":318,"n_cols":28,"rows_kept":318,"cut":false,"hidden":false,"merged":[[3,1,3,24],[317,18,317,22],[117,18,117,22],[196,18,196,22],[296,23,296,27],[298,0,299,1],[300,0,301,1],[296,0,297,2],[296,3,296,7],[296,8,296,12],[296,13,296,17],[296,18,296,22],[196,23,196,27],[198,0,199,1],[200,0,201,1],[196,13,196,17],[96,8,96,12],[96,13,96,17],[96,18,96,22],[217,18,217,22],[98,0,99,1],[100,0,101,1],[196,0,197,2],[196,3,196,7],[196,8,196,12],[217,1,217,11],[35,3,36,3],[38,1,39,2],[38,3,39,3],[96,0,97,2],[96,3,96,7],[317,1,317,11],[6,9,6,16],[6,17,6,24],[6,1,6,8],[4,1,4,24],[117,1,117,11],[30,21,30,24],[32,1,33,2],[32,3,33,3],[30,17,30,20],[30,1,31,4],[30,5,30,8],[30,9,30,12],[30,13,30,16],[96,23,96,27],[35,1,36,2]]}
["BGD"]
[]
[]
[null,"Summary of trends in use of drinking water by wealth quintile (%)"]
[null,{"$f":"IF(ISERROR(INDIRECT(CONCATENATE($B105,\"!A2\"))),\"\",INDIRECT(CONCATENATE($B105,\"!A2\")))","v":"Gabon"}]
[]
[null,{"$f":"B118","v":"National use of drinking water sources, 2000–2018"},null,null,null,null,null,null,null,{"$f":"B218","v":"Urban use of drinking water sources,  2000–2018"},null,null,null,null,null,null,null,{"$f":"B318","v":"Rural use of drinking water sources, 2000–2018"}]
[]
[]
[]
[]
[]
[]
[]
[]
[]
[]
[]
[]
[]
[]
[]
[]
[]
[]
[]
[]
[]
[]
[]
[null,{"$f":"IF(ISERROR(INDIRECT(CONCATENATE($B105,\"!A2\"))),\"\",INDIRECT(CONCATENATE($B105,\"!A2\")))","v":"Gabon"},null,null,null,"Poorest",null,null,null,"Poor",null,null,null,"Middle",null,null,null,"Rich",null,null,null,"Richest"]
[null,null,null,null,null,"Basic","Limited","Unimproved","Surface \n water","Basic","Limited","Unimproved","Surface \nwater","Basic","Limited","Unimproved","Surface \nwater","Basic","Limited","Unimproved","Surface \nwater","Basic","Limited","Unimproved","Surface \nwater"]
[null,"NATIONAL",null,"Estimate",{"$f":"C99","v":2000},{"$f":"E99","v":34.235568344268202},{"$f":"F99","v":12.09131710129093},17.287289997939297,36.385824556501575,{"$f":"J99","v":65.366998799398573},{"$f":"K99","v":9.7674825792204771},11.147313802644248,13.718204818736695,{"$f":"O99","v":89.231489233932066},{"$f":"P99","v":5.0935522395690667},3.573717737298324,2.1012407892005456,{"$f":"T99","v":93.415885693737252},{"$f":"U99","v":3.8923285705723858},1.5632573322853887,1.128528403404971,{"$f":"Y99","v":96.979538559470996},{"$f":"Z99","v":2.2830392905504917},0.64873714697105811,8.8685003007453744E-2]
[null,null,null,null,{"$f":"C100","v":2018},{"$f":"E100","v":58.266838609288705},20.578680483118195,5.0521183336768445,16.102362573916253,{"$f":"J100","v":84.820000200100296},12.674252903463262,1.6421143662257691,0.86363253021067976,{"$f":"O100","v":92.735585127678021},5.293574626738498,1.6210470437835625,0.34979320179991191,{"$f":"T100","v":95.198685717710475},3.9666119049046027,0.78945711128574203,4.5245266099186665E-2,{"$f":"Y100","v":95.882360240088133},2.2572101182415802,1.8604296416702937,0]
[]
[null,"URBAN",null,"Estimate",{"$f":"C199","v":2000},{"$f":"E199","v":61.888776260829303},{"$f":"F199","v":18.695567828792186},10.815945191038281,8.5997107193402371,{"$f":"J199","v":88.940460519950918},{"$f":"K199","v":7.3154491336756111},2.8041723936432561,0.93991795273021239,{"$f":"O199","v":94.323357135583606},{"$f":"P199","v":3.5224490216607927},1.6524180093268228,0.50177583342878762,{"$f":"T199","v":96.180101485809502},{"$f":"U199","v":3.1795074871342011},0.48843107580682954,0.15195995124945938,{"$f":"Y199","v":96.956123936523824},{"$f":"Z199","v":2.4860544599108669},0.4759185717839074,8.1903031781404678E-2]
[null,null,null,null,{"$f":"C200","v":2018},{"$f":"E200","v":72.565203956528336},21.920738695201273,4.3806758014939078,1.1333815467764907,{"$f":"J200","v":90.28158991334152},7.4257584777207262,1.9826379343927982,0.31001367454496176,{"$f":"O200","v":96.183773810736014},3.5919251630565259,7.4596998445585427E-2,0.14970402776187086,{"$f":"T200","v":95.773983085698404},3.1660820854776364,1.0599348288239554,0,{"$f":"Y200","v":95.429396010579381},2.446907590014856,2.1236963994057589,0]
[]
[null,"RURAL",null,"Estimate",{"$f":"C299","v":2000},{"$f":"E299","v":31.322328402894353},{"$f":"F299","v":10.440776134298119},16.837883893173057,41.399011569634467,{"$f":"J299","v":32.190491102187309},{"$f":"K299","v":8.1484701787491698},18.673130695349869,40.987908023713658,{"$f":"O299","v":30.677845985144991},{"$f":"P299","v":12.048959008093158},16.015651914489808,41.257543092272044,{"$f":"T299","v":40.116118080218193},{"$f":"U299","v":9.3488857178313705},20.195373289585632,30.339622912364803,{"$f":"Y299","v":57.523585359889097},{"$f":"Z299","v":9.5984512327469531},12.862563016125023,20.015400391238927]
[null,null,null,null,{"$f":"C300","v":2018},{"$f":"E300","v":39.492111932851003},13.164037310950334,7.1103526844710814,40.233498071727581,{"$f":"J300","v":49.098418149635506},12.428421636875155,4.1211448841082756,34.352015329381061,{"$f":"O300","v":51.17822566914213},20.100640165317664,4.2140580142518047,24.507076151288402,{"$f":"T300","v":60.775663653296824},14.163502380361411,7.0174377850694327,18.043396181272328,{"$f":"Y300","v":80.297752440018442},13.398574794542164,3.5729061639790416,2.7307666014603456]
[]
[]
[]
[]
[]
[]
[]
[]
[]
[]
[]
[]
[]
[]
[]
[]
[]
[]
[]
[]
[]
[]
[]
[]
[]
[]
[]
[]
[]
[]
[]
[]
[]
[]
[]
[]
[]
[]
[]
[]
[]
[]
[]
[]
[]
[]
[]
[]
[]
[]
[]
[]
[]
[]
[]
[]
["NATIONAL",null,null,"Poorest",null,null,null,null,"Poor",null,null,null,null,"Middle",null,null,null,null,"Rich",null,null,null,null,"Richest"]
[null,null,null,"Improved","Basic","Limited","Unimproved","Surface water","Improved","Basic","Limited","Unimproved","Surface water","Improved","Basic","Limited","Unimproved","Surface water","Improved","Basic","Limited","Unimproved","Surface water","Improved","Basic","Limited","Unimproved","Surface water"]
["Forecast period:",null,{"$f":"MinBase(C105:C116)","v":2000},{"$f":"IF((D101+H101)>100,D101*100/(D101+H101),D101)","v":46.326885445559128},{"$f":"D99*AVERAGEIF(E105:E116,\">0\")/100","v":34.235568344268202},{"$f":"D99*(100-AVERAGEIF(E105:E116,\">0\"))/100","v":12.09131710129093},{"$f":"100-(E99+F99+H99)","v":17.287289997939297},{"$f":"IF((D101+H101)>100,H101*100/(D101+H101),H101)","v":36.385824556501575},{"$f":"IF((I101+M101)>100,I101*100/(I101+M101),I101)","v":75.134481378619057},{"$f":"I99*AVERAGEIF(J105:J116,\">0\")/100","v":65.366998799398573},{"$f":"I99*(100-AVERAGEIF(J105:J116,\">0\"))/100","v":9.7674825792204771},{"$f":"100-(J99+K99+M99)","v":11.147313802644248},{"$f":"IF((I101+M101)>100,M101*100/(I101+M101),M101)","v":13.718204818736695},{"$f":"IF((N101+R101)>100,N101*100/(N101+R101),N101)","v":94.32504147350113},{"$f":"N99*AVERAGEIF(O105:O116,\">0\")/100","v":89.231489233932066},{"$f":"N99*(100-AVERAGEIF(O105:O116,\">0\"))/100","v":5.0935522395690667},{"$f":"100-(O99+P99+R99)","v":3.573717737298324},{"$f":"IF((N101+R101)>100,R101*100/(N101+R101),R101)","v":2.1012407892005456},{"$f":"IF((S101+W101)>100,S101*100/(S101+W101),S101)","v":97.30821426430964},{"$f":"S99*AVERAGEIF(T105:T116,\">0\")/100","v":93.415885693737252},{"$f":"S99*(100-AVERAGEIF(T105:T116,\">0\"))/100","v":3.8923285705723858},{"$f":"100-(T99+U99+W99)","v":1.5632573322853887},{"$f":"IF((S101+W101)>100,W101*100/(S101+W101),W101)","v":1.128528403404971},{"$f":"IF((X101+AB101)>100,X101*100/(X101+AB101),X101)","v":99.262577850021501},{"$f":"X99*AVERAGEIF(Y105:Y116,\">0\")/100","v":96.979538559470996},{"$f":"X99*(100-AVERAGEIF(Y105:Y116,\">0\"))/100","v":2.2830392905504917},{"$f":"100-(Y99+Z99+AB99)","v":0.64873714697105811},{"$f":"IF((X101+AB101)>100,AB101*100/(X101+AB101),AB101)","v":8.8685003007453744E-2}]
[null,null,{"$f":"MaxTarget(C105:C116)","v":2018},{"$f":"IF((D102+H102)>100,D102*100/(D102+H102),D102)","v":78.845519092406903},{"$f":"D100*AVERAGEIF(E105:E116,\">0\")/100","v":58.266838609288705},{"$f":"D100*(100-AVERAGEIF(E105:E116,\">0\"))/100","v":20.578680483118195},{"$f":"100-(E100+F100+H100)","v":5.0521183336768445},{"$f":"IF((D102+H102)>100,H102*100/(D102+H102),H102)","v":16.102362573916253},{"$f":"IF((I102+M102)>100,I102*100/(I102+M102),I102)","v":97.494253103563551},{"$f":"I100*AVERAGEIF(J105:J116,\">0\")/100","v":84.820000200100296},{"$f":"I100*(100-AVERAGEIF(J105:J116,\">0\"))/100","v":12.674252903463262},{"$f":"100-(J100+K100+M100)","v":1.6421143662257691},{"$f":"IF((I102+M102)>100,M102*100/(I102+M102),M102)","v":0.86363253021067976},{"$f":"IF((N102+R102)>100,N102*100/(N102+R102),N102)","v":98.029159754416526},{"$f":"N100*AVERAGEIF(O105:O116,\">0\")/100","v":92.735585127678021},{"$f":"N100*(100-AVERAGEIF(O105:O116,\">0\"))/100","v":5.293574626738498},{"$f":"100-(O100+P100+R100)","v":1.6210470437835625},{"$f":"IF((N102+R102)>100,R102*100/(N102+R102),R102)","v":0.34979320179991191},{"$f":"IF((S102+W102)>100,S102*100/(S102+W102),S102)","v":99.165297622615071},{"$f":"S100*AVERAGEIF(T105:T116,\">0\")/100","v":95.198685717710475},{"$f":"S100*(100-AVERAGEIF(T105:T116,\">0\"))/100","v":3.9666119049046027},{"$f":"100-(T100+U100+W100)","v":0.78945711128574203},{"$f":"IF((S102+W102)>100,W102*100/(S102+W102),W102)","v":4.5245266099186665E-2},{"$f":"IF((X102+AB102)>100,X102*100/(X102+AB102),X102)","v":98.139570358329706},{"$f":"X100*AVERAGEIF(Y105:Y116,\">0\")/100","v":95.882360240088133},{"$f":"X100*(100-AVERAGEIF(Y105:Y116,\">0\"))/100","v":2.2572101182415802},{"$f":"100-(Y100+Z100+AB100)","v":1.8604296416702937},{"$f":"IF((X102+AB102)>100,AB102*100/(X102+AB102),AB102)","v":0}]
["Regression period:",null,{"$f":"MinRegYear(C99,C105:C116)","v":2000},{"$f":"IF(MAX(C105:C116)-MIN(C105:C116)<5,AVERAGEIF(C105:C116,\">0\",D105:D116),\nIF(FORECAST($C101,D$105:D$116,$C$105:$C$116)<0,0,\nIF(FORECAST($C101,D$105:D$116,$C$105:$C$116)>100,100,\nFORECAST($C101,D$105:D$116,$C$105:$C$116))))","v":46.326885445559128},null,null,null,{"$f":"IF(MAX(C105:C116)-MIN(C105:C116)<5,AVERAGEIF(C105:C116,\">0\",H105:H116),\nIF(FORECAST($C101,H$105:H$116,$C$105:$C$116)<0,0,\nIF(FORECAST($C101,H$105:H$116,$C$105:$C$116)>100,100,\nFORECAST($C101,H$105:H$116,$C$105:$C$116))))","v":36.385824556501575},{"$f":"IF(MAX(C105:C116)-MIN(C105:C116)<5,AVERAGEIF(C105:C116,\">0\",I105:I116),\nIF(FORECAST($C101,I$105:I$116,$C$105:$C$116)<0,0,\nIF(FORECAST($C101,I$105:I$116,$C$105:$C$116)>100,100,\nFORECAST($C101,I$105:I$116,$C$105:$C$116))))","v":75.134481378619057},null,null,null,{"$f":"IF(MAX(C105:C116)-MIN(C105:C116)<5,AVERAGEIF(C105:C116,\">0\",M105:M116),\nIF(FORECAST($C101,M$105:M$116,$C$105:$C$116)<0,0,\nIF(FORECAST($C101,M$105:M$116,$C$105:$C$116)>100,100,\nFORECAST($C101,M$105:M$116,$C$105:$C$116))))","v":13.718204818736695},{"$f":"IF(MAX(C105:C116)-MIN(C105:C116)<5,AVERAGEIF(C105:C116,\">0\",N105:N116),\nIF(FORECAST($C101,N$105:N$116,$C$105:$C$116)<0,0,\nIF(FORECAST($C101,N$105:N$116,$C$105:$C$116)>100,100,\nFORECAST($C101,N$105:N$116,$C$105:$C$116))))","v":94.32504147350113},null,null,null,{"$f":"IF(MAX(C105:C116)-MIN(C105:C116)<5,AVERAGEIF(C105:C116,\">0\",R105:R116),\nIF(FORECAST($C101,R$105:R$116,$C$105:$C$116)<0,0,\nIF(FORECAST($C101,R$105:R$116,$C$105:$C$116)>100,100,\nFORECAST($C101,R$105:R$116,$C$105:$C$116))))","v":2.1012407892005456},{"$f":"IF(MAX(C105:C116)-MIN(C105:C116)<5,AVERAGEIF(C105:C116,\">0\",S105:S116),\nIF(FORECAST($C101,S$105:S$116,$C$105:$C$116)<0,0,\nIF(FORECAST($C101,S$105:S$116,$C$105:$C$116)>100,100,\nFORECAST($C101,S$105:S$116,$C$105:$C$116))))","v":97.30821426430964},null,null,null,{"$f":"IF(MAX(C105:C116)-MIN(C105:C116)<5,AVERAGEIF(C105:C116,\">0\",W105:W116),\nIF(FORECAST($C101,W$105:W$116,$C$105:$C$116)<0,0,\nIF(FORECAST($C101,W$105:W$116,$C$105:$C$116)>100,100,\nFORECAST($C101,W$105:W$116,$C$105:$C$116))))","v":1.128528403404971},{"$f":"IF(MAX(C105:C116)-MIN(C105:C116)<5,AVERAGEIF(C105:C116,\">0\",X105:X116),\nIF(FORECAST($C101,X$105:X$116,$C$105:$C$116)<0,0,\nIF(FORECAST($C101,X$105:X$116,$C$105:$C$116)>100,100,\nFORECAST($C101,X$105:X$116,$C$105:$C$116))))","v":99.262577850021501},null,null,null,{"$f":"IF(MAX(C105:C116)-MIN(C105:C116)<5,AVERAGEIF(C105:C116,\">0\",AB105:AB116),\nIF(FORECAST($C101,AB$105:AB$116,$C$105:$C$116)<0,0,\nIF(FORECAST($C101,AB$105:AB$116,$C$105:$C$116)>100,100,\nFORECAST($C101,AB$105:AB$116,$C$105:$C$116))))","v":8.8685003007453744E-2}]
[null,null,{"$f":"MaxRegYear(C100,C105:C116)","v":2014},{"$f":"IF(MAX(C105:C116)-MIN(C105:C116)<5,AVERAGEIF(C105:C116,\">0\",D105:D116),\nIF(FORECAST($C102,D$105:D$116,$C$105:$C$116)<0,0,\nIF(FORECAST($C102,D$105:D$116,$C$105:$C$116)>100,100,\nFORECAST($C102,D$105:D$116,$C$105:$C$116))))","v":78.845519092406903},null,null,null,{"$f":"IF(MAX(C105:C116)-MIN(C105:C116)<5,AVERAGEIF(C105:C116,\">0\",H105:H116),\nIF(FORECAST($C102,H$105:H$116,$C$105:$C$116)<0,0,\nIF(FORECAST($C102,H$105:H$116,$C$105:$C$116)>100,100,\nFORECAST($C102,H$105:H$116,$C$105:$C$116))))","v":16.102362573916253},{"$f":"IF(MAX(C105:C116)-MIN(C105:C116)<5,AVERAGEIF(C105:C116,\">0\",I105:I116),\nIF(FORECAST($C102,I$105:I$116,$C$105:$C$116)<0,0,\nIF(FORECAST($C102,I$105:I$116,$C$105:$C$116)>100,100,\nFORECAST($C102,I$105:I$116,$C$105:$C$116))))","v":97.494253103563551},null,null,null,{"$f":"IF(MAX(C105:C116)-MIN(C105:C116)<5,AVERAGEIF(C105:C116,\">0\",M105:M116),\nIF(FORECAST($C102,M$105:M$116,$C$105:$C$116)<0,0,\nIF(FORECAST($C102,M$105:M$116,$C$105:$C$116)>100,100,\nFORECAST($C102,M$105:M$116,$C$105:$C$116))))","v":0.86363253021067976},{"$f":"IF(MAX(C105:C116)-MIN(C105:C116)<5,AVERAGEIF(C105:C116,\">0\",N105:N116),\nIF(FORECAST($C102,N$105:N$116,$C$105:$C$116)<0,0,\nIF(FORECAST($C102,N$105:N$116,$C$105:$C$116)>100,100,\nFORECAST($C102,N$105:N$116,$C$105:$C$116))))","v":98.029159754416526},null,null,null,{"$f":"IF(MAX(C105:C116)-MIN(C105:C116)<5,AVERAGEIF(C105:C116,\">0\",R105:R116),\nIF(FORECAST($C102,R$105:R$116,$C$105:$C$116)<0,0,\nIF(FORECAST($C102,R$105:R$116,$C$105:$C$116)>100,100,\nFORECAST($C102,R$105:R$116,$C$105:$C$116))))","v":0.34979320179991191},{"$f":"IF(MAX(C105:C116)-MIN(C105:C116)<5,AVERAGEIF(C105:C116,\">0\",S105:S116),\nIF(FORECAST($C102,S$105:S$116,$C$105:$C$116)<0,0,\nIF(FORECAST($C102,S$105:S$116,$C$105:$C$116)>100,100,\nFORECAST($C102,S$105:S$116,$C$105:$C$116))))","v":99.165297622615071},null,null,null,{"$f":"IF(MAX(C105:C116)-MIN(C105:C116)<5,AVERAGEIF(C105:C116,\">0\",W105:W116),\nIF(FORECAST($C102,W$105:W$116,$C$105:$C$116)<0,0,\nIF(FORECAST($C102,W$105:W$116,$C$105:$C$116)>100,100,\nFORECAST($C102,W$105:W$116,$C$105:$C$116))))","v":4.5245266099186665E-2},{"$f":"IF(MAX(C105:C116)-MIN(C105:C116)<5,AVERAGEIF(C105:C116,\">0\",X105:X116),\nIF(FORECAST($C102,X$105:X$116,$C$105:$C$116)<0,0,\nIF(FORECAST($C102,X$105:X$116,$C$105:$C$116)>100,100,\nFORECAST($C102,X$105:X$116,$C$105:$C$116))))","v":98.139570358329706},null,null,null,{"$f":"IF(MAX(C105:C116)-MIN(C105:C116)<5,AVERAGEIF(C105:C116,\">0\",AB105:AB116),\nIF(FORECAST($C102,AB$105:AB$116,$C$105:$C$116)<0,0,\nIF(FORECAST($C102,AB$105:AB$116,$C$105:$C$116)>100,100,\nFORECAST($C102,AB$105:AB$116,$C$105:$C$116))))","v":0}]
[]
[null,"Survey","Year","Improved","% Improved\n< = 30min",null,null,"Surface water","Improved","% Improved\n< = 30min",null,null,"Surface water","Improved","% Improved\n< = 30min",null,null,"Surface water","Improved","% Improved\n< = 30min",null,null,"Surface water","Improved","% Improved\n< = 30min",null,null,"Surface water"]
[null,"DHS00",2000,{"$f":"IF(ISERROR(INDIRECT(CONCATENATE($B105,\"!C16\"))),\"\",INDIRECT(CONCATENATE($B105,\"!C16\")))","v":46.326885445559093},{"$f":"IF(ISERROR(INDIRECT(CONCATENATE($B105,\"!C23\"))),\"\",INDIRECT(CONCATENATE($B105,\"!C23\")))","v":"N/A"},null,null,{"$f":"IF(ISERROR(INDIRECT(CONCATENATE($B105,\"!C21\"))),\"\",INDIRECT(CONCATENATE($B105,\"!C21\")))","v":36.385824556501412},{"$f":"IF(ISERROR(INDIRECT(CONCATENATE($B105,\"!D16\"))),\"\",INDIRECT(CONCATENATE($B105,\"!D16\")))","v":75.134481378619029},{"$f":"IF(ISERROR(INDIRECT(CONCATENATE($B105,\"!D23\"))),\"\",INDIRECT(CONCATENATE($B105,\"!D23\")))","v":"N/A"},null,null,{"$f":"IF(ISERROR(INDIRECT(CONCATENATE($B105,\"!D21\"))),\"\",INDIRECT(CONCATENATE($B105,\"!D21\")))","v":13.718204818736531},{"$f":"IF(ISERROR(INDIRECT(CONCATENATE($B105,\"!E16\"))),\"\",INDIRECT(CONCATENATE($B105,\"!E16\")))","v":94.325041473501088},{"$f":"IF(ISERROR(INDIRECT(CONCATENATE($B105,\"!E23\"))),\"\",INDIRECT(CONCATENATE($B105,\"!E23\")))","v":"N/A"},null,null,{"$f":"IF(ISERROR(INDIRECT(CONCATENATE($B105,\"!E21\"))),\"\",INDIRECT(CONCATENATE($B105,\"!E21\")))","v":2.1012407892005407},{"$f":"IF(ISERROR(INDIRECT(CONCATENATE($B105,\"!F16\"))),\"\",INDIRECT(CONCATENATE($B105,\"!F16\")))","v":97.30821426430964},{"$f":"IF(ISERROR(INDIRECT(CONCATENATE($B105,\"!F23\"))),\"\",INDIRECT(CONCATENATE($B105,\"!F23\")))","v":"N/A"},null,null,{"$f":"IF(ISERROR(INDIRECT(CONCATENATE($B105,\"!F21\"))),\"\",INDIRECT(CONCATENATE($B105,\"!F21\")))","v":1.1285284034049592},{"$f":"IF(ISERROR(INDIRECT(CONCATENATE($B105,\"!G16\"))),\"\",INDIRECT(CONCATENATE($B105,\"!G16\")))","v":99.262577850021529},{"$f":"IF(ISERROR(INDIRECT(CONCATENATE($B105,\"!G23\"))),\"\",INDIRECT(CONCATENATE($B105,\"!G23\")))","v":"N/A"},null,null,{"$f":"IF(ISERROR(INDIRECT(CONCATENATE($B105,\"!G221\"))),\"\",INDIRECT(CONCATENATE($B105,\"!G21\")))","v":8.8685003007453647E-2}]
[null,"DHS12",2012,74.2,73.900000000000006,null,null,19,94.3,87,null,null,2.7,97.5,94.6,null,null,0.6,98.9,96,null,null,0.2,98.3,97.7,null,null,0]
[null,null,null,"","",null,null,"","","",null,null,"","","",null,null,"","","",null,null,"","","",null,null,""]
[null,null,null,"","",null,null,"","","",null,null,"","","",null,null,"","","",null,null,"","","",null,null,""]
[null,null,null,"","",null,null,"","","",null,null,"","","",null,null,"","","",null,null,"","","",null,null,""]
[null,null,null,"","",null,null,"","","",null,null,"","","",null,null,"","","",null,null,"","","",null,null,""]
[null,null,null,{"$f":"IF(ISERROR(INDIRECT(CONCATENATE($B111,\"!C16\"))),\"\",INDIRECT(CONCATENATE($B111,\"!C16\")))","v":""},{"$f":"IF(ISERROR(INDIRECT(CONCATENATE($B111,\"!C23\"))),\"\",INDIRECT(CONCATENATE($B111,\"!C23\")))","v":""},null,null,{"$f":"IF(ISERROR(INDIRECT(CONCATENATE($B111,\"!C21\"))),\"\",INDIRECT(CONCATENATE($B111,\"!C21\")))","v":""},{"$f":"IF(ISERROR(INDIRECT(CONCATENATE($B111,\"!D16\"))),\"\",INDIRECT(CONCATENATE($B111,\"!D16\")))","v":""},{"$f":"IF(ISERROR(INDIRECT(CONCATENATE($B111,\"!D23\"))),\"\",INDIRECT(CONCATENATE($B111,\"!D23\")))","v":""},null,null,{"$f":"IF(ISERROR(INDIRECT(CONCATENATE($B111,\"!D21\"))),\"\",INDIRECT(CONCATENATE($B111,\"!D21\")))","v":""},{"$f":"IF(ISERROR(INDIRECT(CONCATENATE($B111,\"!E16\"))),\"\",INDIRECT(CONCATENATE($B111,\"!E16\")))","v":""},{"$f":"IF(ISERROR(INDIRECT(CONCATENATE($B111,\"!E23\"))),\"\",INDIRECT(CONCATENATE($B111,\"!E23\")))","v":""},null,null,{"$f":"IF(ISERROR(INDIRECT(CONCATENATE($B111,\"!E21\"))),\"\",INDIRECT(CONCATENATE($B111,\"!E21\")))","v":""},{"$f":"IF(ISERROR(INDIRECT(CONCATENATE($B111,\"!F16\"))),\"\",INDIRECT(CONCATENATE($B111,\"!F16\")))","v":""},{"$f":"IF(ISERROR(INDIRECT(CONCATENATE($B111,\"!F23\"))),\"\",INDIRECT(CONCATENATE($B111,\"!F23\")))","v":""},null,null,{"$f":"IF(ISERROR(INDIRECT(CONCATENATE($B111,\"!F21\"))),\"\",INDIRECT(CONCATENATE($B111,\"!F21\")))","v":""},{"$f":"IF(ISERROR(INDIRECT(CONCATENATE($B111,\"!G16\"))),\"\",INDIRECT(CONCATENATE($B111,\"!G16\")))","v":""},{"$f":"IF(ISERROR(INDIRECT(CONCATENATE($B111,\"!G23\"))),\"\",INDIRECT(CONCATENATE($B111,\"!G23\")))","v":""},null,null,{"$f":"IF(ISERROR(INDIRECT(CONCATENATE($B111,\"!G221\"))),\"\",INDIRECT(CONCATENATE($B111,\"!G21\")))","v":""}]
[null,null,null,{"$f":"IF(ISERROR(INDIRECT(CONCATENATE($B112,\"!C16\"))),\"\",INDIRECT(CONCATENATE($B112,\"!C16\")))","v":""},{"$f":"IF(ISERROR(INDIRECT(CONCATENATE($B112,\"!C23\"))),\"\",INDIRECT(CONCATENATE($B112,\"!C23\")))","v":""},null,null,{"$f":"IF(ISERROR(INDIRECT(CONCATENATE($B112,\"!C21\"))),\"\",INDIRECT(CONCATENATE($B112,\"!C21\")))","v":""},{"$f":"IF(ISERROR(INDIRECT(CONCATENATE($B112,\"!D16\"))),\"\",INDIRECT(CONCATENATE($B112,\"!D16\")))","v":""},{"$f":"IF(ISERROR(INDIRECT(CONCATENATE($B112,\"!D23\"))),\"\",INDIRECT(CONCATENATE($B112,\"!D23\")))","v":""},null,null,{"$f":"IF(ISERROR(INDIRECT(CONCATENATE($B112,\"!D21\"))),\"\",INDIRECT(CONCATENATE($B112,\"!D21\")))","v":""},{"$f":"IF(ISERROR(INDIRECT(CONCATENATE($B112,\"!E16\"))),\"\",INDIRECT(CONCATENATE($B112,\"!E16\")))","v":""},{"$f":"IF(ISERROR(INDIRECT(CONCATENATE($B112,\"!E23\"))),\"\",INDIRECT(CONCATENATE($B112,\"!E23\")))","v":""},null,null,{"$f":"IF(ISERROR(INDIRECT(CONCATENATE($B112,\"!E21\"))),\"\",INDIRECT(CONCATENATE($B112,\"!E21\")))","v":""},{"$f":"IF(ISERROR(INDIRECT(CONCATENATE($B112,\"!F16\"))),\"\",INDIRECT(CONCATENATE($B112,\"!F16\")))","v":""},{"$f":"IF(ISERROR(INDIRECT(CONCATENATE($B112,\"!F23\"))),\"\",INDIRECT(CONCATENATE($B112,\"!F23\")))","v":""},null,null,{"$f":"IF(ISERROR(INDIRECT(CONCATENATE($B112,\"!F21\"))),\"\",INDIRECT(CONCATENATE($B112,\"!F21\")))","v":""},{"$f":"IF(ISERROR(INDIRECT(CONCATENATE($B112,\"!G16\"))),\"\",INDIRECT(CONCATENATE($B112,\"!G16\")))","v":""},{"$f":"IF(ISERROR(INDIRECT(CONCATENATE($B112,\"!G23\"))),\"\",INDIRECT(CONCATENATE($B112,\"!G23\")))","v":""},null,null,{"$f":"IF(ISERROR(INDIRECT(CONCATENATE($B112,\"!G221\"))),\"\",INDIRECT(CONCATENATE($B112,\"!G21\")))","v":""}]
[null,null,null,"","",null,null,"","","",null,null,"","","",null,null,"","","",null,null,"","","",null,null,""]
[null,null,null,"","",null,null,"","","",null,null,"","","",null,null,"","","",null,null,"","","",null,null,""]
[null,null,null,"","",null,null,"","","",null,null,"","","",null,null,"","","",null,null,"","","",null,null,""]
[null,null,null,"","",null,null,"","","",null,null,"","","",null,null,"","","",null,null,"","","",null,null,""]
[]
[null,{"$f":"CONCATENATE(\"National use of drinking water sources, \",C99,\"–\",C100)","v":"National use of drinking water sources, 2000–2018"},null,null,null,null,null,null,null,null,null,null,null,null,null,null,null,null,"Data points used for regression"]
[]
[]
[]
[]
[]
[]
[]
[]
[]
[]
[]
[]
[]
[]
[]
[]
[]
[]
[]
[]
[]
[]
[]
[]
[]
[]
[]
[]
[]
[]
[]
[]
[]
[]
[null,null,null,null,{"$f":"IF(ISERROR(INDIRECT(CONCATENATE($B153,\"!M18\"))),\"\",INDIRECT(CONCATENATE($B153,\"!M18\")))","v":""},{"$f":"IF(ISERROR(INDIRECT(CONCATENATE($B153,\"!M19\"))),\"\",INDIRECT(CONCATENATE($B153,\"!M19\")))","v":""},{"$f":"IF(ISERROR(INDIRECT(CONCATENATE($B153,\"!M20\"))),\"\",INDIRECT(CONCATENATE($B153,\"!M20\")))","v":""},{"$f":"IF(ISERROR(INDIRECT(CONCATENATE($B153,\"!M21\"))),\"\",INDIRECT(CONCATENATE($B153,\"!M21\")))","v":""},null,{"$f":"IF(ISERROR(INDIRECT(CONCATENATE($B153,\"!N18\"))),\"\",INDIRECT(CONCATENATE($B153,\"!N18\")))","v":""},{"$f":"IF(ISERROR(INDIRECT(CONCATENATE($B153,\"!N19\"))),\"\",INDIRECT(CONCATENATE($B153,\"!N19\")))","v":""},{"$f":"IF(ISERROR(INDIRECT(CONCATENATE($B153,\"!N20\"))),\"\",INDIRECT(CONCATENATE($B153,\"!N20\")))","v":""},{"$f":"IF(ISERROR(INDIRECT(CONCATENATE($B153,\"!N21\"))),\"\",INDIRECT(CONCATENATE($B153,\"!N21\")))","v":""},null,{"$f":"IF(ISERROR(INDIRECT(CONCATENATE($B153,\"!O18\"))),\"\",INDIRECT(CONCATENATE($B153,\"!O18\")))","v":""},{"$f":"IF(ISERROR(INDIRECT(CONCATENATE($B153,\"!O19\"))),\"\",INDIRECT(CONCATENATE($B153,\"!O19\")))","v":""},{"$f":"IF(ISERROR(INDIRECT(CONCATENATE($B153,\"!O20\"))),\"\",INDIRECT(CONCATENATE($B153,\"!O20\")))","v":""},{"$f":"IF(ISERROR(INDIRECT(CONCATENATE($B153,\"!O21\"))),\"\",INDIRECT(CONCATENATE($B153,\"!O21\")))","v":""},null,{"$f":"IF(ISERROR(INDIRECT(CONCATENATE($B153,\"!P18\"))),\"\",INDIRECT(CONCATENATE($B153,\"!P18\")))","v":""},{"$f":"IF(ISERROR(INDIRECT(CONCATENATE($B153,\"!P19\"))),\"\",INDIRECT(CONCATENATE($B153,\"!P19\")))","v":""},{"$f":"IF(ISERROR(INDIRECT(CONCATENATE($B153,\"!P20\"))),\"\",INDIRECT(CONCATENATE($B153,\"!P20\")))","v":""},{"$f":"IF(ISERROR(INDIRECT(CONCATENATE($B153,\"!P21\"))),\"\",INDIRECT(CONCATENATE($B153,\"!P21\")))","v":""},null,{"$f":"IF(ISERROR(INDIRECT(CONCATENATE($B153,\"!Q18\"))),\"\",INDIRECT(CONCATENATE($B153,\"!Q18\")))","v":""},{"$f":"IF(ISERROR(INDIRECT(CONCATENATE($B153,\"!Q19\"))),\"\",INDIRECT(CONCATENATE($B153,\"!Q19\")))","v":""},{"$f":"IF(ISERROR(INDIRECT(CONCATENATE($B153,\"!Q20\"))),\"\",INDIRECT(CONCATENATE($B153,\"!Q20\")))","v":""},{"$f":"IF(ISERROR(INDIRECT(CONCATENATE($B153,\"!Q21\"))),\"\",INDIRECT(CONCATENATE($B153,\"!Q1\")))","v":""}]
[null,null,null,null,"","","","",null,"","","","",null,"","","","",null,"","","","",null,"","","",""]
[null,null,null,null,"","","","",null,"","","","",null,"","","","",null,"","","","",null,"","","",""]
[null,null,null,null,"","","","",null,"","","","",null,"","","","",null,"","","","",null,"","","",""]
[null,null,null,null,"","","","",null,"","","","",null,"","","","",null,"","","","",null,"","","",""]
[null,null,null,null,"","","","",null,"","","","",null,"","","","",null,"","","","",null,"","","",""]
[]
[]
[]
[]
[]
[]
[]
[]
[]
[]
[]
[]
[]
[]
[]
[]
[]
[]
[]
[]
[]
[]
[]
[]
[]
[]
[]
[]
[]
[]
[]
[]
[]
[]
[]
[]
[]
[]
["URBAN",null,null,"Poorest",null,null,null,null,"Poor",null,null,null,null,"Middle",null,null,null,null,"Rich",null,null,null,null,"Richest"]
[null,null,null,"Improved","Basic","Limited","Unimproved","Surface water","Improved","Basic","Limited","Unimproved","Surface water","Improved","Basic","Limited","Unimproved","Surface water","Improved","Basic","Limited","Unimproved","Surface water","Improved","Basic","Limited","Unimproved","Surface water"]
["Forecast period:",null,{"$f":"MinBase(C205:C216)","v":2000},{"$f":"IF((D201+H201)>100,D201*100/(D201+H201),D201)","v":80.584344089621482},{"$f":"D199*AVERAGEIF(E205:E216,\">0\")/100","v":61.888776260829303},{"$f":"D199*(100-AVERAGEIF(E205:E216,\">0\"))/100","v":18.695567828792186},{"$f":"100-(E199+F199+H199)","v":10.815945191038281},{"$f":"IF((D201+H201)>100,H201*100/(D201+H201),H201)","v":8.5997107193402371},{"$f":"IF((I201+M201)>100,I201*100/(I201+M201),I201)","v":96.255909653626532},{"$f":"I199*AVERAGEIF(J205:J216,\">0\")/100","v":88.940460519950918},{"$f":"I199*(100-AVERAGEIF(J205:J216,\">0\"))/100","v":7.3154491336756111},{"$f":"100-(J199+K199+M199)","v":2.8041723936432561},{"$f":"IF((I201+M201)>100,M201*100/(I201+M201),M201)","v":0.93991795273021239},{"$f":"IF((N201+R201)>100,N201*100/(N201+R201),N201)","v":97.845806157244397},{"$f":"N199*AVERAGEIF(O205:O216,\">0\")/100","v":94.323357135583606},{"$f":"N199*(100-AVERAGEIF(O205:O216,\">0\"))/100","v":3.5224490216607927},{"$f":"100-(O199+P199+R199)","v":1.6524180093268228},{"$f":"IF((N201+R201)>100,R201*100/(N201+R201),R201)","v":0.50177583342878762},{"$f":"IF((S201+W201)>100,S201*100/(S201+W201),S201)","v":99.359608972943704},{"$f":"S199*AVERAGEIF(T205:T216,\">0\")/100","v":96.180101485809502},{"$f":"S199*(100-AVERAGEIF(T205:T216,\">0\"))/100","v":3.1795074871342011},{"$f":"100-(T199+U199+W199)","v":0.48843107580682954},{"$f":"IF((S201+W201)>100,W201*100/(S201+W201),W201)","v":0.15195995124945938},{"$f":"IF((X201+AB201)>100,X201*100/(X201+AB201),X201)","v":99.442178396434684},{"$f":"X199*AVERAGEIF(Y205:Y216,\">0\")/100","v":96.956123936523824},{"$f":"X199*(100-AVERAGEIF(Y205:Y216,\">0\"))/100","v":2.4860544599108669},{"$f":"100-(Y199+Z199+AB199)","v":0.4759185717839074},{"$f":"IF((X201+AB201)>100,AB201*100/(X201+AB201),AB201)","v":8.1903031781404678E-2}]
[null,null,{"$f":"MaxTarget(C205:C216)","v":2018},{"$f":"IF((D202+H202)>100,D202*100/(D202+H202),D202)","v":94.485942651729601},{"$f":"D200*AVERAGEIF(E205:E216,\">0\")/100","v":72.565203956528336},{"$f":"D200*(100-AVERAGEIF(E205:E216,\">0\"))/100","v":21.920738695201273},{"$f":"100-(E200+F200+H200)","v":4.3806758014939078},{"$f":"IF((D202+H202)>100,H202*100/(D202+H202),H202)","v":1.1333815467764907},{"$f":"IF((I202+M202)>100,I202*100/(I202+M202),I202)","v":97.707348391062254},{"$f":"I200*AVERAGEIF(J205:J216,\">0\")/100","v":90.28158991334152},{"$f":"I200*(100-AVERAGEIF(J205:J216,\">0\"))/100","v":7.4257584777207262},{"$f":"100-(J200+K200+M200)","v":1.9826379343927982},{"$f":"IF((I202+M202)>100,M202*100/(I202+M202),M202)","v":0.31001367454496176},{"$f":"IF((N202+R202)>100,N202*100/(N202+R202),N202)","v":99.775698973792544},{"$f":"N200*AVERAGEIF(O205:O216,\">0\")/100","v":96.183773810736014},{"$f":"N200*(100-AVERAGEIF(O205:O216,\">0\"))/100","v":3.5919251630565259},{"$f":"100-(O200+P200+R200)","v":7.4596998445585427E-2},{"$f":"IF((N202+R202)>100,R202*100/(N202+R202),R202)","v":0.14970402776187086},{"$f":"IF((S202+W202)>100,S202*100/(S202+W202),S202)","v":98.940065171176045},{"$f":"S200*AVERAGEIF(T205:T216,\">0\")/100","v":95.773983085698404},{"$f":"S200*(100-AVERAGEIF(T205:T216,\">0\"))/100","v":3.1660820854776364},{"$f":"100-(T200+U200+W200)","v":1.0599348288239554},{"$f":"IF((S202+W202)>100,W202*100/(S202+W202),W202)","v":0},{"$f":"IF((X202+AB202)>100,X202*100/(X202+AB202),X202)","v":97.876303600594241},{"$f":"X200*AVERAGEIF(Y205:Y216,\">0\")/100","v":95.429396010579381},{"$f":"X200*(100-AVERAGEIF(Y205:Y216,\">0\"))/100","v":2.446907590014856},{"$f":"100-(Y200+Z200+AB200)","v":2.1236963994057589},{"$f":"IF((X202+AB202)>100,AB202*100/(X202+AB202),AB202)","v":0}]
["Regression period:",null,{"$f":"MinRegYear(C199,C205:C216)","v":2000},{"$f":"IF(MAX(C205:C216)-MIN(C205:C216)<5,AVERAGEIF(C205:C216,\">0\",D205:D216),\nIF(FORECAST($C201,D$205:D$216,$C$205:$C$216)<0,0,\nIF(FORECAST($C201,D$205:D$216,$C$205:$C$216)>100,100,\nFORECAST($C201,D$205:D$216,$C$205:$C$216))))","v":80.584344089621482},null,null,null,{"$f":"IF(MAX(C205:C216)-MIN(C205:C216)<5,AVERAGEIF(C205:C216,\">0\",H205:H216),\nIF(FORECAST($C201,H$205:H$216,$C$205:$C$216)<0,0,\nIF(FORECAST($C201,H$205:H$216,$C$205:$C$216)>100,100,\nFORECAST($C201,H$205:H$216,$C$205:$C$216))))","v":8.5997107193402371},{"$f":"IF(MAX(C205:C216)-MIN(C205:C216)<5,AVERAGEIF(C205:C216,\">0\",I205:I216),\nIF(FORECAST($C201,I$205:I$216,$C$205:$C$216)<0,0,\nIF(FORECAST($C201,I$205:I$216,$C$205:$C$216)>100,100,\nFORECAST($C201,I$205:I$216,$C$205:$C$216))))","v":96.255909653626532},null,null,null,{"$f":"IF(MAX(C205:C216)-MIN(C205:C216)<5,AVERAGEIF(C205:C216,\">0\",M205:M216),\nIF(FORECAST($C201,M$205:M$216,$C$205:$C$216)<0,0,\nIF(FORECAST($C201,M$205:M$216,$C$205:$C$216)>100,100,\nFORECAST($C201,M$205:M$216,$C$205:$C$216))))","v":0.93991795273021239},{"$f":"IF(MAX(C205:C216)-MIN(C205:C216)<5,AVERAGEIF(C205:C216,\">0\",N205:N216),\nIF(FORECAST($C201,N$205:N$216,$C$205:$C$216)<0,0,\nIF(FORECAST($C201,N$205:N$216,$C$205:$C$216)>100,100,\nFORECAST($C201,N$205:N$216,$C$205:$C$216))))","v":97.845806157244397},null,null,null,{"$f":"IF(MAX(C205:C216)-MIN(C205:C216)<5,AVERAGEIF(C205:C216,\">0\",R205:R216),\nIF(FORECAST($C201,R$205:R$216,$C$205:$C$216)<0,0,\nIF(FORECAST($C201,R$205:R$216,$C$205:$C$216)>100,100,\nFORECAST($C201,R$205:R$216,$C$205:$C$216))))","v":0.50177583342878762},{"$f":"IF(MAX(C205:C216)-MIN(C205:C216)<5,AVERAGEIF(C205:C216,\">0\",S205:S216),\nIF(FORECAST($C201,S$205:S$216,$C$205:$C$216)<0,0,\nIF(FORECAST($C201,S$205:S$216,$C$205:$C$216)>100,100,\nFORECAST($C201,S$205:S$216,$C$205:$C$216))))","v":99.359608972943704},null,null,null,{"$f":"IF(MAX(C205:C216)-MIN(C205:C216)<5,AVERAGEIF(C205:C216,\">0\",W205:W216),\nIF(FORECAST($C201,W$205:W$216,$C$205:$C$216)<0,0,\nIF(FORECAST($C201,W$205:W$216,$C$205:$C$216)>100,100,\nFORECAST($C201,W$205:W$216,$C$205:$C$216))))","v":0.15195995124945938},{"$f":"IF(MAX(C205:C216)-MIN(C205:C216)<5,AVERAGEIF(C205:C216,\">0\",X205:X216),\nIF(FORECAST($C201,X$205:X$216,$C$205:$C$216)<0,0,\nIF(FORECAST($C201,X$205:X$216,$C$205:$C$216)>100,100,\nFORECAST($C201,X$205:X$216,$C$205:$C$216))))","v":99.442178396434684},null,null,null,{"$f":"IF(MAX(C205:C216)-MIN(C205:C216)<5,AVERAGEIF(C205:C216,\">0\",AB205:AB216),\nIF(FORECAST($C201,AB$205:AB$216,$C$205:$C$216)<0,0,\nIF(FORECAST($C201,AB$205:AB$216,$C$205:$C$216)>100,100,\nFORECAST($C201,AB$205:AB$216,$C$205:$C$216))))","v":8.1903031781404678E-2}]
[null,null,{"$f":"MaxRegYear(C200,C205:C216)","v":2014},{"$f":"IF(MAX(C205:C216)-MIN(C205:C216)<5,AVERAGEIF(C205:C216,\">0\",D205:D216),\nIF(FORECAST($C202,D$205:D$216,$C$205:$C$216)<0,0,\nIF(FORECAST($C202,D$205:D$216,$C$205:$C$216)>100,100,\nFORECAST($C202,D$205:D$216,$C$205:$C$216))))","v":94.485942651729601},null,null,null,{"$f":"IF(MAX(C205:C216)-MIN(C205:C216)<5,AVERAGEIF(C205:C216,\">0\",H205:H216),\nIF(FORECAST($C202,H$205:H$216,$C$205:$C$216)<0,0,\nIF(FORECAST($C202,H$205:H$216,$C$205:$C$216)>100,100,\nFORECAST($C202,H$205:H$216,$C$205:$C$216))))","v":1.1333815467764907},{"$f":"IF(MAX(C205:C216)-MIN(C205:C216)<5,AVERAGEIF(C205:C216,\">0\",I205:I216),\nIF(FORECAST($C202,I$205:I$216,$C$205:$C$216)<0,0,\nIF(FORECAST($C202,I$205:I$216,$C$205:$C$216)>100,100,\nFORECAST($C202,I$205:I$216,$C$205:$C$216))))","v":97.707348391062254},null,null,null,{"$f":"IF(MAX(C205:C216)-MIN(C205:C216)<5,AVERAGEIF(C205:C216,\">0\",M205:M216),\nIF(FORECAST($C202,M$205:M$216,$C$205:$C$216)<0,0,\nIF(FORECAST($C202,M$205:M$216,$C$205:$C$216)>100,100,\nFORECAST($C202,M$205:M$216,$C$205:$C$216))))","v":0.31001367454496176},{"$f":"IF(MAX(C205:C216)-MIN(C205:C216)<5,AVERAGEIF(C205:C216,\">0\",N205:N216),\nIF(FORECAST($C202,N$205:N$216,$C$205:$C$216)<0,0,\nIF(FORECAST($C202,N$205:N$216,$C$205:$C$216)>100,100,\nFORECAST($C202,N$205:N$216,$C$205:$C$216))))","v":99.775698973792544},null,null,null,{"$f":"IF(MAX(C205:C216)-MIN(C205:C216)<5,AVERAGEIF(C205:C216,\">0\",R205:R216),\nIF(FORECAST($C202,R$205:R$216,$C$205:$C$216)<0,0,\nIF(FORECAST($C202,R$205:R$216,$C$205:$C$216)>100,100,\nFORECAST($C202,R$205:R$216,$C$205:$C$216))))","v":0.14970402776187086},{"$f":"IF(MAX(C205:C216)-MIN(C205:C216)<5,AVERAGEIF(C205:C216,\">0\",S205:S216),\nIF(FORECAST($C202,S$205:S$216,$C$205:$C$216)<0,0,\nIF(FORECAST($C202,S$205:S$216,$C$205:$C$216)>100,100,\nFORECAST($C202,S$205:S$216,$C$205:$C$216))))","v":98.940065171176045},null,null,null,{"$f":"IF(MAX(C205:C216)-MIN(C205:C216)<5,AVERAGEIF(C205:C216,\">0\",W205:W216),\nIF(FORECAST($C202,W$205:W$216,$C$205:$C$216)<0,0,\nIF(FORECAST($C202,W$205:W$216,$C$205:$C$216)>100,100,\nFORECAST($C202,W$205:W$216,$C$205:$C$216))))","v":0},{"$f":"IF(MAX(C205:C216)-MIN(C205:C216)<5,AVERAGEIF(C205:C216,\">0\",X205:X216),\nIF(FORECAST($C202,X$205:X$216,$C$205:$C$216)<0,0,\nIF(FORECAST($C202,X$205:X$216,$C$205:$C$216)>100,100,\nFORECAST($C202,X$205:X$216,$C$205:$C$216))))","v":97.876303600594241},null,null,null,{"$f":"IF(MAX(C205:C216)-MIN(C205:C216)<5,AVERAGEIF(C205:C216,\">0\",AB205:AB216),\nIF(FORECAST($C202,AB$205:AB$216,$C$205:$C$216)<0,0,\nIF(FORECAST($C202,AB$205:AB$216,$C$205:$C$216)>100,100,\nFORECAST($C202,AB$205:AB$216,$C$205:$C$216))))","v":0}]
[]
[null,"Survey","Year","Improved","% Improved\n< = 30min",null,null,"Surface water","Improved","% Improved\n< = 30min",null,null,"Surface water","Improved","% Improved\n< = 30min",null,null,"Surface water","Improved","% Improved\n< = 30min",null,null,"Surface water","Improved","% Improved\n< = 30min",null,null,"Surface water"]
[null,"DHS00",2000,{"$f":"IF(ISERROR(INDIRECT(CONCATENATE($B205,\"!H16\"))),\"\",INDIRECT(CONCATENATE($B205,\"!H16\")))","v":80.584344089621524},{"$f":"IF(ISERROR(INDIRECT(CONCATENATE($B205,\"!H23\"))),\"\",INDIRECT(CONCATENATE($B205,\"!H23\")))","v":"N/A"},null,null,{"$f":"IF(ISERROR(INDIRECT(CONCATENATE($B205,\"!H21\"))),\"\",INDIRECT(CONCATENATE($B205,\"!H21\")))","v":8.5997107193402815},{"$f":"IF(ISERROR(INDIRECT(CONCATENATE($B205,\"!I16\"))),\"\",INDIRECT(CONCATENATE($B205,\"!I16\")))","v":96.255909653626532},{"$f":"IF(ISERROR(INDIRECT(CONCATENATE($B205,\"!I23\"))),\"\",INDIRECT(CONCATENATE($B205,\"!I23\")))","v":"N/A"},null,null,{"$f":"IF(ISERROR(INDIRECT(CONCATENATE($B205,\"!I21\"))),\"\",INDIRECT(CONCATENATE($B205,\"!I21\")))","v":0.93991795273022616},{"$f":"IF(ISERROR(INDIRECT(CONCATENATE($B205,\"!J16\"))),\"\",INDIRECT(CONCATENATE($B205,\"!J16\")))","v":97.845806157244425},{"$f":"IF(ISERROR(INDIRECT(CONCATENATE($B205,\"!J23\"))),\"\",INDIRECT(CONCATENATE($B205,\"!J23\")))","v":"N/A"},null,null,{"$f":"IF(ISERROR(INDIRECT(CONCATENATE($B205,\"!J21\"))),\"\",INDIRECT(CONCATENATE($B205,\"!J21\")))","v":0.50177583342878618},{"$f":"IF(ISERROR(INDIRECT(CONCATENATE($B205,\"!K16\"))),\"\",INDIRECT(CONCATENATE($B205,\"!K16\")))","v":99.359608972943704},{"$f":"IF(ISERROR(INDIRECT(CONCATENATE($B205,\"!K23\"))),\"\",INDIRECT(CONCATENATE($B205,\"!K23\")))","v":"N/A"},null,null,{"$f":"IF(ISERROR(INDIRECT(CONCATENATE($B205,\"!K21\"))),\"\",INDIRECT(CONCATENATE($B205,\"!K21\")))","v":0.15195995124945808},{"$f":"IF(ISERROR(INDIRECT(CONCATENATE($B205,\"!L16\"))),\"\",INDIRECT(CONCATENATE($B205,\"!L16\")))","v":99.44217839643467},{"$f":"IF(ISERROR(INDIRECT(CONCATENATE($B205,\"!L23\"))),\"\",INDIRECT(CONCATENATE($B205,\"!L23\")))","v":"N/A"},null,null,{"$f":"IF(ISERROR(INDIRECT(CONCATENATE($B205,\"!L221\"))),\"\",INDIRECT(CONCATENATE($B205,\"!L21\")))","v":8.1903031781404761E-2}]
[null,"DHS12",2012,92.5,76.8,null,null,2.2000000000000002,97.5,92.4,null,null,0.4,99.5,96.4,null,null,0.2,99,96.8,null,null,0,98.1,97.5,null,null,0]
[null,null,null,"","",null,null,"","","",null,null,"","","",null,null,"","","",null,null,"","","",null,null,""]
[null,null,null,"","",null,null,"","","",null,null,"","","",null,null,"","","",null,null,"","","",null,null,""]
[null,null,null,"","",null,null,"","","",null,null,"","","",null,null,"","","",null,null,"","","",null,null,""]
[null,null,null,"","",null,null,"","","",null,null,"","","",null,null,"","","",null,null,"","","",null,null,""]
[null,null,null,"","",null,null,"","","",null,null,"","","",null,null,"","","",null,null,"","","",null,null,""]
[null,null,null,"","",null,null,"","","",null,null,"","","",null,null,"","","",null,null,"","","",null,null,""]
[null,null,null,"","",null,null,"","","",null,null,"","","",null,null,"","","",null,null,"","","",null,null,""]
[null,null,null,"","",null,null,"","","",null,null,"","","",null,null,"","","",null,null,"","","",null,null,""]
[null,null,null,"","",null,null,"","","",null,null,"","","",null,null,"","","",null,null,"","","",null,null,""]
[null,null,null,"","",null,null,"","","",null,null,"","","",null,null,"","","",null,null,"","","",null,null,""]
[]
[null,{"$f":"CONCATENATE(\"Urban use of drinking water sources,  \",C199,\"–\",C200)","v":"Urban use of drinking water sources,  2000–2018"},null,null,null,null,null,null,null,null,null,null,null,null,null,null,null,null,"Data points used for regression"]
[]
[]
[]
[]
[]
[]
[]
[]
[]
[]
[]
[]
[]
[]
[]
[]
[]
[]
[]
[]
[]
[]
[]
[]
[]
[]
[]
[]
[]
[]
[]
[]
[]
[]
[null,null,null,null,{"$f":"IF(ISERROR(INDIRECT(CONCATENATE($B253,\"!M18\"))),\"\",INDIRECT(CONCATENATE($B253,\"!M18\")))","v":""},{"$f":"IF(ISERROR(INDIRECT(CONCATENATE($B253,\"!M19\"))),\"\",INDIRECT(CONCATENATE($B253,\"!M19\")))","v":""},{"$f":"IF(ISERROR(INDIRECT(CONCATENATE($B253,\"!M20\"))),\"\",INDIRECT(CONCATENATE($B253,\"!M20\")))","v":""},{"$f":"IF(ISERROR(INDIRECT(CONCATENATE($B253,\"!M21\"))),\"\",INDIRECT(CONCATENATE($B253,\"!M21\")))","v":""},null,{"$f":"IF(ISERROR(INDIRECT(CONCATENATE($B253,\"!N18\"))),\"\",INDIRECT(CONCATENATE($B253,\"!N18\")))","v":""},{"$f":"IF(ISERROR(INDIRECT(CONCATENATE($B253,\"!N19\"))),\"\",INDIRECT(CONCATENATE($B253,\"!N19\")))","v":""},{"$f":"IF(ISERROR(INDIRECT(CONCATENATE($B253,\"!N20\"))),\"\",INDIRECT(CONCATENATE($B253,\"!N20\")))","v":""},{"$f":"IF(ISERROR(INDIRECT(CONCATENATE($B253,\"!N21\"))),\"\",INDIRECT(CONCATENATE($B253,\"!N21\")))","v":""},null,{"$f":"IF(ISERROR(INDIRECT(CONCATENATE($B253,\"!O18\"))),\"\",INDIRECT(CONCATENATE($B253,\"!O18\")))","v":""},{"$f":"IF(ISERROR(INDIRECT(CONCATENATE($B253,\"!O19\"))),\"\",INDIRECT(CONCATENATE($B253,\"!O19\")))","v":""},{"$f":"IF(ISERROR(INDIRECT(CONCATENATE($B253,\"!O20\"))),\"\",INDIRECT(CONCATENATE($B253,\"!O20\")))","v":""},{"$f":"IF(ISERROR(INDIRECT(CONCATENATE($B253,\"!O21\"))),\"\",INDIRECT(CONCATENATE($B253,\"!O21\")))","v":""},null,{"$f":"IF(ISERROR(INDIRECT(CONCATENATE($B253,\"!P18\"))),\"\",INDIRECT(CONCATENATE($B253,\"!P18\")))","v":""},{"$f":"IF(ISERROR(INDIRECT(CONCATENATE($B253,\"!P19\"))),\"\",INDIRECT(CONCATENATE($B253,\"!P19\")))","v":""},{"$f":"IF(ISERROR(INDIRECT(CONCATENATE($B253,\"!P20\"))),\"\",INDIRECT(CONCATENATE($B253,\"!P20\")))","v":""},{"$f":"IF(ISERROR(INDIRECT(CONCATENATE($B253,\"!P21\"))),\"\",INDIRECT(CONCATENATE($B253,\"!P21\")))","v":""},null,{"$f":"IF(ISERROR(INDIRECT(CONCATENATE($B253,\"!Q18\"))),\"\",INDIRECT(CONCATENATE($B253,\"!Q18\")))","v":""},{"$f":"IF(ISERROR(INDIRECT(CONCATENATE($B253,\"!Q19\"))),\"\",INDIRECT(CONCATENATE($B253,\"!Q19\")))","v":""},{"$f":"IF(ISERROR(INDIRECT(CONCATENATE($B253,\"!Q20\"))),\"\",INDIRECT(CONCATENATE($B253,\"!Q20\")))","v":""},{"$f":"IF(ISERROR(INDIRECT(CONCATENATE($B253,\"!Q21\"))),\"\",INDIRECT(CONCATENATE($B253,\"!Q1\")))","v":""}]
[null,null,null,null,{"$f":"IF(ISERROR(INDIRECT(CONCATENATE($B254,\"!M18\"))),\"\",INDIRECT(CONCATENATE($B254,\"!M18\")))","v":""},{"$f":"IF(ISERROR(INDIRECT(CONCATENATE($B254,\"!M19\"))),\"\",INDIRECT(CONCATENATE($B254,\"!M19\")))","v":""},{"$f":"IF(ISERROR(INDIRECT(CONCATENATE($B254,\"!M20\"))),\"\",INDIRECT(CONCATENATE($B254,\"!M20\")))","v":""},{"$f":"IF(ISERROR(INDIRECT(CONCATENATE($B254,\"!M21\"))),\"\",INDIRECT(CONCATENATE($B254,\"!M21\")))","v":""},null,{"$f":"IF(ISERROR(INDIRECT(CONCATENATE($B254,\"!N18\"))),\"\",INDIRECT(CONCATENATE($B254,\"!N18\")))","v":""},{"$f":"IF(ISERROR(INDIRECT(CONCATENATE($B254,\"!N19\"))),\"\",INDIRECT(CONCATENATE($B254,\"!N19\")))","v":""},{"$f":"IF(ISERROR(INDIRECT(CONCATENATE($B254,\"!N20\"))),\"\",INDIRECT(CONCATENATE($B254,\"!N20\")))","v":""},{"$f":"IF(ISERROR(INDIRECT(CONCATENATE($B254,\"!N21\"))),\"\",INDIRECT(CONCATENATE($B254,\"!N21\")))","v":""},null,{"$f":"IF(ISERROR(INDIRECT(CONCATENATE($B254,\"!O18\"))),\"\",INDIRECT(CONCATENATE($B254,\"!O18\")))","v":""},{"$f":"IF(ISERROR(INDIRECT(CONCATENATE($B254,\"!O19\"))),\"\",INDIRECT(CONCATENATE($B254,\"!O19\")))","v":""},{"$f":"IF(ISERROR(INDIRECT(CONCATENATE($B254,\"!O20\"))),\"\",INDIRECT(CONCATENATE($B254,\"!O20\")))","v":""},{"$f":"IF(ISERROR(INDIRECT(CONCATENATE($B254,\"!O21\"))),\"\",INDIRECT(CONCATENATE($B254,\"!O21\")))","v":""},null,{"$f":"IF(ISERROR(INDIRECT(CONCATENATE($B254,\"!P18\"))),\"\",INDIRECT(CONCATENATE($B254,\"!P18\")))","v":""},{"$f":"IF(ISERROR(INDIRECT(CONCATENATE($B254,\"!P19\"))),\"\",INDIRECT(CONCATENATE($B254,\"!P19\")))","v":""},{"$f":"IF(ISERROR(INDIRECT(CONCATENATE($B254,\"!P20\"))),\"\",INDIRECT(CONCATENATE($B254,\"!P20\")))","v":""},{"$f":"IF(ISERROR(INDIRECT(CONCATENATE($B254,\"!P21\"))),\"\",INDIRECT(CONCATENATE($B254,\"!P21\")))","v":""},null,{"$f":"IF(ISERROR(INDIRECT(CONCATENATE($B254,\"!Q18\"))),\"\",INDIRECT(CONCATENATE($B254,\"!Q18\")))","v":""},{"$f":"IF(ISERROR(INDIRECT(CONCATENATE($B254,\"!Q19\"))),\"\",INDIRECT(CONCATENATE($B254,\"!Q19\")))","v":""},{"$f":"IF(ISERROR(INDIRECT(CONCATENATE($B254,\"!Q20\"))),\"\",INDIRECT(CONCATENATE($B254,\"!Q20\")))","v":""},{"$f":"IF(ISERROR(INDIRECT(CONCATENATE($B254,\"!Q21\"))),\"\",INDIRECT(CONCATENATE($B254,\"!Q1\")))","v":""}]
[null,null,null,null,{"$f":"IF(ISERROR(INDIRECT(CONCATENATE($B255,\"!M18\"))),\"\",INDIRECT(CONCATENATE($B255,\"!M18\")))","v":""},{"$f":"IF(ISERROR(INDIRECT(CONCATENATE($B255,\"!M19\"))),\"\",INDIRECT(CONCATENATE($B255,\"!M19\")))","v":""},{"$f":"IF(ISERROR(INDIRECT(CONCATENATE($B255,\"!M20\"))),\"\",INDIRECT(CONCATENATE($B255,\"!M20\")))","v":""},{"$f":"IF(ISERROR(INDIRECT(CONCATENATE($B255,\"!M21\"))),\"\",INDIRECT(CONCATENATE($B255,\"!M21\")))","v":""},null,{"$f":"IF(ISERROR(INDIRECT(CONCATENATE($B255,\"!N18\"))),\"\",INDIRECT(CONCATENATE($B255,\"!N18\")))","v":""},{"$f":"IF(ISERROR(INDIRECT(CONCATENATE($B255,\"!N19\"))),\"\",INDIRECT(CONCATENATE($B255,\"!N19\")))","v":""},{"$f":"IF(ISERROR(INDIRECT(CONCATENATE($B255,\"!N20\"))),\"\",INDIRECT(CONCATENATE($B255,\"!N20\")))","v":""},{"$f":"IF(ISERROR(INDIRECT(CONCATENATE($B255,\"!N21\"))),\"\",INDIRECT(CONCATENATE($B255,\"!N21\")))","v":""},null,{"$f":"IF(ISERROR(INDIRECT(CONCATENATE($B255,\"!O18\"))),\"\",INDIRECT(CONCATENATE($B255,\"!O18\")))","v":""},{"$f":"IF(ISERROR(INDIRECT(CONCATENATE($B255,\"!O19\"))),\"\",INDIRECT(CONCATENATE($B255,\"!O19\")))","v":""},{"$f":"IF(ISERROR(INDIRECT(CONCATENATE($B255,\"!O20\"))),\"\",INDIRECT(CONCATENATE($B255,\"!O20\")))","v":""},{"$f":"IF(ISERROR(INDIRECT(CONCATENATE($B255,\"!O21\"))),\"\",INDIRECT(CONCATENATE($B255,\"!O21\")))","v":""},null,{"$f":"IF(ISERROR(INDIRECT(CONCATENATE($B255,\"!P18\"))),\"\",INDIRECT(CONCATENATE($B255,\"!P18\")))","v":""},{"$f":"IF(ISERROR(INDIRECT(CONCATENATE($B255,\"!P19\"))),\"\",INDIRECT(CONCATENATE($B255,\"!P19\")))","v":""},{"$f":"IF(ISERROR(INDIRECT(CONCATENATE($B255,\"!P20\"))),\"\",INDIRECT(CONCATENATE($B255,\"!P20\")))","v":""},{"$f":"IF(ISERROR(INDIRECT(CONCATENATE($B255,\"!P21\"))),\"\",INDIRECT(CONCATENATE($B255,\"!P21\")))","v":""},null,{"$f":"IF(ISERROR(INDIRECT(CONCATENATE($B255,\"!Q18\"))),\"\",INDIRECT(CONCATENATE($B255,\"!Q18\")))","v":""},{"$f":"IF(ISERROR(INDIRECT(CONCATENATE($B255,\"!Q19\"))),\"\",INDIRECT(CONCATENATE($B255,\"!Q19\")))","v":""},{"$f":"IF(ISERROR(INDIRECT(CONCATENATE($B255,\"!Q20\"))),\"\",INDIRECT(CONCATENATE($B255,\"!Q20\")))","v":""},{"$f":"IF(ISERROR(INDIRECT(CONCATENATE($B255,\"!Q21\"))),\"\",INDIRECT(CONCATENATE($B255,\"!Q1\")))","v":""}]
[null,null,null,null,{"$f":"IF(ISERROR(INDIRECT(CONCATENATE($B256,\"!M18\"))),\"\",INDIRECT(CONCATENATE($B256,\"!M18\")))","v":""},{"$f":"IF(ISERROR(INDIRECT(CONCATENATE($B256,\"!M19\"))),\"\",INDIRECT(CONCATENATE($B256,\"!M19\")))","v":""},{"$f":"IF(ISERROR(INDIRECT(CONCATENATE($B256,\"!M20\"))),\"\",INDIRECT(CONCATENATE($B256,\"!M20\")))","v":""},{"$f":"IF(ISERROR(INDIRECT(CONCATENATE($B256,\"!M21\"))),\"\",INDIRECT(CONCATENATE($B256,\"!M21\")))","v":""},null,{"$f":"IF(ISERROR(INDIRECT(CONCATENATE($B256,\"!N18\"))),\"\",INDIRECT(CONCATENATE($B256,\"!N18\")))","v":""},{"$f":"IF(ISERROR(INDIRECT(CONCATENATE($B256,\"!N19\"))),\"\",INDIRECT(CONCATENATE($B256,\"!N19\")))","v":""},{"$f":"IF(ISERROR(INDIRECT(CONCATENATE($B256,\"!N20\"))),\"\",INDIRECT(CONCATENATE($B256,\"!N20\")))","v":""},{"$f":"IF(ISERROR(INDIRECT(CONCATENATE($B256,\"!N21\"))),\"\",INDIRECT(CONCATENATE($B256,\"!N21\")))","v":""},null,{"$f":"IF(ISERROR(INDIRECT(CONCATENATE($B256,\"!O18\"))),\"\",INDIRECT(CONCATENATE($B256,\"!O18\")))","v":""},{"$f":"IF(ISERROR(INDIRECT(CONCATENATE($B256,\"!O19\"))),\"\",INDIRECT(CONCATENATE($B256,\"!O19\")))","v":""},{"$f":"IF(ISERROR(INDIRECT(CONCATENATE($B256,\"!O20\"))),\"\",INDIRECT(CONCATENATE($B256,\"!O20\")))","v":""},{"$f":"IF(ISERROR(INDIRECT(CONCATENATE($B256,\"!O21\"))),\"\",INDIRECT(CONCATENATE($B256,\"!O21\")))","v":""},null,{"$f":"IF(ISERROR(INDIRECT(CONCATENATE($B256,\"!P18\"))),\"\",INDIRECT(CONCATENATE($B256,\"!P18\")))","v":""},{"$f":"IF(ISERROR(INDIRECT(CONCATENATE($B256,\"!P19\"))),\"\",INDIRECT(CONCATENATE($B256,\"!P19\")))","v":""},{"$f":"IF(ISERROR(INDIRECT(CONCATENATE($B256,\"!P20\"))),\"\",INDIRECT(CONCATENATE($B256,\"!P20\")))","v":""},{"$f":"IF(ISERROR(INDIRECT(CONCATENATE($B256,\"!P21\"))),\"\",INDIRECT(CONCATENATE($B256,\"!P21\")))","v":""},null,{"$f":"IF(ISERROR(INDIRECT(CONCATENATE($B256,\"!Q18\"))),\"\",INDIRECT(CONCATENATE($B256,\"!Q18\")))","v":""},{"$f":"IF(ISERROR(INDIRECT(CONCATENATE($B256,\"!Q19\"))),\"\",INDIRECT(CONCATENATE($B256,\"!Q19\")))","v":""},{"$f":"IF(ISERROR(INDIRECT(CONCATENATE($B256,\"!Q20\"))),\"\",INDIRECT(CONCATENATE($B256,\"!Q20\")))","v":""},{"$f":"IF(ISERROR(INDIRECT(CONCATENATE($B256,\"!Q21\"))),\"\",INDIRECT(CONCATENATE($B256,\"!Q1\")))","v":""}]
[null,null,null,null,{"$f":"IF(ISERROR(INDIRECT(CONCATENATE($B257,\"!M18\"))),\"\",INDIRECT(CONCATENATE($B257,\"!M18\")))","v":""},{"$f":"IF(ISERROR(INDIRECT(CONCATENATE($B257,\"!M19\"))),\"\",INDIRECT(CONCATENATE($B257,\"!M19\")))","v":""},{"$f":"IF(ISERROR(INDIRECT(CONCATENATE($B257,\"!M20\"))),\"\",INDIRECT(CONCATENATE($B257,\"!M20\")))","v":""},{"$f":"IF(ISERROR(INDIRECT(CONCATENATE($B257,\"!M21\"))),\"\",INDIRECT(CONCATENATE($B257,\"!M21\")))","v":""},null,{"$f":"IF(ISERROR(INDIRECT(CONCATENATE($B257,\"!N18\"))),\"\",INDIRECT(CONCATENATE($B257,\"!N18\")))","v":""},{"$f":"IF(ISERROR(INDIRECT(CONCATENATE($B257,\"!N19\"))),\"\",INDIRECT(CONCATENATE($B257,\"!N19\")))","v":""},{"$f":"IF(ISERROR(INDIRECT(CONCATENATE($B257,\"!N20\"))),\"\",INDIRECT(CONCATENATE($B257,\"!N20\")))","v":""},{"$f":"IF(ISERROR(INDIRECT(CONCATENATE($B257,\"!N21\"))),\"\",INDIRECT(CONCATENATE($B257,\"!N21\")))","v":""},null,{"$f":"IF(ISERROR(INDIRECT(CONCATENATE($B257,\"!O18\"))),\"\",INDIRECT(CONCATENATE($B257,\"!O18\")))","v":""},{"$f":"IF(ISERROR(INDIRECT(CONCATENATE($B257,\"!O19\"))),\"\",INDIRECT(CONCATENATE($B257,\"!O19\")))","v":""},{"$f":"IF(ISERROR(INDIRECT(CONCATENATE($B257,\"!O20\"))),\"\",INDIRECT(CONCATENATE($B257,\"!O20\")))","v":""},{"$f":"IF(ISERROR(INDIRECT(CONCATENATE($B257,\"!O21\"))),\"\",INDIRECT(CONCATENATE($B257,\"!O21\")))","v":""},null,{"$f":"IF(ISERROR(INDIRECT(CONCATENATE($B257,\"!P18\"))),\"\",INDIRECT(CONCATENATE($B257,\"!P18\")))","v":""},{"$f":"IF(ISERROR(INDIRECT(CONCATENATE($B257,\"!P19\"))),\"\",INDIRECT(CONCATENATE($B257,\"!P19\")))","v":""},{"$f":"IF(ISERROR(INDIRECT(CONCATENATE($B257,\"!P20\"))),\"\",INDIRECT(CONCATENATE($B257,\"!P20\")))","v":""},{"$f":"IF(ISERROR(INDIRECT(CONCATENATE($B257,\"!P21\"))),\"\",INDIRECT(CONCATENATE($B257,\"!P21\")))","v":""},null,{"$f":"IF(ISERROR(INDIRECT(CONCATENATE($B257,\"!Q18\"))),\"\",INDIRECT(CONCATENATE($B257,\"!Q18\")))","v":""},{"$f":"IF(ISERROR(INDIRECT(CONCATENATE($B257,\"!Q19\"))),\"\",INDIRECT(CONCATENATE($B257,\"!Q19\")))","v":""},{"$f":"IF(ISERROR(INDIRECT(CONCATENATE($B257,\"!Q20\"))),\"\",INDIRECT(CONCATENATE($B257,\"!Q20\")))","v":""},{"$f":"IF(ISERROR(INDIRECT(CONCATENATE($B257,\"!Q21\"))),\"\",INDIRECT(CONCATENATE($B257,\"!Q1\")))","v":""}]
[]
[]
[]
[]
[]
[]
[]
[]
[]
[]
[]
[]
[]
[]
[]
[]
[]
[]
[]
[]
[]
[]
[]
[]
[]
[]
[]
[]
[]
[]
[]
[]
[]
[]
[]
[]
[]
[]
[]
["RURAL",null,null,"Poorest",null,null,null,null,"Poor",null,null,null,null,"Middle",null,null,null,null,"Rich",null,null,null,null,"Richest"]
[null,null,null,"Improved","Basic","Limited","Unimproved","Surface water","Improved","Basic","Limited","Unimproved","Surface water","Improved","Basic","Limited","Unimproved","Surface water","Improved","Basic","Limited","Unimproved","Surface water","Improved","Basic","Limited","Unimproved","Surface water"]
["Forecast period:",null,2000,{"$f":"IF((D301+H301)>100,D301*100/(D301+H301),D301)","v":41.763104537192476},{"$f":"D299*AVERAGEIF(E305:E316,\">0\")/100","v":31.322328402894353},{"$f":"D299*(100-AVERAGEIF(E305:E316,\">0\"))/100","v":10.440776134298119},{"$f":"100-(E299+F299+H299)","v":16.837883893173057},{"$f":"IF((D301+H301)>100,H301*100/(D301+H301),H301)","v":41.399011569634467},{"$f":"IF((I301+M301)>100,I301*100/(I301+M301),I301)","v":40.338961280936473},{"$f":"I299*AVERAGEIF(J305:J316,\">0\")/100","v":32.190491102187309},{"$f":"I299*(100-AVERAGEIF(J305:J316,\">0\"))/100","v":8.1484701787491698},{"$f":"100-(J299+K299+M299)","v":18.673130695349869},{"$f":"IF((I301+M301)>100,M301*100/(I301+M301),M301)","v":40.987908023713658},{"$f":"IF((N301+R301)>100,N301*100/(N301+R301),N301)","v":42.726804993238147},{"$f":"N299*AVERAGEIF(O305:O316,\">0\")/100","v":30.677845985144991},{"$f":"N299*(100-AVERAGEIF(O305:O316,\">0\"))/100","v":12.048959008093158},{"$f":"100-(O299+P299+R299)","v":16.015651914489808},{"$f":"IF((N301+R301)>100,R301*100/(N301+R301),R301)","v":41.257543092272044},{"$f":"IF((S301+W301)>100,S301*100/(S301+W301),S301)","v":49.465003798049565},{"$f":"S299*AVERAGEIF(T305:T316,\">0\")/100","v":40.116118080218193},{"$f":"S299*(100-AVERAGEIF(T305:T316,\">0\"))/100","v":9.3488857178313705},{"$f":"100-(T299+U299+W299)","v":20.195373289585632},{"$f":"IF((S301+W301)>100,W301*100/(S301+W301),W301)","v":30.339622912364803},{"$f":"IF((X301+AB301)>100,X301*100/(X301+AB301),X301)","v":67.12203659263605},{"$f":"X299*AVERAGEIF(Y305:Y316,\">0\")/100","v":57.523585359889097},{"$f":"X299*(100-AVERAGEIF(Y305:Y316,\">0\"))/100","v":9.5984512327469531},{"$f":"100-(Y299+Z299+AB299)","v":12.862563016125023},{"$f":"IF((X301+AB301)>100,AB301*100/(X301+AB301),AB301)","v":20.015400391238927}]
[null,null,2018,{"$f":"IF((D302+H302)>100,D302*100/(D302+H302),D302)","v":52.656149243801337},{"$f":"D300*AVERAGEIF(E305:E316,\">0\")/100","v":39.492111932851003},{"$f":"D300*(100-AVERAGEIF(E305:E316,\">0\"))/100","v":13.164037310950334},{"$f":"100-(E300+F300+H300)","v":7.1103526844710814},{"$f":"IF((D302+H302)>100,H302*100/(D302+H302),H302)","v":40.233498071727581},{"$f":"IF((I302+M302)>100,I302*100/(I302+M302),I302)","v":61.526839786510664},{"$f":"I300*AVERAGEIF(J305:J316,\">0\")/100","v":49.098418149635506},{"$f":"I300*(100-AVERAGEIF(J305:J316,\">0\"))/100","v":12.428421636875155},{"$f":"100-(J300+K300+M300)","v":4.1211448841082756},{"$f":"IF((I302+M302)>100,M302*100/(I302+M302),M302)","v":34.352015329381061},{"$f":"IF((N302+R302)>100,N302*100/(N302+R302),N302)","v":71.278865834459793},{"$f":"N300*AVERAGEIF(O305:O316,\">0\")/100","v":51.17822566914213},{"$f":"N300*(100-AVERAGEIF(O305:O316,\">0\"))/100","v":20.100640165317664},{"$f":"100-(O300+P300+R300)","v":4.2140580142518047},{"$f":"IF((N302+R302)>100,R302*100/(N302+R302),R302)","v":24.507076151288402},{"$f":"IF((S302+W302)>100,S302*100/(S302+W302),S302)","v":74.939166033658239},{"$f":"S300*AVERAGEIF(T305:T316,\">0\")/100","v":60.775663653296824},{"$f":"S300*(100-AVERAGEIF(T305:T316,\">0\"))/100","v":14.163502380361411},{"$f":"100-(T300+U300+W300)","v":7.0174377850694327},{"$f":"IF((S302+W302)>100,W302*100/(S302+W302),W302)","v":18.043396181272328},{"$f":"IF((X302+AB302)>100,X302*100/(X302+AB302),X302)","v":93.696327234560613},{"$f":"X300*AVERAGEIF(Y305:Y316,\">0\")/100","v":80.297752440018442},{"$f":"X300*(100-AVERAGEIF(Y305:Y316,\">0\"))/100","v":13.398574794542164},{"$f":"100-(Y300+Z300+AB300)","v":3.5729061639790416},{"$f":"IF((X302+AB302)>100,AB302*100/(X302+AB302),AB302)","v":2.7307666014603456}]
["Regression period:",null,{"$f":"MinRegYear(C299,C305:C316)","v":2000},{"$f":"IF(MAX(C305:C316)-MIN(C305:C316)<5,AVERAGEIF(C305:C316,\">0\",D305:D316),\nIF(FORECAST($C301,D$305:D$316,$C$305:$C$316)<0,0,\nIF(FORECAST($C301,D$305:D$316,$C$305:$C$316)>100,100,\nFORECAST($C301,D$305:D$316,$C$305:$C$316))))","v":41.763104537192476},null,null,null,{"$f":"IF(MAX(C305:C316)-MIN(C305:C316)<5,AVERAGEIF(C305:C316,\">0\",H305:H316),\nIF(FORECAST($C301,H$305:H$316,$C$305:$C$316)<0,0,\nIF(FORECAST($C301,H$305:H$316,$C$305:$C$316)>100,100,\nFORECAST($C301,H$305:H$316,$C$305:$C$316))))","v":41.399011569634467},{"$f":"IF(MAX(C305:C316)-MIN(C305:C316)<5,AVERAGEIF(C305:C316,\">0\",I305:I316),\nIF(FORECAST($C301,I$305:I$316,$C$305:$C$316)<0,0,\nIF(FORECAST($C301,I$305:I$316,$C$305:$C$316)>100,100,\nFORECAST($C301,I$305:I$316,$C$305:$C$316))))","v":40.338961280936473},null,null,null,{"$f":"IF(MAX(C305:C316)-MIN(C305:C316)<5,AVERAGEIF(C305:C316,\">0\",M305:M316),\nIF(FORECAST($C301,M$305:M$316,$C$305:$C$316)<0,0,\nIF(FORECAST($C301,M$305:M$316,$C$305:$C$316)>100,100,\nFORECAST($C301,M$305:M$316,$C$305:$C$316))))","v":40.987908023713658},{"$f":"IF(MAX(C305:C316)-MIN(C305:C316)<5,AVERAGEIF(C305:C316,\">0\",N305:N316),\nIF(FORECAST($C301,N$305:N$316,$C$305:$C$316)<0,0,\nIF(FORECAST($C301,N$305:N$316,$C$305:$C$316)>100,100,\nFORECAST($C301,N$305:N$316,$C$305:$C$316))))","v":42.726804993238147},null,null,null,{"$f":"IF(MAX(C305:C316)-MIN(C305:C316)<5,AVERAGEIF(C305:C316,\">0\",R305:R316),\nIF(FORECAST($C301,R$305:R$316,$C$305:$C$316)<0,0,\nIF(FORECAST($C301,R$305:R$316,$C$305:$C$316)>100,100,\nFORECAST($C301,R$305:R$316,$C$305:$C$316))))","v":41.257543092272044},{"$f":"IF(MAX(C305:C316)-MIN(C305:C316)<5,AVERAGEIF(C305:C316,\">0\",S305:S316),\nIF(FORECAST($C301,S$305:S$316,$C$305:$C$316)<0,0,\nIF(FORECAST($C301,S$305:S$316,$C$305:$C$316)>100,100,\nFORECAST($C301,S$305:S$316,$C$305:$C$316))))","v":49.465003798049565},null,null,null,{"$f":"IF(MAX(C305:C316)-MIN(C305:C316)<5,AVERAGEIF(C305:C316,\">0\",W305:W316),\nIF(FORECAST($C301,W$305:W$316,$C$305:$C$316)<0,0,\nIF(FORECAST($C301,W$305:W$316,$C$305:$C$316)>100,100,\nFORECAST($C301,W$305:W$316,$C$305:$C$316))))","v":30.339622912364803},{"$f":"IF(MAX(C305:C316)-MIN(C305:C316)<5,AVERAGEIF(C305:C316,\">0\",X305:X316),\nIF(FORECAST($C301,X$305:X$316,$C$305:$C$316)<0,0,\nIF(FORECAST($C301,X$305:X$316,$C$305:$C$316)>100,100,\nFORECAST($C301,X$305:X$316,$C$305:$C$316))))","v":67.12203659263605},null,null,null,{"$f":"IF(MAX(C305:C316)-MIN(C305:C316)<5,AVERAGEIF(C305:C316,\">0\",AB305:AB316),\nIF(FORECAST($C301,AB$305:AB$316,$C$305:$C$316)<0,0,\nIF(FORECAST($C301,AB$305:AB$316,$C$305:$C$316)>100,100,\nFORECAST($C301,AB$305:AB$316,$C$305:$C$316))))","v":20.015400391238927}]
[null,null,{"$f":"MaxRegYear(C300,C305:C316)","v":2014},{"$f":"IF(MAX(C305:C316)-MIN(C305:C316)<5,AVERAGEIF(C305:C316,\">0\",D305:D316),\nIF(FORECAST($C302,D$305:D$316,$C$305:$C$316)<0,0,\nIF(FORECAST($C302,D$305:D$316,$C$305:$C$316)>100,100,\nFORECAST($C302,D$305:D$316,$C$305:$C$316))))","v":52.656149243801337},null,null,null,{"$f":"IF(MAX(C305:C316)-MIN(C305:C316)<5,AVERAGEIF(C305:C316,\">0\",H305:H316),\nIF(FORECAST($C302,H$305:H$316,$C$305:$C$316)<0,0,\nIF(FORECAST($C302,H$305:H$316,$C$305:$C$316)>100,100,\nFORECAST($C302,H$305:H$316,$C$305:$C$316))))","v":40.233498071727581},{"$f":"IF(MAX(C305:C316)-MIN(C305:C316)<5,AVERAGEIF(C305:C316,\">0\",I305:I316),\nIF(FORECAST($C302,I$305:I$316,$C$305:$C$316)<0,0,\nIF(FORECAST($C302,I$305:I$316,$C$305:$C$316)>100,100,\nFORECAST($C302,I$305:I$316,$C$305:$C$316))))","v":61.526839786510664},null,null,null,{"$f":"IF(MAX(C305:C316)-MIN(C305:C316)<5,AVERAGEIF(C305:C316,\">0\",M305:M316),\nIF(FORECAST($C302,M$305:M$316,$C$305:$C$316)<0,0,\nIF(FORECAST($C302,M$305:M$316,$C$305:$C$316)>100,100,\nFORECAST($C302,M$305:M$316,$C$305:$C$316))))","v":34.352015329381061},{"$f":"IF(MAX(C305:C316)-MIN(C305:C316)<5,AVERAGEIF(C305:C316,\">0\",N305:N316),\nIF(FORECAST($C302,N$305:N$316,$C$305:$C$316)<0,0,\nIF(FORECAST($C302,N$305:N$316,$C$305:$C$316)>100,100,\nFORECAST($C302,N$305:N$316,$C$305:$C$316))))","v":71.278865834459793},null,null,null,{"$f":"IF(MAX(C305:C316)-MIN(C305:C316)<5,AVERAGEIF(C305:C316,\">0\",R305:R316),\nIF(FORECAST($C302,R$305:R$316,$C$305:$C$316)<0,0,\nIF(FORECAST($C302,R$305:R$316,$C$305:$C$316)>100,100,\nFORECAST($C302,R$305:R$316,$C$305:$C$316))))","v":24.507076151288402},{"$f":"IF(MAX(C305:C316)-MIN(C305:C316)<5,AVERAGEIF(C305:C316,\">0\",S305:S316),\nIF(FORECAST($C302,S$305:S$316,$C$305:$C$316)<0,0,\nIF(FORECAST($C302,S$305:S$316,$C$305:$C$316)>100,100,\nFORECAST($C302,S$305:S$316,$C$305:$C$316))))","v":74.939166033658239},null,null,null,{"$f":"IF(MAX(C305:C316)-MIN(C305:C316)<5,AVERAGEIF(C305:C316,\">0\",W305:W316),\nIF(FORECAST($C302,W$305:W$316,$C$305:$C$316)<0,0,\nIF(FORECAST($C302,W$305:W$316,$C$305:$C$316)>100,100,\nFORECAST($C302,W$305:W$316,$C$305:$C$316))))","v":18.043396181272328},{"$f":"IF(MAX(C305:C316)-MIN(C305:C316)<5,AVERAGEIF(C305:C316,\">0\",X305:X316),\nIF(FORECAST($C302,X$305:X$316,$C$305:$C$316)<0,0,\nIF(FORECAST($C302,X$305:X$316,$C$305:$C$316)>100,100,\nFORECAST($C302,X$305:X$316,$C$305:$C$316))))","v":93.696327234560613},null,null,null,{"$f":"IF(MAX(C305:C316)-MIN(C305:C316)<5,AVERAGEIF(C305:C316,\">0\",AB305:AB316),\nIF(FORECAST($C302,AB$305:AB$316,$C$305:$C$316)<0,0,\nIF(FORECAST($C302,AB$305:AB$316,$C$305:$C$316)>100,100,\nFORECAST($C302,AB$305:AB$316,$C$305:$C$316))))","v":2.7307666014603456}]
[]
[null,"Survey","Year","Improved","% Improved\n< = 30min",null,null,"Surface water","Improved","% Improved\n< = 30min",null,null,"Surface water","Improved","% Improved\n< = 30min",null,null,"Surface water","Improved","% Improved\n< = 30min",null,null,"Surface water","Improved","% Improved\n< = 30min",null,null,"Surface water"]
[null,"DHS00",2000,{"$f":"IF(ISERROR(INDIRECT(CONCATENATE($B305,\"!M16\"))),\"\",INDIRECT(CONCATENATE($B305,\"!M16\")))","v":41.76310453719239},{"$f":"IF(ISERROR(INDIRECT(CONCATENATE($B305,\"!M23\"))),\"\",INDIRECT(CONCATENATE($B305,\"!M23\")))","v":"N/A"},null,null,{"$f":"IF(ISERROR(INDIRECT(CONCATENATE($B305,\"!M21\"))),\"\",INDIRECT(CONCATENATE($B305,\"!M21\")))","v":41.399011569634467},{"$f":"IF(ISERROR(INDIRECT(CONCATENATE($B305,\"!N16\"))),\"\",INDIRECT(CONCATENATE($B305,\"!N16\")))","v":40.338961280936623},{"$f":"IF(ISERROR(INDIRECT(CONCATENATE($B305,\"!N23\"))),\"\",INDIRECT(CONCATENATE($B305,\"!N23\")))","v":"N/A"},null,null,{"$f":"IF(ISERROR(INDIRECT(CONCATENATE($B305,\"!N21\"))),\"\",INDIRECT(CONCATENATE($B305,\"!N21\")))","v":40.987908023713644},{"$f":"IF(ISERROR(INDIRECT(CONCATENATE($B305,\"!O16\"))),\"\",INDIRECT(CONCATENATE($B305,\"!O16\")))","v":42.726804993238304},{"$f":"IF(ISERROR(INDIRECT(CONCATENATE($B305,\"!O23\"))),\"\",INDIRECT(CONCATENATE($B305,\"!O23\")))","v":"N/A"},null,null,{"$f":"IF(ISERROR(INDIRECT(CONCATENATE($B305,\"!O21\"))),\"\",INDIRECT(CONCATENATE($B305,\"!O21\")))","v":41.257543092271732},{"$f":"IF(ISERROR(INDIRECT(CONCATENATE($B305,\"!P16\"))),\"\",INDIRECT(CONCATENATE($B305,\"!P16\")))","v":49.465003798049679},{"$f":"IF(ISERROR(INDIRECT(CONCATENATE($B305,\"!P23\"))),\"\",INDIRECT(CONCATENATE($B305,\"!P23\")))","v":"N/A"},null,null,{"$f":"IF(ISERROR(INDIRECT(CONCATENATE($B305,\"!P21\"))),\"\",INDIRECT(CONCATENATE($B305,\"!P21\")))","v":30.339622912364828},{"$f":"IF(ISERROR(INDIRECT(CONCATENATE($B305,\"!Q16\"))),\"\",INDIRECT(CONCATENATE($B305,\"!Q16\")))","v":67.122036592636093},{"$f":"IF(ISERROR(INDIRECT(CONCATENATE($B305,\"!Q23\"))),\"\",INDIRECT(CONCATENATE($B305,\"!Q23\")))","v":"N/A"},null,null,{"$f":"IF(ISERROR(INDIRECT(CONCATENATE($B305,\"!Q221\"))),\"\",INDIRECT(CONCATENATE($B305,\"!Q21\")))","v":20.015400391238821}]
[null,"DHS12",2012,51.1,75,null,null,40.4,58.5,79.8,null,null,35.299999999999997,67.2,71.8,null,null,26.9,71.3,81.099999999999994,null,null,19.8,89.9,85.7,null,null,5.2]
[null,null,null,"","",null,null,"","","",null,null,"","","",null,null,"","","",null,null,"","","",null,null,""]
[null,null,null,"","",null,null,"","","",null,null,"","","",null,null,"","","",null,null,"","","",null,null,""]
[null,null,null,"","",null,null,"","","",null,null,"","","",null,null,"","","",null,null,"","","",null,null,""]
[null,null,null,"","",null,null,"","","",null,null,"","","",null,null,"","","",null,null,"","","",null,null,""]
[null,null,null,"","",null,null,"","","",null,null,"","","",null,null,"","","",null,null,"","","",null,null,""]
[null,null,null,"","",null,null,"","","",null,null,"","","",null,null,"","","",null,null,"","","",null,null,""]
[null,null,null,"","",null,null,"","","",null,null,"","","",null,null,"","","",null,null,"","","",null,null,""]
[null,null,null,"","",null,null,"","","",null,null,"","","",null,null,"","","",null,null,"","","",null,null,""]
[null,null,null,"","",null,null,"","","",null,null,"","","",null,null,"","","",null,null,"","","",null,null,""]
[null,null,null,"","",null,null,"","","",null,null,"","","",null,null,"","","",null,null,"","","",null,null,""]
[]
[null,{"$f":"CONCATENATE(\"Rural use of drinking water sources, \",C299,\"–\",C300)","v":"Rural use of drinking water sources, 2000–2018"},null,null,null,null,null,null,null,null,null,null,null,null,null,null,null,null,"Data points used for regression"]

{"sheet":"Sanitation","index":2,"n_rows":318,"n_cols":28,"rows_kept":318,"cut":false,"hidden":false,"merged":[[30,21,30,24],[4,1,4,24],[3,1,3,24],[6,1,6,8],[6,9,6,16],[6,17,6,24],[30,1,31,4],[30,5,30,8],[30,9,30,12],[30,13,30,16],[30,17,30,20],[96,23,96,27],[32,1,33,2],[32,3,33,3],[35,1,36,2],[35,3,36,3],[38,1,39,2],[38,3,39,3],[96,0,97,2],[96,3,96,7],[96,8,96,12],[96,13,96,17],[96,18,96,22],[98,0,99,1],[100,0,101,1],[117,18,117,22],[196,0,197,2],[196,3,196,7],[196,8,196,12],[196,13,196,17],[196,18,196,22],[117,1,117,11],[298,0,299,1],[300,0,301,1],[317,18,317,22],[196,23,196,27],[198,0,199,1],[200,0,201,1],[217,18,217,22],[296,0,297,2],[296,3,296,7],[296,8,296,12],[296,13,296,17],[296,18,296,22],[296,23,296,27],[217,1,217,11],[317,1,317,11]]}
[]
[]
[]
[null,"Summary of trends in use of sanitation facilities by wealth quintile (%)"]
[null,{"$f":"IF(ISERROR(INDIRECT(CONCATENATE($B105,\"!A2\"))),\"\",INDIRECT(CONCATENATE($B105,\"!A2\")))","v":"Gabon"}]
[]
[null,{"$f":"B118","v":"National use of sanitation facilities, 2000–2018"},null,null,null,null,null,null,null,{"$f":"B218","v":"Urban use of sanitation facilities, 2000–2018"},null,null,null,null,null,null,null,{"$f":"B318","v":"Rural use of sanitation facilities, 2000–2018"}]
[]
[]
[]
[]
[]
[]
[]
[]
[]
[]
[]
[]
[]
[]
[]
[]
[]
[]
[]
[]
[]
[]
[]
[null,{"$f":"IF(ISERROR(INDIRECT(CONCATENATE($B105,\"!A2\"))),\"\",INDIRECT(CONCATENATE($B105,\"!A2\")))","v":"Gabon"},null,null,null,"Poorest",null,null,null,"Poor",null,null,null,"Middle",null,null,null,"Rich",null,null,null,"Richest"]
[null,null,null,null,null,"Basic","Limited","Unimproved","Open defecation","Basic","Limited","Unimproved","Open defecation","Basic","Limited","Unimproved","Open defecation","Basic","Limited","Unimproved","Open defecation","Basic","Limited","Unimproved","Open defecation"]
[null,"NATIONAL",null,"Estimate",{"$f":"C99","v":2000},{"$f":"E99","v":17.650135886992924},{"$f":"F99","v":31.189973042536682},46.326379208774682,4.8335118616957118,{"$f":"J99","v":17.476582316159913},{"$f":"K99","v":42.128249473886633},37.592664106327398,2.8025041036260561,{"$f":"O99","v":29.056968615032638},{"$f":"P99","v":42.446660032144173},26.729258311373172,1.7671130414500116,{"$f":"T99","v":55.963751324500407},{"$f":"U99","v":29.260717822587161},14.039859718206486,0.73567113470593881,{"$f":"Y99","v":87.468208061450184},{"$f":"Z99","v":8.482687162422156},3.904084228520091,0.14502054760757765]
[null,null,null,null,{"$f":"C100","v":2018},{"$f":"E100","v":14.156855172137188},25.016913978064718,54.77822046584464,6.0480103839534536,{"$f":"J100","v":14.925094076983752},35.977748699469807,46.635935807858282,2.4612214156881578,{"$f":"O100","v":24.217526726647534},35.377163303041911,38.74458031522969,1.6607296550808659,{"$f":"T100","v":49.51155942774394},25.887181167879,22.834446924633681,1.7668124797433791,{"$f":"Y100","v":85.559271301193164},8.2975580314042698,6.1078172245976816,3.5353442804897384E-2]
[]
[null,"URBAN",null,"Estimate",{"$f":"C199","v":2000},{"$f":"E199","v":16.134969668564242},{"$f":"F199","v":40.874139685708585},39.329330387079267,3.6615602586479099,{"$f":"J199","v":22.736461678761192},{"$f":"K199","v":47.978252188455038},27.050363830725075,2.2349223020586919,{"$f":"O199","v":35.330814524194359},{"$f":"P199","v":42.745560873742413},20.811134864563172,1.1124897375000558,{"$f":"T199","v":64.117109836115816},{"$f":"U199","v":25.804629790413827},9.7327720294553899,0.3454883440149672,{"$f":"Y199","v":88.663674314210269},{"$f":"Z199","v":8.3783100451927552},2.9580156405969831,0]
[null,null,null,null,{"$f":"C200","v":2018},{"$f":"E200","v":12.362379772518285},31.317173074962124,51.624684475140867,4.695762677378724,{"$f":"J200","v":17.221586922317623},36.340819082513164,45.14597822329057,1.2916157718786394,{"$f":"O200","v":29.444379125991595},35.623761220045758,33.069549503849657,1.8623101501129895,{"$f":"T200","v":54.484260464228321},21.927784553569392,21.614979936462987,1.9729750457393038,{"$f":"Y200","v":88.085382954053131},8.3236641673929856,3.5909528785538782,0]
[]
[null,"RURAL",null,"Estimate",{"$f":"C299","v":2000},{"$f":"E299","v":23.620908757328749},{"$f":"F299","v":24.936978668795604},48.341736487197863,3.1003760866777839,{"$f":"J299","v":18.354930119506957},{"$f":"K299","v":29.349986203507502},44.637957479285774,7.6571261976997675,{"$f":"O299","v":31.47742699425914},{"$f":"P299","v":18.051173965926122},47.093537234838976,3.3778618049757654,{"$f":"T299","v":34.83825897346415},{"$f":"U299","v":20.430000741589161},41.916113073228722,2.8156272117179668,{"$f":"Y299","v":53.863265720548007},{"$f":"Z299","v":17.414820660715158},26.894496188908136,1.8274174298286923]
[null,null,null,null,{"$f":"C300","v":2018},{"$f":"E300","v":17.652137317694113},18.635649300047064,54.705895744749569,9.0063176375092553,{"$f":"J300","v":14.308721362042254},22.879998552511733,57.018054558251151,5.7932255271948634,{"$f":"O300","v":24.180302626395004},13.866535194804911,57.046024579512988,4.9071375992870969,{"$f":"T300","v":27.485333446523171},16.11806672437335,53.006002131164436,3.3905976979390431,{"$f":"Y300","v":48.350016406877884},15.632302523892479,34.492413984829881,1.5252670843997507]
[]
[]
[]
[]
[]
[]
[]
[]
[]
[]
[]
[]
[]
[]
[]
[]
[]
[]
[]
[]
[]
[]
[]
[]
[]
[]
[]
[]
[]
[]
[]
[]
[]
[]
[]
[]
[]
[]
[]
[]
[]
[]
[]
[]
[]
[]
[]
[]
[]
[]
[]
[]
[]
[]
[]
[]
["NATIONAL",null,null,"Poorest",null,null,null,null,"Poor",null,null,null,null,"Middle",null,null,null,null,"Rich",null,null,null,null,"Richest"]
[null,null,null,"Improved","Basic","Limited","Unimproved","Open defecation","Improved","Basic","Limited","Unimproved","Open defecation","Improved","Basic","Limited","Unimproved","Open defecation","Improved","Basic","Limited","Unimproved","Open defecation","Improved","Basic","Limited","Unimproved","Open defecation"]
["Forecast period:",null,2000,{"$f":"IF((D101+H101)>100,D101*100/(D101+H101),D101)","v":48.840108929529606},{"$f":"D99*AVERAGEIF(E105:E116,\">0\")/100","v":17.650135886992924},{"$f":"D99*(100-AVERAGEIF(E105:E116,\">0\"))/100","v":31.189973042536682},{"$f":"100-(E99+F99+H99)","v":46.326379208774682},{"$f":"IF((D101+H101)>100,H101*100/(D101+H101),H101)","v":4.8335118616957118},{"$f":"IF((I101+M101)>100,I101*100/(I101+M101),I101)","v":59.604831790046546},{"$f":"I99*AVERAGEIF(J105:J116,\">0\")/100","v":17.476582316159913},{"$f":"I99*(100-AVERAGEIF(J105:J116,\">0\"))/100","v":42.128249473886633},{"$f":"100-(J99+K99+M99)","v":37.592664106327398},{"$f":"IF((I101+M101)>100,M101*100/(I101+M101),M101)","v":2.8025041036260561},{"$f":"IF((N101+R101)>100,N101*100/(N101+R101),N101)","v":71.503628647176811},{"$f":"N99*AVERAGEIF(O105:O116,\">0\")/100","v":29.056968615032638},{"$f":"N99*(100-AVERAGEIF(O105:O116,\">0\"))/100","v":42.446660032144173},{"$f":"100-(O99+P99+R99)","v":26.729258311373172},{"$f":"IF((N101+R101)>100,R101*100/(N101+R101),R101)","v":1.7671130414500116},{"$f":"IF((S101+W101)>100,S101*100/(S101+W101),S101)","v":85.224469147087575},{"$f":"S99*AVERAGEIF(T105:T116,\">0\")/100","v":55.963751324500407},{"$f":"S99*(100-AVERAGEIF(T105:T116,\">0\"))/100","v":29.260717822587161},{"$f":"100-(T99+U99+W99)","v":14.039859718206486},{"$f":"IF((S101+W101)>100,W101*100/(S101+W101),W101)","v":0.73567113470593881},{"$f":"IF((X101+AB101)>100,X101*100/(X101+AB101),X101)","v":95.950895223872351},{"$f":"X99*AVERAGEIF(Y105:Y116,\">0\")/100","v":87.468208061450184},{"$f":"X99*(100-AVERAGEIF(Y105:Y116,\">0\"))/100","v":8.482687162422156},{"$f":"100-(Y99+Z99+AB99)","v":3.904084228520091},{"$f":"IF((X101+AB101)>100,AB101*100/(X101+AB101),AB101)","v":0.14502054760757765}]
[null,null,2018,{"$f":"IF((D102+H102)>100,D102*100/(D102+H102),D102)","v":39.173769150201906},{"$f":"D100*AVERAGEIF(E105:E116,\">0\")/100","v":14.156855172137188},{"$f":"D100*(100-AVERAGEIF(E105:E116,\">0\"))/100","v":25.016913978064718},{"$f":"100-(E100+F100+H100)","v":54.77822046584464},{"$f":"IF((D102+H102)>100,H102*100/(D102+H102),H102)","v":6.0480103839534536},{"$f":"IF((I102+M102)>100,I102*100/(I102+M102),I102)","v":50.902842776453554},{"$f":"I100*AVERAGEIF(J105:J116,\">0\")/100","v":14.925094076983752},{"$f":"I100*(100-AVERAGEIF(J105:J116,\">0\"))/100","v":35.977748699469807},{"$f":"100-(J100+K100+M100)","v":46.635935807858282},{"$f":"IF((I102+M102)>100,M102*100/(I102+M102),M102)","v":2.4612214156881578},{"$f":"IF((N102+R102)>100,N102*100/(N102+R102),N102)","v":59.594690029689446},{"$f":"N100*AVERAGEIF(O105:O116,\">0\")/100","v":24.217526726647534},{"$f":"N100*(100-AVERAGEIF(O105:O116,\">0\"))/100","v":35.377163303041911},{"$f":"100-(O100+P100+R100)","v":38.74458031522969},{"$f":"IF((N102+R102)>100,R102*100/(N102+R102),R102)","v":1.6607296550808659},{"$f":"IF((S102+W102)>100,S102*100/(S102+W102),S102)","v":75.39874059562294},{"$f":"S100*AVERAGEIF(T105:T116,\">0\")/100","v":49.51155942774394},{"$f":"S100*(100-AVERAGEIF(T105:T116,\">0\"))/100","v":25.887181167879},{"$f":"100-(T100+U100+W100)","v":22.834446924633681},{"$f":"IF((S102+W102)>100,W102*100/(S102+W102),W102)","v":1.7668124797433791},{"$f":"IF((X102+AB102)>100,X102*100/(X102+AB102),X102)","v":93.856829332597442},{"$f":"X100*AVERAGEIF(Y105:Y116,\">0\")/100","v":85.559271301193164},{"$f":"X100*(100-AVERAGEIF(Y105:Y116,\">0\"))/100","v":8.2975580314042698},{"$f":"100-(Y100+Z100+AB100)","v":6.1078172245976816},{"$f":"IF((X102+AB102)>100,AB102*100/(X102+AB102),AB102)","v":3.5353442804897384E-2}]
["Regression period:",null,{"$f":"MinRegYear(C99,C105:C116)","v":2000},{"$f":"IF(MAX(C105:C116)-MIN(C105:C116)<5,AVERAGEIF(C105:C116,\">0\",D105:D116),\nIF(FORECAST($C101,D$105:D$116,$C$105:$C$116)<0,0,\nIF(FORECAST($C101,D$105:D$116,$C$105:$C$116)>100,100,\nFORECAST($C101,D$105:D$116,$C$105:$C$116))))","v":48.840108929529606},null,null,null,{"$f":"IF(MAX(C105:C116)-MIN(C105:C116)<5,AVERAGEIF(C105:C116,\">0\",H105:H116),\nIF(FORECAST($C101,H$105:H$116,$C$105:$C$116)<0,0,\nIF(FORECAST($C101,H$105:H$116,$C$105:$C$116)>100,100,\nFORECAST($C101,H$105:H$116,$C$105:$C$116))))","v":4.8335118616957118},{"$f":"IF(MAX(C105:C116)-MIN(C105:C116)<5,AVERAGEIF(C105:C116,\">0\",I105:I116),\nIF(FORECAST($C101,I$105:I$116,$C$105:$C$116)<0,0,\nIF(FORECAST($C101,I$105:I$116,$C$105:$C$116)>100,100,\nFORECAST($C101,I$105:I$116,$C$105:$C$116))))","v":59.604831790046546},null,null,null,{"$f":"IF(MAX(C105:C116)-MIN(C105:C116)<5,AVERAGEIF(C105:C116,\">0\",M105:M116),\nIF(FORECAST($C101,M$105:M$116,$C$105:$C$116)<0,0,\nIF(FORECAST($C101,M$105:M$116,$C$105:$C$116)>100,100,\nFORECAST($C101,M$105:M$116,$C$105:$C$116))))","v":2.8025041036260561},{"$f":"IF(MAX(C105:C116)-MIN(C105:C116)<5,AVERAGEIF(C105:C116,\">0\",N105:N116),\nIF(FORECAST($C101,N$105:N$116,$C$105:$C$116)<0,0,\nIF(FORECAST($C101,N$105:N$116,$C$105:$C$116)>100,100,\nFORECAST($C101,N$105:N$116,$C$105:$C$116))))","v":71.503628647176811},null,null,null,{"$f":"IF(MAX(C105:C116)-MIN(C105:C116)<5,AVERAGEIF(C105:C116,\">0\",R105:R116),\nIF(FORECAST($C101,R$105:R$116,$C$105:$C$116)<0,0,\nIF(FORECAST($C101,R$105:R$116,$C$105:$C$116)>100,100,\nFORECAST($C101,R$105:R$116,$C$105:$C$116))))","v":1.7671130414500116},{"$f":"IF(MAX(C105:C116)-MIN(C105:C116)<5,AVERAGEIF(C105:C116,\">0\",S105:S116),\nIF(FORECAST($C101,S$105:S$116,$C$105:$C$116)<0,0,\nIF(FORECAST($C101,S$105:S$116,$C$105:$C$116)>100,100,\nFORECAST($C101,S$105:S$116,$C$105:$C$116))))","v":85.224469147087575},null,null,null,{"$f":"IF(MAX(C105:C116)-MIN(C105:C116)<5,AVERAGEIF(C105:C116,\">0\",W105:W116),\nIF(FORECAST($C101,W$105:W$116,$C$105:$C$116)<0,0,\nIF(FORECAST($C101,W$105:W$116,$C$105:$C$116)>100,100,\nFORECAST($C101,W$105:W$116,$C$105:$C$116))))","v":0.73567113470593881},{"$f":"IF(MAX(C105:C116)-MIN(C105:C116)<5,AVERAGEIF(C105:C116,\">0\",X105:X116),\nIF(FORECAST($C101,X$105:X$116,$C$105:$C$116)<0,0,\nIF(FORECAST($C101,X$105:X$116,$C$105:$C$116)>100,100,\nFORECAST($C101,X$105:X$116,$C$105:$C$116))))","v":95.950895223872351},null,null,null,{"$f":"IF(MAX(C105:C116)-MIN(C105:C116)<5,AVERAGEIF(C105:C116,\">0\",AB105:AB116),\nIF(FORECAST($C101,AB$105:AB$116,$C$105:$C$116)<0,0,\nIF(FORECAST($C101,AB$105:AB$116,$C$105:$C$116)>100,100,\nFORECAST($C101,AB$105:AB$116,$C$105:$C$116))))","v":0.14502054760757765}]
[null,null,{"$f":"MaxRegYear(C100,C105:C116)","v":2014},{"$f":"IF(MAX(C105:C116)-MIN(C105:C116)<5,AVERAGEIF(C105:C116,\">0\",D105:D116),\nIF(FORECAST($C102,D$105:D$116,$C$105:$C$116)<0,0,\nIF(FORECAST($C102,D$105:D$116,$C$105:$C$116)>100,100,\nFORECAST($C102,D$105:D$116,$C$105:$C$116))))","v":39.173769150201906},null,null,null,{"$f":"IF(MAX(C105:C116)-MIN(C105:C116)<5,AVERAGEIF(C105:C116,\">0\",H105:H116),\nIF(FORECAST($C102,H$105:H$116,$C$105:$C$116)<0,0,\nIF(FORECAST($C102,H$105:H$116,$C$105:$C$116)>100,100,\nFORECAST($C102,H$105:H$116,$C$105:$C$116))))","v":6.0480103839534536},{"$f":"IF(MAX(C105:C116)-MIN(C105:C116)<5,AVERAGEIF(C105:C116,\">0\",I105:I116),\nIF(FORECAST($C102,I$105:I$116,$C$105:$C$116)<0,0,\nIF(FORECAST($C102,I$105:I$116,$C$105:$C$116)>100,100,\nFORECAST($C102,I$105:I$116,$C$105:$C$116))))","v":50.902842776453554},null,null,null,{"$f":"IF(MAX(C105:C116)-MIN(C105:C116)<5,AVERAGEIF(C105:C116,\">0\",M105:M116),\nIF(FORECAST($C102,M$105:M$116,$C$105:$C$116)<0,0,\nIF(FORECAST($C102,M$105:M$116,$C$105:$C$116)>100,100,\nFORECAST($C102,M$105:M$116,$C$105:$C$116))))","v":2.4612214156881578},{"$f":"IF(MAX(C105:C116)-MIN(C105:C116)<5,AVERAGEIF(C105:C116,\">0\",N105:N116),\nIF(FORECAST($C102,N$105:N$116,$C$105:$C$116)<0,0,\nIF(FORECAST($C102,N$105:N$116,$C$105:$C$116)>100,100,\nFORECAST($C102,N$105:N$116,$C$105:$C$116))))","v":59.594690029689446},null,null,null,{"$f":"IF(MAX(C105:C116)-MIN(C105:C116)<5,AVERAGEIF(C105:C116,\">0\",R105:R116),\nIF(FORECAST($C102,R$105:R$116,$C$105:$C$116)<0,0,\nIF(FORECAST($C102,R$105:R$116,$C$105:$C$116)>100,100,\nFORECAST($C102,R$105:R$116,$C$105:$C$116))))","v":1.6607296550808659},{"$f":"IF(MAX(C105:C116)-MIN(C105:C116)<5,AVERAGEIF(C105:C116,\">0\",S105:S116),\nIF(FORECAST($C102,S$105:S$116,$C$105:$C$116)<0,0,\nIF(FORECAST($C102,S$105:S$116,$C$105:$C$116)>100,100,\nFORECAST($C102,S$105:S$116,$C$105:$C$116))))","v":75.39874059562294},null,null,null,{"$f":"IF(MAX(C105:C116)-MIN(C105:C116)<5,AVERAGEIF(C105:C116,\">0\",W105:W116),\nIF(FORECAST($C102,W$105:W$116,$C$105:$C$116)<0,0,\nIF(FORECAST($C102,W$105:W$116,$C$105:$C$116)>100,100,\nFORECAST($C102,W$105:W$116,$C$105:$C$116))))","v":1.7668124797433791},{"$f":"IF(MAX(C105:C116)-MIN(C105:C116)<5,AVERAGEIF(C105:C116,\">0\",X105:X116),\nIF(FORECAST($C102,X$105:X$116,$C$105:$C$116)<0,0,\nIF(FORECAST($C102,X$105:X$116,$C$105:$C$116)>100,100,\nFORECAST($C102,X$105:X$116,$C$105:$C$116))))","v":93.856829332597442},null,null,null,{"$f":"IF(MAX(C105:C116)-MIN(C105:C116)<5,AVERAGEIF(C105:C116,\">0\",AB105:AB116),\nIF(FORECAST($C102,AB$105:AB$116,$C$105:$C$116)<0,0,\nIF(FORECAST($C102,AB$105:AB$116,$C$105:$C$116)>100,100,\nFORECAST($C102,AB$105:AB$116,$C$105:$C$116))))","v":3.5353442804897384E-2}]
[]
[null,"Survey","Year","Improved","Not shared",null,null,"Open defecation","Improved","Not shared",null,null,"Open defecation","Improved","Not shared",null,null,"Open defecation","Improved","Not shared",null,null,"Open defecation","Improved","Not shared",null,null,"Open defecation"]
[null,"DHS00",2000,{"$f":"IF(ISERROR(INDIRECT(CONCATENATE($B105,\"!C122\"))),\"\",INDIRECT(CONCATENATE($B105,\"!C122\")))","v":48.840108929529755},{"$f":"IF(ISERROR(INDIRECT(CONCATENATE($B105,\"!C129\"))),\"\",INDIRECT(CONCATENATE($B105,\"!C129\")))","v":"N/A"},null,null,{"$f":"IF(ISERROR(INDIRECT(CONCATENATE($B105,\"!C127\"))),\"\",INDIRECT(CONCATENATE($B105,\"!C127\")))","v":4.8335118616957002},{"$f":"IF(ISERROR(INDIRECT(CONCATENATE($B105,\"!D122\"))),\"\",INDIRECT(CONCATENATE($B105,\"!D122\")))","v":59.60483179004666},{"$f":"IF(ISERROR(INDIRECT(CONCATENATE($B105,\"!D129\"))),\"\",INDIRECT(CONCATENATE($B105,\"!D129\")))","v":"N/A"},null,null,{"$f":"IF(ISERROR(INDIRECT(CONCATENATE($B105,\"!D127\"))),\"\",INDIRECT(CONCATENATE($B105,\"!D127\")))","v":2.8025041036260512},{"$f":"IF(ISERROR(INDIRECT(CONCATENATE($B105,\"!E122\"))),\"\",INDIRECT(CONCATENATE($B105,\"!E122\")))","v":71.503628647176825},{"$f":"IF(ISERROR(INDIRECT(CONCATENATE($B105,\"!E129\"))),\"\",INDIRECT(CONCATENATE($B105,\"!E129\")))","v":"N/A"},null,null,{"$f":"IF(ISERROR(INDIRECT(CONCATENATE($B105,\"!E127\"))),\"\",INDIRECT(CONCATENATE($B105,\"!E127\")))","v":1.7671130414500105},{"$f":"IF(ISERROR(INDIRECT(CONCATENATE($B105,\"!F122\"))),\"\",INDIRECT(CONCATENATE($B105,\"!F122\")))","v":85.224469147087675},{"$f":"IF(ISERROR(INDIRECT(CONCATENATE($B105,\"!F129\"))),\"\",INDIRECT(CONCATENATE($B105,\"!F129\")))","v":"N/A"},null,null,{"$f":"IF(ISERROR(INDIRECT(CONCATENATE($B105,\"!F127\"))),\"\",INDIRECT(CONCATENATE($B105,\"!F127\")))","v":0.73567113470592727},{"$f":"IF(ISERROR(INDIRECT(CONCATENATE($B105,\"!G122\"))),\"\",INDIRECT(CONCATENATE($B105,\"!G122\")))","v":95.950895223872394},{"$f":"IF(ISERROR(INDIRECT(CONCATENATE($B105,\"!G129\"))),\"\",INDIRECT(CONCATENATE($B105,\"!G129\")))","v":"N/A"},null,null,{"$f":"IF(ISERROR(INDIRECT(CONCATENATE($B105,\"!G2127\"))),\"\",INDIRECT(CONCATENATE($B105,\"!G127\")))","v":0.14502054760757827}]
[null,"DHS12",2012,40.554674832962988,36.138608766126922,null,null,5.8745105950594878,52.145984064109768,29.320747649653363,null,null,2.5099760853935686,61.295966975044763,40.637054600976391,null,null,1.675927281705029,76.802416102975172,65.666295002569569,null,null,1.6195065733094465,94.15598160277959,91.159345472879252,null,null,5.1020172062424478E-2]
[null,null,null,"","",null,null,"","","",null,null,"","","",null,null,"","","",null,null,"","","",null,null,""]
[null,null,null,"","",null,null,"","","",null,null,"","","",null,null,"","","",null,null,"","","",null,null,""]
[null,null,null,"","",null,null,"","","",null,null,"","","",null,null,"","","",null,null,"","","",null,null,""]
[null,null,null,"","",null,null,"","","",null,null,"","","",null,null,"","","",null,null,"","","",null,null,""]
[null,null,null,"","",null,null,"","","",null,null,"","","",null,null,"","","",null,null,"","","",null,null,""]
[null,null,null,"","",null,null,"","","",null,null,"","","",null,null,"","","",null,null,"","","",null,null,""]
[null,null,null,"","",null,null,"","","",null,null,"","","",null,null,"","","",null,null,"","","",null,null,""]
[null,null,null,"","",null,null,"","","",null,null,"","","",null,null,"","","",null,null,"","","",null,null,""]
[null,null,null,"","",null,null,"","","",null,null,"","","",null,null,"","","",null,null,"","","",null,null,""]
[null,null,null,"","",null,null,"","","",null,null,"","","",null,null,"","","",null,null,"","","",null,null,""]
[]
[null,{"$f":"CONCATENATE(\"National use of sanitation facilities, \",C99,\"–\",C100)","v":"National use of sanitation facilities, 2000–2018"},null,null,null,null,null,null,null,null,null,null,null,null,null,null,null,null,"Data points used for regression"]
[]
[]
[]
[]
[]
[]
[]
[]
[]
[]
[]
[]
[]
[]
[]
[]
[]
[]
[]
[]
[]
[]
[]
[]
[]
[]
[]
[]
[]
[]
[]
[]
[]
[]
[]
[]
[]
[]
[]
[]
[]
[]
[]
[]
[]
[]
[]
[]
[]
[]
[]
[]
[]
[]
[]
[]
[]
[]
[]
[]
[]
[]
[]
[]
[]
[]
[]
[]
[]
[]
[]
[]
[]
[]
[]
[]
[]
[]
["URBAN",null,null,"Poorest",null,null,null,null,"Poor",null,null,null,null,"Middle",null,null,null,null,"Rich",null,null,null,null,"Richest"]
[null,null,null,"Improved","Basic","Limited","Unimproved","Open defecation","Improved","Basic","Limited","Unimproved","Open defecation","Improved","Basic","Limited","Unimproved","Open defecation","Improved","Basic","Limited","Unimproved","Open defecation","Improved","Basic","Limited","Unimproved","Open defecation"]
["Forecast period:",null,{"$f":"MinBase(C205:C216)","v":2000},{"$f":"IF((D201+H201)>100,D201*100/(D201+H201),D201)","v":57.009109354272823},{"$f":"D199*AVERAGEIF(E205:E216,\">0\")/100","v":16.134969668564242},{"$f":"D199*(100-AVERAGEIF(E205:E216,\">0\"))/100","v":40.874139685708585},{"$f":"100-(E199+F199+H199)","v":39.329330387079267},{"$f":"IF((D201+H201)>100,H201*100/(D201+H201),H201)","v":3.6615602586479099},{"$f":"IF((I201+M201)>100,I201*100/(I201+M201),I201)","v":70.714713867216233},{"$f":"I199*AVERAGEIF(J205:J216,\">0\")/100","v":22.736461678761192},{"$f":"I199*(100-AVERAGEIF(J205:J216,\">0\"))/100","v":47.978252188455038},{"$f":"100-(J199+K199+M199)","v":27.050363830725075},{"$f":"IF((I201+M201)>100,M201*100/(I201+M201),M201)","v":2.2349223020586919},{"$f":"IF((N201+R201)>100,N201*100/(N201+R201),N201)","v":78.076375397936772},{"$f":"N199*AVERAGEIF(O205:O216,\">0\")/100","v":35.330814524194359},{"$f":"N199*(100-AVERAGEIF(O205:O216,\">0\"))/100","v":42.745560873742413},{"$f":"100-(O199+P199+R199)","v":20.811134864563172},{"$f":"IF((N201+R201)>100,R201*100/(N201+R201),R201)","v":1.1124897375000558},{"$f":"IF((S201+W201)>100,S201*100/(S201+W201),S201)","v":89.921739626529643},{"$f":"S199*AVERAGEIF(T205:T216,\">0\")/100","v":64.117109836115816},{"$f":"S199*(100-AVERAGEIF(T205:T216,\">0\"))/100","v":25.804629790413827},{"$f":"100-(T199+U199+W199)","v":9.7327720294553899},{"$f":"IF((S201+W201)>100,W201*100/(S201+W201),W201)","v":0.3454883440149672},{"$f":"IF((X201+AB201)>100,X201*100/(X201+AB201),X201)","v":97.041984359403031},{"$f":"X199*AVERAGEIF(Y205:Y216,\">0\")/100","v":88.663674314210269},{"$f":"X199*(100-AVERAGEIF(Y205:Y216,\">0\"))/100","v":8.3783100451927552},{"$f":"100-(Y199+Z199+AB199)","v":2.9580156405969831},{"$f":"IF((X201+AB201)>100,AB201*100/(X201+AB201),AB201)","v":0}]
[null,null,{"$f":"MaxTarget(C205:C216)","v":2018},{"$f":"IF((D202+H202)>100,D202*100/(D202+H202),D202)","v":43.679552847480409},{"$f":"D200*AVERAGEIF(E205:E216,\">0\")/100","v":12.362379772518285},{"$f":"D200*(100-AVERAGEIF(E205:E216,\">0\"))/100","v":31.317173074962124},{"$f":"100-(E200+F200+H200)","v":51.624684475140867},{"$f":"IF((D202+H202)>100,H202*100/(D202+H202),H202)","v":4.695762677378724},{"$f":"IF((I202+M202)>100,I202*100/(I202+M202),I202)","v":53.562406004830791},{"$f":"I200*AVERAGEIF(J205:J216,\">0\")/100","v":17.221586922317623},{"$f":"I200*(100-AVERAGEIF(J205:J216,\">0\"))/100","v":36.340819082513164},{"$f":"100-(J200+K200+M200)","v":45.14597822329057},{"$f":"IF((I202+M202)>100,M202*100/(I202+M202),M202)","v":1.2916157718786394},{"$f":"IF((N202+R202)>100,N202*100/(N202+R202),N202)","v":65.068140346037353},{"$f":"N200*AVERAGEIF(O205:O216,\">0\")/100","v":29.444379125991595},{"$f":"N200*(100-AVERAGEIF(O205:O216,\">0\"))/100","v":35.623761220045758},{"$f":"100-(O200+P200+R200)","v":33.069549503849657},{"$f":"IF((N202+R202)>100,R202*100/(N202+R202),R202)","v":1.8623101501129895},{"$f":"IF((S202+W202)>100,S202*100/(S202+W202),S202)","v":76.412045017797709},{"$f":"S200*AVERAGEIF(T205:T216,\">0\")/100","v":54.484260464228321},{"$f":"S200*(100-AVERAGEIF(T205:T216,\">0\"))/100","v":21.927784553569392},{"$f":"100-(T200+U200+W200)","v":21.614979936462987},{"$f":"IF((S202+W202)>100,W202*100/(S202+W202),W202)","v":1.9729750457393038},{"$f":"IF((X202+AB202)>100,X202*100/(X202+AB202),X202)","v":96.409047121446122},{"$f":"X200*AVERAGEIF(Y205:Y216,\">0\")/100","v":88.085382954053131},{"$f":"X200*(100-AVERAGEIF(Y205:Y216,\">0\"))/100","v":8.3236641673929856},{"$f":"100-(Y200+Z200+AB200)","v":3.5909528785538782},{"$f":"IF((X202+AB202)>100,AB202*100/(X202+AB202),AB202)","v":0}]
["Regression period:",null,{"$f":"MinRegYear(C199,C205:C216)","v":2000},{"$f":"IF(MAX(C205:C216)-MIN(C205:C216)<5,AVERAGEIF(C205:C216,\">0\",D205:D216),\nIF(FORECAST($C201,D$205:D$216,$C$205:$C$216)<0,0,\nIF(FORECAST($C201,D$205:D$216,$C$205:$C$216)>100,100,\nFORECAST($C201,D$205:D$216,$C$205:$C$216))))","v":57.009109354272823},null,null,null,{"$f":"IF(MAX(C205:C216)-MIN(C205:C216)<5,AVERAGEIF(C205:C216,\">0\",H205:H216),\nIF(FORECAST($C201,H$205:H$216,$C$205:$C$216)<0,0,\nIF(FORECAST($C201,H$205:H$216,$C$205:$C$216)>100,100,\nFORECAST($C201,H$205:H$216,$C$205:$C$216))))","v":3.6615602586479099},{"$f":"IF(MAX(C205:C216)-MIN(C205:C216)<5,AVERAGEIF(C205:C216,\">0\",I205:I216),\nIF(FORECAST($C201,I$205:I$216,$C$205:$C$216)<0,0,\nIF(FORECAST($C201,I$205:I$216,$C$205:$C$216)>100,100,\nFORECAST($C201,I$205:I$216,$C$205:$C$216))))","v":70.714713867216233},null,null,null,{"$f":"IF(MAX(C205:C216)-MIN(C205:C216)<5,AVERAGEIF(C205:C216,\">0\",M205:M216),\nIF(FORECAST($C201,M$205:M$216,$C$205:$C$216)<0,0,\nIF(FORECAST($C201,M$205:M$216,$C$205:$C$216)>100,100,\nFORECAST($C201,M$205:M$216,$C$205:$C$216))))","v":2.2349223020586919},{"$f":"IF(MAX(C205:C216)-MIN(C205:C216)<5,AVERAGEIF(C205:C216,\">0\",N205:N216),\nIF(FORECAST($C201,N$205:N$216,$C$205:$C$216)<0,0,\nIF(FORECAST($C201,N$205:N$216,$C$205:$C$216)>100,100,\nFORECAST($C201,N$205:N$216,$C$205:$C$216))))","v":78.076375397936772},null,null,null,{"$f":"IF(MAX(C205:C216)-MIN(C205:C216)<5,AVERAGEIF(C205:C216,\">0\",R205:R216),\nIF(FORECAST($C201,R$205:R$216,$C$205:$C$216)<0,0,\nIF(FORECAST($C201,R$205:R$216,$C$205:$C$216)>100,100,\nFORECAST($C201,R$205:R$216,$C$205:$C$216))))","v":1.1124897375000558},{"$f":"IF(MAX(C205:C216)-MIN(C205:C216)<5,AVERAGEIF(C205:C216,\">0\",S205:S216),\nIF(FORECAST($C201,S$205:S$216,$C$205:$C$216)<0,0,\nIF(FORECAST($C201,S$205:S$216,$C$205:$C$216)>100,100,\nFORECAST($C201,S$205:S$216,$C$205:$C$216))))","v":89.921739626529643},null,null,null,{"$f":"IF(MAX(C205:C216)-MIN(C205:C216)<5,AVERAGEIF(C205:C216,\">0\",W205:W216),\nIF(FORECAST($C201,W$205:W$216,$C$205:$C$216)<0,0,\nIF(FORECAST($C201,W$205:W$216,$C$205:$C$216)>100,100,\nFORECAST($C201,W$205:W$216,$C$205:$C$216))))","v":0.3454883440149672},{"$f":"IF(MAX(C205:C216)-MIN(C205:C216)<5,AVERAGEIF(C205:C216,\">0\",X205:X216),\nIF(FORECAST($C201,X$205:X$216,$C$205:$C$216)<0,0,\nIF(FORECAST($C201,X$205:X$216,$C$205:$C$216)>100,100,\nFORECAST($C201,X$205:X$216,$C$205:$C$216))))","v":97.041984359403031},null,null,null,{"$f":"IF(MAX(C205:C216)-MIN(C205:C216)<5,AVERAGEIF(C205:C216,\">0\",AB205:AB216),\nIF(FORECAST($C201,AB$205:AB$216,$C$205:$C$216)<0,0,\nIF(FORECAST($C201,AB$205:AB$216,$C$205:$C$216)>100,100,\nFORECAST($C201,AB$205:AB$216,$C$205:$C$216))))","v":0}]
[null,null,{"$f":"MaxRegYear(C200,C205:C216)","v":2014},{"$f":"IF(MAX(C205:C216)-MIN(C205:C216)<5,AVERAGEIF(C205:C216,\">0\",D205:D216),\nIF(FORECAST($C202,D$205:D$216,$C$205:$C$216)<0,0,\nIF(FORECAST($C202,D$205:D$216,$C$205:$C$216)>100,100,\nFORECAST($C202,D$205:D$216,$C$205:$C$216))))","v":43.679552847480409},null,null,null,{"$f":"IF(MAX(C205:C216)-MIN(C205:C216)<5,AVERAGEIF(C205:C216,\">0\",H205:H216),\nIF(FORECAST($C202,H$205:H$216,$C$205:$C$216)<0,0,\nIF(FORECAST($C202,H$205:H$216,$C$205:$C$216)>100,100,\nFORECAST($C202,H$205:H$216,$C$205:$C$216))))","v":4.695762677378724},{"$f":"IF(MAX(C205:C216)-MIN(C205:C216)<5,AVERAGEIF(C205:C216,\">0\",I205:I216),\nIF(FORECAST($C202,I$205:I$216,$C$205:$C$216)<0,0,\nIF(FORECAST($C202,I$205:I$216,$C$205:$C$216)>100,100,\nFORECAST($C202,I$205:I$216,$C$205:$C$216))))","v":53.562406004830791},null,null,null,{"$f":"IF(MAX(C205:C216)-MIN(C205:C216)<5,AVERAGEIF(C205:C216,\">0\",M205:M216),\nIF(FORECAST($C202,M$205:M$216,$C$205:$C$216)<0,0,\nIF(FORECAST($C202,M$205:M$216,$C$205:$C$216)>100,100,\nFORECAST($C202,M$205:M$216,$C$205:$C$216))))","v":1.2916157718786394},{"$f":"IF(MAX(C205:C216)-MIN(C205:C216)<5,AVERAGEIF(C205:C216,\">0\",N205:N216),\nIF(FORECAST($C202,N$205:N$216,$C$205:$C$216)<0,0,\nIF(FORECAST($C202,N$205:N$216,$C$205:$C$216)>100,100,\nFORECAST($C202,N$205:N$216,$C$205:$C$216))))","v":65.068140346037353},null,null,null,{"$f":"IF(MAX(C205:C216)-MIN(C205:C216)<5,AVERAGEIF(C205:C216,\">0\",R205:R216),\nIF(FORECAST($C202,R$205:R$216,$C$205:$C$216)<0,0,\nIF(FORECAST($C202,R$205:R$216,$C$205:$C$216)>100,100,\nFORECAST($C202,R$205:R$216,$C$205:$C$216))))","v":1.8623101501129895},{"$f":"IF(MAX(C205:C216)-MIN(C205:C216)<5,AVERAGEIF(C205:C216,\">0\",S205:S216),\nIF(FORECAST($C202,S$205:S$216,$C$205:$C$216)<0,0,\nIF(FORECAST($C202,S$205:S$216,$C$205:$C$216)>100,100,\nFORECAST($C202,S$205:S$216,$C$205:$C$216))))","v":76.412045017797709},null,null,null,{"$f":"IF(MAX(C205:C216)-MIN(C205:C216)<5,AVERAGEIF(C205:C216,\">0\",W205:W216),\nIF(FORECAST($C202,W$205:W$216,$C$205:$C$216)<0,0,\nIF(FORECAST($C202,W$205:W$216,$C$205:$C$216)>100,100,\nFORECAST($C202,W$205:W$216,$C$205:$C$216))))","v":1.9729750457393038},{"$f":"IF(MAX(C205:C216)-MIN(C205:C216)<5,AVERAGEIF(C205:C216,\">0\",X205:X216),\nIF(FORECAST($C202,X$205:X$216,$C$205:$C$216)<0,0,\nIF(FORECAST($C202,X$205:X$216,$C$205:$C$216)>100,100,\nFORECAST($C202,X$205:X$216,$C$205:$C$216))))","v":96.409047121446122},null,null,null,{"$f":"IF(MAX(C205:C216)-MIN(C205:C216)<5,AVERAGEIF(C205:C216,\">0\",AB205:AB216),\nIF(FORECAST($C202,AB$205:AB$216,$C$205:$C$216)<0,0,\nIF(FORECAST($C202,AB$205:AB$216,$C$205:$C$216)>100,100,\nFORECAST($C202,AB$205:AB$216,$C$205:$C$216))))","v":0}]
[]
[null,"Survey","Year","Improved","Not shared",null,null,"Open defecation","Improved","Not shared",null,null,"Open defecation","Improved","Not shared",null,null,"Open defecation","Improved","Not shared",null,null,"Open defecation","Improved","Not shared",null,null,"Open defecation"]
[null,"DHS00",2000,{"$f":"IF(ISERROR(INDIRECT(CONCATENATE($B205,\"!H122\"))),\"\",INDIRECT(CONCATENATE($B205,\"!H122\")))","v":57.00910935427278},{"$f":"IF(ISERROR(INDIRECT(CONCATENATE($B205,\"!H129\"))),\"\",INDIRECT(CONCATENATE($B205,\"!H129\")))","v":"N/A"},null,null,{"$f":"IF(ISERROR(INDIRECT(CONCATENATE($B205,\"!H127\"))),\"\",INDIRECT(CONCATENATE($B205,\"!H127\")))","v":3.661560258647901},{"$f":"IF(ISERROR(INDIRECT(CONCATENATE($B205,\"!I122\"))),\"\",INDIRECT(CONCATENATE($B205,\"!I122\")))","v":70.714713867215892},{"$f":"IF(ISERROR(INDIRECT(CONCATENATE($B205,\"!I129\"))),\"\",INDIRECT(CONCATENATE($B205,\"!I129\")))","v":"N/A"},null,null,{"$f":"IF(ISERROR(INDIRECT(CONCATENATE($B205,\"!I127\"))),\"\",INDIRECT(CONCATENATE($B205,\"!I127\")))","v":2.234922302058707},{"$f":"IF(ISERROR(INDIRECT(CONCATENATE($B205,\"!J122\"))),\"\",INDIRECT(CONCATENATE($B205,\"!J122\")))","v":78.076375397936687},{"$f":"IF(ISERROR(INDIRECT(CONCATENATE($B205,\"!J129\"))),\"\",INDIRECT(CONCATENATE($B205,\"!J129\")))","v":"N/A"},null,null,{"$f":"IF(ISERROR(INDIRECT(CONCATENATE($B205,\"!J127\"))),\"\",INDIRECT(CONCATENATE($B205,\"!J127\")))","v":1.1124897375000486},{"$f":"IF(ISERROR(INDIRECT(CONCATENATE($B205,\"!K122\"))),\"\",INDIRECT(CONCATENATE($B205,\"!K122\")))","v":89.921739626529643},{"$f":"IF(ISERROR(INDIRECT(CONCATENATE($B205,\"!K129\"))),\"\",INDIRECT(CONCATENATE($B205,\"!K129\")))","v":"N/A"},null,null,{"$f":"IF(ISERROR(INDIRECT(CONCATENATE($B205,\"!K127\"))),\"\",INDIRECT(CONCATENATE($B205,\"!K127\")))","v":0.34548834401495865},{"$f":"IF(ISERROR(INDIRECT(CONCATENATE($B205,\"!L122\"))),\"\",INDIRECT(CONCATENATE($B205,\"!L122\")))","v":97.041984359403017},{"$f":"IF(ISERROR(INDIRECT(CONCATENATE($B205,\"!L129\"))),\"\",INDIRECT(CONCATENATE($B205,\"!L129\")))","v":"N/A"},null,null,{"$f":"IF(ISERROR(INDIRECT(CONCATENATE($B205,\"!L2127\"))),\"\",INDIRECT(CONCATENATE($B205,\"!L127\")))","v":0}]
[null,"DHS12",2012,45.583775205593696,28.302441226184371,null,null,4.5480194747029055,56.012735699457068,32.152377398364834,null,null,1.4263738476186474,66.926459639165884,45.251606960647919,null,null,1.7551929483111419,78.342001390473627,71.303235571745233,null,null,1.7404769454929703,96.499466726868519,91.366303873009244,null,null,0]
[null,null,null,"","",null,null,"","","",null,null,"","","",null,null,"","","",null,null,"","","",null,null,""]
[null,null,null,"","",null,null,"","","",null,null,"","","",null,null,"","","",null,null,"","","",null,null,""]
[null,null,null,"","",null,null,"","","",null,null,"","","",null,null,"","","",null,null,"","","",null,null,""]
[null,null,null,"","",null,null,"","","",null,null,"","","",null,null,"","","",null,null,"","","",null,null,""]
[null,null,null,"","",null,null,"","","",null,null,"","","",null,null,"","","",null,null,"","","",null,null,""]
[null,null,null,"","",null,null,"","","",null,null,"","","",null,null,"","","",null,null,"","","",null,null,""]
[null,null,null,"","",null,null,"","","",null,null,"","","",null,null,"","","",null,null,"","","",null,null,""]
[null,null,null,"","",null,null,"","","",null,null,"","","",null,null,"","","",null,null,"","","",null,null,""]
[null,null,null,"","",null,null,"","","",null,null,"","","",null,null,"","","",null,null,"","","",null,null,""]
[null,null,null,"","",null,null,"","","",null,null,"","","",null,null,"","","",null,null,"","","",null,null,""]
[]
[null,{"$f":"CONCATENATE(\"Urban use of sanitation facilities, \",C199,\"–\",C200)","v":"Urban use of sanitation facilities, 2000–2018"},null,null,null,null,null,null,null,null,null,null,null,null,null,null,null,null,"Data points used for regression"]
[]
[]
[]
[]
[]
[]
[]
[]
[]
[]
[]
[]
[]
[]
[]
[]
[]
[]
[]
[]
[]
[]
[]
[]
[]
[]
[]
[]
[]
[]
[]
[]
[]
[]
[]
[]
[]
[]
[]
[]
[]
[]
[]
[]
[]
[]
[]
[]
[]
[]
[]
[]
[]
[]
[]
[]
[]
[]
[]
[]
[]
[]
[]
[]
[]
[]
[]
[]
[]
[]
[]
[]
[]
[]
[]
[]
[]
[]
["RURAL",null,null,"Poorest",null,null,null,null,"Poor",null,null,null,null,"Middle",null,null,null,null,"Rich",null,null,null,null,"Richest"]
[null,null,null,"Improved","Basic","Limited","Unimproved","Open defecation","Improved","Basic","Limited","Unimproved","Open defecation","Improved","Basic","Limited","Unimproved","Open defecation","Improved","Basic","Limited","Unimproved","Open defecation","Improved","Basic","Limited","Unimproved","Open defecation"]
["Forecast period:",null,{"$f":"MinBase(C305:C316)","v":2000},{"$f":"IF((D301+H301)>100,D301*100/(D301+H301),D301)","v":48.557887426124353},{"$f":"D299*AVERAGEIF(E305:E316,\">0\")/100","v":23.620908757328749},{"$f":"D299*(100-AVERAGEIF(E305:E316,\">0\"))/100","v":24.936978668795604},{"$f":"100-(E299+F299+H299)","v":48.341736487197863},{"$f":"IF((D301+H301)>100,H301*100/(D301+H301),H301)","v":3.1003760866777839},{"$f":"IF((I301+M301)>100,I301*100/(I301+M301),I301)","v":47.704916323014459},{"$f":"I299*AVERAGEIF(J305:J316,\">0\")/100","v":18.354930119506957},{"$f":"I299*(100-AVERAGEIF(J305:J316,\">0\"))/100","v":29.349986203507502},{"$f":"100-(J299+K299+M299)","v":44.637957479285774},{"$f":"IF((I301+M301)>100,M301*100/(I301+M301),M301)","v":7.6571261976997675},{"$f":"IF((N301+R301)>100,N301*100/(N301+R301),N301)","v":49.528600960185258},{"$f":"N299*AVERAGEIF(O305:O316,\">0\")/100","v":31.47742699425914},{"$f":"N299*(100-AVERAGEIF(O305:O316,\">0\"))/100","v":18.051173965926122},{"$f":"100-(O299+P299+R299)","v":47.093537234838976},{"$f":"IF((N301+R301)>100,R301*100/(N301+R301),R301)","v":3.3778618049757654},{"$f":"IF((S301+W301)>100,S301*100/(S301+W301),S301)","v":55.268259715053318},{"$f":"S299*AVERAGEIF(T305:T316,\">0\")/100","v":34.83825897346415},{"$f":"S299*(100-AVERAGEIF(T305:T316,\">0\"))/100","v":20.430000741589161},{"$f":"100-(T299+U299+W299)","v":41.916113073228722},{"$f":"IF((S301+W301)>100,W301*100/(S301+W301),W301)","v":2.8156272117179668},{"$f":"IF((X301+AB301)>100,X301*100/(X301+AB301),X301)","v":71.278086381263165},{"$f":"X299*AVERAGEIF(Y305:Y316,\">0\")/100","v":53.863265720548007},{"$f":"X299*(100-AVERAGEIF(Y305:Y316,\">0\"))/100","v":17.414820660715158},{"$f":"100-(Y299+Z299+AB299)","v":26.894496188908136},{"$f":"IF((X301+AB301)>100,AB301*100/(X301+AB301),AB301)","v":1.8274174298286923}]
[null,null,{"$f":"MaxTarget(C305:C316)","v":2018},{"$f":"IF((D302+H302)>100,D302*100/(D302+H302),D302)","v":36.287786617741176},{"$f":"D300*AVERAGEIF(E305:E316,\">0\")/100","v":17.652137317694113},{"$f":"D300*(100-AVERAGEIF(E305:E316,\">0\"))/100","v":18.635649300047064},{"$f":"100-(E300+F300+H300)","v":54.705895744749569},{"$f":"IF((D302+H302)>100,H302*100/(D302+H302),H302)","v":9.0063176375092553},{"$f":"IF((I302+M302)>100,I302*100/(I302+M302),I302)","v":37.188719914553985},{"$f":"I300*AVERAGEIF(J305:J316,\">0\")/100","v":14.308721362042254},{"$f":"I300*(100-AVERAGEIF(J305:J316,\">0\"))/100","v":22.879998552511733},{"$f":"100-(J300+K300+M300)","v":57.018054558251151},{"$f":"IF((I302+M302)>100,M302*100/(I302+M302),M302)","v":5.7932255271948634},{"$f":"IF((N302+R302)>100,N302*100/(N302+R302),N302)","v":38.046837821199915},{"$f":"N300*AVERAGEIF(O305:O316,\">0\")/100","v":24.180302626395004},{"$f":"N300*(100-AVERAGEIF(O305:O316,\">0\"))/100","v":13.866535194804911},{"$f":"100-(O300+P300+R300)","v":57.046024579512988},{"$f":"IF((N302+R302)>100,R302*100/(N302+R302),R302)","v":4.9071375992870969},{"$f":"IF((S302+W302)>100,S302*100/(S302+W302),S302)","v":43.603400170896521},{"$f":"S300*AVERAGEIF(T305:T316,\">0\")/100","v":27.485333446523171},{"$f":"S300*(100-AVERAGEIF(T305:T316,\">0\"))/100","v":16.11806672437335},{"$f":"100-(T300+U300+W300)","v":53.006002131164436},{"$f":"IF((S302+W302)>100,W302*100/(S302+W302),W302)","v":3.3905976979390431},{"$f":"IF((X302+AB302)>100,X302*100/(X302+AB302),X302)","v":63.982318930770361},{"$f":"X300*AVERAGEIF(Y305:Y316,\">0\")/100","v":48.350016406877884},{"$f":"X300*(100-AVERAGEIF(Y305:Y316,\">0\"))/100","v":15.632302523892479},{"$f":"100-(Y300+Z300+AB300)","v":34.492413984829881},{"$f":"IF((X302+AB302)>100,AB302*100/(X302+AB302),AB302)","v":1.5252670843997507}]
["Regression period:",null,{"$f":"MinRegYear(C299,C305:C316)","v":2000},{"$f":"IF(MAX(C305:C316)-MIN(C305:C316)<5,AVERAGEIF(C305:C316,\">0\",D305:D316),\nIF(FORECAST($C301,D$305:D$316,$C$305:$C$316)<0,0,\nIF(FORECAST($C301,D$305:D$316,$C$305:$C$316)>100,100,\nFORECAST($C301,D$305:D$316,$C$305:$C$316))))","v":48.557887426124353},null,null,null,{"$f":"IF(MAX(C305:C316)-MIN(C305:C316)<5,AVERAGEIF(C305:C316,\">0\",H305:H316),\nIF(FORECAST($C301,H$305:H$316,$C$305:$C$316)<0,0,\nIF(FORECAST($C301,H$305:H$316,$C$305:$C$316)>100,100,\nFORECAST($C301,H$305:H$316,$C$305:$C$316))))","v":3.1003760866777839},{"$f":"IF(MAX(C305:C316)-MIN(C305:C316)<5,AVERAGEIF(C305:C316,\">0\",I305:I316),\nIF(FORECAST($C301,I$305:I$316,$C$305:$C$316)<0,0,\nIF(FORECAST($C301,I$305:I$316,$C$305:$C$316)>100,100,\nFORECAST($C301,I$305:I$316,$C$305:$C$316))))","v":47.704916323014459},null,null,null,{"$f":"IF(MAX(C305:C316)-MIN(C305:C316)<5,AVERAGEIF(C305:C316,\">0\",M305:M316),\nIF(FORECAST($C301,M$305:M$316,$C$305:$C$316)<0,0,\nIF(FORECAST($C301,M$305:M$316,$C$305:$C$316)>100,100,\nFORECAST($C301,M$305:M$316,$C$305:$C$316))))","v":7.6571261976997675},{"$f":"IF(MAX(C305:C316)-MIN(C305:C316)<5,AVERAGEIF(C305:C316,\">0\",N305:N316),\nIF(FORECAST($C301,N$305:N$316,$C$305:$C$316)<0,0,\nIF(FORECAST($C301,N$305:N$316,$C$305:$C$316)>100,100,\nFORECAST($C301,N$305:N$316,$C$305:$C$316))))","v":49.528600960185258},null,null,null,{"$f":"IF(MAX(C305:C316)-MIN(C305:C316)<5,AVERAGEIF(C305:C316,\">0\",R305:R316),\nIF(FORECAST($C301,R$305:R$316,$C$305:$C$316)<0,0,\nIF(FORECAST($C301,R$305:R$316,$C$305:$C$316)>100,100,\nFORECAST($C301,R$305:R$316,$C$305:$C$316))))","v":3.3778618049757654},{"$f":"IF(MAX(C305:C316)-MIN(C305:C316)<5,AVERAGEIF(C305:C316,\">0\",S305:S316),\nIF(FORECAST($C301,S$305:S$316,$C$305:$C$316)<0,0,\nIF(FORECAST($C301,S$305:S$316,$C$305:$C$316)>100,100,\nFORECAST($C301,S$305:S$316,$C$305:$C$316))))","v":55.268259715053318},null,null,null,{"$f":"IF(MAX(C305:C316)-MIN(C305:C316)<5,AVERAGEIF(C305:C316,\">0\",W305:W316),\nIF(FORECAST($C301,W$305:W$316,$C$305:$C$316)<0,0,\nIF(FORECAST($C301,W$305:W$316,$C$305:$C$316)>100,100,\nFORECAST($C301,W$305:W$316,$C$305:$C$316))))","v":2.8156272117179668},{"$f":"IF(MAX(C305:C316)-MIN(C305:C316)<5,AVERAGEIF(C305:C316,\">0\",X305:X316),\nIF(FORECAST($C301,X$305:X$316,$C$305:$C$316)<0,0,\nIF(FORECAST($C301,X$305:X$316,$C$305:$C$316)>100,100,\nFORECAST($C301,X$305:X$316,$C$305:$C$316))))","v":71.278086381263165},null,null,null,{"$f":"IF(MAX(C305:C316)-MIN(C305:C316)<5,AVERAGEIF(C305:C316,\">0\",AB305:AB316),\nIF(FORECAST($C301,AB$305:AB$316,$C$305:$C$316)<0,0,\nIF(FORECAST($C301,AB$305:AB$316,$C$305:$C$316)>100,100,\nFORECAST($C301,AB$305:AB$316,$C$305:$C$316))))","v":1.8274174298286923}]
[null,null,{"$f":"MaxRegYear(C300,C305:C316)","v":2014},{"$f":"IF(MAX(C305:C316)-MIN(C305:C316)<5,AVERAGEIF(C305:C316,\">0\",D305:D316),\nIF(FORECAST($C302,D$305:D$316,$C$305:$C$316)<0,0,\nIF(FORECAST($C302,D$305:D$316,$C$305:$C$316)>100,100,\nFORECAST($C302,D$305:D$316,$C$305:$C$316))))","v":36.287786617741176},null,null,null,{"$f":"IF(MAX(C305:C316)-MIN(C305:C316)<5,AVERAGEIF(C305:C316,\">0\",H305:H316),\nIF(FORECAST($C302,H$305:H$316,$C$305:$C$316)<0,0,\nIF(FORECAST($C302,H$305:H$316,$C$305:$C$316)>100,100,\nFORECAST($C302,H$305:H$316,$C$305:$C$316))))","v":9.0063176375092553},{"$f":"IF(MAX(C305:C316)-MIN(C305:C316)<5,AVERAGEIF(C305:C316,\">0\",I305:I316),\nIF(FORECAST($C302,I$305:I$316,$C$305:$C$316)<0,0,\nIF(FORECAST($C302,I$305:I$316,$C$305:$C$316)>100,100,\nFORECAST($C302,I$305:I$316,$C$305:$C$316))))","v":37.188719914553985},null,null,null,{"$f":"IF(MAX(C305:C316)-MIN(C305:C316)<5,AVERAGEIF(C305:C316,\">0\",M305:M316),\nIF(FORECAST($C302,M$305:M$316,$C$305:$C$316)<0,0,\nIF(FORECAST($C302,M$305:M$316,$C$305:$C$316)>100,100,\nFORECAST($C302,M$305:M$316,$C$305:$C$316))))","v":5.7932255271948634},{"$f":"IF(MAX(C305:C316)-MIN(C305:C316)<5,AVERAGEIF(C305:C316,\">0\",N305:N316),\nIF(FORECAST($C302,N$305:N$316,$C$305:$C$316)<0,0,\nIF(FORECAST($C302,N$305:N$316,$C$305:$C$316)>100,100,\nFORECAST($C302,N$305:N$316,$C$305:$C$316))))","v":38.046837821199915},null,null,null,{"$f":"IF(MAX(C305:C316)-MIN(C305:C316)<5,AVERAGEIF(C305:C316,\">0\",R305:R316),\nIF(FORECAST($C302,R$305:R$316,$C$305:$C$316)<0,0,\nIF(FORECAST($C302,R$305:R$316,$C$305:$C$316)>100,100,\nFORECAST($C302,R$305:R$316,$C$305:$C$316))))","v":4.9071375992870969},{"$f":"IF(MAX(C305:C316)-MIN(C305:C316)<5,AVERAGEIF(C305:C316,\">0\",S305:S316),\nIF(FORECAST($C302,S$305:S$316,$C$305:$C$316)<0,0,\nIF(FORECAST($C302,S$305:S$316,$C$305:$C$316)>100,100,\nFORECAST($C302,S$305:S$316,$C$305:$C$316))))","v":43.603400170896521},null,null,null,{"$f":"IF(MAX(C305:C316)-MIN(C305:C316)<5,AVERAGEIF(C305:C316,\">0\",W305:W316),\nIF(FORECAST($C302,W$305:W$316,$C$305:$C$316)<0,0,\nIF(FORECAST($C302,W$305:W$316,$C$305:$C$316)>100,100,\nFORECAST($C302,W$305:W$316,$C$305:$C$316))))","v":3.3905976979390431},{"$f":"IF(MAX(C305:C316)-MIN(C305:C316)<5,AVERAGEIF(C305:C316,\">0\",X305:X316),\nIF(FORECAST($C302,X$305:X$316,$C$305:$C$316)<0,0,\nIF(FORECAST($C302,X$305:X$316,$C$305:$C$316)>100,100,\nFORECAST($C302,X$305:X$316,$C$305:$C$316))))","v":63.982318930770361},null,null,null,{"$f":"IF(MAX(C305:C316)-MIN(C305:C316)<5,AVERAGEIF(C305:C316,\">0\",AB305:AB316),\nIF(FORECAST($C302,AB$305:AB$316,$C$305:$C$316)<0,0,\nIF(FORECAST($C302,AB$305:AB$316,$C$305:$C$316)>100,100,\nFORECAST($C302,AB$305:AB$316,$C$305:$C$316))))","v":1.5252670843997507}]
[]
[null,"Survey","Year","Improved","Not shared",null,null,"Open defecation","Improved","Not shared",null,null,"Open defecation","Improved","Not shared",null,null,"Open defecation","Improved","Not shared",null,null,"Open defecation","Improved","Not shared",null,null,"Open defecation"]
[null,"DHS00",2000,{"$f":"IF(ISERROR(INDIRECT(CONCATENATE($B305,\"!M122\"))),\"\",INDIRECT(CONCATENATE($B305,\"!M122\")))","v":48.557887426124417},{"$f":"IF(ISERROR(INDIRECT(CONCATENATE($B305,\"!M129\"))),\"\",INDIRECT(CONCATENATE($B305,\"!M129\")))","v":"N/A"},null,null,{"$f":"IF(ISERROR(INDIRECT(CONCATENATE($B305,\"!M127\"))),\"\",INDIRECT(CONCATENATE($B305,\"!M127\")))","v":3.1003760866777683},{"$f":"IF(ISERROR(INDIRECT(CONCATENATE($B305,\"!N122\"))),\"\",INDIRECT(CONCATENATE($B305,\"!N122\")))","v":47.70491632301438},{"$f":"IF(ISERROR(INDIRECT(CONCATENATE($B305,\"!N129\"))),\"\",INDIRECT(CONCATENATE($B305,\"!N129\")))","v":"N/A"},null,null,{"$f":"IF(ISERROR(INDIRECT(CONCATENATE($B305,\"!N127\"))),\"\",INDIRECT(CONCATENATE($B305,\"!N127\")))","v":7.6571261976997773},{"$f":"IF(ISERROR(INDIRECT(CONCATENATE($B305,\"!O122\"))),\"\",INDIRECT(CONCATENATE($B305,\"!O122\")))","v":49.528600960185365},{"$f":"IF(ISERROR(INDIRECT(CONCATENATE($B305,\"!O129\"))),\"\",INDIRECT(CONCATENATE($B305,\"!O129\")))","v":"N/A"},null,null,{"$f":"IF(ISERROR(INDIRECT(CONCATENATE($B305,\"!O127\"))),\"\",INDIRECT(CONCATENATE($B305,\"!O127\")))","v":3.3778618049757689},{"$f":"IF(ISERROR(INDIRECT(CONCATENATE($B305,\"!P122\"))),\"\",INDIRECT(CONCATENATE($B305,\"!P122\")))","v":55.268259715053475},{"$f":"IF(ISERROR(INDIRECT(CONCATENATE($B305,\"!P129\"))),\"\",INDIRECT(CONCATENATE($B305,\"!P129\")))","v":"N/A"},null,null,{"$f":"IF(ISERROR(INDIRECT(CONCATENATE($B305,\"!P127\"))),\"\",INDIRECT(CONCATENATE($B305,\"!P127\")))","v":2.8156272117179628},{"$f":"IF(ISERROR(INDIRECT(CONCATENATE($B305,\"!Q122\"))),\"\",INDIRECT(CONCATENATE($B305,\"!Q122\")))","v":71.278086381263392},{"$f":"IF(ISERROR(INDIRECT(CONCATENATE($B305,\"!Q129\"))),\"\",INDIRECT(CONCATENATE($B305,\"!Q129\")))","v":"N/A"},null,null,{"$f":"IF(ISERROR(INDIRECT(CONCATENATE($B305,\"!Q2127\"))),\"\",INDIRECT(CONCATENATE($B305,\"!Q127\")))","v":1.8274174298286934}]
[null,"DHS12",2012,38.040658161795974,48.644844348439669,null,null,8.1626117016761697,38.691033687191215,38.475971732607192,null,null,6.0594970515527553,39.687089698197937,63.554040259612854,null,null,4.6886696286711906,45.269808677204814,63.034839803315393,null,null,3.308459057050305,65.024571423698006,75.567777496769352,null,null,1.5684314194610309]
[null,null,null,"","",null,null,"","","",null,null,"","","",null,null,"","","",null,null,"","","",null,null,""]
[null,null,null,"","",null,null,"","","",null,null,"","","",null,null,"","","",null,null,"","","",null,null,""]
[null,null,null,"","",null,null,"","","",null,null,"","","",null,null,"","","",null,null,"","","",null,null,""]
[null,null,null,"","",null,null,"","","",null,null,"","","",null,null,"","","",null,null,"","","",null,null,""]
[null,null,null,"","",null,null,"","","",null,null,"","","",null,null,"","","",null,null,"","","",null,null,""]
[null,null,null,"","",null,null,"","","",null,null,"","","",null,null,"","","",null,null,"","","",null,null,""]
[null,null,null,"","",null,null,"","","",null,null,"","","",null,null,"","","",null,null,"","","",null,null,""]
[null,null,null,"","",null,null,"","","",null,null,"","","",null,null,"","","",null,null,"","","",null,null,""]
[null,null,null,"","",null,null,"","","",null,null,"","","",null,null,"","","",null,null,"","","",null,null,""]
[null,null,null,"","",null,null,"","","",null,null,"","","",null,null,"","","",null,null,"","","",null,null,""]
[]
[null,{"$f":"CONCATENATE(\"Rural use of sanitation facilities, \",C299,\"–\",C300)","v":"Rural use of sanitation facilities, 2000–2018"},null,null,null,null,null,null,null,null,null,null,null,null,null,null,null,null,"Data points used for regression"]

{"sheet":"Hygiene","index":3,"n_rows":88,"n_cols":25,"rows_kept":88,"cut":false,"hidden":false,"merged":[[39,22,40,22],[39,23,40,23],[39,24,40,24],[31,4,32,5],[39,16,40,16],[39,17,40,17],[39,18,40,18],[39,19,40,19],[39,20,40,20],[39,21,40,21],[36,24,37,24],[39,6,40,7],[39,8,40,8],[39,9,40,9],[39,10,40,10],[39,11,40,11],[39,12,40,12],[39,13,40,13],[39,14,40,14],[39,15,40,15],[36,18,37,18],[36,12,37,12],[36,13,37,13],[36,14,37,14],[36,15,37,15],[36,16,37,16],[36,17,37,17],[36,19,37,19],[36,20,37,20],[36,21,37,21],[36,22,37,22],[36,23,37,23],[33,20,34,20],[33,21,34,21],[33,22,34,22],[33,23,34,23],[33,24,34,24],[33,15,34,15],[33,16,34,16],[33,17,34,17],[33,18,34,18],[36,6,37,7],[36,8,37,8],[36,9,37,9],[36,10,37,10],[36,11,37,11],[33,10,34,10],[33,11,34,11],[33,12,34,12],[33,13,34,13],[33,14,34,14],[6,1,6,7],[3,1,3,24],[4,1,4,24],[33,1,34,3],[31,6,32,9],[31,10,31,12],[31,13,31,15],[6,10,6,15],[6,18,6,23],[33,19,34,19],[31,16,31,18],[31,19,31,21],[31,22,31,24],[33,6,34,7],[33,8,34,8],[33,9,34,9]]}
[]
[]
[]
[null,"Access to hygiene facilities by wealth quintile (%)"]
[null,{"$f":"IF(ISERROR(INDIRECT(CONCATENATE($E$32,\"!A2\"))),\"\",INDIRECT(CONCATENATE($E$32,\"!A2\")))","v":""}]
[]
[null,{"$f":"CONCATENATE(\"National \",IF(ISERROR(INDIRECT(CONCATENATE($E$32,\"!A2\"))),\"\",INDIRECT(CONCATENATE($E$32,\"!A210\"))))","v":"National "},null,null,null,null,null,null,null,null,{"$f":"CONCATENATE(\"Urban \",IF(ISERROR(INDIRECT(CONCATENATE($E$32,\"!A2\"))),\"\",INDIRECT(CONCATENATE($E$32,\"!A210\"))))","v":"Urban "},null,null,null,null,null,null,null,{"$f":"CONCATENATE(\"Rural \",IF(ISERROR(INDIRECT(CONCATENATE($E$32,\"!A2\"))),\"\",INDIRECT(CONCATENATE($E$32,\"!A210\"))))","v":"Rural "}]
[]
[]
[]
[]
[]
[]
[]
[]
[]
[]
[]
[]
[]
[]
[]
[]
[]
[]
[]
[]
[]
[]
[]
[]
[null,null,null,null,{"$f":"INDEX(B88:B100,A88)","v":0},null,{"$f":"IF(ISERROR(INDIRECT(CONCATENATE($E$32,\"!A2\"))),\"\",INDIRECT(CONCATENATE($E$32,\"!A2\")))","v":""},null,null,null,"Poorest",null,null,"Poor",null,null,"Middle",null,null,"Rich",null,null,"Richest"]
[null,null,null,null,null,null,null,null,null,null,"Basic","Limited","No facility","Basic","Limited","No facility","Basic","Limited","No facility","Basic","Limited","No facility","Basic","Limited","No facility"]
[null,">>>  Select Survey :   ",null,null,null,null,"NATIONAL",null,null,{"$f":"IF(ISERROR(INDIRECT(CONCATENATE(#REF!,\"!A2\"))),\"\",INDIRECT(CONCATENATE(#REF!,\"!A210\")))","v":""},{"$f":"IF(ISERROR(INDIRECT(CONCATENATE($E$32,\"!C222\"))),\"\",INDIRECT(CONCATENATE($E$32,\"!C222\")))","v":""},{"$f":"IF(ISERROR(INDIRECT(CONCATENATE($E$32,\"!C223\"))),\"\",INDIRECT(CONCATENATE($E$32,\"!C223\")))","v":""},{"$f":"IF(ISERROR(INDIRECT(CONCATENATE($E$32,\"!C224\"))),\"\",INDIRECT(CONCATENATE($E$32,\"!C224\")))","v":""},{"$f":"IF(ISERROR(INDIRECT(CONCATENATE($E$32,\"!D222\"))),\"\",INDIRECT(CONCATENATE($E$32,\"!D222\")))","v":""},{"$f":"IF(ISERROR(INDIRECT(CONCATENATE($E$32,\"!D223\"))),\"\",INDIRECT(CONCATENATE($E$32,\"!D223\")))","v":""},{"$f":"IF(ISERROR(INDIRECT(CONCATENATE($E$32,\"!D224\"))),\"\",INDIRECT(CONCATENATE($E$32,\"!D224\")))","v":""},{"$f":"IF(ISERROR(INDIRECT(CONCATENATE($E$32,\"!E222\"))),\"\",INDIRECT(CONCATENATE($E$32,\"!E222\")))","v":""},{"$f":"IF(ISERROR(INDIRECT(CONCATENATE($E$32,\"!E223\"))),\"\",INDIRECT(CONCATENATE($E$32,\"!E223\")))","v":""},{"$f":"IF(ISERROR(INDIRECT(CONCATENATE($E$32,\"!E224\"))),\"\",INDIRECT(CONCATENATE($E$32,\"!E224\")))","v":""},{"$f":"IF(ISERROR(INDIRECT(CONCATENATE($E$32,\"!F222\"))),\"\",INDIRECT(CONCATENATE($E$32,\"!F222\")))","v":""},{"$f":"IF(ISERROR(INDIRECT(CONCATENATE($E$32,\"!F223\"))),\"\",INDIRECT(CONCATENATE($E$32,\"!F223\")))","v":""},{"$f":"IF(ISERROR(INDIRECT(CONCATENATE($E$32,\"!F224\"))),\"\",INDIRECT(CONCATENATE($E$32,\"!F224\")))","v":""},{"$f":"IF(ISERROR(INDIRECT(CONCATENATE($E$32,\"!G222\"))),\"\",INDIRECT(CONCATENATE($E$32,\"!G222\")))","v":""},{"$f":"IF(ISERROR(INDIRECT(CONCATENATE($E$32,\"!G223\"))),\"\",INDIRECT(CONCATENATE($E$32,\"!G223\")))","v":""},{"$f":"IF(ISERROR(INDIRECT(CONCATENATE($E$32,\"!G224\"))),\"\",INDIRECT(CONCATENATE($E$32,\"!G224\")))","v":""}]
[]
[]
[null,null,null,null,null,null,"URBAN",null,null,{"$f":"IF(ISERROR(INDIRECT(CONCATENATE(#REF!,\"!A2\"))),\"\",INDIRECT(CONCATENATE(#REF!,\"!A210\")))","v":""},{"$f":"IF(ISERROR(INDIRECT(CONCATENATE($E$32,\"!H222\"))),\"\",INDIRECT(CONCATENATE($E$32,\"!H222\")))","v":""},{"$f":"IF(ISERROR(INDIRECT(CONCATENATE($E$32,\"!H223\"))),\"\",INDIRECT(CONCATENATE($E$32,\"!H223\")))","v":""},{"$f":"IF(ISERROR(INDIRECT(CONCATENATE($E$32,\"!H224\"))),\"\",INDIRECT(CONCATENATE($E$32,\"!H224\")))","v":""},{"$f":"IF(ISERROR(INDIRECT(CONCATENATE($E$32,\"!I222\"))),\"\",INDIRECT(CONCATENATE($E$32,\"!I222\")))","v":""},{"$f":"IF(ISERROR(INDIRECT(CONCATENATE($E$32,\"!I223\"))),\"\",INDIRECT(CONCATENATE($E$32,\"!I223\")))","v":""},{"$f":"IF(ISERROR(INDIRECT(CONCATENATE($E$32,\"!I224\"))),\"\",INDIRECT(CONCATENATE($E$32,\"!I224\")))","v":""},{"$f":"IF(ISERROR(INDIRECT(CONCATENATE($E$32,\"!J222\"))),\"\",INDIRECT(CONCATENATE($E$32,\"!J222\")))","v":""},{"$f":"IF(ISERROR(INDIRECT(CONCATENATE($E$32,\"!J223\"))),\"\",INDIRECT(CONCATENATE($E$32,\"!J223\")))","v":""},{"$f":"IF(ISERROR(INDIRECT(CONCATENATE($E$32,\"!J224\"))),\"\",INDIRECT(CONCATENATE($E$32,\"!J224\")))","v":""},{"$f":"IF(ISERROR(INDIRECT(CONCATENATE($E$32,\"!K222\"))),\"\",INDIRECT(CONCATENATE($E$32,\"!K222\")))","v":""},{"$f":"IF(ISERROR(INDIRECT(CONCATENATE($E$32,\"!K223\"))),\"\",INDIRECT(CONCATENATE($E$32,\"!K223\")))","v":""},{"$f":"IF(ISERROR(INDIRECT(CONCATENATE($E$32,\"!K224\"))),\"\",INDIRECT(CONCATENATE($E$32,\"!K224\")))","v":""},{"$f":"IF(ISERROR(INDIRECT(CONCATENATE($E$32,\"!L222\"))),\"\",INDIRECT(CONCATENATE($E$32,\"!L222\")))","v":""},{"$f":"IF(ISERROR(INDIRECT(CONCATENATE($E$32,\"!L223\"))),\"\",INDIRECT(CONCATENATE($E$32,\"!L223\")))","v":""},{"$f":"IF(ISERROR(INDIRECT(CONCATENATE($E$32,\"!L224\"))),\"\",INDIRECT(CONCATENATE($E$32,\"!L224\")))","v":""}]
[]
[]
[null,null,null,null,null,null,"RURAL",null,null,{"$f":"IF(ISERROR(INDIRECT(CONCATENATE(#REF!,\"!A2\"))),\"\",INDIRECT(CONCATENATE(#REF!,\"!A210\")))","v":""},{"$f":"IF(ISERROR(INDIRECT(CONCATENATE($E$32,\"!M222\"))),\"\",INDIRECT(CONCATENATE($E$32,\"!M222\")))","v":""},{"$f":"IF(ISERROR(INDIRECT(CONCATENATE($E$32,\"!M223\"))),\"\",INDIRECT(CONCATENATE($E$32,\"!M223\")))","v":""},{"$f":"IF(ISERROR(INDIRECT(CONCATENATE($E$32,\"!M224\"))),\"\",INDIRECT(CONCATENATE($E$32,\"!M224\")))","v":""},{"$f":"IF(ISERROR(INDIRECT(CONCATENATE($E$32,\"!N222\"))),\"\",INDIRECT(CONCATENATE($E$32,\"!N222\")))","v":""},{"$f":"IF(ISERROR(INDIRECT(CONCATENATE($E$32,\"!N223\"))),\"\",INDIRECT(CONCATENATE($E$32,\"!N223\")))","v":""},{"$f":"IF(ISERROR(INDIRECT(CONCATENATE($E$32,\"!N224\"))),\"\",INDIRECT(CONCATENATE($E$32,\"!N224\")))","v":""},{"$f":"IF(ISERROR(INDIRECT(CONCATENATE($E$32,\"!O222\"))),\"\",INDIRECT(CONCATENATE($E$32,\"!O222\")))","v":""},{"$f":"IF(ISERROR(INDIRECT(CONCATENATE($E$32,\"!O223\"))),\"\",INDIRECT(CONCATENATE($E$32,\"!O223\")))","v":""},{"$f":"IF(ISERROR(INDIRECT(CONCATENATE($E$32,\"!O224\"))),\"\",INDIRECT(CONCATENATE($E$32,\"!O224\")))","v":""},{"$f":"IF(ISERROR(INDIRECT(CONCATENATE($E$32,\"!P222\"))),\"\",INDIRECT(CONCATENATE($E$32,\"!P222\")))","v":""},{"$f":"IF(ISERROR(INDIRECT(CONCATENATE($E$32,\"!P223\"))),\"\",INDIRECT(CONCATENATE($E$32,\"!P223\")))","v":""},{"$f":"IF(ISERROR(INDIRECT(CONCATENATE($E$32,\"!P224\"))),\"\",INDIRECT(CONCATENATE($E$32,\"!P224\")))","v":""},{"$f":"IF(ISERROR(INDIRECT(CONCATENATE($E$32,\"!Q222\"))),\"\",INDIRECT(CONCATENATE($E$32,\"!Q222\")))","v":""},{"$f":"IF(ISERROR(INDIRECT(CONCATENATE($E$32,\"!Q223\"))),\"\",INDIRECT(CONCATENATE($E$32,\"!Q223\")))","v":""},{"$f":"IF(ISERROR(INDIRECT(CONCATENATE($E$32,\"!Q224\"))),\"\",INDIRECT(CONCATENATE($E$32,\"!Q224\")))","v":""}]
[]
[]
[]
[]
[]
[]
[]
[]
[]
[]
[]
[]
[]
[]
[]
[]
[]
[]
[]
[]
[]
[]
[]
[]
[]
[]
[]
[]
[]
[]
[]
[]
[]
[]
[]
[]
[]
[]
[]
[]
[]
[]
[]
[]
[]
[]
[]
[2,"Template"]

{"sheet":"DHS00","index":4,"n_rows":1072,"n_cols":74,"rows_kept":1072,"cut":false,"hidden":false,"merged":[[346,52,347,52],[348,52,349,52],[350,52,351,52],[352,52,353,52],[152,52,157,52],[270,52,272,52],[273,52,275,52],[276,52,283,52],[338,54,338,58],[338,59,338,63],[338,64,338,68],[340,52,341,52],[342,52,343,52],[344,52,345,52],[221,52,223,52],[224,52,225,52],[226,52,229,52],[258,54,258,58],[258,59,258,63],[258,64,258,68],[260,52,262,52],[263,52,266,52],[267,52,269,52],[119,64,119,68],[121,52,122,52],[123,52,126,52],[127,52,128,52],[132,54,132,58],[132,59,132,63],[132,64,132,68],[134,52,138,52],[219,54,219,58],[219,59,219,63],[219,64,219,68],[139,52,142,52],[13,64,13,68],[15,52,16,52],[17,52,20,52],[21,52,22,52],[26,54,26,58],[26,59,26,63],[26,64,26,68],[40,52,41,52],[55,54,55,58],[55,59,55,63],[55,64,55,68],[143,0,146,0],[143,52,146,52],[147,0,149,0],[147,52,149,52],[150,0,151,0],[150,52,151,52],[13,54,13,58],[13,59,13,63],[119,54,119,58],[119,59,119,63],[42,52,43,52],[44,52,45,52],[46,0,48,0],[46,52,48,52],[49,0,51,0],[49,52,51,52],[52,0,54,0],[52,52,54,52],[32,52,33,52],[34,52,35,52],[36,52,37,52],[38,0,39,0],[38,52,39,52],[13,2,13,6],[13,7,13,11],[28,52,29,52],[30,0,31,0],[30,52,31,52],[26,2,26,6],[26,7,26,11],[26,12,26,16],[13,12,13,16],[15,0,16,0],[17,0,20,0],[21,0,22,0],[23,0,25,0],[32,0,33,0],[55,2,55,6],[55,7,55,11],[55,12,55,16],[28,0,29,0],[34,0,35,0],[36,0,37,0],[40,0,41,0],[42,0,43,0],[44,0,45,0],[139,0,142,0],[119,7,119,11],[119,12,119,16],[57,0,68,0],[107,0,107,1],[121,0,122,0],[123,0,126,0],[127,0,128,0],[129,0,131,0],[132,2,132,6],[119,2,119,6],[132,7,132,11],[132,12,132,16],[134,0,138,0],[152,0,156,0],[201,0,203,0],[207,0,207,1],[219,2,219,6],[219,7,219,11],[1024,0,1024,2],[1025,0,1025,1],[1030,0,1032,0],[1033,0,1033,2],[398,2,398,5],[405,2,405,3],[405,7,405,8],[408,7,408,8],[417,2,417,3],[417,7,417,8],[421,2,421,3],[421,7,421,8],[425,2,425,3],[425,7,425,8],[429,2,429,3],[429,7,429,8],[433,2,433,3],[433,7,433,8],[437,2,437,3],[219,12,219,16],[221,0,223,0],[398,7,398,10],[398,12,398,15],[399,2,399,4],[399,7,399,9],[399,12,399,14],[400,2,401,3],[400,7,401,8],[400,12,401,13],[405,12,405,13],[406,2,406,3],[406,7,406,8],[406,12,406,13],[401,1,444,1],[402,2,402,3],[402,7,402,8],[402,12,402,13],[403,2,403,3],[403,7,403,8],[403,12,403,13],[404,2,404,3],[404,7,404,8],[404,12,404,13],[409,2,409,3],[409,7,409,8],[409,12,409,13],[410,2,410,3],[410,7,410,8],[410,12,410,13],[407,2,407,3],[407,7,407,8],[407,12,407,13],[408,2,408,3],[408,12,408,13],[413,2,413,3],[413,7,413,8],[413,12,413,13],[414,2,414,3],[414,7,414,8],[414,12,414,13],[411,2,411,3],[411,7,411,8],[411,12,411,13],[412,2,412,3],[412,7,412,8],[412,12,412,13],[417,12,417,13],[418,2,418,3],[418,7,418,8],[418,12,418,13],[415,2,415,3],[415,7,415,8],[415,12,415,13],[416,2,416,3],[416,7,416,8],[416,12,416,13],[421,12,421,13],[422,2,422,3],[422,7,422,8],[422,12,422,13],[419,2,419,3],[419,7,419,8],[419,12,419,13],[420,2,420,3],[420,7,420,8],[420,12,420,13],[425,12,425,13],[426,2,426,3],[426,7,426,8],[426,12,426,13],[423,2,423,3],[423,7,423,8],[423,12,423,13],[424,2,424,3],[424,7,424,8],[424,12,424,13],[429,12,429,13],[430,2,430,3],[430,7,430,8],[430,12,430,13],[427,2,427,3],[427,7,427,8],[427,12,427,13],[428,2,428,3],[428,7,428,8],[428,12,428,13],[433,12,433,13],[434,2,434,3],[434,7,434,8],[434,12,434,13],[431,2,431,3],[431,7,431,8],[431,12,431,13],[432,2,432,3],[432,7,432,8],[432,12,432,13],[437,7,437,8],[437,12,437,13],[438,2,438,3],[438,7,438,8],[438,12,438,13],[435,2,435,3],[435,7,435,8],[435,12,435,13],[436,2,436,3],[436,7,436,8],[436,12,436,13],[441,2,441,3],[441,7,441,8],[441,12,441,13],[442,2,442,3],[442,7,442,8],[442,12,442,13],[439,2,439,3],[439,7,439,8],[439,12,439,13],[440,2,440,3],[440,7,440,8],[440,12,440,13],[445,2,445,3],[445,7,445,8],[445,12,445,13],[446,2,446,3],[446,7,446,8],[446,12,446,13],[443,2,443,3],[443,7,443,8],[443,12,443,13],[444,2,444,4],[444,7,444,9],[444,12,444,14],[449,2,449,3],[449,7,449,8],[449,12,449,13],[450,2,450,3],[450,7,450,8],[450,12,450,13],[447,2,447,3],[447,7,447,8],[447,12,447,13],[448,2,448,3],[448,7,448,8],[448,12,448,13],[453,2,453,3],[453,7,453,8],[453,12,453,13],[454,2,454,3],[454,7,454,8],[454,12,454,13],[451,2,451,3],[451,7,451,8],[451,12,451,13],[452,2,452,3],[452,7,452,8],[452,12,452,13],[457,2,457,3],[457,7,457,8],[457,12,457,13],[458,2,458,3],[458,7,458,8],[458,12,458,13],[455,2,455,3],[455,7,455,8],[455,12,455,13],[456,2,456,3],[456,7,456,8],[456,12,456,13],[461,2,461,3],[461,7,461,8],[461,12,461,13],[462,2,462,3],[462,7,462,8],[462,12,462,13],[459,2,459,3],[459,7,459,8],[459,12,459,13],[460,2,460,3],[460,7,460,8],[460,12,460,13],[465,2,465,3],[465,7,465,8],[465,12,465,13],[466,2,466,3],[466,7,466,8],[466,12,466,13],[463,2,463,3],[463,7,463,8],[463,12,463,13],[464,2,464,3],[464,7,464,8],[464,12,464,13],[469,2,469,3],[469,7,469,8],[469,12,469,13],[470,2,470,3],[470,7,470,8],[470,12,470,13],[467,2,467,3],[467,7,467,8],[467,12,467,13],[468,2,468,3],[468,7,468,8],[468,12,468,13],[473,2,473,3],[473,7,473,8],[473,12,473,13],[474,2,474,3],[474,7,474,8],[474,12,474,13],[471,2,471,3],[471,7,471,8],[471,12,471,13],[472,2,472,3],[472,7,472,8],[472,12,472,13],[477,2,477,3],[477,7,477,8],[477,12,477,13],[478,2,478,3],[478,7,478,8],[478,12,478,13],[475,2,475,3],[475,7,475,8],[475,12,475,13],[476,2,476,3],[476,7,476,8],[476,12,476,13],[481,2,481,3],[481,7,481,8],[481,12,481,13],[482,2,482,3],[482,7,482,8],[482,12,482,13],[479,2,479,3],[479,7,479,8],[479,12,479,13],[480,2,480,3],[480,7,480,8],[480,12,480,13],[485,2,485,3],[485,7,485,8],[485,12,485,13],[486,2,486,3],[486,7,486,8],[486,12,486,13],[483,2,483,3],[483,7,483,8],[483,12,483,13],[484,2,484,3],[484,7,484,8],[484,12,484,13],[487,2,487,6],[487,7,487,11],[487,12,487,16],[488,2,489,3],[488,4,488,6],[488,7,489,8],[488,9,488,11],[488,12,489,13],[488,14,488,16],[492,2,492,3],[492,7,492,8],[492,12,492,13],[493,2,493,4],[493,7,493,9],[493,12,493,14],[490,2,490,3],[490,7,490,8],[490,12,490,13],[491,2,491,3],[491,7,491,8],[491,12,491,13],[497,2,497,3],[497,7,497,8],[497,12,497,13],[498,2,498,3],[498,7,498,8],[498,12,498,13],[494,2,495,3],[494,7,495,8],[494,12,495,13],[496,2,496,3],[496,7,496,8],[496,12,496,13],[501,2,501,3],[501,7,501,8],[501,12,501,13],[502,2,502,3],[502,7,502,8],[502,12,502,13],[499,2,499,3],[499,7,499,8],[499,12,499,13],[500,2,500,3],[500,7,500,8],[500,12,500,13],[505,2,505,3],[505,7,505,8],[505,12,505,13],[506,2,506,3],[506,7,506,8],[506,12,506,13],[503,2,503,3],[503,7,503,8],[503,12,503,13],[504,2,504,3],[504,7,504,8],[504,12,504,13],[509,2,509,3],[509,7,509,8],[509,12,509,13],[510,2,510,3],[510,7,510,8],[510,12,510,13],[507,2,507,3],[507,7,507,8],[507,12,507,13],[508,2,508,3],[508,7,508,8],[508,12,508,13],[513,2,513,3],[513,7,513,8],[513,12,513,13],[514,2,514,3],[514,7,514,8],[514,12,514,13],[511,2,511,3],[511,7,511,8],[511,12,511,13],[512,2,512,3],[512,7,512,8],[512,12,512,13],[517,2,517,3],[517,7,517,8],[517,12,517,13],[518,2,518,3],[518,7,518,8],[518,12,518,13],[515,2,515,3],[515,7,515,8],[515,12,515,13],[516,2,516,3],[516,7,516,8],[516,12,516,13],[521,2,521,3],[521,7,521,8],[521,12,521,13],[522,2,522,3],[522,7,522,8],[522,12,522,13],[519,2,519,3],[519,7,519,8],[519,12,519,13],[520,2,520,3],[520,7,520,8],[520,12,520,13],[525,2,525,3],[525,7,525,8],[525,12,525,13],[526,2,526,3],[526,7,526,8],[526,12,526,13],[523,2,523,3],[523,7,523,8],[523,12,523,13],[524,2,524,3],[524,7,524,8],[524,12,524,13],[529,2,529,3],[529,7,529,8],[529,12,529,13],[530,2,530,3],[530,7,530,8],[530,12,530,13],[527,2,527,3],[527,7,527,8],[527,12,527,13],[528,2,528,3],[528,7,528,8],[528,12,528,13],[533,2,533,3],[533,7,533,8],[533,12,533,13],[534,2,534,3],[534,7,534,8],[534,12,534,13],[531,2,531,3],[531,7,531,8],[531,12,531,13],[532,2,532,3],[532,7,532,8],[532,12,532,13],[537,2,537,4],[537,7,537,9],[537,12,537,14],[538,2,538,3],[538,7,538,8],[538,12,538,13],[535,2,535,3],[535,7,535,8],[535,12,535,13],[536,2,536,3],[536,7,536,8],[536,12,536,13],[541,2,541,3],[541,7,541,8],[541,12,541,13],[542,2,542,3],[542,7,542,8],[542,12,542,13],[539,2,539,3],[539,7,539,8],[539,12,539,13],[540,2,540,3],[540,7,540,8],[540,12,540,13],[545,2,545,3],[545,7,545,8],[545,12,545,13],[546,2,546,3],[546,7,546,8],[546,12,546,13],[543,2,543,3],[543,7,543,8],[543,12,543,13],[544,2,544,3],[544,7,544,8],[544,12,544,13],[549,2,549,3],[549,7,549,8],[549,12,549,13],[550,2,550,3],[550,7,550,8],[550,12,550,13],[547,2,547,3],[547,7,547,8],[547,12,547,13],[548,2,548,3],[548,7,548,8],[548,12,548,13],[553,2,553,3],[553,7,553,8],[553,12,553,13],[554,2,554,3],[554,7,554,8],[554,12,554,13],[551,2,551,3],[551,7,551,8],[551,12,551,13],[552,2,552,3],[552,7,552,8],[552,12,552,13],[557,2,557,3],[557,7,557,8],[557,12,557,13],[558,2,558,3],[558,7,558,8],[558,12,558,13],[555,2,555,3],[555,7,555,8],[555,12,555,13],[556,2,556,3],[556,7,556,8],[556,12,556,13],[561,2,561,3],[561,7,561,8],[561,12,561,13],[562,2,562,3],[562,7,562,8],[562,12,562,13],[559,2,559,3],[559,7,559,8],[559,12,559,13],[560,2,560,3],[560,7,560,8],[560,12,560,13],[565,2,565,3],[565,7,565,8],[565,12,565,13],[566,2,566,3],[566,7,566,8],[566,12,566,13],[563,2,563,3],[563,7,563,8],[563,12,563,13],[564,2,564,3],[564,7,564,8],[564,12,564,13],[569,2,569,3],[569,7,569,8],[569,12,569,13],[570,2,570,3],[570,7,570,8],[570,12,570,13],[567,2,567,3],[567,7,567,8],[567,12,567,13],[568,2,568,3],[568,7,568,8],[568,12,568,13],[573,2,573,3],[573,7,573,8],[573,12,573,13],[574,2,574,3],[574,7,574,8],[574,12,574,13],[571,2,571,3],[571,7,571,8],[571,12,571,13],[572,2,572,3],[572,7,572,8],[572,12,572,13],[577,2,577,3],[577,7,577,8],[577,12,577,13],[578,2,578,3],[578,7,578,8],[578,12,578,13],[575,2,575,3],[575,7,575,8],[575,12,575,13],[576,2,576,3],[576,7,576,8],[576,12,576,13],[581,2,581,3],[581,7,581,8],[581,12,581,13],[582,2,582,3],[582,7,582,8],[582,12,582,13],[579,2,579,3],[579,7,579,8],[579,12,579,13],[580,2,580,3],[580,7,580,8],[580,12,580,13],[585,2,585,3],[585,7,585,8],[585,12,585,13],[586,2,586,3],[586,7,586,8],[586,12,586,13],[583,2,583,3],[583,7,583,8],[583,12,583,13],[584,2,584,3],[584,7,584,8],[584,12,584,13],[589,2,589,3],[589,7,589,8],[589,12,589,13],[590,2,590,3],[590,7,590,8],[590,12,590,13],[587,2,587,3],[587,7,587,8],[587,12,587,13],[588,2,588,3],[588,7,588,8],[588,12,588,13],[593,2,593,3],[593,7,593,8],[593,12,593,13],[594,2,594,3],[594,7,594,8],[594,12,594,13],[591,2,591,3],[591,7,591,8],[591,12,591,13],[592,2,592,3],[592,7,592,8],[592,12,592,13],[597,2,597,3],[597,7,597,8],[597,12,597,13],[598,2,598,3],[598,7,598,8],[598,12,598,13],[595,2,595,3],[595,7,595,8],[595,12,595,13],[596,2,596,3],[596,7,596,8],[596,12,596,13],[601,2,601,3],[601,7,601,8],[601,12,601,13],[602,2,602,3],[602,7,602,8],[602,12,602,13],[599,2,599,3],[599,7,599,8],[599,12,599,13],[600,2,600,3],[600,7,600,8],[600,12,600,13],[605,2,605,3],[605,7,605,8],[605,12,605,13],[606,2,606,3],[606,7,606,8],[606,12,606,13],[603,2,603,3],[603,7,603,8],[603,12,603,13],[604,2,604,3],[604,7,604,8],[604,12,604,13],[609,2,609,3],[609,7,609,8],[609,12,609,13],[610,2,610,3],[610,7,610,8],[610,12,610,13],[607,2,607,3],[607,7,607,8],[607,12,607,13],[608,2,608,3],[608,7,608,8],[608,12,608,13],[613,2,613,3],[613,7,613,8],[613,12,613,13],[614,2,614,3],[614,7,614,8],[614,12,614,13],[611,2,611,3],[611,7,611,8],[611,12,611,13],[612,2,612,3],[612,7,612,8],[612,12,612,13],[617,2,617,3],[617,7,617,8],[617,12,617,13],[618,2,618,3],[618,7,618,8],[618,12,618,13],[615,2,615,3],[615,7,615,8],[615,12,615,13],[616,2,616,3],[616,7,616,8],[616,12,616,13],[621,2,621,3],[621,7,621,8],[621,12,621,13],[622,2,622,3],[622,7,622,8],[622,12,622,13],[619,2,619,3],[619,7,619,8],[619,12,619,13],[620,2,620,3],[620,7,620,8],[620,12,620,13],[625,2,625,3],[625,7,625,8],[625,12,625,13],[626,2,626,3],[626,7,626,8],[626,12,626,13],[623,2,623,3],[623,7,623,8],[623,12,623,13],[624,2,624,3],[624,7,624,8],[624,12,624,13],[629,2,629,3],[629,7,629,8],[629,12,629,13],[630,2,630,3],[630,7,630,8],[630,12,630,13],[627,2,627,3],[627,7,627,8],[627,12,627,13],[628,2,628,3],[628,7,628,8],[628,12,628,13],[633,2,633,3],[633,7,633,8],[633,12,633,13],[634,2,634,3],[634,7,634,8],[634,12,634,13],[631,2,631,3],[631,7,631,8],[631,12,631,13],[632,2,632,3],[632,7,632,8],[632,12,632,13],[637,2,637,3],[637,7,637,8],[637,12,637,13],[638,2,638,3],[638,7,638,8],[638,12,638,13],[635,2,635,3],[635,7,635,8],[635,12,635,13],[636,2,636,3],[636,7,636,8],[636,12,636,13],[641,2,641,3],[641,7,641,8],[641,12,641,13],[642,2,642,3],[642,7,642,8],[642,12,642,13],[639,2,639,3],[639,7,639,8],[639,12,639,13],[640,2,640,3],[640,7,640,8],[640,12,640,13],[645,2,645,3],[645,7,645,8],[645,12,645,13],[646,2,646,3],[646,7,646,8],[646,12,646,13],[643,2,643,3],[643,7,643,8],[643,12,643,13],[644,2,644,3],[644,7,644,8],[644,12,644,13],[649,2,649,3],[649,7,649,8],[649,12,649,13],[650,2,650,3],[650,7,650,8],[650,12,650,13],[647,2,647,3],[647,7,647,8],[647,12,647,13],[648,2,648,3],[648,7,648,8],[648,12,648,13],[653,2,653,3],[653,7,653,8],[653,12,653,13],[654,2,654,3],[654,7,654,8],[654,12,654,13],[651,2,651,3],[651,7,651,8],[651,12,651,13],[652,2,652,3],[652,7,652,8],[652,12,652,13],[657,2,657,3],[657,7,657,8],[657,12,657,13],[658,2,658,3],[658,7,658,8],[658,12,658,13],[655,2,655,3],[655,7,655,8],[655,12,655,13],[656,2,656,3],[656,7,656,8],[656,12,656,13],[661,2,661,3],[661,7,661,8],[661,12,661,13],[662,2,662,3],[662,7,662,8],[662,12,662,13],[659,2,659,3],[659,7,659,8],[659,12,659,13],[660,2,660,3],[660,7,660,8],[660,12,660,13],[665,2,665,3],[665,7,665,8],[665,12,665,13],[666,2,666,3],[666,7,666,8],[666,12,666,13],[663,2,663,3],[663,7,663,8],[663,12,663,13],[664,2,664,3],[664,7,664,8],[664,12,664,13],[669,2,669,3],[669,7,669,8],[669,12,669,13],[670,2,670,3],[670,7,670,8],[670,12,670,13],[667,2,667,3],[667,7,667,8],[667,12,667,13],[668,2,668,3],[668,7,668,8],[668,12,668,13],[673,2,673,3],[673,7,673,8],[673,12,673,13],[674,2,674,3],[674,7,674,8],[674,12,674,13],[671,2,671,3],[671,7,671,8],[671,12,671,13],[672,2,672,3],[672,7,672,8],[672,12,672,13],[677,2,677,3],[677,7,677,8],[677,12,677,13],[678,2,678,3],[678,7,678,8],[678,12,678,13],[675,2,675,3],[675,7,675,8],[675,12,675,13],[676,2,676,3],[676,7,676,8],[676,12,676,13],[681,2,681,3],[681,7,681,8],[681,12,681,13],[682,2,682,3],[682,7,682,8],[682,12,682,13],[679,2,679,3],[679,7,679,8],[679,12,679,13],[680,2,680,3],[680,7,680,8],[680,12,680,13],[685,2,685,3],[685,7,685,8],[685,12,685,13],[686,2,686,3],[686,7,686,8],[686,12,686,13],[683,2,683,3],[683,7,683,8],[683,12,683,13],[684,2,684,3],[684,7,684,8],[684,12,684,13],[689,2,689,3],[689,7,689,8],[689,12,689,13],[687,2,687,3],[687,7,687,8],[687,12,687,13],[688,2,688,3],[688,7,688,8],[688,12,688,13]]}
[]
[{"$f":"A1026","v":"Gabon"}]
[{"$f":"A1034","v":"2000"}]
["Use of drinking water sources"]
[" by wealth quintile and sub-national region"]
["Notes:"]
["WHO/UNICEF JMP customised wealth index excludes water,"]
[" sanitation and hygiene assets."]
["Survey used for analysis:",{"$f":"A1025","v":"DHS00"}]
["50% of Springs considered improved"]
["Time to source based on:","DHS12"]
[]
[]
["Use of drinking water sources",null,"NATIONAL wealth index quintile",null,null,null,null,"URBAN wealth index quintile",null,null,null,null,"RURAL wealth index quintile",null,null,null,null,"SUB-REGIONS:",null,null,null,null,null,null,null,null,null,null,null,null,null,null,null,null,null,null,null,null,null,null,null,null,null,null,null,null,null,null,null,null,null,null,"Raw numbers of respondents:","Use of drinking water sources","NATIONAL wealth index quintile",null,null,null,null,"URBAN wealth index quintile",null,null,null,null,"RURAL wealth index quintile",null,null,null,null,"SUB-REGIONS:"]
["Weighted percentage (used in graphs)",null,"Poorest","Poor","Middle","Rich","Richest","Poorest","Poor","Middle","Rich","Richest","Poorest","Poor","Middle","Rich","Richest","Big cities","East (Haut-Ogoou‚ & Ogoou‚-Lolo)","North (Ogoou‚-Ivindo & Woleu-Ntem)","South (Ngouni‚, Nyanga)","West (Estuaire, Moyen-Ogoou‚ & Ogoou‚-maritime)",null,null,null,null,null,null,null,null,null,null,null,null,null,null,null,null,null,null,null,null,null,null,null,null,null,null,null,null,null,null,"Water data, raw numbers (weighted)",null,"Poorest","Poor","Middle","Rich","Richest","Poorest","Poor","Middle","Rich","Richest","Poorest","Poor","Middle","Rich","Richest","Big cities","East (Haut-Ogoou‚ & Ogoou‚-Lolo)","North (Ogoou‚-Ivindo & Woleu-Ntem)","South (Ngouni‚, Nyanga)","West (Estuaire, Moyen-Ogoou‚ & Ogoou‚-maritime)"]
["Water","Improved",{"$f":"C58+C59+C60+C61+C67+C68+C64*0.5","v":46.326885445559093},75.134481378619029,94.325041473501088,97.30821426430964,99.262577850021529,80.584344089621524,96.255909653626532,97.845806157244425,99.359608972943704,99.44217839643467,41.76310453719239,40.338961280936623,42.726804993238304,49.465003798049679,67.122036592636093,99.84348798211218,72.240510575647065,55.055371191168526,65.044725201678446,67.014250990421075,null,null,null,null,null,null,null,null,null,null,null,null,null,null,null,null,null,null,null,null,null,null,null,null,null,null,null,null,null,null,"Water","Improved","N/A","N/A","N/A","N/A","N/A","N/A","N/A","N/A","N/A","N/A","N/A","N/A","N/A","N/A","N/A","N/A","N/A","N/A","N/A","N/A"]
[null,"Not Improved",{"$f":"100-C16","v":53.673114554440907},{"$f":"100-D16","v":24.865518621380971},5.6749585264989122,2.6917857356903596,0.737422149978471,19.415655910378476,3.7440903463734685,2.1541938427555749,0.64039102705629602,0.55782160356532984,58.23689546280761,59.661038719063377,57.273195006761696,50.534996201950321,32.877963407363907,0.15651201788782032,27.759489424352935,44.944628808831474,34.955274798321554,32.985749009578925,null,null,null,null,null,null,null,null,null,null,null,null,null,null,null,null,null,null,null,null,null,null,null,null,null,null,null,null,null,null,null,"Not Improved","N/A","N/A","N/A","N/A","N/A","N/A","N/A","N/A","N/A","N/A","N/A","N/A","N/A","N/A","N/A","N/A","N/A","N/A","N/A","N/A"]
["Water ladder","Basic",{"$f":"C16*'DHS12'!C23/100","v":34.235568344268174},{"$f":"D16*'DHS12'!D23/100","v":65.366998799398559},{"$f":"E16*'DHS12'!E23/100","v":89.231489233932024},{"$f":"F16*'DHS12'!F23/100","v":93.415885693737252},{"$f":"G16*'DHS12'!G23/100","v":96.979538559471038},{"$f":"H16*'DHS12'!H23/100","v":61.888776260829324},{"$f":"I16*'DHS12'!I23/100","v":88.940460519950918},{"$f":"J16*'DHS12'!J23/100","v":94.323357135583635},{"$f":"K16*'DHS12'!K23/100","v":96.180101485809502},{"$f":"L16*'DHS12'!L23/100","v":96.956123936523795},{"$f":"M16*'DHS12'!M23/100","v":31.322328402894289},{"$f":"N16*'DHS12'!N23/100","v":32.190491102187423},{"$f":"O16*'DHS12'!O23/100","v":30.677845985145101},{"$f":"P16*'DHS12'!P23/100","v":40.116118080218286},{"$f":"Q16*'DHS12'!Q23/100","v":57.523585359889132},"N/A","N/A","N/A","N/A","N/A",null,null,null,null,null,null,null,null,null,null,null,null,null,null,null,null,null,null,null,null,null,null,null,null,null,null,null,null,null,null,"Water ladder","Basic","N/A","N/A","N/A","N/A","N/A","N/A","N/A","N/A","N/A","N/A","N/A","N/A","N/A","N/A","N/A","N/A","N/A","N/A","N/A","N/A"]
[null,"Limited",{"$f":"C16*'DHS12'!C22/100","v":12.091317101290924},{"$f":"D16*'DHS12'!D22/100","v":9.7674825792204736},{"$f":"E16*'DHS12'!E22/100","v":5.0935522395690587},{"$f":"F16*'DHS12'!F22/100","v":3.8923285705723858},{"$f":"G16*'DHS12'!G22/100","v":2.2830392905504953},{"$f":"H16*'DHS12'!H22/100","v":18.695567828792193},{"$f":"I16*'DHS12'!I22/100","v":7.3154491336756156},{"$f":"J16*'DHS12'!J22/100","v":3.5224490216607993},{"$f":"K16*'DHS12'!K22/100","v":3.1795074871341988},{"$f":"L16*'DHS12'!L22/100","v":2.4860544599108665},{"$f":"M16*'DHS12'!M22/100","v":10.440776134298098},{"$f":"N16*'DHS12'!N22/100","v":8.1484701787491982},{"$f":"O16*'DHS12'!O22/100","v":12.048959008093203},{"$f":"P16*'DHS12'!P22/100","v":9.3488857178313882},{"$f":"Q16*'DHS12'!Q22/100","v":9.598451232746962},"N/A","N/A","N/A","N/A","N/A",null,null,null,null,null,null,null,null,null,null,null,null,null,null,null,null,null,null,null,null,null,null,null,null,null,null,null,null,null,null,null,"Limited","N/A","N/A","N/A","N/A","N/A","N/A","N/A","N/A","N/A","N/A","N/A","N/A","N/A","N/A","N/A","N/A","N/A","N/A","N/A","N/A"]
[null,"Unimproved",{"$f":"100-(C18+C19+C21)","v":17.287289997939496},{"$f":"100-(D18+D19+D21)","v":11.147313802644447},3.5737177372983666,1.5632573322854029,0.64873714697101548,10.81594519103821,2.8041723936432419,1.6524180093267802,0.48843107580684375,0.47591857178393582,16.837883893173142,18.673130695349727,16.015651914489965,20.195373289585504,12.86256301612508,"N/A","N/A","N/A","N/A","N/A",null,null,null,null,null,null,null,null,null,null,null,null,null,null,null,null,null,null,null,null,null,null,null,null,null,null,null,null,null,null,null,"Unimproved","N/A","N/A","N/A","N/A","N/A","N/A","N/A","N/A","N/A","N/A","N/A","N/A","N/A","N/A","N/A","N/A","N/A","N/A","N/A","N/A"]
[null,"Surface water",{"$f":"C65+C66","v":36.385824556501412},13.718204818736531,2.1012407892005407,1.1285284034049592,8.8685003007453647E-2,8.5997107193402815,0.93991795273022616,0.50177583342878618,0.15195995124945808,8.1903031781404761E-2,41.399011569634467,40.987908023713644,41.257543092271732,30.339622912364828,20.015400391238821,"N/A","N/A","N/A","N/A","N/A",null,null,null,null,null,null,null,null,null,null,null,null,null,null,null,null,null,null,null,null,null,null,null,null,null,null,null,null,null,null,null,"Surface water","N/A","N/A","N/A","N/A","N/A","N/A","N/A","N/A","N/A","N/A","N/A","N/A","N/A","N/A","N/A","N/A","N/A","N/A","N/A","N/A"]
["Improved water point at more than 30 minutes","Yes","N/A","N/A","N/A","N/A","N/A","N/A","N/A","N/A","N/A","N/A","N/A","N/A","N/A","N/A","N/A","N/A","N/A","N/A","N/A","N/A",null,null,null,null,null,null,null,null,null,null,null,null,null,null,null,null,null,null,null,null,null,null,null,null,null,null,null,null,null,null,"Improved water point at more than 30 minutes","Yes","N/A","N/A","N/A","N/A","N/A","N/A","N/A","N/A","N/A","N/A","N/A","N/A","N/A","N/A","N/A","N/A","N/A","N/A","N/A","N/A"]
[null,"No","N/A","N/A","N/A","N/A","N/A","N/A","N/A","N/A","N/A","N/A","N/A","N/A","N/A","N/A","N/A","N/A","N/A","N/A","N/A","N/A",null,null,null,null,null,null,null,null,null,null,null,null,null,null,null,null,null,null,null,null,null,null,null,null,null,null,null,null,null,null,null,"No","N/A","N/A","N/A","N/A","N/A","N/A","N/A","N/A","N/A","N/A","N/A","N/A","N/A","N/A","N/A","N/A","N/A","N/A","N/A","N/A"]
["Manually calculated ratios","Improved wells"]
[null,"Improved springs"]
[null,"Other"]
[null,null,"NATIONAL wealth index quintile",null,null,null,null,"URBAN wealth index quintile",null,null,null,null,"RURAL wealth index quintile",null,null,null,null,"SUB-REGIONS:",null,null,null,null,null,null,null,null,null,null,null,null,null,null,null,null,null,null,null,null,null,null,null,null,null,null,null,null,null,null,null,null,null,null,"Raw numbers of respondents:","Use of drinking water sources","NATIONAL wealth index quintile",null,null,null,null,"URBAN wealth index quintile",null,null,null,null,"RURAL wealth index quintile",null,null,null,null,"SUB-REGIONS:"]
["Percentage based on weighted population",null,"Poorest","Poor","Middle","Rich","Richest","Poorest","Poor","Middle","Rich","Richest","Poorest","Poor","Middle","Rich","Richest","Big cities","East (Haut-Ogoou‚ & Ogoou‚-Lolo)","North (Ogoou‚-Ivindo & Woleu-Ntem)","South (Ngouni‚, Nyanga)","West (Estuaire, Moyen-Ogoou‚ & Ogoou‚-maritime)",null,null,null,null,null,null,null,null,null,null,null,null,null,null,null,null,null,null,null,null,null,null,null,null,null,null,null,null,null,null,"Water data, raw numbers (weighted)",null,"Poorest","Poor","Middle","Rich","Richest","Poorest","Poor","Middle","Rich","Richest","Poorest","Poor","Middle","Rich","Richest","Big cities","East (Haut-Ogoou‚ & Ogoou‚-Lolo)","North (Ogoou‚-Ivindo & Woleu-Ntem)","South (Ngouni‚, Nyanga)","West (Estuaire, Moyen-Ogoou‚ & Ogoou‚-maritime)"]
["Piped water","Yes",19.063673904448329,61.806642325211349,90.607977533180076,95.799373655539384,98.675062582372718,72.499755072106183,94.926721429907019,96.49005218215774,99.027495010551007,98.855493298049964,11.91089333980929,8.9725700468388467,11.209317520520147,20.239252599619189,45.409524013190364,99.519714062325463,64.708148453498708,23.072174144135538,42.480407982918528,54.435350968226061,null,null,null,null,null,null,null,null,null,null,null,null,null,null,null,null,null,null,null,null,null,null,null,null,null,null,null,null,null,null,"Piped water","Yes","N/A","N/A","N/A","N/A","N/A","N/A","N/A","N/A","N/A","N/A","N/A","N/A","N/A","N/A","N/A","N/A","N/A","N/A","N/A","N/A"]
[null,"No",80.936326095551507,38.193357674788402,9.3920224668198831,4.2006263444605976,1.3249374176272737,27.500244927893196,5.0732785700928344,3.5099478178422525,0.97250498944898911,1.1445067019500048,88.089106660190751,91.027429953161146,88.790682479479827,79.760747400380765,54.590475986809771,0.48028593767452021,35.291851546500872,76.927825855864597,57.519592017082196,45.564649031774415,null,null,null,null,null,null,null,null,null,null,null,null,null,null,null,null,null,null,null,null,null,null,null,null,null,null,null,null,null,null,null,"No","N/A","N/A","N/A","N/A","N/A","N/A","N/A","N/A","N/A","N/A","N/A","N/A","N/A","N/A","N/A","N/A","N/A","N/A","N/A","N/A"]
["Piped water on premises","Yes",3.1951147883986306,17.575160081426773,41.28292204091575,59.919569543615815,92.99220981199835,17.186154675844222,38.009513093469025,52.790177091419629,73.654046741676893,94.338019031183265,2.743821226680653,1.4646793265715861,2.4502385075395505,6.9516752499145111,30.05701411661769,62.303138612755127,40.573909466027558,11.236330354587574,11.46472929686246,26.821728516827097,null,null,null,null,null,null,null,null,null,null,null,null,null,null,null,null,null,null,null,null,null,null,null,null,null,null,null,null,null,null,"Piped water on premises","Yes","N/A","N/A","N/A","N/A","N/A","N/A","N/A","N/A","N/A","N/A","N/A","N/A","N/A","N/A","N/A","N/A","N/A","N/A","N/A","N/A"]
[null,"No",96.804885211601345,82.424839918573085,58.717077959084286,40.080430456384178,7.0077901880016666,82.813845324155366,61.990486906530847,47.209822908580264,26.345953258323068,5.6619809688167217,97.256178773319348,98.535320673428402,97.549761492460448,93.048324750085442,69.942985883382391,37.696861387244141,59.426090533971795,88.763669645412364,88.535270703137769,73.178271483173205,null,null,null,null,null,null,null,null,null,null,null,null,null,null,null,null,null,null,null,null,null,null,null,null,null,null,null,null,null,null,null,"No","N/A","N/A","N/A","N/A","N/A","N/A","N/A","N/A","N/A","N/A","N/A","N/A","N/A","N/A","N/A","N/A","N/A","N/A","N/A","N/A"]
["Piped water into dwelling","Yes","N/A","N/A","N/A","N/A","N/A","N/A","N/A","N/A","N/A","N/A","N/A","N/A","N/A","N/A","N/A","N/A","N/A","N/A","N/A","N/A",null,null,null,null,null,null,null,null,null,null,null,null,null,null,null,null,null,null,null,null,null,null,null,null,null,null,null,null,null,null,"Piped water into dwelling","Yes","N/A","N/A","N/A","N/A","N/A","N/A","N/A","N/A","N/A","N/A","N/A","N/A","N/A","N/A","N/A","N/A","N/A","N/A","N/A","N/A"]
[null,"No","N/A","N/A","N/A","N/A","N/A","N/A","N/A","N/A","N/A","N/A","N/A","N/A","N/A","N/A","N/A","N/A","N/A","N/A","N/A","N/A",null,null,null,null,null,null,null,null,null,null,null,null,null,null,null,null,null,null,null,null,null,null,null,null,null,null,null,null,null,null,null,"No","N/A","N/A","N/A","N/A","N/A","N/A","N/A","N/A","N/A","N/A","N/A","N/A","N/A","N/A","N/A","N/A","N/A","N/A","N/A","N/A"]
["Water source on premises","Yes",3.9841884599080073,20.486275255909021,48.855552592623432,64.658458144818269,94.176698133234666,20.289781011417549,45.507795270697287,57.953943161870583,77.891055764207081,95.316230848536875,3.2125602003330487,2.7168449154127439,3.1975442232646345,8.2944090408539388,32.132457734381603,67.605791895835281,42.615824581017677,12.336737908068242,12.090061099892742,29.656697450086632,null,null,null,null,null,null,null,null,null,null,null,null,null,null,null,null,null,null,null,null,null,null,null,null,null,null,null,null,null,null,"Water source on premises","Yes","N/A","N/A","N/A","N/A","N/A","N/A","N/A","N/A","N/A","N/A","N/A","N/A","N/A","N/A","N/A","N/A","N/A","N/A","N/A","N/A"]
[null,"No",96.015811540091974,79.513724744090979,51.144447407376624,35.341541855181724,5.8233018667653322,79.710218988582042,54.492204729302451,42.046056838129367,22.108944235792865,4.6837691514631121,96.787439799666942,97.283155084587264,96.802455776735371,91.705590959146036,67.867542265618525,32.394208104164051,57.384175418981883,87.663262091931813,87.909938900107392,70.343302549913673,null,null,null,null,null,null,null,null,null,null,null,null,null,null,null,null,null,null,null,null,null,null,null,null,null,null,null,null,null,null,null,"No","N/A","N/A","N/A","N/A","N/A","N/A","N/A","N/A","N/A","N/A","N/A","N/A","N/A","N/A","N/A","N/A","N/A","N/A","N/A","N/A"]
["Improved Water source on premises","Yes","N/A","N/A","N/A","N/A","N/A","N/A","N/A","N/A","N/A","N/A","N/A","N/A","N/A","N/A","N/A","N/A","N/A","N/A","N/A","N/A",null,null,null,null,null,null,null,null,null,null,null,null,null,null,null,null,null,null,null,null,null,null,null,null,null,null,null,null,null,null,"Improved water source on premises","Yes","N/A","N/A","N/A","N/A","N/A","N/A","N/A","N/A","N/A","N/A","N/A","N/A","N/A","N/A","N/A","N/A","N/A","N/A","N/A","N/A"]
[null,"No","N/A","N/A","N/A","N/A","N/A","N/A","N/A","N/A","N/A","N/A","N/A","N/A","N/A","N/A","N/A","N/A","N/A","N/A","N/A","N/A",null,null,null,null,null,null,null,null,null,null,null,null,null,null,null,null,null,null,null,null,null,null,null,null,null,null,null,null,null,null,null,"No","N/A","N/A","N/A","N/A","N/A","N/A","N/A","N/A","N/A","N/A","N/A","N/A","N/A","N/A","N/A","N/A","N/A","N/A","N/A","N/A"]
["Piped water on premises available when needed","Yes","N/A","N/A","N/A","N/A","N/A","N/A","N/A","N/A","N/A","N/A","N/A","N/A","N/A","N/A","N/A","N/A","N/A","N/A","N/A","N/A",null,null,null,null,null,null,null,null,null,null,null,null,null,null,null,null,null,null,null,null,null,null,null,null,null,null,null,null,null,null,"Piped water on premises available when needed","Yes","N/A","N/A","N/A","N/A","N/A","N/A","N/A","N/A","N/A","N/A","N/A","N/A","N/A","N/A","N/A","N/A","N/A","N/A","N/A","N/A"]
[null,"No","N/A","N/A","N/A","N/A","N/A","N/A","N/A","N/A","N/A","N/A","N/A","N/A","N/A","N/A","N/A","N/A","N/A","N/A","N/A","N/A",null,null,null,null,null,null,null,null,null,null,null,null,null,null,null,null,null,null,null,null,null,null,null,null,null,null,null,null,null,null,null,"No","N/A","N/A","N/A","N/A","N/A","N/A","N/A","N/A","N/A","N/A","N/A","N/A","N/A","N/A","N/A","N/A","N/A","N/A","N/A","N/A"]
["Water point at more than 30 minutes","Yes",17.689475633422454,11.370141481925609,4.9034489006470778,3.1974312542496031,0.42824207056955033,12.619845616163749,4.9912682804146087,3.5000226883895298,1.159088170093286,0.51164818440470705,11.66297958599845,16.986142087563614,21.518794496808667,17.502896136699629,12.108162859923164,2.4132899315299028,12.914866775689493,7.9740124819384226,15.102820958245729,15.414299249733308,null,null,null,null,null,null,null,null,null,null,null,null,null,null,null,null,null,null,null,null,null,null,null,null,null,null,null,null,null,null,"Water point at more than 30 minutes","Yes","N/A","N/A","N/A","N/A","N/A","N/A","N/A","N/A","N/A","N/A","N/A","N/A","N/A","N/A","N/A","N/A","N/A","N/A","N/A","N/A"]
[null,"No",82.310524366577582,88.629858518074258,95.096551099353007,96.802568745750435,99.571757929430433,87.380154383835944,95.008731719585285,96.499977311610479,98.840911829906702,99.48835181559528,88.337020414001515,83.013857912436279,78.481205503191305,82.497103863300353,87.891837140076888,97.586710068469969,87.085133224310113,92.025987518061541,84.897179041754555,84.585700750266867,null,null,null,null,null,null,null,null,null,null,null,null,null,null,null,null,null,null,null,null,null,null,null,null,null,null,null,null,null,null,null,"No","N/A","N/A","N/A","N/A","N/A","N/A","N/A","N/A","N/A","N/A","N/A","N/A","N/A","N/A","N/A","N/A","N/A","N/A","N/A","N/A"]
["Water source available when needed","Yes","N/A","N/A","N/A","N/A","N/A","N/A","N/A","N/A","N/A","N/A","N/A","N/A","N/A","N/A","N/A","N/A","N/A","N/A","N/A","N/A",null,null,null,null,null,null,null,null,null,null,null,null,null,null,null,null,null,null,null,null,null,null,null,null,null,null,null,null,null,null,"Water source available when needed","Yes","N/A","N/A","N/A","N/A","N/A","N/A","N/A","N/A","N/A","N/A","N/A","N/A","N/A","N/A","N/A","N/A","N/A","N/A","N/A","N/A"]
[null,"No","N/A","N/A","N/A","N/A","N/A","N/A","N/A","N/A","N/A","N/A","N/A","N/A","N/A","N/A","N/A","N/A","N/A","N/A","N/A","N/A",null,null,null,null,null,null,null,null,null,null,null,null,null,null,null,null,null,null,null,null,null,null,null,null,null,null,null,null,null,null,null,"No","N/A","N/A","N/A","N/A","N/A","N/A","N/A","N/A","N/A","N/A","N/A","N/A","N/A","N/A","N/A","N/A","N/A","N/A","N/A","N/A"]
["Improved water source available when needed","Yes","N/A","N/A","N/A","N/A","N/A","N/A","N/A","N/A","N/A","N/A","N/A","N/A","N/A","N/A","N/A","N/A","N/A","N/A","N/A","N/A",null,null,null,null,null,null,null,null,null,null,null,null,null,null,null,null,null,null,null,null,null,null,null,null,null,null,null,null,null,null,"Improved water source available when needed","Yes","N/A","N/A","N/A","N/A","N/A","N/A","N/A","N/A","N/A","N/A","N/A","N/A","N/A","N/A","N/A","N/A","N/A","N/A","N/A","N/A"]
[null,"No","N/A","N/A","N/A","N/A","N/A","N/A","N/A","N/A","N/A","N/A","N/A","N/A","N/A","N/A","N/A","N/A","N/A","N/A","N/A","N/A",null,null,null,null,null,null,null,null,null,null,null,null,null,null,null,null,null,null,null,null,null,null,null,null,null,null,null,null,null,null,null,"No","N/A","N/A","N/A","N/A","N/A","N/A","N/A","N/A","N/A","N/A","N/A","N/A","N/A","N/A","N/A","N/A","N/A","N/A","N/A","N/A"]
["Microbiological quality at point of collection","Not contaminated (No E. coli in 100 mL)","N/A","N/A","N/A","N/A","N/A","N/A","N/A","N/A","N/A","N/A","N/A","N/A","N/A","N/A","N/A","N/A","N/A","N/A","N/A","N/A",null,null,null,null,null,null,null,null,null,null,null,null,null,null,null,null,null,null,null,null,null,null,null,null,null,null,null,null,null,null,"Microbiological quality at point of collection","Not contaminated (No E. coli in 100 mL)","N/A","N/A","N/A","N/A","N/A","N/A","N/A","N/A","N/A","N/A","N/A","N/A","N/A","N/A","N/A","N/A","N/A","N/A","N/A","N/A"]
[null,"Contaminated (E. coli detected in 100 mL)","N/A","N/A","N/A","N/A","N/A","N/A","N/A","N/A","N/A","N/A","N/A","N/A","N/A","N/A","N/A","N/A","N/A","N/A","N/A","N/A",null,null,null,null,null,null,null,null,null,null,null,null,null,null,null,null,null,null,null,null,null,null,null,null,null,null,null,null,null,null,null,"Contaminated (E. coli detected in 100 mL)","N/A","N/A","N/A","N/A","N/A","N/A","N/A","N/A","N/A","N/A","N/A","N/A","N/A","N/A","N/A","N/A","N/A","N/A","N/A","N/A"]
[null,"Highly contaminated (>100 CFU/100 mL)","N/A","N/A","N/A","N/A","N/A","N/A","N/A","N/A","N/A","N/A","N/A","N/A","N/A","N/A","N/A","N/A","N/A","N/A","N/A","N/A",null,null,null,null,null,null,null,null,null,null,null,null,null,null,null,null,null,null,null,null,null,null,null,null,null,null,null,null,null,null,null,"Highly contaminated (>100 CFU/100 mL)","N/A","N/A","N/A","N/A","N/A","N/A","N/A","N/A","N/A","N/A","N/A","N/A","N/A","N/A","N/A","N/A","N/A","N/A","N/A","N/A"]
["Microbiological quality of improved water sources at point of collection","Not contaminated (No E. coli in 100 mL)","N/A","N/A","N/A","N/A","N/A","N/A","N/A","N/A","N/A","N/A","N/A","N/A","N/A","N/A","N/A","N/A","N/A","N/A","N/A","N/A",null,null,null,null,null,null,null,null,null,null,null,null,null,null,null,null,null,null,null,null,null,null,null,null,null,null,null,null,null,null,"Microbiological quality of improved water sources at point of collection","Not contaminated (No E. coli in 100 mL)","N/A","N/A","N/A","N/A","N/A","N/A","N/A","N/A","N/A","N/A","N/A","N/A","N/A","N/A","N/A","N/A","N/A","N/A","N/A","N/A"]
[null,"Contaminated (E. coli detected in 100 mL)","N/A","N/A","N/A","N/A","N/A","N/A","N/A","N/A","N/A","N/A","N/A","N/A","N/A","N/A","N/A","N/A","N/A","N/A","N/A","N/A",null,null,null,null,null,null,null,null,null,null,null,null,null,null,null,null,null,null,null,null,null,null,null,null,null,null,null,null,null,null,null,"Contaminated (E. coli detected in 100 mL)","N/A","N/A","N/A","N/A","N/A","N/A","N/A","N/A","N/A","N/A","N/A","N/A","N/A","N/A","N/A","N/A","N/A","N/A","N/A","N/A"]
[null,"Highly contaminated (>100 CFU/100 mL)","N/A","N/A","N/A","N/A","N/A","N/A","N/A","N/A","N/A","N/A","N/A","N/A","N/A","N/A","N/A","N/A","N/A","N/A","N/A","N/A",null,null,null,null,null,null,null,null,null,null,null,null,null,null,null,null,null,null,null,null,null,null,null,null,null,null,null,null,null,null,null,"Highly contaminated (>100 CFU/100 mL)","N/A","N/A","N/A","N/A","N/A","N/A","N/A","N/A","N/A","N/A","N/A","N/A","N/A","N/A","N/A","N/A","N/A","N/A","N/A","N/A"]
["Microbiological quality of piped on premises at point of collection","Not contaminated (No E. coli in 100 mL)","N/A","N/A","N/A","N/A","N/A","N/A","N/A","N/A","N/A","N/A","N/A","N/A","N/A","N/A","N/A","N/A","N/A","N/A","N/A","N/A",null,null,null,null,null,null,null,null,null,null,null,null,null,null,null,null,null,null,null,null,null,null,null,null,null,null,null,null,null,null,"Microbiological quality of piped on premises at point of collection","Not contaminated (No E. coli in 100 mL)","N/A","N/A","N/A","N/A","N/A","N/A","N/A","N/A","N/A","N/A","N/A","N/A","N/A","N/A","N/A","N/A","N/A","N/A","N/A","N/A"]
[null,"Contaminated (E. coli detected in 100 mL)","N/A","N/A","N/A","N/A","N/A","N/A","N/A","N/A","N/A","N/A","N/A","N/A","N/A","N/A","N/A","N/A","N/A","N/A","N/A","N/A",null,null,null,null,null,null,null,null,null,null,null,null,null,null,null,null,null,null,null,null,null,null,null,null,null,null,null,null,null,null,null,"Contaminated (E. coli detected in 100 mL)","N/A","N/A","N/A","N/A","N/A","N/A","N/A","N/A","N/A","N/A","N/A","N/A","N/A","N/A","N/A","N/A","N/A","N/A","N/A","N/A"]
[null,"Highly contaminated (>100 CFU/100 mL)","N/A","N/A","N/A","N/A","N/A","N/A","N/A","N/A","N/A","N/A","N/A","N/A","N/A","N/A","N/A","N/A","N/A","N/A","N/A","N/A",null,null,null,null,null,null,null,null,null,null,null,null,null,null,null,null,null,null,null,null,null,null,null,null,null,null,null,null,null,null,null,"Highly contaminated (>100 CFU/100 mL)","N/A","N/A","N/A","N/A","N/A","N/A","N/A","N/A","N/A","N/A","N/A","N/A","N/A","N/A","N/A","N/A","N/A","N/A","N/A","N/A"]
[null,null,"NATIONAL wealth index quintile",null,null,null,null,"URBAN wealth index quintile",null,null,null,null,"RURAL wealth index quintile",null,null,null,null,"SUB-REGIONS:",null,null,null,null,null,null,null,null,null,null,null,null,null,null,null,null,null,null,null,null,null,null,null,null,null,null,null,null,null,null,null,null,null,null,"Raw numbers of respondents:","Use of drinking water sources","NATIONAL wealth index quintile",null,null,null,null,"URBAN wealth index quintile",null,null,null,null,"RURAL wealth index quintile",null,null,null,null,"SUB-REGIONS:"]
["Percentage based on weighted population",null,"Poorest","Poor","Middle","Rich","Richest","Poorest","Poor","Middle","Rich","Richest","Poorest","Poor","Middle","Rich","Richest","Big cities","East (Haut-Ogoou‚ & Ogoou‚-Lolo)","North (Ogoou‚-Ivindo & Woleu-Ntem)","South (Ngouni‚, Nyanga)","West (Estuaire, Moyen-Ogoou‚ & Ogoou‚-maritime)",null,null,null,null,null,null,null,null,null,null,null,null,null,null,null,null,null,null,null,null,null,null,null,null,null,null,null,null,null,null,"Water data, raw numbers (weighted)",null,"Poorest","Poor","Middle","Rich","Richest","Poorest","Poor","Middle","Rich","Richest","Poorest","Poor","Middle","Rich","Richest","Big cities","East (Haut-Ogoou‚ & Ogoou‚-Lolo)","North (Ogoou‚-Ivindo & Woleu-Ntem)","South (Ngouni‚, Nyanga)","West (Estuaire, Moyen-Ogoou‚ & Ogoou‚-maritime)"]
["Source of drinking water","Piped into residence/yard/plot",3.1988149824543184,17.597347746534044,41.375119130616916,59.919569543615815,92.99220981199835,17.216043542284375,38.009513093469025,52.95400709317353,73.654046741676893,94.338019031183265,2.743821226680653,1.4646793265715861,2.4502385075395505,6.9816966916820045,30.05701411661769,62.358859698155008,40.670377359267981,11.236330354587574,11.479614495053742,26.821728516827097]
[null,"Public tap",15.886936154748502,44.287322037600049,49.435213066896104,35.87980411192359,5.6828527703743932,55.409797646068547,56.917208336437987,43.835494082891856,25.373448268874082,4.5174742668667172,9.1670721131286417,7.5078907202672616,8.7590790129805995,13.344960960891097,15.352509896572647,37.249860257126535,24.19162017702665,11.835843789547958,31.055947802955714,27.61362245139911]
[null,"Protected well in yard/plot",1.4910249495159467,0.90473907599096393,0.2179288020025518,0.19568750885850827,9.6680365071718843E-2,0.84627637738019978,0,0,2.5806519431988421E-2,0.13104485085024764,1.3866138379662578,1.3250752300159212,1.8122376330672392,2.191760285193912,1.5035461152766276,0.11179429849077643,0.49352937355055992,1.8859905008681681,0.34068639163506581,1.4536953483706136]
[null,"Public protected well",13.709533504701351,5.5637892363783861,1.0977459559533036,0.67562950846501224,0,1.7138580156415353,0.27387067763912204,1.3233684156233348E-2,0.17954089944943091,0,14.255931788025213,18.316366393040344,17.41455533775024,13.163311381675822,10.877579749634856,0,1.2889348281816204,14.887304446658264,16.14677716680136,3.2218103958335043]
[null,"Open well in yard/plot",1.6550704729852588,1.059428624492432,0.81651989975755923,0.58690337816481486,0,1.5817854134258822,0.87216126127808258,0.92426329377797956,0,0,0.60894144964868668,1.780673512187771,1.1424472411262829,1.8330992771476908,0.93846932745669243,7.8256008943543509E-2,0.84579000850856656,3.0411052396920932,0.76617349299512505,1.5590355910061651]
[null,"Public open well",4.8808511298153405,4.0887604987224861,0.97651095038305724,0.32627236053150699,0.20669621770800281,4.6574820556702337,1.0331911163641223,0.16331860755156813,0.29405570908949275,0.18856130724898829,3.2723294570534134,5.9904270294504887,4.7584813102033028,5.8896758422546345,2.2595370720942403,4.4717719396310578E-2,1.6538546531306171,9.8395340450588193,2.3317575110043007,2.4860297261990207]
[null,"Spring",21.502736790279389,11.724041570039596,3.219920728180266,0.93646450223344502,0.73336305939202751,8.8097153918656321,1.5628937368825364,1.0767374793693991,0.25353308702259397,0.57471452906982179,25.913225972942193,21.804060307422702,20.229446726320504,24.945196340366195,17.186537125186103,6.7076579094465863E-2,10.421823469719923,30.083368575637021,6.8399179892285566,11.935892450671892]
[null,"River/stream",35.468096465426676,13.199568285389004,2.1012407892005407,1.1285284034049592,8.8685003007453647E-2,8.2683394860438444,0.93991795273022616,0.50177583342878618,0.15195995124945808,8.1903031781404761E-2,41.12699673336985,40.22428817930119,39.269678210599714,29.45841981833513,19.37262755885013,0,18.813344151371638,16.58112375460815,28.181870005982258,21.807505791476409]
[null,"Pond/lake",0.91772809107473607,0.51863653334752702,0,0,0,0.33137123329643736,0,0,0,0,0.2720148362646142,0.76361984441245623,1.9878648816720141,0.88120309402969643,0.64277283238869054,0,0.84824699415816851,0.17263623195155348,8.8584450543586074E-2,1.132007351128586]
[null,"Rainwater",1.289207458999281,0.91926249709579544,0.533241690332942,0.16929134033000212,0,0.99351081231404004,0.27387067763912198,0.42711709978689222,0,0,1.2530525849205283,0.82291945733016014,2.1759711387404215,1.3106763084237427,0.73811815194122044,6.7076579094465863E-2,0.38513710276028446,5.3126990387013975E-2,2.5090012710723357,1.9354480526548141]
[null,"Bottled water",0,0,5.5832463609155399E-2,0,0.12415337288105954,0,0,7.758545755121099E-2,0,0.16828298299954247,0,0,0,0,0,2.2358859698155289E-2,0,0.11509082130103565,9.2739079545951814E-2,0]
[null,"Other",0,0.13710389440939438,0.17072652306768232,0.18184934247234749,7.5359399567011667E-2,0.1718200260085701,0.11737314755962372,2.6467368312466696E-2,6.7608823206025057E-2,0,0,0,0,0,1.0712880539811509,0,0.38734188232342964,0.2685452497024165,0.1669303431827133,3.3224324433393182E-2]
[]
[]
[]
[]
[]
[]
[]
[]
[]
[]
[]
[]
[]
[]
[]
[]
[]
[]
[]
[]
[]
[]
[]
[]
[]
[]
[]
[]
[]
[]
[]
[]
[]
[]
[]
[]
[]
[]
[{"$f":"A1026","v":"Gabon"}]
[{"$f":"A1034","v":"2000"}]
["Use of sanitation facilities"]
[" by wealth quintile and sub-national region"]
["Notes:"]
["WHO/UNICEF JMP customised wealth index excludes water,"]
[" sanitation and hygiene assets."]
["Survey used for analysis:",{"$f":"A1025","v":"DHS00"}]
[{"$f":"B1030","v":"Ratio of Improved latrines based on:"},"DHS12"]
[{"$f":"B1029","v":"Ratio of Shared improved based on:"},"DHS12"]
[]
[]
["Use of sanitation facilities",null,"NATIONAL wealth index quintile",null,null,null,null,"URBAN wealth index quintile",null,null,null,null,"RURAL wealth index quintile",null,null,null,null,"SUB-REGIONS:",null,null,null,null,null,null,null,null,null,null,null,null,null,null,null,null,null,null,null,null,null,null,null,null,null,null,null,null,null,null,null,null,null,null,"Raw numbers of respondents:","Use of sanitation facilities","NATIONAL wealth index quintile",null,null,null,null,"URBAN wealth index quintile",null,null,null,null,"RURAL wealth index quintile",null,null,null,null,"SUB-REGIONS:"]
["Weighted percentage (used in graphs)",null,"Poorest","Poor","Middle","Rich","Richest","Poorest","Poor","Middle","Rich","Richest","Poorest","Poor","Middle","Rich","Richest","Big cities","East (Haut-Ogoou‚ & Ogoou‚-Lolo)","North (Ogoou‚-Ivindo & Woleu-Ntem)","South (Ngouni‚, Nyanga)","West (Estuaire, Moyen-Ogoou‚ & Ogoou‚-maritime)",null,null,null,null,null,null,null,null,null,null,null,null,null,null,null,null,null,null,null,null,null,null,null,null,null,null,null,null,null,null,"Sanitation data, raw numbers (weighted)",null,"Poorest","Poor","Middle","Rich","Richest","Poorest","Poor","Middle","Rich","Richest","Poorest","Poor","Middle","Rich","Richest","Big cities","East (Haut-Ogoou‚ & Ogoou‚-Lolo)","North (Ogoou‚-Ivindo & Woleu-Ntem)","South (Ngouni‚, Nyanga)","West (Estuaire, Moyen-Ogoou‚ & Ogoou‚-maritime)"]
["Sanitation","Improved",{"$f":"C153+C154+C155*0.5","v":48.840108929529755},{"$f":"D153+D154+D155*0.5","v":59.60483179004666},71.503628647176825,85.224469147087675,95.950895223872394,57.00910935427278,70.714713867215892,78.076375397936687,89.921739626529643,97.041984359403017,48.557887426124417,47.70491632301438,49.528600960185365,55.268259715053475,71.278086381263392,84.552163703454539,62.490890552114635,56.01655722054555,55.894339208757188,64.147842458461724,null,null,null,null,null,null,null,null,null,null,null,null,null,null,null,null,null,null,null,null,null,null,null,null,null,null,null,null,null,null,"Sanitation","Improved","N/A","N/A","N/A","N/A","N/A","N/A","N/A","N/A","N/A","N/A","N/A","N/A","N/A","N/A","N/A","N/A","N/A","N/A","N/A","N/A"]
[null,"Not Improved",{"$f":"100-C122","v":51.159891070470245},{"$f":"100-D122","v":40.39516820995334},28.496371352823175,14.775530852912325,4.0491047761276064,42.99089064572722,29.285286132784108,21.923624602063313,10.078260373470357,2.9580156405969831,51.442112573875583,52.29508367698562,50.471399039814635,44.731740284946525,28.721913618736608,15.447836296545461,37.509109447885365,43.98344277945445,44.105660791242812,35.852157541538276,null,null,null,null,null,null,null,null,null,null,null,null,null,null,null,null,null,null,null,null,null,null,null,null,null,null,null,null,null,null,null,"Not Improved","N/A","N/A","N/A","N/A","N/A","N/A","N/A","N/A","N/A","N/A","N/A","N/A","N/A","N/A","N/A","N/A","N/A","N/A","N/A","N/A"]
["Sanitation ladder","Basic",{"$f":"C122*'DHS12'!C129/100","v":17.650135886992977},{"$f":"D122*'DHS12'!D129/100","v":17.476582316159949},{"$f":"E122*'DHS12'!E129/100","v":29.056968615032641},{"$f":"F122*'DHS12'!F129/100","v":55.963751324500478},{"$f":"G122*'DHS12'!G129/100","v":87.468208061450241},{"$f":"H122*'DHS12'!H129/100","v":16.134969668564228},{"$f":"I122*'DHS12'!I129/100","v":22.736461678761085},{"$f":"J122*'DHS12'!J129/100","v":35.330814524194317},{"$f":"K122*'DHS12'!K129/100","v":64.117109836115816},{"$f":"L122*'DHS12'!L129/100","v":88.663674314210255},{"$f":"M122*'DHS12'!M129/100","v":23.620908757328781},{"$f":"N122*'DHS12'!N129/100","v":18.354930119506928},{"$f":"O122*'DHS12'!O129/100","v":31.477426994259204},{"$f":"P122*'DHS12'!P129/100","v":34.838258973464256},{"$f":"Q122*'DHS12'!Q129/100","v":53.863265720548178},"N/A","N/A","N/A","N/A","N/A",null,null,null,null,null,null,null,null,null,null,null,null,null,null,null,null,null,null,null,null,null,null,null,null,null,null,null,null,null,null,"Sanitation ladder","Basic","N/A","N/A","N/A","N/A","N/A","N/A","N/A","N/A","N/A","N/A","N/A","N/A","N/A","N/A","N/A","N/A","N/A","N/A","N/A","N/A"]
[null,"Limited",{"$f":"C122*'DHS12'!C128/100","v":31.189973042536828},{"$f":"D122*'DHS12'!D128/100","v":42.128249473886733},{"$f":"E122*'DHS12'!E128/100","v":42.446660032144166},{"$f":"F122*'DHS12'!F128/100","v":29.260717822587218},{"$f":"G122*'DHS12'!G128/100","v":8.4826871624221969},{"$f":"H122*'DHS12'!H128/100","v":40.874139685708563},{"$f":"I122*'DHS12'!I128/100","v":47.978252188454853},{"$f":"J122*'DHS12'!J128/100","v":42.745560873742306},{"$f":"K122*'DHS12'!K128/100","v":25.804629790413891},{"$f":"L122*'DHS12'!L128/100","v":8.3783100451927677},{"$f":"M122*'DHS12'!M128/100","v":24.936978668795632},{"$f":"N122*'DHS12'!N128/100","v":29.349986203507438},{"$f":"O122*'DHS12'!O128/100","v":18.051173965926115},{"$f":"P122*'DHS12'!P128/100","v":20.430000741589154},{"$f":"Q122*'DHS12'!Q128/100","v":17.41482066071519},"N/A","N/A","N/A","N/A","N/A",null,null,null,null,null,null,null,null,null,null,null,null,null,null,null,null,null,null,null,null,null,null,null,null,null,null,null,null,null,null,null,"Limited","N/A","N/A","N/A","N/A","N/A","N/A","N/A","N/A","N/A","N/A","N/A","N/A","N/A","N/A","N/A","N/A","N/A","N/A","N/A","N/A"]
[null,"Unimproved",{"$f":"100-(C124+C125+C127)","v":46.326379208774497},{"$f":"100-(D124+D125+D127)","v":37.59266410632727},26.729258311373172,14.039859718206387,3.9040842285199915,39.329330387079303,27.05036383072536,20.811134864563314,9.7327720294553473,2.9580156405969831,48.341736487197821,44.637957479285859,47.093537234838919,41.91611307322863,26.894496188907937,"N/A","N/A","N/A","N/A","N/A",null,null,null,null,null,null,null,null,null,null,null,null,null,null,null,null,null,null,null,null,null,null,null,null,null,null,null,null,null,null,null,"Unimproved","N/A","N/A","N/A","N/A","N/A","N/A","N/A","N/A","N/A","N/A","N/A","N/A","N/A","N/A","N/A","N/A","N/A","N/A","N/A","N/A"]
[null,"Open defecation",{"$f":"C156","v":4.8335118616957002},{"$f":"D156","v":2.8025041036260512},1.7671130414500105,0.73567113470592727,0.14502054760757827,3.661560258647901,2.234922302058707,1.1124897375000486,0.34548834401495865,0,3.1003760866777683,7.6571261976997773,3.3778618049757689,2.8156272117179628,1.8274174298286934,"N/A","N/A","N/A","N/A","N/A",null,null,null,null,null,null,null,null,null,null,null,null,null,null,null,null,null,null,null,null,null,null,null,null,null,null,null,null,null,null,null,"Open defecation","N/A","N/A","N/A","N/A","N/A","N/A","N/A","N/A","N/A","N/A","N/A","N/A","N/A","N/A","N/A","N/A","N/A","N/A","N/A","N/A"]
["Shared among Improved Sanitation","Yes","N/A","N/A","N/A","N/A","N/A","N/A","N/A","N/A","N/A","N/A","N/A","N/A","N/A","N/A","N/A","N/A","N/A","N/A","N/A","N/A",null,null,null,null,null,null,null,null,null,null,null,null,null,null,null,null,null,null,null,null,null,null,null,null,null,null,null,null,null,null,"Shared among improved sanitation facilities","Yes","N/A","N/A","N/A","N/A","N/A","N/A","N/A","N/A","N/A","N/A","N/A","N/A","N/A","N/A","N/A","N/A","N/A","N/A","N/A","N/A"]
[null,"No","N/A","N/A","N/A","N/A","N/A","N/A","N/A","N/A","N/A","N/A","N/A","N/A","N/A","N/A","N/A","N/A","N/A","N/A","N/A","N/A",null,null,null,null,null,null,null,null,null,null,null,null,null,null,null,null,null,null,null,null,null,null,null,null,null,null,null,null,null,null,null,"No","N/A","N/A","N/A","N/A","N/A","N/A","N/A","N/A","N/A","N/A","N/A","N/A","N/A","N/A","N/A","N/A","N/A","N/A","N/A","N/A"]
["Manually calculated ratios","Improved latrines"]
[null,"Other"]
[null,"Other"]
[null,null,"NATIONAL wealth index quintile",null,null,null,null,"URBAN wealth index quintile",null,null,null,null,"RURAL wealth index quintile",null,null,null,null,"SUB-REGIONS:",null,null,null,null,null,null,null,null,null,null,null,null,null,null,null,null,null,null,null,null,null,null,null,null,null,null,null,null,null,null,null,null,null,null,"Raw numbers of respondents:","Use of sanitation facilities","NATIONAL wealth index quintile",null,null,null,null,"URBAN wealth index quintile",null,null,null,null,"RURAL wealth index quintile",null,null,null,null,"SUB-REGIONS:"]
["Percentage based on weighted population",null,"Poorest","Poor","Middle","Rich","Richest","Poorest","Poor","Middle","Rich","Richest","Poorest","Poor","Middle","Rich","Richest","Big cities","East (Haut-Ogoou‚ & Ogoou‚-Lolo)","North (Ogoou‚-Ivindo & Woleu-Ntem)","South (Ngouni‚, Nyanga)","West (Estuaire, Moyen-Ogoou‚ & Ogoou‚-maritime)",null,null,null,null,null,null,null,null,null,null,null,null,null,null,null,null,null,null,null,null,null,null,null,null,null,null,null,null,null,null,"Sanitation data, raw numbers (weighted)",null,"Poorest","Poor","Middle","Rich","Richest","Poorest","Poor","Middle","Rich","Richest","Poorest","Poor","Middle","Rich","Richest","Big cities","East (Haut-Ogoou‚ & Ogoou‚-Lolo)","North (Ogoou‚-Ivindo & Woleu-Ntem)","South (Ngouni‚, Nyanga)","West (Estuaire, Moyen-Ogoou‚ & Ogoou‚-maritime)"]
["Sanitation type","Sewer connection","N/A","N/A","N/A","N/A","N/A","N/A","N/A","N/A","N/A","N/A","N/A","N/A","N/A","N/A","N/A","N/A","N/A","N/A","N/A","N/A",null,null,null,null,null,null,null,null,null,null,null,null,null,null,null,null,null,null,null,null,null,null,null,null,null,null,null,null,null,null,"Sanitation type","Sewer connection","N/A","N/A","N/A","N/A","N/A","N/A","N/A","N/A","N/A","N/A","N/A","N/A","N/A","N/A","N/A","N/A","N/A","N/A","N/A","N/A"]
[null,"Septic tank connection","N/A","N/A","N/A","N/A","N/A","N/A","N/A","N/A","N/A","N/A","N/A","N/A","N/A","N/A","N/A","N/A","N/A","N/A","N/A","N/A",null,null,null,null,null,null,null,null,null,null,null,null,null,null,null,null,null,null,null,null,null,null,null,null,null,null,null,null,null,null,null,"Septic tank connection","N/A","N/A","N/A","N/A","N/A","N/A","N/A","N/A","N/A","N/A","N/A","N/A","N/A","N/A","N/A","N/A","N/A","N/A","N/A","N/A"]
[null,"Improved latrines","N/A","N/A","N/A","N/A","N/A","N/A","N/A","N/A","N/A","N/A","N/A","N/A","N/A","N/A","N/A","N/A","N/A","N/A","N/A","N/A",null,null,null,null,null,null,null,null,null,null,null,null,null,null,null,null,null,null,null,null,null,null,null,null,null,null,null,null,null,null,null,"Improved latrines","N/A","N/A","N/A","N/A","N/A","N/A","N/A","N/A","N/A","N/A","N/A","N/A","N/A","N/A","N/A","N/A","N/A","N/A","N/A","N/A"]
[null,"Unimproved facilities","N/A","N/A","N/A","N/A","N/A","N/A","N/A","N/A","N/A","N/A","N/A","N/A","N/A","N/A","N/A","N/A","N/A","N/A","N/A","N/A",null,null,null,null,null,null,null,null,null,null,null,null,null,null,null,null,null,null,null,null,null,null,null,null,null,null,null,null,null,null,null,"Unimproved facilities","N/A","N/A","N/A","N/A","N/A","N/A","N/A","N/A","N/A","N/A","N/A","N/A","N/A","N/A","N/A","N/A","N/A","N/A","N/A","N/A"]
[null,"Open defecation",4.8227205679643639,2.7929163453810268,1.7627971146405934,0.73325440330304337,0.14502054760757827,3.6559267717687902,2.2288983329877339,1.1117503550077419,0.34418955584119754,0,3.0897722624603294,7.6353841942904666,3.3778618049757689,2.803519955830398,1.8123071843509406,0.92706355411593455,7.310239315131084,0.39398103402661711,2.4157967250884895,1.8455085892110015,null,null,null,null,null,null,null,null,null,null,null,null,null,null,null,null,null,null,null,null,null,null,null,null,null,null,null,null,null,null,null,"Open defecation","N/A","N/A","N/A","N/A","N/A","N/A","N/A","N/A","N/A","N/A","N/A","N/A","N/A","N/A","N/A","N/A","N/A","N/A","N/A","N/A"]
["Septic tank emptying practices","Not emptied/treated and disposed in situ","N/A","N/A","N/A","N/A","N/A","N/A","N/A","N/A","N/A","N/A","N/A","N/A","N/A","N/A","N/A","N/A","N/A","N/A","N/A","N/A",null,null,null,null,null,null,null,null,null,null,null,null,null,null,null,null,null,null,null,null,null,null,null,null,null,null,null,null,null,null,"Septic tank emptying practices","Not emptied/treated and disposed in situ","N/A","N/A","N/A","N/A","N/A","N/A","N/A","N/A","N/A","N/A","N/A","N/A","N/A","N/A","N/A","N/A","N/A","N/A","N/A","N/A"]
[null,"Emptied and buried on site","N/A","N/A","N/A","N/A","N/A","N/A","N/A","N/A","N/A","N/A","N/A","N/A","N/A","N/A","N/A","N/A","N/A","N/A","N/A","N/A",null,null,null,null,null,null,null,null,null,null,null,null,null,null,null,null,null,null,null,null,null,null,null,null,null,null,null,null,null,null,null,"Emptied and buried on site","N/A","N/A","N/A","N/A","N/A","N/A","N/A","N/A","N/A","N/A","N/A","N/A","N/A","N/A","N/A","N/A","N/A","N/A","N/A","N/A"]
[null,"Emptied and discharged locally","N/A","N/A","N/A","N/A","N/A","N/A","N/A","N/A","N/A","N/A","N/A","N/A","N/A","N/A","N/A","N/A","N/A","N/A","N/A","N/A",null,null,null,null,null,null,null,null,null,null,null,null,null,null,null,null,null,null,null,null,null,null,null,null,null,null,null,null,null,null,null,"Emptied and discharged locally","N/A","N/A","N/A","N/A","N/A","N/A","N/A","N/A","N/A","N/A","N/A","N/A","N/A","N/A","N/A","N/A","N/A","N/A","N/A","N/A"]
[null,"Emptied and removed offsite","N/A","N/A","N/A","N/A","N/A","N/A","N/A","N/A","N/A","N/A","N/A","N/A","N/A","N/A","N/A","N/A","N/A","N/A","N/A","N/A",null,null,null,null,null,null,null,null,null,null,null,null,null,null,null,null,null,null,null,null,null,null,null,null,null,null,null,null,null,null,null,"Emptied and removed offsite","N/A","N/A","N/A","N/A","N/A","N/A","N/A","N/A","N/A","N/A","N/A","N/A","N/A","N/A","N/A","N/A","N/A","N/A","N/A","N/A"]
["Latrine emptying practices","Not emptied/treated and disposed in situ","N/A","N/A","N/A","N/A","N/A","N/A","N/A","N/A","N/A","N/A","N/A","N/A","N/A","N/A","N/A","N/A","N/A","N/A","N/A","N/A",null,null,null,null,null,null,null,null,null,null,null,null,null,null,null,null,null,null,null,null,null,null,null,null,null,null,null,null,null,null,"Latrine emptying practices","Not emptied/treated and disposed in situ","N/A","N/A","N/A","N/A","N/A","N/A","N/A","N/A","N/A","N/A","N/A","N/A","N/A","N/A","N/A","N/A","N/A","N/A","N/A","N/A"]
[null,"Emptied and buried on site","N/A","N/A","N/A","N/A","N/A","N/A","N/A","N/A","N/A","N/A","N/A","N/A","N/A","N/A","N/A","N/A","N/A","N/A","N/A","N/A",null,null,null,null,null,null,null,null,null,null,null,null,null,null,null,null,null,null,null,null,null,null,null,null,null,null,null,null,null,null,null,"Emptied and buried on site","N/A","N/A","N/A","N/A","N/A","N/A","N/A","N/A","N/A","N/A","N/A","N/A","N/A","N/A","N/A","N/A","N/A","N/A","N/A","N/A"]
[null,"Emptied and discharged locally","N/A","N/A","N/A","N/A","N/A","N/A","N/A","N/A","N/A","N/A","N/A","N/A","N/A","N/A","N/A","N/A","N/A","N/A","N/A","N/A",null,null,null,null,null,null,null,null,null,null,null,null,null,null,null,null,null,null,null,null,null,null,null,null,null,null,null,null,null,null,null,"Emptied and discharged locally","N/A","N/A","N/A","N/A","N/A","N/A","N/A","N/A","N/A","N/A","N/A","N/A","N/A","N/A","N/A","N/A","N/A","N/A","N/A","N/A"]
[null,"Emptied and removed offsite","N/A","N/A","N/A","N/A","N/A","N/A","N/A","N/A","N/A","N/A","N/A","N/A","N/A","N/A","N/A","N/A","N/A","N/A","N/A","N/A",null,null,null,null,null,null,null,null,null,null,null,null,null,null,null,null,null,null,null,null,null,null,null,null,null,null,null,null,null,null,null,"Emptied and removed offsite","N/A","N/A","N/A","N/A","N/A","N/A","N/A","N/A","N/A","N/A","N/A","N/A","N/A","N/A","N/A","N/A","N/A","N/A","N/A","N/A"]
["Shared among improved sanitation facilities","Yes","N/A","N/A","N/A","N/A","N/A","N/A","N/A","N/A","N/A","N/A","N/A","N/A","N/A","N/A","N/A","N/A","N/A","N/A","N/A","N/A",null,null,null,null,null,null,null,null,null,null,null,null,null,null,null,null,null,null,null,null,null,null,null,null,null,null,null,null,null,null,"Shared among improved sanitation facilities","Yes","N/A","N/A","N/A","N/A","N/A","N/A","N/A","N/A","N/A","N/A","N/A","N/A","N/A","N/A","N/A","N/A","N/A","N/A","N/A","N/A"]
[null,"No","N/A","N/A","N/A","N/A","N/A","N/A","N/A","N/A","N/A","N/A","N/A","N/A","N/A","N/A","N/A","N/A","N/A","N/A","N/A","N/A",null,null,null,null,null,null,null,null,null,null,null,null,null,null,null,null,null,null,null,null,null,null,null,null,null,null,null,null,null,null,null,"No","N/A","N/A","N/A","N/A","N/A","N/A","N/A","N/A","N/A","N/A","N/A","N/A","N/A","N/A","N/A","N/A","N/A","N/A","N/A","N/A"]
[null,"DK/missing","N/A","N/A","N/A","N/A","N/A","N/A","N/A","N/A","N/A","N/A","N/A","N/A","N/A","N/A","N/A","N/A","N/A","N/A","N/A","N/A",null,null,null,null,null,null,null,null,null,null,null,null,null,null,null,null,null,null,null,null,null,null,null,null,null,null,null,null,null,null,null,"DK/missing","N/A","N/A","N/A","N/A","N/A","N/A","N/A","N/A","N/A","N/A","N/A","N/A","N/A","N/A","N/A","N/A","N/A","N/A","N/A","N/A"]
["Shared among all sanitation facilities","Yes",43.625979095763363,58.891966615283224,61.647562085895558,49.362755450354307,14.603270344642524,61.431622892958401,66.460420896289278,56.880220351554101,40.203926659273662,10.420260589051949,39.374468337173099,40.999284010321958,43.063350103979687,50.401950209366689,35.367188525683311,46.976376172713358,36.631235054056027,45.780494626424719,52.100701708095428,43.569025270758033,null,null,null,null,null,null,null,null,null,null,null,null,null,null,null,null,null,null,null,null,null,null,null,null,null,null,null,null,null,null,"Shared among all sanitation facilities","Yes","N/A","N/A","N/A","N/A","N/A","N/A","N/A","N/A","N/A","N/A","N/A","N/A","N/A","N/A","N/A","N/A","N/A","N/A","N/A","N/A"]
[null,"No",55.848775729217017,40.416564387998136,38.101878933702928,50.354207695366867,85.227430061174076,37.664387593448048,33.422218819713436,42.837718683937773,59.461311122220408,89.426885681323483,60.209435328968354,58.620523260690483,56.615326421562898,48.896942578826803,64.19190424301938,52.786255227760435,62.17162157716173,53.859424600753989,47.573717267573009,56.323296509447751,null,null,null,null,null,null,null,null,null,null,null,null,null,null,null,null,null,null,null,null,null,null,null,null,null,null,null,null,null,null,null,"No","N/A","N/A","N/A","N/A","N/A","N/A","N/A","N/A","N/A","N/A","N/A","N/A","N/A","N/A","N/A","N/A","N/A","N/A","N/A","N/A"]
["Type of toilet facility","Modern flush toilets",1.1676737475561911E-2,2.9303695240326681,8.3869457120742101,28.455873577332209,83.087587326151848,2.2722036749257413,7.5541514377764134,14.626998451211188,45.834003930444553,88.402937637327142,4.1874516717692947E-2,0,0,0.71538621334858821,20.786405000866999,36.251817063624905,24.640566901707299,5.7954902803098305,5.8546329248872011,12.03999008590695,null,null,null,null,null,null,null,null,null,null,null,null,null,null,null,null,null,null,null,null,null,null,null,null,null,null,null,null,null,null,"Type of toilet facility","Modern flush toilets",0.75718600000000003,187.94493900000001,547.91533800000013,1845.5789240000006,5388.3523530000048,108.48194699999998,361.69406600000002,689.47965300000044,2215.6785599999994,4229.654142000003,0.75718600000000003,0,0,12.143588000000001,352.65959800000002,5913.8813319999826,1161.6239520000001,246.61747699999995,197.56185299999993,450.86412599999983]
[null,"Ventilated improved pit (VIP) Latrines",2.6422506615412198,19.116915986389436,36.909729081532674,42.728735851549096,9.1279920200522309,15.498813733558222,36.757867165072447,42.704249659895837,34.354963666629878,5.9097871825672934,0.30521169706594747,3.0669588437285618,2.5735494495342084,12.724841456282515,23.641815126264728,34.037794923403503,7.6955279790170295,6.6512858471176193,8.3981667887864511,18.427679285151843,null,null,null,null,null,null,null,null,null,null,null,null,null,null,null,null,null,null,null,null,null,null,null,null,null,null,null,null,null,null,null,"Ventilated improved pit (VIP) Latrines",171.33854499999995,1226.1005240000006,2411.2957660000011,2771.2821440000025,591.96372000000008,739.96073000000035,1759.9729820000007,2012.970148000001,1660.7660230000006,282.75480999999996,5.5189180000000002,48.932016000000004,43.998405999999996,216.00253000000009,401.1041360000001,5552.7004239999815,362.78831000000037,283.03443799999985,283.39221499999962,690.06531200000006]
[null,"Traditional pit toilet",92.372363061025951,75.115092559249106,52.413907707139884,28.079719436412748,7.4706317553366226,78.476183891577634,52.805390528734051,41.490254573659314,19.465544058910446,5.4585190790171376,96.421602424681552,89.275914958571633,93.910103021302319,83.656064090844737,53.699732508263352,28.525103432852266,60.3095913427806,87.139562186236205,83.28307899016707,67.360346174805869,null,null,null,null,null,null,null,null,null,null,null,null,null,null,null,null,null,null,null,null,null,null,null,null,null,null,null,null,null,null,null,"Traditional pit toilet",5989.9488399999491,4817.6523040000202,3424.1766840000091,1821.1824790000023,484.48146699999984,3746.6928320000197,2528.331152000002,1955.7454950000033,940.99107500000002,261.16380800000002,1743.5207179999982,1424.3590220000006,1605.5237800000016,1420.0508160000006,911.06307600000071,4653.3964459999825,2843.1596609999942,3708.0795469999989,2810.3485939999855,2522.4575259999924]
[null,"No toilet/bush",4.8335118616957002,2.8025041036260512,1.7671130414500105,0.73567113470592727,0.14502054760757827,3.661560258647901,2.234922302058707,1.1124897375000486,0.34548834401495865,0,3.1003760866777683,7.6571261976997773,3.3778618049757689,2.8156272117179628,1.8274174298286934,0.92810019009280587,7.3543137764944948,0.39586787805979196,2.4198129631004432,1.8461219507573572,null,null,null,null,null,null,null,null,null,null,null,null,null,null,null,null,null,null,null,null,null,null,null,null,null,null,null,null,null,null,null,"No toilet/bush",313.4323709999997,179.74404199999998,115.444689,47.713845000000006,9.4047959999999993,174.814076,107.00846299999999,52.439947999999994,16.70138,0,56.061814000000005,122.16617200000002,57.74924399999999,47.794905999999997,31.003740000000001,151.40411800000004,346.70253599999995,16.845501000000002,81.655457999999996,69.132130000000004]
[null,"OTHER",0.1401976782615541,3.5117826702718395E-2,0.52230445780324819,0,0.16876835085174,9.1238441289995281E-2,0.64766856635806558,6.6007577733482425E-2,0,0.22875610108838962,0.13093527485704981,0,0.13848572418768737,8.8081027806207551E-2,4.4629934776329212E-2,0.25718439002571725,0,1.7793808276558923E-2,4.4308333059146041E-2,0.32586250337835038,null,null,null,null,null,null,null,null,null,null,null,null,null,null,null,null,null,null,null,null,null,null,null,null,null,null,null,null,null,null,null,"OTHER",9.0912140000000008,2.2523499999999999,34.121912000000002,0,10.944876000000001,4.3560020000000002,31.010482,3.1114299999999999,0,10.944876000000001,2.3676059999999999,0,2.3676059999999999,1.4951639999999999,0.75718600000000003,41.955358000000004,0,0.75718600000000003,1.4951639999999999,12.202644000000001]
[null,null,null,null,null,null,null,null,null,null,null,null,null,null,null,null,null,null,null,null,null,null,null,null,null,null,null,null,null,null,null,null,null,null,null,null,null,null,null,null,null,null,null,null,null,null,null,null,null,null,null,null,null,"Total",6484.5681559999493,6413.6941590000224,6532.9543890000086,6485.7573920000068,6485.1472120000035,4774.3055870000444,4788.017145000018,4713.7466740000109,4834.137038000008,4784.517636000005,1808.2262419999979,1595.4572100000009,1709.6390360000019,1697.4870040000005,1696.587735999999,16313.337678000078,4714.274459000022,4255.3341489999984,3374.4532839999747,3744.7217379999784]
[]
[]
[]
[]
[]
[]
[]
[]
[]
[]
[]
[]
[]
[]
[]
[]
[]
[]
[]
[]
[]
[]
[]
[]
[]
[]
[]
[]
[]
[]
[]
[]
[]
[]
[]
[]
[]
[]
[]
[]
[]
[]
[]
[]
[]
[]
[]
[]
[]
[{"$f":"A1026","v":"Gabon"}]
[{"$f":"A1034","v":"2000"}]
["Access to hygiene facilities "]
[" by wealth quintile and sub-national region"]
["Notes:"]
["WHO/UNICEF JMP customised wealth index excludes water,"]
[" sanitation and hygiene assets."]
["Survey used for analysis:",{"$f":"A1025","v":"DHS00"}]
[]
[]
[]
[]
["Access to handwashing",null,"NATIONAL wealth index quintile",null,null,null,null,"URBAN wealth index quintile",null,null,null,null,"RURAL wealth index quintile",null,null,null,null,"SUB-REGIONS:",null,null,null,null,null,null,null,null,null,null,null,null,null,null,null,null,null,null,null,null,null,null,null,null,null,null,null,null,null,null,null,null,null,null,"Raw numbers of respondents:","Access to handwashing","NATIONAL wealth index quintile",null,null,null,null,"URBAN wealth index quintile",null,null,null,null,"RURAL wealth index quintile",null,null,null,null,"SUB-REGIONS:"]
["Weighted percentage (used in graphs)",null,"Poorest","Poor","Middle","Rich","Richest","Poorest","Poor","Middle","Rich","Richest","Poorest","Poor","Middle","Rich","Richest","Big cities","East (Haut-Ogoou‚ & Ogoou‚-Lolo)","North (Ogoou‚-Ivindo & Woleu-Ntem)","South (Ngouni‚, Nyanga)","West (Estuaire, Moyen-Ogoou‚ & Ogoou‚-maritime)",null,null,null,null,null,null,null,null,null,null,null,null,null,null,null,null,null,null,null,null,null,null,null,null,null,null,null,null,null,null,"Hygiene data, raw numbers (weighted)",null,"Poorest","Poor","Middle","Rich","Richest","Poorest","Poor","Middle","Rich","Richest","Poorest","Poor","Middle","Rich","Richest","Big cities","East (Haut-Ogoou‚ & Ogoou‚-Lolo)","North (Ogoou‚-Ivindo & Woleu-Ntem)","South (Ngouni‚, Nyanga)","West (Estuaire, Moyen-Ogoou‚ & Ogoou‚-maritime)"]
["Hygiene ladder","Basic","N/A","N/A","N/A","N/A","N/A","N/A","N/A","N/A","N/A","N/A","N/A","N/A","N/A","N/A","N/A","N/A","N/A","N/A","N/A","N/A",null,null,null,null,null,null,null,null,null,null,null,null,null,null,null,null,null,null,null,null,null,null,null,null,null,null,null,null,null,null,"Hygiene ladder","Basic","N/A","N/A","N/A","N/A","N/A","N/A","N/A","N/A","N/A","N/A","N/A","N/A","N/A","N/A","N/A","N/A","N/A","N/A","N/A","N/A"]
[null,"Limited","N/A","N/A","N/A","N/A","N/A","N/A","N/A","N/A","N/A","N/A","N/A","N/A","N/A","N/A","N/A","N/A","N/A","N/A","N/A","N/A",null,null,null,null,null,null,null,null,null,null,null,null,null,null,null,null,null,null,null,null,null,null,null,null,null,null,null,null,null,null,null,"Limited","N/A","N/A","N/A","N/A","N/A","N/A","N/A","N/A","N/A","N/A","N/A","N/A","N/A","N/A","N/A","N/A","N/A","N/A","N/A","N/A"]
[null,"No facility","N/A","N/A","N/A","N/A","N/A","N/A","N/A","N/A","N/A","N/A","N/A","N/A","N/A","N/A","N/A","N/A","N/A","N/A","N/A","N/A",null,null,null,null,null,null,null,null,null,null,null,null,null,null,null,null,null,null,null,null,null,null,null,null,null,null,null,null,null,null,null,"No facility","N/A","N/A","N/A","N/A","N/A","N/A","N/A","N/A","N/A","N/A","N/A","N/A","N/A","N/A","N/A","N/A","N/A","N/A","N/A","N/A"]
[null,null,null,null,null,null,null,null,null,null,null,null,null,null,null,null,null,null,null,null,null,null,null,null,null,null,null,null,null,null,null,null,null,null,null,null,null,null,null,null,null,null,null,null,null,null,null,null,null,null,null,null,"Observed handwashing place","Fixed","N/A","N/A","N/A","N/A","N/A","N/A","N/A","N/A","N/A","N/A","N/A","N/A","N/A","N/A","N/A","N/A","N/A","N/A","N/A","N/A"]
[null,null,null,null,null,null,null,null,null,null,null,null,null,null,null,null,null,null,null,null,null,null,null,null,null,null,null,null,null,null,null,null,null,null,null,null,null,null,null,null,null,null,null,null,null,null,null,null,null,null,null,null,null,"Mobile","N/A","N/A","N/A","N/A","N/A","N/A","N/A","N/A","N/A","N/A","N/A","N/A","N/A","N/A","N/A","N/A","N/A","N/A","N/A","N/A"]
[null,null,null,null,null,null,null,null,null,null,null,null,null,null,null,null,null,null,null,null,null,null,null,null,null,null,null,null,null,null,null,null,null,null,null,null,null,null,null,null,null,null,null,null,null,null,null,null,null,null,null,null,"Water / Soap","Water and soap","N/A","N/A","N/A","N/A","N/A","N/A","N/A","N/A","N/A","N/A","N/A","N/A","N/A","N/A","N/A","N/A","N/A","N/A","N/A","N/A"]
[null,null,null,null,null,null,null,null,null,null,null,null,null,null,null,null,null,null,null,null,null,null,null,null,null,null,null,null,null,null,null,null,null,null,null,null,null,null,null,null,null,null,null,null,null,null,null,null,null,null,null,null,null,"Water only","N/A","N/A","N/A","N/A","N/A","N/A","N/A","N/A","N/A","N/A","N/A","N/A","N/A","N/A","N/A","N/A","N/A","N/A","N/A","N/A"]
[null,null,null,null,null,null,null,null,null,null,null,null,null,null,null,null,null,null,null,null,null,null,null,null,null,null,null,null,null,null,null,null,null,null,null,null,null,null,null,null,null,null,null,null,null,null,null,null,null,null,null,null,null,"Soap only","N/A","N/A","N/A","N/A","N/A","N/A","N/A","N/A","N/A","N/A","N/A","N/A","N/A","N/A","N/A","N/A","N/A","N/A","N/A","N/A"]
[null,null,null,null,null,null,null,null,null,null,null,null,null,null,null,null,null,null,null,null,null,null,null,null,null,null,null,null,null,null,null,null,null,null,null,null,null,null,null,null,null,null,null,null,null,null,null,null,null,null,null,null,null,"Neither","N/A","N/A","N/A","N/A","N/A","N/A","N/A","N/A","N/A","N/A","N/A","N/A","N/A","N/A","N/A","N/A","N/A","N/A","N/A","N/A"]
[]
[]
[]
[]
[]
[]
[]
[]
[]
[]
[]
[]
[]
[]
[]
[]
[]
[]
[]
[]
[]
[]
[]
[]
[]
[]
[]
[]
[null,null,null,null,null,null,null,null,null,null,null,null,null,null,null,null,null,null,null,null,null,null,null,null,null,null,null,null,null,null,null,null,null,null,null,null,null,null,null,null,null,null,null,null,null,null,null,null,null,null,null,null,"Raw numbers of respondents:","Menstrual health and hygiene","NATIONAL wealth index quintile",null,null,null,null,"URBAN wealth index quintile",null,null,null,null,"RURAL wealth index quintile",null,null,null,null,"SUB-REGIONS:"]
[null,null,null,null,null,null,null,null,null,null,null,null,null,null,null,null,null,null,null,null,null,null,null,null,null,null,null,null,null,null,null,null,null,null,null,null,null,null,null,null,null,null,null,null,null,null,null,null,null,null,null,null,"MHH data, raw numbers (weighted)",null,"Poorest","Poor","Middle","Rich","Richest","Poorest","Poor","Middle","Rich","Richest","Poorest","Poor","Middle","Rich","Richest","Big cities","East (Haut-Ogoou‚ & Ogoou‚-Lolo)","North (Ogoou‚-Ivindo & Woleu-Ntem)","South (Ngouni‚, Nyanga)","West (Estuaire, Moyen-Ogoou‚ & Ogoou‚-maritime)"]
[null,null,null,null,null,null,null,null,null,null,null,null,null,null,null,null,null,null,null,null,null,null,null,null,null,null,null,null,null,null,null,null,null,null,null,null,null,null,null,null,null,null,null,null,null,null,null,null,null,null,null,null,"Private place to wash and change","Yes","N/A","N/A","N/A","N/A","N/A","N/A","N/A","N/A","N/A","N/A","N/A","N/A","N/A","N/A","N/A","N/A","N/A","N/A","N/A","N/A"]
[null,null,null,null,null,null,null,null,null,null,null,null,null,null,null,null,null,null,null,null,null,null,null,null,null,null,null,null,null,null,null,null,null,null,null,null,null,null,null,null,null,null,null,null,null,null,null,null,null,null,null,null,null,"No","N/A","N/A","N/A","N/A","N/A","N/A","N/A","N/A","N/A","N/A","N/A","N/A","N/A","N/A","N/A","N/A","N/A","N/A","N/A","N/A"]
[null,null,null,null,null,null,null,null,null,null,null,null,null,null,null,null,null,null,null,null,null,null,null,null,null,null,null,null,null,null,null,null,null,null,null,null,null,null,null,null,null,null,null,null,null,null,null,null,null,null,null,null,null,"DK/not sure/missing","N/A","N/A","N/A","N/A","N/A","N/A","N/A","N/A","N/A","N/A","N/A","N/A","N/A","N/A","N/A","N/A","N/A","N/A","N/A","N/A"]
[null,null,null,null,null,null,null,null,null,null,null,null,null,null,null,null,null,null,null,null,null,null,null,null,null,null,null,null,null,null,null,null,null,null,null,null,null,null,null,null,null,null,null,null,null,null,null,null,null,null,null,null,"Use of menstrual materials","Materials reusable","N/A","N/A","N/A","N/A","N/A","N/A","N/A","N/A","N/A","N/A","N/A","N/A","N/A","N/A","N/A","N/A","N/A","N/A","N/A","N/A"]
[null,null,null,null,null,null,null,null,null,null,null,null,null,null,null,null,null,null,null,null,null,null,null,null,null,null,null,null,null,null,null,null,null,null,null,null,null,null,null,null,null,null,null,null,null,null,null,null,null,null,null,null,null,"Materials not reusable","N/A","N/A","N/A","N/A","N/A","N/A","N/A","N/A","N/A","N/A","N/A","N/A","N/A","N/A","N/A","N/A","N/A","N/A","N/A","N/A"]
[null,null,null,null,null,null,null,null,null,null,null,null,null,null,null,null,null,null,null,null,null,null,null,null,null,null,null,null,null,null,null,null,null,null,null,null,null,null,null,null,null,null,null,null,null,null,null,null,null,null,null,null,null,"No materials used","N/A","N/A","N/A","N/A","N/A","N/A","N/A","N/A","N/A","N/A","N/A","N/A","N/A","N/A","N/A","N/A","N/A","N/A","N/A","N/A"]
[null,null,null,null,null,null,null,null,null,null,null,null,null,null,null,null,null,null,null,null,null,null,null,null,null,null,null,null,null,null,null,null,null,null,null,null,null,null,null,null,null,null,null,null,null,null,null,null,null,null,null,null,null,"DK/not sure/missing","N/A","N/A","N/A","N/A","N/A","N/A","N/A","N/A","N/A","N/A","N/A","N/A","N/A","N/A","N/A","N/A","N/A","N/A","N/A","N/A"]
[null,null,null,null,null,null,null,null,null,null,null,null,null,null,null,null,null,null,null,null,null,null,null,null,null,null,null,null,null,null,null,null,null,null,null,null,null,null,null,null,null,null,null,null,null,null,null,null,null,null,null,null,"Use of menstrual materials with private place to wash and change","Materials reusable","N/A","N/A","N/A","N/A","N/A","N/A","N/A","N/A","N/A","N/A","N/A","N/A","N/A","N/A","N/A","N/A","N/A","N/A","N/A","N/A"]
[null,null,null,null,null,null,null,null,null,null,null,null,null,null,null,null,null,null,null,null,null,null,null,null,null,null,null,null,null,null,null,null,null,null,null,null,null,null,null,null,null,null,null,null,null,null,null,null,null,null,null,null,null,"Materials not reusable","N/A","N/A","N/A","N/A","N/A","N/A","N/A","N/A","N/A","N/A","N/A","N/A","N/A","N/A","N/A","N/A","N/A","N/A","N/A","N/A"]
[null,null,null,null,null,null,null,null,null,null,null,null,null,null,null,null,null,null,null,null,null,null,null,null,null,null,null,null,null,null,null,null,null,null,null,null,null,null,null,null,null,null,null,null,null,null,null,null,null,null,null,null,null,"No materials used","N/A","N/A","N/A","N/A","N/A","N/A","N/A","N/A","N/A","N/A","N/A","N/A","N/A","N/A","N/A","N/A","N/A","N/A","N/A","N/A"]
[null,null,null,null,null,null,null,null,null,null,null,null,null,null,null,null,null,null,null,null,null,null,null,null,null,null,null,null,null,null,null,null,null,null,null,null,null,null,null,null,null,null,null,null,null,null,null,null,null,null,null,null,"Awareness of menstruation before menarche","Yes","N/A","N/A","N/A","N/A","N/A","N/A","N/A","N/A","N/A","N/A","N/A","N/A","N/A","N/A","N/A","N/A","N/A","N/A","N/A","N/A"]
[null,null,null,null,null,null,null,null,null,null,null,null,null,null,null,null,null,null,null,null,null,null,null,null,null,null,null,null,null,null,null,null,null,null,null,null,null,null,null,null,null,null,null,null,null,null,null,null,null,null,null,null,null,"No","N/A","N/A","N/A","N/A","N/A","N/A","N/A","N/A","N/A","N/A","N/A","N/A","N/A","N/A","N/A","N/A","N/A","N/A","N/A","N/A"]
[null,null,null,null,null,null,null,null,null,null,null,null,null,null,null,null,null,null,null,null,null,null,null,null,null,null,null,null,null,null,null,null,null,null,null,null,null,null,null,null,null,null,null,null,null,null,null,null,null,null,null,null,null,"DK/not sure/missing","N/A","N/A","N/A","N/A","N/A","N/A","N/A","N/A","N/A","N/A","N/A","N/A","N/A","N/A","N/A","N/A","N/A","N/A","N/A","N/A"]
[null,null,null,null,null,null,null,null,null,null,null,null,null,null,null,null,null,null,null,null,null,null,null,null,null,null,null,null,null,null,null,null,null,null,null,null,null,null,null,null,null,null,null,null,null,null,null,null,null,null,null,null,"Participation in (all) activities during menstruation","Yes","N/A","N/A","N/A","N/A","N/A","N/A","N/A","N/A","N/A","N/A","N/A","N/A","N/A","N/A","N/A","N/A","N/A","N/A","N/A","N/A"]
[null,null,null,null,null,null,null,null,null,null,null,null,null,null,null,null,null,null,null,null,null,null,null,null,null,null,null,null,null,null,null,null,null,null,null,null,null,null,null,null,null,null,null,null,null,null,null,null,null,null,null,null,null,"No","N/A","N/A","N/A","N/A","N/A","N/A","N/A","N/A","N/A","N/A","N/A","N/A","N/A","N/A","N/A","N/A","N/A","N/A","N/A","N/A"]
[null,null,null,null,null,null,null,null,null,null,null,null,null,null,null,null,null,null,null,null,null,null,null,null,null,null,null,null,null,null,null,null,null,null,null,null,null,null,null,null,null,null,null,null,null,null,null,null,null,null,null,null,null,"DK/not sure/missing/no such activity","N/A","N/A","N/A","N/A","N/A","N/A","N/A","N/A","N/A","N/A","N/A","N/A","N/A","N/A","N/A","N/A","N/A","N/A","N/A","N/A"]
[null,null,null,null,null,null,null,null,null,null,null,null,null,null,null,null,null,null,null,null,null,null,null,null,null,null,null,null,null,null,null,null,null,null,null,null,null,null,null,null,null,null,null,null,null,null,null,null,null,null,null,null,"Participation in specific activities during menstruation","Did not go to school (amongst those usually attending school)","N/A","N/A","N/A","N/A","N/A","N/A","N/A","N/A","N/A","N/A","N/A","N/A","N/A","N/A","N/A","N/A","N/A","N/A","N/A","N/A"]
[null,null,null,null,null,null,null,null,null,null,null,null,null,null,null,null,null,null,null,null,null,null,null,null,null,null,null,null,null,null,null,null,null,null,null,null,null,null,null,null,null,null,null,null,null,null,null,null,null,null,null,null,null,"Did not go to work (amongst those who usually work)","N/A","N/A","N/A","N/A","N/A","N/A","N/A","N/A","N/A","N/A","N/A","N/A","N/A","N/A","N/A","N/A","N/A","N/A","N/A","N/A"]
[null,null,null,null,null,null,null,null,null,null,null,null,null,null,null,null,null,null,null,null,null,null,null,null,null,null,null,null,null,null,null,null,null,null,null,null,null,null,null,null,null,null,null,null,null,null,null,null,null,null,null,null,null,"Did not participate in social activities","N/A","N/A","N/A","N/A","N/A","N/A","N/A","N/A","N/A","N/A","N/A","N/A","N/A","N/A","N/A","N/A","N/A","N/A","N/A","N/A"]
[null,null,null,null,null,null,null,null,null,null,null,null,null,null,null,null,null,null,null,null,null,null,null,null,null,null,null,null,null,null,null,null,null,null,null,null,null,null,null,null,null,null,null,null,null,null,null,null,null,null,null,null,null,"Did not cook food","N/A","N/A","N/A","N/A","N/A","N/A","N/A","N/A","N/A","N/A","N/A","N/A","N/A","N/A","N/A","N/A","N/A","N/A","N/A","N/A"]
[null,null,null,null,null,null,null,null,null,null,null,null,null,null,null,null,null,null,null,null,null,null,null,null,null,null,null,null,null,null,null,null,null,null,null,null,null,null,null,null,null,null,null,null,null,null,null,null,null,null,null,null,null,"Did not eat with others","N/A","N/A","N/A","N/A","N/A","N/A","N/A","N/A","N/A","N/A","N/A","N/A","N/A","N/A","N/A","N/A","N/A","N/A","N/A","N/A"]
[null,null,null,null,null,null,null,null,null,null,null,null,null,null,null,null,null,null,null,null,null,null,null,null,null,null,null,null,null,null,null,null,null,null,null,null,null,null,null,null,null,null,null,null,null,null,null,null,null,null,null,null,null,"Did not bathe in regular place","N/A","N/A","N/A","N/A","N/A","N/A","N/A","N/A","N/A","N/A","N/A","N/A","N/A","N/A","N/A","N/A","N/A","N/A","N/A","N/A"]
[null,null,null,null,null,null,null,null,null,null,null,null,null,null,null,null,null,null,null,null,null,null,null,null,null,null,null,null,null,null,null,null,null,null,null,null,null,null,null,null,null,null,null,null,null,null,null,null,null,null,null,null,null,"Did not participate in other activities","N/A","N/A","N/A","N/A","N/A","N/A","N/A","N/A","N/A","N/A","N/A","N/A","N/A","N/A","N/A","N/A","N/A","N/A","N/A","N/A"]
[null,null,null,null,null,null,null,null,null,null,null,null,null,null,null,null,null,null,null,null,null,null,null,null,null,null,null,null,null,null,null,null,null,null,null,null,null,null,null,null,null,null,null,null,null,null,null,null,null,null,null,null,null,"DK/not sure/missing/no such activity","N/A","N/A","N/A","N/A","N/A","N/A","N/A","N/A","N/A","N/A","N/A","N/A","N/A","N/A","N/A","N/A","N/A","N/A","N/A","N/A"]
[]
[]
[]
[]
[]
[]
[]
[]
[]
[]
[]
[]
[]
[]
[]
[]
[]
[]
[]
[]
[]
[]
[]
[]
[]
[]
[]
[]
[]
[]
[]
[]
[]
[]
[]
[]
[]
[]
[]
[]
[]
[]
[]
[]
[]
[]
[]
[]
[]
[]
[]
[]
[]
[]
[null,null,null,null,null,null,null,null,null,null,null,null,null,null,null,null,null,null,null,null,null,null,null,null,null,null,null,null,null,null,null,null,null,null,null,null,null,null,null,null,null,null,null,null,null,null,null,null,null,null,null,null,"Raw numbers of respondents:","Basic water, sanitation and hygiene","NATIONAL wealth index quintile",null,null,null,null,"URBAN wealth index quintile",null,null,null,null,"RURAL wealth index quintile",null,null,null,null,"SUB-REGIONS:"]
[null,null,null,null,null,null,null,null,null,null,null,null,null,null,null,null,null,null,null,null,null,null,null,null,null,null,null,null,null,null,null,null,null,null,null,null,null,null,null,null,null,null,null,null,null,null,null,null,null,null,null,null,"WatSan data, raw numbers (weighted)",null,"Poorest","Poor","Middle","Rich","Richest","Poorest","Poor","Middle","Rich","Richest","Poorest","Poor","Middle","Rich","Richest","Big cities","East (Haut-Ogoou‚ & Ogoou‚-Lolo)","North (Ogoou‚-Ivindo & Woleu-Ntem)","South (Ngouni‚, Nyanga)","West (Estuaire, Moyen-Ogoou‚ & Ogoou‚-maritime)"]
[null,null,null,null,null,null,null,null,null,null,null,null,null,null,null,null,null,null,null,null,null,null,null,null,null,null,null,null,null,null,null,null,null,null,null,null,null,null,null,null,null,null,null,null,null,null,null,null,null,null,null,null,"Use of Basic Water Sanitation and Hygiene","Yes","N/A","N/A","N/A","N/A","N/A","N/A","N/A","N/A","N/A","N/A","N/A","N/A","N/A","N/A","N/A","N/A","N/A","N/A","N/A","N/A"]
[null,null,null,null,null,null,null,null,null,null,null,null,null,null,null,null,null,null,null,null,null,null,null,null,null,null,null,null,null,null,null,null,null,null,null,null,null,null,null,null,null,null,null,null,null,null,null,null,null,null,null,null,null,"No","N/A","N/A","N/A","N/A","N/A","N/A","N/A","N/A","N/A","N/A","N/A","N/A","N/A","N/A","N/A","N/A","N/A","N/A","N/A","N/A"]
[null,null,null,null,null,null,null,null,null,null,null,null,null,null,null,null,null,null,null,null,null,null,null,null,null,null,null,null,null,null,null,null,null,null,null,null,null,null,null,null,null,null,null,null,null,null,null,null,null,null,null,null,"Use of Basic Water and Sanitation","Yes","N/A","N/A","N/A","N/A","N/A","N/A","N/A","N/A","N/A","N/A","N/A","N/A","N/A","N/A","N/A","N/A","N/A","N/A","N/A","N/A"]
[null,null,null,null,null,null,null,null,null,null,null,null,null,null,null,null,null,null,null,null,null,null,null,null,null,null,null,null,null,null,null,null,null,null,null,null,null,null,null,null,null,null,null,null,null,null,null,null,null,null,null,null,null,"No","N/A","N/A","N/A","N/A","N/A","N/A","N/A","N/A","N/A","N/A","N/A","N/A","N/A","N/A","N/A","N/A","N/A","N/A","N/A","N/A"]
[null,null,null,null,null,null,null,null,null,null,null,null,null,null,null,null,null,null,null,null,null,null,null,null,null,null,null,null,null,null,null,null,null,null,null,null,null,null,null,null,null,null,null,null,null,null,null,null,null,null,null,null,"Use of Basic Water and Hygiene","Yes","N/A","N/A","N/A","N/A","N/A","N/A","N/A","N/A","N/A","N/A","N/A","N/A","N/A","N/A","N/A","N/A","N/A","N/A","N/A","N/A"]
[null,null,null,null,null,null,null,null,null,null,null,null,null,null,null,null,null,null,null,null,null,null,null,null,null,null,null,null,null,null,null,null,null,null,null,null,null,null,null,null,null,null,null,null,null,null,null,null,null,null,null,null,null,"No","N/A","N/A","N/A","N/A","N/A","N/A","N/A","N/A","N/A","N/A","N/A","N/A","N/A","N/A","N/A","N/A","N/A","N/A","N/A","N/A"]
[null,null,null,null,null,null,null,null,null,null,null,null,null,null,null,null,null,null,null,null,null,null,null,null,null,null,null,null,null,null,null,null,null,null,null,null,null,null,null,null,null,null,null,null,null,null,null,null,null,null,null,null,"Use of Basic Sanitation and Hygiene","Yes","N/A","N/A","N/A","N/A","N/A","N/A","N/A","N/A","N/A","N/A","N/A","N/A","N/A","N/A","N/A","N/A","N/A","N/A","N/A","N/A"]
[null,null,null,null,null,null,null,null,null,null,null,null,null,null,null,null,null,null,null,null,null,null,null,null,null,null,null,null,null,null,null,null,null,null,null,null,null,null,null,null,null,null,null,null,null,null,null,null,null,null,null,null,null,"No","N/A","N/A","N/A","N/A","N/A","N/A","N/A","N/A","N/A","N/A","N/A","N/A","N/A","N/A","N/A","N/A","N/A","N/A","N/A","N/A"]
[null,null,null,null,null,null,null,null,null,null,null,null,null,null,null,null,null,null,null,null,null,null,null,null,null,null,null,null,null,null,null,null,null,null,null,null,null,null,null,null,null,null,null,null,null,null,null,null,null,null,null,null,"Use of Basic Water","Yes","N/A","N/A","N/A","N/A","N/A","N/A","N/A","N/A","N/A","N/A","N/A","N/A","N/A","N/A","N/A","N/A","N/A","N/A","N/A","N/A"]
[null,null,null,null,null,null,null,null,null,null,null,null,null,null,null,null,null,null,null,null,null,null,null,null,null,null,null,null,null,null,null,null,null,null,null,null,null,null,null,null,null,null,null,null,null,null,null,null,null,null,null,null,null,"No","N/A","N/A","N/A","N/A","N/A","N/A","N/A","N/A","N/A","N/A","N/A","N/A","N/A","N/A","N/A","N/A","N/A","N/A","N/A","N/A"]
[null,null,null,null,null,null,null,null,null,null,null,null,null,null,null,null,null,null,null,null,null,null,null,null,null,null,null,null,null,null,null,null,null,null,null,null,null,null,null,null,null,null,null,null,null,null,null,null,null,null,null,null,"Use of Basic Sanitation","Yes","N/A","N/A","N/A","N/A","N/A","N/A","N/A","N/A","N/A","N/A","N/A","N/A","N/A","N/A","N/A","N/A","N/A","N/A","N/A","N/A"]
[null,null,null,null,null,null,null,null,null,null,null,null,null,null,null,null,null,null,null,null,null,null,null,null,null,null,null,null,null,null,null,null,null,null,null,null,null,null,null,null,null,null,null,null,null,null,null,null,null,null,null,null,null,"No","N/A","N/A","N/A","N/A","N/A","N/A","N/A","N/A","N/A","N/A","N/A","N/A","N/A","N/A","N/A","N/A","N/A","N/A","N/A","N/A"]
[null,null,null,null,null,null,null,null,null,null,null,null,null,null,null,null,null,null,null,null,null,null,null,null,null,null,null,null,null,null,null,null,null,null,null,null,null,null,null,null,null,null,null,null,null,null,null,null,null,null,null,null,"Access to Basic Hygiene","Yes","N/A","N/A","N/A","N/A","N/A","N/A","N/A","N/A","N/A","N/A","N/A","N/A","N/A","N/A","N/A","N/A","N/A","N/A","N/A","N/A"]
[null,null,null,null,null,null,null,null,null,null,null,null,null,null,null,null,null,null,null,null,null,null,null,null,null,null,null,null,null,null,null,null,null,null,null,null,null,null,null,null,null,null,null,null,null,null,null,null,null,null,null,null,null,"No","N/A","N/A","N/A","N/A","N/A","N/A","N/A","N/A","N/A","N/A","N/A","N/A","N/A","N/A","N/A","N/A","N/A","N/A","N/A","N/A"]
[]
[]
[]
[]
[]
[]
[]
[]
[]
[]
[]
[]
[]
[]
[]
[]
[]
[]
[]
[]
[]
[]
[]
[]
[]
[]
[]
[]
[]
[]
[]
[]
[]
[]
[]
[]
[]
[]
[]
[]
[]
[]
[]
[]
[null,null,"INITIAL (national) Wealth Index",null,null,null,null,"URBAN Wealth Index",null,null,null,null,"RURAL Wealth Index"]
[null,null,"Component Matrix",null,null,null,null,"Component Matrix",null,null,null,null,"Component Matrix"]
[null,null,null,null,"Component",null,null,null,null,"Component",null,null,null,null,"Component"]
[null,"Note:\n\nThe INITIAL (national) Wealth Index is based on the first component of the Principal Component Analysis (PCA) which has been obtained at national level.\n\nThe final national-level (NATIONAL) Wealth Index is based on the URBAN and RURAL specific wealth indexes. Regression procedures are used to establish the relationships between the two sets of scores (urban and rural) and the initial (national) wealth factors.\nThis allows best use of the available information for each area and a better precision of the FINAL (NATIONAL) Wealth Index.\n\nFor dependency reasons, all WASH variables (contained in the generic MICS and DHS scripts) have been excluded from the sets of asset variables used in the PCAs.\n\nThe PCA can extracts as many components as there are asset variables in the input. Only the first of the components is used to represent the Wealth Index. \n\nThe scores represent the weights of the asset variables on the Wealth Index (correlations between the variables and the component).\n\nThe communalities are the proportion of each variable's variance that can be explained by the component.\n\nProportion of explained variance is the part of the model's total variance that is explained by the component.\n\nFor more information on the procedure used:\n\nThe DHS Wealth Index, DHS Comparative Reports No. 6, Shea Oscar Rutstein, Kiersten Johnson, ORC Macro International Inc., 2004.\n\nThe DHS Wealth Index: Approaches for Rural and Urban Areas, Shea O. Rutstein, ORC Macro International Inc., 2008.\n\nMICS Methodological Paper No. 4, Review of options for reporting water, sanitation and hygiene coverage by wealth quintile, UNICEF, 2016.",null,null,"1",null,null,null,null,"1",null,null,null,null,"1"]
[null,null,"Has television",null,0.75833141040058616,null,null,"if has corrigated iron sheet roofing",null,-0.72749571761417531,null,null,"if uses gas as cooking fuel",null,0.70989926711405449]
[null,null,"if uses gas as cooking fuel",null,0.74951370232744929,null,null,"if has corrigated iron sheet + ceiling roofing",null,0.69022732890706329,null,null,"Has refrigerator",null,0.69745094696389665]
[null,null,"Has refrigerator",null,0.74472074729510152,null,null,"Has refrigerator",null,0.65232882151713878,null,null,"Has television",null,0.69613729287249315]
[null,null,"if uses wood/straw as cooking fuel",null,-0.73207473575287907,null,null,"Has television",null,0.65133727011642462,null,null,"if has dirt, sand, dung as principal floor in dwelling",null,-0.69440887423084086]
[null,null,"Has electricity",null,0.72914486247671306,null,null,"if uses gas as cooking fuel",null,0.6099037076342686,null,null,"Has electricity",null,0.63666848955736111]
[null,null,"if has corrigated iron sheet + ceiling roofing",null,0.7209753882636103,null,null,"if uses wood/straw as cooking fuel",null,-0.58841724954971952,null,null,"if has corrigated iron sheet + ceiling roofing",null,0.62776358693808842]
[null,null,"if has dirt, sand, dung as principal floor in dwelling",null,-0.71817812276317627,null,null,"if has dirt, sand, dung as principal floor in dwelling",null,-0.57557046916231747,null,null,"if uses wood/straw as cooking fuel",null,-0.60222852357858192]
[null,null,"if has corrigated iron sheet roofing",null,-0.68436784828472608,null,null,"if has tiles for main flooring material",null,0.56781266449191437,null,null,"Has video",null,0.54125354715556317]
[null,null,"Has video",null,0.57791361103546368,null,null,"Has video",null,0.56184495309591109,null,null,"if has cement principal floor",null,0.5144580806300969]
[null,null,"Walls from breeze blocks/parpens/stones/cement",null,0.55232293432796709,null,null,"Has electricity",null,0.5575129413708374,null,null,"Walls from breeze blocks/parpens/stones/cement",null,0.51163505638593654]
[null,null,"if has tiles for main flooring material",null,0.51750576654507008,null,null,"Walls from breeze blocks/parpens/stones/cement",null,0.5211146935916513,null,null,"if has corrigated iron sheet roofing",null,-0.50973556406304066]
[null,null,"Has telephone",null,0.49496526643680644,null,null,"Has telephone",null,0.50881003362293864,null,null,"Has radio",null,0.40616234093593651]
[null,null,"Has radio",null,0.49354210980079494,null,null,"Has car",null,0.47359972791375288,null,null,"Walls from COB/DAUB/MUD/CLAY",null,-0.37752556971071155]
[null,null,"Has car",null,0.46531791462242372,null,null,"Has radio",null,0.46408064226359363,null,null,"Has car",null,0.3522078922182017]
[null,null,"Walls from COB/DAUB/MUD/CLAY",null,-0.41514805591627069,null,null,"if has wood, BRANCHES for walls",null,-0.43133006916659028,null,null,"Has telephone",null,0.33246164296609781]
[null,null,"if has wood, BRANCHES for walls",null,-0.25550330316738806,null,null,"Walls from COB/DAUB/MUD/CLAY",null,-0.29700114464759958,null,null,"if has tiles for main flooring material",null,0.3058450413101928]
[null,null,"if has cement principal floor",null,0.25427870534321911,null,null,"Has bicycle",null,0.2106538858435287,null,null,"if has LINO, GERFLEX as flooring material",null,0.28182780944414426]
[null,null,"Semihard/semifinished walls",null,0.25166477826997841,null,null,"Semihard/semifinished walls",null,0.19804912972490973,null,null,"if has other roofing",null,0.19802663000319459]
[null,null,"if has LINO, GERFLEX as flooring material",null,0.24479446393662599,null,null,"if has LINO, GERFLEX as flooring material",null,0.19753632434492116,null,null,"Semihard/semifinished walls",null,0.19763376014747278]
[null,null,"if has natural material roofing",null,-0.18698124575358316,null,null,"if uses coal/charcoal as cooking fuel",null,-0.19152884203032045,null,null,"if has wood, plank principal floor in dwelling",null,0.14496339327241717]
[null,null,"Has bicycle",null,0.17758327851784686,null,null,"if roof from concrete",null,0.15714918981354595,null,null,"if has natural material roofing",null,-0.12798719465613034]
[null,null,"Number of members per sleeping room",null,0.1672659717726544,null,null,"if has cement principal floor",null,-0.12867380418121693,null,null,"if has cane, palm, trunks for walls",null,-0.11038041139364621]
[null,null,"if roof from concrete",null,0.16724038367370084,null,null,"if uses electricity as cooking fuel",null,0.1193824952045084,null,null,"if uses electricity as cooking fuel",null,0.10704838706805263]
[null,null,"if uses coal/charcoal as cooking fuel",null,-0.1423030337237112,null,null,"if has natural material roofing",null,-9.6717371538477412E-2,null,null,"Number of members per sleeping room",null,0.10605032097891243]
[null,null,"if has cane, palm, trunks for walls",null,-0.13445963445190667,null,null,"if uses oil/kerosene as cooking fuel",null,-8.8300038582744184E-2,null,null,"if roof from concrete",null,0.10282109256316511]
[null,null,"if uses electricity as cooking fuel",null,0.12338503161430812,null,null,"Walls from plastic/carton/used metal sheet",null,-7.4954058555573896E-2,null,null,"if has ceramic/slate tiles for roof",null,7.6990378696327383E-2]
[null,null,"Has motorcycle",null,7.4022078134744415E-2,null,null,"if uses other cooking fuel",null,-7.0135236345372845E-2,null,null,"if has parquet or polished wood floors",null,7.4312501592624883E-2]
[null,null,"Walls from plastic/carton/used metal sheet",null,-6.6614087717918297E-2,null,null,"if has other material for walls",null,-6.8083389926017535E-2,null,null,"Powered boat",null,6.9397587127516577E-2]
[null,null,"Boat without engine",null,-5.7982015139062718E-2,null,null,"if has cane, palm, trunks for walls",null,-6.0879744121248927E-2,null,null,"Has bicycle",null,6.0997526206773039E-2]
[null,null,"Powered boat",null,5.4104487035018037E-2,null,null,"Has motorcycle",null,5.1388820505272319E-2,null,null,"Has motorcycle",null,5.022569234862527E-2]
[null,null,"if has ceramic/slate tiles for roof",null,4.5307067366472775E-2,null,null,"if has plastic/carton/used metal sheet roofing",null,-5.0454952328210824E-2,null,null,"Walls from plastic/carton/used metal sheet",null,-4.8252077768848295E-2]
[null,null,"if has other roofing",null,4.1974109199828975E-2,null,null,"Number of members per sleeping room",null,4.4189221745859604E-2,null,null,"if uses oil/kerosene as cooking fuel",null,3.3279495105417792E-2]
[null,null,"if has other material for walls",null,-3.2310124332434367E-2,null,null,"if has ceramic/slate tiles for roof",null,4.3440052070740399E-2,null,null,"if has other material for walls",null,3.3053763151729802E-2]
[null,null,"if uses oil/kerosene as cooking fuel",null,2.9887290958820298E-2,null,null,"Powered boat",null,4.0428497008683936E-2,null,null,"Boat without engine",null,3.2619944114147113E-2]
[null,null,"if has plastic/carton/used metal sheet roofing",null,-2.6571748358787558E-2,null,null,"if has other roofing",null,3.9890686456397262E-2,null,null,"if uses other cooking fuel",null,2.1446146978730315E-2]
[null,null,"if uses other cooking fuel",null,2.6468796327766261E-2,null,null,"Boat without engine",null,-3.2726691465373228E-2,null,null,"if has plastic/carton/used metal sheet roofing",null,-1.784414388620113E-2]
[null,null,"if has wood, plank principal floor in dwelling",null,-2.1674142620094997E-2,null,null,"if has wood, plank principal floor in dwelling",null,-3.2429957078882951E-2,null,null,"if uses coal/charcoal as cooking fuel",null,-1.6803603596842798E-2]
[null,null,"if has parquet or polished wood floors",null,1.0243237933928803E-2,null,null,"if has other type of flooring",null,2.2957721471149238E-2,null,null,"if has other type of flooring",null,1.017253788686898E-2]
[null,null,"if has other type of flooring",null,8.0917964559902179E-3,null,null,"if has parquet or polished wood floors",null,-2.869388418593155E-3,null,null,"if has wood, BRANCHES for walls",null,-4.5409516502740235E-3]
[]
[]
[]
[null,null,"Communalities",null,null,null,null,"Communalities",null,null,null,null,"Communalities"]
[null,null,null,null,"Extraction",null,null,null,null,"Extraction",null,null,null,null,"Extraction"]
[null,null,"Has electricity",null,0.53165223047618482,null,null,"Has electricity",null,0.31082067979596278,null,null,"Has electricity",null,0.40534676559525162]
[null,null,"Has radio",null,0.24358381414661992,null,null,"Has radio",null,0.21537084252378957,null,null,"Has radio",null,0.16496784719455992]
[null,null,"Has television",null,0.57506652800014224,null,null,"Has television",null,0.42424023944271627,null,null,"Has television",null,0.48460713052784332]
[null,null,"Has refrigerator",null,0.55460899145177445,null,null,"Has refrigerator",null,0.42553289138193912,null,null,"Has refrigerator",null,0.48643782342083619]
[null,null,"Has bicycle",null,3.1535820809147172E-2,null,null,"Has bicycle",null,4.4375059620978423E-2,null,null,"Has bicycle",null,3.7206982033459639E-3]
[null,null,"Has motorcycle",null,5.4792680513862076E-3,null,null,"Has motorcycle",null,2.6408108729230966E-3,null,null,"Has motorcycle",null,2.5226201718987549E-3]
[null,null,"Has car",null,0.21652076166856121,null,null,"Has car",null,0.22429670227998075,null,null,"Has car",null,0.12405039934078839]
[null,null,"Has telephone",null,0.2449906149788588,null,null,"Has telephone",null,0.25888765031537597,null,null,"Has telephone",null,0.1105307440437171]
[null,null,"Has video",null,0.33398414182004921,null,null,"Has video",null,0.31566975131934655,null,null,"Has video",null,0.29295540230847944]
[null,null,"Boat without engine",null,3.3619140795864981E-3,null,null,"Boat without engine",null,1.0710363342697328E-3,null,null,"Boat without engine",null,1.0640607540100809E-3]
[null,null,"Powered boat",null,2.9272955173224348E-3,null,null,"Powered boat",null,1.6344633703811659E-3,null,null,"Powered boat",null,4.8160250991212544E-3]
[null,null,"Number of members per sleeping room",null,2.7977905313050416E-2,null,null,"Number of members per sleeping room",null,1.9526873185047513E-3,null,null,"Number of members per sleeping room",null,1.1246670579730353E-2]
[null,null,"if has dirt, sand, dung as principal floor in dwelling",null,0.51577981601563994,null,null,"if has dirt, sand, dung as principal floor in dwelling",null,0.33128136497173022,null,null,"if has dirt, sand, dung as principal floor in dwelling",null,0.48220368461054375]
[null,null,"if has wood, plank principal floor in dwelling",null,4.6976845831621838E-4,null,null,"if has wood, plank principal floor in dwelling",null,1.0517021161381905E-3,null,null,"if has wood, plank principal floor in dwelling",null,2.1014385389053484E-2]
[null,null,"if has parquet or polished wood floors",null,1.0492392337107802E-4,null,null,"if has parquet or polished wood floors",null,8.2333898967565271E-6,null,null,"if has parquet or polished wood floors",null,5.5223478929538761E-3]
[null,null,"if has tiles for main flooring material",null,0.26781221840740055,null,null,"if has tiles for main flooring material",null,0.32241122195740729,null,null,"if has tiles for main flooring material",null,9.3541189294033544E-2]
[null,null,"if has LINO, GERFLEX as flooring material",null,5.992432957402008E-2,null,null,"if has LINO, GERFLEX as flooring material",null,3.9020599435701894E-2,null,null,"if has LINO, GERFLEX as flooring material",null,7.9426914176084884E-2]
[null,null,"if has cement principal floor",null,6.4657659991023644E-2,null,null,"if has cement principal floor",null,1.6556947882466162E-2,null,null,"if has cement principal floor",null,0.26466711672560328]
[null,null,"if has other type of flooring",null,6.5477169885175856E-5,null,null,"if has other type of flooring",null,5.2705697514686671E-4,null,null,"if has other type of flooring",null,1.0348052705978481E-4]
[null,null,"if has cane, palm, trunks for walls",null,1.8079393296940367E-2,null,null,"if has cane, palm, trunks for walls",null,3.7063432442687432E-3,null,null,"if has cane, palm, trunks for walls",null,1.2183835219430582E-2]
[null,null,"Walls from plastic/carton/used metal sheet",null,4.4374366824905132E-3,null,null,"Walls from plastic/carton/used metal sheet",null,5.6181108939524008E-3,null,null,"Walls from plastic/carton/used metal sheet",null,2.3282630090109839E-3]
[null,null,"Walls from COB/DAUB/MUD/CLAY",null,0.17234790833105901,null,null,"Walls from COB/DAUB/MUD/CLAY",null,8.8209679921984363E-2,null,null,"Walls from COB/DAUB/MUD/CLAY",null,0.14252555578539733]
[null,null,"if has wood, BRANCHES for walls",null,6.5281937929446213E-2,null,null,"if has wood, BRANCHES for walls",null,0.18604562856725557,null,null,"if has wood, BRANCHES for walls",null,2.0620241890126377E-5]
[null,null,"Semihard/semifinished walls",null,6.3335160621677392E-2,null,null,"Semihard/semifinished walls",null,3.9223457784794122E-2,null,null,"Semihard/semifinished walls",null,3.90591031500288E-2]
[null,null,"Walls from breeze blocks/parpens/stones/cement",null,0.30506062378465582,null,null,"Walls from breeze blocks/parpens/stones/cement",null,0.2715605238771206,null,null,"Walls from breeze blocks/parpens/stones/cement",null,0.26177043092304048]
[null,null,"if has other material for walls",null,1.0439441343773673E-3,null,null,"if has other material for walls",null,4.6353479838181456E-3,null,null,"if has other material for walls",null,1.092551258490651E-3]
[null,null,"if has natural material roofing",null,3.496198626356186E-2,null,null,"if has natural material roofing",null,9.3542499573118811E-3,null,null,"if has natural material roofing",null,1.6380721995946198E-2]
[null,null,"if has plastic/carton/used metal sheet roofing",null,7.0605781084272928E-4,null,null,"if has plastic/carton/used metal sheet roofing",null,2.545702214442027E-3,null,null,"if has plastic/carton/used metal sheet roofing",null,3.1841347103144917E-4]
[null,null,"if has corrigated iron sheet roofing",null,0.46835935176586585,null,null,"if has corrigated iron sheet roofing",null,0.5292500191469639,null,null,"if has corrigated iron sheet roofing",null,0.25983034527066623]
[null,null,"if has corrigated iron sheet + ceiling roofing",null,0.51980551048186363,null,null,"if has corrigated iron sheet + ceiling roofing",null,0.47641376557017934,null,null,"if has corrigated iron sheet + ceiling roofing",null,0.39408712108537491]
[null,null,"if has ceramic/slate tiles for roof",null,2.0527303533501022E-3,null,null,"if has ceramic/slate tiles for roof",null,1.8870381239086372E-3,null,null,"if has ceramic/slate tiles for roof",null,5.9275184118039014E-3]
[null,null,"if roof from concrete",null,2.7969345931326661E-2,null,null,"if roof from concrete",null,2.4695867859053894E-2,null,null,"if roof from concrete",null,1.0572177075882969E-2]
[null,null,"if has other roofing",null,1.7618258431191674E-3,null,null,"if has other roofing",null,1.5912668659625959E-3,null,null,"if has other roofing",null,3.9214546190422125E-2]
[null,null,"if uses electricity as cooking fuel",null,1.5223866026463815E-2,null,null,"if uses electricity as cooking fuel",null,1.4252180161254471E-2,null,null,"if uses electricity as cooking fuel",null,1.1459357173871617E-2]
[null,null,"if uses gas as cooking fuel",null,0.56177078997660024,null,null,"if uses gas as cooking fuel",null,0.37198253258602737,null,null,"if uses gas as cooking fuel",null,0.50395696944907165]
[null,null,"if uses oil/kerosene as cooking fuel",null,8.9325016085718147E-4,null,null,"if uses oil/kerosene as cooking fuel",null,7.7968968137141111E-3,null,null,"if uses oil/kerosene as cooking fuel",null,1.1075247944715267E-3]
[null,null,"if uses coal/charcoal as cooking fuel",null,2.0250153406971685E-2,null,null,"if uses coal/charcoal as cooking fuel",null,3.6683297329475444E-2,null,null,"if uses coal/charcoal as cooking fuel",null,2.8236109383982823E-4]
[null,null,"if uses wood/straw as cooking fuel",null,0.53593341872764777,null,null,"if uses wood/straw as cooking fuel",null,0.34623485956765693,null,null,"if uses wood/straw as cooking fuel",null,0.36267919461163861]
[null,null,"if uses other cooking fuel",null,7.0059717904077273E-4,null,null,"if uses other cooking fuel",null,4.9189513772213084E-3,null,null,"if uses other cooking fuel",null,4.5993722023330343E-4]
[]
[]
[null,null,"Total Variance Explained",null,null,null,null,"Total Variance Explained",null,null,null,null,"Total Variance Explained"]
[null,null,"Component",null,"Extraction Sums of Squared Loadings",null,null,"Component",null,"Extraction Sums of Squared Loadings",null,null,"Component",null,"Extraction Sums of Squared Loadings"]
[null,null,null,null,"Total","% of Variance","Cumulative %",null,null,"Total","% of Variance","Cumulative %",null,null,"Total","% of Variance","Cumulative %"]
[null,null,"1",null,6.5004787685604981,16.667894278360251,16.667894278360251,"1",null,5.3639556611510226,13.753732464489801,13.753732464489801,"1",null,5.1040018532864577,13.087184239196045,13.087184239196045]
[]
[]
[null,null,"Component Score Coefficient Matrix",null,null,null,null,"Component Score Coefficient Matrix",null,null,null,null,"Component Score Coefficient Matrix"]
[null,null,null,null,"Component",null,null,null,null,"Component",null,null,null,null,"Component"]
[null,null,null,null,"1",null,null,null,null,"1",null,null,null,null,"1"]
[null,null,"Has electricity",null,0.11216787077333672,null,null,"Has electricity",null,0.10393690339550711,null,null,"Has electricity",null,0.12473907883622953]
[null,null,"Has radio",null,7.5923963045276974E-2,null,null,"Has radio",null,8.6518359132746636E-2,null,null,"Has radio",null,7.9577232260291855E-2]
[null,null,"Has television",null,0.11665777820369916,null,null,"Has television",null,0.12142853357901499,null,null,"Has television",null,0.13639048591337238]
[null,null,"Has refrigerator",null,0.11456398425558068,null,null,"Has refrigerator",null,0.12161338809000501,null,null,"Has refrigerator",null,0.13664786318892289]
[null,null,"Has bicycle",null,2.7318492197332699E-2,null,null,"Has bicycle",null,3.9272115422058801E-2,null,null,"Has bicycle",null,1.1950921641514853E-2]
[null,null,"Has motorcycle",null,1.1387173279105449E-2,null,null,"Has motorcycle",null,9.5803962134625581E-3,null,null,"Has motorcycle",null,9.8404533917410397E-3]
[null,null,"Has car",null,7.158209897906738E-2,null,null,"Has car",null,8.8292998270631792E-2,null,null,"Has car",null,6.9006223418868015E-2]
[null,null,"Has telephone",null,7.6142894094309022E-2,null,null,"Has telephone",null,9.4857240768794079E-2,null,null,"Has telephone",null,6.5137445581456122E-2]
[null,null,"Has video",null,8.8903237993874715E-2,null,null,"Has video",null,0.1047445185211221,null,null,"Has video",null,0.10604493546706904]
[null,null,"Boat without engine",null,-8.9196530291725824E-3,null,null,"Boat without engine",null,-6.1012233382910881E-3,null,null,"Boat without engine",null,6.3910525606771067E-3]
[null,null,"Powered boat",null,8.3231541800726817E-3,null,null,"Powered boat",null,7.5370677094688358E-3,null,null,"Powered boat",null,1.3596701004885333E-2]
[null,null,"Number of members per sleeping room",null,2.5731331141582155E-2,null,null,"Number of members per sleeping room",null,8.2381780419820382E-3,null,null,"Number of members per sleeping room",null,2.077787665978742E-2]
[null,null,"if has dirt, sand, dung as principal floor in dwelling",null,-0.11048080431192817,null,null,"if has dirt, sand, dung as principal floor in dwelling",null,-0.10730336071398637,null,null,"if has dirt, sand, dung as principal floor in dwelling",null,-0.13605184602033643]
[null,null,"if has wood, plank principal floor in dwelling",null,-3.3342378910491597E-3,null,null,"if has wood, plank principal floor in dwelling",null,-6.0459032713040687E-3,null,null,"if has wood, plank principal floor in dwelling",null,2.8401908431729017E-2]
[null,null,"if has parquet or polished wood floors",null,1.5757666932888269E-3,null,null,"if has parquet or polished wood floors",null,-5.3493887717510099E-4,null,null,"if has parquet or polished wood floors",null,1.4559654116264711E-2]
[null,null,"if has tiles for main flooring material",null,7.9610407936101815E-2,null,null,"if has tiles for main flooring material",null,0.10585707644907534,null,null,"if has tiles for main flooring material",null,5.9922596053381079E-2]
[null,null,"if has LINO, GERFLEX as flooring material",null,3.765791300181949E-2,null,null,"if has LINO, GERFLEX as flooring material",null,3.6826613943809684E-2,null,null,"if has LINO, GERFLEX as flooring material",null,5.521702725532434E-2]
[null,null,"if has cement principal floor",null,3.9116919598758716E-2,null,null,"if has cement principal floor",null,-2.3988603245390268E-2,null,null,"if has cement principal floor",null,0.10079504189420274]
[null,null,"if has other type of flooring",null,1.2448000745923686E-3,null,null,"if has other type of flooring",null,4.2799983671421441E-3,null,null,"if has other type of flooring",null,1.9930513701359458E-3]
[null,null,"if has cane, palm, trunks for walls",null,-2.0684574050486765E-2,null,null,"if has cane, palm, trunks for walls",null,-1.1349785115148595E-2,null,null,"if has cane, palm, trunks for walls",null,-2.1626248298200063E-2]
[null,null,"Walls from plastic/carton/used metal sheet",null,-1.0247566385432512E-2,null,null,"Walls from plastic/carton/used metal sheet",null,-1.3973653641180526E-2,null,null,"Walls from plastic/carton/used metal sheet",null,-9.4537735596194727E-3]
[null,null,"Walls from COB/DAUB/MUD/CLAY",null,-6.386422765106628E-2,null,null,"Walls from COB/DAUB/MUD/CLAY",null,-5.5369798598198641E-2,null,null,"Walls from COB/DAUB/MUD/CLAY",null,-7.3966581628026551E-2]
[null,null,"if has wood, BRANCHES for walls",null,-3.9305305388139603E-2,null,null,"if has wood, BRANCHES for walls",null,-8.0412683551905687E-2,null,null,"if has wood, BRANCHES for walls",null,-8.8968456140941891E-4]
[null,null,"Semihard/semifinished walls",null,3.8714806590424172E-2,null,null,"Semihard/semifinished walls",null,3.69222160353226E-2,null,null,"Semihard/semifinished walls",null,3.8721333931377153E-2]
[null,null,"Walls from breeze blocks/parpens/stones/cement",null,8.4966500775184667E-2,null,null,"Walls from breeze blocks/parpens/stones/cement",null,9.715119335640221E-2,null,null,"Walls from breeze blocks/parpens/stones/cement",null,0.10024194173371932]
[null,null,"if has other material for walls",null,-4.9704222539271974E-3,null,null,"if has other material for walls",null,-1.2692757775594267E-2,null,null,"if has other material for walls",null,6.4760484227580255E-3]
[null,null,"if has natural material roofing",null,-2.8764226822478998E-2,null,null,"if has natural material roofing",null,-1.8030978935743725E-2,null,null,"if has natural material roofing",null,-2.5075851916809087E-2]
[null,null,"if has plastic/carton/used metal sheet roofing",null,-4.0876602023994842E-3,null,null,"if has plastic/carton/used metal sheet roofing",null,-9.4062955616199036E-3,null,null,"if has plastic/carton/used metal sheet roofing",null,-3.4961084261188732E-3]
[null,null,"if has corrigated iron sheet roofing",null,-0.10527960672599446,null,null,"if has corrigated iron sheet roofing",null,-0.13562672094460709,null,null,"if has corrigated iron sheet roofing",null,-9.9869784282077184E-2]
[null,null,"if has corrigated iron sheet + ceiling roofing",null,0.11091112115473718,null,null,"if has corrigated iron sheet + ceiling roofing",null,0.12867879089793799,null,null,"if has corrigated iron sheet + ceiling roofing",null,0.12299438851768296]
[null,null,"if has ceramic/slate tiles for roof",null,6.9698046835565339E-3,null,null,"if has ceramic/slate tiles for roof",null,8.0985106542470608E-3,null,null,"if has ceramic/slate tiles for roof",null,1.5084316367705356E-2]
[null,null,"if roof from concrete",null,2.5727394800911785E-2,null,null,"if roof from concrete",null,2.92972574236052E-2,null,null,"if roof from concrete",null,2.014519107138623E-2]
[null,null,"if has other roofing",null,6.4570796543227454E-3,null,null,"if has other roofing",null,7.4368039141914401E-3,null,null,"if has other roofing",null,3.87983068375427E-2]
[null,null,"if uses electricity as cooking fuel",null,1.8980914484492836E-2,null,null,"if uses electricity as cooking fuel",null,2.2256428417025867E-2,null,null,"if uses electricity as cooking fuel",null,2.0973422452643581E-2]
[null,null,"if uses gas as cooking fuel",null,0.11530130764405613,null,null,"if uses gas as cooking fuel",null,0.11370409193565044,null,null,"if uses gas as cooking fuel",null,0.13908679650203332]
[null,null,"if uses oil/kerosene as cooking fuel",null,4.5977061110282959E-3,null,null,"if uses oil/kerosene as cooking fuel",null,-1.6461739089729227E-2,null,null,"if uses oil/kerosene as cooking fuel",null,6.5202748866537317E-3]
[null,null,"if uses coal/charcoal as cooking fuel",null,-2.1891161988245911E-2,null,null,"if uses coal/charcoal as cooking fuel",null,-3.5706641540213864E-2,null,null,"if uses coal/charcoal as cooking fuel",null,-3.2922408885927399E-3]
[null,null,"if uses wood/straw as cooking fuel",null,-0.11261858730983805,null,null,"if uses wood/straw as cooking fuel",null,-0.10969838058345437,null,null,"if uses wood/straw as cooking fuel",null,-0.11799143904910772]
[null,null,"if uses other cooking fuel",null,4.0718225949421339E-3,null,null,"if uses other cooking fuel",null,-1.3075282641378675E-2,null,null,"if uses other cooking fuel",null,4.2018297789059734E-3]
[]
[]
[null,null,"Component Score Covariance Matrix",null,null,null,null,"Component Score Covariance Matrix",null,null,null,null,"Component Score Covariance Matrix"]
[null,null,"Component",null,"1",null,null,"Component",null,"1",null,null,"Component",null,"1"]
[null,null,"1",null,0.99999999999999989,null,null,"1",null,0.99999999999999967,null,null,"1",null,1]
[]
[]
[]
[]
[]
[]
[]
[]
[]
[]
[]
[]
[]
[]
[]
[]
[]
[]
[]
[]
[]
[]
[]
[]
[]
[]
[]
[]
[]
[]
[]
[]
[]
[]
[]
[]
[]
[]
[]
[]
[]
[]
[]
[]
[]
[]
[]
[]
[]
[]
[]
[]
[]
[]
[]
[]
[]
[]
[]
[]
[]
[]
[]
[]
[]
[]
[]
[]
[]
[]
[]
[]
[]
[]
[]
[]
[]
[]
[]
[]
[]
[]
[]
[]
[]
[]
[]
[]
[]
[]
[]
[]
[]
[]
[]
[]
[]
[]
[]
[]
[]
[]
[]
[]
[]
[]
[]
[]
[]
[]
[]
[]
[]
[]
[]
[]
[]
[]
[]
[]
[]
[]
[]
[]
[]
[]
[]
[]
[]
[]
[]
[]
[]
[]
[]
[]
[]
[]
[]
[]
[]
[]
[]
[]
[]
[]
[]
[]
[]
[]
[]
[]
[]
[]
[]
[]
[]
[]
[]
[]
[]
[]
[]
[]
[]
[]
[]
[]
[]
[]
[]
[]
[]
[]
[]
[]
[]
[]
[]
[]
[]
[]
[]
[]
[]
[]
[]
[]
[]
[]
[]
[]
[]
[]
[]
[]
[]
[]
[]
[]
[]
[]
[]
[]
[]
[]
[]
[]
[]
[]
[]
[]
[]
[]
[]
[]
[]
[]
[]
[]
[]
[]
[]
[]
[]
[]
[]
[]
[]
[]
[]
[]
[]
[]
[]
[]
[]
[]
[]
[]
[]
[]
[]
[]
[]
[]
[]
[]
[]
[]
[]
[]
[]
[]
[]
[]
[]
[]
[]
[]
[]
[]
[]
[]
[]
[]
[]
[]
[]
[]
[]
[]
[]
[]
[]
[]
[]
[]
[]
[]
[]
[]
[]
[]
[]
[]
[]
[]
[]
[]
[]
[]
[]
[]
[]
[]
[]
[]
[]
[]
[]
[]
[]
[]
[]
[]
[]
[]
[]
[]
[]
[]
[]
[]
[]
[]
[]
[]
[]
[]
[]
[]
[]
[]
[]
[]
[]
[]
[]
[]
[]
[]
[]
[]
[]
[]
[]
[]
[]
[]
[]
[]
[]
[]
[]
[]
[]
[]
[]
[]
[]
[]
[]
[]
[]
[]
[]
[]
[]
[]
[]
[]
[]
[]
[]
[]
[]
[]
[]
[]
[]
[]
[]
[]
[]
[]
[]
[]
[]
[]
[]
[]
[]
[]
[]
[]
[]
[]
[]
[]
[]
[]
[]
[]
[]
[]
[]
[]
[]
[]
[]
[]
[]
[]
[]
[]
[]
[]
[]
[]
[]
[]
[]
[]
[]
[]
[]
[]
[]
[]
[]
[]
[]
[]
[]
[]
[]
[]
[]
[]
[]
[]
[]
[]
[]
[]
[]
[]
[]
[]
[]
[]
[]
[]
[]
[]
[]
[]
[]
[]
[]
[]
[]
[]
[]
[]
[]
[]
[]
[]
[]
[]
[]
[]
[]
[]
[]
[]
[]
[]
[]
[]
[]
[]
[]
[]
[]
[]
[]
[]
[]
[]
[]
[]
["DHS00"]
["Gabon",null,"Count"]
["W_text_t","",6203]
["W_text_i","",6203]
["S_text_s","Ratio of Shared improved based on:",6203]
["S_text_i","Ratio of Improved latrines based on:",6203]
["Urban/Rural","Urban",3626]
[null,"Rural",2577]
[null,"Missing",0]
["2000"]
[]
["Sub-national region names","Weighted population"]
[{"$f":"R15","v":"Big cities"},{"$f":"BR122+BR123","v":{"$error":"#VALUE!"}}]
[{"$f":"S15","v":"East (Haut-Ogoou‚ & Ogoou‚-Lolo)"},{"$f":"BS122+BS123","v":{"$error":"#VALUE!"}}]
[{"$f":"T15","v":"North (Ogoou‚-Ivindo & Woleu-Ntem)"},{"$f":"BT122+BT123","v":{"$error":"#VALUE!"}}]
[{"$f":"U15","v":"South (Ngouni‚, Nyanga)"},{"$f":"BU122+BU123","v":{"$error":"#VALUE!"}}]
[{"$f":"V15","v":"West (Estuaire, Moyen-Ogoou‚ & Ogoou‚-maritime)"},{"$f":"BV122+BV123","v":{"$error":"#VALUE!"}}]
[{"$f":"W15","v":0},{"$f":"BW122+BW123","v":0}]
[{"$f":"X15","v":0},{"$f":"BX122+XR123","v":0}]
[{"$f":"Y15","v":0},{"$f":"BY122+BY123","v":0}]
[{"$f":"Z15","v":0},{"$f":"BZ122+BZ123","v":0}]
[{"$f":"AA15","v":0},{"$f":"CA122+CA123","v":0}]
[{"$f":"AB15","v":0},{"$f":"CB122+CB123","v":0}]
[{"$f":"AC15","v":0},{"$f":"CC122+CC123","v":0}]
[{"$f":"AD15","v":0},{"$f":"CD122+CD123","v":0}]
[{"$f":"AE15","v":0},{"$f":"CE122+CE123","v":0}]
[{"$f":"AF15","v":0},{"$f":"CF122+CF123","v":0}]
[{"$f":"AG15","v":0},{"$f":"CG122+CG123","v":0}]
[{"$f":"AH15","v":0},{"$f":"CH122+CH123","v":0}]
[{"$f":"AI15","v":0},{"$f":"CI122+CI123","v":0}]
[{"$f":"AJ15","v":0},{"$f":"CJ122+CJ123","v":0}]
[{"$f":"AK15","v":0},{"$f":"CK122+CK123","v":0}]
[{"$f":"AL15","v":0},{"$f":"CL122+CL123","v":0}]
[{"$f":"AM15","v":0},{"$f":"CM122+CM123","v":0}]
[{"$f":"AN15","v":0},{"$f":"CN122+CN123","v":0}]
[{"$f":"AO15","v":0},{"$f":"CO122+CO123","v":0}]
[{"$f":"AP15","v":0},{"$f":"CP122+CP123","v":0}]
[{"$f":"AQ15","v":0},{"$f":"CQ122+CQ123","v":0}]
[{"$f":"AR15","v":0},{"$f":"CR122+CR123","v":0}]
[{"$f":"AS15","v":0},{"$f":"CS122+CS123","v":0}]
[{"$f":"AT15","v":0},{"$f":"CT122+CT123","v":0}]
[{"$f":"AU15","v":0},{"$f":"CU122+CU123","v":0}]
[{"$f":"AV15","v":0},{"$f":"CV122+CV123","v":0}]
[{"$f":"AW15","v":0},{"$f":"CW122+CW123","v":0}]
[{"$f":"AX15","v":0},{"$f":"CX122+CX123","v":0}]
[{"$f":"AY15","v":0},{"$f":"CY122+CY123","v":0}]
[]
[{"$f":"34-COUNTIF(A1037:A1071,\"0\")","v":5},"Sub-regions"]

{"sheet":"DHS12","index":5,"n_rows":1072,"n_cols":79,"rows_kept":1072,"cut":false,"hidden":false,"merged":[[346,52,347,52],[348,52,349,52],[350,52,351,52],[352,52,353,52],[152,52,159,52],[270,52,272,52],[273,52,275,52],[276,52,283,52],[338,54,338,58],[338,59,338,63],[338,64,338,68],[340,52,341,52],[342,52,343,52],[344,52,345,52],[221,52,223,52],[224,52,225,52],[226,52,229,52],[258,54,258,58],[258,59,258,63],[258,64,258,68],[260,52,262,52],[263,52,266,52],[267,52,269,52],[119,64,119,68],[121,52,122,52],[123,52,126,52],[127,52,128,52],[132,54,132,58],[132,59,132,63],[132,64,132,68],[134,52,138,52],[219,54,219,58],[219,59,219,63],[219,64,219,68],[139,52,142,52],[13,64,13,68],[15,52,16,52],[17,52,20,52],[21,52,22,52],[26,54,26,58],[26,59,26,63],[26,64,26,68],[40,52,41,52],[55,54,55,58],[55,59,55,63],[55,64,55,68],[143,0,146,0],[143,52,146,52],[147,0,149,0],[147,52,149,52],[150,0,151,0],[150,52,151,52],[13,54,13,58],[13,59,13,63],[119,54,119,58],[119,59,119,63],[42,52,43,52],[44,52,45,52],[46,0,48,0],[46,52,48,52],[49,0,51,0],[49,52,51,52],[52,0,54,0],[52,52,54,52],[32,52,33,52],[34,52,35,52],[36,52,37,52],[38,0,39,0],[38,52,39,52],[13,2,13,6],[13,7,13,11],[28,52,29,52],[30,0,31,0],[30,52,31,52],[26,2,26,6],[26,7,26,11],[26,12,26,16],[13,12,13,16],[15,0,16,0],[17,0,20,0],[21,0,22,0],[23,0,25,0],[32,0,33,0],[55,2,55,6],[55,7,55,11],[55,12,55,16],[28,0,29,0],[34,0,35,0],[36,0,37,0],[40,0,41,0],[42,0,43,0],[44,0,45,0],[139,0,142,0],[107,0,107,1],[119,2,119,6],[119,7,119,11],[57,0,69,0],[132,12,132,16],[134,0,138,0],[119,12,119,16],[121,0,122,0],[123,0,126,0],[127,0,128,0],[129,0,131,0],[152,0,158,0],[132,2,132,6],[132,7,132,11],[219,2,219,6],[219,7,219,11],[219,12,219,16],[207,0,207,1],[1024,0,1024,2],[1025,0,1025,1],[407,12,407,13],[408,2,408,3],[408,7,408,8],[408,12,408,13],[405,2,405,3],[405,7,405,8],[405,12,405,13],[406,2,406,3],[406,7,406,8],[406,12,406,13],[411,2,411,3],[411,7,411,8],[411,12,411,13],[412,2,412,3],[412,7,412,8],[1030,0,1032,0],[1033,0,1033,2],[398,2,398,5],[221,0,223,0],[398,7,398,10],[398,12,398,15],[399,2,399,4],[399,7,399,9],[399,12,399,14],[400,2,401,3],[400,7,401,8],[400,12,401,13],[401,1,444,1],[402,2,402,3],[402,7,402,8],[402,12,402,13],[403,2,403,3],[403,7,403,8],[403,12,403,13],[404,2,404,3],[404,7,404,8],[404,12,404,13],[407,2,407,3],[407,7,407,8],[412,12,412,13],[409,2,409,3],[409,7,409,8],[409,12,409,13],[410,2,410,3],[410,7,410,8],[410,12,410,13],[415,2,415,3],[415,7,415,8],[415,12,415,13],[416,2,416,3],[416,7,416,8],[416,12,416,13],[413,2,413,3],[413,7,413,8],[413,12,413,13],[414,2,414,3],[414,7,414,8],[414,12,414,13],[419,2,419,3],[419,7,419,8],[419,12,419,13],[420,2,420,3],[420,7,420,8],[420,12,420,13],[417,2,417,3],[417,7,417,8],[417,12,417,13],[418,2,418,3],[418,7,418,8],[418,12,418,13],[423,2,423,3],[423,7,423,8],[423,12,423,13],[424,2,424,3],[424,7,424,8],[424,12,424,13],[421,2,421,3],[421,7,421,8],[421,12,421,13],[422,2,422,3],[422,7,422,8],[422,12,422,13],[427,2,427,3],[427,7,427,8],[427,12,427,13],[428,2,428,3],[428,7,428,8],[428,12,428,13],[425,2,425,3],[425,7,425,8],[425,12,425,13],[426,2,426,3],[426,7,426,8],[426,12,426,13],[431,2,431,3],[431,7,431,8],[431,12,431,13],[432,2,432,3],[432,7,432,8],[432,12,432,13],[429,2,429,3],[429,7,429,8],[429,12,429,13],[430,2,430,3],[430,7,430,8],[430,12,430,13],[435,2,435,3],[435,7,435,8],[435,12,435,13],[436,2,436,3],[436,7,436,8],[436,12,436,13],[433,2,433,3],[433,7,433,8],[433,12,433,13],[434,2,434,3],[434,7,434,8],[434,12,434,13],[439,2,439,3],[439,7,439,8],[439,12,439,13],[440,2,440,3],[440,7,440,8],[440,12,440,13],[437,2,437,3],[437,7,437,8],[437,12,437,13],[438,2,438,3],[438,7,438,8],[438,12,438,13],[443,2,443,3],[443,7,443,8],[443,12,443,13],[444,2,444,3],[444,7,444,8],[444,12,444,13],[441,2,441,3],[441,7,441,8],[441,12,441,13],[442,2,442,3],[442,7,442,8],[442,12,442,13],[447,2,447,3],[447,7,447,8],[447,12,447,13],[448,2,448,3],[448,7,448,8],[448,12,448,13],[445,2,445,3],[445,7,445,8],[445,12,445,13],[446,2,446,3],[446,7,446,8],[446,12,446,13],[451,2,451,3],[451,7,451,8],[451,12,451,13],[452,2,452,3],[452,7,452,8],[452,12,452,13],[449,2,449,3],[449,7,449,8],[449,12,449,13],[450,2,450,3],[450,7,450,8],[450,12,450,13],[455,2,455,3],[455,7,455,8],[455,12,455,13],[456,2,456,3],[456,7,456,8],[456,12,456,13],[453,2,453,3],[453,7,453,8],[453,12,453,13],[454,2,454,3],[454,7,454,8],[454,12,454,13],[459,2,459,3],[459,7,459,8],[459,12,459,13],[460,2,460,3],[460,7,460,8],[460,12,460,13],[457,2,457,3],[457,7,457,8],[457,12,457,13],[458,2,458,3],[458,7,458,8],[458,12,458,13],[463,2,463,3],[463,7,463,8],[463,12,463,13],[464,2,464,3],[464,7,464,8],[464,12,464,13],[461,2,461,3],[461,7,461,8],[461,12,461,13],[462,2,462,3],[462,7,462,8],[462,12,462,13],[467,2,467,3],[467,7,467,8],[467,12,467,13],[468,2,468,3],[468,7,468,8],[468,12,468,13],[465,2,465,3],[465,7,465,8],[465,12,465,13],[466,2,466,3],[466,7,466,8],[466,12,466,13],[471,2,471,4],[471,7,471,8],[471,12,471,13],[472,2,472,3],[472,7,472,8],[472,12,472,13],[469,2,469,3],[469,7,469,8],[469,12,469,13],[470,2,470,3],[470,7,470,8],[470,12,470,13],[475,2,475,3],[475,7,475,8],[475,12,475,13],[476,2,476,3],[476,7,476,8],[476,12,476,13],[473,2,473,3],[473,7,473,8],[473,12,473,13],[474,2,474,3],[474,7,474,8],[474,12,474,13],[479,2,479,3],[479,7,479,9],[479,12,479,14],[480,2,480,3],[480,7,480,8],[480,12,480,13],[477,2,477,3],[477,7,477,8],[477,12,477,13],[478,2,478,3],[478,7,478,8],[478,12,478,13],[483,2,483,3],[483,7,483,8],[483,12,483,13],[484,2,484,3],[484,7,484,8],[484,12,484,13],[481,2,481,3],[481,7,481,8],[481,12,481,13],[482,2,482,3],[482,7,482,8],[482,12,482,13],[487,2,487,3],[487,7,487,8],[487,12,487,13],[488,2,488,3],[488,7,488,8],[488,12,488,13],[485,2,485,3],[485,7,485,8],[485,12,485,13],[486,2,486,3],[486,7,486,8],[486,12,486,13],[491,2,491,3],[491,7,491,8],[491,12,491,13],[492,2,492,3],[492,7,492,8],[492,12,492,13],[489,2,489,3],[489,7,489,8],[489,12,489,13],[490,2,490,3],[490,7,490,8],[490,12,490,13],[495,2,495,3],[495,7,495,8],[495,12,495,13],[496,2,496,3],[496,7,496,8],[496,12,496,13],[493,2,493,3],[493,7,493,8],[493,12,493,13],[494,2,494,3],[494,7,494,8],[494,12,494,13],[499,2,499,3],[499,7,499,8],[499,12,499,13],[500,2,500,3],[500,7,500,8],[500,12,500,13],[497,2,497,3],[497,7,497,8],[497,12,497,13],[498,2,498,3],[498,7,498,8],[498,12,498,13],[503,2,503,3],[503,7,503,8],[503,12,503,13],[504,2,504,3],[504,7,504,8],[504,12,504,13],[501,2,501,3],[501,7,501,8],[501,12,501,13],[502,2,502,3],[502,7,502,8],[502,12,502,13],[507,2,507,3],[507,7,507,8],[507,12,507,13],[508,2,508,3],[508,7,508,8],[508,12,508,13],[505,2,505,3],[505,7,505,8],[505,12,505,13],[506,2,506,3],[506,7,506,8],[506,12,506,13],[511,2,511,3],[511,7,511,8],[511,12,511,13],[512,2,512,3],[512,7,512,8],[512,12,512,13],[509,2,509,3],[509,7,509,8],[509,12,509,13],[510,2,510,3],[510,7,510,8],[510,12,510,13],[515,2,515,3],[515,7,515,8],[515,12,515,13],[516,2,516,3],[516,7,516,8],[516,12,516,13],[513,2,513,3],[513,7,513,8],[513,12,513,13],[514,2,514,3],[514,7,514,8],[514,12,514,13],[519,2,519,3],[519,7,519,8],[519,12,519,13],[520,2,520,3],[520,7,520,8],[520,12,520,13],[517,2,517,3],[517,7,517,8],[517,12,517,13],[518,2,518,3],[518,7,518,8],[518,12,518,13],[523,2,523,3],[523,7,523,8],[523,12,523,13],[524,2,524,3],[524,7,524,8],[524,12,524,13],[521,2,521,3],[521,7,521,8],[521,12,521,13],[522,2,522,3],[522,7,522,8],[522,12,522,13],[527,2,527,3],[527,7,527,8],[527,12,527,13],[528,2,528,3],[528,7,528,8],[528,12,528,13],[525,2,525,3],[525,7,525,8],[525,12,525,13],[526,2,526,3],[526,7,526,8],[526,12,526,13],[531,2,531,3],[531,7,531,8],[531,12,531,13],[532,2,532,3],[532,7,532,8],[532,12,532,13],[529,2,529,3],[529,7,529,8],[529,12,529,13],[530,2,530,3],[530,7,530,8],[530,12,530,13],[535,2,535,3],[535,7,535,8],[535,12,535,13],[536,2,536,3],[536,7,536,8],[536,12,536,13],[533,2,533,3],[533,7,533,8],[533,12,533,13],[534,2,534,3],[534,7,534,8],[534,12,534,13],[539,2,539,3],[539,7,539,8],[539,12,539,13],[540,2,540,3],[540,7,540,8],[540,12,540,13],[537,2,537,3],[537,7,537,8],[537,12,537,13],[538,2,538,3],[538,7,538,8],[538,12,538,13],[541,2,541,6],[541,7,541,8],[541,12,541,13],[542,2,543,3],[542,4,542,6],[542,7,542,8],[542,12,542,13],[543,7,543,8],[543,12,543,13],[546,2,546,3],[546,7,546,8],[546,12,546,13],[547,2,547,4],[547,7,547,8],[547,12,547,13],[544,2,544,3],[544,7,544,8],[544,12,544,13],[545,2,545,3],[545,7,545,8],[545,12,545,13],[551,2,551,3],[551,7,551,8],[551,12,551,13],[552,2,552,3],[552,7,552,8],[552,12,552,13],[548,2,549,3],[548,7,548,8],[548,12,548,13],[549,7,549,8],[549,12,549,13],[550,2,550,3],[550,7,550,8],[550,12,550,13],[555,2,555,3],[555,7,555,8],[555,12,555,13],[556,2,556,3],[556,7,556,8],[556,12,556,13],[553,2,553,3],[553,7,553,8],[553,12,553,13],[554,2,554,3],[554,7,554,8],[554,12,554,13],[560,2,560,3],[560,7,560,8],[560,12,560,13],[561,2,561,3],[561,7,561,8],[561,12,561,13],[557,2,557,3],[557,7,557,11],[557,12,557,16],[558,2,558,3],[558,7,559,8],[558,9,558,11],[558,12,559,13],[558,14,558,16],[559,2,559,3],[564,2,564,3],[564,7,565,8],[564,12,565,13],[565,2,565,3],[566,2,566,3],[566,7,566,8],[566,12,566,13],[562,2,562,3],[562,7,562,8],[562,12,562,13],[563,2,563,3],[563,7,563,9],[563,12,563,14],[569,2,569,3],[569,7,569,8],[569,12,569,13],[570,2,570,3],[570,7,570,8],[570,12,570,13],[567,2,567,3],[567,7,567,8],[567,12,567,13],[568,2,568,3],[568,7,568,8],[568,12,568,13],[573,2,573,3],[573,7,573,8],[573,12,573,13],[574,2,574,3],[574,7,574,8],[574,12,574,13],[571,2,571,3],[571,7,571,8],[571,12,571,13],[572,2,572,3],[572,7,572,8],[572,12,572,13],[577,2,577,3],[577,7,577,8],[577,12,577,13],[578,2,578,3],[578,7,578,8],[578,12,578,13],[575,2,575,3],[575,7,575,8],[575,12,575,13],[576,2,576,3],[576,7,576,8],[576,12,576,13],[581,2,581,3],[581,7,581,8],[581,12,581,13],[582,2,582,3],[582,7,582,8],[582,12,582,13],[579,2,579,3],[579,7,579,8],[579,12,579,13],[580,2,580,3],[580,7,580,8],[580,12,580,13],[585,2,585,3],[585,7,585,8],[585,12,585,13],[586,2,586,3],[586,7,586,8],[586,12,586,13],[583,2,583,3],[583,7,583,8],[583,12,583,13],[584,2,584,3],[584,7,584,8],[584,12,584,13],[589,2,589,3],[589,7,589,8],[589,12,589,13],[590,2,590,3],[590,7,590,8],[590,12,590,13],[587,2,587,3],[587,7,587,8],[587,12,587,13],[588,2,588,3],[588,7,588,8],[588,12,588,13],[593,2,593,3],[593,7,593,8],[593,12,593,13],[594,2,594,3],[594,7,594,8],[594,12,594,13],[591,2,591,3],[591,7,591,8],[591,12,591,13],[592,2,592,3],[592,7,592,8],[592,12,592,13],[597,2,597,3],[597,7,597,8],[597,12,597,13],[598,2,598,3],[598,7,598,8],[598,12,598,13],[595,2,595,3],[595,7,595,8],[595,12,595,13],[596,2,596,3],[596,7,596,8],[596,12,596,13],[601,2,601,3],[601,7,601,8],[601,12,601,13],[602,2,602,3],[602,7,602,8],[602,12,602,13],[599,2,599,3],[599,7,599,8],[599,12,599,13],[600,2,600,3],[600,7,600,8],[600,12,600,13],[605,2,605,3],[605,7,605,8],[605,12,605,13],[606,2,606,3],[606,7,606,8],[606,12,606,13],[603,2,603,3],[603,7,603,8],[603,12,603,13],[604,2,604,3],[604,7,604,8],[604,12,604,13],[609,2,609,3],[609,7,609,8],[609,12,609,13],[610,2,610,3],[610,7,610,8],[610,12,610,13],[607,2,607,3],[607,7,607,8],[607,12,607,13],[608,2,608,3],[608,7,608,8],[608,12,608,13],[613,2,613,3],[613,7,613,8],[613,12,613,13],[614,2,614,3],[614,7,614,8],[614,12,614,13],[611,2,611,3],[611,7,611,8],[611,12,611,13],[612,2,612,3],[612,7,612,8],[612,12,612,13],[617,2,617,3],[617,7,617,8],[617,12,617,13],[618,2,618,4],[618,7,618,8],[618,12,618,13],[615,2,615,3],[615,7,615,8],[615,12,615,13],[616,2,616,3],[616,7,616,8],[616,12,616,13],[621,2,621,3],[621,7,621,8],[621,12,621,13],[622,2,622,3],[622,7,622,8],[622,12,622,13],[619,2,619,3],[619,7,619,8],[619,12,619,13],[620,2,620,3],[620,7,620,8],[620,12,620,13],[625,2,625,3],[625,7,625,8],[625,12,625,13],[626,2,626,3],[626,7,626,8],[626,12,626,13],[623,2,623,3],[623,7,623,8],[623,12,623,13],[624,2,624,3],[624,7,624,8],[624,12,624,13],[629,2,629,3],[629,7,629,8],[629,12,629,13],[630,2,630,3],[630,7,630,8],[630,12,630,13],[627,2,627,3],[627,7,627,8],[627,12,627,13],[628,2,628,3],[628,7,628,8],[628,12,628,13],[633,2,633,3],[633,7,633,8],[633,12,633,13],[634,2,634,3],[634,7,634,8],[634,12,634,13],[631,2,631,3],[631,7,631,8],[631,12,631,13],[632,2,632,3],[632,7,632,8],[632,12,632,13],[637,2,637,3],[637,7,637,8],[637,12,637,13],[638,2,638,3],[638,7,638,8],[638,12,638,13],[635,2,635,3],[635,7,635,8],[635,12,635,13],[636,2,636,3],[636,7,636,8],[636,12,636,13],[641,2,641,3],[641,7,641,8],[641,12,641,13],[642,2,642,3],[642,7,642,9],[642,12,642,14],[639,2,639,3],[639,7,639,8],[639,12,639,13],[640,2,640,3],[640,7,640,8],[640,12,640,13],[645,2,645,3],[645,7,645,8],[645,12,645,13],[646,2,646,3],[646,7,646,8],[646,12,646,13],[643,2,643,3],[643,7,643,8],[643,12,643,13],[644,2,644,3],[644,7,644,8],[644,12,644,13],[649,2,649,3],[649,7,649,8],[649,12,649,13],[650,2,650,3],[650,7,650,8],[650,12,650,13],[647,2,647,3],[647,7,647,8],[647,12,647,13],[648,2,648,3],[648,7,648,8],[648,12,648,13],[653,2,653,3],[653,7,653,8],[653,12,653,13],[654,2,654,3],[654,7,654,8],[654,12,654,13],[651,2,651,3],[651,7,651,8],[651,12,651,13],[652,2,652,3],[652,7,652,8],[652,12,652,13],[657,2,657,3],[657,7,657,8],[657,12,657,13],[658,2,658,3],[658,7,658,8],[658,12,658,13],[655,2,655,3],[655,7,655,8],[655,12,655,13],[656,2,656,3],[656,7,656,8],[656,12,656,13],[661,2,661,3],[661,7,661,8],[661,12,661,13],[662,2,662,3],[662,7,662,8],[662,12,662,13],[659,2,659,3],[659,7,659,8],[659,12,659,13],[660,2,660,3],[660,7,660,8],[660,12,660,13],[665,2,665,3],[665,7,665,8],[665,12,665,13],[666,2,666,3],[666,7,666,8],[666,12,666,13],[663,2,663,3],[663,7,663,8],[663,12,663,13],[664,2,664,3],[664,7,664,8],[664,12,664,13],[669,2,669,3],[669,7,669,8],[669,12,669,13],[670,2,670,3],[670,7,670,8],[670,12,670,13],[667,2,667,3],[667,7,667,8],[667,12,667,13],[668,2,668,3],[668,7,668,8],[668,12,668,13],[673,2,673,3],[673,7,673,8],[673,12,673,13],[674,2,674,3],[674,7,674,8],[674,12,674,13],[671,2,671,3],[671,7,671,8],[671,12,671,13],[672,2,672,3],[672,7,672,8],[672,12,672,13],[677,2,677,3],[677,7,677,8],[677,12,677,13],[678,2,678,3],[678,7,678,8],[678,12,678,13],[675,2,675,3],[675,7,675,8],[675,12,675,13],[676,2,676,3],[676,7,676,8],[676,12,676,13],[681,2,681,3],[681,7,681,8],[681,12,681,13],[682,2,682,3],[682,7,682,8],[682,12,682,13],[679,2,679,3],[679,7,679,8],[679,12,679,13],[680,2,680,3],[680,7,680,8],[680,12,680,13],[685,2,685,3],[685,7,685,8],[685,12,685,13],[686,2,686,3],[686,7,686,8],[686,12,686,13],[683,2,683,3],[683,7,683,8],[683,12,683,13],[684,2,684,3],[684,7,684,8],[684,12,684,13],[689,2,689,3],[689,7,689,8],[689,12,689,13],[690,2,690,3],[690,7,690,8],[690,12,690,13],[687,2,687,3],[687,7,687,8],[687,12,687,13],[688,2,688,3],[688,7,688,8],[688,12,688,13],[693,2,693,3],[693,7,693,8],[693,12,693,13],[691,2,691,3],[691,7,691,8],[691,12,691,13],[692,2,692,3],[692,7,692,8],[692,12,692,13]]}
[]
[{"$f":"A1026","v":"Gabon"}]
[{"$f":"A1034","v":"2012"}]
["Use of drinking water sources"]
[" by wealth quintile and sub-national region"]
["Notes:"]
["WHO/UNICEF JMP customised wealth index excludes water,"]
[" sanitation and hygiene assets."]
["Survey used for analysis:",{"$f":"A1025","v":"DHS12"}]
[{"$f":"B1028","v":""}]
[{"$f":"B1027","v":""}]
[]
[]
["Use of drinking water sources",null,"NATIONAL wealth index quintile",null,null,null,null,"URBAN wealth index quintile",null,null,null,null,"RURAL wealth index quintile",null,null,null,null,"SUB-REGIONS:",null,null,null,null,null,null,null,null,null,null,null,null,null,null,null,null,null,null,null,null,null,null,null,null,null,null,null,null,null,null,null,null,null,null,"Raw numbers of respondents:","Use of drinking water sources","NATIONAL wealth index quintile",null,null,null,null,"URBAN wealth index quintile",null,null,null,null,"RURAL wealth index quintile",null,null,null,null,"SUB-REGIONS:"]
["Weighted percentage (used in graphs)",null,"Poorest","Poor","Middle","Rich","Richest","Poorest","Poor","Middle","Rich","Richest","Poorest","Poor","Middle","Rich","Richest","Estuaire","Haut-Ogooué","Libreville-Port-Gentil","Moyen-Ogooué","Ngounié","Nyanga","Ogooué Maritime","Ogooué-Ivindo","Ogooué-Lolo","Woleu-Ntem",null,null,null,null,null,null,null,null,null,null,null,null,null,null,null,null,null,null,null,null,null,null,null,null,null,"Water data, raw numbers (weighted)",null,"Poorest","Poor","Middle","Rich","Richest","Poorest","Poor","Middle","Rich","Richest","Poorest","Poor","Middle","Rich","Richest","Estuaire","Haut-Ogooué","Libreville-Port-Gentil","Moyen-Ogooué","Ngounié","Nyanga","Ogooué Maritime","Ogooué-Ivindo","Ogooué-Lolo","Woleu-Ntem"]
["Water","Improved",74.2,94.3,97.5,98.9,98.3,92.5,97.5,99.5,99,98.1,51.1,58.5,67.2,71.3,89.9,87.7,89.6,98.4,79.099999999999994,89.2,79.7,88.5,73.7,76.5,93,null,null,null,null,null,null,null,null,null,null,null,null,null,null,null,null,null,null,null,null,null,null,null,null,null,"Water","Improved","N/A","N/A","N/A","N/A","N/A","N/A","N/A","N/A","N/A","N/A","N/A","N/A","N/A","N/A","N/A","N/A","N/A","N/A","N/A","N/A","N/A","N/A","N/A","N/A","N/A"]
[null,"Not Improved",25.8,5.7,2.5,1.1000000000000001,1.7,7.5,2.5,0.5,1,1.9,48.9,41.5,32.799999999999997,28.7,10.1,12.3,10.4,1.6,20.9,10.8,20.3,11.5,26.3,23.5,7,null,null,null,null,null,null,null,null,null,null,null,null,null,null,null,null,null,null,null,null,null,null,null,null,null,null,"Not Improved","N/A","N/A","N/A","N/A","N/A","N/A","N/A","N/A","N/A","N/A","N/A","N/A","N/A","N/A","N/A","N/A","N/A","N/A","N/A","N/A","N/A","N/A","N/A","N/A","N/A"]
["Water ladder","Basic",54.8,82,92.2,94.9,96.1,71,90.1,95.9,95.9,95.7,38.200000000000003,46.6,48,57.7,77,75.2,76.599999999999994,94.5,67.099999999999994,72.8,52.7,76.3,62.5,68.099999999999994,76.400000000000006,null,null,null,null,null,null,null,null,null,null,null,null,null,null,null,null,null,null,null,null,null,null,null,null,null,"Water ladder","Basic","N/A","N/A","N/A","N/A","N/A","N/A","N/A","N/A","N/A","N/A","N/A","N/A","N/A","N/A","N/A","N/A","N/A","N/A","N/A","N/A","N/A","N/A","N/A","N/A","N/A"]
[null,"Limited",19.3,12.2,5.2,3.9,2.2999999999999998,21.5,7.4,3.6,3.2,2.4,12.7,11.8,18.8,13.4,12.9,12.5,12.9,4,11.9,16.399999999999999,27,12.1,11.1,8.4,16.600000000000001,null,null,null,null,null,null,null,null,null,null,null,null,null,null,null,null,null,null,null,null,null,null,null,null,null,null,"Limited","N/A","N/A","N/A","N/A","N/A","N/A","N/A","N/A","N/A","N/A","N/A","N/A","N/A","N/A","N/A","N/A","N/A","N/A","N/A","N/A","N/A","N/A","N/A","N/A","N/A"]
[null,"Unimproved",6.9,3,1.9,0.9,1.7,5.3,2.1,0.3,1,1.9,8.6999999999999993,6.3,6.2,9.1,4.9000000000000004,4.2,4.3,1.6,5.2,0.8,2.1,4.7,13.4,4.7,3.8,null,null,null,null,null,null,null,null,null,null,null,null,null,null,null,null,null,null,null,null,null,null,null,null,null,null,"Unimproved","N/A","N/A","N/A","N/A","N/A","N/A","N/A","N/A","N/A","N/A","N/A","N/A","N/A","N/A","N/A","N/A","N/A","N/A","N/A","N/A","N/A","N/A","N/A","N/A","N/A"]
[null,"Surface water",19,2.7,0.6,0.2,0,2.2000000000000002,0.4,0.2,0,0,40.4,35.299999999999997,26.9,19.8,5.2,8.1999999999999993,6.2,0,15.9,10,18.2,6.8,13,18.8,3.2,null,null,null,null,null,null,null,null,null,null,null,null,null,null,null,null,null,null,null,null,null,null,null,null,null,null,"Surface water","N/A","N/A","N/A","N/A","N/A","N/A","N/A","N/A","N/A","N/A","N/A","N/A","N/A","N/A","N/A","N/A","N/A","N/A","N/A","N/A","N/A","N/A","N/A","N/A","N/A"]
["Improved water point at more than 30 minutes","Yes",26.1,13,5.4,4,2.2999999999999998,23.2,7.6,3.6,3.2,2.5,25,20.2,28.2,18.899999999999999,14.3,14.2,14.4,4.0999999999999996,15,18.3,33.799999999999997,13.7,15.1,11,17.8,null,null,null,null,null,null,null,null,null,null,null,null,null,null,null,null,null,null,null,null,null,null,null,null,null,"Improved water point at more than 30 minutes","Yes","N/A","N/A","N/A","N/A","N/A","N/A","N/A","N/A","N/A","N/A","N/A","N/A","N/A","N/A","N/A","N/A","N/A","N/A","N/A","N/A","N/A","N/A","N/A","N/A","N/A"]
[null,"No",73.900000000000006,87,94.6,96,97.7,76.8,92.4,96.4,96.8,97.5,75,79.8,71.8,81.099999999999994,85.7,85.8,85.6,95.9,85,81.7,66.2,86.3,84.9,89,82.2,null,null,null,null,null,null,null,null,null,null,null,null,null,null,null,null,null,null,null,null,null,null,null,null,null,null,"No","N/A","N/A","N/A","N/A","N/A","N/A","N/A","N/A","N/A","N/A","N/A","N/A","N/A","N/A","N/A","N/A","N/A","N/A","N/A","N/A","N/A","N/A","N/A","N/A","N/A"]
["Manually calculated ratios","Improved wells"]
[null,"Improved springs"]
[null,"Other"]
[null,null,"NATIONAL wealth index quintile",null,null,null,null,"URBAN wealth index quintile",null,null,null,null,"RURAL wealth index quintile",null,null,null,null,"SUB-REGIONS:",null,null,null,null,null,null,null,null,null,null,null,null,null,null,null,null,null,null,null,null,null,null,null,null,null,null,null,null,null,null,null,null,null,null,"Raw numbers of respondents:","Use of drinking water sources","NATIONAL wealth index quintile",null,null,null,null,"URBAN wealth index quintile",null,null,null,null,"RURAL wealth index quintile",null,null,null,null,"SUB-REGIONS:"]
["Percentage based on weighted population",null,"Poorest","Poor","Middle","Rich","Richest","Poorest","Poor","Middle","Rich","Richest","Poorest","Poor","Middle","Rich","Richest","Estuaire","Haut-Ogooué","Libreville-Port-Gentil","Moyen-Ogooué","Ngounié","Nyanga","Ogooué Maritime","Ogooué-Ivindo","Ogooué-Lolo","Woleu-Ntem",null,null,null,null,null,null,null,null,null,null,null,null,null,null,null,null,null,null,null,null,null,null,null,null,null,"Water data, raw numbers (weighted)",null,"Poorest","Poor","Middle","Rich","Richest","Poorest","Poor","Middle","Rich","Richest","Poorest","Poor","Middle","Rich","Richest","Estuaire","Haut-Ogooué","Libreville-Port-Gentil","Moyen-Ogooué","Ngounié","Nyanga","Ogooué Maritime","Ogooué-Ivindo","Ogooué-Lolo","Woleu-Ntem"]
["Piped water","Yes",43.1,90.5,93.7,97.8,97,86,96.5,96.4,98.3,96.8,5.2,8.4,14.5,38.6,78.7,77.099999999999994,84.9,97.1,66.099999999999994,64.5,75.599999999999994,67.099999999999994,38.299999999999997,60.5,61.8,null,null,null,null,null,null,null,null,null,null,null,null,null,null,null,null,null,null,null,null,null,null,null,null,null,"Piped water","Yes","N/A","N/A","N/A","N/A","N/A","N/A","N/A","N/A","N/A","N/A","N/A","N/A","N/A","N/A","N/A","N/A","N/A","N/A","N/A","N/A","N/A","N/A","N/A","N/A","N/A"]
[null,"No",56.9,9.5,6.3,2.2000000000000002,3,14,3.5,3.6,1.7,3.2,94.8,91.6,85.5,61.4,21.3,22.9,15.1,2.9,33.9,35.5,24.4,32.9,61.7,39.5,38.200000000000003,null,null,null,null,null,null,null,null,null,null,null,null,null,null,null,null,null,null,null,null,null,null,null,null,null,null,"No","N/A","N/A","N/A","N/A","N/A","N/A","N/A","N/A","N/A","N/A","N/A","N/A","N/A","N/A","N/A","N/A","N/A","N/A","N/A","N/A","N/A","N/A","N/A","N/A","N/A"]
["Piped water on premises","Yes",15.6,52.5,68,84.6,92.4,39.799999999999997,62.5,76.8,87.2,92.6,1.2,2.1,4.7,12.6,47.4,51.7,55,80.7,33.9,31.9,32.5,44.5,28.2,33.200000000000003,32.9,null,null,null,null,null,null,null,null,null,null,null,null,null,null,null,null,null,null,null,null,null,null,null,null,null,"Piped water on premises","Yes","N/A","N/A","N/A","N/A","N/A","N/A","N/A","N/A","N/A","N/A","N/A","N/A","N/A","N/A","N/A","N/A","N/A","N/A","N/A","N/A","N/A","N/A","N/A","N/A","N/A"]
[null,"No",84.4,47.5,32,15.4,7.6,60.2,37.5,23.2,12.8,7.4,98.8,97.9,95.3,87.4,52.6,48.3,45,19.3,66.099999999999994,68.099999999999994,67.5,55.5,71.8,66.8,67.099999999999994,null,null,null,null,null,null,null,null,null,null,null,null,null,null,null,null,null,null,null,null,null,null,null,null,null,null,"No","N/A","N/A","N/A","N/A","N/A","N/A","N/A","N/A","N/A","N/A","N/A","N/A","N/A","N/A","N/A","N/A","N/A","N/A","N/A","N/A","N/A","N/A","N/A","N/A","N/A"]
["Piped water into dwelling","Yes","N/A","N/A","N/A","N/A","N/A","N/A","N/A","N/A","N/A","N/A","N/A","N/A","N/A","N/A","N/A","N/A","N/A","N/A","N/A","N/A","N/A","N/A","N/A","N/A","N/A",null,null,null,null,null,null,null,null,null,null,null,null,null,null,null,null,null,null,null,null,null,null,null,null,null,"Piped water into dwelling","Yes","N/A","N/A","N/A","N/A","N/A","N/A","N/A","N/A","N/A","N/A","N/A","N/A","N/A","N/A","N/A","N/A","N/A","N/A","N/A","N/A","N/A","N/A","N/A","N/A","N/A"]
[null,"No","N/A","N/A","N/A","N/A","N/A","N/A","N/A","N/A","N/A","N/A","N/A","N/A","N/A","N/A","N/A","N/A","N/A","N/A","N/A","N/A","N/A","N/A","N/A","N/A","N/A",null,null,null,null,null,null,null,null,null,null,null,null,null,null,null,null,null,null,null,null,null,null,null,null,null,null,"No","N/A","N/A","N/A","N/A","N/A","N/A","N/A","N/A","N/A","N/A","N/A","N/A","N/A","N/A","N/A","N/A","N/A","N/A","N/A","N/A","N/A","N/A","N/A","N/A","N/A"]
["Water source on premises","Yes",20.9,54,70.099999999999994,84.7,92.5,41.8,63.1,78.8,87.3,92.6,7.2,10.199999999999999,11.6,22.2,50.2,56.8,55.3,81.400000000000006,42.3,33.299999999999997,33.700000000000003,50.3,37.6,34.6,34.1,null,null,null,null,null,null,null,null,null,null,null,null,null,null,null,null,null,null,null,null,null,null,null,null,null,"Water source on premises","Yes","N/A","N/A","N/A","N/A","N/A","N/A","N/A","N/A","N/A","N/A","N/A","N/A","N/A","N/A","N/A","N/A","N/A","N/A","N/A","N/A","N/A","N/A","N/A","N/A","N/A"]
[null,"No",79.099999999999994,46,29.9,15.3,7.5,58.2,36.9,21.2,12.7,7.4,92.8,89.8,88.4,77.8,49.8,43.2,44.7,18.600000000000001,57.7,66.7,66.3,49.7,62.4,65.400000000000006,65.900000000000006,null,null,null,null,null,null,null,null,null,null,null,null,null,null,null,null,null,null,null,null,null,null,null,null,null,null,"No","N/A","N/A","N/A","N/A","N/A","N/A","N/A","N/A","N/A","N/A","N/A","N/A","N/A","N/A","N/A","N/A","N/A","N/A","N/A","N/A","N/A","N/A","N/A","N/A","N/A"]
["Improved Water source on premises","Yes",19.899999999999999,53.3,69.8,84.7,92.5,41.2,62.9,78.8,87.3,92.6,5.8,9.3000000000000007,10.6,19.8,48.5,55.6,55.3,81.400000000000006,40.9,33,33.6,48.5,34,34.6,33.799999999999997,null,null,null,null,null,null,null,null,null,null,null,null,null,null,null,null,null,null,null,null,null,null,null,null,null,"Improved water source on premises","Yes","N/A","N/A","N/A","N/A","N/A","N/A","N/A","N/A","N/A","N/A","N/A","N/A","N/A","N/A","N/A","N/A","N/A","N/A","N/A","N/A","N/A","N/A","N/A","N/A","N/A"]
[null,"No",80.099999999999994,46.7,30.2,15.3,7.5,58.8,37.1,21.2,12.7,7.4,94.2,90.7,89.4,80.2,51.5,44.4,44.7,18.600000000000001,59.1,67,66.400000000000006,51.5,66,65.400000000000006,66.2,null,null,null,null,null,null,null,null,null,null,null,null,null,null,null,null,null,null,null,null,null,null,null,null,null,null,"No","N/A","N/A","N/A","N/A","N/A","N/A","N/A","N/A","N/A","N/A","N/A","N/A","N/A","N/A","N/A","N/A","N/A","N/A","N/A","N/A","N/A","N/A","N/A","N/A","N/A"]
["Piped water on premises available when needed","Yes","N/A","N/A","N/A","N/A","N/A","N/A","N/A","N/A","N/A","N/A","N/A","N/A","N/A","N/A","N/A","N/A","N/A","N/A","N/A","N/A","N/A","N/A","N/A","N/A","N/A",null,null,null,null,null,null,null,null,null,null,null,null,null,null,null,null,null,null,null,null,null,null,null,null,null,"Piped water on premises available when needed","Yes","N/A","N/A","N/A","N/A","N/A","N/A","N/A","N/A","N/A","N/A","N/A","N/A","N/A","N/A","N/A","N/A","N/A","N/A","N/A","N/A","N/A","N/A","N/A","N/A","N/A"]
[null,"No","N/A","N/A","N/A","N/A","N/A","N/A","N/A","N/A","N/A","N/A","N/A","N/A","N/A","N/A","N/A","N/A","N/A","N/A","N/A","N/A","N/A","N/A","N/A","N/A","N/A",null,null,null,null,null,null,null,null,null,null,null,null,null,null,null,null,null,null,null,null,null,null,null,null,null,null,"No","N/A","N/A","N/A","N/A","N/A","N/A","N/A","N/A","N/A","N/A","N/A","N/A","N/A","N/A","N/A","N/A","N/A","N/A","N/A","N/A","N/A","N/A","N/A","N/A","N/A"]
["Water point at more than 30 minutes","Yes",29.3,15,6.5,4.7,3.8,24.9,8.9,3.7,4.0999999999999996,4.3,30.8,29.3,31.7,24.9,14.9,17.100000000000001,19.399999999999999,5.4,19.3,21.1,39.4,14.5,15.4,16,17.899999999999999,null,null,null,null,null,null,null,null,null,null,null,null,null,null,null,null,null,null,null,null,null,null,null,null,null,"Water point at more than 30 minutes","Yes","N/A","N/A","N/A","N/A","N/A","N/A","N/A","N/A","N/A","N/A","N/A","N/A","N/A","N/A","N/A","N/A","N/A","N/A","N/A","N/A","N/A","N/A","N/A","N/A","N/A"]
[null,"No",70.7,85,93.5,95.3,96.2,75.099999999999994,91.1,96.3,95.9,95.7,69.2,70.7,68.3,75.099999999999994,85.1,82.9,80.599999999999994,94.6,80.7,78.900000000000006,60.6,85.5,84.6,84,82.1,null,null,null,null,null,null,null,null,null,null,null,null,null,null,null,null,null,null,null,null,null,null,null,null,null,null,"No","N/A","N/A","N/A","N/A","N/A","N/A","N/A","N/A","N/A","N/A","N/A","N/A","N/A","N/A","N/A","N/A","N/A","N/A","N/A","N/A","N/A","N/A","N/A","N/A","N/A"]
["Water source available when needed","Yes","N/A","N/A","N/A","N/A","N/A","N/A","N/A","N/A","N/A","N/A","N/A","N/A","N/A","N/A","N/A","N/A","N/A","N/A","N/A","N/A","N/A","N/A","N/A","N/A","N/A",null,null,null,null,null,null,null,null,null,null,null,null,null,null,null,null,null,null,null,null,null,null,null,null,null,"Water source available when needed","Yes","N/A","N/A","N/A","N/A","N/A","N/A","N/A","N/A","N/A","N/A","N/A","N/A","N/A","N/A","N/A","N/A","N/A","N/A","N/A","N/A","N/A","N/A","N/A","N/A","N/A"]
[null,"No","N/A","N/A","N/A","N/A","N/A","N/A","N/A","N/A","N/A","N/A","N/A","N/A","N/A","N/A","N/A","N/A","N/A","N/A","N/A","N/A","N/A","N/A","N/A","N/A","N/A",null,null,null,null,null,null,null,null,null,null,null,null,null,null,null,null,null,null,null,null,null,null,null,null,null,null,"No","N/A","N/A","N/A","N/A","N/A","N/A","N/A","N/A","N/A","N/A","N/A","N/A","N/A","N/A","N/A","N/A","N/A","N/A","N/A","N/A","N/A","N/A","N/A","N/A","N/A"]
["Improved water source available when needed","Yes","N/A","N/A","N/A","N/A","N/A","N/A","N/A","N/A","N/A","N/A","N/A","N/A","N/A","N/A","N/A","N/A","N/A","N/A","N/A","N/A","N/A","N/A","N/A","N/A","N/A",null,null,null,null,null,null,null,null,null,null,null,null,null,null,null,null,null,null,null,null,null,null,null,null,null,"Improved water source available when needed","Yes","N/A","N/A","N/A","N/A","N/A","N/A","N/A","N/A","N/A","N/A","N/A","N/A","N/A","N/A","N/A","N/A","N/A","N/A","N/A","N/A","N/A","N/A","N/A","N/A","N/A"]
[null,"No","N/A","N/A","N/A","N/A","N/A","N/A","N/A","N/A","N/A","N/A","N/A","N/A","N/A","N/A","N/A","N/A","N/A","N/A","N/A","N/A","N/A","N/A","N/A","N/A","N/A",null,null,null,null,null,null,null,null,null,null,null,null,null,null,null,null,null,null,null,null,null,null,null,null,null,null,"No","N/A","N/A","N/A","N/A","N/A","N/A","N/A","N/A","N/A","N/A","N/A","N/A","N/A","N/A","N/A","N/A","N/A","N/A","N/A","N/A","N/A","N/A","N/A","N/A","N/A"]
["Microbiological quality at point of collection","Not contaminated (No E. coli in 100 mL)","N/A","N/A","N/A","N/A","N/A","N/A","N/A","N/A","N/A","N/A","N/A","N/A","N/A","N/A","N/A","N/A","N/A","N/A","N/A","N/A","N/A","N/A","N/A","N/A","N/A",null,null,null,null,null,null,null,null,null,null,null,null,null,null,null,null,null,null,null,null,null,null,null,null,null,"Microbiological quality at point of collection","Not contaminated (No E. coli in 100 mL)","N/A","N/A","N/A","N/A","N/A","N/A","N/A","N/A","N/A","N/A","N/A","N/A","N/A","N/A","N/A","N/A","N/A","N/A","N/A","N/A","N/A","N/A","N/A","N/A","N/A"]
[null,"Contaminated (E. coli detected in 100 mL)","N/A","N/A","N/A","N/A","N/A","N/A","N/A","N/A","N/A","N/A","N/A","N/A","N/A","N/A","N/A","N/A","N/A","N/A","N/A","N/A","N/A","N/A","N/A","N/A","N/A",null,null,null,null,null,null,null,null,null,null,null,null,null,null,null,null,null,null,null,null,null,null,null,null,null,null,"Contaminated (E. coli detected in 100 mL)","N/A","N/A","N/A","N/A","N/A","N/A","N/A","N/A","N/A","N/A","N/A","N/A","N/A","N/A","N/A","N/A","N/A","N/A","N/A","N/A","N/A","N/A","N/A","N/A","N/A"]
[null,"Highly contaminated (>100 CFU/100 mL)","N/A","N/A","N/A","N/A","N/A","N/A","N/A","N/A","N/A","N/A","N/A","N/A","N/A","N/A","N/A","N/A","N/A","N/A","N/A","N/A","N/A","N/A","N/A","N/A","N/A",null,null,null,null,null,null,null,null,null,null,null,null,null,null,null,null,null,null,null,null,null,null,null,null,null,null,"Highly contaminated (>100 CFU/100 mL)","N/A","N/A","N/A","N/A","N/A","N/A","N/A","N/A","N/A","N/A","N/A","N/A","N/A","N/A","N/A","N/A","N/A","N/A","N/A","N/A","N/A","N/A","N/A","N/A","N/A"]
["Microbiological quality of improved water sources at point of collection","Not contaminated (No E. coli in 100 mL)","N/A","N/A","N/A","N/A","N/A","N/A","N/A","N/A","N/A","N/A","N/A","N/A","N/A","N/A","N/A","N/A","N/A","N/A","N/A","N/A","N/A","N/A","N/A","N/A","N/A",null,null,null,null,null,null,null,null,null,null,null,null,null,null,null,null,null,null,null,null,null,null,null,null,null,"Microbiological quality of improved water sources at point of collection","Not contaminated (No E. coli in 100 mL)","N/A","N/A","N/A","N/A","N/A","N/A","N/A","N/A","N/A","N/A","N/A","N/A","N/A","N/A","N/A","N/A","N/A","N/A","N/A","N/A","N/A","N/A","N/A","N/A","N/A"]
[null,"Contaminated (E. coli detected in 100 mL)","N/A","N/A","N/A","N/A","N/A","N/A","N/A","N/A","N/A","N/A","N/A","N/A","N/A","N/A","N/A","N/A","N/A","N/A","N/A","N/A","N/A","N/A","N/A","N/A","N/A",null,null,null,null,null,null,null,null,null,null,null,null,null,null,null,null,null,null,null,null,null,null,null,null,null,null,"Contaminated (E. coli detected in 100 mL)","N/A","N/A","N/A","N/A","N/A","N/A","N/A","N/A","N/A","N/A","N/A","N/A","N/A","N/A","N/A","N/A","N/A","N/A","N/A","N/A","N/A","N/A","N/A","N/A","N/A"]
[null,"Highly contaminated (>100 CFU/100 mL)","N/A","N/A","N/A","N/A","N/A","N/A","N/A","N/A","N/A","N/A","N/A","N/A","N/A","N/A","N/A","N/A","N/A","N/A","N/A","N/A","N/A","N/A","N/A","N/A","N/A",null,null,null,null,null,null,null,null,null,null,null,null,null,null,null,null,null,null,null,null,null,null,null,null,null,null,"Highly contaminated (>100 CFU/100 mL)","N/A","N/A","N/A","N/A","N/A","N/A","N/A","N/A","N/A","N/A","N/A","N/A","N/A","N/A","N/A","N/A","N/A","N/A","N/A","N/A","N/A","N/A","N/A","N/A","N/A"]
["Microbiological quality of piped on premises at point of collection","Not contaminated (No E. coli in 100 mL)","N/A","N/A","N/A","N/A","N/A","N/A","N/A","N/A","N/A","N/A","N/A","N/A","N/A","N/A","N/A","N/A","N/A","N/A","N/A","N/A","N/A","N/A","N/A","N/A","N/A",null,null,null,null,null,null,null,null,null,null,null,null,null,null,null,null,null,null,null,null,null,null,null,null,null,"Microbiological quality of piped on premises at point of collection","Not contaminated (No E. coli in 100 mL)","N/A","N/A","N/A","N/A","N/A","N/A","N/A","N/A","N/A","N/A","N/A","N/A","N/A","N/A","N/A","N/A","N/A","N/A","N/A","N/A","N/A","N/A","N/A","N/A","N/A"]
[null,"Contaminated (E. coli detected in 100 mL)","N/A","N/A","N/A","N/A","N/A","N/A","N/A","N/A","N/A","N/A","N/A","N/A","N/A","N/A","N/A","N/A","N/A","N/A","N/A","N/A","N/A","N/A","N/A","N/A","N/A",null,null,null,null,null,null,null,null,null,null,null,null,null,null,null,null,null,null,null,null,null,null,null,null,null,null,"Contaminated (E. coli detected in 100 mL)","N/A","N/A","N/A","N/A","N/A","N/A","N/A","N/A","N/A","N/A","N/A","N/A","N/A","N/A","N/A","N/A","N/A","N/A","N/A","N/A","N/A","N/A","N/A","N/A","N/A"]
[null,"Highly contaminated (>100 CFU/100 mL)","N/A","N/A","N/A","N/A","N/A","N/A","N/A","N/A","N/A","N/A","N/A","N/A","N/A","N/A","N/A","N/A","N/A","N/A","N/A","N/A","N/A","N/A","N/A","N/A","N/A",null,null,null,null,null,null,null,null,null,null,null,null,null,null,null,null,null,null,null,null,null,null,null,null,null,null,"Highly contaminated (>100 CFU/100 mL)","N/A","N/A","N/A","N/A","N/A","N/A","N/A","N/A","N/A","N/A","N/A","N/A","N/A","N/A","N/A","N/A","N/A","N/A","N/A","N/A","N/A","N/A","N/A","N/A","N/A"]
[null,null,"NATIONAL wealth index quintile",null,null,null,null,"URBAN wealth index quintile",null,null,null,null,"RURAL wealth index quintile",null,null,null,null,"SUB-REGIONS:",null,null,null,null,null,null,null,null,null,null,null,null,null,null,null,null,null,null,null,null,null,null,null,null,null,null,null,null,null,null,null,null,null,null,"Raw numbers of respondents:","Use of drinking water sources","NATIONAL wealth index quintile",null,null,null,null,"URBAN wealth index quintile",null,null,null,null,"RURAL wealth index quintile",null,null,null,null,"SUB-REGIONS:"]
["Percentage based on weighted population",null,"Poorest","Poor","Middle","Rich","Richest","Poorest","Poor","Middle","Rich","Richest","Poorest","Poor","Middle","Rich","Richest","Estuaire","Haut-Ogooué","Libreville-Port-Gentil","Moyen-Ogooué","Ngounié","Nyanga","Ogooué Maritime","Ogooué-Ivindo","Ogooué-Lolo","Woleu-Ntem",null,null,null,null,null,null,null,null,null,null,null,null,null,null,null,null,null,null,null,null,null,null,null,null,null,"Water data, raw numbers (weighted)",null,"Poorest","Poor","Middle","Rich","Richest","Poorest","Poor","Middle","Rich","Richest","Poorest","Poor","Middle","Rich","Richest","Estuaire","Haut-Ogooué","Libreville-Port-Gentil","Moyen-Ogooué","Ngounié","Nyanga","Ogooué Maritime","Ogooué-Ivindo","Ogooué-Lolo","Woleu-Ntem"]
["Source of drinking water","Piped into dwelling",0.8,4.0999999999999996,13.8,38.799999999999997,78.400000000000006,1.9,7.7,19.899999999999999,45.7,80.8,0.3,0,1.7,0.3,25.6,25.3,24.2,36.700000000000003,14.2,8.5,11.1,18.7,4.5999999999999996,8.6,8.9]
[null,"Piped to yard/plot",14.8,48.7,54.3,45.8,14.2,38.1,55,57,41.5,11.9,1,2.1,3,12.5,22,26.5,30.9,44.2,19.8,23.5,21.8,25.9,23.6,24.8,24]
[null,"Public tap/standpipe",27.7,38.200000000000003,25.8,13.2,4.5999999999999996,46.4,34.1,19.7,11.1,4.2,4,6.3,9.9,26.2,31.3,25.4,30,16.399999999999999,32.299999999999997,32.700000000000003,43.6,22.6,10.1,27.4,29]
[null,"Protected well into yard/plot",1.4,0.4,0,0.1,0.1,1,0.2,0.1,0,0.1,1.2,0.6,1.3,1.8,0.3,0.4,0,0,0.8,0.3,0.1,0.7,5.8,1,0.8]
[null,"Village hydraulics / other protected well",11.4,1,0.6,0.2,0,1.3,0.1,0.1,0,0,16.600000000000001,19.399999999999999,23.4,11.1,5.5,1.9,2.6,0,0.8,15.9,1.1000000000000001,1.9,3.2,4,15.6]
[null,"Unprotected well into yard",1,0.6,0.3,0,0,0.7,0.3,0,0,0,1.4,0.9,0.9,2.4,1.7,1.2,0,0,1.4,0.3,0.2,1.9,3.6,0,0.3]
[null,"Public unprotected well",5.5,0.8,0.2,0,0.3,3.2,0.4,0,0,0.3,6.9,5.0999999999999996,4.9000000000000004,4,1.7,2.8,3.4,0,2.9,0.3,0.7,1.7,9.6,1.7,3.4]
[null,"Protected spring",15.2,1.8,0.8,0.3,0,3.8,0.2,0.7,0.1,0,24.8,23.5,23,14.2,4.0999999999999996,4.7,1.5,0,4.5,7.4,2,14.9,26.4,10.4,14.4]
[null,"River/dam/lake/ponds/stream/canal/irrigation channel",19,2.7,0.6,0.2,0,2.2000000000000002,0.4,0.2,0,0,40.5,35.299999999999997,26.7,19.8,5.2,8.1999999999999993,6.1,0,15.8,10,18.399999999999999,6.8,12.9,18.899999999999999,3.2]
[null,"Rainwater",3,0.5,1.8,0,0,0.3,0.2,1.9,0,0,3.3,6.7,4.7,5.3,0.7,3.5,0.3,0.6,6.2,0.9,1,3.3,0,0.3,0.1]
[null,"Tanker truck",0,0,0,0,0,0,0,0,0,0.1,0.1,0.1,0,0,0,0,0,0,0,0,0,0.1,0,0.2,0]
[null,"Bottled water",0.2,0.2,0.5,0.4,1.1000000000000001,0.1,0.3,0.3,0.5,1.2,0,0,0.3,0.4,0.8,0.1,0.3,0.7,0.6,0.3,0,0.7,0,0.3,0.2]
[null,"Other",0.1,1.2,1.2,0.8,1.2,1.1000000000000001,1.2,0.2,0.9,1.4,0,0.2,0.1,1.9,1.2,0,0.4,1.4,0.5,0.1,0,1,0,2.6,0]
[]
[]
[]
[]
[]
[]
[]
[]
[]
[]
[]
[]
[]
[]
[]
[]
[]
[]
[]
[]
[]
[]
[]
[]
[]
[]
[]
[]
[]
[]
[]
[]
[]
[]
[]
[]
[]
[{"$f":"A1026","v":"Gabon"}]
[{"$f":"A1034","v":"2012"}]
["Use of sanitation facilities"]
[" by wealth quintile and sub-national region"]
["Notes:"]
["WHO/UNICEF JMP customised wealth index excludes water,"]
[" sanitation and hygiene assets."]
["Survey used for analysis:",{"$f":"A1025","v":"DHS12"}]
[{"$f":"B1030","v":""}]
[{"$f":"B1029","v":""}]
[]
[]
["Use of sanitation facilities",null,"NATIONAL wealth index quintile",null,null,null,null,"URBAN wealth index quintile",null,null,null,null,"RURAL wealth index quintile",null,null,null,null,"SUB-REGIONS:",null,null,null,null,null,null,null,null,null,null,null,null,null,null,null,null,null,null,null,null,null,null,null,null,null,null,null,null,null,null,null,null,null,null,"Raw numbers of respondents:","Use of sanitation facilities","NATIONAL wealth index quintile",null,null,null,null,"URBAN wealth index quintile",null,null,null,null,"RURAL wealth index quintile",null,null,null,null,"SUB-REGIONS:"]
["Weighted percentage (used in graphs)",null,"Poorest","Poor","Middle","Rich","Richest","Poorest","Poor","Middle","Rich","Richest","Poorest","Poor","Middle","Rich","Richest","Estuaire","Haut-Ogooué","Libreville-Port-Gentil","Moyen-Ogooué","Ngounié","Nyanga","Ogooué Maritime","Ogooué-Ivindo","Ogooué-Lolo","Woleu-Ntem",null,null,null,null,null,null,null,null,null,null,null,null,null,null,null,null,null,null,null,null,null,null,null,null,null,"Sanitation data, raw numbers (weighted)",null,"Poorest","Poor","Middle","Rich","Richest","Poorest","Poor","Middle","Rich","Richest","Poorest","Poor","Middle","Rich","Richest","Estuaire","Haut-Ogooué","Libreville-Port-Gentil","Moyen-Ogooué","Ngounié","Nyanga","Ogooué Maritime","Ogooué-Ivindo","Ogooué-Lolo","Woleu-Ntem"]
["Sanitation","Improved",{"$f":"C153+C154+(C155+C156)*0.5","v":40.554674832962988},{"$f":"D153+D154+(D155+D156)*0.5","v":52.145984064109768},61.295966975044763,76.802416102975172,94.15598160277959,45.583775205593696,56.012735699457068,66.926459639165884,78.342001390473627,96.499466726868519,38.040658161795974,38.691033687191215,39.687089698197937,45.269808677204814,65.024571423698006,65.707962149869502,50.831236471709161,74.194592817009863,44.775652863744867,46.131527565558429,55.394765866894119,62.37346953491177,50.988679249894133,54.845898621252921,52.220562350501339,null,null,null,null,null,null,null,null,null,null,null,null,null,null,null,null,null,null,null,null,null,null,null,null,null,"Sanitation","Improved",894.91381299999932,4018.3288489999973,5818.9616869999982,7035.8854139999949,7914.8463709999933,2034.4606049999995,4222.2507189999951,5480.4346090000035,5951.9652829999977,6777.5602829999943,21.725770000000001,49.873854000000023,95.416765000000069,287.23072600000029,762.01752000000033,2633.8944510000033,1626.6494849999992,18702.364342000081,424.90928099999996,568.73143499999992,360.4892209999997,293.4670500000006,164.80097400000008,367.91390799999999,539.71598699999936]
[null,"Not Improved",{"$f":"100-C122","v":59.445325167037012},{"$f":"100-D122","v":47.854015935890232},38.704033024955237,23.197583897024828,5.8440183972204096,54.416224794406304,43.987264300542932,33.073540360834116,21.657998609526373,3.5005332731314809,61.959341838204026,61.308966312808785,60.312910301802063,54.730191322795186,34.975428576301994,34.292037850130498,49.168763528290839,25.805407182990137,55.224347136255133,53.868472434441571,44.605234133105881,37.62653046508823,49.011320750105867,45.154101378747079,47.779437649498661,null,null,null,null,null,null,null,null,null,null,null,null,null,null,null,null,null,null,null,null,null,null,null,null,null,null,"Not Improved",7314.8067850000025,4192.5595469999989,2393.3245169999977,1172.9383840000005,296.87999399999995,4877.4560820000079,2667.6559009999996,1453.1348379999995,956.379232,138.92825200000001,1276.6910709999991,1249.0199540000003,1203.3764280000014,1009.9879869999993,537.8794819999996,1849.6245840000004,2159.1336309999997,3325.0143550000012,910.06984999999997,1987.7200630000013,748.01877500000012,192.38125899999983,1313.4488849999975,1128.9978450000003,1756.0999800000022]
["Sanitation ladder","Basic",{"$f":"C122*C129/100","v":14.65589527425943},{"$f":"D122*D129/100","v":15.289592396866082},{"$f":"E122*E129/100","v":24.908875567845399},50.433301127280671,85.831976552658475,12.901321186239159,18.009426173238065,30.285298468592011,55.860381803069338,88.167996005504136,18.504818951927664,14.886751184537218,25.222748964661381,28.535751378943427,49.137623451687979,42.416396532544489,36.935849498859241,42.935130508095888,26.442405227853683,34.274834586897448,40.851533765884682,40.345906515588986,34.566786169429882,42.710879239377029,43.618808385753894,null,null,null,null,null,null,null,null,null,null,null,null,null,null,null,null,null,null,null,null,null,null,null,null,null,"Sanitation ladder","Basic",319.34232000000014,1175.2647730000001,2360.760975000002,4620.2052720000002,7137.2333049999952,575.80201699999986,1351.2501390000002,2479.984729000003,4218.2547150000009,6147.2580799999951,10.568467000000002,19.012776000000002,53.780589999999975,181.05542799999995,575.8397040000001,1686.7332629999999,1173.9071309999993,10774.252465999996,250.93153699999996,422.55647900000002,265.84709499999991,189.53039199999984,111.72362400000003,286.51051200000001,450.81414599999988]
[null,"Limited",{"$f":"C122*C128/100","v":25.898779558703595},{"$f":"D122*D128/100","v":36.856391667243706},{"$f":"E122*E128/100","v":36.38709140719935},26.369114975694515,8.3240050501211478,32.682454019354537,38.003309526219041,36.641161170573824,22.481619587404342,8.3314707213643935,19.53583920986831,23.804282502653987,14.464340733536522,16.734057298261334,15.88694797201001,23.291565617324963,13.895386972849927,31.259462308913665,18.333247635891176,11.856692978660995,14.543232101009469,22.027563019322592,16.421893080464248,12.135019381875892,8.6017539647475019,null,null,null,null,null,null,null,null,null,null,null,null,null,null,null,null,null,null,null,null,null,null,null,null,null,null,"Limited",564.31737499999997,2833.0394729999985,3448.6191539999945,2415.6801419999965,692.17054599999994,1458.658588,2851.3944189999984,3000.449879999996,1697.6825929999995,580.88765799999999,11.157302999999999,30.401898000000003,30.841237000000007,106.17529799999998,186.17781599999995,926.21395700000073,441.62768900000015,7844.3301530000044,173.97774399999997,146.17495600000001,94.64212599999999,103.47747799999988,53.077350000000031,81.403395999999972,88.901840999999976]
[null,"Unimproved",{"$f":"100-C124-C125-C127","v":53.570814571977479},{"$f":"100-D124-D125-D127","v":45.344039850496642},{"$f":"100-E124-E125-E127","v":37.028105743250222},21.578077323715366,5.7929982251579535,49.868205319703399,42.560890452924241,31.318347412523032,19.917521664033352,3.5005332731314702,53.796730136527856,55.249469261256039,55.624240673130906,51.421732265744929,33.40699715684098,33.309687023624946,37.149140642476766,24.145869872715025,53.803954295672227,53.143450269362333,41.809121871232733,36.483154219428833,48.98154797540743,44.65899383582434,46.976892050685805,null,null,null,null,null,null,null,null,null,null,null,null,null,null,null,null,null,null,null,null,null,null,null,null,null,null,"Unimproved",6833.1870029999918,3986.7198270000004,2255.8531519999997,1039.9959430000001,292.73394999999994,4563.1007650000092,2569.6597319999987,1331.4373159999991,836.768147,138.92825200000001,1170.7063459999997,1170.3413460000006,1142.9864450000023,967.0700369999995,517.49148899999989,1805.7864730000008,1705.4327180000009,2960.8521759999981,891.10790200000019,1969.1852230000011,717.02364700000032,186.83143499999983,1313.0087689999973,1121.5865220000003,1737.6750100000022]
[null,"Open defecation",5.8745105950594878,2.5099760853935686,1.675927281705029,1.6195065733094465,5.1020172062424478E-2,4.5480194747029055,1.4263738476186474,1.7551929483111419,1.7404769454929703,0,8.1626117016761697,6.0594970515527553,4.6886696286711906,3.308459057050305,1.5684314194610309,0.98235082650560157,12.019622885814069,1.6595373102754201,1.4203928405829096,0.72502216507923034,2.7961122618731209,1.1433762456595911,2.9772774698434874E-2,0.49510754292273901,0.80254559881279863,null,null,null,null,null,null,null,null,null,null,null,null,null,null,null,null,null,null,null,null,null,null,null,null,null,null,"Open defecation",481.61978199999999,205.83971999999997,137.47136500000002,132.942441,4.1460439999999998,314.35531700000001,97.996168999999995,121.69752199999999,119.611085,0,105.984725,78.678608000000011,60.389983000000015,42.917950000000005,20.387993000000002,43.838110999999998,453.70091300000001,364.16217900000009,18.961948,18.534839999999999,30.995128000000001,5.549824000000001,0.44011600000000001,7.4113230000000012,18.424969999999998]
["Shared among Improved Sanitation","Yes",63.861391233873178,70.679252350346673,59.36294539902358,34.333704997430452,8.840654527120785,71.697558773815643,67.847622601635237,54.748393039352003,28.696764428254834,8.6336961269907704,51.355155651560324,61.524028267392779,36.44595974038706,36.965160196684486,24.432222503230616,35.447097817766092,27.336315103378606,42.131725671721888,40.944679671517925,25.701930121024525,26.253801913261665,35.315596813150329,32.206939505102682,22.125664246430166,16.471967320100912,null,null,null,null,null,null,null,null,null,null,null,null,null,null,null,null,null,null,null,null,null,null,null,null,null,"Shared among improved sanitation facilities","Yes","N/A","N/A","N/A","N/A","N/A","N/A","N/A","N/A","N/A","N/A","N/A","N/A","N/A","N/A","N/A","N/A","N/A","N/A","N/A","N/A","N/A","N/A","N/A","N/A","N/A"]
[null,"No",36.138608766126922,29.320747649653363,40.637054600976391,65.666295002569569,91.159345472879252,28.302441226184371,32.152377398364834,45.251606960647919,71.303235571745233,91.366303873009244,48.644844348439669,38.475971732607192,63.554040259612854,63.034839803315393,75.567777496769352,64.552902182233822,72.663684896621405,57.8682743282777,59.055320328482061,74.298069878975497,73.746198086738389,64.684403186849366,67.793060494897304,77.874335753569838,83.528032679899184,null,null,null,null,null,null,null,null,null,null,null,null,null,null,null,null,null,null,null,null,null,null,null,null,null,null,"No","N/A","N/A","N/A","N/A","N/A","N/A","N/A","N/A","N/A","N/A","N/A","N/A","N/A","N/A","N/A","N/A","N/A","N/A","N/A","N/A","N/A","N/A","N/A","N/A","N/A"]
["Manually calculated ratios","Improved latrines",{"$f":"(C155+0.5*C156)/(C155+C156)*100","v":55.848388637449162},{"$f":"(D155+0.5*D156)/(D155+D156)*100","v":72.813981848701232},82.3558121501069,87.003620271558546,87.099299823091741,64.460924953238447,78.603578818613101,85.740341028888395,87.300774368247247,86.751984050807849,50.703835511816941,52.059922750825649,53.640483528574393,60.377034759978542,68.824161822945101,68.595735479902515,66.77306895972599,87.853712097989572,63.636324767233667,57.802432641050039,60.550797464257158,73.480355042153207,52.740044022802849,57.137025823247853,56.436550015290742]
[null,"Other"]
[null,"Other"]
[null,null,"NATIONAL wealth index quintile",null,null,null,null,"URBAN wealth index quintile",null,null,null,null,"RURAL wealth index quintile",null,null,null,null,"SUB-REGIONS:",null,null,null,null,null,null,null,null,null,null,null,null,null,null,null,null,null,null,null,null,null,null,null,null,null,null,null,null,null,null,null,null,null,null,"Raw numbers of respondents:","Use of sanitation facilities","NATIONAL wealth index quintile",null,null,null,null,"URBAN wealth index quintile",null,null,null,null,"RURAL wealth index quintile",null,null,null,null,"SUB-REGIONS:"]
["Percentage based on weighted population",null,"Poorest","Poor","Middle","Rich","Richest","Poorest","Poor","Middle","Rich","Richest","Poorest","Poor","Middle","Rich","Richest","Estuaire","Haut-Ogooué","Libreville-Port-Gentil","Moyen-Ogooué","Ngounié","Nyanga","Ogooué Maritime","Ogooué-Ivindo","Ogooué-Lolo","Woleu-Ntem",null,null,null,null,null,null,null,null,null,null,null,null,null,null,null,null,null,null,null,null,null,null,null,null,null,"Sanitation data, raw numbers (weighted)",null,"Poorest","Poor","Middle","Rich","Richest","Poorest","Poor","Middle","Rich","Richest","Poorest","Poor","Middle","Rich","Richest","Estuaire","Haut-Ogooué","Libreville-Port-Gentil","Moyen-Ogooué","Ngounié","Nyanga","Ogooué Maritime","Ogooué-Ivindo","Ogooué-Lolo","Woleu-Ntem"]
["Sanitation type","Sewer connection",0.87757292273200582,7.280165557861026,18.89446842761301,50.474958215201418,88.210958354309469,4.1558536511335671,10.840462464787358,27.40787561913341,55.738373898974643,91.942765694181844,0,0,0.15602114416070828,1.6240741664354907,33.935641079353722,29.467260040304421,25.897774646845345,45.593484690794185,14.437452281042393,11.331104901721091,14.387987328509988,19.173127553275009,4.5923223727498579,10.992558423716245,12.909552911041319,null,null,null,null,null,null,null,null,null,null,null,null,null,null,null,null,null,null,null,null,null,null,null,null,null,"Sanitation type","Sewer connection","N/A","N/A","N/A","N/A","N/A","N/A","N/A","N/A","N/A","N/A","N/A","N/A","N/A","N/A","N/A","N/A","N/A","N/A","N/A","N/A","N/A","N/A","N/A","N/A","N/A"]
[null,"Septic tank connection",0,0,0,0,0,0,0,0,0,0,0,0,0,0,0,0,0,0,0,0,0,0,0,0,0,null,null,null,null,null,null,null,null,null,null,null,null,null,null,null,null,null,null,null,null,null,null,null,null,null,null,"Septic tank connection","N/A","N/A","N/A","N/A","N/A","N/A","N/A","N/A","N/A","N/A","N/A","N/A","N/A","N/A","N/A","N/A","N/A","N/A","N/A","N/A","N/A","N/A","N/A","N/A","N/A"]
[null,"Improved latrines",10.023088096328911,41.658860954270772,51.962313014876486,35.236290888649968,8.1737239791720793,25.278248308261169,50.441220319470695,51.634162553156827,30.417799552951241,6.0485813412831799,1.6732507861856989,3.8397175883680865,7.1905499276819702,20.517968892420647,24.685735754931741,29.278881783536338,17.069543742980741,39.311599110879719,17.391455836922685,10.915803965704665,18.132231046171004,41.229892188427783,6.5560618463756102,13.585637803459747,10.599125256453966,null,null,null,null,null,null,null,null,null,null,null,null,null,null,null,null,null,null,null,null,null,null,null,null,null,null,"Improved latrines","N/A","N/A","N/A","N/A","N/A","N/A","N/A","N/A","N/A","N/A","N/A","N/A","N/A","N/A","N/A","N/A","N/A","N/A","N/A","N/A","N/A","N/A","N/A","N/A","N/A"]
[null,"Unimproved facilities",83.232881331730795,48.554061810682519,27.46924663805833,12.66924432283936,3.5648283562843752,66.01787856590245,37.296002307793195,19.202768879398484,12.112426431298227,2.0086529645349889,90.164137512138183,90.102927490435775,88.003729243443928,74.549497884093299,39.810191746253402,40.276096943123562,45.048347085501632,13.441690982519097,66.750699041451711,77.028068967495159,64.683669363445929,38.454684628736544,88.821843006176195,74.926696229901268,75.688776233691996,null,null,null,null,null,null,null,null,null,null,null,null,null,null,null,null,null,null,null,null,null,null,null,null,null,null,"Unimproved facilities","N/A","N/A","N/A","N/A","N/A","N/A","N/A","N/A","N/A","N/A","N/A","N/A","N/A","N/A","N/A","N/A","N/A","N/A","N/A","N/A","N/A","N/A","N/A","N/A","N/A"]
[null,"Open defecation",5.8664576492083018,2.5069116771855815,1.6739719194521139,1.6195065733094465,5.0489310234097202E-2,4.5480194747029055,1.4223149079486348,1.7551929483111419,1.731400116776026,0,8.1626117016761697,6.0573549211961435,4.6496996847133847,3.308459057050305,1.5684314194610309,0.97776123303555762,11.984334524672212,1.6532252158065222,1.4203928405829096,0.72502216507923034,2.7961122618731209,1.1422956295603757,2.9772774698434874E-2,0.49510754292273901,0.80254559881279863,null,null,null,null,null,null,null,null,null,null,null,null,null,null,null,null,null,null,null,null,null,null,null,null,null,null,"Open defecation","N/A","N/A","N/A","N/A","N/A","N/A","N/A","N/A","N/A","N/A","N/A","N/A","N/A","N/A","N/A","N/A","N/A","N/A","N/A","N/A","N/A","N/A","N/A","N/A","N/A"]
["Septic tank emptying practices","Not emptied/treated and disposed in situ","N/A","N/A","N/A","N/A","N/A","N/A","N/A","N/A","N/A","N/A","N/A","N/A","N/A","N/A","N/A","N/A","N/A","N/A","N/A","N/A","N/A","N/A","N/A","N/A","N/A",null,null,null,null,null,null,null,null,null,null,null,null,null,null,null,null,null,null,null,null,null,null,null,null,null,"Septic tank emptying practices","Not emptied/treated and disposed in situ","N/A","N/A","N/A","N/A","N/A","N/A","N/A","N/A","N/A","N/A","N/A","N/A","N/A","N/A","N/A","N/A","N/A","N/A","N/A","N/A","N/A","N/A","N/A","N/A","N/A"]
[null,"Emptied and buried on site","N/A","N/A","N/A","N/A","N/A","N/A","N/A","N/A","N/A","N/A","N/A","N/A","N/A","N/A","N/A","N/A","N/A","N/A","N/A","N/A","N/A","N/A","N/A","N/A","N/A",null,null,null,null,null,null,null,null,null,null,null,null,null,null,null,null,null,null,null,null,null,null,null,null,null,null,"Emptied and buried on site","N/A","N/A","N/A","N/A","N/A","N/A","N/A","N/A","N/A","N/A","N/A","N/A","N/A","N/A","N/A","N/A","N/A","N/A","N/A","N/A","N/A","N/A","N/A","N/A","N/A"]
[null,"Emptied and discharged locally","N/A","N/A","N/A","N/A","N/A","N/A","N/A","N/A","N/A","N/A","N/A","N/A","N/A","N/A","N/A","N/A","N/A","N/A","N/A","N/A","N/A","N/A","N/A","N/A","N/A",null,null,null,null,null,null,null,null,null,null,null,null,null,null,null,null,null,null,null,null,null,null,null,null,null,null,"Emptied and discharged locally","N/A","N/A","N/A","N/A","N/A","N/A","N/A","N/A","N/A","N/A","N/A","N/A","N/A","N/A","N/A","N/A","N/A","N/A","N/A","N/A","N/A","N/A","N/A","N/A","N/A"]
[null,"Emptied and removed offsite","N/A","N/A","N/A","N/A","N/A","N/A","N/A","N/A","N/A","N/A","N/A","N/A","N/A","N/A","N/A","N/A","N/A","N/A","N/A","N/A","N/A","N/A","N/A","N/A","N/A",null,null,null,null,null,null,null,null,null,null,null,null,null,null,null,null,null,null,null,null,null,null,null,null,null,null,"Emptied and removed offsite","N/A","N/A","N/A","N/A","N/A","N/A","N/A","N/A","N/A","N/A","N/A","N/A","N/A","N/A","N/A","N/A","N/A","N/A","N/A","N/A","N/A","N/A","N/A","N/A","N/A"]
["Latrine emptying practices","Not emptied/treated and disposed in situ","N/A","N/A","N/A","N/A","N/A","N/A","N/A","N/A","N/A","N/A","N/A","N/A","N/A","N/A","N/A","N/A","N/A","N/A","N/A","N/A","N/A","N/A","N/A","N/A","N/A",null,null,null,null,null,null,null,null,null,null,null,null,null,null,null,null,null,null,null,null,null,null,null,null,null,"Latrine emptying practices","Not emptied/treated and disposed in situ","N/A","N/A","N/A","N/A","N/A","N/A","N/A","N/A","N/A","N/A","N/A","N/A","N/A","N/A","N/A","N/A","N/A","N/A","N/A","N/A","N/A","N/A","N/A","N/A","N/A"]
[null,"Emptied and buried on site","N/A","N/A","N/A","N/A","N/A","N/A","N/A","N/A","N/A","N/A","N/A","N/A","N/A","N/A","N/A","N/A","N/A","N/A","N/A","N/A","N/A","N/A","N/A","N/A","N/A",null,null,null,null,null,null,null,null,null,null,null,null,null,null,null,null,null,null,null,null,null,null,null,null,null,null,"Emptied and buried on site","N/A","N/A","N/A","N/A","N/A","N/A","N/A","N/A","N/A","N/A","N/A","N/A","N/A","N/A","N/A","N/A","N/A","N/A","N/A","N/A","N/A","N/A","N/A","N/A","N/A"]
[null,"Emptied and discharged locally","N/A","N/A","N/A","N/A","N/A","N/A","N/A","N/A","N/A","N/A","N/A","N/A","N/A","N/A","N/A","N/A","N/A","N/A","N/A","N/A","N/A","N/A","N/A","N/A","N/A",null,null,null,null,null,null,null,null,null,null,null,null,null,null,null,null,null,null,null,null,null,null,null,null,null,null,"Emptied and discharged locally","N/A","N/A","N/A","N/A","N/A","N/A","N/A","N/A","N/A","N/A","N/A","N/A","N/A","N/A","N/A","N/A","N/A","N/A","N/A","N/A","N/A","N/A","N/A","N/A","N/A"]
[null,"Emptied and removed offsite","N/A","N/A","N/A","N/A","N/A","N/A","N/A","N/A","N/A","N/A","N/A","N/A","N/A","N/A","N/A","N/A","N/A","N/A","N/A","N/A","N/A","N/A","N/A","N/A","N/A",null,null,null,null,null,null,null,null,null,null,null,null,null,null,null,null,null,null,null,null,null,null,null,null,null,null,"Emptied and removed offsite","N/A","N/A","N/A","N/A","N/A","N/A","N/A","N/A","N/A","N/A","N/A","N/A","N/A","N/A","N/A","N/A","N/A","N/A","N/A","N/A","N/A","N/A","N/A","N/A","N/A"]
["Shared among improved sanitation facilities","Yes",6.8737707728747308,34.50344635520969,41.993411680175683,29.427847416929044,8.42905030238426,21.103532551881862,41.385095274339079,43.274245724880132,24.574376528469962,8.3985920754511962,0.85930054568662262,2.3405991939257893,2.3746072250934525,8.1848416875250347,14.322505222609921,20.658191696514105,11.665424972009928,35.611727845167131,13.032244471842565,5.7178849711937758,8.5377937138488633,21.298309798171935,3.5905533612501555,5.438089175053725,3.8723417851375173,null,null,null,null,null,null,null,null,null,null,null,null,null,null,null,null,null,null,null,null,null,null,null,null,null,"Shared among improved sanitation facilities","Yes","N/A","N/A","N/A","N/A","N/A","N/A","N/A","N/A","N/A","N/A","N/A","N/A","N/A","N/A","N/A","N/A","N/A","N/A","N/A","N/A","N/A","N/A","N/A","N/A","N/A"]
[null,"No",3.8898074080352583,14.313491017275782,28.746696307906717,56.283401686922232,86.915138032610287,8.3305694075128773,19.612023987053671,35.767792447410095,61.060283051040152,88.878309403573681,0.81395024049907627,1.4637667746892511,4.1408124318680404,13.95720137133109,44.298871611675558,37.620744995900239,31.008303831211808,48.91300328652963,18.796663646122507,16.52902389623198,23.982424660832123,39.010198963149925,7.5578308578753157,19.140107052122261,19.636336382357765,null,null,null,null,null,null,null,null,null,null,null,null,null,null,null,null,null,null,null,null,null,null,null,null,null,null,"No","N/A","N/A","N/A","N/A","N/A","N/A","N/A","N/A","N/A","N/A","N/A","N/A","N/A","N/A","N/A","N/A","N/A","N/A","N/A","N/A","N/A","N/A","N/A","N/A","N/A"]
[null,"DK/missing",89.236421819090154,51.183062627514431,29.259892011917465,14.288750896148811,4.6558116650054782,70.565898040605333,39.002880738607132,20.957961827709632,14.365340420490039,2.7230985209751406,98.326749213814296,96.195634031384941,93.484580343038431,77.857956941143584,41.378623165714416,41.721063307585524,57.326271196778123,15.475268868302702,68.171091882034602,77.753091132574397,67.479781625319035,39.691491238677841,88.851615780874639,75.42180377282402,76.491321832504795,null,null,null,null,null,null,null,null,null,null,null,null,null,null,null,null,null,null,null,null,null,null,null,null,null,null,"DK/missing","N/A","N/A","N/A","N/A","N/A","N/A","N/A","N/A","N/A","N/A","N/A","N/A","N/A","N/A","N/A","N/A","N/A","N/A","N/A","N/A","N/A","N/A","N/A","N/A","N/A"]
["Shared among all sanitation facilities","Yes",42.696090146347913,65.346959809042289,59.181981881727182,36.557989406827303,10.436335990625278,61.693275632235633,67.226906419647023,56.448896960140594,31.589005417760259,9.6132679268585015,20.86411584036874,29.842601698454494,32.038688110312599,36.626925499207381,28.015508564504334,42.1102213650883,41.250769046528184,46.135090427110129,45.219687758438532,35.956057387602414,41.973349036607473,43.038297736874902,36.478594051331889,37.124090591903972,27.284001860836359,null,null,null,null,null,null,null,null,null,null,null,null,null,null,null,null,null,null,null,null,null,null,null,null,null,"Shared among all sanitation facilities","Yes","N/A","N/A","N/A","N/A","N/A","N/A","N/A","N/A","N/A","N/A","N/A","N/A","N/A","N/A","N/A","N/A","N/A","N/A","N/A","N/A","N/A","N/A","N/A","N/A","N/A"]
[null,"No",57.051506624651779,34.437599289870931,40.699358332370068,62.978298283091029,88.52264440727123,38.216661908822765,32.45170313862841,43.551103039859328,67.32865968490384,89.672286516701362,79.076063144210053,69.893279480537572,66.780189062978806,63.373074500792448,71.984491435495585,57.2683980115685,58.415665803428475,53.305294711914044,54.780312241561212,64.043942612397757,58.026650963392449,56.684213359531952,63.429388014259537,62.605003209028872,72.603381377115369,null,null,null,null,null,null,null,null,null,null,null,null,null,null,null,null,null,null,null,null,null,null,null,null,null,null,"No","N/A","N/A","N/A","N/A","N/A","N/A","N/A","N/A","N/A","N/A","N/A","N/A","N/A","N/A","N/A","N/A","N/A","N/A","N/A","N/A","N/A","N/A","N/A","N/A","N/A"]
["Type of toilet facility","Flush to piped sewer system",0.87760040314234911,7.280165557861026,18.89446842761301,50.474958215201418,88.210958354309469,4.1558536511335671,10.840462464787358,27.40787561913341,55.738373898974643,91.942765694181844,0,0,0.15602114416070828,1.6240741664354907,33.935641079353722,29.467260040304421,25.897774646845345,45.593484690794185,14.437452281042393,11.331104901721091,14.387987328509988,19.173127553275009,4.593121130028913,10.992558423716245,12.909552911041319,null,null,null,null,null,null,null,null,null,null,null,null,null,null,null,null,null,null,null,null,null,null,null,null,null,"Type of toilet facility","Flush to piped sewer system",72.046285000000026,597.76626899999997,1551.6678239999999,4143.4003820000053,7243.6425239999944,287.24914199999995,746.89774100000011,1900.3440899999985,3850.5988960000009,6359.2108479999943,0,0,2.026392,21.067793999999999,441.12838099999988,1321.1702129999994,980.4335800000008,10043.049534000009,192.736975,289.67420099999998,159.49198999999999,93.152315999999885,67.885999000000041,164.54889900000003,296.37957699999998]
[null,"Ventilated Improved Pit latrine (VIP)",0.96796543097279253,8.1900302691679645,9.907416750815413,7.7729868212722568,1.340003199193305,3.1188831081464667,8.6187014244323592,11.317481046353747,6.7221637975882071,1.3830235026913129,0.61972347753921375,0.71104387732336527,1.6784810790119349,4.1055912519818758,5.1685839644701286,9.0642000140409635,1.0365856890783374,7.7695948189835136,1.8554595667308542,7.9496442689796012E-2,1.4292526582731122,10.784056469773551,1.653380734665254,1.4923899792508339,0.64378404943814027,null,null,null,null,null,null,null,null,null,null,null,null,null,null,null,null,null,null,null,null,null,null,null,null,null,null,"Ventilated Improved Pit latrine (VIP)",79.464769000000018,672.47424500000022,813.62541899999985,638.07079199999998,110.037396,215.57460199999997,593.82048000000009,784.70540800000015,464.39023399999991,95.656661999999997,8.0465939999999989,9.2338769999999997,21.799998000000002,53.258497999999996,67.186267999999998,406.39513299999987,39.242885999999999,1711.4380739999995,24.769997999999998,2.0322879999999999,15.843380000000002,52.394156000000002,24.436847999999994,22.339760999999999,14.780097]
[null,"Pit latrine with slab",9.055436529385716,33.468830685102837,42.054896264061064,27.463304067377663,6.8337207799787736,22.159365200114717,41.822518895038307,40.31668150680305,23.69563575536305,4.6655578385918677,1.0535273086464851,3.1294338034189106,5.5120688486700349,16.412377640438759,19.517151790461611,20.214681769495339,16.032958053902409,31.542004291896191,15.535996270191832,10.83630752301487,16.702978387897893,30.445835718654195,4.9038214284600716,12.093247824208913,9.9553412070158256,null,null,null,null,null,null,null,null,null,null,null,null,null,null,null,null,null,null,null,null,null,null,null,null,null,null,"Pit latrine with slab",743.40275899999972,2748.0883349999976,3453.6684440000004,2254.4142399999969,561.16645100000005,1531.6368610000006,2881.5324979999982,2795.3851109999991,1636.9761529999996,322.69277300000005,13.679176,40.639977000000016,71.590375000000023,212.90443399999992,253.70287100000002,906.3291049999998,606.97301900000025,6947.8767340000059,207.40230799999998,277.02494600000006,185.153851,147.92057799999972,72.478127000000015,181.02524800000003,228.5563129999999]
[null,"Pit latrine without slab/open pit",68.362781468309976,39.882745789058724,22.933267329171613,9.6456380656253504,2.3763193185748608,54.458711692512615,31.284624725436398,16.085524440554412,8.0672916324584989,1.6817972213988512,73.788342059867048,72.8305458163168,70.19310610138055,62.667908877136128,32.323540969286697,34.1383224215529,31.760794217668543,10.121022322568129,41.429485761751415,58.60554491928022,62.452073372324143,34.386735305072222,84.580533341939855,72.628652612362771,67.379109573027947,null,null,null,null,null,null,null,null,null,null,null,null,null,null,null,null,null,null,null,null,null,null,null,null,null,null,"Pit latrine without slab/open pit",5612.2176099999879,3274.7277460000028,1883.345549000001,791.79343299999971,195.13684000000001,3764.140781000001,2155.4814300000016,1115.3010079999997,557.31629899999984,116.32131200000001,958.08025999999938,945.80422300000157,911.66328400000009,812.93984099999989,420.17273999999986,1530.5981839999993,1202.3947850000013,2229.3959149999987,553.0749889999995,1498.2223310000006,692.28622699999994,167.06737199999975,1250.0941819999975,1087.186837,1546.9003560000015]
[null,"No facility/bush/field",5.8666413520770728,2.5069116771855815,1.6739719194521139,1.6195065733094465,5.0489310234097202E-2,4.5480194747029055,1.4223149079486348,1.7551929483111419,1.731400116776026,0,8.1626117016761697,6.0585540065917227,4.6496996847133847,3.308459057050305,1.5684314194610309,0.97776123303555762,11.984334524672212,1.6532252158065222,1.4203928405829096,0.72502216507923034,2.7961122618731209,1.1422956295603757,2.9777953172108493E-2,0.49510754292273901,0.80254559881279863,null,null,null,null,null,null,null,null,null,null,null,null,null,null,null,null,null,null,null,null,null,null,null,null,null,null,"No facility/bush/field",481.61978199999999,205.83971999999997,137.47136500000002,132.942441,4.1460439999999998,314.35531700000001,97.996168999999995,121.69752199999999,119.611085,0,105.984725,78.678608000000011,60.389983000000015,42.917950000000005,20.387993000000002,43.838110999999998,453.70091300000001,364.16217900000009,18.961948,18.534839999999999,30.995128000000001,5.549824000000001,0.44011600000000001,7.4113230000000012,18.424969999999998]
[null,"Hanging toilet/latrine",14.709100907454381,8.0902183291592262,3.6559531236717215,0.94218606591170606,0.32727746646000205,11.445283093297226,4.6565064767162196,2.472639544616936,1.1274321052009681,3.5578024709326035E-2,16.375795452271099,17.226063825134229,17.783076493225774,11.544817500639898,7.3473303541013859,6.1249261764314005,13.26865194355733,1.7061716610482711,24.145433326627728,18.422524048214921,2.0403205102365365,4.0679493236643047,4.2393654117339192,2.2980436175384882,8.3096666606640017,null,null,null,null,null,null,null,null,null,null,null,null,null,null,null,null,null,null,null,null,null,null,null,null,null,null,"Hanging toilet/latrine",1207.5382740000009,664.27879800000039,300.23733400000003,77.342393999999999,26.875129999999999,791.08843200000103,320.82894799999991,171.44218000000001,77.886893999999998,2.46075,212.62608599999993,223.70399300000003,230.96538699999991,149.76153299999999,95.507726999999974,274.61223099999995,502.32238499999983,375.82489299999997,322.33649600000024,470.96289200000012,22.617116000000003,19.764063000000004,62.657514999999997,34.399685000000005,190.77465399999988]
[null,"Other",0.16047390865769487,0.58109769246460441,0.88002618521501219,2.0814201913022985,0.86123157124951344,0.11388378009250151,1.3548711056406146,0.64460489422714429,2.9177026936387565,0.29127771842681177,0,4.4358671215042514E-2,2.7546648837418055E-2,0.3367715063172998,0.13932042286531857,1.2848345139232786E-2,1.8900924275768761E-2,1.6144969989027023,1.1757799530725361,0,0.19127548088520963,0,0,0,0,null,null,null,null,null,null,null,null,null,null,null,null,null,null,null,null,null,null,null,null,null,null,null,null,null,null,"Other",13.174047000000002,47.713282999999997,72.270268999999985,170.860116,70.721980000000002,7.8715519999999994,93.349354000000005,44.694127999999999,201.564954,20.146190000000001,0,0.57605799999999996,0.35777399999999998,4.3686629999999997,1.8110220000000001,0.57605799999999996,0.71554799999999996,355.63136800000007,15.696417,0,2.120304,0,0,0,0]
[null,null,null,null,null,null,null,null,null,null,null,null,null,null,null,null,null,null,null,null,null,null,null,null,null,null,null,null,null,null,null,null,null,null,null,null,null,null,null,null,null,null,null,null,null,null,null,null,null,null,null,null,null,"Total",8209.4635259999905,8210.8883960000039,8212.2862040000055,8208.8237979999903,8211.7263649999932,6911.9166870000026,6889.906620000007,6933.569447000008,6908.3445149999898,6916.488534999994,1298.4168409999991,1298.6367360000006,1298.7931930000025,1297.2187130000029,1299.8970020000011,4483.5190350000066,3785.7831160000046,22027.37869700012,1334.9791310000041,2556.4514979999976,1108.5079959999998,485.848309000001,1477.9927869999958,1496.9117530000003,2295.8159670000005]
[]
[]
[]
[]
[]
[]
[]
[]
[]
[]
[]
[]
[]
[]
[]
[]
[]
[]
[]
[]
[]
[]
[]
[]
[]
[]
[]
[]
[]
[]
[]
[]
[]
[]
[]
[]
[]
[]
[]
[]
[]
[]
[]
[]
[]
[]
[]
[{"$f":"A1026","v":"Gabon"}]
[{"$f":"A1034","v":"2012"}]
["Access to hygiene facilities "]
[" by wealth quintile and sub-national region"]
["Notes:"]
["WHO/UNICEF JMP customised wealth index excludes water,"]
[" sanitation and hygiene assets."]
["Survey used for analysis:",{"$f":"A1025","v":"DHS12"}]
[]
[]
[]
[]
["Access to handwashing",null,"NATIONAL wealth index quintile",null,null,null,null,"URBAN wealth index quintile",null,null,null,null,"RURAL wealth index quintile",null,null,null,null,"SUB-REGIONS:",null,null,null,null,null,null,null,null,null,null,null,null,null,null,null,null,null,null,null,null,null,null,null,null,null,null,null,null,null,null,null,null,null,null,"Raw numbers of respondents:","Access to handwashing","NATIONAL wealth index quintile",null,null,null,null,"URBAN wealth index quintile",null,null,null,null,"RURAL wealth index quintile",null,null,null,null,"SUB-REGIONS:"]
["Weighted percentage (used in graphs)",null,"Poorest","Poor","Middle","Rich","Richest","Poorest","Poor","Middle","Rich","Richest","Poorest","Poor","Middle","Rich","Richest","Estuaire","Haut-Ogooué","Libreville-Port-Gentil","Moyen-Ogooué","Ngounié","Nyanga","Ogooué Maritime","Ogooué-Ivindo","Ogooué-Lolo","Woleu-Ntem",null,null,null,null,null,null,null,null,null,null,null,null,null,null,null,null,null,null,null,null,null,null,null,null,null,"Hygiene data, raw numbers (weighted)",null,"Poorest","Poor","Middle","Rich","Richest","Poorest","Poor","Middle","Rich","Richest","Poorest","Poor","Middle","Rich","Richest","Estuaire","Haut-Ogooué","Libreville-Port-Gentil","Moyen-Ogooué","Ngounié","Nyanga","Ogooué Maritime","Ogooué-Ivindo","Ogooué-Lolo","Woleu-Ntem"]
["Hygiene ladder","Basic","N/A","N/A","N/A","N/A","N/A","N/A","N/A","N/A","N/A","N/A","N/A","N/A","N/A","N/A","N/A","N/A","N/A","N/A","N/A","N/A","N/A","N/A","N/A","N/A","N/A",null,null,null,null,null,null,null,null,null,null,null,null,null,null,null,null,null,null,null,null,null,null,null,null,null,"Hygiene ladder","Basic","N/A","N/A","N/A","N/A","N/A","N/A","N/A","N/A","N/A","N/A","N/A","N/A","N/A","N/A","N/A","N/A","N/A","N/A","N/A","N/A","N/A","N/A","N/A","N/A","N/A"]
[null,"Limited","N/A","N/A","N/A","N/A","N/A","N/A","N/A","N/A","N/A","N/A","N/A","N/A","N/A","N/A","N/A","N/A","N/A","N/A","N/A","N/A","N/A","N/A","N/A","N/A","N/A",null,null,null,null,null,null,null,null,null,null,null,null,null,null,null,null,null,null,null,null,null,null,null,null,null,null,"Limited","N/A","N/A","N/A","N/A","N/A","N/A","N/A","N/A","N/A","N/A","N/A","N/A","N/A","N/A","N/A","N/A","N/A","N/A","N/A","N/A","N/A","N/A","N/A","N/A","N/A"]
[null,"No facility","N/A","N/A","N/A","N/A","N/A","N/A","N/A","N/A","N/A","N/A","N/A","N/A","N/A","N/A","N/A","N/A","N/A","N/A","N/A","N/A","N/A","N/A","N/A","N/A","N/A",null,null,null,null,null,null,null,null,null,null,null,null,null,null,null,null,null,null,null,null,null,null,null,null,null,null,"No facility","N/A","N/A","N/A","N/A","N/A","N/A","N/A","N/A","N/A","N/A","N/A","N/A","N/A","N/A","N/A","N/A","N/A","N/A","N/A","N/A","N/A","N/A","N/A","N/A","N/A"]
[null,null,null,null,null,null,null,null,null,null,null,null,null,null,null,null,null,null,null,null,null,null,null,null,null,null,null,null,null,null,null,null,null,null,null,null,null,null,null,null,null,null,null,null,null,null,null,null,null,null,null,null,"Observed handwashing place","Fixed","N/A","N/A","N/A","N/A","N/A","N/A","N/A","N/A","N/A","N/A","N/A","N/A","N/A","N/A","N/A","N/A","N/A","N/A","N/A","N/A","N/A","N/A","N/A","N/A","N/A"]
[null,null,null,null,null,null,null,null,null,null,null,null,null,null,null,null,null,null,null,null,null,null,null,null,null,null,null,null,null,null,null,null,null,null,null,null,null,null,null,null,null,null,null,null,null,null,null,null,null,null,null,null,null,"Mobile","N/A","N/A","N/A","N/A","N/A","N/A","N/A","N/A","N/A","N/A","N/A","N/A","N/A","N/A","N/A","N/A","N/A","N/A","N/A","N/A","N/A","N/A","N/A","N/A","N/A"]
[null,null,null,null,null,null,null,null,null,null,null,null,null,null,null,null,null,null,null,null,null,null,null,null,null,null,null,null,null,null,null,null,null,null,null,null,null,null,null,null,null,null,null,null,null,null,null,null,null,null,null,null,"Water / Soap","Water and soap","N/A","N/A","N/A","N/A","N/A","N/A","N/A","N/A","N/A","N/A","N/A","N/A","N/A","N/A","N/A","N/A","N/A","N/A","N/A","N/A","N/A","N/A","N/A","N/A","N/A"]
[null,null,null,null,null,null,null,null,null,null,null,null,null,null,null,null,null,null,null,null,null,null,null,null,null,null,null,null,null,null,null,null,null,null,null,null,null,null,null,null,null,null,null,null,null,null,null,null,null,null,null,null,null,"Water only","N/A","N/A","N/A","N/A","N/A","N/A","N/A","N/A","N/A","N/A","N/A","N/A","N/A","N/A","N/A","N/A","N/A","N/A","N/A","N/A","N/A","N/A","N/A","N/A","N/A"]
[null,null,null,null,null,null,null,null,null,null,null,null,null,null,null,null,null,null,null,null,null,null,null,null,null,null,null,null,null,null,null,null,null,null,null,null,null,null,null,null,null,null,null,null,null,null,null,null,null,null,null,null,null,"Soap only","N/A","N/A","N/A","N/A","N/A","N/A","N/A","N/A","N/A","N/A","N/A","N/A","N/A","N/A","N/A","N/A","N/A","N/A","N/A","N/A","N/A","N/A","N/A","N/A","N/A"]
[null,null,null,null,null,null,null,null,null,null,null,null,null,null,null,null,null,null,null,null,null,null,null,null,null,null,null,null,null,null,null,null,null,null,null,null,null,null,null,null,null,null,null,null,null,null,null,null,null,null,null,null,null,"Neither","N/A","N/A","N/A","N/A","N/A","N/A","N/A","N/A","N/A","N/A","N/A","N/A","N/A","N/A","N/A","N/A","N/A","N/A","N/A","N/A","N/A","N/A","N/A","N/A","N/A"]
[]
[]
[]
[]
[]
[]
[]
[]
[]
[]
[]
[]
[]
[]
[]
[]
[]
[]
[]
[]
[]
[]
[]
[]
[]
[]
[]
[]
[null,null,null,null,null,null,null,null,null,null,null,null,null,null,null,null,null,null,null,null,null,null,null,null,null,null,null,null,null,null,null,null,null,null,null,null,null,null,null,null,null,null,null,null,null,null,null,null,null,null,null,null,"Raw numbers of respondents:","Menstrual health and hygiene","NATIONAL wealth index quintile",null,null,null,null,"URBAN wealth index quintile",null,null,null,null,"RURAL wealth index quintile",null,null,null,null,"SUB-REGIONS:"]
[null,null,null,null,null,null,null,null,null,null,null,null,null,null,null,null,null,null,null,null,null,null,null,null,null,null,null,null,null,null,null,null,null,null,null,null,null,null,null,null,null,null,null,null,null,null,null,null,null,null,null,null,"MHH data, raw numbers (weighted)",null,"Poorest","Poor","Middle","Rich","Richest","Poorest","Poor","Middle","Rich","Richest","Poorest","Poor","Middle","Rich","Richest","Estuaire","Haut-Ogooué","Libreville-Port-Gentil","Moyen-Ogooué","Ngounié","Nyanga","Ogooué Maritime","Ogooué-Ivindo","Ogooué-Lolo","Woleu-Ntem"]
[null,null,null,null,null,null,null,null,null,null,null,null,null,null,null,null,null,null,null,null,null,null,null,null,null,null,null,null,null,null,null,null,null,null,null,null,null,null,null,null,null,null,null,null,null,null,null,null,null,null,null,null,"Private place to wash and change","Yes","N/A","N/A","N/A","N/A","N/A","N/A","N/A","N/A","N/A","N/A","N/A","N/A","N/A","N/A","N/A","N/A","N/A","N/A","N/A","N/A","N/A","N/A","N/A","N/A","N/A"]
[null,null,null,null,null,null,null,null,null,null,null,null,null,null,null,null,null,null,null,null,null,null,null,null,null,null,null,null,null,null,null,null,null,null,null,null,null,null,null,null,null,null,null,null,null,null,null,null,null,null,null,null,null,"No","N/A","N/A","N/A","N/A","N/A","N/A","N/A","N/A","N/A","N/A","N/A","N/A","N/A","N/A","N/A","N/A","N/A","N/A","N/A","N/A","N/A","N/A","N/A","N/A","N/A"]
[null,null,null,null,null,null,null,null,null,null,null,null,null,null,null,null,null,null,null,null,null,null,null,null,null,null,null,null,null,null,null,null,null,null,null,null,null,null,null,null,null,null,null,null,null,null,null,null,null,null,null,null,null,"DK/not sure/missing","N/A","N/A","N/A","N/A","N/A","N/A","N/A","N/A","N/A","N/A","N/A","N/A","N/A","N/A","N/A","N/A","N/A","N/A","N/A","N/A","N/A","N/A","N/A","N/A","N/A"]
[null,null,null,null,null,null,null,null,null,null,null,null,null,null,null,null,null,null,null,null,null,null,null,null,null,null,null,null,null,null,null,null,null,null,null,null,null,null,null,null,null,null,null,null,null,null,null,null,null,null,null,null,"Use of menstrual materials","Materials reusable","N/A","N/A","N/A","N/A","N/A","N/A","N/A","N/A","N/A","N/A","N/A","N/A","N/A","N/A","N/A","N/A","N/A","N/A","N/A","N/A","N/A","N/A","N/A","N/A","N/A"]
[null,null,null,null,null,null,null,null,null,null,null,null,null,null,null,null,null,null,null,null,null,null,null,null,null,null,null,null,null,null,null,null,null,null,null,null,null,null,null,null,null,null,null,null,null,null,null,null,null,null,null,null,null,"Materials not reusable","N/A","N/A","N/A","N/A","N/A","N/A","N/A","N/A","N/A","N/A","N/A","N/A","N/A","N/A","N/A","N/A","N/A","N/A","N/A","N/A","N/A","N/A","N/A","N/A","N/A"]
[null,null,null,null,null,null,null,null,null,null,null,null,null,null,null,null,null,null,null,null,null,null,null,null,null,null,null,null,null,null,null,null,null,null,null,null,null,null,null,null,null,null,null,null,null,null,null,null,null,null,null,null,null,"No materials used","N/A","N/A","N/A","N/A","N/A","N/A","N/A","N/A","N/A","N/A","N/A","N/A","N/A","N/A","N/A","N/A","N/A","N/A","N/A","N/A","N/A","N/A","N/A","N/A","N/A"]
[null,null,null,null,null,null,null,null,null,null,null,null,null,null,null,null,null,null,null,null,null,null,null,null,null,null,null,null,null,null,null,null,null,null,null,null,null,null,null,null,null,null,null,null,null,null,null,null,null,null,null,null,null,"DK/not sure/missing","N/A","N/A","N/A","N/A","N/A","N/A","N/A","N/A","N/A","N/A","N/A","N/A","N/A","N/A","N/A","N/A","N/A","N/A","N/A","N/A","N/A","N/A","N/A","N/A","N/A"]
[null,null,null,null,null,null,null,null,null,null,null,null,null,null,null,null,null,null,null,null,null,null,null,null,null,null,null,null,null,null,null,null,null,null,null,null,null,null,null,null,null,null,null,null,null,null,null,null,null,null,null,null,"Use of menstrual materials with private place to wash and change","Materials reusable","N/A","N/A","N/A","N/A","N/A","N/A","N/A","N/A","N/A","N/A","N/A","N/A","N/A","N/A","N/A","N/A","N/A","N/A","N/A","N/A","N/A","N/A","N/A","N/A","N/A"]
[null,null,null,null,null,null,null,null,null,null,null,null,null,null,null,null,null,null,null,null,null,null,null,null,null,null,null,null,null,null,null,null,null,null,null,null,null,null,null,null,null,null,null,null,null,null,null,null,null,null,null,null,null,"Materials not reusable","N/A","N/A","N/A","N/A","N/A","N/A","N/A","N/A","N/A","N/A","N/A","N/A","N/A","N/A","N/A","N/A","N/A","N/A","N/A","N/A","N/A","N/A","N/A","N/A","N/A"]
[null,null,null,null,null,null,null,null,null,null,null,null,null,null,null,null,null,null,null,null,null,null,null,null,null,null,null,null,null,null,null,null,null,null,null,null,null,null,null,null,null,null,null,null,null,null,null,null,null,null,null,null,null,"No materials used","N/A","N/A","N/A","N/A","N/A","N/A","N/A","N/A","N/A","N/A","N/A","N/A","N/A","N/A","N/A","N/A","N/A","N/A","N/A","N/A","N/A","N/A","N/A","N/A","N/A"]
[null,null,null,null,null,null,null,null,null,null,null,null,null,null,null,null,null,null,null,null,null,null,null,null,null,null,null,null,null,null,null,null,null,null,null,null,null,null,null,null,null,null,null,null,null,null,null,null,null,null,null,null,"Awareness of menstruation before menarche","Yes","N/A","N/A","N/A","N/A","N/A","N/A","N/A","N/A","N/A","N/A","N/A","N/A","N/A","N/A","N/A","N/A","N/A","N/A","N/A","N/A","N/A","N/A","N/A","N/A","N/A"]
[null,null,null,null,null,null,null,null,null,null,null,null,null,null,null,null,null,null,null,null,null,null,null,null,null,null,null,null,null,null,null,null,null,null,null,null,null,null,null,null,null,null,null,null,null,null,null,null,null,null,null,null,null,"No","N/A","N/A","N/A","N/A","N/A","N/A","N/A","N/A","N/A","N/A","N/A","N/A","N/A","N/A","N/A","N/A","N/A","N/A","N/A","N/A","N/A","N/A","N/A","N/A","N/A"]
[null,null,null,null,null,null,null,null,null,null,null,null,null,null,null,null,null,null,null,null,null,null,null,null,null,null,null,null,null,null,null,null,null,null,null,null,null,null,null,null,null,null,null,null,null,null,null,null,null,null,null,null,null,"DK/not sure/missing","N/A","N/A","N/A","N/A","N/A","N/A","N/A","N/A","N/A","N/A","N/A","N/A","N/A","N/A","N/A","N/A","N/A","N/A","N/A","N/A","N/A","N/A","N/A","N/A","N/A"]
[null,null,null,null,null,null,null,null,null,null,null,null,null,null,null,null,null,null,null,null,null,null,null,null,null,null,null,null,null,null,null,null,null,null,null,null,null,null,null,null,null,null,null,null,null,null,null,null,null,null,null,null,"Participation in (all) activities during menstruation","Yes","N/A","N/A","N/A","N/A","N/A","N/A","N/A","N/A","N/A","N/A","N/A","N/A","N/A","N/A","N/A","N/A","N/A","N/A","N/A","N/A","N/A","N/A","N/A","N/A","N/A"]
[null,null,null,null,null,null,null,null,null,null,null,null,null,null,null,null,null,null,null,null,null,null,null,null,null,null,null,null,null,null,null,null,null,null,null,null,null,null,null,null,null,null,null,null,null,null,null,null,null,null,null,null,null,"No","N/A","N/A","N/A","N/A","N/A","N/A","N/A","N/A","N/A","N/A","N/A","N/A","N/A","N/A","N/A","N/A","N/A","N/A","N/A","N/A","N/A","N/A","N/A","N/A","N/A"]
[null,null,null,null,null,null,null,null,null,null,null,null,null,null,null,null,null,null,null,null,null,null,null,null,null,null,null,null,null,null,null,null,null,null,null,null,null,null,null,null,null,null,null,null,null,null,null,null,null,null,null,null,null,"DK/not sure/missing/no such activity","N/A","N/A","N/A","N/A","N/A","N/A","N/A","N/A","N/A","N/A","N/A","N/A","N/A","N/A","N/A","N/A","N/A","N/A","N/A","N/A","N/A","N/A","N/A","N/A","N/A"]
[null,null,null,null,null,null,null,null,null,null,null,null,null,null,null,null,null,null,null,null,null,null,null,null,null,null,null,null,null,null,null,null,null,null,null,null,null,null,null,null,null,null,null,null,null,null,null,null,null,null,null,null,"Participation in specific activities during menstruation","Did not go to school (amongst those usually attending school)","N/A","N/A","N/A","N/A","N/A","N/A","N/A","N/A","N/A","N/A","N/A","N/A","N/A","N/A","N/A","N/A","N/A","N/A","N/A","N/A","N/A","N/A","N/A","N/A","N/A"]
[null,null,null,null,null,null,null,null,null,null,null,null,null,null,null,null,null,null,null,null,null,null,null,null,null,null,null,null,null,null,null,null,null,null,null,null,null,null,null,null,null,null,null,null,null,null,null,null,null,null,null,null,null,"Did not go to work (amongst those who usually work)","N/A","N/A","N/A","N/A","N/A","N/A","N/A","N/A","N/A","N/A","N/A","N/A","N/A","N/A","N/A","N/A","N/A","N/A","N/A","N/A","N/A","N/A","N/A","N/A","N/A"]
[null,null,null,null,null,null,null,null,null,null,null,null,null,null,null,null,null,null,null,null,null,null,null,null,null,null,null,null,null,null,null,null,null,null,null,null,null,null,null,null,null,null,null,null,null,null,null,null,null,null,null,null,null,"Did not participate in social activities","N/A","N/A","N/A","N/A","N/A","N/A","N/A","N/A","N/A","N/A","N/A","N/A","N/A","N/A","N/A","N/A","N/A","N/A","N/A","N/A","N/A","N/A","N/A","N/A","N/A"]
[null,null,null,null,null,null,null,null,null,null,null,null,null,null,null,null,null,null,null,null,null,null,null,null,null,null,null,null,null,null,null,null,null,null,null,null,null,null,null,null,null,null,null,null,null,null,null,null,null,null,null,null,null,"Did not cook food","N/A","N/A","N/A","N/A","N/A","N/A","N/A","N/A","N/A","N/A","N/A","N/A","N/A","N/A","N/A","N/A","N/A","N/A","N/A","N/A","N/A","N/A","N/A","N/A","N/A"]
[null,null,null,null,null,null,null,null,null,null,null,null,null,null,null,null,null,null,null,null,null,null,null,null,null,null,null,null,null,null,null,null,null,null,null,null,null,null,null,null,null,null,null,null,null,null,null,null,null,null,null,null,null,"Did not eat with others","N/A","N/A","N/A","N/A","N/A","N/A","N/A","N/A","N/A","N/A","N/A","N/A","N/A","N/A","N/A","N/A","N/A","N/A","N/A","N/A","N/A","N/A","N/A","N/A","N/A"]
[null,null,null,null,null,null,null,null,null,null,null,null,null,null,null,null,null,null,null,null,null,null,null,null,null,null,null,null,null,null,null,null,null,null,null,null,null,null,null,null,null,null,null,null,null,null,null,null,null,null,null,null,null,"Did not bathe in regular place","N/A","N/A","N/A","N/A","N/A","N/A","N/A","N/A","N/A","N/A","N/A","N/A","N/A","N/A","N/A","N/A","N/A","N/A","N/A","N/A","N/A","N/A","N/A","N/A","N/A"]
[null,null,null,null,null,null,null,null,null,null,null,null,null,null,null,null,null,null,null,null,null,null,null,null,null,null,null,null,null,null,null,null,null,null,null,null,null,null,null,null,null,null,null,null,null,null,null,null,null,null,null,null,null,"Did not participate in other activities","N/A","N/A","N/A","N/A","N/A","N/A","N/A","N/A","N/A","N/A","N/A","N/A","N/A","N/A","N/A","N/A","N/A","N/A","N/A","N/A","N/A","N/A","N/A","N/A","N/A"]
[null,null,null,null,null,null,null,null,null,null,null,null,null,null,null,null,null,null,null,null,null,null,null,null,null,null,null,null,null,null,null,null,null,null,null,null,null,null,null,null,null,null,null,null,null,null,null,null,null,null,null,null,null,"DK/not sure/missing/no such activity","N/A","N/A","N/A","N/A","N/A","N/A","N/A","N/A","N/A","N/A","N/A","N/A","N/A","N/A","N/A","N/A","N/A","N/A","N/A","N/A","N/A","N/A","N/A","N/A","N/A"]
[]
[]
[]
[]
[]
[]
[]
[]
[]
[]
[]
[]
[]
[]
[]
[]
[]
[]
[]
[]
[]
[]
[]
[]
[]
[]
[]
[]
[]
[]
[]
[]
[]
[]
[]
[]
[]
[]
[]
[]
[]
[]
[]
[]
[]
[]
[]
[]
[]
[]
[]
[]
[]
[]
[null,null,null,null,null,null,null,null,null,null,null,null,null,null,null,null,null,null,null,null,null,null,null,null,null,null,null,null,null,null,null,null,null,null,null,null,null,null,null,null,null,null,null,null,null,null,null,null,null,null,null,null,"Raw numbers of respondents:","Basic water, sanitation and hygiene","NATIONAL wealth index quintile",null,null,null,null,"URBAN wealth index quintile",null,null,null,null,"RURAL wealth index quintile",null,null,null,null,"SUB-REGIONS:"]
[null,null,null,null,null,null,null,null,null,null,null,null,null,null,null,null,null,null,null,null,null,null,null,null,null,null,null,null,null,null,null,null,null,null,null,null,null,null,null,null,null,null,null,null,null,null,null,null,null,null,null,null,"WatSan data, raw numbers (weighted)",null,"Poorest","Poor","Middle","Rich","Richest","Poorest","Poor","Middle","Rich","Richest","Poorest","Poor","Middle","Rich","Richest","Estuaire","Haut-Ogooué","Libreville-Port-Gentil","Moyen-Ogooué","Ngounié","Nyanga","Ogooué Maritime","Ogooué-Ivindo","Ogooué-Lolo","Woleu-Ntem"]
[null,null,null,null,null,null,null,null,null,null,null,null,null,null,null,null,null,null,null,null,null,null,null,null,null,null,null,null,null,null,null,null,null,null,null,null,null,null,null,null,null,null,null,null,null,null,null,null,null,null,null,null,"Use of Basic Water Sanitation and Hygiene","Yes","N/A","N/A","N/A","N/A","N/A","N/A","N/A","N/A","N/A","N/A","N/A","N/A","N/A","N/A","N/A","N/A","N/A","N/A","N/A","N/A","N/A","N/A","N/A","N/A","N/A"]
[null,null,null,null,null,null,null,null,null,null,null,null,null,null,null,null,null,null,null,null,null,null,null,null,null,null,null,null,null,null,null,null,null,null,null,null,null,null,null,null,null,null,null,null,null,null,null,null,null,null,null,null,null,"No","N/A","N/A","N/A","N/A","N/A","N/A","N/A","N/A","N/A","N/A","N/A","N/A","N/A","N/A","N/A","N/A","N/A","N/A","N/A","N/A","N/A","N/A","N/A","N/A","N/A"]
[null,null,null,null,null,null,null,null,null,null,null,null,null,null,null,null,null,null,null,null,null,null,null,null,null,null,null,null,null,null,null,null,null,null,null,null,null,null,null,null,null,null,null,null,null,null,null,null,null,null,null,null,"Use of Basic Water and Sanitation","Yes","N/A","N/A","N/A","N/A","N/A","N/A","N/A","N/A","N/A","N/A","N/A","N/A","N/A","N/A","N/A","N/A","N/A","N/A","N/A","N/A","N/A","N/A","N/A","N/A","N/A"]
[null,null,null,null,null,null,null,null,null,null,null,null,null,null,null,null,null,null,null,null,null,null,null,null,null,null,null,null,null,null,null,null,null,null,null,null,null,null,null,null,null,null,null,null,null,null,null,null,null,null,null,null,null,"No","N/A","N/A","N/A","N/A","N/A","N/A","N/A","N/A","N/A","N/A","N/A","N/A","N/A","N/A","N/A","N/A","N/A","N/A","N/A","N/A","N/A","N/A","N/A","N/A","N/A"]
[null,null,null,null,null,null,null,null,null,null,null,null,null,null,null,null,null,null,null,null,null,null,null,null,null,null,null,null,null,null,null,null,null,null,null,null,null,null,null,null,null,null,null,null,null,null,null,null,null,null,null,null,"Use of Basic Water and Hygiene","Yes","N/A","N/A","N/A","N/A","N/A","N/A","N/A","N/A","N/A","N/A","N/A","N/A","N/A","N/A","N/A","N/A","N/A","N/A","N/A","N/A","N/A","N/A","N/A","N/A","N/A"]
[null,null,null,null,null,null,null,null,null,null,null,null,null,null,null,null,null,null,null,null,null,null,null,null,null,null,null,null,null,null,null,null,null,null,null,null,null,null,null,null,null,null,null,null,null,null,null,null,null,null,null,null,null,"No","N/A","N/A","N/A","N/A","N/A","N/A","N/A","N/A","N/A","N/A","N/A","N/A","N/A","N/A","N/A","N/A","N/A","N/A","N/A","N/A","N/A","N/A","N/A","N/A","N/A"]
[null,null,null,null,null,null,null,null,null,null,null,null,null,null,null,null,null,null,null,null,null,null,null,null,null,null,null,null,null,null,null,null,null,null,null,null,null,null,null,null,null,null,null,null,null,null,null,null,null,null,null,null,"Use of Basic Sanitation and Hygiene","Yes","N/A","N/A","N/A","N/A","N/A","N/A","N/A","N/A","N/A","N/A","N/A","N/A","N/A","N/A","N/A","N/A","N/A","N/A","N/A","N/A","N/A","N/A","N/A","N/A","N/A"]
[null,null,null,null,null,null,null,null,null,null,null,null,null,null,null,null,null,null,null,null,null,null,null,null,null,null,null,null,null,null,null,null,null,null,null,null,null,null,null,null,null,null,null,null,null,null,null,null,null,null,null,null,null,"No","N/A","N/A","N/A","N/A","N/A","N/A","N/A","N/A","N/A","N/A","N/A","N/A","N/A","N/A","N/A","N/A","N/A","N/A","N/A","N/A","N/A","N/A","N/A","N/A","N/A"]
[null,null,null,null,null,null,null,null,null,null,null,null,null,null,null,null,null,null,null,null,null,null,null,null,null,null,null,null,null,null,null,null,null,null,null,null,null,null,null,null,null,null,null,null,null,null,null,null,null,null,null,null,"Use of Basic Water","Yes","N/A","N/A","N/A","N/A","N/A","N/A","N/A","N/A","N/A","N/A","N/A","N/A","N/A","N/A","N/A","N/A","N/A","N/A","N/A","N/A","N/A","N/A","N/A","N/A","N/A"]
[null,null,null,null,null,null,null,null,null,null,null,null,null,null,null,null,null,null,null,null,null,null,null,null,null,null,null,null,null,null,null,null,null,null,null,null,null,null,null,null,null,null,null,null,null,null,null,null,null,null,null,null,null,"No","N/A","N/A","N/A","N/A","N/A","N/A","N/A","N/A","N/A","N/A","N/A","N/A","N/A","N/A","N/A","N/A","N/A","N/A","N/A","N/A","N/A","N/A","N/A","N/A","N/A"]
[null,null,null,null,null,null,null,null,null,null,null,null,null,null,null,null,null,null,null,null,null,null,null,null,null,null,null,null,null,null,null,null,null,null,null,null,null,null,null,null,null,null,null,null,null,null,null,null,null,null,null,null,"Use of Basic Sanitation","Yes","N/A","N/A","N/A","N/A","N/A","N/A","N/A","N/A","N/A","N/A","N/A","N/A","N/A","N/A","N/A","N/A","N/A","N/A","N/A","N/A","N/A","N/A","N/A","N/A","N/A"]
[null,null,null,null,null,null,null,null,null,null,null,null,null,null,null,null,null,null,null,null,null,null,null,null,null,null,null,null,null,null,null,null,null,null,null,null,null,null,null,null,null,null,null,null,null,null,null,null,null,null,null,null,null,"No","N/A","N/A","N/A","N/A","N/A","N/A","N/A","N/A","N/A","N/A","N/A","N/A","N/A","N/A","N/A","N/A","N/A","N/A","N/A","N/A","N/A","N/A","N/A","N/A","N/A"]
[null,null,null,null,null,null,null,null,null,null,null,null,null,null,null,null,null,null,null,null,null,null,null,null,null,null,null,null,null,null,null,null,null,null,null,null,null,null,null,null,null,null,null,null,null,null,null,null,null,null,null,null,"Access to Basic Hygiene","Yes","N/A","N/A","N/A","N/A","N/A","N/A","N/A","N/A","N/A","N/A","N/A","N/A","N/A","N/A","N/A","N/A","N/A","N/A","N/A","N/A","N/A","N/A","N/A","N/A","N/A"]
[null,null,null,null,null,null,null,null,null,null,null,null,null,null,null,null,null,null,null,null,null,null,null,null,null,null,null,null,null,null,null,null,null,null,null,null,null,null,null,null,null,null,null,null,null,null,null,null,null,null,null,null,null,"No","N/A","N/A","N/A","N/A","N/A","N/A","N/A","N/A","N/A","N/A","N/A","N/A","N/A","N/A","N/A","N/A","N/A","N/A","N/A","N/A","N/A","N/A","N/A","N/A","N/A"]
[]
[]
[]
[]
[]
[]
[]
[]
[]
[]
[]
[]
[]
[]
[]
[]
[]
[]
[]
[]
[]
[]
[]
[]
[]
[]
[]
[]
[]
[]
[]
[]
[]
[]
[]
[]
[]
[]
[]
[]
[]
[]
[]
[]
[null,null,"INITIAL (national) Wealth Index",null,null,null,null,"URBAN Wealth Index",null,null,null,null,"RURAL Wealth Index"]
[null,null,"Component Matrix",null,null,null,null,"Component Matrix",null,null,null,null,"Component Matrix"]
[null,null,null,null,"Component",null,null,null,null,"Component",null,null,null,null,"Component"]
[null,"Note:\n\nThe INITIAL (national) Wealth Index is based on the first component of the Principal Component Analysis (PCA) which has been obtained at national level.\n\nThe final national-level (NATIONAL) Wealth Index is based on the URBAN and RURAL specific wealth indexes. Regression procedures are used to establish the relationships between the two sets of scores (urban and rural) and the initial (national) wealth factors.\nThis allows best use of the available information for each area and a better precision of the FINAL (NATIONAL) Wealth Index.\n\nFor dependency reasons, all WASH variables (contained in the generic MICS and DHS scripts) have been excluded from the sets of asset variables used in the PCAs.\n\nThe PCA can extracts as many components as there are asset variables in the input. Only the first of the components is used to represent the Wealth Index. \n\nThe scores represent the weights of the asset variables on the Wealth Index (correlations between the variables and the component).\n\nThe communalities are the proportion of each variable's variance that can be explained by the component.\n\nProportion of explained variance is the part of the model's total variance that is explained by the component.\n\nFor more information on the procedure used:\n\nThe DHS Wealth Index, DHS Comparative Reports No. 6, Shea Oscar Rutstein, Kiersten Johnson, ORC Macro International Inc., 2004.\n\nThe DHS Wealth Index: Approaches for Rural and Urban Areas, Shea O. Rutstein, ORC Macro International Inc., 2008.\n\nMICS Methodological Paper No. 4, Review of options for reporting water, sanitation and hygiene coverage by wealth quintile, UNICEF, 2016.",null,null,"1",null,null,null,null,"1",null,null,null,null,"1"]
[null,null,"Has television",null,0.75877705472160184,null,null,"Tin roof without ceiling",null,-0.67682998227835545,null,null,"Has television",null,0.7521527100485631]
[null,null,"LPG, natural gas for cooking",null,0.75321544890541048,null,null,"Tin roof with ceiling",null,0.65930896829003327,null,null,"LPG, natural gas for cooking",null,0.73158494956914222]
[null,null,"Has has Fan",null,0.72750639054822219,null,null,"Has antenna / decoder",null,0.61054628411313727,null,null,"Has DVD/VCD reader",null,0.71205235195191063]
[null,null,"Wood for cooking",null,-0.71941867043247132,null,null,"Ceramic tile floor",null,0.59737302444286355,null,null,"Has freezer",null,0.68928185125529873]
[null,null,"Has DVD/VCD reader",null,0.69021834990402875,null,null,"Has stove (gas, electric)",null,0.59594027059146781,null,null,"Has has Fan",null,0.68089116437372188]
[null,null,"Earth, sand, dung floor",null,-0.68543698990619517,null,null,"Has refrigerator",null,0.58323235314161448,null,null,"Wood for cooking",null,-0.65660492941690285]
[null,null,"Tin roof with ceiling",null,0.67852472138563835,null,null,"Has bank account",null,0.55566262720667914,null,null,"Earth, sand, dung floor",null,-0.6510124881963808]
[null,null,"Has electricity",null,0.6769210995978906,null,null,"LPG, natural gas for cooking",null,0.55085877424463159,null,null,"Has antenna / decoder",null,0.62936919762943444]
[null,null,"Has iron",null,0.63213689335314094,null,null,"Parpaing/Cement walls",null,0.54510506495498745,null,null,"Tin roof with ceiling",null,0.59779429681658303]
[null,null,"Has freezer",null,0.63211885233973386,null,null,"Has has Fan",null,0.53342371102765296,null,null,"Has electricity",null,0.58781250198272539]
[null,null,"Tin roof without ceiling",null,-0.6273451169891312,null,null,"Wood for cooking",null,-0.5141774079471102,null,null,"Has iron",null,0.56793285308156849]
[null,null,"Has antenna / decoder",null,0.62632577266342571,null,null,"Has television",null,0.50706452643796496,null,null,"Has stove (gas, electric)",null,0.54250520635773503]
[null,null,"Has stove (gas, electric)",null,0.59502627118788842,null,null,"Has air conditioner",null,0.50392052380237151,null,null,"Has refrigerator",null,0.50085764177179604]
[null,null,"Has refrigerator",null,0.59370819156536936,null,null,"Has watch",null,0.49753697305251038,null,null,"Has mobile telephone",null,0.48065289054104476]
[null,null,"Parpaing/Cement walls",null,0.5833115453737493,null,null,"Earth, sand, dung floor",null,-0.49053027310920183,null,null,"Has oil lamp",null,-0.48048428577763247]
[null,null,"Has bank account",null,0.55009035846262988,null,null,"Has iron",null,0.48774921364210244,null,null,"Has bank account",null,0.47884359886837263]
[null,null,"Has oil lamp",null,-0.54516550140286868,null,null,"Has DVD/VCD reader",null,0.48753234529569667,null,null,"Has HIFI",null,0.47482228679761362]
[null,null,"Ceramic tile floor",null,0.53657570192658077,null,null,"Has computer",null,0.48434462127041922,null,null,"Parpaing/Cement walls",null,0.4724063379902253]
[null,null,"Has mobile telephone",null,0.52963138312169544,null,null,"Has car/truck",null,0.46944849654728699,null,null,"Tin roof without ceiling",null,-0.44859721046311446]
[null,null,"Has watch",null,0.48770702366758728,null,null,"Has HIFI",null,0.43161089177290529,null,null,"Ceramic tile floor",null,0.44067894621350201]
[null,null,"Has HIFI",null,0.45039822400580476,null,null,"Has freezer",null,0.41342940028611963,null,null,"Has watch",null,0.41296120407734077]
[null,null,"Has computer",null,0.44086634397669766,null,null,"Has washing machine",null,0.38778957787115581,null,null,"Has car/truck",null,0.40824788492179404]
[null,null,"Has car/truck",null,0.43495962565710405,null,null,"Planks walls",null,-0.3630774191124872,null,null,"Has gas stove",null,0.39419565116627731]
[null,null,"Has air conditioner",null,0.43479960390065137,null,null,"Has electricity",null,0.3559553717698139,null,null,"Owns land usable for agriculture",null,-0.3908270488281585]
[null,null,"Planks walls",null,-0.3435575001549615,null,null,"Has mobile telephone",null,0.3537813045767248,null,null,"Has air conditioner",null,0.37788215319031598]
[null,null,"Grass/thatch/mud walls",null,-0.32723895940643649,null,null,"Owns land usable for agriculture",null,-0.33589816225617164,null,null,"Cement floor",null,0.36306639194356605]
[null,null,"Has washing machine",null,0.32024735230703738,null,null,"Grass/thatch/mud walls",null,-0.28334570151059252,null,null,"Has computer",null,0.32732385100495337]
[null,null,"Has radio",null,0.2683470278727797,null,null,"Has oil lamp",null,-0.27577018479088833,null,null,"Has radio",null,0.29466242284035632]
[null,null,"Has video recorder",null,0.22948892908876853,null,null,"Has radio",null,0.26847806845324884,null,null,"Grass/thatch/mud walls",null,-0.28384274924595615]
[null,null,"Has indigenous torch",null,-0.18395087288098144,null,null,"Owns livestock, herds or farm animals",null,-0.24972301729883029,null,null,"Has washing machine",null,0.27062280357248319]
[null,null,"Bark, straw, palm bamboo roof",null,-0.17872974406700634,null,null,"Has gas stove",null,-0.23002934799705307,null,null,"Lino/Gerflex floor",null,0.22590970781313718]
[null,null,"Cement floor",null,0.17531040333278594,null,null,"Has video recorder",null,0.22863782138193042,null,null,"Has brushcutter",null,0.22024984633609404]
[null,null,"Has gas stove",null,0.16912203974851137,null,null,"Cement floor",null,-0.22606588022790214,null,null,"Owns livestock, herds or farm animals",null,-0.19870078555215728]
[null,null,"Semi-hard (hard or other)",null,0.15965494261553034,null,null,"Has telephone (land-line)",null,0.19562120374296496,null,null,"Semi-hard (hard or other)",null,0.16022224863428131]
[null,null,"Has bicycle",null,0.15918045528707694,null,null,"Charcoal for cooking",null,-0.1954431896352615,null,null,"Bark, straw, palm bamboo roof",null,-0.15446283774329336]
[null,null,"Has fishing net",null,-0.15772013293059955,null,null,"Has bicycle",null,0.18786360833977286,null,null,"Has video recorder",null,0.14789036566706523]
[null,null,"Charcoal for cooking",null,-0.15256787429677332,null,null,"Owns chickens",null,-0.16244882526492391,null,null,"Has sewing machine",null,0.14131750141616614]
[null,null,"Lino/Gerflex floor",null,0.15163683821745688,null,null,"Mud brick walls",null,-0.1624476615730937,null,null,"Has generator",null,0.14008119353353995]
[null,null,"Has boat without motor",null,-0.14465719570129246,null,null,"Has brushcutter",null,0.15315449162311956,null,null,"Wood planks rudimentary floor",null,0.1237351821277461]
[null,null,"Has telephone (land-line)",null,0.13580811182641206,null,null,"Has sewing machine",null,0.1287878288505015,null,null,"Has indigenous torch",null,-0.12081532130012353]
[null,null,"Has sewing machine",null,0.13472265177693926,null,null,"Metal walls",null,-0.12847796759868613,null,null,"Number of members per sleeping room",null,0.10513192225675122]
[null,null,"Has brushcutter",null,0.13369954620344604,null,null,"Cement (concrete) roof",null,0.11591435817642386,null,null,"Polished wood floor",null,0.10217182729343845]
[null,null,"Number of members per sleeping room",null,0.1277185955059609,null,null,"Does not cook",null,-0.10446939533382593,null,null,"Has gas lamp",null,0.10104365947139751]
[null,null,"Cement (concrete) roof",null,0.12484522797677927,null,null,"Plastic/cardboard walls",null,-9.529317640166457E-2,null,null,"Has chain saw",null,0.10053683456594775]
[null,null,"Metal walls",null,-0.12267619191209356,null,null,"Has generator",null,8.954321071594494E-2,null,null,"Owns chickens",null,-9.2255573884180445E-2]
[null,null,"Has hunting gun",null,-0.12247243007755551,null,null,"Rudimentary or plastic/cardboard roof",null,-8.2753050815075557E-2,null,null,"Metal walls",null,-8.7335798591410149E-2]
[null,null,"Has generator",null,-0.1149224195941536,null,null,"Has gas lamp",null,8.2537393317769089E-2,null,null,"Has bicycle",null,8.5414817592942394E-2]
[null,null,"Plastic/cardboard walls",null,-9.3817600560699044E-2,null,null,"Bark, straw, palm bamboo roof",null,-8.0607117343354837E-2,null,null,"Plastic/cardboard walls",null,-8.3954376621244622E-2]
[null,null,"Rudimentary or plastic/cardboard roof",null,-8.9683250975040416E-2,null,null,"Has motorcycle/scooter",null,7.0209760793586512E-2,null,null,"Charcoal for cooking",null,-8.1819159860837834E-2]
[null,null,"Has gas lamp",null,8.060603521239082E-2,null,null,"Semi-hard (hard or other)",null,6.7000293880038989E-2,null,null,"Cement (concrete) roof",null,7.9117624047425478E-2]
[null,null,"Has motorcycle/scooter",null,7.5615075599634846E-2,null,null,"Number of members per sleeping room",null,-6.1521499927094554E-2,null,null,"Planks walls",null,-7.8143112142766494E-2]
[null,null,"Carpet floor",null,7.4759891660118649E-2,null,null,"Has boat without motor",null,-6.021780548610485E-2,null,null,"Rudimentary or plastic/cardboard roof",null,-7.5704624979776272E-2]
[null,null,"Tile roof",null,4.4741520561943568E-2,null,null,"Kerosene for cooking",null,-5.7979115478893409E-2,null,null,"Has telephone (land-line)",null,7.013002736776873E-2]
[null,null,"Mud brick walls",null,-4.3575683685610767E-2,null,null,"Owns rabbits",null,5.7758631560421103E-2,null,null,"Has boat with a motor",null,6.874587641488468E-2]
[null,null,"Electricity for cooking",null,3.5485622256620879E-2,null,null,"Has chain saw",null,5.4112207545965976E-2,null,null,"Has motorcycle/scooter",null,6.5339038727277407E-2]
[null,null,"Other type of walls",null,-3.445218695780318E-2,null,null,"Lino/Gerflex floor",null,5.3936127858269997E-2,null,null,"Mud brick walls",null,-6.0098742362990919E-2]
[null,null,"Sawdust, wood chips for cooking",null,-3.441446226526592E-2,null,null,"Has indigenous torch",null,-5.3100909277525775E-2,null,null,"Owns rabbits",null,4.375859016481877E-2]
[null,null,"Polished wood floor",null,2.2478852447076252E-2,null,null,"Has fishing net",null,-4.8858381908391334E-2,null,null,"Other type of roof",null,4.2974477763876417E-2]
[null,null,"Has boat with a motor",null,-1.6353061016846939E-2,null,null,"Tile roof",null,4.6762566663768677E-2,null,null,"Owns ducks",null,3.7134791752565996E-2]
[null,null,"Kerosene for cooking",null,-1.5977636660533062E-2,null,null,"Sawdust, wood chips for cooking",null,-4.2510506043624004E-2,null,null,"Has boat without motor",null,-3.2605603175001843E-2]
[null,null,"Other type of flooring",null,-1.5226556048094166E-2,null,null,"Carpet floor",null,3.8760738848503874E-2,null,null,"Has hunting gun",null,2.685909106847683E-2]
[null,null,"Has chain saw",null,-1.1683888114476597E-2,null,null,"Owns cows/ bulls",null,3.6543348660982244E-2,null,null,"Other type of walls",null,-2.6227306669753911E-2]
[null,null,"Other type of roof",null,9.9486027881591447E-3,null,null,"Electricity for cooking",null,3.0048158160068991E-2,null,null,"Sawdust, wood chips for cooking",null,-2.4461763879409518E-2]
[null,null,"Does not cook",null,-9.8990410975983156E-3,null,null,"Owns ducks",null,1.5938297911356644E-2,null,null,"Owns sheep",null,-2.442114766178136E-2]
[null,null,"Wood planks rudimentary floor",null,-1.4814105262046344E-3,null,null,"Owns pigs",null,1.5375262886737641E-2,null,null,"Electricity for cooking",null,2.3260832105686358E-2]
[null,null,"Other fuel for cooking",null,1.2697552969503998E-3,null,null,"Wood planks rudimentary floor",null,-1.2473430133698338E-2,null,null,"Owns cows/ bulls",null,2.0126850403692279E-2]
[null,null,null,null,null,null,null,"Has hunting gun",null,-1.2290593998247334E-2,null,null,"Owns goats",null,1.96212379626882E-2]
[null,null,null,null,null,null,null,"Owns goats",null,-1.2091999513103557E-2,null,null,"Carpet floor",null,-1.6142960917072003E-2]
[null,null,null,null,null,null,null,"Has boat with a motor",null,1.0496388906955633E-2,null,null,"Has fishing net",null,-1.5974185111448335E-2]
[null,null,"Communalities",null,null,null,null,"Owns sheep",null,-1.0090705487580452E-2,null,null,"Does not cook",null,-1.2582878026249453E-2]
[null,null,null,null,"Extraction",null,null,"Other type of walls",null,-4.3445069813919405E-3,null,null,"Kerosene for cooking",null,1.0255645135328064E-2]
[null,null,"Has electricity",null,0.45822217508081731,null,null,"Polished wood floor",null,2.48512568406033E-3,null,null,"Other fuel for cooking",null,-6.9545984606065817E-3]
[null,null,"Has radio",null,7.2010127368154403E-2,null,null,"Other fuel for cooking",null,-1.7448087138845277E-3,null,null,"Owns pigs",null,5.8886199224070799E-3]
[null,null,"Has television",null,0.57574261877198873,null,null,"Other type of roof",null,7.7074690920104962E-4,null,null,"Other type of flooring",null,-2.8702897971341723E-3]
[null,null,"Has refrigerator",null,0.35248941673182133]
[null,null,"Has bicycle",null,2.5338417345401102E-2]
[null,null,"Has motorcycle/scooter",null,5.7176396579384928E-3]
[null,null,"Has car/truck",null,0.18918987595176809,null,null,"Communalities",null,null,null,null,"Communalities"]
[null,null,"Has telephone (land-line)",null,1.8443843237855244E-2,null,null,null,null,"Extraction",null,null,null,null,"Extraction"]
[null,null,"Has mobile telephone",null,0.28050940198740015,null,null,"Has electricity",null,0.12670422669178644,null,null,"Has electricity",null,0.34552353748719156]
[null,null,"Has watch",null,0.23785814093469654,null,null,"Has radio",null,7.2080473240387369E-2,null,null,"Has radio",null,8.6825943434148942E-2]
[null,null,"Has boat with a motor",null,2.6742260462071907E-4,null,null,"Has television",null,0.25711443397175765,null,null,"Has television",null,0.56573369923339778]
[null,null,"Has bank account",null,0.30259940247354461,null,null,"Has refrigerator",null,0.3401599777511049,null,null,"Has refrigerator",null,0.25085837732120475]
[null,null,"Has chain saw",null,1.3651324147160747E-4,null,null,"Has bicycle",null,3.5292735338439574E-2,null,null,"Has bicycle",null,7.2956910644356218E-3]
[null,null,"Has iron",null,0.39959705193816025,null,null,"Has motorcycle/scooter",null,4.9294105106926379E-3,null,null,"Has motorcycle/scooter",null,4.2691899818046572E-3]
[null,null,"Has generator",null,1.3207162525374698E-2,null,null,"Has car/truck",null,0.22038189091050811,null,null,"Has car/truck",null,0.16666633554311838]
[null,null,"Has HIFI",null,0.20285856018758308,null,null,"Has telephone (land-line)",null,3.8267655353846609E-2,null,null,"Has telephone (land-line)",null,4.9182207386039914E-3]
[null,null,"Has video recorder",null,5.2665168574309827E-2,null,null,"Has mobile telephone",null,0.12516121146800932,null,null,"Has mobile telephone",null,0.23102720118546155]
[null,null,"Has DVD/VCD reader",null,0.47640137054424025,null,null,"Has watch",null,0.24754303955425444,null,null,"Has watch",null,0.17053695607300709]
[null,null,"Has freezer",null,0.39957424348330228,null,null,"Has boat with a motor",null,1.1017418008606126E-4,null,null,"Has boat with a motor",null,4.7259955240505974E-3]
[null,null,"Has hunting gun",null,1.4999496129101723E-2,null,null,"Owns land usable for agriculture",null,0.11282757540707342,null,null,"Owns land usable for agriculture",null,0.15274578209572778]
[null,null,"Has fishing net",null,2.4875640331645993E-2,null,null,"Owns livestock, herds or farm animals",null,6.2361585368831893E-2,null,null,"Owns livestock, herds or farm animals",null,3.94820021790444E-2]
[null,null,"Has stove (gas, electric)",null,0.35405626340376256,null,null,"Owns cows/ bulls",null,1.3354163313581129E-3,null,null,"Owns cows/ bulls",null,4.0509010717260807E-4]
[null,null,"Has gas stove",null,2.8602264328697058E-2,null,null,"Owns goats",null,1.4621645222489665E-4,null,null,"Owns goats",null,3.8499297918843657E-4]
[null,null,"Has has Fan",null,0.52926554828850236,null,null,"Owns sheep",null,1.0182233723708624E-4,null,null,"Owns sheep",null,5.9639245311852919E-4]
[null,null,"Has brushcutter",null,1.7875568655007404E-2,null,null,"Owns chickens",null,2.6389620829953778E-2,null,null,"Owns chickens",null,8.5110909126994774E-3]
[null,null,"Has sewing machine",null,1.8150192901810434E-2,null,null,"Owns pigs",null,2.3639870883629188E-4,null,null,"Owns pigs",null,3.4675844590569563E-5]
[null,null,"Has computer",null,0.19436313325137991,null,null,"Owns ducks",null,2.5402934031115552E-4,null,null,"Owns ducks",null,1.3789927585064435E-3]
[null,null,"Has air conditioner",null,0.18905069555216333,null,null,"Owns rabbits",null,3.3360595197324729E-3,null,null,"Owns rabbits",null,1.914814213212574E-3]
[null,null,"Has washing machine",null,0.10255836665966772,null,null,"Has bank account",null,0.30876095527422887,null,null,"Has bank account",null,0.22929119217721497]
[null,null,"Has antenna / decoder",null,0.39228397350243721,null,null,"Has chain saw",null,2.928131005497697E-3,null,null,"Has chain saw",null,1.0107655104540746E-2]
[null,null,"Has indigenous torch",null,3.3837923633674993E-2,null,null,"Has iron",null,0.23789929540848928,null,null,"Has iron",null,0.32254772560937045]
[null,null,"Has oil lamp",null,0.29720542391984123,null,null,"Has generator",null,8.0179865853201165E-3,null,null,"Has generator",null,1.9622740781781077E-2]
[null,null,"Has gas lamp",null,6.4973329126611886E-3,null,null,"Has HIFI",null,0.18628796189700256,null,null,"Has HIFI",null,0.22545620403971525]
[null,null,"Has boat without motor",null,2.0925704268162024E-2,null,null,"Has video recorder",null,5.2275253366275518E-2,null,null,"Has video recorder",null,2.1871560257138267E-2]
[null,null,"Number of members per sleeping room",null,1.6312039638015256E-2,null,null,"Has DVD/VCD reader",null,0.2376877877095224,null,null,"Has DVD/VCD reader",null,0.50701855192024758]
[null,null,"Earth, sand, dung floor",null,0.46982386713166552,null,null,"Has freezer",null,0.17092386902094053,null,null,"Has freezer",null,0.47510947046993174]
[null,null,"Wood planks rudimentary floor",null,2.1945771471498917E-6,null,null,"Has hunting gun",null,1.5105870082975339E-4,null,null,"Has hunting gun",null,7.2141077302473181E-4]
[null,null,"Polished wood floor",null,5.0529880733742602E-4,null,null,"Has fishing net",null,2.3871414827062215E-3,null,null,"Has fishing net",null,2.5517458997481764E-4]
[null,null,"Lino/Gerflex floor",null,2.2993730704587191E-2,null,null,"Has stove (gas, electric)",null,0.35514480611263188,null,null,"Has stove (gas, electric)",null,0.29431189892524867]
[null,null,"Ceramic tile floor",null,0.28791348389800286,null,null,"Has gas stove",null,5.2913500939949343E-2,null,null,"Has gas stove",null,0.15539021139840539]
[null,null,"Cement floor",null,3.0733737516704083E-2,null,null,"Has has Fan",null,0.28454085548651303,null,null,"Has has Fan",null,0.46361277772220277]
[null,null,"Carpet floor",null,5.5890414010326779E-3,null,null,"Has brushcutter",null,2.3456298304336199E-2,null,null,"Has brushcutter",null,4.8509994811073036E-2]
[null,null,"Other type of flooring",null,2.3184800908575303E-4,null,null,"Has sewing machine",null,1.6586304860026064E-2,null,null,"Has sewing machine",null,1.997063620650812E-2]
[null,null,"Grass/thatch/mud walls",null,0.10708533655340739,null,null,"Has computer",null,0.23458971215358582,null,null,"Has computer",null,0.10714090343671291]
[null,null,"Plastic/cardboard walls",null,8.8017421749668773E-3,null,null,"Has air conditioner",null,0.25393589430925645,null,null,"Has air conditioner",null,0.14279492169974944]
[null,null,"Mud brick walls",null,1.8988402086684043E-3,null,null,"Has washing machine",null,0.15038075670548923,null,null,"Has washing machine",null,7.3236701813430824E-2]
[null,null,"Metal walls",null,1.5049448062052809E-2,null,null,"Has antenna / decoder",null,0.37276676504435974,null,null,"Has antenna / decoder",null,0.39610558692471809]
[null,null,"Planks walls",null,0.11803175591272637,null,null,"Has indigenous torch",null,2.8197065661000227E-3,null,null,"Has indigenous torch",null,1.4596341860852081E-2]
[null,null,"Semi-hard (hard or other)",null,2.5489700701568287E-2,null,null,"Has oil lamp",null,7.6049194819600693E-2,null,null,"Has oil lamp",null,0.23086514887924159]
[null,null,"Parpaing/Cement walls",null,0.34025235896631156,null,null,"Has gas lamp",null,6.812421295692114E-3,null,null,"Has gas lamp",null,1.0209821119371741E-2]
[null,null,"Other type of walls",null,1.1869531861754235E-3,null,null,"Has boat without motor",null,3.6261840975623594E-3,null,null,"Has boat without motor",null,1.0631253584056904E-3]
[null,null,"Bark, straw, palm bamboo roof",null,3.1944321414257591E-2,null,null,"Number of members per sleeping room",null,3.7848949532794953E-3,null,null,"Number of members per sleeping room",null,1.1052721077399583E-2]
[null,null,"Rudimentary or plastic/cardboard roof",null,8.0430855054520883E-3,null,null,"Earth, sand, dung floor",null,0.24061994883658813,null,null,"Earth, sand, dung floor",null,0.42381725978764284]
[null,null,"Tin roof without ceiling",null,0.3935618958101067,null,null,"Wood planks rudimentary floor",null,1.5558645930025374E-4,null,null,"Wood planks rudimentary floor",null,1.5310395296186498E-2]
[null,null,"Tin roof with ceiling",null,0.46039579753145815,null,null,"Polished wood floor",null,6.1758496655763232E-6,null,null,"Polished wood floor",null,1.0439082292480214E-2]
[null,null,"Tile roof",null,2.0018036621948193E-3,null,null,"Lino/Gerflex floor",null,2.909105888343649E-3,null,null,"Lino/Gerflex floor",null,5.1035196084217013E-2]
[null,null,"Cement (concrete) roof",null,1.5586330948573989E-2,null,null,"Ceramic tile floor",null,0.35685453033201403,null,null,"Ceramic tile floor",null,0.19419793363584259]
[null,null,"Other type of roof",null,9.8974697436567908E-5,null,null,"Cement floor",null,5.1105782203216196E-2,null,null,"Cement floor",null,0.13181720495891913]
[null,null,"Electricity for cooking",null,1.2592293869395871E-3,null,null,"Carpet floor",null,1.5023948760819175E-3,null,null,"Carpet floor",null,2.6059518717011417E-4]
[null,null,"LPG, natural gas for cooking",null,0.56733351246977903,null,null,"Grass/thatch/mud walls",null,8.0284786564529795E-2,null,null,"Other type of flooring",null,8.2385635195325285E-6]
[null,null,"Kerosene for cooking",null,2.5528487325601008E-4,null,null,"Plastic/cardboard walls",null,9.0807894687187606E-3,null,null,"Grass/thatch/mud walls",null,8.0566706299502744E-2]
[null,null,"Charcoal for cooking",null,2.3276956267436026E-2,null,null,"Mud brick walls",null,2.6389242750566384E-2,null,null,"Plastic/cardboard walls",null,7.0483373538617854E-3]
[null,null,"Wood for cooking",null,0.51756322336682481,null,null,"Metal walls",null,1.6506588158289041E-2,null,null,"Mud brick walls",null,3.6118588336131593E-3]
[null,null,"Sawdust, wood chips for cooking",null,1.1843552130074118E-3,null,null,"Planks walls",null,0.13182521226938468,null,null,"Metal walls",null,7.6275417155993591E-3]
[null,null,"Does not cook",null,9.7991014651940459E-5,null,null,"Semi-hard (hard or other)",null,4.4890393800115901E-3,null,null,"Planks walls",null,6.1063459753569801E-3]
[null,null,"Other fuel for cooking",null,1.6122785141335981E-6,null,null,"Parpaing/Cement walls",null,0.29713953183958108,null,null,"Semi-hard (hard or other)",null,2.5671168957425456E-2]
[null,null,null,null,null,null,null,"Other type of walls",null,1.8874740911363311E-5,null,null,"Parpaing/Cement walls",null,0.22316774817333498]
[null,null,null,null,null,null,null,"Bark, straw, palm bamboo roof",null,6.4975073664053761E-3,null,null,"Other type of walls",null,6.8787161514931793E-4]
[null,null,"Total Variance Explained",null,null,null,null,"Rudimentary or plastic/cardboard roof",null,6.8480674192024776E-3,null,null,"Bark, straw, palm bamboo roof",null,2.3858768243710974E-2]
[null,null,"Component",null,"Extraction Sums of Squared Loadings",null,null,"Tin roof without ceiling",null,0.45809882491091897,null,null,"Rudimentary or plastic/cardboard roof",null,5.7311902433285654E-3]
[null,null,null,null,"Total","% of Variance","Cumulative %","Tin roof with ceiling",null,0.43468831566766808,null,null,"Tin roof without ceiling",null,0.2012394572352878]
[null,null,"1",null,9.7618818322683065,14.790730048891373,14.790730048891373,"Tile roof",null,2.1867376409834098E-3,null,null,"Tin roof with ceiling",null,0.35735802130643296]
[null,null,null,null,null,null,null,"Cement (concrete) roof",null,1.343613843145228E-2,null,null,"Cement (concrete) roof",null,6.2595984349097583E-3]
[null,null,null,null,null,null,null,"Other type of roof",null,5.9405079804297103E-7,null,null,"Other type of roof",null,1.8468057390779087E-3]
[null,null,"Component Score Coefficient Matrix",null,null,null,null,"Electricity for cooking",null,9.0289180881252071E-4,null,null,"Electricity for cooking",null,5.4106631024892918E-4]
[null,null,null,null,"Component",null,null,"LPG, natural gas for cooking",null,0.30344538916229796,null,null,"LPG, natural gas for cooking",null,0.53521653843608441]
[null,null,null,null,"1",null,null,"Kerosene for cooking",null,3.3615778317148573E-3,null,null,"Kerosene for cooking",null,1.0517825714177818E-4]
[null,null,"Has electricity",null,6.9343299911734199E-2,null,null,"Charcoal for cooking",null,3.8198040374804787E-2,null,null,"Charcoal for cooking",null,6.6943749203333368E-3]
[null,null,"Has radio",null,2.7489272302574631E-2,null,null,"Wood for cooking",null,0.26437840684320896,null,null,"Wood for cooking",null,0.43113003333457595]
[null,null,"Has television",null,7.7728563791197774E-2,null,null,"Sawdust, wood chips for cooking",null,1.8071431240849929E-3,null,null,"Sawdust, wood chips for cooking",null,5.9837789209198425E-4]
[null,null,"Has refrigerator",null,6.0819030773640606E-2,null,null,"Does not cook",null,1.0913854561415212E-2,null,null,"Does not cook",null,1.5832881942347133E-4]
[null,null,"Has bicycle",null,1.6306328843369043E-2,null,null,"Other fuel for cooking",null,3.0443574480473795E-6,null,null,"Other fuel for cooking",null,4.8366439748271438E-5]
[null,null,"Has motorcycle/scooter",null,7.7459527680089364E-3]
[null,null,"Has car/truck",null,4.4556944360802118E-2]
[null,null,"Has telephone (land-line)",null,1.3912083157726072E-2,null,null,"Total Variance Explained",null,null,null,null,"Total Variance Explained"]
[null,null,"Has mobile telephone",null,5.4255049612563097E-2,null,null,"Component",null,"Extraction Sums of Squared Loadings",null,null,"Component",null,"Extraction Sums of Squared Loadings"]
[null,null,"Has watch",null,4.9960349044120916E-2,null,null,null,null,"Total","% of Variance","Cumulative %",null,null,"Total","% of Variance","Cumulative %"]
[null,null,"Has boat with a motor",null,-1.6751955512093184E-3,null,null,"1",null,7.4831148125340459,10.112317314235197,10.112317314235197,"1",null,8.5768570484281632,11.590347362740761,11.590347362740761]
[null,null,"Has bank account",null,5.6350852009320912E-2]
[null,null,"Has chain saw",null,-1.1968889108916496E-3]
[null,null,"Has iron",null,6.4755638740021007E-2,null,null,"Component Score Coefficient Matrix",null,null,null,null,"Component Score Coefficient Matrix"]
[null,null,"Has generator",null,-1.1772568196254204E-2,null,null,null,null,"Component",null,null,null,null,"Component"]
[null,null,"Has HIFI",null,4.6138463028408579E-2,null,null,null,null,"1",null,null,null,null,"1"]
[null,null,"Has video recorder",null,2.3508677223502469E-2,null,null,"Has electricity",null,4.7567808417638711E-2,null,null,"Has electricity",null,6.8534720663258664E-2]
[null,null,"Has DVD/VCD reader",null,7.0705460459732583E-2,null,null,"Has radio",null,3.5877849689484147E-2,null,null,"Has radio",null,3.4355524544315168E-2]
[null,null,"Has freezer",null,6.4753790631867578E-2,null,null,"Has television",null,6.7761158172883237E-2,null,null,"Has television",null,8.7695609918834572E-2]
[null,null,"Has hunting gun",null,-1.2545985720982381E-2,null,null,"Has refrigerator",null,7.7939784134370582E-2,null,null,"Has refrigerator",null,5.8396407791777946E-2]
[null,null,"Has fishing net",null,-1.6156734494495627E-2,null,null,"Has bicycle",null,2.5105001466114836E-2,null,null,"Has bicycle",null,9.9587549507538925E-3]
[null,null,"Has stove (gas, electric)",null,6.0954053881394486E-2,null,null,"Has motorcycle/scooter",null,9.3824246390001621E-3,null,null,"Has motorcycle/scooter",null,7.6180631621057216E-3]
[null,null,"Has gas stove",null,1.7324737448620963E-2,null,null,"Has car/truck",null,6.2734370420319027E-2,null,null,"Has car/truck",null,4.7598774541381859E-2]
[null,null,"Has has Fan",null,7.4525219936940792E-2,null,null,"Has telephone (land-line)",null,2.6141681458007823E-2,null,null,"Has telephone (land-line)",null,8.1766580662109897E-3]
[null,null,"Has brushcutter",null,1.369608324508668E-2,null,null,"Has mobile telephone",null,4.7277278705406101E-2,null,null,"Has mobile telephone",null,5.6040678750630631E-2]
[null,null,"Has sewing machine",null,1.3800889428061699E-2,null,null,"Has watch",null,6.6487951276538934E-2,null,null,"Has watch",null,4.8148313740756822E-2]
[null,null,"Has computer",null,4.5162024244075109E-2,null,null,"Has boat with a motor",null,1.4026764482317473E-3,null,null,"Has boat with a motor",null,8.015275995241565E-3]
[null,null,"Has air conditioner",null,4.4540551849685694E-2,null,null,"Owns land usable for agriculture",null,-4.4887479434840408E-2,null,null,"Owns land usable for agriculture",null,-4.5567630032936519E-2]
[null,null,"Has washing machine",null,3.280590339133653E-2,null,null,"Owns livestock, herds or farm animals",null,-3.337153358659551E-2,null,null,"Owns livestock, herds or farm animals",null,-2.3167086081791716E-2]
[null,null,"Has antenna / decoder",null,6.4160351807689336E-2,null,null,"Owns cows/ bulls",null,4.8834408633919354E-3,null,null,"Owns cows/ bulls",null,2.3466463635861603E-3]
[null,null,"Has indigenous torch",null,-1.8843792215648848E-2,null,null,"Owns goats",null,-1.615904581986332E-3,null,null,"Owns goats",null,2.2876955803156451E-3]
[null,null,"Has oil lamp",null,-5.5846353271845735E-2,null,null,"Owns sheep",null,-1.3484632723633682E-3,null,null,"Owns sheep",null,-2.8473306158526795E-3]
[null,null,"Has gas lamp",null,8.257223002428097E-3,null,null,"Owns chickens",null,-2.1708717470541258E-2,null,null,"Owns chickens",null,-1.0756338057550772E-2]
[null,null,"Has boat without motor",null,-1.4818576805869751E-2,null,null,"Owns pigs",null,2.0546608293359908E-3,null,null,"Owns pigs",null,6.8657083698115925E-4]
[null,null,"Number of members per sleeping room",null,1.3083399051582631E-2,null,null,"Owns ducks",null,2.129901559797046E-3,null,null,"Owns ducks",null,4.3296503069701385E-3]
[null,null,"Earth, sand, dung floor",null,-7.0215661455812192E-2,null,null,"Owns rabbits",null,7.7185280471277441E-3,null,null,"Owns rabbits",null,5.1019376815704511E-3]
[null,null,"Wood planks rudimentary floor",null,-1.5175460548065334E-4,null,null,"Has bank account",null,7.4255526091348611E-2,null,null,"Has bank account",null,5.5829728321766518E-2]
[null,null,"Polished wood floor",null,2.3027171229190119E-3,null,null,"Has chain saw",null,7.231241121054199E-3,null,null,"Has chain saw",null,1.1721873641857259E-2]
[null,null,"Lino/Gerflex floor",null,1.5533566255249575E-2,null,null,"Has iron",null,6.517997195835265E-2,null,null,"Has iron",null,6.6216896221402061E-2]
[null,null,"Ceramic tile floor",null,5.4966420526922112E-2,null,null,"Has generator",null,1.1966034593771315E-2,null,null,"Has generator",null,1.6332462199450077E-2]
[null,null,"Cement floor",null,1.7958668865801067E-2,null,null,"Has HIFI",null,5.767797268725143E-2,null,null,"Has HIFI",null,5.5360872183900026E-2]
[null,null,"Carpet floor",null,7.6583483537975951E-3,null,null,"Has video recorder",null,3.0553830471632924E-2,null,null,"Has video recorder",null,1.7242955645875937E-2]
[null,null,"Other type of flooring",null,-1.5597972101815604E-3,null,null,"Has DVD/VCD reader",null,6.5150990932157177E-2,null,null,"Has DVD/VCD reader",null,8.3020195851626649E-2]
[null,null,"Grass/thatch/mud walls",null,-3.3522118483829057E-2,null,null,"Has freezer",null,5.5248303766986827E-2,null,null,"Has freezer",null,8.0365318829887677E-2]
[null,null,"Plastic/cardboard walls",null,-9.6106060463240859E-3,null,null,"Has hunting gun",null,-1.6424435955012839E-3,null,null,"Has hunting gun",null,3.1315773268483188E-3]
[null,null,"Mud brick walls",null,-4.463861009008481E-3,null,null,"Has fishing net",null,-6.5291503782027591E-3,null,null,"Has fishing net",null,-1.8624753824451161E-3]
[null,null,"Metal walls",null,-1.2566858933549295E-2,null,null,"Has stove (gas, electric)",null,7.9637996412039738E-2,null,null,"Has stove (gas, electric)",null,6.3252215035711379E-2]
[null,null,"Planks walls",null,-3.5193777804123569E-2,null,null,"Has gas stove",null,-3.0739786006190789E-2,null,null,"Has gas stove",null,4.5960384898628977E-2]
[null,null,"Semi-hard (hard or other)",null,1.6354934976551782E-2,null,null,"Has has Fan",null,7.1283646501611925E-2,null,null,"Has has Fan",null,7.9387024935725761E-2]
[null,null,"Parpaing/Cement walls",null,5.9754005979214847E-2,null,null,"Has brushcutter",null,2.0466676706147727E-2,null,null,"Has brushcutter",null,2.5679551972532653E-2]
[null,null,"Other type of walls",null,-3.529256709901982E-3,null,null,"Has sewing machine",null,1.7210457420055194E-2,null,null,"Has sewing machine",null,1.6476606829079036E-2]
[null,null,"Bark, straw, palm bamboo roof",null,-1.8308943617429144E-2,null,null,"Has computer",null,6.4725002008408722E-2,null,null,"Has computer",null,3.8163612749607424E-2]
[null,null,"Rudimentary or plastic/cardboard roof",null,-9.1870863134799162E-3,null,null,"Has air conditioner",null,6.7341011921708882E-2,null,null,"Has air conditioner",null,4.405834807047046E-2]
[null,null,"Tin roof without ceiling",null,-6.4264772691205466E-2,null,null,"Has washing machine",null,5.1821946821077387E-2,null,null,"Has washing machine",null,3.1552677402041908E-2]
[null,null,"Tin roof with ceiling",null,6.9507573749023124E-2,null,null,"Has antenna / decoder",null,8.1589859224194483E-2,null,null,"Has antenna / decoder",null,7.3379933240787273E-2]
[null,null,"Tile roof",null,4.5832884817401292E-3,null,null,"Has indigenous torch",null,-7.0960970942986158E-3,null,null,"Has indigenous torch",null,-1.4086199713712695E-2]
[null,null,"Cement (concrete) roof",null,1.2789053393793208E-2,null,null,"Has oil lamp",null,-3.6852325762659635E-2,null,null,"Has oil lamp",null,-5.6021020644816309E-2]
[null,null,"Other type of roof",null,1.0191275574831917E-3,null,null,"Has gas lamp",null,1.1029817847979673E-2,null,null,"Has gas lamp",null,1.1780965789783713E-2]
[null,null,"Electricity for cooking",null,3.6351210623469824E-3,null,null,"Has boat without motor",null,-8.0471577671428225E-3,null,null,"Has boat without motor",null,-3.8015794120035266E-3]
[null,null,"LPG, natural gas for cooking",null,7.7158836979118656E-2,null,null,"Number of members per sleeping room",null,-8.2213759200977978E-3,null,null,"Number of members per sleeping room",null,1.225762790065601E-2]
[null,null,"Kerosene for cooking",null,-1.6367373560821354E-3,null,null,"Earth, sand, dung floor",null,-6.5551616592541759E-2,null,null,"Earth, sand, dung floor",null,-7.5903385648206464E-2]
[null,null,"Charcoal for cooking",null,-1.5628940906911394E-2,null,null,"Wood planks rudimentary floor",null,-1.666876754691192E-3,null,null,"Wood planks rudimentary floor",null,1.4426634538630023E-2]
[null,null,"Wood for cooking",null,-7.369671983268665E-2,null,null,"Polished wood floor",null,3.3209776227110686E-4,null,null,"Polished wood floor",null,1.1912502064163812E-2]
[null,null,"Sawdust, wood chips for cooking",null,-3.5253922201257831E-3,null,null,"Lino/Gerflex floor",null,7.2077108542993647E-3,null,null,"Lino/Gerflex floor",null,2.6339451215936786E-2]
[null,null,"Does not cook",null,-1.0140504943295485E-3,null,null,"Ceramic tile floor",null,7.982946131499645E-2,null,null,"Ceramic tile floor",null,5.1380003621986789E-2]
[null,null,"Other fuel for cooking",null,1.300727993605875E-4,null,null,"Cement floor",null,-3.0210131194198298E-2,null,null,"Cement floor",null,4.2330936599917254E-2]
[null,null,null,null,null,null,null,"Carpet floor",null,5.1797600089712008E-3,null,null,"Carpet floor",null,-1.8821534305541957E-3]
[null,null,null,null,null,null,null,"Grass/thatch/mud walls",null,-3.7864673816843615E-2,null,null,"Other type of flooring",null,-3.3465519839347157E-4]
[null,null,"Component Score Covariance Matrix",null,null,null,null,"Plastic/cardboard walls",null,-1.2734426610968293E-2,null,null,"Grass/thatch/mud walls",null,-3.3094028225406247E-2]
[null,null,"Component",null,"1",null,null,"Mud brick walls",null,-2.1708561961524042E-2,null,null,"Plastic/cardboard walls",null,-9.7884780109084944E-3]
[null,null,"1",null,0.99999999999999989,null,null,"Metal walls",null,-1.7169049362103662E-2,null,null,"Mud brick walls",null,-7.0070822008167786E-3]
[null,null,null,null,null,null,null,"Planks walls",null,-4.851955745812437E-2,null,null,"Metal walls",null,-1.0182727553727356E-2]
[null,null,null,null,null,null,null,"Semi-hard (hard or other)",null,8.9535301219506921E-3,null,null,"Planks walls",null,-9.1109262637282008E-3]
[null,null,null,null,null,null,null,"Parpaing/Cement walls",null,7.2844674792634331E-2,null,null,"Semi-hard (hard or other)",null,1.868076472880522E-2]
[null,null,null,null,null,null,null,"Other type of walls",null,-5.805746791583353E-4,null,null,"Parpaing/Cement walls",null,5.5079189885390567E-2]
[null,null,null,null,null,null,null,"Bark, straw, palm bamboo roof",null,-1.0771866978218718E-2,null,null,"Other type of walls",null,-3.0579157984870989E-3]
[null,null,null,null,null,null,null,"Rudimentary or plastic/cardboard roof",null,-1.1058637063334388E-2,null,null,"Bark, straw, palm bamboo roof",null,-1.8009258737919732E-2]
[null,null,null,null,null,null,null,"Tin roof without ceiling",null,-9.0447627656959198E-2,null,null,"Rudimentary or plastic/cardboard roof",null,-8.8266161546495941E-3]
[null,null,null,null,null,null,null,"Tin roof with ceiling",null,8.8106221113393293E-2,null,null,"Tin roof without ceiling",null,-5.2303216426502819E-2]
[null,null,null,null,null,null,null,"Tile roof",null,6.2490778018589868E-3,null,null,"Tin roof with ceiling",null,6.9698526329774579E-2]
[null,null,null,null,null,null,null,"Cement (concrete) roof",null,1.5490121571069571E-2,null,null,"Cement (concrete) roof",null,9.2245473604955271E-3]
[null,null,null,null,null,null,null,"Other type of roof",null,1.0299814028111212E-4,null,null,"Other type of roof",null,5.0105158009777166E-3]
[null,null,null,null,null,null,null,"Electricity for cooking",null,4.0154613303191623E-3,null,null,"Electricity for cooking",null,2.712046146315246E-3]
[null,null,null,null,null,null,null,"LPG, natural gas for cooking",null,7.3613567083316123E-2,null,null,"LPG, natural gas for cooking",null,8.5297556603583125E-2]
[null,null,null,null,null,null,null,"Kerosene for cooking",null,-7.7479922373741641E-3,null,null,"Kerosene for cooking",null,1.1957346470182293E-3]
[null,null,null,null,null,null,null,"Charcoal for cooking",null,-2.6117892686598719E-2,null,null,"Charcoal for cooking",null,-9.5395270550571211E-3]
[null,null,null,null,null,null,null,"Wood for cooking",null,-6.8711682344613348E-2,null,null,"Wood for cooking",null,-7.6555424173384748E-2]
[null,null,null,null,null,null,null,"Sawdust, wood chips for cooking",null,-5.6808571174693026E-3,null,null,"Sawdust, wood chips for cooking",null,-2.852066175440396E-3]
[null,null,null,null,null,null,null,"Does not cook",null,-1.3960683211600881E-2,null,null,"Does not cook",null,-1.4670733061308806E-3]
[null,null,null,null,null,null,null,"Other fuel for cooking",null,-2.3316610229767062E-4,null,null,"Other fuel for cooking",null,-8.1085628702195925E-4]
[]
[]
[null,null,null,null,null,null,null,"Component Score Covariance Matrix",null,null,null,null,"Component Score Covariance Matrix"]
[null,null,null,null,null,null,null,"Component",null,"1",null,null,"Component",null,"1"]
[null,null,null,null,null,null,null,"1",null,0.99999999999999989,null,null,"1",null,0.99999999999999978]
[]
[]
[]
[]
[]
[]
[]
[]
[]
[]
[]
[]
[]
[]
[]
[]
[]
[]
[]
[]
[]
[]
[]
[]
[]
[]
[]
[]
[]
[]
[]
[]
[]
[]
[]
[]
[]
[]
[]
[]
[]
[]
[]
[]
[]
[]
[]
[]
[]
[]
[]
[]
[]
[]
[]
[]
[]
[]
[]
[]
[]
[]
[]
[]
[]
[]
[]
[]
[]
[]
[]
[]
[]
[]
[]
[]
[]
[]
[]
[]
[]
[]
[]
[]
[]
[]
[]
[]
[]
[]
[]
[]
[]
[]
[]
[]
[]
[]
[]
[]
[]
[]
[]
[]
[]
[]
[]
[]
[]
[]
[]
[]
[]
[]
[]
[]
[]
[]
[]
[]
[]
[]
[]
[]
[]
[]
[]
[]
[]
[]
[]
[]
[]
[]
[]
[]
[]
[]
[]
[]
[]
[]
[]
[]
[]
[]
[]
[]
[]
[]
[]
[]
[]
[]
[]
[]
[]
[]
[]
[]
[]
[]
[]
[]
[]
[]
[]
[]
[]
[]
[]
[]
[]
[]
[]
[]
[]
[]
[]
[]
[]
[]
[]
[]
[]
[]
[]
[]
[]
[]
[]
[]
[]
[]
[]
[]
[]
[]
[]
[]
[]
[]
[]
[]
[]
[]
[]
[]
[]
[]
[]
[]
[]
[]
[]
[]
[]
[]
[]
[]
[]
[]
[]
[]
[]
[]
[]
[]
[]
[]
[]
[]
[]
[]
[]
[]
[]
[]
[]
[]
[]
[]
[]
[]
[]
[]
[]
[]
[]
[]
[]
[]
[]
[]
[]
[]
[]
[]
[]
[]
[]
[]
[]
[]
[]
[]
[]
[]
[]
[]
[]
[]
[]
[]
[]
[]
[]
[]
[]
[]
[]
[]
[]
[]
[]
[]
[]
[]
[]
[]
[]
[]
[]
[]
[]
[]
[]
[]
[]
[]
[]
[]
[]
[]
[]
[]
[]
[]
[]
[]
[]
[]
[]
[]
[]
[]
[]
[]
[]
[]
[]
[]
[]
[]
[]
[]
[]
[]
[]
[]
[]
[]
[]
[]
[]
[]
[]
[]
[]
[]
[]
[]
[]
[]
[]
[]
[]
[]
[]
[]
[]
[]
[]
[]
[]
[]
[]
[]
[]
[]
[]
[]
[]
[]
[]
[]
[]
[]
[]
[]
[]
[]
[]
[]
[]
[]
[]
[]
[]
["DHS12"]
["Gabon",null,"Count"]
["W_text_t","",9755]
["W_text_i","",9755]
["S_text_s","",9755]
["S_text_i","",9755]
["Urban/Rural","Urban",5349]
[null,"Rural",4406]
[null,"Missing",0]
["2012"]
[]
["Sub-national region names","Weighted population"]
[{"$f":"R15","v":"Estuaire"},{"$f":"BR122+BR123","v":4483.5190350000039}]
[{"$f":"S15","v":"Haut-Ogooué"},{"$f":"BS122+BS123","v":3785.7831159999987}]
[{"$f":"T15","v":"Libreville-Port-Gentil"},{"$f":"BT122+BT123","v":22027.37869700008}]
[{"$f":"U15","v":"Moyen-Ogooué"},{"$f":"BU122+BU123","v":1334.9791310000001}]
[{"$f":"V15","v":"Ngounié"},{"$f":"BV122+BV123","v":2556.4514980000013}]
[{"$f":"W15","v":"Nyanga"},{"$f":"BW122+BW123","v":1108.5079959999998}]
[{"$f":"X15","v":"Ogooué Maritime"},{"$f":"BX122+XR123","v":293.4670500000006}]
[{"$f":"Y15","v":"Ogooué-Ivindo"},{"$f":"BY122+BY123","v":1478.2498589999975}]
[{"$f":"Z15","v":"Ogooué-Lolo"},{"$f":"BZ122+BZ123","v":1496.9117530000003}]
[{"$f":"AA15","v":"Woleu-Ntem"},{"$f":"CA122+CA123","v":2295.8159670000014}]
[{"$f":"AB15","v":0},{"$f":"CB122+CB123","v":0}]
[{"$f":"AC15","v":0},{"$f":"CC122+CC123","v":0}]
[{"$f":"AD15","v":0},{"$f":"CD122+CD123","v":0}]
[{"$f":"AE15","v":0},{"$f":"CE122+CE123","v":0}]
[{"$f":"AF15","v":0},{"$f":"CF122+CF123","v":0}]
[{"$f":"AG15","v":0},{"$f":"CG122+CG123","v":0}]
[{"$f":"AH15","v":0},{"$f":"CH122+CH123","v":0}]
[{"$f":"AI15","v":0},{"$f":"CI122+CI123","v":0}]
[{"$f":"AJ15","v":0},{"$f":"CJ122+CJ123","v":0}]
[{"$f":"AK15","v":0},{"$f":"CK122+CK123","v":0}]
[{"$f":"AL15","v":0},{"$f":"CL122+CL123","v":0}]
[{"$f":"AM15","v":0},{"$f":"CM122+CM123","v":0}]
[{"$f":"AN15","v":0},{"$f":"CN122+CN123","v":0}]
[{"$f":"AO15","v":0},{"$f":"CO122+CO123","v":0}]
[{"$f":"AP15","v":0},{"$f":"CP122+CP123","v":0}]
[{"$f":"AQ15","v":0},{"$f":"CQ122+CQ123","v":0}]
[{"$f":"AR15","v":0},{"$f":"CR122+CR123","v":0}]
[{"$f":"AS15","v":0},{"$f":"CS122+CS123","v":0}]
[{"$f":"AT15","v":0},{"$f":"CT122+CT123","v":0}]
[{"$f":"AU15","v":0},{"$f":"CU122+CU123","v":0}]
[{"$f":"AV15","v":0},{"$f":"CV122+CV123","v":0}]
[{"$f":"AW15","v":0},{"$f":"CW122+CW123","v":0}]
[{"$f":"AX15","v":0},{"$f":"CX122+CX123","v":0}]
[{"$f":"AY15","v":0},{"$f":"CY122+CY123","v":0}]
[]
[{"$f":"34-COUNTIF(A1037:A1071,\"0\")","v":10},"Sub-regions"]

{"sheet":"data_summary","index":6,"n_rows":98,"n_cols":67,"rows_kept":98,"cut":false,"hidden":false,"merged":[]}
["iso3","year","data_source","row","var1","var2","varname","total_q1","total_q2","total_q3","total_q4","total_q5","urban_q1","urban_q2","urban_q3","urban_q4","urban_q5","rural_q1","rural_q2","rural_q3","rural_q4","rural_q5","region_1_name","region_2_name","region_3_name","region_4_name","region_5_name","region_6_name","region_7_name","region_8_name","region_9_name","region_10_name","region_1","region_2","region_3","region_4","region_5","region_6","region_7","region_8","region_9","region_10","n_total_q1","n_total_q2","n_total_q3","n_total_q4","n_total_q5","n_urban_q1","n_urban_q2","n_urban_q3","n_urban_q4","n_urban_q5","n_rural_q1","n_rural_q2","n_rural_q3","n_rural_q4","n_rural_q5","n_region_1","n_region_2","n_region_3","n_region_4","n_region_5","n_region_6","n_region_7","n_region_8","n_region_9","n_region_10"]
["GAB",2000,"GAB_2000_DHS",16,"Water","Improved","w_imp",46.326885445559093,75.134481378619029,94.325041473501088,97.30821426430964,99.262577850021529,80.584344089621524,96.255909653626532,97.845806157244425,99.359608972943704,99.44217839643467,41.76310453719239,40.338961280936623,42.726804993238297,49.465003798049679,67.122036592636093,"Big cities","East (Haut-Ogoou‚ & Ogoou‚-Lolo)","North (Ogoou‚-Ivindo & Woleu-Ntem)","South (Ngouni‚, Nyanga)","West (Estuaire, Moyen-Ogoou‚ & Ogoou‚-maritime)","","","","","",99.84348798211218,72.240510575647065,55.055371191168533,65.044725201678446,67.014250990421075]
["GAB",2000,"GAB_2000_DHS",17,"Water","Not Improved","",53.673114554440907,24.865518621380971,5.6749585264989122,2.6917857356903601,0.737422149978471,19.415655910378479,3.744090346373468,2.1541938427555749,0.64039102705629602,0.55782160356532984,58.23689546280761,59.661038719063377,57.273195006761703,50.534996201950321,32.877963407363907,"Big cities","East (Haut-Ogoou‚ & Ogoou‚-Lolo)","North (Ogoou‚-Ivindo & Woleu-Ntem)","South (Ngouni‚, Nyanga)","West (Estuaire, Moyen-Ogoou‚ & Ogoou‚-maritime)","","","","","",0.15651201788782029,27.759489424352939,44.944628808831467,34.955274798321547,32.985749009578917]
["GAB",2000,"GAB_2000_DHS",18,"Water ladder","Basic","w_bas",34.235568344268167,65.366998799398559,89.231489233932024,93.415885693737252,96.979538559471038,61.888776260829317,88.940460519950918,94.323357135583635,96.180101485809502,96.956123936523795,31.322328402894289,32.190491102187423,30.677845985145101,40.116118080218293,57.523585359889132,"Big cities","East (Haut-Ogoou‚ & Ogoou‚-Lolo)","North (Ogoou‚-Ivindo & Woleu-Ntem)","South (Ngouni‚, Nyanga)","West (Estuaire, Moyen-Ogoou‚ & Ogoou‚-maritime)","","","","",""]
["GAB",2000,"GAB_2000_DHS",19,"Water ladder","Limited","w_lim",12.091317101290921,9.7674825792204736,5.0935522395690587,3.8923285705723858,2.2830392905504948,18.695567828792189,7.3154491336756156,3.5224490216607989,3.1795074871341988,2.486054459910866,10.440776134298099,8.1484701787491982,12.048959008093201,9.3488857178313882,9.598451232746962,"Big cities","East (Haut-Ogoou‚ & Ogoou‚-Lolo)","North (Ogoou‚-Ivindo & Woleu-Ntem)","South (Ngouni‚, Nyanga)","West (Estuaire, Moyen-Ogoou‚ & Ogoou‚-maritime)","","","","",""]
["GAB",2000,"GAB_2000_DHS",20,"Water ladder","Unimproved","w_unimp",17.287289997939499,11.147313802644449,3.5737177372983671,1.5632573322854031,0.64873714697101548,10.81594519103821,2.8041723936432419,1.65241800932678,0.48843107580684381,0.47591857178393582,16.837883893173139,18.67313069534973,16.015651914489961,20.1953732895855,12.86256301612508,"Big cities","East (Haut-Ogoou‚ & Ogoou‚-Lolo)","North (Ogoou‚-Ivindo & Woleu-Ntem)","South (Ngouni‚, Nyanga)","West (Estuaire, Moyen-Ogoou‚ & Ogoou‚-maritime)","","","","",""]
["GAB",2000,"GAB_2000_DHS",21,"Water ladder","Surface water","w_sur",36.385824556501412,13.718204818736529,2.1012407892005411,1.128528403404959,0.088685003007453606,8.5997107193402815,0.93991795273022616,0.50177583342878618,0.1519599512494581,0.081903031781404803,41.399011569634467,40.987908023713644,41.257543092271732,30.339622912364831,20.015400391238821,"Big cities","East (Haut-Ogoou‚ & Ogoou‚-Lolo)","North (Ogoou‚-Ivindo & Woleu-Ntem)","South (Ngouni‚, Nyanga)","West (Estuaire, Moyen-Ogoou‚ & Ogoou‚-maritime)","","","","",""]
["GAB",2000,"GAB_2000_DHS",29,"Piped water","Yes","w_pip",19.063673904448329,61.806642325211349,90.607977533180076,95.799373655539384,98.675062582372718,72.499755072106183,94.926721429907019,96.49005218215774,99.027495010551007,98.855493298049964,11.91089333980929,8.9725700468388467,11.20931752052015,20.239252599619189,45.409524013190357,"Big cities","East (Haut-Ogoou‚ & Ogoou‚-Lolo)","North (Ogoou‚-Ivindo & Woleu-Ntem)","South (Ngouni‚, Nyanga)","West (Estuaire, Moyen-Ogoou‚ & Ogoou‚-maritime)","","","","","",99.519714062325463,64.708148453498708,23.072174144135541,42.480407982918528,54.435350968226061]
["GAB",2000,"GAB_2000_DHS",30,"Piped water","No","",80.936326095551507,38.193357674788402,9.3920224668198831,4.2006263444605976,1.3249374176272739,27.500244927893199,5.0732785700928336,3.509947817842253,0.97250498944898911,1.144506701950005,88.089106660190751,91.027429953161146,88.790682479479827,79.760747400380765,54.590475986809771,"Big cities","East (Haut-Ogoou‚ & Ogoou‚-Lolo)","North (Ogoou‚-Ivindo & Woleu-Ntem)","South (Ngouni‚, Nyanga)","West (Estuaire, Moyen-Ogoou‚ & Ogoou‚-maritime)","","","","","",0.48028593767452021,35.291851546500872,76.927825855864597,57.519592017082203,45.564649031774422]
["GAB",2000,"GAB_2000_DHS",31,"Piped water on premises","Yes","w_pop",3.1951147883986311,17.57516008142677,41.28292204091575,59.919569543615808,92.99220981199835,17.186154675844222,38.009513093469018,52.790177091419629,73.654046741676893,94.338019031183265,2.743821226680653,1.4646793265715861,2.450238507539551,6.9516752499145111,30.05701411661769,"Big cities","East (Haut-Ogoou‚ & Ogoou‚-Lolo)","North (Ogoou‚-Ivindo & Woleu-Ntem)","South (Ngouni‚, Nyanga)","West (Estuaire, Moyen-Ogoou‚ & Ogoou‚-maritime)","","","","","",62.303138612755127,40.573909466027558,11.236330354587571,11.46472929686246,26.8217285168271]
["GAB",2000,"GAB_2000_DHS",32,"Piped water on premises","No","",96.804885211601345,82.424839918573085,58.717077959084293,40.080430456384178,7.0077901880016666,82.813845324155366,61.990486906530847,47.209822908580257,26.345953258323071,5.6619809688167217,97.256178773319348,98.535320673428402,97.549761492460448,93.048324750085442,69.942985883382391,"Big cities","East (Haut-Ogoou‚ & Ogoou‚-Lolo)","North (Ogoou‚-Ivindo & Woleu-Ntem)","South (Ngouni‚, Nyanga)","West (Estuaire, Moyen-Ogoou‚ & Ogoou‚-maritime)","","","","","",37.696861387244141,59.426090533971802,88.763669645412364,88.535270703137769,73.178271483173205]
["GAB",2000,"GAB_2000_DHS",35,"Water source on premises","Yes","",3.9841884599080069,20.486275255909021,48.855552592623432,64.658458144818269,94.176698133234666,20.289781011417549,45.507795270697287,57.953943161870583,77.891055764207081,95.316230848536875,3.2125602003330491,2.7168449154127439,3.1975442232646349,8.2944090408539388,32.132457734381603,"Big cities","East (Haut-Ogoou‚ & Ogoou‚-Lolo)","North (Ogoou‚-Ivindo & Woleu-Ntem)","South (Ngouni‚, Nyanga)","West (Estuaire, Moyen-Ogoou‚ & Ogoou‚-maritime)","","","","","",67.605791895835281,42.615824581017677,12.33673790806824,12.09006109989274,29.656697450086629]
["GAB",2000,"GAB_2000_DHS",36,"Water source on premises","No","",96.015811540091974,79.513724744090979,51.144447407376617,35.341541855181717,5.8233018667653322,79.710218988582042,54.492204729302451,42.046056838129367,22.108944235792869,4.6837691514631121,96.787439799666942,97.283155084587264,96.802455776735371,91.705590959146036,67.867542265618525,"Big cities","East (Haut-Ogoou‚ & Ogoou‚-Lolo)","North (Ogoou‚-Ivindo & Woleu-Ntem)","South (Ngouni‚, Nyanga)","West (Estuaire, Moyen-Ogoou‚ & Ogoou‚-maritime)","","","","","",32.394208104164051,57.384175418981883,87.663262091931813,87.909938900107392,70.343302549913673]
["GAB",2000,"GAB_2000_DHS",41,"Water point at more than 30 minutes","Yes","",17.68947563342245,11.370141481925611,4.9034489006470778,3.1974312542496031,0.42824207056955033,12.619845616163749,4.9912682804146087,3.5000226883895298,1.159088170093286,0.51164818440470705,11.66297958599845,16.986142087563611,21.51879449680867,17.502896136699629,12.10816285992316,"Big cities","East (Haut-Ogoou‚ & Ogoou‚-Lolo)","North (Ogoou‚-Ivindo & Woleu-Ntem)","South (Ngouni‚, Nyanga)","West (Estuaire, Moyen-Ogoou‚ & Ogoou‚-maritime)","","","","","",2.4132899315299028,12.914866775689489,7.9740124819384226,15.102820958245729,15.414299249733309]
["GAB",2000,"GAB_2000_DHS",42,"Water point at more than 30 minutes","No","w_30min",82.310524366577582,88.629858518074258,95.096551099353007,96.802568745750435,99.571757929430433,87.380154383835944,95.008731719585285,96.499977311610479,98.840911829906702,99.48835181559528,88.337020414001515,83.013857912436279,78.481205503191305,82.497103863300353,87.891837140076888,"Big cities","East (Haut-Ogoou‚ & Ogoou‚-Lolo)","North (Ogoou‚-Ivindo & Woleu-Ntem)","South (Ngouni‚, Nyanga)","West (Estuaire, Moyen-Ogoou‚ & Ogoou‚-maritime)","","","","","",97.586710068469969,87.085133224310113,92.025987518061541,84.897179041754555,84.585700750266867]
["GAB",2000,"GAB_2000_DHS",58,"Source of drinking water","Piped into residence/yard/plot","",3.1988149824543179,17.597347746534041,41.375119130616923,59.919569543615808,92.99220981199835,17.216043542284371,38.009513093469018,52.95400709317353,73.654046741676893,94.338019031183265,2.743821226680653,1.4646793265715861,2.450238507539551,6.9816966916820036,30.05701411661769,"Big cities","East (Haut-Ogoou‚ & Ogoou‚-Lolo)","North (Ogoou‚-Ivindo & Woleu-Ntem)","South (Ngouni‚, Nyanga)","West (Estuaire, Moyen-Ogoou‚ & Ogoou‚-maritime)","","","","","",62.358859698155008,40.670377359267981,11.236330354587571,11.47961449505374,26.8217285168271]
["GAB",2000,"GAB_2000_DHS",59,"Source of drinking water","Public tap","",15.886936154748501,44.287322037600049,49.435213066896097,35.87980411192359,5.6828527703743932,55.409797646068547,56.917208336437987,43.835494082891863,25.373448268874078,4.5174742668667172,9.1670721131286417,7.5078907202672616,8.7590790129805995,13.3449609608911,15.35250989657265,"Big cities","East (Haut-Ogoou‚ & Ogoou‚-Lolo)","North (Ogoou‚-Ivindo & Woleu-Ntem)","South (Ngouni‚, Nyanga)","West (Estuaire, Moyen-Ogoou‚ & Ogoou‚-maritime)","","","","","",37.249860257126542,24.19162017702665,11.83584378954796,31.055947802955711,27.61362245139911]
["GAB",2000,"GAB_2000_DHS",60,"Source of drinking water","Protected well in yard/plot","",1.4910249495159471,0.90473907599096393,0.2179288020025518,0.1956875088585083,0.096680365071718802,0.84627637738019978,0,0,0.0258065194319884,0.13104485085024761,1.386613837966258,1.325075230015921,1.812237633067239,2.191760285193912,1.5035461152766281,"Big cities","East (Haut-Ogoou‚ & Ogoou‚-Lolo)","North (Ogoou‚-Ivindo & Woleu-Ntem)","South (Ngouni‚, Nyanga)","West (Estuaire, Moyen-Ogoou‚ & Ogoou‚-maritime)","","","","","",0.11179429849077641,0.49352937355055992,1.8859905008681681,0.34068639163506581,1.4536953483706141]
["GAB",2000,"GAB_2000_DHS",61,"Source of drinking water","Public protected well","",13.70953350470135,5.5637892363783861,1.097745955953304,0.67562950846501224,0,1.7138580156415351,0.27387067763912198,0.0132336841562333,0.17954089944943091,0,14.25593178802521,18.31636639304034,17.41455533775024,13.16331138167582,10.87757974963486,"Big cities","East (Haut-Ogoou‚ & Ogoou‚-Lolo)","North (Ogoou‚-Ivindo & Woleu-Ntem)","South (Ngouni‚, Nyanga)","West (Estuaire, Moyen-Ogoou‚ & Ogoou‚-maritime)","","","","","",0,1.28893482818162,14.887304446658259,16.14677716680136,3.2218103958335038]
["GAB",2000,"GAB_2000_DHS",62,"Source of drinking water","Open well in yard/plot","",1.655070472985259,1.059428624492432,0.81651989975755923,0.58690337816481486,0,1.581785413425882,0.87216126127808258,0.92426329377797956,0,0,0.60894144964868668,1.780673512187771,1.1424472411262829,1.8330992771476911,0.93846932745669243,"Big cities","East (Haut-Ogoou‚ & Ogoou‚-Lolo)","North (Ogoou‚-Ivindo & Woleu-Ntem)","South (Ngouni‚, Nyanga)","West (Estuaire, Moyen-Ogoou‚ & Ogoou‚-maritime)","","","","","",0.078256008943543495,0.84579000850856656,3.0411052396920928,0.76617349299512505,1.5590355910061651]
["GAB",2000,"GAB_2000_DHS",63,"Source of drinking water","Public open well","",4.8808511298153414,4.0887604987224861,0.97651095038305724,0.32627236053150699,0.20669621770800281,4.6574820556702337,1.0331911163641221,0.1633186075515681,0.29405570908949269,0.18856130724898831,3.2723294570534129,5.9904270294504887,4.7584813102033028,5.8896758422546336,2.2595370720942398,"Big cities","East (Haut-Ogoou‚ & Ogoou‚-Lolo)","North (Ogoou‚-Ivindo & Woleu-Ntem)","South (Ngouni‚, Nyanga)","West (Estuaire, Moyen-Ogoou‚ & Ogoou‚-maritime)","","","","","",0.044717719396310598,1.6538546531306171,9.8395340450588193,2.3317575110043012,2.4860297261990212]
["GAB",2000,"GAB_2000_DHS",64,"Source of drinking water","Spring","",21.502736790279389,11.724041570039599,3.219920728180266,0.93646450223344502,0.73336305939202751,8.8097153918656321,1.562893736882536,1.0767374793693989,0.25353308702259397,0.57471452906982179,25.91322597294219,21.804060307422699,20.2294467263205,24.945196340366191,17.186537125186099,"Big cities","East (Haut-Ogoou‚ & Ogoou‚-Lolo)","North (Ogoou‚-Ivindo & Woleu-Ntem)","South (Ngouni‚, Nyanga)","West (Estuaire, Moyen-Ogoou‚ & Ogoou‚-maritime)","","","","","",0.067076579094465905,10.42182346971992,30.083368575637021,6.8399179892285566,11.93589245067189]
["GAB",2000,"GAB_2000_DHS",65,"Source of drinking water","River/stream","",35.468096465426683,13.199568285389001,2.1012407892005411,1.128528403404959,0.088685003007453606,8.2683394860438444,0.93991795273022616,0.50177583342878618,0.1519599512494581,0.081903031781404803,41.12699673336985,40.22428817930119,39.269678210599707,29.45841981833513,19.37262755885013,"Big cities","East (Haut-Ogoou‚ & Ogoou‚-Lolo)","North (Ogoou‚-Ivindo & Woleu-Ntem)","South (Ngouni‚, Nyanga)","West (Estuaire, Moyen-Ogoou‚ & Ogoou‚-maritime)","","","","","",0,18.813344151371641,16.58112375460815,28.181870005982262,21.807505791476409]
["GAB",2000,"GAB_2000_DHS",66,"Source of drinking water","Pond/lake","",0.91772809107473607,0.51863653334752702,0,0,0,0.33137123329643742,0,0,0,0,0.2720148362646142,0.76361984441245623,1.9878648816720139,0.88120309402969643,0.64277283238869054,"Big cities","East (Haut-Ogoou‚ & Ogoou‚-Lolo)","North (Ogoou‚-Ivindo & Woleu-Ntem)","South (Ngouni‚, Nyanga)","West (Estuaire, Moyen-Ogoou‚ & Ogoou‚-maritime)","","","","","",0,0.84824699415816851,0.1726362319515535,0.088584450543586102,1.132007351128586]
["GAB",2000,"GAB_2000_DHS",67,"Source of drinking water","Rainwater","",1.289207458999281,0.91926249709579544,0.533241690332942,0.16929134033000209,0,0.99351081231404004,0.27387067763912198,0.42711709978689222,0,0,1.2530525849205281,0.82291945733016014,2.175971138740421,1.3106763084237429,0.73811815194122044,"Big cities","East (Haut-Ogoou‚ & Ogoou‚-Lolo)","North (Ogoou‚-Ivindo & Woleu-Ntem)","South (Ngouni‚, Nyanga)","West (Estuaire, Moyen-Ogoou‚ & Ogoou‚-maritime)","","","","","",0.067076579094465905,0.38513710276028451,0.053126990387014003,2.5090012710723362,1.9354480526548139]
["GAB",2000,"GAB_2000_DHS",68,"Source of drinking water","Bottled water","",0,0,0.055832463609155399,0,0.1241533728810595,0,0,0.077585457551211004,0,0.1682829829995425,0,0,0,0,0,"Big cities","East (Haut-Ogoou‚ & Ogoou‚-Lolo)","North (Ogoou‚-Ivindo & Woleu-Ntem)","South (Ngouni‚, Nyanga)","West (Estuaire, Moyen-Ogoou‚ & Ogoou‚-maritime)","","","","","",0.022358859698155299,0,0.11509082130103571,0.0927390795459518,0]
["GAB",2000,"GAB_2000_DHS",69,"Source of drinking water","Other","",0,0.13710389440939441,0.1707265230676823,0.18184934247234749,0.075359399567011695,0.1718200260085701,0.11737314755962371,0.0264673683124667,0.067608823206025098,0,0,0,0,0,1.0712880539811509,"Big cities","East (Haut-Ogoou‚ & Ogoou‚-Lolo)","North (Ogoou‚-Ivindo & Woleu-Ntem)","South (Ngouni‚, Nyanga)","West (Estuaire, Moyen-Ogoou‚ & Ogoou‚-maritime)","","","","","",0,0.38734188232342959,0.2685452497024165,0.1669303431827133,0.033224324433393203]
["GAB",2000,"GAB_2000_DHS",122,"Sanitation","Improved","s_imp",48.840108929529762,59.60483179004666,71.503628647176825,85.224469147087675,95.950895223872394,57.00910935427278,70.714713867215892,78.076375397936687,89.921739626529643,97.041984359403017,48.557887426124417,47.70491632301438,49.528600960185358,55.268259715053468,71.278086381263392,"Big cities","East (Haut-Ogoou‚ & Ogoou‚-Lolo)","North (Ogoou‚-Ivindo & Woleu-Ntem)","South (Ngouni‚, Nyanga)","West (Estuaire, Moyen-Ogoou‚ & Ogoou‚-maritime)","","","","","",84.552163703454539,62.490890552114642,56.01655722054555,55.894339208757188,64.147842458461724]
["GAB",2000,"GAB_2000_DHS",123,"Sanitation","Not Improved","",51.159891070470238,40.39516820995334,28.496371352823179,14.775530852912331,4.0491047761276064,42.99089064572722,29.285286132784108,21.92362460206331,10.078260373470361,2.9580156405969831,51.442112573875583,52.29508367698562,50.471399039814642,44.731740284946532,28.721913618736611,"Big cities","East (Haut-Ogoou‚ & Ogoou‚-Lolo)","North (Ogoou‚-Ivindo & Woleu-Ntem)","South (Ngouni‚, Nyanga)","West (Estuaire, Moyen-Ogoou‚ & Ogoou‚-maritime)","","","","","",15.447836296545461,37.509109447885358,43.98344277945445,44.105660791242812,35.852157541538283]
["GAB",2000,"GAB_2000_DHS",124,"Sanitation ladder","Basic","s_bas",17.650135886992981,17.476582316159949,29.056968615032641,55.963751324500478,87.468208061450241,16.134969668564231,22.736461678761081,35.330814524194317,64.117109836115816,88.663674314210255,23.620908757328781,18.354930119506928,31.477426994259201,34.838258973464256,53.863265720548178,"Big cities","East (Haut-Ogoou‚ & Ogoou‚-Lolo)","North (Ogoou‚-Ivindo & Woleu-Ntem)","South (Ngouni‚, Nyanga)","West (Estuaire, Moyen-Ogoou‚ & Ogoou‚-maritime)","","","","",""]
["GAB",2000,"GAB_2000_DHS",125,"Sanitation ladder","Limited","s_lim",31.189973042536831,42.128249473886733,42.446660032144173,29.260717822587221,8.4826871624221969,40.874139685708563,47.978252188454853,42.745560873742313,25.804629790413891,8.3783100451927677,24.936978668795629,29.349986203507441,18.051173965926111,20.430000741589151,17.41482066071519,"Big cities","East (Haut-Ogoou‚ & Ogoou‚-Lolo)","North (Ogoou‚-Ivindo & Woleu-Ntem)","South (Ngouni‚, Nyanga)","West (Estuaire, Moyen-Ogoou‚ & Ogoou‚-maritime)","","","","",""]
["GAB",2000,"GAB_2000_DHS",126,"Sanitation ladder","Unimproved","s_unimp",46.326379208774497,37.59266410632727,26.729258311373169,14.03985971820639,3.904084228519991,39.329330387079303,27.05036383072536,20.811134864563311,9.7327720294553473,2.9580156405969831,48.341736487197821,44.637957479285859,47.093537234838919,41.91611307322863,26.89449618890794,"Big cities","East (Haut-Ogoou‚ & Ogoou‚-Lolo)","North (Ogoou‚-Ivindo & Woleu-Ntem)","South (Ngouni‚, Nyanga)","West (Estuaire, Moyen-Ogoou‚ & Ogoou‚-maritime)","","","","",""]
["GAB",2000,"GAB_2000_DHS",127,"Sanitation ladder","Open defecation","s_od",4.8335118616957002,2.8025041036260512,1.76711304145001,0.73567113470592727,0.14502054760757829,3.661560258647901,2.234922302058707,1.1124897375000491,0.34548834401495859,0,3.1003760866777679,7.6571261976997773,3.3778618049757689,2.8156272117179628,1.8274174298286929,"Big cities","East (Haut-Ogoou‚ & Ogoou‚-Lolo)","North (Ogoou‚-Ivindo & Woleu-Ntem)","South (Ngouni‚, Nyanga)","West (Estuaire, Moyen-Ogoou‚ & Ogoou‚-maritime)","","","","",""]
["GAB",2000,"GAB_2000_DHS",139,"Sanitation ladder","Open defecation","",4.8227205679643639,2.7929163453810268,1.762797114640593,0.73325440330304337,0.14502054760757829,3.6559267717687902,2.2288983329877339,1.1117503550077421,0.34418955584119748,0,3.089772262460329,7.6353841942904674,3.3778618049757689,2.803519955830398,1.8123071843509411,"Big cities","East (Haut-Ogoou‚ & Ogoou‚-Lolo)","North (Ogoou‚-Ivindo & Woleu-Ntem)","South (Ngouni‚, Nyanga)","West (Estuaire, Moyen-Ogoou‚ & Ogoou‚-maritime)","","","","","",0.92706355411593455,7.310239315131084,0.39398103402661711,2.41579672508849,1.845508589211001]
["GAB",2000,"GAB_2000_DHS",151,"Shared among all sanitation facilities","Yes","",43.625979095763363,58.891966615283224,61.647562085895558,49.362755450354307,14.603270344642519,61.431622892958401,66.460420896289278,56.880220351554101,40.203926659273662,10.420260589051949,39.374468337173099,40.999284010321958,43.063350103979687,50.401950209366689,35.367188525683311,"Big cities","East (Haut-Ogoou‚ & Ogoou‚-Lolo)","North (Ogoou‚-Ivindo & Woleu-Ntem)","South (Ngouni‚, Nyanga)","West (Estuaire, Moyen-Ogoou‚ & Ogoou‚-maritime)","","","","","",46.976376172713358,36.631235054056027,45.780494626424719,52.100701708095428,43.569025270758033]
["GAB",2000,"GAB_2000_DHS",152,"Shared among all sanitation facilities","No","",55.848775729217017,40.416564387998143,38.101878933702928,50.354207695366867,85.227430061174076,37.664387593448048,33.422218819713443,42.837718683937773,59.461311122220408,89.426885681323483,60.209435328968347,58.620523260690483,56.615326421562898,48.896942578826803,64.19190424301938,"Big cities","East (Haut-Ogoou‚ & Ogoou‚-Lolo)","North (Ogoou‚-Ivindo & Woleu-Ntem)","South (Ngouni‚, Nyanga)","West (Estuaire, Moyen-Ogoou‚ & Ogoou‚-maritime)","","","","","",52.786255227760442,62.17162157716173,53.859424600753989,47.573717267573009,56.323296509447751]
["GAB",2000,"GAB_2000_DHS",153,"Type of toilet facility","Modern flush toilets","",0.0116767374755619,2.9303695240326681,8.3869457120742101,28.455873577332209,83.087587326151848,2.2722036749257408,7.5541514377764134,14.62699845121119,45.834003930444553,88.402937637327142,0.041874516717692899,0,0,0.71538621334858821,20.786405000866999,"Big cities","East (Haut-Ogoou‚ & Ogoou‚-Lolo)","North (Ogoou‚-Ivindo & Woleu-Ntem)","South (Ngouni‚, Nyanga)","West (Estuaire, Moyen-Ogoou‚ & Ogoou‚-maritime)","","","","","",36.251817063624912,24.640566901707299,5.7954902803098296,5.8546329248872011,12.03999008590695,null,null,null,null,null,0.75718600000000003,187.94493900000001,547.91533800000013,1845.5789240000011,5388.3523530000048,108.48194700000001,361.69406600000002,689.47965300000044,2215.6785599999989,4229.654142000003,0.75718600000000003,0,0,12.143587999999999,352.65959800000002,5913.8813319999826,1161.6239519999999,246.61747700000001,197.5618529999999,450.86412599999983]
["GAB",2000,"GAB_2000_DHS",154,"Type of toilet facility","Ventilated improved pit (VIP) Latrines","",2.6422506615412198,19.11691598638944,36.909729081532667,42.728735851549096,9.1279920200522309,15.498813733558221,36.757867165072447,42.704249659895837,34.354963666629878,5.9097871825672934,0.30521169706594747,3.0669588437285622,2.5735494495342079,12.724841456282521,23.641815126264731,"Big cities","East (Haut-Ogoou‚ & Ogoou‚-Lolo)","North (Ogoou‚-Ivindo & Woleu-Ntem)","South (Ngouni‚, Nyanga)","West (Estuaire, Moyen-Ogoou‚ & Ogoou‚-maritime)","","","","","",34.037794923403503,7.6955279790170286,6.6512858471176193,8.3981667887864511,18.427679285151839,null,null,null,null,null,171.33854500000001,1226.1005240000011,2411.2957660000011,2771.282144000003,591.96372000000008,739.96073000000035,1759.9729820000009,2012.970148000001,1660.766023000001,282.75481000000002,5.5189180000000002,48.932015999999997,43.998406000000003,216.00253000000009,401.1041360000001,5552.7004239999806,362.78831000000042,283.03443799999991,283.39221499999962,690.06531200000006]
["GAB",2000,"GAB_2000_DHS",155,"Type of toilet facility","Traditional pit toilet","",92.372363061025951,75.115092559249106,52.413907707139877,28.079719436412748,7.4706317553366226,78.476183891577634,52.805390528734051,41.490254573659307,19.465544058910449,5.4585190790171376,96.421602424681552,89.275914958571633,93.910103021302319,83.656064090844737,53.699732508263352,"Big cities","East (Haut-Ogoou‚ & Ogoou‚-Lolo)","North (Ogoou‚-Ivindo & Woleu-Ntem)","South (Ngouni‚, Nyanga)","West (Estuaire, Moyen-Ogoou‚ & Ogoou‚-maritime)","","","","","",28.525103432852269,60.3095913427806,87.139562186236205,83.28307899016707,67.360346174805869,null,null,null,null,null,5989.9488399999491,4817.6523040000202,3424.1766840000091,1821.1824790000021,484.48146699999978,3746.6928320000202,2528.331152000002,1955.7454950000031,940.99107500000002,261.16380800000002,1743.5207179999979,1424.359022000001,1605.523780000002,1420.0508160000011,911.06307600000071,4653.3964459999816,2843.1596609999938,3708.0795469999989,2810.348593999985,2522.457525999992]
["GAB",2000,"GAB_2000_DHS",156,"Type of toilet facility","No toilet/bush","",4.8335118616957002,2.8025041036260512,1.76711304145001,0.73567113470592727,0.14502054760757829,3.661560258647901,2.234922302058707,1.1124897375000491,0.34548834401495859,0,3.1003760866777679,7.6571261976997773,3.3778618049757689,2.8156272117179628,1.8274174298286929,"Big cities","East (Haut-Ogoou‚ & Ogoou‚-Lolo)","North (Ogoou‚-Ivindo & Woleu-Ntem)","South (Ngouni‚, Nyanga)","West (Estuaire, Moyen-Ogoou‚ & Ogoou‚-maritime)","","","","","",0.92810019009280587,7.3543137764944948,0.39586787805979201,2.4198129631004428,1.846121950757357,null,null,null,null,null,313.4323709999997,179.74404200000001,115.444689,47.713845000000013,9.4047959999999993,174.814076,107.00846300000001,52.439947999999987,16.70138,0,56.061814000000012,122.166172,57.74924399999999,47.794905999999997,31.003740000000001,151.40411800000001,346.70253600000001,16.845500999999999,81.655457999999996,69.132130000000004]
["GAB",2000,"GAB_2000_DHS",157,"Type of toilet facility","OTHER","",0.1401976782615541,0.035117826702718402,0.52230445780324819,0,0.16876835085174,0.091238441289995295,0.64766856635806558,0.066007577733482398,0,0.22875610108838959,0.13093527485704981,0,0.1384857241876874,0.088081027806207607,0.044629934776329198,"Big cities","East (Haut-Ogoou‚ & Ogoou‚-Lolo)","North (Ogoou‚-Ivindo & Woleu-Ntem)","South (Ngouni‚, Nyanga)","West (Estuaire, Moyen-Ogoou‚ & Ogoou‚-maritime)","","","","","",0.25718439002571719,0,0.017793808276558899,0.044308333059145999,0.32586250337835038,null,null,null,null,null,9.0912140000000008,2.2523499999999999,34.121912000000002,0,10.944876000000001,4.3560020000000002,31.010482,3.1114299999999999,0,10.944876000000001,2.3676059999999999,0,2.3676059999999999,1.4951639999999999,0.75718600000000003,41.955357999999997,0,0.75718600000000003,1.4951639999999999,12.202643999999999]
["GAB",2012,"GAB_2012_DHS",16,"Water","Improved","w_imp",74.200000000000003,94.299999999999997,97.5,98.900000000000006,98.299999999999997,92.5,97.5,99.5,99,98.099999999999994,51.100000000000001,58.5,67.200000000000003,71.299999999999997,89.900000000000006,"Estuaire","Haut-Ogooué","Libreville-Port-Gentil","Moyen-Ogooué","Ngounié","Nyanga","Ogooué Maritime","Ogooué-Ivindo","Ogooué-Lolo","Woleu-Ntem",87.700000000000003,89.599999999999994,98.400000000000006,79.099999999999994,89.200000000000003,79.700000000000003,88.5,73.700000000000003,76.5,93]
["GAB",2012,"GAB_2012_DHS",17,"Water","Not Improved","",25.800000000000001,5.7000000000000002,2.5,1.1000000000000001,1.7,7.5,2.5,0.5,1,1.8999999999999999,48.899999999999999,41.5,32.799999999999997,28.699999999999999,10.1,"Estuaire","Haut-Ogooué","Libreville-Port-Gentil","Moyen-Ogooué","Ngounié","Nyanga","Ogooué Maritime","Ogooué-Ivindo","Ogooué-Lolo","Woleu-Ntem",12.300000000000001,10.4,1.6000000000000001,20.899999999999999,10.800000000000001,20.300000000000001,11.5,26.300000000000001,23.5,7]
["GAB",2012,"GAB_2012_DHS",18,"Water ladder","Basic","w_bas",54.799999999999997,82,92.200000000000003,94.900000000000006,96.099999999999994,71,90.099999999999994,95.900000000000006,95.900000000000006,95.700000000000003,38.200000000000003,46.600000000000001,48,57.700000000000003,77,"Estuaire","Haut-Ogooué","Libreville-Port-Gentil","Moyen-Ogooué","Ngounié","Nyanga","Ogooué Maritime","Ogooué-Ivindo","Ogooué-Lolo","Woleu-Ntem",75.200000000000003,76.599999999999994,94.5,67.099999999999994,72.799999999999997,52.700000000000003,76.299999999999997,62.5,68.099999999999994,76.400000000000006]
["GAB",2012,"GAB_2012_DHS",19,"Water ladder","Limited","w_lim",19.300000000000001,12.199999999999999,5.2000000000000002,3.8999999999999999,2.2999999999999998,21.5,7.4000000000000004,3.6000000000000001,3.2000000000000002,2.3999999999999999,12.699999999999999,11.800000000000001,18.800000000000001,13.4,12.9,"Estuaire","Haut-Ogooué","Libreville-Port-Gentil","Moyen-Ogooué","Ngounié","Nyanga","Ogooué Maritime","Ogooué-Ivindo","Ogooué-Lolo","Woleu-Ntem",12.5,12.9,4,11.9,16.399999999999999,27,12.1,11.1,8.4000000000000004,16.600000000000001]
["GAB",2012,"GAB_2012_DHS",20,"Water ladder","Unimproved","w_unimp",6.9000000000000004,3,1.8999999999999999,0.90000000000000002,1.7,5.2999999999999998,2.1000000000000001,0.29999999999999999,1,1.8999999999999999,8.6999999999999993,6.2999999999999998,6.2000000000000002,9.0999999999999996,4.9000000000000004,"Estuaire","Haut-Ogooué","Libreville-Port-Gentil","Moyen-Ogooué","Ngounié","Nyanga","Ogooué Maritime","Ogooué-Ivindo","Ogooué-Lolo","Woleu-Ntem",4.2000000000000002,4.2999999999999998,1.6000000000000001,5.2000000000000002,0.80000000000000004,2.1000000000000001,4.7000000000000002,13.4,4.7000000000000002,3.7999999999999998]
["GAB",2012,"GAB_2012_DHS",21,"Water ladder","Surface water","w_sur",19,2.7000000000000002,0.59999999999999998,0.20000000000000001,0,2.2000000000000002,0.40000000000000002,0.20000000000000001,0,0,40.399999999999999,35.299999999999997,26.899999999999999,19.800000000000001,5.2000000000000002,"Estuaire","Haut-Ogooué","Libreville-Port-Gentil","Moyen-Ogooué","Ngounié","Nyanga","Ogooué Maritime","Ogooué-Ivindo","Ogooué-Lolo","Woleu-Ntem",8.1999999999999993,6.2000000000000002,0,15.9,10,18.199999999999999,6.7999999999999998,13,18.800000000000001,3.2000000000000002]
["GAB",2012,"GAB_2012_DHS",22,"Improved water point at more than 30 minutes","Yes","",26.100000000000001,13,5.4000000000000004,4,2.2999999999999998,23.199999999999999,7.5999999999999996,3.6000000000000001,3.2000000000000002,2.5,25,20.199999999999999,28.199999999999999,18.899999999999999,14.300000000000001,"Estuaire","Haut-Ogooué","Libreville-Port-Gentil","Moyen-Ogooué","Ngounié","Nyanga","Ogooué Maritime","Ogooué-Ivindo","Ogooué-Lolo","Woleu-Ntem",14.199999999999999,14.4,4.0999999999999996,15,18.300000000000001,33.799999999999997,13.699999999999999,15.1,11,17.800000000000001]
["GAB",2012,"GAB_2012_DHS",23,"Improved water point at more than 30 minutes","No","",73.900000000000006,87,94.599999999999994,96,97.700000000000003,76.799999999999997,92.400000000000006,96.400000000000006,96.799999999999997,97.5,75,79.799999999999997,71.799999999999997,81.099999999999994,85.700000000000003,"Estuaire","Haut-Ogooué","Libreville-Port-Gentil","Moyen-Ogooué","Ngounié","Nyanga","Ogooué Maritime","Ogooué-Ivindo","Ogooué-Lolo","Woleu-Ntem",85.799999999999997,85.599999999999994,95.900000000000006,85,81.700000000000003,66.200000000000003,86.299999999999997,84.900000000000006,89,82.200000000000003]
["GAB",2012,"GAB_2012_DHS",29,"Piped water","Yes","w_pip",43.100000000000001,90.5,93.700000000000003,97.799999999999997,97,86,96.5,96.400000000000006,98.299999999999997,96.799999999999997,5.2000000000000002,8.4000000000000004,14.5,38.600000000000001,78.700000000000003,"Estuaire","Haut-Ogooué","Libreville-Port-Gentil","Moyen-Ogooué","Ngounié","Nyanga","Ogooué Maritime","Ogooué-Ivindo","Ogooué-Lolo","Woleu-Ntem",77.099999999999994,84.900000000000006,97.099999999999994,66.099999999999994,64.5,75.599999999999994,67.099999999999994,38.299999999999997,60.5,61.799999999999997]
["GAB",2012,"GAB_2012_DHS",30,"Piped water","No","",56.899999999999999,9.5,6.2999999999999998,2.2000000000000002,3,14,3.5,3.6000000000000001,1.7,3.2000000000000002,94.799999999999997,91.599999999999994,85.5,61.399999999999999,21.300000000000001,"Estuaire","Haut-Ogooué","Libreville-Port-Gentil","Moyen-Ogooué","Ngounié","Nyanga","Ogooué Maritime","Ogooué-Ivindo","Ogooué-Lolo","Woleu-Ntem",22.899999999999999,15.1,2.8999999999999999,33.899999999999999,35.5,24.399999999999999,32.899999999999999,61.700000000000003,39.5,38.200000000000003]
["GAB",2012,"GAB_2012_DHS",31,"Piped water on premises","Yes","w_pop",15.6,52.5,68,84.599999999999994,92.400000000000006,39.799999999999997,62.5,76.799999999999997,87.200000000000003,92.599999999999994,1.2,2.1000000000000001,4.7000000000000002,12.6,47.399999999999999,"Estuaire","Haut-Ogooué","Libreville-Port-Gentil","Moyen-Ogooué","Ngounié","Nyanga","Ogooué Maritime","Ogooué-Ivindo","Ogooué-Lolo","Woleu-Ntem",51.700000000000003,55,80.700000000000003,33.899999999999999,31.899999999999999,32.5,44.5,28.199999999999999,33.200000000000003,32.899999999999999]
["GAB",2012,"GAB_2012_DHS",32,"Piped water on premises","No","",84.400000000000006,47.5,32,15.4,7.5999999999999996,60.200000000000003,37.5,23.199999999999999,12.800000000000001,7.4000000000000004,98.799999999999997,97.900000000000006,95.299999999999997,87.400000000000006,52.600000000000001,"Estuaire","Haut-Ogooué","Libreville-Port-Gentil","Moyen-Ogooué","Ngounié","Nyanga","Ogooué Maritime","Ogooué-Ivindo","Ogooué-Lolo","Woleu-Ntem",48.299999999999997,45,19.300000000000001,66.099999999999994,68.099999999999994,67.5,55.5,71.799999999999997,66.799999999999997,67.099999999999994]
["GAB",2012,"GAB_2012_DHS",35,"Water source on premises","Yes","",20.899999999999999,54,70.099999999999994,84.700000000000003,92.5,41.799999999999997,63.100000000000001,78.799999999999997,87.299999999999997,92.599999999999994,7.2000000000000002,10.199999999999999,11.6,22.199999999999999,50.200000000000003,"Estuaire","Haut-Ogooué","Libreville-Port-Gentil","Moyen-Ogooué","Ngounié","Nyanga","Ogooué Maritime","Ogooué-Ivindo","Ogooué-Lolo","Woleu-Ntem",56.799999999999997,55.299999999999997,81.400000000000006,42.299999999999997,33.299999999999997,33.700000000000003,50.299999999999997,37.600000000000001,34.600000000000001,34.100000000000001]
["GAB",2012,"GAB_2012_DHS",36,"Water source on premises","No","",79.099999999999994,46,29.899999999999999,15.300000000000001,7.5,58.200000000000003,36.899999999999999,21.199999999999999,12.699999999999999,7.4000000000000004,92.799999999999997,89.799999999999997,88.400000000000006,77.799999999999997,49.799999999999997,"Estuaire","Haut-Ogooué","Libreville-Port-Gentil","Moyen-Ogooué","Ngounié","Nyanga","Ogooué Maritime","Ogooué-Ivindo","Ogooué-Lolo","Woleu-Ntem",43.200000000000003,44.700000000000003,18.600000000000001,57.700000000000003,66.700000000000003,66.299999999999997,49.700000000000003,62.399999999999999,65.400000000000006,65.900000000000006]
["GAB",2012,"GAB_2012_DHS",37,"Improved Water source on premises","Yes","w_premises",19.899999999999999,53.299999999999997,69.799999999999997,84.700000000000003,92.5,41.200000000000003,62.899999999999999,78.799999999999997,87.299999999999997,92.599999999999994,5.7999999999999998,9.3000000000000007,10.6,19.800000000000001,48.5,"Estuaire","Haut-Ogooué","Libreville-Port-Gentil","Moyen-Ogooué","Ngounié","Nyanga","Ogooué Maritime","Ogooué-Ivindo","Ogooué-Lolo","Woleu-Ntem",55.600000000000001,55.299999999999997,81.400000000000006,40.899999999999999,33,33.600000000000001,48.5,34,34.600000000000001,33.799999999999997]
["GAB",2012,"GAB_2012_DHS",38,"Improved Water source on premises","No","",80.099999999999994,46.700000000000003,30.199999999999999,15.300000000000001,7.5,58.799999999999997,37.100000000000001,21.199999999999999,12.699999999999999,7.4000000000000004,94.200000000000003,90.700000000000003,89.400000000000006,80.200000000000003,51.5,"Estuaire","Haut-Ogooué","Libreville-Port-Gentil","Moyen-Ogooué","Ngounié","Nyanga","Ogooué Maritime","Ogooué-Ivindo","Ogooué-Lolo","Woleu-Ntem",44.399999999999999,44.700000000000003,18.600000000000001,59.100000000000001,67,66.400000000000006,51.5,66,65.400000000000006,66.200000000000003]
["GAB",2012,"GAB_2012_DHS",41,"Water point at more than 30 minutes","Yes","",29.300000000000001,15,6.5,4.7000000000000002,3.7999999999999998,24.899999999999999,8.9000000000000004,3.7000000000000002,4.0999999999999996,4.2999999999999998,30.800000000000001,29.300000000000001,31.699999999999999,24.899999999999999,14.9,"Estuaire","Haut-Ogooué","Libreville-Port-Gentil","Moyen-Ogooué","Ngounié","Nyanga","Ogooué Maritime","Ogooué-Ivindo","Ogooué-Lolo","Woleu-Ntem",17.100000000000001,19.399999999999999,5.4000000000000004,19.300000000000001,21.100000000000001,39.399999999999999,14.5,15.4,16,17.899999999999999]
["GAB",2012,"GAB_2012_DHS",42,"Water point at more than 30 minutes","No","w_30min",70.700000000000003,85,93.5,95.299999999999997,96.200000000000003,75.099999999999994,91.099999999999994,96.299999999999997,95.900000000000006,95.700000000000003,69.200000000000003,70.700000000000003,68.299999999999997,75.099999999999994,85.099999999999994,"Estuaire","Haut-Ogooué","Libreville-Port-Gentil","Moyen-Ogooué","Ngounié","Nyanga","Ogooué Maritime","Ogooué-Ivindo","Ogooué-Lolo","Woleu-Ntem",82.900000000000006,80.599999999999994,94.599999999999994,80.700000000000003,78.900000000000006,60.600000000000001,85.5,84.599999999999994,84,82.099999999999994]
["GAB",2012,"GAB_2012_DHS",58,"Source of drinking water","Piped into dwelling","",0.80000000000000004,4.0999999999999996,13.800000000000001,38.799999999999997,78.400000000000006,1.8999999999999999,7.7000000000000002,19.899999999999999,45.700000000000003,80.799999999999997,0.29999999999999999,0,1.7,0.29999999999999999,25.600000000000001,"Estuaire","Haut-Ogooué","Libreville-Port-Gentil","Moyen-Ogooué","Ngounié","Nyanga","Ogooué Maritime","Ogooué-Ivindo","Ogooué-Lolo","Woleu-Ntem",25.300000000000001,24.199999999999999,36.700000000000003,14.199999999999999,8.5,11.1,18.699999999999999,4.5999999999999996,8.5999999999999996,8.9000000000000004]
["GAB",2012,"GAB_2012_DHS",59,"Source of drinking water","Piped to yard/plot","",14.800000000000001,48.700000000000003,54.299999999999997,45.799999999999997,14.199999999999999,38.100000000000001,55,57,41.5,11.9,1,2.1000000000000001,3,12.5,22,"Estuaire","Haut-Ogooué","Libreville-Port-Gentil","Moyen-Ogooué","Ngounié","Nyanga","Ogooué Maritime","Ogooué-Ivindo","Ogooué-Lolo","Woleu-Ntem",26.5,30.899999999999999,44.200000000000003,19.800000000000001,23.5,21.800000000000001,25.899999999999999,23.600000000000001,24.800000000000001,24]
["GAB",2012,"GAB_2012_DHS",60,"Source of drinking water","Public tap/standpipe","",27.699999999999999,38.200000000000003,25.800000000000001,13.199999999999999,4.5999999999999996,46.399999999999999,34.100000000000001,19.699999999999999,11.1,4.2000000000000002,4,6.2999999999999998,9.9000000000000004,26.199999999999999,31.300000000000001,"Estuaire","Haut-Ogooué","Libreville-Port-Gentil","Moyen-Ogooué","Ngounié","Nyanga","Ogooué Maritime","Ogooué-Ivindo","Ogooué-Lolo","Woleu-Ntem",25.399999999999999,30,16.399999999999999,32.299999999999997,32.700000000000003,43.600000000000001,22.600000000000001,10.1,27.399999999999999,29]
["GAB",2012,"GAB_2012_DHS",61,"Source of drinking water","Protected well into yard/plot","",1.3999999999999999,0.40000000000000002,0,0.10000000000000001,0.10000000000000001,1,0.20000000000000001,0.10000000000000001,0,0.10000000000000001,1.2,0.59999999999999998,1.3,1.8,0.29999999999999999,"Estuaire","Haut-Ogooué","Libreville-Port-Gentil","Moyen-Ogooué","Ngounié","Nyanga","Ogooué Maritime","Ogooué-Ivindo","Ogooué-Lolo","Woleu-Ntem",0.40000000000000002,0,0,0.80000000000000004,0.29999999999999999,0.10000000000000001,0.69999999999999996,5.7999999999999998,1,0.80000000000000004]
["GAB",2012,"GAB_2012_DHS",62,"Source of drinking water","Village hydraulics / other protected well","",11.4,1,0.59999999999999998,0.20000000000000001,0,1.3,0.10000000000000001,0.10000000000000001,0,0,16.600000000000001,19.399999999999999,23.399999999999999,11.1,5.5,"Estuaire","Haut-Ogooué","Libreville-Port-Gentil","Moyen-Ogooué","Ngounié","Nyanga","Ogooué Maritime","Ogooué-Ivindo","Ogooué-Lolo","Woleu-Ntem",1.8999999999999999,2.6000000000000001,0,0.80000000000000004,15.9,1.1000000000000001,1.8999999999999999,3.2000000000000002,4,15.6]
["GAB",2012,"GAB_2012_DHS",63,"Source of drinking water","Unprotected well into yard","",1,0.59999999999999998,0.29999999999999999,0,0,0.69999999999999996,0.29999999999999999,0,0,0,1.3999999999999999,0.90000000000000002,0.90000000000000002,2.3999999999999999,1.7,"Estuaire","Haut-Ogooué","Libreville-Port-Gentil","Moyen-Ogooué","Ngounié","Nyanga","Ogooué Maritime","Ogooué-Ivindo","Ogooué-Lolo","Woleu-Ntem",1.2,0,0,1.3999999999999999,0.29999999999999999,0.20000000000000001,1.8999999999999999,3.6000000000000001,0,0.29999999999999999]
["GAB",2012,"GAB_2012_DHS",64,"Source of drinking water","Public unprotected well","",5.5,0.80000000000000004,0.20000000000000001,0,0.29999999999999999,3.2000000000000002,0.40000000000000002,0,0,0.29999999999999999,6.9000000000000004,5.0999999999999996,4.9000000000000004,4,1.7,"Estuaire","Haut-Ogooué","Libreville-Port-Gentil","Moyen-Ogooué","Ngounié","Nyanga","Ogooué Maritime","Ogooué-Ivindo","Ogooué-Lolo","Woleu-Ntem",2.7999999999999998,3.3999999999999999,0,2.8999999999999999,0.29999999999999999,0.69999999999999996,1.7,9.5999999999999996,1.7,3.3999999999999999]
["GAB",2012,"GAB_2012_DHS",65,"Source of drinking water","Protected spring","",15.199999999999999,1.8,0.80000000000000004,0.29999999999999999,0,3.7999999999999998,0.20000000000000001,0.69999999999999996,0.10000000000000001,0,24.800000000000001,23.5,23,14.199999999999999,4.0999999999999996,"Estuaire","Haut-Ogooué","Libreville-Port-Gentil","Moyen-Ogooué","Ngounié","Nyanga","Ogooué Maritime","Ogooué-Ivindo","Ogooué-Lolo","Woleu-Ntem",4.7000000000000002,1.5,0,4.5,7.4000000000000004,2,14.9,26.399999999999999,10.4,14.4]
["GAB",2012,"GAB_2012_DHS",66,"Source of drinking water","River/dam/lake/ponds/stream/canal/irrigation channel","",19,2.7000000000000002,0.59999999999999998,0.20000000000000001,0,2.2000000000000002,0.40000000000000002,0.20000000000000001,0,0,40.5,35.299999999999997,26.699999999999999,19.800000000000001,5.2000000000000002,"Estuaire","Haut-Ogooué","Libreville-Port-Gentil","Moyen-Ogooué","Ngounié","Nyanga","Ogooué Maritime","Ogooué-Ivindo","Ogooué-Lolo","Woleu-Ntem",8.1999999999999993,6.0999999999999996,0,15.800000000000001,10,18.399999999999999,6.7999999999999998,12.9,18.899999999999999,3.2000000000000002]
["GAB",2012,"GAB_2012_DHS",67,"Source of drinking water","Rainwater","",3,0.5,1.8,0,0,0.29999999999999999,0.20000000000000001,1.8999999999999999,0,0,3.2999999999999998,6.7000000000000002,4.7000000000000002,5.2999999999999998,0.69999999999999996,"Estuaire","Haut-Ogooué","Libreville-Port-Gentil","Moyen-Ogooué","Ngounié","Nyanga","Ogooué Maritime","Ogooué-Ivindo","Ogooué-Lolo","Woleu-Ntem",3.5,0.29999999999999999,0.59999999999999998,6.2000000000000002,0.90000000000000002,1,3.2999999999999998,0,0.29999999999999999,0.10000000000000001]
["GAB",2012,"GAB_2012_DHS",68,"Source of drinking water","Tanker truck","",0,0,0,0,0,0,0,0,0,0.10000000000000001,0.10000000000000001,0.10000000000000001,0,0,0,"Estuaire","Haut-Ogooué","Libreville-Port-Gentil","Moyen-Ogooué","Ngounié","Nyanga","Ogooué Maritime","Ogooué-Ivindo","Ogooué-Lolo","Woleu-Ntem",0,0,0,0,0,0,0.10000000000000001,0,0.20000000000000001,0]
["GAB",2012,"GAB_2012_DHS",69,"Source of drinking water","Bottled water","",0.20000000000000001,0.20000000000000001,0.5,0.40000000000000002,1.1000000000000001,0.10000000000000001,0.29999999999999999,0.29999999999999999,0.5,1.2,0,0,0.29999999999999999,0.40000000000000002,0.80000000000000004,"Estuaire","Haut-Ogooué","Libreville-Port-Gentil","Moyen-Ogooué","Ngounié","Nyanga","Ogooué Maritime","Ogooué-Ivindo","Ogooué-Lolo","Woleu-Ntem",0.10000000000000001,0.29999999999999999,0.69999999999999996,0.59999999999999998,0.29999999999999999,0,0.69999999999999996,0,0.29999999999999999,0.20000000000000001]
["GAB",2012,"GAB_2012_DHS",70,"Source of drinking water","Other","",0.10000000000000001,1.2,1.2,0.80000000000000004,1.2,1.1000000000000001,1.2,0.20000000000000001,0.90000000000000002,1.3999999999999999,0,0.20000000000000001,0.10000000000000001,1.8999999999999999,1.2,"Estuaire","Haut-Ogooué","Libreville-Port-Gentil","Moyen-Ogooué","Ngounié","Nyanga","Ogooué Maritime","Ogooué-Ivindo","Ogooué-Lolo","Woleu-Ntem",0,0.40000000000000002,1.3999999999999999,0.5,0.10000000000000001,0,1,0,2.6000000000000001,0]
["GAB",2012,"GAB_2012_DHS",122,"Sanitation","Improved","s_imp",40.554674832962988,52.145984064109768,61.295966975044763,76.802416102975172,94.15598160277959,45.583775205593703,56.012735699457068,66.926459639165884,78.342001390473627,96.499466726868519,38.040658161795967,38.691033687191222,39.687089698197937,45.269808677204807,65.024571423698006,"Estuaire","Haut-Ogooué","Libreville-Port-Gentil","Moyen-Ogooué","Ngounié","Nyanga","Ogooué Maritime","Ogooué-Ivindo","Ogooué-Lolo","Woleu-Ntem",65.707962149869502,50.831236471709161,74.194592817009863,44.775652863744867,46.131527565558429,55.394765866894119,62.37346953491177,50.988679249894133,54.845898621252921,52.220562350501339,894.91381299999932,4018.3288489999968,5818.9616869999982,7035.8854139999949,7914.8463709999933,2034.460605,4222.2507189999951,5480.4346090000035,5951.9652829999977,6777.5602829999943,21.725770000000001,49.873854000000023,95.416765000000069,287.23072600000029,762.01752000000033,2633.8944510000028,1626.649484999999,18702.364342000081,424.90928100000002,568.73143499999992,360.4892209999997,293.4670500000006,164.80097400000011,367.91390799999999,539.71598699999936]
["GAB",2012,"GAB_2012_DHS",123,"Sanitation","Not Improved","",59.445325167037012,47.854015935890232,38.704033024955237,23.197583897024831,5.8440183972204096,54.416224794406297,43.987264300542932,33.073540360834123,21.65799860952637,3.5005332731314809,61.959341838204033,61.308966312808778,60.312910301802063,54.730191322795193,34.975428576301987,"Estuaire","Haut-Ogooué","Libreville-Port-Gentil","Moyen-Ogooué","Ngounié","Nyanga","Ogooué Maritime","Ogooué-Ivindo","Ogooué-Lolo","Woleu-Ntem",34.292037850130498,49.168763528290839,25.805407182990141,55.224347136255133,53.868472434441571,44.605234133105881,37.62653046508823,49.011320750105867,45.154101378747079,47.779437649498661,7314.8067850000016,4192.5595469999989,2393.3245169999982,1172.938384,296.87999400000001,4877.4560820000079,2667.6559010000001,1453.134837999999,956.379232,138.92825199999999,1276.6910709999991,1249.0199540000001,1203.3764280000009,1009.987986999999,537.8794819999996,1849.6245839999999,2159.1336310000002,3325.0143550000012,910.06984999999997,1987.7200630000009,748.01877500000012,192.3812589999998,1313.448884999998,1128.9978450000001,1756.099980000002]
["GAB",2012,"GAB_2012_DHS",124,"Sanitation ladder","Basic","s_bas",14.65589527425943,15.28959239686608,24.908875567845399,50.433301127280671,85.831976552658475,12.90132118623916,18.009426173238069,30.285298468592011,55.860381803069338,88.167996005504136,18.50481895192766,14.88675118453722,25.222748964661381,28.535751378943431,49.137623451687979,"Estuaire","Haut-Ogooué","Libreville-Port-Gentil","Moyen-Ogooué","Ngounié","Nyanga","Ogooué Maritime","Ogooué-Ivindo","Ogooué-Lolo","Woleu-Ntem",42.416396532544489,36.935849498859241,42.935130508095888,26.44240522785368,34.274834586897448,40.851533765884682,40.345906515588993,34.566786169429882,42.710879239377029,43.618808385753887,319.34232000000009,1175.2647730000001,2360.760975000002,4620.2052720000002,7137.2333049999952,575.80201699999986,1351.250139,2479.984729000003,4218.2547150000009,6147.2580799999951,10.568467,19.012775999999999,53.780589999999982,181.05542799999989,575.8397040000001,1686.7332630000001,1173.907130999999,10774.252466,250.93153699999999,422.55647900000002,265.84709499999991,189.53039199999981,111.723624,286.51051200000001,450.81414599999988]
["GAB",2012,"GAB_2012_DHS",125,"Sanitation ladder","Limited","s_lim",25.898779558703591,36.856391667243713,36.38709140719935,26.369114975694519,8.3240050501211478,32.682454019354537,38.003309526219041,36.641161170573817,22.481619587404339,8.3314707213643935,19.53583920986831,23.80428250265399,14.46434073353652,16.73405729826133,15.88694797201001,"Estuaire","Haut-Ogooué","Libreville-Port-Gentil","Moyen-Ogooué","Ngounié","Nyanga","Ogooué Maritime","Ogooué-Ivindo","Ogooué-Lolo","Woleu-Ntem",23.291565617324959,13.895386972849931,31.259462308913669,18.33324763589118,11.856692978660989,14.543232101009471,22.027563019322589,16.421893080464251,12.135019381875891,8.6017539647475019,564.31737499999997,2833.039472999998,3448.619153999995,2415.680141999997,692.17054599999994,1458.658588,2851.3944189999979,3000.449879999996,1697.682593,580.88765799999999,11.157303000000001,30.401897999999999,30.84123700000001,106.175298,186.17781600000001,926.21395700000073,441.62768900000009,7844.3301530000044,173.977744,146.17495600000001,94.64212599999999,103.47747799999991,53.077350000000031,81.403395999999972,88.901840999999976]
["GAB",2012,"GAB_2012_DHS",126,"Sanitation ladder","Unimproved","s_unimp",53.570814571977479,45.344039850496642,37.028105743250222,21.57807732371537,5.7929982251579526,49.868205319703399,42.560890452924241,31.318347412523028,19.917521664033352,3.5005332731314698,53.796730136527863,55.249469261256039,55.624240673130913,51.421732265744929,33.40699715684098,"Estuaire","Haut-Ogooué","Libreville-Port-Gentil","Moyen-Ogooué","Ngounié","Nyanga","Ogooué Maritime","Ogooué-Ivindo","Ogooué-Lolo","Woleu-Ntem",33.309687023624953,37.149140642476773,24.145869872715021,53.803954295672227,53.143450269362333,41.809121871232733,36.483154219428833,48.98154797540743,44.65899383582434,46.976892050685812,6833.1870029999918,3986.7198269999999,2255.8531520000001,1039.9959429999999,292.73394999999988,4563.1007650000092,2569.6597319999992,1331.4373159999991,836.768147,138.92825199999999,1170.7063459999999,1170.3413460000011,1142.986445000002,967.0700369999995,517.49148899999989,1805.786473000001,1705.4327180000009,2960.8521759999981,891.10790200000019,1969.1852230000011,717.02364700000032,186.8314349999998,1313.0087689999971,1121.5865220000001,1737.675010000002]
["GAB",2012,"GAB_2012_DHS",127,"Sanitation ladder","Open defecation","s_od",5.8745105950594878,2.5099760853935691,1.675927281705029,1.619506573309446,0.051020172062424499,4.5480194747029046,1.4263738476186469,1.7551929483111419,1.7404769454929701,0,8.1626117016761697,6.0594970515527553,4.6886696286711906,3.308459057050305,1.5684314194610309,"Estuaire","Haut-Ogooué","Libreville-Port-Gentil","Moyen-Ogooué","Ngounié","Nyanga","Ogooué Maritime","Ogooué-Ivindo","Ogooué-Lolo","Woleu-Ntem",0.98235082650560157,12.019622885814069,1.6595373102754201,1.42039284058291,0.72502216507923034,2.7961122618731209,1.1433762456595911,0.029772774698434899,0.49510754292273901,0.80254559881279863,481.61978199999999,205.83972,137.47136499999999,132.942441,4.1460439999999998,314.35531700000001,97.996168999999995,121.69752200000001,119.611085,0,105.984725,78.678608000000011,60.389983000000022,42.917949999999998,20.387993000000002,43.838110999999998,453.70091300000001,364.16217900000009,18.961948,18.534839999999999,30.995128000000001,5.549824000000001,0.44011600000000001,7.4113230000000012,18.424969999999998]
["GAB",2012,"GAB_2012_DHS",128,"Shared among Improved Sanitation","Yes","s_shared",63.861391233873178,70.679252350346673,59.36294539902358,34.333704997430452,8.840654527120785,71.697558773815643,67.847622601635237,54.748393039352003,28.696764428254831,8.6336961269907704,51.355155651560317,61.524028267392779,36.44595974038706,36.965160196684486,24.432222503230619,"Estuaire","Haut-Ogooué","Libreville-Port-Gentil","Moyen-Ogooué","Ngounié","Nyanga","Ogooué Maritime","Ogooué-Ivindo","Ogooué-Lolo","Woleu-Ntem",35.447097817766092,27.33631510337861,42.131725671721888,40.944679671517918,25.701930121024521,26.253801913261661,35.315596813150329,32.206939505102682,22.125664246430169,16.471967320100909]
["GAB",2012,"GAB_2012_DHS",129,"Shared among Improved Sanitation","No","",36.138608766126922,29.320747649653359,40.637054600976391,65.666295002569569,91.159345472879252,28.302441226184371,32.152377398364827,45.251606960647919,71.303235571745233,91.366303873009244,48.644844348439669,38.475971732607192,63.554040259612847,63.034839803315393,75.567777496769352,"Estuaire","Haut-Ogooué","Libreville-Port-Gentil","Moyen-Ogooué","Ngounié","Nyanga","Ogooué Maritime","Ogooué-Ivindo","Ogooué-Lolo","Woleu-Ntem",64.552902182233822,72.663684896621405,57.8682743282777,59.055320328482061,74.298069878975497,73.746198086738389,64.684403186849366,67.793060494897304,77.874335753569838,83.528032679899184]
["GAB",2012,"GAB_2012_DHS",130,"Manually calculated ratios","Improved latrines","",55.848388637449162,72.813981848701232,82.3558121501069,87.003620271558546,87.099299823091741,64.460924953238447,78.603578818613101,85.740341028888395,87.300774368247247,86.751984050807849,50.703835511816941,52.059922750825649,53.640483528574393,60.377034759978542,68.824161822945101,"Estuaire","Haut-Ogooué","Libreville-Port-Gentil","Moyen-Ogooué","Ngounié","Nyanga","Ogooué Maritime","Ogooué-Ivindo","Ogooué-Lolo","Woleu-Ntem",68.595735479902515,66.77306895972599,87.853712097989572,63.636324767233667,57.802432641050039,60.550797464257158,73.480355042153207,52.740044022802849,57.137025823247853,56.436550015290742]
["GAB",2012,"GAB_2012_DHS",135,"Sanitation type","Sewer connection","s_sew",0.87757292273200582,7.280165557861026,18.89446842761301,50.474958215201418,88.210958354309469,4.1558536511335671,10.840462464787359,27.40787561913341,55.738373898974643,91.942765694181844,0,0,0.15602114416070831,1.624074166435491,33.935641079353722,"Estuaire","Haut-Ogooué","Libreville-Port-Gentil","Moyen-Ogooué","Ngounié","Nyanga","Ogooué Maritime","Ogooué-Ivindo","Ogooué-Lolo","Woleu-Ntem",29.467260040304421,25.897774646845349,45.593484690794178,14.43745228104239,11.331104901721091,14.38798732850999,19.173127553275009,4.5923223727498579,10.99255842371625,12.90955291104132]
["GAB",2012,"GAB_2012_DHS",136,"Sanitation type","Septic tank connection","s_sep",0,0,0,0,0,0,0,0,0,0,0,0,0,0,0,"Estuaire","Haut-Ogooué","Libreville-Port-Gentil","Moyen-Ogooué","Ngounié","Nyanga","Ogooué Maritime","Ogooué-Ivindo","Ogooué-Lolo","Woleu-Ntem",0,0,0,0,0,0,0,0,0,0]
["GAB",2012,"GAB_2012_DHS",137,"Sanitation type","Improved latrines","s_lat",10.023088096328911,41.658860954270772,51.962313014876493,35.236290888649968,8.1737239791720793,25.278248308261169,50.441220319470688,51.634162553156827,30.417799552951241,6.0485813412831799,1.6732507861856989,3.839717588368087,7.1905499276819702,20.517968892420651,24.685735754931741,"Estuaire","Haut-Ogooué","Libreville-Port-Gentil","Moyen-Ogooué","Ngounié","Nyanga","Ogooué Maritime","Ogooué-Ivindo","Ogooué-Lolo","Woleu-Ntem",29.278881783536342,17.069543742980741,39.311599110879719,17.391455836922681,10.91580396570467,18.132231046171,41.229892188427783,6.5560618463756102,13.58563780345975,10.59912525645397]
["GAB",2012,"GAB_2012_DHS",138,"Sanitation type","Unimproved facilities","",83.232881331730795,48.554061810682519,27.46924663805833,12.66924432283936,3.5648283562843752,66.01787856590245,37.296002307793202,19.20276887939848,12.11242643129823,2.0086529645349889,90.164137512138183,90.102927490435775,88.003729243443928,74.549497884093299,39.810191746253402,"Estuaire","Haut-Ogooué","Libreville-Port-Gentil","Moyen-Ogooué","Ngounié","Nyanga","Ogooué Maritime","Ogooué-Ivindo","Ogooué-Lolo","Woleu-Ntem",40.276096943123562,45.048347085501632,13.4416909825191,66.750699041451711,77.028068967495159,64.683669363445929,38.454684628736537,88.821843006176195,74.926696229901268,75.688776233691996]
["GAB",2012,"GAB_2012_DHS",139,"Sanitation type","Open defecation","",5.8664576492083018,2.5069116771855819,1.6739719194521141,1.619506573309446,0.050489310234097202,4.5480194747029046,1.422314907948635,1.7551929483111419,1.731400116776026,0,8.1626117016761697,6.0573549211961426,4.6496996847133847,3.308459057050305,1.5684314194610309,"Estuaire","Haut-Ogooué","Libreville-Port-Gentil","Moyen-Ogooué","Ngounié","Nyanga","Ogooué Maritime","Ogooué-Ivindo","Ogooué-Lolo","Woleu-Ntem",0.97776123303555762,11.98433452467221,1.6532252158065219,1.42039284058291,0.72502216507923034,2.7961122618731209,1.1422956295603759,0.029772774698434899,0.49510754292273901,0.80254559881279863]
["GAB",2012,"GAB_2012_DHS",148,"Shared among improved sanitation facilities","Yes","",6.8737707728747308,34.50344635520969,41.993411680175683,29.42784741692904,8.42905030238426,21.103532551881859,41.385095274339079,43.274245724880132,24.574376528469958,8.3985920754511962,0.85930054568662262,2.3405991939257889,2.374607225093452,8.1848416875250347,14.322505222609919,"Estuaire","Haut-Ogooué","Libreville-Port-Gentil","Moyen-Ogooué","Ngounié","Nyanga","Ogooué Maritime","Ogooué-Ivindo","Ogooué-Lolo","Woleu-Ntem",20.658191696514109,11.66542497200993,35.611727845167131,13.032244471842571,5.7178849711937758,8.5377937138488633,21.298309798171939,3.590553361250155,5.438089175053725,3.8723417851375168]
["GAB",2012,"GAB_2012_DHS",149,"Shared among improved sanitation facilities","No","",3.8898074080352578,14.31349101727578,28.746696307906721,56.283401686922232,86.915138032610287,8.3305694075128773,19.612023987053671,35.767792447410088,61.060283051040152,88.878309403573681,0.81395024049907627,1.4637667746892511,4.1408124318680404,13.95720137133109,44.298871611675558,"Estuaire","Haut-Ogooué","Libreville-Port-Gentil","Moyen-Ogooué","Ngounié","Nyanga","Ogooué Maritime","Ogooué-Ivindo","Ogooué-Lolo","Woleu-Ntem",37.620744995900239,31.008303831211808,48.91300328652963,18.796663646122511,16.52902389623198,23.98242466083212,39.010198963149932,7.5578308578753157,19.140107052122261,19.636336382357769]
["GAB",2012,"GAB_2012_DHS",150,"Shared among improved sanitation facilities","DK/missing","",89.236421819090154,51.183062627514431,29.259892011917469,14.288750896148811,4.6558116650054782,70.565898040605333,39.002880738607132,20.957961827709632,14.365340420490041,2.723098520975141,98.326749213814296,96.195634031384941,93.484580343038431,77.857956941143584,41.378623165714423,"Estuaire","Haut-Ogooué","Libreville-Port-Gentil","Moyen-Ogooué","Ngounié","Nyanga","Ogooué Maritime","Ogooué-Ivindo","Ogooué-Lolo","Woleu-Ntem",41.721063307585517,57.326271196778123,15.475268868302701,68.171091882034602,77.753091132574397,67.479781625319035,39.691491238677841,88.851615780874639,75.42180377282402,76.491321832504795]
["GAB",2012,"GAB_2012_DHS",151,"Shared among all sanitation facilities","Yes","",42.696090146347913,65.346959809042289,59.181981881727182,36.557989406827303,10.436335990625279,61.693275632235633,67.226906419647023,56.448896960140587,31.589005417760259,9.6132679268585015,20.86411584036874,29.842601698454491,32.038688110312599,36.626925499207381,28.01550856450433,"Estuaire","Haut-Ogooué","Libreville-Port-Gentil","Moyen-Ogooué","Ngounié","Nyanga","Ogooué Maritime","Ogooué-Ivindo","Ogooué-Lolo","Woleu-Ntem",42.1102213650883,41.250769046528177,46.135090427110129,45.219687758438532,35.956057387602407,41.973349036607473,43.038297736874902,36.478594051331889,37.124090591903972,27.284001860836359]
["GAB",2012,"GAB_2012_DHS",152,"Shared among all sanitation facilities","No","",57.051506624651779,34.437599289870931,40.699358332370068,62.978298283091029,88.52264440727123,38.216661908822758,32.45170313862841,43.551103039859328,67.32865968490384,89.672286516701362,79.076063144210053,69.893279480537572,66.780189062978806,63.373074500792448,71.984491435495585,"Estuaire","Haut-Ogooué","Libreville-Port-Gentil","Moyen-Ogooué","Ngounié","Nyanga","Ogooué Maritime","Ogooué-Ivindo","Ogooué-Lolo","Woleu-Ntem",57.2683980115685,58.415665803428467,53.305294711914037,54.780312241561212,64.043942612397757,58.026650963392449,56.684213359531952,63.429388014259537,62.605003209028872,72.603381377115369]
["GAB",2012,"GAB_2012_DHS",153,"Type of toilet facility","Flush to piped sewer system","",0.87760040314234911,7.280165557861026,18.89446842761301,50.474958215201418,88.210958354309469,4.1558536511335671,10.840462464787359,27.40787561913341,55.738373898974643,91.942765694181844,0,0,0.15602114416070831,1.624074166435491,33.935641079353722,"Estuaire","Haut-Ogooué","Libreville-Port-Gentil","Moyen-Ogooué","Ngounié","Nyanga","Ogooué Maritime","Ogooué-Ivindo","Ogooué-Lolo","Woleu-Ntem",29.467260040304421,25.897774646845349,45.593484690794178,14.43745228104239,11.331104901721091,14.38798732850999,19.173127553275009,4.593121130028913,10.99255842371625,12.90955291104132,72.046285000000026,597.76626899999997,1551.6678240000001,4143.4003820000053,7243.6425239999944,287.24914199999989,746.89774100000011,1900.344089999998,3850.5988960000009,6359.2108479999943,0,0,2.026392,21.067793999999999,441.12838099999988,1321.170212999999,980.4335800000008,10043.049534000011,192.736975,289.67420099999998,159.49198999999999,93.152315999999885,67.885999000000041,164.54889900000001,296.37957699999998]
["GAB",2012,"GAB_2012_DHS",154,"Type of toilet facility","Ventilated Improved Pit latrine (VIP)","",0.96796543097279253,8.1900302691679645,9.907416750815413,7.7729868212722568,1.340003199193305,3.1188831081464672,8.6187014244323592,11.31748104635375,6.7221637975882071,1.3830235026913129,0.61972347753921375,0.71104387732336527,1.6784810790119351,4.1055912519818758,5.1685839644701286,"Estuaire","Haut-Ogooué","Libreville-Port-Gentil","Moyen-Ogooué","Ngounié","Nyanga","Ogooué Maritime","Ogooué-Ivindo","Ogooué-Lolo","Woleu-Ntem",9.0642000140409635,1.0365856890783369,7.7695948189835136,1.855459566730854,0.079496442689795999,1.429252658273112,10.784056469773549,1.653380734665254,1.4923899792508339,0.64378404943814027,79.464769000000018,672.47424500000022,813.62541899999985,638.07079199999998,110.037396,215.574602,593.82048000000009,784.70540800000015,464.39023399999991,95.656661999999997,8.0465939999999989,9.2338769999999997,21.799997999999999,53.258498000000003,67.186267999999998,406.39513299999987,39.242885999999999,1711.438073999999,24.769998000000001,2.0322879999999999,15.84338,52.394156000000002,24.436847999999991,22.339760999999999,14.780097]
["GAB",2012,"GAB_2012_DHS",155,"Type of toilet facility","Pit latrine with slab","",9.055436529385716,33.468830685102837,42.054896264061057,27.46330406737766,6.8337207799787736,22.159365200114721,41.822518895038307,40.31668150680305,23.69563575536305,4.6655578385918677,1.0535273086464849,3.1294338034189111,5.5120688486700349,16.412377640438759,19.517151790461611,"Estuaire","Haut-Ogooué","Libreville-Port-Gentil","Moyen-Ogooué","Ngounié","Nyanga","Ogooué Maritime","Ogooué-Ivindo","Ogooué-Lolo","Woleu-Ntem",20.214681769495339,16.032958053902409,31.542004291896191,15.535996270191831,10.83630752301487,16.70297838789789,30.445835718654191,4.9038214284600716,12.093247824208911,9.9553412070158256,743.40275899999972,2748.0883349999981,3453.6684439999999,2254.4142399999969,561.16645100000005,1531.6368610000011,2881.5324979999982,2795.3851109999991,1636.9761530000001,322.69277299999999,13.679176,40.639977000000023,71.590375000000023,212.9044339999999,253.70287099999999,906.3291049999998,606.97301900000025,6947.8767340000059,207.402308,277.02494600000011,185.153851,147.92057799999969,72.478127000000015,181.025248,228.5563129999999]
["GAB",2012,"GAB_2012_DHS",156,"Type of toilet facility","Pit latrine without slab/open pit","",68.362781468309976,39.882745789058717,22.93326732917161,9.6456380656253504,2.3763193185748608,54.458711692512622,31.284624725436402,16.085524440554408,8.0672916324584989,1.681797221398851,73.788342059867048,72.8305458163168,70.19310610138055,62.667908877136128,32.323540969286697,"Estuaire","Haut-Ogooué","Libreville-Port-Gentil","Moyen-Ogooué","Ngounié","Nyanga","Ogooué Maritime","Ogooué-Ivindo","Ogooué-Lolo","Woleu-Ntem",34.1383224215529,31.76079421766854,10.12102232256813,41.429485761751423,58.60554491928022,62.452073372324143,34.386735305072222,84.580533341939855,72.628652612362771,67.379109573027947,5612.2176099999879,3274.7277460000032,1883.345549000001,791.79343299999971,195.13684000000001,3764.140781000001,2155.4814300000021,1115.3010079999999,557.31629899999984,116.32131200000001,958.08025999999938,945.80422300000157,911.66328400000009,812.93984099999989,420.17273999999992,1530.598183999999,1202.3947850000011,2229.3959149999991,553.0749889999995,1498.2223310000011,692.28622699999994,167.06737199999981,1250.094181999998,1087.186837,1546.900356000001]
["GAB",2012,"GAB_2012_DHS",157,"Type of toilet facility","No facility/bush/field","",5.8666413520770728,2.5069116771855819,1.6739719194521141,1.619506573309446,0.050489310234097202,4.5480194747029046,1.422314907948635,1.7551929483111419,1.731400116776026,0,8.1626117016761697,6.0585540065917227,4.6496996847133847,3.308459057050305,1.5684314194610309,"Estuaire","Haut-Ogooué","Libreville-Port-Gentil","Moyen-Ogooué","Ngounié","Nyanga","Ogooué Maritime","Ogooué-Ivindo","Ogooué-Lolo","Woleu-Ntem",0.97776123303555762,11.98433452467221,1.6532252158065219,1.42039284058291,0.72502216507923034,2.7961122618731209,1.1422956295603759,0.0297779531721085,0.49510754292273901,0.80254559881279863,481.61978199999999,205.83972,137.47136499999999,132.942441,4.1460439999999998,314.35531700000001,97.996168999999995,121.69752200000001,119.611085,0,105.984725,78.678608000000011,60.389983000000022,42.917949999999998,20.387993000000002,43.838110999999998,453.70091300000001,364.16217900000009,18.961948,18.534839999999999,30.995128000000001,5.549824000000001,0.44011600000000001,7.4113230000000012,18.424969999999998]
["GAB",2012,"GAB_2012_DHS",158,"Type of toilet facility","Hanging toilet/latrine","",14.709100907454379,8.0902183291592262,3.655953123671722,0.94218606591170606,0.32727746646000211,11.445283093297229,4.6565064767162196,2.472639544616936,1.1274321052009679,0.035578024709326,16.375795452271099,17.226063825134229,17.783076493225771,11.544817500639899,7.3473303541013859,"Estuaire","Haut-Ogooué","Libreville-Port-Gentil","Moyen-Ogooué","Ngounié","Nyanga","Ogooué Maritime","Ogooué-Ivindo","Ogooué-Lolo","Woleu-Ntem",6.1249261764313996,13.26865194355733,1.7061716610482709,24.145433326627732,18.422524048214921,2.040320510236536,4.0679493236643047,4.2393654117339192,2.2980436175384882,8.3096666606640017,1207.5382740000009,664.27879800000039,300.23733399999998,77.342393999999999,26.875129999999999,791.08843200000103,320.82894799999991,171.44218000000001,77.886893999999998,2.46075,212.6260859999999,223.703993,230.96538699999991,149.76153299999999,95.507726999999974,274.61223100000001,502.32238499999983,375.82489299999997,322.33649600000018,470.96289200000012,22.617115999999999,19.764063,62.657514999999997,34.399685000000012,190.77465399999991]
["GAB",2012,"GAB_2012_DHS",159,"Type of toilet facility","Other","",0.1604739086576949,0.58109769246460441,0.88002618521501219,2.0814201913022981,0.86123157124951344,0.1138837800925015,1.3548711056406151,0.64460489422714429,2.917702693638756,0.29127771842681183,0,0.0443586712150425,0.0275466488374181,0.3367715063172998,0.13932042286531859,"Estuaire","Haut-Ogooué","Libreville-Port-Gentil","Moyen-Ogooué","Ngounié","Nyanga","Ogooué Maritime","Ogooué-Ivindo","Ogooué-Lolo","Woleu-Ntem",0.012848345139232799,0.0189009242757688,1.614496998902702,1.1757799530725359,0,0.1912754808852096,0,0,0,0,13.174047,47.713282999999997,72.270268999999985,170.860116,70.721980000000002,7.8715519999999994,93.349354000000005,44.694127999999999,201.564954,20.146190000000001,0,0.57605799999999996,0.35777399999999998,4.3686629999999997,1.8110219999999999,0.57605799999999996,0.71554799999999996,355.63136800000012,15.696417,0,2.120304,0,0,0,0]