{"text_format":"1","workbook":"xlsx","n_sheets":8,"sheets":["Introduction","Water","Sanitation","Hygiene","MICS00","WHS03","DHS12","data_summary"],"not_rendered":{"charts":120,"images":76,"macros":1,"external_links":0,"defined_names":0,"comments":0,"pivot_tables":0},"unopened":[],"bounds":{"document_bytes":16777216,"sheet_cells":100000,"rows_first":2000,"rows_last":500,"rows_between":2000,"halvings":0,"cell_chars":16384,"cell_head_chars":4096},"cells_cut":0,"cells_raw":0,"read":"whole","date_system":"1900"}

{"sheet":"Introduction","index":0,"n_rows":55,"n_cols":12,"rows_kept":55,"cut":false,"hidden":false,"merged":[[107,0,107,1],[1,0,1,1],[4,0,4,1],[5,0,5,1],[6,0,6,1],[7,0,7,1],[112,0,112,1],[113,0,113,1],[207,0,207,1],[212,0,212,1],[213,0,213,1]]}
[]
[]
[]
[null,null,"Joint Monitoring Programme for Water Supply, Sanitation and Hygiene"]
[]
[null,null,"Estimates on household water, sanitation and hygiene \nby wealth quintile and sub-national region in"]
[null,null,{"$f":"+Water!B5","v":"Comoros"}]
[]
[null,null,"Updated May 2021"]
[]
[null,null,"Follow the links below to find the following information: "]
[]
[null,null,"JMP Estimates"]
[null,null,"WASH status and trends by wealth quintile \n(customized quintiles made without water and sanitation assets)"]
[null,null,"Water"]
[null,null,"Sanitation"]
[null,null,"Hygiene"]
[]
[null,null,"Data inputs"]
[null,null," customized wealth quintiles and subnational data:"]
[null,null,{"$f":"IF(INDIRECT(CONCATENATE(\"Water\",\"!B105\"))=0,\"\",INDIRECT(CONCATENATE(\"Water\",\"!B105\")))","v":"MICS00"}]
[null,null,{"$f":"IF(INDIRECT(CONCATENATE(\"Water\",\"!B106\"))=0,\"\",INDIRECT(CONCATENATE(\"Water\",\"!B106\")))","v":"WHS03"}]
[null,null,{"$f":"IF(INDIRECT(CONCATENATE(\"Water\",\"!B107\"))=0,\"\",INDIRECT(CONCATENATE(\"Water\",\"!B107\")))","v":"DHS12"}]
[null,null,{"$f":"IF(INDIRECT(CONCATENATE(\"Water\",\"!B108\"))=0,\"\",INDIRECT(CONCATENATE(\"Water\",\"!B108\")))","v":""}]
[null,null,{"$f":"IF(INDIRECT(CONCATENATE(\"Water\",\"!B109\"))=0,\"\",INDIRECT(CONCATENATE(\"Water\",\"!B109\")))","v":""}]
[null,null,{"$f":"IF(INDIRECT(CONCATENATE(\"Water\",\"!B110\"))=0,\"\",INDIRECT(CONCATENATE(\"Water\",\"!B110\")))","v":""}]
[null,null,{"$f":"IF(INDIRECT(CONCATENATE(\"Water\",\"!B111\"))=0,\"\",INDIRECT(CONCATENATE(\"Water\",\"!B111\")))","v":""}]
[null,null,{"$f":"IF(INDIRECT(CONCATENATE(\"Water\",\"!B112\"))=0,\"\",INDIRECT(CONCATENATE(\"Water\",\"!B112\")))","v":""}]
[null,null,{"$f":"IF(INDIRECT(CONCATENATE(\"Water\",\"!B113\"))=0,\"\",INDIRECT(CONCATENATE(\"Water\",\"!B113\")))","v":""}]
[null,null,{"$f":"IF(INDIRECT(CONCATENATE(\"Water\",\"!B114\"))=0,\"\",INDIRECT(CONCATENATE(\"Water\",\"!B114\")))","v":""}]
[null,null,{"$f":"IF(INDIRECT(CONCATENATE(\"Water\",\"!B115\"))=0,\"\",INDIRECT(CONCATENATE(\"Water\",\"!B115\")))","v":""}]
[null,null,{"$f":"IF(INDIRECT(CONCATENATE(\"Water\",\"!B116\"))=0,\"\",INDIRECT(CONCATENATE(\"Water\",\"!B116\")))","v":""}]
[]
[]
[]
[]
[]
[]
[]
[]
[]
[]
[]
[]
[]
[]
[]
[]
[]
[]
[]
[]
[]
[]
[null,null,null,null,null,null,null,null,null,null,null,{"$f":"+IF(ISNUMBER(M48), \"\", \"Insufficient data to estimate safely managed sanitation services at national level\")","v":"Insufficient data to estimate safely managed sanitation services at national level"}]

{"sheet":"Water","index":1,"n_rows":318,"n_cols":28,"rows_kept":318,"cut":false,"hidden":false,"merged":[[3,1,3,24],[317,18,317,22],[117,18,117,22],[196,18,196,22],[296,23,296,27],[298,0,299,1],[300,0,301,1],[296,0,297,2],[296,3,296,7],[296,8,296,12],[296,13,296,17],[296,18,296,22],[196,23,196,27],[198,0,199,1],[200,0,201,1],[196,13,196,17],[96,8,96,12],[96,13,96,17],[96,18,96,22],[217,18,217,22],[98,0,99,1],[100,0,101,1],[196,0,197,2],[196,3,196,7],[196,8,196,12],[217,1,217,11],[35,3,36,3],[38,1,39,2],[38,3,39,3],[96,0,97,2],[96,3,96,7],[317,1,317,11],[6,9,6,16],[6,17,6,24],[6,1,6,8],[4,1,4,24],[117,1,117,11],[30,21,30,24],[32,1,33,2],[32,3,33,3],[30,17,30,20],[30,1,31,4],[30,5,30,8],[30,9,30,12],[30,13,30,16],[96,23,96,27],[35,1,36,2]]}
["BGD"]
[]
[]
[null,"Summary of trends in use of drinking water by wealth quintile (%)"]
[null,{"$f":"IF(ISERROR(INDIRECT(CONCATENATE($B105,\"!A2\"))),\"\",INDIRECT(CONCATENATE($B105,\"!A2\")))","v":"Comoros"}]
[]
[null,{"$f":"B118","v":"National use of drinking water sources, 2000–2018"},null,null,null,null,null,null,null,{"$f":"B218","v":"Urban use of drinking water sources,  2000–2018"},null,null,null,null,null,null,null,{"$f":"B318","v":"Rural use of drinking water sources, 2000–2018"}]
[]
[]
[]
[]
[]
[]
[]
[]
[]
[]
[]
[]
[]
[]
[]
[]
[]
[]
[]
[]
[]
[]
[]
[null,{"$f":"IF(ISERROR(INDIRECT(CONCATENATE($B105,\"!A2\"))),\"\",INDIRECT(CONCATENATE($B105,\"!A2\")))","v":"Comoros"},null,null,null,"Poorest",null,null,null,"Poor",null,null,null,"Middle",null,null,null,"Rich",null,null,null,"Richest"]
[null,null,null,null,null,"Basic","Limited","Unimproved","Surface \n water","Basic","Limited","Unimproved","Surface \nwater","Basic","Limited","Unimproved","Surface \nwater","Basic","Limited","Unimproved","Surface \nwater","Basic","Limited","Unimproved","Surface \nwater"]
[null,"NATIONAL",null,"Estimate",{"$f":"C99","v":2000},{"$f":"E99","v":76.700137722969316},{"$f":"F99","v":8.1087605667384999},9.9240127114578769,5.2670889988343106,{"$f":"J99","v":82.980620321737447},{"$f":"K99","v":7.0315511071489656},6.5559753052930745,3.4318532658205072,{"$f":"O99","v":89.726939568384296},{"$f":"P99","v":3.4863377565574147},5.797656914038086,0.98906576102019983,{"$f":"T99","v":92.224632118162972},{"$f":"U99","v":2.5357950845459962},4.8403538790663845,0.39921891822464772,{"$f":"Y99","v":96.050374144731236},{"$f":"Z99","v":1.3090044516078472},2.1377645791573485,0.50285682450356717]
[null,null,null,null,{"$f":"C100","v":2018},{"$f":"E100","v":75.952165550943619},8.0296847341051087,13.97933121475694,2.0388185001943384,{"$f":"J100","v":82.859976668356524},7.0213280934957538,9.2906707824511727,0.82802445569654992,{"$f":"O100","v":86.230631637297662},3.3504888085454461,10.233723847660244,0.18515570649664426,{"$f":"T100","v":90.907029005410593},2.4995664608045738,6.5934045337848346,0,{"$f":"Y100","v":92.874382519946522},1.2657210473303382,5.7103725701404073,0.14952386258273265]
[]
[null,"URBAN",null,"Estimate",{"$f":"C199","v":2000},{"$f":"E199","v":66.341559571191056},{"$f":"F199","v":6.3406049264847333},27.00292684857709,0.31490865374713195,{"$f":"J199","v":86.915350465103572},{"$f":"K199","v":3.9321140541196375},9.1525354807767911,0,{"$f":"O199","v":91.880884826108243},{"$f":"P199","v":4.4220087256361218},3.0086325118853097,0.68847393637032894,{"$f":"T199","v":95.775409313357272},{"$f":"U199","v":1.1077235187041843},3.1168671679385369,0,{"$f":"Y199","v":96.127127315583763},{"$f":"Z199","v":0.54782472824837858},3.3250479561678645,0]
[null,null,null,null,{"$f":"C200","v":2018},{"$f":"E200","v":86.4869671762645},8.2660054074562481,4.5995121919037842,0.64751522437547493,{"$f":"J200","v":95.338057254964411},4.3131634724895038,0,0.34877927254608304,{"$f":"O200","v":95.408228597762616},4.5917714022373985,0,0,{"$f":"T200","v":98.447515839939854},1.1386286880498366,0.41385547201031159,0,{"$f":"Y200","v":98.244284336291599},0.55989032306971032,0.8458253406386973,0.34999999999999432]
[]
[null,"RURAL",null,"Estimate",{"$f":"C299","v":2000},{"$f":"E299","v":79.336660421476978},{"$f":"F299","v":8.9079306373272118},6.0149019820275953,5.740506959168215,{"$f":"J299","v":81.087058191485852},{"$f":"K299","v":8.4401702220151584},5.4323480796335843,5.0404235068654089,{"$f":"O299","v":92.169338253611528},{"$f":"P299","v":2.5478635542168364},4.3930227430002304,0.8897754491714096,{"$f":"T299","v":88.848533318529448},{"$f":"U299","v":2.8792758621672312},7.6678368087536342,0.60435401054968452,{"$f":"Y299","v":96.459656498940419},{"$f":"Z299","v":1.3244297570613157},1.297660888917278,0.91825285508099341]
[null,null,null,null,{"$f":"C300","v":2018},{"$f":"E300","v":74.360075764214585},8.3491590593181186,14.747516336328601,2.5432488401386877,{"$f":"J300","v":78.310920344633345},8.1512082531164758,12.627941986727706,0.90992941552246975,{"$f":"O300","v":83.635181626559529},2.3119514054693453,13.501162876166362,0.55170409180476554,{"$f":"T300","v":84.296924615713436},2.7317738541704899,12.955360531874362,1.5940998241717352E-2,{"$f":"Y300","v":88.421917249385828},1.214068374614067,10.28372318518025,8.0291190819849589E-2]
[]
[]
[]
[]
[]
[]
[]
[]
[]
[]
[]
[]
[]
[]
[]
[]
[]
[]
[]
[]
[]
[]
[]
[]
[]
[]
[]
[]
[]
[]
[]
[]
[]
[]
[]
[]
[]
[]
[]
[]
[]
[]
[]
[]
[]
[]
[]
[]
[]
[]
[]
[]
[]
[]
[]
[]
["NATIONAL",null,null,"Poorest",null,null,null,null,"Poor",null,null,null,null,"Middle",null,null,null,null,"Rich",null,null,null,null,"Richest"]
[null,null,null,"Improved","Basic","Limited","Unimproved","Surface water","Improved","Basic","Limited","Unimproved","Surface water","Improved","Basic","Limited","Unimproved","Surface water","Improved","Basic","Limited","Unimproved","Surface water","Improved","Basic","Limited","Unimproved","Surface water"]
["Forecast period:",null,2000,{"$f":"IF((D101+H101)>100,D101*100/(D101+H101),D101)","v":84.808898289707813},{"$f":"D99*AVERAGEIF(E105:E116,\">0\")/100","v":76.700137722969316},{"$f":"D99*(100-AVERAGEIF(E105:E116,\">0\"))/100","v":8.1087605667384999},{"$f":"100-(E99+F99+H99)","v":9.9240127114578769},{"$f":"IF((D101+H101)>100,H101*100/(D101+H101),H101)","v":5.2670889988343106},{"$f":"IF((I101+M101)>100,I101*100/(I101+M101),I101)","v":90.012171428886404},{"$f":"I99*AVERAGEIF(J105:J116,\">0\")/100","v":82.980620321737447},{"$f":"I99*(100-AVERAGEIF(J105:J116,\">0\"))/100","v":7.0315511071489656},{"$f":"100-(J99+K99+M99)","v":6.5559753052930745},{"$f":"IF((I101+M101)>100,M101*100/(I101+M101),M101)","v":3.4318532658205072},{"$f":"IF((N101+R101)>100,N101*100/(N101+R101),N101)","v":93.213277324941714},{"$f":"N99*AVERAGEIF(O105:O116,\">0\")/100","v":89.726939568384296},{"$f":"N99*(100-AVERAGEIF(O105:O116,\">0\"))/100","v":3.4863377565574147},{"$f":"100-(O99+P99+R99)","v":5.797656914038086},{"$f":"IF((N101+R101)>100,R101*100/(N101+R101),R101)","v":0.98906576102019983},{"$f":"IF((S101+W101)>100,S101*100/(S101+W101),S101)","v":94.760427202708968},{"$f":"S99*AVERAGEIF(T105:T116,\">0\")/100","v":92.224632118162972},{"$f":"S99*(100-AVERAGEIF(T105:T116,\">0\"))/100","v":2.5357950845459962},{"$f":"100-(T99+U99+W99)","v":4.8403538790663845},{"$f":"IF((S101+W101)>100,W101*100/(S101+W101),W101)","v":0.39921891822464772},{"$f":"IF((X101+AB101)>100,X101*100/(X101+AB101),X101)","v":97.35937859633907},{"$f":"X99*AVERAGEIF(Y105:Y116,\">0\")/100","v":96.050374144731236},{"$f":"X99*(100-AVERAGEIF(Y105:Y116,\">0\"))/100","v":1.3090044516078472},{"$f":"100-(Y99+Z99+AB99)","v":2.1377645791573485},{"$f":"IF((X101+AB101)>100,AB101*100/(X101+AB101),AB101)","v":0.50285682450356717}]
[null,null,2018,{"$f":"IF((D102+H102)>100,D102*100/(D102+H102),D102)","v":83.981850285048722},{"$f":"D100*AVERAGEIF(E105:E116,\">0\")/100","v":75.952165550943619},{"$f":"D100*(100-AVERAGEIF(E105:E116,\">0\"))/100","v":8.0296847341051087},{"$f":"100-(E100+F100+H100)","v":13.97933121475694},{"$f":"IF((D102+H102)>100,H102*100/(D102+H102),H102)","v":2.0388185001943384},{"$f":"IF((I102+M102)>100,I102*100/(I102+M102),I102)","v":89.881304761852277},{"$f":"I100*AVERAGEIF(J105:J116,\">0\")/100","v":82.859976668356524},{"$f":"I100*(100-AVERAGEIF(J105:J116,\">0\"))/100","v":7.0213280934957538},{"$f":"100-(J100+K100+M100)","v":9.2906707824511727},{"$f":"IF((I102+M102)>100,M102*100/(I102+M102),M102)","v":0.82802445569654992},{"$f":"IF((N102+R102)>100,N102*100/(N102+R102),N102)","v":89.581120445843112},{"$f":"N100*AVERAGEIF(O105:O116,\">0\")/100","v":86.230631637297662},{"$f":"N100*(100-AVERAGEIF(O105:O116,\">0\"))/100","v":3.3504888085454461},{"$f":"100-(O100+P100+R100)","v":10.233723847660244},{"$f":"IF((N102+R102)>100,R102*100/(N102+R102),R102)","v":0.18515570649664426},{"$f":"IF((S102+W102)>100,S102*100/(S102+W102),S102)","v":93.406595466215151},{"$f":"S100*AVERAGEIF(T105:T116,\">0\")/100","v":90.907029005410593},{"$f":"S100*(100-AVERAGEIF(T105:T116,\">0\"))/100","v":2.4995664608045738},{"$f":"100-(T100+U100+W100)","v":6.5934045337848346},{"$f":"IF((S102+W102)>100,W102*100/(S102+W102),W102)","v":0},{"$f":"IF((X102+AB102)>100,X102*100/(X102+AB102),X102)","v":94.140103567276867},{"$f":"X100*AVERAGEIF(Y105:Y116,\">0\")/100","v":92.874382519946522},{"$f":"X100*(100-AVERAGEIF(Y105:Y116,\">0\"))/100","v":1.2657210473303382},{"$f":"100-(Y100+Z100+AB100)","v":5.7103725701404073},{"$f":"IF((X102+AB102)>100,AB102*100/(X102+AB102),AB102)","v":0.14952386258273265}]
["Regression period:",null,{"$f":"MinRegYear(C99,C105:C116)","v":2000},{"$f":"IF(MAX(C105:C116)-MIN(C105:C116)<5,AVERAGEIF(C105:C116,\">0\",D105:D116),\nIF(FORECAST($C101,D$105:D$116,$C$105:$C$116)<0,0,\nIF(FORECAST($C101,D$105:D$116,$C$105:$C$116)>100,100,\nFORECAST($C101,D$105:D$116,$C$105:$C$116))))","v":84.808898289707813},null,null,null,{"$f":"IF(MAX(C105:C116)-MIN(C105:C116)<5,AVERAGEIF(C105:C116,\">0\",H105:H116),\nIF(FORECAST($C101,H$105:H$116,$C$105:$C$116)<0,0,\nIF(FORECAST($C101,H$105:H$116,$C$105:$C$116)>100,100,\nFORECAST($C101,H$105:H$116,$C$105:$C$116))))","v":5.2670889988343106},{"$f":"IF(MAX(C105:C116)-MIN(C105:C116)<5,AVERAGEIF(C105:C116,\">0\",I105:I116),\nIF(FORECAST($C101,I$105:I$116,$C$105:$C$116)<0,0,\nIF(FORECAST($C101,I$105:I$116,$C$105:$C$116)>100,100,\nFORECAST($C101,I$105:I$116,$C$105:$C$116))))","v":90.012171428886404},null,null,null,{"$f":"IF(MAX(C105:C116)-MIN(C105:C116)<5,AVERAGEIF(C105:C116,\">0\",M105:M116),\nIF(FORECAST($C101,M$105:M$116,$C$105:$C$116)<0,0,\nIF(FORECAST($C101,M$105:M$116,$C$105:$C$116)>100,100,\nFORECAST($C101,M$105:M$116,$C$105:$C$116))))","v":3.4318532658205072},{"$f":"IF(MAX(C105:C116)-MIN(C105:C116)<5,AVERAGEIF(C105:C116,\">0\",N105:N116),\nIF(FORECAST($C101,N$105:N$116,$C$105:$C$116)<0,0,\nIF(FORECAST($C101,N$105:N$116,$C$105:$C$116)>100,100,\nFORECAST($C101,N$105:N$116,$C$105:$C$116))))","v":93.213277324941714},null,null,null,{"$f":"IF(MAX(C105:C116)-MIN(C105:C116)<5,AVERAGEIF(C105:C116,\">0\",R105:R116),\nIF(FORECAST($C101,R$105:R$116,$C$105:$C$116)<0,0,\nIF(FORECAST($C101,R$105:R$116,$C$105:$C$116)>100,100,\nFORECAST($C101,R$105:R$116,$C$105:$C$116))))","v":0.98906576102019983},{"$f":"IF(MAX(C105:C116)-MIN(C105:C116)<5,AVERAGEIF(C105:C116,\">0\",S105:S116),\nIF(FORECAST($C101,S$105:S$116,$C$105:$C$116)<0,0,\nIF(FORECAST($C101,S$105:S$116,$C$105:$C$116)>100,100,\nFORECAST($C101,S$105:S$116,$C$105:$C$116))))","v":94.760427202708968},null,null,null,{"$f":"IF(MAX(C105:C116)-MIN(C105:C116)<5,AVERAGEIF(C105:C116,\">0\",W105:W116),\nIF(FORECAST($C101,W$105:W$116,$C$105:$C$116)<0,0,\nIF(FORECAST($C101,W$105:W$116,$C$105:$C$116)>100,100,\nFORECAST($C101,W$105:W$116,$C$105:$C$116))))","v":0.39921891822464772},{"$f":"IF(MAX(C105:C116)-MIN(C105:C116)<5,AVERAGEIF(C105:C116,\">0\",X105:X116),\nIF(FORECAST($C101,X$105:X$116,$C$105:$C$116)<0,0,\nIF(FORECAST($C101,X$105:X$116,$C$105:$C$116)>100,100,\nFORECAST($C101,X$105:X$116,$C$105:$C$116))))","v":97.35937859633907},null,null,null,{"$f":"IF(MAX(C105:C116)-MIN(C105:C116)<5,AVERAGEIF(C105:C116,\">0\",AB105:AB116),\nIF(FORECAST($C101,AB$105:AB$116,$C$105:$C$116)<0,0,\nIF(FORECAST($C101,AB$105:AB$116,$C$105:$C$116)>100,100,\nFORECAST($C101,AB$105:AB$116,$C$105:$C$116))))","v":0.50285682450356717}]
[null,null,{"$f":"MaxRegYear(C100,C105:C116)","v":2014},{"$f":"IF(MAX(C105:C116)-MIN(C105:C116)<5,AVERAGEIF(C105:C116,\">0\",D105:D116),\nIF(FORECAST($C102,D$105:D$116,$C$105:$C$116)<0,0,\nIF(FORECAST($C102,D$105:D$116,$C$105:$C$116)>100,100,\nFORECAST($C102,D$105:D$116,$C$105:$C$116))))","v":83.981850285048722},null,null,null,{"$f":"IF(MAX(C105:C116)-MIN(C105:C116)<5,AVERAGEIF(C105:C116,\">0\",H105:H116),\nIF(FORECAST($C102,H$105:H$116,$C$105:$C$116)<0,0,\nIF(FORECAST($C102,H$105:H$116,$C$105:$C$116)>100,100,\nFORECAST($C102,H$105:H$116,$C$105:$C$116))))","v":2.0388185001943384},{"$f":"IF(MAX(C105:C116)-MIN(C105:C116)<5,AVERAGEIF(C105:C116,\">0\",I105:I116),\nIF(FORECAST($C102,I$105:I$116,$C$105:$C$116)<0,0,\nIF(FORECAST($C102,I$105:I$116,$C$105:$C$116)>100,100,\nFORECAST($C102,I$105:I$116,$C$105:$C$116))))","v":89.881304761852277},null,null,null,{"$f":"IF(MAX(C105:C116)-MIN(C105:C116)<5,AVERAGEIF(C105:C116,\">0\",M105:M116),\nIF(FORECAST($C102,M$105:M$116,$C$105:$C$116)<0,0,\nIF(FORECAST($C102,M$105:M$116,$C$105:$C$116)>100,100,\nFORECAST($C102,M$105:M$116,$C$105:$C$116))))","v":0.82802445569654992},{"$f":"IF(MAX(C105:C116)-MIN(C105:C116)<5,AVERAGEIF(C105:C116,\">0\",N105:N116),\nIF(FORECAST($C102,N$105:N$116,$C$105:$C$116)<0,0,\nIF(FORECAST($C102,N$105:N$116,$C$105:$C$116)>100,100,\nFORECAST($C102,N$105:N$116,$C$105:$C$116))))","v":89.581120445843112},null,null,null,{"$f":"IF(MAX(C105:C116)-MIN(C105:C116)<5,AVERAGEIF(C105:C116,\">0\",R105:R116),\nIF(FORECAST($C102,R$105:R$116,$C$105:$C$116)<0,0,\nIF(FORECAST($C102,R$105:R$116,$C$105:$C$116)>100,100,\nFORECAST($C102,R$105:R$116,$C$105:$C$116))))","v":0.18515570649664426},{"$f":"IF(MAX(C105:C116)-MIN(C105:C116)<5,AVERAGEIF(C105:C116,\">0\",S105:S116),\nIF(FORECAST($C102,S$105:S$116,$C$105:$C$116)<0,0,\nIF(FORECAST($C102,S$105:S$116,$C$105:$C$116)>100,100,\nFORECAST($C102,S$105:S$116,$C$105:$C$116))))","v":93.406595466215151},null,null,null,{"$f":"IF(MAX(C105:C116)-MIN(C105:C116)<5,AVERAGEIF(C105:C116,\">0\",W105:W116),\nIF(FORECAST($C102,W$105:W$116,$C$105:$C$116)<0,0,\nIF(FORECAST($C102,W$105:W$116,$C$105:$C$116)>100,100,\nFORECAST($C102,W$105:W$116,$C$105:$C$116))))","v":0},{"$f":"IF(MAX(C105:C116)-MIN(C105:C116)<5,AVERAGEIF(C105:C116,\">0\",X105:X116),\nIF(FORECAST($C102,X$105:X$116,$C$105:$C$116)<0,0,\nIF(FORECAST($C102,X$105:X$116,$C$105:$C$116)>100,100,\nFORECAST($C102,X$105:X$116,$C$105:$C$116))))","v":94.140103567276867},null,null,null,{"$f":"IF(MAX(C105:C116)-MIN(C105:C116)<5,AVERAGEIF(C105:C116,\">0\",AB105:AB116),\nIF(FORECAST($C102,AB$105:AB$116,$C$105:$C$116)<0,0,\nIF(FORECAST($C102,AB$105:AB$116,$C$105:$C$116)>100,100,\nFORECAST($C102,AB$105:AB$116,$C$105:$C$116))))","v":0.14952386258273265}]
[]
[null,"Survey","Year","Improved","% Improved\n< = 30min",null,null,"Surface water","Improved","% Improved\n< = 30min",null,null,"Surface water","Improved","% Improved\n< = 30min",null,null,"Surface water","Improved","% Improved\n< = 30min",null,null,"Surface water","Improved","% Improved\n< = 30min",null,null,"Surface water"]
[null,"MICS00",2000,{"$f":"IF(ISERROR(INDIRECT(CONCATENATE($B105,\"!C16\"))),\"\",INDIRECT(CONCATENATE($B105,\"!C16\")))","v":84.808898289707784},{"$f":"IF(ISERROR(INDIRECT(CONCATENATE($B105,\"!C23\"))),\"\",INDIRECT(CONCATENATE($B105,\"!C23\")))","v":93.980178233481354},null,null,{"$f":"IF(ISERROR(INDIRECT(CONCATENATE($B105,\"!C21\"))),\"\",INDIRECT(CONCATENATE($B105,\"!C21\")))","v":5.2670889988342822},{"$f":"IF(ISERROR(INDIRECT(CONCATENATE($B105,\"!D16\"))),\"\",INDIRECT(CONCATENATE($B105,\"!D16\")))","v":90.012171428886404},{"$f":"IF(ISERROR(INDIRECT(CONCATENATE($B105,\"!D23\"))),\"\",INDIRECT(CONCATENATE($B105,\"!D23\")))","v":94.404342387309327},null,null,{"$f":"IF(ISERROR(INDIRECT(CONCATENATE($B105,\"!D21\"))),\"\",INDIRECT(CONCATENATE($B105,\"!D21\")))","v":3.431853265820529},{"$f":"IF(ISERROR(INDIRECT(CONCATENATE($B105,\"!E16\"))),\"\",INDIRECT(CONCATENATE($B105,\"!E16\")))","v":93.213277324941728},{"$f":"IF(ISERROR(INDIRECT(CONCATENATE($B105,\"!E23\"))),\"\",INDIRECT(CONCATENATE($B105,\"!E23\")))","v":96.774507885006329},null,null,{"$f":"IF(ISERROR(INDIRECT(CONCATENATE($B105,\"!E21\"))),\"\",INDIRECT(CONCATENATE($B105,\"!E21\")))","v":0.9890657610201834},{"$f":"IF(ISERROR(INDIRECT(CONCATENATE($B105,\"!F16\"))),\"\",INDIRECT(CONCATENATE($B105,\"!F16\")))","v":94.760427202708968},{"$f":"IF(ISERROR(INDIRECT(CONCATENATE($B105,\"!F23\"))),\"\",INDIRECT(CONCATENATE($B105,\"!F23\")))","v":97.444359175270051},null,null,{"$f":"IF(ISERROR(INDIRECT(CONCATENATE($B105,\"!F21\"))),\"\",INDIRECT(CONCATENATE($B105,\"!F21\")))","v":0.3992189182246591},{"$f":"IF(ISERROR(INDIRECT(CONCATENATE($B105,\"!G16\"))),\"\",INDIRECT(CONCATENATE($B105,\"!G16\")))","v":97.359378596339013},{"$f":"IF(ISERROR(INDIRECT(CONCATENATE($B105,\"!G23\"))),\"\",INDIRECT(CONCATENATE($B105,\"!G23\")))","v":99.676604476850073},null,null,{"$f":"IF(ISERROR(INDIRECT(CONCATENATE($B105,\"!G221\"))),\"\",INDIRECT(CONCATENATE($B105,\"!G21\")))","v":0.50285682450357405}]
[null,"WHS03",null,67.903463089521338,94.036178669167299,null,null,0,64.245505665415038,91.060323272253598,null,null,0,75.828721052454512,95.504973354332492,null,null,0,81.952758305202295,98.627621662928917,null,null,0,94.746546807852624,98.489872085099535,null,null,0]
[null,"DHS12",2012,84.1,83.3,null,null,2.5,89.9,91.1,null,null,1.2,90.1,96.5,null,null,0.3,93.6,95.9,null,null,0,94.6,97.8,null,null,0.2]
[null,null,null,"","",null,null,"","","",null,null,"","","",null,null,"","","",null,null,"","","",null,null,""]
[null,null,null,"","",null,null,"","","",null,null,"","","",null,null,"","","",null,null,"","","",null,null,""]
[null,null,null,"","",null,null,"","","",null,null,"","","",null,null,"","","",null,null,"","","",null,null,""]
[null,null,null,{"$f":"IF(ISERROR(INDIRECT(CONCATENATE($B111,\"!C16\"))),\"\",INDIRECT(CONCATENATE($B111,\"!C16\")))","v":""},{"$f":"IF(ISERROR(INDIRECT(CONCATENATE($B111,\"!C23\"))),\"\",INDIRECT(CONCATENATE($B111,\"!C23\")))","v":""},null,null,{"$f":"IF(ISERROR(INDIRECT(CONCATENATE($B111,\"!C21\"))),\"\",INDIRECT(CONCATENATE($B111,\"!C21\")))","v":""},{"$f":"IF(ISERROR(INDIRECT(CONCATENATE($B111,\"!D16\"))),\"\",INDIRECT(CONCATENATE($B111,\"!D16\")))","v":""},{"$f":"IF(ISERROR(INDIRECT(CONCATENATE($B111,\"!D23\"))),\"\",INDIRECT(CONCATENATE($B111,\"!D23\")))","v":""},null,null,{"$f":"IF(ISERROR(INDIRECT(CONCATENATE($B111,\"!D21\"))),\"\",INDIRECT(CONCATENATE($B111,\"!D21\")))","v":""},{"$f":"IF(ISERROR(INDIRECT(CONCATENATE($B111,\"!E16\"))),\"\",INDIRECT(CONCATENATE($B111,\"!E16\")))","v":""},{"$f":"IF(ISERROR(INDIRECT(CONCATENATE($B111,\"!E23\"))),\"\",INDIRECT(CONCATENATE($B111,\"!E23\")))","v":""},null,null,{"$f":"IF(ISERROR(INDIRECT(CONCATENATE($B111,\"!E21\"))),\"\",INDIRECT(CONCATENATE($B111,\"!E21\")))","v":""},{"$f":"IF(ISERROR(INDIRECT(CONCATENATE($B111,\"!F16\"))),\"\",INDIRECT(CONCATENATE($B111,\"!F16\")))","v":""},{"$f":"IF(ISERROR(INDIRECT(CONCATENATE($B111,\"!F23\"))),\"\",INDIRECT(CONCATENATE($B111,\"!F23\")))","v":""},null,null,{"$f":"IF(ISERROR(INDIRECT(CONCATENATE($B111,\"!F21\"))),\"\",INDIRECT(CONCATENATE($B111,\"!F21\")))","v":""},{"$f":"IF(ISERROR(INDIRECT(CONCATENATE($B111,\"!G16\"))),\"\",INDIRECT(CONCATENATE($B111,\"!G16\")))","v":""},{"$f":"IF(ISERROR(INDIRECT(CONCATENATE($B111,\"!G23\"))),\"\",INDIRECT(CONCATENATE($B111,\"!G23\")))","v":""},null,null,{"$f":"IF(ISERROR(INDIRECT(CONCATENATE($B111,\"!G221\"))),\"\",INDIRECT(CONCATENATE($B111,\"!G21\")))","v":""}]
[null,null,null,{"$f":"IF(ISERROR(INDIRECT(CONCATENATE($B112,\"!C16\"))),\"\",INDIRECT(CONCATENATE($B112,\"!C16\")))","v":""},{"$f":"IF(ISERROR(INDIRECT(CONCATENATE($B112,\"!C23\"))),\"\",INDIRECT(CONCATENATE($B112,\"!C23\")))","v":""},null,null,{"$f":"IF(ISERROR(INDIRECT(CONCATENATE($B112,\"!C21\"))),\"\",INDIRECT(CONCATENATE($B112,\"!C21\")))","v":""},{"$f":"IF(ISERROR(INDIRECT(CONCATENATE($B112,\"!D16\"))),\"\",INDIRECT(CONCATENATE($B112,\"!D16\")))","v":""},{"$f":"IF(ISERROR(INDIRECT(CONCATENATE($B112,\"!D23\"))),\"\",INDIRECT(CONCATENATE($B112,\"!D23\")))","v":""},null,null,{"$f":"IF(ISERROR(INDIRECT(CONCATENATE($B112,\"!D21\"))),\"\",INDIRECT(CONCATENATE($B112,\"!D21\")))","v":""},{"$f":"IF(ISERROR(INDIRECT(CONCATENATE($B112,\"!E16\"))),\"\",INDIRECT(CONCATENATE($B112,\"!E16\")))","v":""},{"$f":"IF(ISERROR(INDIRECT(CONCATENATE($B112,\"!E23\"))),\"\",INDIRECT(CONCATENATE($B112,\"!E23\")))","v":""},null,null,{"$f":"IF(ISERROR(INDIRECT(CONCATENATE($B112,\"!E21\"))),\"\",INDIRECT(CONCATENATE($B112,\"!E21\")))","v":""},{"$f":"IF(ISERROR(INDIRECT(CONCATENATE($B112,\"!F16\"))),\"\",INDIRECT(CONCATENATE($B112,\"!F16\")))","v":""},{"$f":"IF(ISERROR(INDIRECT(CONCATENATE($B112,\"!F23\"))),\"\",INDIRECT(CONCATENATE($B112,\"!F23\")))","v":""},null,null,{"$f":"IF(ISERROR(INDIRECT(CONCATENATE($B112,\"!F21\"))),\"\",INDIRECT(CONCATENATE($B112,\"!F21\")))","v":""},{"$f":"IF(ISERROR(INDIRECT(CONCATENATE($B112,\"!G16\"))),\"\",INDIRECT(CONCATENATE($B112,\"!G16\")))","v":""},{"$f":"IF(ISERROR(INDIRECT(CONCATENATE($B112,\"!G23\"))),\"\",INDIRECT(CONCATENATE($B112,\"!G23\")))","v":""},null,null,{"$f":"IF(ISERROR(INDIRECT(CONCATENATE($B112,\"!G221\"))),\"\",INDIRECT(CONCATENATE($B112,\"!G21\")))","v":""}]
[null,null,null,"","",null,null,"","","",null,null,"","","",null,null,"","","",null,null,"","","",null,null,""]
[null,null,null,"","",null,null,"","","",null,null,"","","",null,null,"","","",null,null,"","","",null,null,""]
[null,null,null,"","",null,null,"","","",null,null,"","","",null,null,"","","",null,null,"","","",null,null,""]
[null,null,null,"","",null,null,"","","",null,null,"","","",null,null,"","","",null,null,"","","",null,null,""]
[]
[null,{"$f":"CONCATENATE(\"National use of drinking water sources, \",C99,\"–\",C100)","v":"National use of drinking water sources, 2000–2018"},null,null,null,null,null,null,null,null,null,null,null,null,null,null,null,null,"Data points used for regression"]
[]
[]
[]
[]
[]
[]
[]
[]
[]
[]
[]
[]
[]
[]
[]
[]
[]
[]
[]
[]
[]
[]
[]
[]
[]
[]
[]
[]
[]
[]
[]
[]
[]
[]
[null,null,null,null,{"$f":"IF(ISERROR(INDIRECT(CONCATENATE($B153,\"!M18\"))),\"\",INDIRECT(CONCATENATE($B153,\"!M18\")))","v":""},{"$f":"IF(ISERROR(INDIRECT(CONCATENATE($B153,\"!M19\"))),\"\",INDIRECT(CONCATENATE($B153,\"!M19\")))","v":""},{"$f":"IF(ISERROR(INDIRECT(CONCATENATE($B153,\"!M20\"))),\"\",INDIRECT(CONCATENATE($B153,\"!M20\")))","v":""},{"$f":"IF(ISERROR(INDIRECT(CONCATENATE($B153,\"!M21\"))),\"\",INDIRECT(CONCATENATE($B153,\"!M21\")))","v":""},null,{"$f":"IF(ISERROR(INDIRECT(CONCATENATE($B153,\"!N18\"))),\"\",INDIRECT(CONCATENATE($B153,\"!N18\")))","v":""},{"$f":"IF(ISERROR(INDIRECT(CONCATENATE($B153,\"!N19\"))),\"\",INDIRECT(CONCATENATE($B153,\"!N19\")))","v":""},{"$f":"IF(ISERROR(INDIRECT(CONCATENATE($B153,\"!N20\"))),\"\",INDIRECT(CONCATENATE($B153,\"!N20\")))","v":""},{"$f":"IF(ISERROR(INDIRECT(CONCATENATE($B153,\"!N21\"))),\"\",INDIRECT(CONCATENATE($B153,\"!N21\")))","v":""},null,{"$f":"IF(ISERROR(INDIRECT(CONCATENATE($B153,\"!O18\"))),\"\",INDIRECT(CONCATENATE($B153,\"!O18\")))","v":""},{"$f":"IF(ISERROR(INDIRECT(CONCATENATE($B153,\"!O19\"))),\"\",INDIRECT(CONCATENATE($B153,\"!O19\")))","v":""},{"$f":"IF(ISERROR(INDIRECT(CONCATENATE($B153,\"!O20\"))),\"\",INDIRECT(CONCATENATE($B153,\"!O20\")))","v":""},{"$f":"IF(ISERROR(INDIRECT(CONCATENATE($B153,\"!O21\"))),\"\",INDIRECT(CONCATENATE($B153,\"!O21\")))","v":""},null,{"$f":"IF(ISERROR(INDIRECT(CONCATENATE($B153,\"!P18\"))),\"\",INDIRECT(CONCATENATE($B153,\"!P18\")))","v":""},{"$f":"IF(ISERROR(INDIRECT(CONCATENATE($B153,\"!P19\"))),\"\",INDIRECT(CONCATENATE($B153,\"!P19\")))","v":""},{"$f":"IF(ISERROR(INDIRECT(CONCATENATE($B153,\"!P20\"))),\"\",INDIRECT(CONCATENATE($B153,\"!P20\")))","v":""},{"$f":"IF(ISERROR(INDIRECT(CONCATENATE($B153,\"!P21\"))),\"\",INDIRECT(CONCATENATE($B153,\"!P21\")))","v":""},null,{"$f":"IF(ISERROR(INDIRECT(CONCATENATE($B153,\"!Q18\"))),\"\",INDIRECT(CONCATENATE($B153,\"!Q18\")))","v":""},{"$f":"IF(ISERROR(INDIRECT(CONCATENATE($B153,\"!Q19\"))),\"\",INDIRECT(CONCATENATE($B153,\"!Q19\")))","v":""},{"$f":"IF(ISERROR(INDIRECT(CONCATENATE($B153,\"!Q20\"))),\"\",INDIRECT(CONCATENATE($B153,\"!Q20\")))","v":""},{"$f":"IF(ISERROR(INDIRECT(CONCATENATE($B153,\"!Q21\"))),\"\",INDIRECT(CONCATENATE($B153,\"!Q1\")))","v":""}]
[null,null,null,null,"","","","",null,"","","","",null,"","","","",null,"","","","",null,"","","",""]
[null,null,null,null,"","","","",null,"","","","",null,"","","","",null,"","","","",null,"","","",""]
[null,null,null,null,"","","","",null,"","","","",null,"","","","",null,"","","","",null,"","","",""]
[null,null,null,null,"","","","",null,"","","","",null,"","","","",null,"","","","",null,"","","",""]
[null,null,null,null,"","","","",null,"","","","",null,"","","","",null,"","","","",null,"","","",""]
[]
[]
[]
[]
[]
[]
[]
[]
[]
[]
[]
[]
[]
[]
[]
[]
[]
[]
[]
[]
[]
[]
[]
[]
[]
[]
[]
[]
[]
[]
[]
[]
[]
[]
[]
[]
[]
[]
["URBAN",null,null,"Poorest",null,null,null,null,"Poor",null,null,null,null,"Middle",null,null,null,null,"Rich",null,null,null,null,"Richest"]
[null,null,null,"Improved","Basic","Limited","Unimproved","Surface water","Improved","Basic","Limited","Unimproved","Surface water","Improved","Basic","Limited","Unimproved","Surface water","Improved","Basic","Limited","Unimproved","Surface water","Improved","Basic","Limited","Unimproved","Surface water"]
["Forecast period:",null,2000,{"$f":"IF((D201+H201)>100,D201*100/(D201+H201),D201)","v":72.682164497675785},{"$f":"D199*AVERAGEIF(E205:E216,\">0\")/100","v":66.341559571191056},{"$f":"D199*(100-AVERAGEIF(E205:E216,\">0\"))/100","v":6.3406049264847333},{"$f":"100-(E199+F199+H199)","v":27.00292684857709},{"$f":"IF((D201+H201)>100,H201*100/(D201+H201),H201)","v":0.31490865374713195},{"$f":"IF((I201+M201)>100,I201*100/(I201+M201),I201)","v":90.847464519223195},{"$f":"I199*AVERAGEIF(J205:J216,\">0\")/100","v":86.915350465103572},{"$f":"I199*(100-AVERAGEIF(J205:J216,\">0\"))/100","v":3.9321140541196375},{"$f":"100-(J199+K199+M199)","v":9.1525354807767911},{"$f":"IF((I201+M201)>100,M201*100/(I201+M201),M201)","v":0},{"$f":"IF((N201+R201)>100,N201*100/(N201+R201),N201)","v":96.302893551744376},{"$f":"N199*AVERAGEIF(O205:O216,\">0\")/100","v":91.880884826108243},{"$f":"N199*(100-AVERAGEIF(O205:O216,\">0\"))/100","v":4.4220087256361218},{"$f":"100-(O199+P199+R199)","v":3.0086325118853097},{"$f":"IF((N201+R201)>100,R201*100/(N201+R201),R201)","v":0.68847393637032894},{"$f":"IF((S201+W201)>100,S201*100/(S201+W201),S201)","v":96.883132832061449},{"$f":"S199*AVERAGEIF(T205:T216,\">0\")/100","v":95.775409313357272},{"$f":"S199*(100-AVERAGEIF(T205:T216,\">0\"))/100","v":1.1077235187041843},{"$f":"100-(T199+U199+W199)","v":3.1168671679385369},{"$f":"IF((S201+W201)>100,W201*100/(S201+W201),W201)","v":0},{"$f":"IF((X201+AB201)>100,X201*100/(X201+AB201),X201)","v":96.67495204383215},{"$f":"X199*AVERAGEIF(Y205:Y216,\">0\")/100","v":96.127127315583763},{"$f":"X199*(100-AVERAGEIF(Y205:Y216,\">0\"))/100","v":0.54782472824837858},{"$f":"100-(Y199+Z199+AB199)","v":3.3250479561678645},{"$f":"IF((X201+AB201)>100,AB201*100/(X201+AB201),AB201)","v":0}]
[null,null,2018,{"$f":"IF((D202+H202)>100,D202*100/(D202+H202),D202)","v":94.752972583720748},{"$f":"D200*AVERAGEIF(E205:E216,\">0\")/100","v":86.4869671762645},{"$f":"D200*(100-AVERAGEIF(E205:E216,\">0\"))/100","v":8.2660054074562481},{"$f":"100-(E200+F200+H200)","v":4.5995121919037842},{"$f":"IF((D202+H202)>100,H202*100/(D202+H202),H202)","v":0.64751522437547493},{"$f":"IF((I202+M202)>100,I202*100/(I202+M202),I202)","v":99.651220727453918},{"$f":"I200*AVERAGEIF(J205:J216,\">0\")/100","v":95.338057254964411},{"$f":"I200*(100-AVERAGEIF(J205:J216,\">0\"))/100","v":4.3131634724895038},{"$f":"100-(J200+K200+M200)","v":0},{"$f":"IF((I202+M202)>100,M202*100/(I202+M202),M202)","v":0.34877927254608304},{"$f":"IF((N202+R202)>100,N202*100/(N202+R202),N202)","v":100},{"$f":"N200*AVERAGEIF(O205:O216,\">0\")/100","v":95.408228597762616},{"$f":"N200*(100-AVERAGEIF(O205:O216,\">0\"))/100","v":4.5917714022373985},{"$f":"100-(O200+P200+R200)","v":0},{"$f":"IF((N202+R202)>100,R202*100/(N202+R202),R202)","v":0},{"$f":"IF((S202+W202)>100,S202*100/(S202+W202),S202)","v":99.586144527989688},{"$f":"S200*AVERAGEIF(T205:T216,\">0\")/100","v":98.447515839939854},{"$f":"S200*(100-AVERAGEIF(T205:T216,\">0\"))/100","v":1.1386286880498366},{"$f":"100-(T200+U200+W200)","v":0.41385547201031159},{"$f":"IF((S202+W202)>100,W202*100/(S202+W202),W202)","v":0},{"$f":"IF((X202+AB202)>100,X202*100/(X202+AB202),X202)","v":98.804174659361308},{"$f":"X200*AVERAGEIF(Y205:Y216,\">0\")/100","v":98.244284336291599},{"$f":"X200*(100-AVERAGEIF(Y205:Y216,\">0\"))/100","v":0.55989032306971032},{"$f":"100-(Y200+Z200+AB200)","v":0.8458253406386973},{"$f":"IF((X202+AB202)>100,AB202*100/(X202+AB202),AB202)","v":0.34999999999999432}]
["Regression period:",null,{"$f":"MinRegYear(C199,C205:C216)","v":2000},{"$f":"IF(MAX(C205:C216)-MIN(C205:C216)<5,AVERAGEIF(C205:C216,\">0\",D205:D216),\nIF(FORECAST($C201,D$205:D$216,$C$205:$C$216)<0,0,\nIF(FORECAST($C201,D$205:D$216,$C$205:$C$216)>100,100,\nFORECAST($C201,D$205:D$216,$C$205:$C$216))))","v":72.682164497675785},null,null,null,{"$f":"IF(MAX(C205:C216)-MIN(C205:C216)<5,AVERAGEIF(C205:C216,\">0\",H205:H216),\nIF(FORECAST($C201,H$205:H$216,$C$205:$C$216)<0,0,\nIF(FORECAST($C201,H$205:H$216,$C$205:$C$216)>100,100,\nFORECAST($C201,H$205:H$216,$C$205:$C$216))))","v":0.31490865374713195},{"$f":"IF(MAX(C205:C216)-MIN(C205:C216)<5,AVERAGEIF(C205:C216,\">0\",I205:I216),\nIF(FORECAST($C201,I$205:I$216,$C$205:$C$216)<0,0,\nIF(FORECAST($C201,I$205:I$216,$C$205:$C$216)>100,100,\nFORECAST($C201,I$205:I$216,$C$205:$C$216))))","v":90.847464519223195},null,null,null,{"$f":"IF(MAX(C205:C216)-MIN(C205:C216)<5,AVERAGEIF(C205:C216,\">0\",M205:M216),\nIF(FORECAST($C201,M$205:M$216,$C$205:$C$216)<0,0,\nIF(FORECAST($C201,M$205:M$216,$C$205:$C$216)>100,100,\nFORECAST($C201,M$205:M$216,$C$205:$C$216))))","v":0},{"$f":"IF(MAX(C205:C216)-MIN(C205:C216)<5,AVERAGEIF(C205:C216,\">0\",N205:N216),\nIF(FORECAST($C201,N$205:N$216,$C$205:$C$216)<0,0,\nIF(FORECAST($C201,N$205:N$216,$C$205:$C$216)>100,100,\nFORECAST($C201,N$205:N$216,$C$205:$C$216))))","v":96.302893551744376},null,null,null,{"$f":"IF(MAX(C205:C216)-MIN(C205:C216)<5,AVERAGEIF(C205:C216,\">0\",R205:R216),\nIF(FORECAST($C201,R$205:R$216,$C$205:$C$216)<0,0,\nIF(FORECAST($C201,R$205:R$216,$C$205:$C$216)>100,100,\nFORECAST($C201,R$205:R$216,$C$205:$C$216))))","v":0.68847393637032894},{"$f":"IF(MAX(C205:C216)-MIN(C205:C216)<5,AVERAGEIF(C205:C216,\">0\",S205:S216),\nIF(FORECAST($C201,S$205:S$216,$C$205:$C$216)<0,0,\nIF(FORECAST($C201,S$205:S$216,$C$205:$C$216)>100,100,\nFORECAST($C201,S$205:S$216,$C$205:$C$216))))","v":96.883132832061449},null,null,null,{"$f":"IF(MAX(C205:C216)-MIN(C205:C216)<5,AVERAGEIF(C205:C216,\">0\",W205:W216),\nIF(FORECAST($C201,W$205:W$216,$C$205:$C$216)<0,0,\nIF(FORECAST($C201,W$205:W$216,$C$205:$C$216)>100,100,\nFORECAST($C201,W$205:W$216,$C$205:$C$216))))","v":0},{"$f":"IF(MAX(C205:C216)-MIN(C205:C216)<5,AVERAGEIF(C205:C216,\">0\",X205:X216),\nIF(FORECAST($C201,X$205:X$216,$C$205:$C$216)<0,0,\nIF(FORECAST($C201,X$205:X$216,$C$205:$C$216)>100,100,\nFORECAST($C201,X$205:X$216,$C$205:$C$216))))","v":96.67495204383215},null,null,null,{"$f":"IF(MAX(C205:C216)-MIN(C205:C216)<5,AVERAGEIF(C205:C216,\">0\",AB205:AB216),\nIF(FORECAST($C201,AB$205:AB$216,$C$205:$C$216)<0,0,\nIF(FORECAST($C201,AB$205:AB$216,$C$205:$C$216)>100,100,\nFORECAST($C201,AB$205:AB$216,$C$205:$C$216))))","v":0}]
[null,null,{"$f":"MaxRegYear(C200,C205:C216)","v":2014},{"$f":"IF(MAX(C205:C216)-MIN(C205:C216)<5,AVERAGEIF(C205:C216,\">0\",D205:D216),\nIF(FORECAST($C202,D$205:D$216,$C$205:$C$216)<0,0,\nIF(FORECAST($C202,D$205:D$216,$C$205:$C$216)>100,100,\nFORECAST($C202,D$205:D$216,$C$205:$C$216))))","v":94.752972583720748},null,null,null,{"$f":"IF(MAX(C205:C216)-MIN(C205:C216)<5,AVERAGEIF(C205:C216,\">0\",H205:H216),\nIF(FORECAST($C202,H$205:H$216,$C$205:$C$216)<0,0,\nIF(FORECAST($C202,H$205:H$216,$C$205:$C$216)>100,100,\nFORECAST($C202,H$205:H$216,$C$205:$C$216))))","v":0.64751522437547493},{"$f":"IF(MAX(C205:C216)-MIN(C205:C216)<5,AVERAGEIF(C205:C216,\">0\",I205:I216),\nIF(FORECAST($C202,I$205:I$216,$C$205:$C$216)<0,0,\nIF(FORECAST($C202,I$205:I$216,$C$205:$C$216)>100,100,\nFORECAST($C202,I$205:I$216,$C$205:$C$216))))","v":100},null,null,null,{"$f":"IF(MAX(C205:C216)-MIN(C205:C216)<5,AVERAGEIF(C205:C216,\">0\",M205:M216),\nIF(FORECAST($C202,M$205:M$216,$C$205:$C$216)<0,0,\nIF(FORECAST($C202,M$205:M$216,$C$205:$C$216)>100,100,\nFORECAST($C202,M$205:M$216,$C$205:$C$216))))","v":0.34999999999999432},{"$f":"IF(MAX(C205:C216)-MIN(C205:C216)<5,AVERAGEIF(C205:C216,\">0\",N205:N216),\nIF(FORECAST($C202,N$205:N$216,$C$205:$C$216)<0,0,\nIF(FORECAST($C202,N$205:N$216,$C$205:$C$216)>100,100,\nFORECAST($C202,N$205:N$216,$C$205:$C$216))))","v":100},null,null,null,{"$f":"IF(MAX(C205:C216)-MIN(C205:C216)<5,AVERAGEIF(C205:C216,\">0\",R205:R216),\nIF(FORECAST($C202,R$205:R$216,$C$205:$C$216)<0,0,\nIF(FORECAST($C202,R$205:R$216,$C$205:$C$216)>100,100,\nFORECAST($C202,R$205:R$216,$C$205:$C$216))))","v":0},{"$f":"IF(MAX(C205:C216)-MIN(C205:C216)<5,AVERAGEIF(C205:C216,\">0\",S205:S216),\nIF(FORECAST($C202,S$205:S$216,$C$205:$C$216)<0,0,\nIF(FORECAST($C202,S$205:S$216,$C$205:$C$216)>100,100,\nFORECAST($C202,S$205:S$216,$C$205:$C$216))))","v":99.586144527989688},null,null,null,{"$f":"IF(MAX(C205:C216)-MIN(C205:C216)<5,AVERAGEIF(C205:C216,\">0\",W205:W216),\nIF(FORECAST($C202,W$205:W$216,$C$205:$C$216)<0,0,\nIF(FORECAST($C202,W$205:W$216,$C$205:$C$216)>100,100,\nFORECAST($C202,W$205:W$216,$C$205:$C$216))))","v":0},{"$f":"IF(MAX(C205:C216)-MIN(C205:C216)<5,AVERAGEIF(C205:C216,\">0\",X205:X216),\nIF(FORECAST($C202,X$205:X$216,$C$205:$C$216)<0,0,\nIF(FORECAST($C202,X$205:X$216,$C$205:$C$216)>100,100,\nFORECAST($C202,X$205:X$216,$C$205:$C$216))))","v":98.804174659361308},null,null,null,{"$f":"IF(MAX(C205:C216)-MIN(C205:C216)<5,AVERAGEIF(C205:C216,\">0\",AB205:AB216),\nIF(FORECAST($C202,AB$205:AB$216,$C$205:$C$216)<0,0,\nIF(FORECAST($C202,AB$205:AB$216,$C$205:$C$216)>100,100,\nFORECAST($C202,AB$205:AB$216,$C$205:$C$216))))","v":0.34999999999999432}]
[]
[null,"Survey","Year","Improved","% Improved\n< = 30min",null,null,"Surface water","Improved","% Improved\n< = 30min",null,null,"Surface water","Improved","% Improved\n< = 30min",null,null,"Surface water","Improved","% Improved\n< = 30min",null,null,"Surface water","Improved","% Improved\n< = 30min",null,null,"Surface water"]
[null,"MICS00",2000,{"$f":"IF(ISERROR(INDIRECT(CONCATENATE($B205,\"!H16\"))),\"\",INDIRECT(CONCATENATE($B205,\"!H16\")))","v":72.682164497675728},{"$f":"IF(ISERROR(INDIRECT(CONCATENATE($B205,\"!H23\"))),\"\",INDIRECT(CONCATENATE($B205,\"!H23\")))","v":98.530486043652644},null,null,{"$f":"IF(ISERROR(INDIRECT(CONCATENATE($B205,\"!H21\"))),\"\",INDIRECT(CONCATENATE($B205,\"!H21\")))","v":0.31490865374713833},{"$f":"IF(ISERROR(INDIRECT(CONCATENATE($B205,\"!I16\"))),\"\",INDIRECT(CONCATENATE($B205,\"!I16\")))","v":90.847464519223337},{"$f":"IF(ISERROR(INDIRECT(CONCATENATE($B205,\"!I23\"))),\"\",INDIRECT(CONCATENATE($B205,\"!I23\")))","v":98.031980319688344},null,null,{"$f":"IF(ISERROR(INDIRECT(CONCATENATE($B205,\"!I21\"))),\"\",INDIRECT(CONCATENATE($B205,\"!I21\")))","v":0},{"$f":"IF(ISERROR(INDIRECT(CONCATENATE($B205,\"!J16\"))),\"\",INDIRECT(CONCATENATE($B205,\"!J16\")))","v":96.302893551744404},{"$f":"IF(ISERROR(INDIRECT(CONCATENATE($B205,\"!J23\"))),\"\",INDIRECT(CONCATENATE($B205,\"!J23\")))","v":99.346929322260152},null,null,{"$f":"IF(ISERROR(INDIRECT(CONCATENATE($B205,\"!J21\"))),\"\",INDIRECT(CONCATENATE($B205,\"!J21\")))","v":0.68847393637032828},{"$f":"IF(ISERROR(INDIRECT(CONCATENATE($B205,\"!K16\"))),\"\",INDIRECT(CONCATENATE($B205,\"!K16\")))","v":96.883132832061506},{"$f":"IF(ISERROR(INDIRECT(CONCATENATE($B205,\"!K23\"))),\"\",INDIRECT(CONCATENATE($B205,\"!K23\")))","v":99.769918355269354},null,null,{"$f":"IF(ISERROR(INDIRECT(CONCATENATE($B205,\"!K21\"))),\"\",INDIRECT(CONCATENATE($B205,\"!K21\")))","v":0},{"$f":"IF(ISERROR(INDIRECT(CONCATENATE($B205,\"!L16\"))),\"\",INDIRECT(CONCATENATE($B205,\"!L16\")))","v":96.674952043832164},{"$f":"IF(ISERROR(INDIRECT(CONCATENATE($B205,\"!L23\"))),\"\",INDIRECT(CONCATENATE($B205,\"!L23\")))","v":100},null,null,{"$f":"IF(ISERROR(INDIRECT(CONCATENATE($B205,\"!L221\"))),\"\",INDIRECT(CONCATENATE($B205,\"!L21\")))","v":0}]
[null,"WHS03",null,79.190830102165407,86.698286240554054,null,null,0,91.089306894202522,96.583241046382028,null,null,0,87.287545656642607,94.477756471027604,null,null,0,94.870491081920534,100,null,null,0,96.104243449267884,100,null,null,0]
[null,"DHS12",2012,91.6,88.6,null,null,0.6,99.1,92.4,null,null,0.3,99.5,92.4,null,null,0,99.2,96.8,null,null,0,98.5,98.3,null,null,0.3]
[null,null,null,"","",null,null,"","","",null,null,"","","",null,null,"","","",null,null,"","","",null,null,""]
[null,null,null,"","",null,null,"","","",null,null,"","","",null,null,"","","",null,null,"","","",null,null,""]
[null,null,null,"","",null,null,"","","",null,null,"","","",null,null,"","","",null,null,"","","",null,null,""]
[null,null,null,"","",null,null,"","","",null,null,"","","",null,null,"","","",null,null,"","","",null,null,""]
[null,null,null,"","",null,null,"","","",null,null,"","","",null,null,"","","",null,null,"","","",null,null,""]
[null,null,null,"","",null,null,"","","",null,null,"","","",null,null,"","","",null,null,"","","",null,null,""]
[null,null,null,"","",null,null,"","","",null,null,"","","",null,null,"","","",null,null,"","","",null,null,""]
[null,null,null,"","",null,null,"","","",null,null,"","","",null,null,"","","",null,null,"","","",null,null,""]
[null,null,null,"","",null,null,"","","",null,null,"","","",null,null,"","","",null,null,"","","",null,null,""]
[]
[null,{"$f":"CONCATENATE(\"Urban use of drinking water sources,  \",C199,\"–\",C200)","v":"Urban use of drinking water sources,  2000–2018"},null,null,null,null,null,null,null,null,null,null,null,null,null,null,null,null,"Data points used for regression"]
[]
[]
[]
[]
[]
[]
[]
[]
[]
[]
[]
[]
[]
[]
[]
[]
[]
[]
[]
[]
[]
[]
[]
[]
[]
[]
[]
[]
[]
[]
[]
[]
[]
[]
[null,null,null,null,{"$f":"IF(ISERROR(INDIRECT(CONCATENATE($B253,\"!M18\"))),\"\",INDIRECT(CONCATENATE($B253,\"!M18\")))","v":""},{"$f":"IF(ISERROR(INDIRECT(CONCATENATE($B253,\"!M19\"))),\"\",INDIRECT(CONCATENATE($B253,\"!M19\")))","v":""},{"$f":"IF(ISERROR(INDIRECT(CONCATENATE($B253,\"!M20\"))),\"\",INDIRECT(CONCATENATE($B253,\"!M20\")))","v":""},{"$f":"IF(ISERROR(INDIRECT(CONCATENATE($B253,\"!M21\"))),\"\",INDIRECT(CONCATENATE($B253,\"!M21\")))","v":""},null,{"$f":"IF(ISERROR(INDIRECT(CONCATENATE($B253,\"!N18\"))),\"\",INDIRECT(CONCATENATE($B253,\"!N18\")))","v":""},{"$f":"IF(ISERROR(INDIRECT(CONCATENATE($B253,\"!N19\"))),\"\",INDIRECT(CONCATENATE($B253,\"!N19\")))","v":""},{"$f":"IF(ISERROR(INDIRECT(CONCATENATE($B253,\"!N20\"))),\"\",INDIRECT(CONCATENATE($B253,\"!N20\")))","v":""},{"$f":"IF(ISERROR(INDIRECT(CONCATENATE($B253,\"!N21\"))),\"\",INDIRECT(CONCATENATE($B253,\"!N21\")))","v":""},null,{"$f":"IF(ISERROR(INDIRECT(CONCATENATE($B253,\"!O18\"))),\"\",INDIRECT(CONCATENATE($B253,\"!O18\")))","v":""},{"$f":"IF(ISERROR(INDIRECT(CONCATENATE($B253,\"!O19\"))),\"\",INDIRECT(CONCATENATE($B253,\"!O19\")))","v":""},{"$f":"IF(ISERROR(INDIRECT(CONCATENATE($B253,\"!O20\"))),\"\",INDIRECT(CONCATENATE($B253,\"!O20\")))","v":""},{"$f":"IF(ISERROR(INDIRECT(CONCATENATE($B253,\"!O21\"))),\"\",INDIRECT(CONCATENATE($B253,\"!O21\")))","v":""},null,{"$f":"IF(ISERROR(INDIRECT(CONCATENATE($B253,\"!P18\"))),\"\",INDIRECT(CONCATENATE($B253,\"!P18\")))","v":""},{"$f":"IF(ISERROR(INDIRECT(CONCATENATE($B253,\"!P19\"))),\"\",INDIRECT(CONCATENATE($B253,\"!P19\")))","v":""},{"$f":"IF(ISERROR(INDIRECT(CONCATENATE($B253,\"!P20\"))),\"\",INDIRECT(CONCATENATE($B253,\"!P20\")))","v":""},{"$f":"IF(ISERROR(INDIRECT(CONCATENATE($B253,\"!P21\"))),\"\",INDIRECT(CONCATENATE($B253,\"!P21\")))","v":""},null,{"$f":"IF(ISERROR(INDIRECT(CONCATENATE($B253,\"!Q18\"))),\"\",INDIRECT(CONCATENATE($B253,\"!Q18\")))","v":""},{"$f":"IF(ISERROR(INDIRECT(CONCATENATE($B253,\"!Q19\"))),\"\",INDIRECT(CONCATENATE($B253,\"!Q19\")))","v":""},{"$f":"IF(ISERROR(INDIRECT(CONCATENATE($B253,\"!Q20\"))),\"\",INDIRECT(CONCATENATE($B253,\"!Q20\")))","v":""},{"$f":"IF(ISERROR(INDIRECT(CONCATENATE($B253,\"!Q21\"))),\"\",INDIRECT(CONCATENATE($B253,\"!Q1\")))","v":""}]
[null,null,null,null,{"$f":"IF(ISERROR(INDIRECT(CONCATENATE($B254,\"!M18\"))),\"\",INDIRECT(CONCATENATE($B254,\"!M18\")))","v":""},{"$f":"IF(ISERROR(INDIRECT(CONCATENATE($B254,\"!M19\"))),\"\",INDIRECT(CONCATENATE($B254,\"!M19\")))","v":""},{"$f":"IF(ISERROR(INDIRECT(CONCATENATE($B254,\"!M20\"))),\"\",INDIRECT(CONCATENATE($B254,\"!M20\")))","v":""},{"$f":"IF(ISERROR(INDIRECT(CONCATENATE($B254,\"!M21\"))),\"\",INDIRECT(CONCATENATE($B254,\"!M21\")))","v":""},null,{"$f":"IF(ISERROR(INDIRECT(CONCATENATE($B254,\"!N18\"))),\"\",INDIRECT(CONCATENATE($B254,\"!N18\")))","v":""},{"$f":"IF(ISERROR(INDIRECT(CONCATENATE($B254,\"!N19\"))),\"\",INDIRECT(CONCATENATE($B254,\"!N19\")))","v":""},{"$f":"IF(ISERROR(INDIRECT(CONCATENATE($B254,\"!N20\"))),\"\",INDIRECT(CONCATENATE($B254,\"!N20\")))","v":""},{"$f":"IF(ISERROR(INDIRECT(CONCATENATE($B254,\"!N21\"))),\"\",INDIRECT(CONCATENATE($B254,\"!N21\")))","v":""},null,{"$f":"IF(ISERROR(INDIRECT(CONCATENATE($B254,\"!O18\"))),\"\",INDIRECT(CONCATENATE($B254,\"!O18\")))","v":""},{"$f":"IF(ISERROR(INDIRECT(CONCATENATE($B254,\"!O19\"))),\"\",INDIRECT(CONCATENATE($B254,\"!O19\")))","v":""},{"$f":"IF(ISERROR(INDIRECT(CONCATENATE($B254,\"!O20\"))),\"\",INDIRECT(CONCATENATE($B254,\"!O20\")))","v":""},{"$f":"IF(ISERROR(INDIRECT(CONCATENATE($B254,\"!O21\"))),\"\",INDIRECT(CONCATENATE($B254,\"!O21\")))","v":""},null,{"$f":"IF(ISERROR(INDIRECT(CONCATENATE($B254,\"!P18\"))),\"\",INDIRECT(CONCATENATE($B254,\"!P18\")))","v":""},{"$f":"IF(ISERROR(INDIRECT(CONCATENATE($B254,\"!P19\"))),\"\",INDIRECT(CONCATENATE($B254,\"!P19\")))","v":""},{"$f":"IF(ISERROR(INDIRECT(CONCATENATE($B254,\"!P20\"))),\"\",INDIRECT(CONCATENATE($B254,\"!P20\")))","v":""},{"$f":"IF(ISERROR(INDIRECT(CONCATENATE($B254,\"!P21\"))),\"\",INDIRECT(CONCATENATE($B254,\"!P21\")))","v":""},null,{"$f":"IF(ISERROR(INDIRECT(CONCATENATE($B254,\"!Q18\"))),\"\",INDIRECT(CONCATENATE($B254,\"!Q18\")))","v":""},{"$f":"IF(ISERROR(INDIRECT(CONCATENATE($B254,\"!Q19\"))),\"\",INDIRECT(CONCATENATE($B254,\"!Q19\")))","v":""},{"$f":"IF(ISERROR(INDIRECT(CONCATENATE($B254,\"!Q20\"))),\"\",INDIRECT(CONCATENATE($B254,\"!Q20\")))","v":""},{"$f":"IF(ISERROR(INDIRECT(CONCATENATE($B254,\"!Q21\"))),\"\",INDIRECT(CONCATENATE($B254,\"!Q1\")))","v":""}]
[null,null,null,null,{"$f":"IF(ISERROR(INDIRECT(CONCATENATE($B255,\"!M18\"))),\"\",INDIRECT(CONCATENATE($B255,\"!M18\")))","v":""},{"$f":"IF(ISERROR(INDIRECT(CONCATENATE($B255,\"!M19\"))),\"\",INDIRECT(CONCATENATE($B255,\"!M19\")))","v":""},{"$f":"IF(ISERROR(INDIRECT(CONCATENATE($B255,\"!M20\"))),\"\",INDIRECT(CONCATENATE($B255,\"!M20\")))","v":""},{"$f":"IF(ISERROR(INDIRECT(CONCATENATE($B255,\"!M21\"))),\"\",INDIRECT(CONCATENATE($B255,\"!M21\")))","v":""},null,{"$f":"IF(ISERROR(INDIRECT(CONCATENATE($B255,\"!N18\"))),\"\",INDIRECT(CONCATENATE($B255,\"!N18\")))","v":""},{"$f":"IF(ISERROR(INDIRECT(CONCATENATE($B255,\"!N19\"))),\"\",INDIRECT(CONCATENATE($B255,\"!N19\")))","v":""},{"$f":"IF(ISERROR(INDIRECT(CONCATENATE($B255,\"!N20\"))),\"\",INDIRECT(CONCATENATE($B255,\"!N20\")))","v":""},{"$f":"IF(ISERROR(INDIRECT(CONCATENATE($B255,\"!N21\"))),\"\",INDIRECT(CONCATENATE($B255,\"!N21\")))","v":""},null,{"$f":"IF(ISERROR(INDIRECT(CONCATENATE($B255,\"!O18\"))),\"\",INDIRECT(CONCATENATE($B255,\"!O18\")))","v":""},{"$f":"IF(ISERROR(INDIRECT(CONCATENATE($B255,\"!O19\"))),\"\",INDIRECT(CONCATENATE($B255,\"!O19\")))","v":""},{"$f":"IF(ISERROR(INDIRECT(CONCATENATE($B255,\"!O20\"))),\"\",INDIRECT(CONCATENATE($B255,\"!O20\")))","v":""},{"$f":"IF(ISERROR(INDIRECT(CONCATENATE($B255,\"!O21\"))),\"\",INDIRECT(CONCATENATE($B255,\"!O21\")))","v":""},null,{"$f":"IF(ISERROR(INDIRECT(CONCATENATE($B255,\"!P18\"))),\"\",INDIRECT(CONCATENATE($B255,\"!P18\")))","v":""},{"$f":"IF(ISERROR(INDIRECT(CONCATENATE($B255,\"!P19\"))),\"\",INDIRECT(CONCATENATE($B255,\"!P19\")))","v":""},{"$f":"IF(ISERROR(INDIRECT(CONCATENATE($B255,\"!P20\"))),\"\",INDIRECT(CONCATENATE($B255,\"!P20\")))","v":""},{"$f":"IF(ISERROR(INDIRECT(CONCATENATE($B255,\"!P21\"))),\"\",INDIRECT(CONCATENATE($B255,\"!P21\")))","v":""},null,{"$f":"IF(ISERROR(INDIRECT(CONCATENATE($B255,\"!Q18\"))),\"\",INDIRECT(CONCATENATE($B255,\"!Q18\")))","v":""},{"$f":"IF(ISERROR(INDIRECT(CONCATENATE($B255,\"!Q19\"))),\"\",INDIRECT(CONCATENATE($B255,\"!Q19\")))","v":""},{"$f":"IF(ISERROR(INDIRECT(CONCATENATE($B255,\"!Q20\"))),\"\",INDIRECT(CONCATENATE($B255,\"!Q20\")))","v":""},{"$f":"IF(ISERROR(INDIRECT(CONCATENATE($B255,\"!Q21\"))),\"\",INDIRECT(CONCATENATE($B255,\"!Q1\")))","v":""}]
[null,null,null,null,{"$f":"IF(ISERROR(INDIRECT(CONCATENATE($B256,\"!M18\"))),\"\",INDIRECT(CONCATENATE($B256,\"!M18\")))","v":""},{"$f":"IF(ISERROR(INDIRECT(CONCATENATE($B256,\"!M19\"))),\"\",INDIRECT(CONCATENATE($B256,\"!M19\")))","v":""},{"$f":"IF(ISERROR(INDIRECT(CONCATENATE($B256,\"!M20\"))),\"\",INDIRECT(CONCATENATE($B256,\"!M20\")))","v":""},{"$f":"IF(ISERROR(INDIRECT(CONCATENATE($B256,\"!M21\"))),\"\",INDIRECT(CONCATENATE($B256,\"!M21\")))","v":""},null,{"$f":"IF(ISERROR(INDIRECT(CONCATENATE($B256,\"!N18\"))),\"\",INDIRECT(CONCATENATE($B256,\"!N18\")))","v":""},{"$f":"IF(ISERROR(INDIRECT(CONCATENATE($B256,\"!N19\"))),\"\",INDIRECT(CONCATENATE($B256,\"!N19\")))","v":""},{"$f":"IF(ISERROR(INDIRECT(CONCATENATE($B256,\"!N20\"))),\"\",INDIRECT(CONCATENATE($B256,\"!N20\")))","v":""},{"$f":"IF(ISERROR(INDIRECT(CONCATENATE($B256,\"!N21\"))),\"\",INDIRECT(CONCATENATE($B256,\"!N21\")))","v":""},null,{"$f":"IF(ISERROR(INDIRECT(CONCATENATE($B256,\"!O18\"))),\"\",INDIRECT(CONCATENATE($B256,\"!O18\")))","v":""},{"$f":"IF(ISERROR(INDIRECT(CONCATENATE($B256,\"!O19\"))),\"\",INDIRECT(CONCATENATE($B256,\"!O19\")))","v":""},{"$f":"IF(ISERROR(INDIRECT(CONCATENATE($B256,\"!O20\"))),\"\",INDIRECT(CONCATENATE($B256,\"!O20\")))","v":""},{"$f":"IF(ISERROR(INDIRECT(CONCATENATE($B256,\"!O21\"))),\"\",INDIRECT(CONCATENATE($B256,\"!O21\")))","v":""},null,{"$f":"IF(ISERROR(INDIRECT(CONCATENATE($B256,\"!P18\"))),\"\",INDIRECT(CONCATENATE($B256,\"!P18\")))","v":""},{"$f":"IF(ISERROR(INDIRECT(CONCATENATE($B256,\"!P19\"))),\"\",INDIRECT(CONCATENATE($B256,\"!P19\")))","v":""},{"$f":"IF(ISERROR(INDIRECT(CONCATENATE($B256,\"!P20\"))),\"\",INDIRECT(CONCATENATE($B256,\"!P20\")))","v":""},{"$f":"IF(ISERROR(INDIRECT(CONCATENATE($B256,\"!P21\"))),\"\",INDIRECT(CONCATENATE($B256,\"!P21\")))","v":""},null,{"$f":"IF(ISERROR(INDIRECT(CONCATENATE($B256,\"!Q18\"))),\"\",INDIRECT(CONCATENATE($B256,\"!Q18\")))","v":""},{"$f":"IF(ISERROR(INDIRECT(CONCATENATE($B256,\"!Q19\"))),\"\",INDIRECT(CONCATENATE($B256,\"!Q19\")))","v":""},{"$f":"IF(ISERROR(INDIRECT(CONCATENATE($B256,\"!Q20\"))),\"\",INDIRECT(CONCATENATE($B256,\"!Q20\")))","v":""},{"$f":"IF(ISERROR(INDIRECT(CONCATENATE($B256,\"!Q21\"))),\"\",INDIRECT(CONCATENATE($B256,\"!Q1\")))","v":""}]
[null,null,null,null,{"$f":"IF(ISERROR(INDIRECT(CONCATENATE($B257,\"!M18\"))),\"\",INDIRECT(CONCATENATE($B257,\"!M18\")))","v":""},{"$f":"IF(ISERROR(INDIRECT(CONCATENATE($B257,\"!M19\"))),\"\",INDIRECT(CONCATENATE($B257,\"!M19\")))","v":""},{"$f":"IF(ISERROR(INDIRECT(CONCATENATE($B257,\"!M20\"))),\"\",INDIRECT(CONCATENATE($B257,\"!M20\")))","v":""},{"$f":"IF(ISERROR(INDIRECT(CONCATENATE($B257,\"!M21\"))),\"\",INDIRECT(CONCATENATE($B257,\"!M21\")))","v":""},null,{"$f":"IF(ISERROR(INDIRECT(CONCATENATE($B257,\"!N18\"))),\"\",INDIRECT(CONCATENATE($B257,\"!N18\")))","v":""},{"$f":"IF(ISERROR(INDIRECT(CONCATENATE($B257,\"!N19\"))),\"\",INDIRECT(CONCATENATE($B257,\"!N19\")))","v":""},{"$f":"IF(ISERROR(INDIRECT(CONCATENATE($B257,\"!N20\"))),\"\",INDIRECT(CONCATENATE($B257,\"!N20\")))","v":""},{"$f":"IF(ISERROR(INDIRECT(CONCATENATE($B257,\"!N21\"))),\"\",INDIRECT(CONCATENATE($B257,\"!N21\")))","v":""},null,{"$f":"IF(ISERROR(INDIRECT(CONCATENATE($B257,\"!O18\"))),\"\",INDIRECT(CONCATENATE($B257,\"!O18\")))","v":""},{"$f":"IF(ISERROR(INDIRECT(CONCATENATE($B257,\"!O19\"))),\"\",INDIRECT(CONCATENATE($B257,\"!O19\")))","v":""},{"$f":"IF(ISERROR(INDIRECT(CONCATENATE($B257,\"!O20\"))),\"\",INDIRECT(CONCATENATE($B257,\"!O20\")))","v":""},{"$f":"IF(ISERROR(INDIRECT(CONCATENATE($B257,\"!O21\"))),\"\",INDIRECT(CONCATENATE($B257,\"!O21\")))","v":""},null,{"$f":"IF(ISERROR(INDIRECT(CONCATENATE($B257,\"!P18\"))),\"\",INDIRECT(CONCATENATE($B257,\"!P18\")))","v":""},{"$f":"IF(ISERROR(INDIRECT(CONCATENATE($B257,\"!P19\"))),\"\",INDIRECT(CONCATENATE($B257,\"!P19\")))","v":""},{"$f":"IF(ISERROR(INDIRECT(CONCATENATE($B257,\"!P20\"))),\"\",INDIRECT(CONCATENATE($B257,\"!P20\")))","v":""},{"$f":"IF(ISERROR(INDIRECT(CONCATENATE($B257,\"!P21\"))),\"\",INDIRECT(CONCATENATE($B257,\"!P21\")))","v":""},null,{"$f":"IF(ISERROR(INDIRECT(CONCATENATE($B257,\"!Q18\"))),\"\",INDIRECT(CONCATENATE($B257,\"!Q18\")))","v":""},{"$f":"IF(ISERROR(INDIRECT(CONCATENATE($B257,\"!Q19\"))),\"\",INDIRECT(CONCATENATE($B257,\"!Q19\")))","v":""},{"$f":"IF(ISERROR(INDIRECT(CONCATENATE($B257,\"!Q20\"))),\"\",INDIRECT(CONCATENATE($B257,\"!Q20\")))","v":""},{"$f":"IF(ISERROR(INDIRECT(CONCATENATE($B257,\"!Q21\"))),\"\",INDIRECT(CONCATENATE($B257,\"!Q1\")))","v":""}]
[]
[]
[]
[]
[]
[]
[]
[]
[]
[]
[]
[]
[]
[]
[]
[]
[]
[]
[]
[]
[]
[]
[]
[]
[]
[]
[]
[]
[]
[]
[]
[]
[]
[]
[]
[]
[]
[]
[]
["RURAL",null,null,"Poorest",null,null,null,null,"Poor",null,null,null,null,"Middle",null,null,null,null,"Rich",null,null,null,null,"Richest"]
[null,null,null,"Improved","Basic","Limited","Unimproved","Surface water","Improved","Basic","Limited","Unimproved","Surface water","Improved","Basic","Limited","Unimproved","Surface water","Improved","Basic","Limited","Unimproved","Surface water","Improved","Basic","Limited","Unimproved","Surface water"]
["Forecast period:",null,2000,{"$f":"IF((D301+H301)>100,D301*100/(D301+H301),D301)","v":88.24459105880419},{"$f":"D299*AVERAGEIF(E305:E316,\">0\")/100","v":79.336660421476978},{"$f":"D299*(100-AVERAGEIF(E305:E316,\">0\"))/100","v":8.9079306373272118},{"$f":"100-(E299+F299+H299)","v":6.0149019820275953},{"$f":"IF((D301+H301)>100,H301*100/(D301+H301),H301)","v":5.740506959168215},{"$f":"IF((I301+M301)>100,I301*100/(I301+M301),I301)","v":89.527228413501007},{"$f":"I299*AVERAGEIF(J305:J316,\">0\")/100","v":81.087058191485852},{"$f":"I299*(100-AVERAGEIF(J305:J316,\">0\"))/100","v":8.4401702220151584},{"$f":"100-(J299+K299+M299)","v":5.4323480796335843},{"$f":"IF((I301+M301)>100,M301*100/(I301+M301),M301)","v":5.0404235068654089},{"$f":"IF((N301+R301)>100,N301*100/(N301+R301),N301)","v":94.71720180782836},{"$f":"N299*AVERAGEIF(O305:O316,\">0\")/100","v":92.169338253611528},{"$f":"N299*(100-AVERAGEIF(O305:O316,\">0\"))/100","v":2.5478635542168364},{"$f":"100-(O299+P299+R299)","v":4.3930227430002304},{"$f":"IF((N301+R301)>100,R301*100/(N301+R301),R301)","v":0.8897754491714096},{"$f":"IF((S301+W301)>100,S301*100/(S301+W301),S301)","v":91.727809180696681},{"$f":"S299*AVERAGEIF(T305:T316,\">0\")/100","v":88.848533318529448},{"$f":"S299*(100-AVERAGEIF(T305:T316,\">0\"))/100","v":2.8792758621672312},{"$f":"100-(T299+U299+W299)","v":7.6678368087536342},{"$f":"IF((S301+W301)>100,W301*100/(S301+W301),W301)","v":0.60435401054968452},{"$f":"IF((X301+AB301)>100,X301*100/(X301+AB301),X301)","v":97.784086256001729},{"$f":"X299*AVERAGEIF(Y305:Y316,\">0\")/100","v":96.459656498940419},{"$f":"X299*(100-AVERAGEIF(Y305:Y316,\">0\"))/100","v":1.3244297570613157},{"$f":"100-(Y299+Z299+AB299)","v":1.297660888917278},{"$f":"IF((X301+AB301)>100,AB301*100/(X301+AB301),AB301)","v":0.91825285508099341}]
[null,null,2018,{"$f":"IF((D302+H302)>100,D302*100/(D302+H302),D302)","v":82.709234823532711},{"$f":"D300*AVERAGEIF(E305:E316,\">0\")/100","v":74.360075764214585},{"$f":"D300*(100-AVERAGEIF(E305:E316,\">0\"))/100","v":8.3491590593181186},{"$f":"100-(E300+F300+H300)","v":14.747516336328601},{"$f":"IF((D302+H302)>100,H302*100/(D302+H302),H302)","v":2.5432488401386877},{"$f":"IF((I302+M302)>100,I302*100/(I302+M302),I302)","v":86.462128597749825},{"$f":"I300*AVERAGEIF(J305:J316,\">0\")/100","v":78.310920344633345},{"$f":"I300*(100-AVERAGEIF(J305:J316,\">0\"))/100","v":8.1512082531164758},{"$f":"100-(J300+K300+M300)","v":12.627941986727706},{"$f":"IF((I302+M302)>100,M302*100/(I302+M302),M302)","v":0.90992941552246975},{"$f":"IF((N302+R302)>100,N302*100/(N302+R302),N302)","v":85.947133032028887},{"$f":"N300*AVERAGEIF(O305:O316,\">0\")/100","v":83.635181626559529},{"$f":"N300*(100-AVERAGEIF(O305:O316,\">0\"))/100","v":2.3119514054693453},{"$f":"100-(O300+P300+R300)","v":13.501162876166362},{"$f":"IF((N302+R302)>100,R302*100/(N302+R302),R302)","v":0.55170409180476554},{"$f":"IF((S302+W302)>100,S302*100/(S302+W302),S302)","v":87.028698469883921},{"$f":"S300*AVERAGEIF(T305:T316,\">0\")/100","v":84.296924615713436},{"$f":"S300*(100-AVERAGEIF(T305:T316,\">0\"))/100","v":2.7317738541704899},{"$f":"100-(T300+U300+W300)","v":12.955360531874362},{"$f":"IF((S302+W302)>100,W302*100/(S302+W302),W302)","v":1.5940998241717352E-2},{"$f":"IF((X302+AB302)>100,X302*100/(X302+AB302),X302)","v":89.635985623999886},{"$f":"X300*AVERAGEIF(Y305:Y316,\">0\")/100","v":88.421917249385828},{"$f":"X300*(100-AVERAGEIF(Y305:Y316,\">0\"))/100","v":1.214068374614067},{"$f":"100-(Y300+Z300+AB300)","v":10.28372318518025},{"$f":"IF((X302+AB302)>100,AB302*100/(X302+AB302),AB302)","v":8.0291190819849589E-2}]
["Regression period:",null,{"$f":"MinRegYear(C299,C305:C316)","v":2000},{"$f":"IF(MAX(C305:C316)-MIN(C305:C316)<5,AVERAGEIF(C305:C316,\">0\",D305:D316),\nIF(FORECAST($C301,D$305:D$316,$C$305:$C$316)<0,0,\nIF(FORECAST($C301,D$305:D$316,$C$305:$C$316)>100,100,\nFORECAST($C301,D$305:D$316,$C$305:$C$316))))","v":88.24459105880419},null,null,null,{"$f":"IF(MAX(C305:C316)-MIN(C305:C316)<5,AVERAGEIF(C305:C316,\">0\",H305:H316),\nIF(FORECAST($C301,H$305:H$316,$C$305:$C$316)<0,0,\nIF(FORECAST($C301,H$305:H$316,$C$305:$C$316)>100,100,\nFORECAST($C301,H$305:H$316,$C$305:$C$316))))","v":5.740506959168215},{"$f":"IF(MAX(C305:C316)-MIN(C305:C316)<5,AVERAGEIF(C305:C316,\">0\",I305:I316),\nIF(FORECAST($C301,I$305:I$316,$C$305:$C$316)<0,0,\nIF(FORECAST($C301,I$305:I$316,$C$305:$C$316)>100,100,\nFORECAST($C301,I$305:I$316,$C$305:$C$316))))","v":89.527228413501007},null,null,null,{"$f":"IF(MAX(C305:C316)-MIN(C305:C316)<5,AVERAGEIF(C305:C316,\">0\",M305:M316),\nIF(FORECAST($C301,M$305:M$316,$C$305:$C$316)<0,0,\nIF(FORECAST($C301,M$305:M$316,$C$305:$C$316)>100,100,\nFORECAST($C301,M$305:M$316,$C$305:$C$316))))","v":5.0404235068654089},{"$f":"IF(MAX(C305:C316)-MIN(C305:C316)<5,AVERAGEIF(C305:C316,\">0\",N305:N316),\nIF(FORECAST($C301,N$305:N$316,$C$305:$C$316)<0,0,\nIF(FORECAST($C301,N$305:N$316,$C$305:$C$316)>100,100,\nFORECAST($C301,N$305:N$316,$C$305:$C$316))))","v":94.71720180782836},null,null,null,{"$f":"IF(MAX(C305:C316)-MIN(C305:C316)<5,AVERAGEIF(C305:C316,\">0\",R305:R316),\nIF(FORECAST($C301,R$305:R$316,$C$305:$C$316)<0,0,\nIF(FORECAST($C301,R$305:R$316,$C$305:$C$316)>100,100,\nFORECAST($C301,R$305:R$316,$C$305:$C$316))))","v":0.8897754491714096},{"$f":"IF(MAX(C305:C316)-MIN(C305:C316)<5,AVERAGEIF(C305:C316,\">0\",S305:S316),\nIF(FORECAST($C301,S$305:S$316,$C$305:$C$316)<0,0,\nIF(FORECAST($C301,S$305:S$316,$C$305:$C$316)>100,100,\nFORECAST($C301,S$305:S$316,$C$305:$C$316))))","v":91.727809180696681},null,null,null,{"$f":"IF(MAX(C305:C316)-MIN(C305:C316)<5,AVERAGEIF(C305:C316,\">0\",W305:W316),\nIF(FORECAST($C301,W$305:W$316,$C$305:$C$316)<0,0,\nIF(FORECAST($C301,W$305:W$316,$C$305:$C$316)>100,100,\nFORECAST($C301,W$305:W$316,$C$305:$C$316))))","v":0.60435401054968452},{"$f":"IF(MAX(C305:C316)-MIN(C305:C316)<5,AVERAGEIF(C305:C316,\">0\",X305:X316),\nIF(FORECAST($C301,X$305:X$316,$C$305:$C$316)<0,0,\nIF(FORECAST($C301,X$305:X$316,$C$305:$C$316)>100,100,\nFORECAST($C301,X$305:X$316,$C$305:$C$316))))","v":97.784086256001729},null,null,null,{"$f":"IF(MAX(C305:C316)-MIN(C305:C316)<5,AVERAGEIF(C305:C316,\">0\",AB305:AB316),\nIF(FORECAST($C301,AB$305:AB$316,$C$305:$C$316)<0,0,\nIF(FORECAST($C301,AB$305:AB$316,$C$305:$C$316)>100,100,\nFORECAST($C301,AB$305:AB$316,$C$305:$C$316))))","v":0.91825285508099341}]
[null,null,{"$f":"MaxRegYear(C300,C305:C316)","v":2014},{"$f":"IF(MAX(C305:C316)-MIN(C305:C316)<5,AVERAGEIF(C305:C316,\">0\",D305:D316),\nIF(FORECAST($C302,D$305:D$316,$C$305:$C$316)<0,0,\nIF(FORECAST($C302,D$305:D$316,$C$305:$C$316)>100,100,\nFORECAST($C302,D$305:D$316,$C$305:$C$316))))","v":82.709234823532711},null,null,null,{"$f":"IF(MAX(C305:C316)-MIN(C305:C316)<5,AVERAGEIF(C305:C316,\">0\",H305:H316),\nIF(FORECAST($C302,H$305:H$316,$C$305:$C$316)<0,0,\nIF(FORECAST($C302,H$305:H$316,$C$305:$C$316)>100,100,\nFORECAST($C302,H$305:H$316,$C$305:$C$316))))","v":2.5432488401386877},{"$f":"IF(MAX(C305:C316)-MIN(C305:C316)<5,AVERAGEIF(C305:C316,\">0\",I305:I316),\nIF(FORECAST($C302,I$305:I$316,$C$305:$C$316)<0,0,\nIF(FORECAST($C302,I$305:I$316,$C$305:$C$316)>100,100,\nFORECAST($C302,I$305:I$316,$C$305:$C$316))))","v":86.462128597749825},null,null,null,{"$f":"IF(MAX(C305:C316)-MIN(C305:C316)<5,AVERAGEIF(C305:C316,\">0\",M305:M316),\nIF(FORECAST($C302,M$305:M$316,$C$305:$C$316)<0,0,\nIF(FORECAST($C302,M$305:M$316,$C$305:$C$316)>100,100,\nFORECAST($C302,M$305:M$316,$C$305:$C$316))))","v":0.90992941552246975},{"$f":"IF(MAX(C305:C316)-MIN(C305:C316)<5,AVERAGEIF(C305:C316,\">0\",N305:N316),\nIF(FORECAST($C302,N$305:N$316,$C$305:$C$316)<0,0,\nIF(FORECAST($C302,N$305:N$316,$C$305:$C$316)>100,100,\nFORECAST($C302,N$305:N$316,$C$305:$C$316))))","v":85.947133032028887},null,null,null,{"$f":"IF(MAX(C305:C316)-MIN(C305:C316)<5,AVERAGEIF(C305:C316,\">0\",R305:R316),\nIF(FORECAST($C302,R$305:R$316,$C$305:$C$316)<0,0,\nIF(FORECAST($C302,R$305:R$316,$C$305:$C$316)>100,100,\nFORECAST($C302,R$305:R$316,$C$305:$C$316))))","v":0.55170409180476554},{"$f":"IF(MAX(C305:C316)-MIN(C305:C316)<5,AVERAGEIF(C305:C316,\">0\",S305:S316),\nIF(FORECAST($C302,S$305:S$316,$C$305:$C$316)<0,0,\nIF(FORECAST($C302,S$305:S$316,$C$305:$C$316)>100,100,\nFORECAST($C302,S$305:S$316,$C$305:$C$316))))","v":87.028698469883921},null,null,null,{"$f":"IF(MAX(C305:C316)-MIN(C305:C316)<5,AVERAGEIF(C305:C316,\">0\",W305:W316),\nIF(FORECAST($C302,W$305:W$316,$C$305:$C$316)<0,0,\nIF(FORECAST($C302,W$305:W$316,$C$305:$C$316)>100,100,\nFORECAST($C302,W$305:W$316,$C$305:$C$316))))","v":1.5940998241717352E-2},{"$f":"IF(MAX(C305:C316)-MIN(C305:C316)<5,AVERAGEIF(C305:C316,\">0\",X305:X316),\nIF(FORECAST($C302,X$305:X$316,$C$305:$C$316)<0,0,\nIF(FORECAST($C302,X$305:X$316,$C$305:$C$316)>100,100,\nFORECAST($C302,X$305:X$316,$C$305:$C$316))))","v":89.635985623999886},null,null,null,{"$f":"IF(MAX(C305:C316)-MIN(C305:C316)<5,AVERAGEIF(C305:C316,\">0\",AB305:AB316),\nIF(FORECAST($C302,AB$305:AB$316,$C$305:$C$316)<0,0,\nIF(FORECAST($C302,AB$305:AB$316,$C$305:$C$316)>100,100,\nFORECAST($C302,AB$305:AB$316,$C$305:$C$316))))","v":8.0291190819849589E-2}]
[]
[null,"Survey","Year","Improved","% Improved\n< = 30min",null,null,"Surface water","Improved","% Improved\n< = 30min",null,null,"Surface water","Improved","% Improved\n< = 30min",null,null,"Surface water","Improved","% Improved\n< = 30min",null,null,"Surface water","Improved","% Improved\n< = 30min",null,null,"Surface water"]
[null,"MICS00",2000,{"$f":"IF(ISERROR(INDIRECT(CONCATENATE($B305,\"!M16\"))),\"\",INDIRECT(CONCATENATE($B305,\"!M16\")))","v":88.244591058804161},{"$f":"IF(ISERROR(INDIRECT(CONCATENATE($B305,\"!M23\"))),\"\",INDIRECT(CONCATENATE($B305,\"!M23\")))","v":93.177868475610381},null,null,{"$f":"IF(ISERROR(INDIRECT(CONCATENATE($B305,\"!M21\"))),\"\",INDIRECT(CONCATENATE($B305,\"!M21\")))","v":5.7405069591681883},{"$f":"IF(ISERROR(INDIRECT(CONCATENATE($B305,\"!N16\"))),\"\",INDIRECT(CONCATENATE($B305,\"!N16\")))","v":89.527228413501021},{"$f":"IF(ISERROR(INDIRECT(CONCATENATE($B305,\"!N23\"))),\"\",INDIRECT(CONCATENATE($B305,\"!N23\")))","v":94.215829844398357},null,null,{"$f":"IF(ISERROR(INDIRECT(CONCATENATE($B305,\"!N21\"))),\"\",INDIRECT(CONCATENATE($B305,\"!N21\")))","v":5.0404235068653849},{"$f":"IF(ISERROR(INDIRECT(CONCATENATE($B305,\"!O16\"))),\"\",INDIRECT(CONCATENATE($B305,\"!O16\")))","v":94.717201807828218},{"$f":"IF(ISERROR(INDIRECT(CONCATENATE($B305,\"!O23\"))),\"\",INDIRECT(CONCATENATE($B305,\"!O23\")))","v":96.850812037489177},null,null,{"$f":"IF(ISERROR(INDIRECT(CONCATENATE($B305,\"!O21\"))),\"\",INDIRECT(CONCATENATE($B305,\"!O21\")))","v":0.88977544917140594},{"$f":"IF(ISERROR(INDIRECT(CONCATENATE($B305,\"!P16\"))),\"\",INDIRECT(CONCATENATE($B305,\"!P16\")))","v":91.727809180696624},{"$f":"IF(ISERROR(INDIRECT(CONCATENATE($B305,\"!P23\"))),\"\",INDIRECT(CONCATENATE($B305,\"!P23\")))","v":95.267435084977691},null,null,{"$f":"IF(ISERROR(INDIRECT(CONCATENATE($B305,\"!P21\"))),\"\",INDIRECT(CONCATENATE($B305,\"!P21\")))","v":0.60435401054968574},{"$f":"IF(ISERROR(INDIRECT(CONCATENATE($B305,\"!Q16\"))),\"\",INDIRECT(CONCATENATE($B305,\"!Q16\")))","v":97.784086256001601},{"$f":"IF(ISERROR(INDIRECT(CONCATENATE($B305,\"!Q23\"))),\"\",INDIRECT(CONCATENATE($B305,\"!Q23\")))","v":99.303043830233463},null,null,{"$f":"IF(ISERROR(INDIRECT(CONCATENATE($B305,\"!Q221\"))),\"\",INDIRECT(CONCATENATE($B305,\"!Q21\")))","v":0.91825285508098231}]
[null,"WHS03",null,68.457596334591429,95.538358217339521,null,null,0,63.967915630714657,88.401701107082488,null,null,0,64.832544224820111,97.579280367311142,null,null,0,77.906522094812772,97.715761370215205,null,null,0,83.31395143701873,98.733627029704024,null,null,0]
[null,"DHS12",2012,83.5,81,null,null,3,86.9,89.1,null,null,1.5,87.2,97.5,null,null,0.6,87.7,97.6,null,null,0.1,90.8,97.9,null,null,0.2]
[null,null,null,"","",null,null,"","","",null,null,"","","",null,null,"","","",null,null,"","","",null,null,""]
[null,null,null,"","",null,null,"","","",null,null,"","","",null,null,"","","",null,null,"","","",null,null,""]
[null,null,null,"","",null,null,"","","",null,null,"","","",null,null,"","","",null,null,"","","",null,null,""]
[null,null,null,"","",null,null,"","","",null,null,"","","",null,null,"","","",null,null,"","","",null,null,""]
[null,null,null,"","",null,null,"","","",null,null,"","","",null,null,"","","",null,null,"","","",null,null,""]
[null,null,null,"","",null,null,"","","",null,null,"","","",null,null,"","","",null,null,"","","",null,null,""]
[null,null,null,"","",null,null,"","","",null,null,"","","",null,null,"","","",null,null,"","","",null,null,""]
[null,null,null,"","",null,null,"","","",null,null,"","","",null,null,"","","",null,null,"","","",null,null,""]
[null,null,null,"","",null,null,"","","",null,null,"","","",null,null,"","","",null,null,"","","",null,null,""]
[]
[null,{"$f":"CONCATENATE(\"Rural use of drinking water sources, \",C299,\"–\",C300)","v":"Rural use of drinking water sources, 2000–2018"},null,null,null,null,null,null,null,null,null,null,null,null,null,null,null,null,"Data points used for regression"]

{"sheet":"Sanitation","index":2,"n_rows":318,"n_cols":28,"rows_kept":318,"cut":false,"hidden":false,"merged":[[30,21,30,24],[4,1,4,24],[3,1,3,24],[6,1,6,8],[6,9,6,16],[6,17,6,24],[30,1,31,4],[30,5,30,8],[30,9,30,12],[30,13,30,16],[30,17,30,20],[96,23,96,27],[32,1,33,2],[32,3,33,3],[35,1,36,2],[35,3,36,3],[38,1,39,2],[38,3,39,3],[96,0,97,2],[96,3,96,7],[96,8,96,12],[96,13,96,17],[96,18,96,22],[98,0,99,1],[100,0,101,1],[117,18,117,22],[196,0,197,2],[196,3,196,7],[196,8,196,12],[196,13,196,17],[196,18,196,22],[117,1,117,11],[298,0,299,1],[300,0,301,1],[317,18,317,22],[196,23,196,27],[198,0,199,1],[200,0,201,1],[217,18,217,22],[296,0,297,2],[296,3,296,7],[296,8,296,12],[296,13,296,17],[296,18,296,22],[296,23,296,27],[217,1,217,11],[317,1,317,11]]}
[]
[]
[]
[null,"Summary of trends in use of sanitation facilities by wealth quintile (%)"]
[null,{"$f":"IF(ISERROR(INDIRECT(CONCATENATE($B105,\"!A2\"))),\"\",INDIRECT(CONCATENATE($B105,\"!A2\")))","v":"Comoros"}]
[]
[null,{"$f":"B118","v":"National use of sanitation facilities, 2000–2018"},null,null,null,null,null,null,null,{"$f":"B218","v":"Urban use of sanitation facilities, 2000–2018"},null,null,null,null,null,null,null,{"$f":"B318","v":"Rural use of sanitation facilities, 2000–2018"}]
[]
[]
[]
[]
[]
[]
[]
[]
[]
[]
[]
[]
[]
[]
[]
[]
[]
[]
[]
[]
[]
[]
[]
[null,{"$f":"IF(ISERROR(INDIRECT(CONCATENATE($B105,\"!A2\"))),\"\",INDIRECT(CONCATENATE($B105,\"!A2\")))","v":"Comoros"},null,null,null,"Poorest",null,null,null,"Poor",null,null,null,"Middle",null,null,null,"Rich",null,null,null,"Richest"]
[null,null,null,null,null,"Basic","Limited","Unimproved","Open defecation","Basic","Limited","Unimproved","Open defecation","Basic","Limited","Unimproved","Open defecation","Basic","Limited","Unimproved","Open defecation","Basic","Limited","Unimproved","Open defecation"]
[null,"NATIONAL",null,"Estimate",{"$f":"C99","v":2000},{"$f":"E99","v":2.8025969116551024},{"$f":"F99","v":0.78776703210051724},95.436510758954668,0.97312529728971242,{"$f":"J99","v":10.005938114778091},{"$f":"K99","v":2.8283142098302232},86.838511429399261,0.32723624599242385,{"$f":"O99","v":20.824229329774081},{"$f":"P99","v":4.580703017783553},74.539935501792414,5.513215064995336E-2,{"$f":"T99","v":33.462953710724484},{"$f":"U99","v":6.3281226678744424},60.01106532644561,0.19785829495545926,{"$f":"Y99","v":60.958956204835552},{"$f":"Z99","v":5.8652900503317316},32.88489328130315,0.29086046352956885]
[null,null,null,null,{"$f":"C100","v":2018},{"$f":"E100","v":29.156845820260923},8.1955424277103255,62.124018923605846,0.52359282842290611,{"$f":"J100","v":24.643282768679995},6.9657583359006878,68.018898510793889,0.37206038462542068,{"$f":"O100","v":25.44936555895902},5.5980936326859556,68.147606464090359,0.80493434426466592,{"$f":"T100","v":33.558280910372233},6.3461498336222943,59.656283172722979,0.43928608328249652,{"$f":"Y100","v":54.144818077322604},5.2096538805359414,40.645528042141457,0]
[]
[null,"URBAN",null,"Estimate",{"$f":"C199","v":2000},{"$f":"E199","v":4.6776363991174454},{"$f":"F199","v":1.4850204762598065},93.217406462823732,0.61993666179900941,{"$f":"J199","v":26.529596246339612},{"$f":"K199","v":5.9797836180126289},67.49062013564776,0,{"$f":"O199","v":33.464657168698658},{"$f":"P199","v":6.9318556896701899},58.845201722471785,0.75828541915936398,{"$f":"T199","v":49.096323069815362},{"$f":"U199","v":9.0665752718805894},41.83710165830405,0,{"$f":"Y199","v":78.354080712234037},{"$f":"Z199","v":7.5420273215813483},14.103891966184619,0]
[null,null,null,null,{"$f":"C200","v":2018},{"$f":"E200","v":30.716519631408396},9.7516473534976242,59.15448764090786,0.37734537418612035,{"$f":"J200","v":33.8968604027434},7.6403684645729451,57.320373844181375,1.1423972885022806,{"$f":"O200","v":42.015411679458175},8.7030555560719964,49.23697416385312,4.4558600616710464E-2,{"$f":"T200","v":54.971135130787836},10.151471704617855,34.715835419989659,0.16155774460465366,{"$f":"Y200","v":67.879761853211022},6.5338143696633031,25.512173529023187,7.4250248102490701E-2]
[]
[null,"RURAL",null,"Estimate",{"$f":"C299","v":2000},{"$f":"E299","v":2.6664147168324854},{"$f":"F299","v":0.73717708204788512},95.350778521227582,1.2456296798920476,{"$f":"J299","v":6.5293562703596413},{"$f":"K299","v":2.0765525614482967},91.167668253027244,0.22642291516481805,{"$f":"O299","v":15.798607139323719},{"$f":"P299","v":2.7741133910880236},81.349669470191316,7.7609999396949902E-2,{"$f":"T299","v":27.667184390392208},{"$f":"U299","v":6.2444134123627464},66.088402197245045,0,{"$f":"Y299","v":52.409273358911996},{"$f":"Z299","v":3.4752182264622347},43.662387807945372,0.45312060668040033]
[null,null,null,null,{"$f":"C300","v":2018},{"$f":"E300","v":27.685097079302761},7.6540303173007862,64.095040425397656,0.56583217799880003,{"$f":"J300","v":24.974677744142664},7.9427785670651812,66.487395980726532,0.59514770806562467,{"$f":"O300","v":21.965885561457153},3.8570398482453681,74.039621974436145,0.1374526158613314,{"$f":"T300","v":23.75322165831739},5.361041941135511,70.038443963608017,0.84729243693908529,{"$f":"Y300","v":38.780740938869535},2.5715208227276856,58.508900865713713,0.13883737268906771]
[]
[]
[]
[]
[]
[]
[]
[]
[]
[]
[]
[]
[]
[]
[]
[]
[]
[]
[]
[]
[]
[]
[]
[]
[]
[]
[]
[]
[]
[]
[]
[]
[]
[]
[]
[]
[]
[]
[]
[]
[]
[]
[]
[]
[]
[]
[]
[]
[]
[]
[]
[]
[]
[]
[]
[]
["NATIONAL",null,null,"Poorest",null,null,null,null,"Poor",null,null,null,null,"Middle",null,null,null,null,"Rich",null,null,null,null,"Richest"]
[null,null,null,"Improved","Basic","Limited","Unimproved","Open defecation","Improved","Basic","Limited","Unimproved","Open defecation","Improved","Basic","Limited","Unimproved","Open defecation","Improved","Basic","Limited","Unimproved","Open defecation","Improved","Basic","Limited","Unimproved","Open defecation"]
["Forecast period:",null,2000,{"$f":"IF((D101+H101)>100,D101*100/(D101+H101),D101)","v":3.5903639437556194},{"$f":"D99*AVERAGEIF(E105:E116,\">0\")/100","v":2.8025969116551024},{"$f":"D99*(100-AVERAGEIF(E105:E116,\">0\"))/100","v":0.78776703210051724},{"$f":"100-(E99+F99+H99)","v":95.436510758954668},{"$f":"IF((D101+H101)>100,H101*100/(D101+H101),H101)","v":0.97312529728971242},{"$f":"IF((I101+M101)>100,I101*100/(I101+M101),I101)","v":12.834252324608315},{"$f":"I99*AVERAGEIF(J105:J116,\">0\")/100","v":10.005938114778091},{"$f":"I99*(100-AVERAGEIF(J105:J116,\">0\"))/100","v":2.8283142098302232},{"$f":"100-(J99+K99+M99)","v":86.838511429399261},{"$f":"IF((I101+M101)>100,M101*100/(I101+M101),M101)","v":0.32723624599242385},{"$f":"IF((N101+R101)>100,N101*100/(N101+R101),N101)","v":25.404932347557633},{"$f":"N99*AVERAGEIF(O105:O116,\">0\")/100","v":20.824229329774081},{"$f":"N99*(100-AVERAGEIF(O105:O116,\">0\"))/100","v":4.580703017783553},{"$f":"100-(O99+P99+R99)","v":74.539935501792414},{"$f":"IF((N101+R101)>100,R101*100/(N101+R101),R101)","v":5.513215064995336E-2},{"$f":"IF((S101+W101)>100,S101*100/(S101+W101),S101)","v":39.79107637859893},{"$f":"S99*AVERAGEIF(T105:T116,\">0\")/100","v":33.462953710724484},{"$f":"S99*(100-AVERAGEIF(T105:T116,\">0\"))/100","v":6.3281226678744424},{"$f":"100-(T99+U99+W99)","v":60.01106532644561},{"$f":"IF((S101+W101)>100,W101*100/(S101+W101),W101)","v":0.19785829495545926},{"$f":"IF((X101+AB101)>100,X101*100/(X101+AB101),X101)","v":66.824246255167282},{"$f":"X99*AVERAGEIF(Y105:Y116,\">0\")/100","v":60.958956204835552},{"$f":"X99*(100-AVERAGEIF(Y105:Y116,\">0\"))/100","v":5.8652900503317316},{"$f":"100-(Y99+Z99+AB99)","v":32.88489328130315},{"$f":"IF((X101+AB101)>100,AB101*100/(X101+AB101),AB101)","v":0.29086046352956885}]
[null,null,2018,{"$f":"IF((D102+H102)>100,D102*100/(D102+H102),D102)","v":37.352388247971248},{"$f":"D100*AVERAGEIF(E105:E116,\">0\")/100","v":29.156845820260923},{"$f":"D100*(100-AVERAGEIF(E105:E116,\">0\"))/100","v":8.1955424277103255},{"$f":"100-(E100+F100+H100)","v":62.124018923605846},{"$f":"IF((D102+H102)>100,H102*100/(D102+H102),H102)","v":0.52359282842290611},{"$f":"IF((I102+M102)>100,I102*100/(I102+M102),I102)","v":31.609041104580683},{"$f":"I100*AVERAGEIF(J105:J116,\">0\")/100","v":24.643282768679995},{"$f":"I100*(100-AVERAGEIF(J105:J116,\">0\"))/100","v":6.9657583359006878},{"$f":"100-(J100+K100+M100)","v":68.018898510793889},{"$f":"IF((I102+M102)>100,M102*100/(I102+M102),M102)","v":0.37206038462542068},{"$f":"IF((N102+R102)>100,N102*100/(N102+R102),N102)","v":31.047459191644975},{"$f":"N100*AVERAGEIF(O105:O116,\">0\")/100","v":25.44936555895902},{"$f":"N100*(100-AVERAGEIF(O105:O116,\">0\"))/100","v":5.5980936326859556},{"$f":"100-(O100+P100+R100)","v":68.147606464090359},{"$f":"IF((N102+R102)>100,R102*100/(N102+R102),R102)","v":0.80493434426466592},{"$f":"IF((S102+W102)>100,S102*100/(S102+W102),S102)","v":39.904430743994524},{"$f":"S100*AVERAGEIF(T105:T116,\">0\")/100","v":33.558280910372233},{"$f":"S100*(100-AVERAGEIF(T105:T116,\">0\"))/100","v":6.3461498336222943},{"$f":"100-(T100+U100+W100)","v":59.656283172722979},{"$f":"IF((S102+W102)>100,W102*100/(S102+W102),W102)","v":0.43928608328249652},{"$f":"IF((X102+AB102)>100,X102*100/(X102+AB102),X102)","v":59.35447195785855},{"$f":"X100*AVERAGEIF(Y105:Y116,\">0\")/100","v":54.144818077322604},{"$f":"X100*(100-AVERAGEIF(Y105:Y116,\">0\"))/100","v":5.2096538805359414},{"$f":"100-(Y100+Z100+AB100)","v":40.645528042141457},{"$f":"IF((X102+AB102)>100,AB102*100/(X102+AB102),AB102)","v":0}]
["Regression period:",null,{"$f":"MinRegYear(C99,C105:C116)","v":2000},{"$f":"IF(MAX(C105:C116)-MIN(C105:C116)<5,AVERAGEIF(C105:C116,\">0\",D105:D116),\nIF(FORECAST($C101,D$105:D$116,$C$105:$C$116)<0,0,\nIF(FORECAST($C101,D$105:D$116,$C$105:$C$116)>100,100,\nFORECAST($C101,D$105:D$116,$C$105:$C$116))))","v":3.5903639437556194},null,null,null,{"$f":"IF(MAX(C105:C116)-MIN(C105:C116)<5,AVERAGEIF(C105:C116,\">0\",H105:H116),\nIF(FORECAST($C101,H$105:H$116,$C$105:$C$116)<0,0,\nIF(FORECAST($C101,H$105:H$116,$C$105:$C$116)>100,100,\nFORECAST($C101,H$105:H$116,$C$105:$C$116))))","v":0.97312529728971242},{"$f":"IF(MAX(C105:C116)-MIN(C105:C116)<5,AVERAGEIF(C105:C116,\">0\",I105:I116),\nIF(FORECAST($C101,I$105:I$116,$C$105:$C$116)<0,0,\nIF(FORECAST($C101,I$105:I$116,$C$105:$C$116)>100,100,\nFORECAST($C101,I$105:I$116,$C$105:$C$116))))","v":12.834252324608315},null,null,null,{"$f":"IF(MAX(C105:C116)-MIN(C105:C116)<5,AVERAGEIF(C105:C116,\">0\",M105:M116),\nIF(FORECAST($C101,M$105:M$116,$C$105:$C$116)<0,0,\nIF(FORECAST($C101,M$105:M$116,$C$105:$C$116)>100,100,\nFORECAST($C101,M$105:M$116,$C$105:$C$116))))","v":0.32723624599242385},{"$f":"IF(MAX(C105:C116)-MIN(C105:C116)<5,AVERAGEIF(C105:C116,\">0\",N105:N116),\nIF(FORECAST($C101,N$105:N$116,$C$105:$C$116)<0,0,\nIF(FORECAST($C101,N$105:N$116,$C$105:$C$116)>100,100,\nFORECAST($C101,N$105:N$116,$C$105:$C$116))))","v":25.404932347557633},null,null,null,{"$f":"IF(MAX(C105:C116)-MIN(C105:C116)<5,AVERAGEIF(C105:C116,\">0\",R105:R116),\nIF(FORECAST($C101,R$105:R$116,$C$105:$C$116)<0,0,\nIF(FORECAST($C101,R$105:R$116,$C$105:$C$116)>100,100,\nFORECAST($C101,R$105:R$116,$C$105:$C$116))))","v":5.513215064995336E-2},{"$f":"IF(MAX(C105:C116)-MIN(C105:C116)<5,AVERAGEIF(C105:C116,\">0\",S105:S116),\nIF(FORECAST($C101,S$105:S$116,$C$105:$C$116)<0,0,\nIF(FORECAST($C101,S$105:S$116,$C$105:$C$116)>100,100,\nFORECAST($C101,S$105:S$116,$C$105:$C$116))))","v":39.79107637859893},null,null,null,{"$f":"IF(MAX(C105:C116)-MIN(C105:C116)<5,AVERAGEIF(C105:C116,\">0\",W105:W116),\nIF(FORECAST($C101,W$105:W$116,$C$105:$C$116)<0,0,\nIF(FORECAST($C101,W$105:W$116,$C$105:$C$116)>100,100,\nFORECAST($C101,W$105:W$116,$C$105:$C$116))))","v":0.19785829495545926},{"$f":"IF(MAX(C105:C116)-MIN(C105:C116)<5,AVERAGEIF(C105:C116,\">0\",X105:X116),\nIF(FORECAST($C101,X$105:X$116,$C$105:$C$116)<0,0,\nIF(FORECAST($C101,X$105:X$116,$C$105:$C$116)>100,100,\nFORECAST($C101,X$105:X$116,$C$105:$C$116))))","v":66.824246255167282},null,null,null,{"$f":"IF(MAX(C105:C116)-MIN(C105:C116)<5,AVERAGEIF(C105:C116,\">0\",AB105:AB116),\nIF(FORECAST($C101,AB$105:AB$116,$C$105:$C$116)<0,0,\nIF(FORECAST($C101,AB$105:AB$116,$C$105:$C$116)>100,100,\nFORECAST($C101,AB$105:AB$116,$C$105:$C$116))))","v":0.29086046352956885}]
[null,null,{"$f":"MaxRegYear(C100,C105:C116)","v":2014},{"$f":"IF(MAX(C105:C116)-MIN(C105:C116)<5,AVERAGEIF(C105:C116,\">0\",D105:D116),\nIF(FORECAST($C102,D$105:D$116,$C$105:$C$116)<0,0,\nIF(FORECAST($C102,D$105:D$116,$C$105:$C$116)>100,100,\nFORECAST($C102,D$105:D$116,$C$105:$C$116))))","v":37.352388247971248},null,null,null,{"$f":"IF(MAX(C105:C116)-MIN(C105:C116)<5,AVERAGEIF(C105:C116,\">0\",H105:H116),\nIF(FORECAST($C102,H$105:H$116,$C$105:$C$116)<0,0,\nIF(FORECAST($C102,H$105:H$116,$C$105:$C$116)>100,100,\nFORECAST($C102,H$105:H$116,$C$105:$C$116))))","v":0.52359282842290611},{"$f":"IF(MAX(C105:C116)-MIN(C105:C116)<5,AVERAGEIF(C105:C116,\">0\",I105:I116),\nIF(FORECAST($C102,I$105:I$116,$C$105:$C$116)<0,0,\nIF(FORECAST($C102,I$105:I$116,$C$105:$C$116)>100,100,\nFORECAST($C102,I$105:I$116,$C$105:$C$116))))","v":31.609041104580683},null,null,null,{"$f":"IF(MAX(C105:C116)-MIN(C105:C116)<5,AVERAGEIF(C105:C116,\">0\",M105:M116),\nIF(FORECAST($C102,M$105:M$116,$C$105:$C$116)<0,0,\nIF(FORECAST($C102,M$105:M$116,$C$105:$C$116)>100,100,\nFORECAST($C102,M$105:M$116,$C$105:$C$116))))","v":0.37206038462542068},{"$f":"IF(MAX(C105:C116)-MIN(C105:C116)<5,AVERAGEIF(C105:C116,\">0\",N105:N116),\nIF(FORECAST($C102,N$105:N$116,$C$105:$C$116)<0,0,\nIF(FORECAST($C102,N$105:N$116,$C$105:$C$116)>100,100,\nFORECAST($C102,N$105:N$116,$C$105:$C$116))))","v":31.047459191644975},null,null,null,{"$f":"IF(MAX(C105:C116)-MIN(C105:C116)<5,AVERAGEIF(C105:C116,\">0\",R105:R116),\nIF(FORECAST($C102,R$105:R$116,$C$105:$C$116)<0,0,\nIF(FORECAST($C102,R$105:R$116,$C$105:$C$116)>100,100,\nFORECAST($C102,R$105:R$116,$C$105:$C$116))))","v":0.80493434426466592},{"$f":"IF(MAX(C105:C116)-MIN(C105:C116)<5,AVERAGEIF(C105:C116,\">0\",S105:S116),\nIF(FORECAST($C102,S$105:S$116,$C$105:$C$116)<0,0,\nIF(FORECAST($C102,S$105:S$116,$C$105:$C$116)>100,100,\nFORECAST($C102,S$105:S$116,$C$105:$C$116))))","v":39.904430743994524},null,null,null,{"$f":"IF(MAX(C105:C116)-MIN(C105:C116)<5,AVERAGEIF(C105:C116,\">0\",W105:W116),\nIF(FORECAST($C102,W$105:W$116,$C$105:$C$116)<0,0,\nIF(FORECAST($C102,W$105:W$116,$C$105:$C$116)>100,100,\nFORECAST($C102,W$105:W$116,$C$105:$C$116))))","v":0.43928608328249652},{"$f":"IF(MAX(C105:C116)-MIN(C105:C116)<5,AVERAGEIF(C105:C116,\">0\",X105:X116),\nIF(FORECAST($C102,X$105:X$116,$C$105:$C$116)<0,0,\nIF(FORECAST($C102,X$105:X$116,$C$105:$C$116)>100,100,\nFORECAST($C102,X$105:X$116,$C$105:$C$116))))","v":59.35447195785855},null,null,null,{"$f":"IF(MAX(C105:C116)-MIN(C105:C116)<5,AVERAGEIF(C105:C116,\">0\",AB105:AB116),\nIF(FORECAST($C102,AB$105:AB$116,$C$105:$C$116)<0,0,\nIF(FORECAST($C102,AB$105:AB$116,$C$105:$C$116)>100,100,\nFORECAST($C102,AB$105:AB$116,$C$105:$C$116))))","v":0}]
[]
[null,"Survey","Year","Improved","Not shared",null,null,"Open defecation","Improved","Not shared",null,null,"Open defecation","Improved","Not shared",null,null,"Open defecation","Improved","Not shared",null,null,"Open defecation","Improved","Not shared",null,null,"Open defecation"]
[null,"MICS00",2000,{"$f":"IF(ISERROR(INDIRECT(CONCATENATE($B105,\"!C122\"))),\"\",INDIRECT(CONCATENATE($B105,\"!C122\")))","v":6.1025540122145161},{"$f":"IF(ISERROR(INDIRECT(CONCATENATE($B105,\"!C129\"))),\"\",INDIRECT(CONCATENATE($B105,\"!C129\")))","v":"N/a"},null,null,{"$f":"IF(ISERROR(INDIRECT(CONCATENATE($B105,\"!C127\"))),\"\",INDIRECT(CONCATENATE($B105,\"!C127\")))","v":1.6307229806177042},{"$f":"IF(ISERROR(INDIRECT(CONCATENATE($B105,\"!D122\"))),\"\",INDIRECT(CONCATENATE($B105,\"!D122\")))","v":13.648393508642403},{"$f":"IF(ISERROR(INDIRECT(CONCATENATE($B105,\"!D129\"))),\"\",INDIRECT(CONCATENATE($B105,\"!D129\")))","v":"N/a"},null,null,{"$f":"IF(ISERROR(INDIRECT(CONCATENATE($B105,\"!D127\"))),\"\",INDIRECT(CONCATENATE($B105,\"!D127\")))","v":0.57986730990990165},{"$f":"IF(ISERROR(INDIRECT(CONCATENATE($B105,\"!E122\"))),\"\",INDIRECT(CONCATENATE($B105,\"!E122\")))","v":24.637577517067889},{"$f":"IF(ISERROR(INDIRECT(CONCATENATE($B105,\"!E129\"))),\"\",INDIRECT(CONCATENATE($B105,\"!E129\")))","v":"N/a"},null,null,{"$f":"IF(ISERROR(INDIRECT(CONCATENATE($B105,\"!E127\"))),\"\",INDIRECT(CONCATENATE($B105,\"!E127\")))","v":0.21698518761122115},{"$f":"IF(ISERROR(INDIRECT(CONCATENATE($B105,\"!F122\"))),\"\",INDIRECT(CONCATENATE($B105,\"!F122\")))","v":39.105448075847924},{"$f":"IF(ISERROR(INDIRECT(CONCATENATE($B105,\"!F129\"))),\"\",INDIRECT(CONCATENATE($B105,\"!F129\")))","v":"N/a"},null,null,{"$f":"IF(ISERROR(INDIRECT(CONCATENATE($B105,\"!F127\"))),\"\",INDIRECT(CONCATENATE($B105,\"!F127\")))","v":0.3850529107246034},{"$f":"IF(ISERROR(INDIRECT(CONCATENATE($B105,\"!G122\"))),\"\",INDIRECT(CONCATENATE($B105,\"!G122\")))","v":63.776679554962712},{"$f":"IF(ISERROR(INDIRECT(CONCATENATE($B105,\"!G129\"))),\"\",INDIRECT(CONCATENATE($B105,\"!G129\")))","v":"N/a"},null,null,{"$f":"IF(ISERROR(INDIRECT(CONCATENATE($B105,\"!G2127\"))),\"\",INDIRECT(CONCATENATE($B105,\"!G127\")))","v":0.45631598265552764}]
[null,"WHS03",2003,7.4754966795706483,83.700439270676156,null,null,0,15.771899770176049,91.949479759573265,null,null,0,27.637185016705544,89.18097468477221,null,null,0,40.72953767008979,94.600417094992025,null,null,0,69.287002601254798,92.770923247783799,null,null,0]
[null,"DHS12",2012,33.366638608283566,72.417266653225752,null,null,0.80701098032273988,29.19830881640571,63.976052350977021,null,null,0.44986729088843747,29.985598984707316,74.757500292320714,null,null,0.7517707574972694,39.659694495640053,73.592840068174667,null,null,0.46719460449215583,59.40572700502495,89.674699773730808,null,null,6.4999884458325941E-2]
[null,null,null,"","",null,null,"","","",null,null,"","","",null,null,"","","",null,null,"","","",null,null,""]
[null,null,null,"","",null,null,"","","",null,null,"","","",null,null,"","","",null,null,"","","",null,null,""]
[null,null,null,"","",null,null,"","","",null,null,"","","",null,null,"","","",null,null,"","","",null,null,""]
[null,null,null,"","",null,null,"","","",null,null,"","","",null,null,"","","",null,null,"","","",null,null,""]
[null,null,null,"","",null,null,"","","",null,null,"","","",null,null,"","","",null,null,"","","",null,null,""]
[null,null,null,"","",null,null,"","","",null,null,"","","",null,null,"","","",null,null,"","","",null,null,""]
[null,null,null,"","",null,null,"","","",null,null,"","","",null,null,"","","",null,null,"","","",null,null,""]
[null,null,null,"","",null,null,"","","",null,null,"","","",null,null,"","","",null,null,"","","",null,null,""]
[null,null,null,"","",null,null,"","","",null,null,"","","",null,null,"","","",null,null,"","","",null,null,""]
[]
[null,{"$f":"CONCATENATE(\"National use of sanitation facilities, \",C99,\"–\",C100)","v":"National use of sanitation facilities, 2000–2018"},null,null,null,null,null,null,null,null,null,null,null,null,null,null,null,null,"Data points used for regression"]
[]
[]
[]
[]
[]
[]
[]
[]
[]
[]
[]
[]
[]
[]
[]
[]
[]
[]
[]
[]
[]
[]
[]
[]
[]
[]
[]
[]
[]
[]
[]
[]
[]
[]
[]
[]
[]
[]
[]
[]
[]
[]
[]
[]
[]
[]
[]
[]
[]
[]
[]
[]
[]
[]
[]
[]
[]
[]
[]
[]
[]
[]
[]
[]
[]
[]
[]
[]
[]
[]
[]
[]
[]
[]
[]
[]
[]
[]
["URBAN",null,null,"Poorest",null,null,null,null,"Poor",null,null,null,null,"Middle",null,null,null,null,"Rich",null,null,null,null,"Richest"]
[null,null,null,"Improved","Basic","Limited","Unimproved","Open defecation","Improved","Basic","Limited","Unimproved","Open defecation","Improved","Basic","Limited","Unimproved","Open defecation","Improved","Basic","Limited","Unimproved","Open defecation","Improved","Basic","Limited","Unimproved","Open defecation"]
["Forecast period:",null,2000,{"$f":"IF((D201+H201)>100,D201*100/(D201+H201),D201)","v":6.1626568753772517},{"$f":"D199*AVERAGEIF(E205:E216,\">0\")/100","v":4.6776363991174454},{"$f":"D199*(100-AVERAGEIF(E205:E216,\">0\"))/100","v":1.4850204762598065},{"$f":"100-(E199+F199+H199)","v":93.217406462823732},{"$f":"IF((D201+H201)>100,H201*100/(D201+H201),H201)","v":0.61993666179900941},{"$f":"IF((I201+M201)>100,I201*100/(I201+M201),I201)","v":32.50937986435224},{"$f":"I199*AVERAGEIF(J205:J216,\">0\")/100","v":26.529596246339612},{"$f":"I199*(100-AVERAGEIF(J205:J216,\">0\"))/100","v":5.9797836180126289},{"$f":"100-(J199+K199+M199)","v":67.49062013564776},{"$f":"IF((I201+M201)>100,M201*100/(I201+M201),M201)","v":0},{"$f":"IF((N201+R201)>100,N201*100/(N201+R201),N201)","v":40.396512858368851},{"$f":"N199*AVERAGEIF(O205:O216,\">0\")/100","v":33.464657168698658},{"$f":"N199*(100-AVERAGEIF(O205:O216,\">0\"))/100","v":6.9318556896701899},{"$f":"100-(O199+P199+R199)","v":58.845201722471785},{"$f":"IF((N201+R201)>100,R201*100/(N201+R201),R201)","v":0.75828541915936398},{"$f":"IF((S201+W201)>100,S201*100/(S201+W201),S201)","v":58.16289834169595},{"$f":"S199*AVERAGEIF(T205:T216,\">0\")/100","v":49.096323069815362},{"$f":"S199*(100-AVERAGEIF(T205:T216,\">0\"))/100","v":9.0665752718805894},{"$f":"100-(T199+U199+W199)","v":41.83710165830405},{"$f":"IF((S201+W201)>100,W201*100/(S201+W201),W201)","v":0},{"$f":"IF((X201+AB201)>100,X201*100/(X201+AB201),X201)","v":85.896108033815381},{"$f":"X199*AVERAGEIF(Y205:Y216,\">0\")/100","v":78.354080712234037},{"$f":"X199*(100-AVERAGEIF(Y205:Y216,\">0\"))/100","v":7.5420273215813483},{"$f":"100-(Y199+Z199+AB199)","v":14.103891966184619},{"$f":"IF((X201+AB201)>100,AB201*100/(X201+AB201),AB201)","v":0}]
[null,null,2018,{"$f":"IF((D202+H202)>100,D202*100/(D202+H202),D202)","v":40.46816698490602},{"$f":"D200*AVERAGEIF(E205:E216,\">0\")/100","v":30.716519631408396},{"$f":"D200*(100-AVERAGEIF(E205:E216,\">0\"))/100","v":9.7516473534976242},{"$f":"100-(E200+F200+H200)","v":59.15448764090786},{"$f":"IF((D202+H202)>100,H202*100/(D202+H202),H202)","v":0.37734537418612035},{"$f":"IF((I202+M202)>100,I202*100/(I202+M202),I202)","v":41.537228867316344},{"$f":"I200*AVERAGEIF(J205:J216,\">0\")/100","v":33.8968604027434},{"$f":"I200*(100-AVERAGEIF(J205:J216,\">0\"))/100","v":7.6403684645729451},{"$f":"100-(J200+K200+M200)","v":57.320373844181375},{"$f":"IF((I202+M202)>100,M202*100/(I202+M202),M202)","v":1.1423972885022806},{"$f":"IF((N202+R202)>100,N202*100/(N202+R202),N202)","v":50.71846723553017},{"$f":"N200*AVERAGEIF(O205:O216,\">0\")/100","v":42.015411679458175},{"$f":"N200*(100-AVERAGEIF(O205:O216,\">0\"))/100","v":8.7030555560719964},{"$f":"100-(O200+P200+R200)","v":49.23697416385312},{"$f":"IF((N202+R202)>100,R202*100/(N202+R202),R202)","v":4.4558600616710464E-2},{"$f":"IF((S202+W202)>100,S202*100/(S202+W202),S202)","v":65.122606835405691},{"$f":"S200*AVERAGEIF(T205:T216,\">0\")/100","v":54.971135130787836},{"$f":"S200*(100-AVERAGEIF(T205:T216,\">0\"))/100","v":10.151471704617855},{"$f":"100-(T200+U200+W200)","v":34.715835419989659},{"$f":"IF((S202+W202)>100,W202*100/(S202+W202),W202)","v":0.16155774460465366},{"$f":"IF((X202+AB202)>100,X202*100/(X202+AB202),X202)","v":74.413576222874326},{"$f":"X200*AVERAGEIF(Y205:Y216,\">0\")/100","v":67.879761853211022},{"$f":"X200*(100-AVERAGEIF(Y205:Y216,\">0\"))/100","v":6.5338143696633031},{"$f":"100-(Y200+Z200+AB200)","v":25.512173529023187},{"$f":"IF((X202+AB202)>100,AB202*100/(X202+AB202),AB202)","v":7.4250248102490701E-2}]
["Regression period:",null,{"$f":"MinRegYear(C199,C205:C216)","v":2000},{"$f":"IF(MAX(C205:C216)-MIN(C205:C216)<5,AVERAGEIF(C205:C216,\">0\",D205:D216),\nIF(FORECAST($C201,D$205:D$216,$C$205:$C$216)<0,0,\nIF(FORECAST($C201,D$205:D$216,$C$205:$C$216)>100,100,\nFORECAST($C201,D$205:D$216,$C$205:$C$216))))","v":6.1626568753772517},null,null,null,{"$f":"IF(MAX(C205:C216)-MIN(C205:C216)<5,AVERAGEIF(C205:C216,\">0\",H205:H216),\nIF(FORECAST($C201,H$205:H$216,$C$205:$C$216)<0,0,\nIF(FORECAST($C201,H$205:H$216,$C$205:$C$216)>100,100,\nFORECAST($C201,H$205:H$216,$C$205:$C$216))))","v":0.61993666179900941},{"$f":"IF(MAX(C205:C216)-MIN(C205:C216)<5,AVERAGEIF(C205:C216,\">0\",I205:I216),\nIF(FORECAST($C201,I$205:I$216,$C$205:$C$216)<0,0,\nIF(FORECAST($C201,I$205:I$216,$C$205:$C$216)>100,100,\nFORECAST($C201,I$205:I$216,$C$205:$C$216))))","v":32.50937986435224},null,null,null,{"$f":"IF(MAX(C205:C216)-MIN(C205:C216)<5,AVERAGEIF(C205:C216,\">0\",M205:M216),\nIF(FORECAST($C201,M$205:M$216,$C$205:$C$216)<0,0,\nIF(FORECAST($C201,M$205:M$216,$C$205:$C$216)>100,100,\nFORECAST($C201,M$205:M$216,$C$205:$C$216))))","v":0},{"$f":"IF(MAX(C205:C216)-MIN(C205:C216)<5,AVERAGEIF(C205:C216,\">0\",N205:N216),\nIF(FORECAST($C201,N$205:N$216,$C$205:$C$216)<0,0,\nIF(FORECAST($C201,N$205:N$216,$C$205:$C$216)>100,100,\nFORECAST($C201,N$205:N$216,$C$205:$C$216))))","v":40.396512858368851},null,null,null,{"$f":"IF(MAX(C205:C216)-MIN(C205:C216)<5,AVERAGEIF(C205:C216,\">0\",R205:R216),\nIF(FORECAST($C201,R$205:R$216,$C$205:$C$216)<0,0,\nIF(FORECAST($C201,R$205:R$216,$C$205:$C$216)>100,100,\nFORECAST($C201,R$205:R$216,$C$205:$C$216))))","v":0.75828541915936398},{"$f":"IF(MAX(C205:C216)-MIN(C205:C216)<5,AVERAGEIF(C205:C216,\">0\",S205:S216),\nIF(FORECAST($C201,S$205:S$216,$C$205:$C$216)<0,0,\nIF(FORECAST($C201,S$205:S$216,$C$205:$C$216)>100,100,\nFORECAST($C201,S$205:S$216,$C$205:$C$216))))","v":58.16289834169595},null,null,null,{"$f":"IF(MAX(C205:C216)-MIN(C205:C216)<5,AVERAGEIF(C205:C216,\">0\",W205:W216),\nIF(FORECAST($C201,W$205:W$216,$C$205:$C$216)<0,0,\nIF(FORECAST($C201,W$205:W$216,$C$205:$C$216)>100,100,\nFORECAST($C201,W$205:W$216,$C$205:$C$216))))","v":0},{"$f":"IF(MAX(C205:C216)-MIN(C205:C216)<5,AVERAGEIF(C205:C216,\">0\",X205:X216),\nIF(FORECAST($C201,X$205:X$216,$C$205:$C$216)<0,0,\nIF(FORECAST($C201,X$205:X$216,$C$205:$C$216)>100,100,\nFORECAST($C201,X$205:X$216,$C$205:$C$216))))","v":85.896108033815381},null,null,null,{"$f":"IF(MAX(C205:C216)-MIN(C205:C216)<5,AVERAGEIF(C205:C216,\">0\",AB205:AB216),\nIF(FORECAST($C201,AB$205:AB$216,$C$205:$C$216)<0,0,\nIF(FORECAST($C201,AB$205:AB$216,$C$205:$C$216)>100,100,\nFORECAST($C201,AB$205:AB$216,$C$205:$C$216))))","v":0}]
[null,null,{"$f":"MaxRegYear(C200,C205:C216)","v":2014},{"$f":"IF(MAX(C205:C216)-MIN(C205:C216)<5,AVERAGEIF(C205:C216,\">0\",D205:D216),\nIF(FORECAST($C202,D$205:D$216,$C$205:$C$216)<0,0,\nIF(FORECAST($C202,D$205:D$216,$C$205:$C$216)>100,100,\nFORECAST($C202,D$205:D$216,$C$205:$C$216))))","v":40.46816698490602},null,null,null,{"$f":"IF(MAX(C205:C216)-MIN(C205:C216)<5,AVERAGEIF(C205:C216,\">0\",H205:H216),\nIF(FORECAST($C202,H$205:H$216,$C$205:$C$216)<0,0,\nIF(FORECAST($C202,H$205:H$216,$C$205:$C$216)>100,100,\nFORECAST($C202,H$205:H$216,$C$205:$C$216))))","v":0.37734537418612035},{"$f":"IF(MAX(C205:C216)-MIN(C205:C216)<5,AVERAGEIF(C205:C216,\">0\",I205:I216),\nIF(FORECAST($C202,I$205:I$216,$C$205:$C$216)<0,0,\nIF(FORECAST($C202,I$205:I$216,$C$205:$C$216)>100,100,\nFORECAST($C202,I$205:I$216,$C$205:$C$216))))","v":41.537228867316344},null,null,null,{"$f":"IF(MAX(C205:C216)-MIN(C205:C216)<5,AVERAGEIF(C205:C216,\">0\",M205:M216),\nIF(FORECAST($C202,M$205:M$216,$C$205:$C$216)<0,0,\nIF(FORECAST($C202,M$205:M$216,$C$205:$C$216)>100,100,\nFORECAST($C202,M$205:M$216,$C$205:$C$216))))","v":1.1423972885022806},{"$f":"IF(MAX(C205:C216)-MIN(C205:C216)<5,AVERAGEIF(C205:C216,\">0\",N205:N216),\nIF(FORECAST($C202,N$205:N$216,$C$205:$C$216)<0,0,\nIF(FORECAST($C202,N$205:N$216,$C$205:$C$216)>100,100,\nFORECAST($C202,N$205:N$216,$C$205:$C$216))))","v":50.71846723553017},null,null,null,{"$f":"IF(MAX(C205:C216)-MIN(C205:C216)<5,AVERAGEIF(C205:C216,\">0\",R205:R216),\nIF(FORECAST($C202,R$205:R$216,$C$205:$C$216)<0,0,\nIF(FORECAST($C202,R$205:R$216,$C$205:$C$216)>100,100,\nFORECAST($C202,R$205:R$216,$C$205:$C$216))))","v":4.4558600616710464E-2},{"$f":"IF(MAX(C205:C216)-MIN(C205:C216)<5,AVERAGEIF(C205:C216,\">0\",S205:S216),\nIF(FORECAST($C202,S$205:S$216,$C$205:$C$216)<0,0,\nIF(FORECAST($C202,S$205:S$216,$C$205:$C$216)>100,100,\nFORECAST($C202,S$205:S$216,$C$205:$C$216))))","v":65.122606835405691},null,null,null,{"$f":"IF(MAX(C205:C216)-MIN(C205:C216)<5,AVERAGEIF(C205:C216,\">0\",W205:W216),\nIF(FORECAST($C202,W$205:W$216,$C$205:$C$216)<0,0,\nIF(FORECAST($C202,W$205:W$216,$C$205:$C$216)>100,100,\nFORECAST($C202,W$205:W$216,$C$205:$C$216))))","v":0.16155774460465366},{"$f":"IF(MAX(C205:C216)-MIN(C205:C216)<5,AVERAGEIF(C205:C216,\">0\",X205:X216),\nIF(FORECAST($C202,X$205:X$216,$C$205:$C$216)<0,0,\nIF(FORECAST($C202,X$205:X$216,$C$205:$C$216)>100,100,\nFORECAST($C202,X$205:X$216,$C$205:$C$216))))","v":74.413576222874326},null,null,null,{"$f":"IF(MAX(C205:C216)-MIN(C205:C216)<5,AVERAGEIF(C205:C216,\">0\",AB205:AB216),\nIF(FORECAST($C202,AB$205:AB$216,$C$205:$C$216)<0,0,\nIF(FORECAST($C202,AB$205:AB$216,$C$205:$C$216)>100,100,\nFORECAST($C202,AB$205:AB$216,$C$205:$C$216))))","v":7.4250248102490701E-2}]
[]
[null,"Survey","Year","Improved","Not shared",null,null,"Open defecation","Improved","Not shared",null,null,"Open defecation","Improved","Not shared",null,null,"Open defecation","Improved","Not shared",null,null,"Open defecation","Improved","Not shared",null,null,"Open defecation"]
[null,"MICS00",2000,{"$f":"IF(ISERROR(INDIRECT(CONCATENATE($B205,\"!H122\"))),\"\",INDIRECT(CONCATENATE($B205,\"!H122\")))","v":9.2364466832693868},{"$f":"IF(ISERROR(INDIRECT(CONCATENATE($B205,\"!H129\"))),\"\",INDIRECT(CONCATENATE($B205,\"!H129\")))","v":"N/a"},null,null,{"$f":"IF(ISERROR(INDIRECT(CONCATENATE($B205,\"!H127\"))),\"\",INDIRECT(CONCATENATE($B205,\"!H127\")))","v":1.045901272639056},{"$f":"IF(ISERROR(INDIRECT(CONCATENATE($B205,\"!I122\"))),\"\",INDIRECT(CONCATENATE($B205,\"!I122\")))","v":32.727506247668991},{"$f":"IF(ISERROR(INDIRECT(CONCATENATE($B205,\"!I129\"))),\"\",INDIRECT(CONCATENATE($B205,\"!I129\")))","v":"N/a"},null,null,{"$f":"IF(ISERROR(INDIRECT(CONCATENATE($B205,\"!I127\"))),\"\",INDIRECT(CONCATENATE($B205,\"!I127\")))","v":0},{"$f":"IF(ISERROR(INDIRECT(CONCATENATE($B205,\"!J122\"))),\"\",INDIRECT(CONCATENATE($B205,\"!J122\")))","v":39.398955154105067},{"$f":"IF(ISERROR(INDIRECT(CONCATENATE($B205,\"!J129\"))),\"\",INDIRECT(CONCATENATE($B205,\"!J129\")))","v":"N/a"},null,null,{"$f":"IF(ISERROR(INDIRECT(CONCATENATE($B205,\"!J127\"))),\"\",INDIRECT(CONCATENATE($B205,\"!J127\")))","v":1.2122933876916773},{"$f":"IF(ISERROR(INDIRECT(CONCATENATE($B205,\"!K122\"))),\"\",INDIRECT(CONCATENATE($B205,\"!K122\")))","v":56.162972570422674},{"$f":"IF(ISERROR(INDIRECT(CONCATENATE($B205,\"!K129\"))),\"\",INDIRECT(CONCATENATE($B205,\"!K129\")))","v":"N/a"},null,null,{"$f":"IF(ISERROR(INDIRECT(CONCATENATE($B205,\"!K127\"))),\"\",INDIRECT(CONCATENATE($B205,\"!K127\")))","v":0},{"$f":"IF(ISERROR(INDIRECT(CONCATENATE($B205,\"!L122\"))),\"\",INDIRECT(CONCATENATE($B205,\"!L122\")))","v":82.651733127589722},{"$f":"IF(ISERROR(INDIRECT(CONCATENATE($B205,\"!L129\"))),\"\",INDIRECT(CONCATENATE($B205,\"!L129\")))","v":"N/a"},null,null,{"$f":"IF(ISERROR(INDIRECT(CONCATENATE($B205,\"!L2127\"))),\"\",INDIRECT(CONCATENATE($B205,\"!L127\")))","v":0}]
[null,"WHS03",2003,9.4154512026090735,87.967566931945157,null,null,0,34.153083758660102,92.314823211285116,null,null,0,43.938437163921897,91.642445300292181,null,null,0,62.320832142521979,92.30298180571522,null,null,0,87.76139871120003,94.668138570548308,null,null,0]
[null,"DHS12",2012,36.591976429031803,63.838269210152255,null,null,0.55398947602988224,40.320244947046056,70.897125814111789,null,null,1.0012021180132284,48.911383089752576,74.038475159483923,null,null,0.29785556420500292,63.461720841117952,76.520527577822762,null,null,0.1415899334737401,74.972479608076327,87.771048735558225,null,null,6.5073251146002042E-2]
[null,null,null,"","",null,null,"","","",null,null,"","","",null,null,"","","",null,null,"","","",null,null,""]
[null,null,null,"","",null,null,"","","",null,null,"","","",null,null,"","","",null,null,"","","",null,null,""]
[null,null,null,"","",null,null,"","","",null,null,"","","",null,null,"","","",null,null,"","","",null,null,""]
[null,null,null,"","",null,null,"","","",null,null,"","","",null,null,"","","",null,null,"","","",null,null,""]
[null,null,null,"","",null,null,"","","",null,null,"","","",null,null,"","","",null,null,"","","",null,null,""]
[null,null,null,"","",null,null,"","","",null,null,"","","",null,null,"","","",null,null,"","","",null,null,""]
[null,null,null,"","",null,null,"","","",null,null,"","","",null,null,"","","",null,null,"","","",null,null,""]
[null,null,null,"","",null,null,"","","",null,null,"","","",null,null,"","","",null,null,"","","",null,null,""]
[null,null,null,"","",null,null,"","","",null,null,"","","",null,null,"","","",null,null,"","","",null,null,""]
[]
[null,{"$f":"CONCATENATE(\"Urban use of sanitation facilities, \",C199,\"–\",C200)","v":"Urban use of sanitation facilities, 2000–2018"},null,null,null,null,null,null,null,null,null,null,null,null,null,null,null,null,"Data points used for regression"]
[]
[]
[]
[]
[]
[]
[]
[]
[]
[]
[]
[]
[]
[]
[]
[]
[]
[]
[]
[]
[]
[]
[]
[]
[]
[]
[]
[]
[]
[]
[]
[]
[]
[]
[]
[]
[]
[]
[]
[]
[]
[]
[]
[]
[]
[]
[]
[]
[]
[]
[]
[]
[]
[]
[]
[]
[]
[]
[]
[]
[]
[]
[]
[]
[]
[]
[]
[]
[]
[]
[]
[]
[]
[]
[]
[]
[]
[]
["RURAL",null,null,"Poorest",null,null,null,null,"Poor",null,null,null,null,"Middle",null,null,null,null,"Rich",null,null,null,null,"Richest"]
[null,null,null,"Improved","Basic","Limited","Unimproved","Open defecation","Improved","Basic","Limited","Unimproved","Open defecation","Improved","Basic","Limited","Unimproved","Open defecation","Improved","Basic","Limited","Unimproved","Open defecation","Improved","Basic","Limited","Unimproved","Open defecation"]
["Forecast period:",null,2000,{"$f":"IF((D301+H301)>100,D301*100/(D301+H301),D301)","v":3.4035917988803703},{"$f":"D299*AVERAGEIF(E305:E316,\">0\")/100","v":2.6664147168324854},{"$f":"D299*(100-AVERAGEIF(E305:E316,\">0\"))/100","v":0.73717708204788512},{"$f":"100-(E299+F299+H299)","v":95.350778521227582},{"$f":"IF((D301+H301)>100,H301*100/(D301+H301),H301)","v":1.2456296798920476},{"$f":"IF((I301+M301)>100,I301*100/(I301+M301),I301)","v":8.6059088318079375},{"$f":"I299*AVERAGEIF(J305:J316,\">0\")/100","v":6.5293562703596413},{"$f":"I299*(100-AVERAGEIF(J305:J316,\">0\"))/100","v":2.0765525614482967},{"$f":"100-(J299+K299+M299)","v":91.167668253027244},{"$f":"IF((I301+M301)>100,M301*100/(I301+M301),M301)","v":0.22642291516481805},{"$f":"IF((N301+R301)>100,N301*100/(N301+R301),N301)","v":18.572720530411743},{"$f":"N299*AVERAGEIF(O305:O316,\">0\")/100","v":15.798607139323719},{"$f":"N299*(100-AVERAGEIF(O305:O316,\">0\"))/100","v":2.7741133910880236},{"$f":"100-(O299+P299+R299)","v":81.349669470191316},{"$f":"IF((N301+R301)>100,R301*100/(N301+R301),R301)","v":7.7609999396949902E-2},{"$f":"IF((S301+W301)>100,S301*100/(S301+W301),S301)","v":33.911597802754955},{"$f":"S299*AVERAGEIF(T305:T316,\">0\")/100","v":27.667184390392208},{"$f":"S299*(100-AVERAGEIF(T305:T316,\">0\"))/100","v":6.2444134123627464},{"$f":"100-(T299+U299+W299)","v":66.088402197245045},{"$f":"IF((S301+W301)>100,W301*100/(S301+W301),W301)","v":0},{"$f":"IF((X301+AB301)>100,X301*100/(X301+AB301),X301)","v":55.884491585374235},{"$f":"X299*AVERAGEIF(Y305:Y316,\">0\")/100","v":52.409273358911996},{"$f":"X299*(100-AVERAGEIF(Y305:Y316,\">0\"))/100","v":3.4752182264622347},{"$f":"100-(Y299+Z299+AB299)","v":43.662387807945372},{"$f":"IF((X301+AB301)>100,AB301*100/(X301+AB301),AB301)","v":0.45312060668040033}]
[null,null,2018,{"$f":"IF((D302+H302)>100,D302*100/(D302+H302),D302)","v":35.339127396603544},{"$f":"D300*AVERAGEIF(E305:E316,\">0\")/100","v":27.685097079302761},{"$f":"D300*(100-AVERAGEIF(E305:E316,\">0\"))/100","v":7.6540303173007862},{"$f":"100-(E300+F300+H300)","v":64.095040425397656},{"$f":"IF((D302+H302)>100,H302*100/(D302+H302),H302)","v":0.56583217799880003},{"$f":"IF((I302+M302)>100,I302*100/(I302+M302),I302)","v":32.917456311207843},{"$f":"I300*AVERAGEIF(J305:J316,\">0\")/100","v":24.974677744142664},{"$f":"I300*(100-AVERAGEIF(J305:J316,\">0\"))/100","v":7.9427785670651812},{"$f":"100-(J300+K300+M300)","v":66.487395980726532},{"$f":"IF((I302+M302)>100,M302*100/(I302+M302),M302)","v":0.59514770806562467},{"$f":"IF((N302+R302)>100,N302*100/(N302+R302),N302)","v":25.82292540970252},{"$f":"N300*AVERAGEIF(O305:O316,\">0\")/100","v":21.965885561457153},{"$f":"N300*(100-AVERAGEIF(O305:O316,\">0\"))/100","v":3.8570398482453681},{"$f":"100-(O300+P300+R300)","v":74.039621974436145},{"$f":"IF((N302+R302)>100,R302*100/(N302+R302),R302)","v":0.1374526158613314},{"$f":"IF((S302+W302)>100,S302*100/(S302+W302),S302)","v":29.114263599452897},{"$f":"S300*AVERAGEIF(T305:T316,\">0\")/100","v":23.75322165831739},{"$f":"S300*(100-AVERAGEIF(T305:T316,\">0\"))/100","v":5.361041941135511},{"$f":"100-(T300+U300+W300)","v":70.038443963608017},{"$f":"IF((S302+W302)>100,W302*100/(S302+W302),W302)","v":0.84729243693908529},{"$f":"IF((X302+AB302)>100,X302*100/(X302+AB302),X302)","v":41.352261761597219},{"$f":"X300*AVERAGEIF(Y305:Y316,\">0\")/100","v":38.780740938869535},{"$f":"X300*(100-AVERAGEIF(Y305:Y316,\">0\"))/100","v":2.5715208227276856},{"$f":"100-(Y300+Z300+AB300)","v":58.508900865713713},{"$f":"IF((X302+AB302)>100,AB302*100/(X302+AB302),AB302)","v":0.13883737268906771}]
["Regression period:",null,{"$f":"MinRegYear(C299,C305:C316)","v":2000},{"$f":"IF(MAX(C305:C316)-MIN(C305:C316)<5,AVERAGEIF(C305:C316,\">0\",D305:D316),\nIF(FORECAST($C301,D$305:D$316,$C$305:$C$316)<0,0,\nIF(FORECAST($C301,D$305:D$316,$C$305:$C$316)>100,100,\nFORECAST($C301,D$305:D$316,$C$305:$C$316))))","v":3.4035917988803703},null,null,null,{"$f":"IF(MAX(C305:C316)-MIN(C305:C316)<5,AVERAGEIF(C305:C316,\">0\",H305:H316),\nIF(FORECAST($C301,H$305:H$316,$C$305:$C$316)<0,0,\nIF(FORECAST($C301,H$305:H$316,$C$305:$C$316)>100,100,\nFORECAST($C301,H$305:H$316,$C$305:$C$316))))","v":1.2456296798920476},{"$f":"IF(MAX(C305:C316)-MIN(C305:C316)<5,AVERAGEIF(C305:C316,\">0\",I305:I316),\nIF(FORECAST($C301,I$305:I$316,$C$305:$C$316)<0,0,\nIF(FORECAST($C301,I$305:I$316,$C$305:$C$316)>100,100,\nFORECAST($C301,I$305:I$316,$C$305:$C$316))))","v":8.6059088318079375},null,null,null,{"$f":"IF(MAX(C305:C316)-MIN(C305:C316)<5,AVERAGEIF(C305:C316,\">0\",M305:M316),\nIF(FORECAST($C301,M$305:M$316,$C$305:$C$316)<0,0,\nIF(FORECAST($C301,M$305:M$316,$C$305:$C$316)>100,100,\nFORECAST($C301,M$305:M$316,$C$305:$C$316))))","v":0.22642291516481805},{"$f":"IF(MAX(C305:C316)-MIN(C305:C316)<5,AVERAGEIF(C305:C316,\">0\",N305:N316),\nIF(FORECAST($C301,N$305:N$316,$C$305:$C$316)<0,0,\nIF(FORECAST($C301,N$305:N$316,$C$305:$C$316)>100,100,\nFORECAST($C301,N$305:N$316,$C$305:$C$316))))","v":18.572720530411743},null,null,null,{"$f":"IF(MAX(C305:C316)-MIN(C305:C316)<5,AVERAGEIF(C305:C316,\">0\",R305:R316),\nIF(FORECAST($C301,R$305:R$316,$C$305:$C$316)<0,0,\nIF(FORECAST($C301,R$305:R$316,$C$305:$C$316)>100,100,\nFORECAST($C301,R$305:R$316,$C$305:$C$316))))","v":7.7609999396949902E-2},{"$f":"IF(MAX(C305:C316)-MIN(C305:C316)<5,AVERAGEIF(C305:C316,\">0\",S305:S316),\nIF(FORECAST($C301,S$305:S$316,$C$305:$C$316)<0,0,\nIF(FORECAST($C301,S$305:S$316,$C$305:$C$316)>100,100,\nFORECAST($C301,S$305:S$316,$C$305:$C$316))))","v":33.911597802754955},null,null,null,{"$f":"IF(MAX(C305:C316)-MIN(C305:C316)<5,AVERAGEIF(C305:C316,\">0\",W305:W316),\nIF(FORECAST($C301,W$305:W$316,$C$305:$C$316)<0,0,\nIF(FORECAST($C301,W$305:W$316,$C$305:$C$316)>100,100,\nFORECAST($C301,W$305:W$316,$C$305:$C$316))))","v":0},{"$f":"IF(MAX(C305:C316)-MIN(C305:C316)<5,AVERAGEIF(C305:C316,\">0\",X305:X316),\nIF(FORECAST($C301,X$305:X$316,$C$305:$C$316)<0,0,\nIF(FORECAST($C301,X$305:X$316,$C$305:$C$316)>100,100,\nFORECAST($C301,X$305:X$316,$C$305:$C$316))))","v":55.884491585374235},null,null,null,{"$f":"IF(MAX(C305:C316)-MIN(C305:C316)<5,AVERAGEIF(C305:C316,\">0\",AB305:AB316),\nIF(FORECAST($C301,AB$305:AB$316,$C$305:$C$316)<0,0,\nIF(FORECAST($C301,AB$305:AB$316,$C$305:$C$316)>100,100,\nFORECAST($C301,AB$305:AB$316,$C$305:$C$316))))","v":0.45312060668040033}]
[null,null,{"$f":"MaxRegYear(C300,C305:C316)","v":2014},{"$f":"IF(MAX(C305:C316)-MIN(C305:C316)<5,AVERAGEIF(C305:C316,\">0\",D305:D316),\nIF(FORECAST($C302,D$305:D$316,$C$305:$C$316)<0,0,\nIF(FORECAST($C302,D$305:D$316,$C$305:$C$316)>100,100,\nFORECAST($C302,D$305:D$316,$C$305:$C$316))))","v":35.339127396603544},null,null,null,{"$f":"IF(MAX(C305:C316)-MIN(C305:C316)<5,AVERAGEIF(C305:C316,\">0\",H305:H316),\nIF(FORECAST($C302,H$305:H$316,$C$305:$C$316)<0,0,\nIF(FORECAST($C302,H$305:H$316,$C$305:$C$316)>100,100,\nFORECAST($C302,H$305:H$316,$C$305:$C$316))))","v":0.56583217799880003},{"$f":"IF(MAX(C305:C316)-MIN(C305:C316)<5,AVERAGEIF(C305:C316,\">0\",I305:I316),\nIF(FORECAST($C302,I$305:I$316,$C$305:$C$316)<0,0,\nIF(FORECAST($C302,I$305:I$316,$C$305:$C$316)>100,100,\nFORECAST($C302,I$305:I$316,$C$305:$C$316))))","v":32.917456311207843},null,null,null,{"$f":"IF(MAX(C305:C316)-MIN(C305:C316)<5,AVERAGEIF(C305:C316,\">0\",M305:M316),\nIF(FORECAST($C302,M$305:M$316,$C$305:$C$316)<0,0,\nIF(FORECAST($C302,M$305:M$316,$C$305:$C$316)>100,100,\nFORECAST($C302,M$305:M$316,$C$305:$C$316))))","v":0.59514770806562467},{"$f":"IF(MAX(C305:C316)-MIN(C305:C316)<5,AVERAGEIF(C305:C316,\">0\",N305:N316),\nIF(FORECAST($C302,N$305:N$316,$C$305:$C$316)<0,0,\nIF(FORECAST($C302,N$305:N$316,$C$305:$C$316)>100,100,\nFORECAST($C302,N$305:N$316,$C$305:$C$316))))","v":25.82292540970252},null,null,null,{"$f":"IF(MAX(C305:C316)-MIN(C305:C316)<5,AVERAGEIF(C305:C316,\">0\",R305:R316),\nIF(FORECAST($C302,R$305:R$316,$C$305:$C$316)<0,0,\nIF(FORECAST($C302,R$305:R$316,$C$305:$C$316)>100,100,\nFORECAST($C302,R$305:R$316,$C$305:$C$316))))","v":0.1374526158613314},{"$f":"IF(MAX(C305:C316)-MIN(C305:C316)<5,AVERAGEIF(C305:C316,\">0\",S305:S316),\nIF(FORECAST($C302,S$305:S$316,$C$305:$C$316)<0,0,\nIF(FORECAST($C302,S$305:S$316,$C$305:$C$316)>100,100,\nFORECAST($C302,S$305:S$316,$C$305:$C$316))))","v":29.114263599452897},null,null,null,{"$f":"IF(MAX(C305:C316)-MIN(C305:C316)<5,AVERAGEIF(C305:C316,\">0\",W305:W316),\nIF(FORECAST($C302,W$305:W$316,$C$305:$C$316)<0,0,\nIF(FORECAST($C302,W$305:W$316,$C$305:$C$316)>100,100,\nFORECAST($C302,W$305:W$316,$C$305:$C$316))))","v":0.84729243693908529},{"$f":"IF(MAX(C305:C316)-MIN(C305:C316)<5,AVERAGEIF(C305:C316,\">0\",X305:X316),\nIF(FORECAST($C302,X$305:X$316,$C$305:$C$316)<0,0,\nIF(FORECAST($C302,X$305:X$316,$C$305:$C$316)>100,100,\nFORECAST($C302,X$305:X$316,$C$305:$C$316))))","v":41.352261761597219},null,null,null,{"$f":"IF(MAX(C305:C316)-MIN(C305:C316)<5,AVERAGEIF(C305:C316,\">0\",AB305:AB316),\nIF(FORECAST($C302,AB$305:AB$316,$C$305:$C$316)<0,0,\nIF(FORECAST($C302,AB$305:AB$316,$C$305:$C$316)>100,100,\nFORECAST($C302,AB$305:AB$316,$C$305:$C$316))))","v":0.13883737268906771}]
[]
[null,"Survey","Year","Improved","Not shared",null,null,"Open defecation","Improved","Not shared",null,null,"Open defecation","Improved","Not shared",null,null,"Open defecation","Improved","Not shared",null,null,"Open defecation","Improved","Not shared",null,null,"Open defecation"]
[null,"MICS00",2000,{"$f":"IF(ISERROR(INDIRECT(CONCATENATE($B305,\"!M122\"))),\"\",INDIRECT(CONCATENATE($B305,\"!M122\")))","v":5.9923445445608046},{"$f":"IF(ISERROR(INDIRECT(CONCATENATE($B305,\"!M129\"))),\"\",INDIRECT(CONCATENATE($B305,\"!M129\")))","v":"N/a"},null,null,{"$f":"IF(ISERROR(INDIRECT(CONCATENATE($B305,\"!M127\"))),\"\",INDIRECT(CONCATENATE($B305,\"!M127\")))","v":2.0705987698639272},{"$f":"IF(ISERROR(INDIRECT(CONCATENATE($B305,\"!N122\"))),\"\",INDIRECT(CONCATENATE($B305,\"!N122\")))","v":9.9036851315058776},{"$f":"IF(ISERROR(INDIRECT(CONCATENATE($B305,\"!N129\"))),\"\",INDIRECT(CONCATENATE($B305,\"!N129\")))","v":"N/a"},null,null,{"$f":"IF(ISERROR(INDIRECT(CONCATENATE($B305,\"!N127\"))),\"\",INDIRECT(CONCATENATE($B305,\"!N127\")))","v":0.45549944325463126},{"$f":"IF(ISERROR(INDIRECT(CONCATENATE($B305,\"!O122\"))),\"\",INDIRECT(CONCATENATE($B305,\"!O122\")))","v":18.104075384078264},{"$f":"IF(ISERROR(INDIRECT(CONCATENATE($B305,\"!O129\"))),\"\",INDIRECT(CONCATENATE($B305,\"!O129\")))","v":"N/a"},null,null,{"$f":"IF(ISERROR(INDIRECT(CONCATENATE($B305,\"!O127\"))),\"\",INDIRECT(CONCATENATE($B305,\"!O127\")))","v":0.14543506230500672},{"$f":"IF(ISERROR(INDIRECT(CONCATENATE($B305,\"!P122\"))),\"\",INDIRECT(CONCATENATE($B305,\"!P122\")))","v":32.242819142752779},{"$f":"IF(ISERROR(INDIRECT(CONCATENATE($B305,\"!P129\"))),\"\",INDIRECT(CONCATENATE($B305,\"!P129\")))","v":"N/a"},null,null,{"$f":"IF(ISERROR(INDIRECT(CONCATENATE($B305,\"!P127\"))),\"\",INDIRECT(CONCATENATE($B305,\"!P127\")))","v":0.12935884621652713},{"$f":"IF(ISERROR(INDIRECT(CONCATENATE($B305,\"!Q122\"))),\"\",INDIRECT(CONCATENATE($B305,\"!Q122\")))","v":54.389268195959637},{"$f":"IF(ISERROR(INDIRECT(CONCATENATE($B305,\"!Q129\"))),\"\",INDIRECT(CONCATENATE($B305,\"!Q129\")))","v":"N/a"},null,null,{"$f":"IF(ISERROR(INDIRECT(CONCATENATE($B305,\"!Q2127\"))),\"\",INDIRECT(CONCATENATE($B305,\"!Q127\")))","v":0.74245125622780261}]
[null,"WHS03",2003,6.7952505279614339,84.24878755563293,null,null,0,12.08515774922534,86.624008369891499,null,null,0,20.751196056799831,92.861470521954047,null,null,0,35.108635829669467,91.646879158668114,null,null,0,54.764073523307431,93.820881564121407,null,null,0]
[null,"DHS12",2012,31.639825607393561,72.433615881207899,null,null,0.93793580349798344,29.876970199764589,65.117228911794811,null,null,0.61883158034782815,24.630966806740314,77.265540364301671,null,null,0.15151202495481869,29.243337503733475,71.525523105105762,null,null,0.77018683325126602,42.929886797093687,93.74197128512327,null,null,0.28017852739410659]
[null,null,null,"","",null,null,"","","",null,null,"","","",null,null,"","","",null,null,"","","",null,null,""]
[null,null,null,"","",null,null,"","","",null,null,"","","",null,null,"","","",null,null,"","","",null,null,""]
[null,null,null,"","",null,null,"","","",null,null,"","","",null,null,"","","",null,null,"","","",null,null,""]
[null,null,null,"","",null,null,"","","",null,null,"","","",null,null,"","","",null,null,"","","",null,null,""]
[null,null,null,"","",null,null,"","","",null,null,"","","",null,null,"","","",null,null,"","","",null,null,""]
[null,null,null,"","",null,null,"","","",null,null,"","","",null,null,"","","",null,null,"","","",null,null,""]
[null,null,null,"","",null,null,"","","",null,null,"","","",null,null,"","","",null,null,"","","",null,null,""]
[null,null,null,"","",null,null,"","","",null,null,"","","",null,null,"","","",null,null,"","","",null,null,""]
[null,null,null,"","",null,null,"","","",null,null,"","","",null,null,"","","",null,null,"","","",null,null,""]
[]
[null,{"$f":"CONCATENATE(\"Rural use of sanitation facilities, \",C299,\"–\",C300)","v":"Rural use of sanitation facilities, 2000–2018"},null,null,null,null,null,null,null,null,null,null,null,null,null,null,null,null,"Data points used for regression"]

{"sheet":"Hygiene","index":3,"n_rows":91,"n_cols":25,"rows_kept":91,"cut":false,"hidden":false,"merged":[[39,22,40,22],[39,23,40,23],[39,24,40,24],[31,4,32,5],[39,16,40,16],[39,17,40,17],[39,18,40,18],[39,19,40,19],[39,20,40,20],[39,21,40,21],[36,24,37,24],[39,6,40,7],[39,8,40,8],[39,9,40,9],[39,10,40,10],[39,11,40,11],[39,12,40,12],[39,13,40,13],[39,14,40,14],[39,15,40,15],[36,18,37,18],[36,12,37,12],[36,13,37,13],[36,14,37,14],[36,15,37,15],[36,16,37,16],[36,17,37,17],[36,19,37,19],[36,20,37,20],[36,21,37,21],[36,22,37,22],[36,23,37,23],[33,20,34,20],[33,21,34,21],[33,22,34,22],[33,23,34,23],[33,24,34,24],[33,15,34,15],[33,16,34,16],[33,17,34,17],[33,18,34,18],[36,6,37,7],[36,8,37,8],[36,9,37,9],[36,10,37,10],[36,11,37,11],[33,10,34,10],[33,11,34,11],[33,12,34,12],[33,13,34,13],[33,14,34,14],[6,1,6,7],[3,1,3,24],[4,1,4,24],[33,1,34,3],[31,6,32,9],[31,10,31,12],[31,13,31,15],[6,10,6,15],[6,18,6,23],[33,19,34,19],[31,16,31,18],[31,19,31,21],[31,22,31,24],[33,6,34,7],[33,8,34,8],[33,9,34,9]]}
[]
[]
[]
[null,"Access to hygiene facilities by wealth quintile (%)"]
[null,{"$f":"IF(ISERROR(INDIRECT(CONCATENATE($E$32,\"!A2\"))),\"\",INDIRECT(CONCATENATE($E$32,\"!A2\")))","v":"Comoros"}]
[]
[null,{"$f":"CONCATENATE(\"National \",IF(ISERROR(INDIRECT(CONCATENATE($E$32,\"!A2\"))),\"\",INDIRECT(CONCATENATE($E$32,\"!A210\"))))","v":"National Access to hygiene facilities "},null,null,null,null,null,null,null,null,{"$f":"CONCATENATE(\"Urban \",IF(ISERROR(INDIRECT(CONCATENATE($E$32,\"!A2\"))),\"\",INDIRECT(CONCATENATE($E$32,\"!A210\"))))","v":"Urban Access to hygiene facilities "},null,null,null,null,null,null,null,{"$f":"CONCATENATE(\"Rural \",IF(ISERROR(INDIRECT(CONCATENATE($E$32,\"!A2\"))),\"\",INDIRECT(CONCATENATE($E$32,\"!A210\"))))","v":"Rural Access to hygiene facilities "}]
[]
[]
[]
[]
[]
[]
[]
[]
[]
[]
[]
[]
[]
[]
[]
[]
[]
[]
[]
[]
[]
[]
[]
[]
[null,null,null,null,{"$f":"INDEX(B88:B100,A88)","v":"DHS12"},null,{"$f":"IF(ISERROR(INDIRECT(CONCATENATE($E$32,\"!A2\"))),\"\",INDIRECT(CONCATENATE($E$32,\"!A2\")))","v":"Comoros"},null,null,null,"Poorest",null,null,"Poor",null,null,"Middle",null,null,"Rich",null,null,"Richest"]
[null,null,null,null,null,null,null,null,null,null,"Basic","Limited","No facility","Basic","Limited","No facility","Basic","Limited","No facility","Basic","Limited","No facility","Basic","Limited","No facility"]
[null,">>>  Select Survey :   ",null,null,null,null,"NATIONAL",null,null,{"$f":"IF(ISERROR(INDIRECT(CONCATENATE(#REF!,\"!A2\"))),\"\",INDIRECT(CONCATENATE(#REF!,\"!A210\")))","v":""},{"$f":"IF(ISERROR(INDIRECT(CONCATENATE($E$32,\"!C222\"))),\"\",INDIRECT(CONCATENATE($E$32,\"!C222\")))","v":12.548276055579432},{"$f":"IF(ISERROR(INDIRECT(CONCATENATE($E$32,\"!C223\"))),\"\",INDIRECT(CONCATENATE($E$32,\"!C223\")))","v":38.006057824399541},{"$f":"IF(ISERROR(INDIRECT(CONCATENATE($E$32,\"!C224\"))),\"\",INDIRECT(CONCATENATE($E$32,\"!C224\")))","v":49.445666120021095},{"$f":"IF(ISERROR(INDIRECT(CONCATENATE($E$32,\"!D222\"))),\"\",INDIRECT(CONCATENATE($E$32,\"!D222\")))","v":10.689487728105254},{"$f":"IF(ISERROR(INDIRECT(CONCATENATE($E$32,\"!D223\"))),\"\",INDIRECT(CONCATENATE($E$32,\"!D223\")))","v":34.391957033755808},{"$f":"IF(ISERROR(INDIRECT(CONCATENATE($E$32,\"!D224\"))),\"\",INDIRECT(CONCATENATE($E$32,\"!D224\")))","v":54.918555238138808},{"$f":"IF(ISERROR(INDIRECT(CONCATENATE($E$32,\"!E222\"))),\"\",INDIRECT(CONCATENATE($E$32,\"!E222\")))","v":13.448860573476987},{"$f":"IF(ISERROR(INDIRECT(CONCATENATE($E$32,\"!E223\"))),\"\",INDIRECT(CONCATENATE($E$32,\"!E223\")))","v":31.185928099389493},{"$f":"IF(ISERROR(INDIRECT(CONCATENATE($E$32,\"!E224\"))),\"\",INDIRECT(CONCATENATE($E$32,\"!E224\")))","v":55.365211327133437},{"$f":"IF(ISERROR(INDIRECT(CONCATENATE($E$32,\"!F222\"))),\"\",INDIRECT(CONCATENATE($E$32,\"!F222\")))","v":15.902129802458598},{"$f":"IF(ISERROR(INDIRECT(CONCATENATE($E$32,\"!F223\"))),\"\",INDIRECT(CONCATENATE($E$32,\"!F223\")))","v":35.697980115872056},{"$f":"IF(ISERROR(INDIRECT(CONCATENATE($E$32,\"!F224\"))),\"\",INDIRECT(CONCATENATE($E$32,\"!F224\")))","v":48.399890081669092},{"$f":"IF(ISERROR(INDIRECT(CONCATENATE($E$32,\"!G222\"))),\"\",INDIRECT(CONCATENATE($E$32,\"!G222\")))","v":26.337288795442255},{"$f":"IF(ISERROR(INDIRECT(CONCATENATE($E$32,\"!G223\"))),\"\",INDIRECT(CONCATENATE($E$32,\"!G223\")))","v":40.706808635394125},{"$f":"IF(ISERROR(INDIRECT(CONCATENATE($E$32,\"!G224\"))),\"\",INDIRECT(CONCATENATE($E$32,\"!G224\")))","v":32.95590256916347}]
[]
[]
[null,null,null,null,null,null,"URBAN",null,null,{"$f":"IF(ISERROR(INDIRECT(CONCATENATE(#REF!,\"!A2\"))),\"\",INDIRECT(CONCATENATE(#REF!,\"!A210\")))","v":""},{"$f":"IF(ISERROR(INDIRECT(CONCATENATE($E$32,\"!H222\"))),\"\",INDIRECT(CONCATENATE($E$32,\"!H222\")))","v":12.733739610277858},{"$f":"IF(ISERROR(INDIRECT(CONCATENATE($E$32,\"!H223\"))),\"\",INDIRECT(CONCATENATE($E$32,\"!H223\")))","v":48.197846448430596},{"$f":"IF(ISERROR(INDIRECT(CONCATENATE($E$32,\"!H224\"))),\"\",INDIRECT(CONCATENATE($E$32,\"!H224\")))","v":39.06841394129161},{"$f":"IF(ISERROR(INDIRECT(CONCATENATE($E$32,\"!I222\"))),\"\",INDIRECT(CONCATENATE($E$32,\"!I222\")))","v":9.4019397431159639},{"$f":"IF(ISERROR(INDIRECT(CONCATENATE($E$32,\"!I223\"))),\"\",INDIRECT(CONCATENATE($E$32,\"!I223\")))","v":31.824330384903554},{"$f":"IF(ISERROR(INDIRECT(CONCATENATE($E$32,\"!I224\"))),\"\",INDIRECT(CONCATENATE($E$32,\"!I224\")))","v":58.773729871980507},{"$f":"IF(ISERROR(INDIRECT(CONCATENATE($E$32,\"!J222\"))),\"\",INDIRECT(CONCATENATE($E$32,\"!J222\")))","v":13.986672778667902},{"$f":"IF(ISERROR(INDIRECT(CONCATENATE($E$32,\"!J223\"))),\"\",INDIRECT(CONCATENATE($E$32,\"!J223\")))","v":38.770243699264888},{"$f":"IF(ISERROR(INDIRECT(CONCATENATE($E$32,\"!J224\"))),\"\",INDIRECT(CONCATENATE($E$32,\"!J224\")))","v":47.243083522067138},{"$f":"IF(ISERROR(INDIRECT(CONCATENATE($E$32,\"!K222\"))),\"\",INDIRECT(CONCATENATE($E$32,\"!K222\")))","v":21.133874999735742},{"$f":"IF(ISERROR(INDIRECT(CONCATENATE($E$32,\"!K223\"))),\"\",INDIRECT(CONCATENATE($E$32,\"!K223\")))","v":45.649812856681621},{"$f":"IF(ISERROR(INDIRECT(CONCATENATE($E$32,\"!K224\"))),\"\",INDIRECT(CONCATENATE($E$32,\"!K224\")))","v":33.216312143582691},{"$f":"IF(ISERROR(INDIRECT(CONCATENATE($E$32,\"!L222\"))),\"\",INDIRECT(CONCATENATE($E$32,\"!L222\")))","v":33.156404730328603},{"$f":"IF(ISERROR(INDIRECT(CONCATENATE($E$32,\"!L223\"))),\"\",INDIRECT(CONCATENATE($E$32,\"!L223\")))","v":45.76088588878897},{"$f":"IF(ISERROR(INDIRECT(CONCATENATE($E$32,\"!L224\"))),\"\",INDIRECT(CONCATENATE($E$32,\"!L224\")))","v":21.082709380882363}]
[]
[]
[null,null,null,null,null,null,"RURAL",null,null,{"$f":"IF(ISERROR(INDIRECT(CONCATENATE(#REF!,\"!A2\"))),\"\",INDIRECT(CONCATENATE(#REF!,\"!A210\")))","v":""},{"$f":"IF(ISERROR(INDIRECT(CONCATENATE($E$32,\"!M222\"))),\"\",INDIRECT(CONCATENATE($E$32,\"!M222\")))","v":12.672893488821554},{"$f":"IF(ISERROR(INDIRECT(CONCATENATE($E$32,\"!M223\"))),\"\",INDIRECT(CONCATENATE($E$32,\"!M223\")))","v":32.548846255596573},{"$f":"IF(ISERROR(INDIRECT(CONCATENATE($E$32,\"!M224\"))),\"\",INDIRECT(CONCATENATE($E$32,\"!M224\")))","v":54.778260255581927},{"$f":"IF(ISERROR(INDIRECT(CONCATENATE($E$32,\"!N222\"))),\"\",INDIRECT(CONCATENATE($E$32,\"!N222\")))","v":9.0206030405641702},{"$f":"IF(ISERROR(INDIRECT(CONCATENATE($E$32,\"!N223\"))),\"\",INDIRECT(CONCATENATE($E$32,\"!N223\")))","v":32.641403142214152},{"$f":"IF(ISERROR(INDIRECT(CONCATENATE($E$32,\"!N224\"))),\"\",INDIRECT(CONCATENATE($E$32,\"!N224\")))","v":58.337993817221658},{"$f":"IF(ISERROR(INDIRECT(CONCATENATE($E$32,\"!O222\"))),\"\",INDIRECT(CONCATENATE($E$32,\"!O222\")))","v":14.786320179703822},{"$f":"IF(ISERROR(INDIRECT(CONCATENATE($E$32,\"!O223\"))),\"\",INDIRECT(CONCATENATE($E$32,\"!O223\")))","v":33.748759953745662},{"$f":"IF(ISERROR(INDIRECT(CONCATENATE($E$32,\"!O224\"))),\"\",INDIRECT(CONCATENATE($E$32,\"!O224\")))","v":51.464919866550531},{"$f":"IF(ISERROR(INDIRECT(CONCATENATE($E$32,\"!P222\"))),\"\",INDIRECT(CONCATENATE($E$32,\"!P222\")))","v":17.365042762042354},{"$f":"IF(ISERROR(INDIRECT(CONCATENATE($E$32,\"!P223\"))),\"\",INDIRECT(CONCATENATE($E$32,\"!P223\")))","v":31.600470848976016},{"$f":"IF(ISERROR(INDIRECT(CONCATENATE($E$32,\"!P224\"))),\"\",INDIRECT(CONCATENATE($E$32,\"!P224\")))","v":51.034486388981648},{"$f":"IF(ISERROR(INDIRECT(CONCATENATE($E$32,\"!Q222\"))),\"\",INDIRECT(CONCATENATE($E$32,\"!Q222\")))","v":19.708998261705524},{"$f":"IF(ISERROR(INDIRECT(CONCATENATE($E$32,\"!Q223\"))),\"\",INDIRECT(CONCATENATE($E$32,\"!Q223\")))","v":35.245621784158658},{"$f":"IF(ISERROR(INDIRECT(CONCATENATE($E$32,\"!Q224\"))),\"\",INDIRECT(CONCATENATE($E$32,\"!Q224\")))","v":45.045379954135832}]
[]
[]
[]
[]
[]
[]
[]
[]
[]
[]
[]
[]
[]
[]
[]
[]
[]
[]
[]
[]
[]
[]
[]
[]
[]
[]
[]
[]
[]
[]
[]
[]
[]
[]
[]
[]
[]
[]
[]
[]
[]
[]
[]
[]
[]
[]
[]
[3,"MICS00"]
[null,"WHS03"]
[null,"DHS12"]
[null,"Template"]

{"sheet":"MICS00","index":4,"n_rows":1072,"n_cols":72,"rows_kept":1072,"cut":false,"hidden":false,"merged":[[340,52,341,52],[342,52,343,52],[344,52,345,52],[346,52,347,52],[348,52,349,52],[350,52,351,52],[352,52,353,52],[152,52,161,52],[219,54,219,58],[219,59,219,63],[219,64,219,68],[221,52,223,52],[224,52,225,52],[226,52,229,52],[258,54,258,58],[258,59,258,63],[258,64,258,68],[260,52,262,52],[263,52,266,52],[267,52,269,52],[270,52,272,52],[273,52,275,52],[276,52,283,52],[338,54,338,58],[338,59,338,63],[338,64,338,68],[150,52,151,52],[13,54,13,58],[13,59,13,63],[13,64,13,68],[15,52,16,52],[17,52,20,52],[21,52,22,52],[26,54,26,58],[26,59,26,63],[26,64,26,68],[55,54,55,58],[55,59,55,63],[55,64,55,68],[119,54,119,58],[119,59,119,63],[119,64,119,68],[121,52,122,52],[123,52,126,52],[127,52,128,52],[132,54,132,58],[132,59,132,63],[132,64,132,68],[134,52,138,52],[40,52,41,52],[42,52,43,52],[44,52,45,52],[46,52,48,52],[49,0,51,0],[49,52,51,52],[52,0,54,0],[52,52,54,52],[139,0,142,0],[139,52,142,52],[143,0,146,0],[143,52,146,52],[147,0,149,0],[147,52,149,52],[13,2,13,6],[13,7,13,11],[28,52,29,52],[30,0,31,0],[30,52,31,52],[32,0,33,0],[32,52,33,52],[34,52,35,52],[36,52,37,52],[38,0,39,0],[38,52,39,52],[28,0,29,0],[34,0,35,0],[36,0,37,0],[40,0,41,0],[42,0,43,0],[44,0,45,0],[26,2,26,6],[26,7,26,11],[26,12,26,16],[13,12,13,16],[15,0,16,0],[17,0,20,0],[21,0,22,0],[23,0,25,0],[107,0,107,1],[119,2,119,6],[119,7,119,11],[57,0,71,0],[55,2,55,6],[55,7,55,11],[55,12,55,16],[152,0,160,0],[132,2,132,6],[132,7,132,11],[132,12,132,16],[134,0,138,0],[119,12,119,16],[121,0,122,0],[123,0,126,0],[127,0,128,0],[129,0,131,0],[150,0,151,0],[46,0,48,0],[1024,0,1024,2],[1025,0,1025,1],[1030,0,1032,0],[1033,0,1033,2],[398,2,398,5],[219,7,219,11],[219,12,219,16],[221,0,223,0],[207,0,207,1],[219,2,219,6],[405,2,405,3],[405,7,405,8],[405,12,405,13],[406,2,406,3],[406,7,406,8],[406,12,406,13],[401,1,444,1],[402,2,402,3],[402,7,402,8],[402,12,402,13],[403,2,403,3],[403,7,403,8],[403,12,403,13],[404,2,404,3],[404,7,404,8],[404,12,404,13],[398,7,398,10],[398,12,398,15],[399,2,399,4],[399,7,399,9],[399,12,399,14],[400,2,401,3],[400,7,401,8],[400,12,401,13],[411,2,411,3],[411,7,411,8],[411,12,411,13],[412,2,412,3],[412,7,412,8],[412,12,412,13],[409,2,409,3],[409,7,409,8],[409,12,409,13],[410,2,410,3],[410,7,410,8],[410,12,410,13],[407,2,407,3],[407,7,407,8],[407,12,407,13],[408,2,408,3],[408,7,408,8],[408,12,408,13],[417,2,417,3],[417,7,417,8],[417,12,417,13],[418,2,418,3],[418,7,418,8],[418,12,418,13],[415,2,415,3],[415,7,415,8],[415,12,415,13],[416,2,416,3],[416,7,416,8],[416,12,416,13],[413,2,413,3],[413,7,413,8],[413,12,413,13],[414,2,414,3],[414,7,414,8],[414,12,414,13],[423,2,423,3],[423,7,423,8],[423,12,423,13],[424,2,424,3],[424,7,424,8],[424,12,424,13],[421,2,421,3],[421,7,421,8],[421,12,421,13],[422,2,422,3],[422,7,422,8],[422,12,422,13],[419,2,419,3],[419,7,419,8],[419,12,419,13],[420,2,420,3],[420,7,420,8],[420,12,420,13],[429,2,429,3],[429,7,429,8],[429,12,429,13],[430,2,430,3],[430,7,430,8],[430,12,430,13],[427,2,427,3],[427,7,427,8],[427,12,427,13],[428,2,428,3],[428,7,428,8],[428,12,428,13],[425,2,425,3],[425,7,425,8],[425,12,425,13],[426,2,426,3],[426,7,426,8],[426,12,426,13],[435,2,435,4],[435,7,435,9],[435,12,435,14],[436,2,436,3],[436,7,436,8],[436,12,436,13],[433,2,433,3],[433,7,433,8],[433,12,433,13],[434,2,434,3],[434,7,434,8],[434,12,434,13],[431,2,431,3],[431,7,431,8],[431,12,431,13],[432,2,432,3],[432,7,432,8],[432,12,432,13],[441,2,441,3],[441,7,441,8],[441,12,441,13],[442,2,442,3],[442,7,442,8],[442,12,442,13],[439,2,439,3],[439,7,439,8],[439,12,439,13],[440,2,440,3],[440,7,440,8],[440,12,440,13],[437,2,437,3],[437,7,437,8],[437,12,437,13],[438,2,438,3],[438,7,438,8],[438,12,438,13],[447,2,447,3],[447,7,447,8],[447,12,447,13],[448,2,448,3],[448,7,448,8],[448,12,448,13],[445,2,445,3],[445,7,445,8],[445,12,445,13],[446,2,446,3],[446,7,446,8],[446,12,446,13],[443,2,443,3],[443,7,443,8],[443,12,443,13],[444,2,444,3],[444,7,444,8],[444,12,444,13],[453,2,453,3],[453,7,453,8],[453,12,453,13],[454,2,454,3],[454,7,454,8],[454,12,454,13],[451,2,451,3],[451,7,451,8],[451,12,451,13],[452,2,452,3],[452,7,452,8],[452,12,452,13],[449,2,449,3],[449,7,449,8],[449,12,449,13],[450,2,450,3],[450,7,450,8],[450,12,450,13],[459,2,459,3],[459,7,459,8],[459,12,459,13],[460,2,460,3],[460,7,460,8],[460,12,460,13],[457,2,457,3],[457,7,457,8],[457,12,457,13],[458,2,458,3],[458,7,458,8],[458,12,458,13],[455,2,455,3],[455,7,455,8],[455,12,455,13],[456,2,456,3],[456,7,456,8],[456,12,456,13],[465,2,465,3],[465,7,465,8],[465,12,465,13],[466,2,466,3],[466,7,466,8],[466,12,466,13],[463,2,463,3],[463,7,463,8],[463,12,463,13],[464,2,464,3],[464,7,464,8],[464,12,464,13],[461,2,461,3],[461,7,461,8],[461,12,461,13],[462,2,462,3],[462,7,462,8],[462,12,462,13],[472,2,472,3],[472,7,472,8],[472,12,472,13],[473,2,473,3],[473,7,473,8],[473,12,473,13],[469,2,469,6],[469,7,469,11],[469,12,469,16],[470,2,471,3],[470,4,470,6],[470,7,471,8],[470,9,470,11],[470,12,471,13],[470,14,470,16],[467,2,467,3],[467,7,467,8],[467,12,467,13],[468,2,468,3],[468,7,468,8],[468,12,468,13],[479,2,479,3],[479,7,479,8],[479,12,479,13],[480,2,480,3],[480,7,480,8],[480,12,480,13],[476,2,477,3],[476,7,477,8],[476,12,477,13],[478,2,478,3],[478,7,478,8],[478,12,478,13],[474,2,474,3],[474,7,474,8],[474,12,474,13],[475,2,475,4],[475,7,475,9],[475,12,475,14],[485,2,485,3],[485,7,485,8],[485,12,485,13],[486,2,486,3],[486,7,486,8],[486,12,486,13],[483,2,483,3],[483,7,483,8],[483,12,483,13],[484,2,484,3],[484,7,484,8],[484,12,484,13],[481,2,481,3],[481,7,481,8],[481,12,481,13],[482,2,482,3],[482,7,482,8],[482,12,482,13],[491,2,491,3],[491,7,491,8],[491,12,491,13],[492,2,492,3],[492,7,492,8],[492,12,492,13],[489,2,489,3],[489,7,489,8],[489,12,489,13],[490,2,490,3],[490,7,490,8],[490,12,490,13],[487,2,487,3],[487,7,487,8],[487,12,487,13],[488,2,488,3],[488,7,488,8],[488,12,488,13],[497,2,497,3],[497,7,497,8],[497,12,497,13],[498,2,498,3],[498,7,498,8],[498,12,498,13],[495,2,495,3],[495,7,495,8],[495,12,495,13],[496,2,496,3],[496,7,496,8],[496,12,496,13],[493,2,493,3],[493,7,493,8],[493,12,493,13],[494,2,494,3],[494,7,494,8],[494,12,494,13],[503,2,503,3],[503,7,503,8],[503,12,503,13],[504,2,504,3],[504,7,504,8],[504,12,504,13],[501,2,501,3],[501,7,501,8],[501,12,501,13],[502,2,502,3],[502,7,502,8],[502,12,502,13],[499,2,499,3],[499,7,499,8],[499,12,499,13],[500,2,500,3],[500,7,500,8],[500,12,500,13],[509,2,509,3],[509,7,509,8],[509,12,509,13],[510,2,510,4],[510,7,510,9],[510,12,510,14],[507,2,507,3],[507,7,507,8],[507,12,507,13],[508,2,508,3],[508,7,508,8],[508,12,508,13],[505,2,505,3],[505,7,505,8],[505,12,505,13],[506,2,506,3],[506,7,506,8],[506,12,506,13],[515,2,515,3],[515,7,515,8],[515,12,515,13],[516,2,516,3],[516,7,516,8],[516,12,516,13],[513,2,513,3],[513,7,513,8],[513,12,513,13],[514,2,514,3],[514,7,514,8],[514,12,514,13],[511,2,511,3],[511,7,511,8],[511,12,511,13],[512,2,512,3],[512,7,512,8],[512,12,512,13],[521,2,521,3],[521,7,521,8],[521,12,521,13],[522,2,522,3],[522,7,522,8],[522,12,522,13],[519,2,519,3],[519,7,519,8],[519,12,519,13],[520,2,520,3],[520,7,520,8],[520,12,520,13],[517,2,517,3],[517,7,517,8],[517,12,517,13],[518,2,518,3],[518,7,518,8],[518,12,518,13],[527,2,527,3],[527,7,527,8],[527,12,527,13],[528,2,528,3],[528,7,528,8],[528,12,528,13],[525,2,525,3],[525,7,525,8],[525,12,525,13],[526,2,526,3],[526,7,526,8],[526,12,526,13],[523,2,523,3],[523,7,523,8],[523,12,523,13],[524,2,524,3],[524,7,524,8],[524,12,524,13],[533,2,533,3],[533,7,533,8],[533,12,533,13],[534,2,534,3],[534,7,534,8],[534,12,534,13],[531,2,531,3],[531,7,531,8],[531,12,531,13],[532,2,532,3],[532,7,532,8],[532,12,532,13],[529,2,529,3],[529,7,529,8],[529,12,529,13],[530,2,530,3],[530,7,530,8],[530,12,530,13],[539,2,539,3],[539,7,539,8],[539,12,539,13],[540,2,540,3],[540,7,540,8],[540,12,540,13],[537,2,537,3],[537,7,537,8],[537,12,537,13],[538,2,538,3],[538,7,538,8],[538,12,538,13],[535,2,535,3],[535,7,535,8],[535,12,535,13],[536,2,536,3],[536,7,536,8],[536,12,536,13],[545,2,545,3],[545,7,545,8],[545,12,545,13],[546,2,546,3],[546,7,546,8],[546,12,546,13],[543,2,543,3],[543,7,543,8],[543,12,543,13],[544,2,544,3],[544,7,544,8],[544,12,544,13],[541,2,541,3],[541,7,541,8],[541,12,541,13],[542,2,542,3],[542,7,542,8],[542,12,542,13],[551,2,551,3],[551,7,551,8],[551,12,551,13],[552,2,552,3],[552,7,552,8],[552,12,552,13],[549,2,549,3],[549,7,549,8],[549,12,549,13],[550,2,550,3],[550,7,550,8],[550,12,550,13],[547,2,547,3],[547,7,547,8],[547,12,547,13],[548,2,548,3],[548,7,548,8],[548,12,548,13],[557,2,557,3],[557,7,557,8],[557,12,557,13],[558,2,558,3],[558,7,558,8],[558,12,558,13],[555,2,555,3],[555,7,555,8],[555,12,555,13],[556,2,556,3],[556,7,556,8],[556,12,556,13],[553,2,553,3],[553,7,553,8],[553,12,553,13],[554,2,554,3],[554,7,554,8],[554,12,554,13],[563,2,563,3],[563,7,563,8],[563,12,563,13],[564,2,564,3],[564,7,564,8],[564,12,564,13],[561,2,561,3],[561,7,561,8],[561,12,561,13],[562,2,562,3],[562,7,562,8],[562,12,562,13],[559,2,559,3],[559,7,559,8],[559,12,559,13],[560,2,560,3],[560,7,560,8],[560,12,560,13],[569,2,569,3],[569,7,569,8],[569,12,569,13],[570,2,570,3],[570,7,570,8],[570,12,570,13],[567,2,567,3],[567,7,567,8],[567,12,567,13],[568,2,568,3],[568,7,568,8],[568,12,568,13],[565,2,565,3],[565,7,565,8],[565,12,565,13],[566,2,566,3],[566,7,566,8],[566,12,566,13],[575,2,575,3],[575,7,575,8],[575,12,575,13],[576,2,576,3],[576,7,576,8],[576,12,576,13],[573,2,573,3],[573,7,573,8],[573,12,573,13],[574,2,574,3],[574,7,574,8],[574,12,574,13],[571,2,571,3],[571,7,571,8],[571,12,571,13],[572,2,572,3],[572,7,572,8],[572,12,572,13],[581,2,581,3],[581,7,581,8],[581,12,581,13],[582,2,582,3],[582,7,582,8],[582,12,582,13],[579,2,579,3],[579,7,579,8],[579,12,579,13],[580,2,580,3],[580,7,580,8],[580,12,580,13],[577,2,577,3],[577,7,577,8],[577,12,577,13],[578,2,578,3],[578,7,578,8],[578,12,578,13],[587,2,587,3],[587,7,587,8],[587,12,587,13],[588,2,588,3],[588,7,588,8],[588,12,588,13],[585,2,585,3],[585,7,585,8],[585,12,585,13],[586,2,586,3],[586,7,586,8],[586,12,586,13],[583,2,583,3],[583,7,583,8],[583,12,583,13],[584,2,584,3],[584,7,584,8],[584,12,584,13],[593,2,593,3],[593,7,593,8],[593,12,593,13],[594,2,594,3],[594,7,594,8],[594,12,594,13],[591,2,591,3],[591,7,591,8],[591,12,591,13],[592,2,592,3],[592,7,592,8],[592,12,592,13],[589,2,589,3],[589,7,589,8],[589,12,589,13],[590,2,590,3],[590,7,590,8],[590,12,590,13],[599,2,599,3],[599,7,599,8],[599,12,599,13],[600,2,600,3],[600,7,600,8],[600,12,600,13],[597,2,597,3],[597,7,597,8],[597,12,597,13],[598,2,598,3],[598,7,598,8],[598,12,598,13],[595,2,595,3],[595,7,595,8],[595,12,595,13],[596,2,596,3],[596,7,596,8],[596,12,596,13],[605,2,605,3],[605,7,605,8],[605,12,605,13],[606,2,606,3],[606,7,606,8],[606,12,606,13],[603,2,603,3],[603,7,603,8],[603,12,603,13],[604,2,604,3],[604,7,604,8],[604,12,604,13],[601,2,601,3],[601,7,601,8],[601,12,601,13],[602,2,602,3],[602,7,602,8],[602,12,602,13],[611,2,611,3],[611,7,611,8],[611,12,611,13],[612,2,612,3],[612,7,612,8],[612,12,612,13],[609,2,609,3],[609,7,609,8],[609,12,609,13],[610,2,610,3],[610,7,610,8],[610,12,610,13],[607,2,607,3],[607,7,607,8],[607,12,607,13],[608,2,608,3],[608,7,608,8],[608,12,608,13],[617,2,617,3],[617,7,617,8],[617,12,617,13],[618,2,618,3],[618,7,618,8],[618,12,618,13],[615,2,615,3],[615,7,615,8],[615,12,615,13],[616,2,616,3],[616,7,616,8],[616,12,616,13],[613,2,613,3],[613,7,613,8],[613,12,613,13],[614,2,614,3],[614,7,614,8],[614,12,614,13],[623,2,623,3],[623,7,623,8],[623,12,623,13],[624,2,624,3],[624,7,624,8],[624,12,624,13],[621,2,621,3],[621,7,621,8],[621,12,621,13],[622,2,622,3],[622,7,622,8],[622,12,622,13],[619,2,619,3],[619,7,619,8],[619,12,619,13],[620,2,620,3],[620,7,620,8],[620,12,620,13],[629,2,629,3],[629,7,629,8],[629,12,629,13],[630,2,630,3],[630,7,630,8],[630,12,630,13],[627,2,627,3],[627,7,627,8],[627,12,627,13],[628,2,628,3],[628,7,628,8],[628,12,628,13],[625,2,625,3],[625,7,625,8],[625,12,625,13],[626,2,626,3],[626,7,626,8],[626,12,626,13],[635,2,635,3],[635,7,635,8],[635,12,635,13],[636,2,636,3],[636,7,636,8],[636,12,636,13],[633,2,633,3],[633,7,633,8],[633,12,633,13],[634,2,634,3],[634,7,634,8],[634,12,634,13],[631,2,631,3],[631,7,631,8],[631,12,631,13],[632,2,632,3],[632,7,632,8],[632,12,632,13],[641,2,641,3],[641,7,641,8],[641,12,641,13],[642,2,642,3],[642,7,642,8],[642,12,642,13],[639,2,639,3],[639,7,639,8],[639,12,639,13],[640,2,640,3],[640,7,640,8],[640,12,640,13],[637,2,637,3],[637,7,637,8],[637,12,637,13],[638,2,638,3],[638,7,638,8],[638,12,638,13],[647,2,647,3],[647,7,647,8],[647,12,647,13],[648,2,648,3],[648,7,648,8],[648,12,648,13],[645,2,645,3],[645,7,645,8],[645,12,645,13],[646,2,646,3],[646,7,646,8],[646,12,646,13],[643,2,643,3],[643,7,643,8],[643,12,643,13],[644,2,644,3],[644,7,644,8],[644,12,644,13],[653,2,653,3],[653,7,653,8],[653,12,653,13],[654,2,654,3],[654,7,654,8],[654,12,654,13],[651,2,651,3],[651,7,651,8],[651,12,651,13],[652,2,652,3],[652,7,652,8],[652,12,652,13],[649,2,649,3],[649,7,649,8],[649,12,649,13],[650,2,650,3],[650,7,650,8],[650,12,650,13],[659,2,659,3],[659,7,659,8],[659,12,659,13],[660,2,660,3],[660,7,660,8],[660,12,660,13],[657,2,657,3],[657,7,657,8],[657,12,657,13],[658,2,658,3],[658,7,658,8],[658,12,658,13],[655,2,655,3],[655,7,655,8],[655,12,655,13],[656,2,656,3],[656,7,656,8],[656,12,656,13],[665,2,665,3],[665,7,665,8],[665,12,665,13],[666,2,666,3],[666,7,666,8],[666,12,666,13],[663,2,663,3],[663,7,663,8],[663,12,663,13],[664,2,664,3],[664,7,664,8],[664,12,664,13],[661,2,661,3],[661,7,661,8],[661,12,661,13],[662,2,662,3],[662,7,662,8],[662,12,662,13],[671,2,671,3],[671,7,671,8],[671,12,671,13],[672,2,672,3],[672,7,672,8],[672,12,672,13],[669,2,669,3],[669,7,669,8],[669,12,669,13],[670,2,670,3],[670,7,670,8],[670,12,670,13],[667,2,667,3],[667,7,667,8],[667,12,667,13],[668,2,668,3],[668,7,668,8],[668,12,668,13],[677,2,677,3],[677,7,677,8],[677,12,677,13],[678,2,678,3],[678,7,678,8],[678,12,678,13],[675,2,675,3],[675,7,675,8],[675,12,675,13],[676,2,676,3],[676,7,676,8],[676,12,676,13],[673,2,673,3],[673,7,673,8],[673,12,673,13],[674,2,674,3],[674,7,674,8],[674,12,674,13],[683,2,683,3],[683,7,683,8],[683,12,683,13],[684,2,684,3],[684,7,684,8],[684,12,684,13],[681,2,681,3],[681,7,681,8],[681,12,681,13],[682,2,682,3],[682,7,682,8],[682,12,682,13],[679,2,679,3],[679,7,679,8],[679,12,679,13],[680,2,680,3],[680,7,680,8],[680,12,680,13],[689,2,689,3],[689,7,689,8],[689,12,689,13],[690,2,690,3],[690,7,690,8],[690,12,690,13],[687,2,687,3],[687,7,687,8],[687,12,687,13],[688,2,688,3],[688,7,688,8],[688,12,688,13],[685,2,685,3],[685,7,685,8],[685,12,685,13],[686,2,686,3],[686,7,686,8],[686,12,686,13],[695,2,695,3],[695,7,695,8],[695,12,695,13],[696,2,696,3],[696,7,696,8],[696,12,696,13],[693,2,693,3],[693,7,693,8],[693,12,693,13],[694,2,694,3]],"merged_total":1314,"flags":["merged_cut"]}
[]
[{"$f":"A1026","v":"Comoros"}]
[{"$f":"A1034","v":"2000"}]
["Use of drinking water sources"]
[" by wealth quintile and sub-national region"]
["Notes:"]
["WHO/UNICEF JMP customised wealth index excludes water,"]
[" sanitation and hygiene assets."]
["Survey used for analysis:",{"$f":"A1025","v":"MICS00"}]
[{"$f":"B1028","v":""}]
[{"$f":"B1027","v":""}]
[]
[]
["Use of drinking water sources",null,"NATIONAL wealth index quintile",null,null,null,null,"URBAN wealth index quintile",null,null,null,null,"RURAL wealth index quintile",null,null,null,null,"Ile",null,null,null,null,null,null,null,null,null,null,null,null,null,null,null,null,null,null,null,null,null,null,null,null,null,null,null,null,null,null,null,null,null,null,"Raw numbers of respondents:","Use of drinking water sources","NATIONAL wealth index quintile",null,null,null,null,"URBAN wealth index quintile",null,null,null,null,"RURAL wealth index quintile",null,null,null,null,"SUB-REGIONS:"]
["Weighted percentage (used in graphs)",null,"Poorest","Poor","Middle","Rich","Richest","Poorest","Poor","Middle","Rich","Richest","Poorest","Poor","Middle","Rich","Richest","Mwali","Ndzuwani","Ngazidja",null,null,null,null,null,null,null,null,null,null,null,null,null,null,null,null,null,null,null,null,null,null,null,null,null,null,null,null,null,null,null,null,"Water data, raw numbers (weighted)",null,"Poorest","Poor","Middle","Rich","Richest","Poorest","Poor","Middle","Rich","Richest","Poorest","Poor","Middle","Rich","Richest","Mwali","Ndzuwani","Ngazidja"]
["Water","Improved",84.808898289707784,90.012171428886404,93.213277324941728,94.760427202708968,97.359378596339013,72.682164497675728,90.847464519223337,96.302893551744404,96.883132832061506,96.674952043832164,88.244591058804161,89.527228413501021,94.717201807828218,91.727809180696624,97.784086256001601,68.953493151195445,90.620316588771345,95.764236632782826,null,null,null,null,null,null,null,null,null,null,null,null,null,null,null,null,null,null,null,null,null,null,null,null,null,null,null,null,null,null,null,null,"Water","Improved","N/A","N/A","N/A","N/A","N/A","N/A","N/A","N/A","N/A","N/A","N/A","N/A","N/A","N/A","N/A","N/A","N/A","N/A"]
[null,"Not Improved",15.19110171029202,9.9878285711135835,6.7867226750583152,5.2395727972909256,2.6406214036609534,27.317835502324233,9.1525354807766632,3.6971064482555667,3.1168671679384832,3.3250479561678064,11.755408941195752,10.472771586498961,5.2827981921717786,8.2721908193033542,2.2159137439983607,31.046506848804594,9.3796834112285037,4.2357633672173005,null,null,null,null,null,null,null,null,null,null,null,null,null,null,null,null,null,null,null,null,null,null,null,null,null,null,null,null,null,null,null,null,null,"Not Improved","N/A","N/A","N/A","N/A","N/A","N/A","N/A","N/A","N/A","N/A","N/A","N/A","N/A","N/A","N/A","N/A","N/A","N/A"]
["Water ladder","Basic",{"$f":"C16*C23/100","v":79.703553770519292},{"$f":"D16*D23/100","v":84.975398505977736},{"$f":"E16*E23/100","v":90.206690414698556},92.338691039428028,97.044522724591857,71.614089946607038,89.059568538420876,95.673967592142944,96.660222526574927,96.674952043832164,82.224428993612776,84.348821186469976,91.734379090069012,87.386731066092366,97.102574033790575,68.829601350486016,86.406286190675033,92.689926390192667,null,null,null,null,null,null,null,null,null,null,null,null,null,null,null,null,null,null,null,null,null,null,null,null,null,null,null,null,null,null,null,null,"Water ladder","Basic","N/A","N/A","N/A","N/A","N/A","N/A","N/A","N/A","N/A","N/A","N/A","N/A","N/A","N/A","N/A","N/A","N/A","N/A"]
[null,"Limited",{"$f":"C16*C22/100","v":5.1053445191884128},{"$f":"D16*D22/100","v":5.0367729229085807},{"$f":"E16*E22/100","v":3.0065869102431804},2.4217361632809085,0.31485587174714796,1.0680745510686931,1.7878959808024635,0.62892595960148467,0.22291030548658697,0,6.0201620651913172,5.1784072270310562,2.9828227177592277,4.3410781146042634,0.68151222221099972,0.12389180070943627,4.214030398096317,3.0743102425901401,null,null,null,null,null,null,null,null,null,null,null,null,null,null,null,null,null,null,null,null,null,null,null,null,null,null,null,null,null,null,null,null,null,"Limited","N/A","N/A","N/A","N/A","N/A","N/A","N/A","N/A","N/A","N/A","N/A","N/A","N/A","N/A","N/A","N/A","N/A","N/A"]
[null,"Unimproved",{"$f":"100-C18-C19-C21","v":9.9240127114580119},{"$f":"100-D18-D19-D21","v":6.5559753052931544},{"$f":"100-E18-E19-E21","v":5.7976569140380789},4.8403538790664049,2.1377645791574205,27.002926848577129,9.1525354807766597,3.0086325118852431,3.1168671679384863,3.3250479561678361,6.0149019820277179,5.4323480796335835,4.3930227430003539,7.6678368087536848,1.2976608889174437,20.144028386374153,5.3111723496591337,4.2357633672171922,null,null,null,null,null,null,null,null,null,null,null,null,null,null,null,null,null,null,null,null,null,null,null,null,null,null,null,null,null,null,null,null,null,"Unimproved","N/A","N/A","N/A","N/A","N/A","N/A","N/A","N/A","N/A","N/A","N/A","N/A","N/A","N/A","N/A","N/A","N/A","N/A"]
[null,"Surface water",5.2670889988342822,3.431853265820529,0.9890657610201834,0.3992189182246591,0.50285682450357405,0.31490865374713833,0,0.68847393637032828,0,0,5.7405069591681883,5.0404235068653849,0.88977544917140594,0.60435401054968574,0.91825285508098231,10.902478462430395,4.0685110615695175,0,null,null,null,null,null,null,null,null,null,null,null,null,null,null,null,null,null,null,null,null,null,null,null,null,null,null,null,null,null,null,null,null,null,"Surface water","N/A","N/A","N/A","N/A","N/A","N/A","N/A","N/A","N/A","N/A","N/A","N/A","N/A","N/A","N/A","N/A","N/A","N/A"]
["Improved water point at more than 30 minutes","Yes",6.0198217665185565,5.5956576126905837,3.2254921149936724,2.5556408247299216,0.32339552314992637,1.4695139563473629,1.9680196803116552,0.65307067773987193,0.23008164473064946,0,6.8221315243895466,5.7841701556016609,3.1491879625108417,4.7325649150223112,0.69695616976650043,0.17967443714240366,4.6502048952436263,3.2102905538514115,null,null,null,null,null,null,null,null,null,null,null,null,null,null,null,null,null,null,null,null,null,null,null,null,null,null,null,null,null,null,null,null,"Improved water point at more than 30 minutes","Yes","N/A","N/A","N/A","N/A","N/A","N/A","N/A","N/A","N/A","N/A","N/A","N/A","N/A","N/A","N/A","N/A","N/A","N/A"]
[null,"No",93.980178233481354,94.404342387309327,96.774507885006329,97.444359175270051,99.676604476850073,98.530486043652644,98.031980319688344,99.346929322260152,99.769918355269354,100,93.177868475610381,94.215829844398357,96.850812037489177,95.267435084977691,99.303043830233463,99.820325562857604,95.349795104756382,96.789709446148564,null,null,null,null,null,null,null,null,null,null,null,null,null,null,null,null,null,null,null,null,null,null,null,null,null,null,null,null,null,null,null,null,null,"No","N/A","N/A","N/A","N/A","N/A","N/A","N/A","N/A","N/A","N/A","N/A","N/A","N/A","N/A","N/A","N/A","N/A","N/A"]
["Manually calculated ratios","Improved wells"]
[null,"Improved springs"]
[null,"Other"]
[null,null,"NATIONAL wealth index quintile",null,null,null,null,"URBAN wealth index quintile",null,null,null,null,"RURAL wealth index quintile",null,null,null,null,"Ile",null,null,null,null,null,null,null,null,null,null,null,null,null,null,null,null,null,null,null,null,null,null,null,null,null,null,null,null,null,null,null,null,null,null,"Raw numbers of respondents:","Use of drinking water sources","NATIONAL wealth index quintile",null,null,null,null,"URBAN wealth index quintile",null,null,null,null,"RURAL wealth index quintile",null,null,null,null,"SUB-REGIONS:"]
["Percentage based on weighted population",null,"Poorest","Poor","Middle","Rich","Richest","Poorest","Poor","Middle","Rich","Richest","Poorest","Poor","Middle","Rich","Richest","Mwali","Ndzuwani","Ngazidja",null,null,null,null,null,null,null,null,null,null,null,null,null,null,null,null,null,null,null,null,null,null,null,null,null,null,null,null,null,null,null,null,"Water data, raw numbers (weighted)",null,"Poorest","Poor","Middle","Rich","Richest","Poorest","Poor","Middle","Rich","Richest","Poorest","Poor","Middle","Rich","Richest","Mwali","Ndzuwani","Ngazidja"]
["Piped water","Yes",53.064261078338461,33.360022688031805,25.15890757253662,35.226475229671344,50.120535841285594,61.770171832283303,60.341205112791329,73.182217649069642,73.15646067863338,75.522327832649992,53.249926304650373,29.88455306352893,17.66557111902279,31.891205125738821,23.971233419833744,63.436062518757822,89.113235674685981,12.279763366835478,null,null,null,null,null,null,null,null,null,null,null,null,null,null,null,null,null,null,null,null,null,null,null,null,null,null,null,null,null,null,null,null,"Piped water","Yes","N/A","N/A","N/A","N/A","N/A","N/A","N/A","N/A","N/A","N/A","N/A","N/A","N/A","N/A","N/A","N/A","N/A","N/A"]
[null,"No",46.93573892166107,66.639977311967812,74.841092427463224,64.773524770328279,49.879464158714313,38.229828167716661,39.658794887208757,26.817782350930347,26.84353932136661,24.477672167349954,46.750073695349371,70.115446936470889,82.334428880977185,68.108794874261065,76.028766580166135,36.563937481242235,10.886764325313877,87.720236633164376,null,null,null,null,null,null,null,null,null,null,null,null,null,null,null,null,null,null,null,null,null,null,null,null,null,null,null,null,null,null,null,null,null,"No","N/A","N/A","N/A","N/A","N/A","N/A","N/A","N/A","N/A","N/A","N/A","N/A","N/A","N/A","N/A","N/A","N/A","N/A"]
["Piped water on premises","Yes",15.259055985011742,12.74674470172055,10.85195771308233,21.021093790717366,38.718378387842073,14.521066011724601,30.80872072087914,52.791565860332248,57.55016543601247,65.497111950610929,14.928758470695408,12.978920762293209,6.0026843842457716,15.00392173869735,16.154925282226586,27.53369826356894,45.250599451444742,6.4150374352714339,null,null,null,null,null,null,null,null,null,null,null,null,null,null,null,null,null,null,null,null,null,null,null,null,null,null,null,null,null,null,null,null,"Piped water on premises","Yes","N/A","N/A","N/A","N/A","N/A","N/A","N/A","N/A","N/A","N/A","N/A","N/A","N/A","N/A","N/A","N/A","N/A","N/A"]
[null,"No",84.740944014988017,87.253255298279456,89.148042286917644,78.978906209282329,61.281621612157764,85.478933988275358,69.191279279120863,47.208434139667773,42.44983456398753,34.502888049389,85.071241529304544,87.021079237706672,93.997315615754189,84.996078261302543,83.845074717773286,72.466301736431049,54.749400548554604,93.584962564728599,null,null,null,null,null,null,null,null,null,null,null,null,null,null,null,null,null,null,null,null,null,null,null,null,null,null,null,null,null,null,null,null,null,"No","N/A","N/A","N/A","N/A","N/A","N/A","N/A","N/A","N/A","N/A","N/A","N/A","N/A","N/A","N/A","N/A","N/A","N/A"]
["Piped water into dwelling","Yes","N/A","N/A","N/A","N/A","N/A","N/A","N/A","N/A","N/A","N/A","N/A","N/A","N/A","N/A","N/A","N/A","N/A","N/A",null,null,null,null,null,null,null,null,null,null,null,null,null,null,null,null,null,null,null,null,null,null,null,null,null,null,null,null,null,null,null,null,"Piped water into dwelling","Yes","N/A","N/A","N/A","N/A","N/A","N/A","N/A","N/A","N/A","N/A","N/A","N/A","N/A","N/A","N/A","N/A","N/A","N/A"]
[null,"No","N/A","N/A","N/A","N/A","N/A","N/A","N/A","N/A","N/A","N/A","N/A","N/A","N/A","N/A","N/A","N/A","N/A","N/A",null,null,null,null,null,null,null,null,null,null,null,null,null,null,null,null,null,null,null,null,null,null,null,null,null,null,null,null,null,null,null,null,null,"No","N/A","N/A","N/A","N/A","N/A","N/A","N/A","N/A","N/A","N/A","N/A","N/A","N/A","N/A","N/A","N/A","N/A","N/A"]
["Water source on premises","Yes",22.142312944151872,34.852653026921459,44.160680495964762,55.25117483170807,71.899885668086313,16.94269505670432,44.928266209904706,67.627959443604382,74.00876363235696,82.810932213738923,22.015101730234445,35.350988356518158,44.04976513815356,46.453611877522434,64.638468197071518,30.737774365952479,46.188633754179868,47.407231498465713,null,null,null,null,null,null,null,null,null,null,null,null,null,null,null,null,null,null,null,null,null,null,null,null,null,null,null,null,null,null,null,null,"Water source on premises","Yes","N/A","N/A","N/A","N/A","N/A","N/A","N/A","N/A","N/A","N/A","N/A","N/A","N/A","N/A","N/A","N/A","N/A","N/A"]
[null,"No",77.857687055847805,65.147346973078214,55.839319504035245,44.748825168291546,28.100114331913588,83.057304943295634,55.071733790095337,32.372040556395632,25.991236367642994,17.189067786261031,77.984898269765495,64.6490116434817,55.950234861846482,53.546388122477332,35.361531802928404,69.26222563404751,53.811366245819471,52.592768501535069,null,null,null,null,null,null,null,null,null,null,null,null,null,null,null,null,null,null,null,null,null,null,null,null,null,null,null,null,null,null,null,null,null,"No","N/A","N/A","N/A","N/A","N/A","N/A","N/A","N/A","N/A","N/A","N/A","N/A","N/A","N/A","N/A","N/A","N/A","N/A"]
["Improved Water source on premises","Yes",25.872816458969211,37.982329934233491,45.580257396062187,57.84126520382231,73.474554397623066,23.310663866162269,49.454617635914182,69.946638727428365,75.976343987738574,85.659139687178396,24.660240010164731,39.170677515829524,44.418452830367706,49.87231532923203,65.237094851400542,44.577544894720944,50.96940232925985,48.379820216656711,null,null,null,null,null,null,null,null,null,null,null,null,null,null,null,null,null,null,null,null,null,null,null,null,null,null,null,null,null,null,null,null,"Improved water source on premises","Yes","N/A","N/A","N/A","N/A","N/A","N/A","N/A","N/A","N/A","N/A","N/A","N/A","N/A","N/A","N/A","N/A","N/A","N/A"]
[null,"No",74.127183541030618,62.017670065766204,54.41974260393777,42.158734796177384,26.525445602376891,76.689336133837756,50.545382364085889,30.053361272571667,24.023656012261398,14.340860312821579,75.339759989835215,60.829322484170255,55.581547169632337,50.127684670767749,34.76290514859943,55.422455105279056,49.030597670739496,51.620179783343858,null,null,null,null,null,null,null,null,null,null,null,null,null,null,null,null,null,null,null,null,null,null,null,null,null,null,null,null,null,null,null,null,null,"No","N/A","N/A","N/A","N/A","N/A","N/A","N/A","N/A","N/A","N/A","N/A","N/A","N/A","N/A","N/A","N/A","N/A","N/A"]
["Piped water on premises available when needed","Yes","N/A","N/A","N/A","N/A","N/A","N/A","N/A","N/A","N/A","N/A","N/A","N/A","N/A","N/A","N/A","N/A","N/A","N/A",null,null,null,null,null,null,null,null,null,null,null,null,null,null,null,null,null,null,null,null,null,null,null,null,null,null,null,null,null,null,null,null,"Piped water on premises available when needed","Yes","N/A","N/A","N/A","N/A","N/A","N/A","N/A","N/A","N/A","N/A","N/A","N/A","N/A","N/A","N/A","N/A","N/A","N/A"]
[null,"No","N/A","N/A","N/A","N/A","N/A","N/A","N/A","N/A","N/A","N/A","N/A","N/A","N/A","N/A","N/A","N/A","N/A","N/A",null,null,null,null,null,null,null,null,null,null,null,null,null,null,null,null,null,null,null,null,null,null,null,null,null,null,null,null,null,null,null,null,null,"No","N/A","N/A","N/A","N/A","N/A","N/A","N/A","N/A","N/A","N/A","N/A","N/A","N/A","N/A","N/A","N/A","N/A","N/A"]
["Water point at more than 30 minutes","Yes",7.6492062792476041,6.3089725513950627,4.0461940528592759,3.3819685026389554,0.31584701643785468,2.3111912964771313,2.9036762389280266,1.3212758909655364,0.22349531631153102,0,8.7299651716888604,6.6693808050488839,3.2765440763367244,6.3118777771506069,0.82338796550031601,1.6958265558644496,7.3422871373382685,3.2319860237555029,null,null,null,null,null,null,null,null,null,null,null,null,null,null,null,null,null,null,null,null,null,null,null,null,null,null,null,null,null,null,null,null,"Water point at more than 30 minutes","Yes","N/A","N/A","N/A","N/A","N/A","N/A","N/A","N/A","N/A","N/A","N/A","N/A","N/A","N/A","N/A","N/A","N/A","N/A"]
[null,"No",92.350793720752307,93.691027448604956,95.953805947140708,96.618031497360988,99.684152983562143,97.688808703522866,97.096323761071972,98.678724109034462,99.776504683688472,100,91.270034828311111,93.330619194951055,96.723455923663252,93.688122222849373,99.176612034499684,98.3041734441356,92.657712862661654,96.768013976244561,null,null,null,null,null,null,null,null,null,null,null,null,null,null,null,null,null,null,null,null,null,null,null,null,null,null,null,null,null,null,null,null,null,"No","N/A","N/A","N/A","N/A","N/A","N/A","N/A","N/A","N/A","N/A","N/A","N/A","N/A","N/A","N/A","N/A","N/A","N/A"]
["Water source available when needed","Yes","N/A","N/A","N/A","N/A","N/A","N/A","N/A","N/A","N/A","N/A","N/A","N/A","N/A","N/A","N/A","N/A","N/A","N/A",null,null,null,null,null,null,null,null,null,null,null,null,null,null,null,null,null,null,null,null,null,null,null,null,null,null,null,null,null,null,null,null,"Water source available when needed","Yes","N/A","N/A","N/A","N/A","N/A","N/A","N/A","N/A","N/A","N/A","N/A","N/A","N/A","N/A","N/A","N/A","N/A","N/A"]
[null,"No","N/A","N/A","N/A","N/A","N/A","N/A","N/A","N/A","N/A","N/A","N/A","N/A","N/A","N/A","N/A","N/A","N/A","N/A",null,null,null,null,null,null,null,null,null,null,null,null,null,null,null,null,null,null,null,null,null,null,null,null,null,null,null,null,null,null,null,null,null,"No","N/A","N/A","N/A","N/A","N/A","N/A","N/A","N/A","N/A","N/A","N/A","N/A","N/A","N/A","N/A","N/A","N/A","N/A"]
["Improved water source available when needed","Yes","N/A","N/A","N/A","N/A","N/A","N/A","N/A","N/A","N/A","N/A","N/A","N/A","N/A","N/A","N/A","N/A","N/A","N/A",null,null,null,null,null,null,null,null,null,null,null,null,null,null,null,null,null,null,null,null,null,null,null,null,null,null,null,null,null,null,null,null,"Improved water source available when needed","Yes","N/A","N/A","N/A","N/A","N/A","N/A","N/A","N/A","N/A","N/A","N/A","N/A","N/A","N/A","N/A","N/A","N/A","N/A"]
[null,"No","N/A","N/A","N/A","N/A","N/A","N/A","N/A","N/A","N/A","N/A","N/A","N/A","N/A","N/A","N/A","N/A","N/A","N/A",null,null,null,null,null,null,null,null,null,null,null,null,null,null,null,null,null,null,null,null,null,null,null,null,null,null,null,null,null,null,null,null,null,"No","N/A","N/A","N/A","N/A","N/A","N/A","N/A","N/A","N/A","N/A","N/A","N/A","N/A","N/A","N/A","N/A","N/A","N/A"]
["Microbiological quality at point of collection","Not contaminated (No E. coli in 100 mL)","N/A","N/A","N/A","N/A","N/A","N/A","N/A","N/A","N/A","N/A","N/A","N/A","N/A","N/A","N/A","N/A","N/A","N/A",null,null,null,null,null,null,null,null,null,null,null,null,null,null,null,null,null,null,null,null,null,null,null,null,null,null,null,null,null,null,null,null,"Microbiological quality at point of collection","Not contaminated (No E. coli in 100 mL)","N/A","N/A","N/A","N/A","N/A","N/A","N/A","N/A","N/A","N/A","N/A","N/A","N/A","N/A","N/A","N/A","N/A","N/A"]
[null,"Contaminated (E. coli detected in 100 mL)","N/A","N/A","N/A","N/A","N/A","N/A","N/A","N/A","N/A","N/A","N/A","N/A","N/A","N/A","N/A","N/A","N/A","N/A",null,null,null,null,null,null,null,null,null,null,null,null,null,null,null,null,null,null,null,null,null,null,null,null,null,null,null,null,null,null,null,null,null,"Contaminated (E. coli detected in 100 mL)","N/A","N/A","N/A","N/A","N/A","N/A","N/A","N/A","N/A","N/A","N/A","N/A","N/A","N/A","N/A","N/A","N/A","N/A"]
[null,"Highly contaminated (>100 CFU/100 mL)","N/A","N/A","N/A","N/A","N/A","N/A","N/A","N/A","N/A","N/A","N/A","N/A","N/A","N/A","N/A","N/A","N/A","N/A",null,null,null,null,null,null,null,null,null,null,null,null,null,null,null,null,null,null,null,null,null,null,null,null,null,null,null,null,null,null,null,null,null,"Highly contaminated (>100 CFU/100 mL)","N/A","N/A","N/A","N/A","N/A","N/A","N/A","N/A","N/A","N/A","N/A","N/A","N/A","N/A","N/A","N/A","N/A","N/A"]
["Microbiological quality of improved water sources at point of collection","Not contaminated (No E. coli in 100 mL)","N/A","N/A","N/A","N/A","N/A","N/A","N/A","N/A","N/A","N/A","N/A","N/A","N/A","N/A","N/A","N/A","N/A","N/A",null,null,null,null,null,null,null,null,null,null,null,null,null,null,null,null,null,null,null,null,null,null,null,null,null,null,null,null,null,null,null,null,"Microbiological quality of improved water sources at point of collection","Not contaminated (No E. coli in 100 mL)","N/A","N/A","N/A","N/A","N/A","N/A","N/A","N/A","N/A","N/A","N/A","N/A","N/A","N/A","N/A","N/A","N/A","N/A"]
[null,"Contaminated (E. coli detected in 100 mL)","N/A","N/A","N/A","N/A","N/A","N/A","N/A","N/A","N/A","N/A","N/A","N/A","N/A","N/A","N/A","N/A","N/A","N/A",null,null,null,null,null,null,null,null,null,null,null,null,null,null,null,null,null,null,null,null,null,null,null,null,null,null,null,null,null,null,null,null,null,"Contaminated (E. coli detected in 100 mL)","N/A","N/A","N/A","N/A","N/A","N/A","N/A","N/A","N/A","N/A","N/A","N/A","N/A","N/A","N/A","N/A","N/A","N/A"]
[null,"Highly contaminated (>100 CFU/100 mL)","N/A","N/A","N/A","N/A","N/A","N/A","N/A","N/A","N/A","N/A","N/A","N/A","N/A","N/A","N/A","N/A","N/A","N/A",null,null,null,null,null,null,null,null,null,null,null,null,null,null,null,null,null,null,null,null,null,null,null,null,null,null,null,null,null,null,null,null,null,"Highly contaminated (>100 CFU/100 mL)","N/A","N/A","N/A","N/A","N/A","N/A","N/A","N/A","N/A","N/A","N/A","N/A","N/A","N/A","N/A","N/A","N/A","N/A"]
["Microbiological quality of piped on premises at point of collection","Not contaminated (No E. coli in 100 mL)","N/A","N/A","N/A","N/A","N/A","N/A","N/A","N/A","N/A","N/A","N/A","N/A","N/A","N/A","N/A","N/A","N/A","N/A",null,null,null,null,null,null,null,null,null,null,null,null,null,null,null,null,null,null,null,null,null,null,null,null,null,null,null,null,null,null,null,null,"Microbiological quality of piped on premises at point of collection","Not contaminated (No E. coli in 100 mL)","N/A","N/A","N/A","N/A","N/A","N/A","N/A","N/A","N/A","N/A","N/A","N/A","N/A","N/A","N/A","N/A","N/A","N/A"]
[null,"Contaminated (E. coli detected in 100 mL)","N/A","N/A","N/A","N/A","N/A","N/A","N/A","N/A","N/A","N/A","N/A","N/A","N/A","N/A","N/A","N/A","N/A","N/A",null,null,null,null,null,null,null,null,null,null,null,null,null,null,null,null,null,null,null,null,null,null,null,null,null,null,null,null,null,null,null,null,null,"Contaminated (E. coli detected in 100 mL)","N/A","N/A","N/A","N/A","N/A","N/A","N/A","N/A","N/A","N/A","N/A","N/A","N/A","N/A","N/A","N/A","N/A","N/A"]
[null,"Highly contaminated (>100 CFU/100 mL)","N/A","N/A","N/A","N/A","N/A","N/A","N/A","N/A","N/A","N/A","N/A","N/A","N/A","N/A","N/A","N/A","N/A","N/A",null,null,null,null,null,null,null,null,null,null,null,null,null,null,null,null,null,null,null,null,null,null,null,null,null,null,null,null,null,null,null,null,null,"Highly contaminated (>100 CFU/100 mL)","N/A","N/A","N/A","N/A","N/A","N/A","N/A","N/A","N/A","N/A","N/A","N/A","N/A","N/A","N/A","N/A","N/A","N/A"]
[null,null,"NATIONAL wealth index quintile",null,null,null,null,"URBAN wealth index quintile",null,null,null,null,"RURAL wealth index quintile",null,null,null,null,"Ile",null,null,null,null,null,null,null,null,null,null,null,null,null,null,null,null,null,null,null,null,null,null,null,null,null,null,null,null,null,null,null,null,null,null,"Raw numbers of respondents:","Use of drinking water sources","NATIONAL wealth index quintile",null,null,null,null,"URBAN wealth index quintile",null,null,null,null,"RURAL wealth index quintile",null,null,null,null,"SUB-REGIONS:"]
["Percentage based on weighted population",null,"Poorest","Poor","Middle","Rich","Richest","Poorest","Poor","Middle","Rich","Richest","Poorest","Poor","Middle","Rich","Richest","Mwali","Ndzuwani","Ngazidja",null,null,null,null,null,null,null,null,null,null,null,null,null,null,null,null,null,null,null,null,null,null,null,null,null,null,null,null,null,null,null,null,"Water data, raw numbers (weighted)",null,"Poorest","Poor","Middle","Rich","Richest","Poorest","Poor","Middle","Rich","Richest","Poorest","Poor","Middle","Rich","Richest","Mwali","Ndzuwani","Ngazidja"]
["Principal source d'eau","Eau du robinet dans le logement",4.2490831946071683,4.7820987925035423,3.9614507997919128,8.2297707658873378,19.536039008156532,3.4358243951381304,10.522797819684486,17.609479550332125,22.230013953629111,49.667145723403216,4.4356274742727884,4.6300499736453258,1.3901376446361848,7.3831084911065989,5.7779681543909733,1.198328323669172,20.802554551992529,2.988631335001902]
[null,"Eau du robinet dans la cours",11.009972790404571,7.9646459092170021,6.8905069132904178,12.791323024830023,19.182339379685505,11.085241616586472,20.285922901194667,35.182086310000138,35.320151482383324,15.829966227207759,10.493130996422618,8.348870788647881,4.6125467396095852,7.6208132475907577,10.376957127835613,26.335369939899767,24.448044899452171,3.4264061002695279]
[null,"Borne fontaine",37.805205093326684,20.61327798631131,14.306949859454324,14.205381438953978,11.402157453443534,47.249105820558739,29.532484391912174,20.390651788737433,15.606295242620918,10.025215882039056,38.321167833954981,16.905632301235752,11.662886734777009,16.887283387041457,7.8163081376071597,35.902364255188871,43.862636223240628,5.8647259315640659]
[null,"Puits à pompe",0.14341378468482921,0.39444587320020552,1.6342643452818402,0.82034107058055228,1.702962429612787,0.89689964628878371,4.2138285210153006,1.5148269724662249,2.5510578713218099,0.89274510419864328,8.459125971499204E-2,8.4769927741674189E-2,1.0253075776199294,0.69073141952643702,1.3269213847805585,0.34070245195094984,0.17873804417750258,1.3825177000371949]
[null,"Puits protégé",1.1345749801771297,1.8990668102588235,1.336767225661774,2.8103370044234763,4.7105591295001119,1.2556595048042973,4.1837813973684401,3.2078688828696524,6.135279906448976,4.151264734523691,0.78990238100158894,1.6107248190826589,2.1272523162637662,1.2926259790973218,4.1501583736753629,2.9736026208107678,0,3.4479162375561354]
[null,"Source protégée",1.7379783732271024,1.8312476164293199,1.2274744268974256,2.481028807142716,2.6267085421278917,0.37342182149921743,0,1.467560943304631,0,0,2.1052931957256198,1.8294884381592744,1.7800645778092754,1.8094838741226607,4.5977664847763977,0,0.69646131442631487,2.8635853142934731]
[null,"Eau de pluie / Citerne",28.728670073280011,52.273808820294796,63.646890210217663,53.422245090890605,37.70906430545287,8.0272518342846126,22.108649488048346,16.930419104034279,14.105831188855467,16.108614372459808,32.014877917711424,55.891639024343888,72.119006217112513,55.779024779223505,63.37098578437913,2.2031255596759234,0.49272121582083789,75.550517889609011]
[null,"Eau en bouteille",0,0.25357962067112466,0,0,0.33618894367808072,0.35875985851551351,0,0,0.22250075876234809,0,0,0.2260531406444645,0,0,0.36702080855632463,0,0,0.19045333237106102]
[null,"Puits non protégé",1.6215593022697532,1.8813697836777159,2.0534921899339214,0.66081723767129397,0.46416783189836286,0,8.8712179389795809E-2,0.26732240690580439,0.40050136577222645,0.22318627604966082,1.8414017348502387,1.7844250132086077,2.5351101371275844,1.1592006068598295,0.91155714747810979,2.3539442134792892,0,1.8424028307207956]
[null,"Source non protégée",2.1077034432081221,1.0640013659964909,1.4093334340403809,2.0038520825385793,6.340867225490146E-2,0.40360484082995263,0.88712179389795809,0.22276867242150364,0,0,2.6762412798595476,1.1508593386251018,0.76056994606168171,3.388646438243228,8.0732563512085201E-2,0.65043195372454055,3.6599169330767927,0.2983276580639852]
[null,"Mare, ruisseau ou fleuve",5.2070123405213646,3.4247145940696866,0.98531323378765157,0.39730934015827946,0.50154898698479133,0.3111848512493478,0,0.68016046276818731,0,0,5.6670789543204423,5.0404235068653849,0.88876982519726333,0.60144921832812837,0.91306796422973668,10.902478462430395,4.0530555137537041,0]
[null,"Camion citerne,vendeur d'eau",0,0,0.20897354434624255,0,0.1533594046816712,0,0,0,0.71200242803951386,0,0,0,0,0.26473800298775219,0,0,0.13916033966071453,4.9482792080442664E-2]
[null,"Autre",5.4059364958872766,1.9169806705084274,0.31508400955439941,0.71408236076611553,0.64219250710449804,26.042913077996104,5.2282961342814191,1.1583970965918189,1.6465056148413759,1.3391176562979648,0.64505334591660091,0.98559168760372684,0,0.15884280179265131,0,16.798949767219419,0.15482118844024137,0.60773361001138215]
[null,"Manquant",0.74492204759524228,1.4794511255832665,2.0234998077419619,1.2426709071509805,0.89262370307756411,0.56013273224882609,2.94840537320749,1.0565816681781475,1.0698601873248808,1.4056459821407237,0.79362090380032702,1.2289056143905559,1.0983482837852494,2.7661394553473513,0.31055606877842856,0.34070245195094984,1.4423096061274077,1.3192793610982485]
[null,"Ne sait pas",0.10396808081025644,0.2213110312779942,0,0.22084086900567601,7.6679702340835598E-2,0,0,0.31187614139010511,0,0.35709804167945736,0.13201272244859488,0.28256642580558067,0,0.19791229873216601,0,0,6.9580169830357266E-2,0.16801990732288752]
[]
[]
[]
[]
[]
[]
[]
[]
[]
[]
[]
[]
[]
[]
[]
[]
[]
[]
[]
[]
[]
[]
[]
[]
[]
[]
[]
[]
[]
[]
[]
[]
[]
[]
[]
[{"$f":"A1026","v":"Comoros"}]
[{"$f":"A1034","v":"2000"}]
["Use of sanitation facilities"]
[" by wealth quintile and sub-national region"]
["Notes:"]
["WHO/UNICEF JMP customised wealth index excludes water,"]
[" sanitation and hygiene assets."]
["Survey used for analysis:",{"$f":"A1025","v":"MICS00"}]
[{"$f":"B1030","v":"Ratio of Improved latrines based on:"},"WHS03"]
[{"$f":"B1029","v":"Ratio of Shared improved based on:"},"WHS03"]
[]
[]
["Use of sanitation facilities",null,"NATIONAL wealth index quintile",null,null,null,null,"URBAN wealth index quintile",null,null,null,null,"RURAL wealth index quintile",null,null,null,null,"Ile",null,null,null,null,null,null,null,null,null,null,null,null,null,null,null,null,null,null,null,null,null,null,null,null,null,null,null,null,null,null,null,null,null,null,"Raw numbers of respondents:","Use of sanitation facilities","NATIONAL wealth index quintile",null,null,null,null,"URBAN wealth index quintile",null,null,null,null,"RURAL wealth index quintile",null,null,null,null,"SUB-REGIONS:"]
["Weighted percentage (used in graphs)",null,"Poorest","Poor","Middle","Rich","Richest","Poorest","Poor","Middle","Rich","Richest","Poorest","Poor","Middle","Rich","Richest","Mwali","Ndzuwani","Ngazidja",null,null,null,null,null,null,null,null,null,null,null,null,null,null,null,null,null,null,null,null,null,null,null,null,null,null,null,null,null,null,null,null,"Sanitation data, raw numbers (weighted)",null,"Poorest","Poor","Middle","Rich","Richest","Poorest","Poor","Middle","Rich","Richest","Poorest","Poor","Middle","Rich","Richest","Mwali","Ndzuwani","Ngazidja"]
["Sanitation","Improved",{"$f":"C153+C154+C155+(C156)*'WHS03'!C130/100","v":6.1025540122145161},{"$f":"D153+D154+D155+(D156)*'WHS03'!D130/100","v":13.648393508642403},{"$f":"E153+E154+E155+(E156)*'WHS03'!E130/100","v":24.637577517067889},{"$f":"F153+F154+F155+(F156)*'WHS03'!F130/100","v":39.105448075847924},{"$f":"G153+G154+G155+(G156)*'WHS03'!G130/100","v":63.776679554962712},{"$f":"H153+H154+H155+(H156)*'WHS03'!H130/100","v":9.2364466832693868},{"$f":"I153+I154+I155+(I156)*'WHS03'!I130/100","v":32.727506247668991},{"$f":"J153+J154+J155+(J156)*'WHS03'!J130/100","v":39.398955154105067},{"$f":"K153+K154+K155+(K156)*'WHS03'!K130/100","v":56.162972570422674},{"$f":"L153+L154+L155+(L156)*'WHS03'!L130/100","v":82.651733127589722},{"$f":"M153+M154+M155+(M156)*'WHS03'!M130/100","v":5.9923445445608046},{"$f":"N153+N154+N155+(N156)*'WHS03'!N130/100","v":9.9036851315058776},{"$f":"O153+O154+O155+(O156)*'WHS03'!O130/100","v":18.104075384078264},{"$f":"P153+P154+P155+(P156)*'WHS03'!P130/100","v":32.242819142752779},{"$f":"Q153+Q154+Q155+(Q156)*'WHS03'!Q130/100","v":54.389268195959637},{"$f":"R153+R154+R155+(R156+R157)*'DHS12'!R130/100","v":41.626504258301239},{"$f":"S153+S154+S155+(S156+S157)*'DHS12'!S130/100","v":45.835866962081312},{"$f":"T153+T154+T155+(T156+T157)*'DHS12'!T130/100","v":14.941389660923752},null,null,null,null,null,null,null,null,null,null,null,null,null,null,null,null,null,null,null,null,null,null,null,null,null,null,null,null,null,null,null,null,"Sanitation","Improved","N/A","N/A","N/A","N/A","N/A","N/A","N/A","N/A","N/A","N/A","N/A","N/A","N/A","N/A","N/A","N/A","N/A","N/A"]
[null,"Not Improved",{"$f":"100-C122","v":93.897445987785488},{"$f":"100-D122","v":86.3516064913576},75.362422482932118,60.894551924152076,36.223320445037288,90.763553316730608,67.272493752331002,60.601044845894933,43.837027429577326,17.348266872410278,94.007655455439192,90.096314868494119,81.895924615921729,67.757180857247221,45.610731804040363,58.373495741698761,54.164133037918688,85.058610339076253,null,null,null,null,null,null,null,null,null,null,null,null,null,null,null,null,null,null,null,null,null,null,null,null,null,null,null,null,null,null,null,null,null,"Not Improved","N/A","N/A","N/A","N/A","N/A","N/A","N/A","N/A","N/A","N/A","N/A","N/A","N/A","N/A","N/A","N/A","N/A","N/A"]
["Sanitation ladder","Basic",{"$f":"C122*'WHS03'!C129/100","v":5.107864514953822},{"$f":"D122*'WHS03'!D129/100","v":12.549626826736057},{"$f":"E122*'WHS03'!E129/100","v":21.972031768437446},{"$f":"F122*'WHS03'!F129/100","v":36.99391698661767},{"$f":"G122*'WHS03'!G129/100","v":59.166214439919479},{"$f":"H122*'WHS03'!H129/100","v":8.1250774182384262},{"$f":"I122*'WHS03'!I129/100","v":30.21233953399792},{"$f":"J122*'WHS03'!J129/100","v":36.106165925987384},{"$f":"K122*'WHS03'!K129/100","v":51.840098353226068},{"$f":"L122*'WHS03'!L129/100","v":78.24485724818642},{"$f":"M122*'WHS03'!M129/100","v":5.0484776249485916},{"$f":"N122*'WHS03'!N129/100","v":8.5789690372433522},{"$f":"O122*'WHS03'!O129/100","v":16.811710626058176},{"$f":"P122*'WHS03'!P129/100","v":29.549537497106549},{"$f":"Q122*'WHS03'!Q129/100","v":51.028490897723643},{"$f":"R122*'DHS12'!R129/100","v":33.419367342559958},{"$f":"S122*'DHS12'!S129/100","v":31.983423418204374},{"$f":"T122*'DHS12'!T129/100","v":13.976194847880942},null,null,null,null,null,null,null,null,null,null,null,null,null,null,null,null,null,null,null,null,null,null,null,null,null,null,null,null,null,null,null,null,"Sanitation ladder","Basic","N/A","N/A","N/A","N/A","N/A","N/A","N/A","N/A","N/A","N/A","N/A","N/A","N/A","N/A","N/A","N/A","N/A","N/A"]
[null,"Limited",{"$f":"C122*'WHS03'!C128/100","v":0.99468949726069422},{"$f":"D122*'WHS03'!D128/100","v":1.0987666819063457},{"$f":"E122*'WHS03'!E128/100","v":2.6655457486304455},{"$f":"F122*'WHS03'!F128/100","v":2.1115310892302519},{"$f":"G122*'WHS03'!G128/100","v":4.6104651150432323},{"$f":"H122*'WHS03'!H128/100","v":1.1113692650309595},{"$f":"I122*'WHS03'!I128/100","v":2.5151667136710705},{"$f":"J122*'WHS03'!J128/100","v":3.2927892281176856},{"$f":"K122*'WHS03'!K128/100","v":4.3228742171966035},{"$f":"L122*'WHS03'!L128/100","v":4.4068758794032989},{"$f":"M122*'WHS03'!M128/100","v":0.94386691961221236},{"$f":"N122*'WHS03'!N128/100","v":1.3247160942625271},{"$f":"O122*'WHS03'!O128/100","v":1.2923647580200877},{"$f":"P122*'WHS03'!P128/100","v":2.6932816456462279},{"$f":"Q122*'WHS03'!Q128/100","v":3.3607772982359965},{"$f":"R122*'DHS12'!R128/100","v":8.2071369157412999},{"$f":"S122*'DHS12'!S128/100","v":13.852443543876994},{"$f":"T122*'DHS12'!T128/100","v":0.96519481304281374},null,null,null,null,null,null,null,null,null,null,null,null,null,null,null,null,null,null,null,null,null,null,null,null,null,null,null,null,null,null,null,null,null,"Limited","N/A","N/A","N/A","N/A","N/A","N/A","N/A","N/A","N/A","N/A","N/A","N/A","N/A","N/A","N/A","N/A","N/A","N/A"]
[null,"Unimproved",{"$f":"100-(C124+C125+C127)","v":92.266723007167784},{"$f":"100-(D124+D125+D127)","v":85.7717391814477},75.145437295320889,60.509499013427472,35.767004462381763,89.717652044091551,67.272493752331002,59.388751458203252,43.837027429577326,17.348266872410278,91.937056685575271,89.640815425239495,81.750489553616731,67.627822011030702,44.86828054781256,54.4649345756185,53.343087033920419,84.9155164687851,null,null,null,null,null,null,null,null,null,null,null,null,null,null,null,null,null,null,null,null,null,null,null,null,null,null,null,null,null,null,null,null,null,"Unimproved","N/A","N/A","N/A","N/A","N/A","N/A","N/A","N/A","N/A","N/A","N/A","N/A","N/A","N/A","N/A","N/A","N/A","N/A"]
[null,"Open defecation",{"$f":"C160","v":1.6307229806177042},{"$f":"D160","v":0.57986730990990165},0.21698518761122115,0.3850529107246034,0.45631598265552764,1.045901272639056,0,1.2122933876916773,0,0,2.0705987698639272,0.45549944325463126,0.14543506230500672,0.12935884621652713,0.74245125622780261,3.9085611660802391,0.8210460039982157,0.14309387029114415,null,null,null,null,null,null,null,null,null,null,null,null,null,null,null,null,null,null,null,null,null,null,null,null,null,null,null,null,null,null,null,null,null,"Open defecation","N/A","N/A","N/A","N/A","N/A","N/A","N/A","N/A","N/A","N/A","N/A","N/A","N/A","N/A","N/A","N/A","N/A","N/A"]
["Shared among Improved Sanitation","Yes","N/a","N/a","N/a","N/a","N/a","N/a","N/a","N/a","N/a","N/a","N/a","N/a","N/a","N/a","N/a","N/a","N/a","N/a",null,null,null,null,null,null,null,null,null,null,null,null,null,null,null,null,null,null,null,null,null,null,null,null,null,null,null,null,null,null,null,null,"Shared among improved sanitation facilities","Yes","N/A","N/A","N/A","N/A","N/A","N/A","N/A","N/A","N/A","N/A","N/A","N/A","N/A","N/A","N/A","N/A","N/A","N/A"]
[null,"No","N/a","N/a","N/a","N/a","N/a","N/a","N/a","N/a","N/a","N/a","N/a","N/a","N/a","N/a","N/a","N/a","N/a","N/a",null,null,null,null,null,null,null,null,null,null,null,null,null,null,null,null,null,null,null,null,null,null,null,null,null,null,null,null,null,null,null,null,null,"No","N/A","N/A","N/A","N/A","N/A","N/A","N/A","N/A","N/A","N/A","N/A","N/A","N/A","N/A","N/A","N/A","N/A","N/A"]
["Manually calculated ratios","Improved latrines"]
[null,"Other"]
[null,"Other"]
[null,null,"NATIONAL wealth index quintile",null,null,null,null,"URBAN wealth index quintile",null,null,null,null,"RURAL wealth index quintile",null,null,null,null,"Ile",null,null,null,null,null,null,null,null,null,null,null,null,null,null,null,null,null,null,null,null,null,null,null,null,null,null,null,null,null,null,null,null,null,null,"Raw numbers of respondents:","Use of sanitation facilities","NATIONAL wealth index quintile",null,null,null,null,"URBAN wealth index quintile",null,null,null,null,"RURAL wealth index quintile",null,null,null,null,"SUB-REGIONS:"]
["Percentage based on weighted population",null,"Poorest","Poor","Middle","Rich","Richest","Poorest","Poor","Middle","Rich","Richest","Poorest","Poor","Middle","Rich","Richest","Mwali","Ndzuwani","Ngazidja",null,null,null,null,null,null,null,null,null,null,null,null,null,null,null,null,null,null,null,null,null,null,null,null,null,null,null,null,null,null,null,null,"Sanitation data, raw numbers (weighted)",null,"Poorest","Poor","Middle","Rich","Richest","Poorest","Poor","Middle","Rich","Richest","Poorest","Poor","Middle","Rich","Richest","Mwali","Ndzuwani","Ngazidja"]
["Sanitation type","Sewer connection","N/A","N/A","N/A","N/A","N/A","N/A","N/A","N/A","N/A","N/A","N/A","N/A","N/A","N/A","N/A","N/A","N/A","N/A",null,null,null,null,null,null,null,null,null,null,null,null,null,null,null,null,null,null,null,null,null,null,null,null,null,null,null,null,null,null,null,null,"Sanitation type","Sewer connection","N/A","N/A","N/A","N/A","N/A","N/A","N/A","N/A","N/A","N/A","N/A","N/A","N/A","N/A","N/A","N/A","N/A","N/A"]
[null,"Septic tank connection","N/A","N/A","N/A","N/A","N/A","N/A","N/A","N/A","N/A","N/A","N/A","N/A","N/A","N/A","N/A","N/A","N/A","N/A",null,null,null,null,null,null,null,null,null,null,null,null,null,null,null,null,null,null,null,null,null,null,null,null,null,null,null,null,null,null,null,null,null,"Septic tank connection","N/A","N/A","N/A","N/A","N/A","N/A","N/A","N/A","N/A","N/A","N/A","N/A","N/A","N/A","N/A","N/A","N/A","N/A"]
[null,"Improved latrines","N/A","N/A","N/A","N/A","N/A","N/A","N/A","N/A","N/A","N/A","N/A","N/A","N/A","N/A","N/A","N/A","N/A","N/A",null,null,null,null,null,null,null,null,null,null,null,null,null,null,null,null,null,null,null,null,null,null,null,null,null,null,null,null,null,null,null,null,null,"Improved latrines","N/A","N/A","N/A","N/A","N/A","N/A","N/A","N/A","N/A","N/A","N/A","N/A","N/A","N/A","N/A","N/A","N/A","N/A"]
[null,"Unimproved facilities","N/A","N/A","N/A","N/A","N/A","N/A","N/A","N/A","N/A","N/A","N/A","N/A","N/A","N/A","N/A","N/A","N/A","N/A",null,null,null,null,null,null,null,null,null,null,null,null,null,null,null,null,null,null,null,null,null,null,null,null,null,null,null,null,null,null,null,null,null,"Unimproved facilities","N/A","N/A","N/A","N/A","N/A","N/A","N/A","N/A","N/A","N/A","N/A","N/A","N/A","N/A","N/A","N/A","N/A","N/A"]
[null,"Open defecation",1.6307229806177042,0.57986730990990165,0.21698518761122115,0.3850529107246034,0.45631598265552764,1.045901272639056,0,1.2122933876916773,0,0,2.0705987698639272,0.45549944325463126,0.14543506230500672,0.12935884621652713,0.74245125622780261,3.9085611660802391,0.8210460039982157,0.14309387029114415,null,null,null,null,null,null,null,null,null,null,null,null,null,null,null,null,null,null,null,null,null,null,null,null,null,null,null,null,null,null,null,null,null,"Open defecation","N/A","N/A","N/A","N/A","N/A","N/A","N/A","N/A","N/A","N/A","N/A","N/A","N/A","N/A","N/A","N/A","N/A","N/A"]
["Septic tank emptying practices","Not emptied/treated and disposed in situ","N/A","N/A","N/A","N/A","N/A","N/A","N/A","N/A","N/A","N/A","N/A","N/A","N/A","N/A","N/A","N/A","N/A","N/A",null,null,null,null,null,null,null,null,null,null,null,null,null,null,null,null,null,null,null,null,null,null,null,null,null,null,null,null,null,null,null,null,"Septic tank emptying practices","Not emptied/treated and disposed in situ","N/A","N/A","N/A","N/A","N/A","N/A","N/A","N/A","N/A","N/A","N/A","N/A","N/A","N/A","N/A","N/A","N/A","N/A"]
[null,"Emptied and buried on site","N/A","N/A","N/A","N/A","N/A","N/A","N/A","N/A","N/A","N/A","N/A","N/A","N/A","N/A","N/A","N/A","N/A","N/A",null,null,null,null,null,null,null,null,null,null,null,null,null,null,null,null,null,null,null,null,null,null,null,null,null,null,null,null,null,null,null,null,null,"Emptied and buried on site","N/A","N/A","N/A","N/A","N/A","N/A","N/A","N/A","N/A","N/A","N/A","N/A","N/A","N/A","N/A","N/A","N/A","N/A"]
[null,"Emptied and discharged locally","N/A","N/A","N/A","N/A","N/A","N/A","N/A","N/A","N/A","N/A","N/A","N/A","N/A","N/A","N/A","N/A","N/A","N/A",null,null,null,null,null,null,null,null,null,null,null,null,null,null,null,null,null,null,null,null,null,null,null,null,null,null,null,null,null,null,null,null,null,"Emptied and discharged locally","N/A","N/A","N/A","N/A","N/A","N/A","N/A","N/A","N/A","N/A","N/A","N/A","N/A","N/A","N/A","N/A","N/A","N/A"]
[null,"Emptied and removed offsite","N/A","N/A","N/A","N/A","N/A","N/A","N/A","N/A","N/A","N/A","N/A","N/A","N/A","N/A","N/A","N/A","N/A","N/A",null,null,null,null,null,null,null,null,null,null,null,null,null,null,null,null,null,null,null,null,null,null,null,null,null,null,null,null,null,null,null,null,null,"Emptied and removed offsite","N/A","N/A","N/A","N/A","N/A","N/A","N/A","N/A","N/A","N/A","N/A","N/A","N/A","N/A","N/A","N/A","N/A","N/A"]
["Latrine emptying practices","Not emptied/treated and disposed in situ","N/A","N/A","N/A","N/A","N/A","N/A","N/A","N/A","N/A","N/A","N/A","N/A","N/A","N/A","N/A","N/A","N/A","N/A",null,null,null,null,null,null,null,null,null,null,null,null,null,null,null,null,null,null,null,null,null,null,null,null,null,null,null,null,null,null,null,null,"Latrine emptying practices","Not emptied/treated and disposed in situ","N/A","N/A","N/A","N/A","N/A","N/A","N/A","N/A","N/A","N/A","N/A","N/A","N/A","N/A","N/A","N/A","N/A","N/A"]
[null,"Emptied and buried on site","N/A","N/A","N/A","N/A","N/A","N/A","N/A","N/A","N/A","N/A","N/A","N/A","N/A","N/A","N/A","N/A","N/A","N/A",null,null,null,null,null,null,null,null,null,null,null,null,null,null,null,null,null,null,null,null,null,null,null,null,null,null,null,null,null,null,null,null,null,"Emptied and buried on site","N/A","N/A","N/A","N/A","N/A","N/A","N/A","N/A","N/A","N/A","N/A","N/A","N/A","N/A","N/A","N/A","N/A","N/A"]
[null,"Emptied and discharged locally","N/A","N/A","N/A","N/A","N/A","N/A","N/A","N/A","N/A","N/A","N/A","N/A","N/A","N/A","N/A","N/A","N/A","N/A",null,null,null,null,null,null,null,null,null,null,null,null,null,null,null,null,null,null,null,null,null,null,null,null,null,null,null,null,null,null,null,null,null,"Emptied and discharged locally","N/A","N/A","N/A","N/A","N/A","N/A","N/A","N/A","N/A","N/A","N/A","N/A","N/A","N/A","N/A","N/A","N/A","N/A"]
[null,"Emptied and removed offsite","N/A","N/A","N/A","N/A","N/A","N/A","N/A","N/A","N/A","N/A","N/A","N/A","N/A","N/A","N/A","N/A","N/A","N/A",null,null,null,null,null,null,null,null,null,null,null,null,null,null,null,null,null,null,null,null,null,null,null,null,null,null,null,null,null,null,null,null,null,"Emptied and removed offsite","N/A","N/A","N/A","N/A","N/A","N/A","N/A","N/A","N/A","N/A","N/A","N/A","N/A","N/A","N/A","N/A","N/A","N/A"]
["Shared among improved sanitation facilities","Yes","N/A","N/A","N/A","N/A","N/A","N/A","N/A","N/A","N/A","N/A","N/A","N/A","N/A","N/A","N/A","N/A","N/A","N/A",null,null,null,null,null,null,null,null,null,null,null,null,null,null,null,null,null,null,null,null,null,null,null,null,null,null,null,null,null,null,null,null,"Shared among improved sanitation facilities","Yes","N/A","N/A","N/A","N/A","N/A","N/A","N/A","N/A","N/A","N/A","N/A","N/A","N/A","N/A","N/A","N/A","N/A","N/A"]
[null,"No","N/A","N/A","N/A","N/A","N/A","N/A","N/A","N/A","N/A","N/A","N/A","N/A","N/A","N/A","N/A","N/A","N/A","N/A",null,null,null,null,null,null,null,null,null,null,null,null,null,null,null,null,null,null,null,null,null,null,null,null,null,null,null,null,null,null,null,null,null,"No","N/A","N/A","N/A","N/A","N/A","N/A","N/A","N/A","N/A","N/A","N/A","N/A","N/A","N/A","N/A","N/A","N/A","N/A"]
[null,"DK/missing","N/A","N/A","N/A","N/A","N/A","N/A","N/A","N/A","N/A","N/A","N/A","N/A","N/A","N/A","N/A","N/A","N/A","N/A",null,null,null,null,null,null,null,null,null,null,null,null,null,null,null,null,null,null,null,null,null,null,null,null,null,null,null,null,null,null,null,null,null,"DK/missing","N/A","N/A","N/A","N/A","N/A","N/A","N/A","N/A","N/A","N/A","N/A","N/A","N/A","N/A","N/A","N/A","N/A","N/A"]
["Shared among all sanitation facilities","Yes","N/A","N/A","N/A","N/A","N/A","N/A","N/A","N/A","N/A","N/A","N/A","N/A","N/A","N/A","N/A","N/A","N/A","N/A",null,null,null,null,null,null,null,null,null,null,null,null,null,null,null,null,null,null,null,null,null,null,null,null,null,null,null,null,null,null,null,null,"Shared among all sanitation facilities","Yes","N/A","N/A","N/A","N/A","N/A","N/A","N/A","N/A","N/A","N/A","N/A","N/A","N/A","N/A","N/A","N/A","N/A","N/A"]
[null,"No","N/A","N/A","N/A","N/A","N/A","N/A","N/A","N/A","N/A","N/A","N/A","N/A","N/A","N/A","N/A","N/A","N/A","N/A",null,null,null,null,null,null,null,null,null,null,null,null,null,null,null,null,null,null,null,null,null,null,null,null,null,null,null,null,null,null,null,null,null,"No","N/A","N/A","N/A","N/A","N/A","N/A","N/A","N/A","N/A","N/A","N/A","N/A","N/A","N/A","N/A","N/A","N/A","N/A"]
["Type de toilette","Chase d'eau avec égout ou avec fosse septique",8.882771056973271E-2,0.1859267294105226,0.17928679458336169,0.93340306673454898,5.8952230333675626,0.87158439386587994,0.35484871755918324,0.84652095520171378,4.2457767284468755,17.58939692992189,0.11278834628665604,0,0.12927561093778378,0.90119019223443009,1.597206184238386,1.2912471742012492,2.2406089221622194,1.1022845279265483,null,null,null,null,null,null,null,null,null,null,null,null,null,null,null,null,null,null,null,null,null,null,null,null,null,null,null,null,null,null,null,null,"Type de toilette","Chase d'eau avec égout ou avec fosse septique",4.838692,10.162644999999999,9.7177679999999995,51.259822999999997,321.603655,10.162644999999999,4.183128,9.9349290000000003,49.889233000000004,206.04621199999997,4.838692,0,5.5346399999999996,38.557574000000002,68.43553,28.842054999999998,182.37282000000002,186.36770800000002]
[null,"Latrine à évacuation",0,0.20027834838499373,0.52353045511404328,0.64402144185893984,4.423620749987319,0,0.35484871755918324,1.5593807069505254,1.5793291434829986,15.659524441197641,0,0.25571222881477629,0.56509986597119843,0.49812102819065013,0.81873872677949344,0.18583770106415443,0.38096736152429544,1.661135408378946,null,null,null,null,null,null,null,null,null,null,null,null,null,null,null,null,null,null,null,null,null,null,null,null,null,null,null,null,null,null,null,null,null,"Latrine à évacuation",0,10.947096,28.376587999999998,35.367812999999998,241.32294800000008,0,4.183128,18.301185,18.557621999999999,183.43924500000008,0,10.947096,24.193459999999998,21.312192,35.080517,4.1509799999999997,31.008576000000005,280.85488900000007]
[null,"Latrine améliorée à ventillation",0.30953994215204195,0.15548885870383583,1.4247594218928394,2.4696455660003678,6.1718963074586801,0,1.7742435877959162,1.1284101022884871,1.7327968856213598,3.7413773001457478,0.39303611408050998,0.11302657032223225,0.55310051041618269,2.076021262344804,7.9902568624036636,0.49556720283774519,1.8043180382584652,2.466246015325666,null,null,null,null,null,null,null,null,null,null,null,null,null,null,null,null,null,null,null,null,null,null,null,null,null,null,null,null,null,null,null,null,null,"Latrine améliorée à ventillation",16.861499999999999,8.4989290000000004,77.225328000000005,135.62586100000001,336.6970849999999,0,20.91564,13.243233,20.360917000000001,43.827348000000001,16.861499999999999,4.838692,23.679735000000001,88.822918999999999,342.35871900000001,11.069279999999999,146.86122399999999,416.97819900000002]
[null,"Latrine traditionnelle",81.125952588725823,79.34708241510971,78.324583441817452,83.954132008489907,75.273009941459563,84.938548825305389,87.284153298577252,84.801248040003458,85.170633164775793,56.139136519512277,80.740512238915002,77.935628346819968,77.520657812919097,80.489552451391788,81.280713941074694,88.160041434297682,81.430904435597057,77.606824038252014,null,null,null,null,null,null,null,null,null,null,null,null,null,null,null,null,null,null,null,null,null,null,null,null,null,null,null,null,null,null,null,null,null,"Latrine traditionnelle",4419.1558610000111,4337.064568000008,4245.3775379999979,4610.5204710000107,4106.3883389999946,990.38064999999938,1028.947738999999,995.2433819999992,1000.7821499999994,657.62666399999966,3463.8194770000018,3336.4411600000071,3318.8698970000005,3443.759044000004,3482.6366140000023,1969.1944459999988,6628.0123810000405,13121.29994999995]
[null,"Trou ouvert",13.327991216526927,16.795436267311121,15.435055003203008,9.0172785873781809,5.5877120807427776,9.1174870243132755,7.6302482348536422,6.6567907398135731,7.0044631671580717,3.5709804167945731,13.532251379552715,17.838298001543997,18.052874135499231,12.178256819172354,5.6952353352219172,1.0338468395345446,10.5236706944921,14.201051390756522,null,null,null,null,null,null,null,null,null,null,null,null,null,null,null,null,null,null,null,null,null,null,null,null,null,null,null,null,null,null,null,null,null,"Trou ouvert",726.01268300000015,918.02860700000019,836.61646100000019,495.20311300000014,304.8279290000001,106.309595,89.94905,78.125346999999977,82.304680000000005,41.83128,580.54221600000005,763.66140800000016,772.89257100000032,521.048767,244.02387900000002,23.092610000000001,856.56692799999985,2401.029254999999]
[null,"Sceau",0.28021019046933998,0.10361308666645701,0.37940118649556792,6.6070543286015082E-2,0,0,0,0.30916384671281238,0,0,0,0.48883791011329658,0.48033488607551883,0,0,0,0.19765448902916891,0.17171264434937297,null,null,null,null,null,null,null,null,null,null,null,null,null,null,null,null,null,null,null,null,null,null,null,null,null,null,null,null,null,null,null,null,null,"Sceau",15.263826999999999,5.66343,20.564441000000002,3.6284049999999999,0,0,0,3.6284049999999999,0,0,0,20.927257000000001,20.564441000000002,0,0,0,16.087951,29.032152000000004]
[null,"Autre",3.2367553709381927,2.4552581594808962,3.474603800413171,2.5208744212106775,2.0639001035336961,4.026478483876355,2.5573013539599034,3.4861922213377396,0,2.9698121797069219,3.1508131513010476,2.6869443584866355,2.5003085841374824,3.7274994004493536,1.8753976940539783,4.9248984819843891,2.56408236392563,2.5502097880382411,null,null,null,null,null,null,null,null,null,null,null,null,null,null,null,null,null,null,null,null,null,null,null,null,null,null,null,null,null,null,null,null,null,"Autre",176.31505100000004,134.20295800000002,188.331738,138.43920299999999,112.59248600000004,46.948604999999993,30.146703000000002,40.914607000000004,0,34.789057999999997,135.17189400000001,115.02867099999999,107.045001,159.48168900000002,80.355208000000019,110.00542399999999,208.70171800000003,431.17429400000015]
[null,"Pas de toilette ou brousse ou champ",1.6307229806177042,0.57986730990990165,0.21698518761122115,0.3850529107246034,0.45631598265552764,1.045901272639056,0,1.2122933876916773,0,0,2.0705987698639272,0.45549944325463126,0.14543506230500672,0.12935884621652713,0.74245125622780261,3.9085611660802391,0.8210460039982157,0.14309387029114415,null,null,null,null,null,null,null,null,null,null,null,null,null,null,null,null,null,null,null,null,null,null,null,null,null,null,null,null,null,null,null,null,null,"Pas de toilette ou brousse ou champ",88.830007999999992,31.695203999999997,11.761109999999999,21.146002999999997,24.893526000000001,12.195173999999998,0,14.227702999999998,0,0,88.830007999999992,19.500029999999999,6.2264699999999991,5.5346399999999996,31.811825999999996,87.303916999999998,66.828474,24.193460000000002]
[null,"97",0,0.17704882502239533,4.1794708869248506E-2,9.5214543165296345E-3,0.12832180079472164,0,4.4356089694897904E-2,0,0.26700091051481772,0.32977221272092772,0,0.2260531406444645,5.2913531738532062E-2,0,0,0,3.6747691012619488E-2,9.7442316681817312E-2,null,null,null,null,null,null,null,null,null,null,null,null,null,null,null,null,null,null,null,null,null,null,null,null,null,null,null,null,null,null,null,null,null,"97",0,9.677384,2.2653720000000002,0.52289099999999999,7.0003729999999997,0,0.52289099999999999,0,3.137346,3.8630269999999998,0,9.677384,2.2653720000000002,0,0,0,2.991053,16.474966999999999]
[null,null,null,null,null,null,null,null,null,null,null,null,null,null,null,null,null,null,null,null,null,null,null,null,null,null,null,null,null,null,null,null,null,null,null,null,null,null,null,null,null,null,null,null,null,null,null,null,null,null,null,null,null,"Total",5447.2776220000242,5465.9408210000174,5420.2363440000026,5491.7135830000234,5455.3263410000027,1165.9966689999999,1178.8482789999994,1173.6187909999994,1175.0319480000003,1171.422834,4290.0637870000082,4281.0216980000077,4281.2715869999993,4278.5168250000079,4284.7022930000048,2233.6587119999986,8139.4311250000592,16907.404873999902]
[]
[]
[]
[]
[]
[]
[]
[]
[]
[]
[]
[]
[]
[]
[]
[]
[]
[]
[]
[]
[]
[]
[]
[]
[]
[]
[]
[]
[]
[]
[]
[]
[]
[]
[]
[]
[]
[]
[]
[]
[]
[]
[]
[]
[]
[{"$f":"A1026","v":"Comoros"}]
[{"$f":"A1034","v":"2000"}]
["Access to hygiene facilities "]
[" by wealth quintile and sub-national region"]
["Notes:"]
["WHO/UNICEF JMP customised wealth index excludes water,"]
[" sanitation and hygiene assets."]
["Survey used for analysis:",{"$f":"A1025","v":"MICS00"}]
[]
[]
[]
[]
["Access to handwashing",null,"NATIONAL wealth index quintile",null,null,null,null,"URBAN wealth index quintile",null,null,null,null,"RURAL wealth index quintile",null,null,null,null,"Ile",null,null,null,null,null,null,null,null,null,null,null,null,null,null,null,null,null,null,null,null,null,null,null,null,null,null,null,null,null,null,null,null,null,null,"Raw numbers of respondents:","Access to handwashing","NATIONAL wealth index quintile",null,null,null,null,"URBAN wealth index quintile",null,null,null,null,"RURAL wealth index quintile",null,null,null,null,"SUB-REGIONS:"]
["Weighted percentage (used in graphs)",null,"Poorest","Poor","Middle","Rich","Richest","Poorest","Poor","Middle","Rich","Richest","Poorest","Poor","Middle","Rich","Richest","Mwali","Ndzuwani","Ngazidja",null,null,null,null,null,null,null,null,null,null,null,null,null,null,null,null,null,null,null,null,null,null,null,null,null,null,null,null,null,null,null,null,"Hygiene data, raw numbers (weighted)",null,"Poorest","Poor","Middle","Rich","Richest","Poorest","Poor","Middle","Rich","Richest","Poorest","Poor","Middle","Rich","Richest","Mwali","Ndzuwani","Ngazidja"]
["Hygiene ladder","Basic","N/A","N/A","N/A","N/A","N/A","N/A","N/A","N/A","N/A","N/A","N/A","N/A","N/A","N/A","N/A","N/A","N/A","N/A",null,null,null,null,null,null,null,null,null,null,null,null,null,null,null,null,null,null,null,null,null,null,null,null,null,null,null,null,null,null,null,null,"Hygiene ladder","Basic","N/A","N/A","N/A","N/A","N/A","N/A","N/A","N/A","N/A","N/A","N/A","N/A","N/A","N/A","N/A","N/A","N/A","N/A"]
[null,"Limited","N/A","N/A","N/A","N/A","N/A","N/A","N/A","N/A","N/A","N/A","N/A","N/A","N/A","N/A","N/A","N/A","N/A","N/A",null,null,null,null,null,null,null,null,null,null,null,null,null,null,null,null,null,null,null,null,null,null,null,null,null,null,null,null,null,null,null,null,null,"Limited","N/A","N/A","N/A","N/A","N/A","N/A","N/A","N/A","N/A","N/A","N/A","N/A","N/A","N/A","N/A","N/A","N/A","N/A"]
[null,"No facility","N/A","N/A","N/A","N/A","N/A","N/A","N/A","N/A","N/A","N/A","N/A","N/A","N/A","N/A","N/A","N/A","N/A","N/A",null,null,null,null,null,null,null,null,null,null,null,null,null,null,null,null,null,null,null,null,null,null,null,null,null,null,null,null,null,null,null,null,null,"No facility","N/A","N/A","N/A","N/A","N/A","N/A","N/A","N/A","N/A","N/A","N/A","N/A","N/A","N/A","N/A","N/A","N/A","N/A"]
[null,null,null,null,null,null,null,null,null,null,null,null,null,null,null,null,null,null,null,null,null,null,null,null,null,null,null,null,null,null,null,null,null,null,null,null,null,null,null,null,null,null,null,null,null,null,null,null,null,null,null,null,"Observed handwashing place","Fixed","N/A","N/A","N/A","N/A","N/A","N/A","N/A","N/A","N/A","N/A","N/A","N/A","N/A","N/A","N/A","N/A","N/A","N/A"]
[null,null,null,null,null,null,null,null,null,null,null,null,null,null,null,null,null,null,null,null,null,null,null,null,null,null,null,null,null,null,null,null,null,null,null,null,null,null,null,null,null,null,null,null,null,null,null,null,null,null,null,null,null,"Mobile","N/A","N/A","N/A","N/A","N/A","N/A","N/A","N/A","N/A","N/A","N/A","N/A","N/A","N/A","N/A","N/A","N/A","N/A"]
[null,null,null,null,null,null,null,null,null,null,null,null,null,null,null,null,null,null,null,null,null,null,null,null,null,null,null,null,null,null,null,null,null,null,null,null,null,null,null,null,null,null,null,null,null,null,null,null,null,null,null,null,"Water / Soap","Water and soap","N/A","N/A","N/A","N/A","N/A","N/A","N/A","N/A","N/A","N/A","N/A","N/A","N/A","N/A","N/A","N/A","N/A","N/A"]
[null,null,null,null,null,null,null,null,null,null,null,null,null,null,null,null,null,null,null,null,null,null,null,null,null,null,null,null,null,null,null,null,null,null,null,null,null,null,null,null,null,null,null,null,null,null,null,null,null,null,null,null,null,"Water only","N/A","N/A","N/A","N/A","N/A","N/A","N/A","N/A","N/A","N/A","N/A","N/A","N/A","N/A","N/A","N/A","N/A","N/A"]
[null,null,null,null,null,null,null,null,null,null,null,null,null,null,null,null,null,null,null,null,null,null,null,null,null,null,null,null,null,null,null,null,null,null,null,null,null,null,null,null,null,null,null,null,null,null,null,null,null,null,null,null,null,"Soap only","N/A","N/A","N/A","N/A","N/A","N/A","N/A","N/A","N/A","N/A","N/A","N/A","N/A","N/A","N/A","N/A","N/A","N/A"]
[null,null,null,null,null,null,null,null,null,null,null,null,null,null,null,null,null,null,null,null,null,null,null,null,null,null,null,null,null,null,null,null,null,null,null,null,null,null,null,null,null,null,null,null,null,null,null,null,null,null,null,null,null,"Neither","N/A","N/A","N/A","N/A","N/A","N/A","N/A","N/A","N/A","N/A","N/A","N/A","N/A","N/A","N/A","N/A","N/A","N/A"]
[]
[]
[]
[]
[]
[]
[]
[]
[]
[]
[]
[]
[]
[]
[]
[]
[]
[]
[]
[]
[]
[]
[]
[]
[]
[]
[]
[]
[null,null,null,null,null,null,null,null,null,null,null,null,null,null,null,null,null,null,null,null,null,null,null,null,null,null,null,null,null,null,null,null,null,null,null,null,null,null,null,null,null,null,null,null,null,null,null,null,null,null,null,null,"Raw numbers of respondents:","Menstrual health and hygiene","NATIONAL wealth index quintile",null,null,null,null,"URBAN wealth index quintile",null,null,null,null,"RURAL wealth index quintile",null,null,null,null,"SUB-REGIONS:"]
[null,null,null,null,null,null,null,null,null,null,null,null,null,null,null,null,null,null,null,null,null,null,null,null,null,null,null,null,null,null,null,null,null,null,null,null,null,null,null,null,null,null,null,null,null,null,null,null,null,null,null,null,"MHH data, raw numbers (weighted)",null,"Poorest","Poor","Middle","Rich","Richest","Poorest","Poor","Middle","Rich","Richest","Poorest","Poor","Middle","Rich","Richest","Mwali","Ndzuwani","Ngazidja"]
[null,null,null,null,null,null,null,null,null,null,null,null,null,null,null,null,null,null,null,null,null,null,null,null,null,null,null,null,null,null,null,null,null,null,null,null,null,null,null,null,null,null,null,null,null,null,null,null,null,null,null,null,"Private place to wash and change","Yes","N/A","N/A","N/A","N/A","N/A","N/A","N/A","N/A","N/A","N/A","N/A","N/A","N/A","N/A","N/A","N/A","N/A","N/A"]
[null,null,null,null,null,null,null,null,null,null,null,null,null,null,null,null,null,null,null,null,null,null,null,null,null,null,null,null,null,null,null,null,null,null,null,null,null,null,null,null,null,null,null,null,null,null,null,null,null,null,null,null,null,"No","N/A","N/A","N/A","N/A","N/A","N/A","N/A","N/A","N/A","N/A","N/A","N/A","N/A","N/A","N/A","N/A","N/A","N/A"]
[null,null,null,null,null,null,null,null,null,null,null,null,null,null,null,null,null,null,null,null,null,null,null,null,null,null,null,null,null,null,null,null,null,null,null,null,null,null,null,null,null,null,null,null,null,null,null,null,null,null,null,null,null,"DK/not sure/missing","N/A","N/A","N/A","N/A","N/A","N/A","N/A","N/A","N/A","N/A","N/A","N/A","N/A","N/A","N/A","N/A","N/A","N/A"]
[null,null,null,null,null,null,null,null,null,null,null,null,null,null,null,null,null,null,null,null,null,null,null,null,null,null,null,null,null,null,null,null,null,null,null,null,null,null,null,null,null,null,null,null,null,null,null,null,null,null,null,null,"Use of menstrual materials","Materials reusable","N/A","N/A","N/A","N/A","N/A","N/A","N/A","N/A","N/A","N/A","N/A","N/A","N/A","N/A","N/A","N/A","N/A","N/A"]
[null,null,null,null,null,null,null,null,null,null,null,null,null,null,null,null,null,null,null,null,null,null,null,null,null,null,null,null,null,null,null,null,null,null,null,null,null,null,null,null,null,null,null,null,null,null,null,null,null,null,null,null,null,"Materials not reusable","N/A","N/A","N/A","N/A","N/A","N/A","N/A","N/A","N/A","N/A","N/A","N/A","N/A","N/A","N/A","N/A","N/A","N/A"]
[null,null,null,null,null,null,null,null,null,null,null,null,null,null,null,null,null,null,null,null,null,null,null,null,null,null,null,null,null,null,null,null,null,null,null,null,null,null,null,null,null,null,null,null,null,null,null,null,null,null,null,null,null,"No materials used","N/A","N/A","N/A","N/A","N/A","N/A","N/A","N/A","N/A","N/A","N/A","N/A","N/A","N/A","N/A","N/A","N/A","N/A"]
[null,null,null,null,null,null,null,null,null,null,null,null,null,null,null,null,null,null,null,null,null,null,null,null,null,null,null,null,null,null,null,null,null,null,null,null,null,null,null,null,null,null,null,null,null,null,null,null,null,null,null,null,null,"DK/not sure/missing","N/A","N/A","N/A","N/A","N/A","N/A","N/A","N/A","N/A","N/A","N/A","N/A","N/A","N/A","N/A","N/A","N/A","N/A"]
[null,null,null,null,null,null,null,null,null,null,null,null,null,null,null,null,null,null,null,null,null,null,null,null,null,null,null,null,null,null,null,null,null,null,null,null,null,null,null,null,null,null,null,null,null,null,null,null,null,null,null,null,"Use of menstrual materials with private place to wash and change","Materials reusable","N/A","N/A","N/A","N/A","N/A","N/A","N/A","N/A","N/A","N/A","N/A","N/A","N/A","N/A","N/A","N/A","N/A","N/A"]
[null,null,null,null,null,null,null,null,null,null,null,null,null,null,null,null,null,null,null,null,null,null,null,null,null,null,null,null,null,null,null,null,null,null,null,null,null,null,null,null,null,null,null,null,null,null,null,null,null,null,null,null,null,"Materials not reusable","N/A","N/A","N/A","N/A","N/A","N/A","N/A","N/A","N/A","N/A","N/A","N/A","N/A","N/A","N/A","N/A","N/A","N/A"]
[null,null,null,null,null,null,null,null,null,null,null,null,null,null,null,null,null,null,null,null,null,null,null,null,null,null,null,null,null,null,null,null,null,null,null,null,null,null,null,null,null,null,null,null,null,null,null,null,null,null,null,null,null,"No materials used","N/A","N/A","N/A","N/A","N/A","N/A","N/A","N/A","N/A","N/A","N/A","N/A","N/A","N/A","N/A","N/A","N/A","N/A"]
[null,null,null,null,null,null,null,null,null,null,null,null,null,null,null,null,null,null,null,null,null,null,null,null,null,null,null,null,null,null,null,null,null,null,null,null,null,null,null,null,null,null,null,null,null,null,null,null,null,null,null,null,"Awareness of menstruation before menarche","Yes","N/A","N/A","N/A","N/A","N/A","N/A","N/A","N/A","N/A","N/A","N/A","N/A","N/A","N/A","N/A","N/A","N/A","N/A"]
[null,null,null,null,null,null,null,null,null,null,null,null,null,null,null,null,null,null,null,null,null,null,null,null,null,null,null,null,null,null,null,null,null,null,null,null,null,null,null,null,null,null,null,null,null,null,null,null,null,null,null,null,null,"No","N/A","N/A","N/A","N/A","N/A","N/A","N/A","N/A","N/A","N/A","N/A","N/A","N/A","N/A","N/A","N/A","N/A","N/A"]
[null,null,null,null,null,null,null,null,null,null,null,null,null,null,null,null,null,null,null,null,null,null,null,null,null,null,null,null,null,null,null,null,null,null,null,null,null,null,null,null,null,null,null,null,null,null,null,null,null,null,null,null,null,"DK/not sure/missing","N/A","N/A","N/A","N/A","N/A","N/A","N/A","N/A","N/A","N/A","N/A","N/A","N/A","N/A","N/A","N/A","N/A","N/A"]
[null,null,null,null,null,null,null,null,null,null,null,null,null,null,null,null,null,null,null,null,null,null,null,null,null,null,null,null,null,null,null,null,null,null,null,null,null,null,null,null,null,null,null,null,null,null,null,null,null,null,null,null,"Participation in (all) activities during menstruation","Yes","N/A","N/A","N/A","N/A","N/A","N/A","N/A","N/A","N/A","N/A","N/A","N/A","N/A","N/A","N/A","N/A","N/A","N/A"]
[null,null,null,null,null,null,null,null,null,null,null,null,null,null,null,null,null,null,null,null,null,null,null,null,null,null,null,null,null,null,null,null,null,null,null,null,null,null,null,null,null,null,null,null,null,null,null,null,null,null,null,null,null,"No","N/A","N/A","N/A","N/A","N/A","N/A","N/A","N/A","N/A","N/A","N/A","N/A","N/A","N/A","N/A","N/A","N/A","N/A"]
[null,null,null,null,null,null,null,null,null,null,null,null,null,null,null,null,null,null,null,null,null,null,null,null,null,null,null,null,null,null,null,null,null,null,null,null,null,null,null,null,null,null,null,null,null,null,null,null,null,null,null,null,null,"DK/not sure/missing/no such activity","N/A","N/A","N/A","N/A","N/A","N/A","N/A","N/A","N/A","N/A","N/A","N/A","N/A","N/A","N/A","N/A","N/A","N/A"]
[null,null,null,null,null,null,null,null,null,null,null,null,null,null,null,null,null,null,null,null,null,null,null,null,null,null,null,null,null,null,null,null,null,null,null,null,null,null,null,null,null,null,null,null,null,null,null,null,null,null,null,null,"Participation in specific activities during menstruation","Did not go to school (amongst those usually attending school)","N/A","N/A","N/A","N/A","N/A","N/A","N/A","N/A","N/A","N/A","N/A","N/A","N/A","N/A","N/A","N/A","N/A","N/A"]
[null,null,null,null,null,null,null,null,null,null,null,null,null,null,null,null,null,null,null,null,null,null,null,null,null,null,null,null,null,null,null,null,null,null,null,null,null,null,null,null,null,null,null,null,null,null,null,null,null,null,null,null,null,"Did not go to work (amongst those who usually work)","N/A","N/A","N/A","N/A","N/A","N/A","N/A","N/A","N/A","N/A","N/A","N/A","N/A","N/A","N/A","N/A","N/A","N/A"]
[null,null,null,null,null,null,null,null,null,null,null,null,null,null,null,null,null,null,null,null,null,null,null,null,null,null,null,null,null,null,null,null,null,null,null,null,null,null,null,null,null,null,null,null,null,null,null,null,null,null,null,null,null,"Did not participate in social activities","N/A","N/A","N/A","N/A","N/A","N/A","N/A","N/A","N/A","N/A","N/A","N/A","N/A","N/A","N/A","N/A","N/A","N/A"]
[null,null,null,null,null,null,null,null,null,null,null,null,null,null,null,null,null,null,null,null,null,null,null,null,null,null,null,null,null,null,null,null,null,null,null,null,null,null,null,null,null,null,null,null,null,null,null,null,null,null,null,null,null,"Did not cook food","N/A","N/A","N/A","N/A","N/A","N/A","N/A","N/A","N/A","N/A","N/A","N/A","N/A","N/A","N/A","N/A","N/A","N/A"]
[null,null,null,null,null,null,null,null,null,null,null,null,null,null,null,null,null,null,null,null,null,null,null,null,null,null,null,null,null,null,null,null,null,null,null,null,null,null,null,null,null,null,null,null,null,null,null,null,null,null,null,null,null,"Did not eat with others","N/A","N/A","N/A","N/A","N/A","N/A","N/A","N/A","N/A","N/A","N/A","N/A","N/A","N/A","N/A","N/A","N/A","N/A"]
[null,null,null,null,null,null,null,null,null,null,null,null,null,null,null,null,null,null,null,null,null,null,null,null,null,null,null,null,null,null,null,null,null,null,null,null,null,null,null,null,null,null,null,null,null,null,null,null,null,null,null,null,null,"Did not bathe in regular place","N/A","N/A","N/A","N/A","N/A","N/A","N/A","N/A","N/A","N/A","N/A","N/A","N/A","N/A","N/A","N/A","N/A","N/A"]
[null,null,null,null,null,null,null,null,null,null,null,null,null,null,null,null,null,null,null,null,null,null,null,null,null,null,null,null,null,null,null,null,null,null,null,null,null,null,null,null,null,null,null,null,null,null,null,null,null,null,null,null,null,"Did not participate in other activities","N/A","N/A","N/A","N/A","N/A","N/A","N/A","N/A","N/A","N/A","N/A","N/A","N/A","N/A","N/A","N/A","N/A","N/A"]
[null,null,null,null,null,null,null,null,null,null,null,null,null,null,null,null,null,null,null,null,null,null,null,null,null,null,null,null,null,null,null,null,null,null,null,null,null,null,null,null,null,null,null,null,null,null,null,null,null,null,null,null,null,"DK/not sure/missing/no such activity","N/A","N/A","N/A","N/A","N/A","N/A","N/A","N/A","N/A","N/A","N/A","N/A","N/A","N/A","N/A","N/A","N/A","N/A"]
[]
[]
[]
[]
[]
[]
[]
[]
[]
[]
[]
[]
[]
[]
[]
[]
[]
[]
[]
[]
[]
[]
[]
[]
[]
[]
[]
[]
[]
[]
[]
[]
[]
[]
[]
[]
[]
[]
[]
[]
[]
[]
[]
[]
[]
[]
[]
[]
[]
[]
[]
[]
[]
[]
[null,null,null,null,null,null,null,null,null,null,null,null,null,null,null,null,null,null,null,null,null,null,null,null,null,null,null,null,null,null,null,null,null,null,null,null,null,null,null,null,null,null,null,null,null,null,null,null,null,null,null,null,"Raw numbers of respondents:","Basic water, sanitation and hygiene","NATIONAL wealth index quintile",null,null,null,null,"URBAN wealth index quintile",null,null,null,null,"RURAL wealth index quintile",null,null,null,null,"SUB-REGIONS:"]
[null,null,null,null,null,null,null,null,null,null,null,null,null,null,null,null,null,null,null,null,null,null,null,null,null,null,null,null,null,null,null,null,null,null,null,null,null,null,null,null,null,null,null,null,null,null,null,null,null,null,null,null,"WatSan data, raw numbers (weighted)",null,"Poorest","Poor","Middle","Rich","Richest","Poorest","Poor","Middle","Rich","Richest","Poorest","Poor","Middle","Rich","Richest","Mwali","Ndzuwani","Ngazidja"]
[null,null,null,null,null,null,null,null,null,null,null,null,null,null,null,null,null,null,null,null,null,null,null,null,null,null,null,null,null,null,null,null,null,null,null,null,null,null,null,null,null,null,null,null,null,null,null,null,null,null,null,null,"Use of Basic Water Sanitation and Hygiene","Yes","N/A","N/A","N/A","N/A","N/A","N/A","N/A","N/A","N/A","N/A","N/A","N/A","N/A","N/A","N/A","N/A","N/A","N/A"]
[null,null,null,null,null,null,null,null,null,null,null,null,null,null,null,null,null,null,null,null,null,null,null,null,null,null,null,null,null,null,null,null,null,null,null,null,null,null,null,null,null,null,null,null,null,null,null,null,null,null,null,null,null,"No","N/A","N/A","N/A","N/A","N/A","N/A","N/A","N/A","N/A","N/A","N/A","N/A","N/A","N/A","N/A","N/A","N/A","N/A"]
[null,null,null,null,null,null,null,null,null,null,null,null,null,null,null,null,null,null,null,null,null,null,null,null,null,null,null,null,null,null,null,null,null,null,null,null,null,null,null,null,null,null,null,null,null,null,null,null,null,null,null,null,"Use of Basic Water and Sanitation","Yes","N/A","N/A","N/A","N/A","N/A","N/A","N/A","N/A","N/A","N/A","N/A","N/A","N/A","N/A","N/A","N/A","N/A","N/A"]
[null,null,null,null,null,null,null,null,null,null,null,null,null,null,null,null,null,null,null,null,null,null,null,null,null,null,null,null,null,null,null,null,null,null,null,null,null,null,null,null,null,null,null,null,null,null,null,null,null,null,null,null,null,"No","N/A","N/A","N/A","N/A","N/A","N/A","N/A","N/A","N/A","N/A","N/A","N/A","N/A","N/A","N/A","N/A","N/A","N/A"]
[null,null,null,null,null,null,null,null,null,null,null,null,null,null,null,null,null,null,null,null,null,null,null,null,null,null,null,null,null,null,null,null,null,null,null,null,null,null,null,null,null,null,null,null,null,null,null,null,null,null,null,null,"Use of Basic Water and Hygiene","Yes","N/A","N/A","N/A","N/A","N/A","N/A","N/A","N/A","N/A","N/A","N/A","N/A","N/A","N/A","N/A","N/A","N/A","N/A"]
[null,null,null,null,null,null,null,null,null,null,null,null,null,null,null,null,null,null,null,null,null,null,null,null,null,null,null,null,null,null,null,null,null,null,null,null,null,null,null,null,null,null,null,null,null,null,null,null,null,null,null,null,null,"No","N/A","N/A","N/A","N/A","N/A","N/A","N/A","N/A","N/A","N/A","N/A","N/A","N/A","N/A","N/A","N/A","N/A","N/A"]
[null,null,null,null,null,null,null,null,null,null,null,null,null,null,null,null,null,null,null,null,null,null,null,null,null,null,null,null,null,null,null,null,null,null,null,null,null,null,null,null,null,null,null,null,null,null,null,null,null,null,null,null,"Use of Basic Sanitation and Hygiene","Yes","N/A","N/A","N/A","N/A","N/A","N/A","N/A","N/A","N/A","N/A","N/A","N/A","N/A","N/A","N/A","N/A","N/A","N/A"]
[null,null,null,null,null,null,null,null,null,null,null,null,null,null,null,null,null,null,null,null,null,null,null,null,null,null,null,null,null,null,null,null,null,null,null,null,null,null,null,null,null,null,null,null,null,null,null,null,null,null,null,null,null,"No","N/A","N/A","N/A","N/A","N/A","N/A","N/A","N/A","N/A","N/A","N/A","N/A","N/A","N/A","N/A","N/A","N/A","N/A"]
[null,null,null,null,null,null,null,null,null,null,null,null,null,null,null,null,null,null,null,null,null,null,null,null,null,null,null,null,null,null,null,null,null,null,null,null,null,null,null,null,null,null,null,null,null,null,null,null,null,null,null,null,"Use of Basic Water","Yes","N/A","N/A","N/A","N/A","N/A","N/A","N/A","N/A","N/A","N/A","N/A","N/A","N/A","N/A","N/A","N/A","N/A","N/A"]
[null,null,null,null,null,null,null,null,null,null,null,null,null,null,null,null,null,null,null,null,null,null,null,null,null,null,null,null,null,null,null,null,null,null,null,null,null,null,null,null,null,null,null,null,null,null,null,null,null,null,null,null,null,"No","N/A","N/A","N/A","N/A","N/A","N/A","N/A","N/A","N/A","N/A","N/A","N/A","N/A","N/A","N/A","N/A","N/A","N/A"]
[null,null,null,null,null,null,null,null,null,null,null,null,null,null,null,null,null,null,null,null,null,null,null,null,null,null,null,null,null,null,null,null,null,null,null,null,null,null,null,null,null,null,null,null,null,null,null,null,null,null,null,null,"Use of Basic Sanitation","Yes","N/A","N/A","N/A","N/A","N/A","N/A","N/A","N/A","N/A","N/A","N/A","N/A","N/A","N/A","N/A","N/A","N/A","N/A"]
[null,null,null,null,null,null,null,null,null,null,null,null,null,null,null,null,null,null,null,null,null,null,null,null,null,null,null,null,null,null,null,null,null,null,null,null,null,null,null,null,null,null,null,null,null,null,null,null,null,null,null,null,null,"No","N/A","N/A","N/A","N/A","N/A","N/A","N/A","N/A","N/A","N/A","N/A","N/A","N/A","N/A","N/A","N/A","N/A","N/A"]
[null,null,null,null,null,null,null,null,null,null,null,null,null,null,null,null,null,null,null,null,null,null,null,null,null,null,null,null,null,null,null,null,null,null,null,null,null,null,null,null,null,null,null,null,null,null,null,null,null,null,null,null,"Access to Basic Hygiene","Yes","N/A","N/A","N/A","N/A","N/A","N/A","N/A","N/A","N/A","N/A","N/A","N/A","N/A","N/A","N/A","N/A","N/A","N/A"]
[null,null,null,null,null,null,null,null,null,null,null,null,null,null,null,null,null,null,null,null,null,null,null,null,null,null,null,null,null,null,null,null,null,null,null,null,null,null,null,null,null,null,null,null,null,null,null,null,null,null,null,null,null,"No","N/A","N/A","N/A","N/A","N/A","N/A","N/A","N/A","N/A","N/A","N/A","N/A","N/A","N/A","N/A","N/A","N/A","N/A"]
[]
[]
[]
[]
[]
[]
[]
[]
[]
[]
[]
[]
[]
[]
[]
[]
[]
[]
[]
[]
[]
[]
[]
[]
[]
[]
[]
[]
[]
[]
[]
[]
[]
[]
[]
[]
[]
[]
[]
[]
[]
[]
[]
[]
[null,null,"INITIAL (national) Wealth Index",null,null,null,null,"URBAN Wealth Index",null,null,null,null,"RURAL Wealth Index"]
[null,null,"Component Matrix",null,null,null,null,"Component Matrix",null,null,null,null,"Component Matrix"]
[null,null,null,null,"Component",null,null,null,null,"Component",null,null,null,null,"Component"]
[null,"Note:\n\nThe INITIAL (national) Wealth Index is based on the first component of the Principal Component Analysis (PCA) which has been obtained at national level.\n\nThe final national-level (NATIONAL) Wealth Index is based on the URBAN and RURAL specific wealth indexes. Regression procedures are used to establish the relationships between the two sets of scores (urban and rural) and the initial (national) wealth factors.\nThis allows best use of the available information for each area and a better precision of the FINAL (NATIONAL) Wealth Index.\n\nFor dependency reasons, all WASH variables (contained in the generic MICS and DHS scripts) have been excluded from the sets of asset variables used in the PCAs.\n\nThe PCA can extracts as many components as there are asset variables in the input. Only the first of the components is used to represent the Wealth Index. \n\nThe scores represent the weights of the asset variables on the Wealth Index (correlations between the variables and the component).\n\nThe communalities are the proportion of each variable's variance that can be explained by the component.\n\nProportion of explained variance is the part of the model's total variance that is explained by the component.\n\nFor more information on the procedure used:\n\nThe DHS Wealth Index, DHS Comparative Reports No. 6, Shea Oscar Rutstein, Kiersten Johnson, ORC Macro International Inc., 2004.\n\nThe DHS Wealth Index: Approaches for Rural and Urban Areas, Shea O. Rutstein, ORC Macro International Inc., 2008.\n\nMICS Methodological Paper No. 4, Review of options for reporting water, sanitation and hygiene coverage by wealth quintile, UNICEF, 2016.",null,null,"1",null,null,null,null,"1",null,null,null,null,"1"]
[null,null,"TV/Vidéo",null,0.69245646717187193,null,null,"TV/Vidéo",null,0.70913131930358864,null,null,"Has earth/sand floor",null,-0.71475416801136027]
[null,null,"Electricité",null,0.6709285803591114,null,null,"Electricité",null,0.65513690082103015,null,null,"Has cement floor",null,0.70985733395911454]
[null,null,"Has earth/sand floor",null,-0.65198169408354867,null,null,"Has cement wall",null,0.64209335013811919,null,null,"Has jute roof",null,-0.67291502880167853]
[null,null,"Réfrigérateur",null,0.645569812902689,null,null,"Réfrigérateur",null,0.6362055815514549,null,null,"Has jute wall",null,-0.63252780167941824]
[null,null,"Has cement wall",null,0.62302837686592794,null,null,"Has jute roof",null,-0.60958347891524689,null,null,"Electricité",null,0.61801992555341601]
[null,null,"Has jute roof",null,-0.59863290317155182,null,null,"Téléphone",null,0.59760658462054195,null,null,"TV/Vidéo",null,0.57937526991912158]
[null,null,"Has cement/concrete roof",null,0.57101768109868045,null,null,"Has cement/concrete roof",null,0.5953187532830263,null,null,"Réfrigérateur",null,0.57036255029527061]
[null,null,"Has cement floor",null,0.56456452124333978,null,null,"Has jute wall",null,-0.54515577541499582,null,null,"Has cement wall",null,0.558067489464669]
[null,null,"Has jute wall",null,-0.55892930222092263,null,null,"Household fuel type: grass, straw",null,-0.54078175049001376,null,null,"Has cement/concrete roof",null,0.48299358967401801]
[null,null,"Household fuel type: grass, straw",null,-0.55540030672894869,null,null,"Has earth/sand floor",null,-0.53319180931390364,null,null,"Radio",null,0.46324588731362665]
[null,null,"Téléphone",null,0.54698803325694156,null,null,"Household fuel type: kerosene",null,0.52660689999675747,null,null,"Voiture",null,0.4208129006230984]
[null,null,"Household fuel type: kerosene",null,0.54212679461285207,null,null,"Radio",null,0.4987786561765099,null,null,"Téléphone",null,0.35317648569357751]
[null,null,"Radio",null,0.47404054392792572,null,null,"Voiture",null,0.38235985907167241,null,null,"Persons per sleeping rooms",null,-0.32046931308981585]
[null,null,"Voiture",null,0.42874550506992198,null,null,"Has cement floor",null,0.35569712217311483,null,null,"Household fuel type: grass, straw",null,-0.30581364374623088]
[null,null,"Persons per sleeping rooms",null,-0.32939839381906227,null,null,"Persons per sleeping rooms",null,-0.31979432226499682,null,null,"Household fuel type: kerosene",null,0.28227043598191215]
[null,null,"Domestique",null,0.25763076221011771,null,null,"Has ceramic tile floor",null,0.30310870779891852,null,null,"Has uncovered adobe wall",null,-0.24821281188998445]
[null,null,"Has uncovered adobe wall",null,-0.25657533409148536,null,null,"Has uncovered adobe wall",null,-0.29882761073727815,null,null,"Domestique",null,0.2180590080023635]
[null,null,"Has ceramic tile floor",null,0.23563294194681966,null,null,"Domestique",null,0.28025060284951903,null,null,"Has corrugated iron roof",null,0.2045088442378229]
[null,null,"Has wood roof",null,-0.1087198028064513,null,null,"Has other floor",null,-0.19909482396730452,null,null,"Has corrugated iron Wall",null,0.19968584845096551]
[null,null,"Household fuel type: charcoal",null,8.24663949066341E-2,null,null,"Has corrugated iron roof",null,-0.14669192798606742,null,null,"Has wood roof",null,-0.10727658127810927]
[null,null,"Household fuel type: LPG",null,6.0193112074806772E-2,null,null,"Has corrugated iron Wall",null,-0.14151272108860424,null,null,"Has rustic mat roof",null,9.9015774921952279E-2]
[null,null,"Has rustic mat roof",null,5.474101198552779E-2,null,null,"Has wood roof",null,-8.4583020246913096E-2,null,null,"Household fuel type: animal dung",null,9.2639479155476462E-2]
[null,null,"Has other floor",null,-4.8371850482115182E-2,null,null,"Household fuel type: charcoal",null,5.7279636452244549E-2,null,null,"Has wood floor",null,-8.5422126277136995E-2]
[null,null,"Household fuel type: animal dung",null,4.6082672939776116E-2,null,null,"Has reused wood wall",null,-4.8798292579110211E-2,null,null,"Has ceramic tile floor",null,7.5302253987527476E-2]
[null,null,"Has wood floor",null,-3.6696833399244191E-2,null,null,"Household fuel type: LPG",null,3.5440369986192252E-2,null,null,"Household fuel type: charcoal",null,7.4008981952005684E-2]
[null,null,"Has other roof",null,-1.8219482948299753E-2,null,null,"Household fuel type: animal dung",null,2.8846516462686704E-2,null,null,"Household fuel type: LPG",null,6.4780453540285873E-2]
[null,null,"Has reused wood wall",null,6.7571009906375349E-3,null,null,"Has bamboo with mud wall",null,1.8023412155529224E-2,null,null,"Has bamboo with mud wall",null,-3.4459425691178408E-2]
[null,null,"Has corrugated iron Wall",null,-5.8942710594709954E-3,null,null,"Has rustic mat roof",null,-1.77578893144439E-2,null,null,"Has other floor",null,-2.2036245865648993E-2]
[null,null,"Has corrugated iron roof",null,3.3208027265186381E-3,null,null,"Has other roof",null,-1.7507701235249383E-2,null,null,"Has other roof",null,-1.2107846871415293E-2]
[null,null,"Has bamboo with mud wall",null,1.3835548476563257E-3,null,null,"Has wood floor",null,-2.3190385493608687E-3,null,null,"Has reused wood wall",null,6.6133369852084531E-3]
[]
[]
[]
[null,null,"Communalities",null,null,null,null,"Communalities",null,null,null,null,"Communalities"]
[null,null,null,null,"Extraction",null,null,null,null,"Extraction",null,null,null,null,"Extraction"]
[null,null,"Téléphone",null,0.29919590852629702,null,null,"Téléphone",null,0.35713362998182896,null,null,"Téléphone",null,0.12473363004686576]
[null,null,"Electricité",null,0.45014515994269261,null,null,"Electricité",null,0.42920435881738428,null,null,"Electricité",null,0.38194862838104987]
[null,null,"Réfrigérateur",null,0.4167603833312129,null,null,"Réfrigérateur",null,0.40475754199722491,null,null,"Réfrigérateur",null,0.32531343877932511]
[null,null,"Radio",null,0.22471443728748366,null,null,"Radio",null,0.24878014785724509,null,null,"Radio",null,0.21459675211298929]
[null,null,"TV/Vidéo",null,0.47949595892814972,null,null,"TV/Vidéo",null,0.50286722801724815,null,null,"TV/Vidéo",null,0.335675703393855]
[null,null,"Voiture",null,0.18382270811766249,null,null,"Voiture",null,0.1461990618293092,null,null,"Voiture",null,0.17708349733082568]
[null,null,"Domestique",null,6.6373609636966216E-2,null,null,"Domestique",null,7.8540400397518847E-2,null,null,"Domestique",null,4.7549730970974827E-2]
[null,null,"Persons per sleeping rooms",null,0.10850330185057805,null,null,"Persons per sleeping rooms",null,0.10226840855292864,null,null,"Persons per sleeping rooms",null,0.10270058063225843]
[null,null,"Has earth/sand floor",null,0.42508012942005402,null,null,"Has earth/sand floor",null,0.28429350551943416,null,null,"Has earth/sand floor",null,0.51087352068961178]
[null,null,"Has wood floor",null,1.3466575815318841E-3,null,null,"Has wood floor",null,5.3779397934217619E-6,null,null,"Has wood floor",null,7.2969396577071384E-3]
[null,null,"Has ceramic tile floor",null,5.5522883330513285E-2,null,null,"Has ceramic tile floor",null,9.187488874353017E-2,null,null,"Has ceramic tile floor",null,5.670429455602098E-3]
[null,null,"Has cement floor",null,0.31873309864672145,null,null,"Has cement floor",null,0.12652044272223578,null,null,"Has cement floor",null,0.50389743457554192]
[null,null,"Has other floor",null,2.3398359190641067E-3,null,null,"Has other floor",null,3.9638748930571975E-2,null,null,"Has other floor",null,4.8559613185133235E-4]
[null,null,"Has cement wall",null,0.38816435838019275,null,null,"Has cement wall",null,0.4122838702915933,null,null,"Has cement wall",null,0.31143932279739844]
[null,null,"Has jute wall",null,0.31240196488116745,null,null,"Has jute wall",null,0.29719481946832538,null,null,"Has jute wall",null,0.40009141989739744]
[null,null,"Has reused wood wall",null,4.5658413797674757E-5,null,null,"Has reused wood wall",null,2.3812733586364427E-3,null,null,"Has reused wood wall",null,4.373622607992603E-5]
[null,null,"Has corrugated iron Wall",null,3.4742431322517328E-5,null,null,"Has corrugated iron Wall",null,2.0025850229901096E-2,null,null,"Has corrugated iron Wall",null,3.9874438071581968E-2]
[null,null,"Has bamboo with mud wall",null,1.9142240164733187E-6,null,null,"Has bamboo with mud wall",null,3.2484338572807861E-4,null,null,"Has bamboo with mud wall",null,1.1874520189658466E-3]
[null,null,"Has uncovered adobe wall",null,6.5830902064157329E-2,null,null,"Has uncovered adobe wall",null,8.9297940938950229E-2,null,null,"Has uncovered adobe wall",null,6.1609599986332808E-2]
[null,null,"Has jute roof",null,0.35836135275960052,null,null,"Has jute roof",null,0.37159201776641526,null,null,"Has jute roof",null,0.45281463598716382]
[null,null,"Has cement/concrete roof",null,0.32606119212731433,null,null,"Has cement/concrete roof",null,0.35440441801045675,null,null,"Has cement/concrete roof",null,0.23328280766619366]
[null,null,"Has wood roof",null,1.1819995522273656E-2,null,null,"Has wood roof",null,7.1542873140897105E-3,null,null,"Has wood roof",null,1.1508264890718784E-2]
[null,null,"Has rustic mat roof",null,2.9965783931996974E-3,null,null,"Has rustic mat roof",null,3.1534263290404084E-4,null,null,"Has rustic mat roof",null,9.8041236833947137E-3]
[null,null,"Has other roof",null,3.3194955890338549E-4,null,null,"Has other roof",null,3.0651960254275278E-4,null,null,"Has other roof",null,1.4659995586164108E-4]
[null,null,"Has corrugated iron roof",null,1.1027730748453621E-5,null,null,"Has corrugated iron roof",null,2.1518521736269589E-2,null,null,"Has corrugated iron roof",null,4.182386737149011E-2]
[null,null,"Household fuel type: grass, straw",null,0.30846950071461027,null,null,"Household fuel type: grass, straw",null,0.29244490166304349,null,null,"Household fuel type: grass, straw",null,9.3521984701346622E-2]
[null,null,"Household fuel type: LPG",null,3.6232107412502487E-3,null,null,"Household fuel type: LPG",null,1.2560198247581966E-3,null,null,"Household fuel type: LPG",null,4.1965071608851363E-3]
[null,null,"Household fuel type: kerosene",null,0.29390146143720547,null,null,"Household fuel type: kerosene",null,0.27731482712419492,null,null,"Household fuel type: kerosene",null,7.967659902941876E-2]
[null,null,"Household fuel type: charcoal",null,6.8007062888969265E-3,null,null,"Household fuel type: charcoal",null,3.2809567521013025E-3,null,null,"Household fuel type: charcoal",null,5.4773294095723027E-3]
[null,null,"Household fuel type: animal dung",null,2.1236127452743739E-3,null,null,"Household fuel type: animal dung",null,8.32121512032055E-4,null,null,"Household fuel type: animal dung",null,8.5820730981979575E-3]
[]
[]
[null,null,"Total Variance Explained",null,null,null,null,"Total Variance Explained",null,null,null,null,"Total Variance Explained"]
[null,null,"Component",null,"Extraction Sums of Squared Loadings",null,null,"Component",null,"Extraction Sums of Squared Loadings",null,null,"Component",null,"Extraction Sums of Squared Loadings"]
[null,null,null,null,"Total","% of Variance","Cumulative %",null,null,"Total","% of Variance","Cumulative %",null,null,"Total","% of Variance","Cumulative %"]
[null,null,"1",null,5.1130142009328585,17.043380669776194,17.043380669776194,"1",null,4.9640122729181968,16.546707576393992,16.546707576393992,"1",null,4.4929066441104579,14.976355480368191,14.976355480368191]
[]
[]
[null,null,"Component Score Coefficient Matrix",null,null,null,null,"Component Score Coefficient Matrix",null,null,null,null,"Component Score Coefficient Matrix"]
[null,null,null,null,"Component",null,null,null,null,"Component",null,null,null,null,"Component"]
[null,null,null,null,"1",null,null,null,null,"1",null,null,null,null,"1"]
[null,null,"Téléphone",null,0.10697956464841125,null,null,"Téléphone",null,0.12038781368065123,null,null,"Téléphone",null,7.8607572707200618E-2]
[null,null,"Electricité",null,0.13121977643572785,null,null,"Electricité",null,0.13197729272250455,null,null,"Electricité",null,0.13755458871230936]
[null,null,"Réfrigérateur",null,0.12626012514983945,null,null,"Réfrigérateur",null,0.12816357949442544,null,null,"Réfrigérateur",null,0.12694734065817556]
[null,null,"Radio",null,9.2712542015126423E-2,null,null,"Radio",null,0.10047893291836939,null,null,"Radio",null,0.10310605672630081]
[null,null,"TV/Vidéo",null,0.1354301865708753,null,null,"TV/Vidéo",null,0.14285446536309854,null,null,"TV/Vidéo",null,0.12895332928374947]
[null,null,"Voiture",null,8.3853767703539389E-2,null,null,"Voiture",null,7.7026372629593484E-2,null,null,"Voiture",null,9.3661616845460718E-2]
[null,null,"Domestique",null,5.0387257317437831E-2,null,null,"Domestique",null,5.6456468566458216E-2,null,null,"Domestique",null,4.853406163874046E-2]
[null,null,"Persons per sleeping rooms",null,-6.4423524143344693E-2,null,null,"Persons per sleeping rooms",null,-6.4422548672910335E-2,null,null,"Persons per sleeping rooms",null,-7.1327837071777173E-2]
[null,null,"Has earth/sand floor",null,-0.12751415671104455,null,null,"Has earth/sand floor",null,-0.10741146072961978,null,null,"Has earth/sand floor",null,-0.15908502549197151]
[null,null,"Has wood floor",null,-7.1771428666380262E-3,null,null,"Has wood floor",null,-4.6717018852122493E-4,null,null,"Has wood floor",null,-1.9012664416055227E-2]
[null,null,"Has ceramic tile floor",null,4.6084937902935795E-2,null,null,"Has ceramic tile floor",null,6.1061232554272024E-2,null,null,"Has ceramic tile floor",null,1.6760253428866077E-2]
[null,null,"Has cement floor",null,0.11041716276483961,null,null,"Has cement floor",null,7.1655165744385019E-2,null,null,"Has cement floor",null,0.15799512213093356]
[null,null,"Has other floor",null,-9.4605351327383055E-3,null,null,"Has other floor",null,-4.0107641363719373E-2,null,null,"Has other floor",null,-4.9046747709604165E-3]
[null,null,"Has cement wall",null,0.1218514857150715,null,null,"Has cement wall",null,0.12934967015314233,null,null,"Has cement wall",null,0.12421079129169393]
[null,null,"Has jute wall",null,-0.10931503028466989,null,null,"Has jute wall",null,-0.10982160104421231,null,null,"Has jute wall",null,-0.14078365116011693]
[null,null,"Has reused wood wall",null,1.3215494276164375E-3,null,null,"Has reused wood wall",null,-9.8304133624599454E-3,null,null,"Has reused wood wall",null,1.4719506789391159E-3]
[null,null,"Has corrugated iron Wall",null,-1.1527977094989484E-3,null,null,"Has corrugated iron Wall",null,-2.8507729898381788E-2,null,null,"Has corrugated iron Wall",null,4.4444691214032772E-2]
[null,null,"Has bamboo with mud wall",null,2.7059475942857718E-4,null,null,"Has bamboo with mud wall",null,3.6308153897721502E-3,null,null,"Has bamboo with mud wall",null,-7.6697399747554665E-3]
[null,null,"Has uncovered adobe wall",null,-5.0180837370777054E-2,null,null,"Has uncovered adobe wall",null,-6.0198805786111836E-2,null,null,"Has uncovered adobe wall",null,-5.5245486174380028E-2]
[null,null,"Has jute roof",null,-0.11708023479816124,null,null,"Has jute roof",null,-0.12280055837913764,null,null,"Has jute roof",null,-0.14977276006475043]
[null,null,"Has cement/concrete roof",null,0.11167926758241734,null,null,"Has cement/concrete roof",null,0.11992693018324385,null,null,"Has cement/concrete roof",null,0.10750136335620325]
[null,null,"Has wood roof",null,-2.1263348493461176E-2,null,null,"Has wood roof",null,-1.7039244787601868E-2,null,null,"Has wood roof",null,-2.387687743717826E-2]
[null,null,"Has rustic mat roof",null,1.0706211607145627E-2,null,null,"Has rustic mat roof",null,-3.5773258280049651E-3,null,null,"Has rustic mat roof",null,2.2038244451784338E-2]
[null,null,"Has other roof",null,-3.5633546538899985E-3,null,null,"Has other roof",null,-3.5269254531792521E-3,null,null,"Has other roof",null,-2.6948805818805309E-3]
[null,null,"Has corrugated iron roof",null,6.4948044265411282E-4,null,null,"Has corrugated iron roof",null,-2.9551080843688474E-2,null,null,"Has corrugated iron roof",null,4.5518160166070673E-2]
[null,null,"Household fuel type: grass, straw",null,-0.10862483163602736,null,null,"Household fuel type: grass, straw",null,-0.10894045396308095,null,null,"Household fuel type: grass, straw",null,-6.80658798346295E-2]
[null,null,"Household fuel type: LPG",null,1.1772529805183148E-2,null,null,"Household fuel type: LPG",null,7.1394605890766454E-3,null,null,"Household fuel type: LPG",null,1.4418384059950046E-2]
[null,null,"Household fuel type: kerosene",null,0.10602880674846203,null,null,"Household fuel type: kerosene",null,0.106084931109,null,null,"Household fuel type: kerosene",null,6.2825795935895393E-2]
[null,null,"Household fuel type: charcoal",null,1.6128724010112915E-2,null,null,"Household fuel type: charcoal",null,1.1538979620324654E-2,null,null,"Household fuel type: charcoal",null,1.6472405908771914E-2]
[null,null,"Household fuel type: animal dung",null,9.0128192742684795E-3,null,null,"Household fuel type: animal dung",null,5.8111291585765321E-3,null,null,"Household fuel type: animal dung",null,2.061905276329595E-2]
[]
[]
[null,null,"Component Score Covariance Matrix",null,null,null,null,"Component Score Covariance Matrix",null,null,null,null,"Component Score Covariance Matrix"]
[null,null,"Component",null,"1",null,null,"Component",null,"1",null,null,"Component",null,"1"]
[null,null,"1",null,1.0000000000000002,null,null,"1",null,0.99999999999999978,null,null,"1",null,1.0000000000000002]
[]
[]
[]
[]
[]
[]
[]
[]
[]
[]
[]
[]
[]
[]
[]
[]
[]
[]
[]
[]
[]
[]
[]
[]
[]
[]
[]
[]
[]
[]
[]
[]
[]
[]
[]
[]
[]
[]
[]
[]
[]
[]
[]
[]
[]
[]
[]
[]
[]
[]
[]
[]
[]
[]
[]
[]
[]
[]
[]
[]
[]
[]
[]
[]
[]
[]
[]
[]
[]
[]
[]
[]
[]
[]
[]
[]
[]
[]
[]
[]
[]
[]
[]
[]
[]
[]
[]
[]
[]
[]
[]
[]
[]
[]
[]
[]
[]
[]
[]
[]
[]
[]
[]
[]
[]
[]
[]
[]
[]
[]
[]
[]
[]
[]
[]
[]
[]
[]
[]
[]
[]
[]
[]
[]
[]
[]
[]
[]
[]
[]
[]
[]
[]
[]
[]
[]
[]
[]
[]
[]
[]
[]
[]
[]
[]
[]
[]
[]
[]
[]
[]
[]
[]
[]
[]
[]
[]
[]
[]
[]
[]
[]
[]
[]
[]
[]
[]
[]
[]
[]
[]
[]
[]
[]
[]
[]
[]
[]
[]
[]
[]
[]
[]
[]
[]
[]
[]
[]
[]
[]
[]
[]
[]
[]
[]
[]
[]
[]
[]
[]
[]
[]
[]
[]
[]
[]
[]
[]
[]
[]
[]
[]
[]
[]
[]
[]
[]
[]
[]
[]
[]
[]
[]
[]
[]
[]
[]
[]
[]
[]
[]
[]
[]
[]
[]
[]
[]
[]
[]
[]
[]
[]
[]
[]
[]
[]
[]
[]
[]
[]
[]
[]
[]
[]
[]
[]
[]
[]
[]
[]
[]
[]
[]
[]
[]
[]
[]
[]
[]
[]
[]
[]
[]
[]
[]
[]
[]
[]
[]
[]
[]
[]
[]
[]
[]
[]
[]
[]
[]
[]
[]
[]
[]
[]
[]
[]
[]
[]
[]
[]
[]
[]
[]
[]
[]
[]
[]
[]
[]
[]
[]
[]
[]
[]
[]
[]
[]
[]
[]
[]
[]
[]
[]
[]
[]
[]
[]
[]
[]
[]
[]
[]
[]
[]
[]
[]
[]
[]
[]
[]
[]
[]
[]
[]
[]
[]
[]
[]
[]
[]
[]
[]
[]
[]
[]
[]
[]
[]
[]
[]
[]
[]
[]
[]
[]
[]
[]
[]
[]
[]
[]
[]
[]
[]
[]
[]
[]
[]
[]
[]
[]
[]
[]
[]
[]
[]
[]
[]
[]
[]
[]
[]
[]
[]
[]
[]
[]
[]
[]
[]
[]
[]
[]
[]
[]
[]
[]
[]
[]
[]
[]
[]
[]
[]
[]
[]
[]
[]
[]
[]
[]
[]
[]
[]
[]
[]
[]
[]
[]
[]
[]
[]
[]
[]
[]
[]
[]
[]
[]
[]
[]
[]
[]
[]
[]
[]
[]
[]
[]
[]
[]
[]
[]
[]
[]
[]
[]
[]
[]
[]
[]
[]
[]
[]
[]
[]
[]
[]
[]
[]
[]
[]
[]
[]
[]
[]
[]
[]
[]
[]
[]
[]
[]
[]
[]
[]
[]
[]
[]
[]
[]
[]
[]
[]
[]
[]
[]
[]
[]
[]
[]
[]
[]
[]
[]
[]
[]
[]
[]
[]
[]
["MICS00"]
["Comoros",null,"Count"]
["W_text_t","",3677]
["W_text_i","",3677]
["S_text_s","Ratio of Shared improved based on:",3677]
["S_text_i","Ratio of Improved latrines based on:",3677]
["Urban/Rural","Urban",1165]
[null,"Rural",2512]
[null,"Missing",0]
["2000"]
[]
["Sub-national region names","Weighted population"]
[{"$f":"R15","v":"Mwali"},{"$f":"BR122+BR123","v":{"$error":"#VALUE!"}}]
[{"$f":"S15","v":"Ndzuwani"},{"$f":"BS122+BS123","v":{"$error":"#VALUE!"}}]
[{"$f":"T15","v":"Ngazidja"},{"$f":"BT122+BT123","v":{"$error":"#VALUE!"}}]
[{"$f":"U15","v":0},{"$f":"BU122+BU123","v":0}]
[{"$f":"V15","v":0},{"$f":"BV122+BV123","v":0}]
[{"$f":"W15","v":0},{"$f":"BW122+BW123","v":0}]
[{"$f":"X15","v":0},{"$f":"BX122+XR123","v":0}]
[{"$f":"Y15","v":0},{"$f":"BY122+BY123","v":0}]
[{"$f":"Z15","v":0},{"$f":"BZ122+BZ123","v":0}]
[{"$f":"AA15","v":0},{"$f":"CA122+CA123","v":0}]
[{"$f":"AB15","v":0},{"$f":"CB122+CB123","v":0}]
[{"$f":"AC15","v":0},{"$f":"CC122+CC123","v":0}]
[{"$f":"AD15","v":0},{"$f":"CD122+CD123","v":0}]
[{"$f":"AE15","v":0},{"$f":"CE122+CE123","v":0}]
[{"$f":"AF15","v":0},{"$f":"CF122+CF123","v":0}]
[{"$f":"AG15","v":0},{"$f":"CG122+CG123","v":0}]
[{"$f":"AH15","v":0},{"$f":"CH122+CH123","v":0}]
[{"$f":"AI15","v":0},{"$f":"CI122+CI123","v":0}]
[{"$f":"AJ15","v":0},{"$f":"CJ122+CJ123","v":0}]
[{"$f":"AK15","v":0},{"$f":"CK122+CK123","v":0}]
[{"$f":"AL15","v":0},{"$f":"CL122+CL123","v":0}]
[{"$f":"AM15","v":0},{"$f":"CM122+CM123","v":0}]
[{"$f":"AN15","v":0},{"$f":"CN122+CN123","v":0}]
[{"$f":"AO15","v":0},{"$f":"CO122+CO123","v":0}]
[{"$f":"AP15","v":0},{"$f":"CP122+CP123","v":0}]
[{"$f":"AQ15","v":0},{"$f":"CQ122+CQ123","v":0}]
[{"$f":"AR15","v":0},{"$f":"CR122+CR123","v":0}]
[{"$f":"AS15","v":0},{"$f":"CS122+CS123","v":0}]
[{"$f":"AT15","v":0},{"$f":"CT122+CT123","v":0}]
[{"$f":"AU15","v":0},{"$f":"CU122+CU123","v":0}]
[{"$f":"AV15","v":0},{"$f":"CV122+CV123","v":0}]
[{"$f":"AW15","v":0},{"$f":"CW122+CW123","v":0}]
[{"$f":"AX15","v":0},{"$f":"CX122+CX123","v":0}]
[{"$f":"AY15","v":0},{"$f":"CY122+CY123","v":0}]
[]
[{"$f":"34-COUNTIF(A1037:A1071,\"0\")","v":3},"Sub-regions"]

{"sheet":"WHS03","index":5,"n_rows":1072,"n_cols":69,"rows_kept":1072,"cut":false,"hidden":false,"merged":[[346,52,347,52],[348,52,349,52],[350,52,351,52],[352,52,353,52],[152,52,158,52],[270,52,272,52],[273,52,275,52],[276,52,283,52],[338,54,338,58],[338,59,338,63],[338,64,338,68],[340,52,341,52],[342,52,343,52],[344,52,345,52],[221,52,223,52],[224,52,225,52],[226,52,229,52],[258,54,258,58],[258,59,258,63],[258,64,258,68],[260,52,262,52],[263,52,266,52],[267,52,269,52],[119,64,119,68],[121,52,122,52],[123,52,126,52],[127,52,128,52],[132,54,132,58],[132,59,132,63],[132,64,132,68],[134,52,138,52],[219,54,219,58],[219,59,219,63],[219,64,219,68],[13,64,13,68],[15,52,16,52],[17,52,20,52],[21,52,22,52],[26,54,26,58],[26,59,26,63],[26,64,26,68],[40,52,41,52],[55,54,55,58],[55,59,55,63],[55,64,55,68],[139,52,142,52],[143,0,146,0],[143,52,146,52],[147,0,149,0],[147,52,149,52],[150,0,151,0],[150,52,151,52],[13,54,13,58],[13,59,13,63],[119,54,119,58],[119,59,119,63],[42,52,43,52],[44,52,45,52],[46,0,48,0],[46,52,48,52],[49,0,51,0],[49,52,51,52],[52,0,54,0],[52,52,54,52],[32,52,33,52],[34,52,35,52],[36,52,37,52],[38,0,39,0],[38,52,39,52],[13,2,13,6],[13,7,13,11],[28,52,29,52],[30,0,31,0],[30,52,31,52],[28,0,29,0],[34,0,35,0],[36,0,37,0],[40,0,41,0],[42,0,43,0],[13,12,13,16],[15,0,16,0],[17,0,20,0],[21,0,22,0],[23,0,25,0],[26,2,26,6],[26,7,26,11],[26,12,26,16],[32,0,33,0],[139,0,142,0],[119,12,119,16],[121,0,122,0],[55,12,55,16],[57,0,63,0],[107,0,107,1],[44,0,45,0],[55,2,55,6],[55,7,55,11],[123,0,126,0],[127,0,128,0],[129,0,131,0],[132,2,132,6],[132,7,132,11],[119,2,119,6],[119,7,119,11],[207,0,207,1],[132,12,132,16],[134,0,138,0],[152,0,157,0],[1024,0,1024,2],[1025,0,1025,1],[1030,0,1032,0],[1033,0,1033,2],[398,2,398,5],[219,2,219,6],[219,7,219,11],[219,12,219,16],[221,0,223,0],[398,7,398,10],[398,12,398,15],[399,2,399,4],[399,7,399,9],[399,12,399,14],[400,2,401,3],[400,7,401,8],[400,12,401,13],[401,1,444,1],[402,2,402,3],[402,7,402,8],[402,12,402,13],[403,2,403,3],[403,7,403,8],[403,12,403,13],[404,2,404,3],[404,7,404,8],[404,12,404,13],[407,2,407,3],[407,7,407,8],[407,12,407,13],[408,2,408,3],[408,7,408,8],[408,12,408,13],[405,2,405,3],[405,7,405,8],[405,12,405,13],[406,2,406,3],[406,7,406,8],[406,12,406,13],[411,2,411,3],[411,7,411,8],[411,12,411,13],[412,2,412,3],[412,7,412,8],[412,12,412,13],[409,2,409,3],[409,7,409,8],[409,12,409,13],[410,2,410,3],[410,7,410,8],[410,12,410,13],[415,2,415,3],[415,7,415,8],[415,12,415,13],[416,2,416,3],[416,7,416,8],[416,12,416,13],[413,2,413,3],[413,7,413,8],[413,12,413,13],[414,2,414,3],[414,7,414,8],[414,12,414,13],[419,2,419,3],[419,7,419,8],[419,12,419,13],[420,2,420,3],[420,7,420,8],[420,12,420,13],[417,2,417,3],[417,7,417,8],[417,12,417,13],[418,2,418,3],[418,7,418,8],[418,12,418,13],[423,2,423,3],[423,7,423,8],[423,12,423,13],[424,2,424,3],[424,7,424,8],[424,12,424,13],[421,2,421,3],[421,7,421,8],[421,12,421,13],[422,2,422,3],[422,7,422,8],[422,12,422,13],[427,2,427,3],[427,7,427,8],[427,12,427,13],[428,2,428,3],[428,7,428,8],[428,12,428,13],[425,2,425,3],[425,7,425,8],[425,12,425,13],[426,2,426,3],[426,7,426,8],[426,12,426,13],[431,2,431,3],[431,7,431,8],[431,12,431,13],[432,2,432,3],[432,7,432,8],[432,12,432,13],[429,2,429,3],[429,7,429,8],[429,12,429,13],[430,2,430,3],[430,7,430,8],[430,12,430,13],[435,2,435,3],[435,7,435,8],[435,12,435,13],[436,2,436,3],[436,7,436,8],[436,12,436,13],[433,2,433,3],[433,7,433,8],[433,12,433,13],[434,2,434,3],[434,7,434,8],[434,12,434,13],[439,2,439,3],[439,7,439,8],[439,12,439,13],[440,2,440,3],[440,7,440,8],[440,12,440,13],[437,2,437,3],[437,7,437,8],[437,12,437,13],[438,2,438,3],[438,7,438,8],[438,12,438,13],[443,2,443,3],[443,7,443,8],[443,12,443,14],[444,2,444,3],[444,7,444,8],[444,12,444,13],[441,2,441,3],[441,7,441,8],[441,12,441,13],[442,2,442,3],[442,7,442,8],[442,12,442,13],[447,2,447,3],[447,7,447,8],[447,12,447,13],[448,2,448,3],[448,7,448,8],[448,12,448,13],[445,2,445,3],[445,7,445,9],[445,12,445,13],[446,2,446,4],[446,7,446,8],[446,12,446,13],[451,2,451,3],[451,7,451,8],[451,12,451,13],[452,2,452,3],[452,7,452,8],[452,12,452,13],[449,2,449,3],[449,7,449,8],[449,12,449,13],[450,2,450,3],[450,7,450,8],[450,12,450,13],[455,2,455,3],[455,7,455,8],[455,12,455,13],[456,2,456,3],[456,7,456,8],[456,12,456,13],[453,2,453,3],[453,7,453,8],[453,12,453,13],[454,2,454,3],[454,7,454,8],[454,12,454,13],[459,2,459,3],[459,7,459,8],[459,12,459,13],[460,2,460,3],[460,7,460,8],[460,12,460,13],[457,2,457,3],[457,7,457,8],[457,12,457,13],[458,2,458,3],[458,7,458,8],[458,12,458,13],[463,2,463,3],[463,7,463,8],[463,12,463,13],[464,2,464,3],[464,7,464,8],[464,12,464,13],[461,2,461,3],[461,7,461,8],[461,12,461,13],[462,2,462,3],[462,7,462,8],[462,12,462,13],[467,2,467,3],[467,7,467,8],[467,12,467,13],[468,2,468,3],[468,7,468,8],[468,12,468,13],[465,2,465,3],[465,7,465,8],[465,12,465,13],[466,2,466,3],[466,7,466,8],[466,12,466,13],[471,2,471,3],[471,7,471,8],[471,12,471,13],[472,2,472,3],[472,7,472,8],[472,12,472,13],[469,2,469,3],[469,7,469,8],[469,12,469,13],[470,2,470,3],[470,7,470,8],[470,12,470,13],[475,2,475,3],[475,7,475,8],[475,12,475,13],[476,2,476,3],[476,7,476,8],[476,12,476,13],[473,2,473,3],[473,7,473,8],[473,12,473,13],[474,2,474,3],[474,7,474,8],[474,12,474,13],[479,2,479,3],[479,7,479,8],[479,12,479,13],[480,2,480,3],[480,7,480,8],[480,12,480,13],[477,2,477,3],[477,7,477,8],[477,12,477,13],[478,2,478,3],[478,7,478,8],[478,12,478,13],[483,2,483,3],[483,7,483,8],[483,12,483,13],[484,2,484,3],[484,7,484,8],[484,12,484,13],[481,2,481,3],[481,7,481,8],[481,12,481,13],[482,2,482,3],[482,7,482,8],[482,12,482,13],[485,2,485,3],[485,7,485,8],[485,12,485,16],[486,2,486,3],[486,7,486,8],[486,12,487,13],[486,14,486,16],[487,2,487,3],[487,7,487,8],[490,2,490,3],[490,7,491,8],[490,9,490,11],[490,12,490,13],[491,2,491,6],[491,12,491,14],[488,2,488,3],[488,7,488,8],[488,12,488,13],[489,2,489,3],[489,7,489,11],[489,12,489,13],[495,2,495,3],[495,7,495,9],[495,12,495,13],[496,2,496,3],[496,7,497,8],[496,12,496,13],[497,2,497,4],[497,12,497,13],[492,2,493,3],[492,4,492,6],[492,7,492,8],[492,12,493,13],[493,7,493,8],[494,2,494,3],[494,7,494,8],[494,12,494,13],[501,2,501,3],[501,7,501,8],[501,12,501,13],[502,2,502,3],[502,7,502,8],[502,12,502,13],[498,2,499,3],[498,7,498,8],[498,12,498,13],[499,7,499,8],[499,12,499,13],[500,2,500,3],[500,7,500,8],[500,12,500,13],[505,2,505,3],[505,7,505,8],[505,12,505,13],[506,2,506,3],[506,7,506,8],[506,12,506,13],[503,2,503,3],[503,7,503,8],[503,12,503,13],[504,2,504,3],[504,7,504,8],[504,12,504,13],[509,2,509,3],[509,7,509,8],[509,12,509,13],[510,2,510,3],[510,7,510,8],[510,12,510,13],[507,2,507,3],[507,7,507,8],[507,12,507,13],[508,2,508,3],[508,7,508,8],[508,12,508,13],[513,2,513,3],[513,7,513,8],[513,12,513,13],[514,2,514,3],[514,7,514,8],[514,12,514,13],[511,2,511,3],[511,7,511,8],[511,12,511,13],[512,2,512,3],[512,7,512,8],[512,12,512,13],[517,2,517,3],[517,7,517,8],[517,12,517,13],[518,2,518,3],[518,7,518,8],[518,12,518,13],[515,2,515,3],[515,7,515,8],[515,12,515,13],[516,2,516,3],[516,7,516,8],[516,12,516,13],[521,2,521,3],[521,7,521,8],[521,12,521,13],[522,2,522,3],[522,7,522,8],[522,12,522,13],[519,2,519,3],[519,7,519,8],[519,12,519,13],[520,2,520,3],[520,7,520,8],[520,12,520,13],[525,2,525,3],[525,7,525,8],[525,12,525,13],[526,2,526,3],[526,7,526,8],[526,12,526,13],[523,2,523,3],[523,7,523,8],[523,12,523,13],[524,2,524,3],[524,7,524,8],[524,12,524,13],[529,2,529,3],[529,7,529,8],[529,12,529,13],[530,2,530,3],[530,7,530,8],[530,12,530,13],[527,2,527,3],[527,7,527,8],[527,12,527,13],[528,2,528,3],[528,7,528,8],[528,12,528,13],[533,2,533,3],[533,7,533,8],[533,12,533,13],[534,2,534,3],[534,7,534,8],[534,12,534,14],[531,2,531,3],[531,7,531,8],[531,12,531,13],[532,2,532,3],[532,7,532,8],[532,12,532,13],[537,2,537,3],[537,7,537,8],[537,12,537,13],[538,2,538,3],[538,7,538,8],[538,12,538,13],[535,2,535,3],[535,7,535,8],[535,12,535,13],[536,2,536,3],[536,7,536,8],[536,12,536,13],[541,2,541,3],[541,7,541,8],[541,12,541,13],[542,2,542,3],[542,7,542,8],[542,12,542,13],[539,2,539,3],[539,7,539,8],[539,12,539,13],[540,2,540,3],[540,7,540,9],[540,12,540,13],[545,2,545,3],[545,7,545,8],[545,12,545,13],[546,2,546,3],[546,7,546,8],[546,12,546,13],[543,2,543,4],[543,7,543,8],[543,12,543,13],[544,2,544,3],[544,7,544,8],[544,12,544,13],[549,2,549,3],[549,7,549,8],[549,12,549,13],[550,2,550,3],[550,7,550,8],[550,12,550,13],[547,2,547,3],[547,7,547,8],[547,12,547,13],[548,2,548,3],[548,7,548,8],[548,12,548,13],[553,2,553,3],[553,7,553,8],[553,12,553,13],[554,2,554,3],[554,7,554,8],[554,12,554,13],[551,2,551,3],[551,7,551,8],[551,12,551,13],[552,2,552,3],[552,7,552,8],[552,12,552,13],[557,2,557,3],[557,7,557,8],[557,12,557,13],[558,2,558,3],[558,7,558,8],[558,12,558,13],[555,2,555,3],[555,7,555,8],[555,12,555,13],[556,2,556,3],[556,7,556,8],[556,12,556,13],[561,2,561,3],[561,7,561,8],[561,12,561,13],[562,2,562,3],[562,7,562,8],[562,12,562,13],[559,2,559,3],[559,7,559,8],[559,12,559,13],[560,2,560,3],[560,7,560,8],[560,12,560,13],[565,2,565,3],[565,7,565,8],[565,12,565,13],[566,2,566,3],[566,7,566,8],[566,12,566,13],[563,2,563,3],[563,7,563,8],[563,12,563,13],[564,2,564,3],[564,7,564,8],[564,12,564,13],[569,2,569,3],[569,7,569,8],[569,12,569,13],[570,2,570,3],[570,7,570,8],[570,12,570,13],[567,2,567,3],[567,7,567,8],[567,12,567,13],[568,2,568,3],[568,7,568,8],[568,12,568,13],[573,2,573,3],[573,7,573,8],[573,12,573,13],[574,2,574,3],[574,7,574,8],[574,12,574,13],[571,2,571,3],[571,7,571,8],[571,12,571,13],[572,2,572,3],[572,7,572,8],[572,12,572,13],[577,2,577,3],[577,7,577,8],[577,12,577,13],[578,2,578,3],[578,7,578,8],[578,12,578,13],[575,2,575,3],[575,7,575,8],[575,12,575,13],[576,2,576,3],[576,7,576,8],[576,12,576,13],[581,2,581,3],[581,7,581,8],[581,12,581,13],[582,2,582,3],[582,7,582,8],[582,12,582,13],[579,2,579,3],[579,7,579,8],[579,12,579,13],[580,2,580,3],[580,7,580,8],[580,12,580,13],[585,2,585,3],[585,7,585,8],[585,12,585,13],[586,2,586,3],[586,7,586,8],[586,12,586,13],[583,2,583,3],[583,7,583,8],[583,12,583,13],[584,2,584,3],[584,7,584,8],[584,12,584,13],[589,2,589,3],[589,7,589,8],[589,12,589,13],[590,2,590,3],[590,7,590,8],[590,12,590,13],[587,2,587,3],[587,7,587,8],[587,12,587,13],[588,2,588,3],[588,7,588,8],[588,12,588,13],[593,2,593,3],[593,7,593,8],[593,12,593,13],[594,2,594,3],[594,7,594,8],[594,12,594,13],[591,2,591,3],[591,7,591,8],[591,12,591,13],[592,2,592,3],[592,7,592,8],[592,12,592,13],[597,2,597,3],[597,7,597,8],[597,12,597,13],[598,2,598,3],[598,7,598,8],[598,12,598,13],[595,2,595,3],[595,7,595,8],[595,12,595,13],[596,2,596,3],[596,7,596,8],[596,12,596,13],[601,2,601,3],[601,7,601,8],[601,12,601,13],[602,2,602,3],[602,7,602,8],[602,12,602,13],[599,2,599,3],[599,7,599,8],[599,12,599,13],[600,2,600,3],[600,7,600,8],[600,12,600,13],[605,2,605,3],[605,7,605,8],[605,12,605,13],[606,2,606,3],[606,7,606,8],[606,12,606,13],[603,2,603,3],[603,7,603,8],[603,12,603,13],[604,2,604,3],[604,7,604,8],[604,12,604,13],[609,2,609,3],[609,7,609,8],[609,12,609,13],[610,2,610,3],[610,7,610,8],[610,12,610,13],[607,2,607,3],[607,7,607,8],[607,12,607,13],[608,2,608,3],[608,7,608,8],[608,12,608,13],[613,2,613,3],[613,7,613,8],[613,12,613,13],[614,2,614,3],[614,7,614,8],[614,12,614,13],[611,2,611,3],[611,7,611,8],[611,12,611,13],[612,2,612,3],[612,7,612,8],[612,12,612,13],[617,2,617,3],[617,7,617,8],[617,12,617,13],[618,2,618,3],[618,7,618,8],[618,12,618,13],[615,2,615,3],[615,7,615,8],[615,12,615,13],[616,2,616,3],[616,7,616,8],[616,12,616,13],[621,2,621,3],[621,7,621,8],[621,12,621,13],[622,2,622,3],[622,7,622,8],[622,12,622,13],[619,2,619,3],[619,7,619,8],[619,12,619,13],[620,2,620,3],[620,7,620,8],[620,12,620,13],[625,2,625,3],[625,7,625,8],[625,12,625,13],[626,2,626,3],[626,7,626,8],[626,12,626,13],[623,2,623,3],[623,7,623,8],[623,12,623,13],[624,2,624,3],[624,7,624,8],[624,12,624,13],[629,2,629,3],[629,7,629,8],[629,12,629,13],[630,2,630,3],[630,7,630,8],[630,12,630,13],[627,2,627,3],[627,7,627,8],[627,12,627,13],[628,2,628,3],[628,7,628,8],[628,12,628,13],[633,2,633,3],[633,7,633,8],[633,12,633,13],[634,2,634,3],[634,7,634,8],[634,12,634,13],[631,2,631,3],[631,7,631,8],[631,12,631,13],[632,2,632,3],[632,7,632,8],[632,12,632,13],[637,2,637,3],[637,7,637,8],[637,12,637,13],[638,2,638,3],[638,7,638,8],[638,12,638,13],[635,2,635,3],[635,7,635,8],[635,12,635,13],[636,2,636,3],[636,7,636,8],[636,12,636,13],[641,2,641,3],[641,7,641,8],[641,12,641,13],[642,2,642,3],[642,7,642,8],[642,12,642,13],[639,2,639,3],[639,7,639,8],[639,12,639,13],[640,2,640,3],[640,7,640,8],[640,12,640,13],[645,2,645,3],[645,7,645,8],[645,12,645,13],[646,2,646,3],[646,7,646,8],[646,12,646,13],[643,2,643,3],[643,7,643,8],[643,12,643,13],[644,2,644,3],[644,7,644,8],[644,12,644,13],[649,2,649,3],[649,7,649,8],[649,12,649,13],[650,2,650,3],[650,7,650,8],[650,12,650,13],[647,2,647,3],[647,7,647,8],[647,12,647,13],[648,2,648,3],[648,7,648,8],[648,12,648,13],[653,2,653,3],[653,7,653,8],[653,12,653,13],[654,2,654,3],[654,7,654,8],[654,12,654,13],[651,2,651,3],[651,7,651,8],[651,12,651,13],[652,2,652,3],[652,7,652,8],[652,12,652,13],[657,2,657,3],[657,7,657,8],[657,12,657,13],[658,2,658,3],[658,7,658,8],[658,12,658,13],[655,2,655,3],[655,7,655,8],[655,12,655,13],[656,2,656,3],[656,7,656,8],[656,12,656,13],[661,2,661,3],[661,7,661,8],[661,12,661,13],[662,2,662,3],[662,7,662,8],[662,12,662,13],[659,2,659,3],[659,7,659,8],[659,12,659,13],[660,2,660,3],[660,7,660,8],[660,12,660,13],[665,2,665,3],[665,7,665,8],[665,12,665,13],[666,2,666,3],[666,7,666,8],[666,12,666,13],[663,2,663,3],[663,7,663,8],[663,12,663,13],[664,2,664,3],[664,7,664,8],[664,12,664,13],[669,2,669,3],[669,7,669,8],[669,12,669,13],[670,2,670,3],[670,7,670,8],[670,12,670,13],[667,2,667,3],[667,7,667,8],[667,12,667,13],[668,2,668,3],[668,7,668,8],[668,12,668,13],[673,2,673,3],[673,7,673,8],[673,12,673,13],[674,2,674,3],[674,7,674,8],[674,12,674,13],[671,2,671,3],[671,7,671,8],[671,12,671,13],[672,2,672,3],[672,7,672,8],[672,12,672,13],[677,2,677,3],[677,7,677,8],[677,12,677,13],[678,2,678,3],[678,7,678,8],[678,12,678,13],[675,2,675,3],[675,7,675,8],[675,12,675,13],[676,2,676,3],[676,7,676,8],[676,12,676,13],[681,2,681,3],[681,7,681,8],[681,12,681,13],[682,2,682,3],[682,7,682,8],[682,12,682,13],[679,2,679,3],[679,7,679,8],[679,12,679,13],[680,2,680,3],[680,7,680,8],[680,12,680,13],[685,2,685,3],[685,7,685,8],[685,12,685,13],[686,2,686,3],[686,7,686,8],[686,12,686,13],[683,2,683,3],[683,7,683,8],[683,12,683,13],[684,2,684,3],[684,7,684,8],[684,12,684,13],[689,2,689,3],[689,7,689,8],[689,12,689,13],[690,2,690,3],[690,7,690,8],[690,12,690,13],[687,2,687,3],[687,7,687,8],[687,12,687,13],[688,2,688,3],[688,7,688,8],[688,12,688,13],[693,2,693,3],[693,7,693,8],[693,12,693,13],[694,2,694,3],[694,7,694,8],[694,12,694,13],[691,2,691,3],[691,7,691,8],[691,12,691,13],[692,2,692,3]],"merged_total":1014,"flags":["merged_cut"]}
[]
[{"$f":"A1026","v":"Comoros"}]
[{"$f":"A1034","v":"2003"}]
["Use of drinking water sources"]
[" by wealth quintile and sub-national region"]
["Notes:"]
["WHO/UNICEF JMP customised wealth index excludes water,"]
[" sanitation and hygiene assets."]
["Survey used for analysis:",{"$f":"A1025","v":"WHS03"}]
[{"$f":"B1028","v":""}]
[{"$f":"B1027","v":""}]
[]
[]
["Use of drinking water sources",null,"NATIONAL wealth index quintile",null,null,null,null,"URBAN wealth index quintile",null,null,null,null,"RURAL wealth index quintile",null,null,null,null,null,null,null,null,null,null,null,null,null,null,null,null,null,null,null,null,null,null,null,null,null,null,null,null,null,null,null,null,null,null,null,null,null,null,null,"Raw numbers of respondents:","Use of drinking water sources","NATIONAL wealth index quintile",null,null,null,null,"URBAN wealth index quintile",null,null,null,null,"RURAL wealth index quintile"]
["Weighted percentage (used in graphs)",null,"Poorest","Poor","Middle","Rich","Richest","Poorest","Poor","Middle","Rich","Richest","Poorest","Poor","Middle","Rich","Richest",null,null,null,null,null,null,null,null,null,null,null,null,null,null,null,null,null,null,null,null,null,null,null,null,null,null,null,null,null,null,null,null,null,null,null,"Water data, raw numbers (weighted)",null,"Poorest","Poor","Middle","Rich","Richest","Poorest","Poor","Middle","Rich","Richest","Poorest","Poor","Middle","Rich","Richest"]
["Water","Improved",67.903463089521338,64.245505665415038,75.828721052454512,81.952758305202295,94.746546807852624,79.190830102165407,91.089306894202522,87.287545656642607,94.870491081920534,96.104243449267884,68.457596334591429,63.967915630714657,64.832544224820111,77.906522094812772,83.31395143701873,null,null,null,null,null,null,null,null,null,null,null,null,null,null,null,null,null,null,null,null,null,null,null,null,null,null,null,null,null,null,null,null,null,null,null,"Water","Improved","N/A","N/A","N/A","N/A","N/A","N/A","N/A","N/A","N/A","N/A","N/A","N/A","N/A","N/A","N/A"]
[null,"Not Improved",32.096536910478655,35.754494334584962,24.171278947545481,18.047241694797698,5.2534531921473766,20.809169897834586,8.9106931057974741,12.712454343357397,5.1295089180794715,3.8957565507321226,31.542403665408571,36.032084369285343,35.167455775179882,22.093477905187225,16.686048562981266,null,null,null,null,null,null,null,null,null,null,null,null,null,null,null,null,null,null,null,null,null,null,null,null,null,null,null,null,null,null,null,null,null,null,null,null,"Not Improved","N/A","N/A","N/A","N/A","N/A","N/A","N/A","N/A","N/A","N/A","N/A","N/A","N/A","N/A","N/A"]
["Water ladder","Basic",{"$f":"C16*C23/100","v":63.853821873414354},58.502165146820936,72.420199836077785,80.828056403589471,93.315752756103009,68.657092558246219,87.977004845106308,82.467314815019833,94.870491081920534,96.104243449267884,65.403263613122249,56.54872558029507,63.263130098398207,76.126951222001239,82.258886075534804,null,null,null,null,null,null,null,null,null,null,null,null,null,null,null,null,null,null,null,null,null,null,null,null,null,null,null,null,null,null,null,null,null,null,null,"Water ladder","Basic","N/A","N/A","N/A","N/A","N/A","N/A","N/A","N/A","N/A","N/A","N/A","N/A","N/A","N/A","N/A"]
[null,"Limited",{"$f":"C16*C22/100","v":4.0496412161069877},5.743340518594108,3.4085212163767165,1.1247019016128186,1.4307940517496192,10.533737543919194,3.1123020490962121,4.8202308416227728,0,0,3.054332721469176,7.4191900504195862,1.5694141264219095,1.7795708728115445,1.0550653614839205,null,null,null,null,null,null,null,null,null,null,null,null,null,null,null,null,null,null,null,null,null,null,null,null,null,null,null,null,null,null,null,null,null,null,null,null,"Limited","N/A","N/A","N/A","N/A","N/A","N/A","N/A","N/A","N/A","N/A","N/A","N/A","N/A","N/A","N/A"]
[null,"Unimproved",{"$f":"100-C18-C19-C21","v":32.096536910478662},35.754494334584955,24.171278947545499,18.047241694797709,5.2534531921473713,20.809169897834586,8.9106931057974812,12.712454343357393,5.1295089180794662,3.8957565507321164,31.542403665408575,36.032084369285343,35.167455775179882,22.093477905187218,16.686048562981277,null,null,null,null,null,null,null,null,null,null,null,null,null,null,null,null,null,null,null,null,null,null,null,null,null,null,null,null,null,null,null,null,null,null,null,null,"Unimproved","N/A","N/A","N/A","N/A","N/A","N/A","N/A","N/A","N/A","N/A","N/A","N/A","N/A","N/A","N/A"]
[null,"Surface water",0,0,0,0,0,0,0,0,0,0,0,0,0,0,0,null,null,null,null,null,null,null,null,null,null,null,null,null,null,null,null,null,null,null,null,null,null,null,null,null,null,null,null,null,null,null,null,null,null,null,null,"Surface water","N/A","N/A","N/A","N/A","N/A","N/A","N/A","N/A","N/A","N/A","N/A","N/A","N/A","N/A","N/A"]
["Improved water point at more than 30 minutes","Yes",5.9638213308327073,8.9396767277464075,4.4950266456675063,1.3723783370710825,1.5101279149004663,13.30171375944594,3.4167589536179661,5.522243528972397,0,0,4.4616417826604735,11.598298892917512,2.4207196326888623,2.284238629784801,1.2663729702959754,null,null,null,null,null,null,null,null,null,null,null,null,null,null,null,null,null,null,null,null,null,null,null,null,null,null,null,null,null,null,null,null,null,null,null,"Improved water point at more than 30 minutes","Yes","N/A","N/A","N/A","N/A","N/A","N/A","N/A","N/A","N/A","N/A","N/A","N/A","N/A","N/A","N/A"]
[null,"No",94.036178669167299,91.060323272253598,95.504973354332492,98.627621662928917,98.489872085099535,86.698286240554054,96.583241046382028,94.477756471027604,100,100,95.538358217339521,88.401701107082488,97.579280367311142,97.715761370215205,98.733627029704024,null,null,null,null,null,null,null,null,null,null,null,null,null,null,null,null,null,null,null,null,null,null,null,null,null,null,null,null,null,null,null,null,null,null,null,null,"No","N/A","N/A","N/A","N/A","N/A","N/A","N/A","N/A","N/A","N/A","N/A","N/A","N/A","N/A","N/A"]
["Manually calculated ratios","Improved wells"]
[null,"Improved springs"]
[null,"Other"]
[null,null,"NATIONAL wealth index quintile",null,null,null,null,"URBAN wealth index quintile",null,null,null,null,"RURAL wealth index quintile",null,null,null,null,null,null,null,null,null,null,null,null,null,null,null,null,null,null,null,null,null,null,null,null,null,null,null,null,null,null,null,null,null,null,null,null,null,null,null,"Raw numbers of respondents:","Use of drinking water sources","NATIONAL wealth index quintile",null,null,null,null,"URBAN wealth index quintile",null,null,null,null,"RURAL wealth index quintile"]
["Percentage based on weighted population",null,"Poorest","Poor","Middle","Rich","Richest","Poorest","Poor","Middle","Rich","Richest","Poorest","Poor","Middle","Rich","Richest",null,null,null,null,null,null,null,null,null,null,null,null,null,null,null,null,null,null,null,null,null,null,null,null,null,null,null,null,null,null,null,null,null,null,null,"Water data, raw numbers (weighted)",null,"Poorest","Poor","Middle","Rich","Richest","Poorest","Poor","Middle","Rich","Richest","Poorest","Poor","Middle","Rich","Richest"]
["Piped water","Yes",4.8701036156620452,11.916462841387107,20.944807259011668,28.083951301319438,46.47589181899933,43.263841083820815,55.232822150124527,53.776265872303263,52.433032720583583,64.039157196448784,3.1185440862798037,7.6405398276230327,9.0338461731871789,14.397755756370358,13.954027489769569,null,null,null,null,null,null,null,null,null,null,null,null,null,null,null,null,null,null,null,null,null,null,null,null,null,null,null,null,null,null,null,null,null,null,null,"Piped water","Yes","N/A","N/A","N/A","N/A","N/A","N/A","N/A","N/A","N/A","N/A","N/A","N/A","N/A","N/A","N/A"]
[null,"No",95.129896384337954,88.083537158612884,79.055192740988332,71.916048698680555,53.52410818100067,56.736158916179193,44.767177849875473,46.22373412769673,47.56696727941641,35.960842803551216,96.881455913720188,92.359460172376956,90.966153826812828,85.602244243629642,86.045972510230428,null,null,null,null,null,null,null,null,null,null,null,null,null,null,null,null,null,null,null,null,null,null,null,null,null,null,null,null,null,null,null,null,null,null,null,null,"No","N/A","N/A","N/A","N/A","N/A","N/A","N/A","N/A","N/A","N/A","N/A","N/A","N/A","N/A","N/A"]
["Piped water on premises","Yes",1.177551529621691,1.3273893210079826,3.6587720995378401,8.6402179406269024,32.535836534473603,6.9128928291172373,12.806548636162269,26.205805433646546,33.194116381619686,53.267191719829263,0.38324713018675099,1.9021105124566469,1.8550643869792438,1.8989125209401541,6.5547057199364556,null,null,null,null,null,null,null,null,null,null,null,null,null,null,null,null,null,null,null,null,null,null,null,null,null,null,null,null,null,null,null,null,null,null,null,"Piped water on premises","Yes","N/A","N/A","N/A","N/A","N/A","N/A","N/A","N/A","N/A","N/A","N/A","N/A","N/A","N/A","N/A"]
[null,"No",98.822448470378305,98.672610678992015,96.341227900462158,91.359782059373089,67.464163465526397,93.08710717088276,87.193451363837738,73.794194566353454,66.805883618380307,46.732808280170737,99.616752869813254,98.097889487543355,98.144935613020749,98.101087479059842,93.445294280063536,null,null,null,null,null,null,null,null,null,null,null,null,null,null,null,null,null,null,null,null,null,null,null,null,null,null,null,null,null,null,null,null,null,null,null,null,"No","N/A","N/A","N/A","N/A","N/A","N/A","N/A","N/A","N/A","N/A","N/A","N/A","N/A","N/A","N/A"]
["Piped water into dwelling","Yes","N/A","N/A","N/A","N/A","N/A","N/A","N/A","N/A","N/A","N/A","N/A","N/A","N/A","N/A","N/A",null,null,null,null,null,null,null,null,null,null,null,null,null,null,null,null,null,null,null,null,null,null,null,null,null,null,null,null,null,null,null,null,null,null,null,"Piped water into dwelling","Yes","N/A","N/A","N/A","N/A","N/A","N/A","N/A","N/A","N/A","N/A","N/A","N/A","N/A","N/A","N/A"]
[null,"No","N/A","N/A","N/A","N/A","N/A","N/A","N/A","N/A","N/A","N/A","N/A","N/A","N/A","N/A","N/A",null,null,null,null,null,null,null,null,null,null,null,null,null,null,null,null,null,null,null,null,null,null,null,null,null,null,null,null,null,null,null,null,null,null,null,null,"No","N/A","N/A","N/A","N/A","N/A","N/A","N/A","N/A","N/A","N/A","N/A","N/A","N/A","N/A","N/A"]
["Water source on premises","Yes","N/A","N/A","N/A","N/A","N/A","N/A","N/A","N/A","N/A","N/A","N/A","N/A","N/A","N/A","N/A",null,null,null,null,null,null,null,null,null,null,null,null,null,null,null,null,null,null,null,null,null,null,null,null,null,null,null,null,null,null,null,null,null,null,null,"Water source on premises","Yes","N/A","N/A","N/A","N/A","N/A","N/A","N/A","N/A","N/A","N/A","N/A","N/A","N/A","N/A","N/A"]
[null,"No","N/A","N/A","N/A","N/A","N/A","N/A","N/A","N/A","N/A","N/A","N/A","N/A","N/A","N/A","N/A",null,null,null,null,null,null,null,null,null,null,null,null,null,null,null,null,null,null,null,null,null,null,null,null,null,null,null,null,null,null,null,null,null,null,null,null,"No","N/A","N/A","N/A","N/A","N/A","N/A","N/A","N/A","N/A","N/A","N/A","N/A","N/A","N/A","N/A"]
["Improved Water source on premises","Yes","N/A","N/A","N/A","N/A","N/A","N/A","N/A","N/A","N/A","N/A","N/A","N/A","N/A","N/A","N/A",null,null,null,null,null,null,null,null,null,null,null,null,null,null,null,null,null,null,null,null,null,null,null,null,null,null,null,null,null,null,null,null,null,null,null,"Improved water source on premises","Yes","N/A","N/A","N/A","N/A","N/A","N/A","N/A","N/A","N/A","N/A","N/A","N/A","N/A","N/A","N/A"]
[null,"No","N/A","N/A","N/A","N/A","N/A","N/A","N/A","N/A","N/A","N/A","N/A","N/A","N/A","N/A","N/A",null,null,null,null,null,null,null,null,null,null,null,null,null,null,null,null,null,null,null,null,null,null,null,null,null,null,null,null,null,null,null,null,null,null,null,null,"No","N/A","N/A","N/A","N/A","N/A","N/A","N/A","N/A","N/A","N/A","N/A","N/A","N/A","N/A","N/A"]
["Piped water on premises available when needed","Yes","N/A","N/A","N/A","N/A","N/A","N/A","N/A","N/A","N/A","N/A","N/A","N/A","N/A","N/A","N/A",null,null,null,null,null,null,null,null,null,null,null,null,null,null,null,null,null,null,null,null,null,null,null,null,null,null,null,null,null,null,null,null,null,null,null,"Piped water on premises available when needed","Yes","N/A","N/A","N/A","N/A","N/A","N/A","N/A","N/A","N/A","N/A","N/A","N/A","N/A","N/A","N/A"]
[null,"No","N/A","N/A","N/A","N/A","N/A","N/A","N/A","N/A","N/A","N/A","N/A","N/A","N/A","N/A","N/A",null,null,null,null,null,null,null,null,null,null,null,null,null,null,null,null,null,null,null,null,null,null,null,null,null,null,null,null,null,null,null,null,null,null,null,null,"No","N/A","N/A","N/A","N/A","N/A","N/A","N/A","N/A","N/A","N/A","N/A","N/A","N/A","N/A","N/A"]
["Water point at more than 30 minutes","Yes",8.0590981283367,8.6514106988117092,3.5419637400286752,1.1747753419961082,1.4311992861557359,11.79200231700359,3.1764146312257178,5.1050425235329229,0,0,6.7967479096702146,12.627014252906971,2.0686680159706556,1.832165714352614,1.0839748760540626,null,null,null,null,null,null,null,null,null,null,null,null,null,null,null,null,null,null,null,null,null,null,null,null,null,null,null,null,null,null,null,null,null,null,null,"Water point at more than 30 minutes","Yes","N/A","N/A","N/A","N/A","N/A","N/A","N/A","N/A","N/A","N/A","N/A","N/A","N/A","N/A","N/A"]
[null,"No",91.9409018716633,91.348589301188284,96.458036259971323,98.82522465800389,98.568800713844269,88.207997682996407,96.823585368774275,94.894957476467084,100,100,93.203252090329798,87.372985747093026,97.931331984029342,98.167834285647388,98.916025123945943,null,null,null,null,null,null,null,null,null,null,null,null,null,null,null,null,null,null,null,null,null,null,null,null,null,null,null,null,null,null,null,null,null,null,null,null,"No","N/A","N/A","N/A","N/A","N/A","N/A","N/A","N/A","N/A","N/A","N/A","N/A","N/A","N/A","N/A"]
["Water source available when needed","Yes","N/A","N/A","N/A","N/A","N/A","N/A","N/A","N/A","N/A","N/A","N/A","N/A","N/A","N/A","N/A",null,null,null,null,null,null,null,null,null,null,null,null,null,null,null,null,null,null,null,null,null,null,null,null,null,null,null,null,null,null,null,null,null,null,null,"Water source available when needed","Yes","N/A","N/A","N/A","N/A","N/A","N/A","N/A","N/A","N/A","N/A","N/A","N/A","N/A","N/A","N/A"]
[null,"No","N/A","N/A","N/A","N/A","N/A","N/A","N/A","N/A","N/A","N/A","N/A","N/A","N/A","N/A","N/A",null,null,null,null,null,null,null,null,null,null,null,null,null,null,null,null,null,null,null,null,null,null,null,null,null,null,null,null,null,null,null,null,null,null,null,null,"No","N/A","N/A","N/A","N/A","N/A","N/A","N/A","N/A","N/A","N/A","N/A","N/A","N/A","N/A","N/A"]
["Improved water source available when needed","Yes","N/A","N/A","N/A","N/A","N/A","N/A","N/A","N/A","N/A","N/A","N/A","N/A","N/A","N/A","N/A",null,null,null,null,null,null,null,null,null,null,null,null,null,null,null,null,null,null,null,null,null,null,null,null,null,null,null,null,null,null,null,null,null,null,null,"Improved water source available when needed","Yes","N/A","N/A","N/A","N/A","N/A","N/A","N/A","N/A","N/A","N/A","N/A","N/A","N/A","N/A","N/A"]
[null,"No","N/A","N/A","N/A","N/A","N/A","N/A","N/A","N/A","N/A","N/A","N/A","N/A","N/A","N/A","N/A",null,null,null,null,null,null,null,null,null,null,null,null,null,null,null,null,null,null,null,null,null,null,null,null,null,null,null,null,null,null,null,null,null,null,null,null,"No","N/A","N/A","N/A","N/A","N/A","N/A","N/A","N/A","N/A","N/A","N/A","N/A","N/A","N/A","N/A"]
["Microbiological quality at point of collection","Not contaminated (No E. coli in 100 mL)","N/A","N/A","N/A","N/A","N/A","N/A","N/A","N/A","N/A","N/A","N/A","N/A","N/A","N/A","N/A",null,null,null,null,null,null,null,null,null,null,null,null,null,null,null,null,null,null,null,null,null,null,null,null,null,null,null,null,null,null,null,null,null,null,null,"Microbiological quality at point of collection","Not contaminated (No E. coli in 100 mL)","N/A","N/A","N/A","N/A","N/A","N/A","N/A","N/A","N/A","N/A","N/A","N/A","N/A","N/A","N/A"]
[null,"Contaminated (E. coli detected in 100 mL)","N/A","N/A","N/A","N/A","N/A","N/A","N/A","N/A","N/A","N/A","N/A","N/A","N/A","N/A","N/A",null,null,null,null,null,null,null,null,null,null,null,null,null,null,null,null,null,null,null,null,null,null,null,null,null,null,null,null,null,null,null,null,null,null,null,null,"Contaminated (E. coli detected in 100 mL)","N/A","N/A","N/A","N/A","N/A","N/A","N/A","N/A","N/A","N/A","N/A","N/A","N/A","N/A","N/A"]
[null,"Highly contaminated (>100 CFU/100 mL)","N/A","N/A","N/A","N/A","N/A","N/A","N/A","N/A","N/A","N/A","N/A","N/A","N/A","N/A","N/A",null,null,null,null,null,null,null,null,null,null,null,null,null,null,null,null,null,null,null,null,null,null,null,null,null,null,null,null,null,null,null,null,null,null,null,null,"Highly contaminated (>100 CFU/100 mL)","N/A","N/A","N/A","N/A","N/A","N/A","N/A","N/A","N/A","N/A","N/A","N/A","N/A","N/A","N/A"]
["Microbiological quality of improved water sources at point of collection","Not contaminated (No E. coli in 100 mL)","N/A","N/A","N/A","N/A","N/A","N/A","N/A","N/A","N/A","N/A","N/A","N/A","N/A","N/A","N/A",null,null,null,null,null,null,null,null,null,null,null,null,null,null,null,null,null,null,null,null,null,null,null,null,null,null,null,null,null,null,null,null,null,null,null,"Microbiological quality of improved water sources at point of collection","Not contaminated (No E. coli in 100 mL)","N/A","N/A","N/A","N/A","N/A","N/A","N/A","N/A","N/A","N/A","N/A","N/A","N/A","N/A","N/A"]
[null,"Contaminated (E. coli detected in 100 mL)","N/A","N/A","N/A","N/A","N/A","N/A","N/A","N/A","N/A","N/A","N/A","N/A","N/A","N/A","N/A",null,null,null,null,null,null,null,null,null,null,null,null,null,null,null,null,null,null,null,null,null,null,null,null,null,null,null,null,null,null,null,null,null,null,null,null,"Contaminated (E. coli detected in 100 mL)","N/A","N/A","N/A","N/A","N/A","N/A","N/A","N/A","N/A","N/A","N/A","N/A","N/A","N/A","N/A"]
[null,"Highly contaminated (>100 CFU/100 mL)","N/A","N/A","N/A","N/A","N/A","N/A","N/A","N/A","N/A","N/A","N/A","N/A","N/A","N/A","N/A",null,null,null,null,null,null,null,null,null,null,null,null,null,null,null,null,null,null,null,null,null,null,null,null,null,null,null,null,null,null,null,null,null,null,null,null,"Highly contaminated (>100 CFU/100 mL)","N/A","N/A","N/A","N/A","N/A","N/A","N/A","N/A","N/A","N/A","N/A","N/A","N/A","N/A","N/A"]
["Microbiological quality of piped on premises at point of collection","Not contaminated (No E. coli in 100 mL)","N/A","N/A","N/A","N/A","N/A","N/A","N/A","N/A","N/A","N/A","N/A","N/A","N/A","N/A","N/A",null,null,null,null,null,null,null,null,null,null,null,null,null,null,null,null,null,null,null,null,null,null,null,null,null,null,null,null,null,null,null,null,null,null,null,"Microbiological quality of piped on premises at point of collection","Not contaminated (No E. coli in 100 mL)","N/A","N/A","N/A","N/A","N/A","N/A","N/A","N/A","N/A","N/A","N/A","N/A","N/A","N/A","N/A"]
[null,"Contaminated (E. coli detected in 100 mL)","N/A","N/A","N/A","N/A","N/A","N/A","N/A","N/A","N/A","N/A","N/A","N/A","N/A","N/A","N/A",null,null,null,null,null,null,null,null,null,null,null,null,null,null,null,null,null,null,null,null,null,null,null,null,null,null,null,null,null,null,null,null,null,null,null,null,"Contaminated (E. coli detected in 100 mL)","N/A","N/A","N/A","N/A","N/A","N/A","N/A","N/A","N/A","N/A","N/A","N/A","N/A","N/A","N/A"]
[null,"Highly contaminated (>100 CFU/100 mL)","N/A","N/A","N/A","N/A","N/A","N/A","N/A","N/A","N/A","N/A","N/A","N/A","N/A","N/A","N/A",null,null,null,null,null,null,null,null,null,null,null,null,null,null,null,null,null,null,null,null,null,null,null,null,null,null,null,null,null,null,null,null,null,null,null,null,"Highly contaminated (>100 CFU/100 mL)","N/A","N/A","N/A","N/A","N/A","N/A","N/A","N/A","N/A","N/A","N/A","N/A","N/A","N/A","N/A"]
[null,null,"NATIONAL wealth index quintile",null,null,null,null,"URBAN wealth index quintile",null,null,null,null,"RURAL wealth index quintile",null,null,null,null,null,null,null,null,null,null,null,null,null,null,null,null,null,null,null,null,null,null,null,null,null,null,null,null,null,null,null,null,null,null,null,null,null,null,null,"Raw numbers of respondents:","Use of drinking water sources","NATIONAL wealth index quintile",null,null,null,null,"URBAN wealth index quintile",null,null,null,null,"RURAL wealth index quintile"]
["Percentage based on weighted population",null,"Poorest","Poor","Middle","Rich","Richest","Poorest","Poor","Middle","Rich","Richest","Poorest","Poor","Middle","Rich","Richest",null,null,null,null,null,null,null,null,null,null,null,null,null,null,null,null,null,null,null,null,null,null,null,null,null,null,null,null,null,null,null,null,null,null,null,"Water data, raw numbers (weighted)",null,"Poorest","Poor","Middle","Rich","Richest","Poorest","Poor","Middle","Rich","Richest","Poorest","Poor","Middle","Rich","Richest"]
["main source of drinking water","Piped water through house connection or yard",1.1803286049719501,1.4160343843015297,3.854918128135798,9.2701451077439998,33.127004963907346,7.2305718479873216,13.194632661835499,29.074986650947899,33.781123894962292,53.85951485806784,0.38324713018675099,2.0059328813220172,1.9968997379000577,1.9682664798904039,6.8541015834561234]
[null,"Public standpipe",3.7012604059055452,11.29622784019935,18.212735990925928,20.861305921737507,14.193342781223123,38.021440458475539,43.711940674364818,30.58905291974791,19.579138934730754,10.891748108106233,2.7352969560930527,6.0516484058371969,7.7276603270163102,12.955338335186806,7.7372967187314341]
[null,"Protected tube well or bore hole",28.304766729479482,30.058815219139866,31.714221752551953,33.687221522106498,28.569050936655106,18.066746615310432,20.974321401992771,21.694172014972324,24.976940882909201,19.862599818858197,30.511871678161462,25.388901164042903,34.950244120311588,40.084875981748347,40.191601274827818]
[null,"Protected dug well or protected spring",17.14105225294449,12.802636251567909,19.87553451974086,19.987507026564735,16.905978660800411,11.070782554053354,13.067737818065991,12.683131435273557,14.610028841573891,10.992157422378765,15.04387163144626,17.803171134191935,17.501769161568404,18.853777195622488,27.546844550001058]
[null,"Unprotected dug well or spring",31.936396968574172,31.464082451723048,20.106116624376995,12.072361288843215,3.5319309189664807,17.169989335914018,6.1503627529757399,3.1556488051150939,3.451811267708317,2.8270918578885005,31.542403665408571,32.540541428605486,30.210459820882889,19.248098944472765,12.88056079594789]
[null,"Rainwater (into tank or cistern )",17.23504626537785,12.422762163583696,5.6781755171489436,3.8362865756989599,3.6726917384475337,8.4404691882593337,2.9010046907651788,2.803008173943216,3.6009561781155468,1.5668879347004692,19.409642953222519,15.449519047556354,6.4650891667136126,6.5022715014039667,4.7895950770356741]
[null,"Tanker-truck, vendor",0.50114877274651204,0.53944168948460081,0.55829746711952499,0.28517255730508534,0,0,0,0,0,0,0.37366598548138724,0.76028593844410564,1.1478776656071399,0.38737156167522574,0]
[]
[]
[]
[]
[]
[]
[]
[]
[]
[]
[]
[]
[]
[]
[]
[]
[]
[]
[]
[]
[]
[]
[]
[]
[]
[]
[]
[]
[]
[]
[]
[]
[]
[]
[]
[]
[]
[]
[]
[]
[]
[]
[]
[{"$f":"A1026","v":"Comoros"}]
[{"$f":"A1034","v":"2003"}]
["Use of sanitation facilities"]
[" by wealth quintile and sub-national region"]
["Notes:"]
["WHO/UNICEF JMP customised wealth index excludes water,"]
[" sanitation and hygiene assets."]
["Survey used for analysis:",{"$f":"A1025","v":"WHS03"}]
[{"$f":"B1030","v":""}]
[{"$f":"B1029","v":""}]
[]
[]
["Use of sanitation facilities",null,"NATIONAL wealth index quintile",null,null,null,null,"URBAN wealth index quintile",null,null,null,null,"RURAL wealth index quintile",null,null,null,null,null,null,null,null,null,null,null,null,null,null,null,null,null,null,null,null,null,null,null,null,null,null,null,null,null,null,null,null,null,null,null,null,null,null,null,"Raw numbers of respondents:","Use of sanitation facilities","NATIONAL wealth index quintile",null,null,null,null,"URBAN wealth index quintile",null,null,null,null,"RURAL wealth index quintile"]
["Weighted percentage (used in graphs)",null,"Poorest","Poor","Middle","Rich","Richest","Poorest","Poor","Middle","Rich","Richest","Poorest","Poor","Middle","Rich","Richest",null,null,null,null,null,null,null,null,null,null,null,null,null,null,null,null,null,null,null,null,null,null,null,null,null,null,null,null,null,null,null,null,null,null,null,"Sanitation data, raw numbers (weighted)",null,"Poorest","Poor","Middle","Rich","Richest","Poorest","Poor","Middle","Rich","Richest","Poorest","Poor","Middle","Rich","Richest"]
["Sanitation","Improved",7.4754966795706483,15.771899770176049,27.637185016705544,40.72953767008979,69.287002601254798,9.4154512026090735,34.153083758660102,43.938437163921897,62.320832142521979,87.76139871120003,6.7952505279614339,12.08515774922534,20.751196056799831,35.108635829669467,54.764073523307431,null,null,null,null,null,null,null,null,null,null,null,null,null,null,null,null,null,null,null,null,null,null,null,null,null,null,null,null,null,null,null,null,null,null,null,"Sanitation","Improved",524.97785568237305,1109.9804248809814,1938.9922533035278,2848.404839515686,4870.9873342514038,191.86728477478027,699.92819976806641,896.33335494995117,1284.4982595443726,1772.0927114486694,338.03376388549805,596.56305694580078,1044.993971824646,1746.2374124526978,2722.7946920394897]
[null,"Not Improved",92.524503320429346,84.228100229823951,72.362814983294456,59.27046232991021,30.712997398745205,90.584548797390923,65.846916241339898,56.061562836078103,37.679167857478021,12.238601288799966,93.204749472038557,87.914842250774655,79.248803943200173,64.891364170330533,45.235926476692569,null,null,null,null,null,null,null,null,null,null,null,null,null,null,null,null,null,null,null,null,null,null,null,null,null,null,null,null,null,null,null,null,null,null,null,null,"Not Improved",6497.6706476211548,5927.7286720275879,5076.8896179199219,4145.0574054718018,2159.1729431152344,1845.9244327545166,1349.4568710327148,1143.6421489715576,776.60749816894531,247.12386608123779,4636.5254888534546,4339.7652006149292,3990.8312835693359,3227.57421875,2249.0682773590088]
["Sanitation ladder","Basic",{"$f":"C122*C129/100","v":6.257023558465443},14.502179786878207,24.647110973331827,38.530312516766841,64.278192003900045,8.2825433385997727,31.528358893009205,40.266258243750379,57.523986353682382,83.082082543370234,5.7249161811752538,10.468648060203551,19.269865809238066,32.175969053074034,51.380136559990632,null,null,null,null,null,null,null,null,null,null,null,null,null,null,null,null,null,null,null,null,null,null,null,null,null,null,null,null,null,null,null,null,null,null,null,"Sanitation ladder","Basic",451.46966361999512,1024.4745483398438,1750.6394662857056,2701.6004953384399,4580.8997650146484,139.26163673400879,621.86526489257813,896.33335494995117,1243.6864042282104,1662.2561311721802,281.31581687927246,559.38658905029297,959.01147365570068,1668.6041975021362,2477.3630695343018]
[null,"Limited",{"$f":"C122*C128/100","v":1.2184731211052058},1.269719983297841,2.9900740433737143,2.1992251533229488,5.0088105973547457,1.1329078640093007,2.6247248656508986,3.6721789201715227,4.7968457888395939,4.6793161678297839,1.0703343467861799,1.6165096890217914,1.4813302475617649,2.9326667765954322,3.3839369633167991,null,null,null,null,null,null,null,null,null,null,null,null,null,null,null,null,null,null,null,null,null,null,null,null,null,null,null,null,null,null,null,null,null,null,null,null,"Limited",73.50819206237793,66.917642593383789,188.35278701782227,109.62787246704102,247.78572940826416,52.605648040771484,78.062934875488281,0,40.811855316162109,87.630128860473633,56.717947006225586,37.176467895507813,67.394264221191406,77.633214950561523,188.15976238250732]
[null,"Unimproved",{"$f":"100-C124-C125-C127","v":92.524503320429346},84.228100229823951,72.36281498329447,59.27046232991021,30.712997398745209,90.584548797390937,65.846916241339898,56.061562836078096,37.679167857478021,12.238601288799982,93.204749472038557,87.914842250774655,79.248803943200159,64.891364170330547,45.235926476692569,null,null,null,null,null,null,null,null,null,null,null,null,null,null,null,null,null,null,null,null,null,null,null,null,null,null,null,null,null,null,null,null,null,null,null,null,"Unimproved",6497.6706476211548,5927.7286720275879,5076.8896179199219,4145.0574054718018,2159.1729431152344,1845.9244327545166,1349.4568710327148,1143.6421489715576,776.60749816894531,247.12386608123779,4636.5254888534546,4339.7652006149292,3990.8312835693359,3227.57421875,2249.0682773590088]
[null,"Open defecation",0,0,0,0,0,0,0,0,0,0,0,0,0,0,0,null,null,null,null,null,null,null,null,null,null,null,null,null,null,null,null,null,null,null,null,null,null,null,null,null,null,null,null,null,null,null,null,null,null,null,null,"Open defecation",19.064857482910156,19.064857482910156,0,0,69.128625869750977,0,0,0,45.893333435058594,0,0,19.064857482910156,19.064857482910156,0,23.235292434692383]
["Shared among Improved Sanitation","Yes",16.299560729323851,8.0505202404267386,10.81902531522779,5.3995829050079678,7.2290767522162014,12.032433068054832,7.685176788714883,8.3575546997078227,7.6970181942847802,5.3318614294516866,15.751212444367063,13.375991630108508,7.1385294780459514,8.3531208413318812,6.1791184358785971,null,null,null,null,null,null,null,null,null,null,null,null,null,null,null,null,null,null,null,null,null,null,null,null,null,null,null,null,null,null,null,null,null,null,null,"Shared among improved sanitation facilities","Yes","N/A","N/A","N/A","N/A","N/A","N/A","N/A","N/A","N/A","N/A","N/A","N/A","N/A","N/A","N/A"]
[null,"No",83.700439270676156,91.949479759573265,89.18097468477221,94.600417094992025,92.770923247783799,87.967566931945157,92.314823211285116,91.642445300292181,92.30298180571522,94.668138570548308,84.24878755563293,86.624008369891499,92.861470521954047,91.646879158668114,93.820881564121407,null,null,null,null,null,null,null,null,null,null,null,null,null,null,null,null,null,null,null,null,null,null,null,null,null,null,null,null,null,null,null,null,null,null,null,null,"No","N/A","N/A","N/A","N/A","N/A","N/A","N/A","N/A","N/A","N/A","N/A","N/A","N/A","N/A","N/A"]
["Manually calculated ratios","Improved latrines",{"$f":"C156/(C156+C157)*100","v":7.0312719634992122},16.518187150945831,28.739381502359279,41.758966667309203,62.819248892695811,9.8481342159584884,34.64954872312164,42.292589105228544,57.067874227067684,81.336189487798606,6.7952505279614339,12.234386935250683,21.744654744072474,35.740646809231279,54.112549324337969]
[null,"Other"]
[null,"Other"]
[null,null,"NATIONAL wealth index quintile",null,null,null,null,"URBAN wealth index quintile",null,null,null,null,"RURAL wealth index quintile",null,null,null,null,null,null,null,null,null,null,null,null,null,null,null,null,null,null,null,null,null,null,null,null,null,null,null,null,null,null,null,null,null,null,null,null,null,null,null,"Raw numbers of respondents:","Use of sanitation facilities","NATIONAL wealth index quintile",null,null,null,null,"URBAN wealth index quintile",null,null,null,null,"RURAL wealth index quintile"]
["Percentage based on weighted population",null,"Poorest","Poor","Middle","Rich","Richest","Poorest","Poor","Middle","Rich","Richest","Poorest","Poor","Middle","Rich","Richest",null,null,null,null,null,null,null,null,null,null,null,null,null,null,null,null,null,null,null,null,null,null,null,null,null,null,null,null,null,null,null,null,null,null,null,"Sanitation data, raw numbers (weighted)",null,"Poorest","Poor","Middle","Rich","Richest","Poorest","Poor","Middle","Rich","Richest","Poorest","Poor","Middle","Rich","Richest"]
["Sanitation type","Sewer connection",0.27147674376614245,0.27089578754093019,0,0,0.98331507593515666,0,0,0,2.2266365160211232,0,0,0.38621535052312328,0.37858457186315936,0,0.46733573667866823,null,null,null,null,null,null,null,null,null,null,null,null,null,null,null,null,null,null,null,null,null,null,null,null,null,null,null,null,null,null,null,null,null,null,null,"Sanitation type","Sewer connection","N/A","N/A","N/A","N/A","N/A","N/A","N/A","N/A","N/A","N/A","N/A","N/A","N/A","N/A","N/A"]
[null,"Septic tank connection",0,0,0,0,0.31587404184095969,0,0,0,1.0774047538760188,0,0,0,0,0,0,null,null,null,null,null,null,null,null,null,null,null,null,null,null,null,null,null,null,null,null,null,null,null,null,null,null,null,null,null,null,null,null,null,null,null,null,"Septic tank connection","N/A","N/A","N/A","N/A","N/A","N/A","N/A","N/A","N/A","N/A","N/A","N/A","N/A","N/A","N/A"]
[null,"Improved latrines",7.2040199358045047,15.501003982635117,27.637185016705544,40.72953767008979,67.987813483478675,9.4154512026090735,34.153083758660102,43.938437163921897,59.016790872624838,87.76139871120003,6.7952505279614339,11.698942398702217,20.372611484936673,35.108635829669467,54.296737786628753,null,null,null,null,null,null,null,null,null,null,null,null,null,null,null,null,null,null,null,null,null,null,null,null,null,null,null,null,null,null,null,null,null,null,null,null,"Improved latrines","N/A","N/A","N/A","N/A","N/A","N/A","N/A","N/A","N/A","N/A","N/A","N/A","N/A","N/A","N/A"]
[null,"Unimproved facilities",92.524503320429346,84.228100229823951,72.362814983294456,59.27046232991021,30.712997398745205,90.584548797390923,65.846916241339898,56.061562836078103,37.679167857478021,12.238601288799966,93.204749472038557,87.914842250774655,79.248803943200173,64.891364170330533,45.235926476692569,null,null,null,null,null,null,null,null,null,null,null,null,null,null,null,null,null,null,null,null,null,null,null,null,null,null,null,null,null,null,null,null,null,null,null,null,"Unimproved facilities","N/A","N/A","N/A","N/A","N/A","N/A","N/A","N/A","N/A","N/A","N/A","N/A","N/A","N/A","N/A"]
[null,"Open defecation",0,0,0,0,0,0,0,0,0,0,0,0,0,0,0,null,null,null,null,null,null,null,null,null,null,null,null,null,null,null,null,null,null,null,null,null,null,null,null,null,null,null,null,null,null,null,null,null,null,null,null,"Open defecation","N/A","N/A","N/A","N/A","N/A","N/A","N/A","N/A","N/A","N/A","N/A","N/A","N/A","N/A","N/A"]
["Septic tank emptying practices","Not emptied/treated and disposed in situ","N/A","N/A","N/A","N/A","N/A","N/A","N/A","N/A","N/A","N/A","N/A","N/A","N/A","N/A","N/A",null,null,null,null,null,null,null,null,null,null,null,null,null,null,null,null,null,null,null,null,null,null,null,null,null,null,null,null,null,null,null,null,null,null,null,"Septic tank emptying practices","Not emptied/treated and disposed in situ","N/A","N/A","N/A","N/A","N/A","N/A","N/A","N/A","N/A","N/A","N/A","N/A","N/A","N/A","N/A"]
[null,"Emptied and buried on site","N/A","N/A","N/A","N/A","N/A","N/A","N/A","N/A","N/A","N/A","N/A","N/A","N/A","N/A","N/A",null,null,null,null,null,null,null,null,null,null,null,null,null,null,null,null,null,null,null,null,null,null,null,null,null,null,null,null,null,null,null,null,null,null,null,null,"Emptied and buried on site","N/A","N/A","N/A","N/A","N/A","N/A","N/A","N/A","N/A","N/A","N/A","N/A","N/A","N/A","N/A"]
[null,"Emptied and discharged locally","N/A","N/A","N/A","N/A","N/A","N/A","N/A","N/A","N/A","N/A","N/A","N/A","N/A","N/A","N/A",null,null,null,null,null,null,null,null,null,null,null,null,null,null,null,null,null,null,null,null,null,null,null,null,null,null,null,null,null,null,null,null,null,null,null,null,"Emptied and discharged locally","N/A","N/A","N/A","N/A","N/A","N/A","N/A","N/A","N/A","N/A","N/A","N/A","N/A","N/A","N/A"]
[null,"Emptied and removed offsite","N/A","N/A","N/A","N/A","N/A","N/A","N/A","N/A","N/A","N/A","N/A","N/A","N/A","N/A","N/A",null,null,null,null,null,null,null,null,null,null,null,null,null,null,null,null,null,null,null,null,null,null,null,null,null,null,null,null,null,null,null,null,null,null,null,null,"Emptied and removed offsite","N/A","N/A","N/A","N/A","N/A","N/A","N/A","N/A","N/A","N/A","N/A","N/A","N/A","N/A","N/A"]
["Latrine emptying practices","Not emptied/treated and disposed in situ","N/A","N/A","N/A","N/A","N/A","N/A","N/A","N/A","N/A","N/A","N/A","N/A","N/A","N/A","N/A",null,null,null,null,null,null,null,null,null,null,null,null,null,null,null,null,null,null,null,null,null,null,null,null,null,null,null,null,null,null,null,null,null,null,null,"Latrine emptying practices","Not emptied/treated and disposed in situ","N/A","N/A","N/A","N/A","N/A","N/A","N/A","N/A","N/A","N/A","N/A","N/A","N/A","N/A","N/A"]
[null,"Emptied and buried on site","N/A","N/A","N/A","N/A","N/A","N/A","N/A","N/A","N/A","N/A","N/A","N/A","N/A","N/A","N/A",null,null,null,null,null,null,null,null,null,null,null,null,null,null,null,null,null,null,null,null,null,null,null,null,null,null,null,null,null,null,null,null,null,null,null,null,"Emptied and buried on site","N/A","N/A","N/A","N/A","N/A","N/A","N/A","N/A","N/A","N/A","N/A","N/A","N/A","N/A","N/A"]
[null,"Emptied and discharged locally","N/A","N/A","N/A","N/A","N/A","N/A","N/A","N/A","N/A","N/A","N/A","N/A","N/A","N/A","N/A",null,null,null,null,null,null,null,null,null,null,null,null,null,null,null,null,null,null,null,null,null,null,null,null,null,null,null,null,null,null,null,null,null,null,null,null,"Emptied and discharged locally","N/A","N/A","N/A","N/A","N/A","N/A","N/A","N/A","N/A","N/A","N/A","N/A","N/A","N/A","N/A"]
[null,"Emptied and removed offsite","N/A","N/A","N/A","N/A","N/A","N/A","N/A","N/A","N/A","N/A","N/A","N/A","N/A","N/A","N/A",null,null,null,null,null,null,null,null,null,null,null,null,null,null,null,null,null,null,null,null,null,null,null,null,null,null,null,null,null,null,null,null,null,null,null,null,"Emptied and removed offsite","N/A","N/A","N/A","N/A","N/A","N/A","N/A","N/A","N/A","N/A","N/A","N/A","N/A","N/A","N/A"]
["Shared among improved sanitation facilities","Yes",16.032325265843873,7.4481938030067987,9.9889187744027836,4.940010004534642,6.923772786111174,11.285089657318911,7.4591383363673938,7.7208334405411705,7.3508382150335114,5.1146363084648652,15.445501403538719,12.547126821278894,6.5232845562803652,7.8502233733545079,5.6583821794551739,null,null,null,null,null,null,null,null,null,null,null,null,null,null,null,null,null,null,null,null,null,null,null,null,null,null,null,null,null,null,null,null,null,null,null,"Shared among improved sanitation facilities","Yes","N/A","N/A","N/A","N/A","N/A","N/A","N/A","N/A","N/A","N/A","N/A","N/A","N/A","N/A","N/A"]
[null,"No",82.328149179340372,85.069973726151389,82.338425726246186,86.548723318791403,88.852949794522203,82.503835604022797,89.599635214822598,84.660655140216647,88.151576219840564,90.81126829612721,82.613625524574857,81.256212536650352,84.858064730603843,86.129302632195447,85.914262659332735,null,null,null,null,null,null,null,null,null,null,null,null,null,null,null,null,null,null,null,null,null,null,null,null,null,null,null,null,null,null,null,null,null,null,null,null,"No","N/A","N/A","N/A","N/A","N/A","N/A","N/A","N/A","N/A","N/A","N/A","N/A","N/A","N/A","N/A"]
[null,"DK/missing",1.6395255548157603,7.4818324708418151,7.6726554993510305,8.5112666766739444,4.2232774193666156,6.2110747386582927,2.9412264488100157,7.618511419242183,4.4975855651259273,4.0740953954079266,1.9408730718864331,6.19666064207075,8.6186507131157875,6.0204739944500405,8.4273551612121,null,null,null,null,null,null,null,null,null,null,null,null,null,null,null,null,null,null,null,null,null,null,null,null,null,null,null,null,null,null,null,null,null,null,null,null,"DK/missing","N/A","N/A","N/A","N/A","N/A","N/A","N/A","N/A","N/A","N/A","N/A","N/A","N/A","N/A","N/A"]
["Shared among all sanitation facilities","Yes",83.656458508319659,91.949479759573265,89.152858283279329,94.571222549750246,93.041390960493004,87.860924189129648,92.314823211285116,91.642445300292181,92.159692881180618,94.632143162624743,84.24878755563293,86.57009596463007,92.861470521954047,91.646879158668114,94.258533803710023,null,null,null,null,null,null,null,null,null,null,null,null,null,null,null,null,null,null,null,null,null,null,null,null,null,null,null,null,null,null,null,null,null,null,null,"Shared among all sanitation facilities","Yes","N/A","N/A","N/A","N/A","N/A","N/A","N/A","N/A","N/A","N/A","N/A","N/A","N/A","N/A","N/A"]
[null,"No",16.343541491680337,8.0505202404267386,10.847141716720662,5.4287774502497568,6.9586090395069906,12.139075810870354,7.685176788714883,8.3575546997078227,7.8403071188193767,5.3678568373752649,15.751212444367063,13.42990403536993,7.1385294780459514,8.3531208413318812,5.741466196289978,null,null,null,null,null,null,null,null,null,null,null,null,null,null,null,null,null,null,null,null,null,null,null,null,null,null,null,null,null,null,null,null,null,null,null,null,"No","N/A","N/A","N/A","N/A","N/A","N/A","N/A","N/A","N/A","N/A","N/A","N/A","N/A","N/A","N/A"]
["What type of toilet facilities","Flush to piped sewage system",0.27219722211007574,0.29062435491080385,0,0,1.0036221969204184,0,0,0,2.2849554856405141,0,0,0.41073947381450576,0.40591767946425084,0,0.48753838068034039,null,null,null,null,null,null,null,null,null,null,null,null,null,null,null,null,null,null,null,null,null,null,null,null,null,null,null,null,null,null,null,null,null,null,null,"What type of toilet facilities","Flush to piped sewage system",19.064857482910156,19.064857482910156,0,0,69.128625869750977,0,0,0,45.893333435058594,0,0,19.064857482910156,19.064857482910156,0,23.235292434692383]
[null,"Flush to septic tank",0,0,0,0,0.32239737555235204,0,0,0,1.1056236098307224,0,0,0,0,0,0,null,null,null,null,null,null,null,null,null,null,null,null,null,null,null,null,null,null,null,null,null,null,null,null,null,null,null,null,null,null,null,null,null,null,null,null,"Flush to septic tank",0,0,0,0,22.206451416015625,0,0,0,22.206451416015625,0,0,0,0,0,0]
[null,"Pour flush latrine",0.26539226160207768,0.24115635393371052,0.53245031229920459,2.6800496476750975,19.91789663128996,0,0.82401127517250994,9.1311679883449219,12.646908932480242,39.654832201472836,0,0.40047094176735171,0.33682527263372286,1.2321592088266475,6.0914766960758415,null,null,null,null,null,null,null,null,null,null,null,null,null,null,null,null,null,null,null,null,null,null,null,null,null,null,null,null,null,null,null,null,null,null,null,null,"Pour flush latrine",18.588233947753906,15.81977367401123,35.455331802368164,176.22095775604248,1371.927433013916,0,16.390474319458008,172.08231544494629,254.01317977905273,791.91101455688477,0,18.588233947753906,15.81977367401123,58.89678955078125,290.30994892120361]
[null,"Covered dry latrine (with privacy)",6.9577465875981268,16.388741526048889,28.586358575797107,40.639805628269215,49.473980298098368,9.8481342159584884,34.364032534846736,38.430781747409668,47.915620730095306,49.082460027340083,6.7952505279614339,12.041337594637431,21.506651174106732,35.300265138277126,50.552476545872651,null,null,null,null,null,null,null,null,null,null,null,null,null,null,null,null,null,null,null,null,null,null,null,null,null,null,null,null,null,null,null,null,null,null,null,null,"Covered dry latrine (with privacy)",487.32476425170898,1075.0957937240601,1903.5369215011597,2672.1838817596436,3407.7248239517212,191.86728477478027,683.5377254486084,724.25103950500488,962.38529491424561,980.18169689178467,338.03376388549805,558.90996551513672,1010.1093406677246,1687.3406229019165,2409.2494506835938]
[null,"Uncovered dry latrine (without privacy)",91.996562443786644,82.827603320307148,70.881191111903689,56.68014472405568,29.282103498138902,90.151865784041505,64.811956189980762,52.438050264245419,36.046891241953219,11.262707771187079,93.204749472038557,86.380738299847962,77.398810546178254,63.467575652896222,42.868508377371164,null,null,null,null,null,null,null,null,null,null,null,null,null,null,null,null,null,null,null,null,null,null,null,null,null,null,null,null,null,null,null,null,null,null,null,null,"Uncovered dry latrine (without privacy)",6443.4946775436401,5433.4622211456299,4719.9073629379272,3726.8822231292725,2016.925874710083,1756.392970085144,1289.1798152923584,988.2263822555542,724.00185012817383,224.91741466522217,4636.5254888534546,4009.4428949356079,3635.2131652832031,3033.7284498214722,2043.0439281463623]
[null,"Other",0.50810148490308027,0.25187444479944188,0,0,0,0,0,0,0,0,0,0.76671368993274913,0.35179532761703608,0,0,null,null,null,null,null,null,null,null,null,null,null,null,null,null,null,null,null,null,null,null,null,null,null,null,null,null,null,null,null,null,null,null,null,null,null,null,"Other",35.587734222412109,16.522876739501953,0,0,0,0,0,0,0,0,0,35.587734222412109,16.522876739501953,0,0]
[null,null,null,null,null,null,null,null,null,null,null,null,null,null,null,null,null,null,null,null,null,null,null,null,null,null,null,null,null,null,null,null,null,null,null,null,null,null,null,null,null,null,null,null,null,null,null,null,null,null,null,null,null,"Total",7004.0602674484253,6559.9655227661133,6658.8996162414551,6575.2870626449585,6887.9132089614868,1948.2602548599243,1989.1080150604248,1884.5597372055054,2008.5001096725464,1997.0101261138916,4974.5592527389526,4641.5936861038208,4696.7300138473511,4779.9658622741699,4765.8386201858521]
[]
[]
[]
[]
[]
[]
[]
[]
[]
[]
[]
[]
[]
[]
[]
[]
[]
[]
[]
[]
[]
[]
[]
[]
[]
[]
[]
[]
[]
[]
[]
[]
[]
[]
[]
[]
[]
[]
[]
[]
[]
[]
[]
[]
[]
[]
[]
[]
[{"$f":"A1026","v":"Comoros"}]
[{"$f":"A1034","v":"2003"}]
["Access to hygiene facilities "]
[" by wealth quintile and sub-national region"]
["Notes:"]
["WHO/UNICEF JMP customised wealth index excludes water,"]
[" sanitation and hygiene assets."]
["Survey used for analysis:",{"$f":"A1025","v":"WHS03"}]
[]
[]
[]
[]
["Access to handwashing",null,"NATIONAL wealth index quintile",null,null,null,null,"URBAN wealth index quintile",null,null,null,null,"RURAL wealth index quintile",null,null,null,null,null,null,null,null,null,null,null,null,null,null,null,null,null,null,null,null,null,null,null,null,null,null,null,null,null,null,null,null,null,null,null,null,null,null,null,"Raw numbers of respondents:","Access to handwashing","NATIONAL wealth index quintile",null,null,null,null,"URBAN wealth index quintile",null,null,null,null,"RURAL wealth index quintile"]
["Weighted percentage (used in graphs)",null,"Poorest","Poor","Middle","Rich","Richest","Poorest","Poor","Middle","Rich","Richest","Poorest","Poor","Middle","Rich","Richest",null,null,null,null,null,null,null,null,null,null,null,null,null,null,null,null,null,null,null,null,null,null,null,null,null,null,null,null,null,null,null,null,null,null,null,"Hygiene data, raw numbers (weighted)",null,"Poorest","Poor","Middle","Rich","Richest","Poorest","Poor","Middle","Rich","Richest","Poorest","Poor","Middle","Rich","Richest"]
["Hygiene ladder","Basic","N/A","N/A","N/A","N/A","N/A","N/A","N/A","N/A","N/A","N/A","N/A","N/A","N/A","N/A","N/A",null,null,null,null,null,null,null,null,null,null,null,null,null,null,null,null,null,null,null,null,null,null,null,null,null,null,null,null,null,null,null,null,null,null,null,"Hygiene ladder","Basic","N/A","N/A","N/A","N/A","N/A","N/A","N/A","N/A","N/A","N/A","N/A","N/A","N/A","N/A","N/A"]
[null,"Limited","N/A","N/A","N/A","N/A","N/A","N/A","N/A","N/A","N/A","N/A","N/A","N/A","N/A","N/A","N/A",null,null,null,null,null,null,null,null,null,null,null,null,null,null,null,null,null,null,null,null,null,null,null,null,null,null,null,null,null,null,null,null,null,null,null,null,"Limited","N/A","N/A","N/A","N/A","N/A","N/A","N/A","N/A","N/A","N/A","N/A","N/A","N/A","N/A","N/A"]
[null,"No facility","N/A","N/A","N/A","N/A","N/A","N/A","N/A","N/A","N/A","N/A","N/A","N/A","N/A","N/A","N/A",null,null,null,null,null,null,null,null,null,null,null,null,null,null,null,null,null,null,null,null,null,null,null,null,null,null,null,null,null,null,null,null,null,null,null,null,"No facility","N/A","N/A","N/A","N/A","N/A","N/A","N/A","N/A","N/A","N/A","N/A","N/A","N/A","N/A","N/A"]
[null,null,null,null,null,null,null,null,null,null,null,null,null,null,null,null,null,null,null,null,null,null,null,null,null,null,null,null,null,null,null,null,null,null,null,null,null,null,null,null,null,null,null,null,null,null,null,null,null,null,null,null,"Observed handwashing place","Fixed","N/A","N/A","N/A","N/A","N/A","N/A","N/A","N/A","N/A","N/A","N/A","N/A","N/A","N/A","N/A"]
[null,null,null,null,null,null,null,null,null,null,null,null,null,null,null,null,null,null,null,null,null,null,null,null,null,null,null,null,null,null,null,null,null,null,null,null,null,null,null,null,null,null,null,null,null,null,null,null,null,null,null,null,null,"Mobile","N/A","N/A","N/A","N/A","N/A","N/A","N/A","N/A","N/A","N/A","N/A","N/A","N/A","N/A","N/A"]
[null,null,null,null,null,null,null,null,null,null,null,null,null,null,null,null,null,null,null,null,null,null,null,null,null,null,null,null,null,null,null,null,null,null,null,null,null,null,null,null,null,null,null,null,null,null,null,null,null,null,null,null,"Water / Soap","Water and soap","N/A","N/A","N/A","N/A","N/A","N/A","N/A","N/A","N/A","N/A","N/A","N/A","N/A","N/A","N/A"]
[null,null,null,null,null,null,null,null,null,null,null,null,null,null,null,null,null,null,null,null,null,null,null,null,null,null,null,null,null,null,null,null,null,null,null,null,null,null,null,null,null,null,null,null,null,null,null,null,null,null,null,null,null,"Water only","N/A","N/A","N/A","N/A","N/A","N/A","N/A","N/A","N/A","N/A","N/A","N/A","N/A","N/A","N/A"]
[null,null,null,null,null,null,null,null,null,null,null,null,null,null,null,null,null,null,null,null,null,null,null,null,null,null,null,null,null,null,null,null,null,null,null,null,null,null,null,null,null,null,null,null,null,null,null,null,null,null,null,null,null,"Soap only","N/A","N/A","N/A","N/A","N/A","N/A","N/A","N/A","N/A","N/A","N/A","N/A","N/A","N/A","N/A"]
[null,null,null,null,null,null,null,null,null,null,null,null,null,null,null,null,null,null,null,null,null,null,null,null,null,null,null,null,null,null,null,null,null,null,null,null,null,null,null,null,null,null,null,null,null,null,null,null,null,null,null,null,null,"Neither","N/A","N/A","N/A","N/A","N/A","N/A","N/A","N/A","N/A","N/A","N/A","N/A","N/A","N/A","N/A"]
[]
[]
[]
[]
[]
[]
[]
[]
[]
[]
[]
[]
[]
[]
[]
[]
[]
[]
[]
[]
[]
[]
[]
[]
[]
[]
[]
[]
[null,null,null,null,null,null,null,null,null,null,null,null,null,null,null,null,null,null,null,null,null,null,null,null,null,null,null,null,null,null,null,null,null,null,null,null,null,null,null,null,null,null,null,null,null,null,null,null,null,null,null,null,"Raw numbers of respondents:","Menstrual health and hygiene","NATIONAL wealth index quintile",null,null,null,null,"URBAN wealth index quintile",null,null,null,null,"RURAL wealth index quintile"]
[null,null,null,null,null,null,null,null,null,null,null,null,null,null,null,null,null,null,null,null,null,null,null,null,null,null,null,null,null,null,null,null,null,null,null,null,null,null,null,null,null,null,null,null,null,null,null,null,null,null,null,null,"MHH data, raw numbers (weighted)",null,"Poorest","Poor","Middle","Rich","Richest","Poorest","Poor","Middle","Rich","Richest","Poorest","Poor","Middle","Rich","Richest"]
[null,null,null,null,null,null,null,null,null,null,null,null,null,null,null,null,null,null,null,null,null,null,null,null,null,null,null,null,null,null,null,null,null,null,null,null,null,null,null,null,null,null,null,null,null,null,null,null,null,null,null,null,"Private place to wash and change","Yes","N/A","N/A","N/A","N/A","N/A","N/A","N/A","N/A","N/A","N/A","N/A","N/A","N/A","N/A","N/A"]
[null,null,null,null,null,null,null,null,null,null,null,null,null,null,null,null,null,null,null,null,null,null,null,null,null,null,null,null,null,null,null,null,null,null,null,null,null,null,null,null,null,null,null,null,null,null,null,null,null,null,null,null,null,"No","N/A","N/A","N/A","N/A","N/A","N/A","N/A","N/A","N/A","N/A","N/A","N/A","N/A","N/A","N/A"]
[null,null,null,null,null,null,null,null,null,null,null,null,null,null,null,null,null,null,null,null,null,null,null,null,null,null,null,null,null,null,null,null,null,null,null,null,null,null,null,null,null,null,null,null,null,null,null,null,null,null,null,null,null,"DK/not sure/missing","N/A","N/A","N/A","N/A","N/A","N/A","N/A","N/A","N/A","N/A","N/A","N/A","N/A","N/A","N/A"]
[null,null,null,null,null,null,null,null,null,null,null,null,null,null,null,null,null,null,null,null,null,null,null,null,null,null,null,null,null,null,null,null,null,null,null,null,null,null,null,null,null,null,null,null,null,null,null,null,null,null,null,null,"Use of menstrual materials","Materials reusable","N/A","N/A","N/A","N/A","N/A","N/A","N/A","N/A","N/A","N/A","N/A","N/A","N/A","N/A","N/A"]
[null,null,null,null,null,null,null,null,null,null,null,null,null,null,null,null,null,null,null,null,null,null,null,null,null,null,null,null,null,null,null,null,null,null,null,null,null,null,null,null,null,null,null,null,null,null,null,null,null,null,null,null,null,"Materials not reusable","N/A","N/A","N/A","N/A","N/A","N/A","N/A","N/A","N/A","N/A","N/A","N/A","N/A","N/A","N/A"]
[null,null,null,null,null,null,null,null,null,null,null,null,null,null,null,null,null,null,null,null,null,null,null,null,null,null,null,null,null,null,null,null,null,null,null,null,null,null,null,null,null,null,null,null,null,null,null,null,null,null,null,null,null,"No materials used","N/A","N/A","N/A","N/A","N/A","N/A","N/A","N/A","N/A","N/A","N/A","N/A","N/A","N/A","N/A"]
[null,null,null,null,null,null,null,null,null,null,null,null,null,null,null,null,null,null,null,null,null,null,null,null,null,null,null,null,null,null,null,null,null,null,null,null,null,null,null,null,null,null,null,null,null,null,null,null,null,null,null,null,null,"DK/not sure/missing","N/A","N/A","N/A","N/A","N/A","N/A","N/A","N/A","N/A","N/A","N/A","N/A","N/A","N/A","N/A"]
[null,null,null,null,null,null,null,null,null,null,null,null,null,null,null,null,null,null,null,null,null,null,null,null,null,null,null,null,null,null,null,null,null,null,null,null,null,null,null,null,null,null,null,null,null,null,null,null,null,null,null,null,"Use of menstrual materials with private place to wash and change","Materials reusable","N/A","N/A","N/A","N/A","N/A","N/A","N/A","N/A","N/A","N/A","N/A","N/A","N/A","N/A","N/A"]
[null,null,null,null,null,null,null,null,null,null,null,null,null,null,null,null,null,null,null,null,null,null,null,null,null,null,null,null,null,null,null,null,null,null,null,null,null,null,null,null,null,null,null,null,null,null,null,null,null,null,null,null,null,"Materials not reusable","N/A","N/A","N/A","N/A","N/A","N/A","N/A","N/A","N/A","N/A","N/A","N/A","N/A","N/A","N/A"]
[null,null,null,null,null,null,null,null,null,null,null,null,null,null,null,null,null,null,null,null,null,null,null,null,null,null,null,null,null,null,null,null,null,null,null,null,null,null,null,null,null,null,null,null,null,null,null,null,null,null,null,null,null,"No materials used","N/A","N/A","N/A","N/A","N/A","N/A","N/A","N/A","N/A","N/A","N/A","N/A","N/A","N/A","N/A"]
[null,null,null,null,null,null,null,null,null,null,null,null,null,null,null,null,null,null,null,null,null,null,null,null,null,null,null,null,null,null,null,null,null,null,null,null,null,null,null,null,null,null,null,null,null,null,null,null,null,null,null,null,"Awareness of menstruation before menarche","Yes","N/A","N/A","N/A","N/A","N/A","N/A","N/A","N/A","N/A","N/A","N/A","N/A","N/A","N/A","N/A"]
[null,null,null,null,null,null,null,null,null,null,null,null,null,null,null,null,null,null,null,null,null,null,null,null,null,null,null,null,null,null,null,null,null,null,null,null,null,null,null,null,null,null,null,null,null,null,null,null,null,null,null,null,null,"No","N/A","N/A","N/A","N/A","N/A","N/A","N/A","N/A","N/A","N/A","N/A","N/A","N/A","N/A","N/A"]
[null,null,null,null,null,null,null,null,null,null,null,null,null,null,null,null,null,null,null,null,null,null,null,null,null,null,null,null,null,null,null,null,null,null,null,null,null,null,null,null,null,null,null,null,null,null,null,null,null,null,null,null,null,"DK/not sure/missing","N/A","N/A","N/A","N/A","N/A","N/A","N/A","N/A","N/A","N/A","N/A","N/A","N/A","N/A","N/A"]
[null,null,null,null,null,null,null,null,null,null,null,null,null,null,null,null,null,null,null,null,null,null,null,null,null,null,null,null,null,null,null,null,null,null,null,null,null,null,null,null,null,null,null,null,null,null,null,null,null,null,null,null,"Participation in (all) activities during menstruation","Yes","N/A","N/A","N/A","N/A","N/A","N/A","N/A","N/A","N/A","N/A","N/A","N/A","N/A","N/A","N/A"]
[null,null,null,null,null,null,null,null,null,null,null,null,null,null,null,null,null,null,null,null,null,null,null,null,null,null,null,null,null,null,null,null,null,null,null,null,null,null,null,null,null,null,null,null,null,null,null,null,null,null,null,null,null,"No","N/A","N/A","N/A","N/A","N/A","N/A","N/A","N/A","N/A","N/A","N/A","N/A","N/A","N/A","N/A"]
[null,null,null,null,null,null,null,null,null,null,null,null,null,null,null,null,null,null,null,null,null,null,null,null,null,null,null,null,null,null,null,null,null,null,null,null,null,null,null,null,null,null,null,null,null,null,null,null,null,null,null,null,null,"DK/not sure/missing/no such activity","N/A","N/A","N/A","N/A","N/A","N/A","N/A","N/A","N/A","N/A","N/A","N/A","N/A","N/A","N/A"]
[null,null,null,null,null,null,null,null,null,null,null,null,null,null,null,null,null,null,null,null,null,null,null,null,null,null,null,null,null,null,null,null,null,null,null,null,null,null,null,null,null,null,null,null,null,null,null,null,null,null,null,null,"Participation in specific activities during menstruation","Did not go to school (amongst those usually attending school)","N/A","N/A","N/A","N/A","N/A","N/A","N/A","N/A","N/A","N/A","N/A","N/A","N/A","N/A","N/A"]
[null,null,null,null,null,null,null,null,null,null,null,null,null,null,null,null,null,null,null,null,null,null,null,null,null,null,null,null,null,null,null,null,null,null,null,null,null,null,null,null,null,null,null,null,null,null,null,null,null,null,null,null,null,"Did not go to work (amongst those who usually work)","N/A","N/A","N/A","N/A","N/A","N/A","N/A","N/A","N/A","N/A","N/A","N/A","N/A","N/A","N/A"]
[null,null,null,null,null,null,null,null,null,null,null,null,null,null,null,null,null,null,null,null,null,null,null,null,null,null,null,null,null,null,null,null,null,null,null,null,null,null,null,null,null,null,null,null,null,null,null,null,null,null,null,null,null,"Did not participate in social activities","N/A","N/A","N/A","N/A","N/A","N/A","N/A","N/A","N/A","N/A","N/A","N/A","N/A","N/A","N/A"]
[null,null,null,null,null,null,null,null,null,null,null,null,null,null,null,null,null,null,null,null,null,null,null,null,null,null,null,null,null,null,null,null,null,null,null,null,null,null,null,null,null,null,null,null,null,null,null,null,null,null,null,null,null,"Did not cook food","N/A","N/A","N/A","N/A","N/A","N/A","N/A","N/A","N/A","N/A","N/A","N/A","N/A","N/A","N/A"]
[null,null,null,null,null,null,null,null,null,null,null,null,null,null,null,null,null,null,null,null,null,null,null,null,null,null,null,null,null,null,null,null,null,null,null,null,null,null,null,null,null,null,null,null,null,null,null,null,null,null,null,null,null,"Did not eat with others","N/A","N/A","N/A","N/A","N/A","N/A","N/A","N/A","N/A","N/A","N/A","N/A","N/A","N/A","N/A"]
[null,null,null,null,null,null,null,null,null,null,null,null,null,null,null,null,null,null,null,null,null,null,null,null,null,null,null,null,null,null,null,null,null,null,null,null,null,null,null,null,null,null,null,null,null,null,null,null,null,null,null,null,null,"Did not bathe in regular place","N/A","N/A","N/A","N/A","N/A","N/A","N/A","N/A","N/A","N/A","N/A","N/A","N/A","N/A","N/A"]
[null,null,null,null,null,null,null,null,null,null,null,null,null,null,null,null,null,null,null,null,null,null,null,null,null,null,null,null,null,null,null,null,null,null,null,null,null,null,null,null,null,null,null,null,null,null,null,null,null,null,null,null,null,"Did not participate in other activities","N/A","N/A","N/A","N/A","N/A","N/A","N/A","N/A","N/A","N/A","N/A","N/A","N/A","N/A","N/A"]
[null,null,null,null,null,null,null,null,null,null,null,null,null,null,null,null,null,null,null,null,null,null,null,null,null,null,null,null,null,null,null,null,null,null,null,null,null,null,null,null,null,null,null,null,null,null,null,null,null,null,null,null,null,"DK/not sure/missing/no such activity","N/A","N/A","N/A","N/A","N/A","N/A","N/A","N/A","N/A","N/A","N/A","N/A","N/A","N/A","N/A"]
[]
[]
[]
[]
[]
[]
[]
[]
[]
[]
[]
[]
[]
[]
[]
[]
[]
[]
[]
[]
[]
[]
[]
[]
[]
[]
[]
[]
[]
[]
[]
[]
[]
[]
[]
[]
[]
[]
[]
[]
[]
[]
[]
[]
[]
[]
[]
[]
[]
[]
[]
[]
[]
[]
[null,null,null,null,null,null,null,null,null,null,null,null,null,null,null,null,null,null,null,null,null,null,null,null,null,null,null,null,null,null,null,null,null,null,null,null,null,null,null,null,null,null,null,null,null,null,null,null,null,null,null,null,"Raw numbers of respondents:","Basic water, sanitation and hygiene","NATIONAL wealth index quintile",null,null,null,null,"URBAN wealth index quintile",null,null,null,null,"RURAL wealth index quintile"]
[null,null,null,null,null,null,null,null,null,null,null,null,null,null,null,null,null,null,null,null,null,null,null,null,null,null,null,null,null,null,null,null,null,null,null,null,null,null,null,null,null,null,null,null,null,null,null,null,null,null,null,null,"WatSan data, raw numbers (weighted)",null,"Poorest","Poor","Middle","Rich","Richest","Poorest","Poor","Middle","Rich","Richest","Poorest","Poor","Middle","Rich","Richest"]
[null,null,null,null,null,null,null,null,null,null,null,null,null,null,null,null,null,null,null,null,null,null,null,null,null,null,null,null,null,null,null,null,null,null,null,null,null,null,null,null,null,null,null,null,null,null,null,null,null,null,null,null,"Use of Basic Water Sanitation and Hygiene","Yes","N/A","N/A","N/A","N/A","N/A","N/A","N/A","N/A","N/A","N/A","N/A","N/A","N/A","N/A","N/A"]
[null,null,null,null,null,null,null,null,null,null,null,null,null,null,null,null,null,null,null,null,null,null,null,null,null,null,null,null,null,null,null,null,null,null,null,null,null,null,null,null,null,null,null,null,null,null,null,null,null,null,null,null,null,"No","N/A","N/A","N/A","N/A","N/A","N/A","N/A","N/A","N/A","N/A","N/A","N/A","N/A","N/A","N/A"]
[null,null,null,null,null,null,null,null,null,null,null,null,null,null,null,null,null,null,null,null,null,null,null,null,null,null,null,null,null,null,null,null,null,null,null,null,null,null,null,null,null,null,null,null,null,null,null,null,null,null,null,null,"Use of Basic Water and Sanitation","Yes","N/A","N/A","N/A","N/A","N/A","N/A","N/A","N/A","N/A","N/A","N/A","N/A","N/A","N/A","N/A"]
[null,null,null,null,null,null,null,null,null,null,null,null,null,null,null,null,null,null,null,null,null,null,null,null,null,null,null,null,null,null,null,null,null,null,null,null,null,null,null,null,null,null,null,null,null,null,null,null,null,null,null,null,null,"No","N/A","N/A","N/A","N/A","N/A","N/A","N/A","N/A","N/A","N/A","N/A","N/A","N/A","N/A","N/A"]
[null,null,null,null,null,null,null,null,null,null,null,null,null,null,null,null,null,null,null,null,null,null,null,null,null,null,null,null,null,null,null,null,null,null,null,null,null,null,null,null,null,null,null,null,null,null,null,null,null,null,null,null,"Use of Basic Water and Hygiene","Yes","N/A","N/A","N/A","N/A","N/A","N/A","N/A","N/A","N/A","N/A","N/A","N/A","N/A","N/A","N/A"]
[null,null,null,null,null,null,null,null,null,null,null,null,null,null,null,null,null,null,null,null,null,null,null,null,null,null,null,null,null,null,null,null,null,null,null,null,null,null,null,null,null,null,null,null,null,null,null,null,null,null,null,null,null,"No","N/A","N/A","N/A","N/A","N/A","N/A","N/A","N/A","N/A","N/A","N/A","N/A","N/A","N/A","N/A"]
[null,null,null,null,null,null,null,null,null,null,null,null,null,null,null,null,null,null,null,null,null,null,null,null,null,null,null,null,null,null,null,null,null,null,null,null,null,null,null,null,null,null,null,null,null,null,null,null,null,null,null,null,"Use of Basic Sanitation and Hygiene","Yes","N/A","N/A","N/A","N/A","N/A","N/A","N/A","N/A","N/A","N/A","N/A","N/A","N/A","N/A","N/A"]
[null,null,null,null,null,null,null,null,null,null,null,null,null,null,null,null,null,null,null,null,null,null,null,null,null,null,null,null,null,null,null,null,null,null,null,null,null,null,null,null,null,null,null,null,null,null,null,null,null,null,null,null,null,"No","N/A","N/A","N/A","N/A","N/A","N/A","N/A","N/A","N/A","N/A","N/A","N/A","N/A","N/A","N/A"]
[null,null,null,null,null,null,null,null,null,null,null,null,null,null,null,null,null,null,null,null,null,null,null,null,null,null,null,null,null,null,null,null,null,null,null,null,null,null,null,null,null,null,null,null,null,null,null,null,null,null,null,null,"Use of Basic Water","Yes","N/A","N/A","N/A","N/A","N/A","N/A","N/A","N/A","N/A","N/A","N/A","N/A","N/A","N/A","N/A"]
[null,null,null,null,null,null,null,null,null,null,null,null,null,null,null,null,null,null,null,null,null,null,null,null,null,null,null,null,null,null,null,null,null,null,null,null,null,null,null,null,null,null,null,null,null,null,null,null,null,null,null,null,null,"No","N/A","N/A","N/A","N/A","N/A","N/A","N/A","N/A","N/A","N/A","N/A","N/A","N/A","N/A","N/A"]
[null,null,null,null,null,null,null,null,null,null,null,null,null,null,null,null,null,null,null,null,null,null,null,null,null,null,null,null,null,null,null,null,null,null,null,null,null,null,null,null,null,null,null,null,null,null,null,null,null,null,null,null,"Use of Basic Sanitation","Yes","N/A","N/A","N/A","N/A","N/A","N/A","N/A","N/A","N/A","N/A","N/A","N/A","N/A","N/A","N/A"]
[null,null,null,null,null,null,null,null,null,null,null,null,null,null,null,null,null,null,null,null,null,null,null,null,null,null,null,null,null,null,null,null,null,null,null,null,null,null,null,null,null,null,null,null,null,null,null,null,null,null,null,null,null,"No","N/A","N/A","N/A","N/A","N/A","N/A","N/A","N/A","N/A","N/A","N/A","N/A","N/A","N/A","N/A"]
[null,null,null,null,null,null,null,null,null,null,null,null,null,null,null,null,null,null,null,null,null,null,null,null,null,null,null,null,null,null,null,null,null,null,null,null,null,null,null,null,null,null,null,null,null,null,null,null,null,null,null,null,"Access to Basic Hygiene","Yes","N/A","N/A","N/A","N/A","N/A","N/A","N/A","N/A","N/A","N/A","N/A","N/A","N/A","N/A","N/A"]
[null,null,null,null,null,null,null,null,null,null,null,null,null,null,null,null,null,null,null,null,null,null,null,null,null,null,null,null,null,null,null,null,null,null,null,null,null,null,null,null,null,null,null,null,null,null,null,null,null,null,null,null,null,"No","N/A","N/A","N/A","N/A","N/A","N/A","N/A","N/A","N/A","N/A","N/A","N/A","N/A","N/A","N/A"]
[]
[]
[]
[]
[]
[]
[]
[]
[]
[]
[]
[]
[]
[]
[]
[]
[]
[]
[]
[]
[]
[]
[]
[]
[]
[]
[]
[]
[]
[]
[]
[]
[]
[]
[]
[]
[]
[]
[]
[]
[]
[]
[]
[]
[null,null,"INITIAL (national) Wealth Index",null,null,null,null,"URBAN Wealth Index",null,null,null,null,"RURAL Wealth Index"]
[null,null,"Component Matrix",null,null,null,null,"Component Matrix",null,null,null,null,"Component Matrix"]
[null,null,null,null,"Component",null,null,null,null,"Component",null,null,null,null,"Component"]
[null,"Note:\n\nThe INITIAL (national) Wealth Index is based on the first component of the Principal Component Analysis (PCA) which has been obtained at national level.\n\nThe final national-level (NATIONAL) Wealth Index is based on the URBAN and RURAL specific wealth indexes. Regression procedures are used to establish the relationships between the two sets of scores (urban and rural) and the initial (national) wealth factors.\nThis allows best use of the available information for each area and a better precision of the FINAL (NATIONAL) Wealth Index.\n\nFor dependency reasons, all WASH variables (contained in the generic MICS and DHS scripts) have been excluded from the sets of asset variables used in the PCAs.\n\nThe PCA can extracts as many components as there are asset variables in the input. Only the first of the components is used to represent the Wealth Index. \n\nThe scores represent the weights of the asset variables on the Wealth Index (correlations between the variables and the component).\n\nThe communalities are the proportion of each variable's variance that can be explained by the component.\n\nProportion of explained variance is the part of the model's total variance that is explained by the component.\n\nFor more information on the procedure used:\n\nThe DHS Wealth Index, DHS Comparative Reports No. 6, Shea Oscar Rutstein, Kiersten Johnson, ORC Macro International Inc., 2004.\n\nThe DHS Wealth Index: Approaches for Rural and Urban Areas, Shea O. Rutstein, ORC Macro International Inc., 2008.\n\nMICS Methodological Paper No. 4, Review of options for reporting water, sanitation and hygiene coverage by wealth quintile, UNICEF, 2016.",null,null,"1",null,null,null,null,"1",null,null,null,null,"1"]
[null,null,"Has Television",null,0.72031214227104934,null,null,"Has Television",null,0.65265447688123901,null,null,"Has Television",null,0.70658335737408728]
[null,null,"Has Electricity",null,0.69857568389080205,null,null,"Has Refrigerator",null,0.63313937698789058,null,null,"Has Refrigerator",null,0.68453153613447515]
[null,null,"Has Refrigerator",null,0.69573373413338424,null,null,"Has Fix telephone",null,0.63221836593155223,null,null,"Has Electricity",null,0.67693733884890284]
[null,null,"Uses wood fuel",null,0.63402947537779575,null,null,"Uses wood fuel",null,0.58223079246992016,null,null,"Has hearth floor",null,0.52465329578137376]
[null,null,"Uses kerozene fuel",null,-0.62859316135271637,null,null,"Has Clock",null,0.57204888233325779,null,null,"Has cement, brick, stone or wood wall",null,-0.51827481487935578]
[null,null,"Has Fix telephone",null,0.62362650092723093,null,null,"Has Electricity",null,0.56635898091995629,null,null,"Has Clock",null,0.51252052377927748]
[null,null,"Uses closed stove with chimney",null,-0.61521581647700962,null,null,"Uses kerozene fuel",null,-0.51827426845405711,null,null,"Has Fix telephone",null,0.50567197990092072]
[null,null,"Has Clock",null,0.55014111517487518,null,null,"Uses closed stove with chimney",null,-0.50920392839340067,null,null,"Has hard floor",null,-0.48886469401098825]
[null,null,"Has cement, brick, stone or wood wall",null,-0.52271257248714897,null,null,"Has cement, brick, stone or wood wall",null,-0.48141853452468886,null,null,"Uses kerozene fuel",null,-0.47339901901653303]
[null,null,"Has hearth floor",null,0.49173149134090249,null,null,"Has Car",null,0.4489640098756571,null,null,"Uses closed stove with chimney",null,-0.45462826564864323]
[null,null,"Has hard floor",null,-0.46217297963830301,null,null,"Has metal sheet wall",null,0.44377768177365218,null,null,"Uses wood fuel",null,0.44552094582098828]
[null,null,"Permanent Income question 16",null,0.42064045581086251,null,null,"Permanent Income question 20",null,0.40666068556228691,null,null,"Permanent Income question 16",null,0.40975092477266745]
[null,null,"Has metal sheet wall",null,0.41651917348065592,null,null,"Has hearth floor",null,0.40183854423908927,null,null,"Has Car",null,0.40918260731895512]
[null,null,"Has Car",null,0.38039115876000829,null,null,"Has hard floor",null,-0.38162872843378798,null,null,"Has metal sheet wall",null,0.36079466982758285]
[null,null,"Permanent Income question 20",null,0.36694609939875367,null,null,"Has Bicycle",null,0.35514117680752316,null,null,"Permanent Income question 18",null,0.33428598557808087]
[null,null,"Has Bicycle",null,0.34097352127077285,null,null,"Permanent Income question 16",null,0.30659460974321273,null,null,"Permanent Income question 20",null,0.29001658529901586]
[null,null,"Permanent Income question 18",null,0.26013592412796455,null,null,"Has Computer",null,0.26998410281569191,null,null,"Has Bicycle",null,0.24431613787852494]
[null,null,"Has Computer",null,0.26007985258787375,null,null,"Permanent Income question 18",null,0.26491631436707191,null,null,"Uses gaz fuel",null,-0.22081499053682069]
[null,null,"Uses gaz fuel",null,-0.23110395210266677,null,null,"Uses gaz fuel",null,-0.25353574233403842,null,null,"Has mud brick wall",null,-0.19740337694338081]
[null,null,"Uses separate building as kitchen",null,0.19196807329444177,null,null,"Has Clothes washing machine",null,0.25290515879283409,null,null,"Has Bucket",null,0.19335076872569601]
[null,null,"Has mud brick wall",null,-0.18846785812249395,null,null,"Uses separate room as kitchen",null,-0.24563677810950352,null,null,"Has Mobile telephone",null,0.17567798352068265]
[null,null,"Has Bucket",null,0.18299124833742941,null,null,"Uses separate building as kitchen",null,0.23933742087601423,null,null,"Has Computer",null,0.16362486104954896]
[null,null,"Has Clothes washing machine",null,0.16902347622248884,null,null,"Has Dish washing machine",null,0.1171927340751458,null,null,"Uses separate building as kitchen",null,0.12814212888917498]
[null,null,"Uses separate room as kitchen",null,-0.1652211503193638,null,null,"Permanent Income question 17",null,0.11201416757936207,null,null,"Uses living or sleeping room as kitchen",null,-0.11687211941233688]
[null,null,"Has Mobile telephone",null,0.15346747421047854,null,null,"Has Mobile telephone",null,9.5733794047133294E-2,null,null,"Has Dish washing machine",null,0.11332563277129336]
[null,null,"Has Dish washing machine",null,0.11287656541027442,null,null,"Has thatch wall",null,9.5482497665059354E-2,null,null,"Permanent Income question 19",null,9.0111089059630764E-2]
[null,null,"Permanent Income question 19",null,8.2959342665022848E-2,null,null,"Uses kerozene heating",null,-8.8231189781025371E-2,null,null,"Has Clothes washing machine",null,7.7008259098790735E-2]
[null,null,"Has thatch wall",null,8.0230236186549495E-2,null,null,"Permanent Income question 19",null,8.7936204774153343E-2,null,null,"Uses separate room as kitchen",null,-7.2808417318214275E-2]
[null,null,"Kooks outdoor",null,7.6786858064820496E-2,null,null,"Kooks outdoor",null,7.9904646217737796E-2,null,null,"Has thatch wall",null,6.3931296132127335E-2]
[null,null,"Uses kerozene heating",null,-6.8277235380189316E-2,null,null,"Has mud brick wall",null,-7.3628588491639918E-2,null,null,"Has plastic sheet wall",null,-4.6992440449732102E-2]
[null,null,"Uses living or sleeping room as kitchen",null,-6.8207723090892944E-2,null,null,"Uses living or sleeping room as kitchen",null,6.9412738795368079E-2,null,null,"Uses open fire with chimney",null,-3.0472099627740463E-2]
[null,null,"Uses electricity fuel",null,-6.4998184121908581E-2,null,null,"Uses electricity fuel",null,-5.9725219284054117E-2,null,null,"Uses shrubs grass heating",null,-2.9640838315712362E-2]
[null,null,"Permanent Income question 17",null,4.1336492489020465E-2,null,null,"Heats house",null,-5.4887553691231189E-2,null,null,"Uses charcoal fuel",null,2.8230642974114428E-2]
[null,null,"Has plastic sheet wall",null,-3.9001731377096824E-2,null,null,"Uses electricity heating",null,-5.4887553691229801E-2,null,null,"Uses open fire without chimney",null,2.4643746917344167E-2]
[null,null,"Uses open fire with chimney",null,-3.8111301827692061E-2,null,null,"Uses charcoal fuel",null,4.7064522617601315E-2,null,null,"Kooks outdoor",null,2.0178233134113984E-2]
[null,null,"Uses electricity heating",null,-3.6909240659481729E-2,null,null,"Has Bucket",null,-2.3293193087461857E-2,null,null,"Heats house",null,8.9340684845919567E-3]
[null,null,"Uses charcoal fuel",null,3.3284853172545821E-2,null,null,"Uses open fire with chimney",null,-1.5026249668361528E-2,null,null,"Permanent Income question 17",null,-5.9863615309615498E-3]
[null,null,"Uses shrubs grass heating",null,-6.2874594589141788E-3,null,null,"Uses coal fuel",null,1.3399027824498918E-2,null,null,"Uses coal fuel",null,-1.5392055367331728E-3]
[null,null,"Uses open fire without chimney",null,5.7093195193700505E-3,null,null,"Uses open fire without chimney",null,-1.2846093389228876E-2]
[null,null,"Uses coal fuel",null,-5.3424930001185729E-3,null,null,"Has plastic sheet wall",null,2.1888583322841994E-3]
[null,null,"Heats house",null,5.1713724023405095E-3]
[null,null,null,null,null,null,null,null,null,null,null,null,"Communalities"]
[null,null,null,null,null,null,null,null,null,null,null,null,null,null,"Extraction"]
[null,null,null,null,null,null,null,"Communalities",null,null,null,null,"Has hard floor",null,0.23898868905045717]
[null,null,"Communalities",null,null,null,null,null,null,"Extraction",null,null,"Has hearth floor",null,0.27526108077425765]
[null,null,null,null,"Extraction",null,null,"Has hard floor",null,0.14564048636598989,null,null,"Has cement, brick, stone or wood wall",null,0.26860878373823049]
[null,null,"Has hard floor",null,0.21360386310774723,null,null,"Has hearth floor",null,0.16147421563619049,null,null,"Has mud brick wall",null,3.896809322865049E-2]
[null,null,"Has hearth floor",null,0.24179985957634806,null,null,"Has cement, brick, stone or wood wall",null,0.23176380538389904,null,null,"Has thatch wall",null,4.0872106251337598E-3]
[null,null,"Has cement, brick, stone or wood wall",null,0.27322843343613296,null,null,"Has mud brick wall",null,5.4211690432712503E-3,null,null,"Has plastic sheet wall",null,2.2082894594216179E-3]
[null,null,"Has mud brick wall",null,3.5520133545280511E-2,null,null,"Has thatch wall",null,9.1169073603580651E-3,null,null,"Has metal sheet wall",null,0.13017279377599453]
[null,null,"Has thatch wall",null,6.4368907985495162E-3,null,null,"Has plastic sheet wall",null,4.7911007988099671E-6,null,null,"Uses gaz fuel",null,4.8759260045776208E-2]
[null,null,"Has plastic sheet wall",null,1.5211350504112189E-3,null,null,"Has metal sheet wall",null,0.19693863084039689,null,null,"Uses kerozene fuel",null,0.22410663120581581]
[null,null,"Has metal sheet wall",null,0.17348822187700874,null,null,"Uses gaz fuel",null,6.4280372640871913E-2,null,null,"Uses coal fuel",null,2.3691536843100545E-6]
[null,null,"Uses gaz fuel",null,5.3409036677471697E-2,null,null,"Uses electricity fuel",null,3.5671018185283497E-3,null,null,"Uses charcoal fuel",null,7.9696920273191634E-4]
[null,null,"Uses electricity fuel",null,4.224763939145529E-3,null,null,"Uses kerozene fuel",null,0.26860821734158807,null,null,"Uses wood fuel",null,0.19848891316522799]
[null,null,"Uses kerozene fuel",null,0.39512936249940211,null,null,"Uses coal fuel",null,1.7953394664169621E-4,null,null,"Uses open fire without chimney",null,6.0731426212611017E-4]
[null,null,"Uses coal fuel",null,2.8542231456315952E-5,null,null,"Uses charcoal fuel",null,2.2150692892227057E-3,null,null,"Uses open fire with chimney",null,9.2854885572294049E-4]
[null,null,"Uses charcoal fuel",null,1.1078814507179337E-3,null,null,"Uses wood fuel",null,0.33899269570015123,null,null,"Uses closed stove with chimney",null,0.20668685992669331]
[null,null,"Uses wood fuel",null,0.40199337564784293,null,null,"Uses open fire without chimney",null,1.6502211536478982E-4,null,null,"Uses living or sleeping room as kitchen",null,1.3659092295931532E-2]
[null,null,"Uses open fire without chimney",null,3.2596329374259865E-5,null,null,"Uses open fire with chimney",null,2.2578817909593493E-4,null,null,"Uses separate room as kitchen",null,5.3010656323832445E-3]
[null,null,"Uses open fire with chimney",null,1.4524713270014443E-3,null,null,"Uses closed stove with chimney",null,0.2592886406912715,null,null,"Uses separate building as kitchen",null,1.6420405196249932E-2]
[null,null,"Uses closed stove with chimney",null,0.37849050084347358,null,null,"Uses living or sleeping room as kitchen",null,4.818128307073997E-3,null,null,"Kooks outdoor",null,4.0716109241465548E-4]
[null,null,"Uses living or sleeping room as kitchen",null,4.6522934892439301E-3,null,null,"Uses separate room as kitchen",null,6.0337426760017465E-2,null,null,"Heats house",null,7.9817579687379219E-5]
[null,null,"Uses separate room as kitchen",null,2.7298028512853807E-2,null,null,"Uses separate building as kitchen",null,5.7282401031582372E-2,null,null,"Uses shrubs grass heating",null,8.7857929605820203E-4]
[null,null,"Uses separate building as kitchen",null,3.6851741164380163E-2,null,null,"Kooks outdoor",null,6.3847524871818388E-3,null,null,"Has Car",null,0.16743040613233823]
[null,null,"Kooks outdoor",null,5.8962215714668887E-3,null,null,"Heats house",null,3.0126435502077866E-3,null,null,"Has Electricity",null,0.4582441607278343]
[null,null,"Heats house",null,2.6743092523689053E-5,null,null,"Uses electricity heating",null,3.012643550207634E-3,null,null,"Has Bicycle",null,5.9690375227878407E-2]
[null,null,"Uses electricity heating",null,1.3622920460595392E-3,null,null,"Uses kerozene heating",null,7.7847428501753154E-3,null,null,"Has Clock",null,0.26267728729498491]
[null,null,"Uses kerozene heating",null,4.6617808711617754E-3,null,null,"Has Car",null,0.20156868216362914,null,null,"Has Bucket",null,3.7384519766817587E-2]
[null,null,"Uses shrubs grass heating",null,3.9532146447489376E-5,null,null,"Has Electricity",null,0.32076249526869144,null,null,"Has Clothes washing machine",null,5.9302719694264861E-3]
[null,null,"Has Car",null,0.14469743366278182,null,null,"Has Bicycle",null,0.12612525546423242,null,null,"Has Dish washing machine",null,1.2842699043014039E-2]
[null,null,"Has Electricity",null,0.48800798612350177,null,null,"Has Clock",null,0.3272399237787294,null,null,"Has Refrigerator",null,0.46858342396262426]
[null,null,"Has Bicycle",null,0.11626294220779018,null,null,"Has Bucket",null,5.4257284420978081E-4,null,null,"Has Fix telephone",null,0.25570415125691714]
[null,null,"Has Clock",null,0.3026552466058553,null,null,"Has Clothes washing machine",null,6.3961019344028633E-2,null,null,"Has Mobile telephone",null,3.0862753893893244E-2]
[null,null,"Has Bucket",null,3.3485796968090766E-2,null,null,"Has Dish washing machine",null,1.373413692000784E-2,null,null,"Has Television",null,0.49926004091803716]
[null,null,"Has Clothes washing machine",null,2.8568935514334249E-2,null,null,"Has Refrigerator",null,0.40086547069261425,null,null,"Has Computer",null,2.6773095153484205E-2]
[null,null,"Has Dish washing machine",null,1.274111901881996E-2,null,null,"Has Fix telephone",null,0.39970006222116206,null,null,"Permanent Income question 16",null,0.16789582035205616]
[null,null,"Has Refrigerator",null,0.48404542881118257,null,null,"Has Mobile telephone",null,9.1649593226589346E-3,null,null,"Permanent Income question 17",null,3.5836524379376313E-5]
[null,null,"Has Fix telephone",null,0.38891001265874159,null,null,"Has Television",null,0.42595786619312376,null,null,"Permanent Income question 18",null,0.11174712015390889]
[null,null,"Has Mobile telephone",null,2.3552265640543898E-2,null,null,"Has Computer",null,7.2891415773194093E-2,null,null,"Permanent Income question 19",null,8.1200083715127075E-3]
[null,null,"Has Television",null,0.5188495823031084,null,null,"Permanent Income question 16",null,9.4000254723592913E-2,null,null,"Permanent Income question 20",null,8.4109619748501341E-2]
[null,null,"Has Computer",null,6.7641529722130139E-2,null,null,"Permanent Income question 17",null,1.2547173738497409E-2]
[null,null,"Permanent Income question 16",null,0.17693839306477019,null,null,"Permanent Income question 18",null,7.018065361783328E-2]
[null,null,"Permanent Income question 17",null,1.7087056112948453E-3,null,null,"Permanent Income question 19",null,7.7327761100818293E-3,null,null,"Total Variance Explained"]
[null,null,"Permanent Income question 18",null,6.7670699021910127E-2,null,null,"Permanent Income question 20",null,0.16537291318198918,null,null,"Component",null,"Extraction Sums of Squared Loadings"]
[null,null,"Permanent Income question 19",null,6.8822525354126805E-3,null,null,null,null,null,null,null,null,null,"Total","% of Variance","Cumulative %"]
[null,null,"Permanent Income question 20",null,0.13464943986396,null,null,null,null,null,null,null,"1",null,4.3327095180602573,11.40186715279015,11.40186715279015]
[null,null,null,null,null,null,null,"Total Variance Explained"]
[null,null,null,null,null,null,null,"Component",null,"Extraction Sums of Squared Loadings"]
[null,null,"Total Variance Explained",null,null,null,null,null,null,"Total","% of Variance","Cumulative %","Component Score Coefficient Matrix"]
[null,null,"Component",null,"Extraction Sums of Squared Loadings",null,null,"1",null,4.5428628173483636,11.357157043370909,11.357157043370909,null,null,"Component"]
[null,null,null,null,"Total","% of Variance","Cumulative %",null,null,null,null,null,null,null,"1"]
[null,null,"1",null,5.2595234705657292,12.828106025770072,12.828106025770072,null,null,null,null,null,"Has hard floor",null,-0.11283117226604465]
[null,null,null,null,null,null,null,"Component Score Coefficient Matrix",null,null,null,null,"Has hearth floor",null,0.12109126946877796]
[null,null,null,null,null,null,null,null,null,"Component",null,null,"Has cement, brick, stone or wood wall",null,-0.11961910040795581]
[null,null,"Component Score Coefficient Matrix",null,null,null,null,null,null,"1",null,null,"Has mud brick wall",null,-4.5561184316773161E-2]
[null,null,null,null,"Component",null,null,"Has hard floor",null,-8.4006218936750102E-2,null,null,"Has thatch wall",null,1.4755500193502288E-2]
[null,null,null,null,"1",null,null,"Has hearth floor",null,8.8454914972237619E-2,null,null,"Has plastic sheet wall",null,-1.0845970691977173E-2]
[null,null,"Has hard floor",null,-8.7873546382062323E-2,null,null,"Has cement, brick, stone or wood wall",null,-0.10597250101549169,null,null,"Has metal sheet wall",null,8.3272296082546896E-2]
[null,null,"Has hearth floor",null,9.3493544442346685E-2,null,null,"Has mud brick wall",null,-1.6207530680976277E-2,null,null,"Uses gaz fuel",null,-5.0964642244393746E-2]
[null,null,"Has cement, brick, stone or wood wall",null,-9.9384017470868807E-2,null,null,"Has thatch wall",null,2.1018133609588461E-2,null,null,"Uses kerozene fuel",null,-0.10926165648614092]
[null,null,"Has mud brick wall",null,-3.5833637624631001E-2,null,null,"Has plastic sheet wall",null,4.8182355934794013E-4,null,null,"Uses coal fuel",null,-3.5525241891182007E-4]
[null,null,"Has thatch wall",null,1.5254278574009234E-2,null,null,"Has metal sheet wall",null,9.7686789061502424E-2,null,null,"Uses charcoal fuel",null,6.5157017465489377E-3]
[null,null,"Has plastic sheet wall",null,-7.41544963063007E-3,null,null,"Uses gaz fuel",null,-5.5809684889852218E-2,null,null,"Uses wood fuel",null,0.10282732871056789]
[null,null,"Has metal sheet wall",null,7.9193329169772467E-2,null,null,"Uses electricity fuel",null,-1.3147044426693762E-2,null,null,"Uses open fire without chimney",null,5.6878373254935187E-3]
[null,null,"Uses gaz fuel",null,-4.3940093317581211E-2,null,null,"Uses kerozene fuel",null,-0.11408538828750504,null,null,"Uses open fire with chimney",null,-7.0330354483082768E-3]
[null,null,"Uses electricity fuel",null,-1.2358188814188749E-2,null,null,"Uses coal fuel",null,2.9494678495090099E-3,null,null,"Uses closed stove with chimney",null,-0.10492932049877626]
[null,null,"Uses kerozene fuel",null,-0.11951523077528982,null,null,"Uses charcoal fuel",null,1.0360102100787746E-2,null,null,"Uses living or sleeping room as kitchen",null,-2.6974372254861021E-2]
[null,null,"Uses coal fuel",null,-1.0157751039646789E-3,null,null,"Uses wood fuel",null,0.1281638508313496,null,null,"Uses separate room as kitchen",null,-1.6804361569757488E-2]
[null,null,"Uses charcoal fuel",null,6.3284921835258219E-3,null,null,"Uses open fire without chimney",null,-2.8277528742827085E-3,null,null,"Uses separate building as kitchen",null,2.9575518126713433E-2]
[null,null,"Uses wood fuel",null,0.12054884419207615,null,null,"Uses open fire with chimney",null,-3.3076608897321365E-3,null,null,"Kooks outdoor",null,4.6571857748607445E-3]
[null,null,"Uses open fire without chimney",null,1.0855203045145722E-3,null,null,"Uses closed stove with chimney",null,-0.11208877504485584,null,null,"Heats house",null,2.0620049526402858E-3]
[null,null,"Uses open fire with chimney",null,-7.2461511087415489E-3,null,null,"Uses living or sleeping room as kitchen",null,1.5279514611423772E-2,null,null,"Uses shrubs grass heating",null,-6.8411782955120617E-3]
[null,null,"Uses closed stove with chimney",null,-0.11697177889213511,null,null,"Uses separate room as kitchen",null,-5.4070921351941678E-2,null,null,"Has Car",null,9.444035091975081E-2]
[null,null,"Uses living or sleeping room as kitchen",null,-1.2968422609502364E-2,null,null,"Uses separate building as kitchen",null,5.2684272120661083E-2,null,null,"Has Electricity",null,0.1562388006920819]
[null,null,"Uses separate room as kitchen",null,-3.1413711003288311E-2,null,null,"Kooks outdoor",null,1.7589051096281522E-2,null,null,"Has Bicycle",null,5.6388764781051974E-2]
[null,null,"Uses separate building as kitchen",null,3.6499138062367681E-2,null,null,"Heats house",null,-1.2082150815037964E-2,null,null,"Has Clock",null,0.1182909958867336]
[null,null,"Kooks outdoor",null,1.4599584638142336E-2,null,null,"Uses electricity heating",null,-1.2082150815037659E-2,null,null,"Has Bucket",null,4.4625832384964183E-2]
[null,null,"Heats house",null,9.8323972338586435E-4,null,null,"Uses kerozene heating",null,-1.9421935754715413E-2,null,null,"Has Clothes washing machine",null,1.7773695369558751E-2]
[null,null,"Uses electricity heating",null,-7.0176016641126738E-3,null,null,"Has Car",null,9.8828432186229706E-2,null,null,"Has Dish washing machine",null,2.6155834426220416E-2]
[null,null,"Uses kerozene heating",null,-1.2981639070971808E-2,null,null,"Has Electricity",null,0.12467006020017483,null,null,"Has Refrigerator",null,0.15799156008061627]
[null,null,"Uses shrubs grass heating",null,-1.1954427989724098E-3,null,null,"Has Bicycle",null,7.8175633094467192E-2,null,null,"Has Fix telephone",null,0.11671033513627027]
[null,null,"Has Car",null,7.2324263003829187E-2,null,null,"Has Clock",null,0.12592255265748012,null,null,"Has Mobile telephone",null,4.0546910146732659E-2]
[null,null,"Has Electricity",null,0.13282109829916991,null,null,"Has Bucket",null,-5.1274260359589572E-3,null,null,"Has Television",null,0.16308117459266522]
[null,null,"Has Bicycle",null,6.482973660617522E-2,null,null,"Has Clothes washing machine",null,5.5670877365487571E-2,null,null,"Has Computer",null,3.776501987209227E-2]
[null,null,"Has Clock",null,0.10459904176750454,null,null,"Has Dish washing machine",null,2.5797110497725831E-2,null,null,"Permanent Income question 16",null,9.4571519984130353E-2]
[null,null,"Has Bucket",null,3.4792362722881116E-2,null,null,"Has Refrigerator",null,0.13937012902305723,null,null,"Permanent Income question 17",null,-1.3816669467473619E-3]
[null,null,"Has Clothes washing machine",null,3.2136652145086479E-2,null,null,"Has Fix telephone",null,0.1391673909934559,null,null,"Permanent Income question 18",null,7.7154026639602608E-2]
[null,null,"Has Dish washing machine",null,2.14613673732942E-2,null,null,"Has Mobile telephone",null,2.1073450354156288E-2,null,null,"Permanent Income question 19",null,2.0797860711413041E-2]
[null,null,"Has Refrigerator",null,0.1322807547160825,null,null,"Has Television",null,0.14366590036328433,null,null,"Permanent Income question 20",null,6.693654030812006E-2]
[null,null,"Has Fix telephone",null,0.11857091320483296,null,null,"Has Computer",null,5.9430388649349471E-2]
[null,null,"Has Mobile telephone",null,2.9178969362783573E-2,null,null,"Permanent Income question 16",null,6.7489295202220051E-2]
[null,null,"Has Television",null,0.13695387924441954,null,null,"Permanent Income question 17",null,2.4657175900535767E-2,null,null,"Component Score Covariance Matrix"]
[null,null,"Has Computer",null,4.9449318753567388E-2,null,null,"Permanent Income question 18",null,5.831483912642154E-2,null,null,"Component",null,"1"]
[null,null,"Permanent Income question 16",null,7.9976913909582226E-2,null,null,"Permanent Income question 19",null,1.9357002029280094E-2,null,null,"1",null,1]
[null,null,"Permanent Income question 17",null,7.8593607805640606E-3,null,null,"Permanent Income question 20",null,8.9516391296106071E-2]
[null,null,"Permanent Income question 18",null,4.9459979708006432E-2]
[null,null,"Permanent Income question 19",null,1.5773167118522148E-2]
[null,null,"Permanent Income question 20",null,6.9767936477956982E-2,null,null,"Component Score Covariance Matrix"]
[null,null,null,null,null,null,null,"Component",null,"1"]
[null,null,null,null,null,null,null,"1",null,1]
[null,null,"Component Score Covariance Matrix"]
[null,null,"Component",null,"1"]
[null,null,"1",null,1]
[]
[]
[]
[]
[]
[]
[]
[]
[]
[]
[]
[]
[]
[]
[]
[]
[]
[]
[]
[]
[]
[]
[]
[]
[]
[]
[]
[]
[]
[]
[]
[]
[]
[]
[]
[]
[]
[]
[]
[]
[]
[]
[]
[]
[]
[]
[]
[]
[]
[]
[]
[]
[]
[]
[]
[]
[]
[]
[]
[]
[]
[]
[]
[]
[]
[]
[]
[]
[]
[]
[]
[]
[]
[]
[]
[]
[]
[]
[]
[]
[]
[]
[]
[]
[]
[]
[]
[]
[]
[]
[]
[]
[]
[]
[]
[]
[]
[]
[]
[]
[]
[]
[]
[]
[]
[]
[]
[]
[]
[]
[]
[]
[]
[]
[]
[]
[]
[]
[]
[]
[]
[]
[]
[]
[]
[]
[]
[]
[]
[]
[]
[]
[]
[]
[]
[]
[]
[]
[]
[]
[]
[]
[]
[]
[]
[]
[]
[]
[]
[]
[]
[]
[]
[]
[]
[]
[]
[]
[]
[]
[]
[]
[]
[]
[]
[]
[]
[]
[]
[]
[]
[]
[]
[]
[]
[]
[]
[]
[]
[]
[]
[]
[]
[]
[]
[]
[]
[]
[]
[]
[]
[]
[]
[]
[]
[]
[]
[]
[]
[]
[]
[]
[]
[]
[]
[]
[]
[]
[]
[]
[]
[]
[]
[]
[]
[]
[]
[]
[]
[]
[]
[]
[]
[]
[]
[]
[]
[]
[]
[]
[]
[]
[]
[]
[]
[]
[]
[]
[]
[]
[]
[]
[]
[]
[]
[]
[]
[]
[]
[]
[]
[]
[]
[]
[]
[]
[]
[]
[]
[]
[]
[]
[]
[]
[]
[]
[]
[]
[]
[]
[]
[]
[]
[]
[]
[]
[]
[]
[]
[]
[]
[]
[]
[]
[]
[]
[]
[]
[]
[]
[]
[]
[]
[]
[]
[]
[]
[]
[]
[]
[]
[]
[]
[]
[]
[]
[]
[]
[]
[]
[]
[]
[]
[]
[]
[]
[]
[]
[]
[]
[]
[]
[]
[]
[]
[]
[]
[]
[]
[]
[]
[]
[]
[]
[]
[]
[]
[]
[]
[]
[]
[]
[]
[]
[]
[]
[]
[]
[]
[]
[]
[]
[]
[]
[]
[]
[]
[]
[]
[]
[]
[]
[]
[]
[]
[]
[]
[]
[]
[]
[]
[]
[]
[]
[]
[]
[]
[]
[]
[]
[]
[]
[]
[]
[]
[]
[]
[]
[]
[]
[]
[]
[]
[]
[]
[]
[]
[]
[]
[]
[]
[]
[]
[]
[]
[]
[]
[]
[]
[]
[]
[]
[]
[]
[]
[]
[]
[]
[]
[]
[]
[]
[]
[]
[]
[]
[]
[]
[]
[]
[]
[]
[]
[]
[]
[]
[]
[]
[]
[]
[]
[]
[]
[]
[]
[]
[]
[]
[]
[]
[]
[]
[]
[]
[]
[]
[]
[]
[]
[]
[]
[]
[]
[]
[]
[]
[]
[]
[]
[]
[]
[]
[]
[]
[]
[]
[]
[]
["WHS03"]
["Comoros",null,"Count"]
["W_text_t","",1833]
["W_text_i","",1833]
["S_text_s","",1833]
["S_text_i","",1833]
["Urban/Rural","Urban",548]
[null,"Rural",1285]
[null,"Missing",0]
["2003"]
[]
["Sub-national region names","Weighted population"]
[{"$f":"R15","v":0},{"$f":"#REF!+#REF!","v":{"$error":"#REF!"}}]
[{"$f":"S15","v":0},{"$f":"#REF!+#REF!","v":{"$error":"#REF!"}}]
[{"$f":"T15","v":0},{"$f":"#REF!+#REF!","v":{"$error":"#REF!"}}]
[{"$f":"U15","v":0},{"$f":"#REF!+#REF!","v":{"$error":"#REF!"}}]
[{"$f":"V15","v":0},{"$f":"#REF!+#REF!","v":{"$error":"#REF!"}}]
[{"$f":"W15","v":0},{"$f":"#REF!+#REF!","v":{"$error":"#REF!"}}]
[{"$f":"X15","v":0},{"$f":"#REF!+WH123","v":{"$error":"#REF!"}}]
[{"$f":"Y15","v":0},{"$f":"#REF!+#REF!","v":{"$error":"#REF!"}}]
[{"$f":"Z15","v":0},{"$f":"#REF!+#REF!","v":{"$error":"#REF!"}}]
[{"$f":"AA15","v":0},{"$f":"#REF!+#REF!","v":{"$error":"#REF!"}}]
[{"$f":"AB15","v":0},{"$f":"#REF!+#REF!","v":{"$error":"#REF!"}}]
[{"$f":"AC15","v":0},{"$f":"#REF!+#REF!","v":{"$error":"#REF!"}}]
[{"$f":"AD15","v":0},{"$f":"#REF!+#REF!","v":{"$error":"#REF!"}}]
[{"$f":"AE15","v":0},{"$f":"#REF!+#REF!","v":{"$error":"#REF!"}}]
[{"$f":"AF15","v":0},{"$f":"#REF!+#REF!","v":{"$error":"#REF!"}}]
[{"$f":"AG15","v":0},{"$f":"#REF!+#REF!","v":{"$error":"#REF!"}}]
[{"$f":"AH15","v":0},{"$f":"#REF!+#REF!","v":{"$error":"#REF!"}}]
[{"$f":"AI15","v":0},{"$f":"#REF!+#REF!","v":{"$error":"#REF!"}}]
[{"$f":"AJ15","v":0},{"$f":"#REF!+#REF!","v":{"$error":"#REF!"}}]
[{"$f":"AK15","v":0},{"$f":"#REF!+#REF!","v":{"$error":"#REF!"}}]
[{"$f":"AL15","v":0},{"$f":"#REF!+#REF!","v":{"$error":"#REF!"}}]
[{"$f":"AM15","v":0},{"$f":"#REF!+#REF!","v":{"$error":"#REF!"}}]
[{"$f":"AN15","v":0},{"$f":"#REF!+#REF!","v":{"$error":"#REF!"}}]
[{"$f":"AO15","v":0},{"$f":"#REF!+#REF!","v":{"$error":"#REF!"}}]
[{"$f":"AP15","v":0},{"$f":"#REF!+#REF!","v":{"$error":"#REF!"}}]
[{"$f":"AQ15","v":0},{"$f":"#REF!+#REF!","v":{"$error":"#REF!"}}]
[{"$f":"AR15","v":0},{"$f":"#REF!+#REF!","v":{"$error":"#REF!"}}]
[{"$f":"AS15","v":0},{"$f":"#REF!+#REF!","v":{"$error":"#REF!"}}]
[{"$f":"AT15","v":0},{"$f":"#REF!+#REF!","v":{"$error":"#REF!"}}]
[{"$f":"AU15","v":0},{"$f":"#REF!+#REF!","v":{"$error":"#REF!"}}]
[{"$f":"AV15","v":0},{"$f":"#REF!+#REF!","v":{"$error":"#REF!"}}]
[{"$f":"AW15","v":0},{"$f":"#REF!+#REF!","v":{"$error":"#REF!"}}]
[{"$f":"AX15","v":0},{"$f":"#REF!+#REF!","v":{"$error":"#REF!"}}]
[{"$f":"AY15","v":0},{"$f":"#REF!+#REF!","v":{"$error":"#REF!"}}]
[]
[{"$f":"34-COUNTIF(A1037:A1071,\"0\")","v":0},"Sub-regions"]

{"sheet":"DHS12","index":6,"n_rows":1072,"n_cols":72,"rows_kept":1072,"cut":false,"hidden":false,"merged":[[346,52,347,52],[348,52,349,52],[350,52,351,52],[352,52,353,52],[152,52,164,52],[230,52,235,52],[270,52,272,52],[273,52,275,52],[276,52,283,52],[338,54,338,58],[338,59,338,63],[338,64,338,68],[340,52,341,52],[342,52,343,52],[344,52,345,52],[221,52,223,52],[224,52,225,52],[226,52,229,52],[258,54,258,58],[258,59,258,63],[258,64,258,68],[260,52,262,52],[263,52,266,52],[267,52,269,52],[119,64,119,68],[121,52,122,52],[123,52,126,52],[127,52,128,52],[132,54,132,58],[132,59,132,63],[132,64,132,68],[134,52,138,52],[219,54,219,58],[219,59,219,63],[219,64,219,68],[13,64,13,68],[15,52,16,52],[17,52,20,52],[21,52,22,52],[26,54,26,58],[26,59,26,63],[26,64,26,68],[40,52,41,52],[55,54,55,58],[55,59,55,63],[55,64,55,68],[139,52,142,52],[143,0,146,0],[143,52,146,52],[147,0,149,0],[147,52,149,52],[150,0,151,0],[150,52,151,52],[13,54,13,58],[13,59,13,63],[119,54,119,58],[119,59,119,63],[42,52,43,52],[44,52,45,52],[46,0,48,0],[46,52,48,52],[49,0,51,0],[49,52,51,52],[52,0,54,0],[52,52,54,52],[32,52,33,52],[34,52,35,52],[36,52,37,52],[38,0,39,0],[38,52,39,52],[13,2,13,6],[13,7,13,11],[28,52,29,52],[30,0,31,0],[30,52,31,52],[26,2,26,6],[26,7,26,11],[26,12,26,16],[13,12,13,16],[15,0,16,0],[17,0,20,0],[21,0,22,0],[23,0,25,0],[32,0,33,0],[55,2,55,6],[55,7,55,11],[55,12,55,16],[28,0,29,0],[34,0,35,0],[36,0,37,0],[40,0,41,0],[42,0,43,0],[44,0,45,0],[139,0,142,0],[107,0,107,1],[119,2,119,6],[119,7,119,11],[57,0,70,0],[132,12,132,16],[134,0,138,0],[119,12,119,16],[121,0,122,0],[123,0,126,0],[127,0,128,0],[129,0,131,0],[152,0,163,0],[132,2,132,6],[132,7,132,11],[219,2,219,6],[219,7,219,11],[219,12,219,16],[207,0,207,1],[1024,0,1024,2],[1025,0,1025,1],[1030,0,1032,0],[1033,0,1033,2],[221,0,223,0],[224,0,228,0],[401,1,444,1],[402,2,402,3],[402,7,402,8],[402,12,402,13],[403,2,403,3],[403,7,403,8],[403,12,403,13],[398,2,398,5],[398,7,398,10],[398,12,398,15],[399,2,399,4],[399,7,399,9],[399,12,399,14],[404,2,404,3],[404,7,404,8],[404,12,404,13],[405,2,405,3],[405,7,405,8],[405,12,405,13],[400,2,401,3],[400,7,401,8],[400,12,401,13],[408,2,408,3],[408,7,408,8],[408,12,408,13],[409,2,409,3],[409,7,409,8],[409,12,409,13],[406,2,406,3],[406,7,406,8],[406,12,406,13],[407,2,407,3],[407,7,407,8],[407,12,407,13],[412,2,412,3],[412,7,412,8],[412,12,412,13],[413,2,413,3],[413,7,413,8],[413,12,413,13],[410,2,410,3],[410,7,410,8],[410,12,410,13],[411,2,411,3],[411,7,411,8],[411,12,411,13],[416,2,416,3],[416,7,416,8],[416,12,416,13],[417,2,417,3],[417,7,417,8],[417,12,417,13],[414,2,414,3],[414,7,414,8],[414,12,414,13],[415,2,415,3],[415,7,415,8],[415,12,415,13],[420,2,420,3],[420,7,420,8],[420,12,420,13],[421,2,421,3],[421,7,421,8],[421,12,421,13],[418,2,418,3],[418,7,418,8],[418,12,418,13],[419,2,419,3],[419,7,419,8],[419,12,419,13],[424,2,424,3],[424,7,424,8],[424,12,424,13],[425,2,425,3],[425,7,425,8],[425,12,425,13],[422,2,422,3],[422,7,422,8],[422,12,422,13],[423,2,423,3],[423,7,423,8],[423,12,423,13],[428,2,428,3],[428,7,428,8],[428,12,428,13],[429,2,429,3],[429,7,429,8],[429,12,429,13],[426,2,426,3],[426,7,426,8],[426,12,426,13],[427,2,427,3],[427,7,427,8],[427,12,427,13],[432,2,432,3],[432,7,432,8],[432,12,432,13],[433,2,433,3],[433,7,433,8],[433,12,433,13],[430,2,430,3],[430,7,430,8],[430,12,430,13],[431,2,431,3],[431,7,431,8],[431,12,431,13],[436,2,436,3],[436,7,436,8],[436,12,436,13],[437,2,437,3],[437,7,437,8],[437,12,437,13],[434,2,434,3],[434,7,434,8],[434,12,434,13],[435,2,435,3],[435,7,435,8],[435,12,435,13],[440,2,440,3],[440,7,440,8],[440,12,440,13],[441,2,441,3],[441,7,441,8],[441,12,441,13],[438,2,438,3],[438,7,438,8],[438,12,438,13],[439,2,439,3],[439,7,439,8],[439,12,439,13],[444,2,444,3],[444,7,444,8],[444,12,444,13],[445,2,445,3],[445,7,445,8],[445,12,445,13],[442,2,442,3],[442,7,442,8],[442,12,442,13],[443,2,443,3],[443,7,443,8],[443,12,443,13],[448,2,448,3],[448,7,448,8],[448,12,448,13],[449,2,449,3],[449,7,449,8],[449,12,449,13],[446,2,446,3],[446,7,446,8],[446,12,446,13],[447,2,447,3],[447,7,447,8],[447,12,447,13],[452,2,452,3],[452,7,452,8],[452,12,452,13],[453,2,453,3],[453,7,453,8],[453,12,453,13],[450,2,450,3],[450,7,450,8],[450,12,450,13],[451,2,451,3],[451,7,451,8],[451,12,451,13],[456,2,456,3],[456,7,456,8],[456,12,456,13],[457,2,457,3],[457,7,457,8],[457,12,457,13],[454,2,454,3],[454,7,454,8],[454,12,454,13],[455,2,455,3],[455,7,455,8],[455,12,455,13],[460,2,460,3],[460,7,460,8],[460,12,460,13],[461,2,461,3],[461,7,461,8],[461,12,461,13],[458,2,458,3],[458,7,458,8],[458,12,458,13],[459,2,459,3],[459,7,459,8],[459,12,459,13],[464,2,464,3],[464,7,464,8],[464,12,464,13],[465,2,465,3],[465,7,465,8],[465,12,465,13],[462,2,462,3],[462,7,462,8],[462,12,462,13],[463,2,463,3],[463,7,463,8],[463,12,463,13],[468,2,468,3],[468,7,468,8],[468,12,468,13],[469,2,469,3],[469,7,469,8],[469,12,469,13],[466,2,466,3],[466,7,466,8],[466,12,466,13],[467,2,467,3],[467,7,467,8],[467,12,467,13],[472,2,472,3],[472,7,472,8],[472,12,472,13],[473,2,473,3],[473,7,473,8],[473,12,473,13],[470,2,470,3],[470,7,470,8],[470,12,470,13],[471,2,471,3],[471,7,471,8],[471,12,471,13],[476,2,476,3],[476,7,476,8],[476,12,476,13],[477,2,477,3],[477,7,477,9],[477,12,477,13],[474,2,474,4],[474,7,474,8],[474,12,474,13],[475,2,475,3],[475,7,475,8],[475,12,475,13],[480,2,480,3],[480,7,480,8],[480,12,480,13],[481,2,481,3],[481,7,481,8],[481,12,481,14],[478,2,478,3],[478,7,478,8],[478,12,478,13],[479,2,479,3],[479,7,479,8],[479,12,479,13],[484,2,484,3],[484,7,484,8],[484,12,484,13],[485,2,485,3],[485,7,485,8],[485,12,485,13],[482,2,482,3],[482,7,482,8],[482,12,482,13],[483,2,483,3],[483,7,483,8],[483,12,483,13],[488,2,488,3],[488,7,488,8],[488,12,488,13],[489,2,489,3],[489,7,489,8],[489,12,489,13],[486,2,486,3],[486,7,486,8],[486,12,486,13],[487,2,487,3],[487,7,487,8],[487,12,487,13],[492,2,492,3],[492,7,492,8],[492,12,492,13],[493,2,493,3],[493,7,493,8],[493,12,493,13],[490,2,490,3],[490,7,490,8],[490,12,490,13],[491,2,491,3],[491,7,491,8],[491,12,491,13],[496,2,496,3],[496,7,496,8],[496,12,496,13],[497,2,497,3],[497,7,497,8],[497,12,497,13],[494,2,494,3],[494,7,494,8],[494,12,494,13],[495,2,495,3],[495,7,495,8],[495,12,495,13],[500,2,500,3],[500,7,500,8],[500,12,500,13],[501,2,501,3],[501,7,501,8],[501,12,501,13],[498,2,498,3],[498,7,498,8],[498,12,498,13],[499,2,499,3],[499,7,499,8],[499,12,499,13],[504,2,504,3],[504,7,504,8],[504,12,504,13],[505,2,505,3],[505,7,505,8],[505,12,505,13],[502,2,502,3],[502,7,502,8],[502,12,502,13],[503,2,503,3],[503,7,503,8],[503,12,503,13],[508,2,508,3],[508,7,508,8],[508,12,508,13],[509,2,509,3],[509,7,509,8],[509,12,509,13],[506,2,506,3],[506,7,506,8],[506,12,506,13],[507,2,507,3],[507,7,507,8],[507,12,507,13],[512,2,512,3],[512,7,512,8],[512,12,512,13],[513,2,513,3],[513,7,513,8],[513,12,513,13],[510,2,510,3],[510,7,510,8],[510,12,510,13],[511,2,511,3],[511,7,511,8],[511,12,511,13],[516,2,516,3],[516,7,516,8],[516,12,516,13],[517,2,517,3],[517,7,517,8],[517,12,517,13],[514,2,514,3],[514,7,514,8],[514,12,514,13],[515,2,515,3],[515,7,515,8],[515,12,515,13],[520,2,520,3],[520,7,520,8],[520,12,520,13],[521,2,521,3],[521,7,521,8],[521,12,521,13],[518,2,518,3],[518,7,518,8],[518,12,518,13],[519,2,519,3],[519,7,519,8],[519,12,519,13],[524,2,524,3],[524,7,524,8],[524,12,524,13],[525,2,525,3],[525,7,525,8],[525,12,525,13],[522,2,522,3],[522,7,522,8],[522,12,522,13],[523,2,523,3],[523,7,523,8],[523,12,523,13],[528,2,528,3],[528,7,528,8],[528,12,528,13],[529,2,529,3],[529,7,529,8],[529,12,529,13],[526,2,526,3],[526,7,526,8],[526,12,526,13],[527,2,527,3],[527,7,527,8],[527,12,527,13],[532,2,532,3],[532,7,532,8],[532,12,532,13],[533,2,533,3],[533,7,533,8],[533,12,533,13],[530,2,530,3],[530,7,530,8],[530,12,530,13],[531,2,531,3],[531,7,531,8],[531,12,531,13],[536,2,536,3],[536,7,536,8],[536,12,536,13],[537,2,537,3],[537,7,537,8],[537,12,537,13],[534,2,534,3],[534,7,534,8],[534,12,534,13],[535,2,535,3],[535,7,535,8],[535,12,535,13],[540,2,540,3],[540,7,540,8],[540,12,540,13],[541,2,541,3],[541,7,541,8],[541,12,541,13],[538,2,538,3],[538,7,538,8],[538,12,538,13],[539,2,539,3],[539,7,539,8],[539,12,539,13],[544,2,544,3],[544,7,544,8],[544,12,544,13],[545,2,545,3],[545,7,545,8],[545,12,545,13],[542,2,542,3],[542,7,542,8],[542,12,542,13],[543,2,543,3],[543,7,543,8],[543,12,543,13],[548,2,549,3],[548,4,548,6],[548,7,548,8],[548,12,548,13],[549,7,549,8],[549,12,549,13],[546,2,546,3],[546,7,546,8],[546,12,546,13],[547,2,547,6],[547,7,547,8],[547,12,547,13],[552,2,552,3],[552,7,552,8],[552,12,552,13],[553,2,553,4],[553,7,553,11],[553,12,553,13],[550,2,550,3],[550,7,550,8],[550,12,550,13],[551,2,551,3],[551,7,551,8],[551,12,551,13],[557,2,557,3],[557,7,557,8],[557,12,557,13],[558,2,558,3],[558,7,558,8],[558,12,558,13],[554,2,555,3],[554,7,555,8],[554,9,554,11],[554,12,554,13],[555,12,555,13],[556,2,556,3],[556,7,556,8],[556,12,556,13],[562,2,562,3],[562,7,562,8],[562,12,563,13],[562,14,562,16],[563,2,563,3],[563,7,563,8],[559,2,559,3],[559,7,559,9],[559,12,559,13],[560,2,560,3],[560,7,561,8],[560,12,560,13],[561,2,561,3],[561,12,561,16],[566,2,566,3],[566,7,566,8],[566,12,566,13],[567,2,567,3],[567,7,567,8],[567,12,567,14],[564,2,564,3],[564,7,564,8],[564,12,564,13],[565,2,565,3],[565,7,565,8],[565,12,565,13],[571,2,571,3],[571,7,571,8],[571,12,571,13],[572,2,572,3],[572,7,572,8],[572,12,572,13],[568,2,568,3],[568,7,568,8],[568,12,569,13],[569,2,569,3],[569,7,569,8],[570,2,570,3],[570,7,570,8],[570,12,570,13],[575,2,575,3],[575,7,575,8],[575,12,575,13],[576,2,576,3],[576,7,576,8],[576,12,576,13],[573,2,573,3],[573,7,573,8],[573,12,573,13],[574,2,574,3],[574,7,574,8],[574,12,574,13],[579,2,579,3],[579,7,579,8],[579,12,579,13],[580,2,580,3],[580,7,580,8],[580,12,580,13],[577,2,577,3],[577,7,577,8],[577,12,577,13],[578,2,578,3],[578,7,578,8],[578,12,578,13],[583,2,583,3],[583,7,583,8],[583,12,583,13],[584,2,584,3],[584,7,584,8],[584,12,584,13],[581,2,581,3],[581,7,581,8],[581,12,581,13],[582,2,582,3],[582,7,582,8],[582,12,582,13],[587,2,587,3],[587,7,587,8],[587,12,587,13],[588,2,588,3],[588,7,588,8],[588,12,588,13],[585,2,585,3],[585,7,585,8],[585,12,585,13],[586,2,586,3],[586,7,586,8],[586,12,586,13],[591,2,591,3],[591,7,591,8],[591,12,591,13],[592,2,592,3],[592,7,592,8],[592,12,592,13],[589,2,589,3],[589,7,589,8],[589,12,589,13],[590,2,590,3],[590,7,590,8],[590,12,590,13],[595,2,595,3],[595,7,595,8],[595,12,595,13],[596,2,596,3],[596,7,596,8],[596,12,596,13],[593,2,593,3],[593,7,593,8],[593,12,593,13],[594,2,594,3],[594,7,594,8],[594,12,594,13],[599,2,599,3],[599,7,599,8],[599,12,599,13],[600,2,600,3],[600,7,600,8],[600,12,600,13],[597,2,597,3],[597,7,597,8],[597,12,597,13],[598,2,598,3],[598,7,598,8],[598,12,598,13],[603,2,603,3],[603,7,603,8],[603,12,603,13],[604,2,604,3],[604,7,604,8],[604,12,604,13],[601,2,601,3],[601,7,601,8],[601,12,601,13],[602,2,602,3],[602,7,602,8],[602,12,602,13],[607,2,607,3],[607,7,607,8],[607,12,607,13],[608,2,608,3],[608,7,608,8],[608,12,608,13],[605,2,605,3],[605,7,605,8],[605,12,605,13],[606,2,606,3],[606,7,606,8],[606,12,606,13],[611,2,611,3],[611,7,611,8],[611,12,611,13],[612,2,612,3],[612,7,612,8],[612,12,612,13],[609,2,609,3],[609,7,609,8],[609,12,609,13],[610,2,610,3],[610,7,610,8],[610,12,610,13],[615,2,615,3],[615,7,615,8],[615,12,615,13],[616,2,616,3],[616,7,616,8],[616,12,616,13],[613,2,613,3],[613,7,613,8],[613,12,613,13],[614,2,614,3],[614,7,614,8],[614,12,614,13],[619,2,619,3],[619,7,619,8],[619,12,619,13],[620,2,620,3],[620,7,620,8],[620,12,620,13],[617,2,617,3],[617,7,617,8],[617,12,617,13],[618,2,618,3],[618,7,618,8],[618,12,618,13],[623,2,623,3],[623,7,623,8],[623,12,623,13],[624,2,624,3],[624,7,624,8],[624,12,624,13],[621,2,621,3],[621,7,621,8],[621,12,621,13],[622,2,622,3],[622,7,622,8],[622,12,622,13],[627,2,627,4],[627,7,627,8],[627,12,627,13],[628,2,628,3],[628,7,628,8],[628,12,628,13],[625,2,625,3],[625,7,625,8],[625,12,625,13],[626,2,626,3],[626,7,626,8],[626,12,626,13],[631,2,631,3],[631,7,631,8],[631,12,631,13],[632,2,632,3],[632,7,632,8],[632,12,632,13],[629,2,629,3],[629,7,629,8],[629,12,629,13],[630,2,630,3],[630,7,630,8],[630,12,630,13],[635,2,635,3],[635,7,635,8],[635,12,635,13],[636,2,636,3],[636,7,636,9],[636,12,636,13],[633,2,633,3],[633,7,633,8],[633,12,633,13],[634,2,634,3],[634,7,634,8],[634,12,634,13],[639,2,639,3],[639,7,639,8],[639,12,639,13],[640,2,640,3],[640,7,640,8],[640,12,640,13],[637,2,637,3],[637,7,637,8],[637,12,637,13],[638,2,638,3],[638,7,638,8],[638,12,638,13],[643,2,643,3],[643,7,643,8],[643,12,643,13],[644,2,644,3],[644,7,644,8],[644,12,644,13],[641,2,641,3],[641,7,641,8],[641,12,641,13],[642,2,642,3],[642,7,642,8],[642,12,642,13],[647,2,647,3],[647,7,647,8],[647,12,647,13],[648,2,648,3],[648,7,648,8],[648,12,648,14],[645,2,645,3],[645,7,645,8],[645,12,645,13],[646,2,646,3],[646,7,646,8],[646,12,646,13],[651,2,651,3],[651,7,651,8],[651,12,651,13],[652,2,652,3],[652,7,652,8],[652,12,652,13],[649,2,649,3],[649,7,649,8],[649,12,649,13],[650,2,650,3],[650,7,650,8],[650,12,650,13],[655,2,655,3],[655,7,655,8],[655,12,655,13],[656,2,656,3],[656,7,656,8],[656,12,656,13],[653,2,653,3],[653,7,653,8],[653,12,653,13],[654,2,654,3],[654,7,654,8],[654,12,654,13],[659,2,659,3],[659,7,659,8],[659,12,659,13],[660,2,660,3],[660,7,660,8],[660,12,660,13],[657,2,657,3],[657,7,657,8],[657,12,657,13],[658,2,658,3],[658,7,658,8],[658,12,658,13],[663,2,663,3],[663,7,663,8],[663,12,663,13],[664,2,664,3],[664,7,664,8],[664,12,664,13],[661,2,661,3],[661,7,661,8],[661,12,661,13],[662,2,662,3],[662,7,662,8],[662,12,662,13],[667,2,667,3],[667,7,667,8],[667,12,667,13],[668,2,668,3],[668,7,668,8],[668,12,668,13],[665,2,665,3],[665,7,665,8],[665,12,665,13],[666,2,666,3],[666,7,666,8],[666,12,666,13],[671,2,671,3],[671,7,671,8],[671,12,671,13],[672,2,672,3],[672,7,672,8],[672,12,672,13],[669,2,669,3],[669,7,669,8],[669,12,669,13],[670,2,670,3],[670,7,670,8],[670,12,670,13],[675,2,675,3],[675,7,675,8],[675,12,675,13],[676,2,676,3],[676,7,676,8],[676,12,676,13],[673,2,673,3],[673,7,673,8],[673,12,673,13],[674,2,674,3],[674,7,674,8],[674,12,674,13],[690,12,690,13],[679,2,679,3],[679,7,679,8],[679,12,679,13],[680,2,680,3],[680,7,680,8],[680,12,680,13],[677,2,677,3],[677,7,677,8],[677,12,677,13],[678,2,678,3],[678,7,678,8],[678,12,678,13],[683,2,683,3],[683,7,683,8],[683,12,683,13],[684,2,684,3],[684,7,684,8],[684,12,684,13],[681,2,681,3],[681,7,681,8],[681,12,681,13],[682,2,682,3],[682,7,682,8],[682,12,682,13],[695,2,695,3],[695,7,695,8],[695,12,695,13],[693,2,693,3],[693,7,693,8],[693,12,693,13],[694,2,694,3],[694,7,694,8],[694,12,694,13],[687,2,687,3],[687,7,687,8],[687,12,687,13],[688,2,688,3],[688,7,688,8],[688,12,688,13],[685,2,685,3],[685,7,685,8],[685,12,685,13],[686,2,686,3],[686,7,686,8],[686,12,686,13],[691,2,691,3],[691,7,691,8],[691,12,691,13],[692,2,692,3]],"merged_total":1007,"flags":["merged_cut"]}
[]
[{"$f":"A1026","v":"Comoros"}]
[{"$f":"A1034","v":"2012"}]
["Use of drinking water sources"]
[" by wealth quintile and sub-national region"]
["Notes:"]
["WHO/UNICEF JMP customised wealth index excludes water,"]
[" sanitation and hygiene assets."]
["Survey used for analysis:",{"$f":"A1025","v":"DHS12"}]
[{"$f":"B1028","v":""}]
[{"$f":"B1027","v":""}]
[]
[]
["Use of drinking water sources",null,"NATIONAL wealth index quintile",null,null,null,null,"URBAN wealth index quintile",null,null,null,null,"RURAL wealth index quintile",null,null,null,null,"SUB-REGIONS:",null,null,null,null,null,null,null,null,null,null,null,null,null,null,null,null,null,null,null,null,null,null,null,null,null,null,null,null,null,null,null,null,null,null,"Raw numbers of respondents:","Use of drinking water sources","NATIONAL wealth index quintile",null,null,null,null,"URBAN wealth index quintile",null,null,null,null,"RURAL wealth index quintile",null,null,null,null,"SUB-REGIONS:"]
["Weighted percentage (used in graphs)",null,"Poorest","Poor","Middle","Rich","Richest","Poorest","Poor","Middle","Rich","Richest","Poorest","Poor","Middle","Rich","Richest","Mohéli","Ndzouani","Ngazidja",null,null,null,null,null,null,null,null,null,null,null,null,null,null,null,null,null,null,null,null,null,null,null,null,null,null,null,null,null,null,null,null,"Water data, raw numbers (weighted)",null,"Poorest","Poor","Middle","Rich","Richest","Poorest","Poor","Middle","Rich","Richest","Poorest","Poor","Middle","Rich","Richest","Mohéli","Ndzouani","Ngazidja"]
["Water","Improved",84.1,89.9,90.1,93.6,94.6,91.6,99.1,99.5,99.2,98.5,83.5,86.9,87.2,87.7,90.8,91.5,90.6,90.2,null,null,null,null,null,null,null,null,null,null,null,null,null,null,null,null,null,null,null,null,null,null,null,null,null,null,null,null,null,null,null,null,"Water","Improved","N/A","N/A","N/A","N/A","N/A","N/A","N/A","N/A","N/A","N/A","N/A","N/A","N/A","N/A","N/A","N/A","N/A","N/A"]
[null,"Not Improved",15.9,10.1,9.9,6.4,5.4,8.4,0.9,0.5,0.8,1.5,16.5,13.1,12.8,12.3,9.1999999999999993,8.5,9.4,9.8000000000000007,null,null,null,null,null,null,null,null,null,null,null,null,null,null,null,null,null,null,null,null,null,null,null,null,null,null,null,null,null,null,null,null,null,"Not Improved","N/A","N/A","N/A","N/A","N/A","N/A","N/A","N/A","N/A","N/A","N/A","N/A","N/A","N/A","N/A","N/A","N/A","N/A"]
["Water ladder","Basic",70,82,86.9,89.7,92.5,81.2,91.5,91.9,96,96.8,67.599999999999994,77.5,85,85.5,88.9,83.3,81.3,87.4,null,null,null,null,null,null,null,null,null,null,null,null,null,null,null,null,null,null,null,null,null,null,null,null,null,null,null,null,null,null,null,null,"Water ladder","Basic","N/A","N/A","N/A","N/A","N/A","N/A","N/A","N/A","N/A","N/A","N/A","N/A","N/A","N/A","N/A","N/A","N/A","N/A"]
[null,"Limited",14.1,8,3.2,3.9,2.1,10.4,7.6,7.6,3.2,1.7,15.8,9.5,2.2000000000000002,2.1,1.9,8.1999999999999993,9.3000000000000007,2.8,null,null,null,null,null,null,null,null,null,null,null,null,null,null,null,null,null,null,null,null,null,null,null,null,null,null,null,null,null,null,null,null,null,"Limited","N/A","N/A","N/A","N/A","N/A","N/A","N/A","N/A","N/A","N/A","N/A","N/A","N/A","N/A","N/A","N/A","N/A","N/A"]
[null,"Unimproved",13.5,8.9,9.6999999999999993,6.4,5.0999999999999996,7.7,0.6,0.5,0.8,1.3,13.6,11.6,12.1,12.2,9,6.5,8,9.8000000000000007,null,null,null,null,null,null,null,null,null,null,null,null,null,null,null,null,null,null,null,null,null,null,null,null,null,null,null,null,null,null,null,null,null,"Unimproved","N/A","N/A","N/A","N/A","N/A","N/A","N/A","N/A","N/A","N/A","N/A","N/A","N/A","N/A","N/A","N/A","N/A","N/A"]
[null,"Surface water",2.5,1.2,0.3,0,0.2,0.6,0.3,0,0,0.3,3,1.5,0.6,0.1,0.2,2,1.5,0,null,null,null,null,null,null,null,null,null,null,null,null,null,null,null,null,null,null,null,null,null,null,null,null,null,null,null,null,null,null,null,null,null,"Surface water","N/A","N/A","N/A","N/A","N/A","N/A","N/A","N/A","N/A","N/A","N/A","N/A","N/A","N/A","N/A","N/A","N/A","N/A"]
["Improved water point at more than 30 minutes","Yes",16.7,8.9,3.5,4.0999999999999996,2.2000000000000002,11.4,7.6,7.6,3.2,1.7,19,10.9,2.5,2.4,2.1,8.9,10.199999999999999,3.1,null,null,null,null,null,null,null,null,null,null,null,null,null,null,null,null,null,null,null,null,null,null,null,null,null,null,null,null,null,null,null,null,"Improved water point at more than 30 minutes","Yes","N/A","N/A","N/A","N/A","N/A","N/A","N/A","N/A","N/A","N/A","N/A","N/A","N/A","N/A","N/A","N/A","N/A","N/A"]
[null,"No",83.3,91.1,96.5,95.9,97.8,88.6,92.4,92.4,96.8,98.3,81,89.1,97.5,97.6,97.9,91.1,89.8,96.9,null,null,null,null,null,null,null,null,null,null,null,null,null,null,null,null,null,null,null,null,null,null,null,null,null,null,null,null,null,null,null,null,null,"No","N/A","N/A","N/A","N/A","N/A","N/A","N/A","N/A","N/A","N/A","N/A","N/A","N/A","N/A","N/A","N/A","N/A","N/A"]
["Manually calculated ratios","Improved wells"]
[null,"Improved springs"]
[null,"Other"]
[null,null,"NATIONAL wealth index quintile",null,null,null,null,"URBAN wealth index quintile",null,null,null,null,"RURAL wealth index quintile",null,null,null,null,"SUB-REGIONS:",null,null,null,null,null,null,null,null,null,null,null,null,null,null,null,null,null,null,null,null,null,null,null,null,null,null,null,null,null,null,null,null,null,null,"Raw numbers of respondents:","Use of drinking water sources","NATIONAL wealth index quintile",null,null,null,null,"URBAN wealth index quintile",null,null,null,null,"RURAL wealth index quintile",null,null,null,null,"SUB-REGIONS:"]
["Percentage based on weighted population",null,"Poorest","Poor","Middle","Rich","Richest","Poorest","Poor","Middle","Rich","Richest","Poorest","Poor","Middle","Rich","Richest","Mohéli","Ndzouani","Ngazidja",null,null,null,null,null,null,null,null,null,null,null,null,null,null,null,null,null,null,null,null,null,null,null,null,null,null,null,null,null,null,null,null,"Water data, raw numbers (weighted)",null,"Poorest","Poor","Middle","Rich","Richest","Poorest","Poor","Middle","Rich","Richest","Poorest","Poor","Middle","Rich","Richest","Mohéli","Ndzouani","Ngazidja"]
["Piped water","Yes",69.2,56.5,57.1,57,52.9,87,87.1,83.4,82.9,73.2,68.400000000000006,52.4,40.1,45.9,30.6,89.1,86,25.8,null,null,null,null,null,null,null,null,null,null,null,null,null,null,null,null,null,null,null,null,null,null,null,null,null,null,null,null,null,null,null,null,"Piped water","Yes","N/A","N/A","N/A","N/A","N/A","N/A","N/A","N/A","N/A","N/A","N/A","N/A","N/A","N/A","N/A","N/A","N/A","N/A"]
[null,"No",30.8,43.5,42.9,43,47.1,13,12.9,16.600000000000001,17.100000000000001,26.8,31.6,47.6,59.9,54.1,69.400000000000006,10.9,14,74.2,null,null,null,null,null,null,null,null,null,null,null,null,null,null,null,null,null,null,null,null,null,null,null,null,null,null,null,null,null,null,null,null,null,"No","N/A","N/A","N/A","N/A","N/A","N/A","N/A","N/A","N/A","N/A","N/A","N/A","N/A","N/A","N/A","N/A","N/A","N/A"]
["Piped water on premises","Yes",35.700000000000003,29.8,36.799999999999997,39.799999999999997,45.5,50.6,48.8,54.5,68.599999999999994,67.099999999999994,33.299999999999997,25.6,27.5,31.3,23.1,64.099999999999994,60.7,9.6999999999999993,null,null,null,null,null,null,null,null,null,null,null,null,null,null,null,null,null,null,null,null,null,null,null,null,null,null,null,null,null,null,null,null,"Piped water on premises","Yes","N/A","N/A","N/A","N/A","N/A","N/A","N/A","N/A","N/A","N/A","N/A","N/A","N/A","N/A","N/A","N/A","N/A","N/A"]
[null,"No",64.3,70.2,63.2,60.2,54.5,49.4,51.2,45.5,31.4,32.9,66.7,74.400000000000006,72.5,68.7,76.900000000000006,35.9,39.299999999999997,90.3,null,null,null,null,null,null,null,null,null,null,null,null,null,null,null,null,null,null,null,null,null,null,null,null,null,null,null,null,null,null,null,null,null,"No","N/A","N/A","N/A","N/A","N/A","N/A","N/A","N/A","N/A","N/A","N/A","N/A","N/A","N/A","N/A","N/A","N/A","N/A"]
["Piped water into dwelling","Yes","N/A","N/A","N/A","N/A","N/A","N/A","N/A","N/A","N/A","N/A","N/A","N/A","N/A","N/A","N/A","N/A","N/A","N/A",null,null,null,null,null,null,null,null,null,null,null,null,null,null,null,null,null,null,null,null,null,null,null,null,null,null,null,null,null,null,null,null,"Piped water into dwelling","Yes","N/A","N/A","N/A","N/A","N/A","N/A","N/A","N/A","N/A","N/A","N/A","N/A","N/A","N/A","N/A","N/A","N/A","N/A"]
[null,"No","N/A","N/A","N/A","N/A","N/A","N/A","N/A","N/A","N/A","N/A","N/A","N/A","N/A","N/A","N/A","N/A","N/A","N/A",null,null,null,null,null,null,null,null,null,null,null,null,null,null,null,null,null,null,null,null,null,null,null,null,null,null,null,null,null,null,null,null,null,"No","N/A","N/A","N/A","N/A","N/A","N/A","N/A","N/A","N/A","N/A","N/A","N/A","N/A","N/A","N/A","N/A","N/A","N/A"]
["Water source on premises","Yes",46.5,58.6,65.7,75.900000000000006,89.1,53.7,57.1,70.2,86.4,91,43.4,56,68,72,86,64.8,64,70.8,null,null,null,null,null,null,null,null,null,null,null,null,null,null,null,null,null,null,null,null,null,null,null,null,null,null,null,null,null,null,null,null,"Water source on premises","Yes","N/A","N/A","N/A","N/A","N/A","N/A","N/A","N/A","N/A","N/A","N/A","N/A","N/A","N/A","N/A","N/A","N/A","N/A"]
[null,"No",53.5,41.4,34.299999999999997,24.1,10.9,46.3,42.9,29.8,13.6,9,56.6,44,32,28,14,35.200000000000003,36,29.2,null,null,null,null,null,null,null,null,null,null,null,null,null,null,null,null,null,null,null,null,null,null,null,null,null,null,null,null,null,null,null,null,null,"No","N/A","N/A","N/A","N/A","N/A","N/A","N/A","N/A","N/A","N/A","N/A","N/A","N/A","N/A","N/A","N/A","N/A","N/A"]
["Improved Water source on premises","Yes",46,56.9,63.2,73.2,85.7,53.7,57.1,70.2,86.1,90.7,42.9,54.1,64.8,68.2,80.099999999999994,64.8,63.8,66.3,null,null,null,null,null,null,null,null,null,null,null,null,null,null,null,null,null,null,null,null,null,null,null,null,null,null,null,null,null,null,null,null,"Improved water source on premises","Yes","N/A","N/A","N/A","N/A","N/A","N/A","N/A","N/A","N/A","N/A","N/A","N/A","N/A","N/A","N/A","N/A","N/A","N/A"]
[null,"No",54,43.1,36.799999999999997,26.8,14.3,46.3,42.9,29.8,13.9,9.3000000000000007,57.1,45.9,35.200000000000003,31.8,19.899999999999999,35.200000000000003,36.200000000000003,33.700000000000003,null,null,null,null,null,null,null,null,null,null,null,null,null,null,null,null,null,null,null,null,null,null,null,null,null,null,null,null,null,null,null,null,null,"No","N/A","N/A","N/A","N/A","N/A","N/A","N/A","N/A","N/A","N/A","N/A","N/A","N/A","N/A","N/A","N/A","N/A","N/A"]
["Piped water on premises available when needed","Yes","N/A","N/A","N/A","N/A","N/A","N/A","N/A","N/A","N/A","N/A","N/A","N/A","N/A","N/A","N/A","N/A","N/A","N/A",null,null,null,null,null,null,null,null,null,null,null,null,null,null,null,null,null,null,null,null,null,null,null,null,null,null,null,null,null,null,null,null,"Piped water on premises available when needed","Yes","N/A","N/A","N/A","N/A","N/A","N/A","N/A","N/A","N/A","N/A","N/A","N/A","N/A","N/A","N/A","N/A","N/A","N/A"]
[null,"No","N/A","N/A","N/A","N/A","N/A","N/A","N/A","N/A","N/A","N/A","N/A","N/A","N/A","N/A","N/A","N/A","N/A","N/A",null,null,null,null,null,null,null,null,null,null,null,null,null,null,null,null,null,null,null,null,null,null,null,null,null,null,null,null,null,null,null,null,null,"No","N/A","N/A","N/A","N/A","N/A","N/A","N/A","N/A","N/A","N/A","N/A","N/A","N/A","N/A","N/A","N/A","N/A","N/A"]
["Water point at more than 30 minutes","Yes",20.2,10.9,5.0999999999999996,5.0999999999999996,2.7,12,8,7.6,3.4,2.4,22.2,14.6,4.4000000000000004,4.5,3.2,10.6,14.1,3,null,null,null,null,null,null,null,null,null,null,null,null,null,null,null,null,null,null,null,null,null,null,null,null,null,null,null,null,null,null,null,null,"Water point at more than 30 minutes","Yes","N/A","N/A","N/A","N/A","N/A","N/A","N/A","N/A","N/A","N/A","N/A","N/A","N/A","N/A","N/A","N/A","N/A","N/A"]
[null,"No",79.8,89.1,94.9,94.9,97.3,88,92,92.4,96.6,97.6,77.8,85.4,95.6,95.5,96.8,89.4,85.9,97,null,null,null,null,null,null,null,null,null,null,null,null,null,null,null,null,null,null,null,null,null,null,null,null,null,null,null,null,null,null,null,null,null,"No","N/A","N/A","N/A","N/A","N/A","N/A","N/A","N/A","N/A","N/A","N/A","N/A","N/A","N/A","N/A","N/A","N/A","N/A"]
["Water source available when needed","Yes","N/A","N/A","N/A","N/A","N/A","N/A","N/A","N/A","N/A","N/A","N/A","N/A","N/A","N/A","N/A","N/A","N/A","N/A",null,null,null,null,null,null,null,null,null,null,null,null,null,null,null,null,null,null,null,null,null,null,null,null,null,null,null,null,null,null,null,null,"Water source available when needed","Yes","N/A","N/A","N/A","N/A","N/A","N/A","N/A","N/A","N/A","N/A","N/A","N/A","N/A","N/A","N/A","N/A","N/A","N/A"]
[null,"No","N/A","N/A","N/A","N/A","N/A","N/A","N/A","N/A","N/A","N/A","N/A","N/A","N/A","N/A","N/A","N/A","N/A","N/A",null,null,null,null,null,null,null,null,null,null,null,null,null,null,null,null,null,null,null,null,null,null,null,null,null,null,null,null,null,null,null,null,null,"No","N/A","N/A","N/A","N/A","N/A","N/A","N/A","N/A","N/A","N/A","N/A","N/A","N/A","N/A","N/A","N/A","N/A","N/A"]
["Improved water source available when needed","Yes","N/A","N/A","N/A","N/A","N/A","N/A","N/A","N/A","N/A","N/A","N/A","N/A","N/A","N/A","N/A","N/A","N/A","N/A",null,null,null,null,null,null,null,null,null,null,null,null,null,null,null,null,null,null,null,null,null,null,null,null,null,null,null,null,null,null,null,null,"Improved water source available when needed","Yes","N/A","N/A","N/A","N/A","N/A","N/A","N/A","N/A","N/A","N/A","N/A","N/A","N/A","N/A","N/A","N/A","N/A","N/A"]
[null,"No","N/A","N/A","N/A","N/A","N/A","N/A","N/A","N/A","N/A","N/A","N/A","N/A","N/A","N/A","N/A","N/A","N/A","N/A",null,null,null,null,null,null,null,null,null,null,null,null,null,null,null,null,null,null,null,null,null,null,null,null,null,null,null,null,null,null,null,null,null,"No","N/A","N/A","N/A","N/A","N/A","N/A","N/A","N/A","N/A","N/A","N/A","N/A","N/A","N/A","N/A","N/A","N/A","N/A"]
["Microbiological quality at point of collection","Not contaminated (No E. coli in 100 mL)","N/A","N/A","N/A","N/A","N/A","N/A","N/A","N/A","N/A","N/A","N/A","N/A","N/A","N/A","N/A","N/A","N/A","N/A",null,null,null,null,null,null,null,null,null,null,null,null,null,null,null,null,null,null,null,null,null,null,null,null,null,null,null,null,null,null,null,null,"Microbiological quality at point of collection","Not contaminated (No E. coli in 100 mL)","N/A","N/A","N/A","N/A","N/A","N/A","N/A","N/A","N/A","N/A","N/A","N/A","N/A","N/A","N/A","N/A","N/A","N/A"]
[null,"Contaminated (E. coli detected in 100 mL)","N/A","N/A","N/A","N/A","N/A","N/A","N/A","N/A","N/A","N/A","N/A","N/A","N/A","N/A","N/A","N/A","N/A","N/A",null,null,null,null,null,null,null,null,null,null,null,null,null,null,null,null,null,null,null,null,null,null,null,null,null,null,null,null,null,null,null,null,null,"Contaminated (E. coli detected in 100 mL)","N/A","N/A","N/A","N/A","N/A","N/A","N/A","N/A","N/A","N/A","N/A","N/A","N/A","N/A","N/A","N/A","N/A","N/A"]
[null,"Highly contaminated (>100 CFU/100 mL)","N/A","N/A","N/A","N/A","N/A","N/A","N/A","N/A","N/A","N/A","N/A","N/A","N/A","N/A","N/A","N/A","N/A","N/A",null,null,null,null,null,null,null,null,null,null,null,null,null,null,null,null,null,null,null,null,null,null,null,null,null,null,null,null,null,null,null,null,null,"Highly contaminated (>100 CFU/100 mL)","N/A","N/A","N/A","N/A","N/A","N/A","N/A","N/A","N/A","N/A","N/A","N/A","N/A","N/A","N/A","N/A","N/A","N/A"]
["Microbiological quality of improved water sources at point of collection","Not contaminated (No E. coli in 100 mL)","N/A","N/A","N/A","N/A","N/A","N/A","N/A","N/A","N/A","N/A","N/A","N/A","N/A","N/A","N/A","N/A","N/A","N/A",null,null,null,null,null,null,null,null,null,null,null,null,null,null,null,null,null,null,null,null,null,null,null,null,null,null,null,null,null,null,null,null,"Microbiological quality of improved water sources at point of collection","Not contaminated (No E. coli in 100 mL)","N/A","N/A","N/A","N/A","N/A","N/A","N/A","N/A","N/A","N/A","N/A","N/A","N/A","N/A","N/A","N/A","N/A","N/A"]
[null,"Contaminated (E. coli detected in 100 mL)","N/A","N/A","N/A","N/A","N/A","N/A","N/A","N/A","N/A","N/A","N/A","N/A","N/A","N/A","N/A","N/A","N/A","N/A",null,null,null,null,null,null,null,null,null,null,null,null,null,null,null,null,null,null,null,null,null,null,null,null,null,null,null,null,null,null,null,null,null,"Contaminated (E. coli detected in 100 mL)","N/A","N/A","N/A","N/A","N/A","N/A","N/A","N/A","N/A","N/A","N/A","N/A","N/A","N/A","N/A","N/A","N/A","N/A"]
[null,"Highly contaminated (>100 CFU/100 mL)","N/A","N/A","N/A","N/A","N/A","N/A","N/A","N/A","N/A","N/A","N/A","N/A","N/A","N/A","N/A","N/A","N/A","N/A",null,null,null,null,null,null,null,null,null,null,null,null,null,null,null,null,null,null,null,null,null,null,null,null,null,null,null,null,null,null,null,null,null,"Highly contaminated (>100 CFU/100 mL)","N/A","N/A","N/A","N/A","N/A","N/A","N/A","N/A","N/A","N/A","N/A","N/A","N/A","N/A","N/A","N/A","N/A","N/A"]
["Microbiological quality of piped on premises at point of collection","Not contaminated (No E. coli in 100 mL)","N/A","N/A","N/A","N/A","N/A","N/A","N/A","N/A","N/A","N/A","N/A","N/A","N/A","N/A","N/A","N/A","N/A","N/A",null,null,null,null,null,null,null,null,null,null,null,null,null,null,null,null,null,null,null,null,null,null,null,null,null,null,null,null,null,null,null,null,"Microbiological quality of piped on premises at point of collection","Not contaminated (No E. coli in 100 mL)","N/A","N/A","N/A","N/A","N/A","N/A","N/A","N/A","N/A","N/A","N/A","N/A","N/A","N/A","N/A","N/A","N/A","N/A"]
[null,"Contaminated (E. coli detected in 100 mL)","N/A","N/A","N/A","N/A","N/A","N/A","N/A","N/A","N/A","N/A","N/A","N/A","N/A","N/A","N/A","N/A","N/A","N/A",null,null,null,null,null,null,null,null,null,null,null,null,null,null,null,null,null,null,null,null,null,null,null,null,null,null,null,null,null,null,null,null,null,"Contaminated (E. coli detected in 100 mL)","N/A","N/A","N/A","N/A","N/A","N/A","N/A","N/A","N/A","N/A","N/A","N/A","N/A","N/A","N/A","N/A","N/A","N/A"]
[null,"Highly contaminated (>100 CFU/100 mL)","N/A","N/A","N/A","N/A","N/A","N/A","N/A","N/A","N/A","N/A","N/A","N/A","N/A","N/A","N/A","N/A","N/A","N/A",null,null,null,null,null,null,null,null,null,null,null,null,null,null,null,null,null,null,null,null,null,null,null,null,null,null,null,null,null,null,null,null,null,"Highly contaminated (>100 CFU/100 mL)","N/A","N/A","N/A","N/A","N/A","N/A","N/A","N/A","N/A","N/A","N/A","N/A","N/A","N/A","N/A","N/A","N/A","N/A"]
[null,null,"NATIONAL wealth index quintile",null,null,null,null,"URBAN wealth index quintile",null,null,null,null,"RURAL wealth index quintile",null,null,null,null,"SUB-REGIONS:",null,null,null,null,null,null,null,null,null,null,null,null,null,null,null,null,null,null,null,null,null,null,null,null,null,null,null,null,null,null,null,null,null,null,"Raw numbers of respondents:","Use of drinking water sources","NATIONAL wealth index quintile",null,null,null,null,"URBAN wealth index quintile",null,null,null,null,"RURAL wealth index quintile",null,null,null,null,"SUB-REGIONS:"]
["Percentage based on weighted population",null,"Poorest","Poor","Middle","Rich","Richest","Poorest","Poor","Middle","Rich","Richest","Poorest","Poor","Middle","Rich","Richest","Mohéli","Ndzouani","Ngazidja",null,null,null,null,null,null,null,null,null,null,null,null,null,null,null,null,null,null,null,null,null,null,null,null,null,null,null,null,null,null,null,null,"Water data, raw numbers (weighted)",null,"Poorest","Poor","Middle","Rich","Richest","Poorest","Poor","Middle","Rich","Richest","Poorest","Poor","Middle","Rich","Richest","Mohéli","Ndzouani","Ngazidja"]
["Source of drinking water","Piped into dwelling",6.5157242956987185,6.5406352538561201,15.207200366515236,16.946126438326278,21.147177225508894,7.6632445379481089,22.112914739408545,20.281693583186552,28.47998733852517,33.411785462710498,6.2541303955146743,5.4634306918903039,9.6033139110571035,13.36614407569949,10.824930780187913,14.097196782286945,19.111833162392472,7.1131406994983628]
[null,"Piped to yard/plot",29.144227131642637,23.27351081421568,21.642798691091286,22.837851448014906,24.399727769656756,42.925065157459855,26.806897158033681,34.201344132655791,40.145497272098204,33.923594843952522,27.001592566678205,20.178704943144197,17.932334594817117,17.978401821771715,12.279659196005497,50.284213602681803,41.64327289554469,2.5590269099787513]
[null,"Public tap/standpipe",33.49505270766727,26.728949736219032,20.362850347467539,17.22651628573723,7.4824729585783398,36.384759087051954,38.401352545338341,28.906372893110127,14.316203731078877,6.0652613435767906,35.10975700968779,26.843697879647603,12.582667445260013,14.685130339354657,7.4865512712020399,25.09717432031217,25.299255679535428,16.106961164013029]
[null,"Tube well or borehole",0.45628970520556372,0.1556088517724073,1.4123483975652862,0.52255421258543178,0.16880548492473876,0.67168516345835438,2.7164994530311417,0,0.53563046919160473,0,0.31952167368407169,0.16305852874562526,0.91464010716323862,0.76330951206384201,0,1.6421969699474805,0.29187156205297132,0.64434165655447406]
[null,"Protected well",2.5513633423018978,5.9230976317893687,6.1887177305892314,8.4683908016193321,11.530938167297533,0.91994386615033696,0.26690120743566714,1.4445411583277015,1.7979481376784623,6.974767004676159,1.8118201778274194,6.9913623009938819,9.113513054025816,8.3670233950860187,19.020483140853464,0.76963829999480071,0.10793620834792012,14.866918621526198]
[null,"Unprotected well",1.8110323171702538,2.10516627830529,3.1446454765940137,2.5009721789535528,3.2925471075147859,0.34719828398798203,9.5140134195035281E-2,0,0,0,1.9086834679771039,2.8694614158137859,3.9682451088057373,4.0098148165315122,5.7681123408067823,2.2413777137865809,0,5.2728250692271317]
[null,"Protected spring",3.0045309820704786,3.4908007898913773,3.1054079618266019,4.5652507190395522,5.8130963104407618,0.41347279704990003,1.418951212763899,0.77868661446972431,2.9981676993717841,2.8649512986594852,3.8344991672695108,2.3426502947943586,5.5581114867432522,5.4996122197464468,8.0028300813127426,0,1.8715111462886225,6.7639914525273435]
[null,"Unprotected spring",3.6821333190024759,2.0967683865347286,2.6314564470636066,1.8010496230671271,0.83873379242748125,0.3876407525435927,0,0,0.25187502835946823,0.96627415101623571,3.5413568233236372,4.1306909451255498,3.0141132171286853,3.0847307718840762,1.5906778281659828,1.6812865352317969,1.9235666614516109,2.581909539160764]
[null,"River/dam/lake/ponds/stream/canal/irrigation channel",2.4531259583290583,1.1848139550679815,0.27136635671104442,0,0.22799906771762535,0.61928347697699238,0.34660610385865909,0,0,0.25294789038085408,2.9953683734316838,1.5089015167268929,0.64623515280944244,9.9224906144445235E-2,0.21621848374635474,2.0446281265635102,1.4586292800020022,0]
[null,"Rainwater",7.2132126781968413,20.813896851432361,19.472891331490608,18.478767957676574,19.679277646998152,1.6887337658810744,4.7097084734796564,9.4608687936210565,9.5311352646105387,10.875863491226752,6.9611792288474224,21.882549036672273,27.907535826709477,24.063794307947241,27.441485452737581,0,1.493007545669256,35.752523551696349]
[null,"Tanker truck",0.81218389289319792,2.9625098454215211,2.7057821089280525,3.9714898716863316,3.2770353031510635,0.34569849591002461,2.4647335659756093,2.9368526879668644,1.3791935550620291,2.7213555462141352,0.83348394518856816,3.1523902101192736,3.7317558581424084,2.9819224667520565,4.8146099873841743,0,3.337377539650755E-2,5.9443988340353835]
[null,"Cart with small tank",0.41133680160218011,0.19854387493162826,0.12844997975219807,0.41931949268730789,7.9379140560883493E-2,0.6344046513674183,0.40855204105337378,1.3442821742917217,0,0.25294789038085408,0.59828647799968238,0,0,0,0,0,0.51212798076765276,9.8738255073829457E-3]
[null,"Bottled water",0.53986010065469614,0,3.0502626816729324E-2,0.16366234883527744,1.2244245360251969,0,0,0.15674846471931134,0,1.6902510772056494,0.77075746706414361,1.446170230667815E-2,0,0.2120012954534361,1.0096549792859735,0,0.33599684573197874,0.50425952453638367]
[null,"Other",7.9099267675647678,4.5256977305624773,3.6955821775885065,2.0980486217709498,0.83838548919748301,6.9988699642144532,0.25174336542645198,0.48860949765113193,0.56436150402393337,0,8.0595632255061123,4.4586405340195814,5.0275342373377319,4.888890071565041,1.5447864583114967,2.1422876491950458,5.9176172568191259,1.8798291517382926]
[]
[]
[]
[]
[]
[]
[]
[]
[]
[]
[]
[]
[]
[]
[]
[]
[]
[]
[]
[]
[]
[]
[]
[]
[]
[]
[]
[]
[]
[]
[]
[]
[]
[]
[]
[]
[{"$f":"A1026","v":"Comoros"}]
[{"$f":"A1034","v":"2012"}]
["Use of sanitation facilities"]
[" by wealth quintile and sub-national region"]
["Notes:"]
["WHO/UNICEF JMP customised wealth index excludes water,"]
[" sanitation and hygiene assets."]
["Survey used for analysis:",{"$f":"A1025","v":"DHS12"}]
[{"$f":"B1030","v":""}]
[{"$f":"B1029","v":""}]
[]
[]
["Use of sanitation facilities",null,"NATIONAL wealth index quintile",null,null,null,null,"URBAN wealth index quintile",null,null,null,null,"RURAL wealth index quintile",null,null,null,null,"SUB-REGIONS:",null,null,null,null,null,null,null,null,null,null,null,null,null,null,null,null,null,null,null,null,null,null,null,null,null,null,null,null,null,null,null,null,null,null,"Raw numbers of respondents:","Use of sanitation facilities","NATIONAL wealth index quintile",null,null,null,null,"URBAN wealth index quintile",null,null,null,null,"RURAL wealth index quintile",null,null,null,null,"SUB-REGIONS:"]
["Weighted percentage (used in graphs)",null,"Poorest","Poor","Middle","Rich","Richest","Poorest","Poor","Middle","Rich","Richest","Poorest","Poor","Middle","Rich","Richest","Mohéli","Ndzouani","Ngazidja",null,null,null,null,null,null,null,null,null,null,null,null,null,null,null,null,null,null,null,null,null,null,null,null,null,null,null,null,null,null,null,null,"Sanitation data, raw numbers (weighted)",null,"Poorest","Poor","Middle","Rich","Richest","Poorest","Poor","Middle","Rich","Richest","Poorest","Poor","Middle","Rich","Richest","Mohéli","Ndzouani","Ngazidja"]
["Sanitation","Improved",{"$f":"C153+C154+C155+C157+C158+C159+C162","v":33.366638608283566},{"$f":"D153+D154+D155+D157+D158+D159+D162","v":29.19830881640571},29.985598984707316,39.659694495640053,59.40572700502495,36.591976429031803,40.320244947046056,48.911383089752576,63.461720841117952,74.972479608076327,31.639825607393561,29.876970199764589,24.630966806740314,29.243337503733475,42.929886797093687,48.783278727402958,52.218381969004504,22.43508965620326,null,null,null,null,null,null,null,null,null,null,null,null,null,null,null,null,null,null,null,null,null,null,null,null,null,null,null,null,null,null,null,null,"Sanitation","Improved",1621.8924439999994,1424.8710579999993,1457.5517569999997,1935.4060260000008,2877.4191790000027,557.96010200000001,616.93921999999998,744.53870599999982,968.09232299999996,1144.4970379999997,1057.3823419999999,999.86516299999971,822.63972400000023,976.96800200000007,1428.2578439999995,786.91657999999961,6021.9981459999935,2508.2257380000019]
[null,"Not Improved",66.633361391716434,70.801691183594258,70.066367925784718,60.34030550435984,40.813603151985291,63.408023570968311,59.697782477457508,51.088616910247318,36.709602560754092,25.095703853597719,68.360174392606453,70.123029800235358,75.369033193259696,70.82438164738538,57.229915065132822,51.216721272597141,47.891481089656331,77.569071544444412,null,null,null,null,null,null,null,null,null,null,null,null,null,null,null,null,null,null,null,null,null,null,null,null,null,null,null,null,null,null,null,null,null,"Not Improved",3238.9281589999987,3455.1069809999995,3411.7262290000017,2944.6265880000014,1984.2033089999991,966.85532600000067,913.84309899999892,777.68098799999927,561.51147499999945,383.44875000000008,2284.5524559999999,2346.7431319999982,2517.2199349999992,2371.6088479999958,1911.1272570000001,826.17011799999977,5534.6499260000055,8673.7712220000085]
["Sanitation ladder","Basic",{"$f":"C122*C129/100","v":24.163207654178883},{"$f":"D122*D129/100","v":18.679925333983658},{"$f":"E122*E129/100","v":22.41648424864669},29.186695541703056,53.271907340158251,23.359684422080782,28.585894788665296,36.21324221906648,48.561243597588557,65.804131615061124,22.917869745943509,19.455055076889426,19.031249600179684,20.916450122936944,40.243322154067492,39.165102643478683,36.437024789120798,20.985811332182962,null,null,null,null,null,null,null,null,null,null,null,null,null,null,null,null,null,null,null,null,null,null,null,null,null,null,null,null,null,null,null,null,"Sanitation ladder","Basic",1174.5301759999998,911.57625399999972,1089.6292590000005,1417.2012580000007,2580.317010000002,356.19207200000011,437.39217499999995,544.0829930000001,740.78935300000001,1004.537053,765.90026399999999,651.08448700000008,635.617028,698.78147400000012,1338.8770580000003,631.7670609999999,4195.2893580000009,2346.1975380000026]
[null,"Limited",{"$f":"C122*C128/100","v":9.2034309541046895},{"$f":"D122*D128/100","v":10.51838348242206},{"$f":"E122*E128/100","v":7.5691147360606434},10.472998953936999,6.1338196648666905,13.232292006951031,11.734350158380757,12.698140870686121,14.900477243529394,9.1683479930152245,8.7219558614500556,10.421915122875175,5.5997172065606229,8.3268873807965331,2.6865646430262187,9.6181760839243022,15.781357179883772,1.4492783240203035,null,null,null,null,null,null,null,null,null,null,null,null,null,null,null,null,null,null,null,null,null,null,null,null,null,null,null,null,null,null,null,null,null,"Limited",447.36226799999997,513.29480399999989,367.92249799999996,508.53126800000007,297.10216899999995,201.76803000000001,179.547045,190.78221299999996,227.30296999999999,139.95998499999999,291.48207799999994,348.78067600000003,187.02269599999994,278.18652800000001,89.380785999999986,155.149519,1817.0352880000012,162.02819999999997]
[null,"Unimproved",{"$f":"100-C124-C125-C127","v":65.82635041139369},{"$f":"100-D124-D125-D127","v":70.351823892705838},{"$f":"100-E124-E125-E127","v":69.262630257795394},59.873110899867783,40.529273110516733,62.854034094938299,58.678552934940718,50.790761346042395,36.396689225408309,24.962447140777648,67.42223858910846,69.50419821988757,75.217521168304884,69.986475663015256,56.789934675512185,48.577090119926005,47.312289336608139,77.324095674499958,null,null,null,null,null,null,null,null,null,null,null,null,null,null,null,null,null,null,null,null,null,null,null,null,null,null,null,null,null,null,null,null,null,"Unimproved",3199.7008029999988,3433.1535559999998,3375.1204210000019,2921.872533000002,1981.043259999999,958.40800900000067,898.51687399999901,773.17578499999945,559.3457099999996,382.45446600000008,2253.2072530000005,2326.0332629999975,2512.1596459999992,2345.8185499999959,1901.771017,783.59057899999993,5480.4566610000047,8646.8433330000098]
[null,"Open defecation",0.80701098032273988,0.44986729088843747,0.7517707574972694,0.46719460449215583,6.4999884458325941E-2,0.55398947602988224,1.0012021180132284,0.29785556420500292,0.1415899334737401,6.5073251146002042E-2,0.93793580349798344,0.61883158034782815,0.15151202495481869,0.77018683325126602,0.28017852739410659,2.6396311526710057,0.46932869438729086,0.2408146692967798,null,null,null,null,null,null,null,null,null,null,null,null,null,null,null,null,null,null,null,null,null,null,null,null,null,null,null,null,null,null,null,null,null,"Open defecation",39.227356,21.953424999999999,36.605807999999996,22.754055000000001,3.1600489999999999,8.447317,15.326225000000001,4.5052029999999998,2.1657649999999999,0.99428399999999995,31.345203000000001,20.709869000000001,5.060289,25.790298,9.3562399999999997,42.579539000000004,54.193265000000004,26.927889]
["Shared among Improved Sanitation","Yes",27.582733346774269,36.023947649023,25.24249970767934,26.407159931825337,10.325300226269176,36.161730789847766,29.102874185888201,25.96152484051613,23.479472422177238,12.228951264441806,27.566384118792104,34.882771088205232,22.734459635698297,28.474476894894252,6.2580287148767804,19.716132934954818,30.221842548187688,6.4598731105118672,null,null,null,null,null,null,null,null,null,null,null,null,null,null,null,null,null,null,null,null,null,null,null,null,null,null,null,null,null,null,null,null,"Shared among improved sanitation facilities","Yes","N/A","N/A","N/A","N/A","N/A","N/A","N/A","N/A","N/A","N/A","N/A","N/A","N/A","N/A","N/A","N/A","N/A","N/A"]
[null,"No",72.417266653225752,63.976052350977021,74.757500292320714,73.592840068174667,89.674699773730808,63.838269210152255,70.897125814111789,74.038475159483923,76.520527577822762,87.771048735558225,72.433615881207899,65.117228911794811,77.265540364301671,71.525523105105762,93.74197128512327,80.283867065045229,69.778157451812433,93.540126889488164,null,null,null,null,null,null,null,null,null,null,null,null,null,null,null,null,null,null,null,null,null,null,null,null,null,null,null,null,null,null,null,null,null,"No","N/A","N/A","N/A","N/A","N/A","N/A","N/A","N/A","N/A","N/A","N/A","N/A","N/A","N/A","N/A","N/A","N/A","N/A"]
["Manually calculated ratios","Improved latrines",{"$f":"(C159)/(C159+C160+C164)*100","v":27.737226940206639},{"$f":"(D159)/(D159+D160+D164)*100","v":26.561020870332058},25.575016474235312,33.46313361006117,34.076375903622484,34.486317033161114,34.737288780045418,43.012555456906739,53.689077542783224,36.597767217350878,25.850540287435496,25.794260177527867,21.64892817680963,24.333734433355573,25.244093428070478,44.458037369620733,45.033074843261673,10.578312224208142]
[null,"Other"]
[null,"Other"]
[null,null,"NATIONAL wealth index quintile",null,null,null,null,"URBAN wealth index quintile",null,null,null,null,"RURAL wealth index quintile",null,null,null,null,"SUB-REGIONS:",null,null,null,null,null,null,null,null,null,null,null,null,null,null,null,null,null,null,null,null,null,null,null,null,null,null,null,null,null,null,null,null,null,null,"Raw numbers of respondents:","Use of sanitation facilities","NATIONAL wealth index quintile",null,null,null,null,"URBAN wealth index quintile",null,null,null,null,"RURAL wealth index quintile",null,null,null,null,"SUB-REGIONS:"]
["Percentage based on weighted population",null,"Poorest","Poor","Middle","Rich","Richest","Poorest","Poor","Middle","Rich","Richest","Poorest","Poor","Middle","Rich","Richest","Mohéli","Ndzouani","Ngazidja",null,null,null,null,null,null,null,null,null,null,null,null,null,null,null,null,null,null,null,null,null,null,null,null,null,null,null,null,null,null,null,null,"Sanitation data, raw numbers (weighted)",null,"Poorest","Poor","Middle","Rich","Richest","Poorest","Poor","Middle","Rich","Richest","Poorest","Poor","Middle","Rich","Richest","Mohéli","Ndzouani","Ngazidja"]
["Sanitation type","Sewer connection",1.0723481950317109,0.4094068219227901,1.6079546336256345,3.0228435682335744,17.730646016379811,0,1.4619826556802566,3.179765390684794,8.2469901137104866,23.924781551215599,0.70001886374325395,1.2019507051392164,0.53554783213123047,2.6366938838509855,12.805612502491662,1.6398029338904159,3.1049636863944166,6.9274864388802246,null,null,null,null,null,null,null,null,null,null,null,null,null,null,null,null,null,null,null,null,null,null,null,null,null,null,null,null,null,null,null,null,"Sanitation type","Sewer connection","N/A","N/A","N/A","N/A","N/A","N/A","N/A","N/A","N/A","N/A","N/A","N/A","N/A","N/A","N/A","N/A","N/A","N/A"]
[null,"Septic tank connection",2.6722085756432516,1.7882264080410133,1.7742479326174165,2.9047109560977162,13.76285722825129,1.3435645143537998,2.6192181933609091,2.5666412774712128,7.676780167095278,25.266685508870935,2.436026311725787,2.8512246008163324,1.1408348820084364,1.9894124574145577,6.8788851256242109,6.7411614102839845,4.1900331997926781,4.6631225340629978,null,null,null,null,null,null,null,null,null,null,null,null,null,null,null,null,null,null,null,null,null,null,null,null,null,null,null,null,null,null,null,null,null,"Septic tank connection","N/A","N/A","N/A","N/A","N/A","N/A","N/A","N/A","N/A","N/A","N/A","N/A","N/A","N/A","N/A","N/A","N/A","N/A"]
[null,"Improved latrines",29.622081837608601,27.000675586441901,26.55142950797222,33.732139971308762,27.692893603383308,35.248411914677988,36.221016673501339,43.164976421596563,47.366627158440195,25.712829086315708,28.503780431924515,25.823794893809044,22.954584092600655,24.549512011348934,23.0855873067513,40.40231438322855,44.813522024156725,10.840319482612347,null,null,null,null,null,null,null,null,null,null,null,null,null,null,null,null,null,null,null,null,null,null,null,null,null,null,null,null,null,null,null,null,null,"Improved latrines","N/A","N/A","N/A","N/A","N/A","N/A","N/A","N/A","N/A","N/A","N/A","N/A","N/A","N/A","N/A","N/A","N/A","N/A"]
[null,"Unimproved facilities",65.82635041139369,70.351823892705838,69.314597168287463,59.874037001671518,40.74860326752696,62.854034094938427,58.696580359444283,50.792654177814043,36.568012627280368,25.030630602451716,67.422238589108503,69.504198219887513,75.217521168304884,70.054194814134121,56.949736537738715,48.577090119926154,47.422545247166639,77.328256875147645,null,null,null,null,null,null,null,null,null,null,null,null,null,null,null,null,null,null,null,null,null,null,null,null,null,null,null,null,null,null,null,null,null,"Unimproved facilities","N/A","N/A","N/A","N/A","N/A","N/A","N/A","N/A","N/A","N/A","N/A","N/A","N/A","N/A","N/A","N/A","N/A","N/A"]
[null,"Open defecation",0.80701098032273988,0.44986729088843747,0.7517707574972694,0.46626850268832992,6.4999884458325941E-2,0.55398947602988224,1.0012021180132284,0.29596273243328558,0.1415899334737401,6.5073251146002042E-2,0.93793580349798344,0.61883158034782815,0.15151202495481869,0.77018683325126602,0.28017852739410659,2.6396311526710057,0.46893584248967579,0.2408146692967798,null,null,null,null,null,null,null,null,null,null,null,null,null,null,null,null,null,null,null,null,null,null,null,null,null,null,null,null,null,null,null,null,null,"Open defecation","N/A","N/A","N/A","N/A","N/A","N/A","N/A","N/A","N/A","N/A","N/A","N/A","N/A","N/A","N/A","N/A","N/A","N/A"]
["Septic tank emptying practices","Not emptied/treated and disposed in situ","N/A","N/A","N/A","N/A","N/A","N/A","N/A","N/A","N/A","N/A","N/A","N/A","N/A","N/A","N/A","N/A","N/A","N/A",null,null,null,null,null,null,null,null,null,null,null,null,null,null,null,null,null,null,null,null,null,null,null,null,null,null,null,null,null,null,null,null,"Septic tank emptying practices","Not emptied/treated and disposed in situ","N/A","N/A","N/A","N/A","N/A","N/A","N/A","N/A","N/A","N/A","N/A","N/A","N/A","N/A","N/A","N/A","N/A","N/A"]
[null,"Emptied and buried on site","N/A","N/A","N/A","N/A","N/A","N/A","N/A","N/A","N/A","N/A","N/A","N/A","N/A","N/A","N/A","N/A","N/A","N/A",null,null,null,null,null,null,null,null,null,null,null,null,null,null,null,null,null,null,null,null,null,null,null,null,null,null,null,null,null,null,null,null,null,"Emptied and buried on site","N/A","N/A","N/A","N/A","N/A","N/A","N/A","N/A","N/A","N/A","N/A","N/A","N/A","N/A","N/A","N/A","N/A","N/A"]
[null,"Emptied and discharged locally","N/A","N/A","N/A","N/A","N/A","N/A","N/A","N/A","N/A","N/A","N/A","N/A","N/A","N/A","N/A","N/A","N/A","N/A",null,null,null,null,null,null,null,null,null,null,null,null,null,null,null,null,null,null,null,null,null,null,null,null,null,null,null,null,null,null,null,null,null,"Emptied and discharged locally","N/A","N/A","N/A","N/A","N/A","N/A","N/A","N/A","N/A","N/A","N/A","N/A","N/A","N/A","N/A","N/A","N/A","N/A"]
[null,"Emptied and removed offsite","N/A","N/A","N/A","N/A","N/A","N/A","N/A","N/A","N/A","N/A","N/A","N/A","N/A","N/A","N/A","N/A","N/A","N/A",null,null,null,null,null,null,null,null,null,null,null,null,null,null,null,null,null,null,null,null,null,null,null,null,null,null,null,null,null,null,null,null,null,"Emptied and removed offsite","N/A","N/A","N/A","N/A","N/A","N/A","N/A","N/A","N/A","N/A","N/A","N/A","N/A","N/A","N/A","N/A","N/A","N/A"]
["Latrine emptying practices","Not emptied/treated and disposed in situ","N/A","N/A","N/A","N/A","N/A","N/A","N/A","N/A","N/A","N/A","N/A","N/A","N/A","N/A","N/A","N/A","N/A","N/A",null,null,null,null,null,null,null,null,null,null,null,null,null,null,null,null,null,null,null,null,null,null,null,null,null,null,null,null,null,null,null,null,"Latrine emptying practices","Not emptied/treated and disposed in situ","N/A","N/A","N/A","N/A","N/A","N/A","N/A","N/A","N/A","N/A","N/A","N/A","N/A","N/A","N/A","N/A","N/A","N/A"]
[null,"Emptied and buried on site","N/A","N/A","N/A","N/A","N/A","N/A","N/A","N/A","N/A","N/A","N/A","N/A","N/A","N/A","N/A","N/A","N/A","N/A",null,null,null,null,null,null,null,null,null,null,null,null,null,null,null,null,null,null,null,null,null,null,null,null,null,null,null,null,null,null,null,null,null,"Emptied and buried on site","N/A","N/A","N/A","N/A","N/A","N/A","N/A","N/A","N/A","N/A","N/A","N/A","N/A","N/A","N/A","N/A","N/A","N/A"]
[null,"Emptied and discharged locally","N/A","N/A","N/A","N/A","N/A","N/A","N/A","N/A","N/A","N/A","N/A","N/A","N/A","N/A","N/A","N/A","N/A","N/A",null,null,null,null,null,null,null,null,null,null,null,null,null,null,null,null,null,null,null,null,null,null,null,null,null,null,null,null,null,null,null,null,null,"Emptied and discharged locally","N/A","N/A","N/A","N/A","N/A","N/A","N/A","N/A","N/A","N/A","N/A","N/A","N/A","N/A","N/A","N/A","N/A","N/A"]
[null,"Emptied and removed offsite","N/A","N/A","N/A","N/A","N/A","N/A","N/A","N/A","N/A","N/A","N/A","N/A","N/A","N/A","N/A","N/A","N/A","N/A",null,null,null,null,null,null,null,null,null,null,null,null,null,null,null,null,null,null,null,null,null,null,null,null,null,null,null,null,null,null,null,null,null,"Emptied and removed offsite","N/A","N/A","N/A","N/A","N/A","N/A","N/A","N/A","N/A","N/A","N/A","N/A","N/A","N/A","N/A","N/A","N/A","N/A"]
["Shared among improved sanitation facilities","Yes",9.2034309541046877,10.518383482422058,7.5559969888315965,10.420653061643643,6.1111731676686105,13.232292006951029,11.729103659708533,12.533158896313681,14.860251412634121,9.1600098707166939,8.7219558614500539,10.421915122875177,5.5997172065606247,8.3076047067577381,2.6765641966011744,9.6181760839243005,15.722857325753509,1.4490095157385896,null,null,null,null,null,null,null,null,null,null,null,null,null,null,null,null,null,null,null,null,null,null,null,null,null,null,null,null,null,null,null,null,"Shared among improved sanitation facilities","Yes","N/A","N/A","N/A","N/A","N/A","N/A","N/A","N/A","N/A","N/A","N/A","N/A","N/A","N/A","N/A","N/A","N/A","N/A"]
[null,"No",24.163207654178883,18.67992533398365,22.377635085383684,29.040815299764276,53.075223680345843,23.359684422080779,28.573113862833971,35.742737736514918,48.43014602661183,65.744286275685582,22.917869745943502,19.455055076889426,19.031249600179688,20.868013645856749,40.093520738266001,39.165102643478669,36.301956517690918,20.981918939816993,null,null,null,null,null,null,null,null,null,null,null,null,null,null,null,null,null,null,null,null,null,null,null,null,null,null,null,null,null,null,null,null,null,"No","N/A","N/A","N/A","N/A","N/A","N/A","N/A","N/A","N/A","N/A","N/A","N/A","N/A","N/A","N/A","N/A","N/A","N/A"]
[null,"DK/missing",66.633361391716434,70.801691183594258,70.066367925784718,60.538531638591984,40.813603151985291,63.408023570968311,59.697782477457508,51.724103367171324,36.709602560754092,25.095703853597719,68.360174392606453,70.123029800235358,75.369033193259696,70.82438164738538,57.229915065132822,51.216721272597141,47.975186156555772,77.569071544444412,null,null,null,null,null,null,null,null,null,null,null,null,null,null,null,null,null,null,null,null,null,null,null,null,null,null,null,null,null,null,null,null,null,"DK/missing","N/A","N/A","N/A","N/A","N/A","N/A","N/A","N/A","N/A","N/A","N/A","N/A","N/A","N/A","N/A","N/A","N/A","N/A"]
["Shared among all sanitation facilities","Yes",21.655314633802014,23.200385826616568,23.859922203065665,19.234388056021697,9.6627966953394111,35.946160239451252,39.576666349793967,32.424523381585068,21.995042727864316,11.809534653040293,20.616966809502713,19.856314337123411,15.739492268166055,15.756325596203988,5.5074519667954318,17.216500189159618,29.415555251222713,9.6289614628420068,null,null,null,null,null,null,null,null,null,null,null,null,null,null,null,null,null,null,null,null,null,null,null,null,null,null,null,null,null,null,null,null,"Shared among all sanitation facilities","Yes","N/A","N/A","N/A","N/A","N/A","N/A","N/A","N/A","N/A","N/A","N/A","N/A","N/A","N/A","N/A","N/A","N/A","N/A"]
[null,"No",78.344685366198021,76.799614173383389,75.912418655267572,80.110881489183257,90.337203304660335,64.053839760548826,60.423333650206082,65.266098786955581,78.004957272135783,88.190465346959684,79.383033190497258,80.143685662876536,84.260507731833982,84.010305817561175,94.492548033204542,82.783499810840453,70.240549270258086,90.341924598200407,null,null,null,null,null,null,null,null,null,null,null,null,null,null,null,null,null,null,null,null,null,null,null,null,null,null,null,null,null,null,null,null,null,"No","N/A","N/A","N/A","N/A","N/A","N/A","N/A","N/A","N/A","N/A","N/A","N/A","N/A","N/A","N/A","N/A","N/A","N/A"]
["Type of toilet facility","Flush to piped sewer system",1.0723481950317109,0.4094068219227901,1.610746157030269,3.0228435682335744,17.796351407851052,0,1.4626366093227836,3.179765390684794,8.2693142333029073,23.94655966688963,0.70001886374325395,1.2019507051392164,0.53554783213123047,2.642813879986698,12.853458110653667,1.6398029338904159,3.1115100403256117,6.9287715689680649,null,null,null,null,null,null,null,null,null,null,null,null,null,null,null,null,null,null,null,null,null,null,null,null,null,null,null,null,null,null,null,null,"Type of toilet facility","Flush to piped sewer system",52.124922000000005,19.978962999999997,78.295781000000005,147.51575199999999,861.99707399999954,0,22.379771999999999,48.403014999999996,126.14627400000002,365.55769199999986,23.394174000000003,40.224581999999998,17.886545999999999,88.291720999999995,427.62871599999983,26.451442999999998,358.82972599999999,774.63132299999972]
[null,"Flush to septic tank",2.6722085756432516,1.7882264080410133,1.7773281529954992,2.9047109560977162,13.813858975232741,1.3435645143537998,2.6203897854256071,2.5666412774712128,7.6975607617330768,25.28968512533697,2.436026311725787,2.8512246008163324,1.1408348820084364,1.994030056987373,6.9045867031354788,6.7411614102839845,4.1988672613404807,4.663987598054776,null,null,null,null,null,null,null,null,null,null,null,null,null,null,null,null,null,null,null,null,null,null,null,null,null,null,null,null,null,null,null,null,null,"Flush to septic tank",129.89126499999998,87.265055999999987,86.39306400000001,141.75084199999998,669.09816200000012,20.486878999999998,40.094528999999994,39.069918999999999,117.42432100000001,386.0612569999999,81.410411000000011,95.419319000000016,38.102284000000004,66.617004999999992,229.71246500000004,108.74077800000001,484.22739099999984,521.43021999999985]
[null,"Flush to pit latrine",1.2971454030022351,0.51459567644173165,1.4190584551619385,1.9433185083217528,4.4029983557314862,1.5309910675956262,3.1848902671879196,3.370596320769975,4.1091175865977911,7.2395986982210028,1.1251122560051816,0.65808714551100467,0.76174976189321397,0.31454391750970329,2.1967569072939086,0.47237938354135572,2.7214362223257003,1.2860431919293194,null,null,null,null,null,null,null,null,null,null,null,null,null,null,null,null,null,null,null,null,null,null,null,null,null,null,null,null,null,null,null,null,null,"Flush to pit latrine",63.051911000000004,25.112156000000002,68.978149999999999,94.834576999999982,213.26684399999996,23.344788000000001,48.731938999999997,51.307880999999995,62.683538000000013,110.516543,37.600518000000001,22.023599000000001,25.441372999999999,10.508354000000001,73.085104999999999,7.6198890000000006,313.84511100000003,143.77863799999997]
[null,"Flush to somewhere else",0.77610416185112618,0.20448026446538686,0.13689882946846454,2.6640805560812959E-2,1.0554456432484769,1.0342926566978576,0.3102538739062134,0,0.39049661473578001,0.37784747057884766,0.6569241570224077,0.29817030020837865,5.710551324695648E-2,0,1.2232639419776681,6.537714316952363E-2,0.453856761574217,0.47751316555964768,null,null,null,null,null,null,null,null,null,null,null,null,null,null,null,null,null,null,null,null,null,null,null,null,null,null,null,null,null,null,null,null,null,"Flush to somewhere else",37.725030999999994,9.9785920000000008,6.654431999999999,1.3000799999999999,51.122335999999997,15.771053999999999,4.7471879999999995,0,5.9569259999999993,5.7680540000000002,21.953976999999998,9.9785920000000008,1.9072439999999999,0,40.697435999999996,1.0545899999999999,52.340276999999986,53.385604000000001]
[null,"Flush, don't know where",2.2658003245794762,8.4352100913214781E-2,0.18922226340230819,1.3495790952515119E-2,4.5849956941137616E-2,0.36192406626148088,0.60112428218048897,4.3265699596184558E-2,0,0.14547921626702134,2.5865548020784583,0.66614321231759221,0,0,0,0,1.0704740642896255,2.5755284827140412E-2,null,null,null,null,null,null,null,null,null,null,null,null,null,null,null,null,null,null,null,null,null,null,null,null,null,null,null,null,null,null,null,null,null,"Flush, don't know where",110.13648900000001,4.1163639999999999,9.1977899999999995,0.65859900000000005,2.2208220000000001,5.5186739999999999,9.1977899999999995,0.65859900000000005,0,2.2208220000000001,86.440975000000009,22.293203999999999,0,0,0,0,123.45064300000001,2.8794210000000002]
[null,"Ventilated Improved Pit latrine (VIP)",0,4.1704613908816808E-2,4.3611892973812925E-2,0,0.89991722610149771,0.13347031795641048,0,0,0,2.2998958656748516,0,0,6.3472846659512902E-2,0,0.25488309932005593,0.25758565892036173,0.17678997368590074,0.20752413140534437,null,null,null,null,null,null,null,null,null,null,null,null,null,null,null,null,null,null,null,null,null,null,null,null,null,null,null,null,null,null,null,null,null,"Ventilated Improved Pit latrine (VIP)",0,2.0351759999999999,2.119904,0,43.589047999999998,2.0351759999999999,0,0,0,35.109203000000001,0,0,2.119904,0,8.479845000000001,4.1550799999999999,20.388010000000001,23.201038]
[null,"Pit latrine with slab",24.928150737596763,25.364290804342275,23.753560399594058,30.098823761672467,20.270976783746029,32.512817544760594,31.067371632365585,38.33689810348752,41.74217629035212,14.190971650717527,23.222547323917006,24.056337074249669,20.767328415460234,22.506579375268878,18.637105261779912,38.789037053977403,38.264274810326398,9.0907104393530531,null,null,null,null,null,null,null,null,null,null,null,null,null,null,null,null,null,null,null,null,null,null,null,null,null,null,null,null,null,null,null,null,null,"Pit latrine with slab",1211.7126869999995,1237.7718209999996,1154.6223809999999,1468.832416,981.85983599999963,495.76045799999997,475.36120000000005,583.57181299999979,636.76622500000008,216.63315799999992,776.08239000000003,805.07137199999954,693.59962400000006,751.90487000000007,620.04803099999992,625.70079699999974,4412.7639210000034,1016.3344230000002]
[null,"Pit latrine without slab/open pit",61.521766389698584,65.228750591924495,62.538646700979584,54.98371005354096,35.582104082127358,57.439304516271015,53.187077349469746,48.199051811768193,34.645782210385242,22.314429585400593,62.700231173091879,63.577057111190783,70.195194480176227,62.87189653783787,49.888712653341045,37.992479496598072,41.904975218623335,73.119868413819518,null,null,null,null,null,null,null,null,null,null,null,null,null,null,null,null,null,null,null,null,null,null,null,null,null,null,null,null,null,null,null,null,null,"Pit latrine without slab/open pit",2990.4626959999969,3183.1487039999979,3039.9030689999995,2683.2229829999997,1723.4807799999996,875.8433770000006,813.8143519999993,733.69545899999957,528.5125479999997,340.64230900000001,2095.4008440000007,2127.6750669999979,2344.4209829999995,2100.4384719999985,1659.7748209999991,612.85163299999999,4832.6216470000027,8174.7449520000127]
[null,"No facility/bush/field",0.80701098032273988,0.44986729088843747,0.7530758849060829,0.46626850268832992,6.524075796344099E-2,0.55398947602988224,1.0016499617475139,0.29596273243328558,0.14197320913726924,6.51324856592915E-2,0.93793580349798344,0.61883158034782815,0.15151202495481869,0.77197450396728784,0.28122535838594692,2.6396311526710057,0.46992452393848377,0.24085934324595851,null,null,null,null,null,null,null,null,null,null,null,null,null,null,null,null,null,null,null,null,null,null,null,null,null,null,null,null,null,null,null,null,null,"No facility/bush/field",39.227356,21.953424999999999,36.605807999999996,22.754055000000001,3.1600489999999999,8.447317,15.326225000000001,4.5052029999999998,2.1657649999999999,0.99428399999999995,31.345203000000001,20.709869000000001,5.060289,25.790298,9.3562399999999997,42.579539000000004,54.193265000000004,26.927889]
[null,"Composting toilet",1.1309853724301295,0.99573239083586773,1.1920716635494295,1.6765019103620253,2.1757742994210014,0.70920891810389042,1.3838323705636737,1.4142162977428927,1.6435519691320595,1.8602893849693387,1.5695660499238744,0.4432274617307731,1.3620330685876887,1.7853702739808228,2.0830967149106585,0.88331228678943696,2.6750295967107882,0.23229744166556221,null,null,null,null,null,null,null,null,null,null,null,null,null,null,null,null,null,null,null,null,null,null,null,null,null,null,null,null,null,null,null,null,null,"Composting toilet",54.975169999999999,48.591521999999998,57.944687000000009,81.813839999999999,105.38739299999999,10.814126999999999,21.17399,21.527479,25.071965000000002,28.398362999999996,52.453873999999999,14.833087000000001,45.489992999999998,59.646052000000005,69.303681999999995,14.248593,308.49334399999998,25.970675000000004]
[null,"Bucket toilet",0.10585568611242988,1.722204471584508E-2,0,0,0.25767181052412641,5.5116965933532026E-2,0,0,0,0,0.15396634916633706,0,0,0,0.37514127773936523,5.2100857383674308E-2,0.15284187234710511,0,null,null,null,null,null,null,null,null,null,null,null,null,null,null,null,null,null,null,null,null,null,null,null,null,null,null,null,null,null,null,null,null,null,"Bucket toilet",5.1454550000000001,0.84043199999999996,0,0,12.480779999999999,0.84043199999999996,0,0,0,0,5.1454550000000001,0,0,0,12.480779999999999,0.84043199999999996,17.626235000000001,0]
[null,"Hanging toilet/latrine",3.4226241737315157,4.9013709916000705,6.5857795999384798,4.8636861425696951,3.6338107011113676,4.3253199560360187,5.180773867830502,2.593602366045856,1.3600271246238167,2.2701108502848877,3.9111169098278746,5.6289708084883605,4.9652211748817097,7.1127914544613136,5.3017699714622601,10.467132622774891,4.8000196545125,3.7266694211716329,null,null,null,null,null,null,null,null,null,null,null,null,null,null,null,null,null,null,null,null,null,null,null,null,null,null,null,null,null,null,null,null,null,"Hanging toilet/latrine",166.36762099999999,239.18582799999999,320.12415800000008,237.34947,176.00990899999999,65.95314599999999,79.27091200000001,39.480326000000005,20.746866000000001,34.654518000000003,130.70697699999999,188.379604,165.83141900000001,237.62573799999998,176.38748000000004,168.84392400000004,553.55429199999992,416.63877000000008]
[null,null,null,null,null,null,null,null,null,null,null,null,null,null,null,null,null,null,null,null,null,null,null,null,null,null,null,null,null,null,null,null,null,null,null,null,null,null,null,null,null,null,null,null,null,null,null,null,null,null,null,null,null,"Total",4860.8206029999983,4879.9780390000005,4860.839224000003,4880.032614000007,4843.6730330000128,1524.815427999999,1530.0978969999987,1522.2196940000006,1525.4744279999989,1526.5562030000003,3341.9347979999993,3346.6082949999995,3339.8596589999988,3340.8225100000004,3326.9546009999999,1613.0866979999978,11532.333861999989,11179.922953000012]
[]
[]
[]
[]
[]
[]
[]
[]
[]
[]
[]
[]
[]
[]
[]
[]
[]
[]
[]
[]
[]
[]
[]
[]
[]
[]
[]
[]
[]
[]
[]
[]
[]
[]
[]
[]
[]
[]
[]
[]
[]
[]
[{"$f":"A1026","v":"Comoros"}]
[{"$f":"A1034","v":"2012"}]
["Access to hygiene facilities "]
[" by wealth quintile and sub-national region"]
["Notes:"]
["WHO/UNICEF JMP customised wealth index excludes water,"]
[" sanitation and hygiene assets."]
["Survey used for analysis:",{"$f":"A1025","v":"DHS12"}]
[]
[]
[]
[]
["Access to handwashing",null,"NATIONAL wealth index quintile",null,null,null,null,"URBAN wealth index quintile",null,null,null,null,"RURAL wealth index quintile",null,null,null,null,"SUB-REGIONS:",null,null,null,null,null,null,null,null,null,null,null,null,null,null,null,null,null,null,null,null,null,null,null,null,null,null,null,null,null,null,null,null,null,null,"Raw numbers of respondents:","Access to handwashing","NATIONAL wealth index quintile",null,null,null,null,"URBAN wealth index quintile",null,null,null,null,"RURAL wealth index quintile",null,null,null,null,"SUB-REGIONS:"]
["Weighted percentage (used in graphs)",null,"Poorest","Poor","Middle","Rich","Richest","Poorest","Poor","Middle","Rich","Richest","Poorest","Poor","Middle","Rich","Richest","Mohéli","Ndzouani","Ngazidja",null,null,null,null,null,null,null,null,null,null,null,null,null,null,null,null,null,null,null,null,null,null,null,null,null,null,null,null,null,null,null,null,"Hygiene data, raw numbers (weighted)",null,"Poorest","Poor","Middle","Rich","Richest","Poorest","Poor","Middle","Rich","Richest","Poorest","Poor","Middle","Rich","Richest","Mohéli","Ndzouani","Ngazidja"]
["Hygiene ladder","Basic",12.548276055579432,10.689487728105254,13.448860573476987,15.902129802458598,26.337288795442255,12.733739610277858,9.4019397431159639,13.986672778667902,21.133874999735742,33.156404730328603,12.672893488821554,9.0206030405641702,14.786320179703822,17.365042762042354,19.708998261705524,23.690408075280541,24.413298073047283,5.6081769467672755,null,null,null,null,null,null,null,null,null,null,null,null,null,null,null,null,null,null,null,null,null,null,null,null,null,null,null,null,null,null,null,null,"Hygiene ladder","Basic",590.78022600000008,506.68337700000001,642.66062000000011,752.10635400000001,1235.1164179999996,192.36792100000002,140.66342499999996,207.43720500000003,320.48172799999998,493.5788869999999,405.03566999999987,294.52340099999998,482.45724599999983,562.11818600000004,628.68332599999997,380.26373100000012,2740.5580169999998,606.52524699999981]
[null,"Limited",38.006057824399541,34.391957033755808,31.185928099389493,35.697980115872056,40.706808635394125,48.197846448430596,31.824330384903554,38.770243699264888,45.649812856681621,45.76088588878897,32.548846255596573,32.641403142214152,33.748759953745662,31.600470848976016,35.245621784158658,57.072049281406635,39.617223957848111,29.06829880920111,null,null,null,null,null,null,null,null,null,null,null,null,null,null,null,null,null,null,null,null,null,null,null,null,null,null,null,null,null,null,null,null,null,"Limited",1789.3475830000002,1630.1840999999988,1490.235383,1688.3699230000002,1908.9910150000001,728.12228000000016,476.127207,575.003871,692.25028099999997,681.2140009999996,1040.286795,1065.7443879999998,1101.1755180000002,1022.9286270000003,1124.2750360000002,916.08512299999973,4447.3016469999993,3143.7412339999996]
[null,"No facility",49.445666120021095,54.918555238138808,55.365211327133437,48.399890081669092,32.95590256916347,39.06841394129161,58.773729871980507,47.243083522067138,33.216312143582691,21.082709380882363,54.778260255581927,58.337993817221658,51.464919866550531,51.034486388981648,45.045379954135832,19.23754264331297,35.969477969104673,65.323524244031631,null,null,null,null,null,null,null,null,null,null,null,null,null,null,null,null,null,null,null,null,null,null,null,null,null,null,null,null,null,null,null,null,null,"No facility",2327.9310779999996,2603.1480399999969,2645.6546889999986,2289.1188359999983,1545.5036640000005,590.20443299999999,879.32005199999912,700.66507999999965,503.70417699999985,313.8452529999999,1750.7563970000001,1904.740100999999,1679.229395999999,1652.0208619999989,1436.8705559999996,308.78909800000002,4037.8174600000007,7064.7497490000114]
["Place where household members wash their hands","Observed",48.96555547701211,43.788465028377132,43.803126646957445,50.009425551761225,64.671978146403433,60.367319486486792,40.292510851766679,51.40132394056387,66.20877970649498,76.887079190011093,43.248074913519019,40.646160802036718,47.416146954934078,47.334939110028166,52.493447415665386,80.364487265767551,62.196751334974898,33.538432306996448,null,null,null,null,null,null,null,null,null,null,null,null,null,null,null,null,null,null,null,null,null,null,null,null,null,null,null,null,null,null,null,null,"Observed handwashing place","Fixed","N/A","N/A","N/A","N/A","N/A","N/A","N/A","N/A","N/A","N/A","N/A","N/A","N/A","N/A","N/A","N/A","N/A","N/A"]
[null,"Not observed: not in dwelling",40.759953304534648,48.564626419623082,51.294348816830862,44.459099080111081,28.52127995175583,34.263186770431879,53.223408442046406,41.804682301002963,29.189038990605344,17.37574180216922,45.760990187936038,49.265569784885763,47.678972788838351,48.095403066529563,40.086070803847655,18.955191706627069,29.496109129245873,59.833373796588837,null,null,null,null,null,null,null,null,null,null,null,null,null,null,null,null,null,null,null,null,null,null,null,null,null,null,null,null,null,null,null,null,null,"Mobile","N/A","N/A","N/A","N/A","N/A","N/A","N/A","N/A","N/A","N/A","N/A","N/A","N/A","N/A","N/A","N/A","N/A","N/A"]
[null,"Not observed: no permission to see",2.4313827160594768,1.8790252592774015,1.042734203017013,1.4503007991577308,2.8936087149348322,0.86289827335089175,1.5127860253264407,1.194387582269711,0.42383785974359917,1.8362214955757314,3.3297888416792514,1.5570829450776824,1.425577924260919,1.7880352365214489,3.3597691073845386,0.1728775027069254,1.7847916516532323,2.3524915088154321,null,null,null,null,null,null,null,null,null,null,null,null,null,null,null,null,null,null,null,null,null,null,null,null,null,null,null,null,null,null,null,null,"Water / Soap","Water and soap","N/A","N/A","N/A","N/A","N/A","N/A","N/A","N/A","N/A","N/A","N/A","N/A","N/A","N/A","N/A","N/A","N/A","N/A"]
[null,"Not observed: other reason",7.131776675445435,4.7788111777607103,3.0392648443053991,2.4487602942892925,3.2685940628304824,4.4434279556620568,4.219118890933574,4.2244869944508796,3.7413301454158687,3.1645977481499483,6.6265189294695519,7.6499677713253273,2.5994690455345273,1.2396110604419903,2.9419272419518414,0.18755482912053645,5.4432386370240682,3.3463048804119815,null,null,null,null,null,null,null,null,null,null,null,null,null,null,null,null,null,null,null,null,null,null,null,null,null,null,null,null,null,null,null,null,null,"Water only","N/A","N/A","N/A","N/A","N/A","N/A","N/A","N/A","N/A","N/A","N/A","N/A","N/A","N/A","N/A","N/A","N/A","N/A"]
[null,"missing",0.71133182694831509,0.98907211496162217,0.82052548888918542,1.6324142746804986,0.64453912407523628,6.316751406846341E-2,0.75217578992692891,1.3751191817125439,0.43701329774025605,0.73635976409393378,1.0346271273961583,0.88121869667450881,0.87983328643211134,1.5420115264787784,1.1187854311505474,0.31988869577796286,1.0791092471021138,0.92939750718730196,null,null,null,null,null,null,null,null,null,null,null,null,null,null,null,null,null,null,null,null,null,null,null,null,null,null,null,null,null,null,null,null,null,"Soap only","N/A","N/A","N/A","N/A","N/A","N/A","N/A","N/A","N/A","N/A","N/A","N/A","N/A","N/A","N/A","N/A","N/A","N/A"]
[null,null,null,null,null,null,null,null,null,null,null,null,null,null,null,null,null,null,null,null,null,null,null,null,null,null,null,null,null,null,null,null,null,null,null,null,null,null,null,null,null,null,null,null,null,null,null,null,null,null,null,null,null,"Neither","N/A","N/A","N/A","N/A","N/A","N/A","N/A","N/A","N/A","N/A","N/A","N/A","N/A","N/A","N/A","N/A","N/A","N/A"]
[null,null,null,null,null,null,null,null,null,null,null,null,null,null,null,null,null,null,null,null,null,null,null,null,null,null,null,null,null,null,null,null,null,null,null,null,null,null,null,null,null,null,null,null,null,null,null,null,null,null,null,null,"Place where household members wash their hands","Observed",2380.1278089999987,2136.8674769999993,2132.8960029999998,2440.4762770000007,3144.1074330000038,920.49020100000041,616.79063200000007,782.44107600000029,1012.7320089999996,1174.792887999999,1445.3224650000002,1360.2677889999991,1583.6327639999997,1585.0468129999995,1752.9583619999994,1296.3488539999985,7187.8596640000014,3750.2664810000042]
[null,null,null,null,null,null,null,null,null,null,null,null,null,null,null,null,null,null,null,null,null,null,null,null,null,null,null,null,null,null,null,null,null,null,null,null,null,null,null,null,null,null,null,null,null,null,null,null,null,null,null,null,null,"Not observed: not in dwelling",1981.2682079999988,2369.9431039999986,2497.6644349999974,2169.6185349999978,1386.5969600000008,522.45035799999994,814.73452599999905,636.35910699999965,446.47664899999984,265.49191499999995,1529.3024549999998,1648.7256450000002,1592.4107779999988,1610.5115329999992,1338.6282759999997,305.76367600000003,3408.7615270000047,6690.5660390000075]
[null,null,null,null,null,null,null,null,null,null,null,null,null,null,null,null,null,null,null,null,null,null,null,null,null,null,null,null,null,null,null,null,null,null,null,null,null,null,null,null,null,null,null,null,null,null,null,null,null,null,null,null,null,"Not observed: no permission to see",118.185152,91.696020000000004,50.773626999999991,70.775152000000006,140.676332,13.157606000000001,23.157460999999998,18.181203,6.4830400000000008,28.056469,111.27937200000001,52.109467000000002,47.612301999999993,59.873733999999992,112.195629,2.7886639999999998,206.26208999999997,263.05552900000004]
[null,null,null,null,null,null,null,null,null,null,null,null,null,null,null,null,null,null,null,null,null,null,null,null,null,null,null,null,null,null,null,null,null,null,null,null,null,null,null,null,null,null,null,null,null,null,null,null,null,null,null,null,null,"Not observed: other reason",346.66287,233.20493599999995,147.99025400000002,119.50030100000002,158.90670400000002,67.754075,64.585526000000002,64.305972999999994,57.227528,48.353337999999994,221.45394199999998,256.014456,86.818617999999987,41.509329000000001,98.242280000000022,3.0254219999999998,629.05593300000032,374.18370999999979]
[null,null,null,null,null,null,null,null,null,null,null,null,null,null,null,null,null,null,null,null,null,null,null,null,null,null,null,null,null,null,null,null,null,null,null,null,null,null,null,null,null,null,null,null,null,null,null,null,null,null,null,null,null,"missing",34.576563999999998,48.266502000000003,39.953666999999996,79.662348999999992,31.335059000000001,0.96318800000000004,11.514174000000001,20.932334999999998,6.6845719999999993,11.251177999999999,34.576563999999998,29.490937999999996,29.385196999999998,51.635441,37.360554,5.1600820000000001,124.70885799999999,103.92520099999999]
[null,null,null,null,null,null,null,null,null,null,null,null,null,null,null,null,null,null,null,null,null,null,null,null,null,null,null,null,null,null,null,null,null,null,null,null,null,null,null,null,null,null,null,null,null,null,null,null,null,null,null,null,null,"Total",4860.8206029999983,4879.9780390000005,4869.2779860000019,4880.032614000007,4861.6224880000136,1524.815427999999,1530.7823189999988,1522.2196940000006,1529.6037979999987,1527.9457880000002,3341.9347979999993,3346.6082949999995,3339.8596589999988,3348.5768500000004,3339.3851010000003,1613.0866979999978,11556.648071999985,11181.996960000011]
[]
[]
[]
[]
[]
[]
[]
[]
[]
[]
[]
[]
[]
[]
[]
[]
[]
[]
[]
[]
[]
[]
[null,null,null,null,null,null,null,null,null,null,null,null,null,null,null,null,null,null,null,null,null,null,null,null,null,null,null,null,null,null,null,null,null,null,null,null,null,null,null,null,null,null,null,null,null,null,null,null,null,null,null,null,"Raw numbers of respondents:","Menstrual health and hygiene","NATIONAL wealth index quintile",null,null,null,null,"URBAN wealth index quintile",null,null,null,null,"RURAL wealth index quintile",null,null,null,null,"SUB-REGIONS:"]
[null,null,null,null,null,null,null,null,null,null,null,null,null,null,null,null,null,null,null,null,null,null,null,null,null,null,null,null,null,null,null,null,null,null,null,null,null,null,null,null,null,null,null,null,null,null,null,null,null,null,null,null,"MHH data, raw numbers (weighted)",null,"Poorest","Poor","Middle","Rich","Richest","Poorest","Poor","Middle","Rich","Richest","Poorest","Poor","Middle","Rich","Richest","Mohéli","Ndzouani","Ngazidja"]
[null,null,null,null,null,null,null,null,null,null,null,null,null,null,null,null,null,null,null,null,null,null,null,null,null,null,null,null,null,null,null,null,null,null,null,null,null,null,null,null,null,null,null,null,null,null,null,null,null,null,null,null,"Private place to wash and change","Yes","N/A","N/A","N/A","N/A","N/A","N/A","N/A","N/A","N/A","N/A","N/A","N/A","N/A","N/A","N/A","N/A","N/A","N/A"]
[null,null,null,null,null,null,null,null,null,null,null,null,null,null,null,null,null,null,null,null,null,null,null,null,null,null,null,null,null,null,null,null,null,null,null,null,null,null,null,null,null,null,null,null,null,null,null,null,null,null,null,null,null,"No","N/A","N/A","N/A","N/A","N/A","N/A","N/A","N/A","N/A","N/A","N/A","N/A","N/A","N/A","N/A","N/A","N/A","N/A"]
[null,null,null,null,null,null,null,null,null,null,null,null,null,null,null,null,null,null,null,null,null,null,null,null,null,null,null,null,null,null,null,null,null,null,null,null,null,null,null,null,null,null,null,null,null,null,null,null,null,null,null,null,null,"DK/not sure/missing","N/A","N/A","N/A","N/A","N/A","N/A","N/A","N/A","N/A","N/A","N/A","N/A","N/A","N/A","N/A","N/A","N/A","N/A"]
[null,null,null,null,null,null,null,null,null,null,null,null,null,null,null,null,null,null,null,null,null,null,null,null,null,null,null,null,null,null,null,null,null,null,null,null,null,null,null,null,null,null,null,null,null,null,null,null,null,null,null,null,"Use of menstrual materials","Materials reusable","N/A","N/A","N/A","N/A","N/A","N/A","N/A","N/A","N/A","N/A","N/A","N/A","N/A","N/A","N/A","N/A","N/A","N/A"]
[null,null,null,null,null,null,null,null,null,null,null,null,null,null,null,null,null,null,null,null,null,null,null,null,null,null,null,null,null,null,null,null,null,null,null,null,null,null,null,null,null,null,null,null,null,null,null,null,null,null,null,null,null,"Materials not reusable","N/A","N/A","N/A","N/A","N/A","N/A","N/A","N/A","N/A","N/A","N/A","N/A","N/A","N/A","N/A","N/A","N/A","N/A"]
[null,null,null,null,null,null,null,null,null,null,null,null,null,null,null,null,null,null,null,null,null,null,null,null,null,null,null,null,null,null,null,null,null,null,null,null,null,null,null,null,null,null,null,null,null,null,null,null,null,null,null,null,null,"No materials used","N/A","N/A","N/A","N/A","N/A","N/A","N/A","N/A","N/A","N/A","N/A","N/A","N/A","N/A","N/A","N/A","N/A","N/A"]
[null,null,null,null,null,null,null,null,null,null,null,null,null,null,null,null,null,null,null,null,null,null,null,null,null,null,null,null,null,null,null,null,null,null,null,null,null,null,null,null,null,null,null,null,null,null,null,null,null,null,null,null,null,"DK/not sure/missing","N/A","N/A","N/A","N/A","N/A","N/A","N/A","N/A","N/A","N/A","N/A","N/A","N/A","N/A","N/A","N/A","N/A","N/A"]
[null,null,null,null,null,null,null,null,null,null,null,null,null,null,null,null,null,null,null,null,null,null,null,null,null,null,null,null,null,null,null,null,null,null,null,null,null,null,null,null,null,null,null,null,null,null,null,null,null,null,null,null,"Use of menstrual materials with private place to wash and change","Materials reusable","N/A","N/A","N/A","N/A","N/A","N/A","N/A","N/A","N/A","N/A","N/A","N/A","N/A","N/A","N/A","N/A","N/A","N/A"]
[null,null,null,null,null,null,null,null,null,null,null,null,null,null,null,null,null,null,null,null,null,null,null,null,null,null,null,null,null,null,null,null,null,null,null,null,null,null,null,null,null,null,null,null,null,null,null,null,null,null,null,null,null,"Materials not reusable","N/A","N/A","N/A","N/A","N/A","N/A","N/A","N/A","N/A","N/A","N/A","N/A","N/A","N/A","N/A","N/A","N/A","N/A"]
[null,null,null,null,null,null,null,null,null,null,null,null,null,null,null,null,null,null,null,null,null,null,null,null,null,null,null,null,null,null,null,null,null,null,null,null,null,null,null,null,null,null,null,null,null,null,null,null,null,null,null,null,null,"No materials used","N/A","N/A","N/A","N/A","N/A","N/A","N/A","N/A","N/A","N/A","N/A","N/A","N/A","N/A","N/A","N/A","N/A","N/A"]
[null,null,null,null,null,null,null,null,null,null,null,null,null,null,null,null,null,null,null,null,null,null,null,null,null,null,null,null,null,null,null,null,null,null,null,null,null,null,null,null,null,null,null,null,null,null,null,null,null,null,null,null,"Awareness of menstruation before menarche","Yes","N/A","N/A","N/A","N/A","N/A","N/A","N/A","N/A","N/A","N/A","N/A","N/A","N/A","N/A","N/A","N/A","N/A","N/A"]
[null,null,null,null,null,null,null,null,null,null,null,null,null,null,null,null,null,null,null,null,null,null,null,null,null,null,null,null,null,null,null,null,null,null,null,null,null,null,null,null,null,null,null,null,null,null,null,null,null,null,null,null,null,"No","N/A","N/A","N/A","N/A","N/A","N/A","N/A","N/A","N/A","N/A","N/A","N/A","N/A","N/A","N/A","N/A","N/A","N/A"]
[null,null,null,null,null,null,null,null,null,null,null,null,null,null,null,null,null,null,null,null,null,null,null,null,null,null,null,null,null,null,null,null,null,null,null,null,null,null,null,null,null,null,null,null,null,null,null,null,null,null,null,null,null,"DK/not sure/missing","N/A","N/A","N/A","N/A","N/A","N/A","N/A","N/A","N/A","N/A","N/A","N/A","N/A","N/A","N/A","N/A","N/A","N/A"]
[null,null,null,null,null,null,null,null,null,null,null,null,null,null,null,null,null,null,null,null,null,null,null,null,null,null,null,null,null,null,null,null,null,null,null,null,null,null,null,null,null,null,null,null,null,null,null,null,null,null,null,null,"Participation in (all) activities during menstruation","Yes","N/A","N/A","N/A","N/A","N/A","N/A","N/A","N/A","N/A","N/A","N/A","N/A","N/A","N/A","N/A","N/A","N/A","N/A"]
[null,null,null,null,null,null,null,null,null,null,null,null,null,null,null,null,null,null,null,null,null,null,null,null,null,null,null,null,null,null,null,null,null,null,null,null,null,null,null,null,null,null,null,null,null,null,null,null,null,null,null,null,null,"No","N/A","N/A","N/A","N/A","N/A","N/A","N/A","N/A","N/A","N/A","N/A","N/A","N/A","N/A","N/A","N/A","N/A","N/A"]
[null,null,null,null,null,null,null,null,null,null,null,null,null,null,null,null,null,null,null,null,null,null,null,null,null,null,null,null,null,null,null,null,null,null,null,null,null,null,null,null,null,null,null,null,null,null,null,null,null,null,null,null,null,"DK/not sure/missing/no such activity","N/A","N/A","N/A","N/A","N/A","N/A","N/A","N/A","N/A","N/A","N/A","N/A","N/A","N/A","N/A","N/A","N/A","N/A"]
[null,null,null,null,null,null,null,null,null,null,null,null,null,null,null,null,null,null,null,null,null,null,null,null,null,null,null,null,null,null,null,null,null,null,null,null,null,null,null,null,null,null,null,null,null,null,null,null,null,null,null,null,"Participation in specific activities during menstruation","Did not go to school (amongst those usually attending school)","N/A","N/A","N/A","N/A","N/A","N/A","N/A","N/A","N/A","N/A","N/A","N/A","N/A","N/A","N/A","N/A","N/A","N/A"]
[null,null,null,null,null,null,null,null,null,null,null,null,null,null,null,null,null,null,null,null,null,null,null,null,null,null,null,null,null,null,null,null,null,null,null,null,null,null,null,null,null,null,null,null,null,null,null,null,null,null,null,null,null,"Did not go to work (amongst those who usually work)","N/A","N/A","N/A","N/A","N/A","N/A","N/A","N/A","N/A","N/A","N/A","N/A","N/A","N/A","N/A","N/A","N/A","N/A"]
[null,null,null,null,null,null,null,null,null,null,null,null,null,null,null,null,null,null,null,null,null,null,null,null,null,null,null,null,null,null,null,null,null,null,null,null,null,null,null,null,null,null,null,null,null,null,null,null,null,null,null,null,null,"Did not participate in social activities","N/A","N/A","N/A","N/A","N/A","N/A","N/A","N/A","N/A","N/A","N/A","N/A","N/A","N/A","N/A","N/A","N/A","N/A"]
[null,null,null,null,null,null,null,null,null,null,null,null,null,null,null,null,null,null,null,null,null,null,null,null,null,null,null,null,null,null,null,null,null,null,null,null,null,null,null,null,null,null,null,null,null,null,null,null,null,null,null,null,null,"Did not cook food","N/A","N/A","N/A","N/A","N/A","N/A","N/A","N/A","N/A","N/A","N/A","N/A","N/A","N/A","N/A","N/A","N/A","N/A"]
[null,null,null,null,null,null,null,null,null,null,null,null,null,null,null,null,null,null,null,null,null,null,null,null,null,null,null,null,null,null,null,null,null,null,null,null,null,null,null,null,null,null,null,null,null,null,null,null,null,null,null,null,null,"Did not eat with others","N/A","N/A","N/A","N/A","N/A","N/A","N/A","N/A","N/A","N/A","N/A","N/A","N/A","N/A","N/A","N/A","N/A","N/A"]
[null,null,null,null,null,null,null,null,null,null,null,null,null,null,null,null,null,null,null,null,null,null,null,null,null,null,null,null,null,null,null,null,null,null,null,null,null,null,null,null,null,null,null,null,null,null,null,null,null,null,null,null,null,"Did not bathe in regular place","N/A","N/A","N/A","N/A","N/A","N/A","N/A","N/A","N/A","N/A","N/A","N/A","N/A","N/A","N/A","N/A","N/A","N/A"]
[null,null,null,null,null,null,null,null,null,null,null,null,null,null,null,null,null,null,null,null,null,null,null,null,null,null,null,null,null,null,null,null,null,null,null,null,null,null,null,null,null,null,null,null,null,null,null,null,null,null,null,null,null,"Did not participate in other activities","N/A","N/A","N/A","N/A","N/A","N/A","N/A","N/A","N/A","N/A","N/A","N/A","N/A","N/A","N/A","N/A","N/A","N/A"]
[null,null,null,null,null,null,null,null,null,null,null,null,null,null,null,null,null,null,null,null,null,null,null,null,null,null,null,null,null,null,null,null,null,null,null,null,null,null,null,null,null,null,null,null,null,null,null,null,null,null,null,null,null,"DK/not sure/missing/no such activity","N/A","N/A","N/A","N/A","N/A","N/A","N/A","N/A","N/A","N/A","N/A","N/A","N/A","N/A","N/A","N/A","N/A","N/A"]
[]
[]
[]
[]
[]
[]
[]
[]
[]
[]
[]
[]
[]
[]
[]
[]
[]
[]
[]
[]
[]
[]
[]
[]
[]
[]
[]
[]
[]
[]
[]
[]
[]
[]
[]
[]
[]
[]
[]
[]
[]
[]
[]
[]
[]
[]
[]
[]
[]
[]
[]
[]
[]
[]
[null,null,null,null,null,null,null,null,null,null,null,null,null,null,null,null,null,null,null,null,null,null,null,null,null,null,null,null,null,null,null,null,null,null,null,null,null,null,null,null,null,null,null,null,null,null,null,null,null,null,null,null,"Raw numbers of respondents:","Basic water, sanitation and hygiene","NATIONAL wealth index quintile",null,null,null,null,"URBAN wealth index quintile",null,null,null,null,"RURAL wealth index quintile",null,null,null,null,"SUB-REGIONS:"]
[null,null,null,null,null,null,null,null,null,null,null,null,null,null,null,null,null,null,null,null,null,null,null,null,null,null,null,null,null,null,null,null,null,null,null,null,null,null,null,null,null,null,null,null,null,null,null,null,null,null,null,null,"WatSan data, raw numbers (weighted)",null,"Poorest","Poor","Middle","Rich","Richest","Poorest","Poor","Middle","Rich","Richest","Poorest","Poor","Middle","Rich","Richest","Mohéli","Ndzouani","Ngazidja"]
[null,null,null,null,null,null,null,null,null,null,null,null,null,null,null,null,null,null,null,null,null,null,null,null,null,null,null,null,null,null,null,null,null,null,null,null,null,null,null,null,null,null,null,null,null,null,null,null,null,null,null,null,"Use of Basic Water Sanitation and Hygiene","Yes","N/A","N/A","N/A","N/A","N/A","N/A","N/A","N/A","N/A","N/A","N/A","N/A","N/A","N/A","N/A","N/A","N/A","N/A"]
[null,null,null,null,null,null,null,null,null,null,null,null,null,null,null,null,null,null,null,null,null,null,null,null,null,null,null,null,null,null,null,null,null,null,null,null,null,null,null,null,null,null,null,null,null,null,null,null,null,null,null,null,null,"No","N/A","N/A","N/A","N/A","N/A","N/A","N/A","N/A","N/A","N/A","N/A","N/A","N/A","N/A","N/A","N/A","N/A","N/A"]
[null,null,null,null,null,null,null,null,null,null,null,null,null,null,null,null,null,null,null,null,null,null,null,null,null,null,null,null,null,null,null,null,null,null,null,null,null,null,null,null,null,null,null,null,null,null,null,null,null,null,null,null,"Use of Basic Water and Sanitation","Yes","N/A","N/A","N/A","N/A","N/A","N/A","N/A","N/A","N/A","N/A","N/A","N/A","N/A","N/A","N/A","N/A","N/A","N/A"]
[null,null,null,null,null,null,null,null,null,null,null,null,null,null,null,null,null,null,null,null,null,null,null,null,null,null,null,null,null,null,null,null,null,null,null,null,null,null,null,null,null,null,null,null,null,null,null,null,null,null,null,null,null,"No","N/A","N/A","N/A","N/A","N/A","N/A","N/A","N/A","N/A","N/A","N/A","N/A","N/A","N/A","N/A","N/A","N/A","N/A"]
[null,null,null,null,null,null,null,null,null,null,null,null,null,null,null,null,null,null,null,null,null,null,null,null,null,null,null,null,null,null,null,null,null,null,null,null,null,null,null,null,null,null,null,null,null,null,null,null,null,null,null,null,"Use of Basic Water and Hygiene","Yes","N/A","N/A","N/A","N/A","N/A","N/A","N/A","N/A","N/A","N/A","N/A","N/A","N/A","N/A","N/A","N/A","N/A","N/A"]
[null,null,null,null,null,null,null,null,null,null,null,null,null,null,null,null,null,null,null,null,null,null,null,null,null,null,null,null,null,null,null,null,null,null,null,null,null,null,null,null,null,null,null,null,null,null,null,null,null,null,null,null,null,"No","N/A","N/A","N/A","N/A","N/A","N/A","N/A","N/A","N/A","N/A","N/A","N/A","N/A","N/A","N/A","N/A","N/A","N/A"]
[null,null,null,null,null,null,null,null,null,null,null,null,null,null,null,null,null,null,null,null,null,null,null,null,null,null,null,null,null,null,null,null,null,null,null,null,null,null,null,null,null,null,null,null,null,null,null,null,null,null,null,null,"Use of Basic Sanitation and Hygiene","Yes","N/A","N/A","N/A","N/A","N/A","N/A","N/A","N/A","N/A","N/A","N/A","N/A","N/A","N/A","N/A","N/A","N/A","N/A"]
[null,null,null,null,null,null,null,null,null,null,null,null,null,null,null,null,null,null,null,null,null,null,null,null,null,null,null,null,null,null,null,null,null,null,null,null,null,null,null,null,null,null,null,null,null,null,null,null,null,null,null,null,null,"No","N/A","N/A","N/A","N/A","N/A","N/A","N/A","N/A","N/A","N/A","N/A","N/A","N/A","N/A","N/A","N/A","N/A","N/A"]
[null,null,null,null,null,null,null,null,null,null,null,null,null,null,null,null,null,null,null,null,null,null,null,null,null,null,null,null,null,null,null,null,null,null,null,null,null,null,null,null,null,null,null,null,null,null,null,null,null,null,null,null,"Use of Basic Water","Yes","N/A","N/A","N/A","N/A","N/A","N/A","N/A","N/A","N/A","N/A","N/A","N/A","N/A","N/A","N/A","N/A","N/A","N/A"]
[null,null,null,null,null,null,null,null,null,null,null,null,null,null,null,null,null,null,null,null,null,null,null,null,null,null,null,null,null,null,null,null,null,null,null,null,null,null,null,null,null,null,null,null,null,null,null,null,null,null,null,null,null,"No","N/A","N/A","N/A","N/A","N/A","N/A","N/A","N/A","N/A","N/A","N/A","N/A","N/A","N/A","N/A","N/A","N/A","N/A"]
[null,null,null,null,null,null,null,null,null,null,null,null,null,null,null,null,null,null,null,null,null,null,null,null,null,null,null,null,null,null,null,null,null,null,null,null,null,null,null,null,null,null,null,null,null,null,null,null,null,null,null,null,"Use of Basic Sanitation","Yes","N/A","N/A","N/A","N/A","N/A","N/A","N/A","N/A","N/A","N/A","N/A","N/A","N/A","N/A","N/A","N/A","N/A","N/A"]
[null,null,null,null,null,null,null,null,null,null,null,null,null,null,null,null,null,null,null,null,null,null,null,null,null,null,null,null,null,null,null,null,null,null,null,null,null,null,null,null,null,null,null,null,null,null,null,null,null,null,null,null,null,"No","N/A","N/A","N/A","N/A","N/A","N/A","N/A","N/A","N/A","N/A","N/A","N/A","N/A","N/A","N/A","N/A","N/A","N/A"]
[null,null,null,null,null,null,null,null,null,null,null,null,null,null,null,null,null,null,null,null,null,null,null,null,null,null,null,null,null,null,null,null,null,null,null,null,null,null,null,null,null,null,null,null,null,null,null,null,null,null,null,null,"Access to Basic Hygiene","Yes","N/A","N/A","N/A","N/A","N/A","N/A","N/A","N/A","N/A","N/A","N/A","N/A","N/A","N/A","N/A","N/A","N/A","N/A"]
[null,null,null,null,null,null,null,null,null,null,null,null,null,null,null,null,null,null,null,null,null,null,null,null,null,null,null,null,null,null,null,null,null,null,null,null,null,null,null,null,null,null,null,null,null,null,null,null,null,null,null,null,null,"No","N/A","N/A","N/A","N/A","N/A","N/A","N/A","N/A","N/A","N/A","N/A","N/A","N/A","N/A","N/A","N/A","N/A","N/A"]
[]
[]
[]
[]
[]
[]
[]
[]
[]
[]
[]
[]
[]
[]
[]
[]
[]
[]
[]
[]
[]
[]
[]
[]
[]
[]
[]
[]
[]
[]
[]
[]
[]
[]
[]
[]
[]
[]
[]
[]
[]
[]
[]
[]
[null,null,"INITIAL (national) Wealth Index",null,null,null,null,"URBAN Wealth Index",null,null,null,null,"RURAL Wealth Index"]
[null,null,"Component Matrix",null,null,null,null,"Component Matrix",null,null,null,null,"Component Matrix"]
[null,null,null,null,"Component",null,null,null,null,"Component",null,null,null,null,"Component"]
[null,"Note:\n\nThe INITIAL (national) Wealth Index is based on the first component of the Principal Component Analysis (PCA) which has been obtained at national level.\n\nThe final national-level (NATIONAL) Wealth Index is based on the URBAN and RURAL specific wealth indexes. Regression procedures are used to establish the relationships between the two sets of scores (urban and rural) and the initial (national) wealth factors.\nThis allows best use of the available information for each area and a better precision of the FINAL (NATIONAL) Wealth Index.\n\nFor dependency reasons, all WASH variables (contained in the generic MICS and DHS scripts) have been excluded from the sets of asset variables used in the PCAs.\n\nThe PCA can extracts as many components as there are asset variables in the input. Only the first of the components is used to represent the Wealth Index. \n\nThe scores represent the weights of the asset variables on the Wealth Index (correlations between the variables and the component).\n\nThe communalities are the proportion of each variable's variance that can be explained by the component.\n\nProportion of explained variance is the part of the model's total variance that is explained by the component.\n\nFor more information on the procedure used:\n\nThe DHS Wealth Index, DHS Comparative Reports No. 6, Shea Oscar Rutstein, Kiersten Johnson, ORC Macro International Inc., 2004.\n\nThe DHS Wealth Index: Approaches for Rural and Urban Areas, Shea O. Rutstein, ORC Macro International Inc., 2008.\n\nMICS Methodological Paper No. 4, Review of options for reporting water, sanitation and hygiene coverage by wealth quintile, UNICEF, 2016.",null,null,"1",null,null,null,null,"1",null,null,null,null,"1"]
[null,null,"Has television",null,0.66878118375128393,null,null,"roof35",null,0.66265308036994608,null,null,"Has electricity",null,0.67987394763038533]
[null,null,"Has electricity",null,0.66660153239310516,null,null,"floor33",null,0.60413866835726571,null,null,"Has television",null,0.66815437012650358]
[null,null,"Has refrigerator",null,0.64144566491691646,null,null,"Has refrigerator",null,0.60369058000915887,null,null,"roof35",null,0.63551175358209777]
[null,null,"roof35",null,0.61780101533133935,null,null,"Has television",null,0.58399009127116752,null,null,"Has refrigerator",null,0.62751619348795851]
[null,null,"Has radio",null,0.56599091773189936,null,null,"Has electricity",null,0.57018664860707036,null,null,"floor11",null,-0.57512401148655268]
[null,null,"floor33",null,0.56353012384632839,null,null,"fuel8",null,-0.54013019418134667,null,null,"Has radio",null,0.5427343308039474]
[null,null,"Has bank account",null,0.55584997511864753,null,null,"floor11",null,-0.53768923063931351,null,null,"Has mobile telephone",null,0.53770617282495436]
[null,null,"fuel8",null,-0.5422072773164921,null,null,"Has radio",null,0.52475164252414774,null,null,"Has bank account",null,0.52656510528826006]
[null,null,"floor11",null,-0.53871364517638443,null,null,"Has telephone (land-line)",null,0.50379004805917726,null,null,"floor33",null,0.48595453646052617]
[null,null,"Has mobile telephone",null,0.53257836674351167,null,null,"Household cooks in owm house",null,0.4927523462471613,null,null,"Has telephone (land-line)",null,0.46274719786546342]
[null,null,"Has telephone (land-line)",null,0.49944096650564296,null,null,"Has bank account",null,0.49139895596941235,null,null,"Has car/truck",null,0.42909315714096519]
[null,null,"Has watch",null,0.45228479264205218,null,null,"roof12",null,-0.48674966093061772,null,null,"wall31",null,0.4058553468493527]
[null,null,"Has car/truck",null,0.43101142046820456,null,null,"Has watch",null,0.43273144115233458,null,null,"Has watch",null,0.39901731586563766]
[null,null,"wall31",null,0.40806560464621933,null,null,"wall31",null,0.41790488007291871,null,null,"fuel8",null,-0.38788149818350304]
[null,null,"Household cooks in owm house",null,0.40624167594600791,null,null,"Has car/truck",null,0.40954951096308062,null,null,"roof31",null,-0.3779001347629809]
[null,null,"fuel5",null,0.39230441402053368,null,null,"Has mobile telephone",null,0.40806305104164714,null,null,"roof12",null,-0.36021706894162081]
[null,null,"roof12",null,-0.38056473807907426,null,null,"wall14",null,-0.34143718592716421,null,null,"Household cooks in owm house",null,0.33050465376783927]
[null,null,"roof31",null,-0.35024779373109732,null,null,"roof31",null,-0.33525481430278081,null,null,"wall33",null,0.32051371436349757]
[null,null,"Persons per rooms",null,-0.3198428213263308,null,null,"Persons per rooms",null,-0.32759438657608703,null,null,"fuel5",null,0.31614299771045135]
[null,null,"wall14",null,-0.28209835078426088,null,null,"Household cooks in other house",null,-0.3224623776989663,null,null,"Persons per rooms",null,-0.3025967837587053]
[null,null,"Household cooks in other house",null,-0.25011878948340954,null,null,"fuel5",null,0.29762757518241129,null,null,"wall14",null,-0.26749746600805635]
[null,null,"wall12",null,-0.24805152194770819,null,null,"wall11",null,-0.29228605821033526,null,null,"wall12",null,-0.26429937446545326]
[null,null,"wall34",null,0.24729208816246109,null,null,"wall37",null,-0.24996860282093736,null,null,"floor34",null,0.25886466480521203]
[null,null,"wall33",null,0.24529551865953209,null,null,"wall34",null,0.24909771568121145,null,null,"Has bicycle",null,0.22659260647862919]
[null,null,"Has bicycle",null,0.23329142253967813,null,null,"wall12",null,-0.2428705544449424,null,null,"wall37",null,-0.21674410308490097]
[null,null,"fuel4",null,0.21726952083948678,null,null,"fuel4",null,0.23535491733697372,null,null,"wall34",null,0.20220844509516256]
[null,null,"wall37",null,-0.21680895530517835,null,null,"wall33",null,0.23006611932498786,null,null,"Household cooks in other house",null,-0.19596638749396153]
[null,null,"wall11",null,-0.20433284309730282,null,null,"fuel2",null,0.22264420100507315,null,null,"wall11",null,-0.18613062141853318]
[null,null,"fuel3",null,0.20347453681477487,null,null,"fuel3",null,0.21134669873121062,null,null,"Has motorcycle/scooter",null,0.18106444476896796]
[null,null,"fuel2",null,0.20059659607388577,null,null,"anima2",null,-0.20589471563720163,null,null,"fuel3",null,0.17554141792741929]
[null,null,"Has motorcycle/scooter",null,0.19095620544172676,null,null,"Has bicycle",null,0.2035773360542954,null,null,"floor35",null,0.17029705096337247]
[null,null,"floor34",null,0.13772958202221972,null,null,"anima1",null,-0.18447661886746905,null,null,"floor12",null,-0.16396594874456535]
[null,null,"Household cooks outside house",null,-0.13269437479971957,null,null,"Household cooks outside house",null,-0.15904694588553256,null,null,"fuel4",null,0.15737681201794129]
[null,null,"floor12",null,-0.13168952878098253,null,null,"wall13",null,-0.15022902496603788,null,null,"anima1",null,-0.15698141648306163]
[null,null,"wall36",null,-0.12595036030429385,null,null,"roof11",null,-0.1427323934952742,null,null,"fuel2",null,0.14875075277318764]
[null,null,"wall13",null,-0.11924570584296512,null,null,"Has motorcycle/scooter",null,0.13547116546183396,null,null,"wall36",null,-0.13135810124092134]
[null,null,"fuel1",null,0.11908009973667867,null,null,"anima6",null,-0.13514875698805548,null,null,"fuel1",null,0.12184816389915663]
[null,null,"wall21",null,-0.10773772249045335,null,null,"fuel1",null,0.11364524782577567,null,null,"wall21",null,-0.11980203434170797]
[null,null,"floor21",null,-9.263318966847929E-2,null,null,"anima4",null,-0.10696371069620984,null,null,"floor21",null,-0.10873206288597299]
[null,null,"floor35",null,8.7943678923851215E-2,null,null,"floor21",null,-9.8211326281937419E-2,null,null,"Household cooks outside house",null,-0.10736515546879803]
[null,null,"roof22",null,-8.4501696220246239E-2,null,null,"wall36",null,-9.1248201051773351E-2,null,null,"wall13",null,-0.10629344817272443]
[null,null,"Has boat with a motor",null,8.3961325994362401E-2,null,null,"floor12",null,-9.0786934219490398E-2,null,null,"roof22",null,-9.9757919257007679E-2]
[null,null,"Has animal-drawn cart",null,7.2150204672745161E-2,null,null,"Has animal-drawn cart",null,8.7028412646070127E-2,null,null,"anima6",null,-8.4493747470065078E-2]
[null,null,"fuel7",null,6.9602102691079512E-2,null,null,"fuel9",null,-8.305590051498099E-2,null,null,"Has boat with a motor",null,8.3440746993569473E-2]
[null,null,"wall26",null,-6.2529566720175414E-2,null,null,"fuel7",null,7.8812419030253766E-2,null,null,"anima2",null,-8.2339724275594911E-2]
[null,null,"roof11",null,-6.249948634461195E-2,null,null,"Has boat with a motor",null,7.013934143377186E-2,null,null,"roof24",null,8.0793414506622252E-2]
[null,null,"floor22",null,-5.9373245272163408E-2,null,null,"anima5",null,-6.6504827389765375E-2,null,null,"wall26",null,-7.4401289405980869E-2]
[null,null,"roof24",null,5.9071092799315265E-2,null,null,"anima3",null,-5.7065348150852534E-2,null,null,"floor22",null,-7.4364817948201406E-2]
[null,null,"wall23",null,-4.3185132064044396E-2,null,null,"fuel95",null,-5.1904263733344246E-2,null,null,"anima5",null,-5.895689039366387E-2]
[null,null,"roof36",null,3.8472716074500854E-2,null,null,"Household owns: agricultural land",null,-5.070484881593966E-2,null,null,"wall23",null,-4.9499294045017593E-2]
[null,null,"fuel6",null,3.7662422045539462E-2,null,null,"roof24",null,4.8088408301456304E-2,null,null,"fuel7",null,4.8620143496053335E-2]
[null,null,"wall25",null,-3.6707503478517027E-2,null,null,"roof36",null,4.4049320336740423E-2,null,null,"roof21",null,-4.1920875836390092E-2]
[null,null,"roof21",null,-3.6539172143006365E-2,null,null,"wall96",null,-4.2783630685252677E-2,null,null,"Has animal-drawn cart",null,4.0455781361088329E-2]
[null,null,"fuel9",null,-3.1884521222589737E-2,null,null,"floor35",null,4.1353034300168665E-2,null,null,"fuel6",null,3.0492410549106244E-2]
[null,null,"roof32",null,-2.721950160483818E-2,null,null,"fuel6",null,4.123749963217245E-2,null,null,"roof11",null,-2.6787348304099109E-2]
[null,null,"wall96",null,-2.136878168260305E-2,null,null,"floor22",null,-3.867683677576924E-2,null,null,"roof34",null,2.6273935067808715E-2]
[null,null,"fuel95",null,-2.0896627732325791E-2,null,null,"wall25",null,-3.7408965506017612E-2,null,null,"wall25",null,-2.3236986792186873E-2]
[null,null,"wall22",null,-1.8739867730722122E-2,null,null,"roof33",null,3.3760162741441779E-2,null,null,"anima3",null,2.1394784290758667E-2]
[null,null,"wall24",null,-1.8264594807785133E-2,null,null,"roof23",null,-2.6510776690329106E-2,null,null,"roof96",null,1.9424319382853144E-2]
[null,null,"roof34",null,1.6444124854147705E-2,null,null,"floor34",null,2.4143119948762677E-2,null,null,"Household owns: agricultural land",null,1.6471315846044252E-2]
[null,null,"floor96",null,-1.6134866032474843E-2,null,null,"roof22",null,-2.317940351548459E-2,null,null,"roof23",null,-1.5683310056438162E-2]
[null,null,"roof33",null,1.5871285842285469E-2,null,null,"wall26",null,-2.2873474680218824E-2,null,null,"roof36",null,1.4827408663261423E-2]
[null,null,"wall32",null,-1.2525664058244516E-2,null,null,"roof13",null,-2.1214961242102173E-2,null,null,"roof32",null,-1.4662259180458248E-2]
[null,null,"roof23",null,-1.184141621855595E-2,null,null,"wall21",null,-2.1182007170426644E-2,null,null,"wall24",null,-1.2456593367321319E-2]
[null,null,"roof13",null,-8.0220057911716668E-3,null,null,"roof34",null,1.9629149056968054E-2,null,null,"fuel95",null,1.0231665354967296E-2]
[null,null,"fuel11",null,-6.9438500622070196E-3,null,null,"roof96",null,-1.8181052604233656E-2,null,null,"roof33",null,9.9879029773278435E-3]
[null,null,"roof96",null,-6.4410163543526877E-3,null,null,"wall24",null,-1.7859494480623184E-2,null,null,"wall22",null,-9.147398383251102E-3]
[null,null,"floor31",null,3.6587771911699512E-3,null,null,"roof32",null,-1.7070841987275452E-2,null,null,"wall35",null,7.6421167405612443E-3]
[null,null,"wall35",null,-2.9114664877907619E-3,null,null,"wall22",null,1.6785508345714368E-2,null,null,"floor96",null,-6.5483036571294274E-3]
[null,null,null,null,null,null,null,"floor31",null,8.033351632009314E-3,null,null,"roof13",null,4.4040793970030849E-3]
[null,null,null,null,null,null,null,"wall32",null,-5.1205250924534233E-4,null,null,"anima4",null,-3.9492583579590849E-3]
[null,null,null,null,null,null,null,"floor96",null,-2.7286316075074624E-4,null,null,"floor31",null,3.6511072534380902E-3]
[null,null,"Communalities",null,null,null,null,null,null,null,null,null,"fuel11",null,3.4985975218829392E-3]
[null,null,null,null,"Extraction",null,null,null,null,null,null,null,"wall32",null,2.8472525033030262E-3]
[null,null,"Persons per rooms",null,0.10229943035398717,null,null,null,null,null,null,null,"fuel9",null,4.169865561485486E-4]
[null,null,"floor11",null,0.2902123914992274,null,null,"Communalities",null,null,null,null,"wall96",null,-1.9601212753549393E-4]
[null,null,"floor12",null,1.7342131990557227E-2,null,null,null,null,"Extraction"]
[null,null,"floor21",null,8.5809078281564588E-3,null,null,"Persons per rooms",null,0.10731808211616274]
[null,null,"floor22",null,3.5251822541484744E-3,null,null,"floor11",null,0.28910970874549685]
[null,null,"floor31",null,1.3386650534625477E-5,null,null,"floor12",null,8.2422674249740761E-3,null,null,"Communalities"]
[null,null,"floor33",null,0.3175662004822582,null,null,"floor21",null,9.6454646100571709E-3,null,null,null,null,"Extraction"]
[null,null,"floor34",null,1.896943776401535E-2,null,null,"floor22",null,1.495897702979496E-3,null,null,"Persons per rooms",null,9.156481354111265E-2]
[null,null,"floor35",null,7.7340906626614326E-3,null,null,"floor31",null,6.4534738443506703E-5,null,null,"floor11",null,0.33076762858838438]
[null,null,"floor96",null,2.6033390188591048E-4,null,null,"floor33",null,0.36498353060449029,null,null,"floor12",null,2.6884832347705431E-2]
[null,null,"wall11",null,4.1751910768226971E-2,null,null,"floor34",null,5.8289024086034238E-4,null,null,"floor21",null,1.1822661499439186E-2]
[null,null,"wall12",null,6.1529557540574355E-2,null,null,"floor35",null,1.7100734458309261E-3,null,null,"floor22",null,5.5301261484691378E-3]
[null,null,"wall13",null,1.4219538361986967E-2,null,null,"floor96",null,7.4454304494887579E-8,null,null,"floor31",null,1.3330584176108235E-5]
[null,null,"wall14",null,7.9579479515199905E-2,null,null,"wall11",null,8.5431139824135499E-2,null,null,"floor33",null,0.23615181150656486]
[null,null,"wall21",null,1.1607416847429938E-2,null,null,"wall12",null,5.8986106216393733E-2,null,null,"floor34",null,6.7010914684714776E-2]
[null,null,"wall22",null,3.5118264256496029E-4,null,null,"wall13",null,2.2568759942246431E-2,null,null,"floor35",null,2.9001085566821481E-2]
[null,null,"wall23",null,1.8649556313889554E-3,null,null,"wall14",null,0.1165793519338609,null,null,"floor96",null,4.2880280785974634E-5]
[null,null,"wall24",null,3.3359542349257164E-4,null,null,"wall21",null,4.4867742776800578E-4,null,null,"wall11",null,3.4644608229649321E-2]
[null,null,"wall25",null,1.3474408116253397E-3,null,null,"wall22",null,2.8175329042404672E-4,null,null,"wall12",null,6.9854159342829888E-2]
[null,null,"wall26",null,3.9099467142128686E-3,null,null,"wall24",null,3.1896154310340994E-4,null,null,"wall13",null,1.1298297124447654E-2]
[null,null,"wall31",null,0.16651753769528457,null,null,"wall25",null,1.3994307002304154E-3,null,null,"wall14",null,7.1554894320731269E-2]
[null,null,"wall32",null,1.5689226009999848E-4,null,null,"wall26",null,5.2319584394661166E-4,null,null,"wall21",null,1.4352527432411775E-2]
[null,null,"wall33",null,6.0169891474448851E-2,null,null,"wall31",null,0.17464448878876057,null,null,"wall22",null,8.3674897181904872E-5]
[null,null,"wall34",null,6.1153376867750429E-2,null,null,"wall32",null,2.6219777222445137E-7,null,null,"wall23",null,2.4501801109551142E-3]
[null,null,"wall35",null,8.476637109528674E-6,null,null,"wall33",null,5.2930419261259548E-2,null,null,"wall24",null,1.5516671831879348E-4]
[null,null,"wall36",null,1.5863493260781441E-2,null,null,"wall34",null,6.2049671957597655E-2,null,null,"wall25",null,5.3995755518026719E-4]
[null,null,"wall37",null,4.7006123100522823E-2,null,null,"wall36",null,8.326234195184851E-3,null,null,"wall26",null,5.5355518652725208E-3]
[null,null,"wall96",null,4.5662483059875165E-4,null,null,"wall37",null,6.248430239625153E-2,null,null,"wall31",null,0.1647185625662084]
[null,null,"roof11",null,3.9061857933403357E-3,null,null,"wall96",null,1.8304390546120945E-3,null,null,"wall32",null,8.1068468175653495E-6]
[null,null,"roof12",null,0.1448295198691944,null,null,"roof11",null,2.0372536152889791E-2,null,null,"wall33",null,0.10272904109508571]
[null,null,"roof13",null,6.4352576913591765E-5,null,null,"roof12",null,0.23692523241607133,null,null,"wall34",null,4.0888255267803368E-2]
[null,null,"roof21",null,1.3351111008962524E-3,null,null,"roof13",null,4.5007458050389735E-4,null,null,"wall35",null,5.8401948276366419E-5]
[null,null,"roof22",null,7.1405366640987771E-3,null,null,"roof22",null,5.3728474733365933E-4,null,null,"wall36",null,1.725495076162014E-2]
[null,null,"roof23",null,1.402191380610799E-4,null,null,"roof23",null,7.028212807244971E-4,null,null,"wall37",null,4.6978006222078178E-2]
[null,null,"roof24",null,3.4893940045053157E-3,null,null,"roof24",null,2.3124950129675714E-3,null,null,"wall96",null,3.8420754140990736E-8]
[null,null,"roof31",null,0.12267351701350129,null,null,"roof31",null,0.11239579051319204,null,null,"roof11",null,7.1756202916512142E-4]
[null,null,"roof32",null,7.4090126761578823E-4,null,null,"roof32",null,2.914136461545265E-4,null,null,"roof12",null,0.12975633675689241]
[null,null,"roof33",null,2.518977142875312E-4,null,null,"roof33",null,1.1397485883286337E-3,null,null,"roof13",null,1.9395915335107057E-5]
[null,null,"roof34",null,2.7040924221879829E-4,null,null,"roof34",null,3.8530349270066985E-4,null,null,"roof21",null,1.7573598308900347E-3]
[null,null,"roof35",null,0.3816780945444338,null,null,"roof35",null,0.43910910492377819,null,null,"roof22",null,9.9516424544876629E-3]
[null,null,"roof36",null,1.4801498821491565E-3,null,null,"roof36",null,1.9403426221287735E-3,null,null,"roof23",null,2.4596621432637438E-4]
[null,null,"roof96",null,4.1486691677038787E-5,null,null,"roof96",null,3.3055067379791138E-4,null,null,"roof24",null,6.5275758276388792E-3]
[null,null,"fuel1",null,1.418007015329734E-2,null,null,"fuel1",null,1.291524235338197E-2,null,null,"roof31",null,0.14280851185387913]
[null,null,"fuel2",null,4.0238994356429685E-2,null,null,"fuel2",null,4.9570440241187418E-2,null,null,"roof32",null,2.1498184427493216E-4]
[null,null,"fuel3",null,4.1401887131987176E-2,null,null,"fuel3",null,4.4667427064581107E-2,null,null,"roof33",null,9.9758205884514396E-5]
[null,null,"fuel4",null,4.7206044685820181E-2,null,null,"fuel4",null,5.5391937114693736E-2,null,null,"roof34",null,6.9031966394742851E-4]
[null,null,"fuel5",null,0.15390275325999431,null,null,"fuel5",null,8.8582173508961887E-2,null,null,"roof35",null,0.40387518894099295]
[null,null,"fuel6",null,1.4184580343363368E-3,null,null,"fuel6",null,1.7005313759134229E-3,null,null,"roof36",null,2.1985204766735992E-4]
[null,null,"fuel7",null,4.8444526990195783E-3,null,null,"fuel7",null,6.2113973934003058E-3,null,null,"roof96",null,3.7730418348708432E-4]
[null,null,"fuel8",null,0.29398873157496336,null,null,"fuel8",null,0.29174062666637923,null,null,"fuel1",null,1.4846975045595737E-2]
[null,null,"fuel9",null,1.0166226935937753E-3,null,null,"fuel9",null,6.8982826103544193E-3,null,null,"fuel2",null,2.2126786450589991E-2]
[null,null,"fuel11",null,4.8217053686412428E-5,null,null,"fuel95",null,2.6940525937005546E-3,null,null,"fuel3",null,3.081478940796888E-2]
[null,null,"fuel95",null,4.3666905058340735E-4,null,null,"Household cooks in owm house",null,0.24280487473208234,null,null,"fuel4",null,2.4767460960930431E-2]
[null,null,"Household cooks in owm house",null,0.16503229927542129,null,null,"Household cooks in other house",null,0.10398198503127079,null,null,"fuel5",null,9.9946395001350441E-2]
[null,null,"Household cooks in other house",null,6.2559408852646145E-2,null,null,"Household cooks outside house",null,2.5295930995515522E-2,null,null,"fuel6",null,9.2978710109524573E-4]
[null,null,"Household cooks outside house",null,1.7607797103488452E-2,null,null,"Household owns: agricultural land",null,2.5709816934472974E-3,null,null,"fuel7",null,2.3639183535768176E-3]
[null,null,"Has electricity",null,0.44435760298883603,null,null,"anima1",null,3.4031622908773436E-2,null,null,"fuel8",null,0.15045205663307887]
[null,null,"Has radio",null,0.32034571895499764,null,null,"anima2",null,4.2392633927324119E-2,null,null,"fuel9",null,1.7387778800862668E-7]
[null,null,"Has television",null,0.44726827173976857,null,null,"anima3",null,3.2564539595780085E-3,null,null,"fuel11",null,1.2240184620125443E-5]
[null,null,"Has refrigerator",null,0.41145254104070506,null,null,"anima4",null,1.1441235405902476E-2,null,null,"fuel95",null,1.0468697593603805E-4]
[null,null,"Has bicycle",null,5.4424887830586646E-2,null,null,"anima5",null,4.4228920661424868E-3,null,null,"Household cooks in owm house",null,0.10923332616219932]
[null,null,"Has motorcycle/scooter",null,3.6464272396702954E-2,null,null,"anima6",null,1.8265186515416476E-2,null,null,"Household cooks in other house",null,3.8402825027433481E-2]
[null,null,"Has car/truck",null,0.18577084457401943,null,null,"Has electricity",null,0.32511281424976274,null,null,"Household cooks outside house",null,1.1527276608839171E-2]
[null,null,"Has telephone (land-line)",null,0.24944127902409077,null,null,"Has radio",null,0.27536428633179094,null,null,"Household owns: agricultural land",null,2.7130424570014848E-4]
[null,null,"Has mobile telephone",null,0.28363971672318639,null,null,"Has television",null,0.34104442670290658,null,null,"anima1",null,2.4643165121028453E-2]
[null,null,"Has watch",null,0.20456153365526414,null,null,"Has refrigerator",null,0.36444231639179464,null,null,"anima2",null,6.7798301937809936E-3]
[null,null,"Has animal-drawn cart",null,5.205652034319018E-3,null,null,"Has bicycle",null,4.144373175496352E-2,null,null,"anima3",null,4.5773679484809385E-4]
[null,null,"Has boat with a motor",null,7.0495042627315959E-3,null,null,"Has motorcycle/scooter",null,1.8352436671587594E-2,null,null,"anima4",null,1.5596641577909687E-5]
[null,null,"Has bank account",null,0.30896919483940111,null,null,"Has car/truck",null,0.16773080193009848,null,null,"anima5",null,3.475914924890495E-3]
[null,null,null,null,null,null,null,"Has telephone (land-line)",null,0.25380441252346814,null,null,"anima6",null,7.1391933615351285E-3]
[null,null,null,null,null,null,null,"Has mobile telephone",null,0.16651545362541792,null,null,"Has electricity",null,0.46222858466652395]
[null,null,"Total Variance Explained",null,null,null,null,"Has watch",null,0.18725650016177642,null,null,"Has radio",null,0.29456055383320862]
[null,null,"Component",null,"Extraction Sums of Squared Loadings",null,null,"Has animal-drawn cart",null,7.5739446076946585E-3,null,null,"Has television",null,0.44643026231914473]
[null,null,null,null,"Total","% of Variance","Cumulative %","Has boat with a motor",null,4.9195272167632262E-3,null,null,"Has refrigerator",null,0.393776573089617]
[null,null,"1",null,5.8052061352635009,8.4133422250195675,8.4133422250195675,"Has bank account",null,0.24147293392782845,null,null,"Has bicycle",null,5.1344209310778911E-2]
[null,null,null,null,null,null,null,null,null,null,null,null,"Has motorcycle/scooter",null,3.2784333159494652E-2]
[null,null,null,null,null,null,null,null,null,null,null,null,"Has car/truck",null,0.18412093750520103]
[null,null,"Component Score Coefficient Matrix",null,null,null,null,"Total Variance Explained",null,null,null,null,"Has telephone (land-line)",null,0.21413496913233834]
[null,null,null,null,"Component",null,null,"Component",null,"Extraction Sums of Squared Loadings",null,null,"Has mobile telephone",null,0.2891279282940597]
[null,null,null,null,"1",null,null,null,null,"Total","% of Variance","Cumulative %","Has watch",null,0.15921481836061804]
[null,null,"Persons per rooms",null,-5.5095859453372018E-2,null,null,"1",null,5.6927179115615791,7.9065526549466369,7.9065526549466369,"Has animal-drawn cart",null,1.6366702455361819E-3]
[null,null,"floor11",null,-9.2798366263686857E-2,null,null,null,null,null,null,null,"Has boat with a motor",null,6.9623582588448727E-3]
[null,null,"floor12",null,-2.2684729140114344E-2,null,null,null,null,null,null,null,"Has bank account",null,0.27727081010723642]
[null,null,"floor21",null,-1.5956916517706848E-2,null,null,"Component Score Coefficient Matrix"]
[null,null,"floor22",null,-1.0227586047548408E-2,null,null,null,null,"Component"]
[null,null,"floor31",null,6.3025792812848624E-4,null,null,null,null,"1",null,null,"Total Variance Explained"]
[null,null,"floor33",null,9.707323232213691E-2,null,null,"Persons per rooms",null,-5.7546218109764728E-2,null,null,"Component",null,"Extraction Sums of Squared Loadings"]
[null,null,"floor34",null,2.3725183708048998E-2,null,null,"floor11",null,-9.4452112153194503E-2,null,null,null,null,"Total","% of Variance","Cumulative %"]
[null,null,"floor35",null,1.5149105281488752E-2,null,null,"floor12",null,-1.5947906716949279E-2,null,null,"1",null,5.441060668599631,7.1592903534205661,7.1592903534205661]
[null,null,"floor96",null,-2.7793786571099037E-3,null,null,"floor21",null,-1.7252097821758551E-2]
[null,null,"wall11",null,-3.519820628867782E-2,null,null,"floor22",null,-6.7940898137985768E-3]
[null,null,"wall12",null,-4.2729149692192457E-2,null,null,"floor31",null,1.4111627796792887E-3,null,null,"Component Score Coefficient Matrix"]
[null,null,"wall13",null,-2.0541166508905112E-2,null,null,"floor33",null,0.10612482082245725,null,null,null,null,"Component"]
[null,null,"wall14",null,-4.8594028224194369E-2,null,null,"floor34",null,4.2410532761037395E-3,null,null,null,null,"1"]
[null,null,"wall21",null,-1.8558810829473343E-2,null,null,"floor35",null,7.2641987434829769E-3,null,null,"Persons per rooms",null,-5.5613565477222439E-2]
[null,null,"wall22",null,-3.2281140917438775E-3,null,null,"floor96",null,-4.793196588866225E-5,null,null,"floor11",null,-0.10570071655432813]
[null,null,"wall23",null,-7.4390350760704209E-3,null,null,"wall11",null,-5.1343850644121891E-2,null,null,"floor12",null,-3.0134923819323148E-2]
[null,null,"wall24",null,-3.1462439717407369E-3,null,null,"wall12",null,-4.2663374194545349E-2,null,null,"floor21",null,-1.9983615237643991E-2]
[null,null,"wall25",null,-6.3232041418027707E-3,null,null,"wall13",null,-2.6389683680080378E-2,null,null,"floor22",null,-1.3667338498421985E-2]
[null,null,"wall26",null,-1.0771291365579935E-2,null,null,"wall14",null,-5.9977885999537246E-2,null,null,"floor31",null,6.7102858722172226E-4]
[null,null,"wall31",null,7.0293043026920354E-2,null,null,"wall21",null,-3.7208952734874173E-3,null,null,"floor33",null,8.9312464252598853E-2]
[null,null,"wall32",null,-2.1576605147847982E-3,null,null,"wall22",null,2.9485930282306758E-3,null,null,"floor34",null,4.7576140126339775E-2]
[null,null,"wall33",null,4.2254402848762578E-2,null,null,"wall24",null,-3.1372526722870963E-3,null,null,"floor35",null,3.1298502504512951E-2]
[null,null,"wall34",null,4.2598330257438199E-2,null,null,"wall25",null,-6.5713717221157529E-3,null,null,"floor96",null,-1.2034976369441526E-3]
[null,null,"wall35",null,-5.0152680541439704E-4,null,null,"wall26",null,-4.0180235584419393E-3,null,null,"wall11",null,-3.4208517926053145E-2]
[null,null,"wall36",null,-2.1696104732476809E-2,null,null,"wall31",null,7.3410431812224203E-2,null,null,"wall12",null,-4.8574972889151066E-2]
[null,null,"wall37",null,-3.7347331042765337E-2,null,null,"wall32",null,-8.994868834188909E-5,null,null,"wall13",null,-1.953542785989211E-2]
[null,null,"wall96",null,-3.6809686313805825E-3,null,null,"wall33",null,4.0414108497759373E-2,null,null,"wall14",null,-4.9162742762966165E-2]
[null,null,"roof11",null,-1.0766109745003062E-2,null,null,"wall34",null,4.3757256121071522E-2,null,null,"wall21",null,-2.2018139777982202E-2]
[null,null,"roof12",null,-6.5555766532965715E-2,null,null,"wall36",null,-1.6028934240084784E-2,null,null,"wall22",null,-1.681179266395751E-3]
[null,null,"roof13",null,-1.3818640723956899E-3,null,null,"wall37",null,-4.3910238783001286E-2,null,null,"wall23",null,-9.0973611690599396E-3]
[null,null,"roof21",null,-6.2942075253883869E-3,null,null,"wall96",null,-7.5155016197731494E-3,null,null,"wall24",null,-2.2893685856524883E-3]
[null,null,"roof22",null,-1.4556192192202088E-2,null,null,"roof11",null,-2.5072802782901464E-2,null,null,"wall25",null,-4.2706722471020321E-3]
[null,null,"roof23",null,-2.0397925487306511E-3,null,null,"roof12",null,-8.5503913682787161E-2,null,null,"wall26",null,-1.3674041503589699E-2]
[null,null,"roof24",null,1.0175537512869729E-2,null,null,"roof13",null,-3.7266840851214174E-3,null,null,"wall31",null,7.459121880252953E-2]
[null,null,"roof31",null,-6.0333394813240238E-2,null,null,"roof22",null,-4.0717639404560281E-3,null,null,"wall32",null,5.2328997537824282E-4]
[null,null,"roof32",null,-4.6888087986220444E-3,null,null,"roof23",null,-4.6569630011856471E-3,null,null,"wall33",null,5.890647685904013E-2]
[null,null,"roof33",null,2.7339745518898898E-3,null,null,"roof24",null,8.4473548572978705E-3,null,null,"wall34",null,3.7163424084224565E-2]
[null,null,"roof34",null,2.8326513255504402E-3,null,null,"roof31",null,-5.8891871951339402E-2,null,null,"wall35",null,1.404527022582915E-3]
[null,null,"roof35",null,0.10642189113294889,null,null,"roof32",null,-2.998715596394749E-3,null,null,"wall36",null,-2.4142002679549069E-2]
[null,null,"roof36",null,6.6272782013372137E-3,null,null,"roof33",null,5.9304120221514659E-3,null,null,"wall37",null,-3.983489916510792E-2]
[null,null,"roof96",null,-1.1095241416539856E-3,null,null,"roof34",null,3.4481155331976647E-3,null,null,"wall96",null,-3.6024617160892947E-5]
[null,null,"fuel1",null,2.0512639338219393E-2,null,null,"roof35",null,0.11640363894092418,null,null,"roof11",null,-4.9231850066824168E-3]
[null,null,"fuel2",null,3.4554603471420156E-2,null,null,"roof36",null,7.7378364818110534E-3,null,null,"roof12",null,-6.6203464890666266E-2]
[null,null,"fuel3",null,3.5050355159445004E-2,null,null,"roof96",null,-3.193738542236388E-3,null,null,"roof13",null,8.0941560207535145E-4]
[null,null,"fuel4",null,3.7426667680186487E-2,null,null,"fuel1",null,1.9963267035411812E-2,null,null,"roof21",null,-7.704541152851966E-3]
[null,null,"fuel5",null,6.757803338584234E-2,null,null,"fuel2",null,3.9110351938025187E-2,null,null,"roof22",null,-1.8334278063229615E-2]
[null,null,"fuel6",null,6.4876976231318523E-3,null,null,"fuel3",null,3.7125798610533244E-2,null,null,"roof23",null,-2.882399409171555E-3]
[null,null,"fuel7",null,1.1989600553248957E-2,null,null,"fuel4",null,4.1343154709805929E-2,null,null,"roof24",null,1.4848835443589366E-2]
[null,null,"fuel8",null,-9.3400176442120605E-2,null,null,"fuel5",null,5.2282157627720663E-2,null,null,"roof31",null,-6.9453394802936705E-2]
[null,null,"fuel9",null,-5.4924012136121124E-3,null,null,"fuel6",null,7.2439035752011318E-3,null,null,"roof32",null,-2.6947428219417156E-3]
[null,null,"fuel11",null,-1.1961418596364512E-3,null,null,"fuel7",null,1.3844427258584219E-2,null,null,"roof33",null,1.8356536685885615E-3]
[null,null,"fuel95",null,-3.5996357830241428E-3,null,null,"fuel8",null,-9.4880899171970831E-2,null,null,"roof34",null,4.8288259712735114E-3]
[null,null,"Household cooks in owm house",null,6.9978854579910349E-2,null,null,"fuel9",null,-1.4589850016333897E-2,null,null,"roof35",null,0.11679924049544917]
[null,null,"Household cooks in other house",null,-4.308525548542929E-2,null,null,"fuel95",null,-9.1176595327039991E-3,null,null,"roof36",null,2.7250952647579212E-3]
[null,null,"Household cooks outside house",null,-2.2857823082917367E-2,null,null,"Household cooks in owm house",null,8.6558363492139648E-2,null,null,"roof96",null,3.569950891183941E-3]
[null,null,"Has electricity",null,0.11482822777710852,null,null,"Household cooks in other house",null,-5.6644713950091206E-2,null,null,"fuel1",null,2.239419321352959E-2]
[null,null,"Has radio",null,9.7497126638416726E-2,null,null,"Household cooks outside house",null,-2.7938666267393549E-2,null,null,"fuel2",null,2.7338558018959142E-2]
[null,null,"Has television",null,0.11520369271450989,null,null,"Household owns: agricultural land",null,-8.9069666903678919E-3,null,null,"fuel3",null,3.2262352621882907E-2]
[null,null,"Has refrigerator",null,0.11049489888403435,null,null,"anima1",null,-3.2405719330094986E-2,null,null,"fuel4",null,2.8923921566646572E-2]
[null,null,"Has bicycle",null,4.0186587194993538E-2,null,null,"anima2",null,-3.616808681474299E-2,null,null,"fuel5",null,5.8103192918783839E-2]
[null,null,"Has motorcycle/scooter",null,3.2893957766937959E-2,null,null,"anima3",null,-1.0024271189506179E-2,null,null,"fuel6",null,5.6041298574518728E-3]
[null,null,"Has car/truck",null,7.4245670252782628E-2,null,null,"anima4",null,-1.8789568068878444E-2,null,null,"fuel7",null,8.9357841158875968E-3]
[null,null,"Has telephone (land-line)",null,8.6033287168186506E-2,null,null,"anima5",null,-1.168243858609223E-2,null,null,"fuel8",null,-7.1287846581451986E-2]
[null,null,"Has mobile telephone",null,9.1741508283122775E-2,null,null,"anima6",null,-2.3740638318574717E-2,null,null,"fuel9",null,7.6636998104979528E-5]
[null,null,"Has watch",null,7.7910203721219415E-2,null,null,"Has electricity",null,0.1001607066194259,null,null,"fuel11",null,6.4299917515593067E-4]
[null,null,"Has animal-drawn cart",null,1.2428534489838616E-2,null,null,"Has radio",null,9.217945639962373E-2,null,null,"fuel95",null,1.8804541941636953E-3]
[null,null,"Has boat with a motor",null,1.4463108464717997E-2,null,null,"Has television",null,0.10258546099484703,null,null,"Household cooks in owm house",null,6.074268858555136E-2]
[null,null,"Has bank account",null,9.5750256264313896E-2,null,null,"Has refrigerator",null,0.10604610827160403,null,null,"Household cooks in other house",null,-3.6016210704079045E-2]
[null,null,null,null,null,null,null,"Has bicycle",null,3.5761008927008599E-2,null,null,"Household cooks outside house",null,-1.9732394473820608E-2]
[null,null,null,null,null,null,null,"Has motorcycle/scooter",null,2.3797273563599539E-2,null,null,"Household owns: agricultural land",null,3.0272251770872985E-3]
[null,null,"Component Score Covariance Matrix",null,null,null,null,"Has car/truck",null,7.1942702471048017E-2,null,null,"anima1",null,-2.8851252732578707E-2]
[null,null,"Component",null,"1",null,null,"Has telephone (land-line)",null,8.8497279486835084E-2,null,null,"anima2",null,-1.5133028152172164E-2]
[null,null,"1",null,1.0000000000000002,null,null,"Has mobile telephone",null,7.168158643745455E-2,null,null,"anima3",null,3.9320980951798607E-3]
[null,null,null,null,null,null,null,"Has watch",null,7.6014910254639897E-2,null,null,"anima4",null,-7.2582509155802292E-4]
[null,null,null,null,null,null,null,"Has animal-drawn cart",null,1.5287673480064851E-2,null,null,"anima5",null,-1.0835551004587059E-2]
[null,null,null,null,null,null,null,"Has boat with a motor",null,1.2320888286300454E-2,null,null,"anima6",null,-1.5528911110599926E-2]
[null,null,null,null,null,null,null,"Has bank account",null,8.6320622873550357E-2,null,null,"Has electricity",null,0.12495246589583882]
[null,null,null,null,null,null,null,null,null,null,null,null,"Has radio",null,9.9747891791772875E-2]
[null,null,null,null,null,null,null,null,null,null,null,null,"Has television",null,0.12279855175709094]
[null,null,null,null,null,null,null,"Component Score Covariance Matrix",null,null,null,null,"Has refrigerator",null,0.11532975493351055]
[null,null,null,null,null,null,null,"Component",null,"1",null,null,"Has bicycle",null,4.1644932905507824E-2]
[null,null,null,null,null,null,null,"1",null,0.99999999999999978,null,null,"Has motorcycle/scooter",null,3.3277416995897716E-2]
[null,null,null,null,null,null,null,null,null,null,null,null,"Has car/truck",null,7.886204239869303E-2]
[null,null,null,null,null,null,null,null,null,null,null,null,"Has telephone (land-line)",null,8.5047240979314598E-2]
[null,null,null,null,null,null,null,null,null,null,null,null,"Has mobile telephone",null,9.8823778225458403E-2]
[null,null,null,null,null,null,null,null,null,null,null,null,"Has watch",null,7.3334472847981128E-2]
[null,null,null,null,null,null,null,null,null,null,null,null,"Has animal-drawn cart",null,7.4352748159120336E-3]
[null,null,null,null,null,null,null,null,null,null,null,null,"Has boat with a motor",null,1.5335382579927136E-2]
[null,null,null,null,null,null,null,null,null,null,null,null,"Has bank account",null,9.6776187100259342E-2]
[]
[]
[null,null,null,null,null,null,null,null,null,null,null,null,"Component Score Covariance Matrix"]
[null,null,null,null,null,null,null,null,null,null,null,null,"Component",null,"1"]
[null,null,null,null,null,null,null,null,null,null,null,null,"1",null,0.99999999999999989]
[]
[]
[]
[]
[]
[]
[]
[]
[]
[]
[]
[]
[]
[]
[]
[]
[]
[]
[]
[]
[]
[]
[]
[]
[]
[]
[]
[]
[]
[]
[]
[]
[]
[]
[]
[]
[]
[]
[]
[]
[]
[]
[]
[]
[]
[]
[]
[]
[]
[]
[]
[]
[]
[]
[]
[]
[]
[]
[]
[]
[]
[]
[]
[]
[]
[]
[]
[]
[]
[]
[]
[]
[]
[]
[]
[]
[]
[]
[]
[]
[]
[]
[]
[]
[]
[]
[]
[]
[]
[]
[]
[]
[]
[]
[]
[]
[]
[]
[]
[]
[]
[]
[]
[]
[]
[]
[]
[]
[]
[]
[]
[]
[]
[]
[]
[]
[]
[]
[]
[]
[]
[]
[]
[]
[]
[]
[]
[]
[]
[]
[]
[]
[]
[]
[]
[]
[]
[]
[]
[]
[]
[]
[]
[]
[]
[]
[]
[]
[]
[]
[]
[]
[]
[]
[]
[]
[]
[]
[]
[]
[]
[]
[]
[]
[]
[]
[]
[]
[]
[]
[]
[]
[]
[]
[]
[]
[]
[]
[]
[]
[]
[]
[]
[]
[]
[]
[]
[]
[]
[]
[]
[]
[]
[]
[]
[]
[]
[]
[]
[]
[]
[]
[]
[]
[]
[]
[]
[]
[]
[]
[]
[]
[]
[]
[]
[]
[]
[]
[]
[]
[]
[]
[]
[]
[]
[]
[]
[]
[]
[]
[]
[]
[]
[]
[]
[]
[]
[]
[]
[]
[]
[]
[]
[]
[]
[]
[]
[]
[]
[]
[]
[]
[]
[]
[]
[]
[]
[]
[]
[]
[]
[]
[]
[]
[]
[]
[]
[]
[]
[]
[]
[]
[]
[]
[]
[]
[]
[]
[]
[]
[]
[]
[]
[]
[]
[]
[]
[]
[]
[]
[]
[]
[]
[]
[]
[]
[]
[]
[]
[]
[]
[]
[]
[]
[]
[]
[]
[]
[]
[]
[]
[]
[]
[]
[]
[]
[]
[]
[]
[]
[]
[]
[]
[]
[]
[]
[]
[]
[]
[]
[]
[]
[]
[]
[]
[]
[]
[]
[]
[]
[]
[]
[]
[]
[]
[]
[]
[]
[]
[]
[]
[]
[]
[]
[]
[]
[]
[]
[]
[]
[]
[]
[]
[]
[]
[]
[]
[]
[]
[]
[]
[]
[]
["DHS12"]
["Comoros",null,"Count"]
["W_text_t","",4482]
["W_text_i","",4482]
["S_text_s","",4482]
["S_text_i","",4482]
["Urban/Rural","Urban",1892]
[null,"Rural",2590]
[null,"Missing",0]
["2012"]
[]
["Sub-national region names","Weighted population"]
[{"$f":"R15","v":"Mohéli"},{"$f":"BR122+BR123","v":1613.0866979999994}]
[{"$f":"S15","v":"Ndzouani"},{"$f":"BS122+BS123","v":11556.648072}]
[{"$f":"T15","v":"Ngazidja"},{"$f":"BT122+BT123","v":11181.996960000011}]
[{"$f":"U15","v":0},{"$f":"BU122+BU123","v":0}]
[{"$f":"V15","v":0},{"$f":"BV122+BV123","v":0}]
[{"$f":"W15","v":0},{"$f":"BW122+BW123","v":0}]
[{"$f":"X15","v":0},{"$f":"BX122+XR123","v":0}]
[{"$f":"Y15","v":0},{"$f":"BY122+BY123","v":0}]
[{"$f":"Z15","v":0},{"$f":"BZ122+BZ123","v":0}]
[{"$f":"AA15","v":0},{"$f":"CA122+CA123","v":0}]
[{"$f":"AB15","v":0},{"$f":"CB122+CB123","v":0}]
[{"$f":"AC15","v":0},{"$f":"CC122+CC123","v":0}]
[{"$f":"AD15","v":0},{"$f":"CD122+CD123","v":0}]
[{"$f":"AE15","v":0},{"$f":"CE122+CE123","v":0}]
[{"$f":"AF15","v":0},{"$f":"CF122+CF123","v":0}]
[{"$f":"AG15","v":0},{"$f":"CG122+CG123","v":0}]
[{"$f":"AH15","v":0},{"$f":"CH122+CH123","v":0}]
[{"$f":"AI15","v":0},{"$f":"CI122+CI123","v":0}]
[{"$f":"AJ15","v":0},{"$f":"CJ122+CJ123","v":0}]
[{"$f":"AK15","v":0},{"$f":"CK122+CK123","v":0}]
[{"$f":"AL15","v":0},{"$f":"CL122+CL123","v":0}]
[{"$f":"AM15","v":0},{"$f":"CM122+CM123","v":0}]
[{"$f":"AN15","v":0},{"$f":"CN122+CN123","v":0}]
[{"$f":"AO15","v":0},{"$f":"CO122+CO123","v":0}]
[{"$f":"AP15","v":0},{"$f":"CP122+CP123","v":0}]
[{"$f":"AQ15","v":0},{"$f":"CQ122+CQ123","v":0}]
[{"$f":"AR15","v":0},{"$f":"CR122+CR123","v":0}]
[{"$f":"AS15","v":0},{"$f":"CS122+CS123","v":0}]
[{"$f":"AT15","v":0},{"$f":"CT122+CT123","v":0}]
[{"$f":"AU15","v":0},{"$f":"CU122+CU123","v":0}]
[{"$f":"AV15","v":0},{"$f":"CV122+CV123","v":0}]
[{"$f":"AW15","v":0},{"$f":"CW122+CW123","v":0}]
[{"$f":"AX15","v":0},{"$f":"CX122+CX123","v":0}]
[{"$f":"AY15","v":0},{"$f":"CY122+CY123","v":0}]
[]
[{"$f":"34-COUNTIF(A1037:A1071,\"0\")","v":3},"Sub-regions"]

{"sheet":"data_summary","index":7,"n_rows":167,"n_cols":46,"rows_kept":167,"cut":false,"hidden":false,"merged":[]}
["iso3","year","data_source","row","var1","var2","varname","total_q1","total_q2","total_q3","total_q4","total_q5","urban_q1","urban_q2","urban_q3","urban_q4","urban_q5","rural_q1","rural_q2","rural_q3","rural_q4","rural_q5","region_1_name","region_2_name","region_3_name","region_1","region_2","region_3","n_total_q1","n_total_q2","n_total_q3","n_total_q4","n_total_q5","n_urban_q1","n_urban_q2","n_urban_q3","n_urban_q4","n_urban_q5","n_rural_q1","n_rural_q2","n_rural_q3","n_rural_q4","n_rural_q5","n_region_1","n_region_2","n_region_3"]
["COM",2000,"COM_2000_MICS",16,"Water","Improved","w_imp",84.808898289707784,90.012171428886404,93.213277324941728,94.760427202708968,97.359378596339013,72.682164497675728,90.847464519223337,96.302893551744404,96.883132832061506,96.674952043832164,88.244591058804161,89.527228413501021,94.717201807828218,91.727809180696624,97.784086256001601,"Mwali","Ndzuwani","Ngazidja",68.953493151195445,90.620316588771345,95.764236632782826]
["COM",2000,"COM_2000_MICS",17,"Water","Not Improved","",15.19110171029202,9.9878285711135835,6.7867226750583152,5.2395727972909256,2.640621403660953,27.317835502324229,9.1525354807766632,3.6971064482555671,3.1168671679384832,3.3250479561678059,11.75540894119575,10.472771586498959,5.2827981921717786,8.2721908193033542,2.2159137439983612,"Mwali","Ndzuwani","Ngazidja",31.04650684880459,9.3796834112285037,4.2357633672173014]
["COM",2000,"COM_2000_MICS",18,"Water ladder","Basic","w_bas",79.703553770519292,84.975398505977736,90.206690414698556,92.338691039428028,97.044522724591857,71.614089946607038,89.059568538420876,95.673967592142944,96.660222526574927,96.674952043832164,82.224428993612776,84.348821186469976,91.734379090069012,87.386731066092366,97.102574033790575,"Mwali","Ndzuwani","Ngazidja",68.829601350486016,86.406286190675033,92.689926390192667]
["COM",2000,"COM_2000_MICS",19,"Water ladder","Limited","w_lim",5.1053445191884128,5.0367729229085807,3.0065869102431799,2.421736163280908,0.31485587174714802,1.0680745510686931,1.787895980802463,0.62892595960148467,0.222910305486587,0,6.0201620651913172,5.1784072270310562,2.9828227177592281,4.3410781146042634,0.68151222221099972,"Mwali","Ndzuwani","Ngazidja",0.1238918007094363,4.214030398096317,3.0743102425901401]
["COM",2000,"COM_2000_MICS",20,"Water ladder","Unimproved","w_unimp",9.9240127114580119,6.5559753052931544,5.7976569140380789,4.8403538790664049,2.13776457915742,27.002926848577129,9.1525354807766597,3.0086325118852431,3.1168671679384858,3.3250479561678361,6.0149019820277179,5.4323480796335826,4.3930227430003539,7.6678368087536848,1.2976608889174439,"Mwali","Ndzuwani","Ngazidja",20.144028386374149,5.3111723496591337,4.2357633672171922]
["COM",2000,"COM_2000_MICS",21,"Water ladder","Surface water","w_sur",5.2670889988342822,3.431853265820529,0.9890657610201834,0.3992189182246591,0.50285682450357405,0.31490865374713828,0,0.68847393637032828,0,0,5.7405069591681883,5.0404235068653849,0.88977544917140594,0.60435401054968574,0.91825285508098231,"Mwali","Ndzuwani","Ngazidja",10.902478462430389,4.0685110615695166,0]
["COM",2000,"COM_2000_MICS",22,"Improved water point at more than 30 minutes","Yes","",6.0198217665185556,5.5956576126905837,3.2254921149936719,2.555640824729922,0.32339552314992642,1.4695139563473629,1.968019680311655,0.65307067773987193,0.23008164473064949,0,6.8221315243895466,5.7841701556016609,3.1491879625108421,4.7325649150223112,0.69695616976650043,"Mwali","Ndzuwani","Ngazidja",0.17967443714240369,4.6502048952436263,3.210290553851411]
["COM",2000,"COM_2000_MICS",23,"Improved water point at more than 30 minutes","No","",93.980178233481354,94.404342387309327,96.774507885006329,97.444359175270051,99.676604476850073,98.530486043652644,98.031980319688344,99.346929322260152,99.769918355269354,100,93.177868475610381,94.215829844398357,96.850812037489177,95.267435084977691,99.303043830233463,"Mwali","Ndzuwani","Ngazidja",99.820325562857604,95.349795104756382,96.789709446148564]
["COM",2000,"COM_2000_MICS",29,"Piped water","Yes","w_pip",53.064261078338461,33.360022688031798,25.15890757253662,35.226475229671337,50.120535841285587,61.770171832283303,60.341205112791329,73.182217649069642,73.15646067863338,75.522327832649992,53.249926304650373,29.88455306352893,17.66557111902279,31.891205125738821,23.971233419833741,"Mwali","Ndzuwani","Ngazidja",63.436062518757822,89.113235674685981,12.27976336683548]
["COM",2000,"COM_2000_MICS",30,"Piped water","No","",46.93573892166107,66.639977311967812,74.841092427463224,64.773524770328279,49.879464158714313,38.229828167716661,39.658794887208757,26.817782350930351,26.84353932136661,24.477672167349951,46.750073695349371,70.115446936470889,82.334428880977185,68.108794874261065,76.028766580166135,"Mwali","Ndzuwani","Ngazidja",36.563937481242228,10.88676432531388,87.720236633164376]
["COM",2000,"COM_2000_MICS",31,"Piped water on premises","Yes","w_pop",15.25905598501174,12.74674470172055,10.85195771308233,21.021093790717369,38.718378387842073,14.521066011724599,30.80872072087914,52.791565860332248,57.55016543601247,65.497111950610929,14.92875847069541,12.97892076229321,6.0026843842457724,15.00392173869735,16.154925282226589,"Mwali","Ndzuwani","Ngazidja",27.53369826356894,45.250599451444742,6.4150374352714339]
["COM",2000,"COM_2000_MICS",32,"Piped water on premises","No","",84.740944014988017,87.253255298279456,89.148042286917644,78.978906209282329,61.281621612157757,85.478933988275358,69.191279279120863,47.208434139667773,42.44983456398753,34.502888049389,85.071241529304544,87.021079237706672,93.997315615754189,84.996078261302543,83.845074717773286,"Mwali","Ndzuwani","Ngazidja",72.466301736431049,54.749400548554597,93.584962564728599]
["COM",2000,"COM_2000_MICS",35,"Water source on premises","Yes","",22.142312944151868,34.852653026921459,44.160680495964762,55.25117483170807,71.899885668086313,16.94269505670432,44.928266209904713,67.627959443604382,74.00876363235696,82.810932213738923,22.015101730234441,35.350988356518158,44.04976513815356,46.453611877522427,64.638468197071518,"Mwali","Ndzuwani","Ngazidja",30.737774365952479,46.188633754179868,47.407231498465713]
["COM",2000,"COM_2000_MICS",36,"Water source on premises","No","",77.857687055847805,65.147346973078214,55.839319504035252,44.748825168291553,28.100114331913591,83.057304943295634,55.071733790095337,32.372040556395632,25.991236367642991,17.189067786261031,77.984898269765495,64.6490116434817,55.950234861846482,53.546388122477332,35.361531802928397,"Mwali","Ndzuwani","Ngazidja",69.26222563404751,53.811366245819471,52.592768501535069]
["COM",2000,"COM_2000_MICS",37,"Improved Water source on premises","Yes","w_premises",25.872816458969211,37.982329934233491,45.580257396062187,57.84126520382231,73.474554397623066,23.310663866162269,49.454617635914182,69.946638727428365,75.976343987738574,85.659139687178396,24.660240010164731,39.170677515829517,44.418452830367713,49.87231532923203,65.237094851400542,"Mwali","Ndzuwani","Ngazidja",44.577544894720937,50.96940232925985,48.379820216656711]
["COM",2000,"COM_2000_MICS",38,"Improved Water source on premises","No","",74.127183541030618,62.017670065766197,54.41974260393777,42.158734796177377,26.525445602376891,76.689336133837756,50.545382364085889,30.053361272571671,24.023656012261402,14.340860312821579,75.339759989835215,60.829322484170262,55.581547169632337,50.127684670767749,34.76290514859943,"Mwali","Ndzuwani","Ngazidja",55.422455105279063,49.030597670739503,51.620179783343858]
["COM",2000,"COM_2000_MICS",41,"Water point at more than 30 minutes","Yes","",7.6492062792476041,6.3089725513950627,4.0461940528592759,3.381968502638955,0.31584701643785468,2.3111912964771308,2.9036762389280271,1.321275890965536,0.22349531631153099,0,8.7299651716888604,6.6693808050488839,3.276544076336724,6.3118777771506069,0.82338796550031601,"Mwali","Ndzuwani","Ngazidja",1.6958265558644501,7.3422871373382694,3.2319860237555029]
["COM",2000,"COM_2000_MICS",42,"Water point at more than 30 minutes","No","w_30min",92.350793720752307,93.691027448604956,95.953805947140708,96.618031497360988,99.684152983562143,97.688808703522866,97.096323761071972,98.678724109034462,99.776504683688472,100,91.270034828311111,93.330619194951055,96.723455923663252,93.688122222849373,99.176612034499684,"Mwali","Ndzuwani","Ngazidja",98.3041734441356,92.657712862661654,96.768013976244561]
["COM",2000,"COM_2000_MICS",58,"Principal source d'eau","Eau du robinet dans le logement","",4.2490831946071683,4.7820987925035423,3.9614507997919128,8.2297707658873378,19.536039008156528,3.43582439513813,10.52279781968449,17.609479550332129,22.230013953629111,49.667145723403223,4.4356274742727884,4.6300499736453258,1.3901376446361851,7.3831084911065989,5.7779681543909733,"Mwali","Ndzuwani","Ngazidja",1.198328323669172,20.802554551992529,2.988631335001902]
["COM",2000,"COM_2000_MICS",59,"Principal source d'eau","Eau du robinet dans la cours","",11.00997279040457,7.9646459092170021,6.8905069132904178,12.791323024830019,19.182339379685509,11.085241616586471,20.28592290119467,35.182086310000138,35.320151482383316,15.829966227207761,10.49313099642262,8.348870788647881,4.6125467396095852,7.6208132475907577,10.37695712783561,"Mwali","Ndzuwani","Ngazidja",26.33536993989977,24.448044899452171,3.4264061002695279]
["COM",2000,"COM_2000_MICS",60,"Principal source d'eau","Borne fontaine","",37.805205093326677,20.61327798631131,14.306949859454321,14.20538143895398,11.402157453443531,47.249105820558739,29.53248439191217,20.390651788737429,15.60629524262092,10.02521588203906,38.321167833954981,16.905632301235752,11.662886734777009,16.88728338704146,7.8163081376071597,"Mwali","Ndzuwani","Ngazidja",35.902364255188871,43.862636223240628,5.8647259315640659]
["COM",2000,"COM_2000_MICS",61,"Principal source d'eau","Puits à pompe","",0.14341378468482921,0.39444587320020552,1.6342643452818399,0.82034107058055228,1.702962429612787,0.89689964628878371,4.2138285210153006,1.5148269724662251,2.5510578713218099,0.89274510419864328,0.084591259714991998,0.084769927741674203,1.025307577619929,0.69073141952643702,1.326921384780559,"Mwali","Ndzuwani","Ngazidja",0.34070245195094978,0.17873804417750261,1.3825177000371951]
["COM",2000,"COM_2000_MICS",62,"Principal source d'eau","Puits protégé","",1.1345749801771301,1.899066810258824,1.336767225661774,2.8103370044234759,4.7105591295001119,1.2556595048042971,4.1837813973684401,3.207868882869652,6.135279906448976,4.151264734523691,0.78990238100158894,1.6107248190826591,2.1272523162637662,1.292625979097322,4.1501583736753629,"Mwali","Ndzuwani","Ngazidja",2.9736026208107682,0,3.447916237556135]
["COM",2000,"COM_2000_MICS",63,"Principal source d'eau","Source protégée","",1.7379783732271019,1.8312476164293201,1.227474426897426,2.481028807142716,2.6267085421278922,0.37342182149921738,0,1.467560943304631,0,0,2.1052931957256198,1.829488438159274,1.780064577809275,1.8094838741226611,4.5977664847763977,"Mwali","Ndzuwani","Ngazidja",0,0.69646131442631487,2.8635853142934731]
["COM",2000,"COM_2000_MICS",64,"Principal source d'eau","Eau de pluie / Citerne","",28.728670073280011,52.273808820294803,63.646890210217663,53.422245090890613,37.70906430545287,8.0272518342846126,22.10864948804835,16.930419104034279,14.10583118885547,16.108614372459812,32.014877917711424,55.891639024343888,72.119006217112513,55.779024779223498,63.37098578437913,"Mwali","Ndzuwani","Ngazidja",2.2031255596759229,0.49272121582083789,75.550517889609011]
["COM",2000,"COM_2000_MICS",65,"Principal source d'eau","Eau en bouteille","",0,0.25357962067112472,0,0,0.33618894367808072,0.35875985851551351,0,0,0.22250075876234809,0,0,0.2260531406444645,0,0,0.36702080855632457,"Mwali","Ndzuwani","Ngazidja",0,0,0.19045333237106099]
["COM",2000,"COM_2000_MICS",66,"Principal source d'eau","Puits non protégé","",1.621559302269753,1.8813697836777159,2.0534921899339209,0.66081723767129397,0.46416783189836291,0,0.088712179389795795,0.26732240690580439,0.40050136577222639,0.22318627604966079,1.8414017348502389,1.7844250132086079,2.5351101371275839,1.15920060685983,0.91155714747810979,"Mwali","Ndzuwani","Ngazidja",2.3539442134792892,0,1.842402830720796]
["COM",2000,"COM_2000_MICS",67,"Principal source d'eau","Source non protégée","",2.1077034432081221,1.0640013659964911,1.4093334340403809,2.0038520825385788,0.063408672254901502,0.40360484082995263,0.88712179389795809,0.22276867242150361,0,0,2.6762412798595481,1.150859338625102,0.76056994606168171,3.388646438243228,0.080732563512085201,"Mwali","Ndzuwani","Ngazidja",0.65043195372454055,3.6599169330767931,0.2983276580639852]
["COM",2000,"COM_2000_MICS",68,"Principal source d'eau","Mare, ruisseau ou fleuve","",5.2070123405213646,3.424714594069687,0.98531323378765157,0.39730934015827951,0.50154898698479133,0.3111848512493478,0,0.68016046276818731,0,0,5.6670789543204423,5.0404235068653849,0.88876982519726333,0.60144921832812837,0.91306796422973668,"Mwali","Ndzuwani","Ngazidja",10.902478462430389,4.0530555137537041,0]
["COM",2000,"COM_2000_MICS",69,"Principal source d'eau","Camion citerne,vendeur d'eau","",0,0,0.20897354434624249,0,0.1533594046816712,0,0,0,0.71200242803951386,0,0,0,0,0.26473800298775219,0,"Mwali","Ndzuwani","Ngazidja",0,0.1391603396607145,0.049482792080442699]
["COM",2000,"COM_2000_MICS",70,"Principal source d'eau","Autre","",5.4059364958872766,1.9169806705084269,0.31508400955439941,0.71408236076611553,0.64219250710449804,26.042913077996101,5.2282961342814191,1.1583970965918191,1.6465056148413759,1.339117656297965,0.64505334591660091,0.98559168760372684,0,0.15884280179265131,0,"Mwali","Ndzuwani","Ngazidja",16.798949767219419,0.1548211884402414,0.60773361001138215]
["COM",2000,"COM_2000_MICS",71,"Principal source d'eau","Manquant","",0.74492204759524228,1.479451125583267,2.0234998077419619,1.2426709071509801,0.89262370307756411,0.56013273224882609,2.94840537320749,1.056581668178147,1.069860187324881,1.4056459821407239,0.79362090380032702,1.2289056143905559,1.098348283785249,2.7661394553473508,0.31055606877842862,"Mwali","Ndzuwani","Ngazidja",0.34070245195094978,1.4423096061274081,1.3192793610982489]
["COM",2000,"COM_2000_MICS",72,"Principal source d'eau","Ne sait pas","",0.10396808081025639,0.2213110312779942,0,0.22084086900567601,0.076679702340835598,0,0,0.31187614139010511,0,0.35709804167945741,0.13201272244859491,0.28256642580558072,0,0.19791229873216601,0,"Mwali","Ndzuwani","Ngazidja",0,0.069580169830357294,0.16801990732288749]
["COM",2000,"COM_2000_MICS",122,"Sanitation","Improved","s_imp",6.1025540122145161,13.6483935086424,24.637577517067889,39.105448075847917,63.776679554962712,9.2364466832693868,32.727506247668991,39.398955154105067,56.162972570422667,82.651733127589722,5.9923445445608046,9.9036851315058776,18.104075384078261,32.242819142752779,54.389268195959637,"Mwali","Ndzuwani","Ngazidja",41.626504258301239,45.835866962081312,14.94138966092375]
["COM",2000,"COM_2000_MICS",123,"Sanitation","Not Improved","",93.897445987785488,86.3516064913576,75.362422482932118,60.894551924152083,36.223320445037288,90.763553316730608,67.272493752331002,60.601044845894933,43.837027429577333,17.348266872410282,94.007655455439192,90.096314868494119,81.895924615921729,67.757180857247221,45.610731804040363,"Mwali","Ndzuwani","Ngazidja",58.373495741698761,54.164133037918688,85.058610339076253]
["COM",2000,"COM_2000_MICS",124,"Sanitation ladder","Basic","s_bas",5.107864514953822,12.549626826736059,21.97203176843745,36.99391698661767,59.166214439919479,8.1250774182384262,30.21233953399792,36.106165925987384,51.840098353226068,78.24485724818642,5.0484776249485916,8.5789690372433522,16.811710626058179,29.549537497106549,51.028490897723643,"Mwali","Ndzuwani","Ngazidja",33.419367342559958,31.983423418204371,13.97619484788094]
["COM",2000,"COM_2000_MICS",125,"Sanitation ladder","Limited","s_lim",0.99468949726069422,1.098766681906346,2.665545748630445,2.1115310892302519,4.6104651150432323,1.111369265030959,2.51516671367107,3.292789228117686,4.3228742171966026,4.4068758794032989,0.94386691961221236,1.3247160942625269,1.2923647580200881,2.6932816456462279,3.360777298235996,"Mwali","Ndzuwani","Ngazidja",8.2071369157412999,13.852443543876991,0.96519481304281374]
["COM",2000,"COM_2000_MICS",126,"Sanitation ladder","Unimproved","s_unimp",92.266723007167784,85.7717391814477,75.145437295320889,60.509499013427472,35.767004462381763,89.717652044091551,67.272493752331002,59.388751458203252,43.837027429577333,17.348266872410282,91.937056685575271,89.640815425239495,81.750489553616731,67.627822011030702,44.86828054781256,"Mwali","Ndzuwani","Ngazidja",54.4649345756185,53.343087033920419,84.9155164687851]
["COM",2000,"COM_2000_MICS",127,"Sanitation ladder","Open defecation","s_od",1.6307229806177039,0.57986730990990165,0.21698518761122121,0.3850529107246034,0.45631598265552759,1.045901272639056,0,1.212293387691677,0,0,2.0705987698639272,0.45549944325463132,0.14543506230500669,0.1293588462165271,0.74245125622780261,"Mwali","Ndzuwani","Ngazidja",3.9085611660802391,0.8210460039982157,0.14309387029114409]
["COM",2000,"COM_2000_MICS",139,"Sanitation ladder","Open defecation","",1.6307229806177039,0.57986730990990165,0.21698518761122121,0.3850529107246034,0.45631598265552759,1.045901272639056,0,1.212293387691677,0,0,2.0705987698639272,0.45549944325463132,0.14543506230500669,0.1293588462165271,0.74245125622780261,"Mwali","Ndzuwani","Ngazidja",3.9085611660802391,0.8210460039982157,0.14309387029114409]
["COM",2000,"COM_2000_MICS",153,"Type de toilette","Chase d'eau avec égout ou avec fosse septique","",0.088827710569732696,0.1859267294105226,0.17928679458336169,0.93340306673454898,5.8952230333675626,0.87158439386587994,0.35484871755918318,0.84652095520171378,4.2457767284468746,17.58939692992189,0.112788346286656,0,0.12927561093778381,0.90119019223443009,1.597206184238386,"Mwali","Ndzuwani","Ngazidja",1.291247174201249,2.240608922162219,1.1022845279265481,4.838692,10.162644999999999,9.7177679999999995,51.259822999999997,321.603655,10.162644999999999,4.183128,9.9349290000000003,49.889232999999997,206.046212,4.838692,0,5.5346399999999996,38.557574000000002,68.43553,28.842054999999998,182.37281999999999,186.36770799999999]
["COM",2000,"COM_2000_MICS",154,"Type de toilette","Latrine à évacuation","",0,0.2002783483849937,0.52353045511404328,0.64402144185893984,4.423620749987319,0,0.35484871755918318,1.559380706950525,1.579329143482999,15.65952444119764,0,0.25571222881477629,0.56509986597119843,0.49812102819065007,0.81873872677949344,"Mwali","Ndzuwani","Ngazidja",0.1858377010641544,0.38096736152429539,1.661135408378946,0,10.947096,28.376588000000002,35.367812999999998,241.32294800000011,0,4.183128,18.301185,18.557621999999999,183.43924500000011,0,10.947096,24.193460000000002,21.312192,35.080517,4.1509799999999997,31.008576000000009,280.85488900000013]
["COM",2000,"COM_2000_MICS",155,"Type de toilette","Latrine améliorée à ventillation","",0.30953994215204189,0.1554888587038358,1.424759421892839,2.4696455660003682,6.1718963074586801,0,1.774243587795916,1.1284101022884869,1.73279688562136,3.7413773001457482,0.39303611408050998,0.11302657032223221,0.55310051041618269,2.076021262344804,7.9902568624036636,"Mwali","Ndzuwani","Ngazidja",0.49556720283774519,1.8043180382584649,2.466246015325666,16.861499999999999,8.4989290000000004,77.225328000000005,135.62586099999999,336.6970849999999,0,20.91564,13.243233,20.360917000000001,43.827348000000001,16.861499999999999,4.838692,23.679735000000001,88.822918999999999,342.35871900000001,11.069279999999999,146.86122399999999,416.97819900000002]
["COM",2000,"COM_2000_MICS",156,"Type de toilette","Latrine traditionnelle","",81.125952588725823,79.34708241510971,78.324583441817452,83.954132008489907,75.273009941459563,84.938548825305389,87.284153298577252,84.801248040003458,85.170633164775793,56.139136519512277,80.740512238915002,77.935628346819968,77.520657812919097,80.489552451391788,81.280713941074694,"Mwali","Ndzuwani","Ngazidja",88.160041434297682,81.430904435597057,77.606824038252014,4419.1558610000111,4337.064568000008,4245.3775379999979,4610.5204710000107,4106.3883389999946,990.38064999999938,1028.947738999999,995.2433819999992,1000.782149999999,657.62666399999966,3463.8194770000018,3336.4411600000071,3318.869897,3443.759044000004,3482.6366140000018,1969.1944459999991,6628.0123810000396,13121.29994999995]
["COM",2000,"COM_2000_MICS",157,"Type de toilette","Trou ouvert","",13.327991216526931,16.795436267311121,15.43505500320301,9.0172785873781809,5.5877120807427776,9.1174870243132755,7.6302482348536422,6.6567907398135731,7.0044631671580717,3.5709804167945731,13.53225137955272,17.838298001544,18.052874135499231,12.178256819172351,5.6952353352219172,"Mwali","Ndzuwani","Ngazidja",1.033846839534545,10.5236706944921,14.20105139075652,726.01268300000015,918.02860700000019,836.61646100000019,495.20311300000009,304.8279290000001,106.309595,89.94905,78.125346999999977,82.304680000000005,41.83128,580.54221600000005,763.66140800000016,772.89257100000032,521.048767,244.02387899999999,23.092610000000001,856.56692799999985,2401.029254999999]
["COM",2000,"COM_2000_MICS",158,"Type de toilette","Sceau","",0.28021019046933998,0.10361308666645699,0.37940118649556792,0.066070543286015096,0,0,0,0.30916384671281238,0,0,0,0.48883791011329658,0.48033488607551877,0,0,"Mwali","Ndzuwani","Ngazidja",0,0.19765448902916891,0.171712644349373,15.263826999999999,5.66343,20.564440999999999,3.6284049999999999,0,0,0,3.6284049999999999,0,0,0,20.927257000000001,20.564440999999999,0,0,0,16.087951,29.032152]
["COM",2000,"COM_2000_MICS",159,"Type de toilette","Autre","",3.2367553709381931,2.4552581594808962,3.474603800413171,2.520874421210678,2.0639001035336961,4.026478483876355,2.557301353959903,3.4861922213377401,0,2.9698121797069219,3.150813151301048,2.686944358486635,2.5003085841374819,3.727499400449354,1.875397694053978,"Mwali","Ndzuwani","Ngazidja",4.9248984819843891,2.56408236392563,2.5502097880382411,176.31505100000001,134.202958,188.331738,138.43920299999999,112.59248599999999,46.948604999999993,30.146702999999999,40.914606999999997,0,34.789057999999997,135.17189400000001,115.028671,107.045001,159.48168899999999,80.355208000000019,110.005424,208.701718,431.17429400000009]
["COM",2000,"COM_2000_MICS",160,"Type de toilette","Pas de toilette ou brousse ou champ","",1.6307229806177039,0.57986730990990165,0.21698518761122121,0.3850529107246034,0.45631598265552759,1.045901272639056,0,1.212293387691677,0,0,2.0705987698639272,0.45549944325463132,0.14543506230500669,0.1293588462165271,0.74245125622780261,"Mwali","Ndzuwani","Ngazidja",3.9085611660802391,0.8210460039982157,0.14309387029114409,88.830007999999992,31.695204,11.76111,21.146003,24.893526000000001,12.195174,0,14.227703,0,0,88.830007999999992,19.500029999999999,6.2264699999999991,5.5346399999999996,31.811826,87.303916999999998,66.828474,24.193460000000002]
["COM",2000,"COM_2000_MICS",161,"Type de toilette","97","",0,0.1770488250223953,0.041794708869248499,0.0095214543165295998,0.12832180079472161,0,0.044356089694897897,0,0.26700091051481772,0.32977221272092772,0,0.2260531406444645,0.052913531738532103,0,0,"Mwali","Ndzuwani","Ngazidja",0,0.036747691012619502,0.097442316681817298,0,9.677384,2.2653720000000002,0.52289099999999999,7.0003729999999997,0,0.52289099999999999,0,3.137346,3.8630270000000002,0,9.677384,2.2653720000000002,0,0,0,2.991053,16.474966999999999]
["COM",2003,"COM_2003_WHS",16,"Water","Improved","w_imp",67.903463089521338,64.245505665415038,75.828721052454512,81.952758305202295,94.746546807852624,79.190830102165407,91.089306894202522,87.287545656642607,94.870491081920534,96.104243449267884,68.457596334591429,63.967915630714657,64.832544224820111,77.906522094812772,83.31395143701873,"","",""]
["COM",2003,"COM_2003_WHS",17,"Water","Not Improved","",32.096536910478648,35.754494334584962,24.171278947545481,18.047241694797702,5.2534531921473766,20.80916989783459,8.9106931057974741,12.7124543433574,5.1295089180794724,3.895756550732123,31.542403665408571,36.032084369285343,35.167455775179882,22.093477905187221,16.68604856298127,"","",""]
["COM",2003,"COM_2003_WHS",18,"Water ladder","Basic","w_bas",63.853821873414347,58.502165146820943,72.420199836077785,80.828056403589471,93.315752756103009,68.657092558246219,87.977004845106308,82.467314815019833,94.870491081920534,96.104243449267884,65.403263613122249,56.54872558029507,63.263130098398207,76.126951222001239,82.258886075534804,"","",""]
["COM",2003,"COM_2003_WHS",19,"Water ladder","Limited","w_lim",4.0496412161069877,5.743340518594108,3.408521216376716,1.124701901612819,1.4307940517496189,10.533737543919189,3.1123020490962121,4.8202308416227728,0,0,3.054332721469176,7.4191900504195862,1.569414126421909,1.779570872811544,1.0550653614839201,"","",""]
["COM",2003,"COM_2003_WHS",20,"Water ladder","Unimproved","w_unimp",32.096536910478662,35.754494334584948,24.171278947545499,18.047241694797709,5.2534531921473713,20.80916989783459,8.9106931057974812,12.71245434335739,5.1295089180794662,3.8957565507321159,31.542403665408571,36.032084369285343,35.167455775179882,22.093477905187221,16.686048562981281,"","",""]
["COM",2003,"COM_2003_WHS",21,"Water ladder","Surface water","w_sur",0,0,0,0,0,0,0,0,0,0,0,0,0,0,0,"","",""]
["COM",2003,"COM_2003_WHS",22,"Improved water point at more than 30 minutes","Yes","",5.9638213308327073,8.9396767277464075,4.4950266456675063,1.372378337071082,1.5101279149004661,13.30171375944594,3.4167589536179661,5.522243528972397,0,0,4.4616417826604744,11.59829889291751,2.4207196326888618,2.284238629784801,1.266372970295975,"","",""]
["COM",2003,"COM_2003_WHS",23,"Improved water point at more than 30 minutes","No","",94.036178669167299,91.060323272253598,95.504973354332492,98.627621662928917,98.489872085099535,86.698286240554054,96.583241046382028,94.477756471027604,100,100,95.538358217339521,88.401701107082488,97.579280367311142,97.715761370215205,98.733627029704024,"","",""]
["COM",2003,"COM_2003_WHS",29,"Piped water","Yes","w_pip",4.8701036156620452,11.91646284138711,20.944807259011672,28.083951301319441,46.47589181899933,43.263841083820807,55.232822150124527,53.776265872303263,52.433032720583583,64.039157196448784,3.1185440862798042,7.6405398276230327,9.0338461731871789,14.39775575637036,13.954027489769571,"","",""]
["COM",2003,"COM_2003_WHS",30,"Piped water","No","",95.129896384337954,88.083537158612884,79.055192740988332,71.916048698680555,53.52410818100067,56.736158916179193,44.767177849875473,46.22373412769673,47.56696727941641,35.960842803551223,96.881455913720188,92.359460172376956,90.966153826812828,85.602244243629642,86.045972510230428,"","",""]
["COM",2003,"COM_2003_WHS",31,"Piped water on premises","Yes","w_pop",1.177551529621691,1.327389321007983,3.6587720995378401,8.6402179406269024,32.535836534473603,6.9128928291172373,12.806548636162271,26.20580543364655,33.194116381619693,53.267191719829263,0.38324713018675099,1.9021105124566471,1.855064386979244,1.8989125209401541,6.5547057199364556,"","",""]
["COM",2003,"COM_2003_WHS",32,"Piped water on premises","No","",98.822448470378305,98.672610678992015,96.341227900462158,91.359782059373089,67.464163465526397,93.08710717088276,87.193451363837738,73.794194566353454,66.805883618380307,46.732808280170737,99.616752869813254,98.097889487543355,98.144935613020749,98.101087479059842,93.445294280063536,"","",""]
["COM",2003,"COM_2003_WHS",41,"Water point at more than 30 minutes","Yes","",8.0590981283367,8.6514106988117092,3.5419637400286752,1.174775341996108,1.4311992861557361,11.79200231700359,3.1764146312257182,5.1050425235329229,0,0,6.7967479096702146,12.627014252906971,2.0686680159706561,1.832165714352614,1.0839748760540631,"","",""]
["COM",2003,"COM_2003_WHS",42,"Water point at more than 30 minutes","No","w_30min",91.9409018716633,91.348589301188284,96.458036259971323,98.82522465800389,98.568800713844269,88.207997682996407,96.823585368774275,94.894957476467084,100,100,93.203252090329798,87.372985747093026,97.931331984029342,98.167834285647388,98.916025123945943,"","",""]
["COM",2003,"COM_2003_WHS",58,"main source of drinking water","Piped water through house connection or yard","",1.1803286049719499,1.4160343843015299,3.854918128135798,9.2701451077439998,33.127004963907353,7.2305718479873224,13.194632661835501,29.074986650947899,33.781123894962292,53.85951485806784,0.38324713018675099,2.0059328813220172,1.9968997379000579,1.9682664798904039,6.8541015834561234,"","",""]
["COM",2003,"COM_2003_WHS",59,"main source of drinking water","Public standpipe","",3.7012604059055452,11.29622784019935,18.212735990925928,20.861305921737511,14.193342781223119,38.021440458475539,43.711940674364818,30.58905291974791,19.57913893473075,10.89174810810623,2.7352969560930531,6.0516484058371969,7.7276603270163102,12.955338335186809,7.7372967187314341,"","",""]
["COM",2003,"COM_2003_WHS",60,"main source of drinking water","Protected tube well or bore hole","",28.304766729479478,30.05881521913987,31.71422175255195,33.687221522106498,28.56905093665511,18.066746615310429,20.974321401992771,21.69417201497232,24.976940882909201,19.8625998188582,30.511871678161459,25.388901164042899,34.950244120311588,40.084875981748347,40.191601274827818,"","",""]
["COM",2003,"COM_2003_WHS",61,"main source of drinking water","Protected dug well or protected spring","",17.14105225294449,12.802636251567909,19.87553451974086,19.987507026564739,16.905978660800411,11.07078255405335,13.067737818065989,12.683131435273561,14.610028841573889,10.992157422378771,15.04387163144626,17.803171134191931,17.501769161568401,18.853777195622492,27.546844550001062,"","",""]
["COM",2003,"COM_2003_WHS",62,"main source of drinking water","Unprotected dug well or spring","",31.936396968574169,31.464082451723051,20.106116624376991,12.07236128884322,3.5319309189664811,17.169989335914021,6.1503627529757399,3.1556488051150939,3.451811267708317,2.8270918578885,31.542403665408571,32.540541428605493,30.210459820882889,19.248098944472769,12.88056079594789,"","",""]
["COM",2003,"COM_2003_WHS",63,"main source of drinking water","Rainwater (into tank or cistern )","",17.23504626537785,12.4227621635837,5.6781755171489436,3.8362865756989599,3.6726917384475342,8.4404691882593337,2.9010046907651792,2.803008173943216,3.6009561781155468,1.5668879347004689,19.409642953222519,15.44951904755635,6.4650891667136126,6.5022715014039667,4.7895950770356741,"","",""]
["COM",2003,"COM_2003_WHS",64,"main source of drinking water","Tanker-truck, vendor","",0.50114877274651204,0.53944168948460081,0.55829746711952499,0.28517255730508528,0,0,0,0,0,0,0.37366598548138719,0.76028593844410564,1.1478776656071401,0.38737156167522568,0,"","",""]
["COM",2003,"COM_2003_WHS",122,"Sanitation","Improved","s_imp",7.4754966795706483,15.77189977017605,27.637185016705541,40.72953767008979,69.287002601254798,9.4154512026090735,34.153083758660102,43.938437163921897,62.320832142521979,87.76139871120003,6.7952505279614339,12.08515774922534,20.751196056799831,35.108635829669467,54.764073523307431,"","","",null,null,null,524.97785568237305,1109.980424880981,1938.9922533035281,2848.404839515686,4870.9873342514038,191.8672847747803,699.92819976806641,896.33335494995117,1284.498259544373,1772.092711448669,338.03376388549799,596.56305694580078,1044.993971824646,1746.237412452698,2722.7946920394902]
["COM",2003,"COM_2003_WHS",123,"Sanitation","Not Improved","",92.524503320429346,84.228100229823951,72.362814983294456,59.27046232991021,30.712997398745209,90.584548797390923,65.846916241339898,56.061562836078103,37.679167857478021,12.23860128879997,93.204749472038557,87.914842250774655,79.248803943200173,64.891364170330533,45.235926476692569,"","","",null,null,null,6497.6706476211548,5927.7286720275879,5076.8896179199219,4145.0574054718018,2159.1729431152339,1845.9244327545171,1349.4568710327151,1143.6421489715581,776.60749816894531,247.12386608123779,4636.5254888534546,4339.7652006149292,3990.8312835693359,3227.57421875,2249.0682773590088]
["COM",2003,"COM_2003_WHS",124,"Sanitation ladder","Basic","s_bas",6.257023558465443,14.502179786878211,24.647110973331831,38.530312516766841,64.278192003900045,8.2825433385997727,31.528358893009209,40.266258243750379,57.523986353682382,83.082082543370234,5.7249161811752538,10.468648060203551,19.26986580923807,32.175969053074027,51.380136559990632,"","","",null,null,null,451.46966361999512,1024.474548339844,1750.639466285706,2701.6004953384399,4580.8997650146484,139.26163673400879,621.86526489257813,896.33335494995117,1243.68640422821,1662.2561311721799,281.31581687927252,559.38658905029297,959.01147365570068,1668.604197502136,2477.3630695343022]
["COM",2003,"COM_2003_WHS",125,"Sanitation ladder","Limited","s_lim",1.218473121105206,1.269719983297841,2.9900740433737139,2.1992251533229492,5.0088105973547457,1.1329078640093011,2.624724865650899,3.6721789201715231,4.7968457888395939,4.6793161678297839,1.0703343467861799,1.6165096890217909,1.4813302475617649,2.9326667765954322,3.3839369633167991,"","","",null,null,null,73.50819206237793,66.917642593383789,188.35278701782229,109.627872467041,247.78572940826419,52.605648040771477,78.062934875488281,0,40.811855316162109,87.630128860473633,56.717947006225593,37.176467895507813,67.394264221191406,77.633214950561523,188.1597623825073]
["COM",2003,"COM_2003_WHS",126,"Sanitation ladder","Unimproved","s_unimp",92.524503320429346,84.228100229823951,72.36281498329447,59.27046232991021,30.712997398745209,90.584548797390937,65.846916241339898,56.061562836078103,37.679167857478021,12.23860128879998,93.204749472038557,87.914842250774655,79.248803943200159,64.891364170330547,45.235926476692569,"","","",null,null,null,6497.6706476211548,5927.7286720275879,5076.8896179199219,4145.0574054718018,2159.1729431152339,1845.9244327545171,1349.4568710327151,1143.6421489715581,776.60749816894531,247.12386608123779,4636.5254888534546,4339.7652006149292,3990.8312835693359,3227.57421875,2249.0682773590088]
["COM",2003,"COM_2003_WHS",127,"Sanitation ladder","Open defecation","s_od",0,0,0,0,0,0,0,0,0,0,0,0,0,0,0,"","","",null,null,null,19.06485748291016,19.06485748291016,0,0,69.128625869750977,0,0,0,45.893333435058587,0,0,19.06485748291016,19.06485748291016,0,23.235292434692379]
["COM",2003,"COM_2003_WHS",128,"Shared among Improved Sanitation","Yes","s_shared",16.299560729323851,8.0505202404267386,10.81902531522779,5.3995829050079678,7.2290767522162014,12.03243306805483,7.685176788714883,8.3575546997078227,7.6970181942847802,5.3318614294516866,15.751212444367059,13.37599163010851,7.1385294780459514,8.3531208413318812,6.1791184358785971,"","",""]
["COM",2003,"COM_2003_WHS",129,"Shared among Improved Sanitation","No","",83.700439270676156,91.949479759573265,89.18097468477221,94.600417094992025,92.770923247783799,87.967566931945157,92.314823211285116,91.642445300292181,92.30298180571522,94.668138570548308,84.24878755563293,86.624008369891499,92.861470521954047,91.646879158668114,93.820881564121407,"","",""]
["COM",2003,"COM_2003_WHS",130,"Manually calculated ratios","Improved latrines","",7.0312719634992122,16.518187150945831,28.739381502359279,41.758966667309203,62.819248892695811,9.8481342159584884,34.64954872312164,42.292589105228537,57.067874227067684,81.336189487798606,6.7952505279614339,12.234386935250679,21.74465474407247,35.740646809231279,54.112549324337969,"","",""]
["COM",2003,"COM_2003_WHS",135,"Sanitation type","Sewer connection","s_sew",0.27147674376614239,0.27089578754093019,0,0,0.98331507593515666,0,0,0,2.2266365160211228,0,0,0.38621535052312328,0.37858457186315941,0,0.46733573667866818,"","",""]
["COM",2003,"COM_2003_WHS",136,"Sanitation type","Septic tank connection","s_sep",0,0,0,0,0.31587404184095969,0,0,0,1.077404753876019,0,0,0,0,0,0,"","",""]
["COM",2003,"COM_2003_WHS",137,"Sanitation type","Improved latrines","s_lat",7.2040199358045047,15.501003982635121,27.637185016705541,40.72953767008979,67.987813483478675,9.4154512026090735,34.153083758660102,43.938437163921897,59.016790872624838,87.76139871120003,6.7952505279614339,11.69894239870222,20.37261148493667,35.108635829669467,54.296737786628753,"","",""]
["COM",2003,"COM_2003_WHS",138,"Sanitation type","Unimproved facilities","",92.524503320429346,84.228100229823951,72.362814983294456,59.27046232991021,30.712997398745209,90.584548797390923,65.846916241339898,56.061562836078103,37.679167857478021,12.23860128879997,93.204749472038557,87.914842250774655,79.248803943200173,64.891364170330533,45.235926476692569,"","",""]
["COM",2003,"COM_2003_WHS",139,"Sanitation type","Open defecation","",0,0,0,0,0,0,0,0,0,0,0,0,0,0,0,"","",""]
["COM",2003,"COM_2003_WHS",148,"Shared among improved sanitation facilities","Yes","",16.03232526584387,7.4481938030067987,9.9889187744027836,4.940010004534642,6.923772786111174,11.28508965731891,7.4591383363673938,7.7208334405411696,7.3508382150335114,5.1146363084648652,15.445501403538721,12.547126821278891,6.5232845562803652,7.8502233733545079,5.6583821794551739,"","",""]
["COM",2003,"COM_2003_WHS",149,"Shared among improved sanitation facilities","No","",82.328149179340372,85.069973726151389,82.338425726246186,86.548723318791403,88.852949794522203,82.503835604022797,89.599635214822598,84.660655140216647,88.151576219840564,90.81126829612721,82.613625524574857,81.256212536650352,84.858064730603843,86.129302632195447,85.914262659332735,"","",""]
["COM",2003,"COM_2003_WHS",150,"Shared among improved sanitation facilities","DK/missing","",1.6395255548157599,7.4818324708418151,7.6726554993510314,8.5112666766739444,4.2232774193666156,6.2110747386582927,2.9412264488100162,7.618511419242183,4.4975855651259273,4.0740953954079266,1.9408730718864331,6.19666064207075,8.6186507131157875,6.0204739944500414,8.4273551612121,"","",""]
["COM",2003,"COM_2003_WHS",151,"Shared among all sanitation facilities","Yes","",83.656458508319659,91.949479759573265,89.152858283279329,94.571222549750246,93.041390960493004,87.860924189129648,92.314823211285116,91.642445300292181,92.159692881180618,94.632143162624743,84.24878755563293,86.57009596463007,92.861470521954047,91.646879158668114,94.258533803710023,"","",""]
["COM",2003,"COM_2003_WHS",152,"Shared among all sanitation facilities","No","",16.343541491680341,8.0505202404267386,10.84714171672066,5.4287774502497568,6.9586090395069906,12.13907581087035,7.685176788714883,8.3575546997078227,7.8403071188193767,5.3678568373752649,15.751212444367059,13.42990403536993,7.1385294780459514,8.3531208413318812,5.741466196289978,"","",""]
["COM",2003,"COM_2003_WHS",153,"What type of toilet facilities","Flush to piped sewage system","",0.27219722211007569,0.29062435491080391,0,0,1.003622196920418,0,0,0,2.2849554856405141,0,0,0.41073947381450582,0.40591767946425078,0,0.48753838068034039,"","","",null,null,null,19.06485748291016,19.06485748291016,0,0,69.128625869750977,0,0,0,45.893333435058587,0,0,19.06485748291016,19.06485748291016,0,23.235292434692379]
["COM",2003,"COM_2003_WHS",154,"What type of toilet facilities","Flush to septic tank","",0,0,0,0,0.32239737555235198,0,0,0,1.1056236098307219,0,0,0,0,0,0,"","","",null,null,null,0,0,0,0,22.206451416015629,0,0,0,22.206451416015629,0,0,0,0,0,0]
["COM",2003,"COM_2003_WHS",155,"What type of toilet facilities","Pour flush latrine","",0.26539226160207768,0.24115635393371049,0.53245031229920459,2.680049647675097,19.91789663128996,0,0.82401127517250994,9.1311679883449219,12.64690893248024,39.654832201472843,0,0.40047094176735171,0.33682527263372292,1.232159208826648,6.0914766960758424,"","","",null,null,null,18.58823394775391,15.81977367401123,35.455331802368157,176.22095775604251,1371.927433013916,0,16.390474319458011,172.08231544494629,254.01317977905271,791.91101455688477,0,18.58823394775391,15.81977367401123,58.89678955078125,290.30994892120361]
["COM",2003,"COM_2003_WHS",156,"What type of toilet facilities","Covered dry latrine (with privacy)","",6.9577465875981268,16.388741526048889,28.58635857579711,40.639805628269222,49.473980298098368,9.8481342159584884,34.364032534846743,38.430781747409668,47.915620730095313,49.082460027340083,6.7952505279614339,12.041337594637429,21.506651174106729,35.300265138277133,50.552476545872651,"","","",null,null,null,487.32476425170898,1075.0957937240601,1903.5369215011599,2672.183881759644,3407.7248239517212,191.8672847747803,683.5377254486084,724.25103950500488,962.38529491424561,980.18169689178467,338.03376388549799,558.90996551513672,1010.109340667725,1687.340622901917,2409.2494506835942]
["COM",2003,"COM_2003_WHS",157,"What type of toilet facilities","Uncovered dry latrine (without privacy)","",91.996562443786644,82.827603320307148,70.881191111903689,56.68014472405568,29.282103498138898,90.151865784041505,64.811956189980762,52.438050264245419,36.046891241953219,11.262707771187079,93.204749472038557,86.380738299847962,77.398810546178254,63.467575652896222,42.868508377371157,"","","",null,null,null,6443.4946775436401,5433.4622211456299,4719.9073629379272,3726.882223129272,2016.925874710083,1756.392970085144,1289.1798152923579,988.2263822555542,724.00185012817383,224.9174146652222,4636.5254888534546,4009.4428949356079,3635.2131652832031,3033.7284498214722,2043.0439281463621]
["COM",2003,"COM_2003_WHS",158,"What type of toilet facilities","Other","",0.50810148490308027,0.25187444479944188,0,0,0,0,0,0,0,0,0,0.76671368993274913,0.35179532761703608,0,0,"","","",null,null,null,35.587734222412109,16.52287673950195,0,0,0,0,0,0,0,0,0,35.587734222412109,16.52287673950195,0,0]
["COM",2012,"COM_2012_DHS",16,"Water","Improved","w_imp",84.099999999999994,89.900000000000006,90.099999999999994,93.599999999999994,94.599999999999994,91.599999999999994,99.099999999999994,99.5,99.200000000000003,98.5,83.5,86.900000000000006,87.200000000000003,87.700000000000003,90.799999999999997,"Mohéli","Ndzouani","Ngazidja",91.5,90.599999999999994,90.200000000000003]
["COM",2012,"COM_2012_DHS",17,"Water","Not Improved","",15.9,10.1,9.9000000000000004,6.4000000000000004,5.4000000000000004,8.4000000000000004,0.90000000000000002,0.5,0.80000000000000004,1.5,16.5,13.1,12.800000000000001,12.300000000000001,9.1999999999999993,"Mohéli","Ndzouani","Ngazidja",8.5,9.4000000000000004,9.8000000000000007]
["COM",2012,"COM_2012_DHS",18,"Water ladder","Basic","w_bas",70,82,86.900000000000006,89.700000000000003,92.5,81.200000000000003,91.5,91.900000000000006,96,96.799999999999997,67.599999999999994,77.5,85,85.5,88.900000000000006,"Mohéli","Ndzouani","Ngazidja",83.299999999999997,81.299999999999997,87.400000000000006]
["COM",2012,"COM_2012_DHS",19,"Water ladder","Limited","w_lim",14.1,8,3.2000000000000002,3.8999999999999999,2.1000000000000001,10.4,7.5999999999999996,7.5999999999999996,3.2000000000000002,1.7,15.800000000000001,9.5,2.2000000000000002,2.1000000000000001,1.8999999999999999,"Mohéli","Ndzouani","Ngazidja",8.1999999999999993,9.3000000000000007,2.7999999999999998]
["COM",2012,"COM_2012_DHS",20,"Water ladder","Unimproved","w_unimp",13.5,8.9000000000000004,9.6999999999999993,6.4000000000000004,5.0999999999999996,7.7000000000000002,0.59999999999999998,0.5,0.80000000000000004,1.3,13.6,11.6,12.1,12.199999999999999,9,"Mohéli","Ndzouani","Ngazidja",6.5,8,9.8000000000000007]
["COM",2012,"COM_2012_DHS",21,"Water ladder","Surface water","w_sur",2.5,1.2,0.29999999999999999,0,0.20000000000000001,0.59999999999999998,0.29999999999999999,0,0,0.29999999999999999,3,1.5,0.59999999999999998,0.10000000000000001,0.20000000000000001,"Mohéli","Ndzouani","Ngazidja",2,1.5,0]
["COM",2012,"COM_2012_DHS",22,"Improved water point at more than 30 minutes","Yes","",16.699999999999999,8.9000000000000004,3.5,4.0999999999999996,2.2000000000000002,11.4,7.5999999999999996,7.5999999999999996,3.2000000000000002,1.7,19,10.9,2.5,2.3999999999999999,2.1000000000000001,"Mohéli","Ndzouani","Ngazidja",8.9000000000000004,10.199999999999999,3.1000000000000001]
["COM",2012,"COM_2012_DHS",23,"Improved water point at more than 30 minutes","No","",83.299999999999997,91.099999999999994,96.5,95.900000000000006,97.799999999999997,88.599999999999994,92.400000000000006,92.400000000000006,96.799999999999997,98.299999999999997,81,89.099999999999994,97.5,97.599999999999994,97.900000000000006,"Mohéli","Ndzouani","Ngazidja",91.099999999999994,89.799999999999997,96.900000000000006]
["COM",2012,"COM_2012_DHS",29,"Piped water","Yes","w_pip",69.200000000000003,56.5,57.100000000000001,57,52.899999999999999,87,87.099999999999994,83.400000000000006,82.900000000000006,73.200000000000003,68.400000000000006,52.399999999999999,40.100000000000001,45.899999999999999,30.600000000000001,"Mohéli","Ndzouani","Ngazidja",89.099999999999994,86,25.800000000000001]
["COM",2012,"COM_2012_DHS",30,"Piped water","No","",30.800000000000001,43.5,42.899999999999999,43,47.100000000000001,13,12.9,16.600000000000001,17.100000000000001,26.800000000000001,31.600000000000001,47.600000000000001,59.899999999999999,54.100000000000001,69.400000000000006,"Mohéli","Ndzouani","Ngazidja",10.9,14,74.200000000000003]
["COM",2012,"COM_2012_DHS",31,"Piped water on premises","Yes","w_pop",35.700000000000003,29.800000000000001,36.799999999999997,39.799999999999997,45.5,50.600000000000001,48.799999999999997,54.5,68.599999999999994,67.099999999999994,33.299999999999997,25.600000000000001,27.5,31.300000000000001,23.100000000000001,"Mohéli","Ndzouani","Ngazidja",64.099999999999994,60.700000000000003,9.6999999999999993]
["COM",2012,"COM_2012_DHS",32,"Piped water on premises","No","",64.299999999999997,70.200000000000003,63.200000000000003,60.200000000000003,54.5,49.399999999999999,51.200000000000003,45.5,31.399999999999999,32.899999999999999,66.700000000000003,74.400000000000006,72.5,68.700000000000003,76.900000000000006,"Mohéli","Ndzouani","Ngazidja",35.899999999999999,39.299999999999997,90.299999999999997]
["COM",2012,"COM_2012_DHS",35,"Water source on premises","Yes","",46.5,58.600000000000001,65.700000000000003,75.900000000000006,89.099999999999994,53.700000000000003,57.100000000000001,70.200000000000003,86.400000000000006,91,43.399999999999999,56,68,72,86,"Mohéli","Ndzouani","Ngazidja",64.799999999999997,64,70.799999999999997]
["COM",2012,"COM_2012_DHS",36,"Water source on premises","No","",53.5,41.399999999999999,34.299999999999997,24.100000000000001,10.9,46.299999999999997,42.899999999999999,29.800000000000001,13.6,9,56.600000000000001,44,32,28,14,"Mohéli","Ndzouani","Ngazidja",35.200000000000003,36,29.199999999999999]
["COM",2012,"COM_2012_DHS",37,"Improved Water source on premises","Yes","w_premises",46,56.899999999999999,63.200000000000003,73.200000000000003,85.700000000000003,53.700000000000003,57.100000000000001,70.200000000000003,86.099999999999994,90.700000000000003,42.899999999999999,54.100000000000001,64.799999999999997,68.200000000000003,80.099999999999994,"Mohéli","Ndzouani","Ngazidja",64.799999999999997,63.799999999999997,66.299999999999997]
["COM",2012,"COM_2012_DHS",38,"Improved Water source on premises","No","",54,43.100000000000001,36.799999999999997,26.800000000000001,14.300000000000001,46.299999999999997,42.899999999999999,29.800000000000001,13.9,9.3000000000000007,57.100000000000001,45.899999999999999,35.200000000000003,31.800000000000001,19.899999999999999,"Mohéli","Ndzouani","Ngazidja",35.200000000000003,36.200000000000003,33.700000000000003]
["COM",2012,"COM_2012_DHS",41,"Water point at more than 30 minutes","Yes","",20.199999999999999,10.9,5.0999999999999996,5.0999999999999996,2.7000000000000002,12,8,7.5999999999999996,3.3999999999999999,2.3999999999999999,22.199999999999999,14.6,4.4000000000000004,4.5,3.2000000000000002,"Mohéli","Ndzouani","Ngazidja",10.6,14.1,3]
["COM",2012,"COM_2012_DHS",42,"Water point at more than 30 minutes","No","w_30min",79.799999999999997,89.099999999999994,94.900000000000006,94.900000000000006,97.299999999999997,88,92,92.400000000000006,96.599999999999994,97.599999999999994,77.799999999999997,85.400000000000006,95.599999999999994,95.5,96.799999999999997,"Mohéli","Ndzouani","Ngazidja",89.400000000000006,85.900000000000006,97]
["COM",2012,"COM_2012_DHS",58,"Source of drinking water","Piped into dwelling","",6.5157242956987176,6.5406352538561201,15.20720036651524,16.946126438326282,21.147177225508891,7.6632445379481089,22.112914739408549,20.281693583186549,28.47998733852517,33.411785462710498,6.2541303955146743,5.4634306918903039,9.6033139110571035,13.36614407569949,10.824930780187911,"Mohéli","Ndzouani","Ngazidja",14.09719678228694,19.111833162392472,7.1131406994983628]
["COM",2012,"COM_2012_DHS",59,"Source of drinking water","Piped to yard/plot","",29.144227131642641,23.27351081421568,21.64279869109129,22.837851448014909,24.39972776965676,42.925065157459848,26.806897158033681,34.201344132655791,40.145497272098197,33.923594843952522,27.001592566678209,20.178704943144201,17.932334594817121,17.978401821771719,12.2796591960055,"Mohéli","Ndzouani","Ngazidja",50.284213602681803,41.64327289554469,2.5590269099787508]
["COM",2012,"COM_2012_DHS",60,"Source of drinking water","Public tap/standpipe","",33.49505270766727,26.728949736219029,20.362850347467539,17.22651628573723,7.4824729585783398,36.384759087051947,38.401352545338341,28.906372893110131,14.316203731078881,6.0652613435767906,35.10975700968779,26.8436978796476,12.582667445260009,14.685130339354661,7.4865512712020399,"Mohéli","Ndzouani","Ngazidja",25.09717432031217,25.299255679535431,16.106961164013029]
["COM",2012,"COM_2012_DHS",61,"Source of drinking water","Tube well or borehole","",0.45628970520556372,0.1556088517724073,1.412348397565286,0.52255421258543178,0.16880548492473879,0.67168516345835438,2.7164994530311422,0,0.53563046919160473,0,0.31952167368407169,0.16305852874562529,0.91464010716323862,0.76330951206384201,0,"Mohéli","Ndzouani","Ngazidja",1.642196969947481,0.29187156205297132,0.64434165655447406]
["COM",2012,"COM_2012_DHS",62,"Source of drinking water","Protected well","",2.5513633423018982,5.9230976317893687,6.1887177305892314,8.4683908016193321,11.53093816729753,0.91994386615033696,0.26690120743566709,1.444541158327701,1.7979481376784621,6.974767004676159,1.811820177827419,6.9913623009938819,9.113513054025816,8.3670233950860187,19.020483140853461,"Mohéli","Ndzouani","Ngazidja",0.76963829999480071,0.1079362083479201,14.866918621526199]
["COM",2012,"COM_2012_DHS",63,"Source of drinking water","Unprotected well","",1.811032317170254,2.10516627830529,3.1446454765940142,2.5009721789535528,3.2925471075147859,0.34719828398798203,0.095140134195035295,0,0,0,1.9086834679771041,2.8694614158137859,3.9682451088057369,4.0098148165315122,5.7681123408067823,"Mohéli","Ndzouani","Ngazidja",2.2413777137865809,0,5.2728250692271317]
["COM",2012,"COM_2012_DHS",64,"Source of drinking water","Protected spring","",3.0045309820704791,3.4908007898913769,3.1054079618266019,4.5652507190395522,5.8130963104407618,0.41347279704989998,1.418951212763899,0.77868661446972431,2.9981676993717841,2.8649512986594852,3.8344991672695108,2.342650294794359,5.5581114867432522,5.4996122197464468,8.0028300813127426,"Mohéli","Ndzouani","Ngazidja",0,1.871511146288622,6.7639914525273426]
["COM",2012,"COM_2012_DHS",65,"Source of drinking water","Unprotected spring","",3.6821333190024759,2.0967683865347291,2.631456447063607,1.8010496230671269,0.83873379242748125,0.3876407525435927,0,0,0.25187502835946818,0.96627415101623571,3.5413568233236372,4.1306909451255498,3.0141132171286849,3.0847307718840762,1.590677828165983,"Mohéli","Ndzouani","Ngazidja",1.6812865352317969,1.9235666614516109,2.581909539160764]
["COM",2012,"COM_2012_DHS",66,"Source of drinking water","River/dam/lake/ponds/stream/canal/irrigation channel","",2.4531259583290579,1.184813955067981,0.27136635671104442,0,0.22799906771762529,0.61928347697699238,0.34660610385865909,0,0,0.25294789038085408,2.9953683734316838,1.5089015167268931,0.64623515280944244,0.099224906144445194,0.21621848374635469,"Mohéli","Ndzouani","Ngazidja",2.0446281265635098,1.458629280002002,0]
["COM",2012,"COM_2012_DHS",67,"Source of drinking water","Rainwater","",7.2132126781968413,20.813896851432361,19.472891331490612,18.47876795767657,19.679277646998148,1.6887337658810739,4.7097084734796564,9.4608687936210565,9.5311352646105387,10.875863491226751,6.9611792288474224,21.88254903667227,27.907535826709481,24.063794307947241,27.441485452737581,"Mohéli","Ndzouani","Ngazidja",0,1.493007545669256,35.752523551696349]
["COM",2012,"COM_2012_DHS",68,"Source of drinking water","Tanker truck","",0.81218389289319792,2.9625098454215211,2.705782108928052,3.9714898716863321,3.2770353031510639,0.34569849591002461,2.4647335659756089,2.9368526879668639,1.3791935550620289,2.7213555462141348,0.83348394518856816,3.152390210119274,3.731755858142408,2.981922466752057,4.8146099873841743,"Mohéli","Ndzouani","Ngazidja",0,0.033373775396507599,5.9443988340353826]
["COM",2012,"COM_2012_DHS",69,"Source of drinking water","Cart with small tank","",0.41133680160218011,0.19854387493162831,0.1284499797521981,0.41931949268730789,0.079379140560883493,0.6344046513674183,0.40855204105337378,1.3442821742917219,0,0.25294789038085408,0.59828647799968238,0,0,0,0,"Mohéli","Ndzouani","Ngazidja",0,0.51212798076765276,0.0098738255073829006]
["COM",2012,"COM_2012_DHS",70,"Source of drinking water","Bottled water","",0.53986010065469614,0,0.0305026268167293,0.16366234883527739,1.2244245360251971,0,0,0.15674846471931131,0,1.6902510772056489,0.77075746706414361,0.014461702306678099,0,0.2120012954534361,1.009654979285973,"Mohéli","Ndzouani","Ngazidja",0,0.33599684573197869,0.50425952453638367]
["COM",2012,"COM_2012_DHS",71,"Source of drinking water","Other","",7.9099267675647678,4.5256977305624773,3.695582177588506,2.0980486217709502,0.83838548919748301,6.9988699642144532,0.25174336542645198,0.48860949765113187,0.56436150402393337,0,8.0595632255061123,4.4586405340195814,5.0275342373377319,4.888890071565041,1.544786458311497,"Mohéli","Ndzouani","Ngazidja",2.1422876491950462,5.9176172568191259,1.879829151738293]
["COM",2012,"COM_2012_DHS",122,"Sanitation","Improved","s_imp",33.366638608283573,29.19830881640571,29.98559898470732,39.659694495640053,59.40572700502495,36.591976429031803,40.320244947046064,48.911383089752583,63.461720841117952,74.972479608076327,31.639825607393561,29.876970199764589,24.630966806740311,29.243337503733471,42.929886797093687,"Mohéli","Ndzouani","Ngazidja",48.783278727402958,52.218381969004497,22.43508965620326,1621.8924439999989,1424.871057999999,1457.551757,1935.406026000001,2877.4191790000032,557.96010200000001,616.93921999999998,744.53870599999982,968.09232299999996,1144.497038,1057.3823420000001,999.86516299999971,822.63972400000023,976.96800200000007,1428.257844,786.91657999999961,6021.9981459999944,2508.2257380000019]
["COM",2012,"COM_2012_DHS",123,"Sanitation","Not Improved","",66.633361391716434,70.801691183594258,70.066367925784718,60.34030550435984,40.813603151985291,63.408023570968311,59.697782477457508,51.088616910247318,36.709602560754092,25.095703853597719,68.360174392606453,70.123029800235358,75.369033193259696,70.82438164738538,57.229915065132822,"Mohéli","Ndzouani","Ngazidja",51.216721272597141,47.891481089656331,77.569071544444412,3238.9281589999991,3455.106980999999,3411.7262290000021,2944.626588000001,1984.2033089999991,966.85532600000067,913.84309899999892,777.68098799999927,561.51147499999945,383.44875000000008,2284.5524559999999,2346.7431319999978,2517.2199349999992,2371.6088479999962,1911.1272570000001,826.17011799999977,5534.6499260000064,8673.7712220000085]
["COM",2012,"COM_2012_DHS",124,"Sanitation ladder","Basic","s_bas",24.16320765417888,18.679925333983661,22.41648424864669,29.18669554170306,53.271907340158251,23.359684422080779,28.5858947886653,36.21324221906648,48.561243597588557,65.804131615061124,22.917869745943509,19.45505507688943,19.031249600179681,20.91645012293694,40.243322154067492,"Mohéli","Ndzouani","Ngazidja",39.165102643478683,36.437024789120798,20.985811332182958,1174.530176,911.57625399999972,1089.629259000001,1417.201258000001,2580.317010000002,356.19207200000011,437.39217500000001,544.0829930000001,740.78935300000001,1004.537053,765.90026399999999,651.08448700000008,635.617028,698.78147400000012,1338.877058,631.7670609999999,4195.2893580000009,2346.1975380000031]
["COM",2012,"COM_2012_DHS",125,"Sanitation ladder","Limited","s_lim",9.2034309541046895,10.51838348242206,7.5691147360606426,10.472998953936999,6.1338196648666914,13.232292006951029,11.73435015838076,12.698140870686119,14.900477243529391,9.1683479930152245,8.7219558614500556,10.421915122875181,5.5997172065606229,8.3268873807965331,2.6865646430262191,"Mohéli","Ndzouani","Ngazidja",9.6181760839243022,15.78135717988377,1.449278324020304,447.36226799999997,513.29480399999989,367.92249800000002,508.53126800000013,297.10216899999989,201.76803000000001,179.547045,190.78221300000001,227.30296999999999,139.95998499999999,291.48207799999989,348.78067600000003,187.02269599999991,278.18652800000001,89.380785999999986,155.149519,1817.0352880000009,162.0282]
["COM",2012,"COM_2012_DHS",126,"Sanitation ladder","Unimproved","s_unimp",65.82635041139369,70.351823892705838,69.262630257795394,59.873110899867783,40.529273110516733,62.854034094938299,58.678552934940718,50.790761346042387,36.396689225408309,24.962447140777648,67.42223858910846,69.50419821988757,75.217521168304884,69.986475663015256,56.789934675512193,"Mohéli","Ndzouani","Ngazidja",48.577090119926012,47.312289336608139,77.324095674499958,3199.7008029999988,3433.1535560000002,3375.1204210000019,2921.872533000002,1981.043259999999,958.40800900000067,898.51687399999901,773.17578499999945,559.3457099999996,382.45446600000008,2253.207253,2326.033262999998,2512.1596459999992,2345.8185499999959,1901.771017,783.59057899999993,5480.4566610000047,8646.8433330000098]
["COM",2012,"COM_2012_DHS",127,"Sanitation ladder","Open defecation","s_od",0.80701098032273988,0.44986729088843752,0.7517707574972694,0.46719460449215577,0.064999884458325899,0.55398947602988224,1.001202118013228,0.29785556420500292,0.1415899334737401,0.065073251146002001,0.93793580349798344,0.61883158034782815,0.15151202495481869,0.77018683325126602,0.28017852739410659,"Mohéli","Ndzouani","Ngazidja",2.6396311526710061,0.46932869438729091,0.2408146692967798,39.227356,21.953424999999999,36.605808000000003,22.754055000000001,3.1600489999999999,8.447317,15.326225000000001,4.5052029999999998,2.1657649999999999,0.99428399999999995,31.345203000000001,20.709869000000001,5.060289,25.790298,9.3562399999999997,42.579538999999997,54.193264999999997,26.927889]
["COM",2012,"COM_2012_DHS",128,"Shared among Improved Sanitation","Yes","s_shared",27.582733346774269,36.023947649023,25.24249970767934,26.40715993182534,10.32530022626918,36.161730789847773,29.102874185888201,25.96152484051613,23.479472422177238,12.228951264441809,27.566384118792101,34.882771088205232,22.7344596356983,28.474476894894249,6.2580287148767804,"Mohéli","Ndzouani","Ngazidja",19.716132934954821,30.221842548187691,6.4598731105118672]
["COM",2012,"COM_2012_DHS",129,"Shared among Improved Sanitation","No","",72.417266653225752,63.976052350977021,74.757500292320714,73.592840068174667,89.674699773730808,63.838269210152262,70.897125814111789,74.038475159483923,76.520527577822762,87.771048735558225,72.433615881207899,65.117228911794811,77.265540364301671,71.525523105105762,93.74197128512327,"Mohéli","Ndzouani","Ngazidja",80.283867065045229,69.778157451812433,93.540126889488164]
["COM",2012,"COM_2012_DHS",130,"Manually calculated ratios","Improved latrines","",27.737226940206639,26.561020870332062,25.575016474235309,33.46313361006117,34.076375903622477,34.486317033161107,34.737288780045418,43.012555456906739,53.689077542783217,36.597767217350878,25.8505402874355,25.794260177527871,21.64892817680963,24.33373443335557,25.244093428070482,"Mohéli","Ndzouani","Ngazidja",44.458037369620733,45.033074843261673,10.57831222420814]
["COM",2012,"COM_2012_DHS",135,"Sanitation type","Sewer connection","s_sew",1.0723481950317111,0.4094068219227901,1.607954633625635,3.0228435682335739,17.730646016379811,0,1.4619826556802571,3.179765390684794,8.2469901137104866,23.924781551215599,0.70001886374325395,1.201950705139216,0.53554783213123047,2.636693883850985,12.805612502491661,"Mohéli","Ndzouani","Ngazidja",1.6398029338904161,3.104963686394417,6.9274864388802246]
["COM",2012,"COM_2012_DHS",136,"Sanitation type","Septic tank connection","s_sep",2.6722085756432521,1.7882264080410131,1.774247932617417,2.9047109560977158,13.76285722825129,1.3435645143538,2.6192181933609091,2.5666412774712128,7.676780167095278,25.266685508870939,2.436026311725787,2.851224600816332,1.140834882008436,1.989412457414558,6.8788851256242109,"Mohéli","Ndzouani","Ngazidja",6.7411614102839854,4.1900331997926781,4.6631225340629978]
["COM",2012,"COM_2012_DHS",137,"Sanitation type","Improved latrines","s_lat",29.622081837608601,27.000675586441901,26.55142950797222,33.732139971308762,27.692893603383311,35.248411914677988,36.221016673501339,43.164976421596563,47.366627158440203,25.712829086315711,28.503780431924511,25.82379489380904,22.954584092600651,24.549512011348931,23.0855873067513,"Mohéli","Ndzouani","Ngazidja",40.40231438322855,44.813522024156732,10.840319482612349]
["COM",2012,"COM_2012_DHS",138,"Sanitation type","Unimproved facilities","",65.82635041139369,70.351823892705838,69.314597168287463,59.874037001671518,40.74860326752696,62.854034094938427,58.696580359444283,50.792654177814043,36.568012627280368,25.030630602451719,67.422238589108503,69.504198219887513,75.217521168304884,70.054194814134121,56.949736537738723,"Mohéli","Ndzouani","Ngazidja",48.577090119926147,47.422545247166639,77.328256875147645]
["COM",2012,"COM_2012_DHS",139,"Sanitation type","Open defecation","",0.80701098032273988,0.44986729088843752,0.7517707574972694,0.46626850268832992,0.064999884458325899,0.55398947602988224,1.001202118013228,0.29596273243328558,0.1415899334737401,0.065073251146002001,0.93793580349798344,0.61883158034782815,0.15151202495481869,0.77018683325126602,0.28017852739410659,"Mohéli","Ndzouani","Ngazidja",2.6396311526710061,0.46893584248967579,0.2408146692967798]
["COM",2012,"COM_2012_DHS",148,"Shared among improved sanitation facilities","Yes","",9.2034309541046877,10.51838348242206,7.5559969888315974,10.420653061643639,6.1111731676686114,13.232292006951029,11.72910365970853,12.53315889631368,14.860251412634121,9.1600098707166939,8.7219558614500539,10.421915122875181,5.5997172065606247,8.3076047067577381,2.676564196601174,"Mohéli","Ndzouani","Ngazidja",9.6181760839243005,15.722857325753511,1.44900951573859]
["COM",2012,"COM_2012_DHS",149,"Shared among improved sanitation facilities","No","",24.16320765417888,18.67992533398365,22.37763508538368,29.040815299764279,53.075223680345843,23.359684422080779,28.573113862833971,35.742737736514918,48.43014602661183,65.744286275685582,22.917869745943499,19.45505507688943,19.031249600179692,20.868013645856749,40.093520738266001,"Mohéli","Ndzouani","Ngazidja",39.165102643478669,36.301956517690918,20.981918939816989]
["COM",2012,"COM_2012_DHS",150,"Shared among improved sanitation facilities","DK/missing","",66.633361391716434,70.801691183594258,70.066367925784718,60.538531638591977,40.813603151985291,63.408023570968311,59.697782477457508,51.724103367171317,36.709602560754092,25.095703853597719,68.360174392606453,70.123029800235358,75.369033193259696,70.82438164738538,57.229915065132822,"Mohéli","Ndzouani","Ngazidja",51.216721272597141,47.975186156555772,77.569071544444412]
["COM",2012,"COM_2012_DHS",151,"Shared among all sanitation facilities","Yes","",21.655314633802011,23.200385826616571,23.859922203065661,19.2343880560217,9.6627966953394111,35.946160239451252,39.576666349793967,32.424523381585068,21.99504272786432,11.80953465304029,20.61696680950271,19.856314337123411,15.73949226816605,15.75632559620399,5.5074519667954318,"Mohéli","Ndzouani","Ngazidja",17.216500189159621,29.41555525122271,9.6289614628420068]
["COM",2012,"COM_2012_DHS",152,"Shared among all sanitation facilities","No","",78.344685366198021,76.799614173383389,75.912418655267572,80.110881489183257,90.337203304660335,64.053839760548826,60.423333650206082,65.266098786955581,78.004957272135783,88.190465346959684,79.383033190497258,80.143685662876536,84.260507731833982,84.010305817561175,94.492548033204542,"Mohéli","Ndzouani","Ngazidja",82.783499810840453,70.240549270258086,90.341924598200407]
["COM",2012,"COM_2012_DHS",153,"Type of toilet facility","Flush to piped sewer system","",1.0723481950317111,0.4094068219227901,1.610746157030269,3.0228435682335739,17.796351407851049,0,1.4626366093227841,3.179765390684794,8.2693142333029073,23.94655966688963,0.70001886374325395,1.201950705139216,0.53554783213123047,2.642813879986698,12.853458110653669,"Mohéli","Ndzouani","Ngazidja",1.6398029338904161,3.1115100403256122,6.9287715689680649,52.124922000000012,19.978963,78.295781000000005,147.51575199999999,861.99707399999954,0,22.379771999999999,48.403015000000003,126.14627400000001,365.55769199999992,23.394174,40.224581999999998,17.886545999999999,88.291720999999995,427.62871599999983,26.451443000000001,358.82972599999999,774.63132299999972]
["COM",2012,"COM_2012_DHS",154,"Type of toilet facility","Flush to septic tank","",2.6722085756432521,1.7882264080410131,1.777328152995499,2.9047109560977158,13.813858975232741,1.3435645143538,2.6203897854256071,2.5666412774712128,7.6975607617330768,25.28968512533697,2.436026311725787,2.851224600816332,1.140834882008436,1.994030056987373,6.9045867031354788,"Mohéli","Ndzouani","Ngazidja",6.7411614102839854,4.1988672613404807,4.663987598054776,129.891265,87.265055999999987,86.39306400000001,141.75084200000001,669.09816200000012,20.486878999999998,40.094528999999987,39.069918999999999,117.42432100000001,386.0612569999999,81.410411000000011,95.419319000000016,38.102283999999997,66.617004999999992,229.71246500000001,108.74077800000001,484.22739099999978,521.43021999999985]
["COM",2012,"COM_2012_DHS",155,"Type of toilet facility","Flush to pit latrine","",1.2971454030022349,0.51459567644173165,1.419058455161939,1.943318508321753,4.4029983557314862,1.530991067595626,3.18489026718792,3.370596320769975,4.1091175865977911,7.2395986982210028,1.1251122560051821,0.65808714551100467,0.76174976189321397,0.31454391750970329,2.196756907293909,"Mohéli","Ndzouani","Ngazidja",0.47237938354135572,2.7214362223256998,1.2860431919293189,63.051910999999997,25.112155999999999,68.978149999999999,94.834576999999982,213.26684399999999,23.344788000000001,48.731938999999997,51.307880999999988,62.683538000000013,110.516543,37.600518000000001,22.023599000000001,25.441372999999999,10.508354000000001,73.085104999999999,7.6198890000000006,313.84511099999997,143.778638]
["COM",2012,"COM_2012_DHS",156,"Type of toilet facility","Flush to somewhere else","",0.77610416185112618,0.20448026446538689,0.13689882946846449,0.026640805560813,1.0554456432484769,1.0342926566978581,0.3102538739062134,0,0.39049661473578001,0.37784747057884771,0.6569241570224077,0.29817030020837859,0.0571055132469565,0,1.2232639419776681,"Mohéli","Ndzouani","Ngazidja",0.065377143169523602,0.453856761574217,0.47751316555964768,37.725030999999987,9.9785920000000008,6.654431999999999,1.3000799999999999,51.122335999999997,15.771053999999999,4.7471880000000004,0,5.9569259999999993,5.7680540000000002,21.953976999999998,9.9785920000000008,1.9072439999999999,0,40.697436000000003,1.0545899999999999,52.340276999999993,53.385604000000001]
["COM",2012,"COM_2012_DHS",157,"Type of toilet facility","Flush, don't know where","",2.2658003245794762,0.084352100913214795,0.18922226340230819,0.0134957909525151,0.045849956941137603,0.36192406626148088,0.60112428218048897,0.043265699596184599,0,0.14547921626702129,2.5865548020784579,0.66614321231759221,0,0,0,"Mohéli","Ndzouani","Ngazidja",0,1.070474064289626,0.025755284827140401,110.136489,4.1163639999999999,9.1977899999999995,0.65859900000000005,2.2208220000000001,5.5186739999999999,9.1977899999999995,0.65859900000000005,0,2.2208220000000001,86.440975000000009,22.293203999999999,0,0,0,0,123.450643,2.8794209999999998]
["COM",2012,"COM_2012_DHS",158,"Type of toilet facility","Ventilated Improved Pit latrine (VIP)","",0,0.041704613908816801,0.043611892973812898,0,0.89991722610149771,0.13347031795641051,0,0,0,2.299895865674852,0,0,0.063472846659512902,0,0.25488309932005587,"Mohéli","Ndzouani","Ngazidja",0.25758565892036173,0.17678997368590069,0.2075241314053444,0,2.0351759999999999,2.119904,0,43.589047999999998,2.0351759999999999,0,0,0,35.109203000000001,0,0,2.119904,0,8.479845000000001,4.1550799999999999,20.388010000000001,23.201038]
["COM",2012,"COM_2012_DHS",159,"Type of toilet facility","Pit latrine with slab","",24.928150737596759,25.364290804342279,23.753560399594061,30.09882376167247,20.270976783746029,32.512817544760587,31.067371632365589,38.33689810348752,41.74217629035212,14.190971650717531,23.222547323917009,24.056337074249669,20.767328415460231,22.506579375268881,18.637105261779912,"Mohéli","Ndzouani","Ngazidja",38.789037053977403,38.264274810326398,9.0907104393530531,1211.712687,1237.771821,1154.6223809999999,1468.832416,981.85983599999963,495.76045800000003,475.36120000000011,583.57181299999979,636.76622500000008,216.6331579999999,776.08239000000003,805.07137199999954,693.59962400000006,751.90487000000007,620.04803099999992,625.70079699999974,4412.7639210000034,1016.334423]
["COM",2012,"COM_2012_DHS",160,"Type of toilet facility","Pit latrine without slab/open pit","",61.521766389698577,65.228750591924495,62.538646700979577,54.98371005354096,35.582104082127358,57.439304516271022,53.187077349469753,48.199051811768193,34.645782210385242,22.314429585400589,62.700231173091879,63.577057111190783,70.195194480176227,62.87189653783787,49.888712653341052,"Mohéli","Ndzouani","Ngazidja",37.992479496598072,41.904975218623328,73.119868413819518,2990.4626959999969,3183.1487039999979,3039.903069,2683.2229830000001,1723.4807800000001,875.8433770000006,813.8143519999993,733.69545899999957,528.5125479999997,340.64230900000001,2095.4008440000011,2127.6750669999979,2344.420983,2100.438471999998,1659.7748209999991,612.85163299999999,4832.6216470000027,8174.7449520000127]
["COM",2012,"COM_2012_DHS",161,"Type of toilet facility","No facility/bush/field","",0.80701098032273988,0.44986729088843752,0.7530758849060829,0.46626850268832992,0.065240757963441004,0.55398947602988224,1.0016499617475141,0.29596273243328558,0.14197320913726921,0.0651324856592915,0.93793580349798344,0.61883158034782815,0.15151202495481869,0.77197450396728784,0.28122535838594692,"Mohéli","Ndzouani","Ngazidja",2.6396311526710061,0.46992452393848377,0.24085934324595851,39.227356,21.953424999999999,36.605808000000003,22.754055000000001,3.1600489999999999,8.447317,15.326225000000001,4.5052029999999998,2.1657649999999999,0.99428399999999995,31.345203000000001,20.709869000000001,5.060289,25.790298,9.3562399999999997,42.579538999999997,54.193264999999997,26.927889]
["COM",2012,"COM_2012_DHS",162,"Type of toilet facility","Composting toilet","",1.13098537243013,0.99573239083586773,1.1920716635494299,1.6765019103620249,2.175774299421001,0.70920891810389042,1.3838323705636739,1.4142162977428929,1.643551969132059,1.8602893849693389,1.5695660499238739,0.4432274617307731,1.3620330685876889,1.785370273980823,2.083096714910659,"Mohéli","Ndzouani","Ngazidja",0.88331228678943696,2.6750295967107882,0.23229744166556221,54.975169999999999,48.591521999999998,57.944687000000009,81.813839999999999,105.387393,10.814126999999999,21.17399,21.527479,25.071964999999999,28.398363,52.453873999999999,14.833087000000001,45.489992999999998,59.646051999999997,69.303681999999995,14.248593,308.49334399999998,25.970675]
["COM",2012,"COM_2012_DHS",163,"Type of toilet facility","Bucket toilet","",0.1058556861124299,0.017222044715845101,0,0,0.25767181052412641,0.055116965933531999,0,0,0,0,0.15396634916633711,0,0,0,0.37514127773936518,"Mohéli","Ndzouani","Ngazidja",0.052100857383674301,0.15284187234710511,0,5.1454550000000001,0.84043199999999996,0,0,12.480779999999999,0.84043199999999996,0,0,0,0,5.1454550000000001,0,0,0,12.480779999999999,0.84043199999999996,17.626235000000001,0]
["COM",2012,"COM_2012_DHS",164,"Type of toilet facility","Hanging toilet/latrine","",3.4226241737315162,4.9013709916000714,6.5857795999384798,4.8636861425696951,3.6338107011113681,4.3253199560360187,5.180773867830502,2.593602366045856,1.3600271246238169,2.2701108502848881,3.9111169098278751,5.6289708084883614,4.9652211748817097,7.1127914544613136,5.3017699714622601,"Mohéli","Ndzouani","Ngazidja",10.467132622774891,4.8000196545125,3.7266694211716329,166.36762100000001,239.18582799999999,320.12415800000008,237.34947,176.00990899999999,65.95314599999999,79.27091200000001,39.480326000000012,20.746866000000001,34.654518000000003,130.70697699999999,188.379604,165.83141900000001,237.62573800000001,176.38748000000001,168.84392399999999,553.55429199999992,416.63877000000008]
["COM",2012,"COM_2012_DHS",222,"Hygiene ladder","Basic","h_bas",12.54827605557943,10.68948772810525,13.44886057347699,15.9021298024586,26.337288795442259,12.73373961027786,9.4019397431159639,13.9866727786679,21.133874999735738,33.156404730328603,12.672893488821551,9.0206030405641702,14.78632017970382,17.36504276204235,19.708998261705521,"Mohéli","Ndzouani","Ngazidja",23.690408075280541,24.41329807304728,5.6081769467672764,590.78022600000008,506.68337700000001,642.66062000000011,752.10635400000001,1235.1164180000001,192.367921,140.66342499999999,207.43720500000001,320.48172799999998,493.5788869999999,405.03566999999993,294.52340099999998,482.45724599999983,562.11818600000004,628.68332599999997,380.26373100000012,2740.5580169999998,606.52524699999981]
["COM",2012,"COM_2012_DHS",223,"Hygiene ladder","Limited","h_lim",38.006057824399541,34.391957033755808,31.185928099389489,35.697980115872063,40.706808635394133,48.197846448430603,31.824330384903551,38.770243699264888,45.649812856681621,45.76088588878897,32.548846255596573,32.641403142214152,33.748759953745662,31.60047084897602,35.245621784158658,"Mohéli","Ndzouani","Ngazidja",57.072049281406628,39.617223957848111,29.06829880920111,1789.347583,1630.184099999999,1490.235383,1688.369923,1908.9910150000001,728.12228000000016,476.127207,575.003871,692.25028099999997,681.2140009999996,1040.286795,1065.7443880000001,1101.175518,1022.928627,1124.275036,916.08512299999973,4447.3016469999993,3143.7412340000001]
["COM",2012,"COM_2012_DHS",224,"Hygiene ladder","No facility","h_nfac",49.445666120021087,54.918555238138808,55.365211327133437,48.399890081669092,32.95590256916347,39.06841394129161,58.773729871980507,47.243083522067138,33.216312143582691,21.08270938088236,54.778260255581927,58.337993817221658,51.464919866550531,51.034486388981648,45.045379954135832,"Mohéli","Ndzouani","Ngazidja",19.23754264331297,35.969477969104673,65.323524244031631,2327.9310780000001,2603.1480399999969,2645.6546889999991,2289.1188359999978,1545.503664000001,590.20443299999999,879.32005199999912,700.66507999999965,503.70417699999979,313.8452529999999,1750.7563970000001,1904.740100999999,1679.229395999999,1652.0208619999989,1436.8705560000001,308.78909800000002,4037.8174600000011,7064.7497490000114]
["COM",2012,"COM_2012_DHS",225,"Place where household members wash their hands","Observed","",48.96555547701211,43.788465028377132,43.803126646957438,50.009425551761232,64.671978146403433,60.367319486486792,40.292510851766679,51.40132394056387,66.20877970649498,76.887079190011093,43.248074913519019,40.646160802036718,47.416146954934078,47.334939110028166,52.493447415665393,"Mohéli","Ndzouani","Ngazidja",80.364487265767551,62.196751334974898,33.538432306996448]
["COM",2012,"COM_2012_DHS",226,"Place where household members wash their hands","Not observed: not in dwelling","",40.759953304534648,48.564626419623082,51.294348816830862,44.459099080111081,28.52127995175583,34.263186770431879,53.223408442046413,41.804682301002963,29.18903899060534,17.37574180216922,45.760990187936038,49.265569784885763,47.678972788838351,48.095403066529563,40.086070803847647,"Mohéli","Ndzouani","Ngazidja",18.955191706627069,29.49610912924587,59.833373796588837]
["COM",2012,"COM_2012_DHS",227,"Place where household members wash their hands","Not observed: no permission to see","",2.4313827160594772,1.879025259277401,1.042734203017013,1.450300799157731,2.8936087149348322,0.86289827335089175,1.5127860253264409,1.194387582269711,0.42383785974359922,1.836221495575731,3.3297888416792509,1.557082945077682,1.425577924260919,1.7880352365214489,3.359769107384539,"Mohéli","Ndzouani","Ngazidja",0.1728775027069254,1.7847916516532321,2.3524915088154321]
["COM",2012,"COM_2012_DHS",228,"Place where household members wash their hands","Not observed: other reason","",7.131776675445435,4.7788111777607103,3.0392648443053991,2.448760294289293,3.2685940628304819,4.4434279556620568,4.219118890933574,4.2244869944508796,3.7413301454158692,3.1645977481499479,6.6265189294695519,7.6499677713253273,2.5994690455345268,1.2396110604419901,2.941927241951841,"Mohéli","Ndzouani","Ngazidja",0.18755482912053639,5.4432386370240682,3.346304880411981]
["COM",2012,"COM_2012_DHS",229,"Place where household members wash their hands","missing","",0.71133182694831509,0.98907211496162217,0.82052548888918542,1.632414274680499,0.64453912407523628,0.063167514068463396,0.75217578992692891,1.3751191817125441,0.43701329774025599,0.73635976409393378,1.034627127396158,0.88121869667450881,0.87983328643211134,1.5420115264787779,1.118785431150547,"Mohéli","Ndzouani","Ngazidja",0.31988869577796292,1.079109247102114,0.92939750718730196]