{"text_format":"1","workbook":"xlsx","n_sheets":8,"sheets":["Introduction","Water","Sanitation","Hygiene","DHS03","DHS08","EDS16","data_summary"],"not_rendered":{"charts":123,"images":76,"macros":1,"external_links":0,"defined_names":0,"comments":0,"pivot_tables":0},"unopened":[],"bounds":{"document_bytes":16777216,"sheet_cells":100000,"rows_first":2000,"rows_last":500,"rows_between":2000,"halvings":0,"cell_chars":16384,"cell_head_chars":4096},"cells_cut":0,"cells_raw":0,"read":"whole","date_system":"1900"}

{"sheet":"Introduction","index":0,"n_rows":55,"n_cols":12,"rows_kept":55,"cut":false,"hidden":false,"merged":[[107,0,107,1],[1,0,1,1],[4,0,4,1],[5,0,5,1],[6,0,6,1],[7,0,7,1],[112,0,112,1],[113,0,113,1],[207,0,207,1],[212,0,212,1],[213,0,213,1]]}
[]
[]
[]
[null,null,"Joint Monitoring Programme for Water Supply, Sanitation and Hygiene"]
[]
[null,null,"Estimates on household water, sanitation and hygiene \nby wealth quintile and sub-national region in"]
[null,null,{"$f":"+Water!B5","v":"Bolivia (Plurinational State of)"}]
[]
[null,null,"Updated May 2021"]
[]
[null,null,"Follow the links below to find the following information: "]
[]
[null,null,"JMP Estimates"]
[null,null,"WASH status and trends by wealth quintile \n(customized quintiles made without water and sanitation assets)"]
[null,null,"Water"]
[null,null,"Sanitation"]
[null,null,"Hygiene"]
[]
[null,null,"Data inputs"]
[null,null," customized wealth quintiles and subnational data:"]
[null,null,{"$f":"IF(INDIRECT(CONCATENATE(\"Water\",\"!B105\"))=0,\"\",INDIRECT(CONCATENATE(\"Water\",\"!B105\")))","v":"DHS03"}]
[null,null,{"$f":"IF(INDIRECT(CONCATENATE(\"Water\",\"!B106\"))=0,\"\",INDIRECT(CONCATENATE(\"Water\",\"!B106\")))","v":"DHS08"}]
[null,null,{"$f":"IF(INDIRECT(CONCATENATE(\"Water\",\"!B107\"))=0,\"\",INDIRECT(CONCATENATE(\"Water\",\"!B107\")))","v":"EDS16"}]
[null,null,{"$f":"IF(INDIRECT(CONCATENATE(\"Water\",\"!B108\"))=0,\"\",INDIRECT(CONCATENATE(\"Water\",\"!B108\")))","v":""}]
[null,null,{"$f":"IF(INDIRECT(CONCATENATE(\"Water\",\"!B109\"))=0,\"\",INDIRECT(CONCATENATE(\"Water\",\"!B109\")))","v":""}]
[null,null,{"$f":"IF(INDIRECT(CONCATENATE(\"Water\",\"!B110\"))=0,\"\",INDIRECT(CONCATENATE(\"Water\",\"!B110\")))","v":""}]
[null,null,{"$f":"IF(INDIRECT(CONCATENATE(\"Water\",\"!B111\"))=0,\"\",INDIRECT(CONCATENATE(\"Water\",\"!B111\")))","v":""}]
[null,null,{"$f":"IF(INDIRECT(CONCATENATE(\"Water\",\"!B112\"))=0,\"\",INDIRECT(CONCATENATE(\"Water\",\"!B112\")))","v":""}]
[null,null,{"$f":"IF(INDIRECT(CONCATENATE(\"Water\",\"!B113\"))=0,\"\",INDIRECT(CONCATENATE(\"Water\",\"!B113\")))","v":""}]
[null,null,{"$f":"IF(INDIRECT(CONCATENATE(\"Water\",\"!B114\"))=0,\"\",INDIRECT(CONCATENATE(\"Water\",\"!B114\")))","v":""}]
[null,null,{"$f":"IF(INDIRECT(CONCATENATE(\"Water\",\"!B115\"))=0,\"\",INDIRECT(CONCATENATE(\"Water\",\"!B115\")))","v":""}]
[null,null,{"$f":"IF(INDIRECT(CONCATENATE(\"Water\",\"!B116\"))=0,\"\",INDIRECT(CONCATENATE(\"Water\",\"!B116\")))","v":""}]
[]
[]
[]
[]
[]
[]
[]
[]
[]
[]
[]
[]
[]
[]
[]
[]
[]
[]
[]
[]
[]
[]
[null,null,null,null,null,null,null,null,null,null,null,{"$f":"+IF(ISNUMBER(M48), \"\", \"Insufficient data to estimate safely managed sanitation services at national level\")","v":"Insufficient data to estimate safely managed sanitation services at national level"}]

{"sheet":"Water","index":1,"n_rows":318,"n_cols":28,"rows_kept":318,"cut":false,"hidden":false,"merged":[[3,1,3,24],[317,18,317,22],[117,18,117,22],[196,18,196,22],[296,23,296,27],[298,0,299,1],[300,0,301,1],[296,0,297,2],[296,3,296,7],[296,8,296,12],[296,13,296,17],[296,18,296,22],[196,23,196,27],[198,0,199,1],[200,0,201,1],[196,13,196,17],[96,8,96,12],[96,13,96,17],[96,18,96,22],[217,18,217,22],[98,0,99,1],[100,0,101,1],[196,0,197,2],[196,3,196,7],[196,8,196,12],[217,1,217,11],[35,3,36,3],[38,1,39,2],[38,3,39,3],[96,0,97,2],[96,3,96,7],[317,1,317,11],[6,9,6,16],[6,17,6,24],[6,1,6,8],[4,1,4,24],[117,1,117,11],[30,21,30,24],[32,1,33,2],[32,3,33,3],[30,17,30,20],[30,1,31,4],[30,5,30,8],[30,9,30,12],[30,13,30,16],[96,23,96,27],[35,1,36,2]]}
["BGD"]
[]
[]
[null,"Summary of trends in use of drinking water by wealth quintile (%)"]
[null,{"$f":"IF(ISERROR(INDIRECT(CONCATENATE($B105,\"!A2\"))),\"\",INDIRECT(CONCATENATE($B105,\"!A2\")))","v":"Bolivia (Plurinational State of)"}]
[]
[null,{"$f":"B118","v":"National use of drinking water sources, 2000–2020"},null,null,null,null,null,null,null,{"$f":"B218","v":"Urban use of drinking water sources,  2000–2020"},null,null,null,null,null,null,null,{"$f":"B318","v":"Rural use of drinking water sources, 2000–2020"}]
[]
[]
[]
[]
[]
[]
[]
[]
[]
[]
[]
[]
[]
[]
[]
[]
[]
[]
[]
[]
[]
[]
[]
[null,{"$f":"IF(ISERROR(INDIRECT(CONCATENATE($B105,\"!A2\"))),\"\",INDIRECT(CONCATENATE($B105,\"!A2\")))","v":"Bolivia (Plurinational State of)"},null,null,null,"Poorest",null,null,null,"Poor",null,null,null,"Middle",null,null,null,"Rich",null,null,null,"Richest"]
[null,null,null,null,null,"Basic","Limited","Unimproved","Surface \n water","Basic","Limited","Unimproved","Surface \nwater","Basic","Limited","Unimproved","Surface \nwater","Basic","Limited","Unimproved","Surface \nwater","Basic","Limited","Unimproved","Surface \nwater"]
[null,"NATIONAL",null,"Estimate",{"$f":"C99","v":2000},{"$f":"E99","v":42.778534042098165},{"$f":"F99","v":0.26051850974692353},23.935993468234756,33.024953979920156,{"$f":"J99","v":69.695166855093859},{"$f":"K99","v":0.11626502600513602},19.287068974301746,10.901499144599256,{"$f":"O99","v":91.500765649843856},{"$f":"P99","v":4.0181114280594746E-2},7.2637352149906746,1.1953180208848622,{"$f":"T99","v":96.863246811037911},{"$f":"U99","v":8.1383185490454812E-2},2.7686066581412803,0.28676334533035064,{"$f":"Y99","v":99.513865571163549},{"$f":"Z99","v":9.4825525405571962E-3},0.47665187629588956,0]
[null,null,null,null,{"$f":"C100","v":2020},{"$f":"E100","v":81.762016927366545},0.49792540302710042,5.9519898012654266,11.788067868340931,{"$f":"J100","v":98.289018795433762},0.16396510463960809,0.64879848301417553,0.89821761691246138,{"$f":"O100","v":98.59649415226751},4.3297091243574892E-2,0,1.3602087564889098,{"$f":"T100","v":99.667932132273549},8.3739644036447569E-2,0,0.24832822369000412,{"$f":"Y100","v":99.891944866491897},9.5185792466033411E-3,0,9.8536554261494186E-2]
[]
[null,"URBAN",null,"Estimate",{"$f":"C199","v":2000},{"$f":"E199","v":78.277236394982623},{"$f":"F199","v":0.1619243361618922},18.647433012546173,2.9134062563093153,{"$f":"J199","v":93.885938733221082},{"$f":"K199","v":3.1159290620984263E-2},5.3248915098033933,0.75801046635453417,{"$f":"O199","v":96.914964429160776},{"$f":"P199","v":8.6830082448547063E-2},2.4620797919705382,0.53612569642014307,{"$f":"T199","v":98.990033673046142},{"$f":"U199","v":8.9333143644115733E-3},0.96814643178080928,3.2886580808630494E-2,{"$f":"Y199","v":99.651434463486154},{"$f":"Z199","v":1.3750849982185225E-2},0.32969806525392187,5.1166212777307152E-3]
[null,null,null,null,{"$f":"C200","v":2020},{"$f":"E200","v":99.192304882315113},0.20518925884647618,0.60250585883841268,0,{"$f":"J200","v":99.966822558110692},3.3177441889307602E-2,0,0,{"$f":"O200","v":99.91048610710169},8.9513892898295921E-2,0,0,{"$f":"T200","v":99.984408383122897},9.0230512960149736E-3,0,6.5685655810802934E-3,{"$f":"Y200","v":99.899420458765974},1.3785069441615339E-2,5.4927462344991795E-2,3.1867009447430483E-2]
[]
[null,"RURAL",null,"Estimate",{"$f":"C299","v":2000},{"$f":"E299","v":37.404677701608314},{"$f":"F299","v":0.40111159051457052},23.056604442669368,39.137606265207751,{"$f":"J299","v":46.901072102493664},{"$f":"K299","v":0.36787599319236797},23.752249537626312,28.97880236668766,{"$f":"O299","v":56.427000927329388},{"$f":"P299","v":8.9516109919438383E-2},20.229984505057701,23.253498457693468,{"$f":"T299","v":68.990702606044266},{"$f":"U299","v":8.8101944243450664E-2},17.260324231621325,13.660871218090961,{"$f":"Y299","v":87.118990282926731},{"$f":"Z299","v":7.9835645356478274E-2},11.164914753416099,1.6362593183006879]
[null,null,null,null,{"$f":"C300","v":2020},{"$f":"E300","v":71.797905040578499},0.76992968944101481,5.3962724425448414,22.035892827435646,{"$f":"J300","v":81.471687235481511},0.63903609267851236,5.2798329268634916,12.609443744976488,{"$f":"O300","v":88.063855959339875},0.13970499371636469,5.7472684625724924,6.049170584371268,{"$f":"T300","v":94.44890292211818},0.12061236753328161,1.232571948671648,4.1979127616768892,{"$f":"Y300","v":95.030270207266938},8.7085524358797559E-2,0,4.8826442683742819]
[]
[]
[]
[]
[]
[]
[]
[]
[]
[]
[]
[]
[]
[]
[]
[]
[]
[]
[]
[]
[]
[]
[]
[]
[]
[]
[]
[]
[]
[]
[]
[]
[]
[]
[]
[]
[]
[]
[]
[]
[]
[]
[]
[]
[]
[]
[]
[]
[]
[]
[]
[]
[]
[]
[]
[]
["NATIONAL",null,null,"Poorest",null,null,null,null,"Poor",null,null,null,null,"Middle",null,null,null,null,"Rich",null,null,null,null,"Richest"]
[null,null,null,"Improved","Basic","Limited","Unimproved","Surface water","Improved","Basic","Limited","Unimproved","Surface water","Improved","Basic","Limited","Unimproved","Surface water","Improved","Basic","Limited","Unimproved","Surface water","Improved","Basic","Limited","Unimproved","Surface water"]
["Forecast period:",null,2000,{"$f":"IF((D101+H101)>100,D101*100/(D101+H101),D101)","v":43.039052551845089},{"$f":"D99*AVERAGEIF(E105:E116,\">0\")/100","v":42.778534042098165},{"$f":"D99*(100-AVERAGEIF(E105:E116,\">0\"))/100","v":0.26051850974692353},{"$f":"100-(E99+F99+H99)","v":23.935993468234756},{"$f":"IF((D101+H101)>100,H101*100/(D101+H101),H101)","v":33.024953979920156},{"$f":"IF((I101+M101)>100,I101*100/(I101+M101),I101)","v":69.811431881098997},{"$f":"I99*AVERAGEIF(J105:J116,\">0\")/100","v":69.695166855093859},{"$f":"I99*(100-AVERAGEIF(J105:J116,\">0\"))/100","v":0.11626502600513602},{"$f":"100-(J99+K99+M99)","v":19.287068974301746},{"$f":"IF((I101+M101)>100,M101*100/(I101+M101),M101)","v":10.901499144599256},{"$f":"IF((N101+R101)>100,N101*100/(N101+R101),N101)","v":91.540946764124442},{"$f":"N99*AVERAGEIF(O105:O116,\">0\")/100","v":91.500765649843856},{"$f":"N99*(100-AVERAGEIF(O105:O116,\">0\"))/100","v":4.0181114280594746E-2},{"$f":"100-(O99+P99+R99)","v":7.2637352149906746},{"$f":"IF((N101+R101)>100,R101*100/(N101+R101),R101)","v":1.1953180208848622},{"$f":"IF((S101+W101)>100,S101*100/(S101+W101),S101)","v":96.944629996528363},{"$f":"S99*AVERAGEIF(T105:T116,\">0\")/100","v":96.863246811037911},{"$f":"S99*(100-AVERAGEIF(T105:T116,\">0\"))/100","v":8.1383185490454812E-2},{"$f":"100-(T99+U99+W99)","v":2.7686066581412803},{"$f":"IF((S101+W101)>100,W101*100/(S101+W101),W101)","v":0.28676334533035064},{"$f":"IF((X101+AB101)>100,X101*100/(X101+AB101),X101)","v":99.52334812370411},{"$f":"X99*AVERAGEIF(Y105:Y116,\">0\")/100","v":99.513865571163549},{"$f":"X99*(100-AVERAGEIF(Y105:Y116,\">0\"))/100","v":9.4825525405571962E-3},{"$f":"100-(Y99+Z99+AB99)","v":0.47665187629588956},{"$f":"IF((X101+AB101)>100,AB101*100/(X101+AB101),AB101)","v":0}]
[null,null,2020,{"$f":"IF((D102+H102)>100,D102*100/(D102+H102),D102)","v":82.259942330393642},{"$f":"D100*AVERAGEIF(E105:E116,\">0\")/100","v":81.762016927366545},{"$f":"D100*(100-AVERAGEIF(E105:E116,\">0\"))/100","v":0.49792540302710042},{"$f":"100-(E100+F100+H100)","v":5.9519898012654266},{"$f":"IF((D102+H102)>100,H102*100/(D102+H102),H102)","v":11.788067868340931},{"$f":"IF((I102+M102)>100,I102*100/(I102+M102),I102)","v":98.452983900073377},{"$f":"I100*AVERAGEIF(J105:J116,\">0\")/100","v":98.289018795433762},{"$f":"I100*(100-AVERAGEIF(J105:J116,\">0\"))/100","v":0.16396510463960809},{"$f":"100-(J100+K100+M100)","v":0.64879848301417553},{"$f":"IF((I102+M102)>100,M102*100/(I102+M102),M102)","v":0.89821761691246138},{"$f":"IF((N102+R102)>100,N102*100/(N102+R102),N102)","v":98.639791243511098},{"$f":"N100*AVERAGEIF(O105:O116,\">0\")/100","v":98.59649415226751},{"$f":"N100*(100-AVERAGEIF(O105:O116,\">0\"))/100","v":4.3297091243574892E-2},{"$f":"100-(O100+P100+R100)","v":0},{"$f":"IF((N102+R102)>100,R102*100/(N102+R102),R102)","v":1.3602087564889098},{"$f":"IF((S102+W102)>100,S102*100/(S102+W102),S102)","v":99.75167177630999},{"$f":"S100*AVERAGEIF(T105:T116,\">0\")/100","v":99.667932132273549},{"$f":"S100*(100-AVERAGEIF(T105:T116,\">0\"))/100","v":8.3739644036447569E-2},{"$f":"100-(T100+U100+W100)","v":0},{"$f":"IF((S102+W102)>100,W102*100/(S102+W102),W102)","v":0.24832822369000412},{"$f":"IF((X102+AB102)>100,X102*100/(X102+AB102),X102)","v":99.901463445738514},{"$f":"X100*AVERAGEIF(Y105:Y116,\">0\")/100","v":99.891944866491897},{"$f":"X100*(100-AVERAGEIF(Y105:Y116,\">0\"))/100","v":9.5185792466033411E-3},{"$f":"100-(Y100+Z100+AB100)","v":0},{"$f":"IF((X102+AB102)>100,AB102*100/(X102+AB102),AB102)","v":9.8536554261494186E-2}]
["Regression period:",null,{"$f":"MinRegYear(C99,C105:C116)","v":2001},{"$f":"IF(MAX(C105:C116)-MIN(C105:C116)<5,AVERAGEIF(C105:C116,\">0\",D105:D116),\nIF(FORECAST($C101,D$105:D$116,$C$105:$C$116)<0,0,\nIF(FORECAST($C101,D$105:D$116,$C$105:$C$116)>100,100,\nFORECAST($C101,D$105:D$116,$C$105:$C$116))))","v":43.039052551845089},null,null,null,{"$f":"IF(MAX(C105:C116)-MIN(C105:C116)<5,AVERAGEIF(C105:C116,\">0\",H105:H116),\nIF(FORECAST($C101,H$105:H$116,$C$105:$C$116)<0,0,\nIF(FORECAST($C101,H$105:H$116,$C$105:$C$116)>100,100,\nFORECAST($C101,H$105:H$116,$C$105:$C$116))))","v":33.024953979920156},{"$f":"IF(MAX(C105:C116)-MIN(C105:C116)<5,AVERAGEIF(C105:C116,\">0\",I105:I116),\nIF(FORECAST($C101,I$105:I$116,$C$105:$C$116)<0,0,\nIF(FORECAST($C101,I$105:I$116,$C$105:$C$116)>100,100,\nFORECAST($C101,I$105:I$116,$C$105:$C$116))))","v":69.811431881098997},null,null,null,{"$f":"IF(MAX(C105:C116)-MIN(C105:C116)<5,AVERAGEIF(C105:C116,\">0\",M105:M116),\nIF(FORECAST($C101,M$105:M$116,$C$105:$C$116)<0,0,\nIF(FORECAST($C101,M$105:M$116,$C$105:$C$116)>100,100,\nFORECAST($C101,M$105:M$116,$C$105:$C$116))))","v":10.901499144599256},{"$f":"IF(MAX(C105:C116)-MIN(C105:C116)<5,AVERAGEIF(C105:C116,\">0\",N105:N116),\nIF(FORECAST($C101,N$105:N$116,$C$105:$C$116)<0,0,\nIF(FORECAST($C101,N$105:N$116,$C$105:$C$116)>100,100,\nFORECAST($C101,N$105:N$116,$C$105:$C$116))))","v":91.540946764124442},null,null,null,{"$f":"IF(MAX(C105:C116)-MIN(C105:C116)<5,AVERAGEIF(C105:C116,\">0\",R105:R116),\nIF(FORECAST($C101,R$105:R$116,$C$105:$C$116)<0,0,\nIF(FORECAST($C101,R$105:R$116,$C$105:$C$116)>100,100,\nFORECAST($C101,R$105:R$116,$C$105:$C$116))))","v":1.1953180208848622},{"$f":"IF(MAX(C105:C116)-MIN(C105:C116)<5,AVERAGEIF(C105:C116,\">0\",S105:S116),\nIF(FORECAST($C101,S$105:S$116,$C$105:$C$116)<0,0,\nIF(FORECAST($C101,S$105:S$116,$C$105:$C$116)>100,100,\nFORECAST($C101,S$105:S$116,$C$105:$C$116))))","v":96.944629996528363},null,null,null,{"$f":"IF(MAX(C105:C116)-MIN(C105:C116)<5,AVERAGEIF(C105:C116,\">0\",W105:W116),\nIF(FORECAST($C101,W$105:W$116,$C$105:$C$116)<0,0,\nIF(FORECAST($C101,W$105:W$116,$C$105:$C$116)>100,100,\nFORECAST($C101,W$105:W$116,$C$105:$C$116))))","v":0.28676334533035064},{"$f":"IF(MAX(C105:C116)-MIN(C105:C116)<5,AVERAGEIF(C105:C116,\">0\",X105:X116),\nIF(FORECAST($C101,X$105:X$116,$C$105:$C$116)<0,0,\nIF(FORECAST($C101,X$105:X$116,$C$105:$C$116)>100,100,\nFORECAST($C101,X$105:X$116,$C$105:$C$116))))","v":99.52334812370411},null,null,null,{"$f":"IF(MAX(C105:C116)-MIN(C105:C116)<5,AVERAGEIF(C105:C116,\">0\",AB105:AB116),\nIF(FORECAST($C101,AB$105:AB$116,$C$105:$C$116)<0,0,\nIF(FORECAST($C101,AB$105:AB$116,$C$105:$C$116)>100,100,\nFORECAST($C101,AB$105:AB$116,$C$105:$C$116))))","v":0}]
[null,null,{"$f":"MaxRegYear(C100,C105:C116)","v":2018},{"$f":"IF(MAX(C105:C116)-MIN(C105:C116)<5,AVERAGEIF(C105:C116,\">0\",D105:D116),\nIF(FORECAST($C102,D$105:D$116,$C$105:$C$116)<0,0,\nIF(FORECAST($C102,D$105:D$116,$C$105:$C$116)>100,100,\nFORECAST($C102,D$105:D$116,$C$105:$C$116))))","v":82.259942330393642},null,null,null,{"$f":"IF(MAX(C105:C116)-MIN(C105:C116)<5,AVERAGEIF(C105:C116,\">0\",H105:H116),\nIF(FORECAST($C102,H$105:H$116,$C$105:$C$116)<0,0,\nIF(FORECAST($C102,H$105:H$116,$C$105:$C$116)>100,100,\nFORECAST($C102,H$105:H$116,$C$105:$C$116))))","v":11.788067868340931},{"$f":"IF(MAX(C105:C116)-MIN(C105:C116)<5,AVERAGEIF(C105:C116,\">0\",I105:I116),\nIF(FORECAST($C102,I$105:I$116,$C$105:$C$116)<0,0,\nIF(FORECAST($C102,I$105:I$116,$C$105:$C$116)>100,100,\nFORECAST($C102,I$105:I$116,$C$105:$C$116))))","v":98.452983900073377},null,null,null,{"$f":"IF(MAX(C105:C116)-MIN(C105:C116)<5,AVERAGEIF(C105:C116,\">0\",M105:M116),\nIF(FORECAST($C102,M$105:M$116,$C$105:$C$116)<0,0,\nIF(FORECAST($C102,M$105:M$116,$C$105:$C$116)>100,100,\nFORECAST($C102,M$105:M$116,$C$105:$C$116))))","v":0.89821761691246138},{"$f":"IF(MAX(C105:C116)-MIN(C105:C116)<5,AVERAGEIF(C105:C116,\">0\",N105:N116),\nIF(FORECAST($C102,N$105:N$116,$C$105:$C$116)<0,0,\nIF(FORECAST($C102,N$105:N$116,$C$105:$C$116)>100,100,\nFORECAST($C102,N$105:N$116,$C$105:$C$116))))","v":98.862478631600879},null,null,null,{"$f":"IF(MAX(C105:C116)-MIN(C105:C116)<5,AVERAGEIF(C105:C116,\">0\",R105:R116),\nIF(FORECAST($C102,R$105:R$116,$C$105:$C$116)<0,0,\nIF(FORECAST($C102,R$105:R$116,$C$105:$C$116)>100,100,\nFORECAST($C102,R$105:R$116,$C$105:$C$116))))","v":1.3632795388924492},{"$f":"IF(MAX(C105:C116)-MIN(C105:C116)<5,AVERAGEIF(C105:C116,\">0\",S105:S116),\nIF(FORECAST($C102,S$105:S$116,$C$105:$C$116)<0,0,\nIF(FORECAST($C102,S$105:S$116,$C$105:$C$116)>100,100,\nFORECAST($C102,S$105:S$116,$C$105:$C$116))))","v":99.929745768303519},null,null,null,{"$f":"IF(MAX(C105:C116)-MIN(C105:C116)<5,AVERAGEIF(C105:C116,\">0\",W105:W116),\nIF(FORECAST($C102,W$105:W$116,$C$105:$C$116)<0,0,\nIF(FORECAST($C102,W$105:W$116,$C$105:$C$116)>100,100,\nFORECAST($C102,W$105:W$116,$C$105:$C$116))))","v":0.24877153253214868},{"$f":"IF(MAX(C105:C116)-MIN(C105:C116)<5,AVERAGEIF(C105:C116,\">0\",X105:X116),\nIF(FORECAST($C102,X$105:X$116,$C$105:$C$116)<0,0,\nIF(FORECAST($C102,X$105:X$116,$C$105:$C$116)>100,100,\nFORECAST($C102,X$105:X$116,$C$105:$C$116))))","v":99.906097895753476},null,null,null,{"$f":"IF(MAX(C105:C116)-MIN(C105:C116)<5,AVERAGEIF(C105:C116,\">0\",AB105:AB116),\nIF(FORECAST($C102,AB$105:AB$116,$C$105:$C$116)<0,0,\nIF(FORECAST($C102,AB$105:AB$116,$C$105:$C$116)>100,100,\nFORECAST($C102,AB$105:AB$116,$C$105:$C$116))))","v":9.8541125393083462E-2}]
[]
[null,"Survey","Year","Improved","% Improved\n< = 30min",null,null,"Surface water","Improved","% Improved\n< = 30min",null,null,"Surface water","Improved","% Improved\n< = 30min",null,null,"Surface water","Improved","% Improved\n< = 30min",null,null,"Surface water","Improved","% Improved\n< = 30min",null,null,"Surface water"]
[null,"DHS03",2003,{"$f":"IF(ISERROR(INDIRECT(CONCATENATE($B105,\"!C16\"))),\"\",INDIRECT(CONCATENATE($B105,\"!C16\")))","v":47.32518094956319},{"$f":"IF(ISERROR(INDIRECT(CONCATENATE($B105,\"!C23\"))),\"\",INDIRECT(CONCATENATE($B105,\"!C23\")))","v":"N/A"},null,null,{"$f":"IF(ISERROR(INDIRECT(CONCATENATE($B105,\"!C21\"))),\"\",INDIRECT(CONCATENATE($B105,\"!C21\")))","v":33.080020104841942},{"$f":"IF(ISERROR(INDIRECT(CONCATENATE($B105,\"!D16\"))),\"\",INDIRECT(CONCATENATE($B105,\"!D16\")))","v":73.010652416466357},{"$f":"IF(ISERROR(INDIRECT(CONCATENATE($B105,\"!D23\"))),\"\",INDIRECT(CONCATENATE($B105,\"!D23\")))","v":"N/A"},null,null,{"$f":"IF(ISERROR(INDIRECT(CONCATENATE($B105,\"!D21\"))),\"\",INDIRECT(CONCATENATE($B105,\"!D21\")))","v":10.958061420343093},{"$f":"IF(ISERROR(INDIRECT(CONCATENATE($B105,\"!E16\"))),\"\",INDIRECT(CONCATENATE($B105,\"!E16\")))","v":91.597231389219061},{"$f":"IF(ISERROR(INDIRECT(CONCATENATE($B105,\"!E23\"))),\"\",INDIRECT(CONCATENATE($B105,\"!E23\")))","v":"N/A"},null,null,{"$f":"IF(ISERROR(INDIRECT(CONCATENATE($B105,\"!E21\"))),\"\",INDIRECT(CONCATENATE($B105,\"!E21\")))","v":1.6531407156869922},{"$f":"IF(ISERROR(INDIRECT(CONCATENATE($B105,\"!F16\"))),\"\",INDIRECT(CONCATENATE($B105,\"!F16\")))","v":96.827162890674344},{"$f":"IF(ISERROR(INDIRECT(CONCATENATE($B105,\"!F23\"))),\"\",INDIRECT(CONCATENATE($B105,\"!F23\")))","v":"N/A"},null,null,{"$f":"IF(ISERROR(INDIRECT(CONCATENATE($B105,\"!F21\"))),\"\",INDIRECT(CONCATENATE($B105,\"!F21\")))","v":0.39372342620812589},{"$f":"IF(ISERROR(INDIRECT(CONCATENATE($B105,\"!G16\"))),\"\",INDIRECT(CONCATENATE($B105,\"!G16\")))","v":99.648390356642906},{"$f":"IF(ISERROR(INDIRECT(CONCATENATE($B105,\"!G23\"))),\"\",INDIRECT(CONCATENATE($B105,\"!G23\")))","v":"N/A"},null,null,{"$f":"IF(ISERROR(INDIRECT(CONCATENATE($B105,\"!G221\"))),\"\",INDIRECT(CONCATENATE($B105,\"!G21\")))","v":0}]
[null,"DHS08",2008,59.721983330854677,99.825985938756148,null,null,20.130878430234837,81.881869581391356,99.966488423692184,null,null,4.7781951136453955,95.863937286089111,100,null,null,0.55262705710067517,98.935363258876151,99.908095364398193,null,null,9.0046385599165932E-2,99.550930093031866,100,null,null,4.5448828033315333E-2]
[null,"EDS16",2016,77.44066129777471,98.963399541172336,null,null,15.882477129513193,94.976905907521186,99.700428518498157,null,null,2.8459610960161021,97.497951900561645,99.912211713553432,null,null,1.6173084329364464,99.285644929599471,99.924008413823728,null,null,0.32288472376276744,99.911076540801375,99.980944064444515,null,null,8.2698652717998616E-2]
[null,null,null,"","",null,null,"","","",null,null,"","","",null,null,"","","",null,null,"","","",null,null,""]
[null,null,null,"","",null,null,"","","",null,null,"","","",null,null,"","","",null,null,"","","",null,null,""]
[null,null,null,"","",null,null,"","","",null,null,"","","",null,null,"","","",null,null,"","","",null,null,""]
[null,null,null,{"$f":"IF(ISERROR(INDIRECT(CONCATENATE($B111,\"!C16\"))),\"\",INDIRECT(CONCATENATE($B111,\"!C16\")))","v":""},{"$f":"IF(ISERROR(INDIRECT(CONCATENATE($B111,\"!C23\"))),\"\",INDIRECT(CONCATENATE($B111,\"!C23\")))","v":""},null,null,{"$f":"IF(ISERROR(INDIRECT(CONCATENATE($B111,\"!C21\"))),\"\",INDIRECT(CONCATENATE($B111,\"!C21\")))","v":""},{"$f":"IF(ISERROR(INDIRECT(CONCATENATE($B111,\"!D16\"))),\"\",INDIRECT(CONCATENATE($B111,\"!D16\")))","v":""},{"$f":"IF(ISERROR(INDIRECT(CONCATENATE($B111,\"!D23\"))),\"\",INDIRECT(CONCATENATE($B111,\"!D23\")))","v":""},null,null,{"$f":"IF(ISERROR(INDIRECT(CONCATENATE($B111,\"!D21\"))),\"\",INDIRECT(CONCATENATE($B111,\"!D21\")))","v":""},{"$f":"IF(ISERROR(INDIRECT(CONCATENATE($B111,\"!E16\"))),\"\",INDIRECT(CONCATENATE($B111,\"!E16\")))","v":""},{"$f":"IF(ISERROR(INDIRECT(CONCATENATE($B111,\"!E23\"))),\"\",INDIRECT(CONCATENATE($B111,\"!E23\")))","v":""},null,null,{"$f":"IF(ISERROR(INDIRECT(CONCATENATE($B111,\"!E21\"))),\"\",INDIRECT(CONCATENATE($B111,\"!E21\")))","v":""},{"$f":"IF(ISERROR(INDIRECT(CONCATENATE($B111,\"!F16\"))),\"\",INDIRECT(CONCATENATE($B111,\"!F16\")))","v":""},{"$f":"IF(ISERROR(INDIRECT(CONCATENATE($B111,\"!F23\"))),\"\",INDIRECT(CONCATENATE($B111,\"!F23\")))","v":""},null,null,{"$f":"IF(ISERROR(INDIRECT(CONCATENATE($B111,\"!F21\"))),\"\",INDIRECT(CONCATENATE($B111,\"!F21\")))","v":""},{"$f":"IF(ISERROR(INDIRECT(CONCATENATE($B111,\"!G16\"))),\"\",INDIRECT(CONCATENATE($B111,\"!G16\")))","v":""},{"$f":"IF(ISERROR(INDIRECT(CONCATENATE($B111,\"!G23\"))),\"\",INDIRECT(CONCATENATE($B111,\"!G23\")))","v":""},null,null,{"$f":"IF(ISERROR(INDIRECT(CONCATENATE($B111,\"!G221\"))),\"\",INDIRECT(CONCATENATE($B111,\"!G21\")))","v":""}]
[null,null,null,{"$f":"IF(ISERROR(INDIRECT(CONCATENATE($B112,\"!C16\"))),\"\",INDIRECT(CONCATENATE($B112,\"!C16\")))","v":""},{"$f":"IF(ISERROR(INDIRECT(CONCATENATE($B112,\"!C23\"))),\"\",INDIRECT(CONCATENATE($B112,\"!C23\")))","v":""},null,null,{"$f":"IF(ISERROR(INDIRECT(CONCATENATE($B112,\"!C21\"))),\"\",INDIRECT(CONCATENATE($B112,\"!C21\")))","v":""},{"$f":"IF(ISERROR(INDIRECT(CONCATENATE($B112,\"!D16\"))),\"\",INDIRECT(CONCATENATE($B112,\"!D16\")))","v":""},{"$f":"IF(ISERROR(INDIRECT(CONCATENATE($B112,\"!D23\"))),\"\",INDIRECT(CONCATENATE($B112,\"!D23\")))","v":""},null,null,{"$f":"IF(ISERROR(INDIRECT(CONCATENATE($B112,\"!D21\"))),\"\",INDIRECT(CONCATENATE($B112,\"!D21\")))","v":""},{"$f":"IF(ISERROR(INDIRECT(CONCATENATE($B112,\"!E16\"))),\"\",INDIRECT(CONCATENATE($B112,\"!E16\")))","v":""},{"$f":"IF(ISERROR(INDIRECT(CONCATENATE($B112,\"!E23\"))),\"\",INDIRECT(CONCATENATE($B112,\"!E23\")))","v":""},null,null,{"$f":"IF(ISERROR(INDIRECT(CONCATENATE($B112,\"!E21\"))),\"\",INDIRECT(CONCATENATE($B112,\"!E21\")))","v":""},{"$f":"IF(ISERROR(INDIRECT(CONCATENATE($B112,\"!F16\"))),\"\",INDIRECT(CONCATENATE($B112,\"!F16\")))","v":""},{"$f":"IF(ISERROR(INDIRECT(CONCATENATE($B112,\"!F23\"))),\"\",INDIRECT(CONCATENATE($B112,\"!F23\")))","v":""},null,null,{"$f":"IF(ISERROR(INDIRECT(CONCATENATE($B112,\"!F21\"))),\"\",INDIRECT(CONCATENATE($B112,\"!F21\")))","v":""},{"$f":"IF(ISERROR(INDIRECT(CONCATENATE($B112,\"!G16\"))),\"\",INDIRECT(CONCATENATE($B112,\"!G16\")))","v":""},{"$f":"IF(ISERROR(INDIRECT(CONCATENATE($B112,\"!G23\"))),\"\",INDIRECT(CONCATENATE($B112,\"!G23\")))","v":""},null,null,{"$f":"IF(ISERROR(INDIRECT(CONCATENATE($B112,\"!G221\"))),\"\",INDIRECT(CONCATENATE($B112,\"!G21\")))","v":""}]
[null,null,null,"","",null,null,"","","",null,null,"","","",null,null,"","","",null,null,"","","",null,null,""]
[null,null,null,"","",null,null,"","","",null,null,"","","",null,null,"","","",null,null,"","","",null,null,""]
[null,null,null,"","",null,null,"","","",null,null,"","","",null,null,"","","",null,null,"","","",null,null,""]
[null,null,null,"","",null,null,"","","",null,null,"","","",null,null,"","","",null,null,"","","",null,null,""]
[]
[null,{"$f":"CONCATENATE(\"National use of drinking water sources, \",C99,\"–\",C100)","v":"National use of drinking water sources, 2000–2020"},null,null,null,null,null,null,null,null,null,null,null,null,null,null,null,null,"Data points used for regression"]
[]
[]
[]
[]
[]
[]
[]
[]
[]
[]
[]
[]
[]
[]
[]
[]
[]
[]
[]
[]
[]
[]
[]
[]
[]
[]
[]
[]
[]
[]
[]
[]
[]
[]
[null,null,null,null,{"$f":"IF(ISERROR(INDIRECT(CONCATENATE($B153,\"!M18\"))),\"\",INDIRECT(CONCATENATE($B153,\"!M18\")))","v":""},{"$f":"IF(ISERROR(INDIRECT(CONCATENATE($B153,\"!M19\"))),\"\",INDIRECT(CONCATENATE($B153,\"!M19\")))","v":""},{"$f":"IF(ISERROR(INDIRECT(CONCATENATE($B153,\"!M20\"))),\"\",INDIRECT(CONCATENATE($B153,\"!M20\")))","v":""},{"$f":"IF(ISERROR(INDIRECT(CONCATENATE($B153,\"!M21\"))),\"\",INDIRECT(CONCATENATE($B153,\"!M21\")))","v":""},null,{"$f":"IF(ISERROR(INDIRECT(CONCATENATE($B153,\"!N18\"))),\"\",INDIRECT(CONCATENATE($B153,\"!N18\")))","v":""},{"$f":"IF(ISERROR(INDIRECT(CONCATENATE($B153,\"!N19\"))),\"\",INDIRECT(CONCATENATE($B153,\"!N19\")))","v":""},{"$f":"IF(ISERROR(INDIRECT(CONCATENATE($B153,\"!N20\"))),\"\",INDIRECT(CONCATENATE($B153,\"!N20\")))","v":""},{"$f":"IF(ISERROR(INDIRECT(CONCATENATE($B153,\"!N21\"))),\"\",INDIRECT(CONCATENATE($B153,\"!N21\")))","v":""},null,{"$f":"IF(ISERROR(INDIRECT(CONCATENATE($B153,\"!O18\"))),\"\",INDIRECT(CONCATENATE($B153,\"!O18\")))","v":""},{"$f":"IF(ISERROR(INDIRECT(CONCATENATE($B153,\"!O19\"))),\"\",INDIRECT(CONCATENATE($B153,\"!O19\")))","v":""},{"$f":"IF(ISERROR(INDIRECT(CONCATENATE($B153,\"!O20\"))),\"\",INDIRECT(CONCATENATE($B153,\"!O20\")))","v":""},{"$f":"IF(ISERROR(INDIRECT(CONCATENATE($B153,\"!O21\"))),\"\",INDIRECT(CONCATENATE($B153,\"!O21\")))","v":""},null,{"$f":"IF(ISERROR(INDIRECT(CONCATENATE($B153,\"!P18\"))),\"\",INDIRECT(CONCATENATE($B153,\"!P18\")))","v":""},{"$f":"IF(ISERROR(INDIRECT(CONCATENATE($B153,\"!P19\"))),\"\",INDIRECT(CONCATENATE($B153,\"!P19\")))","v":""},{"$f":"IF(ISERROR(INDIRECT(CONCATENATE($B153,\"!P20\"))),\"\",INDIRECT(CONCATENATE($B153,\"!P20\")))","v":""},{"$f":"IF(ISERROR(INDIRECT(CONCATENATE($B153,\"!P21\"))),\"\",INDIRECT(CONCATENATE($B153,\"!P21\")))","v":""},null,{"$f":"IF(ISERROR(INDIRECT(CONCATENATE($B153,\"!Q18\"))),\"\",INDIRECT(CONCATENATE($B153,\"!Q18\")))","v":""},{"$f":"IF(ISERROR(INDIRECT(CONCATENATE($B153,\"!Q19\"))),\"\",INDIRECT(CONCATENATE($B153,\"!Q19\")))","v":""},{"$f":"IF(ISERROR(INDIRECT(CONCATENATE($B153,\"!Q20\"))),\"\",INDIRECT(CONCATENATE($B153,\"!Q20\")))","v":""},{"$f":"IF(ISERROR(INDIRECT(CONCATENATE($B153,\"!Q21\"))),\"\",INDIRECT(CONCATENATE($B153,\"!Q1\")))","v":""}]
[null,null,null,null,"","","","",null,"","","","",null,"","","","",null,"","","","",null,"","","",""]
[null,null,null,null,"","","","",null,"","","","",null,"","","","",null,"","","","",null,"","","",""]
[null,null,null,null,"","","","",null,"","","","",null,"","","","",null,"","","","",null,"","","",""]
[null,null,null,null,"","","","",null,"","","","",null,"","","","",null,"","","","",null,"","","",""]
[null,null,null,null,"","","","",null,"","","","",null,"","","","",null,"","","","",null,"","","",""]
[]
[]
[]
[]
[]
[]
[]
[]
[]
[]
[]
[]
[]
[]
[]
[]
[]
[]
[]
[]
[]
[]
[]
[]
[]
[]
[]
[]
[]
[]
[]
[]
[]
[]
[]
[]
[]
[]
["URBAN",null,null,"Poorest",null,null,null,null,"Poor",null,null,null,null,"Middle",null,null,null,null,"Rich",null,null,null,null,"Richest"]
[null,null,null,"Improved","Basic","Limited","Unimproved","Surface water","Improved","Basic","Limited","Unimproved","Surface water","Improved","Basic","Limited","Unimproved","Surface water","Improved","Basic","Limited","Unimproved","Surface water","Improved","Basic","Limited","Unimproved","Surface water"]
["Forecast period:",null,2000,{"$f":"IF((D201+H201)>100,D201*100/(D201+H201),D201)","v":78.439160731144511},{"$f":"D199*AVERAGEIF(E205:E216,\">0\")/100","v":78.277236394982623},{"$f":"D199*(100-AVERAGEIF(E205:E216,\">0\"))/100","v":0.1619243361618922},{"$f":"100-(E199+F199+H199)","v":18.647433012546173},{"$f":"IF((D201+H201)>100,H201*100/(D201+H201),H201)","v":2.9134062563093153},{"$f":"IF((I201+M201)>100,I201*100/(I201+M201),I201)","v":93.917098023842073},{"$f":"I199*AVERAGEIF(J205:J216,\">0\")/100","v":93.885938733221082},{"$f":"I199*(100-AVERAGEIF(J205:J216,\">0\"))/100","v":3.1159290620984263E-2},{"$f":"100-(J199+K199+M199)","v":5.3248915098033933},{"$f":"IF((I201+M201)>100,M201*100/(I201+M201),M201)","v":0.75801046635453417},{"$f":"IF((N201+R201)>100,N201*100/(N201+R201),N201)","v":97.001794511609319},{"$f":"N199*AVERAGEIF(O205:O216,\">0\")/100","v":96.914964429160776},{"$f":"N199*(100-AVERAGEIF(O205:O216,\">0\"))/100","v":8.6830082448547063E-2},{"$f":"100-(O199+P199+R199)","v":2.4620797919705382},{"$f":"IF((N201+R201)>100,R201*100/(N201+R201),R201)","v":0.53612569642014307},{"$f":"IF((S201+W201)>100,S201*100/(S201+W201),S201)","v":98.998966987410554},{"$f":"S199*AVERAGEIF(T205:T216,\">0\")/100","v":98.990033673046142},{"$f":"S199*(100-AVERAGEIF(T205:T216,\">0\"))/100","v":8.9333143644115733E-3},{"$f":"100-(T199+U199+W199)","v":0.96814643178080928},{"$f":"IF((S201+W201)>100,W201*100/(S201+W201),W201)","v":3.2886580808630494E-2},{"$f":"IF((X201+AB201)>100,X201*100/(X201+AB201),X201)","v":99.665185313468328},{"$f":"X199*AVERAGEIF(Y205:Y216,\">0\")/100","v":99.651434463486154},{"$f":"X199*(100-AVERAGEIF(Y205:Y216,\">0\"))/100","v":1.3750849982185225E-2},{"$f":"100-(Y199+Z199+AB199)","v":0.32969806525392187},{"$f":"IF((X201+AB201)>100,AB201*100/(X201+AB201),AB201)","v":5.1166212777307152E-3}]
[null,null,2020,{"$f":"IF((D202+H202)>100,D202*100/(D202+H202),D202)","v":99.397494141161587},{"$f":"D200*AVERAGEIF(E205:E216,\">0\")/100","v":99.192304882315113},{"$f":"D200*(100-AVERAGEIF(E205:E216,\">0\"))/100","v":0.20518925884647618},{"$f":"100-(E200+F200+H200)","v":0.60250585883841268},{"$f":"IF((D202+H202)>100,H202*100/(D202+H202),H202)","v":0},{"$f":"IF((I202+M202)>100,I202*100/(I202+M202),I202)","v":100},{"$f":"I200*AVERAGEIF(J205:J216,\">0\")/100","v":99.966822558110692},{"$f":"I200*(100-AVERAGEIF(J205:J216,\">0\"))/100","v":3.3177441889307602E-2},{"$f":"100-(J200+K200+M200)","v":0},{"$f":"IF((I202+M202)>100,M202*100/(I202+M202),M202)","v":0},{"$f":"IF((N202+R202)>100,N202*100/(N202+R202),N202)","v":100},{"$f":"N200*AVERAGEIF(O205:O216,\">0\")/100","v":99.91048610710169},{"$f":"N200*(100-AVERAGEIF(O205:O216,\">0\"))/100","v":8.9513892898295921E-2},{"$f":"100-(O200+P200+R200)","v":0},{"$f":"IF((N202+R202)>100,R202*100/(N202+R202),R202)","v":0},{"$f":"IF((S202+W202)>100,S202*100/(S202+W202),S202)","v":99.993431434418923},{"$f":"S200*AVERAGEIF(T205:T216,\">0\")/100","v":99.984408383122897},{"$f":"S200*(100-AVERAGEIF(T205:T216,\">0\"))/100","v":9.0230512960149736E-3},{"$f":"100-(T200+U200+W200)","v":0},{"$f":"IF((S202+W202)>100,W202*100/(S202+W202),W202)","v":6.5685655810802934E-3},{"$f":"IF((X202+AB202)>100,X202*100/(X202+AB202),X202)","v":99.913205528207598},{"$f":"X200*AVERAGEIF(Y205:Y216,\">0\")/100","v":99.899420458765974},{"$f":"X200*(100-AVERAGEIF(Y205:Y216,\">0\"))/100","v":1.3785069441615339E-2},{"$f":"100-(Y200+Z200+AB200)","v":5.4927462344991795E-2},{"$f":"IF((X202+AB202)>100,AB202*100/(X202+AB202),AB202)","v":3.1867009447430483E-2}]
["Regression period:",null,{"$f":"MinRegYear(C199,C205:C216)","v":2001},{"$f":"IF(MAX(C205:C216)-MIN(C205:C216)<5,AVERAGEIF(C205:C216,\">0\",D205:D216),\nIF(FORECAST($C201,D$205:D$216,$C$205:$C$216)<0,0,\nIF(FORECAST($C201,D$205:D$216,$C$205:$C$216)>100,100,\nFORECAST($C201,D$205:D$216,$C$205:$C$216))))","v":78.439160731144511},null,null,null,{"$f":"IF(MAX(C205:C216)-MIN(C205:C216)<5,AVERAGEIF(C205:C216,\">0\",H205:H216),\nIF(FORECAST($C201,H$205:H$216,$C$205:$C$216)<0,0,\nIF(FORECAST($C201,H$205:H$216,$C$205:$C$216)>100,100,\nFORECAST($C201,H$205:H$216,$C$205:$C$216))))","v":2.9134062563093153},{"$f":"IF(MAX(C205:C216)-MIN(C205:C216)<5,AVERAGEIF(C205:C216,\">0\",I205:I216),\nIF(FORECAST($C201,I$205:I$216,$C$205:$C$216)<0,0,\nIF(FORECAST($C201,I$205:I$216,$C$205:$C$216)>100,100,\nFORECAST($C201,I$205:I$216,$C$205:$C$216))))","v":93.917098023842073},null,null,null,{"$f":"IF(MAX(C205:C216)-MIN(C205:C216)<5,AVERAGEIF(C205:C216,\">0\",M205:M216),\nIF(FORECAST($C201,M$205:M$216,$C$205:$C$216)<0,0,\nIF(FORECAST($C201,M$205:M$216,$C$205:$C$216)>100,100,\nFORECAST($C201,M$205:M$216,$C$205:$C$216))))","v":0.75801046635453417},{"$f":"IF(MAX(C205:C216)-MIN(C205:C216)<5,AVERAGEIF(C205:C216,\">0\",N205:N216),\nIF(FORECAST($C201,N$205:N$216,$C$205:$C$216)<0,0,\nIF(FORECAST($C201,N$205:N$216,$C$205:$C$216)>100,100,\nFORECAST($C201,N$205:N$216,$C$205:$C$216))))","v":97.001794511609319},null,null,null,{"$f":"IF(MAX(C205:C216)-MIN(C205:C216)<5,AVERAGEIF(C205:C216,\">0\",R205:R216),\nIF(FORECAST($C201,R$205:R$216,$C$205:$C$216)<0,0,\nIF(FORECAST($C201,R$205:R$216,$C$205:$C$216)>100,100,\nFORECAST($C201,R$205:R$216,$C$205:$C$216))))","v":0.53612569642014307},{"$f":"IF(MAX(C205:C216)-MIN(C205:C216)<5,AVERAGEIF(C205:C216,\">0\",S205:S216),\nIF(FORECAST($C201,S$205:S$216,$C$205:$C$216)<0,0,\nIF(FORECAST($C201,S$205:S$216,$C$205:$C$216)>100,100,\nFORECAST($C201,S$205:S$216,$C$205:$C$216))))","v":98.998966987410554},null,null,null,{"$f":"IF(MAX(C205:C216)-MIN(C205:C216)<5,AVERAGEIF(C205:C216,\">0\",W205:W216),\nIF(FORECAST($C201,W$205:W$216,$C$205:$C$216)<0,0,\nIF(FORECAST($C201,W$205:W$216,$C$205:$C$216)>100,100,\nFORECAST($C201,W$205:W$216,$C$205:$C$216))))","v":3.2886580808630494E-2},{"$f":"IF(MAX(C205:C216)-MIN(C205:C216)<5,AVERAGEIF(C205:C216,\">0\",X205:X216),\nIF(FORECAST($C201,X$205:X$216,$C$205:$C$216)<0,0,\nIF(FORECAST($C201,X$205:X$216,$C$205:$C$216)>100,100,\nFORECAST($C201,X$205:X$216,$C$205:$C$216))))","v":99.665185313468328},null,null,null,{"$f":"IF(MAX(C205:C216)-MIN(C205:C216)<5,AVERAGEIF(C205:C216,\">0\",AB205:AB216),\nIF(FORECAST($C201,AB$205:AB$216,$C$205:$C$216)<0,0,\nIF(FORECAST($C201,AB$205:AB$216,$C$205:$C$216)>100,100,\nFORECAST($C201,AB$205:AB$216,$C$205:$C$216))))","v":5.1166212777307152E-3}]
[null,null,{"$f":"MaxRegYear(C200,C205:C216)","v":2018},{"$f":"IF(MAX(C205:C216)-MIN(C205:C216)<5,AVERAGEIF(C205:C216,\">0\",D205:D216),\nIF(FORECAST($C202,D$205:D$216,$C$205:$C$216)<0,0,\nIF(FORECAST($C202,D$205:D$216,$C$205:$C$216)>100,100,\nFORECAST($C202,D$205:D$216,$C$205:$C$216))))","v":99.397494141161587},null,null,null,{"$f":"IF(MAX(C205:C216)-MIN(C205:C216)<5,AVERAGEIF(C205:C216,\">0\",H205:H216),\nIF(FORECAST($C202,H$205:H$216,$C$205:$C$216)<0,0,\nIF(FORECAST($C202,H$205:H$216,$C$205:$C$216)>100,100,\nFORECAST($C202,H$205:H$216,$C$205:$C$216))))","v":0},{"$f":"IF(MAX(C205:C216)-MIN(C205:C216)<5,AVERAGEIF(C205:C216,\">0\",I205:I216),\nIF(FORECAST($C202,I$205:I$216,$C$205:$C$216)<0,0,\nIF(FORECAST($C202,I$205:I$216,$C$205:$C$216)>100,100,\nFORECAST($C202,I$205:I$216,$C$205:$C$216))))","v":100},null,null,null,{"$f":"IF(MAX(C205:C216)-MIN(C205:C216)<5,AVERAGEIF(C205:C216,\">0\",M205:M216),\nIF(FORECAST($C202,M$205:M$216,$C$205:$C$216)<0,0,\nIF(FORECAST($C202,M$205:M$216,$C$205:$C$216)>100,100,\nFORECAST($C202,M$205:M$216,$C$205:$C$216))))","v":0},{"$f":"IF(MAX(C205:C216)-MIN(C205:C216)<5,AVERAGEIF(C205:C216,\">0\",N205:N216),\nIF(FORECAST($C202,N$205:N$216,$C$205:$C$216)<0,0,\nIF(FORECAST($C202,N$205:N$216,$C$205:$C$216)>100,100,\nFORECAST($C202,N$205:N$216,$C$205:$C$216))))","v":100},null,null,null,{"$f":"IF(MAX(C205:C216)-MIN(C205:C216)<5,AVERAGEIF(C205:C216,\">0\",R205:R216),\nIF(FORECAST($C202,R$205:R$216,$C$205:$C$216)<0,0,\nIF(FORECAST($C202,R$205:R$216,$C$205:$C$216)>100,100,\nFORECAST($C202,R$205:R$216,$C$205:$C$216))))","v":0},{"$f":"IF(MAX(C205:C216)-MIN(C205:C216)<5,AVERAGEIF(C205:C216,\">0\",S205:S216),\nIF(FORECAST($C202,S$205:S$216,$C$205:$C$216)<0,0,\nIF(FORECAST($C202,S$205:S$216,$C$205:$C$216)>100,100,\nFORECAST($C202,S$205:S$216,$C$205:$C$216))))","v":99.999304637180771},null,null,null,{"$f":"IF(MAX(C205:C216)-MIN(C205:C216)<5,AVERAGEIF(C205:C216,\">0\",W205:W216),\nIF(FORECAST($C202,W$205:W$216,$C$205:$C$216)<0,0,\nIF(FORECAST($C202,W$205:W$216,$C$205:$C$216)>100,100,\nFORECAST($C202,W$205:W$216,$C$205:$C$216))))","v":6.5689513915976327E-3},{"$f":"IF(MAX(C205:C216)-MIN(C205:C216)<5,AVERAGEIF(C205:C216,\">0\",X205:X216),\nIF(FORECAST($C202,X$205:X$216,$C$205:$C$216)<0,0,\nIF(FORECAST($C202,X$205:X$216,$C$205:$C$216)>100,100,\nFORECAST($C202,X$205:X$216,$C$205:$C$216))))","v":99.913205528207598},null,null,null,{"$f":"IF(MAX(C205:C216)-MIN(C205:C216)<5,AVERAGEIF(C205:C216,\">0\",AB205:AB216),\nIF(FORECAST($C202,AB$205:AB$216,$C$205:$C$216)<0,0,\nIF(FORECAST($C202,AB$205:AB$216,$C$205:$C$216)>100,100,\nFORECAST($C202,AB$205:AB$216,$C$205:$C$216))))","v":3.1867009447430483E-2}]
[]
[null,"Survey","Year","Improved","% Improved\n< = 30min",null,null,"Surface water","Improved","% Improved\n< = 30min",null,null,"Surface water","Improved","% Improved\n< = 30min",null,null,"Surface water","Improved","% Improved\n< = 30min",null,null,"Surface water","Improved","% Improved\n< = 30min",null,null,"Surface water"]
[null,"DHS03",2003,{"$f":"IF(ISERROR(INDIRECT(CONCATENATE($B205,\"!H16\"))),\"\",INDIRECT(CONCATENATE($B205,\"!H16\")))","v":80.111406074294109},{"$f":"IF(ISERROR(INDIRECT(CONCATENATE($B205,\"!H23\"))),\"\",INDIRECT(CONCATENATE($B205,\"!H23\")))","v":"N/A"},null,null,{"$f":"IF(ISERROR(INDIRECT(CONCATENATE($B205,\"!H21\"))),\"\",INDIRECT(CONCATENATE($B205,\"!H21\")))","v":3.0449199019053457},{"$f":"IF(ISERROR(INDIRECT(CONCATENATE($B205,\"!I16\"))),\"\",INDIRECT(CONCATENATE($B205,\"!I16\")))","v":93.97828433398405},{"$f":"IF(ISERROR(INDIRECT(CONCATENATE($B205,\"!I23\"))),\"\",INDIRECT(CONCATENATE($B205,\"!I23\")))","v":"N/A"},null,null,{"$f":"IF(ISERROR(INDIRECT(CONCATENATE($B205,\"!I21\"))),\"\",INDIRECT(CONCATENATE($B205,\"!I21\")))","v":0.65692802594696664},{"$f":"IF(ISERROR(INDIRECT(CONCATENATE($B205,\"!J16\"))),\"\",INDIRECT(CONCATENATE($B205,\"!J16\")))","v":96.909993659721152},{"$f":"IF(ISERROR(INDIRECT(CONCATENATE($B205,\"!J23\"))),\"\",INDIRECT(CONCATENATE($B205,\"!J23\")))","v":"N/A"},null,null,{"$f":"IF(ISERROR(INDIRECT(CONCATENATE($B205,\"!J21\"))),\"\",INDIRECT(CONCATENATE($B205,\"!J21\")))","v":0.5398917264259574},{"$f":"IF(ISERROR(INDIRECT(CONCATENATE($B205,\"!K16\"))),\"\",INDIRECT(CONCATENATE($B205,\"!K16\")))","v":99.044891826962413},{"$f":"IF(ISERROR(INDIRECT(CONCATENATE($B205,\"!K23\"))),\"\",INDIRECT(CONCATENATE($B205,\"!K23\")))","v":"N/A"},null,null,{"$f":"IF(ISERROR(INDIRECT(CONCATENATE($B205,\"!K21\"))),\"\",INDIRECT(CONCATENATE($B205,\"!K21\")))","v":1.4326160172158217E-2},{"$f":"IF(ISERROR(INDIRECT(CONCATENATE($B205,\"!L16\"))),\"\",INDIRECT(CONCATENATE($B205,\"!L16\")))","v":99.842412216600636},{"$f":"IF(ISERROR(INDIRECT(CONCATENATE($B205,\"!L23\"))),\"\",INDIRECT(CONCATENATE($B205,\"!L23\")))","v":"N/A"},null,null,{"$f":"IF(ISERROR(INDIRECT(CONCATENATE($B205,\"!L221\"))),\"\",INDIRECT(CONCATENATE($B205,\"!L21\")))","v":0}]
[null,"DHS08",2008,88.358404251625316,99.919304606249554,null,null,0.7959582667538897,97.869508782749861,100,null,null,0.42650247754854942,98.996265833872414,99.844705227799466,null,null,0.12859393271295988,99.527483882559039,100,null,null,4.7179281900275448E-2,99.526733195941745,100,null,null,2.9560041368127041E-2]
[null,"EDS16",2016,96.435907269891771,99.667829333857483,null,null,0.4418069835775823,99.390732594726217,99.933645116221399,null,null,2.9780709495981179E-2,99.419814627641813,99.976266986403942,null,null,0,99.836766640621079,99.98195271196002,null,null,0,99.976556713376908,99.972405910972952,null,null,2.3555076351700222E-2]
[null,null,null,"","",null,null,"","","",null,null,"","","",null,null,"","","",null,null,"","","",null,null,""]
[null,null,null,"","",null,null,"","","",null,null,"","","",null,null,"","","",null,null,"","","",null,null,""]
[null,null,null,"","",null,null,"","","",null,null,"","","",null,null,"","","",null,null,"","","",null,null,""]
[null,null,null,"","",null,null,"","","",null,null,"","","",null,null,"","","",null,null,"","","",null,null,""]
[null,null,null,"","",null,null,"","","",null,null,"","","",null,null,"","","",null,null,"","","",null,null,""]
[null,null,null,"","",null,null,"","","",null,null,"","","",null,null,"","","",null,null,"","","",null,null,""]
[null,null,null,"","",null,null,"","","",null,null,"","","",null,null,"","","",null,null,"","","",null,null,""]
[null,null,null,"","",null,null,"","","",null,null,"","","",null,null,"","","",null,null,"","","",null,null,""]
[null,null,null,"","",null,null,"","","",null,null,"","","",null,null,"","","",null,null,"","","",null,null,""]
[]
[null,{"$f":"CONCATENATE(\"Urban use of drinking water sources,  \",C199,\"–\",C200)","v":"Urban use of drinking water sources,  2000–2020"},null,null,null,null,null,null,null,null,null,null,null,null,null,null,null,null,"Data points used for regression"]
[]
[]
[]
[]
[]
[]
[]
[]
[]
[]
[]
[]
[]
[]
[]
[]
[]
[]
[]
[]
[]
[]
[]
[]
[]
[]
[]
[]
[]
[]
[]
[]
[]
[]
[null,null,null,null,{"$f":"IF(ISERROR(INDIRECT(CONCATENATE($B253,\"!M18\"))),\"\",INDIRECT(CONCATENATE($B253,\"!M18\")))","v":""},{"$f":"IF(ISERROR(INDIRECT(CONCATENATE($B253,\"!M19\"))),\"\",INDIRECT(CONCATENATE($B253,\"!M19\")))","v":""},{"$f":"IF(ISERROR(INDIRECT(CONCATENATE($B253,\"!M20\"))),\"\",INDIRECT(CONCATENATE($B253,\"!M20\")))","v":""},{"$f":"IF(ISERROR(INDIRECT(CONCATENATE($B253,\"!M21\"))),\"\",INDIRECT(CONCATENATE($B253,\"!M21\")))","v":""},null,{"$f":"IF(ISERROR(INDIRECT(CONCATENATE($B253,\"!N18\"))),\"\",INDIRECT(CONCATENATE($B253,\"!N18\")))","v":""},{"$f":"IF(ISERROR(INDIRECT(CONCATENATE($B253,\"!N19\"))),\"\",INDIRECT(CONCATENATE($B253,\"!N19\")))","v":""},{"$f":"IF(ISERROR(INDIRECT(CONCATENATE($B253,\"!N20\"))),\"\",INDIRECT(CONCATENATE($B253,\"!N20\")))","v":""},{"$f":"IF(ISERROR(INDIRECT(CONCATENATE($B253,\"!N21\"))),\"\",INDIRECT(CONCATENATE($B253,\"!N21\")))","v":""},null,{"$f":"IF(ISERROR(INDIRECT(CONCATENATE($B253,\"!O18\"))),\"\",INDIRECT(CONCATENATE($B253,\"!O18\")))","v":""},{"$f":"IF(ISERROR(INDIRECT(CONCATENATE($B253,\"!O19\"))),\"\",INDIRECT(CONCATENATE($B253,\"!O19\")))","v":""},{"$f":"IF(ISERROR(INDIRECT(CONCATENATE($B253,\"!O20\"))),\"\",INDIRECT(CONCATENATE($B253,\"!O20\")))","v":""},{"$f":"IF(ISERROR(INDIRECT(CONCATENATE($B253,\"!O21\"))),\"\",INDIRECT(CONCATENATE($B253,\"!O21\")))","v":""},null,{"$f":"IF(ISERROR(INDIRECT(CONCATENATE($B253,\"!P18\"))),\"\",INDIRECT(CONCATENATE($B253,\"!P18\")))","v":""},{"$f":"IF(ISERROR(INDIRECT(CONCATENATE($B253,\"!P19\"))),\"\",INDIRECT(CONCATENATE($B253,\"!P19\")))","v":""},{"$f":"IF(ISERROR(INDIRECT(CONCATENATE($B253,\"!P20\"))),\"\",INDIRECT(CONCATENATE($B253,\"!P20\")))","v":""},{"$f":"IF(ISERROR(INDIRECT(CONCATENATE($B253,\"!P21\"))),\"\",INDIRECT(CONCATENATE($B253,\"!P21\")))","v":""},null,{"$f":"IF(ISERROR(INDIRECT(CONCATENATE($B253,\"!Q18\"))),\"\",INDIRECT(CONCATENATE($B253,\"!Q18\")))","v":""},{"$f":"IF(ISERROR(INDIRECT(CONCATENATE($B253,\"!Q19\"))),\"\",INDIRECT(CONCATENATE($B253,\"!Q19\")))","v":""},{"$f":"IF(ISERROR(INDIRECT(CONCATENATE($B253,\"!Q20\"))),\"\",INDIRECT(CONCATENATE($B253,\"!Q20\")))","v":""},{"$f":"IF(ISERROR(INDIRECT(CONCATENATE($B253,\"!Q21\"))),\"\",INDIRECT(CONCATENATE($B253,\"!Q1\")))","v":""}]
[null,null,null,null,{"$f":"IF(ISERROR(INDIRECT(CONCATENATE($B254,\"!M18\"))),\"\",INDIRECT(CONCATENATE($B254,\"!M18\")))","v":""},{"$f":"IF(ISERROR(INDIRECT(CONCATENATE($B254,\"!M19\"))),\"\",INDIRECT(CONCATENATE($B254,\"!M19\")))","v":""},{"$f":"IF(ISERROR(INDIRECT(CONCATENATE($B254,\"!M20\"))),\"\",INDIRECT(CONCATENATE($B254,\"!M20\")))","v":""},{"$f":"IF(ISERROR(INDIRECT(CONCATENATE($B254,\"!M21\"))),\"\",INDIRECT(CONCATENATE($B254,\"!M21\")))","v":""},null,{"$f":"IF(ISERROR(INDIRECT(CONCATENATE($B254,\"!N18\"))),\"\",INDIRECT(CONCATENATE($B254,\"!N18\")))","v":""},{"$f":"IF(ISERROR(INDIRECT(CONCATENATE($B254,\"!N19\"))),\"\",INDIRECT(CONCATENATE($B254,\"!N19\")))","v":""},{"$f":"IF(ISERROR(INDIRECT(CONCATENATE($B254,\"!N20\"))),\"\",INDIRECT(CONCATENATE($B254,\"!N20\")))","v":""},{"$f":"IF(ISERROR(INDIRECT(CONCATENATE($B254,\"!N21\"))),\"\",INDIRECT(CONCATENATE($B254,\"!N21\")))","v":""},null,{"$f":"IF(ISERROR(INDIRECT(CONCATENATE($B254,\"!O18\"))),\"\",INDIRECT(CONCATENATE($B254,\"!O18\")))","v":""},{"$f":"IF(ISERROR(INDIRECT(CONCATENATE($B254,\"!O19\"))),\"\",INDIRECT(CONCATENATE($B254,\"!O19\")))","v":""},{"$f":"IF(ISERROR(INDIRECT(CONCATENATE($B254,\"!O20\"))),\"\",INDIRECT(CONCATENATE($B254,\"!O20\")))","v":""},{"$f":"IF(ISERROR(INDIRECT(CONCATENATE($B254,\"!O21\"))),\"\",INDIRECT(CONCATENATE($B254,\"!O21\")))","v":""},null,{"$f":"IF(ISERROR(INDIRECT(CONCATENATE($B254,\"!P18\"))),\"\",INDIRECT(CONCATENATE($B254,\"!P18\")))","v":""},{"$f":"IF(ISERROR(INDIRECT(CONCATENATE($B254,\"!P19\"))),\"\",INDIRECT(CONCATENATE($B254,\"!P19\")))","v":""},{"$f":"IF(ISERROR(INDIRECT(CONCATENATE($B254,\"!P20\"))),\"\",INDIRECT(CONCATENATE($B254,\"!P20\")))","v":""},{"$f":"IF(ISERROR(INDIRECT(CONCATENATE($B254,\"!P21\"))),\"\",INDIRECT(CONCATENATE($B254,\"!P21\")))","v":""},null,{"$f":"IF(ISERROR(INDIRECT(CONCATENATE($B254,\"!Q18\"))),\"\",INDIRECT(CONCATENATE($B254,\"!Q18\")))","v":""},{"$f":"IF(ISERROR(INDIRECT(CONCATENATE($B254,\"!Q19\"))),\"\",INDIRECT(CONCATENATE($B254,\"!Q19\")))","v":""},{"$f":"IF(ISERROR(INDIRECT(CONCATENATE($B254,\"!Q20\"))),\"\",INDIRECT(CONCATENATE($B254,\"!Q20\")))","v":""},{"$f":"IF(ISERROR(INDIRECT(CONCATENATE($B254,\"!Q21\"))),\"\",INDIRECT(CONCATENATE($B254,\"!Q1\")))","v":""}]
[null,null,null,null,{"$f":"IF(ISERROR(INDIRECT(CONCATENATE($B255,\"!M18\"))),\"\",INDIRECT(CONCATENATE($B255,\"!M18\")))","v":""},{"$f":"IF(ISERROR(INDIRECT(CONCATENATE($B255,\"!M19\"))),\"\",INDIRECT(CONCATENATE($B255,\"!M19\")))","v":""},{"$f":"IF(ISERROR(INDIRECT(CONCATENATE($B255,\"!M20\"))),\"\",INDIRECT(CONCATENATE($B255,\"!M20\")))","v":""},{"$f":"IF(ISERROR(INDIRECT(CONCATENATE($B255,\"!M21\"))),\"\",INDIRECT(CONCATENATE($B255,\"!M21\")))","v":""},null,{"$f":"IF(ISERROR(INDIRECT(CONCATENATE($B255,\"!N18\"))),\"\",INDIRECT(CONCATENATE($B255,\"!N18\")))","v":""},{"$f":"IF(ISERROR(INDIRECT(CONCATENATE($B255,\"!N19\"))),\"\",INDIRECT(CONCATENATE($B255,\"!N19\")))","v":""},{"$f":"IF(ISERROR(INDIRECT(CONCATENATE($B255,\"!N20\"))),\"\",INDIRECT(CONCATENATE($B255,\"!N20\")))","v":""},{"$f":"IF(ISERROR(INDIRECT(CONCATENATE($B255,\"!N21\"))),\"\",INDIRECT(CONCATENATE($B255,\"!N21\")))","v":""},null,{"$f":"IF(ISERROR(INDIRECT(CONCATENATE($B255,\"!O18\"))),\"\",INDIRECT(CONCATENATE($B255,\"!O18\")))","v":""},{"$f":"IF(ISERROR(INDIRECT(CONCATENATE($B255,\"!O19\"))),\"\",INDIRECT(CONCATENATE($B255,\"!O19\")))","v":""},{"$f":"IF(ISERROR(INDIRECT(CONCATENATE($B255,\"!O20\"))),\"\",INDIRECT(CONCATENATE($B255,\"!O20\")))","v":""},{"$f":"IF(ISERROR(INDIRECT(CONCATENATE($B255,\"!O21\"))),\"\",INDIRECT(CONCATENATE($B255,\"!O21\")))","v":""},null,{"$f":"IF(ISERROR(INDIRECT(CONCATENATE($B255,\"!P18\"))),\"\",INDIRECT(CONCATENATE($B255,\"!P18\")))","v":""},{"$f":"IF(ISERROR(INDIRECT(CONCATENATE($B255,\"!P19\"))),\"\",INDIRECT(CONCATENATE($B255,\"!P19\")))","v":""},{"$f":"IF(ISERROR(INDIRECT(CONCATENATE($B255,\"!P20\"))),\"\",INDIRECT(CONCATENATE($B255,\"!P20\")))","v":""},{"$f":"IF(ISERROR(INDIRECT(CONCATENATE($B255,\"!P21\"))),\"\",INDIRECT(CONCATENATE($B255,\"!P21\")))","v":""},null,{"$f":"IF(ISERROR(INDIRECT(CONCATENATE($B255,\"!Q18\"))),\"\",INDIRECT(CONCATENATE($B255,\"!Q18\")))","v":""},{"$f":"IF(ISERROR(INDIRECT(CONCATENATE($B255,\"!Q19\"))),\"\",INDIRECT(CONCATENATE($B255,\"!Q19\")))","v":""},{"$f":"IF(ISERROR(INDIRECT(CONCATENATE($B255,\"!Q20\"))),\"\",INDIRECT(CONCATENATE($B255,\"!Q20\")))","v":""},{"$f":"IF(ISERROR(INDIRECT(CONCATENATE($B255,\"!Q21\"))),\"\",INDIRECT(CONCATENATE($B255,\"!Q1\")))","v":""}]
[null,null,null,null,{"$f":"IF(ISERROR(INDIRECT(CONCATENATE($B256,\"!M18\"))),\"\",INDIRECT(CONCATENATE($B256,\"!M18\")))","v":""},{"$f":"IF(ISERROR(INDIRECT(CONCATENATE($B256,\"!M19\"))),\"\",INDIRECT(CONCATENATE($B256,\"!M19\")))","v":""},{"$f":"IF(ISERROR(INDIRECT(CONCATENATE($B256,\"!M20\"))),\"\",INDIRECT(CONCATENATE($B256,\"!M20\")))","v":""},{"$f":"IF(ISERROR(INDIRECT(CONCATENATE($B256,\"!M21\"))),\"\",INDIRECT(CONCATENATE($B256,\"!M21\")))","v":""},null,{"$f":"IF(ISERROR(INDIRECT(CONCATENATE($B256,\"!N18\"))),\"\",INDIRECT(CONCATENATE($B256,\"!N18\")))","v":""},{"$f":"IF(ISERROR(INDIRECT(CONCATENATE($B256,\"!N19\"))),\"\",INDIRECT(CONCATENATE($B256,\"!N19\")))","v":""},{"$f":"IF(ISERROR(INDIRECT(CONCATENATE($B256,\"!N20\"))),\"\",INDIRECT(CONCATENATE($B256,\"!N20\")))","v":""},{"$f":"IF(ISERROR(INDIRECT(CONCATENATE($B256,\"!N21\"))),\"\",INDIRECT(CONCATENATE($B256,\"!N21\")))","v":""},null,{"$f":"IF(ISERROR(INDIRECT(CONCATENATE($B256,\"!O18\"))),\"\",INDIRECT(CONCATENATE($B256,\"!O18\")))","v":""},{"$f":"IF(ISERROR(INDIRECT(CONCATENATE($B256,\"!O19\"))),\"\",INDIRECT(CONCATENATE($B256,\"!O19\")))","v":""},{"$f":"IF(ISERROR(INDIRECT(CONCATENATE($B256,\"!O20\"))),\"\",INDIRECT(CONCATENATE($B256,\"!O20\")))","v":""},{"$f":"IF(ISERROR(INDIRECT(CONCATENATE($B256,\"!O21\"))),\"\",INDIRECT(CONCATENATE($B256,\"!O21\")))","v":""},null,{"$f":"IF(ISERROR(INDIRECT(CONCATENATE($B256,\"!P18\"))),\"\",INDIRECT(CONCATENATE($B256,\"!P18\")))","v":""},{"$f":"IF(ISERROR(INDIRECT(CONCATENATE($B256,\"!P19\"))),\"\",INDIRECT(CONCATENATE($B256,\"!P19\")))","v":""},{"$f":"IF(ISERROR(INDIRECT(CONCATENATE($B256,\"!P20\"))),\"\",INDIRECT(CONCATENATE($B256,\"!P20\")))","v":""},{"$f":"IF(ISERROR(INDIRECT(CONCATENATE($B256,\"!P21\"))),\"\",INDIRECT(CONCATENATE($B256,\"!P21\")))","v":""},null,{"$f":"IF(ISERROR(INDIRECT(CONCATENATE($B256,\"!Q18\"))),\"\",INDIRECT(CONCATENATE($B256,\"!Q18\")))","v":""},{"$f":"IF(ISERROR(INDIRECT(CONCATENATE($B256,\"!Q19\"))),\"\",INDIRECT(CONCATENATE($B256,\"!Q19\")))","v":""},{"$f":"IF(ISERROR(INDIRECT(CONCATENATE($B256,\"!Q20\"))),\"\",INDIRECT(CONCATENATE($B256,\"!Q20\")))","v":""},{"$f":"IF(ISERROR(INDIRECT(CONCATENATE($B256,\"!Q21\"))),\"\",INDIRECT(CONCATENATE($B256,\"!Q1\")))","v":""}]
[null,null,null,null,{"$f":"IF(ISERROR(INDIRECT(CONCATENATE($B257,\"!M18\"))),\"\",INDIRECT(CONCATENATE($B257,\"!M18\")))","v":""},{"$f":"IF(ISERROR(INDIRECT(CONCATENATE($B257,\"!M19\"))),\"\",INDIRECT(CONCATENATE($B257,\"!M19\")))","v":""},{"$f":"IF(ISERROR(INDIRECT(CONCATENATE($B257,\"!M20\"))),\"\",INDIRECT(CONCATENATE($B257,\"!M20\")))","v":""},{"$f":"IF(ISERROR(INDIRECT(CONCATENATE($B257,\"!M21\"))),\"\",INDIRECT(CONCATENATE($B257,\"!M21\")))","v":""},null,{"$f":"IF(ISERROR(INDIRECT(CONCATENATE($B257,\"!N18\"))),\"\",INDIRECT(CONCATENATE($B257,\"!N18\")))","v":""},{"$f":"IF(ISERROR(INDIRECT(CONCATENATE($B257,\"!N19\"))),\"\",INDIRECT(CONCATENATE($B257,\"!N19\")))","v":""},{"$f":"IF(ISERROR(INDIRECT(CONCATENATE($B257,\"!N20\"))),\"\",INDIRECT(CONCATENATE($B257,\"!N20\")))","v":""},{"$f":"IF(ISERROR(INDIRECT(CONCATENATE($B257,\"!N21\"))),\"\",INDIRECT(CONCATENATE($B257,\"!N21\")))","v":""},null,{"$f":"IF(ISERROR(INDIRECT(CONCATENATE($B257,\"!O18\"))),\"\",INDIRECT(CONCATENATE($B257,\"!O18\")))","v":""},{"$f":"IF(ISERROR(INDIRECT(CONCATENATE($B257,\"!O19\"))),\"\",INDIRECT(CONCATENATE($B257,\"!O19\")))","v":""},{"$f":"IF(ISERROR(INDIRECT(CONCATENATE($B257,\"!O20\"))),\"\",INDIRECT(CONCATENATE($B257,\"!O20\")))","v":""},{"$f":"IF(ISERROR(INDIRECT(CONCATENATE($B257,\"!O21\"))),\"\",INDIRECT(CONCATENATE($B257,\"!O21\")))","v":""},null,{"$f":"IF(ISERROR(INDIRECT(CONCATENATE($B257,\"!P18\"))),\"\",INDIRECT(CONCATENATE($B257,\"!P18\")))","v":""},{"$f":"IF(ISERROR(INDIRECT(CONCATENATE($B257,\"!P19\"))),\"\",INDIRECT(CONCATENATE($B257,\"!P19\")))","v":""},{"$f":"IF(ISERROR(INDIRECT(CONCATENATE($B257,\"!P20\"))),\"\",INDIRECT(CONCATENATE($B257,\"!P20\")))","v":""},{"$f":"IF(ISERROR(INDIRECT(CONCATENATE($B257,\"!P21\"))),\"\",INDIRECT(CONCATENATE($B257,\"!P21\")))","v":""},null,{"$f":"IF(ISERROR(INDIRECT(CONCATENATE($B257,\"!Q18\"))),\"\",INDIRECT(CONCATENATE($B257,\"!Q18\")))","v":""},{"$f":"IF(ISERROR(INDIRECT(CONCATENATE($B257,\"!Q19\"))),\"\",INDIRECT(CONCATENATE($B257,\"!Q19\")))","v":""},{"$f":"IF(ISERROR(INDIRECT(CONCATENATE($B257,\"!Q20\"))),\"\",INDIRECT(CONCATENATE($B257,\"!Q20\")))","v":""},{"$f":"IF(ISERROR(INDIRECT(CONCATENATE($B257,\"!Q21\"))),\"\",INDIRECT(CONCATENATE($B257,\"!Q1\")))","v":""}]
[]
[]
[]
[]
[]
[]
[]
[]
[]
[]
[]
[]
[]
[]
[]
[]
[]
[]
[]
[]
[]
[]
[]
[]
[]
[]
[]
[]
[]
[]
[]
[]
[]
[]
[]
[]
[]
[]
[]
["RURAL",null,null,"Poorest",null,null,null,null,"Poor",null,null,null,null,"Middle",null,null,null,null,"Rich",null,null,null,null,"Richest"]
[null,null,null,"Improved","Basic","Limited","Unimproved","Surface water","Improved","Basic","Limited","Unimproved","Surface water","Improved","Basic","Limited","Unimproved","Surface water","Improved","Basic","Limited","Unimproved","Surface water","Improved","Basic","Limited","Unimproved","Surface water"]
["Forecast period:",null,2000,{"$f":"IF((D301+H301)>100,D301*100/(D301+H301),D301)","v":37.805789292122881},{"$f":"D299*AVERAGEIF(E305:E316,\">0\")/100","v":37.404677701608314},{"$f":"D299*(100-AVERAGEIF(E305:E316,\">0\"))/100","v":0.40111159051457052},{"$f":"100-(E299+F299+H299)","v":23.056604442669368},{"$f":"IF((D301+H301)>100,H301*100/(D301+H301),H301)","v":39.137606265207751},{"$f":"IF((I301+M301)>100,I301*100/(I301+M301),I301)","v":47.268948095686028},{"$f":"I299*AVERAGEIF(J305:J316,\">0\")/100","v":46.901072102493664},{"$f":"I299*(100-AVERAGEIF(J305:J316,\">0\"))/100","v":0.36787599319236797},{"$f":"100-(J299+K299+M299)","v":23.752249537626312},{"$f":"IF((I301+M301)>100,M301*100/(I301+M301),M301)","v":28.97880236668766},{"$f":"IF((N301+R301)>100,N301*100/(N301+R301),N301)","v":56.516517037248832},{"$f":"N299*AVERAGEIF(O305:O316,\">0\")/100","v":56.427000927329388},{"$f":"N299*(100-AVERAGEIF(O305:O316,\">0\"))/100","v":8.9516109919438383E-2},{"$f":"100-(O299+P299+R299)","v":20.229984505057701},{"$f":"IF((N301+R301)>100,R301*100/(N301+R301),R301)","v":23.253498457693468},{"$f":"IF((S301+W301)>100,S301*100/(S301+W301),S301)","v":69.078804550287714},{"$f":"S299*AVERAGEIF(T305:T316,\">0\")/100","v":68.990702606044266},{"$f":"S299*(100-AVERAGEIF(T305:T316,\">0\"))/100","v":8.8101944243450664E-2},{"$f":"100-(T299+U299+W299)","v":17.260324231621325},{"$f":"IF((S301+W301)>100,W301*100/(S301+W301),W301)","v":13.660871218090961},{"$f":"IF((X301+AB301)>100,X301*100/(X301+AB301),X301)","v":87.198825928283213},{"$f":"X299*AVERAGEIF(Y305:Y316,\">0\")/100","v":87.118990282926731},{"$f":"X299*(100-AVERAGEIF(Y305:Y316,\">0\"))/100","v":7.9835645356478274E-2},{"$f":"100-(Y299+Z299+AB299)","v":11.164914753416099},{"$f":"IF((X301+AB301)>100,AB301*100/(X301+AB301),AB301)","v":1.6362593183006879}]
[null,null,2020,{"$f":"IF((D302+H302)>100,D302*100/(D302+H302),D302)","v":72.567834730019513},{"$f":"D300*AVERAGEIF(E305:E316,\">0\")/100","v":71.797905040578499},{"$f":"D300*(100-AVERAGEIF(E305:E316,\">0\"))/100","v":0.76992968944101481},{"$f":"100-(E300+F300+H300)","v":5.3962724425448414},{"$f":"IF((D302+H302)>100,H302*100/(D302+H302),H302)","v":22.035892827435646},{"$f":"IF((I302+M302)>100,I302*100/(I302+M302),I302)","v":82.11072332816002},{"$f":"I300*AVERAGEIF(J305:J316,\">0\")/100","v":81.471687235481511},{"$f":"I300*(100-AVERAGEIF(J305:J316,\">0\"))/100","v":0.63903609267851236},{"$f":"100-(J300+K300+M300)","v":5.2798329268634916},{"$f":"IF((I302+M302)>100,M302*100/(I302+M302),M302)","v":12.609443744976488},{"$f":"IF((N302+R302)>100,N302*100/(N302+R302),N302)","v":88.20356095305624},{"$f":"N300*AVERAGEIF(O305:O316,\">0\")/100","v":88.063855959339875},{"$f":"N300*(100-AVERAGEIF(O305:O316,\">0\"))/100","v":0.13970499371636469},{"$f":"100-(O300+P300+R300)","v":5.7472684625724924},{"$f":"IF((N302+R302)>100,R302*100/(N302+R302),R302)","v":6.049170584371268},{"$f":"IF((S302+W302)>100,S302*100/(S302+W302),S302)","v":94.569515289651463},{"$f":"S300*AVERAGEIF(T305:T316,\">0\")/100","v":94.44890292211818},{"$f":"S300*(100-AVERAGEIF(T305:T316,\">0\"))/100","v":0.12061236753328161},{"$f":"100-(T300+U300+W300)","v":1.232571948671648},{"$f":"IF((S302+W302)>100,W302*100/(S302+W302),W302)","v":4.1979127616768892},{"$f":"IF((X302+AB302)>100,X302*100/(X302+AB302),X302)","v":95.117355731625722},{"$f":"X300*AVERAGEIF(Y305:Y316,\">0\")/100","v":95.030270207266938},{"$f":"X300*(100-AVERAGEIF(Y305:Y316,\">0\"))/100","v":8.7085524358797559E-2},{"$f":"100-(Y300+Z300+AB300)","v":0},{"$f":"IF((X302+AB302)>100,AB302*100/(X302+AB302),AB302)","v":4.8826442683742819}]
["Regression period:",null,{"$f":"MinRegYear(C299,C305:C316)","v":2001},{"$f":"IF(MAX(C305:C316)-MIN(C305:C316)<5,AVERAGEIF(C305:C316,\">0\",D305:D316),\nIF(FORECAST($C301,D$305:D$316,$C$305:$C$316)<0,0,\nIF(FORECAST($C301,D$305:D$316,$C$305:$C$316)>100,100,\nFORECAST($C301,D$305:D$316,$C$305:$C$316))))","v":37.805789292122881},null,null,null,{"$f":"IF(MAX(C305:C316)-MIN(C305:C316)<5,AVERAGEIF(C305:C316,\">0\",H305:H316),\nIF(FORECAST($C301,H$305:H$316,$C$305:$C$316)<0,0,\nIF(FORECAST($C301,H$305:H$316,$C$305:$C$316)>100,100,\nFORECAST($C301,H$305:H$316,$C$305:$C$316))))","v":39.137606265207751},{"$f":"IF(MAX(C305:C316)-MIN(C305:C316)<5,AVERAGEIF(C305:C316,\">0\",I305:I316),\nIF(FORECAST($C301,I$305:I$316,$C$305:$C$316)<0,0,\nIF(FORECAST($C301,I$305:I$316,$C$305:$C$316)>100,100,\nFORECAST($C301,I$305:I$316,$C$305:$C$316))))","v":47.268948095686028},null,null,null,{"$f":"IF(MAX(C305:C316)-MIN(C305:C316)<5,AVERAGEIF(C305:C316,\">0\",M305:M316),\nIF(FORECAST($C301,M$305:M$316,$C$305:$C$316)<0,0,\nIF(FORECAST($C301,M$305:M$316,$C$305:$C$316)>100,100,\nFORECAST($C301,M$305:M$316,$C$305:$C$316))))","v":28.97880236668766},{"$f":"IF(MAX(C305:C316)-MIN(C305:C316)<5,AVERAGEIF(C305:C316,\">0\",N305:N316),\nIF(FORECAST($C301,N$305:N$316,$C$305:$C$316)<0,0,\nIF(FORECAST($C301,N$305:N$316,$C$305:$C$316)>100,100,\nFORECAST($C301,N$305:N$316,$C$305:$C$316))))","v":56.516517037248832},null,null,null,{"$f":"IF(MAX(C305:C316)-MIN(C305:C316)<5,AVERAGEIF(C305:C316,\">0\",R305:R316),\nIF(FORECAST($C301,R$305:R$316,$C$305:$C$316)<0,0,\nIF(FORECAST($C301,R$305:R$316,$C$305:$C$316)>100,100,\nFORECAST($C301,R$305:R$316,$C$305:$C$316))))","v":23.253498457693468},{"$f":"IF(MAX(C305:C316)-MIN(C305:C316)<5,AVERAGEIF(C305:C316,\">0\",S305:S316),\nIF(FORECAST($C301,S$305:S$316,$C$305:$C$316)<0,0,\nIF(FORECAST($C301,S$305:S$316,$C$305:$C$316)>100,100,\nFORECAST($C301,S$305:S$316,$C$305:$C$316))))","v":69.078804550287714},null,null,null,{"$f":"IF(MAX(C305:C316)-MIN(C305:C316)<5,AVERAGEIF(C305:C316,\">0\",W305:W316),\nIF(FORECAST($C301,W$305:W$316,$C$305:$C$316)<0,0,\nIF(FORECAST($C301,W$305:W$316,$C$305:$C$316)>100,100,\nFORECAST($C301,W$305:W$316,$C$305:$C$316))))","v":13.660871218090961},{"$f":"IF(MAX(C305:C316)-MIN(C305:C316)<5,AVERAGEIF(C305:C316,\">0\",X305:X316),\nIF(FORECAST($C301,X$305:X$316,$C$305:$C$316)<0,0,\nIF(FORECAST($C301,X$305:X$316,$C$305:$C$316)>100,100,\nFORECAST($C301,X$305:X$316,$C$305:$C$316))))","v":87.198825928283213},null,null,null,{"$f":"IF(MAX(C305:C316)-MIN(C305:C316)<5,AVERAGEIF(C305:C316,\">0\",AB305:AB316),\nIF(FORECAST($C301,AB$305:AB$316,$C$305:$C$316)<0,0,\nIF(FORECAST($C301,AB$305:AB$316,$C$305:$C$316)>100,100,\nFORECAST($C301,AB$305:AB$316,$C$305:$C$316))))","v":1.6362593183006879}]
[null,null,{"$f":"MaxRegYear(C300,C305:C316)","v":2018},{"$f":"IF(MAX(C305:C316)-MIN(C305:C316)<5,AVERAGEIF(C305:C316,\">0\",D305:D316),\nIF(FORECAST($C302,D$305:D$316,$C$305:$C$316)<0,0,\nIF(FORECAST($C302,D$305:D$316,$C$305:$C$316)>100,100,\nFORECAST($C302,D$305:D$316,$C$305:$C$316))))","v":72.567834730019513},null,null,null,{"$f":"IF(MAX(C305:C316)-MIN(C305:C316)<5,AVERAGEIF(C305:C316,\">0\",H305:H316),\nIF(FORECAST($C302,H$305:H$316,$C$305:$C$316)<0,0,\nIF(FORECAST($C302,H$305:H$316,$C$305:$C$316)>100,100,\nFORECAST($C302,H$305:H$316,$C$305:$C$316))))","v":22.035892827435646},{"$f":"IF(MAX(C305:C316)-MIN(C305:C316)<5,AVERAGEIF(C305:C316,\">0\",I305:I316),\nIF(FORECAST($C302,I$305:I$316,$C$305:$C$316)<0,0,\nIF(FORECAST($C302,I$305:I$316,$C$305:$C$316)>100,100,\nFORECAST($C302,I$305:I$316,$C$305:$C$316))))","v":82.11072332816002},null,null,null,{"$f":"IF(MAX(C305:C316)-MIN(C305:C316)<5,AVERAGEIF(C305:C316,\">0\",M305:M316),\nIF(FORECAST($C302,M$305:M$316,$C$305:$C$316)<0,0,\nIF(FORECAST($C302,M$305:M$316,$C$305:$C$316)>100,100,\nFORECAST($C302,M$305:M$316,$C$305:$C$316))))","v":12.609443744976488},{"$f":"IF(MAX(C305:C316)-MIN(C305:C316)<5,AVERAGEIF(C305:C316,\">0\",N305:N316),\nIF(FORECAST($C302,N$305:N$316,$C$305:$C$316)<0,0,\nIF(FORECAST($C302,N$305:N$316,$C$305:$C$316)>100,100,\nFORECAST($C302,N$305:N$316,$C$305:$C$316))))","v":88.20356095305624},null,null,null,{"$f":"IF(MAX(C305:C316)-MIN(C305:C316)<5,AVERAGEIF(C305:C316,\">0\",R305:R316),\nIF(FORECAST($C302,R$305:R$316,$C$305:$C$316)<0,0,\nIF(FORECAST($C302,R$305:R$316,$C$305:$C$316)>100,100,\nFORECAST($C302,R$305:R$316,$C$305:$C$316))))","v":6.049170584371268},{"$f":"IF(MAX(C305:C316)-MIN(C305:C316)<5,AVERAGEIF(C305:C316,\">0\",S305:S316),\nIF(FORECAST($C302,S$305:S$316,$C$305:$C$316)<0,0,\nIF(FORECAST($C302,S$305:S$316,$C$305:$C$316)>100,100,\nFORECAST($C302,S$305:S$316,$C$305:$C$316))))","v":94.569515289651463},null,null,null,{"$f":"IF(MAX(C305:C316)-MIN(C305:C316)<5,AVERAGEIF(C305:C316,\">0\",W305:W316),\nIF(FORECAST($C302,W$305:W$316,$C$305:$C$316)<0,0,\nIF(FORECAST($C302,W$305:W$316,$C$305:$C$316)>100,100,\nFORECAST($C302,W$305:W$316,$C$305:$C$316))))","v":4.1979127616768892},{"$f":"IF(MAX(C305:C316)-MIN(C305:C316)<5,AVERAGEIF(C305:C316,\">0\",X305:X316),\nIF(FORECAST($C302,X$305:X$316,$C$305:$C$316)<0,0,\nIF(FORECAST($C302,X$305:X$316,$C$305:$C$316)>100,100,\nFORECAST($C302,X$305:X$316,$C$305:$C$316))))","v":95.216796189525553},null,null,null,{"$f":"IF(MAX(C305:C316)-MIN(C305:C316)<5,AVERAGEIF(C305:C316,\">0\",AB305:AB316),\nIF(FORECAST($C302,AB$305:AB$316,$C$305:$C$316)<0,0,\nIF(FORECAST($C302,AB$305:AB$316,$C$305:$C$316)>100,100,\nFORECAST($C302,AB$305:AB$316,$C$305:$C$316))))","v":4.8877488297666218}]
[]
[null,"Survey","Year","Improved","% Improved\n< = 30min",null,null,"Surface water","Improved","% Improved\n< = 30min",null,null,"Surface water","Improved","% Improved\n< = 30min",null,null,"Surface water","Improved","% Improved\n< = 30min",null,null,"Surface water","Improved","% Improved\n< = 30min",null,null,"Surface water"]
[null,"DHS03",2003,{"$f":"IF(ISERROR(INDIRECT(CONCATENATE($B305,\"!M16\"))),\"\",INDIRECT(CONCATENATE($B305,\"!M16\")))","v":41.797486679810703},{"$f":"IF(ISERROR(INDIRECT(CONCATENATE($B305,\"!M23\"))),\"\",INDIRECT(CONCATENATE($B305,\"!M23\")))","v":"N/A"},null,null,{"$f":"IF(ISERROR(INDIRECT(CONCATENATE($B305,\"!M21\"))),\"\",INDIRECT(CONCATENATE($B305,\"!M21\")))","v":38.923968360815948},{"$f":"IF(ISERROR(INDIRECT(CONCATENATE($B305,\"!N16\"))),\"\",INDIRECT(CONCATENATE($B305,\"!N16\")))","v":49.5323795533197},{"$f":"IF(ISERROR(INDIRECT(CONCATENATE($B305,\"!N23\"))),\"\",INDIRECT(CONCATENATE($B305,\"!N23\")))","v":"N/A"},null,null,{"$f":"IF(ISERROR(INDIRECT(CONCATENATE($B305,\"!N21\"))),\"\",INDIRECT(CONCATENATE($B305,\"!N21\")))","v":30.568725487349372},{"$f":"IF(ISERROR(INDIRECT(CONCATENATE($B305,\"!O16\"))),\"\",INDIRECT(CONCATENATE($B305,\"!O16\")))","v":58.496185613265737},{"$f":"IF(ISERROR(INDIRECT(CONCATENATE($B305,\"!O23\"))),\"\",INDIRECT(CONCATENATE($B305,\"!O23\")))","v":"N/A"},null,null,{"$f":"IF(ISERROR(INDIRECT(CONCATENATE($B305,\"!O21\"))),\"\",INDIRECT(CONCATENATE($B305,\"!O21\")))","v":25.387477064131488},{"$f":"IF(ISERROR(INDIRECT(CONCATENATE($B305,\"!P16\"))),\"\",INDIRECT(CONCATENATE($B305,\"!P16\")))","v":69.942679251586284},{"$f":"IF(ISERROR(INDIRECT(CONCATENATE($B305,\"!P23\"))),\"\",INDIRECT(CONCATENATE($B305,\"!P23\")))","v":"N/A"},null,null,{"$f":"IF(ISERROR(INDIRECT(CONCATENATE($B305,\"!P21\"))),\"\",INDIRECT(CONCATENATE($B305,\"!P21\")))","v":15.682599978028446},{"$f":"IF(ISERROR(INDIRECT(CONCATENATE($B305,\"!Q16\"))),\"\",INDIRECT(CONCATENATE($B305,\"!Q16\")))","v":86.265342903921379},{"$f":"IF(ISERROR(INDIRECT(CONCATENATE($B305,\"!Q23\"))),\"\",INDIRECT(CONCATENATE($B305,\"!Q23\")))","v":"N/A"},null,null,{"$f":"IF(ISERROR(INDIRECT(CONCATENATE($B305,\"!Q221\"))),\"\",INDIRECT(CONCATENATE($B305,\"!Q21\")))","v":3.3183719416289588}]
[null,"DHS08",2008,52.27874960998151,99.933976775058511,null,null,29.173440640010668,64.598412926024395,99.734275258521947,null,null,16.525416950168939,72.404979138692582,99.995134540159867,null,null,9.4125855339051441,83.044407282940554,99.98938796878312,null,null,4.669954678590071,93.550100265090705,100,null,null,0.86328321671723696]
[null,"EDS16",2016,68.416960440079492,97.944064667667604,null,null,25.171814353235391,76.864440371207877,98.709201873875074,null,null,16.732581902481922,83.383036593868212,99.688086880365958,null,null,10.671969895059675,90.236212866025625,99.755535398617326,null,null,7.2705882356582112,93.100522043473688,99.816888256220011,null,null,5.3174609303900944]
[null,null,null,"","",null,null,"","","",null,null,"","","",null,null,"","","",null,null,"","","",null,null,""]
[null,null,null,"","",null,null,"","","",null,null,"","","",null,null,"","","",null,null,"","","",null,null,""]
[null,null,null,"","",null,null,"","","",null,null,"","","",null,null,"","","",null,null,"","","",null,null,""]
[null,null,null,"","",null,null,"","","",null,null,"","","",null,null,"","","",null,null,"","","",null,null,""]
[null,null,null,"","",null,null,"","","",null,null,"","","",null,null,"","","",null,null,"","","",null,null,""]
[null,null,null,"","",null,null,"","","",null,null,"","","",null,null,"","","",null,null,"","","",null,null,""]
[null,null,null,"","",null,null,"","","",null,null,"","","",null,null,"","","",null,null,"","","",null,null,""]
[null,null,null,"","",null,null,"","","",null,null,"","","",null,null,"","","",null,null,"","","",null,null,""]
[null,null,null,"","",null,null,"","","",null,null,"","","",null,null,"","","",null,null,"","","",null,null,""]
[]
[null,{"$f":"CONCATENATE(\"Rural use of drinking water sources, \",C299,\"–\",C300)","v":"Rural use of drinking water sources, 2000–2020"},null,null,null,null,null,null,null,null,null,null,null,null,null,null,null,null,"Data points used for regression"]

{"sheet":"Sanitation","index":2,"n_rows":318,"n_cols":28,"rows_kept":318,"cut":false,"hidden":false,"merged":[[30,21,30,24],[4,1,4,24],[3,1,3,24],[6,1,6,8],[6,9,6,16],[6,17,6,24],[30,1,31,4],[30,5,30,8],[30,9,30,12],[30,13,30,16],[30,17,30,20],[96,23,96,27],[32,1,33,2],[32,3,33,3],[35,1,36,2],[35,3,36,3],[38,1,39,2],[38,3,39,3],[96,0,97,2],[96,3,96,7],[96,8,96,12],[96,13,96,17],[96,18,96,22],[98,0,99,1],[100,0,101,1],[117,18,117,22],[196,0,197,2],[196,3,196,7],[196,8,196,12],[196,13,196,17],[196,18,196,22],[117,1,117,11],[298,0,299,1],[300,0,301,1],[317,18,317,22],[196,23,196,27],[198,0,199,1],[200,0,201,1],[217,18,217,22],[296,0,297,2],[296,3,296,7],[296,8,296,12],[296,13,296,17],[296,18,296,22],[296,23,296,27],[217,1,217,11],[317,1,317,11]]}
[]
[]
[]
[null,"Summary of trends in use of sanitation facilities by wealth quintile (%)"]
[null,{"$f":"IF(ISERROR(INDIRECT(CONCATENATE($B105,\"!A2\"))),\"\",INDIRECT(CONCATENATE($B105,\"!A2\")))","v":"Bolivia (Plurinational State of)"}]
[]
[null,{"$f":"B118","v":"National use of sanitation facilities, 2000–2020"},null,null,null,null,null,null,null,{"$f":"B218","v":"Urban use of sanitation facilities, 2000–2020"},null,null,null,null,null,null,null,{"$f":"B318","v":"Rural use of sanitation facilities, 2000–2020"}]
[]
[]
[]
[]
[]
[]
[]
[]
[]
[]
[]
[]
[]
[]
[]
[]
[]
[]
[]
[]
[]
[]
[]
[null,{"$f":"IF(ISERROR(INDIRECT(CONCATENATE($B105,\"!A2\"))),\"\",INDIRECT(CONCATENATE($B105,\"!A2\")))","v":"Bolivia (Plurinational State of)"},null,null,null,"Poorest",null,null,null,"Poor",null,null,null,"Middle",null,null,null,"Rich",null,null,null,"Richest"]
[null,null,null,null,null,"Basic","Limited","Unimproved","Open defecation","Basic","Limited","Unimproved","Open defecation","Basic","Limited","Unimproved","Open defecation","Basic","Limited","Unimproved","Open defecation","Basic","Limited","Unimproved","Open defecation"]
[null,"NATIONAL",null,"Estimate",{"$f":"C99","v":2000},{"$f":"E99","v":9.1417275942383718},{"$f":"F99","v":4.320537182004446},12.481041799828517,74.056693423928664,{"$f":"J99","v":14.535626414185231},{"$f":"K99","v":8.292190254628963},20.064014240066172,57.108169091119635,{"$f":"O99","v":25.913390518016534},{"$f":"P99","v":19.72884995405591},16.072459814247395,38.28529971368016,{"$f":"T99","v":47.984837116531793},{"$f":"U99","v":24.141264456934923},14.950553970552392,12.923344455980896,{"$f":"Y99","v":80.643488786167438},{"$f":"Z99","v":9.1667283711964789},8.7018182597262808,1.4879645829097967]
[null,null,null,null,{"$f":"C100","v":2020},{"$f":"E100","v":20.690690506231405},9.7787750435553171,21.990720680731783,47.539813769481498,{"$f":"J100","v":42.899799932539175},24.473200726937751,18.113102138737304,14.513897201785767,{"$f":"O100","v":47.030760462427637},35.806307003449596,13.341821622790576,3.8211109113321982,{"$f":"T100","v":61.1646093581695},30.772033389105115,6.9305854038725556,1.1327718488528262,{"$f":"Y100","v":87.715998541667318},9.9706590642647228,2.0291382560597953,0.28420413800816391]
[]
[null,"URBAN",null,"Estimate",{"$f":"C199","v":2000},{"$f":"E199","v":16.933858532894043},{"$f":"F199","v":15.470902560647268},17.936940788350512,49.658298118108178,{"$f":"J199","v":28.445032854001578},{"$f":"K199","v":25.400523218069271},14.462703471109762,31.691740456819389,{"$f":"O199","v":46.553199804372234},{"$f":"P199","v":27.043360007234529},14.136203663609876,12.267236524783357,{"$f":"T199","v":60.903591056761051},{"$f":"U199","v":19.072924409887555},12.761998433903614,7.2614860994477795,{"$f":"Y199","v":88.635121231728462},{"$f":"Z199","v":5.0740088061553701},5.881028560628522,0.40984140148763382]
[null,null,null,null,{"$f":"C200","v":2020},{"$f":"E200","v":37.857088618789405},34.586525458057238,15.644262686336333,11.912123236817024,{"$f":"J200","v":46.58620076187669},41.600017836759825,10.670976275841895,1.1428051255215905,{"$f":"O200","v":58.866717512279401},34.196442797026258,6.0907562262589181,0.84608346443542359,{"$f":"T200","v":73.173382673568426},22.915404039936561,3.9112132864950127,0,{"$f":"Y200","v":93.142408345254495},5.3320330993259084,1.1072268774052105,0.41833167801438098]
[]
[null,"RURAL",null,"Estimate",{"$f":"C299","v":2000},{"$f":"E299","v":6.0866649044211023},{"$f":"F299","v":2.9005489577069983},8.124537180340667,82.888248957531232,{"$f":"J299","v":11.431090980108927},{"$f":"K299","v":4.4107374081493234},13.037211513237821,71.120960098503929,{"$f":"O299","v":13.742400980781165},{"$f":"P299","v":5.3163241136881432},17.194291124221991,63.7469837813087,{"$f":"T299","v":16.156401257074279},{"$f":"U299","v":6.3814050164947229},18.904279960393978,58.557913766037018,{"$f":"Y299","v":30.82251635608791},{"$f":"Z299","v":8.4281286016511352},24.530367342460522,36.218987699800437]
[null,null,null,null,{"$f":"C300","v":2020},{"$f":"E300","v":15.394023962252547},7.3358926209647999,21.318111283534108,55.951972133248546,{"$f":"J300","v":16.408730427860945},6.3313817766250224,20.136868353782802,57.12301944173123,{"$f":"O300","v":25.10775283695429},9.7130735767567806,25.925423325201791,39.253750261087134,{"$f":"T300","v":33.439361505400569},13.207774792391232,26.024108294970574,27.328755407237622,{"$f":"Y300","v":50.147404543746646},13.712338397388564,24.0442096893089,12.09604736955589]
[]
[]
[]
[]
[]
[]
[]
[]
[]
[]
[]
[]
[]
[]
[]
[]
[]
[]
[]
[]
[]
[]
[]
[]
[]
[]
[]
[]
[]
[]
[]
[]
[]
[]
[]
[]
[]
[]
[]
[]
[]
[]
[]
[]
[]
[]
[]
[]
[]
[]
[]
[]
[]
[]
[]
[]
["NATIONAL",null,null,"Poorest",null,null,null,null,"Poor",null,null,null,null,"Middle",null,null,null,null,"Rich",null,null,null,null,"Richest"]
[null,null,null,"Improved","Basic","Limited","Unimproved","Open defecation","Improved","Basic","Limited","Unimproved","Open defecation","Improved","Basic","Limited","Unimproved","Open defecation","Improved","Basic","Limited","Unimproved","Open defecation","Improved","Basic","Limited","Unimproved","Open defecation"]
["Forecast period:",null,2000,{"$f":"IF((D101+H101)>100,D101*100/(D101+H101),D101)","v":13.462264776242819},{"$f":"D99*AVERAGEIF(E105:E116,\">0\")/100","v":9.1417275942383718},{"$f":"D99*(100-AVERAGEIF(E105:E116,\">0\"))/100","v":4.320537182004446},{"$f":"100-(E99+F99+H99)","v":12.481041799828517},{"$f":"IF((D101+H101)>100,H101*100/(D101+H101),H101)","v":74.056693423928664},{"$f":"IF((I101+M101)>100,I101*100/(I101+M101),I101)","v":22.827816668814194},{"$f":"I99*AVERAGEIF(J105:J116,\">0\")/100","v":14.535626414185231},{"$f":"I99*(100-AVERAGEIF(J105:J116,\">0\"))/100","v":8.292190254628963},{"$f":"100-(J99+K99+M99)","v":20.064014240066172},{"$f":"IF((I101+M101)>100,M101*100/(I101+M101),M101)","v":57.108169091119635},{"$f":"IF((N101+R101)>100,N101*100/(N101+R101),N101)","v":45.642240472072444},{"$f":"N99*AVERAGEIF(O105:O116,\">0\")/100","v":25.913390518016534},{"$f":"N99*(100-AVERAGEIF(O105:O116,\">0\"))/100","v":19.72884995405591},{"$f":"100-(O99+P99+R99)","v":16.072459814247395},{"$f":"IF((N101+R101)>100,R101*100/(N101+R101),R101)","v":38.28529971368016},{"$f":"IF((S101+W101)>100,S101*100/(S101+W101),S101)","v":72.126101573466713},{"$f":"S99*AVERAGEIF(T105:T116,\">0\")/100","v":47.984837116531793},{"$f":"S99*(100-AVERAGEIF(T105:T116,\">0\"))/100","v":24.141264456934923},{"$f":"100-(T99+U99+W99)","v":14.950553970552392},{"$f":"IF((S101+W101)>100,W101*100/(S101+W101),W101)","v":12.923344455980896},{"$f":"IF((X101+AB101)>100,X101*100/(X101+AB101),X101)","v":89.810217157363923},{"$f":"X99*AVERAGEIF(Y105:Y116,\">0\")/100","v":80.643488786167438},{"$f":"X99*(100-AVERAGEIF(Y105:Y116,\">0\"))/100","v":9.1667283711964789},{"$f":"100-(Y99+Z99+AB99)","v":8.7018182597262808},{"$f":"IF((X101+AB101)>100,AB101*100/(X101+AB101),AB101)","v":1.4879645829097967}]
[null,null,2020,{"$f":"IF((D102+H102)>100,D102*100/(D102+H102),D102)","v":30.469465549786719},{"$f":"D100*AVERAGEIF(E105:E116,\">0\")/100","v":20.690690506231405},{"$f":"D100*(100-AVERAGEIF(E105:E116,\">0\"))/100","v":9.7787750435553171},{"$f":"100-(E100+F100+H100)","v":21.990720680731783},{"$f":"IF((D102+H102)>100,H102*100/(D102+H102),H102)","v":47.539813769481498},{"$f":"IF((I102+M102)>100,I102*100/(I102+M102),I102)","v":67.373000659476929},{"$f":"I100*AVERAGEIF(J105:J116,\">0\")/100","v":42.899799932539175},{"$f":"I100*(100-AVERAGEIF(J105:J116,\">0\"))/100","v":24.473200726937751},{"$f":"100-(J100+K100+M100)","v":18.113102138737304},{"$f":"IF((I102+M102)>100,M102*100/(I102+M102),M102)","v":14.513897201785767},{"$f":"IF((N102+R102)>100,N102*100/(N102+R102),N102)","v":82.837067465877226},{"$f":"N100*AVERAGEIF(O105:O116,\">0\")/100","v":47.030760462427637},{"$f":"N100*(100-AVERAGEIF(O105:O116,\">0\"))/100","v":35.806307003449596},{"$f":"100-(O100+P100+R100)","v":13.341821622790576},{"$f":"IF((N102+R102)>100,R102*100/(N102+R102),R102)","v":3.8211109113321982},{"$f":"IF((S102+W102)>100,S102*100/(S102+W102),S102)","v":91.936642747274618},{"$f":"S100*AVERAGEIF(T105:T116,\">0\")/100","v":61.1646093581695},{"$f":"S100*(100-AVERAGEIF(T105:T116,\">0\"))/100","v":30.772033389105115},{"$f":"100-(T100+U100+W100)","v":6.9305854038725556},{"$f":"IF((S102+W102)>100,W102*100/(S102+W102),W102)","v":1.1327718488528262},{"$f":"IF((X102+AB102)>100,X102*100/(X102+AB102),X102)","v":97.686657605932055},{"$f":"X100*AVERAGEIF(Y105:Y116,\">0\")/100","v":87.715998541667318},{"$f":"X100*(100-AVERAGEIF(Y105:Y116,\">0\"))/100","v":9.9706590642647228},{"$f":"100-(Y100+Z100+AB100)","v":2.0291382560597953},{"$f":"IF((X102+AB102)>100,AB102*100/(X102+AB102),AB102)","v":0.28420413800816391}]
["Regression period:",null,{"$f":"MinRegYear(C99,C105:C116)","v":2001},{"$f":"IF(MAX(C105:C116)-MIN(C105:C116)<5,AVERAGEIF(C105:C116,\">0\",D105:D116),\nIF(FORECAST($C101,D$105:D$116,$C$105:$C$116)<0,0,\nIF(FORECAST($C101,D$105:D$116,$C$105:$C$116)>100,100,\nFORECAST($C101,D$105:D$116,$C$105:$C$116))))","v":13.462264776242819},null,null,null,{"$f":"IF(MAX(C105:C116)-MIN(C105:C116)<5,AVERAGEIF(C105:C116,\">0\",H105:H116),\nIF(FORECAST($C101,H$105:H$116,$C$105:$C$116)<0,0,\nIF(FORECAST($C101,H$105:H$116,$C$105:$C$116)>100,100,\nFORECAST($C101,H$105:H$116,$C$105:$C$116))))","v":74.056693423928664},{"$f":"IF(MAX(C105:C116)-MIN(C105:C116)<5,AVERAGEIF(C105:C116,\">0\",I105:I116),\nIF(FORECAST($C101,I$105:I$116,$C$105:$C$116)<0,0,\nIF(FORECAST($C101,I$105:I$116,$C$105:$C$116)>100,100,\nFORECAST($C101,I$105:I$116,$C$105:$C$116))))","v":22.827816668814194},null,null,null,{"$f":"IF(MAX(C105:C116)-MIN(C105:C116)<5,AVERAGEIF(C105:C116,\">0\",M105:M116),\nIF(FORECAST($C101,M$105:M$116,$C$105:$C$116)<0,0,\nIF(FORECAST($C101,M$105:M$116,$C$105:$C$116)>100,100,\nFORECAST($C101,M$105:M$116,$C$105:$C$116))))","v":57.108169091119635},{"$f":"IF(MAX(C105:C116)-MIN(C105:C116)<5,AVERAGEIF(C105:C116,\">0\",N105:N116),\nIF(FORECAST($C101,N$105:N$116,$C$105:$C$116)<0,0,\nIF(FORECAST($C101,N$105:N$116,$C$105:$C$116)>100,100,\nFORECAST($C101,N$105:N$116,$C$105:$C$116))))","v":45.642240472072444},null,null,null,{"$f":"IF(MAX(C105:C116)-MIN(C105:C116)<5,AVERAGEIF(C105:C116,\">0\",R105:R116),\nIF(FORECAST($C101,R$105:R$116,$C$105:$C$116)<0,0,\nIF(FORECAST($C101,R$105:R$116,$C$105:$C$116)>100,100,\nFORECAST($C101,R$105:R$116,$C$105:$C$116))))","v":38.28529971368016},{"$f":"IF(MAX(C105:C116)-MIN(C105:C116)<5,AVERAGEIF(C105:C116,\">0\",S105:S116),\nIF(FORECAST($C101,S$105:S$116,$C$105:$C$116)<0,0,\nIF(FORECAST($C101,S$105:S$116,$C$105:$C$116)>100,100,\nFORECAST($C101,S$105:S$116,$C$105:$C$116))))","v":72.126101573466713},null,null,null,{"$f":"IF(MAX(C105:C116)-MIN(C105:C116)<5,AVERAGEIF(C105:C116,\">0\",W105:W116),\nIF(FORECAST($C101,W$105:W$116,$C$105:$C$116)<0,0,\nIF(FORECAST($C101,W$105:W$116,$C$105:$C$116)>100,100,\nFORECAST($C101,W$105:W$116,$C$105:$C$116))))","v":12.923344455980896},{"$f":"IF(MAX(C105:C116)-MIN(C105:C116)<5,AVERAGEIF(C105:C116,\">0\",X105:X116),\nIF(FORECAST($C101,X$105:X$116,$C$105:$C$116)<0,0,\nIF(FORECAST($C101,X$105:X$116,$C$105:$C$116)>100,100,\nFORECAST($C101,X$105:X$116,$C$105:$C$116))))","v":89.810217157363923},null,null,null,{"$f":"IF(MAX(C105:C116)-MIN(C105:C116)<5,AVERAGEIF(C105:C116,\">0\",AB105:AB116),\nIF(FORECAST($C101,AB$105:AB$116,$C$105:$C$116)<0,0,\nIF(FORECAST($C101,AB$105:AB$116,$C$105:$C$116)>100,100,\nFORECAST($C101,AB$105:AB$116,$C$105:$C$116))))","v":1.4879645829097967}]
[null,null,{"$f":"MaxRegYear(C100,C105:C116)","v":2018},{"$f":"IF(MAX(C105:C116)-MIN(C105:C116)<5,AVERAGEIF(C105:C116,\">0\",D105:D116),\nIF(FORECAST($C102,D$105:D$116,$C$105:$C$116)<0,0,\nIF(FORECAST($C102,D$105:D$116,$C$105:$C$116)>100,100,\nFORECAST($C102,D$105:D$116,$C$105:$C$116))))","v":30.469465549786719},null,null,null,{"$f":"IF(MAX(C105:C116)-MIN(C105:C116)<5,AVERAGEIF(C105:C116,\">0\",H105:H116),\nIF(FORECAST($C102,H$105:H$116,$C$105:$C$116)<0,0,\nIF(FORECAST($C102,H$105:H$116,$C$105:$C$116)>100,100,\nFORECAST($C102,H$105:H$116,$C$105:$C$116))))","v":47.539813769481498},{"$f":"IF(MAX(C105:C116)-MIN(C105:C116)<5,AVERAGEIF(C105:C116,\">0\",I105:I116),\nIF(FORECAST($C102,I$105:I$116,$C$105:$C$116)<0,0,\nIF(FORECAST($C102,I$105:I$116,$C$105:$C$116)>100,100,\nFORECAST($C102,I$105:I$116,$C$105:$C$116))))","v":67.373000659476929},null,null,null,{"$f":"IF(MAX(C105:C116)-MIN(C105:C116)<5,AVERAGEIF(C105:C116,\">0\",M105:M116),\nIF(FORECAST($C102,M$105:M$116,$C$105:$C$116)<0,0,\nIF(FORECAST($C102,M$105:M$116,$C$105:$C$116)>100,100,\nFORECAST($C102,M$105:M$116,$C$105:$C$116))))","v":14.513897201785767},{"$f":"IF(MAX(C105:C116)-MIN(C105:C116)<5,AVERAGEIF(C105:C116,\">0\",N105:N116),\nIF(FORECAST($C102,N$105:N$116,$C$105:$C$116)<0,0,\nIF(FORECAST($C102,N$105:N$116,$C$105:$C$116)>100,100,\nFORECAST($C102,N$105:N$116,$C$105:$C$116))))","v":82.837067465877226},null,null,null,{"$f":"IF(MAX(C105:C116)-MIN(C105:C116)<5,AVERAGEIF(C105:C116,\">0\",R105:R116),\nIF(FORECAST($C102,R$105:R$116,$C$105:$C$116)<0,0,\nIF(FORECAST($C102,R$105:R$116,$C$105:$C$116)>100,100,\nFORECAST($C102,R$105:R$116,$C$105:$C$116))))","v":3.8211109113321982},{"$f":"IF(MAX(C105:C116)-MIN(C105:C116)<5,AVERAGEIF(C105:C116,\">0\",S105:S116),\nIF(FORECAST($C102,S$105:S$116,$C$105:$C$116)<0,0,\nIF(FORECAST($C102,S$105:S$116,$C$105:$C$116)>100,100,\nFORECAST($C102,S$105:S$116,$C$105:$C$116))))","v":91.936642747274618},null,null,null,{"$f":"IF(MAX(C105:C116)-MIN(C105:C116)<5,AVERAGEIF(C105:C116,\">0\",W105:W116),\nIF(FORECAST($C102,W$105:W$116,$C$105:$C$116)<0,0,\nIF(FORECAST($C102,W$105:W$116,$C$105:$C$116)>100,100,\nFORECAST($C102,W$105:W$116,$C$105:$C$116))))","v":1.1327718488528262},{"$f":"IF(MAX(C105:C116)-MIN(C105:C116)<5,AVERAGEIF(C105:C116,\">0\",X105:X116),\nIF(FORECAST($C102,X$105:X$116,$C$105:$C$116)<0,0,\nIF(FORECAST($C102,X$105:X$116,$C$105:$C$116)>100,100,\nFORECAST($C102,X$105:X$116,$C$105:$C$116))))","v":97.686657605932055},null,null,null,{"$f":"IF(MAX(C105:C116)-MIN(C105:C116)<5,AVERAGEIF(C105:C116,\">0\",AB105:AB116),\nIF(FORECAST($C102,AB$105:AB$116,$C$105:$C$116)<0,0,\nIF(FORECAST($C102,AB$105:AB$116,$C$105:$C$116)>100,100,\nFORECAST($C102,AB$105:AB$116,$C$105:$C$116))))","v":0.28420413800816391}]
[]
[null,"Survey","Year","Improved","Not shared",null,null,"Open defecation","Improved","Not shared",null,null,"Open defecation","Improved","Not shared",null,null,"Open defecation","Improved","Not shared",null,null,"Open defecation","Improved","Not shared",null,null,"Open defecation"]
[null,"DHS03",2003,{"$f":"IF(ISERROR(INDIRECT(CONCATENATE($B105,\"!C122\"))),\"\",INDIRECT(CONCATENATE($B105,\"!C122\")))","v":15.463111926071505},{"$f":"IF(ISERROR(INDIRECT(CONCATENATE($B105,\"!C129\"))),\"\",INDIRECT(CONCATENATE($B105,\"!C129\")))","v":28.594891312415484},null,null,{"$f":"IF(ISERROR(INDIRECT(CONCATENATE($B105,\"!C127\"))),\"\",INDIRECT(CONCATENATE($B105,\"!C127\")))","v":70.937060523405719},{"$f":"IF(ISERROR(INDIRECT(CONCATENATE($B105,\"!D122\"))),\"\",INDIRECT(CONCATENATE($B105,\"!D122\")))","v":28.068426550068313},{"$f":"IF(ISERROR(INDIRECT(CONCATENATE($B105,\"!D129\"))),\"\",INDIRECT(CONCATENATE($B105,\"!D129\")))","v":41.141734225277233},null,null,{"$f":"IF(ISERROR(INDIRECT(CONCATENATE($B105,\"!D127\"))),\"\",INDIRECT(CONCATENATE($B105,\"!D127\")))","v":52.097078280610134},{"$f":"IF(ISERROR(INDIRECT(CONCATENATE($B105,\"!E122\"))),\"\",INDIRECT(CONCATENATE($B105,\"!E122\")))","v":50.018102471343241},{"$f":"IF(ISERROR(INDIRECT(CONCATENATE($B105,\"!E129\"))),\"\",INDIRECT(CONCATENATE($B105,\"!E129\")))","v":38.363627442048717},null,null,{"$f":"IF(ISERROR(INDIRECT(CONCATENATE($B105,\"!E127\"))),\"\",INDIRECT(CONCATENATE($B105,\"!E127\")))","v":34.230689266345081},{"$f":"IF(ISERROR(INDIRECT(CONCATENATE($B105,\"!F122\"))),\"\",INDIRECT(CONCATENATE($B105,\"!F122\")))","v":74.456753476267522},{"$f":"IF(ISERROR(INDIRECT(CONCATENATE($B105,\"!F129\"))),\"\",INDIRECT(CONCATENATE($B105,\"!F129\")))","v":57.617201481863958},null,null,{"$f":"IF(ISERROR(INDIRECT(CONCATENATE($B105,\"!F127\"))),\"\",INDIRECT(CONCATENATE($B105,\"!F127\")))","v":11.53621826690704},{"$f":"IF(ISERROR(INDIRECT(CONCATENATE($B105,\"!G122\"))),\"\",INDIRECT(CONCATENATE($B105,\"!G122\")))","v":90.736857210136691},{"$f":"IF(ISERROR(INDIRECT(CONCATENATE($B105,\"!G129\"))),\"\",INDIRECT(CONCATENATE($B105,\"!G129\")))","v":89.885210769522089},null,null,{"$f":"IF(ISERROR(INDIRECT(CONCATENATE($B105,\"!G2127\"))),\"\",INDIRECT(CONCATENATE($B105,\"!G127\")))","v":1.3463457070390377}]
[null,"DHS08",null,16.621551846963378,93.052617630775202,null,null,68.612218636846251,8.6513287371913705,83.079654237249756,null,null,45.690759913716924,47.083674547035294,60.092851173625206,null,null,23.170527961311475,71.427284834679625,64.066696951211142,null,null,4.1880753918854161,89.140421660839991,88.147582444715866,null,null,0.72751803426506934]
[null,"EDS16",2016,28.468618399958068,82.071428683953556,null,null,50.65944667000489,62.132390778221605,66.803797498986512,null,null,19.524988012296223,78.461205466605307,71.868577187879879,null,null,7.8757213586670884,89.60599084447361,77.903363610978644,null,null,2.5198980379267022,96.760017553159415,91.346876511530468,null,null,0.4258230138789707]
[null,null,null,"","",null,null,"","","",null,null,"","","",null,null,"","","",null,null,"","","",null,null,""]
[null,null,null,"","",null,null,"","","",null,null,"","","",null,null,"","","",null,null,"","","",null,null,""]
[null,null,null,"","",null,null,"","","",null,null,"","","",null,null,"","","",null,null,"","","",null,null,""]
[null,null,null,"","",null,null,"","","",null,null,"","","",null,null,"","","",null,null,"","","",null,null,""]
[null,null,null,"","",null,null,"","","",null,null,"","","",null,null,"","","",null,null,"","","",null,null,""]
[null,null,null,"","",null,null,"","","",null,null,"","","",null,null,"","","",null,null,"","","",null,null,""]
[null,null,null,"","",null,null,"","","",null,null,"","","",null,null,"","","",null,null,"","","",null,null,""]
[null,null,null,"","",null,null,"","","",null,null,"","","",null,null,"","","",null,null,"","","",null,null,""]
[null,null,null,"","",null,null,"","","",null,null,"","","",null,null,"","","",null,null,"","","",null,null,""]
[]
[null,{"$f":"CONCATENATE(\"National use of sanitation facilities, \",C99,\"–\",C100)","v":"National use of sanitation facilities, 2000–2020"},null,null,null,null,null,null,null,null,null,null,null,null,null,null,null,null,"Data points used for regression"]
[]
[]
[]
[]
[]
[]
[]
[]
[]
[]
[]
[]
[]
[]
[]
[]
[]
[]
[]
[]
[]
[]
[]
[]
[]
[]
[]
[]
[]
[]
[]
[]
[]
[]
[]
[]
[]
[]
[]
[]
[]
[]
[]
[]
[]
[]
[]
[]
[]
[]
[]
[]
[]
[]
[]
[]
[]
[]
[]
[]
[]
[]
[]
[]
[]
[]
[]
[]
[]
[]
[]
[]
[]
[]
[]
[]
[]
[]
["URBAN",null,null,"Poorest",null,null,null,null,"Poor",null,null,null,null,"Middle",null,null,null,null,"Rich",null,null,null,null,"Richest"]
[null,null,null,"Improved","Basic","Limited","Unimproved","Open defecation","Improved","Basic","Limited","Unimproved","Open defecation","Improved","Basic","Limited","Unimproved","Open defecation","Improved","Basic","Limited","Unimproved","Open defecation","Improved","Basic","Limited","Unimproved","Open defecation"]
["Forecast period:",null,2000,{"$f":"IF((D201+H201)>100,D201*100/(D201+H201),D201)","v":32.40476109354131},{"$f":"D199*AVERAGEIF(E205:E216,\">0\")/100","v":16.933858532894043},{"$f":"D199*(100-AVERAGEIF(E205:E216,\">0\"))/100","v":15.470902560647268},{"$f":"100-(E199+F199+H199)","v":17.936940788350512},{"$f":"IF((D201+H201)>100,H201*100/(D201+H201),H201)","v":49.658298118108178},{"$f":"IF((I201+M201)>100,I201*100/(I201+M201),I201)","v":53.845556072070849},{"$f":"I199*AVERAGEIF(J205:J216,\">0\")/100","v":28.445032854001578},{"$f":"I199*(100-AVERAGEIF(J205:J216,\">0\"))/100","v":25.400523218069271},{"$f":"100-(J199+K199+M199)","v":14.462703471109762},{"$f":"IF((I201+M201)>100,M201*100/(I201+M201),M201)","v":31.691740456819389},{"$f":"IF((N201+R201)>100,N201*100/(N201+R201),N201)","v":73.596559811606767},{"$f":"N199*AVERAGEIF(O205:O216,\">0\")/100","v":46.553199804372234},{"$f":"N199*(100-AVERAGEIF(O205:O216,\">0\"))/100","v":27.043360007234529},{"$f":"100-(O199+P199+R199)","v":14.136203663609876},{"$f":"IF((N201+R201)>100,R201*100/(N201+R201),R201)","v":12.267236524783357},{"$f":"IF((S201+W201)>100,S201*100/(S201+W201),S201)","v":79.976515466648607},{"$f":"S199*AVERAGEIF(T205:T216,\">0\")/100","v":60.903591056761051},{"$f":"S199*(100-AVERAGEIF(T205:T216,\">0\"))/100","v":19.072924409887555},{"$f":"100-(T199+U199+W199)","v":12.761998433903614},{"$f":"IF((S201+W201)>100,W201*100/(S201+W201),W201)","v":7.2614860994477795},{"$f":"IF((X201+AB201)>100,X201*100/(X201+AB201),X201)","v":93.709130037883824},{"$f":"X199*AVERAGEIF(Y205:Y216,\">0\")/100","v":88.635121231728462},{"$f":"X199*(100-AVERAGEIF(Y205:Y216,\">0\"))/100","v":5.0740088061553701},{"$f":"100-(Y199+Z199+AB199)","v":5.881028560628522},{"$f":"IF((X201+AB201)>100,AB201*100/(X201+AB201),AB201)","v":0.40984140148763382}]
[null,null,2020,{"$f":"IF((D202+H202)>100,D202*100/(D202+H202),D202)","v":72.443614076846643},{"$f":"D200*AVERAGEIF(E205:E216,\">0\")/100","v":37.857088618789405},{"$f":"D200*(100-AVERAGEIF(E205:E216,\">0\"))/100","v":34.586525458057238},{"$f":"100-(E200+F200+H200)","v":15.644262686336333},{"$f":"IF((D202+H202)>100,H202*100/(D202+H202),H202)","v":11.912123236817024},{"$f":"IF((I202+M202)>100,I202*100/(I202+M202),I202)","v":88.186218598636515},{"$f":"I200*AVERAGEIF(J205:J216,\">0\")/100","v":46.58620076187669},{"$f":"I200*(100-AVERAGEIF(J205:J216,\">0\"))/100","v":41.600017836759825},{"$f":"100-(J200+K200+M200)","v":10.670976275841895},{"$f":"IF((I202+M202)>100,M202*100/(I202+M202),M202)","v":1.1428051255215905},{"$f":"IF((N202+R202)>100,N202*100/(N202+R202),N202)","v":93.063160309305658},{"$f":"N200*AVERAGEIF(O205:O216,\">0\")/100","v":58.866717512279401},{"$f":"N200*(100-AVERAGEIF(O205:O216,\">0\"))/100","v":34.196442797026258},{"$f":"100-(O200+P200+R200)","v":6.0907562262589181},{"$f":"IF((N202+R202)>100,R202*100/(N202+R202),R202)","v":0.84608346443542359},{"$f":"IF((S202+W202)>100,S202*100/(S202+W202),S202)","v":96.088786713504987},{"$f":"S200*AVERAGEIF(T205:T216,\">0\")/100","v":73.173382673568426},{"$f":"S200*(100-AVERAGEIF(T205:T216,\">0\"))/100","v":22.915404039936561},{"$f":"100-(T200+U200+W200)","v":3.9112132864950127},{"$f":"IF((S202+W202)>100,W202*100/(S202+W202),W202)","v":0},{"$f":"IF((X202+AB202)>100,X202*100/(X202+AB202),X202)","v":98.474441444580407},{"$f":"X200*AVERAGEIF(Y205:Y216,\">0\")/100","v":93.142408345254495},{"$f":"X200*(100-AVERAGEIF(Y205:Y216,\">0\"))/100","v":5.3320330993259084},{"$f":"100-(Y200+Z200+AB200)","v":1.1072268774052105},{"$f":"IF((X202+AB202)>100,AB202*100/(X202+AB202),AB202)","v":0.41833167801438098}]
["Regression period:",null,{"$f":"MinRegYear(C199,C205:C216)","v":2001},{"$f":"IF(MAX(C205:C216)-MIN(C205:C216)<5,AVERAGEIF(C205:C216,\">0\",D205:D216),\nIF(FORECAST($C201,D$205:D$216,$C$205:$C$216)<0,0,\nIF(FORECAST($C201,D$205:D$216,$C$205:$C$216)>100,100,\nFORECAST($C201,D$205:D$216,$C$205:$C$216))))","v":32.40476109354131},null,null,null,{"$f":"IF(MAX(C205:C216)-MIN(C205:C216)<5,AVERAGEIF(C205:C216,\">0\",H205:H216),\nIF(FORECAST($C201,H$205:H$216,$C$205:$C$216)<0,0,\nIF(FORECAST($C201,H$205:H$216,$C$205:$C$216)>100,100,\nFORECAST($C201,H$205:H$216,$C$205:$C$216))))","v":49.658298118108178},{"$f":"IF(MAX(C205:C216)-MIN(C205:C216)<5,AVERAGEIF(C205:C216,\">0\",I205:I216),\nIF(FORECAST($C201,I$205:I$216,$C$205:$C$216)<0,0,\nIF(FORECAST($C201,I$205:I$216,$C$205:$C$216)>100,100,\nFORECAST($C201,I$205:I$216,$C$205:$C$216))))","v":53.845556072070849},null,null,null,{"$f":"IF(MAX(C205:C216)-MIN(C205:C216)<5,AVERAGEIF(C205:C216,\">0\",M205:M216),\nIF(FORECAST($C201,M$205:M$216,$C$205:$C$216)<0,0,\nIF(FORECAST($C201,M$205:M$216,$C$205:$C$216)>100,100,\nFORECAST($C201,M$205:M$216,$C$205:$C$216))))","v":31.691740456819389},{"$f":"IF(MAX(C205:C216)-MIN(C205:C216)<5,AVERAGEIF(C205:C216,\">0\",N205:N216),\nIF(FORECAST($C201,N$205:N$216,$C$205:$C$216)<0,0,\nIF(FORECAST($C201,N$205:N$216,$C$205:$C$216)>100,100,\nFORECAST($C201,N$205:N$216,$C$205:$C$216))))","v":73.596559811606767},null,null,null,{"$f":"IF(MAX(C205:C216)-MIN(C205:C216)<5,AVERAGEIF(C205:C216,\">0\",R205:R216),\nIF(FORECAST($C201,R$205:R$216,$C$205:$C$216)<0,0,\nIF(FORECAST($C201,R$205:R$216,$C$205:$C$216)>100,100,\nFORECAST($C201,R$205:R$216,$C$205:$C$216))))","v":12.267236524783357},{"$f":"IF(MAX(C205:C216)-MIN(C205:C216)<5,AVERAGEIF(C205:C216,\">0\",S205:S216),\nIF(FORECAST($C201,S$205:S$216,$C$205:$C$216)<0,0,\nIF(FORECAST($C201,S$205:S$216,$C$205:$C$216)>100,100,\nFORECAST($C201,S$205:S$216,$C$205:$C$216))))","v":79.976515466648607},null,null,null,{"$f":"IF(MAX(C205:C216)-MIN(C205:C216)<5,AVERAGEIF(C205:C216,\">0\",W205:W216),\nIF(FORECAST($C201,W$205:W$216,$C$205:$C$216)<0,0,\nIF(FORECAST($C201,W$205:W$216,$C$205:$C$216)>100,100,\nFORECAST($C201,W$205:W$216,$C$205:$C$216))))","v":7.2614860994477795},{"$f":"IF(MAX(C205:C216)-MIN(C205:C216)<5,AVERAGEIF(C205:C216,\">0\",X205:X216),\nIF(FORECAST($C201,X$205:X$216,$C$205:$C$216)<0,0,\nIF(FORECAST($C201,X$205:X$216,$C$205:$C$216)>100,100,\nFORECAST($C201,X$205:X$216,$C$205:$C$216))))","v":93.709130037883824},null,null,null,{"$f":"IF(MAX(C205:C216)-MIN(C205:C216)<5,AVERAGEIF(C205:C216,\">0\",AB205:AB216),\nIF(FORECAST($C201,AB$205:AB$216,$C$205:$C$216)<0,0,\nIF(FORECAST($C201,AB$205:AB$216,$C$205:$C$216)>100,100,\nFORECAST($C201,AB$205:AB$216,$C$205:$C$216))))","v":0.40984140148763382}]
[null,null,{"$f":"MaxRegYear(C200,C205:C216)","v":2018},{"$f":"IF(MAX(C205:C216)-MIN(C205:C216)<5,AVERAGEIF(C205:C216,\">0\",D205:D216),\nIF(FORECAST($C202,D$205:D$216,$C$205:$C$216)<0,0,\nIF(FORECAST($C202,D$205:D$216,$C$205:$C$216)>100,100,\nFORECAST($C202,D$205:D$216,$C$205:$C$216))))","v":72.443614076846643},null,null,null,{"$f":"IF(MAX(C205:C216)-MIN(C205:C216)<5,AVERAGEIF(C205:C216,\">0\",H205:H216),\nIF(FORECAST($C202,H$205:H$216,$C$205:$C$216)<0,0,\nIF(FORECAST($C202,H$205:H$216,$C$205:$C$216)>100,100,\nFORECAST($C202,H$205:H$216,$C$205:$C$216))))","v":11.912123236817024},{"$f":"IF(MAX(C205:C216)-MIN(C205:C216)<5,AVERAGEIF(C205:C216,\">0\",I205:I216),\nIF(FORECAST($C202,I$205:I$216,$C$205:$C$216)<0,0,\nIF(FORECAST($C202,I$205:I$216,$C$205:$C$216)>100,100,\nFORECAST($C202,I$205:I$216,$C$205:$C$216))))","v":88.186218598636515},null,null,null,{"$f":"IF(MAX(C205:C216)-MIN(C205:C216)<5,AVERAGEIF(C205:C216,\">0\",M205:M216),\nIF(FORECAST($C202,M$205:M$216,$C$205:$C$216)<0,0,\nIF(FORECAST($C202,M$205:M$216,$C$205:$C$216)>100,100,\nFORECAST($C202,M$205:M$216,$C$205:$C$216))))","v":1.1428051255215905},{"$f":"IF(MAX(C205:C216)-MIN(C205:C216)<5,AVERAGEIF(C205:C216,\">0\",N205:N216),\nIF(FORECAST($C202,N$205:N$216,$C$205:$C$216)<0,0,\nIF(FORECAST($C202,N$205:N$216,$C$205:$C$216)>100,100,\nFORECAST($C202,N$205:N$216,$C$205:$C$216))))","v":93.063160309305658},null,null,null,{"$f":"IF(MAX(C205:C216)-MIN(C205:C216)<5,AVERAGEIF(C205:C216,\">0\",R205:R216),\nIF(FORECAST($C202,R$205:R$216,$C$205:$C$216)<0,0,\nIF(FORECAST($C202,R$205:R$216,$C$205:$C$216)>100,100,\nFORECAST($C202,R$205:R$216,$C$205:$C$216))))","v":0.84608346443542359},{"$f":"IF(MAX(C205:C216)-MIN(C205:C216)<5,AVERAGEIF(C205:C216,\">0\",S205:S216),\nIF(FORECAST($C202,S$205:S$216,$C$205:$C$216)<0,0,\nIF(FORECAST($C202,S$205:S$216,$C$205:$C$216)>100,100,\nFORECAST($C202,S$205:S$216,$C$205:$C$216))))","v":96.088786713504987},null,null,null,{"$f":"IF(MAX(C205:C216)-MIN(C205:C216)<5,AVERAGEIF(C205:C216,\">0\",W205:W216),\nIF(FORECAST($C202,W$205:W$216,$C$205:$C$216)<0,0,\nIF(FORECAST($C202,W$205:W$216,$C$205:$C$216)>100,100,\nFORECAST($C202,W$205:W$216,$C$205:$C$216))))","v":0},{"$f":"IF(MAX(C205:C216)-MIN(C205:C216)<5,AVERAGEIF(C205:C216,\">0\",X205:X216),\nIF(FORECAST($C202,X$205:X$216,$C$205:$C$216)<0,0,\nIF(FORECAST($C202,X$205:X$216,$C$205:$C$216)>100,100,\nFORECAST($C202,X$205:X$216,$C$205:$C$216))))","v":98.474441444580407},null,null,null,{"$f":"IF(MAX(C205:C216)-MIN(C205:C216)<5,AVERAGEIF(C205:C216,\">0\",AB205:AB216),\nIF(FORECAST($C202,AB$205:AB$216,$C$205:$C$216)<0,0,\nIF(FORECAST($C202,AB$205:AB$216,$C$205:$C$216)>100,100,\nFORECAST($C202,AB$205:AB$216,$C$205:$C$216))))","v":0.41833167801438098}]
[]
[null,"Survey","Year","Improved","Not shared",null,null,"Open defecation","Improved","Not shared",null,null,"Open defecation","Improved","Not shared",null,null,"Open defecation","Improved","Not shared",null,null,"Open defecation","Improved","Not shared",null,null,"Open defecation"]
[null,"DHS03",2003,{"$f":"IF(ISERROR(INDIRECT(CONCATENATE($B205,\"!H122\"))),\"\",INDIRECT(CONCATENATE($B205,\"!H122\")))","v":37.115214385695424},{"$f":"IF(ISERROR(INDIRECT(CONCATENATE($B205,\"!H129\"))),\"\",INDIRECT(CONCATENATE($B205,\"!H129\")))","v":36.81533150171412},null,null,{"$f":"IF(ISERROR(INDIRECT(CONCATENATE($B205,\"!H127\"))),\"\",INDIRECT(CONCATENATE($B205,\"!H127\")))","v":45.217571661485927},{"$f":"IF(ISERROR(INDIRECT(CONCATENATE($B205,\"!I122\"))),\"\",INDIRECT(CONCATENATE($B205,\"!I122\")))","v":57.885634016372705},{"$f":"IF(ISERROR(INDIRECT(CONCATENATE($B205,\"!I129\"))),\"\",INDIRECT(CONCATENATE($B205,\"!I129\")))","v":36.403211646116333},null,null,{"$f":"IF(ISERROR(INDIRECT(CONCATENATE($B205,\"!I127\"))),\"\",INDIRECT(CONCATENATE($B205,\"!I127\")))","v":28.097748064902063},{"$f":"IF(ISERROR(INDIRECT(CONCATENATE($B205,\"!J122\"))),\"\",INDIRECT(CONCATENATE($B205,\"!J122\")))","v":75.886748105453506},{"$f":"IF(ISERROR(INDIRECT(CONCATENATE($B205,\"!J129\"))),\"\",INDIRECT(CONCATENATE($B205,\"!J129\")))","v":54.706817429663971},null,null,{"$f":"IF(ISERROR(INDIRECT(CONCATENATE($B205,\"!J127\"))),\"\",INDIRECT(CONCATENATE($B205,\"!J127\")))","v":10.923571458860042},{"$f":"IF(ISERROR(INDIRECT(CONCATENATE($B205,\"!K122\"))),\"\",INDIRECT(CONCATENATE($B205,\"!K122\")))","v":81.872076789808034},{"$f":"IF(ISERROR(INDIRECT(CONCATENATE($B205,\"!K129\"))),\"\",INDIRECT(CONCATENATE($B205,\"!K129\")))","v":72.835650214576702},null,null,{"$f":"IF(ISERROR(INDIRECT(CONCATENATE($B205,\"!K127\"))),\"\",INDIRECT(CONCATENATE($B205,\"!K127\")))","v":6.3655053137266426},{"$f":"IF(ISERROR(INDIRECT(CONCATENATE($B205,\"!L122\"))),\"\",INDIRECT(CONCATENATE($B205,\"!L122\")))","v":94.269754909259845},{"$f":"IF(ISERROR(INDIRECT(CONCATENATE($B205,\"!L129\"))),\"\",INDIRECT(CONCATENATE($B205,\"!L129\")))","v":95.548911887831707},null,null,{"$f":"IF(ISERROR(INDIRECT(CONCATENATE($B205,\"!L2127\"))),\"\",INDIRECT(CONCATENATE($B205,\"!L127\")))","v":0.41084025754960396}]
[null,"DHS08",null,30.714529557282486,61.659690833672776,null,null,27.349692704504953,63.326928154093487,56.78795142365032,null,null,13.804667833134729,73.152112960791698,60.518956619060837,null,null,3.6264296518587966,82.03026758651319,74.87457585510731,null,null,1.807616529897103,93.519232898386804,93.864228030472745,null,null,0.22668263944240144]
[null,"EDS16",2016,67.733160784693396,58.296926860706812,null,null,16.352849693439548,84.146140654334374,65.290065070557475,null,null,4.7367975174389354,90.772972015458805,74.537986337112244,null,null,2.189748530358623,94.193225390345361,80.74530503741488,null,null,0.54163020653911131,97.913816573204315,94.342950430296241,null,null,0.41733282195241062]
[null,null,null,"","",null,null,"","","",null,null,"","","",null,null,"","","",null,null,"","","",null,null,""]
[null,null,null,"","",null,null,"","","",null,null,"","","",null,null,"","","",null,null,"","","",null,null,""]
[null,null,null,"","",null,null,"","","",null,null,"","","",null,null,"","","",null,null,"","","",null,null,""]
[null,null,null,"","",null,null,"","","",null,null,"","","",null,null,"","","",null,null,"","","",null,null,""]
[null,null,null,"","",null,null,"","","",null,null,"","","",null,null,"","","",null,null,"","","",null,null,""]
[null,null,null,"","",null,null,"","","",null,null,"","","",null,null,"","","",null,null,"","","",null,null,""]
[null,null,null,"","",null,null,"","","",null,null,"","","",null,null,"","","",null,null,"","","",null,null,""]
[null,null,null,"","",null,null,"","","",null,null,"","","",null,null,"","","",null,null,"","","",null,null,""]
[null,null,null,"","",null,null,"","","",null,null,"","","",null,null,"","","",null,null,"","","",null,null,""]
[]
[null,{"$f":"CONCATENATE(\"Urban use of sanitation facilities, \",C199,\"–\",C200)","v":"Urban use of sanitation facilities, 2000–2020"},null,null,null,null,null,null,null,null,null,null,null,null,null,null,null,null,"Data points used for regression"]
[]
[]
[]
[]
[]
[]
[]
[]
[]
[]
[]
[]
[]
[]
[]
[]
[]
[]
[]
[]
[]
[]
[]
[]
[]
[]
[]
[]
[]
[]
[]
[]
[]
[]
[]
[]
[]
[]
[]
[]
[]
[]
[]
[]
[]
[]
[]
[]
[]
[]
[]
[]
[]
[]
[]
[]
[]
[]
[]
[]
[]
[]
[]
[]
[]
[]
[]
[]
[]
[]
[]
[]
[]
[]
[]
[]
[]
[]
["RURAL",null,null,"Poorest",null,null,null,null,"Poor",null,null,null,null,"Middle",null,null,null,null,"Rich",null,null,null,null,"Richest"]
[null,null,null,"Improved","Basic","Limited","Unimproved","Open defecation","Improved","Basic","Limited","Unimproved","Open defecation","Improved","Basic","Limited","Unimproved","Open defecation","Improved","Basic","Limited","Unimproved","Open defecation","Improved","Basic","Limited","Unimproved","Open defecation"]
["Forecast period:",null,2000,{"$f":"IF((D301+H301)>100,D301*100/(D301+H301),D301)","v":8.987213862128101},{"$f":"D299*AVERAGEIF(E305:E316,\">0\")/100","v":6.0866649044211023},{"$f":"D299*(100-AVERAGEIF(E305:E316,\">0\"))/100","v":2.9005489577069983},{"$f":"100-(E299+F299+H299)","v":8.124537180340667},{"$f":"IF((D301+H301)>100,H301*100/(D301+H301),H301)","v":82.888248957531232},{"$f":"IF((I301+M301)>100,I301*100/(I301+M301),I301)","v":15.84182838825825},{"$f":"I299*AVERAGEIF(J305:J316,\">0\")/100","v":11.431090980108927},{"$f":"I299*(100-AVERAGEIF(J305:J316,\">0\"))/100","v":4.4107374081493234},{"$f":"100-(J299+K299+M299)","v":13.037211513237821},{"$f":"IF((I301+M301)>100,M301*100/(I301+M301),M301)","v":71.120960098503929},{"$f":"IF((N301+R301)>100,N301*100/(N301+R301),N301)","v":19.05872509446931},{"$f":"N299*AVERAGEIF(O305:O316,\">0\")/100","v":13.742400980781165},{"$f":"N299*(100-AVERAGEIF(O305:O316,\">0\"))/100","v":5.3163241136881432},{"$f":"100-(O299+P299+R299)","v":17.194291124221991},{"$f":"IF((N301+R301)>100,R301*100/(N301+R301),R301)","v":63.7469837813087},{"$f":"IF((S301+W301)>100,S301*100/(S301+W301),S301)","v":22.537806273569004},{"$f":"S299*AVERAGEIF(T305:T316,\">0\")/100","v":16.156401257074279},{"$f":"S299*(100-AVERAGEIF(T305:T316,\">0\"))/100","v":6.3814050164947229},{"$f":"100-(T299+U299+W299)","v":18.904279960393978},{"$f":"IF((S301+W301)>100,W301*100/(S301+W301),W301)","v":58.557913766037018},{"$f":"IF((X301+AB301)>100,X301*100/(X301+AB301),X301)","v":39.250644957739041},{"$f":"X299*AVERAGEIF(Y305:Y316,\">0\")/100","v":30.82251635608791},{"$f":"X299*(100-AVERAGEIF(Y305:Y316,\">0\"))/100","v":8.4281286016511352},{"$f":"100-(Y299+Z299+AB299)","v":24.530367342460522},{"$f":"IF((X301+AB301)>100,AB301*100/(X301+AB301),AB301)","v":36.218987699800437}]
[null,null,2020,{"$f":"IF((D302+H302)>100,D302*100/(D302+H302),D302)","v":22.729916583217346},{"$f":"D300*AVERAGEIF(E305:E316,\">0\")/100","v":15.394023962252547},{"$f":"D300*(100-AVERAGEIF(E305:E316,\">0\"))/100","v":7.3358926209647999},{"$f":"100-(E300+F300+H300)","v":21.318111283534108},{"$f":"IF((D302+H302)>100,H302*100/(D302+H302),H302)","v":55.951972133248546},{"$f":"IF((I302+M302)>100,I302*100/(I302+M302),I302)","v":22.740112204485968},{"$f":"I300*AVERAGEIF(J305:J316,\">0\")/100","v":16.408730427860945},{"$f":"I300*(100-AVERAGEIF(J305:J316,\">0\"))/100","v":6.3313817766250224},{"$f":"100-(J300+K300+M300)","v":20.136868353782802},{"$f":"IF((I302+M302)>100,M302*100/(I302+M302),M302)","v":57.12301944173123},{"$f":"IF((N302+R302)>100,N302*100/(N302+R302),N302)","v":34.820826413711075},{"$f":"N300*AVERAGEIF(O305:O316,\">0\")/100","v":25.10775283695429},{"$f":"N300*(100-AVERAGEIF(O305:O316,\">0\"))/100","v":9.7130735767567806},{"$f":"100-(O300+P300+R300)","v":25.925423325201791},{"$f":"IF((N302+R302)>100,R302*100/(N302+R302),R302)","v":39.253750261087134},{"$f":"IF((S302+W302)>100,S302*100/(S302+W302),S302)","v":46.647136297791803},{"$f":"S300*AVERAGEIF(T305:T316,\">0\")/100","v":33.439361505400569},{"$f":"S300*(100-AVERAGEIF(T305:T316,\">0\"))/100","v":13.207774792391232},{"$f":"100-(T300+U300+W300)","v":26.024108294970574},{"$f":"IF((S302+W302)>100,W302*100/(S302+W302),W302)","v":27.328755407237622},{"$f":"IF((X302+AB302)>100,X302*100/(X302+AB302),X302)","v":63.85974294113521},{"$f":"X300*AVERAGEIF(Y305:Y316,\">0\")/100","v":50.147404543746646},{"$f":"X300*(100-AVERAGEIF(Y305:Y316,\">0\"))/100","v":13.712338397388564},{"$f":"100-(Y300+Z300+AB300)","v":24.0442096893089},{"$f":"IF((X302+AB302)>100,AB302*100/(X302+AB302),AB302)","v":12.09604736955589}]
["Regression period:",null,{"$f":"MinRegYear(C299,C305:C316)","v":2001},{"$f":"IF(MAX(C305:C316)-MIN(C305:C316)<5,AVERAGEIF(C305:C316,\">0\",D305:D316),\nIF(FORECAST($C301,D$305:D$316,$C$305:$C$316)<0,0,\nIF(FORECAST($C301,D$305:D$316,$C$305:$C$316)>100,100,\nFORECAST($C301,D$305:D$316,$C$305:$C$316))))","v":8.987213862128101},null,null,null,{"$f":"IF(MAX(C305:C316)-MIN(C305:C316)<5,AVERAGEIF(C305:C316,\">0\",H305:H316),\nIF(FORECAST($C301,H$305:H$316,$C$305:$C$316)<0,0,\nIF(FORECAST($C301,H$305:H$316,$C$305:$C$316)>100,100,\nFORECAST($C301,H$305:H$316,$C$305:$C$316))))","v":82.888248957531232},{"$f":"IF(MAX(C305:C316)-MIN(C305:C316)<5,AVERAGEIF(C305:C316,\">0\",I305:I316),\nIF(FORECAST($C301,I$305:I$316,$C$305:$C$316)<0,0,\nIF(FORECAST($C301,I$305:I$316,$C$305:$C$316)>100,100,\nFORECAST($C301,I$305:I$316,$C$305:$C$316))))","v":15.84182838825825},null,null,null,{"$f":"IF(MAX(C305:C316)-MIN(C305:C316)<5,AVERAGEIF(C305:C316,\">0\",M305:M316),\nIF(FORECAST($C301,M$305:M$316,$C$305:$C$316)<0,0,\nIF(FORECAST($C301,M$305:M$316,$C$305:$C$316)>100,100,\nFORECAST($C301,M$305:M$316,$C$305:$C$316))))","v":71.120960098503929},{"$f":"IF(MAX(C305:C316)-MIN(C305:C316)<5,AVERAGEIF(C305:C316,\">0\",N305:N316),\nIF(FORECAST($C301,N$305:N$316,$C$305:$C$316)<0,0,\nIF(FORECAST($C301,N$305:N$316,$C$305:$C$316)>100,100,\nFORECAST($C301,N$305:N$316,$C$305:$C$316))))","v":19.05872509446931},null,null,null,{"$f":"IF(MAX(C305:C316)-MIN(C305:C316)<5,AVERAGEIF(C305:C316,\">0\",R305:R316),\nIF(FORECAST($C301,R$305:R$316,$C$305:$C$316)<0,0,\nIF(FORECAST($C301,R$305:R$316,$C$305:$C$316)>100,100,\nFORECAST($C301,R$305:R$316,$C$305:$C$316))))","v":63.7469837813087},{"$f":"IF(MAX(C305:C316)-MIN(C305:C316)<5,AVERAGEIF(C305:C316,\">0\",S305:S316),\nIF(FORECAST($C301,S$305:S$316,$C$305:$C$316)<0,0,\nIF(FORECAST($C301,S$305:S$316,$C$305:$C$316)>100,100,\nFORECAST($C301,S$305:S$316,$C$305:$C$316))))","v":22.537806273569004},null,null,null,{"$f":"IF(MAX(C305:C316)-MIN(C305:C316)<5,AVERAGEIF(C305:C316,\">0\",W305:W316),\nIF(FORECAST($C301,W$305:W$316,$C$305:$C$316)<0,0,\nIF(FORECAST($C301,W$305:W$316,$C$305:$C$316)>100,100,\nFORECAST($C301,W$305:W$316,$C$305:$C$316))))","v":58.557913766037018},{"$f":"IF(MAX(C305:C316)-MIN(C305:C316)<5,AVERAGEIF(C305:C316,\">0\",X305:X316),\nIF(FORECAST($C301,X$305:X$316,$C$305:$C$316)<0,0,\nIF(FORECAST($C301,X$305:X$316,$C$305:$C$316)>100,100,\nFORECAST($C301,X$305:X$316,$C$305:$C$316))))","v":39.250644957739041},null,null,null,{"$f":"IF(MAX(C305:C316)-MIN(C305:C316)<5,AVERAGEIF(C305:C316,\">0\",AB305:AB316),\nIF(FORECAST($C301,AB$305:AB$316,$C$305:$C$316)<0,0,\nIF(FORECAST($C301,AB$305:AB$316,$C$305:$C$316)>100,100,\nFORECAST($C301,AB$305:AB$316,$C$305:$C$316))))","v":36.218987699800437}]
[null,null,{"$f":"MaxRegYear(C300,C305:C316)","v":2018},{"$f":"IF(MAX(C305:C316)-MIN(C305:C316)<5,AVERAGEIF(C305:C316,\">0\",D305:D316),\nIF(FORECAST($C302,D$305:D$316,$C$305:$C$316)<0,0,\nIF(FORECAST($C302,D$305:D$316,$C$305:$C$316)>100,100,\nFORECAST($C302,D$305:D$316,$C$305:$C$316))))","v":22.729916583217346},null,null,null,{"$f":"IF(MAX(C305:C316)-MIN(C305:C316)<5,AVERAGEIF(C305:C316,\">0\",H305:H316),\nIF(FORECAST($C302,H$305:H$316,$C$305:$C$316)<0,0,\nIF(FORECAST($C302,H$305:H$316,$C$305:$C$316)>100,100,\nFORECAST($C302,H$305:H$316,$C$305:$C$316))))","v":55.951972133248546},{"$f":"IF(MAX(C305:C316)-MIN(C305:C316)<5,AVERAGEIF(C305:C316,\">0\",I305:I316),\nIF(FORECAST($C302,I$305:I$316,$C$305:$C$316)<0,0,\nIF(FORECAST($C302,I$305:I$316,$C$305:$C$316)>100,100,\nFORECAST($C302,I$305:I$316,$C$305:$C$316))))","v":22.740112204485968},null,null,null,{"$f":"IF(MAX(C305:C316)-MIN(C305:C316)<5,AVERAGEIF(C305:C316,\">0\",M305:M316),\nIF(FORECAST($C302,M$305:M$316,$C$305:$C$316)<0,0,\nIF(FORECAST($C302,M$305:M$316,$C$305:$C$316)>100,100,\nFORECAST($C302,M$305:M$316,$C$305:$C$316))))","v":57.12301944173123},{"$f":"IF(MAX(C305:C316)-MIN(C305:C316)<5,AVERAGEIF(C305:C316,\">0\",N305:N316),\nIF(FORECAST($C302,N$305:N$316,$C$305:$C$316)<0,0,\nIF(FORECAST($C302,N$305:N$316,$C$305:$C$316)>100,100,\nFORECAST($C302,N$305:N$316,$C$305:$C$316))))","v":34.820826413711075},null,null,null,{"$f":"IF(MAX(C305:C316)-MIN(C305:C316)<5,AVERAGEIF(C305:C316,\">0\",R305:R316),\nIF(FORECAST($C302,R$305:R$316,$C$305:$C$316)<0,0,\nIF(FORECAST($C302,R$305:R$316,$C$305:$C$316)>100,100,\nFORECAST($C302,R$305:R$316,$C$305:$C$316))))","v":39.253750261087134},{"$f":"IF(MAX(C305:C316)-MIN(C305:C316)<5,AVERAGEIF(C305:C316,\">0\",S305:S316),\nIF(FORECAST($C302,S$305:S$316,$C$305:$C$316)<0,0,\nIF(FORECAST($C302,S$305:S$316,$C$305:$C$316)>100,100,\nFORECAST($C302,S$305:S$316,$C$305:$C$316))))","v":46.647136297791803},null,null,null,{"$f":"IF(MAX(C305:C316)-MIN(C305:C316)<5,AVERAGEIF(C305:C316,\">0\",W305:W316),\nIF(FORECAST($C302,W$305:W$316,$C$305:$C$316)<0,0,\nIF(FORECAST($C302,W$305:W$316,$C$305:$C$316)>100,100,\nFORECAST($C302,W$305:W$316,$C$305:$C$316))))","v":27.328755407237622},{"$f":"IF(MAX(C305:C316)-MIN(C305:C316)<5,AVERAGEIF(C305:C316,\">0\",X305:X316),\nIF(FORECAST($C302,X$305:X$316,$C$305:$C$316)<0,0,\nIF(FORECAST($C302,X$305:X$316,$C$305:$C$316)>100,100,\nFORECAST($C302,X$305:X$316,$C$305:$C$316))))","v":63.85974294113521},null,null,null,{"$f":"IF(MAX(C305:C316)-MIN(C305:C316)<5,AVERAGEIF(C305:C316,\">0\",AB305:AB316),\nIF(FORECAST($C302,AB$305:AB$316,$C$305:$C$316)<0,0,\nIF(FORECAST($C302,AB$305:AB$316,$C$305:$C$316)>100,100,\nFORECAST($C302,AB$305:AB$316,$C$305:$C$316))))","v":12.09604736955589}]
[]
[null,"Survey","Year","Improved","Not shared",null,null,"Open defecation","Improved","Not shared",null,null,"Open defecation","Improved","Not shared",null,null,"Open defecation","Improved","Not shared",null,null,"Open defecation","Improved","Not shared",null,null,"Open defecation"]
[null,"DHS03",2003,{"$f":"IF(ISERROR(INDIRECT(CONCATENATE($B305,\"!M122\"))),\"\",INDIRECT(CONCATENATE($B305,\"!M122\")))","v":10.60400241755042},{"$f":"IF(ISERROR(INDIRECT(CONCATENATE($B305,\"!M129\"))),\"\",INDIRECT(CONCATENATE($B305,\"!M129\")))","v":20.003361964508482},null,null,{"$f":"IF(ISERROR(INDIRECT(CONCATENATE($B305,\"!M127\"))),\"\",INDIRECT(CONCATENATE($B305,\"!M127\")))","v":79.719275213497838},{"$f":"IF(ISERROR(INDIRECT(CONCATENATE($B305,\"!N122\"))),\"\",INDIRECT(CONCATENATE($B305,\"!N122\")))","v":16.653391190167294},{"$f":"IF(ISERROR(INDIRECT(CONCATENATE($B305,\"!N129\"))),\"\",INDIRECT(CONCATENATE($B305,\"!N129\")))","v":31.275755703753834},null,null,{"$f":"IF(ISERROR(INDIRECT(CONCATENATE($B305,\"!N127\"))),\"\",INDIRECT(CONCATENATE($B305,\"!N127\")))","v":69.474143550648293},{"$f":"IF(ISERROR(INDIRECT(CONCATENATE($B305,\"!O122\"))),\"\",INDIRECT(CONCATENATE($B305,\"!O122\")))","v":20.91308995555643},{"$f":"IF(ISERROR(INDIRECT(CONCATENATE($B305,\"!O129\"))),\"\",INDIRECT(CONCATENATE($B305,\"!O129\")))","v":37.057441247066656},null,null,{"$f":"IF(ISERROR(INDIRECT(CONCATENATE($B305,\"!O127\"))),\"\",INDIRECT(CONCATENATE($B305,\"!O127\")))","v":60.865426896576444},{"$f":"IF(ISERROR(INDIRECT(CONCATENATE($B305,\"!P122\"))),\"\",INDIRECT(CONCATENATE($B305,\"!P122\")))","v":25.37419804112449},{"$f":"IF(ISERROR(INDIRECT(CONCATENATE($B305,\"!P129\"))),\"\",INDIRECT(CONCATENATE($B305,\"!P129\")))","v":42.044194637830671},null,null,{"$f":"IF(ISERROR(INDIRECT(CONCATENATE($B305,\"!P127\"))),\"\",INDIRECT(CONCATENATE($B305,\"!P127\")))","v":54.883895135590244},{"$f":"IF(ISERROR(INDIRECT(CONCATENATE($B305,\"!Q122\"))),\"\",INDIRECT(CONCATENATE($B305,\"!Q122\")))","v":42.145832955785423},{"$f":"IF(ISERROR(INDIRECT(CONCATENATE($B305,\"!Q129\"))),\"\",INDIRECT(CONCATENATE($B305,\"!Q129\")))","v":59.294375960159073},null,null,{"$f":"IF(ISERROR(INDIRECT(CONCATENATE($B305,\"!Q2127\"))),\"\",INDIRECT(CONCATENATE($B305,\"!Q127\")))","v":33.380994719771635}]
[null,"DHS08",null,1.3653961093813953,95.250256451861944,null,null,78.434130324303268,1.8782636295879354,93.255656581520839,null,null,65.296480377449768,3.1300464894385689,91.376880802652138,null,null,57.915203365415145,6.9219162550803492,87.907282649233792,null,null,47.428745107191169,24.161090926249418,87.193517815494218,null,null,31.923139847723863]
[null,"EDS16",2016,21.113128027795174,87.923862317792128,null,null,59.12094587728167,21.928549402576778,91.941535785192343,null,null,58.769835989586802,32.966461552623713,87.88236617570351,null,null,42.135307145818921,43.810744530236107,85.105849867551456,null,null,31.002774037684816,60.964554943088544,89.094347402352909,null,null,14.934040349584896]
[null,null,null,"","",null,null,"","","",null,null,"","","",null,null,"","","",null,null,"","","",null,null,""]
[null,null,null,"","",null,null,"","","",null,null,"","","",null,null,"","","",null,null,"","","",null,null,""]
[null,null,null,"","",null,null,"","","",null,null,"","","",null,null,"","","",null,null,"","","",null,null,""]
[null,null,null,"","",null,null,"","","",null,null,"","","",null,null,"","","",null,null,"","","",null,null,""]
[null,null,null,"","",null,null,"","","",null,null,"","","",null,null,"","","",null,null,"","","",null,null,""]
[null,null,null,"","",null,null,"","","",null,null,"","","",null,null,"","","",null,null,"","","",null,null,""]
[null,null,null,"","",null,null,"","","",null,null,"","","",null,null,"","","",null,null,"","","",null,null,""]
[null,null,null,"","",null,null,"","","",null,null,"","","",null,null,"","","",null,null,"","","",null,null,""]
[null,null,null,"","",null,null,"","","",null,null,"","","",null,null,"","","",null,null,"","","",null,null,""]
[]
[null,{"$f":"CONCATENATE(\"Rural use of sanitation facilities, \",C299,\"–\",C300)","v":"Rural use of sanitation facilities, 2000–2020"},null,null,null,null,null,null,null,null,null,null,null,null,null,null,null,null,"Data points used for regression"]

{"sheet":"Hygiene","index":3,"n_rows":91,"n_cols":25,"rows_kept":91,"cut":false,"hidden":false,"merged":[[39,22,40,22],[39,23,40,23],[39,24,40,24],[31,4,32,5],[39,16,40,16],[39,17,40,17],[39,18,40,18],[39,19,40,19],[39,20,40,20],[39,21,40,21],[36,24,37,24],[39,6,40,7],[39,8,40,8],[39,9,40,9],[39,10,40,10],[39,11,40,11],[39,12,40,12],[39,13,40,13],[39,14,40,14],[39,15,40,15],[36,18,37,18],[36,12,37,12],[36,13,37,13],[36,14,37,14],[36,15,37,15],[36,16,37,16],[36,17,37,17],[36,19,37,19],[36,20,37,20],[36,21,37,21],[36,22,37,22],[36,23,37,23],[33,20,34,20],[33,21,34,21],[33,22,34,22],[33,23,34,23],[33,24,34,24],[33,15,34,15],[33,16,34,16],[33,17,34,17],[33,18,34,18],[36,6,37,7],[36,8,37,8],[36,9,37,9],[36,10,37,10],[36,11,37,11],[33,10,34,10],[33,11,34,11],[33,12,34,12],[33,13,34,13],[33,14,34,14],[6,1,6,7],[3,1,3,24],[4,1,4,24],[33,1,34,3],[31,6,32,9],[31,10,31,12],[31,13,31,15],[6,10,6,15],[6,18,6,23],[33,19,34,19],[31,16,31,18],[31,19,31,21],[31,22,31,24],[33,6,34,7],[33,8,34,8],[33,9,34,9]]}
[]
[]
[]
[null,"Access to hygiene facilities by wealth quintile (%)"]
[null,{"$f":"IF(ISERROR(INDIRECT(CONCATENATE($E$32,\"!A2\"))),\"\",INDIRECT(CONCATENATE($E$32,\"!A2\")))","v":"Bolivia (Plurinational State of)"}]
[]
[null,{"$f":"CONCATENATE(\"National \",IF(ISERROR(INDIRECT(CONCATENATE($E$32,\"!A2\"))),\"\",INDIRECT(CONCATENATE($E$32,\"!A210\"))))","v":"National Access to hygiene facilities "},null,null,null,null,null,null,null,null,{"$f":"CONCATENATE(\"Urban \",IF(ISERROR(INDIRECT(CONCATENATE($E$32,\"!A2\"))),\"\",INDIRECT(CONCATENATE($E$32,\"!A210\"))))","v":"Urban Access to hygiene facilities "},null,null,null,null,null,null,null,{"$f":"CONCATENATE(\"Rural \",IF(ISERROR(INDIRECT(CONCATENATE($E$32,\"!A2\"))),\"\",INDIRECT(CONCATENATE($E$32,\"!A210\"))))","v":"Rural Access to hygiene facilities "}]
[]
[]
[]
[]
[]
[]
[]
[]
[]
[]
[]
[]
[]
[]
[]
[]
[]
[]
[]
[]
[]
[]
[]
[]
[null,null,null,null,{"$f":"INDEX(B88:B100,A88)","v":"EDS16"},null,{"$f":"IF(ISERROR(INDIRECT(CONCATENATE($E$32,\"!A2\"))),\"\",INDIRECT(CONCATENATE($E$32,\"!A2\")))","v":"Bolivia (Plurinational State of)"},null,null,null,"Poorest",null,null,"Poor",null,null,"Middle",null,null,"Rich",null,null,"Richest"]
[null,null,null,null,null,null,null,null,null,null,"Basic","Limited","No facility","Basic","Limited","No facility","Basic","Limited","No facility","Basic","Limited","No facility","Basic","Limited","No facility"]
[null,">>>  Select Survey :   ",null,null,null,null,"NATIONAL",null,null,{"$f":"IF(ISERROR(INDIRECT(CONCATENATE(#REF!,\"!A2\"))),\"\",INDIRECT(CONCATENATE(#REF!,\"!A210\")))","v":""},{"$f":"IF(ISERROR(INDIRECT(CONCATENATE($E$32,\"!C222\"))),\"\",INDIRECT(CONCATENATE($E$32,\"!C222\")))","v":7.0880334177959012},{"$f":"IF(ISERROR(INDIRECT(CONCATENATE($E$32,\"!C223\"))),\"\",INDIRECT(CONCATENATE($E$32,\"!C223\")))","v":42.923823084847925},{"$f":"IF(ISERROR(INDIRECT(CONCATENATE($E$32,\"!C224\"))),\"\",INDIRECT(CONCATENATE($E$32,\"!C224\")))","v":49.988143497356297},{"$f":"IF(ISERROR(INDIRECT(CONCATENATE($E$32,\"!D222\"))),\"\",INDIRECT(CONCATENATE($E$32,\"!D222\")))","v":12.304933099582902},{"$f":"IF(ISERROR(INDIRECT(CONCATENATE($E$32,\"!D223\"))),\"\",INDIRECT(CONCATENATE($E$32,\"!D223\")))","v":34.371579364359306},{"$f":"IF(ISERROR(INDIRECT(CONCATENATE($E$32,\"!D224\"))),\"\",INDIRECT(CONCATENATE($E$32,\"!D224\")))","v":53.323487536058281},{"$f":"IF(ISERROR(INDIRECT(CONCATENATE($E$32,\"!E222\"))),\"\",INDIRECT(CONCATENATE($E$32,\"!E222\")))","v":20.909378786597856},{"$f":"IF(ISERROR(INDIRECT(CONCATENATE($E$32,\"!E223\"))),\"\",INDIRECT(CONCATENATE($E$32,\"!E223\")))","v":28.174306677118139},{"$f":"IF(ISERROR(INDIRECT(CONCATENATE($E$32,\"!E224\"))),\"\",INDIRECT(CONCATENATE($E$32,\"!E224\")))","v":50.916314536283899},{"$f":"IF(ISERROR(INDIRECT(CONCATENATE($E$32,\"!F222\"))),\"\",INDIRECT(CONCATENATE($E$32,\"!F222\")))","v":27.059491745473611},{"$f":"IF(ISERROR(INDIRECT(CONCATENATE($E$32,\"!F223\"))),\"\",INDIRECT(CONCATENATE($E$32,\"!F223\")))","v":19.015203636897827},{"$f":"IF(ISERROR(INDIRECT(CONCATENATE($E$32,\"!F224\"))),\"\",INDIRECT(CONCATENATE($E$32,\"!F224\")))","v":53.925304617628612},{"$f":"IF(ISERROR(INDIRECT(CONCATENATE($E$32,\"!G222\"))),\"\",INDIRECT(CONCATENATE($E$32,\"!G222\")))","v":40.731959380494224},{"$f":"IF(ISERROR(INDIRECT(CONCATENATE($E$32,\"!G223\"))),\"\",INDIRECT(CONCATENATE($E$32,\"!G223\")))","v":7.6092055179928231},{"$f":"IF(ISERROR(INDIRECT(CONCATENATE($E$32,\"!G224\"))),\"\",INDIRECT(CONCATENATE($E$32,\"!G224\")))","v":51.658835101512892}]
[]
[]
[null,null,null,null,null,null,"URBAN",null,null,{"$f":"IF(ISERROR(INDIRECT(CONCATENATE(#REF!,\"!A2\"))),\"\",INDIRECT(CONCATENATE(#REF!,\"!A210\")))","v":""},{"$f":"IF(ISERROR(INDIRECT(CONCATENATE($E$32,\"!H222\"))),\"\",INDIRECT(CONCATENATE($E$32,\"!H222\")))","v":13.549521290393182},{"$f":"IF(ISERROR(INDIRECT(CONCATENATE($E$32,\"!H223\"))),\"\",INDIRECT(CONCATENATE($E$32,\"!H223\")))","v":34.164534881224128},{"$f":"IF(ISERROR(INDIRECT(CONCATENATE($E$32,\"!H224\"))),\"\",INDIRECT(CONCATENATE($E$32,\"!H224\")))","v":52.285943828382628},{"$f":"IF(ISERROR(INDIRECT(CONCATENATE($E$32,\"!I222\"))),\"\",INDIRECT(CONCATENATE($E$32,\"!I222\")))","v":20.421729210438148},{"$f":"IF(ISERROR(INDIRECT(CONCATENATE($E$32,\"!I223\"))),\"\",INDIRECT(CONCATENATE($E$32,\"!I223\")))","v":26.378468103137664},{"$f":"IF(ISERROR(INDIRECT(CONCATENATE($E$32,\"!I224\"))),\"\",INDIRECT(CONCATENATE($E$32,\"!I224\")))","v":53.1998026864241},{"$f":"IF(ISERROR(INDIRECT(CONCATENATE($E$32,\"!J222\"))),\"\",INDIRECT(CONCATENATE($E$32,\"!J222\")))","v":23.046714713112245},{"$f":"IF(ISERROR(INDIRECT(CONCATENATE($E$32,\"!J223\"))),\"\",INDIRECT(CONCATENATE($E$32,\"!J223\")))","v":22.153797914649893},{"$f":"IF(ISERROR(INDIRECT(CONCATENATE($E$32,\"!J224\"))),\"\",INDIRECT(CONCATENATE($E$32,\"!J224\")))","v":54.799487372237834},{"$f":"IF(ISERROR(INDIRECT(CONCATENATE($E$32,\"!K222\"))),\"\",INDIRECT(CONCATENATE($E$32,\"!K222\")))","v":34.741409940526133},{"$f":"IF(ISERROR(INDIRECT(CONCATENATE($E$32,\"!K223\"))),\"\",INDIRECT(CONCATENATE($E$32,\"!K223\")))","v":12.93980164366077},{"$f":"IF(ISERROR(INDIRECT(CONCATENATE($E$32,\"!K224\"))),\"\",INDIRECT(CONCATENATE($E$32,\"!K224\")))","v":52.31878841581301},{"$f":"IF(ISERROR(INDIRECT(CONCATENATE($E$32,\"!L222\"))),\"\",INDIRECT(CONCATENATE($E$32,\"!L222\")))","v":42.450796518492702},{"$f":"IF(ISERROR(INDIRECT(CONCATENATE($E$32,\"!L223\"))),\"\",INDIRECT(CONCATENATE($E$32,\"!L223\")))","v":5.8493403276150779},{"$f":"IF(ISERROR(INDIRECT(CONCATENATE($E$32,\"!L224\"))),\"\",INDIRECT(CONCATENATE($E$32,\"!L224\")))","v":51.699863153891791}]
[]
[]
[null,null,null,null,null,null,"RURAL",null,null,{"$f":"IF(ISERROR(INDIRECT(CONCATENATE(#REF!,\"!A2\"))),\"\",INDIRECT(CONCATENATE(#REF!,\"!A210\")))","v":""},{"$f":"IF(ISERROR(INDIRECT(CONCATENATE($E$32,\"!M222\"))),\"\",INDIRECT(CONCATENATE($E$32,\"!M222\")))","v":3.4124229350870872},{"$f":"IF(ISERROR(INDIRECT(CONCATENATE($E$32,\"!M223\"))),\"\",INDIRECT(CONCATENATE($E$32,\"!M223\")))","v":42.232053564953446},{"$f":"IF(ISERROR(INDIRECT(CONCATENATE($E$32,\"!M224\"))),\"\",INDIRECT(CONCATENATE($E$32,\"!M224\")))","v":54.355523499959567},{"$f":"IF(ISERROR(INDIRECT(CONCATENATE($E$32,\"!N222\"))),\"\",INDIRECT(CONCATENATE($E$32,\"!N222\")))","v":6.6188533061011583},{"$f":"IF(ISERROR(INDIRECT(CONCATENATE($E$32,\"!N223\"))),\"\",INDIRECT(CONCATENATE($E$32,\"!N223\")))","v":46.252717091520779},{"$f":"IF(ISERROR(INDIRECT(CONCATENATE($E$32,\"!N224\"))),\"\",INDIRECT(CONCATENATE($E$32,\"!N224\")))","v":47.128429602377622},{"$f":"IF(ISERROR(INDIRECT(CONCATENATE($E$32,\"!O222\"))),\"\",INDIRECT(CONCATENATE($E$32,\"!O222\")))","v":8.7891057961116594},{"$f":"IF(ISERROR(INDIRECT(CONCATENATE($E$32,\"!O223\"))),\"\",INDIRECT(CONCATENATE($E$32,\"!O223\")))","v":42.601294260109434},{"$f":"IF(ISERROR(INDIRECT(CONCATENATE($E$32,\"!O224\"))),\"\",INDIRECT(CONCATENATE($E$32,\"!O224\")))","v":48.60959994377879},{"$f":"IF(ISERROR(INDIRECT(CONCATENATE($E$32,\"!P222\"))),\"\",INDIRECT(CONCATENATE($E$32,\"!P222\")))","v":11.060885707385475},{"$f":"IF(ISERROR(INDIRECT(CONCATENATE($E$32,\"!P223\"))),\"\",INDIRECT(CONCATENATE($E$32,\"!P223\")))","v":37.931072986483123},{"$f":"IF(ISERROR(INDIRECT(CONCATENATE($E$32,\"!P224\"))),\"\",INDIRECT(CONCATENATE($E$32,\"!P224\")))","v":51.008041306131382},{"$f":"IF(ISERROR(INDIRECT(CONCATENATE($E$32,\"!Q222\"))),\"\",INDIRECT(CONCATENATE($E$32,\"!Q222\")))","v":20.687553665418381},{"$f":"IF(ISERROR(INDIRECT(CONCATENATE($E$32,\"!Q223\"))),\"\",INDIRECT(CONCATENATE($E$32,\"!Q223\")))","v":30.477606698792236},{"$f":"IF(ISERROR(INDIRECT(CONCATENATE($E$32,\"!Q224\"))),\"\",INDIRECT(CONCATENATE($E$32,\"!Q224\")))","v":48.834839635789386}]
[]
[]
[]
[]
[]
[]
[]
[]
[]
[]
[]
[]
[]
[]
[]
[]
[]
[]
[]
[]
[]
[]
[]
[]
[]
[]
[]
[]
[]
[]
[]
[]
[]
[]
[]
[]
[]
[]
[]
[]
[]
[]
[]
[]
[]
[]
[]
[3,"DHS03"]
[null,"DHS08"]
[null,"EDS16"]
[null,"Template"]

{"sheet":"DHS03","index":4,"n_rows":1072,"n_cols":78,"rows_kept":1072,"cut":false,"hidden":false,"merged":[[346,52,347,52],[348,52,349,52],[350,52,351,52],[352,52,353,52],[152,52,156,52],[270,52,272,52],[273,52,275,52],[276,52,283,52],[338,54,338,58],[338,59,338,63],[338,64,338,68],[340,52,341,52],[342,52,343,52],[344,52,345,52],[221,52,223,52],[224,52,225,52],[226,52,229,52],[258,54,258,58],[258,59,258,63],[258,64,258,68],[260,52,262,52],[263,52,266,52],[267,52,269,52],[119,64,119,68],[121,52,122,52],[123,52,126,52],[127,52,128,52],[132,54,132,58],[132,59,132,63],[132,64,132,68],[134,52,138,52],[219,54,219,58],[219,59,219,63],[219,64,219,68],[139,52,142,52],[13,64,13,68],[15,52,16,52],[17,52,20,52],[21,52,22,52],[26,54,26,58],[26,59,26,63],[26,64,26,68],[40,52,41,52],[55,54,55,58],[55,59,55,63],[55,64,55,68],[143,0,146,0],[143,52,146,52],[147,0,149,0],[147,52,149,52],[150,0,151,0],[150,52,151,52],[13,54,13,58],[13,59,13,63],[119,54,119,58],[119,59,119,63],[42,52,43,52],[44,52,45,52],[46,0,48,0],[46,52,48,52],[49,0,51,0],[49,52,51,52],[52,0,54,0],[52,52,54,52],[32,52,33,52],[34,52,35,52],[36,52,37,52],[38,0,39,0],[38,52,39,52],[13,2,13,6],[13,7,13,11],[28,52,29,52],[30,0,31,0],[30,52,31,52],[26,2,26,6],[26,7,26,11],[26,12,26,16],[13,12,13,16],[15,0,16,0],[17,0,20,0],[21,0,22,0],[23,0,25,0],[32,0,33,0],[55,2,55,6],[55,7,55,11],[55,12,55,16],[28,0,29,0],[34,0,35,0],[36,0,37,0],[40,0,41,0],[42,0,43,0],[44,0,45,0],[139,0,142,0],[119,7,119,11],[119,12,119,16],[57,0,66,0],[107,0,107,1],[121,0,122,0],[123,0,126,0],[127,0,128,0],[129,0,131,0],[132,2,132,6],[119,2,119,6],[132,7,132,11],[132,12,132,16],[134,0,138,0],[152,0,155,0],[201,0,202,0],[207,0,207,1],[219,2,219,6],[219,7,219,11],[1024,0,1024,2],[1025,0,1025,1],[1030,0,1032,0],[1033,0,1033,2],[398,2,398,5],[408,7,408,8],[412,2,412,3],[412,7,412,8],[416,2,416,3],[416,7,416,8],[420,2,420,3],[420,7,420,8],[424,2,424,3],[424,7,424,8],[428,2,428,3],[428,7,428,8],[432,2,432,3],[432,7,432,8],[436,2,436,3],[219,12,219,16],[221,0,223,0],[398,7,398,10],[398,12,398,15],[399,2,399,4],[399,7,399,9],[399,12,399,14],[400,2,401,3],[400,7,401,8],[400,12,401,13],[401,1,444,1],[402,2,402,3],[402,7,402,8],[402,12,402,13],[403,2,403,3],[403,7,403,8],[403,12,403,13],[404,2,404,3],[404,7,404,8],[404,12,404,13],[407,2,407,3],[407,7,407,8],[407,12,407,13],[408,2,408,3],[408,12,408,13],[405,2,405,3],[405,7,405,8],[405,12,405,13],[406,2,406,3],[406,7,406,8],[406,12,406,13],[411,2,411,3],[411,7,411,8],[411,12,411,13],[412,12,412,13],[409,2,409,3],[409,7,409,8],[409,12,409,13],[410,2,410,3],[410,7,410,8],[410,12,410,13],[415,2,415,3],[415,7,415,8],[415,12,415,13],[416,12,416,13],[413,2,413,3],[413,7,413,8],[413,12,413,13],[414,2,414,3],[414,7,414,8],[414,12,414,13],[419,2,419,3],[419,7,419,8],[419,12,419,13],[420,12,420,13],[417,2,417,3],[417,7,417,8],[417,12,417,13],[418,2,418,3],[418,7,418,8],[418,12,418,13],[423,2,423,3],[423,7,423,8],[423,12,423,13],[424,12,424,13],[421,2,421,3],[421,7,421,8],[421,12,421,13],[422,2,422,3],[422,7,422,8],[422,12,422,13],[427,2,427,3],[427,7,427,8],[427,12,427,13],[428,12,428,13],[425,2,425,3],[425,7,425,8],[425,12,425,13],[426,2,426,3],[426,7,426,8],[426,12,426,13],[431,2,431,3],[431,7,431,8],[431,12,431,13],[432,12,432,13],[429,2,429,3],[429,7,429,8],[429,12,429,13],[430,2,430,3],[430,7,430,8],[430,12,430,13],[435,2,435,3],[435,7,435,8],[435,12,435,13],[436,7,436,8],[436,12,436,13],[433,2,433,3],[433,7,433,8],[433,12,433,13],[434,2,434,3],[434,7,434,8],[434,12,434,13],[439,2,439,3],[439,7,439,8],[439,12,439,13],[440,2,440,3],[440,7,440,8],[440,12,440,13],[437,2,437,3],[437,7,437,8],[437,12,437,13],[438,2,438,3],[438,7,438,8],[438,12,438,13],[443,2,443,3],[443,7,443,8],[443,12,443,13],[444,2,444,3],[444,7,444,8],[444,12,444,13],[441,2,441,3],[441,7,441,8],[441,12,441,13],[442,2,442,3],[442,7,442,8],[442,12,442,13],[447,2,447,3],[447,7,447,8],[447,12,447,13],[448,2,448,3],[448,7,448,8],[448,12,448,13],[445,2,445,3],[445,7,445,8],[445,12,445,13],[446,2,446,3],[446,7,446,8],[446,12,446,13],[451,2,451,3],[451,7,451,8],[451,12,451,13],[452,2,452,3],[452,7,452,8],[452,12,452,13],[449,2,449,3],[449,7,449,8],[449,12,449,13],[450,2,450,3],[450,7,450,8],[450,12,450,13],[455,2,455,3],[455,7,455,8],[455,12,455,13],[456,2,456,3],[456,7,456,8],[456,12,456,13],[453,2,453,4],[453,7,453,9],[453,12,453,14],[454,2,454,3],[454,7,454,8],[454,12,454,13],[459,2,459,3],[459,7,459,8],[459,12,459,13],[460,2,460,3],[460,7,460,8],[460,12,460,13],[457,2,457,3],[457,7,457,8],[457,12,457,13],[458,2,458,3],[458,7,458,8],[458,12,458,13],[463,2,463,3],[463,7,463,8],[463,12,463,13],[464,2,464,3],[464,7,464,8],[464,12,464,13],[461,2,461,3],[461,7,461,8],[461,12,461,13],[462,2,462,3],[462,7,462,8],[462,12,462,13],[467,2,467,3],[467,7,467,8],[467,12,467,13],[468,2,468,3],[468,7,468,8],[468,12,468,13],[465,2,465,3],[465,7,465,8],[465,12,465,13],[466,2,466,3],[466,7,466,8],[466,12,466,13],[471,2,471,3],[471,7,471,8],[471,12,471,13],[472,2,472,3],[472,7,472,8],[472,12,472,13],[469,2,469,3],[469,7,469,8],[469,12,469,13],[470,2,470,3],[470,7,470,8],[470,12,470,13],[475,2,475,3],[475,7,475,8],[475,12,475,13],[476,2,476,3],[476,7,476,8],[476,12,476,13],[473,2,473,3],[473,7,473,8],[473,12,473,13],[474,2,474,3],[474,7,474,8],[474,12,474,13],[479,2,479,3],[479,7,479,8],[479,12,479,13],[480,2,480,3],[480,7,480,8],[480,12,480,13],[477,2,477,3],[477,7,477,8],[477,12,477,13],[478,2,478,3],[478,7,478,8],[478,12,478,13],[483,2,483,3],[483,7,483,8],[483,12,483,13],[484,2,484,3],[484,7,484,8],[484,12,484,13],[481,2,481,3],[481,7,481,8],[481,12,481,13],[482,2,482,3],[482,7,482,8],[482,12,482,13],[487,2,487,3],[487,7,487,8],[487,12,487,13],[488,2,488,3],[488,7,488,8],[488,12,488,13],[485,2,485,3],[485,7,485,8],[485,12,485,13],[486,2,486,3],[486,7,486,8],[486,12,486,13],[491,2,491,3],[491,7,491,8],[491,12,491,13],[492,2,492,3],[492,7,492,8],[492,12,492,13],[489,2,489,3],[489,7,489,8],[489,12,489,13],[490,2,490,3],[490,7,490,8],[490,12,490,13],[495,2,495,3],[495,7,495,8],[495,12,495,13],[496,2,496,3],[496,7,496,8],[496,12,496,13],[493,2,493,3],[493,7,493,8],[493,12,493,13],[494,2,494,3],[494,7,494,8],[494,12,494,13],[499,2,499,3],[499,7,499,8],[499,12,499,13],[500,2,500,3],[500,7,500,8],[500,12,500,13],[497,2,497,3],[497,7,497,8],[497,12,497,13],[498,2,498,3],[498,7,498,8],[498,12,498,13],[503,2,503,3],[503,7,503,8],[503,12,503,13],[504,2,504,3],[504,7,504,8],[504,12,504,13],[501,2,501,3],[501,7,501,8],[501,12,501,13],[502,2,502,3],[502,7,502,8],[502,12,502,13],[505,2,505,6],[505,7,505,11],[505,12,505,16],[506,2,507,3],[506,4,506,6],[506,7,507,8],[506,9,506,11],[506,12,507,13],[506,14,506,16],[510,2,510,3],[510,7,510,8],[510,12,510,13],[511,2,511,4],[511,7,511,9],[511,12,511,14],[508,2,508,3],[508,7,508,8],[508,12,508,13],[509,2,509,3],[509,7,509,8],[509,12,509,13],[515,2,515,3],[515,7,515,8],[515,12,515,13],[516,2,516,3],[516,7,516,8],[516,12,516,13],[512,2,513,3],[512,7,513,8],[512,12,513,13],[514,2,514,3],[514,7,514,8],[514,12,514,13],[519,2,519,3],[519,7,519,8],[519,12,519,13],[520,2,520,3],[520,7,520,8],[520,12,520,13],[517,2,517,3],[517,7,517,8],[517,12,517,13],[518,2,518,3],[518,7,518,8],[518,12,518,13],[523,2,523,3],[523,7,523,8],[523,12,523,13],[524,2,524,3],[524,7,524,8],[524,12,524,13],[521,2,521,3],[521,7,521,8],[521,12,521,13],[522,2,522,3],[522,7,522,8],[522,12,522,13],[527,2,527,3],[527,7,527,8],[527,12,527,13],[528,2,528,3],[528,7,528,8],[528,12,528,13],[525,2,525,3],[525,7,525,8],[525,12,525,13],[526,2,526,3],[526,7,526,8],[526,12,526,13],[531,2,531,3],[531,7,531,8],[531,12,531,13],[532,2,532,3],[532,7,532,8],[532,12,532,13],[529,2,529,3],[529,7,529,8],[529,12,529,13],[530,2,530,3],[530,7,530,8],[530,12,530,13],[535,2,535,3],[535,7,535,8],[535,12,535,13],[536,2,536,3],[536,7,536,8],[536,12,536,13],[533,2,533,3],[533,7,533,8],[533,12,533,13],[534,2,534,3],[534,7,534,8],[534,12,534,13],[539,2,539,3],[539,7,539,8],[539,12,539,13],[540,2,540,3],[540,7,540,8],[540,12,540,13],[537,2,537,3],[537,7,537,8],[537,12,537,13],[538,2,538,3],[538,7,538,8],[538,12,538,13],[543,2,543,3],[543,7,543,8],[543,12,543,13],[544,2,544,3],[544,7,544,8],[544,12,544,13],[541,2,541,3],[541,7,541,8],[541,12,541,13],[542,2,542,3],[542,7,542,8],[542,12,542,13],[547,2,547,3],[547,7,547,8],[547,12,547,13],[548,2,548,3],[548,7,548,8],[548,12,548,13],[545,2,545,3],[545,7,545,8],[545,12,545,13],[546,2,546,3],[546,7,546,8],[546,12,546,13],[551,2,551,3],[551,7,551,8],[551,12,551,13],[552,2,552,3],[552,7,552,8],[552,12,552,13],[549,2,549,3],[549,7,549,8],[549,12,549,13],[550,2,550,3],[550,7,550,8],[550,12,550,13],[555,2,555,3],[555,7,555,8],[555,12,555,13],[556,2,556,3],[556,7,556,8],[556,12,556,13],[553,2,553,3],[553,7,553,8],[553,12,553,13],[554,2,554,3],[554,7,554,8],[554,12,554,13],[559,2,559,3],[559,7,559,8],[559,12,559,13],[560,2,560,3],[560,7,560,8],[560,12,560,13],[557,2,557,3],[557,7,557,8],[557,12,557,13],[558,2,558,3],[558,7,558,8],[558,12,558,13],[563,2,563,3],[563,7,563,8],[563,12,563,13],[564,2,564,4],[564,7,564,9],[564,12,564,14],[561,2,561,3],[561,7,561,8],[561,12,561,13],[562,2,562,3],[562,7,562,8],[562,12,562,13],[567,2,567,3],[567,7,567,8],[567,12,567,13],[568,2,568,3],[568,7,568,8],[568,12,568,13],[565,2,565,3],[565,7,565,8],[565,12,565,13],[566,2,566,3],[566,7,566,8],[566,12,566,13],[571,2,571,3],[571,7,571,8],[571,12,571,13],[572,2,572,3],[572,7,572,8],[572,12,572,13],[569,2,569,3],[569,7,569,8],[569,12,569,13],[570,2,570,3],[570,7,570,8],[570,12,570,13],[575,2,575,3],[575,7,575,8],[575,12,575,13],[576,2,576,3],[576,7,576,8],[576,12,576,13],[573,2,573,3],[573,7,573,8],[573,12,573,13],[574,2,574,3],[574,7,574,8],[574,12,574,13],[579,2,579,3],[579,7,579,8],[579,12,579,13],[580,2,580,3],[580,7,580,8],[580,12,580,13],[577,2,577,3],[577,7,577,8],[577,12,577,13],[578,2,578,3],[578,7,578,8],[578,12,578,13],[583,2,583,3],[583,7,583,8],[583,12,583,13],[584,2,584,3],[584,7,584,8],[584,12,584,13],[581,2,581,3],[581,7,581,8],[581,12,581,13],[582,2,582,3],[582,7,582,8],[582,12,582,13],[587,2,587,3],[587,7,587,8],[587,12,587,13],[588,2,588,3],[588,7,588,8],[588,12,588,13],[585,2,585,3],[585,7,585,8],[585,12,585,13],[586,2,586,3],[586,7,586,8],[586,12,586,13]]}
[]
[{"$f":"A1026","v":"Bolivia (Plurinational State of)"}]
[{"$f":"A1034","v":"2003"}]
["Use of drinking water sources"]
[" by wealth quintile and sub-national region"]
["Notes:"]
["WHO/UNICEF JMP customised wealth index excludes water,"]
[" sanitation and hygiene assets."]
["Survey used for analysis:",{"$f":"A1025","v":"DHS03"}]
["Improved wells based on:","DHS08"]
["Time to source based on:","DHS08"]
[]
[]
["Use of drinking water sources",null,"NATIONAL wealth index quintile",null,null,null,null,"URBAN wealth index quintile",null,null,null,null,"RURAL wealth index quintile",null,null,null,null,"SUB-REGIONS:",null,null,null,null,null,null,null,null,null,null,null,null,null,null,null,null,null,null,null,null,null,null,null,null,null,null,null,null,null,null,null,null,null,null,"Raw numbers of respondents:","Use of drinking water sources","NATIONAL wealth index quintile",null,null,null,null,"URBAN wealth index quintile",null,null,null,null,"RURAL wealth index quintile",null,null,null,null,"SUB-REGIONS:"]
["Weighted percentage (used in graphs)",null,"Poorest","Poor","Middle","Rich","Richest","Poorest","Poor","Middle","Rich","Richest","Poorest","Poor","Middle","Rich","Richest","Beni","Chuquisaca","Cochabamba","La Paz","Oruro","Pando","Potosi","Santa Cruz","Tarija",null,null,null,null,null,null,null,null,null,null,null,null,null,null,null,null,null,null,null,null,null,null,null,null,null,null,"Water data, raw numbers (weighted)",null,"Poorest","Poor","Middle","Rich","Richest","Poorest","Poor","Middle","Rich","Richest","Poorest","Poor","Middle","Rich","Richest","Beni","Chuquisaca","Cochabamba","La Paz","Oruro","Pando","Potosi","Santa Cruz","Tarija"]
["Water","Improved",{"$f":"C58+C59+C60+C65+C66+(C61+C62)*'DHS08'!C24/100","v":47.32518094956319},{"$f":"D58+D59+D60+D65+D66+(D61+D62)*'DHS08'!D24/100","v":73.010652416466357},{"$f":"E58+E59+E60+E65+E66+(E61+E62)*'DHS08'!E24/100","v":91.597231389219061},{"$f":"F58+F59+F60+F65+F66+(F61+F62)*'DHS08'!F24/100","v":96.827162890674344},{"$f":"G58+G59+G60+G65+G66+(G61+G62)*'DHS08'!G24/100","v":99.648390356642906},{"$f":"H58+H59+H60+H65+H66+(H61+H62)*'DHS08'!H24/100","v":80.111406074294109},{"$f":"I58+I59+I60+I65+I66+(I61+I62)*'DHS08'!I24/100","v":93.97828433398405},{"$f":"J58+J59+J60+J65+J66+(J61+J62)*'DHS08'!J24/100","v":96.909993659721152},{"$f":"K58+K59+K60+K65+K66+(K61+K62)*'DHS08'!K24/100","v":99.044891826962413},{"$f":"L58+L59+L60+L65+L66+(L61+L62)*'DHS08'!L24/100","v":99.842412216600636},{"$f":"M58+M59+M60+M65+M66+(M61+M62)*'DHS08'!M24/100","v":41.797486679810703},{"$f":"N58+N59+N60+N65+N66+(N61+N62)*'DHS08'!N24/100","v":49.5323795533197},{"$f":"O58+O59+O60+O65+O66+(O61+O62)*'DHS08'!O24/100","v":58.496185613265737},{"$f":"P58+P59+P60+P65+P66+(P61+P62)*'DHS08'!P24/100","v":69.942679251586284},{"$f":"Q58+Q59+Q60+Q65+Q66+(Q61+Q62)*'DHS08'!Q24/100","v":86.265342903921379},{"$f":"R58+R59+R60+R65+R66+(R61+R62)*'DHS08'!R24/100","v":56.482230035355883},{"$f":"S58+S59+S60+S65+S66+(S61+S62)*'DHS08'!S24/100","v":66.919675456621817},{"$f":"T58+T59+T60+T65+T66+(T61+T62)*'DHS08'!T24/100","v":82.939307138610673},{"$f":"U58+U59+U60+U65+U66+(U61+U62)*'DHS08'!U24/100","v":82.862692299381322},{"$f":"V58+V59+V60+V65+V66+(V61+V62)*'DHS08'!V24/100","v":82.326222159643407},{"$f":"W58+W59+W60+W65+W66+(W61+W62)*'DHS08'!W24/100","v":52.98926698129457},{"$f":"X58+X59+X60+X65+X66+(X61+X62)*'DHS08'!X24/100","v":70.247213260041732},{"$f":"Y58+Y59+Y60+Y65+Y66+(Y61+Y62)*'DHS08'!Y24/100","v":91.674435366306795},{"$f":"Z58+Z59+Z60+Z65+Z66+(Z61+Z62)*'DHS08'!Z24/100","v":85.84695744645137},null,null,null,null,null,null,null,null,null,null,null,null,null,null,null,null,null,null,null,null,null,null,null,null,null,null,"Water","Improved","N/A","N/A","N/A","N/A","N/A","N/A","N/A","N/A","N/A","N/A","N/A","N/A","N/A","N/A","N/A","N/A","N/A","N/A","N/A","N/A","N/A","N/A","N/A","N/A"]
[null,"Not Improved",{"$f":"100-C16","v":52.67481905043681},{"$f":"100-D16","v":26.989347583533643},8.4027686107809387,3.1728371093256555,0.35160964335709366,19.888593925705891,6.0217156660159503,3.0900063402788476,0.95510817303758699,0.15758778339936441,58.202513320189297,50.4676204466803,41.503814386734263,30.057320748413716,13.734657096078621,43.517769964644117,33.080324543378183,17.060692861389327,17.137307700618678,17.673777840356593,47.01073301870543,29.752786739958268,8.3255646336932045,14.15304255354863,null,null,null,null,null,null,null,null,null,null,null,null,null,null,null,null,null,null,null,null,null,null,null,null,null,null,null,"Not Improved","N/A","N/A","N/A","N/A","N/A","N/A","N/A","N/A","N/A","N/A","N/A","N/A","N/A","N/A","N/A","N/A","N/A","N/A","N/A","N/A","N/A","N/A","N/A","N/A"]
["Water ladder","Basic",{"$f":"C16*'DHS08'!C23/100","v":47.242828480201851},{"$f":"D16*'DHS08'!D23/100","v":72.986185395968974},{"$f":"E16*'DHS08'!E23/100","v":91.597231389219075},{"$f":"F16*'DHS08'!F23/100","v":96.7381742394561},{"$f":"G16*'DHS08'!G23/100","v":99.648390356642906},{"$f":"H16*'DHS08'!H23/100","v":80.046759859723437},{"$f":"I16*'DHS08'!I23/100","v":93.97828433398405},{"$f":"J16*'DHS08'!J23/100","v":96.759497505827724},{"$f":"K16*'DHS08'!K23/100","v":99.044891826962413},{"$f":"L16*'DHS08'!L23/100","v":99.842412216600636},{"$f":"M16*'DHS08'!M23/100","v":41.769890631160209},{"$f":"N16*'DHS08'!N23/100","v":49.400759765803713},{"$f":"O16*'DHS08'!O23/100","v":58.493339504846716},{"$f":"P16*'DHS08'!P23/100","v":69.93525691263018},{"$f":"Q16*'DHS08'!Q23/100","v":86.265342903921379},{"$f":"R16*'DHS08'!R23/100","v":56.002357544846951},{"$f":"S16*'DHS08'!S23/100","v":66.793186143650615},{"$f":"T16*'DHS08'!T23/100","v":82.939307138610673},{"$f":"U16*'DHS08'!U23/100","v":82.862692299381322},{"$f":"V16*'DHS08'!V23/100","v":82.308686635898468},{"$f":"W16*'DHS08'!W23/100","v":52.98926698129457},{"$f":"X16*'DHS08'!X23/100","v":70.247213260041732},{"$f":"Y16*'DHS08'!Y23/100","v":91.598050543057127},{"$f":"Z16*'DHS08'!Z23/100","v":85.846957446451384},null,null,null,null,null,null,null,null,null,null,null,null,null,null,null,null,null,null,null,null,null,null,null,null,null,null,"Water ladder","Basic","N/A","N/A","N/A","N/A","N/A","N/A","N/A","N/A","N/A","N/A","N/A","N/A","N/A","N/A","N/A","N/A","N/A","N/A","N/A","N/A","N/A","N/A","N/A","N/A"]
[null,"Limited",{"$f":"C16*'DHS08'!C22/100","v":8.2352469361330574E-2},{"$f":"D16*'DHS08'!D22/100","v":2.4467020497371723E-2},{"$f":"E16*'DHS08'!E22/100","v":0},{"$f":"F16*'DHS08'!F22/100","v":8.8988651218238429E-2},{"$f":"G16*'DHS08'!G22/100","v":0},{"$f":"H16*'DHS08'!H22/100","v":6.4646214570656751E-2},{"$f":"I16*'DHS08'!I22/100","v":0},{"$f":"J16*'DHS08'!J22/100","v":0.15049615389341023},{"$f":"K16*'DHS08'!K22/100","v":0},{"$f":"L16*'DHS08'!L22/100","v":0},{"$f":"M16*'DHS08'!M22/100","v":2.7596048650499437E-2},{"$f":"N16*'DHS08'!N22/100","v":0.13161978751598469},{"$f":"O16*'DHS08'!O22/100","v":2.8461084190211684E-3},{"$f":"P16*'DHS08'!P22/100","v":7.4223389561027097E-3},{"$f":"Q16*'DHS08'!Q22/100","v":0},{"$f":"R16*'DHS08'!R22/100","v":0.47987249050893865},{"$f":"S16*'DHS08'!S22/100","v":0.12648931297119048},{"$f":"T16*'DHS08'!T22/100","v":0},{"$f":"U16*'DHS08'!U22/100","v":0},{"$f":"V16*'DHS08'!V22/100","v":1.7535523744956313E-2},{"$f":"W16*'DHS08'!W22/100","v":0},{"$f":"X16*'DHS08'!X22/100","v":0},{"$f":"Y16*'DHS08'!Y22/100","v":7.6384823249684777E-2},{"$f":"Z16*'DHS08'!Z22/100","v":0},null,null,null,null,null,null,null,null,null,null,null,null,null,null,null,null,null,null,null,null,null,null,null,null,null,null,null,"Limited","N/A","N/A","N/A","N/A","N/A","N/A","N/A","N/A","N/A","N/A","N/A","N/A","N/A","N/A","N/A","N/A","N/A","N/A","N/A","N/A","N/A","N/A","N/A","N/A"]
[null,"Unimproved",{"$f":"100-(C18+C19+C21)","v":19.594798945594874},{"$f":"100-(D18+D19+D21)","v":16.031286163190572},6.749627895093937,2.7791136831175294,0.35160964335709366,16.84367402380056,5.3647876400689825,2.5501146138528981,0.94078201286542651,0.15758778339936441,19.278544959373335,19.898894959330931,16.116337322602774,14.374720770385267,10.416285154449668,32.673557492121262,5.9706461123424504,6.5206529615636981,10.391675557861774,16.329741027327501,13.94970388336597,11.135235593107069,5.6425750392557177,2.9230039408490427,null,null,null,null,null,null,null,null,null,null,null,null,null,null,null,null,null,null,null,null,null,null,null,null,null,null,null,"Unimproved","N/A","N/A","N/A","N/A","N/A","N/A","N/A","N/A","N/A","N/A","N/A","N/A","N/A","N/A","N/A","N/A","N/A","N/A","N/A","N/A","N/A","N/A","N/A","N/A"]
[null,"Surface water",{"$f":"C63+C64","v":33.080020104841942},10.958061420343093,1.6531407156869922,0.39372342620812589,0,3.0449199019053457,0.65692802594696664,0.5398917264259574,1.4326160172158217E-2,0,38.923968360815948,30.568725487349372,25.387477064131488,15.682599978028446,3.3183719416289588,10.844212472522843,27.10967843103575,10.540039899825626,6.7456321427569028,1.3440368130290843,33.061029135339467,18.617551146851202,2.6829895944374744,11.230038612699575,null,null,null,null,null,null,null,null,null,null,null,null,null,null,null,null,null,null,null,null,null,null,null,null,null,null,null,"Surface water","N/A","N/A","N/A","N/A","N/A","N/A","N/A","N/A","N/A","N/A","N/A","N/A","N/A","N/A","N/A","N/A","N/A","N/A","N/A","N/A","N/A","N/A","N/A","N/A"]
["Improved water point at more than 30 minutes","Yes","N/A","N/A","N/A","N/A","N/A","N/A","N/A","N/A","N/A","N/A","N/A","N/A","N/A","N/A","N/A","N/A","N/A","N/A","N/A","N/A","N/A","N/A","N/A","N/A",null,null,null,null,null,null,null,null,null,null,null,null,null,null,null,null,null,null,null,null,null,null,null,null,null,null,"Improved water point at more than 30 minutes","Yes","N/A","N/A","N/A","N/A","N/A","N/A","N/A","N/A","N/A","N/A","N/A","N/A","N/A","N/A","N/A","N/A","N/A","N/A","N/A","N/A","N/A","N/A","N/A","N/A"]
[null,"No","N/A","N/A","N/A","N/A","N/A","N/A","N/A","N/A","N/A","N/A","N/A","N/A","N/A","N/A","N/A","N/A","N/A","N/A","N/A","N/A","N/A","N/A","N/A","N/A",null,null,null,null,null,null,null,null,null,null,null,null,null,null,null,null,null,null,null,null,null,null,null,null,null,null,null,"No","N/A","N/A","N/A","N/A","N/A","N/A","N/A","N/A","N/A","N/A","N/A","N/A","N/A","N/A","N/A","N/A","N/A","N/A","N/A","N/A","N/A","N/A","N/A","N/A"]
["Manually calculated ratios","Improved wells"]
[null,"Improved springs"]
[null,"Other"]
[null,null,"NATIONAL wealth index quintile",null,null,null,null,"URBAN wealth index quintile",null,null,null,null,"RURAL wealth index quintile",null,null,null,null,"SUB-REGIONS:",null,null,null,null,null,null,null,null,null,null,null,null,null,null,null,null,null,null,null,null,null,null,null,null,null,null,null,null,null,null,null,null,null,null,"Raw numbers of respondents:","Use of drinking water sources","NATIONAL wealth index quintile",null,null,null,null,"URBAN wealth index quintile",null,null,null,null,"RURAL wealth index quintile",null,null,null,null,"SUB-REGIONS:"]
["Percentage based on weighted population",null,"Poorest","Poor","Middle","Rich","Richest","Poorest","Poor","Middle","Rich","Richest","Poorest","Poor","Middle","Rich","Richest","Beni","Chuquisaca","Cochabamba","La Paz","Oruro","Pando","Potosi","Santa Cruz","Tarija",null,null,null,null,null,null,null,null,null,null,null,null,null,null,null,null,null,null,null,null,null,null,null,null,null,null,"Water data, raw numbers (weighted)",null,"Poorest","Poor","Middle","Rich","Richest","Poorest","Poor","Middle","Rich","Richest","Poorest","Poor","Middle","Rich","Richest","Beni","Chuquisaca","Cochabamba","La Paz","Oruro","Pando","Potosi","Santa Cruz","Tarija"]
["Piped water","Yes",42.984651979428968,64.84034077594805,84.659900289469277,92.624260267032255,97.313882225946912,72.447277089431751,88.617884205903778,92.476769203793737,96.094088631021918,98.142258367738791,37.889111501321935,44.648185717992611,54.172633296821573,61.309695352497698,78.492640689091431,50.120356493581163,64.649222111362562,73.765861021817287,79.224901136602952,75.678986944765811,51.9326771960949,68.724616256994537,85.736880217753551,81.525160276632718,null,null,null,null,null,null,null,null,null,null,null,null,null,null,null,null,null,null,null,null,null,null,null,null,null,null,"Piped water","Yes","N/A","N/A","N/A","N/A","N/A","N/A","N/A","N/A","N/A","N/A","N/A","N/A","N/A","N/A","N/A","N/A","N/A","N/A","N/A","N/A","N/A","N/A","N/A","N/A"]
[null,"No",57.015348020571054,35.159659224051914,15.340099710530611,7.3757397329676913,2.6861177740530833,27.55272291056815,11.382115794096412,7.5232307962061205,3.9059113689780829,1.8577416322612406,62.110888498678122,55.351814282007574,45.827366703178519,38.690304647502366,21.507359310908505,49.879643506419107,35.350777888637325,26.234138978182202,20.775098863397563,24.321013055234381,48.067322803905341,31.275383743005698,14.263119782246228,18.474839723367356,null,null,null,null,null,null,null,null,null,null,null,null,null,null,null,null,null,null,null,null,null,null,null,null,null,null,null,"No","N/A","N/A","N/A","N/A","N/A","N/A","N/A","N/A","N/A","N/A","N/A","N/A","N/A","N/A","N/A","N/A","N/A","N/A","N/A","N/A","N/A","N/A","N/A","N/A"]
["Piped water on premises","Yes",29.212924485017282,56.380488011556665,78.129383561541772,91.380945229310001,97.137593454541744,64.025466443941013,82.682343229252069,91.451732308770559,95.752091952811298,98.026856854847253,20.621769299643173,31.584475206553169,44.856263446435101,52.880031437737514,73.169166649099978,45.648621845626423,59.241708301392784,68.478995819174941,72.247750462512286,67.44286785860821,50.002450656937093,53.125060105361598,82.730950491319064,79.751353772989503,null,null,null,null,null,null,null,null,null,null,null,null,null,null,null,null,null,null,null,null,null,null,null,null,null,null,"Piped water on premises","Yes","N/A","N/A","N/A","N/A","N/A","N/A","N/A","N/A","N/A","N/A","N/A","N/A","N/A","N/A","N/A","N/A","N/A","N/A","N/A","N/A","N/A","N/A","N/A","N/A"]
[null,"No",70.787075514982817,43.619511988443321,21.87061643845815,8.6190547706899441,2.8624065454582759,35.974533556058979,17.317656770748378,8.5482676912293538,4.2479080471886954,1.9731431451527721,79.378230700356809,68.415524793446892,55.143736553564892,47.119968562262557,26.83083335090004,54.351378154373883,40.758291698607088,31.521004180824676,27.752249537488176,32.557132141392096,49.997549343063156,46.874939894638686,17.26904950868073,20.248646227010582,null,null,null,null,null,null,null,null,null,null,null,null,null,null,null,null,null,null,null,null,null,null,null,null,null,null,null,"No","N/A","N/A","N/A","N/A","N/A","N/A","N/A","N/A","N/A","N/A","N/A","N/A","N/A","N/A","N/A","N/A","N/A","N/A","N/A","N/A","N/A","N/A","N/A","N/A"]
["Piped water into dwelling","Yes","N/A","N/A","N/A","N/A","N/A","N/A","N/A","N/A","N/A","N/A","N/A","N/A","N/A","N/A","N/A","N/A","N/A","N/A","N/A","N/A","N/A","N/A","N/A","N/A",null,null,null,null,null,null,null,null,null,null,null,null,null,null,null,null,null,null,null,null,null,null,null,null,null,null,"Piped water into dwelling","Yes","N/A","N/A","N/A","N/A","N/A","N/A","N/A","N/A","N/A","N/A","N/A","N/A","N/A","N/A","N/A","N/A","N/A","N/A","N/A","N/A","N/A","N/A","N/A","N/A"]
[null,"No","N/A","N/A","N/A","N/A","N/A","N/A","N/A","N/A","N/A","N/A","N/A","N/A","N/A","N/A","N/A","N/A","N/A","N/A","N/A","N/A","N/A","N/A","N/A","N/A",null,null,null,null,null,null,null,null,null,null,null,null,null,null,null,null,null,null,null,null,null,null,null,null,null,null,null,"No","N/A","N/A","N/A","N/A","N/A","N/A","N/A","N/A","N/A","N/A","N/A","N/A","N/A","N/A","N/A","N/A","N/A","N/A","N/A","N/A","N/A","N/A","N/A","N/A"]
["Water source on premises","Yes",33.39900381738429,64.105289360076341,84.952533875378876,96.108279378893229,99.206870967178816,73.515047064429609,88.845084683065906,96.299691770122735,98.556823590798942,99.589731073598799,22.727242899390166,35.325116638468138,51.455479054802076,59.719162570673788,80.537536081053432,59.690344676031827,59.715723875450379,79.315860266357845,76.100327177189087,72.157883820208568,54.383828166539004,53.63609369656367,87.250818350217898,81.201801746334439,null,null,null,null,null,null,null,null,null,null,null,null,null,null,null,null,null,null,null,null,null,null,null,null,null,null,"Water source on premises","Yes","N/A","N/A","N/A","N/A","N/A","N/A","N/A","N/A","N/A","N/A","N/A","N/A","N/A","N/A","N/A","N/A","N/A","N/A","N/A","N/A","N/A","N/A","N/A","N/A"]
[null,"No",66.600996182615802,35.894710639923623,15.047466124620984,3.8917206211067161,0.79312903282121594,26.484952935570355,11.154915316934263,3.700308229877213,1.4431764092010133,0.41026892640120438,77.272757100609866,64.674883361531968,48.544520945197974,40.280837429326269,19.462463918946643,40.309655323968421,40.284276124549493,20.684139733642041,23.899672822811432,27.842116179791738,45.61617183346123,46.363906303436629,12.749181649781965,18.79819825366566,null,null,null,null,null,null,null,null,null,null,null,null,null,null,null,null,null,null,null,null,null,null,null,null,null,null,null,"No","N/A","N/A","N/A","N/A","N/A","N/A","N/A","N/A","N/A","N/A","N/A","N/A","N/A","N/A","N/A","N/A","N/A","N/A","N/A","N/A","N/A","N/A","N/A","N/A"]
["Improved Water source on premises","Yes","N/A","N/A","N/A","N/A","N/A","N/A","N/A","N/A","N/A","N/A","N/A","N/A","N/A","N/A","N/A","N/A","N/A","N/A","N/A","N/A","N/A","N/A","N/A","N/A",null,null,null,null,null,null,null,null,null,null,null,null,null,null,null,null,null,null,null,null,null,null,null,null,null,null,"Improved water source on premises","Yes","N/A","N/A","N/A","N/A","N/A","N/A","N/A","N/A","N/A","N/A","N/A","N/A","N/A","N/A","N/A","N/A","N/A","N/A","N/A","N/A","N/A","N/A","N/A","N/A"]
[null,"No","N/A","N/A","N/A","N/A","N/A","N/A","N/A","N/A","N/A","N/A","N/A","N/A","N/A","N/A","N/A","N/A","N/A","N/A","N/A","N/A","N/A","N/A","N/A","N/A",null,null,null,null,null,null,null,null,null,null,null,null,null,null,null,null,null,null,null,null,null,null,null,null,null,null,null,"No","N/A","N/A","N/A","N/A","N/A","N/A","N/A","N/A","N/A","N/A","N/A","N/A","N/A","N/A","N/A","N/A","N/A","N/A","N/A","N/A","N/A","N/A","N/A","N/A"]
["Piped water on premises available when needed","Yes","N/A","N/A","N/A","N/A","N/A","N/A","N/A","N/A","N/A","N/A","N/A","N/A","N/A","N/A","N/A","N/A","N/A","N/A","N/A","N/A","N/A","N/A","N/A","N/A",null,null,null,null,null,null,null,null,null,null,null,null,null,null,null,null,null,null,null,null,null,null,null,null,null,null,"Piped water on premises available when needed","Yes","N/A","N/A","N/A","N/A","N/A","N/A","N/A","N/A","N/A","N/A","N/A","N/A","N/A","N/A","N/A","N/A","N/A","N/A","N/A","N/A","N/A","N/A","N/A","N/A"]
[null,"No","N/A","N/A","N/A","N/A","N/A","N/A","N/A","N/A","N/A","N/A","N/A","N/A","N/A","N/A","N/A","N/A","N/A","N/A","N/A","N/A","N/A","N/A","N/A","N/A",null,null,null,null,null,null,null,null,null,null,null,null,null,null,null,null,null,null,null,null,null,null,null,null,null,null,null,"No","N/A","N/A","N/A","N/A","N/A","N/A","N/A","N/A","N/A","N/A","N/A","N/A","N/A","N/A","N/A","N/A","N/A","N/A","N/A","N/A","N/A","N/A","N/A","N/A"]
["Water point at more than 30 minutes","Yes",5.0700915144913639,2.4018042505332238,1.0953281226120386,0.25290839165874474,0.11439387574798451,1.4916890781556948,0.62208623679666897,0.3211223708741372,0.22268012752691102,0,5.7085832172103164,5.5017981800347826,3.7034644906816649,3.2884059108768793,0.90079860580098092,0.750908136910858,3.8780552363747613,1.2152896575345502,1.6929599445176005,2.0489415946758358,0.745720716574509,5.5163195687177575,0.52893642488615433,1.638391199619903,null,null,null,null,null,null,null,null,null,null,null,null,null,null,null,null,null,null,null,null,null,null,null,null,null,null,"Water point at more than 30 minutes","Yes","N/A","N/A","N/A","N/A","N/A","N/A","N/A","N/A","N/A","N/A","N/A","N/A","N/A","N/A","N/A","N/A","N/A","N/A","N/A","N/A","N/A","N/A","N/A","N/A"]
[null,"No",94.929908485508648,97.598195749466782,98.904671877387912,99.747091608341208,99.885606124252007,98.50831092184427,99.377913763203324,99.678877629125864,99.777319872473086,100,94.291416782789611,94.498201819965217,96.296535509318346,96.711594089123068,99.099201394198971,99.249091863089134,96.121944763625294,98.784710342465459,98.307040055482446,97.951058405324247,99.25427928342549,94.483680431282266,99.471063575113774,98.361608800380068,null,null,null,null,null,null,null,null,null,null,null,null,null,null,null,null,null,null,null,null,null,null,null,null,null,null,null,"No","N/A","N/A","N/A","N/A","N/A","N/A","N/A","N/A","N/A","N/A","N/A","N/A","N/A","N/A","N/A","N/A","N/A","N/A","N/A","N/A","N/A","N/A","N/A","N/A"]
["Water source available when needed","Yes","N/A","N/A","N/A","N/A","N/A","N/A","N/A","N/A","N/A","N/A","N/A","N/A","N/A","N/A","N/A","N/A","N/A","N/A","N/A","N/A","N/A","N/A","N/A","N/A",null,null,null,null,null,null,null,null,null,null,null,null,null,null,null,null,null,null,null,null,null,null,null,null,null,null,"Water source available when needed","Yes","N/A","N/A","N/A","N/A","N/A","N/A","N/A","N/A","N/A","N/A","N/A","N/A","N/A","N/A","N/A","N/A","N/A","N/A","N/A","N/A","N/A","N/A","N/A","N/A"]
[null,"No","N/A","N/A","N/A","N/A","N/A","N/A","N/A","N/A","N/A","N/A","N/A","N/A","N/A","N/A","N/A","N/A","N/A","N/A","N/A","N/A","N/A","N/A","N/A","N/A",null,null,null,null,null,null,null,null,null,null,null,null,null,null,null,null,null,null,null,null,null,null,null,null,null,null,null,"No","N/A","N/A","N/A","N/A","N/A","N/A","N/A","N/A","N/A","N/A","N/A","N/A","N/A","N/A","N/A","N/A","N/A","N/A","N/A","N/A","N/A","N/A","N/A","N/A"]
["Improved water source available when needed","Yes","N/A","N/A","N/A","N/A","N/A","N/A","N/A","N/A","N/A","N/A","N/A","N/A","N/A","N/A","N/A","N/A","N/A","N/A","N/A","N/A","N/A","N/A","N/A","N/A",null,null,null,null,null,null,null,null,null,null,null,null,null,null,null,null,null,null,null,null,null,null,null,null,null,null,"Improved water source available when needed","Yes","N/A","N/A","N/A","N/A","N/A","N/A","N/A","N/A","N/A","N/A","N/A","N/A","N/A","N/A","N/A","N/A","N/A","N/A","N/A","N/A","N/A","N/A","N/A","N/A"]
[null,"No","N/A","N/A","N/A","N/A","N/A","N/A","N/A","N/A","N/A","N/A","N/A","N/A","N/A","N/A","N/A","N/A","N/A","N/A","N/A","N/A","N/A","N/A","N/A","N/A",null,null,null,null,null,null,null,null,null,null,null,null,null,null,null,null,null,null,null,null,null,null,null,null,null,null,null,"No","N/A","N/A","N/A","N/A","N/A","N/A","N/A","N/A","N/A","N/A","N/A","N/A","N/A","N/A","N/A","N/A","N/A","N/A","N/A","N/A","N/A","N/A","N/A","N/A"]
["Microbiological quality at point of collection","Not contaminated (No E. coli in 100 mL)","N/A","N/A","N/A","N/A","N/A","N/A","N/A","N/A","N/A","N/A","N/A","N/A","N/A","N/A","N/A","N/A","N/A","N/A","N/A","N/A","N/A","N/A","N/A","N/A",null,null,null,null,null,null,null,null,null,null,null,null,null,null,null,null,null,null,null,null,null,null,null,null,null,null,"Microbiological quality at point of collection","Not contaminated (No E. coli in 100 mL)","N/A","N/A","N/A","N/A","N/A","N/A","N/A","N/A","N/A","N/A","N/A","N/A","N/A","N/A","N/A","N/A","N/A","N/A","N/A","N/A","N/A","N/A","N/A","N/A"]
[null,"Contaminated (E. coli detected in 100 mL)","N/A","N/A","N/A","N/A","N/A","N/A","N/A","N/A","N/A","N/A","N/A","N/A","N/A","N/A","N/A","N/A","N/A","N/A","N/A","N/A","N/A","N/A","N/A","N/A",null,null,null,null,null,null,null,null,null,null,null,null,null,null,null,null,null,null,null,null,null,null,null,null,null,null,null,"Contaminated (E. coli detected in 100 mL)","N/A","N/A","N/A","N/A","N/A","N/A","N/A","N/A","N/A","N/A","N/A","N/A","N/A","N/A","N/A","N/A","N/A","N/A","N/A","N/A","N/A","N/A","N/A","N/A"]
[null,"Highly contaminated (>100 CFU/100 mL)","N/A","N/A","N/A","N/A","N/A","N/A","N/A","N/A","N/A","N/A","N/A","N/A","N/A","N/A","N/A","N/A","N/A","N/A","N/A","N/A","N/A","N/A","N/A","N/A",null,null,null,null,null,null,null,null,null,null,null,null,null,null,null,null,null,null,null,null,null,null,null,null,null,null,null,"Highly contaminated (>100 CFU/100 mL)","N/A","N/A","N/A","N/A","N/A","N/A","N/A","N/A","N/A","N/A","N/A","N/A","N/A","N/A","N/A","N/A","N/A","N/A","N/A","N/A","N/A","N/A","N/A","N/A"]
["Microbiological quality of improved water sources at point of collection","Not contaminated (No E. coli in 100 mL)","N/A","N/A","N/A","N/A","N/A","N/A","N/A","N/A","N/A","N/A","N/A","N/A","N/A","N/A","N/A","N/A","N/A","N/A","N/A","N/A","N/A","N/A","N/A","N/A",null,null,null,null,null,null,null,null,null,null,null,null,null,null,null,null,null,null,null,null,null,null,null,null,null,null,"Microbiological quality of improved water sources at point of collection","Not contaminated (No E. coli in 100 mL)","N/A","N/A","N/A","N/A","N/A","N/A","N/A","N/A","N/A","N/A","N/A","N/A","N/A","N/A","N/A","N/A","N/A","N/A","N/A","N/A","N/A","N/A","N/A","N/A"]
[null,"Contaminated (E. coli detected in 100 mL)","N/A","N/A","N/A","N/A","N/A","N/A","N/A","N/A","N/A","N/A","N/A","N/A","N/A","N/A","N/A","N/A","N/A","N/A","N/A","N/A","N/A","N/A","N/A","N/A",null,null,null,null,null,null,null,null,null,null,null,null,null,null,null,null,null,null,null,null,null,null,null,null,null,null,null,"Contaminated (E. coli detected in 100 mL)","N/A","N/A","N/A","N/A","N/A","N/A","N/A","N/A","N/A","N/A","N/A","N/A","N/A","N/A","N/A","N/A","N/A","N/A","N/A","N/A","N/A","N/A","N/A","N/A"]
[null,"Highly contaminated (>100 CFU/100 mL)","N/A","N/A","N/A","N/A","N/A","N/A","N/A","N/A","N/A","N/A","N/A","N/A","N/A","N/A","N/A","N/A","N/A","N/A","N/A","N/A","N/A","N/A","N/A","N/A",null,null,null,null,null,null,null,null,null,null,null,null,null,null,null,null,null,null,null,null,null,null,null,null,null,null,null,"Highly contaminated (>100 CFU/100 mL)","N/A","N/A","N/A","N/A","N/A","N/A","N/A","N/A","N/A","N/A","N/A","N/A","N/A","N/A","N/A","N/A","N/A","N/A","N/A","N/A","N/A","N/A","N/A","N/A"]
["Microbiological quality of piped on premises at point of collection","Not contaminated (No E. coli in 100 mL)","N/A","N/A","N/A","N/A","N/A","N/A","N/A","N/A","N/A","N/A","N/A","N/A","N/A","N/A","N/A","N/A","N/A","N/A","N/A","N/A","N/A","N/A","N/A","N/A",null,null,null,null,null,null,null,null,null,null,null,null,null,null,null,null,null,null,null,null,null,null,null,null,null,null,"Microbiological quality of piped on premises at point of collection","Not contaminated (No E. coli in 100 mL)","N/A","N/A","N/A","N/A","N/A","N/A","N/A","N/A","N/A","N/A","N/A","N/A","N/A","N/A","N/A","N/A","N/A","N/A","N/A","N/A","N/A","N/A","N/A","N/A"]
[null,"Contaminated (E. coli detected in 100 mL)","N/A","N/A","N/A","N/A","N/A","N/A","N/A","N/A","N/A","N/A","N/A","N/A","N/A","N/A","N/A","N/A","N/A","N/A","N/A","N/A","N/A","N/A","N/A","N/A",null,null,null,null,null,null,null,null,null,null,null,null,null,null,null,null,null,null,null,null,null,null,null,null,null,null,null,"Contaminated (E. coli detected in 100 mL)","N/A","N/A","N/A","N/A","N/A","N/A","N/A","N/A","N/A","N/A","N/A","N/A","N/A","N/A","N/A","N/A","N/A","N/A","N/A","N/A","N/A","N/A","N/A","N/A"]
[null,"Highly contaminated (>100 CFU/100 mL)","N/A","N/A","N/A","N/A","N/A","N/A","N/A","N/A","N/A","N/A","N/A","N/A","N/A","N/A","N/A","N/A","N/A","N/A","N/A","N/A","N/A","N/A","N/A","N/A",null,null,null,null,null,null,null,null,null,null,null,null,null,null,null,null,null,null,null,null,null,null,null,null,null,null,null,"Highly contaminated (>100 CFU/100 mL)","N/A","N/A","N/A","N/A","N/A","N/A","N/A","N/A","N/A","N/A","N/A","N/A","N/A","N/A","N/A","N/A","N/A","N/A","N/A","N/A","N/A","N/A","N/A","N/A"]
[null,null,"NATIONAL wealth index quintile",null,null,null,null,"URBAN wealth index quintile",null,null,null,null,"RURAL wealth index quintile",null,null,null,null,"SUB-REGIONS:",null,null,null,null,null,null,null,null,null,null,null,null,null,null,null,null,null,null,null,null,null,null,null,null,null,null,null,null,null,null,null,null,null,null,"Raw numbers of respondents:","Use of drinking water sources","NATIONAL wealth index quintile",null,null,null,null,"URBAN wealth index quintile",null,null,null,null,"RURAL wealth index quintile",null,null,null,null,"SUB-REGIONS:"]
["Percentage based on weighted population",null,"Poorest","Poor","Middle","Rich","Richest","Poorest","Poor","Middle","Rich","Richest","Poorest","Poor","Middle","Rich","Richest","Beni","Chuquisaca","Cochabamba","La Paz","Oruro","Pando","Potosi","Santa Cruz","Tarija",null,null,null,null,null,null,null,null,null,null,null,null,null,null,null,null,null,null,null,null,null,null,null,null,null,null,"Water data, raw numbers (weighted)",null,"Poorest","Poor","Middle","Rich","Richest","Poorest","Poor","Middle","Rich","Richest","Poorest","Poor","Middle","Rich","Richest","Beni","Chuquisaca","Cochabamba","La Paz","Oruro","Pando","Potosi","Santa Cruz","Tarija"]
["Source of drinking water","Piped into dwelling",1.1586621522221114,3.1817141383117002,10.757160203685743,26.086452546463494,69.278324642443266,8.0404426635211195,11.433398154130872,23.751102522300286,43.370324976772039,82.468392727837696,0.34562864166732621,1.3285045607273356,1.1685030911916507,1.8800902558833321,10.795858864654015,19.997194434318263,20.340946362215139,21.829278579234074,16.775284148749211,18.066672175468035,10.222579264472369,7.6395752250085343,34.617076772496581,26.349768311470832]
[null,"Piped into yard/spot",28.153452310327904,53.267436742483,67.372223357855972,65.294492682846638,27.946903836118175,56.086079216266036,71.248945075121028,67.700629786470472,52.381766976038961,15.701550538171185,20.403294529750816,30.331785706698106,43.731466160456797,50.999941181854147,62.373307784445927,25.966948975272565,38.921527909001327,46.702901930519353,55.479400290279614,49.408258775566019,39.779871392464742,45.569718301055737,48.277114034151381,53.401585461518678]
[null,"Pipedoutside dwelling",13.818488212992239,8.4701555798621033,6.5305167279275267,1.2433150377222497,0.17644781457444397,8.4351033209317734,5.9355409766519571,1.0250368950232318,0.3419966782106123,0.11556996048693668,17.373812669091311,13.095068512519466,9.3254472771423043,8.429663914760182,5.3234740399915577,4.5026431103072291,5.4094093033952015,5.2909712834424267,6.9778203059977217,8.2400346291331505,1.9302265391578179,15.624290316140033,3.011860867240757,1.7738065036432284]
[null,"Well with electrical pump",4.2392842080677395,3.63829344245215,3.1390257931047687,1.3057376429953491,0.68726373331240098,1.3391379734063298,1.2427865526417419,0.47010821158125721,1.0562099482358869,0.36884780230256509,3.405978604216982,6.0057881624477849,3.3510248437613024,4.9330917066242641,9.1378251768075582,4.4743927177118517,0.66152637072042164,1.5355536804201675,1.7215853924596929,3.1063034777424616,5.8711561177987592E-2,2.8063314455648642,4.981136047339068,0.42910789157381846]
[null,"Well without electrical pump",17.591668309095379,17.139887760285223,5.8085520293861839,2.4129766349780115,0.31342535669417659,16.051533429281601,4.8582531437572785,2.3010854397992322,0.57636217873157125,0.10359079817695464,17.874206941093455,16.926613392285741,16.20780277498837,16.237816141488288,7.4117005082558309,29.799523675968764,5.7644074435093522,4.9362079649840451,11.44862649846495,18.267892341579149,12.931605134168564,8.2668299312533886,5.0145349020825076,2.9846416136480594]
[null,"River/ stream",29.826903063003172,10.135105182633334,1.6339006581980022,0.37326049153878105,0,2.9804998073800459,0.62590846555334645,0.52106813580482558,0,0,34.772411719410265,27.955111904466939,22.408940966718315,14.848096687146359,3.3183719416289588,8.9966886519588432,25.481195648607795,8.5495851048004567,6.2613376997942671,1.3440368130290843,28.526278619578715,18.347220109218458,2.3480660855527336,11.170755806056809]
[null,"Pond/ lake",3.2531170418387734,0.82295623770975834,1.9240057488989867E-2,2.0462934669344839E-2,0,6.4420094525299551E-2,3.1019560393620159E-2,1.8823590621131855E-2,1.4326160172158217E-2,0,4.1515566414056835,2.6136135828824316,2.9785360974131736,0.83450329088208597,0,1.8475238205639992,1.6284827824279566,1.9904547950251692,0.48429444296263546,0,4.5347505157607495,0.27033103763274274,0.33492350888474104,5.9282806642766306E-2]
[null,"Wather from neighbors",0.7813468553793661,1.0898919204500659,1.0293781969541842,0.40053501276286635,0,2.687943630623006,0.70670244458385645,0.58844410882898956,4.265641601005337E-2,0,0.36904513362854036,0.45712393596976308,0.31510428886953767,0.46603273462136874,0.52154640623813153,1.313445619587041,0.70655876368590831,0.42946658724331011,0.22461604631809728,0.75565290670830432,0.29623828706278349,0.55172024984012502,0.95854950990125254,2.0758735260127512]
[null,"Tanker truck",0.15334075363770494,1.3924730462147299,3.3574874472854734,2.7379640161364778,1.4951344665354651,3.5609442290068198,3.6985797749084797,3.5161568642500809,2.0131275725766349,1.1879370802642204,0,0.27243617928593872,0.12339099421163875,0.40926390710692107,0.49361239339879276,2.2708077222386671,0.31349157397327548,7.9239780348384965,0.40962034618473375,0.20852247849305192,0,0.35699930022938658,9.2226270067216218E-2,1.3802479146262907]
[null,"Other",1.0237370934357723,0.862085949597864,0.35251552811301817,0.12480299988686665,0.1025001503220197,0.75389563505797863,0.21886585225809208,0.10754444532060586,0.20322909325177879,5.4111092760380827E-2,1.3040651197356952,1.0139540627165462,0.38978350524682992,0.96150017963306667,0.6243028845792391,0.83083127207292085,0.77245384246376003,0.811602039492064,0.21741482878937429,0.60262640228117237,1.7197386861565227,0.56698408405691103,0.36451200228346281,0.37493016480686836]
[]
[]
[]
[]
[]
[]
[]
[]
[]
[]
[]
[]
[]
[]
[]
[]
[]
[]
[]
[]
[]
[]
[]
[]
[]
[]
[]
[]
[]
[]
[]
[]
[]
[]
[]
[]
[]
[]
[]
[]
[{"$f":"A1026","v":"Bolivia (Plurinational State of)"}]
[{"$f":"A1034","v":"2003"}]
["Use of sanitation facilities"]
[" by wealth quintile and sub-national region"]
["Notes:"]
["WHO/UNICEF JMP customised wealth index excludes water,"]
[" sanitation and hygiene assets."]
["Survey used for analysis:",{"$f":"A1025","v":"DHS03"}]
[{"$f":"B1030","v":"Ratio of Improved latrines based on:"},"50% Rule"]
[{"$f":"B1029","v":"Ratio of Shared improved based on:"},"Shared among sanitation"]
[]
[]
["Use of sanitation facilities",null,"NATIONAL wealth index quintile",null,null,null,null,"URBAN wealth index quintile",null,null,null,null,"RURAL wealth index quintile",null,null,null,null,"SUB-REGIONS:",null,null,null,null,null,null,null,null,null,null,null,null,null,null,null,null,null,null,null,null,null,null,null,null,null,null,null,null,null,null,null,null,null,null,"Raw numbers of respondents:","Use of sanitation facilities","NATIONAL wealth index quintile",null,null,null,null,"URBAN wealth index quintile",null,null,null,null,"RURAL wealth index quintile",null,null,null,null,"SUB-REGIONS:"]
["Weighted percentage (used in graphs)",null,"Poorest","Poor","Middle","Rich","Richest","Poorest","Poor","Middle","Rich","Richest","Poorest","Poor","Middle","Rich","Richest","Beni","Chuquisaca","Cochabamba","La Paz","Oruro","Pando","Potosi","Santa Cruz","Tarija",null,null,null,null,null,null,null,null,null,null,null,null,null,null,null,null,null,null,null,null,null,null,null,null,null,null,"Sanitation data, raw numbers (weighted)",null,"Poorest","Poor","Middle","Rich","Richest","Poorest","Poor","Middle","Rich","Richest","Poorest","Poor","Middle","Rich","Richest","Beni","Chuquisaca","Cochabamba","La Paz","Oruro","Pando","Potosi","Santa Cruz","Tarija"]
["Sanitation","Improved",{"$f":"C135+C136+C137","v":15.463111926071505},{"$f":"D135+D136+D137","v":28.068426550068313},50.018102471343241,74.456753476267522,90.736857210136691,37.115214385695424,57.885634016372705,75.886748105453506,81.872076789808034,94.269754909259845,10.60400241755042,16.653391190167294,20.91308995555643,25.37419804112449,42.145832955785423,55.583830297598354,40.079986766729135,56.565260429614987,46.58907809038331,44.354450215577799,48.044073912454479,32.20397766613803,63.226996825710486,62.293940613675289,null,null,null,null,null,null,null,null,null,null,null,null,null,null,null,null,null,null,null,null,null,null,null,null,null,null,"Sanitation","Improved","N/A","N/A","N/A","N/A","N/A","N/A","N/A","N/A","N/A","N/A","N/A","N/A","N/A","N/A","N/A","N/A","N/A","N/A","N/A","N/A","N/A","N/A","N/A","N/A"]
[null,"Not Improved",{"$f":"100-C122","v":84.536888073928495},{"$f":"100-D122","v":71.93157344993169},49.981897528656759,25.543246523732478,9.2631427898633092,62.884785614304576,42.114365983627295,24.113251894546494,18.127923210191966,5.730245090740155,89.395997582449581,83.346608809832702,79.08691004444357,74.625801958875513,57.854167044214577,44.416169702401646,59.920013233270865,43.434739570385013,53.41092190961669,55.645549784422201,51.955926087545521,67.79602233386197,36.773003174289514,37.706059386324711,null,null,null,null,null,null,null,null,null,null,null,null,null,null,null,null,null,null,null,null,null,null,null,null,null,null,null,"Not Improved","N/A","N/A","N/A","N/A","N/A","N/A","N/A","N/A","N/A","N/A","N/A","N/A","N/A","N/A","N/A","N/A","N/A","N/A","N/A","N/A","N/A","N/A","N/A","N/A"]
["Sanitation ladder","Basic",{"$f":"C122*C129/100","v":4.4216600487773032},{"$f":"D122*D129/100","v":11.547837452446256},19.188758485688282,42.899897667275809,81.559015348971656,13.664089213665658,21.072229863676466,41.515224739359425,59.632059474034222,90.073725055123589,2.1211569863078408,5.2084739450271869,7.7498560232265223,10.668377212198997,24.990108644344033,41.291187869933125,13.655788709901024,32.360922877414275,19.054985871100431,15.353195731778371,29.231480610974458,7.8262386709538987,45.291869791330903,33.318387047385364,null,null,null,null,null,null,null,null,null,null,null,null,null,null,null,null,null,null,null,null,null,null,null,null,null,null,"Sanitation ladder","Basic","N/A","N/A","N/A","N/A","N/A","N/A","N/A","N/A","N/A","N/A","N/A","N/A","N/A","N/A","N/A","N/A","N/A","N/A","N/A","N/A","N/A","N/A","N/A","N/A"]
[null,"Limited",{"$f":"C122*C128/100","v":11.041451877294215},{"$f":"D122*D128/100","v":16.520589097622008},30.829343985654855,31.556855808991717,9.1778418611649037,23.451125172029748,36.813404152696393,34.371523366094337,22.240017315773642,4.1960298541363183,8.4828454312425841,11.44491724514012,13.163233932329918,14.7058208289255,17.155724311441396,14.292642427665353,26.424198056828118,24.20433755220056,27.534092219283046,29.001254483799563,18.812593301480106,24.377738995184192,17.935127034379477,28.975553566289975,null,null,null,null,null,null,null,null,null,null,null,null,null,null,null,null,null,null,null,null,null,null,null,null,null,null,null,"Limited","N/A","N/A","N/A","N/A","N/A","N/A","N/A","N/A","N/A","N/A","N/A","N/A","N/A","N/A","N/A","N/A","N/A","N/A","N/A","N/A","N/A","N/A","N/A","N/A"]
[null,"Unimproved",{"$f":"100-(C124+C125+C127)","v":13.599827550522761},{"$f":"100-(D124+D125+D127)","v":19.834495169321599},15.751208262311778,14.007028256825436,7.9167970828244023,17.667213952818656,14.016617918725075,13.189680435686199,11.762417896465493,5.3194048331904895,9.6767223689517436,13.872465259184395,18.221483147867119,19.741906823285262,24.473172324442942,31.403331135050024,5.8353826236735244,15.205281128148059,9.0390969966887695,4.5292850466853167,27.163620035903165,4.2284433933928511,24.749046951138865,12.27017598198519,null,null,null,null,null,null,null,null,null,null,null,null,null,null,null,null,null,null,null,null,null,null,null,null,null,null,null,"Unimproved","N/A","N/A","N/A","N/A","N/A","N/A","N/A","N/A","N/A","N/A","N/A","N/A","N/A","N/A","N/A","N/A","N/A","N/A","N/A","N/A","N/A","N/A","N/A","N/A"]
[null,"Open defecation",{"$f":"C139","v":70.937060523405719},{"$f":"D139","v":52.097078280610134},34.230689266345081,11.53621826690704,1.3463457070390377,45.217571661485927,28.097748064902063,10.923571458860042,6.3655053137266426,0.41084025754960396,79.719275213497838,69.474143550648293,60.865426896576444,54.883895135590244,33.380994719771635,13.012838567351501,54.08463060959734,28.2294584422371,44.37182491292775,51.116264737736749,24.792306051642278,63.567578940469062,12.023956223150748,25.435883404339471,null,null,null,null,null,null,null,null,null,null,null,null,null,null,null,null,null,null,null,null,null,null,null,null,null,null,null,"Open defecation","N/A","N/A","N/A","N/A","N/A","N/A","N/A","N/A","N/A","N/A","N/A","N/A","N/A","N/A","N/A","N/A","N/A","N/A","N/A","N/A","N/A","N/A","N/A","N/A"]
["Shared among Improved Sanitation","Yes",71.405108687584601,58.858265774722597,61.636372557951077,42.382798518136042,10.114789230477776,63.184668498285824,63.596788353883937,45.29318257033637,27.164349785423088,4.4510881121683648,79.996638035491557,68.724244296246241,62.942558752933387,57.955805362169365,40.705624039840941,25.713669517091382,65.928659634097372,42.790110694033459,59.099886385102138,65.385219167058878,39.1569485463707,75.697912996682376,28.366248493217022,46.514240840832301,null,null,null,null,null,null,null,null,null,null,null,null,null,null,null,null,null,null,null,null,null,null,null,null,null,null,"Shared among improved sanitation facilities","Yes","N/A","N/A","N/A","N/A","N/A","N/A","N/A","N/A","N/A","N/A","N/A","N/A","N/A","N/A","N/A","N/A","N/A","N/A","N/A","N/A","N/A","N/A","N/A","N/A"]
[null,"No",28.594891312415484,41.141734225277233,38.363627442048717,57.617201481863958,89.885210769522089,36.81533150171412,36.403211646116333,54.706817429663971,72.835650214576702,95.548911887831707,20.003361964508482,31.275755703753834,37.057441247066656,42.044194637830671,59.294375960159073,74.286330482908838,34.07134036590265,57.209889305966279,40.900113614898231,34.614780832941427,60.843051453629485,24.302087003317805,71.633751506782801,53.485759159167777,null,null,null,null,null,null,null,null,null,null,null,null,null,null,null,null,null,null,null,null,null,null,null,null,null,null,null,"No","N/A","N/A","N/A","N/A","N/A","N/A","N/A","N/A","N/A","N/A","N/A","N/A","N/A","N/A","N/A","N/A","N/A","N/A","N/A","N/A","N/A","N/A","N/A","N/A"]
["Manually calculated ratios","Improved latrines"]
[null,"Other"]
[null,"Other"]
[null,null,"NATIONAL wealth index quintile",null,null,null,null,"URBAN wealth index quintile",null,null,null,null,"RURAL wealth index quintile",null,null,null,null,"SUB-REGIONS:",null,null,null,null,null,null,null,null,null,null,null,null,null,null,null,null,null,null,null,null,null,null,null,null,null,null,null,null,null,null,null,null,null,null,"Raw numbers of respondents:","Use of sanitation facilities","NATIONAL wealth index quintile",null,null,null,null,"URBAN wealth index quintile",null,null,null,null,"RURAL wealth index quintile",null,null,null,null,"SUB-REGIONS:"]
["Percentage based on weighted population",null,"Poorest","Poor","Middle","Rich","Richest","Poorest","Poor","Middle","Rich","Richest","Poorest","Poor","Middle","Rich","Richest","Beni","Chuquisaca","Cochabamba","La Paz","Oruro","Pando","Potosi","Santa Cruz","Tarija",null,null,null,null,null,null,null,null,null,null,null,null,null,null,null,null,null,null,null,null,null,null,null,null,null,null,"Sanitation data, raw numbers (weighted)",null,"Poorest","Poor","Middle","Rich","Richest","Poorest","Poor","Middle","Rich","Richest","Poorest","Poor","Middle","Rich","Richest","Beni","Chuquisaca","Cochabamba","La Paz","Oruro","Pando","Potosi","Santa Cruz","Tarija"]
["Sanitation type","Sewer connection",{"$f":"C153","v":0.25492144846521064},{"$f":"D153","v":4.9361850754278809},27.706538338871773,47.826470903005671,66.751367089007047,14.498718372871256,37.73430810939486,51.126373539474692,53.15323049060683,74.663825647230183,3.0163589615098955E-2,0.47417900524475326,0.77248053852688392,2.2816088487364952,8.2803538504373879,5.0465499914755254,33.714487781815535,34.359468907221668,34.246463035419396,37.799951773718391,2.8068863347707178,27.068842833696532,19.678204106480219,45.471762486007826,null,null,null,null,null,null,null,null,null,null,null,null,null,null,null,null,null,null,null,null,null,null,null,null,null,null,"Sanitation type","Sewer connection","N/A","N/A","N/A","N/A","N/A","N/A","N/A","N/A","N/A","N/A","N/A","N/A","N/A","N/A","N/A","N/A","N/A","N/A","N/A","N/A","N/A","N/A","N/A","N/A"]
[null,"Septic tank connection",{"$f":"C154","v":1.6083629270835273},3.2977463053188787,6.5603558701597873,12.623254316436419,16.068693038305369,4.9492820600055127,6.1347079882526181,11.570694130292372,16.956428402735877,14.286524428839115,0.89711645898358527,2.3067469257381314,1.9191262691624207,3.3506823691027261,9.3923067809050984,19.133949171072683,0.53011636124007255,7.0005103942454117,3.3035180582749728,2.0252133951739619,18.073567541780509,0.90669143904859051,18.799745768091501,4.5520021456822217,null,null,null,null,null,null,null,null,null,null,null,null,null,null,null,null,null,null,null,null,null,null,null,null,null,null,null,"Septic tank connection","N/A","N/A","N/A","N/A","N/A","N/A","N/A","N/A","N/A","N/A","N/A","N/A","N/A","N/A","N/A","N/A","N/A","N/A","N/A","N/A","N/A","N/A","N/A","N/A"]
[null,"Improved latrines",{"$f":"(100-(C135+C136+C139))/2","v":13.599827550522768},{"$f":"(100-(D135+D136+D139))/2","v":19.834495169321553},15.751208262311678,14.007028256825436,7.9167970828242744,17.667213952818656,14.016617918725231,13.189680435686448,11.762417896465323,5.3194048331905464,9.6767223689517365,13.872465259184409,18.221483147867126,19.741906823285269,24.473172324442938,31.403331135050145,5.8353826236735244,15.205281128147909,9.0390969966889401,4.5292850466854446,27.16362003590325,4.228443393392908,24.749046951138766,12.27017598198524,null,null,null,null,null,null,null,null,null,null,null,null,null,null,null,null,null,null,null,null,null,null,null,null,null,null,null,"Improved latrines","N/A","N/A","N/A","N/A","N/A","N/A","N/A","N/A","N/A","N/A","N/A","N/A","N/A","N/A","N/A","N/A","N/A","N/A","N/A","N/A","N/A","N/A","N/A","N/A"]
[null,"Unimproved facilities",{"$f":"(100-(C135+C136+C139))/2","v":13.599827550522768},{"$f":"(100-(D135+D136+D139))/2","v":19.834495169321553},15.751208262311678,14.007028256825436,7.9167970828242744,17.667213952818656,14.016617918725231,13.189680435686448,11.762417896465323,5.3194048331905464,9.6767223689517365,13.872465259184409,18.221483147867126,19.741906823285269,24.473172324442938,31.403331135050145,5.8353826236735244,15.205281128147909,9.0390969966889401,4.5292850466854446,27.16362003590325,4.228443393392908,24.749046951138766,12.27017598198524,null,null,null,null,null,null,null,null,null,null,null,null,null,null,null,null,null,null,null,null,null,null,null,null,null,null,null,"Unimproved facilities","N/A","N/A","N/A","N/A","N/A","N/A","N/A","N/A","N/A","N/A","N/A","N/A","N/A","N/A","N/A","N/A","N/A","N/A","N/A","N/A","N/A","N/A","N/A","N/A"]
[null,"Open defecation",70.937060523405719,52.097078280610134,34.230689266345081,11.53621826690704,1.3463457070390377,45.217571661485927,28.097748064902063,10.923571458860042,6.3655053137266426,0.41084025754960396,79.719275213497838,69.474143550648293,60.865426896576444,54.883895135590244,33.380994719771635,13.012838567351501,54.08463060959734,28.2294584422371,44.37182491292775,51.116264737736749,24.792306051642278,63.567578940469062,12.023956223150748,25.435883404339471,null,null,null,null,null,null,null,null,null,null,null,null,null,null,null,null,null,null,null,null,null,null,null,null,null,null,null,"Open defecation","N/A","N/A","N/A","N/A","N/A","N/A","N/A","N/A","N/A","N/A","N/A","N/A","N/A","N/A","N/A","N/A","N/A","N/A","N/A","N/A","N/A","N/A","N/A","N/A"]
["Septic tank emptying practices","Not emptied/treated and disposed in situ","N/A","N/A","N/A","N/A","N/A","N/A","N/A","N/A","N/A","N/A","N/A","N/A","N/A","N/A","N/A","N/A","N/A","N/A","N/A","N/A","N/A","N/A","N/A","N/A",null,null,null,null,null,null,null,null,null,null,null,null,null,null,null,null,null,null,null,null,null,null,null,null,null,null,"Septic tank emptying practices","Not emptied/treated and disposed in situ","N/A","N/A","N/A","N/A","N/A","N/A","N/A","N/A","N/A","N/A","N/A","N/A","N/A","N/A","N/A","N/A","N/A","N/A","N/A","N/A","N/A","N/A","N/A","N/A"]
[null,"Emptied and buried on site","N/A","N/A","N/A","N/A","N/A","N/A","N/A","N/A","N/A","N/A","N/A","N/A","N/A","N/A","N/A","N/A","N/A","N/A","N/A","N/A","N/A","N/A","N/A","N/A",null,null,null,null,null,null,null,null,null,null,null,null,null,null,null,null,null,null,null,null,null,null,null,null,null,null,null,"Emptied and buried on site","N/A","N/A","N/A","N/A","N/A","N/A","N/A","N/A","N/A","N/A","N/A","N/A","N/A","N/A","N/A","N/A","N/A","N/A","N/A","N/A","N/A","N/A","N/A","N/A"]
[null,"Emptied and discharged locally","N/A","N/A","N/A","N/A","N/A","N/A","N/A","N/A","N/A","N/A","N/A","N/A","N/A","N/A","N/A","N/A","N/A","N/A","N/A","N/A","N/A","N/A","N/A","N/A",null,null,null,null,null,null,null,null,null,null,null,null,null,null,null,null,null,null,null,null,null,null,null,null,null,null,null,"Emptied and discharged locally","N/A","N/A","N/A","N/A","N/A","N/A","N/A","N/A","N/A","N/A","N/A","N/A","N/A","N/A","N/A","N/A","N/A","N/A","N/A","N/A","N/A","N/A","N/A","N/A"]
[null,"Emptied and removed offsite","N/A","N/A","N/A","N/A","N/A","N/A","N/A","N/A","N/A","N/A","N/A","N/A","N/A","N/A","N/A","N/A","N/A","N/A","N/A","N/A","N/A","N/A","N/A","N/A",null,null,null,null,null,null,null,null,null,null,null,null,null,null,null,null,null,null,null,null,null,null,null,null,null,null,null,"Emptied and removed offsite","N/A","N/A","N/A","N/A","N/A","N/A","N/A","N/A","N/A","N/A","N/A","N/A","N/A","N/A","N/A","N/A","N/A","N/A","N/A","N/A","N/A","N/A","N/A","N/A"]
["Latrine emptying practices","Not emptied/treated and disposed in situ","N/A","N/A","N/A","N/A","N/A","N/A","N/A","N/A","N/A","N/A","N/A","N/A","N/A","N/A","N/A","N/A","N/A","N/A","N/A","N/A","N/A","N/A","N/A","N/A",null,null,null,null,null,null,null,null,null,null,null,null,null,null,null,null,null,null,null,null,null,null,null,null,null,null,"Latrine emptying practices","Not emptied/treated and disposed in situ","N/A","N/A","N/A","N/A","N/A","N/A","N/A","N/A","N/A","N/A","N/A","N/A","N/A","N/A","N/A","N/A","N/A","N/A","N/A","N/A","N/A","N/A","N/A","N/A"]
[null,"Emptied and buried on site","N/A","N/A","N/A","N/A","N/A","N/A","N/A","N/A","N/A","N/A","N/A","N/A","N/A","N/A","N/A","N/A","N/A","N/A","N/A","N/A","N/A","N/A","N/A","N/A",null,null,null,null,null,null,null,null,null,null,null,null,null,null,null,null,null,null,null,null,null,null,null,null,null,null,null,"Emptied and buried on site","N/A","N/A","N/A","N/A","N/A","N/A","N/A","N/A","N/A","N/A","N/A","N/A","N/A","N/A","N/A","N/A","N/A","N/A","N/A","N/A","N/A","N/A","N/A","N/A"]
[null,"Emptied and discharged locally","N/A","N/A","N/A","N/A","N/A","N/A","N/A","N/A","N/A","N/A","N/A","N/A","N/A","N/A","N/A","N/A","N/A","N/A","N/A","N/A","N/A","N/A","N/A","N/A",null,null,null,null,null,null,null,null,null,null,null,null,null,null,null,null,null,null,null,null,null,null,null,null,null,null,null,"Emptied and discharged locally","N/A","N/A","N/A","N/A","N/A","N/A","N/A","N/A","N/A","N/A","N/A","N/A","N/A","N/A","N/A","N/A","N/A","N/A","N/A","N/A","N/A","N/A","N/A","N/A"]
[null,"Emptied and removed offsite","N/A","N/A","N/A","N/A","N/A","N/A","N/A","N/A","N/A","N/A","N/A","N/A","N/A","N/A","N/A","N/A","N/A","N/A","N/A","N/A","N/A","N/A","N/A","N/A",null,null,null,null,null,null,null,null,null,null,null,null,null,null,null,null,null,null,null,null,null,null,null,null,null,null,null,"Emptied and removed offsite","N/A","N/A","N/A","N/A","N/A","N/A","N/A","N/A","N/A","N/A","N/A","N/A","N/A","N/A","N/A","N/A","N/A","N/A","N/A","N/A","N/A","N/A","N/A","N/A"]
["Shared among improved sanitation facilities","Yes","N/A","N/A","N/A","N/A","N/A","N/A","N/A","N/A","N/A","N/A","N/A","N/A","N/A","N/A","N/A","N/A","N/A","N/A","N/A","N/A","N/A","N/A","N/A","N/A",null,null,null,null,null,null,null,null,null,null,null,null,null,null,null,null,null,null,null,null,null,null,null,null,null,null,"Shared among improved sanitation facilities","Yes","N/A","N/A","N/A","N/A","N/A","N/A","N/A","N/A","N/A","N/A","N/A","N/A","N/A","N/A","N/A","N/A","N/A","N/A","N/A","N/A","N/A","N/A","N/A","N/A"]
[null,"No","N/A","N/A","N/A","N/A","N/A","N/A","N/A","N/A","N/A","N/A","N/A","N/A","N/A","N/A","N/A","N/A","N/A","N/A","N/A","N/A","N/A","N/A","N/A","N/A",null,null,null,null,null,null,null,null,null,null,null,null,null,null,null,null,null,null,null,null,null,null,null,null,null,null,null,"No","N/A","N/A","N/A","N/A","N/A","N/A","N/A","N/A","N/A","N/A","N/A","N/A","N/A","N/A","N/A","N/A","N/A","N/A","N/A","N/A","N/A","N/A","N/A","N/A"]
[null,"DK/missing","N/A","N/A","N/A","N/A","N/A","N/A","N/A","N/A","N/A","N/A","N/A","N/A","N/A","N/A","N/A","N/A","N/A","N/A","N/A","N/A","N/A","N/A","N/A","N/A",null,null,null,null,null,null,null,null,null,null,null,null,null,null,null,null,null,null,null,null,null,null,null,null,null,null,null,"DK/missing","N/A","N/A","N/A","N/A","N/A","N/A","N/A","N/A","N/A","N/A","N/A","N/A","N/A","N/A","N/A","N/A","N/A","N/A","N/A","N/A","N/A","N/A","N/A","N/A"]
["Shared among all sanitation facilities","Yes",71.405108687584601,58.858265774722597,61.636372557951077,42.382798518136042,10.114789230477776,63.184668498285824,63.596788353883937,45.29318257033637,27.164349785423088,4.4510881121683648,79.996638035491557,68.724244296246241,62.942558752933387,57.955805362169365,40.705624039840941,25.713669517091382,65.928659634097372,42.790110694033459,59.099886385102138,65.385219167058878,39.1569485463707,75.697912996682376,28.366248493217022,46.514240840832301,null,null,null,null,null,null,null,null,null,null,null,null,null,null,null,null,null,null,null,null,null,null,null,null,null,null,"Shared among all sanitation facilities","Yes","N/A","N/A","N/A","N/A","N/A","N/A","N/A","N/A","N/A","N/A","N/A","N/A","N/A","N/A","N/A","N/A","N/A","N/A","N/A","N/A","N/A","N/A","N/A","N/A"]
[null,"No",28.594891312415484,41.141734225277233,38.363627442048717,57.617201481863958,89.885210769522089,36.81533150171412,36.403211646116333,54.706817429663971,72.835650214576702,95.548911887831707,20.003361964508482,31.275755703753834,37.057441247066656,42.044194637830671,59.294375960159073,74.286330482908838,34.07134036590265,57.209889305966279,40.900113614898231,34.614780832941427,60.843051453629485,24.302087003317805,71.633751506782801,53.485759159167777,null,null,null,null,null,null,null,null,null,null,null,null,null,null,null,null,null,null,null,null,null,null,null,null,null,null,null,"No","N/A","N/A","N/A","N/A","N/A","N/A","N/A","N/A","N/A","N/A","N/A","N/A","N/A","N/A","N/A","N/A","N/A","N/A","N/A","N/A","N/A","N/A","N/A","N/A"]
["Type of toilet facility","Flush toilet",0.25492144846521064,4.9361850754278809,27.706538338871773,47.826470903005671,66.751367089007047,14.498718372871256,37.73430810939486,51.126373539474692,53.15323049060683,74.663825647230183,3.0163589615098955E-2,0.47417900524475326,0.77248053852688392,2.2816088487364952,8.2803538504373879,5.0465499914755254,33.714487781815535,34.359468907221668,34.246463035419396,37.799951773718391,2.8068863347707178,27.068842833696532,19.678204106480219,45.471762486007826,null,null,null,null,null,null,null,null,null,null,null,null,null,null,null,null,null,null,null,null,null,null,null,null,null,null,"Type of toilet facility","Flush toilet",41.774477999999995,808.12165500000026,4537.8347449999983,7818.0966339999959,10923.756316999963,1467.3209190000007,3819.3807959999981,5156.7284439999894,5394.4434759999958,7552.1164179999987,1.890134,29.567899000000001,48.325369999999992,142.67655800000009,517.13381499999946,159.35966499999995,1975.4520650000004,5249.8615630000058,7571.7450169999956,1556.9513680000007,12.255932999999999,1941.0685029999995,3907.0382720000043,1755.8514429999998]
[null,"Camara s‚ptica",1.6083629270835273,3.2977463053188787,6.5603558701597873,12.623254316436419,16.068693038305369,4.9492820600055127,6.1347079882526181,11.570694130292372,16.956428402735877,14.286524428839115,0.89711645898358527,2.3067469257381314,1.9191262691624207,3.3506823691027261,9.3923067809050984,19.133949171072683,0.53011636124007255,7.0005103942454117,3.3035180582749728,2.0252133951739619,18.073567541780509,0.90669143904859051,18.799745768091501,4.5520021456822217,null,null,null,null,null,null,null,null,null,null,null,null,null,null,null,null,null,null,null,null,null,null,null,null,null,null,null,"Camara s‚ptica",263.56558900000005,539.88660500000015,1074.468793,2063.4978960000017,2629.6163620000052,500.88462399999975,620.94118200000003,1167.0479130000008,1720.8830720000005,1445.0571579999996,56.215800000000002,143.83947700000002,120.058024,209.52926599999998,586.57872899999995,604.21074499999963,31.061408000000004,1069.6239380000002,730.39357000000041,83.417005000000017,78.916067999999953,65.017562999999996,3732.6234560000021,175.77149199999999]
[null,"Pit toilet",27.174394403311368,39.606725741453275,31.471107898755818,27.980771210961819,15.831535233724983,35.266222196967568,27.90499804946575,26.373667302308164,23.519744072828683,10.637961240741785,19.353444737903509,27.67991427609736,36.431663954315049,39.45625998507807,48.910465194016091,62.800574345591286,11.62477146381568,30.385231108186172,17.996147930607563,8.6496159711574858,54.327240071806749,8.4316572035502713,49.492106827785015,24.50191247080987,null,null,null,null,null,null,null,null,null,null,null,null,null,null,null,null,null,null,null,null,null,null,null,null,null,null,null,"Pit toilet",4453.1213359999992,6484.1678880000027,5154.4038140000057,4573.9601750000074,2590.8058600000027,3569.0648119999987,2824.4804000000013,2660.1112289999978,2386.9843620000033,1076.0113220000001,1212.7404060000006,1726.0083230000002,2279.1171460000037,2467.3306160000029,3054.6104569999966,1983.1129200000028,681.13681400000007,4642.6287120000025,3978.8705559999999,356.27112700000009,237.2133870000003,604.62223399999993,9826.4838850000051,946.11943799999983]
[null,"No facility/ bush/ field",70.962321221140002,52.159342877799887,34.261997892212612,11.569503569596112,1.3484046389625104,45.285777370155664,28.225985852887181,10.92926502792487,6.3705970338283988,0.41168868318899349,79.719275213497838,69.539159792919861,60.876729237995697,54.911448797082741,33.416874174641443,13.018926491860691,54.130624393128812,28.254789590346448,44.453870975698308,51.525218859950549,24.792306051642278,63.592808523704768,12.029943297643065,25.47432289750013,null,null,null,null,null,null,null,null,null,null,null,null,null,null,null,null,null,null,null,null,null,null,null,null,null,null,null,"No facility/ bush/ field",11628.734830000003,8539.2046379999956,5611.501608999999,1891.2433889999993,220.6643,4583.0787770000015,2856.9700550000039,1102.3518380000007,646.54255799999987,41.641595999999993,4995.4303999999966,4336.1828140000007,3808.3683899999969,3433.7947600000007,2086.9875779999988,411.11091099999982,3171.7063130000001,4317.1136970000061,9828.558812000023,2122.2847179999981,108.25263499999998,4560.1505170000091,2388.5029660000005,983.66819699999951]
[null,null,null,null,null,null,null,null,null,null,null,null,null,null,null,null,null,null,null,null,null,null,null,null,null,null,null,null,null,null,null,null,null,null,null,null,null,null,null,null,null,null,null,null,null,null,null,null,null,null,null,null,null,"Total",16387.196232999984,16371.380786000012,16378.208961000004,16346.798094000002,16364.842838999986,10120.349132000001,10121.772432999962,10086.239423999979,10148.853468000021,10114.82649399999,6266.2767399999957,6235.5985129999945,6255.8689299999978,6253.3312000000014,6245.3105789999936,3157.7942409999964,5859.3565999999946,15279.22791000006,22109.567954999966,4118.9242179999828,436.63802299999912,7170.8588169999966,19854.648579000052,3861.4105699999973]
[]
[]
[]
[]
[]
[]
[]
[]
[]
[]
[]
[]
[]
[]
[]
[]
[]
[]
[]
[]
[]
[]
[]
[]
[]
[]
[]
[]
[]
[]
[]
[]
[]
[]
[]
[]
[]
[]
[]
[]
[]
[]
[]
[]
[]
[]
[]
[]
[]
[]
[{"$f":"A1026","v":"Bolivia (Plurinational State of)"}]
[{"$f":"A1034","v":"2003"}]
["Access to hygiene facilities "]
[" by wealth quintile and sub-national region"]
["Notes:"]
["WHO/UNICEF JMP customised wealth index excludes water,"]
[" sanitation and hygiene assets."]
["Survey used for analysis:",{"$f":"A1025","v":"DHS03"}]
[]
[]
[]
[]
["Access to handwashing",null,"NATIONAL wealth index quintile",null,null,null,null,"URBAN wealth index quintile",null,null,null,null,"RURAL wealth index quintile",null,null,null,null,"SUB-REGIONS:",null,null,null,null,null,null,null,null,null,null,null,null,null,null,null,null,null,null,null,null,null,null,null,null,null,null,null,null,null,null,null,null,null,null,"Raw numbers of respondents:","Access to handwashing","NATIONAL wealth index quintile",null,null,null,null,"URBAN wealth index quintile",null,null,null,null,"RURAL wealth index quintile",null,null,null,null,"SUB-REGIONS:"]
["Weighted percentage (used in graphs)",null,"Poorest","Poor","Middle","Rich","Richest","Poorest","Poor","Middle","Rich","Richest","Poorest","Poor","Middle","Rich","Richest","Beni","Chuquisaca","Cochabamba","La Paz","Oruro","Pando","Potosi","Santa Cruz","Tarija",null,null,null,null,null,null,null,null,null,null,null,null,null,null,null,null,null,null,null,null,null,null,null,null,null,null,"Hygiene data, raw numbers (weighted)",null,"Poorest","Poor","Middle","Rich","Richest","Poorest","Poor","Middle","Rich","Richest","Poorest","Poor","Middle","Rich","Richest","Beni","Chuquisaca","Cochabamba","La Paz","Oruro","Pando","Potosi","Santa Cruz","Tarija"]
["Hygiene ladder","Basic","N/A","N/A","N/A","N/A","N/A","N/A","N/A","N/A","N/A","N/A","N/A","N/A","N/A","N/A","N/A","N/A","N/A","N/A","N/A","N/A","N/A","N/A","N/A","N/A",null,null,null,null,null,null,null,null,null,null,null,null,null,null,null,null,null,null,null,null,null,null,null,null,null,null,"Hygiene ladder","Basic","N/A","N/A","N/A","N/A","N/A","N/A","N/A","N/A","N/A","N/A","N/A","N/A","N/A","N/A","N/A","N/A","N/A","N/A","N/A","N/A","N/A","N/A","N/A","N/A"]
[null,"Limited","N/A","N/A","N/A","N/A","N/A","N/A","N/A","N/A","N/A","N/A","N/A","N/A","N/A","N/A","N/A","N/A","N/A","N/A","N/A","N/A","N/A","N/A","N/A","N/A",null,null,null,null,null,null,null,null,null,null,null,null,null,null,null,null,null,null,null,null,null,null,null,null,null,null,null,"Limited","N/A","N/A","N/A","N/A","N/A","N/A","N/A","N/A","N/A","N/A","N/A","N/A","N/A","N/A","N/A","N/A","N/A","N/A","N/A","N/A","N/A","N/A","N/A","N/A"]
[null,"No facility","N/A","N/A","N/A","N/A","N/A","N/A","N/A","N/A","N/A","N/A","N/A","N/A","N/A","N/A","N/A","N/A","N/A","N/A","N/A","N/A","N/A","N/A","N/A","N/A",null,null,null,null,null,null,null,null,null,null,null,null,null,null,null,null,null,null,null,null,null,null,null,null,null,null,null,"No facility","N/A","N/A","N/A","N/A","N/A","N/A","N/A","N/A","N/A","N/A","N/A","N/A","N/A","N/A","N/A","N/A","N/A","N/A","N/A","N/A","N/A","N/A","N/A","N/A"]
[null,null,null,null,null,null,null,null,null,null,null,null,null,null,null,null,null,null,null,null,null,null,null,null,null,null,null,null,null,null,null,null,null,null,null,null,null,null,null,null,null,null,null,null,null,null,null,null,null,null,null,null,"Observed handwashing place","Fixed","N/A","N/A","N/A","N/A","N/A","N/A","N/A","N/A","N/A","N/A","N/A","N/A","N/A","N/A","N/A","N/A","N/A","N/A","N/A","N/A","N/A","N/A","N/A","N/A"]
[null,null,null,null,null,null,null,null,null,null,null,null,null,null,null,null,null,null,null,null,null,null,null,null,null,null,null,null,null,null,null,null,null,null,null,null,null,null,null,null,null,null,null,null,null,null,null,null,null,null,null,null,null,"Mobile","N/A","N/A","N/A","N/A","N/A","N/A","N/A","N/A","N/A","N/A","N/A","N/A","N/A","N/A","N/A","N/A","N/A","N/A","N/A","N/A","N/A","N/A","N/A","N/A"]
[null,null,null,null,null,null,null,null,null,null,null,null,null,null,null,null,null,null,null,null,null,null,null,null,null,null,null,null,null,null,null,null,null,null,null,null,null,null,null,null,null,null,null,null,null,null,null,null,null,null,null,null,"Water / Soap","Water and soap","N/A","N/A","N/A","N/A","N/A","N/A","N/A","N/A","N/A","N/A","N/A","N/A","N/A","N/A","N/A","N/A","N/A","N/A","N/A","N/A","N/A","N/A","N/A","N/A"]
[null,null,null,null,null,null,null,null,null,null,null,null,null,null,null,null,null,null,null,null,null,null,null,null,null,null,null,null,null,null,null,null,null,null,null,null,null,null,null,null,null,null,null,null,null,null,null,null,null,null,null,null,null,"Water only","N/A","N/A","N/A","N/A","N/A","N/A","N/A","N/A","N/A","N/A","N/A","N/A","N/A","N/A","N/A","N/A","N/A","N/A","N/A","N/A","N/A","N/A","N/A","N/A"]
[null,null,null,null,null,null,null,null,null,null,null,null,null,null,null,null,null,null,null,null,null,null,null,null,null,null,null,null,null,null,null,null,null,null,null,null,null,null,null,null,null,null,null,null,null,null,null,null,null,null,null,null,null,"Soap only","N/A","N/A","N/A","N/A","N/A","N/A","N/A","N/A","N/A","N/A","N/A","N/A","N/A","N/A","N/A","N/A","N/A","N/A","N/A","N/A","N/A","N/A","N/A","N/A"]
[null,null,null,null,null,null,null,null,null,null,null,null,null,null,null,null,null,null,null,null,null,null,null,null,null,null,null,null,null,null,null,null,null,null,null,null,null,null,null,null,null,null,null,null,null,null,null,null,null,null,null,null,null,"Neither","N/A","N/A","N/A","N/A","N/A","N/A","N/A","N/A","N/A","N/A","N/A","N/A","N/A","N/A","N/A","N/A","N/A","N/A","N/A","N/A","N/A","N/A","N/A","N/A"]
[]
[]
[]
[]
[]
[]
[]
[]
[]
[]
[]
[]
[]
[]
[]
[]
[]
[]
[]
[]
[]
[]
[]
[]
[]
[]
[]
[]
[null,null,null,null,null,null,null,null,null,null,null,null,null,null,null,null,null,null,null,null,null,null,null,null,null,null,null,null,null,null,null,null,null,null,null,null,null,null,null,null,null,null,null,null,null,null,null,null,null,null,null,null,"Raw numbers of respondents:","Menstrual health and hygiene","NATIONAL wealth index quintile",null,null,null,null,"URBAN wealth index quintile",null,null,null,null,"RURAL wealth index quintile",null,null,null,null,"SUB-REGIONS:"]
[null,null,null,null,null,null,null,null,null,null,null,null,null,null,null,null,null,null,null,null,null,null,null,null,null,null,null,null,null,null,null,null,null,null,null,null,null,null,null,null,null,null,null,null,null,null,null,null,null,null,null,null,"MHH data, raw numbers (weighted)",null,"Poorest","Poor","Middle","Rich","Richest","Poorest","Poor","Middle","Rich","Richest","Poorest","Poor","Middle","Rich","Richest","Beni","Chuquisaca","Cochabamba","La Paz","Oruro","Pando","Potosi","Santa Cruz","Tarija"]
[null,null,null,null,null,null,null,null,null,null,null,null,null,null,null,null,null,null,null,null,null,null,null,null,null,null,null,null,null,null,null,null,null,null,null,null,null,null,null,null,null,null,null,null,null,null,null,null,null,null,null,null,"Private place to wash and change","Yes","N/A","N/A","N/A","N/A","N/A","N/A","N/A","N/A","N/A","N/A","N/A","N/A","N/A","N/A","N/A","N/A","N/A","N/A","N/A","N/A","N/A","N/A","N/A","N/A"]
[null,null,null,null,null,null,null,null,null,null,null,null,null,null,null,null,null,null,null,null,null,null,null,null,null,null,null,null,null,null,null,null,null,null,null,null,null,null,null,null,null,null,null,null,null,null,null,null,null,null,null,null,null,"No","N/A","N/A","N/A","N/A","N/A","N/A","N/A","N/A","N/A","N/A","N/A","N/A","N/A","N/A","N/A","N/A","N/A","N/A","N/A","N/A","N/A","N/A","N/A","N/A"]
[null,null,null,null,null,null,null,null,null,null,null,null,null,null,null,null,null,null,null,null,null,null,null,null,null,null,null,null,null,null,null,null,null,null,null,null,null,null,null,null,null,null,null,null,null,null,null,null,null,null,null,null,null,"DK/not sure/missing","N/A","N/A","N/A","N/A","N/A","N/A","N/A","N/A","N/A","N/A","N/A","N/A","N/A","N/A","N/A","N/A","N/A","N/A","N/A","N/A","N/A","N/A","N/A","N/A"]
[null,null,null,null,null,null,null,null,null,null,null,null,null,null,null,null,null,null,null,null,null,null,null,null,null,null,null,null,null,null,null,null,null,null,null,null,null,null,null,null,null,null,null,null,null,null,null,null,null,null,null,null,"Use of menstrual materials","Materials reusable","N/A","N/A","N/A","N/A","N/A","N/A","N/A","N/A","N/A","N/A","N/A","N/A","N/A","N/A","N/A","N/A","N/A","N/A","N/A","N/A","N/A","N/A","N/A","N/A"]
[null,null,null,null,null,null,null,null,null,null,null,null,null,null,null,null,null,null,null,null,null,null,null,null,null,null,null,null,null,null,null,null,null,null,null,null,null,null,null,null,null,null,null,null,null,null,null,null,null,null,null,null,null,"Materials not reusable","N/A","N/A","N/A","N/A","N/A","N/A","N/A","N/A","N/A","N/A","N/A","N/A","N/A","N/A","N/A","N/A","N/A","N/A","N/A","N/A","N/A","N/A","N/A","N/A"]
[null,null,null,null,null,null,null,null,null,null,null,null,null,null,null,null,null,null,null,null,null,null,null,null,null,null,null,null,null,null,null,null,null,null,null,null,null,null,null,null,null,null,null,null,null,null,null,null,null,null,null,null,null,"No materials used","N/A","N/A","N/A","N/A","N/A","N/A","N/A","N/A","N/A","N/A","N/A","N/A","N/A","N/A","N/A","N/A","N/A","N/A","N/A","N/A","N/A","N/A","N/A","N/A"]
[null,null,null,null,null,null,null,null,null,null,null,null,null,null,null,null,null,null,null,null,null,null,null,null,null,null,null,null,null,null,null,null,null,null,null,null,null,null,null,null,null,null,null,null,null,null,null,null,null,null,null,null,null,"DK/not sure/missing","N/A","N/A","N/A","N/A","N/A","N/A","N/A","N/A","N/A","N/A","N/A","N/A","N/A","N/A","N/A","N/A","N/A","N/A","N/A","N/A","N/A","N/A","N/A","N/A"]
[null,null,null,null,null,null,null,null,null,null,null,null,null,null,null,null,null,null,null,null,null,null,null,null,null,null,null,null,null,null,null,null,null,null,null,null,null,null,null,null,null,null,null,null,null,null,null,null,null,null,null,null,"Use of menstrual materials with private place to wash and change","Materials reusable","N/A","N/A","N/A","N/A","N/A","N/A","N/A","N/A","N/A","N/A","N/A","N/A","N/A","N/A","N/A","N/A","N/A","N/A","N/A","N/A","N/A","N/A","N/A","N/A"]
[null,null,null,null,null,null,null,null,null,null,null,null,null,null,null,null,null,null,null,null,null,null,null,null,null,null,null,null,null,null,null,null,null,null,null,null,null,null,null,null,null,null,null,null,null,null,null,null,null,null,null,null,null,"Materials not reusable","N/A","N/A","N/A","N/A","N/A","N/A","N/A","N/A","N/A","N/A","N/A","N/A","N/A","N/A","N/A","N/A","N/A","N/A","N/A","N/A","N/A","N/A","N/A","N/A"]
[null,null,null,null,null,null,null,null,null,null,null,null,null,null,null,null,null,null,null,null,null,null,null,null,null,null,null,null,null,null,null,null,null,null,null,null,null,null,null,null,null,null,null,null,null,null,null,null,null,null,null,null,null,"No materials used","N/A","N/A","N/A","N/A","N/A","N/A","N/A","N/A","N/A","N/A","N/A","N/A","N/A","N/A","N/A","N/A","N/A","N/A","N/A","N/A","N/A","N/A","N/A","N/A"]
[null,null,null,null,null,null,null,null,null,null,null,null,null,null,null,null,null,null,null,null,null,null,null,null,null,null,null,null,null,null,null,null,null,null,null,null,null,null,null,null,null,null,null,null,null,null,null,null,null,null,null,null,"Awareness of menstruation before menarche","Yes","N/A","N/A","N/A","N/A","N/A","N/A","N/A","N/A","N/A","N/A","N/A","N/A","N/A","N/A","N/A","N/A","N/A","N/A","N/A","N/A","N/A","N/A","N/A","N/A"]
[null,null,null,null,null,null,null,null,null,null,null,null,null,null,null,null,null,null,null,null,null,null,null,null,null,null,null,null,null,null,null,null,null,null,null,null,null,null,null,null,null,null,null,null,null,null,null,null,null,null,null,null,null,"No","N/A","N/A","N/A","N/A","N/A","N/A","N/A","N/A","N/A","N/A","N/A","N/A","N/A","N/A","N/A","N/A","N/A","N/A","N/A","N/A","N/A","N/A","N/A","N/A"]
[null,null,null,null,null,null,null,null,null,null,null,null,null,null,null,null,null,null,null,null,null,null,null,null,null,null,null,null,null,null,null,null,null,null,null,null,null,null,null,null,null,null,null,null,null,null,null,null,null,null,null,null,null,"DK/not sure/missing","N/A","N/A","N/A","N/A","N/A","N/A","N/A","N/A","N/A","N/A","N/A","N/A","N/A","N/A","N/A","N/A","N/A","N/A","N/A","N/A","N/A","N/A","N/A","N/A"]
[null,null,null,null,null,null,null,null,null,null,null,null,null,null,null,null,null,null,null,null,null,null,null,null,null,null,null,null,null,null,null,null,null,null,null,null,null,null,null,null,null,null,null,null,null,null,null,null,null,null,null,null,"Participation in (all) activities during menstruation","Yes","N/A","N/A","N/A","N/A","N/A","N/A","N/A","N/A","N/A","N/A","N/A","N/A","N/A","N/A","N/A","N/A","N/A","N/A","N/A","N/A","N/A","N/A","N/A","N/A"]
[null,null,null,null,null,null,null,null,null,null,null,null,null,null,null,null,null,null,null,null,null,null,null,null,null,null,null,null,null,null,null,null,null,null,null,null,null,null,null,null,null,null,null,null,null,null,null,null,null,null,null,null,null,"No","N/A","N/A","N/A","N/A","N/A","N/A","N/A","N/A","N/A","N/A","N/A","N/A","N/A","N/A","N/A","N/A","N/A","N/A","N/A","N/A","N/A","N/A","N/A","N/A"]
[null,null,null,null,null,null,null,null,null,null,null,null,null,null,null,null,null,null,null,null,null,null,null,null,null,null,null,null,null,null,null,null,null,null,null,null,null,null,null,null,null,null,null,null,null,null,null,null,null,null,null,null,null,"DK/not sure/missing/no such activity","N/A","N/A","N/A","N/A","N/A","N/A","N/A","N/A","N/A","N/A","N/A","N/A","N/A","N/A","N/A","N/A","N/A","N/A","N/A","N/A","N/A","N/A","N/A","N/A"]
[null,null,null,null,null,null,null,null,null,null,null,null,null,null,null,null,null,null,null,null,null,null,null,null,null,null,null,null,null,null,null,null,null,null,null,null,null,null,null,null,null,null,null,null,null,null,null,null,null,null,null,null,"Participation in specific activities during menstruation","Did not go to school (amongst those usually attending school)","N/A","N/A","N/A","N/A","N/A","N/A","N/A","N/A","N/A","N/A","N/A","N/A","N/A","N/A","N/A","N/A","N/A","N/A","N/A","N/A","N/A","N/A","N/A","N/A"]
[null,null,null,null,null,null,null,null,null,null,null,null,null,null,null,null,null,null,null,null,null,null,null,null,null,null,null,null,null,null,null,null,null,null,null,null,null,null,null,null,null,null,null,null,null,null,null,null,null,null,null,null,null,"Did not go to work (amongst those who usually work)","N/A","N/A","N/A","N/A","N/A","N/A","N/A","N/A","N/A","N/A","N/A","N/A","N/A","N/A","N/A","N/A","N/A","N/A","N/A","N/A","N/A","N/A","N/A","N/A"]
[null,null,null,null,null,null,null,null,null,null,null,null,null,null,null,null,null,null,null,null,null,null,null,null,null,null,null,null,null,null,null,null,null,null,null,null,null,null,null,null,null,null,null,null,null,null,null,null,null,null,null,null,null,"Did not participate in social activities","N/A","N/A","N/A","N/A","N/A","N/A","N/A","N/A","N/A","N/A","N/A","N/A","N/A","N/A","N/A","N/A","N/A","N/A","N/A","N/A","N/A","N/A","N/A","N/A"]
[null,null,null,null,null,null,null,null,null,null,null,null,null,null,null,null,null,null,null,null,null,null,null,null,null,null,null,null,null,null,null,null,null,null,null,null,null,null,null,null,null,null,null,null,null,null,null,null,null,null,null,null,null,"Did not cook food","N/A","N/A","N/A","N/A","N/A","N/A","N/A","N/A","N/A","N/A","N/A","N/A","N/A","N/A","N/A","N/A","N/A","N/A","N/A","N/A","N/A","N/A","N/A","N/A"]
[null,null,null,null,null,null,null,null,null,null,null,null,null,null,null,null,null,null,null,null,null,null,null,null,null,null,null,null,null,null,null,null,null,null,null,null,null,null,null,null,null,null,null,null,null,null,null,null,null,null,null,null,null,"Did not eat with others","N/A","N/A","N/A","N/A","N/A","N/A","N/A","N/A","N/A","N/A","N/A","N/A","N/A","N/A","N/A","N/A","N/A","N/A","N/A","N/A","N/A","N/A","N/A","N/A"]
[null,null,null,null,null,null,null,null,null,null,null,null,null,null,null,null,null,null,null,null,null,null,null,null,null,null,null,null,null,null,null,null,null,null,null,null,null,null,null,null,null,null,null,null,null,null,null,null,null,null,null,null,null,"Did not bathe in regular place","N/A","N/A","N/A","N/A","N/A","N/A","N/A","N/A","N/A","N/A","N/A","N/A","N/A","N/A","N/A","N/A","N/A","N/A","N/A","N/A","N/A","N/A","N/A","N/A"]
[null,null,null,null,null,null,null,null,null,null,null,null,null,null,null,null,null,null,null,null,null,null,null,null,null,null,null,null,null,null,null,null,null,null,null,null,null,null,null,null,null,null,null,null,null,null,null,null,null,null,null,null,null,"Did not participate in other activities","N/A","N/A","N/A","N/A","N/A","N/A","N/A","N/A","N/A","N/A","N/A","N/A","N/A","N/A","N/A","N/A","N/A","N/A","N/A","N/A","N/A","N/A","N/A","N/A"]
[null,null,null,null,null,null,null,null,null,null,null,null,null,null,null,null,null,null,null,null,null,null,null,null,null,null,null,null,null,null,null,null,null,null,null,null,null,null,null,null,null,null,null,null,null,null,null,null,null,null,null,null,null,"DK/not sure/missing/no such activity","N/A","N/A","N/A","N/A","N/A","N/A","N/A","N/A","N/A","N/A","N/A","N/A","N/A","N/A","N/A","N/A","N/A","N/A","N/A","N/A","N/A","N/A","N/A","N/A"]
[]
[]
[]
[]
[]
[]
[]
[]
[]
[]
[]
[]
[]
[]
[]
[]
[]
[]
[]
[]
[]
[]
[]
[]
[]
[]
[]
[]
[]
[]
[]
[]
[]
[]
[]
[]
[]
[]
[]
[]
[]
[]
[]
[]
[]
[]
[]
[]
[]
[]
[]
[]
[]
[]
[null,null,null,null,null,null,null,null,null,null,null,null,null,null,null,null,null,null,null,null,null,null,null,null,null,null,null,null,null,null,null,null,null,null,null,null,null,null,null,null,null,null,null,null,null,null,null,null,null,null,null,null,"Raw numbers of respondents:","Basic water, sanitation and hygiene","NATIONAL wealth index quintile",null,null,null,null,"URBAN wealth index quintile",null,null,null,null,"RURAL wealth index quintile",null,null,null,null,"SUB-REGIONS:"]
[null,null,null,null,null,null,null,null,null,null,null,null,null,null,null,null,null,null,null,null,null,null,null,null,null,null,null,null,null,null,null,null,null,null,null,null,null,null,null,null,null,null,null,null,null,null,null,null,null,null,null,null,"WatSan data, raw numbers (weighted)",null,"Poorest","Poor","Middle","Rich","Richest","Poorest","Poor","Middle","Rich","Richest","Poorest","Poor","Middle","Rich","Richest","Beni","Chuquisaca","Cochabamba","La Paz","Oruro","Pando","Potosi","Santa Cruz","Tarija"]
[null,null,null,null,null,null,null,null,null,null,null,null,null,null,null,null,null,null,null,null,null,null,null,null,null,null,null,null,null,null,null,null,null,null,null,null,null,null,null,null,null,null,null,null,null,null,null,null,null,null,null,null,"Use of Basic Water Sanitation and Hygiene","Yes","N/A","N/A","N/A","N/A","N/A","N/A","N/A","N/A","N/A","N/A","N/A","N/A","N/A","N/A","N/A","N/A","N/A","N/A","N/A","N/A","N/A","N/A","N/A","N/A"]
[null,null,null,null,null,null,null,null,null,null,null,null,null,null,null,null,null,null,null,null,null,null,null,null,null,null,null,null,null,null,null,null,null,null,null,null,null,null,null,null,null,null,null,null,null,null,null,null,null,null,null,null,null,"No","N/A","N/A","N/A","N/A","N/A","N/A","N/A","N/A","N/A","N/A","N/A","N/A","N/A","N/A","N/A","N/A","N/A","N/A","N/A","N/A","N/A","N/A","N/A","N/A"]
[null,null,null,null,null,null,null,null,null,null,null,null,null,null,null,null,null,null,null,null,null,null,null,null,null,null,null,null,null,null,null,null,null,null,null,null,null,null,null,null,null,null,null,null,null,null,null,null,null,null,null,null,"Use of Basic Water and Sanitation","Yes","N/A","N/A","N/A","N/A","N/A","N/A","N/A","N/A","N/A","N/A","N/A","N/A","N/A","N/A","N/A","N/A","N/A","N/A","N/A","N/A","N/A","N/A","N/A","N/A"]
[null,null,null,null,null,null,null,null,null,null,null,null,null,null,null,null,null,null,null,null,null,null,null,null,null,null,null,null,null,null,null,null,null,null,null,null,null,null,null,null,null,null,null,null,null,null,null,null,null,null,null,null,null,"No","N/A","N/A","N/A","N/A","N/A","N/A","N/A","N/A","N/A","N/A","N/A","N/A","N/A","N/A","N/A","N/A","N/A","N/A","N/A","N/A","N/A","N/A","N/A","N/A"]
[null,null,null,null,null,null,null,null,null,null,null,null,null,null,null,null,null,null,null,null,null,null,null,null,null,null,null,null,null,null,null,null,null,null,null,null,null,null,null,null,null,null,null,null,null,null,null,null,null,null,null,null,"Use of Basic Water and Hygiene","Yes","N/A","N/A","N/A","N/A","N/A","N/A","N/A","N/A","N/A","N/A","N/A","N/A","N/A","N/A","N/A","N/A","N/A","N/A","N/A","N/A","N/A","N/A","N/A","N/A"]
[null,null,null,null,null,null,null,null,null,null,null,null,null,null,null,null,null,null,null,null,null,null,null,null,null,null,null,null,null,null,null,null,null,null,null,null,null,null,null,null,null,null,null,null,null,null,null,null,null,null,null,null,null,"No","N/A","N/A","N/A","N/A","N/A","N/A","N/A","N/A","N/A","N/A","N/A","N/A","N/A","N/A","N/A","N/A","N/A","N/A","N/A","N/A","N/A","N/A","N/A","N/A"]
[null,null,null,null,null,null,null,null,null,null,null,null,null,null,null,null,null,null,null,null,null,null,null,null,null,null,null,null,null,null,null,null,null,null,null,null,null,null,null,null,null,null,null,null,null,null,null,null,null,null,null,null,"Use of Basic Sanitation and Hygiene","Yes","N/A","N/A","N/A","N/A","N/A","N/A","N/A","N/A","N/A","N/A","N/A","N/A","N/A","N/A","N/A","N/A","N/A","N/A","N/A","N/A","N/A","N/A","N/A","N/A"]
[null,null,null,null,null,null,null,null,null,null,null,null,null,null,null,null,null,null,null,null,null,null,null,null,null,null,null,null,null,null,null,null,null,null,null,null,null,null,null,null,null,null,null,null,null,null,null,null,null,null,null,null,null,"No","N/A","N/A","N/A","N/A","N/A","N/A","N/A","N/A","N/A","N/A","N/A","N/A","N/A","N/A","N/A","N/A","N/A","N/A","N/A","N/A","N/A","N/A","N/A","N/A"]
[null,null,null,null,null,null,null,null,null,null,null,null,null,null,null,null,null,null,null,null,null,null,null,null,null,null,null,null,null,null,null,null,null,null,null,null,null,null,null,null,null,null,null,null,null,null,null,null,null,null,null,null,"Use of Basic Water","Yes","N/A","N/A","N/A","N/A","N/A","N/A","N/A","N/A","N/A","N/A","N/A","N/A","N/A","N/A","N/A","N/A","N/A","N/A","N/A","N/A","N/A","N/A","N/A","N/A"]
[null,null,null,null,null,null,null,null,null,null,null,null,null,null,null,null,null,null,null,null,null,null,null,null,null,null,null,null,null,null,null,null,null,null,null,null,null,null,null,null,null,null,null,null,null,null,null,null,null,null,null,null,null,"No","N/A","N/A","N/A","N/A","N/A","N/A","N/A","N/A","N/A","N/A","N/A","N/A","N/A","N/A","N/A","N/A","N/A","N/A","N/A","N/A","N/A","N/A","N/A","N/A"]
[null,null,null,null,null,null,null,null,null,null,null,null,null,null,null,null,null,null,null,null,null,null,null,null,null,null,null,null,null,null,null,null,null,null,null,null,null,null,null,null,null,null,null,null,null,null,null,null,null,null,null,null,"Use of Basic Sanitation","Yes","N/A","N/A","N/A","N/A","N/A","N/A","N/A","N/A","N/A","N/A","N/A","N/A","N/A","N/A","N/A","N/A","N/A","N/A","N/A","N/A","N/A","N/A","N/A","N/A"]
[null,null,null,null,null,null,null,null,null,null,null,null,null,null,null,null,null,null,null,null,null,null,null,null,null,null,null,null,null,null,null,null,null,null,null,null,null,null,null,null,null,null,null,null,null,null,null,null,null,null,null,null,null,"No","N/A","N/A","N/A","N/A","N/A","N/A","N/A","N/A","N/A","N/A","N/A","N/A","N/A","N/A","N/A","N/A","N/A","N/A","N/A","N/A","N/A","N/A","N/A","N/A"]
[null,null,null,null,null,null,null,null,null,null,null,null,null,null,null,null,null,null,null,null,null,null,null,null,null,null,null,null,null,null,null,null,null,null,null,null,null,null,null,null,null,null,null,null,null,null,null,null,null,null,null,null,"Access to Basic Hygiene","Yes","N/A","N/A","N/A","N/A","N/A","N/A","N/A","N/A","N/A","N/A","N/A","N/A","N/A","N/A","N/A","N/A","N/A","N/A","N/A","N/A","N/A","N/A","N/A","N/A"]
[null,null,null,null,null,null,null,null,null,null,null,null,null,null,null,null,null,null,null,null,null,null,null,null,null,null,null,null,null,null,null,null,null,null,null,null,null,null,null,null,null,null,null,null,null,null,null,null,null,null,null,null,null,"No","N/A","N/A","N/A","N/A","N/A","N/A","N/A","N/A","N/A","N/A","N/A","N/A","N/A","N/A","N/A","N/A","N/A","N/A","N/A","N/A","N/A","N/A","N/A","N/A"]
[]
[]
[]
[]
[]
[]
[]
[]
[]
[]
[]
[]
[]
[]
[]
[]
[]
[]
[]
[]
[]
[]
[]
[]
[]
[]
[]
[]
[]
[]
[]
[]
[]
[]
[]
[]
[]
[]
[]
[]
[]
[]
[]
[]
[null,null,"INITIAL (national) Wealth Index",null,null,null,null,"URBAN Wealth Index",null,null,null,null,"RURAL Wealth Index"]
[null,null,"Component Matrix",null,null,null,null,"Component Matrix",null,null,null,null,"Component Matrix"]
[null,null,null,null,"Component",null,null,null,null,"Component",null,null,null,null,"Component"]
[null,"Note:\n\nThe INITIAL (national) Wealth Index is based on the first component of the Principal Component Analysis (PCA) which has been obtained at national level.\n\nThe final national-level (NATIONAL) Wealth Index is based on the URBAN and RURAL specific wealth indexes. Regression procedures are used to establish the relationships between the two sets of scores (urban and rural) and the initial (national) wealth factors.\nThis allows best use of the available information for each area and a better precision of the FINAL (NATIONAL) Wealth Index.\n\nFor dependency reasons, all WASH variables (contained in the generic MICS and DHS scripts) have been excluded from the sets of asset variables used in the PCAs.\n\nThe PCA can extracts as many components as there are asset variables in the input. Only the first of the components is used to represent the Wealth Index. \n\nThe scores represent the weights of the asset variables on the Wealth Index (correlations between the variables and the component).\n\nThe communalities are the proportion of each variable's variance that can be explained by the component.\n\nProportion of explained variance is the part of the model's total variance that is explained by the component.\n\nFor more information on the procedure used:\n\nThe DHS Wealth Index, DHS Comparative Reports No. 6, Shea Oscar Rutstein, Kiersten Johnson, ORC Macro International Inc., 2004.\n\nThe DHS Wealth Index: Approaches for Rural and Urban Areas, Shea O. Rutstein, ORC Macro International Inc., 2008.\n\nMICS Methodological Paper No. 4, Review of options for reporting water, sanitation and hygiene coverage by wealth quintile, UNICEF, 2016.",null,null,"1",null,null,null,null,"1",null,null,null,null,"1"]
[null,null,"LPG, natural gas for cooking",null,0.76030917265274467,null,null,"Has refrigerator",null,0.69322232418701923,null,null,"Earth, mud, dung floor",null,-0.74023111927389806]
[null,null,"Has television",null,0.75300474262695216,null,null,"Has telephone",null,0.64898613235834823,null,null,"LPG, natural gas for cooking",null,0.72031599252757339]
[null,null,"Wood, straw for cooking",null,-0.74993408405077278,null,null,"Number of rooms excluding kitchen and bathrooms",null,0.58926004085092176,null,null,"Has television",null,0.69079387927278346]
[null,null,"Earth, mud, dung floor",null,-0.72672156993506565,null,null,"Has television",null,0.53923566392563937,null,null,"Wood, straw for cooking",null,-0.67073174306022487]
[null,null,"Has electricity",null,0.71819616970116695,null,null,"Computer",null,0.53381085200534317,null,null,"Has electricity",null,0.66996075752340611]
[null,null,"Has refrigerator",null,0.67940485835849251,null,null,"Earth, mud, dung floor",null,-0.52567732373121634,null,null,"Palm tree roof",null,-0.56714744177815424]
[null,null,"Blocks/brick walls",null,0.63458904059882859,null,null,"Blocks/brick walls",null,0.52521841153658044,null,null,"Concrete, cement floor",null,0.56370401010928506]
[null,null,"Has telephone",null,0.59998123499993172,null,null,"Cellular phone",null,0.50845485633009735,null,null,"Has refrigerator",null,0.56352492639298224]
[null,null,"Palm tree roof",null,-0.57487184673394509,null,null,"Has car/truck",null,0.49956599669877821,null,null,"Blocks/brick walls",null,0.49059545697824525]
[null,null,"Cellular phone",null,0.54716088084656145,null,null,"Wood, straw for cooking",null,-0.49145384898006972,null,null,"Cellular phone",null,0.39040407202357058]
[null,null,"Solid waste collected by contractors",null,0.50375370325800251,null,null,"LPG, natural gas for cooking",null,0.48948072257892805,null,null,"Solid waste collected by town council",null,0.37184213939768146]
[null,null,"Solid waste thrown in street",null,-0.488292136300784,null,null,"Terrazo, ceramic tile floor",null,0.47145876144319304,null,null,"Has car/truck",null,0.3373314289740254]
[null,null,"Computer",null,0.45681907188134097,null,null,"Has electricity",null,0.46561280165054347,null,null,"Zinc roof",null,0.32834555883700284]
[null,null,"Has car/truck",null,0.43337231406798971,null,null,"memsleep",null,-0.41074047738463376,null,null,"Has telephone",null,0.31132483492947416]
[null,null,"Adobe walls",null,-0.4313627380604893,null,null,"Has an exclusively room for kitchen",null,0.3804995733314927,null,null,"Terrazo, ceramic tile floor",null,0.26754931175914448]
[null,null,"Terrazo, ceramic tile floor",null,0.41839389995870579,null,null,"Adobe walls",null,-0.36014340092494679,null,null,"Number of rooms excluding kitchen and bathrooms",null,0.25942933580010757]
[null,null,"Number of rooms excluding kitchen and bathrooms",null,0.37066756004298429,null,null,"Electric water pump",null,0.3319096756660242,null,null,"Has radio",null,0.25865321253027995]
[null,null,"Solid waste collected by town council",null,0.33448349749523187,null,null,"Solid waste thrown in street",null,-0.32679307826223158,null,null,"Ceramic tile roof",null,0.2473377387361492]
[null,null,"memsleep",null,-0.33391401319639835,null,null,"Solid waste collected by contractors",null,0.32424434359679655,null,null,"Solid waste thrown in street",null,-0.23829596476411766]
[null,null,"Has radio",null,0.30594125184944898,null,null,"Has radio",null,0.3072942843669571,null,null,"Electric water pump",null,0.23000904638909303]
[null,null,"Concrete, cement floor",null,0.29991535907175443,null,null,"Palm tree roof",null,-0.30374553620126615,null,null,"memsleep",null,-0.22934059236417115]
[null,null,"Electric water pump",null,0.27179857754254039,null,null,"Solid waste burnt",null,-0.29191469413681126,null,null,"Has bicycle",null,0.22165529880990262]
[null,null,"Solid waste burnt",null,-0.26559511823690701,null,null,"Ceramic tile roof",null,0.25140853757168741,null,null,"Adobe walls",null,-0.20123446149178165]
[null,null,"Parquet, wood tile floor",null,0.26273407957536471,null,null,"Finished wood walls",null,-0.24669101052083661,null,null,"Asphalt strips for floor",null,0.18316737653052581]
[null,null,"Ceramic tile roof",null,0.23954430063464635,null,null,"Parquet, wood tile floor",null,0.21225666593765982,null,null,"Solid waste collected by contractors",null,0.18206446140530561]
[null,null,"Cement roof",null,0.20982019462237714,null,null,"Has bicycle",null,0.2087293141423002,null,null,"Computer",null,0.17446501705540179]
[null,null,"Solid waste thrown in yard",null,-0.19849765640140202,null,null,"Has motorcycle/scooter",null,0.20298145410243595,null,null,"Has motorcycle/scooter",null,0.16425103717631967]
[null,null,"Has motorcycle/scooter",null,0.19813298239963126,null,null,"Zinc roof",null,-0.20109664033353317,null,null,"Parquet, wood tile floor",null,0.15413731580501899]
[null,null,"Finished wood walls",null,-0.16514430642129499,null,null,"Cement roof",null,0.17044573777841718,null,null,"Cement roof",null,0.12899099570947953]
[null,null,"Has an exclusively room for kitchen",null,0.1538542045902086,null,null,"Tabique/Chinche walls",null,-0.16047579293898315,null,null,"Palm tree walls",null,-0.11859814013545882]
[null,null,"Tabique/Chinche walls",null,-0.14504714936878765,null,null,"Does not cook",null,-0.13598998282596611,null,null,"Stone walls",null,-0.10772041059326987]
[null,null,"Dung for cooking",null,-0.14077746063219579,null,null,"Other roof materials",null,-0.12094162880277727,null,null,"Tabique/Chinche walls",null,-0.10694808146490663]
[null,null,"Has bicycle",null,0.14008759085103137,null,null,"Palm tree walls",null,-0.11183723291813874,null,null,"Solid waste thrown in yard",null,-0.10307092368883007]
[null,null,"Zinc roof",null,0.13099450343483446,null,null,"Asphalt strips for floor",null,-0.10950623965647191,null,null,"Solid waste collected by private company",null,8.5604379700394001E-2]
[null,null,"Palm tree walls",null,-0.12218626550969587,null,null,"Other wall materials",null,-8.9367957439471291E-2,null,null,"Rudimentary wood plank floor",null,8.1913895840894105E-2]
[null,null,"Stone walls",null,-0.11415322299179281,null,null,"Solid waste other disposal",null,-8.857404799020574E-2,null,null,"Solid waste burnt",null,7.6307974405342108E-2]
[null,null,"Solid waste other disposal",null,-0.10582035484554554,null,null,"Solid waste thrown in yard",null,-8.074922919122339E-2,null,null,"Does not cook",null,6.4453302217177696E-2]
[null,null,"Electricity for cooking",null,7.4918291092014908E-2,null,null,"Kerosene for cooking",null,-7.7078877082687042E-2,null,null,"Has an exclusively room for kitchen",null,6.0037597939073255E-2]
[null,null,"Other wall materials",null,-7.0655456998608729E-2,null,null,"Dung for cooking",null,-7.1853956103234404E-2,null,null,"Dung for cooking",null,-5.2779816595553149E-2]
[null,null,"Other roof materials",null,-6.9808931011885691E-2,null,null,"Electricity for cooking",null,6.9363183455069324E-2,null,null,"Finished wood walls",null,-4.7055389162509544E-2]
[null,null,"Carpeted floor",null,6.7684995296388092E-2,null,null,"Solid waste collected by town council",null,6.7714331313000475E-2,null,null,"Other wall materials",null,-4.2385800194436558E-2]
[null,null,"Solid waste collected by private company",null,5.7094828649784497E-2,null,null,"Carpeted floor",null,6.6800445231631547E-2,null,null,"Other roof materials",null,-3.3929589958742734E-2]
[null,null,"Rudimentary wood plank floor",null,-3.5377347309896813E-2,null,null,"Rudimentary wood plank floor",null,-6.6562644616961528E-2,null,null,"Carpeted floor",null,2.2178346909805902E-2]
[null,null,"Other type of flooring",null,-3.1407679725621959E-2,null,null,"Solid waste collected by private company",null,5.8150990087683346E-2,null,null,"Other type of flooring",null,-1.8088022784287512E-2]
[null,null,"Kerosene for cooking",null,-1.9999728431637862E-2,null,null,"Other type of flooring",null,-4.0474925666037852E-2,null,null,"Electricity for cooking",null,1.0632425096892731E-2]
[null,null,"Asphalt strips for floor",null,1.4838348197642735E-2,null,null,"Concrete, cement floor",null,-3.3296390155098006E-2,null,null,"Other fuel for cooking",null,-9.8508444372006187E-3]
[null,null,"Does not cook",null,-1.1590678821225893E-2,null,null,"Stone walls",null,-2.5804658735466415E-2,null,null,"Kerosene for cooking",null,5.450648227379621E-3]
[null,null,"Other fuel for cooking",null,-6.5563739732077877E-3,null,null,"Other fuel for cooking",null,-1.0477076138846776E-2,null,null,"Solid waste other disposal",null,1.3237815638637185E-3]
[]
[]
[]
[null,null,"Communalities",null,null,null,null,"Communalities",null,null,null,null,"Communalities"]
[null,null,null,null,"Extraction",null,null,null,null,"Extraction",null,null,null,null,"Extraction"]
[null,null,"Has electricity",null,0.51580573817342745,null,null,"Has electricity",null,0.21679528106086834,null,null,"Has electricity",null,0.44884741662133615]
[null,null,"Has radio",null,9.3600049583207973E-2,null,null,"Has radio",null,9.4429777204600301E-2,null,null,"Has radio",null,6.690148435223417E-2]
[null,null,"Has television",null,0.56701614241868248,null,null,"Has television",null,0.2907751012493251,null,null,"Has television",null,0.47719618364074096]
[null,null,"Has refrigerator",null,0.46159096156112328,null,null,"Has refrigerator",null,0.48055719075125281,null,null,"Has refrigerator",null,0.31756034266621608]
[null,null,"Has bicycle",null,1.9624533110445968E-2,null,null,"Has bicycle",null,4.3567926582315043E-2,null,null,"Has bicycle",null,4.9131071490507217E-2]
[null,null,"Has motorcycle/scooter",null,3.9256678714572592E-2,null,null,"Has motorcycle/scooter",null,4.1201470709539313E-2,null,null,"Has motorcycle/scooter",null,2.6978403213496746E-2]
[null,null,"Has car/truck",null,0.1878115626006443,null,null,"Has car/truck",null,0.24956618505764369,null,null,"Has car/truck",null,0.11379249297365794]
[null,null,"Has telephone",null,0.3599774823520433,null,null,"Has telephone",null,0.42118299999344749,null,null,"Has telephone",null,9.6923152843864338E-2]
[null,null,"Has an exclusively room for kitchen",null,2.3671116270085765E-2,null,null,"Has an exclusively room for kitchen",null,0.144779925305448,null,null,"Has an exclusively room for kitchen",null,3.6045131662938131E-3]
[null,null,"Number of rooms excluding kitchen and bathrooms",null,0.13739444006821935,null,null,"Number of rooms excluding kitchen and bathrooms",null,0.34722739574362999,null,null,"Number of rooms excluding kitchen and bathrooms",null,6.7303580273684979E-2]
[null,null,"Cellular phone",null,0.29938502952878504,null,null,"Cellular phone",null,0.25852634092565996,null,null,"Cellular phone",null,0.15241533945258529]
[null,null,"Computer",null,0.20868366443452976,null,null,"Computer",null,0.2849540257186704,null,null,"Computer",null,3.0438042176141638E-2]
[null,null,"Electric water pump",null,7.3874466754148341E-2,null,null,"Electric water pump",null,0.11016403280072537,null,null,"Electric water pump",null,5.2904161420819946E-2]
[null,null,"memsleep",null,0.1114985682089245,null,null,"memsleep",null,0.16870773976215683,null,null,"memsleep",null,5.2597107305948916E-2]
[null,null,"Earth, mud, dung floor",null,0.52812424020888649,null,null,"Earth, mud, dung floor",null,0.27633664868521401,null,null,"Earth, mud, dung floor",null,0.54794210994148795]
[null,null,"Rudimentary wood plank floor",null,1.2515567026850634E-3,null,null,"Rudimentary wood plank floor",null,4.4305856584039172E-3,null,null,"Rudimentary wood plank floor",null,6.7098863318328485E-3]
[null,null,"Concrete, cement floor",null,8.994922260713939E-2,null,null,"Concrete, cement floor",null,1.1086495973605074E-3,null,null,"Concrete, cement floor",null,0.31776221101328894]
[null,null,"Terrazo, ceramic tile floor",null,0.17505345552265553,null,null,"Terrazo, ceramic tile floor",null,0.2222733637415496,null,null,"Terrazo, ceramic tile floor",null,7.1582634222791888E-2]
[null,null,"Parquet, wood tile floor",null,6.9029196570314075E-2,null,null,"Parquet, wood tile floor",null,4.5052892234971317E-2,null,null,"Parquet, wood tile floor",null,2.3758312123576156E-2]
[null,null,"Asphalt strips for floor",null,2.2017657723448741E-4,null,null,"Asphalt strips for floor",null,1.1991616523700661E-2,null,null,"Asphalt strips for floor",null,3.3550287825075416E-2]
[null,null,"Carpeted floor",null,4.5812585882720781E-3,null,null,"Carpeted floor",null,4.4622994831442055E-3,null,null,"Carpeted floor",null,4.9187907165169702E-4]
[null,null,"Other type of flooring",null,9.8644234574724477E-4,null,null,"Other type of flooring",null,1.6382196076712896E-3,null,null,"Other type of flooring",null,3.2717656824490419E-4]
[null,null,"Stone walls",null,1.3030958319413975E-2,null,null,"Stone walls",null,6.658804124538831E-4,null,null,"Stone walls",null,1.1603686858382646E-2]
[null,null,"Palm tree walls",null,1.4929483479205894E-2,null,null,"Palm tree walls",null,1.2507566666786015E-2,null,null,"Palm tree walls",null,1.4065518843589928E-2]
[null,null,"Adobe walls",null,0.1860738117870423,null,null,"Adobe walls",null,0.12970326922978695,null,null,"Adobe walls",null,4.0495308491887351E-2]
[null,null,"Tabique/Chinche walls",null,2.1038675540011396E-2,null,null,"Tabique/Chinche walls",null,2.5752480119395394E-2,null,null,"Tabique/Chinche walls",null,1.1437892129024305E-2]
[null,null,"Finished wood walls",null,2.7272641943370573E-2,null,null,"Finished wood walls",null,6.0856454671791523E-2,null,null,"Finished wood walls",null,2.2142096492352207E-3]
[null,null,"Blocks/brick walls",null,0.4027032504481417,null,null,"Blocks/brick walls",null,0.27585437981700878,null,null,"Blocks/brick walls",null,0.24068390240769327]
[null,null,"Other wall materials",null,4.9921936036822472E-3,null,null,"Other wall materials",null,7.986631816903152E-3,null,null,"Other wall materials",null,1.7965560581226982E-3]
[null,null,"Palm tree roof",null,0.33047764016729647,null,null,"Palm tree roof",null,9.2261350762194688E-2,null,null,"Palm tree roof",null,0.32165622071550487]
[null,null,"Zinc roof",null,1.7159559930138856E-2,null,null,"Zinc roof",null,4.04398587534344E-2,null,null,"Zinc roof",null,0.10781080600798369]
[null,null,"Cement roof",null,4.4024514071372221E-2,null,null,"Cement roof",null,2.905174952682895E-2,null,null,"Cement roof",null,1.6638676974122964E-2]
[null,null,"Ceramic tile roof",null,5.7381471966541829E-2,null,null,"Ceramic tile roof",null,6.3206252763934559E-2,null,null,"Ceramic tile roof",null,6.1175957003111597E-2]
[null,null,"Other roof materials",null,4.8732868490222155E-3,null,null,"Other roof materials",null,1.4626877577468765E-2,null,null,"Other roof materials",null,1.1512170747684158E-3]
[null,null,"Electricity for cooking",null,5.61275034014788E-3,null,null,"Electricity for cooking",null,4.8112512190216028E-3,null,null,"Electricity for cooking",null,1.130484634410344E-4]
[null,null,"LPG, natural gas for cooking",null,0.57807003801990109,null,null,"LPG, natural gas for cooking",null,0.23959137777638953,null,null,"LPG, natural gas for cooking",null,0.51885512909098319]
[null,null,"Kerosene for cooking",null,3.9998913733926389E-4,null,null,"Kerosene for cooking",null,5.941153292327978E-3,null,null,"Kerosene for cooking",null,2.9709566098636605E-5]
[null,null,"Wood, straw for cooking",null,0.56240113042107154,null,null,"Wood, straw for cooking",null,0.24152688567732516,null,null,"Wood, straw for cooking",null,0.44988107114860754]
[null,null,"Dung for cooking",null,1.9818293422049434E-2,null,null,"Dung for cooking",null,5.1629910076855367E-3,null,null,"Dung for cooking",null,2.7857090398602275E-3]
[null,null,"Does not cook",null,1.3434383553681444E-4,null,null,"Does not cook",null,1.8493275429006556E-2,null,null,"Does not cook",null,4.1542281666988434E-3]
[null,null,"Other fuel for cooking",null,4.2986039676556472E-5,null,null,"Other fuel for cooking",null,1.0976912441919248E-4,null,null,"Other fuel for cooking",null,9.7039136125926371E-5]
[null,null,"Solid waste collected by town council",null,0.11187921009664278,null,null,"Solid waste collected by town council",null,4.5852306651667967E-3,null,null,"Solid waste collected by town council",null,0.13826657663184477]
[null,null,"Solid waste collected by contractors",null,0.25376779354615164,null,null,"Solid waste collected by contractors",null,0.10513439435451746,null,null,"Solid waste collected by contractors",null,3.3147468106804016E-2]
[null,null,"Solid waste collected by private company",null,3.2598194585482525E-3,null,null,"Solid waste collected by private company",null,3.3815376481778469E-3,null,null,"Solid waste collected by private company",null,7.3281098238892287E-3]
[null,null,"Solid waste burnt",null,7.0540766831276622E-2,null,null,"Solid waste burnt",null,8.5214188652988077E-2,null,null,"Solid waste burnt",null,5.8229069578463466E-3]
[null,null,"Solid waste thrown in yard",null,3.9401319596849053E-2,null,null,"Solid waste thrown in yard",null,6.5204380149767238E-3,null,null,"Solid waste thrown in yard",null,1.0623615310068632E-2]
[null,null,"Solid waste thrown in street",null,0.2384292103731834,null,null,"Solid waste thrown in street",null,0.10679371600010502,null,null,"Solid waste thrown in street",null,5.6784966822861604E-2]
[null,null,"Solid waste other disposal",null,1.1197947499637173E-2,null,null,"Solid waste other disposal",null,7.8453619773712693E-3,null,null,"Solid waste other disposal",null,1.7523976288254724E-6]
[]
[]
[null,null,"Total Variance Explained",null,null,null,null,"Total Variance Explained",null,null,null,null,"Total Variance Explained"]
[null,null,"Component",null,"Extraction Sums of Squared Loadings",null,null,"Component",null,"Extraction Sums of Squared Loadings",null,null,"Component",null,"Extraction Sums of Squared Loadings"]
[null,null,null,null,"Total","% of Variance","Cumulative %",null,null,"Total","% of Variance","Cumulative %",null,null,"Total","% of Variance","Cumulative %"]
[null,null,"1",null,6.9872990696250259,14.556873061718804,14.556873061718804,"1",null,5.3077539913547644,11.057820815322426,11.057820815322426,"1",null,5.0173390715716639,10.452789732440966,10.452789732440966]
[]
[]
[null,null,"Component Score Coefficient Matrix",null,null,null,null,"Component Score Coefficient Matrix",null,null,null,null,"Component Score Coefficient Matrix"]
[null,null,null,null,"Component",null,null,null,null,"Component",null,null,null,null,"Component"]
[null,null,null,null,"1",null,null,null,null,"1",null,null,null,null,"1"]
[null,null,"Has electricity",null,0.10278594955571424,null,null,"Has electricity",null,8.7723131556008554E-2,null,null,"Has electricity",null,0.13352909738937441]
[null,null,"Has radio",null,4.3785338054217186E-2,null,null,"Has radio",null,5.789535175659536E-2,null,null,"Has radio",null,5.1551870192671212E-2]
[null,null,"Has television",null,0.10776764170584761,null,null,"Has television",null,0.10159394440736005,null,null,"Has television",null,0.13768132259325153]
[null,null,"Has refrigerator",null,9.7234260561706976E-2,null,null,"Has refrigerator",null,0.13060558671636538,null,null,"Has refrigerator",null,0.11231549599386752]
[null,null,"Has bicycle",null,2.0048890058250959E-2,null,null,"Has bicycle",null,3.9325355787453067E-2,null,null,"Has bicycle",null,4.4177859149644803E-2]
[null,null,"Has motorcycle/scooter",null,2.8356161719332858E-2,null,null,"Has motorcycle/scooter",null,3.824243822020592E-2,null,null,"Has motorcycle/scooter",null,3.2736682698398654E-2]
[null,null,"Has car/truck",null,6.2022866024431765E-2,null,null,"Has car/truck",null,9.4120035991206094E-2,null,null,"Has car/truck",null,6.7233133771116144E-2]
[null,null,"Has telephone",null,8.5867404417846072E-2,null,null,"Has telephone",null,0.12227132859122948,null,null,"Has telephone",null,6.2049789836498476E-2]
[null,null,"Has an exclusively room for kitchen",null,2.2019123992994508E-2,null,null,"Has an exclusively room for kitchen",null,7.1687492289817495E-2,null,null,"Has an exclusively room for kitchen",null,1.1966023639751076E-2]
[null,null,"Number of rooms excluding kitchen and bathrooms",null,5.3048761237992383E-2,null,null,"Number of rooms excluding kitchen and bathrooms",null,0.11101871748590925,null,null,"Number of rooms excluding kitchen and bathrooms",null,5.1706558416599539E-2]
[null,null,"Cellular phone",null,7.8307923475776586E-2,null,null,"Cellular phone",null,9.579472921282059E-2,null,null,"Cellular phone",null,7.7810980373163779E-2]
[null,null,"Computer",null,6.5378491364025182E-2,null,null,"Computer",null,0.10057189027125425,null,null,"Computer",null,3.4772419118317875E-2]
[null,null,"Electric water pump",null,3.8898947194645622E-2,null,null,"Electric water pump",null,6.2532980278783928E-2,null,null,"Electric water pump",null,4.5842834838954481E-2]
[null,null,"memsleep",null,-4.7788710611798367E-2,null,null,"memsleep",null,-7.7384987709235437E-2,null,null,"memsleep",null,-4.5709606046683025E-2]
[null,null,"Earth, mud, dung floor",null,-0.10400607769806899,null,null,"Earth, mud, dung floor",null,-9.9039504202236228E-2,null,null,"Earth, mud, dung floor",null,-0.14753460125269613]
[null,null,"Rudimentary wood plank floor",null,-5.0630933293936342E-3,null,null,"Rudimentary wood plank floor",null,-1.2540642374416435E-2,null,null,"Rudimentary wood plank floor",null,1.632616306619972E-2]
[null,null,"Concrete, cement floor",null,4.2922931462249465E-2,null,null,"Concrete, cement floor",null,-6.2731600238690325E-3,null,null,"Concrete, cement floor",null,0.1123511889605473]
[null,null,"Terrazo, ceramic tile floor",null,5.9879203078273123E-2,null,null,"Terrazo, ceramic tile floor",null,8.8824531470580975E-2,null,null,"Terrazo, ceramic tile floor",null,5.3324941356880547E-2]
[null,null,"Parquet, wood tile floor",null,3.760166510082763E-2,null,null,"Parquet, wood tile floor",null,3.9989921590823936E-2,null,null,"Parquet, wood tile floor",null,3.0720928684761183E-2]
[null,null,"Asphalt strips for floor",null,2.1236171587598919E-3,null,null,"Asphalt strips for floor",null,-2.0631370601356988E-2,null,null,"Asphalt strips for floor",null,3.6506876238115049E-2]
[null,null,"Carpeted floor",null,9.6868610634724718E-3,null,null,"Carpeted floor",null,1.2585444868099704E-2,null,null,"Carpeted floor",null,4.4203404620327185E-3]
[null,null,"Other type of flooring",null,-4.494967141474804E-3,null,null,"Other type of flooring",null,-7.6256220111111305E-3,null,null,"Other type of flooring",null,-3.6051027300057479E-3]
[null,null,"Stone walls",null,-1.6337245887761729E-2,null,null,"Stone walls",null,-4.8616907975570977E-3,null,null,"Stone walls",null,-2.1469629430391837E-2]
[null,null,"Palm tree walls",null,-1.7486909361137882E-2,null,null,"Palm tree walls",null,-2.1070538141047701E-2,null,null,"Palm tree walls",null,-2.3637657021714571E-2]
[null,null,"Adobe walls",null,-6.173526190337212E-2,null,null,"Adobe walls",null,-6.7852315972357802E-2,null,null,"Adobe walls",null,-4.010780587502643E-2]
[null,null,"Tabique/Chinche walls",null,-2.0758686285424967E-2,null,null,"Tabique/Chinche walls",null,-3.0234218315386335E-2,null,null,"Tabique/Chinche walls",null,-2.1315697412374705E-2]
[null,null,"Finished wood walls",null,-2.363492742699469E-2,null,null,"Finished wood walls",null,-4.6477476334179264E-2,null,null,"Finished wood walls",null,-9.3785547461056086E-3]
[null,null,"Blocks/brick walls",null,9.0820363387262862E-2,null,null,"Blocks/brick walls",null,9.8953043489214604E-2,null,null,"Blocks/brick walls",null,9.7780008482577577E-2]
[null,null,"Other wall materials",null,-1.0111984086348899E-2,null,null,"Other wall materials",null,-1.6837245581659069E-2,null,null,"Other wall materials",null,-8.4478644137477733E-3]
[null,null,"Palm tree roof",null,-8.2273828700564794E-2,null,null,"Palm tree roof",null,-5.7226754799865429E-2,null,null,"Palm tree roof",null,-0.11303749531133386]
[null,null,"Zinc roof",null,1.8747516333498557E-2,null,null,"Zinc roof",null,-3.7887332506570212E-2,null,null,"Zinc roof",null,6.5442170471877184E-2]
[null,null,"Cement roof",null,3.0028798328455855E-2,null,null,"Cement roof",null,3.2112591890286944E-2,null,null,"Cement roof",null,2.5709044947818033E-2]
[null,null,"Ceramic tile roof",null,3.4282817759438131E-2,null,null,"Ceramic tile roof",null,4.7366275449310574E-2,null,null,"Ceramic tile roof",null,4.9296596304915764E-2]
[null,null,"Other roof materials",null,-9.9908319818965471E-3,null,null,"Other roof materials",null,-2.2785839170347044E-2,null,null,"Other roof materials",null,-6.7624670118446679E-3]
[null,null,"Electricity for cooking",null,1.0722067331810288E-2,null,null,"Electricity for cooking",null,1.3068273994621384E-2,null,null,"Electricity for cooking",null,2.1191362483624532E-3]
[null,null,"LPG, natural gas for cooking",null,0.10881302847876335,null,null,"LPG, natural gas for cooking",null,9.2219933963818043E-2,null,null,"LPG, natural gas for cooking",null,0.14356534056247006]
[null,null,"Kerosene for cooking",null,-2.8622974674978596E-3,null,null,"Kerosene for cooking",null,-1.4521938508874491E-2,null,null,"Kerosene for cooking",null,1.0863623425937255E-3]
[null,null,"Wood, straw for cooking",null,-0.10732817882532944,null,null,"Wood, straw for cooking",null,-9.2591678095960472E-2,null,null,"Wood, straw for cooking",null,-0.13368276161772746]
[null,null,"Dung for cooking",null,-2.0147622025251399E-2,null,null,"Dung for cooking",null,-1.3537544547141721E-2,null,null,"Dung for cooking",null,-1.0519483702946161E-2]
[null,null,"Does not cook",null,-1.6588210559946603E-3,null,null,"Does not cook",null,-2.5621003356121198E-2,null,null,"Does not cook",null,1.2846112510587792E-2]
[null,null,"Other fuel for cooking",null,-9.3832737197545432E-4,null,null,"Other fuel for cooking",null,-1.9739189412153937E-3,null,null,"Other fuel for cooking",null,-1.963360318423701E-3]
[null,null,"Solid waste collected by town council",null,4.7870213391793745E-2,null,null,"Solid waste collected by town council",null,1.2757624302726377E-2,null,null,"Solid waste collected by town council",null,7.4111423225220283E-2]
[null,null,"Solid waste collected by contractors",null,7.2095626398461357E-2,null,null,"Solid waste collected by contractors",null,6.1088804063813743E-2,null,null,"Solid waste collected by contractors",null,3.6287055510536688E-2]
[null,null,"Solid waste collected by private company",null,8.1712301249542048E-3,null,null,"Solid waste collected by private company",null,1.0955856315571388E-2,null,null,"Solid waste collected by private company",null,1.7061709101031261E-2]
[null,null,"Solid waste burnt",null,-3.801112784645129E-2,null,null,"Solid waste burnt",null,-5.499778147447678E-2,null,null,"Solid waste burnt",null,1.5208853401537978E-2]
[null,null,"Solid waste thrown in yard",null,-2.8408352701590374E-2,null,null,"Solid waste thrown in yard",null,-1.5213446087129738E-2,null,null,"Solid waste thrown in yard",null,-2.0542945616897176E-2]
[null,null,"Solid waste thrown in street",null,-6.9882816154738917E-2,null,null,"Solid waste thrown in street",null,-6.1568994869489059E-2,null,null,"Solid waste thrown in street",null,-4.7494490877506561E-2]
[null,null,"Solid waste other disposal",null,-1.5144672324899413E-2,null,null,"Solid waste other disposal",null,-1.6687670177343294E-2,null,null,"Solid waste other disposal",null,2.6384135992807206E-4]
[]
[]
[null,null,"Component Score Covariance Matrix",null,null,null,null,"Component Score Covariance Matrix",null,null,null,null,"Component Score Covariance Matrix"]
[null,null,"Component",null,"1",null,null,"Component",null,"1",null,null,"Component",null,"1"]
[null,null,"1",null,1,null,null,"1",null,0.99999999999999989,null,null,"1",null,0.99999999999999978]
[]
[]
[]
[]
[]
[]
[]
[]
[]
[]
[]
[]
[]
[]
[]
[]
[]
[]
[]
[]
[]
[]
[]
[]
[]
[]
[]
[]
[]
[]
[]
[]
[]
[]
[]
[]
[]
[]
[]
[]
[]
[]
[]
[]
[]
[]
[]
[]
[]
[]
[]
[]
[]
[]
[]
[]
[]
[]
[]
[]
[]
[]
[]
[]
[]
[]
[]
[]
[]
[]
[]
[]
[]
[]
[]
[]
[]
[]
[]
[]
[]
[]
[]
[]
[]
[]
[]
[]
[]
[]
[]
[]
[]
[]
[]
[]
[]
[]
[]
[]
[]
[]
[]
[]
[]
[]
[]
[]
[]
[]
[]
[]
[]
[]
[]
[]
[]
[]
[]
[]
[]
[]
[]
[]
[]
[]
[]
[]
[]
[]
[]
[]
[]
[]
[]
[]
[]
[]
[]
[]
[]
[]
[]
[]
[]
[]
[]
[]
[]
[]
[]
[]
[]
[]
[]
[]
[]
[]
[]
[]
[]
[]
[]
[]
[]
[]
[]
[]
[]
[]
[]
[]
[]
[]
[]
[]
[]
[]
[]
[]
[]
[]
[]
[]
[]
[]
[]
[]
[]
[]
[]
[]
[]
[]
[]
[]
[]
[]
[]
[]
[]
[]
[]
[]
[]
[]
[]
[]
[]
[]
[]
[]
[]
[]
[]
[]
[]
[]
[]
[]
[]
[]
[]
[]
[]
[]
[]
[]
[]
[]
[]
[]
[]
[]
[]
[]
[]
[]
[]
[]
[]
[]
[]
[]
[]
[]
[]
[]
[]
[]
[]
[]
[]
[]
[]
[]
[]
[]
[]
[]
[]
[]
[]
[]
[]
[]
[]
[]
[]
[]
[]
[]
[]
[]
[]
[]
[]
[]
[]
[]
[]
[]
[]
[]
[]
[]
[]
[]
[]
[]
[]
[]
[]
[]
[]
[]
[]
[]
[]
[]
[]
[]
[]
[]
[]
[]
[]
[]
[]
[]
[]
[]
[]
[]
[]
[]
[]
[]
[]
[]
[]
[]
[]
[]
[]
[]
[]
[]
[]
[]
[]
[]
[]
[]
[]
[]
[]
[]
[]
[]
[]
[]
[]
[]
[]
[]
[]
[]
[]
[]
[]
[]
[]
[]
[]
[]
[]
[]
[]
[]
[]
[]
[]
[]
[]
[]
[]
[]
[]
[]
[]
[]
[]
[]
[]
[]
[]
[]
[]
[]
[]
[]
[]
[]
[]
[]
[]
[]
[]
[]
[]
[]
[]
[]
[]
[]
[]
[]
[]
[]
[]
[]
[]
[]
[]
[]
[]
[]
[]
[]
[]
[]
[]
[]
[]
[]
[]
[]
[]
[]
[]
[]
[]
[]
[]
[]
[]
[]
[]
[]
[]
[]
[]
[]
[]
[]
[]
[]
[]
[]
[]
[]
[]
[]
[]
[]
[]
[]
[]
[]
[]
[]
[]
[]
[]
[]
[]
["DHS03"]
["Bolivia (Plurinational State of)",null,"Count"]
["W_text_t","",19207]
["W_text_i","",19207]
["S_text_s","Ratio of Shared improved based on:",19207]
["S_text_i","Ratio of Improved latrines based on:",19207]
["Urban/Rural","Urban",11554]
[null,"Rural",7653]
[null,"Missing",0]
["2003"]
[]
["Sub-national region names","Weighted population"]
[{"$f":"R15","v":"Beni"},{"$f":"BR122+BR123","v":{"$error":"#VALUE!"}}]
[{"$f":"S15","v":"Chuquisaca"},{"$f":"BS122+BS123","v":{"$error":"#VALUE!"}}]
[{"$f":"T15","v":"Cochabamba"},{"$f":"BT122+BT123","v":{"$error":"#VALUE!"}}]
[{"$f":"U15","v":"La Paz"},{"$f":"BU122+BU123","v":{"$error":"#VALUE!"}}]
[{"$f":"V15","v":"Oruro"},{"$f":"BV122+BV123","v":{"$error":"#VALUE!"}}]
[{"$f":"W15","v":"Pando"},{"$f":"BW122+BW123","v":{"$error":"#VALUE!"}}]
[{"$f":"X15","v":"Potosi"},{"$f":"BX122+XR123","v":{"$error":"#VALUE!"}}]
[{"$f":"Y15","v":"Santa Cruz"},{"$f":"BY122+BY123","v":{"$error":"#VALUE!"}}]
[{"$f":"Z15","v":"Tarija"},{"$f":"BZ122+BZ123","v":{"$error":"#VALUE!"}}]
[{"$f":"AA15","v":0},{"$f":"CA122+CA123","v":0}]
[{"$f":"AB15","v":0},{"$f":"CB122+CB123","v":0}]
[{"$f":"AC15","v":0},{"$f":"CC122+CC123","v":0}]
[{"$f":"AD15","v":0},{"$f":"CD122+CD123","v":0}]
[{"$f":"AE15","v":0},{"$f":"CE122+CE123","v":0}]
[{"$f":"AF15","v":0},{"$f":"CF122+CF123","v":0}]
[{"$f":"AG15","v":0},{"$f":"CG122+CG123","v":0}]
[{"$f":"AH15","v":0},{"$f":"CH122+CH123","v":0}]
[{"$f":"AI15","v":0},{"$f":"CI122+CI123","v":0}]
[{"$f":"AJ15","v":0},{"$f":"CJ122+CJ123","v":0}]
[{"$f":"AK15","v":0},{"$f":"CK122+CK123","v":0}]
[{"$f":"AL15","v":0},{"$f":"CL122+CL123","v":0}]
[{"$f":"AM15","v":0},{"$f":"CM122+CM123","v":0}]
[{"$f":"AN15","v":0},{"$f":"CN122+CN123","v":0}]
[{"$f":"AO15","v":0},{"$f":"CO122+CO123","v":0}]
[{"$f":"AP15","v":0},{"$f":"CP122+CP123","v":0}]
[{"$f":"AQ15","v":0},{"$f":"CQ122+CQ123","v":0}]
[{"$f":"AR15","v":0},{"$f":"CR122+CR123","v":0}]
[{"$f":"AS15","v":0},{"$f":"CS122+CS123","v":0}]
[{"$f":"AT15","v":0},{"$f":"CT122+CT123","v":0}]
[{"$f":"AU15","v":0},{"$f":"CU122+CU123","v":0}]
[{"$f":"AV15","v":0},{"$f":"CV122+CV123","v":0}]
[{"$f":"AW15","v":0},{"$f":"CW122+CW123","v":0}]
[{"$f":"AX15","v":0},{"$f":"CX122+CX123","v":0}]
[{"$f":"AY15","v":0},{"$f":"CY122+CY123","v":0}]
[]
[{"$f":"34-COUNTIF(A1037:A1071,\"0\")","v":9},"Sub-regions"]

{"sheet":"DHS08","index":5,"n_rows":1072,"n_cols":78,"rows_kept":1072,"cut":false,"hidden":false,"merged":[[340,52,341,52],[342,52,343,52],[344,52,345,52],[346,52,347,52],[348,52,349,52],[350,52,351,52],[352,52,353,52],[152,52,156,52],[219,54,219,58],[219,59,219,63],[219,64,219,68],[221,52,223,52],[224,52,225,52],[226,52,229,52],[258,54,258,58],[258,59,258,63],[258,64,258,68],[260,52,262,52],[263,52,266,52],[267,52,269,52],[270,52,272,52],[273,52,275,52],[276,52,283,52],[338,54,338,58],[338,59,338,63],[338,64,338,68],[150,52,151,52],[13,54,13,58],[13,59,13,63],[13,64,13,68],[15,52,16,52],[17,52,20,52],[21,52,22,52],[26,54,26,58],[26,59,26,63],[26,64,26,68],[55,54,55,58],[55,59,55,63],[55,64,55,68],[119,54,119,58],[119,59,119,63],[119,64,119,68],[121,52,122,52],[123,52,126,52],[127,52,128,52],[132,54,132,58],[132,59,132,63],[132,64,132,68],[134,52,138,52],[40,52,41,52],[42,52,43,52],[44,52,45,52],[46,52,48,52],[49,0,51,0],[49,52,51,52],[52,0,54,0],[52,52,54,52],[139,0,142,0],[139,52,142,52],[143,0,146,0],[143,52,146,52],[147,0,149,0],[147,52,149,52],[13,2,13,6],[13,7,13,11],[28,52,29,52],[30,0,31,0],[30,52,31,52],[32,0,33,0],[32,52,33,52],[34,52,35,52],[36,52,37,52],[38,0,39,0],[38,52,39,52],[28,0,29,0],[34,0,35,0],[36,0,37,0],[40,0,41,0],[42,0,43,0],[44,0,45,0],[26,2,26,6],[26,7,26,11],[26,12,26,16],[13,12,13,16],[15,0,16,0],[17,0,20,0],[21,0,22,0],[23,0,25,0],[107,0,107,1],[119,2,119,6],[119,7,119,11],[57,0,65,0],[55,2,55,6],[55,7,55,11],[55,12,55,16],[152,0,155,0],[201,0,203,0],[132,2,132,6],[132,7,132,11],[132,12,132,16],[134,0,138,0],[119,12,119,16],[121,0,122,0],[123,0,126,0],[127,0,128,0],[129,0,131,0],[150,0,151,0],[46,0,48,0],[1024,0,1024,2],[1025,0,1025,1],[1030,0,1032,0],[1033,0,1033,2],[398,2,398,5],[221,0,223,0],[207,0,207,1],[219,2,219,6],[219,7,219,11],[219,12,219,16],[405,2,405,3],[405,7,405,8],[405,12,405,13],[406,2,406,3],[406,7,406,8],[406,12,406,13],[401,1,444,1],[402,2,402,3],[402,7,402,8],[402,12,402,13],[403,2,403,3],[403,7,403,8],[403,12,403,13],[404,2,404,3],[404,7,404,8],[404,12,404,13],[398,7,398,10],[398,12,398,15],[399,2,399,4],[399,7,399,9],[399,12,399,14],[400,2,401,3],[400,7,401,8],[400,12,401,13],[411,2,411,3],[411,7,411,8],[411,12,411,13],[412,2,412,3],[412,7,412,8],[412,12,412,13],[409,2,409,3],[409,7,409,8],[409,12,409,13],[410,2,410,3],[410,7,410,8],[410,12,410,13],[407,2,407,3],[407,7,407,8],[407,12,407,13],[408,2,408,3],[408,7,408,8],[408,12,408,13],[417,2,417,3],[417,7,417,8],[417,12,417,13],[418,2,418,3],[418,7,418,8],[418,12,418,13],[415,2,415,3],[415,7,415,8],[415,12,415,13],[416,2,416,3],[416,7,416,8],[416,12,416,13],[413,2,413,3],[413,7,413,8],[413,12,413,13],[414,2,414,3],[414,7,414,8],[414,12,414,13],[423,2,423,3],[423,7,423,8],[423,12,423,13],[424,2,424,3],[424,7,424,8],[424,12,424,13],[421,2,421,3],[421,7,421,8],[421,12,421,13],[422,2,422,3],[422,7,422,8],[422,12,422,13],[419,2,419,3],[419,7,419,8],[419,12,419,13],[420,2,420,3],[420,7,420,8],[420,12,420,13],[429,2,429,3],[429,7,429,8],[429,12,429,13],[430,2,430,3],[430,7,430,8],[430,12,430,13],[427,2,427,3],[427,7,427,8],[427,12,427,13],[428,2,428,3],[428,7,428,8],[428,12,428,13],[425,2,425,3],[425,7,425,8],[425,12,425,13],[426,2,426,3],[426,7,426,8],[426,12,426,13],[435,2,435,3],[435,7,435,8],[435,12,435,13],[436,2,436,3],[436,7,436,8],[436,12,436,13],[433,2,433,3],[433,7,433,8],[433,12,433,13],[434,2,434,3],[434,7,434,8],[434,12,434,13],[431,2,431,3],[431,7,431,8],[431,12,431,13],[432,2,432,3],[432,7,432,8],[432,12,432,13],[441,2,441,3],[441,7,441,8],[441,12,441,13],[442,2,442,3],[442,7,442,8],[442,12,442,13],[439,2,439,3],[439,7,439,8],[439,12,439,13],[440,2,440,3],[440,7,440,8],[440,12,440,13],[437,2,437,3],[437,7,437,8],[437,12,437,13],[438,2,438,3],[438,7,438,8],[438,12,438,13],[447,2,447,3],[447,7,447,8],[447,12,447,13],[448,2,448,3],[448,7,448,8],[448,12,448,13],[445,2,445,3],[445,7,445,8],[445,12,445,13],[446,2,446,3],[446,7,446,8],[446,12,446,13],[443,2,443,3],[443,7,443,8],[443,12,443,13],[444,2,444,3],[444,7,444,8],[444,12,444,13],[453,2,453,3],[453,7,453,8],[453,12,453,14],[454,2,454,4],[454,7,454,9],[454,12,454,13],[451,2,451,3],[451,7,451,8],[451,12,451,13],[452,2,452,3],[452,7,452,8],[452,12,452,13],[449,2,449,3],[449,7,449,8],[449,12,449,13],[450,2,450,3],[450,7,450,8],[450,12,450,13],[459,2,459,3],[459,7,459,8],[459,12,459,13],[460,2,460,3],[460,7,460,8],[460,12,460,13],[457,2,457,3],[457,7,457,8],[457,12,457,13],[458,2,458,3],[458,7,458,8],[458,12,458,13],[455,2,455,3],[455,7,455,8],[455,12,455,13],[456,2,456,3],[456,7,456,8],[456,12,456,13],[465,2,465,3],[465,7,465,8],[465,12,465,13],[466,2,466,3],[466,7,466,8],[466,12,466,13],[463,2,463,3],[463,7,463,8],[463,12,463,13],[464,2,464,3],[464,7,464,8],[464,12,464,13],[461,2,461,3],[461,7,461,8],[461,12,461,13],[462,2,462,3],[462,7,462,8],[462,12,462,13],[471,2,471,3],[471,7,471,8],[471,12,471,13],[472,2,472,3],[472,7,472,8],[472,12,472,13],[469,2,469,3],[469,7,469,8],[469,12,469,13],[470,2,470,3],[470,7,470,8],[470,12,470,13],[467,2,467,3],[467,7,467,8],[467,12,467,13],[468,2,468,3],[468,7,468,8],[468,12,468,13],[477,2,477,3],[477,7,477,8],[477,12,477,13],[478,2,478,3],[478,7,478,8],[478,12,478,13],[475,2,475,3],[475,7,475,8],[475,12,475,13],[476,2,476,3],[476,7,476,8],[476,12,476,13],[473,2,473,3],[473,7,473,8],[473,12,473,13],[474,2,474,3],[474,7,474,8],[474,12,474,13],[483,2,483,3],[483,7,483,8],[483,12,483,13],[484,2,484,3],[484,7,484,8],[484,12,484,13],[481,2,481,3],[481,7,481,8],[481,12,481,13],[482,2,482,3],[482,7,482,8],[482,12,482,13],[479,2,479,3],[479,7,479,8],[479,12,479,13],[480,2,480,3],[480,7,480,8],[480,12,480,13],[489,2,489,3],[489,7,489,8],[489,12,489,13],[490,2,490,3],[490,7,490,8],[490,12,490,13],[487,2,487,3],[487,7,487,8],[487,12,487,13],[488,2,488,3],[488,7,488,8],[488,12,488,13],[485,2,485,3],[485,7,485,8],[485,12,485,13],[486,2,486,3],[486,7,486,8],[486,12,486,13],[495,2,495,3],[495,7,495,8],[495,12,495,13],[496,2,496,3],[496,7,496,8],[496,12,496,13],[493,2,493,3],[493,7,493,8],[493,12,493,13],[494,2,494,3],[494,7,494,8],[494,12,494,13],[491,2,491,3],[491,7,491,8],[491,12,491,13],[492,2,492,3],[492,7,492,8],[492,12,492,13],[501,2,501,3],[501,7,501,8],[501,12,501,13],[502,2,502,3],[502,7,502,8],[502,12,502,13],[499,2,499,3],[499,7,499,8],[499,12,499,13],[500,2,500,3],[500,7,500,8],[500,12,500,13],[497,2,497,3],[497,7,497,8],[497,12,497,13],[498,2,498,3],[498,7,498,8],[498,12,498,13],[508,2,509,3],[508,4,508,6],[508,7,509,8],[508,9,508,11],[508,12,508,13],[509,12,509,13],[505,2,505,3],[505,7,505,8],[505,12,505,16],[506,2,506,3],[506,7,506,8],[506,12,507,13],[506,14,506,16],[507,2,507,6],[507,7,507,11],[503,2,503,3],[503,7,503,8],[503,12,503,13],[504,2,504,3],[504,7,504,8],[504,12,504,13],[516,2,516,3],[516,7,516,8],[516,12,516,13],[517,2,517,3],[517,7,517,8],[517,12,517,13],[512,2,512,3],[512,7,512,8],[512,12,513,13],[513,2,513,4],[513,7,513,9],[514,2,515,3],[514,7,515,8],[514,12,514,13],[515,12,515,13],[510,2,510,3],[510,7,510,8],[510,12,510,13],[511,2,511,3],[511,7,511,8],[511,12,511,14],[522,2,522,3],[522,7,522,8],[522,12,522,13],[523,2,523,3],[523,7,523,8],[523,12,523,13],[520,2,520,3],[520,7,520,8],[520,12,520,13],[521,2,521,3],[521,7,521,8],[521,12,521,13],[518,2,518,3],[518,7,518,8],[518,12,518,13],[519,2,519,3],[519,7,519,8],[519,12,519,13],[528,2,528,3],[528,7,528,8],[528,12,528,13],[529,2,529,3],[529,7,529,8],[529,12,529,13],[526,2,526,3],[526,7,526,8],[526,12,526,13],[527,2,527,3],[527,7,527,8],[527,12,527,13],[524,2,524,3],[524,7,524,8],[524,12,524,13],[525,2,525,3],[525,7,525,8],[525,12,525,13],[534,2,534,3],[534,7,534,8],[534,12,534,13],[535,2,535,3],[535,7,535,8],[535,12,535,13],[532,2,532,3],[532,7,532,8],[532,12,532,13],[533,2,533,3],[533,7,533,8],[533,12,533,13],[530,2,530,3],[530,7,530,8],[530,12,530,13],[531,2,531,3],[531,7,531,8],[531,12,531,13],[540,2,540,3],[540,7,540,8],[540,12,540,13],[541,2,541,3],[541,7,541,8],[541,12,541,13],[538,2,538,3],[538,7,538,8],[538,12,538,13],[539,2,539,3],[539,7,539,8],[539,12,539,13],[536,2,536,3],[536,7,536,8],[536,12,536,13],[537,2,537,3],[537,7,537,8],[537,12,537,13],[546,2,546,3],[546,7,546,8],[546,12,546,13],[547,2,547,3],[547,7,547,8],[547,12,547,13],[544,2,544,3],[544,7,544,8],[544,12,544,13],[545,2,545,3],[545,7,545,8],[545,12,545,13],[542,2,542,3],[542,7,542,8],[542,12,542,13],[543,2,543,3],[543,7,543,8],[543,12,543,13],[552,2,552,3],[552,7,552,8],[552,12,552,13],[553,2,553,3],[553,7,553,8],[553,12,553,13],[550,2,550,3],[550,7,550,8],[550,12,550,13],[551,2,551,3],[551,7,551,8],[551,12,551,13],[548,2,548,3],[548,7,548,8],[548,12,548,13],[549,2,549,3],[549,7,549,8],[549,12,549,13],[558,2,558,3],[558,7,558,8],[558,12,558,13],[559,2,559,3],[559,7,559,8],[559,12,559,13],[556,2,556,3],[556,7,556,8],[556,12,556,13],[557,2,557,3],[557,7,557,8],[557,12,557,13],[554,2,554,3],[554,7,554,8],[554,12,554,13],[555,2,555,3],[555,7,555,8],[555,12,555,13],[564,2,564,3],[564,7,564,8],[564,12,564,14],[565,2,565,3],[565,7,565,8],[565,12,565,13],[562,2,562,3],[562,7,562,8],[562,12,562,13],[563,2,563,3],[563,7,563,8],[563,12,563,13],[560,2,560,3],[560,7,560,8],[560,12,560,13],[561,2,561,3],[561,7,561,8],[561,12,561,13],[570,2,570,3],[570,7,570,8],[570,12,570,13],[571,2,571,3],[571,7,571,8],[571,12,571,13],[568,2,568,3],[568,7,568,8],[568,12,568,13],[569,2,569,3],[569,7,569,8],[569,12,569,13],[566,2,566,3],[566,7,566,8],[566,12,566,13],[567,2,567,4],[567,7,567,9],[567,12,567,13],[576,2,576,3],[576,7,576,8],[576,12,576,13],[577,2,577,3],[577,7,577,8],[577,12,577,13],[574,2,574,3],[574,7,574,8],[574,12,574,13],[575,2,575,3],[575,7,575,8],[575,12,575,13],[572,2,572,3],[572,7,572,8],[572,12,572,13],[573,2,573,3],[573,7,573,8],[573,12,573,13],[582,2,582,3],[582,7,582,8],[582,12,582,13],[583,2,583,3],[583,7,583,8],[583,12,583,13],[580,2,580,3],[580,7,580,8],[580,12,580,13],[581,2,581,3],[581,7,581,8],[581,12,581,13],[578,2,578,3],[578,7,578,8],[578,12,578,13],[579,2,579,3],[579,7,579,8],[579,12,579,13],[588,2,588,3],[588,7,588,8],[588,12,588,13],[589,2,589,3],[589,7,589,8],[589,12,589,13],[586,2,586,3],[586,7,586,8],[586,12,586,13],[587,2,587,3],[587,7,587,8],[587,12,587,13],[584,2,584,3],[584,7,584,8],[584,12,584,13],[585,2,585,3],[585,7,585,8],[585,12,585,13],[594,2,594,3],[594,7,594,8],[594,12,594,13],[595,2,595,3],[595,7,595,8],[595,12,595,13],[592,2,592,3],[592,7,592,8],[592,12,592,13],[593,2,593,3],[593,7,593,8],[593,12,593,13],[590,2,590,3],[590,7,590,8],[590,12,590,13],[591,2,591,3],[591,7,591,8],[591,12,591,13],[600,2,600,3],[600,7,600,8],[600,12,600,13],[601,2,601,3],[601,7,601,8],[601,12,601,13],[598,2,598,3],[598,7,598,8],[598,12,598,13],[599,2,599,3],[599,7,599,8],[599,12,599,13],[596,2,596,3],[596,7,596,8],[596,12,596,13],[597,2,597,3],[597,7,597,8],[597,12,597,13],[606,2,606,3],[606,7,606,8],[606,12,606,13],[607,2,607,3],[607,7,607,8],[607,12,607,13],[604,2,604,3],[604,7,604,8],[604,12,604,13],[605,2,605,3],[605,7,605,8],[605,12,605,13],[602,2,602,3],[602,7,602,8],[602,12,602,13],[603,2,603,3],[603,7,603,8],[603,12,603,13],[612,2,612,3],[612,7,612,8],[612,12,612,13],[613,2,613,3],[613,7,613,8],[613,12,613,13],[610,2,610,3],[610,7,610,8],[610,12,610,13],[611,2,611,3],[611,7,611,8],[611,12,611,13],[608,2,608,3],[608,7,608,8],[608,12,608,13],[609,2,609,3],[609,7,609,8],[609,12,609,13],[618,2,618,3],[618,7,618,8],[618,12,618,13],[619,2,619,3],[619,7,619,8],[619,12,619,13],[616,2,616,3],[616,7,616,8],[616,12,616,13],[617,2,617,3],[617,7,617,8],[617,12,617,13],[614,2,614,3],[614,7,614,8],[614,12,614,13],[615,2,615,3],[615,7,615,8],[615,12,615,13],[624,2,624,3],[624,7,624,8],[624,12,624,13],[625,2,625,3],[625,7,625,8],[625,12,625,13],[622,2,622,3],[622,7,622,8],[622,12,622,13],[623,2,623,3],[623,7,623,8],[623,12,623,13],[620,2,620,3],[620,7,620,8],[620,12,620,13],[621,2,621,3],[621,7,621,8],[621,12,621,13],[630,2,630,3],[630,7,630,8],[630,12,630,13],[631,2,631,3],[631,7,631,8],[631,12,631,13],[628,2,628,3],[628,7,628,8],[628,12,628,13],[629,2,629,3],[629,7,629,8],[629,12,629,13],[626,2,626,3],[626,7,626,8],[626,12,626,13],[627,2,627,3],[627,7,627,8],[627,12,627,13],[636,2,636,3],[636,7,636,8],[636,12,636,13],[637,2,637,3],[637,7,637,8],[637,12,637,13],[634,2,634,3],[634,7,634,8],[634,12,634,13],[635,2,635,3],[635,7,635,8],[635,12,635,13],[632,2,632,3],[632,7,632,8],[632,12,632,13],[633,2,633,3],[633,7,633,8],[633,12,633,13],[642,2,642,3],[642,7,642,8],[642,12,642,13],[643,2,643,3],[643,7,643,8],[643,12,643,13],[640,2,640,3],[640,7,640,8],[640,12,640,13],[641,2,641,3],[641,7,641,8],[641,12,641,13],[638,2,638,3],[638,7,638,8],[638,12,638,13],[639,2,639,3],[639,7,639,8],[639,12,639,13],[648,2,648,3],[648,7,648,8],[648,12,648,13],[649,2,649,3],[649,7,649,8],[649,12,649,13],[646,2,646,3],[646,7,646,8],[646,12,646,13],[647,2,647,3],[647,7,647,8],[647,12,647,13],[644,2,644,3],[644,7,644,8],[644,12,644,13],[645,2,645,3],[645,7,645,8],[645,12,645,13],[654,2,654,3],[654,7,654,8],[654,12,654,13],[655,2,655,3],[655,7,655,8],[655,12,655,13],[652,2,652,3],[652,7,652,8],[652,12,652,13],[653,2,653,3],[653,7,653,8],[653,12,653,13],[650,2,650,3],[650,7,650,8],[650,12,650,13],[651,2,651,3],[651,7,651,8],[651,12,651,13],[660,2,660,3],[660,7,660,8],[660,12,660,13],[661,2,661,3],[661,7,661,8],[661,12,661,13],[658,2,658,3],[658,7,658,8],[658,12,658,13],[659,2,659,3],[659,7,659,8],[659,12,659,13],[656,2,656,3],[656,7,656,8],[656,12,656,13],[657,2,657,3],[657,7,657,8],[657,12,657,13],[694,2,694,3],[694,7,694,8],[694,12,694,13],[695,2,695,3],[695,7,695,8],[695,12,695,13],[664,2,664,3],[664,7,664,8],[664,12,664,13],[693,2,693,3],[693,7,693,8],[693,12,693,13],[662,2,662,3],[662,7,662,8],[662,12,662,13],[663,2,663,3],[663,7,663,8],[663,12,663,13],[700,2,700,3],[700,7,700,8],[700,12,700,13],[701,2,701,3],[701,7,701,8],[701,12,701,13],[698,2,698,3],[698,7,698,8],[698,12,698,13],[699,2,699,3],[699,7,699,8],[699,12,699,13],[696,2,696,3],[696,7,696,8],[696,12,696,13],[697,2,697,3],[697,7,697,8],[697,12,697,13],[706,2,706,3],[706,7,706,8],[706,12,706,13],[707,2,707,3],[707,7,707,8],[707,12,707,13],[704,2,704,3],[704,7,704,8],[704,12,704,13],[705,2,705,3],[705,7,705,8],[705,12,705,13],[702,2,702,3],[702,7,702,8],[702,12,702,13],[703,2,703,3],[703,7,703,8],[703,12,703,13],[712,2,712,3],[712,7,712,8],[712,12,712,13],[713,2,713,3],[713,7,713,8],[713,12,713,13],[710,2,710,3],[710,7,710,8],[710,12,710,13],[711,2,711,3],[711,7,711,8],[711,12,711,13],[708,2,708,3],[708,7,708,8],[708,12,708,13],[709,2,709,3],[709,7,709,8],[709,12,709,13],[718,2,718,3],[718,7,718,8],[718,12,718,13],[719,2,719,3],[719,7,719,8],[719,12,719,13],[716,2,716,3],[716,7,716,8],[716,12,716,13],[717,2,717,3],[717,7,717,8],[717,12,717,13],[714,2,714,3],[714,7,714,8],[714,12,714,13],[715,2,715,3],[715,7,715,8],[715,12,715,13],[724,2,724,3],[724,7,724,8],[724,12,724,13],[725,2,725,3],[725,7,725,8],[725,12,725,13]],"merged_total":1231,"flags":["merged_cut"]}
[]
[{"$f":"A1026","v":"Bolivia (Plurinational State of)"}]
[{"$f":"A1034","v":"2008"}]
["Use of drinking water sources"]
[" by wealth quintile and sub-national region"]
["Notes:"]
["WHO/UNICEF JMP customised wealth index excludes water,"]
[" sanitation and hygiene assets."]
["Survey used for analysis:",{"$f":"A1025","v":"DHS08"}]
[{"$f":"B1028","v":""}]
[{"$f":"B1027","v":""}]
[]
[]
["Use of drinking water sources",null,"NATIONAL wealth index quintile",null,null,null,null,"URBAN wealth index quintile",null,null,null,null,"RURAL wealth index quintile",null,null,null,null,"SUB-REGIONS:",null,null,null,null,null,null,null,null,null,null,null,null,null,null,null,null,null,null,null,null,null,null,null,null,null,null,null,null,null,null,null,null,null,null,"Raw numbers of respondents:","Use of drinking water sources","NATIONAL wealth index quintile",null,null,null,null,"URBAN wealth index quintile",null,null,null,null,"RURAL wealth index quintile",null,null,null,null,"SUB-REGIONS:"]
["Weighted percentage (used in graphs)",null,"Poorest","Poor","Middle","Rich","Richest","Poorest","Poor","Middle","Rich","Richest","Poorest","Poor","Middle","Rich","Richest","Beni","Chuquisaca","Cochabamba","La Paz","Oruro","Pando","Potosí","Santa Cruz","Tarija",null,null,null,null,null,null,null,null,null,null,null,null,null,null,null,null,null,null,null,null,null,null,null,null,null,null,"Water data, raw numbers (weighted)",null,"Poorest","Poor","Middle","Rich","Richest","Poorest","Poor","Middle","Rich","Richest","Poorest","Poor","Middle","Rich","Richest","Beni","Chuquisaca","Cochabamba","La Paz","Oruro","Pando","Potosí","Santa Cruz","Tarija"]
["Water","Improved",59.721983330854677,81.881869581391356,95.863937286089111,98.935363258876151,99.550930093031866,88.358404251625316,97.869508782749861,98.996265833872414,99.527483882559039,99.526733195941745,52.27874960998151,64.598412926024395,72.404979138692582,83.044407282940554,93.550100265090705,60.144377201810059,81.416743131189264,87.800772057989846,86.001311909396875,84.558333708745607,54.693463955055456,85.418161850838416,95.561543006513844,92.828205502569233,null,null,null,null,null,null,null,null,null,null,null,null,null,null,null,null,null,null,null,null,null,null,null,null,null,null,"Water","Improved","N/A","N/A","N/A","N/A","N/A","N/A","N/A","N/A","N/A","N/A","N/A","N/A","N/A","N/A","N/A","N/A","N/A","N/A","N/A","N/A","N/A","N/A","N/A","N/A"]
[null,"Not Improved",40.27801666914543,18.118130418608484,4.1360627139108788,1.0646367411237718,0.44906990696813864,11.641595748374844,2.130491217250206,1.0037341661275769,0.47251611744100563,0.47326680405828353,47.721250390018561,35.401587073975243,27.595020861307091,16.955592717059449,6.449899734909331,39.855622798189728,18.583256868810594,12.199227942010198,13.998688090603279,15.441666291254352,45.306536044944636,14.581838149161626,4.4384569934861196,7.171794497430807,null,null,null,null,null,null,null,null,null,null,null,null,null,null,null,null,null,null,null,null,null,null,null,null,null,null,null,"Not Improved","N/A","N/A","N/A","N/A","N/A","N/A","N/A","N/A","N/A","N/A","N/A","N/A","N/A","N/A","N/A","N/A","N/A","N/A","N/A","N/A","N/A","N/A","N/A","N/A"]
["Water ladder","Basic",{"$f":"C16*C23/100","v":59.61805868220528},{"$f":"D16*D23/100","v":81.854429676184324},{"$f":"E16*E23/100","v":95.863937286089111},98.844437073791767,99.550930093031852,88.287103089402862,97.869508782749847,98.842529808358663,99.527483882559039,99.526733195941745,52.244233493529919,64.426758960277795,72.401456303510329,83.03559458451582,93.55010026509072,59.633391143719308,81.262851949967214,87.800772057989846,86.001311909396875,84.540322744198889,54.693463955055456,85.41816185083843,95.481919373787321,92.828205502569233,null,null,null,null,null,null,null,null,null,null,null,null,null,null,null,null,null,null,null,null,null,null,null,null,null,null,"Water ladder","Basic","N/A","N/A","N/A","N/A","N/A","N/A","N/A","N/A","N/A","N/A","N/A","N/A","N/A","N/A","N/A","N/A","N/A","N/A","N/A","N/A","N/A","N/A","N/A","N/A"]
[null,"Limited",{"$f":"C16*C22/100","v":0.10392464864938883},{"$f":"D16*D22/100","v":2.743990520702682E-2},{"$f":"E16*E22/100","v":0},9.0926185084390168E-2,0,7.1301162222444869E-2,0,0.15373602551374144,0,0,3.4516116451594789E-2,0.17165396574660083,3.5228351822473702E-3,8.8126984247411406E-3,0,0.51098605809075281,0.15389118122205392,0,0,1.8010964546731133E-2,0,0,7.9623632726539662E-2,0,null,null,null,null,null,null,null,null,null,null,null,null,null,null,null,null,null,null,null,null,null,null,null,null,null,null,null,"Limited","N/A","N/A","N/A","N/A","N/A","N/A","N/A","N/A","N/A","N/A","N/A","N/A","N/A","N/A","N/A","N/A","N/A","N/A","N/A","N/A","N/A","N/A","N/A","N/A"]
[null,"Unimproved",{"$f":"100-C18-C19-C21","v":20.147138238910493},{"$f":"100-D18-D19-D21","v":13.339935304963255},{"$f":"100-E18-E19-E21","v":3.5834356568102135},0.97459035552467743,0.40362107893483296,10.845637481620804,1.7039887397016038,0.87514023341463609,0.42533683554068524,0.44370676269012821,18.547809750007822,18.876170123806666,18.182435327402278,12.285638038469369,5.5866165181920433,34.285348270932687,4.6254194557184967,5.8605327694584979,10.004892138883726,11.182682406973662,35.02007715237572,6.1891625587744663,3.1077798165770734,1.6769879917101402,null,null,null,null,null,null,null,null,null,null,null,null,null,null,null,null,null,null,null,null,null,null,null,null,null,null,null,"Unimproved","N/A","N/A","N/A","N/A","N/A","N/A","N/A","N/A","N/A","N/A","N/A","N/A","N/A","N/A","N/A","N/A","N/A","N/A","N/A","N/A","N/A","N/A","N/A","N/A"]
[null,"Surface water",20.130878430234837,4.7781951136453955,0.55262705710067517,9.0046385599165932E-2,4.5448828033315333E-2,0.7959582667538897,0.42650247754854942,0.12859393271295988,4.7179281900275448E-2,2.9560041368127041E-2,29.173440640010668,16.525416950168939,9.4125855339051441,4.669954678590071,0.86328321671723696,5.570274527257256,13.957837413092236,6.338695172551656,3.9937959517193984,4.2589838842807186,10.286458892568826,8.3926755903871033,1.3306771769090666,5.4948065057206268,null,null,null,null,null,null,null,null,null,null,null,null,null,null,null,null,null,null,null,null,null,null,null,null,null,null,null,"Surface water","N/A","N/A","N/A","N/A","N/A","N/A","N/A","N/A","N/A","N/A","N/A","N/A","N/A","N/A","N/A","N/A","N/A","N/A","N/A","N/A","N/A","N/A","N/A","N/A"]
["Improved water point at more than 30 minutes","Yes",0.17401406124383911,3.3511576307806816E-2,0,9.1904635601802953E-2,0,8.0695393750429029E-2,0,0.15529477220052815,0,0,6.602322494148688E-2,0.26572474147804886,4.865459840129694E-3,1.0612031216883035E-2,0,0.84959905125657298,0.18901662643773945,0,0,2.1300046674013768E-2,0,0,8.3321836610687844E-2,0,null,null,null,null,null,null,null,null,null,null,null,null,null,null,null,null,null,null,null,null,null,null,null,null,null,null,"Improved water point at more than 30 minutes","Yes","N/A","N/A","N/A","N/A","N/A","N/A","N/A","N/A","N/A","N/A","N/A","N/A","N/A","N/A","N/A","N/A","N/A","N/A","N/A","N/A","N/A","N/A","N/A","N/A"]
[null,"No",99.825985938756148,99.966488423692184,100,99.908095364398193,100,99.919304606249554,100,99.844705227799466,100,100,99.933976775058511,99.734275258521947,99.995134540159867,99.98938796878312,100,99.150400948743439,99.810983373562252,100,100,99.978699953326,100,100,99.916678163389321,100,null,null,null,null,null,null,null,null,null,null,null,null,null,null,null,null,null,null,null,null,null,null,null,null,null,null,null,"No","N/A","N/A","N/A","N/A","N/A","N/A","N/A","N/A","N/A","N/A","N/A","N/A","N/A","N/A","N/A","N/A","N/A","N/A","N/A","N/A","N/A","N/A","N/A","N/A"]
["Manually calculated ratios","Improved wells",{"$f":"C61/(C61+C62)*100","v":14.932425245490302},26.994571538368401,28.504535038512955,28.622892623057183,75.106204762022813,7.4804070747048481,15.655002362164417,11.858553540074084,54.822644131297793,78.097325126713983,15.534195877353147,17.649528107463492,19.59357624134935,36.643148763466726,40.832248269761159,7.0934122196796068,19.106040924857055,11.785210351104695,22.747934404277817,26.420087295963,5.8532175617337563,4.5597625699282034,47.196510732704709,25.358501783900287]
[null,"Improved springs"]
[null,"Other"]
[null,null,"NATIONAL wealth index quintile",null,null,null,null,"URBAN wealth index quintile",null,null,null,null,"RURAL wealth index quintile",null,null,null,null,"SUB-REGIONS:",null,null,null,null,null,null,null,null,null,null,null,null,null,null,null,null,null,null,null,null,null,null,null,null,null,null,null,null,null,null,null,null,null,null,"Raw numbers of respondents:","Use of drinking water sources","NATIONAL wealth index quintile",null,null,null,null,"URBAN wealth index quintile",null,null,null,null,"RURAL wealth index quintile",null,null,null,null,"SUB-REGIONS:"]
["Percentage based on weighted population",null,"Poorest","Poor","Middle","Rich","Richest","Poorest","Poor","Middle","Rich","Richest","Poorest","Poor","Middle","Rich","Richest","Beni","Chuquisaca","Cochabamba","La Paz","Oruro","Pando","Potosí","Santa Cruz","Tarija",null,null,null,null,null,null,null,null,null,null,null,null,null,null,null,null,null,null,null,null,null,null,null,null,null,null,"Water data, raw numbers (weighted)",null,"Poorest","Poor","Middle","Rich","Richest","Poorest","Poor","Middle","Rich","Richest","Poorest","Poor","Middle","Rich","Richest","Beni","Chuquisaca","Cochabamba","La Paz","Oruro","Pando","Potosí","Santa Cruz","Tarija"]
["Piped water","Yes",56.054552162980301,76.652033827152195,91.655786022541605,96.221751018068545,97.955813230983296,83.134008147034336,94.449424611711436,96.061468189514414,97.323933968132238,97.927867831107946,49.121619383494036,60.591542224302522,68.243946202212925,77.282044685725666,90.273864934422548,56.720872417453194,78.617746115504531,79.25419112226632,83.490207927026134,80.868589265534524,51.860117568300822,85.16626641586079,92.880597866900516,91.691377019919116,null,null,null,null,null,null,null,null,null,null,null,null,null,null,null,null,null,null,null,null,null,null,null,null,null,null,"Piped water","Yes","N/A","N/A","N/A","N/A","N/A","N/A","N/A","N/A","N/A","N/A","N/A","N/A","N/A","N/A","N/A","N/A","N/A","N/A","N/A","N/A","N/A","N/A","N/A","N/A"]
[null,"No",43.94544783701982,23.347966172847574,8.3442139774583293,3.7782489819313905,2.0441867690167572,16.865991852965713,5.5505753882886362,3.9385318104856721,2.6760660318678311,2.0721321688920797,50.878380616506021,39.408457775697109,31.756053797786738,22.717955314274366,9.7261350655775463,43.279127582546629,21.382253884495285,20.745808877733879,16.509792072973987,19.131410734465508,48.139882431699263,14.83373358413926,7.1194021330993369,8.3086229800809299,null,null,null,null,null,null,null,null,null,null,null,null,null,null,null,null,null,null,null,null,null,null,null,null,null,null,null,"No","N/A","N/A","N/A","N/A","N/A","N/A","N/A","N/A","N/A","N/A","N/A","N/A","N/A","N/A","N/A","N/A","N/A","N/A","N/A","N/A","N/A","N/A","N/A","N/A"]
["Piped water on premises","Yes",42.792608445257756,68.70083519725749,86.813609709679085,95.066553302695638,97.815496581800204,76.150563780040244,91.509861407302878,95.163746719757938,96.805150822881942,97.882046403176176,34.865243018419186,47.943368121652512,58.291998886878602,69.395855816438996,84.512538298955903,53.220529639386719,70.483580928549429,75.697950091463071,78.35806474293814,75.008629904834933,51.312035546143555,68.711516499976582,91.001006629064335,87.007225758949289,null,null,null,null,null,null,null,null,null,null,null,null,null,null,null,null,null,null,null,null,null,null,null,null,null,null,"Piped water on premises","Yes","N/A","N/A","N/A","N/A","N/A","N/A","N/A","N/A","N/A","N/A","N/A","N/A","N/A","N/A","N/A","N/A","N/A","N/A","N/A","N/A","N/A","N/A","N/A","N/A"]
[null,"No",57.207391554742394,31.299164802742109,13.186390290320848,4.9334466973042979,2.1845034181998599,23.84943621995977,8.4901385926971518,4.8362532802421443,3.1948491771181557,2.1179535968238521,65.13475698158085,52.056631878347126,41.708001113120993,30.6041441835611,15.487461701044264,46.779470360613125,29.516419071450322,24.302049908537128,21.641935257062038,24.991370095165088,48.68796445385653,31.288483500023624,8.998993370935457,12.992774241050917,null,null,null,null,null,null,null,null,null,null,null,null,null,null,null,null,null,null,null,null,null,null,null,null,null,null,null,"No","N/A","N/A","N/A","N/A","N/A","N/A","N/A","N/A","N/A","N/A","N/A","N/A","N/A","N/A","N/A","N/A","N/A","N/A","N/A","N/A","N/A","N/A","N/A","N/A"]
["Piped water into dwelling","Yes","N/A","N/A","N/A","N/A","N/A","N/A","N/A","N/A","N/A","N/A","N/A","N/A","N/A","N/A","N/A","N/A","N/A","N/A","N/A","N/A","N/A","N/A","N/A","N/A",null,null,null,null,null,null,null,null,null,null,null,null,null,null,null,null,null,null,null,null,null,null,null,null,null,null,"Piped water into dwelling","Yes","N/A","N/A","N/A","N/A","N/A","N/A","N/A","N/A","N/A","N/A","N/A","N/A","N/A","N/A","N/A","N/A","N/A","N/A","N/A","N/A","N/A","N/A","N/A","N/A"]
[null,"No","N/A","N/A","N/A","N/A","N/A","N/A","N/A","N/A","N/A","N/A","N/A","N/A","N/A","N/A","N/A","N/A","N/A","N/A","N/A","N/A","N/A","N/A","N/A","N/A",null,null,null,null,null,null,null,null,null,null,null,null,null,null,null,null,null,null,null,null,null,null,null,null,null,null,null,"No","N/A","N/A","N/A","N/A","N/A","N/A","N/A","N/A","N/A","N/A","N/A","N/A","N/A","N/A","N/A","N/A","N/A","N/A","N/A","N/A","N/A","N/A","N/A","N/A"]
["Water source on premises","Yes",61.994000210066247,82.839924473333298,96.104389858044797,99.350532919633409,99.606185610328112,91.934690979046579,98.091001384178966,99.326632387300435,99.527411992172219,99.623977817161062,53.08926281020895,66.759760746987496,74.253729372235995,81.577786107610649,93.72186403928022,76.569898553091704,80.200796892750375,89.472469727785025,85.875192803434501,82.443991971139624,63.620282828989993,86.489433352420164,95.477227881794462,93.036011221085758,null,null,null,null,null,null,null,null,null,null,null,null,null,null,null,null,null,null,null,null,null,null,null,null,null,null,"Water source on premises","Yes","N/A","N/A","N/A","N/A","N/A","N/A","N/A","N/A","N/A","N/A","N/A","N/A","N/A","N/A","N/A","N/A","N/A","N/A","N/A","N/A","N/A","N/A","N/A","N/A"]
[null,"No",38.005999789933881,17.160075526666464,3.8956101419550984,0.64946708036652034,0.39381438967188892,8.0653090209535421,1.9089986158210843,0.67336761269956513,0.47258800782778337,0.3760221828389621,46.910737189791121,33.240239253012113,25.746270627763767,18.422213892389369,6.2781359607198048,23.430101446908115,19.79920310724944,10.527530272215039,14.124807196565692,17.556008028860415,36.379717171010043,13.510566647579866,4.5227721182055234,6.9639887789142545,null,null,null,null,null,null,null,null,null,null,null,null,null,null,null,null,null,null,null,null,null,null,null,null,null,null,null,"No","N/A","N/A","N/A","N/A","N/A","N/A","N/A","N/A","N/A","N/A","N/A","N/A","N/A","N/A","N/A","N/A","N/A","N/A","N/A","N/A","N/A","N/A","N/A","N/A"]
["Improved Water source on premises","Yes",95.425560271089822,95.373810251668118,98.594863884218526,99.620707525552234,99.725797806966213,97.830561083044287,99.367333072068192,99.527943849615212,99.756529815474522,99.669710733896181,94.950405681341593,95.184709981198125,95.300163142320855,94.433007306524786,97.963085226490477,96.909304433475469,97.605523130832239,98.346256195098334,97.364085937128522,95.966051446016991,98.303147104205365,99.734991166659825,98.264544541497273,99.71110802365601,null,null,null,null,null,null,null,null,null,null,null,null,null,null,null,null,null,null,null,null,null,null,null,null,null,null,"Improved water source on premises","Yes","N/A","N/A","N/A","N/A","N/A","N/A","N/A","N/A","N/A","N/A","N/A","N/A","N/A","N/A","N/A","N/A","N/A","N/A","N/A","N/A","N/A","N/A","N/A","N/A"]
[null,"No",4.5744397289103071,4.6261897483318855,1.4051361157814748,0.37929247444773956,0.27420219303382359,2.1694389169556585,0.63266692793182722,0.47205615038480536,0.24347018452547309,0.33028926610379572,5.0495943186583698,4.8152900188019192,4.6998368576791671,5.5669926934752398,2.0369147735095785,3.0906955665245248,2.3944768691677334,1.653743804901658,2.6359140628714517,4.0339485539830644,1.6968528957946494,0.2650088333401826,1.7354554585026629,0.28889197634400465,null,null,null,null,null,null,null,null,null,null,null,null,null,null,null,null,null,null,null,null,null,null,null,null,null,null,null,"No","N/A","N/A","N/A","N/A","N/A","N/A","N/A","N/A","N/A","N/A","N/A","N/A","N/A","N/A","N/A","N/A","N/A","N/A","N/A","N/A","N/A","N/A","N/A","N/A"]
["Piped water on premises available when needed","Yes","N/A","N/A","N/A","N/A","N/A","N/A","N/A","N/A","N/A","N/A","N/A","N/A","N/A","N/A","N/A","N/A","N/A","N/A","N/A","N/A","N/A","N/A","N/A","N/A",null,null,null,null,null,null,null,null,null,null,null,null,null,null,null,null,null,null,null,null,null,null,null,null,null,null,"Piped water on premises available when needed","Yes","N/A","N/A","N/A","N/A","N/A","N/A","N/A","N/A","N/A","N/A","N/A","N/A","N/A","N/A","N/A","N/A","N/A","N/A","N/A","N/A","N/A","N/A","N/A","N/A"]
[null,"No","N/A","N/A","N/A","N/A","N/A","N/A","N/A","N/A","N/A","N/A","N/A","N/A","N/A","N/A","N/A","N/A","N/A","N/A","N/A","N/A","N/A","N/A","N/A","N/A",null,null,null,null,null,null,null,null,null,null,null,null,null,null,null,null,null,null,null,null,null,null,null,null,null,null,null,"No","N/A","N/A","N/A","N/A","N/A","N/A","N/A","N/A","N/A","N/A","N/A","N/A","N/A","N/A","N/A","N/A","N/A","N/A","N/A","N/A","N/A","N/A","N/A","N/A"]
["Water point at more than 30 minutes","Yes",2.8389019415340186,0.66236281464805913,0.14672364138505264,0.15203707830646854,1.0504348141421283E-2,0.44347071660668658,0.13482474856581511,0.15373602551374141,0,1.7736024820876224E-2,4.7561378508492949,1.5471874239732917,1.0084966921413236,0.87242054771298794,5.9292639590468543E-2,0.86464768837137174,3.0121298130087295,0.25929660072374433,0.75526016470576385,0.12982152088060242,0.24282915653365142,1.93740055344595,0.18703936857624018,0.51237886821508416,null,null,null,null,null,null,null,null,null,null,null,null,null,null,null,null,null,null,null,null,null,null,null,null,null,null,"Water point at more than 30 minutes","Yes","N/A","N/A","N/A","N/A","N/A","N/A","N/A","N/A","N/A","N/A","N/A","N/A","N/A","N/A","N/A","N/A","N/A","N/A","N/A","N/A","N/A","N/A","N/A","N/A"]
[null,"No",97.161098058465939,99.337637185351895,99.853276358614949,99.847962921693508,99.989495651858576,99.556529283393331,99.865175251434181,99.846263974486263,100,99.982263975179123,95.243862149150701,98.452812576026631,98.991503307858636,99.127579452287037,99.940707360409533,99.135352311628651,96.987870186991287,99.740703399276256,99.244739835294226,99.870178479119403,99.757170843466341,98.062599446554074,99.812960631423763,99.487621131784934,null,null,null,null,null,null,null,null,null,null,null,null,null,null,null,null,null,null,null,null,null,null,null,null,null,null,null,"No","N/A","N/A","N/A","N/A","N/A","N/A","N/A","N/A","N/A","N/A","N/A","N/A","N/A","N/A","N/A","N/A","N/A","N/A","N/A","N/A","N/A","N/A","N/A","N/A"]
["Water source available when needed","Yes","N/A","N/A","N/A","N/A","N/A","N/A","N/A","N/A","N/A","N/A","N/A","N/A","N/A","N/A","N/A","N/A","N/A","N/A","N/A","N/A","N/A","N/A","N/A","N/A",null,null,null,null,null,null,null,null,null,null,null,null,null,null,null,null,null,null,null,null,null,null,null,null,null,null,"Water source available when needed","Yes","N/A","N/A","N/A","N/A","N/A","N/A","N/A","N/A","N/A","N/A","N/A","N/A","N/A","N/A","N/A","N/A","N/A","N/A","N/A","N/A","N/A","N/A","N/A","N/A"]
[null,"No","N/A","N/A","N/A","N/A","N/A","N/A","N/A","N/A","N/A","N/A","N/A","N/A","N/A","N/A","N/A","N/A","N/A","N/A","N/A","N/A","N/A","N/A","N/A","N/A",null,null,null,null,null,null,null,null,null,null,null,null,null,null,null,null,null,null,null,null,null,null,null,null,null,null,null,"No","N/A","N/A","N/A","N/A","N/A","N/A","N/A","N/A","N/A","N/A","N/A","N/A","N/A","N/A","N/A","N/A","N/A","N/A","N/A","N/A","N/A","N/A","N/A","N/A"]
["Improved water source available when needed","Yes","N/A","N/A","N/A","N/A","N/A","N/A","N/A","N/A","N/A","N/A","N/A","N/A","N/A","N/A","N/A","N/A","N/A","N/A","N/A","N/A","N/A","N/A","N/A","N/A",null,null,null,null,null,null,null,null,null,null,null,null,null,null,null,null,null,null,null,null,null,null,null,null,null,null,"Improved water source available when needed","Yes","N/A","N/A","N/A","N/A","N/A","N/A","N/A","N/A","N/A","N/A","N/A","N/A","N/A","N/A","N/A","N/A","N/A","N/A","N/A","N/A","N/A","N/A","N/A","N/A"]
[null,"No","N/A","N/A","N/A","N/A","N/A","N/A","N/A","N/A","N/A","N/A","N/A","N/A","N/A","N/A","N/A","N/A","N/A","N/A","N/A","N/A","N/A","N/A","N/A","N/A",null,null,null,null,null,null,null,null,null,null,null,null,null,null,null,null,null,null,null,null,null,null,null,null,null,null,null,"No","N/A","N/A","N/A","N/A","N/A","N/A","N/A","N/A","N/A","N/A","N/A","N/A","N/A","N/A","N/A","N/A","N/A","N/A","N/A","N/A","N/A","N/A","N/A","N/A"]
["Microbiological quality at point of collection","Not contaminated (No E. coli in 100 mL)","N/A","N/A","N/A","N/A","N/A","N/A","N/A","N/A","N/A","N/A","N/A","N/A","N/A","N/A","N/A","N/A","N/A","N/A","N/A","N/A","N/A","N/A","N/A","N/A",null,null,null,null,null,null,null,null,null,null,null,null,null,null,null,null,null,null,null,null,null,null,null,null,null,null,"Microbiological quality at point of collection","Not contaminated (No E. coli in 100 mL)","N/A","N/A","N/A","N/A","N/A","N/A","N/A","N/A","N/A","N/A","N/A","N/A","N/A","N/A","N/A","N/A","N/A","N/A","N/A","N/A","N/A","N/A","N/A","N/A"]
[null,"Contaminated (E. coli detected in 100 mL)","N/A","N/A","N/A","N/A","N/A","N/A","N/A","N/A","N/A","N/A","N/A","N/A","N/A","N/A","N/A","N/A","N/A","N/A","N/A","N/A","N/A","N/A","N/A","N/A",null,null,null,null,null,null,null,null,null,null,null,null,null,null,null,null,null,null,null,null,null,null,null,null,null,null,null,"Contaminated (E. coli detected in 100 mL)","N/A","N/A","N/A","N/A","N/A","N/A","N/A","N/A","N/A","N/A","N/A","N/A","N/A","N/A","N/A","N/A","N/A","N/A","N/A","N/A","N/A","N/A","N/A","N/A"]
[null,"Highly contaminated (>100 CFU/100 mL)","N/A","N/A","N/A","N/A","N/A","N/A","N/A","N/A","N/A","N/A","N/A","N/A","N/A","N/A","N/A","N/A","N/A","N/A","N/A","N/A","N/A","N/A","N/A","N/A",null,null,null,null,null,null,null,null,null,null,null,null,null,null,null,null,null,null,null,null,null,null,null,null,null,null,null,"Highly contaminated (>100 CFU/100 mL)","N/A","N/A","N/A","N/A","N/A","N/A","N/A","N/A","N/A","N/A","N/A","N/A","N/A","N/A","N/A","N/A","N/A","N/A","N/A","N/A","N/A","N/A","N/A","N/A"]
["Microbiological quality of improved water sources at point of collection","Not contaminated (No E. coli in 100 mL)","N/A","N/A","N/A","N/A","N/A","N/A","N/A","N/A","N/A","N/A","N/A","N/A","N/A","N/A","N/A","N/A","N/A","N/A","N/A","N/A","N/A","N/A","N/A","N/A",null,null,null,null,null,null,null,null,null,null,null,null,null,null,null,null,null,null,null,null,null,null,null,null,null,null,"Microbiological quality of improved water sources at point of collection","Not contaminated (No E. coli in 100 mL)","N/A","N/A","N/A","N/A","N/A","N/A","N/A","N/A","N/A","N/A","N/A","N/A","N/A","N/A","N/A","N/A","N/A","N/A","N/A","N/A","N/A","N/A","N/A","N/A"]
[null,"Contaminated (E. coli detected in 100 mL)","N/A","N/A","N/A","N/A","N/A","N/A","N/A","N/A","N/A","N/A","N/A","N/A","N/A","N/A","N/A","N/A","N/A","N/A","N/A","N/A","N/A","N/A","N/A","N/A",null,null,null,null,null,null,null,null,null,null,null,null,null,null,null,null,null,null,null,null,null,null,null,null,null,null,null,"Contaminated (E. coli detected in 100 mL)","N/A","N/A","N/A","N/A","N/A","N/A","N/A","N/A","N/A","N/A","N/A","N/A","N/A","N/A","N/A","N/A","N/A","N/A","N/A","N/A","N/A","N/A","N/A","N/A"]
[null,"Highly contaminated (>100 CFU/100 mL)","N/A","N/A","N/A","N/A","N/A","N/A","N/A","N/A","N/A","N/A","N/A","N/A","N/A","N/A","N/A","N/A","N/A","N/A","N/A","N/A","N/A","N/A","N/A","N/A",null,null,null,null,null,null,null,null,null,null,null,null,null,null,null,null,null,null,null,null,null,null,null,null,null,null,null,"Highly contaminated (>100 CFU/100 mL)","N/A","N/A","N/A","N/A","N/A","N/A","N/A","N/A","N/A","N/A","N/A","N/A","N/A","N/A","N/A","N/A","N/A","N/A","N/A","N/A","N/A","N/A","N/A","N/A"]
["Microbiological quality of piped on premises at point of collection","Not contaminated (No E. coli in 100 mL)","N/A","N/A","N/A","N/A","N/A","N/A","N/A","N/A","N/A","N/A","N/A","N/A","N/A","N/A","N/A","N/A","N/A","N/A","N/A","N/A","N/A","N/A","N/A","N/A",null,null,null,null,null,null,null,null,null,null,null,null,null,null,null,null,null,null,null,null,null,null,null,null,null,null,"Microbiological quality of piped on premises at point of collection","Not contaminated (No E. coli in 100 mL)","N/A","N/A","N/A","N/A","N/A","N/A","N/A","N/A","N/A","N/A","N/A","N/A","N/A","N/A","N/A","N/A","N/A","N/A","N/A","N/A","N/A","N/A","N/A","N/A"]
[null,"Contaminated (E. coli detected in 100 mL)","N/A","N/A","N/A","N/A","N/A","N/A","N/A","N/A","N/A","N/A","N/A","N/A","N/A","N/A","N/A","N/A","N/A","N/A","N/A","N/A","N/A","N/A","N/A","N/A",null,null,null,null,null,null,null,null,null,null,null,null,null,null,null,null,null,null,null,null,null,null,null,null,null,null,null,"Contaminated (E. coli detected in 100 mL)","N/A","N/A","N/A","N/A","N/A","N/A","N/A","N/A","N/A","N/A","N/A","N/A","N/A","N/A","N/A","N/A","N/A","N/A","N/A","N/A","N/A","N/A","N/A","N/A"]
[null,"Highly contaminated (>100 CFU/100 mL)","N/A","N/A","N/A","N/A","N/A","N/A","N/A","N/A","N/A","N/A","N/A","N/A","N/A","N/A","N/A","N/A","N/A","N/A","N/A","N/A","N/A","N/A","N/A","N/A",null,null,null,null,null,null,null,null,null,null,null,null,null,null,null,null,null,null,null,null,null,null,null,null,null,null,null,"Highly contaminated (>100 CFU/100 mL)","N/A","N/A","N/A","N/A","N/A","N/A","N/A","N/A","N/A","N/A","N/A","N/A","N/A","N/A","N/A","N/A","N/A","N/A","N/A","N/A","N/A","N/A","N/A","N/A"]
[null,null,"NATIONAL wealth index quintile",null,null,null,null,"URBAN wealth index quintile",null,null,null,null,"RURAL wealth index quintile",null,null,null,null,"SUB-REGIONS:",null,null,null,null,null,null,null,null,null,null,null,null,null,null,null,null,null,null,null,null,null,null,null,null,null,null,null,null,null,null,null,null,null,null,"Raw numbers of respondents:","Use of drinking water sources","NATIONAL wealth index quintile",null,null,null,null,"URBAN wealth index quintile",null,null,null,null,"RURAL wealth index quintile",null,null,null,null,"SUB-REGIONS:"]
["Percentage based on weighted population",null,"Poorest","Poor","Middle","Rich","Richest","Poorest","Poor","Middle","Rich","Richest","Poorest","Poor","Middle","Rich","Richest","Beni","Chuquisaca","Cochabamba","La Paz","Oruro","Pando","Potosí","Santa Cruz","Tarija",null,null,null,null,null,null,null,null,null,null,null,null,null,null,null,null,null,null,null,null,null,null,null,null,null,null,"Water data, raw numbers (weighted)",null,"Poorest","Poor","Middle","Rich","Richest","Poorest","Poor","Middle","Rich","Richest","Poorest","Poor","Middle","Rich","Richest","Beni","Chuquisaca","Cochabamba","La Paz","Oruro","Pando","Potosí","Santa Cruz","Tarija"]
["Source of drinking water","Piped into dwelling",0.97097205579463919,2.8244830798540685,13.566645543945208,29.474386388129361,74.272000864068474,7.7136805000331528,18.62832994320053,27.6811926095735,53.77056556696558,84.42136877546919,0.99153279386345272,1.000171960319622,1.0462132969362663,3.0800902446376046,11.890532575165999,22.091540529488221,18.807251792120169,23.983055212695035,28.158574458875229,14.561458848753453,15.688020905832703,10.132568682262194,29.613569530837928,30.055128535304849]
[null,"Piped to yard/plot",42.175521133416119,66.372037827681481,73.396294652955774,65.779847244826612,23.675101031418791,69.070757648359631,73.003012902431124,67.77170763672224,43.08870950085705,13.655576654210908,34.180703968083947,47.243490234619763,57.714075519702135,66.447675875146487,72.890808453990189,31.891176446911878,51.720466235500396,52.143045541858193,50.328890923946048,60.776194042756806,38.345062619596142,59.104458309621052,61.688170472841733,56.952097223644586]
[null,"Public tap/standpipe",13.37161685351324,8.0085675909720457,4.8505054740439517,1.157478305982381,0.14050543743523627,7.0415742897066567,2.9434655419340956,0.90044918212359071,0.51907319950659303,4.5912665824982303E-2,14.381905917447352,12.727396148779272,10.031896481570865,7.9011792394428086,5.7796512575921524,3.5504722480046031,8.1392588335885794,3.5763552737068824,5.1406184139724527,5.8856638874066958,0.57714649919468153,16.580596996009501,1.8858027714970187,4.6841512609699762]
[null,"Protected well",3.1732105201905672,4.0013243581916589,1.129333400623902,0.21134608347169631,0.25427051953538371,0.67687326404583625,0.22328320261777679,6.1854110399443447E-2,0.19209185200634563,0.21310764828069598,3.0708380615229105,3.6564889311421149,3.9661042278405096,5.5934433075827847,3.1910062221042423,2.1457501071699898,0.86951128330165073,0.6100332315764857,2.5152508237098594,3.7059293907073645,1.9302391869581479,0.25382194891134746,2.4204985629294056,0.2604083120573209]
[null,"Unprotected well",18.077259299833472,10.821375652084207,2.8326094940700148,0.52703520543215965,8.4277434446648328E-2,8.3717421025522896,1.2029906327501168,0.45974500529723389,0.15829593948049728,5.976680412202829E-2,16.697407979456891,17.060716134504304,16.27575554797026,9.6711927740179746,4.6239105589229306,28.104149951040757,3.6814644354324808,4.5662276360906224,8.5418006826320045,10.321009086795819,31.047164550387301,5.3127387002178912,2.7080554876820657,0.76649901187082237]
[null,"River/dam/",18.481583299402839,4.6933483066966222,0.5535776461611317,6.0817815402305603E-2,1.7530801929955413E-2,0.75075939032670957,0.42706866936248788,7.921224912763887E-2,0,2.9618900203815093E-2,26.673629627104269,15.062728731081677,9.2928295862153778,4.5344944865858858,0.86596791954923069,4.3301211745585757,13.766321639370757,5.3156722684455868,3.9742612908135557,3.5832535281791631,9.013312765191781,8.0442123018391349,1.1353564584370397,5.4486822851761891]
[null,"Lake/ pond/ stream",1.815772730998511,0.11887522837704828,0,2.9406339715170052E-2,2.797917497525702E-2,5.1737572094608837E-2,0,4.9772414198784518E-2,4.7205660073213536E-2,0,2.7566875747288484,1.5661954394422817,0.19537214035257713,0.14433702090143713,0,1.3199269426484765,0.20025622709519036,1.0588748200162617,2.6130022256476742E-2,0.69441225443226728,1.784452195186683,0.41265105942795194,0.19971824167269692,4.6124220544439085E-2]
[null,"Tanker truck",0.52454943545727917,1.2662453601693604,3.0860564201104856,2.507623368929905,1.3429924835883538,4.5910105130773813,3.2013412085424764,2.8818608697907488,2.0126900782201971,1.3889413167593421,0.11409117461214703,0.37547887099834359,0.22835644930271481,0.17987260938359004,9.5649586038539069E-2,1.3267837269262031,1.9312384754609921,7.9848875111084263,0,0,1.053357942692108,0,0.26930636526046003,0.87642017059280464]
[null,"Other",1.4095146713931286,1.8937425959730816,0.58497736808959577,0.25205924811052322,0.18534225260199538,1.7318647198036357,0.37050789916122073,0.11420592276707801,0.21136820289041122,0.18570723512935081,1.133202903180089,1.3073335491123117,1.2493967501088812,2.4477144423014812,0.66247342663670228,5.2400788732511421,0.88423107812968671,0.76184850450294139,1.3144733837942766,0.47207896096841484,0.56124333496053302,0.15895200171110541,7.9522108841345085E-2,0.91048897983935662]
[]
[]
[]
[]
[]
[]
[]
[]
[]
[]
[]
[]
[]
[]
[]
[]
[]
[]
[]
[]
[]
[]
[]
[]
[]
[]
[]
[]
[]
[]
[]
[]
[]
[]
[]
[]
[]
[]
[]
[]
[]
[{"$f":"A1026","v":"Bolivia (Plurinational State of)"}]
[{"$f":"A1034","v":"2008"}]
["Use of sanitation facilities"]
[" by wealth quintile and sub-national region"]
["Notes:"]
["WHO/UNICEF JMP customised wealth index excludes water,"]
[" sanitation and hygiene assets."]
["Survey used for analysis:",{"$f":"A1025","v":"DHS08"}]
[{"$f":"B1030","v":"Ratio of Improved latrines based on:"},"50% Rule"]
[{"$f":"B1029","v":"Ratio of Shared improved based on:"},"Shared among sanitation"]
[]
[]
["Use of sanitation facilities",null,"NATIONAL wealth index quintile",null,null,null,null,"URBAN wealth index quintile",null,null,null,null,"RURAL wealth index quintile",null,null,null,null,"SUB-REGIONS:",null,null,null,null,null,null,null,null,null,null,null,null,null,null,null,null,null,null,null,null,null,null,null,null,null,null,null,null,null,null,null,null,null,null,"Raw numbers of respondents:","Use of sanitation facilities","NATIONAL wealth index quintile",null,null,null,null,"URBAN wealth index quintile",null,null,null,null,"RURAL wealth index quintile",null,null,null,null,"SUB-REGIONS:"]
["Weighted percentage (used in graphs)",null,"Poorest","Poor","Middle","Rich","Richest","Poorest","Poor","Middle","Rich","Richest","Poorest","Poor","Middle","Rich","Richest","Beni","Chuquisaca","Cochabamba","La Paz","Oruro","Pando","Potosí","Santa Cruz","Tarija",null,null,null,null,null,null,null,null,null,null,null,null,null,null,null,null,null,null,null,null,null,null,null,null,null,null,"Sanitation data, raw numbers (weighted)",null,"Poorest","Poor","Middle","Rich","Richest","Poorest","Poor","Middle","Rich","Richest","Poorest","Poor","Middle","Rich","Richest","Beni","Chuquisaca","Cochabamba","La Paz","Oruro","Pando","Potosí","Santa Cruz","Tarija"]
["Sanitation","Improved",{"$f":"C135+C136+C137","v":16.621551846963378},{"$f":"D135+D136+D137","v":8.6513287371913705},47.083674547035294,71.427284834679625,89.140421660839991,30.714529557282486,63.326928154093487,73.152112960791698,82.03026758651319,93.519232898386804,1.3653961093813953,1.8782636295879354,3.1300464894385689,6.9219162550803492,24.161090926249418,29.430028191953692,36.144061293515662,44.680724123916562,48.874167017321156,40.730826278985184,29.71835588147788,28.965617488820648,46.704795768388948,51.020349286588896,null,null,null,null,null,null,null,null,null,null,null,null,null,null,null,null,null,null,null,null,null,null,null,null,null,null,"Sanitation","Improved","N/A","N/A","N/A","N/A","N/A","N/A","N/A","N/A","N/A","N/A","N/A","N/A","N/A","N/A","N/A","N/A","N/A","N/A","N/A","N/A","N/A","N/A","N/A","N/A"]
[null,"Not Improved",{"$f":"100-C122","v":83.378448153036629},{"$f":"100-D122","v":91.348671262808637},52.916325452964706,28.572715165320375,10.859578339160009,69.285470442717511,36.673071845906513,26.847887039208302,17.96973241348681,6.4807671016131962,98.634603890618607,98.121736370412066,96.86995351056143,93.078083744919653,75.838909073750585,70.569971808046304,63.855938706484338,55.319275876083438,51.125832982678844,59.269173721014816,70.281644118522124,71.034382511179359,53.295204231611052,48.979650713411104,null,null,null,null,null,null,null,null,null,null,null,null,null,null,null,null,null,null,null,null,null,null,null,null,null,null,null,"Not Improved","N/A","N/A","N/A","N/A","N/A","N/A","N/A","N/A","N/A","N/A","N/A","N/A","N/A","N/A","N/A","N/A","N/A","N/A","N/A","N/A","N/A","N/A","N/A","N/A"]
["Sanitation ladder","Basic",{"$f":"C122*C129/100","v":15.466789084455886},{"$f":"D122*D129/100","v":7.1874940017864164},28.293922472623972,45.761102115512585,78.575126675056296,18.938483966037424,35.962065198236544,44.270895508667905,61.419814928211323,87.781106020090689,1.3005432957695247,1.7515870801041336,2.8601388497218792,6.0848684870967418,21.066905121197042,22.445022468799049,27.511490800110572,35.857246049283738,36.236535312075951,29.943229251750278,22.915309634744368,20.377404149136762,34.384741255942181,40.382294647901773,null,null,null,null,null,null,null,null,null,null,null,null,null,null,null,null,null,null,null,null,null,null,null,null,null,null,"Sanitation ladder","Basic","N/A","N/A","N/A","N/A","N/A","N/A","N/A","N/A","N/A","N/A","N/A","N/A","N/A","N/A","N/A","N/A","N/A","N/A","N/A","N/A","N/A","N/A","N/A","N/A"]
[null,"Limited",{"$f":"C122*C128/100","v":1.1418931011410698},{"$f":"D122*D128/100","v":1.4535292265618984},18.743275331754823,25.511233638305342,10.467978487072441,11.768203325490887,27.270068681382948,28.78752356275449,20.418922062222972,5.6093262829733446,6.485281361187091E-2,0.12342284359298725,0.26990763971669546,0.81968464564726828,3.071606664985771,6.9850057231546323,8.5871921252685226,8.7405803507089903,12.570142834963923,10.76061135570132,6.5510958013394687,8.5882133396839091,12.24434439321411,10.638054638687208,null,null,null,null,null,null,null,null,null,null,null,null,null,null,null,null,null,null,null,null,null,null,null,null,null,null,null,"Limited","N/A","N/A","N/A","N/A","N/A","N/A","N/A","N/A","N/A","N/A","N/A","N/A","N/A","N/A","N/A","N/A","N/A","N/A","N/A","N/A","N/A","N/A","N/A","N/A"]
[null,"Unimproved",{"$f":"100-C124-C125-C127","v":14.779099177556802},{"$f":"100-D124-D125-D127","v":45.668216857934759},29.792274234309726,24.539588854296657,10.229376803606193,41.943620003966736,22.963198287245774,23.315151276718808,16.353646479668601,6.3828850574935645,20.200473566315338,32.828509698853111,38.954750145146285,45.666701760064818,43.938348366093336,60.655996358219184,15.454801239299051,26.333183277927507,23.389402903590053,9.2684211826159739,56.560455004611313,10.267793318847396,47.024353338667822,28.589537597062513,null,null,null,null,null,null,null,null,null,null,null,null,null,null,null,null,null,null,null,null,null,null,null,null,null,null,null,"Unimproved","N/A","N/A","N/A","N/A","N/A","N/A","N/A","N/A","N/A","N/A","N/A","N/A","N/A","N/A","N/A","N/A","N/A","N/A","N/A","N/A","N/A","N/A","N/A","N/A"]
[null,"Open defecation",{"$f":"C139","v":68.612218636846251},{"$f":"D139","v":45.690759913716924},23.170527961311475,4.1880753918854161,0.72751803426506934,27.349692704504953,13.804667833134729,3.6264296518587966,1.807616529897103,0.22668263944240144,78.434130324303268,65.296480377449768,57.915203365415145,47.428745107191169,31.923139847723863,9.9139754498271344,48.446515835321847,29.068990322079774,27.803918949370072,50.027738209932423,13.973139559304837,60.766589192331935,6.3465610121758953,20.390113116348505,null,null,null,null,null,null,null,null,null,null,null,null,null,null,null,null,null,null,null,null,null,null,null,null,null,null,null,"Open defecation","N/A","N/A","N/A","N/A","N/A","N/A","N/A","N/A","N/A","N/A","N/A","N/A","N/A","N/A","N/A","N/A","N/A","N/A","N/A","N/A","N/A","N/A","N/A","N/A"]
["Shared among Improved Sanitation","Yes",6.8699548132124884,16.801225230446885,39.808437875915587,35.716370428123902,11.743245423384728,38.314776410764267,43.062358267286641,39.352962474486716,24.891936431498486,5.9980456523506236,4.7497435481380599,6.5711139612528457,8.6231191973480357,11.841874640503772,12.713029698707331,23.734281454288126,23.758238056134235,19.562306838331565,25.719400661107993,26.418838847011532,22.04393751614797,29.649681533627071,26.21646062630127,20.85061115307477,null,null,null,null,null,null,null,null,null,null,null,null,null,null,null,null,null,null,null,null,null,null,null,null,null,null,"Shared among improved sanitation facilities","Yes","N/A","N/A","N/A","N/A","N/A","N/A","N/A","N/A","N/A","N/A","N/A","N/A","N/A","N/A","N/A","N/A","N/A","N/A","N/A","N/A","N/A","N/A","N/A","N/A"]
[null,"No",93.052617630775202,83.079654237249756,60.092851173625206,64.066696951211142,88.147582444715866,61.659690833672776,56.78795142365032,60.518956619060837,74.87457585510731,93.864228030472745,95.250256451861944,93.255656581520839,91.376880802652138,87.907282649233792,87.193517815494218,76.265718545711835,76.116213329480502,80.252159633398108,74.142512340381401,73.514907472425378,77.108268459179641,70.350318466373011,73.621435850951073,79.14938884692539,null,null,null,null,null,null,null,null,null,null,null,null,null,null,null,null,null,null,null,null,null,null,null,null,null,null,null,"No","N/A","N/A","N/A","N/A","N/A","N/A","N/A","N/A","N/A","N/A","N/A","N/A","N/A","N/A","N/A","N/A","N/A","N/A","N/A","N/A","N/A","N/A","N/A","N/A"]
["Manually calculated ratios","Improved latrines"]
[null,"Other"]
[null,"Other"]
[null,null,"NATIONAL wealth index quintile",null,null,null,null,"URBAN wealth index quintile",null,null,null,null,"RURAL wealth index quintile",null,null,null,null,"SUB-REGIONS:",null,null,null,null,null,null,null,null,null,null,null,null,null,null,null,null,null,null,null,null,null,null,null,null,null,null,null,null,null,null,null,null,null,null,"Raw numbers of respondents:","Use of sanitation facilities","NATIONAL wealth index quintile",null,null,null,null,"URBAN wealth index quintile",null,null,null,null,"RURAL wealth index quintile",null,null,null,null,"SUB-REGIONS:"]
["Percentage based on weighted population",null,"Poorest","Poor","Middle","Rich","Richest","Poorest","Poor","Middle","Rich","Richest","Poorest","Poor","Middle","Rich","Richest","Beni","Chuquisaca","Cochabamba","La Paz","Oruro","Pando","Potosí","Santa Cruz","Tarija",null,null,null,null,null,null,null,null,null,null,null,null,null,null,null,null,null,null,null,null,null,null,null,null,null,null,"Sanitation data, raw numbers (weighted)",null,"Poorest","Poor","Middle","Rich","Richest","Poorest","Poor","Middle","Rich","Richest","Poorest","Poor","Middle","Rich","Richest","Beni","Chuquisaca","Cochabamba","La Paz","Oruro","Pando","Potosí","Santa Cruz","Tarija"]
["Sanitation type","Sewer connection",0.40840859729457635,6.0839958240135088,39.741661714038642,56.174279294246823,69.271761328145885,26.385584368359922,54.327136153076381,58.344310495946694,64.665832856601355,72.213602687077369,0,0.56249466070053944,1.3185787772379836,4.5196886797042222,14.067051708012132,14.398205308598916,35.297682508481643,37.078044562514407,46.544653221985484,38.779041461915718,13.847251124490271,27.392881816297287,18.12153835816526,45.916708962537214,null,null,null,null,null,null,null,null,null,null,null,null,null,null,null,null,null,null,null,null,null,null,null,null,null,null,"Sanitation type","Sewer connection","N/A","N/A","N/A","N/A","N/A","N/A","N/A","N/A","N/A","N/A","N/A","N/A","N/A","N/A","N/A","N/A","N/A","N/A","N/A","N/A","N/A","N/A","N/A","N/A"]
[null,"Septic tank connection",1.446913733478429,2.5673329131778608,7.3420128329966499,15.253005540432804,19.868660332694105,4.3289451889225647,8.9997920010171057,14.807802464844999,17.364434729911832,21.305630211309442,1.3653961093813953,1.3157689688873959,1.8114677122005853,2.4022275753761266,10.094039218237286,15.031822883354776,0.84637878503402131,7.6026795614021552,2.3295137953356728,1.9517848170694678,15.871104756987609,1.5727356725233601,28.583257410223688,5.1036403240516792,null,null,null,null,null,null,null,null,null,null,null,null,null,null,null,null,null,null,null,null,null,null,null,null,null,null,null,"Septic tank connection","N/A","N/A","N/A","N/A","N/A","N/A","N/A","N/A","N/A","N/A","N/A","N/A","N/A","N/A","N/A","N/A","N/A","N/A","N/A","N/A","N/A","N/A","N/A","N/A"]
[null,"Improved latrines",{"$f":"(100-(C135+C136+C139))/2","v":14.766229516190371},0,0,0,0,0,0,0,0,0,0,0,0,0,0,0,0,0,0,0,0,0,0,0,null,null,null,null,null,null,null,null,null,null,null,null,null,null,null,null,null,null,null,null,null,null,null,null,null,null,null,"Improved latrines","N/A","N/A","N/A","N/A","N/A","N/A","N/A","N/A","N/A","N/A","N/A","N/A","N/A","N/A","N/A","N/A","N/A","N/A","N/A","N/A","N/A","N/A","N/A","N/A"]
[null,"Unimproved facilities",{"$f":"(100-(C135+C136+C139))/2","v":14.766229516190371},45.657911349091087,29.745797491653519,24.384639773434881,10.132060304894937,41.935777738212494,22.86840401277184,23.221457387349432,16.1621158835896,6.2540844621709555,20.200473566315338,32.825255992961964,38.954750145145958,45.649338637728555,43.915769226026917,60.655996358219035,15.409422871162334,26.250285554003987,23.32191403330873,9.2414355110824236,56.308504559217354,10.2677933188477,46.94864321943448,28.589537597062936,null,null,null,null,null,null,null,null,null,null,null,null,null,null,null,null,null,null,null,null,null,null,null,null,null,null,null,"Unimproved facilities","N/A","N/A","N/A","N/A","N/A","N/A","N/A","N/A","N/A","N/A","N/A","N/A","N/A","N/A","N/A","N/A","N/A","N/A","N/A","N/A","N/A","N/A","N/A","N/A"]
[null,"Open defecation",68.612218636846251,45.690759913716924,23.170527961311475,4.1880753918854161,0.72751803426506934,27.349692704504953,13.804667833134729,3.6264296518587966,1.807616529897103,0.22668263944240144,78.434130324303268,65.296480377449768,57.915203365415145,47.428745107191169,31.923139847723863,9.9139754498271344,48.446515835321847,29.068990322079774,27.803918949370072,50.027738209932423,13.973139559304837,60.766589192331935,6.3465610121758953,20.390113116348505,null,null,null,null,null,null,null,null,null,null,null,null,null,null,null,null,null,null,null,null,null,null,null,null,null,null,null,"Open defecation","N/A","N/A","N/A","N/A","N/A","N/A","N/A","N/A","N/A","N/A","N/A","N/A","N/A","N/A","N/A","N/A","N/A","N/A","N/A","N/A","N/A","N/A","N/A","N/A"]
["Septic tank emptying practices","Not emptied/treated and disposed in situ","N/A","N/A","N/A","N/A","N/A","N/A","N/A","N/A","N/A","N/A","N/A","N/A","N/A","N/A","N/A","N/A","N/A","N/A","N/A","N/A","N/A","N/A","N/A","N/A",null,null,null,null,null,null,null,null,null,null,null,null,null,null,null,null,null,null,null,null,null,null,null,null,null,null,"Septic tank emptying practices","Not emptied/treated and disposed in situ","N/A","N/A","N/A","N/A","N/A","N/A","N/A","N/A","N/A","N/A","N/A","N/A","N/A","N/A","N/A","N/A","N/A","N/A","N/A","N/A","N/A","N/A","N/A","N/A"]
[null,"Emptied and buried on site","N/A","N/A","N/A","N/A","N/A","N/A","N/A","N/A","N/A","N/A","N/A","N/A","N/A","N/A","N/A","N/A","N/A","N/A","N/A","N/A","N/A","N/A","N/A","N/A",null,null,null,null,null,null,null,null,null,null,null,null,null,null,null,null,null,null,null,null,null,null,null,null,null,null,null,"Emptied and buried on site","N/A","N/A","N/A","N/A","N/A","N/A","N/A","N/A","N/A","N/A","N/A","N/A","N/A","N/A","N/A","N/A","N/A","N/A","N/A","N/A","N/A","N/A","N/A","N/A"]
[null,"Emptied and discharged locally","N/A","N/A","N/A","N/A","N/A","N/A","N/A","N/A","N/A","N/A","N/A","N/A","N/A","N/A","N/A","N/A","N/A","N/A","N/A","N/A","N/A","N/A","N/A","N/A",null,null,null,null,null,null,null,null,null,null,null,null,null,null,null,null,null,null,null,null,null,null,null,null,null,null,null,"Emptied and discharged locally","N/A","N/A","N/A","N/A","N/A","N/A","N/A","N/A","N/A","N/A","N/A","N/A","N/A","N/A","N/A","N/A","N/A","N/A","N/A","N/A","N/A","N/A","N/A","N/A"]
[null,"Emptied and removed offsite","N/A","N/A","N/A","N/A","N/A","N/A","N/A","N/A","N/A","N/A","N/A","N/A","N/A","N/A","N/A","N/A","N/A","N/A","N/A","N/A","N/A","N/A","N/A","N/A",null,null,null,null,null,null,null,null,null,null,null,null,null,null,null,null,null,null,null,null,null,null,null,null,null,null,null,"Emptied and removed offsite","N/A","N/A","N/A","N/A","N/A","N/A","N/A","N/A","N/A","N/A","N/A","N/A","N/A","N/A","N/A","N/A","N/A","N/A","N/A","N/A","N/A","N/A","N/A","N/A"]
["Latrine emptying practices","Not emptied/treated and disposed in situ","N/A","N/A","N/A","N/A","N/A","N/A","N/A","N/A","N/A","N/A","N/A","N/A","N/A","N/A","N/A","N/A","N/A","N/A","N/A","N/A","N/A","N/A","N/A","N/A",null,null,null,null,null,null,null,null,null,null,null,null,null,null,null,null,null,null,null,null,null,null,null,null,null,null,"Latrine emptying practices","Not emptied/treated and disposed in situ","N/A","N/A","N/A","N/A","N/A","N/A","N/A","N/A","N/A","N/A","N/A","N/A","N/A","N/A","N/A","N/A","N/A","N/A","N/A","N/A","N/A","N/A","N/A","N/A"]
[null,"Emptied and buried on site","N/A","N/A","N/A","N/A","N/A","N/A","N/A","N/A","N/A","N/A","N/A","N/A","N/A","N/A","N/A","N/A","N/A","N/A","N/A","N/A","N/A","N/A","N/A","N/A",null,null,null,null,null,null,null,null,null,null,null,null,null,null,null,null,null,null,null,null,null,null,null,null,null,null,null,"Emptied and buried on site","N/A","N/A","N/A","N/A","N/A","N/A","N/A","N/A","N/A","N/A","N/A","N/A","N/A","N/A","N/A","N/A","N/A","N/A","N/A","N/A","N/A","N/A","N/A","N/A"]
[null,"Emptied and discharged locally","N/A","N/A","N/A","N/A","N/A","N/A","N/A","N/A","N/A","N/A","N/A","N/A","N/A","N/A","N/A","N/A","N/A","N/A","N/A","N/A","N/A","N/A","N/A","N/A",null,null,null,null,null,null,null,null,null,null,null,null,null,null,null,null,null,null,null,null,null,null,null,null,null,null,null,"Emptied and discharged locally","N/A","N/A","N/A","N/A","N/A","N/A","N/A","N/A","N/A","N/A","N/A","N/A","N/A","N/A","N/A","N/A","N/A","N/A","N/A","N/A","N/A","N/A","N/A","N/A"]
[null,"Emptied and removed offsite","N/A","N/A","N/A","N/A","N/A","N/A","N/A","N/A","N/A","N/A","N/A","N/A","N/A","N/A","N/A","N/A","N/A","N/A","N/A","N/A","N/A","N/A","N/A","N/A",null,null,null,null,null,null,null,null,null,null,null,null,null,null,null,null,null,null,null,null,null,null,null,null,null,null,null,"Emptied and removed offsite","N/A","N/A","N/A","N/A","N/A","N/A","N/A","N/A","N/A","N/A","N/A","N/A","N/A","N/A","N/A","N/A","N/A","N/A","N/A","N/A","N/A","N/A","N/A","N/A"]
["Shared among improved sanitation facilities","Yes","N/A","N/A","N/A","N/A","N/A","N/A","N/A","N/A","N/A","N/A","N/A","N/A","N/A","N/A","N/A","N/A","N/A","N/A","N/A","N/A","N/A","N/A","N/A","N/A",null,null,null,null,null,null,null,null,null,null,null,null,null,null,null,null,null,null,null,null,null,null,null,null,null,null,"Shared among improved sanitation facilities","Yes","N/A","N/A","N/A","N/A","N/A","N/A","N/A","N/A","N/A","N/A","N/A","N/A","N/A","N/A","N/A","N/A","N/A","N/A","N/A","N/A","N/A","N/A","N/A","N/A"]
[null,"No","N/A","N/A","N/A","N/A","N/A","N/A","N/A","N/A","N/A","N/A","N/A","N/A","N/A","N/A","N/A","N/A","N/A","N/A","N/A","N/A","N/A","N/A","N/A","N/A",null,null,null,null,null,null,null,null,null,null,null,null,null,null,null,null,null,null,null,null,null,null,null,null,null,null,null,"No","N/A","N/A","N/A","N/A","N/A","N/A","N/A","N/A","N/A","N/A","N/A","N/A","N/A","N/A","N/A","N/A","N/A","N/A","N/A","N/A","N/A","N/A","N/A","N/A"]
[null,"DK/missing","N/A","N/A","N/A","N/A","N/A","N/A","N/A","N/A","N/A","N/A","N/A","N/A","N/A","N/A","N/A","N/A","N/A","N/A","N/A","N/A","N/A","N/A","N/A","N/A",null,null,null,null,null,null,null,null,null,null,null,null,null,null,null,null,null,null,null,null,null,null,null,null,null,null,null,"DK/missing","N/A","N/A","N/A","N/A","N/A","N/A","N/A","N/A","N/A","N/A","N/A","N/A","N/A","N/A","N/A","N/A","N/A","N/A","N/A","N/A","N/A","N/A","N/A","N/A"]
["Shared among all sanitation facilities","Yes",6.8699548132124884,16.801225230446885,39.808437875915587,35.716370428123902,11.743245423384728,38.314776410764267,43.062358267286641,39.352962474486716,24.891936431498486,5.9980456523506236,4.7497435481380599,6.5711139612528457,8.6231191973480357,11.841874640503772,12.713029698707331,23.734281454288126,23.758238056134235,19.562306838331565,25.719400661107993,26.418838847011532,22.04393751614797,29.649681533627071,26.21646062630127,20.85061115307477,null,null,null,null,null,null,null,null,null,null,null,null,null,null,null,null,null,null,null,null,null,null,null,null,null,null,"Shared among all sanitation facilities","Yes","N/A","N/A","N/A","N/A","N/A","N/A","N/A","N/A","N/A","N/A","N/A","N/A","N/A","N/A","N/A","N/A","N/A","N/A","N/A","N/A","N/A","N/A","N/A","N/A"]
[null,"No",93.052617630775202,83.079654237249756,60.092851173625206,64.066696951211142,88.147582444715866,61.659690833672776,56.78795142365032,60.518956619060837,74.87457585510731,93.864228030472745,95.250256451861944,93.255656581520839,91.376880802652138,87.907282649233792,87.193517815494218,76.265718545711835,76.116213329480502,80.252159633398108,74.142512340381401,73.514907472425378,77.108268459179641,70.350318466373011,73.621435850951073,79.14938884692539,null,null,null,null,null,null,null,null,null,null,null,null,null,null,null,null,null,null,null,null,null,null,null,null,null,null,null,"No","N/A","N/A","N/A","N/A","N/A","N/A","N/A","N/A","N/A","N/A","N/A","N/A","N/A","N/A","N/A","N/A","N/A","N/A","N/A","N/A","N/A","N/A","N/A","N/A"]
["Main source sanitation services,sewer,septic,open pit,surfac","Sewage system",1.2759111849875389,11.111594391536912,51.232156481624017,58.539844803246496,69.659684842888183,35.868862735041894,62.840657898063213,60.459840555983831,65.737408497911559,72.332259311849583,0,1.6044480385373601,3.0939563664634977,8.5477322128749229,20.360321290234751,15.818568274821999,66.969525994120104,51.919853150435856,64.276064358805314,77.481854126733978,15.553704795534816,69.007260511434097,19.26983156105965,57.423072329195037,null,null,null,null,null,null,null,null,null,null,null,null,null,null,null,null,null,null,null,null,null,null,null,null,null,null,"Main source sanitation services,sewer,septic,open pit,surfac","Sewage system",63.424366000000006,944.99511399999983,6171.4854740000328,8729.3655199999776,10752.798572999965,2427.0526819999964,4991.4658600000103,5362.3727859999917,5944.835026000007,6638.9150480000017,0,35.628479999999996,83.586759000000001,286.32769100000007,891.88471500000014,375.00021800000002,1692.4843929999959,5347.8064260000001,10651.935280999984,1682.8750540000051,63.295230999999994,2243.1632719999998,2972.6326380000019,1632.8765340000032]
[null,"Septic system",4.5203098771342223,4.6888858612753541,9.464806807947415,15.895327689792794,19.979925304187589,5.8848172017436751,10.410135529619961,15.344724590947562,17.65218027434728,21.340638216386733,6.1118071279155366,3.7530719645774626,4.2504870831805617,4.5431443366676092,14.609876032693112,16.514691343744818,1.6058160767803304,10.645922972348137,3.216953361315285,3.8997329686828177,17.826966229608303,3.9619847592988706,30.394470098243165,6.3825721418607095,null,null,null,null,null,null,null,null,null,null,null,null,null,null,null,null,null,null,null,null,null,null,null,null,null,null,null,"Septic system",224.70042700000002,398.7703360000001,1140.1416950000009,2370.2851609999993,3084.1384479999988,398.19387299999988,826.88243299999988,1360.9717259999989,1596.3406829999997,1958.7205699999997,86.583843999999999,83.340966000000009,114.83175499999999,152.18399399999996,639.98622300000022,391.50274199999984,40.582915999999997,1096.5426870000006,533.11881100000016,84.700649000000013,72.546185000000023,128.78903800000001,4688.7588789999945,181.49415999999994]
[null,"Open pit",92.147287903870151,83.198398424777736,38.332218182693303,25.278662975350581,10.168888067103868,56.933341930402314,26.430885687751481,23.891630752864774,16.345417209810492,6.2643607608973486,90.250644183789504,93.48129690829623,91.19593401754868,86.170780520237443,63.562656177658006,66.639626196802013,28.87729758433283,36.725822506506347,32.05246263122914,18.336393237433029,62.512188615849674,25.781999945094807,49.923600799109231,35.753849140926555,null,null,null,null,null,null,null,null,null,null,null,null,null,null,null,null,null,null,null,null,null,null,null,null,null,null,null,"Open pit",4580.5565329999927,7075.6794420000024,4617.5438229999863,3769.5127090000024,1569.6884839999987,3852.3724949999983,2099.4188790000007,2119.0236259999974,1478.166099999999,574.96557299999961,1278.5494589999976,2075.8519050000009,2463.7621400000035,2886.5060350000003,2784.3647790000018,1579.7810469999993,729.80022999999937,3782.8032569999923,5311.7869139999912,398.25916799999999,254.39105799999993,838.0746450000006,7701.3919229999901,1016.6927490000003]
[null,"Surface water (street/stream)",2.0564910340080478,1.0011213224099089,0.97081852773551525,0.28616453161012673,0.1915017858203035,1.3129781328121921,0.31832088456526547,0.30380410020361737,0.2649940179305188,6.2741710866485473E-2,3.6375486882949066,1.1611830885889529,1.4596225328073986,0.73834293022011566,1.4671464994144445,1.0271141846311747,2.5473603447667514,0.70840137070962172,0.45451964865033678,0.28201966715020255,4.1071403590071931,1.2487547841723257,0.41209754158731193,0.44050638801789987,null,null,null,null,null,null,null,null,null,null,null,null,null,null,null,null,null,null,null,null,null,null,null,null,null,null,null,"Surface water (street/stream)",102.22626899999999,85.14122500000002,116.94593499999999,42.672384999999998,29.560571999999997,88.842155999999989,25.284392000000008,26.945338,23.964219999999997,5.7586599999999999,51.531886,25.785308999999998,39.433367000000004,24.732644999999998,64.268412999999995,24.349108999999999,64.378051999999997,72.966180999999992,75.323744999999988,6.1253549999999999,16.713857000000001,40.592263000000003,63.571630000000006,12.526194]
[null,null,null,null,null,null,null,null,null,null,null,null,null,null,null,null,null,null,null,null,null,null,null,null,null,null,null,null,null,null,null,null,null,null,null,null,null,null,null,null,null,null,null,null,null,null,null,null,null,null,null,null,null,"Total",4970.9075949999951,8504.5861170000098,12046.11692699999,14911.83577499998,15436.186076999971,6766.461205999989,7943.0515640000176,8869.3134760000066,9043.3060290000194,9178.3598509999883,1416.6651889999982,2220.6066600000008,2701.6140209999999,3349.7503649999971,4380.5041299999884,2370.6331159999991,2527.2455909999949,10300.118550999996,16572.164750999964,2171.9602260000047,406.94633099999999,3250.6192179999971,15426.355070000085,2843.5896369999978]
[]
[]
[]
[]
[]
[]
[]
[]
[]
[]
[]
[]
[]
[]
[]
[]
[]
[]
[]
[]
[]
[]
[]
[]
[]
[]
[]
[]
[]
[]
[]
[]
[]
[]
[]
[]
[]
[]
[]
[]
[]
[]
[]
[]
[]
[]
[]
[]
[]
[]
[{"$f":"A1026","v":"Bolivia (Plurinational State of)"}]
[{"$f":"A1034","v":"2008"}]
["Access to hygiene facilities "]
[" by wealth quintile and sub-national region"]
["Notes:"]
["WHO/UNICEF JMP customised wealth index excludes water,"]
[" sanitation and hygiene assets."]
["Survey used for analysis:",{"$f":"A1025","v":"DHS08"}]
[]
[]
[]
[]
["Access to handwashing",null,"NATIONAL wealth index quintile",null,null,null,null,"URBAN wealth index quintile",null,null,null,null,"RURAL wealth index quintile",null,null,null,null,"SUB-REGIONS:",null,null,null,null,null,null,null,null,null,null,null,null,null,null,null,null,null,null,null,null,null,null,null,null,null,null,null,null,null,null,null,null,null,null,"Raw numbers of respondents:","Access to handwashing","NATIONAL wealth index quintile",null,null,null,null,"URBAN wealth index quintile",null,null,null,null,"RURAL wealth index quintile",null,null,null,null,"SUB-REGIONS:"]
["Weighted percentage (used in graphs)",null,"Poorest","Poor","Middle","Rich","Richest","Poorest","Poor","Middle","Rich","Richest","Poorest","Poor","Middle","Rich","Richest","Beni","Chuquisaca","Cochabamba","La Paz","Oruro","Pando","Potosí","Santa Cruz","Tarija",null,null,null,null,null,null,null,null,null,null,null,null,null,null,null,null,null,null,null,null,null,null,null,null,null,null,"Hygiene data, raw numbers (weighted)",null,"Poorest","Poor","Middle","Rich","Richest","Poorest","Poor","Middle","Rich","Richest","Poorest","Poor","Middle","Rich","Richest","Beni","Chuquisaca","Cochabamba","La Paz","Oruro","Pando","Potosí","Santa Cruz","Tarija"]
["Hygiene ladder","Basic","N/A","N/A","N/A","N/A","N/A","N/A","N/A","N/A","N/A","N/A","N/A","N/A","N/A","N/A","N/A","N/A","N/A","N/A","N/A","N/A","N/A","N/A","N/A","N/A",null,null,null,null,null,null,null,null,null,null,null,null,null,null,null,null,null,null,null,null,null,null,null,null,null,null,"Hygiene ladder","Basic","N/A","N/A","N/A","N/A","N/A","N/A","N/A","N/A","N/A","N/A","N/A","N/A","N/A","N/A","N/A","N/A","N/A","N/A","N/A","N/A","N/A","N/A","N/A","N/A"]
[null,"Limited","N/A","N/A","N/A","N/A","N/A","N/A","N/A","N/A","N/A","N/A","N/A","N/A","N/A","N/A","N/A","N/A","N/A","N/A","N/A","N/A","N/A","N/A","N/A","N/A",null,null,null,null,null,null,null,null,null,null,null,null,null,null,null,null,null,null,null,null,null,null,null,null,null,null,null,"Limited","N/A","N/A","N/A","N/A","N/A","N/A","N/A","N/A","N/A","N/A","N/A","N/A","N/A","N/A","N/A","N/A","N/A","N/A","N/A","N/A","N/A","N/A","N/A","N/A"]
[null,"No facility","N/A","N/A","N/A","N/A","N/A","N/A","N/A","N/A","N/A","N/A","N/A","N/A","N/A","N/A","N/A","N/A","N/A","N/A","N/A","N/A","N/A","N/A","N/A","N/A",null,null,null,null,null,null,null,null,null,null,null,null,null,null,null,null,null,null,null,null,null,null,null,null,null,null,null,"No facility","N/A","N/A","N/A","N/A","N/A","N/A","N/A","N/A","N/A","N/A","N/A","N/A","N/A","N/A","N/A","N/A","N/A","N/A","N/A","N/A","N/A","N/A","N/A","N/A"]
[null,null,null,null,null,null,null,null,null,null,null,null,null,null,null,null,null,null,null,null,null,null,null,null,null,null,null,null,null,null,null,null,null,null,null,null,null,null,null,null,null,null,null,null,null,null,null,null,null,null,null,null,"Observed handwashing place","Fixed","N/A","N/A","N/A","N/A","N/A","N/A","N/A","N/A","N/A","N/A","N/A","N/A","N/A","N/A","N/A","N/A","N/A","N/A","N/A","N/A","N/A","N/A","N/A","N/A"]
[null,null,null,null,null,null,null,null,null,null,null,null,null,null,null,null,null,null,null,null,null,null,null,null,null,null,null,null,null,null,null,null,null,null,null,null,null,null,null,null,null,null,null,null,null,null,null,null,null,null,null,null,null,"Mobile","N/A","N/A","N/A","N/A","N/A","N/A","N/A","N/A","N/A","N/A","N/A","N/A","N/A","N/A","N/A","N/A","N/A","N/A","N/A","N/A","N/A","N/A","N/A","N/A"]
[null,null,null,null,null,null,null,null,null,null,null,null,null,null,null,null,null,null,null,null,null,null,null,null,null,null,null,null,null,null,null,null,null,null,null,null,null,null,null,null,null,null,null,null,null,null,null,null,null,null,null,null,"Water / Soap","Water and soap","N/A","N/A","N/A","N/A","N/A","N/A","N/A","N/A","N/A","N/A","N/A","N/A","N/A","N/A","N/A","N/A","N/A","N/A","N/A","N/A","N/A","N/A","N/A","N/A"]
[null,null,null,null,null,null,null,null,null,null,null,null,null,null,null,null,null,null,null,null,null,null,null,null,null,null,null,null,null,null,null,null,null,null,null,null,null,null,null,null,null,null,null,null,null,null,null,null,null,null,null,null,null,"Water only","N/A","N/A","N/A","N/A","N/A","N/A","N/A","N/A","N/A","N/A","N/A","N/A","N/A","N/A","N/A","N/A","N/A","N/A","N/A","N/A","N/A","N/A","N/A","N/A"]
[null,null,null,null,null,null,null,null,null,null,null,null,null,null,null,null,null,null,null,null,null,null,null,null,null,null,null,null,null,null,null,null,null,null,null,null,null,null,null,null,null,null,null,null,null,null,null,null,null,null,null,null,null,"Soap only","N/A","N/A","N/A","N/A","N/A","N/A","N/A","N/A","N/A","N/A","N/A","N/A","N/A","N/A","N/A","N/A","N/A","N/A","N/A","N/A","N/A","N/A","N/A","N/A"]
[null,null,null,null,null,null,null,null,null,null,null,null,null,null,null,null,null,null,null,null,null,null,null,null,null,null,null,null,null,null,null,null,null,null,null,null,null,null,null,null,null,null,null,null,null,null,null,null,null,null,null,null,null,"Neither","N/A","N/A","N/A","N/A","N/A","N/A","N/A","N/A","N/A","N/A","N/A","N/A","N/A","N/A","N/A","N/A","N/A","N/A","N/A","N/A","N/A","N/A","N/A","N/A"]
[]
[]
[]
[]
[]
[]
[]
[]
[]
[]
[]
[]
[]
[]
[]
[]
[]
[]
[]
[]
[]
[]
[]
[]
[]
[]
[]
[]
[null,null,null,null,null,null,null,null,null,null,null,null,null,null,null,null,null,null,null,null,null,null,null,null,null,null,null,null,null,null,null,null,null,null,null,null,null,null,null,null,null,null,null,null,null,null,null,null,null,null,null,null,"Raw numbers of respondents:","Menstrual health and hygiene","NATIONAL wealth index quintile",null,null,null,null,"URBAN wealth index quintile",null,null,null,null,"RURAL wealth index quintile",null,null,null,null,"SUB-REGIONS:"]
[null,null,null,null,null,null,null,null,null,null,null,null,null,null,null,null,null,null,null,null,null,null,null,null,null,null,null,null,null,null,null,null,null,null,null,null,null,null,null,null,null,null,null,null,null,null,null,null,null,null,null,null,"MHH data, raw numbers (weighted)",null,"Poorest","Poor","Middle","Rich","Richest","Poorest","Poor","Middle","Rich","Richest","Poorest","Poor","Middle","Rich","Richest","Beni","Chuquisaca","Cochabamba","La Paz","Oruro","Pando","Potosí","Santa Cruz","Tarija"]
[null,null,null,null,null,null,null,null,null,null,null,null,null,null,null,null,null,null,null,null,null,null,null,null,null,null,null,null,null,null,null,null,null,null,null,null,null,null,null,null,null,null,null,null,null,null,null,null,null,null,null,null,"Private place to wash and change","Yes","N/A","N/A","N/A","N/A","N/A","N/A","N/A","N/A","N/A","N/A","N/A","N/A","N/A","N/A","N/A","N/A","N/A","N/A","N/A","N/A","N/A","N/A","N/A","N/A"]
[null,null,null,null,null,null,null,null,null,null,null,null,null,null,null,null,null,null,null,null,null,null,null,null,null,null,null,null,null,null,null,null,null,null,null,null,null,null,null,null,null,null,null,null,null,null,null,null,null,null,null,null,null,"No","N/A","N/A","N/A","N/A","N/A","N/A","N/A","N/A","N/A","N/A","N/A","N/A","N/A","N/A","N/A","N/A","N/A","N/A","N/A","N/A","N/A","N/A","N/A","N/A"]
[null,null,null,null,null,null,null,null,null,null,null,null,null,null,null,null,null,null,null,null,null,null,null,null,null,null,null,null,null,null,null,null,null,null,null,null,null,null,null,null,null,null,null,null,null,null,null,null,null,null,null,null,null,"DK/not sure/missing","N/A","N/A","N/A","N/A","N/A","N/A","N/A","N/A","N/A","N/A","N/A","N/A","N/A","N/A","N/A","N/A","N/A","N/A","N/A","N/A","N/A","N/A","N/A","N/A"]
[null,null,null,null,null,null,null,null,null,null,null,null,null,null,null,null,null,null,null,null,null,null,null,null,null,null,null,null,null,null,null,null,null,null,null,null,null,null,null,null,null,null,null,null,null,null,null,null,null,null,null,null,"Use of menstrual materials","Materials reusable","N/A","N/A","N/A","N/A","N/A","N/A","N/A","N/A","N/A","N/A","N/A","N/A","N/A","N/A","N/A","N/A","N/A","N/A","N/A","N/A","N/A","N/A","N/A","N/A"]
[null,null,null,null,null,null,null,null,null,null,null,null,null,null,null,null,null,null,null,null,null,null,null,null,null,null,null,null,null,null,null,null,null,null,null,null,null,null,null,null,null,null,null,null,null,null,null,null,null,null,null,null,null,"Materials not reusable","N/A","N/A","N/A","N/A","N/A","N/A","N/A","N/A","N/A","N/A","N/A","N/A","N/A","N/A","N/A","N/A","N/A","N/A","N/A","N/A","N/A","N/A","N/A","N/A"]
[null,null,null,null,null,null,null,null,null,null,null,null,null,null,null,null,null,null,null,null,null,null,null,null,null,null,null,null,null,null,null,null,null,null,null,null,null,null,null,null,null,null,null,null,null,null,null,null,null,null,null,null,null,"No materials used","N/A","N/A","N/A","N/A","N/A","N/A","N/A","N/A","N/A","N/A","N/A","N/A","N/A","N/A","N/A","N/A","N/A","N/A","N/A","N/A","N/A","N/A","N/A","N/A"]
[null,null,null,null,null,null,null,null,null,null,null,null,null,null,null,null,null,null,null,null,null,null,null,null,null,null,null,null,null,null,null,null,null,null,null,null,null,null,null,null,null,null,null,null,null,null,null,null,null,null,null,null,null,"DK/not sure/missing","N/A","N/A","N/A","N/A","N/A","N/A","N/A","N/A","N/A","N/A","N/A","N/A","N/A","N/A","N/A","N/A","N/A","N/A","N/A","N/A","N/A","N/A","N/A","N/A"]
[null,null,null,null,null,null,null,null,null,null,null,null,null,null,null,null,null,null,null,null,null,null,null,null,null,null,null,null,null,null,null,null,null,null,null,null,null,null,null,null,null,null,null,null,null,null,null,null,null,null,null,null,"Use of menstrual materials with private place to wash and change","Materials reusable","N/A","N/A","N/A","N/A","N/A","N/A","N/A","N/A","N/A","N/A","N/A","N/A","N/A","N/A","N/A","N/A","N/A","N/A","N/A","N/A","N/A","N/A","N/A","N/A"]
[null,null,null,null,null,null,null,null,null,null,null,null,null,null,null,null,null,null,null,null,null,null,null,null,null,null,null,null,null,null,null,null,null,null,null,null,null,null,null,null,null,null,null,null,null,null,null,null,null,null,null,null,null,"Materials not reusable","N/A","N/A","N/A","N/A","N/A","N/A","N/A","N/A","N/A","N/A","N/A","N/A","N/A","N/A","N/A","N/A","N/A","N/A","N/A","N/A","N/A","N/A","N/A","N/A"]
[null,null,null,null,null,null,null,null,null,null,null,null,null,null,null,null,null,null,null,null,null,null,null,null,null,null,null,null,null,null,null,null,null,null,null,null,null,null,null,null,null,null,null,null,null,null,null,null,null,null,null,null,null,"No materials used","N/A","N/A","N/A","N/A","N/A","N/A","N/A","N/A","N/A","N/A","N/A","N/A","N/A","N/A","N/A","N/A","N/A","N/A","N/A","N/A","N/A","N/A","N/A","N/A"]
[null,null,null,null,null,null,null,null,null,null,null,null,null,null,null,null,null,null,null,null,null,null,null,null,null,null,null,null,null,null,null,null,null,null,null,null,null,null,null,null,null,null,null,null,null,null,null,null,null,null,null,null,"Awareness of menstruation before menarche","Yes","N/A","N/A","N/A","N/A","N/A","N/A","N/A","N/A","N/A","N/A","N/A","N/A","N/A","N/A","N/A","N/A","N/A","N/A","N/A","N/A","N/A","N/A","N/A","N/A"]
[null,null,null,null,null,null,null,null,null,null,null,null,null,null,null,null,null,null,null,null,null,null,null,null,null,null,null,null,null,null,null,null,null,null,null,null,null,null,null,null,null,null,null,null,null,null,null,null,null,null,null,null,null,"No","N/A","N/A","N/A","N/A","N/A","N/A","N/A","N/A","N/A","N/A","N/A","N/A","N/A","N/A","N/A","N/A","N/A","N/A","N/A","N/A","N/A","N/A","N/A","N/A"]
[null,null,null,null,null,null,null,null,null,null,null,null,null,null,null,null,null,null,null,null,null,null,null,null,null,null,null,null,null,null,null,null,null,null,null,null,null,null,null,null,null,null,null,null,null,null,null,null,null,null,null,null,null,"DK/not sure/missing","N/A","N/A","N/A","N/A","N/A","N/A","N/A","N/A","N/A","N/A","N/A","N/A","N/A","N/A","N/A","N/A","N/A","N/A","N/A","N/A","N/A","N/A","N/A","N/A"]
[null,null,null,null,null,null,null,null,null,null,null,null,null,null,null,null,null,null,null,null,null,null,null,null,null,null,null,null,null,null,null,null,null,null,null,null,null,null,null,null,null,null,null,null,null,null,null,null,null,null,null,null,"Participation in (all) activities during menstruation","Yes","N/A","N/A","N/A","N/A","N/A","N/A","N/A","N/A","N/A","N/A","N/A","N/A","N/A","N/A","N/A","N/A","N/A","N/A","N/A","N/A","N/A","N/A","N/A","N/A"]
[null,null,null,null,null,null,null,null,null,null,null,null,null,null,null,null,null,null,null,null,null,null,null,null,null,null,null,null,null,null,null,null,null,null,null,null,null,null,null,null,null,null,null,null,null,null,null,null,null,null,null,null,null,"No","N/A","N/A","N/A","N/A","N/A","N/A","N/A","N/A","N/A","N/A","N/A","N/A","N/A","N/A","N/A","N/A","N/A","N/A","N/A","N/A","N/A","N/A","N/A","N/A"]
[null,null,null,null,null,null,null,null,null,null,null,null,null,null,null,null,null,null,null,null,null,null,null,null,null,null,null,null,null,null,null,null,null,null,null,null,null,null,null,null,null,null,null,null,null,null,null,null,null,null,null,null,null,"DK/not sure/missing/no such activity","N/A","N/A","N/A","N/A","N/A","N/A","N/A","N/A","N/A","N/A","N/A","N/A","N/A","N/A","N/A","N/A","N/A","N/A","N/A","N/A","N/A","N/A","N/A","N/A"]
[null,null,null,null,null,null,null,null,null,null,null,null,null,null,null,null,null,null,null,null,null,null,null,null,null,null,null,null,null,null,null,null,null,null,null,null,null,null,null,null,null,null,null,null,null,null,null,null,null,null,null,null,"Participation in specific activities during menstruation","Did not go to school (amongst those usually attending school)","N/A","N/A","N/A","N/A","N/A","N/A","N/A","N/A","N/A","N/A","N/A","N/A","N/A","N/A","N/A","N/A","N/A","N/A","N/A","N/A","N/A","N/A","N/A","N/A"]
[null,null,null,null,null,null,null,null,null,null,null,null,null,null,null,null,null,null,null,null,null,null,null,null,null,null,null,null,null,null,null,null,null,null,null,null,null,null,null,null,null,null,null,null,null,null,null,null,null,null,null,null,null,"Did not go to work (amongst those who usually work)","N/A","N/A","N/A","N/A","N/A","N/A","N/A","N/A","N/A","N/A","N/A","N/A","N/A","N/A","N/A","N/A","N/A","N/A","N/A","N/A","N/A","N/A","N/A","N/A"]
[null,null,null,null,null,null,null,null,null,null,null,null,null,null,null,null,null,null,null,null,null,null,null,null,null,null,null,null,null,null,null,null,null,null,null,null,null,null,null,null,null,null,null,null,null,null,null,null,null,null,null,null,null,"Did not participate in social activities","N/A","N/A","N/A","N/A","N/A","N/A","N/A","N/A","N/A","N/A","N/A","N/A","N/A","N/A","N/A","N/A","N/A","N/A","N/A","N/A","N/A","N/A","N/A","N/A"]
[null,null,null,null,null,null,null,null,null,null,null,null,null,null,null,null,null,null,null,null,null,null,null,null,null,null,null,null,null,null,null,null,null,null,null,null,null,null,null,null,null,null,null,null,null,null,null,null,null,null,null,null,null,"Did not cook food","N/A","N/A","N/A","N/A","N/A","N/A","N/A","N/A","N/A","N/A","N/A","N/A","N/A","N/A","N/A","N/A","N/A","N/A","N/A","N/A","N/A","N/A","N/A","N/A"]
[null,null,null,null,null,null,null,null,null,null,null,null,null,null,null,null,null,null,null,null,null,null,null,null,null,null,null,null,null,null,null,null,null,null,null,null,null,null,null,null,null,null,null,null,null,null,null,null,null,null,null,null,null,"Did not eat with others","N/A","N/A","N/A","N/A","N/A","N/A","N/A","N/A","N/A","N/A","N/A","N/A","N/A","N/A","N/A","N/A","N/A","N/A","N/A","N/A","N/A","N/A","N/A","N/A"]
[null,null,null,null,null,null,null,null,null,null,null,null,null,null,null,null,null,null,null,null,null,null,null,null,null,null,null,null,null,null,null,null,null,null,null,null,null,null,null,null,null,null,null,null,null,null,null,null,null,null,null,null,null,"Did not bathe in regular place","N/A","N/A","N/A","N/A","N/A","N/A","N/A","N/A","N/A","N/A","N/A","N/A","N/A","N/A","N/A","N/A","N/A","N/A","N/A","N/A","N/A","N/A","N/A","N/A"]
[null,null,null,null,null,null,null,null,null,null,null,null,null,null,null,null,null,null,null,null,null,null,null,null,null,null,null,null,null,null,null,null,null,null,null,null,null,null,null,null,null,null,null,null,null,null,null,null,null,null,null,null,null,"Did not participate in other activities","N/A","N/A","N/A","N/A","N/A","N/A","N/A","N/A","N/A","N/A","N/A","N/A","N/A","N/A","N/A","N/A","N/A","N/A","N/A","N/A","N/A","N/A","N/A","N/A"]
[null,null,null,null,null,null,null,null,null,null,null,null,null,null,null,null,null,null,null,null,null,null,null,null,null,null,null,null,null,null,null,null,null,null,null,null,null,null,null,null,null,null,null,null,null,null,null,null,null,null,null,null,null,"DK/not sure/missing/no such activity","N/A","N/A","N/A","N/A","N/A","N/A","N/A","N/A","N/A","N/A","N/A","N/A","N/A","N/A","N/A","N/A","N/A","N/A","N/A","N/A","N/A","N/A","N/A","N/A"]
[]
[]
[]
[]
[]
[]
[]
[]
[]
[]
[]
[]
[]
[]
[]
[]
[]
[]
[]
[]
[]
[]
[]
[]
[]
[]
[]
[]
[]
[]
[]
[]
[]
[]
[]
[]
[]
[]
[]
[]
[]
[]
[]
[]
[]
[]
[]
[]
[]
[]
[]
[]
[]
[]
[null,null,null,null,null,null,null,null,null,null,null,null,null,null,null,null,null,null,null,null,null,null,null,null,null,null,null,null,null,null,null,null,null,null,null,null,null,null,null,null,null,null,null,null,null,null,null,null,null,null,null,null,"Raw numbers of respondents:","Basic water, sanitation and hygiene","NATIONAL wealth index quintile",null,null,null,null,"URBAN wealth index quintile",null,null,null,null,"RURAL wealth index quintile",null,null,null,null,"SUB-REGIONS:"]
[null,null,null,null,null,null,null,null,null,null,null,null,null,null,null,null,null,null,null,null,null,null,null,null,null,null,null,null,null,null,null,null,null,null,null,null,null,null,null,null,null,null,null,null,null,null,null,null,null,null,null,null,"WatSan data, raw numbers (weighted)",null,"Poorest","Poor","Middle","Rich","Richest","Poorest","Poor","Middle","Rich","Richest","Poorest","Poor","Middle","Rich","Richest","Beni","Chuquisaca","Cochabamba","La Paz","Oruro","Pando","Potosí","Santa Cruz","Tarija"]
[null,null,null,null,null,null,null,null,null,null,null,null,null,null,null,null,null,null,null,null,null,null,null,null,null,null,null,null,null,null,null,null,null,null,null,null,null,null,null,null,null,null,null,null,null,null,null,null,null,null,null,null,"Use of Basic Water Sanitation and Hygiene","Yes","N/A","N/A","N/A","N/A","N/A","N/A","N/A","N/A","N/A","N/A","N/A","N/A","N/A","N/A","N/A","N/A","N/A","N/A","N/A","N/A","N/A","N/A","N/A","N/A"]
[null,null,null,null,null,null,null,null,null,null,null,null,null,null,null,null,null,null,null,null,null,null,null,null,null,null,null,null,null,null,null,null,null,null,null,null,null,null,null,null,null,null,null,null,null,null,null,null,null,null,null,null,null,"No","N/A","N/A","N/A","N/A","N/A","N/A","N/A","N/A","N/A","N/A","N/A","N/A","N/A","N/A","N/A","N/A","N/A","N/A","N/A","N/A","N/A","N/A","N/A","N/A"]
[null,null,null,null,null,null,null,null,null,null,null,null,null,null,null,null,null,null,null,null,null,null,null,null,null,null,null,null,null,null,null,null,null,null,null,null,null,null,null,null,null,null,null,null,null,null,null,null,null,null,null,null,"Use of Basic Water and Sanitation","Yes","N/A","N/A","N/A","N/A","N/A","N/A","N/A","N/A","N/A","N/A","N/A","N/A","N/A","N/A","N/A","N/A","N/A","N/A","N/A","N/A","N/A","N/A","N/A","N/A"]
[null,null,null,null,null,null,null,null,null,null,null,null,null,null,null,null,null,null,null,null,null,null,null,null,null,null,null,null,null,null,null,null,null,null,null,null,null,null,null,null,null,null,null,null,null,null,null,null,null,null,null,null,null,"No","N/A","N/A","N/A","N/A","N/A","N/A","N/A","N/A","N/A","N/A","N/A","N/A","N/A","N/A","N/A","N/A","N/A","N/A","N/A","N/A","N/A","N/A","N/A","N/A"]
[null,null,null,null,null,null,null,null,null,null,null,null,null,null,null,null,null,null,null,null,null,null,null,null,null,null,null,null,null,null,null,null,null,null,null,null,null,null,null,null,null,null,null,null,null,null,null,null,null,null,null,null,"Use of Basic Water and Hygiene","Yes","N/A","N/A","N/A","N/A","N/A","N/A","N/A","N/A","N/A","N/A","N/A","N/A","N/A","N/A","N/A","N/A","N/A","N/A","N/A","N/A","N/A","N/A","N/A","N/A"]
[null,null,null,null,null,null,null,null,null,null,null,null,null,null,null,null,null,null,null,null,null,null,null,null,null,null,null,null,null,null,null,null,null,null,null,null,null,null,null,null,null,null,null,null,null,null,null,null,null,null,null,null,null,"No","N/A","N/A","N/A","N/A","N/A","N/A","N/A","N/A","N/A","N/A","N/A","N/A","N/A","N/A","N/A","N/A","N/A","N/A","N/A","N/A","N/A","N/A","N/A","N/A"]
[null,null,null,null,null,null,null,null,null,null,null,null,null,null,null,null,null,null,null,null,null,null,null,null,null,null,null,null,null,null,null,null,null,null,null,null,null,null,null,null,null,null,null,null,null,null,null,null,null,null,null,null,"Use of Basic Sanitation and Hygiene","Yes","N/A","N/A","N/A","N/A","N/A","N/A","N/A","N/A","N/A","N/A","N/A","N/A","N/A","N/A","N/A","N/A","N/A","N/A","N/A","N/A","N/A","N/A","N/A","N/A"]
[null,null,null,null,null,null,null,null,null,null,null,null,null,null,null,null,null,null,null,null,null,null,null,null,null,null,null,null,null,null,null,null,null,null,null,null,null,null,null,null,null,null,null,null,null,null,null,null,null,null,null,null,null,"No","N/A","N/A","N/A","N/A","N/A","N/A","N/A","N/A","N/A","N/A","N/A","N/A","N/A","N/A","N/A","N/A","N/A","N/A","N/A","N/A","N/A","N/A","N/A","N/A"]
[null,null,null,null,null,null,null,null,null,null,null,null,null,null,null,null,null,null,null,null,null,null,null,null,null,null,null,null,null,null,null,null,null,null,null,null,null,null,null,null,null,null,null,null,null,null,null,null,null,null,null,null,"Use of Basic Water","Yes","N/A","N/A","N/A","N/A","N/A","N/A","N/A","N/A","N/A","N/A","N/A","N/A","N/A","N/A","N/A","N/A","N/A","N/A","N/A","N/A","N/A","N/A","N/A","N/A"]
[null,null,null,null,null,null,null,null,null,null,null,null,null,null,null,null,null,null,null,null,null,null,null,null,null,null,null,null,null,null,null,null,null,null,null,null,null,null,null,null,null,null,null,null,null,null,null,null,null,null,null,null,null,"No","N/A","N/A","N/A","N/A","N/A","N/A","N/A","N/A","N/A","N/A","N/A","N/A","N/A","N/A","N/A","N/A","N/A","N/A","N/A","N/A","N/A","N/A","N/A","N/A"]
[null,null,null,null,null,null,null,null,null,null,null,null,null,null,null,null,null,null,null,null,null,null,null,null,null,null,null,null,null,null,null,null,null,null,null,null,null,null,null,null,null,null,null,null,null,null,null,null,null,null,null,null,"Use of Basic Sanitation","Yes","N/A","N/A","N/A","N/A","N/A","N/A","N/A","N/A","N/A","N/A","N/A","N/A","N/A","N/A","N/A","N/A","N/A","N/A","N/A","N/A","N/A","N/A","N/A","N/A"]
[null,null,null,null,null,null,null,null,null,null,null,null,null,null,null,null,null,null,null,null,null,null,null,null,null,null,null,null,null,null,null,null,null,null,null,null,null,null,null,null,null,null,null,null,null,null,null,null,null,null,null,null,null,"No","N/A","N/A","N/A","N/A","N/A","N/A","N/A","N/A","N/A","N/A","N/A","N/A","N/A","N/A","N/A","N/A","N/A","N/A","N/A","N/A","N/A","N/A","N/A","N/A"]
[null,null,null,null,null,null,null,null,null,null,null,null,null,null,null,null,null,null,null,null,null,null,null,null,null,null,null,null,null,null,null,null,null,null,null,null,null,null,null,null,null,null,null,null,null,null,null,null,null,null,null,null,"Access to Basic Hygiene","Yes","N/A","N/A","N/A","N/A","N/A","N/A","N/A","N/A","N/A","N/A","N/A","N/A","N/A","N/A","N/A","N/A","N/A","N/A","N/A","N/A","N/A","N/A","N/A","N/A"]
[null,null,null,null,null,null,null,null,null,null,null,null,null,null,null,null,null,null,null,null,null,null,null,null,null,null,null,null,null,null,null,null,null,null,null,null,null,null,null,null,null,null,null,null,null,null,null,null,null,null,null,null,null,"No","N/A","N/A","N/A","N/A","N/A","N/A","N/A","N/A","N/A","N/A","N/A","N/A","N/A","N/A","N/A","N/A","N/A","N/A","N/A","N/A","N/A","N/A","N/A","N/A"]
[]
[]
[]
[]
[]
[]
[]
[]
[]
[]
[]
[]
[]
[]
[]
[]
[]
[]
[]
[]
[]
[]
[]
[]
[]
[]
[]
[]
[]
[]
[]
[]
[]
[]
[]
[]
[]
[]
[]
[]
[]
[]
[]
[]
[null,null,"INITIAL (national) Wealth Index",null,null,null,null,"URBAN Wealth Index",null,null,null,null,"RURAL Wealth Index"]
[null,null,"Component Matrix",null,null,null,null,"Component Matrix",null,null,null,null,"Component Matrix"]
[null,null,null,null,"Component",null,null,null,null,"Component",null,null,null,null,"Component"]
[null,"Note:\n\nThe INITIAL (national) Wealth Index is based on the first component of the Principal Component Analysis (PCA) which has been obtained at national level.\n\nThe final national-level (NATIONAL) Wealth Index is based on the URBAN and RURAL specific wealth indexes. Regression procedures are used to establish the relationships between the two sets of scores (urban and rural) and the initial (national) wealth factors.\nThis allows best use of the available information for each area and a better precision of the FINAL (NATIONAL) Wealth Index.\n\nFor dependency reasons, all WASH variables (contained in the generic MICS and DHS scripts) have been excluded from the sets of asset variables used in the PCAs.\n\nThe PCA can extracts as many components as there are asset variables in the input. Only the first of the components is used to represent the Wealth Index. \n\nThe scores represent the weights of the asset variables on the Wealth Index (correlations between the variables and the component).\n\nThe communalities are the proportion of each variable's variance that can be explained by the component.\n\nProportion of explained variance is the part of the model's total variance that is explained by the component.\n\nFor more information on the procedure used:\n\nThe DHS Wealth Index, DHS Comparative Reports No. 6, Shea Oscar Rutstein, Kiersten Johnson, ORC Macro International Inc., 2004.\n\nThe DHS Wealth Index: Approaches for Rural and Urban Areas, Shea O. Rutstein, ORC Macro International Inc., 2008.\n\nMICS Methodological Paper No. 4, Review of options for reporting water, sanitation and hygiene coverage by wealth quintile, UNICEF, 2016.",null,null,"1",null,null,null,null,"1",null,null,null,null,"1"]
[null,null,"LPG for cooking",null,0.78232481108812035,null,null,"Has refrigerator",null,0.62975437812099988,null,null,"Earth, mud, dung floor",null,-0.72755363869702894]
[null,null,"Wood for cooking",null,-0.77864905717683819,null,null,"Has telephone",null,0.60095525623521107,null,null,"LPG for cooking",null,0.72353315159665466]
[null,null,"Earth, mud, dung floor",null,-0.74748284547874067,null,null,"Household has computer",null,0.56825198330063453,null,null,"Has television",null,0.66964000732404316]
[null,null,"Has television",null,0.74531937949257732,null,null,"Wood walls",null,0.53289624354811949,null,null,"Wood for cooking",null,-0.66369275104320058]
[null,null,"Has electricity",null,0.69388763922385377,null,null,"Earth, mud, dung floor",null,-0.51959529017643291,null,null,"Has electricity",null,0.62042165490952372]
[null,null,"Has a mobile telephone",null,0.66966086867902175,null,null,"Terrazo, ceramic tile floor",null,0.49515545276022355,null,null,"Wood walls",null,0.59494324842931978]
[null,null,"Wood walls",null,0.65553199333082468,null,null,"Interior walls smoothly finished (plaster)",null,0.46779520721076762,null,null,"Has refrigerator",null,0.59154338125393591]
[null,null,"Has refrigerator",null,0.65186854635667246,null,null,"Access to Internet in close proximity to home",null,0.4577544810025595,null,null,"Has a mobile telephone",null,0.55647434190664213]
[null,null,"Access to Internet in close proximity to home",null,0.59785317091853774,null,null,"Has car/truck",null,0.4535400010718561,null,null,"Corrugated roof",null,-0.53725305282398383]
[null,null,"Corrugated roof",null,-0.5690095659791532,null,null,"Wood for cooking",null,-0.43867138053341265,null,null,"Concrete, cement floor",null,0.52635754828235082]
[null,null,"Has telephone",null,0.56816997648796974,null,null,"Has television",null,0.43124227341207461,null,null,"Interior walls smoothly finished (plaster)",null,0.38340012084141356]
[null,null,"Household has computer",null,0.512276939403846,null,null,"Access to Internet at home",null,0.40493066644633408,null,null,"Has car/truck",null,0.36890508508797126]
[null,null,"Trash thrown in canal/gorge",null,-0.49607532559791473,null,null,"Has a mobile telephone",null,0.40274332460778478,null,null,"Terrazo, ceramic tile floor",null,0.31956928425774617]
[null,null,"Interior walls smoothly finished (plaster)",null,0.46460527236085514,null,null,"Number of members per sleeping room",null,-0.39717621932283242,null,null,"Cement shingle roof",null,0.29046959603705319]
[null,null,"Cane/palm/trunk walls",null,-0.45620464826668605,null,null,"LPG for cooking",null,0.3856805405475085,null,null,"Cane/palm/trunk walls",null,-0.28939459142717733]
[null,null,"Terrazo, ceramic tile floor",null,0.43653611870165138,null,null,"Cane/palm/trunk walls",null,-0.35604070639603952,null,null,"Has telephone",null,0.28084326543564098]
[null,null,"Trash collected by government",null,0.43198165629989616,null,null,"Has electricity",null,0.33641609076222223,null,null,"Trash thrown in canal/gorge",null,-0.25451021284266617]
[null,null,"Trash collected by govt. contractor",null,0.43032547708754754,null,null,"Stone, rock walls",null,-0.32147625378726735,null,null,"Trash collected by government",null,0.25221016693264736]
[null,null,"Has car/truck",null,0.39538756387466184,null,null,"Household has electric water pump",null,0.31183892997978785,null,null,"Household has computer",null,0.24655343707953326]
[null,null,"Trash is burned",null,-0.34923111590041406,null,null,"Has radio",null,0.28349580686626957,null,null,"Ceramic tile roof",null,0.23114380578204374]
[null,null,"Number of members per sleeping room",null,-0.3364208477254661,null,null,"Trash is burned",null,-0.26423877998158102,null,null,"Access to Internet in close proximity to home",null,0.22454290469982613]
[null,null,"Access to Internet at home",null,0.30298125145225419,null,null,"Ceramic tile roof",null,-0.25152532456001958,null,null,"Has motorcycle/scooter",null,0.20013499503224724]
[null,null,"Parquet, wood tile floor",null,0.29656022260054421,null,null,"Trash thrown in canal/gorge",null,-0.24867358333718245,null,null,"Number of members per sleeping room",null,-0.19756563020592427]
[null,null,"Household has electric water pump",null,0.24986362875256793,null,null,"Corrugated roof",null,-0.2426563358733537,null,null,"Trash collected by govt. contractor",null,0.18950775701344047]
[null,null,"Straw/Palm/Cane/Mud roof",null,0.23182824465016802,null,null,"Cement shingle roof",null,0.23262918775131566,null,null,"Brick floor",null,0.18765384986995887]
[null,null,"Has radio",null,0.22918544403640401,null,null,"Parquet, wood tile floor",null,0.22568422111765396,null,null,"Household has electric water pump",null,0.17600023373725338]
[null,null,"Concrete, cement floor",null,0.21475628978254152,null,null,"Straw/Palm/Cane/Mud roof",null,0.19880208117649614,null,null,"Has bicycle",null,0.16955400252454295]
[null,null,"Trash thrown outside to patio/yard",null,-0.18640698299687433,null,null,"Concrete, cement floor",null,-0.17695006625646387,null,null,"Has radio",null,0.16351514956610011]
[null,null,"Stone, rock walls",null,-0.1717525744809745,null,null,"Has bicycle",null,0.16965404817193186,null,null,"Trash is burned",null,0.162271042919512]
[null,null,"Straw for cooking",null,-0.16740381388899936,null,null,"Other type of roof",null,-0.14336609652665891,null,null,"Straw/Palm/Cane/Mud roof",null,0.15909514548154255]
[null,null,"Ceramic tile roof",null,0.16322582444731881,null,null,"Rudimentary wood plank floor",null,-0.13752088333747517,null,null,"Parquet, wood tile floor",null,0.14561612951830491]
[null,null,"Cement shingle roof",null,0.15652383480496601,null,null,"Trash collected by govt. contractor",null,0.13126705182459231,null,null,"Tabique, quinche walls",null,-0.13233284375871132]
[null,null,"Has motorcycle/scooter",null,0.15294808047006531,null,null,"Brick floor",null,-0.13021328889844908,null,null,"Brick, Cement walls",null,-0.12526208710740175]
[null,null,"Adobe, tapial walls",null,-0.14538855926068006,null,null,"Trash thrown outside to patio/yard",null,-0.12420113781732249,null,null,"Trash thrown outside to patio/yard",null,-0.1100775649345993]
[null,null,"Brick, Cement walls",null,-0.14536080415458016,null,null,"Adobe, tapial walls",null,-0.11896173131422134,null,null,"Access to Internet at home",null,9.6330323016652258E-2]
[null,null,"Tabique, quinche walls",null,-0.14236498341967643,null,null,"Trash collected by government",null,0.11400800703849004,null,null,"Adobe, tapial walls",null,-8.2541136113220476E-2]
[null,null,"Other type of roof",null,-0.11073705124301758,null,null,"Does not cook",null,-0.1139134533858612,null,null,"Stone, rock walls",null,-7.9510435164219906E-2]
[null,null,"Other type of walls",null,-8.3127197803987127E-2,null,null,"Brick, Cement walls",null,-0.11328764749115747,null,null,"Straw for cooking",null,-7.7200189831916191E-2]
[null,null,"Electricity for cooking",null,6.6224583143945498E-2,null,null,"Other type of walls",null,-9.7563985167923653E-2,null,null,"Other type of roof",null,-6.5599825006618845E-2]
[null,null,"Carpet/rug floor",null,4.1202081289910014E-2,null,null,"Has motorcycle/scooter",null,9.3870216325853184E-2,null,null,"Does not cook",null,6.3787559407433456E-2]
[null,null,"Trash collected by private company/person",null,3.4588595647257664E-2,null,null,"Kerosene for cooking",null,-7.8228269512516352E-2,null,null,"Other type of walls",null,-5.9371931529530617E-2]
[null,null,"Other type of flooring",null,-3.1502495642573007E-2,null,null,"Electricity for cooking",null,6.3083753270765971E-2,null,null,"Rudimentary wood plank floor",null,4.9072259534772088E-2]
[null,null,"Does not cook",null,2.5836285169364152E-2,null,null,"Tabique, quinche walls",null,-5.9048357089558808E-2,null,null,"Trash collected by private company/person",null,4.5623777087649434E-2]
[null,null,"Rudimentary wood plank floor",null,-1.9893151900461249E-2,null,null,"Carpet/rug floor",null,4.0211815676335826E-2,null,null,"Trash other disposal",null,3.8177761803493242E-2]
[null,null,"Kerosene for cooking",null,-1.5368969749265713E-2,null,null,"Trash collected by private company/person",null,3.0430818341882725E-2,null,null,"Electricity for cooking",null,3.1846814754625287E-2]
[null,null,"Has bicycle",null,1.0976344991507996E-2,null,null,"Trash other disposal",null,1.5041022080795437E-2,null,null,"Carpet/rug floor",null,2.7656107316038785E-2]
[null,null,"Brick floor",null,-5.1429688893293675E-3,null,null,"Straw for cooking",null,-1.0466670265885691E-2,null,null,"Other type of flooring",null,-6.972987638694134E-3]
[null,null,"Other fuel for cooking",null,4.0248070596333261E-3,null,null,"Other type of flooring",null,-8.6307543231250866E-3,null,null,"Kerosene for cooking",null,-2.7560967307808299E-3]
[null,null,"Trash other disposal",null,-2.3746782989661108E-3,null,null,"Other fuel for cooking",null,-5.756167345128258E-3]
[]
[]
[null,null,null,null,null,null,null,null,null,null,null,null,"Communalities"]
[null,null,"Communalities",null,null,null,null,"Communalities",null,null,null,null,null,null,"Extraction"]
[null,null,null,null,"Extraction",null,null,null,null,"Extraction",null,null,"Has electricity",null,0.38492302988067212]
[null,null,"Has electricity",null,0.48148005586765302,null,null,"Has electricity",null,0.11317578612373574,null,null,"Has radio",null,2.673720413762409E-2]
[null,null,"Has radio",null,5.2525967758163671E-2,null,null,"Has radio",null,8.0369872510757223E-2,null,null,"Has television",null,0.44841773940894458]
[null,null,"Has television",null,0.55550097744720051,null,null,"Has television",null,0.18596989837761452,null,null,"Has refrigerator",null,0.34992357190533935]
[null,null,"Has refrigerator",null,0.42493260172916125,null,null,"Has refrigerator",null,0.39659057676256732,null,null,"Has bicycle",null,2.8748559772092716E-2]
[null,null,"Has bicycle",null,1.2048014937260268E-4,null,null,"Has bicycle",null,2.8782496061124176E-2,null,null,"Has motorcycle/scooter",null,4.0054016236557625E-2]
[null,null,"Has motorcycle/scooter",null,2.3393115319477572E-2,null,null,"Has motorcycle/scooter",null,8.8116175130624735E-3,null,null,"Has car/truck",null,0.13609096180376332]
[null,null,"Has car/truck",null,0.1563313256667398,null,null,"Has car/truck",null,0.20569853257225923,null,null,"Has telephone",null,7.8872939740553899E-2]
[null,null,"Has telephone",null,0.3228171221823401,null,null,"Has telephone",null,0.36114721999672816,null,null,"Has a mobile telephone",null,0.30966369320043047]
[null,null,"Has a mobile telephone",null,0.44844567903994204,null,null,"Has a mobile telephone",null,0.1622021855161315,null,null,"Interior walls smoothly finished (plaster)",null,0.14699565266121051]
[null,null,"Interior walls smoothly finished (plaster)",null,0.21585805910550437,null,null,"Interior walls smoothly finished (plaster)",null,0.218832355889365,null,null,"Household has computer",null,6.0788597335731366E-2]
[null,null,"Household has computer",null,0.26242766264497169,null,null,"Household has computer",null,0.3229103165251046,null,null,"Household has electric water pump",null,3.0976082275567821E-2]
[null,null,"Household has electric water pump",null,6.2431832973401089E-2,null,null,"Household has electric water pump",null,9.7243518250939034E-2,null,null,"Access to Internet at home",null,9.2795311324925644E-3]
[null,null,"Access to Internet at home",null,9.179763873157408E-2,null,null,"Access to Internet at home",null,0.16396884462867226,null,null,"Access to Internet in close proximity to home",null,5.0419516051035201E-2]
[null,null,"Access to Internet in close proximity to home",null,0.35742841397735031,null,null,"Access to Internet in close proximity to home",null,0.2095391648779226,null,null,"Number of members per sleeping room",null,3.9032178238664013E-2]
[null,null,"Number of members per sleeping room",null,0.11317898678432124,null,null,"Number of members per sleeping room",null,0.15774894919557869,null,null,"Earth, mud, dung floor",null,0.52933429718128688]
[null,null,"Earth, mud, dung floor",null,0.55873060428499488,null,null,"Earth, mud, dung floor",null,0.26997926557353152,null,null,"Rudimentary wood plank floor",null,2.4080866558480302E-3]
[null,null,"Rudimentary wood plank floor",null,3.95737492534825E-4,null,null,"Rudimentary wood plank floor",null,1.8911993353919455E-2,null,null,"Parquet, wood tile floor",null,2.1204057175891751E-2]
[null,null,"Parquet, wood tile floor",null,8.7947965628884336E-2,null,null,"Parquet, wood tile floor",null,5.0933367661482126E-2,null,null,"Carpet/rug floor",null,7.6486027187625395E-4]
[null,null,"Carpet/rug floor",null,1.6976115026203528E-3,null,null,"Carpet/rug floor",null,1.6169901199876077E-3,null,null,"Concrete, cement floor",null,0.27705226863380727]
[null,null,"Concrete, cement floor",null,4.6120264001162946E-2,null,null,"Concrete, cement floor",null,3.1311325948166956E-2,null,null,"Terrazo, ceramic tile floor",null,0.10212452744100817]
[null,null,"Terrazo, ceramic tile floor",null,0.19056378293110227,null,null,"Terrazo, ceramic tile floor",null,0.24517892239818198,null,null,"Brick floor",null,3.5213967371017063E-2]
[null,null,"Brick floor",null,2.6450128996609746E-5,null,null,"Brick floor",null,1.6955500605750962E-2,null,null,"Other type of flooring",null,4.8622556609381195E-5]
[null,null,"Other type of flooring",null,9.9240723171033132E-4,null,null,"Other type of flooring",null,7.4489920186142369E-5,null,null,"Brick, Cement walls",null,1.5690590466502303E-2]
[null,null,"Brick, Cement walls",null,2.1129763384466212E-2,null,null,"Brick, Cement walls",null,1.2834091074080756E-2,null,null,"Adobe, tapial walls",null,6.8130391508611898E-3]
[null,null,"Adobe, tapial walls",null,2.1137833163896277E-2,null,null,"Adobe, tapial walls",null,1.4151893517276991E-2,null,null,"Tabique, quinche walls",null,1.7511981537267501E-2]
[null,null,"Tabique, quinche walls",null,2.0267788504084745E-2,null,null,"Tabique, quinche walls",null,3.4867084749760501E-3,null,null,"Stone, rock walls",null,6.3219093000036171E-3]
[null,null,"Stone, rock walls",null,2.9498946840842692E-2,null,null,"Stone, rock walls",null,0.10334698174909553,null,null,"Wood walls",null,0.35395746885163132]
[null,null,"Wood walls",null,0.42972219428028435,null,null,"Wood walls",null,0.28397840638769667,null,null,"Cane/palm/trunk walls",null,8.3749229547302892E-2]
[null,null,"Cane/palm/trunk walls",null,0.20812268110013074,null,null,"Cane/palm/trunk walls",null,0.12676498461099081,null,null,"Other type of walls",null,3.5250262535472718E-3]
[null,null,"Other type of walls",null,6.9101310147432022E-3,null,null,"Other type of walls",null,9.5187312018468265E-3,null,null,"Corrugated roof",null,0.28864084276869034]
[null,null,"Corrugated roof",null,0.32377188617578428,null,null,"Corrugated roof",null,5.888209733948184E-2,null,null,"Ceramic tile roof",null,5.3427458951407159E-2]
[null,null,"Ceramic tile roof",null,2.6642669766506939E-2,null,null,"Ceramic tile roof",null,6.3264988895023189E-2,null,null,"Cement shingle roof",null,8.4372586221928864E-2]
[null,null,"Cement shingle roof",null,2.4499710862052288E-2,null,null,"Cement shingle roof",null,5.4116338993836874E-2,null,null,"Straw/Palm/Cane/Mud roof",null,2.531126531579319E-2]
[null,null,"Straw/Palm/Cane/Mud roof",null,5.3744335017578158E-2,null,null,"Straw/Palm/Cane/Mud roof",null,3.9522267480106163E-2,null,null,"Other type of roof",null,4.303337040899015E-3]
[null,null,"Other type of roof",null,1.2262694517998702E-2,null,null,"Other type of roof",null,2.0553837633291279E-2,null,null,"Electricity for cooking",null,1.0142196100154188E-3]
[null,null,"Electricity for cooking",null,4.3856954125893501E-3,null,null,"Electricity for cooking",null,3.9795599267268764E-3,null,null,"LPG for cooking",null,0.52350022145938768]
[null,null,"LPG for cooking",null,0.61203211004406322,null,null,"LPG for cooking",null,0.14874947935701835,null,null,"Kerosene for cooking",null,7.5960691894207788E-6]
[null,null,"Kerosene for cooking",null,2.3620523115384459E-4,null,null,"Kerosene for cooking",null,6.1196621509228954E-3,null,null,"Wood for cooking",null,0.44048806778729183]
[null,null,"Wood for cooking",null,0.60629435424237899,null,null,"Wood for cooking",null,0.19243258009909012,null,null,"Straw for cooking",null,5.9598693100838956E-3]
[null,null,"Straw for cooking",null,2.8024036904582734E-2,null,null,"Straw for cooking",null,1.0955118645477565E-4,null,null,"Does not cook",null,4.0688527351568525E-3]
[null,null,"Does not cook",null,6.6751363135270601E-4,null,null,"Does not cook",null,1.2976274862292773E-2,null,null,"Trash collected by government",null,6.3609968304193854E-2]
[null,null,"Other fuel for cooking",null,1.6199071867274259E-5,null,null,"Other fuel for cooking",null,3.3133462505120895E-5,null,null,"Trash collected by govt. contractor",null,3.5913189968265195E-2]
[null,null,"Trash collected by government",null,0.1866081513796016,null,null,"Trash collected by government",null,1.2997825668888394E-2,null,null,"Trash collected by private company/person",null,2.0815290357435253E-3]
[null,null,"Trash collected by govt. contractor",null,0.18518001623062541,null,null,"Trash collected by govt. contractor",null,1.7231038894720201E-2,null,null,"Trash is burned",null,2.6331891370186104E-2]
[null,null,"Trash collected by private company/person",null,1.1963709488494918E-3,null,null,"Trash collected by private company/person",null,9.2603470495666613E-4,null,null,"Trash thrown outside to patio/yard",null,1.2117070301930925E-2]
[null,null,"Trash is burned",null,0.12196237231304843,null,null,"Trash is burned",null,6.9822132846154378E-2,null,null,"Trash thrown in canal/gorge",null,6.4775448441219241E-2]
[null,null,"Trash thrown outside to patio/yard",null,3.4747563309996995E-2,null,null,"Trash thrown outside to patio/yard",null,1.5425922635117535E-2,null,null,"Trash other disposal",null,1.4575414963242676E-3]
[null,null,"Trash thrown in canal/gorge",null,0.24609072866707712,null,null,"Trash thrown in canal/gorge",null,6.183855104975463E-2]
[null,null,"Trash other disposal",null,5.6390970235805816E-6,null,null,"Trash other disposal",null,2.262323452349759E-4]
[null,null,null,null,null,null,null,null,null,null,null,null,"Total Variance Explained"]
[null,null,null,null,null,null,null,null,null,null,null,null,"Component",null,"Extraction Sums of Squared Loadings"]
[null,null,"Total Variance Explained",null,null,null,null,"Total Variance Explained",null,null,null,null,null,null,"Total","% of Variance","Cumulative %"]
[null,null,"Component",null,"Extraction Sums of Squared Loadings",null,null,"Component",null,"Extraction Sums of Squared Loadings",null,null,"1",null,5.2340241623628483,10.9042170049226,10.9042170049226]
[null,null,null,null,"Total","% of Variance","Cumulative %",null,null,"Total","% of Variance","Cumulative %"]
[null,null,"1",null,7.6603023336917584,15.633270068758689,15.633270068758689,"1",null,4.6812424969303104,9.553556116184307,9.553556116184307]
[null,null,null,null,null,null,null,null,null,null,null,null,"Component Score Coefficient Matrix"]
[null,null,null,null,null,null,null,null,null,null,null,null,null,null,"Component"]
[null,null,"Component Score Coefficient Matrix",null,null,null,null,"Component Score Coefficient Matrix",null,null,null,null,null,null,"1"]
[null,null,null,null,"Component",null,null,null,null,"Component",null,null,"Has electricity",null,0.11853626113744199]
[null,null,null,null,"1",null,null,null,null,"1",null,null,"Has radio",null,3.1240809078015949E-2]
[null,null,"Has electricity",null,9.0582278479006961E-2,null,null,"Has electricity",null,7.1864700660737954E-2,null,null,"Has television",null,0.12793980053423001]
[null,null,"Has radio",null,2.9918589900609291E-2,null,null,"Has radio",null,6.0559948999046695E-2,null,null,"Has refrigerator",null,0.11301884800372979]
[null,null,"Has television",null,9.7296339886546332E-2,null,null,"Has television",null,9.2121327552430479E-2,null,null,"Has bicycle",null,3.2394577721628147E-2]
[null,null,"Has refrigerator",null,8.509697371729126E-2,null,null,"Has refrigerator",null,0.13452718557817858,null,null,"Has motorcycle/scooter",null,3.8237308201859402E-2]
[null,null,"Has bicycle",null,1.4328866555607766E-3,null,null,"Has bicycle",null,3.6241243277437822E-2,null,null,"Has car/truck",null,7.0482113502783814E-2]
[null,null,"Has motorcycle/scooter",null,1.9966324279051591E-2,null,null,"Has motorcycle/scooter",null,2.0052414799576795E-2,null,null,"Has telephone",null,5.3657235183426633E-2]
[null,null,"Has car/truck",null,5.1615138234904524E-2,null,null,"Has car/truck",null,9.688453468694723E-2,null,null,"Has a mobile telephone",null,0.10631864214693026]
[null,null,"Has telephone",null,7.4170698718904152E-2,null,null,"Has telephone",null,0.12837516036165247,null,null,"Interior walls smoothly finished (plaster)",null,7.3251499983204391E-2]
[null,null,"Has a mobile telephone",null,8.7419639526980605E-2,null,null,"Has a mobile telephone",null,8.6033424859293384E-2,null,null,"Household has computer",null,4.7105903494383018E-2]
[null,null,"Interior walls smoothly finished (plaster)",null,6.0651035967263997E-2,null,null,"Interior walls smoothly finished (plaster)",null,9.9929710438525846E-2,null,null,"Household has electric water pump",null,3.3626179069414112E-2]
[null,null,"Household has computer",null,6.6874245570012966E-2,null,null,"Household has computer",null,0.12138913625458658,null,null,"Access to Internet at home",null,1.8404638577970353E-2]
[null,null,"Household has electric water pump",null,3.2617985278937445E-2,null,null,"Household has electric water pump",null,6.6614564441870694E-2,null,null,"Access to Internet in close proximity to home",null,4.2900624401867191E-2]
[null,null,"Access to Internet at home",null,3.9552127090294271E-2,null,null,"Access to Internet at home",null,8.6500681541677102E-2,null,null,"Number of members per sleeping room",null,-3.774641157115622E-2]
[null,null,"Access to Internet in close proximity to home",null,7.80456364351369E-2,null,null,"Access to Internet in close proximity to home",null,9.7784825567726649E-2,null,null,"Earth, mud, dung floor",null,-0.13900463890265688]
[null,null,"Number of members per sleeping room",null,-4.3917437337402526E-2,null,null,"Number of members per sleeping room",null,-8.4844188179372837E-2,null,null,"Rudimentary wood plank floor",null,9.3756272444525546E-3]
[null,null,"Earth, mud, dung floor",null,-9.7578765552260319E-2,null,null,"Earth, mud, dung floor",null,-0.11099516645786961,null,null,"Parquet, wood tile floor",null,2.7821065589534448E-2]
[null,null,"Rudimentary wood plank floor",null,-2.5969147213637544E-3,null,null,"Rudimentary wood plank floor",null,-2.9377004807517121E-2,null,null,"Carpet/rug floor",null,5.2839089882140908E-3]
[null,null,"Parquet, wood tile floor",null,3.8713905754894903E-2,null,null,"Parquet, wood tile floor",null,4.821032477288769E-2,null,null,"Concrete, cement floor",null,0.10056460038287861]
[null,null,"Carpet/rug floor",null,5.3786494964688089E-3,null,null,"Carpet/rug floor",null,8.5899877442162896E-3,null,null,"Terrazo, ceramic tile floor",null,6.1056134695694597E-2]
[null,null,"Concrete, cement floor",null,2.8034962646055671E-2,null,null,"Concrete, cement floor",null,-3.7799807716113305E-2,null,null,"Brick floor",null,3.5852690787969994E-2]
[null,null,"Terrazo, ceramic tile floor",null,5.698680021827153E-2,null,null,"Terrazo, ceramic tile floor",null,0.1057743650505006,null,null,"Other type of flooring",null,-1.3322421567779402E-3]
[null,null,"Brick floor",null,-6.7137936145280014E-4,null,null,"Brick floor",null,-2.7815967445359958E-2,null,null,"Brick, Cement walls",null,-2.3932271464878644E-2]
[null,null,"Other type of flooring",null,-4.1124350280559866E-3,null,null,"Other type of flooring",null,-1.8436887917651435E-3,null,null,"Adobe, tapial walls",null,-1.5770109872010621E-2]
[null,null,"Brick, Cement walls",null,-1.8975857325532725E-2,null,null,"Brick, Cement walls",null,-2.4200337317591431E-2,null,null,"Tabique, quinche walls",null,-2.5283193132790385E-2]
[null,null,"Adobe, tapial walls",null,-1.8979480564523935E-2,null,null,"Adobe, tapial walls",null,-2.5412426592347995E-2,null,null,"Stone, rock walls",null,-1.5191071477271457E-2]
[null,null,"Tabique, quinche walls",null,-1.8584773448630448E-2,null,null,"Tabique, quinche walls",null,-1.2613821464766957E-2,null,null,"Wood walls",null,0.11366841840499614]
[null,null,"Stone, rock walls",null,-2.2421122169756599E-2,null,null,"Stone, rock walls",null,-6.8673275096958336E-2,null,null,"Cane/palm/trunk walls",null,-5.5291030849298373E-2]
[null,null,"Wood walls",null,8.5575211626784678E-2,null,null,"Wood walls",null,0.11383649616476015,null,null,"Other type of walls",null,-1.1343457670001994E-2]
[null,null,"Cane/palm/trunk walls",null,-5.9554392032308424E-2,null,null,"Cane/palm/trunk walls",null,-7.6056881614125008E-2,null,null,"Corrugated roof",null,-0.10264626913404355]
[null,null,"Other type of walls",null,-1.0851686288982974E-2,null,null,"Other type of walls",null,-2.0841472158705836E-2,null,null,"Ceramic tile roof",null,4.4161776600912014E-2]
[null,null,"Corrugated roof",null,-7.4280301376163607E-2,null,null,"Corrugated roof",null,-5.1835882467629858E-2,null,null,"Cement shingle roof",null,5.5496418630578796E-2]
[null,null,"Ceramic tile roof",null,2.1308013357307632E-2,null,null,"Ceramic tile roof",null,-5.3730462526766228E-2,null,null,"Straw/Palm/Cane/Mud roof",null,3.0396333785689022E-2]
[null,null,"Cement shingle roof",null,2.0433114515146282E-2,null,null,"Cement shingle roof",null,4.969389812723022E-2,null,null,"Other type of roof",null,-1.253334393798527E-2]
[null,null,"Straw/Palm/Cane/Mud roof",null,3.0263589418727574E-2,null,null,"Straw/Palm/Cane/Mud roof",null,4.2467802363765413E-2,null,null,"Electricity for cooking",null,6.084575417826951E-3]
[null,null,"Other type of roof",null,-1.4455963540234014E-2,null,null,"Other type of roof",null,-3.062565048075808E-2,null,null,"LPG for cooking",null,0.13823649435925087]
[null,null,"Electricity for cooking",null,8.6451657205061823E-3,null,null,"Electricity for cooking",null,1.3475856743617249E-2,null,null,"Kerosene for cooking",null,-5.2657317683008499E-4]
[null,null,"LPG for cooking",null,0.10212714551059915,null,null,"LPG for cooking",null,8.2388498523717935E-2,null,null,"Wood for cooking",null,-0.12680353213034901]
[null,null,"Kerosene for cooking",null,-2.0063137301604243E-3,null,null,"Kerosene for cooking",null,-1.6711005585336364E-2,null,null,"Straw for cooking",null,-1.4749681590515418E-2]
[null,null,"Wood for cooking",null,-0.10164730101476047,null,null,"Wood for cooking",null,-9.3708322271505509E-2,null,null,"Does not cook",null,1.218709685486763E-2]
[null,null,"Straw for cooking",null,-2.1853421261549846E-2,null,null,"Straw for cooking",null,-2.2358744014541292E-3,null,null,"Trash collected by government",null,4.8186664621507891E-2]
[null,null,"Does not cook",null,3.372750061799816E-3,null,null,"Does not cook",null,-2.4334021034065016E-2,null,null,"Trash collected by govt. contractor",null,3.6206893803846917E-2]
[null,null,"Other fuel for cooking",null,5.2541099349712422E-4,null,null,"Other fuel for cooking",null,-1.2296238336088809E-3,null,null,"Trash collected by private company/person",null,8.716768526924993E-3]
[null,null,"Trash collected by government",null,5.639224634776388E-2,null,null,"Trash collected by government",null,2.4354219443502433E-2,null,null,"Trash is burned",null,3.1003113070509083E-2]
[null,null,"Trash collected by govt. contractor",null,5.6176043495682657E-2,null,null,"Trash collected by govt. contractor",null,2.804107070092389E-2,null,null,"Trash thrown outside to patio/yard",null,-2.1031153376431085E-2]
[null,null,"Trash collected by private company/person",null,4.5153042452553242E-3,null,null,"Trash collected by private company/person",null,6.5005857658169833E-3,null,null,"Trash thrown in canal/gorge",null,-4.8626105831305534E-2]
[null,null,"Trash is burned",null,-4.5589730103003365E-2,null,null,"Trash is burned",null,-5.6446291802839443E-2,null,null,"Trash other disposal",null,7.2941508520392969E-3]
[null,null,"Trash thrown outside to patio/yard",null,-2.4334154825327699E-2,null,null,"Trash thrown outside to patio/yard",null,-2.6531660750060793E-2]
[null,null,"Trash thrown in canal/gorge",null,-6.4759235861496248E-2,null,null,"Trash thrown in canal/gorge",null,-5.3121277844556933E-2]
[null,null,"Trash other disposal",null,-3.0999798644000429E-4,null,null,"Trash other disposal",null,3.2130405743044663E-3,null,null,"Component Score Covariance Matrix"]
[null,null,null,null,null,null,null,null,null,null,null,null,"Component",null,"1"]
[null,null,null,null,null,null,null,null,null,null,null,null,"1",null,0.99999999999999978]
[null,null,"Component Score Covariance Matrix",null,null,null,null,"Component Score Covariance Matrix"]
[null,null,"Component",null,"1",null,null,"Component",null,"1"]
[null,null,"1",null,1.0000000000000002,null,null,"1",null,1]
[]
[]
[]
[]
[]
[]
[]
[]
[]
[]
[]
[]
[]
[]
[]
[]
[]
[]
[]
[]
[]
[]
[]
[]
[]
[]
[]
[]
[]
[]
[]
[]
[]
[]
[]
[]
[]
[]
[]
[]
[]
[]
[]
[]
[]
[]
[]
[]
[]
[]
[]
[]
[]
[]
[]
[]
[]
[]
[]
[]
[]
[]
[]
[]
[]
[]
[]
[]
[]
[]
[]
[]
[]
[]
[]
[]
[]
[]
[]
[]
[]
[]
[]
[]
[]
[]
[]
[]
[]
[]
[]
[]
[]
[]
[]
[]
[]
[]
[]
[]
[]
[]
[]
[]
[]
[]
[]
[]
[]
[]
[]
[]
[]
[]
[]
[]
[]
[]
[]
[]
[]
[]
[]
[]
[]
[]
[]
[]
[]
[]
[]
[]
[]
[]
[]
[]
[]
[]
[]
[]
[]
[]
[]
[]
[]
[]
[]
[]
[]
[]
[]
[]
[]
[]
[]
[]
[]
[]
[]
[]
[]
[]
[]
[]
[]
[]
[]
[]
[]
[]
[]
[]
[]
[]
[]
[]
[]
[]
[]
[]
[]
[]
[]
[]
[]
[]
[]
[]
[]
[]
[]
[]
[]
[]
[]
[]
[]
[]
[]
[]
[]
[]
[]
[]
[]
[]
[]
[]
[]
[]
[]
[]
[]
[]
[]
[]
[]
[]
[]
[]
[]
[]
[]
[]
[]
[]
[]
[]
[]
[]
[]
[]
[]
[]
[]
[]
[]
[]
[]
[]
[]
[]
[]
[]
[]
[]
[]
[]
[]
[]
[]
[]
[]
[]
[]
[]
[]
[]
[]
[]
[]
[]
[]
[]
[]
[]
[]
[]
[]
[]
[]
[]
[]
[]
[]
[]
[]
[]
[]
[]
[]
[]
[]
[]
[]
[]
[]
[]
[]
[]
[]
[]
[]
[]
[]
[]
[]
[]
[]
[]
[]
[]
[]
[]
[]
[]
[]
[]
[]
[]
[]
[]
[]
[]
[]
[]
[]
[]
[]
[]
[]
[]
[]
[]
[]
[]
[]
[]
[]
[]
[]
[]
[]
[]
[]
[]
[]
[]
[]
[]
[]
[]
[]
[]
[]
[]
[]
[]
[]
[]
[]
[]
[]
[]
[]
[]
[]
[]
[]
[]
[]
[]
[]
[]
[]
[]
[]
[]
[]
[]
[]
[]
[]
[]
[]
[]
[]
[]
[]
[]
[]
[]
[]
[]
[]
[]
[]
[]
[]
[]
[]
[]
[]
[]
[]
[]
[]
[]
[]
[]
[]
[]
[]
[]
[]
[]
[]
[]
[]
[]
[]
[]
[]
[]
[]
[]
[]
[]
[]
[]
[]
[]
[]
[]
[]
[]
[]
[]
[]
[]
[]
[]
[]
[]
[]
[]
[]
[]
[]
[]
[]
[]
[]
[]
[]
[]
[]
[]
[]
[]
[]
[]
[]
[]
["DHS08"]
["Bolivia (Plurinational State of)",null,"Count"]
["W_text_t","",19564]
["W_text_i","",19564]
["S_text_s","Ratio of Shared improved based on:",19564]
["S_text_i","Ratio of Improved latrines based on:",19564]
["Urban/Rural","Urban",11485]
[null,"Rural",8079]
[null,"Missing",0]
["2008"]
[]
["Sub-national region names","Weighted population"]
[{"$f":"R15","v":"Beni"},{"$f":"BR122+BR123","v":{"$error":"#VALUE!"}}]
[{"$f":"S15","v":"Chuquisaca"},{"$f":"BS122+BS123","v":{"$error":"#VALUE!"}}]
[{"$f":"T15","v":"Cochabamba"},{"$f":"BT122+BT123","v":{"$error":"#VALUE!"}}]
[{"$f":"U15","v":"La Paz"},{"$f":"BU122+BU123","v":{"$error":"#VALUE!"}}]
[{"$f":"V15","v":"Oruro"},{"$f":"BV122+BV123","v":{"$error":"#VALUE!"}}]
[{"$f":"W15","v":"Pando"},{"$f":"BW122+BW123","v":{"$error":"#VALUE!"}}]
[{"$f":"X15","v":"Potosí"},{"$f":"BX122+XR123","v":{"$error":"#VALUE!"}}]
[{"$f":"Y15","v":"Santa Cruz"},{"$f":"BY122+BY123","v":{"$error":"#VALUE!"}}]
[{"$f":"Z15","v":"Tarija"},{"$f":"BZ122+BZ123","v":{"$error":"#VALUE!"}}]
[{"$f":"AA15","v":0},{"$f":"CA122+CA123","v":0}]
[{"$f":"AB15","v":0},{"$f":"CB122+CB123","v":0}]
[{"$f":"AC15","v":0},{"$f":"CC122+CC123","v":0}]
[{"$f":"AD15","v":0},{"$f":"CD122+CD123","v":0}]
[{"$f":"AE15","v":0},{"$f":"CE122+CE123","v":0}]
[{"$f":"AF15","v":0},{"$f":"CF122+CF123","v":0}]
[{"$f":"AG15","v":0},{"$f":"CG122+CG123","v":0}]
[{"$f":"AH15","v":0},{"$f":"CH122+CH123","v":0}]
[{"$f":"AI15","v":0},{"$f":"CI122+CI123","v":0}]
[{"$f":"AJ15","v":0},{"$f":"CJ122+CJ123","v":0}]
[{"$f":"AK15","v":0},{"$f":"CK122+CK123","v":0}]
[{"$f":"AL15","v":0},{"$f":"CL122+CL123","v":0}]
[{"$f":"AM15","v":0},{"$f":"CM122+CM123","v":0}]
[{"$f":"AN15","v":0},{"$f":"CN122+CN123","v":0}]
[{"$f":"AO15","v":0},{"$f":"CO122+CO123","v":0}]
[{"$f":"AP15","v":0},{"$f":"CP122+CP123","v":0}]
[{"$f":"AQ15","v":0},{"$f":"CQ122+CQ123","v":0}]
[{"$f":"AR15","v":0},{"$f":"CR122+CR123","v":0}]
[{"$f":"AS15","v":0},{"$f":"CS122+CS123","v":0}]
[{"$f":"AT15","v":0},{"$f":"CT122+CT123","v":0}]
[{"$f":"AU15","v":0},{"$f":"CU122+CU123","v":0}]
[{"$f":"AV15","v":0},{"$f":"CV122+CV123","v":0}]
[{"$f":"AW15","v":0},{"$f":"CW122+CW123","v":0}]
[{"$f":"AX15","v":0},{"$f":"CX122+CX123","v":0}]
[{"$f":"AY15","v":0},{"$f":"CY122+CY123","v":0}]
[]
[{"$f":"34-COUNTIF(A1037:A1071,\"0\")","v":9},"Sub-regions"]

{"sheet":"EDS16","index":6,"n_rows":1072,"n_cols":78,"rows_kept":1072,"cut":false,"hidden":false,"merged":[[340,52,341,52],[342,52,343,52],[344,52,345,52],[346,52,347,52],[348,52,349,52],[350,52,351,52],[352,52,353,52],[152,52,157,52],[230,52,232,52],[219,54,219,58],[219,59,219,63],[219,64,219,68],[221,52,223,52],[224,52,225,52],[226,52,229,52],[258,54,258,58],[258,59,258,63],[258,64,258,68],[260,52,262,52],[263,52,266,52],[267,52,269,52],[270,52,272,52],[273,52,275,52],[276,52,283,52],[338,54,338,58],[338,59,338,63],[338,64,338,68],[139,52,142,52],[143,0,146,0],[143,52,146,52],[147,0,149,0],[147,52,149,52],[150,0,151,0],[150,52,151,52],[13,54,13,58],[13,59,13,63],[13,64,13,68],[15,52,16,52],[17,52,20,52],[21,52,22,52],[26,54,26,58],[26,59,26,63],[26,64,26,68],[55,54,55,58],[55,59,55,63],[55,64,55,68],[119,54,119,58],[119,59,119,63],[119,64,119,68],[121,52,122,52],[123,52,126,52],[127,52,128,52],[132,54,132,58],[132,59,132,63],[132,64,132,68],[134,52,138,52],[34,52,35,52],[36,52,37,52],[38,0,39,0],[38,52,39,52],[40,52,41,52],[42,52,43,52],[44,52,45,52],[46,0,48,0],[46,52,48,52],[49,0,51,0],[49,52,51,52],[52,0,54,0],[52,52,54,52],[13,12,13,16],[15,0,16,0],[17,0,20,0],[21,0,22,0],[23,0,25,0],[13,2,13,6],[13,7,13,11],[28,52,29,52],[30,0,31,0],[30,52,31,52],[32,0,33,0],[32,52,33,52],[55,2,55,6],[55,7,55,11],[55,12,55,16],[28,0,29,0],[34,0,35,0],[36,0,37,0],[40,0,41,0],[42,0,43,0],[44,0,45,0],[26,2,26,6],[26,7,26,11],[26,12,26,16],[139,0,142,0],[119,12,119,16],[121,0,122,0],[123,0,126,0],[127,0,128,0],[129,0,131,0],[107,0,107,1],[119,2,119,6],[119,7,119,11],[57,0,68,0],[207,0,207,1],[219,2,219,6],[219,7,219,11],[219,12,219,16],[152,0,156,0],[201,0,202,0],[132,2,132,6],[132,7,132,11],[132,12,132,16],[134,0,138,0],[398,2,398,5],[398,7,398,10],[398,12,398,15],[399,2,399,4],[399,7,399,9],[399,12,399,14],[1024,0,1024,2],[420,7,420,8],[420,12,420,13],[421,2,421,3],[421,7,421,8],[421,12,421,13],[418,2,418,3],[418,7,418,8],[418,12,418,13],[419,2,419,3],[419,7,419,8],[419,12,419,13],[428,2,428,3],[428,7,428,8],[428,12,428,13],[429,2,429,3],[1025,0,1025,1],[1030,0,1032,0],[221,0,223,0],[224,0,225,0],[404,2,404,3],[404,7,404,8],[404,12,404,13],[405,2,405,3],[405,7,405,8],[405,12,405,13],[400,2,401,3],[400,7,401,8],[400,12,401,13],[401,1,444,1],[402,2,402,3],[402,7,402,8],[402,12,402,13],[403,2,403,3],[403,7,403,8],[403,12,403,13],[412,7,412,8],[412,12,412,13],[413,2,413,3],[413,7,413,8],[413,12,413,13],[422,2,422,3],[422,7,422,8],[422,12,422,13],[423,2,423,3],[423,7,423,8],[423,12,423,13],[420,2,420,3],[1033,0,1033,2],[410,2,410,3],[410,7,410,8],[410,12,410,13],[411,2,411,3],[411,7,411,8],[411,12,411,13],[408,2,408,3],[408,7,408,8],[408,12,408,13],[409,2,409,3],[409,7,409,8],[409,12,409,13],[406,2,406,3],[406,7,406,8],[406,12,406,13],[407,2,407,3],[407,7,407,8],[407,12,407,13],[416,2,416,3],[416,7,416,8],[416,12,416,13],[417,2,417,3],[417,7,417,8],[417,12,417,13],[414,2,414,3],[414,7,414,8],[414,12,414,13],[415,2,415,3],[415,7,415,8],[415,12,415,13],[412,2,412,3],[429,7,429,8],[429,12,429,13],[426,2,426,3],[426,7,426,8],[426,12,426,13],[427,2,427,3],[427,7,427,8],[427,12,427,13],[424,2,424,3],[424,7,424,8],[424,12,424,13],[425,2,425,3],[425,7,425,8],[425,12,425,13],[434,2,434,3],[434,7,434,8],[434,12,434,13],[435,2,435,3],[435,7,435,8],[435,12,435,13],[432,2,432,3],[432,7,432,8],[432,12,432,13],[433,2,433,3],[433,7,433,8],[433,12,433,13],[430,2,430,3],[430,7,430,8],[430,12,430,13],[431,2,431,3],[431,7,431,8],[431,12,431,13],[440,2,440,3],[440,7,440,8],[440,12,440,13],[441,2,441,3],[441,7,441,8],[441,12,441,13],[438,2,438,3],[438,7,438,8],[438,12,438,13],[439,2,439,3],[439,7,439,8],[439,12,439,13],[436,2,436,3],[436,7,436,8],[436,12,436,13],[437,2,437,3],[437,7,437,8],[437,12,437,13],[446,2,446,3],[446,7,446,8],[446,12,446,13],[447,2,447,3],[447,7,447,8],[447,12,447,13],[444,2,444,3],[444,7,444,8],[444,12,444,13],[445,2,445,3],[445,7,445,8],[445,12,445,13],[442,2,442,3],[442,7,442,8],[442,12,442,13],[443,2,443,3],[443,7,443,8],[443,12,443,13],[452,2,452,3],[452,7,452,8],[452,12,452,14],[453,2,453,3],[453,7,453,9],[453,12,453,13],[450,2,450,4],[450,7,450,8],[450,12,450,13],[451,2,451,3],[451,7,451,8],[451,12,451,13],[448,2,448,3],[448,7,448,8],[448,12,448,13],[449,2,449,3],[449,7,449,8],[449,12,449,13],[458,2,458,3],[458,7,458,8],[458,12,458,13],[459,2,459,3],[459,7,459,8],[459,12,459,13],[456,2,456,3],[456,7,456,8],[456,12,456,13],[457,2,457,3],[457,7,457,8],[457,12,457,13],[454,2,454,3],[454,7,454,8],[454,12,454,13],[455,2,455,3],[455,7,455,8],[455,12,455,13],[464,2,464,3],[464,7,464,8],[464,12,464,13],[465,2,465,3],[465,7,465,8],[465,12,465,13],[462,2,462,3],[462,7,462,8],[462,12,462,13],[463,2,463,3],[463,7,463,8],[463,12,463,13],[460,2,460,3],[460,7,460,8],[460,12,460,13],[461,2,461,3],[461,7,461,8],[461,12,461,13],[470,2,470,3],[470,7,470,8],[470,12,470,13],[471,2,471,3],[471,7,471,8],[471,12,471,13],[468,2,468,3],[468,7,468,8],[468,12,468,13],[469,2,469,3],[469,7,469,8],[469,12,469,13],[466,2,466,3],[466,7,466,8],[466,12,466,13],[467,2,467,3],[467,7,467,8],[467,12,467,13],[476,2,476,3],[476,7,476,8],[476,12,476,13],[477,2,477,3],[477,7,477,8],[477,12,477,13],[474,2,474,3],[474,7,474,8],[474,12,474,13],[475,2,475,3],[475,7,475,8],[475,12,475,13],[472,2,472,3],[472,7,472,8],[472,12,472,13],[473,2,473,3],[473,7,473,8],[473,12,473,13],[482,2,482,3],[482,7,482,8],[482,12,482,13],[483,2,483,3],[483,7,483,8],[483,12,483,13],[480,2,480,3],[480,7,480,8],[480,12,480,13],[481,2,481,3],[481,7,481,8],[481,12,481,13],[478,2,478,3],[478,7,478,8],[478,12,478,13],[479,2,479,3],[479,7,479,8],[479,12,479,13],[488,2,488,3],[488,7,488,8],[488,12,488,13],[489,2,489,3],[489,7,489,8],[489,12,489,13],[486,2,486,3],[486,7,486,8],[486,12,486,13],[487,2,487,3],[487,7,487,8],[487,12,487,13],[484,2,484,3],[484,7,484,8],[484,12,484,13],[485,2,485,3],[485,7,485,8],[485,12,485,13],[494,2,494,3],[494,7,494,8],[494,12,494,13],[495,2,495,3],[495,7,495,8],[495,12,495,13],[492,2,492,3],[492,7,492,8],[492,12,492,13],[493,2,493,3],[493,7,493,8],[493,12,493,13],[490,2,490,3],[490,7,490,8],[490,12,490,13],[491,2,491,3],[491,7,491,8],[491,12,491,13],[500,2,501,3],[500,4,500,6],[500,7,500,8],[500,12,500,13],[501,7,501,8],[501,12,501,13],[498,2,498,3],[498,7,498,8],[498,12,498,13],[499,2,499,6],[499,7,499,8],[499,12,499,13],[496,2,496,3],[496,7,496,8],[496,12,496,13],[497,2,497,3],[497,7,497,8],[497,12,497,13],[506,2,507,3],[506,7,507,8],[506,9,506,11],[506,12,506,13],[507,12,507,13],[508,2,508,3],[508,7,508,8],[508,12,508,13],[504,2,504,3],[504,7,504,8],[504,12,505,13],[504,14,504,16],[505,2,505,4],[505,7,505,11],[502,2,502,3],[502,7,502,8],[502,12,502,13],[503,2,503,3],[503,7,503,8],[503,12,503,16],[515,2,515,3],[515,7,515,8],[515,12,515,13],[516,2,516,3],[516,7,516,8],[516,12,516,13],[512,2,512,3],[512,7,513,8],[512,12,512,13],[513,2,513,3],[513,12,513,13],[514,2,514,3],[514,7,514,8],[514,12,514,13],[509,2,509,3],[509,7,509,8],[509,12,509,14],[510,2,510,3],[510,7,510,8],[510,12,511,13],[511,2,511,3],[511,7,511,9],[521,2,521,3],[521,7,521,8],[521,12,521,13],[522,2,522,3],[522,7,522,8],[522,12,522,13],[519,2,519,3],[519,7,519,8],[519,12,519,13],[520,2,520,3],[520,7,520,8],[520,12,520,13],[517,2,517,3],[517,7,517,8],[517,12,517,13],[518,2,518,3],[518,7,518,8],[518,12,518,13],[527,2,527,3],[527,7,527,8],[527,12,527,13],[528,2,528,3],[528,7,528,8],[528,12,528,13],[525,2,525,3],[525,7,525,8],[525,12,525,13],[526,2,526,3],[526,7,526,8],[526,12,526,13],[523,2,523,3],[523,7,523,8],[523,12,523,13],[524,2,524,3],[524,7,524,8],[524,12,524,13],[533,2,533,3],[533,7,533,8],[533,12,533,13],[534,2,534,3],[534,7,534,8],[534,12,534,13],[531,2,531,3],[531,7,531,8],[531,12,531,13],[532,2,532,3],[532,7,532,8],[532,12,532,13],[529,2,529,3],[529,7,529,8],[529,12,529,13],[530,2,530,3],[530,7,530,8],[530,12,530,13],[539,2,539,3],[539,7,539,8],[539,12,539,13],[540,2,540,3],[540,7,540,8],[540,12,540,13],[537,2,537,3],[537,7,537,8],[537,12,537,13],[538,2,538,3],[538,7,538,8],[538,12,538,13],[535,2,535,3],[535,7,535,8],[535,12,535,13],[536,2,536,3],[536,7,536,8],[536,12,536,13],[545,2,545,3],[545,7,545,8],[545,12,545,13],[546,2,546,3],[546,7,546,8],[546,12,546,13],[543,2,543,3],[543,7,543,8],[543,12,543,13],[544,2,544,3],[544,7,544,8],[544,12,544,13],[541,2,541,3],[541,7,541,8],[541,12,541,13],[542,2,542,3],[542,7,542,8],[542,12,542,13],[551,2,551,3],[551,7,551,8],[551,12,551,13],[552,2,552,3],[552,7,552,8],[552,12,552,13],[549,2,549,3],[549,7,549,8],[549,12,549,13],[550,2,550,3],[550,7,550,8],[550,12,550,13],[547,2,547,3],[547,7,547,8],[547,12,547,13],[548,2,548,3],[548,7,548,8],[548,12,548,13],[557,2,557,3],[557,7,557,8],[557,12,557,13],[558,2,558,3],[558,7,558,8],[558,12,558,13],[555,2,555,4],[555,7,555,8],[555,12,555,13],[556,2,556,3],[556,7,556,8],[556,12,556,13],[553,2,553,3],[553,7,553,8],[553,12,553,13],[554,2,554,3],[554,7,554,8],[554,12,554,13],[563,2,563,3],[563,7,563,8],[563,12,563,13],[564,2,564,3],[564,7,564,9],[564,12,564,13],[561,2,561,3],[561,7,561,8],[561,12,561,14],[562,2,562,3],[562,7,562,8],[562,12,562,13],[559,2,559,3],[559,7,559,8],[559,12,559,13],[560,2,560,3],[560,7,560,8],[560,12,560,13],[569,2,569,3],[569,7,569,8],[569,12,569,13],[570,2,570,3],[570,7,570,8],[570,12,570,13],[567,2,567,3],[567,7,567,8],[567,12,567,13],[568,2,568,3],[568,7,568,8],[568,12,568,13],[565,2,565,3],[565,7,565,8],[565,12,565,13],[566,2,566,3],[566,7,566,8],[566,12,566,13],[575,2,575,3],[575,7,575,8],[575,12,575,13],[576,2,576,3],[576,7,576,8],[576,12,576,13],[573,2,573,3],[573,7,573,8],[573,12,573,13],[574,2,574,3],[574,7,574,8],[574,12,574,13],[571,2,571,3],[571,7,571,8],[571,12,571,13],[572,2,572,3],[572,7,572,8],[572,12,572,13],[581,2,581,3],[581,7,581,8],[581,12,581,13],[582,2,582,3],[582,7,582,8],[582,12,582,13],[579,2,579,3],[579,7,579,8],[579,12,579,13],[580,2,580,3],[580,7,580,8],[580,12,580,13],[577,2,577,3],[577,7,577,8],[577,12,577,13],[578,2,578,3],[578,7,578,8],[578,12,578,13],[587,2,587,3],[587,7,587,8],[587,12,587,13],[588,2,588,3],[588,7,588,8],[588,12,588,13],[585,2,585,3],[585,7,585,8],[585,12,585,13],[586,2,586,3],[586,7,586,8],[586,12,586,13],[583,2,583,3],[583,7,583,8],[583,12,583,13],[584,2,584,3],[584,7,584,8],[584,12,584,13],[593,2,593,3],[593,7,593,8],[593,12,593,13],[594,2,594,3],[594,7,594,8],[594,12,594,13],[591,2,591,3],[591,7,591,8],[591,12,591,13],[592,2,592,3],[592,7,592,8],[592,12,592,13],[589,2,589,3],[589,7,589,8],[589,12,589,13],[590,2,590,3],[590,7,590,8],[590,12,590,13],[599,2,599,3],[599,7,599,8],[599,12,599,13],[600,2,600,3],[600,7,600,8],[600,12,600,13],[597,2,597,3],[597,7,597,8],[597,12,597,13],[598,2,598,3],[598,7,598,8],[598,12,598,13],[595,2,595,3],[595,7,595,8],[595,12,595,13],[596,2,596,3],[596,7,596,8],[596,12,596,13],[605,2,605,3],[605,7,605,8],[605,12,605,13],[606,2,606,3],[606,7,606,8],[606,12,606,13],[603,2,603,3],[603,7,603,8],[603,12,603,13],[604,2,604,3],[604,7,604,8],[604,12,604,13],[601,2,601,3],[601,7,601,8],[601,12,601,13],[602,2,602,3],[602,7,602,8],[602,12,602,13],[611,2,611,3],[611,7,611,8],[611,12,611,13],[612,2,612,3],[612,7,612,8],[612,12,612,13],[609,2,609,3],[609,7,609,8],[609,12,609,13],[610,2,610,3],[610,7,610,8],[610,12,610,13],[607,2,607,3],[607,7,607,8],[607,12,607,13],[608,2,608,3],[608,7,608,8],[608,12,608,13],[617,2,617,3],[617,7,617,8],[617,12,617,13],[618,2,618,3],[618,7,618,8],[618,12,618,13],[615,2,615,3],[615,7,615,8],[615,12,615,13],[616,2,616,3],[616,7,616,8],[616,12,616,13],[613,2,613,3],[613,7,613,8],[613,12,613,13],[614,2,614,3],[614,7,614,8],[614,12,614,13],[623,2,623,3],[623,7,623,8],[623,12,623,13],[624,2,624,3],[624,7,624,8],[624,12,624,13],[621,2,621,3],[621,7,621,8],[621,12,621,13],[622,2,622,3],[622,7,622,8],[622,12,622,13],[619,2,619,3],[619,7,619,8],[619,12,619,13],[620,2,620,3],[620,7,620,8],[620,12,620,13],[629,2,629,3],[629,7,629,8],[629,12,629,13],[630,2,630,3],[630,7,630,8],[630,12,630,13],[627,2,627,3],[627,7,627,8],[627,12,627,13],[628,2,628,3],[628,7,628,8],[628,12,628,13],[625,2,625,3],[625,7,625,8],[625,12,625,13],[626,2,626,3],[626,7,626,8],[626,12,626,13],[635,2,635,3],[635,7,635,8],[635,12,635,13],[636,2,636,3],[636,7,636,8],[636,12,636,13],[633,2,633,3],[633,7,633,8],[633,12,633,13],[634,2,634,3],[634,7,634,8],[634,12,634,13],[631,2,631,3],[631,7,631,8],[631,12,631,13],[632,2,632,3],[632,7,632,8],[632,12,632,13],[641,2,641,3],[641,7,641,8],[641,12,641,13],[642,2,642,3],[642,7,642,8],[642,12,642,13],[639,2,639,3],[639,7,639,8],[639,12,639,13],[640,2,640,3],[640,7,640,8],[640,12,640,13],[637,2,637,3],[637,7,637,8],[637,12,637,13],[638,2,638,3],[638,7,638,8],[638,12,638,13],[647,2,647,3],[647,7,647,8],[647,12,647,13],[648,2,648,3],[648,7,648,8],[648,12,648,13],[645,2,645,3],[645,7,645,8],[645,12,645,13],[646,2,646,3],[646,7,646,8],[646,12,646,13],[643,2,643,3],[643,7,643,8],[643,12,643,13],[644,2,644,3],[644,7,644,8],[644,12,644,13],[653,2,653,3],[653,7,653,8],[653,12,653,13],[654,2,654,3],[654,7,654,8],[654,12,654,13],[651,2,651,3],[651,7,651,8],[651,12,651,13],[652,2,652,3],[652,7,652,8],[652,12,652,13],[649,2,649,3],[649,7,649,8],[649,12,649,13],[650,2,650,3],[650,7,650,8],[650,12,650,13],[659,2,659,3],[659,7,659,8],[659,12,659,13],[660,2,660,3],[660,7,660,8],[660,12,660,13],[657,2,657,3],[657,7,657,8],[657,12,657,13],[658,2,658,3],[658,7,658,8],[658,12,658,13],[655,2,655,3],[655,7,655,8],[655,12,655,13],[656,2,656,3],[656,7,656,8],[656,12,656,13],[665,2,665,3],[665,7,665,8],[665,12,665,13],[666,2,666,3],[666,7,666,8],[666,12,666,13],[663,2,663,3],[663,7,663,8],[663,12,663,13],[664,2,664,3],[664,7,664,8],[664,12,664,13],[661,2,661,3],[661,7,661,8],[661,12,661,13],[662,2,662,3],[662,7,662,8],[662,12,662,13],[671,2,671,3],[671,7,671,8],[671,12,671,13],[672,2,672,3],[672,7,672,8],[672,12,672,13],[669,2,669,3],[669,7,669,8],[669,12,669,13],[670,2,670,3],[670,7,670,8],[670,12,670,13],[667,2,667,3],[667,7,667,8],[667,12,667,13],[668,2,668,3],[668,7,668,8],[668,12,668,13],[677,2,677,3],[677,7,677,8],[677,12,677,13],[678,2,678,3],[678,7,678,8],[678,12,678,13],[675,2,675,3],[675,7,675,8],[675,12,675,13],[676,2,676,3],[676,7,676,8],[676,12,676,13],[673,2,673,3],[673,7,673,8],[673,12,673,13],[674,2,674,3],[674,7,674,8],[674,12,674,13],[683,2,683,3],[683,7,683,8],[683,12,683,13],[684,2,684,3],[684,7,684,8],[684,12,684,13],[681,2,681,3],[681,7,681,8],[681,12,681,13],[682,2,682,3],[682,7,682,8],[682,12,682,13],[679,2,679,3],[679,7,679,8],[679,12,679,13],[680,2,680,3],[680,7,680,8],[680,12,680,13],[689,2,689,3],[689,7,689,8],[689,12,689,13],[690,2,690,3],[690,7,690,8],[690,12,690,13],[687,2,687,3],[687,7,687,8],[687,12,687,13],[688,2,688,3],[688,7,688,8],[688,12,688,13],[685,2,685,3],[685,7,685,8],[685,12,685,13],[686,2,686,3],[686,7,686,8],[686,12,686,13],[695,2,695,3],[695,7,695,8],[695,12,695,13],[696,2,696,3],[696,7,696,8],[696,12,696,13],[693,2,693,3]],"merged_total":1317,"flags":["merged_cut"]}
[]
[{"$f":"A1026","v":"Bolivia (Plurinational State of)"}]
[{"$f":"A1034","v":"2016"}]
["Use of drinking water sources"]
[" by wealth quintile and sub-national region"]
["Notes:"]
["WHO/UNICEF JMP customised wealth index excludes water,"]
[" sanitation and hygiene assets."]
["Survey used for analysis:",{"$f":"A1025","v":"EDS16"}]
[{"$f":"B1028","v":""}]
[{"$f":"B1027","v":""}]
[]
[]
["Use of drinking water sources",null,"NATIONAL wealth index quintile",null,null,null,null,"URBAN wealth index quintile",null,null,null,null,"RURAL wealth index quintile",null,null,null,null,"SUB-REGIONS:",null,null,null,null,null,null,null,null,null,null,null,null,null,null,null,null,null,null,null,null,null,null,null,null,null,null,null,null,null,null,null,null,null,null,"Raw numbers of respondents:","Use of drinking water sources","NATIONAL wealth index quintile",null,null,null,null,"URBAN wealth index quintile",null,null,null,null,"RURAL wealth index quintile",null,null,null,null,"SUB-REGIONS:"]
["Weighted percentage (used in graphs)",null,"Poorest","Poor","Middle","Rich","Richest","Poorest","Poor","Middle","Rich","Richest","Poorest","Poor","Middle","Rich","Richest","Beni","Chuquisaca","Cochabamba","La Paz","Oruro","Pando","Potos?","Santa Cruz","Tarija",null,null,null,null,null,null,null,null,null,null,null,null,null,null,null,null,null,null,null,null,null,null,null,null,null,null,"Water data, raw numbers (weighted)",null,"Poorest","Poor","Middle","Rich","Richest","Poorest","Poor","Middle","Rich","Richest","Poorest","Poor","Middle","Rich","Richest","Beni","Chuquisaca","Cochabamba","La Paz","Oruro","Pando","Potos?","Santa Cruz","Tarija"]
["Water","Improved",77.44066129777471,94.976905907521186,97.497951900561645,99.285644929599471,99.911076540801375,96.435907269891771,99.390732594726217,99.419814627641813,99.836766640621079,99.976556713376908,68.416960440079492,76.864440371207877,83.383036593868212,90.236212866025625,93.100522043473688,87.771381242640373,89.653345616581475,93.93763901363063,89.955407087963806,94.736854515752682,78.823883302461468,92.893179400924978,99.2209118306086,97.143730585860027,null,null,null,null,null,null,null,null,null,null,null,null,null,null,null,null,null,null,null,null,null,null,null,null,null,null,"Water","Improved","N/A","N/A","N/A","N/A","N/A","N/A","N/A","N/A","N/A","N/A","N/A","N/A","N/A","N/A","N/A","N/A","N/A","N/A","N/A","N/A","N/A","N/A","N/A","N/A"]
[null,"Not Improved",22.559338702225411,5.023094092478936,2.5020480994384369,0.71435507040047797,8.892345919860814E-2,3.564092730108221,0.60926740527380696,0.58018537235822376,0.16323335937893488,2.3443286623098452E-2,31.58303955992054,23.135559628791803,16.616963406131745,9.7637871339742457,6.8994779565262139,12.228618757359632,10.346654383418526,6.0623609863695709,10.044592912036274,5.2631454842473318,21.176116697538536,7.1068205990749878,0.77908816939137293,2.8562694141398954,null,null,null,null,null,null,null,null,null,null,null,null,null,null,null,null,null,null,null,null,null,null,null,null,null,null,null,"Not Improved","N/A","N/A","N/A","N/A","N/A","N/A","N/A","N/A","N/A","N/A","N/A","N/A","N/A","N/A","N/A","N/A","N/A","N/A","N/A","N/A","N/A","N/A","N/A","N/A"]
["Water ladder","Basic",{"$f":"C16*C23/100","v":76.637911047442799},{"$f":"D16*D23/100","v":94.692382183409407},{"$f":"E16*E23/100","v":97.412360119267646},99.210196193172123,99.892037550442964,96.115575474312791,99.324781989626274,99.396219309519054,99.818748811775635,99.948969093311248,67.010351977084014,75.872275615239914,83.122953963182681,90.015617267939874,92.93004405409161,87.46624000345372,89.181430857800308,93.890248818830131,89.703370832357066,94.505181477840438,78.213826447806198,92.376192878969377,98.959187173086576,96.957198405804945,null,null,null,null,null,null,null,null,null,null,null,null,null,null,null,null,null,null,null,null,null,null,null,null,null,null,"Water ladder","Basic","N/A","N/A","N/A","N/A","N/A","N/A","N/A","N/A","N/A","N/A","N/A","N/A","N/A","N/A","N/A","N/A","N/A","N/A","N/A","N/A","N/A","N/A","N/A","N/A"]
[null,"Limited",{"$f":"C16*C22/100","v":0.80275025033190883},{"$f":"D16*D22/100","v":0.28452372411180454},{"$f":"E16*E22/100","v":8.5591781294009989E-2},7.5448736427366977E-2,1.9038990358404579E-2,0.32033179557898267,6.5950605099952583E-2,2.359531812275116E-2,1.8017828845429695E-2,2.7587620065662354E-2,1.4066084629955049,0.99216475596796083,0.26008263068552123,0.22059559808576557,0.17047798938208025,0.30514123918664388,0.4719147587811699,4.7390194800508594E-2,0.25203625560674581,0.2316730379122286,0.61005685465525739,0.51698652195559913,0.26172465752201035,0.18653218005506633,null,null,null,null,null,null,null,null,null,null,null,null,null,null,null,null,null,null,null,null,null,null,null,null,null,null,null,"Limited","N/A","N/A","N/A","N/A","N/A","N/A","N/A","N/A","N/A","N/A","N/A","N/A","N/A","N/A","N/A","N/A","N/A","N/A","N/A","N/A","N/A","N/A","N/A","N/A"]
[null,"Unimproved",{"$f":"100-C18-C19-C21","v":6.6768615727121006},{"$f":"100-D18-D19-D21","v":2.1771329964626864},{"$f":"100-E18-E19-E21","v":0.88473966650189761},0.39147034663774216,6.2248064806325193E-3,3.1222857465306437,0.57948669577779222,0.58018537235819456,0.16323335937893579,-1.1178972861103365E-4,6.4112252066850921,6.4029777263102048,5.9449935110721235,2.4931988983161499,1.5820170261362154,6.1057664444503361,2.9219269223032667,0.72470026856229097,2.9247679267992357,2.9428442945024091,6.9763219352367027,3.2116091719522308,0.54214394086059847,1.1990559879736902,null,null,null,null,null,null,null,null,null,null,null,null,null,null,null,null,null,null,null,null,null,null,null,null,null,null,null,"Unimproved","N/A","N/A","N/A","N/A","N/A","N/A","N/A","N/A","N/A","N/A","N/A","N/A","N/A","N/A","N/A","N/A","N/A","N/A","N/A","N/A","N/A","N/A","N/A","N/A"]
[null,"Surface water",15.882477129513193,2.8459610960161021,1.6173084329364464,0.32288472376276744,8.2698652717998616E-2,0.4418069835775823,2.9780709495981179E-2,0,0,2.3555076351700222E-2,25.171814353235391,16.732581902481922,10.671969895059675,7.2705882356582112,5.3174609303900944,6.1228523129092993,7.4247274611152561,5.3376607178070703,7.1198249852369528,2.3203011897449244,14.19979476230184,3.8952114271227933,0.23694422853081498,1.6572134261662981,null,null,null,null,null,null,null,null,null,null,null,null,null,null,null,null,null,null,null,null,null,null,null,null,null,null,null,"Surface water","N/A","N/A","N/A","N/A","N/A","N/A","N/A","N/A","N/A","N/A","N/A","N/A","N/A","N/A","N/A","N/A","N/A","N/A","N/A","N/A","N/A","N/A","N/A","N/A"]
["Improved water point at more than 30 minutes","Yes",1.0366004588276627,0.29957148150187657,8.7788286446576047E-2,7.5991586176295131E-2,1.9055935555483176E-2,0.33217066614252028,6.6354883778623031E-2,2.3733013596055254E-2,1.8047288039974133E-2,2.7594089027043994E-2,2.0559353323324436,1.290798126124924,0.31191311963403245,0.24446460138269044,0.1831117437799917,0.34765459409040572,0.52637718708167069,5.0448569176442824E-2,0.28017910625460191,0.24454373020555206,0.77394925128765757,0.55653873114224706,0.26377973422460632,0.19201669416041292,null,null,null,null,null,null,null,null,null,null,null,null,null,null,null,null,null,null,null,null,null,null,null,null,null,null,"Improved water point at more than 30 minutes","Yes","N/A","N/A","N/A","N/A","N/A","N/A","N/A","N/A","N/A","N/A","N/A","N/A","N/A","N/A","N/A","N/A","N/A","N/A","N/A","N/A","N/A","N/A","N/A","N/A"]
[null,"No",98.963399541172336,99.700428518498157,99.912211713553432,99.924008413823728,99.980944064444515,99.667829333857483,99.933645116221399,99.976266986403942,99.98195271196002,99.972405910972952,97.944064667667604,98.709201873875074,99.688086880365958,99.755535398617326,99.816888256220011,99.652345405909585,99.473622812918336,99.949551430823576,99.719820893745407,99.755456269794422,99.226050748712339,99.443461268857746,99.736220265775373,99.807983305839571,null,null,null,null,null,null,null,null,null,null,null,null,null,null,null,null,null,null,null,null,null,null,null,null,null,null,null,"No","N/A","N/A","N/A","N/A","N/A","N/A","N/A","N/A","N/A","N/A","N/A","N/A","N/A","N/A","N/A","N/A","N/A","N/A","N/A","N/A","N/A","N/A","N/A","N/A"]
["Manually calculated ratios","Improved wells"]
[null,"Improved springs"]
[null,"Other"]
[null,null,"NATIONAL wealth index quintile",null,null,null,null,"URBAN wealth index quintile",null,null,null,null,"RURAL wealth index quintile",null,null,null,null,"SUB-REGIONS:",null,null,null,null,null,null,null,null,null,null,null,null,null,null,null,null,null,null,null,null,null,null,null,null,null,null,null,null,null,null,null,null,null,null,"Raw numbers of respondents:","Use of drinking water sources","NATIONAL wealth index quintile",null,null,null,null,"URBAN wealth index quintile",null,null,null,null,"RURAL wealth index quintile",null,null,null,null,"SUB-REGIONS:"]
["Percentage based on weighted population",null,"Poorest","Poor","Middle","Rich","Richest","Poorest","Poor","Middle","Rich","Richest","Poorest","Poor","Middle","Rich","Richest","Beni","Chuquisaca","Cochabamba","La Paz","Oruro","Pando","Potos?","Santa Cruz","Tarija",null,null,null,null,null,null,null,null,null,null,null,null,null,null,null,null,null,null,null,null,null,null,null,null,null,null,"Water data, raw numbers (weighted)",null,"Poorest","Poor","Middle","Rich","Richest","Poorest","Poor","Middle","Rich","Richest","Poorest","Poor","Middle","Rich","Richest","Beni","Chuquisaca","Cochabamba","La Paz","Oruro","Pando","Potos?","Santa Cruz","Tarija"]
["Piped water","Yes",38.844916780911682,67.215360052702778,76.253240957274087,82.303049535904677,89.500607011252413,77.198733313859847,83.673144638462261,86.884375682664498,89.017900744718602,90.071477432428068,28.618388956973611,37.12523939571355,39.028448932783498,43.757302883219246,45.482777232932278,49.347721261783121,84.903873455173667,26.678752751583723,69.979518650765343,80.816444905604286,45.814321807065653,90.12527695453177,93.286773682475129,71.055751115877314,null,null,null,null,null,null,null,null,null,null,null,null,null,null,null,null,null,null,null,null,null,null,null,null,null,null,"Piped water","Yes","N/A","N/A","N/A","N/A","N/A","N/A","N/A","N/A","N/A","N/A","N/A","N/A","N/A","N/A","N/A","N/A","N/A","N/A","N/A","N/A","N/A","N/A","N/A","N/A"]
[null,"No",61.155083219088382,32.784639947297791,23.746759042725877,17.696950464095433,10.499392988747488,22.80126668614021,16.326855361537621,13.115624317335492,10.982099255281412,9.9285225675719033,71.381611043026268,62.874760604286038,60.97155106721641,56.242697116780739,54.517222767067686,50.652278738216808,15.096126544826308,73.321247248416171,30.020481349235027,19.183555094395938,54.185678192934382,9.874723045468226,6.7132263175248328,28.944248884122164,null,null,null,null,null,null,null,null,null,null,null,null,null,null,null,null,null,null,null,null,null,null,null,null,null,null,null,"No","N/A","N/A","N/A","N/A","N/A","N/A","N/A","N/A","N/A","N/A","N/A","N/A","N/A","N/A","N/A","N/A","N/A","N/A","N/A","N/A","N/A","N/A","N/A","N/A"]
["Piped water on premises","Yes",35.241479403832443,65.09901726735437,75.649132086918812,81.931011531563072,89.458378007486388,74.596175770369072,83.16088189132374,86.715866070266983,88.997829053688889,90.071477432428068,24.558852226638802,33.049815490469605,36.406157249709068,41.821740908524376,43.874043095140486,48.125607501839767,81.99403953961145,26.58721715881245,69.158325072003066,78.616948766482224,42.516148318772679,80.706125024478581,93.284089624092701,70.848781824400518,null,null,null,null,null,null,null,null,null,null,null,null,null,null,null,null,null,null,null,null,null,null,null,null,null,null,"Piped water on premises","Yes","N/A","N/A","N/A","N/A","N/A","N/A","N/A","N/A","N/A","N/A","N/A","N/A","N/A","N/A","N/A","N/A","N/A","N/A","N/A","N/A","N/A","N/A","N/A","N/A"]
[null,"No",64.758520596167529,34.900982732646163,24.35086791308111,18.068988468437027,10.541621992513507,25.403824229631027,16.839118108676139,13.284133929732993,11.002170946311136,9.9285225675719033,75.44114777336118,66.950184509530089,63.593842750290875,58.178259091475581,56.125956904859478,51.874392498160148,18.005960460388454,73.412782841187436,30.841674927997246,21.383051233518003,57.483851681227328,19.293874975521401,6.7159103759072662,29.151218175598949,null,null,null,null,null,null,null,null,null,null,null,null,null,null,null,null,null,null,null,null,null,null,null,null,null,null,null,"No","N/A","N/A","N/A","N/A","N/A","N/A","N/A","N/A","N/A","N/A","N/A","N/A","N/A","N/A","N/A","N/A","N/A","N/A","N/A","N/A","N/A","N/A","N/A","N/A"]
["Piped water into dwelling","Yes","N/A","N/A","N/A","N/A","N/A","N/A","N/A","N/A","N/A","N/A","N/A","N/A","N/A","N/A","N/A","N/A","N/A","N/A","N/A","N/A","N/A","N/A","N/A","N/A",null,null,null,null,null,null,null,null,null,null,null,null,null,null,null,null,null,null,null,null,null,null,null,null,null,null,"Piped water into dwelling","Yes","N/A","N/A","N/A","N/A","N/A","N/A","N/A","N/A","N/A","N/A","N/A","N/A","N/A","N/A","N/A","N/A","N/A","N/A","N/A","N/A","N/A","N/A","N/A","N/A"]
[null,"No","N/A","N/A","N/A","N/A","N/A","N/A","N/A","N/A","N/A","N/A","N/A","N/A","N/A","N/A","N/A","N/A","N/A","N/A","N/A","N/A","N/A","N/A","N/A","N/A",null,null,null,null,null,null,null,null,null,null,null,null,null,null,null,null,null,null,null,null,null,null,null,null,null,null,null,"No","N/A","N/A","N/A","N/A","N/A","N/A","N/A","N/A","N/A","N/A","N/A","N/A","N/A","N/A","N/A","N/A","N/A","N/A","N/A","N/A","N/A","N/A","N/A","N/A"]
["Water source on premises","Yes",58.931238495710616,87.443258084098446,94.041890412922072,96.997199592182383,98.551881109184365,87.295937336397586,95.357914578855627,96.649116459762013,97.710216662106191,99.016031816604126,35.606669094201202,62.795344699596392,75.604831512716743,81.726186256607377,92.046339563687866,51.423779454220806,81.99403953961145,89.07075453053578,88.026345120815179,86.635758522771468,46.230653752022974,81.994250484303194,93.789649578898803,93.719740166674299,null,null,null,null,null,null,null,null,null,null,null,null,null,null,null,null,null,null,null,null,null,null,null,null,null,null,"Water source on premises","Yes","N/A","N/A","N/A","N/A","N/A","N/A","N/A","N/A","N/A","N/A","N/A","N/A","N/A","N/A","N/A","N/A","N/A","N/A","N/A","N/A","N/A","N/A","N/A","N/A"]
[null,"No",41.068761504289533,12.556741915901773,5.9581095870779777,3.0028004078176576,1.4481188908156615,12.704062663602366,4.6420854211443201,3.3508835402379678,2.2897833378937942,0.98396818339585179,64.393330905798834,37.204655300403147,24.395168487283126,18.273813743392566,7.9536604363120125,48.576220545779094,18.005960460388454,10.929245469464338,11.973654879184917,13.364241477228688,53.769346247977033,18.005749515696785,6.2103504211011433,6.2802598333255162,null,null,null,null,null,null,null,null,null,null,null,null,null,null,null,null,null,null,null,null,null,null,null,null,null,null,null,"No","N/A","N/A","N/A","N/A","N/A","N/A","N/A","N/A","N/A","N/A","N/A","N/A","N/A","N/A","N/A","N/A","N/A","N/A","N/A","N/A","N/A","N/A","N/A","N/A"]
["Improved Water source on premises","Yes",69.968884248284553,90.205592396382855,94.861315845137824,97.295627839248951,98.557437913672885,90.218929016920953,95.884477411070378,97.172525860509978,97.854565369687634,99.015801088032248,46.450865727048978,73.874622358562831,83.500576808639934,85.208841252727552,92.67537676646451,58.29612002590968,91.456753761620448,92.206919725196229,93.239253892868931,89.557832025863078,57.552707958417074,87.748353266374934,94.503942218087971,95.301661699920416,null,null,null,null,null,null,null,null,null,null,null,null,null,null,null,null,null,null,null,null,null,null,null,null,null,null,"Improved water source on premises","Yes","N/A","N/A","N/A","N/A","N/A","N/A","N/A","N/A","N/A","N/A","N/A","N/A","N/A","N/A","N/A","N/A","N/A","N/A","N/A","N/A","N/A","N/A","N/A","N/A"]
[null,"No",30.031115751715447,9.7944076036173389,5.1386841548622053,2.7043721607511237,1.442562086327128,9.7810709830790241,4.1155225889295588,2.8274741394899814,2.145434630312351,0.9841989119677258,53.549134272951008,26.125377641437016,16.499423191359945,14.791158747272531,7.3246232335354451,41.703879974090242,8.5432462383794672,7.7930802748037316,6.7607461071311228,10.442167974137126,42.447292041582955,12.251646733625087,5.496057781911996,4.6983383000794205,null,null,null,null,null,null,null,null,null,null,null,null,null,null,null,null,null,null,null,null,null,null,null,null,null,null,null,"No","N/A","N/A","N/A","N/A","N/A","N/A","N/A","N/A","N/A","N/A","N/A","N/A","N/A","N/A","N/A","N/A","N/A","N/A","N/A","N/A","N/A","N/A","N/A","N/A"]
["Piped water on premises available when needed","Yes","N/A","N/A","N/A","N/A","N/A","N/A","N/A","N/A","N/A","N/A","N/A","N/A","N/A","N/A","N/A","N/A","N/A","N/A","N/A","N/A","N/A","N/A","N/A","N/A",null,null,null,null,null,null,null,null,null,null,null,null,null,null,null,null,null,null,null,null,null,null,null,null,null,null,"Piped water on premises available when needed","Yes","N/A","N/A","N/A","N/A","N/A","N/A","N/A","N/A","N/A","N/A","N/A","N/A","N/A","N/A","N/A","N/A","N/A","N/A","N/A","N/A","N/A","N/A","N/A","N/A"]
[null,"No","N/A","N/A","N/A","N/A","N/A","N/A","N/A","N/A","N/A","N/A","N/A","N/A","N/A","N/A","N/A","N/A","N/A","N/A","N/A","N/A","N/A","N/A","N/A","N/A",null,null,null,null,null,null,null,null,null,null,null,null,null,null,null,null,null,null,null,null,null,null,null,null,null,null,null,"No","N/A","N/A","N/A","N/A","N/A","N/A","N/A","N/A","N/A","N/A","N/A","N/A","N/A","N/A","N/A","N/A","N/A","N/A","N/A","N/A","N/A","N/A","N/A","N/A"]
["Water point at more than 30 minutes","Yes",2.0964144677574921,0.40805404222423564,0.2952356309349437,7.5444757022990347E-2,1.9038863445925116E-2,0.44754999789389144,9.6981209525544856E-2,2.3593853013224246E-2,1.8017543318834567E-2,2.758758921830512E-2,3.6470016261437221,2.2738044239027584,0.78674877344304639,0.42277336692635181,0.76973709055030293,0.69660518738523125,1.4400860397526247,0.10066278092107989,0.81100851126831908,0.24785579819678727,2.01081143865972,1.3053616959836671,0.29528983752594595,0.45410307769841329,null,null,null,null,null,null,null,null,null,null,null,null,null,null,null,null,null,null,null,null,null,null,null,null,null,null,"Water point at more than 30 minutes","Yes","N/A","N/A","N/A","N/A","N/A","N/A","N/A","N/A","N/A","N/A","N/A","N/A","N/A","N/A","N/A","N/A","N/A","N/A","N/A","N/A","N/A","N/A","N/A","N/A"]
[null,"No",97.903585532242431,99.591945957775806,99.704764369065089,99.924555242977007,99.980961136554086,99.552450002106099,99.903018790474462,99.976406146986776,99.981982456681166,99.9724124107817,96.352998373856266,97.726195576097183,99.213251226556949,99.57722663307365,99.23026290944965,99.303394812614769,98.5599139602474,99.899337219078959,99.188991488731716,99.752144201803205,97.989188561340285,98.694638304016294,99.704710162474029,99.545896922301552,null,null,null,null,null,null,null,null,null,null,null,null,null,null,null,null,null,null,null,null,null,null,null,null,null,null,null,"No","N/A","N/A","N/A","N/A","N/A","N/A","N/A","N/A","N/A","N/A","N/A","N/A","N/A","N/A","N/A","N/A","N/A","N/A","N/A","N/A","N/A","N/A","N/A","N/A"]
["Water source available when needed","Yes","N/A","N/A","N/A","N/A","N/A","N/A","N/A","N/A","N/A","N/A","N/A","N/A","N/A","N/A","N/A","N/A","N/A","N/A","N/A","N/A","N/A","N/A","N/A","N/A",null,null,null,null,null,null,null,null,null,null,null,null,null,null,null,null,null,null,null,null,null,null,null,null,null,null,"Water source available when needed","Yes","N/A","N/A","N/A","N/A","N/A","N/A","N/A","N/A","N/A","N/A","N/A","N/A","N/A","N/A","N/A","N/A","N/A","N/A","N/A","N/A","N/A","N/A","N/A","N/A"]
[null,"No","N/A","N/A","N/A","N/A","N/A","N/A","N/A","N/A","N/A","N/A","N/A","N/A","N/A","N/A","N/A","N/A","N/A","N/A","N/A","N/A","N/A","N/A","N/A","N/A",null,null,null,null,null,null,null,null,null,null,null,null,null,null,null,null,null,null,null,null,null,null,null,null,null,null,null,"No","N/A","N/A","N/A","N/A","N/A","N/A","N/A","N/A","N/A","N/A","N/A","N/A","N/A","N/A","N/A","N/A","N/A","N/A","N/A","N/A","N/A","N/A","N/A","N/A"]
["Improved water source available when needed","Yes","N/A","N/A","N/A","N/A","N/A","N/A","N/A","N/A","N/A","N/A","N/A","N/A","N/A","N/A","N/A","N/A","N/A","N/A","N/A","N/A","N/A","N/A","N/A","N/A",null,null,null,null,null,null,null,null,null,null,null,null,null,null,null,null,null,null,null,null,null,null,null,null,null,null,"Improved water source available when needed","Yes","N/A","N/A","N/A","N/A","N/A","N/A","N/A","N/A","N/A","N/A","N/A","N/A","N/A","N/A","N/A","N/A","N/A","N/A","N/A","N/A","N/A","N/A","N/A","N/A"]
[null,"No","N/A","N/A","N/A","N/A","N/A","N/A","N/A","N/A","N/A","N/A","N/A","N/A","N/A","N/A","N/A","N/A","N/A","N/A","N/A","N/A","N/A","N/A","N/A","N/A",null,null,null,null,null,null,null,null,null,null,null,null,null,null,null,null,null,null,null,null,null,null,null,null,null,null,null,"No","N/A","N/A","N/A","N/A","N/A","N/A","N/A","N/A","N/A","N/A","N/A","N/A","N/A","N/A","N/A","N/A","N/A","N/A","N/A","N/A","N/A","N/A","N/A","N/A"]
["Microbiological quality at point of collection","Not contaminated (No E. coli in 100 mL)","N/A","N/A","N/A","N/A","N/A","N/A","N/A","N/A","N/A","N/A","N/A","N/A","N/A","N/A","N/A","N/A","N/A","N/A","N/A","N/A","N/A","N/A","N/A","N/A",null,null,null,null,null,null,null,null,null,null,null,null,null,null,null,null,null,null,null,null,null,null,null,null,null,null,"Microbiological quality at point of collection","Not contaminated (No E. coli in 100 mL)","N/A","N/A","N/A","N/A","N/A","N/A","N/A","N/A","N/A","N/A","N/A","N/A","N/A","N/A","N/A","N/A","N/A","N/A","N/A","N/A","N/A","N/A","N/A","N/A"]
[null,"Contaminated (E. coli detected in 100 mL)","N/A","N/A","N/A","N/A","N/A","N/A","N/A","N/A","N/A","N/A","N/A","N/A","N/A","N/A","N/A","N/A","N/A","N/A","N/A","N/A","N/A","N/A","N/A","N/A",null,null,null,null,null,null,null,null,null,null,null,null,null,null,null,null,null,null,null,null,null,null,null,null,null,null,null,"Contaminated (E. coli detected in 100 mL)","N/A","N/A","N/A","N/A","N/A","N/A","N/A","N/A","N/A","N/A","N/A","N/A","N/A","N/A","N/A","N/A","N/A","N/A","N/A","N/A","N/A","N/A","N/A","N/A"]
[null,"Highly contaminated (>100 CFU/100 mL)","N/A","N/A","N/A","N/A","N/A","N/A","N/A","N/A","N/A","N/A","N/A","N/A","N/A","N/A","N/A","N/A","N/A","N/A","N/A","N/A","N/A","N/A","N/A","N/A",null,null,null,null,null,null,null,null,null,null,null,null,null,null,null,null,null,null,null,null,null,null,null,null,null,null,null,"Highly contaminated (>100 CFU/100 mL)","N/A","N/A","N/A","N/A","N/A","N/A","N/A","N/A","N/A","N/A","N/A","N/A","N/A","N/A","N/A","N/A","N/A","N/A","N/A","N/A","N/A","N/A","N/A","N/A"]
["Microbiological quality of improved water sources at point of collection","Not contaminated (No E. coli in 100 mL)","N/A","N/A","N/A","N/A","N/A","N/A","N/A","N/A","N/A","N/A","N/A","N/A","N/A","N/A","N/A","N/A","N/A","N/A","N/A","N/A","N/A","N/A","N/A","N/A",null,null,null,null,null,null,null,null,null,null,null,null,null,null,null,null,null,null,null,null,null,null,null,null,null,null,"Microbiological quality of improved water sources at point of collection","Not contaminated (No E. coli in 100 mL)","N/A","N/A","N/A","N/A","N/A","N/A","N/A","N/A","N/A","N/A","N/A","N/A","N/A","N/A","N/A","N/A","N/A","N/A","N/A","N/A","N/A","N/A","N/A","N/A"]
[null,"Contaminated (E. coli detected in 100 mL)","N/A","N/A","N/A","N/A","N/A","N/A","N/A","N/A","N/A","N/A","N/A","N/A","N/A","N/A","N/A","N/A","N/A","N/A","N/A","N/A","N/A","N/A","N/A","N/A",null,null,null,null,null,null,null,null,null,null,null,null,null,null,null,null,null,null,null,null,null,null,null,null,null,null,null,"Contaminated (E. coli detected in 100 mL)","N/A","N/A","N/A","N/A","N/A","N/A","N/A","N/A","N/A","N/A","N/A","N/A","N/A","N/A","N/A","N/A","N/A","N/A","N/A","N/A","N/A","N/A","N/A","N/A"]
[null,"Highly contaminated (>100 CFU/100 mL)","N/A","N/A","N/A","N/A","N/A","N/A","N/A","N/A","N/A","N/A","N/A","N/A","N/A","N/A","N/A","N/A","N/A","N/A","N/A","N/A","N/A","N/A","N/A","N/A",null,null,null,null,null,null,null,null,null,null,null,null,null,null,null,null,null,null,null,null,null,null,null,null,null,null,null,"Highly contaminated (>100 CFU/100 mL)","N/A","N/A","N/A","N/A","N/A","N/A","N/A","N/A","N/A","N/A","N/A","N/A","N/A","N/A","N/A","N/A","N/A","N/A","N/A","N/A","N/A","N/A","N/A","N/A"]
["Microbiological quality of piped on premises at point of collection","Not contaminated (No E. coli in 100 mL)","N/A","N/A","N/A","N/A","N/A","N/A","N/A","N/A","N/A","N/A","N/A","N/A","N/A","N/A","N/A","N/A","N/A","N/A","N/A","N/A","N/A","N/A","N/A","N/A",null,null,null,null,null,null,null,null,null,null,null,null,null,null,null,null,null,null,null,null,null,null,null,null,null,null,"Microbiological quality of piped on premises at point of collection","Not contaminated (No E. coli in 100 mL)","N/A","N/A","N/A","N/A","N/A","N/A","N/A","N/A","N/A","N/A","N/A","N/A","N/A","N/A","N/A","N/A","N/A","N/A","N/A","N/A","N/A","N/A","N/A","N/A"]
[null,"Contaminated (E. coli detected in 100 mL)","N/A","N/A","N/A","N/A","N/A","N/A","N/A","N/A","N/A","N/A","N/A","N/A","N/A","N/A","N/A","N/A","N/A","N/A","N/A","N/A","N/A","N/A","N/A","N/A",null,null,null,null,null,null,null,null,null,null,null,null,null,null,null,null,null,null,null,null,null,null,null,null,null,null,null,"Contaminated (E. coli detected in 100 mL)","N/A","N/A","N/A","N/A","N/A","N/A","N/A","N/A","N/A","N/A","N/A","N/A","N/A","N/A","N/A","N/A","N/A","N/A","N/A","N/A","N/A","N/A","N/A","N/A"]
[null,"Highly contaminated (>100 CFU/100 mL)","N/A","N/A","N/A","N/A","N/A","N/A","N/A","N/A","N/A","N/A","N/A","N/A","N/A","N/A","N/A","N/A","N/A","N/A","N/A","N/A","N/A","N/A","N/A","N/A",null,null,null,null,null,null,null,null,null,null,null,null,null,null,null,null,null,null,null,null,null,null,null,null,null,null,null,"Highly contaminated (>100 CFU/100 mL)","N/A","N/A","N/A","N/A","N/A","N/A","N/A","N/A","N/A","N/A","N/A","N/A","N/A","N/A","N/A","N/A","N/A","N/A","N/A","N/A","N/A","N/A","N/A","N/A"]
[null,null,"NATIONAL wealth index quintile",null,null,null,null,"URBAN wealth index quintile",null,null,null,null,"RURAL wealth index quintile",null,null,null,null,"SUB-REGIONS:",null,null,null,null,null,null,null,null,null,null,null,null,null,null,null,null,null,null,null,null,null,null,null,null,null,null,null,null,null,null,null,null,null,null,"Raw numbers of respondents:","Use of drinking water sources","NATIONAL wealth index quintile",null,null,null,null,"URBAN wealth index quintile",null,null,null,null,"RURAL wealth index quintile",null,null,null,null,"SUB-REGIONS:"]
["Percentage based on weighted population",null,"Poorest","Poor","Middle","Rich","Richest","Poorest","Poor","Middle","Rich","Richest","Poorest","Poor","Middle","Rich","Richest","Beni","Chuquisaca","Cochabamba","La Paz","Oruro","Pando","Potos?","Santa Cruz","Tarija",null,null,null,null,null,null,null,null,null,null,null,null,null,null,null,null,null,null,null,null,null,null,null,null,null,null,"Water data, raw numbers (weighted)",null,"Poorest","Poor","Middle","Rich","Richest","Poorest","Poor","Middle","Rich","Richest","Poorest","Poor","Middle","Rich","Richest","Beni","Chuquisaca","Cochabamba","La Paz","Oruro","Pando","Potos?","Santa Cruz","Tarija"]
["¿Principalmente el agua para uso de su hogar, proviene de…?","1. Cañeria de red dentro de la vivienda?",6.7569162099090123,18.799871299358255,28.851383166011274,47.378831631174236,74.047325636158149,20.780767849299433,29.699900654914551,45.66080803819748,59.060044435566226,79.207038943474558,5.6543908102552756,5.5476717354808764,7.1795304995276075,10.214839391964233,18.257130660453875,13.209406669856385,72.514135827988852,17.298997214218833,44.331194267866735,35.427050919993903,18.165078389232065,25.559066075032032,35.659150886310087,42.854554542428581]
[null,"2. Cañeria de red fuera de la vivienda, pero dentro del lote o terreno?",28.484563193923425,46.299145967996139,46.797748920907459,34.552179900388758,15.411052371328344,53.815407921069514,53.460981236409211,41.055058032069468,29.937784618122652,10.864438488953439,18.904461416383509,27.502143754988705,29.226626750181406,31.606901516560153,25.616912434686657,34.91620083198341,9.4799037116226685,9.2882199445936315,24.827130804136466,43.189897846488371,24.351069929540607,55.147058949446659,57.624938737782713,27.994227281971924]
[null,"3. Pileta publica?",3.6034373770792429,2.1163427853483734,0.6041088703552302,0.37203800434159456,4.2229003766017154E-2,2.6025575434908039,0.51226274713851605,0.16850961239750287,2.0071691029722911E-2,0,4.0595367303348002,4.0754239052439738,2.6222916830744536,1.9355619746948807,1.6087341377918012,1.2221137599433585,2.9098339155621602,9.1535592771272295E-2,0.82119357876222798,2.1994961391220427,3.2981734882929303,9.4191519300531823,2.6840583824334218E-3,0.20696929147678575]
[null,"4. Pozo perforado o entubado, con bomba?",9.0175881579375083,6.5503417500634251,5.5904762401868524,6.7719252208120446,5.9569047925040337,5.8734877013661526,6.3348097831540811,5.5686169032432664,5.0553781470573744,6.6280665103386509,18.231051979877442,4.708935678850116,5.6078265833642442,6.6180380656701177,8.4651815067804073,2.5385036387416693,0.47491835655641645,28.347271685996855,0.62541535805402215,3.569915080494511,2.7060597560561117,0.23828999179292965,4.6383996779909387,0.34950735133517757]
[null,"5. Pozo excavado cubierto, con bomba?",4.4373498577585844,2.5613511465921057,2.4220768506347636,1.3246012102808358,0.84599357756464599,1.2807311160941537,1.0908103969850254,0.86033158524375786,0.45105105598538103,0.99244636835788669,4.6450759229719845,4.485390736999066,5.8262676487606821,5.3253918395117772,6.5335366709739384,1.7883399908623225,1.8191103423852748,6.2547194907271484,2.0241745087549092,3.9427011948244148,2.6115391032249891,0.2071880003329708,0.80213222533934603,1.3331422410043625]
[null,"6. Pozo excavado cubierto, sin bomba?",7.9268705871347418,3.6400946353043633,1.1340009923380463,0.42974729160825292,0.10976957625834566,3.7884707458581293,0.9764830695781006,0.44270191064092451,0.40321219177206274,6.3021119230343772E-2,6.9228009905613979,8.3051095078463444,7.5110542051853937,6.0543158452653127,1.1075680677704756,18.796925574923392,1.1131461216890126,1.9781172657864818,4.0973268397798011,2.705361006054293,4.6774878507953339,0.9994670590818705,0.44295014569198282,0.2219503840990783]
[null,"7. Pozo excavado no cubierto?",5.4540091016882286,1.0478624819621196,0.51928075511004224,0.23624903371619288,6.8395805967833203E-3,1.0132738730343895,0.2855205750939796,0.14192640139581655,9.4356087081928566E-2,0,5.8704766302320959,5.5827692437445524,5.2219240783331431,1.5967141835063381,1.603399069445113,6.6719075132325916,1.3370763429262635,0.5688510915345214,2.1794603948744782,1.8944368876106061,7.7445855223728559,2.5771651813063938,8.817270010399593E-2,0.47146395959921295]
[null,"8. Manantial o vertiente protegida?",16.22432557503825,10.869853686265214,7.9206400959710734,4.8472594323473608,0.94511929242366544,1.9956115733464816,1.9241905007193114,1.2338997534699125,1.2201118427141429,0.25483391590613369,9.5843495476445444,21.688800632847922,25.387243715672302,28.364494486634051,31.027919732652837,1.3756576123769719,0.78588537160936589,18.094510181704244,12.913895533699998,3.7024323287753949,11.450656329490153,1.2465958521585105,1.7127754384128436E-2,23.133206518435184]
[null,"9. Rio/Acequia/Vertiente no Protegida?",15.834949274091983,2.8186441041323769,1.6021134922904614,0.32053501567727055,8.2083878601824825E-2,0.43597116138147374,2.9471482984632306E-2,0,0,2.3443286623098452E-2,25.156070412870228,16.670253181758394,10.66960119711697,7.2545455692990828,5.2960788870810998,5.4323449693308197,7.4247274611152561,5.3130125604011269,7.1142087877919327,2.3203011897449244,12.69680214110101,3.8928264495778921,0.2368647850530623,1.6500320112116114]
[null,"10. Agua embotellada?",0.2992471201667139,0.86009081795768716,0.93952027557273821,0.7277235225359493,0.743390727621841,1.3208985853624111,0.96519383049885266,1.0528193379964605,0.95992359042676356,0.47458869134039039,6.2545910057279094E-2,0.3724991222919774,2.2195508102020513E-2,6.2388846179267689E-2,0.40211002184885297,11.277543672295101,0,0.34731531249652475,7.8881116553627395E-2,0,10.584608062019592,6.1228449071964203E-2,3.3528344727064723E-2,0.43334279346865623]
[null,"11. Carro repartidor (Aguatero)?",0.69036321882734508,3.2798138186360419,3.2379964885839558,2.8813387161105193,1.8092915631763506,4.9779742340046136,4.4261003753284429,3.3770694543829469,2.7291890679467481,1.4921226757754047,0.35274713199324403,0.17846529665877303,0,5.4280899545964961E-2,8.1428810514857966E-2,2.6466894916576296,0.5564119691677093,12.236952325335478,0.23619508035638212,0,0.97921039380969943,1.513309395498714E-2,0,0.61683018163980652]
[null,"12. Otro (Especifique)?",1.2703803264452074,1.1565875063844382,0.38065385203793262,0.15757102100701456,0,2.1148476956923581,0.2942753471951951,0.43825897096240712,6.8877272297006298E-2,0,0.55649251681821676,0.88253720328885765,0.72543813068162033,0.91252738116882703,0,0.12436627479623309,1.5848505793770011,0.18049733443391922,0.75092372936986895,1.048407406891801,0.73472903406466672,0.63682896819070045,0.45405068423431438,0.73477344332907124]
[]
[]
[]
[]
[]
[]
[]
[]
[]
[]
[]
[]
[]
[]
[]
[]
[]
[]
[]
[]
[]
[]
[]
[]
[]
[]
[]
[]
[]
[]
[]
[]
[]
[]
[]
[]
[]
[]
[{"$f":"A1026","v":"Bolivia (Plurinational State of)"}]
[{"$f":"A1034","v":"2016"}]
["Use of sanitation facilities"]
[" by wealth quintile and sub-national region"]
["Notes:"]
["WHO/UNICEF JMP customised wealth index excludes water,"]
[" sanitation and hygiene assets."]
["Survey used for analysis:",{"$f":"A1025","v":"EDS16"}]
[{"$f":"B1030","v":"Ratio of Improved latrines based on:"},"50% Rule"]
[{"$f":"B1029","v":"Ratio of Shared improved based on:"},"Shared among sanitation"]
[]
[]
["Use of sanitation facilities",null,"NATIONAL wealth index quintile",null,null,null,null,"URBAN wealth index quintile",null,null,null,null,"RURAL wealth index quintile",null,null,null,null,"SUB-REGIONS:",null,null,null,null,null,null,null,null,null,null,null,null,null,null,null,null,null,null,null,null,null,null,null,null,null,null,null,null,null,null,null,null,null,null,"Raw numbers of respondents:","Use of sanitation facilities","NATIONAL wealth index quintile",null,null,null,null,"URBAN wealth index quintile",null,null,null,null,"RURAL wealth index quintile",null,null,null,null,"SUB-REGIONS:"]
["Weighted percentage (used in graphs)",null,"Poorest","Poor","Middle","Rich","Richest","Poorest","Poor","Middle","Rich","Richest","Poorest","Poor","Middle","Rich","Richest","Beni","Chuquisaca","Cochabamba","La Paz","Oruro","Pando","Potos?","Santa Cruz","Tarija",null,null,null,null,null,null,null,null,null,null,null,null,null,null,null,null,null,null,null,null,null,null,null,null,null,null,"Sanitation data, raw numbers (weighted)",null,"Poorest","Poor","Middle","Rich","Richest","Poorest","Poor","Middle","Rich","Richest","Poorest","Poor","Middle","Rich","Richest","Beni","Chuquisaca","Cochabamba","La Paz","Oruro","Pando","Potos?","Santa Cruz","Tarija"]
["Sanitation","Improved",{"$f":"C135+C136+C137","v":28.468618399958068},{"$f":"D135+D136+D137","v":62.132390778221605},78.461205466605307,89.60599084447361,96.760017553159415,67.733160784693396,84.146140654334374,90.772972015458805,94.193225390345361,97.913816573204315,21.113128027795174,21.928549402576778,32.966461552623713,43.810744530236107,60.964554943088544,72.386353375152041,61.108175229204008,73.443550682651846,70.715813280510517,58.44850581614066,51.867229826488078,47.646398629583658,79.828034535722281,79.971997196690978,null,null,null,null,null,null,null,null,null,null,null,null,null,null,null,null,null,null,null,null,null,null,null,null,null,null,"Sanitation","Improved","N/A","N/A","N/A","N/A","N/A","N/A","N/A","N/A","N/A","N/A","N/A","N/A","N/A","N/A","N/A","N/A","N/A","N/A","N/A","N/A","N/A","N/A","N/A","N/A"]
[null,"Not Improved",{"$f":"100-C122","v":71.531381600041925},{"$f":"100-D122","v":37.867609221778395},21.538794533394693,10.39400915552639,3.2399824468405853,32.266839215306604,15.853859345665626,9.2270279845411949,5.8067746096546387,2.0861834267956851,78.88687197220483,78.071450597423222,67.033538447376287,56.189255469763893,39.035445056911456,27.613646624847959,38.891824770795992,26.556449317348154,29.284186719489483,41.55149418385934,48.132770173511922,52.353601370416342,20.171965464277719,20.028002803309022,null,null,null,null,null,null,null,null,null,null,null,null,null,null,null,null,null,null,null,null,null,null,null,null,null,null,null,"Not Improved","N/A","N/A","N/A","N/A","N/A","N/A","N/A","N/A","N/A","N/A","N/A","N/A","N/A","N/A","N/A","N/A","N/A","N/A","N/A","N/A","N/A","N/A","N/A","N/A"]
["Sanitation ladder","Basic",{"$f":"C122*C129/100","v":23.364601847428467},{"$f":"D122*D129/100","v":41.506796516762137},56.388952013308263,69.806080864790516,88.387253746819738,39.486351203097655,54.939069987577732,67.660345478673406,76.056607166014089,92.374783434069343,18.56347761813781,20.161445096143709,28.971706456849283,37.285506465759255,54.315972373293619,55.509953121791817,46.723094272442822,60.274725184252077,56.623010670492896,44.293187689722771,42.660375121311084,35.813861520375589,61.088904843982817,56.896516358491198,null,null,null,null,null,null,null,null,null,null,null,null,null,null,null,null,null,null,null,null,null,null,null,null,null,null,"Sanitation ladder","Basic","N/A","N/A","N/A","N/A","N/A","N/A","N/A","N/A","N/A","N/A","N/A","N/A","N/A","N/A","N/A","N/A","N/A","N/A","N/A","N/A","N/A","N/A","N/A","N/A"]
[null,"Limited",{"$f":"C122*C128/100","v":5.1040165525297239},{"$f":"D122*D128/100","v":20.625594261459586},22.072253453296966,19.799909979683179,8.3727638063397372,28.24680958159567,29.207070666756533,23.112626536785324,18.136618224331354,5.5390331391348919,2.5496504096573651,1.7671043064330794,3.9947550957744151,6.5252380644768744,6.6485825697949288,16.876400253360092,14.385080956761133,13.168825498399679,14.092802610017602,14.155318126417802,9.206854705176962,11.832537109207959,18.739129691739667,23.075480838199613,null,null,null,null,null,null,null,null,null,null,null,null,null,null,null,null,null,null,null,null,null,null,null,null,null,null,null,"Limited","N/A","N/A","N/A","N/A","N/A","N/A","N/A","N/A","N/A","N/A","N/A","N/A","N/A","N/A","N/A","N/A","N/A","N/A","N/A","N/A","N/A","N/A","N/A","N/A"]
[null,"Unimproved",{"$f":"100-C124-C125-C127","v":20.871934930036907},{"$f":"100-D124-D125-D127","v":18.342621209482058},13.663073174727682,7.874111117599603,2.8141594329615542,15.913989521867126,11.117061828226801,7.0372794541826469,5.2651444031154453,1.6688506048433545,19.765926094923159,19.301614607836406,24.898231301557381,25.186481432079056,24.101404707326559,22.150300748722874,7.1825746013689766,12.591509701620449,11.630826898856014,3.342524095101119,29.992641291184135,5.5688718781668101,16.904860418835721,9.7053197662946022,null,null,null,null,null,null,null,null,null,null,null,null,null,null,null,null,null,null,null,null,null,null,null,null,null,null,null,"Unimproved","N/A","N/A","N/A","N/A","N/A","N/A","N/A","N/A","N/A","N/A","N/A","N/A","N/A","N/A","N/A","N/A","N/A","N/A","N/A","N/A","N/A","N/A","N/A","N/A"]
[null,"Open defecation",{"$f":"C139","v":50.65944667000489},{"$f":"D139","v":19.524988012296223},7.8757213586670884,2.5198980379267022,0.4258230138789707,16.352849693439548,4.7367975174389354,2.189748530358623,0.54163020653911131,0.41733282195241062,59.12094587728167,58.769835989586802,42.135307145818921,31.002774037684816,14.934040349584896,5.4633458761252172,31.709250169427072,13.964939615727797,17.65335982063349,38.208970088758306,18.140128882327822,46.784729492249646,3.2671050454417947,10.322683037014587,null,null,null,null,null,null,null,null,null,null,null,null,null,null,null,null,null,null,null,null,null,null,null,null,null,null,null,"Open defecation","N/A","N/A","N/A","N/A","N/A","N/A","N/A","N/A","N/A","N/A","N/A","N/A","N/A","N/A","N/A","N/A","N/A","N/A","N/A","N/A","N/A","N/A","N/A","N/A"]
["Shared among Improved Sanitation","Yes",17.92857131604687,33.196202501013673,28.131422812120022,22.096636389021445,8.6531234884695909,41.703073139293089,34.70993492944239,25.462013662887671,19.254694962585202,5.6570495697036662,12.076137682207873,8.0584642148077101,12.117633824296449,14.894150132448589,10.9056525976471,23.314339604726147,23.540354302522857,17.930540361946711,19.928785311589735,24.218443104338153,17.750812480205205,24.83406395769256,23.474371880412619,28.854451116739664,null,null,null,null,null,null,null,null,null,null,null,null,null,null,null,null,null,null,null,null,null,null,null,null,null,null,"Shared among improved sanitation facilities","Yes","N/A","N/A","N/A","N/A","N/A","N/A","N/A","N/A","N/A","N/A","N/A","N/A","N/A","N/A","N/A","N/A","N/A","N/A","N/A","N/A","N/A","N/A","N/A","N/A"]
[null,"No",82.071428683953556,66.803797498986512,71.868577187879879,77.903363610978644,91.346876511530468,58.296926860706812,65.290065070557475,74.537986337112244,80.74530503741488,94.342950430296241,87.923862317792128,91.941535785192343,87.88236617570351,85.105849867551456,89.094347402352909,76.685660395273672,76.459645697477058,82.069459638053161,80.071214688410237,75.781556895661694,82.249187519794731,75.165936042307209,76.525628119587637,71.145548883260133,null,null,null,null,null,null,null,null,null,null,null,null,null,null,null,null,null,null,null,null,null,null,null,null,null,null,null,"No","N/A","N/A","N/A","N/A","N/A","N/A","N/A","N/A","N/A","N/A","N/A","N/A","N/A","N/A","N/A","N/A","N/A","N/A","N/A","N/A","N/A","N/A","N/A","N/A"]
["Manually calculated ratios","Improved latrines"]
[null,"Other"]
[null,"Other"]
[null,null,"NATIONAL wealth index quintile",null,null,null,null,"URBAN wealth index quintile",null,null,null,null,"RURAL wealth index quintile",null,null,null,null,"SUB-REGIONS:",null,null,null,null,null,null,null,null,null,null,null,null,null,null,null,null,null,null,null,null,null,null,null,null,null,null,null,null,null,null,null,null,null,null,"Raw numbers of respondents:","Use of sanitation facilities","NATIONAL wealth index quintile",null,null,null,null,"URBAN wealth index quintile",null,null,null,null,"RURAL wealth index quintile",null,null,null,null,"SUB-REGIONS:"]
["Percentage based on weighted population",null,"Poorest","Poor","Middle","Rich","Richest","Poorest","Poor","Middle","Rich","Richest","Poorest","Poor","Middle","Rich","Richest","Beni","Chuquisaca","Cochabamba","La Paz","Oruro","Pando","Potos?","Santa Cruz","Tarija",null,null,null,null,null,null,null,null,null,null,null,null,null,null,null,null,null,null,null,null,null,null,null,null,null,null,"Sanitation data, raw numbers (weighted)",null,"Poorest","Poor","Middle","Rich","Richest","Poorest","Poor","Middle","Rich","Richest","Poorest","Poor","Middle","Rich","Richest","Beni","Chuquisaca","Cochabamba","La Paz","Oruro","Pando","Potos?","Santa Cruz","Tarija"]
["Sanitation type","Sewer connection",4.2778593953867965,28.802260665280226,43.972766608892286,61.656798006399328,82.456982591191547,35.710517932972351,52.816613999564197,60.927898325254958,72.576016746906831,86.933859373782965,0.12881968101465194,0.83682074447537524,3.7546651097404191,7.8422604800583704,15.282503088803063,16.217602585192466,52.696624475433453,45.617087434041657,56.408420140506642,51.958411324198707,6.6324707310773334,39.243290132892483,33.157460745565622,62.121977979145001,null,null,null,null,null,null,null,null,null,null,null,null,null,null,null,null,null,null,null,null,null,null,null,null,null,null,"Sanitation type","Sewer connection","N/A","N/A","N/A","N/A","N/A","N/A","N/A","N/A","N/A","N/A","N/A","N/A","N/A","N/A","N/A","N/A","N/A","N/A","N/A","N/A","N/A","N/A","N/A","N/A"]
[null,"Septic tank connection",3.3188240745342337,14.987508903459206,20.825365682985421,20.075081720474603,11.488875529006256,16.108653329853997,20.212464826543485,22.807794236021277,16.352064240323017,9.3111065945780975,1.2183822518573708,1.7901140502649866,4.3135651413259168,10.782002618098662,21.580647146958924,34.018450041236839,1.2289761524016312,15.234953546989836,2.6765662411478877,3.1475703968409112,15.242117804226647,2.8342366185244803,29.765713371320718,8.1446994512515314,null,null,null,null,null,null,null,null,null,null,null,null,null,null,null,null,null,null,null,null,null,null,null,null,null,null,null,"Septic tank connection","N/A","N/A","N/A","N/A","N/A","N/A","N/A","N/A","N/A","N/A","N/A","N/A","N/A","N/A","N/A","N/A","N/A","N/A","N/A","N/A","N/A","N/A","N/A","N/A"]
[null,"Improved latrines",{"$f":"(100-(C135+C136+C139))*0.5","v":20.871934930037039},{"$f":"(100-(D135+D136+D139))*0.5","v":18.342621209482175},13.6630731747276,7.8741111175996821,2.8141594329616169,15.913989521867052,11.117061828226696,7.037279454182567,5.2651444031155208,1.6688506048432643,19.765926094923152,19.301614607836417,24.898231301557374,25.186481432079077,24.101404707326559,22.150300748722739,7.1825746013689269,12.591509701620353,11.630826898855986,3.3425240951010409,29.9926412911841,5.5688718781666964,16.904860418835931,9.7053197662944442,null,null,null,null,null,null,null,null,null,null,null,null,null,null,null,null,null,null,null,null,null,null,null,null,null,null,null,"Improved latrines","N/A","N/A","N/A","N/A","N/A","N/A","N/A","N/A","N/A","N/A","N/A","N/A","N/A","N/A","N/A","N/A","N/A","N/A","N/A","N/A","N/A","N/A","N/A","N/A"]
[null,"Unimproved facilities",{"$f":"(100-(C135+C136+C139))*0.5","v":20.871934930037039},{"$f":"(100-(D135+D136+D139))*0.5","v":18.342621209482175},13.6630731747276,7.8741111175996821,2.8141594329616169,15.913989521867052,11.117061828226696,7.037279454182567,5.2651444031155208,1.6688506048432643,19.765926094923152,19.301614607836417,24.898231301557374,25.186481432079077,24.101404707326559,22.150300748722739,7.1825746013689269,12.591509701620353,11.630826898855986,3.3425240951010409,29.9926412911841,5.5688718781666964,16.904860418835931,9.7053197662944442,null,null,null,null,null,null,null,null,null,null,null,null,null,null,null,null,null,null,null,null,null,null,null,null,null,null,null,"Unimproved facilities","N/A","N/A","N/A","N/A","N/A","N/A","N/A","N/A","N/A","N/A","N/A","N/A","N/A","N/A","N/A","N/A","N/A","N/A","N/A","N/A","N/A","N/A","N/A","N/A"]
[null,"Open defecation",50.65944667000489,19.524988012296223,7.8757213586670884,2.5198980379267022,0.4258230138789707,16.352849693439548,4.7367975174389354,2.189748530358623,0.54163020653911131,0.41733282195241062,59.12094587728167,58.769835989586802,42.135307145818921,31.002774037684816,14.934040349584896,5.4633458761252172,31.709250169427072,13.964939615727797,17.65335982063349,38.208970088758306,18.140128882327822,46.784729492249646,3.2671050454417947,10.322683037014587,null,null,null,null,null,null,null,null,null,null,null,null,null,null,null,null,null,null,null,null,null,null,null,null,null,null,null,"Open defecation","N/A","N/A","N/A","N/A","N/A","N/A","N/A","N/A","N/A","N/A","N/A","N/A","N/A","N/A","N/A","N/A","N/A","N/A","N/A","N/A","N/A","N/A","N/A","N/A"]
["Septic tank emptying practices","Not emptied/treated and disposed in situ","N/A","N/A","N/A","N/A","N/A","N/A","N/A","N/A","N/A","N/A","N/A","N/A","N/A","N/A","N/A","N/A","N/A","N/A","N/A","N/A","N/A","N/A","N/A","N/A",null,null,null,null,null,null,null,null,null,null,null,null,null,null,null,null,null,null,null,null,null,null,null,null,null,null,"Septic tank emptying practices","Not emptied/treated and disposed in situ","N/A","N/A","N/A","N/A","N/A","N/A","N/A","N/A","N/A","N/A","N/A","N/A","N/A","N/A","N/A","N/A","N/A","N/A","N/A","N/A","N/A","N/A","N/A","N/A"]
[null,"Emptied and buried on site","N/A","N/A","N/A","N/A","N/A","N/A","N/A","N/A","N/A","N/A","N/A","N/A","N/A","N/A","N/A","N/A","N/A","N/A","N/A","N/A","N/A","N/A","N/A","N/A",null,null,null,null,null,null,null,null,null,null,null,null,null,null,null,null,null,null,null,null,null,null,null,null,null,null,null,"Emptied and buried on site","N/A","N/A","N/A","N/A","N/A","N/A","N/A","N/A","N/A","N/A","N/A","N/A","N/A","N/A","N/A","N/A","N/A","N/A","N/A","N/A","N/A","N/A","N/A","N/A"]
[null,"Emptied and discharged locally","N/A","N/A","N/A","N/A","N/A","N/A","N/A","N/A","N/A","N/A","N/A","N/A","N/A","N/A","N/A","N/A","N/A","N/A","N/A","N/A","N/A","N/A","N/A","N/A",null,null,null,null,null,null,null,null,null,null,null,null,null,null,null,null,null,null,null,null,null,null,null,null,null,null,null,"Emptied and discharged locally","N/A","N/A","N/A","N/A","N/A","N/A","N/A","N/A","N/A","N/A","N/A","N/A","N/A","N/A","N/A","N/A","N/A","N/A","N/A","N/A","N/A","N/A","N/A","N/A"]
[null,"Emptied and removed offsite","N/A","N/A","N/A","N/A","N/A","N/A","N/A","N/A","N/A","N/A","N/A","N/A","N/A","N/A","N/A","N/A","N/A","N/A","N/A","N/A","N/A","N/A","N/A","N/A",null,null,null,null,null,null,null,null,null,null,null,null,null,null,null,null,null,null,null,null,null,null,null,null,null,null,null,"Emptied and removed offsite","N/A","N/A","N/A","N/A","N/A","N/A","N/A","N/A","N/A","N/A","N/A","N/A","N/A","N/A","N/A","N/A","N/A","N/A","N/A","N/A","N/A","N/A","N/A","N/A"]
["Latrine emptying practices","Not emptied/treated and disposed in situ","N/A","N/A","N/A","N/A","N/A","N/A","N/A","N/A","N/A","N/A","N/A","N/A","N/A","N/A","N/A","N/A","N/A","N/A","N/A","N/A","N/A","N/A","N/A","N/A",null,null,null,null,null,null,null,null,null,null,null,null,null,null,null,null,null,null,null,null,null,null,null,null,null,null,"Latrine emptying practices","Not emptied/treated and disposed in situ","N/A","N/A","N/A","N/A","N/A","N/A","N/A","N/A","N/A","N/A","N/A","N/A","N/A","N/A","N/A","N/A","N/A","N/A","N/A","N/A","N/A","N/A","N/A","N/A"]
[null,"Emptied and buried on site","N/A","N/A","N/A","N/A","N/A","N/A","N/A","N/A","N/A","N/A","N/A","N/A","N/A","N/A","N/A","N/A","N/A","N/A","N/A","N/A","N/A","N/A","N/A","N/A",null,null,null,null,null,null,null,null,null,null,null,null,null,null,null,null,null,null,null,null,null,null,null,null,null,null,null,"Emptied and buried on site","N/A","N/A","N/A","N/A","N/A","N/A","N/A","N/A","N/A","N/A","N/A","N/A","N/A","N/A","N/A","N/A","N/A","N/A","N/A","N/A","N/A","N/A","N/A","N/A"]
[null,"Emptied and discharged locally","N/A","N/A","N/A","N/A","N/A","N/A","N/A","N/A","N/A","N/A","N/A","N/A","N/A","N/A","N/A","N/A","N/A","N/A","N/A","N/A","N/A","N/A","N/A","N/A",null,null,null,null,null,null,null,null,null,null,null,null,null,null,null,null,null,null,null,null,null,null,null,null,null,null,null,"Emptied and discharged locally","N/A","N/A","N/A","N/A","N/A","N/A","N/A","N/A","N/A","N/A","N/A","N/A","N/A","N/A","N/A","N/A","N/A","N/A","N/A","N/A","N/A","N/A","N/A","N/A"]
[null,"Emptied and removed offsite","N/A","N/A","N/A","N/A","N/A","N/A","N/A","N/A","N/A","N/A","N/A","N/A","N/A","N/A","N/A","N/A","N/A","N/A","N/A","N/A","N/A","N/A","N/A","N/A",null,null,null,null,null,null,null,null,null,null,null,null,null,null,null,null,null,null,null,null,null,null,null,null,null,null,null,"Emptied and removed offsite","N/A","N/A","N/A","N/A","N/A","N/A","N/A","N/A","N/A","N/A","N/A","N/A","N/A","N/A","N/A","N/A","N/A","N/A","N/A","N/A","N/A","N/A","N/A","N/A"]
["Shared among improved sanitation facilities","Yes","N/A","N/A","N/A","N/A","N/A","N/A","N/A","N/A","N/A","N/A","N/A","N/A","N/A","N/A","N/A","N/A","N/A","N/A","N/A","N/A","N/A","N/A","N/A","N/A",null,null,null,null,null,null,null,null,null,null,null,null,null,null,null,null,null,null,null,null,null,null,null,null,null,null,"Shared among improved sanitation facilities","Yes","N/A","N/A","N/A","N/A","N/A","N/A","N/A","N/A","N/A","N/A","N/A","N/A","N/A","N/A","N/A","N/A","N/A","N/A","N/A","N/A","N/A","N/A","N/A","N/A"]
[null,"No","N/A","N/A","N/A","N/A","N/A","N/A","N/A","N/A","N/A","N/A","N/A","N/A","N/A","N/A","N/A","N/A","N/A","N/A","N/A","N/A","N/A","N/A","N/A","N/A",null,null,null,null,null,null,null,null,null,null,null,null,null,null,null,null,null,null,null,null,null,null,null,null,null,null,null,"No","N/A","N/A","N/A","N/A","N/A","N/A","N/A","N/A","N/A","N/A","N/A","N/A","N/A","N/A","N/A","N/A","N/A","N/A","N/A","N/A","N/A","N/A","N/A","N/A"]
[null,"DK/missing","N/A","N/A","N/A","N/A","N/A","N/A","N/A","N/A","N/A","N/A","N/A","N/A","N/A","N/A","N/A","N/A","N/A","N/A","N/A","N/A","N/A","N/A","N/A","N/A",null,null,null,null,null,null,null,null,null,null,null,null,null,null,null,null,null,null,null,null,null,null,null,null,null,null,null,"DK/missing","N/A","N/A","N/A","N/A","N/A","N/A","N/A","N/A","N/A","N/A","N/A","N/A","N/A","N/A","N/A","N/A","N/A","N/A","N/A","N/A","N/A","N/A","N/A","N/A"]
["Shared among all sanitation facilities","Yes",17.92857131604687,33.196202501013673,28.131422812120022,22.096636389021445,8.6531234884695909,41.703073139293089,34.70993492944239,25.462013662887671,19.254694962585202,5.6570495697036662,12.076137682207873,8.0584642148077101,12.117633824296449,14.894150132448589,10.9056525976471,23.314339604726147,23.540354302522857,17.930540361946711,19.928785311589735,24.218443104338153,17.750812480205205,24.83406395769256,23.474371880412619,28.854451116739664,null,null,null,null,null,null,null,null,null,null,null,null,null,null,null,null,null,null,null,null,null,null,null,null,null,null,"Shared among all sanitation facilities","Yes","N/A","N/A","N/A","N/A","N/A","N/A","N/A","N/A","N/A","N/A","N/A","N/A","N/A","N/A","N/A","N/A","N/A","N/A","N/A","N/A","N/A","N/A","N/A","N/A"]
[null,"No",82.071428683953556,66.803797498986512,71.868577187879879,77.903363610978644,91.346876511530468,58.296926860706812,65.290065070557475,74.537986337112244,80.74530503741488,94.342950430296241,87.923862317792128,91.941535785192343,87.88236617570351,85.105849867551456,89.094347402352909,76.685660395273672,76.459645697477058,82.069459638053161,80.071214688410237,75.781556895661694,82.249187519794731,75.165936042307209,76.525628119587637,71.145548883260133,null,null,null,null,null,null,null,null,null,null,null,null,null,null,null,null,null,null,null,null,null,null,null,null,null,null,null,"No","N/A","N/A","N/A","N/A","N/A","N/A","N/A","N/A","N/A","N/A","N/A","N/A","N/A","N/A","N/A","N/A","N/A","N/A","N/A","N/A","N/A","N/A","N/A","N/A"]
["¿El baño, servicio sanitario o letrina tiene desagüe ...........?","1. A la red de alcantarillado?",8.5088733411327446,35.469711102468388,47.449766891456889,63.102346388132446,82.726428843434519,42.427460287279068,55.236959306365293,62.062412440197875,72.88337106239257,87.254592265764146,0.30851748608573587,1.9690565301635026,6.37401703775289,11.182947669565873,17.815546354375712,17.1327320054342,75.308033605080567,52.904016432491495,67.905936350796807,83.993923877103711,7.9295392604873634,73.092823871290662,34.140971629045609,69.003592952186978,null,null,null,null,null,null,null,null,null,null,null,null,null,null,null,null,null,null,null,null,null,null,null,null,null,null,"¿El baño, servicio sanitario o letrina tiene desagüe ...........?","1. A la red de alcantarillado?",436.55317644738733,2940.4404597877965,4484.6874215588496,6294.8980372229944,8409.7840469458115,2504.036359126098,3711.1921590868392,4271.6112716130192,5089.6920046276718,6102.3777523941535,4.1070127021222289,26.706721577592887,119.58820366812238,249.97017166508149,487.08148550212854,343.42322382603993,1507.4767546859132,4058.8829205313396,7443.6703542833911,1268.4953960421285,41.316468531985343,1592.4034084916652,4742.4416030505299,1568.2530125198305]
[null,"2. A una cámara séptica?",6.6013047839223171,18.456975205150922,22.472062216962623,20.545743558787716,11.526417946355242,19.138598065610289,21.138710200436829,23.232489083582671,16.421314079824267,9.345458896053449,2.9179720557743036,4.2121754075557956,7.3228202517825105,15.374976559108397,25.157594758528841,35.93804847141319,1.7563132042366627,17.668603546063448,3.2221206755542986,5.0882384886728014,18.222918191748498,5.2789243018575389,30.64861882900583,9.0469354636572437,null,null,null,null,null,null,null,null,null,null,null,null,null,null,null,null,null,null,null,null,null,null,null,null,null,null,null,"2. A una cámara séptica?",338.68415436243629,1530.0839778971049,2123.9340330467494,2049.5808508607738,1171.7499125599124,1129.5454664147653,1420.2413842868771,1599.0381026951541,1146.7558341396193,653.59907108943219,38.844308144571187,57.130607538339937,137.38948523487906,343.67374715401201,687.81492202932691,720.37316991560681,35.156957400041371,1355.5642463227439,353.2004039624095,76.843738200510984,94.949605682896291,115.00687216914599,4257.3271373172756,205.61079775634056]
[null,"3. A un pozo ciego/absorción?",82.434332758355183,44.322820574977825,29.176952925933502,15.912731148772627,5.2800412303532021,36.788398633787253,22.648679822641984,14.01899699701065,10.333215378020297,2.9891469293747224,94.626604678034028,90.655367208346433,84.368983346008989,71.099037213543596,56.166810993882635,46.800402781374551,20.434401084795137,28.929508399046465,27.775787648877515,10.806785936911787,69.691776186678936,20.596817437058274,33.944214951215152,21.294763861089478,null,null,null,null,null,null,null,null,null,null,null,null,null,null,null,null,null,null,null,null,null,null,null,null,null,null,null,"3. A un pozo ciego/absorción?",4229.346045147513,3674.3635868381816,2757.6429213165957,1587.4056324172541,536.75720234797211,2171.2232396019267,1521.6913462825462,964.89490554113604,721.60333591846234,209.05379587236627,1259.6779271803896,1229.5775232754302,1582.916252638687,1589.2624254926388,1535.6146362639181,938.10754726327082,409.04513312347456,2219.519338197962,3044.7088752409823,163.20654607162896,363.12552131535972,448.72315165449095,4715.1105983925572,483.96867680777143]
[null,"4. A la superficie(calle/quebrada/río)?",1.8592057235267407,0.89578525298112943,0.5913003961206541,0.23446953371165169,0.10044257954869508,0.61930340979897736,0.371318029461701,0.36846281513430001,0.12043102067305567,4.9933547776787802E-2,2.096458303841366,2.9845708051702529,1.767394066634449,1.610974381197932,0.83453354956151438,0.12881674177796681,2.4066126748883478,0.22159448647063967,0.86895373432778844,0.11105169731165443,2.1313341279411424,0.88358082835880558,0.39783059441036256,0.38860193995317538,null,null,null,null,null,null,null,null,null,null,null,null,null,null,null,null,null,null,null,null,null,null,null,null,null,null,null,"4. A la superficie(calle/quebrada/río)?",95.38773604152766,74.260633066268639,55.886416784958037,23.389967125337336,10.21076837151227,36.550815084549605,24.94765419332272,25.360437218172077,8.4101049950622215,3.4922330520217222,27.908242714493582,40.480352037265035,33.159541361537478,36.009785122398618,22.816355610780846,2.5821136249679371,48.174311441348245,17.001092489212247,95.252425620719762,1.6771280618894586,11.105210092977631,19.249729976694717,55.261706737511687,8.8318033442822728]
[null,"5. No sabe?",0.59628339306338018,0.85470786442185875,0.30991756952616711,0.2047093705956507,0.36666940030842521,1.0262396035242805,0.60433264109403861,0.31763866407437097,0.24166845908981283,0.36086836103086473,5.04474762645159E-2,0.17883004876405484,0.1667852978211028,0.73206417658420442,2.5514343651326103E-2,0,9.4639430999236968E-2,0.2762771359278936,0.22720159044390667,0,2.0244322331440294,0.1478535614345371,0.86836399632333605,0.26610578311295036,null,null,null,null,null,null,null,null,null,null,null,null,null,null,null,null,null,null,null,null,null,null,null,null,null,null,null,"5. No sabe?",30.592699981357452,70.855315922490206,29.291680799054333,20.421183821558586,37.274792546078935,60.567878986865239,40.603150268808982,21.862329297424555,16.876524865282921,25.238271140964851,0.67156137059537546,2.4255089932092475,3.1291968701279376,16.36368275142917,0.69756852583122497,0,1.8944425379130641,21.196435052941251,24.905241487234125,0,10.548203105900418,3.2211440565024549,120.62238847506778,6.0478183549804072]
[null,null,null,null,null,null,null,null,null,null,null,null,null,null,null,null,null,null,null,null,null,null,null,null,null,null,null,null,null,null,null,null,null,null,null,null,null,null,null,null,null,null,null,null,null,null,null,null,null,null,null,null,null,"Total",5130.5638119802024,8290.0039735118316,9451.4424735062221,9975.6956714479093,10165.776722771279,5901.9237592142126,6718.675694118404,6882.7670463649147,6983.3378045460977,6993.7611235489412,1331.2090521121727,1356.3207134218369,1876.1826797733549,2235.2798121855599,2734.024967931985,2004.4860546298873,2001.7475991886913,7672.1640325942035,10961.737300594701,1510.2228083761586,521.04500872911956,2178.6043063485031,13890.763433972903,2272.7121087832093]
[]
[]
[]
[]
[]
[]
[]
[]
[]
[]
[]
[]
[]
[]
[]
[]
[]
[]
[]
[]
[]
[]
[]
[]
[]
[]
[]
[]
[]
[]
[]
[]
[]
[]
[]
[]
[]
[]
[]
[]
[]
[]
[]
[]
[]
[]
[]
[]
[]
[{"$f":"A1026","v":"Bolivia (Plurinational State of)"}]
[{"$f":"A1034","v":"2016"}]
["Access to hygiene facilities "]
[" by wealth quintile and sub-national region"]
["Notes:"]
["WHO/UNICEF JMP customised wealth index excludes water,"]
[" sanitation and hygiene assets."]
["Survey used for analysis:",{"$f":"A1025","v":"EDS16"}]
[]
[]
[]
[]
["Access to handwashing",null,"NATIONAL wealth index quintile",null,null,null,null,"URBAN wealth index quintile",null,null,null,null,"RURAL wealth index quintile",null,null,null,null,"SUB-REGIONS:",null,null,null,null,null,null,null,null,null,null,null,null,null,null,null,null,null,null,null,null,null,null,null,null,null,null,null,null,null,null,null,null,null,null,"Raw numbers of respondents:","Access to handwashing","NATIONAL wealth index quintile",null,null,null,null,"URBAN wealth index quintile",null,null,null,null,"RURAL wealth index quintile",null,null,null,null,"SUB-REGIONS:"]
["Weighted percentage (used in graphs)",null,"Poorest","Poor","Middle","Rich","Richest","Poorest","Poor","Middle","Rich","Richest","Poorest","Poor","Middle","Rich","Richest","Beni","Chuquisaca","Cochabamba","La Paz","Oruro","Pando","Potos?","Santa Cruz","Tarija",null,null,null,null,null,null,null,null,null,null,null,null,null,null,null,null,null,null,null,null,null,null,null,null,null,null,"Hygiene data, raw numbers (weighted)",null,"Poorest","Poor","Middle","Rich","Richest","Poorest","Poor","Middle","Rich","Richest","Poorest","Poor","Middle","Rich","Richest","Beni","Chuquisaca","Cochabamba","La Paz","Oruro","Pando","Potos?","Santa Cruz","Tarija"]
["Hygiene ladder","Basic",7.0880334177959012,12.304933099582902,20.909378786597856,27.059491745473611,40.731959380494224,13.549521290393182,20.421729210438148,23.046714713112245,34.741409940526133,42.450796518492702,3.4124229350870872,6.6188533061011583,8.7891057961116594,11.060885707385475,20.687553665418381,34.11931318104719,23.834996617549397,13.119344911329039,22.560253657050737,13.383502958486741,38.710584357381819,22.900899659441095,23.787637332015336,23.006126465350253,null,null,null,null,null,null,null,null,null,null,null,null,null,null,null,null,null,null,null,null,null,null,null,null,null,null,"Hygiene ladder","Basic",723.32987536731559,1256.2181684790887,2132.502347894163,2762.6595441942104,4154.2507551751914,950.09806420563632,1434.9454760844394,1615.7886460589302,2436.3844191176877,2979.8607597994683,108.79443442979675,211.23744072548561,279.93798202650959,352.56307872885327,659.350389933158,722.50904323331361,681.84070055044151,1167.3232112012386,2977.057164760256,326.74039588754596,241.14462095737537,929.26639310126893,3402.2955432953204,580.78361812320225]
[null,"Limited",42.923823084847925,34.371579364359306,28.174306677118139,19.015203636897827,7.6092055179928231,34.164534881224128,26.378468103137664,22.153797914649893,12.93980164366077,5.8493403276150779,42.232053564953446,46.252717091520779,42.601294260109434,37.931072986483123,30.477606698792236,29.347131454167009,45.244449078806412,23.539700428480291,19.712135301591179,27.505053820724367,13.685625863349779,38.145680496320047,28.512586566981685,19.253975354239849,null,null,null,null,null,null,null,null,null,null,null,null,null,null,null,null,null,null,null,null,null,null,null,null,null,null,null,"Limited",4380.3523166664872,3509.0156222216838,2873.4366406789104,1941.3717857823267,776.06253787394814,2395.631385010729,1853.4994309535734,1553.1868894619299,907.45686962787408,410.59817818446982,1346.4369657012444,1476.1326672713319,1356.8752753173769,1209.0438528511297,971.37738884370322,621.45353735815468,1294.2945766225973,2094.4977726105926,2601.2186974673077,671.49924815407905,85.253558326938801,1547.8649072459129,4078.0950562964158,486.06154914136869]
[null,"No facility",49.988143497356297,53.323487536058281,50.916314536283899,53.925304617628612,51.658835101512892,52.285943828382628,53.1998026864241,54.799487372237834,52.31878841581301,51.699863153891791,54.355523499959567,47.128429602377622,48.60959994377879,51.008041306131382,48.834839635789386,36.53355536478572,30.920554303644167,63.340954660190597,57.72761104135855,59.111443220789162,47.603789779268425,38.953419844238937,47.699776101003124,57.739898180409469,null,null,null,null,null,null,null,null,null,null,null,null,null,null,null,null,null,null,null,null,null,null,null,null,null,null,null,"No facility",5101.2622930084754,5443.8275533359265,5192.8448665504284,5505.5452954097718,5268.6823319061923,3666.3121118332474,3738.1171499644634,3841.9527732312749,3669.0704591902177,3629.1048963515341,1732.9558937461277,1504.0806004026151,1548.243203693994,1625.8690812445861,1556.4561705527194,773.63292726493512,884.53515417248457,5635.9038575650502,7617.7511417944088,1443.1271408803627,296.54416312801612,1580.6411318296102,6822.3982642532637,1457.6285593226646]
["POR OBSERVACIÓN: ¿Me podría mostrar el lugar dónde los miembros de  su hogar se lavan más frecuentemente las manos?","1. OBSERVADO",50.011856502643724,46.676512463942224,49.083685463715987,46.074695382371431,48.341164898487051,47.714056171617308,46.800197313575779,45.200512627762137,47.681211584186897,48.300136846107804,45.644476500040554,52.871570397621937,51.390400056221083,48.99195869386854,51.16516036421055,63.466444635214117,69.079445696355805,36.659045339809396,42.272388958641791,40.888556779211164,52.396210220731597,61.046580155761156,52.300223898996968,42.260101819590076,null,null,null,null,null,null,null,null,null,null,null,null,null,null,null,null,null,null,null,null,null,null,null,null,null,null,"Observed handwashing place","Fixed","N/A","N/A","N/A","N/A","N/A","N/A","N/A","N/A","N/A","N/A","N/A","N/A","N/A","N/A","N/A","N/A","N/A","N/A","N/A","N/A","N/A","N/A","N/A","N/A"]
[null,"2. NO OBSERVADO",49.988143497356297,53.323487536058281,50.916314536283899,53.925304617628612,51.658835101512892,52.285943828382628,53.1998026864241,54.799487372237834,52.31878841581301,51.699863153891791,54.355523499959567,47.128429602377622,48.60959994377879,51.008041306131382,48.834839635789386,36.53355536478572,30.920554303644167,63.340954660190597,57.72761104135855,59.111443220789162,47.603789779268425,38.953419844238937,47.699776101003124,57.739898180409469,null,null,null,null,null,null,null,null,null,null,null,null,null,null,null,null,null,null,null,null,null,null,null,null,null,null,null,"Mobile","N/A","N/A","N/A","N/A","N/A","N/A","N/A","N/A","N/A","N/A","N/A","N/A","N/A","N/A","N/A","N/A","N/A","N/A","N/A","N/A","N/A","N/A","N/A","N/A"]
[null,null,null,null,null,null,null,null,null,null,null,null,null,null,null,null,null,null,null,null,null,null,null,null,null,null,null,null,null,null,null,null,null,null,null,null,null,null,null,null,null,null,null,null,null,null,null,null,null,null,null,null,"Water / Soap","Water and soap","N/A","N/A","N/A","N/A","N/A","N/A","N/A","N/A","N/A","N/A","N/A","N/A","N/A","N/A","N/A","N/A","N/A","N/A","N/A","N/A","N/A","N/A","N/A","N/A"]
[null,null,null,null,null,null,null,null,null,null,null,null,null,null,null,null,null,null,null,null,null,null,null,null,null,null,null,null,null,null,null,null,null,null,null,null,null,null,null,null,null,null,null,null,null,null,null,null,null,null,null,null,null,"Water only","N/A","N/A","N/A","N/A","N/A","N/A","N/A","N/A","N/A","N/A","N/A","N/A","N/A","N/A","N/A","N/A","N/A","N/A","N/A","N/A","N/A","N/A","N/A","N/A"]
[null,null,null,null,null,null,null,null,null,null,null,null,null,null,null,null,null,null,null,null,null,null,null,null,null,null,null,null,null,null,null,null,null,null,null,null,null,null,null,null,null,null,null,null,null,null,null,null,null,null,null,null,null,"Soap only","N/A","N/A","N/A","N/A","N/A","N/A","N/A","N/A","N/A","N/A","N/A","N/A","N/A","N/A","N/A","N/A","N/A","N/A","N/A","N/A","N/A","N/A","N/A","N/A"]
[null,null,null,null,null,null,null,null,null,null,null,null,null,null,null,null,null,null,null,null,null,null,null,null,null,null,null,null,null,null,null,null,null,null,null,null,null,null,null,null,null,null,null,null,null,null,null,null,null,null,null,null,null,"Neither","N/A","N/A","N/A","N/A","N/A","N/A","N/A","N/A","N/A","N/A","N/A","N/A","N/A","N/A","N/A","N/A","N/A","N/A","N/A","N/A","N/A","N/A","N/A","N/A"]
[null,null,null,null,null,null,null,null,null,null,null,null,null,null,null,null,null,null,null,null,null,null,null,null,null,null,null,null,null,null,null,null,null,null,null,null,null,null,null,null,null,null,null,null,null,null,null,null,null,null,null,null,"POR OBSERVACIÓN: ¿Me podría mostrar el lugar dónde los miembros de  su hogar se lavan más frecuentemente las manos?","1. OBSERVADO",5103.6821920337925,4765.2337907007741,5005.9389885730725,4704.0313299765357,4930.3132930491402,3345.7294492163651,3288.4449070380106,3168.9755355208604,3343.8412887455615,3390.4589379839404,1455.2314001310417,1687.3701079968175,1636.8132573438863,1561.6069315799812,1630.7277787768589,1343.9625805914666,1976.1352771730387,3261.8209838118373,5578.2758622275478,998.23964404162632,326.39817928431415,2477.1313003471823,7480.3905995917294,1066.8451672645704]
[null,null,null,null,null,null,null,null,null,null,null,null,null,null,null,null,null,null,null,null,null,null,null,null,null,null,null,null,null,null,null,null,null,null,null,null,null,null,null,null,null,null,null,null,null,null,null,null,null,null,null,null,null,"2. NO OBSERVADO",5101.2622930084754,5443.8275533359265,5192.8448665504284,5505.5452954097718,5268.6823319061923,3666.3121118332474,3738.1171499644634,3841.9527732312749,3669.0704591902177,3629.1048963515341,1732.9558937461277,1504.0806004026151,1548.243203693994,1625.8690812445861,1556.4561705527194,773.63292726493512,884.53515417248457,5635.9038575650502,7617.7511417944088,1443.1271408803627,296.54416312801612,1580.6411318296102,6822.3982642532637,1457.6285593226646]
[null,null,null,null,null,null,null,null,null,null,null,null,null,null,null,null,null,null,null,null,null,null,null,null,null,null,null,null,null,null,null,null,null,null,null,null,null,null,null,null,null,null,null,null,null,null,null,null,null,null,null,null,null,"Total",10204.944485042266,10209.061344036649,10198.783855123513,10209.576625386304,10198.995624955338,7012.0415610496166,7026.5620570024821,7010.9283087521371,7012.9117479357856,7019.5638343355031,3188.1872938771658,3191.4507083994467,3185.0564610378842,3187.4760128245698,3187.1839493295806,2117.5955078564052,2860.6704313455243,8897.7248413768884,13196.027004021911,2441.366784921981,622.94234241233016,4057.7724321767892,14302.78886384498,2524.4737265872463]
[]
[]
[]
[]
[]
[]
[]
[]
[]
[]
[]
[]
[]
[]
[]
[]
[]
[]
[]
[]
[]
[]
[]
[]
[]
[null,null,null,null,null,null,null,null,null,null,null,null,null,null,null,null,null,null,null,null,null,null,null,null,null,null,null,null,null,null,null,null,null,null,null,null,null,null,null,null,null,null,null,null,null,null,null,null,null,null,null,null,"Raw numbers of respondents:","Menstrual health and hygiene","NATIONAL wealth index quintile",null,null,null,null,"URBAN wealth index quintile",null,null,null,null,"RURAL wealth index quintile",null,null,null,null,"SUB-REGIONS:"]
[null,null,null,null,null,null,null,null,null,null,null,null,null,null,null,null,null,null,null,null,null,null,null,null,null,null,null,null,null,null,null,null,null,null,null,null,null,null,null,null,null,null,null,null,null,null,null,null,null,null,null,null,"MHH data, raw numbers (weighted)",null,"Poorest","Poor","Middle","Rich","Richest","Poorest","Poor","Middle","Rich","Richest","Poorest","Poor","Middle","Rich","Richest","Beni","Chuquisaca","Cochabamba","La Paz","Oruro","Pando","Potos?","Santa Cruz","Tarija"]
[null,null,null,null,null,null,null,null,null,null,null,null,null,null,null,null,null,null,null,null,null,null,null,null,null,null,null,null,null,null,null,null,null,null,null,null,null,null,null,null,null,null,null,null,null,null,null,null,null,null,null,null,"Private place to wash and change","Yes","N/A","N/A","N/A","N/A","N/A","N/A","N/A","N/A","N/A","N/A","N/A","N/A","N/A","N/A","N/A","N/A","N/A","N/A","N/A","N/A","N/A","N/A","N/A","N/A"]
[null,null,null,null,null,null,null,null,null,null,null,null,null,null,null,null,null,null,null,null,null,null,null,null,null,null,null,null,null,null,null,null,null,null,null,null,null,null,null,null,null,null,null,null,null,null,null,null,null,null,null,null,null,"No","N/A","N/A","N/A","N/A","N/A","N/A","N/A","N/A","N/A","N/A","N/A","N/A","N/A","N/A","N/A","N/A","N/A","N/A","N/A","N/A","N/A","N/A","N/A","N/A"]
[null,null,null,null,null,null,null,null,null,null,null,null,null,null,null,null,null,null,null,null,null,null,null,null,null,null,null,null,null,null,null,null,null,null,null,null,null,null,null,null,null,null,null,null,null,null,null,null,null,null,null,null,null,"DK/not sure/missing","N/A","N/A","N/A","N/A","N/A","N/A","N/A","N/A","N/A","N/A","N/A","N/A","N/A","N/A","N/A","N/A","N/A","N/A","N/A","N/A","N/A","N/A","N/A","N/A"]
[null,null,null,null,null,null,null,null,null,null,null,null,null,null,null,null,null,null,null,null,null,null,null,null,null,null,null,null,null,null,null,null,null,null,null,null,null,null,null,null,null,null,null,null,null,null,null,null,null,null,null,null,"Use of menstrual materials","Materials reusable","N/A","N/A","N/A","N/A","N/A","N/A","N/A","N/A","N/A","N/A","N/A","N/A","N/A","N/A","N/A","N/A","N/A","N/A","N/A","N/A","N/A","N/A","N/A","N/A"]
[null,null,null,null,null,null,null,null,null,null,null,null,null,null,null,null,null,null,null,null,null,null,null,null,null,null,null,null,null,null,null,null,null,null,null,null,null,null,null,null,null,null,null,null,null,null,null,null,null,null,null,null,null,"Materials not reusable","N/A","N/A","N/A","N/A","N/A","N/A","N/A","N/A","N/A","N/A","N/A","N/A","N/A","N/A","N/A","N/A","N/A","N/A","N/A","N/A","N/A","N/A","N/A","N/A"]
[null,null,null,null,null,null,null,null,null,null,null,null,null,null,null,null,null,null,null,null,null,null,null,null,null,null,null,null,null,null,null,null,null,null,null,null,null,null,null,null,null,null,null,null,null,null,null,null,null,null,null,null,null,"No materials used","N/A","N/A","N/A","N/A","N/A","N/A","N/A","N/A","N/A","N/A","N/A","N/A","N/A","N/A","N/A","N/A","N/A","N/A","N/A","N/A","N/A","N/A","N/A","N/A"]
[null,null,null,null,null,null,null,null,null,null,null,null,null,null,null,null,null,null,null,null,null,null,null,null,null,null,null,null,null,null,null,null,null,null,null,null,null,null,null,null,null,null,null,null,null,null,null,null,null,null,null,null,null,"DK/not sure/missing","N/A","N/A","N/A","N/A","N/A","N/A","N/A","N/A","N/A","N/A","N/A","N/A","N/A","N/A","N/A","N/A","N/A","N/A","N/A","N/A","N/A","N/A","N/A","N/A"]
[null,null,null,null,null,null,null,null,null,null,null,null,null,null,null,null,null,null,null,null,null,null,null,null,null,null,null,null,null,null,null,null,null,null,null,null,null,null,null,null,null,null,null,null,null,null,null,null,null,null,null,null,"Use of menstrual materials with private place to wash and change","Materials reusable","N/A","N/A","N/A","N/A","N/A","N/A","N/A","N/A","N/A","N/A","N/A","N/A","N/A","N/A","N/A","N/A","N/A","N/A","N/A","N/A","N/A","N/A","N/A","N/A"]
[null,null,null,null,null,null,null,null,null,null,null,null,null,null,null,null,null,null,null,null,null,null,null,null,null,null,null,null,null,null,null,null,null,null,null,null,null,null,null,null,null,null,null,null,null,null,null,null,null,null,null,null,null,"Materials not reusable","N/A","N/A","N/A","N/A","N/A","N/A","N/A","N/A","N/A","N/A","N/A","N/A","N/A","N/A","N/A","N/A","N/A","N/A","N/A","N/A","N/A","N/A","N/A","N/A"]
[null,null,null,null,null,null,null,null,null,null,null,null,null,null,null,null,null,null,null,null,null,null,null,null,null,null,null,null,null,null,null,null,null,null,null,null,null,null,null,null,null,null,null,null,null,null,null,null,null,null,null,null,null,"No materials used","N/A","N/A","N/A","N/A","N/A","N/A","N/A","N/A","N/A","N/A","N/A","N/A","N/A","N/A","N/A","N/A","N/A","N/A","N/A","N/A","N/A","N/A","N/A","N/A"]
[null,null,null,null,null,null,null,null,null,null,null,null,null,null,null,null,null,null,null,null,null,null,null,null,null,null,null,null,null,null,null,null,null,null,null,null,null,null,null,null,null,null,null,null,null,null,null,null,null,null,null,null,"Awareness of menstruation before menarche","Yes","N/A","N/A","N/A","N/A","N/A","N/A","N/A","N/A","N/A","N/A","N/A","N/A","N/A","N/A","N/A","N/A","N/A","N/A","N/A","N/A","N/A","N/A","N/A","N/A"]
[null,null,null,null,null,null,null,null,null,null,null,null,null,null,null,null,null,null,null,null,null,null,null,null,null,null,null,null,null,null,null,null,null,null,null,null,null,null,null,null,null,null,null,null,null,null,null,null,null,null,null,null,null,"No","N/A","N/A","N/A","N/A","N/A","N/A","N/A","N/A","N/A","N/A","N/A","N/A","N/A","N/A","N/A","N/A","N/A","N/A","N/A","N/A","N/A","N/A","N/A","N/A"]
[null,null,null,null,null,null,null,null,null,null,null,null,null,null,null,null,null,null,null,null,null,null,null,null,null,null,null,null,null,null,null,null,null,null,null,null,null,null,null,null,null,null,null,null,null,null,null,null,null,null,null,null,null,"DK/not sure/missing","N/A","N/A","N/A","N/A","N/A","N/A","N/A","N/A","N/A","N/A","N/A","N/A","N/A","N/A","N/A","N/A","N/A","N/A","N/A","N/A","N/A","N/A","N/A","N/A"]
[null,null,null,null,null,null,null,null,null,null,null,null,null,null,null,null,null,null,null,null,null,null,null,null,null,null,null,null,null,null,null,null,null,null,null,null,null,null,null,null,null,null,null,null,null,null,null,null,null,null,null,null,"Participation in (all) activities during menstruation","Yes","N/A","N/A","N/A","N/A","N/A","N/A","N/A","N/A","N/A","N/A","N/A","N/A","N/A","N/A","N/A","N/A","N/A","N/A","N/A","N/A","N/A","N/A","N/A","N/A"]
[null,null,null,null,null,null,null,null,null,null,null,null,null,null,null,null,null,null,null,null,null,null,null,null,null,null,null,null,null,null,null,null,null,null,null,null,null,null,null,null,null,null,null,null,null,null,null,null,null,null,null,null,null,"No","N/A","N/A","N/A","N/A","N/A","N/A","N/A","N/A","N/A","N/A","N/A","N/A","N/A","N/A","N/A","N/A","N/A","N/A","N/A","N/A","N/A","N/A","N/A","N/A"]
[null,null,null,null,null,null,null,null,null,null,null,null,null,null,null,null,null,null,null,null,null,null,null,null,null,null,null,null,null,null,null,null,null,null,null,null,null,null,null,null,null,null,null,null,null,null,null,null,null,null,null,null,null,"DK/not sure/missing/no such activity","N/A","N/A","N/A","N/A","N/A","N/A","N/A","N/A","N/A","N/A","N/A","N/A","N/A","N/A","N/A","N/A","N/A","N/A","N/A","N/A","N/A","N/A","N/A","N/A"]
[null,null,null,null,null,null,null,null,null,null,null,null,null,null,null,null,null,null,null,null,null,null,null,null,null,null,null,null,null,null,null,null,null,null,null,null,null,null,null,null,null,null,null,null,null,null,null,null,null,null,null,null,"Participation in specific activities during menstruation","Did not go to school (amongst those usually attending school)","N/A","N/A","N/A","N/A","N/A","N/A","N/A","N/A","N/A","N/A","N/A","N/A","N/A","N/A","N/A","N/A","N/A","N/A","N/A","N/A","N/A","N/A","N/A","N/A"]
[null,null,null,null,null,null,null,null,null,null,null,null,null,null,null,null,null,null,null,null,null,null,null,null,null,null,null,null,null,null,null,null,null,null,null,null,null,null,null,null,null,null,null,null,null,null,null,null,null,null,null,null,null,"Did not go to work (amongst those who usually work)","N/A","N/A","N/A","N/A","N/A","N/A","N/A","N/A","N/A","N/A","N/A","N/A","N/A","N/A","N/A","N/A","N/A","N/A","N/A","N/A","N/A","N/A","N/A","N/A"]
[null,null,null,null,null,null,null,null,null,null,null,null,null,null,null,null,null,null,null,null,null,null,null,null,null,null,null,null,null,null,null,null,null,null,null,null,null,null,null,null,null,null,null,null,null,null,null,null,null,null,null,null,null,"Did not participate in social activities","N/A","N/A","N/A","N/A","N/A","N/A","N/A","N/A","N/A","N/A","N/A","N/A","N/A","N/A","N/A","N/A","N/A","N/A","N/A","N/A","N/A","N/A","N/A","N/A"]
[null,null,null,null,null,null,null,null,null,null,null,null,null,null,null,null,null,null,null,null,null,null,null,null,null,null,null,null,null,null,null,null,null,null,null,null,null,null,null,null,null,null,null,null,null,null,null,null,null,null,null,null,null,"Did not cook food","N/A","N/A","N/A","N/A","N/A","N/A","N/A","N/A","N/A","N/A","N/A","N/A","N/A","N/A","N/A","N/A","N/A","N/A","N/A","N/A","N/A","N/A","N/A","N/A"]
[null,null,null,null,null,null,null,null,null,null,null,null,null,null,null,null,null,null,null,null,null,null,null,null,null,null,null,null,null,null,null,null,null,null,null,null,null,null,null,null,null,null,null,null,null,null,null,null,null,null,null,null,null,"Did not eat with others","N/A","N/A","N/A","N/A","N/A","N/A","N/A","N/A","N/A","N/A","N/A","N/A","N/A","N/A","N/A","N/A","N/A","N/A","N/A","N/A","N/A","N/A","N/A","N/A"]
[null,null,null,null,null,null,null,null,null,null,null,null,null,null,null,null,null,null,null,null,null,null,null,null,null,null,null,null,null,null,null,null,null,null,null,null,null,null,null,null,null,null,null,null,null,null,null,null,null,null,null,null,null,"Did not bathe in regular place","N/A","N/A","N/A","N/A","N/A","N/A","N/A","N/A","N/A","N/A","N/A","N/A","N/A","N/A","N/A","N/A","N/A","N/A","N/A","N/A","N/A","N/A","N/A","N/A"]
[null,null,null,null,null,null,null,null,null,null,null,null,null,null,null,null,null,null,null,null,null,null,null,null,null,null,null,null,null,null,null,null,null,null,null,null,null,null,null,null,null,null,null,null,null,null,null,null,null,null,null,null,null,"Did not participate in other activities","N/A","N/A","N/A","N/A","N/A","N/A","N/A","N/A","N/A","N/A","N/A","N/A","N/A","N/A","N/A","N/A","N/A","N/A","N/A","N/A","N/A","N/A","N/A","N/A"]
[null,null,null,null,null,null,null,null,null,null,null,null,null,null,null,null,null,null,null,null,null,null,null,null,null,null,null,null,null,null,null,null,null,null,null,null,null,null,null,null,null,null,null,null,null,null,null,null,null,null,null,null,null,"DK/not sure/missing/no such activity","N/A","N/A","N/A","N/A","N/A","N/A","N/A","N/A","N/A","N/A","N/A","N/A","N/A","N/A","N/A","N/A","N/A","N/A","N/A","N/A","N/A","N/A","N/A","N/A"]
[]
[]
[]
[]
[]
[]
[]
[]
[]
[]
[]
[]
[]
[]
[]
[]
[]
[]
[]
[]
[]
[]
[]
[]
[]
[]
[]
[]
[]
[]
[]
[]
[]
[]
[]
[]
[]
[]
[]
[]
[]
[]
[]
[]
[]
[]
[]
[]
[]
[]
[]
[]
[]
[]
[null,null,null,null,null,null,null,null,null,null,null,null,null,null,null,null,null,null,null,null,null,null,null,null,null,null,null,null,null,null,null,null,null,null,null,null,null,null,null,null,null,null,null,null,null,null,null,null,null,null,null,null,"Raw numbers of respondents:","Basic water, sanitation and hygiene","NATIONAL wealth index quintile",null,null,null,null,"URBAN wealth index quintile",null,null,null,null,"RURAL wealth index quintile",null,null,null,null,"SUB-REGIONS:"]
[null,null,null,null,null,null,null,null,null,null,null,null,null,null,null,null,null,null,null,null,null,null,null,null,null,null,null,null,null,null,null,null,null,null,null,null,null,null,null,null,null,null,null,null,null,null,null,null,null,null,null,null,"WatSan data, raw numbers (weighted)",null,"Poorest","Poor","Middle","Rich","Richest","Poorest","Poor","Middle","Rich","Richest","Poorest","Poor","Middle","Rich","Richest","Beni","Chuquisaca","Cochabamba","La Paz","Oruro","Pando","Potos?","Santa Cruz","Tarija"]
[null,null,null,null,null,null,null,null,null,null,null,null,null,null,null,null,null,null,null,null,null,null,null,null,null,null,null,null,null,null,null,null,null,null,null,null,null,null,null,null,null,null,null,null,null,null,null,null,null,null,null,null,"Use of Basic Water Sanitation and Hygiene","Yes","N/A","N/A","N/A","N/A","N/A","N/A","N/A","N/A","N/A","N/A","N/A","N/A","N/A","N/A","N/A","N/A","N/A","N/A","N/A","N/A","N/A","N/A","N/A","N/A"]
[null,null,null,null,null,null,null,null,null,null,null,null,null,null,null,null,null,null,null,null,null,null,null,null,null,null,null,null,null,null,null,null,null,null,null,null,null,null,null,null,null,null,null,null,null,null,null,null,null,null,null,null,null,"No","N/A","N/A","N/A","N/A","N/A","N/A","N/A","N/A","N/A","N/A","N/A","N/A","N/A","N/A","N/A","N/A","N/A","N/A","N/A","N/A","N/A","N/A","N/A","N/A"]
[null,null,null,null,null,null,null,null,null,null,null,null,null,null,null,null,null,null,null,null,null,null,null,null,null,null,null,null,null,null,null,null,null,null,null,null,null,null,null,null,null,null,null,null,null,null,null,null,null,null,null,null,"Use of Basic Water and Sanitation","Yes","N/A","N/A","N/A","N/A","N/A","N/A","N/A","N/A","N/A","N/A","N/A","N/A","N/A","N/A","N/A","N/A","N/A","N/A","N/A","N/A","N/A","N/A","N/A","N/A"]
[null,null,null,null,null,null,null,null,null,null,null,null,null,null,null,null,null,null,null,null,null,null,null,null,null,null,null,null,null,null,null,null,null,null,null,null,null,null,null,null,null,null,null,null,null,null,null,null,null,null,null,null,null,"No","N/A","N/A","N/A","N/A","N/A","N/A","N/A","N/A","N/A","N/A","N/A","N/A","N/A","N/A","N/A","N/A","N/A","N/A","N/A","N/A","N/A","N/A","N/A","N/A"]
[null,null,null,null,null,null,null,null,null,null,null,null,null,null,null,null,null,null,null,null,null,null,null,null,null,null,null,null,null,null,null,null,null,null,null,null,null,null,null,null,null,null,null,null,null,null,null,null,null,null,null,null,"Use of Basic Water and Hygiene","Yes","N/A","N/A","N/A","N/A","N/A","N/A","N/A","N/A","N/A","N/A","N/A","N/A","N/A","N/A","N/A","N/A","N/A","N/A","N/A","N/A","N/A","N/A","N/A","N/A"]
[null,null,null,null,null,null,null,null,null,null,null,null,null,null,null,null,null,null,null,null,null,null,null,null,null,null,null,null,null,null,null,null,null,null,null,null,null,null,null,null,null,null,null,null,null,null,null,null,null,null,null,null,null,"No","N/A","N/A","N/A","N/A","N/A","N/A","N/A","N/A","N/A","N/A","N/A","N/A","N/A","N/A","N/A","N/A","N/A","N/A","N/A","N/A","N/A","N/A","N/A","N/A"]
[null,null,null,null,null,null,null,null,null,null,null,null,null,null,null,null,null,null,null,null,null,null,null,null,null,null,null,null,null,null,null,null,null,null,null,null,null,null,null,null,null,null,null,null,null,null,null,null,null,null,null,null,"Use of Basic Sanitation and Hygiene","Yes","N/A","N/A","N/A","N/A","N/A","N/A","N/A","N/A","N/A","N/A","N/A","N/A","N/A","N/A","N/A","N/A","N/A","N/A","N/A","N/A","N/A","N/A","N/A","N/A"]
[null,null,null,null,null,null,null,null,null,null,null,null,null,null,null,null,null,null,null,null,null,null,null,null,null,null,null,null,null,null,null,null,null,null,null,null,null,null,null,null,null,null,null,null,null,null,null,null,null,null,null,null,null,"No","N/A","N/A","N/A","N/A","N/A","N/A","N/A","N/A","N/A","N/A","N/A","N/A","N/A","N/A","N/A","N/A","N/A","N/A","N/A","N/A","N/A","N/A","N/A","N/A"]
[null,null,null,null,null,null,null,null,null,null,null,null,null,null,null,null,null,null,null,null,null,null,null,null,null,null,null,null,null,null,null,null,null,null,null,null,null,null,null,null,null,null,null,null,null,null,null,null,null,null,null,null,"Use of Basic Water","Yes","N/A","N/A","N/A","N/A","N/A","N/A","N/A","N/A","N/A","N/A","N/A","N/A","N/A","N/A","N/A","N/A","N/A","N/A","N/A","N/A","N/A","N/A","N/A","N/A"]
[null,null,null,null,null,null,null,null,null,null,null,null,null,null,null,null,null,null,null,null,null,null,null,null,null,null,null,null,null,null,null,null,null,null,null,null,null,null,null,null,null,null,null,null,null,null,null,null,null,null,null,null,null,"No","N/A","N/A","N/A","N/A","N/A","N/A","N/A","N/A","N/A","N/A","N/A","N/A","N/A","N/A","N/A","N/A","N/A","N/A","N/A","N/A","N/A","N/A","N/A","N/A"]
[null,null,null,null,null,null,null,null,null,null,null,null,null,null,null,null,null,null,null,null,null,null,null,null,null,null,null,null,null,null,null,null,null,null,null,null,null,null,null,null,null,null,null,null,null,null,null,null,null,null,null,null,"Use of Basic Sanitation","Yes","N/A","N/A","N/A","N/A","N/A","N/A","N/A","N/A","N/A","N/A","N/A","N/A","N/A","N/A","N/A","N/A","N/A","N/A","N/A","N/A","N/A","N/A","N/A","N/A"]
[null,null,null,null,null,null,null,null,null,null,null,null,null,null,null,null,null,null,null,null,null,null,null,null,null,null,null,null,null,null,null,null,null,null,null,null,null,null,null,null,null,null,null,null,null,null,null,null,null,null,null,null,null,"No","N/A","N/A","N/A","N/A","N/A","N/A","N/A","N/A","N/A","N/A","N/A","N/A","N/A","N/A","N/A","N/A","N/A","N/A","N/A","N/A","N/A","N/A","N/A","N/A"]
[null,null,null,null,null,null,null,null,null,null,null,null,null,null,null,null,null,null,null,null,null,null,null,null,null,null,null,null,null,null,null,null,null,null,null,null,null,null,null,null,null,null,null,null,null,null,null,null,null,null,null,null,"Access to Basic Hygiene","Yes","N/A","N/A","N/A","N/A","N/A","N/A","N/A","N/A","N/A","N/A","N/A","N/A","N/A","N/A","N/A","N/A","N/A","N/A","N/A","N/A","N/A","N/A","N/A","N/A"]
[null,null,null,null,null,null,null,null,null,null,null,null,null,null,null,null,null,null,null,null,null,null,null,null,null,null,null,null,null,null,null,null,null,null,null,null,null,null,null,null,null,null,null,null,null,null,null,null,null,null,null,null,null,"No","N/A","N/A","N/A","N/A","N/A","N/A","N/A","N/A","N/A","N/A","N/A","N/A","N/A","N/A","N/A","N/A","N/A","N/A","N/A","N/A","N/A","N/A","N/A","N/A"]
[]
[]
[]
[]
[]
[]
[]
[]
[]
[]
[]
[]
[]
[]
[]
[]
[]
[]
[]
[]
[]
[]
[]
[]
[]
[]
[]
[]
[]
[]
[]
[]
[]
[]
[]
[]
[]
[]
[]
[]
[]
[]
[]
[]
[null,null,"INITIAL (national) Wealth Index",null,null,null,null,"URBAN Wealth Index",null,null,null,null,"RURAL Wealth Index"]
[null,null,"Component Matrix",null,null,null,null,"Component Matrix",null,null,null,null,"Component Matrix"]
[null,null,null,null,"Component",null,null,null,null,"Component",null,null,null,null,"Component"]
[null,"Note:\n\nThe INITIAL (national) Wealth Index is based on the first component of the Principal Component Analysis (PCA) which has been obtained at national level.\n\nThe final national-level (NATIONAL) Wealth Index is based on the URBAN and RURAL specific wealth indexes. Regression procedures are used to establish the relationships between the two sets of scores (urban and rural) and the initial (national) wealth factors.\nThis allows best use of the available information for each area and a better precision of the FINAL (NATIONAL) Wealth Index.\n\nFor dependency reasons, all WASH variables (contained in the generic MICS and DHS scripts) have been excluded from the sets of asset variables used in the PCAs.\n\nThe PCA can extracts as many components as there are asset variables in the input. Only the first of the components is used to represent the Wealth Index. \n\nThe scores represent the weights of the asset variables on the Wealth Index (correlations between the variables and the component).\n\nThe communalities are the proportion of each variable's variance that can be explained by the component.\n\nProportion of explained variance is the part of the model's total variance that is explained by the component.\n\nFor more information on the procedure used:\n\nThe DHS Wealth Index, DHS Comparative Reports No. 6, Shea Oscar Rutstein, Kiersten Johnson, ORC Macro International Inc., 2004.\n\nThe DHS Wealth Index: Approaches for Rural and Urban Areas, Shea O. Rutstein, ORC Macro International Inc., 2008.\n\nMICS Methodological Paper No. 4, Review of options for reporting water, sanitation and hygiene coverage by wealth quintile, UNICEF, 2016.",null,null,"1",null,null,null,null,"1",null,null,null,null,"1"]
[null,null,"Refrigetaror",null,0.6879702255830531,null,null,"Lavadora de ropa",null,0.66798519902646902,null,null,"TIERRA",null,-0.7162778004080641]
[null,null,"LADRILLO/ BLOQUE DE CEMENTO/ HORMIGÓNr",null,0.66637301344973243,null,null,"Computer",null,0.64605049294472483,null,null,"GAS LICUADO (GARRAFA)",null,0.71401047133165918]
[null,null,"TIERRA",null,-0.65696489495121235,null,null,"Microondas",null,0.64042738511625574,null,null,"LEÑA",null,-0.698171327676815]
[null,null,"Computer",null,0.62651738109371813,null,null,"Teléfono fijo",null,0.60152250518097883,null,null,"Cocina",null,0.62761310168925588]
[null,null,"LEÑA",null,-0.62633683847838173,null,null,"Television por Cable",null,0.57744785811305821,null,null,"Refrigetaror",null,0.61103770864689644]
[null,null,"Lavadora de ropa",null,0.60315383295300928,null,null,"Refrigetaror",null,0.57259116902419405,null,null,"Television",null,0.60972152065532792]
[null,null,"Television",null,0.60001500813237307,null,null,"Equipo de Musica",null,0.53078365458560695,null,null,"LADRILLO/ BLOQUE DE CEMENTO/ HORMIGÓNr",null,0.60603267169928843]
[null,null,"Television por Cable",null,0.58405533140693,null,null,"Internet en el Hogar",null,0.49885778680149018,null,null,"Teléfono celular",null,0.49355950383736324]
[null,null,"Equipo de Musica",null,0.57305583501538948,null,null,"MOSAICO/BALDOSAS/CERÁMICA",null,0.48090894883117258,null,null," PAJA/CAÑA/PALMA/BARRO",null,-0.48352953400080506]
[null,null,"Microondas",null,0.55821557108236397,null,null,"GAS NATURAL POR RED (CAÑERIA)",null,0.47464460430910893,null,null,"CEMENTO",null,0.45552844219254113]
[null,null,"Cocina",null,0.53759945489953809,null,null,"Vehiculo automotor",null,0.46492939763368696,null,null,"Equipo de Musica",null,0.45551812256832463]
[null,null,"Teléfono fijo",null,0.53162135247753062,null,null,"Calefón o termo tanque",null,0.42481110116870474,null,null,"Computer",null,0.4184597209639408]
[null,null,"MOSAICO/BALDOSAS/CERÁMICA",null,0.50478513466900909,null,null,"LADRILLO/ BLOQUE DE CEMENTO/ HORMIGÓNr",null,0.40038058736040955,null,null,"MOSAICO/BALDOSAS/CERÁMICA",null,0.40108344116460903]
[null,null,"Teléfono celular",null,0.48138124966616436,null,null,"cuarto sólo para cocinar",null,0.39720627095650984,null,null,"Vehiculo automotor",null,0.38540898063049023]
[null,null,"ADOBE/ TAPIAL",null,-0.47801898654892666,null,null,"Persons per sleeping rooms",null,-0.39105200413603269,null,null,"Television por Cable",null,0.38080575611857992]
[null,null,"Internet en el Hogar",null,0.47029160055508429,null,null,"CEMENTO",null,-0.37680203868724177,null,null,"Lavadora de ropa",null,0.35247080215677629]
[null,null,"GAS NATURAL POR RED (CAÑERIA)",null,0.44466008998810297,null,null,"GAS LICUADO (GARRAFA)",null,-0.35409904087439242,null,null,"ADOBE/ TAPIAL",null,-0.32055547451756639]
[null,null," PAJA/CAÑA/PALMA/BARRO",null,-0.43666982957237038,null,null,"TIERRA",null,-0.33939276733756718,null,null,"Internet en el Hogar",null,0.29258397186820079]
[null,null,"Vehiculo automotor",null,0.42748321569450404,null,null,"CALAMINA O PLANCHA",null,-0.31103330121155975,null,null,"Microondas",null,0.28669862837661653]
[null,null,"Calefón o termo tanque",null,0.35183697908935568,null,null,"ADOBE/ TAPIAL",null,-0.30006459148737896,null,null,"OTROS ANIMALES",null,-0.24507410720665673]
[null,null,"cuarto sólo para cocinar",null,0.27818986251875366,null,null,"MACHIHEMBRE/PARQUET",null,0.2637351566728191,null,null,"Motocicleta o cuadratrac",null,0.22998763250012461]
[null,null,"LOSA DE HORMIGÓN ARMADO",null,0.26953037298794286,null,null,"Teléfono celular",null,0.2519790047610535,null,null,"LOSA DE HORMIGÓN ARMADO",null,0.21184560888247603]
[null,null,"MADERA",null,-0.26613582638859923,null,null,"Television",null,0.25128763775938467,null,null,"TEJA (CEMENTO/ARCILLA/FIBROCEMENTO)",null,0.20994855011107724]
[null,null,"MACHIHEMBRE/PARQUET",null,0.24639385148339046,null,null,"TEJA (CEMENTO/ARCILLA/FIBROCEMENTO)",null,0.22725083526019382,null,null,"Bicicleta",null,0.18812067580335126]
[null,null,"GAS LICUADO (GARRAFA)",null,0.24234113594386222,null,null,"Bicicleta",null,0.2231513957758339,null,null,"cuarto sólo para cocinar",null,0.18194379920767328]
[null,null,"TEJA (CEMENTO/ARCILLA/FIBROCEMENTO)",null,0.23259483612392309,null,null,"MADERA",null,-0.22079322530474951,null,null,"MADERA",null,-0.18193715673433303]
[null,null,"Bicicleta",null,0.21560997009179972,null,null,"Cocina",null,0.21076177863753065,null,null,"GALLINAS",null,-0.17417744601683735]
[null,null,"Persons per sleeping rooms",null,-0.20215441260134814,null,null,"GALLINAS",null,-0.20866341347757908,null,null,"GAS NATURAL POR RED (CAÑERIA)",null,0.1557023910153795]
[null,null,"Radio",null,0.16336864637308393,null,null,"Radio",null,0.20097344902511186,null,null,"Teléfono fijo",null,0.15469761900711435]
[null,null,"GUANO / BOSTA O TAQUIA",null,-0.15396649205918483,null,null,"LEÑA",null,-0.17190462030119491,null,null,"CALAMINA O PLANCHA",null,0.15149292415248936]
[null,null,"PIEDRA",null,-0.1182993687251447,null,null,"LOSA DE HORMIGÓN ARMADO",null,0.17145355773684692,null,null,"PIEDRA",null,-0.14070427270543692]
[null,null,"CALAMINA O PLANCHA",null,-0.11224309359947797,null,null,"LADRILLO",null,-0.12772256923053479,null,null,"Radio",null,0.1290478934138744]
[null,null,"CAÑA/ PALMA/ TRONCO",null,-0.1093263146054457,null,null,"NO COCINA",null,-0.11973736263560236,null,null,"GUANO / BOSTA O TAQUIA",null,-0.12852981988456905]
[null,null,"TABIQUE/ QUINCHE",null,-0.10486805805162003,null,null," PAJA/CAÑA/PALMA/BARRO",null,-9.5623374981933365E-2,null,null,"Calefón o termo tanque",null,0.12275548954043783]
[null,null,"Motocicleta o cuadratrac",null,8.7225932496168862E-2,null,null,"ELECTRICIDAD",null,9.080799890627389E-2,null,null,"CAÑA/ PALMA/ TRONCO",null,-0.11534731266254626]
[null,null,"CEMENTO",null,7.7069926100990671E-2,null,null,"ALFOMBRA/TAPIZÓN",null,8.0291021001374377E-2,null,null,"LADRILLO",null,0.10568234061729745]
[null,null,"TABLÓN DE MADERA",null,-7.2543092377041749E-2,null,null,"Motocicleta o cuadratrac",null,6.7176097546876534E-2,null,null,"MACHIHEMBRE/PARQUET",null,9.8574971859565638E-2]
[null,null,"ELECTRICIDAD",null,7.1476278354244818E-2,null,null,"OTRO",null,-6.6655248647643509E-2,null,null,"TABIQUE/ QUINCHE",null,-9.2852824514732035E-2]
[null,null,"ALFOMBRA/TAPIZÓN",null,7.0345793558897085E-2,null,null,"CAÑA/ PALMA/ TRONCO",null,-5.845665689437135E-2,null,null,"Persons per sleeping rooms",null,-7.631882628326575E-2]
[null,null,"NO COCINA",null,-4.3469745821578247E-2,null,null,"OTROS ANIMALES",null,-5.4586830694445608E-2,null,null,"OTRO",null,-2.8227806076580188E-2]
[null,null,"OTRO",null,-4.147057912164101E-2,null,null,"TABIQUE/ QUINCHE",null,-5.0335570883091915E-2,null,null,"OTRO",null,-2.6894533648858188E-2]
[null,null,"LADRILLO",null,-3.656537358227132E-2,null,null,"OTRO",null,4.228513896260945E-2,null,null,"TABLÓN DE MADERA",null,2.2743923411139941E-2]
[null,null,"OTRO",null,-2.347780799854101E-2,null,null,"TABLÓN DE MADERA",null,-3.4084517045513074E-2,null,null,"CONEJOS /CUISES",null,2.2323984979895094E-2]
[null,null,"OTRO",null,-1.0924605080830249E-2,null,null,"OTRO",null,-3.3693417931174349E-2,null,null,"OTRO",null,-2.1959013786465836E-2]
[null,null,"OTRO",null,7.2103798274725552E-3,null,null,"CONEJOS /CUISES",null,-2.5860943785117271E-2,null,null,"ALFOMBRA/TAPIZÓN",null,-1.0328271790203901E-2]
[null,null,null,null,null,null,null,"OTRO",null,-2.4944836325321379E-2,null,null,"NO COCINA",null,-4.9394763559716592E-3]
[null,null,null,null,null,null,null,"GUANO / BOSTA O TAQUIA",null,-1.3487595731351068E-2,null,null,"ELECTRICIDAD",null,-4.0633068933125316E-3]
[null,null,null,null,null,null,null,"PIEDRA",null,-6.6983461101635354E-3]
[null,null,"Communalities"]
[null,null,null,null,"Extraction"]
[null,null,"Persons per sleeping rooms",null,4.0866406534196105E-2,null,null,null,null,null,null,null,"Communalities"]
[null,null,"LADRILLO/ BLOQUE DE CEMENTO/ HORMIGÓNr",null,0.44405299305407731,null,null,"Communalities",null,null,null,null,null,null,"Extraction"]
[null,null,"ADOBE/ TAPIAL",null,0.22850215150126293,null,null,null,null,"Extraction",null,null,"Persons per sleeping rooms",null,5.8245632452552949E-3]
[null,null,"TABIQUE/ QUINCHE",null,1.0997309599517948E-2,null,null,"Persons per sleeping rooms",null,0.15292166993880774,null,null,"LADRILLO/ BLOQUE DE CEMENTO/ HORMIGÓNr",null,0.3672755991669775]
[null,null,"PIEDRA",null,1.3994740640767743E-2,null,null,"LADRILLO/ BLOQUE DE CEMENTO/ HORMIGÓNr",null,0.16030461473506655,null,null,"ADOBE/ TAPIAL",null,0.10275581224318216]
[null,null,"MADERA",null,7.0828278087542634E-2,null,null,"ADOBE/ TAPIAL",null,9.003875906448762E-2,null,null,"TABIQUE/ QUINCHE",null,8.6216470203636219E-3]
[null,null,"CAÑA/ PALMA/ TRONCO",null,1.195224306520889E-2,null,null,"TABIQUE/ QUINCHE",null,2.5336696961267705E-3,null,null,"PIEDRA",null,1.9797692357565962E-2]
[null,null,"OTRO",null,1.7198089326842872E-3,null,null,"PIEDRA",null,4.4867840611542969E-5,null,null,"MADERA",null,3.3101129000573264E-2]
[null,null,"CALAMINA O PLANCHA",null,1.2598512060781173E-2,null,null,"MADERA",null,4.8749648340473878E-2,null,null,"CAÑA/ PALMA/ TRONCO",null,1.3305002538471205E-2]
[null,null,"TEJA (CEMENTO/ARCILLA/FIBROCEMENTO)",null,5.410035779151464E-2,null,null,"CAÑA/ PALMA/ TRONCO",null,3.4171807352662534E-3,null,null,"OTRO",null,4.8219828647419667E-4]
[null,null,"LOSA DE HORMIGÓN ARMADO",null,7.2646621963019603E-2,null,null,"OTRO",null,4.4429221722791816E-3,null,null,"CALAMINA O PLANCHA",null,2.2950106068271893E-2]
[null,null," PAJA/CAÑA/PALMA/BARRO",null,0.190680540058763,null,null,"CALAMINA O PLANCHA",null,9.6741714462560857E-2,null,null,"TEJA (CEMENTO/ARCILLA/FIBROCEMENTO)",null,4.4078393693743514E-2]
[null,null,"OTRO",null,5.5120746841635622E-4,null,null,"TEJA (CEMENTO/ARCILLA/FIBROCEMENTO)",null,5.1642942126455753E-2,null,null,"LOSA DE HORMIGÓN ARMADO",null,4.4878562002787004E-2]
[null,null,"TIERRA",null,0.43160287319825746,null,null,"LOSA DE HORMIGÓN ARMADO",null,2.93963224606223E-2,null,null," PAJA/CAÑA/PALMA/BARRO",null,0.23380081025103569]
[null,null,"TABLÓN DE MADERA",null,5.2625002516240122E-3,null,null," PAJA/CAÑA/PALMA/BARRO",null,9.1438298429354394E-3,null,null,"OTRO",null,7.9680903589701734E-4]
[null,null,"MACHIHEMBRE/PARQUET",null,6.0709930048819076E-2,null,null,"OTRO",null,1.1352464118847812E-3,null,null,"TIERRA",null,0.51305388735741453]
[null,null,"ALFOMBRA/TAPIZÓN",null,4.9485306714309668E-3,null,null,"TIERRA",null,0.115187450521052,null,null,"TABLÓN DE MADERA",null,5.1728605213179947E-4]
[null,null,"CEMENTO",null,5.9397735092121635E-3,null,null,"TABLÓN DE MADERA",null,1.1617543022258714E-3,null,null,"MACHIHEMBRE/PARQUET",null,9.7170250771141577E-3]
[null,null,"MOSAICO/BALDOSAS/CERÁMICA",null,0.25480803218280967,null,null,"MACHIHEMBRE/PARQUET",null,6.9556232865236434E-2,null,null,"ALFOMBRA/TAPIZÓN",null,1.0667319817232168E-4]
[null,null,"LADRILLO",null,1.3370265452110654E-3,null,null,"ALFOMBRA/TAPIZÓN",null,6.4466480534431415E-3,null,null,"CEMENTO",null,0.20750616164636329]
[null,null,"OTRO",null,5.1989577256423156E-5,null,null,"CEMENTO",null,0.14197977635886164,null,null,"MOSAICO/BALDOSAS/CERÁMICA",null,0.1608679267764444]
[null,null,"LEÑA",null,0.39229783523509443,null,null,"MOSAICO/BALDOSAS/CERÁMICA",null,0.23127341706590338,null,null,"LADRILLO",null,1.1168757118350478E-2]
[null,null,"GUANO / BOSTA O TAQUIA",null,2.3705680677011027E-2,null,null,"LADRILLO",null,1.6313054690848754E-2,null,null,"OTRO",null,7.2331594018956529E-4]
[null,null,"GAS LICUADO (GARRAFA)",null,5.8729226170561512E-2,null,null,"OTRO",null,1.7880329770871919E-3,null,null,"LEÑA",null,0.48744320279000658]
[null,null,"GAS NATURAL POR RED (CAÑERIA)",null,0.19772259562822783,null,null,"LEÑA",null,2.9551198480897992E-2,null,null,"GUANO / BOSTA O TAQUIA",null,1.651991459955976E-2]
[null,null,"ELECTRICIDAD",null,5.1088583673734866E-3,null,null,"GUANO / BOSTA O TAQUIA",null,1.8191523861235955E-4,null,null,"GAS LICUADO (GARRAFA)",null,0.50981095317125813]
[null,null,"NO COCINA",null,1.8896188017926195E-3,null,null,"GAS LICUADO (GARRAFA)",null,0.12538613074816463,null,null,"GAS NATURAL POR RED (CAÑERIA)",null,2.4243234567906131E-2]
[null,null,"OTRO",null,1.1934699617210209E-4,null,null,"GAS NATURAL POR RED (CAÑERIA)",null,0.2252875003997506,null,null,"ELECTRICIDAD",null,1.6510462909241137E-5]
[null,null,"Radio",null,2.6689314617773751E-2,null,null,"ELECTRICIDAD",null,8.2460926653618403E-3,null,null,"NO COCINA",null,2.4398426671203061E-5]
[null,null,"Television",null,0.36001800998409172,null,null,"NO COCINA",null,1.4337036010929744E-2,null,null,"Radio",null,1.665335879455869E-2]
[null,null,"Equipo de Musica",null,0.3283929900451853,null,null,"OTRO",null,6.2224485929707305E-4,null,null,"Television",null,0.37176033275024545]
[null,null,"Refrigetaror",null,0.47330303128879697,null,null,"Radio",null,4.0390327213049235E-2,null,null,"Equipo de Musica",null,0.20749675998817121]
[null,null,"Cocina",null,0.28901317390828046,null,null,"Television",null,6.3145476890691735E-2,null,null,"Refrigetaror",null,0.37336708138844948]
[null,null,"Computer",null,0.39252402881253123,null,null,"Equipo de Musica",null,0.28173128797525293,null,null,"Cocina",null,0.39389820541200826]
[null,null,"Lavadora de ropa",null,0.36379454620590662,null,null,"Refrigetaror",null,0.32786064684449318,null,null,"Computer",null,0.17510853806921919]
[null,null,"Calefón o termo tanque",null,0.12378925985472371,null,null,"Cocina",null,4.4420527334455472E-2,null,null,"Lavadora de ropa",null,0.12423566637304133]
[null,null,"Microondas",null,0.31160462379880977,null,null,"Computer",null,0.41738123943412192,null,null,"Calefón o termo tanque",null,1.506891021231254E-2]
[null,null,"Teléfono fijo",null,0.28262126241003888,null,null,"Lavadora de ropa",null,0.44620422611843141,null,null,"Microondas",null,8.2196103513033261E-2]
[null,null,"Teléfono celular",null,0.23172790753015807,null,null,"Calefón o termo tanque",null,0.1804644716761675,null,null,"Teléfono fijo",null,2.3931353326470305E-2]
[null,null,"Internet en el Hogar",null,0.22117418955266296,null,null,"Microondas",null,0.41014723560684496,null,null,"Teléfono celular",null,0.24360098382818418]
[null,null,"Television por Cable",null,0.34112063014485883,null,null,"Teléfono fijo",null,0.36182932423920072,null,null,"Internet en el Hogar",null,8.5605380594172109E-2]
[null,null,"Bicicleta",null,4.6487659202986767E-2,null,null,"Teléfono celular",null,6.3493418840371019E-2,null,null,"Television por Cable",null,0.14501302389304338]
[null,null,"Motocicleta o cuadratrac",null,7.6083632998262072E-3,null,null,"Internet en el Hogar",null,0.24885909145248103,null,null,"Bicicleta",null,3.5389388664709587E-2]
[null,null,"Vehiculo automotor",null,0.18274189970051385,null,null,"Television por Cable",null,0.33344602883935859,null,null,"Motocicleta o cuadratrac",null,5.2894311103012369E-2]
[null,null,"cuarto sólo para cocinar",null,7.7389599608203061E-2,null,null,"Bicicleta",null,4.9796545436702859E-2,null,null,"Vehiculo automotor",null,0.1485400823506336]
[null,null,null,null,null,null,null,"Motocicleta o cuadratrac",null,4.5126280816274716E-3,null,null,"cuarto sólo para cocinar",null,3.3103546070122135E-2]
[null,null,null,null,null,null,null,"Vehiculo automotor",null,0.21615934478402299,null,null,"CONEJOS /CUISES",null,4.9836030538258174E-4]
[null,null,"Total Variance Explained",null,null,null,null,"cuarto sólo para cocinar",null,0.15777282168717632,null,null,"GALLINAS",null,3.033778270094829E-2]
[null,null,"Component",null,"Extraction Sums of Squared Loadings",null,null,"CONEJOS /CUISES",null,6.6878841345699555E-4,null,null,"OTROS ANIMALES",null,6.0061318023139874E-2]
[null,null,null,null,"Total","% of Variance","Cumulative %","GALLINAS",null,4.3540420124115131E-2]
[null,null,"1",null,6.6577254785839548,14.794945507964345,14.794945507964345,"OTROS ANIMALES",null,2.979722085264069E-3]
[null,null,null,null,null,null,null,null,null,null,null,null,"Total Variance Explained"]
[null,null,null,null,null,null,null,null,null,null,null,null,"Component",null,"Extraction Sums of Squared Loadings"]
[null,null,"Component Score Coefficient Matrix",null,null,null,null,"Total Variance Explained",null,null,null,null,null,null,"Total","% of Variance","Cumulative %"]
[null,null,null,null,"Component",null,null,"Component",null,"Extraction Sums of Squared Loadings",null,null,"1",null,5.4581480594559464,11.613080977565843,11.613080977565843]
[null,null,null,null,"1",null,null,null,null,"Total","% of Variance","Cumulative %"]
[null,null,"Persons per sleeping rooms",null,-3.0363885271572466E-2,null,null,"1",null,5.3326354461425369,11.109657179463618,11.109657179463618]
[null,null,"LADRILLO/ BLOQUE DE CEMENTO/ HORMIGÓNr",null,0.10009019080063729,null,null,null,null,null,null,null,"Component Score Coefficient Matrix"]
[null,null,"ADOBE/ TAPIAL",null,-7.1799143429175663E-2,null,null,null,null,null,null,null,null,null,"Component"]
[null,null,"TABIQUE/ QUINCHE",null,-1.5751334053792285E-2,null,null,"Component Score Coefficient Matrix",null,null,null,null,null,null,"1"]
[null,null,"PIEDRA",null,-1.776873635082743E-2,null,null,null,null,"Component",null,null,"Persons per sleeping rooms",null,-1.3982549658221072E-2]
[null,null,"MADERA",null,-3.9973986197641198E-2,null,null,null,null,"1",null,null,"LADRILLO/ BLOQUE DE CEMENTO/ HORMIGÓNr",null,0.11103265523355849]
[null,null,"CAÑA/ PALMA/ TRONCO",null,-1.6420970638864267E-2,null,null,"Persons per sleeping rooms",null,-7.3331846529825634E-2,null,null,"ADOBE/ TAPIAL",null,-5.8729714002943058E-2]
[null,null,"OTRO",null,-6.2289409881858722E-3,null,null,"LADRILLO/ BLOQUE DE CEMENTO/ HORMIGÓNr",null,7.5081184792039832E-2,null,null,"TABIQUE/ QUINCHE",null,-1.7011781927364453E-2]
[null,null,"CALAMINA O PLANCHA",null,-1.6859075064078966E-2,null,null,"ADOBE/ TAPIAL",null,-5.6269473981094359E-2,null,null,"PIEDRA",null,-2.5778757038602933E-2]
[null,null,"TEJA (CEMENTO/ARCILLA/FIBROCEMENTO)",null,3.4936080929157523E-2,null,null,"TABIQUE/ QUINCHE",null,-9.4391546902954163E-3,null,null,"MADERA",null,-3.3333129616947038E-2]
[null,null,"LOSA DE HORMIGÓN ARMADO",null,4.0483852008459463E-2,null,null,"PIEDRA",null,-1.2561042617321445E-3,null,null,"CAÑA/ PALMA/ TRONCO",null,-2.1133049416406591E-2]
[null,null," PAJA/CAÑA/PALMA/BARRO",null,-6.5588440222868194E-2,null,null,"MADERA",null,-4.1404147636693318E-2,null,null,"OTRO",null,-4.0231619859455864E-3]
[null,null,"OTRO",null,-3.5264007316106018E-3,null,null,"CAÑA/ PALMA/ TRONCO",null,-1.0962057595115956E-2,null,null,"CALAMINA O PLANCHA",null,2.7755370961408062E-2]
[null,null,"TIERRA",null,-9.8677077789477041E-2,null,null,"OTRO",null,-1.2499494728419857E-2,null,null,"TEJA (CEMENTO/ARCILLA/FIBROCEMENTO)",null,3.8465162143660199E-2]
[null,null,"TABLÓN DE MADERA",null,-1.0896077438217093E-2,null,null,"CALAMINA O PLANCHA",null,-5.8326376207950163E-2,null,null,"LOSA DE HORMIGÓN ARMADO",null,3.8812726693161971E-2]
[null,null,"MACHIHEMBRE/PARQUET",null,3.7008713002056132E-2,null,null,"TEJA (CEMENTO/ARCILLA/FIBROCEMENTO)",null,4.2615107962157818E-2,null,null," PAJA/CAÑA/PALMA/BARRO",null,-8.858857046999967E-2]
[null,null,"ALFOMBRA/TAPIZÓN",null,1.0566039976442383E-2,null,null,"LOSA DE HORMIGÓN ARMADO",null,3.215174925577767E-2,null,null,"OTRO",null,-5.1716820007616021E-3]
[null,null,"CEMENTO",null,1.1576014413466446E-2,null,null," PAJA/CAÑA/PALMA/BARRO",null,-1.7931729244890414E-2,null,null,"TIERRA",null,-0.13123092166163422]
[null,null,"MOSAICO/BALDOSAS/CERÁMICA",null,7.5819457604967624E-2,null,null,"OTRO",null,-6.318342641544553E-3,null,null,"TABLÓN DE MADERA",null,4.1669671037481886E-3]
[null,null,"LADRILLO",null,-5.4921720187910894E-3,null,null,"TIERRA",null,-6.3644471999876426E-2,null,null,"MACHIHEMBRE/PARQUET",null,1.806014985042222E-2]
[null,null,"OTRO",null,1.0830094828431021E-3,null,null,"TABLÓN DE MADERA",null,-6.3916833223933876E-3,null,null,"ALFOMBRA/TAPIZÓN",null,-1.8922666951679201E-3]
[null,null,"LEÑA",null,-9.4076699391275956E-2,null,null,"MACHIHEMBRE/PARQUET",null,4.9456813490522208E-2,null,null,"CEMENTO",null,8.3458425317606166E-2]
[null,null,"GUANO / BOSTA O TAQUIA",null,-2.3125989882648666E-2,null,null,"ALFOMBRA/TAPIZÓN",null,1.5056536643519185E-2,null,null,"MOSAICO/BALDOSAS/CERÁMICA",null,7.3483430056418789E-2]
[null,null,"GAS LICUADO (GARRAFA)",null,3.6399989264112191E-2,null,null,"CEMENTO",null,-7.0659628338143515E-2,null,null,"LADRILLO",null,1.9362307410149583E-2]
[null,null,"GAS NATURAL POR RED (CAÑERIA)",null,6.6788588898483464E-2,null,null,"MOSAICO/BALDOSAS/CERÁMICA",null,9.01822285975028E-2,null,null,"OTRO",null,-4.927410058484006E-3]
[null,null,"ELECTRICIDAD",null,1.0735840428411181E-2,null,null,"LADRILLO",null,-2.3951115826401626E-2,null,null,"LEÑA",null,-0.12791359268227817]
[null,null,"NO COCINA",null,-6.5292187191268664E-3,null,null,"OTRO",null,7.9295011612311155E-3,null,null,"GUANO / BOSTA O TAQUIA",null,-2.3548247223139737E-2]
[null,null,"OTRO",null,-1.6408914900399021E-3,null,null,"LEÑA",null,-3.2236334554904815E-2,null,null,"GAS LICUADO (GARRAFA)",null,0.13081551902841379]
[null,null,"Radio",null,2.4538207064649216E-2,null,null,"GUANO / BOSTA O TAQUIA",null,-2.5292551623995931E-3,null,null,"GAS NATURAL POR RED (CAÑERIA)",null,2.8526597175324606E-2]
[null,null,"Television",null,9.0123122388036839E-2,null,null,"GAS LICUADO (GARRAFA)",null,-6.6402259155093138E-2,null,null,"ELECTRICIDAD",null,-7.4444790596566389E-4]
[null,null,"Equipo de Musica",null,8.6073815578420892E-2,null,null,"GAS NATURAL POR RED (CAÑERIA)",null,8.9007510283203806E-2,null,null,"NO COCINA",null,-9.0497295092870978E-4]
[null,null,"Refrigetaror",null,0.10333412331224247,null,null,"ELECTRICIDAD",null,1.7028728069525472E-2,null,null,"Radio",null,2.3643164679328532E-2]
[null,null,"Cocina",null,8.0748215982897664E-2,null,null,"NO COCINA",null,-2.2453693646397047E-2,null,null,"Television",null,0.1117084978299587]
[null,null,"Computer",null,9.4103817153328051E-2,null,null,"OTRO",null,-4.6777689150616329E-3,null,null,"Equipo de Musica",null,8.3456534635253085E-2]
[null,null,"Lavadora de ropa",null,9.0594578417687352E-2,null,null,"Radio",null,3.7687453240496653E-2,null,null,"Refrigetaror",null,0.11194963969295531]
[null,null,"Calefón o termo tanque",null,5.2846423334983843E-2,null,null,"Television",null,4.7122598253206749E-2,null,null,"Cocina",null,0.11498645600167443]
[null,null,"Microondas",null,8.3844786463182885E-2,null,null,"Equipo de Musica",null,9.9534959767324696E-2,null,null,"Computer",null,7.6666978690506926E-2]
[null,null,"Teléfono fijo",null,7.9850296349347538E-2,null,null,"Refrigetaror",null,0.10737489461020419,null,null,"Lavadora de ropa",null,6.4576995405271148E-2]
[null,null,"Teléfono celular",null,7.2304160214270385E-2,null,null,"Cocina",null,3.9523005231866956E-2,null,null,"Calefón o termo tanque",null,2.2490318731418539E-2]
[null,null,"Internet en el Hogar",null,7.0638478872083424E-2,null,null,"Computer",null,0.12115032041278159,null,null,"Microondas",null,5.2526722480517297E-2]
[null,null,"Television por Cable",null,8.7725955851690324E-2,null,null,"Lavadora de ropa",null,0.12526361604367103,null,null,"Teléfono fijo",null,2.8342510558889856E-2]
[null,null,"Bicicleta",null,3.2384929475592947E-2,null,null,"Calefón o termo tanque",null,7.9662505614554985E-2,null,null,"Teléfono celular",null,9.0426184570478643E-2]
[null,null,"Motocicleta o cuadratrac",null,1.3101461268829771E-2,null,null,"Microondas",null,0.12009584971339474,null,null,"Internet en el Hogar",null,5.360498994916689E-2]
[null,null,"Vehiculo automotor",null,6.4208597526226957E-2,null,null,"Teléfono fijo",null,0.11280023006562385,null,null,"Television por Cable",null,6.976830821927861E-2]
[null,null,"cuarto sólo para cocinar",null,4.1784519865472484E-2,null,null,"Teléfono celular",null,4.7252246530995724E-2,null,null,"Bicicleta",null,3.4466026526605915E-2]
[null,null,null,null,null,null,null,"Internet en el Hogar",null,9.3548076151042436E-2,null,null,"Motocicleta o cuadratrac",null,4.2136569033096025E-2]
[null,null,null,null,null,null,null,"Television por Cable",null,0.10828564298929644,null,null,"Vehiculo automotor",null,7.0611675687835176E-2]
[null,null,"Component Score Covariance Matrix",null,null,null,null,"Bicicleta",null,4.1846362465533755E-2,null,null,"cuarto sólo para cocinar",null,3.3334346599936122E-2]
[null,null,"Component",null,"1",null,null,"Motocicleta o cuadratrac",null,1.2597166677776491E-2,null,null,"CONEJOS /CUISES",null,4.0900292071080766E-3]
[null,null,"1",null,0.99999999999999967,null,null,"Vehiculo automotor",null,8.7185670636833523E-2,null,null,"GALLINAS",null,-3.191145496961819E-2]
[null,null,null,null,null,null,null,"cuarto sólo para cocinar",null,7.448592257395667E-2,null,null,"OTROS ANIMALES",null,-4.4900597150727542E-2]
[null,null,null,null,null,null,null,"CONEJOS /CUISES",null,-4.8495615434998992E-3]
[null,null,null,null,null,null,null,"GALLINAS",null,-3.9129510274046528E-2]
[null,null,null,null,null,null,null,"OTROS ANIMALES",null,-1.0236370223644677E-2,null,null,"Component Score Covariance Matrix"]
[null,null,null,null,null,null,null,null,null,null,null,null,"Component",null,"1"]
[null,null,null,null,null,null,null,null,null,null,null,null,"1",null,1]
[null,null,null,null,null,null,null,"Component Score Covariance Matrix"]
[null,null,null,null,null,null,null,"Component",null,"1"]
[null,null,null,null,null,null,null,"1",null,1]
[]
[]
[]
[]
[]
[]
[]
[]
[]
[]
[]
[]
[]
[]
[]
[]
[]
[]
[]
[]
[]
[]
[]
[]
[]
[]
[]
[]
[]
[]
[]
[]
[]
[]
[]
[]
[]
[]
[]
[]
[]
[]
[]
[]
[]
[]
[]
[]
[]
[]
[]
[]
[]
[]
[]
[]
[]
[]
[]
[]
[]
[]
[]
[]
[]
[]
[]
[]
[]
[]
[]
[]
[]
[]
[]
[]
[]
[]
[]
[]
[]
[]
[]
[]
[]
[]
[]
[]
[]
[]
[]
[]
[]
[]
[]
[]
[]
[]
[]
[]
[]
[]
[]
[]
[]
[]
[]
[]
[]
[]
[]
[]
[]
[]
[]
[]
[]
[]
[]
[]
[]
[]
[]
[]
[]
[]
[]
[]
[]
[]
[]
[]
[]
[]
[]
[]
[]
[]
[]
[]
[]
[]
[]
[]
[]
[]
[]
[]
[]
[]
[]
[]
[]
[]
[]
[]
[]
[]
[]
[]
[]
[]
[]
[]
[]
[]
[]
[]
[]
[]
[]
[]
[]
[]
[]
[]
[]
[]
[]
[]
[]
[]
[]
[]
[]
[]
[]
[]
[]
[]
[]
[]
[]
[]
[]
[]
[]
[]
[]
[]
[]
[]
[]
[]
[]
[]
[]
[]
[]
[]
[]
[]
[]
[]
[]
[]
[]
[]
[]
[]
[]
[]
[]
[]
[]
[]
[]
[]
[]
[]
[]
[]
[]
[]
[]
[]
[]
[]
[]
[]
[]
[]
[]
[]
[]
[]
[]
[]
[]
[]
[]
[]
[]
[]
[]
[]
[]
[]
[]
[]
[]
[]
[]
[]
[]
[]
[]
[]
[]
[]
[]
[]
[]
[]
[]
[]
[]
[]
[]
[]
[]
[]
[]
[]
[]
[]
[]
[]
[]
[]
[]
[]
[]
[]
[]
[]
[]
[]
[]
[]
[]
[]
[]
[]
[]
[]
[]
[]
[]
[]
[]
[]
[]
[]
[]
[]
[]
[]
[]
[]
[]
[]
[]
[]
[]
[]
[]
[]
[]
[]
[]
[]
[]
[]
[]
[]
[]
[]
[]
[]
[]
[]
[]
[]
[]
[]
[]
[]
[]
[]
[]
[]
[]
[]
[]
[]
[]
[]
[]
[]
[]
[]
[]
[]
[]
[]
[]
[]
[]
[]
[]
[]
[]
[]
[]
[]
[]
[]
[]
[]
[]
[]
[]
[]
[]
[]
[]
[]
[]
[]
[]
[]
[]
[]
[]
[]
[]
[]
[]
[]
[]
[]
[]
[]
[]
[]
[]
[]
[]
[]
[]
[]
[]
[]
[]
[]
[]
[]
[]
[]
[]
[]
[]
[]
[]
[]
[]
[]
[]
[]
[]
[]
[]
[]
[]
[]
[]
[]
[]
[]
[]
[]
[]
[]
[]
[]
[]
[]
[]
[]
[]
[]
[]
[]
[]
[]
[]
["EDS16"]
["Bolivia (Plurinational State of)",null,"Count"]
["W_text_t","",14655]
["W_text_i","",14655]
["S_text_s","Ratio of Shared improved based on:",14655]
["S_text_i","Ratio of Improved latrines based on:",14655]
["Urban/Rural","Urban",8317]
[null,"Rural",6338]
[null,"Missing",0]
["2016"]
[]
["Sub-national region names","Weighted population"]
[{"$f":"R15","v":"Beni"},{"$f":"BR122+BR123","v":{"$error":"#VALUE!"}}]
[{"$f":"S15","v":"Chuquisaca"},{"$f":"BS122+BS123","v":{"$error":"#VALUE!"}}]
[{"$f":"T15","v":"Cochabamba"},{"$f":"BT122+BT123","v":{"$error":"#VALUE!"}}]
[{"$f":"U15","v":"La Paz"},{"$f":"BU122+BU123","v":{"$error":"#VALUE!"}}]
[{"$f":"V15","v":"Oruro"},{"$f":"BV122+BV123","v":{"$error":"#VALUE!"}}]
[{"$f":"W15","v":"Pando"},{"$f":"BW122+BW123","v":{"$error":"#VALUE!"}}]
[{"$f":"X15","v":"Potos?"},{"$f":"BX122+XR123","v":{"$error":"#VALUE!"}}]
[{"$f":"Y15","v":"Santa Cruz"},{"$f":"BY122+BY123","v":{"$error":"#VALUE!"}}]
[{"$f":"Z15","v":"Tarija"},{"$f":"BZ122+BZ123","v":{"$error":"#VALUE!"}}]
[{"$f":"AA15","v":0},{"$f":"CA122+CA123","v":0}]
[{"$f":"AB15","v":0},{"$f":"CB122+CB123","v":0}]
[{"$f":"AC15","v":0},{"$f":"CC122+CC123","v":0}]
[{"$f":"AD15","v":0},{"$f":"CD122+CD123","v":0}]
[{"$f":"AE15","v":0},{"$f":"CE122+CE123","v":0}]
[{"$f":"AF15","v":0},{"$f":"CF122+CF123","v":0}]
[{"$f":"AG15","v":0},{"$f":"CG122+CG123","v":0}]
[{"$f":"AH15","v":0},{"$f":"CH122+CH123","v":0}]
[{"$f":"AI15","v":0},{"$f":"CI122+CI123","v":0}]
[{"$f":"AJ15","v":0},{"$f":"CJ122+CJ123","v":0}]
[{"$f":"AK15","v":0},{"$f":"CK122+CK123","v":0}]
[{"$f":"AL15","v":0},{"$f":"CL122+CL123","v":0}]
[{"$f":"AM15","v":0},{"$f":"CM122+CM123","v":0}]
[{"$f":"AN15","v":0},{"$f":"CN122+CN123","v":0}]
[{"$f":"AO15","v":0},{"$f":"CO122+CO123","v":0}]
[{"$f":"AP15","v":0},{"$f":"CP122+CP123","v":0}]
[{"$f":"AQ15","v":0},{"$f":"CQ122+CQ123","v":0}]
[{"$f":"AR15","v":0},{"$f":"CR122+CR123","v":0}]
[{"$f":"AS15","v":0},{"$f":"CS122+CS123","v":0}]
[{"$f":"AT15","v":0},{"$f":"CT122+CT123","v":0}]
[{"$f":"AU15","v":0},{"$f":"CU122+CU123","v":0}]
[{"$f":"AV15","v":0},{"$f":"CV122+CV123","v":0}]
[{"$f":"AW15","v":0},{"$f":"CW122+CW123","v":0}]
[{"$f":"AX15","v":0},{"$f":"CX122+CX123","v":0}]
[{"$f":"AY15","v":0},{"$f":"CY122+CY123","v":0}]
[]
[{"$f":"34-COUNTIF(A1037:A1071,\"0\")","v":9},"Sub-regions"]

{"sheet":"data_summary","index":7,"n_rows":146,"n_cols":64,"rows_kept":146,"cut":false,"hidden":false,"merged":[]}
["iso3","year","data_source","row","var1","var2","varname","total_q1","total_q2","total_q3","total_q4","total_q5","urban_q1","urban_q2","urban_q3","urban_q4","urban_q5","rural_q1","rural_q2","rural_q3","rural_q4","rural_q5","region_1_name","region_2_name","region_3_name","region_4_name","region_5_name","region_6_name","region_7_name","region_8_name","region_9_name","region_1","region_2","region_3","region_4","region_5","region_6","region_7","region_8","region_9","n_total_q1","n_total_q2","n_total_q3","n_total_q4","n_total_q5","n_urban_q1","n_urban_q2","n_urban_q3","n_urban_q4","n_urban_q5","n_rural_q1","n_rural_q2","n_rural_q3","n_rural_q4","n_rural_q5","n_region_1","n_region_2","n_region_3","n_region_4","n_region_5","n_region_6","n_region_7","n_region_8","n_region_9"]
["BOL",2003,"BOL_2003_DHS",16,"Water","Improved","w_imp",47.32518094956319,73.010652416466357,91.597231389219061,96.827162890674344,99.648390356642906,80.111406074294109,93.97828433398405,96.909993659721152,99.044891826962413,99.842412216600636,41.797486679810703,49.5323795533197,58.496185613265737,69.942679251586284,86.265342903921379,"Beni","Chuquisaca","Cochabamba","La Paz","Oruro","Pando","Potosi","Santa Cruz","Tarija",56.482230035355883,66.919675456621817,82.939307138610673,82.862692299381322,82.326222159643407,52.98926698129457,70.247213260041732,91.674435366306795,85.84695744645137]
["BOL",2003,"BOL_2003_DHS",17,"Water","Not Improved","",52.67481905043681,26.98934758353364,8.4027686107809387,3.172837109325656,0.35160964335709372,19.888593925705891,6.0217156660159503,3.090006340278848,0.95510817303758699,0.15758778339936441,58.202513320189297,50.4676204466803,41.503814386734263,30.057320748413719,13.734657096078619,"Beni","Chuquisaca","Cochabamba","La Paz","Oruro","Pando","Potosi","Santa Cruz","Tarija",43.517769964644117,33.080324543378183,17.060692861389331,17.137307700618681,17.673777840356589,47.01073301870543,29.752786739958271,8.3255646336932045,14.15304255354863]
["BOL",2003,"BOL_2003_DHS",18,"Water ladder","Basic","w_bas",47.242828480201851,72.986185395968974,91.597231389219075,96.7381742394561,99.648390356642906,80.046759859723437,93.97828433398405,96.759497505827724,99.044891826962413,99.842412216600636,41.769890631160209,49.400759765803713,58.493339504846723,69.93525691263018,86.265342903921379,"Beni","Chuquisaca","Cochabamba","La Paz","Oruro","Pando","Potosi","Santa Cruz","Tarija",56.002357544846951,66.793186143650615,82.939307138610673,82.862692299381322,82.308686635898468,52.98926698129457,70.247213260041732,91.598050543057127,85.846957446451384]
["BOL",2003,"BOL_2003_DHS",19,"Water ladder","Limited","w_lim",0.082352469361330602,0.024467020497371698,0,0.088988651218238402,0,0.064646214570656793,0,0.1504961538934102,0,0,0.027596048650499399,0.13161978751598469,0.0028461084190212001,0.0074223389561027002,0,"Beni","Chuquisaca","Cochabamba","La Paz","Oruro","Pando","Potosi","Santa Cruz","Tarija",0.47987249050893871,0.12648931297119051,0,0,0.017535523744956299,0,0,0.076384823249684805,0]
["BOL",2003,"BOL_2003_DHS",20,"Water ladder","Unimproved","w_unimp",19.594798945594871,16.031286163190568,6.749627895093937,2.7791136831175289,0.35160964335709372,16.84367402380056,5.3647876400689816,2.5501146138528981,0.94078201286542651,0.15758778339936441,19.278544959373331,19.898894959330931,16.116337322602771,14.37472077038527,10.416285154449669,"Beni","Chuquisaca","Cochabamba","La Paz","Oruro","Pando","Potosi","Santa Cruz","Tarija",32.673557492121262,5.9706461123424504,6.5206529615636981,10.39167555786177,16.329741027327501,13.94970388336597,11.135235593107071,5.6425750392557177,2.9230039408490431]
["BOL",2003,"BOL_2003_DHS",21,"Water ladder","Surface water","w_sur",33.080020104841942,10.958061420343091,1.6531407156869919,0.39372342620812589,0,3.0449199019053461,0.65692802594696664,0.5398917264259574,0.0143261601721582,0,38.923968360815948,30.568725487349369,25.387477064131492,15.682599978028451,3.3183719416289592,"Beni","Chuquisaca","Cochabamba","La Paz","Oruro","Pando","Potosi","Santa Cruz","Tarija",10.844212472522839,27.10967843103575,10.540039899825629,6.7456321427569028,1.3440368130290841,33.061029135339467,18.617551146851198,2.682989594437474,11.23003861269958]
["BOL",2003,"BOL_2003_DHS",29,"Piped water","Yes","w_pip",42.984651979428968,64.84034077594805,84.659900289469277,92.624260267032255,97.313882225946912,72.447277089431751,88.617884205903778,92.476769203793737,96.094088631021918,98.142258367738791,37.889111501321928,44.648185717992611,54.172633296821573,61.309695352497698,78.492640689091431,"Beni","Chuquisaca","Cochabamba","La Paz","Oruro","Pando","Potosi","Santa Cruz","Tarija",50.120356493581163,64.649222111362562,73.765861021817287,79.224901136602952,75.678986944765811,51.9326771960949,68.724616256994537,85.736880217753551,81.525160276632718]
["BOL",2003,"BOL_2003_DHS",30,"Piped water","No","",57.015348020571047,35.159659224051907,15.340099710530611,7.3757397329676913,2.6861177740530828,27.55272291056815,11.382115794096411,7.5232307962061196,3.9059113689780829,1.857741632261241,62.110888498678122,55.351814282007567,45.827366703178519,38.690304647502373,21.507359310908509,"Beni","Chuquisaca","Cochabamba","La Paz","Oruro","Pando","Potosi","Santa Cruz","Tarija",49.879643506419107,35.350777888637317,26.234138978182202,20.77509886339756,24.321013055234381,48.067322803905341,31.275383743005701,14.26311978224623,18.47483972336736]
["BOL",2003,"BOL_2003_DHS",31,"Piped water on premises","Yes","w_pop",29.212924485017279,56.380488011556658,78.129383561541772,91.380945229310001,97.137593454541744,64.025466443941013,82.682343229252069,91.451732308770559,95.752091952811298,98.026856854847253,20.621769299643169,31.584475206553169,44.856263446435101,52.880031437737507,73.169166649099978,"Beni","Chuquisaca","Cochabamba","La Paz","Oruro","Pando","Potosi","Santa Cruz","Tarija",45.648621845626423,59.241708301392777,68.478995819174941,72.247750462512286,67.44286785860821,50.002450656937093,53.125060105361598,82.730950491319064,79.751353772989503]
["BOL",2003,"BOL_2003_DHS",32,"Piped water on premises","No","",70.787075514982817,43.619511988443321,21.87061643845815,8.6190547706899441,2.8624065454582759,35.974533556058979,17.317656770748378,8.5482676912293538,4.2479080471886954,1.9731431451527719,79.378230700356809,68.415524793446892,55.143736553564892,47.119968562262557,26.83083335090004,"Beni","Chuquisaca","Cochabamba","La Paz","Oruro","Pando","Potosi","Santa Cruz","Tarija",54.351378154373883,40.758291698607088,31.521004180824679,27.752249537488179,32.557132141392103,49.997549343063163,46.874939894638693,17.26904950868073,20.248646227010578]
["BOL",2003,"BOL_2003_DHS",35,"Water source on premises","Yes","",33.39900381738429,64.105289360076341,84.952533875378876,96.108279378893229,99.206870967178816,73.515047064429609,88.845084683065906,96.299691770122735,98.556823590798942,99.589731073598799,22.72724289939017,35.325116638468138,51.455479054802083,59.719162570673788,80.537536081053432,"Beni","Chuquisaca","Cochabamba","La Paz","Oruro","Pando","Potosi","Santa Cruz","Tarija",59.690344676031827,59.715723875450379,79.315860266357845,76.100327177189087,72.157883820208568,54.383828166538997,53.63609369656367,87.250818350217898,81.201801746334439]
["BOL",2003,"BOL_2003_DHS",36,"Water source on premises","No","",66.600996182615802,35.894710639923623,15.04746612462098,3.8917206211067161,0.79312903282121594,26.484952935570359,11.154915316934259,3.700308229877213,1.4431764092010131,0.41026892640120438,77.272757100609866,64.674883361531968,48.544520945197966,40.280837429326269,19.462463918946639,"Beni","Chuquisaca","Cochabamba","La Paz","Oruro","Pando","Potosi","Santa Cruz","Tarija",40.309655323968421,40.284276124549493,20.684139733642041,23.899672822811429,27.842116179791741,45.61617183346123,46.363906303436629,12.749181649781971,18.79819825366566]
["BOL",2003,"BOL_2003_DHS",41,"Water point at more than 30 minutes","Yes","",5.0700915144913639,2.4018042505332242,1.095328122612039,0.25290839165874468,0.1143938757479845,1.4916890781556951,0.62208623679666897,0.3211223708741372,0.22268012752691099,0,5.7085832172103164,5.5017981800347826,3.7034644906816649,3.2884059108768788,0.90079860580098092,"Beni","Chuquisaca","Cochabamba","La Paz","Oruro","Pando","Potosi","Santa Cruz","Tarija",0.750908136910858,3.8780552363747609,1.21528965753455,1.6929599445176,2.0489415946758358,0.745720716574509,5.5163195687177584,0.52893642488615433,1.638391199619903]
["BOL",2003,"BOL_2003_DHS",42,"Water point at more than 30 minutes","No","w_30min",94.929908485508648,97.598195749466782,98.904671877387912,99.747091608341208,99.885606124252007,98.50831092184427,99.377913763203324,99.678877629125864,99.777319872473086,100,94.291416782789611,94.498201819965217,96.296535509318346,96.711594089123068,99.099201394198971,"Beni","Chuquisaca","Cochabamba","La Paz","Oruro","Pando","Potosi","Santa Cruz","Tarija",99.249091863089134,96.121944763625294,98.784710342465459,98.307040055482446,97.951058405324247,99.25427928342549,94.483680431282266,99.471063575113774,98.361608800380068]
["BOL",2003,"BOL_2003_DHS",58,"Source of drinking water","Piped into dwelling","",1.158662152222111,3.1817141383116998,10.757160203685739,26.086452546463491,69.278324642443266,8.0404426635211195,11.43339815413087,23.75110252230029,43.370324976772039,82.468392727837696,0.34562864166732621,1.328504560727336,1.168503091191651,1.8800902558833319,10.79585886465402,"Beni","Chuquisaca","Cochabamba","La Paz","Oruro","Pando","Potosi","Santa Cruz","Tarija",19.99719443431826,20.340946362215139,21.829278579234071,16.775284148749211,18.066672175468039,10.222579264472371,7.6395752250085343,34.617076772496581,26.349768311470829]
["BOL",2003,"BOL_2003_DHS",59,"Source of drinking water","Piped into yard/spot","",28.1534523103279,53.267436742483,67.372223357855972,65.294492682846638,27.946903836118171,56.086079216266043,71.248945075121028,67.700629786470472,52.381766976038961,15.70155053817119,20.40329452975082,30.33178570669811,43.731466160456797,50.999941181854147,62.373307784445927,"Beni","Chuquisaca","Cochabamba","La Paz","Oruro","Pando","Potosi","Santa Cruz","Tarija",25.966948975272569,38.921527909001327,46.702901930519353,55.479400290279607,49.408258775566019,39.779871392464742,45.569718301055737,48.277114034151381,53.401585461518678]
["BOL",2003,"BOL_2003_DHS",60,"Source of drinking water","Pipedoutside dwelling","",13.818488212992239,8.4701555798621033,6.5305167279275267,1.2433150377222499,0.176447814574444,8.4351033209317734,5.9355409766519571,1.025036895023232,0.3419966782106123,0.1155699604869367,17.373812669091311,13.09506851251947,9.3254472771423043,8.429663914760182,5.3234740399915577,"Beni","Chuquisaca","Cochabamba","La Paz","Oruro","Pando","Potosi","Santa Cruz","Tarija",4.5026431103072291,5.4094093033952024,5.2909712834424267,6.9778203059977217,8.2400346291331505,1.9302265391578179,15.62429031614003,3.011860867240757,1.773806503643228]
["BOL",2003,"BOL_2003_DHS",61,"Source of drinking water","Well with electrical pump","",4.2392842080677404,3.63829344245215,3.1390257931047691,1.3057376429953489,0.68726373331240098,1.33913797340633,1.2427865526417421,0.47010821158125721,1.0562099482358871,0.36884780230256509,3.405978604216982,6.0057881624477849,3.3510248437613019,4.9330917066242641,9.1378251768075582,"Beni","Chuquisaca","Cochabamba","La Paz","Oruro","Pando","Potosi","Santa Cruz","Tarija",4.4743927177118517,0.66152637072042164,1.535553680420167,1.7215853924596931,3.1063034777424621,0.058711561177987599,2.8063314455648638,4.981136047339068,0.42910789157381851]
["BOL",2003,"BOL_2003_DHS",62,"Source of drinking water","Well without electrical pump","",17.591668309095379,17.13988776028522,5.8085520293861839,2.412976634978012,0.31342535669417659,16.051533429281601,4.8582531437572776,2.3010854397992322,0.57636217873157125,0.1035907981769546,17.874206941093451,16.926613392285741,16.20780277498837,16.237816141488288,7.4117005082558309,"Beni","Chuquisaca","Cochabamba","La Paz","Oruro","Pando","Potosi","Santa Cruz","Tarija",29.799523675968761,5.7644074435093522,4.9362079649840451,11.44862649846495,18.267892341579149,12.93160513416856,8.2668299312533886,5.0145349020825076,2.9846416136480589]
["BOL",2003,"BOL_2003_DHS",63,"Source of drinking water","River/ stream","",29.826903063003169,10.13510518263333,1.633900658198002,0.37326049153878099,0,2.9804998073800459,0.62590846555334645,0.52106813580482558,0,0,34.772411719410258,27.955111904466939,22.408940966718319,14.848096687146359,3.3183719416289592,"Beni","Chuquisaca","Cochabamba","La Paz","Oruro","Pando","Potosi","Santa Cruz","Tarija",8.9966886519588432,25.481195648607791,8.5495851048004567,6.2613376997942671,1.3440368130290841,28.526278619578719,18.347220109218458,2.348066085552734,11.17075580605681]
["BOL",2003,"BOL_2003_DHS",64,"Source of drinking water","Pond/ lake","",3.2531170418387729,0.82295623770975834,0.019240057488989899,0.0204629346693448,0,0.064420094525299607,0.031019560393620201,0.018823590621131901,0.0143261601721582,0,4.1515566414056826,2.6136135828824321,2.978536097413174,0.83450329088208597,0,"Beni","Chuquisaca","Cochabamba","La Paz","Oruro","Pando","Potosi","Santa Cruz","Tarija",1.847523820563999,1.6284827824279571,1.990454795025169,0.48429444296263552,0,4.5347505157607504,0.27033103763274269,0.33492350888474098,0.059282806642766299]
["BOL",2003,"BOL_2003_DHS",65,"Source of drinking water","Wather from neighbors","",0.7813468553793661,1.0898919204500661,1.029378196954184,0.40053501276286629,0,2.687943630623006,0.70670244458385645,0.58844410882898956,0.042656416010053398,0,0.36904513362854041,0.45712393596976308,0.31510428886953767,0.46603273462136868,0.52154640623813153,"Beni","Chuquisaca","Cochabamba","La Paz","Oruro","Pando","Potosi","Santa Cruz","Tarija",1.313445619587041,0.70655876368590831,0.42946658724331011,0.22461604631809731,0.75565290670830432,0.29623828706278349,0.55172024984012502,0.95854950990125254,2.0758735260127512]
["BOL",2003,"BOL_2003_DHS",66,"Source of drinking water","Tanker truck","",0.15334075363770491,1.3924730462147299,3.357487447285473,2.7379640161364782,1.4951344665354649,3.5609442290068198,3.6985797749084801,3.5161568642500809,2.0131275725766349,1.18793708026422,0,0.27243617928593872,0.12339099421163879,0.40926390710692112,0.49361239339879281,"Beni","Chuquisaca","Cochabamba","La Paz","Oruro","Pando","Potosi","Santa Cruz","Tarija",2.2708077222386671,0.31349157397327548,7.9239780348384956,0.40962034618473381,0.20852247849305189,0,0.35699930022938658,0.092226270067216204,1.3802479146262909]
["BOL",2003,"BOL_2003_DHS",67,"Source of drinking water","Other","",1.0237370934357719,0.862085949597864,0.35251552811301817,0.12480299988686661,0.1025001503220197,0.75389563505797863,0.2188658522580921,0.10754444532060591,0.20322909325177879,0.0541110927603808,1.3040651197356949,1.013954062716546,0.38978350524682992,0.96150017963306667,0.6243028845792391,"Beni","Chuquisaca","Cochabamba","La Paz","Oruro","Pando","Potosi","Santa Cruz","Tarija",0.83083127207292085,0.77245384246376003,0.811602039492064,0.21741482878937429,0.60262640228117237,1.7197386861565229,0.56698408405691103,0.36451200228346281,0.37493016480686842]
["BOL",2003,"BOL_2003_DHS",122,"Sanitation","Improved","s_imp",15.463111926071511,28.06842655006831,50.018102471343241,74.456753476267522,90.736857210136691,37.115214385695417,57.885634016372713,75.886748105453506,81.872076789808034,94.269754909259845,10.60400241755042,16.653391190167291,20.91308995555643,25.37419804112449,42.145832955785423,"Beni","Chuquisaca","Cochabamba","La Paz","Oruro","Pando","Potosi","Santa Cruz","Tarija",55.583830297598347,40.079986766729142,56.565260429614987,46.58907809038331,44.354450215577799,48.044073912454479,32.20397766613803,63.226996825710494,62.293940613675289]
["BOL",2003,"BOL_2003_DHS",123,"Sanitation","Not Improved","",84.536888073928495,71.93157344993169,49.981897528656759,25.543246523732481,9.2631427898633092,62.884785614304583,42.114365983627287,24.11325189454649,18.12792321019197,5.730245090740155,89.395997582449581,83.346608809832702,79.08691004444357,74.625801958875513,57.854167044214577,"Beni","Chuquisaca","Cochabamba","La Paz","Oruro","Pando","Potosi","Santa Cruz","Tarija",44.416169702401653,59.920013233270858,43.434739570385013,53.41092190961669,55.645549784422201,51.955926087545521,67.79602233386197,36.773003174289506,37.706059386324711]
["BOL",2003,"BOL_2003_DHS",124,"Sanitation ladder","Basic","s_bas",4.4216600487773032,11.547837452446259,19.188758485688279,42.899897667275809,81.559015348971656,13.66408921366566,21.072229863676469,41.515224739359432,59.632059474034222,90.073725055123589,2.1211569863078412,5.2084739450271869,7.7498560232265223,10.668377212198999,24.99010864434403,"Beni","Chuquisaca","Cochabamba","La Paz","Oruro","Pando","Potosi","Santa Cruz","Tarija",41.291187869933133,13.655788709901019,32.360922877414268,19.054985871100431,15.353195731778371,29.231480610974462,7.8262386709538987,45.291869791330903,33.318387047385357]
["BOL",2003,"BOL_2003_DHS",125,"Sanitation ladder","Limited","s_lim",11.041451877294209,16.520589097622011,30.829343985654859,31.55685580899172,9.1778418611649037,23.451125172029752,36.813404152696393,34.371523366094337,22.240017315773638,4.1960298541363183,8.4828454312425841,11.44491724514012,13.16323393232992,14.7058208289255,17.1557243114414,"Beni","Chuquisaca","Cochabamba","La Paz","Oruro","Pando","Potosi","Santa Cruz","Tarija",14.292642427665349,26.424198056828121,24.20433755220056,27.53409221928305,29.00125448379956,18.81259330148011,24.377738995184188,17.93512703437948,28.975553566289971]
["BOL",2003,"BOL_2003_DHS",126,"Sanitation ladder","Unimproved","s_unimp",13.599827550522759,19.834495169321599,15.75120826231178,14.007028256825439,7.9167970828244023,17.66721395281866,14.016617918725069,13.189680435686199,11.76241789646549,5.3194048331904904,9.6767223689517436,13.87246525918439,18.221483147867119,19.741906823285259,24.473172324442942,"Beni","Chuquisaca","Cochabamba","La Paz","Oruro","Pando","Potosi","Santa Cruz","Tarija",31.403331135050021,5.8353826236735236,15.20528112814806,9.0390969966887695,4.5292850466853167,27.163620035903161,4.2284433933928511,24.749046951138869,12.27017598198519]
["BOL",2003,"BOL_2003_DHS",127,"Sanitation ladder","Open defecation","s_od",70.937060523405719,52.097078280610127,34.230689266345081,11.53621826690704,1.3463457070390381,45.217571661485927,28.09774806490206,10.923571458860041,6.3655053137266426,0.41084025754960402,79.719275213497838,69.474143550648293,60.865426896576437,54.883895135590237,33.380994719771643,"Beni","Chuquisaca","Cochabamba","La Paz","Oruro","Pando","Potosi","Santa Cruz","Tarija",13.012838567351499,54.08463060959734,28.2294584422371,44.37182491292775,51.116264737736749,24.792306051642282,63.567578940469062,12.02395622315075,25.435883404339471]
["BOL",2003,"BOL_2003_DHS",128,"Shared among Improved Sanitation","Yes","s_shared",71.405108687584601,58.858265774722597,61.636372557951077,42.382798518136042,10.114789230477779,63.184668498285824,63.596788353883937,45.29318257033637,27.164349785423092,4.4510881121683648,79.996638035491557,68.724244296246241,62.942558752933387,57.955805362169357,40.705624039840941,"Beni","Chuquisaca","Cochabamba","La Paz","Oruro","Pando","Potosi","Santa Cruz","Tarija",25.713669517091379,65.928659634097372,42.790110694033459,59.099886385102138,65.385219167058878,39.1569485463707,75.697912996682376,28.366248493217022,46.514240840832301]
["BOL",2003,"BOL_2003_DHS",129,"Shared among Improved Sanitation","No","",28.594891312415481,41.141734225277233,38.363627442048717,57.617201481863958,89.885210769522089,36.81533150171412,36.403211646116333,54.706817429663971,72.835650214576702,95.548911887831707,20.003361964508478,31.275755703753831,37.057441247066663,42.044194637830671,59.294375960159073,"Beni","Chuquisaca","Cochabamba","La Paz","Oruro","Pando","Potosi","Santa Cruz","Tarija",74.286330482908838,34.07134036590265,57.209889305966279,40.900113614898231,34.614780832941427,60.843051453629492,24.302087003317801,71.633751506782801,53.485759159167777]
["BOL",2003,"BOL_2003_DHS",135,"Sanitation type","Sewer connection","s_sew",0.25492144846521059,4.9361850754278809,27.70653833887177,47.826470903005671,66.751367089007047,14.498718372871259,37.73430810939486,51.126373539474692,53.15323049060683,74.663825647230183,0.030163589615099001,0.47417900524475332,0.77248053852688392,2.2816088487364952,8.2803538504373879,"Beni","Chuquisaca","Cochabamba","La Paz","Oruro","Pando","Potosi","Santa Cruz","Tarija",5.0465499914755254,33.714487781815542,34.359468907221668,34.246463035419403,37.799951773718391,2.8068863347707178,27.068842833696529,19.678204106480219,45.471762486007833]
["BOL",2003,"BOL_2003_DHS",136,"Sanitation type","Septic tank connection","s_sep",1.6083629270835269,3.2977463053188791,6.5603558701597873,12.623254316436419,16.068693038305369,4.9492820600055127,6.1347079882526181,11.57069413029237,16.956428402735881,14.286524428839121,0.89711645898358527,2.306746925738131,1.9191262691624209,3.3506823691027261,9.3923067809050984,"Beni","Chuquisaca","Cochabamba","La Paz","Oruro","Pando","Potosi","Santa Cruz","Tarija",19.133949171072679,0.53011636124007255,7.0005103942454117,3.3035180582749728,2.0252133951739619,18.073567541780509,0.90669143904859051,18.799745768091501,4.5520021456822217]
["BOL",2003,"BOL_2003_DHS",137,"Sanitation type","Improved latrines","s_lat",13.59982755052277,19.834495169321549,15.75120826231168,14.007028256825439,7.9167970828242744,17.66721395281866,14.016617918725229,13.18968043568645,11.762417896465321,5.3194048331905464,9.6767223689517365,13.872465259184411,18.221483147867129,19.741906823285269,24.473172324442942,"Beni","Chuquisaca","Cochabamba","La Paz","Oruro","Pando","Potosi","Santa Cruz","Tarija",31.403331135050141,5.8353826236735236,15.205281128147909,9.0390969966889401,4.5292850466854446,27.16362003590325,4.228443393392908,24.749046951138769,12.27017598198524]
["BOL",2003,"BOL_2003_DHS",138,"Sanitation type","Unimproved facilities","",13.59982755052277,19.834495169321549,15.75120826231168,14.007028256825439,7.9167970828242744,17.66721395281866,14.016617918725229,13.18968043568645,11.762417896465321,5.3194048331905464,9.6767223689517365,13.872465259184411,18.221483147867129,19.741906823285269,24.473172324442942,"Beni","Chuquisaca","Cochabamba","La Paz","Oruro","Pando","Potosi","Santa Cruz","Tarija",31.403331135050141,5.8353826236735236,15.205281128147909,9.0390969966889401,4.5292850466854446,27.16362003590325,4.228443393392908,24.749046951138769,12.27017598198524]
["BOL",2003,"BOL_2003_DHS",139,"Sanitation type","Open defecation","",70.937060523405719,52.097078280610127,34.230689266345081,11.53621826690704,1.3463457070390381,45.217571661485927,28.09774806490206,10.923571458860041,6.3655053137266426,0.41084025754960402,79.719275213497838,69.474143550648293,60.865426896576437,54.883895135590237,33.380994719771643,"Beni","Chuquisaca","Cochabamba","La Paz","Oruro","Pando","Potosi","Santa Cruz","Tarija",13.012838567351499,54.08463060959734,28.2294584422371,44.37182491292775,51.116264737736749,24.792306051642282,63.567578940469062,12.02395622315075,25.435883404339471]
["BOL",2003,"BOL_2003_DHS",151,"Shared among all sanitation facilities","Yes","",71.405108687584601,58.858265774722597,61.636372557951077,42.382798518136042,10.114789230477779,63.184668498285824,63.596788353883937,45.29318257033637,27.164349785423092,4.4510881121683648,79.996638035491557,68.724244296246241,62.942558752933387,57.955805362169357,40.705624039840941,"Beni","Chuquisaca","Cochabamba","La Paz","Oruro","Pando","Potosi","Santa Cruz","Tarija",25.713669517091379,65.928659634097372,42.790110694033459,59.099886385102138,65.385219167058878,39.1569485463707,75.697912996682376,28.366248493217022,46.514240840832301]
["BOL",2003,"BOL_2003_DHS",152,"Shared among all sanitation facilities","No","",28.594891312415481,41.141734225277233,38.363627442048717,57.617201481863958,89.885210769522089,36.81533150171412,36.403211646116333,54.706817429663971,72.835650214576702,95.548911887831707,20.003361964508478,31.275755703753831,37.057441247066663,42.044194637830671,59.294375960159073,"Beni","Chuquisaca","Cochabamba","La Paz","Oruro","Pando","Potosi","Santa Cruz","Tarija",74.286330482908838,34.07134036590265,57.209889305966279,40.900113614898231,34.614780832941427,60.843051453629492,24.302087003317801,71.633751506782801,53.485759159167777]
["BOL",2003,"BOL_2003_DHS",153,"Type of toilet facility","Flush toilet","",0.25492144846521059,4.9361850754278809,27.70653833887177,47.826470903005671,66.751367089007047,14.498718372871259,37.73430810939486,51.126373539474692,53.15323049060683,74.663825647230183,0.030163589615099001,0.47417900524475332,0.77248053852688392,2.2816088487364952,8.2803538504373879,"Beni","Chuquisaca","Cochabamba","La Paz","Oruro","Pando","Potosi","Santa Cruz","Tarija",5.0465499914755254,33.714487781815542,34.359468907221668,34.246463035419403,37.799951773718391,2.8068863347707178,27.068842833696529,19.678204106480219,45.471762486007833,41.774477999999988,808.12165500000026,4537.8347449999983,7818.0966339999959,10923.756316999959,1467.3209190000009,3819.3807959999981,5156.7284439999894,5394.4434759999958,7552.1164179999987,1.890134,29.567899000000001,48.325369999999992,142.67655800000011,517.13381499999946,159.35966499999989,1975.4520649999999,5249.8615630000058,7571.7450169999956,1556.9513680000009,12.255933000000001,1941.068503,3907.0382720000039,1755.851443]
["BOL",2003,"BOL_2003_DHS",154,"Type of toilet facility","Camara s‚ptica","",1.6083629270835269,3.2977463053188791,6.5603558701597873,12.623254316436419,16.068693038305369,4.9492820600055127,6.1347079882526181,11.57069413029237,16.956428402735881,14.286524428839121,0.89711645898358527,2.306746925738131,1.9191262691624209,3.3506823691027261,9.3923067809050984,"Beni","Chuquisaca","Cochabamba","La Paz","Oruro","Pando","Potosi","Santa Cruz","Tarija",19.133949171072679,0.53011636124007255,7.0005103942454117,3.3035180582749728,2.0252133951739619,18.073567541780509,0.90669143904859051,18.799745768091501,4.5520021456822217,263.56558899999999,539.88660500000015,1074.468793,2063.4978960000021,2629.6163620000052,500.88462399999969,620.94118200000003,1167.047913000001,1720.883072000001,1445.0571580000001,56.215800000000002,143.83947699999999,120.058024,209.52926600000001,586.57872899999995,604.21074499999963,31.061408,1069.623938,730.39357000000041,83.417005000000017,78.916067999999953,65.017562999999996,3732.6234560000021,175.77149199999999]
["BOL",2003,"BOL_2003_DHS",155,"Type of toilet facility","Pit toilet","",27.174394403311371,39.606725741453268,31.471107898755822,27.980771210961819,15.83153523372498,35.266222196967568,27.90499804946575,26.37366730230816,23.519744072828679,10.637961240741779,19.353444737903509,27.67991427609736,36.431663954315049,39.45625998507807,48.910465194016091,"Beni","Chuquisaca","Cochabamba","La Paz","Oruro","Pando","Potosi","Santa Cruz","Tarija",62.800574345591293,11.62477146381568,30.385231108186169,17.99614793060756,8.6496159711574858,54.327240071806749,8.4316572035502713,49.492106827785022,24.50191247080987,4453.1213359999992,6484.1678880000027,5154.4038140000057,4573.9601750000074,2590.8058600000031,3569.0648119999992,2824.4804000000008,2660.1112289999978,2386.9843620000029,1076.0113220000001,1212.740406000001,1726.008323,2279.1171460000041,2467.3306160000029,3054.610456999997,1983.112920000003,681.13681400000007,4642.6287120000025,3978.8705559999999,356.27112700000009,237.2133870000003,604.62223399999993,9826.4838850000051,946.11943799999983]
["BOL",2003,"BOL_2003_DHS",156,"Type of toilet facility","No facility/ bush/ field","",70.962321221140002,52.159342877799887,34.261997892212612,11.56950356959611,1.3484046389625099,45.285777370155657,28.225985852887181,10.92926502792487,6.3705970338283988,0.41168868318899349,79.719275213497838,69.539159792919861,60.876729237995697,54.911448797082741,33.416874174641443,"Beni","Chuquisaca","Cochabamba","La Paz","Oruro","Pando","Potosi","Santa Cruz","Tarija",13.01892649186069,54.130624393128812,28.254789590346451,44.453870975698308,51.525218859950549,24.792306051642282,63.592808523704768,12.02994329764307,25.47432289750013,11628.734829999999,8539.2046379999956,5611.501608999999,1891.2433889999991,220.6643,4583.0787770000024,2856.9700550000039,1102.351838000001,646.54255799999987,41.641595999999993,4995.4303999999966,4336.1828140000007,3808.3683899999969,3433.7947600000011,2086.9875779999988,411.11091099999982,3171.7063130000001,4317.1136970000061,9828.558812000023,2122.2847179999981,108.252635,4560.1505170000091,2388.502966,983.66819699999951]
["BOL",2008,"BOL_2008_DHS",16,"Water","Improved","w_imp",59.721983330854677,81.881869581391356,95.863937286089111,98.935363258876151,99.550930093031866,88.358404251625316,97.869508782749861,98.996265833872414,99.527483882559039,99.526733195941745,52.27874960998151,64.598412926024395,72.404979138692582,83.044407282940554,93.550100265090705,"Beni","Chuquisaca","Cochabamba","La Paz","Oruro","Pando","Potosí","Santa Cruz","Tarija",60.144377201810059,81.416743131189264,87.800772057989846,86.001311909396875,84.558333708745607,54.693463955055464,85.418161850838416,95.561543006513844,92.828205502569233]
["BOL",2008,"BOL_2008_DHS",17,"Water","Not Improved","",40.27801666914543,18.11813041860848,4.1360627139108788,1.064636741123772,0.44906990696813859,11.64159574837484,2.130491217250206,1.0037341661275769,0.47251611744100558,0.47326680405828347,47.721250390018561,35.401587073975243,27.595020861307091,16.955592717059449,6.449899734909331,"Beni","Chuquisaca","Cochabamba","La Paz","Oruro","Pando","Potosí","Santa Cruz","Tarija",39.855622798189728,18.58325686881059,12.1992279420102,13.998688090603279,15.44166629125435,45.306536044944643,14.58183814916163,4.4384569934861204,7.171794497430807]
["BOL",2008,"BOL_2008_DHS",18,"Water ladder","Basic","w_bas",59.61805868220528,81.854429676184324,95.863937286089111,98.844437073791767,99.550930093031852,88.287103089402862,97.869508782749847,98.842529808358663,99.527483882559039,99.526733195941745,52.244233493529919,64.426758960277795,72.401456303510329,83.03559458451582,93.55010026509072,"Beni","Chuquisaca","Cochabamba","La Paz","Oruro","Pando","Potosí","Santa Cruz","Tarija",59.633391143719308,81.262851949967214,87.800772057989846,86.001311909396875,84.540322744198889,54.693463955055464,85.41816185083843,95.481919373787321,92.828205502569233]
["BOL",2008,"BOL_2008_DHS",19,"Water ladder","Limited","w_lim",0.1039246486493888,0.027439905207026799,0,0.090926185084390196,0,0.071301162222444897,0,0.15373602551374141,0,0,0.034516116451594803,0.1716539657466008,0.0035228351822474001,0.0088126984247411007,0,"Beni","Chuquisaca","Cochabamba","La Paz","Oruro","Pando","Potosí","Santa Cruz","Tarija",0.51098605809075281,0.15389118122205389,0,0,0.018010964546731099,0,0,0.079623632726539703,0]
["BOL",2008,"BOL_2008_DHS",20,"Water ladder","Unimproved","w_unimp",20.14713823891049,13.339935304963261,3.583435656810213,0.97459035552467743,0.40362107893483301,10.8456374816208,1.703988739701604,0.87514023341463609,0.42533683554068519,0.44370676269012821,18.547809750007819,18.87617012380667,18.182435327402281,12.28563803846937,5.5866165181920433,"Beni","Chuquisaca","Cochabamba","La Paz","Oruro","Pando","Potosí","Santa Cruz","Tarija",34.285348270932687,4.6254194557184967,5.8605327694584979,10.004892138883729,11.18268240697366,35.02007715237572,6.1891625587744663,3.1077798165770729,1.67698799171014]
["BOL",2008,"BOL_2008_DHS",21,"Water ladder","Surface water","w_sur",20.130878430234841,4.7781951136453964,0.55262705710067517,0.090046385599165904,0.045448828033315299,0.7959582667538897,0.42650247754854942,0.12859393271295991,0.047179281900275399,0.029560041368127,29.173440640010671,16.525416950168939,9.4125855339051441,4.669954678590071,0.86328321671723696,"Beni","Chuquisaca","Cochabamba","La Paz","Oruro","Pando","Potosí","Santa Cruz","Tarija",5.570274527257256,13.957837413092239,6.338695172551656,3.9937959517193979,4.2589838842807186,10.286458892568829,8.3926755903871033,1.3306771769090671,5.4948065057206268]
["BOL",2008,"BOL_2008_DHS",22,"Improved water point at more than 30 minutes","Yes","",0.17401406124383911,0.033511576307806802,0,0.091904635601802995,0,0.080695393750429001,0,0.15529477220052809,0,0,0.066023224941486894,0.26572474147804892,0.0048654598401297001,0.010612031216883,0,"Beni","Chuquisaca","Cochabamba","La Paz","Oruro","Pando","Potosí","Santa Cruz","Tarija",0.84959905125657298,0.18901662643773939,0,0,0.021300046674013799,0,0,0.083321836610687802,0]
["BOL",2008,"BOL_2008_DHS",23,"Improved water point at more than 30 minutes","No","",99.825985938756148,99.966488423692184,100,99.908095364398193,100,99.919304606249554,100,99.844705227799466,100,100,99.933976775058511,99.734275258521947,99.995134540159867,99.98938796878312,100,"Beni","Chuquisaca","Cochabamba","La Paz","Oruro","Pando","Potosí","Santa Cruz","Tarija",99.150400948743439,99.810983373562252,100,100,99.978699953326,100,100,99.916678163389321,100]
["BOL",2008,"BOL_2008_DHS",24,"Manually calculated ratios","Improved wells","",14.9324252454903,26.994571538368401,28.504535038512959,28.622892623057179,75.106204762022813,7.4804070747048481,15.655002362164421,11.85855354007408,54.822644131297793,78.097325126713983,15.534195877353151,17.649528107463489,19.59357624134935,36.643148763466733,40.832248269761159,"Beni","Chuquisaca","Cochabamba","La Paz","Oruro","Pando","Potosí","Santa Cruz","Tarija",7.0934122196796068,19.106040924857059,11.78521035110469,22.747934404277821,26.420087295963,5.8532175617337563,4.5597625699282034,47.196510732704709,25.358501783900291]
["BOL",2008,"BOL_2008_DHS",29,"Piped water","Yes","w_pip",56.054552162980301,76.652033827152195,91.655786022541605,96.221751018068545,97.955813230983296,83.134008147034336,94.449424611711436,96.061468189514414,97.323933968132238,97.927867831107946,49.121619383494043,60.591542224302522,68.243946202212925,77.282044685725666,90.273864934422548,"Beni","Chuquisaca","Cochabamba","La Paz","Oruro","Pando","Potosí","Santa Cruz","Tarija",56.720872417453187,78.617746115504531,79.25419112226632,83.490207927026134,80.868589265534524,51.860117568300822,85.16626641586079,92.880597866900516,91.691377019919116]
["BOL",2008,"BOL_2008_DHS",30,"Piped water","No","",43.94544783701982,23.34796617284757,8.3442139774583293,3.77824898193139,2.0441867690167572,16.86599185296571,5.5505753882886362,3.9385318104856721,2.6760660318678311,2.0721321688920802,50.878380616506021,39.408457775697109,31.756053797786741,22.71795531427437,9.7261350655775463,"Beni","Chuquisaca","Cochabamba","La Paz","Oruro","Pando","Potosí","Santa Cruz","Tarija",43.279127582546629,21.382253884495281,20.745808877733879,16.50979207297399,19.131410734465511,48.139882431699263,14.83373358413926,7.1194021330993369,8.3086229800809299]
["BOL",2008,"BOL_2008_DHS",31,"Piped water on premises","Yes","w_pop",42.792608445257763,68.70083519725749,86.813609709679085,95.066553302695638,97.815496581800204,76.150563780040244,91.509861407302878,95.163746719757938,96.805150822881942,97.882046403176176,34.865243018419193,47.943368121652512,58.291998886878602,69.395855816438996,84.512538298955903,"Beni","Chuquisaca","Cochabamba","La Paz","Oruro","Pando","Potosí","Santa Cruz","Tarija",53.220529639386719,70.483580928549429,75.697950091463071,78.35806474293814,75.008629904834933,51.312035546143562,68.711516499976582,91.001006629064335,87.007225758949289]
["BOL",2008,"BOL_2008_DHS",32,"Piped water on premises","No","",57.207391554742387,31.299164802742109,13.186390290320849,4.9334466973042979,2.1845034181998599,23.84943621995977,8.4901385926971518,4.8362532802421443,3.1948491771181562,2.1179535968238521,65.13475698158085,52.056631878347133,41.708001113120993,30.6041441835611,15.487461701044261,"Beni","Chuquisaca","Cochabamba","La Paz","Oruro","Pando","Potosí","Santa Cruz","Tarija",46.779470360613132,29.516419071450319,24.302049908537128,21.641935257062041,24.991370095165092,48.68796445385653,31.28848350002362,8.998993370935457,12.99277424105092]
["BOL",2008,"BOL_2008_DHS",35,"Water source on premises","Yes","",61.994000210066247,82.839924473333298,96.104389858044797,99.350532919633409,99.606185610328112,91.934690979046579,98.091001384178966,99.326632387300435,99.527411992172219,99.623977817161062,53.08926281020895,66.759760746987496,74.253729372235995,81.577786107610649,93.72186403928022,"Beni","Chuquisaca","Cochabamba","La Paz","Oruro","Pando","Potosí","Santa Cruz","Tarija",76.569898553091704,80.200796892750375,89.472469727785025,85.875192803434501,82.443991971139624,63.620282828989993,86.489433352420164,95.477227881794462,93.036011221085758]
["BOL",2008,"BOL_2008_DHS",36,"Water source on premises","No","",38.005999789933881,17.160075526666461,3.8956101419550979,0.64946708036652034,0.39381438967188892,8.0653090209535421,1.9089986158210841,0.67336761269956513,0.47258800782778337,0.3760221828389621,46.910737189791121,33.240239253012113,25.746270627763771,18.422213892389369,6.2781359607198048,"Beni","Chuquisaca","Cochabamba","La Paz","Oruro","Pando","Potosí","Santa Cruz","Tarija",23.430101446908111,19.79920310724944,10.52753027221504,14.124807196565691,17.556008028860411,36.379717171010043,13.51056664757987,4.5227721182055234,6.9639887789142536]
["BOL",2008,"BOL_2008_DHS",37,"Improved Water source on premises","Yes","w_premises",95.425560271089822,95.373810251668118,98.594863884218526,99.620707525552234,99.725797806966213,97.830561083044287,99.367333072068192,99.527943849615212,99.756529815474522,99.669710733896181,94.950405681341593,95.184709981198125,95.300163142320855,94.433007306524786,97.963085226490477,"Beni","Chuquisaca","Cochabamba","La Paz","Oruro","Pando","Potosí","Santa Cruz","Tarija",96.909304433475469,97.605523130832239,98.346256195098334,97.364085937128522,95.966051446016991,98.303147104205365,99.734991166659825,98.264544541497273,99.71110802365601]
["BOL",2008,"BOL_2008_DHS",38,"Improved Water source on premises","No","",4.5744397289103071,4.6261897483318846,1.405136115781475,0.37929247444773961,0.27420219303382359,2.169438916955658,0.63266692793182722,0.47205615038480542,0.24347018452547309,0.33028926610379572,5.0495943186583698,4.8152900188019192,4.6998368576791671,5.5669926934752398,2.0369147735095789,"Beni","Chuquisaca","Cochabamba","La Paz","Oruro","Pando","Potosí","Santa Cruz","Tarija",3.0906955665245248,2.3944768691677329,1.653743804901658,2.6359140628714521,4.0339485539830644,1.6968528957946489,0.2650088333401826,1.7354554585026629,0.28889197634400471]
["BOL",2008,"BOL_2008_DHS",41,"Water point at more than 30 minutes","Yes","",2.8389019415340191,0.66236281464805913,0.14672364138505259,0.15203707830646851,0.0105043481414213,0.44347071660668658,0.13482474856581511,0.15373602551374141,0,0.0177360248208762,4.7561378508492949,1.5471874239732919,1.0084966921413241,0.87242054771298794,0.059292639590468502,"Beni","Chuquisaca","Cochabamba","La Paz","Oruro","Pando","Potosí","Santa Cruz","Tarija",0.86464768837137174,3.01212981300873,0.25929660072374427,0.75526016470576385,0.12982152088060239,0.24282915653365139,1.93740055344595,0.18703936857624021,0.51237886821508416]
["BOL",2008,"BOL_2008_DHS",42,"Water point at more than 30 minutes","No","w_30min",97.161098058465939,99.337637185351895,99.853276358614949,99.847962921693508,99.989495651858576,99.556529283393331,99.865175251434181,99.846263974486263,100,99.982263975179123,95.243862149150701,98.452812576026631,98.991503307858636,99.127579452287037,99.940707360409533,"Beni","Chuquisaca","Cochabamba","La Paz","Oruro","Pando","Potosí","Santa Cruz","Tarija",99.135352311628651,96.987870186991287,99.740703399276256,99.244739835294226,99.870178479119403,99.757170843466341,98.062599446554074,99.812960631423763,99.487621131784934]
["BOL",2008,"BOL_2008_DHS",58,"Source of drinking water","Piped into dwelling","",0.97097205579463919,2.824483079854069,13.56664554394521,29.474386388129361,74.272000864068474,7.7136805000331528,18.62832994320053,27.6811926095735,53.77056556696558,84.42136877546919,0.99153279386345272,1.000171960319622,1.0462132969362661,3.0800902446376051,11.890532575166,"Beni","Chuquisaca","Cochabamba","La Paz","Oruro","Pando","Potosí","Santa Cruz","Tarija",22.091540529488221,18.807251792120169,23.983055212695039,28.158574458875229,14.56145884875345,15.688020905832699,10.132568682262191,29.613569530837928,30.055128535304849]
["BOL",2008,"BOL_2008_DHS",59,"Source of drinking water","Piped to yard/plot","",42.175521133416119,66.372037827681481,73.396294652955774,65.779847244826612,23.675101031418791,69.070757648359631,73.003012902431124,67.77170763672224,43.08870950085705,13.655576654210909,34.180703968083947,47.243490234619763,57.714075519702128,66.447675875146487,72.890808453990189,"Beni","Chuquisaca","Cochabamba","La Paz","Oruro","Pando","Potosí","Santa Cruz","Tarija",31.891176446911881,51.720466235500403,52.143045541858193,50.328890923946048,60.776194042756813,38.345062619596142,59.104458309621052,61.688170472841733,56.952097223644593]
["BOL",2008,"BOL_2008_DHS",60,"Source of drinking water","Public tap/standpipe","",13.37161685351324,8.0085675909720457,4.8505054740439517,1.157478305982381,0.1405054374352363,7.0415742897066567,2.943465541934096,0.90044918212359071,0.51907319950659303,0.045912665824982303,14.38190591744735,12.72739614877927,10.031896481570859,7.9011792394428086,5.7796512575921524,"Beni","Chuquisaca","Cochabamba","La Paz","Oruro","Pando","Potosí","Santa Cruz","Tarija",3.5504722480046031,8.1392588335885794,3.576355273706882,5.1406184139724527,5.8856638874066958,0.57714649919468153,16.580596996009501,1.8858027714970189,4.6841512609699762]
["BOL",2008,"BOL_2008_DHS",61,"Source of drinking water","Protected well","",3.1732105201905672,4.0013243581916589,1.129333400623902,0.21134608347169631,0.25427051953538371,0.67687326404583625,0.22328320261777679,0.061854110399443399,0.1920918520063456,0.213107648280696,3.0708380615229109,3.6564889311421149,3.9661042278405101,5.5934433075827847,3.1910062221042419,"Beni","Chuquisaca","Cochabamba","La Paz","Oruro","Pando","Potosí","Santa Cruz","Tarija",2.1457501071699898,0.86951128330165073,0.6100332315764857,2.515250823709859,3.705929390707364,1.9302391869581479,0.25382194891134752,2.420498562929406,0.2604083120573209]
["BOL",2008,"BOL_2008_DHS",62,"Source of drinking water","Unprotected well","",18.077259299833472,10.82137565208421,2.8326094940700148,0.52703520543215965,0.0842774344466483,8.3717421025522896,1.202990632750117,0.45974500529723389,0.15829593948049731,0.059766804122028297,16.697407979456891,17.0607161345043,16.27575554797026,9.6711927740179746,4.6239105589229306,"Beni","Chuquisaca","Cochabamba","La Paz","Oruro","Pando","Potosí","Santa Cruz","Tarija",28.10414995104076,3.6814644354324808,4.5662276360906224,8.5418006826320045,10.32100908679582,31.047164550387301,5.3127387002178912,2.7080554876820662,0.76649901187082237]
["BOL",2008,"BOL_2008_DHS",63,"Source of drinking water","River/dam/","",18.481583299402839,4.6933483066966222,0.5535776461611317,0.060817815402305603,0.0175308019299554,0.75075939032670957,0.42706866936248788,0.079212249127638898,0,0.0296189002038151,26.673629627104269,15.06272873108168,9.2928295862153778,4.5344944865858858,0.86596791954923069,"Beni","Chuquisaca","Cochabamba","La Paz","Oruro","Pando","Potosí","Santa Cruz","Tarija",4.3301211745585757,13.76632163937076,5.3156722684455868,3.9742612908135562,3.5832535281791631,9.013312765191781,8.0442123018391349,1.1353564584370399,5.4486822851761891]
["BOL",2008,"BOL_2008_DHS",64,"Source of drinking water","Lake/ pond/ stream","",1.815772730998511,0.11887522837704829,0,0.0294063397151701,0.027979174975256999,0.051737572094608802,0,0.049772414198784497,0.047205660073213501,0,2.756687574728848,1.5661954394422819,0.19537214035257711,0.1443370209014371,0,"Beni","Chuquisaca","Cochabamba","La Paz","Oruro","Pando","Potosí","Santa Cruz","Tarija",1.319926942648477,0.20025622709519039,1.0588748200162621,0.0261300222564767,0.69441225443226728,1.784452195186683,0.41265105942795188,0.19971824167269689,0.046124220544439098]
["BOL",2008,"BOL_2008_DHS",65,"Source of drinking water","Tanker truck","",0.52454943545727917,1.26624536016936,3.0860564201104861,2.507623368929905,1.342992483588354,4.5910105130773813,3.2013412085424759,2.8818608697907488,2.0126900782201971,1.3889413167593421,0.114091174612147,0.37547887099834359,0.22835644930271479,0.17987260938359001,0.095649586038539097,"Beni","Chuquisaca","Cochabamba","La Paz","Oruro","Pando","Potosí","Santa Cruz","Tarija",1.3267837269262031,1.9312384754609919,7.9848875111084263,0,0,1.053357942692108,0,0.26930636526045998,0.87642017059280464]
["BOL",2008,"BOL_2008_DHS",66,"Source of drinking water","Other","",1.409514671393129,1.893742595973082,0.58497736808959577,0.25205924811052322,0.18534225260199541,1.7318647198036361,0.37050789916122068,0.114205922767078,0.21136820289041119,0.18570723512935081,1.133202903180089,1.3073335491123119,1.249396750108881,2.4477144423014812,0.66247342663670228,"Beni","Chuquisaca","Cochabamba","La Paz","Oruro","Pando","Potosí","Santa Cruz","Tarija",5.2400788732511421,0.88423107812968671,0.76184850450294139,1.314473383794277,0.47207896096841478,0.56124333496053302,0.15895200171110541,0.079522108841345099,0.91048897983935662]
["BOL",2008,"BOL_2008_DHS",122,"Sanitation","Improved","s_imp",16.621551846963381,8.6513287371913705,47.083674547035287,71.427284834679625,89.140421660839991,30.714529557282489,63.326928154093487,73.152112960791698,82.03026758651319,93.519232898386804,1.3653961093813951,1.8782636295879349,3.1300464894385689,6.9219162550803492,24.161090926249418,"Beni","Chuquisaca","Cochabamba","La Paz","Oruro","Pando","Potosí","Santa Cruz","Tarija",29.430028191953689,36.144061293515662,44.680724123916562,48.874167017321163,40.730826278985177,29.71835588147788,28.965617488820651,46.704795768388948,51.020349286588903]
["BOL",2008,"BOL_2008_DHS",123,"Sanitation","Not Improved","",83.378448153036629,91.348671262808637,52.916325452964713,28.572715165320371,10.859578339160009,69.285470442717511,36.673071845906513,26.847887039208299,17.96973241348681,6.4807671016131962,98.634603890618607,98.121736370412066,96.86995351056143,93.078083744919653,75.838909073750585,"Beni","Chuquisaca","Cochabamba","La Paz","Oruro","Pando","Potosí","Santa Cruz","Tarija",70.569971808046304,63.855938706484338,55.319275876083438,51.125832982678837,59.269173721014823,70.281644118522124,71.034382511179359,53.295204231611052,48.979650713411097]
["BOL",2008,"BOL_2008_DHS",124,"Sanitation ladder","Basic","s_bas",15.46678908445589,7.1874940017864164,28.293922472623969,45.761102115512593,78.575126675056296,18.93848396603742,35.962065198236537,44.270895508667913,61.419814928211323,87.781106020090689,1.3005432957695251,1.751587080104134,2.8601388497218792,6.0848684870967418,21.066905121197038,"Beni","Chuquisaca","Cochabamba","La Paz","Oruro","Pando","Potosí","Santa Cruz","Tarija",22.445022468799049,27.511490800110568,35.857246049283738,36.236535312075951,29.943229251750282,22.915309634744371,20.377404149136758,34.384741255942181,40.382294647901773]
["BOL",2008,"BOL_2008_DHS",125,"Sanitation ladder","Limited","s_lim",1.14189310114107,1.453529226561898,18.74327533175482,25.511233638305342,10.46797848707244,11.768203325490891,27.270068681382948,28.78752356275449,20.418922062222968,5.6093262829733446,0.064852813611870896,0.12342284359298721,0.26990763971669551,0.81968464564726828,3.071606664985771,"Beni","Chuquisaca","Cochabamba","La Paz","Oruro","Pando","Potosí","Santa Cruz","Tarija",6.9850057231546323,8.5871921252685226,8.7405803507089903,12.570142834963921,10.76061135570132,6.5510958013394687,8.5882133396839091,12.24434439321411,10.63805463868721]
["BOL",2008,"BOL_2008_DHS",126,"Sanitation ladder","Unimproved","s_unimp",14.7790991775568,45.668216857934759,29.79227423430973,24.53958885429666,10.22937680360619,41.943620003966743,22.963198287245771,23.315151276718812,16.353646479668601,6.3828850574935636,20.200473566315338,32.828509698853111,38.954750145146278,45.666701760064818,43.938348366093336,"Beni","Chuquisaca","Cochabamba","La Paz","Oruro","Pando","Potosí","Santa Cruz","Tarija",60.655996358219177,15.45480123929905,26.33318327792751,23.389402903590049,9.2684211826159739,56.560455004611313,10.267793318847399,47.024353338667822,28.58953759706251]
["BOL",2008,"BOL_2008_DHS",127,"Sanitation ladder","Open defecation","s_od",68.612218636846251,45.690759913716917,23.170527961311471,4.1880753918854161,0.72751803426506934,27.34969270450495,13.804667833134729,3.6264296518587971,1.807616529897103,0.22668263944240141,78.434130324303268,65.296480377449768,57.915203365415152,47.428745107191169,31.92313984772386,"Beni","Chuquisaca","Cochabamba","La Paz","Oruro","Pando","Potosí","Santa Cruz","Tarija",9.9139754498271344,48.446515835321847,29.06899032207977,27.803918949370068,50.027738209932423,13.97313955930484,60.766589192331942,6.3465610121758953,20.390113116348509]
["BOL",2008,"BOL_2008_DHS",128,"Shared among Improved Sanitation","Yes","s_shared",6.8699548132124884,16.801225230446889,39.808437875915587,35.716370428123902,11.74324542338473,38.314776410764267,43.062358267286641,39.352962474486723,24.89193643149849,5.9980456523506236,4.7497435481380599,6.5711139612528457,8.6231191973480357,11.84187464050377,12.713029698707331,"Beni","Chuquisaca","Cochabamba","La Paz","Oruro","Pando","Potosí","Santa Cruz","Tarija",23.73428145428813,23.758238056134239,19.562306838331569,25.71940066110799,26.418838847011529,22.04393751614797,29.649681533627071,26.21646062630127,20.85061115307477]
["BOL",2008,"BOL_2008_DHS",129,"Shared among Improved Sanitation","No","",93.052617630775202,83.079654237249756,60.092851173625213,64.066696951211142,88.147582444715866,61.659690833672776,56.78795142365032,60.518956619060837,74.87457585510731,93.864228030472745,95.250256451861944,93.255656581520839,91.376880802652138,87.907282649233792,87.193517815494218,"Beni","Chuquisaca","Cochabamba","La Paz","Oruro","Pando","Potosí","Santa Cruz","Tarija",76.265718545711835,76.116213329480502,80.252159633398108,74.142512340381401,73.514907472425378,77.108268459179641,70.350318466373011,73.621435850951073,79.14938884692539]
["BOL",2008,"BOL_2008_DHS",135,"Sanitation type","Sewer connection","s_sew",0.40840859729457629,6.0839958240135088,39.741661714038642,56.174279294246823,69.271761328145885,26.385584368359918,54.327136153076381,58.344310495946687,64.665832856601355,72.213602687077369,0,0.56249466070053944,1.318578777237984,4.5196886797042222,14.06705170801213,"Beni","Chuquisaca","Cochabamba","La Paz","Oruro","Pando","Potosí","Santa Cruz","Tarija",14.39820530859892,35.297682508481643,37.078044562514407,46.544653221985477,38.779041461915718,13.847251124490271,27.39288181629729,18.12153835816526,45.916708962537207]
["BOL",2008,"BOL_2008_DHS",136,"Sanitation type","Septic tank connection","s_sep",1.446913733478429,2.5673329131778608,7.3420128329966499,15.253005540432801,19.868660332694109,4.3289451889225647,8.9997920010171057,14.807802464845,17.364434729911832,21.305630211309438,1.3653961093813951,1.3157689688873959,1.8114677122005849,2.4022275753761271,10.09403921823729,"Beni","Chuquisaca","Cochabamba","La Paz","Oruro","Pando","Potosí","Santa Cruz","Tarija",15.03182288335478,0.84637878503402131,7.6026795614021552,2.3295137953356728,1.951784817069468,15.871104756987609,1.5727356725233601,28.583257410223691,5.1036403240516792]
["BOL",2008,"BOL_2008_DHS",137,"Sanitation type","Improved latrines","s_lat",14.76622951619037,0,0,0,0,0,0,0,0,0,0,0,0,0,0,"Beni","Chuquisaca","Cochabamba","La Paz","Oruro","Pando","Potosí","Santa Cruz","Tarija",0,0,0,0,0,0,0,0,0]
["BOL",2008,"BOL_2008_DHS",138,"Sanitation type","Unimproved facilities","",14.76622951619037,45.657911349091087,29.745797491653519,24.384639773434881,10.13206030489494,41.935777738212487,22.86840401277184,23.221457387349432,16.1621158835896,6.2540844621709546,20.200473566315338,32.825255992961957,38.954750145145958,45.649338637728547,43.915769226026917,"Beni","Chuquisaca","Cochabamba","La Paz","Oruro","Pando","Potosí","Santa Cruz","Tarija",60.655996358219028,15.409422871162329,26.250285554003991,23.32191403330873,9.2414355110824236,56.308504559217347,10.2677933188477,46.94864321943448,28.58953759706294]
["BOL",2008,"BOL_2008_DHS",139,"Sanitation type","Open defecation","",68.612218636846251,45.690759913716917,23.170527961311471,4.1880753918854161,0.72751803426506934,27.34969270450495,13.804667833134729,3.6264296518587971,1.807616529897103,0.22668263944240141,78.434130324303268,65.296480377449768,57.915203365415152,47.428745107191169,31.92313984772386,"Beni","Chuquisaca","Cochabamba","La Paz","Oruro","Pando","Potosí","Santa Cruz","Tarija",9.9139754498271344,48.446515835321847,29.06899032207977,27.803918949370068,50.027738209932423,13.97313955930484,60.766589192331942,6.3465610121758953,20.390113116348509]
["BOL",2008,"BOL_2008_DHS",151,"Shared among all sanitation facilities","Yes","",6.8699548132124884,16.801225230446889,39.808437875915587,35.716370428123902,11.74324542338473,38.314776410764267,43.062358267286641,39.352962474486723,24.89193643149849,5.9980456523506236,4.7497435481380599,6.5711139612528457,8.6231191973480357,11.84187464050377,12.713029698707331,"Beni","Chuquisaca","Cochabamba","La Paz","Oruro","Pando","Potosí","Santa Cruz","Tarija",23.73428145428813,23.758238056134239,19.562306838331569,25.71940066110799,26.418838847011529,22.04393751614797,29.649681533627071,26.21646062630127,20.85061115307477]
["BOL",2008,"BOL_2008_DHS",152,"Shared among all sanitation facilities","No","",93.052617630775202,83.079654237249756,60.092851173625213,64.066696951211142,88.147582444715866,61.659690833672776,56.78795142365032,60.518956619060837,74.87457585510731,93.864228030472745,95.250256451861944,93.255656581520839,91.376880802652138,87.907282649233792,87.193517815494218,"Beni","Chuquisaca","Cochabamba","La Paz","Oruro","Pando","Potosí","Santa Cruz","Tarija",76.265718545711835,76.116213329480502,80.252159633398108,74.142512340381401,73.514907472425378,77.108268459179641,70.350318466373011,73.621435850951073,79.14938884692539]
["BOL",2008,"BOL_2008_DHS",153,"Main source sanitation services,sewer,septic,open pit,surfac","Sewage system","",1.2759111849875391,11.11159439153691,51.232156481624017,58.539844803246503,69.659684842888183,35.868862735041887,62.840657898063213,60.459840555983831,65.737408497911559,72.332259311849583,0,1.6044480385373601,3.0939563664634981,8.5477322128749229,20.360321290234751,"Beni","Chuquisaca","Cochabamba","La Paz","Oruro","Pando","Potosí","Santa Cruz","Tarija",15.818568274822001,66.969525994120104,51.919853150435863,64.276064358805314,77.481854126733978,15.55370479553482,69.007260511434097,19.26983156105965,57.423072329195037,63.424366000000013,944.99511399999983,6171.4854740000328,8729.3655199999776,10752.798572999969,2427.0526819999959,4991.4658600000103,5362.3727859999917,5944.835026000007,6638.9150480000017,0,35.628480000000003,83.586759000000001,286.32769100000007,891.88471500000014,375.00021800000002,1692.4843929999961,5347.8064260000001,10651.93528099998,1682.8750540000051,63.295230999999987,2243.1632719999998,2972.6326380000019,1632.8765340000029]
["BOL",2008,"BOL_2008_DHS",154,"Main source sanitation services,sewer,septic,open pit,surfac","Septic system","",4.5203098771342223,4.6888858612753541,9.464806807947415,15.89532768979279,19.979925304187589,5.8848172017436751,10.410135529619961,15.34472459094756,17.65218027434728,21.340638216386729,6.1118071279155366,3.7530719645774631,4.2504870831805617,4.5431443366676092,14.60987603269311,"Beni","Chuquisaca","Cochabamba","La Paz","Oruro","Pando","Potosí","Santa Cruz","Tarija",16.514691343744818,1.60581607678033,10.64592297234814,3.216953361315285,3.8997329686828182,17.826966229608299,3.9619847592988711,30.394470098243161,6.3825721418607104,224.70042699999999,398.7703360000001,1140.1416950000009,2370.2851609999989,3084.1384479999988,398.19387299999988,826.88243299999988,1360.9717259999991,1596.3406829999999,1958.72057,86.583843999999999,83.340966000000009,114.831755,152.18399400000001,639.98622300000022,391.50274199999978,40.582915999999997,1096.542687000001,533.11881100000016,84.700649000000013,72.546185000000023,128.78903800000001,4688.7588789999954,181.49415999999991]
["BOL",2008,"BOL_2008_DHS",155,"Main source sanitation services,sewer,septic,open pit,surfac","Open pit","",92.147287903870151,83.198398424777736,38.332218182693303,25.278662975350581,10.16888806710387,56.933341930402307,26.430885687751481,23.891630752864771,16.345417209810488,6.2643607608973486,90.250644183789504,93.48129690829623,91.19593401754868,86.170780520237443,63.562656177658013,"Beni","Chuquisaca","Cochabamba","La Paz","Oruro","Pando","Potosí","Santa Cruz","Tarija",66.639626196802013,28.87729758433283,36.725822506506347,32.05246263122914,18.336393237433029,62.512188615849666,25.78199994509481,49.923600799109231,35.753849140926548,4580.5565329999927,7075.6794420000024,4617.5438229999863,3769.5127090000019,1569.6884839999991,3852.3724949999978,2099.4188790000012,2119.023625999997,1478.166099999999,574.96557299999961,1278.549458999998,2075.8519050000009,2463.762140000003,2886.5060349999999,2784.3647790000018,1579.781046999999,729.80022999999937,3782.8032569999918,5311.7869139999912,398.25916799999999,254.3910579999999,838.0746450000006,7701.3919229999901,1016.692749]
["BOL",2008,"BOL_2008_DHS",156,"Main source sanitation services,sewer,septic,open pit,surfac","Surface water (street/stream)","",2.0564910340080478,1.0011213224099089,0.97081852773551525,0.28616453161012673,0.1915017858203035,1.3129781328121919,0.31832088456526553,0.30380410020361742,0.2649940179305188,0.062741710866485501,3.6375486882949071,1.1611830885889529,1.4596225328073991,0.73834293022011566,1.467146499414445,"Beni","Chuquisaca","Cochabamba","La Paz","Oruro","Pando","Potosí","Santa Cruz","Tarija",1.0271141846311751,2.547360344766751,0.70840137070962172,0.45451964865033678,0.28201966715020249,4.1071403590071931,1.2487547841723261,0.41209754158731188,0.44050638801789987,102.226269,85.14122500000002,116.94593500000001,42.672384999999998,29.560572000000001,88.842155999999989,25.284392000000011,26.945338,23.964220000000001,5.7586599999999999,51.531886,25.785309000000002,39.433366999999997,24.732645000000002,64.268412999999995,24.349108999999999,64.378051999999997,72.966180999999992,75.323744999999988,6.1253549999999999,16.713857000000001,40.592263000000003,63.571630000000013,12.526194]
["BOL",2016,"BOL_2016_EDS",16,"Water","Improved","w_imp",77.44066129777471,94.976905907521186,97.497951900561645,99.285644929599471,99.911076540801375,96.435907269891771,99.390732594726217,99.419814627641813,99.836766640621079,99.976556713376908,68.416960440079492,76.864440371207877,83.383036593868212,90.236212866025625,93.100522043473688,"Beni","Chuquisaca","Cochabamba","La Paz","Oruro","Pando","Potos?","Santa Cruz","Tarija",87.771381242640373,89.653345616581475,93.93763901363063,89.955407087963806,94.736854515752682,78.823883302461468,92.893179400924978,99.2209118306086,97.143730585860027]
["BOL",2016,"BOL_2016_EDS",17,"Water","Not Improved","",22.559338702225411,5.023094092478936,2.5020480994384369,0.71435507040047797,0.088923459198608099,3.564092730108221,0.60926740527380696,0.58018537235822376,0.16323335937893491,0.023443286623098501,31.58303955992054,23.1355596287918,16.616963406131749,9.7637871339742457,6.8994779565262139,"Beni","Chuquisaca","Cochabamba","La Paz","Oruro","Pando","Potos?","Santa Cruz","Tarija",12.22861875735963,10.34665438341853,6.0623609863695709,10.04459291203627,5.2631454842473318,21.176116697538539,7.1068205990749878,0.77908816939137293,2.856269414139895]
["BOL",2016,"BOL_2016_EDS",18,"Water ladder","Basic","w_bas",76.637911047442799,94.692382183409407,97.412360119267646,99.210196193172123,99.892037550442964,96.115575474312791,99.324781989626274,99.396219309519054,99.818748811775635,99.948969093311248,67.010351977084014,75.872275615239914,83.122953963182681,90.015617267939874,92.93004405409161,"Beni","Chuquisaca","Cochabamba","La Paz","Oruro","Pando","Potos?","Santa Cruz","Tarija",87.46624000345372,89.181430857800308,93.890248818830131,89.703370832357066,94.505181477840438,78.213826447806198,92.376192878969377,98.959187173086576,96.957198405804945]
["BOL",2016,"BOL_2016_EDS",19,"Water ladder","Limited","w_lim",0.80275025033190883,0.28452372411180449,0.085591781294010003,0.075448736427367005,0.0190389903584046,0.32033179557898273,0.065950605099952597,0.023595318122751199,0.018017828845429702,0.027587620065662399,1.4066084629955049,0.99216475596796083,0.26008263068552118,0.22059559808576559,0.17047798938208031,"Beni","Chuquisaca","Cochabamba","La Paz","Oruro","Pando","Potos?","Santa Cruz","Tarija",0.30514123918664388,0.4719147587811699,0.0473901948005086,0.25203625560674581,0.2316730379122286,0.61005685465525739,0.51698652195559913,0.26172465752201041,0.1865321800550663]
["BOL",2016,"BOL_2016_EDS",20,"Water ladder","Unimproved","w_unimp",6.6768615727121006,2.177132996462686,0.88473966650189761,0.39147034663774222,0.0062248064806325002,3.1222857465306442,0.57948669577779222,0.58018537235819456,0.16323335937893579,-0.00011178972861099999,6.4112252066850921,6.4029777263102048,5.9449935110721226,2.4931988983161499,1.582017026136215,"Beni","Chuquisaca","Cochabamba","La Paz","Oruro","Pando","Potos?","Santa Cruz","Tarija",6.1057664444503361,2.9219269223032671,0.72470026856229097,2.9247679267992361,2.9428442945024091,6.9763219352367027,3.2116091719522308,0.54214394086059847,1.19905598797369]
["BOL",2016,"BOL_2016_EDS",21,"Water ladder","Surface water","w_sur",15.882477129513189,2.8459610960161021,1.617308432936446,0.32288472376276739,0.082698652717998603,0.4418069835775823,0.0297807094959812,0,0,0.023555076351700201,25.171814353235391,16.732581902481918,10.67196989505968,7.2705882356582112,5.3174609303900944,"Beni","Chuquisaca","Cochabamba","La Paz","Oruro","Pando","Potos?","Santa Cruz","Tarija",6.1228523129092993,7.4247274611152561,5.3376607178070703,7.1198249852369528,2.3203011897449239,14.19979476230184,3.8952114271227929,0.23694422853081501,1.6572134261662981]
["BOL",2016,"BOL_2016_EDS",22,"Improved water point at more than 30 minutes","Yes","",1.0366004588276629,0.29957148150187662,0.087788286446576005,0.075991586176295103,0.019055935555483201,0.33217066614252028,0.066354883778623003,0.0237330135960553,0.018047288039974099,0.027594089027044001,2.0559353323324441,1.290798126124924,0.31191311963403251,0.24446460138269041,0.1831117437799917,"Beni","Chuquisaca","Cochabamba","La Paz","Oruro","Pando","Potos?","Santa Cruz","Tarija",0.34765459409040572,0.52637718708167069,0.050448569176442797,0.28017910625460191,0.24454373020555209,0.77394925128765757,0.55653873114224706,0.26377973422460632,0.19201669416041289]
["BOL",2016,"BOL_2016_EDS",23,"Improved water point at more than 30 minutes","No","",98.963399541172336,99.700428518498157,99.912211713553432,99.924008413823728,99.980944064444515,99.667829333857483,99.933645116221399,99.976266986403942,99.98195271196002,99.972405910972952,97.944064667667604,98.709201873875074,99.688086880365958,99.755535398617326,99.816888256220011,"Beni","Chuquisaca","Cochabamba","La Paz","Oruro","Pando","Potos?","Santa Cruz","Tarija",99.652345405909585,99.473622812918336,99.949551430823576,99.719820893745407,99.755456269794422,99.226050748712339,99.443461268857746,99.736220265775373,99.807983305839571]
["BOL",2016,"BOL_2016_EDS",29,"Piped water","Yes","w_pip",38.844916780911682,67.215360052702778,76.253240957274087,82.303049535904677,89.500607011252413,77.198733313859847,83.673144638462261,86.884375682664498,89.017900744718602,90.071477432428068,28.618388956973611,37.12523939571355,39.028448932783498,43.757302883219253,45.482777232932278,"Beni","Chuquisaca","Cochabamba","La Paz","Oruro","Pando","Potos?","Santa Cruz","Tarija",49.347721261783121,84.903873455173667,26.678752751583719,69.979518650765343,80.816444905604286,45.814321807065653,90.12527695453177,93.286773682475129,71.055751115877314]
["BOL",2016,"BOL_2016_EDS",30,"Piped water","No","",61.155083219088382,32.784639947297791,23.746759042725881,17.69695046409543,10.499392988747489,22.80126668614021,16.326855361537621,13.11562431733549,10.98209925528141,9.9285225675719033,71.381611043026268,62.874760604286038,60.97155106721641,56.242697116780739,54.517222767067693,"Beni","Chuquisaca","Cochabamba","La Paz","Oruro","Pando","Potos?","Santa Cruz","Tarija",50.652278738216808,15.09612654482631,73.321247248416171,30.02048134923503,19.183555094395938,54.185678192934382,9.874723045468226,6.7132263175248328,28.94424888412216]
["BOL",2016,"BOL_2016_EDS",31,"Piped water on premises","Yes","w_pop",35.241479403832443,65.09901726735437,75.649132086918812,81.931011531563072,89.458378007486388,74.596175770369072,83.16088189132374,86.715866070266983,88.997829053688889,90.071477432428068,24.558852226638798,33.049815490469612,36.406157249709068,41.821740908524383,43.874043095140493,"Beni","Chuquisaca","Cochabamba","La Paz","Oruro","Pando","Potos?","Santa Cruz","Tarija",48.125607501839767,81.99403953961145,26.58721715881245,69.158325072003066,78.616948766482224,42.516148318772679,80.706125024478581,93.284089624092701,70.848781824400518]
["BOL",2016,"BOL_2016_EDS",32,"Piped water on premises","No","",64.758520596167529,34.900982732646163,24.35086791308111,18.068988468437031,10.541621992513511,25.403824229631031,16.839118108676139,13.28413392973299,11.002170946311139,9.9285225675719033,75.44114777336118,66.950184509530089,63.593842750290882,58.178259091475581,56.125956904859478,"Beni","Chuquisaca","Cochabamba","La Paz","Oruro","Pando","Potos?","Santa Cruz","Tarija",51.874392498160148,18.005960460388451,73.412782841187436,30.84167492799725,21.383051233518,57.483851681227328,19.293874975521401,6.7159103759072662,29.151218175598949]
["BOL",2016,"BOL_2016_EDS",35,"Water source on premises","Yes","",58.931238495710623,87.443258084098446,94.041890412922072,96.997199592182383,98.551881109184365,87.295937336397586,95.357914578855627,96.649116459762013,97.710216662106191,99.016031816604126,35.606669094201202,62.795344699596392,75.604831512716743,81.726186256607377,92.046339563687866,"Beni","Chuquisaca","Cochabamba","La Paz","Oruro","Pando","Potos?","Santa Cruz","Tarija",51.423779454220814,81.99403953961145,89.07075453053578,88.026345120815179,86.635758522771468,46.230653752022967,81.994250484303194,93.789649578898803,93.719740166674299]
["BOL",2016,"BOL_2016_EDS",36,"Water source on premises","No","",41.068761504289533,12.556741915901769,5.9581095870779777,3.002800407817658,1.448118890815661,12.70406266360237,4.6420854211443201,3.3508835402379682,2.2897833378937942,0.98396818339585179,64.393330905798834,37.204655300403147,24.395168487283129,18.273813743392569,7.9536604363120116,"Beni","Chuquisaca","Cochabamba","La Paz","Oruro","Pando","Potos?","Santa Cruz","Tarija",48.576220545779087,18.005960460388451,10.929245469464339,11.97365487918492,13.36424147722869,53.769346247977033,18.005749515696781,6.2103504211011433,6.2802598333255162]
["BOL",2016,"BOL_2016_EDS",37,"Improved Water source on premises","Yes","w_premises",69.968884248284553,90.205592396382855,94.861315845137824,97.295627839248951,98.557437913672885,90.218929016920953,95.884477411070378,97.172525860509978,97.854565369687634,99.015801088032248,46.450865727048978,73.874622358562831,83.500576808639934,85.208841252727552,92.67537676646451,"Beni","Chuquisaca","Cochabamba","La Paz","Oruro","Pando","Potos?","Santa Cruz","Tarija",58.29612002590968,91.456753761620448,92.206919725196229,93.239253892868931,89.557832025863078,57.552707958417074,87.748353266374934,94.503942218087971,95.301661699920416]
["BOL",2016,"BOL_2016_EDS",38,"Improved Water source on premises","No","",30.031115751715451,9.7944076036173389,5.1386841548622053,2.7043721607511242,1.442562086327128,9.7810709830790241,4.1155225889295588,2.8274741394899809,2.145434630312351,0.9841989119677258,53.549134272951008,26.125377641437019,16.499423191359941,14.791158747272529,7.3246232335354451,"Beni","Chuquisaca","Cochabamba","La Paz","Oruro","Pando","Potos?","Santa Cruz","Tarija",41.703879974090242,8.5432462383794672,7.7930802748037324,6.7607461071311228,10.44216797413713,42.447292041582948,12.25164673362509,5.496057781911996,4.6983383000794214]
["BOL",2016,"BOL_2016_EDS",41,"Water point at more than 30 minutes","Yes","",2.0964144677574921,0.40805404222423558,0.2952356309349437,0.075444757022990305,0.019038863445925099,0.44754999789389138,0.096981209525544898,0.023593853013224201,0.018017543318834602,0.027587589218305099,3.6470016261437221,2.2738044239027579,0.78674877344304639,0.42277336692635181,0.76973709055030293,"Beni","Chuquisaca","Cochabamba","La Paz","Oruro","Pando","Potos?","Santa Cruz","Tarija",0.69660518738523125,1.4400860397526249,0.1006627809210799,0.81100851126831908,0.2478557981967873,2.01081143865972,1.3053616959836669,0.29528983752594601,0.45410307769841329]
["BOL",2016,"BOL_2016_EDS",42,"Water point at more than 30 minutes","No","w_30min",97.903585532242431,99.591945957775806,99.704764369065089,99.924555242977007,99.980961136554086,99.552450002106099,99.903018790474462,99.976406146986776,99.981982456681166,99.9724124107817,96.352998373856266,97.726195576097183,99.213251226556949,99.57722663307365,99.23026290944965,"Beni","Chuquisaca","Cochabamba","La Paz","Oruro","Pando","Potos?","Santa Cruz","Tarija",99.303394812614769,98.5599139602474,99.899337219078959,99.188991488731716,99.752144201803205,97.989188561340285,98.694638304016294,99.704710162474029,99.545896922301552]
["BOL",2016,"BOL_2016_EDS",58,"¿Principalmente el agua para uso de su hogar, proviene de…?","1. Cañeria de red dentro de la vivienda?","",6.7569162099090123,18.799871299358259,28.851383166011271,47.378831631174243,74.047325636158149,20.78076784929943,29.699900654914551,45.66080803819748,59.060044435566233,79.207038943474558,5.6543908102552756,5.5476717354808764,7.1795304995276066,10.21483939196423,18.257130660453871,"Beni","Chuquisaca","Cochabamba","La Paz","Oruro","Pando","Potos?","Santa Cruz","Tarija",13.20940666985639,72.514135827988852,17.298997214218829,44.331194267866742,35.427050919993903,18.165078389232061,25.559066075032032,35.659150886310087,42.854554542428581]
["BOL",2016,"BOL_2016_EDS",59,"¿Principalmente el agua para uso de su hogar, proviene de…?","2. Cañeria de red fuera de la vivienda, pero dentro del lote o terreno?","",28.484563193923421,46.299145967996139,46.797748920907459,34.552179900388758,15.41105237132834,53.815407921069507,53.460981236409211,41.055058032069468,29.937784618122649,10.864438488953439,18.904461416383509,27.502143754988701,29.22662675018141,31.60690151656015,25.616912434686661,"Beni","Chuquisaca","Cochabamba","La Paz","Oruro","Pando","Potos?","Santa Cruz","Tarija",34.91620083198341,9.4799037116226685,9.2882199445936315,24.82713080413647,43.189897846488371,24.351069929540611,55.147058949446659,57.624938737782713,27.99422728197192]
["BOL",2016,"BOL_2016_EDS",60,"¿Principalmente el agua para uso de su hogar, proviene de…?","3. Pileta publica?","",3.6034373770792429,2.1163427853483729,0.6041088703552302,0.37203800434159462,0.042229003766017202,2.6025575434908039,0.51226274713851605,0.16850961239750289,0.0200716910297229,0,4.0595367303348002,4.0754239052439738,2.622291683074454,1.9355619746948809,1.608734137791801,"Beni","Chuquisaca","Cochabamba","La Paz","Oruro","Pando","Potos?","Santa Cruz","Tarija",1.222113759943358,2.9098339155621602,0.091535592771272295,0.82119357876222798,2.1994961391220431,3.2981734882929299,9.4191519300531823,0.0026840583824334001,0.20696929147678569]
["BOL",2016,"BOL_2016_EDS",61,"¿Principalmente el agua para uso de su hogar, proviene de…?","4. Pozo perforado o entubado, con bomba?","",9.0175881579375083,6.5503417500634251,5.5904762401868524,6.7719252208120446,5.9569047925040337,5.8734877013661526,6.3348097831540811,5.5686169032432664,5.0553781470573744,6.6280665103386509,18.231051979877439,4.708935678850116,5.6078265833642442,6.6180380656701177,8.4651815067804073,"Beni","Chuquisaca","Cochabamba","La Paz","Oruro","Pando","Potos?","Santa Cruz","Tarija",2.5385036387416688,0.47491835655641651,28.347271685996851,0.62541535805402215,3.569915080494511,2.7060597560561122,0.23828999179292959,4.6383996779909387,0.34950735133517757]
["BOL",2016,"BOL_2016_EDS",62,"¿Principalmente el agua para uso de su hogar, proviene de…?","5. Pozo excavado cubierto, con bomba?","",4.4373498577585844,2.5613511465921062,2.4220768506347641,1.324601210280836,0.84599357756464599,1.2807311160941539,1.0908103969850249,0.86033158524375786,0.45105105598538098,0.99244636835788669,4.6450759229719836,4.485390736999066,5.8262676487606821,5.3253918395117772,6.5335366709739384,"Beni","Chuquisaca","Cochabamba","La Paz","Oruro","Pando","Potos?","Santa Cruz","Tarija",1.788339990862323,1.819110342385275,6.2547194907271484,2.0241745087549088,3.9427011948244148,2.6115391032249891,0.2071880003329708,0.80213222533934603,1.333142241004363]
["BOL",2016,"BOL_2016_EDS",63,"¿Principalmente el agua para uso de su hogar, proviene de…?","6. Pozo excavado cubierto, sin bomba?","",7.9268705871347418,3.6400946353043628,1.1340009923380461,0.42974729160825292,0.1097695762583457,3.7884707458581288,0.9764830695781006,0.44270191064092451,0.40321219177206269,0.0630211192303438,6.9228009905613979,8.3051095078463444,7.5110542051853937,6.0543158452653127,1.107568067770476,"Beni","Chuquisaca","Cochabamba","La Paz","Oruro","Pando","Potos?","Santa Cruz","Tarija",18.796925574923389,1.1131461216890131,1.9781172657864821,4.0973268397798011,2.705361006054293,4.6774878507953339,0.9994670590818705,0.44295014569198282,0.2219503840990783]
["BOL",2016,"BOL_2016_EDS",64,"¿Principalmente el agua para uso de su hogar, proviene de…?","7. Pozo excavado no cubierto?","",5.4540091016882286,1.0478624819621201,0.51928075511004224,0.23624903371619291,0.0068395805967833003,1.01327387303439,0.2855205750939796,0.14192640139581661,0.094356087081928594,0,5.8704766302320959,5.5827692437445524,5.2219240783331431,1.5967141835063381,1.603399069445113,"Beni","Chuquisaca","Cochabamba","La Paz","Oruro","Pando","Potos?","Santa Cruz","Tarija",6.6719075132325916,1.337076342926264,0.5688510915345214,2.1794603948744782,1.8944368876106059,7.7445855223728559,2.5771651813063938,0.088172700103995902,0.47146395959921289]
["BOL",2016,"BOL_2016_EDS",65,"¿Principalmente el agua para uso de su hogar, proviene de…?","8. Manantial o vertiente protegida?","",16.22432557503825,10.869853686265211,7.9206400959710734,4.8472594323473608,0.94511929242366544,1.9956115733464821,1.924190500719311,1.233899753469913,1.2201118427141431,0.25483391590613369,9.5843495476445444,21.688800632847919,25.387243715672302,28.364494486634051,31.02791973265284,"Beni","Chuquisaca","Cochabamba","La Paz","Oruro","Pando","Potos?","Santa Cruz","Tarija",1.3756576123769719,0.78588537160936589,18.094510181704241,12.9138955337,3.7024323287753949,11.450656329490149,1.246595852158511,0.017127754384128401,23.13320651843518]
["BOL",2016,"BOL_2016_EDS",66,"¿Principalmente el agua para uso de su hogar, proviene de…?","9. Rio/Acequia/Vertiente no Protegida?","",15.834949274091979,2.8186441041323769,1.602113492290461,0.32053501567727061,0.082083878601824797,0.43597116138147368,0.0294714829846323,0,0,0.023443286623098501,25.156070412870228,16.67025318175839,10.66960119711697,7.2545455692990828,5.2960788870810998,"Beni","Chuquisaca","Cochabamba","La Paz","Oruro","Pando","Potos?","Santa Cruz","Tarija",5.4323449693308197,7.4247274611152561,5.3130125604011269,7.1142087877919327,2.3203011897449239,12.69680214110101,3.8928264495778921,0.2368647850530623,1.6500320112116109]
["BOL",2016,"BOL_2016_EDS",67,"¿Principalmente el agua para uso de su hogar, proviene de…?","10. Agua embotellada?","",0.2992471201667139,0.86009081795768716,0.93952027557273821,0.7277235225359493,0.743390727621841,1.3208985853624109,0.96519383049885266,1.052819337996461,0.95992359042676356,0.47458869134039039,0.062545910057279094,0.3724991222919774,0.022195508102020499,0.062388846179267703,0.40211002184885303,"Beni","Chuquisaca","Cochabamba","La Paz","Oruro","Pando","Potos?","Santa Cruz","Tarija",11.277543672295099,0,0.34731531249652481,0.078881116553627395,0,10.584608062019591,0.061228449071964203,0.033528344727064702,0.43334279346865617]
["BOL",2016,"BOL_2016_EDS",68,"¿Principalmente el agua para uso de su hogar, proviene de…?","11. Carro repartidor (Aguatero)?","",0.69036321882734508,3.2798138186360419,3.2379964885839558,2.8813387161105188,1.8092915631763511,4.9779742340046136,4.4261003753284429,3.3770694543829469,2.7291890679467481,1.4921226757754049,0.35274713199324398,0.178465296658773,0,0.054280899545965003,0.081428810514857994,"Beni","Chuquisaca","Cochabamba","La Paz","Oruro","Pando","Potos?","Santa Cruz","Tarija",2.64668949165763,0.5564119691677093,12.23695232533548,0.23619508035638209,0,0.97921039380969943,0.0151330939549871,0,0.61683018163980652]
["BOL",2016,"BOL_2016_EDS",69,"¿Principalmente el agua para uso de su hogar, proviene de…?","12. Otro (Especifique)?","",1.2703803264452069,1.156587506384438,0.38065385203793262,0.15757102100701459,0,2.1148476956923581,0.2942753471951951,0.43825897096240712,0.068877272297006298,0,0.55649251681821676,0.88253720328885765,0.72543813068162033,0.91252738116882703,0,"Beni","Chuquisaca","Cochabamba","La Paz","Oruro","Pando","Potos?","Santa Cruz","Tarija",0.12436627479623311,1.5848505793770009,0.18049733443391919,0.75092372936986895,1.048407406891801,0.73472903406466672,0.63682896819070045,0.45405068423431438,0.73477344332907124]
["BOL",2016,"BOL_2016_EDS",122,"Sanitation","Improved","s_imp",28.468618399958071,62.132390778221612,78.461205466605307,89.60599084447361,96.760017553159415,67.733160784693396,84.146140654334374,90.772972015458805,94.193225390345361,97.913816573204315,21.11312802779517,21.928549402576781,32.966461552623713,43.810744530236107,60.964554943088537,"Beni","Chuquisaca","Cochabamba","La Paz","Oruro","Pando","Potos?","Santa Cruz","Tarija",72.386353375152041,61.108175229204008,73.443550682651846,70.715813280510517,58.44850581614066,51.867229826488078,47.646398629583658,79.828034535722281,79.971997196690978]
["BOL",2016,"BOL_2016_EDS",123,"Sanitation","Not Improved","",71.531381600041925,37.867609221778388,21.53879453339469,10.39400915552639,3.2399824468405849,32.266839215306597,15.853859345665629,9.2270279845411949,5.8067746096546387,2.0861834267956851,78.88687197220483,78.071450597423222,67.033538447376287,56.189255469763893,39.035445056911463,"Beni","Chuquisaca","Cochabamba","La Paz","Oruro","Pando","Potos?","Santa Cruz","Tarija",27.613646624847959,38.891824770795992,26.55644931734815,29.28418671948948,41.55149418385934,48.132770173511922,52.353601370416342,20.171965464277719,20.028002803309018]
["BOL",2016,"BOL_2016_EDS",124,"Sanitation ladder","Basic","s_bas",23.364601847428471,41.506796516762137,56.388952013308263,69.806080864790516,88.387253746819738,39.486351203097662,54.939069987577732,67.660345478673406,76.056607166014089,92.374783434069343,18.56347761813781,20.161445096143709,28.971706456849279,37.285506465759248,54.315972373293619,"Beni","Chuquisaca","Cochabamba","La Paz","Oruro","Pando","Potos?","Santa Cruz","Tarija",55.509953121791817,46.723094272442822,60.274725184252077,56.623010670492903,44.293187689722771,42.660375121311077,35.813861520375589,61.088904843982817,56.896516358491198]
["BOL",2016,"BOL_2016_EDS",125,"Sanitation ladder","Limited","s_lim",5.1040165525297239,20.62559426145959,22.07225345329697,19.799909979683179,8.3727638063397372,28.24680958159567,29.207070666756529,23.112626536785321,18.13661822433135,5.5390331391348919,2.5496504096573651,1.7671043064330789,3.9947550957744151,6.5252380644768744,6.6485825697949288,"Beni","Chuquisaca","Cochabamba","La Paz","Oruro","Pando","Potos?","Santa Cruz","Tarija",16.876400253360089,14.385080956761129,13.168825498399681,14.0928026100176,14.1553181264178,9.206854705176962,11.83253710920796,18.73912969173967,23.07548083819961]
["BOL",2016,"BOL_2016_EDS",126,"Sanitation ladder","Unimproved","s_unimp",20.871934930036911,18.342621209482061,13.66307317472768,7.874111117599603,2.8141594329615538,15.91398952186713,11.117061828226801,7.0372794541826469,5.2651444031154453,1.668850604843354,19.765926094923159,19.301614607836409,24.898231301557381,25.186481432079059,24.101404707326559,"Beni","Chuquisaca","Cochabamba","La Paz","Oruro","Pando","Potos?","Santa Cruz","Tarija",22.15030074872287,7.1825746013689766,12.591509701620449,11.630826898856011,3.342524095101119,29.992641291184139,5.5688718781668101,16.904860418835721,9.7053197662946022]
["BOL",2016,"BOL_2016_EDS",127,"Sanitation ladder","Open defecation","s_od",50.65944667000489,19.52498801229622,7.8757213586670876,2.5198980379267022,0.4258230138789707,16.352849693439548,4.7367975174389354,2.189748530358623,0.54163020653911131,0.41733282195241062,59.12094587728167,58.769835989586802,42.135307145818921,31.002774037684819,14.934040349584899,"Beni","Chuquisaca","Cochabamba","La Paz","Oruro","Pando","Potos?","Santa Cruz","Tarija",5.4633458761252172,31.709250169427069,13.964939615727801,17.65335982063349,38.208970088758313,18.140128882327819,46.784729492249653,3.2671050454417951,10.32268303701459]
["BOL",2016,"BOL_2016_EDS",128,"Shared among Improved Sanitation","Yes","s_shared",17.92857131604687,33.196202501013673,28.131422812120022,22.096636389021441,8.6531234884695909,41.703073139293089,34.70993492944239,25.462013662887671,19.254694962585202,5.6570495697036662,12.07613768220787,8.0584642148077101,12.117633824296449,14.894150132448591,10.9056525976471,"Beni","Chuquisaca","Cochabamba","La Paz","Oruro","Pando","Potos?","Santa Cruz","Tarija",23.31433960472615,23.540354302522861,17.930540361946711,19.928785311589731,24.218443104338149,17.750812480205209,24.83406395769256,23.474371880412619,28.854451116739661]
["BOL",2016,"BOL_2016_EDS",129,"Shared among Improved Sanitation","No","",82.071428683953556,66.803797498986512,71.868577187879879,77.903363610978644,91.346876511530468,58.296926860706812,65.290065070557475,74.537986337112244,80.74530503741488,94.342950430296241,87.923862317792128,91.941535785192343,87.88236617570351,85.105849867551456,89.094347402352909,"Beni","Chuquisaca","Cochabamba","La Paz","Oruro","Pando","Potos?","Santa Cruz","Tarija",76.685660395273672,76.459645697477058,82.069459638053161,80.071214688410237,75.781556895661694,82.249187519794731,75.165936042307209,76.525628119587637,71.145548883260133]
["BOL",2016,"BOL_2016_EDS",135,"Sanitation type","Sewer connection","s_sew",4.2778593953867956,28.80226066528023,43.972766608892293,61.656798006399328,82.456982591191547,35.710517932972351,52.816613999564197,60.927898325254958,72.576016746906831,86.933859373782965,0.12881968101465191,0.83682074447537524,3.7546651097404191,7.8422604800583704,15.282503088803059,"Beni","Chuquisaca","Cochabamba","La Paz","Oruro","Pando","Potos?","Santa Cruz","Tarija",16.21760258519247,52.696624475433453,45.617087434041657,56.408420140506642,51.958411324198707,6.6324707310773334,39.243290132892483,33.157460745565622,62.121977979145001]
["BOL",2016,"BOL_2016_EDS",136,"Sanitation type","Septic tank connection","s_sep",3.3188240745342341,14.98750890345921,20.825365682985421,20.0750817204746,11.488875529006259,16.108653329854,20.212464826543481,22.80779423602128,16.352064240323021,9.3111065945780975,1.218382251857371,1.790114050264987,4.3135651413259168,10.782002618098661,21.580647146958921,"Beni","Chuquisaca","Cochabamba","La Paz","Oruro","Pando","Potos?","Santa Cruz","Tarija",34.018450041236839,1.2289761524016309,15.234953546989839,2.6765662411478881,3.1475703968409108,15.24211780422665,2.8342366185244798,29.765713371320722,8.1446994512515314]
["BOL",2016,"BOL_2016_EDS",137,"Sanitation type","Improved latrines","s_lat",20.871934930037039,18.342621209482179,13.6630731747276,7.8741111175996821,2.8141594329616169,15.91398952186705,11.117061828226699,7.037279454182567,5.2651444031155208,1.6688506048432641,19.765926094923149,19.30161460783642,24.89823130155737,25.186481432079081,24.101404707326559,"Beni","Chuquisaca","Cochabamba","La Paz","Oruro","Pando","Potos?","Santa Cruz","Tarija",22.150300748722739,7.1825746013689269,12.59150970162035,11.63082689885599,3.3425240951010409,29.9926412911841,5.5688718781666964,16.904860418835931,9.7053197662944442]
["BOL",2016,"BOL_2016_EDS",138,"Sanitation type","Unimproved facilities","",20.871934930037039,18.342621209482179,13.6630731747276,7.8741111175996821,2.8141594329616169,15.91398952186705,11.117061828226699,7.037279454182567,5.2651444031155208,1.6688506048432641,19.765926094923149,19.30161460783642,24.89823130155737,25.186481432079081,24.101404707326559,"Beni","Chuquisaca","Cochabamba","La Paz","Oruro","Pando","Potos?","Santa Cruz","Tarija",22.150300748722739,7.1825746013689269,12.59150970162035,11.63082689885599,3.3425240951010409,29.9926412911841,5.5688718781666964,16.904860418835931,9.7053197662944442]
["BOL",2016,"BOL_2016_EDS",139,"Sanitation type","Open defecation","",50.65944667000489,19.52498801229622,7.8757213586670876,2.5198980379267022,0.4258230138789707,16.352849693439548,4.7367975174389354,2.189748530358623,0.54163020653911131,0.41733282195241062,59.12094587728167,58.769835989586802,42.135307145818921,31.002774037684819,14.934040349584899,"Beni","Chuquisaca","Cochabamba","La Paz","Oruro","Pando","Potos?","Santa Cruz","Tarija",5.4633458761252172,31.709250169427069,13.964939615727801,17.65335982063349,38.208970088758313,18.140128882327819,46.784729492249653,3.2671050454417951,10.32268303701459]
["BOL",2016,"BOL_2016_EDS",151,"Shared among all sanitation facilities","Yes","",17.92857131604687,33.196202501013673,28.131422812120022,22.096636389021441,8.6531234884695909,41.703073139293089,34.70993492944239,25.462013662887671,19.254694962585202,5.6570495697036662,12.07613768220787,8.0584642148077101,12.117633824296449,14.894150132448591,10.9056525976471,"Beni","Chuquisaca","Cochabamba","La Paz","Oruro","Pando","Potos?","Santa Cruz","Tarija",23.31433960472615,23.540354302522861,17.930540361946711,19.928785311589731,24.218443104338149,17.750812480205209,24.83406395769256,23.474371880412619,28.854451116739661]
["BOL",2016,"BOL_2016_EDS",152,"Shared among all sanitation facilities","No","",82.071428683953556,66.803797498986512,71.868577187879879,77.903363610978644,91.346876511530468,58.296926860706812,65.290065070557475,74.537986337112244,80.74530503741488,94.342950430296241,87.923862317792128,91.941535785192343,87.88236617570351,85.105849867551456,89.094347402352909,"Beni","Chuquisaca","Cochabamba","La Paz","Oruro","Pando","Potos?","Santa Cruz","Tarija",76.685660395273672,76.459645697477058,82.069459638053161,80.071214688410237,75.781556895661694,82.249187519794731,75.165936042307209,76.525628119587637,71.145548883260133]
["BOL",2016,"BOL_2016_EDS",153,"¿El baño, servicio sanitario o letrina tiene desagüe ...........?","1. A la red de alcantarillado?","",8.5088733411327446,35.469711102468388,47.449766891456889,63.102346388132453,82.726428843434519,42.427460287279068,55.236959306365293,62.062412440197868,72.88337106239257,87.254592265764146,0.30851748608573593,1.969056530163503,6.37401703775289,11.18294766956587,17.815546354375709,"Beni","Chuquisaca","Cochabamba","La Paz","Oruro","Pando","Potos?","Santa Cruz","Tarija",17.1327320054342,75.308033605080567,52.904016432491503,67.905936350796807,83.993923877103711,7.9295392604873634,73.092823871290662,34.140971629045609,69.003592952186978,436.55317644738727,2940.440459787796,4484.6874215588496,6294.8980372229944,8409.7840469458115,2504.036359126098,3711.1921590868392,4271.6112716130192,5089.6920046276718,6102.3777523941544,4.1070127021222289,26.706721577592891,119.5882036681224,249.97017166508149,487.08148550212849,343.42322382603987,1507.476754685913,4058.88292053134,7443.6703542833911,1268.495396042129,41.316468531985343,1592.403408491665,4742.4416030505299,1568.25301251983]
["BOL",2016,"BOL_2016_EDS",154,"¿El baño, servicio sanitario o letrina tiene desagüe ...........?","2. A una cámara séptica?","",6.6013047839223171,18.456975205150918,22.47206221696262,20.54574355878772,11.52641794635524,19.138598065610289,21.138710200436829,23.232489083582671,16.42131407982427,9.345458896053449,2.9179720557743041,4.2121754075557956,7.3228202517825114,15.374976559108401,25.157594758528841,"Beni","Chuquisaca","Cochabamba","La Paz","Oruro","Pando","Potos?","Santa Cruz","Tarija",35.93804847141319,1.7563132042366629,17.668603546063451,3.222120675554299,5.0882384886728014,18.222918191748501,5.2789243018575389,30.64861882900583,9.0469354636572437,338.68415436243629,1530.0839778971049,2123.9340330467489,2049.5808508607738,1171.749912559912,1129.5454664147651,1420.2413842868771,1599.0381026951541,1146.7558341396191,653.59907108943219,38.844308144571187,57.130607538339937,137.38948523487909,343.67374715401201,687.81492202932691,720.37316991560681,35.156957400041371,1355.5642463227441,353.2004039624095,76.843738200510984,94.949605682896291,115.00687216914601,4257.3271373172756,205.61079775634059]
["BOL",2016,"BOL_2016_EDS",155,"¿El baño, servicio sanitario o letrina tiene desagüe ...........?","3. A un pozo ciego/absorción?","",82.434332758355183,44.322820574977833,29.176952925933499,15.912731148772631,5.2800412303532021,36.788398633787253,22.648679822641981,14.01899699701065,10.3332153780203,2.9891469293747219,94.626604678034028,90.655367208346433,84.368983346008989,71.099037213543596,56.166810993882628,"Beni","Chuquisaca","Cochabamba","La Paz","Oruro","Pando","Potos?","Santa Cruz","Tarija",46.800402781374551,20.434401084795141,28.929508399046469,27.775787648877511,10.80678593691179,69.691776186678936,20.59681743705827,33.944214951215152,21.294763861089478,4229.346045147513,3674.3635868381821,2757.6429213165961,1587.4056324172541,536.75720234797211,2171.2232396019272,1521.691346282546,964.89490554113604,721.60333591846234,209.05379587236629,1259.67792718039,1229.5775232754299,1582.916252638687,1589.2624254926391,1535.6146362639181,938.10754726327082,409.04513312347461,2219.519338197962,3044.7088752409818,163.20654607162899,363.12552131535972,448.72315165449089,4715.1105983925572,483.96867680777137]
["BOL",2016,"BOL_2016_EDS",156,"¿El baño, servicio sanitario o letrina tiene desagüe ...........?","4. A la superficie(calle/quebrada/río)?","",1.859205723526741,0.89578525298112943,0.5913003961206541,0.23446953371165169,0.10044257954869509,0.61930340979897736,0.371318029461701,0.36846281513430001,0.12043102067305569,0.049933547776787802,2.096458303841366,2.9845708051702529,1.767394066634449,1.610974381197932,0.83453354956151438,"Beni","Chuquisaca","Cochabamba","La Paz","Oruro","Pando","Potos?","Santa Cruz","Tarija",0.12881674177796679,2.4066126748883478,0.2215944864706397,0.86895373432778844,0.1110516973116544,2.131334127941142,0.88358082835880558,0.39783059441036261,0.38860193995317538,95.38773604152766,74.260633066268639,55.886416784958037,23.389967125337339,10.21076837151227,36.550815084549598,24.94765419332272,25.360437218172081,8.4101049950622215,3.4922330520217222,27.908242714493579,40.480352037265042,33.159541361537478,36.009785122398618,22.81635561078085,2.5821136249679371,48.174311441348237,17.001092489212251,95.252425620719762,1.6771280618894591,11.105210092977631,19.24972997669472,55.261706737511687,8.8318033442822728]
["BOL",2016,"BOL_2016_EDS",157,"¿El baño, servicio sanitario o letrina tiene desagüe ...........?","5. No sabe?","",0.59628339306338018,0.85470786442185875,0.30991756952616711,0.2047093705956507,0.36666940030842521,1.02623960352428,0.60433264109403861,0.31763866407437102,0.2416684590898128,0.36086836103086473,0.0504474762645159,0.17883004876405481,0.1667852978211028,0.73206417658420442,0.025514343651326099,"Beni","Chuquisaca","Cochabamba","La Paz","Oruro","Pando","Potos?","Santa Cruz","Tarija",0,0.094639430999236995,0.2762771359278936,0.2272015904439067,0,2.024432233144029,0.1478535614345371,0.86836399632333605,0.26610578311295041,30.592699981357448,70.855315922490206,29.29168079905433,20.421183821558589,37.274792546078928,60.567878986865239,40.603150268808982,21.862329297424559,16.876524865282921,25.238271140964851,0.67156137059537546,2.425508993209248,3.129196870127938,16.36368275142917,0.69756852583122497,0,1.8944425379130641,21.196435052941251,24.905241487234129,0,10.54820310590042,3.2211440565024549,120.62238847506779,6.0478183549804072]
["BOL",2016,"BOL_2016_EDS",222,"Hygiene ladder","Basic","h_bas",7.0880334177959012,12.3049330995829,20.909378786597859,27.059491745473611,40.731959380494217,13.54952129039318,20.421729210438151,23.046714713112241,34.741409940526133,42.450796518492702,3.4124229350870872,6.6188533061011583,8.7891057961116594,11.060885707385481,20.687553665418381,"Beni","Chuquisaca","Cochabamba","La Paz","Oruro","Pando","Potos?","Santa Cruz","Tarija",34.11931318104719,23.8349966175494,13.119344911329041,22.56025365705074,13.383502958486741,38.710584357381819,22.900899659441091,23.78763733201534,23.006126465350249,723.32987536731559,1256.2181684790889,2132.502347894163,2762.65954419421,4154.2507551751914,950.09806420563632,1434.945476084439,1615.78864605893,2436.3844191176881,2979.8607597994678,108.79443442979679,211.23744072548561,279.93798202650959,352.56307872885333,659.350389933158,722.50904323331361,681.84070055044151,1167.323211201239,2977.057164760256,326.74039588754601,241.14462095737539,929.26639310126893,3402.2955432953199,580.78361812320225]
["BOL",2016,"BOL_2016_EDS",223,"Hygiene ladder","Limited","h_lim",42.923823084847918,34.371579364359313,28.174306677118139,19.01520363689783,7.6092055179928231,34.164534881224128,26.37846810313766,22.153797914649889,12.93980164366077,5.8493403276150779,42.232053564953453,46.252717091520779,42.601294260109427,37.931072986483123,30.47760669879224,"Beni","Chuquisaca","Cochabamba","La Paz","Oruro","Pando","Potos?","Santa Cruz","Tarija",29.347131454167009,45.244449078806412,23.539700428480291,19.712135301591179,27.50505382072437,13.685625863349779,38.145680496320047,28.512586566981689,19.253975354239849,4380.3523166664872,3509.0156222216842,2873.43664067891,1941.3717857823269,776.06253787394814,2395.631385010729,1853.499430953573,1553.1868894619299,907.45686962787408,410.59817818446982,1346.4369657012439,1476.1326672713319,1356.8752753173769,1209.0438528511299,971.37738884370322,621.45353735815468,1294.2945766225971,2094.4977726105931,2601.2186974673082,671.49924815407905,85.253558326938801,1547.8649072459129,4078.0950562964158,486.06154914136869]
["BOL",2016,"BOL_2016_EDS",224,"Hygiene ladder","No facility","h_nfac",49.988143497356297,53.323487536058281,50.916314536283899,53.925304617628612,51.658835101512892,52.285943828382628,53.1998026864241,54.799487372237827,52.31878841581301,51.699863153891791,54.355523499959567,47.128429602377622,48.60959994377879,51.008041306131382,48.834839635789393,"Beni","Chuquisaca","Cochabamba","La Paz","Oruro","Pando","Potos?","Santa Cruz","Tarija",36.53355536478572,30.92055430364417,63.340954660190597,57.72761104135855,59.111443220789162,47.603789779268418,38.953419844238937,47.699776101003117,57.739898180409469,5101.2622930084754,5443.8275533359256,5192.8448665504284,5505.5452954097718,5268.6823319061923,3666.3121118332469,3738.1171499644629,3841.9527732312749,3669.0704591902181,3629.1048963515341,1732.9558937461279,1504.0806004026149,1548.243203693994,1625.8690812445859,1556.456170552719,773.63292726493512,884.53515417248457,5635.9038575650502,7617.7511417944088,1443.127140880363,296.54416312801612,1580.64113182961,6822.3982642532637,1457.6285593226651]
["BOL",2016,"BOL_2016_EDS",225,"POR OBSERVACIÓN: ¿Me podría mostrar el lugar dónde los miembros de  su hogar se lavan más frecuentemente las manos?","1. OBSERVADO","",50.011856502643717,46.676512463942217,49.083685463715987,46.074695382371431,48.341164898487051,47.714056171617308,46.800197313575779,45.200512627762137,47.681211584186897,48.300136846107797,45.644476500040547,52.871570397621937,51.390400056221083,48.99195869386854,51.16516036421055,"Beni","Chuquisaca","Cochabamba","La Paz","Oruro","Pando","Potos?","Santa Cruz","Tarija",63.466444635214117,69.079445696355805,36.659045339809403,42.272388958641791,40.888556779211157,52.396210220731597,61.046580155761163,52.300223898996968,42.260101819590083]
["BOL",2016,"BOL_2016_EDS",226,"POR OBSERVACIÓN: ¿Me podría mostrar el lugar dónde los miembros de  su hogar se lavan más frecuentemente las manos?","2. NO OBSERVADO","",49.988143497356297,53.323487536058281,50.916314536283899,53.925304617628612,51.658835101512892,52.285943828382628,53.1998026864241,54.799487372237827,52.31878841581301,51.699863153891791,54.355523499959567,47.128429602377622,48.60959994377879,51.008041306131382,48.834839635789393,"Beni","Chuquisaca","Cochabamba","La Paz","Oruro","Pando","Potos?","Santa Cruz","Tarija",36.53355536478572,30.92055430364417,63.340954660190597,57.72761104135855,59.111443220789162,47.603789779268418,38.953419844238937,47.699776101003117,57.739898180409469]